# Logfile created on 2024-05-11 15:11:13 +0000 by logger.rb/v1.4.3 I, [2024-05-11T15:11:13.891398 #2076912] INFO -- : #, @formatter=nil, @logdev=#, @binmode=false, @mon_data=#, @mon_data_owner_object_id=860>>> I, [2024-05-11T15:11:13.891520 #2076912] INFO -- : $$$[beg] make update-unicode -j20 I, [2024-05-11T15:11:13.950479 #2076912] INFO -- : Downloading Unicode emoji 15.0 files... I, [2024-05-11T15:11:13.950738 #2076912] INFO -- : Downloading Unicode emoji 15.0 files... I, [2024-05-11T15:11:13.951198 #2076912] INFO -- : Downloading Unicode emoji 15.0 files... I, [2024-05-11T15:11:13.991927 #2076912] INFO -- : made symlink emoji/15.0/emoji-sequences.txt to /tmp/ruby/src/trunk/.downloaded-cache/emoji/15.0/emoji-sequences.txt I, [2024-05-11T15:11:13.992162 #2076912] INFO -- : downloading emoji/15.0/emoji-test.txt ... /tmp/ruby/src/trunk/enc/unicode/data/emoji/15.0/emoji-sequences.txt already exists I, [2024-05-11T15:11:13.992771 #2076912] INFO -- : downloading emoji/15.0/emoji-test.txt ... /tmp/ruby/src/trunk/enc/unicode/data/emoji/15.0/emoji-sequences.txt already exists E, [2024-05-11T15:11:14.471085 #2076912] ERROR -- : /tmp/ruby/src/trunk/tool/downloader.rb:302:in `rescue in download': failed to download emoji/15.0/emoji-test.txt (RuntimeError) E, [2024-05-11T15:11:14.471188 #2076912] ERROR -- : OpenURI::HTTPError: 403 Forbidden: https://www.unicode.org/Public/emoji/15.0/emoji-test.txt E, [2024-05-11T15:11:14.471205 #2076912] ERROR -- : from /tmp/ruby/src/trunk/tool/downloader.rb:201:in `download' E, [2024-05-11T15:11:14.471217 #2076912] ERROR -- : from /tmp/ruby/src/trunk/tool/downloader.rb:136:in `download' E, [2024-05-11T15:11:14.471227 #2076912] ERROR -- : from /tmp/ruby/src/trunk/tool/downloader.rb:482:in `block in
' E, [2024-05-11T15:11:14.471237 #2076912] ERROR -- : from /tmp/ruby/src/trunk/tool/downloader.rb:465:in `each' E, [2024-05-11T15:11:14.471246 #2076912] ERROR -- : from /tmp/ruby/src/trunk/tool/downloader.rb:465:in `
' E, [2024-05-11T15:11:14.471256 #2076912] ERROR -- : /usr/lib/ruby/3.0.0/open-uri.rb:364:in `open_http': 403 Forbidden (OpenURI::HTTPError) E, [2024-05-11T15:11:14.471266 #2076912] ERROR -- : from /usr/lib/ruby/3.0.0/open-uri.rb:741:in `buffer_open' E, [2024-05-11T15:11:14.471279 #2076912] ERROR -- : from /usr/lib/ruby/3.0.0/open-uri.rb:212:in `block in open_loop' E, [2024-05-11T15:11:14.471288 #2076912] ERROR -- : from /usr/lib/ruby/3.0.0/open-uri.rb:210:in `catch' E, [2024-05-11T15:11:14.471298 #2076912] ERROR -- : from /usr/lib/ruby/3.0.0/open-uri.rb:210:in `open_loop' E, [2024-05-11T15:11:14.471308 #2076912] ERROR -- : from /usr/lib/ruby/3.0.0/open-uri.rb:151:in `open_uri' E, [2024-05-11T15:11:14.471318 #2076912] ERROR -- : from /usr/lib/ruby/3.0.0/open-uri.rb:721:in `open' E, [2024-05-11T15:11:14.471328 #2076912] ERROR -- : from /usr/lib/ruby/3.0.0/open-uri.rb:729:in `read' E, [2024-05-11T15:11:14.471353 #2076912] ERROR -- : from /tmp/ruby/src/trunk/tool/downloader.rb:247:in `block in download' E, [2024-05-11T15:11:14.471363 #2076912] ERROR -- : from /tmp/ruby/src/trunk/tool/downloader.rb:378:in `with_retry' E, [2024-05-11T15:11:14.471377 #2076912] ERROR -- : from /tmp/ruby/src/trunk/tool/downloader.rb:246:in `download' E, [2024-05-11T15:11:14.471387 #2076912] ERROR -- : from /tmp/ruby/src/trunk/tool/downloader.rb:136:in `download' E, [2024-05-11T15:11:14.471396 #2076912] ERROR -- : from /tmp/ruby/src/trunk/tool/downloader.rb:482:in `block in
' E, [2024-05-11T15:11:14.471406 #2076912] ERROR -- : from /tmp/ruby/src/trunk/tool/downloader.rb:465:in `each' E, [2024-05-11T15:11:14.471416 #2076912] ERROR -- : from /tmp/ruby/src/trunk/tool/downloader.rb:465:in `
' E, [2024-05-11T15:11:14.474883 #2076912] ERROR -- : /tmp/ruby/src/trunk/tool/downloader.rb:302:in `rescue in download': failed to download emoji/15.0/emoji-test.txt (RuntimeError) E, [2024-05-11T15:11:14.474937 #2076912] ERROR -- : OpenURI::HTTPError: 403 Forbidden: https://www.unicode.org/Public/emoji/15.0/emoji-test.txt E, [2024-05-11T15:11:14.474951 #2076912] ERROR -- : from /tmp/ruby/src/trunk/tool/downloader.rb:201:in `download' E, [2024-05-11T15:11:14.474969 #2076912] ERROR -- : from /tmp/ruby/src/trunk/tool/downloader.rb:136:in `download' E, [2024-05-11T15:11:14.474977 #2076912] ERROR -- : from /tmp/ruby/src/trunk/tool/downloader.rb:482:in `block in
' E, [2024-05-11T15:11:14.474985 #2076912] ERROR -- : from /tmp/ruby/src/trunk/tool/downloader.rb:465:in `each' E, [2024-05-11T15:11:14.474995 #2076912] ERROR -- : from /tmp/ruby/src/trunk/tool/downloader.rb:465:in `
' E, [2024-05-11T15:11:14.475003 #2076912] ERROR -- : /usr/lib/ruby/3.0.0/open-uri.rb:364:in `open_http': 403 Forbidden (OpenURI::HTTPError) E, [2024-05-11T15:11:14.475010 #2076912] ERROR -- : from /usr/lib/ruby/3.0.0/open-uri.rb:741:in `buffer_open' E, [2024-05-11T15:11:14.475018 #2076912] ERROR -- : from /usr/lib/ruby/3.0.0/open-uri.rb:212:in `block in open_loop' E, [2024-05-11T15:11:14.475026 #2076912] ERROR -- : from /usr/lib/ruby/3.0.0/open-uri.rb:210:in `catch' E, [2024-05-11T15:11:14.475036 #2076912] ERROR -- : from /usr/lib/ruby/3.0.0/open-uri.rb:210:in `open_loop' E, [2024-05-11T15:11:14.475044 #2076912] ERROR -- : from /usr/lib/ruby/3.0.0/open-uri.rb:151:in `open_uri' E, [2024-05-11T15:11:14.475051 #2076912] ERROR -- : from /usr/lib/ruby/3.0.0/open-uri.rb:721:in `open' E, [2024-05-11T15:11:14.475059 #2076912] ERROR -- : from /usr/lib/ruby/3.0.0/open-uri.rb:729:in `read' E, [2024-05-11T15:11:14.475066 #2076912] ERROR -- : from /tmp/ruby/src/trunk/tool/downloader.rb:247:in `block in download' E, [2024-05-11T15:11:14.475074 #2076912] ERROR -- : from /tmp/ruby/src/trunk/tool/downloader.rb:378:in `with_retry' E, [2024-05-11T15:11:14.475081 #2076912] ERROR -- : from /tmp/ruby/src/trunk/tool/downloader.rb:246:in `download' E, [2024-05-11T15:11:14.475088 #2076912] ERROR -- : from /tmp/ruby/src/trunk/tool/downloader.rb:136:in `download' E, [2024-05-11T15:11:14.475098 #2076912] ERROR -- : from /tmp/ruby/src/trunk/tool/downloader.rb:482:in `block in
' E, [2024-05-11T15:11:14.475106 #2076912] ERROR -- : from /tmp/ruby/src/trunk/tool/downloader.rb:465:in `each' E, [2024-05-11T15:11:14.475113 #2076912] ERROR -- : from /tmp/ruby/src/trunk/tool/downloader.rb:465:in `
' E, [2024-05-11T15:11:14.475122 #2076912] ERROR -- : make: *** [uncommon.mk:1765: /tmp/ruby/src/trunk/enc/unicode/data/emoji/15.0/emoji-sequences.txt] Error 1 E, [2024-05-11T15:11:14.475130 #2076912] ERROR -- : make: *** Deleting file '/tmp/ruby/src/trunk/enc/unicode/data/emoji/15.0/emoji-sequences.txt' E, [2024-05-11T15:11:14.475138 #2076912] ERROR -- : make: *** Waiting for unfinished jobs.... E, [2024-05-11T15:11:14.478231 #2076912] ERROR -- : make: *** [uncommon.mk:1765: /tmp/ruby/src/trunk/enc/unicode/data/emoji/15.0/emoji-zwj-sequences.txt] Error 1 E, [2024-05-11T15:11:14.491593 #2076912] ERROR -- : /tmp/ruby/src/trunk/tool/downloader.rb:302:in `rescue in download': failed to download emoji/15.0/emoji-test.txt (RuntimeError) E, [2024-05-11T15:11:14.491711 #2076912] ERROR -- : OpenURI::HTTPError: 403 Forbidden: https://www.unicode.org/Public/emoji/15.0/emoji-test.txt E, [2024-05-11T15:11:14.491738 #2076912] ERROR -- : from /tmp/ruby/src/trunk/tool/downloader.rb:201:in `download' E, [2024-05-11T15:11:14.491751 #2076912] ERROR -- : from /tmp/ruby/src/trunk/tool/downloader.rb:136:in `download' E, [2024-05-11T15:11:14.491762 #2076912] ERROR -- : from /tmp/ruby/src/trunk/tool/downloader.rb:482:in `block in
' E, [2024-05-11T15:11:14.491773 #2076912] ERROR -- : from /tmp/ruby/src/trunk/tool/downloader.rb:465:in `each' E, [2024-05-11T15:11:14.491784 #2076912] ERROR -- : from /tmp/ruby/src/trunk/tool/downloader.rb:465:in `
' E, [2024-05-11T15:11:14.491795 #2076912] ERROR -- : /usr/lib/ruby/3.0.0/open-uri.rb:364:in `open_http': 403 Forbidden (OpenURI::HTTPError) E, [2024-05-11T15:11:14.491809 #2076912] ERROR -- : from /usr/lib/ruby/3.0.0/open-uri.rb:741:in `buffer_open' E, [2024-05-11T15:11:14.491820 #2076912] ERROR -- : from /usr/lib/ruby/3.0.0/open-uri.rb:212:in `block in open_loop' E, [2024-05-11T15:11:14.491831 #2076912] ERROR -- : from /usr/lib/ruby/3.0.0/open-uri.rb:210:in `catch' E, [2024-05-11T15:11:14.491841 #2076912] ERROR -- : from /usr/lib/ruby/3.0.0/open-uri.rb:210:in `open_loop' E, [2024-05-11T15:11:14.491852 #2076912] ERROR -- : from /usr/lib/ruby/3.0.0/open-uri.rb:151:in `open_uri' E, [2024-05-11T15:11:14.492057 #2076912] ERROR -- : from /usr/lib/ruby/3.0.0/open-uri.rb:721:in `open' E, [2024-05-11T15:11:14.492070 #2076912] ERROR -- : from /usr/lib/ruby/3.0.0/open-uri.rb:729:in `read' E, [2024-05-11T15:11:14.492081 #2076912] ERROR -- : from /tmp/ruby/src/trunk/tool/downloader.rb:247:in `block in download' E, [2024-05-11T15:11:14.492094 #2076912] ERROR -- : from /tmp/ruby/src/trunk/tool/downloader.rb:378:in `with_retry' E, [2024-05-11T15:11:14.492105 #2076912] ERROR -- : from /tmp/ruby/src/trunk/tool/downloader.rb:246:in `download' E, [2024-05-11T15:11:14.492122 #2076912] ERROR -- : from /tmp/ruby/src/trunk/tool/downloader.rb:136:in `download' E, [2024-05-11T15:11:14.492133 #2076912] ERROR -- : from /tmp/ruby/src/trunk/tool/downloader.rb:482:in `block in
' E, [2024-05-11T15:11:14.492144 #2076912] ERROR -- : from /tmp/ruby/src/trunk/tool/downloader.rb:465:in `each' E, [2024-05-11T15:11:14.492163 #2076912] ERROR -- : from /tmp/ruby/src/trunk/tool/downloader.rb:465:in `
' E, [2024-05-11T15:11:14.495585 #2076912] ERROR -- : make: *** [uncommon.mk:1765: /tmp/ruby/src/trunk/enc/unicode/data/emoji/15.0/emoji-test.txt] Error 1 I, [2024-05-11T15:11:14.495755 #2076912] INFO -- : downloading emoji/15.0/emoji-test.txt ... I, [2024-05-11T15:11:14.496199 #2076912] INFO -- : $$$[end] "make update-unicode -j20" exit with 512. I, [2024-05-11T15:11:14.496276 #2076912] INFO -- : $$$[beg] make update-download -j20 I, [2024-05-11T15:11:14.611210 #2076912] INFO -- : tool/config.guess already exists I, [2024-05-11T15:11:14.611267 #2076912] INFO -- : tool/config.sub already exists I, [2024-05-11T15:11:14.613612 #2076912] INFO -- : Update minitest to ea9caafc0754b1d6236a490d59e624b53209734a I, [2024-05-11T15:11:14.613723 #2076912] INFO -- : Update power_assert to 84e85124c5014a139af39161d484156cfe87a9ed I, [2024-05-11T15:11:14.614427 #2076912] INFO -- : Update rbs to ba7872795d5de04adb8ff500c0e6afdc81a041dd I, [2024-05-11T15:11:14.614680 #2076912] INFO -- : Update typeprof to b19a6416da3a05d57fadd6ffdadb382b6d236ca5 I, [2024-05-11T15:11:14.614960 #2076912] INFO -- : echo ea9caafc0754b1d6236a490d59e624b53209734a | /bin/sh /tmp/ruby/src/trunk/tool/ifchange /tmp/ruby/src/trunk/.bundle/.timestamp/minitest.revision - I, [2024-05-11T15:11:14.615118 #2076912] INFO -- : echo 84e85124c5014a139af39161d484156cfe87a9ed | /bin/sh /tmp/ruby/src/trunk/tool/ifchange /tmp/ruby/src/trunk/.bundle/.timestamp/power_assert.revision - I, [2024-05-11T15:11:14.615501 #2076912] INFO -- : echo ba7872795d5de04adb8ff500c0e6afdc81a041dd | /bin/sh /tmp/ruby/src/trunk/tool/ifchange /tmp/ruby/src/trunk/.bundle/.timestamp/rbs.revision - I, [2024-05-11T15:11:14.615617 #2076912] INFO -- : echo b19a6416da3a05d57fadd6ffdadb382b6d236ca5 | /bin/sh /tmp/ruby/src/trunk/tool/ifchange /tmp/ruby/src/trunk/.bundle/.timestamp/typeprof.revision - I, [2024-05-11T15:11:14.616967 #2076912] INFO -- : /tmp/ruby/src/trunk/.bundle/.timestamp/power_assert.revision unchanged I, [2024-05-11T15:11:14.617071 #2076912] INFO -- : /tmp/ruby/src/trunk/.bundle/.timestamp/minitest.revision unchanged I, [2024-05-11T15:11:14.617543 #2076912] INFO -- : /tmp/ruby/src/trunk/.bundle/.timestamp/rbs.revision unchanged I, [2024-05-11T15:11:14.617565 #2076912] INFO -- : /tmp/ruby/src/trunk/.bundle/.timestamp/typeprof.revision unchanged I, [2024-05-11T15:11:14.618068 #2076912] INFO -- : Building power_assert@84e85124c5014a139af39161d484156cfe87a9ed to /tmp/ruby/src/trunk/gems/power_assert-2.0.3.gem I, [2024-05-11T15:11:14.686893 #2076912] INFO -- : Successfully built RubyGem I, [2024-05-11T15:11:14.686957 #2076912] INFO -- : Name: power_assert I, [2024-05-11T15:11:14.686983 #2076912] INFO -- : Version: 2.0.4dev I, [2024-05-11T15:11:14.686998 #2076912] INFO -- : File: power_assert-2.0.4dev.gem I, [2024-05-11T15:11:14.733148 #2076912] INFO -- : $$$[end] "make update-download -j20" exit with 0. I, [2024-05-11T15:11:14.733195 #2076912] INFO -- : $$$[beg] make update-rubyspec -j20 I, [2024-05-11T15:11:14.791081 #2076912] INFO -- : make: Nothing to be done for 'update-rubyspec'. I, [2024-05-11T15:11:14.791405 #2076912] INFO -- : $$$[end] "make update-rubyspec -j20" exit with 0. I, [2024-05-11T15:11:14.791434 #2076912] INFO -- : $$$[beg] make update-src -j20 I, [2024-05-11T15:11:15.341820 #2076912] INFO -- : Already up to date. I, [2024-05-11T15:11:15.359740 #2076912] INFO -- : Latest commit hash = 7e604a0263 I, [2024-05-11T15:11:15.361344 #2076912] INFO -- : $$$[end] "make update-src -j20" exit with 0. I, [2024-05-11T15:11:15.361417 #2076912] INFO -- : $$$[beg] make after-update -j20 I, [2024-05-11T15:11:15.441285 #2076912] INFO -- : generating /tmp/ruby/src/trunk/ext/ripper/eventids2table.c I, [2024-05-11T15:11:15.445605 #2076912] INFO -- : make[1]: Entering directory '/tmp/ruby/src/trunk/ext/ripper' I, [2024-05-11T15:11:15.445627 #2076912] INFO -- : make[1]: Nothing to be done for 'src'. I, [2024-05-11T15:11:15.445632 #2076912] INFO -- : make[1]: Leaving directory '/tmp/ruby/src/trunk/ext/ripper' I, [2024-05-11T15:11:15.462030 #2076912] INFO -- : /tmp/ruby/src/trunk/revision.h updated I, [2024-05-11T15:11:15.463369 #2076912] INFO -- : generating x86_64-linux-fake.rb I, [2024-05-11T15:11:15.517008 #2076912] INFO -- : x86_64-linux-fake.rb updated I, [2024-05-11T15:11:15.518369 #2076912] INFO -- : generating enc.mk I, [2024-05-11T15:11:15.634999 #2076912] INFO -- : making srcs under enc I, [2024-05-11T15:11:15.664973 #2076912] INFO -- : make[1]: Entering directory '/tmp/ruby/build/trunk' I, [2024-05-11T15:11:15.665001 #2076912] INFO -- : make[1]: Nothing to be done for 'srcs'. I, [2024-05-11T15:11:15.665007 #2076912] INFO -- : make[1]: Leaving directory '/tmp/ruby/build/trunk' I, [2024-05-11T15:11:15.709723 #2076912] INFO -- : Update minitest to ea9caafc0754b1d6236a490d59e624b53209734a I, [2024-05-11T15:11:15.709968 #2076912] INFO -- : Update power_assert to 84e85124c5014a139af39161d484156cfe87a9ed I, [2024-05-11T15:11:15.710611 #2076912] INFO -- : Update rbs to ba7872795d5de04adb8ff500c0e6afdc81a041dd I, [2024-05-11T15:11:15.710844 #2076912] INFO -- : Update typeprof to b19a6416da3a05d57fadd6ffdadb382b6d236ca5 I, [2024-05-11T15:11:15.712008 #2076912] INFO -- : echo ea9caafc0754b1d6236a490d59e624b53209734a | /bin/sh /tmp/ruby/src/trunk/tool/ifchange /tmp/ruby/src/trunk/.bundle/.timestamp/minitest.revision - I, [2024-05-11T15:11:15.712166 #2076912] INFO -- : echo 84e85124c5014a139af39161d484156cfe87a9ed | /bin/sh /tmp/ruby/src/trunk/tool/ifchange /tmp/ruby/src/trunk/.bundle/.timestamp/power_assert.revision - I, [2024-05-11T15:11:15.713522 #2076912] INFO -- : echo ba7872795d5de04adb8ff500c0e6afdc81a041dd | /bin/sh /tmp/ruby/src/trunk/tool/ifchange /tmp/ruby/src/trunk/.bundle/.timestamp/rbs.revision - I, [2024-05-11T15:11:15.713734 #2076912] INFO -- : echo b19a6416da3a05d57fadd6ffdadb382b6d236ca5 | /bin/sh /tmp/ruby/src/trunk/tool/ifchange /tmp/ruby/src/trunk/.bundle/.timestamp/typeprof.revision - I, [2024-05-11T15:11:15.713970 #2076912] INFO -- : /tmp/ruby/src/trunk/.bundle/.timestamp/minitest.revision unchanged I, [2024-05-11T15:11:15.714259 #2076912] INFO -- : /tmp/ruby/src/trunk/.bundle/.timestamp/power_assert.revision unchanged I, [2024-05-11T15:11:15.715134 #2076912] INFO -- : /tmp/ruby/src/trunk/.bundle/.timestamp/rbs.revision unchanged I, [2024-05-11T15:11:15.715246 #2076912] INFO -- : /tmp/ruby/src/trunk/.bundle/.timestamp/typeprof.revision unchanged I, [2024-05-11T15:11:15.715272 #2076912] INFO -- : Building power_assert@84e85124c5014a139af39161d484156cfe87a9ed to /tmp/ruby/src/trunk/gems/power_assert-2.0.3.gem I, [2024-05-11T15:11:15.785289 #2076912] INFO -- : Successfully built RubyGem I, [2024-05-11T15:11:15.785351 #2076912] INFO -- : Name: power_assert I, [2024-05-11T15:11:15.785375 #2076912] INFO -- : Version: 2.0.4dev I, [2024-05-11T15:11:15.785390 #2076912] INFO -- : File: power_assert-2.0.4dev.gem I, [2024-05-11T15:11:15.787451 #2076912] INFO -- : Extracting bundle gem power_assert-2.0.3... I, [2024-05-11T15:11:15.847398 #2076912] INFO -- : Try with hash version of bundled gems instead of gems/power_assert-2.0.3.gem. We don't use this gem with release version of Ruby. I, [2024-05-11T15:11:15.852353 #2076912] INFO -- : Unpacked gems/power_assert-2.0.4dev.gem I, [2024-05-11T15:11:15.854172 #2076912] INFO -- : $$$[end] "make after-update -j20" exit with 0. I, [2024-05-11T15:11:15.854337 #2076912] INFO -- : $$$[beg] make miniruby -j20 I, [2024-05-11T15:11:15.911104 #2076912] INFO -- : BASERUBY = /usr/bin/ruby --disable=gems I, [2024-05-11T15:11:15.911131 #2076912] INFO -- : CC = gcc I, [2024-05-11T15:11:15.911136 #2076912] INFO -- : LD = ld I, [2024-05-11T15:11:15.911140 #2076912] INFO -- : LDSHARED = gcc -shared I, [2024-05-11T15:11:15.911144 #2076912] INFO -- : CFLAGS = -O3 -fno-fast-math -ggdb3 -Wall -Wextra -Wdeprecated-declarations -Wdiv-by-zero -Wduplicated-cond -Wimplicit-function-declaration -Wimplicit-int -Wpointer-arith -Wwrite-strings -Wold-style-definition -Wimplicit-fallthrough=0 -Wmissing-noreturn -Wno-cast-function-type -Wno-constant-logical-operand -Wno-long-long -Wno-missing-field-initializers -Wno-overlength-strings -Wno-packed-bitfield-compat -Wno-parentheses-equality -Wno-self-assign -Wno-tautological-compare -Wno-unused-parameter -Wno-unused-value -Wsuggest-attribute=format -Wsuggest-attribute=noreturn -Wunused-variable -Wmisleading-indentation -Wundef -fPIC I, [2024-05-11T15:11:15.911148 #2076912] INFO -- : XCFLAGS = -U_FORTIFY_SOURCE -D_FORTIFY_SOURCE=2 -fstack-protector-strong -fno-strict-overflow -fvisibility=hidden -fexcess-precision=standard -DRUBY_EXPORT -I. -I.ext/include/x86_64-linux -I/tmp/ruby/src/trunk/include -I/tmp/ruby/src/trunk -I/tmp/ruby/src/trunk/prism -I/tmp/ruby/src/trunk/enc/unicode/15.0.0 I, [2024-05-11T15:11:15.911152 #2076912] INFO -- : CPPFLAGS = I, [2024-05-11T15:11:15.911155 #2076912] INFO -- : DLDFLAGS = -Wl,--compress-debug-sections=zlib -Wl,-soname,libruby.so.3.4 -fstack-protector-strong I, [2024-05-11T15:11:15.911159 #2076912] INFO -- : SOLIBS = -lz -lrt -lrt -lgmp -ldl -lcrypt -lm -lpthread I, [2024-05-11T15:11:15.911163 #2076912] INFO -- : LANG = en_US.UTF-8 I, [2024-05-11T15:11:15.911166 #2076912] INFO -- : LC_ALL = I, [2024-05-11T15:11:15.911169 #2076912] INFO -- : LC_CTYPE = I, [2024-05-11T15:11:15.911173 #2076912] INFO -- : MFLAGS = -j20 --jobserver-auth=4,5 I, [2024-05-11T15:11:15.911176 #2076912] INFO -- : RUSTC = no I, [2024-05-11T15:11:15.911180 #2076912] INFO -- : YJIT_RUSTC_ARGS = --crate-name=yjit --crate-type=staticlib --edition=2021 -g -C lto=thin -C opt-level=3 -C overflow-checks=on '--out-dir=/tmp/ruby/build/trunk/yjit/target/release/' /tmp/ruby/src/trunk/yjit/src/lib.rs I, [2024-05-11T15:11:15.912349 #2076912] INFO -- : gcc (Ubuntu 11.4.0-1ubuntu1~22.04) 11.4.0 I, [2024-05-11T15:11:15.912370 #2076912] INFO -- : Copyright (C) 2021 Free Software Foundation, Inc. I, [2024-05-11T15:11:15.912376 #2076912] INFO -- : This is free software; see the source for copying conditions. There is NO I, [2024-05-11T15:11:15.912380 #2076912] INFO -- : warranty; not even for MERCHANTABILITY or FITNESS FOR A PARTICULAR PURPOSE. I, [2024-05-11T15:11:15.912383 #2076912] INFO -- : I, [2024-05-11T15:11:15.933217 #2076912] INFO -- : compiling /tmp/ruby/src/trunk/version.c I, [2024-05-11T15:11:16.037236 #2076912] INFO -- : linking miniruby I, [2024-05-11T15:11:16.559580 #2076912] INFO -- : $$$[end] "make miniruby -j20" exit with 0. I, [2024-05-11T15:11:16.559730 #2076912] INFO -- : $$$[beg] make ruby -j20 I, [2024-05-11T15:11:16.617339 #2076912] INFO -- : BASERUBY = /usr/bin/ruby --disable=gems I, [2024-05-11T15:11:16.617374 #2076912] INFO -- : CC = gcc I, [2024-05-11T15:11:16.617387 #2076912] INFO -- : LD = ld I, [2024-05-11T15:11:16.617404 #2076912] INFO -- : LDSHARED = gcc -shared I, [2024-05-11T15:11:16.617415 #2076912] INFO -- : CFLAGS = -O3 -fno-fast-math -ggdb3 -Wall -Wextra -Wdeprecated-declarations -Wdiv-by-zero -Wduplicated-cond -Wimplicit-function-declaration -Wimplicit-int -Wpointer-arith -Wwrite-strings -Wold-style-definition -Wimplicit-fallthrough=0 -Wmissing-noreturn -Wno-cast-function-type -Wno-constant-logical-operand -Wno-long-long -Wno-missing-field-initializers -Wno-overlength-strings -Wno-packed-bitfield-compat -Wno-parentheses-equality -Wno-self-assign -Wno-tautological-compare -Wno-unused-parameter -Wno-unused-value -Wsuggest-attribute=format -Wsuggest-attribute=noreturn -Wunused-variable -Wmisleading-indentation -Wundef -fPIC I, [2024-05-11T15:11:16.617427 #2076912] INFO -- : XCFLAGS = -U_FORTIFY_SOURCE -D_FORTIFY_SOURCE=2 -fstack-protector-strong -fno-strict-overflow -fvisibility=hidden -fexcess-precision=standard -DRUBY_EXPORT -I. -I.ext/include/x86_64-linux -I/tmp/ruby/src/trunk/include -I/tmp/ruby/src/trunk -I/tmp/ruby/src/trunk/prism -I/tmp/ruby/src/trunk/enc/unicode/15.0.0 I, [2024-05-11T15:11:16.617437 #2076912] INFO -- : CPPFLAGS = I, [2024-05-11T15:11:16.617447 #2076912] INFO -- : DLDFLAGS = -Wl,--compress-debug-sections=zlib -Wl,-soname,libruby.so.3.4 -fstack-protector-strong I, [2024-05-11T15:11:16.617458 #2076912] INFO -- : SOLIBS = -lz -lrt -lrt -lgmp -ldl -lcrypt -lm -lpthread I, [2024-05-11T15:11:16.617467 #2076912] INFO -- : LANG = en_US.UTF-8 I, [2024-05-11T15:11:16.617477 #2076912] INFO -- : LC_ALL = I, [2024-05-11T15:11:16.617487 #2076912] INFO -- : LC_CTYPE = I, [2024-05-11T15:11:16.617497 #2076912] INFO -- : MFLAGS = -j20 --jobserver-auth=4,5 I, [2024-05-11T15:11:16.617507 #2076912] INFO -- : RUSTC = no I, [2024-05-11T15:11:16.617517 #2076912] INFO -- : YJIT_RUSTC_ARGS = --crate-name=yjit --crate-type=staticlib --edition=2021 -g -C lto=thin -C opt-level=3 -C overflow-checks=on '--out-dir=/tmp/ruby/build/trunk/yjit/target/release/' /tmp/ruby/src/trunk/yjit/src/lib.rs I, [2024-05-11T15:11:16.618772 #2076912] INFO -- : gcc (Ubuntu 11.4.0-1ubuntu1~22.04) 11.4.0 I, [2024-05-11T15:11:16.618809 #2076912] INFO -- : Copyright (C) 2021 Free Software Foundation, Inc. I, [2024-05-11T15:11:16.618822 #2076912] INFO -- : This is free software; see the source for copying conditions. There is NO I, [2024-05-11T15:11:16.618834 #2076912] INFO -- : warranty; not even for MERCHANTABILITY or FITNESS FOR A PARTICULAR PURPOSE. I, [2024-05-11T15:11:16.618845 #2076912] INFO -- : I, [2024-05-11T15:11:16.724644 #2076912] INFO -- : builtin_binary.inc updated I, [2024-05-11T15:11:16.729210 #2076912] INFO -- : c5234a9416e4f20f175185e840b25b0f08674d14078ed7083f37e655458e3ca9 builtin_binary.inc I, [2024-05-11T15:11:16.729895 #2076912] INFO -- : compiling /tmp/ruby/src/trunk/builtin.c I, [2024-05-11T15:11:16.912420 #2076912] INFO -- : linking static-library libruby-static.a I, [2024-05-11T15:11:17.212093 #2076912] INFO -- : linking shared-library libruby.so.3.4.0 I, [2024-05-11T15:11:18.794034 #2076912] INFO -- : linking ruby I, [2024-05-11T15:11:18.816497 #2076912] INFO -- : $$$[end] "make ruby -j20" exit with 0. I, [2024-05-11T15:11:18.816657 #2076912] INFO -- : $$$[beg] make all -j20 I, [2024-05-11T15:11:18.874600 #2076912] INFO -- : BASERUBY = /usr/bin/ruby --disable=gems I, [2024-05-11T15:11:18.874632 #2076912] INFO -- : CC = gcc I, [2024-05-11T15:11:18.874638 #2076912] INFO -- : LD = ld I, [2024-05-11T15:11:18.874642 #2076912] INFO -- : LDSHARED = gcc -shared I, [2024-05-11T15:11:18.874646 #2076912] INFO -- : CFLAGS = -O3 -fno-fast-math -ggdb3 -Wall -Wextra -Wdeprecated-declarations -Wdiv-by-zero -Wduplicated-cond -Wimplicit-function-declaration -Wimplicit-int -Wpointer-arith -Wwrite-strings -Wold-style-definition -Wimplicit-fallthrough=0 -Wmissing-noreturn -Wno-cast-function-type -Wno-constant-logical-operand -Wno-long-long -Wno-missing-field-initializers -Wno-overlength-strings -Wno-packed-bitfield-compat -Wno-parentheses-equality -Wno-self-assign -Wno-tautological-compare -Wno-unused-parameter -Wno-unused-value -Wsuggest-attribute=format -Wsuggest-attribute=noreturn -Wunused-variable -Wmisleading-indentation -Wundef -fPIC I, [2024-05-11T15:11:18.874652 #2076912] INFO -- : XCFLAGS = -U_FORTIFY_SOURCE -D_FORTIFY_SOURCE=2 -fstack-protector-strong -fno-strict-overflow -fvisibility=hidden -fexcess-precision=standard -DRUBY_EXPORT -I. -I.ext/include/x86_64-linux -I/tmp/ruby/src/trunk/include -I/tmp/ruby/src/trunk -I/tmp/ruby/src/trunk/prism -I/tmp/ruby/src/trunk/enc/unicode/15.0.0 I, [2024-05-11T15:11:18.874656 #2076912] INFO -- : CPPFLAGS = I, [2024-05-11T15:11:18.874660 #2076912] INFO -- : DLDFLAGS = -Wl,--compress-debug-sections=zlib -Wl,-soname,libruby.so.3.4 -fstack-protector-strong I, [2024-05-11T15:11:18.874663 #2076912] INFO -- : SOLIBS = -lz -lrt -lrt -lgmp -ldl -lcrypt -lm -lpthread I, [2024-05-11T15:11:18.874667 #2076912] INFO -- : LANG = en_US.UTF-8 I, [2024-05-11T15:11:18.874671 #2076912] INFO -- : LC_ALL = I, [2024-05-11T15:11:18.874674 #2076912] INFO -- : LC_CTYPE = I, [2024-05-11T15:11:18.874678 #2076912] INFO -- : MFLAGS = -j20 --jobserver-auth=4,5 I, [2024-05-11T15:11:18.874682 #2076912] INFO -- : RUSTC = no I, [2024-05-11T15:11:18.874686 #2076912] INFO -- : YJIT_RUSTC_ARGS = --crate-name=yjit --crate-type=staticlib --edition=2021 -g -C lto=thin -C opt-level=3 -C overflow-checks=on '--out-dir=/tmp/ruby/build/trunk/yjit/target/release/' /tmp/ruby/src/trunk/yjit/src/lib.rs I, [2024-05-11T15:11:18.876150 #2076912] INFO -- : gcc (Ubuntu 11.4.0-1ubuntu1~22.04) 11.4.0 I, [2024-05-11T15:11:18.876183 #2076912] INFO -- : Copyright (C) 2021 Free Software Foundation, Inc. I, [2024-05-11T15:11:18.876189 #2076912] INFO -- : This is free software; see the source for copying conditions. There is NO I, [2024-05-11T15:11:18.876194 #2076912] INFO -- : warranty; not even for MERCHANTABILITY or FITNESS FOR A PARTICULAR PURPOSE. I, [2024-05-11T15:11:18.876199 #2076912] INFO -- : I, [2024-05-11T15:11:18.908138 #2076912] INFO -- : generating enc.mk I, [2024-05-11T15:11:18.910159 #2076912] INFO -- : building spec/ruby/optional/capi/ext/array_spec.so I, [2024-05-11T15:11:18.910390 #2076912] INFO -- : building spec/ruby/optional/capi/ext/basic_object_spec.so I, [2024-05-11T15:11:18.910993 #2076912] INFO -- : building spec/ruby/optional/capi/ext/bignum_spec.so I, [2024-05-11T15:11:18.911801 #2076912] INFO -- : building spec/ruby/optional/capi/ext/binding_spec.so I, [2024-05-11T15:11:18.912281 #2076912] INFO -- : building spec/ruby/optional/capi/ext/class_id_under_autoload_spec.so I, [2024-05-11T15:11:18.912310 #2076912] INFO -- : building spec/ruby/optional/capi/ext/boolean_spec.so I, [2024-05-11T15:11:18.912704 #2076912] INFO -- : building spec/ruby/optional/capi/ext/class_spec.so I, [2024-05-11T15:11:18.914099 #2076912] INFO -- : building spec/ruby/optional/capi/ext/class_under_autoload_spec.so I, [2024-05-11T15:11:18.914998 #2076912] INFO -- : building spec/ruby/optional/capi/ext/complex_spec.so I, [2024-05-11T15:11:18.915312 #2076912] INFO -- : building spec/ruby/optional/capi/ext/constants_spec.so I, [2024-05-11T15:11:18.916016 #2076912] INFO -- : building spec/ruby/optional/capi/ext/data_spec.so I, [2024-05-11T15:11:18.916346 #2076912] INFO -- : building spec/ruby/optional/capi/ext/debug_spec.so I, [2024-05-11T15:11:18.917032 #2076912] INFO -- : building spec/ruby/optional/capi/ext/encoding_spec.so I, [2024-05-11T15:11:18.917349 #2076912] INFO -- : building spec/ruby/optional/capi/ext/enumerator_spec.so I, [2024-05-11T15:11:18.918058 #2076912] INFO -- : building spec/ruby/optional/capi/ext/exception_spec.so I, [2024-05-11T15:11:18.918263 #2076912] INFO -- : building spec/ruby/optional/capi/ext/fiber_spec.so I, [2024-05-11T15:11:18.918996 #2076912] INFO -- : building spec/ruby/optional/capi/ext/file_spec.so I, [2024-05-11T15:11:18.919241 #2076912] INFO -- : building spec/ruby/optional/capi/ext/fixnum_spec.so I, [2024-05-11T15:11:18.920175 #2076912] INFO -- : building spec/ruby/optional/capi/ext/float_spec.so I, [2024-05-11T15:11:19.043706 #2076912] INFO -- : building spec/ruby/optional/capi/ext/gc_spec.so I, [2024-05-11T15:11:19.048092 #2076912] INFO -- : building spec/ruby/optional/capi/ext/globals_spec.so I, [2024-05-11T15:11:19.057943 #2076912] INFO -- : building spec/ruby/optional/capi/ext/hash_spec.so I, [2024-05-11T15:11:19.062106 #2076912] INFO -- : building spec/ruby/optional/capi/ext/integer_spec.so I, [2024-05-11T15:11:19.066455 #2076912] INFO -- : building spec/ruby/optional/capi/ext/io_spec.so I, [2024-05-11T15:11:19.066668 #2076912] INFO -- : building spec/ruby/optional/capi/ext/kernel_spec.so I, [2024-05-11T15:11:19.067350 #2076912] INFO -- : building spec/ruby/optional/capi/ext/language_spec.so I, [2024-05-11T15:11:19.067863 #2076912] INFO -- : building spec/ruby/optional/capi/ext/marshal_spec.so I, [2024-05-11T15:11:19.082128 #2076912] INFO -- : building spec/ruby/optional/capi/ext/module_spec.so I, [2024-05-11T15:11:19.083522 #2076912] INFO -- : building spec/ruby/optional/capi/ext/module_under_autoload_spec.so I, [2024-05-11T15:11:19.091724 #2076912] INFO -- : building spec/ruby/optional/capi/ext/mutex_spec.so I, [2024-05-11T15:11:19.101006 #2076912] INFO -- : building spec/ruby/optional/capi/ext/numeric_spec.so I, [2024-05-11T15:11:19.104214 #2076912] INFO -- : building spec/ruby/optional/capi/ext/object_spec.so I, [2024-05-11T15:11:19.106667 #2076912] INFO -- : building spec/ruby/optional/capi/ext/proc_spec.so I, [2024-05-11T15:11:19.110160 #2076912] INFO -- : building spec/ruby/optional/capi/ext/range_spec.so I, [2024-05-11T15:11:19.111060 #2076912] INFO -- : building spec/ruby/optional/capi/ext/rational_spec.so I, [2024-05-11T15:11:19.156306 #2076912] INFO -- : building spec/ruby/optional/capi/ext/rbasic_spec.so I, [2024-05-11T15:11:19.168492 #2076912] INFO -- : building spec/ruby/optional/capi/ext/regexp_spec.so I, [2024-05-11T15:11:19.207460 #2076912] INFO -- : building spec/ruby/optional/capi/ext/string_spec.so I, [2024-05-11T15:11:19.218857 #2076912] INFO -- : building spec/ruby/optional/capi/ext/struct_spec.so I, [2024-05-11T15:11:19.219300 #2076912] INFO -- : building spec/ruby/optional/capi/ext/st_spec.so I, [2024-05-11T15:11:19.221532 #2076912] INFO -- : building spec/ruby/optional/capi/ext/symbol_spec.so I, [2024-05-11T15:11:19.227303 #2076912] INFO -- : building spec/ruby/optional/capi/ext/thread_spec.so I, [2024-05-11T15:11:19.228522 #2076912] INFO -- : building spec/ruby/optional/capi/ext/time_spec.so I, [2024-05-11T15:11:19.237453 #2076912] INFO -- : building spec/ruby/optional/capi/ext/tracepoint_spec.so I, [2024-05-11T15:11:19.241997 #2076912] INFO -- : building spec/ruby/optional/capi/ext/typed_data_spec.so I, [2024-05-11T15:11:19.252339 #2076912] INFO -- : building spec/ruby/optional/capi/ext/util_spec.so I, [2024-05-11T15:11:19.260748 #2076912] INFO -- : making enc I, [2024-05-11T15:11:19.261666 #2076912] INFO -- : making srcs under enc I, [2024-05-11T15:11:19.289000 #2076912] INFO -- : make[1]: Entering directory '/tmp/ruby/build/trunk' I, [2024-05-11T15:11:19.289080 #2076912] INFO -- : make[1]: Nothing to be done for 'enc'. I, [2024-05-11T15:11:19.289106 #2076912] INFO -- : make[1]: Leaving directory '/tmp/ruby/build/trunk' I, [2024-05-11T15:11:19.308902 #2076912] INFO -- : make[1]: Entering directory '/tmp/ruby/build/trunk' I, [2024-05-11T15:11:19.308966 #2076912] INFO -- : make[1]: Nothing to be done for 'srcs'. I, [2024-05-11T15:11:19.308979 #2076912] INFO -- : make[1]: Leaving directory '/tmp/ruby/build/trunk' I, [2024-05-11T15:11:19.309673 #2076912] INFO -- : generating transdb.h I, [2024-05-11T15:11:19.422839 #2076912] INFO -- : transdb.h unchanged I, [2024-05-11T15:11:19.423936 #2076912] INFO -- : generating makefiles ext/configure-ext.mk I, [2024-05-11T15:11:19.424111 #2076912] INFO -- : making trans I, [2024-05-11T15:11:19.450205 #2076912] INFO -- : ext/configure-ext.mk updated I, [2024-05-11T15:11:19.452498 #2076912] INFO -- : make[1]: Entering directory '/tmp/ruby/build/trunk' I, [2024-05-11T15:11:19.460702 #2076912] INFO -- : make[1]: Entering directory '/tmp/ruby/build/trunk' I, [2024-05-11T15:11:19.460766 #2076912] INFO -- : make[1]: Nothing to be done for 'trans'. I, [2024-05-11T15:11:19.460777 #2076912] INFO -- : make[1]: Leaving directory '/tmp/ruby/build/trunk' I, [2024-05-11T15:11:19.534721 #2076912] INFO -- : making encs I, [2024-05-11T15:11:19.577240 #2076912] INFO -- : make[1]: Entering directory '/tmp/ruby/build/trunk' I, [2024-05-11T15:11:19.577305 #2076912] INFO -- : make[1]: Nothing to be done for 'encs'. I, [2024-05-11T15:11:19.577314 #2076912] INFO -- : make[1]: Leaving directory '/tmp/ruby/build/trunk' I, [2024-05-11T15:11:19.605777 #2076912] INFO -- : make[1]: Leaving directory '/tmp/ruby/build/trunk' I, [2024-05-11T15:11:19.606666 #2076912] INFO -- : generating makefile exts.mk I, [2024-05-11T15:11:19.643612 #2076912] INFO -- : exts.mk unchanged I, [2024-05-11T15:11:19.647874 #2076912] INFO -- : make[1]: Entering directory '/tmp/ruby/build/trunk' I, [2024-05-11T15:11:19.665972 #2076912] INFO -- : make[2]: Entering directory '/tmp/ruby/build/trunk/ext/digest' I, [2024-05-11T15:11:19.667157 #2076912] INFO -- : make[2]: Entering directory '/tmp/ruby/build/trunk/ext/coverage' I, [2024-05-11T15:11:19.667498 #2076912] INFO -- : make[2]: Entering directory '/tmp/ruby/build/trunk/ext/json' I, [2024-05-11T15:11:19.668123 #2076912] INFO -- : make[2]: Entering directory '/tmp/ruby/build/trunk/ext/date' I, [2024-05-11T15:11:19.668422 #2076912] INFO -- : make[2]: Entering directory '/tmp/ruby/build/trunk/ext/io/console' I, [2024-05-11T15:11:19.668465 #2076912] INFO -- : make[2]: Entering directory '/tmp/ruby/build/trunk/ext/rubyvm' I, [2024-05-11T15:11:19.669354 #2076912] INFO -- : make[2]: Entering directory '/tmp/ruby/build/trunk/ext/monitor' I, [2024-05-11T15:11:19.669783 #2076912] INFO -- : make[2]: Entering directory '/tmp/ruby/build/trunk/ext/pathname' I, [2024-05-11T15:11:19.670248 #2076912] INFO -- : make[2]: Entering directory '/tmp/ruby/build/trunk/ext/fiddle' I, [2024-05-11T15:11:19.670273 #2076912] INFO -- : make[2]: Entering directory '/tmp/ruby/build/trunk/ext/pty' I, [2024-05-11T15:11:19.670841 #2076912] INFO -- : make[2]: Leaving directory '/tmp/ruby/build/trunk/ext/coverage' I, [2024-05-11T15:11:19.671308 #2076912] INFO -- : make[2]: Leaving directory '/tmp/ruby/build/trunk/ext/io/console' I, [2024-05-11T15:11:19.671590 #2076912] INFO -- : make[2]: Entering directory '/tmp/ruby/build/trunk/ext/objspace' I, [2024-05-11T15:11:19.671975 #2076912] INFO -- : make[2]: Leaving directory '/tmp/ruby/build/trunk/ext/monitor' I, [2024-05-11T15:11:19.672180 #2076912] INFO -- : make[2]: Entering directory '/tmp/ruby/build/trunk/ext/psych' I, [2024-05-11T15:11:19.672398 #2076912] INFO -- : make[2]: Leaving directory '/tmp/ruby/build/trunk/ext/date' I, [2024-05-11T15:11:19.672430 #2076912] INFO -- : make[2]: Leaving directory '/tmp/ruby/build/trunk/ext/pathname' I, [2024-05-11T15:11:19.673322 #2076912] INFO -- : make[2]: Leaving directory '/tmp/ruby/build/trunk/ext/digest' I, [2024-05-11T15:11:19.673471 #2076912] INFO -- : make[2]: Leaving directory '/tmp/ruby/build/trunk/ext/pty' I, [2024-05-11T15:11:19.673740 #2076912] INFO -- : make[2]: Entering directory '/tmp/ruby/build/trunk/.bundle/gems/debug-1.9.2/ext/debug' I, [2024-05-11T15:11:19.673798 #2076912] INFO -- : make[2]: Entering directory '/tmp/ruby/build/trunk/.bundle/gems/racc-1.7.3/ext/racc/cparse' I, [2024-05-11T15:11:19.673822 #2076912] INFO -- : make[2]: Entering directory '/tmp/ruby/build/trunk/.bundle/gems/bigdecimal-3.1.8/ext/bigdecimal' I, [2024-05-11T15:11:19.673857 #2076912] INFO -- : make[2]: Entering directory '/tmp/ruby/build/trunk/.bundle/gems/nkf-0.2.0/ext/nkf' I, [2024-05-11T15:11:19.674489 #2076912] INFO -- : make[2]: Entering directory '/tmp/ruby/build/trunk/.bundle/gems/syslog-0.1.2/ext/syslog' I, [2024-05-11T15:11:19.674535 #2076912] INFO -- : make[2]: Entering directory '/tmp/ruby/build/trunk/ext/ripper' I, [2024-05-11T15:11:19.675354 #2076912] INFO -- : make[2]: Entering directory '/tmp/ruby/build/trunk/.bundle/gems/rbs-3.4.4/ext/rbs_extension' I, [2024-05-11T15:11:19.675803 #2076912] INFO -- : make[2]: Leaving directory '/tmp/ruby/build/trunk/ext/objspace' I, [2024-05-11T15:11:19.677011 #2076912] INFO -- : make[2]: Leaving directory '/tmp/ruby/build/trunk/ext/json' I, [2024-05-11T15:11:19.678455 #2076912] INFO -- : make[2]: Entering directory '/tmp/ruby/build/trunk/ext/digest/sha2' I, [2024-05-11T15:11:19.679333 #2076912] INFO -- : make[2]: Entering directory '/tmp/ruby/build/trunk/ext/socket' I, [2024-05-11T15:11:19.679575 #2076912] INFO -- : make[2]: Leaving directory '/tmp/ruby/build/trunk/ext/fiddle' I, [2024-05-11T15:11:19.681310 #2076912] INFO -- : make[2]: Entering directory '/tmp/ruby/build/trunk/ext/openssl' I, [2024-05-11T15:11:19.681752 #2076912] INFO -- : make[2]: Leaving directory '/tmp/ruby/build/trunk/ext/ripper' I, [2024-05-11T15:11:19.681811 #2076912] INFO -- : make[2]: Leaving directory '/tmp/ruby/build/trunk/ext/digest/sha2' I, [2024-05-11T15:11:19.683102 #2076912] INFO -- : make[2]: Leaving directory '/tmp/ruby/build/trunk/ext/psych' I, [2024-05-11T15:11:19.684524 #2076912] INFO -- : make[2]: Leaving directory '/tmp/ruby/build/trunk/ext/rubyvm' I, [2024-05-11T15:11:19.686582 #2076912] INFO -- : make[2]: Leaving directory '/tmp/ruby/build/trunk/ext/socket' I, [2024-05-11T15:11:19.692608 #2076912] INFO -- : make[2]: Leaving directory '/tmp/ruby/build/trunk/ext/openssl' I, [2024-05-11T15:11:19.697856 #2076912] INFO -- : make[2]: Leaving directory '/tmp/ruby/build/trunk/.bundle/gems/racc-1.7.3/ext/racc/cparse' I, [2024-05-11T15:11:19.697899 #2076912] INFO -- : make[2]: Leaving directory '/tmp/ruby/build/trunk/.bundle/gems/syslog-0.1.2/ext/syslog' I, [2024-05-11T15:11:19.699341 #2076912] INFO -- : make[2]: Leaving directory '/tmp/ruby/build/trunk/.bundle/gems/debug-1.9.2/ext/debug' I, [2024-05-11T15:11:19.701378 #2076912] INFO -- : make[2]: Leaving directory '/tmp/ruby/build/trunk/.bundle/gems/bigdecimal-3.1.8/ext/bigdecimal' I, [2024-05-11T15:11:19.706915 #2076912] INFO -- : make[2]: Leaving directory '/tmp/ruby/build/trunk/.bundle/gems/nkf-0.2.0/ext/nkf' I, [2024-05-11T15:11:19.707585 #2076912] INFO -- : make[2]: Leaving directory '/tmp/ruby/build/trunk/.bundle/gems/rbs-3.4.4/ext/rbs_extension' I, [2024-05-11T15:11:19.731360 #2076912] INFO -- : make[2]: Entering directory '/tmp/ruby/build/trunk' I, [2024-05-11T15:11:19.802528 #2076912] INFO -- : linking ruby I, [2024-05-11T15:11:19.825222 #2076912] INFO -- : make[2]: Leaving directory '/tmp/ruby/build/trunk' I, [2024-05-11T15:11:19.825747 #2076912] INFO -- : make[1]: Leaving directory '/tmp/ruby/build/trunk' I, [2024-05-11T15:11:19.829489 #2076912] INFO -- : make[1]: Entering directory '/tmp/ruby/build/trunk' I, [2024-05-11T15:11:19.829510 #2076912] INFO -- : make[1]: Nothing to be done for 'note'. I, [2024-05-11T15:11:19.829516 #2076912] INFO -- : make[1]: Leaving directory '/tmp/ruby/build/trunk' I, [2024-05-11T15:11:19.830273 #2076912] INFO -- : $$$[end] "make all -j20" exit with 0. I, [2024-05-11T15:11:19.830408 #2076912] INFO -- : $$$[beg] make install -j20 I, [2024-05-11T15:11:19.898734 #2076912] INFO -- : Update minitest to ea9caafc0754b1d6236a490d59e624b53209734a I, [2024-05-11T15:11:19.899000 #2076912] INFO -- : Update power_assert to 84e85124c5014a139af39161d484156cfe87a9ed I, [2024-05-11T15:11:19.899911 #2076912] INFO -- : Update rbs to ba7872795d5de04adb8ff500c0e6afdc81a041dd I, [2024-05-11T15:11:19.900113 #2076912] INFO -- : Update typeprof to b19a6416da3a05d57fadd6ffdadb382b6d236ca5 I, [2024-05-11T15:11:19.901630 #2076912] INFO -- : echo ea9caafc0754b1d6236a490d59e624b53209734a | /bin/sh /tmp/ruby/src/trunk/tool/ifchange /tmp/ruby/src/trunk/.bundle/.timestamp/minitest.revision - I, [2024-05-11T15:11:19.901970 #2076912] INFO -- : echo 84e85124c5014a139af39161d484156cfe87a9ed | /bin/sh /tmp/ruby/src/trunk/tool/ifchange /tmp/ruby/src/trunk/.bundle/.timestamp/power_assert.revision - I, [2024-05-11T15:11:19.903500 #2076912] INFO -- : BASERUBY = /usr/bin/ruby --disable=gems I, [2024-05-11T15:11:19.903560 #2076912] INFO -- : CC = gcc I, [2024-05-11T15:11:19.903580 #2076912] INFO -- : LD = ld I, [2024-05-11T15:11:19.903597 #2076912] INFO -- : LDSHARED = gcc -shared I, [2024-05-11T15:11:19.903616 #2076912] INFO -- : CFLAGS = -O3 -fno-fast-math -ggdb3 -Wall -Wextra -Wdeprecated-declarations -Wdiv-by-zero -Wduplicated-cond -Wimplicit-function-declaration -Wimplicit-int -Wpointer-arith -Wwrite-strings -Wold-style-definition -Wimplicit-fallthrough=0 -Wmissing-noreturn -Wno-cast-function-type -Wno-constant-logical-operand -Wno-long-long -Wno-missing-field-initializers -Wno-overlength-strings -Wno-packed-bitfield-compat -Wno-parentheses-equality -Wno-self-assign -Wno-tautological-compare -Wno-unused-parameter -Wno-unused-value -Wsuggest-attribute=format -Wsuggest-attribute=noreturn -Wunused-variable -Wmisleading-indentation -Wundef -fPIC I, [2024-05-11T15:11:19.903634 #2076912] INFO -- : XCFLAGS = -U_FORTIFY_SOURCE -D_FORTIFY_SOURCE=2 -fstack-protector-strong -fno-strict-overflow -fvisibility=hidden -fexcess-precision=standard -DRUBY_EXPORT -I. -I.ext/include/x86_64-linux -I/tmp/ruby/src/trunk/include -I/tmp/ruby/src/trunk -I/tmp/ruby/src/trunk/prism -I/tmp/ruby/src/trunk/enc/unicode/15.0.0 I, [2024-05-11T15:11:19.903649 #2076912] INFO -- : CPPFLAGS = I, [2024-05-11T15:11:19.903664 #2076912] INFO -- : DLDFLAGS = -Wl,--compress-debug-sections=zlib -Wl,-soname,libruby.so.3.4 -fstack-protector-strong I, [2024-05-11T15:11:19.903679 #2076912] INFO -- : SOLIBS = -lz -lrt -lrt -lgmp -ldl -lcrypt -lm -lpthread I, [2024-05-11T15:11:19.903704 #2076912] INFO -- : LANG = en_US.UTF-8 I, [2024-05-11T15:11:19.903725 #2076912] INFO -- : LC_ALL = I, [2024-05-11T15:11:19.903740 #2076912] INFO -- : LC_CTYPE = I, [2024-05-11T15:11:19.903754 #2076912] INFO -- : MFLAGS = -j20 --jobserver-auth=4,5 I, [2024-05-11T15:11:19.903769 #2076912] INFO -- : RUSTC = no I, [2024-05-11T15:11:19.903783 #2076912] INFO -- : YJIT_RUSTC_ARGS = --crate-name=yjit --crate-type=staticlib --edition=2021 -g -C lto=thin -C opt-level=3 -C overflow-checks=on '--out-dir=/tmp/ruby/build/trunk/yjit/target/release/' /tmp/ruby/src/trunk/yjit/src/lib.rs I, [2024-05-11T15:11:19.904664 #2076912] INFO -- : /tmp/ruby/src/trunk/.bundle/.timestamp/minitest.revision unchanged I, [2024-05-11T15:11:19.904918 #2076912] INFO -- : /tmp/ruby/src/trunk/.bundle/.timestamp/power_assert.revision unchanged I, [2024-05-11T15:11:19.935377 #2076912] INFO -- : echo ba7872795d5de04adb8ff500c0e6afdc81a041dd | /bin/sh /tmp/ruby/src/trunk/tool/ifchange /tmp/ruby/src/trunk/.bundle/.timestamp/rbs.revision - I, [2024-05-11T15:11:19.935431 #2076912] INFO -- : echo b19a6416da3a05d57fadd6ffdadb382b6d236ca5 | /bin/sh /tmp/ruby/src/trunk/tool/ifchange /tmp/ruby/src/trunk/.bundle/.timestamp/typeprof.revision - I, [2024-05-11T15:11:19.936220 #2076912] INFO -- : gcc (Ubuntu 11.4.0-1ubuntu1~22.04) 11.4.0 I, [2024-05-11T15:11:19.936267 #2076912] INFO -- : Copyright (C) 2021 Free Software Foundation, Inc. I, [2024-05-11T15:11:19.936290 #2076912] INFO -- : This is free software; see the source for copying conditions. There is NO I, [2024-05-11T15:11:19.936302 #2076912] INFO -- : warranty; not even for MERCHANTABILITY or FITNESS FOR A PARTICULAR PURPOSE. I, [2024-05-11T15:11:19.936313 #2076912] INFO -- : I, [2024-05-11T15:11:19.936323 #2076912] INFO -- : generating enc.mk I, [2024-05-11T15:11:19.937569 #2076912] INFO -- : /tmp/ruby/src/trunk/.bundle/.timestamp/rbs.revision unchanged I, [2024-05-11T15:11:19.937621 #2076912] INFO -- : /tmp/ruby/src/trunk/.bundle/.timestamp/typeprof.revision unchanged I, [2024-05-11T15:11:20.058959 #2076912] INFO -- : Building power_assert@84e85124c5014a139af39161d484156cfe87a9ed to /tmp/ruby/src/trunk/gems/power_assert-2.0.3.gem I, [2024-05-11T15:11:20.059660 #2076912] INFO -- : making srcs under enc I, [2024-05-11T15:11:20.059875 #2076912] INFO -- : making enc I, [2024-05-11T15:11:20.076675 #2076912] INFO -- : make[1]: Entering directory '/tmp/ruby/build/trunk' I, [2024-05-11T15:11:20.076705 #2076912] INFO -- : make[1]: Nothing to be done for 'enc'. I, [2024-05-11T15:11:20.076710 #2076912] INFO -- : make[1]: Leaving directory '/tmp/ruby/build/trunk' I, [2024-05-11T15:11:20.088662 #2076912] INFO -- : make[1]: Entering directory '/tmp/ruby/build/trunk' I, [2024-05-11T15:11:20.088691 #2076912] INFO -- : make[1]: Nothing to be done for 'srcs'. I, [2024-05-11T15:11:20.088705 #2076912] INFO -- : make[1]: Leaving directory '/tmp/ruby/build/trunk' I, [2024-05-11T15:11:20.089492 #2076912] INFO -- : generating transdb.h I, [2024-05-11T15:11:20.127899 #2076912] INFO -- : Successfully built RubyGem I, [2024-05-11T15:11:20.127942 #2076912] INFO -- : Name: power_assert I, [2024-05-11T15:11:20.127948 #2076912] INFO -- : Version: 2.0.4dev I, [2024-05-11T15:11:20.127954 #2076912] INFO -- : File: power_assert-2.0.4dev.gem I, [2024-05-11T15:11:20.130142 #2076912] INFO -- : Extracting bundle gem power_assert-2.0.3... I, [2024-05-11T15:11:20.187127 #2076912] INFO -- : transdb.h unchanged I, [2024-05-11T15:11:20.188655 #2076912] INFO -- : generating makefiles ext/configure-ext.mk I, [2024-05-11T15:11:20.189027 #2076912] INFO -- : making trans I, [2024-05-11T15:11:20.191807 #2076912] INFO -- : Try with hash version of bundled gems instead of gems/power_assert-2.0.3.gem. We don't use this gem with release version of Ruby. I, [2024-05-11T15:11:20.196856 #2076912] INFO -- : Unpacked gems/power_assert-2.0.4dev.gem I, [2024-05-11T15:11:20.215843 #2076912] INFO -- : ext/configure-ext.mk unchanged I, [2024-05-11T15:11:20.218264 #2076912] INFO -- : make[1]: Entering directory '/tmp/ruby/build/trunk' I, [2024-05-11T15:11:20.223151 #2076912] INFO -- : make[1]: Entering directory '/tmp/ruby/build/trunk' I, [2024-05-11T15:11:20.223239 #2076912] INFO -- : make[1]: Nothing to be done for 'trans'. I, [2024-05-11T15:11:20.223248 #2076912] INFO -- : make[1]: Leaving directory '/tmp/ruby/build/trunk' I, [2024-05-11T15:11:20.224125 #2076912] INFO -- : making encs I, [2024-05-11T15:11:20.281650 #2076912] INFO -- : make[1]: Entering directory '/tmp/ruby/build/trunk' I, [2024-05-11T15:11:20.281734 #2076912] INFO -- : make[1]: Nothing to be done for 'encs'. I, [2024-05-11T15:11:20.281767 #2076912] INFO -- : make[1]: Leaving directory '/tmp/ruby/build/trunk' I, [2024-05-11T15:11:20.370666 #2076912] INFO -- : make[1]: Leaving directory '/tmp/ruby/build/trunk' I, [2024-05-11T15:11:20.371373 #2076912] INFO -- : generating makefile exts.mk I, [2024-05-11T15:11:20.408550 #2076912] INFO -- : exts.mk unchanged I, [2024-05-11T15:11:20.413025 #2076912] INFO -- : make[1]: Entering directory '/tmp/ruby/build/trunk' I, [2024-05-11T15:11:20.433013 #2076912] INFO -- : make[2]: Entering directory '/tmp/ruby/build/trunk/ext/digest' I, [2024-05-11T15:11:20.434681 #2076912] INFO -- : make[2]: Entering directory '/tmp/ruby/build/trunk/ext/json' I, [2024-05-11T15:11:20.434796 #2076912] INFO -- : make[2]: Entering directory '/tmp/ruby/build/trunk/ext/coverage' I, [2024-05-11T15:11:20.434840 #2076912] INFO -- : make[2]: Entering directory '/tmp/ruby/build/trunk/ext/io/console' I, [2024-05-11T15:11:20.435269 #2076912] INFO -- : make[2]: Entering directory '/tmp/ruby/build/trunk/ext/date' I, [2024-05-11T15:11:20.436491 #2076912] INFO -- : make[2]: Entering directory '/tmp/ruby/build/trunk/ext/rubyvm' I, [2024-05-11T15:11:20.436559 #2076912] INFO -- : make[2]: Entering directory '/tmp/ruby/build/trunk/ext/monitor' I, [2024-05-11T15:11:20.437550 #2076912] INFO -- : make[2]: Entering directory '/tmp/ruby/build/trunk/ext/pathname' I, [2024-05-11T15:11:20.437807 #2076912] INFO -- : make[2]: Entering directory '/tmp/ruby/build/trunk/ext/fiddle' I, [2024-05-11T15:11:20.437833 #2076912] INFO -- : make[2]: Entering directory '/tmp/ruby/build/trunk/ext/pty' I, [2024-05-11T15:11:20.437897 #2076912] INFO -- : make[2]: Leaving directory '/tmp/ruby/build/trunk/ext/digest' I, [2024-05-11T15:11:20.438127 #2076912] INFO -- : make[2]: Leaving directory '/tmp/ruby/build/trunk/ext/io/console' I, [2024-05-11T15:11:20.438719 #2076912] INFO -- : make[2]: Leaving directory '/tmp/ruby/build/trunk/ext/coverage' I, [2024-05-11T15:11:20.439000 #2076912] INFO -- : make[2]: Leaving directory '/tmp/ruby/build/trunk/ext/rubyvm' I, [2024-05-11T15:11:20.439021 #2076912] INFO -- : make[2]: Entering directory '/tmp/ruby/build/trunk/ext/objspace' I, [2024-05-11T15:11:20.439519 #2076912] INFO -- : make[2]: Leaving directory '/tmp/ruby/build/trunk/ext/date' I, [2024-05-11T15:11:20.439701 #2076912] INFO -- : make[2]: Leaving directory '/tmp/ruby/build/trunk/ext/monitor' I, [2024-05-11T15:11:20.439717 #2076912] INFO -- : make[2]: Entering directory '/tmp/ruby/build/trunk/ext/psych' I, [2024-05-11T15:11:20.440135 #2076912] INFO -- : make[2]: Entering directory '/tmp/ruby/build/trunk/.bundle/gems/bigdecimal-3.1.8/ext/bigdecimal' I, [2024-05-11T15:11:20.440644 #2076912] INFO -- : make[2]: Entering directory '/tmp/ruby/build/trunk/.bundle/gems/debug-1.9.2/ext/debug' I, [2024-05-11T15:11:20.440933 #2076912] INFO -- : make[2]: Leaving directory '/tmp/ruby/build/trunk/ext/pathname' I, [2024-05-11T15:11:20.440965 #2076912] INFO -- : make[2]: Entering directory '/tmp/ruby/build/trunk/.bundle/gems/nkf-0.2.0/ext/nkf' I, [2024-05-11T15:11:20.440980 #2076912] INFO -- : make[2]: Leaving directory '/tmp/ruby/build/trunk/ext/pty' I, [2024-05-11T15:11:20.441570 #2076912] INFO -- : make[2]: Entering directory '/tmp/ruby/build/trunk/.bundle/gems/racc-1.7.3/ext/racc/cparse' I, [2024-05-11T15:11:20.442274 #2076912] INFO -- : make[2]: Entering directory '/tmp/ruby/build/trunk/ext/ripper' I, [2024-05-11T15:11:20.442522 #2076912] INFO -- : make[2]: Entering directory '/tmp/ruby/build/trunk/.bundle/gems/syslog-0.1.2/ext/syslog' I, [2024-05-11T15:11:20.442750 #2076912] INFO -- : make[2]: Entering directory '/tmp/ruby/build/trunk/.bundle/gems/rbs-3.4.4/ext/rbs_extension' I, [2024-05-11T15:11:20.443684 #2076912] INFO -- : make[2]: Leaving directory '/tmp/ruby/build/trunk/ext/objspace' I, [2024-05-11T15:11:20.444132 #2076912] INFO -- : make[2]: Leaving directory '/tmp/ruby/build/trunk/ext/json' I, [2024-05-11T15:11:20.445853 #2076912] INFO -- : make[2]: Entering directory '/tmp/ruby/build/trunk/ext/digest/sha2' I, [2024-05-11T15:11:20.446166 #2076912] INFO -- : make[2]: Leaving directory '/tmp/ruby/build/trunk/ext/fiddle' I, [2024-05-11T15:11:20.446958 #2076912] INFO -- : make[2]: Entering directory '/tmp/ruby/build/trunk/ext/socket' I, [2024-05-11T15:11:20.448201 #2076912] INFO -- : make[2]: Leaving directory '/tmp/ruby/build/trunk/ext/digest/sha2' I, [2024-05-11T15:11:20.449653 #2076912] INFO -- : make[2]: Leaving directory '/tmp/ruby/build/trunk/ext/ripper' I, [2024-05-11T15:11:20.450061 #2076912] INFO -- : make[2]: Leaving directory '/tmp/ruby/build/trunk/ext/psych' I, [2024-05-11T15:11:20.451208 #2076912] INFO -- : make[2]: Entering directory '/tmp/ruby/build/trunk/ext/openssl' I, [2024-05-11T15:11:20.452926 #2076912] INFO -- : make[2]: Leaving directory '/tmp/ruby/build/trunk/ext/socket' I, [2024-05-11T15:11:20.462533 #2076912] INFO -- : make[2]: Leaving directory '/tmp/ruby/build/trunk/ext/openssl' I, [2024-05-11T15:11:20.464056 #2076912] INFO -- : make[2]: Leaving directory '/tmp/ruby/build/trunk/.bundle/gems/debug-1.9.2/ext/debug' I, [2024-05-11T15:11:20.464776 #2076912] INFO -- : make[2]: Leaving directory '/tmp/ruby/build/trunk/.bundle/gems/racc-1.7.3/ext/racc/cparse' I, [2024-05-11T15:11:20.470186 #2076912] INFO -- : make[2]: Leaving directory '/tmp/ruby/build/trunk/.bundle/gems/bigdecimal-3.1.8/ext/bigdecimal' I, [2024-05-11T15:11:20.473461 #2076912] INFO -- : make[2]: Leaving directory '/tmp/ruby/build/trunk/.bundle/gems/nkf-0.2.0/ext/nkf' I, [2024-05-11T15:11:20.479858 #2076912] INFO -- : make[2]: Leaving directory '/tmp/ruby/build/trunk/.bundle/gems/syslog-0.1.2/ext/syslog' I, [2024-05-11T15:11:20.479885 #2076912] INFO -- : make[2]: Leaving directory '/tmp/ruby/build/trunk/.bundle/gems/rbs-3.4.4/ext/rbs_extension' I, [2024-05-11T15:11:20.504666 #2076912] INFO -- : make[2]: Entering directory '/tmp/ruby/build/trunk' I, [2024-05-11T15:11:20.571979 #2076912] INFO -- : make[2]: 'ruby' is up to date. I, [2024-05-11T15:11:20.572012 #2076912] INFO -- : make[2]: Leaving directory '/tmp/ruby/build/trunk' I, [2024-05-11T15:11:20.572288 #2076912] INFO -- : make[1]: Leaving directory '/tmp/ruby/build/trunk' I, [2024-05-11T15:11:20.576001 #2076912] INFO -- : make[1]: Entering directory '/tmp/ruby/build/trunk' I, [2024-05-11T15:11:20.576023 #2076912] INFO -- : make[1]: Nothing to be done for 'note'. I, [2024-05-11T15:11:20.576028 #2076912] INFO -- : make[1]: Leaving directory '/tmp/ruby/build/trunk' I, [2024-05-11T15:11:20.576266 #2076912] INFO -- : ./miniruby -I/tmp/ruby/src/trunk/lib -I. -I.ext/common /tmp/ruby/src/trunk/tool/runruby.rb --extout=.ext -- --disable-gems -r./x86_64-linux-fake /tmp/ruby/src/trunk/tool/rbinstall.rb --make="make" --dest-dir="" --extout=".ext" --ext-build-dir="./ext" --mflags="-j20 --jobserver-auth=4,5" --make-flags=" -j20 --jobserver-auth=4,5" --data-mode=0644 --prog-mode=0755 --installed-list .installed.list --mantype="doc" --gnumake --install=all --exclude=doc I, [2024-05-11T15:11:20.671839 #2076912] INFO -- : Installing to I, [2024-05-11T15:11:20.671898 #2076912] INFO -- : installing binary commands: /tmp/ruby/install/trunk/bin I, [2024-05-11T15:11:20.672079 #2076912] INFO -- : installing base libraries: /tmp/ruby/install/trunk/lib I, [2024-05-11T15:11:20.679405 #2076912] INFO -- : installing arch files: /tmp/ruby/install/trunk/lib/ruby/3.4.0+0/x86_64-linux I, [2024-05-11T15:11:20.679433 #2076912] INFO -- : installing pkgconfig data: /tmp/ruby/install/trunk/lib/pkgconfig I, [2024-05-11T15:11:20.679446 #2076912] INFO -- : installing extension objects: /tmp/ruby/install/trunk/lib/ruby/3.4.0+0/x86_64-linux I, [2024-05-11T15:11:20.688843 #2076912] INFO -- : installing extension objects: /tmp/ruby/install/trunk/lib/ruby/site_ruby/3.4.0+0/x86_64-linux I, [2024-05-11T15:11:20.688866 #2076912] INFO -- : installing extension objects: /tmp/ruby/install/trunk/lib/ruby/vendor_ruby/3.4.0+0/x86_64-linux I, [2024-05-11T15:11:20.688873 #2076912] INFO -- : installing extension headers: /tmp/ruby/install/trunk/include/ruby-3.4.0+0/x86_64-linux I, [2024-05-11T15:11:20.689035 #2076912] INFO -- : installing extension scripts: /tmp/ruby/install/trunk/lib/ruby/3.4.0+0 I, [2024-05-11T15:11:20.692838 #2076912] INFO -- : installing extension scripts: /tmp/ruby/install/trunk/lib/ruby/site_ruby/3.4.0+0 I, [2024-05-11T15:11:20.692862 #2076912] INFO -- : installing extension scripts: /tmp/ruby/install/trunk/lib/ruby/vendor_ruby/3.4.0+0 I, [2024-05-11T15:11:20.692868 #2076912] INFO -- : installing extension headers: /tmp/ruby/install/trunk/include/ruby-3.4.0+0/ruby I, [2024-05-11T15:11:20.692872 #2076912] INFO -- : installing command scripts: /tmp/ruby/install/trunk/bin I, [2024-05-11T15:11:20.692876 #2076912] INFO -- : installing library scripts: /tmp/ruby/install/trunk/lib/ruby/3.4.0+0 I, [2024-05-11T15:11:20.726162 #2076912] INFO -- : installing common headers: /tmp/ruby/install/trunk/include/ruby-3.4.0+0 I, [2024-05-11T15:11:20.731438 #2076912] INFO -- : installing manpages: /tmp/ruby/install/trunk/share/man/man1 I, [2024-05-11T15:11:20.731463 #2076912] INFO -- : installing default gems from lib: /tmp/ruby/install/trunk/lib/ruby/gems/3.4.0+0 I, [2024-05-11T15:11:20.753887 #2076912] INFO -- : benchmark 0.3.0 I, [2024-05-11T15:11:20.760723 #2076912] INFO -- : bundler 2.6.0.dev I, [2024-05-11T15:11:20.762790 #2076912] INFO -- : cgi 0.4.1 I, [2024-05-11T15:11:20.763324 #2076912] INFO -- : delegate 0.3.1 I, [2024-05-11T15:11:20.763836 #2076912] INFO -- : did_you_mean 1.6.3 I, [2024-05-11T15:11:20.764330 #2076912] INFO -- : english 0.8.0 I, [2024-05-11T15:11:20.764785 #2076912] INFO -- : erb 4.0.4 I, [2024-05-11T15:11:20.765479 #2076912] INFO -- : error_highlight 0.6.0 I, [2024-05-11T15:11:20.765959 #2076912] INFO -- : fileutils 1.7.2 I, [2024-05-11T15:11:20.766416 #2076912] INFO -- : find 0.2.0 I, [2024-05-11T15:11:20.766796 #2076912] INFO -- : forwardable 1.3.3 I, [2024-05-11T15:11:20.767223 #2076912] INFO -- : ipaddr 1.2.6 I, [2024-05-11T15:11:20.767755 #2076912] INFO -- : irb 1.13.1 I, [2024-05-11T15:11:20.769193 #2076912] INFO -- : logger 1.6.0 I, [2024-05-11T15:11:20.769695 #2076912] INFO -- : net-http 0.4.1 I, [2024-05-11T15:11:20.770198 #2076912] INFO -- : net-protocol 0.2.2 I, [2024-05-11T15:11:20.770688 #2076912] INFO -- : open-uri 0.4.1 I, [2024-05-11T15:11:20.771200 #2076912] INFO -- : open3 0.2.1 I, [2024-05-11T15:11:20.771677 #2076912] INFO -- : optparse 0.5.0 I, [2024-05-11T15:11:20.772132 #2076912] INFO -- : ostruct 0.6.0 I, [2024-05-11T15:11:20.772625 #2076912] INFO -- : pp 0.5.0 I, [2024-05-11T15:11:20.773190 #2076912] INFO -- : prettyprint 0.2.0 I, [2024-05-11T15:11:20.773635 #2076912] INFO -- : prism 0.29.0 I, [2024-05-11T15:11:20.774124 #2076912] INFO -- : pstore 0.1.3 I, [2024-05-11T15:11:20.774575 #2076912] INFO -- : rdoc 6.6.3.1 I, [2024-05-11T15:11:20.776157 #2076912] INFO -- : readline 0.0.4 I, [2024-05-11T15:11:20.776662 #2076912] INFO -- : reline 0.5.6 I, [2024-05-11T15:11:20.777173 #2076912] INFO -- : resolv 0.4.0 I, [2024-05-11T15:11:20.777570 #2076912] INFO -- : ruby2_keywords 0.0.5 I, [2024-05-11T15:11:20.778027 #2076912] INFO -- : securerandom 0.3.1 I, [2024-05-11T15:11:20.778583 #2076912] INFO -- : set 1.1.0 I, [2024-05-11T15:11:20.779095 #2076912] INFO -- : shellwords 0.2.0 I, [2024-05-11T15:11:20.779570 #2076912] INFO -- : singleton 0.2.0 I, [2024-05-11T15:11:20.780033 #2076912] INFO -- : syntax_suggest 2.0.0 I, [2024-05-11T15:11:20.780733 #2076912] INFO -- : tempfile 0.2.1 I, [2024-05-11T15:11:20.781216 #2076912] INFO -- : time 0.3.0 I, [2024-05-11T15:11:20.781703 #2076912] INFO -- : timeout 0.4.1 I, [2024-05-11T15:11:20.782720 #2076912] INFO -- : tmpdir 0.2.0 I, [2024-05-11T15:11:20.783249 #2076912] INFO -- : tsort 0.2.0 I, [2024-05-11T15:11:20.783724 #2076912] INFO -- : un 0.3.0 I, [2024-05-11T15:11:20.784194 #2076912] INFO -- : uri 0.13.0 I, [2024-05-11T15:11:20.784687 #2076912] INFO -- : weakref 0.1.3 I, [2024-05-11T15:11:20.785169 #2076912] INFO -- : yaml 0.3.0 I, [2024-05-11T15:11:20.785444 #2076912] INFO -- : installing default gems from ext: /tmp/ruby/install/trunk/lib/ruby/gems/3.4.0+0 I, [2024-05-11T15:11:20.791919 #2076912] INFO -- : date 3.3.4 I, [2024-05-11T15:11:20.792451 #2076912] INFO -- : digest 3.1.1 I, [2024-05-11T15:11:20.793015 #2076912] INFO -- : etc 1.4.3 I, [2024-05-11T15:11:20.793517 #2076912] INFO -- : fcntl 1.1.0 I, [2024-05-11T15:11:20.793978 #2076912] INFO -- : fiddle 1.1.3 I, [2024-05-11T15:11:20.794452 #2076912] INFO -- : io-console 0.7.2 I, [2024-05-11T15:11:20.794923 #2076912] INFO -- : io-nonblock 0.3.0 I, [2024-05-11T15:11:20.795317 #2076912] INFO -- : io-wait 0.3.1 I, [2024-05-11T15:11:20.795836 #2076912] INFO -- : json 2.7.2 I, [2024-05-11T15:11:20.797063 #2076912] INFO -- : openssl 3.2.0 I, [2024-05-11T15:11:20.797611 #2076912] INFO -- : pathname 0.3.0 I, [2024-05-11T15:11:20.798099 #2076912] INFO -- : psych 5.1.2 I, [2024-05-11T15:11:20.798651 #2076912] INFO -- : stringio 3.1.1 I, [2024-05-11T15:11:20.799133 #2076912] INFO -- : strscan 3.1.1 I, [2024-05-11T15:11:20.799594 #2076912] INFO -- : zlib 3.1.0 I, [2024-05-11T15:11:20.799947 #2076912] INFO -- : installing bundled gems: /tmp/ruby/install/trunk/lib/ruby/gems/3.4.0+0 I, [2024-05-11T15:11:20.800295 #2076912] INFO -- : minitest 5.22.3 I, [2024-05-11T15:11:20.807613 #2076912] INFO -- : rake 13.2.1 I, [2024-05-11T15:11:20.810854 #2076912] INFO -- : test-unit 3.6.2 I, [2024-05-11T15:11:20.815202 #2076912] INFO -- : rexml 3.2.6 I, [2024-05-11T15:11:20.818518 #2076912] INFO -- : rss 0.3.0 I, [2024-05-11T15:11:20.821497 #2076912] INFO -- : net-ftp 0.3.4 I, [2024-05-11T15:11:20.822961 #2076912] INFO -- : net-imap 0.4.11 I, [2024-05-11T15:11:20.825789 #2076912] INFO -- : net-pop 0.1.2 I, [2024-05-11T15:11:20.826682 #2076912] INFO -- : net-smtp 0.5.0 I, [2024-05-11T15:11:20.827732 #2076912] INFO -- : matrix 0.4.2 I, [2024-05-11T15:11:20.831294 #2076912] INFO -- : prime 0.1.2 I, [2024-05-11T15:11:20.836801 #2076912] INFO -- : rbs 3.4.4 I, [2024-05-11T15:11:20.858543 #2076912] INFO -- : typeprof 0.21.11 I, [2024-05-11T15:11:20.861434 #2076912] INFO -- : debug 1.9.2 I, [2024-05-11T15:11:20.864079 #2076912] INFO -- : racc 1.7.3 I, [2024-05-11T15:11:20.866490 #2076912] INFO -- : mutex_m 0.2.0 I, [2024-05-11T15:11:20.867660 #2076912] INFO -- : getoptlong 0.2.1 I, [2024-05-11T15:11:20.869138 #2076912] INFO -- : base64 0.2.0 I, [2024-05-11T15:11:20.870123 #2076912] INFO -- : bigdecimal 3.1.8 I, [2024-05-11T15:11:20.872067 #2076912] INFO -- : observer 0.1.2 I, [2024-05-11T15:11:20.873128 #2076912] INFO -- : abbrev 0.1.2 I, [2024-05-11T15:11:20.874542 #2076912] INFO -- : resolv-replace 0.1.1 I, [2024-05-11T15:11:20.875661 #2076912] INFO -- : rinda 0.2.0 I, [2024-05-11T15:11:20.877209 #2076912] INFO -- : drb 2.2.1 I, [2024-05-11T15:11:20.878663 #2076912] INFO -- : nkf 0.2.0 I, [2024-05-11T15:11:20.881196 #2076912] INFO -- : syslog 0.1.2 I, [2024-05-11T15:11:20.882713 #2076912] INFO -- : csv 3.3.0 I, [2024-05-11T15:11:20.884874 #2076912] INFO -- : installing bundled gem cache: /tmp/ruby/install/trunk/lib/ruby/gems/3.4.0+0/cache I, [2024-05-11T15:11:20.886237 #2076912] INFO -- : skipped bundled gems: I, [2024-05-11T15:11:20.886258 #2076912] INFO -- : power_assert-2.0.4dev.gem not found in bundled_gems I, [2024-05-11T15:11:20.889335 #2076912] INFO -- : $$$[end] "make install -j20" exit with 0. I, [2024-05-11T15:11:20.889448 #2076912] INFO -- : $$$[beg] make yes-btest TESTOPTS='-q -j20' I, [2024-05-11T15:11:26.912502 #2076912] INFO -- : PASS all 1936 tests E, [2024-05-11T15:11:26.917626 #2076912] ERROR -- : I, [2024-05-11T15:11:26.917851 #2076912] INFO -- : $$$[end] "make yes-btest TESTOPTS='-q -j20'" exit with 0. I, [2024-05-11T15:11:26.917941 #2076912] INFO -- : $$$[beg] make yes-test-basic TESTS='-j20' I, [2024-05-11T15:11:26.978278 #2076912] INFO -- : BASERUBY = /usr/bin/ruby --disable=gems I, [2024-05-11T15:11:26.978307 #2076912] INFO -- : CC = gcc I, [2024-05-11T15:11:26.978313 #2076912] INFO -- : LD = ld I, [2024-05-11T15:11:26.978317 #2076912] INFO -- : LDSHARED = gcc -shared I, [2024-05-11T15:11:26.978321 #2076912] INFO -- : CFLAGS = -O3 -fno-fast-math -ggdb3 -Wall -Wextra -Wdeprecated-declarations -Wdiv-by-zero -Wduplicated-cond -Wimplicit-function-declaration -Wimplicit-int -Wpointer-arith -Wwrite-strings -Wold-style-definition -Wimplicit-fallthrough=0 -Wmissing-noreturn -Wno-cast-function-type -Wno-constant-logical-operand -Wno-long-long -Wno-missing-field-initializers -Wno-overlength-strings -Wno-packed-bitfield-compat -Wno-parentheses-equality -Wno-self-assign -Wno-tautological-compare -Wno-unused-parameter -Wno-unused-value -Wsuggest-attribute=format -Wsuggest-attribute=noreturn -Wunused-variable -Wmisleading-indentation -Wundef -fPIC I, [2024-05-11T15:11:26.978329 #2076912] INFO -- : XCFLAGS = -U_FORTIFY_SOURCE -D_FORTIFY_SOURCE=2 -fstack-protector-strong -fno-strict-overflow -fvisibility=hidden -fexcess-precision=standard -DRUBY_EXPORT -I. -I.ext/include/x86_64-linux -I/tmp/ruby/src/trunk/include -I/tmp/ruby/src/trunk -I/tmp/ruby/src/trunk/prism -I/tmp/ruby/src/trunk/enc/unicode/15.0.0 I, [2024-05-11T15:11:26.978333 #2076912] INFO -- : CPPFLAGS = I, [2024-05-11T15:11:26.978337 #2076912] INFO -- : DLDFLAGS = -Wl,--compress-debug-sections=zlib -Wl,-soname,libruby.so.3.4 -fstack-protector-strong I, [2024-05-11T15:11:26.978341 #2076912] INFO -- : SOLIBS = -lz -lrt -lrt -lgmp -ldl -lcrypt -lm -lpthread I, [2024-05-11T15:11:26.978345 #2076912] INFO -- : LANG = en_US.UTF-8 I, [2024-05-11T15:11:26.978348 #2076912] INFO -- : LC_ALL = I, [2024-05-11T15:11:26.978352 #2076912] INFO -- : LC_CTYPE = I, [2024-05-11T15:11:26.978355 #2076912] INFO -- : MFLAGS = I, [2024-05-11T15:11:26.978359 #2076912] INFO -- : RUSTC = no I, [2024-05-11T15:11:26.978363 #2076912] INFO -- : YJIT_RUSTC_ARGS = --crate-name=yjit --crate-type=staticlib --edition=2021 -g -C lto=thin -C opt-level=3 -C overflow-checks=on '--out-dir=/tmp/ruby/build/trunk/yjit/target/release/' /tmp/ruby/src/trunk/yjit/src/lib.rs I, [2024-05-11T15:11:26.978910 #2076912] INFO -- : gcc (Ubuntu 11.4.0-1ubuntu1~22.04) 11.4.0 I, [2024-05-11T15:11:26.978936 #2076912] INFO -- : Copyright (C) 2021 Free Software Foundation, Inc. I, [2024-05-11T15:11:26.978942 #2076912] INFO -- : This is free software; see the source for copying conditions. There is NO I, [2024-05-11T15:11:26.978947 #2076912] INFO -- : warranty; not even for MERCHANTABILITY or FITNESS FOR A PARTICULAR PURPOSE. I, [2024-05-11T15:11:26.978956 #2076912] INFO -- : I, [2024-05-11T15:11:27.086465 #2076912] INFO -- : Checking leaked global symbols...none I, [2024-05-11T15:11:27.127961 #2076912] INFO -- : /tmp/ruby/src/trunk/basictest/test.rb:assignment ....................................................................................................................................................................................................................................................................................................................................................................................OK 372 I, [2024-05-11T15:11:27.128018 #2076912] INFO -- : /tmp/ruby/src/trunk/basictest/test.rb:condition ..OK 2 I, [2024-05-11T15:11:27.128025 #2076912] INFO -- : /tmp/ruby/src/trunk/basictest/test.rb:if/unless ...OK 3 I, [2024-05-11T15:11:27.128030 #2076912] INFO -- : /tmp/ruby/src/trunk/basictest/test.rb:case .....OK 5 I, [2024-05-11T15:11:27.128284 #2076912] INFO -- : /tmp/ruby/src/trunk/basictest/test.rb:while/until ........OK 8 I, [2024-05-11T15:11:27.128350 #2076912] INFO -- : /tmp/ruby/src/trunk/basictest/test.rb:exception ..........OK 10 I, [2024-05-11T15:11:27.128640 #2076912] INFO -- : /tmp/ruby/src/trunk/basictest/test.rb:array .......................................OK 39 I, [2024-05-11T15:11:27.128749 #2076912] INFO -- : /tmp/ruby/src/trunk/basictest/test.rb:hash ...........................OK 27 I, [2024-05-11T15:11:27.129491 #2076912] INFO -- : /tmp/ruby/src/trunk/basictest/test.rb:iterator ...........................................................................................................OK 107 I, [2024-05-11T15:11:27.129776 #2076912] INFO -- : /tmp/ruby/src/trunk/basictest/test.rb:float ................................................................................OK 80 I, [2024-05-11T15:11:27.130810 #2076912] INFO -- : /tmp/ruby/src/trunk/basictest/test.rb:bignum ...............................OK 31 I, [2024-05-11T15:11:27.131612 #2076912] INFO -- : /tmp/ruby/src/trunk/basictest/test.rb:string & char ..............................................................OK 62 I, [2024-05-11T15:11:27.131646 #2076912] INFO -- : /tmp/ruby/src/trunk/basictest/test.rb:assignment ..........OK 10 I, [2024-05-11T15:11:27.131675 #2076912] INFO -- : /tmp/ruby/src/trunk/basictest/test.rb:call ......OK 6 I, [2024-05-11T15:11:27.131735 #2076912] INFO -- : /tmp/ruby/src/trunk/basictest/test.rb:proc .........OK 9 I, [2024-05-11T15:11:27.232424 #2076912] INFO -- : /tmp/ruby/src/trunk/basictest/test.rb:signal ..OK 2 I, [2024-05-11T15:11:27.235315 #2076912] INFO -- : /tmp/ruby/src/trunk/basictest/test.rb:eval ...........................OK 27 I, [2024-05-11T15:11:27.354281 #2076912] INFO -- : /tmp/ruby/src/trunk/basictest/test.rb:system ........OK 8 I, [2024-05-11T15:11:27.354344 #2076912] INFO -- : /tmp/ruby/src/trunk/basictest/test.rb:const .....OK 5 I, [2024-05-11T15:11:27.354353 #2076912] INFO -- : /tmp/ruby/src/trunk/basictest/test.rb:clone .....OK 5 I, [2024-05-11T15:11:27.354458 #2076912] INFO -- : /tmp/ruby/src/trunk/basictest/test.rb:marshal ....OK 4 I, [2024-05-11T15:11:27.354576 #2076912] INFO -- : /tmp/ruby/src/trunk/basictest/test.rb:pack ....OK 4 I, [2024-05-11T15:11:27.354599 #2076912] INFO -- : /tmp/ruby/src/trunk/basictest/test.rb:math ..OK 2 I, [2024-05-11T15:11:27.354607 #2076912] INFO -- : /tmp/ruby/src/trunk/basictest/test.rb:struct ......OK 6 I, [2024-05-11T15:11:27.354715 #2076912] INFO -- : /tmp/ruby/src/trunk/basictest/test.rb:variable ............OK 12 I, [2024-05-11T15:11:27.354746 #2076912] INFO -- : /tmp/ruby/src/trunk/basictest/test.rb:trace ...OK 3 I, [2024-05-11T15:11:27.354850 #2076912] INFO -- : /tmp/ruby/src/trunk/basictest/test.rb:defined? ............OK 12 I, [2024-05-11T15:11:27.354873 #2076912] INFO -- : /tmp/ruby/src/trunk/basictest/test.rb:alias ......OK 6 I, [2024-05-11T15:11:27.355243 #2076912] INFO -- : /tmp/ruby/src/trunk/basictest/test.rb:path .......................OK 23 I, [2024-05-11T15:11:27.389094 #2076912] INFO -- : /tmp/ruby/src/trunk/basictest/test.rb:gc ....OK 4 I, [2024-05-11T15:11:27.391534 #2076912] INFO -- : I, [2024-05-11T15:11:27.391562 #2076912] INFO -- : test succeeded I, [2024-05-11T15:11:27.393087 #2076912] INFO -- : $$$[end] "make yes-test-basic TESTS='-j20'" exit with 0. I, [2024-05-11T15:11:27.393183 #2076912] INFO -- : $$$[beg] make yes-test-all TESTOPTS='--stderr-on-failure' TESTS='-j20' I, [2024-05-11T15:11:27.480795 #2076912] INFO -- : BASERUBY = /usr/bin/ruby --disable=gems I, [2024-05-11T15:11:27.480838 #2076912] INFO -- : CC = gcc I, [2024-05-11T15:11:27.480845 #2076912] INFO -- : LD = ld I, [2024-05-11T15:11:27.480850 #2076912] INFO -- : LDSHARED = gcc -shared I, [2024-05-11T15:11:27.480854 #2076912] INFO -- : CFLAGS = -O3 -fno-fast-math -ggdb3 -Wall -Wextra -Wdeprecated-declarations -Wdiv-by-zero -Wduplicated-cond -Wimplicit-function-declaration -Wimplicit-int -Wpointer-arith -Wwrite-strings -Wold-style-definition -Wimplicit-fallthrough=0 -Wmissing-noreturn -Wno-cast-function-type -Wno-constant-logical-operand -Wno-long-long -Wno-missing-field-initializers -Wno-overlength-strings -Wno-packed-bitfield-compat -Wno-parentheses-equality -Wno-self-assign -Wno-tautological-compare -Wno-unused-parameter -Wno-unused-value -Wsuggest-attribute=format -Wsuggest-attribute=noreturn -Wunused-variable -Wmisleading-indentation -Wundef -fPIC I, [2024-05-11T15:11:27.480860 #2076912] INFO -- : XCFLAGS = -U_FORTIFY_SOURCE -D_FORTIFY_SOURCE=2 -fstack-protector-strong -fno-strict-overflow -fvisibility=hidden -fexcess-precision=standard -DRUBY_EXPORT -I. -I.ext/include/x86_64-linux -I/tmp/ruby/src/trunk/include -I/tmp/ruby/src/trunk -I/tmp/ruby/src/trunk/prism -I/tmp/ruby/src/trunk/enc/unicode/15.0.0 I, [2024-05-11T15:11:27.480863 #2076912] INFO -- : CPPFLAGS = I, [2024-05-11T15:11:27.480867 #2076912] INFO -- : DLDFLAGS = -Wl,--compress-debug-sections=zlib -Wl,-soname,libruby.so.3.4 -fstack-protector-strong I, [2024-05-11T15:11:27.480871 #2076912] INFO -- : SOLIBS = -lz -lrt -lrt -lgmp -ldl -lcrypt -lm -lpthread I, [2024-05-11T15:11:27.480874 #2076912] INFO -- : LANG = en_US.UTF-8 I, [2024-05-11T15:11:27.480877 #2076912] INFO -- : LC_ALL = I, [2024-05-11T15:11:27.480881 #2076912] INFO -- : LC_CTYPE = I, [2024-05-11T15:11:27.480884 #2076912] INFO -- : MFLAGS = I, [2024-05-11T15:11:27.480889 #2076912] INFO -- : RUSTC = no I, [2024-05-11T15:11:27.480893 #2076912] INFO -- : YJIT_RUSTC_ARGS = --crate-name=yjit --crate-type=staticlib --edition=2021 -g -C lto=thin -C opt-level=3 -C overflow-checks=on '--out-dir=/tmp/ruby/build/trunk/yjit/target/release/' /tmp/ruby/src/trunk/yjit/src/lib.rs I, [2024-05-11T15:11:27.481545 #2076912] INFO -- : gcc (Ubuntu 11.4.0-1ubuntu1~22.04) 11.4.0 I, [2024-05-11T15:11:27.481565 #2076912] INFO -- : Copyright (C) 2021 Free Software Foundation, Inc. I, [2024-05-11T15:11:27.481571 #2076912] INFO -- : This is free software; see the source for copying conditions. There is NO I, [2024-05-11T15:11:27.481575 #2076912] INFO -- : warranty; not even for MERCHANTABILITY or FITNESS FOR A PARTICULAR PURPOSE. I, [2024-05-11T15:11:27.481579 #2076912] INFO -- : I, [2024-05-11T15:11:27.483242 #2076912] INFO -- : generating enc.mk I, [2024-05-11T15:11:27.600399 #2076912] INFO -- : making enc I, [2024-05-11T15:11:27.617468 #2076912] INFO -- : make[1]: Entering directory '/tmp/ruby/build/trunk' I, [2024-05-11T15:11:27.617490 #2076912] INFO -- : make[1]: Nothing to be done for 'enc'. I, [2024-05-11T15:11:27.617496 #2076912] INFO -- : make[1]: Leaving directory '/tmp/ruby/build/trunk' I, [2024-05-11T15:11:27.618058 #2076912] INFO -- : making srcs under enc I, [2024-05-11T15:11:27.648632 #2076912] INFO -- : make[1]: Entering directory '/tmp/ruby/build/trunk' I, [2024-05-11T15:11:27.648655 #2076912] INFO -- : make[1]: Nothing to be done for 'srcs'. I, [2024-05-11T15:11:27.648660 #2076912] INFO -- : make[1]: Leaving directory '/tmp/ruby/build/trunk' I, [2024-05-11T15:11:27.649619 #2076912] INFO -- : generating transdb.h I, [2024-05-11T15:11:27.748120 #2076912] INFO -- : transdb.h unchanged I, [2024-05-11T15:11:27.749507 #2076912] INFO -- : making trans I, [2024-05-11T15:11:27.783732 #2076912] INFO -- : make[1]: Entering directory '/tmp/ruby/build/trunk' I, [2024-05-11T15:11:27.783756 #2076912] INFO -- : make[1]: Nothing to be done for 'trans'. I, [2024-05-11T15:11:27.783762 #2076912] INFO -- : make[1]: Leaving directory '/tmp/ruby/build/trunk' I, [2024-05-11T15:11:27.784324 #2076912] INFO -- : making encs I, [2024-05-11T15:11:27.822223 #2076912] INFO -- : make[1]: Entering directory '/tmp/ruby/build/trunk' I, [2024-05-11T15:11:27.822245 #2076912] INFO -- : make[1]: Nothing to be done for 'encs'. I, [2024-05-11T15:11:27.822250 #2076912] INFO -- : make[1]: Leaving directory '/tmp/ruby/build/trunk' I, [2024-05-11T15:11:27.824278 #2076912] INFO -- : generating makefiles ext/configure-ext.mk I, [2024-05-11T15:11:27.850989 #2076912] INFO -- : ext/configure-ext.mk updated I, [2024-05-11T15:11:27.853814 #2076912] INFO -- : make[1]: Entering directory '/tmp/ruby/build/trunk' I, [2024-05-11T15:11:29.201485 #2076912] INFO -- : make[1]: Leaving directory '/tmp/ruby/build/trunk' I, [2024-05-11T15:11:29.202262 #2076912] INFO -- : generating makefile exts.mk I, [2024-05-11T15:11:29.238881 #2076912] INFO -- : exts.mk unchanged I, [2024-05-11T15:11:29.243396 #2076912] INFO -- : make[1]: Entering directory '/tmp/ruby/build/trunk' I, [2024-05-11T15:11:29.551920 #2076912] INFO -- : make[2]: Entering directory '/tmp/ruby/build/trunk/ext/coverage' I, [2024-05-11T15:11:29.556475 #2076912] INFO -- : make[2]: Leaving directory '/tmp/ruby/build/trunk/ext/coverage' I, [2024-05-11T15:11:29.563071 #2076912] INFO -- : make[2]: Entering directory '/tmp/ruby/build/trunk/ext/date' I, [2024-05-11T15:11:29.568064 #2076912] INFO -- : make[2]: Leaving directory '/tmp/ruby/build/trunk/ext/date' I, [2024-05-11T15:11:29.571923 #2076912] INFO -- : make[2]: Entering directory '/tmp/ruby/build/trunk/ext/digest' I, [2024-05-11T15:11:29.580724 #2076912] INFO -- : make[2]: Leaving directory '/tmp/ruby/build/trunk/ext/digest' I, [2024-05-11T15:11:29.606957 #2076912] INFO -- : make[2]: Entering directory '/tmp/ruby/build/trunk/ext/digest/sha2' I, [2024-05-11T15:11:29.611822 #2076912] INFO -- : make[2]: Leaving directory '/tmp/ruby/build/trunk/ext/digest/sha2' I, [2024-05-11T15:11:29.633045 #2076912] INFO -- : make[2]: Entering directory '/tmp/ruby/build/trunk/ext/fiddle' I, [2024-05-11T15:11:29.643629 #2076912] INFO -- : make[2]: Leaving directory '/tmp/ruby/build/trunk/ext/fiddle' I, [2024-05-11T15:11:29.648424 #2076912] INFO -- : make[2]: Entering directory '/tmp/ruby/build/trunk/ext/io/console' I, [2024-05-11T15:11:29.652005 #2076912] INFO -- : make[2]: Leaving directory '/tmp/ruby/build/trunk/ext/io/console' I, [2024-05-11T15:11:29.662748 #2076912] INFO -- : make[2]: Entering directory '/tmp/ruby/build/trunk/ext/json' I, [2024-05-11T15:11:29.672749 #2076912] INFO -- : make[2]: Leaving directory '/tmp/ruby/build/trunk/ext/json' I, [2024-05-11T15:11:29.685272 #2076912] INFO -- : make[2]: Entering directory '/tmp/ruby/build/trunk/ext/monitor' I, [2024-05-11T15:11:29.688294 #2076912] INFO -- : make[2]: Leaving directory '/tmp/ruby/build/trunk/ext/monitor' I, [2024-05-11T15:11:29.695293 #2076912] INFO -- : make[2]: Entering directory '/tmp/ruby/build/trunk/ext/objspace' I, [2024-05-11T15:11:29.701392 #2076912] INFO -- : make[2]: Leaving directory '/tmp/ruby/build/trunk/ext/objspace' I, [2024-05-11T15:11:29.719404 #2076912] INFO -- : make[2]: Entering directory '/tmp/ruby/build/trunk/ext/openssl' I, [2024-05-11T15:11:29.737331 #2076912] INFO -- : make[2]: Leaving directory '/tmp/ruby/build/trunk/ext/openssl' I, [2024-05-11T15:11:29.742060 #2076912] INFO -- : make[2]: Entering directory '/tmp/ruby/build/trunk/ext/pathname' I, [2024-05-11T15:11:29.746159 #2076912] INFO -- : make[2]: Leaving directory '/tmp/ruby/build/trunk/ext/pathname' I, [2024-05-11T15:11:29.752900 #2076912] INFO -- : make[2]: Entering directory '/tmp/ruby/build/trunk/ext/psych' I, [2024-05-11T15:11:29.776740 #2076912] INFO -- : make[2]: Leaving directory '/tmp/ruby/build/trunk/ext/psych' I, [2024-05-11T15:11:29.781449 #2076912] INFO -- : make[2]: Entering directory '/tmp/ruby/build/trunk/ext/pty' I, [2024-05-11T15:11:29.785554 #2076912] INFO -- : make[2]: Leaving directory '/tmp/ruby/build/trunk/ext/pty' I, [2024-05-11T15:11:29.801786 #2076912] INFO -- : make[2]: Entering directory '/tmp/ruby/build/trunk/ext/ripper' I, [2024-05-11T15:11:29.809995 #2076912] INFO -- : make[2]: Leaving directory '/tmp/ruby/build/trunk/ext/ripper' I, [2024-05-11T15:11:29.812618 #2076912] INFO -- : make[2]: Entering directory '/tmp/ruby/build/trunk/ext/rubyvm' I, [2024-05-11T15:11:29.816025 #2076912] INFO -- : make[2]: Leaving directory '/tmp/ruby/build/trunk/ext/rubyvm' I, [2024-05-11T15:11:29.828586 #2076912] INFO -- : make[2]: Entering directory '/tmp/ruby/build/trunk/ext/socket' I, [2024-05-11T15:11:29.836872 #2076912] INFO -- : make[2]: Leaving directory '/tmp/ruby/build/trunk/ext/socket' I, [2024-05-11T15:11:29.855197 #2076912] INFO -- : make[2]: Entering directory '/tmp/ruby/build/trunk/.bundle/gems/bigdecimal-3.1.8/ext/bigdecimal' I, [2024-05-11T15:11:29.882476 #2076912] INFO -- : make[2]: Leaving directory '/tmp/ruby/build/trunk/.bundle/gems/bigdecimal-3.1.8/ext/bigdecimal' I, [2024-05-11T15:11:29.884214 #2076912] INFO -- : make[2]: Entering directory '/tmp/ruby/build/trunk/.bundle/gems/debug-1.9.2/ext/debug' I, [2024-05-11T15:11:29.906873 #2076912] INFO -- : make[2]: Leaving directory '/tmp/ruby/build/trunk/.bundle/gems/debug-1.9.2/ext/debug' I, [2024-05-11T15:11:29.908956 #2076912] INFO -- : make[2]: Entering directory '/tmp/ruby/build/trunk/.bundle/gems/nkf-0.2.0/ext/nkf' I, [2024-05-11T15:11:29.930608 #2076912] INFO -- : make[2]: Leaving directory '/tmp/ruby/build/trunk/.bundle/gems/nkf-0.2.0/ext/nkf' I, [2024-05-11T15:11:29.932616 #2076912] INFO -- : make[2]: Entering directory '/tmp/ruby/build/trunk/.bundle/gems/racc-1.7.3/ext/racc/cparse' I, [2024-05-11T15:11:29.954715 #2076912] INFO -- : make[2]: Leaving directory '/tmp/ruby/build/trunk/.bundle/gems/racc-1.7.3/ext/racc/cparse' I, [2024-05-11T15:11:29.957161 #2076912] INFO -- : make[2]: Entering directory '/tmp/ruby/build/trunk/.bundle/gems/rbs-3.4.4/ext/rbs_extension' I, [2024-05-11T15:11:29.979448 #2076912] INFO -- : make[2]: Leaving directory '/tmp/ruby/build/trunk/.bundle/gems/rbs-3.4.4/ext/rbs_extension' I, [2024-05-11T15:11:29.981480 #2076912] INFO -- : make[2]: Entering directory '/tmp/ruby/build/trunk/.bundle/gems/syslog-0.1.2/ext/syslog' I, [2024-05-11T15:11:30.003524 #2076912] INFO -- : make[2]: Leaving directory '/tmp/ruby/build/trunk/.bundle/gems/syslog-0.1.2/ext/syslog' I, [2024-05-11T15:11:30.031125 #2076912] INFO -- : make[2]: Entering directory '/tmp/ruby/build/trunk' I, [2024-05-11T15:11:30.099970 #2076912] INFO -- : make[2]: 'ruby' is up to date. I, [2024-05-11T15:11:30.100016 #2076912] INFO -- : make[2]: Leaving directory '/tmp/ruby/build/trunk' I, [2024-05-11T15:11:30.100372 #2076912] INFO -- : make[1]: Leaving directory '/tmp/ruby/build/trunk' I, [2024-05-11T15:11:30.103814 #2076912] INFO -- : make[1]: Entering directory '/tmp/ruby/build/trunk' I, [2024-05-11T15:11:30.103836 #2076912] INFO -- : make[1]: Nothing to be done for 'note'. I, [2024-05-11T15:11:30.103842 #2076912] INFO -- : make[1]: Leaving directory '/tmp/ruby/build/trunk' I, [2024-05-11T15:11:30.183542 #2076912] INFO -- : Run options: I, [2024-05-11T15:11:30.183603 #2076912] INFO -- : --seed=19742 I, [2024-05-11T15:11:30.183609 #2076912] INFO -- : "--ruby=./miniruby -I/tmp/ruby/src/trunk/lib -I. -I.ext/common /tmp/ruby/src/trunk/tool/runruby.rb --extout=.ext -- --disable-gems" I, [2024-05-11T15:11:30.183627 #2076912] INFO -- : --excludes-dir=/tmp/ruby/src/trunk/test/.excludes I, [2024-05-11T15:11:30.183631 #2076912] INFO -- : --name=!/memory_leak/ I, [2024-05-11T15:11:30.183635 #2076912] INFO -- : --stderr-on-failure I, [2024-05-11T15:11:30.183646 #2076912] INFO -- : -j20 I, [2024-05-11T15:11:30.183650 #2076912] INFO -- : I, [2024-05-11T15:11:30.183654 #2076912] INFO -- : # Running tests: I, [2024-05-11T15:11:30.183657 #2076912] INFO -- : I, [2024-05-11T15:11:30.332571 #2076912] INFO -- : [ 1/885] 2118287=format_errors_test I, [2024-05-11T15:11:30.332650 #2076912] INFO -- : [ 2/885] 2118274=test_dir I, [2024-05-11T15:11:30.332950 #2076912] INFO -- : [ 3/885] 2118276=test_date_ractor I, [2024-05-11T15:11:30.332983 #2076912] INFO -- : [ 4/885] 2118278=test_gem_console_ui I, [2024-05-11T15:11:30.332991 #2076912] INFO -- : [ 5/885] 2118273=test_eval I, [2024-05-11T15:11:30.333944 #2076912] INFO -- : [ 6/885] 2118277=test_autoconf I, [2024-05-11T15:11:30.334302 #2076912] INFO -- : [ 7/885] 2118289=test_ractor_compatibility I, [2024-05-11T15:11:30.334700 #2076912] INFO -- : [ 8/885] 2118291=test_member I, [2024-05-11T15:11:30.334803 #2076912] INFO -- : [ 9/885] 2118290=test_numeric I, [2024-05-11T15:11:30.335025 #2076912] INFO -- : [ 10/885] 2118288=test_cgi_multipart I, [2024-05-11T15:11:30.337449 #2076912] INFO -- : [ 11/885] 2118292=test_word I, [2024-05-11T15:11:30.337933 #2076912] INFO -- : [ 12/885] 2118292=test_gem_commands_cleanup_command I, [2024-05-11T15:11:30.341577 #2076912] INFO -- : [ 13/885] 2118273=test_rdoc_comment I, [2024-05-11T15:11:30.343809 #2076912] INFO -- : [ 14/885] 2118277=test_resize I, [2024-05-11T15:11:30.353357 #2076912] INFO -- : [ 15/885] 2118291=test_error_highlight I, [2024-05-11T15:11:30.356853 #2076912] INFO -- : [ 16/885] 2118287=test_rdoc_generator_darkfish I, [2024-05-11T15:11:30.360245 #2076912] INFO -- : [ 17/885] 2118290=test_http_request I, [2024-05-11T15:11:30.360327 #2076912] INFO -- : [ 18/885] 2118286=test_gem_source_fetch_problem I, [2024-05-11T15:11:30.364569 #2076912] INFO -- : [ 19/885] 2118277=json_generic_object_test I, [2024-05-11T15:11:30.364827 #2076912] INFO -- : [ 20/885] 2118279=location_test I, [2024-05-11T15:11:30.364949 #2076912] INFO -- : [ 21/885] 2118282=test_symbol I, [2024-05-11T15:11:30.365475 #2076912] INFO -- : [ 22/885] 2118281=test_coderange I, [2024-05-11T15:11:30.365602 #2076912] INFO -- : [ 23/885] 2118283=test_mailto I, [2024-05-11T15:11:30.365717 #2076912] INFO -- : [ 24/885] 2118285=test_pkcs7 I, [2024-05-11T15:11:30.365942 #2076912] INFO -- : [ 25/885] 2118284=test_arith_seq_beg_len_step I, [2024-05-11T15:11:30.372241 #2076912] INFO -- : [ 26/885] 2118281=test_gem_resolver_requirement_list I, [2024-05-11T15:11:30.377911 #2076912] INFO -- : [ 27/885] 2118277=test_function_entry I, [2024-05-11T15:11:30.378130 #2076912] INFO -- : [ 28/885] 2118277=test_find_executable I, [2024-05-11T15:11:30.384372 #2076912] INFO -- : [ 29/885] 2118275=ruby_api_test I, [2024-05-11T15:11:30.393281 #2076912] INFO -- : [ 30/885] 2118280=test_context I, [2024-05-11T15:11:30.398262 #2076912] INFO -- : [ 31/885] 2118282=test_gem_commands_pristine_command I, [2024-05-11T15:11:30.404814 #2076912] INFO -- : [ 32/885] 2118277=test_nofree I, [2024-05-11T15:11:30.406666 #2076912] INFO -- : [ 33/885] 2118283=test_coder I, [2024-05-11T15:11:30.406731 #2076912] INFO -- : [ 34/885] 2118277=test_symbol I, [2024-05-11T15:11:30.408412 #2076912] INFO -- : [ 35/885] 2118290=test_unix I, [2024-05-11T15:11:30.445468 #2076912] INFO -- : [ 36/885] 2118283=test_lazy_enumerator I, [2024-05-11T15:11:30.450226 #2076912] INFO -- : [ 37/885] 2118284=test_enc_associate I, [2024-05-11T15:11:30.456821 #2076912] INFO -- : [ 38/885] 2118290=test_bignum I, [2024-05-11T15:11:30.502560 #2076912] INFO -- : [ 39/885] 2118278=test_rdoc_class_module I, [2024-05-11T15:11:30.504552 #2076912] INFO -- : [ 40/885] 2118279=test_gem_ci_detector I, [2024-05-11T15:11:30.507617 #2076912] INFO -- : [ 41/885] 2118273=test_arity I, [2024-05-11T15:11:30.511705 #2076912] INFO -- : [ 42/885] 2118273=test_stringio I, [2024-05-11T15:11:30.532683 #2076912] INFO -- : [ 43/885] 2118288=test_io_wait_uncommon I, [2024-05-11T15:11:30.534852 #2076912] INFO -- : [ 44/885] 2118286=test_win32ole_variable I, [2024-05-11T15:11:30.540406 #2076912] INFO -- : [ 45/885] 2118288=ractor_test I, [2024-05-11T15:11:30.543698 #2076912] INFO -- : [ 46/885] 2118286=test_trace I, [2024-05-11T15:11:30.550666 #2076912] INFO -- : [ 47/885] 2118286=test_win32ole_event I, [2024-05-11T15:11:30.553484 #2076912] INFO -- : [ 48/885] 2118286=test_time_tz I, [2024-05-11T15:11:30.569058 #2076912] INFO -- : [ 49/885] 2118275=test_rdoc_generator_json_index I, [2024-05-11T15:11:30.594875 #2076912] INFO -- : [ 50/885] 2118273=test_resolve_symbol I, [2024-05-11T15:11:30.607713 #2076912] INFO -- : [ 51/885] 2118286=test_complex2 I, [2024-05-11T15:11:30.617046 #2076912] INFO -- : [ 52/885] 2118286=test_gem_package I, [2024-05-11T15:11:30.618312 #2076912] INFO -- : [ 53/885] 2118290=test_have_macro I, [2024-05-11T15:11:30.624683 #2076912] INFO -- : [ 54/885] 2118288=test_gem_specification I, [2024-05-11T15:11:30.625158 #2076912] INFO -- : [ 55/885] 2118281=test_enum I, [2024-05-11T15:11:30.627044 #2076912] INFO -- : [ 56/885] 2118285=test_threadgroup I, [2024-05-11T15:11:30.629192 #2076912] INFO -- : [ 57/885] 2118276=test_rdoc_extend I, [2024-05-11T15:11:30.645438 #2076912] INFO -- : [ 58/885] 2118273=test_merge_keys I, [2024-05-11T15:11:30.651074 #2076912] INFO -- : [ 59/885] 2118280=test_gem_resolver_api_specification I, [2024-05-11T15:11:30.657196 #2076912] INFO -- : [ 60/885] 2118279=test_win32ole_variant I, [2024-05-11T15:11:30.661314 #2076912] INFO -- : [ 61/885] 2118279=test_history I, [2024-05-11T15:11:30.668090 #2076912] INFO -- : [ 62/885] 2118273=test_mixed_unicode_escapes I, [2024-05-11T15:11:30.669106 #2076912] INFO -- : [ 63/885] 2118273=test_rdoc_markup_to_ansi I, [2024-05-11T15:11:30.687155 #2076912] INFO -- : [ 64/885] 2118274=test_ipaddr I, [2024-05-11T15:11:30.713571 #2076912] INFO -- : [ 65/885] 2118273=test_cgi_core I, [2024-05-11T15:11:30.724351 #2076912] INFO -- : [ 66/885] 2118291=test_parser I, [2024-05-11T15:11:30.725127 #2076912] INFO -- : [ 67/885] 2118274=test_registry I, [2024-05-11T15:11:30.726481 #2076912] INFO -- : [ 68/885] 2118274=parse_stream_test I, [2024-05-11T15:11:30.737423 #2076912] INFO -- : [ 69/885] 2118273=test_gem I, [2024-05-11T15:11:30.763076 #2076912] INFO -- : [ 70/885] 2118291=test_gem_source_lock I, [2024-05-11T15:11:30.774247 #2076912] INFO -- : [ 71/885] 2118279=test_ractor I, [2024-05-11T15:11:30.783780 #2076912] INFO -- : [ 72/885] 2118279=test_gem_commands_open_command I, [2024-05-11T15:11:30.803598 #2076912] INFO -- : [ 73/885] 2118287=test_dns I, [2024-05-11T15:11:30.817752 #2076912] INFO -- : [ 74/885] 2118289=test_ssl I, [2024-05-11T15:11:30.818498 #2076912] INFO -- : [ 75/885] 2118274=test_debugger_integration I, [2024-05-11T15:11:30.827256 #2076912] INFO -- : [ 76/885] 2118276=test_rendering I, [2024-05-11T15:11:30.829721 #2076912] INFO -- : [ 77/885] 2118275=test_my_integer I, [2024-05-11T15:11:30.832787 #2076912] INFO -- : [ 78/885] 2118275=json_ext_parser_test I, [2024-05-11T15:11:30.836245 #2076912] INFO -- : [ 79/885] 2118275=test_thread I, [2024-05-11T15:11:30.845289 #2076912] INFO -- : [ 80/885] 2118274=test_ractor I, [2024-05-11T15:11:30.858251 #2076912] INFO -- : [ 81/885] 2118283=test_timeout I, [2024-05-11T15:11:30.870061 #2076912] INFO -- : [ 82/885] 2118280=test_alias I, [2024-05-11T15:11:30.885216 #2076912] INFO -- : [ 83/885] 2118279=test_nonblock I, [2024-05-11T15:11:30.886104 #2076912] INFO -- : [ 84/885] 2118276=test_weakref I, [2024-05-11T15:11:30.892817 #2076912] INFO -- : [ 85/885] 2118279=test_marshal I, [2024-05-11T15:11:30.946411 #2076912] INFO -- : [ 86/885] 2118292=test_unicode_normalize I, [2024-05-11T15:11:30.974785 #2076912] INFO -- : [ 87/885] 2118276=test_reline_key I, [2024-05-11T15:11:30.975946 #2076912] INFO -- : [ 88/885] 2118276=test_rb_str_dup I, [2024-05-11T15:11:30.976800 #2076912] INFO -- : [ 89/885] 2118284=test_ancdata I, [2024-05-11T15:11:30.980191 #2076912] INFO -- : [ 90/885] 2118276=test_singleton_function I, [2024-05-11T15:11:30.983458 #2076912] INFO -- : [ 91/885] 2118276=test_rubyoptions I, [2024-05-11T15:11:30.984228 #2076912] INFO -- : [ 92/885] 2118284=test_super I, [2024-05-11T15:11:30.987986 #2076912] INFO -- : [ 93/885] 2118291=test_integer I, [2024-05-11T15:11:31.027936 #2076912] INFO -- : [ 94/885] 2118280=test_cgi_modruby I, [2024-05-11T15:11:31.041173 #2076912] INFO -- : [ 95/885] 2118280=test_rubygems I, [2024-05-11T15:11:31.126743 #2076912] INFO -- : [ 96/885] 2118290=test_call I, [2024-05-11T15:11:31.159283 #2076912] INFO -- : [ 97/885] 2118280=test_https_proxy I, [2024-05-11T15:11:31.183903 #2076912] INFO -- : [ 98/885] 2118278=test_have_func I, [2024-05-11T15:11:31.208632 #2076912] INFO -- : [ 99/885] 2118280=test_stat I, [2024-05-11T15:11:31.213640 #2076912] INFO -- : [100/885] 2118280=test_gem_request_set_lockfile_tokenizer I, [2024-05-11T15:11:31.257701 #2076912] INFO -- : [101/885] 2118284=test_capacity I, [2024-05-11T15:11:31.258204 #2076912] INFO -- : [102/885] 2118290=test_nextafter I, [2024-05-11T15:11:31.261012 #2076912] INFO -- : [103/885] 2118284=test_usrmarshal I, [2024-05-11T15:11:31.263303 #2076912] INFO -- : [104/885] 2118280=test_object_references I, [2024-05-11T15:11:31.266466 #2076912] INFO -- : [105/885] 2118279=test_gem_resolver_git_specification I, [2024-05-11T15:11:31.273114 #2076912] INFO -- : [106/885] 2118280=test_env I, [2024-05-11T15:11:31.280827 #2076912] INFO -- : [107/885] 2118274=test_rdoc_attr I, [2024-05-11T15:11:31.285864 #2076912] INFO -- : [108/885] 2118287=test_dryrun I, [2024-05-11T15:11:31.307571 #2076912] INFO -- : [109/885] 2118287=test_integer I, [2024-05-11T15:11:31.322652 #2076912] INFO -- : [110/885] 2118290=desugar_compiler_test I, [2024-05-11T15:11:31.339938 #2076912] INFO -- : [111/885] 2118289=test_gem_commands_setup_command I, [2024-05-11T15:11:31.376570 #2076912] INFO -- : [112/885] 2118286=test_gem_safe_marshal I, [2024-05-11T15:11:31.379206 #2076912] INFO -- : [113/885] 2118287=test_gem_resolver_api_set I, [2024-05-11T15:11:31.388945 #2076912] INFO -- : [114/885] 2118290=test_gem_resolver_vendor_set I, [2024-05-11T15:11:31.394991 #2076912] INFO -- : [115/885] 2118274=test_config I, [2024-05-11T15:11:31.480787 #2076912] INFO -- : [116/885] 2118284=test_enumerable I, [2024-05-11T15:11:31.484335 #2076912] INFO -- : [117/885] 2118279=test_eval I, [2024-05-11T15:11:31.501640 #2076912] INFO -- : [118/885] 2118284=json_generator_test I, [2024-05-11T15:11:31.539205 #2076912] INFO -- : [119/885] 2118290=test_transcode I, [2024-05-11T15:11:31.547552 #2076912] INFO -- : [120/885] 2118281=test_fips I, [2024-05-11T15:11:31.573485 #2076912] INFO -- : [121/885] 2118287=test_x509name I, [2024-05-11T15:11:31.582786 #2076912] INFO -- : [122/885] 2118287=test_update I, [2024-05-11T15:11:31.584579 #2076912] INFO -- : [123/885] 2118287=test_rdoc_code_object I, [2024-05-11T15:11:31.593768 #2076912] INFO -- : [124/885] 2118284=test_x509store I, [2024-05-11T15:11:31.631761 #2076912] INFO -- : [125/885] 2118285=test_webauthn_listener I, [2024-05-11T15:11:31.677349 #2076912] INFO -- : [126/885] 2118279=test_gem_request_set_gem_dependency_api I, [2024-05-11T15:11:31.678465 #2076912] INFO -- : [127/885] 2118283=test_ast I, [2024-05-11T15:11:31.743750 #2076912] INFO -- : [128/885] 2118282=test_lambda I, [2024-05-11T15:11:31.767126 #2076912] INFO -- : [129/885] 2118290=test_jaro_winkler I, [2024-05-11T15:11:31.775185 #2076912] INFO -- : [130/885] 2118290=test_random_formatter I, [2024-05-11T15:11:31.793579 #2076912] INFO -- : [131/885] 2118290=test_helper I, [2024-05-11T15:11:31.793647 #2076912] INFO -- : [132/885] 2118277=test_vm_dump I, [2024-05-11T15:11:31.794913 #2076912] INFO -- : [133/885] 2118290=test_integer_comb I, [2024-05-11T15:11:31.795239 #2076912] INFO -- : [134/885] 2118277=test_rdoc_markup_document I, [2024-05-11T15:11:31.813292 #2076912] INFO -- : [135/885] 2118282=test_tmpdir I, [2024-05-11T15:11:31.844426 #2076912] INFO -- : [136/885] 2118285=test_gem_commands_check_command I, [2024-05-11T15:11:31.848334 #2076912] INFO -- : [137/885] 2118281=test_regexp I, [2024-05-11T15:11:31.862562 #2076912] INFO -- : [138/885] 2118284=errors_test I, [2024-05-11T15:11:31.870570 #2076912] INFO -- : [139/885] 2118285=static_inspect_test I, [2024-05-11T15:11:31.876614 #2076912] INFO -- : [140/885] 2118279=unescape_test I, [2024-05-11T15:11:31.883794 #2076912] INFO -- : [141/885] 2118287=test_ostruct I, [2024-05-11T15:11:31.912704 #2076912] INFO -- : [142/885] 2118289=test_file I, [2024-05-11T15:11:31.924068 #2076912] INFO -- : [143/885] 2118274=test_force_exit I, [2024-05-11T15:11:31.927427 #2076912] INFO -- : [144/885] 2118282=test_data_error I, [2024-05-11T15:11:31.945595 #2076912] INFO -- : [145/885] 2118285=bom_test I, [2024-05-11T15:11:31.950740 #2076912] INFO -- : [146/885] 2118285=test_udp I, [2024-05-11T15:11:31.957682 #2076912] INFO -- : [147/885] 2118285=test_constant I, [2024-05-11T15:11:31.963306 #2076912] INFO -- : [148/885] 2118277=test_dup I, [2024-05-11T15:11:31.996201 #2076912] INFO -- : [149/885] 2118282=test_pty I, [2024-05-11T15:11:32.020352 #2076912] INFO -- : [150/885] 2118284=command_line_test I, [2024-05-11T15:11:32.025283 #2076912] INFO -- : [151/885] 2118284=test_range I, [2024-05-11T15:11:32.052323 #2076912] INFO -- : [152/885] 2118274=test_project_sanity I, [2024-05-11T15:11:32.065355 #2076912] INFO -- : [153/885] 2118287=test_gem_uri_formatter I, [2024-05-11T15:11:32.069881 #2076912] INFO -- : [154/885] 2118286=test_encoding I, [2024-05-11T15:11:32.089892 #2076912] INFO -- : [155/885] 2118287=test_helper I, [2024-05-11T15:11:32.090024 #2076912] INFO -- : [156/885] 2118287=test_erb_command I, [2024-05-11T15:11:32.139648 #2076912] INFO -- : [157/885] 2118287=test_ts I, [2024-05-11T15:11:32.178035 #2076912] INFO -- : [158/885] 2118277=library_symbols_test I, [2024-05-11T15:11:32.254970 #2076912] INFO -- : [159/885] 2118286=test_locale I, [2024-05-11T15:11:32.278640 #2076912] INFO -- : [160/885] 2118277=test_addr I, [2024-05-11T15:11:32.292740 #2076912] INFO -- : [161/885] 2118274=test_ensured I, [2024-05-11T15:11:32.310050 #2076912] INFO -- : [162/885] 2118277=test_rdoc_ri_paths I, [2024-05-11T15:11:32.347878 #2076912] INFO -- : [163/885] 2118277=version_test I, [2024-05-11T15:11:32.350293 #2076912] INFO -- : [164/885] 2118277=test_cgi_header I, [2024-05-11T15:11:32.355503 #2076912] INFO -- : [165/885] 2118274=heredoc_dedent_test I, [2024-05-11T15:11:32.361070 #2076912] INFO -- : [166/885] 2118274=test_object I, [2024-05-11T15:11:32.363255 #2076912] INFO -- : [167/885] 2118277=test_arithmetic_sequence I, [2024-05-11T15:11:32.365848 #2076912] INFO -- : [168/885] 2118274=test_key_actor_emacs I, [2024-05-11T15:11:32.377020 #2076912] INFO -- : [169/885] 2118286=test_gem_command_manager I, [2024-05-11T15:11:32.381493 #2076912] INFO -- : [170/885] 2118277=test_basicinstructions I, [2024-05-11T15:11:32.462462 #2076912] INFO -- : [171/885] 2118277=test_gem_gemcutter_utilities I, [2024-05-11T15:11:32.490202 #2076912] INFO -- : [172/885] 2118274=test_gem_local_remote_options I, [2024-05-11T15:11:32.492907 #2076912] INFO -- : [173/885] 2118278=test_date_arith I, [2024-05-11T15:11:32.496573 #2076912] INFO -- : [174/885] 2118286=test_ruby_lex I, [2024-05-11T15:11:32.498398 #2076912] INFO -- : [175/885] 2118278=test_object I, [2024-05-11T15:11:32.499576 #2076912] INFO -- : [176/885] 2118282=test_sleep I, [2024-05-11T15:11:32.541472 #2076912] INFO -- : [177/885] 2118274=test_flip I, [2024-05-11T15:11:32.562139 #2076912] INFO -- : [178/885] 2118274=compiler_test I, [2024-05-11T15:11:32.570994 #2076912] INFO -- : [179/885] 2118274=test_change_word I, [2024-05-11T15:11:32.575614 #2076912] INFO -- : [180/885] 2118274=test_ossl I, [2024-05-11T15:11:32.586065 #2076912] INFO -- : [181/885] 2118286=test_normalize I, [2024-05-11T15:11:32.586743 #2076912] INFO -- : [182/885] 2118286=test_timeout I, [2024-05-11T15:11:32.594227 #2076912] INFO -- : [183/885] 2118286=test_rdoc_rd_block_parser I, [2024-05-11T15:11:32.632059 #2076912] INFO -- : [184/885] 2118284=test_tsort I, [2024-05-11T15:11:32.635247 #2076912] INFO -- : [185/885] 2118284=test_signedness I, [2024-05-11T15:11:32.642278 #2076912] INFO -- : [186/885] 2118288=test_type I, [2024-05-11T15:11:32.653293 #2076912] INFO -- : [187/885] 2118288=test_ractor I, [2024-05-11T15:11:32.691120 #2076912] INFO -- : [188/885] 2118287=test_pointer I, [2024-05-11T15:11:32.733756 #2076912] INFO -- : [189/885] 2118288=test_func I, [2024-05-11T15:11:32.798741 #2076912] INFO -- : [190/885] 2118286=test_big5 I, [2024-05-11T15:11:32.804257 #2076912] INFO -- : [191/885] 2118286=test_rdoc_markup_hard_break I, [2024-05-11T15:11:32.808219 #2076912] INFO -- : [192/885] 2118286=test_gem_package_task I, [2024-05-11T15:11:32.815832 #2076912] INFO -- : [193/885] 2118286=test_date_strptime I, [2024-05-11T15:11:32.900722 #2076912] INFO -- : [194/885] 2118273=test_placearg I, [2024-05-11T15:11:32.905595 #2076912] INFO -- : [195/885] 2118278=test_gem_platform I, [2024-05-11T15:11:32.974694 #2076912] INFO -- : [196/885] 2118286=test_pkey_rsa I, [2024-05-11T15:11:32.975619 #2076912] INFO -- : [197/885] 2118278=test_numhash I, [2024-05-11T15:11:32.980674 #2076912] INFO -- : [198/885] 2118278=test_gem_commands_push_command I, [2024-05-11T15:11:32.986362 #2076912] INFO -- : [199/885] 2118277=test_weakkeymap I, [2024-05-11T15:11:33.030879 #2076912] INFO -- : [200/885] 2118273=test_continuation I, [2024-05-11T15:11:33.037253 #2076912] INFO -- : [201/885] 2118273=test_fd_setsize I, [2024-05-11T15:11:33.043888 #2076912] INFO -- : [202/885] 2118273=test_class_name_check I, [2024-05-11T15:11:33.064556 #2076912] INFO -- : [203/885] 2118273=test_keyword I, [2024-05-11T15:11:33.181282 #2076912] INFO -- : [204/885] 2118277=test_delete I, [2024-05-11T15:11:33.186209 #2076912] INFO -- : [205/885] 2118277=test_win32ole_method I, [2024-05-11T15:11:33.194001 #2076912] INFO -- : [206/885] 2118277=test_logger I, [2024-05-11T15:11:33.208112 #2076912] INFO -- : [207/885] 2118277=test_gem_update_suggestion I, [2024-05-11T15:11:33.209410 #2076912] INFO -- : [208/885] 2118286=test_files_test I, [2024-05-11T15:11:33.228194 #2076912] INFO -- : [209/885] 2118287=test_file_exhaustive I, [2024-05-11T15:11:33.271225 #2076912] INFO -- : [210/885] 2118277=test_rdoc_parser_markdown I, [2024-05-11T15:11:33.303133 #2076912] INFO -- : [211/885] 2118286=test_import I, [2024-05-11T15:11:33.303694 #2076912] INFO -- : [212/885] 2118277=test_gem_resolver_lock_set I, [2024-05-11T15:11:33.344655 #2076912] INFO -- : [213/885] 2118277=test_not I, [2024-05-11T15:11:33.347778 #2076912] INFO -- : [214/885] 2118277=test_terminfo I, [2024-05-11T15:11:33.400917 #2076912] INFO -- : [215/885] 2118277=test_compile_prism I, [2024-05-11T15:11:33.469392 #2076912] INFO -- : [216/885] 2118288=test_bug-14834 I, [2024-05-11T15:11:33.504971 #2076912] INFO -- : [217/885] 2118278=test_rdoc_markup_to_html I, [2024-05-11T15:11:33.566191 #2076912] INFO -- : [218/885] 2118278=test_date_compat I, [2024-05-11T15:11:33.568052 #2076912] INFO -- : [219/885] 2118288=test_tree_spell_checker I, [2024-05-11T15:11:33.570523 #2076912] INFO -- : [220/885] 2118278=test_addrinfo I, [2024-05-11T15:11:33.596609 #2076912] INFO -- : [221/885] 2118288=test_http I, [2024-05-11T15:11:33.610868 #2076912] INFO -- : [222/885] 2118278=test_win32ole_param_event I, [2024-05-11T15:11:33.623822 #2076912] INFO -- : [223/885] 2118278=test_bn I, [2024-05-11T15:11:33.634652 #2076912] INFO -- : [224/885] 2118278=redundant_return_test I, [2024-05-11T15:11:33.697500 #2076912] INFO -- : [225/885] 2118278=test_case_mapping I, [2024-05-11T15:11:33.701877 #2076912] INFO -- : [226/885] 2118278=test_path I, [2024-05-11T15:11:33.705268 #2076912] INFO -- : [227/885] 2118273=test_rdoc_generator_pot I, [2024-05-11T15:11:33.712602 #2076912] INFO -- : [228/885] 2118278=test_unicode I, [2024-05-11T15:11:33.747059 #2076912] INFO -- : [229/885] 2118273=test_rdoc_parser_changelog I, [2024-05-11T15:11:33.755219 #2076912] INFO -- : [230/885] 2118277=test_enumerator I, [2024-05-11T15:11:33.757349 #2076912] INFO -- : [231/885] 2118277=test_koi8 I, [2024-05-11T15:11:33.762080 #2076912] INFO -- : [232/885] 2118277=parameters_signature_test I, [2024-05-11T15:11:33.770288 #2076912] INFO -- : [233/885] 2118278=test_rdoc_method_attr I, [2024-05-11T15:11:33.777317 #2076912] INFO -- : [234/885] 2118277=static_literals_test I, [2024-05-11T15:11:33.784457 #2076912] INFO -- : [235/885] 2118277=test_data I, [2024-05-11T15:11:33.788136 #2076912] INFO -- : [236/885] 2118277=test_filter I, [2024-05-11T15:11:33.822584 #2076912] INFO -- : [237/885] 2118273=test_gem_gem_runner I, [2024-05-11T15:11:33.844457 #2076912] INFO -- : [238/885] 2118277=test_gem_resolver_vendor_specification I, [2024-05-11T15:11:33.874128 #2076912] INFO -- : [239/885] 2118277=test_gem_commands_update_command I, [2024-05-11T15:11:33.878205 #2076912] INFO -- : [240/885] 2118273=test_notimplement I, [2024-05-11T15:11:33.882200 #2076912] INFO -- : [241/885] 2118273=test_random I, [2024-05-11T15:11:33.882754 #2076912] INFO -- : [242/885] 2118279=test_gem_uri I, [2024-05-11T15:11:33.887394 #2076912] INFO -- : [243/885] 2118273=test_key_event_record I, [2024-05-11T15:11:33.909293 #2076912] INFO -- : [244/885] 2118279=test_ssl_session I, [2024-05-11T15:11:33.913566 #2076912] INFO -- : [245/885] 2118278=test_lexer I, [2024-05-11T15:11:33.925124 #2076912] INFO -- : [246/885] 2118278=test_thread_cv I, [2024-05-11T15:11:33.933325 #2076912] INFO -- : [247/885] 2118291=test_rbconfig I, [2024-05-11T15:11:33.938339 #2076912] INFO -- : [248/885] 2118291=test_primitive I, [2024-05-11T15:11:33.947940 #2076912] INFO -- : [249/885] 2118291=test_human_typo I, [2024-05-11T15:11:33.950184 #2076912] INFO -- : [250/885] 2118273=test_rdoc_i18n_locale I, [2024-05-11T15:11:33.963607 #2076912] INFO -- : [251/885] 2118273=test_chilled I, [2024-05-11T15:11:33.966641 #2076912] INFO -- : [252/885] 2118273=test_name_error_extension I, [2024-05-11T15:11:33.968124 #2076912] INFO -- : [253/885] 2118291=test_acceptable I, [2024-05-11T15:11:33.983443 #2076912] INFO -- : [254/885] 2118273=test_rdoc_generator_pot_po_entry I, [2024-05-11T15:11:33.986916 #2076912] INFO -- : [255/885] 2118273=test_euc_jp I, [2024-05-11T15:11:33.996390 #2076912] INFO -- : [256/885] 2118273=test_document I, [2024-05-11T15:11:34.013077 #2076912] INFO -- : [257/885] 2118286=test_pair I, [2024-05-11T15:11:34.014480 #2076912] INFO -- : [258/885] 2118273=test_win32ole_param I, [2024-05-11T15:11:34.017722 #2076912] INFO -- : [259/885] 2118273=test_gem_commands_yank_command I, [2024-05-11T15:11:34.085732 #2076912] INFO -- : [260/885] 2118291=test_sockopt I, [2024-05-11T15:11:34.090165 #2076912] INFO -- : [261/885] 2118291=test_rdoc_markup_to_label I, [2024-05-11T15:11:34.200184 #2076912] INFO -- : [262/885] 2118280=test_install I, [2024-05-11T15:11:34.208919 #2076912] INFO -- : [263/885] 2118290=test_rdoc_ri_driver I, [2024-05-11T15:11:34.256145 #2076912] INFO -- : [264/885] 2118292=test_httpheader I, [2024-05-11T15:11:34.280580 #2076912] INFO -- : [265/885] 2118291=test_gem_resolver_local_specification I, [2024-05-11T15:11:34.299556 #2076912] INFO -- : [266/885] 2118292=test_set_len I, [2024-05-11T15:11:34.305639 #2076912] INFO -- : [267/885] 2118292=test_httpresponses I, [2024-05-11T15:11:34.311095 #2076912] INFO -- : [268/885] 2118291=test_encoding I, [2024-05-11T15:11:34.314137 #2076912] INFO -- : [269/885] 2118292=test_key_stroke I, [2024-05-11T15:11:34.317980 #2076912] INFO -- : [270/885] 2118285=json_encoding_test I, [2024-05-11T15:11:34.321813 #2076912] INFO -- : [271/885] 2118291=test_color I, [2024-05-11T15:11:34.336101 #2076912] INFO -- : [272/885] 2118285=test_beginendblock I, [2024-05-11T15:11:34.395086 #2076912] INFO -- : [273/885] 2118292=test_files_lib I, [2024-05-11T15:11:34.429943 #2076912] INFO -- : [274/885] 2118291=test_gem_commands_unpack_command I, [2024-05-11T15:11:34.433332 #2076912] INFO -- : [275/885] 2118280=test_help I, [2024-05-11T15:11:34.439325 #2076912] INFO -- : [276/885] 2118280=test_rdoc_markup_to_bs I, [2024-05-11T15:11:34.496925 #2076912] INFO -- : [277/885] 2118273=test_within_pipe I, [2024-05-11T15:11:34.517977 #2076912] INFO -- : [278/885] 2118273=test_emoji_breaks I, [2024-05-11T15:11:34.522766 #2076912] INFO -- : [279/885] 2118273=test_gem_bundler_version_finder I, [2024-05-11T15:11:34.544911 #2076912] INFO -- : [280/885] 2118273=reflection_test I, [2024-05-11T15:11:34.561417 #2076912] INFO -- : [281/885] 2118278=test_pinned I, [2024-05-11T15:11:34.597532 #2076912] INFO -- : [282/885] 2118278=test_printf I, [2024-05-11T15:11:34.608141 #2076912] INFO -- : [283/885] 2118278=test_rdoc_markup_pre_process I, [2024-05-11T15:11:34.625175 #2076912] INFO -- : [284/885] 2118280=test_stream I, [2024-05-11T15:11:34.631561 #2076912] INFO -- : [285/885] 2118280=test_to_ary_concat I, [2024-05-11T15:11:34.642882 #2076912] INFO -- : [286/885] 2118273=test_time I, [2024-05-11T15:11:34.648212 #2076912] INFO -- : [287/885] 2118290=test_webauthn_listener_response I, [2024-05-11T15:11:34.663265 #2076912] INFO -- : [288/885] 2118290=test_recursion I, [2024-05-11T15:11:34.666666 #2076912] INFO -- : [289/885] 2118290=test_exit I, [2024-05-11T15:11:34.669842 #2076912] INFO -- : [290/885] 2118278=test_popen_deadlock I, [2024-05-11T15:11:34.674380 #2076912] INFO -- : [291/885] 2118285=test_delegate I, [2024-05-11T15:11:34.691397 #2076912] INFO -- : [292/885] 2118285=test_mkmf I, [2024-05-11T15:11:34.718624 #2076912] INFO -- : [293/885] 2118290=test_date_marshal I, [2024-05-11T15:11:34.721767 #2076912] INFO -- : [294/885] 2118290=test_history I, [2024-05-11T15:11:34.729960 #2076912] INFO -- : [295/885] 2118285=test_open3 I, [2024-05-11T15:11:34.740427 #2076912] INFO -- : [296/885] 2118291=test_multi_irb_commands I, [2024-05-11T15:11:34.740498 #2076912] INFO -- : [297/885] 2118291=test_fiber I, [2024-05-11T15:11:34.791072 #2076912] INFO -- : [298/885] 2118273=test_bundled_ca I, [2024-05-11T15:11:34.804375 #2076912] INFO -- : [299/885] 2118284=test_closure I, [2024-05-11T15:11:34.888627 #2076912] INFO -- : [300/885] 2118290=test_digest I, [2024-05-11T15:11:34.894593 #2076912] INFO -- : [301/885] 2118277=test_rdoc_servlet I, [2024-05-11T15:11:34.903866 #2076912] INFO -- : [302/885] 2118279=test_gem_security I, [2024-05-11T15:11:34.915538 #2076912] INFO -- : [303/885] 2118290=test_ractor I, [2024-05-11T15:11:34.987670 #2076912] INFO -- : [304/885] 2118284=test_case_comprehensive I, [2024-05-11T15:11:34.991637 #2076912] INFO -- : [305/885] 2118290=test_interned_str I, [2024-05-11T15:11:34.998396 #2076912] INFO -- : [306/885] 2118290=test_gem_commands_build_command I, [2024-05-11T15:11:35.024916 #2076912] INFO -- : [307/885] 2118277=test_option I, [2024-05-11T15:11:35.111271 #2076912] INFO -- : [308/885] 2118277=test_append I, [2024-05-11T15:11:35.114357 #2076912] INFO -- : [309/885] 2118277=test_tracer I, [2024-05-11T15:11:35.161731 #2076912] INFO -- : [310/885] 2118278=test_cmethod I, [2024-05-11T15:11:35.165660 #2076912] INFO -- : [311/885] 2118278=test_did_you_mean I, [2024-05-11T15:11:35.167492 #2076912] INFO -- : [312/885] 2118277=test_io_m17n I, [2024-05-11T15:11:35.262670 #2076912] INFO -- : [313/885] 2118278=test_variable_name_check I, [2024-05-11T15:11:35.299102 #2076912] INFO -- : [314/885] 2118278=test_gem_commands_server_command I, [2024-05-11T15:11:35.306385 #2076912] INFO -- : [315/885] 2118290=test_exception_at_throwing I, [2024-05-11T15:11:35.309593 #2076912] INFO -- : [316/885] 2118278=test_iseq I, [2024-05-11T15:11:35.344775 #2076912] INFO -- : [317/885] 2118290=test_rdoc_markup_heading I, [2024-05-11T15:11:35.354885 #2076912] INFO -- : [318/885] 2118290=test_scheduler I, [2024-05-11T15:11:35.504743 #2076912] INFO -- : [319/885] 2118290=test_ocsp I, [2024-05-11T15:11:35.794710 #2076912] INFO -- : [320/885] 2118278=test_class I, [2024-05-11T15:11:35.795112 #2076912] INFO -- : [321/885] 2118280=test_pkey_dsa I, [2024-05-11T15:11:35.803470 #2076912] INFO -- : [322/885] 2118278=test_config I, [2024-05-11T15:11:35.823236 #2076912] INFO -- : [323/885] 2118290=test_nomethod_error I, [2024-05-11T15:11:35.827693 #2076912] INFO -- : [324/885] 2118290=json_parser_test I, [2024-05-11T15:11:35.837767 #2076912] INFO -- : [325/885] 2118278=memsize_test I, [2024-05-11T15:11:35.840978 #2076912] INFO -- : [326/885] 2118278=json_common_interface_test I, [2024-05-11T15:11:35.859664 #2076912] INFO -- : [327/885] 2118278=test_dln I, [2024-05-11T15:11:35.861126 #2076912] INFO -- : [328/885] 2118278=test_gem_source_subpath_problem I, [2024-05-11T15:11:35.873899 #2076912] INFO -- : [329/885] 2118290=test_win32ole_variant_outarg I, [2024-05-11T15:11:35.879718 #2076912] INFO -- : [330/885] 2118290=test_variable I, [2024-05-11T15:11:35.951620 #2076912] INFO -- : [331/885] 2118290=fuzzer_test I, [2024-05-11T15:11:35.959001 #2076912] INFO -- : [332/885] 2118290=test_sexp I, [2024-05-11T15:11:35.979102 #2076912] INFO -- : [333/885] 2118290=test_rdoc_markup_include I, [2024-05-11T15:11:35.979167 #2076912] INFO -- : [334/885] 2118278=magic_comment_test I, [2024-05-11T15:11:35.983361 #2076912] INFO -- : [335/885] 2118290=test_rdoc_markup_to_html_snippet I, [2024-05-11T15:11:35.985344 #2076912] INFO -- : [336/885] 2118278=test_struct I, [2024-05-11T15:11:35.990913 #2076912] INFO -- : [337/885] 2118278=test_cparser I, [2024-05-11T15:11:36.054309 #2076912] INFO -- : [338/885] 2118290=test_pkg_config I, [2024-05-11T15:11:36.069367 #2076912] INFO -- : [339/885] 2118290=test_color_printer I, [2024-05-11T15:11:36.073984 #2076912] INFO -- : [340/885] 2118290=test_deprecated I, [2024-05-11T15:11:36.075469 #2076912] INFO -- : [341/885] 2118290=test_insns_leaf I, [2024-05-11T15:11:36.081438 #2076912] INFO -- : [342/885] 2118290=test_serialize_subclasses I, [2024-05-11T15:11:36.084482 #2076912] INFO -- : [343/885] 2118290=test_key_error I, [2024-05-11T15:11:36.092569 #2076912] INFO -- : [344/885] 2118290=test_div I, [2024-05-11T15:11:36.107273 #2076912] INFO -- : [345/885] 2118290=test_allocation I, [2024-05-11T15:11:36.228878 #2076912] INFO -- : [346/885] 2118277=test_engine I, [2024-05-11T15:11:36.238052 #2076912] INFO -- : [347/885] 2118277=test_win32ole_variant_m I, [2024-05-11T15:11:36.240018 #2076912] INFO -- : [348/885] 2118277=test_rdoc_rd_inline I, [2024-05-11T15:11:36.249544 #2076912] INFO -- : [349/885] 2118277=test_mutex I, [2024-05-11T15:11:36.358424 #2076912] INFO -- : [350/885] 2118273=test_x509req I, [2024-05-11T15:11:36.543533 #2076912] INFO -- : [351/885] 2118273=test_struct I, [2024-05-11T15:11:36.549567 #2076912] INFO -- : [352/885] 2118278=test_gem_path_support I, [2024-05-11T15:11:36.589385 #2076912] INFO -- : [353/885] 2118278=test_set I, [2024-05-11T15:11:36.606201 #2076912] INFO -- : [354/885] 2118278=test_files_test_1 I, [2024-05-11T15:11:36.780141 #2076912] INFO -- : [355/885] 2118285=test_gem_resolver_installer_set I, [2024-05-11T15:11:37.004840 #2076912] INFO -- : [356/885] 2118292=test_dir_m17n I, [2024-05-11T15:11:37.008741 #2076912] INFO -- : [357/885] 2118285=test_gem_source_git I, [2024-05-11T15:11:37.070295 #2076912] INFO -- : [358/885] 2118280=test_regex_casefold I, [2024-05-11T15:11:37.202918 #2076912] INFO -- : [359/885] 2118273=test_gem_commands_signout_command I, [2024-05-11T15:11:37.216325 #2076912] INFO -- : [360/885] 2118273=test_refinement I, [2024-05-11T15:11:37.376068 #2076912] INFO -- : [361/885] 2118277=test_require I, [2024-05-11T15:11:37.428148 #2076912] INFO -- : [362/885] 2118286=test_cgi_cookie I, [2024-05-11T15:11:37.440445 #2076912] INFO -- : [363/885] 2118286=test_float I, [2024-05-11T15:11:37.502522 #2076912] INFO -- : [364/885] 2118282=test_input_method I, [2024-05-11T15:11:37.507607 #2076912] INFO -- : [365/885] 2118285=test_windows_1252 I, [2024-05-11T15:11:37.510935 #2076912] INFO -- : [366/885] 2118285=test_process I, [2024-05-11T15:11:37.530770 #2076912] INFO -- : [367/885] 2118285=test_x509crl I, [2024-05-11T15:11:37.640427 #2076912] INFO -- : [368/885] 2118280=test_fixnum I, [2024-05-11T15:11:37.655400 #2076912] INFO -- : [369/885] 2118280=test_signal I, [2024-05-11T15:11:37.677647 #2076912] INFO -- : [370/885] 2118285=test_rdoc_top_level I, [2024-05-11T15:11:37.710158 #2076912] INFO -- : [371/885] 2118282=test_metaclass I, [2024-05-11T15:11:37.715117 #2076912] INFO -- : [372/885] 2118282=test_rdoc_rd I, [2024-05-11T15:11:37.736791 #2076912] INFO -- : [373/885] 2118282=test_cgi_session I, [2024-05-11T15:11:37.751556 #2076912] INFO -- : [374/885] 2118282=test_shellwords I, [2024-05-11T15:11:37.765132 #2076912] INFO -- : [375/885] 2118282=test_memory_view I, [2024-05-11T15:11:37.776680 #2076912] INFO -- : [376/885] 2118282=pattern_test I, [2024-05-11T15:11:37.832056 #2076912] INFO -- : [377/885] 2118282=test_debug I, [2024-05-11T15:11:37.837789 #2076912] INFO -- : [378/885] 2118282=test_omap I, [2024-05-11T15:11:37.846102 #2076912] INFO -- : [379/885] 2118282=test_iterator I, [2024-05-11T15:11:37.897255 #2076912] INFO -- : [380/885] 2118282=test_string I, [2024-05-11T15:11:37.901496 #2076912] INFO -- : [381/885] 2118282=test_digest_extend I, [2024-05-11T15:11:37.916762 #2076912] INFO -- : [382/885] 2118282=test_storage I, [2024-05-11T15:11:37.919498 #2076912] INFO -- : [383/885] 2118282=test_gem_resolver_git_set I, [2024-05-11T15:11:37.973847 #2076912] INFO -- : [384/885] 2118285=test_gem_security_signer I, [2024-05-11T15:11:37.982045 #2076912] INFO -- : [385/885] 2118289=test_cipher I, [2024-05-11T15:11:38.036724 #2076912] INFO -- : [386/885] 2118289=test_new I, [2024-05-11T15:11:38.040152 #2076912] INFO -- : [387/885] 2118289=test_array I, [2024-05-11T15:11:38.082469 #2076912] INFO -- : [388/885] 2118285=test_helper_method I, [2024-05-11T15:11:38.186763 #2076912] INFO -- : [389/885] 2118282=test_gem_package_tar_writer I, [2024-05-11T15:11:38.220275 #2076912] INFO -- : [390/885] 2118285=test_gem_commands_outdated_command I, [2024-05-11T15:11:38.257083 #2076912] INFO -- : [391/885] 2118282=test_scalar_scanner I, [2024-05-11T15:11:38.261428 #2076912] INFO -- : [392/885] 2118282=test_gem_source I, [2024-05-11T15:11:38.272382 #2076912] INFO -- : [393/885] 2118285=test_nesting_parser I, [2024-05-11T15:11:38.287055 #2076912] INFO -- : [394/885] 2118285=test_win32ole_method_event I, [2024-05-11T15:11:38.290689 #2076912] INFO -- : [395/885] 2118285=test_benchmark I, [2024-05-11T15:11:38.309056 #2076912] INFO -- : [396/885] 2118292=test_gem_dependency_list I, [2024-05-11T15:11:38.375825 #2076912] INFO -- : [397/885] 2118292=test_evaluation I, [2024-05-11T15:11:38.397890 #2076912] INFO -- : [398/885] 2118292=test_gem_ext_builder I, [2024-05-11T15:11:38.522047 #2076912] INFO -- : [399/885] 2118290=test_https I, [2024-05-11T15:11:38.523614 #2076912] INFO -- : [400/885] 2118282=test_load I, [2024-05-11T15:11:38.528659 #2076912] INFO -- : [401/885] 2118282=test_yamldbm I, [2024-05-11T15:11:38.532951 #2076912] INFO -- : [402/885] 2118282=test_gem_commands_rebuild_command I, [2024-05-11T15:11:38.584441 #2076912] INFO -- : [403/885] 2118282=test_rdoc_parser_simple I, [2024-05-11T15:11:38.613797 #2076912] INFO -- : [404/885] 2118282=test_provider I, [2024-05-11T15:11:38.677279 #2076912] INFO -- : [405/885] 2118278=test_abi I, [2024-05-11T15:11:38.805747 #2076912] INFO -- : [406/885] 2118286=test_gem_commands_cert_command I, [2024-05-11T15:11:38.861114 #2076912] INFO -- : [407/885] 2118290=test_completion I, [2024-05-11T15:11:38.863697 #2076912] INFO -- : [408/885] 2118287=test_yield_block I, [2024-05-11T15:11:38.866055 #2076912] INFO -- : [409/885] 2118287=test_len I, [2024-05-11T15:11:38.872095 #2076912] INFO -- : [410/885] 2118287=test_gem_source_installed I, [2024-05-11T15:11:38.878999 #2076912] INFO -- : [411/885] 2118282=test_erb I, [2024-05-11T15:11:38.881736 #2076912] INFO -- : [412/885] 2118278=test_x509ext I, [2024-05-11T15:11:38.882487 #2076912] INFO -- : [413/885] 2118287=test_propertyputref I, [2024-05-11T15:11:38.883727 #2076912] INFO -- : [414/885] 2118278=attribute_write_test I, [2024-05-11T15:11:38.885811 #2076912] INFO -- : [415/885] 2118287=test_spell_checker I, [2024-05-11T15:11:38.888067 #2076912] INFO -- : [416/885] 2118278=test_assembler I, [2024-05-11T15:11:38.888368 #2076912] INFO -- : [417/885] 2118278=test_rational2 I, [2024-05-11T15:11:38.893720 #2076912] INFO -- : [418/885] 2118287=test_rational I, [2024-05-11T15:11:38.896941 #2076912] INFO -- : [419/885] 2118278=test_gem_request_set I, [2024-05-11T15:11:38.907964 #2076912] INFO -- : [420/885] 2118287=test_module I, [2024-05-11T15:11:38.939357 #2076912] INFO -- : [421/885] 2118274=test_ssl I, [2024-05-11T15:11:38.941480 #2076912] INFO -- : [422/885] 2118282=test_gem_ext_cargo_builder I, [2024-05-11T15:11:38.962592 #2076912] INFO -- : [423/885] 2118282=constant_path_node_test I, [2024-05-11T15:11:38.967219 #2076912] INFO -- : [424/885] 2118282=test_parser I, [2024-05-11T15:11:39.008895 #2076912] INFO -- : [425/885] 2118282=test_method_name_check I, [2024-05-11T15:11:39.047501 #2076912] INFO -- : [426/885] 2118282=test_arith_seq_extract I, [2024-05-11T15:11:39.204611 #2076912] INFO -- : [427/885] 2118292=test_rdoc_generator_markup I, [2024-05-11T15:11:39.208754 #2076912] INFO -- : [428/885] 2118278=test_whileuntil I, [2024-05-11T15:11:39.212820 #2076912] INFO -- : [429/885] 2118278=test_monitor I, [2024-05-11T15:11:39.256573 #2076912] INFO -- : [430/885] 2118282=test_buffered_io I, [2024-05-11T15:11:39.291995 #2076912] INFO -- : [431/885] 2118292=test_rubyvm I, [2024-05-11T15:11:39.296207 #2076912] INFO -- : [432/885] 2118292=test_configuration I, [2024-05-11T15:11:39.320756 #2076912] INFO -- : [433/885] 2118290=test_stringify_symbols I, [2024-05-11T15:11:39.320814 #2076912] INFO -- : [434/885] 2118282=test_instrumentation_api I, [2024-05-11T15:11:39.331842 #2076912] INFO -- : [435/885] 2118290=integer_parse_test I, [2024-05-11T15:11:39.337526 #2076912] INFO -- : [436/885] 2118290=test_boolean I, [2024-05-11T15:11:39.343135 #2076912] INFO -- : [437/885] 2118290=test_rdoc_include I, [2024-05-11T15:11:39.376324 #2076912] INFO -- : [438/885] 2118290=test_reqarg I, [2024-05-11T15:11:39.391748 #2076912] INFO -- : [439/885] 2118292=test_gem_commands_list_command I, [2024-05-11T15:11:39.405360 #2076912] INFO -- : [440/885] 2118292=test_stack I, [2024-05-11T15:11:39.421855 #2076912] INFO -- : [441/885] 2118278=test_too_many_dummy_encodings I, [2024-05-11T15:11:39.499757 #2076912] INFO -- : [442/885] 2118278=test_gem_version I, [2024-05-11T15:11:39.570151 #2076912] INFO -- : [443/885] 2118285=test_rdoc_options I, [2024-05-11T15:11:39.584384 #2076912] INFO -- : [444/885] 2118278=test_econv I, [2024-05-11T15:11:39.588860 #2076912] INFO -- : [445/885] 2118275=test_cesu8 I, [2024-05-11T15:11:39.591886 #2076912] INFO -- : [446/885] 2118275=test_string_processing I, [2024-05-11T15:11:39.644968 #2076912] INFO -- : [447/885] 2118281=test_fileutils I, [2024-05-11T15:11:39.652351 #2076912] INFO -- : [448/885] 2118275=test_emitter I, [2024-05-11T15:11:39.667615 #2076912] INFO -- : [449/885] 2118275=test_gem_commands_signin_command I, [2024-05-11T15:11:39.716685 #2076912] INFO -- : [450/885] 2118290=test_resource I, [2024-05-11T15:11:39.729672 #2076912] INFO -- : [451/885] 2118276=test_ldap I, [2024-05-11T15:11:39.732829 #2076912] INFO -- : [452/885] 2118290=test_gem_ext_ext_conf_builder I, [2024-05-11T15:11:39.748309 #2076912] INFO -- : [453/885] 2118276=test_frozen_error I, [2024-05-11T15:11:39.753705 #2076912] INFO -- : [454/885] 2118276=test_method_cache I, [2024-05-11T15:11:39.754855 #2076912] INFO -- : [455/885] 2118276=test_gem_stub_specification I, [2024-05-11T15:11:39.778052 #2076912] INFO -- : [456/885] 2118280=test_gem_commands_search_command I, [2024-05-11T15:11:39.786536 #2076912] INFO -- : [457/885] 2118280=test_complex I, [2024-05-11T15:11:39.808463 #2076912] INFO -- : [458/885] 2118285=test_inlinecache I, [2024-05-11T15:11:39.860852 #2076912] INFO -- : [459/885] 2118285=test_rdoc_markup_verbatim I, [2024-05-11T15:11:39.864855 #2076912] INFO -- : [460/885] 2118285=test_gem_resolver_specification I, [2024-05-11T15:11:39.891832 #2076912] INFO -- : [461/885] 2118285=test_gem_dependency I, [2024-05-11T15:11:39.907464 #2076912] INFO -- : [462/885] 2118275=test_path_to_class I, [2024-05-11T15:11:39.909579 #2076912] INFO -- : [463/885] 2118275=test_mdns I, [2024-05-11T15:11:39.917930 #2076912] INFO -- : [464/885] 2118273=test_parse I, [2024-05-11T15:11:39.923258 #2076912] INFO -- : [465/885] 2118280=test_gem_remote_fetcher I, [2024-05-11T15:11:39.923738 #2076912] INFO -- : [466/885] 2118275=test_scanner_events I, [2024-05-11T15:11:39.949397 #2076912] INFO -- : [467/885] 2118281=test_gem_resolver_installed_specification I, [2024-05-11T15:11:39.967188 #2076912] INFO -- : [468/885] 2118275=test_date_strftime I, [2024-05-11T15:11:39.992537 #2076912] INFO -- : [469/885] 2118281=test_rdoc_parser_rd I, [2024-05-11T15:11:40.011586 #2076912] INFO -- : [470/885] 2118285=test_yamlstore I, [2024-05-11T15:11:40.019769 #2076912] INFO -- : [471/885] 2118285=test_gem_installer I, [2024-05-11T15:11:40.052668 #2076912] INFO -- : [472/885] 2118277=test_rdoc_normal_class I, [2024-05-11T15:11:40.054612 #2076912] INFO -- : [473/885] 2118276=test_class I, [2024-05-11T15:11:40.107900 #2076912] INFO -- : [474/885] 2118277=test_const I, [2024-05-11T15:11:40.111674 #2076912] INFO -- : [475/885] 2118277=json_string_matching_test I, [2024-05-11T15:11:40.118958 #2076912] INFO -- : [476/885] 2118277=test_load I, [2024-05-11T15:11:40.128724 #2076912] INFO -- : [477/885] 2118277=test_random I, [2024-05-11T15:11:40.130023 #2076912] INFO -- : [478/885] 2118277=test_asn1 I, [2024-05-11T15:11:40.146564 #2076912] INFO -- : [479/885] 2118277=test_irb I, [2024-05-11T15:11:40.166216 #2076912] INFO -- : [480/885] 2118281=test_function I, [2024-05-11T15:11:40.223408 #2076912] INFO -- : [481/885] 2118292=test_queue I, [2024-05-11T15:11:40.230786 #2076912] INFO -- : [482/885] 2118292=test_tempfile I, [2024-05-11T15:11:40.309525 #2076912] INFO -- : [483/885] 2118275=test_noarg I, [2024-05-11T15:11:40.313934 #2076912] INFO -- : [484/885] 2118277=parse_comments_test I, [2024-05-11T15:11:40.316147 #2076912] INFO -- : [485/885] 2118277=test_utf32 I, [2024-05-11T15:11:40.321882 #2076912] INFO -- : [486/885] 2118277=test_basicsocket I, [2024-05-11T15:11:40.326996 #2076912] INFO -- : [487/885] 2118277=test_duplicate I, [2024-05-11T15:11:40.327563 #2076912] INFO -- : [488/885] 2118277=test_gem_commands_help_command I, [2024-05-11T15:11:40.372728 #2076912] INFO -- : [489/885] 2118277=test_rdoc_markup I, [2024-05-11T15:11:40.378797 #2076912] INFO -- : [490/885] 2118281=test_prettyprint I, [2024-05-11T15:11:40.382015 #2076912] INFO -- : [491/885] 2118277=test_tracepoint I, [2024-05-11T15:11:40.397059 #2076912] INFO -- : [492/885] 2118281=test_internal_ivar I, [2024-05-11T15:11:40.401368 #2076912] INFO -- : [493/885] 2118281=test_gem_resolver_index_specification I, [2024-05-11T15:11:40.419903 #2076912] INFO -- : [494/885] 2118273=test_marshalable I, [2024-05-11T15:11:40.424006 #2076912] INFO -- : [495/885] 2118273=test_digest I, [2024-05-11T15:11:40.449190 #2076912] INFO -- : [496/885] 2118281=test_gem_ext_cmake_builder I, [2024-05-11T15:11:40.464373 #2076912] INFO -- : [497/885] 2118281=test_gem_commands_contents_command I, [2024-05-11T15:11:40.488327 #2076912] INFO -- : [498/885] 2118275=test_cgi_util I, [2024-05-11T15:11:40.527044 #2076912] INFO -- : [499/885] 2118281=test_require I, [2024-05-11T15:11:40.541013 #2076912] INFO -- : [500/885] 2118292=test_fiddle I, [2024-05-11T15:11:40.549933 #2076912] INFO -- : [501/885] 2118277=test_wss I, [2024-05-11T15:11:40.553609 #2076912] INFO -- : [502/885] 2118277=test_ractor I, [2024-05-11T15:11:40.601368 #2076912] INFO -- : [503/885] 2118278=test_find I, [2024-05-11T15:11:40.621536 #2076912] INFO -- : [504/885] 2118278=test_rdoc_encoding I, [2024-05-11T15:11:40.625432 #2076912] INFO -- : [505/885] 2118292=test_coverage I, [2024-05-11T15:11:40.639104 #2076912] INFO -- : [506/885] 2118287=regexp_test I, [2024-05-11T15:11:40.648890 #2076912] INFO -- : [507/885] 2118287=test_gem_package_tar_reader I, [2024-05-11T15:11:40.648997 #2076912] INFO -- : [508/885] 2118278=test_complexrational I, [2024-05-11T15:11:40.654327 #2076912] INFO -- : [509/885] 2118278=test_init I, [2024-05-11T15:11:40.669327 #2076912] INFO -- : [510/885] 2118277=test_pathname I, [2024-05-11T15:11:40.670184 #2076912] INFO -- : [511/885] 2118291=test_rdoc_markdown I, [2024-05-11T15:11:40.673168 #2076912] INFO -- : [512/885] 2118287=test_gem_available_set I, [2024-05-11T15:11:40.684629 #2076912] INFO -- : [513/885] 2118275=test_rdoc_any_method I, [2024-05-11T15:11:40.734712 #2076912] INFO -- : [514/885] 2118287=test_modify_expand I, [2024-05-11T15:11:40.739373 #2076912] INFO -- : [515/885] 2118287=test_file I, [2024-05-11T15:11:40.756142 #2076912] INFO -- : [516/885] 2118287=test_deprecate I, [2024-05-11T15:11:40.757161 #2076912] INFO -- : [517/885] 2118279=test_rdoc_constant I, [2024-05-11T15:11:40.790733 #2076912] INFO -- : [518/885] 2118287=test_bash_completion I, [2024-05-11T15:11:40.797381 #2076912] INFO -- : [519/885] 2118287=test_formatter I, [2024-05-11T15:11:40.806144 #2076912] INFO -- : [520/885] 2118287=test_gem_source_vendor I, [2024-05-11T15:11:40.809651 #2076912] INFO -- : [521/885] 2118290=test_gem_commands_owner_command I, [2024-05-11T15:11:40.814305 #2076912] INFO -- : [522/885] 2118287=test_recorder I, [2024-05-11T15:11:40.819969 #2076912] INFO -- : [523/885] 2118287=test_big2str I, [2024-05-11T15:11:40.823444 #2076912] INFO -- : [524/885] 2118287=test_yaml I, [2024-05-11T15:11:40.830871 #2076912] INFO -- : [525/885] 2118277=test_forwardable I, [2024-05-11T15:11:40.839860 #2076912] INFO -- : [526/885] 2118291=test_wait I, [2024-05-11T15:11:40.842473 #2076912] INFO -- : [527/885] 2118277=test_handle I, [2024-05-11T15:11:40.883557 #2076912] INFO -- : [528/885] 2118287=test_nowrite I, [2024-05-11T15:11:40.895118 #2076912] INFO -- : [529/885] 2118287=test_thread_queue I, [2024-05-11T15:11:40.895908 #2076912] INFO -- : [530/885] 2118291=test_rdoc_markup_formatter I, [2024-05-11T15:11:40.903072 #2076912] INFO -- : [531/885] 2118291=test_bmethod I, [2024-05-11T15:11:40.908968 #2076912] INFO -- : [532/885] 2118291=test_ractor I, [2024-05-11T15:11:40.919468 #2076912] INFO -- : [533/885] 2118291=test_euc_tw I, [2024-05-11T15:11:40.922814 #2076912] INFO -- : [534/885] 2118291=test_gem_commands_sources_command I, [2024-05-11T15:11:41.011996 #2076912] INFO -- : [535/885] 2118278=test_ansi_without_terminfo I, [2024-05-11T15:11:41.014401 #2076912] INFO -- : [536/885] 2118278=test_io_timeout I, [2024-05-11T15:11:41.018745 #2076912] INFO -- : [537/885] 2118278=test_shapes I, [2024-05-11T15:11:41.020371 #2076912] INFO -- : [538/885] 2118278=json_fixtures_test I, [2024-05-11T15:11:41.029184 #2076912] INFO -- : [539/885] 2118278=test_comparable I, [2024-05-11T15:11:41.033133 #2076912] INFO -- : [540/885] 2118278=test_rdoc_parser_c I, [2024-05-11T15:11:41.060394 #2076912] INFO -- : [541/885] 2118275=test_gbk I, [2024-05-11T15:11:41.064060 #2076912] INFO -- : [542/885] 2118275=test_class2name I, [2024-05-11T15:11:41.067654 #2076912] INFO -- : [543/885] 2118275=test_enc_str_buf_cat I, [2024-05-11T15:11:41.071223 #2076912] INFO -- : [544/885] 2118275=test_pstore I, [2024-05-11T15:11:41.076588 #2076912] INFO -- : [545/885] 2118279=test_cstr I, [2024-05-11T15:11:41.096105 #2076912] INFO -- : [546/885] 2118291=test_profile_frames I, [2024-05-11T15:11:41.096800 #2076912] INFO -- : [547/885] 2118275=test_rdoc_markup_indented_paragraph I, [2024-05-11T15:11:41.101356 #2076912] INFO -- : [548/885] 2118275=test_rdoc_task I, [2024-05-11T15:11:41.106545 #2076912] INFO -- : [549/885] 2118275=test_gem_resolver_conflict I, [2024-05-11T15:11:41.113488 #2076912] INFO -- : [550/885] 2118277=test_pack I, [2024-05-11T15:11:41.119917 #2076912] INFO -- : [551/885] 2118275=test_backtrace I, [2024-05-11T15:11:41.137091 #2076912] INFO -- : [552/885] 2118277=ruby_parser_test I, [2024-05-11T15:11:41.137265 #2076912] INFO -- : [553/885] 2118277=test_io_buffer I, [2024-05-11T15:11:41.233878 #2076912] INFO -- : [554/885] 2118273=test_readpartial I, [2024-05-11T15:11:41.243848 #2076912] INFO -- : [555/885] 2118277=test_gem_commands_install_command I, [2024-05-11T15:11:41.281022 #2076912] INFO -- : [556/885] 2118278=test_clone I, [2024-05-11T15:11:41.285831 #2076912] INFO -- : [557/885] 2118291=test_rdoc_require I, [2024-05-11T15:11:41.299651 #2076912] INFO -- : [558/885] 2118292=locals_test I, [2024-05-11T15:11:41.330918 #2076912] INFO -- : [559/885] 2118291=encoding_test I, [2024-05-11T15:11:41.362919 #2076912] INFO -- : [560/885] 2118290=test_gem_resolver_best_set I, [2024-05-11T15:11:41.434295 #2076912] INFO -- : [561/885] 2118290=test_typeddata I, [2024-05-11T15:11:41.450911 #2076912] INFO -- : [562/885] 2118279=test_rdoc_markup_to_html_crossref I, [2024-05-11T15:11:41.467370 #2076912] INFO -- : [563/885] 2118278=test_webauthn_poller I, [2024-05-11T15:11:41.481212 #2076912] INFO -- : [564/885] 2118291=test_rdoc_markup_raw I, [2024-05-11T15:11:41.485944 #2076912] INFO -- : [565/885] 2118291=test_rat I, [2024-05-11T15:11:41.494623 #2076912] INFO -- : [566/885] 2118291=test_optparse I, [2024-05-11T15:11:41.494742 #2076912] INFO -- : [567/885] 2118291=test_array I, [2024-05-11T15:11:41.505314 #2076912] INFO -- : [568/885] 2118291=test_fstring I, [2024-05-11T15:11:41.549749 #2076912] INFO -- : [569/885] 2118289=test_yield I, [2024-05-11T15:11:41.587625 #2076912] INFO -- : [570/885] 2118291=test_rdoc_alias I, [2024-05-11T15:11:41.594461 #2076912] INFO -- : [571/885] 2118291=parser_test I, [2024-05-11T15:11:41.597133 #2076912] INFO -- : [572/885] 2118291=test_convertible I, [2024-05-11T15:11:41.610303 #2076912] INFO -- : [573/885] 2118278=test_files_sample I, [2024-05-11T15:11:41.611414 #2076912] INFO -- : [574/885] 2118278=test_stringscanner I, [2024-05-11T15:11:41.627120 #2076912] INFO -- : [575/885] 2118290=test_gem_util I, [2024-05-11T15:11:41.639171 #2076912] INFO -- : [576/885] 2118273=test_iseq_load I, [2024-05-11T15:11:41.650749 #2076912] INFO -- : [577/885] 2118278=test_gem_package_tar_header I, [2024-05-11T15:11:41.658914 #2076912] INFO -- : [578/885] 2118276=test_pkey_dh I, [2024-05-11T15:11:41.695860 #2076912] INFO -- : [579/885] 2118280=test_bigzero I, [2024-05-11T15:11:41.699911 #2076912] INFO -- : [580/885] 2118280=test_pkcs12 I, [2024-05-11T15:11:41.703843 #2076912] INFO -- : [581/885] 2118278=test_system I, [2024-05-11T15:11:41.719123 #2076912] INFO -- : [582/885] 2118292=test_etc I, [2024-05-11T15:11:41.722477 #2076912] INFO -- : [583/885] 2118281=test_yjit_exit_locations I, [2024-05-11T15:11:41.725092 #2076912] INFO -- : [584/885] 2118281=test_gem_resolver_activation_request I, [2024-05-11T15:11:41.731715 #2076912] INFO -- : [585/885] 2118281=test_getopts I, [2024-05-11T15:11:41.733643 #2076912] INFO -- : [586/885] 2118276=test_protocol I, [2024-05-11T15:11:41.734606 #2076912] INFO -- : [587/885] 2118281=test_ripper I, [2024-05-11T15:11:41.737089 #2076912] INFO -- : [588/885] 2118279=test_gem_config_file I, [2024-05-11T15:11:41.779669 #2076912] INFO -- : [589/885] 2118290=test_config I, [2024-05-11T15:11:41.805065 #2076912] INFO -- : [590/885] 2118292=test_sleep I, [2024-05-11T15:11:41.809466 #2076912] INFO -- : [591/885] 2118290=test_gem_commands_fetch_command I, [2024-05-11T15:11:41.888087 #2076912] INFO -- : [592/885] 2118279=test_math I, [2024-05-11T15:11:41.890445 #2076912] INFO -- : [593/885] 2118290=test_gc I, [2024-05-11T15:11:41.893253 #2076912] INFO -- : [594/885] 2118290=test_libs I, [2024-05-11T15:11:41.897338 #2076912] INFO -- : [595/885] 2118279=test_yaml_tree I, [2024-05-11T15:11:41.902728 #2076912] INFO -- : [596/885] 2118290=test_rendering I, [2024-05-11T15:11:41.905646 #2076912] INFO -- : [597/885] 2118290=test_face I, [2024-05-11T15:11:41.930127 #2076912] INFO -- : [598/885] 2118290=test_sizeof I, [2024-05-11T15:11:41.941698 #2076912] INFO -- : [599/885] 2118279=test_case I, [2024-05-11T15:11:41.970223 #2076912] INFO -- : [600/885] 2118279=test_unicode_escape I, [2024-05-11T15:11:42.046856 #2076912] INFO -- : [601/885] 2118276=test_io I, [2024-05-11T15:11:42.058177 #2076912] INFO -- : [602/885] 2118279=test_utf16 I, [2024-05-11T15:11:42.060426 #2076912] INFO -- : [603/885] 2118280=test_autoload I, [2024-05-11T15:11:42.076570 #2076912] INFO -- : [604/885] 2118279=test_date_attr I, [2024-05-11T15:11:42.080649 #2076912] INFO -- : [605/885] 2118279=test_ellipsize I, [2024-05-11T15:11:42.093363 #2076912] INFO -- : [606/885] 2118281=test_kwargs I, [2024-05-11T15:11:42.094303 #2076912] INFO -- : [607/885] 2118279=warnings_test I, [2024-05-11T15:11:42.099023 #2076912] INFO -- : [608/885] 2118281=test_io_wait I, [2024-05-11T15:11:42.128249 #2076912] INFO -- : [609/885] 2118279=test_gem_commands_exec_command I, [2024-05-11T15:11:42.163337 #2076912] INFO -- : [610/885] 2118273=test_type_completor I, [2024-05-11T15:11:42.167080 #2076912] INFO -- : [611/885] 2118273=test_summary I, [2024-05-11T15:11:42.205876 #2076912] INFO -- : [612/885] 2118273=test_console_attr I, [2024-05-11T15:11:42.210467 #2076912] INFO -- : [613/885] 2118273=test_gem_commands_uninstall_command I, [2024-05-11T15:11:42.299347 #2076912] INFO -- : [614/885] 2118282=test_foreach I, [2024-05-11T15:11:42.308455 #2076912] INFO -- : [615/885] 2118282=test_gem_source_specific_file I, [2024-05-11T15:11:42.320296 #2076912] INFO -- : [616/885] 2118277=test_condition I, [2024-05-11T15:11:42.325002 #2076912] INFO -- : [617/885] 2118277=test_cp949 I, [2024-05-11T15:11:42.329321 #2076912] INFO -- : [618/885] 2118277=test_win32ole_record I, [2024-05-11T15:11:42.335137 #2076912] INFO -- : [619/885] 2118277=test_gem_unsatisfiable_dependency_error I, [2024-05-11T15:11:42.350601 #2076912] INFO -- : [620/885] 2118277=test_ubf_async_safe I, [2024-05-11T15:11:42.351315 #2076912] INFO -- : [621/885] 2118286=test_hash I, [2024-05-11T15:11:42.367900 #2076912] INFO -- : [622/885] 2118277=test_sorted_set I, [2024-05-11T15:11:42.381646 #2076912] INFO -- : [623/885] 2118282=test_win32ole_type_event I, [2024-05-11T15:11:42.385577 #2076912] INFO -- : [624/885] 2118282=test_emoji I, [2024-05-11T15:11:42.406029 #2076912] INFO -- : [625/885] 2118282=test_io I, [2024-05-11T15:11:42.425340 #2076912] INFO -- : [626/885] 2118281=test_to_ruby I, [2024-05-11T15:11:42.426655 #2076912] INFO -- : [627/885] 2118275=test_pattern_key_name_check I, [2024-05-11T15:11:42.434120 #2076912] INFO -- : [628/885] 2118275=test_array_create I, [2024-05-11T15:11:42.437621 #2076912] INFO -- : [629/885] 2118275=test_pack I, [2024-05-11T15:11:42.443573 #2076912] INFO -- : [630/885] 2118281=test_gem_impossible_dependencies_error I, [2024-05-11T15:11:42.453672 #2076912] INFO -- : [631/885] 2118281=test_gem_commands_query_command I, [2024-05-11T15:11:42.541076 #2076912] INFO -- : [632/885] 2118278=test_method I, [2024-05-11T15:11:42.613859 #2076912] INFO -- : [633/885] 2118282=test_rdoc_rubygems_hook I, [2024-05-11T15:11:42.617075 #2076912] INFO -- : [634/885] 2118275=test_rdoc_context_section I, [2024-05-11T15:11:42.621264 #2076912] INFO -- : [635/885] 2118277=test_euc_kr I, [2024-05-11T15:11:42.623676 #2076912] INFO -- : [636/885] 2118275=test_ftp I, [2024-05-11T15:11:42.628660 #2076912] INFO -- : [637/885] 2118277=comments_test I, [2024-05-11T15:11:42.632386 #2076912] INFO -- : [638/885] 2118275=test_sprintf I, [2024-05-11T15:11:42.634312 #2076912] INFO -- : [639/885] 2118277=test_gem_requirement I, [2024-05-11T15:11:42.706456 #2076912] INFO -- : [640/885] 2118282=test_string_memory I, [2024-05-11T15:11:42.772548 #2076912] INFO -- : [641/885] 2118273=test_gem_security_trust_dir I, [2024-05-11T15:11:42.792810 #2076912] INFO -- : [642/885] 2118275=test_undef I, [2024-05-11T15:11:42.796422 #2076912] INFO -- : [643/885] 2118275=test_line_editor I, [2024-05-11T15:11:42.796783 #2076912] INFO -- : [644/885] 2118282=test_objspace I, [2024-05-11T15:11:42.797931 #2076912] INFO -- : [645/885] 2118273=ripper_test I, [2024-05-11T15:11:42.798560 #2076912] INFO -- : [646/885] 2118281=test_have_library I, [2024-05-11T15:11:42.803833 #2076912] INFO -- : [647/885] 2118275=test_remote_fetch_error I, [2024-05-11T15:11:42.812967 #2076912] INFO -- : [648/885] 2118275=test_c_struct_entry I, [2024-05-11T15:11:42.835916 #2076912] INFO -- : [649/885] 2118277=test_lock_native_thread I, [2024-05-11T15:11:43.042009 #2076912] INFO -- : [650/885] 2118279=test_gem_commands_stale_command I, [2024-05-11T15:11:43.052128 #2076912] INFO -- : [651/885] 2118279=test_set I, [2024-05-11T15:11:43.057435 #2076912] INFO -- : [652/885] 2118279=test_show_source I, [2024-05-11T15:11:43.079258 #2076912] INFO -- : [653/885] 2118288=test_protect I, [2024-05-11T15:11:43.085564 #2076912] INFO -- : [654/885] 2118288=test_win32ole_typelib I, [2024-05-11T15:11:43.090653 #2076912] INFO -- : [655/885] 2118288=test_gem_request_set_lockfile I, [2024-05-11T15:11:43.099216 #2076912] INFO -- : [656/885] 2118277=test_raise_exception I, [2024-05-11T15:11:43.104149 #2076912] INFO -- : [657/885] 2118279=test_alias_and_anchor I, [2024-05-11T15:11:43.119355 #2076912] INFO -- : [658/885] 2118279=test_postponed_job I, [2024-05-11T15:11:43.134773 #2076912] INFO -- : [659/885] 2118275=test_external_new I, [2024-05-11T15:11:43.138996 #2076912] INFO -- : [660/885] 2118275=test_tree_builder I, [2024-05-11T15:11:43.144232 #2076912] INFO -- : [661/885] 2118275=test_gem_resolver_dependency_request I, [2024-05-11T15:11:43.150400 #2076912] INFO -- : [662/885] 2118289=test_hash I, [2024-05-11T15:11:43.164596 #2076912] INFO -- : [663/885] 2118289=test_kill_ring I, [2024-05-11T15:11:43.168456 #2076912] INFO -- : [664/885] 2118275=test_ns_spki I, [2024-05-11T15:11:43.196269 #2076912] INFO -- : [665/885] 2118275=test_framework I, [2024-05-11T15:11:43.211487 #2076912] INFO -- : [666/885] 2118289=test_argf I, [2024-05-11T15:11:43.220774 #2076912] INFO -- : [667/885] 2118275=test_gem_commands_environment_command I, [2024-05-11T15:11:43.256523 #2076912] INFO -- : [668/885] 2118273=test_m17n I, [2024-05-11T15:11:43.272738 #2076912] INFO -- : [669/885] 2118275=test_ws I, [2024-05-11T15:11:43.278271 #2076912] INFO -- : [670/885] 2118275=test_yjit I, [2024-05-11T15:11:43.282457 #2076912] INFO -- : [671/885] 2118275=test_weakmap I, [2024-05-11T15:11:43.321828 #2076912] INFO -- : [672/885] 2118273=test_workspace I, [2024-05-11T15:11:43.413657 #2076912] INFO -- : [673/885] 2118288=test_rdoc_tom_doc I, [2024-05-11T15:11:43.462735 #2076912] INFO -- : [674/885] 2118279=test_hmac I, [2024-05-11T15:11:43.468913 #2076912] INFO -- : [675/885] 2118279=test_rdoc_markup_to_tt_only I, [2024-05-11T15:11:43.485190 #2076912] INFO -- : [676/885] 2118273=test_gem_spec_fetcher I, [2024-05-11T15:11:43.492238 #2076912] INFO -- : [677/885] 2118279=test_common I, [2024-05-11T15:11:43.536808 #2076912] INFO -- : [678/885] 2118288=test_bug-3571 I, [2024-05-11T15:11:43.551656 #2076912] INFO -- : [679/885] 2118288=test_key_actor_vi I, [2024-05-11T15:11:43.646329 #2076912] INFO -- : [680/885] 2118279=test_gem_command I, [2024-05-11T15:11:43.677931 #2076912] INFO -- : [681/885] 2118273=test_gem_commands_lock_command I, [2024-05-11T15:11:43.695164 #2076912] INFO -- : [682/885] 2118288=test_assignment I, [2024-05-11T15:11:43.701209 #2076912] INFO -- : [683/885] 2118273=test_ifunless I, [2024-05-11T15:11:43.705254 #2076912] INFO -- : [684/885] 2118273=test_numeric I, [2024-05-11T15:11:43.721774 #2076912] INFO -- : [685/885] 2118279=test_config I, [2024-05-11T15:11:43.734420 #2076912] INFO -- : [686/885] 2118279=test_optarg I, [2024-05-11T15:11:43.741152 #2076912] INFO -- : [687/885] 2118277=test_yaml_special_cases I, [2024-05-11T15:11:43.764222 #2076912] INFO -- : [688/885] 2118277=test_gem_source_list I, [2024-05-11T15:11:43.774071 #2076912] INFO -- : [689/885] 2118273=test_address_resolve I, [2024-05-11T15:11:43.788015 #2076912] INFO -- : [690/885] 2118273=test_rdoc_token_stream I, [2024-05-11T15:11:43.793628 #2076912] INFO -- : [691/885] 2118273=test_iter_break I, [2024-05-11T15:11:43.796878 #2076912] INFO -- : [692/885] 2118273=test_zsh_completion I, [2024-05-11T15:11:43.802395 #2076912] INFO -- : [693/885] 2118273=test_exception I, [2024-05-11T15:11:43.807642 #2076912] INFO -- : [694/885] 2118273=test_frozen I, [2024-05-11T15:11:43.810733 #2076912] INFO -- : [695/885] 2118277=test_gem_ext_configure_builder I, [2024-05-11T15:11:43.810809 #2076912] INFO -- : [696/885] 2118281=test_pp I, [2024-05-11T15:11:43.811440 #2076912] INFO -- : [697/885] 2118273=test_macro I, [2024-05-11T15:11:43.815363 #2076912] INFO -- : [698/885] 2118273=test_rdoc_single_class I, [2024-05-11T15:11:43.819353 #2076912] INFO -- : [699/885] 2118273=test_num2int I, [2024-05-11T15:11:43.827532 #2076912] INFO -- : [700/885] 2118273=test_nil I, [2024-05-11T15:11:43.832060 #2076912] INFO -- : [701/885] 2118273=test_verbose I, [2024-05-11T15:11:43.833961 #2076912] INFO -- : [702/885] 2118277=test_gem_silent_ui I, [2024-05-11T15:11:43.841216 #2076912] INFO -- : [703/885] 2118279=test_emitter I, [2024-05-11T15:11:43.847212 #2076912] INFO -- : [704/885] 2118281=test_files_ext I, [2024-05-11T15:11:43.847285 #2076912] INFO -- : [705/885] 2118279=test_bug-5832 I, [2024-05-11T15:11:43.849081 #2076912] INFO -- : [706/885] 2118273=test_eval_history I, [2024-05-11T15:11:43.850674 #2076912] INFO -- : [707/885] 2118279=dispatcher_test I, [2024-05-11T15:11:43.853148 #2076912] INFO -- : [708/885] 2118292=test_kernel I, [2024-05-11T15:11:43.864743 #2076912] INFO -- : [709/885] 2118277=test_gem_doctor I, [2024-05-11T15:11:43.865199 #2076912] INFO -- : [710/885] 2118279=test_kdf I, [2024-05-11T15:11:43.867634 #2076912] INFO -- : [711/885] 2118273=test_rdoc_markup_paragraph I, [2024-05-11T15:11:43.869089 #2076912] INFO -- : [712/885] 2118273=!Nothing_to_test I, [2024-05-11T15:11:43.869859 #2076912] INFO -- : [713/885] 2118273=test_enc_raise I, [2024-05-11T15:11:43.873778 #2076912] INFO -- : [714/885] 2118273=test_psych I, [2024-05-11T15:11:43.894986 #2076912] INFO -- : [715/885] 2118273=test_gem_ext_cargo_builder_unit I, [2024-05-11T15:11:43.898661 #2076912] INFO -- : [716/885] 2118277=test_gem_rdoc I, [2024-05-11T15:11:43.908394 #2076912] INFO -- : [717/885] 2118281=test_date I, [2024-05-11T15:11:43.911546 #2076912] INFO -- : [718/885] 2118281=test_at_exit I, [2024-05-11T15:11:43.912006 #2076912] INFO -- : [719/885] 2118273=test_command I, [2024-05-11T15:11:43.926793 #2076912] INFO -- : [720/885] 2118279=test_object_create_start I, [2024-05-11T15:11:43.929103 #2076912] INFO -- : [721/885] 2118279=test_rdoc_markup_attributes I, [2024-05-11T15:11:43.929843 #2076912] INFO -- : [722/885] 2118281=test_default_gems I, [2024-05-11T15:11:43.934907 #2076912] INFO -- : [723/885] 2118279=test_rdoc_markup_to_rdoc I, [2024-05-11T15:11:43.960782 #2076912] INFO -- : [724/885] 2118279=test_rdoc_rd_inline_parser I, [2024-05-11T15:11:43.970665 #2076912] INFO -- : [725/885] 2118281=test_mul I, [2024-05-11T15:11:43.978607 #2076912] INFO -- : [726/885] 2118281=test_null I, [2024-05-11T15:11:43.980626 #2076912] INFO -- : [727/885] 2118281=test_win32ole_type I, [2024-05-11T15:11:43.984640 #2076912] INFO -- : [728/885] 2118279=test_pkey_ec I, [2024-05-11T15:11:43.984705 #2076912] INFO -- : [729/885] 2118281=test_thread I, [2024-05-11T15:11:43.990574 #2076912] INFO -- : [730/885] 2118281=test_trick I, [2024-05-11T15:11:43.990984 #2076912] INFO -- : [731/885] 2118277=test_pipe I, [2024-05-11T15:11:44.066849 #2076912] INFO -- : [732/885] 2118279=test_date_parse I, [2024-05-11T15:11:44.119446 #2076912] INFO -- : [733/885] 2118277=test_rdoc_i18n_text I, [2024-05-11T15:11:44.125214 #2076912] INFO -- : [734/885] 2118277=test_io_buffer I, [2024-05-11T15:11:44.130991 #2076912] INFO -- : [735/885] 2118273=test_key_name_check I, [2024-05-11T15:11:44.137005 #2076912] INFO -- : [736/885] 2118273=test_backtrace I, [2024-05-11T15:11:44.139023 #2076912] INFO -- : [737/885] 2118273=test_defined I, [2024-05-11T15:11:44.169608 #2076912] INFO -- : [738/885] 2118277=test_gb18030 I, [2024-05-11T15:11:44.173975 #2076912] INFO -- : [739/885] 2118277=test_buffering I, [2024-05-11T15:11:44.177522 #2076912] INFO -- : [740/885] 2118279=test_svcb_https I, [2024-05-11T15:11:44.182778 #2076912] INFO -- : [741/885] 2118277=test_gem_uninstaller I, [2024-05-11T15:11:44.198792 #2076912] INFO -- : [742/885] 2118279=test_rdoc_rdoc I, [2024-05-11T15:11:44.199656 #2076912] INFO -- : [743/885] 2118273=test_time I, [2024-05-11T15:11:44.300408 #2076912] INFO -- : [744/885] 2118279=test_windows_1251 I, [2024-05-11T15:11:44.303773 #2076912] INFO -- : [745/885] 2118279=test_gem_package_old I, [2024-05-11T15:11:44.312087 #2076912] INFO -- : [746/885] 2118273=test_gem_resolver_index_set I, [2024-05-11T15:11:44.335034 #2076912] INFO -- : [747/885] 2118279=test_gc_compact I, [2024-05-11T15:11:44.349421 #2076912] INFO -- : [748/885] 2118273=test_string I, [2024-05-11T15:11:44.421502 #2076912] INFO -- : [749/885] 2118290=test_proc I, [2024-05-11T15:11:44.456562 #2076912] INFO -- : [750/885] 2118292=test_date_conv I, [2024-05-11T15:11:44.471029 #2076912] INFO -- : [751/885] 2118292=test_optimization I, [2024-05-11T15:11:44.474636 #2076912] INFO -- : [752/885] 2118285=test_ole_methods I, [2024-05-11T15:11:44.486773 #2076912] INFO -- : [753/885] 2118285=test_erb_m17n I, [2024-05-11T15:11:44.490454 #2076912] INFO -- : [754/885] 2118285=test_egrep_cpp I, [2024-05-11T15:11:44.629372 #2076912] INFO -- : [755/885] 2118285=test_zlib I, [2024-05-11T15:11:45.151979 #2076912] INFO -- : [756/885] 2118277=test_cgi_tag_helper I, [2024-05-11T15:11:45.176028 #2076912] INFO -- : [757/885] 2118287=test_files_test_2 I, [2024-05-11T15:11:45.192504 #2076912] INFO -- : [758/885] 2118277=test_fnmatch I, [2024-05-11T15:11:45.212432 #2076912] INFO -- : [759/885] 2118290=test_rdoc_markup_parser I, [2024-05-11T15:11:45.231393 #2076912] INFO -- : [760/885] 2118277=test_require_path_check I, [2024-05-11T15:11:45.250683 #2076912] INFO -- : [761/885] 2118290=test_folderitem2_invokeverb I, [2024-05-11T15:11:45.271978 #2076912] INFO -- : [762/885] 2118290=test_gem_validator I, [2024-05-11T15:11:45.280052 #2076912] INFO -- : [763/885] 2118290=test_x509attr I, [2024-05-11T15:11:45.293183 #2076912] INFO -- : [764/885] 2118290=test_raise I, [2024-05-11T15:11:45.297201 #2076912] INFO -- : [765/885] 2118290=test_depth_first I, [2024-05-11T15:11:45.301094 #2076912] INFO -- : [766/885] 2118290=test_gem_request_set_lockfile_parser I, [2024-05-11T15:11:45.308162 #2076912] INFO -- : [767/885] 2118277=test_rdoc_store I, [2024-05-11T15:11:45.353787 #2076912] INFO -- : [768/885] 2118288=test_string I, [2024-05-11T15:11:45.399676 #2076912] INFO -- : [769/885] 2118288=test_rdoc_stats I, [2024-05-11T15:11:45.403024 #2076912] INFO -- : [770/885] 2118290=test_pattern_matching I, [2024-05-11T15:11:45.439446 #2076912] INFO -- : [771/885] 2118290=test_gem_dependency_resolution_error I, [2024-05-11T15:11:45.445415 #2076912] INFO -- : [772/885] 2118290=test_qsort I, [2024-05-11T15:11:45.450464 #2076912] INFO -- : [773/885] 2118290=test_rdoc_parser I, [2024-05-11T15:11:45.472826 #2076912] INFO -- : [774/885] 2118290=test_custom_command I, [2024-05-11T15:11:45.481707 #2076912] INFO -- : [775/885] 2118290=json_addition_test I, [2024-05-11T15:11:45.497464 #2076912] INFO -- : [776/885] 2118288=test_gem_version_option I, [2024-05-11T15:11:45.498213 #2076912] INFO -- : [777/885] 2118290=test_grapheme_breaks I, [2024-05-11T15:11:45.524299 #2076912] INFO -- : [778/885] 2118290=test_gem_request_connection_pools I, [2024-05-11T15:11:45.548924 #2076912] INFO -- : [779/885] 2118288=test_cclass I, [2024-05-11T15:11:45.662246 #2076912] INFO -- : [780/885] 2118288=test_parser_events I, [2024-05-11T15:11:45.735722 #2076912] INFO -- : [781/885] 2118288=test_reline I, [2024-05-11T15:11:45.871162 #2076912] INFO -- : [782/885] 2118277=test_case I, [2024-05-11T15:11:45.882301 #2076912] INFO -- : [783/885] 2118277=test_pkey I, [2024-05-11T15:11:45.913060 #2076912] INFO -- : [784/885] 2118277=test_json_tree I, [2024-05-11T15:11:45.918826 #2076912] INFO -- : [785/885] 2118277=test_rdoc_markup_to_markdown I, [2024-05-11T15:11:45.944951 #2076912] INFO -- : [786/885] 2118277=test_ansi_with_terminfo I, [2024-05-11T15:11:45.948507 #2076912] INFO -- : [787/885] 2118277=test_rdoc_generator_pot_po I, [2024-05-11T15:11:45.958528 #2076912] INFO -- : [788/885] 2118277=test_ractor I, [2024-05-11T15:11:45.986259 #2076912] INFO -- : [789/885] 2118291=test_m17n_comb I, [2024-05-11T15:11:46.008272 #2076912] INFO -- : [790/885] 2118277=test_memory_view I, [2024-05-11T15:11:46.029860 #2076912] INFO -- : [791/885] 2118288=test_extlibs I, [2024-05-11T15:11:46.077800 #2076912] INFO -- : [792/885] 2118281=test_rdoc_generator_ri I, [2024-05-11T15:11:46.088941 #2076912] INFO -- : [793/885] 2118281=test_gem_stream_ui I, [2024-05-11T15:11:46.161180 #2076912] INFO -- : [794/885] 2118281=test_gem_install_update_options I, [2024-05-11T15:11:46.223503 #2076912] INFO -- : [795/885] 2118277=parse_test I, [2024-05-11T15:11:46.271458 #2076912] INFO -- : [796/885] 2118280=test_require_lib I, [2024-05-11T15:11:46.304363 #2076912] INFO -- : [797/885] 2118281=test_ractor I, [2024-05-11T15:11:46.332507 #2076912] INFO -- : [798/885] 2118281=test_severity I, [2024-05-11T15:11:46.344633 #2076912] INFO -- : [799/885] 2118281=test_objectspace I, [2024-05-11T15:11:46.582388 #2076912] INFO -- : [800/885] 2118290=test_thread I, [2024-05-11T15:11:46.589742 #2076912] INFO -- : [801/885] 2118275=test_socket I, [2024-05-11T15:11:46.817614 #2076912] INFO -- : [802/885] 2118290=test_rdoc_markup_to_table_of_contents I, [2024-05-11T15:11:46.827253 #2076912] INFO -- : [803/885] 2118274=test_dot_dot I, [2024-05-11T15:11:46.832667 #2076912] INFO -- : [804/885] 2118274=test_c_struct_builder I, [2024-05-11T15:11:46.836799 #2076912] INFO -- : [805/885] 2118290=test_str2big I, [2024-05-11T15:11:46.842533 #2076912] INFO -- : [806/885] 2118290=test_literal I, [2024-05-11T15:11:46.940282 #2076912] INFO -- : [807/885] 2118274=test_store I, [2024-05-11T15:11:47.041393 #2076912] INFO -- : [808/885] 2118274=test_case_options I, [2024-05-11T15:11:47.044236 #2076912] INFO -- : [809/885] 2118274=test_gem_commands_info_command I, [2024-05-11T15:11:47.063993 #2076912] INFO -- : [810/885] 2118274=test_scalar I, [2024-05-11T15:11:47.067300 #2076912] INFO -- : [811/885] 2118274=test_gem_dependency_installer I, [2024-05-11T15:11:47.126912 #2076912] INFO -- : [812/885] 2118286=test_rdoc_cross_reference I, [2024-05-11T15:11:47.163172 #2076912] INFO -- : [813/885] 2118279=test_gem_package_tar_reader_entry I, [2024-05-11T15:11:47.259260 #2076912] INFO -- : [814/885] 2118281=test_gem_name_tuple I, [2024-05-11T15:11:47.275439 #2076912] INFO -- : [815/885] 2118281=test_rand I, [2024-05-11T15:11:47.410307 #2076912] INFO -- : [816/885] 2118278=test_bug_reporter I, [2024-05-11T15:11:47.452241 #2076912] INFO -- : [817/885] 2118279=test_exception I, [2024-05-11T15:11:47.498062 #2076912] INFO -- : [818/885] 2118289=test_sprintf_comb I, [2024-05-11T15:11:47.562271 #2076912] INFO -- : [819/885] 2118290=test_method_cache I, [2024-05-11T15:11:47.567959 #2076912] INFO -- : [820/885] 2118281=test_gem_request I, [2024-05-11T15:11:47.573639 #2076912] INFO -- : [821/885] 2118290=test_gem_ext_cargo_builder_link_flag_converter I, [2024-05-11T15:11:47.640131 #2076912] INFO -- : [822/885] 2118290=test_gem_commands_mirror I, [2024-05-11T15:11:47.652133 #2076912] INFO -- : [823/885] 2118290=test_gem_text I, [2024-05-11T15:11:47.692673 #2076912] INFO -- : [824/885] 2118288=test_settracefunc I, [2024-05-11T15:11:47.696588 #2076912] INFO -- : [825/885] 2118289=test_enumerator_kw I, [2024-05-11T15:11:47.699346 #2076912] INFO -- : [826/885] 2118289=test_scan_args I, [2024-05-11T15:11:47.717260 #2076912] INFO -- : [827/885] 2118286=test_generic I, [2024-05-11T15:11:47.725583 #2076912] INFO -- : [828/885] 2118289=test_win32ole I, [2024-05-11T15:11:47.725652 #2076912] INFO -- : [829/885] 2118289=test_gem_commands_specification_command I, [2024-05-11T15:11:47.729958 #2076912] INFO -- : [830/885] 2118290=test_flags I, [2024-05-11T15:11:47.750002 #2076912] INFO -- : [831/885] 2118281=test_inadvertent_creation I, [2024-05-11T15:11:47.781068 #2076912] INFO -- : [832/885] 2118278=test_enumerator I, [2024-05-11T15:11:47.792856 #2076912] INFO -- : [833/885] 2118286=test_http I, [2024-05-11T15:11:47.803082 #2076912] INFO -- : [834/885] 2118286=test_gem_commands_which_command I, [2024-05-11T15:11:47.836292 #2076912] INFO -- : [835/885] 2118286=test_shift_jis I, [2024-05-11T15:11:47.839938 #2076912] INFO -- : [836/885] 2118286=test_rdoc_markup_attribute_manager I, [2024-05-11T15:11:47.860393 #2076912] INFO -- : [837/885] 2118289=test_name_error I, [2024-05-11T15:11:47.881302 #2076912] INFO -- : [838/885] 2118281=test_gem_resolver I, [2024-05-11T15:11:47.899644 #2076912] INFO -- : [839/885] 2118286=test_safe_load I, [2024-05-11T15:11:47.915720 #2076912] INFO -- : [840/885] 2118286=test_gem_resolver_composed_set I, [2024-05-11T15:11:47.930697 #2076912] INFO -- : [841/885] 2118286=test_gem_commands_dependency_command I, [2024-05-11T15:11:48.012030 #2076912] INFO -- : [842/885] 2118286=test_nil2vtempty I, [2024-05-11T15:11:48.015583 #2076912] INFO -- : [843/885] 2118289=test_stream I, [2024-05-11T15:11:48.017334 #2076912] INFO -- : [844/885] 2118286=test_rdoc_context I, [2024-05-11T15:11:48.025662 #2076912] INFO -- : [845/885] 2118289=test_rdoc_parser_ruby I, [2024-05-11T15:11:48.030275 #2076912] INFO -- : [846/885] 2118291=test_httpresponse I, [2024-05-11T15:11:48.120381 #2076912] INFO -- : [847/885] 2118291=test_open-uri I, [2024-05-11T15:11:48.122180 #2076912] INFO -- : [848/885] 2118281=test_require I, [2024-05-11T15:11:48.125737 #2076912] INFO -- : [849/885] 2118281=test_date_time I, [2024-05-11T15:11:48.138298 #2076912] INFO -- : [850/885] 2118281=test_rdoc_markup_to_joined_paragraph I, [2024-05-11T15:11:48.144303 #2076912] INFO -- : [851/885] 2118281=test_data I, [2024-05-11T15:11:48.150818 #2076912] INFO -- : [852/885] 2118281=test_date_new I, [2024-05-11T15:11:48.158898 #2076912] INFO -- : [853/885] 2118281=index_write_test I, [2024-05-11T15:11:48.175262 #2076912] INFO -- : [854/885] 2118275=test_syntax I, [2024-05-11T15:11:48.217513 #2076912] INFO -- : [855/885] 2118281=test_gem_safe_yaml I, [2024-05-11T15:11:48.228786 #2076912] INFO -- : [856/885] 2118281=test_rdoc_text I, [2024-05-11T15:11:48.283483 #2076912] INFO -- : [857/885] 2118281=test_tcp I, [2024-05-11T15:11:48.458453 #2076912] INFO -- : [858/885] 2118281=test_iso_8859 I, [2024-05-11T15:11:48.514161 #2076912] INFO -- : [859/885] 2118281=test_switch_hitter I, [2024-05-11T15:11:48.533409 #2076912] INFO -- : [860/885] 2118281=test_flush I, [2024-05-11T15:11:48.537716 #2076912] INFO -- : [861/885] 2118281=test_singleton I, [2024-05-11T15:11:48.543889 #2076912] INFO -- : [862/885] 2118281=test_io_console I, [2024-05-11T15:11:48.647092 #2076912] INFO -- : [863/885] 2118287=test_logperiod I, [2024-05-11T15:11:48.654986 #2076912] INFO -- : [864/885] 2118287=test_c_union_entity I, [2024-05-11T15:11:48.659800 #2076912] INFO -- : [865/885] 2118291=test_rdoc_normal_module I, [2024-05-11T15:11:48.695207 #2076912] INFO -- : [866/885] 2118288=test_rdoc_markdown_test I, [2024-05-11T15:11:48.735068 #2076912] INFO -- : [867/885] 2118287=test_securerandom I, [2024-05-11T15:11:48.739545 #2076912] INFO -- : [868/885] 2118291=test_thread_fd_close I, [2024-05-11T15:11:48.745980 #2076912] INFO -- : [869/885] 2118291=test_passing_block I, [2024-05-11T15:11:48.751139 #2076912] INFO -- : [870/885] 2118285=test_stringchar I, [2024-05-11T15:11:48.752469 #2076912] INFO -- : [871/885] 2118291=test_hash_create I, [2024-05-11T15:11:48.756508 #2076912] INFO -- : [872/885] 2118291=newline_test I, [2024-05-11T15:11:48.770253 #2076912] INFO -- : [873/885] 2118290=test_uncorrectable_name_check I, [2024-05-11T15:11:48.775266 #2076912] INFO -- : [874/885] 2118290=test_gem_source_local I, [2024-05-11T15:11:48.776840 #2076912] INFO -- : [875/885] 2118287=test_gem_security_policy I, [2024-05-11T15:11:48.818917 #2076912] INFO -- : [876/885] 2118285=test_pack I, [2024-05-11T15:11:48.834393 #2076912] INFO -- : [877/885] 2118291=test_last_thread I, [2024-05-11T15:11:48.852708 #2076912] INFO -- : [878/885] 2118289=test_process I, [2024-05-11T15:11:48.913625 #2076912] INFO -- : [879/885] 2118286=test_x509cert I, [2024-05-11T15:11:49.039751 #2076912] INFO -- : [880/885] 2118285=test_gc I, [2024-05-11T15:11:49.063331 #2076912] INFO -- : [881/885] 2118290=test_gem_resolver_lock_specification I, [2024-05-11T15:11:49.117506 #2076912] INFO -- : [882/885] 2118290=test_err_in_callback I, [2024-05-11T15:11:49.122181 #2076912] INFO -- : [883/885] 2118290=test_logdevice I, [2024-05-11T15:11:49.151435 #2076912] INFO -- : [884/885] 2118287=test_arity I, [2024-05-11T15:11:49.153154 #2076912] INFO -- : [885/885] 2118277=test_gem_ext_rake_builder I, [2024-05-11T15:12:00.986293 #2076912] INFO -- : Finished tests in 30.807608s, 856.1197 tests/s, 303620.3220 assertions/s. E, [2024-05-11T15:12:00.986385 #2076912] ERROR -- : Children under /tmp/rubytest.lgvxsx: E, [2024-05-11T15:12:00.986424 #2076912] ERROR -- : * drwx------ 2 40 2024-05-11 15:11:40 +0000 d20240511-2118278-6bzfnv/ E, [2024-05-11T15:12:00.986431 #2076912] ERROR -- : * drwx------ 2 40 2024-05-11 15:11:40 +0000 d20240511-2118278-p3dkwy/ E, [2024-05-11T15:12:00.986436 #2076912] ERROR -- : * drwx------ 2 40 2024-05-11 15:11:40 +0000 d20240511-2118278-j118xg/ E, [2024-05-11T15:12:00.986440 #2076912] ERROR -- : * drwx------ 2 40 2024-05-11 15:11:40 +0000 d20240511-2118278-k1suam/ E, [2024-05-11T15:12:00.986443 #2076912] ERROR -- : * drwx------ 2 40 2024-05-11 15:11:40 +0000 d20240511-2118278-g6lkw4/ E, [2024-05-11T15:12:00.986447 #2076912] ERROR -- : * drwx------ 4 80 2024-05-11 15:11:38 +0000 gem_rebuild20240511-2118282-70tl4r/ E, [2024-05-11T15:12:00.986451 #2076912] ERROR -- : * drwxrwxr-x 2 60 2024-05-11 15:11:38 +0000 new/ E, [2024-05-11T15:12:00.986455 #2076912] ERROR -- : * -rw-rw-r-- 1 4096 2024-05-11 15:11:38 +0000 rebuild_test_gem-1.0.0.gem E, [2024-05-11T15:12:00.986470 #2076912] ERROR -- : * drwxrwxr-x 2 60 2024-05-11 15:11:38 +0000 old/ E, [2024-05-11T15:12:00.986488 #2076912] ERROR -- : * -rw-rw-r-- 1 4096 2024-05-11 15:11:38 +0000 rebuild_test_gem-1.0.0.gem I, [2024-05-11T15:12:00.987681 #2076912] INFO -- : 26375 tests, 9353816 assertions, 0 failures, 0 errors, 306 skips I, [2024-05-11T15:12:00.987774 #2076912] INFO -- : I, [2024-05-11T15:12:00.987795 #2076912] INFO -- : ruby -v: ruby 3.4.0dev (2024-05-11T11:47:15Z master 7e604a0263) [x86_64-linux] I, [2024-05-11T15:12:00.989489 #2076912] INFO -- : $$$[end] "make yes-test-all TESTOPTS='--stderr-on-failure' TESTS='-j20'" exit with 0. I, [2024-05-11T15:12:00.989634 #2076912] INFO -- : $$$[beg] make yes-test-rubyspec MSPECOPT='--error-output stderr --debug -j' TESTS='-j20' I, [2024-05-11T15:12:01.085440 #2076912] INFO -- : BASERUBY = /usr/bin/ruby --disable=gems I, [2024-05-11T15:12:01.085480 #2076912] INFO -- : CC = gcc I, [2024-05-11T15:12:01.085486 #2076912] INFO -- : LD = ld I, [2024-05-11T15:12:01.085491 #2076912] INFO -- : LDSHARED = gcc -shared I, [2024-05-11T15:12:01.085495 #2076912] INFO -- : CFLAGS = -O3 -fno-fast-math -ggdb3 -Wall -Wextra -Wdeprecated-declarations -Wdiv-by-zero -Wduplicated-cond -Wimplicit-function-declaration -Wimplicit-int -Wpointer-arith -Wwrite-strings -Wold-style-definition -Wimplicit-fallthrough=0 -Wmissing-noreturn -Wno-cast-function-type -Wno-constant-logical-operand -Wno-long-long -Wno-missing-field-initializers -Wno-overlength-strings -Wno-packed-bitfield-compat -Wno-parentheses-equality -Wno-self-assign -Wno-tautological-compare -Wno-unused-parameter -Wno-unused-value -Wsuggest-attribute=format -Wsuggest-attribute=noreturn -Wunused-variable -Wmisleading-indentation -Wundef -fPIC I, [2024-05-11T15:12:01.085501 #2076912] INFO -- : XCFLAGS = -U_FORTIFY_SOURCE -D_FORTIFY_SOURCE=2 -fstack-protector-strong -fno-strict-overflow -fvisibility=hidden -fexcess-precision=standard -DRUBY_EXPORT -I. -I.ext/include/x86_64-linux -I/tmp/ruby/src/trunk/include -I/tmp/ruby/src/trunk -I/tmp/ruby/src/trunk/prism -I/tmp/ruby/src/trunk/enc/unicode/15.0.0 I, [2024-05-11T15:12:01.085505 #2076912] INFO -- : CPPFLAGS = I, [2024-05-11T15:12:01.085509 #2076912] INFO -- : DLDFLAGS = -Wl,--compress-debug-sections=zlib -Wl,-soname,libruby.so.3.4 -fstack-protector-strong I, [2024-05-11T15:12:01.085514 #2076912] INFO -- : SOLIBS = -lz -lrt -lrt -lgmp -ldl -lcrypt -lm -lpthread I, [2024-05-11T15:12:01.085518 #2076912] INFO -- : LANG = en_US.UTF-8 I, [2024-05-11T15:12:01.085531 #2076912] INFO -- : LC_ALL = I, [2024-05-11T15:12:01.085535 #2076912] INFO -- : LC_CTYPE = I, [2024-05-11T15:12:01.085540 #2076912] INFO -- : MFLAGS = I, [2024-05-11T15:12:01.085543 #2076912] INFO -- : RUSTC = no I, [2024-05-11T15:12:01.085548 #2076912] INFO -- : YJIT_RUSTC_ARGS = --crate-name=yjit --crate-type=staticlib --edition=2021 -g -C lto=thin -C opt-level=3 -C overflow-checks=on '--out-dir=/tmp/ruby/build/trunk/yjit/target/release/' /tmp/ruby/src/trunk/yjit/src/lib.rs I, [2024-05-11T15:12:01.086104 #2076912] INFO -- : gcc (Ubuntu 11.4.0-1ubuntu1~22.04) 11.4.0 I, [2024-05-11T15:12:01.086126 #2076912] INFO -- : Copyright (C) 2021 Free Software Foundation, Inc. I, [2024-05-11T15:12:01.086133 #2076912] INFO -- : This is free software; see the source for copying conditions. There is NO I, [2024-05-11T15:12:01.086138 #2076912] INFO -- : warranty; not even for MERCHANTABILITY or FITNESS FOR A PARTICULAR PURPOSE. I, [2024-05-11T15:12:01.086142 #2076912] INFO -- : I, [2024-05-11T15:12:01.087775 #2076912] INFO -- : generating enc.mk I, [2024-05-11T15:12:01.206459 #2076912] INFO -- : making enc I, [2024-05-11T15:12:01.223610 #2076912] INFO -- : make[1]: Entering directory '/tmp/ruby/build/trunk' I, [2024-05-11T15:12:01.223632 #2076912] INFO -- : make[1]: Nothing to be done for 'enc'. I, [2024-05-11T15:12:01.223637 #2076912] INFO -- : make[1]: Leaving directory '/tmp/ruby/build/trunk' I, [2024-05-11T15:12:01.224286 #2076912] INFO -- : making srcs under enc I, [2024-05-11T15:12:01.254379 #2076912] INFO -- : make[1]: Entering directory '/tmp/ruby/build/trunk' I, [2024-05-11T15:12:01.254399 #2076912] INFO -- : make[1]: Nothing to be done for 'srcs'. I, [2024-05-11T15:12:01.254405 #2076912] INFO -- : make[1]: Leaving directory '/tmp/ruby/build/trunk' I, [2024-05-11T15:12:01.255202 #2076912] INFO -- : generating transdb.h I, [2024-05-11T15:12:01.350906 #2076912] INFO -- : transdb.h unchanged I, [2024-05-11T15:12:01.352297 #2076912] INFO -- : making trans I, [2024-05-11T15:12:01.386587 #2076912] INFO -- : make[1]: Entering directory '/tmp/ruby/build/trunk' I, [2024-05-11T15:12:01.386609 #2076912] INFO -- : make[1]: Nothing to be done for 'trans'. I, [2024-05-11T15:12:01.386614 #2076912] INFO -- : make[1]: Leaving directory '/tmp/ruby/build/trunk' I, [2024-05-11T15:12:01.387311 #2076912] INFO -- : making encs I, [2024-05-11T15:12:01.426045 #2076912] INFO -- : make[1]: Entering directory '/tmp/ruby/build/trunk' I, [2024-05-11T15:12:01.426066 #2076912] INFO -- : make[1]: Nothing to be done for 'encs'. I, [2024-05-11T15:12:01.426071 #2076912] INFO -- : make[1]: Leaving directory '/tmp/ruby/build/trunk' I, [2024-05-11T15:12:01.427779 #2076912] INFO -- : generating makefiles ext/configure-ext.mk I, [2024-05-11T15:12:01.453917 #2076912] INFO -- : ext/configure-ext.mk updated I, [2024-05-11T15:12:01.456390 #2076912] INFO -- : make[1]: Entering directory '/tmp/ruby/build/trunk' I, [2024-05-11T15:12:02.805807 #2076912] INFO -- : make[1]: Leaving directory '/tmp/ruby/build/trunk' I, [2024-05-11T15:12:02.806423 #2076912] INFO -- : generating makefile exts.mk I, [2024-05-11T15:12:02.842809 #2076912] INFO -- : exts.mk unchanged I, [2024-05-11T15:12:02.847327 #2076912] INFO -- : make[1]: Entering directory '/tmp/ruby/build/trunk' I, [2024-05-11T15:12:03.158507 #2076912] INFO -- : make[2]: Entering directory '/tmp/ruby/build/trunk/ext/coverage' I, [2024-05-11T15:12:03.163231 #2076912] INFO -- : make[2]: Leaving directory '/tmp/ruby/build/trunk/ext/coverage' I, [2024-05-11T15:12:03.169657 #2076912] INFO -- : make[2]: Entering directory '/tmp/ruby/build/trunk/ext/date' I, [2024-05-11T15:12:03.174061 #2076912] INFO -- : make[2]: Leaving directory '/tmp/ruby/build/trunk/ext/date' I, [2024-05-11T15:12:03.177801 #2076912] INFO -- : make[2]: Entering directory '/tmp/ruby/build/trunk/ext/digest' I, [2024-05-11T15:12:03.186711 #2076912] INFO -- : make[2]: Leaving directory '/tmp/ruby/build/trunk/ext/digest' I, [2024-05-11T15:12:03.212778 #2076912] INFO -- : make[2]: Entering directory '/tmp/ruby/build/trunk/ext/digest/sha2' I, [2024-05-11T15:12:03.217669 #2076912] INFO -- : make[2]: Leaving directory '/tmp/ruby/build/trunk/ext/digest/sha2' I, [2024-05-11T15:12:03.238916 #2076912] INFO -- : make[2]: Entering directory '/tmp/ruby/build/trunk/ext/fiddle' I, [2024-05-11T15:12:03.249602 #2076912] INFO -- : make[2]: Leaving directory '/tmp/ruby/build/trunk/ext/fiddle' I, [2024-05-11T15:12:03.254496 #2076912] INFO -- : make[2]: Entering directory '/tmp/ruby/build/trunk/ext/io/console' I, [2024-05-11T15:12:03.258676 #2076912] INFO -- : make[2]: Leaving directory '/tmp/ruby/build/trunk/ext/io/console' I, [2024-05-11T15:12:03.271641 #2076912] INFO -- : make[2]: Entering directory '/tmp/ruby/build/trunk/ext/json' I, [2024-05-11T15:12:03.283019 #2076912] INFO -- : make[2]: Leaving directory '/tmp/ruby/build/trunk/ext/json' I, [2024-05-11T15:12:03.298881 #2076912] INFO -- : make[2]: Entering directory '/tmp/ruby/build/trunk/ext/monitor' I, [2024-05-11T15:12:03.302925 #2076912] INFO -- : make[2]: Leaving directory '/tmp/ruby/build/trunk/ext/monitor' I, [2024-05-11T15:12:03.310080 #2076912] INFO -- : make[2]: Entering directory '/tmp/ruby/build/trunk/ext/objspace' I, [2024-05-11T15:12:03.316240 #2076912] INFO -- : make[2]: Leaving directory '/tmp/ruby/build/trunk/ext/objspace' I, [2024-05-11T15:12:03.332866 #2076912] INFO -- : make[2]: Entering directory '/tmp/ruby/build/trunk/ext/openssl' I, [2024-05-11T15:12:03.352652 #2076912] INFO -- : make[2]: Leaving directory '/tmp/ruby/build/trunk/ext/openssl' I, [2024-05-11T15:12:03.357712 #2076912] INFO -- : make[2]: Entering directory '/tmp/ruby/build/trunk/ext/pathname' I, [2024-05-11T15:12:03.361780 #2076912] INFO -- : make[2]: Leaving directory '/tmp/ruby/build/trunk/ext/pathname' I, [2024-05-11T15:12:03.368976 #2076912] INFO -- : make[2]: Entering directory '/tmp/ruby/build/trunk/ext/psych' I, [2024-05-11T15:12:03.387581 #2076912] INFO -- : make[2]: Leaving directory '/tmp/ruby/build/trunk/ext/psych' I, [2024-05-11T15:12:03.390634 #2076912] INFO -- : make[2]: Entering directory '/tmp/ruby/build/trunk/ext/pty' I, [2024-05-11T15:12:03.393189 #2076912] INFO -- : make[2]: Leaving directory '/tmp/ruby/build/trunk/ext/pty' I, [2024-05-11T15:12:03.406037 #2076912] INFO -- : make[2]: Entering directory '/tmp/ruby/build/trunk/ext/ripper' I, [2024-05-11T15:12:03.414215 #2076912] INFO -- : make[2]: Leaving directory '/tmp/ruby/build/trunk/ext/ripper' I, [2024-05-11T15:12:03.416590 #2076912] INFO -- : make[2]: Entering directory '/tmp/ruby/build/trunk/ext/rubyvm' I, [2024-05-11T15:12:03.419913 #2076912] INFO -- : make[2]: Leaving directory '/tmp/ruby/build/trunk/ext/rubyvm' I, [2024-05-11T15:12:03.431810 #2076912] INFO -- : make[2]: Entering directory '/tmp/ruby/build/trunk/ext/socket' I, [2024-05-11T15:12:03.439657 #2076912] INFO -- : make[2]: Leaving directory '/tmp/ruby/build/trunk/ext/socket' I, [2024-05-11T15:12:03.457013 #2076912] INFO -- : make[2]: Entering directory '/tmp/ruby/build/trunk/.bundle/gems/bigdecimal-3.1.8/ext/bigdecimal' I, [2024-05-11T15:12:03.483524 #2076912] INFO -- : make[2]: Leaving directory '/tmp/ruby/build/trunk/.bundle/gems/bigdecimal-3.1.8/ext/bigdecimal' I, [2024-05-11T15:12:03.485642 #2076912] INFO -- : make[2]: Entering directory '/tmp/ruby/build/trunk/.bundle/gems/debug-1.9.2/ext/debug' I, [2024-05-11T15:12:03.507538 #2076912] INFO -- : make[2]: Leaving directory '/tmp/ruby/build/trunk/.bundle/gems/debug-1.9.2/ext/debug' I, [2024-05-11T15:12:03.509713 #2076912] INFO -- : make[2]: Entering directory '/tmp/ruby/build/trunk/.bundle/gems/nkf-0.2.0/ext/nkf' I, [2024-05-11T15:12:03.531164 #2076912] INFO -- : make[2]: Leaving directory '/tmp/ruby/build/trunk/.bundle/gems/nkf-0.2.0/ext/nkf' I, [2024-05-11T15:12:03.533224 #2076912] INFO -- : make[2]: Entering directory '/tmp/ruby/build/trunk/.bundle/gems/racc-1.7.3/ext/racc/cparse' I, [2024-05-11T15:12:03.554676 #2076912] INFO -- : make[2]: Leaving directory '/tmp/ruby/build/trunk/.bundle/gems/racc-1.7.3/ext/racc/cparse' I, [2024-05-11T15:12:03.557050 #2076912] INFO -- : make[2]: Entering directory '/tmp/ruby/build/trunk/.bundle/gems/rbs-3.4.4/ext/rbs_extension' I, [2024-05-11T15:12:03.578633 #2076912] INFO -- : make[2]: Leaving directory '/tmp/ruby/build/trunk/.bundle/gems/rbs-3.4.4/ext/rbs_extension' I, [2024-05-11T15:12:03.580539 #2076912] INFO -- : make[2]: Entering directory '/tmp/ruby/build/trunk/.bundle/gems/syslog-0.1.2/ext/syslog' I, [2024-05-11T15:12:03.601691 #2076912] INFO -- : make[2]: Leaving directory '/tmp/ruby/build/trunk/.bundle/gems/syslog-0.1.2/ext/syslog' I, [2024-05-11T15:12:03.625142 #2076912] INFO -- : make[2]: Entering directory '/tmp/ruby/build/trunk' I, [2024-05-11T15:12:03.691105 #2076912] INFO -- : make[2]: 'ruby' is up to date. I, [2024-05-11T15:12:03.691149 #2076912] INFO -- : make[2]: Leaving directory '/tmp/ruby/build/trunk' I, [2024-05-11T15:12:03.691409 #2076912] INFO -- : make[1]: Leaving directory '/tmp/ruby/build/trunk' I, [2024-05-11T15:12:03.695062 #2076912] INFO -- : make[1]: Entering directory '/tmp/ruby/build/trunk' I, [2024-05-11T15:12:03.695089 #2076912] INFO -- : make[1]: Nothing to be done for 'note'. I, [2024-05-11T15:12:03.695095 #2076912] INFO -- : make[1]: Leaving directory '/tmp/ruby/build/trunk' E, [2024-05-11T15:12:03.751417 #2076912] ERROR -- : $ /tmp/ruby/build/trunk/miniruby -I/tmp/ruby/src/trunk/lib /tmp/ruby/src/trunk/tool/runruby.rb --archdir=/tmp/ruby/build/trunk --extout=.ext -- /tmp/ruby/src/trunk/spec/mspec/bin/mspec-run -B /tmp/ruby/src/trunk/spec/default.mspec --error-output stderr --debug -fy -o /tmp/rubytest.sj0ird/1-mspec-multi-0 E, [2024-05-11T15:12:03.751581 #2076912] ERROR -- : $ /tmp/ruby/build/trunk/miniruby -I/tmp/ruby/src/trunk/lib /tmp/ruby/src/trunk/tool/runruby.rb --archdir=/tmp/ruby/build/trunk --extout=.ext -- /tmp/ruby/src/trunk/spec/mspec/bin/mspec-run -B /tmp/ruby/src/trunk/spec/default.mspec --error-output stderr --debug -fy -o /tmp/rubytest.sj0ird/2-mspec-multi-1 E, [2024-05-11T15:12:03.751807 #2076912] ERROR -- : $ /tmp/ruby/build/trunk/miniruby -I/tmp/ruby/src/trunk/lib /tmp/ruby/src/trunk/tool/runruby.rb --archdir=/tmp/ruby/build/trunk --extout=.ext -- /tmp/ruby/src/trunk/spec/mspec/bin/mspec-run -B /tmp/ruby/src/trunk/spec/default.mspec --error-output stderr --debug -fy -o /tmp/rubytest.sj0ird/3-mspec-multi-2 E, [2024-05-11T15:12:03.751982 #2076912] ERROR -- : $ /tmp/ruby/build/trunk/miniruby -I/tmp/ruby/src/trunk/lib /tmp/ruby/src/trunk/tool/runruby.rb --archdir=/tmp/ruby/build/trunk --extout=.ext -- /tmp/ruby/src/trunk/spec/mspec/bin/mspec-run -B /tmp/ruby/src/trunk/spec/default.mspec --error-output stderr --debug -fy -o /tmp/rubytest.sj0ird/4-mspec-multi-3 E, [2024-05-11T15:12:03.752198 #2076912] ERROR -- : $ /tmp/ruby/build/trunk/miniruby -I/tmp/ruby/src/trunk/lib /tmp/ruby/src/trunk/tool/runruby.rb --archdir=/tmp/ruby/build/trunk --extout=.ext -- /tmp/ruby/src/trunk/spec/mspec/bin/mspec-run -B /tmp/ruby/src/trunk/spec/default.mspec --error-output stderr --debug -fy -o /tmp/rubytest.sj0ird/5-mspec-multi-4 E, [2024-05-11T15:12:03.752321 #2076912] ERROR -- : $ /tmp/ruby/build/trunk/miniruby -I/tmp/ruby/src/trunk/lib /tmp/ruby/src/trunk/tool/runruby.rb --archdir=/tmp/ruby/build/trunk --extout=.ext -- /tmp/ruby/src/trunk/spec/mspec/bin/mspec-run -B /tmp/ruby/src/trunk/spec/default.mspec --error-output stderr --debug -fy -o /tmp/rubytest.sj0ird/6-mspec-multi-5 E, [2024-05-11T15:12:03.752680 #2076912] ERROR -- : $ /tmp/ruby/build/trunk/miniruby -I/tmp/ruby/src/trunk/lib /tmp/ruby/src/trunk/tool/runruby.rb --archdir=/tmp/ruby/build/trunk --extout=.ext -- /tmp/ruby/src/trunk/spec/mspec/bin/mspec-run -B /tmp/ruby/src/trunk/spec/default.mspec --error-output stderr --debug -fy -o /tmp/rubytest.sj0ird/7-mspec-multi-6 E, [2024-05-11T15:12:03.752850 #2076912] ERROR -- : $ /tmp/ruby/build/trunk/miniruby -I/tmp/ruby/src/trunk/lib /tmp/ruby/src/trunk/tool/runruby.rb --archdir=/tmp/ruby/build/trunk --extout=.ext -- /tmp/ruby/src/trunk/spec/mspec/bin/mspec-run -B /tmp/ruby/src/trunk/spec/default.mspec --error-output stderr --debug -fy -o /tmp/rubytest.sj0ird/8-mspec-multi-7 E, [2024-05-11T15:12:03.753066 #2076912] ERROR -- : $ /tmp/ruby/build/trunk/miniruby -I/tmp/ruby/src/trunk/lib /tmp/ruby/src/trunk/tool/runruby.rb --archdir=/tmp/ruby/build/trunk --extout=.ext -- /tmp/ruby/src/trunk/spec/mspec/bin/mspec-run -B /tmp/ruby/src/trunk/spec/default.mspec --error-output stderr --debug -fy -o /tmp/rubytest.sj0ird/9-mspec-multi-8 E, [2024-05-11T15:12:03.753292 #2076912] ERROR -- : $ /tmp/ruby/build/trunk/miniruby -I/tmp/ruby/src/trunk/lib /tmp/ruby/src/trunk/tool/runruby.rb --archdir=/tmp/ruby/build/trunk --extout=.ext -- /tmp/ruby/src/trunk/spec/mspec/bin/mspec-run -B /tmp/ruby/src/trunk/spec/default.mspec --error-output stderr --debug -fy -o /tmp/rubytest.sj0ird/10-mspec-multi-9 E, [2024-05-11T15:12:03.753597 #2076912] ERROR -- : $ /tmp/ruby/build/trunk/miniruby -I/tmp/ruby/src/trunk/lib /tmp/ruby/src/trunk/tool/runruby.rb --archdir=/tmp/ruby/build/trunk --extout=.ext -- /tmp/ruby/src/trunk/spec/mspec/bin/mspec-run -B /tmp/ruby/src/trunk/spec/default.mspec --error-output stderr --debug -fy -o /tmp/rubytest.sj0ird/11-mspec-multi-10 E, [2024-05-11T15:12:03.753774 #2076912] ERROR -- : $ /tmp/ruby/build/trunk/miniruby -I/tmp/ruby/src/trunk/lib /tmp/ruby/src/trunk/tool/runruby.rb --archdir=/tmp/ruby/build/trunk --extout=.ext -- /tmp/ruby/src/trunk/spec/mspec/bin/mspec-run -B /tmp/ruby/src/trunk/spec/default.mspec --error-output stderr --debug -fy -o /tmp/rubytest.sj0ird/12-mspec-multi-11 E, [2024-05-11T15:12:03.753936 #2076912] ERROR -- : $ /tmp/ruby/build/trunk/miniruby -I/tmp/ruby/src/trunk/lib /tmp/ruby/src/trunk/tool/runruby.rb --archdir=/tmp/ruby/build/trunk --extout=.ext -- /tmp/ruby/src/trunk/spec/mspec/bin/mspec-run -B /tmp/ruby/src/trunk/spec/default.mspec --error-output stderr --debug -fy -o /tmp/rubytest.sj0ird/13-mspec-multi-12 E, [2024-05-11T15:12:03.754069 #2076912] ERROR -- : $ /tmp/ruby/build/trunk/miniruby -I/tmp/ruby/src/trunk/lib /tmp/ruby/src/trunk/tool/runruby.rb --archdir=/tmp/ruby/build/trunk --extout=.ext -- /tmp/ruby/src/trunk/spec/mspec/bin/mspec-run -B /tmp/ruby/src/trunk/spec/default.mspec --error-output stderr --debug -fy -o /tmp/rubytest.sj0ird/14-mspec-multi-13 E, [2024-05-11T15:12:03.754266 #2076912] ERROR -- : $ /tmp/ruby/build/trunk/miniruby -I/tmp/ruby/src/trunk/lib /tmp/ruby/src/trunk/tool/runruby.rb --archdir=/tmp/ruby/build/trunk --extout=.ext -- /tmp/ruby/src/trunk/spec/mspec/bin/mspec-run -B /tmp/ruby/src/trunk/spec/default.mspec --error-output stderr --debug -fy -o /tmp/rubytest.sj0ird/15-mspec-multi-14 E, [2024-05-11T15:12:03.754393 #2076912] ERROR -- : $ /tmp/ruby/build/trunk/miniruby -I/tmp/ruby/src/trunk/lib /tmp/ruby/src/trunk/tool/runruby.rb --archdir=/tmp/ruby/build/trunk --extout=.ext -- /tmp/ruby/src/trunk/spec/mspec/bin/mspec-run -B /tmp/ruby/src/trunk/spec/default.mspec --error-output stderr --debug -fy -o /tmp/rubytest.sj0ird/16-mspec-multi-15 E, [2024-05-11T15:12:03.754629 #2076912] ERROR -- : $ /tmp/ruby/build/trunk/miniruby -I/tmp/ruby/src/trunk/lib /tmp/ruby/src/trunk/tool/runruby.rb --archdir=/tmp/ruby/build/trunk --extout=.ext -- /tmp/ruby/src/trunk/spec/mspec/bin/mspec-run -B /tmp/ruby/src/trunk/spec/default.mspec --error-output stderr --debug -fy -o /tmp/rubytest.sj0ird/17-mspec-multi-16 E, [2024-05-11T15:12:03.754779 #2076912] ERROR -- : $ /tmp/ruby/build/trunk/miniruby -I/tmp/ruby/src/trunk/lib /tmp/ruby/src/trunk/tool/runruby.rb --archdir=/tmp/ruby/build/trunk --extout=.ext -- /tmp/ruby/src/trunk/spec/mspec/bin/mspec-run -B /tmp/ruby/src/trunk/spec/default.mspec --error-output stderr --debug -fy -o /tmp/rubytest.sj0ird/18-mspec-multi-17 E, [2024-05-11T15:12:03.757176 #2076912] ERROR -- : $ /tmp/ruby/build/trunk/miniruby -I/tmp/ruby/src/trunk/lib /tmp/ruby/src/trunk/tool/runruby.rb --archdir=/tmp/ruby/build/trunk --extout=.ext -- /tmp/ruby/src/trunk/spec/mspec/bin/mspec-run -B /tmp/ruby/src/trunk/spec/default.mspec --error-output stderr --debug -fy -o /tmp/rubytest.sj0ird/19-mspec-multi-18 E, [2024-05-11T15:12:03.757475 #2076912] ERROR -- : $ /tmp/ruby/build/trunk/miniruby -I/tmp/ruby/src/trunk/lib /tmp/ruby/src/trunk/tool/runruby.rb --archdir=/tmp/ruby/build/trunk --extout=.ext -- /tmp/ruby/src/trunk/spec/mspec/bin/mspec-run -B /tmp/ruby/src/trunk/spec/default.mspec --error-output stderr --debug -fy -o /tmp/rubytest.sj0ird/20-mspec-multi-19 I, [2024-05-11T15:12:03.921003 #2076912] INFO -- : ruby 3.4.0dev (2024-05-11T11:47:15Z master 7e604a0263) [x86_64-linux] I, [2024-05-11T15:12:04.555088 #2076912] INFO -- : 0 ......................................................................... I, [2024-05-11T15:12:04.911349 #2076912] INFO -- : 73 ......................................................................... I, [2024-05-11T15:12:05.062171 #2076912] INFO -- : 146 ......................................................................... I, [2024-05-11T15:12:05.117510 #2076912] INFO -- : 219 ......................................................................... I, [2024-05-11T15:12:05.164764 #2076912] INFO -- : 292 ......................................................................... I, [2024-05-11T15:12:05.211570 #2076912] INFO -- : 365 ......................................................................... I, [2024-05-11T15:12:05.232359 #2076912] INFO -- : 438 ......................................................................... I, [2024-05-11T15:12:05.251540 #2076912] INFO -- : 511 ......................................................................... I, [2024-05-11T15:12:05.272733 #2076912] INFO -- : 584 ......................................................................... I, [2024-05-11T15:12:05.320569 #2076912] INFO -- : 657 ......................................................................... I, [2024-05-11T15:12:05.348187 #2076912] INFO -- : 730 ......................................................................... I, [2024-05-11T15:12:05.372866 #2076912] INFO -- : 803 ......................................................................... I, [2024-05-11T15:12:05.408565 #2076912] INFO -- : 876 ......................................................................... I, [2024-05-11T15:12:05.455166 #2076912] INFO -- : 949 ......................................................................... I, [2024-05-11T15:12:05.539754 #2076912] INFO -- : 1022 ......................................................................... I, [2024-05-11T15:12:05.712236 #2076912] INFO -- : 1095 ......................................................................... I, [2024-05-11T15:12:05.825759 #2076912] INFO -- : 1168 ......................................................................... I, [2024-05-11T15:12:05.879549 #2076912] INFO -- : 1241 ......................................................................... I, [2024-05-11T15:12:05.920416 #2076912] INFO -- : 1314 ......................................................................... I, [2024-05-11T15:12:05.942721 #2076912] INFO -- : 1387 ......................................................................... I, [2024-05-11T15:12:06.050420 #2076912] INFO -- : 1460 ......................................................................... I, [2024-05-11T15:12:06.492961 #2076912] INFO -- : 1533 ......................................................................... I, [2024-05-11T15:12:06.548622 #2076912] INFO -- : 1606 ......................................................................... I, [2024-05-11T15:12:06.647987 #2076912] INFO -- : 1679 ......................................................................... I, [2024-05-11T15:12:06.772702 #2076912] INFO -- : 1752 ......................................................................... I, [2024-05-11T15:12:06.855077 #2076912] INFO -- : 1825 ......................................................................... I, [2024-05-11T15:12:06.980222 #2076912] INFO -- : 1898 ......................................................................... I, [2024-05-11T15:12:07.062290 #2076912] INFO -- : 1971 ......................................................................... I, [2024-05-11T15:12:07.112790 #2076912] INFO -- : 2044 ......................................................................... I, [2024-05-11T15:12:07.156849 #2076912] INFO -- : 2117 ......................................................................... I, [2024-05-11T15:12:07.171818 #2076912] INFO -- : 2190 ......................................................................... I, [2024-05-11T15:12:07.198670 #2076912] INFO -- : 2263 ......................................................................... I, [2024-05-11T15:12:07.211646 #2076912] INFO -- : 2336 ......................................................................... I, [2024-05-11T15:12:07.249324 #2076912] INFO -- : 2409 ......................................................................... I, [2024-05-11T15:12:07.358614 #2076912] INFO -- : 2482 ......................................................................... I, [2024-05-11T15:12:07.379927 #2076912] INFO -- : 2555 ......................................................................... I, [2024-05-11T15:12:07.487784 #2076912] INFO -- : 2628 ......................................................................... I, [2024-05-11T15:12:07.575976 #2076912] INFO -- : 2701 ......................................................................... I, [2024-05-11T15:12:07.605228 #2076912] INFO -- : 2774 ......................................................................... I, [2024-05-11T15:12:07.663578 #2076912] INFO -- : 2847 ......................................................................... I, [2024-05-11T15:12:07.698001 #2076912] INFO -- : 2920 ......................................................................... I, [2024-05-11T15:12:07.722027 #2076912] INFO -- : 2993 ......................................................................... I, [2024-05-11T15:12:07.745868 #2076912] INFO -- : 3066 ......................................................................... I, [2024-05-11T15:12:07.761951 #2076912] INFO -- : 3139 ......................................................................... I, [2024-05-11T15:12:07.772538 #2076912] INFO -- : 3212 ......................................................................... I, [2024-05-11T15:12:07.806524 #2076912] INFO -- : 3285 ......................................................................... I, [2024-05-11T15:12:11.772794 #2076912] INFO -- : 3358 ........................................................................ I, [2024-05-11T15:12:11.772874 #2076912] INFO -- : I, [2024-05-11T15:12:11.772889 #2076912] INFO -- : Finished in 8.020528 seconds I, [2024-05-11T15:12:11.772901 #2076912] INFO -- : I, [2024-05-11T15:12:11.772911 #2076912] INFO -- : 3429 files, 32611 examples, 187710 expectations, 0 failures, 0 errors, 0 tagged I, [2024-05-11T15:12:11.774896 #2076912] INFO -- : $$$[end] "make yes-test-rubyspec MSPECOPT='--error-output stderr --debug -j' TESTS='-j20'" exit with 0.