# Logfile created on 2024-05-10 23:57:24 +0000 by logger.rb/v1.4.3 I, [2024-05-10T23:57:24.138633 #620712] INFO -- : #, @formatter=nil, @logdev=#, @binmode=false, @mon_data=#, @mon_data_owner_object_id=860>>> I, [2024-05-10T23:57:24.138762 #620712] INFO -- : $$$[beg] make update-unicode -j20 I, [2024-05-10T23:57:24.197333 #620712] INFO -- : Downloading Unicode emoji 15.0 files... I, [2024-05-10T23:57:24.197534 #620712] INFO -- : Downloading Unicode emoji 15.0 files... I, [2024-05-10T23:57:24.198254 #620712] INFO -- : Downloading Unicode emoji 15.0 files... I, [2024-05-10T23:57:24.239211 #620712] INFO -- : made symlink emoji/15.0/emoji-sequences.txt to /tmp/ruby/src/trunk/.downloaded-cache/emoji/15.0/emoji-sequences.txt I, [2024-05-10T23:57:24.239246 #620712] INFO -- : downloading emoji/15.0/emoji-sequences.txt ... downloading emoji/15.0/emoji-test.txt ... /tmp/ruby/src/trunk/enc/unicode/data/emoji/15.0/emoji-sequences.txt already exists E, [2024-05-10T23:57:24.686556 #620712] ERROR -- : /tmp/ruby/src/trunk/tool/downloader.rb:302:in `rescue in download': failed to download emoji/15.0/emoji-test.txt (RuntimeError) E, [2024-05-10T23:57:24.686662 #620712] ERROR -- : OpenURI::HTTPError: 403 Forbidden: https://www.unicode.org/Public/emoji/15.0/emoji-test.txt E, [2024-05-10T23:57:24.686679 #620712] ERROR -- : from /tmp/ruby/src/trunk/tool/downloader.rb:201:in `download' E, [2024-05-10T23:57:24.686690 #620712] ERROR -- : from /tmp/ruby/src/trunk/tool/downloader.rb:136:in `download' E, [2024-05-10T23:57:24.686700 #620712] ERROR -- : from /tmp/ruby/src/trunk/tool/downloader.rb:482:in `block in
' E, [2024-05-10T23:57:24.686711 #620712] ERROR -- : from /tmp/ruby/src/trunk/tool/downloader.rb:465:in `each' E, [2024-05-10T23:57:24.686721 #620712] ERROR -- : from /tmp/ruby/src/trunk/tool/downloader.rb:465:in `
' E, [2024-05-10T23:57:24.686731 #620712] ERROR -- : /usr/lib/ruby/3.0.0/open-uri.rb:364:in `open_http': 403 Forbidden (OpenURI::HTTPError) E, [2024-05-10T23:57:24.686742 #620712] ERROR -- : from /usr/lib/ruby/3.0.0/open-uri.rb:741:in `buffer_open' E, [2024-05-10T23:57:24.686754 #620712] ERROR -- : from /usr/lib/ruby/3.0.0/open-uri.rb:212:in `block in open_loop' E, [2024-05-10T23:57:24.686764 #620712] ERROR -- : from /usr/lib/ruby/3.0.0/open-uri.rb:210:in `catch' E, [2024-05-10T23:57:24.686774 #620712] ERROR -- : from /usr/lib/ruby/3.0.0/open-uri.rb:210:in `open_loop' E, [2024-05-10T23:57:24.686784 #620712] ERROR -- : from /usr/lib/ruby/3.0.0/open-uri.rb:151:in `open_uri' E, [2024-05-10T23:57:24.686794 #620712] ERROR -- : from /usr/lib/ruby/3.0.0/open-uri.rb:721:in `open' E, [2024-05-10T23:57:24.686804 #620712] ERROR -- : from /usr/lib/ruby/3.0.0/open-uri.rb:729:in `read' E, [2024-05-10T23:57:24.686813 #620712] ERROR -- : from /tmp/ruby/src/trunk/tool/downloader.rb:247:in `block in download' E, [2024-05-10T23:57:24.686838 #620712] ERROR -- : from /tmp/ruby/src/trunk/tool/downloader.rb:378:in `with_retry' E, [2024-05-10T23:57:24.686849 #620712] ERROR -- : from /tmp/ruby/src/trunk/tool/downloader.rb:246:in `download' E, [2024-05-10T23:57:24.686862 #620712] ERROR -- : from /tmp/ruby/src/trunk/tool/downloader.rb:136:in `download' E, [2024-05-10T23:57:24.686872 #620712] ERROR -- : from /tmp/ruby/src/trunk/tool/downloader.rb:482:in `block in
' E, [2024-05-10T23:57:24.686882 #620712] ERROR -- : from /tmp/ruby/src/trunk/tool/downloader.rb:465:in `each' E, [2024-05-10T23:57:24.686892 #620712] ERROR -- : from /tmp/ruby/src/trunk/tool/downloader.rb:465:in `
' E, [2024-05-10T23:57:24.690564 #620712] ERROR -- : make: *** [uncommon.mk:1765: /tmp/ruby/src/trunk/enc/unicode/data/emoji/15.0/emoji-zwj-sequences.txt] Error 1 E, [2024-05-10T23:57:24.690614 #620712] ERROR -- : make: *** Waiting for unfinished jobs.... E, [2024-05-10T23:57:24.712594 #620712] ERROR -- : /tmp/ruby/src/trunk/tool/downloader.rb:302:in `rescue in download': failed to download emoji/15.0/emoji-test.txt (RuntimeError) E, [2024-05-10T23:57:24.712696 #620712] ERROR -- : OpenURI::HTTPError: 403 Forbidden: https://www.unicode.org/Public/emoji/15.0/emoji-test.txt E, [2024-05-10T23:57:24.712717 #620712] ERROR -- : from /tmp/ruby/src/trunk/tool/downloader.rb:201:in `download' E, [2024-05-10T23:57:24.712729 #620712] ERROR -- : from /tmp/ruby/src/trunk/tool/downloader.rb:136:in `download' E, [2024-05-10T23:57:24.712741 #620712] ERROR -- : from /tmp/ruby/src/trunk/tool/downloader.rb:482:in `block in
' E, [2024-05-10T23:57:24.712753 #620712] ERROR -- : from /tmp/ruby/src/trunk/tool/downloader.rb:465:in `each' E, [2024-05-10T23:57:24.712764 #620712] ERROR -- : from /tmp/ruby/src/trunk/tool/downloader.rb:465:in `
' E, [2024-05-10T23:57:24.712776 #620712] ERROR -- : /usr/lib/ruby/3.0.0/open-uri.rb:364:in `open_http': 403 Forbidden (OpenURI::HTTPError) E, [2024-05-10T23:57:24.712787 #620712] ERROR -- : from /usr/lib/ruby/3.0.0/open-uri.rb:741:in `buffer_open' E, [2024-05-10T23:57:24.712803 #620712] ERROR -- : from /usr/lib/ruby/3.0.0/open-uri.rb:212:in `block in open_loop' E, [2024-05-10T23:57:24.712815 #620712] ERROR -- : from /usr/lib/ruby/3.0.0/open-uri.rb:210:in `catch' E, [2024-05-10T23:57:24.712826 #620712] ERROR -- : from /usr/lib/ruby/3.0.0/open-uri.rb:210:in `open_loop' E, [2024-05-10T23:57:24.712838 #620712] ERROR -- : from /usr/lib/ruby/3.0.0/open-uri.rb:151:in `open_uri' E, [2024-05-10T23:57:24.712850 #620712] ERROR -- : from /usr/lib/ruby/3.0.0/open-uri.rb:721:in `open' E, [2024-05-10T23:57:24.712868 #620712] ERROR -- : from /usr/lib/ruby/3.0.0/open-uri.rb:729:in `read' E, [2024-05-10T23:57:24.712879 #620712] ERROR -- : from /tmp/ruby/src/trunk/tool/downloader.rb:247:in `block in download' E, [2024-05-10T23:57:24.712891 #620712] ERROR -- : from /tmp/ruby/src/trunk/tool/downloader.rb:378:in `with_retry' E, [2024-05-10T23:57:24.712905 #620712] ERROR -- : from /tmp/ruby/src/trunk/tool/downloader.rb:246:in `download' E, [2024-05-10T23:57:24.712916 #620712] ERROR -- : from /tmp/ruby/src/trunk/tool/downloader.rb:136:in `download' E, [2024-05-10T23:57:24.712928 #620712] ERROR -- : from /tmp/ruby/src/trunk/tool/downloader.rb:482:in `block in
' E, [2024-05-10T23:57:24.712940 #620712] ERROR -- : from /tmp/ruby/src/trunk/tool/downloader.rb:465:in `each' E, [2024-05-10T23:57:24.712951 #620712] ERROR -- : from /tmp/ruby/src/trunk/tool/downloader.rb:465:in `
' E, [2024-05-10T23:57:24.717096 #620712] ERROR -- : make: *** [uncommon.mk:1765: /tmp/ruby/src/trunk/enc/unicode/data/emoji/15.0/emoji-sequences.txt] Error 1 E, [2024-05-10T23:57:24.717160 #620712] ERROR -- : make: *** Deleting file '/tmp/ruby/src/trunk/enc/unicode/data/emoji/15.0/emoji-sequences.txt' E, [2024-05-10T23:57:25.147466 #620712] ERROR -- : /tmp/ruby/src/trunk/tool/downloader.rb:302:in `rescue in download': failed to download emoji/15.0/emoji-sequences.txt (RuntimeError) E, [2024-05-10T23:57:25.147606 #620712] ERROR -- : EOFError: end of file reached: https://www.unicode.org/Public/emoji/15.0/emoji-sequences.txt E, [2024-05-10T23:57:25.147649 #620712] ERROR -- : from /tmp/ruby/src/trunk/tool/downloader.rb:201:in `download' E, [2024-05-10T23:57:25.147664 #620712] ERROR -- : from /tmp/ruby/src/trunk/tool/downloader.rb:136:in `download' E, [2024-05-10T23:57:25.147677 #620712] ERROR -- : from /tmp/ruby/src/trunk/tool/downloader.rb:482:in `block in
' E, [2024-05-10T23:57:25.147721 #620712] ERROR -- : from /tmp/ruby/src/trunk/tool/downloader.rb:465:in `each' E, [2024-05-10T23:57:25.147736 #620712] ERROR -- : from /tmp/ruby/src/trunk/tool/downloader.rb:465:in `
' E, [2024-05-10T23:57:25.147749 #620712] ERROR -- : /usr/lib/ruby/3.0.0/net/protocol.rb:227:in `rbuf_fill': end of file reached (EOFError) E, [2024-05-10T23:57:25.147766 #620712] ERROR -- : from /usr/lib/ruby/3.0.0/net/protocol.rb:193:in `readuntil' E, [2024-05-10T23:57:25.147779 #620712] ERROR -- : from /usr/lib/ruby/3.0.0/net/protocol.rb:203:in `readline' E, [2024-05-10T23:57:25.147792 #620712] ERROR -- : from /usr/lib/ruby/3.0.0/net/http/response.rb:42:in `read_status_line' E, [2024-05-10T23:57:25.147805 #620712] ERROR -- : from /usr/lib/ruby/3.0.0/net/http/response.rb:31:in `read_new' E, [2024-05-10T23:57:25.147818 #620712] ERROR -- : from /usr/lib/ruby/3.0.0/net/http.rb:1557:in `block in transport_request' E, [2024-05-10T23:57:25.147831 #620712] ERROR -- : from /usr/lib/ruby/3.0.0/net/http.rb:1548:in `catch' E, [2024-05-10T23:57:25.148082 #620712] ERROR -- : from /usr/lib/ruby/3.0.0/net/http.rb:1548:in `transport_request' E, [2024-05-10T23:57:25.148097 #620712] ERROR -- : from /usr/lib/ruby/3.0.0/net/http.rb:1521:in `request' E, [2024-05-10T23:57:25.148110 #620712] ERROR -- : from /usr/lib/ruby/3.0.0/open-uri.rb:329:in `block in open_http' E, [2024-05-10T23:57:25.148123 #620712] ERROR -- : from /usr/lib/ruby/3.0.0/net/http.rb:960:in `start' E, [2024-05-10T23:57:25.148135 #620712] ERROR -- : from /usr/lib/ruby/3.0.0/open-uri.rb:323:in `open_http' E, [2024-05-10T23:57:25.148148 #620712] ERROR -- : from /usr/lib/ruby/3.0.0/open-uri.rb:741:in `buffer_open' E, [2024-05-10T23:57:25.148165 #620712] ERROR -- : from /usr/lib/ruby/3.0.0/open-uri.rb:212:in `block in open_loop' E, [2024-05-10T23:57:25.148178 #620712] ERROR -- : from /usr/lib/ruby/3.0.0/open-uri.rb:210:in `catch' E, [2024-05-10T23:57:25.148191 #620712] ERROR -- : from /usr/lib/ruby/3.0.0/open-uri.rb:210:in `open_loop' E, [2024-05-10T23:57:25.148204 #620712] ERROR -- : from /usr/lib/ruby/3.0.0/open-uri.rb:151:in `open_uri' E, [2024-05-10T23:57:25.148216 #620712] ERROR -- : from /usr/lib/ruby/3.0.0/open-uri.rb:721:in `open' E, [2024-05-10T23:57:25.148229 #620712] ERROR -- : from /usr/lib/ruby/3.0.0/open-uri.rb:729:in `read' E, [2024-05-10T23:57:25.148241 #620712] ERROR -- : from /tmp/ruby/src/trunk/tool/downloader.rb:247:in `block in download' E, [2024-05-10T23:57:25.148254 #620712] ERROR -- : from /tmp/ruby/src/trunk/tool/downloader.rb:378:in `with_retry' E, [2024-05-10T23:57:25.148267 #620712] ERROR -- : from /tmp/ruby/src/trunk/tool/downloader.rb:246:in `download' E, [2024-05-10T23:57:25.148282 #620712] ERROR -- : from /tmp/ruby/src/trunk/tool/downloader.rb:136:in `download' E, [2024-05-10T23:57:25.148295 #620712] ERROR -- : from /tmp/ruby/src/trunk/tool/downloader.rb:482:in `block in
' E, [2024-05-10T23:57:25.148308 #620712] ERROR -- : from /tmp/ruby/src/trunk/tool/downloader.rb:465:in `each' E, [2024-05-10T23:57:25.148320 #620712] ERROR -- : from /tmp/ruby/src/trunk/tool/downloader.rb:465:in `
' E, [2024-05-10T23:57:25.152379 #620712] ERROR -- : make: *** [uncommon.mk:1765: /tmp/ruby/src/trunk/enc/unicode/data/emoji/15.0/emoji-test.txt] Error 1 I, [2024-05-10T23:57:25.152471 #620712] INFO -- : downloading emoji/15.0/emoji-test.txt ... I, [2024-05-10T23:57:25.152933 #620712] INFO -- : $$$[end] "make update-unicode -j20" exit with 512. I, [2024-05-10T23:57:25.152997 #620712] INFO -- : $$$[beg] make update-download -j20 I, [2024-05-10T23:57:25.263893 #620712] INFO -- : tool/config.guess already exists I, [2024-05-10T23:57:25.263937 #620712] INFO -- : tool/config.sub already exists I, [2024-05-10T23:57:25.266055 #620712] INFO -- : Update minitest to ea9caafc0754b1d6236a490d59e624b53209734a I, [2024-05-10T23:57:25.266291 #620712] INFO -- : Update power_assert to 84e85124c5014a139af39161d484156cfe87a9ed I, [2024-05-10T23:57:25.266931 #620712] INFO -- : Update rbs to ba7872795d5de04adb8ff500c0e6afdc81a041dd I, [2024-05-10T23:57:25.267228 #620712] INFO -- : Update typeprof to b19a6416da3a05d57fadd6ffdadb382b6d236ca5 I, [2024-05-10T23:57:25.267278 #620712] INFO -- : echo ea9caafc0754b1d6236a490d59e624b53209734a | /bin/sh /tmp/ruby/src/trunk/tool/ifchange /tmp/ruby/src/trunk/.bundle/.timestamp/minitest.revision - I, [2024-05-10T23:57:25.267377 #620712] INFO -- : echo 84e85124c5014a139af39161d484156cfe87a9ed | /bin/sh /tmp/ruby/src/trunk/tool/ifchange /tmp/ruby/src/trunk/.bundle/.timestamp/power_assert.revision - I, [2024-05-10T23:57:25.268052 #620712] INFO -- : echo ba7872795d5de04adb8ff500c0e6afdc81a041dd | /bin/sh /tmp/ruby/src/trunk/tool/ifchange /tmp/ruby/src/trunk/.bundle/.timestamp/rbs.revision - I, [2024-05-10T23:57:25.268504 #620712] INFO -- : echo b19a6416da3a05d57fadd6ffdadb382b6d236ca5 | /bin/sh /tmp/ruby/src/trunk/tool/ifchange /tmp/ruby/src/trunk/.bundle/.timestamp/typeprof.revision - I, [2024-05-10T23:57:25.269460 #620712] INFO -- : /tmp/ruby/src/trunk/.bundle/.timestamp/minitest.revision unchanged I, [2024-05-10T23:57:25.269499 #620712] INFO -- : /tmp/ruby/src/trunk/.bundle/.timestamp/power_assert.revision unchanged I, [2024-05-10T23:57:25.270082 #620712] INFO -- : /tmp/ruby/src/trunk/.bundle/.timestamp/rbs.revision unchanged I, [2024-05-10T23:57:25.270373 #620712] INFO -- : /tmp/ruby/src/trunk/.bundle/.timestamp/typeprof.revision unchanged I, [2024-05-10T23:57:25.270531 #620712] INFO -- : Building power_assert@84e85124c5014a139af39161d484156cfe87a9ed to /tmp/ruby/src/trunk/gems/power_assert-2.0.3.gem I, [2024-05-10T23:57:25.339944 #620712] INFO -- : Successfully built RubyGem I, [2024-05-10T23:57:25.340002 #620712] INFO -- : Name: power_assert I, [2024-05-10T23:57:25.340022 #620712] INFO -- : Version: 2.0.4dev I, [2024-05-10T23:57:25.340034 #620712] INFO -- : File: power_assert-2.0.4dev.gem I, [2024-05-10T23:57:25.385832 #620712] INFO -- : $$$[end] "make update-download -j20" exit with 0. I, [2024-05-10T23:57:25.385873 #620712] INFO -- : $$$[beg] make update-rubyspec -j20 I, [2024-05-10T23:57:25.443844 #620712] INFO -- : make: Nothing to be done for 'update-rubyspec'. I, [2024-05-10T23:57:25.444063 #620712] INFO -- : $$$[end] "make update-rubyspec -j20" exit with 0. I, [2024-05-10T23:57:25.444090 #620712] INFO -- : $$$[beg] make update-src -j20 I, [2024-05-10T23:57:25.983188 #620712] INFO -- : Already up to date. I, [2024-05-10T23:57:26.001459 #620712] INFO -- : Latest commit hash = 68b6fe7048 I, [2024-05-10T23:57:26.003103 #620712] INFO -- : $$$[end] "make update-src -j20" exit with 0. I, [2024-05-10T23:57:26.003164 #620712] INFO -- : $$$[beg] make after-update -j20 I, [2024-05-10T23:57:26.102007 #620712] INFO -- : /tmp/ruby/src/trunk/revision.h updated I, [2024-05-10T23:57:26.103281 #620712] INFO -- : generating x86_64-linux-fake.rb I, [2024-05-10T23:57:26.153859 #620712] INFO -- : x86_64-linux-fake.rb updated I, [2024-05-10T23:57:26.155072 #620712] INFO -- : generating enc.mk I, [2024-05-10T23:57:26.273970 #620712] INFO -- : making srcs under enc I, [2024-05-10T23:57:26.303877 #620712] INFO -- : make[1]: Entering directory '/tmp/ruby/build/trunk' I, [2024-05-10T23:57:26.303898 #620712] INFO -- : make[1]: Nothing to be done for 'srcs'. I, [2024-05-10T23:57:26.303904 #620712] INFO -- : make[1]: Leaving directory '/tmp/ruby/build/trunk' I, [2024-05-10T23:57:26.348176 #620712] INFO -- : Update minitest to ea9caafc0754b1d6236a490d59e624b53209734a I, [2024-05-10T23:57:26.348307 #620712] INFO -- : Update power_assert to 84e85124c5014a139af39161d484156cfe87a9ed I, [2024-05-10T23:57:26.348925 #620712] INFO -- : Update rbs to ba7872795d5de04adb8ff500c0e6afdc81a041dd I, [2024-05-10T23:57:26.349312 #620712] INFO -- : Update typeprof to b19a6416da3a05d57fadd6ffdadb382b6d236ca5 I, [2024-05-10T23:57:26.349637 #620712] INFO -- : echo ea9caafc0754b1d6236a490d59e624b53209734a | /bin/sh /tmp/ruby/src/trunk/tool/ifchange /tmp/ruby/src/trunk/.bundle/.timestamp/minitest.revision - I, [2024-05-10T23:57:26.349895 #620712] INFO -- : echo 84e85124c5014a139af39161d484156cfe87a9ed | /bin/sh /tmp/ruby/src/trunk/tool/ifchange /tmp/ruby/src/trunk/.bundle/.timestamp/power_assert.revision - I, [2024-05-10T23:57:26.351179 #620712] INFO -- : echo ba7872795d5de04adb8ff500c0e6afdc81a041dd | /bin/sh /tmp/ruby/src/trunk/tool/ifchange /tmp/ruby/src/trunk/.bundle/.timestamp/rbs.revision - I, [2024-05-10T23:57:26.351497 #620712] INFO -- : echo b19a6416da3a05d57fadd6ffdadb382b6d236ca5 | /bin/sh /tmp/ruby/src/trunk/tool/ifchange /tmp/ruby/src/trunk/.bundle/.timestamp/typeprof.revision - I, [2024-05-10T23:57:26.351517 #620712] INFO -- : /tmp/ruby/src/trunk/.bundle/.timestamp/minitest.revision unchanged I, [2024-05-10T23:57:26.351831 #620712] INFO -- : /tmp/ruby/src/trunk/.bundle/.timestamp/power_assert.revision unchanged I, [2024-05-10T23:57:26.352832 #620712] INFO -- : /tmp/ruby/src/trunk/.bundle/.timestamp/rbs.revision unchanged I, [2024-05-10T23:57:26.353002 #620712] INFO -- : /tmp/ruby/src/trunk/.bundle/.timestamp/typeprof.revision unchanged I, [2024-05-10T23:57:26.353146 #620712] INFO -- : Building power_assert@84e85124c5014a139af39161d484156cfe87a9ed to /tmp/ruby/src/trunk/gems/power_assert-2.0.3.gem I, [2024-05-10T23:57:26.422417 #620712] INFO -- : Successfully built RubyGem I, [2024-05-10T23:57:26.422461 #620712] INFO -- : Name: power_assert I, [2024-05-10T23:57:26.422467 #620712] INFO -- : Version: 2.0.4dev I, [2024-05-10T23:57:26.422471 #620712] INFO -- : File: power_assert-2.0.4dev.gem I, [2024-05-10T23:57:26.424531 #620712] INFO -- : Extracting bundle gem power_assert-2.0.3... I, [2024-05-10T23:57:26.485158 #620712] INFO -- : Try with hash version of bundled gems instead of gems/power_assert-2.0.3.gem. We don't use this gem with release version of Ruby. I, [2024-05-10T23:57:26.490103 #620712] INFO -- : Unpacked gems/power_assert-2.0.4dev.gem I, [2024-05-10T23:57:26.492197 #620712] INFO -- : $$$[end] "make after-update -j20" exit with 0. I, [2024-05-10T23:57:26.492297 #620712] INFO -- : $$$[beg] make miniruby -j20 I, [2024-05-10T23:57:26.551454 #620712] INFO -- : BASERUBY = /usr/bin/ruby --disable=gems I, [2024-05-10T23:57:26.551510 #620712] INFO -- : CC = gcc I, [2024-05-10T23:57:26.551529 #620712] INFO -- : LD = ld I, [2024-05-10T23:57:26.551545 #620712] INFO -- : LDSHARED = gcc -shared I, [2024-05-10T23:57:26.551560 #620712] INFO -- : CFLAGS = -O3 -fno-fast-math -ggdb3 -Wall -Wextra -Wdeprecated-declarations -Wdiv-by-zero -Wduplicated-cond -Wimplicit-function-declaration -Wimplicit-int -Wpointer-arith -Wwrite-strings -Wold-style-definition -Wimplicit-fallthrough=0 -Wmissing-noreturn -Wno-cast-function-type -Wno-constant-logical-operand -Wno-long-long -Wno-missing-field-initializers -Wno-overlength-strings -Wno-packed-bitfield-compat -Wno-parentheses-equality -Wno-self-assign -Wno-tautological-compare -Wno-unused-parameter -Wno-unused-value -Wsuggest-attribute=format -Wsuggest-attribute=noreturn -Wunused-variable -Wmisleading-indentation -Wundef -fPIC I, [2024-05-10T23:57:26.551576 #620712] INFO -- : XCFLAGS = -U_FORTIFY_SOURCE -D_FORTIFY_SOURCE=2 -fstack-protector-strong -fno-strict-overflow -fvisibility=hidden -fexcess-precision=standard -DRUBY_EXPORT -I. -I.ext/include/x86_64-linux -I/tmp/ruby/src/trunk/include -I/tmp/ruby/src/trunk -I/tmp/ruby/src/trunk/prism -I/tmp/ruby/src/trunk/enc/unicode/15.0.0 I, [2024-05-10T23:57:26.551591 #620712] INFO -- : CPPFLAGS = I, [2024-05-10T23:57:26.551606 #620712] INFO -- : DLDFLAGS = -Wl,--compress-debug-sections=zlib -Wl,-soname,libruby.so.3.4 -fstack-protector-strong I, [2024-05-10T23:57:26.551621 #620712] INFO -- : SOLIBS = -lz -lrt -lrt -lgmp -ldl -lcrypt -lm -lpthread I, [2024-05-10T23:57:26.551647 #620712] INFO -- : LANG = en_US.UTF-8 I, [2024-05-10T23:57:26.551663 #620712] INFO -- : LC_ALL = I, [2024-05-10T23:57:26.551677 #620712] INFO -- : LC_CTYPE = I, [2024-05-10T23:57:26.551702 #620712] INFO -- : MFLAGS = -j20 --jobserver-auth=4,5 I, [2024-05-10T23:57:26.551718 #620712] INFO -- : RUSTC = no I, [2024-05-10T23:57:26.551734 #620712] INFO -- : YJIT_RUSTC_ARGS = --crate-name=yjit --crate-type=staticlib --edition=2021 -g -C lto=thin -C opt-level=3 -C overflow-checks=on '--out-dir=/tmp/ruby/build/trunk/yjit/target/release/' /tmp/ruby/src/trunk/yjit/src/lib.rs I, [2024-05-10T23:57:26.553490 #620712] INFO -- : gcc (Ubuntu 11.4.0-1ubuntu1~22.04) 11.4.0 I, [2024-05-10T23:57:26.553545 #620712] INFO -- : Copyright (C) 2021 Free Software Foundation, Inc. I, [2024-05-10T23:57:26.553562 #620712] INFO -- : This is free software; see the source for copying conditions. There is NO I, [2024-05-10T23:57:26.553577 #620712] INFO -- : warranty; not even for MERCHANTABILITY or FITNESS FOR A PARTICULAR PURPOSE. I, [2024-05-10T23:57:26.553592 #620712] INFO -- : I, [2024-05-10T23:57:26.579212 #620712] INFO -- : compiling /tmp/ruby/src/trunk/version.c I, [2024-05-10T23:57:26.681668 #620712] INFO -- : linking miniruby I, [2024-05-10T23:57:27.201575 #620712] INFO -- : $$$[end] "make miniruby -j20" exit with 0. I, [2024-05-10T23:57:27.201689 #620712] INFO -- : $$$[beg] make ruby -j20 I, [2024-05-10T23:57:27.259880 #620712] INFO -- : BASERUBY = /usr/bin/ruby --disable=gems I, [2024-05-10T23:57:27.259921 #620712] INFO -- : CC = gcc I, [2024-05-10T23:57:27.259936 #620712] INFO -- : LD = ld I, [2024-05-10T23:57:27.259948 #620712] INFO -- : LDSHARED = gcc -shared I, [2024-05-10T23:57:27.259966 #620712] INFO -- : CFLAGS = -O3 -fno-fast-math -ggdb3 -Wall -Wextra -Wdeprecated-declarations -Wdiv-by-zero -Wduplicated-cond -Wimplicit-function-declaration -Wimplicit-int -Wpointer-arith -Wwrite-strings -Wold-style-definition -Wimplicit-fallthrough=0 -Wmissing-noreturn -Wno-cast-function-type -Wno-constant-logical-operand -Wno-long-long -Wno-missing-field-initializers -Wno-overlength-strings -Wno-packed-bitfield-compat -Wno-parentheses-equality -Wno-self-assign -Wno-tautological-compare -Wno-unused-parameter -Wno-unused-value -Wsuggest-attribute=format -Wsuggest-attribute=noreturn -Wunused-variable -Wmisleading-indentation -Wundef -fPIC I, [2024-05-10T23:57:27.259980 #620712] INFO -- : XCFLAGS = -U_FORTIFY_SOURCE -D_FORTIFY_SOURCE=2 -fstack-protector-strong -fno-strict-overflow -fvisibility=hidden -fexcess-precision=standard -DRUBY_EXPORT -I. -I.ext/include/x86_64-linux -I/tmp/ruby/src/trunk/include -I/tmp/ruby/src/trunk -I/tmp/ruby/src/trunk/prism -I/tmp/ruby/src/trunk/enc/unicode/15.0.0 I, [2024-05-10T23:57:27.259992 #620712] INFO -- : CPPFLAGS = I, [2024-05-10T23:57:27.260003 #620712] INFO -- : DLDFLAGS = -Wl,--compress-debug-sections=zlib -Wl,-soname,libruby.so.3.4 -fstack-protector-strong I, [2024-05-10T23:57:27.260015 #620712] INFO -- : SOLIBS = -lz -lrt -lrt -lgmp -ldl -lcrypt -lm -lpthread I, [2024-05-10T23:57:27.260026 #620712] INFO -- : LANG = en_US.UTF-8 I, [2024-05-10T23:57:27.260037 #620712] INFO -- : LC_ALL = I, [2024-05-10T23:57:27.260047 #620712] INFO -- : LC_CTYPE = I, [2024-05-10T23:57:27.260058 #620712] INFO -- : MFLAGS = -j20 --jobserver-auth=4,5 I, [2024-05-10T23:57:27.260070 #620712] INFO -- : RUSTC = no I, [2024-05-10T23:57:27.260081 #620712] INFO -- : YJIT_RUSTC_ARGS = --crate-name=yjit --crate-type=staticlib --edition=2021 -g -C lto=thin -C opt-level=3 -C overflow-checks=on '--out-dir=/tmp/ruby/build/trunk/yjit/target/release/' /tmp/ruby/src/trunk/yjit/src/lib.rs I, [2024-05-10T23:57:27.261375 #620712] INFO -- : gcc (Ubuntu 11.4.0-1ubuntu1~22.04) 11.4.0 I, [2024-05-10T23:57:27.261419 #620712] INFO -- : Copyright (C) 2021 Free Software Foundation, Inc. I, [2024-05-10T23:57:27.261435 #620712] INFO -- : This is free software; see the source for copying conditions. There is NO I, [2024-05-10T23:57:27.261456 #620712] INFO -- : warranty; not even for MERCHANTABILITY or FITNESS FOR A PARTICULAR PURPOSE. I, [2024-05-10T23:57:27.261480 #620712] INFO -- : I, [2024-05-10T23:57:27.371644 #620712] INFO -- : builtin_binary.inc updated I, [2024-05-10T23:57:27.376167 #620712] INFO -- : c5234a9416e4f20f175185e840b25b0f08674d14078ed7083f37e655458e3ca9 builtin_binary.inc I, [2024-05-10T23:57:27.376861 #620712] INFO -- : compiling /tmp/ruby/src/trunk/builtin.c I, [2024-05-10T23:57:27.560831 #620712] INFO -- : linking static-library libruby-static.a I, [2024-05-10T23:57:27.854895 #620712] INFO -- : linking shared-library libruby.so.3.4.0 I, [2024-05-10T23:57:29.396677 #620712] INFO -- : linking ruby I, [2024-05-10T23:57:29.423065 #620712] INFO -- : $$$[end] "make ruby -j20" exit with 0. I, [2024-05-10T23:57:29.423254 #620712] INFO -- : $$$[beg] make all -j20 I, [2024-05-10T23:57:29.488066 #620712] INFO -- : BASERUBY = /usr/bin/ruby --disable=gems I, [2024-05-10T23:57:29.488096 #620712] INFO -- : CC = gcc I, [2024-05-10T23:57:29.488101 #620712] INFO -- : LD = ld I, [2024-05-10T23:57:29.488104 #620712] INFO -- : LDSHARED = gcc -shared I, [2024-05-10T23:57:29.488108 #620712] INFO -- : CFLAGS = -O3 -fno-fast-math -ggdb3 -Wall -Wextra -Wdeprecated-declarations -Wdiv-by-zero -Wduplicated-cond -Wimplicit-function-declaration -Wimplicit-int -Wpointer-arith -Wwrite-strings -Wold-style-definition -Wimplicit-fallthrough=0 -Wmissing-noreturn -Wno-cast-function-type -Wno-constant-logical-operand -Wno-long-long -Wno-missing-field-initializers -Wno-overlength-strings -Wno-packed-bitfield-compat -Wno-parentheses-equality -Wno-self-assign -Wno-tautological-compare -Wno-unused-parameter -Wno-unused-value -Wsuggest-attribute=format -Wsuggest-attribute=noreturn -Wunused-variable -Wmisleading-indentation -Wundef -fPIC I, [2024-05-10T23:57:29.488114 #620712] INFO -- : XCFLAGS = -U_FORTIFY_SOURCE -D_FORTIFY_SOURCE=2 -fstack-protector-strong -fno-strict-overflow -fvisibility=hidden -fexcess-precision=standard -DRUBY_EXPORT -I. -I.ext/include/x86_64-linux -I/tmp/ruby/src/trunk/include -I/tmp/ruby/src/trunk -I/tmp/ruby/src/trunk/prism -I/tmp/ruby/src/trunk/enc/unicode/15.0.0 I, [2024-05-10T23:57:29.488117 #620712] INFO -- : CPPFLAGS = I, [2024-05-10T23:57:29.488121 #620712] INFO -- : DLDFLAGS = -Wl,--compress-debug-sections=zlib -Wl,-soname,libruby.so.3.4 -fstack-protector-strong I, [2024-05-10T23:57:29.488125 #620712] INFO -- : SOLIBS = -lz -lrt -lrt -lgmp -ldl -lcrypt -lm -lpthread I, [2024-05-10T23:57:29.488128 #620712] INFO -- : LANG = en_US.UTF-8 I, [2024-05-10T23:57:29.488132 #620712] INFO -- : LC_ALL = I, [2024-05-10T23:57:29.488135 #620712] INFO -- : LC_CTYPE = I, [2024-05-10T23:57:29.488139 #620712] INFO -- : MFLAGS = -j20 --jobserver-auth=4,5 I, [2024-05-10T23:57:29.488142 #620712] INFO -- : RUSTC = no I, [2024-05-10T23:57:29.488146 #620712] INFO -- : YJIT_RUSTC_ARGS = --crate-name=yjit --crate-type=staticlib --edition=2021 -g -C lto=thin -C opt-level=3 -C overflow-checks=on '--out-dir=/tmp/ruby/build/trunk/yjit/target/release/' /tmp/ruby/src/trunk/yjit/src/lib.rs I, [2024-05-10T23:57:29.489616 #620712] INFO -- : gcc (Ubuntu 11.4.0-1ubuntu1~22.04) 11.4.0 I, [2024-05-10T23:57:29.489636 #620712] INFO -- : Copyright (C) 2021 Free Software Foundation, Inc. I, [2024-05-10T23:57:29.489641 #620712] INFO -- : This is free software; see the source for copying conditions. There is NO I, [2024-05-10T23:57:29.489645 #620712] INFO -- : warranty; not even for MERCHANTABILITY or FITNESS FOR A PARTICULAR PURPOSE. I, [2024-05-10T23:57:29.489649 #620712] INFO -- : I, [2024-05-10T23:57:29.518392 #620712] INFO -- : generating enc.mk I, [2024-05-10T23:57:29.520087 #620712] INFO -- : building spec/ruby/optional/capi/ext/array_spec.so I, [2024-05-10T23:57:29.520430 #620712] INFO -- : building spec/ruby/optional/capi/ext/basic_object_spec.so I, [2024-05-10T23:57:29.521224 #620712] INFO -- : building spec/ruby/optional/capi/ext/bignum_spec.so I, [2024-05-10T23:57:29.521764 #620712] INFO -- : building spec/ruby/optional/capi/ext/binding_spec.so I, [2024-05-10T23:57:29.521948 #620712] INFO -- : building spec/ruby/optional/capi/ext/boolean_spec.so I, [2024-05-10T23:57:29.522765 #620712] INFO -- : building spec/ruby/optional/capi/ext/class_id_under_autoload_spec.so I, [2024-05-10T23:57:29.523432 #620712] INFO -- : building spec/ruby/optional/capi/ext/class_spec.so I, [2024-05-10T23:57:29.523874 #620712] INFO -- : building spec/ruby/optional/capi/ext/class_under_autoload_spec.so I, [2024-05-10T23:57:29.524467 #620712] INFO -- : building spec/ruby/optional/capi/ext/complex_spec.so I, [2024-05-10T23:57:29.525221 #620712] INFO -- : building spec/ruby/optional/capi/ext/constants_spec.so I, [2024-05-10T23:57:29.525947 #620712] INFO -- : building spec/ruby/optional/capi/ext/data_spec.so I, [2024-05-10T23:57:29.526588 #620712] INFO -- : building spec/ruby/optional/capi/ext/debug_spec.so I, [2024-05-10T23:57:29.526914 #620712] INFO -- : building spec/ruby/optional/capi/ext/encoding_spec.so I, [2024-05-10T23:57:29.527533 #620712] INFO -- : building spec/ruby/optional/capi/ext/enumerator_spec.so I, [2024-05-10T23:57:29.527915 #620712] INFO -- : building spec/ruby/optional/capi/ext/exception_spec.so I, [2024-05-10T23:57:29.528681 #620712] INFO -- : building spec/ruby/optional/capi/ext/fiber_spec.so I, [2024-05-10T23:57:29.529448 #620712] INFO -- : building spec/ruby/optional/capi/ext/file_spec.so I, [2024-05-10T23:57:29.529750 #620712] INFO -- : building spec/ruby/optional/capi/ext/fixnum_spec.so I, [2024-05-10T23:57:29.530656 #620712] INFO -- : building spec/ruby/optional/capi/ext/float_spec.so I, [2024-05-10T23:57:29.635269 #620712] INFO -- : building spec/ruby/optional/capi/ext/gc_spec.so I, [2024-05-10T23:57:29.657667 #620712] INFO -- : building spec/ruby/optional/capi/ext/globals_spec.so I, [2024-05-10T23:57:29.659181 #620712] INFO -- : building spec/ruby/optional/capi/ext/hash_spec.so I, [2024-05-10T23:57:29.678182 #620712] INFO -- : building spec/ruby/optional/capi/ext/integer_spec.so I, [2024-05-10T23:57:29.679814 #620712] INFO -- : building spec/ruby/optional/capi/ext/io_spec.so I, [2024-05-10T23:57:29.681621 #620712] INFO -- : building spec/ruby/optional/capi/ext/kernel_spec.so I, [2024-05-10T23:57:29.687185 #620712] INFO -- : building spec/ruby/optional/capi/ext/language_spec.so I, [2024-05-10T23:57:29.687616 #620712] INFO -- : building spec/ruby/optional/capi/ext/marshal_spec.so I, [2024-05-10T23:57:29.695351 #620712] INFO -- : building spec/ruby/optional/capi/ext/module_spec.so I, [2024-05-10T23:57:29.698698 #620712] INFO -- : building spec/ruby/optional/capi/ext/module_under_autoload_spec.so I, [2024-05-10T23:57:29.704975 #620712] INFO -- : building spec/ruby/optional/capi/ext/mutex_spec.so I, [2024-05-10T23:57:29.706321 #620712] INFO -- : building spec/ruby/optional/capi/ext/numeric_spec.so I, [2024-05-10T23:57:29.707066 #620712] INFO -- : building spec/ruby/optional/capi/ext/object_spec.so I, [2024-05-10T23:57:29.708618 #620712] INFO -- : building spec/ruby/optional/capi/ext/proc_spec.so I, [2024-05-10T23:57:29.717045 #620712] INFO -- : building spec/ruby/optional/capi/ext/range_spec.so I, [2024-05-10T23:57:29.723129 #620712] INFO -- : building spec/ruby/optional/capi/ext/rational_spec.so I, [2024-05-10T23:57:29.756954 #620712] INFO -- : building spec/ruby/optional/capi/ext/rbasic_spec.so I, [2024-05-10T23:57:29.760085 #620712] INFO -- : building spec/ruby/optional/capi/ext/regexp_spec.so I, [2024-05-10T23:57:29.809420 #620712] INFO -- : building spec/ruby/optional/capi/ext/string_spec.so I, [2024-05-10T23:57:29.831983 #620712] INFO -- : building spec/ruby/optional/capi/ext/struct_spec.so I, [2024-05-10T23:57:29.835818 #620712] INFO -- : building spec/ruby/optional/capi/ext/st_spec.so I, [2024-05-10T23:57:29.837543 #620712] INFO -- : building spec/ruby/optional/capi/ext/symbol_spec.so I, [2024-05-10T23:57:29.837856 #620712] INFO -- : building spec/ruby/optional/capi/ext/thread_spec.so I, [2024-05-10T23:57:29.842345 #620712] INFO -- : building spec/ruby/optional/capi/ext/time_spec.so I, [2024-05-10T23:57:29.849640 #620712] INFO -- : building spec/ruby/optional/capi/ext/tracepoint_spec.so I, [2024-05-10T23:57:29.858084 #620712] INFO -- : building spec/ruby/optional/capi/ext/typed_data_spec.so I, [2024-05-10T23:57:29.863942 #620712] INFO -- : building spec/ruby/optional/capi/ext/util_spec.so I, [2024-05-10T23:57:29.873465 #620712] INFO -- : making enc I, [2024-05-10T23:57:29.886899 #620712] INFO -- : making srcs under enc I, [2024-05-10T23:57:29.901088 #620712] INFO -- : make[1]: Entering directory '/tmp/ruby/build/trunk' I, [2024-05-10T23:57:29.901163 #620712] INFO -- : make[1]: Nothing to be done for 'enc'. I, [2024-05-10T23:57:29.901190 #620712] INFO -- : make[1]: Leaving directory '/tmp/ruby/build/trunk' I, [2024-05-10T23:57:29.929797 #620712] INFO -- : make[1]: Entering directory '/tmp/ruby/build/trunk' I, [2024-05-10T23:57:29.929856 #620712] INFO -- : make[1]: Nothing to be done for 'srcs'. I, [2024-05-10T23:57:29.929867 #620712] INFO -- : make[1]: Leaving directory '/tmp/ruby/build/trunk' I, [2024-05-10T23:57:29.930385 #620712] INFO -- : generating transdb.h I, [2024-05-10T23:57:30.028872 #620712] INFO -- : transdb.h unchanged I, [2024-05-10T23:57:30.030227 #620712] INFO -- : generating makefiles ext/configure-ext.mk I, [2024-05-10T23:57:30.030546 #620712] INFO -- : making trans I, [2024-05-10T23:57:30.056296 #620712] INFO -- : ext/configure-ext.mk updated I, [2024-05-10T23:57:30.058887 #620712] INFO -- : make[1]: Entering directory '/tmp/ruby/build/trunk' I, [2024-05-10T23:57:30.064885 #620712] INFO -- : make[1]: Entering directory '/tmp/ruby/build/trunk' I, [2024-05-10T23:57:30.064985 #620712] INFO -- : make[1]: Nothing to be done for 'trans'. I, [2024-05-10T23:57:30.064994 #620712] INFO -- : make[1]: Leaving directory '/tmp/ruby/build/trunk' I, [2024-05-10T23:57:30.066020 #620712] INFO -- : making encs I, [2024-05-10T23:57:30.124028 #620712] INFO -- : make[1]: Entering directory '/tmp/ruby/build/trunk' I, [2024-05-10T23:57:30.125093 #620712] INFO -- : make[1]: Nothing to be done for 'encs'. I, [2024-05-10T23:57:30.125154 #620712] INFO -- : make[1]: Leaving directory '/tmp/ruby/build/trunk' I, [2024-05-10T23:57:30.215480 #620712] INFO -- : make[1]: Leaving directory '/tmp/ruby/build/trunk' I, [2024-05-10T23:57:30.216192 #620712] INFO -- : generating makefile exts.mk I, [2024-05-10T23:57:30.254265 #620712] INFO -- : exts.mk unchanged I, [2024-05-10T23:57:30.258817 #620712] INFO -- : make[1]: Entering directory '/tmp/ruby/build/trunk' I, [2024-05-10T23:57:30.281069 #620712] INFO -- : make[2]: Entering directory '/tmp/ruby/build/trunk/ext/digest' I, [2024-05-10T23:57:30.282344 #620712] INFO -- : make[2]: Entering directory '/tmp/ruby/build/trunk/ext/coverage' I, [2024-05-10T23:57:30.282882 #620712] INFO -- : make[2]: Entering directory '/tmp/ruby/build/trunk/ext/json' I, [2024-05-10T23:57:30.283207 #620712] INFO -- : make[2]: Entering directory '/tmp/ruby/build/trunk/ext/date' I, [2024-05-10T23:57:30.283231 #620712] INFO -- : make[2]: Entering directory '/tmp/ruby/build/trunk/ext/io/console' I, [2024-05-10T23:57:30.284353 #620712] INFO -- : make[2]: Entering directory '/tmp/ruby/build/trunk/ext/rubyvm' I, [2024-05-10T23:57:30.284784 #620712] INFO -- : make[2]: Entering directory '/tmp/ruby/build/trunk/ext/monitor' I, [2024-05-10T23:57:30.285290 #620712] INFO -- : make[2]: Leaving directory '/tmp/ruby/build/trunk/ext/digest' I, [2024-05-10T23:57:30.285438 #620712] INFO -- : make[2]: Entering directory '/tmp/ruby/build/trunk/ext/pathname' I, [2024-05-10T23:57:30.285856 #620712] INFO -- : make[2]: Entering directory '/tmp/ruby/build/trunk/ext/fiddle' I, [2024-05-10T23:57:30.285876 #620712] INFO -- : make[2]: Entering directory '/tmp/ruby/build/trunk/ext/pty' I, [2024-05-10T23:57:30.286116 #620712] INFO -- : make[2]: Leaving directory '/tmp/ruby/build/trunk/ext/coverage' I, [2024-05-10T23:57:30.286469 #620712] INFO -- : make[2]: Leaving directory '/tmp/ruby/build/trunk/ext/io/console' I, [2024-05-10T23:57:30.286573 #620712] INFO -- : make[2]: Leaving directory '/tmp/ruby/build/trunk/ext/rubyvm' I, [2024-05-10T23:57:30.287141 #620712] INFO -- : make[2]: Entering directory '/tmp/ruby/build/trunk/ext/objspace' I, [2024-05-10T23:57:30.287199 #620712] INFO -- : make[2]: Leaving directory '/tmp/ruby/build/trunk/ext/date' I, [2024-05-10T23:57:30.287372 #620712] INFO -- : make[2]: Leaving directory '/tmp/ruby/build/trunk/ext/monitor' I, [2024-05-10T23:57:30.287578 #620712] INFO -- : make[2]: Entering directory '/tmp/ruby/build/trunk/ext/psych' I, [2024-05-10T23:57:30.288147 #620712] INFO -- : make[2]: Leaving directory '/tmp/ruby/build/trunk/ext/pathname' I, [2024-05-10T23:57:30.288965 #620712] INFO -- : make[2]: Entering directory '/tmp/ruby/build/trunk/ext/ripper' I, [2024-05-10T23:57:30.289093 #620712] INFO -- : make[2]: Leaving directory '/tmp/ruby/build/trunk/ext/pty' I, [2024-05-10T23:57:30.289709 #620712] INFO -- : make[2]: Entering directory '/tmp/ruby/build/trunk/.bundle/gems/bigdecimal-3.1.8/ext/bigdecimal' I, [2024-05-10T23:57:30.290296 #620712] INFO -- : make[2]: Entering directory '/tmp/ruby/build/trunk/.bundle/gems/debug-1.9.2/ext/debug' I, [2024-05-10T23:57:30.290398 #620712] INFO -- : make[2]: Entering directory '/tmp/ruby/build/trunk/.bundle/gems/nkf-0.2.0/ext/nkf' I, [2024-05-10T23:57:30.290599 #620712] INFO -- : make[2]: Entering directory '/tmp/ruby/build/trunk/.bundle/gems/racc-1.7.3/ext/racc/cparse' I, [2024-05-10T23:57:30.290868 #620712] INFO -- : make[2]: Entering directory '/tmp/ruby/build/trunk/.bundle/gems/syslog-0.1.2/ext/syslog' I, [2024-05-10T23:57:30.291204 #620712] INFO -- : make[2]: Leaving directory '/tmp/ruby/build/trunk/ext/objspace' I, [2024-05-10T23:57:30.291248 #620712] INFO -- : make[2]: Entering directory '/tmp/ruby/build/trunk/.bundle/gems/rbs-3.4.4/ext/rbs_extension' I, [2024-05-10T23:57:30.291755 #620712] INFO -- : make[2]: Leaving directory '/tmp/ruby/build/trunk/ext/json' I, [2024-05-10T23:57:30.292527 #620712] INFO -- : make[2]: Leaving directory '/tmp/ruby/build/trunk/ext/fiddle' I, [2024-05-10T23:57:30.293366 #620712] INFO -- : make[2]: Entering directory '/tmp/ruby/build/trunk/ext/socket' I, [2024-05-10T23:57:30.293859 #620712] INFO -- : make[2]: Leaving directory '/tmp/ruby/build/trunk/ext/ripper' I, [2024-05-10T23:57:30.295497 #620712] INFO -- : make[2]: Entering directory '/tmp/ruby/build/trunk/ext/digest/sha2' I, [2024-05-10T23:57:30.296911 #620712] INFO -- : make[2]: Entering directory '/tmp/ruby/build/trunk/ext/openssl' I, [2024-05-10T23:57:30.297693 #620712] INFO -- : make[2]: Leaving directory '/tmp/ruby/build/trunk/ext/digest/sha2' I, [2024-05-10T23:57:30.298817 #620712] INFO -- : make[2]: Leaving directory '/tmp/ruby/build/trunk/ext/psych' I, [2024-05-10T23:57:30.302096 #620712] INFO -- : make[2]: Leaving directory '/tmp/ruby/build/trunk/ext/socket' I, [2024-05-10T23:57:30.307897 #620712] INFO -- : make[2]: Leaving directory '/tmp/ruby/build/trunk/ext/openssl' I, [2024-05-10T23:57:30.314367 #620712] INFO -- : make[2]: Leaving directory '/tmp/ruby/build/trunk/.bundle/gems/debug-1.9.2/ext/debug' I, [2024-05-10T23:57:30.314410 #620712] INFO -- : make[2]: Leaving directory '/tmp/ruby/build/trunk/.bundle/gems/nkf-0.2.0/ext/nkf' I, [2024-05-10T23:57:30.314534 #620712] INFO -- : make[2]: Leaving directory '/tmp/ruby/build/trunk/.bundle/gems/bigdecimal-3.1.8/ext/bigdecimal' I, [2024-05-10T23:57:30.323157 #620712] INFO -- : make[2]: Leaving directory '/tmp/ruby/build/trunk/.bundle/gems/racc-1.7.3/ext/racc/cparse' I, [2024-05-10T23:57:30.324302 #620712] INFO -- : make[2]: Leaving directory '/tmp/ruby/build/trunk/.bundle/gems/syslog-0.1.2/ext/syslog' I, [2024-05-10T23:57:30.324833 #620712] INFO -- : make[2]: Leaving directory '/tmp/ruby/build/trunk/.bundle/gems/rbs-3.4.4/ext/rbs_extension' I, [2024-05-10T23:57:30.349189 #620712] INFO -- : make[2]: Entering directory '/tmp/ruby/build/trunk' I, [2024-05-10T23:57:30.423187 #620712] INFO -- : linking ruby I, [2024-05-10T23:57:30.446103 #620712] INFO -- : make[2]: Leaving directory '/tmp/ruby/build/trunk' I, [2024-05-10T23:57:30.446526 #620712] INFO -- : make[1]: Leaving directory '/tmp/ruby/build/trunk' I, [2024-05-10T23:57:30.450266 #620712] INFO -- : make[1]: Entering directory '/tmp/ruby/build/trunk' I, [2024-05-10T23:57:30.450288 #620712] INFO -- : make[1]: Nothing to be done for 'note'. I, [2024-05-10T23:57:30.450294 #620712] INFO -- : make[1]: Leaving directory '/tmp/ruby/build/trunk' I, [2024-05-10T23:57:30.451024 #620712] INFO -- : $$$[end] "make all -j20" exit with 0. I, [2024-05-10T23:57:30.451154 #620712] INFO -- : $$$[beg] make install -j20 I, [2024-05-10T23:57:30.520774 #620712] INFO -- : Update minitest to ea9caafc0754b1d6236a490d59e624b53209734a I, [2024-05-10T23:57:30.520970 #620712] INFO -- : Update power_assert to 84e85124c5014a139af39161d484156cfe87a9ed I, [2024-05-10T23:57:30.521602 #620712] INFO -- : Update rbs to ba7872795d5de04adb8ff500c0e6afdc81a041dd I, [2024-05-10T23:57:30.521654 #620712] INFO -- : Update typeprof to b19a6416da3a05d57fadd6ffdadb382b6d236ca5 I, [2024-05-10T23:57:30.522700 #620712] INFO -- : echo ea9caafc0754b1d6236a490d59e624b53209734a | /bin/sh /tmp/ruby/src/trunk/tool/ifchange /tmp/ruby/src/trunk/.bundle/.timestamp/minitest.revision - I, [2024-05-10T23:57:30.522840 #620712] INFO -- : echo 84e85124c5014a139af39161d484156cfe87a9ed | /bin/sh /tmp/ruby/src/trunk/tool/ifchange /tmp/ruby/src/trunk/.bundle/.timestamp/power_assert.revision - I, [2024-05-10T23:57:30.523631 #620712] INFO -- : BASERUBY = /usr/bin/ruby --disable=gems I, [2024-05-10T23:57:30.523682 #620712] INFO -- : CC = gcc I, [2024-05-10T23:57:30.523703 #620712] INFO -- : LD = ld I, [2024-05-10T23:57:30.523715 #620712] INFO -- : LDSHARED = gcc -shared I, [2024-05-10T23:57:30.523726 #620712] INFO -- : CFLAGS = -O3 -fno-fast-math -ggdb3 -Wall -Wextra -Wdeprecated-declarations -Wdiv-by-zero -Wduplicated-cond -Wimplicit-function-declaration -Wimplicit-int -Wpointer-arith -Wwrite-strings -Wold-style-definition -Wimplicit-fallthrough=0 -Wmissing-noreturn -Wno-cast-function-type -Wno-constant-logical-operand -Wno-long-long -Wno-missing-field-initializers -Wno-overlength-strings -Wno-packed-bitfield-compat -Wno-parentheses-equality -Wno-self-assign -Wno-tautological-compare -Wno-unused-parameter -Wno-unused-value -Wsuggest-attribute=format -Wsuggest-attribute=noreturn -Wunused-variable -Wmisleading-indentation -Wundef -fPIC I, [2024-05-10T23:57:30.523741 #620712] INFO -- : XCFLAGS = -U_FORTIFY_SOURCE -D_FORTIFY_SOURCE=2 -fstack-protector-strong -fno-strict-overflow -fvisibility=hidden -fexcess-precision=standard -DRUBY_EXPORT -I. -I.ext/include/x86_64-linux -I/tmp/ruby/src/trunk/include -I/tmp/ruby/src/trunk -I/tmp/ruby/src/trunk/prism -I/tmp/ruby/src/trunk/enc/unicode/15.0.0 I, [2024-05-10T23:57:30.523753 #620712] INFO -- : CPPFLAGS = I, [2024-05-10T23:57:30.523763 #620712] INFO -- : DLDFLAGS = -Wl,--compress-debug-sections=zlib -Wl,-soname,libruby.so.3.4 -fstack-protector-strong I, [2024-05-10T23:57:30.523773 #620712] INFO -- : SOLIBS = -lz -lrt -lrt -lgmp -ldl -lcrypt -lm -lpthread I, [2024-05-10T23:57:30.523783 #620712] INFO -- : LANG = en_US.UTF-8 I, [2024-05-10T23:57:30.523793 #620712] INFO -- : LC_ALL = I, [2024-05-10T23:57:30.523803 #620712] INFO -- : LC_CTYPE = I, [2024-05-10T23:57:30.523813 #620712] INFO -- : MFLAGS = -j20 --jobserver-auth=4,5 I, [2024-05-10T23:57:30.523822 #620712] INFO -- : RUSTC = no I, [2024-05-10T23:57:30.523835 #620712] INFO -- : YJIT_RUSTC_ARGS = --crate-name=yjit --crate-type=staticlib --edition=2021 -g -C lto=thin -C opt-level=3 -C overflow-checks=on '--out-dir=/tmp/ruby/build/trunk/yjit/target/release/' /tmp/ruby/src/trunk/yjit/src/lib.rs I, [2024-05-10T23:57:30.524626 #620712] INFO -- : /tmp/ruby/src/trunk/.bundle/.timestamp/minitest.revision unchanged I, [2024-05-10T23:57:30.524679 #620712] INFO -- : /tmp/ruby/src/trunk/.bundle/.timestamp/power_assert.revision unchanged I, [2024-05-10T23:57:30.549844 #620712] INFO -- : echo ba7872795d5de04adb8ff500c0e6afdc81a041dd | /bin/sh /tmp/ruby/src/trunk/tool/ifchange /tmp/ruby/src/trunk/.bundle/.timestamp/rbs.revision - I, [2024-05-10T23:57:30.549900 #620712] INFO -- : echo b19a6416da3a05d57fadd6ffdadb382b6d236ca5 | /bin/sh /tmp/ruby/src/trunk/tool/ifchange /tmp/ruby/src/trunk/.bundle/.timestamp/typeprof.revision - I, [2024-05-10T23:57:30.550641 #620712] INFO -- : generating enc.mk I, [2024-05-10T23:57:30.550694 #620712] INFO -- : gcc (Ubuntu 11.4.0-1ubuntu1~22.04) 11.4.0 I, [2024-05-10T23:57:30.550712 #620712] INFO -- : Copyright (C) 2021 Free Software Foundation, Inc. I, [2024-05-10T23:57:30.550724 #620712] INFO -- : This is free software; see the source for copying conditions. There is NO I, [2024-05-10T23:57:30.550737 #620712] INFO -- : warranty; not even for MERCHANTABILITY or FITNESS FOR A PARTICULAR PURPOSE. I, [2024-05-10T23:57:30.550748 #620712] INFO -- : I, [2024-05-10T23:57:30.551848 #620712] INFO -- : /tmp/ruby/src/trunk/.bundle/.timestamp/rbs.revision unchanged I, [2024-05-10T23:57:30.551895 #620712] INFO -- : /tmp/ruby/src/trunk/.bundle/.timestamp/typeprof.revision unchanged I, [2024-05-10T23:57:30.671777 #620712] INFO -- : Building power_assert@84e85124c5014a139af39161d484156cfe87a9ed to /tmp/ruby/src/trunk/gems/power_assert-2.0.3.gem I, [2024-05-10T23:57:30.672029 #620712] INFO -- : making srcs under enc I, [2024-05-10T23:57:30.672781 #620712] INFO -- : making enc I, [2024-05-10T23:57:30.689526 #620712] INFO -- : make[1]: Entering directory '/tmp/ruby/build/trunk' I, [2024-05-10T23:57:30.689570 #620712] INFO -- : make[1]: Nothing to be done for 'enc'. I, [2024-05-10T23:57:30.689583 #620712] INFO -- : make[1]: Leaving directory '/tmp/ruby/build/trunk' I, [2024-05-10T23:57:30.701455 #620712] INFO -- : make[1]: Entering directory '/tmp/ruby/build/trunk' I, [2024-05-10T23:57:30.701495 #620712] INFO -- : make[1]: Nothing to be done for 'srcs'. I, [2024-05-10T23:57:30.701509 #620712] INFO -- : make[1]: Leaving directory '/tmp/ruby/build/trunk' I, [2024-05-10T23:57:30.702313 #620712] INFO -- : generating transdb.h I, [2024-05-10T23:57:30.741336 #620712] INFO -- : Successfully built RubyGem I, [2024-05-10T23:57:30.741394 #620712] INFO -- : Name: power_assert I, [2024-05-10T23:57:30.741407 #620712] INFO -- : Version: 2.0.4dev I, [2024-05-10T23:57:30.741425 #620712] INFO -- : File: power_assert-2.0.4dev.gem I, [2024-05-10T23:57:30.743631 #620712] INFO -- : Extracting bundle gem power_assert-2.0.3... I, [2024-05-10T23:57:30.798806 #620712] INFO -- : transdb.h unchanged I, [2024-05-10T23:57:30.800255 #620712] INFO -- : generating makefiles ext/configure-ext.mk I, [2024-05-10T23:57:30.800392 #620712] INFO -- : making trans I, [2024-05-10T23:57:30.805271 #620712] INFO -- : Try with hash version of bundled gems instead of gems/power_assert-2.0.3.gem. We don't use this gem with release version of Ruby. I, [2024-05-10T23:57:30.810282 #620712] INFO -- : Unpacked gems/power_assert-2.0.4dev.gem I, [2024-05-10T23:57:30.826853 #620712] INFO -- : ext/configure-ext.mk unchanged I, [2024-05-10T23:57:30.829169 #620712] INFO -- : make[1]: Entering directory '/tmp/ruby/build/trunk' I, [2024-05-10T23:57:30.837021 #620712] INFO -- : make[1]: Entering directory '/tmp/ruby/build/trunk' I, [2024-05-10T23:57:30.837089 #620712] INFO -- : make[1]: Nothing to be done for 'trans'. I, [2024-05-10T23:57:30.837098 #620712] INFO -- : make[1]: Leaving directory '/tmp/ruby/build/trunk' I, [2024-05-10T23:57:30.837776 #620712] INFO -- : making encs I, [2024-05-10T23:57:30.894940 #620712] INFO -- : make[1]: Entering directory '/tmp/ruby/build/trunk' I, [2024-05-10T23:57:30.895011 #620712] INFO -- : make[1]: Nothing to be done for 'encs'. I, [2024-05-10T23:57:30.895037 #620712] INFO -- : make[1]: Leaving directory '/tmp/ruby/build/trunk' I, [2024-05-10T23:57:30.979667 #620712] INFO -- : make[1]: Leaving directory '/tmp/ruby/build/trunk' I, [2024-05-10T23:57:30.980403 #620712] INFO -- : generating makefile exts.mk I, [2024-05-10T23:57:31.018300 #620712] INFO -- : exts.mk unchanged I, [2024-05-10T23:57:31.023669 #620712] INFO -- : make[1]: Entering directory '/tmp/ruby/build/trunk' I, [2024-05-10T23:57:31.044748 #620712] INFO -- : make[2]: Entering directory '/tmp/ruby/build/trunk/ext/digest' I, [2024-05-10T23:57:31.045767 #620712] INFO -- : make[2]: Entering directory '/tmp/ruby/build/trunk/ext/json' I, [2024-05-10T23:57:31.046379 #620712] INFO -- : make[2]: Entering directory '/tmp/ruby/build/trunk/ext/coverage' I, [2024-05-10T23:57:31.046763 #620712] INFO -- : make[2]: Entering directory '/tmp/ruby/build/trunk/ext/io/console' I, [2024-05-10T23:57:31.047242 #620712] INFO -- : make[2]: Entering directory '/tmp/ruby/build/trunk/ext/date' I, [2024-05-10T23:57:31.047957 #620712] INFO -- : make[2]: Entering directory '/tmp/ruby/build/trunk/ext/monitor' I, [2024-05-10T23:57:31.048607 #620712] INFO -- : make[2]: Entering directory '/tmp/ruby/build/trunk/ext/fiddle' I, [2024-05-10T23:57:31.048812 #620712] INFO -- : make[2]: Leaving directory '/tmp/ruby/build/trunk/ext/coverage' I, [2024-05-10T23:57:31.049033 #620712] INFO -- : make[2]: Entering directory '/tmp/ruby/build/trunk/ext/pathname' I, [2024-05-10T23:57:31.049079 #620712] INFO -- : make[2]: Leaving directory '/tmp/ruby/build/trunk/ext/digest' I, [2024-05-10T23:57:31.049566 #620712] INFO -- : make[2]: Leaving directory '/tmp/ruby/build/trunk/ext/io/console' I, [2024-05-10T23:57:31.049588 #620712] INFO -- : make[2]: Entering directory '/tmp/ruby/build/trunk/ext/pty' I, [2024-05-10T23:57:31.049678 #620712] INFO -- : make[2]: Entering directory '/tmp/ruby/build/trunk/ext/objspace' I, [2024-05-10T23:57:31.050698 #620712] INFO -- : make[2]: Leaving directory '/tmp/ruby/build/trunk/ext/monitor' I, [2024-05-10T23:57:31.050715 #620712] INFO -- : make[2]: Leaving directory '/tmp/ruby/build/trunk/ext/date' I, [2024-05-10T23:57:31.051051 #620712] INFO -- : make[2]: Leaving directory '/tmp/ruby/build/trunk/ext/json' I, [2024-05-10T23:57:31.051289 #620712] INFO -- : make[2]: Entering directory '/tmp/ruby/build/trunk/ext/psych' I, [2024-05-10T23:57:31.051417 #620712] INFO -- : make[2]: Leaving directory '/tmp/ruby/build/trunk/ext/pty' I, [2024-05-10T23:57:31.051627 #620712] INFO -- : make[2]: Leaving directory '/tmp/ruby/build/trunk/ext/pathname' I, [2024-05-10T23:57:31.052439 #620712] INFO -- : make[2]: Leaving directory '/tmp/ruby/build/trunk/ext/objspace' I, [2024-05-10T23:57:31.052578 #620712] INFO -- : make[2]: Entering directory '/tmp/ruby/build/trunk/ext/rubyvm' I, [2024-05-10T23:57:31.053936 #620712] INFO -- : make[2]: Entering directory '/tmp/ruby/build/trunk/.bundle/gems/bigdecimal-3.1.8/ext/bigdecimal' I, [2024-05-10T23:57:31.053961 #620712] INFO -- : make[2]: Entering directory '/tmp/ruby/build/trunk/.bundle/gems/debug-1.9.2/ext/debug' I, [2024-05-10T23:57:31.054039 #620712] INFO -- : make[2]: Entering directory '/tmp/ruby/build/trunk/.bundle/gems/nkf-0.2.0/ext/nkf' I, [2024-05-10T23:57:31.054142 #620712] INFO -- : make[2]: Entering directory '/tmp/ruby/build/trunk/.bundle/gems/racc-1.7.3/ext/racc/cparse' I, [2024-05-10T23:57:31.054168 #620712] INFO -- : make[2]: Entering directory '/tmp/ruby/build/trunk/ext/ripper' I, [2024-05-10T23:57:31.054376 #620712] INFO -- : make[2]: Entering directory '/tmp/ruby/build/trunk/.bundle/gems/syslog-0.1.2/ext/syslog' I, [2024-05-10T23:57:31.054495 #620712] INFO -- : make[2]: Leaving directory '/tmp/ruby/build/trunk/ext/rubyvm' I, [2024-05-10T23:57:31.054790 #620712] INFO -- : make[2]: Entering directory '/tmp/ruby/build/trunk/.bundle/gems/rbs-3.4.4/ext/rbs_extension' I, [2024-05-10T23:57:31.055145 #620712] INFO -- : make[2]: Leaving directory '/tmp/ruby/build/trunk/ext/fiddle' I, [2024-05-10T23:57:31.058345 #620712] INFO -- : make[2]: Entering directory '/tmp/ruby/build/trunk/ext/digest/sha2' I, [2024-05-10T23:57:31.059507 #620712] INFO -- : make[2]: Entering directory '/tmp/ruby/build/trunk/ext/openssl' I, [2024-05-10T23:57:31.060624 #620712] INFO -- : make[2]: Leaving directory '/tmp/ruby/build/trunk/ext/digest/sha2' I, [2024-05-10T23:57:31.061338 #620712] INFO -- : make[2]: Leaving directory '/tmp/ruby/build/trunk/ext/ripper' I, [2024-05-10T23:57:31.061755 #620712] INFO -- : make[2]: Entering directory '/tmp/ruby/build/trunk/ext/socket' I, [2024-05-10T23:57:31.063860 #620712] INFO -- : make[2]: Leaving directory '/tmp/ruby/build/trunk/ext/psych' I, [2024-05-10T23:57:31.067805 #620712] INFO -- : make[2]: Leaving directory '/tmp/ruby/build/trunk/ext/socket' I, [2024-05-10T23:57:31.071909 #620712] INFO -- : make[2]: Leaving directory '/tmp/ruby/build/trunk/ext/openssl' I, [2024-05-10T23:57:31.078028 #620712] INFO -- : make[2]: Leaving directory '/tmp/ruby/build/trunk/.bundle/gems/rbs-3.4.4/ext/rbs_extension' I, [2024-05-10T23:57:31.078096 #620712] INFO -- : make[2]: Leaving directory '/tmp/ruby/build/trunk/.bundle/gems/bigdecimal-3.1.8/ext/bigdecimal' I, [2024-05-10T23:57:31.078684 #620712] INFO -- : make[2]: Leaving directory '/tmp/ruby/build/trunk/.bundle/gems/syslog-0.1.2/ext/syslog' I, [2024-05-10T23:57:31.083183 #620712] INFO -- : make[2]: Leaving directory '/tmp/ruby/build/trunk/.bundle/gems/debug-1.9.2/ext/debug' I, [2024-05-10T23:57:31.085205 #620712] INFO -- : make[2]: Leaving directory '/tmp/ruby/build/trunk/.bundle/gems/nkf-0.2.0/ext/nkf' I, [2024-05-10T23:57:31.086624 #620712] INFO -- : make[2]: Leaving directory '/tmp/ruby/build/trunk/.bundle/gems/racc-1.7.3/ext/racc/cparse' I, [2024-05-10T23:57:31.110300 #620712] INFO -- : make[2]: Entering directory '/tmp/ruby/build/trunk' I, [2024-05-10T23:57:31.178029 #620712] INFO -- : make[2]: 'ruby' is up to date. I, [2024-05-10T23:57:31.178065 #620712] INFO -- : make[2]: Leaving directory '/tmp/ruby/build/trunk' I, [2024-05-10T23:57:31.178484 #620712] INFO -- : make[1]: Leaving directory '/tmp/ruby/build/trunk' I, [2024-05-10T23:57:31.182109 #620712] INFO -- : make[1]: Entering directory '/tmp/ruby/build/trunk' I, [2024-05-10T23:57:31.182135 #620712] INFO -- : make[1]: Nothing to be done for 'note'. I, [2024-05-10T23:57:31.182142 #620712] INFO -- : make[1]: Leaving directory '/tmp/ruby/build/trunk' I, [2024-05-10T23:57:31.182327 #620712] INFO -- : ./miniruby -I/tmp/ruby/src/trunk/lib -I. -I.ext/common /tmp/ruby/src/trunk/tool/runruby.rb --extout=.ext -- --disable-gems -r./x86_64-linux-fake /tmp/ruby/src/trunk/tool/rbinstall.rb --make="make" --dest-dir="" --extout=".ext" --ext-build-dir="./ext" --mflags="-j20 --jobserver-auth=4,5" --make-flags=" -j20 --jobserver-auth=4,5" --data-mode=0644 --prog-mode=0755 --installed-list .installed.list --mantype="doc" --gnumake --install=all --exclude=doc I, [2024-05-10T23:57:31.276730 #620712] INFO -- : Installing to I, [2024-05-10T23:57:31.276790 #620712] INFO -- : installing binary commands: /tmp/ruby/install/trunk/bin I, [2024-05-10T23:57:31.276890 #620712] INFO -- : installing base libraries: /tmp/ruby/install/trunk/lib I, [2024-05-10T23:57:31.284139 #620712] INFO -- : installing arch files: /tmp/ruby/install/trunk/lib/ruby/3.4.0+0/x86_64-linux I, [2024-05-10T23:57:31.284166 #620712] INFO -- : installing pkgconfig data: /tmp/ruby/install/trunk/lib/pkgconfig I, [2024-05-10T23:57:31.284172 #620712] INFO -- : installing extension objects: /tmp/ruby/install/trunk/lib/ruby/3.4.0+0/x86_64-linux I, [2024-05-10T23:57:31.293357 #620712] INFO -- : installing extension objects: /tmp/ruby/install/trunk/lib/ruby/site_ruby/3.4.0+0/x86_64-linux I, [2024-05-10T23:57:31.293385 #620712] INFO -- : installing extension objects: /tmp/ruby/install/trunk/lib/ruby/vendor_ruby/3.4.0+0/x86_64-linux I, [2024-05-10T23:57:31.293393 #620712] INFO -- : installing extension headers: /tmp/ruby/install/trunk/include/ruby-3.4.0+0/x86_64-linux I, [2024-05-10T23:57:31.293539 #620712] INFO -- : installing extension scripts: /tmp/ruby/install/trunk/lib/ruby/3.4.0+0 I, [2024-05-10T23:57:31.297334 #620712] INFO -- : installing extension scripts: /tmp/ruby/install/trunk/lib/ruby/site_ruby/3.4.0+0 I, [2024-05-10T23:57:31.297355 #620712] INFO -- : installing extension scripts: /tmp/ruby/install/trunk/lib/ruby/vendor_ruby/3.4.0+0 I, [2024-05-10T23:57:31.297360 #620712] INFO -- : installing extension headers: /tmp/ruby/install/trunk/include/ruby-3.4.0+0/ruby I, [2024-05-10T23:57:31.297364 #620712] INFO -- : installing command scripts: /tmp/ruby/install/trunk/bin I, [2024-05-10T23:57:31.297377 #620712] INFO -- : installing library scripts: /tmp/ruby/install/trunk/lib/ruby/3.4.0+0 I, [2024-05-10T23:57:31.330333 #620712] INFO -- : installing common headers: /tmp/ruby/install/trunk/include/ruby-3.4.0+0 I, [2024-05-10T23:57:31.335559 #620712] INFO -- : installing manpages: /tmp/ruby/install/trunk/share/man/man1 I, [2024-05-10T23:57:31.335593 #620712] INFO -- : installing default gems from lib: /tmp/ruby/install/trunk/lib/ruby/gems/3.4.0+0 I, [2024-05-10T23:57:31.358080 #620712] INFO -- : benchmark 0.3.0 I, [2024-05-10T23:57:31.364917 #620712] INFO -- : bundler 2.6.0.dev I, [2024-05-10T23:57:31.367026 #620712] INFO -- : cgi 0.4.1 I, [2024-05-10T23:57:31.367553 #620712] INFO -- : delegate 0.3.1 I, [2024-05-10T23:57:31.368067 #620712] INFO -- : did_you_mean 1.6.3 I, [2024-05-10T23:57:31.368557 #620712] INFO -- : english 0.8.0 I, [2024-05-10T23:57:31.369021 #620712] INFO -- : erb 4.0.4 I, [2024-05-10T23:57:31.369719 #620712] INFO -- : error_highlight 0.6.0 I, [2024-05-10T23:57:31.370209 #620712] INFO -- : fileutils 1.7.2 I, [2024-05-10T23:57:31.370665 #620712] INFO -- : find 0.2.0 I, [2024-05-10T23:57:31.371032 #620712] INFO -- : forwardable 1.3.3 I, [2024-05-10T23:57:31.371471 #620712] INFO -- : ipaddr 1.2.6 I, [2024-05-10T23:57:31.371959 #620712] INFO -- : irb 1.13.1 I, [2024-05-10T23:57:31.373440 #620712] INFO -- : logger 1.6.0 I, [2024-05-10T23:57:31.373943 #620712] INFO -- : net-http 0.4.1 I, [2024-05-10T23:57:31.374436 #620712] INFO -- : net-protocol 0.2.2 I, [2024-05-10T23:57:31.374907 #620712] INFO -- : open-uri 0.4.1 I, [2024-05-10T23:57:31.375396 #620712] INFO -- : open3 0.2.1 I, [2024-05-10T23:57:31.375910 #620712] INFO -- : optparse 0.5.0 I, [2024-05-10T23:57:31.376330 #620712] INFO -- : ostruct 0.6.0 I, [2024-05-10T23:57:31.376808 #620712] INFO -- : pp 0.5.0 I, [2024-05-10T23:57:31.377371 #620712] INFO -- : prettyprint 0.2.0 I, [2024-05-10T23:57:31.377842 #620712] INFO -- : prism 0.29.0 I, [2024-05-10T23:57:31.378323 #620712] INFO -- : pstore 0.1.3 I, [2024-05-10T23:57:31.378773 #620712] INFO -- : rdoc 6.6.3.1 I, [2024-05-10T23:57:31.380345 #620712] INFO -- : readline 0.0.4 I, [2024-05-10T23:57:31.380846 #620712] INFO -- : reline 0.5.6 I, [2024-05-10T23:57:31.381363 #620712] INFO -- : resolv 0.4.0 I, [2024-05-10T23:57:31.381755 #620712] INFO -- : ruby2_keywords 0.0.5 I, [2024-05-10T23:57:31.382214 #620712] INFO -- : securerandom 0.3.1 I, [2024-05-10T23:57:31.382768 #620712] INFO -- : set 1.1.0 I, [2024-05-10T23:57:31.383279 #620712] INFO -- : shellwords 0.2.0 I, [2024-05-10T23:57:31.383774 #620712] INFO -- : singleton 0.2.0 I, [2024-05-10T23:57:31.384250 #620712] INFO -- : syntax_suggest 2.0.0 I, [2024-05-10T23:57:31.384932 #620712] INFO -- : tempfile 0.2.1 I, [2024-05-10T23:57:31.385419 #620712] INFO -- : time 0.3.0 I, [2024-05-10T23:57:31.385897 #620712] INFO -- : timeout 0.4.1 I, [2024-05-10T23:57:31.386926 #620712] INFO -- : tmpdir 0.2.0 I, [2024-05-10T23:57:31.387456 #620712] INFO -- : tsort 0.2.0 I, [2024-05-10T23:57:31.387894 #620712] INFO -- : un 0.3.0 I, [2024-05-10T23:57:31.388415 #620712] INFO -- : uri 0.13.0 I, [2024-05-10T23:57:31.388920 #620712] INFO -- : weakref 0.1.3 I, [2024-05-10T23:57:31.389380 #620712] INFO -- : yaml 0.3.0 I, [2024-05-10T23:57:31.389737 #620712] INFO -- : installing default gems from ext: /tmp/ruby/install/trunk/lib/ruby/gems/3.4.0+0 I, [2024-05-10T23:57:31.396194 #620712] INFO -- : date 3.3.4 I, [2024-05-10T23:57:31.396710 #620712] INFO -- : digest 3.1.1 I, [2024-05-10T23:57:31.397186 #620712] INFO -- : etc 1.4.3 I, [2024-05-10T23:57:31.397687 #620712] INFO -- : fcntl 1.1.0 I, [2024-05-10T23:57:31.398078 #620712] INFO -- : fiddle 1.1.3 I, [2024-05-10T23:57:31.398640 #620712] INFO -- : io-console 0.7.2 I, [2024-05-10T23:57:31.399225 #620712] INFO -- : io-nonblock 0.3.0 I, [2024-05-10T23:57:31.399691 #620712] INFO -- : io-wait 0.3.1 I, [2024-05-10T23:57:31.400227 #620712] INFO -- : json 2.7.2 I, [2024-05-10T23:57:31.401095 #620712] INFO -- : openssl 3.2.0 I, [2024-05-10T23:57:31.401802 #620712] INFO -- : pathname 0.3.0 I, [2024-05-10T23:57:31.402235 #620712] INFO -- : psych 5.1.2 I, [2024-05-10T23:57:31.402777 #620712] INFO -- : stringio 3.1.1 I, [2024-05-10T23:57:31.403352 #620712] INFO -- : strscan 3.1.1 I, [2024-05-10T23:57:31.403815 #620712] INFO -- : zlib 3.1.0 I, [2024-05-10T23:57:31.404240 #620712] INFO -- : installing bundled gems: /tmp/ruby/install/trunk/lib/ruby/gems/3.4.0+0 I, [2024-05-10T23:57:31.404509 #620712] INFO -- : minitest 5.22.3 I, [2024-05-10T23:57:31.411841 #620712] INFO -- : rake 13.2.1 I, [2024-05-10T23:57:31.415094 #620712] INFO -- : test-unit 3.6.2 I, [2024-05-10T23:57:31.419427 #620712] INFO -- : rexml 3.2.6 I, [2024-05-10T23:57:31.422724 #620712] INFO -- : rss 0.3.0 I, [2024-05-10T23:57:31.425681 #620712] INFO -- : net-ftp 0.3.4 I, [2024-05-10T23:57:31.427128 #620712] INFO -- : net-imap 0.4.11 I, [2024-05-10T23:57:31.429940 #620712] INFO -- : net-pop 0.1.2 I, [2024-05-10T23:57:31.430855 #620712] INFO -- : net-smtp 0.5.0 I, [2024-05-10T23:57:31.431961 #620712] INFO -- : matrix 0.4.2 I, [2024-05-10T23:57:31.435434 #620712] INFO -- : prime 0.1.2 I, [2024-05-10T23:57:31.440827 #620712] INFO -- : rbs 3.4.4 I, [2024-05-10T23:57:31.462449 #620712] INFO -- : typeprof 0.21.11 I, [2024-05-10T23:57:31.465345 #620712] INFO -- : debug 1.9.2 I, [2024-05-10T23:57:31.467828 #620712] INFO -- : racc 1.7.3 I, [2024-05-10T23:57:31.470434 #620712] INFO -- : mutex_m 0.2.0 I, [2024-05-10T23:57:31.471561 #620712] INFO -- : getoptlong 0.2.1 I, [2024-05-10T23:57:31.472823 #620712] INFO -- : base64 0.2.0 I, [2024-05-10T23:57:31.473821 #620712] INFO -- : bigdecimal 3.1.8 I, [2024-05-10T23:57:31.475770 #620712] INFO -- : observer 0.1.2 I, [2024-05-10T23:57:31.476836 #620712] INFO -- : abbrev 0.1.2 I, [2024-05-10T23:57:31.478223 #620712] INFO -- : resolv-replace 0.1.1 I, [2024-05-10T23:57:31.479354 #620712] INFO -- : rinda 0.2.0 I, [2024-05-10T23:57:31.480937 #620712] INFO -- : drb 2.2.1 I, [2024-05-10T23:57:31.482404 #620712] INFO -- : nkf 0.2.0 I, [2024-05-10T23:57:31.484818 #620712] INFO -- : syslog 0.1.2 I, [2024-05-10T23:57:31.486330 #620712] INFO -- : csv 3.3.0 I, [2024-05-10T23:57:31.488550 #620712] INFO -- : installing bundled gem cache: /tmp/ruby/install/trunk/lib/ruby/gems/3.4.0+0/cache I, [2024-05-10T23:57:31.489889 #620712] INFO -- : skipped bundled gems: I, [2024-05-10T23:57:31.489910 #620712] INFO -- : power_assert-2.0.4dev.gem not found in bundled_gems I, [2024-05-10T23:57:31.493000 #620712] INFO -- : $$$[end] "make install -j20" exit with 0. I, [2024-05-10T23:57:31.493108 #620712] INFO -- : $$$[beg] make yes-btest TESTOPTS='-q -j20' I, [2024-05-10T23:57:37.298762 #620712] INFO -- : PASS all 1936 tests E, [2024-05-10T23:57:37.303615 #620712] ERROR -- : I, [2024-05-10T23:57:37.303695 #620712] INFO -- : $$$[end] "make yes-btest TESTOPTS='-q -j20'" exit with 0. I, [2024-05-10T23:57:37.303773 #620712] INFO -- : $$$[beg] make yes-test-basic TESTS='-j20' I, [2024-05-10T23:57:37.363618 #620712] INFO -- : BASERUBY = /usr/bin/ruby --disable=gems I, [2024-05-10T23:57:37.363645 #620712] INFO -- : CC = gcc I, [2024-05-10T23:57:37.363650 #620712] INFO -- : LD = ld I, [2024-05-10T23:57:37.363654 #620712] INFO -- : LDSHARED = gcc -shared I, [2024-05-10T23:57:37.363658 #620712] INFO -- : CFLAGS = -O3 -fno-fast-math -ggdb3 -Wall -Wextra -Wdeprecated-declarations -Wdiv-by-zero -Wduplicated-cond -Wimplicit-function-declaration -Wimplicit-int -Wpointer-arith -Wwrite-strings -Wold-style-definition -Wimplicit-fallthrough=0 -Wmissing-noreturn -Wno-cast-function-type -Wno-constant-logical-operand -Wno-long-long -Wno-missing-field-initializers -Wno-overlength-strings -Wno-packed-bitfield-compat -Wno-parentheses-equality -Wno-self-assign -Wno-tautological-compare -Wno-unused-parameter -Wno-unused-value -Wsuggest-attribute=format -Wsuggest-attribute=noreturn -Wunused-variable -Wmisleading-indentation -Wundef -fPIC I, [2024-05-10T23:57:37.363663 #620712] INFO -- : XCFLAGS = -U_FORTIFY_SOURCE -D_FORTIFY_SOURCE=2 -fstack-protector-strong -fno-strict-overflow -fvisibility=hidden -fexcess-precision=standard -DRUBY_EXPORT -I. -I.ext/include/x86_64-linux -I/tmp/ruby/src/trunk/include -I/tmp/ruby/src/trunk -I/tmp/ruby/src/trunk/prism -I/tmp/ruby/src/trunk/enc/unicode/15.0.0 I, [2024-05-10T23:57:37.363666 #620712] INFO -- : CPPFLAGS = I, [2024-05-10T23:57:37.363670 #620712] INFO -- : DLDFLAGS = -Wl,--compress-debug-sections=zlib -Wl,-soname,libruby.so.3.4 -fstack-protector-strong I, [2024-05-10T23:57:37.363674 #620712] INFO -- : SOLIBS = -lz -lrt -lrt -lgmp -ldl -lcrypt -lm -lpthread I, [2024-05-10T23:57:37.363677 #620712] INFO -- : LANG = en_US.UTF-8 I, [2024-05-10T23:57:37.363681 #620712] INFO -- : LC_ALL = I, [2024-05-10T23:57:37.363684 #620712] INFO -- : LC_CTYPE = I, [2024-05-10T23:57:37.363693 #620712] INFO -- : MFLAGS = I, [2024-05-10T23:57:37.363696 #620712] INFO -- : RUSTC = no I, [2024-05-10T23:57:37.363720 #620712] INFO -- : YJIT_RUSTC_ARGS = --crate-name=yjit --crate-type=staticlib --edition=2021 -g -C lto=thin -C opt-level=3 -C overflow-checks=on '--out-dir=/tmp/ruby/build/trunk/yjit/target/release/' /tmp/ruby/src/trunk/yjit/src/lib.rs I, [2024-05-10T23:57:37.364250 #620712] INFO -- : gcc (Ubuntu 11.4.0-1ubuntu1~22.04) 11.4.0 I, [2024-05-10T23:57:37.364270 #620712] INFO -- : Copyright (C) 2021 Free Software Foundation, Inc. I, [2024-05-10T23:57:37.364276 #620712] INFO -- : This is free software; see the source for copying conditions. There is NO I, [2024-05-10T23:57:37.364279 #620712] INFO -- : warranty; not even for MERCHANTABILITY or FITNESS FOR A PARTICULAR PURPOSE. I, [2024-05-10T23:57:37.364283 #620712] INFO -- : I, [2024-05-10T23:57:37.470422 #620712] INFO -- : Checking leaked global symbols...none I, [2024-05-10T23:57:37.511015 #620712] INFO -- : /tmp/ruby/src/trunk/basictest/test.rb:assignment ....................................................................................................................................................................................................................................................................................................................................................................................OK 372 I, [2024-05-10T23:57:37.511070 #620712] INFO -- : /tmp/ruby/src/trunk/basictest/test.rb:condition ..OK 2 I, [2024-05-10T23:57:37.511076 #620712] INFO -- : /tmp/ruby/src/trunk/basictest/test.rb:if/unless ...OK 3 I, [2024-05-10T23:57:37.511080 #620712] INFO -- : /tmp/ruby/src/trunk/basictest/test.rb:case .....OK 5 I, [2024-05-10T23:57:37.511291 #620712] INFO -- : /tmp/ruby/src/trunk/basictest/test.rb:while/until ........OK 8 I, [2024-05-10T23:57:37.511349 #620712] INFO -- : /tmp/ruby/src/trunk/basictest/test.rb:exception ..........OK 10 I, [2024-05-10T23:57:37.511619 #620712] INFO -- : /tmp/ruby/src/trunk/basictest/test.rb:array .......................................OK 39 I, [2024-05-10T23:57:37.511723 #620712] INFO -- : /tmp/ruby/src/trunk/basictest/test.rb:hash ...........................OK 27 I, [2024-05-10T23:57:37.512449 #620712] INFO -- : /tmp/ruby/src/trunk/basictest/test.rb:iterator ...........................................................................................................OK 107 I, [2024-05-10T23:57:37.512728 #620712] INFO -- : /tmp/ruby/src/trunk/basictest/test.rb:float ................................................................................OK 80 I, [2024-05-10T23:57:37.513732 #620712] INFO -- : /tmp/ruby/src/trunk/basictest/test.rb:bignum ...............................OK 31 I, [2024-05-10T23:57:37.514513 #620712] INFO -- : /tmp/ruby/src/trunk/basictest/test.rb:string & char ..............................................................OK 62 I, [2024-05-10T23:57:37.514545 #620712] INFO -- : /tmp/ruby/src/trunk/basictest/test.rb:assignment ..........OK 10 I, [2024-05-10T23:57:37.514573 #620712] INFO -- : /tmp/ruby/src/trunk/basictest/test.rb:call ......OK 6 I, [2024-05-10T23:57:37.514626 #620712] INFO -- : /tmp/ruby/src/trunk/basictest/test.rb:proc .........OK 9 I, [2024-05-10T23:57:37.615368 #620712] INFO -- : /tmp/ruby/src/trunk/basictest/test.rb:signal ..OK 2 I, [2024-05-10T23:57:37.618029 #620712] INFO -- : /tmp/ruby/src/trunk/basictest/test.rb:eval ...........................OK 27 I, [2024-05-10T23:57:37.723467 #620712] INFO -- : /tmp/ruby/src/trunk/basictest/test.rb:system ........OK 8 I, [2024-05-10T23:57:37.723528 #620712] INFO -- : /tmp/ruby/src/trunk/basictest/test.rb:const .....OK 5 I, [2024-05-10T23:57:37.723573 #620712] INFO -- : /tmp/ruby/src/trunk/basictest/test.rb:clone .....OK 5 I, [2024-05-10T23:57:37.723811 #620712] INFO -- : /tmp/ruby/src/trunk/basictest/test.rb:marshal ....OK 4 I, [2024-05-10T23:57:37.723832 #620712] INFO -- : /tmp/ruby/src/trunk/basictest/test.rb:pack ....OK 4 I, [2024-05-10T23:57:37.723839 #620712] INFO -- : /tmp/ruby/src/trunk/basictest/test.rb:math ..OK 2 I, [2024-05-10T23:57:37.723844 #620712] INFO -- : /tmp/ruby/src/trunk/basictest/test.rb:struct ......OK 6 I, [2024-05-10T23:57:37.723934 #620712] INFO -- : /tmp/ruby/src/trunk/basictest/test.rb:variable ............OK 12 I, [2024-05-10T23:57:37.723960 #620712] INFO -- : /tmp/ruby/src/trunk/basictest/test.rb:trace ...OK 3 I, [2024-05-10T23:57:37.724018 #620712] INFO -- : /tmp/ruby/src/trunk/basictest/test.rb:defined? ............OK 12 I, [2024-05-10T23:57:37.724063 #620712] INFO -- : /tmp/ruby/src/trunk/basictest/test.rb:alias ......OK 6 I, [2024-05-10T23:57:37.724434 #620712] INFO -- : /tmp/ruby/src/trunk/basictest/test.rb:path .......................OK 23 I, [2024-05-10T23:57:37.757649 #620712] INFO -- : /tmp/ruby/src/trunk/basictest/test.rb:gc ....OK 4 I, [2024-05-10T23:57:37.759954 #620712] INFO -- : I, [2024-05-10T23:57:37.759978 #620712] INFO -- : test succeeded I, [2024-05-10T23:57:37.761632 #620712] INFO -- : $$$[end] "make yes-test-basic TESTS='-j20'" exit with 0. I, [2024-05-10T23:57:37.761716 #620712] INFO -- : $$$[beg] make yes-test-all TESTOPTS='--stderr-on-failure' TESTS='-j20' I, [2024-05-10T23:57:37.848298 #620712] INFO -- : BASERUBY = /usr/bin/ruby --disable=gems I, [2024-05-10T23:57:37.848335 #620712] INFO -- : CC = gcc I, [2024-05-10T23:57:37.848340 #620712] INFO -- : LD = ld I, [2024-05-10T23:57:37.848344 #620712] INFO -- : LDSHARED = gcc -shared I, [2024-05-10T23:57:37.848347 #620712] INFO -- : CFLAGS = -O3 -fno-fast-math -ggdb3 -Wall -Wextra -Wdeprecated-declarations -Wdiv-by-zero -Wduplicated-cond -Wimplicit-function-declaration -Wimplicit-int -Wpointer-arith -Wwrite-strings -Wold-style-definition -Wimplicit-fallthrough=0 -Wmissing-noreturn -Wno-cast-function-type -Wno-constant-logical-operand -Wno-long-long -Wno-missing-field-initializers -Wno-overlength-strings -Wno-packed-bitfield-compat -Wno-parentheses-equality -Wno-self-assign -Wno-tautological-compare -Wno-unused-parameter -Wno-unused-value -Wsuggest-attribute=format -Wsuggest-attribute=noreturn -Wunused-variable -Wmisleading-indentation -Wundef -fPIC I, [2024-05-10T23:57:37.848352 #620712] INFO -- : XCFLAGS = -U_FORTIFY_SOURCE -D_FORTIFY_SOURCE=2 -fstack-protector-strong -fno-strict-overflow -fvisibility=hidden -fexcess-precision=standard -DRUBY_EXPORT -I. -I.ext/include/x86_64-linux -I/tmp/ruby/src/trunk/include -I/tmp/ruby/src/trunk -I/tmp/ruby/src/trunk/prism -I/tmp/ruby/src/trunk/enc/unicode/15.0.0 I, [2024-05-10T23:57:37.848355 #620712] INFO -- : CPPFLAGS = I, [2024-05-10T23:57:37.848359 #620712] INFO -- : DLDFLAGS = -Wl,--compress-debug-sections=zlib -Wl,-soname,libruby.so.3.4 -fstack-protector-strong I, [2024-05-10T23:57:37.848362 #620712] INFO -- : SOLIBS = -lz -lrt -lrt -lgmp -ldl -lcrypt -lm -lpthread I, [2024-05-10T23:57:37.848366 #620712] INFO -- : LANG = en_US.UTF-8 I, [2024-05-10T23:57:37.848369 #620712] INFO -- : LC_ALL = I, [2024-05-10T23:57:37.848372 #620712] INFO -- : LC_CTYPE = I, [2024-05-10T23:57:37.848376 #620712] INFO -- : MFLAGS = I, [2024-05-10T23:57:37.848381 #620712] INFO -- : RUSTC = no I, [2024-05-10T23:57:37.848385 #620712] INFO -- : YJIT_RUSTC_ARGS = --crate-name=yjit --crate-type=staticlib --edition=2021 -g -C lto=thin -C opt-level=3 -C overflow-checks=on '--out-dir=/tmp/ruby/build/trunk/yjit/target/release/' /tmp/ruby/src/trunk/yjit/src/lib.rs I, [2024-05-10T23:57:37.848997 #620712] INFO -- : gcc (Ubuntu 11.4.0-1ubuntu1~22.04) 11.4.0 I, [2024-05-10T23:57:37.849017 #620712] INFO -- : Copyright (C) 2021 Free Software Foundation, Inc. I, [2024-05-10T23:57:37.849023 #620712] INFO -- : This is free software; see the source for copying conditions. There is NO I, [2024-05-10T23:57:37.849027 #620712] INFO -- : warranty; not even for MERCHANTABILITY or FITNESS FOR A PARTICULAR PURPOSE. I, [2024-05-10T23:57:37.849031 #620712] INFO -- : I, [2024-05-10T23:57:37.850567 #620712] INFO -- : generating enc.mk I, [2024-05-10T23:57:37.968303 #620712] INFO -- : making enc I, [2024-05-10T23:57:37.985487 #620712] INFO -- : make[1]: Entering directory '/tmp/ruby/build/trunk' I, [2024-05-10T23:57:37.985510 #620712] INFO -- : make[1]: Nothing to be done for 'enc'. I, [2024-05-10T23:57:37.985516 #620712] INFO -- : make[1]: Leaving directory '/tmp/ruby/build/trunk' I, [2024-05-10T23:57:37.986253 #620712] INFO -- : making srcs under enc I, [2024-05-10T23:57:38.016685 #620712] INFO -- : make[1]: Entering directory '/tmp/ruby/build/trunk' I, [2024-05-10T23:57:38.016706 #620712] INFO -- : make[1]: Nothing to be done for 'srcs'. I, [2024-05-10T23:57:38.016711 #620712] INFO -- : make[1]: Leaving directory '/tmp/ruby/build/trunk' I, [2024-05-10T23:57:38.017574 #620712] INFO -- : generating transdb.h I, [2024-05-10T23:57:38.116732 #620712] INFO -- : transdb.h unchanged I, [2024-05-10T23:57:38.118018 #620712] INFO -- : making trans I, [2024-05-10T23:57:38.151780 #620712] INFO -- : make[1]: Entering directory '/tmp/ruby/build/trunk' I, [2024-05-10T23:57:38.151801 #620712] INFO -- : make[1]: Nothing to be done for 'trans'. I, [2024-05-10T23:57:38.151806 #620712] INFO -- : make[1]: Leaving directory '/tmp/ruby/build/trunk' I, [2024-05-10T23:57:38.152487 #620712] INFO -- : making encs I, [2024-05-10T23:57:38.190168 #620712] INFO -- : make[1]: Entering directory '/tmp/ruby/build/trunk' I, [2024-05-10T23:57:38.190189 #620712] INFO -- : make[1]: Nothing to be done for 'encs'. I, [2024-05-10T23:57:38.190194 #620712] INFO -- : make[1]: Leaving directory '/tmp/ruby/build/trunk' I, [2024-05-10T23:57:38.191947 #620712] INFO -- : generating makefiles ext/configure-ext.mk I, [2024-05-10T23:57:38.218362 #620712] INFO -- : ext/configure-ext.mk updated I, [2024-05-10T23:57:38.220833 #620712] INFO -- : make[1]: Entering directory '/tmp/ruby/build/trunk' I, [2024-05-10T23:57:39.561281 #620712] INFO -- : make[1]: Leaving directory '/tmp/ruby/build/trunk' I, [2024-05-10T23:57:39.561966 #620712] INFO -- : generating makefile exts.mk I, [2024-05-10T23:57:39.598705 #620712] INFO -- : exts.mk unchanged I, [2024-05-10T23:57:39.603322 #620712] INFO -- : make[1]: Entering directory '/tmp/ruby/build/trunk' I, [2024-05-10T23:57:39.935463 #620712] INFO -- : make[2]: Entering directory '/tmp/ruby/build/trunk/ext/coverage' I, [2024-05-10T23:57:39.939762 #620712] INFO -- : make[2]: Leaving directory '/tmp/ruby/build/trunk/ext/coverage' I, [2024-05-10T23:57:39.946133 #620712] INFO -- : make[2]: Entering directory '/tmp/ruby/build/trunk/ext/date' I, [2024-05-10T23:57:39.951083 #620712] INFO -- : make[2]: Leaving directory '/tmp/ruby/build/trunk/ext/date' I, [2024-05-10T23:57:39.954901 #620712] INFO -- : make[2]: Entering directory '/tmp/ruby/build/trunk/ext/digest' I, [2024-05-10T23:57:39.963961 #620712] INFO -- : make[2]: Leaving directory '/tmp/ruby/build/trunk/ext/digest' I, [2024-05-10T23:57:39.990303 #620712] INFO -- : make[2]: Entering directory '/tmp/ruby/build/trunk/ext/digest/sha2' I, [2024-05-10T23:57:39.995070 #620712] INFO -- : make[2]: Leaving directory '/tmp/ruby/build/trunk/ext/digest/sha2' I, [2024-05-10T23:57:40.015438 #620712] INFO -- : make[2]: Entering directory '/tmp/ruby/build/trunk/ext/fiddle' I, [2024-05-10T23:57:40.024833 #620712] INFO -- : make[2]: Leaving directory '/tmp/ruby/build/trunk/ext/fiddle' I, [2024-05-10T23:57:40.029973 #620712] INFO -- : make[2]: Entering directory '/tmp/ruby/build/trunk/ext/io/console' I, [2024-05-10T23:57:40.034155 #620712] INFO -- : make[2]: Leaving directory '/tmp/ruby/build/trunk/ext/io/console' I, [2024-05-10T23:57:40.046985 #620712] INFO -- : make[2]: Entering directory '/tmp/ruby/build/trunk/ext/json' I, [2024-05-10T23:57:40.057700 #620712] INFO -- : make[2]: Leaving directory '/tmp/ruby/build/trunk/ext/json' I, [2024-05-10T23:57:40.072895 #620712] INFO -- : make[2]: Entering directory '/tmp/ruby/build/trunk/ext/monitor' I, [2024-05-10T23:57:40.076780 #620712] INFO -- : make[2]: Leaving directory '/tmp/ruby/build/trunk/ext/monitor' I, [2024-05-10T23:57:40.083822 #620712] INFO -- : make[2]: Entering directory '/tmp/ruby/build/trunk/ext/objspace' I, [2024-05-10T23:57:40.089820 #620712] INFO -- : make[2]: Leaving directory '/tmp/ruby/build/trunk/ext/objspace' I, [2024-05-10T23:57:40.108229 #620712] INFO -- : make[2]: Entering directory '/tmp/ruby/build/trunk/ext/openssl' I, [2024-05-10T23:57:40.121883 #620712] INFO -- : make[2]: Leaving directory '/tmp/ruby/build/trunk/ext/openssl' I, [2024-05-10T23:57:40.124898 #620712] INFO -- : make[2]: Entering directory '/tmp/ruby/build/trunk/ext/pathname' I, [2024-05-10T23:57:40.127455 #620712] INFO -- : make[2]: Leaving directory '/tmp/ruby/build/trunk/ext/pathname' I, [2024-05-10T23:57:40.131648 #620712] INFO -- : make[2]: Entering directory '/tmp/ruby/build/trunk/ext/psych' I, [2024-05-10T23:57:40.152034 #620712] INFO -- : make[2]: Leaving directory '/tmp/ruby/build/trunk/ext/psych' I, [2024-05-10T23:57:40.156230 #620712] INFO -- : make[2]: Entering directory '/tmp/ruby/build/trunk/ext/pty' I, [2024-05-10T23:57:40.158940 #620712] INFO -- : make[2]: Leaving directory '/tmp/ruby/build/trunk/ext/pty' I, [2024-05-10T23:57:40.172232 #620712] INFO -- : make[2]: Entering directory '/tmp/ruby/build/trunk/ext/ripper' I, [2024-05-10T23:57:40.177554 #620712] INFO -- : make[2]: Leaving directory '/tmp/ruby/build/trunk/ext/ripper' I, [2024-05-10T23:57:40.179819 #620712] INFO -- : make[2]: Entering directory '/tmp/ruby/build/trunk/ext/rubyvm' I, [2024-05-10T23:57:40.183102 #620712] INFO -- : make[2]: Leaving directory '/tmp/ruby/build/trunk/ext/rubyvm' I, [2024-05-10T23:57:40.195756 #620712] INFO -- : make[2]: Entering directory '/tmp/ruby/build/trunk/ext/socket' I, [2024-05-10T23:57:40.205628 #620712] INFO -- : make[2]: Leaving directory '/tmp/ruby/build/trunk/ext/socket' I, [2024-05-10T23:57:40.223790 #620712] INFO -- : make[2]: Entering directory '/tmp/ruby/build/trunk/.bundle/gems/bigdecimal-3.1.8/ext/bigdecimal' I, [2024-05-10T23:57:40.250847 #620712] INFO -- : make[2]: Leaving directory '/tmp/ruby/build/trunk/.bundle/gems/bigdecimal-3.1.8/ext/bigdecimal' I, [2024-05-10T23:57:40.252852 #620712] INFO -- : make[2]: Entering directory '/tmp/ruby/build/trunk/.bundle/gems/debug-1.9.2/ext/debug' I, [2024-05-10T23:57:40.275510 #620712] INFO -- : make[2]: Leaving directory '/tmp/ruby/build/trunk/.bundle/gems/debug-1.9.2/ext/debug' I, [2024-05-10T23:57:40.277982 #620712] INFO -- : make[2]: Entering directory '/tmp/ruby/build/trunk/.bundle/gems/nkf-0.2.0/ext/nkf' I, [2024-05-10T23:57:40.306499 #620712] INFO -- : make[2]: Leaving directory '/tmp/ruby/build/trunk/.bundle/gems/nkf-0.2.0/ext/nkf' I, [2024-05-10T23:57:40.308517 #620712] INFO -- : make[2]: Entering directory '/tmp/ruby/build/trunk/.bundle/gems/racc-1.7.3/ext/racc/cparse' I, [2024-05-10T23:57:40.331262 #620712] INFO -- : make[2]: Leaving directory '/tmp/ruby/build/trunk/.bundle/gems/racc-1.7.3/ext/racc/cparse' I, [2024-05-10T23:57:40.333599 #620712] INFO -- : make[2]: Entering directory '/tmp/ruby/build/trunk/.bundle/gems/rbs-3.4.4/ext/rbs_extension' I, [2024-05-10T23:57:40.355637 #620712] INFO -- : make[2]: Leaving directory '/tmp/ruby/build/trunk/.bundle/gems/rbs-3.4.4/ext/rbs_extension' I, [2024-05-10T23:57:40.357485 #620712] INFO -- : make[2]: Entering directory '/tmp/ruby/build/trunk/.bundle/gems/syslog-0.1.2/ext/syslog' I, [2024-05-10T23:57:40.384724 #620712] INFO -- : make[2]: Leaving directory '/tmp/ruby/build/trunk/.bundle/gems/syslog-0.1.2/ext/syslog' I, [2024-05-10T23:57:40.407972 #620712] INFO -- : make[2]: Entering directory '/tmp/ruby/build/trunk' I, [2024-05-10T23:57:40.470474 #620712] INFO -- : make[2]: 'ruby' is up to date. I, [2024-05-10T23:57:40.470513 #620712] INFO -- : make[2]: Leaving directory '/tmp/ruby/build/trunk' I, [2024-05-10T23:57:40.470712 #620712] INFO -- : make[1]: Leaving directory '/tmp/ruby/build/trunk' I, [2024-05-10T23:57:40.474288 #620712] INFO -- : make[1]: Entering directory '/tmp/ruby/build/trunk' I, [2024-05-10T23:57:40.474312 #620712] INFO -- : make[1]: Nothing to be done for 'note'. I, [2024-05-10T23:57:40.474320 #620712] INFO -- : make[1]: Leaving directory '/tmp/ruby/build/trunk' I, [2024-05-10T23:57:40.548594 #620712] INFO -- : Run options: I, [2024-05-10T23:57:40.548652 #620712] INFO -- : --seed=24952 I, [2024-05-10T23:57:40.548658 #620712] INFO -- : "--ruby=./miniruby -I/tmp/ruby/src/trunk/lib -I. -I.ext/common /tmp/ruby/src/trunk/tool/runruby.rb --extout=.ext -- --disable-gems" I, [2024-05-10T23:57:40.548671 #620712] INFO -- : --excludes-dir=/tmp/ruby/src/trunk/test/.excludes I, [2024-05-10T23:57:40.548675 #620712] INFO -- : --name=!/memory_leak/ I, [2024-05-10T23:57:40.548678 #620712] INFO -- : --stderr-on-failure I, [2024-05-10T23:57:40.548688 #620712] INFO -- : -j20 I, [2024-05-10T23:57:40.548694 #620712] INFO -- : I, [2024-05-10T23:57:40.548697 #620712] INFO -- : # Running tests: I, [2024-05-10T23:57:40.548702 #620712] INFO -- : I, [2024-05-10T23:57:40.695187 #620712] INFO -- : [ 1/885] 662067=test_pkey_rsa I, [2024-05-10T23:57:40.695293 #620712] INFO -- : [ 2/885] 662070=test_gem_commands_push_command I, [2024-05-10T23:57:40.695365 #620712] INFO -- : [ 3/885] 662068=test_weakkeymap I, [2024-05-10T23:57:40.695560 #620712] INFO -- : [ 4/885] 662069=test_numhash I, [2024-05-10T23:57:40.695585 #620712] INFO -- : [ 5/885] 662071=test_gem_package_task I, [2024-05-10T23:57:40.697985 #620712] INFO -- : [ 6/885] 662072=test_date_strptime I, [2024-05-10T23:57:40.698485 #620712] INFO -- : [ 7/885] 662082=test_placearg I, [2024-05-10T23:57:40.699494 #620712] INFO -- : [ 8/885] 662069=test_rdoc_markup_hard_break I, [2024-05-10T23:57:40.700229 #620712] INFO -- : [ 9/885] 662080=test_gem_platform I, [2024-05-10T23:57:40.700343 #620712] INFO -- : [ 10/885] 662091=test_delete I, [2024-05-10T23:57:40.700440 #620712] INFO -- : [ 11/885] 662083=test_win32ole_method I, [2024-05-10T23:57:40.700466 #620712] INFO -- : [ 12/885] 662092=test_fd_setsize I, [2024-05-10T23:57:40.704790 #620712] INFO -- : [ 13/885] 662092=test_continuation I, [2024-05-10T23:57:40.706474 #620712] INFO -- : [ 14/885] 662083=test_keyword I, [2024-05-10T23:57:40.708219 #620712] INFO -- : [ 15/885] 662091=test_class_name_check I, [2024-05-10T23:57:40.709170 #620712] INFO -- : [ 16/885] 662090=test_file_exhaustive I, [2024-05-10T23:57:40.717564 #620712] INFO -- : [ 17/885] 662092=test_files_test I, [2024-05-10T23:57:40.720976 #620712] INFO -- : [ 18/885] 662078=test_gem_update_suggestion I, [2024-05-10T23:57:40.722280 #620712] INFO -- : [ 19/885] 662073=test_logger I, [2024-05-10T23:57:40.730195 #620712] INFO -- : [ 20/885] 662076=test_import I, [2024-05-10T23:57:40.730280 #620712] INFO -- : [ 21/885] 662077=test_gem_resolver_lock_set I, [2024-05-10T23:57:40.730307 #620712] INFO -- : [ 22/885] 662081=test_not I, [2024-05-10T23:57:40.730722 #620712] INFO -- : [ 23/885] 662074=test_rdoc_parser_markdown I, [2024-05-10T23:57:40.730755 #620712] INFO -- : [ 24/885] 662075=test_cgi_header I, [2024-05-10T23:57:40.730764 #620712] INFO -- : [ 25/885] 662079=heredoc_dedent_test I, [2024-05-10T23:57:40.731476 #620712] INFO -- : [ 26/885] 662091=test_object I, [2024-05-10T23:57:40.733933 #620712] INFO -- : [ 27/885] 662081=version_test I, [2024-05-10T23:57:40.742926 #620712] INFO -- : [ 28/885] 662073=test_key_actor_emacs I, [2024-05-10T23:57:40.753269 #620712] INFO -- : [ 29/885] 662075=test_basicinstructions I, [2024-05-10T23:57:40.759382 #620712] INFO -- : [ 30/885] 662091=test_gem_gemcutter_utilities I, [2024-05-10T23:57:40.788360 #620712] INFO -- : [ 31/885] 662092=test_gem_command_manager I, [2024-05-10T23:57:40.792413 #620712] INFO -- : [ 32/885] 662068=test_arithmetic_sequence I, [2024-05-10T23:57:40.799217 #620712] INFO -- : [ 33/885] 662068=test_change_word I, [2024-05-10T23:57:40.805240 #620712] INFO -- : [ 34/885] 662068=test_flip I, [2024-05-10T23:57:40.807486 #620712] INFO -- : [ 35/885] 662072=compiler_test I, [2024-05-10T23:57:40.821840 #620712] INFO -- : [ 36/885] 662081=test_timeout I, [2024-05-10T23:57:40.825573 #620712] INFO -- : [ 37/885] 662075=test_normalize I, [2024-05-10T23:57:40.825637 #620712] INFO -- : [ 38/885] 662075=test_ossl I, [2024-05-10T23:57:40.831399 #620712] INFO -- : [ 39/885] 662079=test_date_arith I, [2024-05-10T23:57:40.833280 #620712] INFO -- : [ 40/885] 662068=test_object I, [2024-05-10T23:57:40.836624 #620712] INFO -- : [ 41/885] 662081=test_ruby_lex I, [2024-05-10T23:57:40.848811 #620712] INFO -- : [ 42/885] 662082=test_gem_local_remote_options I, [2024-05-10T23:57:40.857278 #620712] INFO -- : [ 43/885] 662069=test_sleep I, [2024-05-10T23:57:40.860154 #620712] INFO -- : [ 44/885] 662071=test_ractor I, [2024-05-10T23:57:40.863609 #620712] INFO -- : [ 45/885] 662079=test_type I, [2024-05-10T23:57:40.869991 #620712] INFO -- : [ 46/885] 662079=test_big5 I, [2024-05-10T23:57:40.873458 #620712] INFO -- : [ 47/885] 662079=test_func I, [2024-05-10T23:57:40.892964 #620712] INFO -- : [ 48/885] 662072=test_pointer I, [2024-05-10T23:57:40.911941 #620712] INFO -- : [ 49/885] 662071=test_rdoc_rd_block_parser I, [2024-05-10T23:57:40.920450 #620712] INFO -- : [ 50/885] 662073=test_signedness I, [2024-05-10T23:57:40.938237 #620712] INFO -- : [ 51/885] 662074=test_tsort I, [2024-05-10T23:57:40.943379 #620712] INFO -- : [ 52/885] 662074=errors_test I, [2024-05-10T23:57:40.944385 #620712] INFO -- : [ 53/885] 662078=test_regexp I, [2024-05-10T23:57:40.947430 #620712] INFO -- : [ 54/885] 662080=test_gem_commands_check_command I, [2024-05-10T23:57:40.949142 #620712] INFO -- : [ 55/885] 662076=test_vm_dump I, [2024-05-10T23:57:40.951713 #620712] INFO -- : [ 56/885] 662076=test_tmpdir I, [2024-05-10T23:57:40.964286 #620712] INFO -- : [ 57/885] 662077=test_integer_comb I, [2024-05-10T23:57:40.967349 #620712] INFO -- : [ 58/885] 662080=test_rdoc_markup_document I, [2024-05-10T23:57:41.007030 #620712] INFO -- : [ 59/885] 662076=test_data_error I, [2024-05-10T23:57:41.039179 #620712] INFO -- : [ 60/885] 662067=bom_test I, [2024-05-10T23:57:41.056058 #620712] INFO -- : [ 61/885] 662076=test_ostruct I, [2024-05-10T23:57:41.072579 #620712] INFO -- : [ 62/885] 662072=unescape_test I, [2024-05-10T23:57:41.085477 #620712] INFO -- : [ 63/885] 662082=test_force_exit I, [2024-05-10T23:57:41.085800 #620712] INFO -- : [ 64/885] 662081=test_file I, [2024-05-10T23:57:41.102743 #620712] INFO -- : [ 65/885] 662080=test_udp I, [2024-05-10T23:57:41.109839 #620712] INFO -- : [ 66/885] 662080=static_inspect_test I, [2024-05-10T23:57:41.113910 #620712] INFO -- : [ 67/885] 662092=test_gem_uri_formatter I, [2024-05-10T23:57:41.125692 #620712] INFO -- : [ 68/885] 662074=test_erb_command I, [2024-05-10T23:57:41.132900 #620712] INFO -- : [ 69/885] 662071=test_helper I, [2024-05-10T23:57:41.133157 #620712] INFO -- : [ 70/885] 662092=test_encoding I, [2024-05-10T23:57:41.139589 #620712] INFO -- : [ 71/885] 662071=test_range I, [2024-05-10T23:57:41.140398 #620712] INFO -- : [ 72/885] 662067=test_project_sanity I, [2024-05-10T23:57:41.165934 #620712] INFO -- : [ 73/885] 662074=test_dup I, [2024-05-10T23:57:41.173433 #620712] INFO -- : [ 74/885] 662082=test_pty I, [2024-05-10T23:57:41.177751 #620712] INFO -- : [ 75/885] 662080=test_constant I, [2024-05-10T23:57:41.207192 #620712] INFO -- : [ 76/885] 662076=command_line_test I, [2024-05-10T23:57:41.257784 #620712] INFO -- : [ 77/885] 662079=test_rdoc_ri_paths I, [2024-05-10T23:57:41.260459 #620712] INFO -- : [ 78/885] 662068=test_ts I, [2024-05-10T23:57:41.271743 #620712] INFO -- : [ 79/885] 662091=test_ensured I, [2024-05-10T23:57:41.271815 #620712] INFO -- : [ 80/885] 662083=library_symbols_test I, [2024-05-10T23:57:41.275001 #620712] INFO -- : [ 81/885] 662076=test_addr I, [2024-05-10T23:57:41.310016 #620712] INFO -- : [ 82/885] 662076=test_locale I, [2024-05-10T23:57:41.314392 #620712] INFO -- : [ 83/885] 662091=test_config I, [2024-05-10T23:57:41.337513 #620712] INFO -- : [ 84/885] 662092=test_gem_resolver_vendor_set I, [2024-05-10T23:57:41.337827 #620712] INFO -- : [ 85/885] 662083=test_enumerable I, [2024-05-10T23:57:41.348312 #620712] INFO -- : [ 86/885] 662074=test_gem_safe_marshal I, [2024-05-10T23:57:41.354896 #620712] INFO -- : [ 87/885] 662092=test_gem_resolver_api_set I, [2024-05-10T23:57:41.360269 #620712] INFO -- : [ 88/885] 662067=test_transcode I, [2024-05-10T23:57:41.364053 #620712] INFO -- : [ 89/885] 662083=test_eval I, [2024-05-10T23:57:41.388559 #620712] INFO -- : [ 90/885] 662070=json_generator_test I, [2024-05-10T23:57:41.396935 #620712] INFO -- : [ 91/885] 662079=test_rdoc_code_object I, [2024-05-10T23:57:41.406765 #620712] INFO -- : [ 92/885] 662092=test_x509store I, [2024-05-10T23:57:41.447588 #620712] INFO -- : [ 93/885] 662076=test_update I, [2024-05-10T23:57:41.454641 #620712] INFO -- : [ 94/885] 662076=test_fips I, [2024-05-10T23:57:41.485587 #620712] INFO -- : [ 95/885] 662070=test_x509name I, [2024-05-10T23:57:41.501242 #620712] INFO -- : [ 96/885] 662070=test_lambda I, [2024-05-10T23:57:41.525936 #620712] INFO -- : [ 97/885] 662067=test_ast I, [2024-05-10T23:57:41.556766 #620712] INFO -- : [ 98/885] 662083=test_gem_request_set_gem_dependency_api I, [2024-05-10T23:57:41.561553 #620712] INFO -- : [ 99/885] 662070=test_random_formatter I, [2024-05-10T23:57:41.583934 #620712] INFO -- : [100/885] 662070=test_helper I, [2024-05-10T23:57:41.650853 #620712] INFO -- : [101/885] 662070=test_jaro_winkler I, [2024-05-10T23:57:41.662258 #620712] INFO -- : [102/885] 662082=test_webauthn_listener I, [2024-05-10T23:57:41.664001 #620712] INFO -- : [103/885] 662070=test_call I, [2024-05-10T23:57:41.714707 #620712] INFO -- : [104/885] 662082=test_https_proxy I, [2024-05-10T23:57:41.723831 #620712] INFO -- : [105/885] 662091=test_rubygems I, [2024-05-10T23:57:41.744569 #620712] INFO -- : [106/885] 662068=test_super I, [2024-05-10T23:57:41.777606 #620712] INFO -- : [107/885] 662082=test_rubyoptions I, [2024-05-10T23:57:41.780154 #620712] INFO -- : [108/885] 662076=test_cgi_modruby I, [2024-05-10T23:57:41.793190 #620712] INFO -- : [109/885] 662070=test_integer I, [2024-05-10T23:57:41.796177 #620712] INFO -- : [110/885] 662076=test_object_references I, [2024-05-10T23:57:41.803110 #620712] INFO -- : [111/885] 662076=test_usrmarshal I, [2024-05-10T23:57:41.812067 #620712] INFO -- : [112/885] 662092=test_gem_resolver_git_specification I, [2024-05-10T23:57:41.833417 #620712] INFO -- : [113/885] 662079=test_gem_request_set_lockfile_tokenizer I, [2024-05-10T23:57:41.882454 #620712] INFO -- : [114/885] 662071=test_stat I, [2024-05-10T23:57:41.889235 #620712] INFO -- : [115/885] 662071=test_have_func I, [2024-05-10T23:57:41.906930 #620712] INFO -- : [116/885] 662091=test_nextafter I, [2024-05-10T23:57:41.916440 #620712] INFO -- : [117/885] 662083=test_capacity I, [2024-05-10T23:57:41.920775 #620712] INFO -- : [118/885] 662083=test_dryrun I, [2024-05-10T23:57:41.928495 #620712] INFO -- : [119/885] 662072=test_integer I, [2024-05-10T23:57:41.939945 #620712] INFO -- : [120/885] 662083=desugar_compiler_test I, [2024-05-10T23:57:41.952067 #620712] INFO -- : [121/885] 662083=test_env I, [2024-05-10T23:57:41.974952 #620712] INFO -- : [122/885] 662091=test_rdoc_attr I, [2024-05-10T23:57:41.985563 #620712] INFO -- : [123/885] 662072=test_gem_commands_setup_command I, [2024-05-10T23:57:41.990724 #620712] INFO -- : [124/885] 662092=test_parser I, [2024-05-10T23:57:42.031152 #620712] INFO -- : [125/885] 662092=test_cgi_core I, [2024-05-10T23:57:42.042376 #620712] INFO -- : [126/885] 662076=test_gem_source_lock I, [2024-05-10T23:57:42.042950 #620712] INFO -- : [127/885] 662092=test_gem I, [2024-05-10T23:57:42.075636 #620712] INFO -- : [128/885] 662068=test_ractor I, [2024-05-10T23:57:42.081752 #620712] INFO -- : [129/885] 662079=test_dns I, [2024-05-10T23:57:42.093893 #620712] INFO -- : [130/885] 662068=test_gem_commands_open_command I, [2024-05-10T23:57:42.104172 #620712] INFO -- : [131/885] 662091=parse_stream_test I, [2024-05-10T23:57:42.191029 #620712] INFO -- : [132/885] 662091=test_registry I, [2024-05-10T23:57:42.192760 #620712] INFO -- : [133/885] 662091=test_my_integer I, [2024-05-10T23:57:42.195832 #620712] INFO -- : [134/885] 662091=test_thread I, [2024-05-10T23:57:42.226551 #620712] INFO -- : [135/885] 662074=json_ext_parser_test I, [2024-05-10T23:57:42.239183 #620712] INFO -- : [136/885] 662074=test_rendering I, [2024-05-10T23:57:42.245749 #620712] INFO -- : [137/885] 662076=test_debugger_integration I, [2024-05-10T23:57:42.255074 #620712] INFO -- : [138/885] 662076=test_ractor I, [2024-05-10T23:57:42.326005 #620712] INFO -- : [139/885] 662074=test_ssl I, [2024-05-10T23:57:42.355327 #620712] INFO -- : [140/885] 662068=test_rb_str_dup I, [2024-05-10T23:57:42.362849 #620712] INFO -- : [141/885] 662068=test_reline_key I, [2024-05-10T23:57:42.435835 #620712] INFO -- : [142/885] 662068=test_singleton_function I, [2024-05-10T23:57:42.436360 #620712] INFO -- : [143/885] 662068=test_ancdata I, [2024-05-10T23:57:42.442102 #620712] INFO -- : [144/885] 662068=test_alias I, [2024-05-10T23:57:42.479067 #620712] INFO -- : [145/885] 662072=test_timeout I, [2024-05-10T23:57:42.504862 #620712] INFO -- : [146/885] 662076=test_marshal I, [2024-05-10T23:57:42.539032 #620712] INFO -- : [147/885] 662079=test_unicode_normalize I, [2024-05-10T23:57:42.611881 #620712] INFO -- : [148/885] 662068=test_nonblock I, [2024-05-10T23:57:42.624731 #620712] INFO -- : [149/885] 662068=test_weakref I, [2024-05-10T23:57:42.745897 #620712] INFO -- : [150/885] 662068=test_trace I, [2024-05-10T23:57:42.753527 #620712] INFO -- : [151/885] 662068=ractor_test I, [2024-05-10T23:57:42.841212 #620712] INFO -- : [152/885] 662068=test_rdoc_generator_json_index I, [2024-05-10T23:57:42.850171 #620712] INFO -- : [153/885] 662074=test_win32ole_event I, [2024-05-10T23:57:42.854110 #620712] INFO -- : [154/885] 662074=test_time_tz I, [2024-05-10T23:57:42.891694 #620712] INFO -- : [155/885] 662076=test_rdoc_class_module I, [2024-05-10T23:57:42.930299 #620712] INFO -- : [156/885] 662074=test_bignum I, [2024-05-10T23:57:43.017543 #620712] INFO -- : [157/885] 662068=test_gem_ci_detector I, [2024-05-10T23:57:43.021020 #620712] INFO -- : [158/885] 662068=test_win32ole_variable I, [2024-05-10T23:57:43.021557 #620712] INFO -- : [159/885] 662068=test_stringio I, [2024-05-10T23:57:43.050832 #620712] INFO -- : [160/885] 662074=test_arity I, [2024-05-10T23:57:43.056213 #620712] INFO -- : [161/885] 662074=test_io_wait_uncommon I, [2024-05-10T23:57:43.057362 #620712] INFO -- : [162/885] 662074=test_enum I, [2024-05-10T23:57:43.175232 #620712] INFO -- : [163/885] 662068=test_gem_specification I, [2024-05-10T23:57:43.229791 #620712] INFO -- : [164/885] 662073=test_threadgroup I, [2024-05-10T23:57:43.240435 #620712] INFO -- : [165/885] 662071=test_have_macro I, [2024-05-10T23:57:43.399432 #620712] INFO -- : [166/885] 662072=test_gem_package I, [2024-05-10T23:57:43.481071 #620712] INFO -- : [167/885] 662080=test_complex2 I, [2024-05-10T23:57:43.492224 #620712] INFO -- : [168/885] 662080=test_resolve_symbol I, [2024-05-10T23:57:43.549141 #620712] INFO -- : [169/885] 662071=test_merge_keys I, [2024-05-10T23:57:43.553165 #620712] INFO -- : [170/885] 662080=test_rdoc_extend I, [2024-05-10T23:57:43.571382 #620712] INFO -- : [171/885] 662071=test_win32ole_variant I, [2024-05-10T23:57:43.577558 #620712] INFO -- : [172/885] 662071=test_ipaddr I, [2024-05-10T23:57:43.598966 #620712] INFO -- : [173/885] 662071=test_mixed_unicode_escapes I, [2024-05-10T23:57:43.602824 #620712] INFO -- : [174/885] 662071=test_history I, [2024-05-10T23:57:43.607068 #620712] INFO -- : [175/885] 662080=test_rdoc_markup_to_ansi I, [2024-05-10T23:57:43.630425 #620712] INFO -- : [176/885] 662080=test_gem_resolver_api_specification I, [2024-05-10T23:57:43.653516 #620712] INFO -- : [177/885] 662071=test_numeric I, [2024-05-10T23:57:43.659218 #620712] INFO -- : [178/885] 662076=test_member I, [2024-05-10T23:57:43.660257 #620712] INFO -- : [179/885] 662071=test_cgi_multipart I, [2024-05-10T23:57:43.664749 #620712] INFO -- : [180/885] 662076=test_gem_commands_cleanup_command I, [2024-05-10T23:57:43.682094 #620712] INFO -- : [181/885] 662080=test_word I, [2024-05-10T23:57:43.684502 #620712] INFO -- : [182/885] 662080=test_ractor_compatibility I, [2024-05-10T23:57:43.832508 #620712] INFO -- : [183/885] 662071=test_gem_console_ui I, [2024-05-10T23:57:43.846081 #620712] INFO -- : [184/885] 662071=test_date_ractor I, [2024-05-10T23:57:43.913130 #620712] INFO -- : [185/885] 662074=format_errors_test I, [2024-05-10T23:57:43.914954 #620712] INFO -- : [186/885] 662074=test_dir I, [2024-05-10T23:57:43.999894 #620712] INFO -- : [187/885] 662092=test_eval I, [2024-05-10T23:57:44.002244 #620712] INFO -- : [188/885] 662092=test_autoconf I, [2024-05-10T23:57:44.003311 #620712] INFO -- : [189/885] 662072=test_coderange I, [2024-05-10T23:57:44.006310 #620712] INFO -- : [190/885] 662092=location_test I, [2024-05-10T23:57:44.013723 #620712] INFO -- : [191/885] 662072=test_symbol I, [2024-05-10T23:57:44.026263 #620712] INFO -- : [192/885] 662072=test_mailto I, [2024-05-10T23:57:44.028931 #620712] INFO -- : [193/885] 662080=test_rdoc_generator_darkfish I, [2024-05-10T23:57:44.040683 #620712] INFO -- : [194/885] 662072=test_rdoc_comment I, [2024-05-10T23:57:44.041451 #620712] INFO -- : [195/885] 662077=test_error_highlight I, [2024-05-10T23:57:44.081624 #620712] INFO -- : [196/885] 662071=test_resize I, [2024-05-10T23:57:44.087197 #620712] INFO -- : [197/885] 662076=test_http_request I, [2024-05-10T23:57:44.089083 #620712] INFO -- : [198/885] 662071=json_generic_object_test I, [2024-05-10T23:57:44.097414 #620712] INFO -- : [199/885] 662071=test_gem_source_fetch_problem I, [2024-05-10T23:57:44.109347 #620712] INFO -- : [200/885] 662071=test_function_entry I, [2024-05-10T23:57:44.112557 #620712] INFO -- : [201/885] 662071=test_pkcs7 I, [2024-05-10T23:57:44.116626 #620712] INFO -- : [202/885] 662092=test_gem_resolver_requirement_list I, [2024-05-10T23:57:44.117838 #620712] INFO -- : [203/885] 662076=test_arith_seq_beg_len_step I, [2024-05-10T23:57:44.121595 #620712] INFO -- : [204/885] 662092=test_unix I, [2024-05-10T23:57:44.152366 #620712] INFO -- : [205/885] 662092=test_enc_associate I, [2024-05-10T23:57:44.153333 #620712] INFO -- : [206/885] 662074=test_lazy_enumerator I, [2024-05-10T23:57:44.162800 #620712] INFO -- : [207/885] 662076=ruby_api_test I, [2024-05-10T23:57:44.174400 #620712] INFO -- : [208/885] 662072=test_find_executable I, [2024-05-10T23:57:44.190981 #620712] INFO -- : [209/885] 662072=test_coder I, [2024-05-10T23:57:44.197414 #620712] INFO -- : [210/885] 662072=test_symbol I, [2024-05-10T23:57:44.236553 #620712] INFO -- : [211/885] 662073=test_context I, [2024-05-10T23:57:44.256531 #620712] INFO -- : [212/885] 662076=test_gem_commands_pristine_command I, [2024-05-10T23:57:44.316239 #620712] INFO -- : [213/885] 662080=test_nofree I, [2024-05-10T23:57:44.319714 #620712] INFO -- : [214/885] 662080=test_gem_ext_cargo_builder I, [2024-05-10T23:57:44.338185 #620712] INFO -- : [215/885] 662080=test_ssl I, [2024-05-10T23:57:44.343969 #620712] INFO -- : [216/885] 662071=constant_path_node_test I, [2024-05-10T23:57:44.359509 #620712] INFO -- : [217/885] 662070=test_gem_request_set I, [2024-05-10T23:57:44.393583 #620712] INFO -- : [218/885] 662073=test_module I, [2024-05-10T23:57:44.460006 #620712] INFO -- : [219/885] 662071=test_parser I, [2024-05-10T23:57:44.473858 #620712] INFO -- : [220/885] 662074=test_arith_seq_extract I, [2024-05-10T23:57:44.502233 #620712] INFO -- : [221/885] 662071=test_method_name_check I, [2024-05-10T23:57:44.531891 #620712] INFO -- : [222/885] 662071=test_buffered_io I, [2024-05-10T23:57:44.545343 #620712] INFO -- : [223/885] 662077=test_monitor I, [2024-05-10T23:57:44.600606 #620712] INFO -- : [224/885] 662071=test_configuration I, [2024-05-10T23:57:44.637511 #620712] INFO -- : [225/885] 662074=test_rubyvm I, [2024-05-10T23:57:44.640464 #620712] INFO -- : [226/885] 662074=test_rdoc_generator_markup I, [2024-05-10T23:57:44.650503 #620712] INFO -- : [227/885] 662074=test_whileuntil I, [2024-05-10T23:57:44.655454 #620712] INFO -- : [228/885] 662074=test_boolean I, [2024-05-10T23:57:44.663346 #620712] INFO -- : [229/885] 662074=test_stringify_symbols I, [2024-05-10T23:57:44.672634 #620712] INFO -- : [230/885] 662074=test_instrumentation_api I, [2024-05-10T23:57:44.696485 #620712] INFO -- : [231/885] 662070=integer_parse_test I, [2024-05-10T23:57:44.698516 #620712] INFO -- : [232/885] 662070=test_win32ole_method_event I, [2024-05-10T23:57:44.704196 #620712] INFO -- : [233/885] 662070=test_nesting_parser I, [2024-05-10T23:57:44.713600 #620712] INFO -- : [234/885] 662071=test_gem_dependency_list I, [2024-05-10T23:57:44.726473 #620712] INFO -- : [235/885] 662083=test_benchmark I, [2024-05-10T23:57:44.749493 #620712] INFO -- : [236/885] 662092=test_gem_commands_outdated_command I, [2024-05-10T23:57:44.756623 #620712] INFO -- : [237/885] 662077=test_array I, [2024-05-10T23:57:44.770754 #620712] INFO -- : [238/885] 662071=test_gem_package_tar_writer I, [2024-05-10T23:57:44.793426 #620712] INFO -- : [239/885] 662092=test_helper_method I, [2024-05-10T23:57:44.795340 #620712] INFO -- : [240/885] 662070=test_gem_source I, [2024-05-10T23:57:44.847870 #620712] INFO -- : [241/885] 662071=test_scalar_scanner I, [2024-05-10T23:57:44.858299 #620712] INFO -- : [242/885] 662071=test_rdoc_parser_simple I, [2024-05-10T23:57:44.879263 #620712] INFO -- : [243/885] 662092=test_load I, [2024-05-10T23:57:44.882416 #620712] INFO -- : [244/885] 662092=test_gem_commands_rebuild_command I, [2024-05-10T23:57:44.925422 #620712] INFO -- : [245/885] 662071=test_yamldbm I, [2024-05-10T23:57:44.928221 #620712] INFO -- : [246/885] 662092=test_abi I, [2024-05-10T23:57:44.932686 #620712] INFO -- : [247/885] 662071=test_provider I, [2024-05-10T23:57:44.986691 #620712] INFO -- : [248/885] 662070=test_evaluation I, [2024-05-10T23:57:44.989063 #620712] INFO -- : [249/885] 662070=test_https I, [2024-05-10T23:57:45.071778 #620712] INFO -- : [250/885] 662090=test_gem_ext_builder I, [2024-05-10T23:57:45.096613 #620712] INFO -- : [251/885] 662092=test_x509ext I, [2024-05-10T23:57:45.101341 #620712] INFO -- : [252/885] 662092=test_erb I, [2024-05-10T23:57:45.165545 #620712] INFO -- : [253/885] 662092=test_gem_source_installed I, [2024-05-10T23:57:45.179673 #620712] INFO -- : [254/885] 662092=test_gem_commands_cert_command I, [2024-05-10T23:57:45.276473 #620712] INFO -- : [255/885] 662071=test_completion I, [2024-05-10T23:57:45.320649 #620712] INFO -- : [256/885] 662068=test_len I, [2024-05-10T23:57:45.328733 #620712] INFO -- : [257/885] 662068=test_yield_block I, [2024-05-10T23:57:45.332519 #620712] INFO -- : [258/885] 662068=test_rational2 I, [2024-05-10T23:57:45.346147 #620712] INFO -- : [259/885] 662068=test_rational I, [2024-05-10T23:57:45.370027 #620712] INFO -- : [260/885] 662068=test_assembler I, [2024-05-10T23:57:45.370095 #620712] INFO -- : [261/885] 662068=attribute_write_test I, [2024-05-10T23:57:45.370559 #620712] INFO -- : [262/885] 662070=test_propertyputref I, [2024-05-10T23:57:45.375787 #620712] INFO -- : [263/885] 662070=test_spell_checker I, [2024-05-10T23:57:45.381281 #620712] INFO -- : [264/885] 662070=test_float I, [2024-05-10T23:57:45.429727 #620712] INFO -- : [265/885] 662068=test_require I, [2024-05-10T23:57:45.507797 #620712] INFO -- : [266/885] 662079=test_cgi_cookie I, [2024-05-10T23:57:45.519699 #620712] INFO -- : [267/885] 662076=test_dir_m17n I, [2024-05-10T23:57:45.524581 #620712] INFO -- : [268/885] 662079=test_gem_resolver_installer_set I, [2024-05-10T23:57:45.789148 #620712] INFO -- : [269/885] 662079=test_regex_casefold I, [2024-05-10T23:57:45.859504 #620712] INFO -- : [270/885] 662069=test_gem_commands_signout_command I, [2024-05-10T23:57:45.916574 #620712] INFO -- : [271/885] 662073=test_refinement I, [2024-05-10T23:57:45.957102 #620712] INFO -- : [272/885] 662083=test_gem_source_git I, [2024-05-10T23:57:45.967861 #620712] INFO -- : [273/885] 662071=test_signal I, [2024-05-10T23:57:46.044637 #620712] INFO -- : [274/885] 662069=test_fixnum I, [2024-05-10T23:57:46.044885 #620712] INFO -- : [275/885] 662072=test_x509crl I, [2024-05-10T23:57:46.057992 #620712] INFO -- : [276/885] 662069=test_cgi_session I, [2024-05-10T23:57:46.080329 #620712] INFO -- : [277/885] 662069=test_rdoc_rd I, [2024-05-10T23:57:46.106867 #620712] INFO -- : [278/885] 662069=test_rdoc_top_level I, [2024-05-10T23:57:46.110419 #620712] INFO -- : [279/885] 662092=test_metaclass I, [2024-05-10T23:57:46.113392 #620712] INFO -- : [280/885] 662092=test_windows_1252 I, [2024-05-10T23:57:46.119534 #620712] INFO -- : [281/885] 662092=test_input_method I, [2024-05-10T23:57:46.167885 #620712] INFO -- : [282/885] 662090=test_process I, [2024-05-10T23:57:46.186423 #620712] INFO -- : [283/885] 662090=test_string I, [2024-05-10T23:57:46.190135 #620712] INFO -- : [284/885] 662090=test_iterator I, [2024-05-10T23:57:46.229989 #620712] INFO -- : [285/885] 662072=test_omap I, [2024-05-10T23:57:46.238359 #620712] INFO -- : [286/885] 662072=test_digest_extend I, [2024-05-10T23:57:46.257962 #620712] INFO -- : [287/885] 662072=test_shellwords I, [2024-05-10T23:57:46.260234 #620712] INFO -- : [288/885] 662079=test_debug I, [2024-05-10T23:57:46.263986 #620712] INFO -- : [289/885] 662072=pattern_test I, [2024-05-10T23:57:46.266749 #620712] INFO -- : [290/885] 662090=test_memory_view I, [2024-05-10T23:57:46.268370 #620712] INFO -- : [291/885] 662079=test_cipher I, [2024-05-10T23:57:46.288532 #620712] INFO -- : [292/885] 662072=test_gem_security_signer I, [2024-05-10T23:57:46.288762 #620712] INFO -- : [293/885] 662092=test_new I, [2024-05-10T23:57:46.292221 #620712] INFO -- : [294/885] 662090=test_gem_resolver_git_set I, [2024-05-10T23:57:46.297415 #620712] INFO -- : [295/885] 662092=test_storage I, [2024-05-10T23:57:46.299581 #620712] INFO -- : [296/885] 662092=test_gem_source_subpath_problem I, [2024-05-10T23:57:46.332477 #620712] INFO -- : [297/885] 662079=test_dln I, [2024-05-10T23:57:46.334141 #620712] INFO -- : [298/885] 662079=json_common_interface_test I, [2024-05-10T23:57:46.365622 #620712] INFO -- : [299/885] 662079=test_win32ole_variant_outarg I, [2024-05-10T23:57:46.368090 #620712] INFO -- : [300/885] 662079=test_config I, [2024-05-10T23:57:46.374588 #620712] INFO -- : [301/885] 662072=json_parser_test I, [2024-05-10T23:57:46.410409 #620712] INFO -- : [302/885] 662069=test_nomethod_error I, [2024-05-10T23:57:46.413419 #620712] INFO -- : [303/885] 662072=memsize_test I, [2024-05-10T23:57:46.415151 #620712] INFO -- : [304/885] 662072=test_cparser I, [2024-05-10T23:57:46.417314 #620712] INFO -- : [305/885] 662069=test_pkg_config I, [2024-05-10T23:57:46.421075 #620712] INFO -- : [306/885] 662092=fuzzer_test I, [2024-05-10T23:57:46.429208 #620712] INFO -- : [307/885] 662092=test_sexp I, [2024-05-10T23:57:46.434457 #620712] INFO -- : [308/885] 662079=test_rdoc_markup_include I, [2024-05-10T23:57:46.439381 #620712] INFO -- : [309/885] 662079=test_variable I, [2024-05-10T23:57:46.441686 #620712] INFO -- : [310/885] 662069=test_struct I, [2024-05-10T23:57:46.450550 #620712] INFO -- : [311/885] 662092=test_rdoc_markup_to_html_snippet I, [2024-05-10T23:57:46.467581 #620712] INFO -- : [312/885] 662069=magic_comment_test I, [2024-05-10T23:57:46.474665 #620712] INFO -- : [313/885] 662083=test_key_error I, [2024-05-10T23:57:46.477252 #620712] INFO -- : [314/885] 662083=test_engine I, [2024-05-10T23:57:46.483085 #620712] INFO -- : [315/885] 662083=test_win32ole_variant_m I, [2024-05-10T23:57:46.486247 #620712] INFO -- : [316/885] 662083=test_div I, [2024-05-10T23:57:46.489397 #620712] INFO -- : [317/885] 662083=test_allocation I, [2024-05-10T23:57:46.528595 #620712] INFO -- : [318/885] 662079=test_color_printer I, [2024-05-10T23:57:46.546430 #620712] INFO -- : [319/885] 662069=test_deprecated I, [2024-05-10T23:57:46.551583 #620712] INFO -- : [320/885] 662069=test_insns_leaf I, [2024-05-10T23:57:46.555055 #620712] INFO -- : [321/885] 662092=test_serialize_subclasses I, [2024-05-10T23:57:46.556085 #620712] INFO -- : [322/885] 662092=test_set I, [2024-05-10T23:57:46.558292 #620712] INFO -- : [323/885] 662069=test_struct I, [2024-05-10T23:57:46.582094 #620712] INFO -- : [324/885] 662092=test_gem_path_support I, [2024-05-10T23:57:46.592513 #620712] INFO -- : [325/885] 662090=test_files_test_1 I, [2024-05-10T23:57:46.615258 #620712] INFO -- : [326/885] 662092=test_rdoc_rd_inline I, [2024-05-10T23:57:46.618898 #620712] INFO -- : [327/885] 662092=test_x509req I, [2024-05-10T23:57:46.629355 #620712] INFO -- : [328/885] 662079=test_mutex I, [2024-05-10T23:57:46.773509 #620712] INFO -- : [329/885] 662092=test_gem_commands_build_command I, [2024-05-10T23:57:46.889884 #620712] INFO -- : [330/885] 662076=test_interned_str I, [2024-05-10T23:57:46.898584 #620712] INFO -- : [331/885] 662076=test_case_comprehensive I, [2024-05-10T23:57:46.924337 #620712] INFO -- : [332/885] 662072=test_io_m17n I, [2024-05-10T23:57:46.990306 #620712] INFO -- : [333/885] 662092=test_variable_name_check I, [2024-05-10T23:57:47.017647 #620712] INFO -- : [334/885] 662092=test_did_you_mean I, [2024-05-10T23:57:47.129955 #620712] INFO -- : [335/885] 662070=test_gem_commands_server_command I, [2024-05-10T23:57:47.135729 #620712] INFO -- : [336/885] 662070=test_append I, [2024-05-10T23:57:47.135988 #620712] INFO -- : [337/885] 662092=test_option I, [2024-05-10T23:57:47.139612 #620712] INFO -- : [338/885] 662070=test_cmethod I, [2024-05-10T23:57:47.145251 #620712] INFO -- : [339/885] 662070=test_tracer I, [2024-05-10T23:57:47.146546 #620712] INFO -- : [340/885] 662070=test_exception_at_throwing I, [2024-05-10T23:57:47.150534 #620712] INFO -- : [341/885] 662081=test_iseq I, [2024-05-10T23:57:47.203048 #620712] INFO -- : [342/885] 662070=test_rdoc_markup_heading I, [2024-05-10T23:57:47.289731 #620712] INFO -- : [343/885] 662092=test_ocsp I, [2024-05-10T23:57:47.319172 #620712] INFO -- : [344/885] 662069=test_class I, [2024-05-10T23:57:47.323696 #620712] INFO -- : [345/885] 662069=test_pkey_dsa I, [2024-05-10T23:57:47.332418 #620712] INFO -- : [346/885] 662070=test_scheduler I, [2024-05-10T23:57:47.486028 #620712] INFO -- : [347/885] 662070=test_emoji_breaks I, [2024-05-10T23:57:47.491845 #620712] INFO -- : [348/885] 662070=test_gem_bundler_version_finder I, [2024-05-10T23:57:47.518534 #620712] INFO -- : [349/885] 662070=test_within_pipe I, [2024-05-10T23:57:47.562990 #620712] INFO -- : [350/885] 662070=reflection_test I, [2024-05-10T23:57:47.572980 #620712] INFO -- : [351/885] 662070=test_files_lib I, [2024-05-10T23:57:47.611585 #620712] INFO -- : [352/885] 662092=test_gem_commands_unpack_command I, [2024-05-10T23:57:47.633204 #620712] INFO -- : [353/885] 662074=test_beginendblock I, [2024-05-10T23:57:47.755034 #620712] INFO -- : [354/885] 662077=test_rdoc_markup_to_bs I, [2024-05-10T23:57:47.766395 #620712] INFO -- : [355/885] 662079=test_help I, [2024-05-10T23:57:47.768668 #620712] INFO -- : [356/885] 662079=test_printf I, [2024-05-10T23:57:47.780349 #620712] INFO -- : [357/885] 662079=test_rdoc_markup_pre_process I, [2024-05-10T23:57:47.813793 #620712] INFO -- : [358/885] 662081=test_to_ary_concat I, [2024-05-10T23:57:47.891972 #620712] INFO -- : [359/885] 662092=test_time I, [2024-05-10T23:57:47.936494 #620712] INFO -- : [360/885] 662079=test_webauthn_listener_response I, [2024-05-10T23:57:47.958330 #620712] INFO -- : [361/885] 662079=test_stream I, [2024-05-10T23:57:47.974119 #620712] INFO -- : [362/885] 662077=test_pinned I, [2024-05-10T23:57:47.981173 #620712] INFO -- : [363/885] 662079=test_delegate I, [2024-05-10T23:57:47.991194 #620712] INFO -- : [364/885] 662079=test_popen_deadlock I, [2024-05-10T23:57:48.024580 #620712] INFO -- : [365/885] 662077=test_history I, [2024-05-10T23:57:48.074306 #620712] INFO -- : [366/885] 662092=test_mkmf I, [2024-05-10T23:57:48.076912 #620712] INFO -- : [367/885] 662074=test_date_marshal I, [2024-05-10T23:57:48.086277 #620712] INFO -- : [368/885] 662074=test_recursion I, [2024-05-10T23:57:48.089851 #620712] INFO -- : [369/885] 662074=test_exit I, [2024-05-10T23:57:48.106683 #620712] INFO -- : [370/885] 662069=test_digest I, [2024-05-10T23:57:48.116994 #620712] INFO -- : [371/885] 662069=test_ractor I, [2024-05-10T23:57:48.128249 #620712] INFO -- : [372/885] 662077=test_gem_security I, [2024-05-10T23:57:48.135823 #620712] INFO -- : [373/885] 662092=test_rdoc_servlet I, [2024-05-10T23:57:48.139900 #620712] INFO -- : [374/885] 662068=test_multi_irb_commands I, [2024-05-10T23:57:48.141445 #620712] INFO -- : [375/885] 662071=test_fiber I, [2024-05-10T23:57:48.146167 #620712] INFO -- : [376/885] 662072=test_open3 I, [2024-05-10T23:57:48.148389 #620712] INFO -- : [377/885] 662068=test_bundled_ca I, [2024-05-10T23:57:48.188699 #620712] INFO -- : [378/885] 662074=test_closure I, [2024-05-10T23:57:48.209536 #620712] INFO -- : [379/885] 662069=test_primitive I, [2024-05-10T23:57:48.226348 #620712] INFO -- : [380/885] 662069=test_human_typo I, [2024-05-10T23:57:48.243312 #620712] INFO -- : [381/885] 662069=test_rbconfig I, [2024-05-10T23:57:48.247864 #620712] INFO -- : [382/885] 662069=test_document I, [2024-05-10T23:57:48.255073 #620712] INFO -- : [383/885] 662069=test_acceptable I, [2024-05-10T23:57:48.307404 #620712] INFO -- : [384/885] 662081=test_rdoc_generator_pot_po_entry I, [2024-05-10T23:57:48.365781 #620712] INFO -- : [385/885] 662092=test_euc_jp I, [2024-05-10T23:57:48.391114 #620712] INFO -- : [386/885] 662092=test_pair I, [2024-05-10T23:57:48.437539 #620712] INFO -- : [387/885] 662069=test_gem_commands_yank_command I, [2024-05-10T23:57:48.464365 #620712] INFO -- : [388/885] 662081=test_win32ole_param I, [2024-05-10T23:57:48.466735 #620712] INFO -- : [389/885] 662081=test_chilled I, [2024-05-10T23:57:48.468898 #620712] INFO -- : [390/885] 662081=test_name_error_extension I, [2024-05-10T23:57:48.475660 #620712] INFO -- : [391/885] 662081=test_rdoc_i18n_locale I, [2024-05-10T23:57:48.480537 #620712] INFO -- : [392/885] 662081=test_gem_resolver_local_specification I, [2024-05-10T23:57:48.591897 #620712] INFO -- : [393/885] 662074=test_httpheader I, [2024-05-10T23:57:48.605530 #620712] INFO -- : [394/885] 662074=test_rdoc_ri_driver I, [2024-05-10T23:57:48.663595 #620712] INFO -- : [395/885] 662079=test_set_len I, [2024-05-10T23:57:48.686692 #620712] INFO -- : [396/885] 662078=test_encoding I, [2024-05-10T23:57:48.694444 #620712] INFO -- : [397/885] 662079=test_httpresponses I, [2024-05-10T23:57:48.696582 #620712] INFO -- : [398/885] 662081=test_sockopt I, [2024-05-10T23:57:48.698067 #620712] INFO -- : [399/885] 662081=test_install I, [2024-05-10T23:57:48.703419 #620712] INFO -- : [400/885] 662078=test_rdoc_markup_to_label I, [2024-05-10T23:57:48.718653 #620712] INFO -- : [401/885] 662075=test_key_stroke I, [2024-05-10T23:57:48.725556 #620712] INFO -- : [402/885] 662079=json_encoding_test I, [2024-05-10T23:57:48.728927 #620712] INFO -- : [403/885] 662079=test_color I, [2024-05-10T23:57:48.757986 #620712] INFO -- : [404/885] 662079=test_bug-14834 I, [2024-05-10T23:57:48.780370 #620712] INFO -- : [405/885] 662075=test_date_compat I, [2024-05-10T23:57:48.782851 #620712] INFO -- : [406/885] 662075=test_rdoc_markup_to_html I, [2024-05-10T23:57:48.805304 #620712] INFO -- : [407/885] 662079=test_terminfo I, [2024-05-10T23:57:48.807187 #620712] INFO -- : [408/885] 662079=test_compile_prism I, [2024-05-10T23:57:48.823525 #620712] INFO -- : [409/885] 662074=test_bn I, [2024-05-10T23:57:48.834323 #620712] INFO -- : [410/885] 662074=test_win32ole_param_event I, [2024-05-10T23:57:48.836124 #620712] INFO -- : [411/885] 662074=test_path I, [2024-05-10T23:57:48.846217 #620712] INFO -- : [412/885] 662074=redundant_return_test I, [2024-05-10T23:57:48.852025 #620712] INFO -- : [413/885] 662074=test_case_mapping I, [2024-05-10T23:57:48.854750 #620712] INFO -- : [414/885] 662081=test_tree_spell_checker I, [2024-05-10T23:57:48.857102 #620712] INFO -- : [415/885] 662078=test_addrinfo I, [2024-05-10T23:57:48.860377 #620712] INFO -- : [416/885] 662074=test_http I, [2024-05-10T23:57:48.883360 #620712] INFO -- : [417/885] 662078=test_rdoc_method_attr I, [2024-05-10T23:57:48.888385 #620712] INFO -- : [418/885] 662081=test_filter I, [2024-05-10T23:57:48.896549 #620712] INFO -- : [419/885] 662073=test_gem_gem_runner I, [2024-05-10T23:57:48.921260 #620712] INFO -- : [420/885] 662069=static_literals_test I, [2024-05-10T23:57:48.922283 #620712] INFO -- : [421/885] 662081=test_data I, [2024-05-10T23:57:48.924928 #620712] INFO -- : [422/885] 662069=test_rdoc_generator_pot I, [2024-05-10T23:57:48.925821 #620712] INFO -- : [423/885] 662081=test_rdoc_parser_changelog I, [2024-05-10T23:57:48.931611 #620712] INFO -- : [424/885] 662069=test_enumerator I, [2024-05-10T23:57:48.934448 #620712] INFO -- : [425/885] 662069=test_koi8 I, [2024-05-10T23:57:48.942454 #620712] INFO -- : [426/885] 662069=parameters_signature_test I, [2024-05-10T23:57:48.947231 #620712] INFO -- : [427/885] 662069=test_unicode I, [2024-05-10T23:57:48.985215 #620712] INFO -- : [428/885] 662075=test_ssl_session I, [2024-05-10T23:57:48.998696 #620712] INFO -- : [429/885] 662081=test_thread_cv I, [2024-05-10T23:57:49.008382 #620712] INFO -- : [430/885] 662069=test_lexer I, [2024-05-10T23:57:49.016690 #620712] INFO -- : [431/885] 662069=test_gem_resolver_vendor_specification I, [2024-05-10T23:57:49.028537 #620712] INFO -- : [432/885] 662069=test_gem_commands_update_command I, [2024-05-10T23:57:49.042014 #620712] INFO -- : [433/885] 662068=test_gem_uri I, [2024-05-10T23:57:49.060828 #620712] INFO -- : [434/885] 662073=test_key_event_record I, [2024-05-10T23:57:49.062337 #620712] INFO -- : [435/885] 662073=test_notimplement I, [2024-05-10T23:57:49.063693 #620712] INFO -- : [436/885] 662073=test_random I, [2024-05-10T23:57:49.070938 #620712] INFO -- : [437/885] 662073=test_objspace I, [2024-05-10T23:57:49.075230 #620712] INFO -- : [438/885] 662068=ripper_test I, [2024-05-10T23:57:49.076580 #620712] INFO -- : [439/885] 662078=test_line_editor I, [2024-05-10T23:57:49.083579 #620712] INFO -- : [440/885] 662079=test_undef I, [2024-05-10T23:57:49.113652 #620712] INFO -- : [441/885] 662079=test_string_memory I, [2024-05-10T23:57:49.140174 #620712] INFO -- : [442/885] 662078=comments_test I, [2024-05-10T23:57:49.201976 #620712] INFO -- : [443/885] 662083=test_gem_requirement I, [2024-05-10T23:57:49.215399 #620712] INFO -- : [444/885] 662078=test_sprintf I, [2024-05-10T23:57:49.294846 #620712] INFO -- : [445/885] 662079=test_gem_security_trust_dir I, [2024-05-10T23:57:49.327336 #620712] INFO -- : [446/885] 662083=test_show_source I, [2024-05-10T23:57:49.335230 #620712] INFO -- : [447/885] 662079=test_set I, [2024-05-10T23:57:49.344181 #620712] INFO -- : [448/885] 662079=test_lock_native_thread I, [2024-05-10T23:57:49.349455 #620712] INFO -- : [449/885] 662078=test_c_struct_entry I, [2024-05-10T23:57:49.428828 #620712] INFO -- : [450/885] 662083=test_gem_commands_stale_command I, [2024-05-10T23:57:49.438998 #620712] INFO -- : [451/885] 662083=test_have_library I, [2024-05-10T23:57:49.495980 #620712] INFO -- : [452/885] 662078=test_remote_fetch_error I, [2024-05-10T23:57:49.509875 #620712] INFO -- : [453/885] 662078=test_gem_request_set_lockfile I, [2024-05-10T23:57:49.616148 #620712] INFO -- : [454/885] 662079=test_raise_exception I, [2024-05-10T23:57:49.627927 #620712] INFO -- : [455/885] 662081=test_protect I, [2024-05-10T23:57:49.633560 #620712] INFO -- : [456/885] 662081=test_win32ole_typelib I, [2024-05-10T23:57:49.638761 #620712] INFO -- : [457/885] 662081=test_gem_resolver_dependency_request I, [2024-05-10T23:57:49.645509 #620712] INFO -- : [458/885] 662068=test_tree_builder I, [2024-05-10T23:57:49.653551 #620712] INFO -- : [459/885] 662068=test_hash I, [2024-05-10T23:57:49.662797 #620712] INFO -- : [460/885] 662081=test_alias_and_anchor I, [2024-05-10T23:57:49.668730 #620712] INFO -- : [461/885] 662068=test_postponed_job I, [2024-05-10T23:57:49.675039 #620712] INFO -- : [462/885] 662081=test_external_new I, [2024-05-10T23:57:49.685065 #620712] INFO -- : [463/885] 662081=test_ws I, [2024-05-10T23:57:49.702897 #620712] INFO -- : [464/885] 662081=test_gem_commands_environment_command I, [2024-05-10T23:57:49.750328 #620712] INFO -- : [465/885] 662090=test_m17n I, [2024-05-10T23:57:49.752860 #620712] INFO -- : [466/885] 662078=test_weakmap I, [2024-05-10T23:57:49.761271 #620712] INFO -- : [467/885] 662081=test_workspace I, [2024-05-10T23:57:49.800080 #620712] INFO -- : [468/885] 662090=test_yjit I, [2024-05-10T23:57:49.812815 #620712] INFO -- : [469/885] 662090=test_kill_ring I, [2024-05-10T23:57:49.845540 #620712] INFO -- : [470/885] 662081=test_framework I, [2024-05-10T23:57:49.848090 #620712] INFO -- : [471/885] 662081=test_ns_spki I, [2024-05-10T23:57:49.860906 #620712] INFO -- : [472/885] 662090=test_argf I, [2024-05-10T23:57:49.870602 #620712] INFO -- : [473/885] 662081=test_type_completor I, [2024-05-10T23:57:49.877109 #620712] INFO -- : [474/885] 662081=test_console_attr I, [2024-05-10T23:57:49.878614 #620712] INFO -- : [475/885] 662081=test_summary I, [2024-05-10T23:57:49.999585 #620712] INFO -- : [476/885] 662075=test_ellipsize I, [2024-05-10T23:57:50.010638 #620712] INFO -- : [477/885] 662075=test_date_attr I, [2024-05-10T23:57:50.013860 #620712] INFO -- : [478/885] 662075=test_io_wait I, [2024-05-10T23:57:50.021015 #620712] INFO -- : [479/885] 662081=test_gem_commands_exec_command I, [2024-05-10T23:57:50.026417 #620712] INFO -- : [480/885] 662068=test_kwargs I, [2024-05-10T23:57:50.030552 #620712] INFO -- : [481/885] 662068=warnings_test I, [2024-05-10T23:57:50.034900 #620712] INFO -- : [482/885] 662069=test_sorted_set I, [2024-05-10T23:57:50.039836 #620712] INFO -- : [483/885] 662068=test_emoji I, [2024-05-10T23:57:50.061670 #620712] INFO -- : [484/885] 662068=test_win32ole_type_event I, [2024-05-10T23:57:50.063220 #620712] INFO -- : [485/885] 662068=test_hash I, [2024-05-10T23:57:50.277689 #620712] INFO -- : [486/885] 662079=test_ubf_async_safe I, [2024-05-10T23:57:50.292333 #620712] INFO -- : [487/885] 662069=test_io I, [2024-05-10T23:57:50.295852 #620712] INFO -- : [488/885] 662079=test_cp949 I, [2024-05-10T23:57:50.312645 #620712] INFO -- : [489/885] 662079=test_gem_commands_uninstall_command I, [2024-05-10T23:57:50.361443 #620712] INFO -- : [490/885] 662075=test_condition I, [2024-05-10T23:57:50.364222 #620712] INFO -- : [491/885] 662075=test_foreach I, [2024-05-10T23:57:50.365929 #620712] INFO -- : [492/885] 662075=test_gem_source_specific_file I, [2024-05-10T23:57:50.508048 #620712] INFO -- : [493/885] 662072=test_gem_unsatisfiable_dependency_error I, [2024-05-10T23:57:50.520700 #620712] INFO -- : [494/885] 662072=test_win32ole_record I, [2024-05-10T23:57:50.539174 #620712] INFO -- : [495/885] 662072=test_gem_commands_query_command I, [2024-05-10T23:57:50.544124 #620712] INFO -- : [496/885] 662069=test_method I, [2024-05-10T23:57:50.565792 #620712] INFO -- : [497/885] 662082=test_rdoc_rubygems_hook I, [2024-05-10T23:57:50.636035 #620712] INFO -- : [498/885] 662075=test_to_ruby I, [2024-05-10T23:57:50.661543 #620712] INFO -- : [499/885] 662075=test_pattern_key_name_check I, [2024-05-10T23:57:50.667629 #620712] INFO -- : [500/885] 662083=test_gem_impossible_dependencies_error I, [2024-05-10T23:57:50.667858 #620712] INFO -- : [501/885] 662075=test_pack I, [2024-05-10T23:57:50.673171 #620712] INFO -- : [502/885] 662083=test_array_create I, [2024-05-10T23:57:50.675127 #620712] INFO -- : [503/885] 662083=test_ftp I, [2024-05-10T23:57:50.696134 #620712] INFO -- : [504/885] 662083=test_euc_kr I, [2024-05-10T23:57:50.700473 #620712] INFO -- : [505/885] 662083=test_rdoc_context_section I, [2024-05-10T23:57:50.756808 #620712] INFO -- : [506/885] 662082=test_system I, [2024-05-10T23:57:50.822646 #620712] INFO -- : [507/885] 662077=test_pkcs12 I, [2024-05-10T23:57:50.861168 #620712] INFO -- : [508/885] 662083=test_gem_package_tar_header I, [2024-05-10T23:57:50.898257 #620712] INFO -- : [509/885] 662083=test_gem_util I, [2024-05-10T23:57:50.910560 #620712] INFO -- : [510/885] 662075=test_iseq_load I, [2024-05-10T23:57:50.985984 #620712] INFO -- : [511/885] 662081=test_pkey_dh I, [2024-05-10T23:57:51.021528 #620712] INFO -- : [512/885] 662072=test_bigzero I, [2024-05-10T23:57:51.028296 #620712] INFO -- : [513/885] 662072=test_getopts I, [2024-05-10T23:57:51.035352 #620712] INFO -- : [514/885] 662072=test_protocol I, [2024-05-10T23:57:51.055927 #620712] INFO -- : [515/885] 662083=test_gem_resolver_activation_request I, [2024-05-10T23:57:51.073549 #620712] INFO -- : [516/885] 662083=test_gem_config_file I, [2024-05-10T23:57:51.084127 #620712] INFO -- : [517/885] 662091=test_ripper I, [2024-05-10T23:57:51.102872 #620712] INFO -- : [518/885] 662081=test_etc I, [2024-05-10T23:57:51.190833 #620712] INFO -- : [519/885] 662081=test_yjit_exit_locations I, [2024-05-10T23:57:51.194709 #620712] INFO -- : [520/885] 662081=test_yaml_tree I, [2024-05-10T23:57:51.199312 #620712] INFO -- : [521/885] 662083=test_sleep I, [2024-05-10T23:57:51.209417 #620712] INFO -- : [522/885] 662079=test_config I, [2024-05-10T23:57:51.221163 #620712] INFO -- : [523/885] 662081=test_libs I, [2024-05-10T23:57:51.237611 #620712] INFO -- : [524/885] 662081=test_math I, [2024-05-10T23:57:51.250190 #620712] INFO -- : [525/885] 662081=test_gem_commands_fetch_command I, [2024-05-10T23:57:51.257015 #620712] INFO -- : [526/885] 662079=test_gc I, [2024-05-10T23:57:51.257680 #620712] INFO -- : [527/885] 662079=test_io I, [2024-05-10T23:57:51.326272 #620712] INFO -- : [528/885] 662077=test_unicode_escape I, [2024-05-10T23:57:51.342840 #620712] INFO -- : [529/885] 662072=test_utf16 I, [2024-05-10T23:57:51.347833 #620712] INFO -- : [530/885] 662070=test_autoload I, [2024-05-10T23:57:51.362073 #620712] INFO -- : [531/885] 662072=test_rendering I, [2024-05-10T23:57:51.403847 #620712] INFO -- : [532/885] 662077=test_sizeof I, [2024-05-10T23:57:51.418497 #620712] INFO -- : [533/885] 662081=test_case I, [2024-05-10T23:57:51.434688 #620712] INFO -- : [534/885] 662081=test_face I, [2024-05-10T23:57:51.447120 #620712] INFO -- : [535/885] 662072=test_gem_resolver_conflict I, [2024-05-10T23:57:51.462092 #620712] INFO -- : [536/885] 662081=test_rdoc_task I, [2024-05-10T23:57:51.464367 #620712] INFO -- : [537/885] 662072=ruby_parser_test I, [2024-05-10T23:57:51.467619 #620712] INFO -- : [538/885] 662081=test_pack I, [2024-05-10T23:57:51.472381 #620712] INFO -- : [539/885] 662072=test_backtrace I, [2024-05-10T23:57:51.496183 #620712] INFO -- : [540/885] 662091=test_io_buffer I, [2024-05-10T23:57:51.497558 #620712] INFO -- : [541/885] 662081=test_rdoc_markup_indented_paragraph I, [2024-05-10T23:57:51.504425 #620712] INFO -- : [542/885] 662081=test_rdoc_require I, [2024-05-10T23:57:51.541075 #620712] INFO -- : [543/885] 662081=locals_test I, [2024-05-10T23:57:51.601481 #620712] INFO -- : [544/885] 662091=test_readpartial I, [2024-05-10T23:57:51.753348 #620712] INFO -- : [545/885] 662082=test_clone I, [2024-05-10T23:57:51.926807 #620712] INFO -- : [546/885] 662081=test_gem_commands_install_command I, [2024-05-10T23:57:51.969144 #620712] INFO -- : [547/885] 662082=test_optparse I, [2024-05-10T23:57:51.973698 #620712] INFO -- : [548/885] 662082=test_array I, [2024-05-10T23:57:52.012845 #620712] INFO -- : [549/885] 662091=test_fstring I, [2024-05-10T23:57:52.013243 #620712] INFO -- : [550/885] 662082=test_rdoc_markup_to_html_crossref I, [2024-05-10T23:57:52.043703 #620712] INFO -- : [551/885] 662092=test_gem_resolver_best_set I, [2024-05-10T23:57:52.067999 #620712] INFO -- : [552/885] 662075=encoding_test I, [2024-05-10T23:57:52.119003 #620712] INFO -- : [553/885] 662092=test_typeddata I, [2024-05-10T23:57:52.130681 #620712] INFO -- : [554/885] 662078=test_rat I, [2024-05-10T23:57:52.136877 #620712] INFO -- : [555/885] 662078=test_rdoc_markup_raw I, [2024-05-10T23:57:52.147951 #620712] INFO -- : [556/885] 662078=test_webauthn_poller I, [2024-05-10T23:57:52.160204 #620712] INFO -- : [557/885] 662091=test_stringscanner I, [2024-05-10T23:57:52.196198 #620712] INFO -- : [558/885] 662091=test_files_sample I, [2024-05-10T23:57:52.249048 #620712] INFO -- : [559/885] 662091=test_rdoc_alias I, [2024-05-10T23:57:52.277824 #620712] INFO -- : [560/885] 662075=test_yield I, [2024-05-10T23:57:52.284657 #620712] INFO -- : [561/885] 662078=test_convertible I, [2024-05-10T23:57:52.309493 #620712] INFO -- : [562/885] 662091=parser_test I, [2024-05-10T23:57:52.312177 #620712] INFO -- : [563/885] 662091=test_forwardable I, [2024-05-10T23:57:52.333434 #620712] INFO -- : [564/885] 662091=test_yaml I, [2024-05-10T23:57:52.367744 #620712] INFO -- : [565/885] 662092=test_wait I, [2024-05-10T23:57:52.406356 #620712] INFO -- : [566/885] 662082=test_handle I, [2024-05-10T23:57:52.413187 #620712] INFO -- : [567/885] 662091=test_big2str I, [2024-05-10T23:57:52.426534 #620712] INFO -- : [568/885] 662091=test_ractor I, [2024-05-10T23:57:52.435968 #620712] INFO -- : [569/885] 662091=test_euc_tw I, [2024-05-10T23:57:52.437212 #620712] INFO -- : [570/885] 662091=test_bmethod I, [2024-05-10T23:57:52.440464 #620712] INFO -- : [571/885] 662092=test_ansi_without_terminfo I, [2024-05-10T23:57:52.442922 #620712] INFO -- : [572/885] 662091=test_gem_commands_sources_command I, [2024-05-10T23:57:52.465889 #620712] INFO -- : [573/885] 662092=test_thread_queue I, [2024-05-10T23:57:52.549975 #620712] INFO -- : [574/885] 662080=test_nowrite I, [2024-05-10T23:57:52.580438 #620712] INFO -- : [575/885] 662080=test_rdoc_markup_formatter I, [2024-05-10T23:57:52.587170 #620712] INFO -- : [576/885] 662080=test_comparable I, [2024-05-10T23:57:52.591445 #620712] INFO -- : [577/885] 662080=test_rdoc_parser_c I, [2024-05-10T23:57:52.674229 #620712] INFO -- : [578/885] 662091=test_io_timeout I, [2024-05-10T23:57:52.679554 #620712] INFO -- : [579/885] 662082=test_shapes I, [2024-05-10T23:57:52.681527 #620712] INFO -- : [580/885] 662091=json_fixtures_test I, [2024-05-10T23:57:52.684653 #620712] INFO -- : [581/885] 662082=test_pstore I, [2024-05-10T23:57:52.692821 #620712] INFO -- : [582/885] 662091=test_cstr I, [2024-05-10T23:57:52.728739 #620712] INFO -- : [583/885] 662082=test_profile_frames I, [2024-05-10T23:57:52.797427 #620712] INFO -- : [584/885] 662072=test_class2name I, [2024-05-10T23:57:52.802146 #620712] INFO -- : [585/885] 662072=test_gbk I, [2024-05-10T23:57:52.807168 #620712] INFO -- : [586/885] 662072=test_enc_str_buf_cat I, [2024-05-10T23:57:52.809781 #620712] INFO -- : [587/885] 662072=test_gem_commands_contents_command I, [2024-05-10T23:57:52.816746 #620712] INFO -- : [588/885] 662080=test_gem_ext_cmake_builder I, [2024-05-10T23:57:52.833383 #620712] INFO -- : [589/885] 662080=test_require I, [2024-05-10T23:57:52.909115 #620712] INFO -- : [590/885] 662072=test_cgi_util I, [2024-05-10T23:57:52.919212 #620712] INFO -- : [591/885] 662082=test_marshalable I, [2024-05-10T23:57:52.921576 #620712] INFO -- : [592/885] 662082=test_digest I, [2024-05-10T23:57:53.111615 #620712] INFO -- : [593/885] 662091=test_ractor I, [2024-05-10T23:57:53.168770 #620712] INFO -- : [594/885] 662072=test_find I, [2024-05-10T23:57:53.189527 #620712] INFO -- : [595/885] 662072=test_fiddle I, [2024-05-10T23:57:53.211675 #620712] INFO -- : [596/885] 662091=test_wss I, [2024-05-10T23:57:53.233329 #620712] INFO -- : [597/885] 662091=test_rdoc_any_method I, [2024-05-10T23:57:53.245911 #620712] INFO -- : [598/885] 662081=test_modify_expand I, [2024-05-10T23:57:53.249760 #620712] INFO -- : [599/885] 662083=test_rdoc_markdown I, [2024-05-10T23:57:53.251254 #620712] INFO -- : [600/885] 662081=test_gem_available_set I, [2024-05-10T23:57:53.282092 #620712] INFO -- : [601/885] 662072=test_file I, [2024-05-10T23:57:53.287846 #620712] INFO -- : [602/885] 662072=regexp_test I, [2024-05-10T23:57:53.300570 #620712] INFO -- : [603/885] 662072=test_gem_package_tar_reader I, [2024-05-10T23:57:53.328780 #620712] INFO -- : [604/885] 662068=test_coverage I, [2024-05-10T23:57:53.342429 #620712] INFO -- : [605/885] 662072=test_rdoc_encoding I, [2024-05-10T23:57:53.358170 #620712] INFO -- : [606/885] 662081=test_pathname I, [2024-05-10T23:57:53.377573 #620712] INFO -- : [607/885] 662072=test_init I, [2024-05-10T23:57:53.450828 #620712] INFO -- : [608/885] 662083=test_complexrational I, [2024-05-10T23:57:53.458246 #620712] INFO -- : [609/885] 662083=test_recorder I, [2024-05-10T23:57:53.465178 #620712] INFO -- : [610/885] 662083=test_gem_source_vendor I, [2024-05-10T23:57:53.476957 #620712] INFO -- : [611/885] 662083=test_gem_commands_owner_command I, [2024-05-10T23:57:53.505402 #620712] INFO -- : [612/885] 662081=test_deprecate I, [2024-05-10T23:57:53.540135 #620712] INFO -- : [613/885] 662081=test_rdoc_constant I, [2024-05-10T23:57:53.675447 #620712] INFO -- : [614/885] 662081=test_formatter I, [2024-05-10T23:57:53.686054 #620712] INFO -- : [615/885] 662081=test_bash_completion I, [2024-05-10T23:57:53.689276 #620712] INFO -- : [616/885] 662081=test_yamlstore I, [2024-05-10T23:57:53.701048 #620712] INFO -- : [617/885] 662081=test_gem_installer I, [2024-05-10T23:57:53.703223 #620712] INFO -- : [618/885] 662091=test_rdoc_parser_rd I, [2024-05-10T23:57:53.725845 #620712] INFO -- : [619/885] 662072=test_date_strftime I, [2024-05-10T23:57:53.730026 #620712] INFO -- : [620/885] 662091=test_irb I, [2024-05-10T23:57:53.783014 #620712] INFO -- : [621/885] 662082=json_string_matching_test I, [2024-05-10T23:57:53.785534 #620712] INFO -- : [622/885] 662090=test_load I, [2024-05-10T23:57:53.787820 #620712] INFO -- : [623/885] 662082=test_rdoc_normal_class I, [2024-05-10T23:57:53.796744 #620712] INFO -- : [624/885] 662090=test_class I, [2024-05-10T23:57:53.833399 #620712] INFO -- : [625/885] 662082=test_const I, [2024-05-10T23:57:53.838734 #620712] INFO -- : [626/885] 662082=test_asn1 I, [2024-05-10T23:57:53.860550 #620712] INFO -- : [627/885] 662082=test_random I, [2024-05-10T23:57:53.862112 #620712] INFO -- : [628/885] 662082=test_tempfile I, [2024-05-10T23:57:54.036083 #620712] INFO -- : [629/885] 662080=test_noarg I, [2024-05-10T23:57:54.055154 #620712] INFO -- : [630/885] 662083=parse_comments_test I, [2024-05-10T23:57:54.059777 #620712] INFO -- : [631/885] 662083=test_function I, [2024-05-10T23:57:54.137657 #620712] INFO -- : [632/885] 662077=test_queue I, [2024-05-10T23:57:54.138926 #620712] INFO -- : [633/885] 662091=test_internal_ivar I, [2024-05-10T23:57:54.139946 #620712] INFO -- : [634/885] 662082=test_gem_resolver_index_specification I, [2024-05-10T23:57:54.142810 #620712] INFO -- : [635/885] 662077=test_duplicate I, [2024-05-10T23:57:54.144118 #620712] INFO -- : [636/885] 662091=test_utf32 I, [2024-05-10T23:57:54.147352 #620712] INFO -- : [637/885] 662077=test_basicsocket I, [2024-05-10T23:57:54.149564 #620712] INFO -- : [638/885] 662091=test_tracepoint I, [2024-05-10T23:57:54.152667 #620712] INFO -- : [639/885] 662071=test_prettyprint I, [2024-05-10T23:57:54.158221 #620712] INFO -- : [640/885] 662077=test_rdoc_markup I, [2024-05-10T23:57:54.166787 #620712] INFO -- : [641/885] 662077=test_gem_commands_help_command I, [2024-05-10T23:57:54.173799 #620712] INFO -- : [642/885] 662071=test_too_many_dummy_encodings I, [2024-05-10T23:57:54.199027 #620712] INFO -- : [643/885] 662068=test_stack I, [2024-05-10T23:57:54.212869 #620712] INFO -- : [644/885] 662082=test_gem_commands_list_command I, [2024-05-10T23:57:54.219756 #620712] INFO -- : [645/885] 662080=test_reqarg I, [2024-05-10T23:57:54.226740 #620712] INFO -- : [646/885] 662082=test_rdoc_include I, [2024-05-10T23:57:54.236982 #620712] INFO -- : [647/885] 662071=test_fileutils I, [2024-05-10T23:57:54.257374 #620712] INFO -- : [648/885] 662069=test_string_processing I, [2024-05-10T23:57:54.262287 #620712] INFO -- : [649/885] 662069=test_ldap I, [2024-05-10T23:57:54.264203 #620712] INFO -- : [650/885] 662077=test_emitter I, [2024-05-10T23:57:54.270113 #620712] INFO -- : [651/885] 662082=test_gem_commands_signin_command I, [2024-05-10T23:57:54.274376 #620712] INFO -- : [652/885] 662077=test_resource I, [2024-05-10T23:57:54.286292 #620712] INFO -- : [653/885] 662083=test_gem_version I, [2024-05-10T23:57:54.289072 #620712] INFO -- : [654/885] 662077=test_econv I, [2024-05-10T23:57:54.298322 #620712] INFO -- : [655/885] 662069=test_cesu8 I, [2024-05-10T23:57:54.301835 #620712] INFO -- : [656/885] 662069=test_rdoc_options I, [2024-05-10T23:57:54.366095 #620712] INFO -- : [657/885] 662083=test_inlinecache I, [2024-05-10T23:57:54.381440 #620712] INFO -- : [658/885] 662082=test_rdoc_markup_verbatim I, [2024-05-10T23:57:54.382716 #620712] INFO -- : [659/885] 662072=test_path_to_class I, [2024-05-10T23:57:54.385292 #620712] INFO -- : [660/885] 662082=test_gem_resolver_specification I, [2024-05-10T23:57:54.388104 #620712] INFO -- : [661/885] 662072=test_gem_dependency I, [2024-05-10T23:57:54.400345 #620712] INFO -- : [662/885] 662091=test_gem_stub_specification I, [2024-05-10T23:57:54.408367 #620712] INFO -- : [663/885] 662082=test_method_cache I, [2024-05-10T23:57:54.411044 #620712] INFO -- : [664/885] 662082=test_frozen_error I, [2024-05-10T23:57:54.416304 #620712] INFO -- : [665/885] 662082=test_gem_ext_ext_conf_builder I, [2024-05-10T23:57:54.439513 #620712] INFO -- : [666/885] 662083=test_complex I, [2024-05-10T23:57:54.504634 #620712] INFO -- : [667/885] 662072=test_gem_commands_search_command I, [2024-05-10T23:57:54.508796 #620712] INFO -- : [668/885] 662072=test_scanner_events I, [2024-05-10T23:57:54.534248 #620712] INFO -- : [669/885] 662069=test_gem_resolver_installed_specification I, [2024-05-10T23:57:54.539455 #620712] INFO -- : [670/885] 662072=test_parse I, [2024-05-10T23:57:54.551238 #620712] INFO -- : [671/885] 662071=test_mdns I, [2024-05-10T23:57:54.552088 #620712] INFO -- : [672/885] 662069=test_gem_remote_fetcher I, [2024-05-10T23:57:54.554480 #620712] INFO -- : [673/885] 662080=test_rdoc_markdown_test I, [2024-05-10T23:57:54.555613 #620712] INFO -- : [674/885] 662071=test_c_union_entity I, [2024-05-10T23:57:54.556560 #620712] INFO -- : [675/885] 662091=test_rdoc_normal_module I, [2024-05-10T23:57:54.562442 #620712] INFO -- : [676/885] 662083=test_logperiod I, [2024-05-10T23:57:54.571839 #620712] INFO -- : [677/885] 662083=test_securerandom I, [2024-05-10T23:57:54.600667 #620712] INFO -- : [678/885] 662071=test_switch_hitter I, [2024-05-10T23:57:54.609966 #620712] INFO -- : [679/885] 662083=test_flush I, [2024-05-10T23:57:54.611620 #620712] INFO -- : [680/885] 662071=test_singleton I, [2024-05-10T23:57:54.612970 #620712] INFO -- : [681/885] 662091=test_io_console I, [2024-05-10T23:57:54.613745 #620712] INFO -- : [682/885] 662083=test_hash_create I, [2024-05-10T23:57:54.614796 #620712] INFO -- : [683/885] 662071=test_stringchar I, [2024-05-10T23:57:54.617185 #620712] INFO -- : [684/885] 662083=test_uncorrectable_name_check I, [2024-05-10T23:57:54.622248 #620712] INFO -- : [685/885] 662083=newline_test I, [2024-05-10T23:57:54.660117 #620712] INFO -- : [686/885] 662071=test_thread_fd_close I, [2024-05-10T23:57:54.663336 #620712] INFO -- : [687/885] 662071=test_passing_block I, [2024-05-10T23:57:54.671134 #620712] INFO -- : [688/885] 662071=test_pack I, [2024-05-10T23:57:54.710962 #620712] INFO -- : [689/885] 662083=test_last_thread I, [2024-05-10T23:57:54.806470 #620712] INFO -- : [690/885] 662071=test_process I, [2024-05-10T23:57:54.962457 #620712] INFO -- : [691/885] 662068=test_gem_security_policy I, [2024-05-10T23:57:55.130676 #620712] INFO -- : [692/885] 662072=test_gem_source_local I, [2024-05-10T23:57:55.272596 #620712] INFO -- : [693/885] 662077=test_logdevice I, [2024-05-10T23:57:55.307639 #620712] INFO -- : [694/885] 662075=test_arity I, [2024-05-10T23:57:55.313016 #620712] INFO -- : [695/885] 662075=test_gem_ext_rake_builder I, [2024-05-10T23:57:55.349452 #620712] INFO -- : [696/885] 662068=test_gc I, [2024-05-10T23:57:55.394620 #620712] INFO -- : [697/885] 662090=test_x509cert I, [2024-05-10T23:57:55.421291 #620712] INFO -- : [698/885] 662072=test_err_in_callback I, [2024-05-10T23:57:55.427534 #620712] INFO -- : [699/885] 662072=test_gem_resolver_lock_specification I, [2024-05-10T23:57:55.461989 #620712] INFO -- : [700/885] 662072=test_enumerator I, [2024-05-10T23:57:55.516266 #620712] INFO -- : [701/885] 662082=test_flags I, [2024-05-10T23:57:55.602226 #620712] INFO -- : [702/885] 662090=test_inadvertent_creation I, [2024-05-10T23:57:55.666384 #620712] INFO -- : [703/885] 662090=test_gem_commands_which_command I, [2024-05-10T23:57:55.711248 #620712] INFO -- : [704/885] 662090=test_shift_jis I, [2024-05-10T23:57:55.717849 #620712] INFO -- : [705/885] 662090=test_http I, [2024-05-10T23:57:55.737110 #620712] INFO -- : [706/885] 662090=test_gem_commands_specification_command I, [2024-05-10T23:57:55.784034 #620712] INFO -- : [707/885] 662070=test_safe_load I, [2024-05-10T23:57:55.784984 #620712] INFO -- : [708/885] 662083=test_gem_resolver_composed_set I, [2024-05-10T23:57:55.797165 #620712] INFO -- : [709/885] 662083=test_gem_resolver I, [2024-05-10T23:57:55.803073 #620712] INFO -- : [710/885] 662070=test_gem_commands_dependency_command I, [2024-05-10T23:57:55.830253 #620712] INFO -- : [711/885] 662080=test_name_error I, [2024-05-10T23:57:55.862131 #620712] INFO -- : [712/885] 662090=test_rdoc_markup_attribute_manager I, [2024-05-10T23:57:55.897923 #620712] INFO -- : [713/885] 662070=test_open-uri I, [2024-05-10T23:57:55.920416 #620712] INFO -- : [714/885] 662075=test_httpresponse I, [2024-05-10T23:57:55.957371 #620712] INFO -- : [715/885] 662080=test_rdoc_parser_ruby I, [2024-05-10T23:57:55.979526 #620712] INFO -- : [716/885] 662075=test_stream I, [2024-05-10T23:57:55.988424 #620712] INFO -- : [717/885] 662090=test_nil2vtempty I, [2024-05-10T23:57:55.989874 #620712] INFO -- : [718/885] 662075=test_rdoc_context I, [2024-05-10T23:57:55.994778 #620712] INFO -- : [719/885] 662090=test_rdoc_text I, [2024-05-10T23:57:56.045179 #620712] INFO -- : [720/885] 662083=test_iso_8859 I, [2024-05-10T23:57:56.054863 #620712] INFO -- : [721/885] 662090=test_tcp I, [2024-05-10T23:57:56.067245 #620712] INFO -- : [722/885] 662083=index_write_test I, [2024-05-10T23:57:56.075384 #620712] INFO -- : [723/885] 662083=test_date_new I, [2024-05-10T23:57:56.078112 #620712] INFO -- : [724/885] 662077=test_data I, [2024-05-10T23:57:56.078616 #620712] INFO -- : [725/885] 662090=test_require I, [2024-05-10T23:57:56.080479 #620712] INFO -- : [726/885] 662090=test_rdoc_markup_to_joined_paragraph I, [2024-05-10T23:57:56.084440 #620712] INFO -- : [727/885] 662083=test_date_time I, [2024-05-10T23:57:56.087634 #620712] INFO -- : [728/885] 662077=test_gem_safe_yaml I, [2024-05-10T23:57:56.090235 #620712] INFO -- : [729/885] 662083=test_syntax I, [2024-05-10T23:57:56.093760 #620712] INFO -- : [730/885] 662090=test_scalar I, [2024-05-10T23:57:56.098271 #620712] INFO -- : [731/885] 662077=test_gem_dependency_installer I, [2024-05-10T23:57:56.099040 #620712] INFO -- : [732/885] 662090=test_gem_commands_info_command I, [2024-05-10T23:57:56.122843 #620712] INFO -- : [733/885] 662090=test_rdoc_cross_reference I, [2024-05-10T23:57:56.198514 #620712] INFO -- : [734/885] 662070=test_store I, [2024-05-10T23:57:56.291314 #620712] INFO -- : [735/885] 662069=test_case_options I, [2024-05-10T23:57:56.296003 #620712] INFO -- : [736/885] 662069=test_exception I, [2024-05-10T23:57:56.349902 #620712] INFO -- : [737/885] 662070=test_rand I, [2024-05-10T23:57:56.542979 #620712] INFO -- : [738/885] 662082=test_gem_package_tar_reader_entry I, [2024-05-10T23:57:56.636810 #620712] INFO -- : [739/885] 662070=test_gem_name_tuple I, [2024-05-10T23:57:56.652468 #620712] INFO -- : [740/885] 662070=test_bug_reporter I, [2024-05-10T23:57:56.729696 #620712] INFO -- : [741/885] 662082=test_gem_commands_mirror I, [2024-05-10T23:57:56.734869 #620712] INFO -- : [742/885] 662082=test_gem_ext_cargo_builder_link_flag_converter I, [2024-05-10T23:57:56.739962 #620712] INFO -- : [743/885] 662090=test_sprintf_comb I, [2024-05-10T23:57:56.772177 #620712] INFO -- : [744/885] 662092=test_method_cache I, [2024-05-10T23:57:56.776312 #620712] INFO -- : [745/885] 662080=test_gem_request I, [2024-05-10T23:57:56.776756 #620712] INFO -- : [746/885] 662092=test_scan_args I, [2024-05-10T23:57:56.783242 #620712] INFO -- : [747/885] 662082=test_win32ole I, [2024-05-10T23:57:56.788190 #620712] INFO -- : [748/885] 662092=test_generic I, [2024-05-10T23:57:56.791250 #620712] INFO -- : [749/885] 662082=test_settracefunc I, [2024-05-10T23:57:56.809409 #620712] INFO -- : [750/885] 662092=test_gem_text I, [2024-05-10T23:57:56.864394 #620712] INFO -- : [751/885] 662092=test_enumerator_kw I, [2024-05-10T23:57:56.868020 #620712] INFO -- : [752/885] 662092=test_parser_events I, [2024-05-10T23:57:56.894256 #620712] INFO -- : [753/885] 662078=test_reline I, [2024-05-10T23:57:56.932402 #620712] INFO -- : [754/885] 662075=test_case I, [2024-05-10T23:57:56.932473 #620712] INFO -- : [755/885] 662075=test_pkey I, [2024-05-10T23:57:56.950328 #620712] INFO -- : [756/885] 662090=test_gem_request_connection_pools I, [2024-05-10T23:57:56.954978 #620712] INFO -- : [757/885] 662092=test_gem_version_option I, [2024-05-10T23:57:56.963819 #620712] INFO -- : [758/885] 662070=test_grapheme_breaks I, [2024-05-10T23:57:56.985081 #620712] INFO -- : [759/885] 662080=test_cclass I, [2024-05-10T23:57:56.985554 #620712] INFO -- : [760/885] 662075=test_ractor I, [2024-05-10T23:57:56.988663 #620712] INFO -- : [761/885] 662070=test_memory_view I, [2024-05-10T23:57:57.002831 #620712] INFO -- : [762/885] 662092=test_m17n_comb I, [2024-05-10T23:57:57.063346 #620712] INFO -- : [763/885] 662075=test_json_tree I, [2024-05-10T23:57:57.065746 #620712] INFO -- : [764/885] 662080=test_rdoc_markup_to_markdown I, [2024-05-10T23:57:57.071079 #620712] INFO -- : [765/885] 662075=test_rdoc_generator_pot_po I, [2024-05-10T23:57:57.071986 #620712] INFO -- : [766/885] 662075=test_ansi_with_terminfo I, [2024-05-10T23:57:57.076914 #620712] INFO -- : [767/885] 662075=test_require_lib I, [2024-05-10T23:57:57.095634 #620712] INFO -- : [768/885] 662080=test_gem_install_update_options I, [2024-05-10T23:57:57.149152 #620712] INFO -- : [769/885] 662070=parse_test I, [2024-05-10T23:57:57.163596 #620712] INFO -- : [770/885] 662078=test_ractor I, [2024-05-10T23:57:57.173477 #620712] INFO -- : [771/885] 662078=test_severity I, [2024-05-10T23:57:57.184266 #620712] INFO -- : [772/885] 662078=test_gem_stream_ui I, [2024-05-10T23:57:57.212764 #620712] INFO -- : [773/885] 662080=test_extlibs I, [2024-05-10T23:57:57.272740 #620712] INFO -- : [774/885] 662078=test_rdoc_generator_ri I, [2024-05-10T23:57:57.274073 #620712] INFO -- : [775/885] 662078=test_str2big I, [2024-05-10T23:57:57.304902 #620712] INFO -- : [776/885] 662078=test_dot_dot I, [2024-05-10T23:57:57.308502 #620712] INFO -- : [777/885] 662078=test_c_struct_builder I, [2024-05-10T23:57:57.320674 #620712] INFO -- : [778/885] 662091=test_literal I, [2024-05-10T23:57:57.384824 #620712] INFO -- : [779/885] 662078=test_thread I, [2024-05-10T23:57:57.602128 #620712] INFO -- : [780/885] 662078=test_socket I, [2024-05-10T23:57:57.738044 #620712] INFO -- : [781/885] 662082=test_objectspace I, [2024-05-10T23:57:57.882333 #620712] INFO -- : [782/885] 662091=test_rdoc_markup_to_table_of_contents I, [2024-05-10T23:57:57.908579 #620712] INFO -- : [783/885] 662091=test_erb_m17n I, [2024-05-10T23:57:57.921233 #620712] INFO -- : [784/885] 662091=test_ole_methods I, [2024-05-10T23:57:57.933605 #620712] INFO -- : [785/885] 662091=test_date_conv I, [2024-05-10T23:57:57.946226 #620712] INFO -- : [786/885] 662091=test_optimization I, [2024-05-10T23:57:57.993119 #620712] INFO -- : [787/885] 662090=test_cgi_tag_helper I, [2024-05-10T23:57:58.024582 #620712] INFO -- : [788/885] 662090=test_zlib I, [2024-05-10T23:57:58.093587 #620712] INFO -- : [789/885] 662077=test_egrep_cpp I, [2024-05-10T23:57:58.134757 #620712] INFO -- : [790/885] 662074=test_gem_resolver_index_set I, [2024-05-10T23:57:58.175908 #620712] INFO -- : [791/885] 662074=test_gem_package_old I, [2024-05-10T23:57:58.226077 #620712] INFO -- : [792/885] 662074=test_gc_compact I, [2024-05-10T23:57:58.238214 #620712] INFO -- : [793/885] 662081=test_string I, [2024-05-10T23:57:58.239762 #620712] INFO -- : [794/885] 662077=test_proc I, [2024-05-10T23:57:58.279947 #620712] INFO -- : [795/885] 662073=test_gem_validator I, [2024-05-10T23:57:58.311713 #620712] INFO -- : [796/885] 662073=test_fnmatch I, [2024-05-10T23:57:58.350838 #620712] INFO -- : [797/885] 662073=test_files_test_2 I, [2024-05-10T23:57:58.436654 #620712] INFO -- : [798/885] 662069=test_require_path_check I, [2024-05-10T23:57:58.500103 #620712] INFO -- : [799/885] 662069=test_rdoc_markup_parser I, [2024-05-10T23:57:58.542749 #620712] INFO -- : [800/885] 662069=test_folderitem2_invokeverb I, [2024-05-10T23:57:58.545467 #620712] INFO -- : [801/885] 662069=test_string I, [2024-05-10T23:57:58.560070 #620712] INFO -- : [802/885] 662069=test_rdoc_stats I, [2024-05-10T23:57:58.599878 #620712] INFO -- : [803/885] 662069=test_pattern_matching I, [2024-05-10T23:57:58.631647 #620712] INFO -- : [804/885] 662069=test_gem_request_set_lockfile_parser I, [2024-05-10T23:57:58.731827 #620712] INFO -- : [805/885] 662082=test_depth_first I, [2024-05-10T23:57:58.735681 #620712] INFO -- : [806/885] 662082=test_x509attr I, [2024-05-10T23:57:58.745115 #620712] INFO -- : [807/885] 662082=test_raise I, [2024-05-10T23:57:58.745181 #620712] INFO -- : [808/885] 662082=test_rdoc_store I, [2024-05-10T23:57:58.749685 #620712] INFO -- : [809/885] 662069=json_addition_test I, [2024-05-10T23:57:58.772176 #620712] INFO -- : [810/885] 662069=test_custom_command I, [2024-05-10T23:57:58.836140 #620712] INFO -- : [811/885] 662069=test_gem_dependency_resolution_error I, [2024-05-10T23:57:58.843028 #620712] INFO -- : [812/885] 662069=test_qsort I, [2024-05-10T23:57:58.863801 #620712] INFO -- : [813/885] 662069=test_rdoc_parser I, [2024-05-10T23:57:58.876383 #620712] INFO -- : [814/885] 662069=test_rdoc_rd_inline_parser I, [2024-05-10T23:57:58.892152 #620712] INFO -- : [815/885] 662069=test_rdoc_markup_to_rdoc I, [2024-05-10T23:57:58.934221 #620712] INFO -- : [816/885] 662069=test_default_gems I, [2024-05-10T23:57:58.981305 #620712] INFO -- : [817/885] 662069=test_win32ole_type I, [2024-05-10T23:57:58.985800 #620712] INFO -- : [818/885] 662069=test_null I, [2024-05-10T23:57:58.990360 #620712] INFO -- : [819/885] 662069=test_mul I, [2024-05-10T23:57:58.993890 #620712] INFO -- : [820/885] 662092=test_rdoc_markup_attributes I, [2024-05-10T23:57:58.995983 #620712] INFO -- : [821/885] 662092=test_date_parse I, [2024-05-10T23:57:58.998287 #620712] INFO -- : [822/885] 662069=test_pkey_ec I, [2024-05-10T23:57:59.008288 #620712] INFO -- : [823/885] 662078=test_thread I, [2024-05-10T23:57:59.011063 #620712] INFO -- : [824/885] 662078=test_trick I, [2024-05-10T23:57:59.080816 #620712] INFO -- : [825/885] 662069=test_pipe I, [2024-05-10T23:57:59.094851 #620712] INFO -- : [826/885] 662092=test_rdoc_i18n_text I, [2024-05-10T23:57:59.097368 #620712] INFO -- : [827/885] 662080=test_io_buffer I, [2024-05-10T23:57:59.102138 #620712] INFO -- : [828/885] 662092=test_backtrace I, [2024-05-10T23:57:59.103684 #620712] INFO -- : [829/885] 662092=test_defined I, [2024-05-10T23:57:59.138505 #620712] INFO -- : [830/885] 662077=test_key_name_check I, [2024-05-10T23:57:59.149859 #620712] INFO -- : [831/885] 662080=test_rdoc_rdoc I, [2024-05-10T23:57:59.152838 #620712] INFO -- : [832/885] 662077=test_time I, [2024-05-10T23:57:59.179931 #620712] INFO -- : [833/885] 662092=test_windows_1251 I, [2024-05-10T23:57:59.193748 #620712] INFO -- : [834/885] 662092=test_svcb_https I, [2024-05-10T23:57:59.214701 #620712] INFO -- : [835/885] 662092=test_buffering I, [2024-05-10T23:57:59.223775 #620712] INFO -- : [836/885] 662080=test_gb18030 I, [2024-05-10T23:57:59.227132 #620712] INFO -- : [837/885] 662080=test_gem_uninstaller I, [2024-05-10T23:57:59.249299 #620712] INFO -- : [838/885] 662092=test_files_ext I, [2024-05-10T23:57:59.249525 #620712] INFO -- : [839/885] 662092=test_bug-5832 I, [2024-05-10T23:57:59.254263 #620712] INFO -- : [840/885] 662092=test_gem_silent_ui I, [2024-05-10T23:57:59.267975 #620712] INFO -- : [841/885] 662069=test_emitter I, [2024-05-10T23:57:59.278589 #620712] INFO -- : [842/885] 662069=test_gem_doctor I, [2024-05-10T23:57:59.281258 #620712] INFO -- : [843/885] 662077=test_kdf I, [2024-05-10T23:57:59.296090 #620712] INFO -- : [844/885] 662092=test_eval_history I, [2024-05-10T23:57:59.307717 #620712] INFO -- : [845/885] 662092=dispatcher_test I, [2024-05-10T23:57:59.322033 #620712] INFO -- : [846/885] 662092=test_kernel I, [2024-05-10T23:57:59.330275 #620712] INFO -- : [847/885] 662069=test_rdoc_markup_paragraph I, [2024-05-10T23:57:59.340177 #620712] INFO -- : [848/885] 662069=test_enc_raise I, [2024-05-10T23:57:59.347544 #620712] INFO -- : [849/885] 662069=test_psych I, [2024-05-10T23:57:59.353837 #620712] INFO -- : [850/885] 662077=!Nothing_to_test I, [2024-05-10T23:57:59.354985 #620712] INFO -- : [851/885] 662077=test_object_create_start I, [2024-05-10T23:57:59.358007 #620712] INFO -- : [852/885] 662077=test_command I, [2024-05-10T23:57:59.385383 #620712] INFO -- : [853/885] 662069=test_at_exit I, [2024-05-10T23:57:59.406179 #620712] INFO -- : [854/885] 662069=test_gem_ext_cargo_builder_unit I, [2024-05-10T23:57:59.432453 #620712] INFO -- : [855/885] 662069=test_date I, [2024-05-10T23:57:59.442613 #620712] INFO -- : [856/885] 662069=test_gem_rdoc I, [2024-05-10T23:57:59.527851 #620712] INFO -- : [857/885] 662082=test_hmac I, [2024-05-10T23:57:59.535360 #620712] INFO -- : [858/885] 662082=test_rdoc_markup_to_tt_only I, [2024-05-10T23:57:59.555735 #620712] INFO -- : [859/885] 662069=test_rdoc_tom_doc I, [2024-05-10T23:57:59.572914 #620712] INFO -- : [860/885] 662069=test_ifunless I, [2024-05-10T23:57:59.578170 #620712] INFO -- : [861/885] 662069=test_assignment I, [2024-05-10T23:57:59.605839 #620712] INFO -- : [862/885] 662082=test_gem_commands_lock_command I, [2024-05-10T23:57:59.635844 #620712] INFO -- : [863/885] 662082=test_numeric I, [2024-05-10T23:57:59.653702 #620712] INFO -- : [864/885] 662077=test_common I, [2024-05-10T23:57:59.739947 #620712] INFO -- : [865/885] 662082=test_gem_spec_fetcher I, [2024-05-10T23:57:59.816535 #620712] INFO -- : [866/885] 662070=test_gem_command I, [2024-05-10T23:57:59.912113 #620712] INFO -- : [867/885] 662070=test_bug-3571 I, [2024-05-10T23:57:59.913224 #620712] INFO -- : [868/885] 662077=test_key_actor_vi I, [2024-05-10T23:57:59.920523 #620712] INFO -- : [869/885] 662082=test_address_resolve I, [2024-05-10T23:57:59.922038 #620712] INFO -- : [870/885] 662092=test_rdoc_token_stream I, [2024-05-10T23:57:59.927452 #620712] INFO -- : [871/885] 662092=test_config I, [2024-05-10T23:57:59.928601 #620712] INFO -- : [872/885] 662070=test_gem_source_list I, [2024-05-10T23:57:59.950874 #620712] INFO -- : [873/885] 662092=test_yaml_special_cases I, [2024-05-10T23:57:59.956826 #620712] INFO -- : [874/885] 662092=test_optarg I, [2024-05-10T23:57:59.976379 #620712] INFO -- : [875/885] 662082=test_macro I, [2024-05-10T23:57:59.983431 #620712] INFO -- : [876/885] 662070=test_gem_ext_configure_builder I, [2024-05-10T23:57:59.994207 #620712] INFO -- : [877/885] 662082=test_frozen I, [2024-05-10T23:57:59.997380 #620712] INFO -- : [878/885] 662082=test_pp I, [2024-05-10T23:58:00.021448 #620712] INFO -- : [879/885] 662092=test_verbose I, [2024-05-10T23:58:00.033053 #620712] INFO -- : [880/885] 662082=test_num2int I, [2024-05-10T23:58:00.038758 #620712] INFO -- : [881/885] 662092=test_nil I, [2024-05-10T23:58:00.043074 #620712] INFO -- : [882/885] 662082=test_rdoc_single_class I, [2024-05-10T23:58:00.046484 #620712] INFO -- : [883/885] 662092=test_zsh_completion I, [2024-05-10T23:58:00.047913 #620712] INFO -- : [884/885] 662082=test_exception I, [2024-05-10T23:58:00.051292 #620712] INFO -- : [885/885] 662092=test_iter_break I, [2024-05-10T23:58:11.193301 #620712] INFO -- : Finished tests in 30.649601s, 860.3375 tests/s, 305136.6025 assertions/s. E, [2024-05-10T23:58:11.193397 #620712] ERROR -- : Children under /tmp/rubytest.brf1r0: E, [2024-05-10T23:58:11.193548 #620712] ERROR -- : * drwx------ 2 40 2024-05-10 23:57:53 +0000 d20240510-662072-84oxus/ E, [2024-05-10T23:58:11.193565 #620712] ERROR -- : * drwx------ 2 40 2024-05-10 23:57:53 +0000 d20240510-662072-pex5sc/ E, [2024-05-10T23:58:11.193571 #620712] ERROR -- : * drwx------ 2 40 2024-05-10 23:57:53 +0000 d20240510-662072-8hls82/ E, [2024-05-10T23:58:11.193575 #620712] ERROR -- : * drwx------ 2 40 2024-05-10 23:57:53 +0000 d20240510-662072-osrbvo/ E, [2024-05-10T23:58:11.193580 #620712] ERROR -- : * drwx------ 2 40 2024-05-10 23:57:53 +0000 d20240510-662072-59jwwe/ E, [2024-05-10T23:58:11.193584 #620712] ERROR -- : * drwx------ 4 80 2024-05-10 23:57:44 +0000 gem_rebuild20240510-662092-1oxpcu/ E, [2024-05-10T23:58:11.193588 #620712] ERROR -- : * drwxrwxr-x 2 60 2024-05-10 23:57:44 +0000 new/ E, [2024-05-10T23:58:11.193592 #620712] ERROR -- : * -rw-rw-r-- 1 4096 2024-05-10 23:57:44 +0000 rebuild_test_gem-1.0.0.gem E, [2024-05-10T23:58:11.193601 #620712] ERROR -- : * drwxrwxr-x 2 60 2024-05-10 23:57:44 +0000 old/ E, [2024-05-10T23:58:11.193604 #620712] ERROR -- : * -rw-rw-r-- 1 4096 2024-05-10 23:57:44 +0000 rebuild_test_gem-1.0.0.gem I, [2024-05-10T23:58:11.194755 #620712] INFO -- : 26369 tests, 9352315 assertions, 0 failures, 0 errors, 306 skips I, [2024-05-10T23:58:11.194806 #620712] INFO -- : I, [2024-05-10T23:58:11.194826 #620712] INFO -- : ruby -v: ruby 3.4.0dev (2024-05-10T17:19:42Z master 68b6fe7048) [x86_64-linux] I, [2024-05-10T23:58:11.196843 #620712] INFO -- : $$$[end] "make yes-test-all TESTOPTS='--stderr-on-failure' TESTS='-j20'" exit with 0. I, [2024-05-10T23:58:11.197014 #620712] INFO -- : $$$[beg] make yes-test-rubyspec MSPECOPT='--error-output stderr --debug -j' TESTS='-j20' I, [2024-05-10T23:58:11.290450 #620712] INFO -- : BASERUBY = /usr/bin/ruby --disable=gems I, [2024-05-10T23:58:11.290487 #620712] INFO -- : CC = gcc I, [2024-05-10T23:58:11.290496 #620712] INFO -- : LD = ld I, [2024-05-10T23:58:11.290501 #620712] INFO -- : LDSHARED = gcc -shared I, [2024-05-10T23:58:11.290506 #620712] INFO -- : CFLAGS = -O3 -fno-fast-math -ggdb3 -Wall -Wextra -Wdeprecated-declarations -Wdiv-by-zero -Wduplicated-cond -Wimplicit-function-declaration -Wimplicit-int -Wpointer-arith -Wwrite-strings -Wold-style-definition -Wimplicit-fallthrough=0 -Wmissing-noreturn -Wno-cast-function-type -Wno-constant-logical-operand -Wno-long-long -Wno-missing-field-initializers -Wno-overlength-strings -Wno-packed-bitfield-compat -Wno-parentheses-equality -Wno-self-assign -Wno-tautological-compare -Wno-unused-parameter -Wno-unused-value -Wsuggest-attribute=format -Wsuggest-attribute=noreturn -Wunused-variable -Wmisleading-indentation -Wundef -fPIC I, [2024-05-10T23:58:11.290511 #620712] INFO -- : XCFLAGS = -U_FORTIFY_SOURCE -D_FORTIFY_SOURCE=2 -fstack-protector-strong -fno-strict-overflow -fvisibility=hidden -fexcess-precision=standard -DRUBY_EXPORT -I. -I.ext/include/x86_64-linux -I/tmp/ruby/src/trunk/include -I/tmp/ruby/src/trunk -I/tmp/ruby/src/trunk/prism -I/tmp/ruby/src/trunk/enc/unicode/15.0.0 I, [2024-05-10T23:58:11.290516 #620712] INFO -- : CPPFLAGS = I, [2024-05-10T23:58:11.290520 #620712] INFO -- : DLDFLAGS = -Wl,--compress-debug-sections=zlib -Wl,-soname,libruby.so.3.4 -fstack-protector-strong I, [2024-05-10T23:58:11.290524 #620712] INFO -- : SOLIBS = -lz -lrt -lrt -lgmp -ldl -lcrypt -lm -lpthread I, [2024-05-10T23:58:11.290528 #620712] INFO -- : LANG = en_US.UTF-8 I, [2024-05-10T23:58:11.290532 #620712] INFO -- : LC_ALL = I, [2024-05-10T23:58:11.290536 #620712] INFO -- : LC_CTYPE = I, [2024-05-10T23:58:11.290540 #620712] INFO -- : MFLAGS = I, [2024-05-10T23:58:11.290544 #620712] INFO -- : RUSTC = no I, [2024-05-10T23:58:11.290550 #620712] INFO -- : YJIT_RUSTC_ARGS = --crate-name=yjit --crate-type=staticlib --edition=2021 -g -C lto=thin -C opt-level=3 -C overflow-checks=on '--out-dir=/tmp/ruby/build/trunk/yjit/target/release/' /tmp/ruby/src/trunk/yjit/src/lib.rs I, [2024-05-10T23:58:11.291121 #620712] INFO -- : gcc (Ubuntu 11.4.0-1ubuntu1~22.04) 11.4.0 I, [2024-05-10T23:58:11.291145 #620712] INFO -- : Copyright (C) 2021 Free Software Foundation, Inc. I, [2024-05-10T23:58:11.291154 #620712] INFO -- : This is free software; see the source for copying conditions. There is NO I, [2024-05-10T23:58:11.291160 #620712] INFO -- : warranty; not even for MERCHANTABILITY or FITNESS FOR A PARTICULAR PURPOSE. I, [2024-05-10T23:58:11.291165 #620712] INFO -- : I, [2024-05-10T23:58:11.292949 #620712] INFO -- : generating enc.mk I, [2024-05-10T23:58:11.411121 #620712] INFO -- : making enc I, [2024-05-10T23:58:11.428339 #620712] INFO -- : make[1]: Entering directory '/tmp/ruby/build/trunk' I, [2024-05-10T23:58:11.428363 #620712] INFO -- : make[1]: Nothing to be done for 'enc'. I, [2024-05-10T23:58:11.428369 #620712] INFO -- : make[1]: Leaving directory '/tmp/ruby/build/trunk' I, [2024-05-10T23:58:11.429074 #620712] INFO -- : making srcs under enc I, [2024-05-10T23:58:11.458871 #620712] INFO -- : make[1]: Entering directory '/tmp/ruby/build/trunk' I, [2024-05-10T23:58:11.458892 #620712] INFO -- : make[1]: Nothing to be done for 'srcs'. I, [2024-05-10T23:58:11.458897 #620712] INFO -- : make[1]: Leaving directory '/tmp/ruby/build/trunk' I, [2024-05-10T23:58:11.459832 #620712] INFO -- : generating transdb.h I, [2024-05-10T23:58:11.555730 #620712] INFO -- : transdb.h unchanged I, [2024-05-10T23:58:11.557003 #620712] INFO -- : making trans I, [2024-05-10T23:58:11.591498 #620712] INFO -- : make[1]: Entering directory '/tmp/ruby/build/trunk' I, [2024-05-10T23:58:11.591520 #620712] INFO -- : make[1]: Nothing to be done for 'trans'. I, [2024-05-10T23:58:11.591526 #620712] INFO -- : make[1]: Leaving directory '/tmp/ruby/build/trunk' I, [2024-05-10T23:58:11.592121 #620712] INFO -- : making encs I, [2024-05-10T23:58:11.631537 #620712] INFO -- : make[1]: Entering directory '/tmp/ruby/build/trunk' I, [2024-05-10T23:58:11.631558 #620712] INFO -- : make[1]: Nothing to be done for 'encs'. I, [2024-05-10T23:58:11.631564 #620712] INFO -- : make[1]: Leaving directory '/tmp/ruby/build/trunk' I, [2024-05-10T23:58:11.633371 #620712] INFO -- : generating makefiles ext/configure-ext.mk I, [2024-05-10T23:58:11.659938 #620712] INFO -- : ext/configure-ext.mk updated I, [2024-05-10T23:58:11.662538 #620712] INFO -- : make[1]: Entering directory '/tmp/ruby/build/trunk' I, [2024-05-10T23:58:13.010829 #620712] INFO -- : make[1]: Leaving directory '/tmp/ruby/build/trunk' I, [2024-05-10T23:58:13.011554 #620712] INFO -- : generating makefile exts.mk I, [2024-05-10T23:58:13.047914 #620712] INFO -- : exts.mk unchanged I, [2024-05-10T23:58:13.052339 #620712] INFO -- : make[1]: Entering directory '/tmp/ruby/build/trunk' I, [2024-05-10T23:58:13.375788 #620712] INFO -- : make[2]: Entering directory '/tmp/ruby/build/trunk/ext/coverage' I, [2024-05-10T23:58:13.379834 #620712] INFO -- : make[2]: Leaving directory '/tmp/ruby/build/trunk/ext/coverage' I, [2024-05-10T23:58:13.386103 #620712] INFO -- : make[2]: Entering directory '/tmp/ruby/build/trunk/ext/date' I, [2024-05-10T23:58:13.390577 #620712] INFO -- : make[2]: Leaving directory '/tmp/ruby/build/trunk/ext/date' I, [2024-05-10T23:58:13.394692 #620712] INFO -- : make[2]: Entering directory '/tmp/ruby/build/trunk/ext/digest' I, [2024-05-10T23:58:13.403727 #620712] INFO -- : make[2]: Leaving directory '/tmp/ruby/build/trunk/ext/digest' I, [2024-05-10T23:58:13.429980 #620712] INFO -- : make[2]: Entering directory '/tmp/ruby/build/trunk/ext/digest/sha2' I, [2024-05-10T23:58:13.434881 #620712] INFO -- : make[2]: Leaving directory '/tmp/ruby/build/trunk/ext/digest/sha2' I, [2024-05-10T23:58:13.456010 #620712] INFO -- : make[2]: Entering directory '/tmp/ruby/build/trunk/ext/fiddle' I, [2024-05-10T23:58:13.465836 #620712] INFO -- : make[2]: Leaving directory '/tmp/ruby/build/trunk/ext/fiddle' I, [2024-05-10T23:58:13.470785 #620712] INFO -- : make[2]: Entering directory '/tmp/ruby/build/trunk/ext/io/console' I, [2024-05-10T23:58:13.474977 #620712] INFO -- : make[2]: Leaving directory '/tmp/ruby/build/trunk/ext/io/console' I, [2024-05-10T23:58:13.487923 #620712] INFO -- : make[2]: Entering directory '/tmp/ruby/build/trunk/ext/json' I, [2024-05-10T23:58:13.498597 #620712] INFO -- : make[2]: Leaving directory '/tmp/ruby/build/trunk/ext/json' I, [2024-05-10T23:58:13.514016 #620712] INFO -- : make[2]: Entering directory '/tmp/ruby/build/trunk/ext/monitor' I, [2024-05-10T23:58:13.518096 #620712] INFO -- : make[2]: Leaving directory '/tmp/ruby/build/trunk/ext/monitor' I, [2024-05-10T23:58:13.525198 #620712] INFO -- : make[2]: Entering directory '/tmp/ruby/build/trunk/ext/objspace' I, [2024-05-10T23:58:13.531377 #620712] INFO -- : make[2]: Leaving directory '/tmp/ruby/build/trunk/ext/objspace' I, [2024-05-10T23:58:13.548192 #620712] INFO -- : make[2]: Entering directory '/tmp/ruby/build/trunk/ext/openssl' I, [2024-05-10T23:58:13.561274 #620712] INFO -- : make[2]: Leaving directory '/tmp/ruby/build/trunk/ext/openssl' I, [2024-05-10T23:58:13.564064 #620712] INFO -- : make[2]: Entering directory '/tmp/ruby/build/trunk/ext/pathname' I, [2024-05-10T23:58:13.566676 #620712] INFO -- : make[2]: Leaving directory '/tmp/ruby/build/trunk/ext/pathname' I, [2024-05-10T23:58:13.570884 #620712] INFO -- : make[2]: Entering directory '/tmp/ruby/build/trunk/ext/psych' I, [2024-05-10T23:58:13.586780 #620712] INFO -- : make[2]: Leaving directory '/tmp/ruby/build/trunk/ext/psych' I, [2024-05-10T23:58:13.589838 #620712] INFO -- : make[2]: Entering directory '/tmp/ruby/build/trunk/ext/pty' I, [2024-05-10T23:58:13.592308 #620712] INFO -- : make[2]: Leaving directory '/tmp/ruby/build/trunk/ext/pty' I, [2024-05-10T23:58:13.602402 #620712] INFO -- : make[2]: Entering directory '/tmp/ruby/build/trunk/ext/ripper' I, [2024-05-10T23:58:13.610235 #620712] INFO -- : make[2]: Leaving directory '/tmp/ruby/build/trunk/ext/ripper' I, [2024-05-10T23:58:13.612736 #620712] INFO -- : make[2]: Entering directory '/tmp/ruby/build/trunk/ext/rubyvm' I, [2024-05-10T23:58:13.615932 #620712] INFO -- : make[2]: Leaving directory '/tmp/ruby/build/trunk/ext/rubyvm' I, [2024-05-10T23:58:13.628393 #620712] INFO -- : make[2]: Entering directory '/tmp/ruby/build/trunk/ext/socket' I, [2024-05-10T23:58:13.638779 #620712] INFO -- : make[2]: Leaving directory '/tmp/ruby/build/trunk/ext/socket' I, [2024-05-10T23:58:13.657228 #620712] INFO -- : make[2]: Entering directory '/tmp/ruby/build/trunk/.bundle/gems/bigdecimal-3.1.8/ext/bigdecimal' I, [2024-05-10T23:58:13.684345 #620712] INFO -- : make[2]: Leaving directory '/tmp/ruby/build/trunk/.bundle/gems/bigdecimal-3.1.8/ext/bigdecimal' I, [2024-05-10T23:58:13.686375 #620712] INFO -- : make[2]: Entering directory '/tmp/ruby/build/trunk/.bundle/gems/debug-1.9.2/ext/debug' I, [2024-05-10T23:58:13.707705 #620712] INFO -- : make[2]: Leaving directory '/tmp/ruby/build/trunk/.bundle/gems/debug-1.9.2/ext/debug' I, [2024-05-10T23:58:13.709621 #620712] INFO -- : make[2]: Entering directory '/tmp/ruby/build/trunk/.bundle/gems/nkf-0.2.0/ext/nkf' I, [2024-05-10T23:58:13.731045 #620712] INFO -- : make[2]: Leaving directory '/tmp/ruby/build/trunk/.bundle/gems/nkf-0.2.0/ext/nkf' I, [2024-05-10T23:58:13.732964 #620712] INFO -- : make[2]: Entering directory '/tmp/ruby/build/trunk/.bundle/gems/racc-1.7.3/ext/racc/cparse' I, [2024-05-10T23:58:13.753973 #620712] INFO -- : make[2]: Leaving directory '/tmp/ruby/build/trunk/.bundle/gems/racc-1.7.3/ext/racc/cparse' I, [2024-05-10T23:58:13.756348 #620712] INFO -- : make[2]: Entering directory '/tmp/ruby/build/trunk/.bundle/gems/rbs-3.4.4/ext/rbs_extension' I, [2024-05-10T23:58:13.778572 #620712] INFO -- : make[2]: Leaving directory '/tmp/ruby/build/trunk/.bundle/gems/rbs-3.4.4/ext/rbs_extension' I, [2024-05-10T23:58:13.780603 #620712] INFO -- : make[2]: Entering directory '/tmp/ruby/build/trunk/.bundle/gems/syslog-0.1.2/ext/syslog' I, [2024-05-10T23:58:13.803125 #620712] INFO -- : make[2]: Leaving directory '/tmp/ruby/build/trunk/.bundle/gems/syslog-0.1.2/ext/syslog' I, [2024-05-10T23:58:13.826582 #620712] INFO -- : make[2]: Entering directory '/tmp/ruby/build/trunk' I, [2024-05-10T23:58:13.891081 #620712] INFO -- : make[2]: 'ruby' is up to date. I, [2024-05-10T23:58:13.891121 #620712] INFO -- : make[2]: Leaving directory '/tmp/ruby/build/trunk' I, [2024-05-10T23:58:13.891418 #620712] INFO -- : make[1]: Leaving directory '/tmp/ruby/build/trunk' I, [2024-05-10T23:58:13.895152 #620712] INFO -- : make[1]: Entering directory '/tmp/ruby/build/trunk' I, [2024-05-10T23:58:13.895175 #620712] INFO -- : make[1]: Nothing to be done for 'note'. I, [2024-05-10T23:58:13.895181 #620712] INFO -- : make[1]: Leaving directory '/tmp/ruby/build/trunk' E, [2024-05-10T23:58:13.950290 #620712] ERROR -- : $ /tmp/ruby/build/trunk/miniruby -I/tmp/ruby/src/trunk/lib /tmp/ruby/src/trunk/tool/runruby.rb --archdir=/tmp/ruby/build/trunk --extout=.ext -- /tmp/ruby/src/trunk/spec/mspec/bin/mspec-run -B /tmp/ruby/src/trunk/spec/default.mspec --error-output stderr --debug -fy -o /tmp/rubytest.ltjnc7/1-mspec-multi-0 E, [2024-05-10T23:58:13.950485 #620712] ERROR -- : $ /tmp/ruby/build/trunk/miniruby -I/tmp/ruby/src/trunk/lib /tmp/ruby/src/trunk/tool/runruby.rb --archdir=/tmp/ruby/build/trunk --extout=.ext -- /tmp/ruby/src/trunk/spec/mspec/bin/mspec-run -B /tmp/ruby/src/trunk/spec/default.mspec --error-output stderr --debug -fy -o /tmp/rubytest.ltjnc7/2-mspec-multi-1 E, [2024-05-10T23:58:13.950789 #620712] ERROR -- : $ /tmp/ruby/build/trunk/miniruby -I/tmp/ruby/src/trunk/lib /tmp/ruby/src/trunk/tool/runruby.rb --archdir=/tmp/ruby/build/trunk --extout=.ext -- /tmp/ruby/src/trunk/spec/mspec/bin/mspec-run -B /tmp/ruby/src/trunk/spec/default.mspec --error-output stderr --debug -fy -o /tmp/rubytest.ltjnc7/3-mspec-multi-2 E, [2024-05-10T23:58:13.951080 #620712] ERROR -- : $ /tmp/ruby/build/trunk/miniruby -I/tmp/ruby/src/trunk/lib /tmp/ruby/src/trunk/tool/runruby.rb --archdir=/tmp/ruby/build/trunk --extout=.ext -- /tmp/ruby/src/trunk/spec/mspec/bin/mspec-run -B /tmp/ruby/src/trunk/spec/default.mspec --error-output stderr --debug -fy -o /tmp/rubytest.ltjnc7/4-mspec-multi-3 E, [2024-05-10T23:58:13.951364 #620712] ERROR -- : $ /tmp/ruby/build/trunk/miniruby -I/tmp/ruby/src/trunk/lib /tmp/ruby/src/trunk/tool/runruby.rb --archdir=/tmp/ruby/build/trunk --extout=.ext -- /tmp/ruby/src/trunk/spec/mspec/bin/mspec-run -B /tmp/ruby/src/trunk/spec/default.mspec --error-output stderr --debug -fy -o /tmp/rubytest.ltjnc7/5-mspec-multi-4 E, [2024-05-10T23:58:13.951531 #620712] ERROR -- : $ /tmp/ruby/build/trunk/miniruby -I/tmp/ruby/src/trunk/lib /tmp/ruby/src/trunk/tool/runruby.rb --archdir=/tmp/ruby/build/trunk --extout=.ext -- /tmp/ruby/src/trunk/spec/mspec/bin/mspec-run -B /tmp/ruby/src/trunk/spec/default.mspec --error-output stderr --debug -fy -o /tmp/rubytest.ltjnc7/6-mspec-multi-5 E, [2024-05-10T23:58:13.951645 #620712] ERROR -- : $ /tmp/ruby/build/trunk/miniruby -I/tmp/ruby/src/trunk/lib /tmp/ruby/src/trunk/tool/runruby.rb --archdir=/tmp/ruby/build/trunk --extout=.ext -- /tmp/ruby/src/trunk/spec/mspec/bin/mspec-run -B /tmp/ruby/src/trunk/spec/default.mspec --error-output stderr --debug -fy -o /tmp/rubytest.ltjnc7/7-mspec-multi-6 E, [2024-05-10T23:58:13.951910 #620712] ERROR -- : $ /tmp/ruby/build/trunk/miniruby -I/tmp/ruby/src/trunk/lib /tmp/ruby/src/trunk/tool/runruby.rb --archdir=/tmp/ruby/build/trunk --extout=.ext -- /tmp/ruby/src/trunk/spec/mspec/bin/mspec-run -B /tmp/ruby/src/trunk/spec/default.mspec --error-output stderr --debug -fy -o /tmp/rubytest.ltjnc7/8-mspec-multi-7 E, [2024-05-10T23:58:13.952197 #620712] ERROR -- : $ /tmp/ruby/build/trunk/miniruby -I/tmp/ruby/src/trunk/lib /tmp/ruby/src/trunk/tool/runruby.rb --archdir=/tmp/ruby/build/trunk --extout=.ext -- /tmp/ruby/src/trunk/spec/mspec/bin/mspec-run -B /tmp/ruby/src/trunk/spec/default.mspec --error-output stderr --debug -fy -o /tmp/rubytest.ltjnc7/9-mspec-multi-8 E, [2024-05-10T23:58:13.952630 #620712] ERROR -- : $ /tmp/ruby/build/trunk/miniruby -I/tmp/ruby/src/trunk/lib /tmp/ruby/src/trunk/tool/runruby.rb --archdir=/tmp/ruby/build/trunk --extout=.ext -- /tmp/ruby/src/trunk/spec/mspec/bin/mspec-run -B /tmp/ruby/src/trunk/spec/default.mspec --error-output stderr --debug -fy -o /tmp/rubytest.ltjnc7/10-mspec-multi-9 E, [2024-05-10T23:58:13.952907 #620712] ERROR -- : $ /tmp/ruby/build/trunk/miniruby -I/tmp/ruby/src/trunk/lib /tmp/ruby/src/trunk/tool/runruby.rb --archdir=/tmp/ruby/build/trunk --extout=.ext -- /tmp/ruby/src/trunk/spec/mspec/bin/mspec-run -B /tmp/ruby/src/trunk/spec/default.mspec --error-output stderr --debug -fy -o /tmp/rubytest.ltjnc7/11-mspec-multi-10 E, [2024-05-10T23:58:13.953195 #620712] ERROR -- : $ /tmp/ruby/build/trunk/miniruby -I/tmp/ruby/src/trunk/lib /tmp/ruby/src/trunk/tool/runruby.rb --archdir=/tmp/ruby/build/trunk --extout=.ext -- /tmp/ruby/src/trunk/spec/mspec/bin/mspec-run -B /tmp/ruby/src/trunk/spec/default.mspec --error-output stderr --debug -fy -o /tmp/rubytest.ltjnc7/12-mspec-multi-11 E, [2024-05-10T23:58:13.953498 #620712] ERROR -- : $ /tmp/ruby/build/trunk/miniruby -I/tmp/ruby/src/trunk/lib /tmp/ruby/src/trunk/tool/runruby.rb --archdir=/tmp/ruby/build/trunk --extout=.ext -- /tmp/ruby/src/trunk/spec/mspec/bin/mspec-run -B /tmp/ruby/src/trunk/spec/default.mspec --error-output stderr --debug -fy -o /tmp/rubytest.ltjnc7/13-mspec-multi-12 E, [2024-05-10T23:58:13.953722 #620712] ERROR -- : $ /tmp/ruby/build/trunk/miniruby -I/tmp/ruby/src/trunk/lib /tmp/ruby/src/trunk/tool/runruby.rb --archdir=/tmp/ruby/build/trunk --extout=.ext -- /tmp/ruby/src/trunk/spec/mspec/bin/mspec-run -B /tmp/ruby/src/trunk/spec/default.mspec --error-output stderr --debug -fy -o /tmp/rubytest.ltjnc7/14-mspec-multi-13 E, [2024-05-10T23:58:13.953954 #620712] ERROR -- : $ /tmp/ruby/build/trunk/miniruby -I/tmp/ruby/src/trunk/lib /tmp/ruby/src/trunk/tool/runruby.rb --archdir=/tmp/ruby/build/trunk --extout=.ext -- /tmp/ruby/src/trunk/spec/mspec/bin/mspec-run -B /tmp/ruby/src/trunk/spec/default.mspec --error-output stderr --debug -fy -o /tmp/rubytest.ltjnc7/15-mspec-multi-14 E, [2024-05-10T23:58:13.954155 #620712] ERROR -- : $ /tmp/ruby/build/trunk/miniruby -I/tmp/ruby/src/trunk/lib /tmp/ruby/src/trunk/tool/runruby.rb --archdir=/tmp/ruby/build/trunk --extout=.ext -- /tmp/ruby/src/trunk/spec/mspec/bin/mspec-run -B /tmp/ruby/src/trunk/spec/default.mspec --error-output stderr --debug -fy -o /tmp/rubytest.ltjnc7/16-mspec-multi-15 E, [2024-05-10T23:58:13.954342 #620712] ERROR -- : $ /tmp/ruby/build/trunk/miniruby -I/tmp/ruby/src/trunk/lib /tmp/ruby/src/trunk/tool/runruby.rb --archdir=/tmp/ruby/build/trunk --extout=.ext -- /tmp/ruby/src/trunk/spec/mspec/bin/mspec-run -B /tmp/ruby/src/trunk/spec/default.mspec --error-output stderr --debug -fy -o /tmp/rubytest.ltjnc7/17-mspec-multi-16 E, [2024-05-10T23:58:13.954540 #620712] ERROR -- : $ /tmp/ruby/build/trunk/miniruby -I/tmp/ruby/src/trunk/lib /tmp/ruby/src/trunk/tool/runruby.rb --archdir=/tmp/ruby/build/trunk --extout=.ext -- /tmp/ruby/src/trunk/spec/mspec/bin/mspec-run -B /tmp/ruby/src/trunk/spec/default.mspec --error-output stderr --debug -fy -o /tmp/rubytest.ltjnc7/18-mspec-multi-17 E, [2024-05-10T23:58:13.957634 #620712] ERROR -- : $ /tmp/ruby/build/trunk/miniruby -I/tmp/ruby/src/trunk/lib /tmp/ruby/src/trunk/tool/runruby.rb --archdir=/tmp/ruby/build/trunk --extout=.ext -- /tmp/ruby/src/trunk/spec/mspec/bin/mspec-run -B /tmp/ruby/src/trunk/spec/default.mspec --error-output stderr --debug -fy -o /tmp/rubytest.ltjnc7/19-mspec-multi-18 E, [2024-05-10T23:58:13.957909 #620712] ERROR -- : $ /tmp/ruby/build/trunk/miniruby -I/tmp/ruby/src/trunk/lib /tmp/ruby/src/trunk/tool/runruby.rb --archdir=/tmp/ruby/build/trunk --extout=.ext -- /tmp/ruby/src/trunk/spec/mspec/bin/mspec-run -B /tmp/ruby/src/trunk/spec/default.mspec --error-output stderr --debug -fy -o /tmp/rubytest.ltjnc7/20-mspec-multi-19 I, [2024-05-10T23:58:14.123716 #620712] INFO -- : ruby 3.4.0dev (2024-05-10T17:19:42Z master 68b6fe7048) [x86_64-linux] I, [2024-05-10T23:58:14.723241 #620712] INFO -- : 0 ......................................................................... I, [2024-05-10T23:58:15.140598 #620712] INFO -- : 73 ......................................................................... I, [2024-05-10T23:58:15.267216 #620712] INFO -- : 146 ......................................................................... I, [2024-05-10T23:58:15.319750 #620712] INFO -- : 219 ......................................................................... I, [2024-05-10T23:58:15.386429 #620712] INFO -- : 292 ......................................................................... I, [2024-05-10T23:58:15.422294 #620712] INFO -- : 365 ......................................................................... I, [2024-05-10T23:58:15.443751 #620712] INFO -- : 438 ......................................................................... I, [2024-05-10T23:58:15.458934 #620712] INFO -- : 511 ......................................................................... I, [2024-05-10T23:58:15.475288 #620712] INFO -- : 584 ......................................................................... I, [2024-05-10T23:58:15.527396 #620712] INFO -- : 657 ......................................................................... I, [2024-05-10T23:58:15.560142 #620712] INFO -- : 730 ......................................................................... I, [2024-05-10T23:58:15.586922 #620712] INFO -- : 803 ......................................................................... I, [2024-05-10T23:58:15.625115 #620712] INFO -- : 876 ......................................................................... I, [2024-05-10T23:58:15.675878 #620712] INFO -- : 949 ......................................................................... I, [2024-05-10T23:58:15.760801 #620712] INFO -- : 1022 ......................................................................... I, [2024-05-10T23:58:15.929786 #620712] INFO -- : 1095 ......................................................................... I, [2024-05-10T23:58:16.037921 #620712] INFO -- : 1168 ......................................................................... I, [2024-05-10T23:58:16.088068 #620712] INFO -- : 1241 ......................................................................... I, [2024-05-10T23:58:16.134042 #620712] INFO -- : 1314 ......................................................................... I, [2024-05-10T23:58:16.154600 #620712] INFO -- : 1387 ......................................................................... I, [2024-05-10T23:58:16.271519 #620712] INFO -- : 1460 ......................................................................... I, [2024-05-10T23:58:16.714176 #620712] INFO -- : 1533 ......................................................................... I, [2024-05-10T23:58:16.770976 #620712] INFO -- : 1606 ......................................................................... I, [2024-05-10T23:58:16.866746 #620712] INFO -- : 1679 ......................................................................... I, [2024-05-10T23:58:16.983421 #620712] INFO -- : 1752 ......................................................................... I, [2024-05-10T23:58:17.088643 #620712] INFO -- : 1825 ......................................................................... I, [2024-05-10T23:58:17.184623 #620712] INFO -- : 1898 ......................................................................... I, [2024-05-10T23:58:17.262823 #620712] INFO -- : 1971 ......................................................................... I, [2024-05-10T23:58:17.332055 #620712] INFO -- : 2044 ......................................................................... I, [2024-05-10T23:58:17.378495 #620712] INFO -- : 2117 ......................................................................... I, [2024-05-10T23:58:17.397783 #620712] INFO -- : 2190 ......................................................................... I, [2024-05-10T23:58:17.417075 #620712] INFO -- : 2263 ......................................................................... I, [2024-05-10T23:58:17.433193 #620712] INFO -- : 2336 ......................................................................... I, [2024-05-10T23:58:17.468010 #620712] INFO -- : 2409 ......................................................................... I, [2024-05-10T23:58:17.570753 #620712] INFO -- : 2482 ......................................................................... I, [2024-05-10T23:58:17.599640 #620712] INFO -- : 2555 ......................................................................... I, [2024-05-10T23:58:17.700075 #620712] INFO -- : 2628 ......................................................................... I, [2024-05-10T23:58:17.797283 #620712] INFO -- : 2701 ......................................................................... I, [2024-05-10T23:58:17.823283 #620712] INFO -- : 2774 ......................................................................... I, [2024-05-10T23:58:17.869507 #620712] INFO -- : 2847 ......................................................................... I, [2024-05-10T23:58:17.903733 #620712] INFO -- : 2920 ......................................................................... I, [2024-05-10T23:58:17.924693 #620712] INFO -- : 2993 ......................................................................... I, [2024-05-10T23:58:17.946797 #620712] INFO -- : 3066 ......................................................................... I, [2024-05-10T23:58:17.966612 #620712] INFO -- : 3139 ......................................................................... I, [2024-05-10T23:58:17.973383 #620712] INFO -- : 3212 ......................................................................... I, [2024-05-10T23:58:18.001632 #620712] INFO -- : 3285 ......................................................................... I, [2024-05-10T23:58:21.969955 #620712] INFO -- : 3358 ........................................................................ I, [2024-05-10T23:58:21.970023 #620712] INFO -- : I, [2024-05-10T23:58:21.970031 #620712] INFO -- : Finished in 8.018926 seconds I, [2024-05-10T23:58:21.970036 #620712] INFO -- : I, [2024-05-10T23:58:21.970041 #620712] INFO -- : 3429 files, 32611 examples, 187151 expectations, 0 failures, 0 errors, 0 tagged I, [2024-05-10T23:58:21.972229 #620712] INFO -- : $$$[end] "make yes-test-rubyspec MSPECOPT='--error-output stderr --debug -j' TESTS='-j20'" exit with 0.