# Logfile created on 2024-05-10 15:30:13 +0000 by logger.rb/v1.4.3 I, [2024-05-10T15:30:13.881519 #971188] INFO -- : #, @formatter=nil, @logdev=#, @binmode=false, @mon_data=#, @mon_data_owner_object_id=860>>> I, [2024-05-10T15:30:13.881707 #971188] INFO -- : $$$[beg] make update-unicode -j16 I, [2024-05-10T15:30:13.975593 #971188] INFO -- : Downloading Unicode emoji 15.0 files... I, [2024-05-10T15:30:13.975647 #971188] INFO -- : Downloading Unicode emoji 15.0 files... I, [2024-05-10T15:30:13.976322 #971188] INFO -- : Downloading Unicode emoji 15.0 files... I, [2024-05-10T15:30:14.015392 #971188] INFO -- : made symlink emoji/15.0/emoji-sequences.txt to /tmp/ruby/src/trunk/.downloaded-cache/emoji/15.0/emoji-sequences.txt I, [2024-05-10T15:30:14.033460 #971188] INFO -- : downloading emoji/15.0/emoji-sequences.txt ... downloading emoji/15.0/emoji-test.txt ... /tmp/ruby/src/trunk/enc/unicode/data/emoji/15.0/emoji-sequences.txt already exists E, [2024-05-10T15:30:14.477150 #971188] ERROR -- : /tmp/ruby/src/trunk/tool/downloader.rb:302:in `rescue in download': failed to download emoji/15.0/emoji-test.txt (RuntimeError) E, [2024-05-10T15:30:14.477222 #971188] ERROR -- : OpenURI::HTTPError: 403 Forbidden: https://www.unicode.org/Public/emoji/15.0/emoji-test.txt E, [2024-05-10T15:30:14.477235 #971188] ERROR -- : from /tmp/ruby/src/trunk/tool/downloader.rb:201:in `download' E, [2024-05-10T15:30:14.477244 #971188] ERROR -- : from /tmp/ruby/src/trunk/tool/downloader.rb:136:in `download' E, [2024-05-10T15:30:14.477253 #971188] ERROR -- : from /tmp/ruby/src/trunk/tool/downloader.rb:482:in `block in
' E, [2024-05-10T15:30:14.477263 #971188] ERROR -- : from /tmp/ruby/src/trunk/tool/downloader.rb:465:in `each' E, [2024-05-10T15:30:14.477271 #971188] ERROR -- : from /tmp/ruby/src/trunk/tool/downloader.rb:465:in `
' E, [2024-05-10T15:30:14.477278 #971188] ERROR -- : /usr/lib/ruby/3.0.0/open-uri.rb:364:in `open_http': 403 Forbidden (OpenURI::HTTPError) E, [2024-05-10T15:30:14.477285 #971188] ERROR -- : from /usr/lib/ruby/3.0.0/open-uri.rb:741:in `buffer_open' E, [2024-05-10T15:30:14.477294 #971188] ERROR -- : from /usr/lib/ruby/3.0.0/open-uri.rb:212:in `block in open_loop' E, [2024-05-10T15:30:14.477303 #971188] ERROR -- : from /usr/lib/ruby/3.0.0/open-uri.rb:210:in `catch' E, [2024-05-10T15:30:14.477310 #971188] ERROR -- : from /usr/lib/ruby/3.0.0/open-uri.rb:210:in `open_loop' E, [2024-05-10T15:30:14.477317 #971188] ERROR -- : from /usr/lib/ruby/3.0.0/open-uri.rb:151:in `open_uri' E, [2024-05-10T15:30:14.477325 #971188] ERROR -- : from /usr/lib/ruby/3.0.0/open-uri.rb:721:in `open' E, [2024-05-10T15:30:14.477332 #971188] ERROR -- : from /usr/lib/ruby/3.0.0/open-uri.rb:729:in `read' E, [2024-05-10T15:30:14.477339 #971188] ERROR -- : from /tmp/ruby/src/trunk/tool/downloader.rb:247:in `block in download' E, [2024-05-10T15:30:14.477359 #971188] ERROR -- : from /tmp/ruby/src/trunk/tool/downloader.rb:378:in `with_retry' E, [2024-05-10T15:30:14.477367 #971188] ERROR -- : from /tmp/ruby/src/trunk/tool/downloader.rb:246:in `download' E, [2024-05-10T15:30:14.477390 #971188] ERROR -- : from /tmp/ruby/src/trunk/tool/downloader.rb:136:in `download' E, [2024-05-10T15:30:14.477400 #971188] ERROR -- : from /tmp/ruby/src/trunk/tool/downloader.rb:482:in `block in
' E, [2024-05-10T15:30:14.477408 #971188] ERROR -- : from /tmp/ruby/src/trunk/tool/downloader.rb:465:in `each' E, [2024-05-10T15:30:14.477416 #971188] ERROR -- : from /tmp/ruby/src/trunk/tool/downloader.rb:465:in `
' E, [2024-05-10T15:30:14.479930 #971188] ERROR -- : make: *** [uncommon.mk:1765: /tmp/ruby/src/trunk/enc/unicode/data/emoji/15.0/emoji-zwj-sequences.txt] Error 1 E, [2024-05-10T15:30:14.479954 #971188] ERROR -- : make: *** Waiting for unfinished jobs.... E, [2024-05-10T15:30:14.488760 #971188] ERROR -- : /tmp/ruby/src/trunk/tool/downloader.rb:302:in `rescue in download': failed to download emoji/15.0/emoji-test.txt (RuntimeError) E, [2024-05-10T15:30:14.488868 #971188] ERROR -- : OpenURI::HTTPError: 403 Forbidden: https://www.unicode.org/Public/emoji/15.0/emoji-test.txt E, [2024-05-10T15:30:14.488902 #971188] ERROR -- : from /tmp/ruby/src/trunk/tool/downloader.rb:201:in `download' E, [2024-05-10T15:30:14.488924 #971188] ERROR -- : from /tmp/ruby/src/trunk/tool/downloader.rb:136:in `download' E, [2024-05-10T15:30:14.488945 #971188] ERROR -- : from /tmp/ruby/src/trunk/tool/downloader.rb:482:in `block in
' E, [2024-05-10T15:30:14.488964 #971188] ERROR -- : from /tmp/ruby/src/trunk/tool/downloader.rb:465:in `each' E, [2024-05-10T15:30:14.488983 #971188] ERROR -- : from /tmp/ruby/src/trunk/tool/downloader.rb:465:in `
' E, [2024-05-10T15:30:14.489002 #971188] ERROR -- : /usr/lib/ruby/3.0.0/open-uri.rb:364:in `open_http': 403 Forbidden (OpenURI::HTTPError) E, [2024-05-10T15:30:14.489023 #971188] ERROR -- : from /usr/lib/ruby/3.0.0/open-uri.rb:741:in `buffer_open' E, [2024-05-10T15:30:14.489047 #971188] ERROR -- : from /usr/lib/ruby/3.0.0/open-uri.rb:212:in `block in open_loop' E, [2024-05-10T15:30:14.489066 #971188] ERROR -- : from /usr/lib/ruby/3.0.0/open-uri.rb:210:in `catch' E, [2024-05-10T15:30:14.489085 #971188] ERROR -- : from /usr/lib/ruby/3.0.0/open-uri.rb:210:in `open_loop' E, [2024-05-10T15:30:14.489104 #971188] ERROR -- : from /usr/lib/ruby/3.0.0/open-uri.rb:151:in `open_uri' E, [2024-05-10T15:30:14.489126 #971188] ERROR -- : from /usr/lib/ruby/3.0.0/open-uri.rb:721:in `open' E, [2024-05-10T15:30:14.489146 #971188] ERROR -- : from /usr/lib/ruby/3.0.0/open-uri.rb:729:in `read' E, [2024-05-10T15:30:14.489165 #971188] ERROR -- : from /tmp/ruby/src/trunk/tool/downloader.rb:247:in `block in download' E, [2024-05-10T15:30:14.489184 #971188] ERROR -- : from /tmp/ruby/src/trunk/tool/downloader.rb:378:in `with_retry' E, [2024-05-10T15:30:14.489207 #971188] ERROR -- : from /tmp/ruby/src/trunk/tool/downloader.rb:246:in `download' E, [2024-05-10T15:30:14.489226 #971188] ERROR -- : from /tmp/ruby/src/trunk/tool/downloader.rb:136:in `download' E, [2024-05-10T15:30:14.489246 #971188] ERROR -- : from /tmp/ruby/src/trunk/tool/downloader.rb:482:in `block in
' E, [2024-05-10T15:30:14.489266 #971188] ERROR -- : from /tmp/ruby/src/trunk/tool/downloader.rb:465:in `each' E, [2024-05-10T15:30:14.489285 #971188] ERROR -- : from /tmp/ruby/src/trunk/tool/downloader.rb:465:in `
' E, [2024-05-10T15:30:14.493222 #971188] ERROR -- : make: *** [uncommon.mk:1765: /tmp/ruby/src/trunk/enc/unicode/data/emoji/15.0/emoji-sequences.txt] Error 1 E, [2024-05-10T15:30:14.493331 #971188] ERROR -- : make: *** Deleting file '/tmp/ruby/src/trunk/enc/unicode/data/emoji/15.0/emoji-sequences.txt' E, [2024-05-10T15:30:14.939420 #971188] ERROR -- : /tmp/ruby/src/trunk/tool/downloader.rb:302:in `rescue in download': failed to download emoji/15.0/emoji-sequences.txt (RuntimeError) E, [2024-05-10T15:30:14.939548 #971188] ERROR -- : EOFError: end of file reached: https://www.unicode.org/Public/emoji/15.0/emoji-sequences.txt E, [2024-05-10T15:30:14.939599 #971188] ERROR -- : from /tmp/ruby/src/trunk/tool/downloader.rb:201:in `download' E, [2024-05-10T15:30:14.939623 #971188] ERROR -- : from /tmp/ruby/src/trunk/tool/downloader.rb:136:in `download' E, [2024-05-10T15:30:14.939643 #971188] ERROR -- : from /tmp/ruby/src/trunk/tool/downloader.rb:482:in `block in
' E, [2024-05-10T15:30:14.939662 #971188] ERROR -- : from /tmp/ruby/src/trunk/tool/downloader.rb:465:in `each' E, [2024-05-10T15:30:14.939682 #971188] ERROR -- : from /tmp/ruby/src/trunk/tool/downloader.rb:465:in `
' E, [2024-05-10T15:30:14.939701 #971188] ERROR -- : /usr/lib/ruby/3.0.0/net/protocol.rb:227:in `rbuf_fill': end of file reached (EOFError) E, [2024-05-10T15:30:14.939729 #971188] ERROR -- : from /usr/lib/ruby/3.0.0/net/protocol.rb:193:in `readuntil' E, [2024-05-10T15:30:14.939749 #971188] ERROR -- : from /usr/lib/ruby/3.0.0/net/protocol.rb:203:in `readline' E, [2024-05-10T15:30:14.939768 #971188] ERROR -- : from /usr/lib/ruby/3.0.0/net/http/response.rb:42:in `read_status_line' E, [2024-05-10T15:30:14.939788 #971188] ERROR -- : from /usr/lib/ruby/3.0.0/net/http/response.rb:31:in `read_new' E, [2024-05-10T15:30:14.939807 #971188] ERROR -- : from /usr/lib/ruby/3.0.0/net/http.rb:1557:in `block in transport_request' E, [2024-05-10T15:30:14.940073 #971188] ERROR -- : from /usr/lib/ruby/3.0.0/net/http.rb:1548:in `catch' E, [2024-05-10T15:30:14.940100 #971188] ERROR -- : from /usr/lib/ruby/3.0.0/net/http.rb:1548:in `transport_request' E, [2024-05-10T15:30:14.940120 #971188] ERROR -- : from /usr/lib/ruby/3.0.0/net/http.rb:1521:in `request' E, [2024-05-10T15:30:14.940139 #971188] ERROR -- : from /usr/lib/ruby/3.0.0/open-uri.rb:329:in `block in open_http' E, [2024-05-10T15:30:14.940158 #971188] ERROR -- : from /usr/lib/ruby/3.0.0/net/http.rb:960:in `start' E, [2024-05-10T15:30:14.940177 #971188] ERROR -- : from /usr/lib/ruby/3.0.0/open-uri.rb:323:in `open_http' E, [2024-05-10T15:30:14.940196 #971188] ERROR -- : from /usr/lib/ruby/3.0.0/open-uri.rb:741:in `buffer_open' E, [2024-05-10T15:30:14.940221 #971188] ERROR -- : from /usr/lib/ruby/3.0.0/open-uri.rb:212:in `block in open_loop' E, [2024-05-10T15:30:14.940240 #971188] ERROR -- : from /usr/lib/ruby/3.0.0/open-uri.rb:210:in `catch' E, [2024-05-10T15:30:14.940258 #971188] ERROR -- : from /usr/lib/ruby/3.0.0/open-uri.rb:210:in `open_loop' E, [2024-05-10T15:30:14.940278 #971188] ERROR -- : from /usr/lib/ruby/3.0.0/open-uri.rb:151:in `open_uri' E, [2024-05-10T15:30:14.940298 #971188] ERROR -- : from /usr/lib/ruby/3.0.0/open-uri.rb:721:in `open' E, [2024-05-10T15:30:14.940317 #971188] ERROR -- : from /usr/lib/ruby/3.0.0/open-uri.rb:729:in `read' E, [2024-05-10T15:30:14.940337 #971188] ERROR -- : from /tmp/ruby/src/trunk/tool/downloader.rb:247:in `block in download' E, [2024-05-10T15:30:14.940356 #971188] ERROR -- : from /tmp/ruby/src/trunk/tool/downloader.rb:378:in `with_retry' E, [2024-05-10T15:30:14.940379 #971188] ERROR -- : from /tmp/ruby/src/trunk/tool/downloader.rb:246:in `download' E, [2024-05-10T15:30:14.940398 #971188] ERROR -- : from /tmp/ruby/src/trunk/tool/downloader.rb:136:in `download' E, [2024-05-10T15:30:14.940417 #971188] ERROR -- : from /tmp/ruby/src/trunk/tool/downloader.rb:482:in `block in
' E, [2024-05-10T15:30:14.940436 #971188] ERROR -- : from /tmp/ruby/src/trunk/tool/downloader.rb:465:in `each' E, [2024-05-10T15:30:14.940455 #971188] ERROR -- : from /tmp/ruby/src/trunk/tool/downloader.rb:465:in `
' E, [2024-05-10T15:30:14.944844 #971188] ERROR -- : make: *** [uncommon.mk:1765: /tmp/ruby/src/trunk/enc/unicode/data/emoji/15.0/emoji-test.txt] Error 1 I, [2024-05-10T15:30:14.945098 #971188] INFO -- : downloading emoji/15.0/emoji-test.txt ... I, [2024-05-10T15:30:14.945573 #971188] INFO -- : $$$[end] "make update-unicode -j16" exit with 512. I, [2024-05-10T15:30:14.945653 #971188] INFO -- : $$$[beg] make update-download -j16 I, [2024-05-10T15:30:15.155717 #971188] INFO -- : tool/config.guess already exists I, [2024-05-10T15:30:15.155825 #971188] INFO -- : tool/config.sub already exists I, [2024-05-10T15:30:15.158366 #971188] INFO -- : Update minitest to ea9caafc0754b1d6236a490d59e624b53209734a I, [2024-05-10T15:30:15.158600 #971188] INFO -- : Update power_assert to 84e85124c5014a139af39161d484156cfe87a9ed I, [2024-05-10T15:30:15.159042 #971188] INFO -- : Update rbs to ba7872795d5de04adb8ff500c0e6afdc81a041dd I, [2024-05-10T15:30:15.160073 #971188] INFO -- : Update typeprof to b19a6416da3a05d57fadd6ffdadb382b6d236ca5 I, [2024-05-10T15:30:15.160594 #971188] INFO -- : echo ea9caafc0754b1d6236a490d59e624b53209734a | /bin/sh /tmp/ruby/src/trunk/tool/ifchange /tmp/ruby/src/trunk/.bundle/.timestamp/minitest.revision - I, [2024-05-10T15:30:15.160740 #971188] INFO -- : echo 84e85124c5014a139af39161d484156cfe87a9ed | /bin/sh /tmp/ruby/src/trunk/tool/ifchange /tmp/ruby/src/trunk/.bundle/.timestamp/power_assert.revision - I, [2024-05-10T15:30:15.160865 #971188] INFO -- : echo ba7872795d5de04adb8ff500c0e6afdc81a041dd | /bin/sh /tmp/ruby/src/trunk/tool/ifchange /tmp/ruby/src/trunk/.bundle/.timestamp/rbs.revision - I, [2024-05-10T15:30:15.161193 #971188] INFO -- : echo b19a6416da3a05d57fadd6ffdadb382b6d236ca5 | /bin/sh /tmp/ruby/src/trunk/tool/ifchange /tmp/ruby/src/trunk/.bundle/.timestamp/typeprof.revision - I, [2024-05-10T15:30:15.162728 #971188] INFO -- : /tmp/ruby/src/trunk/.bundle/.timestamp/minitest.revision unchanged I, [2024-05-10T15:30:15.162852 #971188] INFO -- : /tmp/ruby/src/trunk/.bundle/.timestamp/power_assert.revision unchanged I, [2024-05-10T15:30:15.163086 #971188] INFO -- : /tmp/ruby/src/trunk/.bundle/.timestamp/typeprof.revision unchanged I, [2024-05-10T15:30:15.163171 #971188] INFO -- : /tmp/ruby/src/trunk/.bundle/.timestamp/rbs.revision unchanged I, [2024-05-10T15:30:15.164075 #971188] INFO -- : Building power_assert@84e85124c5014a139af39161d484156cfe87a9ed to /tmp/ruby/src/trunk/gems/power_assert-2.0.3.gem I, [2024-05-10T15:30:15.240083 #971188] INFO -- : Successfully built RubyGem I, [2024-05-10T15:30:15.240126 #971188] INFO -- : Name: power_assert I, [2024-05-10T15:30:15.240141 #971188] INFO -- : Version: 2.0.4dev I, [2024-05-10T15:30:15.240150 #971188] INFO -- : File: power_assert-2.0.4dev.gem I, [2024-05-10T15:30:15.313436 #971188] INFO -- : $$$[end] "make update-download -j16" exit with 0. I, [2024-05-10T15:30:15.313495 #971188] INFO -- : $$$[beg] make update-rubyspec -j16 I, [2024-05-10T15:30:15.369837 #971188] INFO -- : make: Nothing to be done for 'update-rubyspec'. I, [2024-05-10T15:30:15.369987 #971188] INFO -- : $$$[end] "make update-rubyspec -j16" exit with 0. I, [2024-05-10T15:30:15.370015 #971188] INFO -- : $$$[beg] make update-src -j16 I, [2024-05-10T15:30:16.021762 #971188] INFO -- : Already up to date. I, [2024-05-10T15:30:16.031358 #971188] INFO -- : Latest commit hash = 34e0b5b2d4 I, [2024-05-10T15:30:16.032389 #971188] INFO -- : $$$[end] "make update-src -j16" exit with 0. I, [2024-05-10T15:30:16.032416 #971188] INFO -- : $$$[beg] make after-update -j16 I, [2024-05-10T15:30:16.147829 #971188] INFO -- : /tmp/ruby/src/trunk/revision.h updated I, [2024-05-10T15:30:16.149207 #971188] INFO -- : generating x86_64-linux-fake.rb I, [2024-05-10T15:30:16.196490 #971188] INFO -- : x86_64-linux-fake.rb updated I, [2024-05-10T15:30:16.198487 #971188] INFO -- : generating enc.mk I, [2024-05-10T15:30:16.316350 #971188] INFO -- : making srcs under enc I, [2024-05-10T15:30:16.345856 #971188] INFO -- : make[1]: Entering directory '/tmp/ruby/build/trunk' I, [2024-05-10T15:30:16.345889 #971188] INFO -- : make[1]: Nothing to be done for 'srcs'. I, [2024-05-10T15:30:16.345900 #971188] INFO -- : make[1]: Leaving directory '/tmp/ruby/build/trunk' I, [2024-05-10T15:30:16.424401 #971188] INFO -- : Update minitest to ea9caafc0754b1d6236a490d59e624b53209734a I, [2024-05-10T15:30:16.424675 #971188] INFO -- : Update power_assert to 84e85124c5014a139af39161d484156cfe87a9ed I, [2024-05-10T15:30:16.425739 #971188] INFO -- : Update rbs to ba7872795d5de04adb8ff500c0e6afdc81a041dd I, [2024-05-10T15:30:16.425882 #971188] INFO -- : Update typeprof to b19a6416da3a05d57fadd6ffdadb382b6d236ca5 I, [2024-05-10T15:30:16.426355 #971188] INFO -- : echo ea9caafc0754b1d6236a490d59e624b53209734a | /bin/sh /tmp/ruby/src/trunk/tool/ifchange /tmp/ruby/src/trunk/.bundle/.timestamp/minitest.revision - I, [2024-05-10T15:30:16.426499 #971188] INFO -- : echo 84e85124c5014a139af39161d484156cfe87a9ed | /bin/sh /tmp/ruby/src/trunk/tool/ifchange /tmp/ruby/src/trunk/.bundle/.timestamp/power_assert.revision - I, [2024-05-10T15:30:16.427678 #971188] INFO -- : echo ba7872795d5de04adb8ff500c0e6afdc81a041dd | /bin/sh /tmp/ruby/src/trunk/tool/ifchange /tmp/ruby/src/trunk/.bundle/.timestamp/rbs.revision - I, [2024-05-10T15:30:16.427965 #971188] INFO -- : echo b19a6416da3a05d57fadd6ffdadb382b6d236ca5 | /bin/sh /tmp/ruby/src/trunk/tool/ifchange /tmp/ruby/src/trunk/.bundle/.timestamp/typeprof.revision - I, [2024-05-10T15:30:16.428627 #971188] INFO -- : /tmp/ruby/src/trunk/.bundle/.timestamp/power_assert.revision unchanged I, [2024-05-10T15:30:16.428668 #971188] INFO -- : /tmp/ruby/src/trunk/.bundle/.timestamp/minitest.revision unchanged I, [2024-05-10T15:30:16.429776 #971188] INFO -- : /tmp/ruby/src/trunk/.bundle/.timestamp/rbs.revision unchanged I, [2024-05-10T15:30:16.429883 #971188] INFO -- : Building power_assert@84e85124c5014a139af39161d484156cfe87a9ed to /tmp/ruby/src/trunk/gems/power_assert-2.0.3.gem I, [2024-05-10T15:30:16.429981 #971188] INFO -- : /tmp/ruby/src/trunk/.bundle/.timestamp/typeprof.revision unchanged I, [2024-05-10T15:30:16.499411 #971188] INFO -- : Successfully built RubyGem I, [2024-05-10T15:30:16.499454 #971188] INFO -- : Name: power_assert I, [2024-05-10T15:30:16.499466 #971188] INFO -- : Version: 2.0.4dev I, [2024-05-10T15:30:16.499474 #971188] INFO -- : File: power_assert-2.0.4dev.gem I, [2024-05-10T15:30:16.501353 #971188] INFO -- : Extracting bundle gem power_assert-2.0.3... I, [2024-05-10T15:30:16.560878 #971188] INFO -- : Try with hash version of bundled gems instead of gems/power_assert-2.0.3.gem. We don't use this gem with release version of Ruby. I, [2024-05-10T15:30:16.566008 #971188] INFO -- : Unpacked gems/power_assert-2.0.4dev.gem I, [2024-05-10T15:30:16.567684 #971188] INFO -- : $$$[end] "make after-update -j16" exit with 0. I, [2024-05-10T15:30:16.567815 #971188] INFO -- : $$$[beg] make miniruby -j16 I, [2024-05-10T15:30:16.660100 #971188] INFO -- : BASERUBY = /usr/bin/ruby --disable=gems I, [2024-05-10T15:30:16.660154 #971188] INFO -- : CC = gcc I, [2024-05-10T15:30:16.660165 #971188] INFO -- : LD = ld I, [2024-05-10T15:30:16.660175 #971188] INFO -- : LDSHARED = gcc -shared I, [2024-05-10T15:30:16.660183 #971188] INFO -- : CFLAGS = -O3 -fno-fast-math -ggdb3 -Wall -Wextra -Wdeprecated-declarations -Wdiv-by-zero -Wduplicated-cond -Wimplicit-function-declaration -Wimplicit-int -Wpointer-arith -Wwrite-strings -Wold-style-definition -Wimplicit-fallthrough=0 -Wmissing-noreturn -Wno-cast-function-type -Wno-constant-logical-operand -Wno-long-long -Wno-missing-field-initializers -Wno-overlength-strings -Wno-packed-bitfield-compat -Wno-parentheses-equality -Wno-self-assign -Wno-tautological-compare -Wno-unused-parameter -Wno-unused-value -Wsuggest-attribute=format -Wsuggest-attribute=noreturn -Wunused-variable -Wmisleading-indentation -Wundef -fPIC I, [2024-05-10T15:30:16.660191 #971188] INFO -- : XCFLAGS = -U_FORTIFY_SOURCE -D_FORTIFY_SOURCE=2 -fstack-protector-strong -fno-strict-overflow -fvisibility=hidden -fexcess-precision=standard -DRUBY_EXPORT -I. -I.ext/include/x86_64-linux -I/tmp/ruby/src/trunk/include -I/tmp/ruby/src/trunk -I/tmp/ruby/src/trunk/prism -I/tmp/ruby/src/trunk/enc/unicode/15.0.0 I, [2024-05-10T15:30:16.660199 #971188] INFO -- : CPPFLAGS = I, [2024-05-10T15:30:16.660207 #971188] INFO -- : DLDFLAGS = -Wl,--compress-debug-sections=zlib -Wl,-soname,libruby.so.3.4 -fstack-protector-strong I, [2024-05-10T15:30:16.660215 #971188] INFO -- : SOLIBS = -lz -lrt -lrt -lgmp -ldl -lcrypt -lm -lpthread I, [2024-05-10T15:30:16.660230 #971188] INFO -- : LANG = C.UTF-8 I, [2024-05-10T15:30:16.660238 #971188] INFO -- : LC_ALL = I, [2024-05-10T15:30:16.660245 #971188] INFO -- : LC_CTYPE = I, [2024-05-10T15:30:16.660253 #971188] INFO -- : MFLAGS = -j16 --jobserver-auth=4,5 I, [2024-05-10T15:30:16.660260 #971188] INFO -- : RUSTC = rustc I, [2024-05-10T15:30:16.660267 #971188] INFO -- : YJIT_RUSTC_ARGS = --crate-name=yjit --crate-type=staticlib --edition=2021 -g -C lto=thin -C opt-level=3 -C overflow-checks=on '--out-dir=/tmp/ruby/build/trunk/yjit/target/release/' /tmp/ruby/src/trunk/yjit/src/lib.rs I, [2024-05-10T15:30:16.661981 #971188] INFO -- : gcc (Ubuntu 11.4.0-1ubuntu1~22.04) 11.4.0 I, [2024-05-10T15:30:16.662008 #971188] INFO -- : Copyright (C) 2021 Free Software Foundation, Inc. I, [2024-05-10T15:30:16.662019 #971188] INFO -- : This is free software; see the source for copying conditions. There is NO I, [2024-05-10T15:30:16.662027 #971188] INFO -- : warranty; not even for MERCHANTABILITY or FITNESS FOR A PARTICULAR PURPOSE. I, [2024-05-10T15:30:16.662035 #971188] INFO -- : I, [2024-05-10T15:30:16.735965 #971188] INFO -- : compiling /tmp/ruby/src/trunk/version.c I, [2024-05-10T15:30:16.886467 #971188] INFO -- : linking miniruby I, [2024-05-10T15:30:17.519088 #971188] INFO -- : $$$[end] "make miniruby -j16" exit with 0. I, [2024-05-10T15:30:17.519217 #971188] INFO -- : $$$[beg] make ruby -j16 I, [2024-05-10T15:30:17.647314 #971188] INFO -- : BASERUBY = /usr/bin/ruby --disable=gems I, [2024-05-10T15:30:17.647368 #971188] INFO -- : CC = gcc I, [2024-05-10T15:30:17.647379 #971188] INFO -- : LD = ld I, [2024-05-10T15:30:17.647392 #971188] INFO -- : LDSHARED = gcc -shared I, [2024-05-10T15:30:17.647400 #971188] INFO -- : CFLAGS = -O3 -fno-fast-math -ggdb3 -Wall -Wextra -Wdeprecated-declarations -Wdiv-by-zero -Wduplicated-cond -Wimplicit-function-declaration -Wimplicit-int -Wpointer-arith -Wwrite-strings -Wold-style-definition -Wimplicit-fallthrough=0 -Wmissing-noreturn -Wno-cast-function-type -Wno-constant-logical-operand -Wno-long-long -Wno-missing-field-initializers -Wno-overlength-strings -Wno-packed-bitfield-compat -Wno-parentheses-equality -Wno-self-assign -Wno-tautological-compare -Wno-unused-parameter -Wno-unused-value -Wsuggest-attribute=format -Wsuggest-attribute=noreturn -Wunused-variable -Wmisleading-indentation -Wundef -fPIC I, [2024-05-10T15:30:17.647409 #971188] INFO -- : XCFLAGS = -U_FORTIFY_SOURCE -D_FORTIFY_SOURCE=2 -fstack-protector-strong -fno-strict-overflow -fvisibility=hidden -fexcess-precision=standard -DRUBY_EXPORT -I. -I.ext/include/x86_64-linux -I/tmp/ruby/src/trunk/include -I/tmp/ruby/src/trunk -I/tmp/ruby/src/trunk/prism -I/tmp/ruby/src/trunk/enc/unicode/15.0.0 I, [2024-05-10T15:30:17.647418 #971188] INFO -- : CPPFLAGS = I, [2024-05-10T15:30:17.647426 #971188] INFO -- : DLDFLAGS = -Wl,--compress-debug-sections=zlib -Wl,-soname,libruby.so.3.4 -fstack-protector-strong I, [2024-05-10T15:30:17.647434 #971188] INFO -- : SOLIBS = -lz -lrt -lrt -lgmp -ldl -lcrypt -lm -lpthread I, [2024-05-10T15:30:17.647441 #971188] INFO -- : LANG = C.UTF-8 I, [2024-05-10T15:30:17.647448 #971188] INFO -- : LC_ALL = I, [2024-05-10T15:30:17.647455 #971188] INFO -- : LC_CTYPE = I, [2024-05-10T15:30:17.647463 #971188] INFO -- : MFLAGS = -j16 --jobserver-auth=4,5 I, [2024-05-10T15:30:17.647470 #971188] INFO -- : RUSTC = rustc I, [2024-05-10T15:30:17.647478 #971188] INFO -- : YJIT_RUSTC_ARGS = --crate-name=yjit --crate-type=staticlib --edition=2021 -g -C lto=thin -C opt-level=3 -C overflow-checks=on '--out-dir=/tmp/ruby/build/trunk/yjit/target/release/' /tmp/ruby/src/trunk/yjit/src/lib.rs I, [2024-05-10T15:30:17.648602 #971188] INFO -- : gcc (Ubuntu 11.4.0-1ubuntu1~22.04) 11.4.0 I, [2024-05-10T15:30:17.648620 #971188] INFO -- : Copyright (C) 2021 Free Software Foundation, Inc. I, [2024-05-10T15:30:17.648630 #971188] INFO -- : This is free software; see the source for copying conditions. There is NO I, [2024-05-10T15:30:17.648638 #971188] INFO -- : warranty; not even for MERCHANTABILITY or FITNESS FOR A PARTICULAR PURPOSE. I, [2024-05-10T15:30:17.648651 #971188] INFO -- : I, [2024-05-10T15:30:17.787531 #971188] INFO -- : builtin_binary.inc updated I, [2024-05-10T15:30:17.799348 #971188] INFO -- : 6cc993e11a665fcdee4f7a2dfd66564d1ddac647c2f51274e8b33c178429a884 builtin_binary.inc I, [2024-05-10T15:30:17.800934 #971188] INFO -- : compiling /tmp/ruby/src/trunk/builtin.c I, [2024-05-10T15:30:18.073845 #971188] INFO -- : linking static-library libruby-static.a I, [2024-05-10T15:30:18.450306 #971188] INFO -- : linking shared-library libruby.so.3.4.0 I, [2024-05-10T15:30:20.338371 #971188] INFO -- : linking ruby I, [2024-05-10T15:30:20.359156 #971188] INFO -- : $$$[end] "make ruby -j16" exit with 0. I, [2024-05-10T15:30:20.359280 #971188] INFO -- : $$$[beg] make all -j16 I, [2024-05-10T15:30:20.452847 #971188] INFO -- : BASERUBY = /usr/bin/ruby --disable=gems I, [2024-05-10T15:30:20.452899 #971188] INFO -- : CC = gcc I, [2024-05-10T15:30:20.452911 #971188] INFO -- : LD = ld I, [2024-05-10T15:30:20.452919 #971188] INFO -- : LDSHARED = gcc -shared I, [2024-05-10T15:30:20.452929 #971188] INFO -- : CFLAGS = -O3 -fno-fast-math -ggdb3 -Wall -Wextra -Wdeprecated-declarations -Wdiv-by-zero -Wduplicated-cond -Wimplicit-function-declaration -Wimplicit-int -Wpointer-arith -Wwrite-strings -Wold-style-definition -Wimplicit-fallthrough=0 -Wmissing-noreturn -Wno-cast-function-type -Wno-constant-logical-operand -Wno-long-long -Wno-missing-field-initializers -Wno-overlength-strings -Wno-packed-bitfield-compat -Wno-parentheses-equality -Wno-self-assign -Wno-tautological-compare -Wno-unused-parameter -Wno-unused-value -Wsuggest-attribute=format -Wsuggest-attribute=noreturn -Wunused-variable -Wmisleading-indentation -Wundef -fPIC I, [2024-05-10T15:30:20.452938 #971188] INFO -- : XCFLAGS = -U_FORTIFY_SOURCE -D_FORTIFY_SOURCE=2 -fstack-protector-strong -fno-strict-overflow -fvisibility=hidden -fexcess-precision=standard -DRUBY_EXPORT -I. -I.ext/include/x86_64-linux -I/tmp/ruby/src/trunk/include -I/tmp/ruby/src/trunk -I/tmp/ruby/src/trunk/prism -I/tmp/ruby/src/trunk/enc/unicode/15.0.0 I, [2024-05-10T15:30:20.452946 #971188] INFO -- : CPPFLAGS = I, [2024-05-10T15:30:20.452954 #971188] INFO -- : DLDFLAGS = -Wl,--compress-debug-sections=zlib -Wl,-soname,libruby.so.3.4 -fstack-protector-strong I, [2024-05-10T15:30:20.452962 #971188] INFO -- : SOLIBS = -lz -lrt -lrt -lgmp -ldl -lcrypt -lm -lpthread I, [2024-05-10T15:30:20.452969 #971188] INFO -- : LANG = C.UTF-8 I, [2024-05-10T15:30:20.452977 #971188] INFO -- : LC_ALL = I, [2024-05-10T15:30:20.452984 #971188] INFO -- : LC_CTYPE = I, [2024-05-10T15:30:20.452991 #971188] INFO -- : MFLAGS = -j16 --jobserver-auth=4,5 I, [2024-05-10T15:30:20.452998 #971188] INFO -- : RUSTC = rustc I, [2024-05-10T15:30:20.453007 #971188] INFO -- : YJIT_RUSTC_ARGS = --crate-name=yjit --crate-type=staticlib --edition=2021 -g -C lto=thin -C opt-level=3 -C overflow-checks=on '--out-dir=/tmp/ruby/build/trunk/yjit/target/release/' /tmp/ruby/src/trunk/yjit/src/lib.rs I, [2024-05-10T15:30:20.454200 #971188] INFO -- : gcc (Ubuntu 11.4.0-1ubuntu1~22.04) 11.4.0 I, [2024-05-10T15:30:20.454223 #971188] INFO -- : Copyright (C) 2021 Free Software Foundation, Inc. I, [2024-05-10T15:30:20.454237 #971188] INFO -- : This is free software; see the source for copying conditions. There is NO I, [2024-05-10T15:30:20.454252 #971188] INFO -- : warranty; not even for MERCHANTABILITY or FITNESS FOR A PARTICULAR PURPOSE. I, [2024-05-10T15:30:20.454261 #971188] INFO -- : I, [2024-05-10T15:30:20.495938 #971188] INFO -- : generating enc.mk I, [2024-05-10T15:30:20.497793 #971188] INFO -- : building spec/ruby/optional/capi/ext/array_spec.so I, [2024-05-10T15:30:20.498083 #971188] INFO -- : building spec/ruby/optional/capi/ext/basic_object_spec.so I, [2024-05-10T15:30:20.498485 #971188] INFO -- : building spec/ruby/optional/capi/ext/bignum_spec.so I, [2024-05-10T15:30:20.498910 #971188] INFO -- : building spec/ruby/optional/capi/ext/binding_spec.so I, [2024-05-10T15:30:20.499698 #971188] INFO -- : building spec/ruby/optional/capi/ext/boolean_spec.so I, [2024-05-10T15:30:20.500128 #971188] INFO -- : building spec/ruby/optional/capi/ext/class_id_under_autoload_spec.so I, [2024-05-10T15:30:20.500699 #971188] INFO -- : building spec/ruby/optional/capi/ext/class_spec.so I, [2024-05-10T15:30:20.501018 #971188] INFO -- : building spec/ruby/optional/capi/ext/class_under_autoload_spec.so I, [2024-05-10T15:30:20.502135 #971188] INFO -- : building spec/ruby/optional/capi/ext/complex_spec.so I, [2024-05-10T15:30:20.502593 #971188] INFO -- : building spec/ruby/optional/capi/ext/constants_spec.so I, [2024-05-10T15:30:20.503336 #971188] INFO -- : building spec/ruby/optional/capi/ext/data_spec.so I, [2024-05-10T15:30:20.503590 #971188] INFO -- : building spec/ruby/optional/capi/ext/debug_spec.so I, [2024-05-10T15:30:20.504405 #971188] INFO -- : building spec/ruby/optional/capi/ext/encoding_spec.so I, [2024-05-10T15:30:20.504683 #971188] INFO -- : building spec/ruby/optional/capi/ext/enumerator_spec.so I, [2024-05-10T15:30:20.506115 #971188] INFO -- : building spec/ruby/optional/capi/ext/exception_spec.so I, [2024-05-10T15:30:20.678704 #971188] INFO -- : building spec/ruby/optional/capi/ext/fiber_spec.so I, [2024-05-10T15:30:20.681169 #971188] INFO -- : building spec/ruby/optional/capi/ext/file_spec.so I, [2024-05-10T15:30:20.683138 #971188] INFO -- : building spec/ruby/optional/capi/ext/fixnum_spec.so I, [2024-05-10T15:30:20.684975 #971188] INFO -- : building spec/ruby/optional/capi/ext/float_spec.so I, [2024-05-10T15:30:20.695881 #971188] INFO -- : building spec/ruby/optional/capi/ext/gc_spec.so I, [2024-05-10T15:30:20.704287 #971188] INFO -- : building spec/ruby/optional/capi/ext/globals_spec.so I, [2024-05-10T15:30:20.716629 #971188] INFO -- : building spec/ruby/optional/capi/ext/integer_spec.so I, [2024-05-10T15:30:20.716777 #971188] INFO -- : building spec/ruby/optional/capi/ext/hash_spec.so I, [2024-05-10T15:30:20.733036 #971188] INFO -- : building spec/ruby/optional/capi/ext/io_spec.so I, [2024-05-10T15:30:20.746988 #971188] INFO -- : building spec/ruby/optional/capi/ext/kernel_spec.so I, [2024-05-10T15:30:20.748789 #971188] INFO -- : building spec/ruby/optional/capi/ext/language_spec.so I, [2024-05-10T15:30:20.761803 #971188] INFO -- : building spec/ruby/optional/capi/ext/marshal_spec.so I, [2024-05-10T15:30:20.782131 #971188] INFO -- : building spec/ruby/optional/capi/ext/module_spec.so I, [2024-05-10T15:30:20.824950 #971188] INFO -- : building spec/ruby/optional/capi/ext/module_under_autoload_spec.so I, [2024-05-10T15:30:20.873119 #971188] INFO -- : building spec/ruby/optional/capi/ext/mutex_spec.so I, [2024-05-10T15:30:20.875536 #971188] INFO -- : building spec/ruby/optional/capi/ext/numeric_spec.so I, [2024-05-10T15:30:20.887393 #971188] INFO -- : building spec/ruby/optional/capi/ext/object_spec.so I, [2024-05-10T15:30:20.892188 #971188] INFO -- : building spec/ruby/optional/capi/ext/proc_spec.so I, [2024-05-10T15:30:20.905051 #971188] INFO -- : building spec/ruby/optional/capi/ext/range_spec.so I, [2024-05-10T15:30:20.919672 #971188] INFO -- : building spec/ruby/optional/capi/ext/rational_spec.so I, [2024-05-10T15:30:20.921421 #971188] INFO -- : building spec/ruby/optional/capi/ext/rbasic_spec.so I, [2024-05-10T15:30:20.923482 #971188] INFO -- : building spec/ruby/optional/capi/ext/regexp_spec.so I, [2024-05-10T15:30:20.942256 #971188] INFO -- : building spec/ruby/optional/capi/ext/st_spec.so I, [2024-05-10T15:30:20.955660 #971188] INFO -- : building spec/ruby/optional/capi/ext/string_spec.so I, [2024-05-10T15:30:20.956194 #971188] INFO -- : building spec/ruby/optional/capi/ext/struct_spec.so I, [2024-05-10T15:30:20.960012 #971188] INFO -- : building spec/ruby/optional/capi/ext/symbol_spec.so I, [2024-05-10T15:30:21.020719 #971188] INFO -- : building spec/ruby/optional/capi/ext/thread_spec.so I, [2024-05-10T15:30:21.052934 #971188] INFO -- : building spec/ruby/optional/capi/ext/time_spec.so I, [2024-05-10T15:30:21.078789 #971188] INFO -- : building spec/ruby/optional/capi/ext/tracepoint_spec.so I, [2024-05-10T15:30:21.102586 #971188] INFO -- : building spec/ruby/optional/capi/ext/typed_data_spec.so I, [2024-05-10T15:30:21.107618 #971188] INFO -- : building spec/ruby/optional/capi/ext/util_spec.so I, [2024-05-10T15:30:21.126111 #971188] INFO -- : making enc I, [2024-05-10T15:30:21.144494 #971188] INFO -- : making srcs under enc I, [2024-05-10T15:30:21.156908 #971188] INFO -- : make[1]: Entering directory '/tmp/ruby/build/trunk' I, [2024-05-10T15:30:21.156993 #971188] INFO -- : make[1]: Nothing to be done for 'enc'. I, [2024-05-10T15:30:21.157009 #971188] INFO -- : make[1]: Leaving directory '/tmp/ruby/build/trunk' I, [2024-05-10T15:30:21.203234 #971188] INFO -- : make[1]: Entering directory '/tmp/ruby/build/trunk' I, [2024-05-10T15:30:21.203309 #971188] INFO -- : make[1]: Nothing to be done for 'srcs'. I, [2024-05-10T15:30:21.203323 #971188] INFO -- : make[1]: Leaving directory '/tmp/ruby/build/trunk' I, [2024-05-10T15:30:21.204200 #971188] INFO -- : generating transdb.h I, [2024-05-10T15:30:21.317459 #971188] INFO -- : transdb.h unchanged I, [2024-05-10T15:30:21.318850 #971188] INFO -- : generating makefiles ext/configure-ext.mk I, [2024-05-10T15:30:21.318991 #971188] INFO -- : making trans I, [2024-05-10T15:30:21.348008 #971188] INFO -- : ext/configure-ext.mk updated I, [2024-05-10T15:30:21.350563 #971188] INFO -- : make[1]: Entering directory '/tmp/ruby/build/trunk' I, [2024-05-10T15:30:21.359143 #971188] INFO -- : make[1]: Entering directory '/tmp/ruby/build/trunk' I, [2024-05-10T15:30:21.359509 #971188] INFO -- : make[1]: Nothing to be done for 'trans'. I, [2024-05-10T15:30:21.359630 #971188] INFO -- : make[1]: Leaving directory '/tmp/ruby/build/trunk' I, [2024-05-10T15:30:21.363589 #971188] INFO -- : making encs I, [2024-05-10T15:30:21.435304 #971188] INFO -- : make[1]: Entering directory '/tmp/ruby/build/trunk' I, [2024-05-10T15:30:21.437326 #971188] INFO -- : make[1]: Nothing to be done for 'encs'. I, [2024-05-10T15:30:21.437416 #971188] INFO -- : make[1]: Leaving directory '/tmp/ruby/build/trunk' I, [2024-05-10T15:30:21.615604 #971188] INFO -- : make[1]: Leaving directory '/tmp/ruby/build/trunk' I, [2024-05-10T15:30:21.616361 #971188] INFO -- : generating makefile exts.mk I, [2024-05-10T15:30:21.658155 #971188] INFO -- : exts.mk unchanged I, [2024-05-10T15:30:21.662398 #971188] INFO -- : make[1]: Entering directory '/tmp/ruby/build/trunk' I, [2024-05-10T15:30:21.686590 #971188] INFO -- : make[2]: Entering directory '/tmp/ruby/build/trunk/ext/digest' I, [2024-05-10T15:30:21.687739 #971188] INFO -- : make[2]: Entering directory '/tmp/ruby/build/trunk/ext/json' I, [2024-05-10T15:30:21.688404 #971188] INFO -- : make[2]: Entering directory '/tmp/ruby/build/trunk/ext/coverage' I, [2024-05-10T15:30:21.689443 #971188] INFO -- : make[2]: Entering directory '/tmp/ruby/build/trunk/ext/date' I, [2024-05-10T15:30:21.689597 #971188] INFO -- : make[2]: Entering directory '/tmp/ruby/build/trunk/ext/io/console' I, [2024-05-10T15:30:21.690131 #971188] INFO -- : make[2]: Entering directory '/tmp/ruby/build/trunk/ext/monitor' I, [2024-05-10T15:30:21.691974 #971188] INFO -- : make[2]: Entering directory '/tmp/ruby/build/trunk/ext/pathname' I, [2024-05-10T15:30:21.692862 #971188] INFO -- : make[2]: Entering directory '/tmp/ruby/build/trunk/ext/fiddle' I, [2024-05-10T15:30:21.692889 #971188] INFO -- : make[2]: Leaving directory '/tmp/ruby/build/trunk/ext/coverage' I, [2024-05-10T15:30:21.693398 #971188] INFO -- : make[2]: Leaving directory '/tmp/ruby/build/trunk/ext/monitor' I, [2024-05-10T15:30:21.693426 #971188] INFO -- : make[2]: Leaving directory '/tmp/ruby/build/trunk/ext/io/console' I, [2024-05-10T15:30:21.693724 #971188] INFO -- : make[2]: Entering directory '/tmp/ruby/build/trunk/ext/objspace' I, [2024-05-10T15:30:21.694005 #971188] INFO -- : make[2]: Leaving directory '/tmp/ruby/build/trunk/ext/date' I, [2024-05-10T15:30:21.694380 #971188] INFO -- : make[2]: Entering directory '/tmp/ruby/build/trunk/ext/pty' I, [2024-05-10T15:30:21.695056 #971188] INFO -- : make[2]: Entering directory '/tmp/ruby/build/trunk/ext/rubyvm' I, [2024-05-10T15:30:21.695196 #971188] INFO -- : make[2]: Leaving directory '/tmp/ruby/build/trunk/ext/digest' I, [2024-05-10T15:30:21.695297 #971188] INFO -- : make[2]: Entering directory '/tmp/ruby/build/trunk/ext/psych' I, [2024-05-10T15:30:21.695488 #971188] INFO -- : make[2]: Leaving directory '/tmp/ruby/build/trunk/ext/pathname' I, [2024-05-10T15:30:21.696899 #971188] INFO -- : make[2]: Leaving directory '/tmp/ruby/build/trunk/ext/json' I, [2024-05-10T15:30:21.697538 #971188] INFO -- : make[2]: Leaving directory '/tmp/ruby/build/trunk/ext/rubyvm' I, [2024-05-10T15:30:21.697571 #971188] INFO -- : make[2]: Leaving directory '/tmp/ruby/build/trunk/ext/pty' I, [2024-05-10T15:30:21.699850 #971188] INFO -- : make[2]: Leaving directory '/tmp/ruby/build/trunk/ext/objspace' I, [2024-05-10T15:30:21.700557 #971188] INFO -- : make[2]: Entering directory '/tmp/ruby/build/trunk/.bundle/gems/bigdecimal-3.1.8/ext/bigdecimal' I, [2024-05-10T15:30:21.700585 #971188] INFO -- : make[2]: Entering directory '/tmp/ruby/build/trunk/.bundle/gems/debug-1.9.2/ext/debug' I, [2024-05-10T15:30:21.700605 #971188] INFO -- : make[2]: Entering directory '/tmp/ruby/build/trunk/.bundle/gems/nkf-0.2.0/ext/nkf' I, [2024-05-10T15:30:21.700799 #971188] INFO -- : make[2]: Entering directory '/tmp/ruby/build/trunk/.bundle/gems/racc-1.7.3/ext/racc/cparse' I, [2024-05-10T15:30:21.701098 #971188] INFO -- : make[2]: Entering directory '/tmp/ruby/build/trunk/.bundle/gems/syslog-0.1.2/ext/syslog' I, [2024-05-10T15:30:21.701447 #971188] INFO -- : make[2]: Leaving directory '/tmp/ruby/build/trunk/ext/fiddle' I, [2024-05-10T15:30:21.701505 #971188] INFO -- : make[2]: Entering directory '/tmp/ruby/build/trunk/ext/ripper' I, [2024-05-10T15:30:21.701628 #971188] INFO -- : make[2]: Entering directory '/tmp/ruby/build/trunk/.bundle/gems/rbs-3.4.4/ext/rbs_extension' I, [2024-05-10T15:30:21.708332 #971188] INFO -- : make[2]: Entering directory '/tmp/ruby/build/trunk/ext/socket' I, [2024-05-10T15:30:21.708438 #971188] INFO -- : make[2]: Entering directory '/tmp/ruby/build/trunk/ext/openssl' I, [2024-05-10T15:30:21.708510 #971188] INFO -- : make[2]: Leaving directory '/tmp/ruby/build/trunk/ext/ripper' I, [2024-05-10T15:30:21.708696 #971188] INFO -- : make[2]: Entering directory '/tmp/ruby/build/trunk/ext/digest/sha2' I, [2024-05-10T15:30:21.709632 #971188] INFO -- : make[2]: Leaving directory '/tmp/ruby/build/trunk/ext/psych' I, [2024-05-10T15:30:21.712450 #971188] INFO -- : make[2]: Leaving directory '/tmp/ruby/build/trunk/ext/digest/sha2' I, [2024-05-10T15:30:21.717153 #971188] INFO -- : make[2]: Leaving directory '/tmp/ruby/build/trunk/ext/socket' I, [2024-05-10T15:30:21.730492 #971188] INFO -- : make[2]: Leaving directory '/tmp/ruby/build/trunk/ext/openssl' I, [2024-05-10T15:30:21.732751 #971188] INFO -- : make[2]: Leaving directory '/tmp/ruby/build/trunk/.bundle/gems/racc-1.7.3/ext/racc/cparse' I, [2024-05-10T15:30:21.740201 #971188] INFO -- : make[2]: Leaving directory '/tmp/ruby/build/trunk/.bundle/gems/bigdecimal-3.1.8/ext/bigdecimal' I, [2024-05-10T15:30:21.746639 #971188] INFO -- : make[2]: Leaving directory '/tmp/ruby/build/trunk/.bundle/gems/nkf-0.2.0/ext/nkf' I, [2024-05-10T15:30:21.746950 #971188] INFO -- : make[2]: Leaving directory '/tmp/ruby/build/trunk/.bundle/gems/syslog-0.1.2/ext/syslog' I, [2024-05-10T15:30:21.747135 #971188] INFO -- : make[2]: Leaving directory '/tmp/ruby/build/trunk/.bundle/gems/rbs-3.4.4/ext/rbs_extension' I, [2024-05-10T15:30:21.748262 #971188] INFO -- : make[2]: Leaving directory '/tmp/ruby/build/trunk/.bundle/gems/debug-1.9.2/ext/debug' I, [2024-05-10T15:30:21.771085 #971188] INFO -- : make[2]: Entering directory '/tmp/ruby/build/trunk' I, [2024-05-10T15:30:21.847535 #971188] INFO -- : linking ruby I, [2024-05-10T15:30:21.867961 #971188] INFO -- : make[2]: Leaving directory '/tmp/ruby/build/trunk' I, [2024-05-10T15:30:21.868293 #971188] INFO -- : make[1]: Leaving directory '/tmp/ruby/build/trunk' I, [2024-05-10T15:30:21.871688 #971188] INFO -- : make[1]: Entering directory '/tmp/ruby/build/trunk' I, [2024-05-10T15:30:21.871710 #971188] INFO -- : make[1]: Nothing to be done for 'note'. I, [2024-05-10T15:30:21.871724 #971188] INFO -- : make[1]: Leaving directory '/tmp/ruby/build/trunk' I, [2024-05-10T15:30:21.872332 #971188] INFO -- : $$$[end] "make all -j16" exit with 0. I, [2024-05-10T15:30:21.872507 #971188] INFO -- : $$$[beg] make install -j16 I, [2024-05-10T15:30:21.932520 #971188] INFO -- : Update minitest to ea9caafc0754b1d6236a490d59e624b53209734a I, [2024-05-10T15:30:21.932573 #971188] INFO -- : Update power_assert to 84e85124c5014a139af39161d484156cfe87a9ed I, [2024-05-10T15:30:21.933221 #971188] INFO -- : Update rbs to ba7872795d5de04adb8ff500c0e6afdc81a041dd I, [2024-05-10T15:30:21.933311 #971188] INFO -- : Update typeprof to b19a6416da3a05d57fadd6ffdadb382b6d236ca5 I, [2024-05-10T15:30:21.934123 #971188] INFO -- : echo ea9caafc0754b1d6236a490d59e624b53209734a | /bin/sh /tmp/ruby/src/trunk/tool/ifchange /tmp/ruby/src/trunk/.bundle/.timestamp/minitest.revision - I, [2024-05-10T15:30:21.934242 #971188] INFO -- : echo 84e85124c5014a139af39161d484156cfe87a9ed | /bin/sh /tmp/ruby/src/trunk/tool/ifchange /tmp/ruby/src/trunk/.bundle/.timestamp/power_assert.revision - I, [2024-05-10T15:30:21.934964 #971188] INFO -- : BASERUBY = /usr/bin/ruby --disable=gems I, [2024-05-10T15:30:21.934987 #971188] INFO -- : CC = gcc I, [2024-05-10T15:30:21.934999 #971188] INFO -- : LD = ld I, [2024-05-10T15:30:21.935017 #971188] INFO -- : LDSHARED = gcc -shared I, [2024-05-10T15:30:21.935025 #971188] INFO -- : CFLAGS = -O3 -fno-fast-math -ggdb3 -Wall -Wextra -Wdeprecated-declarations -Wdiv-by-zero -Wduplicated-cond -Wimplicit-function-declaration -Wimplicit-int -Wpointer-arith -Wwrite-strings -Wold-style-definition -Wimplicit-fallthrough=0 -Wmissing-noreturn -Wno-cast-function-type -Wno-constant-logical-operand -Wno-long-long -Wno-missing-field-initializers -Wno-overlength-strings -Wno-packed-bitfield-compat -Wno-parentheses-equality -Wno-self-assign -Wno-tautological-compare -Wno-unused-parameter -Wno-unused-value -Wsuggest-attribute=format -Wsuggest-attribute=noreturn -Wunused-variable -Wmisleading-indentation -Wundef -fPIC I, [2024-05-10T15:30:21.935034 #971188] INFO -- : XCFLAGS = -U_FORTIFY_SOURCE -D_FORTIFY_SOURCE=2 -fstack-protector-strong -fno-strict-overflow -fvisibility=hidden -fexcess-precision=standard -DRUBY_EXPORT -I. -I.ext/include/x86_64-linux -I/tmp/ruby/src/trunk/include -I/tmp/ruby/src/trunk -I/tmp/ruby/src/trunk/prism -I/tmp/ruby/src/trunk/enc/unicode/15.0.0 I, [2024-05-10T15:30:21.935042 #971188] INFO -- : CPPFLAGS = I, [2024-05-10T15:30:21.935050 #971188] INFO -- : DLDFLAGS = -Wl,--compress-debug-sections=zlib -Wl,-soname,libruby.so.3.4 -fstack-protector-strong I, [2024-05-10T15:30:21.935060 #971188] INFO -- : SOLIBS = -lz -lrt -lrt -lgmp -ldl -lcrypt -lm -lpthread I, [2024-05-10T15:30:21.935067 #971188] INFO -- : LANG = C.UTF-8 I, [2024-05-10T15:30:21.935075 #971188] INFO -- : LC_ALL = I, [2024-05-10T15:30:21.935083 #971188] INFO -- : LC_CTYPE = I, [2024-05-10T15:30:21.935091 #971188] INFO -- : MFLAGS = -j16 --jobserver-auth=4,5 I, [2024-05-10T15:30:21.935098 #971188] INFO -- : RUSTC = rustc I, [2024-05-10T15:30:21.935105 #971188] INFO -- : YJIT_RUSTC_ARGS = --crate-name=yjit --crate-type=staticlib --edition=2021 -g -C lto=thin -C opt-level=3 -C overflow-checks=on '--out-dir=/tmp/ruby/build/trunk/yjit/target/release/' /tmp/ruby/src/trunk/yjit/src/lib.rs I, [2024-05-10T15:30:21.936123 #971188] INFO -- : /tmp/ruby/src/trunk/.bundle/.timestamp/power_assert.revision unchanged I, [2024-05-10T15:30:21.936153 #971188] INFO -- : /tmp/ruby/src/trunk/.bundle/.timestamp/minitest.revision unchanged I, [2024-05-10T15:30:21.973817 #971188] INFO -- : echo ba7872795d5de04adb8ff500c0e6afdc81a041dd | /bin/sh /tmp/ruby/src/trunk/tool/ifchange /tmp/ruby/src/trunk/.bundle/.timestamp/rbs.revision - I, [2024-05-10T15:30:21.973912 #971188] INFO -- : echo b19a6416da3a05d57fadd6ffdadb382b6d236ca5 | /bin/sh /tmp/ruby/src/trunk/tool/ifchange /tmp/ruby/src/trunk/.bundle/.timestamp/typeprof.revision - I, [2024-05-10T15:30:21.974637 #971188] INFO -- : generating enc.mk I, [2024-05-10T15:30:21.974660 #971188] INFO -- : gcc (Ubuntu 11.4.0-1ubuntu1~22.04) 11.4.0 I, [2024-05-10T15:30:21.974684 #971188] INFO -- : Copyright (C) 2021 Free Software Foundation, Inc. I, [2024-05-10T15:30:21.974694 #971188] INFO -- : This is free software; see the source for copying conditions. There is NO I, [2024-05-10T15:30:21.974711 #971188] INFO -- : warranty; not even for MERCHANTABILITY or FITNESS FOR A PARTICULAR PURPOSE. I, [2024-05-10T15:30:21.974721 #971188] INFO -- : I, [2024-05-10T15:30:21.975976 #971188] INFO -- : /tmp/ruby/src/trunk/.bundle/.timestamp/rbs.revision unchanged I, [2024-05-10T15:30:21.976082 #971188] INFO -- : /tmp/ruby/src/trunk/.bundle/.timestamp/typeprof.revision unchanged I, [2024-05-10T15:30:22.107007 #971188] INFO -- : Building power_assert@84e85124c5014a139af39161d484156cfe87a9ed to /tmp/ruby/src/trunk/gems/power_assert-2.0.3.gem I, [2024-05-10T15:30:22.107500 #971188] INFO -- : making srcs under enc I, [2024-05-10T15:30:22.107845 #971188] INFO -- : making enc I, [2024-05-10T15:30:22.125028 #971188] INFO -- : make[1]: Entering directory '/tmp/ruby/build/trunk' I, [2024-05-10T15:30:22.125075 #971188] INFO -- : make[1]: Nothing to be done for 'enc'. I, [2024-05-10T15:30:22.125087 #971188] INFO -- : make[1]: Leaving directory '/tmp/ruby/build/trunk' I, [2024-05-10T15:30:22.139203 #971188] INFO -- : make[1]: Entering directory '/tmp/ruby/build/trunk' I, [2024-05-10T15:30:22.139234 #971188] INFO -- : make[1]: Nothing to be done for 'srcs'. I, [2024-05-10T15:30:22.139252 #971188] INFO -- : make[1]: Leaving directory '/tmp/ruby/build/trunk' I, [2024-05-10T15:30:22.140041 #971188] INFO -- : generating transdb.h I, [2024-05-10T15:30:22.181667 #971188] INFO -- : Successfully built RubyGem I, [2024-05-10T15:30:22.181711 #971188] INFO -- : Name: power_assert I, [2024-05-10T15:30:22.181722 #971188] INFO -- : Version: 2.0.4dev I, [2024-05-10T15:30:22.181731 #971188] INFO -- : File: power_assert-2.0.4dev.gem I, [2024-05-10T15:30:22.183203 #971188] INFO -- : Extracting bundle gem power_assert-2.0.3... I, [2024-05-10T15:30:22.237978 #971188] INFO -- : transdb.h unchanged I, [2024-05-10T15:30:22.239498 #971188] INFO -- : generating makefiles ext/configure-ext.mk I, [2024-05-10T15:30:22.239630 #971188] INFO -- : making trans I, [2024-05-10T15:30:22.243672 #971188] INFO -- : Try with hash version of bundled gems instead of gems/power_assert-2.0.3.gem. We don't use this gem with release version of Ruby. I, [2024-05-10T15:30:22.249643 #971188] INFO -- : Unpacked gems/power_assert-2.0.4dev.gem I, [2024-05-10T15:30:22.266933 #971188] INFO -- : ext/configure-ext.mk unchanged I, [2024-05-10T15:30:22.269359 #971188] INFO -- : make[1]: Entering directory '/tmp/ruby/build/trunk' I, [2024-05-10T15:30:22.280108 #971188] INFO -- : make[1]: Entering directory '/tmp/ruby/build/trunk' I, [2024-05-10T15:30:22.280465 #971188] INFO -- : make[1]: Nothing to be done for 'trans'. I, [2024-05-10T15:30:22.280603 #971188] INFO -- : make[1]: Leaving directory '/tmp/ruby/build/trunk' I, [2024-05-10T15:30:22.283809 #971188] INFO -- : making encs I, [2024-05-10T15:30:22.355850 #971188] INFO -- : make[1]: Entering directory '/tmp/ruby/build/trunk' I, [2024-05-10T15:30:22.355969 #971188] INFO -- : make[1]: Nothing to be done for 'encs'. I, [2024-05-10T15:30:22.356024 #971188] INFO -- : make[1]: Leaving directory '/tmp/ruby/build/trunk' I, [2024-05-10T15:30:22.519983 #971188] INFO -- : make[1]: Leaving directory '/tmp/ruby/build/trunk' I, [2024-05-10T15:30:22.520579 #971188] INFO -- : generating makefile exts.mk I, [2024-05-10T15:30:22.562264 #971188] INFO -- : exts.mk unchanged I, [2024-05-10T15:30:22.566548 #971188] INFO -- : make[1]: Entering directory '/tmp/ruby/build/trunk' I, [2024-05-10T15:30:22.590391 #971188] INFO -- : make[2]: Entering directory '/tmp/ruby/build/trunk/ext/digest' I, [2024-05-10T15:30:22.591397 #971188] INFO -- : make[2]: Entering directory '/tmp/ruby/build/trunk/ext/json' I, [2024-05-10T15:30:22.592239 #971188] INFO -- : make[2]: Entering directory '/tmp/ruby/build/trunk/ext/coverage' I, [2024-05-10T15:30:22.593304 #971188] INFO -- : make[2]: Entering directory '/tmp/ruby/build/trunk/ext/date' I, [2024-05-10T15:30:22.593366 #971188] INFO -- : make[2]: Entering directory '/tmp/ruby/build/trunk/ext/io/console' I, [2024-05-10T15:30:22.593735 #971188] INFO -- : make[2]: Entering directory '/tmp/ruby/build/trunk/ext/monitor' I, [2024-05-10T15:30:22.595649 #971188] INFO -- : make[2]: Entering directory '/tmp/ruby/build/trunk/ext/pathname' I, [2024-05-10T15:30:22.595982 #971188] INFO -- : make[2]: Entering directory '/tmp/ruby/build/trunk/ext/fiddle' I, [2024-05-10T15:30:22.596630 #971188] INFO -- : make[2]: Leaving directory '/tmp/ruby/build/trunk/ext/coverage' I, [2024-05-10T15:30:22.597521 #971188] INFO -- : make[2]: Leaving directory '/tmp/ruby/build/trunk/ext/io/console' I, [2024-05-10T15:30:22.597703 #971188] INFO -- : make[2]: Leaving directory '/tmp/ruby/build/trunk/ext/monitor' I, [2024-05-10T15:30:22.597729 #971188] INFO -- : make[2]: Entering directory '/tmp/ruby/build/trunk/ext/rubyvm' I, [2024-05-10T15:30:22.597746 #971188] INFO -- : make[2]: Leaving directory '/tmp/ruby/build/trunk/ext/digest' I, [2024-05-10T15:30:22.598399 #971188] INFO -- : make[2]: Leaving directory '/tmp/ruby/build/trunk/ext/date' I, [2024-05-10T15:30:22.598477 #971188] INFO -- : make[2]: Entering directory '/tmp/ruby/build/trunk/ext/objspace' I, [2024-05-10T15:30:22.598504 #971188] INFO -- : make[2]: Entering directory '/tmp/ruby/build/trunk/ext/pty' I, [2024-05-10T15:30:22.598895 #971188] INFO -- : make[2]: Entering directory '/tmp/ruby/build/trunk/ext/psych' I, [2024-05-10T15:30:22.599225 #971188] INFO -- : make[2]: Leaving directory '/tmp/ruby/build/trunk/ext/json' I, [2024-05-10T15:30:22.599533 #971188] INFO -- : make[2]: Leaving directory '/tmp/ruby/build/trunk/ext/pathname' I, [2024-05-10T15:30:22.600683 #971188] INFO -- : make[2]: Leaving directory '/tmp/ruby/build/trunk/ext/rubyvm' I, [2024-05-10T15:30:22.601510 #971188] INFO -- : make[2]: Entering directory '/tmp/ruby/build/trunk/.bundle/gems/bigdecimal-3.1.8/ext/bigdecimal' I, [2024-05-10T15:30:22.601702 #971188] INFO -- : make[2]: Leaving directory '/tmp/ruby/build/trunk/ext/pty' I, [2024-05-10T15:30:22.602019 #971188] INFO -- : make[2]: Entering directory '/tmp/ruby/build/trunk/.bundle/gems/debug-1.9.2/ext/debug' I, [2024-05-10T15:30:22.602774 #971188] INFO -- : make[2]: Entering directory '/tmp/ruby/build/trunk/.bundle/gems/nkf-0.2.0/ext/nkf' I, [2024-05-10T15:30:22.604190 #971188] INFO -- : make[2]: Entering directory '/tmp/ruby/build/trunk/.bundle/gems/racc-1.7.3/ext/racc/cparse' I, [2024-05-10T15:30:22.604559 #971188] INFO -- : make[2]: Entering directory '/tmp/ruby/build/trunk/ext/ripper' I, [2024-05-10T15:30:22.604815 #971188] INFO -- : make[2]: Leaving directory '/tmp/ruby/build/trunk/ext/fiddle' I, [2024-05-10T15:30:22.604843 #971188] INFO -- : make[2]: Leaving directory '/tmp/ruby/build/trunk/ext/objspace' I, [2024-05-10T15:30:22.604964 #971188] INFO -- : make[2]: Entering directory '/tmp/ruby/build/trunk/.bundle/gems/rbs-3.4.4/ext/rbs_extension' I, [2024-05-10T15:30:22.605440 #971188] INFO -- : make[2]: Entering directory '/tmp/ruby/build/trunk/.bundle/gems/syslog-0.1.2/ext/syslog' I, [2024-05-10T15:30:22.612379 #971188] INFO -- : make[2]: Entering directory '/tmp/ruby/build/trunk/ext/socket' I, [2024-05-10T15:30:22.614167 #971188] INFO -- : make[2]: Entering directory '/tmp/ruby/build/trunk/ext/digest/sha2' I, [2024-05-10T15:30:22.614381 #971188] INFO -- : make[2]: Leaving directory '/tmp/ruby/build/trunk/ext/ripper' I, [2024-05-10T15:30:22.614410 #971188] INFO -- : make[2]: Entering directory '/tmp/ruby/build/trunk/ext/openssl' I, [2024-05-10T15:30:22.616667 #971188] INFO -- : make[2]: Leaving directory '/tmp/ruby/build/trunk/ext/psych' I, [2024-05-10T15:30:22.616873 #971188] INFO -- : make[2]: Leaving directory '/tmp/ruby/build/trunk/ext/digest/sha2' I, [2024-05-10T15:30:22.620008 #971188] INFO -- : make[2]: Leaving directory '/tmp/ruby/build/trunk/ext/socket' I, [2024-05-10T15:30:22.634393 #971188] INFO -- : make[2]: Leaving directory '/tmp/ruby/build/trunk/.bundle/gems/debug-1.9.2/ext/debug' I, [2024-05-10T15:30:22.635004 #971188] INFO -- : make[2]: Leaving directory '/tmp/ruby/build/trunk/.bundle/gems/nkf-0.2.0/ext/nkf' I, [2024-05-10T15:30:22.635448 #971188] INFO -- : make[2]: Leaving directory '/tmp/ruby/build/trunk/ext/openssl' I, [2024-05-10T15:30:22.635674 #971188] INFO -- : make[2]: Leaving directory '/tmp/ruby/build/trunk/.bundle/gems/rbs-3.4.4/ext/rbs_extension' I, [2024-05-10T15:30:22.636892 #971188] INFO -- : make[2]: Leaving directory '/tmp/ruby/build/trunk/.bundle/gems/racc-1.7.3/ext/racc/cparse' I, [2024-05-10T15:30:22.637800 #971188] INFO -- : make[2]: Leaving directory '/tmp/ruby/build/trunk/.bundle/gems/syslog-0.1.2/ext/syslog' I, [2024-05-10T15:30:22.642148 #971188] INFO -- : make[2]: Leaving directory '/tmp/ruby/build/trunk/.bundle/gems/bigdecimal-3.1.8/ext/bigdecimal' I, [2024-05-10T15:30:22.664738 #971188] INFO -- : make[2]: Entering directory '/tmp/ruby/build/trunk' I, [2024-05-10T15:30:22.741432 #971188] INFO -- : make[2]: 'ruby' is up to date. I, [2024-05-10T15:30:22.741478 #971188] INFO -- : make[2]: Leaving directory '/tmp/ruby/build/trunk' I, [2024-05-10T15:30:22.741929 #971188] INFO -- : make[1]: Leaving directory '/tmp/ruby/build/trunk' I, [2024-05-10T15:30:22.745298 #971188] INFO -- : make[1]: Entering directory '/tmp/ruby/build/trunk' I, [2024-05-10T15:30:22.745320 #971188] INFO -- : make[1]: Nothing to be done for 'note'. I, [2024-05-10T15:30:22.745341 #971188] INFO -- : make[1]: Leaving directory '/tmp/ruby/build/trunk' I, [2024-05-10T15:30:22.745871 #971188] INFO -- : ./miniruby -I/tmp/ruby/src/trunk/lib -I. -I.ext/common /tmp/ruby/src/trunk/tool/runruby.rb --extout=.ext -- --disable-gems -r./x86_64-linux-fake /tmp/ruby/src/trunk/tool/rbinstall.rb --make="make" --dest-dir="" --extout=".ext" --ext-build-dir="./ext" --mflags="-j16 --jobserver-auth=4,5" --make-flags=" -j16 --jobserver-auth=4,5" --data-mode=0644 --prog-mode=0755 --installed-list .installed.list --mantype="doc" --gnumake --install=all --exclude=doc I, [2024-05-10T15:30:22.840730 #971188] INFO -- : Installing to I, [2024-05-10T15:30:22.840784 #971188] INFO -- : installing binary commands: /tmp/ruby/install/trunk/bin I, [2024-05-10T15:30:22.840930 #971188] INFO -- : installing base libraries: /tmp/ruby/install/trunk/lib I, [2024-05-10T15:30:22.850386 #971188] INFO -- : installing arch files: /tmp/ruby/install/trunk/lib/ruby/3.4.0+0/x86_64-linux I, [2024-05-10T15:30:22.850427 #971188] INFO -- : installing pkgconfig data: /tmp/ruby/install/trunk/lib/pkgconfig I, [2024-05-10T15:30:22.850505 #971188] INFO -- : installing extension objects: /tmp/ruby/install/trunk/lib/ruby/3.4.0+0/x86_64-linux I, [2024-05-10T15:30:22.860659 #971188] INFO -- : installing extension objects: /tmp/ruby/install/trunk/lib/ruby/site_ruby/3.4.0+0/x86_64-linux I, [2024-05-10T15:30:22.860684 #971188] INFO -- : installing extension objects: /tmp/ruby/install/trunk/lib/ruby/vendor_ruby/3.4.0+0/x86_64-linux I, [2024-05-10T15:30:22.860744 #971188] INFO -- : installing extension headers: /tmp/ruby/install/trunk/include/ruby-3.4.0+0/x86_64-linux I, [2024-05-10T15:30:22.860936 #971188] INFO -- : installing extension scripts: /tmp/ruby/install/trunk/lib/ruby/3.4.0+0 I, [2024-05-10T15:30:22.865459 #971188] INFO -- : installing extension scripts: /tmp/ruby/install/trunk/lib/ruby/site_ruby/3.4.0+0 I, [2024-05-10T15:30:22.865482 #971188] INFO -- : installing extension scripts: /tmp/ruby/install/trunk/lib/ruby/vendor_ruby/3.4.0+0 I, [2024-05-10T15:30:22.865494 #971188] INFO -- : installing extension headers: /tmp/ruby/install/trunk/include/ruby-3.4.0+0/ruby I, [2024-05-10T15:30:22.865510 #971188] INFO -- : installing command scripts: /tmp/ruby/install/trunk/bin I, [2024-05-10T15:30:22.865617 #971188] INFO -- : installing library scripts: /tmp/ruby/install/trunk/lib/ruby/3.4.0+0 I, [2024-05-10T15:30:22.908144 #971188] INFO -- : installing common headers: /tmp/ruby/install/trunk/include/ruby-3.4.0+0 I, [2024-05-10T15:30:22.914973 #971188] INFO -- : installing manpages: /tmp/ruby/install/trunk/share/man/man1 I, [2024-05-10T15:30:22.915172 #971188] INFO -- : installing default gems from lib: /tmp/ruby/install/trunk/lib/ruby/gems/3.4.0+0 I, [2024-05-10T15:30:22.940622 #971188] INFO -- : benchmark 0.3.0 I, [2024-05-10T15:30:22.948388 #971188] INFO -- : bundler 2.6.0.dev I, [2024-05-10T15:30:22.950007 #971188] INFO -- : cgi 0.4.1 I, [2024-05-10T15:30:22.950652 #971188] INFO -- : delegate 0.3.1 I, [2024-05-10T15:30:22.951204 #971188] INFO -- : did_you_mean 1.6.3 I, [2024-05-10T15:30:22.951752 #971188] INFO -- : english 0.8.0 I, [2024-05-10T15:30:22.952293 #971188] INFO -- : erb 4.0.4 I, [2024-05-10T15:30:22.953672 #971188] INFO -- : error_highlight 0.6.0 I, [2024-05-10T15:30:22.954232 #971188] INFO -- : fileutils 1.7.2 I, [2024-05-10T15:30:22.954779 #971188] INFO -- : find 0.2.0 I, [2024-05-10T15:30:22.955324 #971188] INFO -- : forwardable 1.3.3 I, [2024-05-10T15:30:22.955855 #971188] INFO -- : ipaddr 1.2.6 I, [2024-05-10T15:30:22.956391 #971188] INFO -- : irb 1.13.1 I, [2024-05-10T15:30:22.957274 #971188] INFO -- : logger 1.6.0 I, [2024-05-10T15:30:22.957850 #971188] INFO -- : net-http 0.4.1 I, [2024-05-10T15:30:22.958512 #971188] INFO -- : net-protocol 0.2.2 I, [2024-05-10T15:30:22.959083 #971188] INFO -- : open-uri 0.4.1 I, [2024-05-10T15:30:22.959666 #971188] INFO -- : open3 0.2.1 I, [2024-05-10T15:30:22.960216 #971188] INFO -- : optparse 0.5.0 I, [2024-05-10T15:30:22.960777 #971188] INFO -- : ostruct 0.6.0 I, [2024-05-10T15:30:22.961872 #971188] INFO -- : pp 0.5.0 I, [2024-05-10T15:30:22.962446 #971188] INFO -- : prettyprint 0.2.0 I, [2024-05-10T15:30:22.962974 #971188] INFO -- : prism 0.28.0 I, [2024-05-10T15:30:22.963537 #971188] INFO -- : pstore 0.1.3 I, [2024-05-10T15:30:22.964053 #971188] INFO -- : rdoc 6.6.3.1 I, [2024-05-10T15:30:22.965197 #971188] INFO -- : readline 0.0.4 I, [2024-05-10T15:30:22.965812 #971188] INFO -- : reline 0.5.6 I, [2024-05-10T15:30:22.966402 #971188] INFO -- : resolv 0.4.0 I, [2024-05-10T15:30:22.966953 #971188] INFO -- : ruby2_keywords 0.0.5 I, [2024-05-10T15:30:22.967599 #971188] INFO -- : securerandom 0.3.1 I, [2024-05-10T15:30:22.968472 #971188] INFO -- : set 1.1.0 I, [2024-05-10T15:30:22.969154 #971188] INFO -- : shellwords 0.2.0 I, [2024-05-10T15:30:22.969754 #971188] INFO -- : singleton 0.2.0 I, [2024-05-10T15:30:22.970277 #971188] INFO -- : syntax_suggest 2.0.0 I, [2024-05-10T15:30:22.971089 #971188] INFO -- : tempfile 0.2.1 I, [2024-05-10T15:30:22.971626 #971188] INFO -- : time 0.3.0 I, [2024-05-10T15:30:22.972183 #971188] INFO -- : timeout 0.4.1 I, [2024-05-10T15:30:22.972763 #971188] INFO -- : tmpdir 0.2.0 I, [2024-05-10T15:30:22.973327 #971188] INFO -- : tsort 0.2.0 I, [2024-05-10T15:30:22.973877 #971188] INFO -- : un 0.3.0 I, [2024-05-10T15:30:22.974425 #971188] INFO -- : uri 0.13.0 I, [2024-05-10T15:30:22.974990 #971188] INFO -- : weakref 0.1.3 I, [2024-05-10T15:30:22.975520 #971188] INFO -- : yaml 0.3.0 I, [2024-05-10T15:30:22.976235 #971188] INFO -- : installing default gems from ext: /tmp/ruby/install/trunk/lib/ruby/gems/3.4.0+0 I, [2024-05-10T15:30:22.982549 #971188] INFO -- : date 3.3.4 I, [2024-05-10T15:30:22.983122 #971188] INFO -- : digest 3.1.1 I, [2024-05-10T15:30:22.983652 #971188] INFO -- : etc 1.4.3 I, [2024-05-10T15:30:22.984641 #971188] INFO -- : fcntl 1.1.0 I, [2024-05-10T15:30:22.985189 #971188] INFO -- : fiddle 1.1.3 I, [2024-05-10T15:30:22.985820 #971188] INFO -- : io-console 0.7.2 I, [2024-05-10T15:30:22.986350 #971188] INFO -- : io-nonblock 0.3.0 I, [2024-05-10T15:30:22.986880 #971188] INFO -- : io-wait 0.3.1 I, [2024-05-10T15:30:22.987383 #971188] INFO -- : json 2.7.2 I, [2024-05-10T15:30:22.988031 #971188] INFO -- : openssl 3.2.0 I, [2024-05-10T15:30:22.988583 #971188] INFO -- : pathname 0.3.0 I, [2024-05-10T15:30:22.989120 #971188] INFO -- : psych 5.1.2 I, [2024-05-10T15:30:22.989745 #971188] INFO -- : stringio 3.1.1 I, [2024-05-10T15:30:22.990666 #971188] INFO -- : strscan 3.1.1 I, [2024-05-10T15:30:22.991214 #971188] INFO -- : zlib 3.1.0 I, [2024-05-10T15:30:22.991657 #971188] INFO -- : installing bundled gems: /tmp/ruby/install/trunk/lib/ruby/gems/3.4.0+0 I, [2024-05-10T15:30:22.992023 #971188] INFO -- : minitest 5.22.3 I, [2024-05-10T15:30:22.999679 #971188] INFO -- : rake 13.2.1 I, [2024-05-10T15:30:23.004616 #971188] INFO -- : test-unit 3.6.2 I, [2024-05-10T15:30:23.010339 #971188] INFO -- : rexml 3.2.6 I, [2024-05-10T15:30:23.015628 #971188] INFO -- : rss 0.3.0 I, [2024-05-10T15:30:23.019356 #971188] INFO -- : net-ftp 0.3.4 I, [2024-05-10T15:30:23.021461 #971188] INFO -- : net-imap 0.4.11 I, [2024-05-10T15:30:23.025714 #971188] INFO -- : net-pop 0.1.2 I, [2024-05-10T15:30:23.026826 #971188] INFO -- : net-smtp 0.5.0 I, [2024-05-10T15:30:23.028189 #971188] INFO -- : matrix 0.4.2 I, [2024-05-10T15:30:23.031854 #971188] INFO -- : prime 0.1.2 I, [2024-05-10T15:30:23.038661 #971188] INFO -- : rbs 3.4.4 I, [2024-05-10T15:30:23.073244 #971188] INFO -- : typeprof 0.21.11 I, [2024-05-10T15:30:23.076704 #971188] INFO -- : debug 1.9.2 I, [2024-05-10T15:30:23.080365 #971188] INFO -- : racc 1.7.3 I, [2024-05-10T15:30:23.083958 #971188] INFO -- : mutex_m 0.2.0 I, [2024-05-10T15:30:23.085293 #971188] INFO -- : getoptlong 0.2.1 I, [2024-05-10T15:30:23.087081 #971188] INFO -- : base64 0.2.0 I, [2024-05-10T15:30:23.088230 #971188] INFO -- : bigdecimal 3.1.8 I, [2024-05-10T15:30:23.091162 #971188] INFO -- : observer 0.1.2 I, [2024-05-10T15:30:23.092497 #971188] INFO -- : abbrev 0.1.2 I, [2024-05-10T15:30:23.093742 #971188] INFO -- : resolv-replace 0.1.1 I, [2024-05-10T15:30:23.095266 #971188] INFO -- : rinda 0.2.0 I, [2024-05-10T15:30:23.096732 #971188] INFO -- : drb 2.2.1 I, [2024-05-10T15:30:23.098961 #971188] INFO -- : nkf 0.2.0 I, [2024-05-10T15:30:23.101989 #971188] INFO -- : syslog 0.1.2 I, [2024-05-10T15:30:23.103940 #971188] INFO -- : csv 3.3.0 I, [2024-05-10T15:30:23.107141 #971188] INFO -- : installing bundled gem cache: /tmp/ruby/install/trunk/lib/ruby/gems/3.4.0+0/cache I, [2024-05-10T15:30:23.109002 #971188] INFO -- : skipped bundled gems: I, [2024-05-10T15:30:23.109025 #971188] INFO -- : power_assert-2.0.4dev.gem not found in bundled_gems I, [2024-05-10T15:30:23.112098 #971188] INFO -- : $$$[end] "make install -j16" exit with 0. I, [2024-05-10T15:30:23.112210 #971188] INFO -- : $$$[beg] make yes-btest TESTOPTS='-q -j16' I, [2024-05-10T15:30:30.817762 #971188] INFO -- : PASS all 1936 tests E, [2024-05-10T15:30:30.828808 #971188] ERROR -- : I, [2024-05-10T15:30:30.829128 #971188] INFO -- : $$$[end] "make yes-btest TESTOPTS='-q -j16'" exit with 0. I, [2024-05-10T15:30:30.829366 #971188] INFO -- : $$$[beg] make yes-test-basic TESTS='-j16' I, [2024-05-10T15:30:30.922317 #971188] INFO -- : BASERUBY = /usr/bin/ruby --disable=gems I, [2024-05-10T15:30:30.922372 #971188] INFO -- : CC = gcc I, [2024-05-10T15:30:30.922384 #971188] INFO -- : LD = ld I, [2024-05-10T15:30:30.922393 #971188] INFO -- : LDSHARED = gcc -shared I, [2024-05-10T15:30:30.922407 #971188] INFO -- : CFLAGS = -O3 -fno-fast-math -ggdb3 -Wall -Wextra -Wdeprecated-declarations -Wdiv-by-zero -Wduplicated-cond -Wimplicit-function-declaration -Wimplicit-int -Wpointer-arith -Wwrite-strings -Wold-style-definition -Wimplicit-fallthrough=0 -Wmissing-noreturn -Wno-cast-function-type -Wno-constant-logical-operand -Wno-long-long -Wno-missing-field-initializers -Wno-overlength-strings -Wno-packed-bitfield-compat -Wno-parentheses-equality -Wno-self-assign -Wno-tautological-compare -Wno-unused-parameter -Wno-unused-value -Wsuggest-attribute=format -Wsuggest-attribute=noreturn -Wunused-variable -Wmisleading-indentation -Wundef -fPIC I, [2024-05-10T15:30:30.922419 #971188] INFO -- : XCFLAGS = -U_FORTIFY_SOURCE -D_FORTIFY_SOURCE=2 -fstack-protector-strong -fno-strict-overflow -fvisibility=hidden -fexcess-precision=standard -DRUBY_EXPORT -I. -I.ext/include/x86_64-linux -I/tmp/ruby/src/trunk/include -I/tmp/ruby/src/trunk -I/tmp/ruby/src/trunk/prism -I/tmp/ruby/src/trunk/enc/unicode/15.0.0 I, [2024-05-10T15:30:30.922429 #971188] INFO -- : CPPFLAGS = I, [2024-05-10T15:30:30.922437 #971188] INFO -- : DLDFLAGS = -Wl,--compress-debug-sections=zlib -Wl,-soname,libruby.so.3.4 -fstack-protector-strong I, [2024-05-10T15:30:30.922445 #971188] INFO -- : SOLIBS = -lz -lrt -lrt -lgmp -ldl -lcrypt -lm -lpthread I, [2024-05-10T15:30:30.922452 #971188] INFO -- : LANG = C.UTF-8 I, [2024-05-10T15:30:30.922459 #971188] INFO -- : LC_ALL = I, [2024-05-10T15:30:30.922467 #971188] INFO -- : LC_CTYPE = I, [2024-05-10T15:30:30.922474 #971188] INFO -- : MFLAGS = I, [2024-05-10T15:30:30.922480 #971188] INFO -- : RUSTC = rustc I, [2024-05-10T15:30:30.922490 #971188] INFO -- : YJIT_RUSTC_ARGS = --crate-name=yjit --crate-type=staticlib --edition=2021 -g -C lto=thin -C opt-level=3 -C overflow-checks=on '--out-dir=/tmp/ruby/build/trunk/yjit/target/release/' /tmp/ruby/src/trunk/yjit/src/lib.rs I, [2024-05-10T15:30:30.922910 #971188] INFO -- : gcc (Ubuntu 11.4.0-1ubuntu1~22.04) 11.4.0 I, [2024-05-10T15:30:30.922931 #971188] INFO -- : Copyright (C) 2021 Free Software Foundation, Inc. I, [2024-05-10T15:30:30.922947 #971188] INFO -- : This is free software; see the source for copying conditions. There is NO I, [2024-05-10T15:30:30.922965 #971188] INFO -- : warranty; not even for MERCHANTABILITY or FITNESS FOR A PARTICULAR PURPOSE. I, [2024-05-10T15:30:30.922973 #971188] INFO -- : I, [2024-05-10T15:30:31.112026 #971188] INFO -- : Checking leaked global symbols...none I, [2024-05-10T15:30:31.224152 #971188] INFO -- : /tmp/ruby/src/trunk/basictest/test.rb:assignment ....................................................................................................................................................................................................................................................................................................................................................................................OK 372 I, [2024-05-10T15:30:31.224206 #971188] INFO -- : /tmp/ruby/src/trunk/basictest/test.rb:condition ..OK 2 I, [2024-05-10T15:30:31.224218 #971188] INFO -- : /tmp/ruby/src/trunk/basictest/test.rb:if/unless ...OK 3 I, [2024-05-10T15:30:31.224228 #971188] INFO -- : /tmp/ruby/src/trunk/basictest/test.rb:case .....OK 5 I, [2024-05-10T15:30:31.224526 #971188] INFO -- : /tmp/ruby/src/trunk/basictest/test.rb:while/until ........OK 8 I, [2024-05-10T15:30:31.224592 #971188] INFO -- : /tmp/ruby/src/trunk/basictest/test.rb:exception ..........OK 10 I, [2024-05-10T15:30:31.224864 #971188] INFO -- : /tmp/ruby/src/trunk/basictest/test.rb:array .......................................OK 39 I, [2024-05-10T15:30:31.225039 #971188] INFO -- : /tmp/ruby/src/trunk/basictest/test.rb:hash ...........................OK 27 I, [2024-05-10T15:30:31.225924 #971188] INFO -- : /tmp/ruby/src/trunk/basictest/test.rb:iterator ...........................................................................................................OK 107 I, [2024-05-10T15:30:31.226221 #971188] INFO -- : /tmp/ruby/src/trunk/basictest/test.rb:float ................................................................................OK 80 I, [2024-05-10T15:30:31.227147 #971188] INFO -- : /tmp/ruby/src/trunk/basictest/test.rb:bignum ...............................OK 31 I, [2024-05-10T15:30:31.228085 #971188] INFO -- : /tmp/ruby/src/trunk/basictest/test.rb:string & char ..............................................................OK 62 I, [2024-05-10T15:30:31.228117 #971188] INFO -- : /tmp/ruby/src/trunk/basictest/test.rb:assignment ..........OK 10 I, [2024-05-10T15:30:31.228150 #971188] INFO -- : /tmp/ruby/src/trunk/basictest/test.rb:call ......OK 6 I, [2024-05-10T15:30:31.228209 #971188] INFO -- : /tmp/ruby/src/trunk/basictest/test.rb:proc .........OK 9 I, [2024-05-10T15:30:31.328953 #971188] INFO -- : /tmp/ruby/src/trunk/basictest/test.rb:signal ..OK 2 I, [2024-05-10T15:30:31.329775 #971188] INFO -- : /tmp/ruby/src/trunk/basictest/test.rb:eval ...........................OK 27 I, [2024-05-10T15:30:31.538740 #971188] INFO -- : /tmp/ruby/src/trunk/basictest/test.rb:system ........OK 8 I, [2024-05-10T15:30:31.538807 #971188] INFO -- : /tmp/ruby/src/trunk/basictest/test.rb:const .....OK 5 I, [2024-05-10T15:30:31.538884 #971188] INFO -- : /tmp/ruby/src/trunk/basictest/test.rb:clone .....OK 5 I, [2024-05-10T15:30:31.539057 #971188] INFO -- : /tmp/ruby/src/trunk/basictest/test.rb:marshal ....OK 4 I, [2024-05-10T15:30:31.539122 #971188] INFO -- : /tmp/ruby/src/trunk/basictest/test.rb:pack ....OK 4 I, [2024-05-10T15:30:31.539137 #971188] INFO -- : /tmp/ruby/src/trunk/basictest/test.rb:math ..OK 2 I, [2024-05-10T15:30:31.539199 #971188] INFO -- : /tmp/ruby/src/trunk/basictest/test.rb:struct ......OK 6 I, [2024-05-10T15:30:31.539311 #971188] INFO -- : /tmp/ruby/src/trunk/basictest/test.rb:variable ............OK 12 I, [2024-05-10T15:30:31.539334 #971188] INFO -- : /tmp/ruby/src/trunk/basictest/test.rb:trace ...OK 3 I, [2024-05-10T15:30:31.539409 #971188] INFO -- : /tmp/ruby/src/trunk/basictest/test.rb:defined? ............OK 12 I, [2024-05-10T15:30:31.539468 #971188] INFO -- : /tmp/ruby/src/trunk/basictest/test.rb:alias ......OK 6 I, [2024-05-10T15:30:31.539882 #971188] INFO -- : /tmp/ruby/src/trunk/basictest/test.rb:path .......................OK 23 I, [2024-05-10T15:30:31.634807 #971188] INFO -- : /tmp/ruby/src/trunk/basictest/test.rb:gc ....OK 4 I, [2024-05-10T15:30:31.637305 #971188] INFO -- : I, [2024-05-10T15:30:31.637338 #971188] INFO -- : test succeeded I, [2024-05-10T15:30:31.639414 #971188] INFO -- : $$$[end] "make yes-test-basic TESTS='-j16'" exit with 0. I, [2024-05-10T15:30:31.639633 #971188] INFO -- : $$$[beg] make yes-test-all TESTOPTS='--stderr-on-failure' TESTS='-j16' I, [2024-05-10T15:30:31.777048 #971188] INFO -- : BASERUBY = /usr/bin/ruby --disable=gems I, [2024-05-10T15:30:31.777106 #971188] INFO -- : CC = gcc I, [2024-05-10T15:30:31.777118 #971188] INFO -- : LD = ld I, [2024-05-10T15:30:31.777127 #971188] INFO -- : LDSHARED = gcc -shared I, [2024-05-10T15:30:31.777135 #971188] INFO -- : CFLAGS = -O3 -fno-fast-math -ggdb3 -Wall -Wextra -Wdeprecated-declarations -Wdiv-by-zero -Wduplicated-cond -Wimplicit-function-declaration -Wimplicit-int -Wpointer-arith -Wwrite-strings -Wold-style-definition -Wimplicit-fallthrough=0 -Wmissing-noreturn -Wno-cast-function-type -Wno-constant-logical-operand -Wno-long-long -Wno-missing-field-initializers -Wno-overlength-strings -Wno-packed-bitfield-compat -Wno-parentheses-equality -Wno-self-assign -Wno-tautological-compare -Wno-unused-parameter -Wno-unused-value -Wsuggest-attribute=format -Wsuggest-attribute=noreturn -Wunused-variable -Wmisleading-indentation -Wundef -fPIC I, [2024-05-10T15:30:31.777149 #971188] INFO -- : XCFLAGS = -U_FORTIFY_SOURCE -D_FORTIFY_SOURCE=2 -fstack-protector-strong -fno-strict-overflow -fvisibility=hidden -fexcess-precision=standard -DRUBY_EXPORT -I. -I.ext/include/x86_64-linux -I/tmp/ruby/src/trunk/include -I/tmp/ruby/src/trunk -I/tmp/ruby/src/trunk/prism -I/tmp/ruby/src/trunk/enc/unicode/15.0.0 I, [2024-05-10T15:30:31.777161 #971188] INFO -- : CPPFLAGS = I, [2024-05-10T15:30:31.777170 #971188] INFO -- : DLDFLAGS = -Wl,--compress-debug-sections=zlib -Wl,-soname,libruby.so.3.4 -fstack-protector-strong I, [2024-05-10T15:30:31.777179 #971188] INFO -- : SOLIBS = -lz -lrt -lrt -lgmp -ldl -lcrypt -lm -lpthread I, [2024-05-10T15:30:31.777187 #971188] INFO -- : LANG = C.UTF-8 I, [2024-05-10T15:30:31.777194 #971188] INFO -- : LC_ALL = I, [2024-05-10T15:30:31.777202 #971188] INFO -- : LC_CTYPE = I, [2024-05-10T15:30:31.777209 #971188] INFO -- : MFLAGS = I, [2024-05-10T15:30:31.777217 #971188] INFO -- : RUSTC = rustc I, [2024-05-10T15:30:31.777227 #971188] INFO -- : YJIT_RUSTC_ARGS = --crate-name=yjit --crate-type=staticlib --edition=2021 -g -C lto=thin -C opt-level=3 -C overflow-checks=on '--out-dir=/tmp/ruby/build/trunk/yjit/target/release/' /tmp/ruby/src/trunk/yjit/src/lib.rs I, [2024-05-10T15:30:31.777728 #971188] INFO -- : gcc (Ubuntu 11.4.0-1ubuntu1~22.04) 11.4.0 I, [2024-05-10T15:30:31.777751 #971188] INFO -- : Copyright (C) 2021 Free Software Foundation, Inc. I, [2024-05-10T15:30:31.777768 #971188] INFO -- : This is free software; see the source for copying conditions. There is NO I, [2024-05-10T15:30:31.777783 #971188] INFO -- : warranty; not even for MERCHANTABILITY or FITNESS FOR A PARTICULAR PURPOSE. I, [2024-05-10T15:30:31.777792 #971188] INFO -- : I, [2024-05-10T15:30:31.779614 #971188] INFO -- : generating enc.mk I, [2024-05-10T15:30:31.932590 #971188] INFO -- : making enc I, [2024-05-10T15:30:31.987280 #971188] INFO -- : make[1]: Entering directory '/tmp/ruby/build/trunk' I, [2024-05-10T15:30:31.987306 #971188] INFO -- : make[1]: Nothing to be done for 'enc'. I, [2024-05-10T15:30:31.987323 #971188] INFO -- : make[1]: Leaving directory '/tmp/ruby/build/trunk' I, [2024-05-10T15:30:31.987900 #971188] INFO -- : making srcs under enc I, [2024-05-10T15:30:32.016592 #971188] INFO -- : make[1]: Entering directory '/tmp/ruby/build/trunk' I, [2024-05-10T15:30:32.016615 #971188] INFO -- : make[1]: Nothing to be done for 'srcs'. I, [2024-05-10T15:30:32.016625 #971188] INFO -- : make[1]: Leaving directory '/tmp/ruby/build/trunk' I, [2024-05-10T15:30:32.017564 #971188] INFO -- : generating transdb.h I, [2024-05-10T15:30:32.151402 #971188] INFO -- : transdb.h unchanged I, [2024-05-10T15:30:32.152633 #971188] INFO -- : making trans I, [2024-05-10T15:30:32.186118 #971188] INFO -- : make[1]: Entering directory '/tmp/ruby/build/trunk' I, [2024-05-10T15:30:32.186142 #971188] INFO -- : make[1]: Nothing to be done for 'trans'. I, [2024-05-10T15:30:32.186153 #971188] INFO -- : make[1]: Leaving directory '/tmp/ruby/build/trunk' I, [2024-05-10T15:30:32.186714 #971188] INFO -- : making encs I, [2024-05-10T15:30:32.223132 #971188] INFO -- : make[1]: Entering directory '/tmp/ruby/build/trunk' I, [2024-05-10T15:30:32.223154 #971188] INFO -- : make[1]: Nothing to be done for 'encs'. I, [2024-05-10T15:30:32.223165 #971188] INFO -- : make[1]: Leaving directory '/tmp/ruby/build/trunk' I, [2024-05-10T15:30:32.226320 #971188] INFO -- : generating makefiles ext/configure-ext.mk I, [2024-05-10T15:30:32.253186 #971188] INFO -- : ext/configure-ext.mk updated I, [2024-05-10T15:30:32.255840 #971188] INFO -- : make[1]: Entering directory '/tmp/ruby/build/trunk' I, [2024-05-10T15:30:33.748805 #971188] INFO -- : make[1]: Leaving directory '/tmp/ruby/build/trunk' I, [2024-05-10T15:30:33.749521 #971188] INFO -- : generating makefile exts.mk I, [2024-05-10T15:30:33.827100 #971188] INFO -- : exts.mk unchanged I, [2024-05-10T15:30:33.831544 #971188] INFO -- : make[1]: Entering directory '/tmp/ruby/build/trunk' I, [2024-05-10T15:30:34.358020 #971188] INFO -- : make[2]: Entering directory '/tmp/ruby/build/trunk/ext/coverage' I, [2024-05-10T15:30:34.360724 #971188] INFO -- : make[2]: Leaving directory '/tmp/ruby/build/trunk/ext/coverage' I, [2024-05-10T15:30:34.368089 #971188] INFO -- : make[2]: Entering directory '/tmp/ruby/build/trunk/ext/date' I, [2024-05-10T15:30:34.371688 #971188] INFO -- : make[2]: Leaving directory '/tmp/ruby/build/trunk/ext/date' I, [2024-05-10T15:30:34.374012 #971188] INFO -- : make[2]: Entering directory '/tmp/ruby/build/trunk/ext/digest' I, [2024-05-10T15:30:34.380092 #971188] INFO -- : make[2]: Leaving directory '/tmp/ruby/build/trunk/ext/digest' I, [2024-05-10T15:30:34.418364 #971188] INFO -- : make[2]: Entering directory '/tmp/ruby/build/trunk/ext/digest/sha2' I, [2024-05-10T15:30:34.421771 #971188] INFO -- : make[2]: Leaving directory '/tmp/ruby/build/trunk/ext/digest/sha2' I, [2024-05-10T15:30:34.438080 #971188] INFO -- : make[2]: Entering directory '/tmp/ruby/build/trunk/ext/fiddle' I, [2024-05-10T15:30:34.444233 #971188] INFO -- : make[2]: Leaving directory '/tmp/ruby/build/trunk/ext/fiddle' I, [2024-05-10T15:30:34.451159 #971188] INFO -- : make[2]: Entering directory '/tmp/ruby/build/trunk/ext/io/console' I, [2024-05-10T15:30:34.454304 #971188] INFO -- : make[2]: Leaving directory '/tmp/ruby/build/trunk/ext/io/console' I, [2024-05-10T15:30:34.463130 #971188] INFO -- : make[2]: Entering directory '/tmp/ruby/build/trunk/ext/json' I, [2024-05-10T15:30:34.472962 #971188] INFO -- : make[2]: Leaving directory '/tmp/ruby/build/trunk/ext/json' I, [2024-05-10T15:30:34.500003 #971188] INFO -- : make[2]: Entering directory '/tmp/ruby/build/trunk/ext/monitor' I, [2024-05-10T15:30:34.503252 #971188] INFO -- : make[2]: Leaving directory '/tmp/ruby/build/trunk/ext/monitor' I, [2024-05-10T15:30:34.516276 #971188] INFO -- : make[2]: Entering directory '/tmp/ruby/build/trunk/ext/objspace' I, [2024-05-10T15:30:34.521100 #971188] INFO -- : make[2]: Leaving directory '/tmp/ruby/build/trunk/ext/objspace' I, [2024-05-10T15:30:34.532406 #971188] INFO -- : make[2]: Entering directory '/tmp/ruby/build/trunk/ext/openssl' I, [2024-05-10T15:30:34.545004 #971188] INFO -- : make[2]: Leaving directory '/tmp/ruby/build/trunk/ext/openssl' I, [2024-05-10T15:30:34.550599 #971188] INFO -- : make[2]: Entering directory '/tmp/ruby/build/trunk/ext/pathname' I, [2024-05-10T15:30:34.554331 #971188] INFO -- : make[2]: Leaving directory '/tmp/ruby/build/trunk/ext/pathname' I, [2024-05-10T15:30:34.558460 #971188] INFO -- : make[2]: Entering directory '/tmp/ruby/build/trunk/ext/psych' I, [2024-05-10T15:30:34.589405 #971188] INFO -- : make[2]: Leaving directory '/tmp/ruby/build/trunk/ext/psych' I, [2024-05-10T15:30:34.597195 #971188] INFO -- : make[2]: Entering directory '/tmp/ruby/build/trunk/ext/pty' I, [2024-05-10T15:30:34.601021 #971188] INFO -- : make[2]: Leaving directory '/tmp/ruby/build/trunk/ext/pty' I, [2024-05-10T15:30:34.621986 #971188] INFO -- : make[2]: Entering directory '/tmp/ruby/build/trunk/ext/ripper' I, [2024-05-10T15:30:34.628462 #971188] INFO -- : make[2]: Leaving directory '/tmp/ruby/build/trunk/ext/ripper' I, [2024-05-10T15:30:34.631296 #971188] INFO -- : make[2]: Entering directory '/tmp/ruby/build/trunk/ext/rubyvm' I, [2024-05-10T15:30:34.633261 #971188] INFO -- : make[2]: Leaving directory '/tmp/ruby/build/trunk/ext/rubyvm' I, [2024-05-10T15:30:34.659078 #971188] INFO -- : make[2]: Entering directory '/tmp/ruby/build/trunk/ext/socket' I, [2024-05-10T15:30:34.665911 #971188] INFO -- : make[2]: Leaving directory '/tmp/ruby/build/trunk/ext/socket' I, [2024-05-10T15:30:34.701403 #971188] INFO -- : make[2]: Entering directory '/tmp/ruby/build/trunk/.bundle/gems/bigdecimal-3.1.8/ext/bigdecimal' I, [2024-05-10T15:30:34.724694 #971188] INFO -- : make[2]: Leaving directory '/tmp/ruby/build/trunk/.bundle/gems/bigdecimal-3.1.8/ext/bigdecimal' I, [2024-05-10T15:30:34.729763 #971188] INFO -- : make[2]: Entering directory '/tmp/ruby/build/trunk/.bundle/gems/debug-1.9.2/ext/debug' I, [2024-05-10T15:30:34.789303 #971188] INFO -- : make[2]: Leaving directory '/tmp/ruby/build/trunk/.bundle/gems/debug-1.9.2/ext/debug' I, [2024-05-10T15:30:34.795249 #971188] INFO -- : make[2]: Entering directory '/tmp/ruby/build/trunk/.bundle/gems/nkf-0.2.0/ext/nkf' I, [2024-05-10T15:30:34.817923 #971188] INFO -- : make[2]: Leaving directory '/tmp/ruby/build/trunk/.bundle/gems/nkf-0.2.0/ext/nkf' I, [2024-05-10T15:30:34.819733 #971188] INFO -- : make[2]: Entering directory '/tmp/ruby/build/trunk/.bundle/gems/racc-1.7.3/ext/racc/cparse' I, [2024-05-10T15:30:34.841861 #971188] INFO -- : make[2]: Leaving directory '/tmp/ruby/build/trunk/.bundle/gems/racc-1.7.3/ext/racc/cparse' I, [2024-05-10T15:30:34.845862 #971188] INFO -- : make[2]: Entering directory '/tmp/ruby/build/trunk/.bundle/gems/rbs-3.4.4/ext/rbs_extension' I, [2024-05-10T15:30:34.868431 #971188] INFO -- : make[2]: Leaving directory '/tmp/ruby/build/trunk/.bundle/gems/rbs-3.4.4/ext/rbs_extension' I, [2024-05-10T15:30:34.871085 #971188] INFO -- : make[2]: Entering directory '/tmp/ruby/build/trunk/.bundle/gems/syslog-0.1.2/ext/syslog' I, [2024-05-10T15:30:34.893010 #971188] INFO -- : make[2]: Leaving directory '/tmp/ruby/build/trunk/.bundle/gems/syslog-0.1.2/ext/syslog' I, [2024-05-10T15:30:34.952906 #971188] INFO -- : make[2]: Entering directory '/tmp/ruby/build/trunk' I, [2024-05-10T15:30:35.031291 #971188] INFO -- : make[2]: 'ruby' is up to date. I, [2024-05-10T15:30:35.031336 #971188] INFO -- : make[2]: Leaving directory '/tmp/ruby/build/trunk' I, [2024-05-10T15:30:35.031546 #971188] INFO -- : make[1]: Leaving directory '/tmp/ruby/build/trunk' I, [2024-05-10T15:30:35.035618 #971188] INFO -- : make[1]: Entering directory '/tmp/ruby/build/trunk' I, [2024-05-10T15:30:35.035685 #971188] INFO -- : make[1]: Nothing to be done for 'note'. I, [2024-05-10T15:30:35.035716 #971188] INFO -- : make[1]: Leaving directory '/tmp/ruby/build/trunk' I, [2024-05-10T15:30:35.120543 #971188] INFO -- : Run options: I, [2024-05-10T15:30:35.120631 #971188] INFO -- : --seed=37290 I, [2024-05-10T15:30:35.120643 #971188] INFO -- : "--ruby=./miniruby -I/tmp/ruby/src/trunk/lib -I. -I.ext/common /tmp/ruby/src/trunk/tool/runruby.rb --extout=.ext -- --disable-gems" I, [2024-05-10T15:30:35.120665 #971188] INFO -- : --excludes-dir=/tmp/ruby/src/trunk/test/.excludes I, [2024-05-10T15:30:35.120675 #971188] INFO -- : --name=!/memory_leak/ I, [2024-05-10T15:30:35.120683 #971188] INFO -- : --stderr-on-failure I, [2024-05-10T15:30:35.120691 #971188] INFO -- : -j16 I, [2024-05-10T15:30:35.120700 #971188] INFO -- : I, [2024-05-10T15:30:35.120707 #971188] INFO -- : # Running tests: I, [2024-05-10T15:30:35.120716 #971188] INFO -- : I, [2024-05-10T15:30:35.343359 #971188] INFO -- : [ 1/885] 1012534=test_gem_ext_cargo_builder_link_flag_converter I, [2024-05-10T15:30:35.343840 #971188] INFO -- : [ 2/885] 1012541=test_gem_commands_mirror I, [2024-05-10T15:30:35.344114 #971188] INFO -- : [ 3/885] 1012544=test_sprintf_comb I, [2024-05-10T15:30:35.345060 #971188] INFO -- : [ 4/885] 1012532=test_method_cache I, [2024-05-10T15:30:35.346225 #971188] INFO -- : [ 5/885] 1012535=test_gem_request I, [2024-05-10T15:30:35.346359 #971188] INFO -- : [ 6/885] 1012542=test_scan_args I, [2024-05-10T15:30:35.346968 #971188] INFO -- : [ 7/885] 1012538=test_generic I, [2024-05-10T15:30:35.347168 #971188] INFO -- : [ 8/885] 1012543=test_win32ole I, [2024-05-10T15:30:35.348305 #971188] INFO -- : [ 9/885] 1012540=test_gem_text I, [2024-05-10T15:30:35.348335 #971188] INFO -- : [ 10/885] 1012539=test_settracefunc I, [2024-05-10T15:30:35.348351 #971188] INFO -- : [ 11/885] 1012536=test_enumerator_kw I, [2024-05-10T15:30:35.348365 #971188] INFO -- : [ 12/885] 1012545=test_gem_commands_info_command I, [2024-05-10T15:30:35.348378 #971188] INFO -- : [ 13/885] 1012533=test_scalar I, [2024-05-10T15:30:35.348392 #971188] INFO -- : [ 14/885] 1012547=test_gem_dependency_installer I, [2024-05-10T15:30:35.348404 #971188] INFO -- : [ 15/885] 1012537=test_rdoc_cross_reference I, [2024-05-10T15:30:35.351410 #971188] INFO -- : [ 16/885] 1012546=test_store I, [2024-05-10T15:30:35.353911 #971188] INFO -- : [ 17/885] 1012532=test_case_options I, [2024-05-10T15:30:35.359315 #971188] INFO -- : [ 18/885] 1012536=test_exception I, [2024-05-10T15:30:35.359402 #971188] INFO -- : [ 19/885] 1012543=test_gem_package_tar_reader_entry I, [2024-05-10T15:30:35.359419 #971188] INFO -- : [ 20/885] 1012532=test_gem_name_tuple I, [2024-05-10T15:30:35.367715 #971188] INFO -- : [ 21/885] 1012542=test_rand I, [2024-05-10T15:30:35.384215 #971188] INFO -- : [ 22/885] 1012533=test_bug_reporter I, [2024-05-10T15:30:35.428105 #971188] INFO -- : [ 23/885] 1012538=test_gem_install_update_options I, [2024-05-10T15:30:35.586483 #971188] INFO -- : [ 24/885] 1012544=parse_test I, [2024-05-10T15:30:35.592089 #971188] INFO -- : [ 25/885] 1012541=test_require_lib I, [2024-05-10T15:30:35.614259 #971188] INFO -- : [ 26/885] 1012532=test_ractor I, [2024-05-10T15:30:35.626904 #971188] INFO -- : [ 27/885] 1012542=test_severity I, [2024-05-10T15:30:35.632577 #971188] INFO -- : [ 28/885] 1012546=test_extlibs I, [2024-05-10T15:30:35.638124 #971188] INFO -- : [ 29/885] 1012542=test_rdoc_generator_ri I, [2024-05-10T15:30:35.638740 #971188] INFO -- : [ 30/885] 1012532=test_gem_stream_ui I, [2024-05-10T15:30:35.643006 #971188] INFO -- : [ 31/885] 1012534=test_dot_dot I, [2024-05-10T15:30:35.645734 #971188] INFO -- : [ 32/885] 1012545=test_c_struct_builder I, [2024-05-10T15:30:35.648849 #971188] INFO -- : [ 33/885] 1012534=test_str2big I, [2024-05-10T15:30:35.657415 #971188] INFO -- : [ 34/885] 1012540=test_literal I, [2024-05-10T15:30:35.666390 #971188] INFO -- : [ 35/885] 1012534=test_objectspace I, [2024-05-10T15:30:35.738567 #971188] INFO -- : [ 36/885] 1012532=test_thread I, [2024-05-10T15:30:35.765322 #971188] INFO -- : [ 37/885] 1012545=test_socket I, [2024-05-10T15:30:35.784241 #971188] INFO -- : [ 38/885] 1012543=test_rdoc_markup_to_table_of_contents I, [2024-05-10T15:30:35.785538 #971188] INFO -- : [ 39/885] 1012542=test_parser_events I, [2024-05-10T15:30:35.800855 #971188] INFO -- : [ 40/885] 1012535=test_reline I, [2024-05-10T15:30:35.852040 #971188] INFO -- : [ 41/885] 1012538=test_case I, [2024-05-10T15:30:35.860111 #971188] INFO -- : [ 42/885] 1012538=test_pkey I, [2024-05-10T15:30:35.870562 #971188] INFO -- : [ 43/885] 1012542=test_gem_version_option I, [2024-05-10T15:30:35.894349 #971188] INFO -- : [ 44/885] 1012533=test_grapheme_breaks I, [2024-05-10T15:30:35.917549 #971188] INFO -- : [ 45/885] 1012538=test_gem_request_connection_pools I, [2024-05-10T15:30:35.949175 #971188] INFO -- : [ 46/885] 1012533=test_cclass I, [2024-05-10T15:30:35.957652 #971188] INFO -- : [ 47/885] 1012532=test_ractor I, [2024-05-10T15:30:35.991376 #971188] INFO -- : [ 48/885] 1012543=test_memory_view I, [2024-05-10T15:30:36.058584 #971188] INFO -- : [ 49/885] 1012532=test_m17n_comb I, [2024-05-10T15:30:36.058662 #971188] INFO -- : [ 50/885] 1012535=test_json_tree I, [2024-05-10T15:30:36.105851 #971188] INFO -- : [ 51/885] 1012535=test_rdoc_markup_to_markdown I, [2024-05-10T15:30:36.107772 #971188] INFO -- : [ 52/885] 1012533=test_ansi_with_terminfo I, [2024-05-10T15:30:36.117156 #971188] INFO -- : [ 53/885] 1012543=test_rdoc_generator_pot_po I, [2024-05-10T15:30:36.121084 #971188] INFO -- : [ 54/885] 1012543=test_pack I, [2024-05-10T15:30:36.131852 #971188] INFO -- : [ 55/885] 1012537=test_last_thread I, [2024-05-10T15:30:36.141906 #971188] INFO -- : [ 56/885] 1012542=test_process I, [2024-05-10T15:30:36.171968 #971188] INFO -- : [ 57/885] 1012533=test_gem_source_local I, [2024-05-10T15:30:36.336970 #971188] INFO -- : [ 58/885] 1012535=test_gem_security_policy I, [2024-05-10T15:30:36.347798 #971188] INFO -- : [ 59/885] 1012543=test_logdevice I, [2024-05-10T15:30:36.410828 #971188] INFO -- : [ 60/885] 1012540=test_arity I, [2024-05-10T15:30:36.422456 #971188] INFO -- : [ 61/885] 1012540=test_gem_ext_rake_builder I, [2024-05-10T15:30:36.516921 #971188] INFO -- : [ 62/885] 1012539=test_x509cert I, [2024-05-10T15:30:36.669729 #971188] INFO -- : [ 63/885] 1012535=test_gc I, [2024-05-10T15:30:36.696931 #971188] INFO -- : [ 64/885] 1012534=test_gem_resolver_lock_specification I, [2024-05-10T15:30:36.711582 #971188] INFO -- : [ 65/885] 1012533=test_err_in_callback I, [2024-05-10T15:30:36.719226 #971188] INFO -- : [ 66/885] 1012533=test_logperiod I, [2024-05-10T15:30:36.732091 #971188] INFO -- : [ 67/885] 1012533=test_rdoc_markdown_test I, [2024-05-10T15:30:36.761237 #971188] INFO -- : [ 68/885] 1012539=test_c_union_entity I, [2024-05-10T15:30:36.772812 #971188] INFO -- : [ 69/885] 1012534=test_rdoc_normal_module I, [2024-05-10T15:30:36.802771 #971188] INFO -- : [ 70/885] 1012539=test_securerandom I, [2024-05-10T15:30:36.853258 #971188] INFO -- : [ 71/885] 1012539=test_switch_hitter I, [2024-05-10T15:30:36.886991 #971188] INFO -- : [ 72/885] 1012539=test_flush I, [2024-05-10T15:30:36.893687 #971188] INFO -- : [ 73/885] 1012539=test_singleton I, [2024-05-10T15:30:36.897984 #971188] INFO -- : [ 74/885] 1012539=test_io_console I, [2024-05-10T15:30:36.962878 #971188] INFO -- : .Leaked thread: TestSocket#test_accept_loop: # I, [2024-05-10T15:30:36.963654 #971188] INFO -- : Finished thread: TestSocket#test_unix: # I, [2024-05-10T15:30:36.971297 #971188] INFO -- : [ 75/885] 1012538=test_stringchar I, [2024-05-10T15:30:37.060379 #971188] INFO -- : [ 76/885] 1012536=test_hash_create I, [2024-05-10T15:30:37.064324 #971188] INFO -- : [ 77/885] 1012536=newline_test I, [2024-05-10T15:30:37.089552 #971188] INFO -- : [ 78/885] 1012538=test_uncorrectable_name_check I, [2024-05-10T15:30:37.100185 #971188] INFO -- : [ 79/885] 1012538=test_thread_fd_close I, [2024-05-10T15:30:37.102560 #971188] INFO -- : [ 80/885] 1012538=test_passing_block I, [2024-05-10T15:30:37.104631 #971188] INFO -- : [ 81/885] 1012534=test_rdoc_parser_ruby I, [2024-05-10T15:30:37.108551 #971188] INFO -- : [ 82/885] 1012538=test_open-uri I, [2024-05-10T15:30:37.219303 #971188] INFO -- : [ 83/885] 1012537=test_httpresponse I, [2024-05-10T15:30:37.258256 #971188] INFO -- : [ 84/885] 1012536=test_nil2vtempty I, [2024-05-10T15:30:37.263110 #971188] INFO -- : [ 85/885] 1012536=test_stream I, [2024-05-10T15:30:37.303175 #971188] INFO -- : [ 86/885] 1012536=test_rdoc_context I, [2024-05-10T15:30:37.335026 #971188] INFO -- : [ 87/885] 1012543=test_rdoc_text I, [2024-05-10T15:30:37.337739 #971188] INFO -- : [ 88/885] 1012537=test_tcp I, [2024-05-10T15:30:37.381779 #971188] INFO -- : [ 89/885] 1012540=test_iso_8859 I, [2024-05-10T15:30:37.404410 #971188] INFO -- : [ 90/885] 1012543=test_require I, [2024-05-10T15:30:37.410984 #971188] INFO -- : [ 91/885] 1012545=test_date_time I, [2024-05-10T15:30:37.412373 #971188] INFO -- : [ 92/885] 1012543=test_rdoc_markup_to_joined_paragraph I, [2024-05-10T15:30:37.417036 #971188] INFO -- : [ 93/885] 1012543=test_data I, [2024-05-10T15:30:37.420014 #971188] INFO -- : [ 94/885] 1012540=test_date_new I, [2024-05-10T15:30:37.426318 #971188] INFO -- : [ 95/885] 1012543=index_write_test I, [2024-05-10T15:30:37.427717 #971188] INFO -- : [ 96/885] 1012545=test_syntax I, [2024-05-10T15:30:37.432935 #971188] INFO -- : [ 97/885] 1012540=test_gem_safe_yaml I, [2024-05-10T15:30:37.445667 #971188] INFO -- : [ 98/885] 1012540=test_flags I, [2024-05-10T15:30:37.448098 #971188] INFO -- : [ 99/885] 1012537=test_inadvertent_creation I, [2024-05-10T15:30:37.547801 #971188] INFO -- : [100/885] 1012543=test_enumerator I, [2024-05-10T15:30:37.609906 #971188] INFO -- : [101/885] 1012537=test_http I, [2024-05-10T15:30:37.615989 #971188] INFO -- : [102/885] 1012537=test_gem_commands_which_command I, [2024-05-10T15:30:37.685263 #971188] INFO -- : [103/885] 1012538=test_shift_jis I, [2024-05-10T15:30:37.688293 #971188] INFO -- : [104/885] 1012538=test_gem_commands_specification_command I, [2024-05-10T15:30:37.732634 #971188] INFO -- : [105/885] 1012534=test_gem_resolver I, [2024-05-10T15:30:37.861174 #971188] INFO -- : [106/885] 1012538=test_safe_load I, [2024-05-10T15:30:37.880725 #971188] INFO -- : [107/885] 1012538=test_gem_resolver_composed_set I, [2024-05-10T15:30:37.889084 #971188] INFO -- : [108/885] 1012537=test_gem_commands_dependency_command I, [2024-05-10T15:30:37.890917 #971188] INFO -- : [109/885] 1012538=test_rdoc_markup_attribute_manager I, [2024-05-10T15:30:37.921541 #971188] INFO -- : [110/885] 1012546=test_name_error I, [2024-05-10T15:30:38.008907 #971188] INFO -- : [111/885] 1012537=test_rdoc_markup_paragraph I, [2024-05-10T15:30:38.012994 #971188] INFO -- : [112/885] 1012534=!Nothing_to_test I, [2024-05-10T15:30:38.014869 #971188] INFO -- : [113/885] 1012534=test_enc_raise I, [2024-05-10T15:30:38.017972 #971188] INFO -- : [114/885] 1012537=test_psych I, [2024-05-10T15:30:38.021455 #971188] INFO -- : [115/885] 1012534=test_object_create_start I, [2024-05-10T15:30:38.024220 #971188] INFO -- : [116/885] 1012534=test_gem_ext_cargo_builder_unit I, [2024-05-10T15:30:38.042109 #971188] INFO -- : [117/885] 1012546=test_gem_rdoc I, [2024-05-10T15:30:38.046991 #971188] INFO -- : [118/885] 1012537=test_date I, [2024-05-10T15:30:38.050608 #971188] INFO -- : [119/885] 1012534=test_at_exit I, [2024-05-10T15:30:38.064935 #971188] INFO -- : [120/885] 1012537=test_command I, [2024-05-10T15:30:38.075285 #971188] INFO -- : [121/885] 1012534=test_files_ext I, [2024-05-10T15:30:38.125217 #971188] INFO -- : [122/885] 1012538=test_bug-5832 I, [2024-05-10T15:30:38.130481 #971188] INFO -- : [123/885] 1012538=test_gem_silent_ui I, [2024-05-10T15:30:38.183969 #971188] INFO -- : [124/885] 1012538=test_emitter I, [2024-05-10T15:30:38.189925 #971188] INFO -- : [125/885] 1012538=test_gem_doctor I, [2024-05-10T15:30:38.192924 #971188] INFO -- : [126/885] 1012534=test_kdf I, [2024-05-10T15:30:38.241400 #971188] INFO -- : [127/885] 1012533=test_eval_history I, [2024-05-10T15:30:38.244999 #971188] INFO -- : [128/885] 1012538=dispatcher_test I, [2024-05-10T15:30:38.277525 #971188] INFO -- : [129/885] 1012534=test_kernel I, [2024-05-10T15:30:38.329342 #971188] INFO -- : [130/885] 1012533=test_address_resolve I, [2024-05-10T15:30:38.354507 #971188] INFO -- : [131/885] 1012533=test_rdoc_token_stream I, [2024-05-10T15:30:38.365947 #971188] INFO -- : [132/885] 1012533=test_config I, [2024-05-10T15:30:38.382751 #971188] INFO -- : [133/885] 1012538=test_yaml_special_cases I, [2024-05-10T15:30:38.398640 #971188] INFO -- : [134/885] 1012538=test_optarg I, [2024-05-10T15:30:38.420067 #971188] INFO -- : [135/885] 1012533=test_gem_source_list I, [2024-05-10T15:30:38.492555 #971188] INFO -- : [136/885] 1012533=test_frozen I, [2024-05-10T15:30:38.492903 #971188] INFO -- : [137/885] 1012536=test_gem_ext_configure_builder I, [2024-05-10T15:30:38.493522 #971188] INFO -- : [138/885] 1012533=test_pp I, [2024-05-10T15:30:38.542565 #971188] INFO -- : [139/885] 1012547=test_macro I, [2024-05-10T15:30:38.554160 #971188] INFO -- : [140/885] 1012537=test_nil I, [2024-05-10T15:30:38.559381 #971188] INFO -- : [141/885] 1012537=test_num2int I, [2024-05-10T15:30:38.564385 #971188] INFO -- : [142/885] 1012538=test_rdoc_single_class I, [2024-05-10T15:30:38.567741 #971188] INFO -- : [143/885] 1012546=test_verbose I, [2024-05-10T15:30:38.568016 #971188] INFO -- : [144/885] 1012537=test_iter_break I, [2024-05-10T15:30:38.572399 #971188] INFO -- : [145/885] 1012537=test_zsh_completion I, [2024-05-10T15:30:38.575120 #971188] INFO -- : [146/885] 1012538=test_exception I, [2024-05-10T15:30:38.575207 #971188] INFO -- : [147/885] 1012537=test_hmac I, [2024-05-10T15:30:38.584569 #971188] INFO -- : [148/885] 1012537=test_rdoc_markup_to_tt_only I, [2024-05-10T15:30:38.585510 #971188] INFO -- : [149/885] 1012538=test_rdoc_tom_doc I, [2024-05-10T15:30:38.588216 #971188] INFO -- : [150/885] 1012533=test_gem_commands_lock_command I, [2024-05-10T15:30:38.601107 #971188] INFO -- : [151/885] 1012546=test_assignment I, [2024-05-10T15:30:38.612028 #971188] INFO -- : [152/885] 1012538=test_ifunless I, [2024-05-10T15:30:38.615770 #971188] INFO -- : [153/885] 1012538=test_numeric I, [2024-05-10T15:30:38.616998 #971188] INFO -- : [154/885] 1012533=test_gem_spec_fetcher I, [2024-05-10T15:30:38.617495 #971188] INFO -- : [155/885] 1012547=test_common I, [2024-05-10T15:30:38.621678 #971188] INFO -- : [156/885] 1012537=test_bug-3571 I, [2024-05-10T15:30:38.649512 #971188] INFO -- : [157/885] 1012537=test_key_actor_vi I, [2024-05-10T15:30:38.695311 #971188] INFO -- : [158/885] 1012540=test_gem_command I, [2024-05-10T15:30:38.715774 #971188] INFO -- : [159/885] 1012538=test_string I, [2024-05-10T15:30:38.740567 #971188] INFO -- : [160/885] 1012538=test_rdoc_stats I, [2024-05-10T15:30:38.773281 #971188] INFO -- : [161/885] 1012537=test_pattern_matching I, [2024-05-10T15:30:38.804360 #971188] INFO -- : [162/885] 1012533=test_x509attr I, [2024-05-10T15:30:38.809768 #971188] INFO -- : [163/885] 1012536=test_raise I, [2024-05-10T15:30:38.811019 #971188] INFO -- : [164/885] 1012536=test_depth_first I, [2024-05-10T15:30:38.816503 #971188] INFO -- : [165/885] 1012536=test_gem_request_set_lockfile_parser I, [2024-05-10T15:30:38.820832 #971188] INFO -- : [166/885] 1012537=test_rdoc_store I, [2024-05-10T15:30:38.822556 #971188] INFO -- : [167/885] 1012540=test_custom_command I, [2024-05-10T15:30:38.825467 #971188] INFO -- : [168/885] 1012538=json_addition_test I, [2024-05-10T15:30:38.843488 #971188] INFO -- : [169/885] 1012533=test_gem_dependency_resolution_error I, [2024-05-10T15:30:38.850776 #971188] INFO -- : [170/885] 1012533=test_qsort I, [2024-05-10T15:30:38.856833 #971188] INFO -- : [171/885] 1012533=test_rdoc_parser I, [2024-05-10T15:30:38.864055 #971188] INFO -- : [172/885] 1012538=test_date_conv I, [2024-05-10T15:30:38.870773 #971188] INFO -- : [173/885] 1012538=test_optimization I, [2024-05-10T15:30:38.906343 #971188] INFO -- : [174/885] 1012533=test_ole_methods I, [2024-05-10T15:30:38.916959 #971188] INFO -- : [175/885] 1012533=test_erb_m17n I, [2024-05-10T15:30:38.921950 #971188] INFO -- : [176/885] 1012533=test_egrep_cpp I, [2024-05-10T15:30:38.937905 #971188] INFO -- : [177/885] 1012547=test_zlib I, [2024-05-10T15:30:38.961820 #971188] INFO -- : [178/885] 1012536=test_cgi_tag_helper I, [2024-05-10T15:30:38.988246 #971188] INFO -- : [179/885] 1012540=test_gem_package_old I, [2024-05-10T15:30:38.990824 #971188] INFO -- : [180/885] 1012536=test_gem_resolver_index_set I, [2024-05-10T15:30:38.992451 #971188] INFO -- : [181/885] 1012534=test_gc_compact I, [2024-05-10T15:30:39.025562 #971188] INFO -- : [182/885] 1012540=test_string I, [2024-05-10T15:30:39.035177 #971188] INFO -- : [183/885] 1012536=test_proc I, [2024-05-10T15:30:39.105878 #971188] INFO -- : [184/885] 1012533=test_gem_validator I, [2024-05-10T15:30:39.137337 #971188] INFO -- : [185/885] 1012533=test_files_test_2 I, [2024-05-10T15:30:39.150627 #971188] INFO -- : [186/885] 1012532=test_fnmatch I, [2024-05-10T15:30:39.201736 #971188] INFO -- : [187/885] 1012532=test_rdoc_markup_parser I, [2024-05-10T15:30:39.291379 #971188] INFO -- : [188/885] 1012544=test_require_path_check I, [2024-05-10T15:30:39.375218 #971188] INFO -- : [189/885] 1012544=test_folderitem2_invokeverb I, [2024-05-10T15:30:39.378240 #971188] INFO -- : [190/885] 1012544=test_rdoc_i18n_text I, [2024-05-10T15:30:39.411249 #971188] INFO -- : [191/885] 1012532=test_io_buffer I, [2024-05-10T15:30:39.448107 #971188] INFO -- : [192/885] 1012532=test_key_name_check I, [2024-05-10T15:30:39.465196 #971188] INFO -- : [193/885] 1012532=test_backtrace I, [2024-05-10T15:30:39.465893 #971188] INFO -- : [194/885] 1012532=test_defined I, [2024-05-10T15:30:39.542803 #971188] INFO -- : [195/885] 1012544=test_rdoc_rdoc I, [2024-05-10T15:30:39.549406 #971188] INFO -- : [196/885] 1012532=test_time I, [2024-05-10T15:30:39.596284 #971188] INFO -- : [197/885] 1012539=test_windows_1251 I, [2024-05-10T15:30:39.608069 #971188] INFO -- : [198/885] 1012539=test_gb18030 I, [2024-05-10T15:30:39.610070 #971188] INFO -- : [199/885] 1012539=test_buffering I, [2024-05-10T15:30:39.614300 #971188] INFO -- : [200/885] 1012539=test_svcb_https I, [2024-05-10T15:30:39.627559 #971188] INFO -- : [201/885] 1012537=test_gem_uninstaller I, [2024-05-10T15:30:39.645249 #971188] INFO -- : [202/885] 1012539=test_default_gems I, [2024-05-10T15:30:39.714077 #971188] INFO -- : [203/885] 1012544=test_rdoc_markup_to_rdoc I, [2024-05-10T15:30:39.728505 #971188] INFO -- : [204/885] 1012539=test_rdoc_rd_inline_parser I, [2024-05-10T15:30:39.739542 #971188] INFO -- : [205/885] 1012532=test_mul I, [2024-05-10T15:30:39.746636 #971188] INFO -- : [206/885] 1012532=test_null I, [2024-05-10T15:30:39.766658 #971188] INFO -- : [207/885] 1012544=test_win32ole_type I, [2024-05-10T15:30:39.771568 #971188] INFO -- : [208/885] 1012544=test_rdoc_markup_attributes I, [2024-05-10T15:30:39.772302 #971188] INFO -- : [209/885] 1012532=test_date_parse I, [2024-05-10T15:30:39.776597 #971188] INFO -- : [210/885] 1012544=test_pkey_ec I, [2024-05-10T15:30:39.889840 #971188] INFO -- : [211/885] 1012541=test_thread I, [2024-05-10T15:30:39.890006 #971188] INFO -- : [212/885] 1012541=test_trick I, [2024-05-10T15:30:39.904259 #971188] INFO -- : [213/885] 1012544=test_pipe I, [2024-05-10T15:30:39.984380 #971188] INFO -- : [214/885] 1012532=test_yaml_tree I, [2024-05-10T15:30:39.993526 #971188] INFO -- : [215/885] 1012539=test_config I, [2024-05-10T15:30:40.057090 #971188] INFO -- : [216/885] 1012532=test_sleep I, [2024-05-10T15:30:40.083473 #971188] INFO -- : [217/885] 1012544=test_gem_commands_fetch_command I, [2024-05-10T15:30:40.123105 #971188] INFO -- : [218/885] 1012536=test_math I, [2024-05-10T15:30:40.137307 #971188] INFO -- : [219/885] 1012536=test_gc I, [2024-05-10T15:30:40.152052 #971188] INFO -- : [220/885] 1012536=test_libs I, [2024-05-10T15:30:40.178277 #971188] INFO -- : [221/885] 1012536=test_unicode_escape I, [2024-05-10T15:30:40.294025 #971188] INFO -- : [222/885] 1012536=test_io I, [2024-05-10T15:30:40.303802 #971188] INFO -- : [223/885] 1012539=test_utf16 I, [2024-05-10T15:30:40.363730 #971188] INFO -- : [224/885] 1012539=test_autoload I, [2024-05-10T15:30:40.418252 #971188] INFO -- : [225/885] 1012546=test_rendering I, [2024-05-10T15:30:40.534447 #971188] INFO -- : [226/885] 1012544=test_face I, [2024-05-10T15:30:40.577689 #971188] INFO -- : [227/885] 1012546=test_sizeof I, [2024-05-10T15:30:40.649092 #971188] INFO -- : [228/885] 1012544=test_case I, [2024-05-10T15:30:40.696806 #971188] INFO -- : [229/885] 1012544=test_pkcs12 I, [2024-05-10T15:30:40.899020 #971188] INFO -- : [230/885] 1012537=test_system I, [2024-05-10T15:30:41.087800 #971188] INFO -- : [231/885] 1012544=test_gem_util I, [2024-05-10T15:30:41.330424 #971188] INFO -- : [232/885] 1012544=test_iseq_load I, [2024-05-10T15:30:42.109836 #971188] INFO -- : [233/885] 1012532=test_gem_package_tar_header I, [2024-05-10T15:30:42.128256 #971188] INFO -- : [234/885] 1012534=test_pkey_dh I, [2024-05-10T15:30:42.162180 #971188] INFO -- : [235/885] 1012532=test_bigzero I, [2024-05-10T15:30:42.165048 #971188] INFO -- : [236/885] 1012537=test_gem_resolver_activation_request I, [2024-05-10T15:30:42.165131 #971188] INFO -- : [237/885] 1012532=test_getopts I, [2024-05-10T15:30:42.180747 #971188] INFO -- : [238/885] 1012537=test_protocol I, [2024-05-10T15:30:42.185043 #971188] INFO -- : [239/885] 1012532=test_ripper I, [2024-05-10T15:30:42.194771 #971188] INFO -- : [240/885] 1012534=test_gem_config_file I, [2024-05-10T15:30:42.386260 #971188] INFO -- : [241/885] 1012534=test_etc I, [2024-05-10T15:30:42.421065 #971188] INFO -- : [242/885] 1012541=test_yjit_exit_locations I, [2024-05-10T15:30:42.489536 #971188] INFO -- : [243/885] 1012534=test_optparse I, [2024-05-10T15:30:42.494497 #971188] INFO -- : [244/885] 1012537=test_array I, [2024-05-10T15:30:42.500066 #971188] INFO -- : [245/885] 1012537=test_fstring I, [2024-05-10T15:30:42.501740 #971188] INFO -- : [246/885] 1012541=encoding_test I, [2024-05-10T15:30:42.569410 #971188] INFO -- : [247/885] 1012547=test_gem_resolver_best_set I, [2024-05-10T15:30:42.572944 #971188] INFO -- : [248/885] 1012534=test_typeddata I, [2024-05-10T15:30:42.632466 #971188] INFO -- : [249/885] 1012547=test_rdoc_markup_to_html_crossref I, [2024-05-10T15:30:42.648523 #971188] INFO -- : [250/885] 1012537=test_rdoc_markup_raw I, [2024-05-10T15:30:42.656231 #971188] INFO -- : [251/885] 1012537=test_webauthn_poller I, [2024-05-10T15:30:42.660691 #971188] INFO -- : [252/885] 1012532=test_rat I, [2024-05-10T15:30:42.671844 #971188] INFO -- : [253/885] 1012532=test_files_sample I, [2024-05-10T15:30:42.724517 #971188] INFO -- : [254/885] 1012541=test_stringscanner I, [2024-05-10T15:30:42.800989 #971188] INFO -- : [255/885] 1012532=test_yield I, [2024-05-10T15:30:42.812500 #971188] INFO -- : [256/885] 1012541=test_rdoc_alias I, [2024-05-10T15:30:42.832567 #971188] INFO -- : [257/885] 1012537=parser_test I, [2024-05-10T15:30:42.919178 #971188] INFO -- : [258/885] 1012534=test_convertible I, [2024-05-10T15:30:42.950119 #971188] INFO -- : [259/885] 1012537=test_rdoc_task I, [2024-05-10T15:30:42.953205 #971188] INFO -- : [260/885] 1012537=test_gem_resolver_conflict I, [2024-05-10T15:30:42.958003 #971188] INFO -- : [261/885] 1012533=test_pack I, [2024-05-10T15:30:42.971510 #971188] INFO -- : [262/885] 1012537=test_backtrace I, [2024-05-10T15:30:43.001207 #971188] INFO -- : [263/885] 1012533=ruby_parser_test I, [2024-05-10T15:30:43.113078 #971188] INFO -- : [264/885] 1012533=test_io_buffer I, [2024-05-10T15:30:43.116519 #971188] INFO -- : [265/885] 1012541=test_rdoc_markup_indented_paragraph I, [2024-05-10T15:30:43.130342 #971188] INFO -- : [266/885] 1012541=test_rdoc_require I, [2024-05-10T15:30:43.144243 #971188] INFO -- : [267/885] 1012541=locals_test I, [2024-05-10T15:30:43.215428 #971188] INFO -- : [268/885] 1012544=test_readpartial I, [2024-05-10T15:30:43.249949 #971188] INFO -- : [269/885] 1012533=test_gem_commands_install_command I, [2024-05-10T15:30:43.311973 #971188] INFO -- : [270/885] 1012547=test_clone I, [2024-05-10T15:30:43.546009 #971188] INFO -- : [271/885] 1012541=test_protect I, [2024-05-10T15:30:43.550167 #971188] INFO -- : [272/885] 1012541=test_win32ole_typelib I, [2024-05-10T15:30:43.554942 #971188] INFO -- : [273/885] 1012541=test_gem_request_set_lockfile I, [2024-05-10T15:30:43.560530 #971188] INFO -- : [274/885] 1012547=test_raise_exception I, [2024-05-10T15:30:43.623135 #971188] INFO -- : [275/885] 1012544=test_alias_and_anchor I, [2024-05-10T15:30:43.636095 #971188] INFO -- : [276/885] 1012544=test_postponed_job I, [2024-05-10T15:30:44.024441 #971188] INFO -- : [277/885] 1012541=test_external_new I, [2024-05-10T15:30:44.042438 #971188] INFO -- : [278/885] 1012541=test_tree_builder I, [2024-05-10T15:30:44.048365 #971188] INFO -- : [279/885] 1012541=test_gem_resolver_dependency_request I, [2024-05-10T15:30:44.079665 #971188] INFO -- : [280/885] 1012541=test_hash I, [2024-05-10T15:30:44.110140 #971188] INFO -- : [281/885] 1012541=test_gem_commands_environment_command I, [2024-05-10T15:30:44.121858 #971188] INFO -- : [282/885] 1012544=test_m17n I, [2024-05-10T15:30:44.167214 #971188] INFO -- : [283/885] 1012541=test_ws I, [2024-05-10T15:30:44.191181 #971188] INFO -- : [284/885] 1012541=test_yjit I, [2024-05-10T15:30:44.248978 #971188] INFO -- : [285/885] 1012544=test_weakmap I, [2024-05-10T15:30:44.359833 #971188] INFO -- : [286/885] 1012547=test_workspace I, [2024-05-10T15:30:44.478228 #971188] INFO -- : [287/885] 1012537=test_kill_ring I, [2024-05-10T15:30:44.488604 #971188] INFO -- : [288/885] 1012537=test_ns_spki I, [2024-05-10T15:30:44.506887 #971188] INFO -- : [289/885] 1012537=test_framework I, [2024-05-10T15:30:44.507631 #971188] INFO -- : [290/885] 1012546=test_argf I, [2024-05-10T15:30:44.553476 #971188] INFO -- : [291/885] 1012537=test_undef I, [2024-05-10T15:30:44.559259 #971188] INFO -- : [292/885] 1012537=test_line_editor I, [2024-05-10T15:30:44.572224 #971188] INFO -- : [293/885] 1012537=test_objspace I, [2024-05-10T15:30:44.614503 #971188] INFO -- : [294/885] 1012547=ripper_test I, [2024-05-10T15:30:45.040547 #971188] INFO -- : [295/885] 1012533=comments_test I, [2024-05-10T15:30:45.051151 #971188] INFO -- : [296/885] 1012533=test_sprintf I, [2024-05-10T15:30:45.354726 #971188] INFO -- : [297/885] 1012533=test_gem_requirement I, [2024-05-10T15:30:45.430507 #971188] INFO -- : [298/885] 1012545=test_string_memory I, [2024-05-10T15:30:45.490932 #971188] INFO -- : [299/885] 1012545=test_gem_security_trust_dir I, [2024-05-10T15:30:45.502715 #971188] INFO -- : [300/885] 1012547=test_set I, [2024-05-10T15:30:45.508829 #971188] INFO -- : [301/885] 1012547=test_show_source I, [2024-05-10T15:30:45.520585 #971188] INFO -- : [302/885] 1012547=test_have_library I, [2024-05-10T15:30:45.540390 #971188] INFO -- : [303/885] 1012545=test_remote_fetch_error I, [2024-05-10T15:30:45.557003 #971188] INFO -- : [304/885] 1012545=test_c_struct_entry I, [2024-05-10T15:30:45.570515 #971188] INFO -- : [305/885] 1012533=test_lock_native_thread I, [2024-05-10T15:30:45.821136 #971188] INFO -- : [306/885] 1012545=test_gem_commands_stale_command I, [2024-05-10T15:30:45.825183 #971188] INFO -- : [307/885] 1012545=test_gem_commands_query_command I, [2024-05-10T15:30:45.917790 #971188] INFO -- : [308/885] 1012533=test_method I, [2024-05-10T15:30:46.366253 #971188] INFO -- : [309/885] 1012532=test_rdoc_rubygems_hook I, [2024-05-10T15:30:46.512496 #971188] INFO -- : [310/885] 1012545=test_to_ruby I, [2024-05-10T15:30:46.521742 #971188] INFO -- : [311/885] 1012545=test_pattern_key_name_check I, [2024-05-10T15:30:46.528117 #971188] INFO -- : [312/885] 1012532=test_array_create I, [2024-05-10T15:30:46.528713 #971188] INFO -- : [313/885] 1012532=test_pack I, [2024-05-10T15:30:46.535706 #971188] INFO -- : [314/885] 1012545=test_gem_impossible_dependencies_error I, [2024-05-10T15:30:46.551118 #971188] INFO -- : [315/885] 1012545=test_ftp I, [2024-05-10T15:30:46.561807 #971188] INFO -- : [316/885] 1012545=test_rdoc_context_section I, [2024-05-10T15:30:46.786306 #971188] INFO -- : [317/885] 1012545=test_euc_kr I, [2024-05-10T15:30:46.793162 #971188] INFO -- : [318/885] 1012545=test_type_completor I, [2024-05-10T15:30:46.804437 #971188] INFO -- : [319/885] 1012545=test_summary I, [2024-05-10T15:30:46.837766 #971188] INFO -- : [320/885] 1012532=test_console_attr I, [2024-05-10T15:30:46.845938 #971188] INFO -- : [321/885] 1012532=test_date_attr I, [2024-05-10T15:30:46.850476 #971188] INFO -- : [322/885] 1012532=test_ellipsize I, [2024-05-10T15:30:46.871140 #971188] INFO -- : [323/885] 1012532=test_kwargs I, [2024-05-10T15:30:46.881015 #971188] INFO -- : [324/885] 1012532=warnings_test I, [2024-05-10T15:30:46.983986 #971188] INFO -- : [325/885] 1012545=test_io_wait I, [2024-05-10T15:30:47.001038 #971188] INFO -- : [326/885] 1012547=test_gem_commands_exec_command I, [2024-05-10T15:30:47.039522 #971188] INFO -- : [327/885] 1012532=test_ubf_async_safe I, [2024-05-10T15:30:47.072001 #971188] INFO -- : [328/885] 1012532=test_hash I, [2024-05-10T15:30:47.325552 #971188] INFO -- : [329/885] 1012545=test_sorted_set I, [2024-05-10T15:30:47.429731 #971188] INFO -- : [330/885] 1012539=test_win32ole_type_event I, [2024-05-10T15:30:47.430193 #971188] INFO -- : [331/885] 1012539=test_emoji I, [2024-05-10T15:30:47.482673 #971188] INFO -- : [332/885] 1012539=test_io I, [2024-05-10T15:30:47.671383 #971188] INFO -- : [333/885] 1012545=test_gem_commands_uninstall_command I, [2024-05-10T15:30:47.695958 #971188] INFO -- : [334/885] 1012535=test_foreach I, [2024-05-10T15:30:47.698077 #971188] INFO -- : [335/885] 1012535=test_gem_source_specific_file I, [2024-05-10T15:30:47.796465 #971188] INFO -- : [336/885] 1012539=test_condition I, [2024-05-10T15:30:47.802854 #971188] INFO -- : [337/885] 1012539=test_cp949 I, [2024-05-10T15:30:47.810391 #971188] INFO -- : [338/885] 1012539=test_win32ole_record I, [2024-05-10T15:30:47.813119 #971188] INFO -- : [339/885] 1012539=test_gem_unsatisfiable_dependency_error I, [2024-05-10T15:30:47.820365 #971188] INFO -- : [340/885] 1012535=test_tempfile I, [2024-05-10T15:30:47.828134 #971188] INFO -- : [341/885] 1012539=test_noarg I, [2024-05-10T15:30:48.090328 #971188] INFO -- : [342/885] 1012539=parse_comments_test I, [2024-05-10T15:30:48.210891 #971188] INFO -- : [343/885] 1012539=test_function I, [2024-05-10T15:30:48.292320 #971188] INFO -- : [344/885] 1012535=test_queue I, [2024-05-10T15:30:48.303236 #971188] INFO -- : [345/885] 1012535=test_internal_ivar I, [2024-05-10T15:30:48.311484 #971188] INFO -- : [346/885] 1012535=test_gem_resolver_index_specification I, [2024-05-10T15:30:48.373170 #971188] INFO -- : [347/885] 1012547=test_utf32 I, [2024-05-10T15:30:48.379880 #971188] INFO -- : [348/885] 1012535=test_basicsocket I, [2024-05-10T15:30:48.384541 #971188] INFO -- : [349/885] 1012547=test_duplicate I, [2024-05-10T15:30:48.390438 #971188] INFO -- : [350/885] 1012547=test_gem_commands_help_command I, [2024-05-10T15:30:48.424839 #971188] INFO -- : [351/885] 1012535=test_rdoc_markup I, [2024-05-10T15:30:48.432396 #971188] INFO -- : [352/885] 1012535=test_tracepoint I, [2024-05-10T15:30:48.432905 #971188] INFO -- : [353/885] 1012539=test_prettyprint I, [2024-05-10T15:30:48.468528 #971188] INFO -- : [354/885] 1012539=test_yamlstore I, [2024-05-10T15:30:48.483951 #971188] INFO -- : [355/885] 1012539=test_gem_installer I, [2024-05-10T15:30:48.500044 #971188] INFO -- : [356/885] 1012547=test_rdoc_parser_rd I, [2024-05-10T15:30:48.569682 #971188] INFO -- : [357/885] 1012547=test_date_strftime I, [2024-05-10T15:30:48.660096 #971188] INFO -- : [358/885] 1012545=test_irb I, [2024-05-10T15:30:48.695090 #971188] INFO -- : [359/885] 1012535=test_rdoc_normal_class I, [2024-05-10T15:30:48.792649 #971188] INFO -- : [360/885] 1012534=test_class I, [2024-05-10T15:30:48.851704 #971188] INFO -- : [361/885] 1012535=test_const I, [2024-05-10T15:30:48.865670 #971188] INFO -- : [362/885] 1012535=json_string_matching_test I, [2024-05-10T15:30:48.891439 #971188] INFO -- : [363/885] 1012535=test_load I, [2024-05-10T15:30:48.909519 #971188] INFO -- : [364/885] 1012535=test_random I, [2024-05-10T15:30:48.938831 #971188] INFO -- : [365/885] 1012535=test_asn1 I, [2024-05-10T15:30:48.960507 #971188] INFO -- : [366/885] 1012535=test_inlinecache I, [2024-05-10T15:30:49.046192 #971188] INFO -- : [367/885] 1012535=test_rdoc_markup_verbatim I, [2024-05-10T15:30:49.055278 #971188] INFO -- : [368/885] 1012535=test_gem_resolver_specification I, [2024-05-10T15:30:49.099968 #971188] INFO -- : [369/885] 1012535=test_gem_dependency I, [2024-05-10T15:30:49.128864 #971188] INFO -- : [370/885] 1012545=test_path_to_class I, [2024-05-10T15:30:49.131573 #971188] INFO -- : [371/885] 1012545=test_gem_ext_ext_conf_builder I, [2024-05-10T15:30:49.230214 #971188] INFO -- : [372/885] 1012547=test_method_cache I, [2024-05-10T15:30:49.235476 #971188] INFO -- : [373/885] 1012547=test_gem_stub_specification I, [2024-05-10T15:30:49.284010 #971188] INFO -- : [374/885] 1012535=test_frozen_error I, [2024-05-10T15:30:49.290075 #971188] INFO -- : [375/885] 1012535=test_gem_commands_search_command I, [2024-05-10T15:30:49.307846 #971188] INFO -- : [376/885] 1012535=test_complex I, [2024-05-10T15:30:49.475919 #971188] INFO -- : [377/885] 1012547=test_scanner_events I, [2024-05-10T15:30:49.514662 #971188] INFO -- : [378/885] 1012535=test_gem_resolver_installed_specification I, [2024-05-10T15:30:49.540215 #971188] INFO -- : [379/885] 1012547=test_mdns I, [2024-05-10T15:30:49.546109 #971188] INFO -- : [380/885] 1012535=test_parse I, [2024-05-10T15:30:49.557488 #971188] INFO -- : [381/885] 1012547=test_gem_remote_fetcher I, [2024-05-10T15:30:49.643754 #971188] INFO -- : [382/885] 1012538=test_too_many_dummy_encodings I, [2024-05-10T15:30:49.658546 #971188] INFO -- : [383/885] 1012543=test_reqarg I, [2024-05-10T15:30:49.735660 #971188] INFO -- : [384/885] 1012538=test_rdoc_include I, [2024-05-10T15:30:49.829425 #971188] INFO -- : [385/885] 1012538=test_stack I, [2024-05-10T15:30:49.979293 #971188] INFO -- : [386/885] 1012546=test_gem_commands_list_command I, [2024-05-10T15:30:49.990322 #971188] INFO -- : [387/885] 1012546=test_string_processing I, [2024-05-10T15:30:50.005543 #971188] INFO -- : [388/885] 1012546=test_fileutils I, [2024-05-10T15:30:50.183886 #971188] INFO -- : [389/885] 1012543=test_emitter I, [2024-05-10T15:30:50.213215 #971188] INFO -- : [390/885] 1012543=test_gem_commands_signin_command I, [2024-05-10T15:30:50.344001 #971188] INFO -- : [391/885] 1012535=test_resource I, [2024-05-10T15:30:50.365044 #971188] INFO -- : [392/885] 1012543=test_ldap I, [2024-05-10T15:30:50.379783 #971188] INFO -- : [393/885] 1012535=test_gem_version I, [2024-05-10T15:30:50.389886 #971188] INFO -- : [394/885] 1012543=test_rdoc_options I, [2024-05-10T15:30:50.503880 #971188] INFO -- : [395/885] 1012546=test_econv I, [2024-05-10T15:30:50.506438 #971188] INFO -- : [396/885] 1012535=test_cesu8 I, [2024-05-10T15:30:50.514095 #971188] INFO -- : [397/885] 1012535=test_comparable I, [2024-05-10T15:30:50.528152 #971188] INFO -- : [398/885] 1012535=test_rdoc_parser_c I, [2024-05-10T15:30:50.637004 #971188] INFO -- : [399/885] 1012544=test_io_timeout I, [2024-05-10T15:30:50.642342 #971188] INFO -- : [400/885] 1012544=test_shapes I, [2024-05-10T15:30:50.651057 #971188] INFO -- : [401/885] 1012544=json_fixtures_test I, [2024-05-10T15:30:50.673936 #971188] INFO -- : [402/885] 1012545=test_pstore I, [2024-05-10T15:30:50.675579 #971188] INFO -- : [403/885] 1012544=test_cstr I, [2024-05-10T15:30:50.708785 #971188] INFO -- : [404/885] 1012536=test_profile_frames I, [2024-05-10T15:30:50.729076 #971188] INFO -- : [405/885] 1012543=test_gbk I, [2024-05-10T15:30:50.733923 #971188] INFO -- : [406/885] 1012545=test_class2name I, [2024-05-10T15:30:50.737364 #971188] INFO -- : [407/885] 1012543=test_enc_str_buf_cat I, [2024-05-10T15:30:50.739636 #971188] INFO -- : [408/885] 1012545=test_yaml I, [2024-05-10T15:30:50.753998 #971188] INFO -- : [409/885] 1012543=test_forwardable I, [2024-05-10T15:30:50.789186 #971188] INFO -- : [410/885] 1012543=test_wait I, [2024-05-10T15:30:50.864488 #971188] INFO -- : [411/885] 1012545=test_handle I, [2024-05-10T15:30:50.873706 #971188] INFO -- : [412/885] 1012543=test_big2str I, [2024-05-10T15:30:50.876390 #971188] INFO -- : [413/885] 1012543=test_bmethod I, [2024-05-10T15:30:50.882107 #971188] INFO -- : [414/885] 1012543=test_ractor I, [2024-05-10T15:30:50.903978 #971188] INFO -- : [415/885] 1012543=test_euc_tw I, [2024-05-10T15:30:50.905889 #971188] INFO -- : [416/885] 1012543=test_gem_commands_sources_command I, [2024-05-10T15:30:50.913902 #971188] INFO -- : [417/885] 1012536=test_ansi_without_terminfo I, [2024-05-10T15:30:50.985363 #971188] INFO -- : [418/885] 1012536=test_nowrite I, [2024-05-10T15:30:51.013226 #971188] INFO -- : [419/885] 1012536=test_thread_queue I, [2024-05-10T15:30:51.038001 #971188] INFO -- : [420/885] 1012535=test_rdoc_markup_formatter I, [2024-05-10T15:30:51.052409 #971188] INFO -- : [421/885] 1012535=test_rdoc_markdown I, [2024-05-10T15:30:51.085101 #971188] INFO -- : [422/885] 1012538=test_gem_available_set I, [2024-05-10T15:30:51.153789 #971188] INFO -- : [423/885] 1012543=test_rdoc_any_method I, [2024-05-10T15:30:51.192672 #971188] INFO -- : [424/885] 1012538=test_modify_expand I, [2024-05-10T15:30:51.205139 #971188] INFO -- : [425/885] 1012538=test_file I, [2024-05-10T15:30:51.209083 #971188] INFO -- : [426/885] 1012538=test_rdoc_encoding I, [2024-05-10T15:30:51.250410 #971188] INFO -- : [427/885] 1012538=test_coverage I, [2024-05-10T15:30:51.293486 #971188] INFO -- : [428/885] 1012545=regexp_test I, [2024-05-10T15:30:51.379998 #971188] INFO -- : [429/885] 1012545=test_gem_package_tar_reader I, [2024-05-10T15:30:51.455147 #971188] INFO -- : [430/885] 1012545=test_complexrational I, [2024-05-10T15:30:51.466505 #971188] INFO -- : [431/885] 1012545=test_init I, [2024-05-10T15:30:51.576857 #971188] INFO -- : [432/885] 1012535=test_pathname I, [2024-05-10T15:30:51.657572 #971188] INFO -- : [433/885] 1012543=test_gem_source_vendor I, [2024-05-10T15:30:51.666211 #971188] INFO -- : [434/885] 1012543=test_gem_commands_owner_command I, [2024-05-10T15:30:51.734958 #971188] INFO -- : [435/885] 1012534=test_recorder I, [2024-05-10T15:30:51.750420 #971188] INFO -- : [436/885] 1012534=test_deprecate I, [2024-05-10T15:30:51.777317 #971188] INFO -- : [437/885] 1012534=test_rdoc_constant I, [2024-05-10T15:30:51.795078 #971188] INFO -- : [438/885] 1012544=test_formatter I, [2024-05-10T15:30:51.804960 #971188] INFO -- : [439/885] 1012544=test_bash_completion I, [2024-05-10T15:30:51.808444 #971188] INFO -- : [440/885] 1012544=test_gem_ext_cmake_builder I, [2024-05-10T15:30:51.828919 #971188] INFO -- : [441/885] 1012544=test_gem_commands_contents_command I, [2024-05-10T15:30:51.846783 #971188] INFO -- : [442/885] 1012546=test_cgi_util I, [2024-05-10T15:30:51.852947 #971188] INFO -- : [443/885] 1012545=test_require I, [2024-05-10T15:30:51.868431 #971188] INFO -- : [444/885] 1012535=test_marshalable I, [2024-05-10T15:30:51.875500 #971188] INFO -- : [445/885] 1012535=test_digest I, [2024-05-10T15:30:51.895215 #971188] INFO -- : [446/885] 1012534=test_ractor I, [2024-05-10T15:30:51.933974 #971188] INFO -- : [447/885] 1012544=test_find I, [2024-05-10T15:30:51.954552 #971188] INFO -- : [448/885] 1012544=test_fiddle I, [2024-05-10T15:30:52.017067 #971188] INFO -- : [449/885] 1012534=test_wss I, [2024-05-10T15:30:52.031589 #971188] INFO -- : [450/885] 1012534=test_omap I, [2024-05-10T15:30:52.045052 #971188] INFO -- : [451/885] 1012534=test_iterator I, [2024-05-10T15:30:52.046874 #971188] INFO -- : [452/885] 1012532=test_string I, [2024-05-10T15:30:52.047976 #971188] INFO -- : [453/885] 1012532=test_digest_extend I, [2024-05-10T15:30:52.064027 #971188] INFO -- : [454/885] 1012532=test_shellwords I, [2024-05-10T15:30:52.077454 #971188] INFO -- : [455/885] 1012532=pattern_test I, [2024-05-10T15:30:52.094369 #971188] INFO -- : [456/885] 1012544=test_memory_view I, [2024-05-10T15:30:52.109872 #971188] INFO -- : [457/885] 1012532=test_debug I, [2024-05-10T15:30:52.112602 #971188] INFO -- : [458/885] 1012532=test_gem_security_signer I, [2024-05-10T15:30:52.129999 #971188] INFO -- : [459/885] 1012544=test_cipher I, [2024-05-10T15:30:52.151840 #971188] INFO -- : [460/885] 1012534=test_new I, [2024-05-10T15:30:52.153855 #971188] INFO -- : [461/885] 1012534=test_gem_resolver_git_set I, [2024-05-10T15:30:52.177811 #971188] INFO -- : [462/885] 1012544=test_storage I, [2024-05-10T15:30:52.181137 #971188] INFO -- : [463/885] 1012547=test_require I, [2024-05-10T15:30:52.187082 #971188] INFO -- : [464/885] 1012546=test_cgi_cookie I, [2024-05-10T15:30:52.190649 #971188] INFO -- : [465/885] 1012544=test_float I, [2024-05-10T15:30:52.200869 #971188] INFO -- : [466/885] 1012546=test_gem_resolver_installer_set I, [2024-05-10T15:30:52.244024 #971188] INFO -- : [467/885] 1012532=test_dir_m17n I, [2024-05-10T15:30:52.276025 #971188] INFO -- : [468/885] 1012543=test_gem_source_git I, [2024-05-10T15:30:52.361184 #971188] INFO -- : [469/885] 1012538=test_regex_casefold I, [2024-05-10T15:30:52.511671 #971188] INFO -- : [470/885] 1012546=test_gem_commands_signout_command I, [2024-05-10T15:30:52.524864 #971188] INFO -- : [471/885] 1012546=test_refinement I, [2024-05-10T15:30:52.552229 #971188] INFO -- : [472/885] 1012540=test_x509crl I, [2024-05-10T15:30:52.579827 #971188] INFO -- : [473/885] 1012534=test_fixnum I, [2024-05-10T15:30:52.594094 #971188] INFO -- : [474/885] 1012534=test_signal I, [2024-05-10T15:30:52.747534 #971188] INFO -- : [475/885] 1012540=test_rdoc_top_level I, [2024-05-10T15:30:52.850314 #971188] INFO -- : [476/885] 1012535=test_metaclass I, [2024-05-10T15:30:52.861702 #971188] INFO -- : [477/885] 1012535=test_rdoc_rd I, [2024-05-10T15:30:52.895099 #971188] INFO -- : [478/885] 1012535=test_cgi_session I, [2024-05-10T15:30:52.908519 #971188] INFO -- : [479/885] 1012535=test_input_method I, [2024-05-10T15:30:52.968603 #971188] INFO -- : [480/885] 1012541=test_windows_1252 I, [2024-05-10T15:30:52.969085 #971188] INFO -- : [481/885] 1012541=test_process I, [2024-05-10T15:30:52.986317 #971188] INFO -- : [482/885] 1012538=test_key_error I, [2024-05-10T15:30:52.993716 #971188] INFO -- : [483/885] 1012538=test_div I, [2024-05-10T15:30:52.995031 #971188] INFO -- : [484/885] 1012538=test_allocation I, [2024-05-10T15:30:53.015896 #971188] INFO -- : [485/885] 1012541=test_engine I, [2024-05-10T15:30:53.023923 #971188] INFO -- : [486/885] 1012541=test_win32ole_variant_m I, [2024-05-10T15:30:53.024274 #971188] INFO -- : [487/885] 1012541=test_color_printer I, [2024-05-10T15:30:53.034850 #971188] INFO -- : [488/885] 1012535=test_deprecated I, [2024-05-10T15:30:53.038617 #971188] INFO -- : [489/885] 1012543=test_insns_leaf I, [2024-05-10T15:30:53.043308 #971188] INFO -- : [490/885] 1012543=test_serialize_subclasses I, [2024-05-10T15:30:53.047535 #971188] INFO -- : [491/885] 1012535=test_struct I, [2024-05-10T15:30:53.050174 #971188] INFO -- : [492/885] 1012543=test_gem_path_support I, [2024-05-10T15:30:53.102853 #971188] INFO -- : [493/885] 1012543=test_set I, [2024-05-10T15:30:53.111458 #971188] INFO -- : [494/885] 1012541=test_files_test_1 I, [2024-05-10T15:30:53.118536 #971188] INFO -- : [495/885] 1012543=test_rdoc_rd_inline I, [2024-05-10T15:30:53.130038 #971188] INFO -- : [496/885] 1012543=test_mutex I, [2024-05-10T15:30:53.377037 #971188] INFO -- : [497/885] 1012540=test_x509req I, [2024-05-10T15:30:53.391090 #971188] INFO -- : [498/885] 1012545=json_common_interface_test I, [2024-05-10T15:30:53.413359 #971188] INFO -- : [499/885] 1012545=test_gem_source_subpath_problem I, [2024-05-10T15:30:53.524756 #971188] INFO -- : [500/885] 1012533=test_dln I, [2024-05-10T15:30:53.530872 #971188] INFO -- : [501/885] 1012533=test_win32ole_variant_outarg I, [2024-05-10T15:30:53.530969 #971188] INFO -- : [502/885] 1012533=test_config I, [2024-05-10T15:30:53.561937 #971188] INFO -- : [503/885] 1012540=json_parser_test I, [2024-05-10T15:30:53.568018 #971188] INFO -- : [504/885] 1012545=test_nomethod_error I, [2024-05-10T15:30:53.572807 #971188] INFO -- : [505/885] 1012545=memsize_test I, [2024-05-10T15:30:53.574099 #971188] INFO -- : [506/885] 1012545=test_cparser I, [2024-05-10T15:30:53.594055 #971188] INFO -- : [507/885] 1012535=test_pkg_config I, [2024-05-10T15:30:53.613051 #971188] INFO -- : [508/885] 1012540=test_variable I, [2024-05-10T15:30:53.625630 #971188] INFO -- : [509/885] 1012533=fuzzer_test I, [2024-05-10T15:30:53.635660 #971188] INFO -- : [510/885] 1012535=test_sexp I, [2024-05-10T15:30:53.636378 #971188] INFO -- : [511/885] 1012533=test_rdoc_markup_include I, [2024-05-10T15:30:53.644167 #971188] INFO -- : [512/885] 1012533=magic_comment_test I, [2024-05-10T15:30:53.649740 #971188] INFO -- : [513/885] 1012533=test_rdoc_markup_to_html_snippet I, [2024-05-10T15:30:53.660499 #971188] INFO -- : [514/885] 1012535=test_struct I, [2024-05-10T15:30:53.670354 #971188] INFO -- : [515/885] 1012535=test_monitor I, [2024-05-10T15:30:53.728872 #971188] INFO -- : [516/885] 1012533=test_buffered_io I, [2024-05-10T15:30:53.757532 #971188] INFO -- : [517/885] 1012540=test_rubyvm I, [2024-05-10T15:30:53.769192 #971188] INFO -- : [518/885] 1012540=test_configuration I, [2024-05-10T15:30:53.790680 #971188] INFO -- : [519/885] 1012533=test_rdoc_generator_markup I, [2024-05-10T15:30:53.798202 #971188] INFO -- : [520/885] 1012533=test_whileuntil I, [2024-05-10T15:30:53.799735 #971188] INFO -- : [521/885] 1012533=test_boolean I, [2024-05-10T15:30:53.810194 #971188] INFO -- : [522/885] 1012533=test_stringify_symbols I, [2024-05-10T15:30:53.828154 #971188] INFO -- : [523/885] 1012533=test_instrumentation_api I, [2024-05-10T15:30:53.863092 #971188] INFO -- : [524/885] 1012544=integer_parse_test I, [2024-05-10T15:30:53.866603 #971188] INFO -- : [525/885] 1012544=test_ssl I, [2024-05-10T15:30:53.882933 #971188] INFO -- : [526/885] 1012540=test_gem_ext_cargo_builder I, [2024-05-10T15:30:53.890696 #971188] INFO -- : [527/885] 1012535=constant_path_node_test I, [2024-05-10T15:30:53.902029 #971188] INFO -- : [528/885] 1012532=test_gem_request_set I, [2024-05-10T15:30:53.915470 #971188] INFO -- : [529/885] 1012540=test_module I, [2024-05-10T15:30:54.016893 #971188] INFO -- : [530/885] 1012535=test_parser I, [2024-05-10T15:30:54.046091 #971188] INFO -- : [531/885] 1012535=test_method_name_check I, [2024-05-10T15:30:54.070900 #971188] INFO -- : [532/885] 1012535=test_arith_seq_extract I, [2024-05-10T15:30:54.268000 #971188] INFO -- : [533/885] 1012535=test_gem_source_installed I, [2024-05-10T15:30:54.277139 #971188] INFO -- : [534/885] 1012543=test_erb I, [2024-05-10T15:30:54.282060 #971188] INFO -- : [535/885] 1012535=test_x509ext I, [2024-05-10T15:30:54.290282 #971188] INFO -- : [536/885] 1012535=test_gem_commands_cert_command I, [2024-05-10T15:30:54.351745 #971188] INFO -- : [537/885] 1012532=test_completion I, [2024-05-10T15:30:54.358206 #971188] INFO -- : [538/885] 1012543=test_yield_block I, [2024-05-10T15:30:54.359458 #971188] INFO -- : [539/885] 1012543=test_len I, [2024-05-10T15:30:54.369740 #971188] INFO -- : [540/885] 1012543=test_rational2 I, [2024-05-10T15:30:54.377074 #971188] INFO -- : [541/885] 1012543=test_rational I, [2024-05-10T15:30:54.396500 #971188] INFO -- : [542/885] 1012543=attribute_write_test I, [2024-05-10T15:30:54.401249 #971188] INFO -- : [543/885] 1012543=test_propertyputref I, [2024-05-10T15:30:54.403576 #971188] INFO -- : [544/885] 1012543=test_spell_checker I, [2024-05-10T15:30:54.412569 #971188] INFO -- : [545/885] 1012543=test_assembler I, [2024-05-10T15:30:54.428888 #971188] INFO -- : [546/885] 1012543=test_nesting_parser I, [2024-05-10T15:30:54.527153 #971188] INFO -- : [547/885] 1012545=test_win32ole_method_event I, [2024-05-10T15:30:54.531963 #971188] INFO -- : [548/885] 1012545=test_benchmark I, [2024-05-10T15:30:54.552022 #971188] INFO -- : [549/885] 1012543=test_gem_dependency_list I, [2024-05-10T15:30:54.640123 #971188] INFO -- : [550/885] 1012539=test_array I, [2024-05-10T15:30:54.672655 #971188] INFO -- : [551/885] 1012543=test_helper_method I, [2024-05-10T15:30:54.693969 #971188] INFO -- : [552/885] 1012543=test_gem_package_tar_writer I, [2024-05-10T15:30:54.802551 #971188] INFO -- : [553/885] 1012543=test_gem_commands_outdated_command I, [2024-05-10T15:30:54.848214 #971188] INFO -- : [554/885] 1012543=test_scalar_scanner I, [2024-05-10T15:30:54.864172 #971188] INFO -- : [555/885] 1012543=test_gem_source I, [2024-05-10T15:30:54.892921 #971188] INFO -- : [556/885] 1012534=test_load I, [2024-05-10T15:30:54.898375 #971188] INFO -- : [557/885] 1012534=test_yamldbm I, [2024-05-10T15:30:54.916447 #971188] INFO -- : [558/885] 1012534=test_gem_commands_rebuild_command I, [2024-05-10T15:30:55.001439 #971188] INFO -- : [559/885] 1012534=test_rdoc_parser_simple I, [2024-05-10T15:30:55.025050 #971188] INFO -- : [560/885] 1012534=test_provider I, [2024-05-10T15:30:55.144307 #971188] INFO -- : [561/885] 1012543=test_abi I, [2024-05-10T15:30:55.237444 #971188] INFO -- : [562/885] 1012532=test_evaluation I, [2024-05-10T15:30:55.240395 #971188] INFO -- : [563/885] 1012532=test_gem_ext_builder I, [2024-05-10T15:30:55.357737 #971188] INFO -- : [564/885] 1012543=test_https I, [2024-05-10T15:30:55.466234 #971188] INFO -- : [565/885] 1012534=test_rdoc_ri_driver I, [2024-05-10T15:30:55.492875 #971188] INFO -- : [566/885] 1012536=test_httpheader I, [2024-05-10T15:30:55.567697 #971188] INFO -- : [567/885] 1012536=test_gem_resolver_local_specification I, [2024-05-10T15:30:55.610481 #971188] INFO -- : [568/885] 1012536=test_set_len I, [2024-05-10T15:30:55.625973 #971188] INFO -- : [569/885] 1012536=test_httpresponses I, [2024-05-10T15:30:55.627219 #971188] INFO -- : [570/885] 1012536=test_encoding I, [2024-05-10T15:30:55.644766 #971188] INFO -- : [571/885] 1012536=test_sockopt I, [2024-05-10T15:30:55.652727 #971188] INFO -- : [572/885] 1012536=test_rdoc_markup_to_label I, [2024-05-10T15:30:55.692822 #971188] INFO -- : [573/885] 1012536=test_install I, [2024-05-10T15:30:55.782140 #971188] INFO -- : [574/885] 1012543=test_key_stroke I, [2024-05-10T15:30:55.796743 #971188] INFO -- : [575/885] 1012543=json_encoding_test I, [2024-05-10T15:30:55.819482 #971188] INFO -- : [576/885] 1012543=test_color I, [2024-05-10T15:30:55.832816 #971188] INFO -- : [577/885] 1012534=test_primitive I, [2024-05-10T15:30:55.841283 #971188] INFO -- : [578/885] 1012534=test_human_typo I, [2024-05-10T15:30:55.850342 #971188] INFO -- : [579/885] 1012534=test_rbconfig I, [2024-05-10T15:30:55.855843 #971188] INFO -- : [580/885] 1012534=test_acceptable I, [2024-05-10T15:30:55.874037 #971188] INFO -- : [581/885] 1012545=test_rdoc_generator_pot_po_entry I, [2024-05-10T15:30:55.883711 #971188] INFO -- : [582/885] 1012545=test_euc_jp I, [2024-05-10T15:30:55.889337 #971188] INFO -- : [583/885] 1012545=test_document I, [2024-05-10T15:30:55.893974 #971188] INFO -- : [584/885] 1012545=test_pair I, [2024-05-10T15:30:55.905736 #971188] INFO -- : [585/885] 1012543=test_win32ole_param I, [2024-05-10T15:30:55.921481 #971188] INFO -- : [586/885] 1012543=test_gem_commands_yank_command I, [2024-05-10T15:30:55.941555 #971188] INFO -- : [587/885] 1012534=test_rdoc_i18n_locale I, [2024-05-10T15:30:55.958420 #971188] INFO -- : [588/885] 1012536=test_chilled I, [2024-05-10T15:30:55.964458 #971188] INFO -- : [589/885] 1012536=test_name_error_extension I, [2024-05-10T15:30:55.976356 #971188] INFO -- : [590/885] 1012536=test_rdoc_method_attr I, [2024-05-10T15:30:55.978248 #971188] INFO -- : [591/885] 1012534=static_literals_test I, [2024-05-10T15:30:56.060692 #971188] INFO -- : [592/885] 1012547=test_data I, [2024-05-10T15:30:56.075003 #971188] INFO -- : [593/885] 1012547=test_filter I, [2024-05-10T15:30:56.078784 #971188] INFO -- : [594/885] 1012534=test_gem_gem_runner I, [2024-05-10T15:30:56.089424 #971188] INFO -- : [595/885] 1012535=test_rdoc_generator_pot I, [2024-05-10T15:30:56.095720 #971188] INFO -- : [596/885] 1012535=test_unicode I, [2024-05-10T15:30:56.095898 #971188] INFO -- : [597/885] 1012538=test_rdoc_parser_changelog I, [2024-05-10T15:30:56.099844 #971188] INFO -- : [598/885] 1012547=test_enumerator I, [2024-05-10T15:30:56.106214 #971188] INFO -- : [599/885] 1012535=test_koi8 I, [2024-05-10T15:30:56.108185 #971188] INFO -- : [600/885] 1012547=parameters_signature_test I, [2024-05-10T15:30:56.115999 #971188] INFO -- : [601/885] 1012535=test_ssl_session I, [2024-05-10T15:30:56.116971 #971188] INFO -- : [602/885] 1012547=test_lexer I, [2024-05-10T15:30:56.145577 #971188] INFO -- : [603/885] 1012547=test_thread_cv I, [2024-05-10T15:30:56.149515 #971188] INFO -- : [604/885] 1012536=test_gem_resolver_vendor_specification I, [2024-05-10T15:30:56.154629 #971188] INFO -- : [605/885] 1012534=test_gem_commands_update_command I, [2024-05-10T15:30:56.185006 #971188] INFO -- : [606/885] 1012536=test_notimplement I, [2024-05-10T15:30:56.189105 #971188] INFO -- : [607/885] 1012536=test_random I, [2024-05-10T15:30:56.197277 #971188] INFO -- : [608/885] 1012538=test_gem_uri I, [2024-05-10T15:30:56.207360 #971188] INFO -- : [609/885] 1012536=test_key_event_record I, [2024-05-10T15:30:56.209852 #971188] INFO -- : [610/885] 1012536=test_bug-14834 I, [2024-05-10T15:30:56.237812 #971188] INFO -- : [611/885] 1012538=test_rdoc_markup_to_html I, [2024-05-10T15:30:56.306211 #971188] INFO -- : [612/885] 1012536=test_date_compat I, [2024-05-10T15:30:56.309972 #971188] INFO -- : [613/885] 1012536=test_terminfo I, [2024-05-10T15:30:56.311557 #971188] INFO -- : [614/885] 1012538=test_compile_prism I, [2024-05-10T15:30:56.316635 #971188] INFO -- : [615/885] 1012536=test_win32ole_param_event I, [2024-05-10T15:30:56.327935 #971188] INFO -- : [616/885] 1012536=test_bn I, [2024-05-10T15:30:56.340163 #971188] INFO -- : [617/885] 1012536=redundant_return_test I, [2024-05-10T15:30:56.343924 #971188] INFO -- : [618/885] 1012536=test_case_mapping I, [2024-05-10T15:30:56.357350 #971188] INFO -- : [619/885] 1012536=test_path I, [2024-05-10T15:30:56.370750 #971188] INFO -- : [620/885] 1012536=test_tree_spell_checker I, [2024-05-10T15:30:56.411276 #971188] INFO -- : [621/885] 1012541=test_addrinfo I, [2024-05-10T15:30:56.421266 #971188] INFO -- : [622/885] 1012543=test_http I, [2024-05-10T15:30:56.453446 #971188] INFO -- : [623/885] 1012536=test_exception_at_throwing I, [2024-05-10T15:30:56.476609 #971188] INFO -- : [624/885] 1012541=test_iseq I, [2024-05-10T15:30:56.513950 #971188] INFO -- : [625/885] 1012532=test_rdoc_markup_heading I, [2024-05-10T15:30:56.520349 #971188] INFO -- : [626/885] 1012532=test_ocsp I, [2024-05-10T15:30:56.538986 #971188] INFO -- : [627/885] 1012536=test_class I, [2024-05-10T15:30:56.544489 #971188] INFO -- : [628/885] 1012536=test_pkey_dsa I, [2024-05-10T15:30:56.696831 #971188] INFO -- : [629/885] 1012540=test_scheduler I, [2024-05-10T15:30:56.714354 #971188] INFO -- : [630/885] 1012538=test_gem_commands_build_command I, [2024-05-10T15:30:56.792143 #971188] INFO -- : [631/885] 1012547=test_case_comprehensive I, [2024-05-10T15:30:56.809356 #971188] INFO -- : [632/885] 1012532=test_interned_str I, [2024-05-10T15:30:56.814354 #971188] INFO -- : [633/885] 1012533=test_did_you_mean I, [2024-05-10T15:30:56.821398 #971188] INFO -- : [634/885] 1012532=test_io_m17n I, [2024-05-10T15:30:56.870646 #971188] INFO -- : [635/885] 1012540=test_variable_name_check I, [2024-05-10T15:30:56.921998 #971188] INFO -- : [636/885] 1012533=test_gem_commands_server_command I, [2024-05-10T15:30:56.943558 #971188] INFO -- : [637/885] 1012540=test_option I, [2024-05-10T15:30:56.961632 #971188] INFO -- : [638/885] 1012533=test_append I, [2024-05-10T15:30:56.970165 #971188] INFO -- : [639/885] 1012533=test_tracer I, [2024-05-10T15:30:56.976174 #971188] INFO -- : [640/885] 1012533=test_cmethod I, [2024-05-10T15:30:56.982730 #971188] INFO -- : [641/885] 1012533=test_popen_deadlock I, [2024-05-10T15:30:57.046342 #971188] INFO -- : [642/885] 1012538=test_delegate I, [2024-05-10T15:30:57.066619 #971188] INFO -- : [643/885] 1012538=test_mkmf I, [2024-05-10T15:30:57.070074 #971188] INFO -- : [644/885] 1012535=test_date_marshal I, [2024-05-10T15:30:57.080446 #971188] INFO -- : [645/885] 1012535=test_history I, [2024-05-10T15:30:57.108093 #971188] INFO -- : [646/885] 1012535=test_recursion I, [2024-05-10T15:30:57.109802 #971188] INFO -- : [647/885] 1012540=test_exit I, [2024-05-10T15:30:57.114363 #971188] INFO -- : [648/885] 1012538=test_digest I, [2024-05-10T15:30:57.117254 #971188] INFO -- : [649/885] 1012535=test_rdoc_servlet I, [2024-05-10T15:30:57.134018 #971188] INFO -- : [650/885] 1012538=test_gem_security I, [2024-05-10T15:30:57.181433 #971188] INFO -- : [651/885] 1012546=test_ractor I, [2024-05-10T15:30:57.209416 #971188] INFO -- : [652/885] 1012540=test_open3 I, [2024-05-10T15:30:57.243364 #971188] INFO -- : [653/885] 1012542=test_multi_irb_commands I, [2024-05-10T15:30:57.256927 #971188] INFO -- : [654/885] 1012546=test_fiber I, [2024-05-10T15:30:57.269076 #971188] INFO -- : [655/885] 1012542=test_bundled_ca I, [2024-05-10T15:30:57.269756 #971188] INFO -- : [656/885] 1012535=test_closure I, [2024-05-10T15:30:57.293402 #971188] INFO -- : [657/885] 1012541=test_within_pipe I, [2024-05-10T15:30:57.324624 #971188] INFO -- : [658/885] 1012541=test_emoji_breaks I, [2024-05-10T15:30:57.332362 #971188] INFO -- : [659/885] 1012541=test_gem_bundler_version_finder I, [2024-05-10T15:30:57.364843 #971188] INFO -- : [660/885] 1012541=reflection_test I, [2024-05-10T15:30:57.379466 #971188] INFO -- : [661/885] 1012541=test_beginendblock I, [2024-05-10T15:30:57.766976 #971188] INFO -- : [662/885] 1012533=test_files_lib I, [2024-05-10T15:30:57.779709 #971188] INFO -- : [663/885] 1012533=test_gem_commands_unpack_command I, [2024-05-10T15:30:57.794358 #971188] INFO -- : [664/885] 1012534=test_help I, [2024-05-10T15:30:57.808061 #971188] INFO -- : [665/885] 1012534=test_rdoc_markup_to_bs I, [2024-05-10T15:30:57.843756 #971188] INFO -- : [666/885] 1012534=test_printf I, [2024-05-10T15:30:57.859200 #971188] INFO -- : [667/885] 1012534=test_rdoc_markup_pre_process I, [2024-05-10T15:30:57.899055 #971188] INFO -- : [668/885] 1012541=test_stream I, [2024-05-10T15:30:57.906552 #971188] INFO -- : [669/885] 1012541=test_to_ary_concat I, [2024-05-10T15:30:57.952764 #971188] INFO -- : [670/885] 1012534=test_webauthn_listener_response I, [2024-05-10T15:30:57.982527 #971188] INFO -- : [671/885] 1012534=test_time I, [2024-05-10T15:30:58.026564 #971188] INFO -- : [672/885] 1012535=test_pinned I, [2024-05-10T15:30:58.097153 #971188] INFO -- : [673/885] 1012535=test_gem_uri_formatter I, [2024-05-10T15:30:58.113286 #971188] INFO -- : [674/885] 1012535=test_encoding I, [2024-05-10T15:30:58.170011 #971188] INFO -- : [675/885] 1012533=test_erb_command I, [2024-05-10T15:30:58.181214 #971188] INFO -- : [676/885] 1012534=test_helper I, [2024-05-10T15:30:58.196723 #971188] INFO -- : [677/885] 1012534=test_constant I, [2024-05-10T15:30:58.222704 #971188] INFO -- : [678/885] 1012533=test_dup I, [2024-05-10T15:30:58.350536 #971188] INFO -- : [679/885] 1012542=test_pty I, [2024-05-10T15:30:58.409051 #971188] INFO -- : [680/885] 1012535=command_line_test I, [2024-05-10T15:30:58.414371 #971188] INFO -- : [681/885] 1012535=test_range I, [2024-05-10T15:30:58.461107 #971188] INFO -- : [682/885] 1012533=test_project_sanity I, [2024-05-10T15:30:58.503219 #971188] INFO -- : [683/885] 1012532=test_rdoc_ri_paths I, [2024-05-10T15:30:58.513038 #971188] INFO -- : [684/885] 1012533=test_ts I, [2024-05-10T15:30:58.544801 #971188] INFO -- : [685/885] 1012532=library_symbols_test I, [2024-05-10T15:30:58.557588 #971188] INFO -- : [686/885] 1012532=test_locale I, [2024-05-10T15:30:58.585083 #971188] INFO -- : [687/885] 1012532=test_addr I, [2024-05-10T15:30:58.597971 #971188] INFO -- : [688/885] 1012532=test_ensured I, [2024-05-10T15:30:58.676924 #971188] INFO -- : [689/885] 1012532=test_gem_commands_check_command I, [2024-05-10T15:30:58.702178 #971188] INFO -- : [690/885] 1012532=test_regexp I, [2024-05-10T15:30:58.922632 #971188] INFO -- : [691/885] 1012542=errors_test I, [2024-05-10T15:30:59.007293 #971188] INFO -- : [692/885] 1012533=test_vm_dump I, [2024-05-10T15:30:59.024872 #971188] INFO -- : [693/885] 1012533=test_integer_comb I, [2024-05-10T15:30:59.126086 #971188] INFO -- : [694/885] 1012542=test_rdoc_markup_document I, [2024-05-10T15:30:59.136589 #971188] INFO -- : [695/885] 1012542=test_tmpdir I, [2024-05-10T15:30:59.161926 #971188] INFO -- : [696/885] 1012535=unescape_test I, [2024-05-10T15:30:59.194777 #971188] INFO -- : [697/885] 1012545=test_ostruct I, [2024-05-10T15:30:59.257839 #971188] INFO -- : [698/885] 1012542=test_force_exit I, [2024-05-10T15:30:59.379987 #971188] INFO -- : [699/885] 1012545=test_file I, [2024-05-10T15:30:59.394892 #971188] INFO -- : [700/885] 1012542=test_data_error I, [2024-05-10T15:30:59.493928 #971188] INFO -- : [701/885] 1012542=bom_test I, [2024-05-10T15:30:59.517864 #971188] INFO -- : [702/885] 1012542=test_udp I, [2024-05-10T15:30:59.538740 #971188] INFO -- : [703/885] 1012542=static_inspect_test I, [2024-05-10T15:30:59.546943 #971188] INFO -- : [704/885] 1012542=test_rdoc_code_object I, [2024-05-10T15:30:59.601969 #971188] INFO -- : [705/885] 1012541=test_x509store I, [2024-05-10T15:30:59.678485 #971188] INFO -- : [706/885] 1012536=test_fips I, [2024-05-10T15:30:59.908716 #971188] INFO -- : [707/885] 1012541=test_x509name I, [2024-05-10T15:30:59.917768 #971188] INFO -- : [708/885] 1012541=test_update I, [2024-05-10T15:30:59.927762 #971188] INFO -- : [709/885] 1012541=test_ast I, [2024-05-10T15:31:00.001437 #971188] INFO -- : [710/885] 1012542=test_gem_request_set_gem_dependency_api I, [2024-05-10T15:31:00.096850 #971188] INFO -- : [711/885] 1012536=test_lambda I, [2024-05-10T15:31:00.112732 #971188] INFO -- : [712/885] 1012540=test_jaro_winkler I, [2024-05-10T15:31:00.117208 #971188] INFO -- : [713/885] 1012540=test_random_formatter I, [2024-05-10T15:31:00.142038 #971188] INFO -- : [714/885] 1012540=test_helper I, [2024-05-10T15:31:00.183895 #971188] INFO -- : [715/885] 1012536=test_webauthn_listener I, [2024-05-10T15:31:00.187980 #971188] INFO -- : [716/885] 1012542=test_gem_resolver_vendor_set I, [2024-05-10T15:31:00.198347 #971188] INFO -- : [717/885] 1012540=test_config I, [2024-05-10T15:31:00.207957 #971188] INFO -- : [718/885] 1012542=test_enumerable I, [2024-05-10T15:31:00.235788 #971188] INFO -- : [719/885] 1012542=test_gem_safe_marshal I, [2024-05-10T15:31:00.256911 #971188] INFO -- : [720/885] 1012536=test_gem_resolver_api_set I, [2024-05-10T15:31:00.333653 #971188] INFO -- : [721/885] 1012536=test_transcode I, [2024-05-10T15:31:00.613978 #971188] INFO -- : [722/885] 1012536=test_eval I, [2024-05-10T15:31:00.700583 #971188] INFO -- : [723/885] 1012540=json_generator_test I, [2024-05-10T15:31:00.765545 #971188] INFO -- : [724/885] 1012534=test_gem_update_suggestion I, [2024-05-10T15:31:00.781941 #971188] INFO -- : [725/885] 1012539=test_files_test I, [2024-05-10T15:31:00.810798 #971188] INFO -- : [726/885] 1012540=test_file_exhaustive I, [2024-05-10T15:31:00.837293 #971188] INFO -- : [727/885] 1012534=test_logger I, [2024-05-10T15:31:00.839905 #971188] INFO -- : [728/885] 1012536=test_import I, [2024-05-10T15:31:00.857542 #971188] INFO -- : [729/885] 1012534=test_gem_resolver_lock_set I, [2024-05-10T15:31:00.862776 #971188] INFO -- : [730/885] 1012539=test_not I, [2024-05-10T15:31:00.867232 #971188] INFO -- : [731/885] 1012539=test_rdoc_parser_markdown I, [2024-05-10T15:31:00.877677 #971188] INFO -- : [732/885] 1012542=test_pkey_rsa I, [2024-05-10T15:31:00.886345 #971188] INFO -- : [733/885] 1012534=test_numhash I, [2024-05-10T15:31:00.892953 #971188] INFO -- : [734/885] 1012534=test_gem_commands_push_command I, [2024-05-10T15:31:00.916776 #971188] INFO -- : [735/885] 1012539=test_weakkeymap I, [2024-05-10T15:31:01.051051 #971188] INFO -- : [736/885] 1012542=test_rdoc_markup_hard_break I, [2024-05-10T15:31:01.058590 #971188] INFO -- : [737/885] 1012542=test_gem_package_task I, [2024-05-10T15:31:01.059787 #971188] INFO -- : [738/885] 1012542=test_date_strptime I, [2024-05-10T15:31:01.103017 #971188] INFO -- : [739/885] 1012535=test_placearg I, [2024-05-10T15:31:01.161744 #971188] INFO -- : [740/885] 1012542=test_gem_platform I, [2024-05-10T15:31:01.245436 #971188] INFO -- : [741/885] 1012535=test_delete I, [2024-05-10T15:31:01.253782 #971188] INFO -- : [742/885] 1012542=test_win32ole_method I, [2024-05-10T15:31:01.268844 #971188] INFO -- : [743/885] 1012542=test_continuation I, [2024-05-10T15:31:01.269144 #971188] INFO -- : [744/885] 1012542=test_fd_setsize I, [2024-05-10T15:31:01.275612 #971188] INFO -- : [745/885] 1012542=test_class_name_check I, [2024-05-10T15:31:01.279229 #971188] INFO -- : [746/885] 1012544=test_keyword I, [2024-05-10T15:31:01.300389 #971188] INFO -- : [747/885] 1012535=test_flip I, [2024-05-10T15:31:01.303126 #971188] INFO -- : [748/885] 1012542=compiler_test I, [2024-05-10T15:31:01.310557 #971188] INFO -- : [749/885] 1012542=test_change_word I, [2024-05-10T15:31:01.313493 #971188] INFO -- : [750/885] 1012542=test_normalize I, [2024-05-10T15:31:01.321320 #971188] INFO -- : [751/885] 1012542=test_ossl I, [2024-05-10T15:31:01.324004 #971188] INFO -- : [752/885] 1012539=test_timeout I, [2024-05-10T15:31:01.328216 #971188] INFO -- : [753/885] 1012539=test_gem_local_remote_options I, [2024-05-10T15:31:01.333777 #971188] INFO -- : [754/885] 1012535=test_date_arith I, [2024-05-10T15:31:01.342394 #971188] INFO -- : [755/885] 1012535=test_ruby_lex I, [2024-05-10T15:31:01.381974 #971188] INFO -- : [756/885] 1012539=test_object I, [2024-05-10T15:31:01.419762 #971188] INFO -- : [757/885] 1012534=test_sleep I, [2024-05-10T15:31:01.493029 #971188] INFO -- : [758/885] 1012535=test_type I, [2024-05-10T15:31:01.496810 #971188] INFO -- : [759/885] 1012535=test_ractor I, [2024-05-10T15:31:01.501720 #971188] INFO -- : [760/885] 1012538=test_pointer I, [2024-05-10T15:31:01.582546 #971188] INFO -- : [761/885] 1012535=test_big5 I, [2024-05-10T15:31:01.597717 #971188] INFO -- : [762/885] 1012535=test_func I, [2024-05-10T15:31:01.747994 #971188] INFO -- : [763/885] 1012539=test_rdoc_rd_block_parser I, [2024-05-10T15:31:01.775487 #971188] INFO -- : [764/885] 1012539=test_tsort I, [2024-05-10T15:31:01.783087 #971188] INFO -- : [765/885] 1012539=test_signedness I, [2024-05-10T15:31:01.934786 #971188] INFO -- : [766/885] 1012544=test_cgi_header I, [2024-05-10T15:31:01.948165 #971188] INFO -- : [767/885] 1012544=heredoc_dedent_test I, [2024-05-10T15:31:01.954924 #971188] INFO -- : [768/885] 1012544=test_object I, [2024-05-10T15:31:01.958359 #971188] INFO -- : [769/885] 1012544=version_test I, [2024-05-10T15:31:01.963683 #971188] INFO -- : [770/885] 1012544=test_key_actor_emacs I, [2024-05-10T15:31:01.993334 #971188] INFO -- : [771/885] 1012533=test_gem_command_manager I, [2024-05-10T15:31:02.066367 #971188] INFO -- : [772/885] 1012544=test_basicinstructions I, [2024-05-10T15:31:02.122352 #971188] INFO -- : [773/885] 1012544=test_gem_gemcutter_utilities I, [2024-05-10T15:31:02.122675 #971188] INFO -- : [774/885] 1012533=test_arithmetic_sequence I, [2024-05-10T15:31:02.136355 #971188] INFO -- : [775/885] 1012533=test_merge_keys I, [2024-05-10T15:31:02.149070 #971188] INFO -- : [776/885] 1012533=test_rdoc_extend I, [2024-05-10T15:31:02.176949 #971188] INFO -- : [777/885] 1012533=test_win32ole_variant I, [2024-05-10T15:31:02.187630 #971188] INFO -- : [778/885] 1012533=test_history I, [2024-05-10T15:31:02.221160 #971188] INFO -- : [779/885] 1012533=test_mixed_unicode_escapes I, [2024-05-10T15:31:02.230705 #971188] INFO -- : [780/885] 1012533=test_rdoc_markup_to_ansi I, [2024-05-10T15:31:02.263093 #971188] INFO -- : [781/885] 1012533=test_ipaddr I, [2024-05-10T15:31:02.289973 #971188] INFO -- : [782/885] 1012533=test_gem_resolver_api_specification I, [2024-05-10T15:31:02.321367 #971188] INFO -- : [783/885] 1012533=ractor_test I, [2024-05-10T15:31:02.336752 #971188] INFO -- : [784/885] 1012536=test_trace I, [2024-05-10T15:31:02.345703 #971188] INFO -- : [785/885] 1012536=test_win32ole_event I, [2024-05-10T15:31:02.357517 #971188] INFO -- : [786/885] 1012536=test_time_tz I, [2024-05-10T15:31:02.382029 #971188] INFO -- : [787/885] 1012533=test_rdoc_generator_json_index I, [2024-05-10T15:31:02.396820 #971188] INFO -- : [788/885] 1012536=test_bignum I, [2024-05-10T15:31:02.404757 #971188] INFO -- : [789/885] 1012533=test_rdoc_class_module I, [2024-05-10T15:31:02.452291 #971188] INFO -- : [790/885] 1012544=test_gem_ci_detector I, [2024-05-10T15:31:02.461664 #971188] INFO -- : [791/885] 1012544=test_arity I, [2024-05-10T15:31:02.464698 #971188] INFO -- : [792/885] 1012544=test_stringio I, [2024-05-10T15:31:02.488022 #971188] INFO -- : [793/885] 1012538=test_io_wait_uncommon I, [2024-05-10T15:31:02.490428 #971188] INFO -- : [794/885] 1012538=test_win32ole_variable I, [2024-05-10T15:31:02.498900 #971188] INFO -- : [795/885] 1012538=test_gem_specification I, [2024-05-10T15:31:02.508138 #971188] INFO -- : [796/885] 1012536=test_enum I, [2024-05-10T15:31:02.629376 #971188] INFO -- : [797/885] 1012544=test_threadgroup I, [2024-05-10T15:31:02.982346 #971188] INFO -- : [798/885] 1012533=test_complex2 I, [2024-05-10T15:31:02.993116 #971188] INFO -- : [799/885] 1012533=test_resolve_symbol I, [2024-05-10T15:31:03.053697 #971188] INFO -- : [800/885] 1012533=test_gem_package I, [2024-05-10T15:31:03.453227 #971188] INFO -- : [801/885] 1012536=test_have_macro I, [2024-05-10T15:31:03.472391 #971188] INFO -- : [802/885] 1012546=test_function_entry I, [2024-05-10T15:31:03.475845 #971188] INFO -- : [803/885] 1012546=test_pkcs7 I, [2024-05-10T15:31:03.633452 #971188] INFO -- : [804/885] 1012544=test_arith_seq_beg_len_step I, [2024-05-10T15:31:03.682005 #971188] INFO -- : [805/885] 1012546=test_gem_resolver_requirement_list I, [2024-05-10T15:31:03.685200 #971188] INFO -- : [806/885] 1012546=test_unix I, [2024-05-10T15:31:03.717966 #971188] INFO -- : [807/885] 1012544=test_enc_associate I, [2024-05-10T15:31:03.730581 #971188] INFO -- : [808/885] 1012546=test_lazy_enumerator I, [2024-05-10T15:31:03.733523 #971188] INFO -- : [809/885] 1012533=test_find_executable I, [2024-05-10T15:31:03.743646 #971188] INFO -- : [810/885] 1012533=ruby_api_test I, [2024-05-10T15:31:03.898449 #971188] INFO -- : [811/885] 1012533=test_context I, [2024-05-10T15:31:03.947540 #971188] INFO -- : [812/885] 1012536=test_gem_commands_pristine_command I, [2024-05-10T15:31:03.988957 #971188] INFO -- : [813/885] 1012533=test_nofree I, [2024-05-10T15:31:03.989490 #971188] INFO -- : [814/885] 1012533=test_coder I, [2024-05-10T15:31:04.009530 #971188] INFO -- : [815/885] 1012533=test_symbol I, [2024-05-10T15:31:04.096168 #971188] INFO -- : [816/885] 1012539=test_member I, [2024-05-10T15:31:04.100465 #971188] INFO -- : [817/885] 1012539=test_numeric I, [2024-05-10T15:31:04.107838 #971188] INFO -- : [818/885] 1012539=test_cgi_multipart I, [2024-05-10T15:31:04.187254 #971188] INFO -- : [819/885] 1012546=test_word I, [2024-05-10T15:31:04.196591 #971188] INFO -- : [820/885] 1012546=test_gem_commands_cleanup_command I, [2024-05-10T15:31:04.215831 #971188] INFO -- : [821/885] 1012544=format_errors_test I, [2024-05-10T15:31:04.221832 #971188] INFO -- : [822/885] 1012544=test_dir I, [2024-05-10T15:31:04.250335 #971188] INFO -- : [823/885] 1012539=test_date_ractor I, [2024-05-10T15:31:04.483764 #971188] INFO -- : [824/885] 1012544=test_gem_console_ui I, [2024-05-10T15:31:04.485728 #971188] INFO -- : [825/885] 1012544=test_eval I, [2024-05-10T15:31:04.491382 #971188] INFO -- : [826/885] 1012544=test_autoconf I, [2024-05-10T15:31:04.498697 #971188] INFO -- : [827/885] 1012544=test_ractor_compatibility I, [2024-05-10T15:31:04.523813 #971188] INFO -- : [828/885] 1012539=location_test I, [2024-05-10T15:31:04.567914 #971188] INFO -- : [829/885] 1012539=test_symbol I, [2024-05-10T15:31:04.573859 #971188] INFO -- : [830/885] 1012539=test_coderange I, [2024-05-10T15:31:04.579548 #971188] INFO -- : [831/885] 1012539=test_mailto I, [2024-05-10T15:31:04.605296 #971188] INFO -- : [832/885] 1012539=test_rdoc_comment I, [2024-05-10T15:31:04.647363 #971188] INFO -- : [833/885] 1012539=test_resize I, [2024-05-10T15:31:04.655678 #971188] INFO -- : [834/885] 1012539=test_error_highlight I, [2024-05-10T15:31:04.705089 #971188] INFO -- : [835/885] 1012539=test_rdoc_generator_darkfish I, [2024-05-10T15:31:04.820219 #971188] INFO -- : [836/885] 1012546=test_http_request I, [2024-05-10T15:31:04.857738 #971188] INFO -- : [837/885] 1012546=test_gem_source_fetch_problem I, [2024-05-10T15:31:04.878143 #971188] INFO -- : [838/885] 1012546=json_generic_object_test I, [2024-05-10T15:31:04.899010 #971188] INFO -- : [839/885] 1012546=test_dryrun I, [2024-05-10T15:31:04.902087 #971188] INFO -- : [840/885] 1012544=test_integer I, [2024-05-10T15:31:04.923466 #971188] INFO -- : [841/885] 1012546=desugar_compiler_test I, [2024-05-10T15:31:04.965878 #971188] INFO -- : [842/885] 1012544=test_env I, [2024-05-10T15:31:05.023345 #971188] INFO -- : [843/885] 1012546=test_rdoc_attr I, [2024-05-10T15:31:05.082971 #971188] INFO -- : [844/885] 1012546=test_gem_commands_setup_command I, [2024-05-10T15:31:05.119002 #971188] INFO -- : [845/885] 1012539=test_rubygems I, [2024-05-10T15:31:05.254280 #971188] INFO -- : [846/885] 1012538=test_call I, [2024-05-10T15:31:05.277107 #971188] INFO -- : [847/885] 1012535=test_https_proxy I, [2024-05-10T15:31:05.304781 #971188] INFO -- : [848/885] 1012535=test_rubyoptions I, [2024-05-10T15:31:05.362718 #971188] INFO -- : [849/885] 1012539=test_super I, [2024-05-10T15:31:05.461236 #971188] INFO -- : [850/885] 1012538=test_integer I, [2024-05-10T15:31:05.464797 #971188] INFO -- : [851/885] 1012545=test_cgi_modruby I, [2024-05-10T15:31:05.491745 #971188] INFO -- : [852/885] 1012545=test_usrmarshal I, [2024-05-10T15:31:05.543983 #971188] INFO -- : [853/885] 1012536=test_object_references I, [2024-05-10T15:31:05.552351 #971188] INFO -- : [854/885] 1012536=test_gem_resolver_git_specification I, [2024-05-10T15:31:05.733715 #971188] INFO -- : [855/885] 1012546=test_have_func I, [2024-05-10T15:31:05.738150 #971188] INFO -- : [856/885] 1012545=test_stat I, [2024-05-10T15:31:05.740752 #971188] INFO -- : [857/885] 1012545=test_gem_request_set_lockfile_tokenizer I, [2024-05-10T15:31:05.813260 #971188] INFO -- : [858/885] 1012545=test_capacity I, [2024-05-10T15:31:05.822647 #971188] INFO -- : [859/885] 1012545=test_nextafter I, [2024-05-10T15:31:05.834554 #971188] INFO -- : [860/885] 1012536=test_debugger_integration I, [2024-05-10T15:31:05.859525 #971188] INFO -- : [861/885] 1012536=test_rendering I, [2024-05-10T15:31:05.878181 #971188] INFO -- : [862/885] 1012536=test_my_integer I, [2024-05-10T15:31:05.885080 #971188] INFO -- : [863/885] 1012536=test_thread I, [2024-05-10T15:31:05.956915 #971188] INFO -- : [864/885] 1012545=json_ext_parser_test I, [2024-05-10T15:31:05.966875 #971188] INFO -- : [865/885] 1012545=test_ractor I, [2024-05-10T15:31:06.383849 #971188] INFO -- : [866/885] 1012543=test_ssl I, [2024-05-10T15:31:06.426411 #971188] INFO -- : [867/885] 1012534=test_reline_key I, [2024-05-10T15:31:06.456475 #971188] INFO -- : [868/885] 1012545=test_rb_str_dup I, [2024-05-10T15:31:06.466695 #971188] INFO -- : [869/885] 1012545=test_singleton_function I, [2024-05-10T15:31:06.471554 #971188] INFO -- : [870/885] 1012545=test_ancdata I, [2024-05-10T15:31:06.477959 #971188] INFO -- : [871/885] 1012545=test_timeout I, [2024-05-10T15:31:06.516863 #971188] INFO -- : [872/885] 1012539=test_alias I, [2024-05-10T15:31:06.539819 #971188] INFO -- : [873/885] 1012534=test_nonblock I, [2024-05-10T15:31:06.556704 #971188] INFO -- : [874/885] 1012534=test_weakref I, [2024-05-10T15:31:06.738932 #971188] INFO -- : [875/885] 1012539=test_marshal I, [2024-05-10T15:31:06.839516 #971188] INFO -- : [876/885] 1012534=test_unicode_normalize I, [2024-05-10T15:31:06.843078 #971188] INFO -- : [877/885] 1012543=test_parser I, [2024-05-10T15:31:06.870735 #971188] INFO -- : [878/885] 1012543=test_cgi_core I, [2024-05-10T15:31:06.890552 #971188] INFO -- : [879/885] 1012543=test_gem I, [2024-05-10T15:31:07.354234 #971188] INFO -- : [880/885] 1012545=test_gem_source_lock I, [2024-05-10T15:31:07.377875 #971188] INFO -- : [881/885] 1012542=test_ractor I, [2024-05-10T15:31:07.425891 #971188] INFO -- : [882/885] 1012542=test_gem_commands_open_command I, [2024-05-10T15:31:07.457314 #971188] INFO -- : [883/885] 1012545=test_dns I, [2024-05-10T15:31:07.534865 #971188] INFO -- : [884/885] 1012542=test_registry I, [2024-05-10T15:31:07.535578 #971188] INFO -- : [885/885] 1012542=parse_stream_test I, [2024-05-10T15:31:31.204979 #971188] INFO -- : E, [2024-05-10T15:31:31.205244 #971188] ERROR -- : Failed tests: E, [2024-05-10T15:31:31.205304 #971188] ERROR -- : ErrorHighlightTest#test_OP_CDECL_toplevel_2: Test::Unit::ProxyError: undefined method 'formatter' for module DidYouMean E, [2024-05-10T15:31:31.205348 #971188] ERROR -- : ErrorHighlightTest#test_OP_CDECL_toplevel_2: Test::Unit::ProxyError: undefined method 'formatter=' for module DidYouMean E, [2024-05-10T15:31:31.205376 #971188] ERROR -- : ErrorHighlightTest#test_CALL_noarg_2: Test::Unit::ProxyError: undefined method 'formatter' for module DidYouMean E, [2024-05-10T15:31:31.205432 #971188] ERROR -- : ErrorHighlightTest#test_CALL_noarg_2: Test::Unit::ProxyError: undefined method 'formatter=' for module DidYouMean E, [2024-05-10T15:31:31.205459 #971188] ERROR -- : ErrorHighlightTest#test_args_OPCALL: Test::Unit::ProxyError: undefined method 'formatter' for module DidYouMean E, [2024-05-10T15:31:31.205492 #971188] ERROR -- : ErrorHighlightTest#test_args_OPCALL: Test::Unit::ProxyError: undefined method 'formatter=' for module DidYouMean E, [2024-05-10T15:31:31.205510 #971188] ERROR -- : ErrorHighlightTest#test_CALL_noarg_4: Test::Unit::ProxyError: undefined method 'formatter' for module DidYouMean E, [2024-05-10T15:31:31.205527 #971188] ERROR -- : ErrorHighlightTest#test_CALL_noarg_4: Test::Unit::ProxyError: undefined method 'formatter=' for module DidYouMean E, [2024-05-10T15:31:31.205544 #971188] ERROR -- : ErrorHighlightTest#test_CALL_aref_1: Test::Unit::ProxyError: undefined method 'formatter' for module DidYouMean E, [2024-05-10T15:31:31.205561 #971188] ERROR -- : ErrorHighlightTest#test_CALL_aref_1: Test::Unit::ProxyError: undefined method 'formatter=' for module DidYouMean E, [2024-05-10T15:31:31.205578 #971188] ERROR -- : ErrorHighlightTest#test_CALL_send: Test::Unit::ProxyError: undefined method 'formatter' for module DidYouMean E, [2024-05-10T15:31:31.205595 #971188] ERROR -- : ErrorHighlightTest#test_CALL_send: Test::Unit::ProxyError: undefined method 'formatter=' for module DidYouMean E, [2024-05-10T15:31:31.205612 #971188] ERROR -- : ErrorHighlightTest#test_CALL_aref_3: Test::Unit::ProxyError: undefined method 'formatter' for module DidYouMean E, [2024-05-10T15:31:31.205628 #971188] ERROR -- : ErrorHighlightTest#test_CALL_aref_3: Test::Unit::ProxyError: undefined method 'formatter=' for module DidYouMean E, [2024-05-10T15:31:31.205645 #971188] ERROR -- : ErrorHighlightTest#test_CALL_aref_5: Test::Unit::ProxyError: undefined method 'formatter' for module DidYouMean E, [2024-05-10T15:31:31.205662 #971188] ERROR -- : ErrorHighlightTest#test_CALL_aref_5: Test::Unit::ProxyError: undefined method 'formatter=' for module DidYouMean E, [2024-05-10T15:31:31.205678 #971188] ERROR -- : ErrorHighlightTest#test_args_OP_ASGN1_aref_2: Test::Unit::ProxyError: undefined method 'formatter' for module DidYouMean E, [2024-05-10T15:31:31.205695 #971188] ERROR -- : ErrorHighlightTest#test_args_OP_ASGN1_aref_2: Test::Unit::ProxyError: undefined method 'formatter=' for module DidYouMean E, [2024-05-10T15:31:31.205712 #971188] ERROR -- : ErrorHighlightTest#test_OP_ASGN2_write_2: Test::Unit::ProxyError: undefined method 'formatter' for module DidYouMean E, [2024-05-10T15:31:31.205729 #971188] ERROR -- : ErrorHighlightTest#test_OP_ASGN2_write_2: Test::Unit::ProxyError: undefined method 'formatter=' for module DidYouMean E, [2024-05-10T15:31:31.205745 #971188] ERROR -- : ErrorHighlightTest#test_CALL_aset: Test::Unit::ProxyError: undefined method 'formatter' for module DidYouMean E, [2024-05-10T15:31:31.205762 #971188] ERROR -- : ErrorHighlightTest#test_CALL_aset: Test::Unit::ProxyError: undefined method 'formatter=' for module DidYouMean E, [2024-05-10T15:31:31.205778 #971188] ERROR -- : ErrorHighlightTest#test_QCALL_2: Test::Unit::ProxyError: undefined method 'formatter' for module DidYouMean E, [2024-05-10T15:31:31.205794 #971188] ERROR -- : ErrorHighlightTest#test_QCALL_2: Test::Unit::ProxyError: undefined method 'formatter=' for module DidYouMean E, [2024-05-10T15:31:31.205811 #971188] ERROR -- : ErrorHighlightTest#test_OP_ASGN1_aset_3: Test::Unit::ProxyError: undefined method 'formatter' for module DidYouMean E, [2024-05-10T15:31:31.205827 #971188] ERROR -- : ErrorHighlightTest#test_OP_ASGN1_aset_3: Test::Unit::ProxyError: undefined method 'formatter=' for module DidYouMean E, [2024-05-10T15:31:31.205853 #971188] ERROR -- : ErrorHighlightTest#test_OP_ASGN1_aset_1: Test::Unit::ProxyError: undefined method 'formatter' for module DidYouMean E, [2024-05-10T15:31:31.205871 #971188] ERROR -- : ErrorHighlightTest#test_OP_ASGN1_aset_1: Test::Unit::ProxyError: undefined method 'formatter=' for module DidYouMean E, [2024-05-10T15:31:31.205888 #971188] ERROR -- : ErrorHighlightTest#test_COLON3: Test::Unit::ProxyError: undefined method 'formatter' for module DidYouMean E, [2024-05-10T15:31:31.205904 #971188] ERROR -- : ErrorHighlightTest#test_COLON3: Test::Unit::ProxyError: undefined method 'formatter=' for module DidYouMean E, [2024-05-10T15:31:31.205921 #971188] ERROR -- : ErrorHighlightTest#test_args_FCALL_1: Test::Unit::ProxyError: undefined method 'formatter' for module DidYouMean E, [2024-05-10T15:31:31.205937 #971188] ERROR -- : ErrorHighlightTest#test_args_FCALL_1: Test::Unit::ProxyError: undefined method 'formatter=' for module DidYouMean E, [2024-05-10T15:31:31.205955 #971188] ERROR -- : ErrorHighlightTest#test_FCALL_2: Test::Unit::ProxyError: undefined method 'formatter' for module DidYouMean E, [2024-05-10T15:31:31.205971 #971188] ERROR -- : ErrorHighlightTest#test_FCALL_2: Test::Unit::ProxyError: undefined method 'formatter=' for module DidYouMean E, [2024-05-10T15:31:31.205994 #971188] ERROR -- : ErrorHighlightTest#test_OP_CDECL_read_3: Test::Unit::ProxyError: undefined method 'formatter' for module DidYouMean E, [2024-05-10T15:31:31.206017 #971188] ERROR -- : ErrorHighlightTest#test_OP_CDECL_read_3: Test::Unit::ProxyError: undefined method 'formatter=' for module DidYouMean E, [2024-05-10T15:31:31.206034 #971188] ERROR -- : ErrorHighlightTest#test_local_variable_get: Test::Unit::ProxyError: undefined method 'formatter' for module DidYouMean E, [2024-05-10T15:31:31.206051 #971188] ERROR -- : ErrorHighlightTest#test_local_variable_get: Test::Unit::ProxyError: undefined method 'formatter=' for module DidYouMean E, [2024-05-10T15:31:31.206067 #971188] ERROR -- : ErrorHighlightTest#test_args_CALL_1: Test::Unit::ProxyError: undefined method 'formatter' for module DidYouMean E, [2024-05-10T15:31:31.206085 #971188] ERROR -- : ErrorHighlightTest#test_args_CALL_1: Test::Unit::ProxyError: undefined method 'formatter=' for module DidYouMean E, [2024-05-10T15:31:31.206101 #971188] ERROR -- : ErrorHighlightTest#test_OP_CDECL_op_3: Test::Unit::ProxyError: undefined method 'formatter' for module DidYouMean E, [2024-05-10T15:31:31.206118 #971188] ERROR -- : ErrorHighlightTest#test_OP_CDECL_op_3: Test::Unit::ProxyError: undefined method 'formatter=' for module DidYouMean E, [2024-05-10T15:31:31.206138 #971188] ERROR -- : ErrorHighlightTest#test_OP_CDECL_read_1: Test::Unit::ProxyError: undefined method 'formatter' for module DidYouMean E, [2024-05-10T15:31:31.206156 #971188] ERROR -- : ErrorHighlightTest#test_OP_CDECL_read_1: Test::Unit::ProxyError: undefined method 'formatter=' for module DidYouMean E, [2024-05-10T15:31:31.206173 #971188] ERROR -- : ErrorHighlightTest#test_OP_CDECL_op_1: Test::Unit::ProxyError: undefined method 'formatter' for module DidYouMean E, [2024-05-10T15:31:31.206190 #971188] ERROR -- : ErrorHighlightTest#test_OP_CDECL_op_1: Test::Unit::ProxyError: undefined method 'formatter=' for module DidYouMean E, [2024-05-10T15:31:31.206206 #971188] ERROR -- : ErrorHighlightTest#test_OPCALL_binary_2: Test::Unit::ProxyError: undefined method 'formatter' for module DidYouMean E, [2024-05-10T15:31:31.206222 #971188] ERROR -- : ErrorHighlightTest#test_OPCALL_binary_2: Test::Unit::ProxyError: undefined method 'formatter=' for module DidYouMean E, [2024-05-10T15:31:31.206239 #971188] ERROR -- : ErrorHighlightTest#test_ATTRASGN_2: Test::Unit::ProxyError: undefined method 'formatter' for module DidYouMean E, [2024-05-10T15:31:31.206256 #971188] ERROR -- : ErrorHighlightTest#test_ATTRASGN_2: Test::Unit::ProxyError: undefined method 'formatter=' for module DidYouMean E, [2024-05-10T15:31:31.206276 #971188] ERROR -- : ErrorHighlightTest#test_CALL_special_call_2: Test::Unit::ProxyError: undefined method 'formatter' for module DidYouMean E, [2024-05-10T15:31:31.206300 #971188] ERROR -- : ErrorHighlightTest#test_CALL_special_call_2: Test::Unit::ProxyError: undefined method 'formatter=' for module DidYouMean E, [2024-05-10T15:31:31.206317 #971188] ERROR -- : ErrorHighlightTest#test_OP_ASGN1_op_4: Test::Unit::ProxyError: undefined method 'formatter' for module DidYouMean E, [2024-05-10T15:31:31.206333 #971188] ERROR -- : ErrorHighlightTest#test_OP_ASGN1_op_4: Test::Unit::ProxyError: undefined method 'formatter=' for module DidYouMean E, [2024-05-10T15:31:31.206350 #971188] ERROR -- : ErrorHighlightTest#test_OP_ASGN1_op_2: Test::Unit::ProxyError: undefined method 'formatter' for module DidYouMean I, [2024-05-10T15:31:31.206410 #971188] INFO -- : Retrying... E, [2024-05-10T15:31:31.206370 #971188] ERROR -- : ErrorHighlightTest#test_OP_ASGN1_op_2: Test::Unit::ProxyError: undefined method 'formatter=' for module DidYouMean E, [2024-05-10T15:31:31.206631 #971188] ERROR -- : ErrorHighlightTest#test_ATTRASGN_4: Test::Unit::ProxyError: undefined method 'formatter' for module DidYouMean E, [2024-05-10T15:31:31.206671 #971188] ERROR -- : ErrorHighlightTest#test_ATTRASGN_4: Test::Unit::ProxyError: undefined method 'formatter=' for module DidYouMean E, [2024-05-10T15:31:31.206695 #971188] ERROR -- : ErrorHighlightTest#test_OP_ASGN1_aref_1: Test::Unit::ProxyError: undefined method 'formatter' for module DidYouMean E, [2024-05-10T15:31:31.206724 #971188] ERROR -- : ErrorHighlightTest#test_OP_ASGN1_aref_1: Test::Unit::ProxyError: undefined method 'formatter=' for module DidYouMean E, [2024-05-10T15:31:31.206742 #971188] ERROR -- : ErrorHighlightTest#test_CALL_arg_5: Test::Unit::ProxyError: undefined method 'formatter' for module DidYouMean E, [2024-05-10T15:31:31.206760 #971188] ERROR -- : ErrorHighlightTest#test_CALL_arg_5: Test::Unit::ProxyError: undefined method 'formatter=' for module DidYouMean E, [2024-05-10T15:31:31.206777 #971188] ERROR -- : ErrorHighlightTest#test_OP_ASGN1_aref_3: Test::Unit::ProxyError: undefined method 'formatter' for module DidYouMean E, [2024-05-10T15:31:31.206793 #971188] ERROR -- : ErrorHighlightTest#test_OP_ASGN1_aref_3: Test::Unit::ProxyError: undefined method 'formatter=' for module DidYouMean E, [2024-05-10T15:31:31.206811 #971188] ERROR -- : ErrorHighlightTest#test_COLON2_4: Test::Unit::ProxyError: undefined method 'formatter' for module DidYouMean E, [2024-05-10T15:31:31.206827 #971188] ERROR -- : ErrorHighlightTest#test_COLON2_4: Test::Unit::ProxyError: undefined method 'formatter=' for module DidYouMean E, [2024-05-10T15:31:31.206843 #971188] ERROR -- : ErrorHighlightTest#test_OPCALL_unary_2: Test::Unit::ProxyError: undefined method 'formatter' for module DidYouMean E, [2024-05-10T15:31:31.206860 #971188] ERROR -- : ErrorHighlightTest#test_OPCALL_unary_2: Test::Unit::ProxyError: undefined method 'formatter=' for module DidYouMean E, [2024-05-10T15:31:31.206869 #971188] ERROR -- : ErrorHighlightTest#test_CALL_arg_3: Test::Unit::ProxyError: undefined method 'formatter' for module DidYouMean E, [2024-05-10T15:31:31.206875 #971188] ERROR -- : ErrorHighlightTest#test_CALL_arg_3: Test::Unit::ProxyError: undefined method 'formatter=' for module DidYouMean E, [2024-05-10T15:31:31.206881 #971188] ERROR -- : ErrorHighlightTest#test_OP_ASGN2_op_2: Test::Unit::ProxyError: undefined method 'formatter' for module DidYouMean E, [2024-05-10T15:31:31.206887 #971188] ERROR -- : ErrorHighlightTest#test_OP_ASGN2_op_2: Test::Unit::ProxyError: undefined method 'formatter=' for module DidYouMean E, [2024-05-10T15:31:31.206893 #971188] ERROR -- : ErrorHighlightTest#test_COLON2_2: Test::Unit::ProxyError: undefined method 'formatter' for module DidYouMean E, [2024-05-10T15:31:31.206899 #971188] ERROR -- : ErrorHighlightTest#test_COLON2_2: Test::Unit::ProxyError: undefined method 'formatter=' for module DidYouMean E, [2024-05-10T15:31:31.206906 #971188] ERROR -- : ErrorHighlightTest#test_CALL_arg_1: Test::Unit::ProxyError: undefined method 'formatter' for module DidYouMean E, [2024-05-10T15:31:31.206915 #971188] ERROR -- : ErrorHighlightTest#test_CALL_arg_1: Test::Unit::ProxyError: undefined method 'formatter=' for module DidYouMean E, [2024-05-10T15:31:31.206921 #971188] ERROR -- : ErrorHighlightTest#test_custom_formatter: Test::Unit::ProxyError: undefined method 'formatter' for module DidYouMean E, [2024-05-10T15:31:31.206928 #971188] ERROR -- : ErrorHighlightTest#test_custom_formatter: Test::Unit::ProxyError: undefined method 'formatter=' for module DidYouMean E, [2024-05-10T15:31:31.206934 #971188] ERROR -- : ErrorHighlightTest#test_args_ATTRASGN_1: Test::Unit::ProxyError: undefined method 'formatter' for module DidYouMean E, [2024-05-10T15:31:31.206940 #971188] ERROR -- : ErrorHighlightTest#test_args_ATTRASGN_1: Test::Unit::ProxyError: undefined method 'formatter=' for module DidYouMean E, [2024-05-10T15:31:31.206947 #971188] ERROR -- : ErrorHighlightTest#test_args_ATTRASGN_3: Test::Unit::ProxyError: undefined method 'formatter' for module DidYouMean E, [2024-05-10T15:31:31.206953 #971188] ERROR -- : ErrorHighlightTest#test_args_ATTRASGN_3: Test::Unit::ProxyError: undefined method 'formatter=' for module DidYouMean E, [2024-05-10T15:31:31.206959 #971188] ERROR -- : ErrorHighlightTest#test_const_get: Test::Unit::ProxyError: undefined method 'formatter' for module DidYouMean E, [2024-05-10T15:31:31.206965 #971188] ERROR -- : ErrorHighlightTest#test_const_get: Test::Unit::ProxyError: undefined method 'formatter=' for module DidYouMean E, [2024-05-10T15:31:31.206971 #971188] ERROR -- : ErrorHighlightTest#test_spot_with_backtrace_location: Test::Unit::ProxyError: undefined method 'formatter' for module DidYouMean E, [2024-05-10T15:31:31.206977 #971188] ERROR -- : ErrorHighlightTest#test_spot_with_backtrace_location: Test::Unit::ProxyError: undefined method 'formatter=' for module DidYouMean E, [2024-05-10T15:31:31.206983 #971188] ERROR -- : ErrorHighlightTest#test_OP_ASGN2_read_1: Test::Unit::ProxyError: undefined method 'formatter' for module DidYouMean E, [2024-05-10T15:31:31.206990 #971188] ERROR -- : ErrorHighlightTest#test_OP_ASGN2_read_1: Test::Unit::ProxyError: undefined method 'formatter=' for module DidYouMean E, [2024-05-10T15:31:31.206996 #971188] ERROR -- : ErrorHighlightTest#test_spot_with_node: Test::Unit::ProxyError: undefined method 'formatter' for module DidYouMean E, [2024-05-10T15:31:31.207002 #971188] ERROR -- : ErrorHighlightTest#test_spot_with_node: Test::Unit::ProxyError: undefined method 'formatter=' for module DidYouMean E, [2024-05-10T15:31:31.207008 #971188] ERROR -- : ErrorHighlightTest#test_OP_ASGN2_read_3: Test::Unit::ProxyError: undefined method 'formatter' for module DidYouMean E, [2024-05-10T15:31:31.207013 #971188] ERROR -- : ErrorHighlightTest#test_OP_ASGN2_read_3: Test::Unit::ProxyError: undefined method 'formatter=' for module DidYouMean E, [2024-05-10T15:31:31.207020 #971188] ERROR -- : ErrorHighlightTest#test_args_ATTRASGN_2: Test::Unit::ProxyError: undefined method 'formatter' for module DidYouMean E, [2024-05-10T15:31:31.207027 #971188] ERROR -- : ErrorHighlightTest#test_args_ATTRASGN_2: Test::Unit::ProxyError: undefined method 'formatter=' for module DidYouMean E, [2024-05-10T15:31:31.207033 #971188] ERROR -- : ErrorHighlightTest#test_explicit_raise_no_method_error: Test::Unit::ProxyError: undefined method 'formatter' for module DidYouMean E, [2024-05-10T15:31:31.207039 #971188] ERROR -- : ErrorHighlightTest#test_explicit_raise_no_method_error: Test::Unit::ProxyError: undefined method 'formatter=' for module DidYouMean E, [2024-05-10T15:31:31.207044 #971188] ERROR -- : ErrorHighlightTest#test_explicit_raise_name_error: Test::Unit::ProxyError: undefined method 'formatter' for module DidYouMean E, [2024-05-10T15:31:31.207051 #971188] ERROR -- : ErrorHighlightTest#test_explicit_raise_name_error: Test::Unit::ProxyError: undefined method 'formatter=' for module DidYouMean E, [2024-05-10T15:31:31.207059 #971188] ERROR -- : ErrorHighlightTest#test_OP_ASGN2_read_2: Test::Unit::ProxyError: undefined method 'formatter' for module DidYouMean E, [2024-05-10T15:31:31.207067 #971188] ERROR -- : ErrorHighlightTest#test_OP_ASGN2_read_2: Test::Unit::ProxyError: undefined method 'formatter=' for module DidYouMean E, [2024-05-10T15:31:31.207074 #971188] ERROR -- : ErrorHighlightTest#test_multibyte: Test::Unit::ProxyError: undefined method 'formatter' for module DidYouMean E, [2024-05-10T15:31:31.207080 #971188] ERROR -- : ErrorHighlightTest#test_multibyte: Test::Unit::ProxyError: undefined method 'formatter=' for module DidYouMean E, [2024-05-10T15:31:31.207085 #971188] ERROR -- : ErrorHighlightTest#test_ATTRASGN_5: Test::Unit::ProxyError: undefined method 'formatter' for module DidYouMean E, [2024-05-10T15:31:31.207091 #971188] ERROR -- : ErrorHighlightTest#test_ATTRASGN_5: Test::Unit::ProxyError: undefined method 'formatter=' for module DidYouMean E, [2024-05-10T15:31:31.207098 #971188] ERROR -- : ErrorHighlightTest#test_OP_ASGN1_op_1: Test::Unit::ProxyError: undefined method 'formatter' for module DidYouMean E, [2024-05-10T15:31:31.207107 #971188] ERROR -- : ErrorHighlightTest#test_OP_ASGN1_op_1: Test::Unit::ProxyError: undefined method 'formatter=' for module DidYouMean E, [2024-05-10T15:31:31.207113 #971188] ERROR -- : ErrorHighlightTest#test_OP_ASGN1_op_3: Test::Unit::ProxyError: undefined method 'formatter' for module DidYouMean E, [2024-05-10T15:31:31.207120 #971188] ERROR -- : ErrorHighlightTest#test_OP_ASGN1_op_3: Test::Unit::ProxyError: undefined method 'formatter=' for module DidYouMean E, [2024-05-10T15:31:31.207125 #971188] ERROR -- : ErrorHighlightTest#test_ATTRASGN_1: Test::Unit::ProxyError: undefined method 'formatter' for module DidYouMean E, [2024-05-10T15:31:31.207131 #971188] ERROR -- : ErrorHighlightTest#test_ATTRASGN_1: Test::Unit::ProxyError: undefined method 'formatter=' for module DidYouMean E, [2024-05-10T15:31:31.207138 #971188] ERROR -- : ErrorHighlightTest#test_CALL_special_call_1: Test::Unit::ProxyError: undefined method 'formatter' for module DidYouMean E, [2024-05-10T15:31:31.207144 #971188] ERROR -- : ErrorHighlightTest#test_CALL_special_call_1: Test::Unit::ProxyError: undefined method 'formatter=' for module DidYouMean E, [2024-05-10T15:31:31.207150 #971188] ERROR -- : ErrorHighlightTest#test_OPCALL_binary_1: Test::Unit::ProxyError: undefined method 'formatter' for module DidYouMean E, [2024-05-10T15:31:31.207156 #971188] ERROR -- : ErrorHighlightTest#test_OPCALL_binary_1: Test::Unit::ProxyError: undefined method 'formatter=' for module DidYouMean E, [2024-05-10T15:31:31.207162 #971188] ERROR -- : ErrorHighlightTest#test_ATTRASGN_3: Test::Unit::ProxyError: undefined method 'formatter' for module DidYouMean E, [2024-05-10T15:31:31.207168 #971188] ERROR -- : ErrorHighlightTest#test_ATTRASGN_3: Test::Unit::ProxyError: undefined method 'formatter=' for module DidYouMean E, [2024-05-10T15:31:31.207175 #971188] ERROR -- : ErrorHighlightTest#test_OPCALL_binary_3: Test::Unit::ProxyError: undefined method 'formatter' for module DidYouMean E, [2024-05-10T15:31:31.207181 #971188] ERROR -- : ErrorHighlightTest#test_OPCALL_binary_3: Test::Unit::ProxyError: undefined method 'formatter=' for module DidYouMean E, [2024-05-10T15:31:31.207187 #971188] ERROR -- : ErrorHighlightTest#test_COLON2_1: Test::Unit::ProxyError: undefined method 'formatter' for module DidYouMean E, [2024-05-10T15:31:31.207193 #971188] ERROR -- : ErrorHighlightTest#test_COLON2_1: Test::Unit::ProxyError: undefined method 'formatter=' for module DidYouMean E, [2024-05-10T15:31:31.207199 #971188] ERROR -- : ErrorHighlightTest#test_OP_ASGN2_op_1: Test::Unit::ProxyError: undefined method 'formatter' for module DidYouMean E, [2024-05-10T15:31:31.207205 #971188] ERROR -- : ErrorHighlightTest#test_OP_ASGN2_op_1: Test::Unit::ProxyError: undefined method 'formatter=' for module DidYouMean E, [2024-05-10T15:31:31.207212 #971188] ERROR -- : ErrorHighlightTest#test_OP_ASGN1_aref_4: Test::Unit::ProxyError: undefined method 'formatter' for module DidYouMean E, [2024-05-10T15:31:31.207218 #971188] ERROR -- : ErrorHighlightTest#test_OP_ASGN1_aref_4: Test::Unit::ProxyError: undefined method 'formatter=' for module DidYouMean E, [2024-05-10T15:31:31.207226 #971188] ERROR -- : ErrorHighlightTest#test_COLON2_3: Test::Unit::ProxyError: undefined method 'formatter' for module DidYouMean E, [2024-05-10T15:31:31.207232 #971188] ERROR -- : ErrorHighlightTest#test_COLON2_3: Test::Unit::ProxyError: undefined method 'formatter=' for module DidYouMean E, [2024-05-10T15:31:31.207238 #971188] ERROR -- : ErrorHighlightTest#test_OP_ASGN2_op_3: Test::Unit::ProxyError: undefined method 'formatter' for module DidYouMean E, [2024-05-10T15:31:31.207244 #971188] ERROR -- : ErrorHighlightTest#test_OP_ASGN2_op_3: Test::Unit::ProxyError: undefined method 'formatter=' for module DidYouMean E, [2024-05-10T15:31:31.207251 #971188] ERROR -- : ErrorHighlightTest#test_CALL_arg_2: Test::Unit::ProxyError: undefined method 'formatter' for module DidYouMean E, [2024-05-10T15:31:31.207257 #971188] ERROR -- : ErrorHighlightTest#test_CALL_arg_2: Test::Unit::ProxyError: undefined method 'formatter=' for module DidYouMean E, [2024-05-10T15:31:31.207263 #971188] ERROR -- : ErrorHighlightTest#test_CONST: Test::Unit::ProxyError: undefined method 'formatter' for module DidYouMean E, [2024-05-10T15:31:31.207269 #971188] ERROR -- : ErrorHighlightTest#test_CONST: Test::Unit::ProxyError: undefined method 'formatter=' for module DidYouMean E, [2024-05-10T15:31:31.207275 #971188] ERROR -- : ErrorHighlightTest#test_no_final_newline: Test::Unit::ProxyError: undefined method 'formatter' for module DidYouMean E, [2024-05-10T15:31:31.207280 #971188] ERROR -- : ErrorHighlightTest#test_no_final_newline: Test::Unit::ProxyError: undefined method 'formatter=' for module DidYouMean E, [2024-05-10T15:31:31.207288 #971188] ERROR -- : ErrorHighlightTest#test_simulate_funcallv_from_embedded_ruby: Test::Unit::ProxyError: undefined method 'formatter' for module DidYouMean E, [2024-05-10T15:31:31.207293 #971188] ERROR -- : ErrorHighlightTest#test_simulate_funcallv_from_embedded_ruby: Test::Unit::ProxyError: undefined method 'formatter=' for module DidYouMean E, [2024-05-10T15:31:31.207299 #971188] ERROR -- : ErrorHighlightTest#test_COLON2_5: Test::Unit::ProxyError: undefined method 'formatter' for module DidYouMean E, [2024-05-10T15:31:31.207306 #971188] ERROR -- : ErrorHighlightTest#test_COLON2_5: Test::Unit::ProxyError: undefined method 'formatter=' for module DidYouMean E, [2024-05-10T15:31:31.207311 #971188] ERROR -- : ErrorHighlightTest#test_OP_ASGN1_aref_2: Test::Unit::ProxyError: undefined method 'formatter' for module DidYouMean E, [2024-05-10T15:31:31.207318 #971188] ERROR -- : ErrorHighlightTest#test_OP_ASGN1_aref_2: Test::Unit::ProxyError: undefined method 'formatter=' for module DidYouMean E, [2024-05-10T15:31:31.207325 #971188] ERROR -- : ErrorHighlightTest#test_CALL_arg_4: Test::Unit::ProxyError: undefined method 'formatter' for module DidYouMean E, [2024-05-10T15:31:31.207332 #971188] ERROR -- : ErrorHighlightTest#test_CALL_arg_4: Test::Unit::ProxyError: undefined method 'formatter=' for module DidYouMean E, [2024-05-10T15:31:31.207338 #971188] ERROR -- : ErrorHighlightTest#test_OPCALL_unary_1: Test::Unit::ProxyError: undefined method 'formatter' for module DidYouMean E, [2024-05-10T15:31:31.207345 #971188] ERROR -- : ErrorHighlightTest#test_OPCALL_unary_1: Test::Unit::ProxyError: undefined method 'formatter=' for module DidYouMean E, [2024-05-10T15:31:31.207352 #971188] ERROR -- : ErrorHighlightTest#test_hard_tabs: Test::Unit::ProxyError: undefined method 'formatter' for module DidYouMean E, [2024-05-10T15:31:31.207358 #971188] ERROR -- : ErrorHighlightTest#test_hard_tabs: Test::Unit::ProxyError: undefined method 'formatter=' for module DidYouMean E, [2024-05-10T15:31:31.207364 #971188] ERROR -- : ErrorHighlightTest#test_CALL_arg_6: Test::Unit::ProxyError: undefined method 'formatter' for module DidYouMean E, [2024-05-10T15:31:31.207372 #971188] ERROR -- : ErrorHighlightTest#test_CALL_arg_6: Test::Unit::ProxyError: undefined method 'formatter=' for module DidYouMean E, [2024-05-10T15:31:31.207378 #971188] ERROR -- : ErrorHighlightTest#test_QCALL_1: Test::Unit::ProxyError: undefined method 'formatter' for module DidYouMean E, [2024-05-10T15:31:31.207386 #971188] ERROR -- : ErrorHighlightTest#test_QCALL_1: Test::Unit::ProxyError: undefined method 'formatter=' for module DidYouMean E, [2024-05-10T15:31:31.207392 #971188] ERROR -- : ErrorHighlightTest#test_OP_ASGN1_aset_2: Test::Unit::ProxyError: undefined method 'formatter' for module DidYouMean E, [2024-05-10T15:31:31.207398 #971188] ERROR -- : ErrorHighlightTest#test_OP_ASGN1_aset_2: Test::Unit::ProxyError: undefined method 'formatter=' for module DidYouMean E, [2024-05-10T15:31:31.207404 #971188] ERROR -- : ErrorHighlightTest#test_OP_ASGN1_aset_4: Test::Unit::ProxyError: undefined method 'formatter' for module DidYouMean E, [2024-05-10T15:31:31.207412 #971188] ERROR -- : ErrorHighlightTest#test_OP_ASGN1_aset_4: Test::Unit::ProxyError: undefined method 'formatter=' for module DidYouMean E, [2024-05-10T15:31:31.207417 #971188] ERROR -- : ErrorHighlightTest#test_OP_ASGN2_write_3: Test::Unit::ProxyError: undefined method 'formatter' for module DidYouMean E, [2024-05-10T15:31:31.207424 #971188] ERROR -- : ErrorHighlightTest#test_OP_ASGN2_write_3: Test::Unit::ProxyError: undefined method 'formatter=' for module DidYouMean E, [2024-05-10T15:31:31.207429 #971188] ERROR -- : ErrorHighlightTest#test_OP_ASGN2_write_1: Test::Unit::ProxyError: undefined method 'formatter' for module DidYouMean E, [2024-05-10T15:31:31.207435 #971188] ERROR -- : ErrorHighlightTest#test_OP_ASGN2_write_1: Test::Unit::ProxyError: undefined method 'formatter=' for module DidYouMean E, [2024-05-10T15:31:31.207443 #971188] ERROR -- : ErrorHighlightTest#test_args_OP_ASGN1_aref_1: Test::Unit::ProxyError: undefined method 'formatter' for module DidYouMean E, [2024-05-10T15:31:31.207449 #971188] ERROR -- : ErrorHighlightTest#test_args_OP_ASGN1_aref_1: Test::Unit::ProxyError: undefined method 'formatter=' for module DidYouMean E, [2024-05-10T15:31:31.207455 #971188] ERROR -- : ErrorHighlightTest#test_args_CALL_2: Test::Unit::ProxyError: undefined method 'formatter' for module DidYouMean E, [2024-05-10T15:31:31.207461 #971188] ERROR -- : ErrorHighlightTest#test_args_CALL_2: Test::Unit::ProxyError: undefined method 'formatter=' for module DidYouMean E, [2024-05-10T15:31:31.207497 #971188] ERROR -- : ErrorHighlightTest#test_spoofed_filename: Test::Unit::ProxyError: undefined method 'formatter' for module DidYouMean E, [2024-05-10T15:31:31.207513 #971188] ERROR -- : ErrorHighlightTest#test_spoofed_filename: Test::Unit::ProxyError: undefined method 'formatter=' for module DidYouMean E, [2024-05-10T15:31:31.207519 #971188] ERROR -- : ErrorHighlightTest#test_OP_CDECL_op_2: Test::Unit::ProxyError: undefined method 'formatter' for module DidYouMean E, [2024-05-10T15:31:31.207526 #971188] ERROR -- : ErrorHighlightTest#test_OP_CDECL_op_2: Test::Unit::ProxyError: undefined method 'formatter=' for module DidYouMean E, [2024-05-10T15:31:31.207534 #971188] ERROR -- : ErrorHighlightTest#test_VCALL_2: Test::Unit::ProxyError: undefined method 'formatter' for module DidYouMean E, [2024-05-10T15:31:31.207541 #971188] ERROR -- : ErrorHighlightTest#test_VCALL_2: Test::Unit::ProxyError: undefined method 'formatter=' for module DidYouMean E, [2024-05-10T15:31:31.207547 #971188] ERROR -- : ErrorHighlightTest#test_OP_CDECL_read_2: Test::Unit::ProxyError: undefined method 'formatter' for module DidYouMean E, [2024-05-10T15:31:31.207553 #971188] ERROR -- : ErrorHighlightTest#test_OP_CDECL_read_2: Test::Unit::ProxyError: undefined method 'formatter=' for module DidYouMean E, [2024-05-10T15:31:31.207559 #971188] ERROR -- : ErrorHighlightTest#test_FCALL_1: Test::Unit::ProxyError: undefined method 'formatter' for module DidYouMean E, [2024-05-10T15:31:31.207565 #971188] ERROR -- : ErrorHighlightTest#test_FCALL_1: Test::Unit::ProxyError: undefined method 'formatter=' for module DidYouMean E, [2024-05-10T15:31:31.207571 #971188] ERROR -- : ErrorHighlightTest#test_args_FCALL_2: Test::Unit::ProxyError: undefined method 'formatter' for module DidYouMean E, [2024-05-10T15:31:31.207583 #971188] ERROR -- : ErrorHighlightTest#test_args_FCALL_2: Test::Unit::ProxyError: undefined method 'formatter=' for module DidYouMean E, [2024-05-10T15:31:31.207593 #971188] ERROR -- : ErrorHighlightTest#test_CALL_noarg_3: Test::Unit::ProxyError: undefined method 'formatter' for module DidYouMean E, [2024-05-10T15:31:31.207599 #971188] ERROR -- : ErrorHighlightTest#test_CALL_noarg_3: Test::Unit::ProxyError: undefined method 'formatter=' for module DidYouMean E, [2024-05-10T15:31:31.207606 #971188] ERROR -- : ErrorHighlightTest#test_CALL_noarg_1: Test::Unit::ProxyError: undefined method 'formatter' for module DidYouMean E, [2024-05-10T15:31:31.207613 #971188] ERROR -- : ErrorHighlightTest#test_CALL_noarg_1: Test::Unit::ProxyError: undefined method 'formatter=' for module DidYouMean E, [2024-05-10T15:31:31.207619 #971188] ERROR -- : ErrorHighlightTest#test_args_OP_ASGN1_op: Test::Unit::ProxyError: undefined method 'formatter' for module DidYouMean E, [2024-05-10T15:31:31.207625 #971188] ERROR -- : ErrorHighlightTest#test_args_OP_ASGN1_op: Test::Unit::ProxyError: undefined method 'formatter=' for module DidYouMean E, [2024-05-10T15:31:31.207631 #971188] ERROR -- : ErrorHighlightTest#test_OP_CDECL_toplevel_1: Test::Unit::ProxyError: undefined method 'formatter' for module DidYouMean E, [2024-05-10T15:31:31.207637 #971188] ERROR -- : ErrorHighlightTest#test_OP_CDECL_toplevel_1: Test::Unit::ProxyError: undefined method 'formatter=' for module DidYouMean E, [2024-05-10T15:31:31.207643 #971188] ERROR -- : ErrorHighlightTest#test_CALL_op_asgn: Test::Unit::ProxyError: undefined method 'formatter' for module DidYouMean E, [2024-05-10T15:31:31.207653 #971188] ERROR -- : ErrorHighlightTest#test_CALL_op_asgn: Test::Unit::ProxyError: undefined method 'formatter=' for module DidYouMean E, [2024-05-10T15:31:31.207659 #971188] ERROR -- : ErrorHighlightTest#test_args_OP_ASGN2: Test::Unit::ProxyError: undefined method 'formatter' for module DidYouMean E, [2024-05-10T15:31:31.207665 #971188] ERROR -- : ErrorHighlightTest#test_args_OP_ASGN2: Test::Unit::ProxyError: undefined method 'formatter=' for module DidYouMean E, [2024-05-10T15:31:31.207671 #971188] ERROR -- : ErrorHighlightTest#test_CALL_aref_4: Test::Unit::ProxyError: undefined method 'formatter' for module DidYouMean E, [2024-05-10T15:31:31.207677 #971188] ERROR -- : ErrorHighlightTest#test_CALL_aref_4: Test::Unit::ProxyError: undefined method 'formatter=' for module DidYouMean E, [2024-05-10T15:31:31.207684 #971188] ERROR -- : ErrorHighlightTest#test_CALL_aref_2: Test::Unit::ProxyError: undefined method 'formatter' for module DidYouMean E, [2024-05-10T15:31:31.207689 #971188] ERROR -- : ErrorHighlightTest#test_CALL_aref_2: Test::Unit::ProxyError: undefined method 'formatter=' for module DidYouMean E, [2024-05-10T15:31:31.207695 #971188] ERROR -- : I, [2024-05-10T15:31:31.430569 #971188] INFO -- : Finished tests in 56.315622s, 470.3313 tests/s, 166114.0672 assertions/s. E, [2024-05-10T15:31:31.430677 #971188] ERROR -- : Children under /tmp/rubytest.scxq7b: E, [2024-05-10T15:31:31.430701 #971188] ERROR -- : * drwx------ 4 80 2024-05-10 15:30:54 +0000 gem_rebuild20240510-1012534-3bq1pl/ E, [2024-05-10T15:31:31.430714 #971188] ERROR -- : * drwxrwxr-x 2 60 2024-05-10 15:30:54 +0000 new/ E, [2024-05-10T15:31:31.430723 #971188] ERROR -- : * -rw-rw-r-- 1 4096 2024-05-10 15:30:54 +0000 rebuild_test_gem-1.0.0.gem E, [2024-05-10T15:31:31.430740 #971188] ERROR -- : * drwxrwxr-x 2 60 2024-05-10 15:30:54 +0000 old/ E, [2024-05-10T15:31:31.430769 #971188] ERROR -- : * -rw-rw-r-- 1 4096 2024-05-10 15:30:54 +0000 rebuild_test_gem-1.0.0.gem E, [2024-05-10T15:31:31.430782 #971188] ERROR -- : * drwx------ 2 40 2024-05-10 15:30:51 +0000 d20240510-1012545-3m4zza/ E, [2024-05-10T15:31:31.430791 #971188] ERROR -- : * drwx------ 2 40 2024-05-10 15:30:51 +0000 d20240510-1012545-fdl3le/ E, [2024-05-10T15:31:31.430814 #971188] ERROR -- : * drwx------ 2 40 2024-05-10 15:30:51 +0000 d20240510-1012545-knwt2v/ E, [2024-05-10T15:31:31.430824 #971188] ERROR -- : * drwx------ 2 40 2024-05-10 15:30:51 +0000 d20240510-1012545-p8il98/ E, [2024-05-10T15:31:31.430838 #971188] ERROR -- : * drwx------ 2 40 2024-05-10 15:30:51 +0000 d20240510-1012545-uxll9r/ I, [2024-05-10T15:31:31.431575 #971188] INFO -- : 26487 tests, 9354817 assertions, 0 failures, 0 errors, 312 skips I, [2024-05-10T15:31:31.431603 #971188] INFO -- : I, [2024-05-10T15:31:31.431616 #971188] INFO -- : ruby -v: ruby 3.4.0dev (2024-05-10T14:47:21Z master 34e0b5b2d4) [x86_64-linux] I, [2024-05-10T15:31:31.434003 #971188] INFO -- : $$$[end] "make yes-test-all TESTOPTS='--stderr-on-failure' TESTS='-j16'" exit with 0. I, [2024-05-10T15:31:31.434177 #971188] INFO -- : $$$[beg] make yes-test-rubyspec MSPECOPT='--error-output stderr --debug -j' TESTS='-j16' I, [2024-05-10T15:31:31.661830 #971188] INFO -- : BASERUBY = /usr/bin/ruby --disable=gems I, [2024-05-10T15:31:31.661889 #971188] INFO -- : CC = gcc I, [2024-05-10T15:31:31.661902 #971188] INFO -- : LD = ld I, [2024-05-10T15:31:31.661911 #971188] INFO -- : LDSHARED = gcc -shared I, [2024-05-10T15:31:31.661920 #971188] INFO -- : CFLAGS = -O3 -fno-fast-math -ggdb3 -Wall -Wextra -Wdeprecated-declarations -Wdiv-by-zero -Wduplicated-cond -Wimplicit-function-declaration -Wimplicit-int -Wpointer-arith -Wwrite-strings -Wold-style-definition -Wimplicit-fallthrough=0 -Wmissing-noreturn -Wno-cast-function-type -Wno-constant-logical-operand -Wno-long-long -Wno-missing-field-initializers -Wno-overlength-strings -Wno-packed-bitfield-compat -Wno-parentheses-equality -Wno-self-assign -Wno-tautological-compare -Wno-unused-parameter -Wno-unused-value -Wsuggest-attribute=format -Wsuggest-attribute=noreturn -Wunused-variable -Wmisleading-indentation -Wundef -fPIC I, [2024-05-10T15:31:31.661930 #971188] INFO -- : XCFLAGS = -U_FORTIFY_SOURCE -D_FORTIFY_SOURCE=2 -fstack-protector-strong -fno-strict-overflow -fvisibility=hidden -fexcess-precision=standard -DRUBY_EXPORT -I. -I.ext/include/x86_64-linux -I/tmp/ruby/src/trunk/include -I/tmp/ruby/src/trunk -I/tmp/ruby/src/trunk/prism -I/tmp/ruby/src/trunk/enc/unicode/15.0.0 I, [2024-05-10T15:31:31.661942 #971188] INFO -- : CPPFLAGS = I, [2024-05-10T15:31:31.661952 #971188] INFO -- : DLDFLAGS = -Wl,--compress-debug-sections=zlib -Wl,-soname,libruby.so.3.4 -fstack-protector-strong I, [2024-05-10T15:31:31.662199 #971188] INFO -- : SOLIBS = -lz -lrt -lrt -lgmp -ldl -lcrypt -lm -lpthread I, [2024-05-10T15:31:31.662209 #971188] INFO -- : LANG = C.UTF-8 I, [2024-05-10T15:31:31.662217 #971188] INFO -- : LC_ALL = I, [2024-05-10T15:31:31.662225 #971188] INFO -- : LC_CTYPE = I, [2024-05-10T15:31:31.662232 #971188] INFO -- : MFLAGS = I, [2024-05-10T15:31:31.662240 #971188] INFO -- : RUSTC = rustc I, [2024-05-10T15:31:31.662248 #971188] INFO -- : YJIT_RUSTC_ARGS = --crate-name=yjit --crate-type=staticlib --edition=2021 -g -C lto=thin -C opt-level=3 -C overflow-checks=on '--out-dir=/tmp/ruby/build/trunk/yjit/target/release/' /tmp/ruby/src/trunk/yjit/src/lib.rs I, [2024-05-10T15:31:31.662494 #971188] INFO -- : gcc (Ubuntu 11.4.0-1ubuntu1~22.04) 11.4.0 I, [2024-05-10T15:31:31.662517 #971188] INFO -- : Copyright (C) 2021 Free Software Foundation, Inc. I, [2024-05-10T15:31:31.662535 #971188] INFO -- : This is free software; see the source for copying conditions. There is NO I, [2024-05-10T15:31:31.662549 #971188] INFO -- : warranty; not even for MERCHANTABILITY or FITNESS FOR A PARTICULAR PURPOSE. I, [2024-05-10T15:31:31.662557 #971188] INFO -- : I, [2024-05-10T15:31:31.664412 #971188] INFO -- : generating enc.mk I, [2024-05-10T15:31:31.783959 #971188] INFO -- : making enc I, [2024-05-10T15:31:31.836002 #971188] INFO -- : make[1]: Entering directory '/tmp/ruby/build/trunk' I, [2024-05-10T15:31:31.836027 #971188] INFO -- : make[1]: Nothing to be done for 'enc'. I, [2024-05-10T15:31:31.836038 #971188] INFO -- : make[1]: Leaving directory '/tmp/ruby/build/trunk' I, [2024-05-10T15:31:31.836636 #971188] INFO -- : making srcs under enc I, [2024-05-10T15:31:31.903005 #971188] INFO -- : make[1]: Entering directory '/tmp/ruby/build/trunk' I, [2024-05-10T15:31:31.903038 #971188] INFO -- : make[1]: Nothing to be done for 'srcs'. I, [2024-05-10T15:31:31.903052 #971188] INFO -- : make[1]: Leaving directory '/tmp/ruby/build/trunk' I, [2024-05-10T15:31:31.903987 #971188] INFO -- : generating transdb.h I, [2024-05-10T15:31:32.036894 #971188] INFO -- : transdb.h unchanged I, [2024-05-10T15:31:32.038151 #971188] INFO -- : making trans I, [2024-05-10T15:31:32.071001 #971188] INFO -- : make[1]: Entering directory '/tmp/ruby/build/trunk' I, [2024-05-10T15:31:32.071025 #971188] INFO -- : make[1]: Nothing to be done for 'trans'. I, [2024-05-10T15:31:32.071037 #971188] INFO -- : make[1]: Leaving directory '/tmp/ruby/build/trunk' I, [2024-05-10T15:31:32.071615 #971188] INFO -- : making encs I, [2024-05-10T15:31:32.108905 #971188] INFO -- : make[1]: Entering directory '/tmp/ruby/build/trunk' I, [2024-05-10T15:31:32.108929 #971188] INFO -- : make[1]: Nothing to be done for 'encs'. I, [2024-05-10T15:31:32.108940 #971188] INFO -- : make[1]: Leaving directory '/tmp/ruby/build/trunk' I, [2024-05-10T15:31:32.112466 #971188] INFO -- : generating makefiles ext/configure-ext.mk I, [2024-05-10T15:31:32.141790 #971188] INFO -- : ext/configure-ext.mk updated I, [2024-05-10T15:31:32.144624 #971188] INFO -- : make[1]: Entering directory '/tmp/ruby/build/trunk' I, [2024-05-10T15:31:33.641312 #971188] INFO -- : make[1]: Leaving directory '/tmp/ruby/build/trunk' I, [2024-05-10T15:31:33.642383 #971188] INFO -- : generating makefile exts.mk I, [2024-05-10T15:31:33.720064 #971188] INFO -- : exts.mk unchanged I, [2024-05-10T15:31:33.725889 #971188] INFO -- : make[1]: Entering directory '/tmp/ruby/build/trunk' I, [2024-05-10T15:31:33.942359 #971188] INFO -- : make[2]: Entering directory '/tmp/ruby/build/trunk/ext/coverage' I, [2024-05-10T15:31:33.945154 #971188] INFO -- : make[2]: Leaving directory '/tmp/ruby/build/trunk/ext/coverage' I, [2024-05-10T15:31:33.948987 #971188] INFO -- : make[2]: Entering directory '/tmp/ruby/build/trunk/ext/date' I, [2024-05-10T15:31:33.951994 #971188] INFO -- : make[2]: Leaving directory '/tmp/ruby/build/trunk/ext/date' I, [2024-05-10T15:31:33.954649 #971188] INFO -- : make[2]: Entering directory '/tmp/ruby/build/trunk/ext/digest' I, [2024-05-10T15:31:33.960758 #971188] INFO -- : make[2]: Leaving directory '/tmp/ruby/build/trunk/ext/digest' I, [2024-05-10T15:31:33.982761 #971188] INFO -- : make[2]: Entering directory '/tmp/ruby/build/trunk/ext/digest/sha2' I, [2024-05-10T15:31:33.985868 #971188] INFO -- : make[2]: Leaving directory '/tmp/ruby/build/trunk/ext/digest/sha2' I, [2024-05-10T15:31:34.005136 #971188] INFO -- : make[2]: Entering directory '/tmp/ruby/build/trunk/ext/fiddle' I, [2024-05-10T15:31:34.020352 #971188] INFO -- : make[2]: Leaving directory '/tmp/ruby/build/trunk/ext/fiddle' I, [2024-05-10T15:31:34.023306 #971188] INFO -- : make[2]: Entering directory '/tmp/ruby/build/trunk/ext/io/console' I, [2024-05-10T15:31:34.027455 #971188] INFO -- : make[2]: Leaving directory '/tmp/ruby/build/trunk/ext/io/console' I, [2024-05-10T15:31:34.040443 #971188] INFO -- : make[2]: Entering directory '/tmp/ruby/build/trunk/ext/json' I, [2024-05-10T15:31:34.053196 #971188] INFO -- : make[2]: Leaving directory '/tmp/ruby/build/trunk/ext/json' I, [2024-05-10T15:31:34.067444 #971188] INFO -- : make[2]: Entering directory '/tmp/ruby/build/trunk/ext/monitor' I, [2024-05-10T15:31:34.070266 #971188] INFO -- : make[2]: Leaving directory '/tmp/ruby/build/trunk/ext/monitor' I, [2024-05-10T15:31:34.081323 #971188] INFO -- : make[2]: Entering directory '/tmp/ruby/build/trunk/ext/objspace' I, [2024-05-10T15:31:34.093712 #971188] INFO -- : make[2]: Leaving directory '/tmp/ruby/build/trunk/ext/objspace' I, [2024-05-10T15:31:34.106026 #971188] INFO -- : make[2]: Entering directory '/tmp/ruby/build/trunk/ext/openssl' I, [2024-05-10T15:31:34.118697 #971188] INFO -- : make[2]: Leaving directory '/tmp/ruby/build/trunk/ext/openssl' I, [2024-05-10T15:31:34.121804 #971188] INFO -- : make[2]: Entering directory '/tmp/ruby/build/trunk/ext/pathname' I, [2024-05-10T15:31:34.126626 #971188] INFO -- : make[2]: Leaving directory '/tmp/ruby/build/trunk/ext/pathname' I, [2024-05-10T15:31:34.130869 #971188] INFO -- : make[2]: Entering directory '/tmp/ruby/build/trunk/ext/psych' I, [2024-05-10T15:31:34.145805 #971188] INFO -- : make[2]: Leaving directory '/tmp/ruby/build/trunk/ext/psych' I, [2024-05-10T15:31:34.148836 #971188] INFO -- : make[2]: Entering directory '/tmp/ruby/build/trunk/ext/pty' I, [2024-05-10T15:31:34.154076 #971188] INFO -- : make[2]: Leaving directory '/tmp/ruby/build/trunk/ext/pty' I, [2024-05-10T15:31:34.163380 #971188] INFO -- : make[2]: Entering directory '/tmp/ruby/build/trunk/ext/ripper' I, [2024-05-10T15:31:34.173385 #971188] INFO -- : make[2]: Leaving directory '/tmp/ruby/build/trunk/ext/ripper' I, [2024-05-10T15:31:34.175353 #971188] INFO -- : make[2]: Entering directory '/tmp/ruby/build/trunk/ext/rubyvm' I, [2024-05-10T15:31:34.177769 #971188] INFO -- : make[2]: Leaving directory '/tmp/ruby/build/trunk/ext/rubyvm' I, [2024-05-10T15:31:34.185791 #971188] INFO -- : make[2]: Entering directory '/tmp/ruby/build/trunk/ext/socket' I, [2024-05-10T15:31:34.202088 #971188] INFO -- : make[2]: Leaving directory '/tmp/ruby/build/trunk/ext/socket' I, [2024-05-10T15:31:34.213152 #971188] INFO -- : make[2]: Entering directory '/tmp/ruby/build/trunk/.bundle/gems/bigdecimal-3.1.8/ext/bigdecimal' I, [2024-05-10T15:31:34.235840 #971188] INFO -- : make[2]: Leaving directory '/tmp/ruby/build/trunk/.bundle/gems/bigdecimal-3.1.8/ext/bigdecimal' I, [2024-05-10T15:31:34.238024 #971188] INFO -- : make[2]: Entering directory '/tmp/ruby/build/trunk/.bundle/gems/debug-1.9.2/ext/debug' I, [2024-05-10T15:31:34.297121 #971188] INFO -- : make[2]: Leaving directory '/tmp/ruby/build/trunk/.bundle/gems/debug-1.9.2/ext/debug' I, [2024-05-10T15:31:34.299203 #971188] INFO -- : make[2]: Entering directory '/tmp/ruby/build/trunk/.bundle/gems/nkf-0.2.0/ext/nkf' I, [2024-05-10T15:31:34.356879 #971188] INFO -- : make[2]: Leaving directory '/tmp/ruby/build/trunk/.bundle/gems/nkf-0.2.0/ext/nkf' I, [2024-05-10T15:31:34.358856 #971188] INFO -- : make[2]: Entering directory '/tmp/ruby/build/trunk/.bundle/gems/racc-1.7.3/ext/racc/cparse' I, [2024-05-10T15:31:34.380854 #971188] INFO -- : make[2]: Leaving directory '/tmp/ruby/build/trunk/.bundle/gems/racc-1.7.3/ext/racc/cparse' I, [2024-05-10T15:31:34.383209 #971188] INFO -- : make[2]: Entering directory '/tmp/ruby/build/trunk/.bundle/gems/rbs-3.4.4/ext/rbs_extension' I, [2024-05-10T15:31:34.405223 #971188] INFO -- : make[2]: Leaving directory '/tmp/ruby/build/trunk/.bundle/gems/rbs-3.4.4/ext/rbs_extension' I, [2024-05-10T15:31:34.407431 #971188] INFO -- : make[2]: Entering directory '/tmp/ruby/build/trunk/.bundle/gems/syslog-0.1.2/ext/syslog' I, [2024-05-10T15:31:34.429873 #971188] INFO -- : make[2]: Leaving directory '/tmp/ruby/build/trunk/.bundle/gems/syslog-0.1.2/ext/syslog' I, [2024-05-10T15:31:34.452341 #971188] INFO -- : make[2]: Entering directory '/tmp/ruby/build/trunk' I, [2024-05-10T15:31:34.531879 #971188] INFO -- : make[2]: 'ruby' is up to date. I, [2024-05-10T15:31:34.531924 #971188] INFO -- : make[2]: Leaving directory '/tmp/ruby/build/trunk' I, [2024-05-10T15:31:34.532141 #971188] INFO -- : make[1]: Leaving directory '/tmp/ruby/build/trunk' I, [2024-05-10T15:31:34.535685 #971188] INFO -- : make[1]: Entering directory '/tmp/ruby/build/trunk' I, [2024-05-10T15:31:34.535708 #971188] INFO -- : make[1]: Nothing to be done for 'note'. I, [2024-05-10T15:31:34.535728 #971188] INFO -- : make[1]: Leaving directory '/tmp/ruby/build/trunk' E, [2024-05-10T15:31:34.628725 #971188] ERROR -- : $ /tmp/ruby/build/trunk/miniruby -I/tmp/ruby/src/trunk/lib /tmp/ruby/src/trunk/tool/runruby.rb --archdir=/tmp/ruby/build/trunk --extout=.ext -- /tmp/ruby/src/trunk/spec/mspec/bin/mspec-run -B /tmp/ruby/src/trunk/spec/default.mspec --error-output stderr --debug -fy -o /tmp/rubytest.uulv10/1-mspec-multi-0 E, [2024-05-10T15:31:34.629232 #971188] ERROR -- : $ /tmp/ruby/build/trunk/miniruby -I/tmp/ruby/src/trunk/lib /tmp/ruby/src/trunk/tool/runruby.rb --archdir=/tmp/ruby/build/trunk --extout=.ext -- /tmp/ruby/src/trunk/spec/mspec/bin/mspec-run -B /tmp/ruby/src/trunk/spec/default.mspec --error-output stderr --debug -fy -o /tmp/rubytest.uulv10/2-mspec-multi-1 E, [2024-05-10T15:31:34.629352 #971188] ERROR -- : $ /tmp/ruby/build/trunk/miniruby -I/tmp/ruby/src/trunk/lib /tmp/ruby/src/trunk/tool/runruby.rb --archdir=/tmp/ruby/build/trunk --extout=.ext -- /tmp/ruby/src/trunk/spec/mspec/bin/mspec-run -B /tmp/ruby/src/trunk/spec/default.mspec --error-output stderr --debug -fy -o /tmp/rubytest.uulv10/3-mspec-multi-2 E, [2024-05-10T15:31:34.629531 #971188] ERROR -- : $ /tmp/ruby/build/trunk/miniruby -I/tmp/ruby/src/trunk/lib /tmp/ruby/src/trunk/tool/runruby.rb --archdir=/tmp/ruby/build/trunk --extout=.ext -- /tmp/ruby/src/trunk/spec/mspec/bin/mspec-run -B /tmp/ruby/src/trunk/spec/default.mspec --error-output stderr --debug -fy -o /tmp/rubytest.uulv10/4-mspec-multi-3 E, [2024-05-10T15:31:34.629707 #971188] ERROR -- : $ /tmp/ruby/build/trunk/miniruby -I/tmp/ruby/src/trunk/lib /tmp/ruby/src/trunk/tool/runruby.rb --archdir=/tmp/ruby/build/trunk --extout=.ext -- /tmp/ruby/src/trunk/spec/mspec/bin/mspec-run -B /tmp/ruby/src/trunk/spec/default.mspec --error-output stderr --debug -fy -o /tmp/rubytest.uulv10/5-mspec-multi-4 E, [2024-05-10T15:31:34.629883 #971188] ERROR -- : $ /tmp/ruby/build/trunk/miniruby -I/tmp/ruby/src/trunk/lib /tmp/ruby/src/trunk/tool/runruby.rb --archdir=/tmp/ruby/build/trunk --extout=.ext -- /tmp/ruby/src/trunk/spec/mspec/bin/mspec-run -B /tmp/ruby/src/trunk/spec/default.mspec --error-output stderr --debug -fy -o /tmp/rubytest.uulv10/6-mspec-multi-5 E, [2024-05-10T15:31:34.630062 #971188] ERROR -- : $ /tmp/ruby/build/trunk/miniruby -I/tmp/ruby/src/trunk/lib /tmp/ruby/src/trunk/tool/runruby.rb --archdir=/tmp/ruby/build/trunk --extout=.ext -- /tmp/ruby/src/trunk/spec/mspec/bin/mspec-run -B /tmp/ruby/src/trunk/spec/default.mspec --error-output stderr --debug -fy -o /tmp/rubytest.uulv10/7-mspec-multi-6 E, [2024-05-10T15:31:34.630199 #971188] ERROR -- : $ /tmp/ruby/build/trunk/miniruby -I/tmp/ruby/src/trunk/lib /tmp/ruby/src/trunk/tool/runruby.rb --archdir=/tmp/ruby/build/trunk --extout=.ext -- /tmp/ruby/src/trunk/spec/mspec/bin/mspec-run -B /tmp/ruby/src/trunk/spec/default.mspec --error-output stderr --debug -fy -o /tmp/rubytest.uulv10/8-mspec-multi-7 E, [2024-05-10T15:31:34.630350 #971188] ERROR -- : $ /tmp/ruby/build/trunk/miniruby -I/tmp/ruby/src/trunk/lib /tmp/ruby/src/trunk/tool/runruby.rb --archdir=/tmp/ruby/build/trunk --extout=.ext -- /tmp/ruby/src/trunk/spec/mspec/bin/mspec-run -B /tmp/ruby/src/trunk/spec/default.mspec --error-output stderr --debug -fy -o /tmp/rubytest.uulv10/9-mspec-multi-8 E, [2024-05-10T15:31:34.630570 #971188] ERROR -- : $ /tmp/ruby/build/trunk/miniruby -I/tmp/ruby/src/trunk/lib /tmp/ruby/src/trunk/tool/runruby.rb --archdir=/tmp/ruby/build/trunk --extout=.ext -- /tmp/ruby/src/trunk/spec/mspec/bin/mspec-run -B /tmp/ruby/src/trunk/spec/default.mspec --error-output stderr --debug -fy -o /tmp/rubytest.uulv10/10-mspec-multi-9 E, [2024-05-10T15:31:34.630811 #971188] ERROR -- : $ /tmp/ruby/build/trunk/miniruby -I/tmp/ruby/src/trunk/lib /tmp/ruby/src/trunk/tool/runruby.rb --archdir=/tmp/ruby/build/trunk --extout=.ext -- /tmp/ruby/src/trunk/spec/mspec/bin/mspec-run -B /tmp/ruby/src/trunk/spec/default.mspec --error-output stderr --debug -fy -o /tmp/rubytest.uulv10/11-mspec-multi-10 E, [2024-05-10T15:31:34.641088 #971188] ERROR -- : $ /tmp/ruby/build/trunk/miniruby -I/tmp/ruby/src/trunk/lib /tmp/ruby/src/trunk/tool/runruby.rb --archdir=/tmp/ruby/build/trunk --extout=.ext -- /tmp/ruby/src/trunk/spec/mspec/bin/mspec-run -B /tmp/ruby/src/trunk/spec/default.mspec --error-output stderr --debug -fy -o /tmp/rubytest.uulv10/12-mspec-multi-11 E, [2024-05-10T15:31:34.641591 #971188] ERROR -- : $ /tmp/ruby/build/trunk/miniruby -I/tmp/ruby/src/trunk/lib /tmp/ruby/src/trunk/tool/runruby.rb --archdir=/tmp/ruby/build/trunk --extout=.ext -- /tmp/ruby/src/trunk/spec/mspec/bin/mspec-run -B /tmp/ruby/src/trunk/spec/default.mspec --error-output stderr --debug -fy -o /tmp/rubytest.uulv10/13-mspec-multi-12 E, [2024-05-10T15:31:34.641792 #971188] ERROR -- : $ /tmp/ruby/build/trunk/miniruby -I/tmp/ruby/src/trunk/lib /tmp/ruby/src/trunk/tool/runruby.rb --archdir=/tmp/ruby/build/trunk --extout=.ext -- /tmp/ruby/src/trunk/spec/mspec/bin/mspec-run -B /tmp/ruby/src/trunk/spec/default.mspec --error-output stderr --debug -fy -o /tmp/rubytest.uulv10/14-mspec-multi-13 E, [2024-05-10T15:31:34.641983 #971188] ERROR -- : $ /tmp/ruby/build/trunk/miniruby -I/tmp/ruby/src/trunk/lib /tmp/ruby/src/trunk/tool/runruby.rb --archdir=/tmp/ruby/build/trunk --extout=.ext -- /tmp/ruby/src/trunk/spec/mspec/bin/mspec-run -B /tmp/ruby/src/trunk/spec/default.mspec --error-output stderr --debug -fy -o /tmp/rubytest.uulv10/15-mspec-multi-14 E, [2024-05-10T15:31:34.645343 #971188] ERROR -- : $ /tmp/ruby/build/trunk/miniruby -I/tmp/ruby/src/trunk/lib /tmp/ruby/src/trunk/tool/runruby.rb --archdir=/tmp/ruby/build/trunk --extout=.ext -- /tmp/ruby/src/trunk/spec/mspec/bin/mspec-run -B /tmp/ruby/src/trunk/spec/default.mspec --error-output stderr --debug -fy -o /tmp/rubytest.uulv10/16-mspec-multi-15 I, [2024-05-10T15:31:34.849076 #971188] INFO -- : ruby 3.4.0dev (2024-05-10T14:47:21Z master 34e0b5b2d4) [x86_64-linux] I, [2024-05-10T15:31:36.266838 #971188] INFO -- : 0 ......................................................................... I, [2024-05-10T15:31:36.919379 #971188] INFO -- : 73 ......................................................................... I, [2024-05-10T15:31:37.125451 #971188] INFO -- : 146 ......................................................................... I, [2024-05-10T15:31:37.197551 #971188] INFO -- : 219 ......................................................................... I, [2024-05-10T15:31:37.287065 #971188] INFO -- : 292 ......................................................................... I, [2024-05-10T15:31:37.364270 #971188] INFO -- : 365 ......................................................................... I, [2024-05-10T15:31:37.399257 #971188] INFO -- : 438 ......................................................................... I, [2024-05-10T15:31:37.428744 #971188] INFO -- : 511 ......................................................................... I, [2024-05-10T15:31:37.457897 #971188] INFO -- : 584 ......................................................................... I, [2024-05-10T15:31:37.559006 #971188] INFO -- : 657 ......................................................................... I, [2024-05-10T15:31:37.601001 #971188] INFO -- : 730 ......................................................................... I, [2024-05-10T15:31:37.637712 #971188] INFO -- : 803 ......................................................................... I, [2024-05-10T15:31:37.692466 #971188] INFO -- : 876 ......................................................................... I, [2024-05-10T15:31:37.771455 #971188] INFO -- : 949 ......................................................................... I, [2024-05-10T15:31:37.910231 #971188] INFO -- : 1022 ......................................................................... I, [2024-05-10T15:31:38.245143 #971188] INFO -- : 1095 ......................................................................... I, [2024-05-10T15:31:38.452056 #971188] INFO -- : 1168 ......................................................................... I, [2024-05-10T15:31:38.560330 #971188] INFO -- : 1241 ......................................................................... I, [2024-05-10T15:31:38.683648 #971188] INFO -- : 1314 ......................................................................... I, [2024-05-10T15:31:38.755610 #971188] INFO -- : 1387 ......................................................................... I, [2024-05-10T15:31:38.926379 #971188] INFO -- : 1460 ......................................................................... I, [2024-05-10T15:31:39.868800 #971188] INFO -- : 1533 ......................................................................... I, [2024-05-10T15:31:39.949257 #971188] INFO -- : 1606 ......................................................................... I, [2024-05-10T15:31:40.083447 #971188] INFO -- : 1679 ......................................................................... I, [2024-05-10T15:31:40.233924 #971188] INFO -- : 1752 ......................................................................... I, [2024-05-10T15:31:40.369538 #971188] INFO -- : 1825 ......................................................................... I, [2024-05-10T15:31:40.582374 #971188] INFO -- : 1898 ......................................................................... I, [2024-05-10T15:31:40.734444 #971188] INFO -- : 1971 ......................................................................... I, [2024-05-10T15:31:40.867418 #971188] INFO -- : 2044 ......................................................................... I, [2024-05-10T15:31:40.949965 #971188] INFO -- : 2117 ......................................................................... I, [2024-05-10T15:31:40.980555 #971188] INFO -- : 2190 ......................................................................... I, [2024-05-10T15:31:41.015511 #971188] INFO -- : 2263 ......................................................................... I, [2024-05-10T15:31:41.039979 #971188] INFO -- : 2336 ......................................................................... I, [2024-05-10T15:31:41.113987 #971188] INFO -- : 2409 ......................................................................... I, [2024-05-10T15:31:41.320779 #971188] INFO -- : 2482 ......................................................................... I, [2024-05-10T15:31:41.376900 #971188] INFO -- : 2555 ......................................................................... I, [2024-05-10T15:31:41.539075 #971188] INFO -- : 2628 ......................................................................... I, [2024-05-10T15:31:41.683534 #971188] INFO -- : 2701 ......................................................................... I, [2024-05-10T15:31:41.747524 #971188] INFO -- : 2774 ......................................................................... I, [2024-05-10T15:31:41.848471 #971188] INFO -- : 2847 ......................................................................... I, [2024-05-10T15:31:41.900969 #971188] INFO -- : 2920 ......................................................................... I, [2024-05-10T15:31:41.935452 #971188] INFO -- : 2993 ......................................................................... I, [2024-05-10T15:31:41.963987 #971188] INFO -- : 3066 ......................................................................... I, [2024-05-10T15:31:41.979480 #971188] INFO -- : 3139 ......................................................................... I, [2024-05-10T15:31:41.997212 #971188] INFO -- : 3212 ......................................................................... I, [2024-05-10T15:31:42.040357 #971188] INFO -- : 3285 ......................................................................... I, [2024-05-10T15:31:45.983859 #971188] INFO -- : 3358 ........................................................................ I, [2024-05-10T15:31:45.983911 #971188] INFO -- : I, [2024-05-10T15:31:45.983923 #971188] INFO -- : Finished in 11.354120 seconds I, [2024-05-10T15:31:45.983932 #971188] INFO -- : I, [2024-05-10T15:31:45.983940 #971188] INFO -- : 3429 files, 32611 examples, 157025 expectations, 0 failures, 0 errors, 0 tagged I, [2024-05-10T15:31:45.986004 #971188] INFO -- : $$$[end] "make yes-test-rubyspec MSPECOPT='--error-output stderr --debug -j' TESTS='-j16'" exit with 0.