# Logfile created on 2024-05-10 12:10:25 +0000 by logger.rb/v1.4.3 I, [2024-05-10T12:10:25.188996 #663761] INFO -- : #, @formatter=nil, @logdev=#, @binmode=false, @mon_data=#, @mon_data_owner_object_id=860>>> I, [2024-05-10T12:10:25.189140 #663761] INFO -- : $$$[beg] make update-unicode -j16 I, [2024-05-10T12:10:25.317530 #663761] INFO -- : Downloading Unicode emoji 15.0 files... I, [2024-05-10T12:10:25.317584 #663761] INFO -- : Downloading Unicode emoji 15.0 files... I, [2024-05-10T12:10:25.318243 #663761] INFO -- : Downloading Unicode emoji 15.0 files... I, [2024-05-10T12:10:25.357807 #663761] INFO -- : made symlink emoji/15.0/emoji-sequences.txt to /tmp/ruby/src/trunk/.downloaded-cache/emoji/15.0/emoji-sequences.txt I, [2024-05-10T12:10:25.374728 #663761] INFO -- : downloading emoji/15.0/emoji-test.txt ... /tmp/ruby/src/trunk/enc/unicode/data/emoji/15.0/emoji-sequences.txt already exists I, [2024-05-10T12:10:25.374800 #663761] INFO -- : /tmp/ruby/src/trunk/enc/unicode/data/emoji/15.0/emoji-sequences.txt already exists E, [2024-05-10T12:10:25.809876 #663761] ERROR -- : /tmp/ruby/src/trunk/tool/downloader.rb:302:in `rescue in download': failed to download emoji/15.0/emoji-test.txt (RuntimeError) E, [2024-05-10T12:10:25.809954 #663761] ERROR -- : OpenURI::HTTPError: 403 Forbidden: https://www.unicode.org/Public/emoji/15.0/emoji-test.txt E, [2024-05-10T12:10:25.809967 #663761] ERROR -- : from /tmp/ruby/src/trunk/tool/downloader.rb:201:in `download' E, [2024-05-10T12:10:25.809975 #663761] ERROR -- : from /tmp/ruby/src/trunk/tool/downloader.rb:136:in `download' E, [2024-05-10T12:10:25.809984 #663761] ERROR -- : from /tmp/ruby/src/trunk/tool/downloader.rb:482:in `block in
' E, [2024-05-10T12:10:25.809993 #663761] ERROR -- : from /tmp/ruby/src/trunk/tool/downloader.rb:465:in `each' E, [2024-05-10T12:10:25.810002 #663761] ERROR -- : from /tmp/ruby/src/trunk/tool/downloader.rb:465:in `
' E, [2024-05-10T12:10:25.810013 #663761] ERROR -- : /usr/lib/ruby/3.0.0/open-uri.rb:364:in `open_http': 403 Forbidden (OpenURI::HTTPError) E, [2024-05-10T12:10:25.810027 #663761] ERROR -- : from /usr/lib/ruby/3.0.0/open-uri.rb:741:in `buffer_open' E, [2024-05-10T12:10:25.810046 #663761] ERROR -- : from /usr/lib/ruby/3.0.0/open-uri.rb:212:in `block in open_loop' E, [2024-05-10T12:10:25.810064 #663761] ERROR -- : from /usr/lib/ruby/3.0.0/open-uri.rb:210:in `catch' E, [2024-05-10T12:10:25.810084 #663761] ERROR -- : from /usr/lib/ruby/3.0.0/open-uri.rb:210:in `open_loop' E, [2024-05-10T12:10:25.810103 #663761] ERROR -- : from /usr/lib/ruby/3.0.0/open-uri.rb:151:in `open_uri' E, [2024-05-10T12:10:25.810123 #663761] ERROR -- : from /usr/lib/ruby/3.0.0/open-uri.rb:721:in `open' E, [2024-05-10T12:10:25.810142 #663761] ERROR -- : from /usr/lib/ruby/3.0.0/open-uri.rb:729:in `read' E, [2024-05-10T12:10:25.810161 #663761] ERROR -- : from /tmp/ruby/src/trunk/tool/downloader.rb:247:in `block in download' E, [2024-05-10T12:10:25.810205 #663761] ERROR -- : from /tmp/ruby/src/trunk/tool/downloader.rb:378:in `with_retry' E, [2024-05-10T12:10:25.810226 #663761] ERROR -- : from /tmp/ruby/src/trunk/tool/downloader.rb:246:in `download' E, [2024-05-10T12:10:25.810252 #663761] ERROR -- : from /tmp/ruby/src/trunk/tool/downloader.rb:136:in `download' E, [2024-05-10T12:10:25.810271 #663761] ERROR -- : from /tmp/ruby/src/trunk/tool/downloader.rb:482:in `block in
' E, [2024-05-10T12:10:25.810291 #663761] ERROR -- : from /tmp/ruby/src/trunk/tool/downloader.rb:465:in `each' E, [2024-05-10T12:10:25.810311 #663761] ERROR -- : from /tmp/ruby/src/trunk/tool/downloader.rb:465:in `
' E, [2024-05-10T12:10:25.815311 #663761] ERROR -- : make: *** [uncommon.mk:1765: /tmp/ruby/src/trunk/enc/unicode/data/emoji/15.0/emoji-zwj-sequences.txt] Error 1 E, [2024-05-10T12:10:25.815419 #663761] ERROR -- : make: *** Waiting for unfinished jobs.... E, [2024-05-10T12:10:25.828812 #663761] ERROR -- : /tmp/ruby/src/trunk/tool/downloader.rb:302:in `rescue in download': failed to download emoji/15.0/emoji-test.txt (RuntimeError) E, [2024-05-10T12:10:25.828860 #663761] ERROR -- : OpenURI::HTTPError: 403 Forbidden: https://www.unicode.org/Public/emoji/15.0/emoji-test.txt E, [2024-05-10T12:10:25.828872 #663761] ERROR -- : from /tmp/ruby/src/trunk/tool/downloader.rb:201:in `download' E, [2024-05-10T12:10:25.828880 #663761] ERROR -- : from /tmp/ruby/src/trunk/tool/downloader.rb:136:in `download' E, [2024-05-10T12:10:25.828888 #663761] ERROR -- : from /tmp/ruby/src/trunk/tool/downloader.rb:482:in `block in
' E, [2024-05-10T12:10:25.828895 #663761] ERROR -- : from /tmp/ruby/src/trunk/tool/downloader.rb:465:in `each' E, [2024-05-10T12:10:25.828902 #663761] ERROR -- : from /tmp/ruby/src/trunk/tool/downloader.rb:465:in `
' E, [2024-05-10T12:10:25.828909 #663761] ERROR -- : /usr/lib/ruby/3.0.0/open-uri.rb:364:in `open_http': 403 Forbidden (OpenURI::HTTPError) E, [2024-05-10T12:10:25.828917 #663761] ERROR -- : from /usr/lib/ruby/3.0.0/open-uri.rb:741:in `buffer_open' E, [2024-05-10T12:10:25.828926 #663761] ERROR -- : from /usr/lib/ruby/3.0.0/open-uri.rb:212:in `block in open_loop' E, [2024-05-10T12:10:25.828933 #663761] ERROR -- : from /usr/lib/ruby/3.0.0/open-uri.rb:210:in `catch' E, [2024-05-10T12:10:25.828940 #663761] ERROR -- : from /usr/lib/ruby/3.0.0/open-uri.rb:210:in `open_loop' E, [2024-05-10T12:10:25.828947 #663761] ERROR -- : from /usr/lib/ruby/3.0.0/open-uri.rb:151:in `open_uri' E, [2024-05-10T12:10:25.828954 #663761] ERROR -- : from /usr/lib/ruby/3.0.0/open-uri.rb:721:in `open' E, [2024-05-10T12:10:25.828961 #663761] ERROR -- : from /usr/lib/ruby/3.0.0/open-uri.rb:729:in `read' E, [2024-05-10T12:10:25.828969 #663761] ERROR -- : from /tmp/ruby/src/trunk/tool/downloader.rb:247:in `block in download' E, [2024-05-10T12:10:25.828977 #663761] ERROR -- : from /tmp/ruby/src/trunk/tool/downloader.rb:378:in `with_retry' E, [2024-05-10T12:10:25.828986 #663761] ERROR -- : from /tmp/ruby/src/trunk/tool/downloader.rb:246:in `download' E, [2024-05-10T12:10:25.828993 #663761] ERROR -- : from /tmp/ruby/src/trunk/tool/downloader.rb:136:in `download' E, [2024-05-10T12:10:25.829000 #663761] ERROR -- : from /tmp/ruby/src/trunk/tool/downloader.rb:482:in `block in
' E, [2024-05-10T12:10:25.829007 #663761] ERROR -- : from /tmp/ruby/src/trunk/tool/downloader.rb:465:in `each' E, [2024-05-10T12:10:25.829014 #663761] ERROR -- : from /tmp/ruby/src/trunk/tool/downloader.rb:465:in `
' E, [2024-05-10T12:10:25.832760 #663761] ERROR -- : make: *** [uncommon.mk:1765: /tmp/ruby/src/trunk/enc/unicode/data/emoji/15.0/emoji-test.txt] Error 1 E, [2024-05-10T12:10:25.840368 #663761] ERROR -- : /tmp/ruby/src/trunk/tool/downloader.rb:302:in `rescue in download': failed to download emoji/15.0/emoji-test.txt (RuntimeError) E, [2024-05-10T12:10:25.840459 #663761] ERROR -- : OpenURI::HTTPError: 403 Forbidden: https://www.unicode.org/Public/emoji/15.0/emoji-test.txt E, [2024-05-10T12:10:25.840503 #663761] ERROR -- : from /tmp/ruby/src/trunk/tool/downloader.rb:201:in `download' E, [2024-05-10T12:10:25.840525 #663761] ERROR -- : from /tmp/ruby/src/trunk/tool/downloader.rb:136:in `download' E, [2024-05-10T12:10:25.840543 #663761] ERROR -- : from /tmp/ruby/src/trunk/tool/downloader.rb:482:in `block in
' E, [2024-05-10T12:10:25.840559 #663761] ERROR -- : from /tmp/ruby/src/trunk/tool/downloader.rb:465:in `each' E, [2024-05-10T12:10:25.840576 #663761] ERROR -- : from /tmp/ruby/src/trunk/tool/downloader.rb:465:in `
' E, [2024-05-10T12:10:25.840593 #663761] ERROR -- : /usr/lib/ruby/3.0.0/open-uri.rb:364:in `open_http': 403 Forbidden (OpenURI::HTTPError) E, [2024-05-10T12:10:25.840609 #663761] ERROR -- : from /usr/lib/ruby/3.0.0/open-uri.rb:741:in `buffer_open' E, [2024-05-10T12:10:25.840631 #663761] ERROR -- : from /usr/lib/ruby/3.0.0/open-uri.rb:212:in `block in open_loop' E, [2024-05-10T12:10:25.840648 #663761] ERROR -- : from /usr/lib/ruby/3.0.0/open-uri.rb:210:in `catch' E, [2024-05-10T12:10:25.840665 #663761] ERROR -- : from /usr/lib/ruby/3.0.0/open-uri.rb:210:in `open_loop' E, [2024-05-10T12:10:25.840685 #663761] ERROR -- : from /usr/lib/ruby/3.0.0/open-uri.rb:151:in `open_uri' E, [2024-05-10T12:10:25.840701 #663761] ERROR -- : from /usr/lib/ruby/3.0.0/open-uri.rb:721:in `open' E, [2024-05-10T12:10:25.840901 #663761] ERROR -- : from /usr/lib/ruby/3.0.0/open-uri.rb:729:in `read' E, [2024-05-10T12:10:25.840921 #663761] ERROR -- : from /tmp/ruby/src/trunk/tool/downloader.rb:247:in `block in download' E, [2024-05-10T12:10:25.840940 #663761] ERROR -- : from /tmp/ruby/src/trunk/tool/downloader.rb:378:in `with_retry' E, [2024-05-10T12:10:25.840956 #663761] ERROR -- : from /tmp/ruby/src/trunk/tool/downloader.rb:246:in `download' E, [2024-05-10T12:10:25.840973 #663761] ERROR -- : from /tmp/ruby/src/trunk/tool/downloader.rb:136:in `download' E, [2024-05-10T12:10:25.840990 #663761] ERROR -- : from /tmp/ruby/src/trunk/tool/downloader.rb:482:in `block in
' E, [2024-05-10T12:10:25.841006 #663761] ERROR -- : from /tmp/ruby/src/trunk/tool/downloader.rb:465:in `each' E, [2024-05-10T12:10:25.841023 #663761] ERROR -- : from /tmp/ruby/src/trunk/tool/downloader.rb:465:in `
' E, [2024-05-10T12:10:25.844874 #663761] ERROR -- : make: *** [uncommon.mk:1765: /tmp/ruby/src/trunk/enc/unicode/data/emoji/15.0/emoji-sequences.txt] Error 1 E, [2024-05-10T12:10:25.844941 #663761] ERROR -- : make: *** Deleting file '/tmp/ruby/src/trunk/enc/unicode/data/emoji/15.0/emoji-sequences.txt' I, [2024-05-10T12:10:25.845164 #663761] INFO -- : downloading emoji/15.0/emoji-test.txt ... downloading emoji/15.0/emoji-test.txt ... I, [2024-05-10T12:10:25.845654 #663761] INFO -- : $$$[end] "make update-unicode -j16" exit with 512. I, [2024-05-10T12:10:25.845722 #663761] INFO -- : $$$[beg] make update-download -j16 I, [2024-05-10T12:10:26.060181 #663761] INFO -- : tool/config.guess already exists I, [2024-05-10T12:10:26.060230 #663761] INFO -- : tool/config.sub already exists I, [2024-05-10T12:10:26.062457 #663761] INFO -- : Update minitest to ea9caafc0754b1d6236a490d59e624b53209734a I, [2024-05-10T12:10:26.062546 #663761] INFO -- : Update power_assert to 84e85124c5014a139af39161d484156cfe87a9ed I, [2024-05-10T12:10:26.063227 #663761] INFO -- : Update rbs to ba7872795d5de04adb8ff500c0e6afdc81a041dd I, [2024-05-10T12:10:26.064264 #663761] INFO -- : Update typeprof to b19a6416da3a05d57fadd6ffdadb382b6d236ca5 I, [2024-05-10T12:10:26.064688 #663761] INFO -- : echo ea9caafc0754b1d6236a490d59e624b53209734a | /bin/sh /tmp/ruby/src/trunk/tool/ifchange /tmp/ruby/src/trunk/.bundle/.timestamp/minitest.revision - I, [2024-05-10T12:10:26.064843 #663761] INFO -- : echo 84e85124c5014a139af39161d484156cfe87a9ed | /bin/sh /tmp/ruby/src/trunk/tool/ifchange /tmp/ruby/src/trunk/.bundle/.timestamp/power_assert.revision - I, [2024-05-10T12:10:26.064985 #663761] INFO -- : echo ba7872795d5de04adb8ff500c0e6afdc81a041dd | /bin/sh /tmp/ruby/src/trunk/tool/ifchange /tmp/ruby/src/trunk/.bundle/.timestamp/rbs.revision - I, [2024-05-10T12:10:26.065474 #663761] INFO -- : echo b19a6416da3a05d57fadd6ffdadb382b6d236ca5 | /bin/sh /tmp/ruby/src/trunk/tool/ifchange /tmp/ruby/src/trunk/.bundle/.timestamp/typeprof.revision - I, [2024-05-10T12:10:26.066983 #663761] INFO -- : /tmp/ruby/src/trunk/.bundle/.timestamp/minitest.revision unchanged I, [2024-05-10T12:10:26.067114 #663761] INFO -- : /tmp/ruby/src/trunk/.bundle/.timestamp/power_assert.revision unchanged I, [2024-05-10T12:10:26.067243 #663761] INFO -- : /tmp/ruby/src/trunk/.bundle/.timestamp/rbs.revision unchanged I, [2024-05-10T12:10:26.067463 #663761] INFO -- : /tmp/ruby/src/trunk/.bundle/.timestamp/typeprof.revision unchanged I, [2024-05-10T12:10:26.068378 #663761] INFO -- : Building power_assert@84e85124c5014a139af39161d484156cfe87a9ed to /tmp/ruby/src/trunk/gems/power_assert-2.0.3.gem I, [2024-05-10T12:10:26.136759 #663761] INFO -- : Successfully built RubyGem I, [2024-05-10T12:10:26.136803 #663761] INFO -- : Name: power_assert I, [2024-05-10T12:10:26.136821 #663761] INFO -- : Version: 2.0.4dev I, [2024-05-10T12:10:26.136833 #663761] INFO -- : File: power_assert-2.0.4dev.gem I, [2024-05-10T12:10:26.178707 #663761] INFO -- : $$$[end] "make update-download -j16" exit with 0. I, [2024-05-10T12:10:26.178757 #663761] INFO -- : $$$[beg] make update-rubyspec -j16 I, [2024-05-10T12:10:26.234496 #663761] INFO -- : make: Nothing to be done for 'update-rubyspec'. I, [2024-05-10T12:10:26.234708 #663761] INFO -- : $$$[end] "make update-rubyspec -j16" exit with 0. I, [2024-05-10T12:10:26.234736 #663761] INFO -- : $$$[beg] make update-src -j16 I, [2024-05-10T12:10:26.929539 #663761] INFO -- : Already up to date. I, [2024-05-10T12:10:26.947663 #663761] INFO -- : Latest commit hash = c68bb24088 I, [2024-05-10T12:10:26.950501 #663761] INFO -- : $$$[end] "make update-src -j16" exit with 0. I, [2024-05-10T12:10:26.950576 #663761] INFO -- : $$$[beg] make after-update -j16 I, [2024-05-10T12:10:27.038005 #663761] INFO -- : /tmp/ruby/src/trunk/revision.h updated I, [2024-05-10T12:10:27.038859 #663761] INFO -- : generating x86_64-linux-fake.rb I, [2024-05-10T12:10:27.163068 #663761] INFO -- : x86_64-linux-fake.rb updated I, [2024-05-10T12:10:27.165775 #663761] INFO -- : generating enc.mk I, [2024-05-10T12:10:27.283615 #663761] INFO -- : making srcs under enc I, [2024-05-10T12:10:27.348628 #663761] INFO -- : make[1]: Entering directory '/tmp/ruby/build/trunk' I, [2024-05-10T12:10:27.348653 #663761] INFO -- : make[1]: Nothing to be done for 'srcs'. I, [2024-05-10T12:10:27.348665 #663761] INFO -- : make[1]: Leaving directory '/tmp/ruby/build/trunk' I, [2024-05-10T12:10:27.390192 #663761] INFO -- : Update minitest to ea9caafc0754b1d6236a490d59e624b53209734a I, [2024-05-10T12:10:27.390602 #663761] INFO -- : Update power_assert to 84e85124c5014a139af39161d484156cfe87a9ed I, [2024-05-10T12:10:27.391049 #663761] INFO -- : Update rbs to ba7872795d5de04adb8ff500c0e6afdc81a041dd I, [2024-05-10T12:10:27.391837 #663761] INFO -- : Update typeprof to b19a6416da3a05d57fadd6ffdadb382b6d236ca5 I, [2024-05-10T12:10:27.392388 #663761] INFO -- : echo ea9caafc0754b1d6236a490d59e624b53209734a | /bin/sh /tmp/ruby/src/trunk/tool/ifchange /tmp/ruby/src/trunk/.bundle/.timestamp/minitest.revision - I, [2024-05-10T12:10:27.392532 #663761] INFO -- : echo 84e85124c5014a139af39161d484156cfe87a9ed | /bin/sh /tmp/ruby/src/trunk/tool/ifchange /tmp/ruby/src/trunk/.bundle/.timestamp/power_assert.revision - I, [2024-05-10T12:10:27.392673 #663761] INFO -- : echo ba7872795d5de04adb8ff500c0e6afdc81a041dd | /bin/sh /tmp/ruby/src/trunk/tool/ifchange /tmp/ruby/src/trunk/.bundle/.timestamp/rbs.revision - I, [2024-05-10T12:10:27.393987 #663761] INFO -- : echo b19a6416da3a05d57fadd6ffdadb382b6d236ca5 | /bin/sh /tmp/ruby/src/trunk/tool/ifchange /tmp/ruby/src/trunk/.bundle/.timestamp/typeprof.revision - I, [2024-05-10T12:10:27.394416 #663761] INFO -- : /tmp/ruby/src/trunk/.bundle/.timestamp/minitest.revision unchanged I, [2024-05-10T12:10:27.394628 #663761] INFO -- : /tmp/ruby/src/trunk/.bundle/.timestamp/power_assert.revision unchanged I, [2024-05-10T12:10:27.394726 #663761] INFO -- : /tmp/ruby/src/trunk/.bundle/.timestamp/rbs.revision unchanged I, [2024-05-10T12:10:27.395820 #663761] INFO -- : Building power_assert@84e85124c5014a139af39161d484156cfe87a9ed to /tmp/ruby/src/trunk/gems/power_assert-2.0.3.gem I, [2024-05-10T12:10:27.395932 #663761] INFO -- : /tmp/ruby/src/trunk/.bundle/.timestamp/typeprof.revision unchanged I, [2024-05-10T12:10:27.464598 #663761] INFO -- : Successfully built RubyGem I, [2024-05-10T12:10:27.464640 #663761] INFO -- : Name: power_assert I, [2024-05-10T12:10:27.464651 #663761] INFO -- : Version: 2.0.4dev I, [2024-05-10T12:10:27.464659 #663761] INFO -- : File: power_assert-2.0.4dev.gem I, [2024-05-10T12:10:27.466588 #663761] INFO -- : Extracting bundle gem power_assert-2.0.3... I, [2024-05-10T12:10:27.561693 #663761] INFO -- : Try with hash version of bundled gems instead of gems/power_assert-2.0.3.gem. We don't use this gem with release version of Ruby. I, [2024-05-10T12:10:27.566737 #663761] INFO -- : Unpacked gems/power_assert-2.0.4dev.gem I, [2024-05-10T12:10:27.568427 #663761] INFO -- : $$$[end] "make after-update -j16" exit with 0. I, [2024-05-10T12:10:27.568548 #663761] INFO -- : $$$[beg] make miniruby -j16 I, [2024-05-10T12:10:27.623789 #663761] INFO -- : BASERUBY = /usr/bin/ruby --disable=gems I, [2024-05-10T12:10:27.623830 #663761] INFO -- : CC = gcc I, [2024-05-10T12:10:27.623841 #663761] INFO -- : LD = ld I, [2024-05-10T12:10:27.623850 #663761] INFO -- : LDSHARED = gcc -shared I, [2024-05-10T12:10:27.623857 #663761] INFO -- : CFLAGS = -O3 -fno-fast-math -ggdb3 -Wall -Wextra -Wdeprecated-declarations -Wdiv-by-zero -Wduplicated-cond -Wimplicit-function-declaration -Wimplicit-int -Wpointer-arith -Wwrite-strings -Wold-style-definition -Wimplicit-fallthrough=0 -Wmissing-noreturn -Wno-cast-function-type -Wno-constant-logical-operand -Wno-long-long -Wno-missing-field-initializers -Wno-overlength-strings -Wno-packed-bitfield-compat -Wno-parentheses-equality -Wno-self-assign -Wno-tautological-compare -Wno-unused-parameter -Wno-unused-value -Wsuggest-attribute=format -Wsuggest-attribute=noreturn -Wunused-variable -Wmisleading-indentation -Wundef -fPIC I, [2024-05-10T12:10:27.623866 #663761] INFO -- : XCFLAGS = -U_FORTIFY_SOURCE -D_FORTIFY_SOURCE=2 -fstack-protector-strong -fno-strict-overflow -fvisibility=hidden -fexcess-precision=standard -DRUBY_EXPORT -I. -I.ext/include/x86_64-linux -I/tmp/ruby/src/trunk/include -I/tmp/ruby/src/trunk -I/tmp/ruby/src/trunk/prism -I/tmp/ruby/src/trunk/enc/unicode/15.0.0 I, [2024-05-10T12:10:27.623875 #663761] INFO -- : CPPFLAGS = I, [2024-05-10T12:10:27.623883 #663761] INFO -- : DLDFLAGS = -Wl,--compress-debug-sections=zlib -Wl,-soname,libruby.so.3.4 -fstack-protector-strong I, [2024-05-10T12:10:27.623891 #663761] INFO -- : SOLIBS = -lz -lrt -lrt -lgmp -ldl -lcrypt -lm -lpthread I, [2024-05-10T12:10:27.623898 #663761] INFO -- : LANG = C.UTF-8 I, [2024-05-10T12:10:27.623906 #663761] INFO -- : LC_ALL = I, [2024-05-10T12:10:27.623913 #663761] INFO -- : LC_CTYPE = I, [2024-05-10T12:10:27.623920 #663761] INFO -- : MFLAGS = -j16 --jobserver-auth=4,5 I, [2024-05-10T12:10:27.623928 #663761] INFO -- : RUSTC = rustc I, [2024-05-10T12:10:27.623935 #663761] INFO -- : YJIT_RUSTC_ARGS = --crate-name=yjit --crate-type=staticlib --edition=2021 -g -C lto=thin -C opt-level=3 -C overflow-checks=on '--out-dir=/tmp/ruby/build/trunk/yjit/target/release/' /tmp/ruby/src/trunk/yjit/src/lib.rs I, [2024-05-10T12:10:27.624780 #663761] INFO -- : gcc (Ubuntu 11.4.0-1ubuntu1~22.04) 11.4.0 I, [2024-05-10T12:10:27.624798 #663761] INFO -- : Copyright (C) 2021 Free Software Foundation, Inc. I, [2024-05-10T12:10:27.624808 #663761] INFO -- : This is free software; see the source for copying conditions. There is NO I, [2024-05-10T12:10:27.624819 #663761] INFO -- : warranty; not even for MERCHANTABILITY or FITNESS FOR A PARTICULAR PURPOSE. I, [2024-05-10T12:10:27.624830 #663761] INFO -- : I, [2024-05-10T12:10:27.647077 #663761] INFO -- : compiling /tmp/ruby/src/trunk/version.c I, [2024-05-10T12:10:27.797625 #663761] INFO -- : linking miniruby I, [2024-05-10T12:10:28.414819 #663761] INFO -- : $$$[end] "make miniruby -j16" exit with 0. I, [2024-05-10T12:10:28.414954 #663761] INFO -- : $$$[beg] make ruby -j16 I, [2024-05-10T12:10:28.543366 #663761] INFO -- : BASERUBY = /usr/bin/ruby --disable=gems I, [2024-05-10T12:10:28.543416 #663761] INFO -- : CC = gcc I, [2024-05-10T12:10:28.543431 #663761] INFO -- : LD = ld I, [2024-05-10T12:10:28.543441 #663761] INFO -- : LDSHARED = gcc -shared I, [2024-05-10T12:10:28.543448 #663761] INFO -- : CFLAGS = -O3 -fno-fast-math -ggdb3 -Wall -Wextra -Wdeprecated-declarations -Wdiv-by-zero -Wduplicated-cond -Wimplicit-function-declaration -Wimplicit-int -Wpointer-arith -Wwrite-strings -Wold-style-definition -Wimplicit-fallthrough=0 -Wmissing-noreturn -Wno-cast-function-type -Wno-constant-logical-operand -Wno-long-long -Wno-missing-field-initializers -Wno-overlength-strings -Wno-packed-bitfield-compat -Wno-parentheses-equality -Wno-self-assign -Wno-tautological-compare -Wno-unused-parameter -Wno-unused-value -Wsuggest-attribute=format -Wsuggest-attribute=noreturn -Wunused-variable -Wmisleading-indentation -Wundef -fPIC I, [2024-05-10T12:10:28.543457 #663761] INFO -- : XCFLAGS = -U_FORTIFY_SOURCE -D_FORTIFY_SOURCE=2 -fstack-protector-strong -fno-strict-overflow -fvisibility=hidden -fexcess-precision=standard -DRUBY_EXPORT -I. -I.ext/include/x86_64-linux -I/tmp/ruby/src/trunk/include -I/tmp/ruby/src/trunk -I/tmp/ruby/src/trunk/prism -I/tmp/ruby/src/trunk/enc/unicode/15.0.0 I, [2024-05-10T12:10:28.543465 #663761] INFO -- : CPPFLAGS = I, [2024-05-10T12:10:28.543473 #663761] INFO -- : DLDFLAGS = -Wl,--compress-debug-sections=zlib -Wl,-soname,libruby.so.3.4 -fstack-protector-strong I, [2024-05-10T12:10:28.543480 #663761] INFO -- : SOLIBS = -lz -lrt -lrt -lgmp -ldl -lcrypt -lm -lpthread I, [2024-05-10T12:10:28.543488 #663761] INFO -- : LANG = C.UTF-8 I, [2024-05-10T12:10:28.543495 #663761] INFO -- : LC_ALL = I, [2024-05-10T12:10:28.543502 #663761] INFO -- : LC_CTYPE = I, [2024-05-10T12:10:28.543510 #663761] INFO -- : MFLAGS = -j16 --jobserver-auth=4,5 I, [2024-05-10T12:10:28.543518 #663761] INFO -- : RUSTC = rustc I, [2024-05-10T12:10:28.543525 #663761] INFO -- : YJIT_RUSTC_ARGS = --crate-name=yjit --crate-type=staticlib --edition=2021 -g -C lto=thin -C opt-level=3 -C overflow-checks=on '--out-dir=/tmp/ruby/build/trunk/yjit/target/release/' /tmp/ruby/src/trunk/yjit/src/lib.rs I, [2024-05-10T12:10:28.544656 #663761] INFO -- : gcc (Ubuntu 11.4.0-1ubuntu1~22.04) 11.4.0 I, [2024-05-10T12:10:28.544665 #663761] INFO -- : Copyright (C) 2021 Free Software Foundation, Inc. I, [2024-05-10T12:10:28.544675 #663761] INFO -- : This is free software; see the source for copying conditions. There is NO I, [2024-05-10T12:10:28.544682 #663761] INFO -- : warranty; not even for MERCHANTABILITY or FITNESS FOR A PARTICULAR PURPOSE. I, [2024-05-10T12:10:28.544688 #663761] INFO -- : I, [2024-05-10T12:10:28.681206 #663761] INFO -- : builtin_binary.inc updated I, [2024-05-10T12:10:28.691581 #663761] INFO -- : 6cc993e11a665fcdee4f7a2dfd66564d1ddac647c2f51274e8b33c178429a884 builtin_binary.inc I, [2024-05-10T12:10:28.693162 #663761] INFO -- : compiling /tmp/ruby/src/trunk/builtin.c I, [2024-05-10T12:10:28.966184 #663761] INFO -- : linking static-library libruby-static.a I, [2024-05-10T12:10:29.343211 #663761] INFO -- : linking shared-library libruby.so.3.4.0 I, [2024-05-10T12:10:31.186225 #663761] INFO -- : linking ruby I, [2024-05-10T12:10:31.208095 #663761] INFO -- : $$$[end] "make ruby -j16" exit with 0. I, [2024-05-10T12:10:31.208221 #663761] INFO -- : $$$[beg] make all -j16 I, [2024-05-10T12:10:31.335413 #663761] INFO -- : BASERUBY = /usr/bin/ruby --disable=gems I, [2024-05-10T12:10:31.335454 #663761] INFO -- : CC = gcc I, [2024-05-10T12:10:31.335465 #663761] INFO -- : LD = ld I, [2024-05-10T12:10:31.335474 #663761] INFO -- : LDSHARED = gcc -shared I, [2024-05-10T12:10:31.335491 #663761] INFO -- : CFLAGS = -O3 -fno-fast-math -ggdb3 -Wall -Wextra -Wdeprecated-declarations -Wdiv-by-zero -Wduplicated-cond -Wimplicit-function-declaration -Wimplicit-int -Wpointer-arith -Wwrite-strings -Wold-style-definition -Wimplicit-fallthrough=0 -Wmissing-noreturn -Wno-cast-function-type -Wno-constant-logical-operand -Wno-long-long -Wno-missing-field-initializers -Wno-overlength-strings -Wno-packed-bitfield-compat -Wno-parentheses-equality -Wno-self-assign -Wno-tautological-compare -Wno-unused-parameter -Wno-unused-value -Wsuggest-attribute=format -Wsuggest-attribute=noreturn -Wunused-variable -Wmisleading-indentation -Wundef -fPIC I, [2024-05-10T12:10:31.335500 #663761] INFO -- : XCFLAGS = -U_FORTIFY_SOURCE -D_FORTIFY_SOURCE=2 -fstack-protector-strong -fno-strict-overflow -fvisibility=hidden -fexcess-precision=standard -DRUBY_EXPORT -I. -I.ext/include/x86_64-linux -I/tmp/ruby/src/trunk/include -I/tmp/ruby/src/trunk -I/tmp/ruby/src/trunk/prism -I/tmp/ruby/src/trunk/enc/unicode/15.0.0 I, [2024-05-10T12:10:31.335509 #663761] INFO -- : CPPFLAGS = I, [2024-05-10T12:10:31.335516 #663761] INFO -- : DLDFLAGS = -Wl,--compress-debug-sections=zlib -Wl,-soname,libruby.so.3.4 -fstack-protector-strong I, [2024-05-10T12:10:31.335524 #663761] INFO -- : SOLIBS = -lz -lrt -lrt -lgmp -ldl -lcrypt -lm -lpthread I, [2024-05-10T12:10:31.335531 #663761] INFO -- : LANG = C.UTF-8 I, [2024-05-10T12:10:31.335538 #663761] INFO -- : LC_ALL = I, [2024-05-10T12:10:31.335545 #663761] INFO -- : LC_CTYPE = I, [2024-05-10T12:10:31.335552 #663761] INFO -- : MFLAGS = -j16 --jobserver-auth=4,5 I, [2024-05-10T12:10:31.335560 #663761] INFO -- : RUSTC = rustc I, [2024-05-10T12:10:31.335569 #663761] INFO -- : YJIT_RUSTC_ARGS = --crate-name=yjit --crate-type=staticlib --edition=2021 -g -C lto=thin -C opt-level=3 -C overflow-checks=on '--out-dir=/tmp/ruby/build/trunk/yjit/target/release/' /tmp/ruby/src/trunk/yjit/src/lib.rs I, [2024-05-10T12:10:31.336260 #663761] INFO -- : gcc (Ubuntu 11.4.0-1ubuntu1~22.04) 11.4.0 I, [2024-05-10T12:10:31.336281 #663761] INFO -- : Copyright (C) 2021 Free Software Foundation, Inc. I, [2024-05-10T12:10:31.336297 #663761] INFO -- : This is free software; see the source for copying conditions. There is NO I, [2024-05-10T12:10:31.336310 #663761] INFO -- : warranty; not even for MERCHANTABILITY or FITNESS FOR A PARTICULAR PURPOSE. I, [2024-05-10T12:10:31.336318 #663761] INFO -- : I, [2024-05-10T12:10:31.376700 #663761] INFO -- : generating enc.mk I, [2024-05-10T12:10:31.378599 #663761] INFO -- : building spec/ruby/optional/capi/ext/array_spec.so I, [2024-05-10T12:10:31.378887 #663761] INFO -- : building spec/ruby/optional/capi/ext/basic_object_spec.so I, [2024-05-10T12:10:31.379287 #663761] INFO -- : building spec/ruby/optional/capi/ext/bignum_spec.so I, [2024-05-10T12:10:31.379687 #663761] INFO -- : building spec/ruby/optional/capi/ext/binding_spec.so I, [2024-05-10T12:10:31.380466 #663761] INFO -- : building spec/ruby/optional/capi/ext/boolean_spec.so I, [2024-05-10T12:10:31.381204 #663761] INFO -- : building spec/ruby/optional/capi/ext/class_id_under_autoload_spec.so I, [2024-05-10T12:10:31.381479 #663761] INFO -- : building spec/ruby/optional/capi/ext/class_spec.so I, [2024-05-10T12:10:31.382227 #663761] INFO -- : building spec/ruby/optional/capi/ext/class_under_autoload_spec.so I, [2024-05-10T12:10:31.383038 #663761] INFO -- : building spec/ruby/optional/capi/ext/complex_spec.so I, [2024-05-10T12:10:31.383420 #663761] INFO -- : building spec/ruby/optional/capi/ext/constants_spec.so I, [2024-05-10T12:10:31.383996 #663761] INFO -- : building spec/ruby/optional/capi/ext/data_spec.so I, [2024-05-10T12:10:31.384317 #663761] INFO -- : building spec/ruby/optional/capi/ext/debug_spec.so I, [2024-05-10T12:10:31.385156 #663761] INFO -- : building spec/ruby/optional/capi/ext/encoding_spec.so I, [2024-05-10T12:10:31.385854 #663761] INFO -- : building spec/ruby/optional/capi/ext/enumerator_spec.so I, [2024-05-10T12:10:31.390078 #663761] INFO -- : building spec/ruby/optional/capi/ext/exception_spec.so I, [2024-05-10T12:10:31.554643 #663761] INFO -- : building spec/ruby/optional/capi/ext/fiber_spec.so I, [2024-05-10T12:10:31.558247 #663761] INFO -- : building spec/ruby/optional/capi/ext/file_spec.so I, [2024-05-10T12:10:31.559266 #663761] INFO -- : building spec/ruby/optional/capi/ext/fixnum_spec.so I, [2024-05-10T12:10:31.560636 #663761] INFO -- : building spec/ruby/optional/capi/ext/float_spec.so I, [2024-05-10T12:10:31.563227 #663761] INFO -- : building spec/ruby/optional/capi/ext/gc_spec.so I, [2024-05-10T12:10:31.564045 #663761] INFO -- : building spec/ruby/optional/capi/ext/globals_spec.so I, [2024-05-10T12:10:31.607831 #663761] INFO -- : building spec/ruby/optional/capi/ext/hash_spec.so I, [2024-05-10T12:10:31.608229 #663761] INFO -- : building spec/ruby/optional/capi/ext/integer_spec.so I, [2024-05-10T12:10:31.609540 #663761] INFO -- : building spec/ruby/optional/capi/ext/io_spec.so I, [2024-05-10T12:10:31.610142 #663761] INFO -- : building spec/ruby/optional/capi/ext/kernel_spec.so I, [2024-05-10T12:10:31.624025 #663761] INFO -- : building spec/ruby/optional/capi/ext/language_spec.so I, [2024-05-10T12:10:31.654546 #663761] INFO -- : building spec/ruby/optional/capi/ext/marshal_spec.so I, [2024-05-10T12:10:31.666123 #663761] INFO -- : building spec/ruby/optional/capi/ext/module_spec.so I, [2024-05-10T12:10:31.685473 #663761] INFO -- : building spec/ruby/optional/capi/ext/module_under_autoload_spec.so I, [2024-05-10T12:10:31.741842 #663761] INFO -- : building spec/ruby/optional/capi/ext/mutex_spec.so I, [2024-05-10T12:10:31.758442 #663761] INFO -- : building spec/ruby/optional/capi/ext/numeric_spec.so I, [2024-05-10T12:10:31.758809 #663761] INFO -- : building spec/ruby/optional/capi/ext/object_spec.so I, [2024-05-10T12:10:31.762828 #663761] INFO -- : building spec/ruby/optional/capi/ext/proc_spec.so I, [2024-05-10T12:10:31.763668 #663761] INFO -- : building spec/ruby/optional/capi/ext/range_spec.so I, [2024-05-10T12:10:31.790181 #663761] INFO -- : building spec/ruby/optional/capi/ext/rational_spec.so I, [2024-05-10T12:10:31.801946 #663761] INFO -- : building spec/ruby/optional/capi/ext/rbasic_spec.so I, [2024-05-10T12:10:31.819339 #663761] INFO -- : building spec/ruby/optional/capi/ext/regexp_spec.so I, [2024-05-10T12:10:31.823088 #663761] INFO -- : building spec/ruby/optional/capi/ext/st_spec.so I, [2024-05-10T12:10:31.829701 #663761] INFO -- : building spec/ruby/optional/capi/ext/string_spec.so I, [2024-05-10T12:10:31.831081 #663761] INFO -- : building spec/ruby/optional/capi/ext/struct_spec.so I, [2024-05-10T12:10:31.836253 #663761] INFO -- : building spec/ruby/optional/capi/ext/symbol_spec.so I, [2024-05-10T12:10:31.879077 #663761] INFO -- : building spec/ruby/optional/capi/ext/thread_spec.so I, [2024-05-10T12:10:31.946930 #663761] INFO -- : building spec/ruby/optional/capi/ext/time_spec.so I, [2024-05-10T12:10:31.947489 #663761] INFO -- : building spec/ruby/optional/capi/ext/tracepoint_spec.so I, [2024-05-10T12:10:31.961167 #663761] INFO -- : building spec/ruby/optional/capi/ext/typed_data_spec.so I, [2024-05-10T12:10:31.969871 #663761] INFO -- : building spec/ruby/optional/capi/ext/util_spec.so I, [2024-05-10T12:10:31.992353 #663761] INFO -- : making enc I, [2024-05-10T12:10:32.014403 #663761] INFO -- : making srcs under enc I, [2024-05-10T12:10:32.022934 #663761] INFO -- : make[1]: Entering directory '/tmp/ruby/build/trunk' I, [2024-05-10T12:10:32.023007 #663761] INFO -- : make[1]: Nothing to be done for 'enc'. I, [2024-05-10T12:10:32.023021 #663761] INFO -- : make[1]: Leaving directory '/tmp/ruby/build/trunk' I, [2024-05-10T12:10:32.050576 #663761] INFO -- : make[1]: Entering directory '/tmp/ruby/build/trunk' I, [2024-05-10T12:10:32.050649 #663761] INFO -- : make[1]: Nothing to be done for 'srcs'. I, [2024-05-10T12:10:32.050664 #663761] INFO -- : make[1]: Leaving directory '/tmp/ruby/build/trunk' I, [2024-05-10T12:10:32.051527 #663761] INFO -- : generating transdb.h I, [2024-05-10T12:10:32.159295 #663761] INFO -- : transdb.h unchanged I, [2024-05-10T12:10:32.160659 #663761] INFO -- : generating makefiles ext/configure-ext.mk I, [2024-05-10T12:10:32.161024 #663761] INFO -- : making trans I, [2024-05-10T12:10:32.188686 #663761] INFO -- : ext/configure-ext.mk updated I, [2024-05-10T12:10:32.191170 #663761] INFO -- : make[1]: Entering directory '/tmp/ruby/build/trunk' I, [2024-05-10T12:10:32.199677 #663761] INFO -- : make[1]: Entering directory '/tmp/ruby/build/trunk' I, [2024-05-10T12:10:32.200012 #663761] INFO -- : make[1]: Nothing to be done for 'trans'. I, [2024-05-10T12:10:32.200132 #663761] INFO -- : make[1]: Leaving directory '/tmp/ruby/build/trunk' I, [2024-05-10T12:10:32.203348 #663761] INFO -- : making encs I, [2024-05-10T12:10:32.273473 #663761] INFO -- : make[1]: Entering directory '/tmp/ruby/build/trunk' I, [2024-05-10T12:10:32.273588 #663761] INFO -- : make[1]: Nothing to be done for 'encs'. I, [2024-05-10T12:10:32.273631 #663761] INFO -- : make[1]: Leaving directory '/tmp/ruby/build/trunk' I, [2024-05-10T12:10:32.446940 #663761] INFO -- : make[1]: Leaving directory '/tmp/ruby/build/trunk' I, [2024-05-10T12:10:32.447652 #663761] INFO -- : generating makefile exts.mk I, [2024-05-10T12:10:32.489040 #663761] INFO -- : exts.mk unchanged I, [2024-05-10T12:10:32.493342 #663761] INFO -- : make[1]: Entering directory '/tmp/ruby/build/trunk' I, [2024-05-10T12:10:32.517320 #663761] INFO -- : make[2]: Entering directory '/tmp/ruby/build/trunk/ext/digest' I, [2024-05-10T12:10:32.518444 #663761] INFO -- : make[2]: Entering directory '/tmp/ruby/build/trunk/ext/json' I, [2024-05-10T12:10:32.519125 #663761] INFO -- : make[2]: Entering directory '/tmp/ruby/build/trunk/ext/coverage' I, [2024-05-10T12:10:32.520056 #663761] INFO -- : make[2]: Entering directory '/tmp/ruby/build/trunk/ext/date' I, [2024-05-10T12:10:32.521328 #663761] INFO -- : make[2]: Entering directory '/tmp/ruby/build/trunk/ext/io/console' I, [2024-05-10T12:10:32.521347 #663761] INFO -- : make[2]: Entering directory '/tmp/ruby/build/trunk/ext/monitor' I, [2024-05-10T12:10:32.522657 #663761] INFO -- : make[2]: Entering directory '/tmp/ruby/build/trunk/ext/pathname' I, [2024-05-10T12:10:32.523429 #663761] INFO -- : make[2]: Entering directory '/tmp/ruby/build/trunk/ext/fiddle' I, [2024-05-10T12:10:32.523583 #663761] INFO -- : make[2]: Leaving directory '/tmp/ruby/build/trunk/ext/coverage' I, [2024-05-10T12:10:32.523957 #663761] INFO -- : make[2]: Entering directory '/tmp/ruby/build/trunk/ext/objspace' I, [2024-05-10T12:10:32.523984 #663761] INFO -- : make[2]: Leaving directory '/tmp/ruby/build/trunk/ext/monitor' I, [2024-05-10T12:10:32.524338 #663761] INFO -- : make[2]: Leaving directory '/tmp/ruby/build/trunk/ext/io/console' I, [2024-05-10T12:10:32.524618 #663761] INFO -- : make[2]: Leaving directory '/tmp/ruby/build/trunk/ext/digest' I, [2024-05-10T12:10:32.525006 #663761] INFO -- : make[2]: Entering directory '/tmp/ruby/build/trunk/ext/rubyvm' I, [2024-05-10T12:10:32.525304 #663761] INFO -- : make[2]: Entering directory '/tmp/ruby/build/trunk/ext/pty' I, [2024-05-10T12:10:32.526276 #663761] INFO -- : make[2]: Leaving directory '/tmp/ruby/build/trunk/ext/json' I, [2024-05-10T12:10:32.526328 #663761] INFO -- : make[2]: Leaving directory '/tmp/ruby/build/trunk/ext/date' I, [2024-05-10T12:10:32.526425 #663761] INFO -- : make[2]: Leaving directory '/tmp/ruby/build/trunk/ext/pathname' I, [2024-05-10T12:10:32.526938 #663761] INFO -- : make[2]: Entering directory '/tmp/ruby/build/trunk/ext/psych' I, [2024-05-10T12:10:32.527551 #663761] INFO -- : make[2]: Leaving directory '/tmp/ruby/build/trunk/ext/rubyvm' I, [2024-05-10T12:10:32.529189 #663761] INFO -- : make[2]: Leaving directory '/tmp/ruby/build/trunk/ext/pty' I, [2024-05-10T12:10:32.529297 #663761] INFO -- : make[2]: Entering directory '/tmp/ruby/build/trunk/.bundle/gems/bigdecimal-3.1.8/ext/bigdecimal' I, [2024-05-10T12:10:32.529359 #663761] INFO -- : make[2]: Entering directory '/tmp/ruby/build/trunk/.bundle/gems/debug-1.9.2/ext/debug' I, [2024-05-10T12:10:32.529490 #663761] INFO -- : make[2]: Entering directory '/tmp/ruby/build/trunk/.bundle/gems/nkf-0.2.0/ext/nkf' I, [2024-05-10T12:10:32.529521 #663761] INFO -- : make[2]: Leaving directory '/tmp/ruby/build/trunk/ext/objspace' I, [2024-05-10T12:10:32.529760 #663761] INFO -- : make[2]: Entering directory '/tmp/ruby/build/trunk/.bundle/gems/racc-1.7.3/ext/racc/cparse' I, [2024-05-10T12:10:32.531139 #663761] INFO -- : make[2]: Entering directory '/tmp/ruby/build/trunk/ext/ripper' I, [2024-05-10T12:10:32.531208 #663761] INFO -- : make[2]: Leaving directory '/tmp/ruby/build/trunk/ext/fiddle' I, [2024-05-10T12:10:32.532002 #663761] INFO -- : make[2]: Entering directory '/tmp/ruby/build/trunk/.bundle/gems/syslog-0.1.2/ext/syslog' I, [2024-05-10T12:10:32.532069 #663761] INFO -- : make[2]: Entering directory '/tmp/ruby/build/trunk/.bundle/gems/rbs-3.4.4/ext/rbs_extension' I, [2024-05-10T12:10:32.537933 #663761] INFO -- : make[2]: Leaving directory '/tmp/ruby/build/trunk/ext/ripper' I, [2024-05-10T12:10:32.538313 #663761] INFO -- : make[2]: Entering directory '/tmp/ruby/build/trunk/ext/socket' I, [2024-05-10T12:10:32.539773 #663761] INFO -- : make[2]: Entering directory '/tmp/ruby/build/trunk/ext/digest/sha2' I, [2024-05-10T12:10:32.540180 #663761] INFO -- : make[2]: Entering directory '/tmp/ruby/build/trunk/ext/openssl' I, [2024-05-10T12:10:32.542004 #663761] INFO -- : make[2]: Leaving directory '/tmp/ruby/build/trunk/ext/psych' I, [2024-05-10T12:10:32.543050 #663761] INFO -- : make[2]: Leaving directory '/tmp/ruby/build/trunk/ext/digest/sha2' I, [2024-05-10T12:10:32.550026 #663761] INFO -- : make[2]: Leaving directory '/tmp/ruby/build/trunk/ext/socket' I, [2024-05-10T12:10:32.561370 #663761] INFO -- : make[2]: Leaving directory '/tmp/ruby/build/trunk/.bundle/gems/racc-1.7.3/ext/racc/cparse' I, [2024-05-10T12:10:32.561565 #663761] INFO -- : make[2]: Leaving directory '/tmp/ruby/build/trunk/.bundle/gems/nkf-0.2.0/ext/nkf' I, [2024-05-10T12:10:32.561580 #663761] INFO -- : make[2]: Leaving directory '/tmp/ruby/build/trunk/ext/openssl' I, [2024-05-10T12:10:32.561902 #663761] INFO -- : make[2]: Leaving directory '/tmp/ruby/build/trunk/.bundle/gems/debug-1.9.2/ext/debug' I, [2024-05-10T12:10:32.564441 #663761] INFO -- : make[2]: Leaving directory '/tmp/ruby/build/trunk/.bundle/gems/syslog-0.1.2/ext/syslog' I, [2024-05-10T12:10:32.565193 #663761] INFO -- : make[2]: Leaving directory '/tmp/ruby/build/trunk/.bundle/gems/bigdecimal-3.1.8/ext/bigdecimal' I, [2024-05-10T12:10:32.569750 #663761] INFO -- : make[2]: Leaving directory '/tmp/ruby/build/trunk/.bundle/gems/rbs-3.4.4/ext/rbs_extension' I, [2024-05-10T12:10:32.592231 #663761] INFO -- : make[2]: Entering directory '/tmp/ruby/build/trunk' I, [2024-05-10T12:10:32.668487 #663761] INFO -- : linking ruby I, [2024-05-10T12:10:32.688745 #663761] INFO -- : make[2]: Leaving directory '/tmp/ruby/build/trunk' I, [2024-05-10T12:10:32.689079 #663761] INFO -- : make[1]: Leaving directory '/tmp/ruby/build/trunk' I, [2024-05-10T12:10:32.692695 #663761] INFO -- : make[1]: Entering directory '/tmp/ruby/build/trunk' I, [2024-05-10T12:10:32.692717 #663761] INFO -- : make[1]: Nothing to be done for 'note'. I, [2024-05-10T12:10:32.692734 #663761] INFO -- : make[1]: Leaving directory '/tmp/ruby/build/trunk' I, [2024-05-10T12:10:32.693311 #663761] INFO -- : $$$[end] "make all -j16" exit with 0. I, [2024-05-10T12:10:32.693518 #663761] INFO -- : $$$[beg] make install -j16 I, [2024-05-10T12:10:32.753847 #663761] INFO -- : Update minitest to ea9caafc0754b1d6236a490d59e624b53209734a I, [2024-05-10T12:10:32.754178 #663761] INFO -- : Update power_assert to 84e85124c5014a139af39161d484156cfe87a9ed I, [2024-05-10T12:10:32.754474 #663761] INFO -- : Update rbs to ba7872795d5de04adb8ff500c0e6afdc81a041dd I, [2024-05-10T12:10:32.754628 #663761] INFO -- : Update typeprof to b19a6416da3a05d57fadd6ffdadb382b6d236ca5 I, [2024-05-10T12:10:32.755306 #663761] INFO -- : echo ea9caafc0754b1d6236a490d59e624b53209734a | /bin/sh /tmp/ruby/src/trunk/tool/ifchange /tmp/ruby/src/trunk/.bundle/.timestamp/minitest.revision - I, [2024-05-10T12:10:32.756008 #663761] INFO -- : BASERUBY = /usr/bin/ruby --disable=gems I, [2024-05-10T12:10:32.756027 #663761] INFO -- : CC = gcc I, [2024-05-10T12:10:32.756039 #663761] INFO -- : LD = ld I, [2024-05-10T12:10:32.756051 #663761] INFO -- : LDSHARED = gcc -shared I, [2024-05-10T12:10:32.756063 #663761] INFO -- : CFLAGS = -O3 -fno-fast-math -ggdb3 -Wall -Wextra -Wdeprecated-declarations -Wdiv-by-zero -Wduplicated-cond -Wimplicit-function-declaration -Wimplicit-int -Wpointer-arith -Wwrite-strings -Wold-style-definition -Wimplicit-fallthrough=0 -Wmissing-noreturn -Wno-cast-function-type -Wno-constant-logical-operand -Wno-long-long -Wno-missing-field-initializers -Wno-overlength-strings -Wno-packed-bitfield-compat -Wno-parentheses-equality -Wno-self-assign -Wno-tautological-compare -Wno-unused-parameter -Wno-unused-value -Wsuggest-attribute=format -Wsuggest-attribute=noreturn -Wunused-variable -Wmisleading-indentation -Wundef -fPIC I, [2024-05-10T12:10:32.756071 #663761] INFO -- : XCFLAGS = -U_FORTIFY_SOURCE -D_FORTIFY_SOURCE=2 -fstack-protector-strong -fno-strict-overflow -fvisibility=hidden -fexcess-precision=standard -DRUBY_EXPORT -I. -I.ext/include/x86_64-linux -I/tmp/ruby/src/trunk/include -I/tmp/ruby/src/trunk -I/tmp/ruby/src/trunk/prism -I/tmp/ruby/src/trunk/enc/unicode/15.0.0 I, [2024-05-10T12:10:32.756077 #663761] INFO -- : CPPFLAGS = I, [2024-05-10T12:10:32.756088 #663761] INFO -- : DLDFLAGS = -Wl,--compress-debug-sections=zlib -Wl,-soname,libruby.so.3.4 -fstack-protector-strong I, [2024-05-10T12:10:32.756099 #663761] INFO -- : SOLIBS = -lz -lrt -lrt -lgmp -ldl -lcrypt -lm -lpthread I, [2024-05-10T12:10:32.756106 #663761] INFO -- : LANG = C.UTF-8 I, [2024-05-10T12:10:32.756112 #663761] INFO -- : LC_ALL = I, [2024-05-10T12:10:32.756118 #663761] INFO -- : LC_CTYPE = I, [2024-05-10T12:10:32.756125 #663761] INFO -- : MFLAGS = -j16 --jobserver-auth=4,5 I, [2024-05-10T12:10:32.756130 #663761] INFO -- : RUSTC = rustc I, [2024-05-10T12:10:32.756137 #663761] INFO -- : YJIT_RUSTC_ARGS = --crate-name=yjit --crate-type=staticlib --edition=2021 -g -C lto=thin -C opt-level=3 -C overflow-checks=on '--out-dir=/tmp/ruby/build/trunk/yjit/target/release/' /tmp/ruby/src/trunk/yjit/src/lib.rs I, [2024-05-10T12:10:32.757346 #663761] INFO -- : /tmp/ruby/src/trunk/.bundle/.timestamp/minitest.revision unchanged I, [2024-05-10T12:10:32.794670 #663761] INFO -- : echo 84e85124c5014a139af39161d484156cfe87a9ed | /bin/sh /tmp/ruby/src/trunk/tool/ifchange /tmp/ruby/src/trunk/.bundle/.timestamp/power_assert.revision - I, [2024-05-10T12:10:32.794806 #663761] INFO -- : echo ba7872795d5de04adb8ff500c0e6afdc81a041dd | /bin/sh /tmp/ruby/src/trunk/tool/ifchange /tmp/ruby/src/trunk/.bundle/.timestamp/rbs.revision - I, [2024-05-10T12:10:32.794937 #663761] INFO -- : echo b19a6416da3a05d57fadd6ffdadb382b6d236ca5 | /bin/sh /tmp/ruby/src/trunk/tool/ifchange /tmp/ruby/src/trunk/.bundle/.timestamp/typeprof.revision - I, [2024-05-10T12:10:32.795585 #663761] INFO -- : gcc (Ubuntu 11.4.0-1ubuntu1~22.04) 11.4.0 I, [2024-05-10T12:10:32.795613 #663761] INFO -- : Copyright (C) 2021 Free Software Foundation, Inc. I, [2024-05-10T12:10:32.795627 #663761] INFO -- : This is free software; see the source for copying conditions. There is NO I, [2024-05-10T12:10:32.795642 #663761] INFO -- : warranty; not even for MERCHANTABILITY or FITNESS FOR A PARTICULAR PURPOSE. I, [2024-05-10T12:10:32.795650 #663761] INFO -- : I, [2024-05-10T12:10:32.795658 #663761] INFO -- : generating enc.mk I, [2024-05-10T12:10:32.796743 #663761] INFO -- : /tmp/ruby/src/trunk/.bundle/.timestamp/power_assert.revision unchanged I, [2024-05-10T12:10:32.796793 #663761] INFO -- : /tmp/ruby/src/trunk/.bundle/.timestamp/rbs.revision unchanged I, [2024-05-10T12:10:32.796998 #663761] INFO -- : /tmp/ruby/src/trunk/.bundle/.timestamp/typeprof.revision unchanged I, [2024-05-10T12:10:32.918272 #663761] INFO -- : Building power_assert@84e85124c5014a139af39161d484156cfe87a9ed to /tmp/ruby/src/trunk/gems/power_assert-2.0.3.gem I, [2024-05-10T12:10:32.918563 #663761] INFO -- : making srcs under enc I, [2024-05-10T12:10:32.918912 #663761] INFO -- : making enc I, [2024-05-10T12:10:32.936597 #663761] INFO -- : make[1]: Entering directory '/tmp/ruby/build/trunk' I, [2024-05-10T12:10:32.936641 #663761] INFO -- : make[1]: Nothing to be done for 'enc'. I, [2024-05-10T12:10:32.936652 #663761] INFO -- : make[1]: Leaving directory '/tmp/ruby/build/trunk' I, [2024-05-10T12:10:32.948519 #663761] INFO -- : make[1]: Entering directory '/tmp/ruby/build/trunk' I, [2024-05-10T12:10:32.948548 #663761] INFO -- : make[1]: Nothing to be done for 'srcs'. I, [2024-05-10T12:10:32.948560 #663761] INFO -- : make[1]: Leaving directory '/tmp/ruby/build/trunk' I, [2024-05-10T12:10:32.949264 #663761] INFO -- : generating transdb.h I, [2024-05-10T12:10:32.989034 #663761] INFO -- : Successfully built RubyGem I, [2024-05-10T12:10:32.989076 #663761] INFO -- : Name: power_assert I, [2024-05-10T12:10:32.989088 #663761] INFO -- : Version: 2.0.4dev I, [2024-05-10T12:10:32.989102 #663761] INFO -- : File: power_assert-2.0.4dev.gem I, [2024-05-10T12:10:32.990727 #663761] INFO -- : Extracting bundle gem power_assert-2.0.3... I, [2024-05-10T12:10:33.045988 #663761] INFO -- : transdb.h unchanged I, [2024-05-10T12:10:33.047509 #663761] INFO -- : generating makefiles ext/configure-ext.mk I, [2024-05-10T12:10:33.047635 #663761] INFO -- : making trans I, [2024-05-10T12:10:33.050524 #663761] INFO -- : Try with hash version of bundled gems instead of gems/power_assert-2.0.3.gem. We don't use this gem with release version of Ruby. I, [2024-05-10T12:10:33.056328 #663761] INFO -- : Unpacked gems/power_assert-2.0.4dev.gem I, [2024-05-10T12:10:33.074551 #663761] INFO -- : ext/configure-ext.mk unchanged I, [2024-05-10T12:10:33.076931 #663761] INFO -- : make[1]: Entering directory '/tmp/ruby/build/trunk' I, [2024-05-10T12:10:33.087469 #663761] INFO -- : make[1]: Entering directory '/tmp/ruby/build/trunk' I, [2024-05-10T12:10:33.087841 #663761] INFO -- : make[1]: Nothing to be done for 'trans'. I, [2024-05-10T12:10:33.087983 #663761] INFO -- : make[1]: Leaving directory '/tmp/ruby/build/trunk' I, [2024-05-10T12:10:33.091362 #663761] INFO -- : making encs I, [2024-05-10T12:10:33.161761 #663761] INFO -- : make[1]: Entering directory '/tmp/ruby/build/trunk' I, [2024-05-10T12:10:33.161878 #663761] INFO -- : make[1]: Nothing to be done for 'encs'. I, [2024-05-10T12:10:33.161924 #663761] INFO -- : make[1]: Leaving directory '/tmp/ruby/build/trunk' I, [2024-05-10T12:10:33.345975 #663761] INFO -- : make[1]: Leaving directory '/tmp/ruby/build/trunk' I, [2024-05-10T12:10:33.346641 #663761] INFO -- : generating makefile exts.mk I, [2024-05-10T12:10:33.387963 #663761] INFO -- : exts.mk unchanged I, [2024-05-10T12:10:33.392216 #663761] INFO -- : make[1]: Entering directory '/tmp/ruby/build/trunk' I, [2024-05-10T12:10:33.416051 #663761] INFO -- : make[2]: Entering directory '/tmp/ruby/build/trunk/ext/digest' I, [2024-05-10T12:10:33.416829 #663761] INFO -- : make[2]: Entering directory '/tmp/ruby/build/trunk/ext/json' I, [2024-05-10T12:10:33.417749 #663761] INFO -- : make[2]: Entering directory '/tmp/ruby/build/trunk/ext/coverage' I, [2024-05-10T12:10:33.418652 #663761] INFO -- : make[2]: Entering directory '/tmp/ruby/build/trunk/ext/date' I, [2024-05-10T12:10:33.419037 #663761] INFO -- : make[2]: Entering directory '/tmp/ruby/build/trunk/ext/io/console' I, [2024-05-10T12:10:33.419258 #663761] INFO -- : make[2]: Entering directory '/tmp/ruby/build/trunk/ext/monitor' I, [2024-05-10T12:10:33.421829 #663761] INFO -- : make[2]: Entering directory '/tmp/ruby/build/trunk/ext/pathname' I, [2024-05-10T12:10:33.421906 #663761] INFO -- : make[2]: Entering directory '/tmp/ruby/build/trunk/ext/fiddle' I, [2024-05-10T12:10:33.422344 #663761] INFO -- : make[2]: Leaving directory '/tmp/ruby/build/trunk/ext/coverage' I, [2024-05-10T12:10:33.422817 #663761] INFO -- : make[2]: Entering directory '/tmp/ruby/build/trunk/ext/objspace' I, [2024-05-10T12:10:33.423183 #663761] INFO -- : make[2]: Leaving directory '/tmp/ruby/build/trunk/ext/io/console' I, [2024-05-10T12:10:33.423217 #663761] INFO -- : make[2]: Leaving directory '/tmp/ruby/build/trunk/ext/monitor' I, [2024-05-10T12:10:33.423233 #663761] INFO -- : make[2]: Leaving directory '/tmp/ruby/build/trunk/ext/digest' I, [2024-05-10T12:10:33.423464 #663761] INFO -- : make[2]: Entering directory '/tmp/ruby/build/trunk/ext/pty' I, [2024-05-10T12:10:33.423541 #663761] INFO -- : make[2]: Entering directory '/tmp/ruby/build/trunk/ext/rubyvm' I, [2024-05-10T12:10:33.423693 #663761] INFO -- : make[2]: Leaving directory '/tmp/ruby/build/trunk/ext/date' I, [2024-05-10T12:10:33.424373 #663761] INFO -- : make[2]: Leaving directory '/tmp/ruby/build/trunk/ext/json' I, [2024-05-10T12:10:33.424514 #663761] INFO -- : make[2]: Entering directory '/tmp/ruby/build/trunk/ext/psych' I, [2024-05-10T12:10:33.425070 #663761] INFO -- : make[2]: Leaving directory '/tmp/ruby/build/trunk/ext/pathname' I, [2024-05-10T12:10:33.426599 #663761] INFO -- : make[2]: Leaving directory '/tmp/ruby/build/trunk/ext/rubyvm' I, [2024-05-10T12:10:33.427171 #663761] INFO -- : make[2]: Leaving directory '/tmp/ruby/build/trunk/ext/pty' I, [2024-05-10T12:10:33.427301 #663761] INFO -- : make[2]: Leaving directory '/tmp/ruby/build/trunk/ext/objspace' I, [2024-05-10T12:10:33.427941 #663761] INFO -- : make[2]: Entering directory '/tmp/ruby/build/trunk/.bundle/gems/debug-1.9.2/ext/debug' I, [2024-05-10T12:10:33.427997 #663761] INFO -- : make[2]: Entering directory '/tmp/ruby/build/trunk/.bundle/gems/bigdecimal-3.1.8/ext/bigdecimal' I, [2024-05-10T12:10:33.428066 #663761] INFO -- : make[2]: Entering directory '/tmp/ruby/build/trunk/.bundle/gems/nkf-0.2.0/ext/nkf' I, [2024-05-10T12:10:33.429375 #663761] INFO -- : make[2]: Entering directory '/tmp/ruby/build/trunk/.bundle/gems/racc-1.7.3/ext/racc/cparse' I, [2024-05-10T12:10:33.430791 #663761] INFO -- : make[2]: Entering directory '/tmp/ruby/build/trunk/ext/ripper' I, [2024-05-10T12:10:33.430834 #663761] INFO -- : make[2]: Entering directory '/tmp/ruby/build/trunk/.bundle/gems/syslog-0.1.2/ext/syslog' I, [2024-05-10T12:10:33.431134 #663761] INFO -- : make[2]: Entering directory '/tmp/ruby/build/trunk/.bundle/gems/rbs-3.4.4/ext/rbs_extension' I, [2024-05-10T12:10:33.432027 #663761] INFO -- : make[2]: Leaving directory '/tmp/ruby/build/trunk/ext/fiddle' I, [2024-05-10T12:10:33.437704 #663761] INFO -- : make[2]: Entering directory '/tmp/ruby/build/trunk/ext/socket' I, [2024-05-10T12:10:33.438092 #663761] INFO -- : make[2]: Entering directory '/tmp/ruby/build/trunk/ext/openssl' I, [2024-05-10T12:10:33.438680 #663761] INFO -- : make[2]: Entering directory '/tmp/ruby/build/trunk/ext/digest/sha2' I, [2024-05-10T12:10:33.438969 #663761] INFO -- : make[2]: Leaving directory '/tmp/ruby/build/trunk/ext/ripper' I, [2024-05-10T12:10:33.440490 #663761] INFO -- : make[2]: Leaving directory '/tmp/ruby/build/trunk/ext/psych' I, [2024-05-10T12:10:33.442229 #663761] INFO -- : make[2]: Leaving directory '/tmp/ruby/build/trunk/ext/digest/sha2' I, [2024-05-10T12:10:33.444676 #663761] INFO -- : make[2]: Leaving directory '/tmp/ruby/build/trunk/ext/socket' I, [2024-05-10T12:10:33.450912 #663761] INFO -- : make[2]: Leaving directory '/tmp/ruby/build/trunk/ext/openssl' I, [2024-05-10T12:10:33.459454 #663761] INFO -- : make[2]: Leaving directory '/tmp/ruby/build/trunk/.bundle/gems/debug-1.9.2/ext/debug' I, [2024-05-10T12:10:33.459514 #663761] INFO -- : make[2]: Leaving directory '/tmp/ruby/build/trunk/.bundle/gems/bigdecimal-3.1.8/ext/bigdecimal' I, [2024-05-10T12:10:33.471580 #663761] INFO -- : make[2]: Leaving directory '/tmp/ruby/build/trunk/.bundle/gems/nkf-0.2.0/ext/nkf' I, [2024-05-10T12:10:33.471964 #663761] INFO -- : make[2]: Leaving directory '/tmp/ruby/build/trunk/.bundle/gems/racc-1.7.3/ext/racc/cparse' I, [2024-05-10T12:10:33.472204 #663761] INFO -- : make[2]: Leaving directory '/tmp/ruby/build/trunk/.bundle/gems/syslog-0.1.2/ext/syslog' I, [2024-05-10T12:10:33.472466 #663761] INFO -- : make[2]: Leaving directory '/tmp/ruby/build/trunk/.bundle/gems/rbs-3.4.4/ext/rbs_extension' I, [2024-05-10T12:10:33.494841 #663761] INFO -- : make[2]: Entering directory '/tmp/ruby/build/trunk' I, [2024-05-10T12:10:33.570058 #663761] INFO -- : make[2]: 'ruby' is up to date. I, [2024-05-10T12:10:33.570106 #663761] INFO -- : make[2]: Leaving directory '/tmp/ruby/build/trunk' I, [2024-05-10T12:10:33.570325 #663761] INFO -- : make[1]: Leaving directory '/tmp/ruby/build/trunk' I, [2024-05-10T12:10:33.573871 #663761] INFO -- : make[1]: Entering directory '/tmp/ruby/build/trunk' I, [2024-05-10T12:10:33.573899 #663761] INFO -- : make[1]: Nothing to be done for 'note'. I, [2024-05-10T12:10:33.573910 #663761] INFO -- : make[1]: Leaving directory '/tmp/ruby/build/trunk' I, [2024-05-10T12:10:33.574048 #663761] INFO -- : ./miniruby -I/tmp/ruby/src/trunk/lib -I. -I.ext/common /tmp/ruby/src/trunk/tool/runruby.rb --extout=.ext -- --disable-gems -r./x86_64-linux-fake /tmp/ruby/src/trunk/tool/rbinstall.rb --make="make" --dest-dir="" --extout=".ext" --ext-build-dir="./ext" --mflags="-j16 --jobserver-auth=4,5" --make-flags=" -j16 --jobserver-auth=4,5" --data-mode=0644 --prog-mode=0755 --installed-list .installed.list --mantype="doc" --gnumake --install=all --exclude=doc I, [2024-05-10T12:10:33.702627 #663761] INFO -- : Installing to I, [2024-05-10T12:10:33.702681 #663761] INFO -- : installing binary commands: /tmp/ruby/install/trunk/bin I, [2024-05-10T12:10:33.702819 #663761] INFO -- : installing base libraries: /tmp/ruby/install/trunk/lib I, [2024-05-10T12:10:33.711806 #663761] INFO -- : installing arch files: /tmp/ruby/install/trunk/lib/ruby/3.4.0+0/x86_64-linux I, [2024-05-10T12:10:33.711845 #663761] INFO -- : installing pkgconfig data: /tmp/ruby/install/trunk/lib/pkgconfig I, [2024-05-10T12:10:33.711920 #663761] INFO -- : installing extension objects: /tmp/ruby/install/trunk/lib/ruby/3.4.0+0/x86_64-linux I, [2024-05-10T12:10:33.721720 #663761] INFO -- : installing extension objects: /tmp/ruby/install/trunk/lib/ruby/site_ruby/3.4.0+0/x86_64-linux I, [2024-05-10T12:10:33.721747 #663761] INFO -- : installing extension objects: /tmp/ruby/install/trunk/lib/ruby/vendor_ruby/3.4.0+0/x86_64-linux I, [2024-05-10T12:10:33.721827 #663761] INFO -- : installing extension headers: /tmp/ruby/install/trunk/include/ruby-3.4.0+0/x86_64-linux I, [2024-05-10T12:10:33.722004 #663761] INFO -- : installing extension scripts: /tmp/ruby/install/trunk/lib/ruby/3.4.0+0 I, [2024-05-10T12:10:33.726410 #663761] INFO -- : installing extension scripts: /tmp/ruby/install/trunk/lib/ruby/site_ruby/3.4.0+0 I, [2024-05-10T12:10:33.726434 #663761] INFO -- : installing extension scripts: /tmp/ruby/install/trunk/lib/ruby/vendor_ruby/3.4.0+0 I, [2024-05-10T12:10:33.726445 #663761] INFO -- : installing extension headers: /tmp/ruby/install/trunk/include/ruby-3.4.0+0/ruby I, [2024-05-10T12:10:33.726479 #663761] INFO -- : installing command scripts: /tmp/ruby/install/trunk/bin I, [2024-05-10T12:10:33.726592 #663761] INFO -- : installing library scripts: /tmp/ruby/install/trunk/lib/ruby/3.4.0+0 I, [2024-05-10T12:10:33.768278 #663761] INFO -- : installing common headers: /tmp/ruby/install/trunk/include/ruby-3.4.0+0 I, [2024-05-10T12:10:33.775038 #663761] INFO -- : installing manpages: /tmp/ruby/install/trunk/share/man/man1 I, [2024-05-10T12:10:33.775240 #663761] INFO -- : installing default gems from lib: /tmp/ruby/install/trunk/lib/ruby/gems/3.4.0+0 I, [2024-05-10T12:10:33.800360 #663761] INFO -- : benchmark 0.3.0 I, [2024-05-10T12:10:33.807941 #663761] INFO -- : bundler 2.6.0.dev I, [2024-05-10T12:10:33.809518 #663761] INFO -- : cgi 0.4.1 I, [2024-05-10T12:10:33.810162 #663761] INFO -- : delegate 0.3.1 I, [2024-05-10T12:10:33.810700 #663761] INFO -- : did_you_mean 1.6.3 I, [2024-05-10T12:10:33.811245 #663761] INFO -- : english 0.8.0 I, [2024-05-10T12:10:33.811784 #663761] INFO -- : erb 4.0.4 I, [2024-05-10T12:10:33.813104 #663761] INFO -- : error_highlight 0.6.0 I, [2024-05-10T12:10:33.813701 #663761] INFO -- : fileutils 1.7.2 I, [2024-05-10T12:10:33.814242 #663761] INFO -- : find 0.2.0 I, [2024-05-10T12:10:33.814779 #663761] INFO -- : forwardable 1.3.3 I, [2024-05-10T12:10:33.815306 #663761] INFO -- : ipaddr 1.2.6 I, [2024-05-10T12:10:33.815839 #663761] INFO -- : irb 1.13.1 I, [2024-05-10T12:10:33.816708 #663761] INFO -- : logger 1.6.0 I, [2024-05-10T12:10:33.817252 #663761] INFO -- : net-http 0.4.1 I, [2024-05-10T12:10:33.817924 #663761] INFO -- : net-protocol 0.2.2 I, [2024-05-10T12:10:33.818500 #663761] INFO -- : open-uri 0.4.1 I, [2024-05-10T12:10:33.819088 #663761] INFO -- : open3 0.2.1 I, [2024-05-10T12:10:33.819631 #663761] INFO -- : optparse 0.5.0 I, [2024-05-10T12:10:33.820189 #663761] INFO -- : ostruct 0.6.0 I, [2024-05-10T12:10:33.821233 #663761] INFO -- : pp 0.5.0 I, [2024-05-10T12:10:33.821834 #663761] INFO -- : prettyprint 0.2.0 I, [2024-05-10T12:10:33.822361 #663761] INFO -- : prism 0.28.0 I, [2024-05-10T12:10:33.822922 #663761] INFO -- : pstore 0.1.3 I, [2024-05-10T12:10:33.823433 #663761] INFO -- : rdoc 6.6.3.1 I, [2024-05-10T12:10:33.824604 #663761] INFO -- : readline 0.0.4 I, [2024-05-10T12:10:33.825130 #663761] INFO -- : reline 0.5.6 I, [2024-05-10T12:10:33.825720 #663761] INFO -- : resolv 0.4.0 I, [2024-05-10T12:10:33.826372 #663761] INFO -- : ruby2_keywords 0.0.5 I, [2024-05-10T12:10:33.826913 #663761] INFO -- : securerandom 0.3.1 I, [2024-05-10T12:10:33.827761 #663761] INFO -- : set 1.1.0 I, [2024-05-10T12:10:33.828426 #663761] INFO -- : shellwords 0.2.0 I, [2024-05-10T12:10:33.828962 #663761] INFO -- : singleton 0.2.0 I, [2024-05-10T12:10:33.829538 #663761] INFO -- : syntax_suggest 2.0.0 I, [2024-05-10T12:10:33.830339 #663761] INFO -- : tempfile 0.2.1 I, [2024-05-10T12:10:33.830871 #663761] INFO -- : time 0.3.0 I, [2024-05-10T12:10:33.831427 #663761] INFO -- : timeout 0.4.1 I, [2024-05-10T12:10:33.832024 #663761] INFO -- : tmpdir 0.2.0 I, [2024-05-10T12:10:33.832572 #663761] INFO -- : tsort 0.2.0 I, [2024-05-10T12:10:33.833099 #663761] INFO -- : un 0.3.0 I, [2024-05-10T12:10:33.833640 #663761] INFO -- : uri 0.13.0 I, [2024-05-10T12:10:33.834217 #663761] INFO -- : weakref 0.1.3 I, [2024-05-10T12:10:33.834762 #663761] INFO -- : yaml 0.3.0 I, [2024-05-10T12:10:33.835487 #663761] INFO -- : installing default gems from ext: /tmp/ruby/install/trunk/lib/ruby/gems/3.4.0+0 I, [2024-05-10T12:10:33.841732 #663761] INFO -- : date 3.3.4 I, [2024-05-10T12:10:33.842311 #663761] INFO -- : digest 3.1.1 I, [2024-05-10T12:10:33.842861 #663761] INFO -- : etc 1.4.3 I, [2024-05-10T12:10:33.843839 #663761] INFO -- : fcntl 1.1.0 I, [2024-05-10T12:10:33.844383 #663761] INFO -- : fiddle 1.1.3 I, [2024-05-10T12:10:33.844942 #663761] INFO -- : io-console 0.7.2 I, [2024-05-10T12:10:33.845570 #663761] INFO -- : io-nonblock 0.3.0 I, [2024-05-10T12:10:33.846114 #663761] INFO -- : io-wait 0.3.1 I, [2024-05-10T12:10:33.846624 #663761] INFO -- : json 2.7.2 I, [2024-05-10T12:10:33.847267 #663761] INFO -- : openssl 3.2.0 I, [2024-05-10T12:10:33.847824 #663761] INFO -- : pathname 0.3.0 I, [2024-05-10T12:10:33.848365 #663761] INFO -- : psych 5.1.2 I, [2024-05-10T12:10:33.848967 #663761] INFO -- : stringio 3.1.1 I, [2024-05-10T12:10:33.849889 #663761] INFO -- : strscan 3.1.1 I, [2024-05-10T12:10:33.850440 #663761] INFO -- : zlib 3.1.0 I, [2024-05-10T12:10:33.850893 #663761] INFO -- : installing bundled gems: /tmp/ruby/install/trunk/lib/ruby/gems/3.4.0+0 I, [2024-05-10T12:10:33.851265 #663761] INFO -- : minitest 5.22.3 I, [2024-05-10T12:10:33.858915 #663761] INFO -- : rake 13.2.1 I, [2024-05-10T12:10:33.863827 #663761] INFO -- : test-unit 3.6.2 I, [2024-05-10T12:10:33.869400 #663761] INFO -- : rexml 3.2.6 I, [2024-05-10T12:10:33.874727 #663761] INFO -- : rss 0.3.0 I, [2024-05-10T12:10:33.878428 #663761] INFO -- : net-ftp 0.3.4 I, [2024-05-10T12:10:33.880488 #663761] INFO -- : net-imap 0.4.11 I, [2024-05-10T12:10:33.884558 #663761] INFO -- : net-pop 0.1.2 I, [2024-05-10T12:10:33.885793 #663761] INFO -- : net-smtp 0.5.0 I, [2024-05-10T12:10:33.887161 #663761] INFO -- : matrix 0.4.2 I, [2024-05-10T12:10:33.890723 #663761] INFO -- : prime 0.1.2 I, [2024-05-10T12:10:33.897476 #663761] INFO -- : rbs 3.4.4 I, [2024-05-10T12:10:33.931625 #663761] INFO -- : typeprof 0.21.11 I, [2024-05-10T12:10:33.935087 #663761] INFO -- : debug 1.9.2 I, [2024-05-10T12:10:33.938758 #663761] INFO -- : racc 1.7.3 I, [2024-05-10T12:10:33.942349 #663761] INFO -- : mutex_m 0.2.0 I, [2024-05-10T12:10:33.943677 #663761] INFO -- : getoptlong 0.2.1 I, [2024-05-10T12:10:33.945460 #663761] INFO -- : base64 0.2.0 I, [2024-05-10T12:10:33.946611 #663761] INFO -- : bigdecimal 3.1.8 I, [2024-05-10T12:10:33.949528 #663761] INFO -- : observer 0.1.2 I, [2024-05-10T12:10:33.950857 #663761] INFO -- : abbrev 0.1.2 I, [2024-05-10T12:10:33.952070 #663761] INFO -- : resolv-replace 0.1.1 I, [2024-05-10T12:10:33.953848 #663761] INFO -- : rinda 0.2.0 I, [2024-05-10T12:10:33.955140 #663761] INFO -- : drb 2.2.1 I, [2024-05-10T12:10:33.957209 #663761] INFO -- : nkf 0.2.0 I, [2024-05-10T12:10:33.960202 #663761] INFO -- : syslog 0.1.2 I, [2024-05-10T12:10:33.962149 #663761] INFO -- : csv 3.3.0 I, [2024-05-10T12:10:33.965271 #663761] INFO -- : installing bundled gem cache: /tmp/ruby/install/trunk/lib/ruby/gems/3.4.0+0/cache I, [2024-05-10T12:10:33.967212 #663761] INFO -- : skipped bundled gems: I, [2024-05-10T12:10:33.967234 #663761] INFO -- : power_assert-2.0.4dev.gem not found in bundled_gems I, [2024-05-10T12:10:33.970305 #663761] INFO -- : $$$[end] "make install -j16" exit with 0. I, [2024-05-10T12:10:33.970428 #663761] INFO -- : $$$[beg] make yes-btest TESTOPTS='-q -j16' I, [2024-05-10T12:10:42.274175 #663761] INFO -- : PASS all 1936 tests E, [2024-05-10T12:10:42.285553 #663761] ERROR -- : I, [2024-05-10T12:10:42.285932 #663761] INFO -- : $$$[end] "make yes-btest TESTOPTS='-q -j16'" exit with 0. I, [2024-05-10T12:10:42.286168 #663761] INFO -- : $$$[beg] make yes-test-basic TESTS='-j16' I, [2024-05-10T12:10:42.381879 #663761] INFO -- : BASERUBY = /usr/bin/ruby --disable=gems I, [2024-05-10T12:10:42.381929 #663761] INFO -- : CC = gcc I, [2024-05-10T12:10:42.381940 #663761] INFO -- : LD = ld I, [2024-05-10T12:10:42.381950 #663761] INFO -- : LDSHARED = gcc -shared I, [2024-05-10T12:10:42.381958 #663761] INFO -- : CFLAGS = -O3 -fno-fast-math -ggdb3 -Wall -Wextra -Wdeprecated-declarations -Wdiv-by-zero -Wduplicated-cond -Wimplicit-function-declaration -Wimplicit-int -Wpointer-arith -Wwrite-strings -Wold-style-definition -Wimplicit-fallthrough=0 -Wmissing-noreturn -Wno-cast-function-type -Wno-constant-logical-operand -Wno-long-long -Wno-missing-field-initializers -Wno-overlength-strings -Wno-packed-bitfield-compat -Wno-parentheses-equality -Wno-self-assign -Wno-tautological-compare -Wno-unused-parameter -Wno-unused-value -Wsuggest-attribute=format -Wsuggest-attribute=noreturn -Wunused-variable -Wmisleading-indentation -Wundef -fPIC I, [2024-05-10T12:10:42.381967 #663761] INFO -- : XCFLAGS = -U_FORTIFY_SOURCE -D_FORTIFY_SOURCE=2 -fstack-protector-strong -fno-strict-overflow -fvisibility=hidden -fexcess-precision=standard -DRUBY_EXPORT -I. -I.ext/include/x86_64-linux -I/tmp/ruby/src/trunk/include -I/tmp/ruby/src/trunk -I/tmp/ruby/src/trunk/prism -I/tmp/ruby/src/trunk/enc/unicode/15.0.0 I, [2024-05-10T12:10:42.381980 #663761] INFO -- : CPPFLAGS = I, [2024-05-10T12:10:42.381989 #663761] INFO -- : DLDFLAGS = -Wl,--compress-debug-sections=zlib -Wl,-soname,libruby.so.3.4 -fstack-protector-strong I, [2024-05-10T12:10:42.381999 #663761] INFO -- : SOLIBS = -lz -lrt -lrt -lgmp -ldl -lcrypt -lm -lpthread I, [2024-05-10T12:10:42.382007 #663761] INFO -- : LANG = C.UTF-8 I, [2024-05-10T12:10:42.382014 #663761] INFO -- : LC_ALL = I, [2024-05-10T12:10:42.382022 #663761] INFO -- : LC_CTYPE = I, [2024-05-10T12:10:42.382030 #663761] INFO -- : MFLAGS = I, [2024-05-10T12:10:42.382038 #663761] INFO -- : RUSTC = rustc I, [2024-05-10T12:10:42.382045 #663761] INFO -- : YJIT_RUSTC_ARGS = --crate-name=yjit --crate-type=staticlib --edition=2021 -g -C lto=thin -C opt-level=3 -C overflow-checks=on '--out-dir=/tmp/ruby/build/trunk/yjit/target/release/' /tmp/ruby/src/trunk/yjit/src/lib.rs I, [2024-05-10T12:10:42.382412 #663761] INFO -- : gcc (Ubuntu 11.4.0-1ubuntu1~22.04) 11.4.0 I, [2024-05-10T12:10:42.382434 #663761] INFO -- : Copyright (C) 2021 Free Software Foundation, Inc. I, [2024-05-10T12:10:42.382455 #663761] INFO -- : This is free software; see the source for copying conditions. There is NO I, [2024-05-10T12:10:42.382466 #663761] INFO -- : warranty; not even for MERCHANTABILITY or FITNESS FOR A PARTICULAR PURPOSE. I, [2024-05-10T12:10:42.382475 #663761] INFO -- : I, [2024-05-10T12:10:42.573393 #663761] INFO -- : Checking leaked global symbols...none I, [2024-05-10T12:10:42.614459 #663761] INFO -- : /tmp/ruby/src/trunk/basictest/test.rb:assignment ....................................................................................................................................................................................................................................................................................................................................................................................OK 372 I, [2024-05-10T12:10:42.614526 #663761] INFO -- : /tmp/ruby/src/trunk/basictest/test.rb:condition ..OK 2 I, [2024-05-10T12:10:42.614538 #663761] INFO -- : /tmp/ruby/src/trunk/basictest/test.rb:if/unless ...OK 3 I, [2024-05-10T12:10:42.614547 #663761] INFO -- : /tmp/ruby/src/trunk/basictest/test.rb:case .....OK 5 I, [2024-05-10T12:10:42.614768 #663761] INFO -- : /tmp/ruby/src/trunk/basictest/test.rb:while/until ........OK 8 I, [2024-05-10T12:10:42.614822 #663761] INFO -- : /tmp/ruby/src/trunk/basictest/test.rb:exception ..........OK 10 I, [2024-05-10T12:10:42.615046 #663761] INFO -- : /tmp/ruby/src/trunk/basictest/test.rb:array .......................................OK 39 I, [2024-05-10T12:10:42.615193 #663761] INFO -- : /tmp/ruby/src/trunk/basictest/test.rb:hash ...........................OK 27 I, [2024-05-10T12:10:42.615927 #663761] INFO -- : /tmp/ruby/src/trunk/basictest/test.rb:iterator ...........................................................................................................OK 107 I, [2024-05-10T12:10:42.616229 #663761] INFO -- : /tmp/ruby/src/trunk/basictest/test.rb:float ................................................................................OK 80 I, [2024-05-10T12:10:42.617158 #663761] INFO -- : /tmp/ruby/src/trunk/basictest/test.rb:bignum ...............................OK 31 I, [2024-05-10T12:10:42.618119 #663761] INFO -- : /tmp/ruby/src/trunk/basictest/test.rb:string & char ..............................................................OK 62 I, [2024-05-10T12:10:42.618150 #663761] INFO -- : /tmp/ruby/src/trunk/basictest/test.rb:assignment ..........OK 10 I, [2024-05-10T12:10:42.618183 #663761] INFO -- : /tmp/ruby/src/trunk/basictest/test.rb:call ......OK 6 I, [2024-05-10T12:10:42.618240 #663761] INFO -- : /tmp/ruby/src/trunk/basictest/test.rb:proc .........OK 9 I, [2024-05-10T12:10:42.718985 #663761] INFO -- : /tmp/ruby/src/trunk/basictest/test.rb:signal ..OK 2 I, [2024-05-10T12:10:42.719955 #663761] INFO -- : /tmp/ruby/src/trunk/basictest/test.rb:eval ...........................OK 27 I, [2024-05-10T12:10:42.960283 #663761] INFO -- : /tmp/ruby/src/trunk/basictest/test.rb:system ........OK 8 I, [2024-05-10T12:10:42.960336 #663761] INFO -- : /tmp/ruby/src/trunk/basictest/test.rb:const .....OK 5 I, [2024-05-10T12:10:42.960401 #663761] INFO -- : /tmp/ruby/src/trunk/basictest/test.rb:clone .....OK 5 I, [2024-05-10T12:10:42.960566 #663761] INFO -- : /tmp/ruby/src/trunk/basictest/test.rb:marshal ....OK 4 I, [2024-05-10T12:10:42.960625 #663761] INFO -- : /tmp/ruby/src/trunk/basictest/test.rb:pack ....OK 4 I, [2024-05-10T12:10:42.960647 #663761] INFO -- : /tmp/ruby/src/trunk/basictest/test.rb:math ..OK 2 I, [2024-05-10T12:10:42.960716 #663761] INFO -- : /tmp/ruby/src/trunk/basictest/test.rb:struct ......OK 6 I, [2024-05-10T12:10:42.960827 #663761] INFO -- : /tmp/ruby/src/trunk/basictest/test.rb:variable ............OK 12 I, [2024-05-10T12:10:42.960853 #663761] INFO -- : /tmp/ruby/src/trunk/basictest/test.rb:trace ...OK 3 I, [2024-05-10T12:10:42.960926 #663761] INFO -- : /tmp/ruby/src/trunk/basictest/test.rb:defined? ............OK 12 I, [2024-05-10T12:10:42.960983 #663761] INFO -- : /tmp/ruby/src/trunk/basictest/test.rb:alias ......OK 6 I, [2024-05-10T12:10:42.961361 #663761] INFO -- : /tmp/ruby/src/trunk/basictest/test.rb:path .......................OK 23 I, [2024-05-10T12:10:42.997039 #663761] INFO -- : /tmp/ruby/src/trunk/basictest/test.rb:gc ....OK 4 I, [2024-05-10T12:10:42.999554 #663761] INFO -- : I, [2024-05-10T12:10:42.999593 #663761] INFO -- : test succeeded I, [2024-05-10T12:10:43.000895 #663761] INFO -- : $$$[end] "make yes-test-basic TESTS='-j16'" exit with 0. I, [2024-05-10T12:10:43.000999 #663761] INFO -- : $$$[beg] make yes-test-all TESTOPTS='--stderr-on-failure' TESTS='-j16' I, [2024-05-10T12:10:43.136817 #663761] INFO -- : BASERUBY = /usr/bin/ruby --disable=gems I, [2024-05-10T12:10:43.136873 #663761] INFO -- : CC = gcc I, [2024-05-10T12:10:43.136893 #663761] INFO -- : LD = ld I, [2024-05-10T12:10:43.136902 #663761] INFO -- : LDSHARED = gcc -shared I, [2024-05-10T12:10:43.136914 #663761] INFO -- : CFLAGS = -O3 -fno-fast-math -ggdb3 -Wall -Wextra -Wdeprecated-declarations -Wdiv-by-zero -Wduplicated-cond -Wimplicit-function-declaration -Wimplicit-int -Wpointer-arith -Wwrite-strings -Wold-style-definition -Wimplicit-fallthrough=0 -Wmissing-noreturn -Wno-cast-function-type -Wno-constant-logical-operand -Wno-long-long -Wno-missing-field-initializers -Wno-overlength-strings -Wno-packed-bitfield-compat -Wno-parentheses-equality -Wno-self-assign -Wno-tautological-compare -Wno-unused-parameter -Wno-unused-value -Wsuggest-attribute=format -Wsuggest-attribute=noreturn -Wunused-variable -Wmisleading-indentation -Wundef -fPIC I, [2024-05-10T12:10:43.136926 #663761] INFO -- : XCFLAGS = -U_FORTIFY_SOURCE -D_FORTIFY_SOURCE=2 -fstack-protector-strong -fno-strict-overflow -fvisibility=hidden -fexcess-precision=standard -DRUBY_EXPORT -I. -I.ext/include/x86_64-linux -I/tmp/ruby/src/trunk/include -I/tmp/ruby/src/trunk -I/tmp/ruby/src/trunk/prism -I/tmp/ruby/src/trunk/enc/unicode/15.0.0 I, [2024-05-10T12:10:43.136935 #663761] INFO -- : CPPFLAGS = I, [2024-05-10T12:10:43.136944 #663761] INFO -- : DLDFLAGS = -Wl,--compress-debug-sections=zlib -Wl,-soname,libruby.so.3.4 -fstack-protector-strong I, [2024-05-10T12:10:43.136953 #663761] INFO -- : SOLIBS = -lz -lrt -lrt -lgmp -ldl -lcrypt -lm -lpthread I, [2024-05-10T12:10:43.136961 #663761] INFO -- : LANG = C.UTF-8 I, [2024-05-10T12:10:43.136968 #663761] INFO -- : LC_ALL = I, [2024-05-10T12:10:43.136976 #663761] INFO -- : LC_CTYPE = I, [2024-05-10T12:10:43.136984 #663761] INFO -- : MFLAGS = I, [2024-05-10T12:10:43.136992 #663761] INFO -- : RUSTC = rustc I, [2024-05-10T12:10:43.137002 #663761] INFO -- : YJIT_RUSTC_ARGS = --crate-name=yjit --crate-type=staticlib --edition=2021 -g -C lto=thin -C opt-level=3 -C overflow-checks=on '--out-dir=/tmp/ruby/build/trunk/yjit/target/release/' /tmp/ruby/src/trunk/yjit/src/lib.rs I, [2024-05-10T12:10:43.137494 #663761] INFO -- : gcc (Ubuntu 11.4.0-1ubuntu1~22.04) 11.4.0 I, [2024-05-10T12:10:43.137518 #663761] INFO -- : Copyright (C) 2021 Free Software Foundation, Inc. I, [2024-05-10T12:10:43.137530 #663761] INFO -- : This is free software; see the source for copying conditions. There is NO I, [2024-05-10T12:10:43.137548 #663761] INFO -- : warranty; not even for MERCHANTABILITY or FITNESS FOR A PARTICULAR PURPOSE. I, [2024-05-10T12:10:43.137557 #663761] INFO -- : I, [2024-05-10T12:10:43.139444 #663761] INFO -- : generating enc.mk I, [2024-05-10T12:10:43.294531 #663761] INFO -- : making enc I, [2024-05-10T12:10:43.347505 #663761] INFO -- : make[1]: Entering directory '/tmp/ruby/build/trunk' I, [2024-05-10T12:10:43.347530 #663761] INFO -- : make[1]: Nothing to be done for 'enc'. I, [2024-05-10T12:10:43.347540 #663761] INFO -- : make[1]: Leaving directory '/tmp/ruby/build/trunk' I, [2024-05-10T12:10:43.348113 #663761] INFO -- : making srcs under enc I, [2024-05-10T12:10:43.376926 #663761] INFO -- : make[1]: Entering directory '/tmp/ruby/build/trunk' I, [2024-05-10T12:10:43.376949 #663761] INFO -- : make[1]: Nothing to be done for 'srcs'. I, [2024-05-10T12:10:43.376960 #663761] INFO -- : make[1]: Leaving directory '/tmp/ruby/build/trunk' I, [2024-05-10T12:10:43.377905 #663761] INFO -- : generating transdb.h I, [2024-05-10T12:10:43.511064 #663761] INFO -- : transdb.h unchanged I, [2024-05-10T12:10:43.512264 #663761] INFO -- : making trans I, [2024-05-10T12:10:43.544979 #663761] INFO -- : make[1]: Entering directory '/tmp/ruby/build/trunk' I, [2024-05-10T12:10:43.545002 #663761] INFO -- : make[1]: Nothing to be done for 'trans'. I, [2024-05-10T12:10:43.545013 #663761] INFO -- : make[1]: Leaving directory '/tmp/ruby/build/trunk' I, [2024-05-10T12:10:43.545607 #663761] INFO -- : making encs I, [2024-05-10T12:10:43.581813 #663761] INFO -- : make[1]: Entering directory '/tmp/ruby/build/trunk' I, [2024-05-10T12:10:43.581844 #663761] INFO -- : make[1]: Nothing to be done for 'encs'. I, [2024-05-10T12:10:43.581856 #663761] INFO -- : make[1]: Leaving directory '/tmp/ruby/build/trunk' I, [2024-05-10T12:10:43.583836 #663761] INFO -- : generating makefiles ext/configure-ext.mk I, [2024-05-10T12:10:43.645088 #663761] INFO -- : ext/configure-ext.mk updated I, [2024-05-10T12:10:43.647707 #663761] INFO -- : make[1]: Entering directory '/tmp/ruby/build/trunk' I, [2024-05-10T12:10:45.118967 #663761] INFO -- : make[1]: Leaving directory '/tmp/ruby/build/trunk' I, [2024-05-10T12:10:45.119696 #663761] INFO -- : generating makefile exts.mk I, [2024-05-10T12:10:45.196341 #663761] INFO -- : exts.mk unchanged I, [2024-05-10T12:10:45.204570 #663761] INFO -- : make[1]: Entering directory '/tmp/ruby/build/trunk' I, [2024-05-10T12:10:45.662998 #663761] INFO -- : make[2]: Entering directory '/tmp/ruby/build/trunk/ext/coverage' I, [2024-05-10T12:10:45.667419 #663761] INFO -- : make[2]: Leaving directory '/tmp/ruby/build/trunk/ext/coverage' I, [2024-05-10T12:10:45.671307 #663761] INFO -- : make[2]: Entering directory '/tmp/ruby/build/trunk/ext/date' I, [2024-05-10T12:10:45.674330 #663761] INFO -- : make[2]: Leaving directory '/tmp/ruby/build/trunk/ext/date' I, [2024-05-10T12:10:45.678249 #663761] INFO -- : make[2]: Entering directory '/tmp/ruby/build/trunk/ext/digest' I, [2024-05-10T12:10:45.690985 #663761] INFO -- : make[2]: Leaving directory '/tmp/ruby/build/trunk/ext/digest' I, [2024-05-10T12:10:45.726174 #663761] INFO -- : make[2]: Entering directory '/tmp/ruby/build/trunk/ext/digest/sha2' I, [2024-05-10T12:10:45.733023 #663761] INFO -- : make[2]: Leaving directory '/tmp/ruby/build/trunk/ext/digest/sha2' I, [2024-05-10T12:10:45.766922 #663761] INFO -- : make[2]: Entering directory '/tmp/ruby/build/trunk/ext/fiddle' I, [2024-05-10T12:10:45.775648 #663761] INFO -- : make[2]: Leaving directory '/tmp/ruby/build/trunk/ext/fiddle' I, [2024-05-10T12:10:45.779857 #663761] INFO -- : make[2]: Entering directory '/tmp/ruby/build/trunk/ext/io/console' I, [2024-05-10T12:10:45.782595 #663761] INFO -- : make[2]: Leaving directory '/tmp/ruby/build/trunk/ext/io/console' I, [2024-05-10T12:10:45.795995 #663761] INFO -- : make[2]: Entering directory '/tmp/ruby/build/trunk/ext/json' I, [2024-05-10T12:10:45.813168 #663761] INFO -- : make[2]: Leaving directory '/tmp/ruby/build/trunk/ext/json' I, [2024-05-10T12:10:45.834090 #663761] INFO -- : make[2]: Entering directory '/tmp/ruby/build/trunk/ext/monitor' I, [2024-05-10T12:10:45.839870 #663761] INFO -- : make[2]: Leaving directory '/tmp/ruby/build/trunk/ext/monitor' I, [2024-05-10T12:10:45.843946 #663761] INFO -- : make[2]: Entering directory '/tmp/ruby/build/trunk/ext/objspace' I, [2024-05-10T12:10:45.851974 #663761] INFO -- : make[2]: Leaving directory '/tmp/ruby/build/trunk/ext/objspace' I, [2024-05-10T12:10:45.863408 #663761] INFO -- : make[2]: Entering directory '/tmp/ruby/build/trunk/ext/openssl' I, [2024-05-10T12:10:45.876064 #663761] INFO -- : make[2]: Leaving directory '/tmp/ruby/build/trunk/ext/openssl' I, [2024-05-10T12:10:45.882909 #663761] INFO -- : make[2]: Entering directory '/tmp/ruby/build/trunk/ext/pathname' I, [2024-05-10T12:10:45.890683 #663761] INFO -- : make[2]: Leaving directory '/tmp/ruby/build/trunk/ext/pathname' I, [2024-05-10T12:10:45.905375 #663761] INFO -- : make[2]: Entering directory '/tmp/ruby/build/trunk/ext/psych' I, [2024-05-10T12:10:45.935991 #663761] INFO -- : make[2]: Leaving directory '/tmp/ruby/build/trunk/ext/psych' I, [2024-05-10T12:10:45.946531 #663761] INFO -- : make[2]: Entering directory '/tmp/ruby/build/trunk/ext/pty' I, [2024-05-10T12:10:45.954355 #663761] INFO -- : make[2]: Leaving directory '/tmp/ruby/build/trunk/ext/pty' I, [2024-05-10T12:10:45.987470 #663761] INFO -- : make[2]: Entering directory '/tmp/ruby/build/trunk/ext/ripper' I, [2024-05-10T12:10:46.003931 #663761] INFO -- : make[2]: Leaving directory '/tmp/ruby/build/trunk/ext/ripper' I, [2024-05-10T12:10:46.008855 #663761] INFO -- : make[2]: Entering directory '/tmp/ruby/build/trunk/ext/rubyvm' I, [2024-05-10T12:10:46.012235 #663761] INFO -- : make[2]: Leaving directory '/tmp/ruby/build/trunk/ext/rubyvm' I, [2024-05-10T12:10:46.036820 #663761] INFO -- : make[2]: Entering directory '/tmp/ruby/build/trunk/ext/socket' I, [2024-05-10T12:10:46.058480 #663761] INFO -- : make[2]: Leaving directory '/tmp/ruby/build/trunk/ext/socket' I, [2024-05-10T12:10:46.097014 #663761] INFO -- : make[2]: Entering directory '/tmp/ruby/build/trunk/.bundle/gems/bigdecimal-3.1.8/ext/bigdecimal' I, [2024-05-10T12:10:46.157888 #663761] INFO -- : make[2]: Leaving directory '/tmp/ruby/build/trunk/.bundle/gems/bigdecimal-3.1.8/ext/bigdecimal' I, [2024-05-10T12:10:46.160440 #663761] INFO -- : make[2]: Entering directory '/tmp/ruby/build/trunk/.bundle/gems/debug-1.9.2/ext/debug' I, [2024-05-10T12:10:46.217908 #663761] INFO -- : make[2]: Leaving directory '/tmp/ruby/build/trunk/.bundle/gems/debug-1.9.2/ext/debug' I, [2024-05-10T12:10:46.221292 #663761] INFO -- : make[2]: Entering directory '/tmp/ruby/build/trunk/.bundle/gems/nkf-0.2.0/ext/nkf' I, [2024-05-10T12:10:46.244037 #663761] INFO -- : make[2]: Leaving directory '/tmp/ruby/build/trunk/.bundle/gems/nkf-0.2.0/ext/nkf' I, [2024-05-10T12:10:46.246564 #663761] INFO -- : make[2]: Entering directory '/tmp/ruby/build/trunk/.bundle/gems/racc-1.7.3/ext/racc/cparse' I, [2024-05-10T12:10:46.268698 #663761] INFO -- : make[2]: Leaving directory '/tmp/ruby/build/trunk/.bundle/gems/racc-1.7.3/ext/racc/cparse' I, [2024-05-10T12:10:46.273308 #663761] INFO -- : make[2]: Entering directory '/tmp/ruby/build/trunk/.bundle/gems/rbs-3.4.4/ext/rbs_extension' I, [2024-05-10T12:10:46.296336 #663761] INFO -- : make[2]: Leaving directory '/tmp/ruby/build/trunk/.bundle/gems/rbs-3.4.4/ext/rbs_extension' I, [2024-05-10T12:10:46.302402 #663761] INFO -- : make[2]: Entering directory '/tmp/ruby/build/trunk/.bundle/gems/syslog-0.1.2/ext/syslog' I, [2024-05-10T12:10:46.361863 #663761] INFO -- : make[2]: Leaving directory '/tmp/ruby/build/trunk/.bundle/gems/syslog-0.1.2/ext/syslog' I, [2024-05-10T12:10:46.384241 #663761] INFO -- : make[2]: Entering directory '/tmp/ruby/build/trunk' I, [2024-05-10T12:10:46.461935 #663761] INFO -- : make[2]: 'ruby' is up to date. I, [2024-05-10T12:10:46.461979 #663761] INFO -- : make[2]: Leaving directory '/tmp/ruby/build/trunk' I, [2024-05-10T12:10:46.462194 #663761] INFO -- : make[1]: Leaving directory '/tmp/ruby/build/trunk' I, [2024-05-10T12:10:46.465798 #663761] INFO -- : make[1]: Entering directory '/tmp/ruby/build/trunk' I, [2024-05-10T12:10:46.465909 #663761] INFO -- : make[1]: Nothing to be done for 'note'. I, [2024-05-10T12:10:46.465920 #663761] INFO -- : make[1]: Leaving directory '/tmp/ruby/build/trunk' I, [2024-05-10T12:10:46.540455 #663761] INFO -- : Run options: I, [2024-05-10T12:10:46.540541 #663761] INFO -- : --seed=16707 I, [2024-05-10T12:10:46.540554 #663761] INFO -- : "--ruby=./miniruby -I/tmp/ruby/src/trunk/lib -I. -I.ext/common /tmp/ruby/src/trunk/tool/runruby.rb --extout=.ext -- --disable-gems" I, [2024-05-10T12:10:46.540570 #663761] INFO -- : --excludes-dir=/tmp/ruby/src/trunk/test/.excludes I, [2024-05-10T12:10:46.540579 #663761] INFO -- : --name=!/memory_leak/ I, [2024-05-10T12:10:46.540587 #663761] INFO -- : --stderr-on-failure I, [2024-05-10T12:10:46.540595 #663761] INFO -- : -j16 I, [2024-05-10T12:10:46.540603 #663761] INFO -- : I, [2024-05-10T12:10:46.540611 #663761] INFO -- : # Running tests: I, [2024-05-10T12:10:46.540619 #663761] INFO -- : I, [2024-05-10T12:10:46.763591 #663761] INFO -- : [ 1/885] 705108=test_switch_hitter I, [2024-05-10T12:10:46.764039 #663761] INFO -- : [ 2/885] 705115=test_flush I, [2024-05-10T12:10:46.765398 #663761] INFO -- : [ 3/885] 705105=test_singleton I, [2024-05-10T12:10:46.765755 #663761] INFO -- : [ 4/885] 705110=test_io_console I, [2024-05-10T12:10:46.766037 #663761] INFO -- : [ 5/885] 705117=test_logperiod I, [2024-05-10T12:10:46.766562 #663761] INFO -- : [ 6/885] 705118=test_rdoc_markdown_test I, [2024-05-10T12:10:46.767010 #663761] INFO -- : [ 7/885] 705107=test_c_union_entity I, [2024-05-10T12:10:46.767144 #663761] INFO -- : [ 8/885] 705113=test_rdoc_normal_module I, [2024-05-10T12:10:46.767409 #663761] INFO -- : [ 9/885] 705106=test_securerandom I, [2024-05-10T12:10:46.767861 #663761] INFO -- : [ 10/885] 705112=test_thread_fd_close I, [2024-05-10T12:10:46.768014 #663761] INFO -- : [ 11/885] 705120=test_passing_block I, [2024-05-10T12:10:46.768152 #663761] INFO -- : [ 12/885] 705109=test_stringchar I, [2024-05-10T12:10:46.768330 #663761] INFO -- : [ 13/885] 705114=test_hash_create I, [2024-05-10T12:10:46.770920 #663761] INFO -- : [ 14/885] 705116=newline_test I, [2024-05-10T12:10:46.771353 #663761] INFO -- : [ 15/885] 705111=test_uncorrectable_name_check I, [2024-05-10T12:10:46.771935 #663761] INFO -- : [ 16/885] 705119=test_gem_security_policy I, [2024-05-10T12:10:46.772907 #663761] INFO -- : [ 17/885] 705115=test_gem_source_local I, [2024-05-10T12:10:46.775984 #663761] INFO -- : [ 18/885] 705105=test_pack I, [2024-05-10T12:10:46.778036 #663761] INFO -- : [ 19/885] 705114=test_last_thread I, [2024-05-10T12:10:46.778626 #663761] INFO -- : [ 20/885] 705120=test_process I, [2024-05-10T12:10:46.785769 #663761] INFO -- : [ 21/885] 705112=test_x509cert I, [2024-05-10T12:10:46.785854 #663761] INFO -- : [ 22/885] 705117=test_gc I, [2024-05-10T12:10:46.789505 #663761] INFO -- : [ 23/885] 705111=test_gem_resolver_lock_specification I, [2024-05-10T12:10:46.805010 #663761] INFO -- : [ 24/885] 705108=test_err_in_callback I, [2024-05-10T12:10:46.810045 #663761] INFO -- : [ 25/885] 705108=test_logdevice I, [2024-05-10T12:10:46.810362 #663761] INFO -- : [ 26/885] 705107=test_arity I, [2024-05-10T12:10:46.841835 #663761] INFO -- : [ 27/885] 705107=test_gem_ext_rake_builder I, [2024-05-10T12:10:46.851402 #663761] INFO -- : [ 28/885] 705106=test_gem_commands_specification_command I, [2024-05-10T12:10:46.882945 #663761] INFO -- : [ 29/885] 705109=test_flags I, [2024-05-10T12:10:46.979849 #663761] INFO -- : [ 30/885] 705116=test_inadvertent_creation I, [2024-05-10T12:10:47.036193 #663761] INFO -- : [ 31/885] 705105=test_enumerator I, [2024-05-10T12:10:47.057471 #663761] INFO -- : [ 32/885] 705113=test_http I, [2024-05-10T12:10:47.085478 #663761] INFO -- : [ 33/885] 705113=test_gem_commands_which_command I, [2024-05-10T12:10:47.108494 #663761] INFO -- : [ 34/885] 705112=test_shift_jis I, [2024-05-10T12:10:47.111274 #663761] INFO -- : [ 35/885] 705112=test_name_error I, [2024-05-10T12:10:47.133026 #663761] INFO -- : [ 36/885] 705111=test_rdoc_markup_attribute_manager I, [2024-05-10T12:10:47.133106 #663761] INFO -- : [ 37/885] 705116=test_gem_resolver I, [2024-05-10T12:10:47.241115 #663761] INFO -- : [ 38/885] 705106=test_safe_load I, [2024-05-10T12:10:47.247280 #663761] INFO -- : [ 39/885] 705112=test_gem_resolver_composed_set I, [2024-05-10T12:10:47.257001 #663761] INFO -- : [ 40/885] 705106=test_gem_commands_dependency_command I, [2024-05-10T12:10:47.355647 #663761] INFO -- : [ 41/885] 705106=test_nil2vtempty I, [2024-05-10T12:10:47.364870 #663761] INFO -- : [ 42/885] 705106=test_stream I, [2024-05-10T12:10:47.366265 #663761] INFO -- : [ 43/885] 705115=test_rdoc_context I, [2024-05-10T12:10:47.373122 #663761] INFO -- : [ 44/885] 705106=test_open-uri I, [2024-05-10T12:10:47.393365 #663761] INFO -- : [ 45/885] 705113=test_httpresponse I, [2024-05-10T12:10:47.398481 #663761] INFO -- : [ 46/885] 705111=test_rdoc_parser_ruby I, [2024-05-10T12:10:47.404427 #663761] INFO -- : [ 47/885] 705119=test_require I, [2024-05-10T12:10:47.432958 #663761] INFO -- : [ 48/885] 705119=test_rdoc_markup_to_joined_paragraph I, [2024-05-10T12:10:47.469979 #663761] INFO -- : [ 49/885] 705112=test_date_time I, [2024-05-10T12:10:47.490122 #663761] INFO -- : [ 50/885] 705113=index_write_test I, [2024-05-10T12:10:47.508053 #663761] INFO -- : [ 51/885] 705112=test_date_new I, [2024-05-10T12:10:47.521749 #663761] INFO -- : [ 52/885] 705112=test_data I, [2024-05-10T12:10:47.529340 #663761] INFO -- : [ 53/885] 705112=test_syntax I, [2024-05-10T12:10:47.591594 #663761] INFO -- : [ 54/885] 705119=test_gem_safe_yaml I, [2024-05-10T12:10:47.595290 #663761] INFO -- : [ 55/885] 705113=test_rdoc_text I, [2024-05-10T12:10:47.605922 #663761] INFO -- : [ 56/885] 705119=test_tcp I, [2024-05-10T12:10:47.651754 #663761] INFO -- : [ 57/885] 705119=test_iso_8859 I, [2024-05-10T12:10:47.689924 #663761] INFO -- : [ 58/885] 705113=test_store I, [2024-05-10T12:10:47.701575 #663761] INFO -- : [ 59/885] 705119=test_case_options I, [2024-05-10T12:10:47.706560 #663761] INFO -- : [ 60/885] 705119=test_gem_commands_info_command I, [2024-05-10T12:10:47.747678 #663761] INFO -- : [ 61/885] 705119=test_scalar I, [2024-05-10T12:10:47.753241 #663761] INFO -- : [ 62/885] 705119=test_gem_dependency_installer I, [2024-05-10T12:10:47.757652 #663761] INFO -- : [ 63/885] 705108=test_rdoc_cross_reference I, [2024-05-10T12:10:47.787106 #663761] INFO -- : [ 64/885] 705116=test_gem_package_tar_reader_entry I, [2024-05-10T12:10:47.869619 #663761] INFO -- : [ 65/885] 705114=test_gem_name_tuple I, [2024-05-10T12:10:47.895352 #663761] INFO -- : [ 66/885] 705106=test_rand I, [2024-05-10T12:10:47.901003 #663761] INFO -- : [ 67/885] 705113=test_bug_reporter I, [2024-05-10T12:10:47.994233 #663761] INFO -- : [ 68/885] 705116=test_exception I, [2024-05-10T12:10:48.074029 #663761] INFO -- : [ 69/885] 705107=test_sprintf_comb I, [2024-05-10T12:10:48.094790 #663761] INFO -- : [ 70/885] 705109=test_method_cache I, [2024-05-10T12:10:48.096842 #663761] INFO -- : [ 71/885] 705109=test_gem_request I, [2024-05-10T12:10:48.110372 #663761] INFO -- : [ 72/885] 705111=test_gem_commands_mirror I, [2024-05-10T12:10:48.115086 #663761] INFO -- : [ 73/885] 705114=test_gem_ext_cargo_builder_link_flag_converter I, [2024-05-10T12:10:48.116261 #663761] INFO -- : [ 74/885] 705111=test_settracefunc I, [2024-05-10T12:10:48.181696 #663761] INFO -- : [ 75/885] 705114=test_gem_text I, [2024-05-10T12:10:48.246841 #663761] INFO -- : [ 76/885] 705106=test_enumerator_kw I, [2024-05-10T12:10:48.248247 #663761] INFO -- : [ 77/885] 705114=test_scan_args I, [2024-05-10T12:10:48.252056 #663761] INFO -- : [ 78/885] 705106=test_generic I, [2024-05-10T12:10:48.265767 #663761] INFO -- : [ 79/885] 705114=test_win32ole I, [2024-05-10T12:10:48.274838 #663761] INFO -- : [ 80/885] 705114=test_gem_version_option I, [2024-05-10T12:10:48.275805 #663761] INFO -- : [ 81/885] 705107=test_grapheme_breaks I, [2024-05-10T12:10:48.298845 #663761] INFO -- : [ 82/885] 705106=test_gem_request_connection_pools I, [2024-05-10T12:10:48.315190 #663761] INFO -- : [ 83/885] 705107=test_cclass I, [2024-05-10T12:10:48.332654 #663761] INFO -- : [ 84/885] 705114=test_parser_events I, [2024-05-10T12:10:48.389720 #663761] INFO -- : [ 85/885] 705118=test_reline I, [2024-05-10T12:10:48.415403 #663761] INFO -- : [ 86/885] 705113=test_case I, [2024-05-10T12:10:48.415823 #663761] INFO -- : [ 87/885] 705113=test_pkey I, [2024-05-10T12:10:48.466540 #663761] INFO -- : [ 88/885] 705114=test_json_tree I, [2024-05-10T12:10:48.478889 #663761] INFO -- : [ 89/885] 705107=test_rdoc_markup_to_markdown I, [2024-05-10T12:10:48.483637 #663761] INFO -- : [ 90/885] 705113=test_ansi_with_terminfo I, [2024-05-10T12:10:48.503402 #663761] INFO -- : [ 91/885] 705114=test_rdoc_generator_pot_po I, [2024-05-10T12:10:48.512400 #663761] INFO -- : [ 92/885] 705108=test_ractor I, [2024-05-10T12:10:48.554438 #663761] INFO -- : [ 93/885] 705109=test_memory_view I, [2024-05-10T12:10:48.564231 #663761] INFO -- : [ 94/885] 705113=test_m17n_comb I, [2024-05-10T12:10:48.595434 #663761] INFO -- : [ 95/885] 705108=test_extlibs I, [2024-05-10T12:10:48.606590 #663761] INFO -- : [ 96/885] 705118=test_rdoc_generator_ri I, [2024-05-10T12:10:48.632692 #663761] INFO -- : [ 97/885] 705118=test_gem_stream_ui I, [2024-05-10T12:10:48.677128 #663761] INFO -- : [ 98/885] 705109=test_gem_install_update_options I, [2024-05-10T12:10:48.717373 #663761] INFO -- : [ 99/885] 705114=parse_test I, [2024-05-10T12:10:48.719972 #663761] INFO -- : [100/885] 705115=test_require_lib I, [2024-05-10T12:10:48.755944 #663761] INFO -- : [101/885] 705107=test_ractor I, [2024-05-10T12:10:48.759615 #663761] INFO -- : [102/885] 705107=test_severity I, [2024-05-10T12:10:48.769089 #663761] INFO -- : [103/885] 705107=test_objectspace I, [2024-05-10T12:10:48.850926 #663761] INFO -- : [104/885] 705109=test_thread I, [2024-05-10T12:10:48.948722 #663761] INFO -- : [105/885] 705118=test_socket I, [2024-05-10T12:10:49.070173 #663761] INFO -- : [106/885] 705109=test_rdoc_markup_to_table_of_contents I, [2024-05-10T12:10:49.284836 #663761] INFO -- : [107/885] 705109=test_dot_dot I, [2024-05-10T12:10:49.289335 #663761] INFO -- : [108/885] 705109=test_c_struct_builder I, [2024-05-10T12:10:49.353640 #663761] INFO -- : [109/885] 705106=test_str2big I, [2024-05-10T12:10:49.360419 #663761] INFO -- : [110/885] 705111=test_literal I, [2024-05-10T12:10:49.363395 #663761] INFO -- : [111/885] 705106=test_gem_package_old I, [2024-05-10T12:10:49.414210 #663761] INFO -- : [112/885] 705106=test_gem_resolver_index_set I, [2024-05-10T12:10:49.418739 #663761] INFO -- : [113/885] 705109=test_gc_compact I, [2024-05-10T12:10:49.463812 #663761] INFO -- : [114/885] 705106=test_string I, [2024-05-10T12:10:49.485671 #663761] INFO -- : [115/885] 705110=test_proc I, [2024-05-10T12:10:49.895446 #663761] INFO -- : [116/885] 705107=test_date_conv I, [2024-05-10T12:10:49.897137 #663761] INFO -- : [117/885] 705107=test_optimization I, [2024-05-10T12:10:50.241754 #663761] INFO -- : .Leaked thread: TestSocket#test_accept_loop: # I, [2024-05-10T12:10:50.254774 #663761] INFO -- : .Finished thread: TestSocket#test_udp_server: # I, [2024-05-10T12:10:50.261500 #663761] INFO -- : [118/885] 705111=test_erb_m17n I, [2024-05-10T12:10:50.279860 #663761] INFO -- : [119/885] 705111=test_ole_methods I, [2024-05-10T12:10:50.286392 #663761] INFO -- : [120/885] 705111=test_egrep_cpp I, [2024-05-10T12:10:50.490379 #663761] INFO -- : [121/885] 705111=test_cgi_tag_helper I, [2024-05-10T12:10:50.524080 #663761] INFO -- : [122/885] 705111=test_zlib I, [2024-05-10T12:10:50.540138 #663761] INFO -- : [123/885] 705105=test_files_test_2 I, [2024-05-10T12:10:50.548029 #663761] INFO -- : [124/885] 705110=test_fnmatch I, [2024-05-10T12:10:50.624600 #663761] INFO -- : [125/885] 705110=test_require_path_check I, [2024-05-10T12:10:50.717495 #663761] INFO -- : [126/885] 705118=test_rdoc_markup_parser I, [2024-05-10T12:10:50.732572 #663761] INFO -- : [127/885] 705119=test_folderitem2_invokeverb I, [2024-05-10T12:10:50.735090 #663761] INFO -- : [128/885] 705119=test_gem_validator I, [2024-05-10T12:10:50.762062 #663761] INFO -- : [129/885] 705119=test_x509attr I, [2024-05-10T12:10:50.787287 #663761] INFO -- : [130/885] 705116=test_raise I, [2024-05-10T12:10:50.789958 #663761] INFO -- : [131/885] 705119=test_gem_request_set_lockfile_parser I, [2024-05-10T12:10:50.791703 #663761] INFO -- : [132/885] 705116=test_depth_first I, [2024-05-10T12:10:50.797072 #663761] INFO -- : [133/885] 705118=test_rdoc_store I, [2024-05-10T12:10:50.806368 #663761] INFO -- : [134/885] 705116=test_string I, [2024-05-10T12:10:50.824539 #663761] INFO -- : [135/885] 705110=test_rdoc_stats I, [2024-05-10T12:10:50.845577 #663761] INFO -- : [136/885] 705116=test_pattern_matching I, [2024-05-10T12:10:50.902369 #663761] INFO -- : [137/885] 705116=test_gem_dependency_resolution_error I, [2024-05-10T12:10:50.910877 #663761] INFO -- : [138/885] 705116=test_qsort I, [2024-05-10T12:10:50.933132 #663761] INFO -- : [139/885] 705116=test_rdoc_parser I, [2024-05-10T12:10:50.948163 #663761] INFO -- : [140/885] 705119=json_addition_test I, [2024-05-10T12:10:50.975685 #663761] INFO -- : [141/885] 705119=test_custom_command I, [2024-05-10T12:10:50.998004 #663761] INFO -- : [142/885] 705108=test_rdoc_markup_attributes I, [2024-05-10T12:10:51.003645 #663761] INFO -- : [143/885] 705108=test_default_gems I, [2024-05-10T12:10:51.077823 #663761] INFO -- : [144/885] 705108=test_rdoc_rd_inline_parser I, [2024-05-10T12:10:51.124352 #663761] INFO -- : [145/885] 705108=test_rdoc_markup_to_rdoc I, [2024-05-10T12:10:51.136038 #663761] INFO -- : [146/885] 705119=test_mul I, [2024-05-10T12:10:51.144931 #663761] INFO -- : [147/885] 705119=test_win32ole_type I, [2024-05-10T12:10:51.149732 #663761] INFO -- : [148/885] 705119=test_null I, [2024-05-10T12:10:51.163549 #663761] INFO -- : [149/885] 705119=test_pkey_ec I, [2024-05-10T12:10:51.173551 #663761] INFO -- : [150/885] 705110=test_thread I, [2024-05-10T12:10:51.175785 #663761] INFO -- : [151/885] 705110=test_trick I, [2024-05-10T12:10:51.176119 #663761] INFO -- : [152/885] 705108=test_pipe I, [2024-05-10T12:10:51.181242 #663761] INFO -- : [153/885] 705116=test_date_parse I, [2024-05-10T12:10:51.245567 #663761] INFO -- : [154/885] 705119=test_rdoc_i18n_text I, [2024-05-10T12:10:51.253519 #663761] INFO -- : [155/885] 705119=test_io_buffer I, [2024-05-10T12:10:51.324964 #663761] INFO -- : [156/885] 705119=test_backtrace I, [2024-05-10T12:10:51.336521 #663761] INFO -- : [157/885] 705119=test_defined I, [2024-05-10T12:10:51.349856 #663761] INFO -- : [158/885] 705108=test_key_name_check I, [2024-05-10T12:10:51.363679 #663761] INFO -- : [159/885] 705108=test_gb18030 I, [2024-05-10T12:10:51.377106 #663761] INFO -- : [160/885] 705108=test_svcb_https I, [2024-05-10T12:10:51.392720 #663761] INFO -- : [161/885] 705116=test_buffering I, [2024-05-10T12:10:51.413512 #663761] INFO -- : [162/885] 705116=test_gem_uninstaller I, [2024-05-10T12:10:51.422307 #663761] INFO -- : [163/885] 705108=test_rdoc_rdoc I, [2024-05-10T12:10:51.435940 #663761] INFO -- : [164/885] 705119=test_time I, [2024-05-10T12:10:51.526447 #663761] INFO -- : [165/885] 705108=test_windows_1251 I, [2024-05-10T12:10:51.562285 #663761] INFO -- : [166/885] 705108=test_gem_silent_ui I, [2024-05-10T12:10:51.652971 #663761] INFO -- : [167/885] 705119=test_emitter I, [2024-05-10T12:10:51.659892 #663761] INFO -- : [168/885] 705119=test_files_ext I, [2024-05-10T12:10:51.730185 #663761] INFO -- : [169/885] 705118=test_bug-5832 I, [2024-05-10T12:10:51.736816 #663761] INFO -- : [170/885] 705118=test_eval_history I, [2024-05-10T12:10:51.781682 #663761] INFO -- : [171/885] 705119=dispatcher_test I, [2024-05-10T12:10:51.789318 #663761] INFO -- : [172/885] 705113=test_kernel I, [2024-05-10T12:10:51.816022 #663761] INFO -- : [173/885] 705118=test_gem_doctor I, [2024-05-10T12:10:51.842887 #663761] INFO -- : [174/885] 705108=test_kdf I, [2024-05-10T12:10:51.870027 #663761] INFO -- : [175/885] 705118=test_rdoc_markup_paragraph I, [2024-05-10T12:10:51.879567 #663761] INFO -- : [176/885] 705118=!Nothing_to_test I, [2024-05-10T12:10:51.881296 #663761] INFO -- : [177/885] 705118=test_enc_raise I, [2024-05-10T12:10:51.886603 #663761] INFO -- : [178/885] 705119=test_psych I, [2024-05-10T12:10:51.911639 #663761] INFO -- : [179/885] 705118=test_gem_ext_cargo_builder_unit I, [2024-05-10T12:10:51.933643 #663761] INFO -- : [180/885] 705119=test_date I, [2024-05-10T12:10:51.944918 #663761] INFO -- : [181/885] 705108=test_gem_rdoc I, [2024-05-10T12:10:51.946686 #663761] INFO -- : [182/885] 705118=test_command I, [2024-05-10T12:10:51.963037 #663761] INFO -- : [183/885] 705119=test_at_exit I, [2024-05-10T12:10:51.997858 #663761] INFO -- : [184/885] 705119=test_object_create_start I, [2024-05-10T12:10:52.003992 #663761] INFO -- : [185/885] 705119=test_rdoc_tom_doc I, [2024-05-10T12:10:52.036462 #663761] INFO -- : [186/885] 705119=test_hmac I, [2024-05-10T12:10:52.045824 #663761] INFO -- : [187/885] 705119=test_rdoc_markup_to_tt_only I, [2024-05-10T12:10:52.107338 #663761] INFO -- : [188/885] 705119=test_gem_spec_fetcher I, [2024-05-10T12:10:52.166576 #663761] INFO -- : [189/885] 705108=test_common I, [2024-05-10T12:10:52.338305 #663761] INFO -- : [190/885] 705118=test_bug-3571 I, [2024-05-10T12:10:52.362432 #663761] INFO -- : [191/885] 705119=test_key_actor_vi I, [2024-05-10T12:10:52.365666 #663761] INFO -- : [192/885] 705118=test_gem_command I, [2024-05-10T12:10:52.464874 #663761] INFO -- : [193/885] 705108=test_gem_commands_lock_command I, [2024-05-10T12:10:52.490875 #663761] INFO -- : [194/885] 705118=test_ifunless I, [2024-05-10T12:10:52.493760 #663761] INFO -- : [195/885] 705108=test_assignment I, [2024-05-10T12:10:52.501325 #663761] INFO -- : [196/885] 705118=test_numeric I, [2024-05-10T12:10:52.517361 #663761] INFO -- : [197/885] 705114=test_config I, [2024-05-10T12:10:52.586677 #663761] INFO -- : [198/885] 705119=test_gem_source_list I, [2024-05-10T12:10:52.616021 #663761] INFO -- : [199/885] 705118=test_yaml_special_cases I, [2024-05-10T12:10:52.620915 #663761] INFO -- : [200/885] 705114=test_optarg I, [2024-05-10T12:10:52.646409 #663761] INFO -- : [201/885] 705119=test_address_resolve I, [2024-05-10T12:10:52.650598 #663761] INFO -- : [202/885] 705113=test_rdoc_token_stream I, [2024-05-10T12:10:52.657941 #663761] INFO -- : [203/885] 705113=test_iter_break I, [2024-05-10T12:10:52.661083 #663761] INFO -- : [204/885] 705118=test_zsh_completion I, [2024-05-10T12:10:52.672809 #663761] INFO -- : [205/885] 705119=test_exception I, [2024-05-10T12:10:52.673823 #663761] INFO -- : [206/885] 705113=test_gem_ext_configure_builder I, [2024-05-10T12:10:52.675581 #663761] INFO -- : [207/885] 705118=test_frozen I, [2024-05-10T12:10:52.683683 #663761] INFO -- : [208/885] 705118=test_pp I, [2024-05-10T12:10:52.686009 #663761] INFO -- : [209/885] 705119=test_macro I, [2024-05-10T12:10:52.691226 #663761] INFO -- : [210/885] 705119=test_nil I, [2024-05-10T12:10:52.696308 #663761] INFO -- : [211/885] 705119=test_num2int I, [2024-05-10T12:10:52.714030 #663761] INFO -- : [212/885] 705119=test_rdoc_single_class I, [2024-05-10T12:10:52.715704 #663761] INFO -- : [213/885] 705119=test_verbose I, [2024-05-10T12:10:52.735398 #663761] INFO -- : [214/885] 705113=comments_test I, [2024-05-10T12:10:52.743038 #663761] INFO -- : [215/885] 705113=test_gem_requirement I, [2024-05-10T12:10:52.748891 #663761] INFO -- : [216/885] 705116=test_sprintf I, [2024-05-10T12:10:52.761780 #663761] INFO -- : [217/885] 705119=test_string_memory I, [2024-05-10T12:10:52.776495 #663761] INFO -- : [218/885] 705118=test_gem_security_trust_dir I, [2024-05-10T12:10:52.828219 #663761] INFO -- : [219/885] 705118=test_undef I, [2024-05-10T12:10:52.833641 #663761] INFO -- : [220/885] 705118=test_objspace I, [2024-05-10T12:10:52.836872 #663761] INFO -- : [221/885] 705114=ripper_test I, [2024-05-10T12:10:52.887197 #663761] INFO -- : [222/885] 705119=test_line_editor I, [2024-05-10T12:10:52.901976 #663761] INFO -- : [223/885] 705119=test_have_library I, [2024-05-10T12:10:52.932086 #663761] INFO -- : [224/885] 705113=test_remote_fetch_error I, [2024-05-10T12:10:52.943007 #663761] INFO -- : [225/885] 705109=test_c_struct_entry I, [2024-05-10T12:10:52.956750 #663761] INFO -- : [226/885] 705113=test_lock_native_thread I, [2024-05-10T12:10:53.059722 #663761] INFO -- : [227/885] 705116=test_gem_commands_stale_command I, [2024-05-10T12:10:53.079502 #663761] INFO -- : [228/885] 705116=test_set I, [2024-05-10T12:10:53.087844 #663761] INFO -- : [229/885] 705116=test_show_source I, [2024-05-10T12:10:53.271304 #663761] INFO -- : [230/885] 705116=test_protect I, [2024-05-10T12:10:53.272157 #663761] INFO -- : [231/885] 705115=test_win32ole_typelib I, [2024-05-10T12:10:53.275581 #663761] INFO -- : [232/885] 705116=test_gem_request_set_lockfile I, [2024-05-10T12:10:53.280184 #663761] INFO -- : [233/885] 705115=test_raise_exception I, [2024-05-10T12:10:53.314517 #663761] INFO -- : [234/885] 705113=test_alias_and_anchor I, [2024-05-10T12:10:53.322163 #663761] INFO -- : [235/885] 705109=test_postponed_job I, [2024-05-10T12:10:53.335748 #663761] INFO -- : [236/885] 705113=test_external_new I, [2024-05-10T12:10:53.337983 #663761] INFO -- : [237/885] 705113=test_gem_resolver_dependency_request I, [2024-05-10T12:10:53.372235 #663761] INFO -- : [238/885] 705113=test_tree_builder I, [2024-05-10T12:10:53.382820 #663761] INFO -- : [239/885] 705113=test_hash I, [2024-05-10T12:10:53.413738 #663761] INFO -- : [240/885] 705113=test_kill_ring I, [2024-05-10T12:10:53.426645 #663761] INFO -- : [241/885] 705113=test_framework I, [2024-05-10T12:10:53.459477 #663761] INFO -- : [242/885] 705113=test_ns_spki I, [2024-05-10T12:10:53.482279 #663761] INFO -- : [243/885] 705113=test_argf I, [2024-05-10T12:10:53.599840 #663761] INFO -- : [244/885] 705114=test_gem_commands_environment_command I, [2024-05-10T12:10:53.675348 #663761] INFO -- : [245/885] 705114=test_m17n I, [2024-05-10T12:10:53.769176 #663761] INFO -- : [246/885] 705114=test_ws I, [2024-05-10T12:10:53.809836 #663761] INFO -- : [247/885] 705114=test_yjit I, [2024-05-10T12:10:53.861619 #663761] INFO -- : [248/885] 705109=test_weakmap I, [2024-05-10T12:10:53.893770 #663761] INFO -- : [249/885] 705116=test_workspace I, [2024-05-10T12:10:54.035145 #663761] INFO -- : [250/885] 705110=test_date_attr I, [2024-05-10T12:10:54.065764 #663761] INFO -- : [251/885] 705110=test_ellipsize I, [2024-05-10T12:10:54.075831 #663761] INFO -- : [252/885] 705116=test_kwargs I, [2024-05-10T12:10:54.078081 #663761] INFO -- : [253/885] 705110=warnings_test I, [2024-05-10T12:10:54.087980 #663761] INFO -- : [254/885] 705116=test_io_wait I, [2024-05-10T12:10:54.212694 #663761] INFO -- : [255/885] 705110=test_gem_commands_exec_command I, [2024-05-10T12:10:54.217322 #663761] INFO -- : [256/885] 705115=test_type_completor I, [2024-05-10T12:10:54.223152 #663761] INFO -- : [257/885] 705115=test_summary I, [2024-05-10T12:10:54.380862 #663761] INFO -- : [258/885] 705115=test_console_attr I, [2024-05-10T12:10:54.404166 #663761] INFO -- : [259/885] 705115=test_gem_commands_uninstall_command I, [2024-05-10T12:10:54.438670 #663761] INFO -- : [260/885] 705116=test_condition I, [2024-05-10T12:10:54.444511 #663761] INFO -- : [261/885] 705116=test_foreach I, [2024-05-10T12:10:54.455497 #663761] INFO -- : [262/885] 705116=test_gem_source_specific_file I, [2024-05-10T12:10:54.509043 #663761] INFO -- : [263/885] 705108=test_cp949 I, [2024-05-10T12:10:54.517895 #663761] INFO -- : [264/885] 705119=test_win32ole_record I, [2024-05-10T12:10:54.517990 #663761] INFO -- : [265/885] 705119=test_gem_unsatisfiable_dependency_error I, [2024-05-10T12:10:54.525024 #663761] INFO -- : [266/885] 705108=test_hash I, [2024-05-10T12:10:54.545986 #663761] INFO -- : [267/885] 705119=test_ubf_async_safe I, [2024-05-10T12:10:54.563105 #663761] INFO -- : [268/885] 705119=test_sorted_set I, [2024-05-10T12:10:54.576051 #663761] INFO -- : [269/885] 705116=test_emoji I, [2024-05-10T12:10:54.643566 #663761] INFO -- : [270/885] 705116=test_win32ole_type_event I, [2024-05-10T12:10:54.652334 #663761] INFO -- : [271/885] 705116=test_io I, [2024-05-10T12:10:54.885436 #663761] INFO -- : [272/885] 705105=test_to_ruby I, [2024-05-10T12:10:54.885521 #663761] INFO -- : [273/885] 705119=test_pattern_key_name_check I, [2024-05-10T12:10:54.893192 #663761] INFO -- : [274/885] 705119=test_pack I, [2024-05-10T12:10:54.926465 #663761] INFO -- : [275/885] 705105=test_array_create I, [2024-05-10T12:10:54.933124 #663761] INFO -- : [276/885] 705105=test_gem_impossible_dependencies_error I, [2024-05-10T12:10:54.965809 #663761] INFO -- : [277/885] 705116=test_gem_commands_query_command I, [2024-05-10T12:10:55.162187 #663761] INFO -- : [278/885] 705119=test_method I, [2024-05-10T12:10:55.188256 #663761] INFO -- : [279/885] 705105=test_rdoc_rubygems_hook I, [2024-05-10T12:10:55.299714 #663761] INFO -- : [280/885] 705111=test_euc_kr I, [2024-05-10T12:10:55.308525 #663761] INFO -- : [281/885] 705111=test_rdoc_context_section I, [2024-05-10T12:10:55.325781 #663761] INFO -- : [282/885] 705111=test_ftp I, [2024-05-10T12:10:55.352695 #663761] INFO -- : [283/885] 705111=test_gem_util I, [2024-05-10T12:10:55.389340 #663761] INFO -- : [284/885] 705115=test_iseq_load I, [2024-05-10T12:10:55.508760 #663761] INFO -- : [285/885] 705105=test_gem_package_tar_header I, [2024-05-10T12:10:55.583269 #663761] INFO -- : [286/885] 705105=test_pkey_dh I, [2024-05-10T12:10:55.603766 #663761] INFO -- : [287/885] 705111=test_bigzero I, [2024-05-10T12:10:55.606286 #663761] INFO -- : [288/885] 705111=test_pkcs12 I, [2024-05-10T12:10:55.701598 #663761] INFO -- : [289/885] 705105=test_system I, [2024-05-10T12:10:55.705764 #663761] INFO -- : [290/885] 705116=test_etc I, [2024-05-10T12:10:55.816769 #663761] INFO -- : [291/885] 705116=test_yjit_exit_locations I, [2024-05-10T12:10:55.821301 #663761] INFO -- : [292/885] 705112=test_gem_resolver_activation_request I, [2024-05-10T12:10:55.837491 #663761] INFO -- : [293/885] 705112=test_getopts I, [2024-05-10T12:10:55.844724 #663761] INFO -- : [294/885] 705112=test_protocol I, [2024-05-10T12:10:55.895100 #663761] INFO -- : [295/885] 705116=test_ripper I, [2024-05-10T12:10:56.002006 #663761] INFO -- : [296/885] 705111=test_gem_config_file I, [2024-05-10T12:10:56.031042 #663761] INFO -- : [297/885] 705110=test_config I, [2024-05-10T12:10:56.094282 #663761] INFO -- : [298/885] 705110=test_sleep I, [2024-05-10T12:10:56.127081 #663761] INFO -- : [299/885] 705117=test_math I, [2024-05-10T12:10:56.138162 #663761] INFO -- : [300/885] 705117=test_gem_commands_fetch_command I, [2024-05-10T12:10:56.156726 #663761] INFO -- : [301/885] 705112=test_gc I, [2024-05-10T12:10:56.165514 #663761] INFO -- : [302/885] 705112=test_libs I, [2024-05-10T12:10:56.176867 #663761] INFO -- : [303/885] 705111=test_yaml_tree I, [2024-05-10T12:10:56.196772 #663761] INFO -- : [304/885] 705112=test_rendering I, [2024-05-10T12:10:56.203412 #663761] INFO -- : [305/885] 705111=test_face I, [2024-05-10T12:10:56.316114 #663761] INFO -- : [306/885] 705111=test_sizeof I, [2024-05-10T12:10:56.350292 #663761] INFO -- : [307/885] 705112=test_case I, [2024-05-10T12:10:56.363796 #663761] INFO -- : [308/885] 705116=test_unicode_escape I, [2024-05-10T12:10:56.407203 #663761] INFO -- : [309/885] 705112=test_io I, [2024-05-10T12:10:56.454130 #663761] INFO -- : [310/885] 705116=test_utf16 I, [2024-05-10T12:10:56.472352 #663761] INFO -- : [311/885] 705116=test_autoload I, [2024-05-10T12:10:56.620071 #663761] INFO -- : [312/885] 705117=test_rdoc_markup_indented_paragraph I, [2024-05-10T12:10:56.774602 #663761] INFO -- : [313/885] 705115=test_rdoc_task I, [2024-05-10T12:10:56.779547 #663761] INFO -- : [314/885] 705115=test_gem_resolver_conflict I, [2024-05-10T12:10:56.796145 #663761] INFO -- : [315/885] 705115=ruby_parser_test I, [2024-05-10T12:10:56.806498 #663761] INFO -- : [316/885] 705117=test_pack I, [2024-05-10T12:10:56.849070 #663761] INFO -- : [317/885] 705117=test_backtrace I, [2024-05-10T12:10:56.877204 #663761] INFO -- : [318/885] 705115=test_io_buffer I, [2024-05-10T12:10:56.982228 #663761] INFO -- : [319/885] 705105=test_readpartial I, [2024-05-10T12:10:56.989654 #663761] INFO -- : [320/885] 705115=test_clone I, [2024-05-10T12:10:57.232508 #663761] INFO -- : [321/885] 705115=test_gem_commands_install_command I, [2024-05-10T12:10:57.393072 #663761] INFO -- : [322/885] 705105=test_rdoc_require I, [2024-05-10T12:10:57.467559 #663761] INFO -- : [323/885] 705105=locals_test I, [2024-05-10T12:10:57.888363 #663761] INFO -- : [324/885] 705109=test_gem_resolver_best_set I, [2024-05-10T12:10:57.951975 #663761] INFO -- : [325/885] 705105=encoding_test I, [2024-05-10T12:10:57.960559 #663761] INFO -- : [326/885] 705109=test_typeddata I, [2024-05-10T12:10:58.067099 #663761] INFO -- : [327/885] 705105=test_rdoc_markup_to_html_crossref I, [2024-05-10T12:10:58.143970 #663761] INFO -- : [328/885] 705110=test_rdoc_markup_raw I, [2024-05-10T12:10:58.151268 #663761] INFO -- : [329/885] 705110=test_webauthn_poller I, [2024-05-10T12:10:58.191553 #663761] INFO -- : [330/885] 705109=test_rat I, [2024-05-10T12:10:58.195032 #663761] INFO -- : [331/885] 705109=test_optparse I, [2024-05-10T12:10:58.285951 #663761] INFO -- : [332/885] 705109=test_array I, [2024-05-10T12:10:58.291260 #663761] INFO -- : [333/885] 705117=test_fstring I, [2024-05-10T12:10:58.299187 #663761] INFO -- : [334/885] 705109=test_yield I, [2024-05-10T12:10:58.322367 #663761] INFO -- : [335/885] 705110=test_rdoc_alias I, [2024-05-10T12:10:58.349524 #663761] INFO -- : [336/885] 705110=test_convertible I, [2024-05-10T12:10:58.441821 #663761] INFO -- : [337/885] 705105=parser_test I, [2024-05-10T12:10:58.446774 #663761] INFO -- : [338/885] 705105=test_files_sample I, [2024-05-10T12:10:58.453530 #663761] INFO -- : [339/885] 705105=test_stringscanner I, [2024-05-10T12:10:58.458039 #663761] INFO -- : [340/885] 705117=test_big2str I, [2024-05-10T12:10:58.460656 #663761] INFO -- : [341/885] 705117=test_yaml I, [2024-05-10T12:10:58.483489 #663761] INFO -- : [342/885] 705105=test_forwardable I, [2024-05-10T12:10:58.512683 #663761] INFO -- : [343/885] 705105=test_wait I, [2024-05-10T12:10:58.616536 #663761] INFO -- : [344/885] 705105=test_handle I, [2024-05-10T12:10:58.666766 #663761] INFO -- : [345/885] 705117=test_nowrite I, [2024-05-10T12:10:58.689663 #663761] INFO -- : [346/885] 705117=test_thread_queue I, [2024-05-10T12:10:59.019864 #663761] INFO -- : [347/885] 705115=test_rdoc_markup_formatter I, [2024-05-10T12:10:59.035706 #663761] INFO -- : [348/885] 705115=test_bmethod I, [2024-05-10T12:10:59.042593 #663761] INFO -- : [349/885] 705115=test_ractor I, [2024-05-10T12:10:59.053354 #663761] INFO -- : [350/885] 705113=test_euc_tw I, [2024-05-10T12:10:59.055967 #663761] INFO -- : [351/885] 705113=test_ansi_without_terminfo I, [2024-05-10T12:10:59.058631 #663761] INFO -- : [352/885] 705115=test_gem_commands_sources_command I, [2024-05-10T12:10:59.066403 #663761] INFO -- : [353/885] 705113=test_io_timeout I, [2024-05-10T12:10:59.067366 #663761] INFO -- : [354/885] 705105=test_shapes I, [2024-05-10T12:10:59.070628 #663761] INFO -- : [355/885] 705113=json_fixtures_test I, [2024-05-10T12:10:59.076606 #663761] INFO -- : [356/885] 705105=test_comparable I, [2024-05-10T12:10:59.080757 #663761] INFO -- : [357/885] 705105=test_rdoc_parser_c I, [2024-05-10T12:10:59.091144 #663761] INFO -- : [358/885] 705113=test_gbk I, [2024-05-10T12:10:59.096810 #663761] INFO -- : [359/885] 705113=test_class2name I, [2024-05-10T12:10:59.101151 #663761] INFO -- : [360/885] 705113=test_enc_str_buf_cat I, [2024-05-10T12:10:59.106639 #663761] INFO -- : [361/885] 705113=test_pstore I, [2024-05-10T12:10:59.162247 #663761] INFO -- : [362/885] 705113=test_cstr I, [2024-05-10T12:10:59.267615 #663761] INFO -- : [363/885] 705115=test_profile_frames I, [2024-05-10T12:10:59.358036 #663761] INFO -- : [364/885] 705105=test_marshalable I, [2024-05-10T12:10:59.366929 #663761] INFO -- : [365/885] 705105=test_digest I, [2024-05-10T12:10:59.478176 #663761] INFO -- : [366/885] 705115=test_gem_ext_cmake_builder I, [2024-05-10T12:10:59.519147 #663761] INFO -- : [367/885] 705115=test_gem_commands_contents_command I, [2024-05-10T12:10:59.553972 #663761] INFO -- : [368/885] 705107=test_cgi_util I, [2024-05-10T12:10:59.634112 #663761] INFO -- : [369/885] 705115=test_require I, [2024-05-10T12:10:59.795943 #663761] INFO -- : [370/885] 705108=test_fiddle I, [2024-05-10T12:10:59.892870 #663761] INFO -- : [371/885] 705108=test_wss I, [2024-05-10T12:10:59.897260 #663761] INFO -- : [372/885] 705108=test_ractor I, [2024-05-10T12:10:59.908432 #663761] INFO -- : [373/885] 705107=test_find I, [2024-05-10T12:10:59.921159 #663761] INFO -- : [374/885] 705107=test_coverage I, [2024-05-10T12:11:00.025971 #663761] INFO -- : [375/885] 705108=test_rdoc_encoding I, [2024-05-10T12:11:00.071366 #663761] INFO -- : [376/885] 705108=regexp_test I, [2024-05-10T12:11:00.127577 #663761] INFO -- : [377/885] 705111=test_gem_package_tar_reader I, [2024-05-10T12:11:00.163023 #663761] INFO -- : [378/885] 705108=test_init I, [2024-05-10T12:11:00.205809 #663761] INFO -- : [379/885] 705111=test_complexrational I, [2024-05-10T12:11:00.213625 #663761] INFO -- : [380/885] 705111=test_pathname I, [2024-05-10T12:11:00.245980 #663761] INFO -- : [381/885] 705113=test_rdoc_markdown I, [2024-05-10T12:11:00.246408 #663761] INFO -- : [382/885] 705105=test_gem_available_set I, [2024-05-10T12:11:00.390819 #663761] INFO -- : [383/885] 705105=test_rdoc_any_method I, [2024-05-10T12:11:00.540904 #663761] INFO -- : [384/885] 705111=test_modify_expand I, [2024-05-10T12:11:00.545029 #663761] INFO -- : [385/885] 705111=test_file I, [2024-05-10T12:11:00.550945 #663761] INFO -- : [386/885] 705111=test_deprecate I, [2024-05-10T12:11:00.605831 #663761] INFO -- : [387/885] 705111=test_rdoc_constant I, [2024-05-10T12:11:00.656671 #663761] INFO -- : [388/885] 705113=test_formatter I, [2024-05-10T12:11:00.669028 #663761] INFO -- : [389/885] 705113=test_bash_completion I, [2024-05-10T12:11:00.676412 #663761] INFO -- : [390/885] 705113=test_gem_source_vendor I, [2024-05-10T12:11:00.690131 #663761] INFO -- : [391/885] 705113=test_gem_commands_owner_command I, [2024-05-10T12:11:00.746502 #663761] INFO -- : [392/885] 705111=test_recorder I, [2024-05-10T12:11:00.751600 #663761] INFO -- : [393/885] 705108=test_rdoc_parser_rd I, [2024-05-10T12:11:00.753888 #663761] INFO -- : [394/885] 705111=test_date_strftime I, [2024-05-10T12:11:00.759664 #663761] INFO -- : [395/885] 705108=test_yamlstore I, [2024-05-10T12:11:00.775933 #663761] INFO -- : [396/885] 705108=test_gem_installer I, [2024-05-10T12:11:00.895355 #663761] INFO -- : [397/885] 705105=test_rdoc_normal_class I, [2024-05-10T12:11:00.954081 #663761] INFO -- : [398/885] 705105=test_class I, [2024-05-10T12:11:01.049713 #663761] INFO -- : [399/885] 705107=test_const I, [2024-05-10T12:11:01.052904 #663761] INFO -- : [400/885] 705107=json_string_matching_test I, [2024-05-10T12:11:01.065868 #663761] INFO -- : [401/885] 705107=test_load I, [2024-05-10T12:11:01.086236 #663761] INFO -- : [402/885] 705107=test_random I, [2024-05-10T12:11:01.106097 #663761] INFO -- : [403/885] 705107=test_asn1 I, [2024-05-10T12:11:01.130938 #663761] INFO -- : [404/885] 705107=test_irb I, [2024-05-10T12:11:01.337710 #663761] INFO -- : [405/885] 705113=test_function I, [2024-05-10T12:11:01.351937 #663761] INFO -- : [406/885] 705115=test_queue I, [2024-05-10T12:11:01.352791 #663761] INFO -- : [407/885] 705111=test_tempfile I, [2024-05-10T12:11:01.362750 #663761] INFO -- : [408/885] 705115=test_noarg I, [2024-05-10T12:11:01.526030 #663761] INFO -- : [409/885] 705115=parse_comments_test I, [2024-05-10T12:11:01.530937 #663761] INFO -- : [410/885] 705115=test_utf32 I, [2024-05-10T12:11:01.536447 #663761] INFO -- : [411/885] 705115=test_basicsocket I, [2024-05-10T12:11:01.549003 #663761] INFO -- : [412/885] 705115=test_duplicate I, [2024-05-10T12:11:01.556140 #663761] INFO -- : [413/885] 705115=test_rdoc_markup I, [2024-05-10T12:11:01.566929 #663761] INFO -- : [414/885] 705107=test_gem_commands_help_command I, [2024-05-10T12:11:01.569664 #663761] INFO -- : [415/885] 705115=test_tracepoint I, [2024-05-10T12:11:01.573304 #663761] INFO -- : [416/885] 705113=test_prettyprint I, [2024-05-10T12:11:01.604032 #663761] INFO -- : [417/885] 705113=test_internal_ivar I, [2024-05-10T12:11:01.616085 #663761] INFO -- : [418/885] 705113=test_gem_resolver_index_specification I, [2024-05-10T12:11:01.660256 #663761] INFO -- : [419/885] 705107=test_stack I, [2024-05-10T12:11:01.690201 #663761] INFO -- : [420/885] 705113=test_gem_commands_list_command I, [2024-05-10T12:11:01.695591 #663761] INFO -- : [421/885] 705111=test_reqarg I, [2024-05-10T12:11:01.755072 #663761] INFO -- : [422/885] 705113=test_rdoc_include I, [2024-05-10T12:11:01.787827 #663761] INFO -- : [423/885] 705113=test_too_many_dummy_encodings I, [2024-05-10T12:11:01.887339 #663761] INFO -- : [424/885] 705113=test_gem_version I, [2024-05-10T12:11:01.936906 #663761] INFO -- : [425/885] 705115=test_rdoc_options I, [2024-05-10T12:11:02.026570 #663761] INFO -- : [426/885] 705113=test_econv I, [2024-05-10T12:11:02.183970 #663761] INFO -- : [427/885] 705109=test_cesu8 I, [2024-05-10T12:11:02.189145 #663761] INFO -- : [428/885] 705109=test_fileutils I, [2024-05-10T12:11:02.268539 #663761] INFO -- : [429/885] 705111=test_string_processing I, [2024-05-10T12:11:02.277764 #663761] INFO -- : [430/885] 705111=test_emitter I, [2024-05-10T12:11:02.284872 #663761] INFO -- : [431/885] 705111=test_gem_commands_signin_command I, [2024-05-10T12:11:02.289721 #663761] INFO -- : [432/885] 705115=test_resource I, [2024-05-10T12:11:02.315837 #663761] INFO -- : [433/885] 705115=test_ldap I, [2024-05-10T12:11:02.345139 #663761] INFO -- : [434/885] 705115=test_gem_ext_ext_conf_builder I, [2024-05-10T12:11:02.433658 #663761] INFO -- : [435/885] 705111=test_gem_stub_specification I, [2024-05-10T12:11:02.617102 #663761] INFO -- : [436/885] 705111=test_method_cache I, [2024-05-10T12:11:02.621406 #663761] INFO -- : [437/885] 705111=test_frozen_error I, [2024-05-10T12:11:02.624971 #663761] INFO -- : [438/885] 705111=test_gem_commands_search_command I, [2024-05-10T12:11:02.636348 #663761] INFO -- : [439/885] 705111=test_complex I, [2024-05-10T12:11:02.744992 #663761] INFO -- : [440/885] 705109=test_inlinecache I, [2024-05-10T12:11:02.745971 #663761] INFO -- : [441/885] 705114=test_rdoc_markup_verbatim I, [2024-05-10T12:11:02.761916 #663761] INFO -- : [442/885] 705114=test_gem_resolver_specification I, [2024-05-10T12:11:02.797006 #663761] INFO -- : [443/885] 705111=test_gem_dependency I, [2024-05-10T12:11:02.807370 #663761] INFO -- : [444/885] 705114=test_path_to_class I, [2024-05-10T12:11:02.817003 #663761] INFO -- : [445/885] 705114=test_mdns I, [2024-05-10T12:11:02.822241 #663761] INFO -- : [446/885] 705109=test_parse I, [2024-05-10T12:11:02.837683 #663761] INFO -- : [447/885] 705114=test_gem_remote_fetcher I, [2024-05-10T12:11:02.937962 #663761] INFO -- : [448/885] 705107=test_scanner_events I, [2024-05-10T12:11:02.969460 #663761] INFO -- : [449/885] 705111=test_gem_resolver_installed_specification I, [2024-05-10T12:11:02.978696 #663761] INFO -- : [450/885] 705107=test_gem_request_set I, [2024-05-10T12:11:02.997830 #663761] INFO -- : [451/885] 705111=test_module I, [2024-05-10T12:11:03.166580 #663761] INFO -- : [452/885] 705116=test_gem_ext_cargo_builder I, [2024-05-10T12:11:03.196364 #663761] INFO -- : [453/885] 705116=test_ssl I, [2024-05-10T12:11:03.303289 #663761] INFO -- : [454/885] 705117=constant_path_node_test I, [2024-05-10T12:11:03.412039 #663761] INFO -- : [455/885] 705113=test_parser I, [2024-05-10T12:11:03.434982 #663761] INFO -- : [456/885] 705117=test_arith_seq_extract I, [2024-05-10T12:11:03.438492 #663761] INFO -- : [457/885] 705119=test_method_name_check I, [2024-05-10T12:11:03.449311 #663761] INFO -- : [458/885] 705113=test_rdoc_generator_markup I, [2024-05-10T12:11:03.462384 #663761] INFO -- : [459/885] 705113=test_whileuntil I, [2024-05-10T12:11:03.466574 #663761] INFO -- : [460/885] 705113=test_buffered_io I, [2024-05-10T12:11:03.470154 #663761] INFO -- : [461/885] 705119=test_monitor I, [2024-05-10T12:11:03.503019 #663761] INFO -- : [462/885] 705113=test_rubyvm I, [2024-05-10T12:11:03.504438 #663761] INFO -- : [463/885] 705106=test_configuration I, [2024-05-10T12:11:03.509991 #663761] INFO -- : [464/885] 705113=test_stringify_symbols I, [2024-05-10T12:11:03.520031 #663761] INFO -- : [465/885] 705109=test_instrumentation_api I, [2024-05-10T12:11:03.526613 #663761] INFO -- : [466/885] 705113=integer_parse_test I, [2024-05-10T12:11:03.531488 #663761] INFO -- : [467/885] 705113=test_boolean I, [2024-05-10T12:11:03.540807 #663761] INFO -- : [468/885] 705113=test_array I, [2024-05-10T12:11:03.553054 #663761] INFO -- : [469/885] 705107=test_gem_package_tar_writer I, [2024-05-10T12:11:03.627159 #663761] INFO -- : [470/885] 705106=test_helper_method I, [2024-05-10T12:11:03.643895 #663761] INFO -- : [471/885] 705117=test_gem_commands_outdated_command I, [2024-05-10T12:11:03.683717 #663761] INFO -- : [472/885] 705119=test_scalar_scanner I, [2024-05-10T12:11:03.696967 #663761] INFO -- : [473/885] 705107=test_gem_source I, [2024-05-10T12:11:03.702559 #663761] INFO -- : [474/885] 705119=test_nesting_parser I, [2024-05-10T12:11:03.709912 #663761] INFO -- : [475/885] 705117=test_win32ole_method_event I, [2024-05-10T12:11:03.720871 #663761] INFO -- : [476/885] 705117=test_benchmark I, [2024-05-10T12:11:03.728745 #663761] INFO -- : [477/885] 705119=test_gem_dependency_list I, [2024-05-10T12:11:03.763812 #663761] INFO -- : [478/885] 705106=test_evaluation I, [2024-05-10T12:11:03.763900 #663761] INFO -- : [479/885] 705106=test_gem_ext_builder I, [2024-05-10T12:11:03.835348 #663761] INFO -- : [480/885] 705119=test_https I, [2024-05-10T12:11:03.896950 #663761] INFO -- : [481/885] 705115=test_load I, [2024-05-10T12:11:03.902529 #663761] INFO -- : [482/885] 705115=test_gem_commands_rebuild_command I, [2024-05-10T12:11:03.946868 #663761] INFO -- : [483/885] 705115=test_yamldbm I, [2024-05-10T12:11:03.955455 #663761] INFO -- : [484/885] 705115=test_rdoc_parser_simple I, [2024-05-10T12:11:03.975219 #663761] INFO -- : [485/885] 705115=test_provider I, [2024-05-10T12:11:04.083849 #663761] INFO -- : [486/885] 705107=test_abi I, [2024-05-10T12:11:04.280487 #663761] INFO -- : [487/885] 705119=test_gem_commands_cert_command I, [2024-05-10T12:11:04.282668 #663761] INFO -- : [488/885] 705107=test_completion I, [2024-05-10T12:11:04.371470 #663761] INFO -- : [489/885] 705110=test_yield_block I, [2024-05-10T12:11:04.374651 #663761] INFO -- : [490/885] 705110=test_len I, [2024-05-10T12:11:04.379560 #663761] INFO -- : [491/885] 705110=test_gem_source_installed I, [2024-05-10T12:11:04.397278 #663761] INFO -- : [492/885] 705110=test_x509ext I, [2024-05-10T12:11:04.405516 #663761] INFO -- : [493/885] 705115=test_erb I, [2024-05-10T12:11:04.413853 #663761] INFO -- : [494/885] 705110=attribute_write_test I, [2024-05-10T12:11:04.419524 #663761] INFO -- : [495/885] 705110=test_propertyputref I, [2024-05-10T12:11:04.424156 #663761] INFO -- : [496/885] 705110=test_spell_checker I, [2024-05-10T12:11:04.444235 #663761] INFO -- : [497/885] 705110=test_assembler I, [2024-05-10T12:11:04.446423 #663761] INFO -- : [498/885] 705110=test_rational2 I, [2024-05-10T12:11:04.463552 #663761] INFO -- : [499/885] 705110=test_rational I, [2024-05-10T12:11:04.487652 #663761] INFO -- : [500/885] 705110=test_gem_resolver_installer_set I, [2024-05-10T12:11:04.498368 #663761] INFO -- : [501/885] 705115=test_dir_m17n I, [2024-05-10T12:11:04.508913 #663761] INFO -- : [502/885] 705105=test_gem_source_git I, [2024-05-10T12:11:04.746060 #663761] INFO -- : [503/885] 705110=test_regex_casefold I, [2024-05-10T12:11:05.034371 #663761] INFO -- : [504/885] 705114=test_gem_commands_signout_command I, [2024-05-10T12:11:05.055908 #663761] INFO -- : [505/885] 705114=test_refinement I, [2024-05-10T12:11:05.094557 #663761] INFO -- : [506/885] 705117=test_require I, [2024-05-10T12:11:05.158260 #663761] INFO -- : [507/885] 705105=test_cgi_cookie I, [2024-05-10T12:11:05.161999 #663761] INFO -- : [508/885] 705106=test_float I, [2024-05-10T12:11:05.168853 #663761] INFO -- : [509/885] 705107=test_windows_1252 I, [2024-05-10T12:11:05.175047 #663761] INFO -- : [510/885] 705105=test_input_method I, [2024-05-10T12:11:05.176266 #663761] INFO -- : [511/885] 705107=test_process I, [2024-05-10T12:11:05.221582 #663761] INFO -- : [512/885] 705107=test_x509crl I, [2024-05-10T12:11:05.320849 #663761] INFO -- : [513/885] 705112=test_signal I, [2024-05-10T12:11:05.362337 #663761] INFO -- : [514/885] 705105=test_fixnum I, [2024-05-10T12:11:05.407436 #663761] INFO -- : [515/885] 705105=test_rdoc_top_level I, [2024-05-10T12:11:05.414165 #663761] INFO -- : [516/885] 705107=test_metaclass I, [2024-05-10T12:11:05.417846 #663761] INFO -- : [517/885] 705110=test_cgi_session I, [2024-05-10T12:11:05.430380 #663761] INFO -- : [518/885] 705107=test_rdoc_rd I, [2024-05-10T12:11:05.436039 #663761] INFO -- : [519/885] 705110=test_shellwords I, [2024-05-10T12:11:05.454502 #663761] INFO -- : [520/885] 705110=pattern_test I, [2024-05-10T12:11:05.456970 #663761] INFO -- : [521/885] 705107=test_memory_view I, [2024-05-10T12:11:05.479824 #663761] INFO -- : [522/885] 705110=test_debug I, [2024-05-10T12:11:05.491186 #663761] INFO -- : [523/885] 705110=test_omap I, [2024-05-10T12:11:05.497017 #663761] INFO -- : [524/885] 705107=test_string I, [2024-05-10T12:11:05.500079 #663761] INFO -- : [525/885] 705110=test_iterator I, [2024-05-10T12:11:05.505832 #663761] INFO -- : [526/885] 705107=test_digest_extend I, [2024-05-10T12:11:05.517807 #663761] INFO -- : [527/885] 705107=test_gem_resolver_git_set I, [2024-05-10T12:11:05.596212 #663761] INFO -- : [528/885] 705110=test_storage I, [2024-05-10T12:11:05.602642 #663761] INFO -- : [529/885] 705110=test_gem_security_signer I, [2024-05-10T12:11:05.741689 #663761] INFO -- : [530/885] 705110=test_cipher I, [2024-05-10T12:11:05.765641 #663761] INFO -- : [531/885] 705105=test_new I, [2024-05-10T12:11:05.769863 #663761] INFO -- : [532/885] 705105=test_config I, [2024-05-10T12:11:05.788614 #663761] INFO -- : [533/885] 705110=json_parser_test I, [2024-05-10T12:11:05.816740 #663761] INFO -- : [534/885] 705105=test_nomethod_error I, [2024-05-10T12:11:05.823118 #663761] INFO -- : [535/885] 705105=memsize_test I, [2024-05-10T12:11:05.823725 #663761] INFO -- : [536/885] 705105=json_common_interface_test I, [2024-05-10T12:11:05.846904 #663761] INFO -- : [537/885] 705110=test_gem_source_subpath_problem I, [2024-05-10T12:11:05.848645 #663761] INFO -- : [538/885] 705105=test_dln I, [2024-05-10T12:11:05.848698 #663761] INFO -- : [539/885] 705105=test_win32ole_variant_outarg I, [2024-05-10T12:11:05.861920 #663761] INFO -- : [540/885] 705105=test_variable I, [2024-05-10T12:11:05.924607 #663761] INFO -- : [541/885] 705119=fuzzer_test I, [2024-05-10T12:11:05.943641 #663761] INFO -- : [542/885] 705119=test_sexp I, [2024-05-10T12:11:05.945462 #663761] INFO -- : [543/885] 705107=test_rdoc_markup_include I, [2024-05-10T12:11:05.949719 #663761] INFO -- : [544/885] 705107=test_rdoc_markup_to_html_snippet I, [2024-05-10T12:11:05.963736 #663761] INFO -- : [545/885] 705119=magic_comment_test I, [2024-05-10T12:11:05.973725 #663761] INFO -- : [546/885] 705119=test_struct I, [2024-05-10T12:11:05.979905 #663761] INFO -- : [547/885] 705119=test_cparser I, [2024-05-10T12:11:05.981643 #663761] INFO -- : [548/885] 705111=test_pkg_config I, [2024-05-10T12:11:05.987664 #663761] INFO -- : [549/885] 705105=test_color_printer I, [2024-05-10T12:11:05.988825 #663761] INFO -- : [550/885] 705105=test_deprecated I, [2024-05-10T12:11:05.991375 #663761] INFO -- : [551/885] 705110=test_insns_leaf I, [2024-05-10T12:11:05.992232 #663761] INFO -- : [552/885] 705105=test_serialize_subclasses I, [2024-05-10T12:11:05.995716 #663761] INFO -- : [553/885] 705110=test_key_error I, [2024-05-10T12:11:05.996647 #663761] INFO -- : [554/885] 705105=test_engine I, [2024-05-10T12:11:05.997361 #663761] INFO -- : [555/885] 705105=test_win32ole_variant_m I, [2024-05-10T12:11:05.998711 #663761] INFO -- : [556/885] 705105=test_div I, [2024-05-10T12:11:06.000989 #663761] INFO -- : [557/885] 705110=test_allocation I, [2024-05-10T12:11:06.002192 #663761] INFO -- : [558/885] 705105=test_rdoc_rd_inline I, [2024-05-10T12:11:06.007760 #663761] INFO -- : [559/885] 705105=test_x509req I, [2024-05-10T12:11:06.016270 #663761] INFO -- : [560/885] 705111=test_mutex I, [2024-05-10T12:11:06.054795 #663761] INFO -- : [561/885] 705107=test_struct I, [2024-05-10T12:11:06.165446 #663761] INFO -- : [562/885] 705105=test_gem_path_support I, [2024-05-10T12:11:06.203143 #663761] INFO -- : [563/885] 705105=test_set I, [2024-05-10T12:11:06.235762 #663761] INFO -- : [564/885] 705105=test_files_test_1 I, [2024-05-10T12:11:06.237822 #663761] INFO -- : [565/885] 705105=test_case_comprehensive I, [2024-05-10T12:11:06.273579 #663761] INFO -- : [566/885] 705115=test_interned_str I, [2024-05-10T12:11:06.274818 #663761] INFO -- : [567/885] 705115=test_gem_commands_build_command I, [2024-05-10T12:11:06.542471 #663761] INFO -- : [568/885] 705109=test_option I, [2024-05-10T12:11:06.608953 #663761] INFO -- : [569/885] 705115=test_append I, [2024-05-10T12:11:06.617037 #663761] INFO -- : [570/885] 705115=test_tracer I, [2024-05-10T12:11:06.697285 #663761] INFO -- : [571/885] 705107=test_cmethod I, [2024-05-10T12:11:06.704365 #663761] INFO -- : [572/885] 705107=test_did_you_mean I, [2024-05-10T12:11:06.710749 #663761] INFO -- : [573/885] 705109=test_io_m17n I, [2024-05-10T12:11:06.728059 #663761] INFO -- : [574/885] 705115=test_variable_name_check I, [2024-05-10T12:11:06.773413 #663761] INFO -- : [575/885] 705115=test_gem_commands_server_command I, [2024-05-10T12:11:06.781847 #663761] INFO -- : [576/885] 705106=test_exception_at_throwing I, [2024-05-10T12:11:06.783440 #663761] INFO -- : [577/885] 705115=test_iseq I, [2024-05-10T12:11:06.788670 #663761] INFO -- : [578/885] 705107=test_rdoc_markup_heading I, [2024-05-10T12:11:06.798950 #663761] INFO -- : [579/885] 705107=test_scheduler I, [2024-05-10T12:11:06.866195 #663761] INFO -- : [580/885] 705106=test_ocsp I, [2024-05-10T12:11:06.889996 #663761] INFO -- : [581/885] 705108=test_class I, [2024-05-10T12:11:06.897097 #663761] INFO -- : [582/885] 705108=test_pkey_dsa I, [2024-05-10T12:11:06.972897 #663761] INFO -- : [583/885] 705107=test_beginendblock I, [2024-05-10T12:11:07.131715 #663761] INFO -- : [584/885] 705106=test_files_lib I, [2024-05-10T12:11:07.154376 #663761] INFO -- : [585/885] 705111=test_gem_commands_unpack_command I, [2024-05-10T12:11:07.389130 #663761] INFO -- : [586/885] 705108=test_rdoc_markup_to_bs I, [2024-05-10T12:11:07.444920 #663761] INFO -- : [587/885] 705108=test_help I, [2024-05-10T12:11:07.450380 #663761] INFO -- : [588/885] 705108=test_within_pipe I, [2024-05-10T12:11:07.458135 #663761] INFO -- : [589/885] 705107=test_emoji_breaks I, [2024-05-10T12:11:07.467053 #663761] INFO -- : [590/885] 705107=test_gem_bundler_version_finder I, [2024-05-10T12:11:07.475127 #663761] INFO -- : [591/885] 705119=reflection_test I, [2024-05-10T12:11:07.476895 #663761] INFO -- : [592/885] 705108=test_pinned I, [2024-05-10T12:11:07.482293 #663761] INFO -- : [593/885] 705119=test_printf I, [2024-05-10T12:11:07.499544 #663761] INFO -- : [594/885] 705119=test_rdoc_markup_pre_process I, [2024-05-10T12:11:07.521068 #663761] INFO -- : [595/885] 705107=test_stream I, [2024-05-10T12:11:07.534350 #663761] INFO -- : [596/885] 705108=test_to_ary_concat I, [2024-05-10T12:11:07.562711 #663761] INFO -- : [597/885] 705107=test_webauthn_listener_response I, [2024-05-10T12:11:07.569711 #663761] INFO -- : [598/885] 705115=test_time I, [2024-05-10T12:11:07.575550 #663761] INFO -- : [599/885] 705111=test_recursion I, [2024-05-10T12:11:07.576298 #663761] INFO -- : [600/885] 705111=test_exit I, [2024-05-10T12:11:07.590435 #663761] INFO -- : [601/885] 705107=test_popen_deadlock I, [2024-05-10T12:11:07.603779 #663761] INFO -- : [602/885] 705119=test_delegate I, [2024-05-10T12:11:07.634941 #663761] INFO -- : [603/885] 705119=test_mkmf I, [2024-05-10T12:11:07.657451 #663761] INFO -- : [604/885] 705119=test_date_marshal I, [2024-05-10T12:11:07.664520 #663761] INFO -- : [605/885] 705119=test_history I, [2024-05-10T12:11:07.678795 #663761] INFO -- : [606/885] 705111=test_open3 I, [2024-05-10T12:11:07.689989 #663761] INFO -- : [607/885] 705112=test_multi_irb_commands I, [2024-05-10T12:11:07.697476 #663761] INFO -- : [608/885] 705119=test_fiber I, [2024-05-10T12:11:07.701850 #663761] INFO -- : [609/885] 705112=test_bundled_ca I, [2024-05-10T12:11:07.863054 #663761] INFO -- : [610/885] 705115=test_closure I, [2024-05-10T12:11:08.466289 #663761] INFO -- : [611/885] 705107=test_digest I, [2024-05-10T12:11:08.477492 #663761] INFO -- : [612/885] 705109=test_gem_security I, [2024-05-10T12:11:08.479479 #663761] INFO -- : [613/885] 705107=test_rdoc_servlet I, [2024-05-10T12:11:08.558055 #663761] INFO -- : [614/885] 705115=test_ractor I, [2024-05-10T12:11:08.684003 #663761] INFO -- : [615/885] 705115=test_rbconfig I, [2024-05-10T12:11:08.685465 #663761] INFO -- : [616/885] 705115=test_primitive I, [2024-05-10T12:11:08.695641 #663761] INFO -- : [617/885] 705107=test_human_typo I, [2024-05-10T12:11:08.697615 #663761] INFO -- : [618/885] 705115=test_rdoc_i18n_locale I, [2024-05-10T12:11:08.704206 #663761] INFO -- : [619/885] 705107=test_chilled I, [2024-05-10T12:11:08.708206 #663761] INFO -- : [620/885] 705115=test_name_error_extension I, [2024-05-10T12:11:08.711299 #663761] INFO -- : [621/885] 705107=test_acceptable I, [2024-05-10T12:11:08.715031 #663761] INFO -- : [622/885] 705115=test_rdoc_generator_pot_po_entry I, [2024-05-10T12:11:08.719361 #663761] INFO -- : [623/885] 705115=test_euc_jp I, [2024-05-10T12:11:08.723692 #663761] INFO -- : [624/885] 705115=test_document I, [2024-05-10T12:11:08.728566 #663761] INFO -- : [625/885] 705115=test_pair I, [2024-05-10T12:11:08.766127 #663761] INFO -- : [626/885] 705117=test_gem_commands_yank_command I, [2024-05-10T12:11:08.815496 #663761] INFO -- : [627/885] 705107=test_win32ole_param I, [2024-05-10T12:11:08.829013 #663761] INFO -- : [628/885] 705107=test_sockopt I, [2024-05-10T12:11:08.838508 #663761] INFO -- : [629/885] 705107=test_rdoc_markup_to_label I, [2024-05-10T12:11:08.839193 #663761] INFO -- : [630/885] 705120=test_install I, [2024-05-10T12:11:08.875719 #663761] INFO -- : [631/885] 705107=test_rdoc_ri_driver I, [2024-05-10T12:11:09.092469 #663761] INFO -- : [632/885] 705120=test_gem_resolver_local_specification I, [2024-05-10T12:11:09.297824 #663761] INFO -- : [633/885] 705107=test_httpheader I, [2024-05-10T12:11:09.303686 #663761] INFO -- : [634/885] 705117=test_set_len I, [2024-05-10T12:11:09.305676 #663761] INFO -- : [635/885] 705117=test_encoding I, [2024-05-10T12:11:09.316455 #663761] INFO -- : [636/885] 705110=test_httpresponses I, [2024-05-10T12:11:09.331231 #663761] INFO -- : [637/885] 705117=test_key_stroke I, [2024-05-10T12:11:09.355024 #663761] INFO -- : [638/885] 705107=json_encoding_test I, [2024-05-10T12:11:09.369275 #663761] INFO -- : [639/885] 705107=test_color I, [2024-05-10T12:11:09.373994 #663761] INFO -- : [640/885] 705114=test_terminfo I, [2024-05-10T12:11:09.374140 #663761] INFO -- : [641/885] 705114=test_compile_prism I, [2024-05-10T12:11:09.386095 #663761] INFO -- : [642/885] 705120=test_bug-14834 I, [2024-05-10T12:11:09.417202 #663761] INFO -- : [643/885] 705110=test_rdoc_markup_to_html I, [2024-05-10T12:11:09.423951 #663761] INFO -- : [644/885] 705117=test_date_compat I, [2024-05-10T12:11:09.429917 #663761] INFO -- : [645/885] 705117=test_tree_spell_checker I, [2024-05-10T12:11:09.440854 #663761] INFO -- : [646/885] 705107=test_addrinfo I, [2024-05-10T12:11:09.466626 #663761] INFO -- : [647/885] 705112=test_http I, [2024-05-10T12:11:09.470806 #663761] INFO -- : [648/885] 705117=test_win32ole_param_event I, [2024-05-10T12:11:09.475987 #663761] INFO -- : [649/885] 705117=test_bn I, [2024-05-10T12:11:09.478257 #663761] INFO -- : [650/885] 705107=redundant_return_test I, [2024-05-10T12:11:09.478716 #663761] INFO -- : [651/885] 705120=test_case_mapping I, [2024-05-10T12:11:09.496966 #663761] INFO -- : [652/885] 705120=test_path I, [2024-05-10T12:11:09.509007 #663761] INFO -- : [653/885] 705120=test_rdoc_generator_pot I, [2024-05-10T12:11:09.514451 #663761] INFO -- : [654/885] 705117=test_unicode I, [2024-05-10T12:11:09.525049 #663761] INFO -- : [655/885] 705110=test_rdoc_parser_changelog I, [2024-05-10T12:11:09.532621 #663761] INFO -- : [656/885] 705117=test_enumerator I, [2024-05-10T12:11:09.546350 #663761] INFO -- : [657/885] 705117=test_koi8 I, [2024-05-10T12:11:09.555137 #663761] INFO -- : [658/885] 705117=parameters_signature_test I, [2024-05-10T12:11:09.567840 #663761] INFO -- : [659/885] 705117=test_rdoc_method_attr I, [2024-05-10T12:11:09.611168 #663761] INFO -- : [660/885] 705107=static_literals_test I, [2024-05-10T12:11:09.616290 #663761] INFO -- : [661/885] 705110=test_data I, [2024-05-10T12:11:09.618782 #663761] INFO -- : [662/885] 705107=test_filter I, [2024-05-10T12:11:09.622271 #663761] INFO -- : [663/885] 705110=test_gem_gem_runner I, [2024-05-10T12:11:09.649448 #663761] INFO -- : [664/885] 705107=test_gem_resolver_vendor_specification I, [2024-05-10T12:11:09.669435 #663761] INFO -- : [665/885] 705108=test_gem_commands_update_command I, [2024-05-10T12:11:09.670245 #663761] INFO -- : [666/885] 705110=test_notimplement I, [2024-05-10T12:11:09.680110 #663761] INFO -- : [667/885] 705110=test_random I, [2024-05-10T12:11:09.687780 #663761] INFO -- : [668/885] 705110=test_gem_uri I, [2024-05-10T12:11:09.690677 #663761] INFO -- : [669/885] 705107=test_key_event_record I, [2024-05-10T12:11:09.700048 #663761] INFO -- : [670/885] 705107=test_ssl_session I, [2024-05-10T12:11:09.726789 #663761] INFO -- : [671/885] 705110=test_thread_cv I, [2024-05-10T12:11:09.746696 #663761] INFO -- : [672/885] 705120=test_lexer I, [2024-05-10T12:11:09.760166 #663761] INFO -- : [673/885] 705120=test_rdoc_markup_hard_break I, [2024-05-10T12:11:09.763403 #663761] INFO -- : [674/885] 705120=test_gem_package_task I, [2024-05-10T12:11:09.771317 #663761] INFO -- : [675/885] 705114=test_date_strptime I, [2024-05-10T12:11:09.775238 #663761] INFO -- : [676/885] 705120=test_placearg I, [2024-05-10T12:11:09.808907 #663761] INFO -- : [677/885] 705117=test_gem_platform I, [2024-05-10T12:11:09.917513 #663761] INFO -- : [678/885] 705114=test_pkey_rsa I, [2024-05-10T12:11:09.924292 #663761] INFO -- : [679/885] 705117=test_numhash I, [2024-05-10T12:11:09.932498 #663761] INFO -- : [680/885] 705117=test_gem_commands_push_command I, [2024-05-10T12:11:09.941515 #663761] INFO -- : [681/885] 705120=test_weakkeymap I, [2024-05-10T12:11:10.114309 #663761] INFO -- : [682/885] 705120=test_continuation I, [2024-05-10T12:11:10.117899 #663761] INFO -- : [683/885] 705120=test_fd_setsize I, [2024-05-10T12:11:10.118201 #663761] INFO -- : [684/885] 705120=test_keyword I, [2024-05-10T12:11:10.208173 #663761] INFO -- : [685/885] 705114=test_class_name_check I, [2024-05-10T12:11:10.239094 #663761] INFO -- : [686/885] 705114=test_delete I, [2024-05-10T12:11:10.248624 #663761] INFO -- : [687/885] 705114=test_win32ole_method I, [2024-05-10T12:11:10.248995 #663761] INFO -- : [688/885] 705114=test_logger I, [2024-05-10T12:11:10.272608 #663761] INFO -- : [689/885] 705114=test_files_test I, [2024-05-10T12:11:10.386413 #663761] INFO -- : [690/885] 705114=test_gem_update_suggestion I, [2024-05-10T12:11:10.414291 #663761] INFO -- : [691/885] 705110=test_file_exhaustive I, [2024-05-10T12:11:10.493204 #663761] INFO -- : [692/885] 705114=test_rdoc_parser_markdown I, [2024-05-10T12:11:10.538578 #663761] INFO -- : [693/885] 705114=test_import I, [2024-05-10T12:11:10.541656 #663761] INFO -- : [694/885] 705117=test_gem_resolver_lock_set I, [2024-05-10T12:11:10.565555 #663761] INFO -- : [695/885] 705117=test_not I, [2024-05-10T12:11:10.571839 #663761] INFO -- : [696/885] 705117=version_test I, [2024-05-10T12:11:10.573065 #663761] INFO -- : [697/885] 705117=test_cgi_header I, [2024-05-10T12:11:10.588086 #663761] INFO -- : [698/885] 705117=heredoc_dedent_test I, [2024-05-10T12:11:10.592965 #663761] INFO -- : [699/885] 705117=test_object I, [2024-05-10T12:11:10.601346 #663761] INFO -- : [700/885] 705117=test_arithmetic_sequence I, [2024-05-10T12:11:10.625425 #663761] INFO -- : [701/885] 705117=test_key_actor_emacs I, [2024-05-10T12:11:10.660289 #663761] INFO -- : [702/885] 705107=test_gem_command_manager I, [2024-05-10T12:11:10.739888 #663761] INFO -- : [703/885] 705117=test_basicinstructions I, [2024-05-10T12:11:10.824608 #663761] INFO -- : [704/885] 705117=test_gem_gemcutter_utilities I, [2024-05-10T12:11:10.844373 #663761] INFO -- : [705/885] 705107=test_gem_local_remote_options I, [2024-05-10T12:11:10.853454 #663761] INFO -- : [706/885] 705120=test_date_arith I, [2024-05-10T12:11:10.869738 #663761] INFO -- : [707/885] 705120=test_object I, [2024-05-10T12:11:10.910992 #663761] INFO -- : [708/885] 705107=test_ruby_lex I, [2024-05-10T12:11:10.942432 #663761] INFO -- : [709/885] 705111=test_sleep I, [2024-05-10T12:11:10.973839 #663761] INFO -- : [710/885] 705116=test_flip I, [2024-05-10T12:11:11.003870 #663761] INFO -- : [711/885] 705116=compiler_test I, [2024-05-10T12:11:11.031948 #663761] INFO -- : [712/885] 705116=test_change_word I, [2024-05-10T12:11:11.044802 #663761] INFO -- : [713/885] 705116=test_normalize I, [2024-05-10T12:11:11.046978 #663761] INFO -- : [714/885] 705116=test_ossl I, [2024-05-10T12:11:11.073517 #663761] INFO -- : [715/885] 705107=test_timeout I, [2024-05-10T12:11:11.078410 #663761] INFO -- : [716/885] 705107=test_rdoc_rd_block_parser I, [2024-05-10T12:11:11.100910 #663761] INFO -- : [717/885] 705107=test_tsort I, [2024-05-10T12:11:11.109039 #663761] INFO -- : [718/885] 705107=test_signedness I, [2024-05-10T12:11:11.193723 #663761] INFO -- : [719/885] 705108=test_type I, [2024-05-10T12:11:11.201829 #663761] INFO -- : [720/885] 705108=test_ractor I, [2024-05-10T12:11:11.220880 #663761] INFO -- : [721/885] 705106=test_big5 I, [2024-05-10T12:11:11.221869 #663761] INFO -- : [722/885] 705106=test_func I, [2024-05-10T12:11:11.231976 #663761] INFO -- : [723/885] 705117=test_pointer I, [2024-05-10T12:11:11.265275 #663761] INFO -- : [724/885] 705108=test_vm_dump I, [2024-05-10T12:11:11.271841 #663761] INFO -- : [725/885] 705108=test_tmpdir I, [2024-05-10T12:11:11.315210 #663761] INFO -- : [726/885] 705120=test_integer_comb I, [2024-05-10T12:11:11.379901 #663761] INFO -- : [727/885] 705108=test_rdoc_markup_document I, [2024-05-10T12:11:11.401160 #663761] INFO -- : [728/885] 705108=test_regexp I, [2024-05-10T12:11:11.523207 #663761] INFO -- : [729/885] 705113=test_gem_commands_check_command I, [2024-05-10T12:11:11.552120 #663761] INFO -- : [730/885] 705113=errors_test I, [2024-05-10T12:11:11.642935 #663761] INFO -- : [731/885] 705113=static_inspect_test I, [2024-05-10T12:11:11.654994 #663761] INFO -- : [732/885] 705113=test_ostruct I, [2024-05-10T12:11:11.827163 #663761] INFO -- : [733/885] 705113=unescape_test I, [2024-05-10T12:11:12.050113 #663761] INFO -- : [734/885] 705115=test_force_exit I, [2024-05-10T12:11:12.075050 #663761] INFO -- : [735/885] 705115=test_file I, [2024-05-10T12:11:12.078042 #663761] INFO -- : [736/885] 705114=test_data_error I, [2024-05-10T12:11:12.143134 #663761] INFO -- : [737/885] 705117=bom_test I, [2024-05-10T12:11:12.147465 #663761] INFO -- : [738/885] 705114=test_udp I, [2024-05-10T12:11:12.149523 #663761] INFO -- : [739/885] 705117=test_dup I, [2024-05-10T12:11:12.185014 #663761] INFO -- : [740/885] 705114=test_pty I, [2024-05-10T12:11:12.324989 #663761] INFO -- : [741/885] 705117=test_constant I, [2024-05-10T12:11:12.672920 #663761] INFO -- : [742/885] 705114=command_line_test I, [2024-05-10T12:11:12.689423 #663761] INFO -- : [743/885] 705114=test_range I, [2024-05-10T12:11:13.005022 #663761] INFO -- : [744/885] 705106=test_project_sanity I, [2024-05-10T12:11:13.052581 #663761] INFO -- : [745/885] 705106=test_gem_uri_formatter I, [2024-05-10T12:11:13.072533 #663761] INFO -- : [746/885] 705106=test_encoding I, [2024-05-10T12:11:13.282801 #663761] INFO -- : [747/885] 705106=test_erb_command I, [2024-05-10T12:11:13.317652 #663761] INFO -- : [748/885] 705106=test_helper I, [2024-05-10T12:11:13.328244 #663761] INFO -- : [749/885] 705106=test_ts I, [2024-05-10T12:11:13.394848 #663761] INFO -- : [750/885] 705113=library_symbols_test I, [2024-05-10T12:11:13.398332 #663761] INFO -- : [751/885] 705113=test_addr I, [2024-05-10T12:11:13.409742 #663761] INFO -- : [752/885] 705113=test_locale I, [2024-05-10T12:11:13.487432 #663761] INFO -- : [753/885] 705113=test_ensured I, [2024-05-10T12:11:13.489939 #663761] INFO -- : [754/885] 705107=test_rdoc_ri_paths I, [2024-05-10T12:11:13.528468 #663761] INFO -- : [755/885] 705113=test_gem_safe_marshal I, [2024-05-10T12:11:13.554175 #663761] INFO -- : [756/885] 705107=test_gem_resolver_api_set I, [2024-05-10T12:11:13.622220 #663761] INFO -- : [757/885] 705107=test_gem_resolver_vendor_set I, [2024-05-10T12:11:13.643387 #663761] INFO -- : [758/885] 705107=test_config I, [2024-05-10T12:11:13.725231 #663761] INFO -- : [759/885] 705114=test_enumerable I, [2024-05-10T12:11:13.730224 #663761] INFO -- : [760/885] 705114=test_eval I, [2024-05-10T12:11:13.884706 #663761] INFO -- : [761/885] 705106=json_generator_test I, [2024-05-10T12:11:13.913692 #663761] INFO -- : [762/885] 705118=test_transcode I, [2024-05-10T12:11:13.959244 #663761] INFO -- : [763/885] 705114=test_fips I, [2024-05-10T12:11:14.005373 #663761] INFO -- : [764/885] 705106=test_x509name I, [2024-05-10T12:11:14.024018 #663761] INFO -- : [765/885] 705106=test_update I, [2024-05-10T12:11:14.030068 #663761] INFO -- : [766/885] 705106=test_rdoc_code_object I, [2024-05-10T12:11:14.063063 #663761] INFO -- : [767/885] 705119=test_x509store I, [2024-05-10T12:11:14.110831 #663761] INFO -- : [768/885] 705118=test_webauthn_listener I, [2024-05-10T12:11:14.115876 #663761] INFO -- : [769/885] 705107=test_lambda I, [2024-05-10T12:11:14.172469 #663761] INFO -- : [770/885] 705118=test_ast I, [2024-05-10T12:11:14.198981 #663761] INFO -- : [771/885] 705107=test_gem_request_set_gem_dependency_api I, [2024-05-10T12:11:14.204169 #663761] INFO -- : [772/885] 705120=test_jaro_winkler I, [2024-05-10T12:11:14.208627 #663761] INFO -- : [773/885] 705120=test_random_formatter I, [2024-05-10T12:11:14.223971 #663761] INFO -- : [774/885] 705120=test_helper I, [2024-05-10T12:11:14.253670 #663761] INFO -- : [775/885] 705113=test_rubyoptions I, [2024-05-10T12:11:14.264373 #663761] INFO -- : [776/885] 705114=test_super I, [2024-05-10T12:11:14.301837 #663761] INFO -- : [777/885] 705120=test_integer I, [2024-05-10T12:11:14.329004 #663761] INFO -- : [778/885] 705119=test_cgi_modruby I, [2024-05-10T12:11:14.333484 #663761] INFO -- : [779/885] 705119=test_rubygems I, [2024-05-10T12:11:14.488727 #663761] INFO -- : [780/885] 705119=test_call I, [2024-05-10T12:11:14.566050 #663761] INFO -- : [781/885] 705107=test_https_proxy I, [2024-05-10T12:11:14.573655 #663761] INFO -- : [782/885] 705107=test_have_func I, [2024-05-10T12:11:14.664485 #663761] INFO -- : [783/885] 705119=test_gem_request_set_lockfile_tokenizer I, [2024-05-10T12:11:14.675881 #663761] INFO -- : [784/885] 705106=test_stat I, [2024-05-10T12:11:14.680005 #663761] INFO -- : [785/885] 705106=test_capacity I, [2024-05-10T12:11:14.683816 #663761] INFO -- : [786/885] 705106=test_nextafter I, [2024-05-10T12:11:14.772232 #663761] INFO -- : [787/885] 705119=test_usrmarshal I, [2024-05-10T12:11:14.785068 #663761] INFO -- : [788/885] 705106=test_object_references I, [2024-05-10T12:11:14.812332 #663761] INFO -- : [789/885] 705106=test_gem_resolver_git_specification I, [2024-05-10T12:11:14.844737 #663761] INFO -- : [790/885] 705109=test_env I, [2024-05-10T12:11:14.942518 #663761] INFO -- : [791/885] 705117=test_rdoc_attr I, [2024-05-10T12:11:14.960611 #663761] INFO -- : [792/885] 705117=test_dryrun I, [2024-05-10T12:11:14.987439 #663761] INFO -- : [793/885] 705117=test_integer I, [2024-05-10T12:11:15.060768 #663761] INFO -- : [794/885] 705117=desugar_compiler_test I, [2024-05-10T12:11:15.080115 #663761] INFO -- : [795/885] 705117=test_gem_commands_setup_command I, [2024-05-10T12:11:15.080713 #663761] INFO -- : [796/885] 705119=test_cgi_core I, [2024-05-10T12:11:15.083453 #663761] INFO -- : [797/885] 705106=test_parser I, [2024-05-10T12:11:15.094289 #663761] INFO -- : [798/885] 705119=test_registry I, [2024-05-10T12:11:15.095846 #663761] INFO -- : [799/885] 705119=parse_stream_test I, [2024-05-10T12:11:15.098390 #663761] INFO -- : [800/885] 705106=test_gem I, [2024-05-10T12:11:15.107408 #663761] INFO -- : [801/885] 705119=test_gem_source_lock I, [2024-05-10T12:11:15.148048 #663761] INFO -- : [802/885] 705119=test_ractor I, [2024-05-10T12:11:15.162713 #663761] INFO -- : [803/885] 705119=test_dns I, [2024-05-10T12:11:15.243528 #663761] INFO -- : [804/885] 705114=test_gem_commands_open_command I, [2024-05-10T12:11:15.369077 #663761] INFO -- : [805/885] 705114=test_ssl I, [2024-05-10T12:11:15.628845 #663761] INFO -- : [806/885] 705119=test_rendering I, [2024-05-10T12:11:15.647403 #663761] INFO -- : [807/885] 705119=test_debugger_integration I, [2024-05-10T12:11:15.662304 #663761] INFO -- : [808/885] 705119=test_my_integer I, [2024-05-10T12:11:15.682583 #663761] INFO -- : [809/885] 705119=test_thread I, [2024-05-10T12:11:15.759965 #663761] INFO -- : [810/885] 705117=json_ext_parser_test I, [2024-05-10T12:11:15.770759 #663761] INFO -- : [811/885] 705117=test_ractor I, [2024-05-10T12:11:15.827476 #663761] INFO -- : [812/885] 705114=test_timeout I, [2024-05-10T12:11:15.975266 #663761] INFO -- : [813/885] 705111=test_alias I, [2024-05-10T12:11:16.174384 #663761] INFO -- : [814/885] 705111=test_nonblock I, [2024-05-10T12:11:16.175021 #663761] INFO -- : [815/885] 705117=test_weakref I, [2024-05-10T12:11:16.190693 #663761] INFO -- : [816/885] 705111=test_marshal I, [2024-05-10T12:11:16.271869 #663761] INFO -- : [817/885] 705107=test_unicode_normalize I, [2024-05-10T12:11:16.395326 #663761] INFO -- : [818/885] 705117=test_reline_key I, [2024-05-10T12:11:16.399087 #663761] INFO -- : [819/885] 705117=test_rb_str_dup I, [2024-05-10T12:11:16.402041 #663761] INFO -- : [820/885] 705117=test_singleton_function I, [2024-05-10T12:11:16.405943 #663761] INFO -- : [821/885] 705117=test_ancdata I, [2024-05-10T12:11:16.434234 #663761] INFO -- : [822/885] 705117=test_rdoc_class_module I, [2024-05-10T12:11:16.808822 #663761] INFO -- : [823/885] 705114=test_bignum I, [2024-05-10T12:11:16.899483 #663761] INFO -- : [824/885] 705111=test_gem_ci_detector I, [2024-05-10T12:11:16.911818 #663761] INFO -- : [825/885] 705111=test_stringio I, [2024-05-10T12:11:16.962333 #663761] INFO -- : [826/885] 705114=test_arity I, [2024-05-10T12:11:16.969891 #663761] INFO -- : [827/885] 705114=test_io_wait_uncommon I, [2024-05-10T12:11:16.975904 #663761] INFO -- : [828/885] 705114=test_win32ole_variable I, [2024-05-10T12:11:16.979803 #663761] INFO -- : [829/885] 705114=test_trace I, [2024-05-10T12:11:17.004097 #663761] INFO -- : [830/885] 705114=ractor_test I, [2024-05-10T12:11:17.076648 #663761] INFO -- : [831/885] 705111=test_win32ole_event I, [2024-05-10T12:11:17.084550 #663761] INFO -- : [832/885] 705111=test_time_tz I, [2024-05-10T12:11:17.109456 #663761] INFO -- : [833/885] 705114=test_rdoc_generator_json_index I, [2024-05-10T12:11:17.147651 #663761] INFO -- : [834/885] 705114=test_gem_package I, [2024-05-10T12:11:17.160551 #663761] INFO -- : [835/885] 705111=test_complex2 I, [2024-05-10T12:11:17.167288 #663761] INFO -- : [836/885] 705117=test_resolve_symbol I, [2024-05-10T12:11:17.180816 #663761] INFO -- : [837/885] 705111=test_have_macro I, [2024-05-10T12:11:17.237897 #663761] INFO -- : [838/885] 705117=test_enum I, [2024-05-10T12:11:17.340959 #663761] INFO -- : [839/885] 705106=test_gem_specification I, [2024-05-10T12:11:17.651612 #663761] INFO -- : [840/885] 705111=test_threadgroup I, [2024-05-10T12:11:17.892217 #663761] INFO -- : [841/885] 705120=test_rdoc_extend I, [2024-05-10T12:11:17.951433 #663761] INFO -- : [842/885] 705110=test_merge_keys I, [2024-05-10T12:11:17.961568 #663761] INFO -- : [843/885] 705120=test_gem_resolver_api_specification I, [2024-05-10T12:11:17.964713 #663761] INFO -- : [844/885] 705110=test_win32ole_variant I, [2024-05-10T12:11:17.973929 #663761] INFO -- : [845/885] 705110=test_mixed_unicode_escapes I, [2024-05-10T12:11:17.979102 #663761] INFO -- : [846/885] 705110=test_history I, [2024-05-10T12:11:18.018678 #663761] INFO -- : [847/885] 705120=test_rdoc_markup_to_ansi I, [2024-05-10T12:11:18.032982 #663761] INFO -- : [848/885] 705114=test_ipaddr I, [2024-05-10T12:11:18.062169 #663761] INFO -- : [849/885] 705110=test_gem_console_ui I, [2024-05-10T12:11:18.067387 #663761] INFO -- : [850/885] 705120=test_date_ractor I, [2024-05-10T12:11:18.072405 #663761] INFO -- : [851/885] 705114=format_errors_test I, [2024-05-10T12:11:18.072974 #663761] INFO -- : [852/885] 705110=test_dir I, [2024-05-10T12:11:18.078780 #663761] INFO -- : [853/885] 705114=test_eval I, [2024-05-10T12:11:18.081578 #663761] INFO -- : [854/885] 705114=test_autoconf I, [2024-05-10T12:11:18.095589 #663761] INFO -- : [855/885] 705114=test_ractor_compatibility I, [2024-05-10T12:11:18.127668 #663761] INFO -- : [856/885] 705109=test_member I, [2024-05-10T12:11:18.130146 #663761] INFO -- : [857/885] 705109=test_numeric I, [2024-05-10T12:11:18.140408 #663761] INFO -- : [858/885] 705109=test_cgi_multipart I, [2024-05-10T12:11:18.154710 #663761] INFO -- : [859/885] 705115=test_gem_commands_cleanup_command I, [2024-05-10T12:11:18.359491 #663761] INFO -- : [860/885] 705109=test_word I, [2024-05-10T12:11:18.367052 #663761] INFO -- : [861/885] 705109=test_rdoc_comment I, [2024-05-10T12:11:18.401376 #663761] INFO -- : [862/885] 705120=test_error_highlight I, [2024-05-10T12:11:18.403929 #663761] INFO -- : [863/885] 705117=test_resize I, [2024-05-10T12:11:18.427308 #663761] INFO -- : [864/885] 705109=test_rdoc_generator_darkfish I, [2024-05-10T12:11:18.433862 #663761] INFO -- : [865/885] 705116=test_http_request I, [2024-05-10T12:11:18.448332 #663761] INFO -- : [866/885] 705117=json_generic_object_test I, [2024-05-10T12:11:18.450630 #663761] INFO -- : [867/885] 705110=test_gem_source_fetch_problem I, [2024-05-10T12:11:18.456572 #663761] INFO -- : [868/885] 705117=location_test I, [2024-05-10T12:11:18.466625 #663761] INFO -- : [869/885] 705110=test_symbol I, [2024-05-10T12:11:18.473562 #663761] INFO -- : [870/885] 705110=test_coderange I, [2024-05-10T12:11:18.480345 #663761] INFO -- : [871/885] 705110=test_mailto I, [2024-05-10T12:11:18.490694 #663761] INFO -- : [872/885] 705110=test_pkcs7 I, [2024-05-10T12:11:18.493802 #663761] INFO -- : [873/885] 705116=test_arith_seq_beg_len_step I, [2024-05-10T12:11:18.517786 #663761] INFO -- : [874/885] 705117=test_gem_resolver_requirement_list I, [2024-05-10T12:11:18.526035 #663761] INFO -- : [875/885] 705117=test_function_entry I, [2024-05-10T12:11:18.526974 #663761] INFO -- : [876/885] 705117=test_find_executable I, [2024-05-10T12:11:18.534131 #663761] INFO -- : [877/885] 705117=ruby_api_test I, [2024-05-10T12:11:18.591911 #663761] INFO -- : [878/885] 705116=test_context I, [2024-05-10T12:11:18.606794 #663761] INFO -- : [879/885] 705114=test_gem_commands_pristine_command I, [2024-05-10T12:11:18.655367 #663761] INFO -- : [880/885] 705111=test_nofree I, [2024-05-10T12:11:18.657231 #663761] INFO -- : [881/885] 705111=test_coder I, [2024-05-10T12:11:18.671794 #663761] INFO -- : [882/885] 705110=test_symbol I, [2024-05-10T12:11:18.677769 #663761] INFO -- : [883/885] 705111=test_unix I, [2024-05-10T12:11:18.706111 #663761] INFO -- : [884/885] 705117=test_enc_associate I, [2024-05-10T12:11:18.732618 #663761] INFO -- : [885/885] 705111=test_lazy_enumerator I, [2024-05-10T12:11:43.525574 #663761] INFO -- : Finished tests in 56.990593s, 464.6030 tests/s, 164174.4110 assertions/s. E, [2024-05-10T12:11:43.525724 #663761] ERROR -- : Children under /tmp/rubytest.0jfjaz: E, [2024-05-10T12:11:43.525861 #663761] ERROR -- : * drwx------ 4 80 2024-05-10 12:11:03 +0000 gem_rebuild20240510-705115-s6ty7z/ E, [2024-05-10T12:11:43.525881 #663761] ERROR -- : * drwxrwxr-x 2 60 2024-05-10 12:11:03 +0000 new/ E, [2024-05-10T12:11:43.525900 #663761] ERROR -- : * -rw-rw-r-- 1 4096 2024-05-10 12:11:03 +0000 rebuild_test_gem-1.0.0.gem E, [2024-05-10T12:11:43.525964 #663761] ERROR -- : * drwxrwxr-x 2 60 2024-05-10 12:11:03 +0000 old/ E, [2024-05-10T12:11:43.525984 #663761] ERROR -- : * -rw-rw-r-- 1 4096 2024-05-10 12:11:03 +0000 rebuild_test_gem-1.0.0.gem E, [2024-05-10T12:11:43.525995 #663761] ERROR -- : * drwx------ 2 40 2024-05-10 12:11:00 +0000 d20240510-705108-tc986q/ E, [2024-05-10T12:11:43.526004 #663761] ERROR -- : * drwx------ 2 40 2024-05-10 12:11:00 +0000 d20240510-705108-dc5kwr/ E, [2024-05-10T12:11:43.526038 #663761] ERROR -- : * drwx------ 2 40 2024-05-10 12:11:00 +0000 d20240510-705108-pzcwtj/ E, [2024-05-10T12:11:43.526048 #663761] ERROR -- : * drwx------ 2 40 2024-05-10 12:11:00 +0000 d20240510-705108-n4lcjs/ E, [2024-05-10T12:11:43.526083 #663761] ERROR -- : * drwx------ 2 40 2024-05-10 12:11:00 +0000 d20240510-705108-1w64og/ I, [2024-05-10T12:11:43.527314 #663761] INFO -- : 26478 tests, 9356397 assertions, 0 failures, 0 errors, 312 skips I, [2024-05-10T12:11:43.527341 #663761] INFO -- : I, [2024-05-10T12:11:43.527354 #663761] INFO -- : ruby -v: ruby 3.4.0dev (2024-05-10T11:40:58Z master c68bb24088) [x86_64-linux] I, [2024-05-10T12:11:43.532289 #663761] INFO -- : $$$[end] "make yes-test-all TESTOPTS='--stderr-on-failure' TESTS='-j16'" exit with 0. I, [2024-05-10T12:11:43.532619 #663761] INFO -- : $$$[beg] make yes-test-rubyspec MSPECOPT='--error-output stderr --debug -j' TESTS='-j16' I, [2024-05-10T12:11:43.707855 #663761] INFO -- : BASERUBY = /usr/bin/ruby --disable=gems I, [2024-05-10T12:11:43.707911 #663761] INFO -- : CC = gcc I, [2024-05-10T12:11:43.707924 #663761] INFO -- : LD = ld I, [2024-05-10T12:11:43.707932 #663761] INFO -- : LDSHARED = gcc -shared I, [2024-05-10T12:11:43.707949 #663761] INFO -- : CFLAGS = -O3 -fno-fast-math -ggdb3 -Wall -Wextra -Wdeprecated-declarations -Wdiv-by-zero -Wduplicated-cond -Wimplicit-function-declaration -Wimplicit-int -Wpointer-arith -Wwrite-strings -Wold-style-definition -Wimplicit-fallthrough=0 -Wmissing-noreturn -Wno-cast-function-type -Wno-constant-logical-operand -Wno-long-long -Wno-missing-field-initializers -Wno-overlength-strings -Wno-packed-bitfield-compat -Wno-parentheses-equality -Wno-self-assign -Wno-tautological-compare -Wno-unused-parameter -Wno-unused-value -Wsuggest-attribute=format -Wsuggest-attribute=noreturn -Wunused-variable -Wmisleading-indentation -Wundef -fPIC I, [2024-05-10T12:11:43.707967 #663761] INFO -- : XCFLAGS = -U_FORTIFY_SOURCE -D_FORTIFY_SOURCE=2 -fstack-protector-strong -fno-strict-overflow -fvisibility=hidden -fexcess-precision=standard -DRUBY_EXPORT -I. -I.ext/include/x86_64-linux -I/tmp/ruby/src/trunk/include -I/tmp/ruby/src/trunk -I/tmp/ruby/src/trunk/prism -I/tmp/ruby/src/trunk/enc/unicode/15.0.0 I, [2024-05-10T12:11:43.707976 #663761] INFO -- : CPPFLAGS = I, [2024-05-10T12:11:43.707983 #663761] INFO -- : DLDFLAGS = -Wl,--compress-debug-sections=zlib -Wl,-soname,libruby.so.3.4 -fstack-protector-strong I, [2024-05-10T12:11:43.707991 #663761] INFO -- : SOLIBS = -lz -lrt -lrt -lgmp -ldl -lcrypt -lm -lpthread I, [2024-05-10T12:11:43.707998 #663761] INFO -- : LANG = C.UTF-8 I, [2024-05-10T12:11:43.708005 #663761] INFO -- : LC_ALL = I, [2024-05-10T12:11:43.708012 #663761] INFO -- : LC_CTYPE = I, [2024-05-10T12:11:43.708020 #663761] INFO -- : MFLAGS = I, [2024-05-10T12:11:43.708027 #663761] INFO -- : RUSTC = rustc I, [2024-05-10T12:11:43.708035 #663761] INFO -- : YJIT_RUSTC_ARGS = --crate-name=yjit --crate-type=staticlib --edition=2021 -g -C lto=thin -C opt-level=3 -C overflow-checks=on '--out-dir=/tmp/ruby/build/trunk/yjit/target/release/' /tmp/ruby/src/trunk/yjit/src/lib.rs I, [2024-05-10T12:11:43.708495 #663761] INFO -- : gcc (Ubuntu 11.4.0-1ubuntu1~22.04) 11.4.0 I, [2024-05-10T12:11:43.708517 #663761] INFO -- : Copyright (C) 2021 Free Software Foundation, Inc. I, [2024-05-10T12:11:43.708540 #663761] INFO -- : This is free software; see the source for copying conditions. There is NO I, [2024-05-10T12:11:43.708550 #663761] INFO -- : warranty; not even for MERCHANTABILITY or FITNESS FOR A PARTICULAR PURPOSE. I, [2024-05-10T12:11:43.708558 #663761] INFO -- : I, [2024-05-10T12:11:43.710453 #663761] INFO -- : generating enc.mk I, [2024-05-10T12:11:43.863456 #663761] INFO -- : making enc I, [2024-05-10T12:11:43.916187 #663761] INFO -- : make[1]: Entering directory '/tmp/ruby/build/trunk' I, [2024-05-10T12:11:43.916212 #663761] INFO -- : make[1]: Nothing to be done for 'enc'. I, [2024-05-10T12:11:43.916223 #663761] INFO -- : make[1]: Leaving directory '/tmp/ruby/build/trunk' I, [2024-05-10T12:11:43.916809 #663761] INFO -- : making srcs under enc I, [2024-05-10T12:11:43.945863 #663761] INFO -- : make[1]: Entering directory '/tmp/ruby/build/trunk' I, [2024-05-10T12:11:43.945893 #663761] INFO -- : make[1]: Nothing to be done for 'srcs'. I, [2024-05-10T12:11:43.945904 #663761] INFO -- : make[1]: Leaving directory '/tmp/ruby/build/trunk' I, [2024-05-10T12:11:43.946741 #663761] INFO -- : generating transdb.h I, [2024-05-10T12:11:44.046402 #663761] INFO -- : transdb.h unchanged I, [2024-05-10T12:11:44.047640 #663761] INFO -- : making trans I, [2024-05-10T12:11:44.082164 #663761] INFO -- : make[1]: Entering directory '/tmp/ruby/build/trunk' I, [2024-05-10T12:11:44.082195 #663761] INFO -- : make[1]: Nothing to be done for 'trans'. I, [2024-05-10T12:11:44.082207 #663761] INFO -- : make[1]: Leaving directory '/tmp/ruby/build/trunk' I, [2024-05-10T12:11:44.082701 #663761] INFO -- : making encs I, [2024-05-10T12:11:44.119861 #663761] INFO -- : make[1]: Entering directory '/tmp/ruby/build/trunk' I, [2024-05-10T12:11:44.119884 #663761] INFO -- : make[1]: Nothing to be done for 'encs'. I, [2024-05-10T12:11:44.119895 #663761] INFO -- : make[1]: Leaving directory '/tmp/ruby/build/trunk' I, [2024-05-10T12:11:44.122648 #663761] INFO -- : generating makefiles ext/configure-ext.mk I, [2024-05-10T12:11:44.149973 #663761] INFO -- : ext/configure-ext.mk updated I, [2024-05-10T12:11:44.152566 #663761] INFO -- : make[1]: Entering directory '/tmp/ruby/build/trunk' I, [2024-05-10T12:11:45.577005 #663761] INFO -- : make[1]: Leaving directory '/tmp/ruby/build/trunk' I, [2024-05-10T12:11:45.577706 #663761] INFO -- : generating makefile exts.mk I, [2024-05-10T12:11:45.618966 #663761] INFO -- : exts.mk unchanged I, [2024-05-10T12:11:45.623348 #663761] INFO -- : make[1]: Entering directory '/tmp/ruby/build/trunk' I, [2024-05-10T12:11:45.847646 #663761] INFO -- : make[2]: Entering directory '/tmp/ruby/build/trunk/ext/coverage' I, [2024-05-10T12:11:45.853330 #663761] INFO -- : make[2]: Leaving directory '/tmp/ruby/build/trunk/ext/coverage' I, [2024-05-10T12:11:45.857393 #663761] INFO -- : make[2]: Entering directory '/tmp/ruby/build/trunk/ext/date' I, [2024-05-10T12:11:45.863091 #663761] INFO -- : make[2]: Leaving directory '/tmp/ruby/build/trunk/ext/date' I, [2024-05-10T12:11:45.865872 #663761] INFO -- : make[2]: Entering directory '/tmp/ruby/build/trunk/ext/digest' I, [2024-05-10T12:11:45.871286 #663761] INFO -- : make[2]: Leaving directory '/tmp/ruby/build/trunk/ext/digest' I, [2024-05-10T12:11:45.891676 #663761] INFO -- : make[2]: Entering directory '/tmp/ruby/build/trunk/ext/digest/sha2' I, [2024-05-10T12:11:45.897916 #663761] INFO -- : make[2]: Leaving directory '/tmp/ruby/build/trunk/ext/digest/sha2' I, [2024-05-10T12:11:45.918845 #663761] INFO -- : make[2]: Entering directory '/tmp/ruby/build/trunk/ext/fiddle' I, [2024-05-10T12:11:45.938811 #663761] INFO -- : make[2]: Leaving directory '/tmp/ruby/build/trunk/ext/fiddle' I, [2024-05-10T12:11:45.942730 #663761] INFO -- : make[2]: Entering directory '/tmp/ruby/build/trunk/ext/io/console' I, [2024-05-10T12:11:45.945738 #663761] INFO -- : make[2]: Leaving directory '/tmp/ruby/build/trunk/ext/io/console' I, [2024-05-10T12:11:45.958414 #663761] INFO -- : make[2]: Entering directory '/tmp/ruby/build/trunk/ext/json' I, [2024-05-10T12:11:45.970661 #663761] INFO -- : make[2]: Leaving directory '/tmp/ruby/build/trunk/ext/json' I, [2024-05-10T12:11:45.982572 #663761] INFO -- : make[2]: Entering directory '/tmp/ruby/build/trunk/ext/monitor' I, [2024-05-10T12:11:45.986654 #663761] INFO -- : make[2]: Leaving directory '/tmp/ruby/build/trunk/ext/monitor' I, [2024-05-10T12:11:45.991381 #663761] INFO -- : make[2]: Entering directory '/tmp/ruby/build/trunk/ext/objspace' I, [2024-05-10T12:11:45.998874 #663761] INFO -- : make[2]: Leaving directory '/tmp/ruby/build/trunk/ext/objspace' I, [2024-05-10T12:11:46.010457 #663761] INFO -- : make[2]: Entering directory '/tmp/ruby/build/trunk/ext/openssl' I, [2024-05-10T12:11:46.023044 #663761] INFO -- : make[2]: Leaving directory '/tmp/ruby/build/trunk/ext/openssl' I, [2024-05-10T12:11:46.026051 #663761] INFO -- : make[2]: Entering directory '/tmp/ruby/build/trunk/ext/pathname' I, [2024-05-10T12:11:46.029095 #663761] INFO -- : make[2]: Leaving directory '/tmp/ruby/build/trunk/ext/pathname' I, [2024-05-10T12:11:46.033948 #663761] INFO -- : make[2]: Entering directory '/tmp/ruby/build/trunk/ext/psych' I, [2024-05-10T12:11:46.067011 #663761] INFO -- : make[2]: Leaving directory '/tmp/ruby/build/trunk/ext/psych' I, [2024-05-10T12:11:46.070113 #663761] INFO -- : make[2]: Entering directory '/tmp/ruby/build/trunk/ext/pty' I, [2024-05-10T12:11:46.072506 #663761] INFO -- : make[2]: Leaving directory '/tmp/ruby/build/trunk/ext/pty' I, [2024-05-10T12:11:46.081998 #663761] INFO -- : make[2]: Entering directory '/tmp/ruby/build/trunk/ext/ripper' I, [2024-05-10T12:11:46.087586 #663761] INFO -- : make[2]: Leaving directory '/tmp/ruby/build/trunk/ext/ripper' I, [2024-05-10T12:11:46.089108 #663761] INFO -- : make[2]: Entering directory '/tmp/ruby/build/trunk/ext/rubyvm' I, [2024-05-10T12:11:46.091056 #663761] INFO -- : make[2]: Leaving directory '/tmp/ruby/build/trunk/ext/rubyvm' I, [2024-05-10T12:11:46.116206 #663761] INFO -- : make[2]: Entering directory '/tmp/ruby/build/trunk/ext/socket' I, [2024-05-10T12:11:46.136025 #663761] INFO -- : make[2]: Leaving directory '/tmp/ruby/build/trunk/ext/socket' I, [2024-05-10T12:11:46.147296 #663761] INFO -- : make[2]: Entering directory '/tmp/ruby/build/trunk/.bundle/gems/bigdecimal-3.1.8/ext/bigdecimal' I, [2024-05-10T12:11:46.170261 #663761] INFO -- : make[2]: Leaving directory '/tmp/ruby/build/trunk/.bundle/gems/bigdecimal-3.1.8/ext/bigdecimal' I, [2024-05-10T12:11:46.172914 #663761] INFO -- : make[2]: Entering directory '/tmp/ruby/build/trunk/.bundle/gems/debug-1.9.2/ext/debug' I, [2024-05-10T12:11:46.195103 #663761] INFO -- : make[2]: Leaving directory '/tmp/ruby/build/trunk/.bundle/gems/debug-1.9.2/ext/debug' I, [2024-05-10T12:11:46.198374 #663761] INFO -- : make[2]: Entering directory '/tmp/ruby/build/trunk/.bundle/gems/nkf-0.2.0/ext/nkf' I, [2024-05-10T12:11:46.221259 #663761] INFO -- : make[2]: Leaving directory '/tmp/ruby/build/trunk/.bundle/gems/nkf-0.2.0/ext/nkf' I, [2024-05-10T12:11:46.224073 #663761] INFO -- : make[2]: Entering directory '/tmp/ruby/build/trunk/.bundle/gems/racc-1.7.3/ext/racc/cparse' I, [2024-05-10T12:11:46.246370 #663761] INFO -- : make[2]: Leaving directory '/tmp/ruby/build/trunk/.bundle/gems/racc-1.7.3/ext/racc/cparse' I, [2024-05-10T12:11:46.251398 #663761] INFO -- : make[2]: Entering directory '/tmp/ruby/build/trunk/.bundle/gems/rbs-3.4.4/ext/rbs_extension' I, [2024-05-10T12:11:46.274449 #663761] INFO -- : make[2]: Leaving directory '/tmp/ruby/build/trunk/.bundle/gems/rbs-3.4.4/ext/rbs_extension' I, [2024-05-10T12:11:46.277096 #663761] INFO -- : make[2]: Entering directory '/tmp/ruby/build/trunk/.bundle/gems/syslog-0.1.2/ext/syslog' I, [2024-05-10T12:11:46.299625 #663761] INFO -- : make[2]: Leaving directory '/tmp/ruby/build/trunk/.bundle/gems/syslog-0.1.2/ext/syslog' I, [2024-05-10T12:11:46.357092 #663761] INFO -- : make[2]: Entering directory '/tmp/ruby/build/trunk' I, [2024-05-10T12:11:46.432106 #663761] INFO -- : make[2]: 'ruby' is up to date. I, [2024-05-10T12:11:46.432150 #663761] INFO -- : make[2]: Leaving directory '/tmp/ruby/build/trunk' I, [2024-05-10T12:11:46.432365 #663761] INFO -- : make[1]: Leaving directory '/tmp/ruby/build/trunk' I, [2024-05-10T12:11:46.435639 #663761] INFO -- : make[1]: Entering directory '/tmp/ruby/build/trunk' I, [2024-05-10T12:11:46.435661 #663761] INFO -- : make[1]: Nothing to be done for 'note'. I, [2024-05-10T12:11:46.435678 #663761] INFO -- : make[1]: Leaving directory '/tmp/ruby/build/trunk' E, [2024-05-10T12:11:46.502019 #663761] ERROR -- : $ /tmp/ruby/build/trunk/miniruby -I/tmp/ruby/src/trunk/lib /tmp/ruby/src/trunk/tool/runruby.rb --archdir=/tmp/ruby/build/trunk --extout=.ext -- /tmp/ruby/src/trunk/spec/mspec/bin/mspec-run -B /tmp/ruby/src/trunk/spec/default.mspec --error-output stderr --debug -fy -o /tmp/rubytest.ssbz1e/1-mspec-multi-0 E, [2024-05-10T12:11:46.502101 #663761] ERROR -- : $ /tmp/ruby/build/trunk/miniruby -I/tmp/ruby/src/trunk/lib /tmp/ruby/src/trunk/tool/runruby.rb --archdir=/tmp/ruby/build/trunk --extout=.ext -- /tmp/ruby/src/trunk/spec/mspec/bin/mspec-run -B /tmp/ruby/src/trunk/spec/default.mspec --error-output stderr --debug -fy -o /tmp/rubytest.ssbz1e/2-mspec-multi-1 E, [2024-05-10T12:11:46.502300 #663761] ERROR -- : $ /tmp/ruby/build/trunk/miniruby -I/tmp/ruby/src/trunk/lib /tmp/ruby/src/trunk/tool/runruby.rb --archdir=/tmp/ruby/build/trunk --extout=.ext -- /tmp/ruby/src/trunk/spec/mspec/bin/mspec-run -B /tmp/ruby/src/trunk/spec/default.mspec --error-output stderr --debug -fy -o /tmp/rubytest.ssbz1e/3-mspec-multi-2 E, [2024-05-10T12:11:46.502467 #663761] ERROR -- : $ /tmp/ruby/build/trunk/miniruby -I/tmp/ruby/src/trunk/lib /tmp/ruby/src/trunk/tool/runruby.rb --archdir=/tmp/ruby/build/trunk --extout=.ext -- /tmp/ruby/src/trunk/spec/mspec/bin/mspec-run -B /tmp/ruby/src/trunk/spec/default.mspec --error-output stderr --debug -fy -o /tmp/rubytest.ssbz1e/4-mspec-multi-3 E, [2024-05-10T12:11:46.502635 #663761] ERROR -- : $ /tmp/ruby/build/trunk/miniruby -I/tmp/ruby/src/trunk/lib /tmp/ruby/src/trunk/tool/runruby.rb --archdir=/tmp/ruby/build/trunk --extout=.ext -- /tmp/ruby/src/trunk/spec/mspec/bin/mspec-run -B /tmp/ruby/src/trunk/spec/default.mspec --error-output stderr --debug -fy -o /tmp/rubytest.ssbz1e/5-mspec-multi-4 E, [2024-05-10T12:11:46.502813 #663761] ERROR -- : $ /tmp/ruby/build/trunk/miniruby -I/tmp/ruby/src/trunk/lib /tmp/ruby/src/trunk/tool/runruby.rb --archdir=/tmp/ruby/build/trunk --extout=.ext -- /tmp/ruby/src/trunk/spec/mspec/bin/mspec-run -B /tmp/ruby/src/trunk/spec/default.mspec --error-output stderr --debug -fy -o /tmp/rubytest.ssbz1e/6-mspec-multi-5 E, [2024-05-10T12:11:46.502999 #663761] ERROR -- : $ /tmp/ruby/build/trunk/miniruby -I/tmp/ruby/src/trunk/lib /tmp/ruby/src/trunk/tool/runruby.rb --archdir=/tmp/ruby/build/trunk --extout=.ext -- /tmp/ruby/src/trunk/spec/mspec/bin/mspec-run -B /tmp/ruby/src/trunk/spec/default.mspec --error-output stderr --debug -fy -o /tmp/rubytest.ssbz1e/7-mspec-multi-6 E, [2024-05-10T12:11:46.503154 #663761] ERROR -- : $ /tmp/ruby/build/trunk/miniruby -I/tmp/ruby/src/trunk/lib /tmp/ruby/src/trunk/tool/runruby.rb --archdir=/tmp/ruby/build/trunk --extout=.ext -- /tmp/ruby/src/trunk/spec/mspec/bin/mspec-run -B /tmp/ruby/src/trunk/spec/default.mspec --error-output stderr --debug -fy -o /tmp/rubytest.ssbz1e/8-mspec-multi-7 E, [2024-05-10T12:11:46.503350 #663761] ERROR -- : $ /tmp/ruby/build/trunk/miniruby -I/tmp/ruby/src/trunk/lib /tmp/ruby/src/trunk/tool/runruby.rb --archdir=/tmp/ruby/build/trunk --extout=.ext -- /tmp/ruby/src/trunk/spec/mspec/bin/mspec-run -B /tmp/ruby/src/trunk/spec/default.mspec --error-output stderr --debug -fy -o /tmp/rubytest.ssbz1e/9-mspec-multi-8 E, [2024-05-10T12:11:46.503544 #663761] ERROR -- : $ /tmp/ruby/build/trunk/miniruby -I/tmp/ruby/src/trunk/lib /tmp/ruby/src/trunk/tool/runruby.rb --archdir=/tmp/ruby/build/trunk --extout=.ext -- /tmp/ruby/src/trunk/spec/mspec/bin/mspec-run -B /tmp/ruby/src/trunk/spec/default.mspec --error-output stderr --debug -fy -o /tmp/rubytest.ssbz1e/10-mspec-multi-9 E, [2024-05-10T12:11:46.503779 #663761] ERROR -- : $ /tmp/ruby/build/trunk/miniruby -I/tmp/ruby/src/trunk/lib /tmp/ruby/src/trunk/tool/runruby.rb --archdir=/tmp/ruby/build/trunk --extout=.ext -- /tmp/ruby/src/trunk/spec/mspec/bin/mspec-run -B /tmp/ruby/src/trunk/spec/default.mspec --error-output stderr --debug -fy -o /tmp/rubytest.ssbz1e/11-mspec-multi-10 E, [2024-05-10T12:11:46.504112 #663761] ERROR -- : $ /tmp/ruby/build/trunk/miniruby -I/tmp/ruby/src/trunk/lib /tmp/ruby/src/trunk/tool/runruby.rb --archdir=/tmp/ruby/build/trunk --extout=.ext -- /tmp/ruby/src/trunk/spec/mspec/bin/mspec-run -B /tmp/ruby/src/trunk/spec/default.mspec --error-output stderr --debug -fy -o /tmp/rubytest.ssbz1e/12-mspec-multi-11 E, [2024-05-10T12:11:46.515182 #663761] ERROR -- : $ /tmp/ruby/build/trunk/miniruby -I/tmp/ruby/src/trunk/lib /tmp/ruby/src/trunk/tool/runruby.rb --archdir=/tmp/ruby/build/trunk --extout=.ext -- /tmp/ruby/src/trunk/spec/mspec/bin/mspec-run -B /tmp/ruby/src/trunk/spec/default.mspec --error-output stderr --debug -fy -o /tmp/rubytest.ssbz1e/13-mspec-multi-12 E, [2024-05-10T12:11:46.515359 #663761] ERROR -- : $ /tmp/ruby/build/trunk/miniruby -I/tmp/ruby/src/trunk/lib /tmp/ruby/src/trunk/tool/runruby.rb --archdir=/tmp/ruby/build/trunk --extout=.ext -- /tmp/ruby/src/trunk/spec/mspec/bin/mspec-run -B /tmp/ruby/src/trunk/spec/default.mspec --error-output stderr --debug -fy -o /tmp/rubytest.ssbz1e/14-mspec-multi-13 E, [2024-05-10T12:11:46.515556 #663761] ERROR -- : $ /tmp/ruby/build/trunk/miniruby -I/tmp/ruby/src/trunk/lib /tmp/ruby/src/trunk/tool/runruby.rb --archdir=/tmp/ruby/build/trunk --extout=.ext -- /tmp/ruby/src/trunk/spec/mspec/bin/mspec-run -B /tmp/ruby/src/trunk/spec/default.mspec --error-output stderr --debug -fy -o /tmp/rubytest.ssbz1e/15-mspec-multi-14 E, [2024-05-10T12:11:46.515745 #663761] ERROR -- : $ /tmp/ruby/build/trunk/miniruby -I/tmp/ruby/src/trunk/lib /tmp/ruby/src/trunk/tool/runruby.rb --archdir=/tmp/ruby/build/trunk --extout=.ext -- /tmp/ruby/src/trunk/spec/mspec/bin/mspec-run -B /tmp/ruby/src/trunk/spec/default.mspec --error-output stderr --debug -fy -o /tmp/rubytest.ssbz1e/16-mspec-multi-15 I, [2024-05-10T12:11:46.720764 #663761] INFO -- : ruby 3.4.0dev (2024-05-10T11:40:58Z master c68bb24088) [x86_64-linux] I, [2024-05-10T12:11:48.170076 #663761] INFO -- : 0 ......................................................................... I, [2024-05-10T12:11:48.828068 #663761] INFO -- : 73 ......................................................................... I, [2024-05-10T12:11:49.012996 #663761] INFO -- : 146 ......................................................................... I, [2024-05-10T12:11:49.078990 #663761] INFO -- : 219 ......................................................................... I, [2024-05-10T12:11:49.183431 #663761] INFO -- : 292 ......................................................................... I, [2024-05-10T12:11:49.256399 #663761] INFO -- : 365 ......................................................................... I, [2024-05-10T12:11:49.291662 #663761] INFO -- : 438 ......................................................................... I, [2024-05-10T12:11:49.320142 #663761] INFO -- : 511 ......................................................................... I, [2024-05-10T12:11:49.346549 #663761] INFO -- : 584 ......................................................................... I, [2024-05-10T12:11:49.445892 #663761] INFO -- : 657 ......................................................................... I, [2024-05-10T12:11:49.488342 #663761] INFO -- : 730 ......................................................................... I, [2024-05-10T12:11:49.519187 #663761] INFO -- : 803 ......................................................................... I, [2024-05-10T12:11:49.578855 #663761] INFO -- : 876 ......................................................................... I, [2024-05-10T12:11:49.666919 #663761] INFO -- : 949 ......................................................................... I, [2024-05-10T12:11:49.805099 #663761] INFO -- : 1022 ......................................................................... I, [2024-05-10T12:11:50.147574 #663761] INFO -- : 1095 ......................................................................... I, [2024-05-10T12:11:50.371402 #663761] INFO -- : 1168 ......................................................................... I, [2024-05-10T12:11:50.476187 #663761] INFO -- : 1241 ......................................................................... I, [2024-05-10T12:11:50.603264 #663761] INFO -- : 1314 ......................................................................... I, [2024-05-10T12:11:50.658350 #663761] INFO -- : 1387 ......................................................................... I, [2024-05-10T12:11:50.837818 #663761] INFO -- : 1460 ......................................................................... I, [2024-05-10T12:11:51.776620 #663761] INFO -- : 1533 ......................................................................... I, [2024-05-10T12:11:51.855056 #663761] INFO -- : 1606 ......................................................................... I, [2024-05-10T12:11:51.997937 #663761] INFO -- : 1679 ......................................................................... I, [2024-05-10T12:11:52.160738 #663761] INFO -- : 1752 ......................................................................... I, [2024-05-10T12:11:52.299947 #663761] INFO -- : 1825 ......................................................................... I, [2024-05-10T12:11:52.510852 #663761] INFO -- : 1898 ......................................................................... I, [2024-05-10T12:11:52.635761 #663761] INFO -- : 1971 ......................................................................... I, [2024-05-10T12:11:52.800012 #663761] INFO -- : 2044 ......................................................................... I, [2024-05-10T12:11:52.860082 #663761] INFO -- : 2117 ......................................................................... I, [2024-05-10T12:11:52.892627 #663761] INFO -- : 2190 ......................................................................... I, [2024-05-10T12:11:52.921169 #663761] INFO -- : 2263 ......................................................................... I, [2024-05-10T12:11:52.946157 #663761] INFO -- : 2336 ......................................................................... I, [2024-05-10T12:11:53.005251 #663761] INFO -- : 2409 ......................................................................... I, [2024-05-10T12:11:53.209531 #663761] INFO -- : 2482 ......................................................................... I, [2024-05-10T12:11:53.267873 #663761] INFO -- : 2555 ......................................................................... I, [2024-05-10T12:11:53.426154 #663761] INFO -- : 2628 ......................................................................... I, [2024-05-10T12:11:53.533717 #663761] INFO -- : 2701 ......................................................................... I, [2024-05-10T12:11:53.582900 #663761] INFO -- : 2774 ......................................................................... I, [2024-05-10T12:11:53.684516 #663761] INFO -- : 2847 ......................................................................... I, [2024-05-10T12:11:53.740645 #663761] INFO -- : 2920 ......................................................................... I, [2024-05-10T12:11:53.788121 #663761] INFO -- : 2993 ......................................................................... I, [2024-05-10T12:11:53.826249 #663761] INFO -- : 3066 ......................................................................... I, [2024-05-10T12:11:53.850207 #663761] INFO -- : 3139 ......................................................................... I, [2024-05-10T12:11:53.865477 #663761] INFO -- : 3212 ......................................................................... I, [2024-05-10T12:11:53.909534 #663761] INFO -- : 3285 ......................................................................... I, [2024-05-10T12:11:57.869851 #663761] INFO -- : 3358 ........................................................................ I, [2024-05-10T12:11:57.869963 #663761] INFO -- : I, [2024-05-10T12:11:57.869996 #663761] INFO -- : Finished in 11.362822 seconds I, [2024-05-10T12:11:57.870020 #663761] INFO -- : I, [2024-05-10T12:11:57.870041 #663761] INFO -- : 3429 files, 32611 examples, 170499 expectations, 0 failures, 0 errors, 0 tagged I, [2024-05-10T12:11:57.875057 #663761] INFO -- : $$$[end] "make yes-test-rubyspec MSPECOPT='--error-output stderr --debug -j' TESTS='-j16'" exit with 0.