# Logfile created on 2024-05-10 10:31:06 +0000 by logger.rb/v1.4.3 I, [2024-05-10T10:31:06.917351 #2196847] INFO -- : #, @formatter=nil, @logdev=#, @binmode=false, @mon_data=#, @mon_data_owner_object_id=860>>> I, [2024-05-10T10:31:06.917477 #2196847] INFO -- : $$$[beg] make update-unicode -j20 I, [2024-05-10T10:31:06.976064 #2196847] INFO -- : Downloading Unicode emoji 15.0 files... I, [2024-05-10T10:31:06.976268 #2196847] INFO -- : Downloading Unicode emoji 15.0 files... I, [2024-05-10T10:31:06.976919 #2196847] INFO -- : Downloading Unicode emoji 15.0 files... I, [2024-05-10T10:31:07.018617 #2196847] INFO -- : made symlink emoji/15.0/emoji-sequences.txt to /tmp/ruby/src/trunk/.downloaded-cache/emoji/15.0/emoji-sequences.txt I, [2024-05-10T10:31:07.018928 #2196847] INFO -- : downloading emoji/15.0/emoji-test.txt ... downloading emoji/15.0/emoji-sequences.txt ... /tmp/ruby/src/trunk/enc/unicode/data/emoji/15.0/emoji-sequences.txt already exists E, [2024-05-10T10:31:07.458741 #2196847] ERROR -- : /tmp/ruby/src/trunk/tool/downloader.rb:302:in `rescue in download': failed to download emoji/15.0/emoji-test.txt (RuntimeError) E, [2024-05-10T10:31:07.458844 #2196847] ERROR -- : OpenURI::HTTPError: 403 Forbidden: https://www.unicode.org/Public/emoji/15.0/emoji-test.txt E, [2024-05-10T10:31:07.458860 #2196847] ERROR -- : from /tmp/ruby/src/trunk/tool/downloader.rb:201:in `download' E, [2024-05-10T10:31:07.458871 #2196847] ERROR -- : from /tmp/ruby/src/trunk/tool/downloader.rb:136:in `download' E, [2024-05-10T10:31:07.458881 #2196847] ERROR -- : from /tmp/ruby/src/trunk/tool/downloader.rb:482:in `block in
' E, [2024-05-10T10:31:07.458892 #2196847] ERROR -- : from /tmp/ruby/src/trunk/tool/downloader.rb:465:in `each' E, [2024-05-10T10:31:07.458903 #2196847] ERROR -- : from /tmp/ruby/src/trunk/tool/downloader.rb:465:in `
' E, [2024-05-10T10:31:07.458913 #2196847] ERROR -- : /usr/lib/ruby/3.0.0/open-uri.rb:364:in `open_http': 403 Forbidden (OpenURI::HTTPError) E, [2024-05-10T10:31:07.458923 #2196847] ERROR -- : from /usr/lib/ruby/3.0.0/open-uri.rb:741:in `buffer_open' E, [2024-05-10T10:31:07.458936 #2196847] ERROR -- : from /usr/lib/ruby/3.0.0/open-uri.rb:212:in `block in open_loop' E, [2024-05-10T10:31:07.458946 #2196847] ERROR -- : from /usr/lib/ruby/3.0.0/open-uri.rb:210:in `catch' E, [2024-05-10T10:31:07.458956 #2196847] ERROR -- : from /usr/lib/ruby/3.0.0/open-uri.rb:210:in `open_loop' E, [2024-05-10T10:31:07.458966 #2196847] ERROR -- : from /usr/lib/ruby/3.0.0/open-uri.rb:151:in `open_uri' E, [2024-05-10T10:31:07.458975 #2196847] ERROR -- : from /usr/lib/ruby/3.0.0/open-uri.rb:721:in `open' E, [2024-05-10T10:31:07.458985 #2196847] ERROR -- : from /usr/lib/ruby/3.0.0/open-uri.rb:729:in `read' E, [2024-05-10T10:31:07.458995 #2196847] ERROR -- : from /tmp/ruby/src/trunk/tool/downloader.rb:247:in `block in download' E, [2024-05-10T10:31:07.459019 #2196847] ERROR -- : from /tmp/ruby/src/trunk/tool/downloader.rb:378:in `with_retry' E, [2024-05-10T10:31:07.459036 #2196847] ERROR -- : from /tmp/ruby/src/trunk/tool/downloader.rb:246:in `download' E, [2024-05-10T10:31:07.459047 #2196847] ERROR -- : from /tmp/ruby/src/trunk/tool/downloader.rb:136:in `download' E, [2024-05-10T10:31:07.459060 #2196847] ERROR -- : from /tmp/ruby/src/trunk/tool/downloader.rb:482:in `block in
' E, [2024-05-10T10:31:07.459070 #2196847] ERROR -- : from /tmp/ruby/src/trunk/tool/downloader.rb:465:in `each' E, [2024-05-10T10:31:07.459079 #2196847] ERROR -- : from /tmp/ruby/src/trunk/tool/downloader.rb:465:in `
' E, [2024-05-10T10:31:07.462393 #2196847] ERROR -- : make: *** [uncommon.mk:1765: /tmp/ruby/src/trunk/enc/unicode/data/emoji/15.0/emoji-zwj-sequences.txt] Error 1 E, [2024-05-10T10:31:07.462444 #2196847] ERROR -- : make: *** Waiting for unfinished jobs.... E, [2024-05-10T10:31:07.481690 #2196847] ERROR -- : /tmp/ruby/src/trunk/tool/downloader.rb:302:in `rescue in download': failed to download emoji/15.0/emoji-test.txt (RuntimeError) E, [2024-05-10T10:31:07.481827 #2196847] ERROR -- : OpenURI::HTTPError: 403 Forbidden: https://www.unicode.org/Public/emoji/15.0/emoji-test.txt E, [2024-05-10T10:31:07.481849 #2196847] ERROR -- : from /tmp/ruby/src/trunk/tool/downloader.rb:201:in `download' E, [2024-05-10T10:31:07.481862 #2196847] ERROR -- : from /tmp/ruby/src/trunk/tool/downloader.rb:136:in `download' E, [2024-05-10T10:31:07.481874 #2196847] ERROR -- : from /tmp/ruby/src/trunk/tool/downloader.rb:482:in `block in
' E, [2024-05-10T10:31:07.481886 #2196847] ERROR -- : from /tmp/ruby/src/trunk/tool/downloader.rb:465:in `each' E, [2024-05-10T10:31:07.481899 #2196847] ERROR -- : from /tmp/ruby/src/trunk/tool/downloader.rb:465:in `
' E, [2024-05-10T10:31:07.481911 #2196847] ERROR -- : /usr/lib/ruby/3.0.0/open-uri.rb:364:in `open_http': 403 Forbidden (OpenURI::HTTPError) E, [2024-05-10T10:31:07.481923 #2196847] ERROR -- : from /usr/lib/ruby/3.0.0/open-uri.rb:741:in `buffer_open' E, [2024-05-10T10:31:07.481939 #2196847] ERROR -- : from /usr/lib/ruby/3.0.0/open-uri.rb:212:in `block in open_loop' E, [2024-05-10T10:31:07.481950 #2196847] ERROR -- : from /usr/lib/ruby/3.0.0/open-uri.rb:210:in `catch' E, [2024-05-10T10:31:07.481964 #2196847] ERROR -- : from /usr/lib/ruby/3.0.0/open-uri.rb:210:in `open_loop' E, [2024-05-10T10:31:07.481975 #2196847] ERROR -- : from /usr/lib/ruby/3.0.0/open-uri.rb:151:in `open_uri' E, [2024-05-10T10:31:07.481987 #2196847] ERROR -- : from /usr/lib/ruby/3.0.0/open-uri.rb:721:in `open' E, [2024-05-10T10:31:07.481999 #2196847] ERROR -- : from /usr/lib/ruby/3.0.0/open-uri.rb:729:in `read' E, [2024-05-10T10:31:07.482011 #2196847] ERROR -- : from /tmp/ruby/src/trunk/tool/downloader.rb:247:in `block in download' E, [2024-05-10T10:31:07.482022 #2196847] ERROR -- : from /tmp/ruby/src/trunk/tool/downloader.rb:378:in `with_retry' E, [2024-05-10T10:31:07.482036 #2196847] ERROR -- : from /tmp/ruby/src/trunk/tool/downloader.rb:246:in `download' E, [2024-05-10T10:31:07.482048 #2196847] ERROR -- : from /tmp/ruby/src/trunk/tool/downloader.rb:136:in `download' E, [2024-05-10T10:31:07.482060 #2196847] ERROR -- : from /tmp/ruby/src/trunk/tool/downloader.rb:482:in `block in
' E, [2024-05-10T10:31:07.482071 #2196847] ERROR -- : from /tmp/ruby/src/trunk/tool/downloader.rb:465:in `each' E, [2024-05-10T10:31:07.482083 #2196847] ERROR -- : from /tmp/ruby/src/trunk/tool/downloader.rb:465:in `
' E, [2024-05-10T10:31:07.485980 #2196847] ERROR -- : make: *** [uncommon.mk:1765: /tmp/ruby/src/trunk/enc/unicode/data/emoji/15.0/emoji-test.txt] Error 1 E, [2024-05-10T10:31:07.981265 #2196847] ERROR -- : /tmp/ruby/src/trunk/tool/downloader.rb:302:in `rescue in download': failed to download emoji/15.0/emoji-sequences.txt (RuntimeError) E, [2024-05-10T10:31:07.981415 #2196847] ERROR -- : EOFError: end of file reached: https://www.unicode.org/Public/emoji/15.0/emoji-sequences.txt E, [2024-05-10T10:31:07.981461 #2196847] ERROR -- : from /tmp/ruby/src/trunk/tool/downloader.rb:201:in `download' E, [2024-05-10T10:31:07.981477 #2196847] ERROR -- : from /tmp/ruby/src/trunk/tool/downloader.rb:136:in `download' E, [2024-05-10T10:31:07.981490 #2196847] ERROR -- : from /tmp/ruby/src/trunk/tool/downloader.rb:482:in `block in
' E, [2024-05-10T10:31:07.981503 #2196847] ERROR -- : from /tmp/ruby/src/trunk/tool/downloader.rb:465:in `each' E, [2024-05-10T10:31:07.981516 #2196847] ERROR -- : from /tmp/ruby/src/trunk/tool/downloader.rb:465:in `
' E, [2024-05-10T10:31:07.981529 #2196847] ERROR -- : /usr/lib/ruby/3.0.0/net/protocol.rb:227:in `rbuf_fill': end of file reached (EOFError) E, [2024-05-10T10:31:07.981541 #2196847] ERROR -- : from /usr/lib/ruby/3.0.0/net/protocol.rb:193:in `readuntil' E, [2024-05-10T10:31:07.981558 #2196847] ERROR -- : from /usr/lib/ruby/3.0.0/net/protocol.rb:203:in `readline' E, [2024-05-10T10:31:07.981572 #2196847] ERROR -- : from /usr/lib/ruby/3.0.0/net/http/response.rb:42:in `read_status_line' E, [2024-05-10T10:31:07.981592 #2196847] ERROR -- : from /usr/lib/ruby/3.0.0/net/http/response.rb:31:in `read_new' E, [2024-05-10T10:31:07.981605 #2196847] ERROR -- : from /usr/lib/ruby/3.0.0/net/http.rb:1557:in `block in transport_request' E, [2024-05-10T10:31:07.981617 #2196847] ERROR -- : from /usr/lib/ruby/3.0.0/net/http.rb:1548:in `catch' E, [2024-05-10T10:31:07.981630 #2196847] ERROR -- : from /usr/lib/ruby/3.0.0/net/http.rb:1548:in `transport_request' E, [2024-05-10T10:31:07.981642 #2196847] ERROR -- : from /usr/lib/ruby/3.0.0/net/http.rb:1521:in `request' E, [2024-05-10T10:31:07.981918 #2196847] ERROR -- : from /usr/lib/ruby/3.0.0/open-uri.rb:329:in `block in open_http' E, [2024-05-10T10:31:07.981934 #2196847] ERROR -- : from /usr/lib/ruby/3.0.0/net/http.rb:960:in `start' E, [2024-05-10T10:31:07.981946 #2196847] ERROR -- : from /usr/lib/ruby/3.0.0/open-uri.rb:323:in `open_http' E, [2024-05-10T10:31:07.981957 #2196847] ERROR -- : from /usr/lib/ruby/3.0.0/open-uri.rb:741:in `buffer_open' E, [2024-05-10T10:31:07.981969 #2196847] ERROR -- : from /usr/lib/ruby/3.0.0/open-uri.rb:212:in `block in open_loop' E, [2024-05-10T10:31:07.981984 #2196847] ERROR -- : from /usr/lib/ruby/3.0.0/open-uri.rb:210:in `catch' E, [2024-05-10T10:31:07.981996 #2196847] ERROR -- : from /usr/lib/ruby/3.0.0/open-uri.rb:210:in `open_loop' E, [2024-05-10T10:31:07.982014 #2196847] ERROR -- : from /usr/lib/ruby/3.0.0/open-uri.rb:151:in `open_uri' E, [2024-05-10T10:31:07.982025 #2196847] ERROR -- : from /usr/lib/ruby/3.0.0/open-uri.rb:721:in `open' E, [2024-05-10T10:31:07.982037 #2196847] ERROR -- : from /usr/lib/ruby/3.0.0/open-uri.rb:729:in `read' E, [2024-05-10T10:31:07.982048 #2196847] ERROR -- : from /tmp/ruby/src/trunk/tool/downloader.rb:247:in `block in download' E, [2024-05-10T10:31:07.982060 #2196847] ERROR -- : from /tmp/ruby/src/trunk/tool/downloader.rb:378:in `with_retry' E, [2024-05-10T10:31:07.982071 #2196847] ERROR -- : from /tmp/ruby/src/trunk/tool/downloader.rb:246:in `download' E, [2024-05-10T10:31:07.982083 #2196847] ERROR -- : from /tmp/ruby/src/trunk/tool/downloader.rb:136:in `download' E, [2024-05-10T10:31:07.982097 #2196847] ERROR -- : from /tmp/ruby/src/trunk/tool/downloader.rb:482:in `block in
' E, [2024-05-10T10:31:07.982109 #2196847] ERROR -- : from /tmp/ruby/src/trunk/tool/downloader.rb:465:in `each' E, [2024-05-10T10:31:07.982120 #2196847] ERROR -- : from /tmp/ruby/src/trunk/tool/downloader.rb:465:in `
' E, [2024-05-10T10:31:07.985970 #2196847] ERROR -- : make: *** [uncommon.mk:1765: /tmp/ruby/src/trunk/enc/unicode/data/emoji/15.0/emoji-sequences.txt] Error 1 E, [2024-05-10T10:31:07.986030 #2196847] ERROR -- : make: *** Deleting file '/tmp/ruby/src/trunk/enc/unicode/data/emoji/15.0/emoji-sequences.txt' I, [2024-05-10T10:31:07.986092 #2196847] INFO -- : downloading emoji/15.0/emoji-test.txt ... I, [2024-05-10T10:31:07.986559 #2196847] INFO -- : $$$[end] "make update-unicode -j20" exit with 512. I, [2024-05-10T10:31:07.986628 #2196847] INFO -- : $$$[beg] make update-download -j20 I, [2024-05-10T10:31:08.096085 #2196847] INFO -- : tool/config.guess already exists I, [2024-05-10T10:31:08.096148 #2196847] INFO -- : tool/config.sub already exists I, [2024-05-10T10:31:08.098184 #2196847] INFO -- : Update minitest to ea9caafc0754b1d6236a490d59e624b53209734a I, [2024-05-10T10:31:08.098383 #2196847] INFO -- : Update power_assert to 84e85124c5014a139af39161d484156cfe87a9ed I, [2024-05-10T10:31:08.099015 #2196847] INFO -- : Update rbs to ba7872795d5de04adb8ff500c0e6afdc81a041dd I, [2024-05-10T10:31:08.099309 #2196847] INFO -- : Update typeprof to b19a6416da3a05d57fadd6ffdadb382b6d236ca5 I, [2024-05-10T10:31:08.099332 #2196847] INFO -- : echo ea9caafc0754b1d6236a490d59e624b53209734a | /bin/sh /tmp/ruby/src/trunk/tool/ifchange /tmp/ruby/src/trunk/.bundle/.timestamp/minitest.revision - I, [2024-05-10T10:31:08.099550 #2196847] INFO -- : echo 84e85124c5014a139af39161d484156cfe87a9ed | /bin/sh /tmp/ruby/src/trunk/tool/ifchange /tmp/ruby/src/trunk/.bundle/.timestamp/power_assert.revision - I, [2024-05-10T10:31:08.100144 #2196847] INFO -- : echo ba7872795d5de04adb8ff500c0e6afdc81a041dd | /bin/sh /tmp/ruby/src/trunk/tool/ifchange /tmp/ruby/src/trunk/.bundle/.timestamp/rbs.revision - I, [2024-05-10T10:31:08.100353 #2196847] INFO -- : echo b19a6416da3a05d57fadd6ffdadb382b6d236ca5 | /bin/sh /tmp/ruby/src/trunk/tool/ifchange /tmp/ruby/src/trunk/.bundle/.timestamp/typeprof.revision - I, [2024-05-10T10:31:08.101233 #2196847] INFO -- : /tmp/ruby/src/trunk/.bundle/.timestamp/minitest.revision unchanged I, [2024-05-10T10:31:08.101446 #2196847] INFO -- : /tmp/ruby/src/trunk/.bundle/.timestamp/power_assert.revision unchanged I, [2024-05-10T10:31:08.101897 #2196847] INFO -- : /tmp/ruby/src/trunk/.bundle/.timestamp/rbs.revision unchanged I, [2024-05-10T10:31:08.101927 #2196847] INFO -- : /tmp/ruby/src/trunk/.bundle/.timestamp/typeprof.revision unchanged I, [2024-05-10T10:31:08.102385 #2196847] INFO -- : Building power_assert@84e85124c5014a139af39161d484156cfe87a9ed to /tmp/ruby/src/trunk/gems/power_assert-2.0.3.gem I, [2024-05-10T10:31:08.171222 #2196847] INFO -- : Successfully built RubyGem I, [2024-05-10T10:31:08.171270 #2196847] INFO -- : Name: power_assert I, [2024-05-10T10:31:08.171280 #2196847] INFO -- : Version: 2.0.4dev I, [2024-05-10T10:31:08.171285 #2196847] INFO -- : File: power_assert-2.0.4dev.gem I, [2024-05-10T10:31:08.216269 #2196847] INFO -- : $$$[end] "make update-download -j20" exit with 0. I, [2024-05-10T10:31:08.216308 #2196847] INFO -- : $$$[beg] make update-rubyspec -j20 I, [2024-05-10T10:31:08.273865 #2196847] INFO -- : make: Nothing to be done for 'update-rubyspec'. I, [2024-05-10T10:31:08.274213 #2196847] INFO -- : $$$[end] "make update-rubyspec -j20" exit with 0. I, [2024-05-10T10:31:08.274238 #2196847] INFO -- : $$$[beg] make update-src -j20 I, [2024-05-10T10:31:08.792621 #2196847] INFO -- : Already up to date. I, [2024-05-10T10:31:08.810057 #2196847] INFO -- : Latest commit hash = 69d0a3b033 I, [2024-05-10T10:31:08.811773 #2196847] INFO -- : $$$[end] "make update-src -j20" exit with 0. I, [2024-05-10T10:31:08.811826 #2196847] INFO -- : $$$[beg] make after-update -j20 I, [2024-05-10T10:31:08.913524 #2196847] INFO -- : /tmp/ruby/src/trunk/revision.h updated I, [2024-05-10T10:31:08.914708 #2196847] INFO -- : generating x86_64-linux-fake.rb I, [2024-05-10T10:31:08.970324 #2196847] INFO -- : x86_64-linux-fake.rb updated I, [2024-05-10T10:31:08.971781 #2196847] INFO -- : generating enc.mk I, [2024-05-10T10:31:09.089638 #2196847] INFO -- : making srcs under enc I, [2024-05-10T10:31:09.119214 #2196847] INFO -- : make[1]: Entering directory '/tmp/ruby/build/trunk' I, [2024-05-10T10:31:09.119237 #2196847] INFO -- : make[1]: Nothing to be done for 'srcs'. I, [2024-05-10T10:31:09.119243 #2196847] INFO -- : make[1]: Leaving directory '/tmp/ruby/build/trunk' I, [2024-05-10T10:31:09.167538 #2196847] INFO -- : Update minitest to ea9caafc0754b1d6236a490d59e624b53209734a I, [2024-05-10T10:31:09.167821 #2196847] INFO -- : Update power_assert to 84e85124c5014a139af39161d484156cfe87a9ed I, [2024-05-10T10:31:09.168515 #2196847] INFO -- : Update rbs to ba7872795d5de04adb8ff500c0e6afdc81a041dd I, [2024-05-10T10:31:09.168734 #2196847] INFO -- : Update typeprof to b19a6416da3a05d57fadd6ffdadb382b6d236ca5 I, [2024-05-10T10:31:09.169249 #2196847] INFO -- : echo ea9caafc0754b1d6236a490d59e624b53209734a | /bin/sh /tmp/ruby/src/trunk/tool/ifchange /tmp/ruby/src/trunk/.bundle/.timestamp/minitest.revision - I, [2024-05-10T10:31:09.169359 #2196847] INFO -- : echo 84e85124c5014a139af39161d484156cfe87a9ed | /bin/sh /tmp/ruby/src/trunk/tool/ifchange /tmp/ruby/src/trunk/.bundle/.timestamp/power_assert.revision - I, [2024-05-10T10:31:09.170519 #2196847] INFO -- : echo ba7872795d5de04adb8ff500c0e6afdc81a041dd | /bin/sh /tmp/ruby/src/trunk/tool/ifchange /tmp/ruby/src/trunk/.bundle/.timestamp/rbs.revision - I, [2024-05-10T10:31:09.170673 #2196847] INFO -- : echo b19a6416da3a05d57fadd6ffdadb382b6d236ca5 | /bin/sh /tmp/ruby/src/trunk/tool/ifchange /tmp/ruby/src/trunk/.bundle/.timestamp/typeprof.revision - I, [2024-05-10T10:31:09.171185 #2196847] INFO -- : /tmp/ruby/src/trunk/.bundle/.timestamp/power_assert.revision unchanged I, [2024-05-10T10:31:09.171262 #2196847] INFO -- : /tmp/ruby/src/trunk/.bundle/.timestamp/minitest.revision unchanged I, [2024-05-10T10:31:09.172025 #2196847] INFO -- : Building power_assert@84e85124c5014a139af39161d484156cfe87a9ed to /tmp/ruby/src/trunk/gems/power_assert-2.0.3.gem I, [2024-05-10T10:31:09.172115 #2196847] INFO -- : /tmp/ruby/src/trunk/.bundle/.timestamp/rbs.revision unchanged I, [2024-05-10T10:31:09.172302 #2196847] INFO -- : /tmp/ruby/src/trunk/.bundle/.timestamp/typeprof.revision unchanged I, [2024-05-10T10:31:09.240829 #2196847] INFO -- : Successfully built RubyGem I, [2024-05-10T10:31:09.240871 #2196847] INFO -- : Name: power_assert I, [2024-05-10T10:31:09.240876 #2196847] INFO -- : Version: 2.0.4dev I, [2024-05-10T10:31:09.240880 #2196847] INFO -- : File: power_assert-2.0.4dev.gem I, [2024-05-10T10:31:09.243038 #2196847] INFO -- : Extracting bundle gem power_assert-2.0.3... I, [2024-05-10T10:31:09.303543 #2196847] INFO -- : Try with hash version of bundled gems instead of gems/power_assert-2.0.3.gem. We don't use this gem with release version of Ruby. I, [2024-05-10T10:31:09.308462 #2196847] INFO -- : Unpacked gems/power_assert-2.0.4dev.gem I, [2024-05-10T10:31:09.310161 #2196847] INFO -- : $$$[end] "make after-update -j20" exit with 0. I, [2024-05-10T10:31:09.310301 #2196847] INFO -- : $$$[beg] make miniruby -j20 I, [2024-05-10T10:31:09.366411 #2196847] INFO -- : BASERUBY = /usr/bin/ruby --disable=gems I, [2024-05-10T10:31:09.366438 #2196847] INFO -- : CC = gcc I, [2024-05-10T10:31:09.366444 #2196847] INFO -- : LD = ld I, [2024-05-10T10:31:09.366448 #2196847] INFO -- : LDSHARED = gcc -shared I, [2024-05-10T10:31:09.366452 #2196847] INFO -- : CFLAGS = -O3 -fno-fast-math -ggdb3 -Wall -Wextra -Wdeprecated-declarations -Wdiv-by-zero -Wduplicated-cond -Wimplicit-function-declaration -Wimplicit-int -Wpointer-arith -Wwrite-strings -Wold-style-definition -Wimplicit-fallthrough=0 -Wmissing-noreturn -Wno-cast-function-type -Wno-constant-logical-operand -Wno-long-long -Wno-missing-field-initializers -Wno-overlength-strings -Wno-packed-bitfield-compat -Wno-parentheses-equality -Wno-self-assign -Wno-tautological-compare -Wno-unused-parameter -Wno-unused-value -Wsuggest-attribute=format -Wsuggest-attribute=noreturn -Wunused-variable -Wmisleading-indentation -Wundef -fPIC I, [2024-05-10T10:31:09.366456 #2196847] INFO -- : XCFLAGS = -U_FORTIFY_SOURCE -D_FORTIFY_SOURCE=2 -fstack-protector-strong -fno-strict-overflow -fvisibility=hidden -fexcess-precision=standard -DRUBY_EXPORT -I. -I.ext/include/x86_64-linux -I/tmp/ruby/src/trunk/include -I/tmp/ruby/src/trunk -I/tmp/ruby/src/trunk/prism -I/tmp/ruby/src/trunk/enc/unicode/15.0.0 I, [2024-05-10T10:31:09.366460 #2196847] INFO -- : CPPFLAGS = I, [2024-05-10T10:31:09.366463 #2196847] INFO -- : DLDFLAGS = -Wl,--compress-debug-sections=zlib -Wl,-soname,libruby.so.3.4 -fstack-protector-strong I, [2024-05-10T10:31:09.366473 #2196847] INFO -- : SOLIBS = -lz -lrt -lrt -lgmp -ldl -lcrypt -lm -lpthread I, [2024-05-10T10:31:09.366477 #2196847] INFO -- : LANG = en_US.UTF-8 I, [2024-05-10T10:31:09.366480 #2196847] INFO -- : LC_ALL = I, [2024-05-10T10:31:09.366484 #2196847] INFO -- : LC_CTYPE = I, [2024-05-10T10:31:09.366487 #2196847] INFO -- : MFLAGS = -j20 --jobserver-auth=4,5 I, [2024-05-10T10:31:09.366490 #2196847] INFO -- : RUSTC = no I, [2024-05-10T10:31:09.366494 #2196847] INFO -- : YJIT_RUSTC_ARGS = --crate-name=yjit --crate-type=staticlib --edition=2021 -g -C lto=thin -C opt-level=3 -C overflow-checks=on '--out-dir=/tmp/ruby/build/trunk/yjit/target/release/' /tmp/ruby/src/trunk/yjit/src/lib.rs I, [2024-05-10T10:31:09.367733 #2196847] INFO -- : gcc (Ubuntu 11.4.0-1ubuntu1~22.04) 11.4.0 I, [2024-05-10T10:31:09.367754 #2196847] INFO -- : Copyright (C) 2021 Free Software Foundation, Inc. I, [2024-05-10T10:31:09.367760 #2196847] INFO -- : This is free software; see the source for copying conditions. There is NO I, [2024-05-10T10:31:09.367763 #2196847] INFO -- : warranty; not even for MERCHANTABILITY or FITNESS FOR A PARTICULAR PURPOSE. I, [2024-05-10T10:31:09.367767 #2196847] INFO -- : I, [2024-05-10T10:31:09.389020 #2196847] INFO -- : compiling /tmp/ruby/src/trunk/version.c I, [2024-05-10T10:31:09.490673 #2196847] INFO -- : linking miniruby I, [2024-05-10T10:31:09.999516 #2196847] INFO -- : $$$[end] "make miniruby -j20" exit with 0. I, [2024-05-10T10:31:09.999644 #2196847] INFO -- : $$$[beg] make ruby -j20 I, [2024-05-10T10:31:10.058382 #2196847] INFO -- : BASERUBY = /usr/bin/ruby --disable=gems I, [2024-05-10T10:31:10.058421 #2196847] INFO -- : CC = gcc I, [2024-05-10T10:31:10.058427 #2196847] INFO -- : LD = ld I, [2024-05-10T10:31:10.058432 #2196847] INFO -- : LDSHARED = gcc -shared I, [2024-05-10T10:31:10.058440 #2196847] INFO -- : CFLAGS = -O3 -fno-fast-math -ggdb3 -Wall -Wextra -Wdeprecated-declarations -Wdiv-by-zero -Wduplicated-cond -Wimplicit-function-declaration -Wimplicit-int -Wpointer-arith -Wwrite-strings -Wold-style-definition -Wimplicit-fallthrough=0 -Wmissing-noreturn -Wno-cast-function-type -Wno-constant-logical-operand -Wno-long-long -Wno-missing-field-initializers -Wno-overlength-strings -Wno-packed-bitfield-compat -Wno-parentheses-equality -Wno-self-assign -Wno-tautological-compare -Wno-unused-parameter -Wno-unused-value -Wsuggest-attribute=format -Wsuggest-attribute=noreturn -Wunused-variable -Wmisleading-indentation -Wundef -fPIC I, [2024-05-10T10:31:10.058446 #2196847] INFO -- : XCFLAGS = -U_FORTIFY_SOURCE -D_FORTIFY_SOURCE=2 -fstack-protector-strong -fno-strict-overflow -fvisibility=hidden -fexcess-precision=standard -DRUBY_EXPORT -I. -I.ext/include/x86_64-linux -I/tmp/ruby/src/trunk/include -I/tmp/ruby/src/trunk -I/tmp/ruby/src/trunk/prism -I/tmp/ruby/src/trunk/enc/unicode/15.0.0 I, [2024-05-10T10:31:10.058450 #2196847] INFO -- : CPPFLAGS = I, [2024-05-10T10:31:10.058455 #2196847] INFO -- : DLDFLAGS = -Wl,--compress-debug-sections=zlib -Wl,-soname,libruby.so.3.4 -fstack-protector-strong I, [2024-05-10T10:31:10.058460 #2196847] INFO -- : SOLIBS = -lz -lrt -lrt -lgmp -ldl -lcrypt -lm -lpthread I, [2024-05-10T10:31:10.058464 #2196847] INFO -- : LANG = en_US.UTF-8 I, [2024-05-10T10:31:10.058469 #2196847] INFO -- : LC_ALL = I, [2024-05-10T10:31:10.058473 #2196847] INFO -- : LC_CTYPE = I, [2024-05-10T10:31:10.058477 #2196847] INFO -- : MFLAGS = -j20 --jobserver-auth=4,5 I, [2024-05-10T10:31:10.058482 #2196847] INFO -- : RUSTC = no I, [2024-05-10T10:31:10.058486 #2196847] INFO -- : YJIT_RUSTC_ARGS = --crate-name=yjit --crate-type=staticlib --edition=2021 -g -C lto=thin -C opt-level=3 -C overflow-checks=on '--out-dir=/tmp/ruby/build/trunk/yjit/target/release/' /tmp/ruby/src/trunk/yjit/src/lib.rs I, [2024-05-10T10:31:10.060127 #2196847] INFO -- : gcc (Ubuntu 11.4.0-1ubuntu1~22.04) 11.4.0 I, [2024-05-10T10:31:10.060155 #2196847] INFO -- : Copyright (C) 2021 Free Software Foundation, Inc. I, [2024-05-10T10:31:10.060170 #2196847] INFO -- : This is free software; see the source for copying conditions. There is NO I, [2024-05-10T10:31:10.060179 #2196847] INFO -- : warranty; not even for MERCHANTABILITY or FITNESS FOR A PARTICULAR PURPOSE. I, [2024-05-10T10:31:10.060184 #2196847] INFO -- : I, [2024-05-10T10:31:10.174830 #2196847] INFO -- : builtin_binary.inc updated I, [2024-05-10T10:31:10.179270 #2196847] INFO -- : c5234a9416e4f20f175185e840b25b0f08674d14078ed7083f37e655458e3ca9 builtin_binary.inc I, [2024-05-10T10:31:10.180036 #2196847] INFO -- : compiling /tmp/ruby/src/trunk/builtin.c I, [2024-05-10T10:31:10.362900 #2196847] INFO -- : linking static-library libruby-static.a I, [2024-05-10T10:31:10.653900 #2196847] INFO -- : linking shared-library libruby.so.3.4.0 I, [2024-05-10T10:31:12.199861 #2196847] INFO -- : linking ruby I, [2024-05-10T10:31:12.223079 #2196847] INFO -- : $$$[end] "make ruby -j20" exit with 0. I, [2024-05-10T10:31:12.223194 #2196847] INFO -- : $$$[beg] make all -j20 I, [2024-05-10T10:31:12.287069 #2196847] INFO -- : BASERUBY = /usr/bin/ruby --disable=gems I, [2024-05-10T10:31:12.287115 #2196847] INFO -- : CC = gcc I, [2024-05-10T10:31:12.287124 #2196847] INFO -- : LD = ld I, [2024-05-10T10:31:12.287131 #2196847] INFO -- : LDSHARED = gcc -shared I, [2024-05-10T10:31:12.287137 #2196847] INFO -- : CFLAGS = -O3 -fno-fast-math -ggdb3 -Wall -Wextra -Wdeprecated-declarations -Wdiv-by-zero -Wduplicated-cond -Wimplicit-function-declaration -Wimplicit-int -Wpointer-arith -Wwrite-strings -Wold-style-definition -Wimplicit-fallthrough=0 -Wmissing-noreturn -Wno-cast-function-type -Wno-constant-logical-operand -Wno-long-long -Wno-missing-field-initializers -Wno-overlength-strings -Wno-packed-bitfield-compat -Wno-parentheses-equality -Wno-self-assign -Wno-tautological-compare -Wno-unused-parameter -Wno-unused-value -Wsuggest-attribute=format -Wsuggest-attribute=noreturn -Wunused-variable -Wmisleading-indentation -Wundef -fPIC I, [2024-05-10T10:31:12.287147 #2196847] INFO -- : XCFLAGS = -U_FORTIFY_SOURCE -D_FORTIFY_SOURCE=2 -fstack-protector-strong -fno-strict-overflow -fvisibility=hidden -fexcess-precision=standard -DRUBY_EXPORT -I. -I.ext/include/x86_64-linux -I/tmp/ruby/src/trunk/include -I/tmp/ruby/src/trunk -I/tmp/ruby/src/trunk/prism -I/tmp/ruby/src/trunk/enc/unicode/15.0.0 I, [2024-05-10T10:31:12.287153 #2196847] INFO -- : CPPFLAGS = I, [2024-05-10T10:31:12.287159 #2196847] INFO -- : DLDFLAGS = -Wl,--compress-debug-sections=zlib -Wl,-soname,libruby.so.3.4 -fstack-protector-strong I, [2024-05-10T10:31:12.287165 #2196847] INFO -- : SOLIBS = -lz -lrt -lrt -lgmp -ldl -lcrypt -lm -lpthread I, [2024-05-10T10:31:12.287171 #2196847] INFO -- : LANG = en_US.UTF-8 I, [2024-05-10T10:31:12.287177 #2196847] INFO -- : LC_ALL = I, [2024-05-10T10:31:12.287182 #2196847] INFO -- : LC_CTYPE = I, [2024-05-10T10:31:12.287188 #2196847] INFO -- : MFLAGS = -j20 --jobserver-auth=4,5 I, [2024-05-10T10:31:12.287194 #2196847] INFO -- : RUSTC = no I, [2024-05-10T10:31:12.287202 #2196847] INFO -- : YJIT_RUSTC_ARGS = --crate-name=yjit --crate-type=staticlib --edition=2021 -g -C lto=thin -C opt-level=3 -C overflow-checks=on '--out-dir=/tmp/ruby/build/trunk/yjit/target/release/' /tmp/ruby/src/trunk/yjit/src/lib.rs I, [2024-05-10T10:31:12.289363 #2196847] INFO -- : gcc (Ubuntu 11.4.0-1ubuntu1~22.04) 11.4.0 I, [2024-05-10T10:31:12.289402 #2196847] INFO -- : Copyright (C) 2021 Free Software Foundation, Inc. I, [2024-05-10T10:31:12.289412 #2196847] INFO -- : This is free software; see the source for copying conditions. There is NO I, [2024-05-10T10:31:12.289420 #2196847] INFO -- : warranty; not even for MERCHANTABILITY or FITNESS FOR A PARTICULAR PURPOSE. I, [2024-05-10T10:31:12.289426 #2196847] INFO -- : I, [2024-05-10T10:31:12.320865 #2196847] INFO -- : generating enc.mk I, [2024-05-10T10:31:12.322662 #2196847] INFO -- : building spec/ruby/optional/capi/ext/array_spec.so I, [2024-05-10T10:31:12.322931 #2196847] INFO -- : building spec/ruby/optional/capi/ext/basic_object_spec.so I, [2024-05-10T10:31:12.323614 #2196847] INFO -- : building spec/ruby/optional/capi/ext/bignum_spec.so I, [2024-05-10T10:31:12.324480 #2196847] INFO -- : building spec/ruby/optional/capi/ext/binding_spec.so I, [2024-05-10T10:31:12.324958 #2196847] INFO -- : building spec/ruby/optional/capi/ext/boolean_spec.so I, [2024-05-10T10:31:12.325266 #2196847] INFO -- : building spec/ruby/optional/capi/ext/class_id_under_autoload_spec.so I, [2024-05-10T10:31:12.326121 #2196847] INFO -- : building spec/ruby/optional/capi/ext/class_spec.so I, [2024-05-10T10:31:12.327278 #2196847] INFO -- : building spec/ruby/optional/capi/ext/class_under_autoload_spec.so I, [2024-05-10T10:31:12.327584 #2196847] INFO -- : building spec/ruby/optional/capi/ext/complex_spec.so I, [2024-05-10T10:31:12.328377 #2196847] INFO -- : building spec/ruby/optional/capi/ext/constants_spec.so I, [2024-05-10T10:31:12.329199 #2196847] INFO -- : building spec/ruby/optional/capi/ext/data_spec.so I, [2024-05-10T10:31:12.329539 #2196847] INFO -- : building spec/ruby/optional/capi/ext/debug_spec.so I, [2024-05-10T10:31:12.330226 #2196847] INFO -- : building spec/ruby/optional/capi/ext/encoding_spec.so I, [2024-05-10T10:31:12.330864 #2196847] INFO -- : building spec/ruby/optional/capi/ext/enumerator_spec.so I, [2024-05-10T10:31:12.331160 #2196847] INFO -- : building spec/ruby/optional/capi/ext/exception_spec.so I, [2024-05-10T10:31:12.331847 #2196847] INFO -- : building spec/ruby/optional/capi/ext/fiber_spec.so I, [2024-05-10T10:31:12.332421 #2196847] INFO -- : building spec/ruby/optional/capi/ext/file_spec.so I, [2024-05-10T10:31:12.332731 #2196847] INFO -- : building spec/ruby/optional/capi/ext/fixnum_spec.so I, [2024-05-10T10:31:12.334107 #2196847] INFO -- : building spec/ruby/optional/capi/ext/float_spec.so I, [2024-05-10T10:31:12.455750 #2196847] INFO -- : building spec/ruby/optional/capi/ext/gc_spec.so I, [2024-05-10T10:31:12.460436 #2196847] INFO -- : building spec/ruby/optional/capi/ext/globals_spec.so I, [2024-05-10T10:31:12.470458 #2196847] INFO -- : building spec/ruby/optional/capi/ext/hash_spec.so I, [2024-05-10T10:31:12.471770 #2196847] INFO -- : building spec/ruby/optional/capi/ext/integer_spec.so I, [2024-05-10T10:31:12.472089 #2196847] INFO -- : building spec/ruby/optional/capi/ext/io_spec.so I, [2024-05-10T10:31:12.488345 #2196847] INFO -- : building spec/ruby/optional/capi/ext/kernel_spec.so I, [2024-05-10T10:31:12.491190 #2196847] INFO -- : building spec/ruby/optional/capi/ext/language_spec.so I, [2024-05-10T10:31:12.495769 #2196847] INFO -- : building spec/ruby/optional/capi/ext/marshal_spec.so I, [2024-05-10T10:31:12.497017 #2196847] INFO -- : building spec/ruby/optional/capi/ext/module_spec.so I, [2024-05-10T10:31:12.497807 #2196847] INFO -- : building spec/ruby/optional/capi/ext/module_under_autoload_spec.so I, [2024-05-10T10:31:12.498404 #2196847] INFO -- : building spec/ruby/optional/capi/ext/mutex_spec.so I, [2024-05-10T10:31:12.502720 #2196847] INFO -- : building spec/ruby/optional/capi/ext/numeric_spec.so I, [2024-05-10T10:31:12.510960 #2196847] INFO -- : building spec/ruby/optional/capi/ext/object_spec.so I, [2024-05-10T10:31:12.514469 #2196847] INFO -- : building spec/ruby/optional/capi/ext/proc_spec.so I, [2024-05-10T10:31:12.525838 #2196847] INFO -- : building spec/ruby/optional/capi/ext/range_spec.so I, [2024-05-10T10:31:12.535922 #2196847] INFO -- : building spec/ruby/optional/capi/ext/rational_spec.so I, [2024-05-10T10:31:12.561742 #2196847] INFO -- : building spec/ruby/optional/capi/ext/rbasic_spec.so I, [2024-05-10T10:31:12.564714 #2196847] INFO -- : building spec/ruby/optional/capi/ext/regexp_spec.so I, [2024-05-10T10:31:12.620517 #2196847] INFO -- : building spec/ruby/optional/capi/ext/string_spec.so I, [2024-05-10T10:31:12.620769 #2196847] INFO -- : building spec/ruby/optional/capi/ext/struct_spec.so I, [2024-05-10T10:31:12.644204 #2196847] INFO -- : building spec/ruby/optional/capi/ext/st_spec.so I, [2024-05-10T10:31:12.644682 #2196847] INFO -- : building spec/ruby/optional/capi/ext/symbol_spec.so I, [2024-05-10T10:31:12.648795 #2196847] INFO -- : building spec/ruby/optional/capi/ext/thread_spec.so I, [2024-05-10T10:31:12.651987 #2196847] INFO -- : building spec/ruby/optional/capi/ext/time_spec.so I, [2024-05-10T10:31:12.654765 #2196847] INFO -- : building spec/ruby/optional/capi/ext/tracepoint_spec.so I, [2024-05-10T10:31:12.661839 #2196847] INFO -- : building spec/ruby/optional/capi/ext/typed_data_spec.so I, [2024-05-10T10:31:12.671436 #2196847] INFO -- : building spec/ruby/optional/capi/ext/util_spec.so I, [2024-05-10T10:31:12.674131 #2196847] INFO -- : making enc I, [2024-05-10T10:31:12.704646 #2196847] INFO -- : make[1]: Entering directory '/tmp/ruby/build/trunk' I, [2024-05-10T10:31:12.704733 #2196847] INFO -- : make[1]: Nothing to be done for 'enc'. I, [2024-05-10T10:31:12.704777 #2196847] INFO -- : make[1]: Leaving directory '/tmp/ruby/build/trunk' I, [2024-05-10T10:31:12.705608 #2196847] INFO -- : making srcs under enc I, [2024-05-10T10:31:12.753897 #2196847] INFO -- : make[1]: Entering directory '/tmp/ruby/build/trunk' I, [2024-05-10T10:31:12.753955 #2196847] INFO -- : make[1]: Nothing to be done for 'srcs'. I, [2024-05-10T10:31:12.753965 #2196847] INFO -- : make[1]: Leaving directory '/tmp/ruby/build/trunk' I, [2024-05-10T10:31:12.754660 #2196847] INFO -- : generating transdb.h I, [2024-05-10T10:31:12.875978 #2196847] INFO -- : transdb.h unchanged I, [2024-05-10T10:31:12.877808 #2196847] INFO -- : generating makefiles ext/configure-ext.mk I, [2024-05-10T10:31:12.878134 #2196847] INFO -- : making trans I, [2024-05-10T10:31:12.904385 #2196847] INFO -- : ext/configure-ext.mk updated I, [2024-05-10T10:31:12.907016 #2196847] INFO -- : make[1]: Entering directory '/tmp/ruby/build/trunk' I, [2024-05-10T10:31:12.912236 #2196847] INFO -- : make[1]: Entering directory '/tmp/ruby/build/trunk' I, [2024-05-10T10:31:12.912355 #2196847] INFO -- : make[1]: Nothing to be done for 'trans'. I, [2024-05-10T10:31:12.912365 #2196847] INFO -- : make[1]: Leaving directory '/tmp/ruby/build/trunk' I, [2024-05-10T10:31:12.913307 #2196847] INFO -- : making encs I, [2024-05-10T10:31:12.971643 #2196847] INFO -- : make[1]: Entering directory '/tmp/ruby/build/trunk' I, [2024-05-10T10:31:12.971739 #2196847] INFO -- : make[1]: Nothing to be done for 'encs'. I, [2024-05-10T10:31:12.971768 #2196847] INFO -- : make[1]: Leaving directory '/tmp/ruby/build/trunk' I, [2024-05-10T10:31:13.059739 #2196847] INFO -- : make[1]: Leaving directory '/tmp/ruby/build/trunk' I, [2024-05-10T10:31:13.060403 #2196847] INFO -- : generating makefile exts.mk I, [2024-05-10T10:31:13.096957 #2196847] INFO -- : exts.mk unchanged I, [2024-05-10T10:31:13.101779 #2196847] INFO -- : make[1]: Entering directory '/tmp/ruby/build/trunk' I, [2024-05-10T10:31:13.120115 #2196847] INFO -- : make[2]: Entering directory '/tmp/ruby/build/trunk/ext/digest' I, [2024-05-10T10:31:13.120879 #2196847] INFO -- : make[2]: Entering directory '/tmp/ruby/build/trunk/ext/json' I, [2024-05-10T10:31:13.121713 #2196847] INFO -- : make[2]: Entering directory '/tmp/ruby/build/trunk/ext/coverage' I, [2024-05-10T10:31:13.122030 #2196847] INFO -- : make[2]: Entering directory '/tmp/ruby/build/trunk/ext/io/console' I, [2024-05-10T10:31:13.122552 #2196847] INFO -- : make[2]: Entering directory '/tmp/ruby/build/trunk/ext/date' I, [2024-05-10T10:31:13.122764 #2196847] INFO -- : make[2]: Entering directory '/tmp/ruby/build/trunk/ext/rubyvm' I, [2024-05-10T10:31:13.123234 #2196847] INFO -- : make[2]: Entering directory '/tmp/ruby/build/trunk/ext/monitor' I, [2024-05-10T10:31:13.123838 #2196847] INFO -- : make[2]: Entering directory '/tmp/ruby/build/trunk/ext/pathname' I, [2024-05-10T10:31:13.124303 #2196847] INFO -- : make[2]: Entering directory '/tmp/ruby/build/trunk/ext/fiddle' I, [2024-05-10T10:31:13.124587 #2196847] INFO -- : make[2]: Entering directory '/tmp/ruby/build/trunk/ext/pty' I, [2024-05-10T10:31:13.125446 #2196847] INFO -- : make[2]: Leaving directory '/tmp/ruby/build/trunk/ext/rubyvm' I, [2024-05-10T10:31:13.125479 #2196847] INFO -- : make[2]: Leaving directory '/tmp/ruby/build/trunk/ext/io/console' I, [2024-05-10T10:31:13.125674 #2196847] INFO -- : make[2]: Entering directory '/tmp/ruby/build/trunk/ext/objspace' I, [2024-05-10T10:31:13.125948 #2196847] INFO -- : make[2]: Leaving directory '/tmp/ruby/build/trunk/ext/monitor' I, [2024-05-10T10:31:13.126111 #2196847] INFO -- : make[2]: Entering directory '/tmp/ruby/build/trunk/ext/psych' I, [2024-05-10T10:31:13.126185 #2196847] INFO -- : make[2]: Leaving directory '/tmp/ruby/build/trunk/ext/date' I, [2024-05-10T10:31:13.126876 #2196847] INFO -- : make[2]: Leaving directory '/tmp/ruby/build/trunk/ext/digest' I, [2024-05-10T10:31:13.127040 #2196847] INFO -- : make[2]: Leaving directory '/tmp/ruby/build/trunk/ext/pathname' I, [2024-05-10T10:31:13.127133 #2196847] INFO -- : make[2]: Leaving directory '/tmp/ruby/build/trunk/ext/pty' I, [2024-05-10T10:31:13.127748 #2196847] INFO -- : make[2]: Entering directory '/tmp/ruby/build/trunk/.bundle/gems/bigdecimal-3.1.8/ext/bigdecimal' I, [2024-05-10T10:31:13.127937 #2196847] INFO -- : make[2]: Entering directory '/tmp/ruby/build/trunk/.bundle/gems/debug-1.9.2/ext/debug' I, [2024-05-10T10:31:13.128026 #2196847] INFO -- : make[2]: Entering directory '/tmp/ruby/build/trunk/ext/ripper' I, [2024-05-10T10:31:13.128210 #2196847] INFO -- : make[2]: Entering directory '/tmp/ruby/build/trunk/.bundle/gems/nkf-0.2.0/ext/nkf' I, [2024-05-10T10:31:13.128773 #2196847] INFO -- : make[2]: Leaving directory '/tmp/ruby/build/trunk/ext/json' I, [2024-05-10T10:31:13.128797 #2196847] INFO -- : make[2]: Entering directory '/tmp/ruby/build/trunk/.bundle/gems/racc-1.7.3/ext/racc/cparse' I, [2024-05-10T10:31:13.129028 #2196847] INFO -- : make[2]: Entering directory '/tmp/ruby/build/trunk/.bundle/gems/syslog-0.1.2/ext/syslog' I, [2024-05-10T10:31:13.129261 #2196847] INFO -- : make[2]: Entering directory '/tmp/ruby/build/trunk/.bundle/gems/rbs-3.4.4/ext/rbs_extension' I, [2024-05-10T10:31:13.129852 #2196847] INFO -- : make[2]: Leaving directory '/tmp/ruby/build/trunk/ext/objspace' I, [2024-05-10T10:31:13.131235 #2196847] INFO -- : make[2]: Leaving directory '/tmp/ruby/build/trunk/ext/fiddle' I, [2024-05-10T10:31:13.132923 #2196847] INFO -- : make[2]: Entering directory '/tmp/ruby/build/trunk/ext/digest/sha2' I, [2024-05-10T10:31:13.133217 #2196847] INFO -- : make[2]: Leaving directory '/tmp/ruby/build/trunk/ext/ripper' I, [2024-05-10T10:31:13.133478 #2196847] INFO -- : make[2]: Entering directory '/tmp/ruby/build/trunk/ext/socket' I, [2024-05-10T10:31:13.133735 #2196847] INFO -- : make[2]: Leaving directory '/tmp/ruby/build/trunk/ext/coverage' I, [2024-05-10T10:31:13.135214 #2196847] INFO -- : make[2]: Leaving directory '/tmp/ruby/build/trunk/ext/digest/sha2' I, [2024-05-10T10:31:13.135972 #2196847] INFO -- : make[2]: Entering directory '/tmp/ruby/build/trunk/ext/openssl' I, [2024-05-10T10:31:13.139413 #2196847] INFO -- : make[2]: Leaving directory '/tmp/ruby/build/trunk/ext/socket' I, [2024-05-10T10:31:13.141751 #2196847] INFO -- : make[2]: Leaving directory '/tmp/ruby/build/trunk/ext/psych' I, [2024-05-10T10:31:13.148175 #2196847] INFO -- : make[2]: Leaving directory '/tmp/ruby/build/trunk/ext/openssl' I, [2024-05-10T10:31:13.151038 #2196847] INFO -- : make[2]: Leaving directory '/tmp/ruby/build/trunk/.bundle/gems/rbs-3.4.4/ext/rbs_extension' I, [2024-05-10T10:31:13.152001 #2196847] INFO -- : make[2]: Leaving directory '/tmp/ruby/build/trunk/.bundle/gems/syslog-0.1.2/ext/syslog' I, [2024-05-10T10:31:13.159260 #2196847] INFO -- : make[2]: Leaving directory '/tmp/ruby/build/trunk/.bundle/gems/nkf-0.2.0/ext/nkf' I, [2024-05-10T10:31:13.162278 #2196847] INFO -- : make[2]: Leaving directory '/tmp/ruby/build/trunk/.bundle/gems/debug-1.9.2/ext/debug' I, [2024-05-10T10:31:13.162500 #2196847] INFO -- : make[2]: Leaving directory '/tmp/ruby/build/trunk/.bundle/gems/racc-1.7.3/ext/racc/cparse' I, [2024-05-10T10:31:13.162528 #2196847] INFO -- : make[2]: Leaving directory '/tmp/ruby/build/trunk/.bundle/gems/bigdecimal-3.1.8/ext/bigdecimal' I, [2024-05-10T10:31:13.186444 #2196847] INFO -- : make[2]: Entering directory '/tmp/ruby/build/trunk' I, [2024-05-10T10:31:13.256686 #2196847] INFO -- : linking ruby I, [2024-05-10T10:31:13.279338 #2196847] INFO -- : make[2]: Leaving directory '/tmp/ruby/build/trunk' I, [2024-05-10T10:31:13.279778 #2196847] INFO -- : make[1]: Leaving directory '/tmp/ruby/build/trunk' I, [2024-05-10T10:31:13.283079 #2196847] INFO -- : make[1]: Entering directory '/tmp/ruby/build/trunk' I, [2024-05-10T10:31:13.283135 #2196847] INFO -- : make[1]: Nothing to be done for 'note'. I, [2024-05-10T10:31:13.283152 #2196847] INFO -- : make[1]: Leaving directory '/tmp/ruby/build/trunk' I, [2024-05-10T10:31:13.283675 #2196847] INFO -- : $$$[end] "make all -j20" exit with 0. I, [2024-05-10T10:31:13.283850 #2196847] INFO -- : $$$[beg] make install -j20 I, [2024-05-10T10:31:13.359090 #2196847] INFO -- : Update minitest to ea9caafc0754b1d6236a490d59e624b53209734a I, [2024-05-10T10:31:13.359290 #2196847] INFO -- : Update power_assert to 84e85124c5014a139af39161d484156cfe87a9ed I, [2024-05-10T10:31:13.359458 #2196847] INFO -- : Update rbs to ba7872795d5de04adb8ff500c0e6afdc81a041dd I, [2024-05-10T10:31:13.360318 #2196847] INFO -- : Update typeprof to b19a6416da3a05d57fadd6ffdadb382b6d236ca5 I, [2024-05-10T10:31:13.361377 #2196847] INFO -- : echo ea9caafc0754b1d6236a490d59e624b53209734a | /bin/sh /tmp/ruby/src/trunk/tool/ifchange /tmp/ruby/src/trunk/.bundle/.timestamp/minitest.revision - I, [2024-05-10T10:31:13.361633 #2196847] INFO -- : echo 84e85124c5014a139af39161d484156cfe87a9ed | /bin/sh /tmp/ruby/src/trunk/tool/ifchange /tmp/ruby/src/trunk/.bundle/.timestamp/power_assert.revision - I, [2024-05-10T10:31:13.361936 #2196847] INFO -- : echo ba7872795d5de04adb8ff500c0e6afdc81a041dd | /bin/sh /tmp/ruby/src/trunk/tool/ifchange /tmp/ruby/src/trunk/.bundle/.timestamp/rbs.revision - I, [2024-05-10T10:31:13.362921 #2196847] INFO -- : BASERUBY = /usr/bin/ruby --disable=gems I, [2024-05-10T10:31:13.362967 #2196847] INFO -- : CC = gcc I, [2024-05-10T10:31:13.362987 #2196847] INFO -- : LD = ld I, [2024-05-10T10:31:13.363003 #2196847] INFO -- : LDSHARED = gcc -shared I, [2024-05-10T10:31:13.363018 #2196847] INFO -- : CFLAGS = -O3 -fno-fast-math -ggdb3 -Wall -Wextra -Wdeprecated-declarations -Wdiv-by-zero -Wduplicated-cond -Wimplicit-function-declaration -Wimplicit-int -Wpointer-arith -Wwrite-strings -Wold-style-definition -Wimplicit-fallthrough=0 -Wmissing-noreturn -Wno-cast-function-type -Wno-constant-logical-operand -Wno-long-long -Wno-missing-field-initializers -Wno-overlength-strings -Wno-packed-bitfield-compat -Wno-parentheses-equality -Wno-self-assign -Wno-tautological-compare -Wno-unused-parameter -Wno-unused-value -Wsuggest-attribute=format -Wsuggest-attribute=noreturn -Wunused-variable -Wmisleading-indentation -Wundef -fPIC I, [2024-05-10T10:31:13.363038 #2196847] INFO -- : XCFLAGS = -U_FORTIFY_SOURCE -D_FORTIFY_SOURCE=2 -fstack-protector-strong -fno-strict-overflow -fvisibility=hidden -fexcess-precision=standard -DRUBY_EXPORT -I. -I.ext/include/x86_64-linux -I/tmp/ruby/src/trunk/include -I/tmp/ruby/src/trunk -I/tmp/ruby/src/trunk/prism -I/tmp/ruby/src/trunk/enc/unicode/15.0.0 I, [2024-05-10T10:31:13.363055 #2196847] INFO -- : CPPFLAGS = I, [2024-05-10T10:31:13.363071 #2196847] INFO -- : DLDFLAGS = -Wl,--compress-debug-sections=zlib -Wl,-soname,libruby.so.3.4 -fstack-protector-strong I, [2024-05-10T10:31:13.363087 #2196847] INFO -- : SOLIBS = -lz -lrt -lrt -lgmp -ldl -lcrypt -lm -lpthread I, [2024-05-10T10:31:13.363102 #2196847] INFO -- : LANG = en_US.UTF-8 I, [2024-05-10T10:31:13.363117 #2196847] INFO -- : LC_ALL = I, [2024-05-10T10:31:13.363132 #2196847] INFO -- : LC_CTYPE = I, [2024-05-10T10:31:13.363149 #2196847] INFO -- : MFLAGS = -j20 --jobserver-auth=4,5 I, [2024-05-10T10:31:13.363165 #2196847] INFO -- : RUSTC = no I, [2024-05-10T10:31:13.363184 #2196847] INFO -- : YJIT_RUSTC_ARGS = --crate-name=yjit --crate-type=staticlib --edition=2021 -g -C lto=thin -C opt-level=3 -C overflow-checks=on '--out-dir=/tmp/ruby/build/trunk/yjit/target/release/' /tmp/ruby/src/trunk/yjit/src/lib.rs I, [2024-05-10T10:31:13.364426 #2196847] INFO -- : /tmp/ruby/src/trunk/.bundle/.timestamp/minitest.revision unchanged I, [2024-05-10T10:31:13.364462 #2196847] INFO -- : /tmp/ruby/src/trunk/.bundle/.timestamp/power_assert.revision unchanged I, [2024-05-10T10:31:13.364589 #2196847] INFO -- : /tmp/ruby/src/trunk/.bundle/.timestamp/rbs.revision unchanged I, [2024-05-10T10:31:13.402083 #2196847] INFO -- : echo b19a6416da3a05d57fadd6ffdadb382b6d236ca5 | /bin/sh /tmp/ruby/src/trunk/tool/ifchange /tmp/ruby/src/trunk/.bundle/.timestamp/typeprof.revision - I, [2024-05-10T10:31:13.402878 #2196847] INFO -- : gcc (Ubuntu 11.4.0-1ubuntu1~22.04) 11.4.0 I, [2024-05-10T10:31:13.402925 #2196847] INFO -- : Copyright (C) 2021 Free Software Foundation, Inc. I, [2024-05-10T10:31:13.402942 #2196847] INFO -- : This is free software; see the source for copying conditions. There is NO I, [2024-05-10T10:31:13.402953 #2196847] INFO -- : warranty; not even for MERCHANTABILITY or FITNESS FOR A PARTICULAR PURPOSE. I, [2024-05-10T10:31:13.402963 #2196847] INFO -- : I, [2024-05-10T10:31:13.402974 #2196847] INFO -- : generating enc.mk I, [2024-05-10T10:31:13.404048 #2196847] INFO -- : /tmp/ruby/src/trunk/.bundle/.timestamp/typeprof.revision unchanged I, [2024-05-10T10:31:13.524478 #2196847] INFO -- : Building power_assert@84e85124c5014a139af39161d484156cfe87a9ed to /tmp/ruby/src/trunk/gems/power_assert-2.0.3.gem I, [2024-05-10T10:31:13.525190 #2196847] INFO -- : making srcs under enc I, [2024-05-10T10:31:13.525368 #2196847] INFO -- : making enc I, [2024-05-10T10:31:13.542345 #2196847] INFO -- : make[1]: Entering directory '/tmp/ruby/build/trunk' I, [2024-05-10T10:31:13.542413 #2196847] INFO -- : make[1]: Nothing to be done for 'enc'. I, [2024-05-10T10:31:13.542427 #2196847] INFO -- : make[1]: Leaving directory '/tmp/ruby/build/trunk' I, [2024-05-10T10:31:13.554969 #2196847] INFO -- : make[1]: Entering directory '/tmp/ruby/build/trunk' I, [2024-05-10T10:31:13.555029 #2196847] INFO -- : make[1]: Nothing to be done for 'srcs'. I, [2024-05-10T10:31:13.555043 #2196847] INFO -- : make[1]: Leaving directory '/tmp/ruby/build/trunk' I, [2024-05-10T10:31:13.555709 #2196847] INFO -- : generating transdb.h I, [2024-05-10T10:31:13.593075 #2196847] INFO -- : Successfully built RubyGem I, [2024-05-10T10:31:13.593116 #2196847] INFO -- : Name: power_assert I, [2024-05-10T10:31:13.593126 #2196847] INFO -- : Version: 2.0.4dev I, [2024-05-10T10:31:13.593130 #2196847] INFO -- : File: power_assert-2.0.4dev.gem I, [2024-05-10T10:31:13.595409 #2196847] INFO -- : Extracting bundle gem power_assert-2.0.3... I, [2024-05-10T10:31:13.651479 #2196847] INFO -- : transdb.h unchanged I, [2024-05-10T10:31:13.653064 #2196847] INFO -- : generating makefiles ext/configure-ext.mk I, [2024-05-10T10:31:13.653424 #2196847] INFO -- : making trans I, [2024-05-10T10:31:13.657086 #2196847] INFO -- : Try with hash version of bundled gems instead of gems/power_assert-2.0.3.gem. We don't use this gem with release version of Ruby. I, [2024-05-10T10:31:13.662071 #2196847] INFO -- : Unpacked gems/power_assert-2.0.4dev.gem I, [2024-05-10T10:31:13.680080 #2196847] INFO -- : ext/configure-ext.mk unchanged I, [2024-05-10T10:31:13.682680 #2196847] INFO -- : make[1]: Entering directory '/tmp/ruby/build/trunk' I, [2024-05-10T10:31:13.688000 #2196847] INFO -- : make[1]: Entering directory '/tmp/ruby/build/trunk' I, [2024-05-10T10:31:13.688114 #2196847] INFO -- : make[1]: Nothing to be done for 'trans'. I, [2024-05-10T10:31:13.688125 #2196847] INFO -- : make[1]: Leaving directory '/tmp/ruby/build/trunk' I, [2024-05-10T10:31:13.689252 #2196847] INFO -- : making encs I, [2024-05-10T10:31:13.746658 #2196847] INFO -- : make[1]: Entering directory '/tmp/ruby/build/trunk' I, [2024-05-10T10:31:13.746736 #2196847] INFO -- : make[1]: Nothing to be done for 'encs'. I, [2024-05-10T10:31:13.746763 #2196847] INFO -- : make[1]: Leaving directory '/tmp/ruby/build/trunk' I, [2024-05-10T10:31:13.834785 #2196847] INFO -- : make[1]: Leaving directory '/tmp/ruby/build/trunk' I, [2024-05-10T10:31:13.835374 #2196847] INFO -- : generating makefile exts.mk I, [2024-05-10T10:31:13.872849 #2196847] INFO -- : exts.mk unchanged I, [2024-05-10T10:31:13.877751 #2196847] INFO -- : make[1]: Entering directory '/tmp/ruby/build/trunk' I, [2024-05-10T10:31:13.897408 #2196847] INFO -- : make[2]: Entering directory '/tmp/ruby/build/trunk/ext/digest' I, [2024-05-10T10:31:13.898683 #2196847] INFO -- : make[2]: Entering directory '/tmp/ruby/build/trunk/ext/json' I, [2024-05-10T10:31:13.898826 #2196847] INFO -- : make[2]: Entering directory '/tmp/ruby/build/trunk/ext/coverage' I, [2024-05-10T10:31:13.899598 #2196847] INFO -- : make[2]: Entering directory '/tmp/ruby/build/trunk/ext/io/console' I, [2024-05-10T10:31:13.899671 #2196847] INFO -- : make[2]: Entering directory '/tmp/ruby/build/trunk/ext/date' I, [2024-05-10T10:31:13.900726 #2196847] INFO -- : make[2]: Entering directory '/tmp/ruby/build/trunk/ext/monitor' I, [2024-05-10T10:31:13.901474 #2196847] INFO -- : make[2]: Entering directory '/tmp/ruby/build/trunk/ext/fiddle' I, [2024-05-10T10:31:13.901523 #2196847] INFO -- : make[2]: Leaving directory '/tmp/ruby/build/trunk/ext/io/console' I, [2024-05-10T10:31:13.901719 #2196847] INFO -- : make[2]: Entering directory '/tmp/ruby/build/trunk/ext/pathname' I, [2024-05-10T10:31:13.902042 #2196847] INFO -- : make[2]: Leaving directory '/tmp/ruby/build/trunk/ext/digest' I, [2024-05-10T10:31:13.902100 #2196847] INFO -- : make[2]: Entering directory '/tmp/ruby/build/trunk/ext/pty' I, [2024-05-10T10:31:13.902529 #2196847] INFO -- : make[2]: Leaving directory '/tmp/ruby/build/trunk/ext/coverage' I, [2024-05-10T10:31:13.902757 #2196847] INFO -- : make[2]: Leaving directory '/tmp/ruby/build/trunk/ext/monitor' I, [2024-05-10T10:31:13.902787 #2196847] INFO -- : make[2]: Entering directory '/tmp/ruby/build/trunk/ext/objspace' I, [2024-05-10T10:31:13.903361 #2196847] INFO -- : make[2]: Entering directory '/tmp/ruby/build/trunk/ext/psych' I, [2024-05-10T10:31:13.903716 #2196847] INFO -- : make[2]: Leaving directory '/tmp/ruby/build/trunk/ext/pathname' I, [2024-05-10T10:31:13.903813 #2196847] INFO -- : make[2]: Leaving directory '/tmp/ruby/build/trunk/ext/date' I, [2024-05-10T10:31:13.904080 #2196847] INFO -- : make[2]: Leaving directory '/tmp/ruby/build/trunk/ext/pty' I, [2024-05-10T10:31:13.904861 #2196847] INFO -- : make[2]: Entering directory '/tmp/ruby/build/trunk/ext/ripper' I, [2024-05-10T10:31:13.904890 #2196847] INFO -- : make[2]: Leaving directory '/tmp/ruby/build/trunk/ext/json' I, [2024-05-10T10:31:13.905010 #2196847] INFO -- : make[2]: Entering directory '/tmp/ruby/build/trunk/ext/rubyvm' I, [2024-05-10T10:31:13.906521 #2196847] INFO -- : make[2]: Leaving directory '/tmp/ruby/build/trunk/ext/fiddle' I, [2024-05-10T10:31:13.906774 #2196847] INFO -- : make[2]: Leaving directory '/tmp/ruby/build/trunk/ext/objspace' I, [2024-05-10T10:31:13.906893 #2196847] INFO -- : make[2]: Leaving directory '/tmp/ruby/build/trunk/ext/rubyvm' I, [2024-05-10T10:31:13.907293 #2196847] INFO -- : make[2]: Entering directory '/tmp/ruby/build/trunk/.bundle/gems/bigdecimal-3.1.8/ext/bigdecimal' I, [2024-05-10T10:31:13.907394 #2196847] INFO -- : make[2]: Entering directory '/tmp/ruby/build/trunk/.bundle/gems/debug-1.9.2/ext/debug' I, [2024-05-10T10:31:13.907499 #2196847] INFO -- : make[2]: Entering directory '/tmp/ruby/build/trunk/.bundle/gems/nkf-0.2.0/ext/nkf' I, [2024-05-10T10:31:13.907613 #2196847] INFO -- : make[2]: Entering directory '/tmp/ruby/build/trunk/.bundle/gems/racc-1.7.3/ext/racc/cparse' I, [2024-05-10T10:31:13.907669 #2196847] INFO -- : make[2]: Entering directory '/tmp/ruby/build/trunk/.bundle/gems/rbs-3.4.4/ext/rbs_extension' I, [2024-05-10T10:31:13.907929 #2196847] INFO -- : make[2]: Entering directory '/tmp/ruby/build/trunk/.bundle/gems/syslog-0.1.2/ext/syslog' I, [2024-05-10T10:31:13.909985 #2196847] INFO -- : make[2]: Leaving directory '/tmp/ruby/build/trunk/ext/ripper' I, [2024-05-10T10:31:13.911389 #2196847] INFO -- : make[2]: Entering directory '/tmp/ruby/build/trunk/ext/digest/sha2' I, [2024-05-10T10:31:13.913221 #2196847] INFO -- : make[2]: Leaving directory '/tmp/ruby/build/trunk/ext/psych' I, [2024-05-10T10:31:13.913486 #2196847] INFO -- : make[2]: Entering directory '/tmp/ruby/build/trunk/ext/socket' I, [2024-05-10T10:31:13.913856 #2196847] INFO -- : make[2]: Leaving directory '/tmp/ruby/build/trunk/ext/digest/sha2' I, [2024-05-10T10:31:13.915520 #2196847] INFO -- : make[2]: Entering directory '/tmp/ruby/build/trunk/ext/openssl' I, [2024-05-10T10:31:13.919445 #2196847] INFO -- : make[2]: Leaving directory '/tmp/ruby/build/trunk/ext/socket' I, [2024-05-10T10:31:13.926692 #2196847] INFO -- : make[2]: Leaving directory '/tmp/ruby/build/trunk/ext/openssl' I, [2024-05-10T10:31:13.930655 #2196847] INFO -- : make[2]: Leaving directory '/tmp/ruby/build/trunk/.bundle/gems/racc-1.7.3/ext/racc/cparse' I, [2024-05-10T10:31:13.930709 #2196847] INFO -- : make[2]: Leaving directory '/tmp/ruby/build/trunk/.bundle/gems/syslog-0.1.2/ext/syslog' I, [2024-05-10T10:31:13.931874 #2196847] INFO -- : make[2]: Leaving directory '/tmp/ruby/build/trunk/.bundle/gems/bigdecimal-3.1.8/ext/bigdecimal' I, [2024-05-10T10:31:13.933963 #2196847] INFO -- : make[2]: Leaving directory '/tmp/ruby/build/trunk/.bundle/gems/debug-1.9.2/ext/debug' I, [2024-05-10T10:31:13.939539 #2196847] INFO -- : make[2]: Leaving directory '/tmp/ruby/build/trunk/.bundle/gems/rbs-3.4.4/ext/rbs_extension' I, [2024-05-10T10:31:13.941838 #2196847] INFO -- : make[2]: Leaving directory '/tmp/ruby/build/trunk/.bundle/gems/nkf-0.2.0/ext/nkf' I, [2024-05-10T10:31:13.965713 #2196847] INFO -- : make[2]: Entering directory '/tmp/ruby/build/trunk' I, [2024-05-10T10:31:14.031243 #2196847] INFO -- : make[2]: 'ruby' is up to date. I, [2024-05-10T10:31:14.031309 #2196847] INFO -- : make[2]: Leaving directory '/tmp/ruby/build/trunk' I, [2024-05-10T10:31:14.031531 #2196847] INFO -- : make[1]: Leaving directory '/tmp/ruby/build/trunk' I, [2024-05-10T10:31:14.035479 #2196847] INFO -- : make[1]: Entering directory '/tmp/ruby/build/trunk' I, [2024-05-10T10:31:14.035534 #2196847] INFO -- : make[1]: Nothing to be done for 'note'. I, [2024-05-10T10:31:14.035550 #2196847] INFO -- : make[1]: Leaving directory '/tmp/ruby/build/trunk' I, [2024-05-10T10:31:14.035804 #2196847] INFO -- : ./miniruby -I/tmp/ruby/src/trunk/lib -I. -I.ext/common /tmp/ruby/src/trunk/tool/runruby.rb --extout=.ext -- --disable-gems -r./x86_64-linux-fake /tmp/ruby/src/trunk/tool/rbinstall.rb --make="make" --dest-dir="" --extout=".ext" --ext-build-dir="./ext" --mflags="-j20 --jobserver-auth=4,5" --make-flags=" -j20 --jobserver-auth=4,5" --data-mode=0644 --prog-mode=0755 --installed-list .installed.list --mantype="doc" --gnumake --install=all --exclude=doc I, [2024-05-10T10:31:14.129594 #2196847] INFO -- : Installing to I, [2024-05-10T10:31:14.129681 #2196847] INFO -- : installing binary commands: /tmp/ruby/install/trunk/bin I, [2024-05-10T10:31:14.129697 #2196847] INFO -- : installing base libraries: /tmp/ruby/install/trunk/lib I, [2024-05-10T10:31:14.136822 #2196847] INFO -- : installing arch files: /tmp/ruby/install/trunk/lib/ruby/3.4.0+0/x86_64-linux I, [2024-05-10T10:31:14.136882 #2196847] INFO -- : installing pkgconfig data: /tmp/ruby/install/trunk/lib/pkgconfig I, [2024-05-10T10:31:14.136895 #2196847] INFO -- : installing extension objects: /tmp/ruby/install/trunk/lib/ruby/3.4.0+0/x86_64-linux I, [2024-05-10T10:31:14.146030 #2196847] INFO -- : installing extension objects: /tmp/ruby/install/trunk/lib/ruby/site_ruby/3.4.0+0/x86_64-linux I, [2024-05-10T10:31:14.146092 #2196847] INFO -- : installing extension objects: /tmp/ruby/install/trunk/lib/ruby/vendor_ruby/3.4.0+0/x86_64-linux I, [2024-05-10T10:31:14.146112 #2196847] INFO -- : installing extension headers: /tmp/ruby/install/trunk/include/ruby-3.4.0+0/x86_64-linux I, [2024-05-10T10:31:14.146134 #2196847] INFO -- : installing extension scripts: /tmp/ruby/install/trunk/lib/ruby/3.4.0+0 I, [2024-05-10T10:31:14.149937 #2196847] INFO -- : installing extension scripts: /tmp/ruby/install/trunk/lib/ruby/site_ruby/3.4.0+0 I, [2024-05-10T10:31:14.149998 #2196847] INFO -- : installing extension scripts: /tmp/ruby/install/trunk/lib/ruby/vendor_ruby/3.4.0+0 I, [2024-05-10T10:31:14.150011 #2196847] INFO -- : installing extension headers: /tmp/ruby/install/trunk/include/ruby-3.4.0+0/ruby I, [2024-05-10T10:31:14.150022 #2196847] INFO -- : installing command scripts: /tmp/ruby/install/trunk/bin I, [2024-05-10T10:31:14.150034 #2196847] INFO -- : installing library scripts: /tmp/ruby/install/trunk/lib/ruby/3.4.0+0 I, [2024-05-10T10:31:14.183122 #2196847] INFO -- : installing common headers: /tmp/ruby/install/trunk/include/ruby-3.4.0+0 I, [2024-05-10T10:31:14.188464 #2196847] INFO -- : installing manpages: /tmp/ruby/install/trunk/share/man/man1 I, [2024-05-10T10:31:14.188532 #2196847] INFO -- : installing default gems from lib: /tmp/ruby/install/trunk/lib/ruby/gems/3.4.0+0 I, [2024-05-10T10:31:14.210819 #2196847] INFO -- : benchmark 0.3.0 I, [2024-05-10T10:31:14.217662 #2196847] INFO -- : bundler 2.6.0.dev I, [2024-05-10T10:31:14.219734 #2196847] INFO -- : cgi 0.4.1 I, [2024-05-10T10:31:14.220240 #2196847] INFO -- : delegate 0.3.1 I, [2024-05-10T10:31:14.220744 #2196847] INFO -- : did_you_mean 1.6.3 I, [2024-05-10T10:31:14.221198 #2196847] INFO -- : english 0.8.0 I, [2024-05-10T10:31:14.221663 #2196847] INFO -- : erb 4.0.4 I, [2024-05-10T10:31:14.222354 #2196847] INFO -- : error_highlight 0.6.0 I, [2024-05-10T10:31:14.222834 #2196847] INFO -- : fileutils 1.7.2 I, [2024-05-10T10:31:14.223293 #2196847] INFO -- : find 0.2.0 I, [2024-05-10T10:31:14.223772 #2196847] INFO -- : forwardable 1.3.3 I, [2024-05-10T10:31:14.224228 #2196847] INFO -- : ipaddr 1.2.6 I, [2024-05-10T10:31:14.224665 #2196847] INFO -- : irb 1.13.1 I, [2024-05-10T10:31:14.226059 #2196847] INFO -- : logger 1.6.0 I, [2024-05-10T10:31:14.226552 #2196847] INFO -- : net-http 0.4.1 I, [2024-05-10T10:31:14.227060 #2196847] INFO -- : net-protocol 0.2.2 I, [2024-05-10T10:31:14.227473 #2196847] INFO -- : open-uri 0.4.1 I, [2024-05-10T10:31:14.228101 #2196847] INFO -- : open3 0.2.1 I, [2024-05-10T10:31:14.228570 #2196847] INFO -- : optparse 0.5.0 I, [2024-05-10T10:31:14.229039 #2196847] INFO -- : ostruct 0.6.0 I, [2024-05-10T10:31:14.229527 #2196847] INFO -- : pp 0.5.0 I, [2024-05-10T10:31:14.229941 #2196847] INFO -- : prettyprint 0.2.0 I, [2024-05-10T10:31:14.230467 #2196847] INFO -- : prism 0.28.0 I, [2024-05-10T10:31:14.230956 #2196847] INFO -- : pstore 0.1.3 I, [2024-05-10T10:31:14.231349 #2196847] INFO -- : rdoc 6.6.3.1 I, [2024-05-10T10:31:14.232983 #2196847] INFO -- : readline 0.0.4 I, [2024-05-10T10:31:14.233492 #2196847] INFO -- : reline 0.5.6 I, [2024-05-10T10:31:14.234012 #2196847] INFO -- : resolv 0.4.0 I, [2024-05-10T10:31:14.234476 #2196847] INFO -- : ruby2_keywords 0.0.5 I, [2024-05-10T10:31:14.234932 #2196847] INFO -- : securerandom 0.3.1 I, [2024-05-10T10:31:14.235408 #2196847] INFO -- : set 1.1.0 I, [2024-05-10T10:31:14.235918 #2196847] INFO -- : shellwords 0.2.0 I, [2024-05-10T10:31:14.236325 #2196847] INFO -- : singleton 0.2.0 I, [2024-05-10T10:31:14.236776 #2196847] INFO -- : syntax_suggest 2.0.0 I, [2024-05-10T10:31:14.237536 #2196847] INFO -- : tempfile 0.2.1 I, [2024-05-10T10:31:14.238026 #2196847] INFO -- : time 0.3.0 I, [2024-05-10T10:31:14.238514 #2196847] INFO -- : timeout 0.4.1 I, [2024-05-10T10:31:14.239515 #2196847] INFO -- : tmpdir 0.2.0 I, [2024-05-10T10:31:14.240067 #2196847] INFO -- : tsort 0.2.0 I, [2024-05-10T10:31:14.240543 #2196847] INFO -- : un 0.3.0 I, [2024-05-10T10:31:14.241009 #2196847] INFO -- : uri 0.13.0 I, [2024-05-10T10:31:14.241502 #2196847] INFO -- : weakref 0.1.3 I, [2024-05-10T10:31:14.241986 #2196847] INFO -- : yaml 0.3.0 I, [2024-05-10T10:31:14.242334 #2196847] INFO -- : installing default gems from ext: /tmp/ruby/install/trunk/lib/ruby/gems/3.4.0+0 I, [2024-05-10T10:31:14.248621 #2196847] INFO -- : date 3.3.4 I, [2024-05-10T10:31:14.249209 #2196847] INFO -- : digest 3.1.1 I, [2024-05-10T10:31:14.249703 #2196847] INFO -- : etc 1.4.3 I, [2024-05-10T10:31:14.250214 #2196847] INFO -- : fcntl 1.1.0 I, [2024-05-10T10:31:14.250673 #2196847] INFO -- : fiddle 1.1.3 I, [2024-05-10T10:31:14.251149 #2196847] INFO -- : io-console 0.7.2 I, [2024-05-10T10:31:14.251615 #2196847] INFO -- : io-nonblock 0.3.0 I, [2024-05-10T10:31:14.252083 #2196847] INFO -- : io-wait 0.3.1 I, [2024-05-10T10:31:14.252526 #2196847] INFO -- : json 2.7.2 I, [2024-05-10T10:31:14.253598 #2196847] INFO -- : openssl 3.2.0 I, [2024-05-10T10:31:14.254307 #2196847] INFO -- : pathname 0.3.0 I, [2024-05-10T10:31:14.254820 #2196847] INFO -- : psych 5.1.2 I, [2024-05-10T10:31:14.255371 #2196847] INFO -- : stringio 3.1.1 I, [2024-05-10T10:31:14.255889 #2196847] INFO -- : strscan 3.1.1 I, [2024-05-10T10:31:14.256343 #2196847] INFO -- : zlib 3.1.0 I, [2024-05-10T10:31:14.256714 #2196847] INFO -- : installing bundled gems: /tmp/ruby/install/trunk/lib/ruby/gems/3.4.0+0 I, [2024-05-10T10:31:14.257014 #2196847] INFO -- : minitest 5.22.3 I, [2024-05-10T10:31:14.264404 #2196847] INFO -- : rake 13.2.1 I, [2024-05-10T10:31:14.267698 #2196847] INFO -- : test-unit 3.6.2 I, [2024-05-10T10:31:14.272013 #2196847] INFO -- : rexml 3.2.6 I, [2024-05-10T10:31:14.275318 #2196847] INFO -- : rss 0.3.0 I, [2024-05-10T10:31:14.278281 #2196847] INFO -- : net-ftp 0.3.4 I, [2024-05-10T10:31:14.279733 #2196847] INFO -- : net-imap 0.4.11 I, [2024-05-10T10:31:14.282571 #2196847] INFO -- : net-pop 0.1.2 I, [2024-05-10T10:31:14.283457 #2196847] INFO -- : net-smtp 0.5.0 I, [2024-05-10T10:31:14.284602 #2196847] INFO -- : matrix 0.4.2 I, [2024-05-10T10:31:14.288051 #2196847] INFO -- : prime 0.1.2 I, [2024-05-10T10:31:14.293393 #2196847] INFO -- : rbs 3.4.4 I, [2024-05-10T10:31:14.314915 #2196847] INFO -- : typeprof 0.21.11 I, [2024-05-10T10:31:14.317546 #2196847] INFO -- : debug 1.9.2 I, [2024-05-10T10:31:14.320205 #2196847] INFO -- : racc 1.7.3 I, [2024-05-10T10:31:14.322678 #2196847] INFO -- : mutex_m 0.2.0 I, [2024-05-10T10:31:14.324343 #2196847] INFO -- : getoptlong 0.2.1 I, [2024-05-10T10:31:14.325631 #2196847] INFO -- : base64 0.2.0 I, [2024-05-10T10:31:14.326631 #2196847] INFO -- : bigdecimal 3.1.8 I, [2024-05-10T10:31:14.328568 #2196847] INFO -- : observer 0.1.2 I, [2024-05-10T10:31:14.329627 #2196847] INFO -- : abbrev 0.1.2 I, [2024-05-10T10:31:14.331040 #2196847] INFO -- : resolv-replace 0.1.1 I, [2024-05-10T10:31:14.332315 #2196847] INFO -- : rinda 0.2.0 I, [2024-05-10T10:31:14.333700 #2196847] INFO -- : drb 2.2.1 I, [2024-05-10T10:31:14.335180 #2196847] INFO -- : nkf 0.2.0 I, [2024-05-10T10:31:14.337657 #2196847] INFO -- : syslog 0.1.2 I, [2024-05-10T10:31:14.339176 #2196847] INFO -- : csv 3.3.0 I, [2024-05-10T10:31:14.341351 #2196847] INFO -- : installing bundled gem cache: /tmp/ruby/install/trunk/lib/ruby/gems/3.4.0+0/cache I, [2024-05-10T10:31:14.342711 #2196847] INFO -- : skipped bundled gems: I, [2024-05-10T10:31:14.342732 #2196847] INFO -- : power_assert-2.0.4dev.gem not found in bundled_gems I, [2024-05-10T10:31:14.345674 #2196847] INFO -- : $$$[end] "make install -j20" exit with 0. I, [2024-05-10T10:31:14.345768 #2196847] INFO -- : $$$[beg] make yes-btest TESTOPTS='-q -j20' I, [2024-05-10T10:31:19.380129 #2196847] INFO -- : PASS all 1936 tests E, [2024-05-10T10:31:19.387210 #2196847] ERROR -- : I, [2024-05-10T10:31:19.387310 #2196847] INFO -- : $$$[end] "make yes-btest TESTOPTS='-q -j20'" exit with 0. I, [2024-05-10T10:31:19.387420 #2196847] INFO -- : $$$[beg] make yes-test-basic TESTS='-j20' I, [2024-05-10T10:31:19.457227 #2196847] INFO -- : BASERUBY = /usr/bin/ruby --disable=gems I, [2024-05-10T10:31:19.457263 #2196847] INFO -- : CC = gcc I, [2024-05-10T10:31:19.457269 #2196847] INFO -- : LD = ld I, [2024-05-10T10:31:19.457273 #2196847] INFO -- : LDSHARED = gcc -shared I, [2024-05-10T10:31:19.457277 #2196847] INFO -- : CFLAGS = -O3 -fno-fast-math -ggdb3 -Wall -Wextra -Wdeprecated-declarations -Wdiv-by-zero -Wduplicated-cond -Wimplicit-function-declaration -Wimplicit-int -Wpointer-arith -Wwrite-strings -Wold-style-definition -Wimplicit-fallthrough=0 -Wmissing-noreturn -Wno-cast-function-type -Wno-constant-logical-operand -Wno-long-long -Wno-missing-field-initializers -Wno-overlength-strings -Wno-packed-bitfield-compat -Wno-parentheses-equality -Wno-self-assign -Wno-tautological-compare -Wno-unused-parameter -Wno-unused-value -Wsuggest-attribute=format -Wsuggest-attribute=noreturn -Wunused-variable -Wmisleading-indentation -Wundef -fPIC I, [2024-05-10T10:31:19.457282 #2196847] INFO -- : XCFLAGS = -U_FORTIFY_SOURCE -D_FORTIFY_SOURCE=2 -fstack-protector-strong -fno-strict-overflow -fvisibility=hidden -fexcess-precision=standard -DRUBY_EXPORT -I. -I.ext/include/x86_64-linux -I/tmp/ruby/src/trunk/include -I/tmp/ruby/src/trunk -I/tmp/ruby/src/trunk/prism -I/tmp/ruby/src/trunk/enc/unicode/15.0.0 I, [2024-05-10T10:31:19.457286 #2196847] INFO -- : CPPFLAGS = I, [2024-05-10T10:31:19.457291 #2196847] INFO -- : DLDFLAGS = -Wl,--compress-debug-sections=zlib -Wl,-soname,libruby.so.3.4 -fstack-protector-strong I, [2024-05-10T10:31:19.457301 #2196847] INFO -- : SOLIBS = -lz -lrt -lrt -lgmp -ldl -lcrypt -lm -lpthread I, [2024-05-10T10:31:19.457305 #2196847] INFO -- : LANG = en_US.UTF-8 I, [2024-05-10T10:31:19.457309 #2196847] INFO -- : LC_ALL = I, [2024-05-10T10:31:19.457313 #2196847] INFO -- : LC_CTYPE = I, [2024-05-10T10:31:19.457317 #2196847] INFO -- : MFLAGS = I, [2024-05-10T10:31:19.457320 #2196847] INFO -- : RUSTC = no I, [2024-05-10T10:31:19.457324 #2196847] INFO -- : YJIT_RUSTC_ARGS = --crate-name=yjit --crate-type=staticlib --edition=2021 -g -C lto=thin -C opt-level=3 -C overflow-checks=on '--out-dir=/tmp/ruby/build/trunk/yjit/target/release/' /tmp/ruby/src/trunk/yjit/src/lib.rs I, [2024-05-10T10:31:19.457951 #2196847] INFO -- : gcc (Ubuntu 11.4.0-1ubuntu1~22.04) 11.4.0 I, [2024-05-10T10:31:19.457975 #2196847] INFO -- : Copyright (C) 2021 Free Software Foundation, Inc. I, [2024-05-10T10:31:19.457982 #2196847] INFO -- : This is free software; see the source for copying conditions. There is NO I, [2024-05-10T10:31:19.457986 #2196847] INFO -- : warranty; not even for MERCHANTABILITY or FITNESS FOR A PARTICULAR PURPOSE. I, [2024-05-10T10:31:19.457991 #2196847] INFO -- : I, [2024-05-10T10:31:19.565303 #2196847] INFO -- : Checking leaked global symbols...none I, [2024-05-10T10:31:19.607029 #2196847] INFO -- : /tmp/ruby/src/trunk/basictest/test.rb:assignment ....................................................................................................................................................................................................................................................................................................................................................................................OK 372 I, [2024-05-10T10:31:19.607083 #2196847] INFO -- : /tmp/ruby/src/trunk/basictest/test.rb:condition ..OK 2 I, [2024-05-10T10:31:19.607089 #2196847] INFO -- : /tmp/ruby/src/trunk/basictest/test.rb:if/unless ...OK 3 I, [2024-05-10T10:31:19.607093 #2196847] INFO -- : /tmp/ruby/src/trunk/basictest/test.rb:case .....OK 5 I, [2024-05-10T10:31:19.607307 #2196847] INFO -- : /tmp/ruby/src/trunk/basictest/test.rb:while/until ........OK 8 I, [2024-05-10T10:31:19.607360 #2196847] INFO -- : /tmp/ruby/src/trunk/basictest/test.rb:exception ..........OK 10 I, [2024-05-10T10:31:19.607635 #2196847] INFO -- : /tmp/ruby/src/trunk/basictest/test.rb:array .......................................OK 39 I, [2024-05-10T10:31:19.607739 #2196847] INFO -- : /tmp/ruby/src/trunk/basictest/test.rb:hash ...........................OK 27 I, [2024-05-10T10:31:19.608734 #2196847] INFO -- : /tmp/ruby/src/trunk/basictest/test.rb:iterator ...........................................................................................................OK 107 I, [2024-05-10T10:31:19.609057 #2196847] INFO -- : /tmp/ruby/src/trunk/basictest/test.rb:float ................................................................................OK 80 I, [2024-05-10T10:31:19.610246 #2196847] INFO -- : /tmp/ruby/src/trunk/basictest/test.rb:bignum ...............................OK 31 I, [2024-05-10T10:31:19.611146 #2196847] INFO -- : /tmp/ruby/src/trunk/basictest/test.rb:string & char ..............................................................OK 62 I, [2024-05-10T10:31:19.611179 #2196847] INFO -- : /tmp/ruby/src/trunk/basictest/test.rb:assignment ..........OK 10 I, [2024-05-10T10:31:19.611204 #2196847] INFO -- : /tmp/ruby/src/trunk/basictest/test.rb:call ......OK 6 I, [2024-05-10T10:31:19.611261 #2196847] INFO -- : /tmp/ruby/src/trunk/basictest/test.rb:proc .........OK 9 I, [2024-05-10T10:31:19.712012 #2196847] INFO -- : /tmp/ruby/src/trunk/basictest/test.rb:signal ..OK 2 I, [2024-05-10T10:31:19.714734 #2196847] INFO -- : /tmp/ruby/src/trunk/basictest/test.rb:eval ...........................OK 27 I, [2024-05-10T10:31:19.824244 #2196847] INFO -- : /tmp/ruby/src/trunk/basictest/test.rb:system ........OK 8 I, [2024-05-10T10:31:19.824307 #2196847] INFO -- : /tmp/ruby/src/trunk/basictest/test.rb:const .....OK 5 I, [2024-05-10T10:31:19.824322 #2196847] INFO -- : /tmp/ruby/src/trunk/basictest/test.rb:clone .....OK 5 I, [2024-05-10T10:31:19.824437 #2196847] INFO -- : /tmp/ruby/src/trunk/basictest/test.rb:marshal ....OK 4 I, [2024-05-10T10:31:19.824543 #2196847] INFO -- : /tmp/ruby/src/trunk/basictest/test.rb:pack ....OK 4 I, [2024-05-10T10:31:19.824572 #2196847] INFO -- : /tmp/ruby/src/trunk/basictest/test.rb:math ..OK 2 I, [2024-05-10T10:31:19.824580 #2196847] INFO -- : /tmp/ruby/src/trunk/basictest/test.rb:struct ......OK 6 I, [2024-05-10T10:31:19.824684 #2196847] INFO -- : /tmp/ruby/src/trunk/basictest/test.rb:variable ............OK 12 I, [2024-05-10T10:31:19.824705 #2196847] INFO -- : /tmp/ruby/src/trunk/basictest/test.rb:trace ...OK 3 I, [2024-05-10T10:31:19.824765 #2196847] INFO -- : /tmp/ruby/src/trunk/basictest/test.rb:defined? ............OK 12 I, [2024-05-10T10:31:19.824810 #2196847] INFO -- : /tmp/ruby/src/trunk/basictest/test.rb:alias ......OK 6 I, [2024-05-10T10:31:19.825183 #2196847] INFO -- : /tmp/ruby/src/trunk/basictest/test.rb:path .......................OK 23 I, [2024-05-10T10:31:19.859259 #2196847] INFO -- : /tmp/ruby/src/trunk/basictest/test.rb:gc ....OK 4 I, [2024-05-10T10:31:19.861540 #2196847] INFO -- : I, [2024-05-10T10:31:19.861568 #2196847] INFO -- : test succeeded I, [2024-05-10T10:31:19.863021 #2196847] INFO -- : $$$[end] "make yes-test-basic TESTS='-j20'" exit with 0. I, [2024-05-10T10:31:19.863144 #2196847] INFO -- : $$$[beg] make yes-test-all TESTOPTS='--stderr-on-failure' TESTS='-j20' I, [2024-05-10T10:31:19.949935 #2196847] INFO -- : BASERUBY = /usr/bin/ruby --disable=gems I, [2024-05-10T10:31:19.949972 #2196847] INFO -- : CC = gcc I, [2024-05-10T10:31:19.949979 #2196847] INFO -- : LD = ld I, [2024-05-10T10:31:19.949982 #2196847] INFO -- : LDSHARED = gcc -shared I, [2024-05-10T10:31:19.949986 #2196847] INFO -- : CFLAGS = -O3 -fno-fast-math -ggdb3 -Wall -Wextra -Wdeprecated-declarations -Wdiv-by-zero -Wduplicated-cond -Wimplicit-function-declaration -Wimplicit-int -Wpointer-arith -Wwrite-strings -Wold-style-definition -Wimplicit-fallthrough=0 -Wmissing-noreturn -Wno-cast-function-type -Wno-constant-logical-operand -Wno-long-long -Wno-missing-field-initializers -Wno-overlength-strings -Wno-packed-bitfield-compat -Wno-parentheses-equality -Wno-self-assign -Wno-tautological-compare -Wno-unused-parameter -Wno-unused-value -Wsuggest-attribute=format -Wsuggest-attribute=noreturn -Wunused-variable -Wmisleading-indentation -Wundef -fPIC I, [2024-05-10T10:31:19.949990 #2196847] INFO -- : XCFLAGS = -U_FORTIFY_SOURCE -D_FORTIFY_SOURCE=2 -fstack-protector-strong -fno-strict-overflow -fvisibility=hidden -fexcess-precision=standard -DRUBY_EXPORT -I. -I.ext/include/x86_64-linux -I/tmp/ruby/src/trunk/include -I/tmp/ruby/src/trunk -I/tmp/ruby/src/trunk/prism -I/tmp/ruby/src/trunk/enc/unicode/15.0.0 I, [2024-05-10T10:31:19.949994 #2196847] INFO -- : CPPFLAGS = I, [2024-05-10T10:31:19.949997 #2196847] INFO -- : DLDFLAGS = -Wl,--compress-debug-sections=zlib -Wl,-soname,libruby.so.3.4 -fstack-protector-strong I, [2024-05-10T10:31:19.950001 #2196847] INFO -- : SOLIBS = -lz -lrt -lrt -lgmp -ldl -lcrypt -lm -lpthread I, [2024-05-10T10:31:19.950004 #2196847] INFO -- : LANG = en_US.UTF-8 I, [2024-05-10T10:31:19.950008 #2196847] INFO -- : LC_ALL = I, [2024-05-10T10:31:19.950011 #2196847] INFO -- : LC_CTYPE = I, [2024-05-10T10:31:19.950015 #2196847] INFO -- : MFLAGS = I, [2024-05-10T10:31:19.950018 #2196847] INFO -- : RUSTC = no I, [2024-05-10T10:31:19.950023 #2196847] INFO -- : YJIT_RUSTC_ARGS = --crate-name=yjit --crate-type=staticlib --edition=2021 -g -C lto=thin -C opt-level=3 -C overflow-checks=on '--out-dir=/tmp/ruby/build/trunk/yjit/target/release/' /tmp/ruby/src/trunk/yjit/src/lib.rs I, [2024-05-10T10:31:19.950571 #2196847] INFO -- : gcc (Ubuntu 11.4.0-1ubuntu1~22.04) 11.4.0 I, [2024-05-10T10:31:19.950592 #2196847] INFO -- : Copyright (C) 2021 Free Software Foundation, Inc. I, [2024-05-10T10:31:19.950605 #2196847] INFO -- : This is free software; see the source for copying conditions. There is NO I, [2024-05-10T10:31:19.950610 #2196847] INFO -- : warranty; not even for MERCHANTABILITY or FITNESS FOR A PARTICULAR PURPOSE. I, [2024-05-10T10:31:19.950613 #2196847] INFO -- : I, [2024-05-10T10:31:19.952156 #2196847] INFO -- : generating enc.mk I, [2024-05-10T10:31:20.070726 #2196847] INFO -- : making enc I, [2024-05-10T10:31:20.087711 #2196847] INFO -- : make[1]: Entering directory '/tmp/ruby/build/trunk' I, [2024-05-10T10:31:20.087763 #2196847] INFO -- : make[1]: Nothing to be done for 'enc'. I, [2024-05-10T10:31:20.087776 #2196847] INFO -- : make[1]: Leaving directory '/tmp/ruby/build/trunk' I, [2024-05-10T10:31:20.088331 #2196847] INFO -- : making srcs under enc I, [2024-05-10T10:31:20.117927 #2196847] INFO -- : make[1]: Entering directory '/tmp/ruby/build/trunk' I, [2024-05-10T10:31:20.117989 #2196847] INFO -- : make[1]: Nothing to be done for 'srcs'. I, [2024-05-10T10:31:20.118001 #2196847] INFO -- : make[1]: Leaving directory '/tmp/ruby/build/trunk' I, [2024-05-10T10:31:20.118829 #2196847] INFO -- : generating transdb.h I, [2024-05-10T10:31:20.214649 #2196847] INFO -- : transdb.h unchanged I, [2024-05-10T10:31:20.215934 #2196847] INFO -- : making trans I, [2024-05-10T10:31:20.249794 #2196847] INFO -- : make[1]: Entering directory '/tmp/ruby/build/trunk' I, [2024-05-10T10:31:20.249859 #2196847] INFO -- : make[1]: Nothing to be done for 'trans'. I, [2024-05-10T10:31:20.249872 #2196847] INFO -- : make[1]: Leaving directory '/tmp/ruby/build/trunk' I, [2024-05-10T10:31:20.250524 #2196847] INFO -- : making encs I, [2024-05-10T10:31:20.287602 #2196847] INFO -- : make[1]: Entering directory '/tmp/ruby/build/trunk' I, [2024-05-10T10:31:20.287667 #2196847] INFO -- : make[1]: Nothing to be done for 'encs'. I, [2024-05-10T10:31:20.287681 #2196847] INFO -- : make[1]: Leaving directory '/tmp/ruby/build/trunk' I, [2024-05-10T10:31:20.289393 #2196847] INFO -- : generating makefiles ext/configure-ext.mk I, [2024-05-10T10:31:20.315895 #2196847] INFO -- : ext/configure-ext.mk updated I, [2024-05-10T10:31:20.318416 #2196847] INFO -- : make[1]: Entering directory '/tmp/ruby/build/trunk' I, [2024-05-10T10:31:21.658371 #2196847] INFO -- : make[1]: Leaving directory '/tmp/ruby/build/trunk' I, [2024-05-10T10:31:21.659153 #2196847] INFO -- : generating makefile exts.mk I, [2024-05-10T10:31:21.697017 #2196847] INFO -- : exts.mk unchanged I, [2024-05-10T10:31:21.701266 #2196847] INFO -- : make[1]: Entering directory '/tmp/ruby/build/trunk' I, [2024-05-10T10:31:22.025046 #2196847] INFO -- : make[2]: Entering directory '/tmp/ruby/build/trunk/ext/coverage' I, [2024-05-10T10:31:22.029641 #2196847] INFO -- : make[2]: Leaving directory '/tmp/ruby/build/trunk/ext/coverage' I, [2024-05-10T10:31:22.035819 #2196847] INFO -- : make[2]: Entering directory '/tmp/ruby/build/trunk/ext/date' I, [2024-05-10T10:31:22.040824 #2196847] INFO -- : make[2]: Leaving directory '/tmp/ruby/build/trunk/ext/date' I, [2024-05-10T10:31:22.044794 #2196847] INFO -- : make[2]: Entering directory '/tmp/ruby/build/trunk/ext/digest' I, [2024-05-10T10:31:22.053605 #2196847] INFO -- : make[2]: Leaving directory '/tmp/ruby/build/trunk/ext/digest' I, [2024-05-10T10:31:22.079959 #2196847] INFO -- : make[2]: Entering directory '/tmp/ruby/build/trunk/ext/digest/sha2' I, [2024-05-10T10:31:22.084828 #2196847] INFO -- : make[2]: Leaving directory '/tmp/ruby/build/trunk/ext/digest/sha2' I, [2024-05-10T10:31:22.105948 #2196847] INFO -- : make[2]: Entering directory '/tmp/ruby/build/trunk/ext/fiddle' I, [2024-05-10T10:31:22.116544 #2196847] INFO -- : make[2]: Leaving directory '/tmp/ruby/build/trunk/ext/fiddle' I, [2024-05-10T10:31:22.121572 #2196847] INFO -- : make[2]: Entering directory '/tmp/ruby/build/trunk/ext/io/console' I, [2024-05-10T10:31:22.125771 #2196847] INFO -- : make[2]: Leaving directory '/tmp/ruby/build/trunk/ext/io/console' I, [2024-05-10T10:31:22.138468 #2196847] INFO -- : make[2]: Entering directory '/tmp/ruby/build/trunk/ext/json' I, [2024-05-10T10:31:22.149164 #2196847] INFO -- : make[2]: Leaving directory '/tmp/ruby/build/trunk/ext/json' I, [2024-05-10T10:31:22.164398 #2196847] INFO -- : make[2]: Entering directory '/tmp/ruby/build/trunk/ext/monitor' I, [2024-05-10T10:31:22.168419 #2196847] INFO -- : make[2]: Leaving directory '/tmp/ruby/build/trunk/ext/monitor' I, [2024-05-10T10:31:22.175467 #2196847] INFO -- : make[2]: Entering directory '/tmp/ruby/build/trunk/ext/objspace' I, [2024-05-10T10:31:22.181589 #2196847] INFO -- : make[2]: Leaving directory '/tmp/ruby/build/trunk/ext/objspace' I, [2024-05-10T10:31:22.200770 #2196847] INFO -- : make[2]: Entering directory '/tmp/ruby/build/trunk/ext/openssl' I, [2024-05-10T10:31:22.217124 #2196847] INFO -- : make[2]: Leaving directory '/tmp/ruby/build/trunk/ext/openssl' I, [2024-05-10T10:31:22.220122 #2196847] INFO -- : make[2]: Entering directory '/tmp/ruby/build/trunk/ext/pathname' I, [2024-05-10T10:31:22.222802 #2196847] INFO -- : make[2]: Leaving directory '/tmp/ruby/build/trunk/ext/pathname' I, [2024-05-10T10:31:22.227675 #2196847] INFO -- : make[2]: Entering directory '/tmp/ruby/build/trunk/ext/psych' I, [2024-05-10T10:31:22.243236 #2196847] INFO -- : make[2]: Leaving directory '/tmp/ruby/build/trunk/ext/psych' I, [2024-05-10T10:31:22.246348 #2196847] INFO -- : make[2]: Entering directory '/tmp/ruby/build/trunk/ext/pty' I, [2024-05-10T10:31:22.248937 #2196847] INFO -- : make[2]: Leaving directory '/tmp/ruby/build/trunk/ext/pty' I, [2024-05-10T10:31:22.260485 #2196847] INFO -- : make[2]: Entering directory '/tmp/ruby/build/trunk/ext/ripper' I, [2024-05-10T10:31:22.267623 #2196847] INFO -- : make[2]: Leaving directory '/tmp/ruby/build/trunk/ext/ripper' I, [2024-05-10T10:31:22.269943 #2196847] INFO -- : make[2]: Entering directory '/tmp/ruby/build/trunk/ext/rubyvm' I, [2024-05-10T10:31:22.273210 #2196847] INFO -- : make[2]: Leaving directory '/tmp/ruby/build/trunk/ext/rubyvm' I, [2024-05-10T10:31:22.284245 #2196847] INFO -- : make[2]: Entering directory '/tmp/ruby/build/trunk/ext/socket' I, [2024-05-10T10:31:22.291197 #2196847] INFO -- : make[2]: Leaving directory '/tmp/ruby/build/trunk/ext/socket' I, [2024-05-10T10:31:22.308026 #2196847] INFO -- : make[2]: Entering directory '/tmp/ruby/build/trunk/.bundle/gems/bigdecimal-3.1.8/ext/bigdecimal' I, [2024-05-10T10:31:22.338177 #2196847] INFO -- : make[2]: Leaving directory '/tmp/ruby/build/trunk/.bundle/gems/bigdecimal-3.1.8/ext/bigdecimal' I, [2024-05-10T10:31:22.340101 #2196847] INFO -- : make[2]: Entering directory '/tmp/ruby/build/trunk/.bundle/gems/debug-1.9.2/ext/debug' I, [2024-05-10T10:31:22.363544 #2196847] INFO -- : make[2]: Leaving directory '/tmp/ruby/build/trunk/.bundle/gems/debug-1.9.2/ext/debug' I, [2024-05-10T10:31:22.365653 #2196847] INFO -- : make[2]: Entering directory '/tmp/ruby/build/trunk/.bundle/gems/nkf-0.2.0/ext/nkf' I, [2024-05-10T10:31:22.387648 #2196847] INFO -- : make[2]: Leaving directory '/tmp/ruby/build/trunk/.bundle/gems/nkf-0.2.0/ext/nkf' I, [2024-05-10T10:31:22.389588 #2196847] INFO -- : make[2]: Entering directory '/tmp/ruby/build/trunk/.bundle/gems/racc-1.7.3/ext/racc/cparse' I, [2024-05-10T10:31:22.410687 #2196847] INFO -- : make[2]: Leaving directory '/tmp/ruby/build/trunk/.bundle/gems/racc-1.7.3/ext/racc/cparse' I, [2024-05-10T10:31:22.412990 #2196847] INFO -- : make[2]: Entering directory '/tmp/ruby/build/trunk/.bundle/gems/rbs-3.4.4/ext/rbs_extension' I, [2024-05-10T10:31:22.434666 #2196847] INFO -- : make[2]: Leaving directory '/tmp/ruby/build/trunk/.bundle/gems/rbs-3.4.4/ext/rbs_extension' I, [2024-05-10T10:31:22.436596 #2196847] INFO -- : make[2]: Entering directory '/tmp/ruby/build/trunk/.bundle/gems/syslog-0.1.2/ext/syslog' I, [2024-05-10T10:31:22.457767 #2196847] INFO -- : make[2]: Leaving directory '/tmp/ruby/build/trunk/.bundle/gems/syslog-0.1.2/ext/syslog' I, [2024-05-10T10:31:22.481517 #2196847] INFO -- : make[2]: Entering directory '/tmp/ruby/build/trunk' I, [2024-05-10T10:31:22.553582 #2196847] INFO -- : make[2]: 'ruby' is up to date. I, [2024-05-10T10:31:22.553675 #2196847] INFO -- : make[2]: Leaving directory '/tmp/ruby/build/trunk' I, [2024-05-10T10:31:22.553895 #2196847] INFO -- : make[1]: Leaving directory '/tmp/ruby/build/trunk' I, [2024-05-10T10:31:22.557390 #2196847] INFO -- : make[1]: Entering directory '/tmp/ruby/build/trunk' I, [2024-05-10T10:31:22.557451 #2196847] INFO -- : make[1]: Nothing to be done for 'note'. I, [2024-05-10T10:31:22.557465 #2196847] INFO -- : make[1]: Leaving directory '/tmp/ruby/build/trunk' I, [2024-05-10T10:31:22.634347 #2196847] INFO -- : Run options: I, [2024-05-10T10:31:22.634439 #2196847] INFO -- : --seed=63876 I, [2024-05-10T10:31:22.634453 #2196847] INFO -- : "--ruby=./miniruby -I/tmp/ruby/src/trunk/lib -I. -I.ext/common /tmp/ruby/src/trunk/tool/runruby.rb --extout=.ext -- --disable-gems" I, [2024-05-10T10:31:22.634467 #2196847] INFO -- : --excludes-dir=/tmp/ruby/src/trunk/test/.excludes I, [2024-05-10T10:31:22.634477 #2196847] INFO -- : --name=!/memory_leak/ I, [2024-05-10T10:31:22.634487 #2196847] INFO -- : --stderr-on-failure I, [2024-05-10T10:31:22.634497 #2196847] INFO -- : -j20 I, [2024-05-10T10:31:22.634507 #2196847] INFO -- : I, [2024-05-10T10:31:22.634517 #2196847] INFO -- : # Running tests: I, [2024-05-10T10:31:22.634527 #2196847] INFO -- : I, [2024-05-10T10:31:22.782941 #2196847] INFO -- : [ 1/885] 2238219=test_usrmarshal I, [2024-05-10T10:31:22.783031 #2196847] INFO -- : [ 2/885] 2238207=test_object_references I, [2024-05-10T10:31:22.783111 #2196847] INFO -- : [ 3/885] 2238203=test_gem_resolver_git_specification I, [2024-05-10T10:31:22.783546 #2196847] INFO -- : [ 4/885] 2238204=test_have_func I, [2024-05-10T10:31:22.783695 #2196847] INFO -- : [ 5/885] 2238202=test_stat I, [2024-05-10T10:31:22.784029 #2196847] INFO -- : [ 6/885] 2238205=test_gem_request_set_lockfile_tokenizer I, [2024-05-10T10:31:22.784147 #2196847] INFO -- : [ 7/885] 2238216=test_capacity I, [2024-05-10T10:31:22.784648 #2196847] INFO -- : [ 8/885] 2238217=test_nextafter I, [2024-05-10T10:31:22.784748 #2196847] INFO -- : [ 9/885] 2238220=test_rubygems I, [2024-05-10T10:31:22.784838 #2196847] INFO -- : [ 10/885] 2238215=test_https_proxy I, [2024-05-10T10:31:22.786484 #2196847] INFO -- : [ 11/885] 2238218=test_call I, [2024-05-10T10:31:22.796081 #2196847] INFO -- : [ 12/885] 2238202=test_rubyoptions I, [2024-05-10T10:31:22.799582 #2196847] INFO -- : [ 13/885] 2238216=test_super I, [2024-05-10T10:31:22.803461 #2196847] INFO -- : [ 14/885] 2238206=test_integer I, [2024-05-10T10:31:22.809074 #2196847] INFO -- : [ 15/885] 2238207=test_cgi_modruby I, [2024-05-10T10:31:22.817511 #2196847] INFO -- : [ 16/885] 2238221=test_gem_commands_setup_command I, [2024-05-10T10:31:22.817591 #2196847] INFO -- : [ 17/885] 2238208=test_dryrun I, [2024-05-10T10:31:22.817681 #2196847] INFO -- : [ 18/885] 2238210=desugar_compiler_test I, [2024-05-10T10:31:22.817769 #2196847] INFO -- : [ 19/885] 2238211=test_integer I, [2024-05-10T10:31:22.817853 #2196847] INFO -- : [ 20/885] 2238212=test_env I, [2024-05-10T10:31:22.817939 #2196847] INFO -- : [ 21/885] 2238213=test_rdoc_attr I, [2024-05-10T10:31:22.818040 #2196847] INFO -- : [ 22/885] 2238214=test_gem I, [2024-05-10T10:31:22.821726 #2196847] INFO -- : [ 23/885] 2238207=test_gem_source_lock I, [2024-05-10T10:31:22.824479 #2196847] INFO -- : [ 24/885] 2238209=test_gem_commands_open_command I, [2024-05-10T10:31:22.858670 #2196847] INFO -- : [ 25/885] 2238217=test_dns I, [2024-05-10T10:31:22.867548 #2196847] INFO -- : [ 26/885] 2238208=test_ractor I, [2024-05-10T10:31:22.870581 #2196847] INFO -- : [ 27/885] 2238215=test_registry I, [2024-05-10T10:31:22.872436 #2196847] INFO -- : [ 28/885] 2238215=parse_stream_test I, [2024-05-10T10:31:22.889744 #2196847] INFO -- : [ 29/885] 2238208=test_parser I, [2024-05-10T10:31:22.889802 #2196847] INFO -- : [ 30/885] 2238211=test_cgi_core I, [2024-05-10T10:31:22.903874 #2196847] INFO -- : [ 31/885] 2238218=test_reline_key I, [2024-05-10T10:31:22.910007 #2196847] INFO -- : [ 32/885] 2238211=test_rb_str_dup I, [2024-05-10T10:31:22.910385 #2196847] INFO -- : [ 33/885] 2238211=test_ancdata I, [2024-05-10T10:31:22.917702 #2196847] INFO -- : [ 34/885] 2238208=test_singleton_function I, [2024-05-10T10:31:22.918580 #2196847] INFO -- : [ 35/885] 2238211=test_timeout I, [2024-05-10T10:31:22.927872 #2196847] INFO -- : [ 36/885] 2238210=test_alias I, [2024-05-10T10:31:22.931907 #2196847] INFO -- : [ 37/885] 2238208=test_weakref I, [2024-05-10T10:31:22.954194 #2196847] INFO -- : [ 38/885] 2238218=test_nonblock I, [2024-05-10T10:31:22.974786 #2196847] INFO -- : [ 39/885] 2238215=test_unicode_normalize I, [2024-05-10T10:31:22.976030 #2196847] INFO -- : [ 40/885] 2238218=test_marshal I, [2024-05-10T10:31:22.977222 #2196847] INFO -- : [ 41/885] 2238219=test_debugger_integration I, [2024-05-10T10:31:22.983863 #2196847] INFO -- : [ 42/885] 2238213=test_rendering I, [2024-05-10T10:31:22.986791 #2196847] INFO -- : [ 43/885] 2238205=json_ext_parser_test I, [2024-05-10T10:31:22.995796 #2196847] INFO -- : [ 44/885] 2238205=test_thread I, [2024-05-10T10:31:22.999296 #2196847] INFO -- : [ 45/885] 2238219=test_my_integer I, [2024-05-10T10:31:23.006039 #2196847] INFO -- : [ 46/885] 2238219=test_ractor I, [2024-05-10T10:31:23.025322 #2196847] INFO -- : [ 47/885] 2238208=test_ssl I, [2024-05-10T10:31:23.048503 #2196847] INFO -- : [ 48/885] 2238213=test_gem_specification I, [2024-05-10T10:31:23.067707 #2196847] INFO -- : [ 49/885] 2238207=test_enum I, [2024-05-10T10:31:23.070866 #2196847] INFO -- : [ 50/885] 2238209=test_threadgroup I, [2024-05-10T10:31:23.107494 #2196847] INFO -- : [ 51/885] 2238210=test_resolve_symbol I, [2024-05-10T10:31:23.116943 #2196847] INFO -- : [ 52/885] 2238216=test_complex2 I, [2024-05-10T10:31:23.117914 #2196847] INFO -- : [ 53/885] 2238216=test_gem_package I, [2024-05-10T10:31:23.163377 #2196847] INFO -- : [ 54/885] 2238220=test_have_macro I, [2024-05-10T10:31:23.175000 #2196847] INFO -- : [ 55/885] 2238210=ractor_test I, [2024-05-10T10:31:23.198864 #2196847] INFO -- : [ 56/885] 2238203=test_trace I, [2024-05-10T10:31:23.207969 #2196847] INFO -- : [ 57/885] 2238203=test_time_tz I, [2024-05-10T10:31:23.224812 #2196847] INFO -- : [ 58/885] 2238210=test_win32ole_event I, [2024-05-10T10:31:23.228527 #2196847] INFO -- : [ 59/885] 2238210=test_rdoc_generator_json_index I, [2024-05-10T10:31:23.232209 #2196847] INFO -- : [ 60/885] 2238218=test_gem_ci_detector I, [2024-05-10T10:31:23.267351 #2196847] INFO -- : [ 61/885] 2238203=test_bignum I, [2024-05-10T10:31:23.342942 #2196847] INFO -- : [ 62/885] 2238217=test_rdoc_class_module I, [2024-05-10T10:31:23.352002 #2196847] INFO -- : [ 63/885] 2238219=test_io_wait_uncommon I, [2024-05-10T10:31:23.355273 #2196847] INFO -- : [ 64/885] 2238219=test_arity I, [2024-05-10T10:31:23.357740 #2196847] INFO -- : [ 65/885] 2238203=test_stringio I, [2024-05-10T10:31:23.359311 #2196847] INFO -- : [ 66/885] 2238219=test_win32ole_variable I, [2024-05-10T10:31:23.361309 #2196847] INFO -- : [ 67/885] 2238219=test_win32ole_variant I, [2024-05-10T10:31:23.361698 #2196847] INFO -- : [ 68/885] 2238218=test_rdoc_markup_to_ansi I, [2024-05-10T10:31:23.369631 #2196847] INFO -- : [ 69/885] 2238219=test_history I, [2024-05-10T10:31:23.412182 #2196847] INFO -- : [ 70/885] 2238210=test_mixed_unicode_escapes I, [2024-05-10T10:31:23.414503 #2196847] INFO -- : [ 71/885] 2238210=test_ipaddr I, [2024-05-10T10:31:23.435823 #2196847] INFO -- : [ 72/885] 2238219=test_gem_resolver_api_specification I, [2024-05-10T10:31:23.460940 #2196847] INFO -- : [ 73/885] 2238210=test_merge_keys I, [2024-05-10T10:31:23.472777 #2196847] INFO -- : [ 74/885] 2238203=test_rdoc_extend I, [2024-05-10T10:31:23.490481 #2196847] INFO -- : [ 75/885] 2238210=test_symbol I, [2024-05-10T10:31:23.493966 #2196847] INFO -- : [ 76/885] 2238210=location_test I, [2024-05-10T10:31:23.500045 #2196847] INFO -- : [ 77/885] 2238218=test_coderange I, [2024-05-10T10:31:23.503467 #2196847] INFO -- : [ 78/885] 2238218=test_mailto I, [2024-05-10T10:31:23.516323 #2196847] INFO -- : [ 79/885] 2238218=test_resize I, [2024-05-10T10:31:23.520005 #2196847] INFO -- : [ 80/885] 2238218=test_error_highlight I, [2024-05-10T10:31:23.537554 #2196847] INFO -- : [ 81/885] 2238210=test_rdoc_comment I, [2024-05-10T10:31:23.581146 #2196847] INFO -- : [ 82/885] 2238210=test_rdoc_generator_darkfish I, [2024-05-10T10:31:23.596066 #2196847] INFO -- : [ 83/885] 2238208=test_gem_source_fetch_problem I, [2024-05-10T10:31:23.658059 #2196847] INFO -- : [ 84/885] 2238203=json_generic_object_test I, [2024-05-10T10:31:23.665389 #2196847] INFO -- : [ 85/885] 2238203=test_http_request I, [2024-05-10T10:31:23.680174 #2196847] INFO -- : [ 86/885] 2238221=test_member I, [2024-05-10T10:31:23.683440 #2196847] INFO -- : [ 87/885] 2238220=test_numeric I, [2024-05-10T10:31:23.685680 #2196847] INFO -- : [ 88/885] 2238221=test_word I, [2024-05-10T10:31:23.688096 #2196847] INFO -- : [ 89/885] 2238221=test_gem_commands_cleanup_command I, [2024-05-10T10:31:23.702556 #2196847] INFO -- : [ 90/885] 2238203=test_cgi_multipart I, [2024-05-10T10:31:23.706161 #2196847] INFO -- : [ 91/885] 2238220=test_autoconf I, [2024-05-10T10:31:23.710720 #2196847] INFO -- : [ 92/885] 2238220=test_eval I, [2024-05-10T10:31:23.714015 #2196847] INFO -- : [ 93/885] 2238220=test_dir I, [2024-05-10T10:31:23.715851 #2196847] INFO -- : [ 94/885] 2238219=format_errors_test I, [2024-05-10T10:31:23.740825 #2196847] INFO -- : [ 95/885] 2238208=test_date_ractor I, [2024-05-10T10:31:23.760425 #2196847] INFO -- : [ 96/885] 2238211=test_gem_console_ui I, [2024-05-10T10:31:23.786755 #2196847] INFO -- : [ 97/885] 2238216=test_ractor_compatibility I, [2024-05-10T10:31:23.814532 #2196847] INFO -- : [ 98/885] 2238219=test_unix I, [2024-05-10T10:31:23.838157 #2196847] INFO -- : [ 99/885] 2238207=test_lazy_enumerator I, [2024-05-10T10:31:23.849050 #2196847] INFO -- : [100/885] 2238218=test_enc_associate I, [2024-05-10T10:31:23.853104 #2196847] INFO -- : [101/885] 2238219=test_find_executable I, [2024-05-10T10:31:23.862193 #2196847] INFO -- : [102/885] 2238203=ruby_api_test I, [2024-05-10T10:31:23.881256 #2196847] INFO -- : [103/885] 2238219=test_nofree I, [2024-05-10T10:31:23.885365 #2196847] INFO -- : [104/885] 2238211=test_gem_commands_pristine_command I, [2024-05-10T10:31:23.888267 #2196847] INFO -- : [105/885] 2238219=test_context I, [2024-05-10T10:31:23.900077 #2196847] INFO -- : [106/885] 2238217=test_symbol I, [2024-05-10T10:31:23.920010 #2196847] INFO -- : [107/885] 2238210=test_coder I, [2024-05-10T10:31:23.928286 #2196847] INFO -- : [108/885] 2238210=test_function_entry I, [2024-05-10T10:31:23.929338 #2196847] INFO -- : [109/885] 2238210=test_pkcs7 I, [2024-05-10T10:31:23.961236 #2196847] INFO -- : [110/885] 2238208=test_arith_seq_beg_len_step I, [2024-05-10T10:31:24.006185 #2196847] INFO -- : [111/885] 2238220=test_gem_resolver_requirement_list I, [2024-05-10T10:31:24.007474 #2196847] INFO -- : [112/885] 2238208=test_delete I, [2024-05-10T10:31:24.011466 #2196847] INFO -- : [113/885] 2238220=test_win32ole_method I, [2024-05-10T10:31:24.012472 #2196847] INFO -- : [114/885] 2238208=test_continuation I, [2024-05-10T10:31:24.014476 #2196847] INFO -- : [115/885] 2238220=test_fd_setsize I, [2024-05-10T10:31:24.014654 #2196847] INFO -- : [116/885] 2238220=test_class_name_check I, [2024-05-10T10:31:24.025283 #2196847] INFO -- : [117/885] 2238208=test_keyword I, [2024-05-10T10:31:24.038615 #2196847] INFO -- : [118/885] 2238220=test_pkey_rsa I, [2024-05-10T10:31:24.063530 #2196847] INFO -- : [119/885] 2238219=test_numhash I, [2024-05-10T10:31:24.066932 #2196847] INFO -- : [120/885] 2238219=test_weakkeymap I, [2024-05-10T10:31:24.074667 #2196847] INFO -- : [121/885] 2238209=test_gem_commands_push_command I, [2024-05-10T10:31:24.099044 #2196847] INFO -- : [122/885] 2238203=test_rdoc_markup_hard_break I, [2024-05-10T10:31:24.101427 #2196847] INFO -- : [123/885] 2238203=test_placearg I, [2024-05-10T10:31:24.130863 #2196847] INFO -- : [124/885] 2238210=test_date_strptime I, [2024-05-10T10:31:24.164776 #2196847] INFO -- : [125/885] 2238221=test_gem_package_task I, [2024-05-10T10:31:24.171829 #2196847] INFO -- : [126/885] 2238221=test_gem_platform I, [2024-05-10T10:31:24.197893 #2196847] INFO -- : [127/885] 2238207=test_import I, [2024-05-10T10:31:24.220347 #2196847] INFO -- : [128/885] 2238210=test_not I, [2024-05-10T10:31:24.222443 #2196847] INFO -- : [129/885] 2238210=test_gem_resolver_lock_set I, [2024-05-10T10:31:24.227056 #2196847] INFO -- : [130/885] 2238216=test_rdoc_parser_markdown I, [2024-05-10T10:31:24.229022 #2196847] INFO -- : [131/885] 2238219=test_gem_update_suggestion I, [2024-05-10T10:31:24.243949 #2196847] INFO -- : [132/885] 2238221=test_files_test I, [2024-05-10T10:31:24.275306 #2196847] INFO -- : [133/885] 2238203=test_file_exhaustive I, [2024-05-10T10:31:24.277614 #2196847] INFO -- : [134/885] 2238220=test_logger I, [2024-05-10T10:31:24.283420 #2196847] INFO -- : [135/885] 2238219=test_key_actor_emacs I, [2024-05-10T10:31:24.292279 #2196847] INFO -- : [136/885] 2238220=test_gem_command_manager I, [2024-05-10T10:31:24.311104 #2196847] INFO -- : [137/885] 2238221=test_gem_gemcutter_utilities I, [2024-05-10T10:31:24.368756 #2196847] INFO -- : [138/885] 2238210=test_basicinstructions I, [2024-05-10T10:31:24.369647 #2196847] INFO -- : [139/885] 2238216=test_arithmetic_sequence I, [2024-05-10T10:31:24.377935 #2196847] INFO -- : [140/885] 2238216=heredoc_dedent_test I, [2024-05-10T10:31:24.395449 #2196847] INFO -- : [141/885] 2238219=test_cgi_header I, [2024-05-10T10:31:24.411801 #2196847] INFO -- : [142/885] 2238219=test_object I, [2024-05-10T10:31:24.415282 #2196847] INFO -- : [143/885] 2238219=version_test I, [2024-05-10T10:31:24.420826 #2196847] INFO -- : [144/885] 2238219=test_type I, [2024-05-10T10:31:24.422620 #2196847] INFO -- : [145/885] 2238219=test_ractor I, [2024-05-10T10:31:24.437620 #2196847] INFO -- : [146/885] 2238220=test_pointer I, [2024-05-10T10:31:24.453360 #2196847] INFO -- : [147/885] 2238216=test_func I, [2024-05-10T10:31:24.463618 #2196847] INFO -- : [148/885] 2238218=test_big5 I, [2024-05-10T10:31:24.467846 #2196847] INFO -- : [149/885] 2238218=test_rdoc_rd_block_parser I, [2024-05-10T10:31:24.473324 #2196847] INFO -- : [150/885] 2238210=test_tsort I, [2024-05-10T10:31:24.480210 #2196847] INFO -- : [151/885] 2238210=test_signedness I, [2024-05-10T10:31:24.480284 #2196847] INFO -- : [152/885] 2238204=compiler_test I, [2024-05-10T10:31:24.491587 #2196847] INFO -- : [153/885] 2238219=test_flip I, [2024-05-10T10:31:24.512937 #2196847] INFO -- : [154/885] 2238218=test_change_word I, [2024-05-10T10:31:24.521752 #2196847] INFO -- : [155/885] 2238218=test_ossl I, [2024-05-10T10:31:24.532796 #2196847] INFO -- : [156/885] 2238219=test_normalize I, [2024-05-10T10:31:24.533980 #2196847] INFO -- : [157/885] 2238219=test_timeout I, [2024-05-10T10:31:24.545089 #2196847] INFO -- : [158/885] 2238219=test_gem_local_remote_options I, [2024-05-10T10:31:24.580195 #2196847] INFO -- : [159/885] 2238209=test_ruby_lex I, [2024-05-10T10:31:24.583330 #2196847] INFO -- : [160/885] 2238219=test_object I, [2024-05-10T10:31:24.597519 #2196847] INFO -- : [161/885] 2238204=test_date_arith I, [2024-05-10T10:31:24.603347 #2196847] INFO -- : [162/885] 2238208=test_sleep I, [2024-05-10T10:31:24.610470 #2196847] INFO -- : [163/885] 2238204=test_file I, [2024-05-10T10:31:24.636977 #2196847] INFO -- : [164/885] 2238207=test_force_exit I, [2024-05-10T10:31:24.673423 #2196847] INFO -- : [165/885] 2238221=unescape_test I, [2024-05-10T10:31:24.692786 #2196847] INFO -- : [166/885] 2238220=test_ostruct I, [2024-05-10T10:31:24.736135 #2196847] INFO -- : [167/885] 2238207=bom_test I, [2024-05-10T10:31:24.789356 #2196847] INFO -- : [168/885] 2238209=test_data_error I, [2024-05-10T10:31:24.834447 #2196847] INFO -- : [169/885] 2238220=test_udp I, [2024-05-10T10:31:24.836367 #2196847] INFO -- : [170/885] 2238207=static_inspect_test I, [2024-05-10T10:31:24.838209 #2196847] INFO -- : [171/885] 2238207=test_gem_commands_check_command I, [2024-05-10T10:31:24.841470 #2196847] INFO -- : [172/885] 2238220=test_regexp I, [2024-05-10T10:31:24.864563 #2196847] INFO -- : [173/885] 2238207=errors_test I, [2024-05-10T10:31:24.865661 #2196847] INFO -- : [174/885] 2238209=test_vm_dump I, [2024-05-10T10:31:24.867146 #2196847] INFO -- : [175/885] 2238209=test_rdoc_markup_document I, [2024-05-10T10:31:24.953634 #2196847] INFO -- : [176/885] 2238207=test_integer_comb I, [2024-05-10T10:31:24.971967 #2196847] INFO -- : [177/885] 2238219=test_tmpdir I, [2024-05-10T10:31:25.012017 #2196847] INFO -- : [178/885] 2238209=test_rdoc_ri_paths I, [2024-05-10T10:31:25.022785 #2196847] INFO -- : [179/885] 2238214=test_ts I, [2024-05-10T10:31:25.039841 #2196847] INFO -- : [180/885] 2238209=test_locale I, [2024-05-10T10:31:25.063798 #2196847] INFO -- : [181/885] 2238209=test_addr I, [2024-05-10T10:31:25.065588 #2196847] INFO -- : [182/885] 2238219=library_symbols_test I, [2024-05-10T10:31:25.069013 #2196847] INFO -- : [183/885] 2238219=test_ensured I, [2024-05-10T10:31:25.095828 #2196847] INFO -- : [184/885] 2238209=test_gem_uri_formatter I, [2024-05-10T10:31:25.121823 #2196847] INFO -- : [185/885] 2238209=test_encoding I, [2024-05-10T10:31:25.146159 #2196847] INFO -- : [186/885] 2238219=test_helper I, [2024-05-10T10:31:25.155020 #2196847] INFO -- : [187/885] 2238219=test_erb_command I, [2024-05-10T10:31:25.184087 #2196847] INFO -- : [188/885] 2238211=command_line_test I, [2024-05-10T10:31:25.199587 #2196847] INFO -- : [189/885] 2238219=test_constant I, [2024-05-10T10:31:25.210041 #2196847] INFO -- : [190/885] 2238213=test_pty I, [2024-05-10T10:31:25.282559 #2196847] INFO -- : [191/885] 2238211=test_dup I, [2024-05-10T10:31:25.321946 #2196847] INFO -- : [192/885] 2238216=test_project_sanity I, [2024-05-10T10:31:25.348347 #2196847] INFO -- : [193/885] 2238209=test_range I, [2024-05-10T10:31:25.348959 #2196847] INFO -- : [194/885] 2238216=test_transcode I, [2024-05-10T10:31:25.478579 #2196847] INFO -- : [195/885] 2238211=test_eval I, [2024-05-10T10:31:25.510605 #2196847] INFO -- : [196/885] 2238217=json_generator_test I, [2024-05-10T10:31:25.530112 #2196847] INFO -- : [197/885] 2238214=test_gem_resolver_vendor_set I, [2024-05-10T10:31:25.542295 #2196847] INFO -- : [198/885] 2238214=test_config I, [2024-05-10T10:31:25.551076 #2196847] INFO -- : [199/885] 2238216=test_enumerable I, [2024-05-10T10:31:25.568062 #2196847] INFO -- : [200/885] 2238216=test_gem_safe_marshal I, [2024-05-10T10:31:25.590112 #2196847] INFO -- : [201/885] 2238217=test_gem_resolver_api_set I, [2024-05-10T10:31:25.671131 #2196847] INFO -- : [202/885] 2238213=test_gem_request_set_gem_dependency_api I, [2024-05-10T10:31:25.687553 #2196847] INFO -- : [203/885] 2238211=test_ast I, [2024-05-10T10:31:25.713744 #2196847] INFO -- : [204/885] 2238221=test_lambda I, [2024-05-10T10:31:25.731257 #2196847] INFO -- : [205/885] 2238206=test_jaro_winkler I, [2024-05-10T10:31:25.734155 #2196847] INFO -- : [206/885] 2238212=test_helper I, [2024-05-10T10:31:25.736035 #2196847] INFO -- : [207/885] 2238206=test_random_formatter I, [2024-05-10T10:31:25.755588 #2196847] INFO -- : [208/885] 2238206=test_webauthn_listener I, [2024-05-10T10:31:25.769971 #2196847] INFO -- : [209/885] 2238221=test_rdoc_code_object I, [2024-05-10T10:31:25.789470 #2196847] INFO -- : [210/885] 2238217=test_x509store I, [2024-05-10T10:31:25.819453 #2196847] INFO -- : [211/885] 2238212=test_x509name I, [2024-05-10T10:31:25.864913 #2196847] INFO -- : [212/885] 2238212=test_fips I, [2024-05-10T10:31:25.911055 #2196847] INFO -- : [213/885] 2238213=test_update I, [2024-05-10T10:31:25.917341 #2196847] INFO -- : [214/885] 2238213=test_did_you_mean I, [2024-05-10T10:31:26.017789 #2196847] INFO -- : [215/885] 2238206=test_variable_name_check I, [2024-05-10T10:31:26.022377 #2196847] INFO -- : [216/885] 2238214=test_io_m17n I, [2024-05-10T10:31:26.048987 #2196847] INFO -- : [217/885] 2238213=test_gem_commands_server_command I, [2024-05-10T10:31:26.054182 #2196847] INFO -- : [218/885] 2238206=test_option I, [2024-05-10T10:31:26.055707 #2196847] INFO -- : [219/885] 2238213=test_append I, [2024-05-10T10:31:26.058545 #2196847] INFO -- : [220/885] 2238213=test_tracer I, [2024-05-10T10:31:26.061511 #2196847] INFO -- : [221/885] 2238216=test_cmethod I, [2024-05-10T10:31:26.065961 #2196847] INFO -- : [222/885] 2238216=test_gem_commands_build_command I, [2024-05-10T10:31:26.083507 #2196847] INFO -- : [223/885] 2238217=test_case_comprehensive I, [2024-05-10T10:31:26.103507 #2196847] INFO -- : [224/885] 2238212=test_interned_str I, [2024-05-10T10:31:26.107479 #2196847] INFO -- : [225/885] 2238212=test_class I, [2024-05-10T10:31:26.109951 #2196847] INFO -- : [226/885] 2238213=test_ocsp I, [2024-05-10T10:31:26.127669 #2196847] INFO -- : [227/885] 2238212=test_pkey_dsa I, [2024-05-10T10:31:26.150612 #2196847] INFO -- : [228/885] 2238209=test_scheduler I, [2024-05-10T10:31:26.200727 #2196847] INFO -- : [229/885] 2238206=test_iseq I, [2024-05-10T10:31:26.271126 #2196847] INFO -- : [230/885] 2238221=test_exception_at_throwing I, [2024-05-10T10:31:26.284298 #2196847] INFO -- : [231/885] 2238209=test_rdoc_markup_heading I, [2024-05-10T10:31:26.297836 #2196847] INFO -- : [232/885] 2238209=test_rdoc_markup_pre_process I, [2024-05-10T10:31:26.327435 #2196847] INFO -- : [233/885] 2238221=test_printf I, [2024-05-10T10:31:26.340132 #2196847] INFO -- : [234/885] 2238221=test_stream I, [2024-05-10T10:31:26.346928 #2196847] INFO -- : [235/885] 2238221=test_time I, [2024-05-10T10:31:26.350388 #2196847] INFO -- : [236/885] 2238209=test_webauthn_listener_response I, [2024-05-10T10:31:26.359715 #2196847] INFO -- : [237/885] 2238209=test_to_ary_concat I, [2024-05-10T10:31:26.376476 #2196847] INFO -- : [238/885] 2238216=test_pinned I, [2024-05-10T10:31:26.394036 #2196847] INFO -- : [239/885] 2238216=test_within_pipe I, [2024-05-10T10:31:26.454549 #2196847] INFO -- : [240/885] 2238216=test_gem_bundler_version_finder I, [2024-05-10T10:31:26.466062 #2196847] INFO -- : [241/885] 2238213=test_emoji_breaks I, [2024-05-10T10:31:26.469259 #2196847] INFO -- : [242/885] 2238213=reflection_test I, [2024-05-10T10:31:26.484496 #2196847] INFO -- : [243/885] 2238216=test_beginendblock I, [2024-05-10T10:31:26.532205 #2196847] INFO -- : [244/885] 2238221=test_gem_commands_unpack_command I, [2024-05-10T10:31:26.533775 #2196847] INFO -- : [245/885] 2238213=test_files_lib I, [2024-05-10T10:31:26.820838 #2196847] INFO -- : [246/885] 2238206=test_help I, [2024-05-10T10:31:26.836888 #2196847] INFO -- : [247/885] 2238206=test_rdoc_markup_to_bs I, [2024-05-10T10:31:26.876151 #2196847] INFO -- : [248/885] 2238221=test_digest I, [2024-05-10T10:31:26.879210 #2196847] INFO -- : [249/885] 2238221=test_rdoc_servlet I, [2024-05-10T10:31:26.890103 #2196847] INFO -- : [250/885] 2238216=test_gem_security I, [2024-05-10T10:31:26.940273 #2196847] INFO -- : [251/885] 2238210=test_ractor I, [2024-05-10T10:31:26.986699 #2196847] INFO -- : [252/885] 2238206=test_open3 I, [2024-05-10T10:31:27.002870 #2196847] INFO -- : [253/885] 2238210=test_fiber I, [2024-05-10T10:31:27.029631 #2196847] INFO -- : [254/885] 2238221=test_multi_irb_commands I, [2024-05-10T10:31:27.044125 #2196847] INFO -- : [255/885] 2238221=test_bundled_ca I, [2024-05-10T10:31:27.203741 #2196847] INFO -- : [256/885] 2238207=test_closure I, [2024-05-10T10:31:27.226415 #2196847] INFO -- : [257/885] 2238209=test_popen_deadlock I, [2024-05-10T10:31:27.264468 #2196847] INFO -- : [258/885] 2238214=test_delegate I, [2024-05-10T10:31:27.275018 #2196847] INFO -- : [259/885] 2238214=test_date_marshal I, [2024-05-10T10:31:27.283086 #2196847] INFO -- : [260/885] 2238214=test_mkmf I, [2024-05-10T10:31:27.298577 #2196847] INFO -- : [261/885] 2238214=test_history I, [2024-05-10T10:31:27.372919 #2196847] INFO -- : [262/885] 2238212=test_recursion I, [2024-05-10T10:31:27.375641 #2196847] INFO -- : [263/885] 2238212=test_exit I, [2024-05-10T10:31:27.394376 #2196847] INFO -- : [264/885] 2238214=test_rdoc_generator_pot_po_entry I, [2024-05-10T10:31:27.431789 #2196847] INFO -- : [265/885] 2238219=test_euc_jp I, [2024-05-10T10:31:27.435367 #2196847] INFO -- : [266/885] 2238219=test_acceptable I, [2024-05-10T10:31:27.494094 #2196847] INFO -- : [267/885] 2238214=test_document I, [2024-05-10T10:31:27.501417 #2196847] INFO -- : [268/885] 2238214=test_win32ole_param I, [2024-05-10T10:31:27.502678 #2196847] INFO -- : [269/885] 2238214=test_gem_commands_yank_command I, [2024-05-10T10:31:27.551165 #2196847] INFO -- : [270/885] 2238207=test_pair I, [2024-05-10T10:31:27.559738 #2196847] INFO -- : [271/885] 2238219=test_rdoc_i18n_locale I, [2024-05-10T10:31:27.589112 #2196847] INFO -- : [272/885] 2238212=test_name_error_extension I, [2024-05-10T10:31:27.597527 #2196847] INFO -- : [273/885] 2238212=test_chilled I, [2024-05-10T10:31:27.598935 #2196847] INFO -- : [274/885] 2238212=test_primitive I, [2024-05-10T10:31:27.606478 #2196847] INFO -- : [275/885] 2238212=test_human_typo I, [2024-05-10T10:31:27.612330 #2196847] INFO -- : [276/885] 2238212=test_rbconfig I, [2024-05-10T10:31:27.616510 #2196847] INFO -- : [277/885] 2238212=test_key_stroke I, [2024-05-10T10:31:27.669508 #2196847] INFO -- : [278/885] 2238219=test_color I, [2024-05-10T10:31:27.672396 #2196847] INFO -- : [279/885] 2238212=json_encoding_test I, [2024-05-10T10:31:27.688520 #2196847] INFO -- : [280/885] 2238212=test_rdoc_ri_driver I, [2024-05-10T10:31:27.700755 #2196847] INFO -- : [281/885] 2238219=test_httpheader I, [2024-05-10T10:31:27.767739 #2196847] INFO -- : [282/885] 2238215=test_gem_resolver_local_specification I, [2024-05-10T10:31:27.769460 #2196847] INFO -- : [283/885] 2238219=test_httpresponses I, [2024-05-10T10:31:27.772869 #2196847] INFO -- : [284/885] 2238219=test_encoding I, [2024-05-10T10:31:27.788686 #2196847] INFO -- : [285/885] 2238219=test_set_len I, [2024-05-10T10:31:27.790185 #2196847] INFO -- : [286/885] 2238219=test_sockopt I, [2024-05-10T10:31:27.804769 #2196847] INFO -- : [287/885] 2238219=test_rdoc_markup_to_label I, [2024-05-10T10:31:27.810388 #2196847] INFO -- : [288/885] 2238209=test_install I, [2024-05-10T10:31:27.840243 #2196847] INFO -- : [289/885] 2238219=test_win32ole_param_event I, [2024-05-10T10:31:27.842413 #2196847] INFO -- : [290/885] 2238219=test_bn I, [2024-05-10T10:31:27.866998 #2196847] INFO -- : [291/885] 2238219=test_case_mapping I, [2024-05-10T10:31:27.873460 #2196847] INFO -- : [292/885] 2238219=redundant_return_test I, [2024-05-10T10:31:27.883146 #2196847] INFO -- : [293/885] 2238219=test_path I, [2024-05-10T10:31:27.898399 #2196847] INFO -- : [294/885] 2238219=test_tree_spell_checker I, [2024-05-10T10:31:27.925881 #2196847] INFO -- : [295/885] 2238219=test_http I, [2024-05-10T10:31:27.969612 #2196847] INFO -- : [296/885] 2238212=test_addrinfo I, [2024-05-10T10:31:27.984615 #2196847] INFO -- : [297/885] 2238214=test_bug-14834 I, [2024-05-10T10:31:27.988625 #2196847] INFO -- : [298/885] 2238212=test_rdoc_markup_to_html I, [2024-05-10T10:31:27.991101 #2196847] INFO -- : [299/885] 2238215=test_date_compat I, [2024-05-10T10:31:27.997649 #2196847] INFO -- : [300/885] 2238215=test_compile_prism I, [2024-05-10T10:31:28.000528 #2196847] INFO -- : [301/885] 2238209=test_terminfo I, [2024-05-10T10:31:28.003025 #2196847] INFO -- : [302/885] 2238209=test_lexer I, [2024-05-10T10:31:28.019562 #2196847] INFO -- : [303/885] 2238209=test_thread_cv I, [2024-05-10T10:31:28.066036 #2196847] INFO -- : [304/885] 2238214=test_ssl_session I, [2024-05-10T10:31:28.074145 #2196847] INFO -- : [305/885] 2238212=test_gem_commands_update_command I, [2024-05-10T10:31:28.355897 #2196847] INFO -- : [306/885] 2238221=test_gem_resolver_vendor_specification I, [2024-05-10T10:31:28.380703 #2196847] INFO -- : [307/885] 2238221=test_random I, [2024-05-10T10:31:28.389388 #2196847] INFO -- : [308/885] 2238221=test_notimplement I, [2024-05-10T10:31:28.397027 #2196847] INFO -- : [309/885] 2238221=test_key_event_record I, [2024-05-10T10:31:28.401630 #2196847] INFO -- : [310/885] 2238215=test_gem_uri I, [2024-05-10T10:31:28.434029 #2196847] INFO -- : [311/885] 2238215=test_rdoc_method_attr I, [2024-05-10T10:31:28.453562 #2196847] INFO -- : [312/885] 2238221=test_data I, [2024-05-10T10:31:28.455667 #2196847] INFO -- : [313/885] 2238221=static_literals_test I, [2024-05-10T10:31:28.465089 #2196847] INFO -- : [314/885] 2238221=test_gem_gem_runner I, [2024-05-10T10:31:28.516644 #2196847] INFO -- : [315/885] 2238221=test_filter I, [2024-05-10T10:31:28.532860 #2196847] INFO -- : [316/885] 2238221=test_rdoc_generator_pot I, [2024-05-10T10:31:28.536523 #2196847] INFO -- : [317/885] 2238221=test_unicode I, [2024-05-10T10:31:28.546954 #2196847] INFO -- : [318/885] 2238221=parameters_signature_test I, [2024-05-10T10:31:28.555378 #2196847] INFO -- : [319/885] 2238221=test_koi8 I, [2024-05-10T10:31:28.558909 #2196847] INFO -- : [320/885] 2238221=test_enumerator I, [2024-05-10T10:31:28.563783 #2196847] INFO -- : [321/885] 2238221=test_rdoc_parser_changelog I, [2024-05-10T10:31:28.630747 #2196847] INFO -- : [322/885] 2238221=test_parser I, [2024-05-10T10:31:28.651078 #2196847] INFO -- : [323/885] 2238221=test_method_name_check I, [2024-05-10T10:31:28.656885 #2196847] INFO -- : [324/885] 2238209=test_arith_seq_extract I, [2024-05-10T10:31:28.672887 #2196847] INFO -- : [325/885] 2238221=test_ssl I, [2024-05-10T10:31:28.794274 #2196847] INFO -- : [326/885] 2238209=test_gem_ext_cargo_builder I, [2024-05-10T10:31:28.830118 #2196847] INFO -- : [327/885] 2238215=constant_path_node_test I, [2024-05-10T10:31:28.831884 #2196847] INFO -- : [328/885] 2238209=test_gem_request_set I, [2024-05-10T10:31:28.835635 #2196847] INFO -- : [329/885] 2238215=test_module I, [2024-05-10T10:31:28.884725 #2196847] INFO -- : [330/885] 2238213=test_boolean I, [2024-05-10T10:31:28.890232 #2196847] INFO -- : [331/885] 2238213=test_instrumentation_api I, [2024-05-10T10:31:28.952267 #2196847] INFO -- : [332/885] 2238206=integer_parse_test I, [2024-05-10T10:31:29.012154 #2196847] INFO -- : [333/885] 2238206=test_stringify_symbols I, [2024-05-10T10:31:29.025660 #2196847] INFO -- : [334/885] 2238206=test_monitor I, [2024-05-10T10:31:29.039857 #2196847] INFO -- : [335/885] 2238214=test_buffered_io I, [2024-05-10T10:31:29.098941 #2196847] INFO -- : [336/885] 2238214=test_rubyvm I, [2024-05-10T10:31:29.099572 #2196847] INFO -- : [337/885] 2238214=test_configuration I, [2024-05-10T10:31:29.156192 #2196847] INFO -- : [338/885] 2238209=test_rdoc_generator_markup I, [2024-05-10T10:31:29.164544 #2196847] INFO -- : [339/885] 2238209=test_whileuntil I, [2024-05-10T10:31:29.166099 #2196847] INFO -- : [340/885] 2238214=test_yamldbm I, [2024-05-10T10:31:29.168173 #2196847] INFO -- : [341/885] 2238209=test_gem_commands_rebuild_command I, [2024-05-10T10:31:29.168837 #2196847] INFO -- : [342/885] 2238214=test_load I, [2024-05-10T10:31:29.175874 #2196847] INFO -- : [343/885] 2238214=test_rdoc_parser_simple I, [2024-05-10T10:31:29.183399 #2196847] INFO -- : [344/885] 2238212=test_provider I, [2024-05-10T10:31:29.208888 #2196847] INFO -- : [345/885] 2238214=test_abi I, [2024-05-10T10:31:29.213663 #2196847] INFO -- : [346/885] 2238209=test_evaluation I, [2024-05-10T10:31:29.218363 #2196847] INFO -- : [347/885] 2238209=test_gem_ext_builder I, [2024-05-10T10:31:29.231036 #2196847] INFO -- : [348/885] 2238206=test_https I, [2024-05-10T10:31:29.350405 #2196847] INFO -- : [349/885] 2238214=test_nesting_parser I, [2024-05-10T10:31:29.358107 #2196847] INFO -- : [350/885] 2238214=test_win32ole_method_event I, [2024-05-10T10:31:29.368281 #2196847] INFO -- : [351/885] 2238214=test_benchmark I, [2024-05-10T10:31:29.509142 #2196847] INFO -- : [352/885] 2238212=test_gem_dependency_list I, [2024-05-10T10:31:29.562118 #2196847] INFO -- : [353/885] 2238212=test_helper_method I, [2024-05-10T10:31:29.597328 #2196847] INFO -- : [354/885] 2238212=test_gem_package_tar_writer I, [2024-05-10T10:31:29.605561 #2196847] INFO -- : [355/885] 2238206=test_array I, [2024-05-10T10:31:29.608773 #2196847] INFO -- : [356/885] 2238208=test_gem_commands_outdated_command I, [2024-05-10T10:31:29.665875 #2196847] INFO -- : [357/885] 2238208=test_scalar_scanner I, [2024-05-10T10:31:29.677359 #2196847] INFO -- : [358/885] 2238208=test_gem_source I, [2024-05-10T10:31:29.683595 #2196847] INFO -- : [359/885] 2238212=test_rational2 I, [2024-05-10T10:31:29.693327 #2196847] INFO -- : [360/885] 2238212=test_rational I, [2024-05-10T10:31:29.707185 #2196847] INFO -- : [361/885] 2238212=test_spell_checker I, [2024-05-10T10:31:29.709500 #2196847] INFO -- : [362/885] 2238216=test_propertyputref I, [2024-05-10T10:31:29.711710 #2196847] INFO -- : [363/885] 2238212=attribute_write_test I, [2024-05-10T10:31:29.712008 #2196847] INFO -- : [364/885] 2238216=test_assembler I, [2024-05-10T10:31:29.713647 #2196847] INFO -- : [365/885] 2238212=test_gem_source_installed I, [2024-05-10T10:31:29.714535 #2196847] INFO -- : [366/885] 2238216=test_erb I, [2024-05-10T10:31:29.719397 #2196847] INFO -- : [367/885] 2238212=test_x509ext I, [2024-05-10T10:31:29.724486 #2196847] INFO -- : [368/885] 2238212=test_completion I, [2024-05-10T10:31:29.747268 #2196847] INFO -- : [369/885] 2238216=test_gem_commands_cert_command I, [2024-05-10T10:31:29.801352 #2196847] INFO -- : [370/885] 2238203=test_yield_block I, [2024-05-10T10:31:29.803996 #2196847] INFO -- : [371/885] 2238203=test_len I, [2024-05-10T10:31:29.804761 #2196847] INFO -- : [372/885] 2238203=test_x509crl I, [2024-05-10T10:31:29.931683 #2196847] INFO -- : [373/885] 2238203=test_fixnum I, [2024-05-10T10:31:29.938946 #2196847] INFO -- : [374/885] 2238203=test_signal I, [2024-05-10T10:31:29.964376 #2196847] INFO -- : [375/885] 2238208=test_metaclass I, [2024-05-10T10:31:29.968659 #2196847] INFO -- : [376/885] 2238208=test_rdoc_top_level I, [2024-05-10T10:31:30.150019 #2196847] INFO -- : [377/885] 2238212=test_rdoc_rd I, [2024-05-10T10:31:30.155566 #2196847] INFO -- : [378/885] 2238212=test_cgi_session I, [2024-05-10T10:31:30.162924 #2196847] INFO -- : [379/885] 2238212=test_input_method I, [2024-05-10T10:31:30.186812 #2196847] INFO -- : [380/885] 2238212=test_windows_1252 I, [2024-05-10T10:31:30.190678 #2196847] INFO -- : [381/885] 2238212=test_process I, [2024-05-10T10:31:30.218559 #2196847] INFO -- : [382/885] 2238212=test_cgi_cookie I, [2024-05-10T10:31:30.225403 #2196847] INFO -- : [383/885] 2238212=test_require I, [2024-05-10T10:31:30.228403 #2196847] INFO -- : [384/885] 2238209=test_float I, [2024-05-10T10:31:30.426119 #2196847] INFO -- : [385/885] 2238208=test_gem_resolver_installer_set I, [2024-05-10T10:31:30.550000 #2196847] INFO -- : [386/885] 2238208=test_dir_m17n I, [2024-05-10T10:31:30.664852 #2196847] INFO -- : [387/885] 2238214=test_gem_source_git I, [2024-05-10T10:31:30.682702 #2196847] INFO -- : [388/885] 2238204=test_refinement I, [2024-05-10T10:31:30.856916 #2196847] INFO -- : [389/885] 2238207=test_gem_commands_signout_command I, [2024-05-10T10:31:30.869672 #2196847] INFO -- : [390/885] 2238207=test_regex_casefold I, [2024-05-10T10:31:30.920233 #2196847] INFO -- : [391/885] 2238216=test_gem_security_signer I, [2024-05-10T10:31:31.000180 #2196847] INFO -- : [392/885] 2238216=test_cipher I, [2024-05-10T10:31:31.059543 #2196847] INFO -- : [393/885] 2238216=test_new I, [2024-05-10T10:31:31.059724 #2196847] INFO -- : [394/885] 2238216=test_storage I, [2024-05-10T10:31:31.067003 #2196847] INFO -- : [395/885] 2238216=test_gem_resolver_git_set I, [2024-05-10T10:31:31.100047 #2196847] INFO -- : [396/885] 2238214=test_omap I, [2024-05-10T10:31:31.104851 #2196847] INFO -- : [397/885] 2238214=test_iterator I, [2024-05-10T10:31:31.173910 #2196847] INFO -- : [398/885] 2238214=test_string I, [2024-05-10T10:31:31.173970 #2196847] INFO -- : [399/885] 2238214=test_digest_extend I, [2024-05-10T10:31:31.188774 #2196847] INFO -- : [400/885] 2238214=test_shellwords I, [2024-05-10T10:31:31.194166 #2196847] INFO -- : [401/885] 2238214=test_memory_view I, [2024-05-10T10:31:31.205841 #2196847] INFO -- : [402/885] 2238207=pattern_test I, [2024-05-10T10:31:31.213543 #2196847] INFO -- : [403/885] 2238214=test_debug I, [2024-05-10T10:31:31.217664 #2196847] INFO -- : [404/885] 2238207=test_cparser I, [2024-05-10T10:31:31.225458 #2196847] INFO -- : [405/885] 2238214=test_pkg_config I, [2024-05-10T10:31:31.233186 #2196847] INFO -- : [406/885] 2238214=test_variable I, [2024-05-10T10:31:31.322124 #2196847] INFO -- : [407/885] 2238214=test_sexp I, [2024-05-10T10:31:31.339714 #2196847] INFO -- : [408/885] 2238214=test_rdoc_markup_include I, [2024-05-10T10:31:31.344372 #2196847] INFO -- : [409/885] 2238214=fuzzer_test I, [2024-05-10T10:31:31.345361 #2196847] INFO -- : [410/885] 2238202=magic_comment_test I, [2024-05-10T10:31:31.374222 #2196847] INFO -- : [411/885] 2238216=test_rdoc_markup_to_html_snippet I, [2024-05-10T10:31:31.424458 #2196847] INFO -- : [412/885] 2238202=test_struct I, [2024-05-10T10:31:31.433281 #2196847] INFO -- : [413/885] 2238216=json_common_interface_test I, [2024-05-10T10:31:31.438902 #2196847] INFO -- : [414/885] 2238202=test_dln I, [2024-05-10T10:31:31.441191 #2196847] INFO -- : [415/885] 2238202=test_gem_source_subpath_problem I, [2024-05-10T10:31:31.446949 #2196847] INFO -- : [416/885] 2238214=test_win32ole_variant_outarg I, [2024-05-10T10:31:31.449968 #2196847] INFO -- : [417/885] 2238216=test_config I, [2024-05-10T10:31:31.450847 #2196847] INFO -- : [418/885] 2238214=memsize_test I, [2024-05-10T10:31:31.453716 #2196847] INFO -- : [419/885] 2238214=test_nomethod_error I, [2024-05-10T10:31:31.459710 #2196847] INFO -- : [420/885] 2238214=json_parser_test I, [2024-05-10T10:31:31.475492 #2196847] INFO -- : [421/885] 2238216=test_gem_path_support I, [2024-05-10T10:31:31.514523 #2196847] INFO -- : [422/885] 2238216=test_struct I, [2024-05-10T10:31:31.525898 #2196847] INFO -- : [423/885] 2238214=test_set I, [2024-05-10T10:31:31.554563 #2196847] INFO -- : [424/885] 2238214=test_files_test_1 I, [2024-05-10T10:31:31.578577 #2196847] INFO -- : [425/885] 2238205=test_rdoc_rd_inline I, [2024-05-10T10:31:31.639502 #2196847] INFO -- : [426/885] 2238208=test_mutex I, [2024-05-10T10:31:31.658319 #2196847] INFO -- : [427/885] 2238207=test_x509req I, [2024-05-10T10:31:31.679801 #2196847] INFO -- : [428/885] 2238205=test_key_error I, [2024-05-10T10:31:31.682440 #2196847] INFO -- : [429/885] 2238205=test_allocation I, [2024-05-10T10:31:31.697460 #2196847] INFO -- : [430/885] 2238209=test_div I, [2024-05-10T10:31:31.707878 #2196847] INFO -- : [431/885] 2238209=test_win32ole_variant_m I, [2024-05-10T10:31:31.707932 #2196847] INFO -- : [432/885] 2238209=test_engine I, [2024-05-10T10:31:31.723828 #2196847] INFO -- : [433/885] 2238209=test_color_printer I, [2024-05-10T10:31:31.730440 #2196847] INFO -- : [434/885] 2238209=test_deprecated I, [2024-05-10T10:31:31.732003 #2196847] INFO -- : [435/885] 2238209=test_serialize_subclasses I, [2024-05-10T10:31:31.736806 #2196847] INFO -- : [436/885] 2238209=test_insns_leaf I, [2024-05-10T10:31:31.742094 #2196847] INFO -- : [437/885] 2238209=test_bmethod I, [2024-05-10T10:31:31.746484 #2196847] INFO -- : [438/885] 2238209=test_ractor I, [2024-05-10T10:31:31.748548 #2196847] INFO -- : [439/885] 2238202=test_euc_tw I, [2024-05-10T10:31:31.753495 #2196847] INFO -- : [440/885] 2238202=test_gem_commands_sources_command I, [2024-05-10T10:31:31.759910 #2196847] INFO -- : [441/885] 2238209=test_ansi_without_terminfo I, [2024-05-10T10:31:31.767434 #2196847] INFO -- : [442/885] 2238209=test_nowrite I, [2024-05-10T10:31:31.787209 #2196847] INFO -- : [443/885] 2238209=test_thread_queue I, [2024-05-10T10:31:31.810557 #2196847] INFO -- : [444/885] 2238215=test_rdoc_markup_formatter I, [2024-05-10T10:31:31.814537 #2196847] INFO -- : [445/885] 2238207=test_yaml I, [2024-05-10T10:31:31.818986 #2196847] INFO -- : [446/885] 2238215=test_forwardable I, [2024-05-10T10:31:31.829143 #2196847] INFO -- : [447/885] 2238213=test_handle I, [2024-05-10T10:31:31.843128 #2196847] INFO -- : [448/885] 2238215=test_wait I, [2024-05-10T10:31:31.868926 #2196847] INFO -- : [449/885] 2238207=test_big2str I, [2024-05-10T10:31:31.872400 #2196847] INFO -- : [450/885] 2238207=test_cstr I, [2024-05-10T10:31:31.888697 #2196847] INFO -- : [451/885] 2238215=test_pstore I, [2024-05-10T10:31:31.925989 #2196847] INFO -- : [452/885] 2238215=test_profile_frames I, [2024-05-10T10:31:31.929360 #2196847] INFO -- : [453/885] 2238202=test_gbk I, [2024-05-10T10:31:31.935834 #2196847] INFO -- : [454/885] 2238202=test_class2name I, [2024-05-10T10:31:31.942732 #2196847] INFO -- : [455/885] 2238202=test_enc_str_buf_cat I, [2024-05-10T10:31:31.943905 #2196847] INFO -- : [456/885] 2238202=test_comparable I, [2024-05-10T10:31:31.958640 #2196847] INFO -- : [457/885] 2238202=test_rdoc_parser_c I, [2024-05-10T10:31:32.008726 #2196847] INFO -- : [458/885] 2238203=test_io_timeout I, [2024-05-10T10:31:32.011940 #2196847] INFO -- : [459/885] 2238203=json_fixtures_test I, [2024-05-10T10:31:32.015440 #2196847] INFO -- : [460/885] 2238203=test_shapes I, [2024-05-10T10:31:32.018148 #2196847] INFO -- : [461/885] 2238203=test_ractor I, [2024-05-10T10:31:32.028110 #2196847] INFO -- : [462/885] 2238213=test_find I, [2024-05-10T10:31:32.037924 #2196847] INFO -- : [463/885] 2238213=test_fiddle I, [2024-05-10T10:31:32.080621 #2196847] INFO -- : [464/885] 2238213=test_wss I, [2024-05-10T10:31:32.090055 #2196847] INFO -- : [465/885] 2238215=test_gem_ext_cmake_builder I, [2024-05-10T10:31:32.090510 #2196847] INFO -- : [466/885] 2238203=test_gem_commands_contents_command I, [2024-05-10T10:31:32.092271 #2196847] INFO -- : [467/885] 2238213=test_cgi_util I, [2024-05-10T10:31:32.107017 #2196847] INFO -- : [468/885] 2238215=test_require I, [2024-05-10T10:31:32.161168 #2196847] INFO -- : [469/885] 2238203=test_marshalable I, [2024-05-10T10:31:32.176735 #2196847] INFO -- : [470/885] 2238203=test_digest I, [2024-05-10T10:31:32.226819 #2196847] INFO -- : [471/885] 2238202=test_gem_commands_owner_command I, [2024-05-10T10:31:32.257258 #2196847] INFO -- : [472/885] 2238216=test_gem_source_vendor I, [2024-05-10T10:31:32.265131 #2196847] INFO -- : [473/885] 2238216=test_recorder I, [2024-05-10T10:31:32.268954 #2196847] INFO -- : [474/885] 2238216=test_rdoc_constant I, [2024-05-10T10:31:32.295403 #2196847] INFO -- : [475/885] 2238213=test_deprecate I, [2024-05-10T10:31:32.328584 #2196847] INFO -- : [476/885] 2238213=test_bash_completion I, [2024-05-10T10:31:32.329809 #2196847] INFO -- : [477/885] 2238216=test_formatter I, [2024-05-10T10:31:32.334216 #2196847] INFO -- : [478/885] 2238213=test_gem_available_set I, [2024-05-10T10:31:32.336045 #2196847] INFO -- : [479/885] 2238216=test_rdoc_markdown I, [2024-05-10T10:31:32.417750 #2196847] INFO -- : [480/885] 2238213=test_modify_expand I, [2024-05-10T10:31:32.420874 #2196847] INFO -- : [481/885] 2238213=test_rdoc_any_method I, [2024-05-10T10:31:32.474212 #2196847] INFO -- : [482/885] 2238207=test_file I, [2024-05-10T10:31:32.485609 #2196847] INFO -- : [483/885] 2238207=test_rdoc_encoding I, [2024-05-10T10:31:32.562319 #2196847] INFO -- : [484/885] 2238216=test_coverage I, [2024-05-10T10:31:32.677758 #2196847] INFO -- : [485/885] 2238207=test_gem_package_tar_reader I, [2024-05-10T10:31:32.691449 #2196847] INFO -- : [486/885] 2238213=regexp_test I, [2024-05-10T10:31:32.698255 #2196847] INFO -- : [487/885] 2238213=test_complexrational I, [2024-05-10T10:31:32.704801 #2196847] INFO -- : [488/885] 2238213=test_init I, [2024-05-10T10:31:32.723222 #2196847] INFO -- : [489/885] 2238207=test_pathname I, [2024-05-10T10:31:32.746951 #2196847] INFO -- : [490/885] 2238212=test_irb I, [2024-05-10T10:31:32.772386 #2196847] INFO -- : [491/885] 2238208=test_const I, [2024-05-10T10:31:32.775873 #2196847] INFO -- : [492/885] 2238208=test_class I, [2024-05-10T10:31:32.780922 #2196847] INFO -- : [493/885] 2238202=test_rdoc_normal_class I, [2024-05-10T10:31:32.835418 #2196847] INFO -- : [494/885] 2238202=test_load I, [2024-05-10T10:31:32.843955 #2196847] INFO -- : [495/885] 2238202=json_string_matching_test I, [2024-05-10T10:31:32.848576 #2196847] INFO -- : [496/885] 2238202=test_random I, [2024-05-10T10:31:32.855093 #2196847] INFO -- : [497/885] 2238210=test_asn1 I, [2024-05-10T10:31:32.857579 #2196847] INFO -- : [498/885] 2238202=test_yamlstore I, [2024-05-10T10:31:32.862127 #2196847] INFO -- : [499/885] 2238202=test_gem_installer I, [2024-05-10T10:31:32.872025 #2196847] INFO -- : [500/885] 2238210=test_date_strftime I, [2024-05-10T10:31:32.893808 #2196847] INFO -- : [501/885] 2238206=test_rdoc_parser_rd I, [2024-05-10T10:31:32.925543 #2196847] INFO -- : [502/885] 2238207=test_internal_ivar I, [2024-05-10T10:31:32.928948 #2196847] INFO -- : [503/885] 2238207=test_gem_resolver_index_specification I, [2024-05-10T10:31:32.936317 #2196847] INFO -- : [504/885] 2238212=test_basicsocket I, [2024-05-10T10:31:32.937992 #2196847] INFO -- : [505/885] 2238206=test_utf32 I, [2024-05-10T10:31:32.941800 #2196847] INFO -- : [506/885] 2238212=test_duplicate I, [2024-05-10T10:31:32.944937 #2196847] INFO -- : [507/885] 2238206=test_gem_commands_help_command I, [2024-05-10T10:31:32.946424 #2196847] INFO -- : [508/885] 2238212=test_rdoc_markup I, [2024-05-10T10:31:32.956824 #2196847] INFO -- : [509/885] 2238212=test_prettyprint I, [2024-05-10T10:31:32.973451 #2196847] INFO -- : [510/885] 2238207=test_tracepoint I, [2024-05-10T10:31:32.974294 #2196847] INFO -- : [511/885] 2238212=test_tempfile I, [2024-05-10T10:31:32.978394 #2196847] INFO -- : [512/885] 2238213=parse_comments_test I, [2024-05-10T10:31:32.982045 #2196847] INFO -- : [513/885] 2238213=test_noarg I, [2024-05-10T10:31:33.024770 #2196847] INFO -- : [514/885] 2238203=test_queue I, [2024-05-10T10:31:33.024829 #2196847] INFO -- : [515/885] 2238206=test_function I, [2024-05-10T10:31:33.038227 #2196847] INFO -- : [516/885] 2238203=test_string_processing I, [2024-05-10T10:31:33.091454 #2196847] INFO -- : [517/885] 2238213=test_fileutils I, [2024-05-10T10:31:33.121196 #2196847] INFO -- : [518/885] 2238203=test_resource I, [2024-05-10T10:31:33.127022 #2196847] INFO -- : [519/885] 2238203=test_gem_commands_signin_command I, [2024-05-10T10:31:33.162700 #2196847] INFO -- : [520/885] 2238218=test_emitter I, [2024-05-10T10:31:33.185872 #2196847] INFO -- : [521/885] 2238218=test_ldap I, [2024-05-10T10:31:33.192313 #2196847] INFO -- : [522/885] 2238218=test_gem_version I, [2024-05-10T10:31:33.199371 #2196847] INFO -- : [523/885] 2238207=test_rdoc_options I, [2024-05-10T10:31:33.231498 #2196847] INFO -- : [524/885] 2238203=test_cesu8 I, [2024-05-10T10:31:33.238316 #2196847] INFO -- : [525/885] 2238203=test_econv I, [2024-05-10T10:31:33.252494 #2196847] INFO -- : [526/885] 2238206=test_too_many_dummy_encodings I, [2024-05-10T10:31:33.258074 #2196847] INFO -- : [527/885] 2238215=test_rdoc_include I, [2024-05-10T10:31:33.264416 #2196847] INFO -- : [528/885] 2238218=test_reqarg I, [2024-05-10T10:31:33.275654 #2196847] INFO -- : [529/885] 2238216=test_gem_commands_list_command I, [2024-05-10T10:31:33.283475 #2196847] INFO -- : [530/885] 2238212=test_stack I, [2024-05-10T10:31:33.292490 #2196847] INFO -- : [531/885] 2238215=test_scanner_events I, [2024-05-10T10:31:33.294084 #2196847] INFO -- : [532/885] 2238216=test_gem_resolver_installed_specification I, [2024-05-10T10:31:33.312807 #2196847] INFO -- : [533/885] 2238216=test_mdns I, [2024-05-10T10:31:33.314354 #2196847] INFO -- : [534/885] 2238206=test_parse I, [2024-05-10T10:31:33.322523 #2196847] INFO -- : [535/885] 2238215=test_gem_remote_fetcher I, [2024-05-10T10:31:33.326985 #2196847] INFO -- : [536/885] 2238216=test_rdoc_markup_verbatim I, [2024-05-10T10:31:33.330552 #2196847] INFO -- : [537/885] 2238216=test_inlinecache I, [2024-05-10T10:31:33.393957 #2196847] INFO -- : [538/885] 2238213=test_gem_dependency I, [2024-05-10T10:31:33.399518 #2196847] INFO -- : [539/885] 2238216=test_gem_resolver_specification I, [2024-05-10T10:31:33.411811 #2196847] INFO -- : [540/885] 2238210=test_path_to_class I, [2024-05-10T10:31:33.414914 #2196847] INFO -- : [541/885] 2238210=test_gem_ext_ext_conf_builder I, [2024-05-10T10:31:33.427136 #2196847] INFO -- : [542/885] 2238216=test_frozen_error I, [2024-05-10T10:31:33.431288 #2196847] INFO -- : [543/885] 2238216=test_method_cache I, [2024-05-10T10:31:33.432023 #2196847] INFO -- : [544/885] 2238216=test_gem_stub_specification I, [2024-05-10T10:31:33.433220 #2196847] INFO -- : [545/885] 2238207=test_gem_commands_search_command I, [2024-05-10T10:31:33.440265 #2196847] INFO -- : [546/885] 2238207=test_complex I, [2024-05-10T10:31:33.485645 #2196847] INFO -- : [547/885] 2238220=test_set I, [2024-05-10T10:31:33.491957 #2196847] INFO -- : [548/885] 2238220=test_show_source I, [2024-05-10T10:31:33.496186 #2196847] INFO -- : [549/885] 2238213=test_remote_fetch_error I, [2024-05-10T10:31:33.507321 #2196847] INFO -- : [550/885] 2238213=test_have_library I, [2024-05-10T10:31:33.576352 #2196847] INFO -- : [551/885] 2238207=test_gem_commands_stale_command I, [2024-05-10T10:31:33.586058 #2196847] INFO -- : [552/885] 2238216=test_c_struct_entry I, [2024-05-10T10:31:33.592030 #2196847] INFO -- : [553/885] 2238207=test_lock_native_thread I, [2024-05-10T10:31:33.602086 #2196847] INFO -- : [554/885] 2238220=test_undef I, [2024-05-10T10:31:33.605436 #2196847] INFO -- : [555/885] 2238220=test_line_editor I, [2024-05-10T10:31:33.610905 #2196847] INFO -- : [556/885] 2238220=test_objspace I, [2024-05-10T10:31:33.628112 #2196847] INFO -- : [557/885] 2238218=ripper_test I, [2024-05-10T10:31:33.734630 #2196847] INFO -- : [558/885] 2238214=test_sprintf I, [2024-05-10T10:31:33.790259 #2196847] INFO -- : [559/885] 2238206=test_gem_requirement I, [2024-05-10T10:31:33.814118 #2196847] INFO -- : [560/885] 2238216=comments_test I, [2024-05-10T10:31:33.820612 #2196847] INFO -- : [561/885] 2238216=test_string_memory I, [2024-05-10T10:31:33.844202 #2196847] INFO -- : [562/885] 2238207=test_gem_security_trust_dir I, [2024-05-10T10:31:33.880062 #2196847] INFO -- : [563/885] 2238216=test_m17n I, [2024-05-10T10:31:33.904340 #2196847] INFO -- : [564/885] 2238207=test_gem_commands_environment_command I, [2024-05-10T10:31:33.912367 #2196847] INFO -- : [565/885] 2238206=test_ws I, [2024-05-10T10:31:33.915455 #2196847] INFO -- : [566/885] 2238216=test_yjit I, [2024-05-10T10:31:33.919336 #2196847] INFO -- : [567/885] 2238206=test_workspace I, [2024-05-10T10:31:33.921874 #2196847] INFO -- : [568/885] 2238216=test_weakmap I, [2024-05-10T10:31:33.938069 #2196847] INFO -- : [569/885] 2238214=test_ns_spki I, [2024-05-10T10:31:33.945834 #2196847] INFO -- : [570/885] 2238207=test_framework I, [2024-05-10T10:31:33.959332 #2196847] INFO -- : [571/885] 2238214=test_kill_ring I, [2024-05-10T10:31:33.963338 #2196847] INFO -- : [572/885] 2238207=test_argf I, [2024-05-10T10:31:33.971627 #2196847] INFO -- : [573/885] 2238214=test_win32ole_typelib I, [2024-05-10T10:31:33.973456 #2196847] INFO -- : [574/885] 2238214=test_protect I, [2024-05-10T10:31:33.974453 #2196847] INFO -- : [575/885] 2238205=test_raise_exception I, [2024-05-10T10:31:33.976978 #2196847] INFO -- : [576/885] 2238214=test_gem_request_set_lockfile I, [2024-05-10T10:31:34.092909 #2196847] INFO -- : [577/885] 2238206=test_external_new I, [2024-05-10T10:31:34.100341 #2196847] INFO -- : [578/885] 2238206=test_postponed_job I, [2024-05-10T10:31:34.200641 #2196847] INFO -- : [579/885] 2238212=test_alias_and_anchor I, [2024-05-10T10:31:34.201497 #2196847] INFO -- : [580/885] 2238218=test_hash I, [2024-05-10T10:31:34.206009 #2196847] INFO -- : [581/885] 2238212=test_tree_builder I, [2024-05-10T10:31:34.212805 #2196847] INFO -- : [582/885] 2238212=test_gem_resolver_dependency_request I, [2024-05-10T10:31:34.212872 #2196847] INFO -- : [583/885] 2238218=test_ubf_async_safe I, [2024-05-10T10:31:34.215391 #2196847] INFO -- : [584/885] 2238203=test_hash I, [2024-05-10T10:31:34.219795 #2196847] INFO -- : [585/885] 2238204=test_win32ole_type_event I, [2024-05-10T10:31:34.221513 #2196847] INFO -- : [586/885] 2238218=test_emoji I, [2024-05-10T10:31:34.221593 #2196847] INFO -- : [587/885] 2238204=test_sorted_set I, [2024-05-10T10:31:34.242751 #2196847] INFO -- : [588/885] 2238212=test_io I, [2024-05-10T10:31:34.247836 #2196847] INFO -- : [589/885] 2238218=test_gem_source_specific_file I, [2024-05-10T10:31:34.283228 #2196847] INFO -- : [590/885] 2238214=test_foreach I, [2024-05-10T10:31:34.286539 #2196847] INFO -- : [591/885] 2238214=test_condition I, [2024-05-10T10:31:34.286810 #2196847] INFO -- : [592/885] 2238214=test_gem_commands_uninstall_command I, [2024-05-10T10:31:34.342806 #2196847] INFO -- : [593/885] 2238218=test_cp949 I, [2024-05-10T10:31:34.345093 #2196847] INFO -- : [594/885] 2238218=test_win32ole_record I, [2024-05-10T10:31:34.355077 #2196847] INFO -- : [595/885] 2238218=test_gem_unsatisfiable_dependency_error I, [2024-05-10T10:31:34.364865 #2196847] INFO -- : [596/885] 2238218=test_type_completor I, [2024-05-10T10:31:34.369151 #2196847] INFO -- : [597/885] 2238218=test_summary I, [2024-05-10T10:31:34.436963 #2196847] INFO -- : [598/885] 2238212=test_console_attr I, [2024-05-10T10:31:34.439483 #2196847] INFO -- : [599/885] 2238212=test_date_attr I, [2024-05-10T10:31:34.441314 #2196847] INFO -- : [600/885] 2238212=test_ellipsize I, [2024-05-10T10:31:34.449172 #2196847] INFO -- : [601/885] 2238218=warnings_test I, [2024-05-10T10:31:34.463347 #2196847] INFO -- : [602/885] 2238218=test_kwargs I, [2024-05-10T10:31:34.473088 #2196847] INFO -- : [603/885] 2238218=test_gem_commands_exec_command I, [2024-05-10T10:31:34.481261 #2196847] INFO -- : [604/885] 2238204=test_io_wait I, [2024-05-10T10:31:34.484683 #2196847] INFO -- : [605/885] 2238212=test_ftp I, [2024-05-10T10:31:34.497698 #2196847] INFO -- : [606/885] 2238206=test_rdoc_context_section I, [2024-05-10T10:31:34.500294 #2196847] INFO -- : [607/885] 2238212=test_euc_kr I, [2024-05-10T10:31:34.503870 #2196847] INFO -- : [608/885] 2238212=test_method I, [2024-05-10T10:31:34.509558 #2196847] INFO -- : [609/885] 2238206=test_gem_commands_query_command I, [2024-05-10T10:31:34.540238 #2196847] INFO -- : [610/885] 2238205=test_rdoc_rubygems_hook I, [2024-05-10T10:31:34.574178 #2196847] INFO -- : [611/885] 2238210=test_pattern_key_name_check I, [2024-05-10T10:31:34.584734 #2196847] INFO -- : [612/885] 2238210=test_to_ruby I, [2024-05-10T10:31:34.592725 #2196847] INFO -- : [613/885] 2238210=test_array_create I, [2024-05-10T10:31:34.593684 #2196847] INFO -- : [614/885] 2238210=test_pack I, [2024-05-10T10:31:34.616159 #2196847] INFO -- : [615/885] 2238213=test_gem_impossible_dependencies_error I, [2024-05-10T10:31:34.623543 #2196847] INFO -- : [616/885] 2238213=test_gem_resolver_activation_request I, [2024-05-10T10:31:34.637059 #2196847] INFO -- : [617/885] 2238213=test_protocol I, [2024-05-10T10:31:34.642122 #2196847] INFO -- : [618/885] 2238205=test_getopts I, [2024-05-10T10:31:34.649749 #2196847] INFO -- : [619/885] 2238205=test_ripper I, [2024-05-10T10:31:34.828846 #2196847] INFO -- : [620/885] 2238210=test_gem_config_file I, [2024-05-10T10:31:34.832606 #2196847] INFO -- : [621/885] 2238204=test_etc I, [2024-05-10T10:31:34.893435 #2196847] INFO -- : [622/885] 2238204=test_yjit_exit_locations I, [2024-05-10T10:31:34.894747 #2196847] INFO -- : [623/885] 2238204=test_pkcs12 I, [2024-05-10T10:31:34.911139 #2196847] INFO -- : [624/885] 2238205=test_system I, [2024-05-10T10:31:34.944794 #2196847] INFO -- : [625/885] 2238213=test_iseq_load I, [2024-05-10T10:31:34.955363 #2196847] INFO -- : [626/885] 2238214=test_gem_util I, [2024-05-10T10:31:34.989126 #2196847] INFO -- : [627/885] 2238210=test_gem_package_tar_header I, [2024-05-10T10:31:35.029831 #2196847] INFO -- : [628/885] 2238210=test_bigzero I, [2024-05-10T10:31:35.041369 #2196847] INFO -- : [629/885] 2238210=test_pkey_dh I, [2024-05-10T10:31:35.062232 #2196847] INFO -- : [630/885] 2238206=test_unicode_escape I, [2024-05-10T10:31:35.075940 #2196847] INFO -- : [631/885] 2238214=test_io I, [2024-05-10T10:31:35.139259 #2196847] INFO -- : [632/885] 2238206=test_autoload I, [2024-05-10T10:31:35.162134 #2196847] INFO -- : [633/885] 2238210=test_utf16 I, [2024-05-10T10:31:35.182550 #2196847] INFO -- : [634/885] 2238210=test_rendering I, [2024-05-10T10:31:35.193048 #2196847] INFO -- : [635/885] 2238215=test_face I, [2024-05-10T10:31:35.263471 #2196847] INFO -- : [636/885] 2238215=test_case I, [2024-05-10T10:31:35.275625 #2196847] INFO -- : [637/885] 2238210=test_sizeof I, [2024-05-10T10:31:35.276792 #2196847] INFO -- : [638/885] 2238218=test_yaml_tree I, [2024-05-10T10:31:35.294657 #2196847] INFO -- : [639/885] 2238215=test_config I, [2024-05-10T10:31:35.301322 #2196847] INFO -- : [640/885] 2238218=test_sleep I, [2024-05-10T10:31:35.314976 #2196847] INFO -- : [641/885] 2238208=test_gc I, [2024-05-10T10:31:35.315041 #2196847] INFO -- : [642/885] 2238208=test_gem_commands_fetch_command I, [2024-05-10T10:31:35.352946 #2196847] INFO -- : [643/885] 2238215=test_math I, [2024-05-10T10:31:35.363942 #2196847] INFO -- : [644/885] 2238215=test_libs I, [2024-05-10T10:31:35.385337 #2196847] INFO -- : [645/885] 2238215=test_rdoc_require I, [2024-05-10T10:31:35.406537 #2196847] INFO -- : [646/885] 2238215=locals_test I, [2024-05-10T10:31:35.417169 #2196847] INFO -- : [647/885] 2238204=test_readpartial I, [2024-05-10T10:31:35.431732 #2196847] INFO -- : [648/885] 2238208=test_gem_commands_install_command I, [2024-05-10T10:31:35.664837 #2196847] INFO -- : [649/885] 2238213=test_clone I, [2024-05-10T10:31:35.778007 #2196847] INFO -- : [650/885] 2238215=test_rdoc_task I, [2024-05-10T10:31:35.786043 #2196847] INFO -- : [651/885] 2238215=test_gem_resolver_conflict I, [2024-05-10T10:31:35.795106 #2196847] INFO -- : [652/885] 2238215=test_io_buffer I, [2024-05-10T10:31:35.811491 #2196847] INFO -- : [653/885] 2238205=test_backtrace I, [2024-05-10T10:31:35.824866 #2196847] INFO -- : [654/885] 2238204=test_pack I, [2024-05-10T10:31:35.845672 #2196847] INFO -- : [655/885] 2238204=ruby_parser_test I, [2024-05-10T10:31:35.849127 #2196847] INFO -- : [656/885] 2238204=test_rdoc_markup_indented_paragraph I, [2024-05-10T10:31:35.864604 #2196847] INFO -- : [657/885] 2238213=test_files_sample I, [2024-05-10T10:31:35.867685 #2196847] INFO -- : [658/885] 2238213=test_stringscanner I, [2024-05-10T10:31:35.903416 #2196847] INFO -- : [659/885] 2238215=test_yield I, [2024-05-10T10:31:35.908527 #2196847] INFO -- : [660/885] 2238213=test_rdoc_alias I, [2024-05-10T10:31:35.918671 #2196847] INFO -- : [661/885] 2238213=parser_test I, [2024-05-10T10:31:35.929970 #2196847] INFO -- : [662/885] 2238213=test_convertible I, [2024-05-10T10:31:36.041126 #2196847] INFO -- : [663/885] 2238204=test_array I, [2024-05-10T10:31:36.072170 #2196847] INFO -- : [664/885] 2238204=test_optparse I, [2024-05-10T10:31:36.074792 #2196847] INFO -- : [665/885] 2238209=test_fstring I, [2024-05-10T10:31:36.144121 #2196847] INFO -- : [666/885] 2238204=test_typeddata I, [2024-05-10T10:31:36.237583 #2196847] INFO -- : [667/885] 2238209=encoding_test I, [2024-05-10T10:31:36.321090 #2196847] INFO -- : [668/885] 2238204=test_gem_resolver_best_set I, [2024-05-10T10:31:36.390204 #2196847] INFO -- : [669/885] 2238209=test_rdoc_markup_to_html_crossref I, [2024-05-10T10:31:36.505898 #2196847] INFO -- : [670/885] 2238204=test_webauthn_poller I, [2024-05-10T10:31:36.578407 #2196847] INFO -- : [671/885] 2238208=test_rdoc_markup_raw I, [2024-05-10T10:31:36.581395 #2196847] INFO -- : [672/885] 2238208=test_rat I, [2024-05-10T10:31:36.584303 #2196847] INFO -- : [673/885] 2238208=test_gem_validator I, [2024-05-10T10:31:36.599705 #2196847] INFO -- : [674/885] 2238208=test_files_test_2 I, [2024-05-10T10:31:36.654962 #2196847] INFO -- : [675/885] 2238204=test_fnmatch I, [2024-05-10T10:31:36.671171 #2196847] INFO -- : [676/885] 2238209=test_folderitem2_invokeverb I, [2024-05-10T10:31:36.676815 #2196847] INFO -- : [677/885] 2238209=test_rdoc_markup_parser I, [2024-05-10T10:31:36.689778 #2196847] INFO -- : [678/885] 2238204=test_require_path_check I, [2024-05-10T10:31:36.703985 #2196847] INFO -- : [679/885] 2238209=test_optimization I, [2024-05-10T10:31:36.779777 #2196847] INFO -- : [680/885] 2238221=test_date_conv I, [2024-05-10T10:31:36.782502 #2196847] INFO -- : [681/885] 2238204=test_ole_methods I, [2024-05-10T10:31:36.783983 #2196847] INFO -- : [682/885] 2238204=test_erb_m17n I, [2024-05-10T10:31:36.787118 #2196847] INFO -- : [683/885] 2238221=test_egrep_cpp I, [2024-05-10T10:31:36.790784 #2196847] INFO -- : [684/885] 2238204=test_zlib I, [2024-05-10T10:31:36.945166 #2196847] INFO -- : [685/885] 2238221=test_cgi_tag_helper I, [2024-05-10T10:31:36.970875 #2196847] INFO -- : [686/885] 2238221=test_gem_package_old I, [2024-05-10T10:31:36.983315 #2196847] INFO -- : [687/885] 2238202=test_gem_resolver_index_set I, [2024-05-10T10:31:37.003891 #2196847] INFO -- : [688/885] 2238202=test_proc I, [2024-05-10T10:31:37.012632 #2196847] INFO -- : [689/885] 2238221=test_string I, [2024-05-10T10:31:37.157786 #2196847] INFO -- : [690/885] 2238205=test_gc_compact I, [2024-05-10T10:31:37.319554 #2196847] INFO -- : [691/885] 2238216=test_custom_command I, [2024-05-10T10:31:37.343975 #2196847] INFO -- : [692/885] 2238219=json_addition_test I, [2024-05-10T10:31:37.346419 #2196847] INFO -- : [693/885] 2238218=test_rdoc_parser I, [2024-05-10T10:31:37.366740 #2196847] INFO -- : [694/885] 2238219=test_qsort I, [2024-05-10T10:31:37.369503 #2196847] INFO -- : [695/885] 2238216=test_gem_dependency_resolution_error I, [2024-05-10T10:31:37.372823 #2196847] INFO -- : [696/885] 2238219=test_string I, [2024-05-10T10:31:37.375203 #2196847] INFO -- : [697/885] 2238216=test_pattern_matching I, [2024-05-10T10:31:37.388300 #2196847] INFO -- : [698/885] 2238218=test_rdoc_stats I, [2024-05-10T10:31:37.402375 #2196847] INFO -- : [699/885] 2238216=test_raise I, [2024-05-10T10:31:37.403528 #2196847] INFO -- : [700/885] 2238216=test_x509attr I, [2024-05-10T10:31:37.409809 #2196847] INFO -- : [701/885] 2238216=test_depth_first I, [2024-05-10T10:31:37.415291 #2196847] INFO -- : [702/885] 2238216=test_gem_request_set_lockfile_parser I, [2024-05-10T10:31:37.417751 #2196847] INFO -- : [703/885] 2238219=test_rdoc_store I, [2024-05-10T10:31:37.435991 #2196847] INFO -- : [704/885] 2238218=test_date_parse I, [2024-05-10T10:31:37.511172 #2196847] INFO -- : [705/885] 2238203=test_pkey_ec I, [2024-05-10T10:31:37.515736 #2196847] INFO -- : [706/885] 2238218=test_pipe I, [2024-05-10T10:31:37.568398 #2196847] INFO -- : [707/885] 2238216=test_trick I, [2024-05-10T10:31:37.602886 #2196847] INFO -- : [708/885] 2238203=test_thread I, [2024-05-10T10:31:37.606402 #2196847] INFO -- : [709/885] 2238203=test_default_gems I, [2024-05-10T10:31:37.652930 #2196847] INFO -- : [710/885] 2238203=test_rdoc_markup_to_rdoc I, [2024-05-10T10:31:37.668845 #2196847] INFO -- : [711/885] 2238218=test_rdoc_rd_inline_parser I, [2024-05-10T10:31:37.682357 #2196847] INFO -- : [712/885] 2238218=test_mul I, [2024-05-10T10:31:37.687853 #2196847] INFO -- : [713/885] 2238218=test_null I, [2024-05-10T10:31:37.690842 #2196847] INFO -- : [714/885] 2238203=test_win32ole_type I, [2024-05-10T10:31:37.691748 #2196847] INFO -- : [715/885] 2238218=test_rdoc_markup_attributes I, [2024-05-10T10:31:37.693357 #2196847] INFO -- : [716/885] 2238202=test_rdoc_rdoc I, [2024-05-10T10:31:37.693892 #2196847] INFO -- : [717/885] 2238203=test_windows_1251 I, [2024-05-10T10:31:37.697452 #2196847] INFO -- : [718/885] 2238218=test_time I, [2024-05-10T10:31:37.698570 #2196847] INFO -- : [719/885] 2238203=test_gb18030 I, [2024-05-10T10:31:37.703620 #2196847] INFO -- : [720/885] 2238203=test_buffering I, [2024-05-10T10:31:37.728187 #2196847] INFO -- : [721/885] 2238203=test_svcb_https I, [2024-05-10T10:31:37.733947 #2196847] INFO -- : [722/885] 2238203=test_gem_uninstaller I, [2024-05-10T10:31:37.773768 #2196847] INFO -- : [723/885] 2238207=test_rdoc_i18n_text I, [2024-05-10T10:31:37.777958 #2196847] INFO -- : [724/885] 2238207=test_key_name_check I, [2024-05-10T10:31:37.787421 #2196847] INFO -- : [725/885] 2238202=test_defined I, [2024-05-10T10:31:37.793513 #2196847] INFO -- : [726/885] 2238207=test_backtrace I, [2024-05-10T10:31:37.794873 #2196847] INFO -- : [727/885] 2238207=test_io_buffer I, [2024-05-10T10:31:37.838844 #2196847] INFO -- : [728/885] 2238207=test_kdf I, [2024-05-10T10:31:37.850914 #2196847] INFO -- : [729/885] 2238218=test_gem_doctor I, [2024-05-10T10:31:37.903631 #2196847] INFO -- : [730/885] 2238202=dispatcher_test I, [2024-05-10T10:31:37.907795 #2196847] INFO -- : [731/885] 2238207=test_eval_history I, [2024-05-10T10:31:37.918027 #2196847] INFO -- : [732/885] 2238207=test_kernel I, [2024-05-10T10:31:37.922669 #2196847] INFO -- : [733/885] 2238202=test_bug-5832 I, [2024-05-10T10:31:37.926046 #2196847] INFO -- : [734/885] 2238202=test_files_ext I, [2024-05-10T10:31:37.934793 #2196847] INFO -- : [735/885] 2238218=test_gem_silent_ui I, [2024-05-10T10:31:37.990524 #2196847] INFO -- : [736/885] 2238218=test_emitter I, [2024-05-10T10:31:38.010468 #2196847] INFO -- : [737/885] 2238218=test_object_create_start I, [2024-05-10T10:31:38.015129 #2196847] INFO -- : [738/885] 2238218=test_gem_rdoc I, [2024-05-10T10:31:38.037548 #2196847] INFO -- : [739/885] 2238202=test_date I, [2024-05-10T10:31:38.041555 #2196847] INFO -- : [740/885] 2238202=test_gem_ext_cargo_builder_unit I, [2024-05-10T10:31:38.068303 #2196847] INFO -- : [741/885] 2238202=test_at_exit I, [2024-05-10T10:31:38.095922 #2196847] INFO -- : [742/885] 2238202=test_command I, [2024-05-10T10:31:38.100436 #2196847] INFO -- : [743/885] 2238219=test_rdoc_markup_paragraph I, [2024-05-10T10:31:38.101083 #2196847] INFO -- : [744/885] 2238219=!Nothing_to_test I, [2024-05-10T10:31:38.103451 #2196847] INFO -- : [745/885] 2238219=test_psych I, [2024-05-10T10:31:38.121072 #2196847] INFO -- : [746/885] 2238219=test_enc_raise I, [2024-05-10T10:31:38.121443 #2196847] INFO -- : [747/885] 2238218=test_gem_commands_lock_command I, [2024-05-10T10:31:38.129424 #2196847] INFO -- : [748/885] 2238219=test_assignment I, [2024-05-10T10:31:38.145059 #2196847] INFO -- : [749/885] 2238218=test_ifunless I, [2024-05-10T10:31:38.170622 #2196847] INFO -- : [750/885] 2238218=test_numeric I, [2024-05-10T10:31:38.250142 #2196847] INFO -- : [751/885] 2238218=test_gem_spec_fetcher I, [2024-05-10T10:31:38.264319 #2196847] INFO -- : [752/885] 2238210=test_common I, [2024-05-10T10:31:38.393459 #2196847] INFO -- : [753/885] 2238218=test_key_actor_vi I, [2024-05-10T10:31:38.394944 #2196847] INFO -- : [754/885] 2238207=test_bug-3571 I, [2024-05-10T10:31:38.414683 #2196847] INFO -- : [755/885] 2238207=test_gem_command I, [2024-05-10T10:31:38.469422 #2196847] INFO -- : [756/885] 2238210=test_rdoc_markup_to_tt_only I, [2024-05-10T10:31:38.479913 #2196847] INFO -- : [757/885] 2238218=test_hmac I, [2024-05-10T10:31:38.483850 #2196847] INFO -- : [758/885] 2238218=test_rdoc_tom_doc I, [2024-05-10T10:31:38.491095 #2196847] INFO -- : [759/885] 2238210=test_pp I, [2024-05-10T10:31:38.497924 #2196847] INFO -- : [760/885] 2238202=test_frozen I, [2024-05-10T10:31:38.498464 #2196847] INFO -- : [761/885] 2238202=test_gem_ext_configure_builder I, [2024-05-10T10:31:38.504725 #2196847] INFO -- : [762/885] 2238207=test_macro I, [2024-05-10T10:31:38.504795 #2196847] INFO -- : [763/885] 2238218=test_rdoc_single_class I, [2024-05-10T10:31:38.514168 #2196847] INFO -- : [764/885] 2238218=test_num2int I, [2024-05-10T10:31:38.515064 #2196847] INFO -- : [765/885] 2238207=test_nil I, [2024-05-10T10:31:38.522013 #2196847] INFO -- : [766/885] 2238218=test_verbose I, [2024-05-10T10:31:38.525207 #2196847] INFO -- : [767/885] 2238207=test_iter_break I, [2024-05-10T10:31:38.527363 #2196847] INFO -- : [768/885] 2238210=test_exception I, [2024-05-10T10:31:38.537897 #2196847] INFO -- : [769/885] 2238207=test_zsh_completion I, [2024-05-10T10:31:38.538516 #2196847] INFO -- : [770/885] 2238218=test_address_resolve I, [2024-05-10T10:31:38.540860 #2196847] INFO -- : [771/885] 2238207=test_rdoc_token_stream I, [2024-05-10T10:31:38.542467 #2196847] INFO -- : [772/885] 2238210=test_optarg I, [2024-05-10T10:31:38.548156 #2196847] INFO -- : [773/885] 2238215=test_yaml_special_cases I, [2024-05-10T10:31:38.552492 #2196847] INFO -- : [774/885] 2238202=test_gem_source_list I, [2024-05-10T10:31:38.559578 #2196847] INFO -- : [775/885] 2238207=test_config I, [2024-05-10T10:31:38.564446 #2196847] INFO -- : [776/885] 2238215=test_stringchar I, [2024-05-10T10:31:38.576529 #2196847] INFO -- : [777/885] 2238218=test_hash_create I, [2024-05-10T10:31:38.582751 #2196847] INFO -- : [778/885] 2238207=newline_test I, [2024-05-10T10:31:38.587196 #2196847] INFO -- : [779/885] 2238218=test_uncorrectable_name_check I, [2024-05-10T10:31:38.592379 #2196847] INFO -- : [780/885] 2238218=test_thread_fd_close I, [2024-05-10T10:31:38.597882 #2196847] INFO -- : [781/885] 2238218=test_passing_block I, [2024-05-10T10:31:38.601535 #2196847] INFO -- : [782/885] 2238218=test_logperiod I, [2024-05-10T10:31:38.612385 #2196847] INFO -- : [783/885] 2238202=test_c_union_entity I, [2024-05-10T10:31:38.613195 #2196847] INFO -- : [784/885] 2238218=test_rdoc_normal_module I, [2024-05-10T10:31:38.634779 #2196847] INFO -- : [785/885] 2238215=test_rdoc_markdown_test I, [2024-05-10T10:31:38.644630 #2196847] INFO -- : [786/885] 2238203=test_securerandom I, [2024-05-10T10:31:38.665346 #2196847] INFO -- : [787/885] 2238202=test_switch_hitter I, [2024-05-10T10:31:38.677358 #2196847] INFO -- : [788/885] 2238202=test_io_console I, [2024-05-10T10:31:38.679479 #2196847] INFO -- : [789/885] 2238210=test_singleton I, [2024-05-10T10:31:38.685091 #2196847] INFO -- : [790/885] 2238210=test_flush I, [2024-05-10T10:31:38.689174 #2196847] INFO -- : [791/885] 2238210=test_logdevice I, [2024-05-10T10:31:38.697887 #2196847] INFO -- : [792/885] 2238207=test_gem_ext_rake_builder I, [2024-05-10T10:31:38.707838 #2196847] INFO -- : [793/885] 2238218=test_arity I, [2024-05-10T10:31:38.713974 #2196847] INFO -- : [794/885] 2238203=test_x509cert I, [2024-05-10T10:31:38.717013 #2196847] INFO -- : [795/885] 2238218=test_gc I, [2024-05-10T10:31:38.977315 #2196847] INFO -- : [796/885] 2238203=test_gem_resolver_lock_specification I, [2024-05-10T10:31:39.007555 #2196847] INFO -- : [797/885] 2238203=test_err_in_callback I, [2024-05-10T10:31:39.017782 #2196847] INFO -- : [798/885] 2238203=test_pack I, [2024-05-10T10:31:39.188996 #2196847] INFO -- : [799/885] 2238203=test_process I, [2024-05-10T10:31:39.311540 #2196847] INFO -- : [800/885] 2238204=test_last_thread I, [2024-05-10T10:31:39.333236 #2196847] INFO -- : [801/885] 2238207=test_gem_source_local I, [2024-05-10T10:31:39.435921 #2196847] INFO -- : [802/885] 2238206=test_gem_security_policy I, [2024-05-10T10:31:39.464374 #2196847] INFO -- : [803/885] 2238210=test_gem_resolver I, [2024-05-10T10:31:39.481213 #2196847] INFO -- : [804/885] 2238215=test_gem_resolver_composed_set I, [2024-05-10T10:31:39.503909 #2196847] INFO -- : [805/885] 2238215=test_safe_load I, [2024-05-10T10:31:39.516780 #2196847] INFO -- : [806/885] 2238215=test_gem_commands_dependency_command I, [2024-05-10T10:31:39.590138 #2196847] INFO -- : [807/885] 2238207=test_rdoc_markup_attribute_manager I, [2024-05-10T10:31:39.620312 #2196847] INFO -- : [808/885] 2238215=test_name_error I, [2024-05-10T10:31:39.626280 #2196847] INFO -- : [809/885] 2238207=test_inadvertent_creation I, [2024-05-10T10:31:39.630292 #2196847] INFO -- : [810/885] 2238205=test_flags I, [2024-05-10T10:31:39.668627 #2196847] INFO -- : [811/885] 2238210=test_enumerator I, [2024-05-10T10:31:39.670559 #2196847] INFO -- : [812/885] 2238216=test_http I, [2024-05-10T10:31:39.688185 #2196847] INFO -- : [813/885] 2238216=test_shift_jis I, [2024-05-10T10:31:39.689657 #2196847] INFO -- : [814/885] 2238216=test_gem_commands_which_command I, [2024-05-10T10:31:39.720105 #2196847] INFO -- : [815/885] 2238215=test_gem_commands_specification_command I, [2024-05-10T10:31:39.725487 #2196847] INFO -- : [816/885] 2238216=test_rdoc_text I, [2024-05-10T10:31:39.731027 #2196847] INFO -- : [817/885] 2238206=test_tcp I, [2024-05-10T10:31:39.766944 #2196847] INFO -- : [818/885] 2238216=test_iso_8859 I, [2024-05-10T10:31:39.768907 #2196847] INFO -- : [819/885] 2238207=test_date_time I, [2024-05-10T10:31:39.779106 #2196847] INFO -- : [820/885] 2238207=test_rdoc_markup_to_joined_paragraph I, [2024-05-10T10:31:39.785596 #2196847] INFO -- : [821/885] 2238207=test_require I, [2024-05-10T10:31:39.788797 #2196847] INFO -- : [822/885] 2238207=test_data I, [2024-05-10T10:31:39.792027 #2196847] INFO -- : [823/885] 2238216=test_date_new I, [2024-05-10T10:31:39.795293 #2196847] INFO -- : [824/885] 2238207=index_write_test I, [2024-05-10T10:31:39.798412 #2196847] INFO -- : [825/885] 2238216=test_syntax I, [2024-05-10T10:31:39.801214 #2196847] INFO -- : [826/885] 2238207=test_gem_safe_yaml I, [2024-05-10T10:31:39.808177 #2196847] INFO -- : [827/885] 2238207=test_rdoc_parser_ruby I, [2024-05-10T10:31:39.810632 #2196847] INFO -- : [828/885] 2238206=test_httpresponse I, [2024-05-10T10:31:39.817529 #2196847] INFO -- : [829/885] 2238219=test_open-uri I, [2024-05-10T10:31:39.833431 #2196847] INFO -- : [830/885] 2238215=test_nil2vtempty I, [2024-05-10T10:31:39.835866 #2196847] INFO -- : [831/885] 2238215=test_stream I, [2024-05-10T10:31:39.845445 #2196847] INFO -- : [832/885] 2238215=test_rdoc_context I, [2024-05-10T10:31:39.848028 #2196847] INFO -- : [833/885] 2238206=test_exception I, [2024-05-10T10:31:39.855593 #2196847] INFO -- : [834/885] 2238208=test_gem_name_tuple I, [2024-05-10T10:31:39.872192 #2196847] INFO -- : [835/885] 2238208=test_gem_package_tar_reader_entry I, [2024-05-10T10:31:40.049671 #2196847] INFO -- : [836/885] 2238208=test_rand I, [2024-05-10T10:31:40.155929 #2196847] INFO -- : [837/885] 2238219=test_bug_reporter I, [2024-05-10T10:31:40.312295 #2196847] INFO -- : [838/885] 2238208=test_gem_commands_info_command I, [2024-05-10T10:31:40.337782 #2196847] INFO -- : [839/885] 2238208=test_gem_dependency_installer I, [2024-05-10T10:31:40.370302 #2196847] INFO -- : [840/885] 2238204=test_scalar I, [2024-05-10T10:31:40.374150 #2196847] INFO -- : [841/885] 2238204=test_rdoc_cross_reference I, [2024-05-10T10:31:40.421986 #2196847] INFO -- : [842/885] 2238212=test_store I, [2024-05-10T10:31:40.450633 #2196847] INFO -- : [843/885] 2238213=test_case_options I, [2024-05-10T10:31:40.458633 #2196847] INFO -- : [844/885] 2238213=test_scan_args I, [2024-05-10T10:31:40.466974 #2196847] INFO -- : [845/885] 2238213=test_win32ole I, [2024-05-10T10:31:40.472733 #2196847] INFO -- : [846/885] 2238213=test_generic I, [2024-05-10T10:31:40.504350 #2196847] INFO -- : [847/885] 2238213=test_gem_text I, [2024-05-10T10:31:40.523841 #2196847] INFO -- : [848/885] 2238219=test_settracefunc I, [2024-05-10T10:31:40.571907 #2196847] INFO -- : [849/885] 2238213=test_enumerator_kw I, [2024-05-10T10:31:40.575515 #2196847] INFO -- : [850/885] 2238213=test_gem_ext_cargo_builder_link_flag_converter I, [2024-05-10T10:31:40.586781 #2196847] INFO -- : [851/885] 2238212=test_gem_commands_mirror I, [2024-05-10T10:31:40.593633 #2196847] INFO -- : [852/885] 2238212=test_sprintf_comb I, [2024-05-10T10:31:40.610901 #2196847] INFO -- : [853/885] 2238207=test_gem_request I, [2024-05-10T10:31:40.654108 #2196847] INFO -- : [854/885] 2238213=test_method_cache I, [2024-05-10T10:31:40.659410 #2196847] INFO -- : [855/885] 2238213=test_ractor I, [2024-05-10T10:31:40.728259 #2196847] INFO -- : [856/885] 2238213=test_m17n_comb I, [2024-05-10T10:31:40.728321 #2196847] INFO -- : [857/885] 2238215=test_memory_view I, [2024-05-10T10:31:40.743859 #2196847] INFO -- : [858/885] 2238205=test_rdoc_markup_to_markdown I, [2024-05-10T10:31:40.780300 #2196847] INFO -- : [859/885] 2238212=test_json_tree I, [2024-05-10T10:31:40.801169 #2196847] INFO -- : [860/885] 2238212=test_ansi_with_terminfo I, [2024-05-10T10:31:40.804444 #2196847] INFO -- : [861/885] 2238212=test_rdoc_generator_pot_po I, [2024-05-10T10:31:40.806782 #2196847] INFO -- : [862/885] 2238207=test_reline I, [2024-05-10T10:31:40.809909 #2196847] INFO -- : [863/885] 2238212=test_parser_events I, [2024-05-10T10:31:40.815769 #2196847] INFO -- : [864/885] 2238205=test_pkey I, [2024-05-10T10:31:40.841851 #2196847] INFO -- : [865/885] 2238204=test_case I, [2024-05-10T10:31:40.842022 #2196847] INFO -- : [866/885] 2238204=test_grapheme_breaks I, [2024-05-10T10:31:40.863917 #2196847] INFO -- : [867/885] 2238204=test_gem_version_option I, [2024-05-10T10:31:40.867608 #2196847] INFO -- : [868/885] 2238212=test_gem_request_connection_pools I, [2024-05-10T10:31:40.882230 #2196847] INFO -- : [869/885] 2238205=test_cclass I, [2024-05-10T10:31:40.906831 #2196847] INFO -- : [870/885] 2238204=test_c_struct_builder I, [2024-05-10T10:31:40.985531 #2196847] INFO -- : [871/885] 2238207=test_dot_dot I, [2024-05-10T10:31:40.986249 #2196847] INFO -- : [872/885] 2238207=test_str2big I, [2024-05-10T10:31:40.992952 #2196847] INFO -- : [873/885] 2238207=test_literal I, [2024-05-10T10:31:41.010830 #2196847] INFO -- : [874/885] 2238204=test_objectspace I, [2024-05-10T10:31:41.041127 #2196847] INFO -- : [875/885] 2238205=test_socket I, [2024-05-10T10:31:41.041360 #2196847] INFO -- : [876/885] 2238215=test_thread I, [2024-05-10T10:31:41.267874 #2196847] INFO -- : [877/885] 2238215=test_rdoc_markup_to_table_of_contents I, [2024-05-10T10:31:41.285483 #2196847] INFO -- : [878/885] 2238215=parse_test I, [2024-05-10T10:31:41.392490 #2196847] INFO -- : [879/885] 2238202=test_gem_install_update_options I, [2024-05-10T10:31:41.515907 #2196847] INFO -- : [880/885] 2238202=test_require_lib I, [2024-05-10T10:31:41.635792 #2196847] INFO -- : [881/885] 2238219=test_severity I, [2024-05-10T10:31:41.644280 #2196847] INFO -- : [882/885] 2238219=test_ractor I, [2024-05-10T10:31:41.663067 #2196847] INFO -- : [883/885] 2238219=test_rdoc_generator_ri I, [2024-05-10T10:31:41.666425 #2196847] INFO -- : [884/885] 2238219=test_extlibs I, [2024-05-10T10:31:41.715493 #2196847] INFO -- : [885/885] 2238207=test_gem_stream_ui I, [2024-05-10T10:31:56.338071 #2196847] INFO -- : Finished tests in 33.708643s, 782.6183 tests/s, 277463.0565 assertions/s. E, [2024-05-10T10:31:56.338225 #2196847] ERROR -- : Children under /tmp/rubytest.dxhm0o: E, [2024-05-10T10:31:56.338262 #2196847] ERROR -- : * drwx------ 4 80 2024-05-10 10:31:29 +0000 gem_rebuild20240510-2238209-h0vwz2/ E, [2024-05-10T10:31:56.338276 #2196847] ERROR -- : * drwxrwxr-x 2 60 2024-05-10 10:31:29 +0000 new/ E, [2024-05-10T10:31:56.338289 #2196847] ERROR -- : * -rw-rw-r-- 1 4096 2024-05-10 10:31:29 +0000 rebuild_test_gem-1.0.0.gem E, [2024-05-10T10:31:56.338300 #2196847] ERROR -- : * drwxrwxr-x 2 60 2024-05-10 10:31:29 +0000 old/ E, [2024-05-10T10:31:56.338310 #2196847] ERROR -- : * -rw-rw-r-- 1 4096 2024-05-10 10:31:29 +0000 rebuild_test_gem-1.0.0.gem I, [2024-05-10T10:31:56.339648 #2196847] INFO -- : 26381 tests, 9352903 assertions, 0 failures, 0 errors, 306 skips I, [2024-05-10T10:31:56.339673 #2196847] INFO -- : I, [2024-05-10T10:31:56.339679 #2196847] INFO -- : ruby -v: ruby 3.4.0dev (2024-05-10T09:39:11Z master 69d0a3b033) [x86_64-linux] I, [2024-05-10T10:31:56.341876 #2196847] INFO -- : $$$[end] "make yes-test-all TESTOPTS='--stderr-on-failure' TESTS='-j20'" exit with 0. I, [2024-05-10T10:31:56.342066 #2196847] INFO -- : $$$[beg] make yes-test-rubyspec MSPECOPT='--error-output stderr --debug -j' TESTS='-j20' I, [2024-05-10T10:31:56.430183 #2196847] INFO -- : BASERUBY = /usr/bin/ruby --disable=gems I, [2024-05-10T10:31:56.430215 #2196847] INFO -- : CC = gcc I, [2024-05-10T10:31:56.430221 #2196847] INFO -- : LD = ld I, [2024-05-10T10:31:56.430225 #2196847] INFO -- : LDSHARED = gcc -shared I, [2024-05-10T10:31:56.430230 #2196847] INFO -- : CFLAGS = -O3 -fno-fast-math -ggdb3 -Wall -Wextra -Wdeprecated-declarations -Wdiv-by-zero -Wduplicated-cond -Wimplicit-function-declaration -Wimplicit-int -Wpointer-arith -Wwrite-strings -Wold-style-definition -Wimplicit-fallthrough=0 -Wmissing-noreturn -Wno-cast-function-type -Wno-constant-logical-operand -Wno-long-long -Wno-missing-field-initializers -Wno-overlength-strings -Wno-packed-bitfield-compat -Wno-parentheses-equality -Wno-self-assign -Wno-tautological-compare -Wno-unused-parameter -Wno-unused-value -Wsuggest-attribute=format -Wsuggest-attribute=noreturn -Wunused-variable -Wmisleading-indentation -Wundef -fPIC I, [2024-05-10T10:31:56.430234 #2196847] INFO -- : XCFLAGS = -U_FORTIFY_SOURCE -D_FORTIFY_SOURCE=2 -fstack-protector-strong -fno-strict-overflow -fvisibility=hidden -fexcess-precision=standard -DRUBY_EXPORT -I. -I.ext/include/x86_64-linux -I/tmp/ruby/src/trunk/include -I/tmp/ruby/src/trunk -I/tmp/ruby/src/trunk/prism -I/tmp/ruby/src/trunk/enc/unicode/15.0.0 I, [2024-05-10T10:31:56.430238 #2196847] INFO -- : CPPFLAGS = I, [2024-05-10T10:31:56.430242 #2196847] INFO -- : DLDFLAGS = -Wl,--compress-debug-sections=zlib -Wl,-soname,libruby.so.3.4 -fstack-protector-strong I, [2024-05-10T10:31:56.430246 #2196847] INFO -- : SOLIBS = -lz -lrt -lrt -lgmp -ldl -lcrypt -lm -lpthread I, [2024-05-10T10:31:56.430258 #2196847] INFO -- : LANG = en_US.UTF-8 I, [2024-05-10T10:31:56.430262 #2196847] INFO -- : LC_ALL = I, [2024-05-10T10:31:56.430266 #2196847] INFO -- : LC_CTYPE = I, [2024-05-10T10:31:56.430269 #2196847] INFO -- : MFLAGS = I, [2024-05-10T10:31:56.430273 #2196847] INFO -- : RUSTC = no I, [2024-05-10T10:31:56.430277 #2196847] INFO -- : YJIT_RUSTC_ARGS = --crate-name=yjit --crate-type=staticlib --edition=2021 -g -C lto=thin -C opt-level=3 -C overflow-checks=on '--out-dir=/tmp/ruby/build/trunk/yjit/target/release/' /tmp/ruby/src/trunk/yjit/src/lib.rs I, [2024-05-10T10:31:56.430898 #2196847] INFO -- : gcc (Ubuntu 11.4.0-1ubuntu1~22.04) 11.4.0 I, [2024-05-10T10:31:56.430919 #2196847] INFO -- : Copyright (C) 2021 Free Software Foundation, Inc. I, [2024-05-10T10:31:56.430925 #2196847] INFO -- : This is free software; see the source for copying conditions. There is NO I, [2024-05-10T10:31:56.430930 #2196847] INFO -- : warranty; not even for MERCHANTABILITY or FITNESS FOR A PARTICULAR PURPOSE. I, [2024-05-10T10:31:56.430934 #2196847] INFO -- : I, [2024-05-10T10:31:56.432599 #2196847] INFO -- : generating enc.mk I, [2024-05-10T10:31:56.550402 #2196847] INFO -- : making enc I, [2024-05-10T10:31:56.567307 #2196847] INFO -- : make[1]: Entering directory '/tmp/ruby/build/trunk' I, [2024-05-10T10:31:56.567329 #2196847] INFO -- : make[1]: Nothing to be done for 'enc'. I, [2024-05-10T10:31:56.567334 #2196847] INFO -- : make[1]: Leaving directory '/tmp/ruby/build/trunk' I, [2024-05-10T10:31:56.567900 #2196847] INFO -- : making srcs under enc I, [2024-05-10T10:31:56.597627 #2196847] INFO -- : make[1]: Entering directory '/tmp/ruby/build/trunk' I, [2024-05-10T10:31:56.597648 #2196847] INFO -- : make[1]: Nothing to be done for 'srcs'. I, [2024-05-10T10:31:56.597654 #2196847] INFO -- : make[1]: Leaving directory '/tmp/ruby/build/trunk' I, [2024-05-10T10:31:56.598487 #2196847] INFO -- : generating transdb.h I, [2024-05-10T10:31:56.694219 #2196847] INFO -- : transdb.h unchanged I, [2024-05-10T10:31:56.695495 #2196847] INFO -- : making trans I, [2024-05-10T10:31:56.728605 #2196847] INFO -- : make[1]: Entering directory '/tmp/ruby/build/trunk' I, [2024-05-10T10:31:56.728627 #2196847] INFO -- : make[1]: Nothing to be done for 'trans'. I, [2024-05-10T10:31:56.728633 #2196847] INFO -- : make[1]: Leaving directory '/tmp/ruby/build/trunk' I, [2024-05-10T10:31:56.729345 #2196847] INFO -- : making encs I, [2024-05-10T10:31:56.766158 #2196847] INFO -- : make[1]: Entering directory '/tmp/ruby/build/trunk' I, [2024-05-10T10:31:56.766179 #2196847] INFO -- : make[1]: Nothing to be done for 'encs'. I, [2024-05-10T10:31:56.766185 #2196847] INFO -- : make[1]: Leaving directory '/tmp/ruby/build/trunk' I, [2024-05-10T10:31:56.767966 #2196847] INFO -- : generating makefiles ext/configure-ext.mk I, [2024-05-10T10:31:56.794301 #2196847] INFO -- : ext/configure-ext.mk updated I, [2024-05-10T10:31:56.796852 #2196847] INFO -- : make[1]: Entering directory '/tmp/ruby/build/trunk' I, [2024-05-10T10:31:58.139999 #2196847] INFO -- : make[1]: Leaving directory '/tmp/ruby/build/trunk' I, [2024-05-10T10:31:58.140773 #2196847] INFO -- : generating makefile exts.mk I, [2024-05-10T10:31:58.177192 #2196847] INFO -- : exts.mk unchanged I, [2024-05-10T10:31:58.181660 #2196847] INFO -- : make[1]: Entering directory '/tmp/ruby/build/trunk' I, [2024-05-10T10:31:58.504906 #2196847] INFO -- : make[2]: Entering directory '/tmp/ruby/build/trunk/ext/coverage' I, [2024-05-10T10:31:58.508846 #2196847] INFO -- : make[2]: Leaving directory '/tmp/ruby/build/trunk/ext/coverage' I, [2024-05-10T10:31:58.515163 #2196847] INFO -- : make[2]: Entering directory '/tmp/ruby/build/trunk/ext/date' I, [2024-05-10T10:31:58.519534 #2196847] INFO -- : make[2]: Leaving directory '/tmp/ruby/build/trunk/ext/date' I, [2024-05-10T10:31:58.523272 #2196847] INFO -- : make[2]: Entering directory '/tmp/ruby/build/trunk/ext/digest' I, [2024-05-10T10:31:58.532015 #2196847] INFO -- : make[2]: Leaving directory '/tmp/ruby/build/trunk/ext/digest' I, [2024-05-10T10:31:58.558511 #2196847] INFO -- : make[2]: Entering directory '/tmp/ruby/build/trunk/ext/digest/sha2' I, [2024-05-10T10:31:58.563321 #2196847] INFO -- : make[2]: Leaving directory '/tmp/ruby/build/trunk/ext/digest/sha2' I, [2024-05-10T10:31:58.584227 #2196847] INFO -- : make[2]: Entering directory '/tmp/ruby/build/trunk/ext/fiddle' I, [2024-05-10T10:31:58.592836 #2196847] INFO -- : make[2]: Leaving directory '/tmp/ruby/build/trunk/ext/fiddle' I, [2024-05-10T10:31:58.597965 #2196847] INFO -- : make[2]: Entering directory '/tmp/ruby/build/trunk/ext/io/console' I, [2024-05-10T10:31:58.602283 #2196847] INFO -- : make[2]: Leaving directory '/tmp/ruby/build/trunk/ext/io/console' I, [2024-05-10T10:31:58.614995 #2196847] INFO -- : make[2]: Entering directory '/tmp/ruby/build/trunk/ext/json' I, [2024-05-10T10:31:58.625659 #2196847] INFO -- : make[2]: Leaving directory '/tmp/ruby/build/trunk/ext/json' I, [2024-05-10T10:31:58.640794 #2196847] INFO -- : make[2]: Entering directory '/tmp/ruby/build/trunk/ext/monitor' I, [2024-05-10T10:31:58.644708 #2196847] INFO -- : make[2]: Leaving directory '/tmp/ruby/build/trunk/ext/monitor' I, [2024-05-10T10:31:58.651809 #2196847] INFO -- : make[2]: Entering directory '/tmp/ruby/build/trunk/ext/objspace' I, [2024-05-10T10:31:58.657895 #2196847] INFO -- : make[2]: Leaving directory '/tmp/ruby/build/trunk/ext/objspace' I, [2024-05-10T10:31:58.676257 #2196847] INFO -- : make[2]: Entering directory '/tmp/ruby/build/trunk/ext/openssl' I, [2024-05-10T10:31:58.693842 #2196847] INFO -- : make[2]: Leaving directory '/tmp/ruby/build/trunk/ext/openssl' I, [2024-05-10T10:31:58.698872 #2196847] INFO -- : make[2]: Entering directory '/tmp/ruby/build/trunk/ext/pathname' I, [2024-05-10T10:31:58.703091 #2196847] INFO -- : make[2]: Leaving directory '/tmp/ruby/build/trunk/ext/pathname' I, [2024-05-10T10:31:58.710051 #2196847] INFO -- : make[2]: Entering directory '/tmp/ruby/build/trunk/ext/psych' I, [2024-05-10T10:31:58.735392 #2196847] INFO -- : make[2]: Leaving directory '/tmp/ruby/build/trunk/ext/psych' I, [2024-05-10T10:31:58.740176 #2196847] INFO -- : make[2]: Entering directory '/tmp/ruby/build/trunk/ext/pty' I, [2024-05-10T10:31:58.744316 #2196847] INFO -- : make[2]: Leaving directory '/tmp/ruby/build/trunk/ext/pty' I, [2024-05-10T10:31:58.760291 #2196847] INFO -- : make[2]: Entering directory '/tmp/ruby/build/trunk/ext/ripper' I, [2024-05-10T10:31:58.768207 #2196847] INFO -- : make[2]: Leaving directory '/tmp/ruby/build/trunk/ext/ripper' I, [2024-05-10T10:31:58.770663 #2196847] INFO -- : make[2]: Entering directory '/tmp/ruby/build/trunk/ext/rubyvm' I, [2024-05-10T10:31:58.773985 #2196847] INFO -- : make[2]: Leaving directory '/tmp/ruby/build/trunk/ext/rubyvm' I, [2024-05-10T10:31:58.785442 #2196847] INFO -- : make[2]: Entering directory '/tmp/ruby/build/trunk/ext/socket' I, [2024-05-10T10:31:58.791826 #2196847] INFO -- : make[2]: Leaving directory '/tmp/ruby/build/trunk/ext/socket' I, [2024-05-10T10:31:58.805769 #2196847] INFO -- : make[2]: Entering directory '/tmp/ruby/build/trunk/.bundle/gems/bigdecimal-3.1.8/ext/bigdecimal' I, [2024-05-10T10:31:58.830867 #2196847] INFO -- : make[2]: Leaving directory '/tmp/ruby/build/trunk/.bundle/gems/bigdecimal-3.1.8/ext/bigdecimal' I, [2024-05-10T10:31:58.832818 #2196847] INFO -- : make[2]: Entering directory '/tmp/ruby/build/trunk/.bundle/gems/debug-1.9.2/ext/debug' I, [2024-05-10T10:31:58.854498 #2196847] INFO -- : make[2]: Leaving directory '/tmp/ruby/build/trunk/.bundle/gems/debug-1.9.2/ext/debug' I, [2024-05-10T10:31:58.856435 #2196847] INFO -- : make[2]: Entering directory '/tmp/ruby/build/trunk/.bundle/gems/nkf-0.2.0/ext/nkf' I, [2024-05-10T10:31:58.883041 #2196847] INFO -- : make[2]: Leaving directory '/tmp/ruby/build/trunk/.bundle/gems/nkf-0.2.0/ext/nkf' I, [2024-05-10T10:31:58.885090 #2196847] INFO -- : make[2]: Entering directory '/tmp/ruby/build/trunk/.bundle/gems/racc-1.7.3/ext/racc/cparse' I, [2024-05-10T10:31:58.907851 #2196847] INFO -- : make[2]: Leaving directory '/tmp/ruby/build/trunk/.bundle/gems/racc-1.7.3/ext/racc/cparse' I, [2024-05-10T10:31:58.910060 #2196847] INFO -- : make[2]: Entering directory '/tmp/ruby/build/trunk/.bundle/gems/rbs-3.4.4/ext/rbs_extension' I, [2024-05-10T10:31:58.931279 #2196847] INFO -- : make[2]: Leaving directory '/tmp/ruby/build/trunk/.bundle/gems/rbs-3.4.4/ext/rbs_extension' I, [2024-05-10T10:31:58.933175 #2196847] INFO -- : make[2]: Entering directory '/tmp/ruby/build/trunk/.bundle/gems/syslog-0.1.2/ext/syslog' I, [2024-05-10T10:31:58.954645 #2196847] INFO -- : make[2]: Leaving directory '/tmp/ruby/build/trunk/.bundle/gems/syslog-0.1.2/ext/syslog' I, [2024-05-10T10:31:58.978068 #2196847] INFO -- : make[2]: Entering directory '/tmp/ruby/build/trunk' I, [2024-05-10T10:31:59.056437 #2196847] INFO -- : make[2]: 'ruby' is up to date. I, [2024-05-10T10:31:59.056475 #2196847] INFO -- : make[2]: Leaving directory '/tmp/ruby/build/trunk' I, [2024-05-10T10:31:59.056877 #2196847] INFO -- : make[1]: Leaving directory '/tmp/ruby/build/trunk' I, [2024-05-10T10:31:59.060395 #2196847] INFO -- : make[1]: Entering directory '/tmp/ruby/build/trunk' I, [2024-05-10T10:31:59.060417 #2196847] INFO -- : make[1]: Nothing to be done for 'note'. I, [2024-05-10T10:31:59.060424 #2196847] INFO -- : make[1]: Leaving directory '/tmp/ruby/build/trunk' E, [2024-05-10T10:31:59.118243 #2196847] ERROR -- : $ /tmp/ruby/build/trunk/miniruby -I/tmp/ruby/src/trunk/lib /tmp/ruby/src/trunk/tool/runruby.rb --archdir=/tmp/ruby/build/trunk --extout=.ext -- /tmp/ruby/src/trunk/spec/mspec/bin/mspec-run -B /tmp/ruby/src/trunk/spec/default.mspec --error-output stderr --debug -fy -o /tmp/rubytest.d3u47t/1-mspec-multi-0 E, [2024-05-10T10:31:59.118419 #2196847] ERROR -- : $ /tmp/ruby/build/trunk/miniruby -I/tmp/ruby/src/trunk/lib /tmp/ruby/src/trunk/tool/runruby.rb --archdir=/tmp/ruby/build/trunk --extout=.ext -- /tmp/ruby/src/trunk/spec/mspec/bin/mspec-run -B /tmp/ruby/src/trunk/spec/default.mspec --error-output stderr --debug -fy -o /tmp/rubytest.d3u47t/2-mspec-multi-1 E, [2024-05-10T10:31:59.118730 #2196847] ERROR -- : $ /tmp/ruby/build/trunk/miniruby -I/tmp/ruby/src/trunk/lib /tmp/ruby/src/trunk/tool/runruby.rb --archdir=/tmp/ruby/build/trunk --extout=.ext -- /tmp/ruby/src/trunk/spec/mspec/bin/mspec-run -B /tmp/ruby/src/trunk/spec/default.mspec --error-output stderr --debug -fy -o /tmp/rubytest.d3u47t/3-mspec-multi-2 E, [2024-05-10T10:31:59.119017 #2196847] ERROR -- : $ /tmp/ruby/build/trunk/miniruby -I/tmp/ruby/src/trunk/lib /tmp/ruby/src/trunk/tool/runruby.rb --archdir=/tmp/ruby/build/trunk --extout=.ext -- /tmp/ruby/src/trunk/spec/mspec/bin/mspec-run -B /tmp/ruby/src/trunk/spec/default.mspec --error-output stderr --debug -fy -o /tmp/rubytest.d3u47t/4-mspec-multi-3 E, [2024-05-10T10:31:59.119327 #2196847] ERROR -- : $ /tmp/ruby/build/trunk/miniruby -I/tmp/ruby/src/trunk/lib /tmp/ruby/src/trunk/tool/runruby.rb --archdir=/tmp/ruby/build/trunk --extout=.ext -- /tmp/ruby/src/trunk/spec/mspec/bin/mspec-run -B /tmp/ruby/src/trunk/spec/default.mspec --error-output stderr --debug -fy -o /tmp/rubytest.d3u47t/5-mspec-multi-4 E, [2024-05-10T10:31:59.119422 #2196847] ERROR -- : $ /tmp/ruby/build/trunk/miniruby -I/tmp/ruby/src/trunk/lib /tmp/ruby/src/trunk/tool/runruby.rb --archdir=/tmp/ruby/build/trunk --extout=.ext -- /tmp/ruby/src/trunk/spec/mspec/bin/mspec-run -B /tmp/ruby/src/trunk/spec/default.mspec --error-output stderr --debug -fy -o /tmp/rubytest.d3u47t/6-mspec-multi-5 E, [2024-05-10T10:31:59.119568 #2196847] ERROR -- : $ /tmp/ruby/build/trunk/miniruby -I/tmp/ruby/src/trunk/lib /tmp/ruby/src/trunk/tool/runruby.rb --archdir=/tmp/ruby/build/trunk --extout=.ext -- /tmp/ruby/src/trunk/spec/mspec/bin/mspec-run -B /tmp/ruby/src/trunk/spec/default.mspec --error-output stderr --debug -fy -o /tmp/rubytest.d3u47t/7-mspec-multi-6 E, [2024-05-10T10:31:59.119845 #2196847] ERROR -- : $ /tmp/ruby/build/trunk/miniruby -I/tmp/ruby/src/trunk/lib /tmp/ruby/src/trunk/tool/runruby.rb --archdir=/tmp/ruby/build/trunk --extout=.ext -- /tmp/ruby/src/trunk/spec/mspec/bin/mspec-run -B /tmp/ruby/src/trunk/spec/default.mspec --error-output stderr --debug -fy -o /tmp/rubytest.d3u47t/8-mspec-multi-7 E, [2024-05-10T10:31:59.120106 #2196847] ERROR -- : $ /tmp/ruby/build/trunk/miniruby -I/tmp/ruby/src/trunk/lib /tmp/ruby/src/trunk/tool/runruby.rb --archdir=/tmp/ruby/build/trunk --extout=.ext -- /tmp/ruby/src/trunk/spec/mspec/bin/mspec-run -B /tmp/ruby/src/trunk/spec/default.mspec --error-output stderr --debug -fy -o /tmp/rubytest.d3u47t/9-mspec-multi-8 E, [2024-05-10T10:31:59.120465 #2196847] ERROR -- : $ /tmp/ruby/build/trunk/miniruby -I/tmp/ruby/src/trunk/lib /tmp/ruby/src/trunk/tool/runruby.rb --archdir=/tmp/ruby/build/trunk --extout=.ext -- /tmp/ruby/src/trunk/spec/mspec/bin/mspec-run -B /tmp/ruby/src/trunk/spec/default.mspec --error-output stderr --debug -fy -o /tmp/rubytest.d3u47t/10-mspec-multi-9 E, [2024-05-10T10:31:59.120682 #2196847] ERROR -- : $ /tmp/ruby/build/trunk/miniruby -I/tmp/ruby/src/trunk/lib /tmp/ruby/src/trunk/tool/runruby.rb --archdir=/tmp/ruby/build/trunk --extout=.ext -- /tmp/ruby/src/trunk/spec/mspec/bin/mspec-run -B /tmp/ruby/src/trunk/spec/default.mspec --error-output stderr --debug -fy -o /tmp/rubytest.d3u47t/11-mspec-multi-10 E, [2024-05-10T10:31:59.120919 #2196847] ERROR -- : $ /tmp/ruby/build/trunk/miniruby -I/tmp/ruby/src/trunk/lib /tmp/ruby/src/trunk/tool/runruby.rb --archdir=/tmp/ruby/build/trunk --extout=.ext -- /tmp/ruby/src/trunk/spec/mspec/bin/mspec-run -B /tmp/ruby/src/trunk/spec/default.mspec --error-output stderr --debug -fy -o /tmp/rubytest.d3u47t/12-mspec-multi-11 E, [2024-05-10T10:31:59.121191 #2196847] ERROR -- : $ /tmp/ruby/build/trunk/miniruby -I/tmp/ruby/src/trunk/lib /tmp/ruby/src/trunk/tool/runruby.rb --archdir=/tmp/ruby/build/trunk --extout=.ext -- /tmp/ruby/src/trunk/spec/mspec/bin/mspec-run -B /tmp/ruby/src/trunk/spec/default.mspec --error-output stderr --debug -fy -o /tmp/rubytest.d3u47t/13-mspec-multi-12 E, [2024-05-10T10:31:59.121512 #2196847] ERROR -- : $ /tmp/ruby/build/trunk/miniruby -I/tmp/ruby/src/trunk/lib /tmp/ruby/src/trunk/tool/runruby.rb --archdir=/tmp/ruby/build/trunk --extout=.ext -- /tmp/ruby/src/trunk/spec/mspec/bin/mspec-run -B /tmp/ruby/src/trunk/spec/default.mspec --error-output stderr --debug -fy -o /tmp/rubytest.d3u47t/14-mspec-multi-13 E, [2024-05-10T10:31:59.121813 #2196847] ERROR -- : $ /tmp/ruby/build/trunk/miniruby -I/tmp/ruby/src/trunk/lib /tmp/ruby/src/trunk/tool/runruby.rb --archdir=/tmp/ruby/build/trunk --extout=.ext -- /tmp/ruby/src/trunk/spec/mspec/bin/mspec-run -B /tmp/ruby/src/trunk/spec/default.mspec --error-output stderr --debug -fy -o /tmp/rubytest.d3u47t/15-mspec-multi-14 E, [2024-05-10T10:31:59.122076 #2196847] ERROR -- : $ /tmp/ruby/build/trunk/miniruby -I/tmp/ruby/src/trunk/lib /tmp/ruby/src/trunk/tool/runruby.rb --archdir=/tmp/ruby/build/trunk --extout=.ext -- /tmp/ruby/src/trunk/spec/mspec/bin/mspec-run -B /tmp/ruby/src/trunk/spec/default.mspec --error-output stderr --debug -fy -o /tmp/rubytest.d3u47t/16-mspec-multi-15 E, [2024-05-10T10:31:59.122374 #2196847] ERROR -- : $ /tmp/ruby/build/trunk/miniruby -I/tmp/ruby/src/trunk/lib /tmp/ruby/src/trunk/tool/runruby.rb --archdir=/tmp/ruby/build/trunk --extout=.ext -- /tmp/ruby/src/trunk/spec/mspec/bin/mspec-run -B /tmp/ruby/src/trunk/spec/default.mspec --error-output stderr --debug -fy -o /tmp/rubytest.d3u47t/17-mspec-multi-16 E, [2024-05-10T10:31:59.122667 #2196847] ERROR -- : $ /tmp/ruby/build/trunk/miniruby -I/tmp/ruby/src/trunk/lib /tmp/ruby/src/trunk/tool/runruby.rb --archdir=/tmp/ruby/build/trunk --extout=.ext -- /tmp/ruby/src/trunk/spec/mspec/bin/mspec-run -B /tmp/ruby/src/trunk/spec/default.mspec --error-output stderr --debug -fy -o /tmp/rubytest.d3u47t/18-mspec-multi-17 E, [2024-05-10T10:31:59.125883 #2196847] ERROR -- : $ /tmp/ruby/build/trunk/miniruby -I/tmp/ruby/src/trunk/lib /tmp/ruby/src/trunk/tool/runruby.rb --archdir=/tmp/ruby/build/trunk --extout=.ext -- /tmp/ruby/src/trunk/spec/mspec/bin/mspec-run -B /tmp/ruby/src/trunk/spec/default.mspec --error-output stderr --debug -fy -o /tmp/rubytest.d3u47t/19-mspec-multi-18 E, [2024-05-10T10:31:59.126121 #2196847] ERROR -- : $ /tmp/ruby/build/trunk/miniruby -I/tmp/ruby/src/trunk/lib /tmp/ruby/src/trunk/tool/runruby.rb --archdir=/tmp/ruby/build/trunk --extout=.ext -- /tmp/ruby/src/trunk/spec/mspec/bin/mspec-run -B /tmp/ruby/src/trunk/spec/default.mspec --error-output stderr --debug -fy -o /tmp/rubytest.d3u47t/20-mspec-multi-19 I, [2024-05-10T10:31:59.291750 #2196847] INFO -- : ruby 3.4.0dev (2024-05-10T09:39:11Z master 69d0a3b033) [x86_64-linux] I, [2024-05-10T10:31:59.901904 #2196847] INFO -- : 0 ......................................................................... I, [2024-05-10T10:32:00.279999 #2196847] INFO -- : 73 ......................................................................... I, [2024-05-10T10:32:00.415105 #2196847] INFO -- : 146 ......................................................................... I, [2024-05-10T10:32:00.472905 #2196847] INFO -- : 219 ......................................................................... I, [2024-05-10T10:32:00.518819 #2196847] INFO -- : 292 ......................................................................... I, [2024-05-10T10:32:00.571681 #2196847] INFO -- : 365 ......................................................................... I, [2024-05-10T10:32:00.593589 #2196847] INFO -- : 438 ......................................................................... I, [2024-05-10T10:32:00.613006 #2196847] INFO -- : 511 ......................................................................... I, [2024-05-10T10:32:00.630305 #2196847] INFO -- : 584 ......................................................................... I, [2024-05-10T10:32:00.690896 #2196847] INFO -- : 657 ......................................................................... I, [2024-05-10T10:32:00.718748 #2196847] INFO -- : 730 ......................................................................... I, [2024-05-10T10:32:00.742454 #2196847] INFO -- : 803 ......................................................................... I, [2024-05-10T10:32:00.780571 #2196847] INFO -- : 876 ......................................................................... I, [2024-05-10T10:32:00.823722 #2196847] INFO -- : 949 ......................................................................... I, [2024-05-10T10:32:00.912847 #2196847] INFO -- : 1022 ......................................................................... I, [2024-05-10T10:32:01.079272 #2196847] INFO -- : 1095 ......................................................................... I, [2024-05-10T10:32:01.189034 #2196847] INFO -- : 1168 ......................................................................... I, [2024-05-10T10:32:01.247924 #2196847] INFO -- : 1241 ......................................................................... I, [2024-05-10T10:32:01.304937 #2196847] INFO -- : 1314 ......................................................................... I, [2024-05-10T10:32:01.320876 #2196847] INFO -- : 1387 ......................................................................... I, [2024-05-10T10:32:01.417666 #2196847] INFO -- : 1460 ......................................................................... I, [2024-05-10T10:32:01.875685 #2196847] INFO -- : 1533 ......................................................................... I, [2024-05-10T10:32:01.930148 #2196847] INFO -- : 1606 ......................................................................... I, [2024-05-10T10:32:02.012712 #2196847] INFO -- : 1679 ......................................................................... I, [2024-05-10T10:32:02.130094 #2196847] INFO -- : 1752 ......................................................................... I, [2024-05-10T10:32:02.231390 #2196847] INFO -- : 1825 ......................................................................... I, [2024-05-10T10:32:02.350574 #2196847] INFO -- : 1898 ......................................................................... I, [2024-05-10T10:32:02.430766 #2196847] INFO -- : 1971 ......................................................................... I, [2024-05-10T10:32:02.495337 #2196847] INFO -- : 2044 ......................................................................... I, [2024-05-10T10:32:02.550791 #2196847] INFO -- : 2117 ......................................................................... I, [2024-05-10T10:32:02.566088 #2196847] INFO -- : 2190 ......................................................................... I, [2024-05-10T10:32:02.582361 #2196847] INFO -- : 2263 ......................................................................... I, [2024-05-10T10:32:02.594194 #2196847] INFO -- : 2336 ......................................................................... I, [2024-05-10T10:32:02.629733 #2196847] INFO -- : 2409 ......................................................................... I, [2024-05-10T10:32:02.731757 #2196847] INFO -- : 2482 ......................................................................... I, [2024-05-10T10:32:02.757983 #2196847] INFO -- : 2555 ......................................................................... I, [2024-05-10T10:32:02.852668 #2196847] INFO -- : 2628 ......................................................................... I, [2024-05-10T10:32:02.953297 #2196847] INFO -- : 2701 ......................................................................... I, [2024-05-10T10:32:02.987678 #2196847] INFO -- : 2774 ......................................................................... I, [2024-05-10T10:32:03.042011 #2196847] INFO -- : 2847 ......................................................................... I, [2024-05-10T10:32:03.074365 #2196847] INFO -- : 2920 ......................................................................... I, [2024-05-10T10:32:03.102044 #2196847] INFO -- : 2993 ......................................................................... I, [2024-05-10T10:32:03.122822 #2196847] INFO -- : 3066 ......................................................................... I, [2024-05-10T10:32:03.133332 #2196847] INFO -- : 3139 ......................................................................... I, [2024-05-10T10:32:03.143007 #2196847] INFO -- : 3212 ......................................................................... I, [2024-05-10T10:32:03.172278 #2196847] INFO -- : 3285 ......................................................................... I, [2024-05-10T10:32:07.148177 #2196847] INFO -- : 3358 ........................................................................ I, [2024-05-10T10:32:07.148265 #2196847] INFO -- : I, [2024-05-10T10:32:07.148283 #2196847] INFO -- : Finished in 8.029156 seconds I, [2024-05-10T10:32:07.148299 #2196847] INFO -- : I, [2024-05-10T10:32:07.148314 #2196847] INFO -- : 3429 files, 32611 examples, 165276 expectations, 0 failures, 0 errors, 0 tagged I, [2024-05-10T10:32:07.150377 #2196847] INFO -- : $$$[end] "make yes-test-rubyspec MSPECOPT='--error-output stderr --debug -j' TESTS='-j20'" exit with 0.