# Logfile created on 2024-05-09 18:13:57 +0000 by logger.rb/v1.4.3 I, [2024-05-09T18:13:57.713227 #2453562] INFO -- : #, @formatter=nil, @logdev=#, @binmode=false, @mon_data=#, @mon_data_owner_object_id=860>>> I, [2024-05-09T18:13:57.713354 #2453562] INFO -- : $$$[beg] make update-unicode -j20 I, [2024-05-09T18:13:57.771660 #2453562] INFO -- : Downloading Unicode emoji 15.0 files... I, [2024-05-09T18:13:57.772049 #2453562] INFO -- : Downloading Unicode emoji 15.0 files... I, [2024-05-09T18:13:57.772195 #2453562] INFO -- : Downloading Unicode emoji 15.0 files... I, [2024-05-09T18:13:57.813360 #2453562] INFO -- : made symlink emoji/15.0/emoji-sequences.txt to /tmp/ruby/src/trunk/.downloaded-cache/emoji/15.0/emoji-sequences.txt E, [2024-05-09T18:13:58.265600 #2453562] ERROR -- : /tmp/ruby/src/trunk/tool/downloader.rb:302:in `rescue in download': failed to download emoji/15.0/emoji-test.txt (RuntimeError) E, [2024-05-09T18:13:58.265636 #2453562] ERROR -- : OpenURI::HTTPError: 403 Forbidden: https://www.unicode.org/Public/emoji/15.0/emoji-test.txt E, [2024-05-09T18:13:58.265642 #2453562] ERROR -- : from /tmp/ruby/src/trunk/tool/downloader.rb:201:in `download' E, [2024-05-09T18:13:58.265646 #2453562] ERROR -- : from /tmp/ruby/src/trunk/tool/downloader.rb:136:in `download' E, [2024-05-09T18:13:58.265649 #2453562] ERROR -- : from /tmp/ruby/src/trunk/tool/downloader.rb:482:in `block in
' E, [2024-05-09T18:13:58.265653 #2453562] ERROR -- : from /tmp/ruby/src/trunk/tool/downloader.rb:465:in `each' E, [2024-05-09T18:13:58.265656 #2453562] ERROR -- : from /tmp/ruby/src/trunk/tool/downloader.rb:465:in `
' E, [2024-05-09T18:13:58.265660 #2453562] ERROR -- : /usr/lib/ruby/3.0.0/open-uri.rb:364:in `open_http': 403 Forbidden (OpenURI::HTTPError) E, [2024-05-09T18:13:58.265663 #2453562] ERROR -- : from /usr/lib/ruby/3.0.0/open-uri.rb:741:in `buffer_open' E, [2024-05-09T18:13:58.265668 #2453562] ERROR -- : from /usr/lib/ruby/3.0.0/open-uri.rb:212:in `block in open_loop' E, [2024-05-09T18:13:58.265671 #2453562] ERROR -- : from /usr/lib/ruby/3.0.0/open-uri.rb:210:in `catch' E, [2024-05-09T18:13:58.265674 #2453562] ERROR -- : from /usr/lib/ruby/3.0.0/open-uri.rb:210:in `open_loop' E, [2024-05-09T18:13:58.265678 #2453562] ERROR -- : from /usr/lib/ruby/3.0.0/open-uri.rb:151:in `open_uri' E, [2024-05-09T18:13:58.265681 #2453562] ERROR -- : from /usr/lib/ruby/3.0.0/open-uri.rb:721:in `open' E, [2024-05-09T18:13:58.265684 #2453562] ERROR -- : from /usr/lib/ruby/3.0.0/open-uri.rb:729:in `read' E, [2024-05-09T18:13:58.265688 #2453562] ERROR -- : from /tmp/ruby/src/trunk/tool/downloader.rb:247:in `block in download' E, [2024-05-09T18:13:58.265691 #2453562] ERROR -- : from /tmp/ruby/src/trunk/tool/downloader.rb:378:in `with_retry' E, [2024-05-09T18:13:58.265696 #2453562] ERROR -- : from /tmp/ruby/src/trunk/tool/downloader.rb:246:in `download' E, [2024-05-09T18:13:58.265706 #2453562] ERROR -- : from /tmp/ruby/src/trunk/tool/downloader.rb:136:in `download' E, [2024-05-09T18:13:58.265710 #2453562] ERROR -- : from /tmp/ruby/src/trunk/tool/downloader.rb:482:in `block in
' E, [2024-05-09T18:13:58.265713 #2453562] ERROR -- : from /tmp/ruby/src/trunk/tool/downloader.rb:465:in `each' E, [2024-05-09T18:13:58.265717 #2453562] ERROR -- : from /tmp/ruby/src/trunk/tool/downloader.rb:465:in `
' E, [2024-05-09T18:13:58.267724 #2453562] ERROR -- : make: *** [uncommon.mk:1765: /tmp/ruby/src/trunk/enc/unicode/data/emoji/15.0/emoji-test.txt] Error 1 E, [2024-05-09T18:13:58.267745 #2453562] ERROR -- : make: *** Waiting for unfinished jobs.... E, [2024-05-09T18:13:58.705236 #2453562] ERROR -- : /tmp/ruby/src/trunk/tool/downloader.rb:302:in `rescue in download': failed to download emoji/15.0/emoji-sequences.txt (RuntimeError) E, [2024-05-09T18:13:58.705261 #2453562] ERROR -- : EOFError: end of file reached: https://www.unicode.org/Public/emoji/15.0/emoji-sequences.txt E, [2024-05-09T18:13:58.705266 #2453562] ERROR -- : from /tmp/ruby/src/trunk/tool/downloader.rb:201:in `download' E, [2024-05-09T18:13:58.705270 #2453562] ERROR -- : from /tmp/ruby/src/trunk/tool/downloader.rb:136:in `download' E, [2024-05-09T18:13:58.705274 #2453562] ERROR -- : from /tmp/ruby/src/trunk/tool/downloader.rb:482:in `block in
' E, [2024-05-09T18:13:58.705277 #2453562] ERROR -- : from /tmp/ruby/src/trunk/tool/downloader.rb:465:in `each' E, [2024-05-09T18:13:58.705281 #2453562] ERROR -- : from /tmp/ruby/src/trunk/tool/downloader.rb:465:in `
' E, [2024-05-09T18:13:58.705284 #2453562] ERROR -- : /usr/lib/ruby/3.0.0/net/protocol.rb:227:in `rbuf_fill': end of file reached (EOFError) E, [2024-05-09T18:13:58.705287 #2453562] ERROR -- : from /usr/lib/ruby/3.0.0/net/protocol.rb:193:in `readuntil' E, [2024-05-09T18:13:58.705292 #2453562] ERROR -- : from /usr/lib/ruby/3.0.0/net/protocol.rb:203:in `readline' E, [2024-05-09T18:13:58.705296 #2453562] ERROR -- : from /usr/lib/ruby/3.0.0/net/http/response.rb:42:in `read_status_line' E, [2024-05-09T18:13:58.705299 #2453562] ERROR -- : from /usr/lib/ruby/3.0.0/net/http/response.rb:31:in `read_new' E, [2024-05-09T18:13:58.705302 #2453562] ERROR -- : from /usr/lib/ruby/3.0.0/net/http.rb:1557:in `block in transport_request' E, [2024-05-09T18:13:58.705306 #2453562] ERROR -- : from /usr/lib/ruby/3.0.0/net/http.rb:1548:in `catch' E, [2024-05-09T18:13:58.705309 #2453562] ERROR -- : from /usr/lib/ruby/3.0.0/net/http.rb:1548:in `transport_request' E, [2024-05-09T18:13:58.705312 #2453562] ERROR -- : from /usr/lib/ruby/3.0.0/net/http.rb:1521:in `request' E, [2024-05-09T18:13:58.705316 #2453562] ERROR -- : from /usr/lib/ruby/3.0.0/open-uri.rb:329:in `block in open_http' E, [2024-05-09T18:13:58.705320 #2453562] ERROR -- : from /usr/lib/ruby/3.0.0/net/http.rb:960:in `start' E, [2024-05-09T18:13:58.705324 #2453562] ERROR -- : from /usr/lib/ruby/3.0.0/open-uri.rb:323:in `open_http' E, [2024-05-09T18:13:58.705327 #2453562] ERROR -- : from /usr/lib/ruby/3.0.0/open-uri.rb:741:in `buffer_open' E, [2024-05-09T18:13:58.705330 #2453562] ERROR -- : from /usr/lib/ruby/3.0.0/open-uri.rb:212:in `block in open_loop' E, [2024-05-09T18:13:58.705334 #2453562] ERROR -- : from /usr/lib/ruby/3.0.0/open-uri.rb:210:in `catch' E, [2024-05-09T18:13:58.705337 #2453562] ERROR -- : from /usr/lib/ruby/3.0.0/open-uri.rb:210:in `open_loop' E, [2024-05-09T18:13:58.705340 #2453562] ERROR -- : from /usr/lib/ruby/3.0.0/open-uri.rb:151:in `open_uri' E, [2024-05-09T18:13:58.705343 #2453562] ERROR -- : from /usr/lib/ruby/3.0.0/open-uri.rb:721:in `open' E, [2024-05-09T18:13:58.705347 #2453562] ERROR -- : from /usr/lib/ruby/3.0.0/open-uri.rb:729:in `read' E, [2024-05-09T18:13:58.705351 #2453562] ERROR -- : from /tmp/ruby/src/trunk/tool/downloader.rb:247:in `block in download' E, [2024-05-09T18:13:58.705354 #2453562] ERROR -- : from /tmp/ruby/src/trunk/tool/downloader.rb:378:in `with_retry' E, [2024-05-09T18:13:58.705358 #2453562] ERROR -- : from /tmp/ruby/src/trunk/tool/downloader.rb:246:in `download' E, [2024-05-09T18:13:58.705365 #2453562] ERROR -- : from /tmp/ruby/src/trunk/tool/downloader.rb:136:in `download' E, [2024-05-09T18:13:58.705368 #2453562] ERROR -- : from /tmp/ruby/src/trunk/tool/downloader.rb:482:in `block in
' E, [2024-05-09T18:13:58.705371 #2453562] ERROR -- : from /tmp/ruby/src/trunk/tool/downloader.rb:465:in `each' E, [2024-05-09T18:13:58.705375 #2453562] ERROR -- : from /tmp/ruby/src/trunk/tool/downloader.rb:465:in `
' E, [2024-05-09T18:13:58.707300 #2453562] ERROR -- : make: *** [uncommon.mk:1765: /tmp/ruby/src/trunk/enc/unicode/data/emoji/15.0/emoji-sequences.txt] Error 1 E, [2024-05-09T18:13:58.707325 #2453562] ERROR -- : make: *** Deleting file '/tmp/ruby/src/trunk/enc/unicode/data/emoji/15.0/emoji-sequences.txt' E, [2024-05-09T18:13:58.745668 #2453562] ERROR -- : /tmp/ruby/src/trunk/tool/downloader.rb:302:in `rescue in download': failed to download emoji/15.0/emoji-sequences.txt (RuntimeError) E, [2024-05-09T18:13:58.745688 #2453562] ERROR -- : EOFError: end of file reached: https://www.unicode.org/Public/emoji/15.0/emoji-sequences.txt E, [2024-05-09T18:13:58.745694 #2453562] ERROR -- : from /tmp/ruby/src/trunk/tool/downloader.rb:201:in `download' E, [2024-05-09T18:13:58.745698 #2453562] ERROR -- : from /tmp/ruby/src/trunk/tool/downloader.rb:136:in `download' E, [2024-05-09T18:13:58.745784 #2453562] ERROR -- : from /tmp/ruby/src/trunk/tool/downloader.rb:482:in `block in
' E, [2024-05-09T18:13:58.745789 #2453562] ERROR -- : from /tmp/ruby/src/trunk/tool/downloader.rb:465:in `each' E, [2024-05-09T18:13:58.745793 #2453562] ERROR -- : from /tmp/ruby/src/trunk/tool/downloader.rb:465:in `
' E, [2024-05-09T18:13:58.745796 #2453562] ERROR -- : /usr/lib/ruby/3.0.0/net/protocol.rb:227:in `rbuf_fill': end of file reached (EOFError) E, [2024-05-09T18:13:58.745800 #2453562] ERROR -- : from /usr/lib/ruby/3.0.0/net/protocol.rb:193:in `readuntil' E, [2024-05-09T18:13:58.745803 #2453562] ERROR -- : from /usr/lib/ruby/3.0.0/net/protocol.rb:203:in `readline' E, [2024-05-09T18:13:58.745810 #2453562] ERROR -- : from /usr/lib/ruby/3.0.0/net/http/response.rb:42:in `read_status_line' E, [2024-05-09T18:13:58.745813 #2453562] ERROR -- : from /usr/lib/ruby/3.0.0/net/http/response.rb:31:in `read_new' E, [2024-05-09T18:13:58.745817 #2453562] ERROR -- : from /usr/lib/ruby/3.0.0/net/http.rb:1557:in `block in transport_request' E, [2024-05-09T18:13:58.745820 #2453562] ERROR -- : from /usr/lib/ruby/3.0.0/net/http.rb:1548:in `catch' E, [2024-05-09T18:13:58.745824 #2453562] ERROR -- : from /usr/lib/ruby/3.0.0/net/http.rb:1548:in `transport_request' E, [2024-05-09T18:13:58.745827 #2453562] ERROR -- : from /usr/lib/ruby/3.0.0/net/http.rb:1521:in `request' E, [2024-05-09T18:13:58.745830 #2453562] ERROR -- : from /usr/lib/ruby/3.0.0/open-uri.rb:329:in `block in open_http' E, [2024-05-09T18:13:58.745834 #2453562] ERROR -- : from /usr/lib/ruby/3.0.0/net/http.rb:960:in `start' E, [2024-05-09T18:13:58.745837 #2453562] ERROR -- : from /usr/lib/ruby/3.0.0/open-uri.rb:323:in `open_http' E, [2024-05-09T18:13:58.745840 #2453562] ERROR -- : from /usr/lib/ruby/3.0.0/open-uri.rb:741:in `buffer_open' E, [2024-05-09T18:13:58.745845 #2453562] ERROR -- : from /usr/lib/ruby/3.0.0/open-uri.rb:212:in `block in open_loop' E, [2024-05-09T18:13:58.745848 #2453562] ERROR -- : from /usr/lib/ruby/3.0.0/open-uri.rb:210:in `catch' E, [2024-05-09T18:13:58.745851 #2453562] ERROR -- : from /usr/lib/ruby/3.0.0/open-uri.rb:210:in `open_loop' E, [2024-05-09T18:13:58.745855 #2453562] ERROR -- : from /usr/lib/ruby/3.0.0/open-uri.rb:151:in `open_uri' E, [2024-05-09T18:13:58.745858 #2453562] ERROR -- : from /usr/lib/ruby/3.0.0/open-uri.rb:721:in `open' E, [2024-05-09T18:13:58.745861 #2453562] ERROR -- : from /usr/lib/ruby/3.0.0/open-uri.rb:729:in `read' E, [2024-05-09T18:13:58.745864 #2453562] ERROR -- : from /tmp/ruby/src/trunk/tool/downloader.rb:247:in `block in download' E, [2024-05-09T18:13:58.745868 #2453562] ERROR -- : from /tmp/ruby/src/trunk/tool/downloader.rb:378:in `with_retry' E, [2024-05-09T18:13:58.745877 #2453562] ERROR -- : from /tmp/ruby/src/trunk/tool/downloader.rb:246:in `download' E, [2024-05-09T18:13:58.745882 #2453562] ERROR -- : from /tmp/ruby/src/trunk/tool/downloader.rb:136:in `download' E, [2024-05-09T18:13:58.745885 #2453562] ERROR -- : from /tmp/ruby/src/trunk/tool/downloader.rb:482:in `block in
' E, [2024-05-09T18:13:58.745888 #2453562] ERROR -- : from /tmp/ruby/src/trunk/tool/downloader.rb:465:in `each' E, [2024-05-09T18:13:58.745892 #2453562] ERROR -- : from /tmp/ruby/src/trunk/tool/downloader.rb:465:in `
' E, [2024-05-09T18:13:58.748043 #2453562] ERROR -- : make: *** [uncommon.mk:1765: /tmp/ruby/src/trunk/enc/unicode/data/emoji/15.0/emoji-zwj-sequences.txt] Error 1 I, [2024-05-09T18:13:58.748089 #2453562] INFO -- : downloading emoji/15.0/emoji-sequences.txt ... downloading emoji/15.0/emoji-sequences.txt ... downloading emoji/15.0/emoji-test.txt ... I, [2024-05-09T18:13:58.748397 #2453562] INFO -- : $$$[end] "make update-unicode -j20" exit with 512. I, [2024-05-09T18:13:58.748427 #2453562] INFO -- : $$$[beg] make update-download -j20 I, [2024-05-09T18:13:58.848254 #2453562] INFO -- : tool/config.guess already exists I, [2024-05-09T18:13:58.848302 #2453562] INFO -- : tool/config.sub already exists I, [2024-05-09T18:13:58.850553 #2453562] INFO -- : Update minitest to ea9caafc0754b1d6236a490d59e624b53209734a I, [2024-05-09T18:13:58.850685 #2453562] INFO -- : Update power_assert to 84e85124c5014a139af39161d484156cfe87a9ed I, [2024-05-09T18:13:58.851107 #2453562] INFO -- : Update rbs to ba7872795d5de04adb8ff500c0e6afdc81a041dd I, [2024-05-09T18:13:58.851664 #2453562] INFO -- : echo ea9caafc0754b1d6236a490d59e624b53209734a | /bin/sh /tmp/ruby/src/trunk/tool/ifchange /tmp/ruby/src/trunk/.bundle/.timestamp/minitest.revision - I, [2024-05-09T18:13:58.851688 #2453562] INFO -- : Update typeprof to b19a6416da3a05d57fadd6ffdadb382b6d236ca5 I, [2024-05-09T18:13:58.851990 #2453562] INFO -- : echo 84e85124c5014a139af39161d484156cfe87a9ed | /bin/sh /tmp/ruby/src/trunk/tool/ifchange /tmp/ruby/src/trunk/.bundle/.timestamp/power_assert.revision - I, [2024-05-09T18:13:58.852098 #2453562] INFO -- : echo ba7872795d5de04adb8ff500c0e6afdc81a041dd | /bin/sh /tmp/ruby/src/trunk/tool/ifchange /tmp/ruby/src/trunk/.bundle/.timestamp/rbs.revision - I, [2024-05-09T18:13:58.852752 #2453562] INFO -- : echo b19a6416da3a05d57fadd6ffdadb382b6d236ca5 | /bin/sh /tmp/ruby/src/trunk/tool/ifchange /tmp/ruby/src/trunk/.bundle/.timestamp/typeprof.revision - I, [2024-05-09T18:13:58.853481 #2453562] INFO -- : /tmp/ruby/src/trunk/.bundle/.timestamp/minitest.revision unchanged I, [2024-05-09T18:13:58.853902 #2453562] INFO -- : /tmp/ruby/src/trunk/.bundle/.timestamp/power_assert.revision unchanged I, [2024-05-09T18:13:58.854045 #2453562] INFO -- : /tmp/ruby/src/trunk/.bundle/.timestamp/rbs.revision unchanged I, [2024-05-09T18:13:58.854554 #2453562] INFO -- : /tmp/ruby/src/trunk/.bundle/.timestamp/typeprof.revision unchanged I, [2024-05-09T18:13:58.854881 #2453562] INFO -- : Building power_assert@84e85124c5014a139af39161d484156cfe87a9ed to /tmp/ruby/src/trunk/gems/power_assert-2.0.3.gem I, [2024-05-09T18:13:58.923481 #2453562] INFO -- : Successfully built RubyGem I, [2024-05-09T18:13:58.923520 #2453562] INFO -- : Name: power_assert I, [2024-05-09T18:13:58.923530 #2453562] INFO -- : Version: 2.0.4dev I, [2024-05-09T18:13:58.923534 #2453562] INFO -- : File: power_assert-2.0.4dev.gem I, [2024-05-09T18:13:58.970180 #2453562] INFO -- : $$$[end] "make update-download -j20" exit with 0. I, [2024-05-09T18:13:58.970216 #2453562] INFO -- : $$$[beg] make update-rubyspec -j20 I, [2024-05-09T18:13:59.027136 #2453562] INFO -- : make: Nothing to be done for 'update-rubyspec'. I, [2024-05-09T18:13:59.027337 #2453562] INFO -- : $$$[end] "make update-rubyspec -j20" exit with 0. I, [2024-05-09T18:13:59.027361 #2453562] INFO -- : $$$[beg] make update-src -j20 I, [2024-05-09T18:13:59.567640 #2453562] INFO -- : Already up to date. I, [2024-05-09T18:13:59.576935 #2453562] INFO -- : Latest commit hash = 444030fc61 I, [2024-05-09T18:13:59.578036 #2453562] INFO -- : $$$[end] "make update-src -j20" exit with 0. I, [2024-05-09T18:13:59.578067 #2453562] INFO -- : $$$[beg] make after-update -j20 I, [2024-05-09T18:13:59.647719 #2453562] INFO -- : generating /tmp/ruby/src/trunk/ext/ripper/eventids2table.c I, [2024-05-09T18:13:59.652035 #2453562] INFO -- : make[1]: Entering directory '/tmp/ruby/src/trunk/ext/ripper' I, [2024-05-09T18:13:59.652059 #2453562] INFO -- : make[1]: Nothing to be done for 'src'. I, [2024-05-09T18:13:59.652065 #2453562] INFO -- : make[1]: Leaving directory '/tmp/ruby/src/trunk/ext/ripper' I, [2024-05-09T18:13:59.668095 #2453562] INFO -- : /tmp/ruby/src/trunk/revision.h updated I, [2024-05-09T18:13:59.669463 #2453562] INFO -- : generating x86_64-linux-fake.rb I, [2024-05-09T18:13:59.720429 #2453562] INFO -- : x86_64-linux-fake.rb updated I, [2024-05-09T18:13:59.721858 #2453562] INFO -- : generating enc.mk I, [2024-05-09T18:13:59.838624 #2453562] INFO -- : making srcs under enc I, [2024-05-09T18:13:59.868664 #2453562] INFO -- : make[1]: Entering directory '/tmp/ruby/build/trunk' I, [2024-05-09T18:13:59.868691 #2453562] INFO -- : make[1]: Nothing to be done for 'srcs'. I, [2024-05-09T18:13:59.868696 #2453562] INFO -- : make[1]: Leaving directory '/tmp/ruby/build/trunk' I, [2024-05-09T18:13:59.913714 #2453562] INFO -- : Update minitest to ea9caafc0754b1d6236a490d59e624b53209734a I, [2024-05-09T18:13:59.913996 #2453562] INFO -- : Update power_assert to 84e85124c5014a139af39161d484156cfe87a9ed I, [2024-05-09T18:13:59.914397 #2453562] INFO -- : Update rbs to ba7872795d5de04adb8ff500c0e6afdc81a041dd I, [2024-05-09T18:13:59.914619 #2453562] INFO -- : Update typeprof to b19a6416da3a05d57fadd6ffdadb382b6d236ca5 I, [2024-05-09T18:13:59.915663 #2453562] INFO -- : echo ea9caafc0754b1d6236a490d59e624b53209734a | /bin/sh /tmp/ruby/src/trunk/tool/ifchange /tmp/ruby/src/trunk/.bundle/.timestamp/minitest.revision - I, [2024-05-09T18:13:59.915789 #2453562] INFO -- : echo 84e85124c5014a139af39161d484156cfe87a9ed | /bin/sh /tmp/ruby/src/trunk/tool/ifchange /tmp/ruby/src/trunk/.bundle/.timestamp/power_assert.revision - I, [2024-05-09T18:13:59.917178 #2453562] INFO -- : echo ba7872795d5de04adb8ff500c0e6afdc81a041dd | /bin/sh /tmp/ruby/src/trunk/tool/ifchange /tmp/ruby/src/trunk/.bundle/.timestamp/rbs.revision - I, [2024-05-09T18:13:59.917361 #2453562] INFO -- : echo b19a6416da3a05d57fadd6ffdadb382b6d236ca5 | /bin/sh /tmp/ruby/src/trunk/tool/ifchange /tmp/ruby/src/trunk/.bundle/.timestamp/typeprof.revision - I, [2024-05-09T18:13:59.917713 #2453562] INFO -- : /tmp/ruby/src/trunk/.bundle/.timestamp/power_assert.revision unchanged I, [2024-05-09T18:13:59.917761 #2453562] INFO -- : /tmp/ruby/src/trunk/.bundle/.timestamp/minitest.revision unchanged I, [2024-05-09T18:13:59.918871 #2453562] INFO -- : Building power_assert@84e85124c5014a139af39161d484156cfe87a9ed to /tmp/ruby/src/trunk/gems/power_assert-2.0.3.gem I, [2024-05-09T18:13:59.918961 #2453562] INFO -- : /tmp/ruby/src/trunk/.bundle/.timestamp/typeprof.revision unchanged I, [2024-05-09T18:13:59.918982 #2453562] INFO -- : /tmp/ruby/src/trunk/.bundle/.timestamp/rbs.revision unchanged I, [2024-05-09T18:13:59.987737 #2453562] INFO -- : Successfully built RubyGem I, [2024-05-09T18:13:59.987803 #2453562] INFO -- : Name: power_assert I, [2024-05-09T18:13:59.987822 #2453562] INFO -- : Version: 2.0.4dev I, [2024-05-09T18:13:59.987838 #2453562] INFO -- : File: power_assert-2.0.4dev.gem I, [2024-05-09T18:13:59.989998 #2453562] INFO -- : Extracting bundle gem power_assert-2.0.3... I, [2024-05-09T18:14:00.051166 #2453562] INFO -- : Try with hash version of bundled gems instead of gems/power_assert-2.0.3.gem. We don't use this gem with release version of Ruby. I, [2024-05-09T18:14:00.056169 #2453562] INFO -- : Unpacked gems/power_assert-2.0.4dev.gem I, [2024-05-09T18:14:00.058470 #2453562] INFO -- : $$$[end] "make after-update -j20" exit with 0. I, [2024-05-09T18:14:00.058613 #2453562] INFO -- : $$$[beg] make miniruby -j20 I, [2024-05-09T18:14:00.115435 #2453562] INFO -- : BASERUBY = /usr/bin/ruby --disable=gems I, [2024-05-09T18:14:00.115461 #2453562] INFO -- : CC = gcc I, [2024-05-09T18:14:00.115467 #2453562] INFO -- : LD = ld I, [2024-05-09T18:14:00.115471 #2453562] INFO -- : LDSHARED = gcc -shared I, [2024-05-09T18:14:00.115475 #2453562] INFO -- : CFLAGS = -O3 -fno-fast-math -ggdb3 -Wall -Wextra -Wdeprecated-declarations -Wdiv-by-zero -Wduplicated-cond -Wimplicit-function-declaration -Wimplicit-int -Wpointer-arith -Wwrite-strings -Wold-style-definition -Wimplicit-fallthrough=0 -Wmissing-noreturn -Wno-cast-function-type -Wno-constant-logical-operand -Wno-long-long -Wno-missing-field-initializers -Wno-overlength-strings -Wno-packed-bitfield-compat -Wno-parentheses-equality -Wno-self-assign -Wno-tautological-compare -Wno-unused-parameter -Wno-unused-value -Wsuggest-attribute=format -Wsuggest-attribute=noreturn -Wunused-variable -Wmisleading-indentation -Wundef -fPIC I, [2024-05-09T18:14:00.115479 #2453562] INFO -- : XCFLAGS = -U_FORTIFY_SOURCE -D_FORTIFY_SOURCE=2 -fstack-protector-strong -fno-strict-overflow -fvisibility=hidden -fexcess-precision=standard -DRUBY_EXPORT -I. -I.ext/include/x86_64-linux -I/tmp/ruby/src/trunk/include -I/tmp/ruby/src/trunk -I/tmp/ruby/src/trunk/prism -I/tmp/ruby/src/trunk/enc/unicode/15.0.0 I, [2024-05-09T18:14:00.115483 #2453562] INFO -- : CPPFLAGS = I, [2024-05-09T18:14:00.115486 #2453562] INFO -- : DLDFLAGS = -Wl,--compress-debug-sections=zlib -Wl,-soname,libruby.so.3.4 -fstack-protector-strong I, [2024-05-09T18:14:00.115490 #2453562] INFO -- : SOLIBS = -lz -lrt -lrt -lgmp -ldl -lcrypt -lm -lpthread I, [2024-05-09T18:14:00.115494 #2453562] INFO -- : LANG = en_US.UTF-8 I, [2024-05-09T18:14:00.115497 #2453562] INFO -- : LC_ALL = I, [2024-05-09T18:14:00.115501 #2453562] INFO -- : LC_CTYPE = I, [2024-05-09T18:14:00.115504 #2453562] INFO -- : MFLAGS = -j20 --jobserver-auth=4,5 I, [2024-05-09T18:14:00.115508 #2453562] INFO -- : RUSTC = no I, [2024-05-09T18:14:00.115511 #2453562] INFO -- : YJIT_RUSTC_ARGS = --crate-name=yjit --crate-type=staticlib --edition=2021 -g -C lto=thin -C opt-level=3 -C overflow-checks=on '--out-dir=/tmp/ruby/build/trunk/yjit/target/release/' /tmp/ruby/src/trunk/yjit/src/lib.rs I, [2024-05-09T18:14:00.116814 #2453562] INFO -- : gcc (Ubuntu 11.4.0-1ubuntu1~22.04) 11.4.0 I, [2024-05-09T18:14:00.116835 #2453562] INFO -- : Copyright (C) 2021 Free Software Foundation, Inc. I, [2024-05-09T18:14:00.116841 #2453562] INFO -- : This is free software; see the source for copying conditions. There is NO I, [2024-05-09T18:14:00.116845 #2453562] INFO -- : warranty; not even for MERCHANTABILITY or FITNESS FOR A PARTICULAR PURPOSE. I, [2024-05-09T18:14:00.116848 #2453562] INFO -- : I, [2024-05-09T18:14:00.137587 #2453562] INFO -- : compiling /tmp/ruby/src/trunk/version.c I, [2024-05-09T18:14:00.240421 #2453562] INFO -- : linking miniruby I, [2024-05-09T18:14:00.770171 #2453562] INFO -- : $$$[end] "make miniruby -j20" exit with 0. I, [2024-05-09T18:14:00.770278 #2453562] INFO -- : $$$[beg] make ruby -j20 I, [2024-05-09T18:14:00.827964 #2453562] INFO -- : BASERUBY = /usr/bin/ruby --disable=gems I, [2024-05-09T18:14:00.828008 #2453562] INFO -- : CC = gcc I, [2024-05-09T18:14:00.828021 #2453562] INFO -- : LD = ld I, [2024-05-09T18:14:00.828031 #2453562] INFO -- : LDSHARED = gcc -shared I, [2024-05-09T18:14:00.828047 #2453562] INFO -- : CFLAGS = -O3 -fno-fast-math -ggdb3 -Wall -Wextra -Wdeprecated-declarations -Wdiv-by-zero -Wduplicated-cond -Wimplicit-function-declaration -Wimplicit-int -Wpointer-arith -Wwrite-strings -Wold-style-definition -Wimplicit-fallthrough=0 -Wmissing-noreturn -Wno-cast-function-type -Wno-constant-logical-operand -Wno-long-long -Wno-missing-field-initializers -Wno-overlength-strings -Wno-packed-bitfield-compat -Wno-parentheses-equality -Wno-self-assign -Wno-tautological-compare -Wno-unused-parameter -Wno-unused-value -Wsuggest-attribute=format -Wsuggest-attribute=noreturn -Wunused-variable -Wmisleading-indentation -Wundef -fPIC I, [2024-05-09T18:14:00.828068 #2453562] INFO -- : XCFLAGS = -U_FORTIFY_SOURCE -D_FORTIFY_SOURCE=2 -fstack-protector-strong -fno-strict-overflow -fvisibility=hidden -fexcess-precision=standard -DRUBY_EXPORT -I. -I.ext/include/x86_64-linux -I/tmp/ruby/src/trunk/include -I/tmp/ruby/src/trunk -I/tmp/ruby/src/trunk/prism -I/tmp/ruby/src/trunk/enc/unicode/15.0.0 I, [2024-05-09T18:14:00.828079 #2453562] INFO -- : CPPFLAGS = I, [2024-05-09T18:14:00.828089 #2453562] INFO -- : DLDFLAGS = -Wl,--compress-debug-sections=zlib -Wl,-soname,libruby.so.3.4 -fstack-protector-strong I, [2024-05-09T18:14:00.828100 #2453562] INFO -- : SOLIBS = -lz -lrt -lrt -lgmp -ldl -lcrypt -lm -lpthread I, [2024-05-09T18:14:00.828110 #2453562] INFO -- : LANG = en_US.UTF-8 I, [2024-05-09T18:14:00.828138 #2453562] INFO -- : LC_ALL = I, [2024-05-09T18:14:00.828151 #2453562] INFO -- : LC_CTYPE = I, [2024-05-09T18:14:00.828161 #2453562] INFO -- : MFLAGS = -j20 --jobserver-auth=4,5 I, [2024-05-09T18:14:00.828171 #2453562] INFO -- : RUSTC = no I, [2024-05-09T18:14:00.828181 #2453562] INFO -- : YJIT_RUSTC_ARGS = --crate-name=yjit --crate-type=staticlib --edition=2021 -g -C lto=thin -C opt-level=3 -C overflow-checks=on '--out-dir=/tmp/ruby/build/trunk/yjit/target/release/' /tmp/ruby/src/trunk/yjit/src/lib.rs I, [2024-05-09T18:14:00.829345 #2453562] INFO -- : gcc (Ubuntu 11.4.0-1ubuntu1~22.04) 11.4.0 I, [2024-05-09T18:14:00.829388 #2453562] INFO -- : Copyright (C) 2021 Free Software Foundation, Inc. I, [2024-05-09T18:14:00.829406 #2453562] INFO -- : This is free software; see the source for copying conditions. There is NO I, [2024-05-09T18:14:00.829418 #2453562] INFO -- : warranty; not even for MERCHANTABILITY or FITNESS FOR A PARTICULAR PURPOSE. I, [2024-05-09T18:14:00.829428 #2453562] INFO -- : I, [2024-05-09T18:14:00.938313 #2453562] INFO -- : builtin_binary.inc updated I, [2024-05-09T18:14:00.942926 #2453562] INFO -- : c5234a9416e4f20f175185e840b25b0f08674d14078ed7083f37e655458e3ca9 builtin_binary.inc I, [2024-05-09T18:14:00.943688 #2453562] INFO -- : compiling /tmp/ruby/src/trunk/builtin.c I, [2024-05-09T18:14:01.127446 #2453562] INFO -- : linking static-library libruby-static.a I, [2024-05-09T18:14:01.442965 #2453562] INFO -- : linking shared-library libruby.so.3.4.0 I, [2024-05-09T18:14:03.017079 #2453562] INFO -- : linking ruby I, [2024-05-09T18:14:03.040355 #2453562] INFO -- : $$$[end] "make ruby -j20" exit with 0. I, [2024-05-09T18:14:03.040496 #2453562] INFO -- : $$$[beg] make all -j20 I, [2024-05-09T18:14:03.098063 #2453562] INFO -- : BASERUBY = /usr/bin/ruby --disable=gems I, [2024-05-09T18:14:03.098091 #2453562] INFO -- : CC = gcc I, [2024-05-09T18:14:03.098097 #2453562] INFO -- : LD = ld I, [2024-05-09T18:14:03.098100 #2453562] INFO -- : LDSHARED = gcc -shared I, [2024-05-09T18:14:03.098104 #2453562] INFO -- : CFLAGS = -O3 -fno-fast-math -ggdb3 -Wall -Wextra -Wdeprecated-declarations -Wdiv-by-zero -Wduplicated-cond -Wimplicit-function-declaration -Wimplicit-int -Wpointer-arith -Wwrite-strings -Wold-style-definition -Wimplicit-fallthrough=0 -Wmissing-noreturn -Wno-cast-function-type -Wno-constant-logical-operand -Wno-long-long -Wno-missing-field-initializers -Wno-overlength-strings -Wno-packed-bitfield-compat -Wno-parentheses-equality -Wno-self-assign -Wno-tautological-compare -Wno-unused-parameter -Wno-unused-value -Wsuggest-attribute=format -Wsuggest-attribute=noreturn -Wunused-variable -Wmisleading-indentation -Wundef -fPIC I, [2024-05-09T18:14:03.098110 #2453562] INFO -- : XCFLAGS = -U_FORTIFY_SOURCE -D_FORTIFY_SOURCE=2 -fstack-protector-strong -fno-strict-overflow -fvisibility=hidden -fexcess-precision=standard -DRUBY_EXPORT -I. -I.ext/include/x86_64-linux -I/tmp/ruby/src/trunk/include -I/tmp/ruby/src/trunk -I/tmp/ruby/src/trunk/prism -I/tmp/ruby/src/trunk/enc/unicode/15.0.0 I, [2024-05-09T18:14:03.098114 #2453562] INFO -- : CPPFLAGS = I, [2024-05-09T18:14:03.098118 #2453562] INFO -- : DLDFLAGS = -Wl,--compress-debug-sections=zlib -Wl,-soname,libruby.so.3.4 -fstack-protector-strong I, [2024-05-09T18:14:03.098127 #2453562] INFO -- : SOLIBS = -lz -lrt -lrt -lgmp -ldl -lcrypt -lm -lpthread I, [2024-05-09T18:14:03.098130 #2453562] INFO -- : LANG = en_US.UTF-8 I, [2024-05-09T18:14:03.098134 #2453562] INFO -- : LC_ALL = I, [2024-05-09T18:14:03.098137 #2453562] INFO -- : LC_CTYPE = I, [2024-05-09T18:14:03.098141 #2453562] INFO -- : MFLAGS = -j20 --jobserver-auth=4,5 I, [2024-05-09T18:14:03.098144 #2453562] INFO -- : RUSTC = no I, [2024-05-09T18:14:03.098149 #2453562] INFO -- : YJIT_RUSTC_ARGS = --crate-name=yjit --crate-type=staticlib --edition=2021 -g -C lto=thin -C opt-level=3 -C overflow-checks=on '--out-dir=/tmp/ruby/build/trunk/yjit/target/release/' /tmp/ruby/src/trunk/yjit/src/lib.rs I, [2024-05-09T18:14:03.099494 #2453562] INFO -- : gcc (Ubuntu 11.4.0-1ubuntu1~22.04) 11.4.0 I, [2024-05-09T18:14:03.099516 #2453562] INFO -- : Copyright (C) 2021 Free Software Foundation, Inc. I, [2024-05-09T18:14:03.099521 #2453562] INFO -- : This is free software; see the source for copying conditions. There is NO I, [2024-05-09T18:14:03.099525 #2453562] INFO -- : warranty; not even for MERCHANTABILITY or FITNESS FOR A PARTICULAR PURPOSE. I, [2024-05-09T18:14:03.099529 #2453562] INFO -- : I, [2024-05-09T18:14:03.127260 #2453562] INFO -- : generating encdb.h I, [2024-05-09T18:14:03.128491 #2453562] INFO -- : generating enc.mk I, [2024-05-09T18:14:03.130342 #2453562] INFO -- : building spec/ruby/optional/capi/ext/array_spec.so I, [2024-05-09T18:14:03.130573 #2453562] INFO -- : building spec/ruby/optional/capi/ext/basic_object_spec.so I, [2024-05-09T18:14:03.130886 #2453562] INFO -- : building spec/ruby/optional/capi/ext/bignum_spec.so I, [2024-05-09T18:14:03.131545 #2453562] INFO -- : building spec/ruby/optional/capi/ext/binding_spec.so I, [2024-05-09T18:14:03.132302 #2453562] INFO -- : building spec/ruby/optional/capi/ext/boolean_spec.so I, [2024-05-09T18:14:03.132486 #2453562] INFO -- : building spec/ruby/optional/capi/ext/class_id_under_autoload_spec.so I, [2024-05-09T18:14:03.133517 #2453562] INFO -- : building spec/ruby/optional/capi/ext/class_spec.so I, [2024-05-09T18:14:03.134492 #2453562] INFO -- : building spec/ruby/optional/capi/ext/class_under_autoload_spec.so I, [2024-05-09T18:14:03.134842 #2453562] INFO -- : building spec/ruby/optional/capi/ext/complex_spec.so I, [2024-05-09T18:14:03.135548 #2453562] INFO -- : building spec/ruby/optional/capi/ext/constants_spec.so I, [2024-05-09T18:14:03.136151 #2453562] INFO -- : building spec/ruby/optional/capi/ext/data_spec.so I, [2024-05-09T18:14:03.136436 #2453562] INFO -- : building spec/ruby/optional/capi/ext/debug_spec.so I, [2024-05-09T18:14:03.137166 #2453562] INFO -- : building spec/ruby/optional/capi/ext/encoding_spec.so I, [2024-05-09T18:14:03.137520 #2453562] INFO -- : building spec/ruby/optional/capi/ext/enumerator_spec.so I, [2024-05-09T18:14:03.138021 #2453562] INFO -- : building spec/ruby/optional/capi/ext/exception_spec.so I, [2024-05-09T18:14:03.138288 #2453562] INFO -- : building spec/ruby/optional/capi/ext/fiber_spec.so I, [2024-05-09T18:14:03.140487 #2453562] INFO -- : building spec/ruby/optional/capi/ext/file_spec.so I, [2024-05-09T18:14:03.164114 #2453562] INFO -- : encdb.h unchanged I, [2024-05-09T18:14:03.172936 #2453562] INFO -- : building spec/ruby/optional/capi/ext/fixnum_spec.so I, [2024-05-09T18:14:03.173495 #2453562] INFO -- : building spec/ruby/optional/capi/ext/float_spec.so I, [2024-05-09T18:14:03.276219 #2453562] INFO -- : building spec/ruby/optional/capi/ext/gc_spec.so I, [2024-05-09T18:14:03.286702 #2453562] INFO -- : building spec/ruby/optional/capi/ext/globals_spec.so I, [2024-05-09T18:14:03.289202 #2453562] INFO -- : building spec/ruby/optional/capi/ext/hash_spec.so I, [2024-05-09T18:14:03.296725 #2453562] INFO -- : building spec/ruby/optional/capi/ext/integer_spec.so I, [2024-05-09T18:14:03.299427 #2453562] INFO -- : building spec/ruby/optional/capi/ext/io_spec.so I, [2024-05-09T18:14:03.305487 #2453562] INFO -- : building spec/ruby/optional/capi/ext/kernel_spec.so I, [2024-05-09T18:14:03.307755 #2453562] INFO -- : building spec/ruby/optional/capi/ext/marshal_spec.so I, [2024-05-09T18:14:03.307857 #2453562] INFO -- : building spec/ruby/optional/capi/ext/language_spec.so I, [2024-05-09T18:14:03.321400 #2453562] INFO -- : building spec/ruby/optional/capi/ext/module_spec.so I, [2024-05-09T18:14:03.322583 #2453562] INFO -- : building spec/ruby/optional/capi/ext/module_under_autoload_spec.so I, [2024-05-09T18:14:03.323669 #2453562] INFO -- : building spec/ruby/optional/capi/ext/mutex_spec.so I, [2024-05-09T18:14:03.341541 #2453562] INFO -- : building spec/ruby/optional/capi/ext/numeric_spec.so I, [2024-05-09T18:14:03.341827 #2453562] INFO -- : building spec/ruby/optional/capi/ext/object_spec.so I, [2024-05-09T18:14:03.342294 #2453562] INFO -- : building spec/ruby/optional/capi/ext/proc_spec.so I, [2024-05-09T18:14:03.344936 #2453562] INFO -- : building spec/ruby/optional/capi/ext/range_spec.so I, [2024-05-09T18:14:03.377928 #2453562] INFO -- : building spec/ruby/optional/capi/ext/rational_spec.so I, [2024-05-09T18:14:03.400050 #2453562] INFO -- : building spec/ruby/optional/capi/ext/rbasic_spec.so I, [2024-05-09T18:14:03.427366 #2453562] INFO -- : building spec/ruby/optional/capi/ext/regexp_spec.so I, [2024-05-09T18:14:03.439387 #2453562] INFO -- : building spec/ruby/optional/capi/ext/string_spec.so I, [2024-05-09T18:14:03.447775 #2453562] INFO -- : building spec/ruby/optional/capi/ext/struct_spec.so I, [2024-05-09T18:14:03.461519 #2453562] INFO -- : building spec/ruby/optional/capi/ext/st_spec.so I, [2024-05-09T18:14:03.462727 #2453562] INFO -- : building spec/ruby/optional/capi/ext/symbol_spec.so I, [2024-05-09T18:14:03.481894 #2453562] INFO -- : building spec/ruby/optional/capi/ext/thread_spec.so I, [2024-05-09T18:14:03.482368 #2453562] INFO -- : building spec/ruby/optional/capi/ext/time_spec.so I, [2024-05-09T18:14:03.483183 #2453562] INFO -- : building spec/ruby/optional/capi/ext/tracepoint_spec.so I, [2024-05-09T18:14:03.494155 #2453562] INFO -- : building spec/ruby/optional/capi/ext/typed_data_spec.so I, [2024-05-09T18:14:03.497406 #2453562] INFO -- : building spec/ruby/optional/capi/ext/util_spec.so I, [2024-05-09T18:14:03.515469 #2453562] INFO -- : making enc I, [2024-05-09T18:14:03.516040 #2453562] INFO -- : making srcs under enc I, [2024-05-09T18:14:03.539306 #2453562] INFO -- : make[1]: Entering directory '/tmp/ruby/build/trunk' I, [2024-05-09T18:14:03.539372 #2453562] INFO -- : make[1]: Nothing to be done for 'enc'. I, [2024-05-09T18:14:03.540283 #2453562] INFO -- : make[1]: Leaving directory '/tmp/ruby/build/trunk' I, [2024-05-09T18:14:03.567871 #2453562] INFO -- : make[1]: Entering directory '/tmp/ruby/build/trunk' I, [2024-05-09T18:14:03.567935 #2453562] INFO -- : make[1]: Nothing to be done for 'srcs'. I, [2024-05-09T18:14:03.567942 #2453562] INFO -- : make[1]: Leaving directory '/tmp/ruby/build/trunk' I, [2024-05-09T18:14:03.568730 #2453562] INFO -- : generating transdb.h I, [2024-05-09T18:14:03.682963 #2453562] INFO -- : transdb.h unchanged I, [2024-05-09T18:14:03.684204 #2453562] INFO -- : generating makefiles ext/configure-ext.mk I, [2024-05-09T18:14:03.684431 #2453562] INFO -- : making trans I, [2024-05-09T18:14:03.710711 #2453562] INFO -- : ext/configure-ext.mk updated I, [2024-05-09T18:14:03.713278 #2453562] INFO -- : make[1]: Entering directory '/tmp/ruby/build/trunk' I, [2024-05-09T18:14:03.718167 #2453562] INFO -- : make[1]: Entering directory '/tmp/ruby/build/trunk' I, [2024-05-09T18:14:03.718256 #2453562] INFO -- : make[1]: Nothing to be done for 'trans'. I, [2024-05-09T18:14:03.718270 #2453562] INFO -- : make[1]: Leaving directory '/tmp/ruby/build/trunk' I, [2024-05-09T18:14:03.799879 #2453562] INFO -- : making encs I, [2024-05-09T18:14:03.848870 #2453562] INFO -- : make[1]: Entering directory '/tmp/ruby/build/trunk' I, [2024-05-09T18:14:03.848935 #2453562] INFO -- : make[1]: Nothing to be done for 'encs'. I, [2024-05-09T18:14:03.848946 #2453562] INFO -- : make[1]: Leaving directory '/tmp/ruby/build/trunk' I, [2024-05-09T18:14:03.882137 #2453562] INFO -- : make[1]: Leaving directory '/tmp/ruby/build/trunk' I, [2024-05-09T18:14:03.882915 #2453562] INFO -- : generating makefile exts.mk I, [2024-05-09T18:14:03.921851 #2453562] INFO -- : exts.mk unchanged I, [2024-05-09T18:14:03.926367 #2453562] INFO -- : make[1]: Entering directory '/tmp/ruby/build/trunk' I, [2024-05-09T18:14:03.946716 #2453562] INFO -- : make[2]: Entering directory '/tmp/ruby/build/trunk/ext/digest' I, [2024-05-09T18:14:03.946770 #2453562] INFO -- : make[2]: Entering directory '/tmp/ruby/build/trunk/ext/date' I, [2024-05-09T18:14:03.946898 #2453562] INFO -- : make[2]: Entering directory '/tmp/ruby/build/trunk/ext/coverage' I, [2024-05-09T18:14:03.946975 #2453562] INFO -- : make[2]: Entering directory '/tmp/ruby/build/trunk/ext/json' I, [2024-05-09T18:14:03.948908 #2453562] INFO -- : make[2]: Entering directory '/tmp/ruby/build/trunk/ext/io/console' I, [2024-05-09T18:14:03.949095 #2453562] INFO -- : make[2]: Entering directory '/tmp/ruby/build/trunk/ext/monitor' I, [2024-05-09T18:14:03.949489 #2453562] INFO -- : make[2]: Entering directory '/tmp/ruby/build/trunk/ext/pathname' I, [2024-05-09T18:14:03.950160 #2453562] INFO -- : make[2]: Entering directory '/tmp/ruby/build/trunk/ext/pty' I, [2024-05-09T18:14:03.950252 #2453562] INFO -- : make[2]: Entering directory '/tmp/ruby/build/trunk/ext/rubyvm' I, [2024-05-09T18:14:03.950391 #2453562] INFO -- : make[2]: Leaving directory '/tmp/ruby/build/trunk/ext/date' I, [2024-05-09T18:14:03.950814 #2453562] INFO -- : make[2]: Leaving directory '/tmp/ruby/build/trunk/ext/coverage' I, [2024-05-09T18:14:03.951248 #2453562] INFO -- : make[2]: Entering directory '/tmp/ruby/build/trunk/ext/objspace' I, [2024-05-09T18:14:03.951830 #2453562] INFO -- : make[2]: Leaving directory '/tmp/ruby/build/trunk/ext/io/console' I, [2024-05-09T18:14:03.952159 #2453562] INFO -- : make[2]: Entering directory '/tmp/ruby/build/trunk/ext/psych' I, [2024-05-09T18:14:03.952185 #2453562] INFO -- : make[2]: Leaving directory '/tmp/ruby/build/trunk/ext/pathname' I, [2024-05-09T18:14:03.952429 #2453562] INFO -- : make[2]: Leaving directory '/tmp/ruby/build/trunk/ext/monitor' I, [2024-05-09T18:14:03.952737 #2453562] INFO -- : make[2]: Entering directory '/tmp/ruby/build/trunk/ext/fiddle' I, [2024-05-09T18:14:03.952759 #2453562] INFO -- : make[2]: Leaving directory '/tmp/ruby/build/trunk/ext/rubyvm' I, [2024-05-09T18:14:03.952799 #2453562] INFO -- : make[2]: Leaving directory '/tmp/ruby/build/trunk/ext/pty' I, [2024-05-09T18:14:03.953166 #2453562] INFO -- : make[2]: Entering directory '/tmp/ruby/build/trunk/.bundle/gems/bigdecimal-3.1.7/ext/bigdecimal' I, [2024-05-09T18:14:03.953681 #2453562] INFO -- : make[2]: Leaving directory '/tmp/ruby/build/trunk/ext/json' I, [2024-05-09T18:14:03.953705 #2453562] INFO -- : make[2]: Entering directory '/tmp/ruby/build/trunk/.bundle/gems/debug-1.9.2/ext/debug' I, [2024-05-09T18:14:03.953944 #2453562] INFO -- : make[2]: Entering directory '/tmp/ruby/build/trunk/.bundle/gems/bigdecimal-3.1.8/ext/bigdecimal' I, [2024-05-09T18:14:03.954144 #2453562] INFO -- : make[2]: Leaving directory '/tmp/ruby/build/trunk/ext/digest' I, [2024-05-09T18:14:03.954611 #2453562] INFO -- : make[2]: Entering directory '/tmp/ruby/build/trunk/.bundle/gems/nkf-0.2.0/ext/nkf' I, [2024-05-09T18:14:03.954992 #2453562] INFO -- : make[2]: Entering directory '/tmp/ruby/build/trunk/.bundle/gems/racc-1.7.3/ext/racc/cparse' I, [2024-05-09T18:14:03.955919 #2453562] INFO -- : make[2]: Entering directory '/tmp/ruby/build/trunk/.bundle/gems/rbs-3.4.4/ext/rbs_extension' I, [2024-05-09T18:14:03.956062 #2453562] INFO -- : make[2]: Entering directory '/tmp/ruby/build/trunk/ext/ripper' I, [2024-05-09T18:14:03.956619 #2453562] INFO -- : make[2]: Leaving directory '/tmp/ruby/build/trunk/ext/objspace' I, [2024-05-09T18:14:03.956652 #2453562] INFO -- : make[2]: Entering directory '/tmp/ruby/build/trunk/.bundle/gems/syslog-0.1.2/ext/syslog' I, [2024-05-09T18:14:03.959489 #2453562] INFO -- : make[2]: Entering directory '/tmp/ruby/build/trunk/ext/digest/sha2' I, [2024-05-09T18:14:03.959705 #2453562] INFO -- : make[2]: Leaving directory '/tmp/ruby/build/trunk/ext/fiddle' I, [2024-05-09T18:14:03.960638 #2453562] INFO -- : make[2]: Entering directory '/tmp/ruby/build/trunk/ext/socket' I, [2024-05-09T18:14:03.961832 #2453562] INFO -- : make[2]: Leaving directory '/tmp/ruby/build/trunk/ext/digest/sha2' I, [2024-05-09T18:14:03.963105 #2453562] INFO -- : make[2]: Entering directory '/tmp/ruby/build/trunk/ext/openssl' I, [2024-05-09T18:14:03.963487 #2453562] INFO -- : make[2]: Leaving directory '/tmp/ruby/build/trunk/ext/ripper' I, [2024-05-09T18:14:03.965035 #2453562] INFO -- : make[2]: Leaving directory '/tmp/ruby/build/trunk/ext/psych' I, [2024-05-09T18:14:03.969642 #2453562] INFO -- : make[2]: Leaving directory '/tmp/ruby/build/trunk/ext/socket' I, [2024-05-09T18:14:03.974436 #2453562] INFO -- : make[2]: Leaving directory '/tmp/ruby/build/trunk/ext/openssl' I, [2024-05-09T18:14:03.977828 #2453562] INFO -- : make[2]: Leaving directory '/tmp/ruby/build/trunk/.bundle/gems/bigdecimal-3.1.7/ext/bigdecimal' I, [2024-05-09T18:14:03.979397 #2453562] INFO -- : make[2]: Leaving directory '/tmp/ruby/build/trunk/.bundle/gems/racc-1.7.3/ext/racc/cparse' I, [2024-05-09T18:14:03.979725 #2453562] INFO -- : make[2]: Leaving directory '/tmp/ruby/build/trunk/.bundle/gems/rbs-3.4.4/ext/rbs_extension' I, [2024-05-09T18:14:03.979889 #2453562] INFO -- : make[2]: Leaving directory '/tmp/ruby/build/trunk/.bundle/gems/syslog-0.1.2/ext/syslog' I, [2024-05-09T18:14:03.986801 #2453562] INFO -- : make[2]: Leaving directory '/tmp/ruby/build/trunk/.bundle/gems/bigdecimal-3.1.8/ext/bigdecimal' I, [2024-05-09T18:14:03.987004 #2453562] INFO -- : make[2]: Leaving directory '/tmp/ruby/build/trunk/.bundle/gems/nkf-0.2.0/ext/nkf' I, [2024-05-09T18:14:03.987148 #2453562] INFO -- : make[2]: Leaving directory '/tmp/ruby/build/trunk/.bundle/gems/debug-1.9.2/ext/debug' I, [2024-05-09T18:14:04.011830 #2453562] INFO -- : make[2]: Entering directory '/tmp/ruby/build/trunk' I, [2024-05-09T18:14:04.078136 #2453562] INFO -- : linking ruby I, [2024-05-09T18:14:04.101588 #2453562] INFO -- : make[2]: Leaving directory '/tmp/ruby/build/trunk' I, [2024-05-09T18:14:04.102025 #2453562] INFO -- : make[1]: Leaving directory '/tmp/ruby/build/trunk' I, [2024-05-09T18:14:04.105875 #2453562] INFO -- : make[1]: Entering directory '/tmp/ruby/build/trunk' I, [2024-05-09T18:14:04.105898 #2453562] INFO -- : make[1]: Nothing to be done for 'note'. I, [2024-05-09T18:14:04.105905 #2453562] INFO -- : make[1]: Leaving directory '/tmp/ruby/build/trunk' I, [2024-05-09T18:14:04.106641 #2453562] INFO -- : $$$[end] "make all -j20" exit with 0. I, [2024-05-09T18:14:04.106799 #2453562] INFO -- : $$$[beg] make install -j20 I, [2024-05-09T18:14:04.169607 #2453562] INFO -- : Update minitest to ea9caafc0754b1d6236a490d59e624b53209734a I, [2024-05-09T18:14:04.169654 #2453562] INFO -- : Update power_assert to 84e85124c5014a139af39161d484156cfe87a9ed I, [2024-05-09T18:14:04.170439 #2453562] INFO -- : Update rbs to ba7872795d5de04adb8ff500c0e6afdc81a041dd I, [2024-05-09T18:14:04.170503 #2453562] INFO -- : Update typeprof to b19a6416da3a05d57fadd6ffdadb382b6d236ca5 I, [2024-05-09T18:14:04.171273 #2453562] INFO -- : echo ea9caafc0754b1d6236a490d59e624b53209734a | /bin/sh /tmp/ruby/src/trunk/tool/ifchange /tmp/ruby/src/trunk/.bundle/.timestamp/minitest.revision - I, [2024-05-09T18:14:04.171430 #2453562] INFO -- : echo 84e85124c5014a139af39161d484156cfe87a9ed | /bin/sh /tmp/ruby/src/trunk/tool/ifchange /tmp/ruby/src/trunk/.bundle/.timestamp/power_assert.revision - I, [2024-05-09T18:14:04.172157 #2453562] INFO -- : BASERUBY = /usr/bin/ruby --disable=gems I, [2024-05-09T18:14:04.172202 #2453562] INFO -- : CC = gcc I, [2024-05-09T18:14:04.172215 #2453562] INFO -- : LD = ld I, [2024-05-09T18:14:04.172227 #2453562] INFO -- : LDSHARED = gcc -shared I, [2024-05-09T18:14:04.172238 #2453562] INFO -- : CFLAGS = -O3 -fno-fast-math -ggdb3 -Wall -Wextra -Wdeprecated-declarations -Wdiv-by-zero -Wduplicated-cond -Wimplicit-function-declaration -Wimplicit-int -Wpointer-arith -Wwrite-strings -Wold-style-definition -Wimplicit-fallthrough=0 -Wmissing-noreturn -Wno-cast-function-type -Wno-constant-logical-operand -Wno-long-long -Wno-missing-field-initializers -Wno-overlength-strings -Wno-packed-bitfield-compat -Wno-parentheses-equality -Wno-self-assign -Wno-tautological-compare -Wno-unused-parameter -Wno-unused-value -Wsuggest-attribute=format -Wsuggest-attribute=noreturn -Wunused-variable -Wmisleading-indentation -Wundef -fPIC I, [2024-05-09T18:14:04.172261 #2453562] INFO -- : XCFLAGS = -U_FORTIFY_SOURCE -D_FORTIFY_SOURCE=2 -fstack-protector-strong -fno-strict-overflow -fvisibility=hidden -fexcess-precision=standard -DRUBY_EXPORT -I. -I.ext/include/x86_64-linux -I/tmp/ruby/src/trunk/include -I/tmp/ruby/src/trunk -I/tmp/ruby/src/trunk/prism -I/tmp/ruby/src/trunk/enc/unicode/15.0.0 I, [2024-05-09T18:14:04.172273 #2453562] INFO -- : CPPFLAGS = I, [2024-05-09T18:14:04.172285 #2453562] INFO -- : DLDFLAGS = -Wl,--compress-debug-sections=zlib -Wl,-soname,libruby.so.3.4 -fstack-protector-strong I, [2024-05-09T18:14:04.172296 #2453562] INFO -- : SOLIBS = -lz -lrt -lrt -lgmp -ldl -lcrypt -lm -lpthread I, [2024-05-09T18:14:04.172306 #2453562] INFO -- : LANG = en_US.UTF-8 I, [2024-05-09T18:14:04.172316 #2453562] INFO -- : LC_ALL = I, [2024-05-09T18:14:04.172326 #2453562] INFO -- : LC_CTYPE = I, [2024-05-09T18:14:04.172337 #2453562] INFO -- : MFLAGS = -j20 --jobserver-auth=4,5 I, [2024-05-09T18:14:04.172349 #2453562] INFO -- : RUSTC = no I, [2024-05-09T18:14:04.172360 #2453562] INFO -- : YJIT_RUSTC_ARGS = --crate-name=yjit --crate-type=staticlib --edition=2021 -g -C lto=thin -C opt-level=3 -C overflow-checks=on '--out-dir=/tmp/ruby/build/trunk/yjit/target/release/' /tmp/ruby/src/trunk/yjit/src/lib.rs I, [2024-05-09T18:14:04.173134 #2453562] INFO -- : /tmp/ruby/src/trunk/.bundle/.timestamp/minitest.revision unchanged I, [2024-05-09T18:14:04.173334 #2453562] INFO -- : /tmp/ruby/src/trunk/.bundle/.timestamp/power_assert.revision unchanged I, [2024-05-09T18:14:04.199869 #2453562] INFO -- : echo ba7872795d5de04adb8ff500c0e6afdc81a041dd | /bin/sh /tmp/ruby/src/trunk/tool/ifchange /tmp/ruby/src/trunk/.bundle/.timestamp/rbs.revision - I, [2024-05-09T18:14:04.199924 #2453562] INFO -- : echo b19a6416da3a05d57fadd6ffdadb382b6d236ca5 | /bin/sh /tmp/ruby/src/trunk/tool/ifchange /tmp/ruby/src/trunk/.bundle/.timestamp/typeprof.revision - I, [2024-05-09T18:14:04.200730 #2453562] INFO -- : gcc (Ubuntu 11.4.0-1ubuntu1~22.04) 11.4.0 I, [2024-05-09T18:14:04.200787 #2453562] INFO -- : Copyright (C) 2021 Free Software Foundation, Inc. I, [2024-05-09T18:14:04.200801 #2453562] INFO -- : This is free software; see the source for copying conditions. There is NO I, [2024-05-09T18:14:04.200813 #2453562] INFO -- : warranty; not even for MERCHANTABILITY or FITNESS FOR A PARTICULAR PURPOSE. I, [2024-05-09T18:14:04.200823 #2453562] INFO -- : I, [2024-05-09T18:14:04.200834 #2453562] INFO -- : generating encdb.h I, [2024-05-09T18:14:04.201902 #2453562] INFO -- : generating enc.mk I, [2024-05-09T18:14:04.201956 #2453562] INFO -- : /tmp/ruby/src/trunk/.bundle/.timestamp/rbs.revision unchanged I, [2024-05-09T18:14:04.202161 #2453562] INFO -- : /tmp/ruby/src/trunk/.bundle/.timestamp/typeprof.revision unchanged I, [2024-05-09T18:14:04.225273 #2453562] INFO -- : encdb.h unchanged I, [2024-05-09T18:14:04.226581 #2453562] INFO -- : Building power_assert@84e85124c5014a139af39161d484156cfe87a9ed to /tmp/ruby/src/trunk/gems/power_assert-2.0.3.gem I, [2024-05-09T18:14:04.295560 #2453562] INFO -- : Successfully built RubyGem I, [2024-05-09T18:14:04.295609 #2453562] INFO -- : Name: power_assert I, [2024-05-09T18:14:04.295622 #2453562] INFO -- : Version: 2.0.4dev I, [2024-05-09T18:14:04.295633 #2453562] INFO -- : File: power_assert-2.0.4dev.gem I, [2024-05-09T18:14:04.297513 #2453562] INFO -- : Extracting bundle gem power_assert-2.0.3... I, [2024-05-09T18:14:04.324374 #2453562] INFO -- : making srcs under enc I, [2024-05-09T18:14:04.324433 #2453562] INFO -- : making enc I, [2024-05-09T18:14:04.342263 #2453562] INFO -- : make[1]: Entering directory '/tmp/ruby/build/trunk' I, [2024-05-09T18:14:04.342311 #2453562] INFO -- : make[1]: Nothing to be done for 'enc'. I, [2024-05-09T18:14:04.342329 #2453562] INFO -- : make[1]: Leaving directory '/tmp/ruby/build/trunk' I, [2024-05-09T18:14:04.354001 #2453562] INFO -- : make[1]: Entering directory '/tmp/ruby/build/trunk' I, [2024-05-09T18:14:04.354058 #2453562] INFO -- : make[1]: Nothing to be done for 'srcs'. I, [2024-05-09T18:14:04.354071 #2453562] INFO -- : make[1]: Leaving directory '/tmp/ruby/build/trunk' I, [2024-05-09T18:14:04.354788 #2453562] INFO -- : generating transdb.h I, [2024-05-09T18:14:04.358819 #2453562] INFO -- : Try with hash version of bundled gems instead of gems/power_assert-2.0.3.gem. We don't use this gem with release version of Ruby. I, [2024-05-09T18:14:04.363789 #2453562] INFO -- : Unpacked gems/power_assert-2.0.4dev.gem I, [2024-05-09T18:14:04.449563 #2453562] INFO -- : transdb.h unchanged I, [2024-05-09T18:14:04.451093 #2453562] INFO -- : generating makefiles ext/configure-ext.mk I, [2024-05-09T18:14:04.451152 #2453562] INFO -- : making trans I, [2024-05-09T18:14:04.477692 #2453562] INFO -- : ext/configure-ext.mk unchanged I, [2024-05-09T18:14:04.479866 #2453562] INFO -- : make[1]: Entering directory '/tmp/ruby/build/trunk' I, [2024-05-09T18:14:04.485457 #2453562] INFO -- : make[1]: Entering directory '/tmp/ruby/build/trunk' I, [2024-05-09T18:14:04.485553 #2453562] INFO -- : make[1]: Nothing to be done for 'trans'. I, [2024-05-09T18:14:04.485561 #2453562] INFO -- : make[1]: Leaving directory '/tmp/ruby/build/trunk' I, [2024-05-09T18:14:04.486495 #2453562] INFO -- : making encs I, [2024-05-09T18:14:04.544510 #2453562] INFO -- : make[1]: Entering directory '/tmp/ruby/build/trunk' I, [2024-05-09T18:14:04.544588 #2453562] INFO -- : make[1]: Nothing to be done for 'encs'. I, [2024-05-09T18:14:04.544619 #2453562] INFO -- : make[1]: Leaving directory '/tmp/ruby/build/trunk' I, [2024-05-09T18:14:04.635775 #2453562] INFO -- : make[1]: Leaving directory '/tmp/ruby/build/trunk' I, [2024-05-09T18:14:04.636566 #2453562] INFO -- : generating makefile exts.mk I, [2024-05-09T18:14:04.674302 #2453562] INFO -- : exts.mk unchanged I, [2024-05-09T18:14:04.678848 #2453562] INFO -- : make[1]: Entering directory '/tmp/ruby/build/trunk' I, [2024-05-09T18:14:04.698257 #2453562] INFO -- : make[2]: Entering directory '/tmp/ruby/build/trunk/ext/digest' I, [2024-05-09T18:14:04.699722 #2453562] INFO -- : make[2]: Entering directory '/tmp/ruby/build/trunk/ext/coverage' I, [2024-05-09T18:14:04.700388 #2453562] INFO -- : make[2]: Entering directory '/tmp/ruby/build/trunk/ext/date' I, [2024-05-09T18:14:04.700420 #2453562] INFO -- : make[2]: Entering directory '/tmp/ruby/build/trunk/ext/json' I, [2024-05-09T18:14:04.701904 #2453562] INFO -- : make[2]: Entering directory '/tmp/ruby/build/trunk/ext/io/console' I, [2024-05-09T18:14:04.702299 #2453562] INFO -- : make[2]: Leaving directory '/tmp/ruby/build/trunk/ext/digest' I, [2024-05-09T18:14:04.702653 #2453562] INFO -- : make[2]: Entering directory '/tmp/ruby/build/trunk/ext/monitor' I, [2024-05-09T18:14:04.703342 #2453562] INFO -- : make[2]: Entering directory '/tmp/ruby/build/trunk/ext/fiddle' I, [2024-05-09T18:14:04.703409 #2453562] INFO -- : make[2]: Entering directory '/tmp/ruby/build/trunk/ext/pathname' I, [2024-05-09T18:14:04.703461 #2453562] INFO -- : make[2]: Leaving directory '/tmp/ruby/build/trunk/ext/coverage' I, [2024-05-09T18:14:04.703983 #2453562] INFO -- : make[2]: Leaving directory '/tmp/ruby/build/trunk/ext/date' I, [2024-05-09T18:14:04.704068 #2453562] INFO -- : make[2]: Entering directory '/tmp/ruby/build/trunk/ext/rubyvm' I, [2024-05-09T18:14:04.704101 #2453562] INFO -- : make[2]: Entering directory '/tmp/ruby/build/trunk/ext/pty' I, [2024-05-09T18:14:04.704749 #2453562] INFO -- : make[2]: Leaving directory '/tmp/ruby/build/trunk/ext/io/console' I, [2024-05-09T18:14:04.705167 #2453562] INFO -- : make[2]: Entering directory '/tmp/ruby/build/trunk/ext/objspace' I, [2024-05-09T18:14:04.705345 #2453562] INFO -- : make[2]: Entering directory '/tmp/ruby/build/trunk/ext/psych' I, [2024-05-09T18:14:04.705896 #2453562] INFO -- : make[2]: Leaving directory '/tmp/ruby/build/trunk/ext/json' I, [2024-05-09T18:14:04.705974 #2453562] INFO -- : make[2]: Leaving directory '/tmp/ruby/build/trunk/ext/monitor' I, [2024-05-09T18:14:04.706135 #2453562] INFO -- : make[2]: Leaving directory '/tmp/ruby/build/trunk/ext/pathname' I, [2024-05-09T18:14:04.706259 #2453562] INFO -- : make[2]: Leaving directory '/tmp/ruby/build/trunk/ext/rubyvm' I, [2024-05-09T18:14:04.706751 #2453562] INFO -- : make[2]: Leaving directory '/tmp/ruby/build/trunk/ext/pty' I, [2024-05-09T18:14:04.708631 #2453562] INFO -- : make[2]: Entering directory '/tmp/ruby/build/trunk/.bundle/gems/bigdecimal-3.1.7/ext/bigdecimal' I, [2024-05-09T18:14:04.708783 #2453562] INFO -- : make[2]: Entering directory '/tmp/ruby/build/trunk/.bundle/gems/bigdecimal-3.1.8/ext/bigdecimal' I, [2024-05-09T18:14:04.708810 #2453562] INFO -- : make[2]: Entering directory '/tmp/ruby/build/trunk/.bundle/gems/debug-1.9.2/ext/debug' I, [2024-05-09T18:14:04.708826 #2453562] INFO -- : make[2]: Entering directory '/tmp/ruby/build/trunk/.bundle/gems/nkf-0.2.0/ext/nkf' I, [2024-05-09T18:14:04.708929 #2453562] INFO -- : make[2]: Entering directory '/tmp/ruby/build/trunk/.bundle/gems/racc-1.7.3/ext/racc/cparse' I, [2024-05-09T18:14:04.709130 #2453562] INFO -- : make[2]: Entering directory '/tmp/ruby/build/trunk/.bundle/gems/rbs-3.4.4/ext/rbs_extension' I, [2024-05-09T18:14:04.709380 #2453562] INFO -- : make[2]: Leaving directory '/tmp/ruby/build/trunk/ext/objspace' I, [2024-05-09T18:14:04.709407 #2453562] INFO -- : make[2]: Entering directory '/tmp/ruby/build/trunk/.bundle/gems/syslog-0.1.2/ext/syslog' I, [2024-05-09T18:14:04.709870 #2453562] INFO -- : make[2]: Entering directory '/tmp/ruby/build/trunk/ext/ripper' I, [2024-05-09T18:14:04.712474 #2453562] INFO -- : make[2]: Entering directory '/tmp/ruby/build/trunk/ext/digest/sha2' I, [2024-05-09T18:14:04.712786 #2453562] INFO -- : make[2]: Entering directory '/tmp/ruby/build/trunk/ext/socket' I, [2024-05-09T18:14:04.712830 #2453562] INFO -- : make[2]: Leaving directory '/tmp/ruby/build/trunk/ext/fiddle' I, [2024-05-09T18:14:04.715230 #2453562] INFO -- : make[2]: Leaving directory '/tmp/ruby/build/trunk/ext/ripper' I, [2024-05-09T18:14:04.715663 #2453562] INFO -- : make[2]: Leaving directory '/tmp/ruby/build/trunk/ext/digest/sha2' I, [2024-05-09T18:14:04.716225 #2453562] INFO -- : make[2]: Entering directory '/tmp/ruby/build/trunk/ext/openssl' I, [2024-05-09T18:14:04.717764 #2453562] INFO -- : make[2]: Leaving directory '/tmp/ruby/build/trunk/ext/psych' I, [2024-05-09T18:14:04.719772 #2453562] INFO -- : make[2]: Leaving directory '/tmp/ruby/build/trunk/ext/socket' I, [2024-05-09T18:14:04.727399 #2453562] INFO -- : make[2]: Leaving directory '/tmp/ruby/build/trunk/ext/openssl' I, [2024-05-09T18:14:04.732932 #2453562] INFO -- : make[2]: Leaving directory '/tmp/ruby/build/trunk/.bundle/gems/rbs-3.4.4/ext/rbs_extension' I, [2024-05-09T18:14:04.733022 #2453562] INFO -- : make[2]: Leaving directory '/tmp/ruby/build/trunk/.bundle/gems/nkf-0.2.0/ext/nkf' I, [2024-05-09T18:14:04.734912 #2453562] INFO -- : make[2]: Leaving directory '/tmp/ruby/build/trunk/.bundle/gems/bigdecimal-3.1.8/ext/bigdecimal' I, [2024-05-09T18:14:04.734930 #2453562] INFO -- : make[2]: Leaving directory '/tmp/ruby/build/trunk/.bundle/gems/debug-1.9.2/ext/debug' I, [2024-05-09T18:14:04.742526 #2453562] INFO -- : make[2]: Leaving directory '/tmp/ruby/build/trunk/.bundle/gems/bigdecimal-3.1.7/ext/bigdecimal' I, [2024-05-09T18:14:04.743220 #2453562] INFO -- : make[2]: Leaving directory '/tmp/ruby/build/trunk/.bundle/gems/racc-1.7.3/ext/racc/cparse' I, [2024-05-09T18:14:04.746022 #2453562] INFO -- : make[2]: Leaving directory '/tmp/ruby/build/trunk/.bundle/gems/syslog-0.1.2/ext/syslog' I, [2024-05-09T18:14:04.769930 #2453562] INFO -- : make[2]: Entering directory '/tmp/ruby/build/trunk' I, [2024-05-09T18:14:04.834568 #2453562] INFO -- : make[2]: 'ruby' is up to date. I, [2024-05-09T18:14:04.834601 #2453562] INFO -- : make[2]: Leaving directory '/tmp/ruby/build/trunk' I, [2024-05-09T18:14:04.835008 #2453562] INFO -- : make[1]: Leaving directory '/tmp/ruby/build/trunk' I, [2024-05-09T18:14:04.838854 #2453562] INFO -- : make[1]: Entering directory '/tmp/ruby/build/trunk' I, [2024-05-09T18:14:04.838876 #2453562] INFO -- : make[1]: Nothing to be done for 'note'. I, [2024-05-09T18:14:04.838887 #2453562] INFO -- : make[1]: Leaving directory '/tmp/ruby/build/trunk' I, [2024-05-09T18:14:04.839165 #2453562] INFO -- : ./miniruby -I/tmp/ruby/src/trunk/lib -I. -I.ext/common /tmp/ruby/src/trunk/tool/runruby.rb --extout=.ext -- --disable-gems -r./x86_64-linux-fake /tmp/ruby/src/trunk/tool/rbinstall.rb --make="make" --dest-dir="" --extout=".ext" --ext-build-dir="./ext" --mflags="-j20 --jobserver-auth=4,5" --make-flags=" -j20 --jobserver-auth=4,5" --data-mode=0644 --prog-mode=0755 --installed-list .installed.list --mantype="doc" --gnumake --install=all --exclude=doc I, [2024-05-09T18:14:04.934964 #2453562] INFO -- : Installing to I, [2024-05-09T18:14:04.935022 #2453562] INFO -- : installing binary commands: /tmp/ruby/install/trunk/bin I, [2024-05-09T18:14:04.935116 #2453562] INFO -- : installing base libraries: /tmp/ruby/install/trunk/lib I, [2024-05-09T18:14:04.942540 #2453562] INFO -- : installing arch files: /tmp/ruby/install/trunk/lib/ruby/3.4.0+0/x86_64-linux I, [2024-05-09T18:14:04.942579 #2453562] INFO -- : installing pkgconfig data: /tmp/ruby/install/trunk/lib/pkgconfig I, [2024-05-09T18:14:04.942587 #2453562] INFO -- : installing extension objects: /tmp/ruby/install/trunk/lib/ruby/3.4.0+0/x86_64-linux I, [2024-05-09T18:14:04.952208 #2453562] INFO -- : installing extension objects: /tmp/ruby/install/trunk/lib/ruby/site_ruby/3.4.0+0/x86_64-linux I, [2024-05-09T18:14:04.952236 #2453562] INFO -- : installing extension objects: /tmp/ruby/install/trunk/lib/ruby/vendor_ruby/3.4.0+0/x86_64-linux I, [2024-05-09T18:14:04.952244 #2453562] INFO -- : installing extension headers: /tmp/ruby/install/trunk/include/ruby-3.4.0+0/x86_64-linux I, [2024-05-09T18:14:04.952397 #2453562] INFO -- : installing extension scripts: /tmp/ruby/install/trunk/lib/ruby/3.4.0+0 I, [2024-05-09T18:14:04.956092 #2453562] INFO -- : installing extension scripts: /tmp/ruby/install/trunk/lib/ruby/site_ruby/3.4.0+0 I, [2024-05-09T18:14:04.956115 #2453562] INFO -- : installing extension scripts: /tmp/ruby/install/trunk/lib/ruby/vendor_ruby/3.4.0+0 I, [2024-05-09T18:14:04.956132 #2453562] INFO -- : installing extension headers: /tmp/ruby/install/trunk/include/ruby-3.4.0+0/ruby I, [2024-05-09T18:14:04.956137 #2453562] INFO -- : installing command scripts: /tmp/ruby/install/trunk/bin I, [2024-05-09T18:14:04.956142 #2453562] INFO -- : installing library scripts: /tmp/ruby/install/trunk/lib/ruby/3.4.0+0 I, [2024-05-09T18:14:04.990071 #2453562] INFO -- : installing common headers: /tmp/ruby/install/trunk/include/ruby-3.4.0+0 I, [2024-05-09T18:14:04.995395 #2453562] INFO -- : installing manpages: /tmp/ruby/install/trunk/share/man/man1 I, [2024-05-09T18:14:04.995529 #2453562] INFO -- : installing default gems from lib: /tmp/ruby/install/trunk/lib/ruby/gems/3.4.0+0 I, [2024-05-09T18:14:05.018329 #2453562] INFO -- : benchmark 0.3.0 I, [2024-05-09T18:14:05.025893 #2453562] INFO -- : bundler 2.6.0.dev I, [2024-05-09T18:14:05.027530 #2453562] INFO -- : cgi 0.4.1 I, [2024-05-09T18:14:05.028063 #2453562] INFO -- : delegate 0.3.1 I, [2024-05-09T18:14:05.028558 #2453562] INFO -- : did_you_mean 1.6.3 I, [2024-05-09T18:14:05.029022 #2453562] INFO -- : english 0.8.0 I, [2024-05-09T18:14:05.029496 #2453562] INFO -- : erb 4.0.4 I, [2024-05-09T18:14:05.030212 #2453562] INFO -- : error_highlight 0.6.0 I, [2024-05-09T18:14:05.030669 #2453562] INFO -- : fileutils 1.7.2 I, [2024-05-09T18:14:05.031154 #2453562] INFO -- : find 0.2.0 I, [2024-05-09T18:14:05.031513 #2453562] INFO -- : forwardable 1.3.3 I, [2024-05-09T18:14:05.031970 #2453562] INFO -- : ipaddr 1.2.6 I, [2024-05-09T18:14:05.033223 #2453562] INFO -- : irb 1.13.1 I, [2024-05-09T18:14:05.034023 #2453562] INFO -- : logger 1.6.0 I, [2024-05-09T18:14:05.034493 #2453562] INFO -- : net-http 0.4.1 I, [2024-05-09T18:14:05.034996 #2453562] INFO -- : net-protocol 0.2.2 I, [2024-05-09T18:14:05.035497 #2453562] INFO -- : open-uri 0.4.1 I, [2024-05-09T18:14:05.036048 #2453562] INFO -- : open3 0.2.1 I, [2024-05-09T18:14:05.036608 #2453562] INFO -- : optparse 0.5.0 I, [2024-05-09T18:14:05.037167 #2453562] INFO -- : ostruct 0.6.0 I, [2024-05-09T18:14:05.037557 #2453562] INFO -- : pp 0.5.0 I, [2024-05-09T18:14:05.038035 #2453562] INFO -- : prettyprint 0.2.0 I, [2024-05-09T18:14:05.038498 #2453562] INFO -- : prism 0.28.0 I, [2024-05-09T18:14:05.038998 #2453562] INFO -- : pstore 0.1.3 I, [2024-05-09T18:14:05.039882 #2453562] INFO -- : rdoc 6.6.3.1 I, [2024-05-09T18:14:05.041167 #2453562] INFO -- : readline 0.0.4 I, [2024-05-09T18:14:05.041733 #2453562] INFO -- : reline 0.5.6 I, [2024-05-09T18:14:05.042272 #2453562] INFO -- : resolv 0.4.0 I, [2024-05-09T18:14:05.042735 #2453562] INFO -- : ruby2_keywords 0.0.5 I, [2024-05-09T18:14:05.043242 #2453562] INFO -- : securerandom 0.3.1 I, [2024-05-09T18:14:05.043730 #2453562] INFO -- : set 1.1.0 I, [2024-05-09T18:14:05.044199 #2453562] INFO -- : shellwords 0.2.0 I, [2024-05-09T18:14:05.044702 #2453562] INFO -- : singleton 0.2.0 I, [2024-05-09T18:14:05.045148 #2453562] INFO -- : syntax_suggest 2.0.0 I, [2024-05-09T18:14:05.045839 #2453562] INFO -- : tempfile 0.2.1 I, [2024-05-09T18:14:05.046694 #2453562] INFO -- : time 0.3.0 I, [2024-05-09T18:14:05.047376 #2453562] INFO -- : timeout 0.4.1 I, [2024-05-09T18:14:05.047880 #2453562] INFO -- : tmpdir 0.2.0 I, [2024-05-09T18:14:05.048485 #2453562] INFO -- : tsort 0.2.0 I, [2024-05-09T18:14:05.048958 #2453562] INFO -- : un 0.3.0 I, [2024-05-09T18:14:05.049424 #2453562] INFO -- : uri 0.13.0 I, [2024-05-09T18:14:05.049928 #2453562] INFO -- : weakref 0.1.3 I, [2024-05-09T18:14:05.050393 #2453562] INFO -- : yaml 0.3.0 I, [2024-05-09T18:14:05.050779 #2453562] INFO -- : installing default gems from ext: /tmp/ruby/install/trunk/lib/ruby/gems/3.4.0+0 I, [2024-05-09T18:14:05.057352 #2453562] INFO -- : date 3.3.4 I, [2024-05-09T18:14:05.057970 #2453562] INFO -- : digest 3.1.1 I, [2024-05-09T18:14:05.058443 #2453562] INFO -- : etc 1.4.3 I, [2024-05-09T18:14:05.058962 #2453562] INFO -- : fcntl 1.1.0 I, [2024-05-09T18:14:05.059536 #2453562] INFO -- : fiddle 1.1.3 I, [2024-05-09T18:14:05.060031 #2453562] INFO -- : io-console 0.7.2 I, [2024-05-09T18:14:05.060484 #2453562] INFO -- : io-nonblock 0.3.0 I, [2024-05-09T18:14:05.060968 #2453562] INFO -- : io-wait 0.3.1 I, [2024-05-09T18:14:05.061440 #2453562] INFO -- : json 2.7.2 I, [2024-05-09T18:14:05.062497 #2453562] INFO -- : openssl 3.2.0 I, [2024-05-09T18:14:05.063018 #2453562] INFO -- : pathname 0.3.0 I, [2024-05-09T18:14:05.063505 #2453562] INFO -- : psych 5.1.2 I, [2024-05-09T18:14:05.064049 #2453562] INFO -- : stringio 3.1.1 I, [2024-05-09T18:14:05.064692 #2453562] INFO -- : strscan 3.1.1 I, [2024-05-09T18:14:05.065183 #2453562] INFO -- : zlib 3.1.0 I, [2024-05-09T18:14:05.065561 #2453562] INFO -- : installing bundled gems: /tmp/ruby/install/trunk/lib/ruby/gems/3.4.0+0 I, [2024-05-09T18:14:05.065905 #2453562] INFO -- : minitest 5.22.3 I, [2024-05-09T18:14:05.073223 #2453562] INFO -- : rake 13.2.1 I, [2024-05-09T18:14:05.077477 #2453562] INFO -- : test-unit 3.6.2 I, [2024-05-09T18:14:05.081121 #2453562] INFO -- : rexml 3.2.6 I, [2024-05-09T18:14:05.084431 #2453562] INFO -- : rss 0.3.0 I, [2024-05-09T18:14:05.087563 #2453562] INFO -- : net-ftp 0.3.4 I, [2024-05-09T18:14:05.089031 #2453562] INFO -- : net-imap 0.4.11 I, [2024-05-09T18:14:05.091866 #2453562] INFO -- : net-pop 0.1.2 I, [2024-05-09T18:14:05.092792 #2453562] INFO -- : net-smtp 0.5.0 I, [2024-05-09T18:14:05.094357 #2453562] INFO -- : matrix 0.4.2 I, [2024-05-09T18:14:05.097622 #2453562] INFO -- : prime 0.1.2 I, [2024-05-09T18:14:05.103221 #2453562] INFO -- : rbs 3.4.4 I, [2024-05-09T18:14:05.125382 #2453562] INFO -- : typeprof 0.21.11 I, [2024-05-09T18:14:05.127954 #2453562] INFO -- : debug 1.9.2 I, [2024-05-09T18:14:05.131130 #2453562] INFO -- : racc 1.7.3 I, [2024-05-09T18:14:05.133617 #2453562] INFO -- : mutex_m 0.2.0 I, [2024-05-09T18:14:05.134735 #2453562] INFO -- : getoptlong 0.2.1 I, [2024-05-09T18:14:05.136013 #2453562] INFO -- : base64 0.2.0 I, [2024-05-09T18:14:05.137203 #2453562] INFO -- : bigdecimal 3.1.8 I, [2024-05-09T18:14:05.139186 #2453562] INFO -- : observer 0.1.2 I, [2024-05-09T18:14:05.140719 #2453562] INFO -- : abbrev 0.1.2 I, [2024-05-09T18:14:05.141702 #2453562] INFO -- : resolv-replace 0.1.1 I, [2024-05-09T18:14:05.143024 #2453562] INFO -- : rinda 0.2.0 I, [2024-05-09T18:14:05.144207 #2453562] INFO -- : drb 2.2.1 I, [2024-05-09T18:14:05.145941 #2453562] INFO -- : nkf 0.2.0 I, [2024-05-09T18:14:05.148242 #2453562] INFO -- : syslog 0.1.2 I, [2024-05-09T18:14:05.149842 #2453562] INFO -- : csv 3.3.0 I, [2024-05-09T18:14:05.151914 #2453562] INFO -- : installing bundled gem cache: /tmp/ruby/install/trunk/lib/ruby/gems/3.4.0+0/cache I, [2024-05-09T18:14:05.153364 #2453562] INFO -- : skipped bundled gems: I, [2024-05-09T18:14:05.153392 #2453562] INFO -- : power_assert-2.0.4dev.gem not found in bundled_gems I, [2024-05-09T18:14:05.156561 #2453562] INFO -- : $$$[end] "make install -j20" exit with 0. I, [2024-05-09T18:14:05.156669 #2453562] INFO -- : $$$[beg] make yes-btest TESTOPTS='-q -j20' I, [2024-05-09T18:14:11.792819 #2453562] INFO -- : PASS all 1936 tests E, [2024-05-09T18:14:11.798333 #2453562] ERROR -- : I, [2024-05-09T18:14:11.798534 #2453562] INFO -- : $$$[end] "make yes-btest TESTOPTS='-q -j20'" exit with 0. I, [2024-05-09T18:14:11.798623 #2453562] INFO -- : $$$[beg] make yes-test-basic TESTS='-j20' I, [2024-05-09T18:14:11.860382 #2453562] INFO -- : BASERUBY = /usr/bin/ruby --disable=gems I, [2024-05-09T18:14:11.860411 #2453562] INFO -- : CC = gcc I, [2024-05-09T18:14:11.860416 #2453562] INFO -- : LD = ld I, [2024-05-09T18:14:11.860420 #2453562] INFO -- : LDSHARED = gcc -shared I, [2024-05-09T18:14:11.860424 #2453562] INFO -- : CFLAGS = -O3 -fno-fast-math -ggdb3 -Wall -Wextra -Wdeprecated-declarations -Wdiv-by-zero -Wduplicated-cond -Wimplicit-function-declaration -Wimplicit-int -Wpointer-arith -Wwrite-strings -Wold-style-definition -Wimplicit-fallthrough=0 -Wmissing-noreturn -Wno-cast-function-type -Wno-constant-logical-operand -Wno-long-long -Wno-missing-field-initializers -Wno-overlength-strings -Wno-packed-bitfield-compat -Wno-parentheses-equality -Wno-self-assign -Wno-tautological-compare -Wno-unused-parameter -Wno-unused-value -Wsuggest-attribute=format -Wsuggest-attribute=noreturn -Wunused-variable -Wmisleading-indentation -Wundef -fPIC I, [2024-05-09T18:14:11.860428 #2453562] INFO -- : XCFLAGS = -U_FORTIFY_SOURCE -D_FORTIFY_SOURCE=2 -fstack-protector-strong -fno-strict-overflow -fvisibility=hidden -fexcess-precision=standard -DRUBY_EXPORT -I. -I.ext/include/x86_64-linux -I/tmp/ruby/src/trunk/include -I/tmp/ruby/src/trunk -I/tmp/ruby/src/trunk/prism -I/tmp/ruby/src/trunk/enc/unicode/15.0.0 I, [2024-05-09T18:14:11.860432 #2453562] INFO -- : CPPFLAGS = I, [2024-05-09T18:14:11.860436 #2453562] INFO -- : DLDFLAGS = -Wl,--compress-debug-sections=zlib -Wl,-soname,libruby.so.3.4 -fstack-protector-strong I, [2024-05-09T18:14:11.860439 #2453562] INFO -- : SOLIBS = -lz -lrt -lrt -lgmp -ldl -lcrypt -lm -lpthread I, [2024-05-09T18:14:11.860443 #2453562] INFO -- : LANG = en_US.UTF-8 I, [2024-05-09T18:14:11.860446 #2453562] INFO -- : LC_ALL = I, [2024-05-09T18:14:11.860449 #2453562] INFO -- : LC_CTYPE = I, [2024-05-09T18:14:11.860453 #2453562] INFO -- : MFLAGS = I, [2024-05-09T18:14:11.860456 #2453562] INFO -- : RUSTC = no I, [2024-05-09T18:14:11.860460 #2453562] INFO -- : YJIT_RUSTC_ARGS = --crate-name=yjit --crate-type=staticlib --edition=2021 -g -C lto=thin -C opt-level=3 -C overflow-checks=on '--out-dir=/tmp/ruby/build/trunk/yjit/target/release/' /tmp/ruby/src/trunk/yjit/src/lib.rs I, [2024-05-09T18:14:11.860920 #2453562] INFO -- : gcc (Ubuntu 11.4.0-1ubuntu1~22.04) 11.4.0 I, [2024-05-09T18:14:11.860937 #2453562] INFO -- : Copyright (C) 2021 Free Software Foundation, Inc. I, [2024-05-09T18:14:11.860944 #2453562] INFO -- : This is free software; see the source for copying conditions. There is NO I, [2024-05-09T18:14:11.860950 #2453562] INFO -- : warranty; not even for MERCHANTABILITY or FITNESS FOR A PARTICULAR PURPOSE. I, [2024-05-09T18:14:11.860955 #2453562] INFO -- : I, [2024-05-09T18:14:11.967407 #2453562] INFO -- : Checking leaked global symbols...none I, [2024-05-09T18:14:12.008514 #2453562] INFO -- : /tmp/ruby/src/trunk/basictest/test.rb:assignment ....................................................................................................................................................................................................................................................................................................................................................................................OK 372 I, [2024-05-09T18:14:12.008588 #2453562] INFO -- : /tmp/ruby/src/trunk/basictest/test.rb:condition ..OK 2 I, [2024-05-09T18:14:12.008596 #2453562] INFO -- : /tmp/ruby/src/trunk/basictest/test.rb:if/unless ...OK 3 I, [2024-05-09T18:14:12.008600 #2453562] INFO -- : /tmp/ruby/src/trunk/basictest/test.rb:case .....OK 5 I, [2024-05-09T18:14:12.008770 #2453562] INFO -- : /tmp/ruby/src/trunk/basictest/test.rb:while/until ........OK 8 I, [2024-05-09T18:14:12.008824 #2453562] INFO -- : /tmp/ruby/src/trunk/basictest/test.rb:exception ..........OK 10 I, [2024-05-09T18:14:12.009091 #2453562] INFO -- : /tmp/ruby/src/trunk/basictest/test.rb:array .......................................OK 39 I, [2024-05-09T18:14:12.009186 #2453562] INFO -- : /tmp/ruby/src/trunk/basictest/test.rb:hash ...........................OK 27 I, [2024-05-09T18:14:12.009907 #2453562] INFO -- : /tmp/ruby/src/trunk/basictest/test.rb:iterator ...........................................................................................................OK 107 I, [2024-05-09T18:14:12.010188 #2453562] INFO -- : /tmp/ruby/src/trunk/basictest/test.rb:float ................................................................................OK 80 I, [2024-05-09T18:14:12.011196 #2453562] INFO -- : /tmp/ruby/src/trunk/basictest/test.rb:bignum ...............................OK 31 I, [2024-05-09T18:14:12.011976 #2453562] INFO -- : /tmp/ruby/src/trunk/basictest/test.rb:string & char ..............................................................OK 62 I, [2024-05-09T18:14:12.012007 #2453562] INFO -- : /tmp/ruby/src/trunk/basictest/test.rb:assignment ..........OK 10 I, [2024-05-09T18:14:12.012021 #2453562] INFO -- : /tmp/ruby/src/trunk/basictest/test.rb:call ......OK 6 I, [2024-05-09T18:14:12.012075 #2453562] INFO -- : /tmp/ruby/src/trunk/basictest/test.rb:proc .........OK 9 I, [2024-05-09T18:14:12.112334 #2453562] INFO -- : /tmp/ruby/src/trunk/basictest/test.rb:signal ..OK 2 I, [2024-05-09T18:14:12.112865 #2453562] INFO -- : /tmp/ruby/src/trunk/basictest/test.rb:eval ...........................OK 27 I, [2024-05-09T18:14:12.213512 #2453562] INFO -- : /tmp/ruby/src/trunk/basictest/test.rb:system ........OK 8 I, [2024-05-09T18:14:12.213573 #2453562] INFO -- : /tmp/ruby/src/trunk/basictest/test.rb:const .....OK 5 I, [2024-05-09T18:14:12.213672 #2453562] INFO -- : /tmp/ruby/src/trunk/basictest/test.rb:clone .....OK 5 I, [2024-05-09T18:14:12.213772 #2453562] INFO -- : /tmp/ruby/src/trunk/basictest/test.rb:marshal ....OK 4 I, [2024-05-09T18:14:12.213811 #2453562] INFO -- : /tmp/ruby/src/trunk/basictest/test.rb:pack ....OK 4 I, [2024-05-09T18:14:12.213827 #2453562] INFO -- : /tmp/ruby/src/trunk/basictest/test.rb:math ..OK 2 I, [2024-05-09T18:14:12.213914 #2453562] INFO -- : /tmp/ruby/src/trunk/basictest/test.rb:struct ......OK 6 I, [2024-05-09T18:14:12.213970 #2453562] INFO -- : /tmp/ruby/src/trunk/basictest/test.rb:variable ............OK 12 I, [2024-05-09T18:14:12.213993 #2453562] INFO -- : /tmp/ruby/src/trunk/basictest/test.rb:trace ...OK 3 I, [2024-05-09T18:14:12.214050 #2453562] INFO -- : /tmp/ruby/src/trunk/basictest/test.rb:defined? ............OK 12 I, [2024-05-09T18:14:12.214094 #2453562] INFO -- : /tmp/ruby/src/trunk/basictest/test.rb:alias ......OK 6 I, [2024-05-09T18:14:12.214431 #2453562] INFO -- : /tmp/ruby/src/trunk/basictest/test.rb:path .......................OK 23 I, [2024-05-09T18:14:12.248348 #2453562] INFO -- : /tmp/ruby/src/trunk/basictest/test.rb:gc ....OK 4 I, [2024-05-09T18:14:12.250835 #2453562] INFO -- : I, [2024-05-09T18:14:12.250857 #2453562] INFO -- : test succeeded I, [2024-05-09T18:14:12.252104 #2453562] INFO -- : $$$[end] "make yes-test-basic TESTS='-j20'" exit with 0. I, [2024-05-09T18:14:12.252197 #2453562] INFO -- : $$$[beg] make yes-test-all TESTOPTS='--stderr-on-failure' TESTS='-j20' I, [2024-05-09T18:14:12.336836 #2453562] INFO -- : BASERUBY = /usr/bin/ruby --disable=gems I, [2024-05-09T18:14:12.336890 #2453562] INFO -- : CC = gcc I, [2024-05-09T18:14:12.336896 #2453562] INFO -- : LD = ld I, [2024-05-09T18:14:12.336900 #2453562] INFO -- : LDSHARED = gcc -shared I, [2024-05-09T18:14:12.336904 #2453562] INFO -- : CFLAGS = -O3 -fno-fast-math -ggdb3 -Wall -Wextra -Wdeprecated-declarations -Wdiv-by-zero -Wduplicated-cond -Wimplicit-function-declaration -Wimplicit-int -Wpointer-arith -Wwrite-strings -Wold-style-definition -Wimplicit-fallthrough=0 -Wmissing-noreturn -Wno-cast-function-type -Wno-constant-logical-operand -Wno-long-long -Wno-missing-field-initializers -Wno-overlength-strings -Wno-packed-bitfield-compat -Wno-parentheses-equality -Wno-self-assign -Wno-tautological-compare -Wno-unused-parameter -Wno-unused-value -Wsuggest-attribute=format -Wsuggest-attribute=noreturn -Wunused-variable -Wmisleading-indentation -Wundef -fPIC I, [2024-05-09T18:14:12.336909 #2453562] INFO -- : XCFLAGS = -U_FORTIFY_SOURCE -D_FORTIFY_SOURCE=2 -fstack-protector-strong -fno-strict-overflow -fvisibility=hidden -fexcess-precision=standard -DRUBY_EXPORT -I. -I.ext/include/x86_64-linux -I/tmp/ruby/src/trunk/include -I/tmp/ruby/src/trunk -I/tmp/ruby/src/trunk/prism -I/tmp/ruby/src/trunk/enc/unicode/15.0.0 I, [2024-05-09T18:14:12.336912 #2453562] INFO -- : CPPFLAGS = I, [2024-05-09T18:14:12.336916 #2453562] INFO -- : DLDFLAGS = -Wl,--compress-debug-sections=zlib -Wl,-soname,libruby.so.3.4 -fstack-protector-strong I, [2024-05-09T18:14:12.336920 #2453562] INFO -- : SOLIBS = -lz -lrt -lrt -lgmp -ldl -lcrypt -lm -lpthread I, [2024-05-09T18:14:12.336923 #2453562] INFO -- : LANG = en_US.UTF-8 I, [2024-05-09T18:14:12.336926 #2453562] INFO -- : LC_ALL = I, [2024-05-09T18:14:12.336930 #2453562] INFO -- : LC_CTYPE = I, [2024-05-09T18:14:12.336933 #2453562] INFO -- : MFLAGS = I, [2024-05-09T18:14:12.336937 #2453562] INFO -- : RUSTC = no I, [2024-05-09T18:14:12.336940 #2453562] INFO -- : YJIT_RUSTC_ARGS = --crate-name=yjit --crate-type=staticlib --edition=2021 -g -C lto=thin -C opt-level=3 -C overflow-checks=on '--out-dir=/tmp/ruby/build/trunk/yjit/target/release/' /tmp/ruby/src/trunk/yjit/src/lib.rs I, [2024-05-09T18:14:12.337551 #2453562] INFO -- : gcc (Ubuntu 11.4.0-1ubuntu1~22.04) 11.4.0 I, [2024-05-09T18:14:12.337575 #2453562] INFO -- : Copyright (C) 2021 Free Software Foundation, Inc. I, [2024-05-09T18:14:12.337589 #2453562] INFO -- : This is free software; see the source for copying conditions. There is NO I, [2024-05-09T18:14:12.337596 #2453562] INFO -- : warranty; not even for MERCHANTABILITY or FITNESS FOR A PARTICULAR PURPOSE. I, [2024-05-09T18:14:12.337602 #2453562] INFO -- : I, [2024-05-09T18:14:12.339237 #2453562] INFO -- : generating enc.mk I, [2024-05-09T18:14:12.456603 #2453562] INFO -- : generating encdb.h I, [2024-05-09T18:14:12.480981 #2453562] INFO -- : encdb.h unchanged I, [2024-05-09T18:14:12.482210 #2453562] INFO -- : making enc I, [2024-05-09T18:14:12.500194 #2453562] INFO -- : make[1]: Entering directory '/tmp/ruby/build/trunk' I, [2024-05-09T18:14:12.500217 #2453562] INFO -- : make[1]: Nothing to be done for 'enc'. I, [2024-05-09T18:14:12.500225 #2453562] INFO -- : make[1]: Leaving directory '/tmp/ruby/build/trunk' I, [2024-05-09T18:14:12.501008 #2453562] INFO -- : making srcs under enc I, [2024-05-09T18:14:12.530134 #2453562] INFO -- : make[1]: Entering directory '/tmp/ruby/build/trunk' I, [2024-05-09T18:14:12.530159 #2453562] INFO -- : make[1]: Nothing to be done for 'srcs'. I, [2024-05-09T18:14:12.530166 #2453562] INFO -- : make[1]: Leaving directory '/tmp/ruby/build/trunk' I, [2024-05-09T18:14:12.531206 #2453562] INFO -- : generating transdb.h I, [2024-05-09T18:14:12.626073 #2453562] INFO -- : transdb.h unchanged I, [2024-05-09T18:14:12.627438 #2453562] INFO -- : making trans I, [2024-05-09T18:14:12.661872 #2453562] INFO -- : make[1]: Entering directory '/tmp/ruby/build/trunk' I, [2024-05-09T18:14:12.661893 #2453562] INFO -- : make[1]: Nothing to be done for 'trans'. I, [2024-05-09T18:14:12.661906 #2453562] INFO -- : make[1]: Leaving directory '/tmp/ruby/build/trunk' I, [2024-05-09T18:14:12.662589 #2453562] INFO -- : making encs I, [2024-05-09T18:14:12.699684 #2453562] INFO -- : make[1]: Entering directory '/tmp/ruby/build/trunk' I, [2024-05-09T18:14:12.699704 #2453562] INFO -- : make[1]: Nothing to be done for 'encs'. I, [2024-05-09T18:14:12.699710 #2453562] INFO -- : make[1]: Leaving directory '/tmp/ruby/build/trunk' I, [2024-05-09T18:14:12.701689 #2453562] INFO -- : generating makefiles ext/configure-ext.mk I, [2024-05-09T18:14:12.728710 #2453562] INFO -- : ext/configure-ext.mk updated I, [2024-05-09T18:14:12.731355 #2453562] INFO -- : make[1]: Entering directory '/tmp/ruby/build/trunk' I, [2024-05-09T18:14:14.125379 #2453562] INFO -- : make[1]: Leaving directory '/tmp/ruby/build/trunk' I, [2024-05-09T18:14:14.125997 #2453562] INFO -- : generating makefile exts.mk I, [2024-05-09T18:14:14.163342 #2453562] INFO -- : exts.mk unchanged I, [2024-05-09T18:14:14.168085 #2453562] INFO -- : make[1]: Entering directory '/tmp/ruby/build/trunk' I, [2024-05-09T18:14:14.379448 #2453562] INFO -- : make[2]: Entering directory '/tmp/ruby/build/trunk/ext/coverage' I, [2024-05-09T18:14:14.382355 #2453562] INFO -- : make[2]: Leaving directory '/tmp/ruby/build/trunk/ext/coverage' I, [2024-05-09T18:14:14.386039 #2453562] INFO -- : make[2]: Entering directory '/tmp/ruby/build/trunk/ext/date' I, [2024-05-09T18:14:14.389148 #2453562] INFO -- : make[2]: Leaving directory '/tmp/ruby/build/trunk/ext/date' I, [2024-05-09T18:14:14.391583 #2453562] INFO -- : make[2]: Entering directory '/tmp/ruby/build/trunk/ext/digest' I, [2024-05-09T18:14:14.396996 #2453562] INFO -- : make[2]: Leaving directory '/tmp/ruby/build/trunk/ext/digest' I, [2024-05-09T18:14:14.412705 #2453562] INFO -- : make[2]: Entering directory '/tmp/ruby/build/trunk/ext/digest/sha2' I, [2024-05-09T18:14:14.415605 #2453562] INFO -- : make[2]: Leaving directory '/tmp/ruby/build/trunk/ext/digest/sha2' I, [2024-05-09T18:14:14.428347 #2453562] INFO -- : make[2]: Entering directory '/tmp/ruby/build/trunk/ext/fiddle' I, [2024-05-09T18:14:14.434861 #2453562] INFO -- : make[2]: Leaving directory '/tmp/ruby/build/trunk/ext/fiddle' I, [2024-05-09T18:14:14.437669 #2453562] INFO -- : make[2]: Entering directory '/tmp/ruby/build/trunk/ext/io/console' I, [2024-05-09T18:14:14.440259 #2453562] INFO -- : make[2]: Leaving directory '/tmp/ruby/build/trunk/ext/io/console' I, [2024-05-09T18:14:14.448091 #2453562] INFO -- : make[2]: Entering directory '/tmp/ruby/build/trunk/ext/json' I, [2024-05-09T18:14:14.454325 #2453562] INFO -- : make[2]: Leaving directory '/tmp/ruby/build/trunk/ext/json' I, [2024-05-09T18:14:14.463321 #2453562] INFO -- : make[2]: Entering directory '/tmp/ruby/build/trunk/ext/monitor' I, [2024-05-09T18:14:14.465819 #2453562] INFO -- : make[2]: Leaving directory '/tmp/ruby/build/trunk/ext/monitor' I, [2024-05-09T18:14:14.470017 #2453562] INFO -- : make[2]: Entering directory '/tmp/ruby/build/trunk/ext/objspace' I, [2024-05-09T18:14:14.473849 #2453562] INFO -- : make[2]: Leaving directory '/tmp/ruby/build/trunk/ext/objspace' I, [2024-05-09T18:14:14.485811 #2453562] INFO -- : make[2]: Entering directory '/tmp/ruby/build/trunk/ext/openssl' I, [2024-05-09T18:14:14.498898 #2453562] INFO -- : make[2]: Leaving directory '/tmp/ruby/build/trunk/ext/openssl' I, [2024-05-09T18:14:14.501699 #2453562] INFO -- : make[2]: Entering directory '/tmp/ruby/build/trunk/ext/pathname' I, [2024-05-09T18:14:14.504225 #2453562] INFO -- : make[2]: Leaving directory '/tmp/ruby/build/trunk/ext/pathname' I, [2024-05-09T18:14:14.508438 #2453562] INFO -- : make[2]: Entering directory '/tmp/ruby/build/trunk/ext/psych' I, [2024-05-09T18:14:14.523128 #2453562] INFO -- : make[2]: Leaving directory '/tmp/ruby/build/trunk/ext/psych' I, [2024-05-09T18:14:14.526054 #2453562] INFO -- : make[2]: Entering directory '/tmp/ruby/build/trunk/ext/pty' I, [2024-05-09T18:14:14.528606 #2453562] INFO -- : make[2]: Leaving directory '/tmp/ruby/build/trunk/ext/pty' I, [2024-05-09T18:14:14.538199 #2453562] INFO -- : make[2]: Entering directory '/tmp/ruby/build/trunk/ext/ripper' I, [2024-05-09T18:14:14.543109 #2453562] INFO -- : make[2]: Leaving directory '/tmp/ruby/build/trunk/ext/ripper' I, [2024-05-09T18:14:14.544621 #2453562] INFO -- : make[2]: Entering directory '/tmp/ruby/build/trunk/ext/rubyvm' I, [2024-05-09T18:14:14.546704 #2453562] INFO -- : make[2]: Leaving directory '/tmp/ruby/build/trunk/ext/rubyvm' I, [2024-05-09T18:14:14.554443 #2453562] INFO -- : make[2]: Entering directory '/tmp/ruby/build/trunk/ext/socket' I, [2024-05-09T18:14:14.560801 #2453562] INFO -- : make[2]: Leaving directory '/tmp/ruby/build/trunk/ext/socket' I, [2024-05-09T18:14:14.571833 #2453562] INFO -- : make[2]: Entering directory '/tmp/ruby/build/trunk/.bundle/gems/bigdecimal-3.1.7/ext/bigdecimal' I, [2024-05-09T18:14:14.594565 #2453562] INFO -- : make[2]: Leaving directory '/tmp/ruby/build/trunk/.bundle/gems/bigdecimal-3.1.7/ext/bigdecimal' I, [2024-05-09T18:14:14.596449 #2453562] INFO -- : make[2]: Entering directory '/tmp/ruby/build/trunk/.bundle/gems/bigdecimal-3.1.8/ext/bigdecimal' I, [2024-05-09T18:14:14.618274 #2453562] INFO -- : make[2]: Leaving directory '/tmp/ruby/build/trunk/.bundle/gems/bigdecimal-3.1.8/ext/bigdecimal' I, [2024-05-09T18:14:14.620218 #2453562] INFO -- : make[2]: Entering directory '/tmp/ruby/build/trunk/.bundle/gems/debug-1.9.2/ext/debug' I, [2024-05-09T18:14:14.642175 #2453562] INFO -- : make[2]: Leaving directory '/tmp/ruby/build/trunk/.bundle/gems/debug-1.9.2/ext/debug' I, [2024-05-09T18:14:14.644051 #2453562] INFO -- : make[2]: Entering directory '/tmp/ruby/build/trunk/.bundle/gems/nkf-0.2.0/ext/nkf' I, [2024-05-09T18:14:14.666053 #2453562] INFO -- : make[2]: Leaving directory '/tmp/ruby/build/trunk/.bundle/gems/nkf-0.2.0/ext/nkf' I, [2024-05-09T18:14:14.668004 #2453562] INFO -- : make[2]: Entering directory '/tmp/ruby/build/trunk/.bundle/gems/racc-1.7.3/ext/racc/cparse' I, [2024-05-09T18:14:14.690169 #2453562] INFO -- : make[2]: Leaving directory '/tmp/ruby/build/trunk/.bundle/gems/racc-1.7.3/ext/racc/cparse' I, [2024-05-09T18:14:14.692439 #2453562] INFO -- : make[2]: Entering directory '/tmp/ruby/build/trunk/.bundle/gems/rbs-3.4.4/ext/rbs_extension' I, [2024-05-09T18:14:14.714745 #2453562] INFO -- : make[2]: Leaving directory '/tmp/ruby/build/trunk/.bundle/gems/rbs-3.4.4/ext/rbs_extension' I, [2024-05-09T18:14:14.716725 #2453562] INFO -- : make[2]: Entering directory '/tmp/ruby/build/trunk/.bundle/gems/syslog-0.1.2/ext/syslog' I, [2024-05-09T18:14:14.738014 #2453562] INFO -- : make[2]: Leaving directory '/tmp/ruby/build/trunk/.bundle/gems/syslog-0.1.2/ext/syslog' I, [2024-05-09T18:14:14.761287 #2453562] INFO -- : make[2]: Entering directory '/tmp/ruby/build/trunk' I, [2024-05-09T18:14:14.824424 #2453562] INFO -- : make[2]: 'ruby' is up to date. I, [2024-05-09T18:14:14.824460 #2453562] INFO -- : make[2]: Leaving directory '/tmp/ruby/build/trunk' I, [2024-05-09T18:14:14.824976 #2453562] INFO -- : make[1]: Leaving directory '/tmp/ruby/build/trunk' I, [2024-05-09T18:14:14.828766 #2453562] INFO -- : make[1]: Entering directory '/tmp/ruby/build/trunk' I, [2024-05-09T18:14:14.828788 #2453562] INFO -- : make[1]: Nothing to be done for 'note'. I, [2024-05-09T18:14:14.828794 #2453562] INFO -- : make[1]: Leaving directory '/tmp/ruby/build/trunk' I, [2024-05-09T18:14:14.905141 #2453562] INFO -- : Run options: I, [2024-05-09T18:14:14.905198 #2453562] INFO -- : --seed=50040 I, [2024-05-09T18:14:14.905205 #2453562] INFO -- : "--ruby=./miniruby -I/tmp/ruby/src/trunk/lib -I. -I.ext/common /tmp/ruby/src/trunk/tool/runruby.rb --extout=.ext -- --disable-gems" I, [2024-05-09T18:14:14.905211 #2453562] INFO -- : --excludes-dir=/tmp/ruby/src/trunk/test/.excludes I, [2024-05-09T18:14:14.905215 #2453562] INFO -- : --name=!/memory_leak/ I, [2024-05-09T18:14:14.905220 #2453562] INFO -- : --stderr-on-failure I, [2024-05-09T18:14:14.905224 #2453562] INFO -- : -j20 I, [2024-05-09T18:14:14.905228 #2453562] INFO -- : I, [2024-05-09T18:14:14.905231 #2453562] INFO -- : # Running tests: I, [2024-05-09T18:14:14.905243 #2453562] INFO -- : I, [2024-05-09T18:14:15.052779 #2453562] INFO -- : [ 1/885] 2494964=test_gem_commands_setup_command I, [2024-05-09T18:14:15.052864 #2453562] INFO -- : [ 2/885] 2494946=test_integer I, [2024-05-09T18:14:15.053233 #2453562] INFO -- : [ 3/885] 2494947=desugar_compiler_test I, [2024-05-09T18:14:15.053507 #2453562] INFO -- : [ 4/885] 2494948=test_dryrun I, [2024-05-09T18:14:15.055876 #2453562] INFO -- : [ 5/885] 2494950=test_rdoc_attr I, [2024-05-09T18:14:15.056700 #2453562] INFO -- : [ 6/885] 2494949=test_env I, [2024-05-09T18:14:15.056734 #2453562] INFO -- : [ 7/885] 2494960=test_gem_resolver_git_specification I, [2024-05-09T18:14:15.057029 #2453562] INFO -- : [ 8/885] 2494961=test_object_references I, [2024-05-09T18:14:15.057272 #2453562] INFO -- : [ 9/885] 2494963=test_usrmarshal I, [2024-05-09T18:14:15.065432 #2453562] INFO -- : [ 10/885] 2494959=test_nextafter I, [2024-05-09T18:14:15.079188 #2453562] INFO -- : [ 11/885] 2494962=test_capacity I, [2024-05-09T18:14:15.085069 #2453562] INFO -- : [ 12/885] 2494948=test_gem_request_set_lockfile_tokenizer I, [2024-05-09T18:14:15.085398 #2453562] INFO -- : [ 13/885] 2494961=test_stat I, [2024-05-09T18:14:15.086679 #2453562] INFO -- : [ 14/885] 2494951=test_have_func I, [2024-05-09T18:14:15.086724 #2453562] INFO -- : [ 15/885] 2494953=test_call I, [2024-05-09T18:14:15.087195 #2453562] INFO -- : [ 16/885] 2494952=test_https_proxy I, [2024-05-09T18:14:15.087222 #2453562] INFO -- : [ 17/885] 2494956=test_rubygems I, [2024-05-09T18:14:15.087230 #2453562] INFO -- : [ 18/885] 2494957=test_cgi_modruby I, [2024-05-09T18:14:15.087356 #2453562] INFO -- : [ 19/885] 2494958=test_integer I, [2024-05-09T18:14:15.091683 #2453562] INFO -- : [ 20/885] 2494962=test_super I, [2024-05-09T18:14:15.094805 #2453562] INFO -- : [ 21/885] 2494954=test_rubyoptions I, [2024-05-09T18:14:15.104237 #2453562] INFO -- : [ 22/885] 2494957=test_singleton_function I, [2024-05-09T18:14:15.112452 #2453562] INFO -- : [ 23/885] 2494957=test_ancdata I, [2024-05-09T18:14:15.112907 #2453562] INFO -- : [ 24/885] 2494961=test_rb_str_dup I, [2024-05-09T18:14:15.114039 #2453562] INFO -- : [ 25/885] 2494946=test_reline_key I, [2024-05-09T18:14:15.116715 #2453562] INFO -- : [ 26/885] 2494961=test_marshal I, [2024-05-09T18:14:15.130889 #2453562] INFO -- : [ 27/885] 2494965=test_unicode_normalize I, [2024-05-09T18:14:15.131654 #2453562] INFO -- : [ 28/885] 2494955=test_nonblock I, [2024-05-09T18:14:15.148523 #2453562] INFO -- : [ 29/885] 2494959=test_weakref I, [2024-05-09T18:14:15.149860 #2453562] INFO -- : [ 30/885] 2494947=test_alias I, [2024-05-09T18:14:15.177676 #2453562] INFO -- : [ 31/885] 2494946=test_timeout I, [2024-05-09T18:14:15.181065 #2453562] INFO -- : [ 32/885] 2494957=test_ractor I, [2024-05-09T18:14:15.187877 #2453562] INFO -- : [ 33/885] 2494955=test_my_integer I, [2024-05-09T18:14:15.190647 #2453562] INFO -- : [ 34/885] 2494955=test_thread I, [2024-05-09T18:14:15.206366 #2453562] INFO -- : [ 35/885] 2494950=json_ext_parser_test I, [2024-05-09T18:14:15.210482 #2453562] INFO -- : [ 36/885] 2494952=test_rendering I, [2024-05-09T18:14:15.214440 #2453562] INFO -- : [ 37/885] 2494950=test_debugger_integration I, [2024-05-09T18:14:15.239115 #2453562] INFO -- : [ 38/885] 2494953=test_ssl I, [2024-05-09T18:14:15.242011 #2453562] INFO -- : [ 39/885] 2494950=test_ractor I, [2024-05-09T18:14:15.252922 #2453562] INFO -- : [ 40/885] 2494963=test_dns I, [2024-05-09T18:14:15.259877 #2453562] INFO -- : [ 41/885] 2494959=test_gem_commands_open_command I, [2024-05-09T18:14:15.268216 #2453562] INFO -- : [ 42/885] 2494950=test_gem_source_lock I, [2024-05-09T18:14:15.272304 #2453562] INFO -- : [ 43/885] 2494952=test_gem I, [2024-05-09T18:14:15.298793 #2453562] INFO -- : [ 44/885] 2494948=parse_stream_test I, [2024-05-09T18:14:15.332827 #2453562] INFO -- : [ 45/885] 2494947=test_registry I, [2024-05-09T18:14:15.350850 #2453562] INFO -- : [ 46/885] 2494947=test_parser I, [2024-05-09T18:14:15.361304 #2453562] INFO -- : [ 47/885] 2494948=test_cgi_core I, [2024-05-09T18:14:15.376563 #2453562] INFO -- : [ 48/885] 2494947=test_ipaddr I, [2024-05-09T18:14:15.387332 #2453562] INFO -- : [ 49/885] 2494948=test_mixed_unicode_escapes I, [2024-05-09T18:14:15.387852 #2453562] INFO -- : [ 50/885] 2494948=test_history I, [2024-05-09T18:14:15.404555 #2453562] INFO -- : [ 51/885] 2494962=test_rdoc_markup_to_ansi I, [2024-05-09T18:14:15.424583 #2453562] INFO -- : [ 52/885] 2494947=test_win32ole_variant I, [2024-05-09T18:14:15.429427 #2453562] INFO -- : [ 53/885] 2494947=test_gem_resolver_api_specification I, [2024-05-09T18:14:15.454122 #2453562] INFO -- : [ 54/885] 2494948=test_merge_keys I, [2024-05-09T18:14:15.467942 #2453562] INFO -- : [ 55/885] 2494956=test_rdoc_extend I, [2024-05-09T18:14:15.471316 #2453562] INFO -- : [ 56/885] 2494961=test_threadgroup I, [2024-05-09T18:14:15.493409 #2453562] INFO -- : [ 57/885] 2494948=test_enum I, [2024-05-09T18:14:15.516559 #2453562] INFO -- : [ 58/885] 2494959=test_gem_specification I, [2024-05-09T18:14:15.525720 #2453562] INFO -- : [ 59/885] 2494962=test_have_macro I, [2024-05-09T18:14:15.542207 #2453562] INFO -- : [ 60/885] 2494960=test_gem_package I, [2024-05-09T18:14:15.551777 #2453562] INFO -- : [ 61/885] 2494957=test_complex2 I, [2024-05-09T18:14:15.567008 #2453562] INFO -- : [ 62/885] 2494957=test_resolve_symbol I, [2024-05-09T18:14:15.585130 #2453562] INFO -- : [ 63/885] 2494950=test_rdoc_generator_json_index I, [2024-05-09T18:14:15.610412 #2453562] INFO -- : [ 64/885] 2494947=test_win32ole_event I, [2024-05-09T18:14:15.618442 #2453562] INFO -- : [ 65/885] 2494947=test_time_tz I, [2024-05-09T18:14:15.649263 #2453562] INFO -- : [ 66/885] 2494957=test_trace I, [2024-05-09T18:14:15.654901 #2453562] INFO -- : [ 67/885] 2494957=ractor_test I, [2024-05-09T18:14:15.658844 #2453562] INFO -- : [ 68/885] 2494947=test_win32ole_variable I, [2024-05-09T18:14:15.660614 #2453562] INFO -- : [ 69/885] 2494947=test_stringio I, [2024-05-09T18:14:15.662829 #2453562] INFO -- : [ 70/885] 2494950=test_arity I, [2024-05-09T18:14:15.666962 #2453562] INFO -- : [ 71/885] 2494950=test_io_wait_uncommon I, [2024-05-09T18:14:15.667829 #2453562] INFO -- : [ 72/885] 2494964=test_rdoc_class_module I, [2024-05-09T18:14:15.669135 #2453562] INFO -- : [ 73/885] 2494956=test_bignum I, [2024-05-09T18:14:15.678073 #2453562] INFO -- : [ 74/885] 2494950=test_gem_ci_detector I, [2024-05-09T18:14:15.682467 #2453562] INFO -- : [ 75/885] 2494950=test_enc_associate I, [2024-05-09T18:14:15.727885 #2453562] INFO -- : [ 76/885] 2494957=test_lazy_enumerator I, [2024-05-09T18:14:15.757362 #2453562] INFO -- : [ 77/885] 2494963=test_unix I, [2024-05-09T18:14:15.780337 #2453562] INFO -- : [ 78/885] 2494956=test_coder I, [2024-05-09T18:14:15.792468 #2453562] INFO -- : [ 79/885] 2494963=test_symbol I, [2024-05-09T18:14:15.808570 #2453562] INFO -- : [ 80/885] 2494947=test_context I, [2024-05-09T18:14:15.811598 #2453562] INFO -- : [ 81/885] 2494956=test_gem_commands_pristine_command I, [2024-05-09T18:14:15.822731 #2453562] INFO -- : [ 82/885] 2494953=test_nofree I, [2024-05-09T18:14:15.825685 #2453562] INFO -- : [ 83/885] 2494953=ruby_api_test I, [2024-05-09T18:14:15.985602 #2453562] INFO -- : [ 84/885] 2494960=test_find_executable I, [2024-05-09T18:14:15.986577 #2453562] INFO -- : [ 85/885] 2494946=test_function_entry I, [2024-05-09T18:14:15.991515 #2453562] INFO -- : [ 86/885] 2494946=test_gem_resolver_requirement_list I, [2024-05-09T18:14:16.005592 #2453562] INFO -- : [ 87/885] 2494962=test_arith_seq_beg_len_step I, [2024-05-09T18:14:16.009657 #2453562] INFO -- : [ 88/885] 2494960=test_pkcs7 I, [2024-05-09T18:14:16.049686 #2453562] INFO -- : [ 89/885] 2494947=test_mailto I, [2024-05-09T18:14:16.052548 #2453562] INFO -- : [ 90/885] 2494962=test_coderange I, [2024-05-09T18:14:16.064962 #2453562] INFO -- : [ 91/885] 2494962=location_test I, [2024-05-09T18:14:16.067824 #2453562] INFO -- : [ 92/885] 2494953=test_symbol I, [2024-05-09T18:14:16.068879 #2453562] INFO -- : [ 93/885] 2494947=test_http_request I, [2024-05-09T18:14:16.087687 #2453562] INFO -- : [ 94/885] 2494957=test_gem_source_fetch_problem I, [2024-05-09T18:14:16.089303 #2453562] INFO -- : [ 95/885] 2494953=json_generic_object_test I, [2024-05-09T18:14:16.102835 #2453562] INFO -- : [ 96/885] 2494953=test_rdoc_generator_darkfish I, [2024-05-09T18:14:16.119210 #2453562] INFO -- : [ 97/885] 2494947=test_rdoc_comment I, [2024-05-09T18:14:16.171767 #2453562] INFO -- : [ 98/885] 2494962=test_error_highlight I, [2024-05-09T18:14:16.193900 #2453562] INFO -- : [ 99/885] 2494960=test_resize I, [2024-05-09T18:14:16.199677 #2453562] INFO -- : [100/885] 2494960=test_cgi_multipart I, [2024-05-09T18:14:16.229324 #2453562] INFO -- : [101/885] 2494946=test_gem_commands_cleanup_command I, [2024-05-09T18:14:16.246097 #2453562] INFO -- : [102/885] 2494950=test_word I, [2024-05-09T18:14:16.246224 #2453562] INFO -- : [103/885] 2494950=test_numeric I, [2024-05-09T18:14:16.253824 #2453562] INFO -- : [104/885] 2494950=test_member I, [2024-05-09T18:14:16.254841 #2453562] INFO -- : [105/885] 2494957=test_ractor_compatibility I, [2024-05-09T18:14:16.257628 #2453562] INFO -- : [106/885] 2494950=test_date_ractor I, [2024-05-09T18:14:16.322169 #2453562] INFO -- : [107/885] 2494964=test_gem_console_ui I, [2024-05-09T18:14:16.327810 #2453562] INFO -- : [108/885] 2494964=format_errors_test I, [2024-05-09T18:14:16.360453 #2453562] INFO -- : [109/885] 2494960=test_dir I, [2024-05-09T18:14:16.364704 #2453562] INFO -- : [110/885] 2494947=test_eval I, [2024-05-09T18:14:16.368969 #2453562] INFO -- : [111/885] 2494947=test_autoconf I, [2024-05-09T18:14:16.377044 #2453562] INFO -- : [112/885] 2494947=test_gem_resolver_lock_set I, [2024-05-09T18:14:16.388741 #2453562] INFO -- : [113/885] 2494964=test_not I, [2024-05-09T18:14:16.390269 #2453562] INFO -- : [114/885] 2494964=test_import I, [2024-05-09T18:14:16.403556 #2453562] INFO -- : [115/885] 2494947=test_rdoc_parser_markdown I, [2024-05-09T18:14:16.434660 #2453562] INFO -- : [116/885] 2494948=test_file_exhaustive I, [2024-05-09T18:14:16.446132 #2453562] INFO -- : [117/885] 2494947=test_files_test I, [2024-05-09T18:14:16.478937 #2453562] INFO -- : [118/885] 2494961=test_gem_update_suggestion I, [2024-05-09T18:14:16.528383 #2453562] INFO -- : [119/885] 2494953=test_logger I, [2024-05-09T18:14:16.536838 #2453562] INFO -- : [120/885] 2494950=test_win32ole_method I, [2024-05-09T18:14:16.537008 #2453562] INFO -- : [121/885] 2494950=test_delete I, [2024-05-09T18:14:16.540326 #2453562] INFO -- : [122/885] 2494947=test_keyword I, [2024-05-09T18:14:16.544362 #2453562] INFO -- : [123/885] 2494950=test_class_name_check I, [2024-05-09T18:14:16.547938 #2453562] INFO -- : [124/885] 2494953=test_fd_setsize I, [2024-05-09T18:14:16.549671 #2453562] INFO -- : [125/885] 2494953=test_continuation I, [2024-05-09T18:14:16.557631 #2453562] INFO -- : [126/885] 2494953=test_gem_commands_push_command I, [2024-05-09T18:14:16.563245 #2453562] INFO -- : [127/885] 2494950=test_weakkeymap I, [2024-05-09T18:14:16.583009 #2453562] INFO -- : [128/885] 2494951=test_numhash I, [2024-05-09T18:14:16.586057 #2453562] INFO -- : [129/885] 2494951=test_pkey_rsa I, [2024-05-09T18:14:16.622834 #2453562] INFO -- : [130/885] 2494960=test_gem_platform I, [2024-05-09T18:14:16.681817 #2453562] INFO -- : [131/885] 2494962=test_gem_package_task I, [2024-05-09T18:14:16.701246 #2453562] INFO -- : [132/885] 2494961=test_date_strptime I, [2024-05-09T18:14:16.705717 #2453562] INFO -- : [133/885] 2494960=test_placearg I, [2024-05-09T18:14:16.725564 #2453562] INFO -- : [134/885] 2494950=test_rdoc_markup_hard_break I, [2024-05-09T18:14:16.727013 #2453562] INFO -- : [135/885] 2494957=test_big5 I, [2024-05-09T18:14:16.728010 #2453562] INFO -- : [136/885] 2494950=test_func I, [2024-05-09T18:14:16.738025 #2453562] INFO -- : [137/885] 2494957=test_pointer I, [2024-05-09T18:14:16.811858 #2453562] INFO -- : [138/885] 2494961=test_ractor I, [2024-05-09T18:14:16.850900 #2453562] INFO -- : [139/885] 2494960=test_type I, [2024-05-09T18:14:16.855448 #2453562] INFO -- : [140/885] 2494960=test_signedness I, [2024-05-09T18:14:16.861255 #2453562] INFO -- : [141/885] 2494951=test_tsort I, [2024-05-09T18:14:16.865206 #2453562] INFO -- : [142/885] 2494946=test_rdoc_rd_block_parser I, [2024-05-09T18:14:16.870812 #2453562] INFO -- : [143/885] 2494951=test_timeout I, [2024-05-09T18:14:16.875826 #2453562] INFO -- : [144/885] 2494961=test_normalize I, [2024-05-09T18:14:16.877592 #2453562] INFO -- : [145/885] 2494961=test_ossl I, [2024-05-09T18:14:16.880203 #2453562] INFO -- : [146/885] 2494951=test_change_word I, [2024-05-09T18:14:16.881951 #2453562] INFO -- : [147/885] 2494962=test_flip I, [2024-05-09T18:14:16.891837 #2453562] INFO -- : [148/885] 2494951=compiler_test I, [2024-05-09T18:14:16.921124 #2453562] INFO -- : [149/885] 2494962=test_sleep I, [2024-05-09T18:14:16.955856 #2453562] INFO -- : [150/885] 2494964=test_date_arith I, [2024-05-09T18:14:16.959792 #2453562] INFO -- : [151/885] 2494951=test_object I, [2024-05-09T18:14:16.962760 #2453562] INFO -- : [152/885] 2494964=test_ruby_lex I, [2024-05-09T18:14:17.023433 #2453562] INFO -- : [153/885] 2494946=test_gem_local_remote_options I, [2024-05-09T18:14:17.057283 #2453562] INFO -- : [154/885] 2494957=test_basicinstructions I, [2024-05-09T18:14:17.083222 #2453562] INFO -- : [155/885] 2494946=test_gem_gemcutter_utilities I, [2024-05-09T18:14:17.113909 #2453562] INFO -- : [156/885] 2494956=test_gem_command_manager I, [2024-05-09T18:14:17.126147 #2453562] INFO -- : [157/885] 2494957=test_key_actor_emacs I, [2024-05-09T18:14:17.154892 #2453562] INFO -- : [158/885] 2494963=test_arithmetic_sequence I, [2024-05-09T18:14:17.155308 #2453562] INFO -- : [159/885] 2494953=test_object I, [2024-05-09T18:14:17.155601 #2453562] INFO -- : [160/885] 2494964=test_cgi_header I, [2024-05-09T18:14:17.161678 #2453562] INFO -- : [161/885] 2494953=heredoc_dedent_test I, [2024-05-09T18:14:17.162535 #2453562] INFO -- : [162/885] 2494963=version_test I, [2024-05-09T18:14:17.165982 #2453562] INFO -- : [163/885] 2494953=test_rdoc_ri_paths I, [2024-05-09T18:14:17.169011 #2453562] INFO -- : [164/885] 2494964=test_ensured I, [2024-05-09T18:14:17.180748 #2453562] INFO -- : [165/885] 2494953=library_symbols_test I, [2024-05-09T18:14:17.181369 #2453562] INFO -- : [166/885] 2494947=test_addr I, [2024-05-09T18:14:17.185726 #2453562] INFO -- : [167/885] 2494953=test_locale I, [2024-05-09T18:14:17.191538 #2453562] INFO -- : [168/885] 2494947=test_ts I, [2024-05-09T18:14:17.237365 #2453562] INFO -- : [169/885] 2494956=test_erb_command I, [2024-05-09T18:14:17.240635 #2453562] INFO -- : [170/885] 2494964=test_helper I, [2024-05-09T18:14:17.252999 #2453562] INFO -- : [171/885] 2494963=test_encoding I, [2024-05-09T18:14:17.267248 #2453562] INFO -- : [172/885] 2494964=test_gem_uri_formatter I, [2024-05-09T18:14:17.282849 #2453562] INFO -- : [173/885] 2494956=test_range I, [2024-05-09T18:14:17.286093 #2453562] INFO -- : [174/885] 2494964=test_project_sanity I, [2024-05-09T18:14:17.302421 #2453562] INFO -- : [175/885] 2494953=test_dup I, [2024-05-09T18:14:17.307425 #2453562] INFO -- : [176/885] 2494957=test_pty I, [2024-05-09T18:14:17.355460 #2453562] INFO -- : [177/885] 2494964=test_constant I, [2024-05-09T18:14:17.385915 #2453562] INFO -- : [178/885] 2494951=command_line_test I, [2024-05-09T18:14:17.392396 #2453562] INFO -- : [179/885] 2494951=test_udp I, [2024-05-09T18:14:17.398948 #2453562] INFO -- : [180/885] 2494951=test_data_error I, [2024-05-09T18:14:17.419871 #2453562] INFO -- : [181/885] 2494946=bom_test I, [2024-05-09T18:14:17.448413 #2453562] INFO -- : [182/885] 2494959=unescape_test I, [2024-05-09T18:14:17.456601 #2453562] INFO -- : [183/885] 2494952=test_ostruct I, [2024-05-09T18:14:17.461536 #2453562] INFO -- : [184/885] 2494951=test_force_exit I, [2024-05-09T18:14:17.492580 #2453562] INFO -- : [185/885] 2494963=test_file I, [2024-05-09T18:14:17.512816 #2453562] INFO -- : [186/885] 2494946=static_inspect_test I, [2024-05-09T18:14:17.527885 #2453562] INFO -- : [187/885] 2494953=errors_test I, [2024-05-09T18:14:17.536483 #2453562] INFO -- : [188/885] 2494946=test_regexp I, [2024-05-09T18:14:17.559091 #2453562] INFO -- : [189/885] 2494951=test_gem_commands_check_command I, [2024-05-09T18:14:17.603559 #2453562] INFO -- : [190/885] 2494953=test_tmpdir I, [2024-05-09T18:14:17.627128 #2453562] INFO -- : [191/885] 2494952=test_integer_comb I, [2024-05-09T18:14:17.681795 #2453562] INFO -- : [192/885] 2494947=test_rdoc_markup_document I, [2024-05-09T18:14:17.689778 #2453562] INFO -- : [193/885] 2494947=test_vm_dump I, [2024-05-09T18:14:17.697480 #2453562] INFO -- : [194/885] 2494947=test_random_formatter I, [2024-05-09T18:14:17.707991 #2453562] INFO -- : [195/885] 2494953=test_helper I, [2024-05-09T18:14:17.708056 #2453562] INFO -- : [196/885] 2494953=test_jaro_winkler I, [2024-05-09T18:14:17.709992 #2453562] INFO -- : [197/885] 2494947=test_lambda I, [2024-05-09T18:14:17.719271 #2453562] INFO -- : [198/885] 2494953=test_ast I, [2024-05-09T18:14:17.719630 #2453562] INFO -- : [199/885] 2494951=test_gem_request_set_gem_dependency_api I, [2024-05-09T18:14:17.777689 #2453562] INFO -- : [200/885] 2494947=test_webauthn_listener I, [2024-05-09T18:14:17.829759 #2453562] INFO -- : [201/885] 2494947=test_x509store I, [2024-05-09T18:14:17.861868 #2453562] INFO -- : [202/885] 2494957=test_rdoc_code_object I, [2024-05-09T18:14:17.934658 #2453562] INFO -- : [203/885] 2494951=test_update I, [2024-05-09T18:14:17.946211 #2453562] INFO -- : [204/885] 2494951=test_fips I, [2024-05-09T18:14:17.955938 #2453562] INFO -- : [205/885] 2494949=test_x509name I, [2024-05-09T18:14:17.990108 #2453562] INFO -- : [206/885] 2494958=test_transcode I, [2024-05-09T18:14:17.995081 #2453562] INFO -- : [207/885] 2494949=json_generator_test I, [2024-05-09T18:14:18.070566 #2453562] INFO -- : [208/885] 2494956=test_eval I, [2024-05-09T18:14:18.075298 #2453562] INFO -- : [209/885] 2494950=test_enumerable I, [2024-05-09T18:14:18.079722 #2453562] INFO -- : [210/885] 2494950=test_config I, [2024-05-09T18:14:18.090077 #2453562] INFO -- : [211/885] 2494949=test_gem_resolver_vendor_set I, [2024-05-09T18:14:18.099600 #2453562] INFO -- : [212/885] 2494947=test_gem_resolver_api_set I, [2024-05-09T18:14:18.149935 #2453562] INFO -- : [213/885] 2494947=test_gem_safe_marshal I, [2024-05-09T18:14:18.185995 #2453562] INFO -- : [214/885] 2494951=test_pkey_dsa I, [2024-05-09T18:14:18.197291 #2453562] INFO -- : [215/885] 2494958=test_ocsp I, [2024-05-09T18:14:18.262678 #2453562] INFO -- : [216/885] 2494956=test_class I, [2024-05-09T18:14:18.265201 #2453562] INFO -- : [217/885] 2494956=test_scheduler I, [2024-05-09T18:14:18.309758 #2453562] INFO -- : [218/885] 2494949=test_rdoc_markup_heading I, [2024-05-09T18:14:18.378945 #2453562] INFO -- : [219/885] 2494957=test_exception_at_throwing I, [2024-05-09T18:14:18.415856 #2453562] INFO -- : [220/885] 2494956=test_iseq I, [2024-05-09T18:14:18.437458 #2453562] INFO -- : [221/885] 2494949=test_gem_commands_server_command I, [2024-05-09T18:14:18.443408 #2453562] INFO -- : [222/885] 2494949=test_io_m17n I, [2024-05-09T18:14:18.449880 #2453562] INFO -- : [223/885] 2494957=test_variable_name_check I, [2024-05-09T18:14:18.514603 #2453562] INFO -- : [224/885] 2494957=test_did_you_mean I, [2024-05-09T18:14:18.535049 #2453562] INFO -- : [225/885] 2494958=test_cmethod I, [2024-05-09T18:14:18.538696 #2453562] INFO -- : [226/885] 2494958=test_tracer I, [2024-05-09T18:14:18.613653 #2453562] INFO -- : [227/885] 2494950=test_append I, [2024-05-09T18:14:18.618037 #2453562] INFO -- : [228/885] 2494950=test_option I, [2024-05-09T18:14:18.633381 #2453562] INFO -- : [229/885] 2494957=test_gem_commands_build_command I, [2024-05-09T18:14:18.664222 #2453562] INFO -- : [230/885] 2494959=test_interned_str I, [2024-05-09T18:14:18.667548 #2453562] INFO -- : [231/885] 2494959=test_case_comprehensive I, [2024-05-09T18:14:18.671183 #2453562] INFO -- : [232/885] 2494958=test_ractor I, [2024-05-09T18:14:18.714864 #2453562] INFO -- : [233/885] 2494965=test_gem_security I, [2024-05-09T18:14:18.737532 #2453562] INFO -- : [234/885] 2494947=test_rdoc_servlet I, [2024-05-09T18:14:18.742986 #2453562] INFO -- : [235/885] 2494958=test_digest I, [2024-05-09T18:14:18.751863 #2453562] INFO -- : [236/885] 2494958=test_closure I, [2024-05-09T18:14:18.765823 #2453562] INFO -- : [237/885] 2494950=test_bundled_ca I, [2024-05-09T18:14:18.849033 #2453562] INFO -- : [238/885] 2494947=test_multi_irb_commands I, [2024-05-09T18:14:18.850694 #2453562] INFO -- : [239/885] 2494947=test_fiber I, [2024-05-09T18:14:18.908467 #2453562] INFO -- : [240/885] 2494958=test_open3 I, [2024-05-09T18:14:18.935040 #2453562] INFO -- : [241/885] 2494957=test_history I, [2024-05-09T18:14:18.966355 #2453562] INFO -- : [242/885] 2494957=test_mkmf I, [2024-05-09T18:14:18.998843 #2453562] INFO -- : [243/885] 2494957=test_date_marshal I, [2024-05-09T18:14:18.999146 #2453562] INFO -- : [244/885] 2494956=test_delegate I, [2024-05-09T18:14:19.004081 #2453562] INFO -- : [245/885] 2494957=test_popen_deadlock I, [2024-05-09T18:14:19.040454 #2453562] INFO -- : [246/885] 2494956=test_exit I, [2024-05-09T18:14:19.098990 #2453562] INFO -- : [247/885] 2494956=test_recursion I, [2024-05-09T18:14:19.125062 #2453562] INFO -- : [248/885] 2494956=test_to_ary_concat I, [2024-05-09T18:14:19.214866 #2453562] INFO -- : [249/885] 2494960=test_webauthn_listener_response I, [2024-05-09T18:14:19.230394 #2453562] INFO -- : [250/885] 2494960=test_time I, [2024-05-09T18:14:19.385853 #2453562] INFO -- : [251/885] 2494951=test_stream I, [2024-05-09T18:14:19.395748 #2453562] INFO -- : [252/885] 2494960=test_printf I, [2024-05-09T18:14:19.399649 #2453562] INFO -- : [253/885] 2494960=test_rdoc_markup_pre_process I, [2024-05-09T18:14:19.402956 #2453562] INFO -- : [254/885] 2494951=test_pinned I, [2024-05-09T18:14:19.432358 #2453562] INFO -- : [255/885] 2494951=reflection_test I, [2024-05-09T18:14:19.433595 #2453562] INFO -- : [256/885] 2494951=test_emoji_breaks I, [2024-05-09T18:14:19.435783 #2453562] INFO -- : [257/885] 2494951=test_gem_bundler_version_finder I, [2024-05-09T18:14:19.470293 #2453562] INFO -- : [258/885] 2494951=test_within_pipe I, [2024-05-09T18:14:19.495496 #2453562] INFO -- : [259/885] 2494951=test_rdoc_markup_to_bs I, [2024-05-09T18:14:19.596099 #2453562] INFO -- : [260/885] 2494957=test_help I, [2024-05-09T18:14:19.602419 #2453562] INFO -- : [261/885] 2494957=test_files_lib I, [2024-05-09T18:14:19.613312 #2453562] INFO -- : [262/885] 2494960=test_gem_commands_unpack_command I, [2024-05-09T18:14:19.645670 #2453562] INFO -- : [263/885] 2494951=test_beginendblock I, [2024-05-09T18:14:19.714591 #2453562] INFO -- : [264/885] 2494964=json_encoding_test I, [2024-05-09T18:14:19.721078 #2453562] INFO -- : [265/885] 2494964=test_color I, [2024-05-09T18:14:19.742706 #2453562] INFO -- : [266/885] 2494949=test_key_stroke I, [2024-05-09T18:14:19.773723 #2453562] INFO -- : [267/885] 2494964=test_set_len I, [2024-05-09T18:14:19.774899 #2453562] INFO -- : [268/885] 2494964=test_encoding I, [2024-05-09T18:14:19.795078 #2453562] INFO -- : [269/885] 2494964=test_httpresponses I, [2024-05-09T18:14:19.819064 #2453562] INFO -- : [270/885] 2494949=test_httpheader I, [2024-05-09T18:14:19.821261 #2453562] INFO -- : [271/885] 2494956=test_gem_resolver_local_specification I, [2024-05-09T18:14:19.838667 #2453562] INFO -- : [272/885] 2494964=test_rdoc_ri_driver I, [2024-05-09T18:14:19.850732 #2453562] INFO -- : [273/885] 2494956=test_install I, [2024-05-09T18:14:19.881802 #2453562] INFO -- : [274/885] 2494949=test_rdoc_markup_to_label I, [2024-05-09T18:14:19.883946 #2453562] INFO -- : [275/885] 2494952=test_sockopt I, [2024-05-09T18:14:19.888823 #2453562] INFO -- : [276/885] 2494952=test_pair I, [2024-05-09T18:14:19.911785 #2453562] INFO -- : [277/885] 2494949=test_win32ole_param I, [2024-05-09T18:14:19.911851 #2453562] INFO -- : [278/885] 2494949=test_gem_commands_yank_command I, [2024-05-09T18:14:19.962500 #2453562] INFO -- : [279/885] 2494960=test_document I, [2024-05-09T18:14:19.971959 #2453562] INFO -- : [280/885] 2494960=test_acceptable I, [2024-05-09T18:14:20.009218 #2453562] INFO -- : [281/885] 2494956=test_euc_jp I, [2024-05-09T18:14:20.010399 #2453562] INFO -- : [282/885] 2494956=test_rdoc_generator_pot_po_entry I, [2024-05-09T18:14:20.014991 #2453562] INFO -- : [283/885] 2494956=test_chilled I, [2024-05-09T18:14:20.017603 #2453562] INFO -- : [284/885] 2494960=test_name_error_extension I, [2024-05-09T18:14:20.019091 #2453562] INFO -- : [285/885] 2494956=test_rdoc_i18n_locale I, [2024-05-09T18:14:20.024015 #2453562] INFO -- : [286/885] 2494960=test_human_typo I, [2024-05-09T18:14:20.024491 #2453562] INFO -- : [287/885] 2494956=test_primitive I, [2024-05-09T18:14:20.027986 #2453562] INFO -- : [288/885] 2494960=test_rbconfig I, [2024-05-09T18:14:20.028953 #2453562] INFO -- : [289/885] 2494960=test_ssl_session I, [2024-05-09T18:14:20.033587 #2453562] INFO -- : [290/885] 2494956=test_thread_cv I, [2024-05-09T18:14:20.048439 #2453562] INFO -- : [291/885] 2494951=test_lexer I, [2024-05-09T18:14:20.066063 #2453562] INFO -- : [292/885] 2494951=test_gem_uri I, [2024-05-09T18:14:20.092990 #2453562] INFO -- : [293/885] 2494951=test_key_event_record I, [2024-05-09T18:14:20.093445 #2453562] INFO -- : [294/885] 2494951=test_notimplement I, [2024-05-09T18:14:20.098055 #2453562] INFO -- : [295/885] 2494951=test_random I, [2024-05-09T18:14:20.109416 #2453562] INFO -- : [296/885] 2494951=test_gem_resolver_vendor_specification I, [2024-05-09T18:14:20.110232 #2453562] INFO -- : [297/885] 2494964=test_gem_commands_update_command I, [2024-05-09T18:14:20.139585 #2453562] INFO -- : [298/885] 2494951=test_filter I, [2024-05-09T18:14:20.150862 #2453562] INFO -- : [299/885] 2494951=test_gem_gem_runner I, [2024-05-09T18:14:20.208891 #2453562] INFO -- : [300/885] 2494951=static_literals_test I, [2024-05-09T18:14:20.210290 #2453562] INFO -- : [301/885] 2494951=test_data I, [2024-05-09T18:14:20.226181 #2453562] INFO -- : [302/885] 2494951=test_rdoc_method_attr I, [2024-05-09T18:14:20.386486 #2453562] INFO -- : [303/885] 2494951=test_rdoc_parser_changelog I, [2024-05-09T18:14:20.390523 #2453562] INFO -- : [304/885] 2494949=test_enumerator I, [2024-05-09T18:14:20.394335 #2453562] INFO -- : [305/885] 2494949=test_koi8 I, [2024-05-09T18:14:20.400721 #2453562] INFO -- : [306/885] 2494949=parameters_signature_test I, [2024-05-09T18:14:20.453535 #2453562] INFO -- : [307/885] 2494951=test_unicode I, [2024-05-09T18:14:20.461365 #2453562] INFO -- : [308/885] 2494951=test_rdoc_generator_pot I, [2024-05-09T18:14:20.462460 #2453562] INFO -- : [309/885] 2494951=test_path I, [2024-05-09T18:14:20.478340 #2453562] INFO -- : [310/885] 2494951=redundant_return_test I, [2024-05-09T18:14:20.485014 #2453562] INFO -- : [311/885] 2494951=test_case_mapping I, [2024-05-09T18:14:20.491047 #2453562] INFO -- : [312/885] 2494951=test_bn I, [2024-05-09T18:14:20.503589 #2453562] INFO -- : [313/885] 2494951=test_win32ole_param_event I, [2024-05-09T18:14:20.503686 #2453562] INFO -- : [314/885] 2494951=test_addrinfo I, [2024-05-09T18:14:20.509023 #2453562] INFO -- : [315/885] 2494949=test_http I, [2024-05-09T18:14:20.531276 #2453562] INFO -- : [316/885] 2494951=test_tree_spell_checker I, [2024-05-09T18:14:20.550812 #2453562] INFO -- : [317/885] 2494951=test_date_compat I, [2024-05-09T18:14:20.554149 #2453562] INFO -- : [318/885] 2494951=test_rdoc_markup_to_html I, [2024-05-09T18:14:20.624076 #2453562] INFO -- : [319/885] 2494950=test_bug-14834 I, [2024-05-09T18:14:20.627374 #2453562] INFO -- : [320/885] 2494951=test_terminfo I, [2024-05-09T18:14:20.629784 #2453562] INFO -- : [321/885] 2494951=test_compile_prism I, [2024-05-09T18:14:20.669569 #2453562] INFO -- : [322/885] 2494956=test_boolean I, [2024-05-09T18:14:20.673050 #2453562] INFO -- : [323/885] 2494956=test_stringify_symbols I, [2024-05-09T18:14:20.678904 #2453562] INFO -- : [324/885] 2494956=integer_parse_test I, [2024-05-09T18:14:20.715660 #2453562] INFO -- : [325/885] 2494950=test_instrumentation_api I, [2024-05-09T18:14:20.744453 #2453562] INFO -- : [326/885] 2494956=test_configuration I, [2024-05-09T18:14:20.826780 #2453562] INFO -- : [327/885] 2494956=test_rubyvm I, [2024-05-09T18:14:20.834490 #2453562] INFO -- : [328/885] 2494956=test_buffered_io I, [2024-05-09T18:14:20.895784 #2453562] INFO -- : [329/885] 2494951=test_monitor I, [2024-05-09T18:14:20.937287 #2453562] INFO -- : [330/885] 2494956=test_whileuntil I, [2024-05-09T18:14:20.946843 #2453562] INFO -- : [331/885] 2494956=test_rdoc_generator_markup I, [2024-05-09T18:14:20.955605 #2453562] INFO -- : [332/885] 2494958=test_arith_seq_extract I, [2024-05-09T18:14:20.976801 #2453562] INFO -- : [333/885] 2494956=test_method_name_check I, [2024-05-09T18:14:20.999488 #2453562] INFO -- : [334/885] 2494956=test_parser I, [2024-05-09T18:14:21.022962 #2453562] INFO -- : [335/885] 2494956=constant_path_node_test I, [2024-05-09T18:14:21.025282 #2453562] INFO -- : [336/885] 2494956=test_gem_ext_cargo_builder I, [2024-05-09T18:14:21.049518 #2453562] INFO -- : [337/885] 2494956=test_ssl I, [2024-05-09T18:14:21.093918 #2453562] INFO -- : [338/885] 2494958=test_module I, [2024-05-09T18:14:21.095094 #2453562] INFO -- : [339/885] 2494960=test_gem_request_set I, [2024-05-09T18:14:21.115566 #2453562] INFO -- : [340/885] 2494951=test_rational I, [2024-05-09T18:14:21.126844 #2453562] INFO -- : [341/885] 2494951=test_rational2 I, [2024-05-09T18:14:21.137287 #2453562] INFO -- : [342/885] 2494951=test_assembler I, [2024-05-09T18:14:21.139961 #2453562] INFO -- : [343/885] 2494951=attribute_write_test I, [2024-05-09T18:14:21.144425 #2453562] INFO -- : [344/885] 2494951=test_propertyputref I, [2024-05-09T18:14:21.148113 #2453562] INFO -- : [345/885] 2494951=test_spell_checker I, [2024-05-09T18:14:21.157224 #2453562] INFO -- : [346/885] 2494951=test_x509ext I, [2024-05-09T18:14:21.162800 #2453562] INFO -- : [347/885] 2494951=test_erb I, [2024-05-09T18:14:21.203997 #2453562] INFO -- : [348/885] 2494951=test_gem_source_installed I, [2024-05-09T18:14:21.227425 #2453562] INFO -- : [349/885] 2494951=test_len I, [2024-05-09T18:14:21.228912 #2453562] INFO -- : [350/885] 2494951=test_yield_block I, [2024-05-09T18:14:21.236674 #2453562] INFO -- : [351/885] 2494951=test_gem_commands_cert_command I, [2024-05-09T18:14:21.303138 #2453562] INFO -- : [352/885] 2494964=test_completion I, [2024-05-09T18:14:21.425060 #2453562] INFO -- : [353/885] 2494960=test_abi I, [2024-05-09T18:14:21.567471 #2453562] INFO -- : [354/885] 2494960=test_provider I, [2024-05-09T18:14:21.699781 #2453562] INFO -- : [355/885] 2494948=test_rdoc_parser_simple I, [2024-05-09T18:14:21.818757 #2453562] INFO -- : [356/885] 2494964=test_load I, [2024-05-09T18:14:21.820593 #2453562] INFO -- : [357/885] 2494948=test_gem_commands_rebuild_command I, [2024-05-09T18:14:21.821199 #2453562] INFO -- : [358/885] 2494964=test_yamldbm I, [2024-05-09T18:14:21.829650 #2453562] INFO -- : [359/885] 2494964=test_https I, [2024-05-09T18:14:21.882921 #2453562] INFO -- : [360/885] 2494948=test_gem_ext_builder I, [2024-05-09T18:14:21.926553 #2453562] INFO -- : [361/885] 2494962=test_evaluation I, [2024-05-09T18:14:21.935282 #2453562] INFO -- : [362/885] 2494962=test_gem_dependency_list I, [2024-05-09T18:14:21.946326 #2453562] INFO -- : [363/885] 2494960=test_benchmark I, [2024-05-09T18:14:22.003180 #2453562] INFO -- : [364/885] 2494962=test_win32ole_method_event I, [2024-05-09T18:14:22.012575 #2453562] INFO -- : [365/885] 2494962=test_nesting_parser I, [2024-05-09T18:14:22.119813 #2453562] INFO -- : [366/885] 2494962=test_gem_source I, [2024-05-09T18:14:22.160727 #2453562] INFO -- : [367/885] 2494964=test_scalar_scanner I, [2024-05-09T18:14:22.188155 #2453562] INFO -- : [368/885] 2494964=test_gem_commands_outdated_command I, [2024-05-09T18:14:22.216416 #2453562] INFO -- : [369/885] 2494964=test_array I, [2024-05-09T18:14:22.317322 #2453562] INFO -- : [370/885] 2494962=test_gem_package_tar_writer I, [2024-05-09T18:14:22.379530 #2453562] INFO -- : [371/885] 2494962=test_helper_method I, [2024-05-09T18:14:22.386772 #2453562] INFO -- : [372/885] 2494962=test_new I, [2024-05-09T18:14:22.393646 #2453562] INFO -- : [373/885] 2494962=test_cipher I, [2024-05-09T18:14:22.428798 #2453562] INFO -- : [374/885] 2494958=test_gem_security_signer I, [2024-05-09T18:14:22.430103 #2453562] INFO -- : [375/885] 2494962=test_gem_resolver_git_set I, [2024-05-09T18:14:22.600339 #2453562] INFO -- : [376/885] 2494958=test_storage I, [2024-05-09T18:14:22.605327 #2453562] INFO -- : [377/885] 2494958=test_digest_extend I, [2024-05-09T18:14:22.613791 #2453562] INFO -- : [378/885] 2494958=test_string I, [2024-05-09T18:14:22.615408 #2453562] INFO -- : [379/885] 2494958=test_iterator I, [2024-05-09T18:14:22.681265 #2453562] INFO -- : [380/885] 2494958=test_omap I, [2024-05-09T18:14:22.696417 #2453562] INFO -- : [381/885] 2494958=test_debug I, [2024-05-09T18:14:22.697326 #2453562] INFO -- : [382/885] 2494958=pattern_test I, [2024-05-09T18:14:22.701427 #2453562] INFO -- : [383/885] 2494962=test_memory_view I, [2024-05-09T18:14:22.716513 #2453562] INFO -- : [384/885] 2494962=test_shellwords I, [2024-05-09T18:14:22.725386 #2453562] INFO -- : [385/885] 2494962=test_cgi_session I, [2024-05-09T18:14:22.730358 #2453562] INFO -- : [386/885] 2494957=test_rdoc_rd I, [2024-05-09T18:14:22.739808 #2453562] INFO -- : [387/885] 2494962=test_rdoc_top_level I, [2024-05-09T18:14:22.744348 #2453562] INFO -- : [388/885] 2494957=test_metaclass I, [2024-05-09T18:14:22.748411 #2453562] INFO -- : [389/885] 2494957=test_signal I, [2024-05-09T18:14:22.769847 #2453562] INFO -- : [390/885] 2494958=test_fixnum I, [2024-05-09T18:14:22.775436 #2453562] INFO -- : [391/885] 2494958=test_x509crl I, [2024-05-09T18:14:22.827167 #2453562] INFO -- : [392/885] 2494948=test_process I, [2024-05-09T18:14:22.845364 #2453562] INFO -- : [393/885] 2494948=test_windows_1252 I, [2024-05-09T18:14:22.850405 #2453562] INFO -- : [394/885] 2494948=test_input_method I, [2024-05-09T18:14:22.892668 #2453562] INFO -- : [395/885] 2494958=test_float I, [2024-05-09T18:14:22.925904 #2453562] INFO -- : [396/885] 2494948=test_require I, [2024-05-09T18:14:22.944113 #2453562] INFO -- : [397/885] 2494962=test_cgi_cookie I, [2024-05-09T18:14:22.948287 #2453562] INFO -- : [398/885] 2494962=test_regex_casefold I, [2024-05-09T18:14:23.100484 #2453562] INFO -- : [399/885] 2494965=test_gem_commands_signout_command I, [2024-05-09T18:14:23.135097 #2453562] INFO -- : [400/885] 2494960=test_refinement I, [2024-05-09T18:14:23.143472 #2453562] INFO -- : [401/885] 2494965=test_gem_source_git I, [2024-05-09T18:14:23.206575 #2453562] INFO -- : [402/885] 2494962=test_dir_m17n I, [2024-05-09T18:14:23.328826 #2453562] INFO -- : [403/885] 2494952=test_gem_resolver_installer_set I, [2024-05-09T18:14:23.504442 #2453562] INFO -- : [404/885] 2494952=test_files_test_1 I, [2024-05-09T18:14:23.508776 #2453562] INFO -- : [405/885] 2494951=test_set I, [2024-05-09T18:14:23.538542 #2453562] INFO -- : [406/885] 2494951=test_struct I, [2024-05-09T18:14:23.566271 #2453562] INFO -- : [407/885] 2494963=test_gem_path_support I, [2024-05-09T18:14:23.605424 #2453562] INFO -- : [408/885] 2494965=test_x509req I, [2024-05-09T18:14:23.671809 #2453562] INFO -- : [409/885] 2494950=test_mutex I, [2024-05-09T18:14:23.720259 #2453562] INFO -- : [410/885] 2494963=test_rdoc_rd_inline I, [2024-05-09T18:14:23.829759 #2453562] INFO -- : [411/885] 2494965=test_engine I, [2024-05-09T18:14:23.830844 #2453562] INFO -- : [412/885] 2494963=test_win32ole_variant_m I, [2024-05-09T18:14:23.832197 #2453562] INFO -- : [413/885] 2494965=test_div I, [2024-05-09T18:14:23.835815 #2453562] INFO -- : [414/885] 2494963=test_allocation I, [2024-05-09T18:14:23.840506 #2453562] INFO -- : [415/885] 2494965=test_key_error I, [2024-05-09T18:14:23.847308 #2453562] INFO -- : [416/885] 2494965=test_insns_leaf I, [2024-05-09T18:14:23.849938 #2453562] INFO -- : [417/885] 2494965=test_serialize_subclasses I, [2024-05-09T18:14:23.870572 #2453562] INFO -- : [418/885] 2494965=test_deprecated I, [2024-05-09T18:14:23.872406 #2453562] INFO -- : [419/885] 2494965=test_color_printer I, [2024-05-09T18:14:23.920395 #2453562] INFO -- : [420/885] 2494955=test_pkg_config I, [2024-05-09T18:14:23.924584 #2453562] INFO -- : [421/885] 2494951=test_cparser I, [2024-05-09T18:14:23.934850 #2453562] INFO -- : [422/885] 2494965=test_struct I, [2024-05-09T18:14:23.939492 #2453562] INFO -- : [423/885] 2494965=test_rdoc_markup_to_html_snippet I, [2024-05-09T18:14:23.982683 #2453562] INFO -- : [424/885] 2494955=magic_comment_test I, [2024-05-09T18:14:23.997453 #2453562] INFO -- : [425/885] 2494954=fuzzer_test I, [2024-05-09T18:14:24.045055 #2453562] INFO -- : [426/885] 2494955=test_rdoc_markup_include I, [2024-05-09T18:14:24.055548 #2453562] INFO -- : [427/885] 2494954=test_sexp I, [2024-05-09T18:14:24.076400 #2453562] INFO -- : [428/885] 2494954=test_variable I, [2024-05-09T18:14:24.156312 #2453562] INFO -- : [429/885] 2494955=test_win32ole_variant_outarg I, [2024-05-09T18:14:24.159319 #2453562] INFO -- : [430/885] 2494955=test_gem_source_subpath_problem I, [2024-05-09T18:14:24.171920 #2453562] INFO -- : [431/885] 2494954=test_dln I, [2024-05-09T18:14:24.173009 #2453562] INFO -- : [432/885] 2494954=json_common_interface_test I, [2024-05-09T18:14:24.187925 #2453562] INFO -- : [433/885] 2494954=json_parser_test I, [2024-05-09T18:14:24.197025 #2453562] INFO -- : [434/885] 2494965=test_nomethod_error I, [2024-05-09T18:14:24.203059 #2453562] INFO -- : [435/885] 2494965=memsize_test I, [2024-05-09T18:14:24.235794 #2453562] INFO -- : [436/885] 2494954=test_config I, [2024-05-09T18:14:24.267926 #2453562] INFO -- : [437/885] 2494965=test_profile_frames I, [2024-05-09T18:14:24.278742 #2453562] INFO -- : [438/885] 2494954=test_pstore I, [2024-05-09T18:14:24.325867 #2453562] INFO -- : [439/885] 2494954=test_cstr I, [2024-05-09T18:14:24.402476 #2453562] INFO -- : [440/885] 2494955=test_enc_str_buf_cat I, [2024-05-09T18:14:24.406036 #2453562] INFO -- : [441/885] 2494955=test_class2name I, [2024-05-09T18:14:24.413437 #2453562] INFO -- : [442/885] 2494955=test_gbk I, [2024-05-09T18:14:24.415895 #2453562] INFO -- : [443/885] 2494955=test_rdoc_parser_c I, [2024-05-09T18:14:24.438755 #2453562] INFO -- : [444/885] 2494965=test_comparable I, [2024-05-09T18:14:24.445231 #2453562] INFO -- : [445/885] 2494965=test_shapes I, [2024-05-09T18:14:24.452236 #2453562] INFO -- : [446/885] 2494965=json_fixtures_test I, [2024-05-09T18:14:24.457793 #2453562] INFO -- : [447/885] 2494958=test_io_timeout I, [2024-05-09T18:14:24.458675 #2453562] INFO -- : [448/885] 2494958=test_ansi_without_terminfo I, [2024-05-09T18:14:24.459862 #2453562] INFO -- : [449/885] 2494965=test_gem_commands_sources_command I, [2024-05-09T18:14:24.469048 #2453562] INFO -- : [450/885] 2494958=test_euc_tw I, [2024-05-09T18:14:24.472161 #2453562] INFO -- : [451/885] 2494958=test_ractor I, [2024-05-09T18:14:24.492073 #2453562] INFO -- : [452/885] 2494958=test_bmethod I, [2024-05-09T18:14:24.498951 #2453562] INFO -- : [453/885] 2494958=test_rdoc_markup_formatter I, [2024-05-09T18:14:24.513030 #2453562] INFO -- : [454/885] 2494962=test_thread_queue I, [2024-05-09T18:14:24.535510 #2453562] INFO -- : [455/885] 2494954=test_nowrite I, [2024-05-09T18:14:24.549743 #2453562] INFO -- : [456/885] 2494954=test_wait I, [2024-05-09T18:14:24.558554 #2453562] INFO -- : [457/885] 2494951=test_handle I, [2024-05-09T18:14:24.605281 #2453562] INFO -- : [458/885] 2494954=test_forwardable I, [2024-05-09T18:14:24.619579 #2453562] INFO -- : [459/885] 2494955=test_yaml I, [2024-05-09T18:14:24.632577 #2453562] INFO -- : [460/885] 2494954=test_big2str I, [2024-05-09T18:14:24.633629 #2453562] INFO -- : [461/885] 2494954=test_recorder I, [2024-05-09T18:14:24.657981 #2453562] INFO -- : [462/885] 2494965=test_gem_source_vendor I, [2024-05-09T18:14:24.660500 #2453562] INFO -- : [463/885] 2494954=test_gem_commands_owner_command I, [2024-05-09T18:14:24.674496 #2453562] INFO -- : [464/885] 2494965=test_formatter I, [2024-05-09T18:14:24.679362 #2453562] INFO -- : [465/885] 2494965=test_bash_completion I, [2024-05-09T18:14:24.685756 #2453562] INFO -- : [466/885] 2494965=test_deprecate I, [2024-05-09T18:14:24.700892 #2453562] INFO -- : [467/885] 2494958=test_rdoc_constant I, [2024-05-09T18:14:24.713614 #2453562] INFO -- : [468/885] 2494965=test_file I, [2024-05-09T18:14:24.741196 #2453562] INFO -- : [469/885] 2494965=test_rdoc_any_method I, [2024-05-09T18:14:24.747753 #2453562] INFO -- : [470/885] 2494955=test_modify_expand I, [2024-05-09T18:14:24.749983 #2453562] INFO -- : [471/885] 2494955=test_rdoc_markdown I, [2024-05-09T18:14:24.771353 #2453562] INFO -- : [472/885] 2494947=test_gem_available_set I, [2024-05-09T18:14:24.790847 #2453562] INFO -- : [473/885] 2494950=test_pathname I, [2024-05-09T18:14:24.840381 #2453562] INFO -- : [474/885] 2494958=test_init I, [2024-05-09T18:14:24.859055 #2453562] INFO -- : [475/885] 2494951=test_complexrational I, [2024-05-09T18:14:24.864800 #2453562] INFO -- : [476/885] 2494951=regexp_test I, [2024-05-09T18:14:24.866510 #2453562] INFO -- : [477/885] 2494957=test_gem_package_tar_reader I, [2024-05-09T18:14:24.872811 #2453562] INFO -- : [478/885] 2494951=test_coverage I, [2024-05-09T18:14:24.880712 #2453562] INFO -- : [479/885] 2494947=test_rdoc_encoding I, [2024-05-09T18:14:24.894553 #2453562] INFO -- : [480/885] 2494957=test_find I, [2024-05-09T18:14:24.908803 #2453562] INFO -- : [481/885] 2494947=test_ractor I, [2024-05-09T18:14:24.923138 #2453562] INFO -- : [482/885] 2494957=test_wss I, [2024-05-09T18:14:24.937157 #2453562] INFO -- : [483/885] 2494957=test_fiddle I, [2024-05-09T18:14:24.985635 #2453562] INFO -- : [484/885] 2494957=test_require I, [2024-05-09T18:14:25.012926 #2453562] INFO -- : [485/885] 2494947=test_cgi_util I, [2024-05-09T18:14:25.017688 #2453562] INFO -- : [486/885] 2494955=test_gem_commands_contents_command I, [2024-05-09T18:14:25.023320 #2453562] INFO -- : [487/885] 2494950=test_gem_ext_cmake_builder I, [2024-05-09T18:14:25.044140 #2453562] INFO -- : [488/885] 2494950=test_digest I, [2024-05-09T18:14:25.097203 #2453562] INFO -- : [489/885] 2494955=test_marshalable I, [2024-05-09T18:14:25.104062 #2453562] INFO -- : [490/885] 2494955=test_gem_resolver_index_specification I, [2024-05-09T18:14:25.111993 #2453562] INFO -- : [491/885] 2494965=test_internal_ivar I, [2024-05-09T18:14:25.121495 #2453562] INFO -- : [492/885] 2494965=test_tracepoint I, [2024-05-09T18:14:25.125815 #2453562] INFO -- : [493/885] 2494958=test_prettyprint I, [2024-05-09T18:14:25.130536 #2453562] INFO -- : [494/885] 2494955=test_rdoc_markup I, [2024-05-09T18:14:25.136579 #2453562] INFO -- : [495/885] 2494955=test_gem_commands_help_command I, [2024-05-09T18:14:25.143970 #2453562] INFO -- : [496/885] 2494958=test_duplicate I, [2024-05-09T18:14:25.144506 #2453562] INFO -- : [497/885] 2494958=test_utf32 I, [2024-05-09T18:14:25.149516 #2453562] INFO -- : [498/885] 2494958=test_basicsocket I, [2024-05-09T18:14:25.172981 #2453562] INFO -- : [499/885] 2494958=test_noarg I, [2024-05-09T18:14:25.210368 #2453562] INFO -- : [500/885] 2494947=parse_comments_test I, [2024-05-09T18:14:25.214200 #2453562] INFO -- : [501/885] 2494947=test_tempfile I, [2024-05-09T18:14:25.215609 #2453562] INFO -- : [502/885] 2494955=test_function I, [2024-05-09T18:14:25.311969 #2453562] INFO -- : [503/885] 2494965=test_queue I, [2024-05-09T18:14:25.323127 #2453562] INFO -- : [504/885] 2494965=test_irb I, [2024-05-09T18:14:25.362039 #2453562] INFO -- : [505/885] 2494958=test_asn1 I, [2024-05-09T18:14:25.380102 #2453562] INFO -- : [506/885] 2494958=test_random I, [2024-05-09T18:14:25.383374 #2453562] INFO -- : [507/885] 2494958=json_string_matching_test I, [2024-05-09T18:14:25.392177 #2453562] INFO -- : [508/885] 2494958=test_load I, [2024-05-09T18:14:25.396466 #2453562] INFO -- : [509/885] 2494958=test_rdoc_normal_class I, [2024-05-09T18:14:25.416276 #2453562] INFO -- : [510/885] 2494954=test_class I, [2024-05-09T18:14:25.438425 #2453562] INFO -- : [511/885] 2494955=test_const I, [2024-05-09T18:14:25.440669 #2453562] INFO -- : [512/885] 2494958=test_gem_installer I, [2024-05-09T18:14:25.444707 #2453562] INFO -- : [513/885] 2494955=test_yamlstore I, [2024-05-09T18:14:25.457565 #2453562] INFO -- : [514/885] 2494955=test_rdoc_parser_rd I, [2024-05-09T18:14:25.484731 #2453562] INFO -- : [515/885] 2494947=test_date_strftime I, [2024-05-09T18:14:25.490306 #2453562] INFO -- : [516/885] 2494955=test_gem_resolver_installed_specification I, [2024-05-09T18:14:25.508033 #2453562] INFO -- : [517/885] 2494955=test_scanner_events I, [2024-05-09T18:14:25.538315 #2453562] INFO -- : [518/885] 2494955=test_gem_remote_fetcher I, [2024-05-09T18:14:25.552323 #2453562] INFO -- : [519/885] 2494961=test_parse I, [2024-05-09T18:14:25.660802 #2453562] INFO -- : [520/885] 2494951=test_mdns I, [2024-05-09T18:14:25.666967 #2453562] INFO -- : [521/885] 2494951=test_path_to_class I, [2024-05-09T18:14:25.676523 #2453562] INFO -- : [522/885] 2494951=test_gem_resolver_specification I, [2024-05-09T18:14:25.678278 #2453562] INFO -- : [523/885] 2494965=test_gem_dependency I, [2024-05-09T18:14:25.702406 #2453562] INFO -- : [524/885] 2494951=test_inlinecache I, [2024-05-09T18:14:25.718871 #2453562] INFO -- : [525/885] 2494948=test_rdoc_markup_verbatim I, [2024-05-09T18:14:25.721247 #2453562] INFO -- : [526/885] 2494948=test_complex I, [2024-05-09T18:14:25.764774 #2453562] INFO -- : [527/885] 2494951=test_gem_commands_search_command I, [2024-05-09T18:14:25.771812 #2453562] INFO -- : [528/885] 2494951=test_method_cache I, [2024-05-09T18:14:25.771871 #2453562] INFO -- : [529/885] 2494951=test_gem_stub_specification I, [2024-05-09T18:14:25.795954 #2453562] INFO -- : [530/885] 2494965=test_frozen_error I, [2024-05-09T18:14:25.807571 #2453562] INFO -- : [531/885] 2494965=test_gem_ext_ext_conf_builder I, [2024-05-09T18:14:25.817631 #2453562] INFO -- : [532/885] 2494960=test_ldap I, [2024-05-09T18:14:25.821208 #2453562] INFO -- : [533/885] 2494950=test_emitter I, [2024-05-09T18:14:25.823685 #2453562] INFO -- : [534/885] 2494950=test_gem_commands_signin_command I, [2024-05-09T18:14:25.837439 #2453562] INFO -- : [535/885] 2494960=test_resource I, [2024-05-09T18:14:25.863380 #2453562] INFO -- : [536/885] 2494960=test_fileutils I, [2024-05-09T18:14:25.886360 #2453562] INFO -- : [537/885] 2494948=test_string_processing I, [2024-05-09T18:14:25.887997 #2453562] INFO -- : [538/885] 2494948=test_econv I, [2024-05-09T18:14:25.917048 #2453562] INFO -- : [539/885] 2494950=test_cesu8 I, [2024-05-09T18:14:25.921102 #2453562] INFO -- : [540/885] 2494950=test_rdoc_options I, [2024-05-09T18:14:25.946883 #2453562] INFO -- : [541/885] 2494951=test_gem_version I, [2024-05-09T18:14:26.024278 #2453562] INFO -- : [542/885] 2494951=test_too_many_dummy_encodings I, [2024-05-09T18:14:26.070154 #2453562] INFO -- : [543/885] 2494952=test_stack I, [2024-05-09T18:14:26.086617 #2453562] INFO -- : [544/885] 2494951=test_gem_commands_list_command I, [2024-05-09T18:14:26.096682 #2453562] INFO -- : [545/885] 2494951=test_reqarg I, [2024-05-09T18:14:26.117101 #2453562] INFO -- : [546/885] 2494947=test_rdoc_include I, [2024-05-09T18:14:26.139500 #2453562] INFO -- : [547/885] 2494961=test_weakmap I, [2024-05-09T18:14:26.152241 #2453562] INFO -- : [548/885] 2494950=test_workspace I, [2024-05-09T18:14:26.153397 #2453562] INFO -- : [549/885] 2494957=test_yjit I, [2024-05-09T18:14:26.162624 #2453562] INFO -- : [550/885] 2494957=test_ws I, [2024-05-09T18:14:26.165567 #2453562] INFO -- : [551/885] 2494960=test_gem_commands_environment_command I, [2024-05-09T18:14:26.166173 #2453562] INFO -- : [552/885] 2494957=test_m17n I, [2024-05-09T18:14:26.176559 #2453562] INFO -- : [553/885] 2494947=test_argf I, [2024-05-09T18:14:26.205793 #2453562] INFO -- : [554/885] 2494960=test_kill_ring I, [2024-05-09T18:14:26.239956 #2453562] INFO -- : [555/885] 2494957=test_framework I, [2024-05-09T18:14:26.257738 #2453562] INFO -- : [556/885] 2494957=test_ns_spki I, [2024-05-09T18:14:26.273179 #2453562] INFO -- : [557/885] 2494957=test_gem_resolver_dependency_request I, [2024-05-09T18:14:26.276774 #2453562] INFO -- : [558/885] 2494960=test_tree_builder I, [2024-05-09T18:14:26.279488 #2453562] INFO -- : [559/885] 2494960=test_hash I, [2024-05-09T18:14:26.281499 #2453562] INFO -- : [560/885] 2494963=test_alias_and_anchor I, [2024-05-09T18:14:26.284846 #2453562] INFO -- : [561/885] 2494957=test_postponed_job I, [2024-05-09T18:14:26.290733 #2453562] INFO -- : [562/885] 2494960=test_external_new I, [2024-05-09T18:14:26.294634 #2453562] INFO -- : [563/885] 2494960=test_gem_request_set_lockfile I, [2024-05-09T18:14:26.302413 #2453562] INFO -- : [564/885] 2494963=test_raise_exception I, [2024-05-09T18:14:26.373664 #2453562] INFO -- : [565/885] 2494950=test_protect I, [2024-05-09T18:14:26.377260 #2453562] INFO -- : [566/885] 2494950=test_win32ole_typelib I, [2024-05-09T18:14:26.385796 #2453562] INFO -- : [567/885] 2494950=test_show_source I, [2024-05-09T18:14:26.389510 #2453562] INFO -- : [568/885] 2494950=test_set I, [2024-05-09T18:14:26.407591 #2453562] INFO -- : [569/885] 2494950=test_lock_native_thread I, [2024-05-09T18:14:26.501202 #2453562] INFO -- : [570/885] 2494951=test_c_struct_entry I, [2024-05-09T18:14:26.586234 #2453562] INFO -- : [571/885] 2494960=test_gem_commands_stale_command I, [2024-05-09T18:14:26.599565 #2453562] INFO -- : [572/885] 2494960=test_have_library I, [2024-05-09T18:14:26.673388 #2453562] INFO -- : [573/885] 2494957=test_remote_fetch_error I, [2024-05-09T18:14:26.685002 #2453562] INFO -- : [574/885] 2494957=ripper_test I, [2024-05-09T18:14:26.717999 #2453562] INFO -- : [575/885] 2494950=test_objspace I, [2024-05-09T18:14:26.792671 #2453562] INFO -- : [576/885] 2494951=test_line_editor I, [2024-05-09T18:14:26.796020 #2453562] INFO -- : [577/885] 2494951=test_undef I, [2024-05-09T18:14:26.804479 #2453562] INFO -- : [578/885] 2494951=test_gem_security_trust_dir I, [2024-05-09T18:14:26.840552 #2453562] INFO -- : [579/885] 2494951=test_string_memory I, [2024-05-09T18:14:26.903823 #2453562] INFO -- : [580/885] 2494965=comments_test I, [2024-05-09T18:14:26.909784 #2453562] INFO -- : [581/885] 2494951=test_gem_requirement I, [2024-05-09T18:14:26.911592 #2453562] INFO -- : [582/885] 2494965=test_sprintf I, [2024-05-09T18:14:26.922684 #2453562] INFO -- : [583/885] 2494952=test_ftp I, [2024-05-09T18:14:26.926169 #2453562] INFO -- : [584/885] 2494952=test_euc_kr I, [2024-05-09T18:14:26.931889 #2453562] INFO -- : [585/885] 2494952=test_rdoc_context_section I, [2024-05-09T18:14:26.938244 #2453562] INFO -- : [586/885] 2494963=test_rdoc_rubygems_hook I, [2024-05-09T18:14:26.979604 #2453562] INFO -- : [587/885] 2494948=test_gem_commands_query_command I, [2024-05-09T18:14:27.013927 #2453562] INFO -- : [588/885] 2494964=test_method I, [2024-05-09T18:14:27.034358 #2453562] INFO -- : [589/885] 2494963=test_gem_impossible_dependencies_error I, [2024-05-09T18:14:27.042806 #2453562] INFO -- : [590/885] 2494963=test_pack I, [2024-05-09T18:14:27.043615 #2453562] INFO -- : [591/885] 2494951=test_array_create I, [2024-05-09T18:14:27.044478 #2453562] INFO -- : [592/885] 2494951=test_to_ruby I, [2024-05-09T18:14:27.054407 #2453562] INFO -- : [593/885] 2494951=test_pattern_key_name_check I, [2024-05-09T18:14:27.057586 #2453562] INFO -- : [594/885] 2494951=test_io I, [2024-05-09T18:14:27.115373 #2453562] INFO -- : [595/885] 2494952=test_sorted_set I, [2024-05-09T18:14:27.127070 #2453562] INFO -- : [596/885] 2494965=test_emoji I, [2024-05-09T18:14:27.167827 #2453562] INFO -- : [597/885] 2494965=test_win32ole_type_event I, [2024-05-09T18:14:27.171254 #2453562] INFO -- : [598/885] 2494965=test_hash I, [2024-05-09T18:14:27.232934 #2453562] INFO -- : [599/885] 2494963=test_ubf_async_safe I, [2024-05-09T18:14:27.245169 #2453562] INFO -- : [600/885] 2494963=test_gem_unsatisfiable_dependency_error I, [2024-05-09T18:14:27.260270 #2453562] INFO -- : [601/885] 2494963=test_win32ole_record I, [2024-05-09T18:14:27.266265 #2453562] INFO -- : [602/885] 2494963=test_cp949 I, [2024-05-09T18:14:27.271719 #2453562] INFO -- : [603/885] 2494963=test_gem_commands_uninstall_command I, [2024-05-09T18:14:27.308698 #2453562] INFO -- : [604/885] 2494951=test_condition I, [2024-05-09T18:14:27.313947 #2453562] INFO -- : [605/885] 2494951=test_foreach I, [2024-05-09T18:14:27.314641 #2453562] INFO -- : [606/885] 2494952=test_gem_source_specific_file I, [2024-05-09T18:14:27.321920 #2453562] INFO -- : [607/885] 2494951=test_console_attr I, [2024-05-09T18:14:27.323630 #2453562] INFO -- : [608/885] 2494951=test_summary I, [2024-05-09T18:14:27.336697 #2453562] INFO -- : [609/885] 2494957=test_type_completor I, [2024-05-09T18:14:27.339972 #2453562] INFO -- : [610/885] 2494957=test_io_wait I, [2024-05-09T18:14:27.385295 #2453562] INFO -- : [611/885] 2494952=test_gem_commands_exec_command I, [2024-05-09T18:14:27.390255 #2453562] INFO -- : [612/885] 2494951=test_kwargs I, [2024-05-09T18:14:27.393622 #2453562] INFO -- : [613/885] 2494951=warnings_test I, [2024-05-09T18:14:27.398101 #2453562] INFO -- : [614/885] 2494951=test_ellipsize I, [2024-05-09T18:14:27.405515 #2453562] INFO -- : [615/885] 2494951=test_date_attr I, [2024-05-09T18:14:27.416208 #2453562] INFO -- : [616/885] 2494951=test_utf16 I, [2024-05-09T18:14:27.419686 #2453562] INFO -- : [617/885] 2494951=test_autoload I, [2024-05-09T18:14:27.427359 #2453562] INFO -- : [618/885] 2494955=test_io I, [2024-05-09T18:14:27.596817 #2453562] INFO -- : [619/885] 2494948=test_unicode_escape I, [2024-05-09T18:14:27.632160 #2453562] INFO -- : [620/885] 2494960=test_sizeof I, [2024-05-09T18:14:27.657808 #2453562] INFO -- : [621/885] 2494954=test_case I, [2024-05-09T18:14:27.677212 #2453562] INFO -- : [622/885] 2494957=test_face I, [2024-05-09T18:14:27.695640 #2453562] INFO -- : [623/885] 2494954=test_rendering I, [2024-05-09T18:14:27.700778 #2453562] INFO -- : [624/885] 2494957=test_yaml_tree I, [2024-05-09T18:14:27.706129 #2453562] INFO -- : [625/885] 2494948=test_libs I, [2024-05-09T18:14:27.735023 #2453562] INFO -- : [626/885] 2494957=test_gem_commands_fetch_command I, [2024-05-09T18:14:27.748483 #2453562] INFO -- : [627/885] 2494948=test_math I, [2024-05-09T18:14:27.755053 #2453562] INFO -- : [628/885] 2494948=test_gc I, [2024-05-09T18:14:27.764211 #2453562] INFO -- : [629/885] 2494948=test_sleep I, [2024-05-09T18:14:27.825174 #2453562] INFO -- : [630/885] 2494954=test_config I, [2024-05-09T18:14:27.870773 #2453562] INFO -- : [631/885] 2494957=test_gem_config_file I, [2024-05-09T18:14:27.884590 #2453562] INFO -- : [632/885] 2494954=test_ripper I, [2024-05-09T18:14:27.993425 #2453562] INFO -- : [633/885] 2494957=test_getopts I, [2024-05-09T18:14:28.002484 #2453562] INFO -- : [634/885] 2494957=test_protocol I, [2024-05-09T18:14:28.156166 #2453562] INFO -- : [635/885] 2494963=test_gem_resolver_activation_request I, [2024-05-09T18:14:28.174454 #2453562] INFO -- : [636/885] 2494963=test_yjit_exit_locations I, [2024-05-09T18:14:28.176026 #2453562] INFO -- : [637/885] 2494963=test_etc I, [2024-05-09T18:14:28.269834 #2453562] INFO -- : [638/885] 2494963=test_system I, [2024-05-09T18:14:28.326767 #2453562] INFO -- : [639/885] 2494957=test_pkcs12 I, [2024-05-09T18:14:28.335245 #2453562] INFO -- : [640/885] 2494952=test_pkey_dh I, [2024-05-09T18:14:28.414993 #2453562] INFO -- : [641/885] 2494952=test_bigzero I, [2024-05-09T18:14:28.422779 #2453562] INFO -- : [642/885] 2494952=test_gem_package_tar_header I, [2024-05-09T18:14:28.429944 #2453562] INFO -- : [643/885] 2494954=test_gem_util I, [2024-05-09T18:14:28.451174 #2453562] INFO -- : [644/885] 2494952=test_iseq_load I, [2024-05-09T18:14:28.509090 #2453562] INFO -- : [645/885] 2494961=test_stringscanner I, [2024-05-09T18:14:28.539877 #2453562] INFO -- : [646/885] 2494961=test_files_sample I, [2024-05-09T18:14:28.612566 #2453562] INFO -- : [647/885] 2494954=test_convertible I, [2024-05-09T18:14:28.675779 #2453562] INFO -- : [648/885] 2494961=parser_test I, [2024-05-09T18:14:28.759352 #2453562] INFO -- : [649/885] 2494957=test_rdoc_alias I, [2024-05-09T18:14:28.763421 #2453562] INFO -- : [650/885] 2494957=test_yield I, [2024-05-09T18:14:28.770109 #2453562] INFO -- : [651/885] 2494961=test_fstring I, [2024-05-09T18:14:28.834418 #2453562] INFO -- : [652/885] 2494962=test_optparse I, [2024-05-09T18:14:28.919800 #2453562] INFO -- : [653/885] 2494962=test_array I, [2024-05-09T18:14:28.922863 #2453562] INFO -- : [654/885] 2494961=test_rat I, [2024-05-09T18:14:28.930965 #2453562] INFO -- : [655/885] 2494961=test_rdoc_markup_raw I, [2024-05-09T18:14:28.931906 #2453562] INFO -- : [656/885] 2494962=test_webauthn_poller I, [2024-05-09T18:14:29.104942 #2453562] INFO -- : [657/885] 2494961=test_rdoc_markup_to_html_crossref I, [2024-05-09T18:14:29.135039 #2453562] INFO -- : [658/885] 2494962=test_gem_resolver_best_set I, [2024-05-09T18:14:29.199831 #2453562] INFO -- : [659/885] 2494962=encoding_test I, [2024-05-09T18:14:29.219994 #2453562] INFO -- : [660/885] 2494956=test_typeddata I, [2024-05-09T18:14:29.325596 #2453562] INFO -- : [661/885] 2494962=locals_test I, [2024-05-09T18:14:29.505585 #2453562] INFO -- : [662/885] 2494952=test_rdoc_require I, [2024-05-09T18:14:29.525772 #2453562] INFO -- : [663/885] 2494961=test_gem_commands_install_command I, [2024-05-09T18:14:29.559155 #2453562] INFO -- : [664/885] 2494956=test_clone I, [2024-05-09T18:14:29.631534 #2453562] INFO -- : [665/885] 2494952=test_readpartial I, [2024-05-09T18:14:29.732339 #2453562] INFO -- : [666/885] 2494963=ruby_parser_test I, [2024-05-09T18:14:29.739484 #2453562] INFO -- : [667/885] 2494963=test_pack I, [2024-05-09T18:14:29.758089 #2453562] INFO -- : [668/885] 2494949=test_backtrace I, [2024-05-09T18:14:29.772372 #2453562] INFO -- : [669/885] 2494963=test_io_buffer I, [2024-05-09T18:14:29.783055 #2453562] INFO -- : [670/885] 2494962=test_gem_resolver_conflict I, [2024-05-09T18:14:29.797877 #2453562] INFO -- : [671/885] 2494962=test_rdoc_task I, [2024-05-09T18:14:29.801757 #2453562] INFO -- : [672/885] 2494956=test_rdoc_markup_indented_paragraph I, [2024-05-09T18:14:29.804447 #2453562] INFO -- : [673/885] 2494962=json_addition_test I, [2024-05-09T18:14:29.805930 #2453562] INFO -- : [674/885] 2494948=test_custom_command I, [2024-05-09T18:14:29.809340 #2453562] INFO -- : [675/885] 2494956=test_gem_dependency_resolution_error I, [2024-05-09T18:14:29.810645 #2453562] INFO -- : [676/885] 2494948=test_qsort I, [2024-05-09T18:14:29.817151 #2453562] INFO -- : [677/885] 2494948=test_rdoc_parser I, [2024-05-09T18:14:29.819627 #2453562] INFO -- : [678/885] 2494956=test_rdoc_stats I, [2024-05-09T18:14:29.825018 #2453562] INFO -- : [679/885] 2494962=test_pattern_matching I, [2024-05-09T18:14:29.833525 #2453562] INFO -- : [680/885] 2494948=test_string I, [2024-05-09T18:14:29.855180 #2453562] INFO -- : [681/885] 2494948=test_rdoc_store I, [2024-05-09T18:14:29.855755 #2453562] INFO -- : [682/885] 2494962=test_gem_request_set_lockfile_parser I, [2024-05-09T18:14:29.886360 #2453562] INFO -- : [683/885] 2494963=test_depth_first I, [2024-05-09T18:14:29.889545 #2453562] INFO -- : [684/885] 2494963=test_x509attr I, [2024-05-09T18:14:29.905029 #2453562] INFO -- : [685/885] 2494956=test_raise I, [2024-05-09T18:14:29.905963 #2453562] INFO -- : [686/885] 2494963=test_gem_validator I, [2024-05-09T18:14:29.908998 #2453562] INFO -- : [687/885] 2494956=test_require_path_check I, [2024-05-09T18:14:29.927021 #2453562] INFO -- : [688/885] 2494963=test_rdoc_markup_parser I, [2024-05-09T18:14:29.982320 #2453562] INFO -- : [689/885] 2494963=test_folderitem2_invokeverb I, [2024-05-09T18:14:29.986230 #2453562] INFO -- : [690/885] 2494963=test_fnmatch I, [2024-05-09T18:14:29.987741 #2453562] INFO -- : [691/885] 2494956=test_files_test_2 I, [2024-05-09T18:14:30.037746 #2453562] INFO -- : [692/885] 2494962=test_cgi_tag_helper I, [2024-05-09T18:14:30.038525 #2453562] INFO -- : [693/885] 2494952=test_zlib I, [2024-05-09T18:14:30.038583 #2453562] INFO -- : [694/885] 2494963=test_egrep_cpp I, [2024-05-09T18:14:30.053741 #2453562] INFO -- : [695/885] 2494962=test_ole_methods I, [2024-05-09T18:14:30.057506 #2453562] INFO -- : [696/885] 2494962=test_erb_m17n I, [2024-05-09T18:14:30.072978 #2453562] INFO -- : [697/885] 2494962=test_date_conv I, [2024-05-09T18:14:30.114206 #2453562] INFO -- : [698/885] 2494962=test_optimization I, [2024-05-09T18:14:30.214284 #2453562] INFO -- : [699/885] 2494963=test_gc_compact I, [2024-05-09T18:14:30.646078 #2453562] INFO -- : [700/885] 2494948=test_string I, [2024-05-09T18:14:30.712454 #2453562] INFO -- : [701/885] 2494946=test_proc I, [2024-05-09T18:14:31.188190 #2453562] INFO -- : [702/885] 2494949=test_gem_resolver_index_set I, [2024-05-09T18:14:31.196389 #2453562] INFO -- : [703/885] 2494958=test_gem_package_old I, [2024-05-09T18:14:31.230887 #2453562] INFO -- : [704/885] 2494949=test_time I, [2024-05-09T18:14:31.241981 #2453562] INFO -- : [705/885] 2494958=test_windows_1251 I, [2024-05-09T18:14:31.252638 #2453562] INFO -- : [706/885] 2494958=test_rdoc_rdoc I, [2024-05-09T18:14:31.344405 #2453562] INFO -- : [707/885] 2494947=test_gem_uninstaller I, [2024-05-09T18:14:31.351586 #2453562] INFO -- : [708/885] 2494958=test_svcb_https I, [2024-05-09T18:14:31.371185 #2453562] INFO -- : [709/885] 2494958=test_buffering I, [2024-05-09T18:14:31.377482 #2453562] INFO -- : [710/885] 2494958=test_gb18030 I, [2024-05-09T18:14:31.392833 #2453562] INFO -- : [711/885] 2494958=test_io_buffer I, [2024-05-09T18:14:31.471309 #2453562] INFO -- : [712/885] 2494958=test_backtrace I, [2024-05-09T18:14:31.477983 #2453562] INFO -- : [713/885] 2494958=test_defined I, [2024-05-09T18:14:31.492370 #2453562] INFO -- : [714/885] 2494949=test_key_name_check I, [2024-05-09T18:14:31.496310 #2453562] INFO -- : [715/885] 2494949=test_rdoc_i18n_text I, [2024-05-09T18:14:31.511298 #2453562] INFO -- : [716/885] 2494949=test_date_parse I, [2024-05-09T18:14:31.526066 #2453562] INFO -- : [717/885] 2494960=test_thread I, [2024-05-09T18:14:31.531453 #2453562] INFO -- : [718/885] 2494960=test_trick I, [2024-05-09T18:14:31.555788 #2453562] INFO -- : [719/885] 2494961=test_pipe I, [2024-05-09T18:14:31.641648 #2453562] INFO -- : [720/885] 2494958=test_pkey_ec I, [2024-05-09T18:14:31.673763 #2453562] INFO -- : [721/885] 2494949=test_win32ole_type I, [2024-05-09T18:14:31.688454 #2453562] INFO -- : [722/885] 2494949=test_null I, [2024-05-09T18:14:31.744466 #2453562] INFO -- : [723/885] 2494949=test_mul I, [2024-05-09T18:14:31.748955 #2453562] INFO -- : [724/885] 2494949=test_rdoc_rd_inline_parser I, [2024-05-09T18:14:31.760768 #2453562] INFO -- : [725/885] 2494958=test_rdoc_markup_to_rdoc I, [2024-05-09T18:14:31.771120 #2453562] INFO -- : [726/885] 2494961=test_default_gems I, [2024-05-09T18:14:31.791395 #2453562] INFO -- : [727/885] 2494949=test_rdoc_markup_attributes I, [2024-05-09T18:14:31.798252 #2453562] INFO -- : [728/885] 2494949=test_object_create_start I, [2024-05-09T18:14:31.802527 #2453562] INFO -- : [729/885] 2494949=test_command I, [2024-05-09T18:14:31.833913 #2453562] INFO -- : [730/885] 2494958=test_at_exit I, [2024-05-09T18:14:31.844076 #2453562] INFO -- : [731/885] 2494946=test_gem_ext_cargo_builder_unit I, [2024-05-09T18:14:31.857886 #2453562] INFO -- : [732/885] 2494961=test_date I, [2024-05-09T18:14:31.865120 #2453562] INFO -- : [733/885] 2494958=test_gem_rdoc I, [2024-05-09T18:14:31.871652 #2453562] INFO -- : [734/885] 2494961=test_enc_raise I, [2024-05-09T18:14:31.879585 #2453562] INFO -- : [735/885] 2494961=test_psych I, [2024-05-09T18:14:31.899243 #2453562] INFO -- : [736/885] 2494946=!Nothing_to_test I, [2024-05-09T18:14:31.900708 #2453562] INFO -- : [737/885] 2494946=test_rdoc_markup_paragraph I, [2024-05-09T18:14:31.913909 #2453562] INFO -- : [738/885] 2494946=test_gem_doctor I, [2024-05-09T18:14:31.915843 #2453562] INFO -- : [739/885] 2494961=test_kdf I, [2024-05-09T18:14:31.961503 #2453562] INFO -- : [740/885] 2494946=test_kernel I, [2024-05-09T18:14:32.002585 #2453562] INFO -- : [741/885] 2494958=test_eval_history I, [2024-05-09T18:14:32.016460 #2453562] INFO -- : [742/885] 2494958=dispatcher_test I, [2024-05-09T18:14:32.024017 #2453562] INFO -- : [743/885] 2494961=test_files_ext I, [2024-05-09T18:14:32.024146 #2453562] INFO -- : [744/885] 2494961=test_bug-5832 I, [2024-05-09T18:14:32.032434 #2453562] INFO -- : [745/885] 2494958=test_emitter I, [2024-05-09T18:14:32.032967 #2453562] INFO -- : [746/885] 2494961=test_gem_silent_ui I, [2024-05-09T18:14:32.041720 #2453562] INFO -- : [747/885] 2494958=test_verbose I, [2024-05-09T18:14:32.087369 #2453562] INFO -- : [748/885] 2494961=test_nil I, [2024-05-09T18:14:32.092461 #2453562] INFO -- : [749/885] 2494958=test_num2int I, [2024-05-09T18:14:32.094114 #2453562] INFO -- : [750/885] 2494961=test_rdoc_single_class I, [2024-05-09T18:14:32.100906 #2453562] INFO -- : [751/885] 2494961=test_macro I, [2024-05-09T18:14:32.109909 #2453562] INFO -- : [752/885] 2494958=test_gem_ext_configure_builder I, [2024-05-09T18:14:32.145562 #2453562] INFO -- : [753/885] 2494949=test_frozen I, [2024-05-09T18:14:32.150846 #2453562] INFO -- : [754/885] 2494949=test_pp I, [2024-05-09T18:14:32.161069 #2453562] INFO -- : [755/885] 2494965=test_zsh_completion I, [2024-05-09T18:14:32.167807 #2453562] INFO -- : [756/885] 2494958=test_exception I, [2024-05-09T18:14:32.171741 #2453562] INFO -- : [757/885] 2494965=test_iter_break I, [2024-05-09T18:14:32.172711 #2453562] INFO -- : [758/885] 2494958=test_rdoc_token_stream I, [2024-05-09T18:14:32.178529 #2453562] INFO -- : [759/885] 2494965=test_address_resolve I, [2024-05-09T18:14:32.179739 #2453562] INFO -- : [760/885] 2494958=test_config I, [2024-05-09T18:14:32.189561 #2453562] INFO -- : [761/885] 2494961=test_gem_source_list I, [2024-05-09T18:14:32.201024 #2453562] INFO -- : [762/885] 2494949=test_yaml_special_cases I, [2024-05-09T18:14:32.206918 #2453562] INFO -- : [763/885] 2494965=test_optarg I, [2024-05-09T18:14:32.219007 #2453562] INFO -- : [764/885] 2494949=test_numeric I, [2024-05-09T18:14:32.220365 #2453562] INFO -- : [765/885] 2494958=test_ifunless I, [2024-05-09T18:14:32.232371 #2453562] INFO -- : [766/885] 2494958=test_assignment I, [2024-05-09T18:14:32.261484 #2453562] INFO -- : [767/885] 2494961=test_gem_commands_lock_command I, [2024-05-09T18:14:32.304542 #2453562] INFO -- : [768/885] 2494961=test_gem_command I, [2024-05-09T18:14:32.319994 #2453562] INFO -- : [769/885] 2494949=test_bug-3571 I, [2024-05-09T18:14:32.329952 #2453562] INFO -- : [770/885] 2494957=test_key_actor_vi I, [2024-05-09T18:14:32.334500 #2453562] INFO -- : [771/885] 2494949=test_common I, [2024-05-09T18:14:32.412166 #2453562] INFO -- : [772/885] 2494965=test_gem_spec_fetcher I, [2024-05-09T18:14:32.434820 #2453562] INFO -- : [773/885] 2494964=test_hmac I, [2024-05-09T18:14:32.446450 #2453562] INFO -- : [774/885] 2494957=test_rdoc_markup_to_tt_only I, [2024-05-09T18:14:32.452890 #2453562] INFO -- : [775/885] 2494964=test_rdoc_tom_doc I, [2024-05-09T18:14:32.455589 #2453562] INFO -- : [776/885] 2494961=test_arity I, [2024-05-09T18:14:32.465421 #2453562] INFO -- : [777/885] 2494961=test_gem_ext_rake_builder I, [2024-05-09T18:14:32.469646 #2453562] INFO -- : [778/885] 2494964=test_logdevice I, [2024-05-09T18:14:32.497049 #2453562] INFO -- : [779/885] 2494957=test_err_in_callback I, [2024-05-09T18:14:32.512486 #2453562] INFO -- : [780/885] 2494957=test_gem_resolver_lock_specification I, [2024-05-09T18:14:32.535263 #2453562] INFO -- : [781/885] 2494951=test_gc I, [2024-05-09T18:14:32.555240 #2453562] INFO -- : [782/885] 2494957=test_x509cert I, [2024-05-09T18:14:32.610105 #2453562] INFO -- : [783/885] 2494949=test_last_thread I, [2024-05-09T18:14:32.637284 #2453562] INFO -- : [784/885] 2494946=test_process I, [2024-05-09T18:14:32.701116 #2453562] INFO -- : [785/885] 2494947=test_pack I, [2024-05-09T18:14:32.745556 #2453562] INFO -- : [786/885] 2494965=test_gem_security_policy I, [2024-05-09T18:14:32.949900 #2453562] INFO -- : [787/885] 2494957=test_gem_source_local I, [2024-05-09T18:14:32.998442 #2453562] INFO -- : [788/885] 2494947=test_uncorrectable_name_check I, [2024-05-09T18:14:33.025250 #2453562] INFO -- : [789/885] 2494947=newline_test I, [2024-05-09T18:14:33.142173 #2453562] INFO -- : [790/885] 2494947=test_hash_create I, [2024-05-09T18:14:33.163459 #2453562] INFO -- : [791/885] 2494947=test_stringchar I, [2024-05-09T18:14:33.178510 #2453562] INFO -- : [792/885] 2494965=test_passing_block I, [2024-05-09T18:14:33.200276 #2453562] INFO -- : [793/885] 2494965=test_thread_fd_close I, [2024-05-09T18:14:33.224375 #2453562] INFO -- : [794/885] 2494965=test_securerandom I, [2024-05-09T18:14:33.268462 #2453562] INFO -- : [795/885] 2494965=test_rdoc_markdown_test I, [2024-05-09T18:14:33.308516 #2453562] INFO -- : [796/885] 2494957=test_rdoc_normal_module I, [2024-05-09T18:14:33.308818 #2453562] INFO -- : [797/885] 2494947=test_c_union_entity I, [2024-05-09T18:14:33.318111 #2453562] INFO -- : [798/885] 2494961=test_logperiod I, [2024-05-09T18:14:33.328093 #2453562] INFO -- : [799/885] 2494961=test_singleton I, [2024-05-09T18:14:33.336640 #2453562] INFO -- : [800/885] 2494961=test_flush I, [2024-05-09T18:14:33.374582 #2453562] INFO -- : [801/885] 2494961=test_io_console I, [2024-05-09T18:14:33.400488 #2453562] INFO -- : [802/885] 2494947=test_switch_hitter I, [2024-05-09T18:14:33.401042 #2453562] INFO -- : [803/885] 2494957=test_iso_8859 I, [2024-05-09T18:14:33.405054 #2453562] INFO -- : [804/885] 2494947=test_tcp I, [2024-05-09T18:14:33.428192 #2453562] INFO -- : [805/885] 2494957=test_rdoc_text I, [2024-05-09T18:14:33.478910 #2453562] INFO -- : [806/885] 2494957=test_gem_safe_yaml I, [2024-05-09T18:14:33.489766 #2453562] INFO -- : [807/885] 2494957=test_syntax I, [2024-05-09T18:14:33.582769 #2453562] INFO -- : [808/885] 2494947=test_date_new I, [2024-05-09T18:14:33.605990 #2453562] INFO -- : [809/885] 2494947=index_write_test I, [2024-05-09T18:14:33.611583 #2453562] INFO -- : [810/885] 2494947=test_data I, [2024-05-09T18:14:33.629564 #2453562] INFO -- : [811/885] 2494947=test_require I, [2024-05-09T18:14:33.638215 #2453562] INFO -- : [812/885] 2494947=test_rdoc_markup_to_joined_paragraph I, [2024-05-09T18:14:33.645979 #2453562] INFO -- : [813/885] 2494947=test_date_time I, [2024-05-09T18:14:33.651954 #2453562] INFO -- : [814/885] 2494947=test_open-uri I, [2024-05-09T18:14:33.707052 #2453562] INFO -- : [815/885] 2494949=test_httpresponse I, [2024-05-09T18:14:33.735859 #2453562] INFO -- : [816/885] 2494949=test_rdoc_parser_ruby I, [2024-05-09T18:14:33.805975 #2453562] INFO -- : [817/885] 2494963=test_rdoc_context I, [2024-05-09T18:14:33.817779 #2453562] INFO -- : [818/885] 2494964=test_stream I, [2024-05-09T18:14:33.829994 #2453562] INFO -- : [819/885] 2494964=test_nil2vtempty I, [2024-05-09T18:14:33.833239 #2453562] INFO -- : [820/885] 2494964=test_gem_commands_dependency_command I, [2024-05-09T18:14:33.918120 #2453562] INFO -- : [821/885] 2494964=test_safe_load I, [2024-05-09T18:14:33.953697 #2453562] INFO -- : [822/885] 2494964=test_gem_resolver_composed_set I, [2024-05-09T18:14:33.970400 #2453562] INFO -- : [823/885] 2494964=test_gem_resolver I, [2024-05-09T18:14:34.234393 #2453562] INFO -- : [824/885] 2494964=test_name_error I, [2024-05-09T18:14:34.246711 #2453562] INFO -- : [825/885] 2494947=test_rdoc_markup_attribute_manager I, [2024-05-09T18:14:34.282561 #2453562] INFO -- : [826/885] 2494947=test_gem_commands_which_command I, [2024-05-09T18:14:34.327381 #2453562] INFO -- : [827/885] 2494947=test_shift_jis I, [2024-05-09T18:14:34.335739 #2453562] INFO -- : [828/885] 2494947=test_http I, [2024-05-09T18:14:34.342564 #2453562] INFO -- : [829/885] 2494947=test_enumerator I, [2024-05-09T18:14:34.343873 #2453562] INFO -- : [830/885] 2494964=test_flags I, [2024-05-09T18:14:34.543572 #2453562] INFO -- : [831/885] 2494952=test_inadvertent_creation I, [2024-05-09T18:14:34.655446 #2453562] INFO -- : [832/885] 2494963=test_gem_commands_specification_command I, [2024-05-09T18:14:34.665601 #2453562] INFO -- : [833/885] 2494952=test_generic I, [2024-05-09T18:14:34.689690 #2453562] INFO -- : [834/885] 2494952=test_win32ole I, [2024-05-09T18:14:34.697814 #2453562] INFO -- : [835/885] 2494952=test_scan_args I, [2024-05-09T18:14:34.708298 #2453562] INFO -- : [836/885] 2494952=test_enumerator_kw I, [2024-05-09T18:14:34.712492 #2453562] INFO -- : [837/885] 2494952=test_settracefunc I, [2024-05-09T18:14:34.729632 #2453562] INFO -- : [838/885] 2494949=test_gem_text I, [2024-05-09T18:14:34.804406 #2453562] INFO -- : [839/885] 2494949=test_gem_ext_cargo_builder_link_flag_converter I, [2024-05-09T18:14:34.825659 #2453562] INFO -- : [840/885] 2494958=test_gem_commands_mirror I, [2024-05-09T18:14:34.839260 #2453562] INFO -- : [841/885] 2494958=test_method_cache I, [2024-05-09T18:14:34.843868 #2453562] INFO -- : [842/885] 2494963=test_gem_request I, [2024-05-09T18:14:34.847031 #2453562] INFO -- : [843/885] 2494958=test_sprintf_comb I, [2024-05-09T18:14:34.911857 #2453562] INFO -- : [844/885] 2494956=test_exception I, [2024-05-09T18:14:34.911953 #2453562] INFO -- : [845/885] 2494949=test_bug_reporter I, [2024-05-09T18:14:35.075193 #2453562] INFO -- : [846/885] 2494960=test_rand I, [2024-05-09T18:14:35.085221 #2453562] INFO -- : [847/885] 2494954=test_gem_package_tar_reader_entry I, [2024-05-09T18:14:35.100336 #2453562] INFO -- : [848/885] 2494965=test_gem_name_tuple I, [2024-05-09T18:14:35.132169 #2453562] INFO -- : [849/885] 2494965=test_rdoc_cross_reference I, [2024-05-09T18:14:35.171819 #2453562] INFO -- : [850/885] 2494958=test_scalar I, [2024-05-09T18:14:35.184134 #2453562] INFO -- : [851/885] 2494963=test_gem_dependency_installer I, [2024-05-09T18:14:35.191703 #2453562] INFO -- : [852/885] 2494958=test_gem_commands_info_command I, [2024-05-09T18:14:35.229343 #2453562] INFO -- : [853/885] 2494958=test_case_options I, [2024-05-09T18:14:35.233919 #2453562] INFO -- : [854/885] 2494958=test_store I, [2024-05-09T18:14:35.275378 #2453562] INFO -- : [855/885] 2494954=test_literal I, [2024-05-09T18:14:35.414346 #2453562] INFO -- : [856/885] 2494949=test_str2big I, [2024-05-09T18:14:35.421438 #2453562] INFO -- : [857/885] 2494949=test_dot_dot I, [2024-05-09T18:14:35.432742 #2453562] INFO -- : [858/885] 2494949=test_c_struct_builder I, [2024-05-09T18:14:35.529811 #2453562] INFO -- : [859/885] 2494958=test_rdoc_markup_to_table_of_contents I, [2024-05-09T18:14:35.561591 #2453562] INFO -- : [860/885] 2494958=test_thread I, [2024-05-09T18:14:35.603218 #2453562] INFO -- : [861/885] 2494960=test_socket I, [2024-05-09T18:14:35.633620 #2453562] INFO -- : [862/885] 2494949=test_objectspace I, [2024-05-09T18:14:35.721366 #2453562] INFO -- : [863/885] 2494964=test_ractor I, [2024-05-09T18:14:35.744572 #2453562] INFO -- : [864/885] 2494964=test_severity I, [2024-05-09T18:14:35.753983 #2453562] INFO -- : [865/885] 2494964=test_require_lib I, [2024-05-09T18:14:35.794925 #2453562] INFO -- : [866/885] 2494965=test_gem_install_update_options I, [2024-05-09T18:14:35.830497 #2453562] INFO -- : [867/885] 2494958=parse_test I, [2024-05-09T18:14:35.957121 #2453562] INFO -- : [868/885] 2494965=test_gem_stream_ui I, [2024-05-09T18:14:36.020907 #2453562] INFO -- : [869/885] 2494952=test_extlibs I, [2024-05-09T18:14:36.164013 #2453562] INFO -- : [870/885] 2494965=test_rdoc_generator_ri I, [2024-05-09T18:14:36.181821 #2453562] INFO -- : [871/885] 2494965=test_memory_view I, [2024-05-09T18:14:36.205386 #2453562] INFO -- : [872/885] 2494954=test_m17n_comb I, [2024-05-09T18:14:36.232556 #2453562] INFO -- : [873/885] 2494961=test_ractor I, [2024-05-09T18:14:36.349753 #2453562] INFO -- : [874/885] 2494961=test_rdoc_generator_pot_po I, [2024-05-09T18:14:36.356827 #2453562] INFO -- : [875/885] 2494961=test_ansi_with_terminfo I, [2024-05-09T18:14:36.361469 #2453562] INFO -- : [876/885] 2494961=test_json_tree I, [2024-05-09T18:14:36.370167 #2453562] INFO -- : [877/885] 2494961=test_rdoc_markup_to_markdown I, [2024-05-09T18:14:36.431901 #2453562] INFO -- : [878/885] 2494961=test_case I, [2024-05-09T18:14:36.438022 #2453562] INFO -- : [879/885] 2494961=test_pkey I, [2024-05-09T18:14:36.509497 #2453562] INFO -- : [880/885] 2494961=test_parser_events I, [2024-05-09T18:14:36.513907 #2453562] INFO -- : [881/885] 2494965=test_reline I, [2024-05-09T18:14:36.574136 #2453562] INFO -- : [882/885] 2494961=test_cclass I, [2024-05-09T18:14:36.684829 #2453562] INFO -- : [883/885] 2494949=test_gem_request_connection_pools I, [2024-05-09T18:14:36.702660 #2453562] INFO -- : [884/885] 2494965=test_gem_version_option I, [2024-05-09T18:14:36.722585 #2453562] INFO -- : [885/885] 2494961=test_grapheme_breaks I, [2024-05-09T18:14:51.465644 #2453562] INFO -- : Finished tests in 36.566024s, 721.1339 tests/s, 255811.4863 assertions/s. E, [2024-05-09T18:14:51.465859 #2453562] ERROR -- : Children under /tmp/rubytest.xy0fh6: E, [2024-05-09T18:14:51.465899 #2453562] ERROR -- : * drwx------ 4 80 2024-05-09 18:14:21 +0000 gem_rebuild20240509-2494948-99cl2p/ E, [2024-05-09T18:14:51.465907 #2453562] ERROR -- : * drwxrwxr-x 2 60 2024-05-09 18:14:21 +0000 new/ E, [2024-05-09T18:14:51.465912 #2453562] ERROR -- : * -rw-rw-r-- 1 4096 2024-05-09 18:14:21 +0000 rebuild_test_gem-1.0.0.gem E, [2024-05-09T18:14:51.465916 #2453562] ERROR -- : * drwxrwxr-x 2 60 2024-05-09 18:14:21 +0000 old/ E, [2024-05-09T18:14:51.465921 #2453562] ERROR -- : * -rw-rw-r-- 1 4096 2024-05-09 18:14:21 +0000 rebuild_test_gem-1.0.0.gem I, [2024-05-09T18:14:51.467099 #2453562] INFO -- : 26369 tests, 9354009 assertions, 0 failures, 0 errors, 304 skips I, [2024-05-09T18:14:51.467108 #2453562] INFO -- : I, [2024-05-09T18:14:51.467115 #2453562] INFO -- : ruby -v: ruby 3.4.0dev (2024-05-09T13:38:43Z master 444030fc61) [x86_64-linux] I, [2024-05-09T18:14:51.469419 #2453562] INFO -- : $$$[end] "make yes-test-all TESTOPTS='--stderr-on-failure' TESTS='-j20'" exit with 0. I, [2024-05-09T18:14:51.469573 #2453562] INFO -- : $$$[beg] make yes-test-rubyspec MSPECOPT='--error-output stderr --debug -j' TESTS='-j20' I, [2024-05-09T18:14:51.556558 #2453562] INFO -- : BASERUBY = /usr/bin/ruby --disable=gems I, [2024-05-09T18:14:51.556614 #2453562] INFO -- : CC = gcc I, [2024-05-09T18:14:51.556620 #2453562] INFO -- : LD = ld I, [2024-05-09T18:14:51.556625 #2453562] INFO -- : LDSHARED = gcc -shared I, [2024-05-09T18:14:51.556629 #2453562] INFO -- : CFLAGS = -O3 -fno-fast-math -ggdb3 -Wall -Wextra -Wdeprecated-declarations -Wdiv-by-zero -Wduplicated-cond -Wimplicit-function-declaration -Wimplicit-int -Wpointer-arith -Wwrite-strings -Wold-style-definition -Wimplicit-fallthrough=0 -Wmissing-noreturn -Wno-cast-function-type -Wno-constant-logical-operand -Wno-long-long -Wno-missing-field-initializers -Wno-overlength-strings -Wno-packed-bitfield-compat -Wno-parentheses-equality -Wno-self-assign -Wno-tautological-compare -Wno-unused-parameter -Wno-unused-value -Wsuggest-attribute=format -Wsuggest-attribute=noreturn -Wunused-variable -Wmisleading-indentation -Wundef -fPIC I, [2024-05-09T18:14:51.556634 #2453562] INFO -- : XCFLAGS = -U_FORTIFY_SOURCE -D_FORTIFY_SOURCE=2 -fstack-protector-strong -fno-strict-overflow -fvisibility=hidden -fexcess-precision=standard -DRUBY_EXPORT -I. -I.ext/include/x86_64-linux -I/tmp/ruby/src/trunk/include -I/tmp/ruby/src/trunk -I/tmp/ruby/src/trunk/prism -I/tmp/ruby/src/trunk/enc/unicode/15.0.0 I, [2024-05-09T18:14:51.556638 #2453562] INFO -- : CPPFLAGS = I, [2024-05-09T18:14:51.556642 #2453562] INFO -- : DLDFLAGS = -Wl,--compress-debug-sections=zlib -Wl,-soname,libruby.so.3.4 -fstack-protector-strong I, [2024-05-09T18:14:51.556646 #2453562] INFO -- : SOLIBS = -lz -lrt -lrt -lgmp -ldl -lcrypt -lm -lpthread I, [2024-05-09T18:14:51.556650 #2453562] INFO -- : LANG = en_US.UTF-8 I, [2024-05-09T18:14:51.556653 #2453562] INFO -- : LC_ALL = I, [2024-05-09T18:14:51.556657 #2453562] INFO -- : LC_CTYPE = I, [2024-05-09T18:14:51.556661 #2453562] INFO -- : MFLAGS = I, [2024-05-09T18:14:51.556665 #2453562] INFO -- : RUSTC = no I, [2024-05-09T18:14:51.556669 #2453562] INFO -- : YJIT_RUSTC_ARGS = --crate-name=yjit --crate-type=staticlib --edition=2021 -g -C lto=thin -C opt-level=3 -C overflow-checks=on '--out-dir=/tmp/ruby/build/trunk/yjit/target/release/' /tmp/ruby/src/trunk/yjit/src/lib.rs I, [2024-05-09T18:14:51.557268 #2453562] INFO -- : gcc (Ubuntu 11.4.0-1ubuntu1~22.04) 11.4.0 I, [2024-05-09T18:14:51.557290 #2453562] INFO -- : Copyright (C) 2021 Free Software Foundation, Inc. I, [2024-05-09T18:14:51.557296 #2453562] INFO -- : This is free software; see the source for copying conditions. There is NO I, [2024-05-09T18:14:51.557301 #2453562] INFO -- : warranty; not even for MERCHANTABILITY or FITNESS FOR A PARTICULAR PURPOSE. I, [2024-05-09T18:14:51.557305 #2453562] INFO -- : I, [2024-05-09T18:14:51.559049 #2453562] INFO -- : generating enc.mk I, [2024-05-09T18:14:51.677525 #2453562] INFO -- : generating encdb.h I, [2024-05-09T18:14:51.701358 #2453562] INFO -- : encdb.h unchanged I, [2024-05-09T18:14:51.702437 #2453562] INFO -- : making enc I, [2024-05-09T18:14:51.719643 #2453562] INFO -- : make[1]: Entering directory '/tmp/ruby/build/trunk' I, [2024-05-09T18:14:51.719702 #2453562] INFO -- : make[1]: Nothing to be done for 'enc'. I, [2024-05-09T18:14:51.719716 #2453562] INFO -- : make[1]: Leaving directory '/tmp/ruby/build/trunk' I, [2024-05-09T18:14:51.720430 #2453562] INFO -- : making srcs under enc I, [2024-05-09T18:14:51.750030 #2453562] INFO -- : make[1]: Entering directory '/tmp/ruby/build/trunk' I, [2024-05-09T18:14:51.750087 #2453562] INFO -- : make[1]: Nothing to be done for 'srcs'. I, [2024-05-09T18:14:51.750101 #2453562] INFO -- : make[1]: Leaving directory '/tmp/ruby/build/trunk' I, [2024-05-09T18:14:51.750961 #2453562] INFO -- : generating transdb.h I, [2024-05-09T18:14:51.845978 #2453562] INFO -- : transdb.h unchanged I, [2024-05-09T18:14:51.847351 #2453562] INFO -- : making trans I, [2024-05-09T18:14:51.882181 #2453562] INFO -- : make[1]: Entering directory '/tmp/ruby/build/trunk' I, [2024-05-09T18:14:51.882245 #2453562] INFO -- : make[1]: Nothing to be done for 'trans'. I, [2024-05-09T18:14:51.882261 #2453562] INFO -- : make[1]: Leaving directory '/tmp/ruby/build/trunk' I, [2024-05-09T18:14:51.882899 #2453562] INFO -- : making encs I, [2024-05-09T18:14:51.920517 #2453562] INFO -- : make[1]: Entering directory '/tmp/ruby/build/trunk' I, [2024-05-09T18:14:51.920580 #2453562] INFO -- : make[1]: Nothing to be done for 'encs'. I, [2024-05-09T18:14:51.920594 #2453562] INFO -- : make[1]: Leaving directory '/tmp/ruby/build/trunk' I, [2024-05-09T18:14:51.922244 #2453562] INFO -- : generating makefiles ext/configure-ext.mk I, [2024-05-09T18:14:51.949425 #2453562] INFO -- : ext/configure-ext.mk updated I, [2024-05-09T18:14:51.951835 #2453562] INFO -- : make[1]: Entering directory '/tmp/ruby/build/trunk' I, [2024-05-09T18:14:53.347715 #2453562] INFO -- : make[1]: Leaving directory '/tmp/ruby/build/trunk' I, [2024-05-09T18:14:53.348350 #2453562] INFO -- : generating makefile exts.mk I, [2024-05-09T18:14:53.385292 #2453562] INFO -- : exts.mk unchanged I, [2024-05-09T18:14:53.389696 #2453562] INFO -- : make[1]: Entering directory '/tmp/ruby/build/trunk' I, [2024-05-09T18:14:53.600976 #2453562] INFO -- : make[2]: Entering directory '/tmp/ruby/build/trunk/ext/coverage' I, [2024-05-09T18:14:53.603921 #2453562] INFO -- : make[2]: Leaving directory '/tmp/ruby/build/trunk/ext/coverage' I, [2024-05-09T18:14:53.607732 #2453562] INFO -- : make[2]: Entering directory '/tmp/ruby/build/trunk/ext/date' I, [2024-05-09T18:14:53.610896 #2453562] INFO -- : make[2]: Leaving directory '/tmp/ruby/build/trunk/ext/date' I, [2024-05-09T18:14:53.613213 #2453562] INFO -- : make[2]: Entering directory '/tmp/ruby/build/trunk/ext/digest' I, [2024-05-09T18:14:53.618674 #2453562] INFO -- : make[2]: Leaving directory '/tmp/ruby/build/trunk/ext/digest' I, [2024-05-09T18:14:53.634460 #2453562] INFO -- : make[2]: Entering directory '/tmp/ruby/build/trunk/ext/digest/sha2' I, [2024-05-09T18:14:53.637438 #2453562] INFO -- : make[2]: Leaving directory '/tmp/ruby/build/trunk/ext/digest/sha2' I, [2024-05-09T18:14:53.650117 #2453562] INFO -- : make[2]: Entering directory '/tmp/ruby/build/trunk/ext/fiddle' I, [2024-05-09T18:14:53.656499 #2453562] INFO -- : make[2]: Leaving directory '/tmp/ruby/build/trunk/ext/fiddle' I, [2024-05-09T18:14:53.659342 #2453562] INFO -- : make[2]: Entering directory '/tmp/ruby/build/trunk/ext/io/console' I, [2024-05-09T18:14:53.661958 #2453562] INFO -- : make[2]: Leaving directory '/tmp/ruby/build/trunk/ext/io/console' I, [2024-05-09T18:14:53.669584 #2453562] INFO -- : make[2]: Entering directory '/tmp/ruby/build/trunk/ext/json' I, [2024-05-09T18:14:53.675859 #2453562] INFO -- : make[2]: Leaving directory '/tmp/ruby/build/trunk/ext/json' I, [2024-05-09T18:14:53.685064 #2453562] INFO -- : make[2]: Entering directory '/tmp/ruby/build/trunk/ext/monitor' I, [2024-05-09T18:14:53.687558 #2453562] INFO -- : make[2]: Leaving directory '/tmp/ruby/build/trunk/ext/monitor' I, [2024-05-09T18:14:53.691800 #2453562] INFO -- : make[2]: Entering directory '/tmp/ruby/build/trunk/ext/objspace' I, [2024-05-09T18:14:53.695514 #2453562] INFO -- : make[2]: Leaving directory '/tmp/ruby/build/trunk/ext/objspace' I, [2024-05-09T18:14:53.707444 #2453562] INFO -- : make[2]: Entering directory '/tmp/ruby/build/trunk/ext/openssl' I, [2024-05-09T18:14:53.720582 #2453562] INFO -- : make[2]: Leaving directory '/tmp/ruby/build/trunk/ext/openssl' I, [2024-05-09T18:14:53.723448 #2453562] INFO -- : make[2]: Entering directory '/tmp/ruby/build/trunk/ext/pathname' I, [2024-05-09T18:14:53.726059 #2453562] INFO -- : make[2]: Leaving directory '/tmp/ruby/build/trunk/ext/pathname' I, [2024-05-09T18:14:53.730285 #2453562] INFO -- : make[2]: Entering directory '/tmp/ruby/build/trunk/ext/psych' I, [2024-05-09T18:14:53.745234 #2453562] INFO -- : make[2]: Leaving directory '/tmp/ruby/build/trunk/ext/psych' I, [2024-05-09T18:14:53.748262 #2453562] INFO -- : make[2]: Entering directory '/tmp/ruby/build/trunk/ext/pty' I, [2024-05-09T18:14:53.750759 #2453562] INFO -- : make[2]: Leaving directory '/tmp/ruby/build/trunk/ext/pty' I, [2024-05-09T18:14:53.760243 #2453562] INFO -- : make[2]: Entering directory '/tmp/ruby/build/trunk/ext/ripper' I, [2024-05-09T18:14:53.765161 #2453562] INFO -- : make[2]: Leaving directory '/tmp/ruby/build/trunk/ext/ripper' I, [2024-05-09T18:14:53.766722 #2453562] INFO -- : make[2]: Entering directory '/tmp/ruby/build/trunk/ext/rubyvm' I, [2024-05-09T18:14:53.768734 #2453562] INFO -- : make[2]: Leaving directory '/tmp/ruby/build/trunk/ext/rubyvm' I, [2024-05-09T18:14:53.776538 #2453562] INFO -- : make[2]: Entering directory '/tmp/ruby/build/trunk/ext/socket' I, [2024-05-09T18:14:53.782906 #2453562] INFO -- : make[2]: Leaving directory '/tmp/ruby/build/trunk/ext/socket' I, [2024-05-09T18:14:53.793828 #2453562] INFO -- : make[2]: Entering directory '/tmp/ruby/build/trunk/.bundle/gems/bigdecimal-3.1.7/ext/bigdecimal' I, [2024-05-09T18:14:53.816189 #2453562] INFO -- : make[2]: Leaving directory '/tmp/ruby/build/trunk/.bundle/gems/bigdecimal-3.1.7/ext/bigdecimal' I, [2024-05-09T18:14:53.818306 #2453562] INFO -- : make[2]: Entering directory '/tmp/ruby/build/trunk/.bundle/gems/bigdecimal-3.1.8/ext/bigdecimal' I, [2024-05-09T18:14:53.841236 #2453562] INFO -- : make[2]: Leaving directory '/tmp/ruby/build/trunk/.bundle/gems/bigdecimal-3.1.8/ext/bigdecimal' I, [2024-05-09T18:14:53.843207 #2453562] INFO -- : make[2]: Entering directory '/tmp/ruby/build/trunk/.bundle/gems/debug-1.9.2/ext/debug' I, [2024-05-09T18:14:53.865092 #2453562] INFO -- : make[2]: Leaving directory '/tmp/ruby/build/trunk/.bundle/gems/debug-1.9.2/ext/debug' I, [2024-05-09T18:14:53.867036 #2453562] INFO -- : make[2]: Entering directory '/tmp/ruby/build/trunk/.bundle/gems/nkf-0.2.0/ext/nkf' I, [2024-05-09T18:14:53.889092 #2453562] INFO -- : make[2]: Leaving directory '/tmp/ruby/build/trunk/.bundle/gems/nkf-0.2.0/ext/nkf' I, [2024-05-09T18:14:53.891075 #2453562] INFO -- : make[2]: Entering directory '/tmp/ruby/build/trunk/.bundle/gems/racc-1.7.3/ext/racc/cparse' I, [2024-05-09T18:14:53.913505 #2453562] INFO -- : make[2]: Leaving directory '/tmp/ruby/build/trunk/.bundle/gems/racc-1.7.3/ext/racc/cparse' I, [2024-05-09T18:14:53.915790 #2453562] INFO -- : make[2]: Entering directory '/tmp/ruby/build/trunk/.bundle/gems/rbs-3.4.4/ext/rbs_extension' I, [2024-05-09T18:14:53.937069 #2453562] INFO -- : make[2]: Leaving directory '/tmp/ruby/build/trunk/.bundle/gems/rbs-3.4.4/ext/rbs_extension' I, [2024-05-09T18:14:53.938914 #2453562] INFO -- : make[2]: Entering directory '/tmp/ruby/build/trunk/.bundle/gems/syslog-0.1.2/ext/syslog' I, [2024-05-09T18:14:53.960946 #2453562] INFO -- : make[2]: Leaving directory '/tmp/ruby/build/trunk/.bundle/gems/syslog-0.1.2/ext/syslog' I, [2024-05-09T18:14:53.984188 #2453562] INFO -- : make[2]: Entering directory '/tmp/ruby/build/trunk' I, [2024-05-09T18:14:54.048331 #2453562] INFO -- : make[2]: 'ruby' is up to date. I, [2024-05-09T18:14:54.048376 #2453562] INFO -- : make[2]: Leaving directory '/tmp/ruby/build/trunk' I, [2024-05-09T18:14:54.048723 #2453562] INFO -- : make[1]: Leaving directory '/tmp/ruby/build/trunk' I, [2024-05-09T18:14:54.052665 #2453562] INFO -- : make[1]: Entering directory '/tmp/ruby/build/trunk' I, [2024-05-09T18:14:54.052688 #2453562] INFO -- : make[1]: Nothing to be done for 'note'. I, [2024-05-09T18:14:54.052694 #2453562] INFO -- : make[1]: Leaving directory '/tmp/ruby/build/trunk' E, [2024-05-09T18:14:54.110191 #2453562] ERROR -- : $ /tmp/ruby/build/trunk/miniruby -I/tmp/ruby/src/trunk/lib /tmp/ruby/src/trunk/tool/runruby.rb --archdir=/tmp/ruby/build/trunk --extout=.ext -- /tmp/ruby/src/trunk/spec/mspec/bin/mspec-run -B /tmp/ruby/src/trunk/spec/default.mspec --error-output stderr --debug -fy -o /tmp/rubytest.mosugb/1-mspec-multi-0 E, [2024-05-09T18:14:54.110405 #2453562] ERROR -- : $ /tmp/ruby/build/trunk/miniruby -I/tmp/ruby/src/trunk/lib /tmp/ruby/src/trunk/tool/runruby.rb --archdir=/tmp/ruby/build/trunk --extout=.ext -- /tmp/ruby/src/trunk/spec/mspec/bin/mspec-run -B /tmp/ruby/src/trunk/spec/default.mspec --error-output stderr --debug -fy -o /tmp/rubytest.mosugb/2-mspec-multi-1 E, [2024-05-09T18:14:54.110673 #2453562] ERROR -- : $ /tmp/ruby/build/trunk/miniruby -I/tmp/ruby/src/trunk/lib /tmp/ruby/src/trunk/tool/runruby.rb --archdir=/tmp/ruby/build/trunk --extout=.ext -- /tmp/ruby/src/trunk/spec/mspec/bin/mspec-run -B /tmp/ruby/src/trunk/spec/default.mspec --error-output stderr --debug -fy -o /tmp/rubytest.mosugb/3-mspec-multi-2 E, [2024-05-09T18:14:54.110931 #2453562] ERROR -- : $ /tmp/ruby/build/trunk/miniruby -I/tmp/ruby/src/trunk/lib /tmp/ruby/src/trunk/tool/runruby.rb --archdir=/tmp/ruby/build/trunk --extout=.ext -- /tmp/ruby/src/trunk/spec/mspec/bin/mspec-run -B /tmp/ruby/src/trunk/spec/default.mspec --error-output stderr --debug -fy -o /tmp/rubytest.mosugb/4-mspec-multi-3 E, [2024-05-09T18:14:54.111055 #2453562] ERROR -- : $ /tmp/ruby/build/trunk/miniruby -I/tmp/ruby/src/trunk/lib /tmp/ruby/src/trunk/tool/runruby.rb --archdir=/tmp/ruby/build/trunk --extout=.ext -- /tmp/ruby/src/trunk/spec/mspec/bin/mspec-run -B /tmp/ruby/src/trunk/spec/default.mspec --error-output stderr --debug -fy -o /tmp/rubytest.mosugb/5-mspec-multi-4 E, [2024-05-09T18:14:54.111365 #2453562] ERROR -- : $ /tmp/ruby/build/trunk/miniruby -I/tmp/ruby/src/trunk/lib /tmp/ruby/src/trunk/tool/runruby.rb --archdir=/tmp/ruby/build/trunk --extout=.ext -- /tmp/ruby/src/trunk/spec/mspec/bin/mspec-run -B /tmp/ruby/src/trunk/spec/default.mspec --error-output stderr --debug -fy -o /tmp/rubytest.mosugb/6-mspec-multi-5 E, [2024-05-09T18:14:54.111576 #2453562] ERROR -- : $ /tmp/ruby/build/trunk/miniruby -I/tmp/ruby/src/trunk/lib /tmp/ruby/src/trunk/tool/runruby.rb --archdir=/tmp/ruby/build/trunk --extout=.ext -- /tmp/ruby/src/trunk/spec/mspec/bin/mspec-run -B /tmp/ruby/src/trunk/spec/default.mspec --error-output stderr --debug -fy -o /tmp/rubytest.mosugb/7-mspec-multi-6 E, [2024-05-09T18:14:54.111774 #2453562] ERROR -- : $ /tmp/ruby/build/trunk/miniruby -I/tmp/ruby/src/trunk/lib /tmp/ruby/src/trunk/tool/runruby.rb --archdir=/tmp/ruby/build/trunk --extout=.ext -- /tmp/ruby/src/trunk/spec/mspec/bin/mspec-run -B /tmp/ruby/src/trunk/spec/default.mspec --error-output stderr --debug -fy -o /tmp/rubytest.mosugb/8-mspec-multi-7 E, [2024-05-09T18:14:54.111966 #2453562] ERROR -- : $ /tmp/ruby/build/trunk/miniruby -I/tmp/ruby/src/trunk/lib /tmp/ruby/src/trunk/tool/runruby.rb --archdir=/tmp/ruby/build/trunk --extout=.ext -- /tmp/ruby/src/trunk/spec/mspec/bin/mspec-run -B /tmp/ruby/src/trunk/spec/default.mspec --error-output stderr --debug -fy -o /tmp/rubytest.mosugb/9-mspec-multi-8 E, [2024-05-09T18:14:54.112384 #2453562] ERROR -- : $ /tmp/ruby/build/trunk/miniruby -I/tmp/ruby/src/trunk/lib /tmp/ruby/src/trunk/tool/runruby.rb --archdir=/tmp/ruby/build/trunk --extout=.ext -- /tmp/ruby/src/trunk/spec/mspec/bin/mspec-run -B /tmp/ruby/src/trunk/spec/default.mspec --error-output stderr --debug -fy -o /tmp/rubytest.mosugb/10-mspec-multi-9 E, [2024-05-09T18:14:54.112668 #2453562] ERROR -- : $ /tmp/ruby/build/trunk/miniruby -I/tmp/ruby/src/trunk/lib /tmp/ruby/src/trunk/tool/runruby.rb --archdir=/tmp/ruby/build/trunk --extout=.ext -- /tmp/ruby/src/trunk/spec/mspec/bin/mspec-run -B /tmp/ruby/src/trunk/spec/default.mspec --error-output stderr --debug -fy -o /tmp/rubytest.mosugb/11-mspec-multi-10 E, [2024-05-09T18:14:54.112937 #2453562] ERROR -- : $ /tmp/ruby/build/trunk/miniruby -I/tmp/ruby/src/trunk/lib /tmp/ruby/src/trunk/tool/runruby.rb --archdir=/tmp/ruby/build/trunk --extout=.ext -- /tmp/ruby/src/trunk/spec/mspec/bin/mspec-run -B /tmp/ruby/src/trunk/spec/default.mspec --error-output stderr --debug -fy -o /tmp/rubytest.mosugb/12-mspec-multi-11 E, [2024-05-09T18:14:54.113205 #2453562] ERROR -- : $ /tmp/ruby/build/trunk/miniruby -I/tmp/ruby/src/trunk/lib /tmp/ruby/src/trunk/tool/runruby.rb --archdir=/tmp/ruby/build/trunk --extout=.ext -- /tmp/ruby/src/trunk/spec/mspec/bin/mspec-run -B /tmp/ruby/src/trunk/spec/default.mspec --error-output stderr --debug -fy -o /tmp/rubytest.mosugb/13-mspec-multi-12 E, [2024-05-09T18:14:54.113437 #2453562] ERROR -- : $ /tmp/ruby/build/trunk/miniruby -I/tmp/ruby/src/trunk/lib /tmp/ruby/src/trunk/tool/runruby.rb --archdir=/tmp/ruby/build/trunk --extout=.ext -- /tmp/ruby/src/trunk/spec/mspec/bin/mspec-run -B /tmp/ruby/src/trunk/spec/default.mspec --error-output stderr --debug -fy -o /tmp/rubytest.mosugb/14-mspec-multi-13 E, [2024-05-09T18:14:54.113681 #2453562] ERROR -- : $ /tmp/ruby/build/trunk/miniruby -I/tmp/ruby/src/trunk/lib /tmp/ruby/src/trunk/tool/runruby.rb --archdir=/tmp/ruby/build/trunk --extout=.ext -- /tmp/ruby/src/trunk/spec/mspec/bin/mspec-run -B /tmp/ruby/src/trunk/spec/default.mspec --error-output stderr --debug -fy -o /tmp/rubytest.mosugb/15-mspec-multi-14 E, [2024-05-09T18:14:54.113919 #2453562] ERROR -- : $ /tmp/ruby/build/trunk/miniruby -I/tmp/ruby/src/trunk/lib /tmp/ruby/src/trunk/tool/runruby.rb --archdir=/tmp/ruby/build/trunk --extout=.ext -- /tmp/ruby/src/trunk/spec/mspec/bin/mspec-run -B /tmp/ruby/src/trunk/spec/default.mspec --error-output stderr --debug -fy -o /tmp/rubytest.mosugb/16-mspec-multi-15 E, [2024-05-09T18:14:54.114126 #2453562] ERROR -- : $ /tmp/ruby/build/trunk/miniruby -I/tmp/ruby/src/trunk/lib /tmp/ruby/src/trunk/tool/runruby.rb --archdir=/tmp/ruby/build/trunk --extout=.ext -- /tmp/ruby/src/trunk/spec/mspec/bin/mspec-run -B /tmp/ruby/src/trunk/spec/default.mspec --error-output stderr --debug -fy -o /tmp/rubytest.mosugb/17-mspec-multi-16 E, [2024-05-09T18:14:54.114322 #2453562] ERROR -- : $ /tmp/ruby/build/trunk/miniruby -I/tmp/ruby/src/trunk/lib /tmp/ruby/src/trunk/tool/runruby.rb --archdir=/tmp/ruby/build/trunk --extout=.ext -- /tmp/ruby/src/trunk/spec/mspec/bin/mspec-run -B /tmp/ruby/src/trunk/spec/default.mspec --error-output stderr --debug -fy -o /tmp/rubytest.mosugb/18-mspec-multi-17 E, [2024-05-09T18:14:54.117267 #2453562] ERROR -- : $ /tmp/ruby/build/trunk/miniruby -I/tmp/ruby/src/trunk/lib /tmp/ruby/src/trunk/tool/runruby.rb --archdir=/tmp/ruby/build/trunk --extout=.ext -- /tmp/ruby/src/trunk/spec/mspec/bin/mspec-run -B /tmp/ruby/src/trunk/spec/default.mspec --error-output stderr --debug -fy -o /tmp/rubytest.mosugb/19-mspec-multi-18 E, [2024-05-09T18:14:54.117668 #2453562] ERROR -- : $ /tmp/ruby/build/trunk/miniruby -I/tmp/ruby/src/trunk/lib /tmp/ruby/src/trunk/tool/runruby.rb --archdir=/tmp/ruby/build/trunk --extout=.ext -- /tmp/ruby/src/trunk/spec/mspec/bin/mspec-run -B /tmp/ruby/src/trunk/spec/default.mspec --error-output stderr --debug -fy -o /tmp/rubytest.mosugb/20-mspec-multi-19 I, [2024-05-09T18:14:54.307089 #2453562] INFO -- : ruby 3.4.0dev (2024-05-09T13:38:43Z master 444030fc61) [x86_64-linux] I, [2024-05-09T18:14:54.984088 #2453562] INFO -- : 0 ......................................................................... I, [2024-05-09T18:14:55.373147 #2453562] INFO -- : 73 ......................................................................... I, [2024-05-09T18:14:55.533547 #2453562] INFO -- : 146 ......................................................................... I, [2024-05-09T18:14:55.579152 #2453562] INFO -- : 219 ......................................................................... I, [2024-05-09T18:14:55.620071 #2453562] INFO -- : 292 ......................................................................... I, [2024-05-09T18:14:55.670541 #2453562] INFO -- : 365 ......................................................................... I, [2024-05-09T18:14:55.693790 #2453562] INFO -- : 438 ......................................................................... I, [2024-05-09T18:14:55.712562 #2453562] INFO -- : 511 ......................................................................... I, [2024-05-09T18:14:55.730662 #2453562] INFO -- : 584 ......................................................................... I, [2024-05-09T18:14:55.793733 #2453562] INFO -- : 657 ......................................................................... I, [2024-05-09T18:14:55.816839 #2453562] INFO -- : 730 ......................................................................... I, [2024-05-09T18:14:55.841080 #2453562] INFO -- : 803 ......................................................................... I, [2024-05-09T18:14:55.885856 #2453562] INFO -- : 876 ......................................................................... I, [2024-05-09T18:14:55.938012 #2453562] INFO -- : 949 ......................................................................... I, [2024-05-09T18:14:56.019083 #2453562] INFO -- : 1022 ......................................................................... I, [2024-05-09T18:14:56.198375 #2453562] INFO -- : 1095 ......................................................................... I, [2024-05-09T18:14:56.315039 #2453562] INFO -- : 1168 ......................................................................... I, [2024-05-09T18:14:56.365175 #2453562] INFO -- : 1241 ......................................................................... I, [2024-05-09T18:14:56.410805 #2453562] INFO -- : 1314 ......................................................................... I, [2024-05-09T18:14:56.433818 #2453562] INFO -- : 1387 ......................................................................... I, [2024-05-09T18:14:56.559136 #2453562] INFO -- : 1460 ......................................................................... I, [2024-05-09T18:14:57.022219 #2453562] INFO -- : 1533 ......................................................................... I, [2024-05-09T18:14:57.104097 #2453562] INFO -- : 1606 ......................................................................... I, [2024-05-09T18:14:57.205526 #2453562] INFO -- : 1679 ......................................................................... I, [2024-05-09T18:14:57.316988 #2453562] INFO -- : 1752 ......................................................................... I, [2024-05-09T18:14:57.402768 #2453562] INFO -- : 1825 ......................................................................... I, [2024-05-09T18:14:57.541068 #2453562] INFO -- : 1898 ......................................................................... I, [2024-05-09T18:14:57.603842 #2453562] INFO -- : 1971 ......................................................................... I, [2024-05-09T18:14:57.678713 #2453562] INFO -- : 2044 ......................................................................... I, [2024-05-09T18:14:57.734186 #2453562] INFO -- : 2117 ......................................................................... I, [2024-05-09T18:14:57.745493 #2453562] INFO -- : 2190 ......................................................................... I, [2024-05-09T18:14:57.762296 #2453562] INFO -- : 2263 ......................................................................... I, [2024-05-09T18:14:57.775157 #2453562] INFO -- : 2336 ......................................................................... I, [2024-05-09T18:14:57.814403 #2453562] INFO -- : 2409 ......................................................................... I, [2024-05-09T18:14:57.922325 #2453562] INFO -- : 2482 ......................................................................... I, [2024-05-09T18:14:57.952319 #2453562] INFO -- : 2555 ......................................................................... I, [2024-05-09T18:14:58.060948 #2453562] INFO -- : 2628 ......................................................................... I, [2024-05-09T18:14:58.159441 #2453562] INFO -- : 2701 ......................................................................... I, [2024-05-09T18:14:58.184841 #2453562] INFO -- : 2774 ......................................................................... I, [2024-05-09T18:14:58.242120 #2453562] INFO -- : 2847 ......................................................................... I, [2024-05-09T18:14:58.275083 #2453562] INFO -- : 2920 ......................................................................... I, [2024-05-09T18:14:58.300518 #2453562] INFO -- : 2993 ......................................................................... I, [2024-05-09T18:14:58.318858 #2453562] INFO -- : 3066 ......................................................................... I, [2024-05-09T18:14:58.332854 #2453562] INFO -- : 3139 ......................................................................... I, [2024-05-09T18:14:58.343794 #2453562] INFO -- : 3212 ......................................................................... I, [2024-05-09T18:14:58.375969 #2453562] INFO -- : 3285 ......................................................................... I, [2024-05-09T18:15:02.333538 #2453562] INFO -- : 3358 ........................................................................ I, [2024-05-09T18:15:02.333581 #2453562] INFO -- : I, [2024-05-09T18:15:02.333587 #2453562] INFO -- : Finished in 8.222598 seconds I, [2024-05-09T18:15:02.333591 #2453562] INFO -- : I, [2024-05-09T18:15:02.333595 #2453562] INFO -- : 3429 files, 32611 examples, 165894 expectations, 0 failures, 0 errors, 0 tagged I, [2024-05-09T18:15:02.335572 #2453562] INFO -- : $$$[end] "make yes-test-rubyspec MSPECOPT='--error-output stderr --debug -j' TESTS='-j20'" exit with 0.