# Logfile created on 2024-05-09 02:14:41 +0000 by logger.rb/v1.4.3 I, [2024-05-09T02:14:41.479390 #2352526] INFO -- : #, @formatter=nil, @logdev=#, @binmode=false, @mon_data=#, @mon_data_owner_object_id=860>>> I, [2024-05-09T02:14:41.479517 #2352526] INFO -- : $$$[beg] make update-unicode -j20 I, [2024-05-09T02:14:41.538183 #2352526] INFO -- : Downloading Unicode emoji 15.0 files... I, [2024-05-09T02:14:41.538484 #2352526] INFO -- : Downloading Unicode emoji 15.0 files... I, [2024-05-09T02:14:41.539009 #2352526] INFO -- : Downloading Unicode emoji 15.0 files... I, [2024-05-09T02:14:41.579318 #2352526] INFO -- : made symlink emoji/15.0/emoji-sequences.txt to /tmp/ruby/src/trunk/.downloaded-cache/emoji/15.0/emoji-sequences.txt I, [2024-05-09T02:14:41.579743 #2352526] INFO -- : downloading emoji/15.0/emoji-test.txt ... downloading emoji/15.0/emoji-sequences.txt ... /tmp/ruby/src/trunk/enc/unicode/data/emoji/15.0/emoji-sequences.txt already exists E, [2024-05-09T02:14:42.026475 #2352526] ERROR -- : /tmp/ruby/src/trunk/tool/downloader.rb:302:in `rescue in download': failed to download emoji/15.0/emoji-test.txt (RuntimeError) E, [2024-05-09T02:14:42.026503 #2352526] ERROR -- : OpenURI::HTTPError: 403 Forbidden: https://www.unicode.org/Public/emoji/15.0/emoji-test.txt E, [2024-05-09T02:14:42.026509 #2352526] ERROR -- : from /tmp/ruby/src/trunk/tool/downloader.rb:201:in `download' E, [2024-05-09T02:14:42.026513 #2352526] ERROR -- : from /tmp/ruby/src/trunk/tool/downloader.rb:136:in `download' E, [2024-05-09T02:14:42.026518 #2352526] ERROR -- : from /tmp/ruby/src/trunk/tool/downloader.rb:482:in `block in
' E, [2024-05-09T02:14:42.026522 #2352526] ERROR -- : from /tmp/ruby/src/trunk/tool/downloader.rb:465:in `each' E, [2024-05-09T02:14:42.026526 #2352526] ERROR -- : from /tmp/ruby/src/trunk/tool/downloader.rb:465:in `
' E, [2024-05-09T02:14:42.026530 #2352526] ERROR -- : /usr/lib/ruby/3.0.0/open-uri.rb:364:in `open_http': 403 Forbidden (OpenURI::HTTPError) E, [2024-05-09T02:14:42.026533 #2352526] ERROR -- : from /usr/lib/ruby/3.0.0/open-uri.rb:741:in `buffer_open' E, [2024-05-09T02:14:42.026539 #2352526] ERROR -- : from /usr/lib/ruby/3.0.0/open-uri.rb:212:in `block in open_loop' E, [2024-05-09T02:14:42.026543 #2352526] ERROR -- : from /usr/lib/ruby/3.0.0/open-uri.rb:210:in `catch' E, [2024-05-09T02:14:42.026546 #2352526] ERROR -- : from /usr/lib/ruby/3.0.0/open-uri.rb:210:in `open_loop' E, [2024-05-09T02:14:42.026550 #2352526] ERROR -- : from /usr/lib/ruby/3.0.0/open-uri.rb:151:in `open_uri' E, [2024-05-09T02:14:42.026554 #2352526] ERROR -- : from /usr/lib/ruby/3.0.0/open-uri.rb:721:in `open' E, [2024-05-09T02:14:42.026557 #2352526] ERROR -- : from /usr/lib/ruby/3.0.0/open-uri.rb:729:in `read' E, [2024-05-09T02:14:42.026561 #2352526] ERROR -- : from /tmp/ruby/src/trunk/tool/downloader.rb:247:in `block in download' E, [2024-05-09T02:14:42.026573 #2352526] ERROR -- : from /tmp/ruby/src/trunk/tool/downloader.rb:378:in `with_retry' E, [2024-05-09T02:14:42.026579 #2352526] ERROR -- : from /tmp/ruby/src/trunk/tool/downloader.rb:246:in `download' E, [2024-05-09T02:14:42.026583 #2352526] ERROR -- : from /tmp/ruby/src/trunk/tool/downloader.rb:136:in `download' E, [2024-05-09T02:14:42.026586 #2352526] ERROR -- : from /tmp/ruby/src/trunk/tool/downloader.rb:482:in `block in
' E, [2024-05-09T02:14:42.026590 #2352526] ERROR -- : from /tmp/ruby/src/trunk/tool/downloader.rb:465:in `each' E, [2024-05-09T02:14:42.026594 #2352526] ERROR -- : from /tmp/ruby/src/trunk/tool/downloader.rb:465:in `
' E, [2024-05-09T02:14:42.028617 #2352526] ERROR -- : make: *** [uncommon.mk:1787: /tmp/ruby/src/trunk/enc/unicode/data/emoji/15.0/emoji-sequences.txt] Error 1 E, [2024-05-09T02:14:42.028637 #2352526] ERROR -- : make: *** Deleting file '/tmp/ruby/src/trunk/enc/unicode/data/emoji/15.0/emoji-sequences.txt' E, [2024-05-09T02:14:42.028643 #2352526] ERROR -- : make: *** Waiting for unfinished jobs.... E, [2024-05-09T02:14:42.041304 #2352526] ERROR -- : /tmp/ruby/src/trunk/tool/downloader.rb:302:in `rescue in download': failed to download emoji/15.0/emoji-test.txt (RuntimeError) E, [2024-05-09T02:14:42.041325 #2352526] ERROR -- : OpenURI::HTTPError: 403 Forbidden: https://www.unicode.org/Public/emoji/15.0/emoji-test.txt E, [2024-05-09T02:14:42.041331 #2352526] ERROR -- : from /tmp/ruby/src/trunk/tool/downloader.rb:201:in `download' E, [2024-05-09T02:14:42.041334 #2352526] ERROR -- : from /tmp/ruby/src/trunk/tool/downloader.rb:136:in `download' E, [2024-05-09T02:14:42.041338 #2352526] ERROR -- : from /tmp/ruby/src/trunk/tool/downloader.rb:482:in `block in
' E, [2024-05-09T02:14:42.041341 #2352526] ERROR -- : from /tmp/ruby/src/trunk/tool/downloader.rb:465:in `each' E, [2024-05-09T02:14:42.041345 #2352526] ERROR -- : from /tmp/ruby/src/trunk/tool/downloader.rb:465:in `
' E, [2024-05-09T02:14:42.041350 #2352526] ERROR -- : /usr/lib/ruby/3.0.0/open-uri.rb:364:in `open_http': 403 Forbidden (OpenURI::HTTPError) E, [2024-05-09T02:14:42.041354 #2352526] ERROR -- : from /usr/lib/ruby/3.0.0/open-uri.rb:741:in `buffer_open' E, [2024-05-09T02:14:42.041357 #2352526] ERROR -- : from /usr/lib/ruby/3.0.0/open-uri.rb:212:in `block in open_loop' E, [2024-05-09T02:14:42.041361 #2352526] ERROR -- : from /usr/lib/ruby/3.0.0/open-uri.rb:210:in `catch' E, [2024-05-09T02:14:42.041364 #2352526] ERROR -- : from /usr/lib/ruby/3.0.0/open-uri.rb:210:in `open_loop' E, [2024-05-09T02:14:42.041367 #2352526] ERROR -- : from /usr/lib/ruby/3.0.0/open-uri.rb:151:in `open_uri' E, [2024-05-09T02:14:42.041371 #2352526] ERROR -- : from /usr/lib/ruby/3.0.0/open-uri.rb:721:in `open' E, [2024-05-09T02:14:42.041374 #2352526] ERROR -- : from /usr/lib/ruby/3.0.0/open-uri.rb:729:in `read' E, [2024-05-09T02:14:42.041377 #2352526] ERROR -- : from /tmp/ruby/src/trunk/tool/downloader.rb:247:in `block in download' E, [2024-05-09T02:14:42.041382 #2352526] ERROR -- : from /tmp/ruby/src/trunk/tool/downloader.rb:378:in `with_retry' E, [2024-05-09T02:14:42.041386 #2352526] ERROR -- : from /tmp/ruby/src/trunk/tool/downloader.rb:246:in `download' E, [2024-05-09T02:14:42.041389 #2352526] ERROR -- : from /tmp/ruby/src/trunk/tool/downloader.rb:136:in `download' E, [2024-05-09T02:14:42.041392 #2352526] ERROR -- : from /tmp/ruby/src/trunk/tool/downloader.rb:482:in `block in
' E, [2024-05-09T02:14:42.041396 #2352526] ERROR -- : from /tmp/ruby/src/trunk/tool/downloader.rb:465:in `each' E, [2024-05-09T02:14:42.041399 #2352526] ERROR -- : from /tmp/ruby/src/trunk/tool/downloader.rb:465:in `
' E, [2024-05-09T02:14:42.043490 #2352526] ERROR -- : make: *** [uncommon.mk:1787: /tmp/ruby/src/trunk/enc/unicode/data/emoji/15.0/emoji-zwj-sequences.txt] Error 1 E, [2024-05-09T02:14:42.458897 #2352526] ERROR -- : /tmp/ruby/src/trunk/tool/downloader.rb:302:in `rescue in download': failed to download emoji/15.0/emoji-sequences.txt (RuntimeError) E, [2024-05-09T02:14:42.458926 #2352526] ERROR -- : EOFError: end of file reached: https://www.unicode.org/Public/emoji/15.0/emoji-sequences.txt E, [2024-05-09T02:14:42.458934 #2352526] ERROR -- : from /tmp/ruby/src/trunk/tool/downloader.rb:201:in `download' E, [2024-05-09T02:14:42.458940 #2352526] ERROR -- : from /tmp/ruby/src/trunk/tool/downloader.rb:136:in `download' E, [2024-05-09T02:14:42.458945 #2352526] ERROR -- : from /tmp/ruby/src/trunk/tool/downloader.rb:482:in `block in
' E, [2024-05-09T02:14:42.458951 #2352526] ERROR -- : from /tmp/ruby/src/trunk/tool/downloader.rb:465:in `each' E, [2024-05-09T02:14:42.458956 #2352526] ERROR -- : from /tmp/ruby/src/trunk/tool/downloader.rb:465:in `
' E, [2024-05-09T02:14:42.458961 #2352526] ERROR -- : /usr/lib/ruby/3.0.0/net/protocol.rb:227:in `rbuf_fill': end of file reached (EOFError) E, [2024-05-09T02:14:42.458968 #2352526] ERROR -- : from /usr/lib/ruby/3.0.0/net/protocol.rb:193:in `readuntil' E, [2024-05-09T02:14:42.458973 #2352526] ERROR -- : from /usr/lib/ruby/3.0.0/net/protocol.rb:203:in `readline' E, [2024-05-09T02:14:42.458979 #2352526] ERROR -- : from /usr/lib/ruby/3.0.0/net/http/response.rb:42:in `read_status_line' E, [2024-05-09T02:14:42.458985 #2352526] ERROR -- : from /usr/lib/ruby/3.0.0/net/http/response.rb:31:in `read_new' E, [2024-05-09T02:14:42.458990 #2352526] ERROR -- : from /usr/lib/ruby/3.0.0/net/http.rb:1557:in `block in transport_request' E, [2024-05-09T02:14:42.458996 #2352526] ERROR -- : from /usr/lib/ruby/3.0.0/net/http.rb:1548:in `catch' E, [2024-05-09T02:14:42.459104 #2352526] ERROR -- : from /usr/lib/ruby/3.0.0/net/http.rb:1548:in `transport_request' E, [2024-05-09T02:14:42.459110 #2352526] ERROR -- : from /usr/lib/ruby/3.0.0/net/http.rb:1521:in `request' E, [2024-05-09T02:14:42.459116 #2352526] ERROR -- : from /usr/lib/ruby/3.0.0/open-uri.rb:329:in `block in open_http' E, [2024-05-09T02:14:42.459121 #2352526] ERROR -- : from /usr/lib/ruby/3.0.0/net/http.rb:960:in `start' E, [2024-05-09T02:14:42.459127 #2352526] ERROR -- : from /usr/lib/ruby/3.0.0/open-uri.rb:323:in `open_http' E, [2024-05-09T02:14:42.459134 #2352526] ERROR -- : from /usr/lib/ruby/3.0.0/open-uri.rb:741:in `buffer_open' E, [2024-05-09T02:14:42.459140 #2352526] ERROR -- : from /usr/lib/ruby/3.0.0/open-uri.rb:212:in `block in open_loop' E, [2024-05-09T02:14:42.459145 #2352526] ERROR -- : from /usr/lib/ruby/3.0.0/open-uri.rb:210:in `catch' E, [2024-05-09T02:14:42.459151 #2352526] ERROR -- : from /usr/lib/ruby/3.0.0/open-uri.rb:210:in `open_loop' E, [2024-05-09T02:14:42.459157 #2352526] ERROR -- : from /usr/lib/ruby/3.0.0/open-uri.rb:151:in `open_uri' E, [2024-05-09T02:14:42.459162 #2352526] ERROR -- : from /usr/lib/ruby/3.0.0/open-uri.rb:721:in `open' E, [2024-05-09T02:14:42.459168 #2352526] ERROR -- : from /usr/lib/ruby/3.0.0/open-uri.rb:729:in `read' E, [2024-05-09T02:14:42.459173 #2352526] ERROR -- : from /tmp/ruby/src/trunk/tool/downloader.rb:247:in `block in download' E, [2024-05-09T02:14:42.459179 #2352526] ERROR -- : from /tmp/ruby/src/trunk/tool/downloader.rb:378:in `with_retry' E, [2024-05-09T02:14:42.459186 #2352526] ERROR -- : from /tmp/ruby/src/trunk/tool/downloader.rb:246:in `download' E, [2024-05-09T02:14:42.459192 #2352526] ERROR -- : from /tmp/ruby/src/trunk/tool/downloader.rb:136:in `download' E, [2024-05-09T02:14:42.459197 #2352526] ERROR -- : from /tmp/ruby/src/trunk/tool/downloader.rb:482:in `block in
' E, [2024-05-09T02:14:42.459203 #2352526] ERROR -- : from /tmp/ruby/src/trunk/tool/downloader.rb:465:in `each' E, [2024-05-09T02:14:42.459208 #2352526] ERROR -- : from /tmp/ruby/src/trunk/tool/downloader.rb:465:in `
' E, [2024-05-09T02:14:42.460949 #2352526] ERROR -- : make: *** [uncommon.mk:1787: /tmp/ruby/src/trunk/enc/unicode/data/emoji/15.0/emoji-test.txt] Error 1 I, [2024-05-09T02:14:42.461018 #2352526] INFO -- : downloading emoji/15.0/emoji-test.txt ... I, [2024-05-09T02:14:42.461382 #2352526] INFO -- : $$$[end] "make update-unicode -j20" exit with 512. I, [2024-05-09T02:14:42.461407 #2352526] INFO -- : $$$[beg] make update-download -j20 I, [2024-05-09T02:14:42.559719 #2352526] INFO -- : tool/config.guess already exists I, [2024-05-09T02:14:42.559762 #2352526] INFO -- : tool/config.sub already exists I, [2024-05-09T02:14:42.561950 #2352526] INFO -- : Update minitest to ea9caafc0754b1d6236a490d59e624b53209734a I, [2024-05-09T02:14:42.562087 #2352526] INFO -- : Update power_assert to 84e85124c5014a139af39161d484156cfe87a9ed I, [2024-05-09T02:14:42.562707 #2352526] INFO -- : Update rbs to ba7872795d5de04adb8ff500c0e6afdc81a041dd I, [2024-05-09T02:14:42.562856 #2352526] INFO -- : Update typeprof to b19a6416da3a05d57fadd6ffdadb382b6d236ca5 I, [2024-05-09T02:14:42.563257 #2352526] INFO -- : echo ea9caafc0754b1d6236a490d59e624b53209734a | /bin/sh /tmp/ruby/src/trunk/tool/ifchange /tmp/ruby/src/trunk/.bundle/.timestamp/minitest.revision - I, [2024-05-09T02:14:42.563315 #2352526] INFO -- : echo 84e85124c5014a139af39161d484156cfe87a9ed | /bin/sh /tmp/ruby/src/trunk/tool/ifchange /tmp/ruby/src/trunk/.bundle/.timestamp/power_assert.revision - I, [2024-05-09T02:14:42.563906 #2352526] INFO -- : echo ba7872795d5de04adb8ff500c0e6afdc81a041dd | /bin/sh /tmp/ruby/src/trunk/tool/ifchange /tmp/ruby/src/trunk/.bundle/.timestamp/rbs.revision - I, [2024-05-09T02:14:42.564041 #2352526] INFO -- : echo b19a6416da3a05d57fadd6ffdadb382b6d236ca5 | /bin/sh /tmp/ruby/src/trunk/tool/ifchange /tmp/ruby/src/trunk/.bundle/.timestamp/typeprof.revision - I, [2024-05-09T02:14:42.565052 #2352526] INFO -- : /tmp/ruby/src/trunk/.bundle/.timestamp/minitest.revision unchanged I, [2024-05-09T02:14:42.565178 #2352526] INFO -- : /tmp/ruby/src/trunk/.bundle/.timestamp/power_assert.revision unchanged I, [2024-05-09T02:14:42.565632 #2352526] INFO -- : /tmp/ruby/src/trunk/.bundle/.timestamp/rbs.revision unchanged I, [2024-05-09T02:14:42.565806 #2352526] INFO -- : /tmp/ruby/src/trunk/.bundle/.timestamp/typeprof.revision unchanged I, [2024-05-09T02:14:42.566245 #2352526] INFO -- : Building power_assert@84e85124c5014a139af39161d484156cfe87a9ed to /tmp/ruby/src/trunk/gems/power_assert-2.0.3.gem I, [2024-05-09T02:14:42.635307 #2352526] INFO -- : Successfully built RubyGem I, [2024-05-09T02:14:42.635347 #2352526] INFO -- : Name: power_assert I, [2024-05-09T02:14:42.635357 #2352526] INFO -- : Version: 2.0.4dev I, [2024-05-09T02:14:42.635361 #2352526] INFO -- : File: power_assert-2.0.4dev.gem I, [2024-05-09T02:14:42.682263 #2352526] INFO -- : $$$[end] "make update-download -j20" exit with 0. I, [2024-05-09T02:14:42.682303 #2352526] INFO -- : $$$[beg] make update-rubyspec -j20 I, [2024-05-09T02:14:42.739748 #2352526] INFO -- : make: Nothing to be done for 'update-rubyspec'. I, [2024-05-09T02:14:42.740005 #2352526] INFO -- : $$$[end] "make update-rubyspec -j20" exit with 0. I, [2024-05-09T02:14:42.740039 #2352526] INFO -- : $$$[beg] make update-src -j20 I, [2024-05-09T02:14:43.267649 #2352526] INFO -- : Already up to date. I, [2024-05-09T02:14:43.276783 #2352526] INFO -- : Latest commit hash = d6564615e7 I, [2024-05-09T02:14:43.277812 #2352526] INFO -- : $$$[end] "make update-src -j20" exit with 0. I, [2024-05-09T02:14:43.277852 #2352526] INFO -- : $$$[beg] make after-update -j20 I, [2024-05-09T02:14:43.346995 #2352526] INFO -- : generating /tmp/ruby/src/trunk/ext/ripper/eventids2table.c I, [2024-05-09T02:14:43.351223 #2352526] INFO -- : make[1]: Entering directory '/tmp/ruby/src/trunk/ext/ripper' I, [2024-05-09T02:14:43.351270 #2352526] INFO -- : make[1]: Nothing to be done for 'src'. I, [2024-05-09T02:14:43.351283 #2352526] INFO -- : make[1]: Leaving directory '/tmp/ruby/src/trunk/ext/ripper' I, [2024-05-09T02:14:43.367641 #2352526] INFO -- : /tmp/ruby/src/trunk/revision.h updated I, [2024-05-09T02:14:43.368842 #2352526] INFO -- : generating x86_64-linux-fake.rb I, [2024-05-09T02:14:43.420703 #2352526] INFO -- : x86_64-linux-fake.rb updated I, [2024-05-09T02:14:43.422328 #2352526] INFO -- : generating enc.mk I, [2024-05-09T02:14:43.539048 #2352526] INFO -- : making srcs under enc I, [2024-05-09T02:14:43.568905 #2352526] INFO -- : make[1]: Entering directory '/tmp/ruby/build/trunk' I, [2024-05-09T02:14:43.568978 #2352526] INFO -- : make[1]: Nothing to be done for 'srcs'. I, [2024-05-09T02:14:43.568992 #2352526] INFO -- : make[1]: Leaving directory '/tmp/ruby/build/trunk' I, [2024-05-09T02:14:43.614973 #2352526] INFO -- : Update minitest to ea9caafc0754b1d6236a490d59e624b53209734a I, [2024-05-09T02:14:43.615113 #2352526] INFO -- : Update power_assert to 84e85124c5014a139af39161d484156cfe87a9ed I, [2024-05-09T02:14:43.615904 #2352526] INFO -- : Update rbs to ba7872795d5de04adb8ff500c0e6afdc81a041dd I, [2024-05-09T02:14:43.615950 #2352526] INFO -- : Update typeprof to b19a6416da3a05d57fadd6ffdadb382b6d236ca5 I, [2024-05-09T02:14:43.616338 #2352526] INFO -- : echo ea9caafc0754b1d6236a490d59e624b53209734a | /bin/sh /tmp/ruby/src/trunk/tool/ifchange /tmp/ruby/src/trunk/.bundle/.timestamp/minitest.revision - I, [2024-05-09T02:14:43.616468 #2352526] INFO -- : echo 84e85124c5014a139af39161d484156cfe87a9ed | /bin/sh /tmp/ruby/src/trunk/tool/ifchange /tmp/ruby/src/trunk/.bundle/.timestamp/power_assert.revision - I, [2024-05-09T02:14:43.617722 #2352526] INFO -- : echo ba7872795d5de04adb8ff500c0e6afdc81a041dd | /bin/sh /tmp/ruby/src/trunk/tool/ifchange /tmp/ruby/src/trunk/.bundle/.timestamp/rbs.revision - I, [2024-05-09T02:14:43.617872 #2352526] INFO -- : echo b19a6416da3a05d57fadd6ffdadb382b6d236ca5 | /bin/sh /tmp/ruby/src/trunk/tool/ifchange /tmp/ruby/src/trunk/.bundle/.timestamp/typeprof.revision - I, [2024-05-09T02:14:43.618281 #2352526] INFO -- : /tmp/ruby/src/trunk/.bundle/.timestamp/minitest.revision unchanged I, [2024-05-09T02:14:43.618515 #2352526] INFO -- : /tmp/ruby/src/trunk/.bundle/.timestamp/power_assert.revision unchanged I, [2024-05-09T02:14:43.619376 #2352526] INFO -- : /tmp/ruby/src/trunk/.bundle/.timestamp/rbs.revision unchanged I, [2024-05-09T02:14:43.619550 #2352526] INFO -- : /tmp/ruby/src/trunk/.bundle/.timestamp/typeprof.revision unchanged I, [2024-05-09T02:14:43.619648 #2352526] INFO -- : Building power_assert@84e85124c5014a139af39161d484156cfe87a9ed to /tmp/ruby/src/trunk/gems/power_assert-2.0.3.gem I, [2024-05-09T02:14:43.688548 #2352526] INFO -- : Successfully built RubyGem I, [2024-05-09T02:14:43.688607 #2352526] INFO -- : Name: power_assert I, [2024-05-09T02:14:43.688619 #2352526] INFO -- : Version: 2.0.4dev I, [2024-05-09T02:14:43.688636 #2352526] INFO -- : File: power_assert-2.0.4dev.gem I, [2024-05-09T02:14:43.690766 #2352526] INFO -- : Extracting bundle gem power_assert-2.0.3... I, [2024-05-09T02:14:43.752608 #2352526] INFO -- : Try with hash version of bundled gems instead of gems/power_assert-2.0.3.gem. We don't use this gem with release version of Ruby. I, [2024-05-09T02:14:43.757595 #2352526] INFO -- : Unpacked gems/power_assert-2.0.4dev.gem I, [2024-05-09T02:14:43.759422 #2352526] INFO -- : $$$[end] "make after-update -j20" exit with 0. I, [2024-05-09T02:14:43.759561 #2352526] INFO -- : $$$[beg] make miniruby -j20 I, [2024-05-09T02:14:43.817305 #2352526] INFO -- : BASERUBY = /usr/bin/ruby --disable=gems I, [2024-05-09T02:14:43.817344 #2352526] INFO -- : CC = gcc I, [2024-05-09T02:14:43.817358 #2352526] INFO -- : LD = ld I, [2024-05-09T02:14:43.817369 #2352526] INFO -- : LDSHARED = gcc -shared I, [2024-05-09T02:14:43.817380 #2352526] INFO -- : CFLAGS = -O3 -fno-fast-math -ggdb3 -Wall -Wextra -Wdeprecated-declarations -Wdiv-by-zero -Wduplicated-cond -Wimplicit-function-declaration -Wimplicit-int -Wpointer-arith -Wwrite-strings -Wold-style-definition -Wimplicit-fallthrough=0 -Wmissing-noreturn -Wno-cast-function-type -Wno-constant-logical-operand -Wno-long-long -Wno-missing-field-initializers -Wno-overlength-strings -Wno-packed-bitfield-compat -Wno-parentheses-equality -Wno-self-assign -Wno-tautological-compare -Wno-unused-parameter -Wno-unused-value -Wsuggest-attribute=format -Wsuggest-attribute=noreturn -Wunused-variable -Wmisleading-indentation -Wundef -fPIC I, [2024-05-09T02:14:43.817391 #2352526] INFO -- : XCFLAGS = -U_FORTIFY_SOURCE -D_FORTIFY_SOURCE=2 -fstack-protector-strong -fno-strict-overflow -fvisibility=hidden -fexcess-precision=standard -DRUBY_EXPORT -I. -I.ext/include/x86_64-linux -I/tmp/ruby/src/trunk/include -I/tmp/ruby/src/trunk -I/tmp/ruby/src/trunk/prism -I/tmp/ruby/src/trunk/enc/unicode/15.0.0 I, [2024-05-09T02:14:43.817412 #2352526] INFO -- : CPPFLAGS = I, [2024-05-09T02:14:43.817423 #2352526] INFO -- : DLDFLAGS = -Wl,--compress-debug-sections=zlib -Wl,-soname,libruby.so.3.4 -fstack-protector-strong I, [2024-05-09T02:14:43.817434 #2352526] INFO -- : SOLIBS = -lz -lrt -lrt -lgmp -ldl -lcrypt -lm -lpthread I, [2024-05-09T02:14:43.817445 #2352526] INFO -- : LANG = en_US.UTF-8 I, [2024-05-09T02:14:43.817455 #2352526] INFO -- : LC_ALL = I, [2024-05-09T02:14:43.817465 #2352526] INFO -- : LC_CTYPE = I, [2024-05-09T02:14:43.817475 #2352526] INFO -- : MFLAGS = -j20 --jobserver-auth=4,5 I, [2024-05-09T02:14:43.817485 #2352526] INFO -- : RUSTC = no I, [2024-05-09T02:14:43.817496 #2352526] INFO -- : YJIT_RUSTC_ARGS = --crate-name=yjit --crate-type=staticlib --edition=2021 -g -C lto=thin -C opt-level=3 -C overflow-checks=on '--out-dir=/tmp/ruby/build/trunk/yjit/target/release/' /tmp/ruby/src/trunk/yjit/src/lib.rs I, [2024-05-09T02:14:43.818770 #2352526] INFO -- : gcc (Ubuntu 11.4.0-1ubuntu1~22.04) 11.4.0 I, [2024-05-09T02:14:43.818810 #2352526] INFO -- : Copyright (C) 2021 Free Software Foundation, Inc. I, [2024-05-09T02:14:43.818823 #2352526] INFO -- : This is free software; see the source for copying conditions. There is NO I, [2024-05-09T02:14:43.818835 #2352526] INFO -- : warranty; not even for MERCHANTABILITY or FITNESS FOR A PARTICULAR PURPOSE. I, [2024-05-09T02:14:43.818846 #2352526] INFO -- : I, [2024-05-09T02:14:43.839345 #2352526] INFO -- : compiling /tmp/ruby/src/trunk/version.c I, [2024-05-09T02:14:43.943095 #2352526] INFO -- : linking miniruby I, [2024-05-09T02:14:44.473766 #2352526] INFO -- : $$$[end] "make miniruby -j20" exit with 0. I, [2024-05-09T02:14:44.473871 #2352526] INFO -- : $$$[beg] make ruby -j20 I, [2024-05-09T02:14:44.530795 #2352526] INFO -- : BASERUBY = /usr/bin/ruby --disable=gems I, [2024-05-09T02:14:44.530835 #2352526] INFO -- : CC = gcc I, [2024-05-09T02:14:44.530847 #2352526] INFO -- : LD = ld I, [2024-05-09T02:14:44.530858 #2352526] INFO -- : LDSHARED = gcc -shared I, [2024-05-09T02:14:44.530874 #2352526] INFO -- : CFLAGS = -O3 -fno-fast-math -ggdb3 -Wall -Wextra -Wdeprecated-declarations -Wdiv-by-zero -Wduplicated-cond -Wimplicit-function-declaration -Wimplicit-int -Wpointer-arith -Wwrite-strings -Wold-style-definition -Wimplicit-fallthrough=0 -Wmissing-noreturn -Wno-cast-function-type -Wno-constant-logical-operand -Wno-long-long -Wno-missing-field-initializers -Wno-overlength-strings -Wno-packed-bitfield-compat -Wno-parentheses-equality -Wno-self-assign -Wno-tautological-compare -Wno-unused-parameter -Wno-unused-value -Wsuggest-attribute=format -Wsuggest-attribute=noreturn -Wunused-variable -Wmisleading-indentation -Wundef -fPIC I, [2024-05-09T02:14:44.530886 #2352526] INFO -- : XCFLAGS = -U_FORTIFY_SOURCE -D_FORTIFY_SOURCE=2 -fstack-protector-strong -fno-strict-overflow -fvisibility=hidden -fexcess-precision=standard -DRUBY_EXPORT -I. -I.ext/include/x86_64-linux -I/tmp/ruby/src/trunk/include -I/tmp/ruby/src/trunk -I/tmp/ruby/src/trunk/prism -I/tmp/ruby/src/trunk/enc/unicode/15.0.0 I, [2024-05-09T02:14:44.530896 #2352526] INFO -- : CPPFLAGS = I, [2024-05-09T02:14:44.530906 #2352526] INFO -- : DLDFLAGS = -Wl,--compress-debug-sections=zlib -Wl,-soname,libruby.so.3.4 -fstack-protector-strong I, [2024-05-09T02:14:44.530917 #2352526] INFO -- : SOLIBS = -lz -lrt -lrt -lgmp -ldl -lcrypt -lm -lpthread I, [2024-05-09T02:14:44.530927 #2352526] INFO -- : LANG = en_US.UTF-8 I, [2024-05-09T02:14:44.530937 #2352526] INFO -- : LC_ALL = I, [2024-05-09T02:14:44.530946 #2352526] INFO -- : LC_CTYPE = I, [2024-05-09T02:14:44.530956 #2352526] INFO -- : MFLAGS = -j20 --jobserver-auth=4,5 I, [2024-05-09T02:14:44.530966 #2352526] INFO -- : RUSTC = no I, [2024-05-09T02:14:44.530976 #2352526] INFO -- : YJIT_RUSTC_ARGS = --crate-name=yjit --crate-type=staticlib --edition=2021 -g -C lto=thin -C opt-level=3 -C overflow-checks=on '--out-dir=/tmp/ruby/build/trunk/yjit/target/release/' /tmp/ruby/src/trunk/yjit/src/lib.rs I, [2024-05-09T02:14:44.532305 #2352526] INFO -- : gcc (Ubuntu 11.4.0-1ubuntu1~22.04) 11.4.0 I, [2024-05-09T02:14:44.532347 #2352526] INFO -- : Copyright (C) 2021 Free Software Foundation, Inc. I, [2024-05-09T02:14:44.532360 #2352526] INFO -- : This is free software; see the source for copying conditions. There is NO I, [2024-05-09T02:14:44.532371 #2352526] INFO -- : warranty; not even for MERCHANTABILITY or FITNESS FOR A PARTICULAR PURPOSE. I, [2024-05-09T02:14:44.532381 #2352526] INFO -- : I, [2024-05-09T02:14:44.640027 #2352526] INFO -- : builtin_binary.inc updated I, [2024-05-09T02:14:44.644469 #2352526] INFO -- : c5234a9416e4f20f175185e840b25b0f08674d14078ed7083f37e655458e3ca9 builtin_binary.inc I, [2024-05-09T02:14:44.645076 #2352526] INFO -- : compiling /tmp/ruby/src/trunk/builtin.c I, [2024-05-09T02:14:44.828342 #2352526] INFO -- : linking static-library libruby-static.a I, [2024-05-09T02:14:45.145686 #2352526] INFO -- : linking shared-library libruby.so.3.4.0 I, [2024-05-09T02:14:46.702041 #2352526] INFO -- : linking ruby I, [2024-05-09T02:14:46.725019 #2352526] INFO -- : $$$[end] "make ruby -j20" exit with 0. I, [2024-05-09T02:14:46.725173 #2352526] INFO -- : $$$[beg] make all -j20 I, [2024-05-09T02:14:46.783417 #2352526] INFO -- : BASERUBY = /usr/bin/ruby --disable=gems I, [2024-05-09T02:14:46.783459 #2352526] INFO -- : CC = gcc I, [2024-05-09T02:14:46.783472 #2352526] INFO -- : LD = ld I, [2024-05-09T02:14:46.783482 #2352526] INFO -- : LDSHARED = gcc -shared I, [2024-05-09T02:14:46.783493 #2352526] INFO -- : CFLAGS = -O3 -fno-fast-math -ggdb3 -Wall -Wextra -Wdeprecated-declarations -Wdiv-by-zero -Wduplicated-cond -Wimplicit-function-declaration -Wimplicit-int -Wpointer-arith -Wwrite-strings -Wold-style-definition -Wimplicit-fallthrough=0 -Wmissing-noreturn -Wno-cast-function-type -Wno-constant-logical-operand -Wno-long-long -Wno-missing-field-initializers -Wno-overlength-strings -Wno-packed-bitfield-compat -Wno-parentheses-equality -Wno-self-assign -Wno-tautological-compare -Wno-unused-parameter -Wno-unused-value -Wsuggest-attribute=format -Wsuggest-attribute=noreturn -Wunused-variable -Wmisleading-indentation -Wundef -fPIC I, [2024-05-09T02:14:46.783507 #2352526] INFO -- : XCFLAGS = -U_FORTIFY_SOURCE -D_FORTIFY_SOURCE=2 -fstack-protector-strong -fno-strict-overflow -fvisibility=hidden -fexcess-precision=standard -DRUBY_EXPORT -I. -I.ext/include/x86_64-linux -I/tmp/ruby/src/trunk/include -I/tmp/ruby/src/trunk -I/tmp/ruby/src/trunk/prism -I/tmp/ruby/src/trunk/enc/unicode/15.0.0 I, [2024-05-09T02:14:46.783518 #2352526] INFO -- : CPPFLAGS = I, [2024-05-09T02:14:46.783528 #2352526] INFO -- : DLDFLAGS = -Wl,--compress-debug-sections=zlib -Wl,-soname,libruby.so.3.4 -fstack-protector-strong I, [2024-05-09T02:14:46.783538 #2352526] INFO -- : SOLIBS = -lz -lrt -lrt -lgmp -ldl -lcrypt -lm -lpthread I, [2024-05-09T02:14:46.783548 #2352526] INFO -- : LANG = en_US.UTF-8 I, [2024-05-09T02:14:46.783558 #2352526] INFO -- : LC_ALL = I, [2024-05-09T02:14:46.783569 #2352526] INFO -- : LC_CTYPE = I, [2024-05-09T02:14:46.783579 #2352526] INFO -- : MFLAGS = -j20 --jobserver-auth=4,5 I, [2024-05-09T02:14:46.783589 #2352526] INFO -- : RUSTC = no I, [2024-05-09T02:14:46.783602 #2352526] INFO -- : YJIT_RUSTC_ARGS = --crate-name=yjit --crate-type=staticlib --edition=2021 -g -C lto=thin -C opt-level=3 -C overflow-checks=on '--out-dir=/tmp/ruby/build/trunk/yjit/target/release/' /tmp/ruby/src/trunk/yjit/src/lib.rs I, [2024-05-09T02:14:46.784707 #2352526] INFO -- : gcc (Ubuntu 11.4.0-1ubuntu1~22.04) 11.4.0 I, [2024-05-09T02:14:46.784749 #2352526] INFO -- : Copyright (C) 2021 Free Software Foundation, Inc. I, [2024-05-09T02:14:46.784762 #2352526] INFO -- : This is free software; see the source for copying conditions. There is NO I, [2024-05-09T02:14:46.784773 #2352526] INFO -- : warranty; not even for MERCHANTABILITY or FITNESS FOR A PARTICULAR PURPOSE. I, [2024-05-09T02:14:46.784794 #2352526] INFO -- : I, [2024-05-09T02:14:46.815361 #2352526] INFO -- : generating enc.mk I, [2024-05-09T02:14:46.817302 #2352526] INFO -- : building spec/ruby/optional/capi/ext/array_spec.so I, [2024-05-09T02:14:46.817610 #2352526] INFO -- : building spec/ruby/optional/capi/ext/basic_object_spec.so I, [2024-05-09T02:14:46.818183 #2352526] INFO -- : building spec/ruby/optional/capi/ext/bignum_spec.so I, [2024-05-09T02:14:46.818676 #2352526] INFO -- : building spec/ruby/optional/capi/ext/binding_spec.so I, [2024-05-09T02:14:46.818984 #2352526] INFO -- : building spec/ruby/optional/capi/ext/boolean_spec.so I, [2024-05-09T02:14:46.819562 #2352526] INFO -- : building spec/ruby/optional/capi/ext/class_id_under_autoload_spec.so I, [2024-05-09T02:14:46.820490 #2352526] INFO -- : building spec/ruby/optional/capi/ext/class_spec.so I, [2024-05-09T02:14:46.820530 #2352526] INFO -- : building spec/ruby/optional/capi/ext/class_under_autoload_spec.so I, [2024-05-09T02:14:46.821473 #2352526] INFO -- : building spec/ruby/optional/capi/ext/complex_spec.so I, [2024-05-09T02:14:46.821807 #2352526] INFO -- : building spec/ruby/optional/capi/ext/constants_spec.so I, [2024-05-09T02:14:46.822648 #2352526] INFO -- : building spec/ruby/optional/capi/ext/data_spec.so I, [2024-05-09T02:14:46.823313 #2352526] INFO -- : building spec/ruby/optional/capi/ext/debug_spec.so I, [2024-05-09T02:14:46.823573 #2352526] INFO -- : building spec/ruby/optional/capi/ext/encoding_spec.so I, [2024-05-09T02:14:46.824101 #2352526] INFO -- : building spec/ruby/optional/capi/ext/enumerator_spec.so I, [2024-05-09T02:14:46.824361 #2352526] INFO -- : building spec/ruby/optional/capi/ext/exception_spec.so I, [2024-05-09T02:14:46.824942 #2352526] INFO -- : building spec/ruby/optional/capi/ext/fiber_spec.so I, [2024-05-09T02:14:46.825294 #2352526] INFO -- : building spec/ruby/optional/capi/ext/file_spec.so I, [2024-05-09T02:14:46.840647 #2352526] INFO -- : building spec/ruby/optional/capi/ext/fixnum_spec.so I, [2024-05-09T02:14:46.841994 #2352526] INFO -- : building spec/ruby/optional/capi/ext/float_spec.so I, [2024-05-09T02:14:46.941809 #2352526] INFO -- : building spec/ruby/optional/capi/ext/gc_spec.so I, [2024-05-09T02:14:46.969687 #2352526] INFO -- : building spec/ruby/optional/capi/ext/globals_spec.so I, [2024-05-09T02:14:46.971234 #2352526] INFO -- : building spec/ruby/optional/capi/ext/hash_spec.so I, [2024-05-09T02:14:46.981599 #2352526] INFO -- : building spec/ruby/optional/capi/ext/integer_spec.so I, [2024-05-09T02:14:46.982525 #2352526] INFO -- : building spec/ruby/optional/capi/ext/io_spec.so I, [2024-05-09T02:14:46.993239 #2352526] INFO -- : building spec/ruby/optional/capi/ext/kernel_spec.so I, [2024-05-09T02:14:46.998390 #2352526] INFO -- : building spec/ruby/optional/capi/ext/language_spec.so I, [2024-05-09T02:14:47.013300 #2352526] INFO -- : building spec/ruby/optional/capi/ext/marshal_spec.so I, [2024-05-09T02:14:47.013641 #2352526] INFO -- : building spec/ruby/optional/capi/ext/module_spec.so I, [2024-05-09T02:14:47.014236 #2352526] INFO -- : building spec/ruby/optional/capi/ext/module_under_autoload_spec.so I, [2024-05-09T02:14:47.015508 #2352526] INFO -- : building spec/ruby/optional/capi/ext/mutex_spec.so I, [2024-05-09T02:14:47.015619 #2352526] INFO -- : building spec/ruby/optional/capi/ext/numeric_spec.so I, [2024-05-09T02:14:47.016421 #2352526] INFO -- : building spec/ruby/optional/capi/ext/object_spec.so I, [2024-05-09T02:14:47.028567 #2352526] INFO -- : building spec/ruby/optional/capi/ext/proc_spec.so I, [2024-05-09T02:14:47.033926 #2352526] INFO -- : building spec/ruby/optional/capi/ext/range_spec.so I, [2024-05-09T02:14:47.051688 #2352526] INFO -- : building spec/ruby/optional/capi/ext/rational_spec.so I, [2024-05-09T02:14:47.062486 #2352526] INFO -- : building spec/ruby/optional/capi/ext/rbasic_spec.so I, [2024-05-09T02:14:47.091510 #2352526] INFO -- : building spec/ruby/optional/capi/ext/regexp_spec.so I, [2024-05-09T02:14:47.093938 #2352526] INFO -- : building spec/ruby/optional/capi/ext/string_spec.so I, [2024-05-09T02:14:47.119205 #2352526] INFO -- : building spec/ruby/optional/capi/ext/struct_spec.so I, [2024-05-09T02:14:47.155783 #2352526] INFO -- : building spec/ruby/optional/capi/ext/st_spec.so I, [2024-05-09T02:14:47.156391 #2352526] INFO -- : building spec/ruby/optional/capi/ext/symbol_spec.so I, [2024-05-09T02:14:47.158637 #2352526] INFO -- : building spec/ruby/optional/capi/ext/thread_spec.so I, [2024-05-09T02:14:47.161955 #2352526] INFO -- : building spec/ruby/optional/capi/ext/time_spec.so I, [2024-05-09T02:14:47.180315 #2352526] INFO -- : building spec/ruby/optional/capi/ext/tracepoint_spec.so I, [2024-05-09T02:14:47.184965 #2352526] INFO -- : building spec/ruby/optional/capi/ext/typed_data_spec.so I, [2024-05-09T02:14:47.186163 #2352526] INFO -- : building spec/ruby/optional/capi/ext/util_spec.so I, [2024-05-09T02:14:47.209976 #2352526] INFO -- : making enc I, [2024-05-09T02:14:47.233659 #2352526] INFO -- : making srcs under enc I, [2024-05-09T02:14:47.240158 #2352526] INFO -- : make[1]: Entering directory '/tmp/ruby/build/trunk' I, [2024-05-09T02:14:47.240214 #2352526] INFO -- : make[1]: Nothing to be done for 'enc'. I, [2024-05-09T02:14:47.240223 #2352526] INFO -- : make[1]: Leaving directory '/tmp/ruby/build/trunk' I, [2024-05-09T02:14:47.280939 #2352526] INFO -- : make[1]: Entering directory '/tmp/ruby/build/trunk' I, [2024-05-09T02:14:47.280953 #2352526] INFO -- : make[1]: Nothing to be done for 'srcs'. I, [2024-05-09T02:14:47.280960 #2352526] INFO -- : make[1]: Leaving directory '/tmp/ruby/build/trunk' I, [2024-05-09T02:14:47.281779 #2352526] INFO -- : generating transdb.h I, [2024-05-09T02:14:47.403461 #2352526] INFO -- : transdb.h unchanged I, [2024-05-09T02:14:47.404729 #2352526] INFO -- : generating makefiles ext/configure-ext.mk I, [2024-05-09T02:14:47.404940 #2352526] INFO -- : making trans I, [2024-05-09T02:14:47.431098 #2352526] INFO -- : ext/configure-ext.mk updated I, [2024-05-09T02:14:47.433337 #2352526] INFO -- : make[1]: Entering directory '/tmp/ruby/build/trunk' I, [2024-05-09T02:14:47.441615 #2352526] INFO -- : make[1]: Entering directory '/tmp/ruby/build/trunk' I, [2024-05-09T02:14:47.442535 #2352526] INFO -- : make[1]: Nothing to be done for 'trans'. I, [2024-05-09T02:14:47.442563 #2352526] INFO -- : make[1]: Leaving directory '/tmp/ruby/build/trunk' I, [2024-05-09T02:14:47.449700 #2352526] INFO -- : making encs I, [2024-05-09T02:14:47.509699 #2352526] INFO -- : make[1]: Entering directory '/tmp/ruby/build/trunk' I, [2024-05-09T02:14:47.509774 #2352526] INFO -- : make[1]: Nothing to be done for 'encs'. I, [2024-05-09T02:14:47.509798 #2352526] INFO -- : make[1]: Leaving directory '/tmp/ruby/build/trunk' I, [2024-05-09T02:14:47.590415 #2352526] INFO -- : make[1]: Leaving directory '/tmp/ruby/build/trunk' I, [2024-05-09T02:14:47.591044 #2352526] INFO -- : generating makefile exts.mk I, [2024-05-09T02:14:47.629549 #2352526] INFO -- : exts.mk unchanged I, [2024-05-09T02:14:47.634236 #2352526] INFO -- : make[1]: Entering directory '/tmp/ruby/build/trunk' I, [2024-05-09T02:14:47.654488 #2352526] INFO -- : make[2]: Entering directory '/tmp/ruby/build/trunk/ext/digest' I, [2024-05-09T02:14:47.656457 #2352526] INFO -- : make[2]: Entering directory '/tmp/ruby/build/trunk/ext/coverage' I, [2024-05-09T02:14:47.657144 #2352526] INFO -- : make[2]: Entering directory '/tmp/ruby/build/trunk/ext/date' I, [2024-05-09T02:14:47.657991 #2352526] INFO -- : make[2]: Entering directory '/tmp/ruby/build/trunk/ext/json' I, [2024-05-09T02:14:47.658543 #2352526] INFO -- : make[2]: Leaving directory '/tmp/ruby/build/trunk/ext/digest' I, [2024-05-09T02:14:47.658776 #2352526] INFO -- : make[2]: Entering directory '/tmp/ruby/build/trunk/ext/rubyvm' I, [2024-05-09T02:14:47.659313 #2352526] INFO -- : make[2]: Leaving directory '/tmp/ruby/build/trunk/ext/coverage' I, [2024-05-09T02:14:47.659861 #2352526] INFO -- : make[2]: Entering directory '/tmp/ruby/build/trunk/ext/io/console' I, [2024-05-09T02:14:47.659883 #2352526] INFO -- : make[2]: Entering directory '/tmp/ruby/build/trunk/ext/monitor' I, [2024-05-09T02:14:47.660361 #2352526] INFO -- : make[2]: Leaving directory '/tmp/ruby/build/trunk/ext/rubyvm' I, [2024-05-09T02:14:47.660920 #2352526] INFO -- : make[2]: Entering directory '/tmp/ruby/build/trunk/ext/pty' I, [2024-05-09T02:14:47.660940 #2352526] INFO -- : make[2]: Entering directory '/tmp/ruby/build/trunk/ext/pathname' I, [2024-05-09T02:14:47.661141 #2352526] INFO -- : make[2]: Leaving directory '/tmp/ruby/build/trunk/ext/date' I, [2024-05-09T02:14:47.661744 #2352526] INFO -- : make[2]: Entering directory '/tmp/ruby/build/trunk/ext/objspace' I, [2024-05-09T02:14:47.661893 #2352526] INFO -- : make[2]: Entering directory '/tmp/ruby/build/trunk/ext/fiddle' I, [2024-05-09T02:14:47.662400 #2352526] INFO -- : make[2]: Leaving directory '/tmp/ruby/build/trunk/ext/io/console' I, [2024-05-09T02:14:47.662488 #2352526] INFO -- : make[2]: Leaving directory '/tmp/ruby/build/trunk/ext/monitor' I, [2024-05-09T02:14:47.662616 #2352526] INFO -- : make[2]: Entering directory '/tmp/ruby/build/trunk/ext/psych' I, [2024-05-09T02:14:47.662977 #2352526] INFO -- : make[2]: Leaving directory '/tmp/ruby/build/trunk/ext/pathname' I, [2024-05-09T02:14:47.663718 #2352526] INFO -- : make[2]: Leaving directory '/tmp/ruby/build/trunk/ext/pty' I, [2024-05-09T02:14:47.664857 #2352526] INFO -- : make[2]: Leaving directory '/tmp/ruby/build/trunk/ext/json' I, [2024-05-09T02:14:47.665238 #2352526] INFO -- : make[2]: Leaving directory '/tmp/ruby/build/trunk/ext/objspace' I, [2024-05-09T02:14:47.665341 #2352526] INFO -- : make[2]: Entering directory '/tmp/ruby/build/trunk/ext/ripper' I, [2024-05-09T02:14:47.665844 #2352526] INFO -- : make[2]: Entering directory '/tmp/ruby/build/trunk/.bundle/gems/bigdecimal-3.1.8/ext/bigdecimal' I, [2024-05-09T02:14:47.665915 #2352526] INFO -- : make[2]: Entering directory '/tmp/ruby/build/trunk/.bundle/gems/bigdecimal-3.1.7/ext/bigdecimal' I, [2024-05-09T02:14:47.665949 #2352526] INFO -- : make[2]: Entering directory '/tmp/ruby/build/trunk/.bundle/gems/racc-1.7.3/ext/racc/cparse' I, [2024-05-09T02:14:47.665964 #2352526] INFO -- : make[2]: Entering directory '/tmp/ruby/build/trunk/.bundle/gems/debug-1.9.2/ext/debug' I, [2024-05-09T02:14:47.665976 #2352526] INFO -- : make[2]: Entering directory '/tmp/ruby/build/trunk/.bundle/gems/nkf-0.2.0/ext/nkf' I, [2024-05-09T02:14:47.666735 #2352526] INFO -- : make[2]: Entering directory '/tmp/ruby/build/trunk/.bundle/gems/syslog-0.1.2/ext/syslog' I, [2024-05-09T02:14:47.666815 #2352526] INFO -- : make[2]: Entering directory '/tmp/ruby/build/trunk/.bundle/gems/rbs-3.4.4/ext/rbs_extension' I, [2024-05-09T02:14:47.668742 #2352526] INFO -- : make[2]: Leaving directory '/tmp/ruby/build/trunk/ext/fiddle' I, [2024-05-09T02:14:47.670626 #2352526] INFO -- : make[2]: Leaving directory '/tmp/ruby/build/trunk/ext/ripper' I, [2024-05-09T02:14:47.674044 #2352526] INFO -- : make[2]: Entering directory '/tmp/ruby/build/trunk/ext/digest/sha2' I, [2024-05-09T02:14:47.674403 #2352526] INFO -- : make[2]: Entering directory '/tmp/ruby/build/trunk/ext/socket' I, [2024-05-09T02:14:47.674579 #2352526] INFO -- : make[2]: Entering directory '/tmp/ruby/build/trunk/ext/openssl' I, [2024-05-09T02:14:47.675273 #2352526] INFO -- : make[2]: Leaving directory '/tmp/ruby/build/trunk/ext/psych' I, [2024-05-09T02:14:47.676260 #2352526] INFO -- : make[2]: Leaving directory '/tmp/ruby/build/trunk/ext/digest/sha2' I, [2024-05-09T02:14:47.683002 #2352526] INFO -- : make[2]: Leaving directory '/tmp/ruby/build/trunk/ext/socket' I, [2024-05-09T02:14:47.689302 #2352526] INFO -- : make[2]: Leaving directory '/tmp/ruby/build/trunk/.bundle/gems/bigdecimal-3.1.8/ext/bigdecimal' I, [2024-05-09T02:14:47.690417 #2352526] INFO -- : make[2]: Leaving directory '/tmp/ruby/build/trunk/.bundle/gems/syslog-0.1.2/ext/syslog' I, [2024-05-09T02:14:47.690451 #2352526] INFO -- : make[2]: Leaving directory '/tmp/ruby/build/trunk/.bundle/gems/debug-1.9.2/ext/debug' I, [2024-05-09T02:14:47.690843 #2352526] INFO -- : make[2]: Leaving directory '/tmp/ruby/build/trunk/ext/openssl' I, [2024-05-09T02:14:47.691216 #2352526] INFO -- : make[2]: Leaving directory '/tmp/ruby/build/trunk/.bundle/gems/nkf-0.2.0/ext/nkf' I, [2024-05-09T02:14:47.699014 #2352526] INFO -- : make[2]: Leaving directory '/tmp/ruby/build/trunk/.bundle/gems/bigdecimal-3.1.7/ext/bigdecimal' I, [2024-05-09T02:14:47.702553 #2352526] INFO -- : make[2]: Leaving directory '/tmp/ruby/build/trunk/.bundle/gems/racc-1.7.3/ext/racc/cparse' I, [2024-05-09T02:14:47.704423 #2352526] INFO -- : make[2]: Leaving directory '/tmp/ruby/build/trunk/.bundle/gems/rbs-3.4.4/ext/rbs_extension' I, [2024-05-09T02:14:47.729777 #2352526] INFO -- : make[2]: Entering directory '/tmp/ruby/build/trunk' I, [2024-05-09T02:14:47.795586 #2352526] INFO -- : linking ruby I, [2024-05-09T02:14:47.819186 #2352526] INFO -- : make[2]: Leaving directory '/tmp/ruby/build/trunk' I, [2024-05-09T02:14:47.819576 #2352526] INFO -- : make[1]: Leaving directory '/tmp/ruby/build/trunk' I, [2024-05-09T02:14:47.823332 #2352526] INFO -- : make[1]: Entering directory '/tmp/ruby/build/trunk' I, [2024-05-09T02:14:47.823394 #2352526] INFO -- : make[1]: Nothing to be done for 'note'. I, [2024-05-09T02:14:47.823410 #2352526] INFO -- : make[1]: Leaving directory '/tmp/ruby/build/trunk' I, [2024-05-09T02:14:47.824025 #2352526] INFO -- : $$$[end] "make all -j20" exit with 0. I, [2024-05-09T02:14:47.824197 #2352526] INFO -- : $$$[beg] make install -j20 I, [2024-05-09T02:14:47.886888 #2352526] INFO -- : Update minitest to ea9caafc0754b1d6236a490d59e624b53209734a I, [2024-05-09T02:14:47.887044 #2352526] INFO -- : Update power_assert to 84e85124c5014a139af39161d484156cfe87a9ed I, [2024-05-09T02:14:47.887696 #2352526] INFO -- : Update rbs to ba7872795d5de04adb8ff500c0e6afdc81a041dd I, [2024-05-09T02:14:47.887822 #2352526] INFO -- : Update typeprof to b19a6416da3a05d57fadd6ffdadb382b6d236ca5 I, [2024-05-09T02:14:47.888410 #2352526] INFO -- : echo ea9caafc0754b1d6236a490d59e624b53209734a | /bin/sh /tmp/ruby/src/trunk/tool/ifchange /tmp/ruby/src/trunk/.bundle/.timestamp/minitest.revision - I, [2024-05-09T02:14:47.888575 #2352526] INFO -- : echo 84e85124c5014a139af39161d484156cfe87a9ed | /bin/sh /tmp/ruby/src/trunk/tool/ifchange /tmp/ruby/src/trunk/.bundle/.timestamp/power_assert.revision - I, [2024-05-09T02:14:47.889408 #2352526] INFO -- : BASERUBY = /usr/bin/ruby --disable=gems I, [2024-05-09T02:14:47.889431 #2352526] INFO -- : CC = gcc I, [2024-05-09T02:14:47.889444 #2352526] INFO -- : LD = ld I, [2024-05-09T02:14:47.889456 #2352526] INFO -- : LDSHARED = gcc -shared I, [2024-05-09T02:14:47.889468 #2352526] INFO -- : CFLAGS = -O3 -fno-fast-math -ggdb3 -Wall -Wextra -Wdeprecated-declarations -Wdiv-by-zero -Wduplicated-cond -Wimplicit-function-declaration -Wimplicit-int -Wpointer-arith -Wwrite-strings -Wold-style-definition -Wimplicit-fallthrough=0 -Wmissing-noreturn -Wno-cast-function-type -Wno-constant-logical-operand -Wno-long-long -Wno-missing-field-initializers -Wno-overlength-strings -Wno-packed-bitfield-compat -Wno-parentheses-equality -Wno-self-assign -Wno-tautological-compare -Wno-unused-parameter -Wno-unused-value -Wsuggest-attribute=format -Wsuggest-attribute=noreturn -Wunused-variable -Wmisleading-indentation -Wundef -fPIC I, [2024-05-09T02:14:47.889481 #2352526] INFO -- : XCFLAGS = -U_FORTIFY_SOURCE -D_FORTIFY_SOURCE=2 -fstack-protector-strong -fno-strict-overflow -fvisibility=hidden -fexcess-precision=standard -DRUBY_EXPORT -I. -I.ext/include/x86_64-linux -I/tmp/ruby/src/trunk/include -I/tmp/ruby/src/trunk -I/tmp/ruby/src/trunk/prism -I/tmp/ruby/src/trunk/enc/unicode/15.0.0 I, [2024-05-09T02:14:47.889493 #2352526] INFO -- : CPPFLAGS = I, [2024-05-09T02:14:47.889505 #2352526] INFO -- : DLDFLAGS = -Wl,--compress-debug-sections=zlib -Wl,-soname,libruby.so.3.4 -fstack-protector-strong I, [2024-05-09T02:14:47.889516 #2352526] INFO -- : SOLIBS = -lz -lrt -lrt -lgmp -ldl -lcrypt -lm -lpthread I, [2024-05-09T02:14:47.889527 #2352526] INFO -- : LANG = en_US.UTF-8 I, [2024-05-09T02:14:47.889547 #2352526] INFO -- : LC_ALL = I, [2024-05-09T02:14:47.889558 #2352526] INFO -- : LC_CTYPE = I, [2024-05-09T02:14:47.889572 #2352526] INFO -- : MFLAGS = -j20 --jobserver-auth=4,5 I, [2024-05-09T02:14:47.889582 #2352526] INFO -- : RUSTC = no I, [2024-05-09T02:14:47.889592 #2352526] INFO -- : YJIT_RUSTC_ARGS = --crate-name=yjit --crate-type=staticlib --edition=2021 -g -C lto=thin -C opt-level=3 -C overflow-checks=on '--out-dir=/tmp/ruby/build/trunk/yjit/target/release/' /tmp/ruby/src/trunk/yjit/src/lib.rs I, [2024-05-09T02:14:47.890380 #2352526] INFO -- : /tmp/ruby/src/trunk/.bundle/.timestamp/power_assert.revision unchanged I, [2024-05-09T02:14:47.890506 #2352526] INFO -- : /tmp/ruby/src/trunk/.bundle/.timestamp/minitest.revision unchanged I, [2024-05-09T02:14:47.915137 #2352526] INFO -- : echo ba7872795d5de04adb8ff500c0e6afdc81a041dd | /bin/sh /tmp/ruby/src/trunk/tool/ifchange /tmp/ruby/src/trunk/.bundle/.timestamp/rbs.revision - I, [2024-05-09T02:14:47.915195 #2352526] INFO -- : echo b19a6416da3a05d57fadd6ffdadb382b6d236ca5 | /bin/sh /tmp/ruby/src/trunk/tool/ifchange /tmp/ruby/src/trunk/.bundle/.timestamp/typeprof.revision - I, [2024-05-09T02:14:47.916033 #2352526] INFO -- : gcc (Ubuntu 11.4.0-1ubuntu1~22.04) 11.4.0 I, [2024-05-09T02:14:47.916088 #2352526] INFO -- : Copyright (C) 2021 Free Software Foundation, Inc. I, [2024-05-09T02:14:47.916102 #2352526] INFO -- : This is free software; see the source for copying conditions. There is NO I, [2024-05-09T02:14:47.916113 #2352526] INFO -- : warranty; not even for MERCHANTABILITY or FITNESS FOR A PARTICULAR PURPOSE. I, [2024-05-09T02:14:47.916225 #2352526] INFO -- : I, [2024-05-09T02:14:47.916240 #2352526] INFO -- : generating enc.mk I, [2024-05-09T02:14:47.917150 #2352526] INFO -- : /tmp/ruby/src/trunk/.bundle/.timestamp/rbs.revision unchanged I, [2024-05-09T02:14:47.917340 #2352526] INFO -- : /tmp/ruby/src/trunk/.bundle/.timestamp/typeprof.revision unchanged I, [2024-05-09T02:14:48.039276 #2352526] INFO -- : Building power_assert@84e85124c5014a139af39161d484156cfe87a9ed to /tmp/ruby/src/trunk/gems/power_assert-2.0.3.gem I, [2024-05-09T02:14:48.040023 #2352526] INFO -- : making srcs under enc I, [2024-05-09T02:14:48.040082 #2352526] INFO -- : making enc I, [2024-05-09T02:14:48.056876 #2352526] INFO -- : make[1]: Entering directory '/tmp/ruby/build/trunk' I, [2024-05-09T02:14:48.056926 #2352526] INFO -- : make[1]: Nothing to be done for 'enc'. I, [2024-05-09T02:14:48.056939 #2352526] INFO -- : make[1]: Leaving directory '/tmp/ruby/build/trunk' I, [2024-05-09T02:14:48.069210 #2352526] INFO -- : make[1]: Entering directory '/tmp/ruby/build/trunk' I, [2024-05-09T02:14:48.069274 #2352526] INFO -- : make[1]: Nothing to be done for 'srcs'. I, [2024-05-09T02:14:48.069292 #2352526] INFO -- : make[1]: Leaving directory '/tmp/ruby/build/trunk' I, [2024-05-09T02:14:48.069949 #2352526] INFO -- : generating transdb.h I, [2024-05-09T02:14:48.107937 #2352526] INFO -- : Successfully built RubyGem I, [2024-05-09T02:14:48.108007 #2352526] INFO -- : Name: power_assert I, [2024-05-09T02:14:48.108026 #2352526] INFO -- : Version: 2.0.4dev I, [2024-05-09T02:14:48.108042 #2352526] INFO -- : File: power_assert-2.0.4dev.gem I, [2024-05-09T02:14:48.110259 #2352526] INFO -- : Extracting bundle gem power_assert-2.0.3... I, [2024-05-09T02:14:48.164667 #2352526] INFO -- : transdb.h unchanged I, [2024-05-09T02:14:48.166195 #2352526] INFO -- : generating makefiles ext/configure-ext.mk I, [2024-05-09T02:14:48.166361 #2352526] INFO -- : making trans I, [2024-05-09T02:14:48.172430 #2352526] INFO -- : Try with hash version of bundled gems instead of gems/power_assert-2.0.3.gem. We don't use this gem with release version of Ruby. I, [2024-05-09T02:14:48.177400 #2352526] INFO -- : Unpacked gems/power_assert-2.0.4dev.gem I, [2024-05-09T02:14:48.192703 #2352526] INFO -- : ext/configure-ext.mk unchanged I, [2024-05-09T02:14:48.195379 #2352526] INFO -- : make[1]: Entering directory '/tmp/ruby/build/trunk' I, [2024-05-09T02:14:48.201355 #2352526] INFO -- : make[1]: Entering directory '/tmp/ruby/build/trunk' I, [2024-05-09T02:14:48.201446 #2352526] INFO -- : make[1]: Nothing to be done for 'trans'. I, [2024-05-09T02:14:48.201456 #2352526] INFO -- : make[1]: Leaving directory '/tmp/ruby/build/trunk' I, [2024-05-09T02:14:48.202398 #2352526] INFO -- : making encs I, [2024-05-09T02:14:48.260479 #2352526] INFO -- : make[1]: Entering directory '/tmp/ruby/build/trunk' I, [2024-05-09T02:14:48.260552 #2352526] INFO -- : make[1]: Nothing to be done for 'encs'. I, [2024-05-09T02:14:48.260579 #2352526] INFO -- : make[1]: Leaving directory '/tmp/ruby/build/trunk' I, [2024-05-09T02:14:48.353475 #2352526] INFO -- : make[1]: Leaving directory '/tmp/ruby/build/trunk' I, [2024-05-09T02:14:48.354228 #2352526] INFO -- : generating makefile exts.mk I, [2024-05-09T02:14:48.391825 #2352526] INFO -- : exts.mk unchanged I, [2024-05-09T02:14:48.396734 #2352526] INFO -- : make[1]: Entering directory '/tmp/ruby/build/trunk' I, [2024-05-09T02:14:48.415486 #2352526] INFO -- : make[2]: Entering directory '/tmp/ruby/build/trunk/ext/digest' I, [2024-05-09T02:14:48.417214 #2352526] INFO -- : make[2]: Entering directory '/tmp/ruby/build/trunk/ext/coverage' I, [2024-05-09T02:14:48.417767 #2352526] INFO -- : make[2]: Entering directory '/tmp/ruby/build/trunk/ext/json' I, [2024-05-09T02:14:48.417924 #2352526] INFO -- : make[2]: Entering directory '/tmp/ruby/build/trunk/ext/date' I, [2024-05-09T02:14:48.418486 #2352526] INFO -- : make[2]: Entering directory '/tmp/ruby/build/trunk/ext/io/console' I, [2024-05-09T02:14:48.419033 #2352526] INFO -- : make[2]: Leaving directory '/tmp/ruby/build/trunk/ext/digest' I, [2024-05-09T02:14:48.419648 #2352526] INFO -- : make[2]: Entering directory '/tmp/ruby/build/trunk/ext/rubyvm' I, [2024-05-09T02:14:48.419670 #2352526] INFO -- : make[2]: Entering directory '/tmp/ruby/build/trunk/ext/monitor' I, [2024-05-09T02:14:48.420258 #2352526] INFO -- : make[2]: Entering directory '/tmp/ruby/build/trunk/ext/pathname' I, [2024-05-09T02:14:48.420285 #2352526] INFO -- : make[2]: Leaving directory '/tmp/ruby/build/trunk/ext/coverage' I, [2024-05-09T02:14:48.420659 #2352526] INFO -- : make[2]: Entering directory '/tmp/ruby/build/trunk/ext/fiddle' I, [2024-05-09T02:14:48.421085 #2352526] INFO -- : make[2]: Entering directory '/tmp/ruby/build/trunk/ext/pty' I, [2024-05-09T02:14:48.421514 #2352526] INFO -- : make[2]: Leaving directory '/tmp/ruby/build/trunk/ext/rubyvm' I, [2024-05-09T02:14:48.421746 #2352526] INFO -- : make[2]: Leaving directory '/tmp/ruby/build/trunk/ext/date' I, [2024-05-09T02:14:48.421778 #2352526] INFO -- : make[2]: Leaving directory '/tmp/ruby/build/trunk/ext/io/console' I, [2024-05-09T02:14:48.421888 #2352526] INFO -- : make[2]: Entering directory '/tmp/ruby/build/trunk/ext/objspace' I, [2024-05-09T02:14:48.422093 #2352526] INFO -- : make[2]: Entering directory '/tmp/ruby/build/trunk/ext/psych' I, [2024-05-09T02:14:48.422703 #2352526] INFO -- : make[2]: Leaving directory '/tmp/ruby/build/trunk/ext/pathname' I, [2024-05-09T02:14:48.423618 #2352526] INFO -- : make[2]: Leaving directory '/tmp/ruby/build/trunk/ext/pty' I, [2024-05-09T02:14:48.423764 #2352526] INFO -- : make[2]: Entering directory '/tmp/ruby/build/trunk/.bundle/gems/bigdecimal-3.1.7/ext/bigdecimal' I, [2024-05-09T02:14:48.424668 #2352526] INFO -- : make[2]: Entering directory '/tmp/ruby/build/trunk/.bundle/gems/bigdecimal-3.1.8/ext/bigdecimal' I, [2024-05-09T02:14:48.425234 #2352526] INFO -- : make[2]: Leaving directory '/tmp/ruby/build/trunk/ext/objspace' I, [2024-05-09T02:14:48.425673 #2352526] INFO -- : make[2]: Leaving directory '/tmp/ruby/build/trunk/ext/json' I, [2024-05-09T02:14:48.426035 #2352526] INFO -- : make[2]: Entering directory '/tmp/ruby/build/trunk/ext/ripper' I, [2024-05-09T02:14:48.426048 #2352526] INFO -- : make[2]: Leaving directory '/tmp/ruby/build/trunk/ext/monitor' I, [2024-05-09T02:14:48.426246 #2352526] INFO -- : make[2]: Leaving directory '/tmp/ruby/build/trunk/ext/fiddle' I, [2024-05-09T02:14:48.427434 #2352526] INFO -- : make[2]: Entering directory '/tmp/ruby/build/trunk/.bundle/gems/nkf-0.2.0/ext/nkf' I, [2024-05-09T02:14:48.427977 #2352526] INFO -- : make[2]: Entering directory '/tmp/ruby/build/trunk/.bundle/gems/debug-1.9.2/ext/debug' I, [2024-05-09T02:14:48.428563 #2352526] INFO -- : make[2]: Entering directory '/tmp/ruby/build/trunk/.bundle/gems/racc-1.7.3/ext/racc/cparse' I, [2024-05-09T02:14:48.428747 #2352526] INFO -- : make[2]: Entering directory '/tmp/ruby/build/trunk/.bundle/gems/syslog-0.1.2/ext/syslog' I, [2024-05-09T02:14:48.429078 #2352526] INFO -- : make[2]: Entering directory '/tmp/ruby/build/trunk/.bundle/gems/rbs-3.4.4/ext/rbs_extension' I, [2024-05-09T02:14:48.430037 #2352526] INFO -- : make[2]: Entering directory '/tmp/ruby/build/trunk/ext/openssl' I, [2024-05-09T02:14:48.430417 #2352526] INFO -- : make[2]: Entering directory '/tmp/ruby/build/trunk/ext/socket' I, [2024-05-09T02:14:48.431034 #2352526] INFO -- : make[2]: Leaving directory '/tmp/ruby/build/trunk/ext/ripper' I, [2024-05-09T02:14:48.432905 #2352526] INFO -- : make[2]: Leaving directory '/tmp/ruby/build/trunk/ext/psych' I, [2024-05-09T02:14:48.436179 #2352526] INFO -- : make[2]: Entering directory '/tmp/ruby/build/trunk/ext/digest/sha2' I, [2024-05-09T02:14:48.438492 #2352526] INFO -- : make[2]: Leaving directory '/tmp/ruby/build/trunk/ext/digest/sha2' I, [2024-05-09T02:14:48.439010 #2352526] INFO -- : make[2]: Leaving directory '/tmp/ruby/build/trunk/ext/socket' I, [2024-05-09T02:14:48.443136 #2352526] INFO -- : make[2]: Leaving directory '/tmp/ruby/build/trunk/ext/openssl' I, [2024-05-09T02:14:48.451642 #2352526] INFO -- : make[2]: Leaving directory '/tmp/ruby/build/trunk/.bundle/gems/syslog-0.1.2/ext/syslog' I, [2024-05-09T02:14:48.451881 #2352526] INFO -- : make[2]: Leaving directory '/tmp/ruby/build/trunk/.bundle/gems/racc-1.7.3/ext/racc/cparse' I, [2024-05-09T02:14:48.454266 #2352526] INFO -- : make[2]: Leaving directory '/tmp/ruby/build/trunk/.bundle/gems/bigdecimal-3.1.8/ext/bigdecimal' I, [2024-05-09T02:14:48.454695 #2352526] INFO -- : make[2]: Leaving directory '/tmp/ruby/build/trunk/.bundle/gems/rbs-3.4.4/ext/rbs_extension' I, [2024-05-09T02:14:48.456758 #2352526] INFO -- : make[2]: Leaving directory '/tmp/ruby/build/trunk/.bundle/gems/bigdecimal-3.1.7/ext/bigdecimal' I, [2024-05-09T02:14:48.460562 #2352526] INFO -- : make[2]: Leaving directory '/tmp/ruby/build/trunk/.bundle/gems/nkf-0.2.0/ext/nkf' I, [2024-05-09T02:14:48.461730 #2352526] INFO -- : make[2]: Leaving directory '/tmp/ruby/build/trunk/.bundle/gems/debug-1.9.2/ext/debug' I, [2024-05-09T02:14:48.486247 #2352526] INFO -- : make[2]: Entering directory '/tmp/ruby/build/trunk' I, [2024-05-09T02:14:48.552610 #2352526] INFO -- : make[2]: 'ruby' is up to date. I, [2024-05-09T02:14:48.552646 #2352526] INFO -- : make[2]: Leaving directory '/tmp/ruby/build/trunk' I, [2024-05-09T02:14:48.552859 #2352526] INFO -- : make[1]: Leaving directory '/tmp/ruby/build/trunk' I, [2024-05-09T02:14:48.556788 #2352526] INFO -- : make[1]: Entering directory '/tmp/ruby/build/trunk' I, [2024-05-09T02:14:48.556810 #2352526] INFO -- : make[1]: Nothing to be done for 'note'. I, [2024-05-09T02:14:48.556820 #2352526] INFO -- : make[1]: Leaving directory '/tmp/ruby/build/trunk' I, [2024-05-09T02:14:48.557111 #2352526] INFO -- : ./miniruby -I/tmp/ruby/src/trunk/lib -I. -I.ext/common /tmp/ruby/src/trunk/tool/runruby.rb --extout=.ext -- --disable-gems -r./x86_64-linux-fake /tmp/ruby/src/trunk/tool/rbinstall.rb --make="make" --dest-dir="" --extout=".ext" --ext-build-dir="./ext" --mflags="-j20 --jobserver-auth=4,5" --make-flags=" -j20 --jobserver-auth=4,5" --data-mode=0644 --prog-mode=0755 --installed-list .installed.list --mantype="doc" --gnumake --install=all --exclude=doc I, [2024-05-09T02:14:48.653998 #2352526] INFO -- : Installing to I, [2024-05-09T02:14:48.654058 #2352526] INFO -- : installing binary commands: /tmp/ruby/install/trunk/bin I, [2024-05-09T02:14:48.654147 #2352526] INFO -- : installing base libraries: /tmp/ruby/install/trunk/lib I, [2024-05-09T02:14:48.661682 #2352526] INFO -- : installing arch files: /tmp/ruby/install/trunk/lib/ruby/3.4.0+0/x86_64-linux I, [2024-05-09T02:14:48.661709 #2352526] INFO -- : installing pkgconfig data: /tmp/ruby/install/trunk/lib/pkgconfig I, [2024-05-09T02:14:48.661714 #2352526] INFO -- : installing extension objects: /tmp/ruby/install/trunk/lib/ruby/3.4.0+0/x86_64-linux I, [2024-05-09T02:14:48.671619 #2352526] INFO -- : installing extension objects: /tmp/ruby/install/trunk/lib/ruby/site_ruby/3.4.0+0/x86_64-linux I, [2024-05-09T02:14:48.671640 #2352526] INFO -- : installing extension objects: /tmp/ruby/install/trunk/lib/ruby/vendor_ruby/3.4.0+0/x86_64-linux I, [2024-05-09T02:14:48.671646 #2352526] INFO -- : installing extension headers: /tmp/ruby/install/trunk/include/ruby-3.4.0+0/x86_64-linux I, [2024-05-09T02:14:48.671808 #2352526] INFO -- : installing extension scripts: /tmp/ruby/install/trunk/lib/ruby/3.4.0+0 I, [2024-05-09T02:14:48.675653 #2352526] INFO -- : installing extension scripts: /tmp/ruby/install/trunk/lib/ruby/site_ruby/3.4.0+0 I, [2024-05-09T02:14:48.675674 #2352526] INFO -- : installing extension scripts: /tmp/ruby/install/trunk/lib/ruby/vendor_ruby/3.4.0+0 I, [2024-05-09T02:14:48.675680 #2352526] INFO -- : installing extension headers: /tmp/ruby/install/trunk/include/ruby-3.4.0+0/ruby I, [2024-05-09T02:14:48.675684 #2352526] INFO -- : installing command scripts: /tmp/ruby/install/trunk/bin I, [2024-05-09T02:14:48.675689 #2352526] INFO -- : installing library scripts: /tmp/ruby/install/trunk/lib/ruby/3.4.0+0 I, [2024-05-09T02:14:48.709992 #2352526] INFO -- : installing common headers: /tmp/ruby/install/trunk/include/ruby-3.4.0+0 I, [2024-05-09T02:14:48.715440 #2352526] INFO -- : installing manpages: /tmp/ruby/install/trunk/share/man/man1 I, [2024-05-09T02:14:48.715553 #2352526] INFO -- : installing default gems from lib: /tmp/ruby/install/trunk/lib/ruby/gems/3.4.0+0 I, [2024-05-09T02:14:48.738128 #2352526] INFO -- : benchmark 0.3.0 I, [2024-05-09T02:14:48.745063 #2352526] INFO -- : bundler 2.6.0.dev I, [2024-05-09T02:14:48.747135 #2352526] INFO -- : cgi 0.4.1 I, [2024-05-09T02:14:48.747668 #2352526] INFO -- : delegate 0.3.1 I, [2024-05-09T02:14:48.748153 #2352526] INFO -- : did_you_mean 1.6.3 I, [2024-05-09T02:14:48.748624 #2352526] INFO -- : english 0.8.0 I, [2024-05-09T02:14:48.749091 #2352526] INFO -- : erb 4.0.4 I, [2024-05-09T02:14:48.749824 #2352526] INFO -- : error_highlight 0.6.0 I, [2024-05-09T02:14:48.750289 #2352526] INFO -- : fileutils 1.7.2 I, [2024-05-09T02:14:48.750743 #2352526] INFO -- : find 0.2.0 I, [2024-05-09T02:14:48.751120 #2352526] INFO -- : forwardable 1.3.3 I, [2024-05-09T02:14:48.751551 #2352526] INFO -- : ipaddr 1.2.6 I, [2024-05-09T02:14:48.752094 #2352526] INFO -- : irb 1.13.1 I, [2024-05-09T02:14:48.753563 #2352526] INFO -- : logger 1.6.0 I, [2024-05-09T02:14:48.754131 #2352526] INFO -- : net-http 0.4.1 I, [2024-05-09T02:14:48.754657 #2352526] INFO -- : net-protocol 0.2.2 I, [2024-05-09T02:14:48.755169 #2352526] INFO -- : open-uri 0.4.1 I, [2024-05-09T02:14:48.755681 #2352526] INFO -- : open3 0.2.1 I, [2024-05-09T02:14:48.756096 #2352526] INFO -- : optparse 0.5.0 I, [2024-05-09T02:14:48.756668 #2352526] INFO -- : ostruct 0.6.0 I, [2024-05-09T02:14:48.757207 #2352526] INFO -- : pp 0.5.0 I, [2024-05-09T02:14:48.757588 #2352526] INFO -- : prettyprint 0.2.0 I, [2024-05-09T02:14:48.758069 #2352526] INFO -- : prism 0.28.0 I, [2024-05-09T02:14:48.758654 #2352526] INFO -- : pstore 0.1.3 I, [2024-05-09T02:14:48.759085 #2352526] INFO -- : rdoc 6.6.3.1 I, [2024-05-09T02:14:48.760758 #2352526] INFO -- : readline 0.0.4 I, [2024-05-09T02:14:48.761259 #2352526] INFO -- : reline 0.5.5 I, [2024-05-09T02:14:48.761773 #2352526] INFO -- : resolv 0.4.0 I, [2024-05-09T02:14:48.762239 #2352526] INFO -- : ruby2_keywords 0.0.5 I, [2024-05-09T02:14:48.762626 #2352526] INFO -- : securerandom 0.3.1 I, [2024-05-09T02:14:48.763090 #2352526] INFO -- : set 1.1.0 I, [2024-05-09T02:14:48.763687 #2352526] INFO -- : shellwords 0.2.0 I, [2024-05-09T02:14:48.764160 #2352526] INFO -- : singleton 0.2.0 I, [2024-05-09T02:14:48.764609 #2352526] INFO -- : syntax_suggest 2.0.0 I, [2024-05-09T02:14:48.765318 #2352526] INFO -- : tempfile 0.2.1 I, [2024-05-09T02:14:48.765784 #2352526] INFO -- : time 0.3.0 I, [2024-05-09T02:14:48.766645 #2352526] INFO -- : timeout 0.4.1 I, [2024-05-09T02:14:48.767345 #2352526] INFO -- : tmpdir 0.2.0 I, [2024-05-09T02:14:48.767844 #2352526] INFO -- : tsort 0.2.0 I, [2024-05-09T02:14:48.768262 #2352526] INFO -- : un 0.3.0 I, [2024-05-09T02:14:48.768806 #2352526] INFO -- : uri 0.13.0 I, [2024-05-09T02:14:48.769373 #2352526] INFO -- : weakref 0.1.3 I, [2024-05-09T02:14:48.769905 #2352526] INFO -- : yaml 0.3.0 I, [2024-05-09T02:14:48.770329 #2352526] INFO -- : installing default gems from ext: /tmp/ruby/install/trunk/lib/ruby/gems/3.4.0+0 I, [2024-05-09T02:14:48.777030 #2352526] INFO -- : date 3.3.4 I, [2024-05-09T02:14:48.777557 #2352526] INFO -- : digest 3.1.1 I, [2024-05-09T02:14:48.778027 #2352526] INFO -- : etc 1.4.3 I, [2024-05-09T02:14:48.778606 #2352526] INFO -- : fcntl 1.1.0 I, [2024-05-09T02:14:48.779159 #2352526] INFO -- : fiddle 1.1.3 I, [2024-05-09T02:14:48.779641 #2352526] INFO -- : io-console 0.7.2 I, [2024-05-09T02:14:48.780129 #2352526] INFO -- : io-nonblock 0.3.0 I, [2024-05-09T02:14:48.780599 #2352526] INFO -- : io-wait 0.3.1 I, [2024-05-09T02:14:48.780935 #2352526] INFO -- : json 2.7.2 I, [2024-05-09T02:14:48.782057 #2352526] INFO -- : openssl 3.2.0 I, [2024-05-09T02:14:48.782658 #2352526] INFO -- : pathname 0.3.0 I, [2024-05-09T02:14:48.783155 #2352526] INFO -- : psych 5.1.2 I, [2024-05-09T02:14:48.783704 #2352526] INFO -- : stringio 3.1.1 I, [2024-05-09T02:14:48.784211 #2352526] INFO -- : strscan 3.1.1 I, [2024-05-09T02:14:48.784941 #2352526] INFO -- : zlib 3.1.0 I, [2024-05-09T02:14:48.785279 #2352526] INFO -- : installing bundled gems: /tmp/ruby/install/trunk/lib/ruby/gems/3.4.0+0 I, [2024-05-09T02:14:48.785601 #2352526] INFO -- : minitest 5.22.3 I, [2024-05-09T02:14:48.793020 #2352526] INFO -- : rake 13.2.1 I, [2024-05-09T02:14:48.796481 #2352526] INFO -- : test-unit 3.6.2 I, [2024-05-09T02:14:48.800957 #2352526] INFO -- : rexml 3.2.6 I, [2024-05-09T02:14:48.804444 #2352526] INFO -- : rss 0.3.0 I, [2024-05-09T02:14:48.807479 #2352526] INFO -- : net-ftp 0.3.4 I, [2024-05-09T02:14:48.809099 #2352526] INFO -- : net-imap 0.4.10 I, [2024-05-09T02:14:48.811982 #2352526] INFO -- : net-pop 0.1.2 I, [2024-05-09T02:14:48.812925 #2352526] INFO -- : net-smtp 0.5.0 I, [2024-05-09T02:14:48.814039 #2352526] INFO -- : matrix 0.4.2 I, [2024-05-09T02:14:48.817585 #2352526] INFO -- : prime 0.1.2 I, [2024-05-09T02:14:48.823568 #2352526] INFO -- : rbs 3.4.4 I, [2024-05-09T02:14:48.846161 #2352526] INFO -- : typeprof 0.21.11 I, [2024-05-09T02:14:48.848779 #2352526] INFO -- : debug 1.9.2 I, [2024-05-09T02:14:48.851485 #2352526] INFO -- : racc 1.7.3 I, [2024-05-09T02:14:48.853963 #2352526] INFO -- : mutex_m 0.2.0 I, [2024-05-09T02:14:48.855094 #2352526] INFO -- : getoptlong 0.2.1 I, [2024-05-09T02:14:48.856560 #2352526] INFO -- : base64 0.2.0 I, [2024-05-09T02:14:48.857673 #2352526] INFO -- : bigdecimal 3.1.8 I, [2024-05-09T02:14:48.859631 #2352526] INFO -- : observer 0.1.2 I, [2024-05-09T02:14:48.861141 #2352526] INFO -- : abbrev 0.1.2 I, [2024-05-09T02:14:48.862167 #2352526] INFO -- : resolv-replace 0.1.1 I, [2024-05-09T02:14:48.863499 #2352526] INFO -- : rinda 0.2.0 I, [2024-05-09T02:14:48.864698 #2352526] INFO -- : drb 2.2.1 I, [2024-05-09T02:14:48.866324 #2352526] INFO -- : nkf 0.2.0 I, [2024-05-09T02:14:48.869185 #2352526] INFO -- : syslog 0.1.2 I, [2024-05-09T02:14:48.870742 #2352526] INFO -- : csv 3.3.0 I, [2024-05-09T02:14:48.872871 #2352526] INFO -- : installing bundled gem cache: /tmp/ruby/install/trunk/lib/ruby/gems/3.4.0+0/cache I, [2024-05-09T02:14:48.874327 #2352526] INFO -- : skipped bundled gems: I, [2024-05-09T02:14:48.874348 #2352526] INFO -- : power_assert-2.0.4dev.gem not found in bundled_gems I, [2024-05-09T02:14:48.877769 #2352526] INFO -- : $$$[end] "make install -j20" exit with 0. I, [2024-05-09T02:14:48.877888 #2352526] INFO -- : $$$[beg] make yes-btest TESTOPTS='-q -j20' I, [2024-05-09T02:14:54.819710 #2352526] INFO -- : PASS all 1936 tests E, [2024-05-09T02:14:54.825144 #2352526] ERROR -- : I, [2024-05-09T02:14:54.825417 #2352526] INFO -- : $$$[end] "make yes-btest TESTOPTS='-q -j20'" exit with 0. I, [2024-05-09T02:14:54.825519 #2352526] INFO -- : $$$[beg] make yes-test-basic TESTS='-j20' I, [2024-05-09T02:14:54.884667 #2352526] INFO -- : BASERUBY = /usr/bin/ruby --disable=gems I, [2024-05-09T02:14:54.884701 #2352526] INFO -- : CC = gcc I, [2024-05-09T02:14:54.884708 #2352526] INFO -- : LD = ld I, [2024-05-09T02:14:54.884715 #2352526] INFO -- : LDSHARED = gcc -shared I, [2024-05-09T02:14:54.884724 #2352526] INFO -- : CFLAGS = -O3 -fno-fast-math -ggdb3 -Wall -Wextra -Wdeprecated-declarations -Wdiv-by-zero -Wduplicated-cond -Wimplicit-function-declaration -Wimplicit-int -Wpointer-arith -Wwrite-strings -Wold-style-definition -Wimplicit-fallthrough=0 -Wmissing-noreturn -Wno-cast-function-type -Wno-constant-logical-operand -Wno-long-long -Wno-missing-field-initializers -Wno-overlength-strings -Wno-packed-bitfield-compat -Wno-parentheses-equality -Wno-self-assign -Wno-tautological-compare -Wno-unused-parameter -Wno-unused-value -Wsuggest-attribute=format -Wsuggest-attribute=noreturn -Wunused-variable -Wmisleading-indentation -Wundef -fPIC I, [2024-05-09T02:14:54.884738 #2352526] INFO -- : XCFLAGS = -U_FORTIFY_SOURCE -D_FORTIFY_SOURCE=2 -fstack-protector-strong -fno-strict-overflow -fvisibility=hidden -fexcess-precision=standard -DRUBY_EXPORT -I. -I.ext/include/x86_64-linux -I/tmp/ruby/src/trunk/include -I/tmp/ruby/src/trunk -I/tmp/ruby/src/trunk/prism -I/tmp/ruby/src/trunk/enc/unicode/15.0.0 I, [2024-05-09T02:14:54.884745 #2352526] INFO -- : CPPFLAGS = I, [2024-05-09T02:14:54.884752 #2352526] INFO -- : DLDFLAGS = -Wl,--compress-debug-sections=zlib -Wl,-soname,libruby.so.3.4 -fstack-protector-strong I, [2024-05-09T02:14:54.884757 #2352526] INFO -- : SOLIBS = -lz -lrt -lrt -lgmp -ldl -lcrypt -lm -lpthread I, [2024-05-09T02:14:54.884763 #2352526] INFO -- : LANG = en_US.UTF-8 I, [2024-05-09T02:14:54.884768 #2352526] INFO -- : LC_ALL = I, [2024-05-09T02:14:54.884774 #2352526] INFO -- : LC_CTYPE = I, [2024-05-09T02:14:54.884779 #2352526] INFO -- : MFLAGS = I, [2024-05-09T02:14:54.884785 #2352526] INFO -- : RUSTC = no I, [2024-05-09T02:14:54.884791 #2352526] INFO -- : YJIT_RUSTC_ARGS = --crate-name=yjit --crate-type=staticlib --edition=2021 -g -C lto=thin -C opt-level=3 -C overflow-checks=on '--out-dir=/tmp/ruby/build/trunk/yjit/target/release/' /tmp/ruby/src/trunk/yjit/src/lib.rs I, [2024-05-09T02:14:54.885301 #2352526] INFO -- : gcc (Ubuntu 11.4.0-1ubuntu1~22.04) 11.4.0 I, [2024-05-09T02:14:54.885310 #2352526] INFO -- : Copyright (C) 2021 Free Software Foundation, Inc. I, [2024-05-09T02:14:54.885316 #2352526] INFO -- : This is free software; see the source for copying conditions. There is NO I, [2024-05-09T02:14:54.885322 #2352526] INFO -- : warranty; not even for MERCHANTABILITY or FITNESS FOR A PARTICULAR PURPOSE. I, [2024-05-09T02:14:54.885328 #2352526] INFO -- : I, [2024-05-09T02:14:54.989988 #2352526] INFO -- : Checking leaked global symbols...none I, [2024-05-09T02:14:55.031252 #2352526] INFO -- : /tmp/ruby/src/trunk/basictest/test.rb:assignment ....................................................................................................................................................................................................................................................................................................................................................................................OK 372 I, [2024-05-09T02:14:55.031294 #2352526] INFO -- : /tmp/ruby/src/trunk/basictest/test.rb:condition ..OK 2 I, [2024-05-09T02:14:55.031305 #2352526] INFO -- : /tmp/ruby/src/trunk/basictest/test.rb:if/unless ...OK 3 I, [2024-05-09T02:14:55.031325 #2352526] INFO -- : /tmp/ruby/src/trunk/basictest/test.rb:case .....OK 5 I, [2024-05-09T02:14:55.031554 #2352526] INFO -- : /tmp/ruby/src/trunk/basictest/test.rb:while/until ........OK 8 I, [2024-05-09T02:14:55.031609 #2352526] INFO -- : /tmp/ruby/src/trunk/basictest/test.rb:exception ..........OK 10 I, [2024-05-09T02:14:55.031878 #2352526] INFO -- : /tmp/ruby/src/trunk/basictest/test.rb:array .......................................OK 39 I, [2024-05-09T02:14:55.031980 #2352526] INFO -- : /tmp/ruby/src/trunk/basictest/test.rb:hash ...........................OK 27 I, [2024-05-09T02:14:55.032704 #2352526] INFO -- : /tmp/ruby/src/trunk/basictest/test.rb:iterator ...........................................................................................................OK 107 I, [2024-05-09T02:14:55.032988 #2352526] INFO -- : /tmp/ruby/src/trunk/basictest/test.rb:float ................................................................................OK 80 I, [2024-05-09T02:14:55.033993 #2352526] INFO -- : /tmp/ruby/src/trunk/basictest/test.rb:bignum ...............................OK 31 I, [2024-05-09T02:14:55.034767 #2352526] INFO -- : /tmp/ruby/src/trunk/basictest/test.rb:string & char ..............................................................OK 62 I, [2024-05-09T02:14:55.034798 #2352526] INFO -- : /tmp/ruby/src/trunk/basictest/test.rb:assignment ..........OK 10 I, [2024-05-09T02:14:55.034825 #2352526] INFO -- : /tmp/ruby/src/trunk/basictest/test.rb:call ......OK 6 I, [2024-05-09T02:14:55.034879 #2352526] INFO -- : /tmp/ruby/src/trunk/basictest/test.rb:proc .........OK 9 I, [2024-05-09T02:14:55.135089 #2352526] INFO -- : /tmp/ruby/src/trunk/basictest/test.rb:signal ..OK 2 I, [2024-05-09T02:14:55.135616 #2352526] INFO -- : /tmp/ruby/src/trunk/basictest/test.rb:eval ...........................OK 27 I, [2024-05-09T02:14:55.237303 #2352526] INFO -- : /tmp/ruby/src/trunk/basictest/test.rb:system ........OK 8 I, [2024-05-09T02:14:55.237352 #2352526] INFO -- : /tmp/ruby/src/trunk/basictest/test.rb:const .....OK 5 I, [2024-05-09T02:14:55.237419 #2352526] INFO -- : /tmp/ruby/src/trunk/basictest/test.rb:clone .....OK 5 I, [2024-05-09T02:14:55.237560 #2352526] INFO -- : /tmp/ruby/src/trunk/basictest/test.rb:marshal ....OK 4 I, [2024-05-09T02:14:55.237611 #2352526] INFO -- : /tmp/ruby/src/trunk/basictest/test.rb:pack ....OK 4 I, [2024-05-09T02:14:55.237627 #2352526] INFO -- : /tmp/ruby/src/trunk/basictest/test.rb:math ..OK 2 I, [2024-05-09T02:14:55.237676 #2352526] INFO -- : /tmp/ruby/src/trunk/basictest/test.rb:struct ......OK 6 I, [2024-05-09T02:14:55.237768 #2352526] INFO -- : /tmp/ruby/src/trunk/basictest/test.rb:variable ............OK 12 I, [2024-05-09T02:14:55.237792 #2352526] INFO -- : /tmp/ruby/src/trunk/basictest/test.rb:trace ...OK 3 I, [2024-05-09T02:14:55.237847 #2352526] INFO -- : /tmp/ruby/src/trunk/basictest/test.rb:defined? ............OK 12 I, [2024-05-09T02:14:55.237889 #2352526] INFO -- : /tmp/ruby/src/trunk/basictest/test.rb:alias ......OK 6 I, [2024-05-09T02:14:55.238244 #2352526] INFO -- : /tmp/ruby/src/trunk/basictest/test.rb:path .......................OK 23 I, [2024-05-09T02:14:55.271634 #2352526] INFO -- : /tmp/ruby/src/trunk/basictest/test.rb:gc ....OK 4 I, [2024-05-09T02:14:55.273928 #2352526] INFO -- : I, [2024-05-09T02:14:55.273938 #2352526] INFO -- : test succeeded I, [2024-05-09T02:14:55.275614 #2352526] INFO -- : $$$[end] "make yes-test-basic TESTS='-j20'" exit with 0. I, [2024-05-09T02:14:55.275711 #2352526] INFO -- : $$$[beg] make yes-test-all TESTOPTS='--stderr-on-failure' TESTS='-j20' I, [2024-05-09T02:14:55.361234 #2352526] INFO -- : BASERUBY = /usr/bin/ruby --disable=gems I, [2024-05-09T02:14:55.361281 #2352526] INFO -- : CC = gcc I, [2024-05-09T02:14:55.361294 #2352526] INFO -- : LD = ld I, [2024-05-09T02:14:55.361305 #2352526] INFO -- : LDSHARED = gcc -shared I, [2024-05-09T02:14:55.361316 #2352526] INFO -- : CFLAGS = -O3 -fno-fast-math -ggdb3 -Wall -Wextra -Wdeprecated-declarations -Wdiv-by-zero -Wduplicated-cond -Wimplicit-function-declaration -Wimplicit-int -Wpointer-arith -Wwrite-strings -Wold-style-definition -Wimplicit-fallthrough=0 -Wmissing-noreturn -Wno-cast-function-type -Wno-constant-logical-operand -Wno-long-long -Wno-missing-field-initializers -Wno-overlength-strings -Wno-packed-bitfield-compat -Wno-parentheses-equality -Wno-self-assign -Wno-tautological-compare -Wno-unused-parameter -Wno-unused-value -Wsuggest-attribute=format -Wsuggest-attribute=noreturn -Wunused-variable -Wmisleading-indentation -Wundef -fPIC I, [2024-05-09T02:14:55.361327 #2352526] INFO -- : XCFLAGS = -U_FORTIFY_SOURCE -D_FORTIFY_SOURCE=2 -fstack-protector-strong -fno-strict-overflow -fvisibility=hidden -fexcess-precision=standard -DRUBY_EXPORT -I. -I.ext/include/x86_64-linux -I/tmp/ruby/src/trunk/include -I/tmp/ruby/src/trunk -I/tmp/ruby/src/trunk/prism -I/tmp/ruby/src/trunk/enc/unicode/15.0.0 I, [2024-05-09T02:14:55.361337 #2352526] INFO -- : CPPFLAGS = I, [2024-05-09T02:14:55.361348 #2352526] INFO -- : DLDFLAGS = -Wl,--compress-debug-sections=zlib -Wl,-soname,libruby.so.3.4 -fstack-protector-strong I, [2024-05-09T02:14:55.361369 #2352526] INFO -- : SOLIBS = -lz -lrt -lrt -lgmp -ldl -lcrypt -lm -lpthread I, [2024-05-09T02:14:55.361380 #2352526] INFO -- : LANG = en_US.UTF-8 I, [2024-05-09T02:14:55.361390 #2352526] INFO -- : LC_ALL = I, [2024-05-09T02:14:55.361401 #2352526] INFO -- : LC_CTYPE = I, [2024-05-09T02:14:55.361411 #2352526] INFO -- : MFLAGS = I, [2024-05-09T02:14:55.361421 #2352526] INFO -- : RUSTC = no I, [2024-05-09T02:14:55.361431 #2352526] INFO -- : YJIT_RUSTC_ARGS = --crate-name=yjit --crate-type=staticlib --edition=2021 -g -C lto=thin -C opt-level=3 -C overflow-checks=on '--out-dir=/tmp/ruby/build/trunk/yjit/target/release/' /tmp/ruby/src/trunk/yjit/src/lib.rs I, [2024-05-09T02:14:55.361920 #2352526] INFO -- : gcc (Ubuntu 11.4.0-1ubuntu1~22.04) 11.4.0 I, [2024-05-09T02:14:55.361968 #2352526] INFO -- : Copyright (C) 2021 Free Software Foundation, Inc. I, [2024-05-09T02:14:55.361981 #2352526] INFO -- : This is free software; see the source for copying conditions. There is NO I, [2024-05-09T02:14:55.361998 #2352526] INFO -- : warranty; not even for MERCHANTABILITY or FITNESS FOR A PARTICULAR PURPOSE. I, [2024-05-09T02:14:55.362008 #2352526] INFO -- : I, [2024-05-09T02:14:55.363586 #2352526] INFO -- : generating enc.mk I, [2024-05-09T02:14:55.481249 #2352526] INFO -- : making enc I, [2024-05-09T02:14:55.498408 #2352526] INFO -- : make[1]: Entering directory '/tmp/ruby/build/trunk' I, [2024-05-09T02:14:55.498468 #2352526] INFO -- : make[1]: Nothing to be done for 'enc'. I, [2024-05-09T02:14:55.498482 #2352526] INFO -- : make[1]: Leaving directory '/tmp/ruby/build/trunk' I, [2024-05-09T02:14:55.499200 #2352526] INFO -- : making srcs under enc I, [2024-05-09T02:14:55.529006 #2352526] INFO -- : make[1]: Entering directory '/tmp/ruby/build/trunk' I, [2024-05-09T02:14:55.529066 #2352526] INFO -- : make[1]: Nothing to be done for 'srcs'. I, [2024-05-09T02:14:55.529086 #2352526] INFO -- : make[1]: Leaving directory '/tmp/ruby/build/trunk' I, [2024-05-09T02:14:55.529936 #2352526] INFO -- : generating transdb.h I, [2024-05-09T02:14:55.625010 #2352526] INFO -- : transdb.h unchanged I, [2024-05-09T02:14:55.626432 #2352526] INFO -- : making trans I, [2024-05-09T02:14:55.660688 #2352526] INFO -- : make[1]: Entering directory '/tmp/ruby/build/trunk' I, [2024-05-09T02:14:55.660747 #2352526] INFO -- : make[1]: Nothing to be done for 'trans'. I, [2024-05-09T02:14:55.660760 #2352526] INFO -- : make[1]: Leaving directory '/tmp/ruby/build/trunk' I, [2024-05-09T02:14:55.661407 #2352526] INFO -- : making encs I, [2024-05-09T02:14:55.698550 #2352526] INFO -- : make[1]: Entering directory '/tmp/ruby/build/trunk' I, [2024-05-09T02:14:55.698610 #2352526] INFO -- : make[1]: Nothing to be done for 'encs'. I, [2024-05-09T02:14:55.698630 #2352526] INFO -- : make[1]: Leaving directory '/tmp/ruby/build/trunk' I, [2024-05-09T02:14:55.700365 #2352526] INFO -- : generating makefiles ext/configure-ext.mk I, [2024-05-09T02:14:55.727432 #2352526] INFO -- : ext/configure-ext.mk updated I, [2024-05-09T02:14:55.729911 #2352526] INFO -- : make[1]: Entering directory '/tmp/ruby/build/trunk' I, [2024-05-09T02:14:57.126665 #2352526] INFO -- : make[1]: Leaving directory '/tmp/ruby/build/trunk' I, [2024-05-09T02:14:57.127350 #2352526] INFO -- : generating makefile exts.mk I, [2024-05-09T02:14:57.164536 #2352526] INFO -- : exts.mk unchanged I, [2024-05-09T02:14:57.169188 #2352526] INFO -- : make[1]: Entering directory '/tmp/ruby/build/trunk' I, [2024-05-09T02:14:57.379821 #2352526] INFO -- : make[2]: Entering directory '/tmp/ruby/build/trunk/ext/coverage' I, [2024-05-09T02:14:57.382732 #2352526] INFO -- : make[2]: Leaving directory '/tmp/ruby/build/trunk/ext/coverage' I, [2024-05-09T02:14:57.386617 #2352526] INFO -- : make[2]: Entering directory '/tmp/ruby/build/trunk/ext/date' I, [2024-05-09T02:14:57.389731 #2352526] INFO -- : make[2]: Leaving directory '/tmp/ruby/build/trunk/ext/date' I, [2024-05-09T02:14:57.392018 #2352526] INFO -- : make[2]: Entering directory '/tmp/ruby/build/trunk/ext/digest' I, [2024-05-09T02:14:57.397254 #2352526] INFO -- : make[2]: Leaving directory '/tmp/ruby/build/trunk/ext/digest' I, [2024-05-09T02:14:57.412805 #2352526] INFO -- : make[2]: Entering directory '/tmp/ruby/build/trunk/ext/digest/sha2' I, [2024-05-09T02:14:57.415794 #2352526] INFO -- : make[2]: Leaving directory '/tmp/ruby/build/trunk/ext/digest/sha2' I, [2024-05-09T02:14:57.428525 #2352526] INFO -- : make[2]: Entering directory '/tmp/ruby/build/trunk/ext/fiddle' I, [2024-05-09T02:14:57.434841 #2352526] INFO -- : make[2]: Leaving directory '/tmp/ruby/build/trunk/ext/fiddle' I, [2024-05-09T02:14:57.437826 #2352526] INFO -- : make[2]: Entering directory '/tmp/ruby/build/trunk/ext/io/console' I, [2024-05-09T02:14:57.440460 #2352526] INFO -- : make[2]: Leaving directory '/tmp/ruby/build/trunk/ext/io/console' I, [2024-05-09T02:14:57.448183 #2352526] INFO -- : make[2]: Entering directory '/tmp/ruby/build/trunk/ext/json' I, [2024-05-09T02:14:57.454458 #2352526] INFO -- : make[2]: Leaving directory '/tmp/ruby/build/trunk/ext/json' I, [2024-05-09T02:14:57.463521 #2352526] INFO -- : make[2]: Entering directory '/tmp/ruby/build/trunk/ext/monitor' I, [2024-05-09T02:14:57.466009 #2352526] INFO -- : make[2]: Leaving directory '/tmp/ruby/build/trunk/ext/monitor' I, [2024-05-09T02:14:57.470199 #2352526] INFO -- : make[2]: Entering directory '/tmp/ruby/build/trunk/ext/objspace' I, [2024-05-09T02:14:57.473909 #2352526] INFO -- : make[2]: Leaving directory '/tmp/ruby/build/trunk/ext/objspace' I, [2024-05-09T02:14:57.485902 #2352526] INFO -- : make[2]: Entering directory '/tmp/ruby/build/trunk/ext/openssl' I, [2024-05-09T02:14:57.498982 #2352526] INFO -- : make[2]: Leaving directory '/tmp/ruby/build/trunk/ext/openssl' I, [2024-05-09T02:14:57.501919 #2352526] INFO -- : make[2]: Entering directory '/tmp/ruby/build/trunk/ext/pathname' I, [2024-05-09T02:14:57.504432 #2352526] INFO -- : make[2]: Leaving directory '/tmp/ruby/build/trunk/ext/pathname' I, [2024-05-09T02:14:57.508635 #2352526] INFO -- : make[2]: Entering directory '/tmp/ruby/build/trunk/ext/psych' I, [2024-05-09T02:14:57.523445 #2352526] INFO -- : make[2]: Leaving directory '/tmp/ruby/build/trunk/ext/psych' I, [2024-05-09T02:14:57.526469 #2352526] INFO -- : make[2]: Entering directory '/tmp/ruby/build/trunk/ext/pty' I, [2024-05-09T02:14:57.528940 #2352526] INFO -- : make[2]: Leaving directory '/tmp/ruby/build/trunk/ext/pty' I, [2024-05-09T02:14:57.538334 #2352526] INFO -- : make[2]: Entering directory '/tmp/ruby/build/trunk/ext/ripper' I, [2024-05-09T02:14:57.543280 #2352526] INFO -- : make[2]: Leaving directory '/tmp/ruby/build/trunk/ext/ripper' I, [2024-05-09T02:14:57.544830 #2352526] INFO -- : make[2]: Entering directory '/tmp/ruby/build/trunk/ext/rubyvm' I, [2024-05-09T02:14:57.546891 #2352526] INFO -- : make[2]: Leaving directory '/tmp/ruby/build/trunk/ext/rubyvm' I, [2024-05-09T02:14:57.554971 #2352526] INFO -- : make[2]: Entering directory '/tmp/ruby/build/trunk/ext/socket' I, [2024-05-09T02:14:57.561063 #2352526] INFO -- : make[2]: Leaving directory '/tmp/ruby/build/trunk/ext/socket' I, [2024-05-09T02:14:57.571962 #2352526] INFO -- : make[2]: Entering directory '/tmp/ruby/build/trunk/.bundle/gems/bigdecimal-3.1.7/ext/bigdecimal' I, [2024-05-09T02:14:57.594646 #2352526] INFO -- : make[2]: Leaving directory '/tmp/ruby/build/trunk/.bundle/gems/bigdecimal-3.1.7/ext/bigdecimal' I, [2024-05-09T02:14:57.596696 #2352526] INFO -- : make[2]: Entering directory '/tmp/ruby/build/trunk/.bundle/gems/bigdecimal-3.1.8/ext/bigdecimal' I, [2024-05-09T02:14:57.618851 #2352526] INFO -- : make[2]: Leaving directory '/tmp/ruby/build/trunk/.bundle/gems/bigdecimal-3.1.8/ext/bigdecimal' I, [2024-05-09T02:14:57.620824 #2352526] INFO -- : make[2]: Entering directory '/tmp/ruby/build/trunk/.bundle/gems/debug-1.9.2/ext/debug' I, [2024-05-09T02:14:57.643356 #2352526] INFO -- : make[2]: Leaving directory '/tmp/ruby/build/trunk/.bundle/gems/debug-1.9.2/ext/debug' I, [2024-05-09T02:14:57.645372 #2352526] INFO -- : make[2]: Entering directory '/tmp/ruby/build/trunk/.bundle/gems/nkf-0.2.0/ext/nkf' I, [2024-05-09T02:14:57.667123 #2352526] INFO -- : make[2]: Leaving directory '/tmp/ruby/build/trunk/.bundle/gems/nkf-0.2.0/ext/nkf' I, [2024-05-09T02:14:57.669071 #2352526] INFO -- : make[2]: Entering directory '/tmp/ruby/build/trunk/.bundle/gems/racc-1.7.3/ext/racc/cparse' I, [2024-05-09T02:14:57.690755 #2352526] INFO -- : make[2]: Leaving directory '/tmp/ruby/build/trunk/.bundle/gems/racc-1.7.3/ext/racc/cparse' I, [2024-05-09T02:14:57.693235 #2352526] INFO -- : make[2]: Entering directory '/tmp/ruby/build/trunk/.bundle/gems/rbs-3.4.4/ext/rbs_extension' I, [2024-05-09T02:14:57.715128 #2352526] INFO -- : make[2]: Leaving directory '/tmp/ruby/build/trunk/.bundle/gems/rbs-3.4.4/ext/rbs_extension' I, [2024-05-09T02:14:57.717102 #2352526] INFO -- : make[2]: Entering directory '/tmp/ruby/build/trunk/.bundle/gems/syslog-0.1.2/ext/syslog' I, [2024-05-09T02:14:57.739365 #2352526] INFO -- : make[2]: Leaving directory '/tmp/ruby/build/trunk/.bundle/gems/syslog-0.1.2/ext/syslog' I, [2024-05-09T02:14:57.762708 #2352526] INFO -- : make[2]: Entering directory '/tmp/ruby/build/trunk' I, [2024-05-09T02:14:57.826695 #2352526] INFO -- : make[2]: 'ruby' is up to date. I, [2024-05-09T02:14:57.826763 #2352526] INFO -- : make[2]: Leaving directory '/tmp/ruby/build/trunk' I, [2024-05-09T02:14:57.827006 #2352526] INFO -- : make[1]: Leaving directory '/tmp/ruby/build/trunk' I, [2024-05-09T02:14:57.830697 #2352526] INFO -- : make[1]: Entering directory '/tmp/ruby/build/trunk' I, [2024-05-09T02:14:57.830762 #2352526] INFO -- : make[1]: Nothing to be done for 'note'. I, [2024-05-09T02:14:57.830779 #2352526] INFO -- : make[1]: Leaving directory '/tmp/ruby/build/trunk' I, [2024-05-09T02:14:57.907005 #2352526] INFO -- : Run options: I, [2024-05-09T02:14:57.907083 #2352526] INFO -- : --seed=8926 I, [2024-05-09T02:14:57.907098 #2352526] INFO -- : "--ruby=./miniruby -I/tmp/ruby/src/trunk/lib -I. -I.ext/common /tmp/ruby/src/trunk/tool/runruby.rb --extout=.ext -- --disable-gems" I, [2024-05-09T02:14:57.907112 #2352526] INFO -- : --excludes-dir=/tmp/ruby/src/trunk/test/.excludes I, [2024-05-09T02:14:57.907123 #2352526] INFO -- : --name=!/memory_leak/ I, [2024-05-09T02:14:57.907134 #2352526] INFO -- : --stderr-on-failure I, [2024-05-09T02:14:57.907145 #2352526] INFO -- : -j20 I, [2024-05-09T02:14:57.907157 #2352526] INFO -- : I, [2024-05-09T02:14:57.907168 #2352526] INFO -- : # Running tests: I, [2024-05-09T02:14:57.907179 #2352526] INFO -- : I, [2024-05-09T02:14:58.054242 #2352526] INFO -- : [ 1/885] 2393927=test_whileuntil I, [2024-05-09T02:14:58.054805 #2352526] INFO -- : [ 2/885] 2393914=test_rdoc_generator_markup I, [2024-05-09T02:14:58.054819 #2352526] INFO -- : [ 3/885] 2393912=test_configuration I, [2024-05-09T02:14:58.054826 #2352526] INFO -- : [ 4/885] 2393910=test_rubyvm I, [2024-05-09T02:14:58.054833 #2352526] INFO -- : [ 5/885] 2393911=test_monitor I, [2024-05-09T02:14:58.056082 #2352526] INFO -- : [ 6/885] 2393913=test_buffered_io I, [2024-05-09T02:14:58.056974 #2352526] INFO -- : [ 7/885] 2393923=test_stringify_symbols I, [2024-05-09T02:14:58.057093 #2352526] INFO -- : [ 8/885] 2393927=test_instrumentation_api I, [2024-05-09T02:14:58.057425 #2352526] INFO -- : [ 9/885] 2393924=integer_parse_test I, [2024-05-09T02:14:58.058143 #2352526] INFO -- : [ 10/885] 2393926=test_boolean I, [2024-05-09T02:14:58.058174 #2352526] INFO -- : [ 11/885] 2393925=test_module I, [2024-05-09T02:14:58.058349 #2352526] INFO -- : [ 12/885] 2393928=test_gem_request_set I, [2024-05-09T02:14:58.072335 #2352526] INFO -- : [ 13/885] 2393910=constant_path_node_test I, [2024-05-09T02:14:58.079596 #2352526] INFO -- : [ 14/885] 2393923=test_ssl I, [2024-05-09T02:14:58.088303 #2352526] INFO -- : [ 15/885] 2393926=test_gem_ext_cargo_builder I, [2024-05-09T02:14:58.088364 #2352526] INFO -- : [ 16/885] 2393921=test_method_name_check I, [2024-05-09T02:14:58.088374 #2352526] INFO -- : [ 17/885] 2393915=test_arith_seq_extract I, [2024-05-09T02:14:58.088389 #2352526] INFO -- : [ 18/885] 2393916=test_parser I, [2024-05-09T02:14:58.088395 #2352526] INFO -- : [ 19/885] 2393918=test_len I, [2024-05-09T02:14:58.088401 #2352526] INFO -- : [ 20/885] 2393920=test_yield_block I, [2024-05-09T02:14:58.089399 #2352526] INFO -- : [ 21/885] 2393922=test_gem_commands_cert_command I, [2024-05-09T02:14:58.091820 #2352526] INFO -- : [ 22/885] 2393917=test_completion I, [2024-05-09T02:14:58.092695 #2352526] INFO -- : [ 23/885] 2393920=test_erb I, [2024-05-09T02:14:58.101669 #2352526] INFO -- : [ 24/885] 2393918=test_x509ext I, [2024-05-09T02:14:58.123231 #2352526] INFO -- : [ 25/885] 2393921=test_gem_source_installed I, [2024-05-09T02:14:58.125747 #2352526] INFO -- : [ 26/885] 2393924=test_assembler I, [2024-05-09T02:14:58.126838 #2352526] INFO -- : [ 27/885] 2393924=test_spell_checker I, [2024-05-09T02:14:58.131836 #2352526] INFO -- : [ 28/885] 2393919=attribute_write_test I, [2024-05-09T02:14:58.133924 #2352526] INFO -- : [ 29/885] 2393910=test_propertyputref I, [2024-05-09T02:14:58.135855 #2352526] INFO -- : [ 30/885] 2393924=test_rational I, [2024-05-09T02:14:58.136400 #2352526] INFO -- : [ 31/885] 2393910=test_rational2 I, [2024-05-09T02:14:58.137040 #2352526] INFO -- : [ 32/885] 2393918=test_gem_source I, [2024-05-09T02:14:58.140579 #2352526] INFO -- : [ 33/885] 2393916=test_scalar_scanner I, [2024-05-09T02:14:58.148704 #2352526] INFO -- : [ 34/885] 2393910=test_gem_commands_outdated_command I, [2024-05-09T02:14:58.156767 #2352526] INFO -- : [ 35/885] 2393924=test_array I, [2024-05-09T02:14:58.158726 #2352526] INFO -- : [ 36/885] 2393913=test_helper_method I, [2024-05-09T02:14:58.161433 #2352526] INFO -- : [ 37/885] 2393912=test_gem_package_tar_writer I, [2024-05-09T02:14:58.166946 #2352526] INFO -- : [ 38/885] 2393916=test_gem_dependency_list I, [2024-05-09T02:14:58.173014 #2352526] INFO -- : [ 39/885] 2393929=test_benchmark I, [2024-05-09T02:14:58.186037 #2352526] INFO -- : [ 40/885] 2393914=test_win32ole_method_event I, [2024-05-09T02:14:58.189592 #2352526] INFO -- : [ 41/885] 2393914=test_nesting_parser I, [2024-05-09T02:14:58.201288 #2352526] INFO -- : [ 42/885] 2393920=test_https I, [2024-05-09T02:14:58.222110 #2352526] INFO -- : [ 43/885] 2393919=test_gem_ext_builder I, [2024-05-09T02:14:58.242626 #2352526] INFO -- : [ 44/885] 2393913=test_evaluation I, [2024-05-09T02:14:58.242740 #2352526] INFO -- : [ 45/885] 2393913=test_abi I, [2024-05-09T02:14:58.289861 #2352526] INFO -- : [ 46/885] 2393911=test_provider I, [2024-05-09T02:14:58.290319 #2352526] INFO -- : [ 47/885] 2393915=test_rdoc_parser_simple I, [2024-05-09T02:14:58.311192 #2352526] INFO -- : [ 48/885] 2393914=test_load I, [2024-05-09T02:14:58.313534 #2352526] INFO -- : [ 49/885] 2393914=test_yamldbm I, [2024-05-09T02:14:58.317073 #2352526] INFO -- : [ 50/885] 2393926=test_gem_commands_rebuild_command I, [2024-05-09T02:14:58.339046 #2352526] INFO -- : [ 51/885] 2393914=test_debug I, [2024-05-09T02:14:58.347715 #2352526] INFO -- : [ 52/885] 2393914=pattern_test I, [2024-05-09T02:14:58.353879 #2352526] INFO -- : [ 53/885] 2393921=test_memory_view I, [2024-05-09T02:14:58.375842 #2352526] INFO -- : [ 54/885] 2393926=test_shellwords I, [2024-05-09T02:14:58.377661 #2352526] INFO -- : [ 55/885] 2393921=test_digest_extend I, [2024-05-09T02:14:58.379112 #2352526] INFO -- : [ 56/885] 2393926=test_iterator I, [2024-05-09T02:14:58.387306 #2352526] INFO -- : [ 57/885] 2393921=test_string I, [2024-05-09T02:14:58.388782 #2352526] INFO -- : [ 58/885] 2393912=test_omap I, [2024-05-09T02:14:58.390735 #2352526] INFO -- : [ 59/885] 2393921=test_gem_resolver_git_set I, [2024-05-09T02:14:58.411410 #2352526] INFO -- : [ 60/885] 2393912=test_storage I, [2024-05-09T02:14:58.413983 #2352526] INFO -- : [ 61/885] 2393912=test_new I, [2024-05-09T02:14:58.416391 #2352526] INFO -- : [ 62/885] 2393912=test_cipher I, [2024-05-09T02:14:58.417952 #2352526] INFO -- : [ 63/885] 2393910=test_gem_security_signer I, [2024-05-09T02:14:58.422117 #2352526] INFO -- : [ 64/885] 2393916=test_regex_casefold I, [2024-05-09T02:14:58.423078 #2352526] INFO -- : [ 65/885] 2393915=test_refinement I, [2024-05-09T02:14:58.439166 #2352526] INFO -- : [ 66/885] 2393913=test_gem_commands_signout_command I, [2024-05-09T02:14:58.462426 #2352526] INFO -- : [ 67/885] 2393926=test_gem_source_git I, [2024-05-09T02:14:58.471335 #2352526] INFO -- : [ 68/885] 2393914=test_dir_m17n I, [2024-05-09T02:14:58.472812 #2352526] INFO -- : [ 69/885] 2393912=test_gem_resolver_installer_set I, [2024-05-09T02:14:58.506781 #2352526] INFO -- : [ 70/885] 2393910=test_float I, [2024-05-09T02:14:58.528709 #2352526] INFO -- : [ 71/885] 2393918=test_require I, [2024-05-09T02:14:58.609420 #2352526] INFO -- : [ 72/885] 2393913=test_cgi_cookie I, [2024-05-09T02:14:58.623924 #2352526] INFO -- : [ 73/885] 2393913=test_process I, [2024-05-09T02:14:58.645522 #2352526] INFO -- : [ 74/885] 2393928=test_input_method I, [2024-05-09T02:14:58.647435 #2352526] INFO -- : [ 75/885] 2393913=test_windows_1252 I, [2024-05-09T02:14:58.649182 #2352526] INFO -- : [ 76/885] 2393912=test_rdoc_rd I, [2024-05-09T02:14:58.649759 #2352526] INFO -- : [ 77/885] 2393913=test_cgi_session I, [2024-05-09T02:14:58.662467 #2352526] INFO -- : [ 78/885] 2393920=test_rdoc_top_level I, [2024-05-09T02:14:58.669726 #2352526] INFO -- : [ 79/885] 2393913=test_metaclass I, [2024-05-09T02:14:58.676317 #2352526] INFO -- : [ 80/885] 2393913=test_fixnum I, [2024-05-09T02:14:58.694252 #2352526] INFO -- : [ 81/885] 2393913=test_signal I, [2024-05-09T02:14:58.737767 #2352526] INFO -- : [ 82/885] 2393911=test_x509crl I, [2024-05-09T02:14:58.773778 #2352526] INFO -- : [ 83/885] 2393921=test_insns_leaf I, [2024-05-09T02:14:58.778887 #2352526] INFO -- : [ 84/885] 2393921=test_serialize_subclasses I, [2024-05-09T02:14:58.785423 #2352526] INFO -- : [ 85/885] 2393921=test_color_printer I, [2024-05-09T02:14:58.793948 #2352526] INFO -- : [ 86/885] 2393912=test_deprecated I, [2024-05-09T02:14:58.796164 #2352526] INFO -- : [ 87/885] 2393912=test_allocation I, [2024-05-09T02:14:58.809091 #2352526] INFO -- : [ 88/885] 2393916=test_div I, [2024-05-09T02:14:58.814136 #2352526] INFO -- : [ 89/885] 2393916=test_win32ole_variant_m I, [2024-05-09T02:14:58.817850 #2352526] INFO -- : [ 90/885] 2393916=test_engine I, [2024-05-09T02:14:58.822123 #2352526] INFO -- : [ 91/885] 2393916=test_key_error I, [2024-05-09T02:14:58.844555 #2352526] INFO -- : [ 92/885] 2393916=test_mutex I, [2024-05-09T02:14:58.853557 #2352526] INFO -- : [ 93/885] 2393921=test_x509req I, [2024-05-09T02:14:58.885484 #2352526] INFO -- : [ 94/885] 2393911=test_rdoc_rd_inline I, [2024-05-09T02:14:58.919548 #2352526] INFO -- : [ 95/885] 2393928=test_files_test_1 I, [2024-05-09T02:14:58.925043 #2352526] INFO -- : [ 96/885] 2393917=test_set I, [2024-05-09T02:14:58.945531 #2352526] INFO -- : [ 97/885] 2393917=test_struct I, [2024-05-09T02:14:59.009518 #2352526] INFO -- : [ 98/885] 2393911=test_gem_path_support I, [2024-05-09T02:14:59.022569 #2352526] INFO -- : [ 99/885] 2393926=json_parser_test I, [2024-05-09T02:14:59.052838 #2352526] INFO -- : [100/885] 2393921=test_nomethod_error I, [2024-05-09T02:14:59.055166 #2352526] INFO -- : [101/885] 2393926=memsize_test I, [2024-05-09T02:14:59.061683 #2352526] INFO -- : [102/885] 2393921=test_config I, [2024-05-09T02:14:59.086058 #2352526] INFO -- : [103/885] 2393921=test_win32ole_variant_outarg I, [2024-05-09T02:14:59.089383 #2352526] INFO -- : [104/885] 2393921=test_gem_source_subpath_problem I, [2024-05-09T02:14:59.097122 #2352526] INFO -- : [105/885] 2393920=test_dln I, [2024-05-09T02:14:59.102004 #2352526] INFO -- : [106/885] 2393920=json_common_interface_test I, [2024-05-09T02:14:59.117496 #2352526] INFO -- : [107/885] 2393920=test_struct I, [2024-05-09T02:14:59.128537 #2352526] INFO -- : [108/885] 2393926=magic_comment_test I, [2024-05-09T02:14:59.131693 #2352526] INFO -- : [109/885] 2393926=test_rdoc_markup_to_html_snippet I, [2024-05-09T02:14:59.135903 #2352526] INFO -- : [110/885] 2393920=fuzzer_test I, [2024-05-09T02:14:59.149094 #2352526] INFO -- : [111/885] 2393911=test_sexp I, [2024-05-09T02:14:59.167493 #2352526] INFO -- : [112/885] 2393911=test_rdoc_markup_include I, [2024-05-09T02:14:59.171136 #2352526] INFO -- : [113/885] 2393911=test_variable I, [2024-05-09T02:14:59.187453 #2352526] INFO -- : [114/885] 2393920=test_pkg_config I, [2024-05-09T02:14:59.196554 #2352526] INFO -- : [115/885] 2393921=test_cparser I, [2024-05-09T02:14:59.223786 #2352526] INFO -- : [116/885] 2393920=test_rdoc_markup_heading I, [2024-05-09T02:14:59.225970 #2352526] INFO -- : [117/885] 2393920=test_exception_at_throwing I, [2024-05-09T02:14:59.242122 #2352526] INFO -- : [118/885] 2393911=test_iseq I, [2024-05-09T02:14:59.297983 #2352526] INFO -- : [119/885] 2393920=test_scheduler I, [2024-05-09T02:14:59.327771 #2352526] INFO -- : [120/885] 2393929=test_pkey_dsa I, [2024-05-09T02:14:59.343136 #2352526] INFO -- : [121/885] 2393926=test_ocsp I, [2024-05-09T02:14:59.389369 #2352526] INFO -- : [122/885] 2393919=test_class I, [2024-05-09T02:14:59.416762 #2352526] INFO -- : [123/885] 2393919=test_interned_str I, [2024-05-09T02:14:59.420780 #2352526] INFO -- : [124/885] 2393919=test_case_comprehensive I, [2024-05-09T02:14:59.453729 #2352526] INFO -- : [125/885] 2393920=test_gem_commands_build_command I, [2024-05-09T02:14:59.576225 #2352526] INFO -- : [126/885] 2393925=test_cmethod I, [2024-05-09T02:14:59.584632 #2352526] INFO -- : [127/885] 2393925=test_tracer I, [2024-05-09T02:14:59.630398 #2352526] INFO -- : [128/885] 2393917=test_append I, [2024-05-09T02:14:59.631791 #2352526] INFO -- : [129/885] 2393917=test_option I, [2024-05-09T02:14:59.653287 #2352526] INFO -- : [130/885] 2393926=test_gem_commands_server_command I, [2024-05-09T02:14:59.658313 #2352526] INFO -- : [131/885] 2393921=test_io_m17n I, [2024-05-09T02:14:59.664022 #2352526] INFO -- : [132/885] 2393926=test_variable_name_check I, [2024-05-09T02:14:59.709675 #2352526] INFO -- : [133/885] 2393925=test_did_you_mean I, [2024-05-09T02:14:59.714968 #2352526] INFO -- : [134/885] 2393922=test_exit I, [2024-05-09T02:14:59.720522 #2352526] INFO -- : [135/885] 2393911=test_recursion I, [2024-05-09T02:14:59.725354 #2352526] INFO -- : [136/885] 2393911=test_history I, [2024-05-09T02:14:59.733896 #2352526] INFO -- : [137/885] 2393926=test_mkmf I, [2024-05-09T02:14:59.736169 #2352526] INFO -- : [138/885] 2393917=test_date_marshal I, [2024-05-09T02:14:59.743647 #2352526] INFO -- : [139/885] 2393917=test_delegate I, [2024-05-09T02:14:59.756476 #2352526] INFO -- : [140/885] 2393917=test_popen_deadlock I, [2024-05-09T02:14:59.776373 #2352526] INFO -- : [141/885] 2393922=test_bundled_ca I, [2024-05-09T02:14:59.784415 #2352526] INFO -- : [142/885] 2393926=test_closure I, [2024-05-09T02:14:59.792634 #2352526] INFO -- : [143/885] 2393914=test_multi_irb_commands I, [2024-05-09T02:14:59.792852 #2352526] INFO -- : [144/885] 2393914=test_fiber I, [2024-05-09T02:14:59.836877 #2352526] INFO -- : [145/885] 2393925=test_open3 I, [2024-05-09T02:14:59.853379 #2352526] INFO -- : [146/885] 2393920=test_ractor I, [2024-05-09T02:14:59.866107 #2352526] INFO -- : [147/885] 2393911=test_rdoc_servlet I, [2024-05-09T02:14:59.916050 #2352526] INFO -- : [148/885] 2393920=test_gem_security I, [2024-05-09T02:14:59.960931 #2352526] INFO -- : [149/885] 2393910=test_digest I, [2024-05-09T02:14:59.971902 #2352526] INFO -- : [150/885] 2393910=test_help I, [2024-05-09T02:14:59.981334 #2352526] INFO -- : [151/885] 2393910=test_rdoc_markup_to_bs I, [2024-05-09T02:15:00.002196 #2352526] INFO -- : [152/885] 2393916=test_files_lib I, [2024-05-09T02:15:00.081249 #2352526] INFO -- : [153/885] 2393911=test_gem_commands_unpack_command I, [2024-05-09T02:15:00.133392 #2352526] INFO -- : [154/885] 2393926=test_beginendblock I, [2024-05-09T02:15:00.154227 #2352526] INFO -- : [155/885] 2393910=reflection_test I, [2024-05-09T02:15:00.154665 #2352526] INFO -- : [156/885] 2393910=test_emoji_breaks I, [2024-05-09T02:15:00.166221 #2352526] INFO -- : [157/885] 2393910=test_gem_bundler_version_finder I, [2024-05-09T02:15:00.187335 #2352526] INFO -- : [158/885] 2393910=test_within_pipe I, [2024-05-09T02:15:00.289575 #2352526] INFO -- : [159/885] 2393910=test_pinned I, [2024-05-09T02:15:00.320216 #2352526] INFO -- : [160/885] 2393910=test_to_ary_concat I, [2024-05-09T02:15:00.448273 #2352526] INFO -- : [161/885] 2393917=test_time I, [2024-05-09T02:15:00.497296 #2352526] INFO -- : [162/885] 2393911=test_webauthn_listener_response I, [2024-05-09T02:15:00.519476 #2352526] INFO -- : [163/885] 2393911=test_stream I, [2024-05-09T02:15:00.522957 #2352526] INFO -- : [164/885] 2393911=test_rdoc_markup_pre_process I, [2024-05-09T02:15:00.551956 #2352526] INFO -- : [165/885] 2393929=test_printf I, [2024-05-09T02:15:00.566031 #2352526] INFO -- : [166/885] 2393929=test_install I, [2024-05-09T02:15:00.588063 #2352526] INFO -- : [167/885] 2393926=test_rdoc_markup_to_label I, [2024-05-09T02:15:00.612590 #2352526] INFO -- : [168/885] 2393911=test_sockopt I, [2024-05-09T02:15:00.617202 #2352526] INFO -- : [169/885] 2393911=test_set_len I, [2024-05-09T02:15:00.622560 #2352526] INFO -- : [170/885] 2393911=test_httpresponses I, [2024-05-09T02:15:00.627323 #2352526] INFO -- : [171/885] 2393926=test_encoding I, [2024-05-09T02:15:00.633628 #2352526] INFO -- : [172/885] 2393917=test_httpheader I, [2024-05-09T02:15:00.653217 #2352526] INFO -- : [173/885] 2393926=test_gem_resolver_local_specification I, [2024-05-09T02:15:00.669403 #2352526] INFO -- : [174/885] 2393911=test_rdoc_ri_driver I, [2024-05-09T02:15:00.676807 #2352526] INFO -- : [175/885] 2393924=json_encoding_test I, [2024-05-09T02:15:00.681254 #2352526] INFO -- : [176/885] 2393924=test_color I, [2024-05-09T02:15:00.688553 #2352526] INFO -- : [177/885] 2393926=test_key_stroke I, [2024-05-09T02:15:00.701350 #2352526] INFO -- : [178/885] 2393917=test_rbconfig I, [2024-05-09T02:15:00.704166 #2352526] INFO -- : [179/885] 2393917=test_human_typo I, [2024-05-09T02:15:00.712590 #2352526] INFO -- : [180/885] 2393917=test_primitive I, [2024-05-09T02:15:00.732430 #2352526] INFO -- : [181/885] 2393917=test_chilled I, [2024-05-09T02:15:00.733076 #2352526] INFO -- : [182/885] 2393917=test_name_error_extension I, [2024-05-09T02:15:00.739749 #2352526] INFO -- : [183/885] 2393917=test_rdoc_i18n_locale I, [2024-05-09T02:15:00.760840 #2352526] INFO -- : [184/885] 2393926=test_pair I, [2024-05-09T02:15:00.781785 #2352526] INFO -- : [185/885] 2393924=test_win32ole_param I, [2024-05-09T02:15:00.787281 #2352526] INFO -- : [186/885] 2393924=test_gem_commands_yank_command I, [2024-05-09T02:15:00.856267 #2352526] INFO -- : [187/885] 2393929=test_document I, [2024-05-09T02:15:00.878732 #2352526] INFO -- : [188/885] 2393929=test_acceptable I, [2024-05-09T02:15:00.888907 #2352526] INFO -- : [189/885] 2393917=test_rdoc_generator_pot_po_entry I, [2024-05-09T02:15:00.892231 #2352526] INFO -- : [190/885] 2393917=test_euc_jp I, [2024-05-09T02:15:00.896316 #2352526] INFO -- : [191/885] 2393917=test_enumerator I, [2024-05-09T02:15:00.903776 #2352526] INFO -- : [192/885] 2393917=test_rdoc_parser_changelog I, [2024-05-09T02:15:00.935890 #2352526] INFO -- : [193/885] 2393913=parameters_signature_test I, [2024-05-09T02:15:00.948610 #2352526] INFO -- : [194/885] 2393921=test_koi8 I, [2024-05-09T02:15:00.961354 #2352526] INFO -- : [195/885] 2393910=test_unicode I, [2024-05-09T02:15:00.964988 #2352526] INFO -- : [196/885] 2393921=test_rdoc_generator_pot I, [2024-05-09T02:15:00.991461 #2352526] INFO -- : [197/885] 2393917=test_filter I, [2024-05-09T02:15:00.994001 #2352526] INFO -- : [198/885] 2393910=test_gem_gem_runner I, [2024-05-09T02:15:01.023199 #2352526] INFO -- : [199/885] 2393927=test_data I, [2024-05-09T02:15:01.026238 #2352526] INFO -- : [200/885] 2393927=static_literals_test I, [2024-05-09T02:15:01.030465 #2352526] INFO -- : [201/885] 2393913=test_rdoc_method_attr I, [2024-05-09T02:15:01.040985 #2352526] INFO -- : [202/885] 2393917=test_gem_uri I, [2024-05-09T02:15:01.046394 #2352526] INFO -- : [203/885] 2393910=test_key_event_record I, [2024-05-09T02:15:01.046874 #2352526] INFO -- : [204/885] 2393910=test_notimplement I, [2024-05-09T02:15:01.049827 #2352526] INFO -- : [205/885] 2393911=test_random I, [2024-05-09T02:15:01.051195 #2352526] INFO -- : [206/885] 2393910=test_gem_resolver_vendor_specification I, [2024-05-09T02:15:01.058875 #2352526] INFO -- : [207/885] 2393929=test_gem_commands_update_command I, [2024-05-09T02:15:01.060158 #2352526] INFO -- : [208/885] 2393911=test_ssl_session I, [2024-05-09T02:15:01.085913 #2352526] INFO -- : [209/885] 2393910=test_lexer I, [2024-05-09T02:15:01.090737 #2352526] INFO -- : [210/885] 2393927=test_thread_cv I, [2024-05-09T02:15:01.097238 #2352526] INFO -- : [211/885] 2393915=test_terminfo I, [2024-05-09T02:15:01.110047 #2352526] INFO -- : [212/885] 2393910=test_compile_prism I, [2024-05-09T02:15:01.136077 #2352526] INFO -- : [213/885] 2393915=test_date_compat I, [2024-05-09T02:15:01.137775 #2352526] INFO -- : [214/885] 2393915=test_rdoc_markup_to_html I, [2024-05-09T02:15:01.153273 #2352526] INFO -- : [215/885] 2393918=test_bug-14834 I, [2024-05-09T02:15:01.184974 #2352526] INFO -- : [216/885] 2393921=test_http I, [2024-05-09T02:15:01.200125 #2352526] INFO -- : [217/885] 2393915=test_addrinfo I, [2024-05-09T02:15:01.221079 #2352526] INFO -- : [218/885] 2393915=test_tree_spell_checker I, [2024-05-09T02:15:01.226507 #2352526] INFO -- : [219/885] 2393918=test_path I, [2024-05-09T02:15:01.232560 #2352526] INFO -- : [220/885] 2393918=redundant_return_test I, [2024-05-09T02:15:01.241362 #2352526] INFO -- : [221/885] 2393917=test_case_mapping I, [2024-05-09T02:15:01.257628 #2352526] INFO -- : [222/885] 2393917=test_bn I, [2024-05-09T02:15:01.259231 #2352526] INFO -- : [223/885] 2393912=test_win32ole_param_event I, [2024-05-09T02:15:01.261399 #2352526] INFO -- : [224/885] 2393912=test_logger I, [2024-05-09T02:15:01.269324 #2352526] INFO -- : [225/885] 2393915=test_file_exhaustive I, [2024-05-09T02:15:01.278997 #2352526] INFO -- : [226/885] 2393912=test_gem_update_suggestion I, [2024-05-09T02:15:01.298651 #2352526] INFO -- : [227/885] 2393917=test_files_test I, [2024-05-09T02:15:01.323756 #2352526] INFO -- : [228/885] 2393918=test_rdoc_parser_markdown I, [2024-05-09T02:15:01.342600 #2352526] INFO -- : [229/885] 2393912=test_gem_resolver_lock_set I, [2024-05-09T02:15:01.357816 #2352526] INFO -- : [230/885] 2393912=test_not I, [2024-05-09T02:15:01.360842 #2352526] INFO -- : [231/885] 2393912=test_import I, [2024-05-09T02:15:01.381776 #2352526] INFO -- : [232/885] 2393913=test_gem_platform I, [2024-05-09T02:15:01.387041 #2352526] INFO -- : [233/885] 2393910=test_date_strptime I, [2024-05-09T02:15:01.426065 #2352526] INFO -- : [234/885] 2393917=test_gem_package_task I, [2024-05-09T02:15:01.429692 #2352526] INFO -- : [235/885] 2393917=test_placearg I, [2024-05-09T02:15:01.434497 #2352526] INFO -- : [236/885] 2393913=test_rdoc_markup_hard_break I, [2024-05-09T02:15:01.436619 #2352526] INFO -- : [237/885] 2393913=test_weakkeymap I, [2024-05-09T02:15:01.450179 #2352526] INFO -- : [238/885] 2393924=test_gem_commands_push_command I, [2024-05-09T02:15:01.463452 #2352526] INFO -- : [239/885] 2393910=test_numhash I, [2024-05-09T02:15:01.464500 #2352526] INFO -- : [240/885] 2393910=test_pkey_rsa I, [2024-05-09T02:15:01.516357 #2352526] INFO -- : [241/885] 2393918=test_class_name_check I, [2024-05-09T02:15:01.531825 #2352526] INFO -- : [242/885] 2393917=test_keyword I, [2024-05-09T02:15:01.542010 #2352526] INFO -- : [243/885] 2393918=test_fd_setsize I, [2024-05-09T02:15:01.543704 #2352526] INFO -- : [244/885] 2393918=test_continuation I, [2024-05-09T02:15:01.549343 #2352526] INFO -- : [245/885] 2393918=test_win32ole_method I, [2024-05-09T02:15:01.552617 #2352526] INFO -- : [246/885] 2393918=test_delete I, [2024-05-09T02:15:01.561431 #2352526] INFO -- : [247/885] 2393918=test_sleep I, [2024-05-09T02:15:01.620991 #2352526] INFO -- : [248/885] 2393913=test_date_arith I, [2024-05-09T02:15:01.626950 #2352526] INFO -- : [249/885] 2393913=test_ruby_lex I, [2024-05-09T02:15:01.647855 #2352526] INFO -- : [250/885] 2393928=test_object I, [2024-05-09T02:15:01.708231 #2352526] INFO -- : [251/885] 2393913=test_gem_local_remote_options I, [2024-05-09T02:15:01.732885 #2352526] INFO -- : [252/885] 2393913=test_timeout I, [2024-05-09T02:15:01.739649 #2352526] INFO -- : [253/885] 2393913=test_normalize I, [2024-05-09T02:15:01.745446 #2352526] INFO -- : [254/885] 2393927=test_ossl I, [2024-05-09T02:15:01.753064 #2352526] INFO -- : [255/885] 2393913=test_change_word I, [2024-05-09T02:15:01.767055 #2352526] INFO -- : [256/885] 2393913=compiler_test I, [2024-05-09T02:15:01.775246 #2352526] INFO -- : [257/885] 2393913=test_flip I, [2024-05-09T02:15:01.777851 #2352526] INFO -- : [258/885] 2393910=test_signedness I, [2024-05-09T02:15:01.801957 #2352526] INFO -- : [259/885] 2393913=test_tsort I, [2024-05-09T02:15:01.810097 #2352526] INFO -- : [260/885] 2393913=test_rdoc_rd_block_parser I, [2024-05-09T02:15:01.861223 #2352526] INFO -- : [261/885] 2393913=test_pointer I, [2024-05-09T02:15:01.864993 #2352526] INFO -- : [262/885] 2393922=test_big5 I, [2024-05-09T02:15:01.866901 #2352526] INFO -- : [263/885] 2393922=test_func I, [2024-05-09T02:15:01.938043 #2352526] INFO -- : [264/885] 2393912=test_ractor I, [2024-05-09T02:15:01.970672 #2352526] INFO -- : [265/885] 2393917=test_type I, [2024-05-09T02:15:01.976938 #2352526] INFO -- : [266/885] 2393917=version_test I, [2024-05-09T02:15:01.984988 #2352526] INFO -- : [267/885] 2393912=test_object I, [2024-05-09T02:15:01.988613 #2352526] INFO -- : [268/885] 2393924=test_cgi_header I, [2024-05-09T02:15:01.990740 #2352526] INFO -- : [269/885] 2393912=heredoc_dedent_test I, [2024-05-09T02:15:02.001900 #2352526] INFO -- : [270/885] 2393924=test_arithmetic_sequence I, [2024-05-09T02:15:02.007100 #2352526] INFO -- : [271/885] 2393924=test_gem_gemcutter_utilities I, [2024-05-09T02:15:02.038103 #2352526] INFO -- : [272/885] 2393928=test_basicinstructions I, [2024-05-09T02:15:02.071237 #2352526] INFO -- : [273/885] 2393917=test_gem_command_manager I, [2024-05-09T02:15:02.090151 #2352526] INFO -- : [274/885] 2393928=test_key_actor_emacs I, [2024-05-09T02:15:02.098039 #2352526] INFO -- : [275/885] 2393912=test_project_sanity I, [2024-05-09T02:15:02.132704 #2352526] INFO -- : [276/885] 2393912=test_range I, [2024-05-09T02:15:02.183045 #2352526] INFO -- : [277/885] 2393928=test_constant I, [2024-05-09T02:15:02.205473 #2352526] INFO -- : [278/885] 2393911=test_pty I, [2024-05-09T02:15:02.236630 #2352526] INFO -- : [279/885] 2393913=test_dup I, [2024-05-09T02:15:02.238360 #2352526] INFO -- : [280/885] 2393917=command_line_test I, [2024-05-09T02:15:02.247862 #2352526] INFO -- : [281/885] 2393917=test_erb_command I, [2024-05-09T02:15:02.285198 #2352526] INFO -- : [282/885] 2393925=test_helper I, [2024-05-09T02:15:02.292666 #2352526] INFO -- : [283/885] 2393917=test_encoding I, [2024-05-09T02:15:02.298807 #2352526] INFO -- : [284/885] 2393925=test_gem_uri_formatter I, [2024-05-09T02:15:02.337072 #2352526] INFO -- : [285/885] 2393924=test_ensured I, [2024-05-09T02:15:02.373294 #2352526] INFO -- : [286/885] 2393924=library_symbols_test I, [2024-05-09T02:15:02.378837 #2352526] INFO -- : [287/885] 2393924=test_locale I, [2024-05-09T02:15:02.384290 #2352526] INFO -- : [288/885] 2393913=test_addr I, [2024-05-09T02:15:02.386083 #2352526] INFO -- : [289/885] 2393913=test_ts I, [2024-05-09T02:15:02.411450 #2352526] INFO -- : [290/885] 2393924=test_rdoc_ri_paths I, [2024-05-09T02:15:02.471858 #2352526] INFO -- : [291/885] 2393925=test_rdoc_markup_document I, [2024-05-09T02:15:02.508647 #2352526] INFO -- : [292/885] 2393922=test_integer_comb I, [2024-05-09T02:15:02.512635 #2352526] INFO -- : [293/885] 2393917=test_tmpdir I, [2024-05-09T02:15:02.578271 #2352526] INFO -- : [294/885] 2393925=test_vm_dump I, [2024-05-09T02:15:02.579281 #2352526] INFO -- : [295/885] 2393924=errors_test I, [2024-05-09T02:15:02.579552 #2352526] INFO -- : [296/885] 2393925=test_gem_commands_check_command I, [2024-05-09T02:15:02.591107 #2352526] INFO -- : [297/885] 2393917=test_regexp I, [2024-05-09T02:15:02.614699 #2352526] INFO -- : [298/885] 2393925=static_inspect_test I, [2024-05-09T02:15:02.631838 #2352526] INFO -- : [299/885] 2393929=test_udp I, [2024-05-09T02:15:02.635207 #2352526] INFO -- : [300/885] 2393929=test_data_error I, [2024-05-09T02:15:02.639572 #2352526] INFO -- : [301/885] 2393924=bom_test I, [2024-05-09T02:15:02.646611 #2352526] INFO -- : [302/885] 2393924=test_force_exit I, [2024-05-09T02:15:02.647742 #2352526] INFO -- : [303/885] 2393924=test_file I, [2024-05-09T02:15:02.696792 #2352526] INFO -- : [304/885] 2393925=unescape_test I, [2024-05-09T02:15:02.702207 #2352526] INFO -- : [305/885] 2393911=test_ostruct I, [2024-05-09T02:15:02.722682 #2352526] INFO -- : [306/885] 2393929=test_update I, [2024-05-09T02:15:02.729940 #2352526] INFO -- : [307/885] 2393929=test_fips I, [2024-05-09T02:15:02.782185 #2352526] INFO -- : [308/885] 2393912=test_x509name I, [2024-05-09T02:15:02.790795 #2352526] INFO -- : [309/885] 2393912=test_x509store I, [2024-05-09T02:15:02.802874 #2352526] INFO -- : [310/885] 2393913=test_rdoc_code_object I, [2024-05-09T02:15:02.858893 #2352526] INFO -- : [311/885] 2393911=test_webauthn_listener I, [2024-05-09T02:15:02.919438 #2352526] INFO -- : [312/885] 2393911=test_random_formatter I, [2024-05-09T02:15:02.945971 #2352526] INFO -- : [313/885] 2393911=test_helper I, [2024-05-09T02:15:02.980543 #2352526] INFO -- : [314/885] 2393912=test_jaro_winkler I, [2024-05-09T02:15:02.983856 #2352526] INFO -- : [315/885] 2393912=test_ast I, [2024-05-09T02:15:03.016346 #2352526] INFO -- : [316/885] 2393913=test_gem_request_set_gem_dependency_api I, [2024-05-09T02:15:03.021169 #2352526] INFO -- : [317/885] 2393911=test_lambda I, [2024-05-09T02:15:03.041063 #2352526] INFO -- : [318/885] 2393929=test_gem_resolver_api_set I, [2024-05-09T02:15:03.093553 #2352526] INFO -- : [319/885] 2393911=test_gem_safe_marshal I, [2024-05-09T02:15:03.107302 #2352526] INFO -- : [320/885] 2393929=test_enumerable I, [2024-05-09T02:15:03.112544 #2352526] INFO -- : [321/885] 2393929=test_config I, [2024-05-09T02:15:03.177749 #2352526] INFO -- : [322/885] 2393913=test_gem_resolver_vendor_set I, [2024-05-09T02:15:03.194080 #2352526] INFO -- : [323/885] 2393913=json_generator_test I, [2024-05-09T02:15:03.259213 #2352526] INFO -- : [324/885] 2393913=test_eval I, [2024-05-09T02:15:03.485876 #2352526] INFO -- : [325/885] 2393913=test_transcode I, [2024-05-09T02:15:03.626088 #2352526] INFO -- : [326/885] 2393929=test_rdoc_attr I, [2024-05-09T02:15:03.627064 #2352526] INFO -- : [327/885] 2393913=test_env I, [2024-05-09T02:15:03.641700 #2352526] INFO -- : [328/885] 2393929=test_integer I, [2024-05-09T02:15:03.686210 #2352526] INFO -- : [329/885] 2393916=desugar_compiler_test I, [2024-05-09T02:15:03.706479 #2352526] INFO -- : [330/885] 2393929=test_dryrun I, [2024-05-09T02:15:03.720858 #2352526] INFO -- : [331/885] 2393929=test_gem_commands_setup_command I, [2024-05-09T02:15:03.753755 #2352526] INFO -- : [332/885] 2393916=test_cgi_modruby I, [2024-05-09T02:15:03.776279 #2352526] INFO -- : [333/885] 2393916=test_integer I, [2024-05-09T02:15:03.788149 #2352526] INFO -- : [334/885] 2393911=test_super I, [2024-05-09T02:15:03.994888 #2352526] INFO -- : [335/885] 2393910=test_rubyoptions I, [2024-05-09T02:15:04.128557 #2352526] INFO -- : [336/885] 2393929=test_call I, [2024-05-09T02:15:04.189266 #2352526] INFO -- : [337/885] 2393926=test_https_proxy I, [2024-05-09T02:15:04.207274 #2352526] INFO -- : [338/885] 2393929=test_rubygems I, [2024-05-09T02:15:04.269202 #2352526] INFO -- : [339/885] 2393926=test_nextafter I, [2024-05-09T02:15:04.293926 #2352526] INFO -- : [340/885] 2393911=test_capacity I, [2024-05-09T02:15:04.298004 #2352526] INFO -- : [341/885] 2393911=test_stat I, [2024-05-09T02:15:04.301106 #2352526] INFO -- : [342/885] 2393911=test_gem_request_set_lockfile_tokenizer I, [2024-05-09T02:15:04.349802 #2352526] INFO -- : [343/885] 2393911=test_have_func I, [2024-05-09T02:15:04.354096 #2352526] INFO -- : [344/885] 2393929=test_gem_resolver_git_specification I, [2024-05-09T02:15:04.354915 #2352526] INFO -- : [345/885] 2393928=test_object_references I, [2024-05-09T02:15:04.361699 #2352526] INFO -- : [346/885] 2393926=test_usrmarshal I, [2024-05-09T02:15:04.364129 #2352526] INFO -- : [347/885] 2393928=test_ssl I, [2024-05-09T02:15:04.513438 #2352526] INFO -- : [348/885] 2393929=test_ractor I, [2024-05-09T02:15:04.609582 #2352526] INFO -- : [349/885] 2393926=test_my_integer I, [2024-05-09T02:15:04.613963 #2352526] INFO -- : [350/885] 2393926=test_thread I, [2024-05-09T02:15:04.745982 #2352526] INFO -- : [351/885] 2393925=json_ext_parser_test I, [2024-05-09T02:15:04.751651 #2352526] INFO -- : [352/885] 2393925=test_debugger_integration I, [2024-05-09T02:15:04.762875 #2352526] INFO -- : [353/885] 2393925=test_rendering I, [2024-05-09T02:15:04.780071 #2352526] INFO -- : [354/885] 2393925=test_marshal I, [2024-05-09T02:15:04.797465 #2352526] INFO -- : [355/885] 2393929=test_unicode_normalize I, [2024-05-09T02:15:04.870660 #2352526] INFO -- : [356/885] 2393928=test_weakref I, [2024-05-09T02:15:05.016344 #2352526] INFO -- : [357/885] 2393928=test_nonblock I, [2024-05-09T02:15:05.023410 #2352526] INFO -- : [358/885] 2393928=test_alias I, [2024-05-09T02:15:05.173833 #2352526] INFO -- : [359/885] 2393928=test_timeout I, [2024-05-09T02:15:05.368446 #2352526] INFO -- : [360/885] 2393925=test_singleton_function I, [2024-05-09T02:15:05.373225 #2352526] INFO -- : [361/885] 2393925=test_ancdata I, [2024-05-09T02:15:05.380869 #2352526] INFO -- : [362/885] 2393925=test_rb_str_dup I, [2024-05-09T02:15:05.383622 #2352526] INFO -- : [363/885] 2393925=test_reline_key I, [2024-05-09T02:15:05.392648 #2352526] INFO -- : [364/885] 2393925=test_cgi_core I, [2024-05-09T02:15:05.418034 #2352526] INFO -- : [365/885] 2393925=test_parser I, [2024-05-09T02:15:05.437923 #2352526] INFO -- : [366/885] 2393925=parse_stream_test I, [2024-05-09T02:15:05.441658 #2352526] INFO -- : [367/885] 2393925=test_registry I, [2024-05-09T02:15:05.441794 #2352526] INFO -- : [368/885] 2393925=test_ractor I, [2024-05-09T02:15:05.476684 #2352526] INFO -- : [369/885] 2393925=test_gem_commands_open_command I, [2024-05-09T02:15:05.569344 #2352526] INFO -- : [370/885] 2393925=test_dns I, [2024-05-09T02:15:05.662962 #2352526] INFO -- : [371/885] 2393911=test_gem_source_lock I, [2024-05-09T02:15:05.731118 #2352526] INFO -- : [372/885] 2393911=test_gem I, [2024-05-09T02:15:05.766055 #2352526] INFO -- : [373/885] 2393914=test_rdoc_extend I, [2024-05-09T02:15:05.773241 #2352526] INFO -- : [374/885] 2393922=test_merge_keys I, [2024-05-09T02:15:05.807898 #2352526] INFO -- : [375/885] 2393922=test_gem_resolver_api_specification I, [2024-05-09T02:15:05.827775 #2352526] INFO -- : [376/885] 2393914=test_ipaddr I, [2024-05-09T02:15:05.852107 #2352526] INFO -- : [377/885] 2393914=test_history I, [2024-05-09T02:15:05.870748 #2352526] INFO -- : [378/885] 2393914=test_mixed_unicode_escapes I, [2024-05-09T02:15:05.871430 #2352526] INFO -- : [379/885] 2393914=test_rdoc_markup_to_ansi I, [2024-05-09T02:15:05.881429 #2352526] INFO -- : [380/885] 2393922=test_win32ole_variant I, [2024-05-09T02:15:05.895532 #2352526] INFO -- : [381/885] 2393922=test_win32ole_variable I, [2024-05-09T02:15:05.897841 #2352526] INFO -- : [382/885] 2393922=test_arity I, [2024-05-09T02:15:05.904571 #2352526] INFO -- : [383/885] 2393922=test_stringio I, [2024-05-09T02:15:05.913209 #2352526] INFO -- : [384/885] 2393914=test_io_wait_uncommon I, [2024-05-09T02:15:05.919792 #2352526] INFO -- : [385/885] 2393914=test_bignum I, [2024-05-09T02:15:06.025771 #2352526] INFO -- : [386/885] 2393914=test_rdoc_class_module I, [2024-05-09T02:15:06.037789 #2352526] INFO -- : [387/885] 2393925=test_gem_ci_detector I, [2024-05-09T02:15:06.041106 #2352526] INFO -- : [388/885] 2393925=test_rdoc_generator_json_index I, [2024-05-09T02:15:06.044365 #2352526] INFO -- : [389/885] 2393922=test_time_tz I, [2024-05-09T02:15:06.056652 #2352526] INFO -- : [390/885] 2393928=test_win32ole_event I, [2024-05-09T02:15:06.056718 #2352526] INFO -- : [391/885] 2393928=ractor_test I, [2024-05-09T02:15:06.100227 #2352526] INFO -- : [392/885] 2393925=test_trace I, [2024-05-09T02:15:06.103016 #2352526] INFO -- : [393/885] 2393922=test_have_macro I, [2024-05-09T02:15:06.117118 #2352526] INFO -- : [394/885] 2393925=test_complex2 I, [2024-05-09T02:15:06.130663 #2352526] INFO -- : [395/885] 2393925=test_resolve_symbol I, [2024-05-09T02:15:06.146145 #2352526] INFO -- : [396/885] 2393928=test_gem_package I, [2024-05-09T02:15:06.172513 #2352526] INFO -- : [397/885] 2393915=test_threadgroup I, [2024-05-09T02:15:06.192525 #2352526] INFO -- : [398/885] 2393925=test_gem_specification I, [2024-05-09T02:15:06.505591 #2352526] INFO -- : [399/885] 2393923=test_enum I, [2024-05-09T02:15:06.566651 #2352526] INFO -- : [400/885] 2393918=test_gem_resolver_requirement_list I, [2024-05-09T02:15:06.570956 #2352526] INFO -- : [401/885] 2393918=test_arith_seq_beg_len_step I, [2024-05-09T02:15:06.583794 #2352526] INFO -- : [402/885] 2393916=test_pkcs7 I, [2024-05-09T02:15:06.626917 #2352526] INFO -- : [403/885] 2393913=test_function_entry I, [2024-05-09T02:15:06.629372 #2352526] INFO -- : [404/885] 2393913=test_coder I, [2024-05-09T02:15:06.658178 #2352526] INFO -- : [405/885] 2393913=test_symbol I, [2024-05-09T02:15:06.664763 #2352526] INFO -- : [406/885] 2393918=test_gem_commands_pristine_command I, [2024-05-09T02:15:06.791385 #2352526] INFO -- : [407/885] 2393922=test_context I, [2024-05-09T02:15:06.812780 #2352526] INFO -- : [408/885] 2393916=test_nofree I, [2024-05-09T02:15:06.818530 #2352526] INFO -- : [409/885] 2393916=ruby_api_test I, [2024-05-09T02:15:06.845368 #2352526] INFO -- : [410/885] 2393928=test_find_executable I, [2024-05-09T02:15:06.852148 #2352526] INFO -- : [411/885] 2393928=test_enc_associate I, [2024-05-09T02:15:06.857305 #2352526] INFO -- : [412/885] 2393914=test_lazy_enumerator I, [2024-05-09T02:15:07.009678 #2352526] INFO -- : [413/885] 2393916=test_unix I, [2024-05-09T02:15:07.039541 #2352526] INFO -- : [414/885] 2393916=test_ractor_compatibility I, [2024-05-09T02:15:07.068183 #2352526] INFO -- : [415/885] 2393922=test_dir I, [2024-05-09T02:15:07.179465 #2352526] INFO -- : [416/885] 2393915=format_errors_test I, [2024-05-09T02:15:07.255683 #2352526] INFO -- : [417/885] 2393915=test_date_ractor I, [2024-05-09T02:15:07.386929 #2352526] INFO -- : [418/885] 2393914=test_gem_console_ui I, [2024-05-09T02:15:07.485641 #2352526] INFO -- : [419/885] 2393922=test_autoconf I, [2024-05-09T02:15:07.492015 #2352526] INFO -- : [420/885] 2393922=test_eval I, [2024-05-09T02:15:07.495305 #2352526] INFO -- : [421/885] 2393922=test_cgi_multipart I, [2024-05-09T02:15:07.598103 #2352526] INFO -- : [422/885] 2393928=test_word I, [2024-05-09T02:15:07.604728 #2352526] INFO -- : [423/885] 2393928=test_gem_commands_cleanup_command I, [2024-05-09T02:15:07.633900 #2352526] INFO -- : [424/885] 2393915=test_numeric I, [2024-05-09T02:15:07.642866 #2352526] INFO -- : [425/885] 2393916=test_member I, [2024-05-09T02:15:07.644240 #2352526] INFO -- : [426/885] 2393915=test_http_request I, [2024-05-09T02:15:07.647450 #2352526] INFO -- : [427/885] 2393914=test_gem_source_fetch_problem I, [2024-05-09T02:15:07.648794 #2352526] INFO -- : [428/885] 2393916=json_generic_object_test I, [2024-05-09T02:15:07.662077 #2352526] INFO -- : [429/885] 2393916=test_rdoc_generator_darkfish I, [2024-05-09T02:15:07.668294 #2352526] INFO -- : [430/885] 2393914=test_rdoc_comment I, [2024-05-09T02:15:07.674580 #2352526] INFO -- : [431/885] 2393922=test_resize I, [2024-05-09T02:15:07.687140 #2352526] INFO -- : [432/885] 2393922=test_error_highlight I, [2024-05-09T02:15:07.715778 #2352526] INFO -- : [433/885] 2393914=test_mailto I, [2024-05-09T02:15:07.747573 #2352526] INFO -- : [434/885] 2393914=test_coderange I, [2024-05-09T02:15:07.751200 #2352526] INFO -- : [435/885] 2393915=location_test I, [2024-05-09T02:15:07.751630 #2352526] INFO -- : [436/885] 2393923=test_symbol I, [2024-05-09T02:15:07.754000 #2352526] INFO -- : [437/885] 2393914=test_gem_source_local I, [2024-05-09T02:15:07.788718 #2352526] INFO -- : [438/885] 2393923=test_gem_security_policy I, [2024-05-09T02:15:07.819801 #2352526] INFO -- : [439/885] 2393915=test_last_thread I, [2024-05-09T02:15:08.007460 #2352526] INFO -- : [440/885] 2393911=test_process I, [2024-05-09T02:15:08.112781 #2352526] INFO -- : [441/885] 2393914=test_pack I, [2024-05-09T02:15:08.184950 #2352526] INFO -- : [442/885] 2393916=test_err_in_callback I, [2024-05-09T02:15:08.186637 #2352526] INFO -- : [443/885] 2393916=test_gem_resolver_lock_specification I, [2024-05-09T02:15:08.250677 #2352526] INFO -- : [444/885] 2393916=test_gc I, [2024-05-09T02:15:08.371383 #2352526] INFO -- : [445/885] 2393922=test_x509cert I, [2024-05-09T02:15:08.375438 #2352526] INFO -- : [446/885] 2393928=test_arity I, [2024-05-09T02:15:08.382201 #2352526] INFO -- : [447/885] 2393914=test_gem_ext_rake_builder I, [2024-05-09T02:15:08.382588 #2352526] INFO -- : [448/885] 2393928=test_logdevice I, [2024-05-09T02:15:08.383986 #2352526] INFO -- : [449/885] 2393918=test_flush I, [2024-05-09T02:15:08.391093 #2352526] INFO -- : [450/885] 2393918=test_singleton I, [2024-05-09T02:15:08.396955 #2352526] INFO -- : [451/885] 2393918=test_io_console I, [2024-05-09T02:15:08.460148 #2352526] INFO -- : [452/885] 2393923=test_switch_hitter I, [2024-05-09T02:15:08.485257 #2352526] INFO -- : [453/885] 2393923=test_securerandom I, [2024-05-09T02:15:08.527451 #2352526] INFO -- : [454/885] 2393923=test_rdoc_markdown_test I, [2024-05-09T02:15:08.709891 #2352526] INFO -- : [455/885] 2393922=test_c_union_entity I, [2024-05-09T02:15:08.731253 #2352526] INFO -- : [456/885] 2393922=test_rdoc_normal_module I, [2024-05-09T02:15:08.755933 #2352526] INFO -- : [457/885] 2393924=test_logperiod I, [2024-05-09T02:15:08.762715 #2352526] INFO -- : [458/885] 2393924=test_passing_block I, [2024-05-09T02:15:08.764180 #2352526] INFO -- : [459/885] 2393920=test_thread_fd_close I, [2024-05-09T02:15:08.767770 #2352526] INFO -- : [460/885] 2393924=test_uncorrectable_name_check I, [2024-05-09T02:15:08.768664 #2352526] INFO -- : [461/885] 2393920=newline_test I, [2024-05-09T02:15:08.773691 #2352526] INFO -- : [462/885] 2393924=test_hash_create I, [2024-05-09T02:15:08.774959 #2352526] INFO -- : [463/885] 2393924=test_stringchar I, [2024-05-09T02:15:08.875535 #2352526] INFO -- : [464/885] 2393920=test_rdoc_context I, [2024-05-09T02:15:08.916392 #2352526] INFO -- : [465/885] 2393915=test_stream I, [2024-05-09T02:15:08.934199 #2352526] INFO -- : [466/885] 2393915=test_nil2vtempty I, [2024-05-09T02:15:08.938518 #2352526] INFO -- : [467/885] 2393915=test_rdoc_parser_ruby I, [2024-05-09T02:15:08.944666 #2352526] INFO -- : [468/885] 2393924=test_open-uri I, [2024-05-09T02:15:08.957901 #2352526] INFO -- : [469/885] 2393922=test_httpresponse I, [2024-05-09T02:15:09.058283 #2352526] INFO -- : [470/885] 2393922=test_gem_safe_yaml I, [2024-05-09T02:15:09.072602 #2352526] INFO -- : [471/885] 2393922=test_syntax I, [2024-05-09T02:15:09.093218 #2352526] INFO -- : [472/885] 2393925=test_data I, [2024-05-09T02:15:09.105913 #2352526] INFO -- : [473/885] 2393925=test_date_new I, [2024-05-09T02:15:09.115679 #2352526] INFO -- : [474/885] 2393925=index_write_test I, [2024-05-09T02:15:09.121041 #2352526] INFO -- : [475/885] 2393925=test_require I, [2024-05-09T02:15:09.122400 #2352526] INFO -- : [476/885] 2393925=test_date_time I, [2024-05-09T02:15:09.138971 #2352526] INFO -- : [477/885] 2393925=test_rdoc_markup_to_joined_paragraph I, [2024-05-09T02:15:09.153157 #2352526] INFO -- : [478/885] 2393925=test_iso_8859 I, [2024-05-09T02:15:09.204867 #2352526] INFO -- : [479/885] 2393925=test_tcp I, [2024-05-09T02:15:09.289149 #2352526] INFO -- : [480/885] 2393925=test_rdoc_text I, [2024-05-09T02:15:09.353918 #2352526] INFO -- : [481/885] 2393925=test_gem_commands_specification_command I, [2024-05-09T02:15:09.429500 #2352526] INFO -- : [482/885] 2393914=test_gem_commands_which_command I, [2024-05-09T02:15:09.438040 #2352526] INFO -- : [483/885] 2393928=test_shift_jis I, [2024-05-09T02:15:09.443624 #2352526] INFO -- : [484/885] 2393928=test_http I, [2024-05-09T02:15:09.448442 #2352526] INFO -- : [485/885] 2393928=test_enumerator I, [2024-05-09T02:15:09.480912 #2352526] INFO -- : [486/885] 2393914=test_flags I, [2024-05-09T02:15:09.485059 #2352526] INFO -- : [487/885] 2393924=test_inadvertent_creation I, [2024-05-09T02:15:09.493149 #2352526] INFO -- : [488/885] 2393925=test_rdoc_markup_attribute_manager I, [2024-05-09T02:15:09.544496 #2352526] INFO -- : [489/885] 2393925=test_name_error I, [2024-05-09T02:15:09.557349 #2352526] INFO -- : [490/885] 2393913=test_gem_commands_dependency_command I, [2024-05-09T02:15:09.591536 #2352526] INFO -- : [491/885] 2393915=test_gem_resolver_composed_set I, [2024-05-09T02:15:09.618555 #2352526] INFO -- : [492/885] 2393929=test_safe_load I, [2024-05-09T02:15:09.643026 #2352526] INFO -- : [493/885] 2393924=test_gem_resolver I, [2024-05-09T02:15:09.645350 #2352526] INFO -- : [494/885] 2393929=test_method_cache I, [2024-05-09T02:15:09.662788 #2352526] INFO -- : [495/885] 2393929=test_gem_request I, [2024-05-09T02:15:09.674229 #2352526] INFO -- : [496/885] 2393913=test_sprintf_comb I, [2024-05-09T02:15:09.708470 #2352526] INFO -- : [497/885] 2393925=test_gem_ext_cargo_builder_link_flag_converter I, [2024-05-09T02:15:09.768188 #2352526] INFO -- : [498/885] 2393920=test_gem_commands_mirror I, [2024-05-09T02:15:09.775164 #2352526] INFO -- : [499/885] 2393920=test_enumerator_kw I, [2024-05-09T02:15:09.778774 #2352526] INFO -- : [500/885] 2393920=test_gem_text I, [2024-05-09T02:15:09.789577 #2352526] INFO -- : [501/885] 2393925=test_settracefunc I, [2024-05-09T02:15:09.803123 #2352526] INFO -- : [502/885] 2393923=test_generic I, [2024-05-09T02:15:09.826896 #2352526] INFO -- : [503/885] 2393920=test_win32ole I, [2024-05-09T02:15:09.834575 #2352526] INFO -- : [504/885] 2393920=test_scan_args I, [2024-05-09T02:15:09.847139 #2352526] INFO -- : [505/885] 2393920=test_case_options I, [2024-05-09T02:15:09.851896 #2352526] INFO -- : [506/885] 2393920=test_store I, [2024-05-09T02:15:09.854459 #2352526] INFO -- : [507/885] 2393915=test_rdoc_cross_reference I, [2024-05-09T02:15:09.858012 #2352526] INFO -- : [508/885] 2393913=test_gem_dependency_installer I, [2024-05-09T02:15:09.871156 #2352526] INFO -- : [509/885] 2393923=test_scalar I, [2024-05-09T02:15:09.878356 #2352526] INFO -- : [510/885] 2393929=test_gem_commands_info_command I, [2024-05-09T02:15:09.881049 #2352526] INFO -- : [511/885] 2393923=test_bug_reporter I, [2024-05-09T02:15:09.910092 #2352526] INFO -- : [512/885] 2393929=test_rand I, [2024-05-09T02:15:09.999035 #2352526] INFO -- : [513/885] 2393920=test_gem_package_tar_reader_entry I, [2024-05-09T02:15:10.019095 #2352526] INFO -- : [514/885] 2393924=test_gem_name_tuple I, [2024-05-09T02:15:10.050341 #2352526] INFO -- : [515/885] 2393924=test_exception I, [2024-05-09T02:15:10.289475 #2352526] INFO -- : [516/885] 2393920=test_gem_stream_ui I, [2024-05-09T02:15:10.320554 #2352526] INFO -- : [517/885] 2393929=test_rdoc_generator_ri I, [2024-05-09T02:15:10.325807 #2352526] INFO -- : [518/885] 2393915=test_extlibs I, [2024-05-09T02:15:10.329259 #2352526] INFO -- : [519/885] 2393929=test_ractor I, [2024-05-09T02:15:10.352641 #2352526] INFO -- : [520/885] 2393929=test_severity I, [2024-05-09T02:15:10.362105 #2352526] INFO -- : [521/885] 2393929=test_require_lib I, [2024-05-09T02:15:10.391955 #2352526] INFO -- : [522/885] 2393923=test_gem_install_update_options I, [2024-05-09T02:15:10.409431 #2352526] INFO -- : [523/885] 2393920=parse_test I, [2024-05-09T02:15:10.528868 #2352526] INFO -- : [524/885] 2393923=test_rdoc_markup_to_table_of_contents I, [2024-05-09T02:15:10.547051 #2352526] INFO -- : [525/885] 2393923=test_thread I, [2024-05-09T02:15:10.631263 #2352526] INFO -- : [526/885] 2393921=test_socket I, [2024-05-09T02:15:10.813956 #2352526] INFO -- : [527/885] 2393923=test_objectspace I, [2024-05-09T02:15:10.924678 #2352526] INFO -- : [528/885] 2393914=test_literal I, [2024-05-09T02:15:10.939142 #2352526] INFO -- : [529/885] 2393925=test_str2big I, [2024-05-09T02:15:10.944435 #2352526] INFO -- : [530/885] 2393925=test_dot_dot I, [2024-05-09T02:15:10.948250 #2352526] INFO -- : [531/885] 2393925=test_c_struct_builder I, [2024-05-09T02:15:11.063519 #2352526] INFO -- : [532/885] 2393925=test_cclass I, [2024-05-09T02:15:11.090255 #2352526] INFO -- : Leaked thread: TestSocket#test_accept_loop_multi_port: # I, [2024-05-09T02:15:11.091446 #2352526] INFO -- : Finished thread: TestSocket#test_resolurion_error_error_code: # I, [2024-05-09T02:15:11.134815 #2352526] INFO -- : [533/885] 2393925=test_gem_request_connection_pools I, [2024-05-09T02:15:11.212009 #2352526] INFO -- : [534/885] 2393918=test_grapheme_breaks I, [2024-05-09T02:15:11.241565 #2352526] INFO -- : [535/885] 2393918=test_gem_version_option I, [2024-05-09T02:15:11.287499 #2352526] INFO -- : [536/885] 2393918=test_case I, [2024-05-09T02:15:11.292857 #2352526] INFO -- : [537/885] 2393918=test_pkey I, [2024-05-09T02:15:11.373216 #2352526] INFO -- : [538/885] 2393918=test_parser_events I, [2024-05-09T02:15:11.437311 #2352526] INFO -- : [539/885] 2393918=test_reline I, [2024-05-09T02:15:11.614941 #2352526] INFO -- : [540/885] 2393914=test_rdoc_generator_pot_po I, [2024-05-09T02:15:11.626030 #2352526] INFO -- : [541/885] 2393914=test_ansi_with_terminfo I, [2024-05-09T02:15:11.631048 #2352526] INFO -- : [542/885] 2393914=test_rdoc_markup_to_markdown I, [2024-05-09T02:15:11.661119 #2352526] INFO -- : [543/885] 2393914=test_json_tree I, [2024-05-09T02:15:11.672996 #2352526] INFO -- : [544/885] 2393914=test_memory_view I, [2024-05-09T02:15:11.751117 #2352526] INFO -- : [545/885] 2393918=test_m17n_comb I, [2024-05-09T02:15:11.850258 #2352526] INFO -- : [546/885] 2393914=test_ractor I, [2024-05-09T02:15:11.923751 #2352526] INFO -- : [547/885] 2393923=test_rdoc_store I, [2024-05-09T02:15:11.948357 #2352526] INFO -- : [548/885] 2393914=test_depth_first I, [2024-05-09T02:15:11.949901 #2352526] INFO -- : [549/885] 2393914=test_gem_request_set_lockfile_parser I, [2024-05-09T02:15:12.062845 #2352526] INFO -- : [550/885] 2393914=test_raise I, [2024-05-09T02:15:12.064775 #2352526] INFO -- : [551/885] 2393914=test_x509attr I, [2024-05-09T02:15:12.084468 #2352526] INFO -- : [552/885] 2393914=test_rdoc_stats I, [2024-05-09T02:15:12.125759 #2352526] INFO -- : [553/885] 2393914=test_pattern_matching I, [2024-05-09T02:15:12.174217 #2352526] INFO -- : [554/885] 2393914=test_string I, [2024-05-09T02:15:12.196685 #2352526] INFO -- : [555/885] 2393914=test_gem_dependency_resolution_error I, [2024-05-09T02:15:12.199478 #2352526] INFO -- : [556/885] 2393914=test_rdoc_parser I, [2024-05-09T02:15:12.205252 #2352526] INFO -- : [557/885] 2393925=test_qsort I, [2024-05-09T02:15:12.210046 #2352526] INFO -- : [558/885] 2393925=test_custom_command I, [2024-05-09T02:15:12.211572 #2352526] INFO -- : [559/885] 2393927=json_addition_test I, [2024-05-09T02:15:12.217057 #2352526] INFO -- : [560/885] 2393914=test_gc_compact I, [2024-05-09T02:15:12.256411 #2352526] INFO -- : [561/885] 2393925=test_proc I, [2024-05-09T02:15:12.258362 #2352526] INFO -- : [562/885] 2393927=test_string I, [2024-05-09T02:15:12.606229 #2352526] INFO -- : [563/885] 2393921=test_gem_resolver_index_set I, [2024-05-09T02:15:12.647050 #2352526] INFO -- : [564/885] 2393921=test_gem_package_old I, [2024-05-09T02:15:12.707814 #2352526] INFO -- : [565/885] 2393921=test_zlib I, [2024-05-09T02:15:12.735417 #2352526] INFO -- : [566/885] 2393924=test_cgi_tag_helper I, [2024-05-09T02:15:12.747010 #2352526] INFO -- : [567/885] 2393924=test_egrep_cpp I, [2024-05-09T02:15:12.798539 #2352526] INFO -- : [568/885] 2393913=test_ole_methods I, [2024-05-09T02:15:12.803055 #2352526] INFO -- : [569/885] 2393913=test_erb_m17n I, [2024-05-09T02:15:12.809456 #2352526] INFO -- : [570/885] 2393913=test_date_conv I, [2024-05-09T02:15:12.820023 #2352526] INFO -- : [571/885] 2393913=test_optimization I, [2024-05-09T02:15:12.872423 #2352526] INFO -- : [572/885] 2393915=test_rdoc_markup_parser I, [2024-05-09T02:15:12.932484 #2352526] INFO -- : [573/885] 2393915=test_require_path_check I, [2024-05-09T02:15:12.974347 #2352526] INFO -- : [574/885] 2393924=test_folderitem2_invokeverb I, [2024-05-09T02:15:12.976964 #2352526] INFO -- : [575/885] 2393924=test_fnmatch I, [2024-05-09T02:15:13.016652 #2352526] INFO -- : [576/885] 2393915=test_files_test_2 I, [2024-05-09T02:15:13.020633 #2352526] INFO -- : [577/885] 2393923=test_gem_validator I, [2024-05-09T02:15:13.039041 #2352526] INFO -- : [578/885] 2393924=test_io_buffer I, [2024-05-09T02:15:13.065160 #2352526] INFO -- : [579/885] 2393923=test_key_name_check I, [2024-05-09T02:15:13.091448 #2352526] INFO -- : [580/885] 2393923=test_defined I, [2024-05-09T02:15:13.135119 #2352526] INFO -- : [581/885] 2393924=test_backtrace I, [2024-05-09T02:15:13.145523 #2352526] INFO -- : [582/885] 2393924=test_rdoc_i18n_text I, [2024-05-09T02:15:13.146840 #2352526] INFO -- : [583/885] 2393924=test_gem_uninstaller I, [2024-05-09T02:15:13.221265 #2352526] INFO -- : [584/885] 2393923=test_buffering I, [2024-05-09T02:15:13.230292 #2352526] INFO -- : [585/885] 2393923=test_svcb_https I, [2024-05-09T02:15:13.258763 #2352526] INFO -- : [586/885] 2393923=test_gb18030 I, [2024-05-09T02:15:13.260977 #2352526] INFO -- : [587/885] 2393923=test_windows_1251 I, [2024-05-09T02:15:13.268767 #2352526] INFO -- : [588/885] 2393923=test_time I, [2024-05-09T02:15:13.366290 #2352526] INFO -- : [589/885] 2393925=test_rdoc_rdoc I, [2024-05-09T02:15:13.444020 #2352526] INFO -- : [590/885] 2393925=test_rdoc_markup_attributes I, [2024-05-09T02:15:13.449220 #2352526] INFO -- : [591/885] 2393925=test_null I, [2024-05-09T02:15:13.465056 #2352526] INFO -- : [592/885] 2393925=test_win32ole_type I, [2024-05-09T02:15:13.465457 #2352526] INFO -- : [593/885] 2393925=test_mul I, [2024-05-09T02:15:13.472077 #2352526] INFO -- : [594/885] 2393923=test_rdoc_markup_to_rdoc I, [2024-05-09T02:15:13.483408 #2352526] INFO -- : [595/885] 2393925=test_rdoc_rd_inline_parser I, [2024-05-09T02:15:13.533138 #2352526] INFO -- : [596/885] 2393925=test_default_gems I, [2024-05-09T02:15:13.571355 #2352526] INFO -- : [597/885] 2393923=test_trick I, [2024-05-09T02:15:13.649503 #2352526] INFO -- : [598/885] 2393925=test_thread I, [2024-05-09T02:15:13.658932 #2352526] INFO -- : [599/885] 2393925=test_pipe I, [2024-05-09T02:15:13.844410 #2352526] INFO -- : [600/885] 2393925=test_pkey_ec I, [2024-05-09T02:15:13.883183 #2352526] INFO -- : [601/885] 2393920=test_date_parse I, [2024-05-09T02:15:13.950652 #2352526] INFO -- : [602/885] 2393925=test_enc_raise I, [2024-05-09T02:15:13.977195 #2352526] INFO -- : [603/885] 2393925=test_psych I, [2024-05-09T02:15:14.024405 #2352526] INFO -- : [604/885] 2393925=!Nothing_to_test I, [2024-05-09T02:15:14.026111 #2352526] INFO -- : [605/885] 2393925=test_rdoc_markup_paragraph I, [2024-05-09T02:15:14.037525 #2352526] INFO -- : [606/885] 2393925=test_at_exit I, [2024-05-09T02:15:14.061973 #2352526] INFO -- : [607/885] 2393925=test_command I, [2024-05-09T02:15:14.068189 #2352526] INFO -- : [608/885] 2393920=test_gem_ext_cargo_builder_unit I, [2024-05-09T02:15:14.102838 #2352526] INFO -- : [609/885] 2393920=test_gem_rdoc I, [2024-05-09T02:15:14.300286 #2352526] INFO -- : [610/885] 2393920=test_date I, [2024-05-09T02:15:14.321467 #2352526] INFO -- : [611/885] 2393920=test_object_create_start I, [2024-05-09T02:15:14.326231 #2352526] INFO -- : [612/885] 2393920=test_emitter I, [2024-05-09T02:15:14.331885 #2352526] INFO -- : [613/885] 2393920=test_gem_silent_ui I, [2024-05-09T02:15:14.379873 #2352526] INFO -- : [614/885] 2393920=test_bug-5832 I, [2024-05-09T02:15:14.380271 #2352526] INFO -- : [615/885] 2393920=test_files_ext I, [2024-05-09T02:15:14.482413 #2352526] INFO -- : [616/885] 2393918=test_kernel I, [2024-05-09T02:15:14.598570 #2352526] INFO -- : [617/885] 2393925=test_eval_history I, [2024-05-09T02:15:14.611803 #2352526] INFO -- : [618/885] 2393925=dispatcher_test I, [2024-05-09T02:15:14.640806 #2352526] INFO -- : [619/885] 2393925=test_kdf I, [2024-05-09T02:15:14.662875 #2352526] INFO -- : [620/885] 2393920=test_gem_doctor I, [2024-05-09T02:15:14.736612 #2352526] INFO -- : [621/885] 2393924=test_config I, [2024-05-09T02:15:14.740361 #2352526] INFO -- : [622/885] 2393926=test_yaml_special_cases I, [2024-05-09T02:15:14.751179 #2352526] INFO -- : [623/885] 2393925=test_optarg I, [2024-05-09T02:15:14.753585 #2352526] INFO -- : [624/885] 2393920=test_gem_source_list I, [2024-05-09T02:15:14.755975 #2352526] INFO -- : [625/885] 2393926=test_rdoc_token_stream I, [2024-05-09T02:15:14.785421 #2352526] INFO -- : [626/885] 2393926=test_address_resolve I, [2024-05-09T02:15:14.794786 #2352526] INFO -- : [627/885] 2393924=test_zsh_completion I, [2024-05-09T02:15:14.803010 #2352526] INFO -- : [628/885] 2393924=test_exception I, [2024-05-09T02:15:14.817728 #2352526] INFO -- : [629/885] 2393924=test_iter_break I, [2024-05-09T02:15:14.822069 #2352526] INFO -- : [630/885] 2393924=test_verbose I, [2024-05-09T02:15:14.841367 #2352526] INFO -- : [631/885] 2393924=test_num2int I, [2024-05-09T02:15:14.854157 #2352526] INFO -- : [632/885] 2393925=test_nil I, [2024-05-09T02:15:14.856854 #2352526] INFO -- : [633/885] 2393924=test_rdoc_single_class I, [2024-05-09T02:15:14.859302 #2352526] INFO -- : [634/885] 2393920=test_macro I, [2024-05-09T02:15:14.861116 #2352526] INFO -- : [635/885] 2393925=test_frozen I, [2024-05-09T02:15:14.864424 #2352526] INFO -- : [636/885] 2393925=test_gem_ext_configure_builder I, [2024-05-09T02:15:14.870604 #2352526] INFO -- : [637/885] 2393924=test_pp I, [2024-05-09T02:15:14.904544 #2352526] INFO -- : [638/885] 2393925=test_rdoc_tom_doc I, [2024-05-09T02:15:14.916054 #2352526] INFO -- : [639/885] 2393926=test_hmac I, [2024-05-09T02:15:14.921222 #2352526] INFO -- : [640/885] 2393926=test_rdoc_markup_to_tt_only I, [2024-05-09T02:15:14.938987 #2352526] INFO -- : [641/885] 2393925=test_gem_command I, [2024-05-09T02:15:14.955874 #2352526] INFO -- : [642/885] 2393926=test_key_actor_vi I, [2024-05-09T02:15:14.958507 #2352526] INFO -- : [643/885] 2393920=test_bug-3571 I, [2024-05-09T02:15:14.962045 #2352526] INFO -- : [644/885] 2393924=test_common I, [2024-05-09T02:15:14.996658 #2352526] INFO -- : [645/885] 2393920=test_gem_spec_fetcher I, [2024-05-09T02:15:15.084298 #2352526] INFO -- : [646/885] 2393926=test_numeric I, [2024-05-09T02:15:15.088154 #2352526] INFO -- : [647/885] 2393925=test_assignment I, [2024-05-09T02:15:15.218668 #2352526] INFO -- : [648/885] 2393926=test_ifunless I, [2024-05-09T02:15:15.230658 #2352526] INFO -- : [649/885] 2393926=test_gem_commands_lock_command I, [2024-05-09T02:15:15.231472 #2352526] INFO -- : [650/885] 2393920=test_tree_builder I, [2024-05-09T02:15:15.255702 #2352526] INFO -- : [651/885] 2393926=test_gem_resolver_dependency_request I, [2024-05-09T02:15:15.256789 #2352526] INFO -- : [652/885] 2393920=test_hash I, [2024-05-09T02:15:15.270932 #2352526] INFO -- : [653/885] 2393929=test_postponed_job I, [2024-05-09T02:15:15.282045 #2352526] INFO -- : [654/885] 2393924=test_alias_and_anchor I, [2024-05-09T02:15:15.282131 #2352526] INFO -- : [655/885] 2393926=test_external_new I, [2024-05-09T02:15:15.287430 #2352526] INFO -- : [656/885] 2393920=test_gem_request_set_lockfile I, [2024-05-09T02:15:15.295595 #2352526] INFO -- : [657/885] 2393924=test_raise_exception I, [2024-05-09T02:15:15.334267 #2352526] INFO -- : [658/885] 2393926=test_protect I, [2024-05-09T02:15:15.342748 #2352526] INFO -- : [659/885] 2393926=test_win32ole_typelib I, [2024-05-09T02:15:15.348172 #2352526] INFO -- : [660/885] 2393918=test_argf I, [2024-05-09T02:15:15.354181 #2352526] INFO -- : [661/885] 2393926=test_kill_ring I, [2024-05-09T02:15:15.359017 #2352526] INFO -- : [662/885] 2393926=test_ns_spki I, [2024-05-09T02:15:15.391232 #2352526] INFO -- : [663/885] 2393926=test_framework I, [2024-05-09T02:15:15.398342 #2352526] INFO -- : [664/885] 2393926=test_workspace I, [2024-05-09T02:15:15.624271 #2352526] INFO -- : [665/885] 2393926=test_weakmap I, [2024-05-09T02:15:15.800154 #2352526] INFO -- : [666/885] 2393929=test_yjit I, [2024-05-09T02:15:15.800224 #2352526] INFO -- : [667/885] 2393929=test_ws I, [2024-05-09T02:15:15.821443 #2352526] INFO -- : [668/885] 2393929=test_gem_commands_environment_command I, [2024-05-09T02:15:15.843863 #2352526] INFO -- : [669/885] 2393914=test_m17n I, [2024-05-09T02:15:15.894477 #2352526] INFO -- : [670/885] 2393929=test_gem_security_trust_dir I, [2024-05-09T02:15:15.942900 #2352526] INFO -- : [671/885] 2393914=test_string_memory I, [2024-05-09T02:15:15.998539 #2352526] INFO -- : [672/885] 2393929=comments_test I, [2024-05-09T02:15:16.039911 #2352526] INFO -- : [673/885] 2393914=test_sprintf I, [2024-05-09T02:15:16.074380 #2352526] INFO -- : [674/885] 2393929=test_gem_requirement I, [2024-05-09T02:15:16.128734 #2352526] INFO -- : [675/885] 2393920=test_line_editor I, [2024-05-09T02:15:16.154512 #2352526] INFO -- : [676/885] 2393920=test_objspace I, [2024-05-09T02:15:16.269577 #2352526] INFO -- : [677/885] 2393929=ripper_test I, [2024-05-09T02:15:16.274061 #2352526] INFO -- : [678/885] 2393914=test_undef I, [2024-05-09T02:15:16.275563 #2352526] INFO -- : [679/885] 2393914=test_lock_native_thread I, [2024-05-09T02:15:16.369648 #2352526] INFO -- : [680/885] 2393924=test_c_struct_entry I, [2024-05-09T02:15:16.683612 #2352526] INFO -- : [681/885] 2393914=test_gem_commands_stale_command I, [2024-05-09T02:15:16.714846 #2352526] INFO -- : [682/885] 2393914=test_remote_fetch_error I, [2024-05-09T02:15:16.741426 #2352526] INFO -- : [683/885] 2393914=test_have_library I, [2024-05-09T02:15:16.798403 #2352526] INFO -- : [684/885] 2393924=test_show_source I, [2024-05-09T02:15:16.817578 #2352526] INFO -- : [685/885] 2393924=test_set I, [2024-05-09T02:15:16.837306 #2352526] INFO -- : [686/885] 2393924=test_gem_impossible_dependencies_error I, [2024-05-09T02:15:16.851892 #2352526] INFO -- : [687/885] 2393924=test_array_create I, [2024-05-09T02:15:16.853917 #2352526] INFO -- : [688/885] 2393924=test_pack I, [2024-05-09T02:15:16.872806 #2352526] INFO -- : [689/885] 2393923=test_pattern_key_name_check I, [2024-05-09T02:15:16.880234 #2352526] INFO -- : [690/885] 2393921=test_to_ruby I, [2024-05-09T02:15:16.884669 #2352526] INFO -- : [691/885] 2393923=test_rdoc_rubygems_hook I, [2024-05-09T02:15:16.897062 #2352526] INFO -- : [692/885] 2393925=test_gem_commands_query_command I, [2024-05-09T02:15:16.907890 #2352526] INFO -- : [693/885] 2393921=test_method I, [2024-05-09T02:15:16.959588 #2352526] INFO -- : [694/885] 2393929=test_rdoc_context_section I, [2024-05-09T02:15:17.011153 #2352526] INFO -- : [695/885] 2393929=test_euc_kr I, [2024-05-09T02:15:17.015837 #2352526] INFO -- : [696/885] 2393929=test_ftp I, [2024-05-09T02:15:17.045268 #2352526] INFO -- : [697/885] 2393929=test_io_wait I, [2024-05-09T02:15:17.071320 #2352526] INFO -- : [698/885] 2393923=test_gem_commands_exec_command I, [2024-05-09T02:15:17.158426 #2352526] INFO -- : [699/885] 2393924=warnings_test I, [2024-05-09T02:15:17.171398 #2352526] INFO -- : [700/885] 2393910=test_kwargs I, [2024-05-09T02:15:17.180408 #2352526] INFO -- : [701/885] 2393910=test_ellipsize I, [2024-05-09T02:15:17.189383 #2352526] INFO -- : [702/885] 2393924=test_date_attr I, [2024-05-09T02:15:17.193857 #2352526] INFO -- : [703/885] 2393910=test_console_attr I, [2024-05-09T02:15:17.200345 #2352526] INFO -- : [704/885] 2393910=test_summary I, [2024-05-09T02:15:17.213680 #2352526] INFO -- : [705/885] 2393924=test_type_completor I, [2024-05-09T02:15:17.216222 #2352526] INFO -- : [706/885] 2393924=test_gem_unsatisfiable_dependency_error I, [2024-05-09T02:15:17.230360 #2352526] INFO -- : [707/885] 2393924=test_win32ole_record I, [2024-05-09T02:15:17.234552 #2352526] INFO -- : [708/885] 2393924=test_cp949 I, [2024-05-09T02:15:17.250510 #2352526] INFO -- : [709/885] 2393924=test_gem_commands_uninstall_command I, [2024-05-09T02:15:17.388495 #2352526] INFO -- : [710/885] 2393910=test_gem_source_specific_file I, [2024-05-09T02:15:17.397952 #2352526] INFO -- : [711/885] 2393929=test_foreach I, [2024-05-09T02:15:17.404748 #2352526] INFO -- : [712/885] 2393929=test_condition I, [2024-05-09T02:15:17.429192 #2352526] INFO -- : [713/885] 2393929=test_io I, [2024-05-09T02:15:17.479825 #2352526] INFO -- : [714/885] 2393916=test_sorted_set I, [2024-05-09T02:15:17.525443 #2352526] INFO -- : [715/885] 2393910=test_win32ole_type_event I, [2024-05-09T02:15:17.530698 #2352526] INFO -- : [716/885] 2393910=test_emoji I, [2024-05-09T02:15:17.601061 #2352526] INFO -- : [717/885] 2393910=test_ubf_async_safe I, [2024-05-09T02:15:17.613209 #2352526] INFO -- : [718/885] 2393910=test_hash I, [2024-05-09T02:15:17.784495 #2352526] INFO -- : [719/885] 2393929=test_libs I, [2024-05-09T02:15:17.787552 #2352526] INFO -- : [720/885] 2393925=test_gem_commands_fetch_command I, [2024-05-09T02:15:17.811977 #2352526] INFO -- : [721/885] 2393916=test_math I, [2024-05-09T02:15:17.834918 #2352526] INFO -- : [722/885] 2393916=test_gc I, [2024-05-09T02:15:17.838768 #2352526] INFO -- : [723/885] 2393929=test_sleep I, [2024-05-09T02:15:17.850656 #2352526] INFO -- : [724/885] 2393916=test_config I, [2024-05-09T02:15:17.908464 #2352526] INFO -- : [725/885] 2393916=test_yaml_tree I, [2024-05-09T02:15:17.934894 #2352526] INFO -- : [726/885] 2393916=test_sizeof I, [2024-05-09T02:15:17.955939 #2352526] INFO -- : [727/885] 2393925=test_case I, [2024-05-09T02:15:18.018125 #2352526] INFO -- : [728/885] 2393925=test_face I, [2024-05-09T02:15:18.031071 #2352526] INFO -- : [729/885] 2393917=test_rendering I, [2024-05-09T02:15:18.039392 #2352526] INFO -- : [730/885] 2393917=test_utf16 I, [2024-05-09T02:15:18.041671 #2352526] INFO -- : [731/885] 2393915=test_autoload I, [2024-05-09T02:15:18.051381 #2352526] INFO -- : [732/885] 2393925=test_io I, [2024-05-09T02:15:18.060552 #2352526] INFO -- : [733/885] 2393917=test_unicode_escape I, [2024-05-09T02:15:18.180852 #2352526] INFO -- : [734/885] 2393917=test_pkey_dh I, [2024-05-09T02:15:18.285063 #2352526] INFO -- : [735/885] 2393917=test_bigzero I, [2024-05-09T02:15:18.288473 #2352526] INFO -- : [736/885] 2393917=test_gem_package_tar_header I, [2024-05-09T02:15:18.346685 #2352526] INFO -- : [737/885] 2393924=test_gem_util I, [2024-05-09T02:15:18.386436 #2352526] INFO -- : [738/885] 2393917=test_iseq_load I, [2024-05-09T02:15:18.448618 #2352526] INFO -- : [739/885] 2393914=test_system I, [2024-05-09T02:15:18.562282 #2352526] INFO -- : [740/885] 2393922=test_pkcs12 I, [2024-05-09T02:15:18.581366 #2352526] INFO -- : [741/885] 2393924=test_yjit_exit_locations I, [2024-05-09T02:15:18.585606 #2352526] INFO -- : [742/885] 2393924=test_etc I, [2024-05-09T02:15:18.678195 #2352526] INFO -- : [743/885] 2393924=test_gem_config_file I, [2024-05-09T02:15:18.714864 #2352526] INFO -- : [744/885] 2393923=test_ripper I, [2024-05-09T02:15:18.835698 #2352526] INFO -- : [745/885] 2393927=test_getopts I, [2024-05-09T02:15:18.840021 #2352526] INFO -- : [746/885] 2393927=test_protocol I, [2024-05-09T02:15:18.862787 #2352526] INFO -- : [747/885] 2393924=test_gem_resolver_activation_request I, [2024-05-09T02:15:18.889622 #2352526] INFO -- : [748/885] 2393924=test_rat I, [2024-05-09T02:15:18.901848 #2352526] INFO -- : [749/885] 2393924=test_rdoc_markup_raw I, [2024-05-09T02:15:18.910973 #2352526] INFO -- : [750/885] 2393924=test_webauthn_poller I, [2024-05-09T02:15:19.002557 #2352526] INFO -- : [751/885] 2393922=test_rdoc_markup_to_html_crossref I, [2024-05-09T02:15:19.076303 #2352526] INFO -- : [752/885] 2393924=encoding_test I, [2024-05-09T02:15:19.149132 #2352526] INFO -- : [753/885] 2393927=test_gem_resolver_best_set I, [2024-05-09T02:15:19.165965 #2352526] INFO -- : [754/885] 2393924=test_typeddata I, [2024-05-09T02:15:19.218633 #2352526] INFO -- : [755/885] 2393923=test_fstring I, [2024-05-09T02:15:19.370611 #2352526] INFO -- : [756/885] 2393922=test_optparse I, [2024-05-09T02:15:19.373718 #2352526] INFO -- : [757/885] 2393923=test_array I, [2024-05-09T02:15:19.384055 #2352526] INFO -- : [758/885] 2393923=parser_test I, [2024-05-09T02:15:19.459884 #2352526] INFO -- : [759/885] 2393922=test_convertible I, [2024-05-09T02:15:19.468719 #2352526] INFO -- : [760/885] 2393923=test_rdoc_alias I, [2024-05-09T02:15:19.482372 #2352526] INFO -- : [761/885] 2393923=test_yield I, [2024-05-09T02:15:19.526790 #2352526] INFO -- : [762/885] 2393924=test_stringscanner I, [2024-05-09T02:15:19.538169 #2352526] INFO -- : [763/885] 2393927=test_files_sample I, [2024-05-09T02:15:19.586628 #2352526] INFO -- : [764/885] 2393924=test_rdoc_markup_indented_paragraph I, [2024-05-09T02:15:19.591357 #2352526] INFO -- : [765/885] 2393924=test_backtrace I, [2024-05-09T02:15:19.656554 #2352526] INFO -- : [766/885] 2393927=test_pack I, [2024-05-09T02:15:19.668956 #2352526] INFO -- : [767/885] 2393927=ruby_parser_test I, [2024-05-09T02:15:19.676150 #2352526] INFO -- : [768/885] 2393927=test_io_buffer I, [2024-05-09T02:15:19.722790 #2352526] INFO -- : [769/885] 2393926=test_gem_resolver_conflict I, [2024-05-09T02:15:19.729779 #2352526] INFO -- : [770/885] 2393926=test_rdoc_task I, [2024-05-09T02:15:19.759792 #2352526] INFO -- : [771/885] 2393926=test_gem_commands_install_command I, [2024-05-09T02:15:19.787597 #2352526] INFO -- : [772/885] 2393927=test_clone I, [2024-05-09T02:15:19.896676 #2352526] INFO -- : [773/885] 2393914=test_readpartial I, [2024-05-09T02:15:19.907346 #2352526] INFO -- : [774/885] 2393929=locals_test I, [2024-05-09T02:15:20.015632 #2352526] INFO -- : [775/885] 2393927=test_rdoc_require I, [2024-05-09T02:15:20.301874 #2352526] INFO -- : [776/885] 2393914=test_shapes I, [2024-05-09T02:15:20.312934 #2352526] INFO -- : [777/885] 2393914=json_fixtures_test I, [2024-05-09T02:15:20.317160 #2352526] INFO -- : [778/885] 2393927=test_io_timeout I, [2024-05-09T02:15:20.318376 #2352526] INFO -- : [779/885] 2393917=test_rdoc_parser_c I, [2024-05-09T02:15:20.321654 #2352526] INFO -- : [780/885] 2393927=test_comparable I, [2024-05-09T02:15:20.327194 #2352526] INFO -- : [781/885] 2393914=test_enc_str_buf_cat I, [2024-05-09T02:15:20.330701 #2352526] INFO -- : [782/885] 2393914=test_class2name I, [2024-05-09T02:15:20.337406 #2352526] INFO -- : [783/885] 2393914=test_gbk I, [2024-05-09T02:15:20.339972 #2352526] INFO -- : [784/885] 2393927=test_profile_frames I, [2024-05-09T02:15:20.342186 #2352526] INFO -- : [785/885] 2393914=test_pstore I, [2024-05-09T02:15:20.381530 #2352526] INFO -- : [786/885] 2393914=test_cstr I, [2024-05-09T02:15:20.519665 #2352526] INFO -- : [787/885] 2393929=test_big2str I, [2024-05-09T02:15:20.528029 #2352526] INFO -- : [788/885] 2393929=test_wait I, [2024-05-09T02:15:20.571135 #2352526] INFO -- : [789/885] 2393927=test_handle I, [2024-05-09T02:15:20.641538 #2352526] INFO -- : [790/885] 2393929=test_forwardable I, [2024-05-09T02:15:20.679024 #2352526] INFO -- : [791/885] 2393917=test_yaml I, [2024-05-09T02:15:20.721542 #2352526] INFO -- : [792/885] 2393929=test_rdoc_markup_formatter I, [2024-05-09T02:15:20.771251 #2352526] INFO -- : [793/885] 2393929=test_thread_queue I, [2024-05-09T02:15:20.815365 #2352526] INFO -- : [794/885] 2393927=test_nowrite I, [2024-05-09T02:15:20.834136 #2352526] INFO -- : [795/885] 2393927=test_gem_commands_sources_command I, [2024-05-09T02:15:20.884939 #2352526] INFO -- : [796/885] 2393917=test_ansi_without_terminfo I, [2024-05-09T02:15:20.901288 #2352526] INFO -- : [797/885] 2393917=test_ractor I, [2024-05-09T02:15:20.925119 #2352526] INFO -- : [798/885] 2393917=test_euc_tw I, [2024-05-09T02:15:20.939607 #2352526] INFO -- : [799/885] 2393917=test_bmethod I, [2024-05-09T02:15:20.949898 #2352526] INFO -- : [800/885] 2393917=test_pathname I, [2024-05-09T02:15:20.957247 #2352526] INFO -- : [801/885] 2393924=test_complexrational I, [2024-05-09T02:15:20.964901 #2352526] INFO -- : [802/885] 2393924=test_init I, [2024-05-09T02:15:21.082480 #2352526] INFO -- : [803/885] 2393927=regexp_test I, [2024-05-09T02:15:21.092228 #2352526] INFO -- : [804/885] 2393927=test_gem_package_tar_reader I, [2024-05-09T02:15:21.152774 #2352526] INFO -- : [805/885] 2393927=test_rdoc_encoding I, [2024-05-09T02:15:21.162016 #2352526] INFO -- : [806/885] 2393918=test_coverage I, [2024-05-09T02:15:21.168334 #2352526] INFO -- : [807/885] 2393914=test_file I, [2024-05-09T02:15:21.174210 #2352526] INFO -- : [808/885] 2393914=test_rdoc_any_method I, [2024-05-09T02:15:21.193185 #2352526] INFO -- : [809/885] 2393927=test_modify_expand I, [2024-05-09T02:15:21.198447 #2352526] INFO -- : [810/885] 2393927=test_rdoc_markdown I, [2024-05-09T02:15:21.303727 #2352526] INFO -- : [811/885] 2393917=test_gem_available_set I, [2024-05-09T02:15:21.417427 #2352526] INFO -- : [812/885] 2393917=test_formatter I, [2024-05-09T02:15:21.426202 #2352526] INFO -- : [813/885] 2393917=test_bash_completion I, [2024-05-09T02:15:21.436004 #2352526] INFO -- : [814/885] 2393917=test_deprecate I, [2024-05-09T02:15:21.477777 #2352526] INFO -- : [815/885] 2393917=test_rdoc_constant I, [2024-05-09T02:15:21.508801 #2352526] INFO -- : [816/885] 2393924=test_recorder I, [2024-05-09T02:15:21.517365 #2352526] INFO -- : [817/885] 2393924=test_gem_source_vendor I, [2024-05-09T02:15:21.537580 #2352526] INFO -- : [818/885] 2393924=test_gem_commands_owner_command I, [2024-05-09T02:15:21.582954 #2352526] INFO -- : [819/885] 2393913=test_digest I, [2024-05-09T02:15:21.591254 #2352526] INFO -- : [820/885] 2393914=test_marshalable I, [2024-05-09T02:15:21.598060 #2352526] INFO -- : [821/885] 2393917=test_require I, [2024-05-09T02:15:21.600595 #2352526] INFO -- : [822/885] 2393914=test_cgi_util I, [2024-05-09T02:15:21.609737 #2352526] INFO -- : [823/885] 2393926=test_gem_commands_contents_command I, [2024-05-09T02:15:21.617822 #2352526] INFO -- : [824/885] 2393927=test_gem_ext_cmake_builder I, [2024-05-09T02:15:21.647968 #2352526] INFO -- : [825/885] 2393927=test_wss I, [2024-05-09T02:15:21.662389 #2352526] INFO -- : [826/885] 2393927=test_fiddle I, [2024-05-09T02:15:21.709345 #2352526] INFO -- : [827/885] 2393926=test_find I, [2024-05-09T02:15:21.731285 #2352526] INFO -- : [828/885] 2393927=test_ractor I, [2024-05-09T02:15:21.739033 #2352526] INFO -- : [829/885] 2393926=test_function I, [2024-05-09T02:15:21.849764 #2352526] INFO -- : [830/885] 2393914=test_queue I, [2024-05-09T02:15:21.862583 #2352526] INFO -- : [831/885] 2393914=parse_comments_test I, [2024-05-09T02:15:21.866051 #2352526] INFO -- : [832/885] 2393914=test_noarg I, [2024-05-09T02:15:21.885174 #2352526] INFO -- : [833/885] 2393927=test_tempfile I, [2024-05-09T02:15:21.968559 #2352526] INFO -- : [834/885] 2393926=test_tracepoint I, [2024-05-09T02:15:22.150843 #2352526] INFO -- : [835/885] 2393924=test_prettyprint I, [2024-05-09T02:15:22.165571 #2352526] INFO -- : [836/885] 2393924=test_gem_commands_help_command I, [2024-05-09T02:15:22.182670 #2352526] INFO -- : [837/885] 2393927=test_rdoc_markup I, [2024-05-09T02:15:22.192688 #2352526] INFO -- : [838/885] 2393914=test_duplicate I, [2024-05-09T02:15:22.194804 #2352526] INFO -- : [839/885] 2393927=test_utf32 I, [2024-05-09T02:15:22.207822 #2352526] INFO -- : [840/885] 2393927=test_basicsocket I, [2024-05-09T02:15:22.210941 #2352526] INFO -- : [841/885] 2393914=test_gem_resolver_index_specification I, [2024-05-09T02:15:22.227045 #2352526] INFO -- : [842/885] 2393918=test_internal_ivar I, [2024-05-09T02:15:22.229487 #2352526] INFO -- : [843/885] 2393927=test_rdoc_parser_rd I, [2024-05-09T02:15:22.233011 #2352526] INFO -- : [844/885] 2393918=test_date_strftime I, [2024-05-09T02:15:22.261729 #2352526] INFO -- : [845/885] 2393927=test_gem_installer I, [2024-05-09T02:15:22.267163 #2352526] INFO -- : [846/885] 2393924=test_yamlstore I, [2024-05-09T02:15:22.271773 #2352526] INFO -- : [847/885] 2393914=test_asn1 I, [2024-05-09T02:15:22.282116 #2352526] INFO -- : [848/885] 2393924=test_random I, [2024-05-09T02:15:22.291590 #2352526] INFO -- : [849/885] 2393914=json_string_matching_test I, [2024-05-09T02:15:22.301279 #2352526] INFO -- : [850/885] 2393914=test_load I, [2024-05-09T02:15:22.307224 #2352526] INFO -- : [851/885] 2393924=test_class I, [2024-05-09T02:15:22.312073 #2352526] INFO -- : [852/885] 2393914=test_rdoc_normal_class I, [2024-05-09T02:15:22.338934 #2352526] INFO -- : [853/885] 2393926=test_const I, [2024-05-09T02:15:22.341010 #2352526] INFO -- : [854/885] 2393926=test_irb I, [2024-05-09T02:15:22.400223 #2352526] INFO -- : [855/885] 2393921=test_complex I, [2024-05-09T02:15:22.413339 #2352526] INFO -- : [856/885] 2393914=test_gem_commands_search_command I, [2024-05-09T02:15:22.415391 #2352526] INFO -- : [857/885] 2393914=test_method_cache I, [2024-05-09T02:15:22.416218 #2352526] INFO -- : [858/885] 2393914=test_gem_stub_specification I, [2024-05-09T02:15:22.514113 #2352526] INFO -- : [859/885] 2393916=test_frozen_error I, [2024-05-09T02:15:22.523576 #2352526] INFO -- : [860/885] 2393916=test_gem_ext_ext_conf_builder I, [2024-05-09T02:15:22.592143 #2352526] INFO -- : [861/885] 2393914=test_path_to_class I, [2024-05-09T02:15:22.596691 #2352526] INFO -- : [862/885] 2393914=test_gem_resolver_specification I, [2024-05-09T02:15:22.597677 #2352526] INFO -- : [863/885] 2393921=test_gem_dependency I, [2024-05-09T02:15:22.616472 #2352526] INFO -- : [864/885] 2393913=test_inlinecache I, [2024-05-09T02:15:22.636877 #2352526] INFO -- : [865/885] 2393914=test_rdoc_markup_verbatim I, [2024-05-09T02:15:22.666892 #2352526] INFO -- : [866/885] 2393914=test_gem_remote_fetcher I, [2024-05-09T02:15:22.693890 #2352526] INFO -- : [867/885] 2393913=test_parse I, [2024-05-09T02:15:22.703812 #2352526] INFO -- : [868/885] 2393910=test_mdns I, [2024-05-09T02:15:22.729398 #2352526] INFO -- : [869/885] 2393910=test_gem_resolver_installed_specification I, [2024-05-09T02:15:22.737963 #2352526] INFO -- : [870/885] 2393918=test_scanner_events I, [2024-05-09T02:15:22.746992 #2352526] INFO -- : [871/885] 2393910=test_reqarg I, [2024-05-09T02:15:22.772760 #2352526] INFO -- : [872/885] 2393918=test_rdoc_include I, [2024-05-09T02:15:22.802291 #2352526] INFO -- : [873/885] 2393926=test_stack I, [2024-05-09T02:15:22.824762 #2352526] INFO -- : [874/885] 2393918=test_gem_commands_list_command I, [2024-05-09T02:15:22.833792 #2352526] INFO -- : [875/885] 2393921=test_too_many_dummy_encodings I, [2024-05-09T02:15:22.843334 #2352526] INFO -- : [876/885] 2393918=test_econv I, [2024-05-09T02:15:22.928398 #2352526] INFO -- : [877/885] 2393923=test_cesu8 I, [2024-05-09T02:15:22.930286 #2352526] INFO -- : [878/885] 2393923=test_rdoc_options I, [2024-05-09T02:15:22.939616 #2352526] INFO -- : [879/885] 2393921=test_gem_version I, [2024-05-09T02:15:23.065777 #2352526] INFO -- : [880/885] 2393921=test_ldap I, [2024-05-09T02:15:23.073152 #2352526] INFO -- : [881/885] 2393921=test_emitter I, [2024-05-09T02:15:23.078982 #2352526] INFO -- : [882/885] 2393921=test_resource I, [2024-05-09T02:15:23.086062 #2352526] INFO -- : [883/885] 2393921=test_gem_commands_signin_command I, [2024-05-09T02:15:23.193466 #2352526] INFO -- : [884/885] 2393923=test_string_processing I, [2024-05-09T02:15:23.204781 #2352526] INFO -- : [885/885] 2393921=test_fileutils I, [2024-05-09T02:15:36.877528 #2352526] INFO -- : Finished tests in 38.975328s, 676.6588 tests/s, 240003.8535 assertions/s. E, [2024-05-09T02:15:36.877656 #2352526] ERROR -- : Children under /tmp/rubytest.485gqk: E, [2024-05-09T02:15:36.877728 #2352526] ERROR -- : * drwx------ 4 80 2024-05-09 02:14:58 +0000 gem_rebuild20240509-2393926-tjd5ec/ E, [2024-05-09T02:15:36.877746 #2352526] ERROR -- : * drwxrwxr-x 2 60 2024-05-09 02:14:58 +0000 new/ E, [2024-05-09T02:15:36.877758 #2352526] ERROR -- : * -rw-rw-r-- 1 4096 2024-05-09 02:14:58 +0000 rebuild_test_gem-1.0.0.gem E, [2024-05-09T02:15:36.877773 #2352526] ERROR -- : * drwxrwxr-x 2 60 2024-05-09 02:14:58 +0000 old/ E, [2024-05-09T02:15:36.877786 #2352526] ERROR -- : * -rw-rw-r-- 1 4096 2024-05-09 02:14:58 +0000 rebuild_test_gem-1.0.0.gem I, [2024-05-09T02:15:36.878916 #2352526] INFO -- : 26373 tests, 9354229 assertions, 0 failures, 0 errors, 306 skips I, [2024-05-09T02:15:36.878981 #2352526] INFO -- : I, [2024-05-09T02:15:36.878996 #2352526] INFO -- : ruby -v: ruby 3.4.0dev (2024-05-09T01:11:19Z master d6564615e7) [x86_64-linux] I, [2024-05-09T02:15:36.880912 #2352526] INFO -- : $$$[end] "make yes-test-all TESTOPTS='--stderr-on-failure' TESTS='-j20'" exit with 0. I, [2024-05-09T02:15:36.881060 #2352526] INFO -- : $$$[beg] make yes-test-rubyspec MSPECOPT='--error-output stderr --debug -j' TESTS='-j20' I, [2024-05-09T02:15:36.967095 #2352526] INFO -- : BASERUBY = /usr/bin/ruby --disable=gems I, [2024-05-09T02:15:36.967132 #2352526] INFO -- : CC = gcc I, [2024-05-09T02:15:36.967140 #2352526] INFO -- : LD = ld I, [2024-05-09T02:15:36.967146 #2352526] INFO -- : LDSHARED = gcc -shared I, [2024-05-09T02:15:36.967153 #2352526] INFO -- : CFLAGS = -O3 -fno-fast-math -ggdb3 -Wall -Wextra -Wdeprecated-declarations -Wdiv-by-zero -Wduplicated-cond -Wimplicit-function-declaration -Wimplicit-int -Wpointer-arith -Wwrite-strings -Wold-style-definition -Wimplicit-fallthrough=0 -Wmissing-noreturn -Wno-cast-function-type -Wno-constant-logical-operand -Wno-long-long -Wno-missing-field-initializers -Wno-overlength-strings -Wno-packed-bitfield-compat -Wno-parentheses-equality -Wno-self-assign -Wno-tautological-compare -Wno-unused-parameter -Wno-unused-value -Wsuggest-attribute=format -Wsuggest-attribute=noreturn -Wunused-variable -Wmisleading-indentation -Wundef -fPIC I, [2024-05-09T02:15:36.967159 #2352526] INFO -- : XCFLAGS = -U_FORTIFY_SOURCE -D_FORTIFY_SOURCE=2 -fstack-protector-strong -fno-strict-overflow -fvisibility=hidden -fexcess-precision=standard -DRUBY_EXPORT -I. -I.ext/include/x86_64-linux -I/tmp/ruby/src/trunk/include -I/tmp/ruby/src/trunk -I/tmp/ruby/src/trunk/prism -I/tmp/ruby/src/trunk/enc/unicode/15.0.0 I, [2024-05-09T02:15:36.967165 #2352526] INFO -- : CPPFLAGS = I, [2024-05-09T02:15:36.967172 #2352526] INFO -- : DLDFLAGS = -Wl,--compress-debug-sections=zlib -Wl,-soname,libruby.so.3.4 -fstack-protector-strong I, [2024-05-09T02:15:36.967178 #2352526] INFO -- : SOLIBS = -lz -lrt -lrt -lgmp -ldl -lcrypt -lm -lpthread I, [2024-05-09T02:15:36.967183 #2352526] INFO -- : LANG = en_US.UTF-8 I, [2024-05-09T02:15:36.967189 #2352526] INFO -- : LC_ALL = I, [2024-05-09T02:15:36.967195 #2352526] INFO -- : LC_CTYPE = I, [2024-05-09T02:15:36.967200 #2352526] INFO -- : MFLAGS = I, [2024-05-09T02:15:36.967206 #2352526] INFO -- : RUSTC = no I, [2024-05-09T02:15:36.967212 #2352526] INFO -- : YJIT_RUSTC_ARGS = --crate-name=yjit --crate-type=staticlib --edition=2021 -g -C lto=thin -C opt-level=3 -C overflow-checks=on '--out-dir=/tmp/ruby/build/trunk/yjit/target/release/' /tmp/ruby/src/trunk/yjit/src/lib.rs I, [2024-05-09T02:15:36.967826 #2352526] INFO -- : gcc (Ubuntu 11.4.0-1ubuntu1~22.04) 11.4.0 I, [2024-05-09T02:15:36.967833 #2352526] INFO -- : Copyright (C) 2021 Free Software Foundation, Inc. I, [2024-05-09T02:15:36.967838 #2352526] INFO -- : This is free software; see the source for copying conditions. There is NO I, [2024-05-09T02:15:36.967844 #2352526] INFO -- : warranty; not even for MERCHANTABILITY or FITNESS FOR A PARTICULAR PURPOSE. I, [2024-05-09T02:15:36.967850 #2352526] INFO -- : I, [2024-05-09T02:15:36.969765 #2352526] INFO -- : generating enc.mk I, [2024-05-09T02:15:37.087527 #2352526] INFO -- : making enc I, [2024-05-09T02:15:37.104582 #2352526] INFO -- : make[1]: Entering directory '/tmp/ruby/build/trunk' I, [2024-05-09T02:15:37.104595 #2352526] INFO -- : make[1]: Nothing to be done for 'enc'. I, [2024-05-09T02:15:37.104602 #2352526] INFO -- : make[1]: Leaving directory '/tmp/ruby/build/trunk' I, [2024-05-09T02:15:37.105245 #2352526] INFO -- : making srcs under enc I, [2024-05-09T02:15:37.134599 #2352526] INFO -- : make[1]: Entering directory '/tmp/ruby/build/trunk' I, [2024-05-09T02:15:37.134613 #2352526] INFO -- : make[1]: Nothing to be done for 'srcs'. I, [2024-05-09T02:15:37.134619 #2352526] INFO -- : make[1]: Leaving directory '/tmp/ruby/build/trunk' I, [2024-05-09T02:15:37.135617 #2352526] INFO -- : generating transdb.h I, [2024-05-09T02:15:37.230734 #2352526] INFO -- : transdb.h unchanged I, [2024-05-09T02:15:37.232112 #2352526] INFO -- : making trans I, [2024-05-09T02:15:37.266088 #2352526] INFO -- : make[1]: Entering directory '/tmp/ruby/build/trunk' I, [2024-05-09T02:15:37.266097 #2352526] INFO -- : make[1]: Nothing to be done for 'trans'. I, [2024-05-09T02:15:37.266103 #2352526] INFO -- : make[1]: Leaving directory '/tmp/ruby/build/trunk' I, [2024-05-09T02:15:37.266804 #2352526] INFO -- : making encs I, [2024-05-09T02:15:37.303888 #2352526] INFO -- : make[1]: Entering directory '/tmp/ruby/build/trunk' I, [2024-05-09T02:15:37.303898 #2352526] INFO -- : make[1]: Nothing to be done for 'encs'. I, [2024-05-09T02:15:37.303904 #2352526] INFO -- : make[1]: Leaving directory '/tmp/ruby/build/trunk' I, [2024-05-09T02:15:37.305714 #2352526] INFO -- : generating makefiles ext/configure-ext.mk I, [2024-05-09T02:15:37.332879 #2352526] INFO -- : ext/configure-ext.mk updated I, [2024-05-09T02:15:37.335315 #2352526] INFO -- : make[1]: Entering directory '/tmp/ruby/build/trunk' I, [2024-05-09T02:15:38.732389 #2352526] INFO -- : make[1]: Leaving directory '/tmp/ruby/build/trunk' I, [2024-05-09T02:15:38.733004 #2352526] INFO -- : generating makefile exts.mk I, [2024-05-09T02:15:38.770255 #2352526] INFO -- : exts.mk unchanged I, [2024-05-09T02:15:38.775048 #2352526] INFO -- : make[1]: Entering directory '/tmp/ruby/build/trunk' I, [2024-05-09T02:15:38.986304 #2352526] INFO -- : make[2]: Entering directory '/tmp/ruby/build/trunk/ext/coverage' I, [2024-05-09T02:15:38.989162 #2352526] INFO -- : make[2]: Leaving directory '/tmp/ruby/build/trunk/ext/coverage' I, [2024-05-09T02:15:38.993084 #2352526] INFO -- : make[2]: Entering directory '/tmp/ruby/build/trunk/ext/date' I, [2024-05-09T02:15:38.996195 #2352526] INFO -- : make[2]: Leaving directory '/tmp/ruby/build/trunk/ext/date' I, [2024-05-09T02:15:38.998372 #2352526] INFO -- : make[2]: Entering directory '/tmp/ruby/build/trunk/ext/digest' I, [2024-05-09T02:15:39.003787 #2352526] INFO -- : make[2]: Leaving directory '/tmp/ruby/build/trunk/ext/digest' I, [2024-05-09T02:15:39.019400 #2352526] INFO -- : make[2]: Entering directory '/tmp/ruby/build/trunk/ext/digest/sha2' I, [2024-05-09T02:15:39.022401 #2352526] INFO -- : make[2]: Leaving directory '/tmp/ruby/build/trunk/ext/digest/sha2' I, [2024-05-09T02:15:39.035096 #2352526] INFO -- : make[2]: Entering directory '/tmp/ruby/build/trunk/ext/fiddle' I, [2024-05-09T02:15:39.041491 #2352526] INFO -- : make[2]: Leaving directory '/tmp/ruby/build/trunk/ext/fiddle' I, [2024-05-09T02:15:39.044482 #2352526] INFO -- : make[2]: Entering directory '/tmp/ruby/build/trunk/ext/io/console' I, [2024-05-09T02:15:39.047052 #2352526] INFO -- : make[2]: Leaving directory '/tmp/ruby/build/trunk/ext/io/console' I, [2024-05-09T02:15:39.054761 #2352526] INFO -- : make[2]: Entering directory '/tmp/ruby/build/trunk/ext/json' I, [2024-05-09T02:15:39.061091 #2352526] INFO -- : make[2]: Leaving directory '/tmp/ruby/build/trunk/ext/json' I, [2024-05-09T02:15:39.070022 #2352526] INFO -- : make[2]: Entering directory '/tmp/ruby/build/trunk/ext/monitor' I, [2024-05-09T02:15:39.072503 #2352526] INFO -- : make[2]: Leaving directory '/tmp/ruby/build/trunk/ext/monitor' I, [2024-05-09T02:15:39.076722 #2352526] INFO -- : make[2]: Entering directory '/tmp/ruby/build/trunk/ext/objspace' I, [2024-05-09T02:15:39.080428 #2352526] INFO -- : make[2]: Leaving directory '/tmp/ruby/build/trunk/ext/objspace' I, [2024-05-09T02:15:39.092292 #2352526] INFO -- : make[2]: Entering directory '/tmp/ruby/build/trunk/ext/openssl' I, [2024-05-09T02:15:39.105411 #2352526] INFO -- : make[2]: Leaving directory '/tmp/ruby/build/trunk/ext/openssl' I, [2024-05-09T02:15:39.108344 #2352526] INFO -- : make[2]: Entering directory '/tmp/ruby/build/trunk/ext/pathname' I, [2024-05-09T02:15:39.110775 #2352526] INFO -- : make[2]: Leaving directory '/tmp/ruby/build/trunk/ext/pathname' I, [2024-05-09T02:15:39.114998 #2352526] INFO -- : make[2]: Entering directory '/tmp/ruby/build/trunk/ext/psych' I, [2024-05-09T02:15:39.129872 #2352526] INFO -- : make[2]: Leaving directory '/tmp/ruby/build/trunk/ext/psych' I, [2024-05-09T02:15:39.132911 #2352526] INFO -- : make[2]: Entering directory '/tmp/ruby/build/trunk/ext/pty' I, [2024-05-09T02:15:39.135517 #2352526] INFO -- : make[2]: Leaving directory '/tmp/ruby/build/trunk/ext/pty' I, [2024-05-09T02:15:39.145089 #2352526] INFO -- : make[2]: Entering directory '/tmp/ruby/build/trunk/ext/ripper' I, [2024-05-09T02:15:39.150065 #2352526] INFO -- : make[2]: Leaving directory '/tmp/ruby/build/trunk/ext/ripper' I, [2024-05-09T02:15:39.151613 #2352526] INFO -- : make[2]: Entering directory '/tmp/ruby/build/trunk/ext/rubyvm' I, [2024-05-09T02:15:39.153677 #2352526] INFO -- : make[2]: Leaving directory '/tmp/ruby/build/trunk/ext/rubyvm' I, [2024-05-09T02:15:39.161559 #2352526] INFO -- : make[2]: Entering directory '/tmp/ruby/build/trunk/ext/socket' I, [2024-05-09T02:15:39.167963 #2352526] INFO -- : make[2]: Leaving directory '/tmp/ruby/build/trunk/ext/socket' I, [2024-05-09T02:15:39.178800 #2352526] INFO -- : make[2]: Entering directory '/tmp/ruby/build/trunk/.bundle/gems/bigdecimal-3.1.7/ext/bigdecimal' I, [2024-05-09T02:15:39.201311 #2352526] INFO -- : make[2]: Leaving directory '/tmp/ruby/build/trunk/.bundle/gems/bigdecimal-3.1.7/ext/bigdecimal' I, [2024-05-09T02:15:39.203317 #2352526] INFO -- : make[2]: Entering directory '/tmp/ruby/build/trunk/.bundle/gems/bigdecimal-3.1.8/ext/bigdecimal' I, [2024-05-09T02:15:39.225145 #2352526] INFO -- : make[2]: Leaving directory '/tmp/ruby/build/trunk/.bundle/gems/bigdecimal-3.1.8/ext/bigdecimal' I, [2024-05-09T02:15:39.227133 #2352526] INFO -- : make[2]: Entering directory '/tmp/ruby/build/trunk/.bundle/gems/debug-1.9.2/ext/debug' I, [2024-05-09T02:15:39.248892 #2352526] INFO -- : make[2]: Leaving directory '/tmp/ruby/build/trunk/.bundle/gems/debug-1.9.2/ext/debug' I, [2024-05-09T02:15:39.250800 #2352526] INFO -- : make[2]: Entering directory '/tmp/ruby/build/trunk/.bundle/gems/nkf-0.2.0/ext/nkf' I, [2024-05-09T02:15:39.272969 #2352526] INFO -- : make[2]: Leaving directory '/tmp/ruby/build/trunk/.bundle/gems/nkf-0.2.0/ext/nkf' I, [2024-05-09T02:15:39.274874 #2352526] INFO -- : make[2]: Entering directory '/tmp/ruby/build/trunk/.bundle/gems/racc-1.7.3/ext/racc/cparse' I, [2024-05-09T02:15:39.296590 #2352526] INFO -- : make[2]: Leaving directory '/tmp/ruby/build/trunk/.bundle/gems/racc-1.7.3/ext/racc/cparse' I, [2024-05-09T02:15:39.299182 #2352526] INFO -- : make[2]: Entering directory '/tmp/ruby/build/trunk/.bundle/gems/rbs-3.4.4/ext/rbs_extension' I, [2024-05-09T02:15:39.321592 #2352526] INFO -- : make[2]: Leaving directory '/tmp/ruby/build/trunk/.bundle/gems/rbs-3.4.4/ext/rbs_extension' I, [2024-05-09T02:15:39.323652 #2352526] INFO -- : make[2]: Entering directory '/tmp/ruby/build/trunk/.bundle/gems/syslog-0.1.2/ext/syslog' I, [2024-05-09T02:15:39.345877 #2352526] INFO -- : make[2]: Leaving directory '/tmp/ruby/build/trunk/.bundle/gems/syslog-0.1.2/ext/syslog' I, [2024-05-09T02:15:39.369123 #2352526] INFO -- : make[2]: Entering directory '/tmp/ruby/build/trunk' I, [2024-05-09T02:15:39.433009 #2352526] INFO -- : make[2]: 'ruby' is up to date. I, [2024-05-09T02:15:39.433020 #2352526] INFO -- : make[2]: Leaving directory '/tmp/ruby/build/trunk' I, [2024-05-09T02:15:39.433406 #2352526] INFO -- : make[1]: Leaving directory '/tmp/ruby/build/trunk' I, [2024-05-09T02:15:39.437311 #2352526] INFO -- : make[1]: Entering directory '/tmp/ruby/build/trunk' I, [2024-05-09T02:15:39.437319 #2352526] INFO -- : make[1]: Nothing to be done for 'note'. I, [2024-05-09T02:15:39.437325 #2352526] INFO -- : make[1]: Leaving directory '/tmp/ruby/build/trunk' E, [2024-05-09T02:15:39.494381 #2352526] ERROR -- : $ /tmp/ruby/build/trunk/miniruby -I/tmp/ruby/src/trunk/lib /tmp/ruby/src/trunk/tool/runruby.rb --archdir=/tmp/ruby/build/trunk --extout=.ext -- /tmp/ruby/src/trunk/spec/mspec/bin/mspec-run -B /tmp/ruby/src/trunk/spec/default.mspec --error-output stderr --debug -fy -o /tmp/rubytest.41ai2b/1-mspec-multi-0 E, [2024-05-09T02:15:39.494615 #2352526] ERROR -- : $ /tmp/ruby/build/trunk/miniruby -I/tmp/ruby/src/trunk/lib /tmp/ruby/src/trunk/tool/runruby.rb --archdir=/tmp/ruby/build/trunk --extout=.ext -- /tmp/ruby/src/trunk/spec/mspec/bin/mspec-run -B /tmp/ruby/src/trunk/spec/default.mspec --error-output stderr --debug -fy -o /tmp/rubytest.41ai2b/2-mspec-multi-1 E, [2024-05-09T02:15:39.494877 #2352526] ERROR -- : $ /tmp/ruby/build/trunk/miniruby -I/tmp/ruby/src/trunk/lib /tmp/ruby/src/trunk/tool/runruby.rb --archdir=/tmp/ruby/build/trunk --extout=.ext -- /tmp/ruby/src/trunk/spec/mspec/bin/mspec-run -B /tmp/ruby/src/trunk/spec/default.mspec --error-output stderr --debug -fy -o /tmp/rubytest.41ai2b/3-mspec-multi-2 E, [2024-05-09T02:15:39.495100 #2352526] ERROR -- : $ /tmp/ruby/build/trunk/miniruby -I/tmp/ruby/src/trunk/lib /tmp/ruby/src/trunk/tool/runruby.rb --archdir=/tmp/ruby/build/trunk --extout=.ext -- /tmp/ruby/src/trunk/spec/mspec/bin/mspec-run -B /tmp/ruby/src/trunk/spec/default.mspec --error-output stderr --debug -fy -o /tmp/rubytest.41ai2b/4-mspec-multi-3 E, [2024-05-09T02:15:39.495247 #2352526] ERROR -- : $ /tmp/ruby/build/trunk/miniruby -I/tmp/ruby/src/trunk/lib /tmp/ruby/src/trunk/tool/runruby.rb --archdir=/tmp/ruby/build/trunk --extout=.ext -- /tmp/ruby/src/trunk/spec/mspec/bin/mspec-run -B /tmp/ruby/src/trunk/spec/default.mspec --error-output stderr --debug -fy -o /tmp/rubytest.41ai2b/5-mspec-multi-4 E, [2024-05-09T02:15:39.495348 #2352526] ERROR -- : $ /tmp/ruby/build/trunk/miniruby -I/tmp/ruby/src/trunk/lib /tmp/ruby/src/trunk/tool/runruby.rb --archdir=/tmp/ruby/build/trunk --extout=.ext -- /tmp/ruby/src/trunk/spec/mspec/bin/mspec-run -B /tmp/ruby/src/trunk/spec/default.mspec --error-output stderr --debug -fy -o /tmp/rubytest.41ai2b/6-mspec-multi-5 E, [2024-05-09T02:15:39.495624 #2352526] ERROR -- : $ /tmp/ruby/build/trunk/miniruby -I/tmp/ruby/src/trunk/lib /tmp/ruby/src/trunk/tool/runruby.rb --archdir=/tmp/ruby/build/trunk --extout=.ext -- /tmp/ruby/src/trunk/spec/mspec/bin/mspec-run -B /tmp/ruby/src/trunk/spec/default.mspec --error-output stderr --debug -fy -o /tmp/rubytest.41ai2b/7-mspec-multi-6 E, [2024-05-09T02:15:39.495795 #2352526] ERROR -- : $ /tmp/ruby/build/trunk/miniruby -I/tmp/ruby/src/trunk/lib /tmp/ruby/src/trunk/tool/runruby.rb --archdir=/tmp/ruby/build/trunk --extout=.ext -- /tmp/ruby/src/trunk/spec/mspec/bin/mspec-run -B /tmp/ruby/src/trunk/spec/default.mspec --error-output stderr --debug -fy -o /tmp/rubytest.41ai2b/8-mspec-multi-7 E, [2024-05-09T02:15:39.495992 #2352526] ERROR -- : $ /tmp/ruby/build/trunk/miniruby -I/tmp/ruby/src/trunk/lib /tmp/ruby/src/trunk/tool/runruby.rb --archdir=/tmp/ruby/build/trunk --extout=.ext -- /tmp/ruby/src/trunk/spec/mspec/bin/mspec-run -B /tmp/ruby/src/trunk/spec/default.mspec --error-output stderr --debug -fy -o /tmp/rubytest.41ai2b/9-mspec-multi-8 E, [2024-05-09T02:15:39.496145 #2352526] ERROR -- : $ /tmp/ruby/build/trunk/miniruby -I/tmp/ruby/src/trunk/lib /tmp/ruby/src/trunk/tool/runruby.rb --archdir=/tmp/ruby/build/trunk --extout=.ext -- /tmp/ruby/src/trunk/spec/mspec/bin/mspec-run -B /tmp/ruby/src/trunk/spec/default.mspec --error-output stderr --debug -fy -o /tmp/rubytest.41ai2b/10-mspec-multi-9 E, [2024-05-09T02:15:39.496285 #2352526] ERROR -- : $ /tmp/ruby/build/trunk/miniruby -I/tmp/ruby/src/trunk/lib /tmp/ruby/src/trunk/tool/runruby.rb --archdir=/tmp/ruby/build/trunk --extout=.ext -- /tmp/ruby/src/trunk/spec/mspec/bin/mspec-run -B /tmp/ruby/src/trunk/spec/default.mspec --error-output stderr --debug -fy -o /tmp/rubytest.41ai2b/11-mspec-multi-10 E, [2024-05-09T02:15:39.496484 #2352526] ERROR -- : $ /tmp/ruby/build/trunk/miniruby -I/tmp/ruby/src/trunk/lib /tmp/ruby/src/trunk/tool/runruby.rb --archdir=/tmp/ruby/build/trunk --extout=.ext -- /tmp/ruby/src/trunk/spec/mspec/bin/mspec-run -B /tmp/ruby/src/trunk/spec/default.mspec --error-output stderr --debug -fy -o /tmp/rubytest.41ai2b/12-mspec-multi-11 E, [2024-05-09T02:15:39.496720 #2352526] ERROR -- : $ /tmp/ruby/build/trunk/miniruby -I/tmp/ruby/src/trunk/lib /tmp/ruby/src/trunk/tool/runruby.rb --archdir=/tmp/ruby/build/trunk --extout=.ext -- /tmp/ruby/src/trunk/spec/mspec/bin/mspec-run -B /tmp/ruby/src/trunk/spec/default.mspec --error-output stderr --debug -fy -o /tmp/rubytest.41ai2b/13-mspec-multi-12 E, [2024-05-09T02:15:39.496910 #2352526] ERROR -- : $ /tmp/ruby/build/trunk/miniruby -I/tmp/ruby/src/trunk/lib /tmp/ruby/src/trunk/tool/runruby.rb --archdir=/tmp/ruby/build/trunk --extout=.ext -- /tmp/ruby/src/trunk/spec/mspec/bin/mspec-run -B /tmp/ruby/src/trunk/spec/default.mspec --error-output stderr --debug -fy -o /tmp/rubytest.41ai2b/14-mspec-multi-13 E, [2024-05-09T02:15:39.497098 #2352526] ERROR -- : $ /tmp/ruby/build/trunk/miniruby -I/tmp/ruby/src/trunk/lib /tmp/ruby/src/trunk/tool/runruby.rb --archdir=/tmp/ruby/build/trunk --extout=.ext -- /tmp/ruby/src/trunk/spec/mspec/bin/mspec-run -B /tmp/ruby/src/trunk/spec/default.mspec --error-output stderr --debug -fy -o /tmp/rubytest.41ai2b/15-mspec-multi-14 E, [2024-05-09T02:15:39.497259 #2352526] ERROR -- : $ /tmp/ruby/build/trunk/miniruby -I/tmp/ruby/src/trunk/lib /tmp/ruby/src/trunk/tool/runruby.rb --archdir=/tmp/ruby/build/trunk --extout=.ext -- /tmp/ruby/src/trunk/spec/mspec/bin/mspec-run -B /tmp/ruby/src/trunk/spec/default.mspec --error-output stderr --debug -fy -o /tmp/rubytest.41ai2b/16-mspec-multi-15 E, [2024-05-09T02:15:39.497376 #2352526] ERROR -- : $ /tmp/ruby/build/trunk/miniruby -I/tmp/ruby/src/trunk/lib /tmp/ruby/src/trunk/tool/runruby.rb --archdir=/tmp/ruby/build/trunk --extout=.ext -- /tmp/ruby/src/trunk/spec/mspec/bin/mspec-run -B /tmp/ruby/src/trunk/spec/default.mspec --error-output stderr --debug -fy -o /tmp/rubytest.41ai2b/17-mspec-multi-16 E, [2024-05-09T02:15:39.497569 #2352526] ERROR -- : $ /tmp/ruby/build/trunk/miniruby -I/tmp/ruby/src/trunk/lib /tmp/ruby/src/trunk/tool/runruby.rb --archdir=/tmp/ruby/build/trunk --extout=.ext -- /tmp/ruby/src/trunk/spec/mspec/bin/mspec-run -B /tmp/ruby/src/trunk/spec/default.mspec --error-output stderr --debug -fy -o /tmp/rubytest.41ai2b/18-mspec-multi-17 E, [2024-05-09T02:15:39.499920 #2352526] ERROR -- : $ /tmp/ruby/build/trunk/miniruby -I/tmp/ruby/src/trunk/lib /tmp/ruby/src/trunk/tool/runruby.rb --archdir=/tmp/ruby/build/trunk --extout=.ext -- /tmp/ruby/src/trunk/spec/mspec/bin/mspec-run -B /tmp/ruby/src/trunk/spec/default.mspec --error-output stderr --debug -fy -o /tmp/rubytest.41ai2b/19-mspec-multi-18 E, [2024-05-09T02:15:39.500351 #2352526] ERROR -- : $ /tmp/ruby/build/trunk/miniruby -I/tmp/ruby/src/trunk/lib /tmp/ruby/src/trunk/tool/runruby.rb --archdir=/tmp/ruby/build/trunk --extout=.ext -- /tmp/ruby/src/trunk/spec/mspec/bin/mspec-run -B /tmp/ruby/src/trunk/spec/default.mspec --error-output stderr --debug -fy -o /tmp/rubytest.41ai2b/20-mspec-multi-19 I, [2024-05-09T02:15:39.691825 #2352526] INFO -- : ruby 3.4.0dev (2024-05-09T01:11:19Z master d6564615e7) [x86_64-linux] I, [2024-05-09T02:15:40.339473 #2352526] INFO -- : 0 ......................................................................... I, [2024-05-09T02:15:40.748055 #2352526] INFO -- : 73 ......................................................................... I, [2024-05-09T02:15:40.898895 #2352526] INFO -- : 146 ......................................................................... I, [2024-05-09T02:15:40.950579 #2352526] INFO -- : 219 ......................................................................... I, [2024-05-09T02:15:41.012528 #2352526] INFO -- : 292 ......................................................................... I, [2024-05-09T02:15:41.052908 #2352526] INFO -- : 365 ......................................................................... I, [2024-05-09T02:15:41.070738 #2352526] INFO -- : 438 ......................................................................... I, [2024-05-09T02:15:41.087988 #2352526] INFO -- : 511 ......................................................................... I, [2024-05-09T02:15:41.103795 #2352526] INFO -- : 584 ......................................................................... I, [2024-05-09T02:15:41.163717 #2352526] INFO -- : 657 ......................................................................... I, [2024-05-09T02:15:41.192779 #2352526] INFO -- : 730 ......................................................................... I, [2024-05-09T02:15:41.213882 #2352526] INFO -- : 803 ......................................................................... I, [2024-05-09T02:15:41.246140 #2352526] INFO -- : 876 ......................................................................... I, [2024-05-09T02:15:41.296786 #2352526] INFO -- : 949 ......................................................................... I, [2024-05-09T02:15:41.403886 #2352526] INFO -- : 1022 ......................................................................... I, [2024-05-09T02:15:41.568265 #2352526] INFO -- : 1095 ......................................................................... I, [2024-05-09T02:15:41.701758 #2352526] INFO -- : 1168 ......................................................................... I, [2024-05-09T02:15:41.762391 #2352526] INFO -- : 1241 ......................................................................... I, [2024-05-09T02:15:41.805207 #2352526] INFO -- : 1314 ......................................................................... I, [2024-05-09T02:15:41.818194 #2352526] INFO -- : 1387 ......................................................................... I, [2024-05-09T02:15:41.939516 #2352526] INFO -- : 1460 ......................................................................... I, [2024-05-09T02:15:42.392856 #2352526] INFO -- : 1533 ......................................................................... I, [2024-05-09T02:15:42.456884 #2352526] INFO -- : 1606 ......................................................................... I, [2024-05-09T02:15:42.597164 #2352526] INFO -- : 1679 ......................................................................... I, [2024-05-09T02:15:42.683195 #2352526] INFO -- : 1752 ......................................................................... I, [2024-05-09T02:15:42.754508 #2352526] INFO -- : 1825 ......................................................................... I, [2024-05-09T02:15:42.915913 #2352526] INFO -- : 1898 ......................................................................... I, [2024-05-09T02:15:42.970700 #2352526] INFO -- : 1971 ......................................................................... I, [2024-05-09T02:15:43.028512 #2352526] INFO -- : 2044 ......................................................................... I, [2024-05-09T02:15:43.077905 #2352526] INFO -- : 2117 ......................................................................... I, [2024-05-09T02:15:43.098962 #2352526] INFO -- : 2190 ......................................................................... I, [2024-05-09T02:15:43.117290 #2352526] INFO -- : 2263 ......................................................................... I, [2024-05-09T02:15:43.131111 #2352526] INFO -- : 2336 ......................................................................... I, [2024-05-09T02:15:43.175248 #2352526] INFO -- : 2409 ......................................................................... I, [2024-05-09T02:15:43.278569 #2352526] INFO -- : 2482 ......................................................................... I, [2024-05-09T02:15:43.300062 #2352526] INFO -- : 2555 ......................................................................... I, [2024-05-09T02:15:43.409869 #2352526] INFO -- : 2628 ......................................................................... I, [2024-05-09T02:15:43.511012 #2352526] INFO -- : 2701 ......................................................................... I, [2024-05-09T02:15:43.536633 #2352526] INFO -- : 2774 ......................................................................... I, [2024-05-09T02:15:43.608576 #2352526] INFO -- : 2847 ......................................................................... I, [2024-05-09T02:15:43.647772 #2352526] INFO -- : 2920 ......................................................................... I, [2024-05-09T02:15:43.674020 #2352526] INFO -- : 2993 ......................................................................... I, [2024-05-09T02:15:43.698078 #2352526] INFO -- : 3066 ......................................................................... I, [2024-05-09T02:15:43.712101 #2352526] INFO -- : 3139 ......................................................................... I, [2024-05-09T02:15:43.720756 #2352526] INFO -- : 3212 ......................................................................... I, [2024-05-09T02:15:43.751779 #2352526] INFO -- : 3285 ......................................................................... I, [2024-05-09T02:15:47.716505 #2352526] INFO -- : 3358 ........................................................................ I, [2024-05-09T02:15:47.716588 #2352526] INFO -- : I, [2024-05-09T02:15:47.716602 #2352526] INFO -- : Finished in 8.219551 seconds I, [2024-05-09T02:15:47.716628 #2352526] INFO -- : I, [2024-05-09T02:15:47.716640 #2352526] INFO -- : 3429 files, 32610 examples, 167061 expectations, 0 failures, 0 errors, 0 tagged I, [2024-05-09T02:15:47.719840 #2352526] INFO -- : $$$[end] "make yes-test-rubyspec MSPECOPT='--error-output stderr --debug -j' TESTS='-j20'" exit with 0.