# Logfile created on 2024-05-08 21:56:46 +0000 by logger.rb/v1.4.3 I, [2024-05-08T21:56:46.981495 #334153] INFO -- : #, @formatter=nil, @logdev=#, @binmode=false, @mon_data=#, @mon_data_owner_object_id=860>>> I, [2024-05-08T21:56:46.981623 #334153] INFO -- : $$$[beg] make update-unicode -j20 I, [2024-05-08T21:56:47.040350 #334153] INFO -- : Downloading Unicode emoji 15.0 files... I, [2024-05-08T21:56:47.040731 #334153] INFO -- : Downloading Unicode emoji 15.0 files... I, [2024-05-08T21:56:47.041143 #334153] INFO -- : Downloading Unicode emoji 15.0 files... I, [2024-05-08T21:56:47.082111 #334153] INFO -- : made symlink emoji/15.0/emoji-sequences.txt to /tmp/ruby/src/trunk/.downloaded-cache/emoji/15.0/emoji-sequences.txt I, [2024-05-08T21:56:47.082156 #334153] INFO -- : downloading emoji/15.0/emoji-sequences.txt ... downloading emoji/15.0/emoji-test.txt ... /tmp/ruby/src/trunk/enc/unicode/data/emoji/15.0/emoji-sequences.txt already exists E, [2024-05-08T21:56:47.545959 #334153] ERROR -- : /tmp/ruby/src/trunk/tool/downloader.rb:302:in `rescue in download': failed to download emoji/15.0/emoji-test.txt (RuntimeError) E, [2024-05-08T21:56:47.545993 #334153] ERROR -- : OpenURI::HTTPError: 403 Forbidden: https://www.unicode.org/Public/emoji/15.0/emoji-test.txt E, [2024-05-08T21:56:47.545999 #334153] ERROR -- : from /tmp/ruby/src/trunk/tool/downloader.rb:201:in `download' E, [2024-05-08T21:56:47.546003 #334153] ERROR -- : from /tmp/ruby/src/trunk/tool/downloader.rb:136:in `download' E, [2024-05-08T21:56:47.546007 #334153] ERROR -- : from /tmp/ruby/src/trunk/tool/downloader.rb:482:in `block in
' E, [2024-05-08T21:56:47.546010 #334153] ERROR -- : from /tmp/ruby/src/trunk/tool/downloader.rb:465:in `each' E, [2024-05-08T21:56:47.546013 #334153] ERROR -- : from /tmp/ruby/src/trunk/tool/downloader.rb:465:in `
' E, [2024-05-08T21:56:47.546017 #334153] ERROR -- : /usr/lib/ruby/3.0.0/open-uri.rb:364:in `open_http': 403 Forbidden (OpenURI::HTTPError) E, [2024-05-08T21:56:47.546020 #334153] ERROR -- : from /usr/lib/ruby/3.0.0/open-uri.rb:741:in `buffer_open' E, [2024-05-08T21:56:47.546025 #334153] ERROR -- : from /usr/lib/ruby/3.0.0/open-uri.rb:212:in `block in open_loop' E, [2024-05-08T21:56:47.546028 #334153] ERROR -- : from /usr/lib/ruby/3.0.0/open-uri.rb:210:in `catch' E, [2024-05-08T21:56:47.546032 #334153] ERROR -- : from /usr/lib/ruby/3.0.0/open-uri.rb:210:in `open_loop' E, [2024-05-08T21:56:47.546035 #334153] ERROR -- : from /usr/lib/ruby/3.0.0/open-uri.rb:151:in `open_uri' E, [2024-05-08T21:56:47.546038 #334153] ERROR -- : from /usr/lib/ruby/3.0.0/open-uri.rb:721:in `open' E, [2024-05-08T21:56:47.546042 #334153] ERROR -- : from /usr/lib/ruby/3.0.0/open-uri.rb:729:in `read' E, [2024-05-08T21:56:47.546045 #334153] ERROR -- : from /tmp/ruby/src/trunk/tool/downloader.rb:247:in `block in download' E, [2024-05-08T21:56:47.546057 #334153] ERROR -- : from /tmp/ruby/src/trunk/tool/downloader.rb:378:in `with_retry' E, [2024-05-08T21:56:47.546060 #334153] ERROR -- : from /tmp/ruby/src/trunk/tool/downloader.rb:246:in `download' E, [2024-05-08T21:56:47.546065 #334153] ERROR -- : from /tmp/ruby/src/trunk/tool/downloader.rb:136:in `download' E, [2024-05-08T21:56:47.546068 #334153] ERROR -- : from /tmp/ruby/src/trunk/tool/downloader.rb:482:in `block in
' E, [2024-05-08T21:56:47.546076 #334153] ERROR -- : from /tmp/ruby/src/trunk/tool/downloader.rb:465:in `each' E, [2024-05-08T21:56:47.546080 #334153] ERROR -- : from /tmp/ruby/src/trunk/tool/downloader.rb:465:in `
' E, [2024-05-08T21:56:47.547861 #334153] ERROR -- : make: *** [uncommon.mk:1787: /tmp/ruby/src/trunk/enc/unicode/data/emoji/15.0/emoji-test.txt] Error 1 E, [2024-05-08T21:56:47.547882 #334153] ERROR -- : make: *** Waiting for unfinished jobs.... E, [2024-05-08T21:56:47.559821 #334153] ERROR -- : /tmp/ruby/src/trunk/tool/downloader.rb:302:in `rescue in download': failed to download emoji/15.0/emoji-test.txt (RuntimeError) E, [2024-05-08T21:56:47.559846 #334153] ERROR -- : OpenURI::HTTPError: 403 Forbidden: https://www.unicode.org/Public/emoji/15.0/emoji-test.txt E, [2024-05-08T21:56:47.559852 #334153] ERROR -- : from /tmp/ruby/src/trunk/tool/downloader.rb:201:in `download' E, [2024-05-08T21:56:47.559856 #334153] ERROR -- : from /tmp/ruby/src/trunk/tool/downloader.rb:136:in `download' E, [2024-05-08T21:56:47.559859 #334153] ERROR -- : from /tmp/ruby/src/trunk/tool/downloader.rb:482:in `block in
' E, [2024-05-08T21:56:47.559863 #334153] ERROR -- : from /tmp/ruby/src/trunk/tool/downloader.rb:465:in `each' E, [2024-05-08T21:56:47.559866 #334153] ERROR -- : from /tmp/ruby/src/trunk/tool/downloader.rb:465:in `
' E, [2024-05-08T21:56:47.559870 #334153] ERROR -- : /usr/lib/ruby/3.0.0/open-uri.rb:364:in `open_http': 403 Forbidden (OpenURI::HTTPError) E, [2024-05-08T21:56:47.559873 #334153] ERROR -- : from /usr/lib/ruby/3.0.0/open-uri.rb:741:in `buffer_open' E, [2024-05-08T21:56:47.559883 #334153] ERROR -- : from /usr/lib/ruby/3.0.0/open-uri.rb:212:in `block in open_loop' E, [2024-05-08T21:56:47.559887 #334153] ERROR -- : from /usr/lib/ruby/3.0.0/open-uri.rb:210:in `catch' E, [2024-05-08T21:56:47.559891 #334153] ERROR -- : from /usr/lib/ruby/3.0.0/open-uri.rb:210:in `open_loop' E, [2024-05-08T21:56:47.559894 #334153] ERROR -- : from /usr/lib/ruby/3.0.0/open-uri.rb:151:in `open_uri' E, [2024-05-08T21:56:47.559898 #334153] ERROR -- : from /usr/lib/ruby/3.0.0/open-uri.rb:721:in `open' E, [2024-05-08T21:56:47.559901 #334153] ERROR -- : from /usr/lib/ruby/3.0.0/open-uri.rb:729:in `read' E, [2024-05-08T21:56:47.559905 #334153] ERROR -- : from /tmp/ruby/src/trunk/tool/downloader.rb:247:in `block in download' E, [2024-05-08T21:56:47.559908 #334153] ERROR -- : from /tmp/ruby/src/trunk/tool/downloader.rb:378:in `with_retry' E, [2024-05-08T21:56:47.559913 #334153] ERROR -- : from /tmp/ruby/src/trunk/tool/downloader.rb:246:in `download' E, [2024-05-08T21:56:47.559917 #334153] ERROR -- : from /tmp/ruby/src/trunk/tool/downloader.rb:136:in `download' E, [2024-05-08T21:56:47.559920 #334153] ERROR -- : from /tmp/ruby/src/trunk/tool/downloader.rb:482:in `block in
' E, [2024-05-08T21:56:47.559924 #334153] ERROR -- : from /tmp/ruby/src/trunk/tool/downloader.rb:465:in `each' E, [2024-05-08T21:56:47.559927 #334153] ERROR -- : from /tmp/ruby/src/trunk/tool/downloader.rb:465:in `
' E, [2024-05-08T21:56:47.561675 #334153] ERROR -- : make: *** [uncommon.mk:1787: /tmp/ruby/src/trunk/enc/unicode/data/emoji/15.0/emoji-zwj-sequences.txt] Error 1 E, [2024-05-08T21:56:47.997378 #334153] ERROR -- : /tmp/ruby/src/trunk/tool/downloader.rb:302:in `rescue in download': failed to download emoji/15.0/emoji-sequences.txt (RuntimeError) E, [2024-05-08T21:56:47.997402 #334153] ERROR -- : EOFError: end of file reached: https://www.unicode.org/Public/emoji/15.0/emoji-sequences.txt E, [2024-05-08T21:56:47.997408 #334153] ERROR -- : from /tmp/ruby/src/trunk/tool/downloader.rb:201:in `download' E, [2024-05-08T21:56:47.997416 #334153] ERROR -- : from /tmp/ruby/src/trunk/tool/downloader.rb:136:in `download' E, [2024-05-08T21:56:47.997420 #334153] ERROR -- : from /tmp/ruby/src/trunk/tool/downloader.rb:482:in `block in
' E, [2024-05-08T21:56:47.997423 #334153] ERROR -- : from /tmp/ruby/src/trunk/tool/downloader.rb:465:in `each' E, [2024-05-08T21:56:47.997426 #334153] ERROR -- : from /tmp/ruby/src/trunk/tool/downloader.rb:465:in `
' E, [2024-05-08T21:56:47.997430 #334153] ERROR -- : /usr/lib/ruby/3.0.0/net/protocol.rb:227:in `rbuf_fill': end of file reached (EOFError) E, [2024-05-08T21:56:47.997433 #334153] ERROR -- : from /usr/lib/ruby/3.0.0/net/protocol.rb:193:in `readuntil' E, [2024-05-08T21:56:47.997438 #334153] ERROR -- : from /usr/lib/ruby/3.0.0/net/protocol.rb:203:in `readline' E, [2024-05-08T21:56:47.997441 #334153] ERROR -- : from /usr/lib/ruby/3.0.0/net/http/response.rb:42:in `read_status_line' E, [2024-05-08T21:56:47.997445 #334153] ERROR -- : from /usr/lib/ruby/3.0.0/net/http/response.rb:31:in `read_new' E, [2024-05-08T21:56:47.997448 #334153] ERROR -- : from /usr/lib/ruby/3.0.0/net/http.rb:1557:in `block in transport_request' E, [2024-05-08T21:56:47.997451 #334153] ERROR -- : from /usr/lib/ruby/3.0.0/net/http.rb:1548:in `catch' E, [2024-05-08T21:56:47.997455 #334153] ERROR -- : from /usr/lib/ruby/3.0.0/net/http.rb:1548:in `transport_request' E, [2024-05-08T21:56:47.997537 #334153] ERROR -- : from /usr/lib/ruby/3.0.0/net/http.rb:1521:in `request' E, [2024-05-08T21:56:47.997541 #334153] ERROR -- : from /usr/lib/ruby/3.0.0/open-uri.rb:329:in `block in open_http' E, [2024-05-08T21:56:47.997544 #334153] ERROR -- : from /usr/lib/ruby/3.0.0/net/http.rb:960:in `start' E, [2024-05-08T21:56:47.997547 #334153] ERROR -- : from /usr/lib/ruby/3.0.0/open-uri.rb:323:in `open_http' E, [2024-05-08T21:56:47.997551 #334153] ERROR -- : from /usr/lib/ruby/3.0.0/open-uri.rb:741:in `buffer_open' E, [2024-05-08T21:56:47.997554 #334153] ERROR -- : from /usr/lib/ruby/3.0.0/open-uri.rb:212:in `block in open_loop' E, [2024-05-08T21:56:47.997561 #334153] ERROR -- : from /usr/lib/ruby/3.0.0/open-uri.rb:210:in `catch' E, [2024-05-08T21:56:47.997564 #334153] ERROR -- : from /usr/lib/ruby/3.0.0/open-uri.rb:210:in `open_loop' E, [2024-05-08T21:56:47.997568 #334153] ERROR -- : from /usr/lib/ruby/3.0.0/open-uri.rb:151:in `open_uri' E, [2024-05-08T21:56:47.997571 #334153] ERROR -- : from /usr/lib/ruby/3.0.0/open-uri.rb:721:in `open' E, [2024-05-08T21:56:47.997574 #334153] ERROR -- : from /usr/lib/ruby/3.0.0/open-uri.rb:729:in `read' E, [2024-05-08T21:56:47.997578 #334153] ERROR -- : from /tmp/ruby/src/trunk/tool/downloader.rb:247:in `block in download' E, [2024-05-08T21:56:47.997581 #334153] ERROR -- : from /tmp/ruby/src/trunk/tool/downloader.rb:378:in `with_retry' E, [2024-05-08T21:56:47.997584 #334153] ERROR -- : from /tmp/ruby/src/trunk/tool/downloader.rb:246:in `download' E, [2024-05-08T21:56:47.997588 #334153] ERROR -- : from /tmp/ruby/src/trunk/tool/downloader.rb:136:in `download' E, [2024-05-08T21:56:47.997592 #334153] ERROR -- : from /tmp/ruby/src/trunk/tool/downloader.rb:482:in `block in
' E, [2024-05-08T21:56:47.997595 #334153] ERROR -- : from /tmp/ruby/src/trunk/tool/downloader.rb:465:in `each' E, [2024-05-08T21:56:47.997599 #334153] ERROR -- : from /tmp/ruby/src/trunk/tool/downloader.rb:465:in `
' E, [2024-05-08T21:56:47.999488 #334153] ERROR -- : make: *** [uncommon.mk:1787: /tmp/ruby/src/trunk/enc/unicode/data/emoji/15.0/emoji-sequences.txt] Error 1 E, [2024-05-08T21:56:47.999509 #334153] ERROR -- : make: *** Deleting file '/tmp/ruby/src/trunk/enc/unicode/data/emoji/15.0/emoji-sequences.txt' I, [2024-05-08T21:56:47.999520 #334153] INFO -- : downloading emoji/15.0/emoji-test.txt ... I, [2024-05-08T21:56:47.999810 #334153] INFO -- : $$$[end] "make update-unicode -j20" exit with 512. I, [2024-05-08T21:56:47.999837 #334153] INFO -- : $$$[beg] make update-download -j20 I, [2024-05-08T21:56:48.098910 #334153] INFO -- : tool/config.guess already exists I, [2024-05-08T21:56:48.098959 #334153] INFO -- : tool/config.sub already exists I, [2024-05-08T21:56:48.100949 #334153] INFO -- : Update minitest to ea9caafc0754b1d6236a490d59e624b53209734a I, [2024-05-08T21:56:48.101109 #334153] INFO -- : Update power_assert to 84e85124c5014a139af39161d484156cfe87a9ed I, [2024-05-08T21:56:48.101771 #334153] INFO -- : Update rbs to ba7872795d5de04adb8ff500c0e6afdc81a041dd I, [2024-05-08T21:56:48.102027 #334153] INFO -- : Update typeprof to b19a6416da3a05d57fadd6ffdadb382b6d236ca5 I, [2024-05-08T21:56:48.102273 #334153] INFO -- : echo ea9caafc0754b1d6236a490d59e624b53209734a | /bin/sh /tmp/ruby/src/trunk/tool/ifchange /tmp/ruby/src/trunk/.bundle/.timestamp/minitest.revision - I, [2024-05-08T21:56:48.102494 #334153] INFO -- : echo 84e85124c5014a139af39161d484156cfe87a9ed | /bin/sh /tmp/ruby/src/trunk/tool/ifchange /tmp/ruby/src/trunk/.bundle/.timestamp/power_assert.revision - I, [2024-05-08T21:56:48.102914 #334153] INFO -- : echo ba7872795d5de04adb8ff500c0e6afdc81a041dd | /bin/sh /tmp/ruby/src/trunk/tool/ifchange /tmp/ruby/src/trunk/.bundle/.timestamp/rbs.revision - I, [2024-05-08T21:56:48.103317 #334153] INFO -- : echo b19a6416da3a05d57fadd6ffdadb382b6d236ca5 | /bin/sh /tmp/ruby/src/trunk/tool/ifchange /tmp/ruby/src/trunk/.bundle/.timestamp/typeprof.revision - I, [2024-05-08T21:56:48.104201 #334153] INFO -- : /tmp/ruby/src/trunk/.bundle/.timestamp/minitest.revision unchanged I, [2024-05-08T21:56:48.104354 #334153] INFO -- : /tmp/ruby/src/trunk/.bundle/.timestamp/power_assert.revision unchanged I, [2024-05-08T21:56:48.104736 #334153] INFO -- : /tmp/ruby/src/trunk/.bundle/.timestamp/rbs.revision unchanged I, [2024-05-08T21:56:48.105129 #334153] INFO -- : /tmp/ruby/src/trunk/.bundle/.timestamp/typeprof.revision unchanged I, [2024-05-08T21:56:48.105426 #334153] INFO -- : Building power_assert@84e85124c5014a139af39161d484156cfe87a9ed to /tmp/ruby/src/trunk/gems/power_assert-2.0.3.gem I, [2024-05-08T21:56:48.174679 #334153] INFO -- : Successfully built RubyGem I, [2024-05-08T21:56:48.174742 #334153] INFO -- : Name: power_assert I, [2024-05-08T21:56:48.174766 #334153] INFO -- : Version: 2.0.4dev I, [2024-05-08T21:56:48.174782 #334153] INFO -- : File: power_assert-2.0.4dev.gem I, [2024-05-08T21:56:48.221970 #334153] INFO -- : $$$[end] "make update-download -j20" exit with 0. I, [2024-05-08T21:56:48.222013 #334153] INFO -- : $$$[beg] make update-rubyspec -j20 I, [2024-05-08T21:56:48.279076 #334153] INFO -- : make: Nothing to be done for 'update-rubyspec'. I, [2024-05-08T21:56:48.279295 #334153] INFO -- : $$$[end] "make update-rubyspec -j20" exit with 0. I, [2024-05-08T21:56:48.279319 #334153] INFO -- : $$$[beg] make update-src -j20 I, [2024-05-08T21:56:48.796226 #334153] INFO -- : Already up to date. I, [2024-05-08T21:56:48.805373 #334153] INFO -- : Latest commit hash = 442e398e62 I, [2024-05-08T21:56:48.806451 #334153] INFO -- : $$$[end] "make update-src -j20" exit with 0. I, [2024-05-08T21:56:48.806477 #334153] INFO -- : $$$[beg] make after-update -j20 I, [2024-05-08T21:56:48.874630 #334153] INFO -- : generating /tmp/ruby/src/trunk/ext/ripper/eventids2table.c I, [2024-05-08T21:56:48.879001 #334153] INFO -- : make[1]: Entering directory '/tmp/ruby/src/trunk/ext/ripper' I, [2024-05-08T21:56:48.879022 #334153] INFO -- : make[1]: Nothing to be done for 'src'. I, [2024-05-08T21:56:48.879027 #334153] INFO -- : make[1]: Leaving directory '/tmp/ruby/src/trunk/ext/ripper' I, [2024-05-08T21:56:48.895459 #334153] INFO -- : /tmp/ruby/src/trunk/revision.h updated I, [2024-05-08T21:56:48.896869 #334153] INFO -- : generating x86_64-linux-fake.rb I, [2024-05-08T21:56:48.947630 #334153] INFO -- : x86_64-linux-fake.rb updated I, [2024-05-08T21:56:48.948950 #334153] INFO -- : generating enc.mk I, [2024-05-08T21:56:49.065784 #334153] INFO -- : making srcs under enc I, [2024-05-08T21:56:49.095546 #334153] INFO -- : make[1]: Entering directory '/tmp/ruby/build/trunk' I, [2024-05-08T21:56:49.095568 #334153] INFO -- : make[1]: Nothing to be done for 'srcs'. I, [2024-05-08T21:56:49.095581 #334153] INFO -- : make[1]: Leaving directory '/tmp/ruby/build/trunk' I, [2024-05-08T21:56:49.140066 #334153] INFO -- : Update minitest to ea9caafc0754b1d6236a490d59e624b53209734a I, [2024-05-08T21:56:49.140114 #334153] INFO -- : Update power_assert to 84e85124c5014a139af39161d484156cfe87a9ed I, [2024-05-08T21:56:49.140373 #334153] INFO -- : Update rbs to ba7872795d5de04adb8ff500c0e6afdc81a041dd I, [2024-05-08T21:56:49.141118 #334153] INFO -- : Update typeprof to b19a6416da3a05d57fadd6ffdadb382b6d236ca5 I, [2024-05-08T21:56:49.141456 #334153] INFO -- : echo ea9caafc0754b1d6236a490d59e624b53209734a | /bin/sh /tmp/ruby/src/trunk/tool/ifchange /tmp/ruby/src/trunk/.bundle/.timestamp/minitest.revision - I, [2024-05-08T21:56:49.141626 #334153] INFO -- : echo 84e85124c5014a139af39161d484156cfe87a9ed | /bin/sh /tmp/ruby/src/trunk/tool/ifchange /tmp/ruby/src/trunk/.bundle/.timestamp/power_assert.revision - I, [2024-05-08T21:56:49.141902 #334153] INFO -- : echo ba7872795d5de04adb8ff500c0e6afdc81a041dd | /bin/sh /tmp/ruby/src/trunk/tool/ifchange /tmp/ruby/src/trunk/.bundle/.timestamp/rbs.revision - I, [2024-05-08T21:56:49.143072 #334153] INFO -- : echo b19a6416da3a05d57fadd6ffdadb382b6d236ca5 | /bin/sh /tmp/ruby/src/trunk/tool/ifchange /tmp/ruby/src/trunk/.bundle/.timestamp/typeprof.revision - I, [2024-05-08T21:56:49.143404 #334153] INFO -- : /tmp/ruby/src/trunk/.bundle/.timestamp/minitest.revision unchanged I, [2024-05-08T21:56:49.143451 #334153] INFO -- : /tmp/ruby/src/trunk/.bundle/.timestamp/power_assert.revision unchanged I, [2024-05-08T21:56:49.143547 #334153] INFO -- : /tmp/ruby/src/trunk/.bundle/.timestamp/rbs.revision unchanged I, [2024-05-08T21:56:49.144355 #334153] INFO -- : Building power_assert@84e85124c5014a139af39161d484156cfe87a9ed to /tmp/ruby/src/trunk/gems/power_assert-2.0.3.gem I, [2024-05-08T21:56:49.144737 #334153] INFO -- : /tmp/ruby/src/trunk/.bundle/.timestamp/typeprof.revision unchanged I, [2024-05-08T21:56:49.213264 #334153] INFO -- : Successfully built RubyGem I, [2024-05-08T21:56:49.213324 #334153] INFO -- : Name: power_assert I, [2024-05-08T21:56:49.213338 #334153] INFO -- : Version: 2.0.4dev I, [2024-05-08T21:56:49.213356 #334153] INFO -- : File: power_assert-2.0.4dev.gem I, [2024-05-08T21:56:49.215564 #334153] INFO -- : Extracting bundle gem power_assert-2.0.3... I, [2024-05-08T21:56:49.276425 #334153] INFO -- : Try with hash version of bundled gems instead of gems/power_assert-2.0.3.gem. We don't use this gem with release version of Ruby. I, [2024-05-08T21:56:49.281469 #334153] INFO -- : Unpacked gems/power_assert-2.0.4dev.gem I, [2024-05-08T21:56:49.283714 #334153] INFO -- : $$$[end] "make after-update -j20" exit with 0. I, [2024-05-08T21:56:49.283861 #334153] INFO -- : $$$[beg] make miniruby -j20 I, [2024-05-08T21:56:49.340509 #334153] INFO -- : BASERUBY = /usr/bin/ruby --disable=gems I, [2024-05-08T21:56:49.340551 #334153] INFO -- : CC = gcc I, [2024-05-08T21:56:49.340564 #334153] INFO -- : LD = ld I, [2024-05-08T21:56:49.340575 #334153] INFO -- : LDSHARED = gcc -shared I, [2024-05-08T21:56:49.340586 #334153] INFO -- : CFLAGS = -O3 -fno-fast-math -ggdb3 -Wall -Wextra -Wdeprecated-declarations -Wdiv-by-zero -Wduplicated-cond -Wimplicit-function-declaration -Wimplicit-int -Wpointer-arith -Wwrite-strings -Wold-style-definition -Wimplicit-fallthrough=0 -Wmissing-noreturn -Wno-cast-function-type -Wno-constant-logical-operand -Wno-long-long -Wno-missing-field-initializers -Wno-overlength-strings -Wno-packed-bitfield-compat -Wno-parentheses-equality -Wno-self-assign -Wno-tautological-compare -Wno-unused-parameter -Wno-unused-value -Wsuggest-attribute=format -Wsuggest-attribute=noreturn -Wunused-variable -Wmisleading-indentation -Wundef -fPIC I, [2024-05-08T21:56:49.340597 #334153] INFO -- : XCFLAGS = -U_FORTIFY_SOURCE -D_FORTIFY_SOURCE=2 -fstack-protector-strong -fno-strict-overflow -fvisibility=hidden -fexcess-precision=standard -DRUBY_EXPORT -I. -I.ext/include/x86_64-linux -I/tmp/ruby/src/trunk/include -I/tmp/ruby/src/trunk -I/tmp/ruby/src/trunk/prism -I/tmp/ruby/src/trunk/enc/unicode/15.0.0 I, [2024-05-08T21:56:49.340617 #334153] INFO -- : CPPFLAGS = I, [2024-05-08T21:56:49.340628 #334153] INFO -- : DLDFLAGS = -Wl,--compress-debug-sections=zlib -Wl,-soname,libruby.so.3.4 -fstack-protector-strong I, [2024-05-08T21:56:49.340638 #334153] INFO -- : SOLIBS = -lz -lrt -lrt -lgmp -ldl -lcrypt -lm -lpthread I, [2024-05-08T21:56:49.340648 #334153] INFO -- : LANG = en_US.UTF-8 I, [2024-05-08T21:56:49.340658 #334153] INFO -- : LC_ALL = I, [2024-05-08T21:56:49.340668 #334153] INFO -- : LC_CTYPE = I, [2024-05-08T21:56:49.340678 #334153] INFO -- : MFLAGS = -j20 --jobserver-auth=4,5 I, [2024-05-08T21:56:49.340688 #334153] INFO -- : RUSTC = no I, [2024-05-08T21:56:49.340698 #334153] INFO -- : YJIT_RUSTC_ARGS = --crate-name=yjit --crate-type=staticlib --edition=2021 -g -C lto=thin -C opt-level=3 -C overflow-checks=on '--out-dir=/tmp/ruby/build/trunk/yjit/target/release/' /tmp/ruby/src/trunk/yjit/src/lib.rs I, [2024-05-08T21:56:49.342000 #334153] INFO -- : gcc (Ubuntu 11.4.0-1ubuntu1~22.04) 11.4.0 I, [2024-05-08T21:56:49.342040 #334153] INFO -- : Copyright (C) 2021 Free Software Foundation, Inc. I, [2024-05-08T21:56:49.342053 #334153] INFO -- : This is free software; see the source for copying conditions. There is NO I, [2024-05-08T21:56:49.342064 #334153] INFO -- : warranty; not even for MERCHANTABILITY or FITNESS FOR A PARTICULAR PURPOSE. I, [2024-05-08T21:56:49.342074 #334153] INFO -- : I, [2024-05-08T21:56:49.361932 #334153] INFO -- : compiling /tmp/ruby/src/trunk/version.c I, [2024-05-08T21:56:49.465753 #334153] INFO -- : linking miniruby I, [2024-05-08T21:56:49.980324 #334153] INFO -- : $$$[end] "make miniruby -j20" exit with 0. I, [2024-05-08T21:56:49.980456 #334153] INFO -- : $$$[beg] make ruby -j20 I, [2024-05-08T21:56:50.038072 #334153] INFO -- : BASERUBY = /usr/bin/ruby --disable=gems I, [2024-05-08T21:56:50.038112 #334153] INFO -- : CC = gcc I, [2024-05-08T21:56:50.038126 #334153] INFO -- : LD = ld I, [2024-05-08T21:56:50.038137 #334153] INFO -- : LDSHARED = gcc -shared I, [2024-05-08T21:56:50.038153 #334153] INFO -- : CFLAGS = -O3 -fno-fast-math -ggdb3 -Wall -Wextra -Wdeprecated-declarations -Wdiv-by-zero -Wduplicated-cond -Wimplicit-function-declaration -Wimplicit-int -Wpointer-arith -Wwrite-strings -Wold-style-definition -Wimplicit-fallthrough=0 -Wmissing-noreturn -Wno-cast-function-type -Wno-constant-logical-operand -Wno-long-long -Wno-missing-field-initializers -Wno-overlength-strings -Wno-packed-bitfield-compat -Wno-parentheses-equality -Wno-self-assign -Wno-tautological-compare -Wno-unused-parameter -Wno-unused-value -Wsuggest-attribute=format -Wsuggest-attribute=noreturn -Wunused-variable -Wmisleading-indentation -Wundef -fPIC I, [2024-05-08T21:56:50.038165 #334153] INFO -- : XCFLAGS = -U_FORTIFY_SOURCE -D_FORTIFY_SOURCE=2 -fstack-protector-strong -fno-strict-overflow -fvisibility=hidden -fexcess-precision=standard -DRUBY_EXPORT -I. -I.ext/include/x86_64-linux -I/tmp/ruby/src/trunk/include -I/tmp/ruby/src/trunk -I/tmp/ruby/src/trunk/prism -I/tmp/ruby/src/trunk/enc/unicode/15.0.0 I, [2024-05-08T21:56:50.038175 #334153] INFO -- : CPPFLAGS = I, [2024-05-08T21:56:50.038186 #334153] INFO -- : DLDFLAGS = -Wl,--compress-debug-sections=zlib -Wl,-soname,libruby.so.3.4 -fstack-protector-strong I, [2024-05-08T21:56:50.038196 #334153] INFO -- : SOLIBS = -lz -lrt -lrt -lgmp -ldl -lcrypt -lm -lpthread I, [2024-05-08T21:56:50.038206 #334153] INFO -- : LANG = en_US.UTF-8 I, [2024-05-08T21:56:50.038216 #334153] INFO -- : LC_ALL = I, [2024-05-08T21:56:50.038225 #334153] INFO -- : LC_CTYPE = I, [2024-05-08T21:56:50.038235 #334153] INFO -- : MFLAGS = -j20 --jobserver-auth=4,5 I, [2024-05-08T21:56:50.038245 #334153] INFO -- : RUSTC = no I, [2024-05-08T21:56:50.038256 #334153] INFO -- : YJIT_RUSTC_ARGS = --crate-name=yjit --crate-type=staticlib --edition=2021 -g -C lto=thin -C opt-level=3 -C overflow-checks=on '--out-dir=/tmp/ruby/build/trunk/yjit/target/release/' /tmp/ruby/src/trunk/yjit/src/lib.rs I, [2024-05-08T21:56:50.039514 #334153] INFO -- : gcc (Ubuntu 11.4.0-1ubuntu1~22.04) 11.4.0 I, [2024-05-08T21:56:50.039560 #334153] INFO -- : Copyright (C) 2021 Free Software Foundation, Inc. I, [2024-05-08T21:56:50.039573 #334153] INFO -- : This is free software; see the source for copying conditions. There is NO I, [2024-05-08T21:56:50.039585 #334153] INFO -- : warranty; not even for MERCHANTABILITY or FITNESS FOR A PARTICULAR PURPOSE. I, [2024-05-08T21:56:50.039595 #334153] INFO -- : I, [2024-05-08T21:56:50.147158 #334153] INFO -- : builtin_binary.inc updated I, [2024-05-08T21:56:50.151527 #334153] INFO -- : c5234a9416e4f20f175185e840b25b0f08674d14078ed7083f37e655458e3ca9 builtin_binary.inc I, [2024-05-08T21:56:50.152328 #334153] INFO -- : compiling /tmp/ruby/src/trunk/builtin.c I, [2024-05-08T21:56:50.336475 #334153] INFO -- : linking static-library libruby-static.a I, [2024-05-08T21:56:50.652101 #334153] INFO -- : linking shared-library libruby.so.3.4.0 I, [2024-05-08T21:56:52.239906 #334153] INFO -- : linking ruby I, [2024-05-08T21:56:52.262831 #334153] INFO -- : $$$[end] "make ruby -j20" exit with 0. I, [2024-05-08T21:56:52.262969 #334153] INFO -- : $$$[beg] make all -j20 I, [2024-05-08T21:56:52.320363 #334153] INFO -- : BASERUBY = /usr/bin/ruby --disable=gems I, [2024-05-08T21:56:52.320405 #334153] INFO -- : CC = gcc I, [2024-05-08T21:56:52.320418 #334153] INFO -- : LD = ld I, [2024-05-08T21:56:52.320430 #334153] INFO -- : LDSHARED = gcc -shared I, [2024-05-08T21:56:52.320441 #334153] INFO -- : CFLAGS = -O3 -fno-fast-math -ggdb3 -Wall -Wextra -Wdeprecated-declarations -Wdiv-by-zero -Wduplicated-cond -Wimplicit-function-declaration -Wimplicit-int -Wpointer-arith -Wwrite-strings -Wold-style-definition -Wimplicit-fallthrough=0 -Wmissing-noreturn -Wno-cast-function-type -Wno-constant-logical-operand -Wno-long-long -Wno-missing-field-initializers -Wno-overlength-strings -Wno-packed-bitfield-compat -Wno-parentheses-equality -Wno-self-assign -Wno-tautological-compare -Wno-unused-parameter -Wno-unused-value -Wsuggest-attribute=format -Wsuggest-attribute=noreturn -Wunused-variable -Wmisleading-indentation -Wundef -fPIC I, [2024-05-08T21:56:52.320455 #334153] INFO -- : XCFLAGS = -U_FORTIFY_SOURCE -D_FORTIFY_SOURCE=2 -fstack-protector-strong -fno-strict-overflow -fvisibility=hidden -fexcess-precision=standard -DRUBY_EXPORT -I. -I.ext/include/x86_64-linux -I/tmp/ruby/src/trunk/include -I/tmp/ruby/src/trunk -I/tmp/ruby/src/trunk/prism -I/tmp/ruby/src/trunk/enc/unicode/15.0.0 I, [2024-05-08T21:56:52.320466 #334153] INFO -- : CPPFLAGS = I, [2024-05-08T21:56:52.320477 #334153] INFO -- : DLDFLAGS = -Wl,--compress-debug-sections=zlib -Wl,-soname,libruby.so.3.4 -fstack-protector-strong I, [2024-05-08T21:56:52.320488 #334153] INFO -- : SOLIBS = -lz -lrt -lrt -lgmp -ldl -lcrypt -lm -lpthread I, [2024-05-08T21:56:52.320499 #334153] INFO -- : LANG = en_US.UTF-8 I, [2024-05-08T21:56:52.320509 #334153] INFO -- : LC_ALL = I, [2024-05-08T21:56:52.320520 #334153] INFO -- : LC_CTYPE = I, [2024-05-08T21:56:52.320530 #334153] INFO -- : MFLAGS = -j20 --jobserver-auth=4,5 I, [2024-05-08T21:56:52.320541 #334153] INFO -- : RUSTC = no I, [2024-05-08T21:56:52.320553 #334153] INFO -- : YJIT_RUSTC_ARGS = --crate-name=yjit --crate-type=staticlib --edition=2021 -g -C lto=thin -C opt-level=3 -C overflow-checks=on '--out-dir=/tmp/ruby/build/trunk/yjit/target/release/' /tmp/ruby/src/trunk/yjit/src/lib.rs I, [2024-05-08T21:56:52.321686 #334153] INFO -- : gcc (Ubuntu 11.4.0-1ubuntu1~22.04) 11.4.0 I, [2024-05-08T21:56:52.321726 #334153] INFO -- : Copyright (C) 2021 Free Software Foundation, Inc. I, [2024-05-08T21:56:52.321739 #334153] INFO -- : This is free software; see the source for copying conditions. There is NO I, [2024-05-08T21:56:52.321751 #334153] INFO -- : warranty; not even for MERCHANTABILITY or FITNESS FOR A PARTICULAR PURPOSE. I, [2024-05-08T21:56:52.321761 #334153] INFO -- : I, [2024-05-08T21:56:52.351582 #334153] INFO -- : generating enc.mk I, [2024-05-08T21:56:52.353555 #334153] INFO -- : building spec/ruby/optional/capi/ext/array_spec.so I, [2024-05-08T21:56:52.353866 #334153] INFO -- : building spec/ruby/optional/capi/ext/basic_object_spec.so I, [2024-05-08T21:56:52.354668 #334153] INFO -- : building spec/ruby/optional/capi/ext/bignum_spec.so I, [2024-05-08T21:56:52.355328 #334153] INFO -- : building spec/ruby/optional/capi/ext/binding_spec.so I, [2024-05-08T21:56:52.355674 #334153] INFO -- : building spec/ruby/optional/capi/ext/boolean_spec.so I, [2024-05-08T21:56:52.356230 #334153] INFO -- : building spec/ruby/optional/capi/ext/class_id_under_autoload_spec.so I, [2024-05-08T21:56:52.357103 #334153] INFO -- : building spec/ruby/optional/capi/ext/class_spec.so I, [2024-05-08T21:56:52.357435 #334153] INFO -- : building spec/ruby/optional/capi/ext/class_under_autoload_spec.so I, [2024-05-08T21:56:52.358266 #334153] INFO -- : building spec/ruby/optional/capi/ext/complex_spec.so I, [2024-05-08T21:56:52.359222 #334153] INFO -- : building spec/ruby/optional/capi/ext/constants_spec.so I, [2024-05-08T21:56:52.359531 #334153] INFO -- : building spec/ruby/optional/capi/ext/data_spec.so I, [2024-05-08T21:56:52.360215 #334153] INFO -- : building spec/ruby/optional/capi/ext/debug_spec.so I, [2024-05-08T21:56:52.360496 #334153] INFO -- : building spec/ruby/optional/capi/ext/encoding_spec.so I, [2024-05-08T21:56:52.361304 #334153] INFO -- : building spec/ruby/optional/capi/ext/enumerator_spec.so I, [2024-05-08T21:56:52.361564 #334153] INFO -- : building spec/ruby/optional/capi/ext/exception_spec.so I, [2024-05-08T21:56:52.362290 #334153] INFO -- : building spec/ruby/optional/capi/ext/fiber_spec.so I, [2024-05-08T21:56:52.362694 #334153] INFO -- : building spec/ruby/optional/capi/ext/file_spec.so I, [2024-05-08T21:56:52.376627 #334153] INFO -- : building spec/ruby/optional/capi/ext/fixnum_spec.so I, [2024-05-08T21:56:52.396520 #334153] INFO -- : building spec/ruby/optional/capi/ext/float_spec.so I, [2024-05-08T21:56:52.480749 #334153] INFO -- : building spec/ruby/optional/capi/ext/gc_spec.so I, [2024-05-08T21:56:52.493923 #334153] INFO -- : building spec/ruby/optional/capi/ext/globals_spec.so I, [2024-05-08T21:56:52.501779 #334153] INFO -- : building spec/ruby/optional/capi/ext/hash_spec.so I, [2024-05-08T21:56:52.502266 #334153] INFO -- : building spec/ruby/optional/capi/ext/integer_spec.so I, [2024-05-08T21:56:52.508747 #334153] INFO -- : building spec/ruby/optional/capi/ext/io_spec.so I, [2024-05-08T21:56:52.510946 #334153] INFO -- : building spec/ruby/optional/capi/ext/kernel_spec.so I, [2024-05-08T21:56:52.537345 #334153] INFO -- : building spec/ruby/optional/capi/ext/language_spec.so I, [2024-05-08T21:56:52.539592 #334153] INFO -- : building spec/ruby/optional/capi/ext/marshal_spec.so I, [2024-05-08T21:56:52.546795 #334153] INFO -- : building spec/ruby/optional/capi/ext/module_spec.so I, [2024-05-08T21:56:52.547921 #334153] INFO -- : building spec/ruby/optional/capi/ext/module_under_autoload_spec.so I, [2024-05-08T21:56:52.552739 #334153] INFO -- : building spec/ruby/optional/capi/ext/mutex_spec.so I, [2024-05-08T21:56:52.559430 #334153] INFO -- : building spec/ruby/optional/capi/ext/object_spec.so I, [2024-05-08T21:56:52.559740 #334153] INFO -- : building spec/ruby/optional/capi/ext/numeric_spec.so I, [2024-05-08T21:56:52.575518 #334153] INFO -- : building spec/ruby/optional/capi/ext/proc_spec.so I, [2024-05-08T21:56:52.612964 #334153] INFO -- : building spec/ruby/optional/capi/ext/range_spec.so I, [2024-05-08T21:56:52.616515 #334153] INFO -- : building spec/ruby/optional/capi/ext/rational_spec.so I, [2024-05-08T21:56:52.629373 #334153] INFO -- : building spec/ruby/optional/capi/ext/rbasic_spec.so I, [2024-05-08T21:56:52.633888 #334153] INFO -- : building spec/ruby/optional/capi/ext/regexp_spec.so I, [2024-05-08T21:56:52.635713 #334153] INFO -- : building spec/ruby/optional/capi/ext/string_spec.so I, [2024-05-08T21:56:52.648169 #334153] INFO -- : building spec/ruby/optional/capi/ext/struct_spec.so I, [2024-05-08T21:56:52.665623 #334153] INFO -- : building spec/ruby/optional/capi/ext/st_spec.so I, [2024-05-08T21:56:52.675545 #334153] INFO -- : building spec/ruby/optional/capi/ext/thread_spec.so I, [2024-05-08T21:56:52.675669 #334153] INFO -- : building spec/ruby/optional/capi/ext/symbol_spec.so I, [2024-05-08T21:56:52.686344 #334153] INFO -- : building spec/ruby/optional/capi/ext/time_spec.so I, [2024-05-08T21:56:52.686897 #334153] INFO -- : building spec/ruby/optional/capi/ext/tracepoint_spec.so I, [2024-05-08T21:56:52.690022 #334153] INFO -- : building spec/ruby/optional/capi/ext/typed_data_spec.so I, [2024-05-08T21:56:52.728089 #334153] INFO -- : building spec/ruby/optional/capi/ext/util_spec.so I, [2024-05-08T21:56:52.769675 #334153] INFO -- : making enc I, [2024-05-08T21:56:52.783369 #334153] INFO -- : making srcs under enc I, [2024-05-08T21:56:52.796727 #334153] INFO -- : make[1]: Entering directory '/tmp/ruby/build/trunk' I, [2024-05-08T21:56:52.796792 #334153] INFO -- : make[1]: Nothing to be done for 'enc'. I, [2024-05-08T21:56:52.796801 #334153] INFO -- : make[1]: Leaving directory '/tmp/ruby/build/trunk' I, [2024-05-08T21:56:52.832689 #334153] INFO -- : make[1]: Entering directory '/tmp/ruby/build/trunk' I, [2024-05-08T21:56:52.832743 #334153] INFO -- : make[1]: Nothing to be done for 'srcs'. I, [2024-05-08T21:56:52.832752 #334153] INFO -- : make[1]: Leaving directory '/tmp/ruby/build/trunk' I, [2024-05-08T21:56:52.833501 #334153] INFO -- : generating transdb.h I, [2024-05-08T21:56:52.930639 #334153] INFO -- : transdb.h unchanged I, [2024-05-08T21:56:52.932163 #334153] INFO -- : generating makefiles ext/configure-ext.mk I, [2024-05-08T21:56:52.932482 #334153] INFO -- : making trans I, [2024-05-08T21:56:52.958831 #334153] INFO -- : ext/configure-ext.mk updated I, [2024-05-08T21:56:52.961301 #334153] INFO -- : make[1]: Entering directory '/tmp/ruby/build/trunk' I, [2024-05-08T21:56:52.967648 #334153] INFO -- : make[1]: Entering directory '/tmp/ruby/build/trunk' I, [2024-05-08T21:56:52.967753 #334153] INFO -- : make[1]: Nothing to be done for 'trans'. I, [2024-05-08T21:56:52.969081 #334153] INFO -- : make[1]: Leaving directory '/tmp/ruby/build/trunk' I, [2024-05-08T21:56:52.969101 #334153] INFO -- : making encs I, [2024-05-08T21:56:53.026579 #334153] INFO -- : make[1]: Entering directory '/tmp/ruby/build/trunk' I, [2024-05-08T21:56:53.026653 #334153] INFO -- : make[1]: Nothing to be done for 'encs'. I, [2024-05-08T21:56:53.026681 #334153] INFO -- : make[1]: Leaving directory '/tmp/ruby/build/trunk' I, [2024-05-08T21:56:53.119158 #334153] INFO -- : make[1]: Leaving directory '/tmp/ruby/build/trunk' I, [2024-05-08T21:56:53.119879 #334153] INFO -- : generating makefile exts.mk I, [2024-05-08T21:56:53.158535 #334153] INFO -- : exts.mk unchanged I, [2024-05-08T21:56:53.163205 #334153] INFO -- : make[1]: Entering directory '/tmp/ruby/build/trunk' I, [2024-05-08T21:56:53.181494 #334153] INFO -- : make[2]: Entering directory '/tmp/ruby/build/trunk/ext/digest' I, [2024-05-08T21:56:53.183385 #334153] INFO -- : make[2]: Entering directory '/tmp/ruby/build/trunk/ext/coverage' I, [2024-05-08T21:56:53.183419 #334153] INFO -- : make[2]: Entering directory '/tmp/ruby/build/trunk/ext/json' I, [2024-05-08T21:56:53.183890 #334153] INFO -- : make[2]: Entering directory '/tmp/ruby/build/trunk/ext/date' I, [2024-05-08T21:56:53.184027 #334153] INFO -- : make[2]: Entering directory '/tmp/ruby/build/trunk/ext/io/console' I, [2024-05-08T21:56:53.185259 #334153] INFO -- : make[2]: Entering directory '/tmp/ruby/build/trunk/ext/monitor' I, [2024-05-08T21:56:53.185501 #334153] INFO -- : make[2]: Leaving directory '/tmp/ruby/build/trunk/ext/digest' I, [2024-05-08T21:56:53.185533 #334153] INFO -- : make[2]: Entering directory '/tmp/ruby/build/trunk/ext/rubyvm' I, [2024-05-08T21:56:53.185942 #334153] INFO -- : make[2]: Entering directory '/tmp/ruby/build/trunk/ext/fiddle' I, [2024-05-08T21:56:53.186028 #334153] INFO -- : make[2]: Entering directory '/tmp/ruby/build/trunk/ext/pathname' I, [2024-05-08T21:56:53.187311 #334153] INFO -- : make[2]: Leaving directory '/tmp/ruby/build/trunk/ext/coverage' I, [2024-05-08T21:56:53.187354 #334153] INFO -- : make[2]: Leaving directory '/tmp/ruby/build/trunk/ext/io/console' I, [2024-05-08T21:56:53.187439 #334153] INFO -- : make[2]: Leaving directory '/tmp/ruby/build/trunk/ext/rubyvm' I, [2024-05-08T21:56:53.187477 #334153] INFO -- : make[2]: Entering directory '/tmp/ruby/build/trunk/ext/objspace' I, [2024-05-08T21:56:53.187889 #334153] INFO -- : make[2]: Entering directory '/tmp/ruby/build/trunk/ext/pty' I, [2024-05-08T21:56:53.188087 #334153] INFO -- : make[2]: Leaving directory '/tmp/ruby/build/trunk/ext/monitor' I, [2024-05-08T21:56:53.188124 #334153] INFO -- : make[2]: Entering directory '/tmp/ruby/build/trunk/ext/psych' I, [2024-05-08T21:56:53.188140 #334153] INFO -- : make[2]: Leaving directory '/tmp/ruby/build/trunk/ext/date' I, [2024-05-08T21:56:53.189389 #334153] INFO -- : make[2]: Leaving directory '/tmp/ruby/build/trunk/ext/pathname' I, [2024-05-08T21:56:53.189969 #334153] INFO -- : make[2]: Entering directory '/tmp/ruby/build/trunk/.bundle/gems/bigdecimal-3.1.7/ext/bigdecimal' I, [2024-05-08T21:56:53.190100 #334153] INFO -- : make[2]: Entering directory '/tmp/ruby/build/trunk/.bundle/gems/bigdecimal-3.1.8/ext/bigdecimal' I, [2024-05-08T21:56:53.190445 #334153] INFO -- : make[2]: Entering directory '/tmp/ruby/build/trunk/.bundle/gems/debug-1.9.2/ext/debug' I, [2024-05-08T21:56:53.191282 #334153] INFO -- : make[2]: Leaving directory '/tmp/ruby/build/trunk/ext/pty' I, [2024-05-08T21:56:53.191515 #334153] INFO -- : make[2]: Entering directory '/tmp/ruby/build/trunk/ext/ripper' I, [2024-05-08T21:56:53.191600 #334153] INFO -- : make[2]: Leaving directory '/tmp/ruby/build/trunk/ext/objspace' I, [2024-05-08T21:56:53.192053 #334153] INFO -- : make[2]: Entering directory '/tmp/ruby/build/trunk/.bundle/gems/nkf-0.2.0/ext/nkf' I, [2024-05-08T21:56:53.192395 #334153] INFO -- : make[2]: Entering directory '/tmp/ruby/build/trunk/.bundle/gems/racc-1.7.3/ext/racc/cparse' I, [2024-05-08T21:56:53.192716 #334153] INFO -- : make[2]: Leaving directory '/tmp/ruby/build/trunk/ext/fiddle' I, [2024-05-08T21:56:53.192851 #334153] INFO -- : make[2]: Entering directory '/tmp/ruby/build/trunk/.bundle/gems/rbs-3.4.4/ext/rbs_extension' I, [2024-05-08T21:56:53.193014 #334153] INFO -- : make[2]: Leaving directory '/tmp/ruby/build/trunk/ext/json' I, [2024-05-08T21:56:53.193325 #334153] INFO -- : make[2]: Entering directory '/tmp/ruby/build/trunk/.bundle/gems/syslog-0.1.2/ext/syslog' I, [2024-05-08T21:56:53.194804 #334153] INFO -- : make[2]: Entering directory '/tmp/ruby/build/trunk/ext/socket' I, [2024-05-08T21:56:53.196053 #334153] INFO -- : make[2]: Entering directory '/tmp/ruby/build/trunk/ext/digest/sha2' I, [2024-05-08T21:56:53.198833 #334153] INFO -- : make[2]: Leaving directory '/tmp/ruby/build/trunk/ext/ripper' I, [2024-05-08T21:56:53.199077 #334153] INFO -- : make[2]: Entering directory '/tmp/ruby/build/trunk/ext/openssl' I, [2024-05-08T21:56:53.199390 #334153] INFO -- : make[2]: Leaving directory '/tmp/ruby/build/trunk/ext/digest/sha2' I, [2024-05-08T21:56:53.199644 #334153] INFO -- : make[2]: Leaving directory '/tmp/ruby/build/trunk/ext/psych' I, [2024-05-08T21:56:53.202801 #334153] INFO -- : make[2]: Leaving directory '/tmp/ruby/build/trunk/ext/socket' I, [2024-05-08T21:56:53.210277 #334153] INFO -- : make[2]: Leaving directory '/tmp/ruby/build/trunk/ext/openssl' I, [2024-05-08T21:56:53.216267 #334153] INFO -- : make[2]: Leaving directory '/tmp/ruby/build/trunk/.bundle/gems/racc-1.7.3/ext/racc/cparse' I, [2024-05-08T21:56:53.216330 #334153] INFO -- : make[2]: Leaving directory '/tmp/ruby/build/trunk/.bundle/gems/debug-1.9.2/ext/debug' I, [2024-05-08T21:56:53.216635 #334153] INFO -- : make[2]: Leaving directory '/tmp/ruby/build/trunk/.bundle/gems/rbs-3.4.4/ext/rbs_extension' I, [2024-05-08T21:56:53.222490 #334153] INFO -- : make[2]: Leaving directory '/tmp/ruby/build/trunk/.bundle/gems/bigdecimal-3.1.7/ext/bigdecimal' I, [2024-05-08T21:56:53.222545 #334153] INFO -- : make[2]: Leaving directory '/tmp/ruby/build/trunk/.bundle/gems/nkf-0.2.0/ext/nkf' I, [2024-05-08T21:56:53.224127 #334153] INFO -- : make[2]: Leaving directory '/tmp/ruby/build/trunk/.bundle/gems/bigdecimal-3.1.8/ext/bigdecimal' I, [2024-05-08T21:56:53.227281 #334153] INFO -- : make[2]: Leaving directory '/tmp/ruby/build/trunk/.bundle/gems/syslog-0.1.2/ext/syslog' I, [2024-05-08T21:56:53.251403 #334153] INFO -- : make[2]: Entering directory '/tmp/ruby/build/trunk' I, [2024-05-08T21:56:53.317656 #334153] INFO -- : linking ruby I, [2024-05-08T21:56:53.339993 #334153] INFO -- : make[2]: Leaving directory '/tmp/ruby/build/trunk' I, [2024-05-08T21:56:53.340256 #334153] INFO -- : make[1]: Leaving directory '/tmp/ruby/build/trunk' I, [2024-05-08T21:56:53.344173 #334153] INFO -- : make[1]: Entering directory '/tmp/ruby/build/trunk' I, [2024-05-08T21:56:53.344219 #334153] INFO -- : make[1]: Nothing to be done for 'note'. I, [2024-05-08T21:56:53.344225 #334153] INFO -- : make[1]: Leaving directory '/tmp/ruby/build/trunk' I, [2024-05-08T21:56:53.345271 #334153] INFO -- : $$$[end] "make all -j20" exit with 0. I, [2024-05-08T21:56:53.345484 #334153] INFO -- : $$$[beg] make install -j20 I, [2024-05-08T21:56:53.407837 #334153] INFO -- : Update minitest to ea9caafc0754b1d6236a490d59e624b53209734a I, [2024-05-08T21:56:53.407965 #334153] INFO -- : Update power_assert to 84e85124c5014a139af39161d484156cfe87a9ed I, [2024-05-08T21:56:53.408226 #334153] INFO -- : Update rbs to ba7872795d5de04adb8ff500c0e6afdc81a041dd I, [2024-05-08T21:56:53.408518 #334153] INFO -- : Update typeprof to b19a6416da3a05d57fadd6ffdadb382b6d236ca5 I, [2024-05-08T21:56:53.409112 #334153] INFO -- : echo ea9caafc0754b1d6236a490d59e624b53209734a | /bin/sh /tmp/ruby/src/trunk/tool/ifchange /tmp/ruby/src/trunk/.bundle/.timestamp/minitest.revision - I, [2024-05-08T21:56:53.409570 #334153] INFO -- : echo 84e85124c5014a139af39161d484156cfe87a9ed | /bin/sh /tmp/ruby/src/trunk/tool/ifchange /tmp/ruby/src/trunk/.bundle/.timestamp/power_assert.revision - I, [2024-05-08T21:56:53.410268 #334153] INFO -- : BASERUBY = /usr/bin/ruby --disable=gems I, [2024-05-08T21:56:53.410293 #334153] INFO -- : CC = gcc I, [2024-05-08T21:56:53.410305 #334153] INFO -- : LD = ld I, [2024-05-08T21:56:53.410317 #334153] INFO -- : LDSHARED = gcc -shared I, [2024-05-08T21:56:53.410329 #334153] INFO -- : CFLAGS = -O3 -fno-fast-math -ggdb3 -Wall -Wextra -Wdeprecated-declarations -Wdiv-by-zero -Wduplicated-cond -Wimplicit-function-declaration -Wimplicit-int -Wpointer-arith -Wwrite-strings -Wold-style-definition -Wimplicit-fallthrough=0 -Wmissing-noreturn -Wno-cast-function-type -Wno-constant-logical-operand -Wno-long-long -Wno-missing-field-initializers -Wno-overlength-strings -Wno-packed-bitfield-compat -Wno-parentheses-equality -Wno-self-assign -Wno-tautological-compare -Wno-unused-parameter -Wno-unused-value -Wsuggest-attribute=format -Wsuggest-attribute=noreturn -Wunused-variable -Wmisleading-indentation -Wundef -fPIC I, [2024-05-08T21:56:53.410341 #334153] INFO -- : XCFLAGS = -U_FORTIFY_SOURCE -D_FORTIFY_SOURCE=2 -fstack-protector-strong -fno-strict-overflow -fvisibility=hidden -fexcess-precision=standard -DRUBY_EXPORT -I. -I.ext/include/x86_64-linux -I/tmp/ruby/src/trunk/include -I/tmp/ruby/src/trunk -I/tmp/ruby/src/trunk/prism -I/tmp/ruby/src/trunk/enc/unicode/15.0.0 I, [2024-05-08T21:56:53.410352 #334153] INFO -- : CPPFLAGS = I, [2024-05-08T21:56:53.410363 #334153] INFO -- : DLDFLAGS = -Wl,--compress-debug-sections=zlib -Wl,-soname,libruby.so.3.4 -fstack-protector-strong I, [2024-05-08T21:56:53.410374 #334153] INFO -- : SOLIBS = -lz -lrt -lrt -lgmp -ldl -lcrypt -lm -lpthread I, [2024-05-08T21:56:53.410384 #334153] INFO -- : LANG = en_US.UTF-8 I, [2024-05-08T21:56:53.410395 #334153] INFO -- : LC_ALL = I, [2024-05-08T21:56:53.410405 #334153] INFO -- : LC_CTYPE = I, [2024-05-08T21:56:53.410420 #334153] INFO -- : MFLAGS = -j20 --jobserver-auth=4,5 I, [2024-05-08T21:56:53.410430 #334153] INFO -- : RUSTC = no I, [2024-05-08T21:56:53.410440 #334153] INFO -- : YJIT_RUSTC_ARGS = --crate-name=yjit --crate-type=staticlib --edition=2021 -g -C lto=thin -C opt-level=3 -C overflow-checks=on '--out-dir=/tmp/ruby/build/trunk/yjit/target/release/' /tmp/ruby/src/trunk/yjit/src/lib.rs I, [2024-05-08T21:56:53.411104 #334153] INFO -- : /tmp/ruby/src/trunk/.bundle/.timestamp/minitest.revision unchanged I, [2024-05-08T21:56:53.411375 #334153] INFO -- : /tmp/ruby/src/trunk/.bundle/.timestamp/power_assert.revision unchanged I, [2024-05-08T21:56:53.438924 #334153] INFO -- : echo ba7872795d5de04adb8ff500c0e6afdc81a041dd | /bin/sh /tmp/ruby/src/trunk/tool/ifchange /tmp/ruby/src/trunk/.bundle/.timestamp/rbs.revision - I, [2024-05-08T21:56:53.438983 #334153] INFO -- : echo b19a6416da3a05d57fadd6ffdadb382b6d236ca5 | /bin/sh /tmp/ruby/src/trunk/tool/ifchange /tmp/ruby/src/trunk/.bundle/.timestamp/typeprof.revision - I, [2024-05-08T21:56:53.439811 #334153] INFO -- : gcc (Ubuntu 11.4.0-1ubuntu1~22.04) 11.4.0 I, [2024-05-08T21:56:53.439882 #334153] INFO -- : Copyright (C) 2021 Free Software Foundation, Inc. I, [2024-05-08T21:56:53.439895 #334153] INFO -- : This is free software; see the source for copying conditions. There is NO I, [2024-05-08T21:56:53.439907 #334153] INFO -- : warranty; not even for MERCHANTABILITY or FITNESS FOR A PARTICULAR PURPOSE. I, [2024-05-08T21:56:53.439917 #334153] INFO -- : I, [2024-05-08T21:56:53.439928 #334153] INFO -- : generating enc.mk I, [2024-05-08T21:56:53.440738 #334153] INFO -- : /tmp/ruby/src/trunk/.bundle/.timestamp/rbs.revision unchanged I, [2024-05-08T21:56:53.440894 #334153] INFO -- : /tmp/ruby/src/trunk/.bundle/.timestamp/typeprof.revision unchanged I, [2024-05-08T21:56:53.563579 #334153] INFO -- : Building power_assert@84e85124c5014a139af39161d484156cfe87a9ed to /tmp/ruby/src/trunk/gems/power_assert-2.0.3.gem I, [2024-05-08T21:56:53.564176 #334153] INFO -- : making srcs under enc I, [2024-05-08T21:56:53.564326 #334153] INFO -- : making enc I, [2024-05-08T21:56:53.581338 #334153] INFO -- : make[1]: Entering directory '/tmp/ruby/build/trunk' I, [2024-05-08T21:56:53.581389 #334153] INFO -- : make[1]: Nothing to be done for 'enc'. I, [2024-05-08T21:56:53.581402 #334153] INFO -- : make[1]: Leaving directory '/tmp/ruby/build/trunk' I, [2024-05-08T21:56:53.594326 #334153] INFO -- : make[1]: Entering directory '/tmp/ruby/build/trunk' I, [2024-05-08T21:56:53.594384 #334153] INFO -- : make[1]: Nothing to be done for 'srcs'. I, [2024-05-08T21:56:53.594397 #334153] INFO -- : make[1]: Leaving directory '/tmp/ruby/build/trunk' I, [2024-05-08T21:56:53.595131 #334153] INFO -- : generating transdb.h I, [2024-05-08T21:56:53.632301 #334153] INFO -- : Successfully built RubyGem I, [2024-05-08T21:56:53.632361 #334153] INFO -- : Name: power_assert I, [2024-05-08T21:56:53.632374 #334153] INFO -- : Version: 2.0.4dev I, [2024-05-08T21:56:53.632387 #334153] INFO -- : File: power_assert-2.0.4dev.gem I, [2024-05-08T21:56:53.634463 #334153] INFO -- : Extracting bundle gem power_assert-2.0.3... I, [2024-05-08T21:56:53.690376 #334153] INFO -- : transdb.h unchanged I, [2024-05-08T21:56:53.692082 #334153] INFO -- : generating makefiles ext/configure-ext.mk I, [2024-05-08T21:56:53.692279 #334153] INFO -- : making trans I, [2024-05-08T21:56:53.695796 #334153] INFO -- : Try with hash version of bundled gems instead of gems/power_assert-2.0.3.gem. We don't use this gem with release version of Ruby. I, [2024-05-08T21:56:53.700783 #334153] INFO -- : Unpacked gems/power_assert-2.0.4dev.gem I, [2024-05-08T21:56:53.719018 #334153] INFO -- : ext/configure-ext.mk unchanged I, [2024-05-08T21:56:53.721514 #334153] INFO -- : make[1]: Entering directory '/tmp/ruby/build/trunk' I, [2024-05-08T21:56:53.726121 #334153] INFO -- : make[1]: Entering directory '/tmp/ruby/build/trunk' I, [2024-05-08T21:56:53.726205 #334153] INFO -- : make[1]: Nothing to be done for 'trans'. I, [2024-05-08T21:56:53.726215 #334153] INFO -- : make[1]: Leaving directory '/tmp/ruby/build/trunk' I, [2024-05-08T21:56:53.788937 #334153] INFO -- : making encs I, [2024-05-08T21:56:53.846235 #334153] INFO -- : make[1]: Entering directory '/tmp/ruby/build/trunk' I, [2024-05-08T21:56:53.846305 #334153] INFO -- : make[1]: Nothing to be done for 'encs'. I, [2024-05-08T21:56:53.846314 #334153] INFO -- : make[1]: Leaving directory '/tmp/ruby/build/trunk' I, [2024-05-08T21:56:53.877179 #334153] INFO -- : make[1]: Leaving directory '/tmp/ruby/build/trunk' I, [2024-05-08T21:56:53.877948 #334153] INFO -- : generating makefile exts.mk I, [2024-05-08T21:56:53.915858 #334153] INFO -- : exts.mk unchanged I, [2024-05-08T21:56:53.920516 #334153] INFO -- : make[1]: Entering directory '/tmp/ruby/build/trunk' I, [2024-05-08T21:56:53.939334 #334153] INFO -- : make[2]: Entering directory '/tmp/ruby/build/trunk/ext/digest' I, [2024-05-08T21:56:53.939969 #334153] INFO -- : make[2]: Entering directory '/tmp/ruby/build/trunk/ext/coverage' I, [2024-05-08T21:56:53.941150 #334153] INFO -- : make[2]: Entering directory '/tmp/ruby/build/trunk/ext/date' I, [2024-05-08T21:56:53.942101 #334153] INFO -- : make[2]: Entering directory '/tmp/ruby/build/trunk/ext/json' I, [2024-05-08T21:56:53.943046 #334153] INFO -- : make[2]: Leaving directory '/tmp/ruby/build/trunk/ext/coverage' I, [2024-05-08T21:56:53.943140 #334153] INFO -- : make[2]: Leaving directory '/tmp/ruby/build/trunk/ext/digest' I, [2024-05-08T21:56:53.943340 #334153] INFO -- : make[2]: Entering directory '/tmp/ruby/build/trunk/ext/rubyvm' I, [2024-05-08T21:56:53.943818 #334153] INFO -- : make[2]: Entering directory '/tmp/ruby/build/trunk/ext/fiddle' I, [2024-05-08T21:56:53.943883 #334153] INFO -- : make[2]: Entering directory '/tmp/ruby/build/trunk/ext/io/console' I, [2024-05-08T21:56:53.944065 #334153] INFO -- : make[2]: Entering directory '/tmp/ruby/build/trunk/ext/pathname' I, [2024-05-08T21:56:53.944087 #334153] INFO -- : make[2]: Entering directory '/tmp/ruby/build/trunk/ext/monitor' I, [2024-05-08T21:56:53.944666 #334153] INFO -- : make[2]: Entering directory '/tmp/ruby/build/trunk/ext/pty' I, [2024-05-08T21:56:53.945236 #334153] INFO -- : make[2]: Leaving directory '/tmp/ruby/build/trunk/ext/date' I, [2024-05-08T21:56:53.945331 #334153] INFO -- : make[2]: Leaving directory '/tmp/ruby/build/trunk/ext/rubyvm' I, [2024-05-08T21:56:53.946355 #334153] INFO -- : make[2]: Entering directory '/tmp/ruby/build/trunk/ext/objspace' I, [2024-05-08T21:56:53.946470 #334153] INFO -- : make[2]: Entering directory '/tmp/ruby/build/trunk/ext/psych' I, [2024-05-08T21:56:53.947343 #334153] INFO -- : make[2]: Leaving directory '/tmp/ruby/build/trunk/ext/pathname' I, [2024-05-08T21:56:53.947367 #334153] INFO -- : make[2]: Leaving directory '/tmp/ruby/build/trunk/ext/io/console' I, [2024-05-08T21:56:53.947375 #334153] INFO -- : make[2]: Leaving directory '/tmp/ruby/build/trunk/ext/monitor' I, [2024-05-08T21:56:53.947759 #334153] INFO -- : make[2]: Leaving directory '/tmp/ruby/build/trunk/ext/pty' I, [2024-05-08T21:56:53.947783 #334153] INFO -- : make[2]: Leaving directory '/tmp/ruby/build/trunk/ext/json' I, [2024-05-08T21:56:53.947850 #334153] INFO -- : make[2]: Entering directory '/tmp/ruby/build/trunk/.bundle/gems/bigdecimal-3.1.7/ext/bigdecimal' I, [2024-05-08T21:56:53.948053 #334153] INFO -- : make[2]: Entering directory '/tmp/ruby/build/trunk/.bundle/gems/bigdecimal-3.1.8/ext/bigdecimal' I, [2024-05-08T21:56:53.949060 #334153] INFO -- : make[2]: Entering directory '/tmp/ruby/build/trunk/.bundle/gems/debug-1.9.2/ext/debug' I, [2024-05-08T21:56:53.949649 #334153] INFO -- : make[2]: Entering directory '/tmp/ruby/build/trunk/.bundle/gems/nkf-0.2.0/ext/nkf' I, [2024-05-08T21:56:53.949678 #334153] INFO -- : make[2]: Entering directory '/tmp/ruby/build/trunk/ext/ripper' I, [2024-05-08T21:56:53.949831 #334153] INFO -- : make[2]: Entering directory '/tmp/ruby/build/trunk/.bundle/gems/racc-1.7.3/ext/racc/cparse' I, [2024-05-08T21:56:53.950142 #334153] INFO -- : make[2]: Entering directory '/tmp/ruby/build/trunk/.bundle/gems/syslog-0.1.2/ext/syslog' I, [2024-05-08T21:56:53.950437 #334153] INFO -- : make[2]: Leaving directory '/tmp/ruby/build/trunk/ext/objspace' I, [2024-05-08T21:56:53.950719 #334153] INFO -- : make[2]: Leaving directory '/tmp/ruby/build/trunk/ext/fiddle' I, [2024-05-08T21:56:53.950764 #334153] INFO -- : make[2]: Entering directory '/tmp/ruby/build/trunk/.bundle/gems/rbs-3.4.4/ext/rbs_extension' I, [2024-05-08T21:56:53.954338 #334153] INFO -- : make[2]: Entering directory '/tmp/ruby/build/trunk/ext/socket' I, [2024-05-08T21:56:53.955096 #334153] INFO -- : make[2]: Leaving directory '/tmp/ruby/build/trunk/ext/ripper' I, [2024-05-08T21:56:53.956852 #334153] INFO -- : make[2]: Entering directory '/tmp/ruby/build/trunk/ext/digest/sha2' I, [2024-05-08T21:56:53.957152 #334153] INFO -- : make[2]: Entering directory '/tmp/ruby/build/trunk/ext/openssl' I, [2024-05-08T21:56:53.959484 #334153] INFO -- : make[2]: Leaving directory '/tmp/ruby/build/trunk/ext/psych' I, [2024-05-08T21:56:53.960075 #334153] INFO -- : make[2]: Leaving directory '/tmp/ruby/build/trunk/ext/digest/sha2' I, [2024-05-08T21:56:53.962998 #334153] INFO -- : make[2]: Leaving directory '/tmp/ruby/build/trunk/ext/socket' I, [2024-05-08T21:56:53.968308 #334153] INFO -- : make[2]: Leaving directory '/tmp/ruby/build/trunk/ext/openssl' I, [2024-05-08T21:56:53.973973 #334153] INFO -- : make[2]: Leaving directory '/tmp/ruby/build/trunk/.bundle/gems/debug-1.9.2/ext/debug' I, [2024-05-08T21:56:53.974136 #334153] INFO -- : make[2]: Leaving directory '/tmp/ruby/build/trunk/.bundle/gems/bigdecimal-3.1.7/ext/bigdecimal' I, [2024-05-08T21:56:53.974162 #334153] INFO -- : make[2]: Leaving directory '/tmp/ruby/build/trunk/.bundle/gems/syslog-0.1.2/ext/syslog' I, [2024-05-08T21:56:53.975335 #334153] INFO -- : make[2]: Leaving directory '/tmp/ruby/build/trunk/.bundle/gems/racc-1.7.3/ext/racc/cparse' I, [2024-05-08T21:56:53.981189 #334153] INFO -- : make[2]: Leaving directory '/tmp/ruby/build/trunk/.bundle/gems/bigdecimal-3.1.8/ext/bigdecimal' I, [2024-05-08T21:56:53.981838 #334153] INFO -- : make[2]: Leaving directory '/tmp/ruby/build/trunk/.bundle/gems/nkf-0.2.0/ext/nkf' I, [2024-05-08T21:56:53.984008 #334153] INFO -- : make[2]: Leaving directory '/tmp/ruby/build/trunk/.bundle/gems/rbs-3.4.4/ext/rbs_extension' I, [2024-05-08T21:56:54.007891 #334153] INFO -- : make[2]: Entering directory '/tmp/ruby/build/trunk' I, [2024-05-08T21:56:54.073221 #334153] INFO -- : make[2]: 'ruby' is up to date. I, [2024-05-08T21:56:54.073260 #334153] INFO -- : make[2]: Leaving directory '/tmp/ruby/build/trunk' I, [2024-05-08T21:56:54.073669 #334153] INFO -- : make[1]: Leaving directory '/tmp/ruby/build/trunk' I, [2024-05-08T21:56:54.077588 #334153] INFO -- : make[1]: Entering directory '/tmp/ruby/build/trunk' I, [2024-05-08T21:56:54.077611 #334153] INFO -- : make[1]: Nothing to be done for 'note'. I, [2024-05-08T21:56:54.077621 #334153] INFO -- : make[1]: Leaving directory '/tmp/ruby/build/trunk' I, [2024-05-08T21:56:54.077879 #334153] INFO -- : ./miniruby -I/tmp/ruby/src/trunk/lib -I. -I.ext/common /tmp/ruby/src/trunk/tool/runruby.rb --extout=.ext -- --disable-gems -r./x86_64-linux-fake /tmp/ruby/src/trunk/tool/rbinstall.rb --make="make" --dest-dir="" --extout=".ext" --ext-build-dir="./ext" --mflags="-j20 --jobserver-auth=4,5" --make-flags=" -j20 --jobserver-auth=4,5" --data-mode=0644 --prog-mode=0755 --installed-list .installed.list --mantype="doc" --gnumake --install=all --exclude=doc I, [2024-05-08T21:56:54.174682 #334153] INFO -- : Installing to I, [2024-05-08T21:56:54.174741 #334153] INFO -- : installing binary commands: /tmp/ruby/install/trunk/bin I, [2024-05-08T21:56:54.174843 #334153] INFO -- : installing base libraries: /tmp/ruby/install/trunk/lib I, [2024-05-08T21:56:54.182282 #334153] INFO -- : installing arch files: /tmp/ruby/install/trunk/lib/ruby/3.4.0+0/x86_64-linux I, [2024-05-08T21:56:54.182311 #334153] INFO -- : installing pkgconfig data: /tmp/ruby/install/trunk/lib/pkgconfig I, [2024-05-08T21:56:54.182317 #334153] INFO -- : installing extension objects: /tmp/ruby/install/trunk/lib/ruby/3.4.0+0/x86_64-linux I, [2024-05-08T21:56:54.192122 #334153] INFO -- : installing extension objects: /tmp/ruby/install/trunk/lib/ruby/site_ruby/3.4.0+0/x86_64-linux I, [2024-05-08T21:56:54.192153 #334153] INFO -- : installing extension objects: /tmp/ruby/install/trunk/lib/ruby/vendor_ruby/3.4.0+0/x86_64-linux I, [2024-05-08T21:56:54.192160 #334153] INFO -- : installing extension headers: /tmp/ruby/install/trunk/include/ruby-3.4.0+0/x86_64-linux I, [2024-05-08T21:56:54.192323 #334153] INFO -- : installing extension scripts: /tmp/ruby/install/trunk/lib/ruby/3.4.0+0 I, [2024-05-08T21:56:54.196192 #334153] INFO -- : installing extension scripts: /tmp/ruby/install/trunk/lib/ruby/site_ruby/3.4.0+0 I, [2024-05-08T21:56:54.196214 #334153] INFO -- : installing extension scripts: /tmp/ruby/install/trunk/lib/ruby/vendor_ruby/3.4.0+0 I, [2024-05-08T21:56:54.196220 #334153] INFO -- : installing extension headers: /tmp/ruby/install/trunk/include/ruby-3.4.0+0/ruby I, [2024-05-08T21:56:54.196225 #334153] INFO -- : installing command scripts: /tmp/ruby/install/trunk/bin I, [2024-05-08T21:56:54.196229 #334153] INFO -- : installing library scripts: /tmp/ruby/install/trunk/lib/ruby/3.4.0+0 I, [2024-05-08T21:56:54.230647 #334153] INFO -- : installing common headers: /tmp/ruby/install/trunk/include/ruby-3.4.0+0 I, [2024-05-08T21:56:54.236052 #334153] INFO -- : installing manpages: /tmp/ruby/install/trunk/share/man/man1 I, [2024-05-08T21:56:54.236081 #334153] INFO -- : installing default gems from lib: /tmp/ruby/install/trunk/lib/ruby/gems/3.4.0+0 I, [2024-05-08T21:56:54.258720 #334153] INFO -- : benchmark 0.3.0 I, [2024-05-08T21:56:54.265704 #334153] INFO -- : bundler 2.6.0.dev I, [2024-05-08T21:56:54.267778 #334153] INFO -- : cgi 0.4.1 I, [2024-05-08T21:56:54.268353 #334153] INFO -- : delegate 0.3.1 I, [2024-05-08T21:56:54.268822 #334153] INFO -- : did_you_mean 1.6.3 I, [2024-05-08T21:56:54.269308 #334153] INFO -- : english 0.8.0 I, [2024-05-08T21:56:54.269778 #334153] INFO -- : erb 4.0.4 I, [2024-05-08T21:56:54.270478 #334153] INFO -- : error_highlight 0.6.0 I, [2024-05-08T21:56:54.270965 #334153] INFO -- : fileutils 1.7.2 I, [2024-05-08T21:56:54.271424 #334153] INFO -- : find 0.2.0 I, [2024-05-08T21:56:54.271800 #334153] INFO -- : forwardable 1.3.3 I, [2024-05-08T21:56:54.272273 #334153] INFO -- : ipaddr 1.2.6 I, [2024-05-08T21:56:54.272798 #334153] INFO -- : irb 1.13.1 I, [2024-05-08T21:56:54.274398 #334153] INFO -- : logger 1.6.0 I, [2024-05-08T21:56:54.274893 #334153] INFO -- : net-http 0.4.1 I, [2024-05-08T21:56:54.275405 #334153] INFO -- : net-protocol 0.2.2 I, [2024-05-08T21:56:54.275893 #334153] INFO -- : open-uri 0.4.1 I, [2024-05-08T21:56:54.276451 #334153] INFO -- : open3 0.2.1 I, [2024-05-08T21:56:54.276979 #334153] INFO -- : optparse 0.5.0 I, [2024-05-08T21:56:54.277524 #334153] INFO -- : ostruct 0.6.0 I, [2024-05-08T21:56:54.277936 #334153] INFO -- : pp 0.5.0 I, [2024-05-08T21:56:54.278416 #334153] INFO -- : prettyprint 0.2.0 I, [2024-05-08T21:56:54.278859 #334153] INFO -- : prism 0.28.0 I, [2024-05-08T21:56:54.279472 #334153] INFO -- : pstore 0.1.3 I, [2024-05-08T21:56:54.279856 #334153] INFO -- : rdoc 6.6.3.1 I, [2024-05-08T21:56:54.281572 #334153] INFO -- : readline 0.0.4 I, [2024-05-08T21:56:54.282060 #334153] INFO -- : reline 0.5.5 I, [2024-05-08T21:56:54.282593 #334153] INFO -- : resolv 0.4.0 I, [2024-05-08T21:56:54.283075 #334153] INFO -- : ruby2_keywords 0.0.5 I, [2024-05-08T21:56:54.283565 #334153] INFO -- : securerandom 0.3.1 I, [2024-05-08T21:56:54.284022 #334153] INFO -- : set 1.1.0 I, [2024-05-08T21:56:54.284562 #334153] INFO -- : shellwords 0.2.0 I, [2024-05-08T21:56:54.285074 #334153] INFO -- : singleton 0.2.0 I, [2024-05-08T21:56:54.285545 #334153] INFO -- : syntax_suggest 2.0.0 I, [2024-05-08T21:56:54.286316 #334153] INFO -- : tempfile 0.2.1 I, [2024-05-08T21:56:54.286800 #334153] INFO -- : time 0.3.0 I, [2024-05-08T21:56:54.287681 #334153] INFO -- : timeout 0.4.1 I, [2024-05-08T21:56:54.288381 #334153] INFO -- : tmpdir 0.2.0 I, [2024-05-08T21:56:54.288966 #334153] INFO -- : tsort 0.2.0 I, [2024-05-08T21:56:54.289466 #334153] INFO -- : un 0.3.0 I, [2024-05-08T21:56:54.289925 #334153] INFO -- : uri 0.13.0 I, [2024-05-08T21:56:54.290444 #334153] INFO -- : weakref 0.1.3 I, [2024-05-08T21:56:54.290927 #334153] INFO -- : yaml 0.3.0 I, [2024-05-08T21:56:54.291200 #334153] INFO -- : installing default gems from ext: /tmp/ruby/install/trunk/lib/ruby/gems/3.4.0+0 I, [2024-05-08T21:56:54.298342 #334153] INFO -- : date 3.3.4 I, [2024-05-08T21:56:54.298965 #334153] INFO -- : digest 3.1.1 I, [2024-05-08T21:56:54.299459 #334153] INFO -- : etc 1.4.3 I, [2024-05-08T21:56:54.299960 #334153] INFO -- : fcntl 1.1.0 I, [2024-05-08T21:56:54.300546 #334153] INFO -- : fiddle 1.1.3 I, [2024-05-08T21:56:54.301028 #334153] INFO -- : io-console 0.7.2 I, [2024-05-08T21:56:54.301497 #334153] INFO -- : io-nonblock 0.3.0 I, [2024-05-08T21:56:54.301886 #334153] INFO -- : io-wait 0.3.1 I, [2024-05-08T21:56:54.302473 #334153] INFO -- : json 2.7.2 I, [2024-05-08T21:56:54.303586 #334153] INFO -- : openssl 3.2.0 I, [2024-05-08T21:56:54.304184 #334153] INFO -- : pathname 0.3.0 I, [2024-05-08T21:56:54.304704 #334153] INFO -- : psych 5.1.2 I, [2024-05-08T21:56:54.305305 #334153] INFO -- : stringio 3.1.1 I, [2024-05-08T21:56:54.305816 #334153] INFO -- : strscan 3.1.1 I, [2024-05-08T21:56:54.306284 #334153] INFO -- : zlib 3.1.0 I, [2024-05-08T21:56:54.306574 #334153] INFO -- : installing bundled gems: /tmp/ruby/install/trunk/lib/ruby/gems/3.4.0+0 I, [2024-05-08T21:56:54.306946 #334153] INFO -- : minitest 5.22.3 I, [2024-05-08T21:56:54.314391 #334153] INFO -- : rake 13.2.1 I, [2024-05-08T21:56:54.317888 #334153] INFO -- : test-unit 3.6.2 I, [2024-05-08T21:56:54.322268 #334153] INFO -- : rexml 3.2.6 I, [2024-05-08T21:56:54.325709 #334153] INFO -- : rss 0.3.0 I, [2024-05-08T21:56:54.328677 #334153] INFO -- : net-ftp 0.3.4 I, [2024-05-08T21:56:54.330134 #334153] INFO -- : net-imap 0.4.10 I, [2024-05-08T21:56:54.333083 #334153] INFO -- : net-pop 0.1.2 I, [2024-05-08T21:56:54.333980 #334153] INFO -- : net-smtp 0.5.0 I, [2024-05-08T21:56:54.335022 #334153] INFO -- : matrix 0.4.2 I, [2024-05-08T21:56:54.338555 #334153] INFO -- : prime 0.1.2 I, [2024-05-08T21:56:54.344343 #334153] INFO -- : rbs 3.4.4 I, [2024-05-08T21:56:54.366889 #334153] INFO -- : typeprof 0.21.11 I, [2024-05-08T21:56:54.369509 #334153] INFO -- : debug 1.9.2 I, [2024-05-08T21:56:54.372202 #334153] INFO -- : racc 1.7.3 I, [2024-05-08T21:56:54.374986 #334153] INFO -- : mutex_m 0.2.0 I, [2024-05-08T21:56:54.376116 #334153] INFO -- : getoptlong 0.2.1 I, [2024-05-08T21:56:54.377398 #334153] INFO -- : base64 0.2.0 I, [2024-05-08T21:56:54.378387 #334153] INFO -- : bigdecimal 3.1.8 I, [2024-05-08T21:56:54.380508 #334153] INFO -- : observer 0.1.2 I, [2024-05-08T21:56:54.382159 #334153] INFO -- : abbrev 0.1.2 I, [2024-05-08T21:56:54.383150 #334153] INFO -- : resolv-replace 0.1.1 I, [2024-05-08T21:56:54.384459 #334153] INFO -- : rinda 0.2.0 I, [2024-05-08T21:56:54.385642 #334153] INFO -- : drb 2.2.1 I, [2024-05-08T21:56:54.387209 #334153] INFO -- : nkf 0.2.0 I, [2024-05-08T21:56:54.389708 #334153] INFO -- : syslog 0.1.2 I, [2024-05-08T21:56:54.391232 #334153] INFO -- : csv 3.3.0 I, [2024-05-08T21:56:54.393302 #334153] INFO -- : installing bundled gem cache: /tmp/ruby/install/trunk/lib/ruby/gems/3.4.0+0/cache I, [2024-05-08T21:56:54.394776 #334153] INFO -- : skipped bundled gems: I, [2024-05-08T21:56:54.394797 #334153] INFO -- : power_assert-2.0.4dev.gem not found in bundled_gems I, [2024-05-08T21:56:54.398162 #334153] INFO -- : $$$[end] "make install -j20" exit with 0. I, [2024-05-08T21:56:54.398254 #334153] INFO -- : $$$[beg] make yes-btest TESTOPTS='-q -j20' I, [2024-05-08T21:56:59.637226 #334153] INFO -- : PASS all 1936 tests E, [2024-05-08T21:56:59.642569 #334153] ERROR -- : I, [2024-05-08T21:56:59.642763 #334153] INFO -- : $$$[end] "make yes-btest TESTOPTS='-q -j20'" exit with 0. I, [2024-05-08T21:56:59.642840 #334153] INFO -- : $$$[beg] make yes-test-basic TESTS='-j20' I, [2024-05-08T21:56:59.703238 #334153] INFO -- : BASERUBY = /usr/bin/ruby --disable=gems I, [2024-05-08T21:56:59.703277 #334153] INFO -- : CC = gcc I, [2024-05-08T21:56:59.703287 #334153] INFO -- : LD = ld I, [2024-05-08T21:56:59.703294 #334153] INFO -- : LDSHARED = gcc -shared I, [2024-05-08T21:56:59.703306 #334153] INFO -- : CFLAGS = -O3 -fno-fast-math -ggdb3 -Wall -Wextra -Wdeprecated-declarations -Wdiv-by-zero -Wduplicated-cond -Wimplicit-function-declaration -Wimplicit-int -Wpointer-arith -Wwrite-strings -Wold-style-definition -Wimplicit-fallthrough=0 -Wmissing-noreturn -Wno-cast-function-type -Wno-constant-logical-operand -Wno-long-long -Wno-missing-field-initializers -Wno-overlength-strings -Wno-packed-bitfield-compat -Wno-parentheses-equality -Wno-self-assign -Wno-tautological-compare -Wno-unused-parameter -Wno-unused-value -Wsuggest-attribute=format -Wsuggest-attribute=noreturn -Wunused-variable -Wmisleading-indentation -Wundef -fPIC I, [2024-05-08T21:56:59.703312 #334153] INFO -- : XCFLAGS = -U_FORTIFY_SOURCE -D_FORTIFY_SOURCE=2 -fstack-protector-strong -fno-strict-overflow -fvisibility=hidden -fexcess-precision=standard -DRUBY_EXPORT -I. -I.ext/include/x86_64-linux -I/tmp/ruby/src/trunk/include -I/tmp/ruby/src/trunk -I/tmp/ruby/src/trunk/prism -I/tmp/ruby/src/trunk/enc/unicode/15.0.0 I, [2024-05-08T21:56:59.703325 #334153] INFO -- : CPPFLAGS = I, [2024-05-08T21:56:59.703330 #334153] INFO -- : DLDFLAGS = -Wl,--compress-debug-sections=zlib -Wl,-soname,libruby.so.3.4 -fstack-protector-strong I, [2024-05-08T21:56:59.703334 #334153] INFO -- : SOLIBS = -lz -lrt -lrt -lgmp -ldl -lcrypt -lm -lpthread I, [2024-05-08T21:56:59.703339 #334153] INFO -- : LANG = en_US.UTF-8 I, [2024-05-08T21:56:59.703343 #334153] INFO -- : LC_ALL = I, [2024-05-08T21:56:59.703347 #334153] INFO -- : LC_CTYPE = I, [2024-05-08T21:56:59.703352 #334153] INFO -- : MFLAGS = I, [2024-05-08T21:56:59.703356 #334153] INFO -- : RUSTC = no I, [2024-05-08T21:56:59.703360 #334153] INFO -- : YJIT_RUSTC_ARGS = --crate-name=yjit --crate-type=staticlib --edition=2021 -g -C lto=thin -C opt-level=3 -C overflow-checks=on '--out-dir=/tmp/ruby/build/trunk/yjit/target/release/' /tmp/ruby/src/trunk/yjit/src/lib.rs I, [2024-05-08T21:56:59.704020 #334153] INFO -- : gcc (Ubuntu 11.4.0-1ubuntu1~22.04) 11.4.0 I, [2024-05-08T21:56:59.704030 #334153] INFO -- : Copyright (C) 2021 Free Software Foundation, Inc. I, [2024-05-08T21:56:59.704035 #334153] INFO -- : This is free software; see the source for copying conditions. There is NO I, [2024-05-08T21:56:59.704039 #334153] INFO -- : warranty; not even for MERCHANTABILITY or FITNESS FOR A PARTICULAR PURPOSE. I, [2024-05-08T21:56:59.704044 #334153] INFO -- : I, [2024-05-08T21:56:59.810370 #334153] INFO -- : Checking leaked global symbols...none I, [2024-05-08T21:56:59.851331 #334153] INFO -- : /tmp/ruby/src/trunk/basictest/test.rb:assignment ....................................................................................................................................................................................................................................................................................................................................................................................OK 372 I, [2024-05-08T21:56:59.851399 #334153] INFO -- : /tmp/ruby/src/trunk/basictest/test.rb:condition ..OK 2 I, [2024-05-08T21:56:59.851406 #334153] INFO -- : /tmp/ruby/src/trunk/basictest/test.rb:if/unless ...OK 3 I, [2024-05-08T21:56:59.851410 #334153] INFO -- : /tmp/ruby/src/trunk/basictest/test.rb:case .....OK 5 I, [2024-05-08T21:56:59.851585 #334153] INFO -- : /tmp/ruby/src/trunk/basictest/test.rb:while/until ........OK 8 I, [2024-05-08T21:56:59.851642 #334153] INFO -- : /tmp/ruby/src/trunk/basictest/test.rb:exception ..........OK 10 I, [2024-05-08T21:56:59.851903 #334153] INFO -- : /tmp/ruby/src/trunk/basictest/test.rb:array .......................................OK 39 I, [2024-05-08T21:56:59.852001 #334153] INFO -- : /tmp/ruby/src/trunk/basictest/test.rb:hash ...........................OK 27 I, [2024-05-08T21:56:59.852722 #334153] INFO -- : /tmp/ruby/src/trunk/basictest/test.rb:iterator ...........................................................................................................OK 107 I, [2024-05-08T21:56:59.852997 #334153] INFO -- : /tmp/ruby/src/trunk/basictest/test.rb:float ................................................................................OK 80 I, [2024-05-08T21:56:59.854009 #334153] INFO -- : /tmp/ruby/src/trunk/basictest/test.rb:bignum ...............................OK 31 I, [2024-05-08T21:56:59.854761 #334153] INFO -- : /tmp/ruby/src/trunk/basictest/test.rb:string & char ..............................................................OK 62 I, [2024-05-08T21:56:59.854794 #334153] INFO -- : /tmp/ruby/src/trunk/basictest/test.rb:assignment ..........OK 10 I, [2024-05-08T21:56:59.854821 #334153] INFO -- : /tmp/ruby/src/trunk/basictest/test.rb:call ......OK 6 I, [2024-05-08T21:56:59.854875 #334153] INFO -- : /tmp/ruby/src/trunk/basictest/test.rb:proc .........OK 9 I, [2024-05-08T21:56:59.955180 #334153] INFO -- : /tmp/ruby/src/trunk/basictest/test.rb:signal ..OK 2 I, [2024-05-08T21:56:59.955651 #334153] INFO -- : /tmp/ruby/src/trunk/basictest/test.rb:eval ...........................OK 27 I, [2024-05-08T21:57:00.056899 #334153] INFO -- : /tmp/ruby/src/trunk/basictest/test.rb:system ........OK 8 I, [2024-05-08T21:57:00.056972 #334153] INFO -- : /tmp/ruby/src/trunk/basictest/test.rb:const .....OK 5 I, [2024-05-08T21:57:00.057026 #334153] INFO -- : /tmp/ruby/src/trunk/basictest/test.rb:clone .....OK 5 I, [2024-05-08T21:57:00.057196 #334153] INFO -- : /tmp/ruby/src/trunk/basictest/test.rb:marshal ....OK 4 I, [2024-05-08T21:57:00.057262 #334153] INFO -- : /tmp/ruby/src/trunk/basictest/test.rb:pack ....OK 4 I, [2024-05-08T21:57:00.057286 #334153] INFO -- : /tmp/ruby/src/trunk/basictest/test.rb:math ..OK 2 I, [2024-05-08T21:57:00.057355 #334153] INFO -- : /tmp/ruby/src/trunk/basictest/test.rb:struct ......OK 6 I, [2024-05-08T21:57:00.057477 #334153] INFO -- : /tmp/ruby/src/trunk/basictest/test.rb:variable ............OK 12 I, [2024-05-08T21:57:00.057507 #334153] INFO -- : /tmp/ruby/src/trunk/basictest/test.rb:trace ...OK 3 I, [2024-05-08T21:57:00.057588 #334153] INFO -- : /tmp/ruby/src/trunk/basictest/test.rb:defined? ............OK 12 I, [2024-05-08T21:57:00.057645 #334153] INFO -- : /tmp/ruby/src/trunk/basictest/test.rb:alias ......OK 6 I, [2024-05-08T21:57:00.058037 #334153] INFO -- : /tmp/ruby/src/trunk/basictest/test.rb:path .......................OK 23 I, [2024-05-08T21:57:00.092374 #334153] INFO -- : /tmp/ruby/src/trunk/basictest/test.rb:gc ....OK 4 I, [2024-05-08T21:57:00.094771 #334153] INFO -- : I, [2024-05-08T21:57:00.094797 #334153] INFO -- : test succeeded I, [2024-05-08T21:57:00.096054 #334153] INFO -- : $$$[end] "make yes-test-basic TESTS='-j20'" exit with 0. I, [2024-05-08T21:57:00.096147 #334153] INFO -- : $$$[beg] make yes-test-all TESTOPTS='--stderr-on-failure' TESTS='-j20' I, [2024-05-08T21:57:00.181511 #334153] INFO -- : BASERUBY = /usr/bin/ruby --disable=gems I, [2024-05-08T21:57:00.181560 #334153] INFO -- : CC = gcc I, [2024-05-08T21:57:00.181573 #334153] INFO -- : LD = ld I, [2024-05-08T21:57:00.181584 #334153] INFO -- : LDSHARED = gcc -shared I, [2024-05-08T21:57:00.181596 #334153] INFO -- : CFLAGS = -O3 -fno-fast-math -ggdb3 -Wall -Wextra -Wdeprecated-declarations -Wdiv-by-zero -Wduplicated-cond -Wimplicit-function-declaration -Wimplicit-int -Wpointer-arith -Wwrite-strings -Wold-style-definition -Wimplicit-fallthrough=0 -Wmissing-noreturn -Wno-cast-function-type -Wno-constant-logical-operand -Wno-long-long -Wno-missing-field-initializers -Wno-overlength-strings -Wno-packed-bitfield-compat -Wno-parentheses-equality -Wno-self-assign -Wno-tautological-compare -Wno-unused-parameter -Wno-unused-value -Wsuggest-attribute=format -Wsuggest-attribute=noreturn -Wunused-variable -Wmisleading-indentation -Wundef -fPIC I, [2024-05-08T21:57:00.181607 #334153] INFO -- : XCFLAGS = -U_FORTIFY_SOURCE -D_FORTIFY_SOURCE=2 -fstack-protector-strong -fno-strict-overflow -fvisibility=hidden -fexcess-precision=standard -DRUBY_EXPORT -I. -I.ext/include/x86_64-linux -I/tmp/ruby/src/trunk/include -I/tmp/ruby/src/trunk -I/tmp/ruby/src/trunk/prism -I/tmp/ruby/src/trunk/enc/unicode/15.0.0 I, [2024-05-08T21:57:00.181617 #334153] INFO -- : CPPFLAGS = I, [2024-05-08T21:57:00.181628 #334153] INFO -- : DLDFLAGS = -Wl,--compress-debug-sections=zlib -Wl,-soname,libruby.so.3.4 -fstack-protector-strong I, [2024-05-08T21:57:00.181639 #334153] INFO -- : SOLIBS = -lz -lrt -lrt -lgmp -ldl -lcrypt -lm -lpthread I, [2024-05-08T21:57:00.181649 #334153] INFO -- : LANG = en_US.UTF-8 I, [2024-05-08T21:57:00.181659 #334153] INFO -- : LC_ALL = I, [2024-05-08T21:57:00.181669 #334153] INFO -- : LC_CTYPE = I, [2024-05-08T21:57:00.181678 #334153] INFO -- : MFLAGS = I, [2024-05-08T21:57:00.181687 #334153] INFO -- : RUSTC = no I, [2024-05-08T21:57:00.181697 #334153] INFO -- : YJIT_RUSTC_ARGS = --crate-name=yjit --crate-type=staticlib --edition=2021 -g -C lto=thin -C opt-level=3 -C overflow-checks=on '--out-dir=/tmp/ruby/build/trunk/yjit/target/release/' /tmp/ruby/src/trunk/yjit/src/lib.rs I, [2024-05-08T21:57:00.182186 #334153] INFO -- : gcc (Ubuntu 11.4.0-1ubuntu1~22.04) 11.4.0 I, [2024-05-08T21:57:00.182236 #334153] INFO -- : Copyright (C) 2021 Free Software Foundation, Inc. I, [2024-05-08T21:57:00.182249 #334153] INFO -- : This is free software; see the source for copying conditions. There is NO I, [2024-05-08T21:57:00.182261 #334153] INFO -- : warranty; not even for MERCHANTABILITY or FITNESS FOR A PARTICULAR PURPOSE. I, [2024-05-08T21:57:00.182271 #334153] INFO -- : I, [2024-05-08T21:57:00.183929 #334153] INFO -- : generating enc.mk I, [2024-05-08T21:57:00.301609 #334153] INFO -- : making enc I, [2024-05-08T21:57:00.319128 #334153] INFO -- : make[1]: Entering directory '/tmp/ruby/build/trunk' I, [2024-05-08T21:57:00.319195 #334153] INFO -- : make[1]: Nothing to be done for 'enc'. I, [2024-05-08T21:57:00.319211 #334153] INFO -- : make[1]: Leaving directory '/tmp/ruby/build/trunk' I, [2024-05-08T21:57:00.319791 #334153] INFO -- : making srcs under enc I, [2024-05-08T21:57:00.348823 #334153] INFO -- : make[1]: Entering directory '/tmp/ruby/build/trunk' I, [2024-05-08T21:57:00.348885 #334153] INFO -- : make[1]: Nothing to be done for 'srcs'. I, [2024-05-08T21:57:00.348897 #334153] INFO -- : make[1]: Leaving directory '/tmp/ruby/build/trunk' I, [2024-05-08T21:57:00.349682 #334153] INFO -- : generating transdb.h I, [2024-05-08T21:57:00.444814 #334153] INFO -- : transdb.h unchanged I, [2024-05-08T21:57:00.446159 #334153] INFO -- : making trans I, [2024-05-08T21:57:00.479919 #334153] INFO -- : make[1]: Entering directory '/tmp/ruby/build/trunk' I, [2024-05-08T21:57:00.479981 #334153] INFO -- : make[1]: Nothing to be done for 'trans'. I, [2024-05-08T21:57:00.479995 #334153] INFO -- : make[1]: Leaving directory '/tmp/ruby/build/trunk' I, [2024-05-08T21:57:00.480714 #334153] INFO -- : making encs I, [2024-05-08T21:57:00.517707 #334153] INFO -- : make[1]: Entering directory '/tmp/ruby/build/trunk' I, [2024-05-08T21:57:00.517767 #334153] INFO -- : make[1]: Nothing to be done for 'encs'. I, [2024-05-08T21:57:00.517781 #334153] INFO -- : make[1]: Leaving directory '/tmp/ruby/build/trunk' I, [2024-05-08T21:57:00.519439 #334153] INFO -- : generating makefiles ext/configure-ext.mk I, [2024-05-08T21:57:00.546713 #334153] INFO -- : ext/configure-ext.mk updated I, [2024-05-08T21:57:00.549080 #334153] INFO -- : make[1]: Entering directory '/tmp/ruby/build/trunk' I, [2024-05-08T21:57:01.948232 #334153] INFO -- : make[1]: Leaving directory '/tmp/ruby/build/trunk' I, [2024-05-08T21:57:01.948825 #334153] INFO -- : generating makefile exts.mk I, [2024-05-08T21:57:01.985879 #334153] INFO -- : exts.mk unchanged I, [2024-05-08T21:57:01.990384 #334153] INFO -- : make[1]: Entering directory '/tmp/ruby/build/trunk' I, [2024-05-08T21:57:02.200760 #334153] INFO -- : make[2]: Entering directory '/tmp/ruby/build/trunk/ext/coverage' I, [2024-05-08T21:57:02.203637 #334153] INFO -- : make[2]: Leaving directory '/tmp/ruby/build/trunk/ext/coverage' I, [2024-05-08T21:57:02.207470 #334153] INFO -- : make[2]: Entering directory '/tmp/ruby/build/trunk/ext/date' I, [2024-05-08T21:57:02.210558 #334153] INFO -- : make[2]: Leaving directory '/tmp/ruby/build/trunk/ext/date' I, [2024-05-08T21:57:02.212850 #334153] INFO -- : make[2]: Entering directory '/tmp/ruby/build/trunk/ext/digest' I, [2024-05-08T21:57:02.218241 #334153] INFO -- : make[2]: Leaving directory '/tmp/ruby/build/trunk/ext/digest' I, [2024-05-08T21:57:02.233853 #334153] INFO -- : make[2]: Entering directory '/tmp/ruby/build/trunk/ext/digest/sha2' I, [2024-05-08T21:57:02.236812 #334153] INFO -- : make[2]: Leaving directory '/tmp/ruby/build/trunk/ext/digest/sha2' I, [2024-05-08T21:57:02.249371 #334153] INFO -- : make[2]: Entering directory '/tmp/ruby/build/trunk/ext/fiddle' I, [2024-05-08T21:57:02.255713 #334153] INFO -- : make[2]: Leaving directory '/tmp/ruby/build/trunk/ext/fiddle' I, [2024-05-08T21:57:02.258706 #334153] INFO -- : make[2]: Entering directory '/tmp/ruby/build/trunk/ext/io/console' I, [2024-05-08T21:57:02.261245 #334153] INFO -- : make[2]: Leaving directory '/tmp/ruby/build/trunk/ext/io/console' I, [2024-05-08T21:57:02.268792 #334153] INFO -- : make[2]: Entering directory '/tmp/ruby/build/trunk/ext/json' I, [2024-05-08T21:57:02.275014 #334153] INFO -- : make[2]: Leaving directory '/tmp/ruby/build/trunk/ext/json' I, [2024-05-08T21:57:02.284016 #334153] INFO -- : make[2]: Entering directory '/tmp/ruby/build/trunk/ext/monitor' I, [2024-05-08T21:57:02.286404 #334153] INFO -- : make[2]: Leaving directory '/tmp/ruby/build/trunk/ext/monitor' I, [2024-05-08T21:57:02.290603 #334153] INFO -- : make[2]: Entering directory '/tmp/ruby/build/trunk/ext/objspace' I, [2024-05-08T21:57:02.294333 #334153] INFO -- : make[2]: Leaving directory '/tmp/ruby/build/trunk/ext/objspace' I, [2024-05-08T21:57:02.306290 #334153] INFO -- : make[2]: Entering directory '/tmp/ruby/build/trunk/ext/openssl' I, [2024-05-08T21:57:02.319518 #334153] INFO -- : make[2]: Leaving directory '/tmp/ruby/build/trunk/ext/openssl' I, [2024-05-08T21:57:02.322390 #334153] INFO -- : make[2]: Entering directory '/tmp/ruby/build/trunk/ext/pathname' I, [2024-05-08T21:57:02.324860 #334153] INFO -- : make[2]: Leaving directory '/tmp/ruby/build/trunk/ext/pathname' I, [2024-05-08T21:57:02.329095 #334153] INFO -- : make[2]: Entering directory '/tmp/ruby/build/trunk/ext/psych' I, [2024-05-08T21:57:02.343763 #334153] INFO -- : make[2]: Leaving directory '/tmp/ruby/build/trunk/ext/psych' I, [2024-05-08T21:57:02.346799 #334153] INFO -- : make[2]: Entering directory '/tmp/ruby/build/trunk/ext/pty' I, [2024-05-08T21:57:02.349308 #334153] INFO -- : make[2]: Leaving directory '/tmp/ruby/build/trunk/ext/pty' I, [2024-05-08T21:57:02.358870 #334153] INFO -- : make[2]: Entering directory '/tmp/ruby/build/trunk/ext/ripper' I, [2024-05-08T21:57:02.363831 #334153] INFO -- : make[2]: Leaving directory '/tmp/ruby/build/trunk/ext/ripper' I, [2024-05-08T21:57:02.365368 #334153] INFO -- : make[2]: Entering directory '/tmp/ruby/build/trunk/ext/rubyvm' I, [2024-05-08T21:57:02.367423 #334153] INFO -- : make[2]: Leaving directory '/tmp/ruby/build/trunk/ext/rubyvm' I, [2024-05-08T21:57:02.375221 #334153] INFO -- : make[2]: Entering directory '/tmp/ruby/build/trunk/ext/socket' I, [2024-05-08T21:57:02.381620 #334153] INFO -- : make[2]: Leaving directory '/tmp/ruby/build/trunk/ext/socket' I, [2024-05-08T21:57:02.392591 #334153] INFO -- : make[2]: Entering directory '/tmp/ruby/build/trunk/.bundle/gems/bigdecimal-3.1.7/ext/bigdecimal' I, [2024-05-08T21:57:02.415032 #334153] INFO -- : make[2]: Leaving directory '/tmp/ruby/build/trunk/.bundle/gems/bigdecimal-3.1.7/ext/bigdecimal' I, [2024-05-08T21:57:02.417131 #334153] INFO -- : make[2]: Entering directory '/tmp/ruby/build/trunk/.bundle/gems/bigdecimal-3.1.8/ext/bigdecimal' I, [2024-05-08T21:57:02.439197 #334153] INFO -- : make[2]: Leaving directory '/tmp/ruby/build/trunk/.bundle/gems/bigdecimal-3.1.8/ext/bigdecimal' I, [2024-05-08T21:57:02.441293 #334153] INFO -- : make[2]: Entering directory '/tmp/ruby/build/trunk/.bundle/gems/debug-1.9.2/ext/debug' I, [2024-05-08T21:57:02.463253 #334153] INFO -- : make[2]: Leaving directory '/tmp/ruby/build/trunk/.bundle/gems/debug-1.9.2/ext/debug' I, [2024-05-08T21:57:02.465145 #334153] INFO -- : make[2]: Entering directory '/tmp/ruby/build/trunk/.bundle/gems/nkf-0.2.0/ext/nkf' I, [2024-05-08T21:57:02.487986 #334153] INFO -- : make[2]: Leaving directory '/tmp/ruby/build/trunk/.bundle/gems/nkf-0.2.0/ext/nkf' I, [2024-05-08T21:57:02.489906 #334153] INFO -- : make[2]: Entering directory '/tmp/ruby/build/trunk/.bundle/gems/racc-1.7.3/ext/racc/cparse' I, [2024-05-08T21:57:02.511669 #334153] INFO -- : make[2]: Leaving directory '/tmp/ruby/build/trunk/.bundle/gems/racc-1.7.3/ext/racc/cparse' I, [2024-05-08T21:57:02.514006 #334153] INFO -- : make[2]: Entering directory '/tmp/ruby/build/trunk/.bundle/gems/rbs-3.4.4/ext/rbs_extension' I, [2024-05-08T21:57:02.535335 #334153] INFO -- : make[2]: Leaving directory '/tmp/ruby/build/trunk/.bundle/gems/rbs-3.4.4/ext/rbs_extension' I, [2024-05-08T21:57:02.537220 #334153] INFO -- : make[2]: Entering directory '/tmp/ruby/build/trunk/.bundle/gems/syslog-0.1.2/ext/syslog' I, [2024-05-08T21:57:02.558753 #334153] INFO -- : make[2]: Leaving directory '/tmp/ruby/build/trunk/.bundle/gems/syslog-0.1.2/ext/syslog' I, [2024-05-08T21:57:02.582094 #334153] INFO -- : make[2]: Entering directory '/tmp/ruby/build/trunk' I, [2024-05-08T21:57:02.645207 #334153] INFO -- : make[2]: 'ruby' is up to date. I, [2024-05-08T21:57:02.645275 #334153] INFO -- : make[2]: Leaving directory '/tmp/ruby/build/trunk' I, [2024-05-08T21:57:02.645581 #334153] INFO -- : make[1]: Leaving directory '/tmp/ruby/build/trunk' I, [2024-05-08T21:57:02.649328 #334153] INFO -- : make[1]: Entering directory '/tmp/ruby/build/trunk' I, [2024-05-08T21:57:02.649393 #334153] INFO -- : make[1]: Nothing to be done for 'note'. I, [2024-05-08T21:57:02.649415 #334153] INFO -- : make[1]: Leaving directory '/tmp/ruby/build/trunk' I, [2024-05-08T21:57:02.725030 #334153] INFO -- : Run options: I, [2024-05-08T21:57:02.725089 #334153] INFO -- : --seed=1570 I, [2024-05-08T21:57:02.725103 #334153] INFO -- : "--ruby=./miniruby -I/tmp/ruby/src/trunk/lib -I. -I.ext/common /tmp/ruby/src/trunk/tool/runruby.rb --extout=.ext -- --disable-gems" I, [2024-05-08T21:57:02.725114 #334153] INFO -- : --excludes-dir=/tmp/ruby/src/trunk/test/.excludes I, [2024-05-08T21:57:02.725125 #334153] INFO -- : --name=!/memory_leak/ I, [2024-05-08T21:57:02.725135 #334153] INFO -- : --stderr-on-failure I, [2024-05-08T21:57:02.725146 #334153] INFO -- : -j20 I, [2024-05-08T21:57:02.725157 #334153] INFO -- : I, [2024-05-08T21:57:02.725167 #334153] INFO -- : # Running tests: I, [2024-05-08T21:57:02.725177 #334153] INFO -- : I, [2024-05-08T21:57:02.871138 #334153] INFO -- : [ 1/885] 375531=test_summary I, [2024-05-08T21:57:02.871877 #334153] INFO -- : [ 2/885] 375535=test_console_attr I, [2024-05-08T21:57:02.872019 #334153] INFO -- : [ 3/885] 375534=test_type_completor I, [2024-05-08T21:57:02.872438 #334153] INFO -- : [ 4/885] 375532=warnings_test I, [2024-05-08T21:57:02.873221 #334153] INFO -- : [ 5/885] 375535=test_kwargs I, [2024-05-08T21:57:02.873663 #334153] INFO -- : [ 6/885] 375549=test_gem_commands_exec_command I, [2024-05-08T21:57:02.875256 #334153] INFO -- : [ 7/885] 375533=test_io_wait I, [2024-05-08T21:57:02.875344 #334153] INFO -- : [ 8/885] 375534=test_date_attr I, [2024-05-08T21:57:02.875966 #334153] INFO -- : [ 9/885] 375535=test_ellipsize I, [2024-05-08T21:57:02.876043 #334153] INFO -- : [ 10/885] 375546=test_io I, [2024-05-08T21:57:02.876151 #334153] INFO -- : [ 11/885] 375547=test_hash I, [2024-05-08T21:57:02.876571 #334153] INFO -- : [ 12/885] 375545=test_ubf_async_safe I, [2024-05-08T21:57:02.877396 #334153] INFO -- : [ 13/885] 375548=test_emoji I, [2024-05-08T21:57:02.877495 #334153] INFO -- : [ 14/885] 375544=test_win32ole_type_event I, [2024-05-08T21:57:02.880527 #334153] INFO -- : [ 15/885] 375544=test_sorted_set I, [2024-05-08T21:57:02.885568 #334153] INFO -- : [ 16/885] 375534=test_win32ole_record I, [2024-05-08T21:57:02.886058 #334153] INFO -- : [ 17/885] 375545=test_gem_unsatisfiable_dependency_error I, [2024-05-08T21:57:02.886086 #334153] INFO -- : [ 18/885] 375534=test_condition I, [2024-05-08T21:57:02.890703 #334153] INFO -- : [ 19/885] 375535=test_gem_source_specific_file I, [2024-05-08T21:57:02.906830 #334153] INFO -- : [ 20/885] 375536=test_foreach I, [2024-05-08T21:57:02.906909 #334153] INFO -- : [ 21/885] 375538=test_gem_commands_uninstall_command I, [2024-05-08T21:57:02.907008 #334153] INFO -- : [ 22/885] 375539=test_cp949 I, [2024-05-08T21:57:02.907113 #334153] INFO -- : [ 23/885] 375540=test_rdoc_rubygems_hook I, [2024-05-08T21:57:02.913491 #334153] INFO -- : [ 24/885] 375541=test_method I, [2024-05-08T21:57:02.913563 #334153] INFO -- : [ 25/885] 375542=test_gem_commands_query_command I, [2024-05-08T21:57:02.913579 #334153] INFO -- : [ 26/885] 375543=test_pack I, [2024-05-08T21:57:02.913603 #334153] INFO -- : [ 27/885] 375534=test_array_create I, [2024-05-08T21:57:02.913615 #334153] INFO -- : [ 28/885] 375548=test_gem_impossible_dependencies_error I, [2024-05-08T21:57:02.920168 #334153] INFO -- : [ 29/885] 375534=test_pattern_key_name_check I, [2024-05-08T21:57:02.920243 #334153] INFO -- : [ 30/885] 375536=test_to_ruby I, [2024-05-08T21:57:02.920259 #334153] INFO -- : [ 31/885] 375539=test_ftp I, [2024-05-08T21:57:02.937767 #334153] INFO -- : [ 32/885] 375534=test_euc_kr I, [2024-05-08T21:57:02.947711 #334153] INFO -- : [ 33/885] 375534=test_rdoc_context_section I, [2024-05-08T21:57:02.951171 #334153] INFO -- : [ 34/885] 375532=test_undef I, [2024-05-08T21:57:02.951233 #334153] INFO -- : [ 35/885] 375539=ripper_test I, [2024-05-08T21:57:02.960615 #334153] INFO -- : [ 36/885] 375536=test_objspace I, [2024-05-08T21:57:02.962742 #334153] INFO -- : [ 37/885] 375550=test_line_editor I, [2024-05-08T21:57:02.980223 #334153] INFO -- : [ 38/885] 375532=test_gem_security_trust_dir I, [2024-05-08T21:57:02.997250 #334153] INFO -- : [ 39/885] 375537=test_gem_requirement I, [2024-05-08T21:57:03.005880 #334153] INFO -- : [ 40/885] 375531=test_sprintf I, [2024-05-08T21:57:03.012344 #334153] INFO -- : [ 41/885] 375550=comments_test I, [2024-05-08T21:57:03.077899 #334153] INFO -- : [ 42/885] 375548=test_string_memory I, [2024-05-08T21:57:03.078895 #334153] INFO -- : [ 43/885] 375550=test_set I, [2024-05-08T21:57:03.081110 #334153] INFO -- : [ 44/885] 375543=test_show_source I, [2024-05-08T21:57:03.087529 #334153] INFO -- : [ 45/885] 375544=test_remote_fetch_error I, [2024-05-08T21:57:03.094185 #334153] INFO -- : [ 46/885] 375546=test_have_library I, [2024-05-08T21:57:03.101451 #334153] INFO -- : [ 47/885] 375534=test_gem_commands_stale_command I, [2024-05-08T21:57:03.103737 #334153] INFO -- : [ 48/885] 375550=test_c_struct_entry I, [2024-05-08T21:57:03.107852 #334153] INFO -- : [ 49/885] 375548=test_lock_native_thread I, [2024-05-08T21:57:03.126803 #334153] INFO -- : [ 50/885] 375545=test_external_new I, [2024-05-08T21:57:03.132534 #334153] INFO -- : [ 51/885] 375545=test_postponed_job I, [2024-05-08T21:57:03.181858 #334153] INFO -- : [ 52/885] 375531=test_alias_and_anchor I, [2024-05-08T21:57:03.185512 #334153] INFO -- : [ 53/885] 375543=test_hash I, [2024-05-08T21:57:03.200235 #334153] INFO -- : [ 54/885] 375540=test_gem_resolver_dependency_request I, [2024-05-08T21:57:03.203704 #334153] INFO -- : [ 55/885] 375535=test_tree_builder I, [2024-05-08T21:57:03.206872 #334153] INFO -- : [ 56/885] 375550=test_win32ole_typelib I, [2024-05-08T21:57:03.211437 #334153] INFO -- : [ 57/885] 375550=test_protect I, [2024-05-08T21:57:03.212010 #334153] INFO -- : [ 58/885] 375532=test_raise_exception I, [2024-05-08T21:57:03.213993 #334153] INFO -- : [ 59/885] 375550=test_gem_request_set_lockfile I, [2024-05-08T21:57:03.215664 #334153] INFO -- : [ 60/885] 375533=test_yjit I, [2024-05-08T21:57:03.220315 #334153] INFO -- : [ 61/885] 375531=test_workspace I, [2024-05-08T21:57:03.220720 #334153] INFO -- : [ 62/885] 375543=test_weakmap I, [2024-05-08T21:57:03.223491 #334153] INFO -- : [ 63/885] 375533=test_m17n I, [2024-05-08T21:57:03.232664 #334153] INFO -- : [ 64/885] 375535=test_gem_commands_environment_command I, [2024-05-08T21:57:03.268745 #334153] INFO -- : [ 65/885] 375544=test_ws I, [2024-05-08T21:57:03.281570 #334153] INFO -- : [ 66/885] 375544=test_argf I, [2024-05-08T21:57:03.289941 #334153] INFO -- : [ 67/885] 375535=test_framework I, [2024-05-08T21:57:03.301168 #334153] INFO -- : [ 68/885] 375533=test_ns_spki I, [2024-05-08T21:57:03.306405 #334153] INFO -- : [ 69/885] 375535=test_kill_ring I, [2024-05-08T21:57:03.309777 #334153] INFO -- : [ 70/885] 375537=test_io_buffer I, [2024-05-08T21:57:03.340759 #334153] INFO -- : [ 71/885] 375534=ruby_parser_test I, [2024-05-08T21:57:03.370705 #334153] INFO -- : [ 72/885] 375533=test_backtrace I, [2024-05-08T21:57:03.375413 #334153] INFO -- : [ 73/885] 375535=test_pack I, [2024-05-08T21:57:03.389017 #334153] INFO -- : [ 74/885] 375540=test_rdoc_task I, [2024-05-08T21:57:03.391858 #334153] INFO -- : [ 75/885] 375548=test_gem_resolver_conflict I, [2024-05-08T21:57:03.395628 #334153] INFO -- : [ 76/885] 375535=test_rdoc_markup_indented_paragraph I, [2024-05-08T21:57:03.401746 #334153] INFO -- : [ 77/885] 375548=locals_test I, [2024-05-08T21:57:03.402681 #334153] INFO -- : [ 78/885] 375540=test_rdoc_require I, [2024-05-08T21:57:03.418164 #334153] INFO -- : [ 79/885] 375540=test_clone I, [2024-05-08T21:57:03.433091 #334153] INFO -- : [ 80/885] 375537=test_gem_commands_install_command I, [2024-05-08T21:57:03.438826 #334153] INFO -- : [ 81/885] 375534=test_readpartial I, [2024-05-08T21:57:03.466643 #334153] INFO -- : [ 82/885] 375531=test_fstring I, [2024-05-08T21:57:03.520257 #334153] INFO -- : [ 83/885] 375545=test_array I, [2024-05-08T21:57:03.540395 #334153] INFO -- : [ 84/885] 375542=test_optparse I, [2024-05-08T21:57:03.550409 #334153] INFO -- : [ 85/885] 375545=test_rdoc_markup_raw I, [2024-05-08T21:57:03.584812 #334153] INFO -- : [ 86/885] 375535=test_webauthn_poller I, [2024-05-08T21:57:03.595284 #334153] INFO -- : [ 87/885] 375539=test_rat I, [2024-05-08T21:57:03.602292 #334153] INFO -- : [ 88/885] 375539=test_typeddata I, [2024-05-08T21:57:03.603408 #334153] INFO -- : [ 89/885] 375542=test_gem_resolver_best_set I, [2024-05-08T21:57:03.621129 #334153] INFO -- : [ 90/885] 375531=encoding_test I, [2024-05-08T21:57:03.639586 #334153] INFO -- : [ 91/885] 375540=test_rdoc_markup_to_html_crossref I, [2024-05-08T21:57:03.662268 #334153] INFO -- : [ 92/885] 375542=test_files_sample I, [2024-05-08T21:57:03.723248 #334153] INFO -- : [ 93/885] 375535=test_stringscanner I, [2024-05-08T21:57:03.728874 #334153] INFO -- : [ 94/885] 375545=test_convertible I, [2024-05-08T21:57:03.760367 #334153] INFO -- : [ 95/885] 375535=parser_test I, [2024-05-08T21:57:03.761174 #334153] INFO -- : [ 96/885] 375550=test_yield I, [2024-05-08T21:57:03.765449 #334153] INFO -- : [ 97/885] 375531=test_rdoc_alias I, [2024-05-08T21:57:03.820395 #334153] INFO -- : [ 98/885] 375542=test_pkcs12 I, [2024-05-08T21:57:03.823823 #334153] INFO -- : [ 99/885] 375532=test_system I, [2024-05-08T21:57:03.840472 #334153] INFO -- : [100/885] 375539=test_bigzero I, [2024-05-08T21:57:03.840985 #334153] INFO -- : [101/885] 375539=test_pkey_dh I, [2024-05-08T21:57:03.847758 #334153] INFO -- : [102/885] 375534=test_iseq_load I, [2024-05-08T21:57:03.862685 #334153] INFO -- : [103/885] 375535=test_gem_util I, [2024-05-08T21:57:03.902902 #334153] INFO -- : [104/885] 375548=test_gem_package_tar_header I, [2024-05-08T21:57:03.948093 #334153] INFO -- : [105/885] 375548=test_ripper I, [2024-05-08T21:57:03.951965 #334153] INFO -- : [106/885] 375540=test_gem_config_file I, [2024-05-08T21:57:03.968661 #334153] INFO -- : [107/885] 375539=test_gem_resolver_activation_request I, [2024-05-08T21:57:03.998632 #334153] INFO -- : [108/885] 375538=test_protocol I, [2024-05-08T21:57:04.001410 #334153] INFO -- : [109/885] 375531=test_getopts I, [2024-05-08T21:57:04.006896 #334153] INFO -- : [110/885] 375531=test_yjit_exit_locations I, [2024-05-08T21:57:04.009380 #334153] INFO -- : [111/885] 375531=test_etc I, [2024-05-08T21:57:04.035078 #334153] INFO -- : [112/885] 375535=test_yaml_tree I, [2024-05-08T21:57:04.064075 #334153] INFO -- : [113/885] 375535=test_gc I, [2024-05-08T21:57:04.067224 #334153] INFO -- : [114/885] 375540=test_math I, [2024-05-08T21:57:04.068481 #334153] INFO -- : [115/885] 375535=test_gem_commands_fetch_command I, [2024-05-08T21:57:04.078449 #334153] INFO -- : [116/885] 375540=test_libs I, [2024-05-08T21:57:04.097474 #334153] INFO -- : [117/885] 375531=test_config I, [2024-05-08T21:57:04.103608 #334153] INFO -- : [118/885] 375540=test_sleep I, [2024-05-08T21:57:04.116933 #334153] INFO -- : [119/885] 375539=test_autoload I, [2024-05-08T21:57:04.221697 #334153] INFO -- : [120/885] 375549=test_utf16 I, [2024-05-08T21:57:04.229823 #334153] INFO -- : [121/885] 375535=test_unicode_escape I, [2024-05-08T21:57:04.233842 #334153] INFO -- : [122/885] 375549=test_io I, [2024-05-08T21:57:04.304794 #334153] INFO -- : [123/885] 375535=test_face I, [2024-05-08T21:57:04.308304 #334153] INFO -- : [124/885] 375538=test_case I, [2024-05-08T21:57:04.321784 #334153] INFO -- : [125/885] 375535=test_sizeof I, [2024-05-08T21:57:04.344908 #334153] INFO -- : [126/885] 375538=test_rendering I, [2024-05-08T21:57:04.345153 #334153] INFO -- : [127/885] 375548=test_cgi_util I, [2024-05-08T21:57:04.355598 #334153] INFO -- : [128/885] 375546=test_require I, [2024-05-08T21:57:04.397333 #334153] INFO -- : [129/885] 375531=test_gem_ext_cmake_builder I, [2024-05-08T21:57:04.412184 #334153] INFO -- : [130/885] 375542=test_gem_commands_contents_command I, [2024-05-08T21:57:04.414684 #334153] INFO -- : [131/885] 375531=test_digest I, [2024-05-08T21:57:04.423228 #334153] INFO -- : [132/885] 375543=test_marshalable I, [2024-05-08T21:57:04.426167 #334153] INFO -- : [133/885] 375543=test_find I, [2024-05-08T21:57:04.437089 #334153] INFO -- : [134/885] 375543=test_ractor I, [2024-05-08T21:57:04.466985 #334153] INFO -- : [135/885] 375538=test_wss I, [2024-05-08T21:57:04.490418 #334153] INFO -- : [136/885] 375538=test_fiddle I, [2024-05-08T21:57:04.498390 #334153] INFO -- : [137/885] 375542=test_file I, [2024-05-08T21:57:04.501388 #334153] INFO -- : [138/885] 375542=test_gem_available_set I, [2024-05-08T21:57:04.515326 #334153] INFO -- : [139/885] 375548=test_rdoc_markdown I, [2024-05-08T21:57:04.526458 #334153] INFO -- : [140/885] 375534=test_modify_expand I, [2024-05-08T21:57:04.533182 #334153] INFO -- : [141/885] 375534=test_rdoc_any_method I, [2024-05-08T21:57:04.536021 #334153] INFO -- : [142/885] 375543=test_init I, [2024-05-08T21:57:04.551469 #334153] INFO -- : [143/885] 375538=test_complexrational I, [2024-05-08T21:57:04.557115 #334153] INFO -- : [144/885] 375538=test_pathname I, [2024-05-08T21:57:04.583575 #334153] INFO -- : [145/885] 375542=test_coverage I, [2024-05-08T21:57:04.653770 #334153] INFO -- : [146/885] 375533=test_rdoc_encoding I, [2024-05-08T21:57:04.730083 #334153] INFO -- : [147/885] 375541=test_gem_package_tar_reader I, [2024-05-08T21:57:04.761614 #334153] INFO -- : [148/885] 375533=regexp_test I, [2024-05-08T21:57:04.769705 #334153] INFO -- : [149/885] 375538=test_gem_commands_owner_command I, [2024-05-08T21:57:04.826291 #334153] INFO -- : [150/885] 375533=test_gem_source_vendor I, [2024-05-08T21:57:04.858406 #334153] INFO -- : [151/885] 375532=test_recorder I, [2024-05-08T21:57:04.880745 #334153] INFO -- : [152/885] 375532=test_formatter I, [2024-05-08T21:57:04.888623 #334153] INFO -- : [153/885] 375532=test_bash_completion I, [2024-05-08T21:57:04.894589 #334153] INFO -- : [154/885] 375532=test_rdoc_constant I, [2024-05-08T21:57:04.899245 #334153] INFO -- : [155/885] 375543=test_deprecate I, [2024-05-08T21:57:04.907985 #334153] INFO -- : [156/885] 375541=test_handle I, [2024-05-08T21:57:04.961668 #334153] INFO -- : [157/885] 375534=test_wait I, [2024-05-08T21:57:04.966227 #334153] INFO -- : [158/885] 375533=test_yaml I, [2024-05-08T21:57:04.971890 #334153] INFO -- : [159/885] 375548=test_forwardable I, [2024-05-08T21:57:04.982318 #334153] INFO -- : [160/885] 375537=test_big2str I, [2024-05-08T21:57:04.986299 #334153] INFO -- : [161/885] 375548=test_ansi_without_terminfo I, [2024-05-08T21:57:04.988871 #334153] INFO -- : [162/885] 375537=test_gem_commands_sources_command I, [2024-05-08T21:57:05.008484 #334153] INFO -- : [163/885] 375541=test_bmethod I, [2024-05-08T21:57:05.011083 #334153] INFO -- : [164/885] 375541=test_euc_tw I, [2024-05-08T21:57:05.012093 #334153] INFO -- : [165/885] 375541=test_ractor I, [2024-05-08T21:57:05.021637 #334153] INFO -- : [166/885] 375534=test_rdoc_markup_formatter I, [2024-05-08T21:57:05.027426 #334153] INFO -- : [167/885] 375541=test_nowrite I, [2024-05-08T21:57:05.028688 #334153] INFO -- : [168/885] 375548=test_thread_queue I, [2024-05-08T21:57:05.030750 #334153] INFO -- : [169/885] 375534=test_rdoc_parser_c I, [2024-05-08T21:57:05.046594 #334153] INFO -- : [170/885] 375541=test_comparable I, [2024-05-08T21:57:05.052000 #334153] INFO -- : [171/885] 375541=json_fixtures_test I, [2024-05-08T21:57:05.054091 #334153] INFO -- : [172/885] 375533=test_shapes I, [2024-05-08T21:57:05.057902 #334153] INFO -- : [173/885] 375533=test_io_timeout I, [2024-05-08T21:57:05.060895 #334153] INFO -- : [174/885] 375533=test_profile_frames I, [2024-05-08T21:57:05.066326 #334153] INFO -- : [175/885] 375541=test_cstr I, [2024-05-08T21:57:05.144155 #334153] INFO -- : [176/885] 375543=test_pstore I, [2024-05-08T21:57:05.176883 #334153] INFO -- : [177/885] 375534=test_enc_str_buf_cat I, [2024-05-08T21:57:05.177894 #334153] INFO -- : [178/885] 375537=test_gbk I, [2024-05-08T21:57:05.181054 #334153] INFO -- : [179/885] 375534=test_class2name I, [2024-05-08T21:57:05.185472 #334153] INFO -- : [180/885] 375537=test_too_many_dummy_encodings I, [2024-05-08T21:57:05.186698 #334153] INFO -- : [181/885] 375543=test_stack I, [2024-05-08T21:57:05.188973 #334153] INFO -- : [182/885] 375534=test_gem_commands_list_command I, [2024-05-08T21:57:05.204097 #334153] INFO -- : [183/885] 375531=test_reqarg I, [2024-05-08T21:57:05.207191 #334153] INFO -- : [184/885] 375534=test_rdoc_include I, [2024-05-08T21:57:05.233732 #334153] INFO -- : [185/885] 375533=test_resource I, [2024-05-08T21:57:05.237563 #334153] INFO -- : [186/885] 375532=test_gem_commands_signin_command I, [2024-05-08T21:57:05.257316 #334153] INFO -- : [187/885] 375533=test_emitter I, [2024-05-08T21:57:05.257749 #334153] INFO -- : [188/885] 375537=test_ldap I, [2024-05-08T21:57:05.260680 #334153] INFO -- : [189/885] 375533=test_fileutils I, [2024-05-08T21:57:05.269722 #334153] INFO -- : [190/885] 375534=test_string_processing I, [2024-05-08T21:57:05.278348 #334153] INFO -- : [191/885] 375537=test_rdoc_options I, [2024-05-08T21:57:05.329035 #334153] INFO -- : [192/885] 375542=test_cesu8 I, [2024-05-08T21:57:05.330647 #334153] INFO -- : [193/885] 375538=test_econv I, [2024-05-08T21:57:05.332658 #334153] INFO -- : [194/885] 375534=test_gem_version I, [2024-05-08T21:57:05.348361 #334153] INFO -- : [195/885] 375542=test_gem_dependency I, [2024-05-08T21:57:05.352441 #334153] INFO -- : [196/885] 375532=test_gem_resolver_specification I, [2024-05-08T21:57:05.389955 #334153] INFO -- : [197/885] 375532=test_path_to_class I, [2024-05-08T21:57:05.391968 #334153] INFO -- : [198/885] 375532=test_rdoc_markup_verbatim I, [2024-05-08T21:57:05.396106 #334153] INFO -- : [199/885] 375532=test_inlinecache I, [2024-05-08T21:57:05.397309 #334153] INFO -- : [200/885] 375534=test_gem_commands_search_command I, [2024-05-08T21:57:05.403372 #334153] INFO -- : [201/885] 375534=test_complex I, [2024-05-08T21:57:05.457683 #334153] INFO -- : [202/885] 375542=test_gem_ext_ext_conf_builder I, [2024-05-08T21:57:05.470667 #334153] INFO -- : [203/885] 375532=test_gem_stub_specification I, [2024-05-08T21:57:05.476748 #334153] INFO -- : [204/885] 375541=test_method_cache I, [2024-05-08T21:57:05.479714 #334153] INFO -- : [205/885] 375541=test_frozen_error I, [2024-05-08T21:57:05.484649 #334153] INFO -- : [206/885] 375541=test_gem_resolver_installed_specification I, [2024-05-08T21:57:05.524960 #334153] INFO -- : [207/885] 375531=test_scanner_events I, [2024-05-08T21:57:05.525783 #334153] INFO -- : [208/885] 375537=test_gem_remote_fetcher I, [2024-05-08T21:57:05.528381 #334153] INFO -- : [209/885] 375541=test_mdns I, [2024-05-08T21:57:05.545259 #334153] INFO -- : [210/885] 375541=test_parse I, [2024-05-08T21:57:05.548926 #334153] INFO -- : [211/885] 375531=test_gem_installer I, [2024-05-08T21:57:05.552175 #334153] INFO -- : [212/885] 375534=test_yamlstore I, [2024-05-08T21:57:05.587527 #334153] INFO -- : [213/885] 375532=test_rdoc_parser_rd I, [2024-05-08T21:57:05.594375 #334153] INFO -- : [214/885] 375534=test_date_strftime I, [2024-05-08T21:57:05.598605 #334153] INFO -- : [215/885] 375546=test_irb I, [2024-05-08T21:57:05.618347 #334153] INFO -- : [216/885] 375532=test_random I, [2024-05-08T21:57:05.630747 #334153] INFO -- : [217/885] 375532=test_asn1 I, [2024-05-08T21:57:05.656559 #334153] INFO -- : [218/885] 375532=test_const I, [2024-05-08T21:57:05.658355 #334153] INFO -- : [219/885] 375532=test_class I, [2024-05-08T21:57:05.738485 #334153] INFO -- : [220/885] 375533=test_rdoc_normal_class I, [2024-05-08T21:57:05.832301 #334153] INFO -- : [221/885] 375533=test_load I, [2024-05-08T21:57:05.842345 #334153] INFO -- : [222/885] 375533=json_string_matching_test I, [2024-05-08T21:57:05.850964 #334153] INFO -- : [223/885] 375533=parse_comments_test I, [2024-05-08T21:57:05.852623 #334153] INFO -- : [224/885] 375533=test_noarg I, [2024-05-08T21:57:05.955022 #334153] INFO -- : [225/885] 375534=test_tempfile I, [2024-05-08T21:57:06.016222 #334153] INFO -- : [226/885] 375546=test_queue I, [2024-05-08T21:57:06.024307 #334153] INFO -- : [227/885] 375546=test_function I, [2024-05-08T21:57:06.069269 #334153] INFO -- : [228/885] 375533=test_gem_resolver_index_specification I, [2024-05-08T21:57:06.101531 #334153] INFO -- : [229/885] 375543=test_internal_ivar I, [2024-05-08T21:57:06.101933 #334153] INFO -- : [230/885] 375543=test_rdoc_markup I, [2024-05-08T21:57:06.109308 #334153] INFO -- : [231/885] 375541=test_gem_commands_help_command I, [2024-05-08T21:57:06.129413 #334153] INFO -- : [232/885] 375533=test_tracepoint I, [2024-05-08T21:57:06.153005 #334153] INFO -- : [233/885] 375540=test_prettyprint I, [2024-05-08T21:57:06.171562 #334153] INFO -- : [234/885] 375540=test_basicsocket I, [2024-05-08T21:57:06.180599 #334153] INFO -- : [235/885] 375540=test_utf32 I, [2024-05-08T21:57:06.190931 #334153] INFO -- : [236/885] 375540=test_duplicate I, [2024-05-08T21:57:06.194258 #334153] INFO -- : [237/885] 375540=test_http I, [2024-05-08T21:57:06.199861 #334153] INFO -- : [238/885] 375541=test_shift_jis I, [2024-05-08T21:57:06.205347 #334153] INFO -- : [239/885] 375541=test_gem_commands_which_command I, [2024-05-08T21:57:06.212324 #334153] INFO -- : [240/885] 375540=test_inadvertent_creation I, [2024-05-08T21:57:06.216023 #334153] INFO -- : [241/885] 375534=test_flags I, [2024-05-08T21:57:06.227980 #334153] INFO -- : [242/885] 375541=test_enumerator I, [2024-05-08T21:57:06.237067 #334153] INFO -- : [243/885] 375546=test_gem_commands_specification_command I, [2024-05-08T21:57:06.291411 #334153] INFO -- : [244/885] 375543=test_gem_commands_dependency_command I, [2024-05-08T21:57:06.340978 #334153] INFO -- : [245/885] 375540=test_gem_resolver I, [2024-05-08T21:57:06.349317 #334153] INFO -- : [246/885] 375546=test_gem_resolver_composed_set I, [2024-05-08T21:57:06.367562 #334153] INFO -- : [247/885] 375546=test_safe_load I, [2024-05-08T21:57:06.378457 #334153] INFO -- : [248/885] 375546=test_name_error I, [2024-05-08T21:57:06.381569 #334153] INFO -- : [249/885] 375533=test_rdoc_markup_attribute_manager I, [2024-05-08T21:57:06.405345 #334153] INFO -- : [250/885] 375543=test_open-uri I, [2024-05-08T21:57:06.417467 #334153] INFO -- : [251/885] 375533=test_httpresponse I, [2024-05-08T21:57:06.443225 #334153] INFO -- : [252/885] 375538=test_rdoc_parser_ruby I, [2024-05-08T21:57:06.466439 #334153] INFO -- : [253/885] 375546=test_rdoc_context I, [2024-05-08T21:57:06.472313 #334153] INFO -- : [254/885] 375547=test_nil2vtempty I, [2024-05-08T21:57:06.475717 #334153] INFO -- : [255/885] 375547=test_stream I, [2024-05-08T21:57:06.506611 #334153] INFO -- : [256/885] 375547=test_tcp I, [2024-05-08T21:57:06.534406 #334153] INFO -- : [257/885] 375533=test_iso_8859 I, [2024-05-08T21:57:06.561437 #334153] INFO -- : [258/885] 375533=test_rdoc_text I, [2024-05-08T21:57:06.614796 #334153] INFO -- : [259/885] 375533=test_syntax I, [2024-05-08T21:57:06.615923 #334153] INFO -- : [260/885] 375547=test_gem_safe_yaml I, [2024-05-08T21:57:06.623002 #334153] INFO -- : [261/885] 375540=test_rdoc_markup_to_joined_paragraph I, [2024-05-08T21:57:06.626879 #334153] INFO -- : [262/885] 375540=test_date_time I, [2024-05-08T21:57:06.641538 #334153] INFO -- : [263/885] 375540=test_require I, [2024-05-08T21:57:06.645460 #334153] INFO -- : [264/885] 375540=index_write_test I, [2024-05-08T21:57:06.734821 #334153] INFO -- : [265/885] 375540=test_date_new I, [2024-05-08T21:57:06.745390 #334153] INFO -- : [266/885] 375540=test_data I, [2024-05-08T21:57:06.754189 #334153] INFO -- : [267/885] 375540=test_securerandom I, [2024-05-08T21:57:06.765197 #334153] INFO -- : [268/885] 375542=test_logperiod I, [2024-05-08T21:57:06.776437 #334153] INFO -- : [269/885] 375542=test_rdoc_markdown_test I, [2024-05-08T21:57:06.802761 #334153] INFO -- : [270/885] 375540=test_rdoc_normal_module I, [2024-05-08T21:57:06.808715 #334153] INFO -- : [271/885] 375550=test_c_union_entity I, [2024-05-08T21:57:06.813934 #334153] INFO -- : [272/885] 375547=test_io_console I, [2024-05-08T21:57:06.851801 #334153] INFO -- : [273/885] 375550=test_singleton I, [2024-05-08T21:57:06.856944 #334153] INFO -- : [274/885] 375550=test_flush I, [2024-05-08T21:57:06.859518 #334153] INFO -- : [275/885] 375550=test_switch_hitter I, [2024-05-08T21:57:06.870076 #334153] INFO -- : [276/885] 375550=newline_test I, [2024-05-08T21:57:06.877008 #334153] INFO -- : [277/885] 375540=test_uncorrectable_name_check I, [2024-05-08T21:57:06.881280 #334153] INFO -- : [278/885] 375543=test_stringchar I, [2024-05-08T21:57:06.888490 #334153] INFO -- : [279/885] 375540=test_hash_create I, [2024-05-08T21:57:06.889607 #334153] INFO -- : [280/885] 375540=test_passing_block I, [2024-05-08T21:57:06.894740 #334153] INFO -- : [281/885] 375540=test_thread_fd_close I, [2024-05-08T21:57:06.898556 #334153] INFO -- : [282/885] 375540=test_process I, [2024-05-08T21:57:06.947132 #334153] INFO -- : [283/885] 375550=test_last_thread I, [2024-05-08T21:57:06.967678 #334153] INFO -- : [284/885] 375543=test_pack I, [2024-05-08T21:57:07.183354 #334153] INFO -- : [285/885] 375543=test_gem_security_policy I, [2024-05-08T21:57:07.299252 #334153] INFO -- : [286/885] 375534=test_gem_source_local I, [2024-05-08T21:57:07.324875 #334153] INFO -- : [287/885] 375538=test_gem_ext_rake_builder I, [2024-05-08T21:57:07.356428 #334153] INFO -- : [288/885] 375544=test_arity I, [2024-05-08T21:57:07.372618 #334153] INFO -- : [289/885] 375544=test_logdevice I, [2024-05-08T21:57:07.384825 #334153] INFO -- : [290/885] 375537=test_gem_resolver_lock_specification I, [2024-05-08T21:57:07.411552 #334153] INFO -- : [291/885] 375543=test_err_in_callback I, [2024-05-08T21:57:07.414926 #334153] INFO -- : [292/885] 375543=test_x509cert I, [2024-05-08T21:57:07.416309 #334153] INFO -- : [293/885] 375537=test_gc I, [2024-05-08T21:57:07.445387 #334153] INFO -- : [294/885] 375536=test_pkey I, [2024-05-08T21:57:07.518707 #334153] INFO -- : [295/885] 375536=test_case I, [2024-05-08T21:57:07.525248 #334153] INFO -- : [296/885] 375536=test_reline I, [2024-05-08T21:57:07.532949 #334153] INFO -- : [297/885] 375546=test_parser_events I, [2024-05-08T21:57:07.575660 #334153] INFO -- : [298/885] 375534=test_cclass I, [2024-05-08T21:57:07.590485 #334153] INFO -- : [299/885] 375546=test_grapheme_breaks I, [2024-05-08T21:57:07.590943 #334153] INFO -- : [300/885] 375535=test_gem_version_option I, [2024-05-08T21:57:07.612910 #334153] INFO -- : [301/885] 375546=test_gem_request_connection_pools I, [2024-05-08T21:57:07.640902 #334153] INFO -- : [302/885] 375535=test_memory_view I, [2024-05-08T21:57:07.708846 #334153] INFO -- : [303/885] 375543=test_m17n_comb I, [2024-05-08T21:57:07.715103 #334153] INFO -- : [304/885] 375534=test_ractor I, [2024-05-08T21:57:07.761816 #334153] INFO -- : [305/885] 375536=test_ansi_with_terminfo I, [2024-05-08T21:57:07.764881 #334153] INFO -- : [306/885] 375536=test_rdoc_generator_pot_po I, [2024-05-08T21:57:07.777514 #334153] INFO -- : [307/885] 375542=test_rdoc_markup_to_markdown I, [2024-05-08T21:57:07.787044 #334153] INFO -- : [308/885] 375534=test_json_tree I, [2024-05-08T21:57:07.795527 #334153] INFO -- : [309/885] 375534=test_severity I, [2024-05-08T21:57:07.801378 #334153] INFO -- : [310/885] 375534=test_ractor I, [2024-05-08T21:57:07.802580 #334153] INFO -- : [311/885] 375535=parse_test I, [2024-05-08T21:57:07.805656 #334153] INFO -- : [312/885] 375542=test_gem_install_update_options I, [2024-05-08T21:57:07.820176 #334153] INFO -- : [313/885] 375534=test_require_lib I, [2024-05-08T21:57:07.899178 #334153] INFO -- : [314/885] 375542=test_rdoc_generator_ri I, [2024-05-08T21:57:07.910180 #334153] INFO -- : [315/885] 375542=test_extlibs I, [2024-05-08T21:57:07.922653 #334153] INFO -- : [316/885] 375536=test_gem_stream_ui I, [2024-05-08T21:57:07.974580 #334153] INFO -- : [317/885] 375538=test_literal I, [2024-05-08T21:57:08.004102 #334153] INFO -- : [318/885] 375550=test_c_struct_builder I, [2024-05-08T21:57:08.008402 #334153] INFO -- : [319/885] 375532=test_dot_dot I, [2024-05-08T21:57:08.026328 #334153] INFO -- : [320/885] 375532=test_str2big I, [2024-05-08T21:57:08.029894 #334153] INFO -- : [321/885] 375532=test_rdoc_markup_to_table_of_contents I, [2024-05-08T21:57:08.055085 #334153] INFO -- : [322/885] 375532=test_objectspace I, [2024-05-08T21:57:08.069982 #334153] INFO -- : [323/885] 375550=test_socket I, [2024-05-08T21:57:08.171418 #334153] INFO -- : [324/885] 375544=test_thread I, [2024-05-08T21:57:08.203273 #334153] INFO -- : [325/885] 375536=test_rdoc_cross_reference I, [2024-05-08T21:57:08.391551 #334153] INFO -- : [326/885] 375544=test_gem_commands_info_command I, [2024-05-08T21:57:08.423720 #334153] INFO -- : [327/885] 375544=test_gem_dependency_installer I, [2024-05-08T21:57:08.492521 #334153] INFO -- : [328/885] 375538=test_scalar I, [2024-05-08T21:57:08.503251 #334153] INFO -- : [329/885] 375538=test_case_options I, [2024-05-08T21:57:08.510976 #334153] INFO -- : [330/885] 375538=test_store I, [2024-05-08T21:57:08.636601 #334153] INFO -- : [331/885] 375536=test_exception I, [2024-05-08T21:57:08.642046 #334153] INFO -- : [332/885] 375545=test_bug_reporter I, [2024-05-08T21:57:08.649624 #334153] INFO -- : [333/885] 375546=test_gem_name_tuple I, [2024-05-08T21:57:08.660812 #334153] INFO -- : [334/885] 375546=test_gem_package_tar_reader_entry I, [2024-05-08T21:57:08.721861 #334153] INFO -- : [335/885] 375538=test_rand I, [2024-05-08T21:57:08.818901 #334153] INFO -- : [336/885] 375546=test_gem_commands_mirror I, [2024-05-08T21:57:08.827840 #334153] INFO -- : [337/885] 375546=test_gem_ext_cargo_builder_link_flag_converter I, [2024-05-08T21:57:08.869215 #334153] INFO -- : [338/885] 375546=test_gem_request I, [2024-05-08T21:57:08.977011 #334153] INFO -- : [339/885] 375532=test_method_cache I, [2024-05-08T21:57:08.981420 #334153] INFO -- : [340/885] 375532=test_sprintf_comb I, [2024-05-08T21:57:09.007481 #334153] INFO -- : [341/885] 375538=test_generic I, [2024-05-08T21:57:09.027438 #334153] INFO -- : [342/885] 375546=test_win32ole I, [2024-05-08T21:57:09.029449 #334153] INFO -- : [343/885] 375538=test_scan_args I, [2024-05-08T21:57:09.034341 #334153] INFO -- : [344/885] 375546=test_enumerator_kw I, [2024-05-08T21:57:09.036457 #334153] INFO -- : [345/885] 375546=test_settracefunc I, [2024-05-08T21:57:09.041397 #334153] INFO -- : [346/885] 375538=test_gem_text I, [2024-05-08T21:57:09.065836 #334153] INFO -- : [347/885] 375539=test_mul I, [2024-05-08T21:57:09.071689 #334153] INFO -- : [348/885] 375545=test_win32ole_type I, [2024-05-08T21:57:09.075485 #334153] INFO -- : [349/885] 375545=test_null I, [2024-05-08T21:57:09.077335 #334153] INFO -- : [350/885] 375539=test_default_gems I, [2024-05-08T21:57:09.078200 #334153] INFO -- : [351/885] 375545=test_rdoc_rd_inline_parser I, [2024-05-08T21:57:09.102940 #334153] INFO -- : [352/885] 375538=test_rdoc_markup_to_rdoc I, [2024-05-08T21:57:09.106587 #334153] INFO -- : [353/885] 375545=test_rdoc_markup_attributes I, [2024-05-08T21:57:09.109932 #334153] INFO -- : [354/885] 375545=test_date_parse I, [2024-05-08T21:57:09.110537 #334153] INFO -- : [355/885] 375532=test_pipe I, [2024-05-08T21:57:09.122410 #334153] INFO -- : [356/885] 375539=test_trick I, [2024-05-08T21:57:09.145669 #334153] INFO -- : [357/885] 375538=test_thread I, [2024-05-08T21:57:09.153763 #334153] INFO -- : [358/885] 375538=test_pkey_ec I, [2024-05-08T21:57:09.162446 #334153] INFO -- : [359/885] 375543=test_defined I, [2024-05-08T21:57:09.224845 #334153] INFO -- : [360/885] 375545=test_backtrace I, [2024-05-08T21:57:09.226373 #334153] INFO -- : [361/885] 375545=test_key_name_check I, [2024-05-08T21:57:09.236714 #334153] INFO -- : [362/885] 375545=test_io_buffer I, [2024-05-08T21:57:09.237325 #334153] INFO -- : [363/885] 375532=test_rdoc_i18n_text I, [2024-05-08T21:57:09.241505 #334153] INFO -- : [364/885] 375532=test_windows_1251 I, [2024-05-08T21:57:09.241850 #334153] INFO -- : [365/885] 375538=test_time I, [2024-05-08T21:57:09.246383 #334153] INFO -- : [366/885] 375543=test_rdoc_rdoc I, [2024-05-08T21:57:09.251173 #334153] INFO -- : [367/885] 375532=test_gem_uninstaller I, [2024-05-08T21:57:09.273864 #334153] INFO -- : [368/885] 375545=test_gb18030 I, [2024-05-08T21:57:09.279880 #334153] INFO -- : [369/885] 375545=test_svcb_https I, [2024-05-08T21:57:09.300096 #334153] INFO -- : [370/885] 375545=test_buffering I, [2024-05-08T21:57:09.302530 #334153] INFO -- : [371/885] 375545=test_egrep_cpp I, [2024-05-08T21:57:09.309548 #334153] INFO -- : [372/885] 375550=test_cgi_tag_helper I, [2024-05-08T21:57:09.326222 #334153] INFO -- : [373/885] 375538=test_zlib I, [2024-05-08T21:57:09.327107 #334153] INFO -- : [374/885] 375550=test_optimization I, [2024-05-08T21:57:09.402460 #334153] INFO -- : [375/885] 375548=test_date_conv I, [2024-05-08T21:57:09.404087 #334153] INFO -- : [376/885] 375543=test_erb_m17n I, [2024-05-08T21:57:09.408774 #334153] INFO -- : [377/885] 375548=test_ole_methods I, [2024-05-08T21:57:09.409561 #334153] INFO -- : [378/885] 375547=test_proc I, [2024-05-08T21:57:09.411651 #334153] INFO -- : [379/885] 375548=test_string I, [2024-05-08T21:57:09.414866 #334153] INFO -- : [380/885] 375543=test_gc_compact I, [2024-05-08T21:57:09.428864 #334153] INFO -- : [381/885] 375545=test_gem_package_old I, [2024-05-08T21:57:09.465067 #334153] INFO -- : [382/885] 375545=test_gem_resolver_index_set I, [2024-05-08T21:57:09.501490 #334153] INFO -- : [383/885] 375545=test_gem_validator I, [2024-05-08T21:57:09.551200 #334153] INFO -- : [384/885] 375545=test_folderitem2_invokeverb I, [2024-05-08T21:57:09.556530 #334153] INFO -- : [385/885] 375545=test_require_path_check I, [2024-05-08T21:57:09.654048 #334153] INFO -- : [386/885] 375545=test_rdoc_markup_parser I, [2024-05-08T21:57:09.719732 #334153] INFO -- : [387/885] 375545=test_files_test_2 I, [2024-05-08T21:57:09.796367 #334153] INFO -- : [388/885] 375542=test_fnmatch I, [2024-05-08T21:57:09.830734 #334153] INFO -- : [389/885] 375542=test_pattern_matching I, [2024-05-08T21:57:09.886092 #334153] INFO -- : [390/885] 375542=test_rdoc_stats I, [2024-05-08T21:57:10.002542 #334153] INFO -- : [391/885] 375542=test_string I, [2024-05-08T21:57:10.027961 #334153] INFO -- : [392/885] 375542=test_rdoc_store I, [2024-05-08T21:57:10.052714 #334153] INFO -- : [393/885] 375531=test_raise I, [2024-05-08T21:57:10.054980 #334153] INFO -- : [394/885] 375531=test_x509attr I, [2024-05-08T21:57:10.068994 #334153] INFO -- : [395/885] 375531=test_gem_request_set_lockfile_parser I, [2024-05-08T21:57:10.105313 #334153] INFO -- : [396/885] 375546=test_depth_first I, [2024-05-08T21:57:10.108499 #334153] INFO -- : [397/885] 375546=json_addition_test I, [2024-05-08T21:57:10.149814 #334153] INFO -- : [398/885] 375546=test_custom_command I, [2024-05-08T21:57:10.150381 #334153] INFO -- : [399/885] 375546=test_rdoc_parser I, [2024-05-08T21:57:10.154765 #334153] INFO -- : [400/885] 375531=test_qsort I, [2024-05-08T21:57:10.157847 #334153] INFO -- : [401/885] 375531=test_gem_dependency_resolution_error I, [2024-05-08T21:57:10.163966 #334153] INFO -- : [402/885] 375531=test_rdoc_markup_to_tt_only I, [2024-05-08T21:57:10.165077 #334153] INFO -- : [403/885] 375546=test_hmac I, [2024-05-08T21:57:10.200609 #334153] INFO -- : [404/885] 375531=test_rdoc_tom_doc I, [2024-05-08T21:57:10.201441 #334153] INFO -- : [405/885] 375546=test_numeric I, [2024-05-08T21:57:10.214255 #334153] INFO -- : [406/885] 375531=test_gem_commands_lock_command I, [2024-05-08T21:57:10.245745 #334153] INFO -- : [407/885] 375531=test_ifunless I, [2024-05-08T21:57:10.247291 #334153] INFO -- : [408/885] 375531=test_assignment I, [2024-05-08T21:57:10.271712 #334153] INFO -- : [409/885] 375546=test_key_actor_vi I, [2024-05-08T21:57:10.278681 #334153] INFO -- : [410/885] 375547=test_bug-3571 I, [2024-05-08T21:57:10.298122 #334153] INFO -- : [411/885] 375547=test_gem_command I, [2024-05-08T21:57:10.340327 #334153] INFO -- : [412/885] 375532=test_gem_spec_fetcher I, [2024-05-08T21:57:10.381046 #334153] INFO -- : [413/885] 375547=test_common I, [2024-05-08T21:57:10.406692 #334153] INFO -- : [414/885] 375546=test_rdoc_token_stream I, [2024-05-08T21:57:10.421778 #334153] INFO -- : [415/885] 375546=test_address_resolve I, [2024-05-08T21:57:10.486802 #334153] INFO -- : [416/885] 375532=test_gem_source_list I, [2024-05-08T21:57:10.489620 #334153] INFO -- : [417/885] 375546=test_yaml_special_cases I, [2024-05-08T21:57:10.501647 #334153] INFO -- : [418/885] 375546=test_optarg I, [2024-05-08T21:57:10.551008 #334153] INFO -- : [419/885] 375532=test_config I, [2024-05-08T21:57:10.552598 #334153] INFO -- : [420/885] 375535=test_num2int I, [2024-05-08T21:57:10.567768 #334153] INFO -- : [421/885] 375535=test_nil I, [2024-05-08T21:57:10.571905 #334153] INFO -- : [422/885] 375535=test_rdoc_single_class I, [2024-05-08T21:57:10.587880 #334153] INFO -- : [423/885] 375535=test_verbose I, [2024-05-08T21:57:10.602984 #334153] INFO -- : [424/885] 375535=test_pp I, [2024-05-08T21:57:10.619855 #334153] INFO -- : [425/885] 375542=test_gem_ext_configure_builder I, [2024-05-08T21:57:10.646192 #334153] INFO -- : [426/885] 375532=test_frozen I, [2024-05-08T21:57:10.648291 #334153] INFO -- : [427/885] 375532=test_macro I, [2024-05-08T21:57:10.651933 #334153] INFO -- : [428/885] 375532=test_iter_break I, [2024-05-08T21:57:10.657906 #334153] INFO -- : [429/885] 375532=test_exception I, [2024-05-08T21:57:10.660090 #334153] INFO -- : [430/885] 375547=test_zsh_completion I, [2024-05-08T21:57:10.662221 #334153] INFO -- : [431/885] 375547=test_bug-5832 I, [2024-05-08T21:57:10.663129 #334153] INFO -- : [432/885] 375532=test_files_ext I, [2024-05-08T21:57:10.664982 #334153] INFO -- : [433/885] 375547=test_emitter I, [2024-05-08T21:57:10.666846 #334153] INFO -- : [434/885] 375546=test_gem_silent_ui I, [2024-05-08T21:57:10.676058 #334153] INFO -- : [435/885] 375547=test_kdf I, [2024-05-08T21:57:10.688900 #334153] INFO -- : [436/885] 375535=test_gem_doctor I, [2024-05-08T21:57:10.707898 #334153] INFO -- : [437/885] 375542=test_kernel I, [2024-05-08T21:57:10.715328 #334153] INFO -- : [438/885] 375546=dispatcher_test I, [2024-05-08T21:57:10.715391 #334153] INFO -- : [439/885] 375544=test_eval_history I, [2024-05-08T21:57:10.716540 #334153] INFO -- : [440/885] 375536=!Nothing_to_test I, [2024-05-08T21:57:10.720208 #334153] INFO -- : [441/885] 375536=test_psych I, [2024-05-08T21:57:10.731489 #334153] INFO -- : [442/885] 375535=test_enc_raise I, [2024-05-08T21:57:10.743137 #334153] INFO -- : [443/885] 375547=test_rdoc_markup_paragraph I, [2024-05-08T21:57:10.750295 #334153] INFO -- : [444/885] 375535=test_object_create_start I, [2024-05-08T21:57:10.753529 #334153] INFO -- : [445/885] 375535=test_date I, [2024-05-08T21:57:10.761305 #334153] INFO -- : [446/885] 375535=test_gem_rdoc I, [2024-05-08T21:57:10.775041 #334153] INFO -- : [447/885] 375536=test_gem_ext_cargo_builder_unit I, [2024-05-08T21:57:10.777426 #334153] INFO -- : [448/885] 375532=test_command I, [2024-05-08T21:57:10.805409 #334153] INFO -- : [449/885] 375546=test_at_exit I, [2024-05-08T21:57:10.807006 #334153] INFO -- : [450/885] 375536=test_object I, [2024-05-08T21:57:10.817897 #334153] INFO -- : [451/885] 375536=heredoc_dedent_test I, [2024-05-08T21:57:10.850786 #334153] INFO -- : [452/885] 375544=test_cgi_header I, [2024-05-08T21:57:10.854376 #334153] INFO -- : [453/885] 375546=version_test I, [2024-05-08T21:57:10.858691 #334153] INFO -- : [454/885] 375546=test_gem_command_manager I, [2024-05-08T21:57:10.882591 #334153] INFO -- : [455/885] 375544=test_gem_gemcutter_utilities I, [2024-05-08T21:57:10.897360 #334153] INFO -- : [456/885] 375536=test_basicinstructions I, [2024-05-08T21:57:10.903338 #334153] INFO -- : [457/885] 375535=test_key_actor_emacs I, [2024-05-08T21:57:10.903400 #334153] INFO -- : [458/885] 375547=test_arithmetic_sequence I, [2024-05-08T21:57:10.916380 #334153] INFO -- : [459/885] 375547=test_normalize I, [2024-05-08T21:57:10.921832 #334153] INFO -- : [460/885] 375547=test_ossl I, [2024-05-08T21:57:10.989922 #334153] INFO -- : [461/885] 375536=test_timeout I, [2024-05-08T21:57:10.998014 #334153] INFO -- : [462/885] 375536=compiler_test I, [2024-05-08T21:57:11.008038 #334153] INFO -- : [463/885] 375536=test_flip I, [2024-05-08T21:57:11.016837 #334153] INFO -- : [464/885] 375546=test_change_word I, [2024-05-08T21:57:11.030888 #334153] INFO -- : [465/885] 375546=test_sleep I, [2024-05-08T21:57:11.032389 #334153] INFO -- : [466/885] 375536=test_gem_local_remote_options I, [2024-05-08T21:57:11.065700 #334153] INFO -- : [467/885] 375536=test_object I, [2024-05-08T21:57:11.083798 #334153] INFO -- : [468/885] 375535=test_ruby_lex I, [2024-05-08T21:57:11.106516 #334153] INFO -- : [469/885] 375532=test_date_arith I, [2024-05-08T21:57:11.111782 #334153] INFO -- : [470/885] 375532=test_big5 I, [2024-05-08T21:57:11.127891 #334153] INFO -- : [471/885] 375532=test_func I, [2024-05-08T21:57:11.234604 #334153] INFO -- : [472/885] 375542=test_pointer I, [2024-05-08T21:57:11.239207 #334153] INFO -- : [473/885] 375544=test_type I, [2024-05-08T21:57:11.252427 #334153] INFO -- : [474/885] 375544=test_ractor I, [2024-05-08T21:57:11.263830 #334153] INFO -- : [475/885] 375535=test_tsort I, [2024-05-08T21:57:11.273925 #334153] INFO -- : [476/885] 375535=test_signedness I, [2024-05-08T21:57:11.317351 #334153] INFO -- : [477/885] 375544=test_rdoc_rd_block_parser I, [2024-05-08T21:57:11.413034 #334153] INFO -- : [478/885] 375534=test_numhash I, [2024-05-08T21:57:11.425212 #334153] INFO -- : [479/885] 375534=test_weakkeymap I, [2024-05-08T21:57:11.494185 #334153] INFO -- : [480/885] 375544=test_gem_commands_push_command I, [2024-05-08T21:57:11.512255 #334153] INFO -- : [481/885] 375536=test_pkey_rsa I, [2024-05-08T21:57:11.605766 #334153] INFO -- : [482/885] 375549=test_gem_platform I, [2024-05-08T21:57:11.634148 #334153] INFO -- : [483/885] 375542=test_rdoc_markup_hard_break I, [2024-05-08T21:57:11.636288 #334153] INFO -- : [484/885] 375542=test_placearg I, [2024-05-08T21:57:11.647734 #334153] INFO -- : [485/885] 375539=test_date_strptime I, [2024-05-08T21:57:11.695591 #334153] INFO -- : [486/885] 375542=test_gem_package_task I, [2024-05-08T21:57:11.697398 #334153] INFO -- : [487/885] 375542=test_win32ole_method I, [2024-05-08T21:57:11.699748 #334153] INFO -- : [488/885] 375549=test_delete I, [2024-05-08T21:57:11.700383 #334153] INFO -- : [489/885] 375542=test_keyword I, [2024-05-08T21:57:11.704984 #334153] INFO -- : [490/885] 375549=test_class_name_check I, [2024-05-08T21:57:11.707511 #334153] INFO -- : [491/885] 375534=test_continuation I, [2024-05-08T21:57:11.713015 #334153] INFO -- : [492/885] 375534=test_fd_setsize I, [2024-05-08T21:57:11.717329 #334153] INFO -- : [493/885] 375534=test_files_test I, [2024-05-08T21:57:11.729550 #334153] INFO -- : [494/885] 375549=test_gem_update_suggestion I, [2024-05-08T21:57:11.742032 #334153] INFO -- : [495/885] 375539=test_file_exhaustive I, [2024-05-08T21:57:11.767253 #334153] INFO -- : [496/885] 375536=test_logger I, [2024-05-08T21:57:11.793408 #334153] INFO -- : [497/885] 375549=test_not I, [2024-05-08T21:57:11.797081 #334153] INFO -- : [498/885] 375549=test_gem_resolver_lock_set I, [2024-05-08T21:57:11.803385 #334153] INFO -- : [499/885] 375536=test_import I, [2024-05-08T21:57:11.820629 #334153] INFO -- : [500/885] 375549=test_rdoc_parser_markdown I, [2024-05-08T21:57:11.824393 #334153] INFO -- : [501/885] 375534=test_enumerable I, [2024-05-08T21:57:11.830292 #334153] INFO -- : [502/885] 375534=test_gem_resolver_vendor_set I, [2024-05-08T21:57:11.857527 #334153] INFO -- : [503/885] 375534=test_config I, [2024-05-08T21:57:11.961592 #334153] INFO -- : [504/885] 375531=test_gem_resolver_api_set I, [2024-05-08T21:57:11.975661 #334153] INFO -- : [505/885] 375549=test_gem_safe_marshal I, [2024-05-08T21:57:12.008591 #334153] INFO -- : [506/885] 375531=test_transcode I, [2024-05-08T21:57:12.056302 #334153] INFO -- : [507/885] 375544=json_generator_test I, [2024-05-08T21:57:12.151851 #334153] INFO -- : [508/885] 375544=test_eval I, [2024-05-08T21:57:12.296580 #334153] INFO -- : [509/885] 375531=test_x509store I, [2024-05-08T21:57:12.336406 #334153] INFO -- : [510/885] 375534=test_rdoc_code_object I, [2024-05-08T21:57:12.361108 #334153] INFO -- : [511/885] 375542=test_x509name I, [2024-05-08T21:57:12.379367 #334153] INFO -- : [512/885] 375542=test_fips I, [2024-05-08T21:57:12.394223 #334153] INFO -- : [513/885] 375544=test_update I, [2024-05-08T21:57:12.416495 #334153] INFO -- : [514/885] 375543=test_jaro_winkler I, [2024-05-08T21:57:12.416779 #334153] INFO -- : [515/885] 375544=test_helper I, [2024-05-08T21:57:12.425726 #334153] INFO -- : [516/885] 375543=test_random_formatter I, [2024-05-08T21:57:12.441207 #334153] INFO -- : [517/885] 375538=test_lambda I, [2024-05-08T21:57:12.449469 #334153] INFO -- : [518/885] 375543=test_ast I, [2024-05-08T21:57:12.499576 #334153] INFO -- : [519/885] 375544=test_gem_request_set_gem_dependency_api I, [2024-05-08T21:57:12.509251 #334153] INFO -- : [520/885] 375538=test_webauthn_listener I, [2024-05-08T21:57:12.510514 #334153] INFO -- : [521/885] 375536=test_regexp I, [2024-05-08T21:57:12.551112 #334153] INFO -- : [522/885] 375531=test_gem_commands_check_command I, [2024-05-08T21:57:12.571280 #334153] INFO -- : [523/885] 375531=errors_test I, [2024-05-08T21:57:12.575794 #334153] INFO -- : [524/885] 375538=test_tmpdir I, [2024-05-08T21:57:12.653275 #334153] INFO -- : [525/885] 375534=test_rdoc_markup_document I, [2024-05-08T21:57:12.662913 #334153] INFO -- : [526/885] 375531=test_integer_comb I, [2024-05-08T21:57:12.664931 #334153] INFO -- : [527/885] 375534=test_vm_dump I, [2024-05-08T21:57:12.665597 #334153] INFO -- : [528/885] 375534=test_udp I, [2024-05-08T21:57:12.677180 #334153] INFO -- : [529/885] 375538=test_force_exit I, [2024-05-08T21:57:12.683119 #334153] INFO -- : [530/885] 375542=test_file I, [2024-05-08T21:57:12.687002 #334153] INFO -- : [531/885] 375538=test_ostruct I, [2024-05-08T21:57:12.695236 #334153] INFO -- : [532/885] 375534=unescape_test I, [2024-05-08T21:57:12.717418 #334153] INFO -- : [533/885] 375549=bom_test I, [2024-05-08T21:57:12.753344 #334153] INFO -- : [534/885] 375544=test_data_error I, [2024-05-08T21:57:12.822462 #334153] INFO -- : [535/885] 375549=static_inspect_test I, [2024-05-08T21:57:12.824856 #334153] INFO -- : [536/885] 375538=test_encoding I, [2024-05-08T21:57:12.831522 #334153] INFO -- : [537/885] 375549=test_erb_command I, [2024-05-08T21:57:12.831928 #334153] INFO -- : [538/885] 375544=test_helper I, [2024-05-08T21:57:12.832829 #334153] INFO -- : [539/885] 375544=test_gem_uri_formatter I, [2024-05-08T21:57:12.849453 #334153] INFO -- : [540/885] 375544=command_line_test I, [2024-05-08T21:57:12.855166 #334153] INFO -- : [541/885] 375544=test_pty I, [2024-05-08T21:57:12.877382 #334153] INFO -- : [542/885] 375549=test_dup I, [2024-05-08T21:57:13.043658 #334153] INFO -- : [543/885] 375538=test_constant I, [2024-05-08T21:57:13.055712 #334153] INFO -- : [544/885] 375549=test_project_sanity I, [2024-05-08T21:57:13.097083 #334153] INFO -- : [545/885] 375533=test_range I, [2024-05-08T21:57:13.102906 #334153] INFO -- : [546/885] 375549=test_rdoc_ri_paths I, [2024-05-08T21:57:13.122752 #334153] INFO -- : [547/885] 375549=test_addr I, [2024-05-08T21:57:13.148573 #334153] INFO -- : [548/885] 375549=test_locale I, [2024-05-08T21:57:13.274835 #334153] INFO -- : [549/885] 375549=library_symbols_test I, [2024-05-08T21:57:13.299081 #334153] INFO -- : [550/885] 375549=test_ensured I, [2024-05-08T21:57:13.319976 #334153] INFO -- : [551/885] 375544=test_ts I, [2024-05-08T21:57:13.350721 #334153] INFO -- : [552/885] 375549=test_parser I, [2024-05-08T21:57:13.373322 #334153] INFO -- : [553/885] 375549=test_cgi_core I, [2024-05-08T21:57:13.375251 #334153] INFO -- : [554/885] 375532=test_dns I, [2024-05-08T21:57:13.385996 #334153] INFO -- : [555/885] 375549=test_gem_commands_open_command I, [2024-05-08T21:57:13.510842 #334153] INFO -- : [556/885] 375549=test_ractor I, [2024-05-08T21:57:13.531587 #334153] INFO -- : [557/885] 375549=test_gem I, [2024-05-08T21:57:13.570978 #334153] INFO -- : [558/885] 375535=test_gem_source_lock I, [2024-05-08T21:57:13.614359 #334153] INFO -- : [559/885] 375535=test_registry I, [2024-05-08T21:57:13.617821 #334153] INFO -- : [560/885] 375535=parse_stream_test I, [2024-05-08T21:57:13.623966 #334153] INFO -- : [561/885] 375535=test_ractor I, [2024-05-08T21:57:13.722472 #334153] INFO -- : [562/885] 375544=test_rendering I, [2024-05-08T21:57:13.731396 #334153] INFO -- : [563/885] 375544=test_debugger_integration I, [2024-05-08T21:57:13.738911 #334153] INFO -- : [564/885] 375544=test_thread I, [2024-05-08T21:57:13.764623 #334153] INFO -- : [565/885] 375533=json_ext_parser_test I, [2024-05-08T21:57:13.767794 #334153] INFO -- : [566/885] 375533=test_my_integer I, [2024-05-08T21:57:13.773594 #334153] INFO -- : [567/885] 375533=test_ssl I, [2024-05-08T21:57:13.817004 #334153] INFO -- : [568/885] 375545=test_singleton_function I, [2024-05-08T21:57:13.819364 #334153] INFO -- : [569/885] 375545=test_ancdata I, [2024-05-08T21:57:13.825987 #334153] INFO -- : [570/885] 375545=test_reline_key I, [2024-05-08T21:57:13.830683 #334153] INFO -- : [571/885] 375532=test_rb_str_dup I, [2024-05-08T21:57:13.833508 #334153] INFO -- : [572/885] 375532=test_weakref I, [2024-05-08T21:57:13.853993 #334153] INFO -- : [573/885] 375541=test_nonblock I, [2024-05-08T21:57:13.863935 #334153] INFO -- : [574/885] 375541=test_unicode_normalize I, [2024-05-08T21:57:13.879012 #334153] INFO -- : [575/885] 375545=test_marshal I, [2024-05-08T21:57:13.948649 #334153] INFO -- : [576/885] 375532=test_timeout I, [2024-05-08T21:57:13.977001 #334153] INFO -- : [577/885] 375535=test_alias I, [2024-05-08T21:57:14.131024 #334153] INFO -- : [578/885] 375535=test_rubygems I, [2024-05-08T21:57:14.202203 #334153] INFO -- : [579/885] 375533=test_https_proxy I, [2024-05-08T21:57:14.210067 #334153] INFO -- : [580/885] 375533=test_call I, [2024-05-08T21:57:14.285580 #334153] INFO -- : [581/885] 375535=test_integer I, [2024-05-08T21:57:14.344310 #334153] INFO -- : [582/885] 375533=test_cgi_modruby I, [2024-05-08T21:57:14.354274 #334153] INFO -- : [583/885] 375533=test_rubyoptions I, [2024-05-08T21:57:14.389377 #334153] INFO -- : [584/885] 375537=test_super I, [2024-05-08T21:57:14.395994 #334153] INFO -- : [585/885] 375545=test_gem_resolver_git_specification I, [2024-05-08T21:57:14.591667 #334153] INFO -- : [586/885] 375545=test_usrmarshal I, [2024-05-08T21:57:14.672372 #334153] INFO -- : [587/885] 375534=test_object_references I, [2024-05-08T21:57:14.680748 #334153] INFO -- : [588/885] 375534=test_capacity I, [2024-05-08T21:57:14.684094 #334153] INFO -- : [589/885] 375534=test_nextafter I, [2024-05-08T21:57:14.728543 #334153] INFO -- : [590/885] 375545=test_have_func I, [2024-05-08T21:57:14.772893 #334153] INFO -- : [591/885] 375534=test_gem_request_set_lockfile_tokenizer I, [2024-05-08T21:57:14.773984 #334153] INFO -- : [592/885] 375531=test_stat I, [2024-05-08T21:57:14.776418 #334153] INFO -- : [593/885] 375531=desugar_compiler_test I, [2024-05-08T21:57:14.783928 #334153] INFO -- : [594/885] 375531=test_integer I, [2024-05-08T21:57:14.834320 #334153] INFO -- : [595/885] 375531=test_dryrun I, [2024-05-08T21:57:14.837424 #334153] INFO -- : [596/885] 375534=test_rdoc_attr I, [2024-05-08T21:57:14.846903 #334153] INFO -- : [597/885] 375534=test_env I, [2024-05-08T21:57:14.856315 #334153] INFO -- : [598/885] 375531=test_gem_commands_setup_command I, [2024-05-08T21:57:14.887911 #334153] INFO -- : [599/885] 375532=test_gem_commands_cleanup_command I, [2024-05-08T21:57:14.980322 #334153] INFO -- : [600/885] 375537=test_word I, [2024-05-08T21:57:14.984818 #334153] INFO -- : [601/885] 375537=test_cgi_multipart I, [2024-05-08T21:57:15.142108 #334153] INFO -- : [602/885] 375537=test_member I, [2024-05-08T21:57:15.155278 #334153] INFO -- : [603/885] 375537=test_numeric I, [2024-05-08T21:57:15.158169 #334153] INFO -- : [604/885] 375537=test_autoconf I, [2024-05-08T21:57:15.165909 #334153] INFO -- : [605/885] 375537=test_eval I, [2024-05-08T21:57:15.168373 #334153] INFO -- : [606/885] 375537=test_gem_console_ui I, [2024-05-08T21:57:15.185714 #334153] INFO -- : [607/885] 375537=test_date_ractor I, [2024-05-08T21:57:15.227406 #334153] INFO -- : [608/885] 375531=test_dir I, [2024-05-08T21:57:15.316644 #334153] INFO -- : [609/885] 375538=format_errors_test I, [2024-05-08T21:57:15.345508 #334153] INFO -- : [610/885] 375532=test_ractor_compatibility I, [2024-05-08T21:57:15.365159 #334153] INFO -- : [611/885] 375549=test_mailto I, [2024-05-08T21:57:15.365825 #334153] INFO -- : [612/885] 375538=test_symbol I, [2024-05-08T21:57:15.389799 #334153] INFO -- : [613/885] 375549=location_test I, [2024-05-08T21:57:15.391390 #334153] INFO -- : [614/885] 375538=test_coderange I, [2024-05-08T21:57:15.400526 #334153] INFO -- : [615/885] 375538=json_generic_object_test I, [2024-05-08T21:57:15.408560 #334153] INFO -- : [616/885] 375538=test_gem_source_fetch_problem I, [2024-05-08T21:57:15.420343 #334153] INFO -- : [617/885] 375538=test_http_request I, [2024-05-08T21:57:15.439917 #334153] INFO -- : [618/885] 375549=test_error_highlight I, [2024-05-08T21:57:15.455491 #334153] INFO -- : [619/885] 375531=test_resize I, [2024-05-08T21:57:15.458213 #334153] INFO -- : [620/885] 375537=test_rdoc_comment I, [2024-05-08T21:57:15.461721 #334153] INFO -- : [621/885] 375531=test_rdoc_generator_darkfish I, [2024-05-08T21:57:15.469988 #334153] INFO -- : [622/885] 375538=test_function_entry I, [2024-05-08T21:57:15.473803 #334153] INFO -- : [623/885] 375538=test_arith_seq_beg_len_step I, [2024-05-08T21:57:15.518971 #334153] INFO -- : [624/885] 375537=test_gem_resolver_requirement_list I, [2024-05-08T21:57:15.527169 #334153] INFO -- : [625/885] 375537=test_pkcs7 I, [2024-05-08T21:57:15.553882 #334153] INFO -- : [626/885] 375538=test_enc_associate I, [2024-05-08T21:57:15.725863 #334153] INFO -- : [627/885] 375537=test_lazy_enumerator I, [2024-05-08T21:57:15.797639 #334153] INFO -- : [628/885] 375532=test_unix I, [2024-05-08T21:57:15.830084 #334153] INFO -- : [629/885] 375531=test_nofree I, [2024-05-08T21:57:15.837922 #334153] INFO -- : [630/885] 375531=test_gem_commands_pristine_command I, [2024-05-08T21:57:15.843734 #334153] INFO -- : [631/885] 375532=test_context I, [2024-05-08T21:57:15.871077 #334153] INFO -- : [632/885] 375549=test_symbol I, [2024-05-08T21:57:15.942703 #334153] INFO -- : [633/885] 375545=test_coder I, [2024-05-08T21:57:15.948337 #334153] INFO -- : [634/885] 375532=test_find_executable I, [2024-05-08T21:57:15.956063 #334153] INFO -- : [635/885] 375545=ruby_api_test I, [2024-05-08T21:57:15.984884 #334153] INFO -- : [636/885] 375532=test_time_tz I, [2024-05-08T21:57:16.041110 #334153] INFO -- : [637/885] 375546=test_win32ole_event I, [2024-05-08T21:57:16.044444 #334153] INFO -- : [638/885] 375546=test_rdoc_generator_json_index I, [2024-05-08T21:57:16.087069 #334153] INFO -- : [639/885] 375546=test_trace I, [2024-05-08T21:57:16.098054 #334153] INFO -- : [640/885] 375546=ractor_test I, [2024-05-08T21:57:16.102843 #334153] INFO -- : [641/885] 375538=test_io_wait_uncommon I, [2024-05-08T21:57:16.106764 #334153] INFO -- : [642/885] 375532=test_stringio I, [2024-05-08T21:57:16.110726 #334153] INFO -- : [643/885] 375538=test_arity I, [2024-05-08T21:57:16.112341 #334153] INFO -- : [644/885] 375538=test_win32ole_variable I, [2024-05-08T21:57:16.117826 #334153] INFO -- : [645/885] 375538=test_gem_ci_detector I, [2024-05-08T21:57:16.129568 #334153] INFO -- : [646/885] 375538=test_rdoc_class_module I, [2024-05-08T21:57:16.137421 #334153] INFO -- : [647/885] 375537=test_bignum I, [2024-05-08T21:57:16.155060 #334153] INFO -- : [648/885] 375545=test_threadgroup I, [2024-05-08T21:57:16.192208 #334153] INFO -- : [649/885] 375546=test_enum I, [2024-05-08T21:57:16.263373 #334153] INFO -- : [650/885] 375537=test_gem_specification I, [2024-05-08T21:57:16.274133 #334153] INFO -- : [651/885] 375532=test_gem_package I, [2024-05-08T21:57:16.835981 #334153] INFO -- : [652/885] 375538=test_complex2 I, [2024-05-08T21:57:16.843983 #334153] INFO -- : [653/885] 375532=test_resolve_symbol I, [2024-05-08T21:57:16.848791 #334153] INFO -- : [654/885] 375538=test_have_macro I, [2024-05-08T21:57:16.900677 #334153] INFO -- : [655/885] 375532=test_merge_keys I, [2024-05-08T21:57:16.910709 #334153] INFO -- : [656/885] 375532=test_rdoc_extend I, [2024-05-08T21:57:16.953878 #334153] INFO -- : [657/885] 375532=test_rdoc_markup_to_ansi I, [2024-05-08T21:57:16.994499 #334153] INFO -- : [658/885] 375532=test_mixed_unicode_escapes I, [2024-05-08T21:57:16.995270 #334153] INFO -- : [659/885] 375532=test_history I, [2024-05-08T21:57:17.006617 #334153] INFO -- : [660/885] 375532=test_ipaddr I, [2024-05-08T21:57:17.017687 #334153] INFO -- : [661/885] 375532=test_win32ole_variant I, [2024-05-08T21:57:17.022125 #334153] INFO -- : [662/885] 375532=test_gem_resolver_api_specification I, [2024-05-08T21:57:17.059753 #334153] INFO -- : [663/885] 375532=test_benchmark I, [2024-05-08T21:57:17.136711 #334153] INFO -- : [664/885] 375539=test_gem_dependency_list I, [2024-05-08T21:57:17.154428 #334153] INFO -- : [665/885] 375535=test_nesting_parser I, [2024-05-08T21:57:17.158731 #334153] INFO -- : [666/885] 375545=test_win32ole_method_event I, [2024-05-08T21:57:17.162972 #334153] INFO -- : [667/885] 375531=test_scalar_scanner I, [2024-05-08T21:57:17.168315 #334153] INFO -- : [668/885] 375535=test_gem_source I, [2024-05-08T21:57:17.172154 #334153] INFO -- : [669/885] 375531=test_gem_package_tar_writer I, [2024-05-08T21:57:17.177605 #334153] INFO -- : [670/885] 375546=test_helper_method I, [2024-05-08T21:57:17.183985 #334153] INFO -- : [671/885] 375545=test_array I, [2024-05-08T21:57:17.184796 #334153] INFO -- : [672/885] 375539=test_gem_commands_outdated_command I, [2024-05-08T21:57:17.188457 #334153] INFO -- : [673/885] 375546=test_provider I, [2024-05-08T21:57:17.210931 #334153] INFO -- : [674/885] 375538=test_abi I, [2024-05-08T21:57:17.242462 #334153] INFO -- : [675/885] 375539=test_gem_commands_rebuild_command I, [2024-05-08T21:57:17.262045 #334153] INFO -- : [676/885] 375531=test_yamldbm I, [2024-05-08T21:57:17.267442 #334153] INFO -- : [677/885] 375531=test_load I, [2024-05-08T21:57:17.270918 #334153] INFO -- : [678/885] 375531=test_rdoc_parser_simple I, [2024-05-08T21:57:17.282728 #334153] INFO -- : [679/885] 375550=test_gem_ext_builder I, [2024-05-08T21:57:17.285088 #334153] INFO -- : [680/885] 375531=test_https I, [2024-05-08T21:57:17.290843 #334153] INFO -- : [681/885] 375539=test_evaluation I, [2024-05-08T21:57:17.299712 #334153] INFO -- : [682/885] 375539=test_gem_source_installed I, [2024-05-08T21:57:17.311400 #334153] INFO -- : [683/885] 375539=test_x509ext I, [2024-05-08T21:57:17.314861 #334153] INFO -- : [684/885] 375539=test_erb I, [2024-05-08T21:57:17.371069 #334153] INFO -- : [685/885] 375539=test_yield_block I, [2024-05-08T21:57:17.373491 #334153] INFO -- : [686/885] 375539=test_len I, [2024-05-08T21:57:17.375825 #334153] INFO -- : [687/885] 375539=test_completion I, [2024-05-08T21:57:17.403520 #334153] INFO -- : [688/885] 375538=test_gem_commands_cert_command I, [2024-05-08T21:57:17.460711 #334153] INFO -- : [689/885] 375535=test_rational I, [2024-05-08T21:57:17.485097 #334153] INFO -- : [690/885] 375535=test_rational2 I, [2024-05-08T21:57:17.494817 #334153] INFO -- : [691/885] 375535=test_spell_checker I, [2024-05-08T21:57:17.507295 #334153] INFO -- : [692/885] 375535=attribute_write_test I, [2024-05-08T21:57:17.512319 #334153] INFO -- : [693/885] 375535=test_propertyputref I, [2024-05-08T21:57:17.516652 #334153] INFO -- : [694/885] 375535=test_assembler I, [2024-05-08T21:57:17.517010 #334153] INFO -- : [695/885] 375535=constant_path_node_test I, [2024-05-08T21:57:17.519583 #334153] INFO -- : [696/885] 375546=test_gem_ext_cargo_builder I, [2024-05-08T21:57:17.526148 #334153] INFO -- : [697/885] 375535=test_ssl I, [2024-05-08T21:57:17.539661 #334153] INFO -- : [698/885] 375546=test_module I, [2024-05-08T21:57:17.708197 #334153] INFO -- : [699/885] 375531=test_gem_request_set I, [2024-05-08T21:57:17.772747 #334153] INFO -- : [700/885] 375534=test_arith_seq_extract I, [2024-05-08T21:57:17.933555 #334153] INFO -- : [701/885] 375539=test_method_name_check I, [2024-05-08T21:57:17.953072 #334153] INFO -- : [702/885] 375539=test_parser I, [2024-05-08T21:57:17.966078 #334153] INFO -- : [703/885] 375534=test_rubyvm I, [2024-05-08T21:57:17.971528 #334153] INFO -- : [704/885] 375534=test_configuration I, [2024-05-08T21:57:17.973108 #334153] INFO -- : [705/885] 375539=test_buffered_io I, [2024-05-08T21:57:18.040331 #334153] INFO -- : [706/885] 375539=test_monitor I, [2024-05-08T21:57:18.057641 #334153] INFO -- : [707/885] 375534=test_whileuntil I, [2024-05-08T21:57:18.072300 #334153] INFO -- : [708/885] 375534=test_rdoc_generator_markup I, [2024-05-08T21:57:18.084284 #334153] INFO -- : [709/885] 375534=test_boolean I, [2024-05-08T21:57:18.088960 #334153] INFO -- : [710/885] 375534=integer_parse_test I, [2024-05-08T21:57:18.096417 #334153] INFO -- : [711/885] 375534=test_instrumentation_api I, [2024-05-08T21:57:18.190175 #334153] INFO -- : [712/885] 375531=test_stringify_symbols I, [2024-05-08T21:57:18.197924 #334153] INFO -- : [713/885] 375531=test_win32ole_variant_outarg I, [2024-05-08T21:57:18.207512 #334153] INFO -- : [714/885] 375531=json_common_interface_test I, [2024-05-08T21:57:18.213056 #334153] INFO -- : [715/885] 375531=test_gem_source_subpath_problem I, [2024-05-08T21:57:18.255112 #334153] INFO -- : [716/885] 375539=test_dln I, [2024-05-08T21:57:18.255186 #334153] INFO -- : [717/885] 375539=memsize_test I, [2024-05-08T21:57:18.260949 #334153] INFO -- : [718/885] 375537=json_parser_test I, [2024-05-08T21:57:18.262016 #334153] INFO -- : [719/885] 375539=test_nomethod_error I, [2024-05-08T21:57:18.275470 #334153] INFO -- : [720/885] 375539=test_config I, [2024-05-08T21:57:18.320336 #334153] INFO -- : [721/885] 375537=test_pkg_config I, [2024-05-08T21:57:18.327189 #334153] INFO -- : [722/885] 375531=test_cparser I, [2024-05-08T21:57:18.343472 #334153] INFO -- : [723/885] 375539=test_rdoc_markup_to_html_snippet I, [2024-05-08T21:57:18.345560 #334153] INFO -- : [724/885] 375550=magic_comment_test I, [2024-05-08T21:57:18.351241 #334153] INFO -- : [725/885] 375550=test_struct I, [2024-05-08T21:57:18.353551 #334153] INFO -- : [726/885] 375548=test_variable I, [2024-05-08T21:57:18.356821 #334153] INFO -- : [727/885] 375550=test_rdoc_markup_include I, [2024-05-08T21:57:18.368739 #334153] INFO -- : [728/885] 375537=test_sexp I, [2024-05-08T21:57:18.390046 #334153] INFO -- : [729/885] 375537=fuzzer_test I, [2024-05-08T21:57:18.444731 #334153] INFO -- : [730/885] 375532=test_win32ole_variant_m I, [2024-05-08T21:57:18.449648 #334153] INFO -- : [731/885] 375532=test_engine I, [2024-05-08T21:57:18.456303 #334153] INFO -- : [732/885] 375532=test_allocation I, [2024-05-08T21:57:18.460362 #334153] INFO -- : [733/885] 375548=test_div I, [2024-05-08T21:57:18.466094 #334153] INFO -- : [734/885] 375548=test_key_error I, [2024-05-08T21:57:18.483320 #334153] INFO -- : [735/885] 375548=test_serialize_subclasses I, [2024-05-08T21:57:18.486564 #334153] INFO -- : [736/885] 375550=test_insns_leaf I, [2024-05-08T21:57:18.490732 #334153] INFO -- : [737/885] 375550=test_deprecated I, [2024-05-08T21:57:18.493623 #334153] INFO -- : [738/885] 375550=test_color_printer I, [2024-05-08T21:57:18.495265 #334153] INFO -- : [739/885] 375548=test_files_test_1 I, [2024-05-08T21:57:18.512717 #334153] INFO -- : [740/885] 375550=test_gem_path_support I, [2024-05-08T21:57:18.523232 #334153] INFO -- : [741/885] 375537=test_struct I, [2024-05-08T21:57:18.542164 #334153] INFO -- : [742/885] 375550=test_set I, [2024-05-08T21:57:18.571924 #334153] INFO -- : [743/885] 375550=test_x509req I, [2024-05-08T21:57:18.607548 #334153] INFO -- : [744/885] 375539=test_mutex I, [2024-05-08T21:57:18.765931 #334153] INFO -- : [745/885] 375550=test_rdoc_rd_inline I, [2024-05-08T21:57:18.776538 #334153] INFO -- : [746/885] 375550=test_cgi_cookie I, [2024-05-08T21:57:18.783034 #334153] INFO -- : [747/885] 375550=test_require I, [2024-05-08T21:57:18.788303 #334153] INFO -- : [748/885] 375542=test_float I, [2024-05-08T21:57:19.000621 #334153] INFO -- : [749/885] 375549=test_gem_source_git I, [2024-05-08T21:57:19.046076 #334153] INFO -- : [750/885] 375541=test_refinement I, [2024-05-08T21:57:19.071076 #334153] INFO -- : [751/885] 375531=test_gem_commands_signout_command I, [2024-05-08T21:57:19.088624 #334153] INFO -- : [752/885] 375531=test_regex_casefold I, [2024-05-08T21:57:19.267042 #334153] INFO -- : [753/885] 375537=test_gem_resolver_installer_set I, [2024-05-08T21:57:19.485593 #334153] INFO -- : [754/885] 375537=test_dir_m17n I, [2024-05-08T21:57:19.568622 #334153] INFO -- : [755/885] 375547=test_metaclass I, [2024-05-08T21:57:19.573490 #334153] INFO -- : [756/885] 375547=test_rdoc_top_level I, [2024-05-08T21:57:19.607587 #334153] INFO -- : [757/885] 375549=test_cgi_session I, [2024-05-08T21:57:19.619146 #334153] INFO -- : [758/885] 375531=test_rdoc_rd I, [2024-05-08T21:57:19.622204 #334153] INFO -- : [759/885] 375549=test_x509crl I, [2024-05-08T21:57:19.648216 #334153] INFO -- : [760/885] 375531=test_signal I, [2024-05-08T21:57:19.747656 #334153] INFO -- : [761/885] 375538=test_fixnum I, [2024-05-08T21:57:19.751841 #334153] INFO -- : [762/885] 375549=test_process I, [2024-05-08T21:57:19.760050 #334153] INFO -- : [763/885] 375539=test_windows_1252 I, [2024-05-08T21:57:19.764486 #334153] INFO -- : [764/885] 375538=test_input_method I, [2024-05-08T21:57:19.767155 #334153] INFO -- : [765/885] 375539=test_digest_extend I, [2024-05-08T21:57:19.778311 #334153] INFO -- : [766/885] 375549=test_omap I, [2024-05-08T21:57:19.784004 #334153] INFO -- : [767/885] 375549=test_string I, [2024-05-08T21:57:19.787348 #334153] INFO -- : [768/885] 375539=test_iterator I, [2024-05-08T21:57:19.792037 #334153] INFO -- : [769/885] 375549=pattern_test I, [2024-05-08T21:57:19.810623 #334153] INFO -- : [770/885] 375538=test_memory_view I, [2024-05-08T21:57:19.819211 #334153] INFO -- : [771/885] 375549=test_debug I, [2024-05-08T21:57:19.845521 #334153] INFO -- : [772/885] 375538=test_shellwords I, [2024-05-08T21:57:19.848282 #334153] INFO -- : [773/885] 375549=test_new I, [2024-05-08T21:57:19.850734 #334153] INFO -- : [774/885] 375538=test_gem_security_signer I, [2024-05-08T21:57:19.853333 #334153] INFO -- : [775/885] 375549=test_cipher I, [2024-05-08T21:57:19.859893 #334153] INFO -- : [776/885] 375539=test_gem_resolver_git_set I, [2024-05-08T21:57:19.890807 #334153] INFO -- : [777/885] 375549=test_storage I, [2024-05-08T21:57:19.895879 #334153] INFO -- : [778/885] 375549=reflection_test I, [2024-05-08T21:57:19.901605 #334153] INFO -- : [779/885] 375549=test_within_pipe I, [2024-05-08T21:57:19.928145 #334153] INFO -- : [780/885] 375549=test_gem_bundler_version_finder I, [2024-05-08T21:57:19.953344 #334153] INFO -- : [781/885] 375547=test_emoji_breaks I, [2024-05-08T21:57:19.957834 #334153] INFO -- : [782/885] 375547=test_rdoc_markup_to_bs I, [2024-05-08T21:57:19.959671 #334153] INFO -- : [783/885] 375538=test_help I, [2024-05-08T21:57:19.965222 #334153] INFO -- : [784/885] 375538=test_beginendblock I, [2024-05-08T21:57:19.979877 #334153] INFO -- : [785/885] 375549=test_gem_commands_unpack_command I, [2024-05-08T21:57:19.983877 #334153] INFO -- : [786/885] 375546=test_files_lib I, [2024-05-08T21:57:19.988909 #334153] INFO -- : [787/885] 375547=test_stream I, [2024-05-08T21:57:19.992341 #334153] INFO -- : [788/885] 375547=test_time I, [2024-05-08T21:57:20.180448 #334153] INFO -- : [789/885] 375547=test_webauthn_listener_response I, [2024-05-08T21:57:20.195056 #334153] INFO -- : [790/885] 375547=test_to_ary_concat I, [2024-05-08T21:57:20.276788 #334153] INFO -- : [791/885] 375542=test_rdoc_markup_pre_process I, [2024-05-08T21:57:20.351428 #334153] INFO -- : [792/885] 375539=test_printf I, [2024-05-08T21:57:20.371104 #334153] INFO -- : [793/885] 375539=test_pinned I, [2024-05-08T21:57:20.373124 #334153] INFO -- : [794/885] 375542=test_date_marshal I, [2024-05-08T21:57:20.380362 #334153] INFO -- : [795/885] 375549=test_mkmf I, [2024-05-08T21:57:20.383888 #334153] INFO -- : [796/885] 375542=test_history I, [2024-05-08T21:57:20.413120 #334153] INFO -- : [797/885] 375539=test_popen_deadlock I, [2024-05-08T21:57:20.431957 #334153] INFO -- : [798/885] 375549=test_delegate I, [2024-05-08T21:57:20.450084 #334153] INFO -- : [799/885] 375538=test_exit I, [2024-05-08T21:57:20.464583 #334153] INFO -- : [800/885] 375549=test_recursion I, [2024-05-08T21:57:20.483115 #334153] INFO -- : [801/885] 375549=test_gem_security I, [2024-05-08T21:57:20.544224 #334153] INFO -- : [802/885] 375542=test_rdoc_servlet I, [2024-05-08T21:57:20.551385 #334153] INFO -- : [803/885] 375538=test_ractor I, [2024-05-08T21:57:20.632081 #334153] INFO -- : [804/885] 375538=test_digest I, [2024-05-08T21:57:20.639265 #334153] INFO -- : [805/885] 375538=test_closure I, [2024-05-08T21:57:20.702950 #334153] INFO -- : [806/885] 375542=test_bundled_ca I, [2024-05-08T21:57:20.908794 #334153] INFO -- : [807/885] 375537=test_open3 I, [2024-05-08T21:57:20.983334 #334153] INFO -- : [808/885] 375532=test_fiber I, [2024-05-08T21:57:21.081183 #334153] INFO -- : [809/885] 375547=test_multi_irb_commands I, [2024-05-08T21:57:21.084960 #334153] INFO -- : [810/885] 375534=test_gem_commands_build_command I, [2024-05-08T21:57:21.086673 #334153] INFO -- : [811/885] 375538=test_case_comprehensive I, [2024-05-08T21:57:21.087850 #334153] INFO -- : [812/885] 375547=test_interned_str I, [2024-05-08T21:57:21.093167 #334153] INFO -- : [813/885] 375547=test_gem_commands_server_command I, [2024-05-08T21:57:21.096181 #334153] INFO -- : [814/885] 375547=test_did_you_mean I, [2024-05-08T21:57:21.188971 #334153] INFO -- : [815/885] 375539=test_variable_name_check I, [2024-05-08T21:57:21.228624 #334153] INFO -- : [816/885] 375547=test_io_m17n I, [2024-05-08T21:57:21.260710 #334153] INFO -- : [817/885] 375539=test_tracer I, [2024-05-08T21:57:21.284705 #334153] INFO -- : [818/885] 375539=test_cmethod I, [2024-05-08T21:57:21.290874 #334153] INFO -- : [819/885] 375539=test_option I, [2024-05-08T21:57:21.307078 #334153] INFO -- : [820/885] 375534=test_append I, [2024-05-08T21:57:21.312176 #334153] INFO -- : [821/885] 375534=test_rdoc_markup_heading I, [2024-05-08T21:57:21.324388 #334153] INFO -- : [822/885] 375534=test_iseq I, [2024-05-08T21:57:21.409367 #334153] INFO -- : [823/885] 375539=test_exception_at_throwing I, [2024-05-08T21:57:21.452025 #334153] INFO -- : [824/885] 375539=test_pkey_dsa I, [2024-05-08T21:57:21.486695 #334153] INFO -- : [825/885] 375550=test_class I, [2024-05-08T21:57:21.494380 #334153] INFO -- : [826/885] 375550=test_ocsp I, [2024-05-08T21:57:21.802146 #334153] INFO -- : [827/885] 375550=test_scheduler I, [2024-05-08T21:57:21.807683 #334153] INFO -- : [828/885] 375542=test_rdoc_markup_to_html I, [2024-05-08T21:57:21.814440 #334153] INFO -- : [829/885] 375548=test_date_compat I, [2024-05-08T21:57:21.820129 #334153] INFO -- : [830/885] 375548=test_bug-14834 I, [2024-05-08T21:57:21.891550 #334153] INFO -- : [831/885] 375542=test_compile_prism I, [2024-05-08T21:57:21.900575 #334153] INFO -- : [832/885] 375548=test_terminfo I, [2024-05-08T21:57:21.901692 #334153] INFO -- : [833/885] 375548=test_case_mapping I, [2024-05-08T21:57:21.912617 #334153] INFO -- : [834/885] 375548=redundant_return_test I, [2024-05-08T21:57:21.919112 #334153] INFO -- : [835/885] 375548=test_path I, [2024-05-08T21:57:21.924126 #334153] INFO -- : [836/885] 375534=test_win32ole_param_event I, [2024-05-08T21:57:21.926582 #334153] INFO -- : [837/885] 375531=test_bn I, [2024-05-08T21:57:21.931275 #334153] INFO -- : [838/885] 375534=test_http I, [2024-05-08T21:57:21.931337 #334153] INFO -- : [839/885] 375548=test_addrinfo I, [2024-05-08T21:57:21.948566 #334153] INFO -- : [840/885] 375531=test_tree_spell_checker I, [2024-05-08T21:57:21.950179 #334153] INFO -- : [841/885] 375550=test_data I, [2024-05-08T21:57:21.958813 #334153] INFO -- : [842/885] 375550=static_literals_test I, [2024-05-08T21:57:21.962701 #334153] INFO -- : [843/885] 375531=test_gem_gem_runner I, [2024-05-08T21:57:21.964678 #334153] INFO -- : [844/885] 375550=test_filter I, [2024-05-08T21:57:21.973034 #334153] INFO -- : [845/885] 375539=test_rdoc_method_attr I, [2024-05-08T21:57:22.011032 #334153] INFO -- : [846/885] 375550=test_unicode I, [2024-05-08T21:57:22.014808 #334153] INFO -- : [847/885] 375531=parameters_signature_test I, [2024-05-08T21:57:22.016478 #334153] INFO -- : [848/885] 375548=test_koi8 I, [2024-05-08T21:57:22.020516 #334153] INFO -- : [849/885] 375550=test_enumerator I, [2024-05-08T21:57:22.021483 #334153] INFO -- : [850/885] 375548=test_rdoc_parser_changelog I, [2024-05-08T21:57:22.022232 #334153] INFO -- : [851/885] 375531=test_rdoc_generator_pot I, [2024-05-08T21:57:22.026214 #334153] INFO -- : [852/885] 375550=test_thread_cv I, [2024-05-08T21:57:22.027109 #334153] INFO -- : [853/885] 375531=test_lexer I, [2024-05-08T21:57:22.041041 #334153] INFO -- : [854/885] 375531=test_ssl_session I, [2024-05-08T21:57:22.087269 #334153] INFO -- : [855/885] 375539=test_random I, [2024-05-08T21:57:22.094700 #334153] INFO -- : [856/885] 375548=test_notimplement I, [2024-05-08T21:57:22.098130 #334153] INFO -- : [857/885] 375545=test_key_event_record I, [2024-05-08T21:57:22.098616 #334153] INFO -- : [858/885] 375548=test_gem_uri I, [2024-05-08T21:57:22.099585 #334153] INFO -- : [859/885] 375545=test_gem_commands_update_command I, [2024-05-08T21:57:22.114593 #334153] INFO -- : [860/885] 375539=test_gem_resolver_vendor_specification I, [2024-05-08T21:57:22.122908 #334153] INFO -- : [861/885] 375548=test_human_typo I, [2024-05-08T21:57:22.130167 #334153] INFO -- : [862/885] 375548=test_primitive I, [2024-05-08T21:57:22.136620 #334153] INFO -- : [863/885] 375539=test_rbconfig I, [2024-05-08T21:57:22.138984 #334153] INFO -- : [864/885] 375548=test_gem_commands_yank_command I, [2024-05-08T21:57:22.144926 #334153] INFO -- : [865/885] 375539=test_win32ole_param I, [2024-05-08T21:57:22.148599 #334153] INFO -- : [866/885] 375539=test_pair I, [2024-05-08T21:57:22.170643 #334153] INFO -- : [867/885] 375542=test_euc_jp I, [2024-05-08T21:57:22.177315 #334153] INFO -- : [868/885] 375542=test_rdoc_generator_pot_po_entry I, [2024-05-08T21:57:22.193954 #334153] INFO -- : [869/885] 375542=test_acceptable I, [2024-05-08T21:57:22.271827 #334153] INFO -- : [870/885] 375542=test_document I, [2024-05-08T21:57:22.275130 #334153] INFO -- : [871/885] 375542=test_rdoc_i18n_locale I, [2024-05-08T21:57:22.282167 #334153] INFO -- : [872/885] 375542=test_name_error_extension I, [2024-05-08T21:57:22.292681 #334153] INFO -- : [873/885] 375542=test_chilled I, [2024-05-08T21:57:22.297594 #334153] INFO -- : [874/885] 375542=test_encoding I, [2024-05-08T21:57:22.305326 #334153] INFO -- : [875/885] 375542=test_httpresponses I, [2024-05-08T21:57:22.337363 #334153] INFO -- : [876/885] 375542=test_set_len I, [2024-05-08T21:57:22.375928 #334153] INFO -- : [877/885] 375542=test_rdoc_ri_driver I, [2024-05-08T21:57:22.611478 #334153] INFO -- : [878/885] 375548=test_gem_resolver_local_specification I, [2024-05-08T21:57:22.616737 #334153] INFO -- : [879/885] 375547=test_httpheader I, [2024-05-08T21:57:22.651177 #334153] INFO -- : [880/885] 375548=test_rdoc_markup_to_label I, [2024-05-08T21:57:22.655733 #334153] INFO -- : [881/885] 375550=test_install I, [2024-05-08T21:57:22.668564 #334153] INFO -- : [882/885] 375547=test_sockopt I, [2024-05-08T21:57:22.680658 #334153] INFO -- : [883/885] 375547=test_color I, [2024-05-08T21:57:22.682113 #334153] INFO -- : [884/885] 375548=json_encoding_test I, [2024-05-08T21:57:22.696545 #334153] INFO -- : [885/885] 375542=test_key_stroke I, [2024-05-08T21:57:39.091390 #334153] INFO -- : Finished tests in 36.371292s, 725.1048 tests/s, 257121.9054 assertions/s. E, [2024-05-08T21:57:39.091444 #334153] ERROR -- : Children under /tmp/rubytest.c813vw: E, [2024-05-08T21:57:39.091496 #334153] ERROR -- : * drwx------ 4 80 2024-05-08 21:57:17 +0000 gem_rebuild20240508-375539-omoe1u/ E, [2024-05-08T21:57:39.091510 #334153] ERROR -- : * drwxrwxr-x 2 60 2024-05-08 21:57:17 +0000 new/ E, [2024-05-08T21:57:39.091527 #334153] ERROR -- : * -rw-rw-r-- 1 4096 2024-05-08 21:57:17 +0000 rebuild_test_gem-1.0.0.gem E, [2024-05-08T21:57:39.091546 #334153] ERROR -- : * drwxrwxr-x 2 60 2024-05-08 21:57:17 +0000 old/ E, [2024-05-08T21:57:39.091553 #334153] ERROR -- : * -rw-rw-r-- 1 4096 2024-05-08 21:57:17 +0000 rebuild_test_gem-1.0.0.gem I, [2024-05-08T21:57:39.092921 #334153] INFO -- : 26373 tests, 9351856 assertions, 0 failures, 0 errors, 306 skips I, [2024-05-08T21:57:39.092943 #334153] INFO -- : I, [2024-05-08T21:57:39.092950 #334153] INFO -- : ruby -v: ruby 3.4.0dev (2024-05-08T18:56:14Z master 442e398e62) [x86_64-linux] I, [2024-05-08T21:57:39.094711 #334153] INFO -- : $$$[end] "make yes-test-all TESTOPTS='--stderr-on-failure' TESTS='-j20'" exit with 0. I, [2024-05-08T21:57:39.094852 #334153] INFO -- : $$$[beg] make yes-test-rubyspec MSPECOPT='--error-output stderr --debug -j' TESTS='-j20' I, [2024-05-08T21:57:39.181621 #334153] INFO -- : BASERUBY = /usr/bin/ruby --disable=gems I, [2024-05-08T21:57:39.181660 #334153] INFO -- : CC = gcc I, [2024-05-08T21:57:39.181668 #334153] INFO -- : LD = ld I, [2024-05-08T21:57:39.181673 #334153] INFO -- : LDSHARED = gcc -shared I, [2024-05-08T21:57:39.181677 #334153] INFO -- : CFLAGS = -O3 -fno-fast-math -ggdb3 -Wall -Wextra -Wdeprecated-declarations -Wdiv-by-zero -Wduplicated-cond -Wimplicit-function-declaration -Wimplicit-int -Wpointer-arith -Wwrite-strings -Wold-style-definition -Wimplicit-fallthrough=0 -Wmissing-noreturn -Wno-cast-function-type -Wno-constant-logical-operand -Wno-long-long -Wno-missing-field-initializers -Wno-overlength-strings -Wno-packed-bitfield-compat -Wno-parentheses-equality -Wno-self-assign -Wno-tautological-compare -Wno-unused-parameter -Wno-unused-value -Wsuggest-attribute=format -Wsuggest-attribute=noreturn -Wunused-variable -Wmisleading-indentation -Wundef -fPIC I, [2024-05-08T21:57:39.181682 #334153] INFO -- : XCFLAGS = -U_FORTIFY_SOURCE -D_FORTIFY_SOURCE=2 -fstack-protector-strong -fno-strict-overflow -fvisibility=hidden -fexcess-precision=standard -DRUBY_EXPORT -I. -I.ext/include/x86_64-linux -I/tmp/ruby/src/trunk/include -I/tmp/ruby/src/trunk -I/tmp/ruby/src/trunk/prism -I/tmp/ruby/src/trunk/enc/unicode/15.0.0 I, [2024-05-08T21:57:39.181688 #334153] INFO -- : CPPFLAGS = I, [2024-05-08T21:57:39.181693 #334153] INFO -- : DLDFLAGS = -Wl,--compress-debug-sections=zlib -Wl,-soname,libruby.so.3.4 -fstack-protector-strong I, [2024-05-08T21:57:39.181698 #334153] INFO -- : SOLIBS = -lz -lrt -lrt -lgmp -ldl -lcrypt -lm -lpthread I, [2024-05-08T21:57:39.181701 #334153] INFO -- : LANG = en_US.UTF-8 I, [2024-05-08T21:57:39.181705 #334153] INFO -- : LC_ALL = I, [2024-05-08T21:57:39.181708 #334153] INFO -- : LC_CTYPE = I, [2024-05-08T21:57:39.181712 #334153] INFO -- : MFLAGS = I, [2024-05-08T21:57:39.181715 #334153] INFO -- : RUSTC = no I, [2024-05-08T21:57:39.181719 #334153] INFO -- : YJIT_RUSTC_ARGS = --crate-name=yjit --crate-type=staticlib --edition=2021 -g -C lto=thin -C opt-level=3 -C overflow-checks=on '--out-dir=/tmp/ruby/build/trunk/yjit/target/release/' /tmp/ruby/src/trunk/yjit/src/lib.rs I, [2024-05-08T21:57:39.182384 #334153] INFO -- : gcc (Ubuntu 11.4.0-1ubuntu1~22.04) 11.4.0 I, [2024-05-08T21:57:39.182417 #334153] INFO -- : Copyright (C) 2021 Free Software Foundation, Inc. I, [2024-05-08T21:57:39.182424 #334153] INFO -- : This is free software; see the source for copying conditions. There is NO I, [2024-05-08T21:57:39.182428 #334153] INFO -- : warranty; not even for MERCHANTABILITY or FITNESS FOR A PARTICULAR PURPOSE. I, [2024-05-08T21:57:39.182432 #334153] INFO -- : I, [2024-05-08T21:57:39.184040 #334153] INFO -- : generating enc.mk I, [2024-05-08T21:57:39.303066 #334153] INFO -- : making enc I, [2024-05-08T21:57:39.320242 #334153] INFO -- : make[1]: Entering directory '/tmp/ruby/build/trunk' I, [2024-05-08T21:57:39.320270 #334153] INFO -- : make[1]: Nothing to be done for 'enc'. I, [2024-05-08T21:57:39.320277 #334153] INFO -- : make[1]: Leaving directory '/tmp/ruby/build/trunk' I, [2024-05-08T21:57:39.320959 #334153] INFO -- : making srcs under enc I, [2024-05-08T21:57:39.351071 #334153] INFO -- : make[1]: Entering directory '/tmp/ruby/build/trunk' I, [2024-05-08T21:57:39.351096 #334153] INFO -- : make[1]: Nothing to be done for 'srcs'. I, [2024-05-08T21:57:39.351104 #334153] INFO -- : make[1]: Leaving directory '/tmp/ruby/build/trunk' I, [2024-05-08T21:57:39.351869 #334153] INFO -- : generating transdb.h I, [2024-05-08T21:57:39.447145 #334153] INFO -- : transdb.h unchanged I, [2024-05-08T21:57:39.448574 #334153] INFO -- : making trans I, [2024-05-08T21:57:39.483491 #334153] INFO -- : make[1]: Entering directory '/tmp/ruby/build/trunk' I, [2024-05-08T21:57:39.483512 #334153] INFO -- : make[1]: Nothing to be done for 'trans'. I, [2024-05-08T21:57:39.483518 #334153] INFO -- : make[1]: Leaving directory '/tmp/ruby/build/trunk' I, [2024-05-08T21:57:39.484222 #334153] INFO -- : making encs I, [2024-05-08T21:57:39.521307 #334153] INFO -- : make[1]: Entering directory '/tmp/ruby/build/trunk' I, [2024-05-08T21:57:39.521328 #334153] INFO -- : make[1]: Nothing to be done for 'encs'. I, [2024-05-08T21:57:39.521334 #334153] INFO -- : make[1]: Leaving directory '/tmp/ruby/build/trunk' I, [2024-05-08T21:57:39.523109 #334153] INFO -- : generating makefiles ext/configure-ext.mk I, [2024-05-08T21:57:39.550236 #334153] INFO -- : ext/configure-ext.mk updated I, [2024-05-08T21:57:39.552686 #334153] INFO -- : make[1]: Entering directory '/tmp/ruby/build/trunk' I, [2024-05-08T21:57:40.951678 #334153] INFO -- : make[1]: Leaving directory '/tmp/ruby/build/trunk' I, [2024-05-08T21:57:40.952249 #334153] INFO -- : generating makefile exts.mk I, [2024-05-08T21:57:40.989318 #334153] INFO -- : exts.mk unchanged I, [2024-05-08T21:57:40.993851 #334153] INFO -- : make[1]: Entering directory '/tmp/ruby/build/trunk' I, [2024-05-08T21:57:41.203769 #334153] INFO -- : make[2]: Entering directory '/tmp/ruby/build/trunk/ext/coverage' I, [2024-05-08T21:57:41.206670 #334153] INFO -- : make[2]: Leaving directory '/tmp/ruby/build/trunk/ext/coverage' I, [2024-05-08T21:57:41.210510 #334153] INFO -- : make[2]: Entering directory '/tmp/ruby/build/trunk/ext/date' I, [2024-05-08T21:57:41.213691 #334153] INFO -- : make[2]: Leaving directory '/tmp/ruby/build/trunk/ext/date' I, [2024-05-08T21:57:41.215973 #334153] INFO -- : make[2]: Entering directory '/tmp/ruby/build/trunk/ext/digest' I, [2024-05-08T21:57:41.221391 #334153] INFO -- : make[2]: Leaving directory '/tmp/ruby/build/trunk/ext/digest' I, [2024-05-08T21:57:41.236931 #334153] INFO -- : make[2]: Entering directory '/tmp/ruby/build/trunk/ext/digest/sha2' I, [2024-05-08T21:57:41.239815 #334153] INFO -- : make[2]: Leaving directory '/tmp/ruby/build/trunk/ext/digest/sha2' I, [2024-05-08T21:57:41.252437 #334153] INFO -- : make[2]: Entering directory '/tmp/ruby/build/trunk/ext/fiddle' I, [2024-05-08T21:57:41.258830 #334153] INFO -- : make[2]: Leaving directory '/tmp/ruby/build/trunk/ext/fiddle' I, [2024-05-08T21:57:41.261679 #334153] INFO -- : make[2]: Entering directory '/tmp/ruby/build/trunk/ext/io/console' I, [2024-05-08T21:57:41.264278 #334153] INFO -- : make[2]: Leaving directory '/tmp/ruby/build/trunk/ext/io/console' I, [2024-05-08T21:57:41.271947 #334153] INFO -- : make[2]: Entering directory '/tmp/ruby/build/trunk/ext/json' I, [2024-05-08T21:57:41.278270 #334153] INFO -- : make[2]: Leaving directory '/tmp/ruby/build/trunk/ext/json' I, [2024-05-08T21:57:41.287193 #334153] INFO -- : make[2]: Entering directory '/tmp/ruby/build/trunk/ext/monitor' I, [2024-05-08T21:57:41.289724 #334153] INFO -- : make[2]: Leaving directory '/tmp/ruby/build/trunk/ext/monitor' I, [2024-05-08T21:57:41.293929 #334153] INFO -- : make[2]: Entering directory '/tmp/ruby/build/trunk/ext/objspace' I, [2024-05-08T21:57:41.297646 #334153] INFO -- : make[2]: Leaving directory '/tmp/ruby/build/trunk/ext/objspace' I, [2024-05-08T21:57:41.309462 #334153] INFO -- : make[2]: Entering directory '/tmp/ruby/build/trunk/ext/openssl' I, [2024-05-08T21:57:41.322414 #334153] INFO -- : make[2]: Leaving directory '/tmp/ruby/build/trunk/ext/openssl' I, [2024-05-08T21:57:41.325430 #334153] INFO -- : make[2]: Entering directory '/tmp/ruby/build/trunk/ext/pathname' I, [2024-05-08T21:57:41.327916 #334153] INFO -- : make[2]: Leaving directory '/tmp/ruby/build/trunk/ext/pathname' I, [2024-05-08T21:57:41.331948 #334153] INFO -- : make[2]: Entering directory '/tmp/ruby/build/trunk/ext/psych' I, [2024-05-08T21:57:41.346723 #334153] INFO -- : make[2]: Leaving directory '/tmp/ruby/build/trunk/ext/psych' I, [2024-05-08T21:57:41.349873 #334153] INFO -- : make[2]: Entering directory '/tmp/ruby/build/trunk/ext/pty' I, [2024-05-08T21:57:41.352319 #334153] INFO -- : make[2]: Leaving directory '/tmp/ruby/build/trunk/ext/pty' I, [2024-05-08T21:57:41.361639 #334153] INFO -- : make[2]: Entering directory '/tmp/ruby/build/trunk/ext/ripper' I, [2024-05-08T21:57:41.366884 #334153] INFO -- : make[2]: Leaving directory '/tmp/ruby/build/trunk/ext/ripper' I, [2024-05-08T21:57:41.368345 #334153] INFO -- : make[2]: Entering directory '/tmp/ruby/build/trunk/ext/rubyvm' I, [2024-05-08T21:57:41.370462 #334153] INFO -- : make[2]: Leaving directory '/tmp/ruby/build/trunk/ext/rubyvm' I, [2024-05-08T21:57:41.378132 #334153] INFO -- : make[2]: Entering directory '/tmp/ruby/build/trunk/ext/socket' I, [2024-05-08T21:57:41.384584 #334153] INFO -- : make[2]: Leaving directory '/tmp/ruby/build/trunk/ext/socket' I, [2024-05-08T21:57:41.395603 #334153] INFO -- : make[2]: Entering directory '/tmp/ruby/build/trunk/.bundle/gems/bigdecimal-3.1.7/ext/bigdecimal' I, [2024-05-08T21:57:41.418510 #334153] INFO -- : make[2]: Leaving directory '/tmp/ruby/build/trunk/.bundle/gems/bigdecimal-3.1.7/ext/bigdecimal' I, [2024-05-08T21:57:41.420358 #334153] INFO -- : make[2]: Entering directory '/tmp/ruby/build/trunk/.bundle/gems/bigdecimal-3.1.8/ext/bigdecimal' I, [2024-05-08T21:57:41.442962 #334153] INFO -- : make[2]: Leaving directory '/tmp/ruby/build/trunk/.bundle/gems/bigdecimal-3.1.8/ext/bigdecimal' I, [2024-05-08T21:57:41.445161 #334153] INFO -- : make[2]: Entering directory '/tmp/ruby/build/trunk/.bundle/gems/debug-1.9.2/ext/debug' I, [2024-05-08T21:57:41.466478 #334153] INFO -- : make[2]: Leaving directory '/tmp/ruby/build/trunk/.bundle/gems/debug-1.9.2/ext/debug' I, [2024-05-08T21:57:41.468324 #334153] INFO -- : make[2]: Entering directory '/tmp/ruby/build/trunk/.bundle/gems/nkf-0.2.0/ext/nkf' I, [2024-05-08T21:57:41.489995 #334153] INFO -- : make[2]: Leaving directory '/tmp/ruby/build/trunk/.bundle/gems/nkf-0.2.0/ext/nkf' I, [2024-05-08T21:57:41.491827 #334153] INFO -- : make[2]: Entering directory '/tmp/ruby/build/trunk/.bundle/gems/racc-1.7.3/ext/racc/cparse' I, [2024-05-08T21:57:41.513338 #334153] INFO -- : make[2]: Leaving directory '/tmp/ruby/build/trunk/.bundle/gems/racc-1.7.3/ext/racc/cparse' I, [2024-05-08T21:57:41.515754 #334153] INFO -- : make[2]: Entering directory '/tmp/ruby/build/trunk/.bundle/gems/rbs-3.4.4/ext/rbs_extension' I, [2024-05-08T21:57:41.537653 #334153] INFO -- : make[2]: Leaving directory '/tmp/ruby/build/trunk/.bundle/gems/rbs-3.4.4/ext/rbs_extension' I, [2024-05-08T21:57:41.539596 #334153] INFO -- : make[2]: Entering directory '/tmp/ruby/build/trunk/.bundle/gems/syslog-0.1.2/ext/syslog' I, [2024-05-08T21:57:41.561325 #334153] INFO -- : make[2]: Leaving directory '/tmp/ruby/build/trunk/.bundle/gems/syslog-0.1.2/ext/syslog' I, [2024-05-08T21:57:41.584737 #334153] INFO -- : make[2]: Entering directory '/tmp/ruby/build/trunk' I, [2024-05-08T21:57:41.648239 #334153] INFO -- : make[2]: 'ruby' is up to date. I, [2024-05-08T21:57:41.648283 #334153] INFO -- : make[2]: Leaving directory '/tmp/ruby/build/trunk' I, [2024-05-08T21:57:41.648477 #334153] INFO -- : make[1]: Leaving directory '/tmp/ruby/build/trunk' I, [2024-05-08T21:57:41.652025 #334153] INFO -- : make[1]: Entering directory '/tmp/ruby/build/trunk' I, [2024-05-08T21:57:41.652047 #334153] INFO -- : make[1]: Nothing to be done for 'note'. I, [2024-05-08T21:57:41.652053 #334153] INFO -- : make[1]: Leaving directory '/tmp/ruby/build/trunk' E, [2024-05-08T21:57:41.708773 #334153] ERROR -- : $ /tmp/ruby/build/trunk/miniruby -I/tmp/ruby/src/trunk/lib /tmp/ruby/src/trunk/tool/runruby.rb --archdir=/tmp/ruby/build/trunk --extout=.ext -- /tmp/ruby/src/trunk/spec/mspec/bin/mspec-run -B /tmp/ruby/src/trunk/spec/default.mspec --error-output stderr --debug -fy -o /tmp/rubytest.upq5tx/1-mspec-multi-0 E, [2024-05-08T21:57:41.708965 #334153] ERROR -- : $ /tmp/ruby/build/trunk/miniruby -I/tmp/ruby/src/trunk/lib /tmp/ruby/src/trunk/tool/runruby.rb --archdir=/tmp/ruby/build/trunk --extout=.ext -- /tmp/ruby/src/trunk/spec/mspec/bin/mspec-run -B /tmp/ruby/src/trunk/spec/default.mspec --error-output stderr --debug -fy -o /tmp/rubytest.upq5tx/2-mspec-multi-1 E, [2024-05-08T21:57:41.709236 #334153] ERROR -- : $ /tmp/ruby/build/trunk/miniruby -I/tmp/ruby/src/trunk/lib /tmp/ruby/src/trunk/tool/runruby.rb --archdir=/tmp/ruby/build/trunk --extout=.ext -- /tmp/ruby/src/trunk/spec/mspec/bin/mspec-run -B /tmp/ruby/src/trunk/spec/default.mspec --error-output stderr --debug -fy -o /tmp/rubytest.upq5tx/3-mspec-multi-2 E, [2024-05-08T21:57:41.709502 #334153] ERROR -- : $ /tmp/ruby/build/trunk/miniruby -I/tmp/ruby/src/trunk/lib /tmp/ruby/src/trunk/tool/runruby.rb --archdir=/tmp/ruby/build/trunk --extout=.ext -- /tmp/ruby/src/trunk/spec/mspec/bin/mspec-run -B /tmp/ruby/src/trunk/spec/default.mspec --error-output stderr --debug -fy -o /tmp/rubytest.upq5tx/4-mspec-multi-3 E, [2024-05-08T21:57:41.709604 #334153] ERROR -- : $ /tmp/ruby/build/trunk/miniruby -I/tmp/ruby/src/trunk/lib /tmp/ruby/src/trunk/tool/runruby.rb --archdir=/tmp/ruby/build/trunk --extout=.ext -- /tmp/ruby/src/trunk/spec/mspec/bin/mspec-run -B /tmp/ruby/src/trunk/spec/default.mspec --error-output stderr --debug -fy -o /tmp/rubytest.upq5tx/5-mspec-multi-4 E, [2024-05-08T21:57:41.709902 #334153] ERROR -- : $ /tmp/ruby/build/trunk/miniruby -I/tmp/ruby/src/trunk/lib /tmp/ruby/src/trunk/tool/runruby.rb --archdir=/tmp/ruby/build/trunk --extout=.ext -- /tmp/ruby/src/trunk/spec/mspec/bin/mspec-run -B /tmp/ruby/src/trunk/spec/default.mspec --error-output stderr --debug -fy -o /tmp/rubytest.upq5tx/6-mspec-multi-5 E, [2024-05-08T21:57:41.710033 #334153] ERROR -- : $ /tmp/ruby/build/trunk/miniruby -I/tmp/ruby/src/trunk/lib /tmp/ruby/src/trunk/tool/runruby.rb --archdir=/tmp/ruby/build/trunk --extout=.ext -- /tmp/ruby/src/trunk/spec/mspec/bin/mspec-run -B /tmp/ruby/src/trunk/spec/default.mspec --error-output stderr --debug -fy -o /tmp/rubytest.upq5tx/7-mspec-multi-6 E, [2024-05-08T21:57:41.710224 #334153] ERROR -- : $ /tmp/ruby/build/trunk/miniruby -I/tmp/ruby/src/trunk/lib /tmp/ruby/src/trunk/tool/runruby.rb --archdir=/tmp/ruby/build/trunk --extout=.ext -- /tmp/ruby/src/trunk/spec/mspec/bin/mspec-run -B /tmp/ruby/src/trunk/spec/default.mspec --error-output stderr --debug -fy -o /tmp/rubytest.upq5tx/8-mspec-multi-7 E, [2024-05-08T21:57:41.710398 #334153] ERROR -- : $ /tmp/ruby/build/trunk/miniruby -I/tmp/ruby/src/trunk/lib /tmp/ruby/src/trunk/tool/runruby.rb --archdir=/tmp/ruby/build/trunk --extout=.ext -- /tmp/ruby/src/trunk/spec/mspec/bin/mspec-run -B /tmp/ruby/src/trunk/spec/default.mspec --error-output stderr --debug -fy -o /tmp/rubytest.upq5tx/9-mspec-multi-8 E, [2024-05-08T21:57:41.710688 #334153] ERROR -- : $ /tmp/ruby/build/trunk/miniruby -I/tmp/ruby/src/trunk/lib /tmp/ruby/src/trunk/tool/runruby.rb --archdir=/tmp/ruby/build/trunk --extout=.ext -- /tmp/ruby/src/trunk/spec/mspec/bin/mspec-run -B /tmp/ruby/src/trunk/spec/default.mspec --error-output stderr --debug -fy -o /tmp/rubytest.upq5tx/10-mspec-multi-9 E, [2024-05-08T21:57:41.710918 #334153] ERROR -- : $ /tmp/ruby/build/trunk/miniruby -I/tmp/ruby/src/trunk/lib /tmp/ruby/src/trunk/tool/runruby.rb --archdir=/tmp/ruby/build/trunk --extout=.ext -- /tmp/ruby/src/trunk/spec/mspec/bin/mspec-run -B /tmp/ruby/src/trunk/spec/default.mspec --error-output stderr --debug -fy -o /tmp/rubytest.upq5tx/11-mspec-multi-10 E, [2024-05-08T21:57:41.711149 #334153] ERROR -- : $ /tmp/ruby/build/trunk/miniruby -I/tmp/ruby/src/trunk/lib /tmp/ruby/src/trunk/tool/runruby.rb --archdir=/tmp/ruby/build/trunk --extout=.ext -- /tmp/ruby/src/trunk/spec/mspec/bin/mspec-run -B /tmp/ruby/src/trunk/spec/default.mspec --error-output stderr --debug -fy -o /tmp/rubytest.upq5tx/12-mspec-multi-11 E, [2024-05-08T21:57:41.711324 #334153] ERROR -- : $ /tmp/ruby/build/trunk/miniruby -I/tmp/ruby/src/trunk/lib /tmp/ruby/src/trunk/tool/runruby.rb --archdir=/tmp/ruby/build/trunk --extout=.ext -- /tmp/ruby/src/trunk/spec/mspec/bin/mspec-run -B /tmp/ruby/src/trunk/spec/default.mspec --error-output stderr --debug -fy -o /tmp/rubytest.upq5tx/13-mspec-multi-12 E, [2024-05-08T21:57:41.711470 #334153] ERROR -- : $ /tmp/ruby/build/trunk/miniruby -I/tmp/ruby/src/trunk/lib /tmp/ruby/src/trunk/tool/runruby.rb --archdir=/tmp/ruby/build/trunk --extout=.ext -- /tmp/ruby/src/trunk/spec/mspec/bin/mspec-run -B /tmp/ruby/src/trunk/spec/default.mspec --error-output stderr --debug -fy -o /tmp/rubytest.upq5tx/14-mspec-multi-13 E, [2024-05-08T21:57:41.711634 #334153] ERROR -- : $ /tmp/ruby/build/trunk/miniruby -I/tmp/ruby/src/trunk/lib /tmp/ruby/src/trunk/tool/runruby.rb --archdir=/tmp/ruby/build/trunk --extout=.ext -- /tmp/ruby/src/trunk/spec/mspec/bin/mspec-run -B /tmp/ruby/src/trunk/spec/default.mspec --error-output stderr --debug -fy -o /tmp/rubytest.upq5tx/15-mspec-multi-14 E, [2024-05-08T21:57:41.711800 #334153] ERROR -- : $ /tmp/ruby/build/trunk/miniruby -I/tmp/ruby/src/trunk/lib /tmp/ruby/src/trunk/tool/runruby.rb --archdir=/tmp/ruby/build/trunk --extout=.ext -- /tmp/ruby/src/trunk/spec/mspec/bin/mspec-run -B /tmp/ruby/src/trunk/spec/default.mspec --error-output stderr --debug -fy -o /tmp/rubytest.upq5tx/16-mspec-multi-15 E, [2024-05-08T21:57:41.711965 #334153] ERROR -- : $ /tmp/ruby/build/trunk/miniruby -I/tmp/ruby/src/trunk/lib /tmp/ruby/src/trunk/tool/runruby.rb --archdir=/tmp/ruby/build/trunk --extout=.ext -- /tmp/ruby/src/trunk/spec/mspec/bin/mspec-run -B /tmp/ruby/src/trunk/spec/default.mspec --error-output stderr --debug -fy -o /tmp/rubytest.upq5tx/17-mspec-multi-16 E, [2024-05-08T21:57:41.712112 #334153] ERROR -- : $ /tmp/ruby/build/trunk/miniruby -I/tmp/ruby/src/trunk/lib /tmp/ruby/src/trunk/tool/runruby.rb --archdir=/tmp/ruby/build/trunk --extout=.ext -- /tmp/ruby/src/trunk/spec/mspec/bin/mspec-run -B /tmp/ruby/src/trunk/spec/default.mspec --error-output stderr --debug -fy -o /tmp/rubytest.upq5tx/18-mspec-multi-17 E, [2024-05-08T21:57:41.714354 #334153] ERROR -- : $ /tmp/ruby/build/trunk/miniruby -I/tmp/ruby/src/trunk/lib /tmp/ruby/src/trunk/tool/runruby.rb --archdir=/tmp/ruby/build/trunk --extout=.ext -- /tmp/ruby/src/trunk/spec/mspec/bin/mspec-run -B /tmp/ruby/src/trunk/spec/default.mspec --error-output stderr --debug -fy -o /tmp/rubytest.upq5tx/19-mspec-multi-18 E, [2024-05-08T21:57:41.714850 #334153] ERROR -- : $ /tmp/ruby/build/trunk/miniruby -I/tmp/ruby/src/trunk/lib /tmp/ruby/src/trunk/tool/runruby.rb --archdir=/tmp/ruby/build/trunk --extout=.ext -- /tmp/ruby/src/trunk/spec/mspec/bin/mspec-run -B /tmp/ruby/src/trunk/spec/default.mspec --error-output stderr --debug -fy -o /tmp/rubytest.upq5tx/20-mspec-multi-19 I, [2024-05-08T21:57:41.902001 #334153] INFO -- : ruby 3.4.0dev (2024-05-08T18:56:14Z master 442e398e62) [x86_64-linux] I, [2024-05-08T21:57:42.557754 #334153] INFO -- : 0 ......................................................................... I, [2024-05-08T21:57:42.932581 #334153] INFO -- : 73 ......................................................................... I, [2024-05-08T21:57:43.092696 #334153] INFO -- : 146 ......................................................................... I, [2024-05-08T21:57:43.160909 #334153] INFO -- : 219 ......................................................................... I, [2024-05-08T21:57:43.237969 #334153] INFO -- : 292 ......................................................................... I, [2024-05-08T21:57:43.278919 #334153] INFO -- : 365 ......................................................................... I, [2024-05-08T21:57:43.300446 #334153] INFO -- : 438 ......................................................................... I, [2024-05-08T21:57:43.323428 #334153] INFO -- : 511 ......................................................................... I, [2024-05-08T21:57:43.343667 #334153] INFO -- : 584 ......................................................................... I, [2024-05-08T21:57:43.389898 #334153] INFO -- : 657 ......................................................................... I, [2024-05-08T21:57:43.413594 #334153] INFO -- : 730 ......................................................................... I, [2024-05-08T21:57:43.432653 #334153] INFO -- : 803 ......................................................................... I, [2024-05-08T21:57:43.469268 #334153] INFO -- : 876 ......................................................................... I, [2024-05-08T21:57:43.520402 #334153] INFO -- : 949 ......................................................................... I, [2024-05-08T21:57:43.615255 #334153] INFO -- : 1022 ......................................................................... I, [2024-05-08T21:57:43.790948 #334153] INFO -- : 1095 ......................................................................... I, [2024-05-08T21:57:43.900764 #334153] INFO -- : 1168 ......................................................................... I, [2024-05-08T21:57:43.966551 #334153] INFO -- : 1241 ......................................................................... I, [2024-05-08T21:57:44.010952 #334153] INFO -- : 1314 ......................................................................... I, [2024-05-08T21:57:44.031910 #334153] INFO -- : 1387 ......................................................................... I, [2024-05-08T21:57:44.138398 #334153] INFO -- : 1460 ......................................................................... I, [2024-05-08T21:57:44.630142 #334153] INFO -- : 1533 ......................................................................... I, [2024-05-08T21:57:44.686134 #334153] INFO -- : 1606 ......................................................................... I, [2024-05-08T21:57:44.788863 #334153] INFO -- : 1679 ......................................................................... I, [2024-05-08T21:57:44.913229 #334153] INFO -- : 1752 ......................................................................... I, [2024-05-08T21:57:45.010933 #334153] INFO -- : 1825 ......................................................................... I, [2024-05-08T21:57:45.106110 #334153] INFO -- : 1898 ......................................................................... I, [2024-05-08T21:57:45.201090 #334153] INFO -- : 1971 ......................................................................... I, [2024-05-08T21:57:45.281528 #334153] INFO -- : 2044 ......................................................................... I, [2024-05-08T21:57:45.329619 #334153] INFO -- : 2117 ......................................................................... I, [2024-05-08T21:57:45.343319 #334153] INFO -- : 2190 ......................................................................... I, [2024-05-08T21:57:45.365274 #334153] INFO -- : 2263 ......................................................................... I, [2024-05-08T21:57:45.379306 #334153] INFO -- : 2336 ......................................................................... I, [2024-05-08T21:57:45.418587 #334153] INFO -- : 2409 ......................................................................... I, [2024-05-08T21:57:45.537519 #334153] INFO -- : 2482 ......................................................................... I, [2024-05-08T21:57:45.566873 #334153] INFO -- : 2555 ......................................................................... I, [2024-05-08T21:57:45.659368 #334153] INFO -- : 2628 ......................................................................... I, [2024-05-08T21:57:45.758001 #334153] INFO -- : 2701 ......................................................................... I, [2024-05-08T21:57:45.790864 #334153] INFO -- : 2774 ......................................................................... I, [2024-05-08T21:57:45.852010 #334153] INFO -- : 2847 ......................................................................... I, [2024-05-08T21:57:45.883478 #334153] INFO -- : 2920 ......................................................................... I, [2024-05-08T21:57:45.911424 #334153] INFO -- : 2993 ......................................................................... I, [2024-05-08T21:57:45.934475 #334153] INFO -- : 3066 ......................................................................... I, [2024-05-08T21:57:45.947855 #334153] INFO -- : 3139 ......................................................................... I, [2024-05-08T21:57:45.957302 #334153] INFO -- : 3212 ......................................................................... I, [2024-05-08T21:57:45.987103 #334153] INFO -- : 3285 ......................................................................... I, [2024-05-08T21:57:49.952281 #334153] INFO -- : 3358 ........................................................................ I, [2024-05-08T21:57:49.952344 #334153] INFO -- : I, [2024-05-08T21:57:49.952351 #334153] INFO -- : Finished in 8.242243 seconds I, [2024-05-08T21:57:49.952356 #334153] INFO -- : I, [2024-05-08T21:57:49.952360 #334153] INFO -- : 3429 files, 32610 examples, 167112 expectations, 0 failures, 0 errors, 0 tagged I, [2024-05-08T21:57:49.955070 #334153] INFO -- : $$$[end] "make yes-test-rubyspec MSPECOPT='--error-output stderr --debug -j' TESTS='-j20'" exit with 0.