# Logfile created on 2024-05-08 19:39:04 +0000 by logger.rb/v1.4.3 I, [2024-05-08T19:39:04.907493 #3137477] INFO -- : #, @formatter=nil, @logdev=#, @binmode=false, @mon_data=#, @mon_data_owner_object_id=860>>> I, [2024-05-08T19:39:04.907616 #3137477] INFO -- : $$$[beg] make update-unicode -j20 I, [2024-05-08T19:39:04.965479 #3137477] INFO -- : Downloading Unicode emoji 15.0 files... I, [2024-05-08T19:39:04.965639 #3137477] INFO -- : Downloading Unicode emoji 15.0 files... I, [2024-05-08T19:39:04.966376 #3137477] INFO -- : Downloading Unicode emoji 15.0 files... I, [2024-05-08T19:39:05.006858 #3137477] INFO -- : made symlink emoji/15.0/emoji-sequences.txt to /tmp/ruby/src/trunk/.downloaded-cache/emoji/15.0/emoji-sequences.txt I, [2024-05-08T19:39:05.006986 #3137477] INFO -- : downloading emoji/15.0/emoji-sequences.txt ... downloading emoji/15.0/emoji-test.txt ... /tmp/ruby/src/trunk/enc/unicode/data/emoji/15.0/emoji-sequences.txt already exists E, [2024-05-08T19:39:05.462498 #3137477] ERROR -- : /tmp/ruby/src/trunk/tool/downloader.rb:302:in `rescue in download': failed to download emoji/15.0/emoji-test.txt (RuntimeError) E, [2024-05-08T19:39:05.462532 #3137477] ERROR -- : OpenURI::HTTPError: 403 Forbidden: https://www.unicode.org/Public/emoji/15.0/emoji-test.txt E, [2024-05-08T19:39:05.462537 #3137477] ERROR -- : from /tmp/ruby/src/trunk/tool/downloader.rb:201:in `download' E, [2024-05-08T19:39:05.462541 #3137477] ERROR -- : from /tmp/ruby/src/trunk/tool/downloader.rb:136:in `download' E, [2024-05-08T19:39:05.462545 #3137477] ERROR -- : from /tmp/ruby/src/trunk/tool/downloader.rb:482:in `block in
' E, [2024-05-08T19:39:05.462549 #3137477] ERROR -- : from /tmp/ruby/src/trunk/tool/downloader.rb:465:in `each' E, [2024-05-08T19:39:05.462552 #3137477] ERROR -- : from /tmp/ruby/src/trunk/tool/downloader.rb:465:in `
' E, [2024-05-08T19:39:05.462555 #3137477] ERROR -- : /usr/lib/ruby/3.0.0/open-uri.rb:364:in `open_http': 403 Forbidden (OpenURI::HTTPError) E, [2024-05-08T19:39:05.462559 #3137477] ERROR -- : from /usr/lib/ruby/3.0.0/open-uri.rb:741:in `buffer_open' E, [2024-05-08T19:39:05.462563 #3137477] ERROR -- : from /usr/lib/ruby/3.0.0/open-uri.rb:212:in `block in open_loop' E, [2024-05-08T19:39:05.462567 #3137477] ERROR -- : from /usr/lib/ruby/3.0.0/open-uri.rb:210:in `catch' E, [2024-05-08T19:39:05.462570 #3137477] ERROR -- : from /usr/lib/ruby/3.0.0/open-uri.rb:210:in `open_loop' E, [2024-05-08T19:39:05.462574 #3137477] ERROR -- : from /usr/lib/ruby/3.0.0/open-uri.rb:151:in `open_uri' E, [2024-05-08T19:39:05.462577 #3137477] ERROR -- : from /usr/lib/ruby/3.0.0/open-uri.rb:721:in `open' E, [2024-05-08T19:39:05.462580 #3137477] ERROR -- : from /usr/lib/ruby/3.0.0/open-uri.rb:729:in `read' E, [2024-05-08T19:39:05.462584 #3137477] ERROR -- : from /tmp/ruby/src/trunk/tool/downloader.rb:247:in `block in download' E, [2024-05-08T19:39:05.462595 #3137477] ERROR -- : from /tmp/ruby/src/trunk/tool/downloader.rb:378:in `with_retry' E, [2024-05-08T19:39:05.462598 #3137477] ERROR -- : from /tmp/ruby/src/trunk/tool/downloader.rb:246:in `download' E, [2024-05-08T19:39:05.462604 #3137477] ERROR -- : from /tmp/ruby/src/trunk/tool/downloader.rb:136:in `download' E, [2024-05-08T19:39:05.462608 #3137477] ERROR -- : from /tmp/ruby/src/trunk/tool/downloader.rb:482:in `block in
' E, [2024-05-08T19:39:05.462611 #3137477] ERROR -- : from /tmp/ruby/src/trunk/tool/downloader.rb:465:in `each' E, [2024-05-08T19:39:05.462614 #3137477] ERROR -- : from /tmp/ruby/src/trunk/tool/downloader.rb:465:in `
' E, [2024-05-08T19:39:05.464582 #3137477] ERROR -- : make: *** [uncommon.mk:1787: /tmp/ruby/src/trunk/enc/unicode/data/emoji/15.0/emoji-sequences.txt] Error 1 E, [2024-05-08T19:39:05.464604 #3137477] ERROR -- : make: *** Deleting file '/tmp/ruby/src/trunk/enc/unicode/data/emoji/15.0/emoji-sequences.txt' E, [2024-05-08T19:39:05.464610 #3137477] ERROR -- : make: *** Waiting for unfinished jobs.... E, [2024-05-08T19:39:05.494090 #3137477] ERROR -- : /tmp/ruby/src/trunk/tool/downloader.rb:302:in `rescue in download': failed to download emoji/15.0/emoji-test.txt (RuntimeError) E, [2024-05-08T19:39:05.494112 #3137477] ERROR -- : OpenURI::HTTPError: 403 Forbidden: https://www.unicode.org/Public/emoji/15.0/emoji-test.txt E, [2024-05-08T19:39:05.494118 #3137477] ERROR -- : from /tmp/ruby/src/trunk/tool/downloader.rb:201:in `download' E, [2024-05-08T19:39:05.494122 #3137477] ERROR -- : from /tmp/ruby/src/trunk/tool/downloader.rb:136:in `download' E, [2024-05-08T19:39:05.494126 #3137477] ERROR -- : from /tmp/ruby/src/trunk/tool/downloader.rb:482:in `block in
' E, [2024-05-08T19:39:05.494130 #3137477] ERROR -- : from /tmp/ruby/src/trunk/tool/downloader.rb:465:in `each' E, [2024-05-08T19:39:05.494134 #3137477] ERROR -- : from /tmp/ruby/src/trunk/tool/downloader.rb:465:in `
' E, [2024-05-08T19:39:05.494138 #3137477] ERROR -- : /usr/lib/ruby/3.0.0/open-uri.rb:364:in `open_http': 403 Forbidden (OpenURI::HTTPError) E, [2024-05-08T19:39:05.494143 #3137477] ERROR -- : from /usr/lib/ruby/3.0.0/open-uri.rb:741:in `buffer_open' E, [2024-05-08T19:39:05.494147 #3137477] ERROR -- : from /usr/lib/ruby/3.0.0/open-uri.rb:212:in `block in open_loop' E, [2024-05-08T19:39:05.494151 #3137477] ERROR -- : from /usr/lib/ruby/3.0.0/open-uri.rb:210:in `catch' E, [2024-05-08T19:39:05.494155 #3137477] ERROR -- : from /usr/lib/ruby/3.0.0/open-uri.rb:210:in `open_loop' E, [2024-05-08T19:39:05.494159 #3137477] ERROR -- : from /usr/lib/ruby/3.0.0/open-uri.rb:151:in `open_uri' E, [2024-05-08T19:39:05.494162 #3137477] ERROR -- : from /usr/lib/ruby/3.0.0/open-uri.rb:721:in `open' E, [2024-05-08T19:39:05.494166 #3137477] ERROR -- : from /usr/lib/ruby/3.0.0/open-uri.rb:729:in `read' E, [2024-05-08T19:39:05.494170 #3137477] ERROR -- : from /tmp/ruby/src/trunk/tool/downloader.rb:247:in `block in download' E, [2024-05-08T19:39:05.494175 #3137477] ERROR -- : from /tmp/ruby/src/trunk/tool/downloader.rb:378:in `with_retry' E, [2024-05-08T19:39:05.494178 #3137477] ERROR -- : from /tmp/ruby/src/trunk/tool/downloader.rb:246:in `download' E, [2024-05-08T19:39:05.494182 #3137477] ERROR -- : from /tmp/ruby/src/trunk/tool/downloader.rb:136:in `download' E, [2024-05-08T19:39:05.494186 #3137477] ERROR -- : from /tmp/ruby/src/trunk/tool/downloader.rb:482:in `block in
' E, [2024-05-08T19:39:05.494190 #3137477] ERROR -- : from /tmp/ruby/src/trunk/tool/downloader.rb:465:in `each' E, [2024-05-08T19:39:05.494193 #3137477] ERROR -- : from /tmp/ruby/src/trunk/tool/downloader.rb:465:in `
' E, [2024-05-08T19:39:05.496001 #3137477] ERROR -- : make: *** [uncommon.mk:1787: /tmp/ruby/src/trunk/enc/unicode/data/emoji/15.0/emoji-zwj-sequences.txt] Error 1 E, [2024-05-08T19:39:05.945009 #3137477] ERROR -- : /tmp/ruby/src/trunk/tool/downloader.rb:302:in `rescue in download': failed to download emoji/15.0/emoji-sequences.txt (RuntimeError) E, [2024-05-08T19:39:05.945037 #3137477] ERROR -- : EOFError: end of file reached: https://www.unicode.org/Public/emoji/15.0/emoji-sequences.txt E, [2024-05-08T19:39:05.945043 #3137477] ERROR -- : from /tmp/ruby/src/trunk/tool/downloader.rb:201:in `download' E, [2024-05-08T19:39:05.945047 #3137477] ERROR -- : from /tmp/ruby/src/trunk/tool/downloader.rb:136:in `download' E, [2024-05-08T19:39:05.945051 #3137477] ERROR -- : from /tmp/ruby/src/trunk/tool/downloader.rb:482:in `block in
' E, [2024-05-08T19:39:05.945055 #3137477] ERROR -- : from /tmp/ruby/src/trunk/tool/downloader.rb:465:in `each' E, [2024-05-08T19:39:05.945059 #3137477] ERROR -- : from /tmp/ruby/src/trunk/tool/downloader.rb:465:in `
' E, [2024-05-08T19:39:05.945064 #3137477] ERROR -- : /usr/lib/ruby/3.0.0/net/protocol.rb:227:in `rbuf_fill': end of file reached (EOFError) E, [2024-05-08T19:39:05.945069 #3137477] ERROR -- : from /usr/lib/ruby/3.0.0/net/protocol.rb:193:in `readuntil' E, [2024-05-08T19:39:05.945072 #3137477] ERROR -- : from /usr/lib/ruby/3.0.0/net/protocol.rb:203:in `readline' E, [2024-05-08T19:39:05.945076 #3137477] ERROR -- : from /usr/lib/ruby/3.0.0/net/http/response.rb:42:in `read_status_line' E, [2024-05-08T19:39:05.945080 #3137477] ERROR -- : from /usr/lib/ruby/3.0.0/net/http/response.rb:31:in `read_new' E, [2024-05-08T19:39:05.945086 #3137477] ERROR -- : from /usr/lib/ruby/3.0.0/net/http.rb:1557:in `block in transport_request' E, [2024-05-08T19:39:05.945090 #3137477] ERROR -- : from /usr/lib/ruby/3.0.0/net/http.rb:1548:in `catch' E, [2024-05-08T19:39:05.945172 #3137477] ERROR -- : from /usr/lib/ruby/3.0.0/net/http.rb:1548:in `transport_request' E, [2024-05-08T19:39:05.945177 #3137477] ERROR -- : from /usr/lib/ruby/3.0.0/net/http.rb:1521:in `request' E, [2024-05-08T19:39:05.945181 #3137477] ERROR -- : from /usr/lib/ruby/3.0.0/open-uri.rb:329:in `block in open_http' E, [2024-05-08T19:39:05.945184 #3137477] ERROR -- : from /usr/lib/ruby/3.0.0/net/http.rb:960:in `start' E, [2024-05-08T19:39:05.945188 #3137477] ERROR -- : from /usr/lib/ruby/3.0.0/open-uri.rb:323:in `open_http' E, [2024-05-08T19:39:05.945192 #3137477] ERROR -- : from /usr/lib/ruby/3.0.0/open-uri.rb:741:in `buffer_open' E, [2024-05-08T19:39:05.945197 #3137477] ERROR -- : from /usr/lib/ruby/3.0.0/open-uri.rb:212:in `block in open_loop' E, [2024-05-08T19:39:05.945201 #3137477] ERROR -- : from /usr/lib/ruby/3.0.0/open-uri.rb:210:in `catch' E, [2024-05-08T19:39:05.945204 #3137477] ERROR -- : from /usr/lib/ruby/3.0.0/open-uri.rb:210:in `open_loop' E, [2024-05-08T19:39:05.945208 #3137477] ERROR -- : from /usr/lib/ruby/3.0.0/open-uri.rb:151:in `open_uri' E, [2024-05-08T19:39:05.945212 #3137477] ERROR -- : from /usr/lib/ruby/3.0.0/open-uri.rb:721:in `open' E, [2024-05-08T19:39:05.945216 #3137477] ERROR -- : from /usr/lib/ruby/3.0.0/open-uri.rb:729:in `read' E, [2024-05-08T19:39:05.945219 #3137477] ERROR -- : from /tmp/ruby/src/trunk/tool/downloader.rb:247:in `block in download' E, [2024-05-08T19:39:05.945223 #3137477] ERROR -- : from /tmp/ruby/src/trunk/tool/downloader.rb:378:in `with_retry' E, [2024-05-08T19:39:05.945227 #3137477] ERROR -- : from /tmp/ruby/src/trunk/tool/downloader.rb:246:in `download' E, [2024-05-08T19:39:05.945232 #3137477] ERROR -- : from /tmp/ruby/src/trunk/tool/downloader.rb:136:in `download' E, [2024-05-08T19:39:05.945236 #3137477] ERROR -- : from /tmp/ruby/src/trunk/tool/downloader.rb:482:in `block in
' E, [2024-05-08T19:39:05.945240 #3137477] ERROR -- : from /tmp/ruby/src/trunk/tool/downloader.rb:465:in `each' E, [2024-05-08T19:39:05.945243 #3137477] ERROR -- : from /tmp/ruby/src/trunk/tool/downloader.rb:465:in `
' E, [2024-05-08T19:39:05.947125 #3137477] ERROR -- : make: *** [uncommon.mk:1787: /tmp/ruby/src/trunk/enc/unicode/data/emoji/15.0/emoji-test.txt] Error 1 I, [2024-05-08T19:39:05.947170 #3137477] INFO -- : downloading emoji/15.0/emoji-test.txt ... I, [2024-05-08T19:39:05.947413 #3137477] INFO -- : $$$[end] "make update-unicode -j20" exit with 512. I, [2024-05-08T19:39:05.947438 #3137477] INFO -- : $$$[beg] make update-download -j20 I, [2024-05-08T19:39:06.045328 #3137477] INFO -- : tool/config.guess already exists I, [2024-05-08T19:39:06.045381 #3137477] INFO -- : tool/config.sub already exists I, [2024-05-08T19:39:06.047610 #3137477] INFO -- : Update minitest to ea9caafc0754b1d6236a490d59e624b53209734a I, [2024-05-08T19:39:06.047937 #3137477] INFO -- : Update power_assert to 84e85124c5014a139af39161d484156cfe87a9ed I, [2024-05-08T19:39:06.048055 #3137477] INFO -- : Update rbs to ba7872795d5de04adb8ff500c0e6afdc81a041dd I, [2024-05-08T19:39:06.048281 #3137477] INFO -- : Update typeprof to b19a6416da3a05d57fadd6ffdadb382b6d236ca5 I, [2024-05-08T19:39:06.049032 #3137477] INFO -- : echo ea9caafc0754b1d6236a490d59e624b53209734a | /bin/sh /tmp/ruby/src/trunk/tool/ifchange /tmp/ruby/src/trunk/.bundle/.timestamp/minitest.revision - I, [2024-05-08T19:39:06.049287 #3137477] INFO -- : echo 84e85124c5014a139af39161d484156cfe87a9ed | /bin/sh /tmp/ruby/src/trunk/tool/ifchange /tmp/ruby/src/trunk/.bundle/.timestamp/power_assert.revision - I, [2024-05-08T19:39:06.049444 #3137477] INFO -- : echo ba7872795d5de04adb8ff500c0e6afdc81a041dd | /bin/sh /tmp/ruby/src/trunk/tool/ifchange /tmp/ruby/src/trunk/.bundle/.timestamp/rbs.revision - I, [2024-05-08T19:39:06.049576 #3137477] INFO -- : echo b19a6416da3a05d57fadd6ffdadb382b6d236ca5 | /bin/sh /tmp/ruby/src/trunk/tool/ifchange /tmp/ruby/src/trunk/.bundle/.timestamp/typeprof.revision - I, [2024-05-08T19:39:06.050935 #3137477] INFO -- : /tmp/ruby/src/trunk/.bundle/.timestamp/power_assert.revision unchanged I, [2024-05-08T19:39:06.050960 #3137477] INFO -- : /tmp/ruby/src/trunk/.bundle/.timestamp/minitest.revision unchanged I, [2024-05-08T19:39:06.051190 #3137477] INFO -- : /tmp/ruby/src/trunk/.bundle/.timestamp/typeprof.revision unchanged I, [2024-05-08T19:39:06.051339 #3137477] INFO -- : /tmp/ruby/src/trunk/.bundle/.timestamp/rbs.revision unchanged I, [2024-05-08T19:39:06.052094 #3137477] INFO -- : Building power_assert@84e85124c5014a139af39161d484156cfe87a9ed to /tmp/ruby/src/trunk/gems/power_assert-2.0.3.gem I, [2024-05-08T19:39:06.121277 #3137477] INFO -- : Successfully built RubyGem I, [2024-05-08T19:39:06.121327 #3137477] INFO -- : Name: power_assert I, [2024-05-08T19:39:06.121337 #3137477] INFO -- : Version: 2.0.4dev I, [2024-05-08T19:39:06.121342 #3137477] INFO -- : File: power_assert-2.0.4dev.gem I, [2024-05-08T19:39:06.167017 #3137477] INFO -- : $$$[end] "make update-download -j20" exit with 0. I, [2024-05-08T19:39:06.167052 #3137477] INFO -- : $$$[beg] make update-rubyspec -j20 I, [2024-05-08T19:39:06.225743 #3137477] INFO -- : make: Nothing to be done for 'update-rubyspec'. I, [2024-05-08T19:39:06.225973 #3137477] INFO -- : $$$[end] "make update-rubyspec -j20" exit with 0. I, [2024-05-08T19:39:06.226014 #3137477] INFO -- : $$$[beg] make update-src -j20 I, [2024-05-08T19:39:06.760541 #3137477] INFO -- : Already up to date. I, [2024-05-08T19:39:06.769968 #3137477] INFO -- : Latest commit hash = 442e398e62 I, [2024-05-08T19:39:06.771085 #3137477] INFO -- : $$$[end] "make update-src -j20" exit with 0. I, [2024-05-08T19:39:06.771110 #3137477] INFO -- : $$$[beg] make after-update -j20 I, [2024-05-08T19:39:06.839382 #3137477] INFO -- : generating /tmp/ruby/src/trunk/ext/ripper/eventids2table.c I, [2024-05-08T19:39:06.843567 #3137477] INFO -- : make[1]: Entering directory '/tmp/ruby/src/trunk/ext/ripper' I, [2024-05-08T19:39:06.843618 #3137477] INFO -- : make[1]: Nothing to be done for 'src'. I, [2024-05-08T19:39:06.843633 #3137477] INFO -- : make[1]: Leaving directory '/tmp/ruby/src/trunk/ext/ripper' I, [2024-05-08T19:39:06.859936 #3137477] INFO -- : /tmp/ruby/src/trunk/revision.h updated I, [2024-05-08T19:39:06.861330 #3137477] INFO -- : generating x86_64-linux-fake.rb I, [2024-05-08T19:39:06.912541 #3137477] INFO -- : x86_64-linux-fake.rb updated I, [2024-05-08T19:39:06.913953 #3137477] INFO -- : generating enc.mk I, [2024-05-08T19:39:07.031383 #3137477] INFO -- : making srcs under enc I, [2024-05-08T19:39:07.060833 #3137477] INFO -- : make[1]: Entering directory '/tmp/ruby/build/trunk' I, [2024-05-08T19:39:07.060907 #3137477] INFO -- : make[1]: Nothing to be done for 'srcs'. I, [2024-05-08T19:39:07.060921 #3137477] INFO -- : make[1]: Leaving directory '/tmp/ruby/build/trunk' I, [2024-05-08T19:39:07.106125 #3137477] INFO -- : Update minitest to ea9caafc0754b1d6236a490d59e624b53209734a I, [2024-05-08T19:39:07.106284 #3137477] INFO -- : Update power_assert to 84e85124c5014a139af39161d484156cfe87a9ed I, [2024-05-08T19:39:07.107017 #3137477] INFO -- : Update rbs to ba7872795d5de04adb8ff500c0e6afdc81a041dd I, [2024-05-08T19:39:07.107066 #3137477] INFO -- : Update typeprof to b19a6416da3a05d57fadd6ffdadb382b6d236ca5 I, [2024-05-08T19:39:07.107568 #3137477] INFO -- : echo ea9caafc0754b1d6236a490d59e624b53209734a | /bin/sh /tmp/ruby/src/trunk/tool/ifchange /tmp/ruby/src/trunk/.bundle/.timestamp/minitest.revision - I, [2024-05-08T19:39:07.107617 #3137477] INFO -- : echo 84e85124c5014a139af39161d484156cfe87a9ed | /bin/sh /tmp/ruby/src/trunk/tool/ifchange /tmp/ruby/src/trunk/.bundle/.timestamp/power_assert.revision - I, [2024-05-08T19:39:07.108713 #3137477] INFO -- : echo ba7872795d5de04adb8ff500c0e6afdc81a041dd | /bin/sh /tmp/ruby/src/trunk/tool/ifchange /tmp/ruby/src/trunk/.bundle/.timestamp/rbs.revision - I, [2024-05-08T19:39:07.108872 #3137477] INFO -- : echo b19a6416da3a05d57fadd6ffdadb382b6d236ca5 | /bin/sh /tmp/ruby/src/trunk/tool/ifchange /tmp/ruby/src/trunk/.bundle/.timestamp/typeprof.revision - I, [2024-05-08T19:39:07.109496 #3137477] INFO -- : /tmp/ruby/src/trunk/.bundle/.timestamp/minitest.revision unchanged I, [2024-05-08T19:39:07.109518 #3137477] INFO -- : /tmp/ruby/src/trunk/.bundle/.timestamp/power_assert.revision unchanged I, [2024-05-08T19:39:07.110428 #3137477] INFO -- : /tmp/ruby/src/trunk/.bundle/.timestamp/typeprof.revision unchanged I, [2024-05-08T19:39:07.110478 #3137477] INFO -- : Building power_assert@84e85124c5014a139af39161d484156cfe87a9ed to /tmp/ruby/src/trunk/gems/power_assert-2.0.3.gem I, [2024-05-08T19:39:07.110611 #3137477] INFO -- : /tmp/ruby/src/trunk/.bundle/.timestamp/rbs.revision unchanged I, [2024-05-08T19:39:07.180006 #3137477] INFO -- : Successfully built RubyGem I, [2024-05-08T19:39:07.180074 #3137477] INFO -- : Name: power_assert I, [2024-05-08T19:39:07.180092 #3137477] INFO -- : Version: 2.0.4dev I, [2024-05-08T19:39:07.180116 #3137477] INFO -- : File: power_assert-2.0.4dev.gem I, [2024-05-08T19:39:07.182444 #3137477] INFO -- : Extracting bundle gem power_assert-2.0.3... I, [2024-05-08T19:39:07.244245 #3137477] INFO -- : Try with hash version of bundled gems instead of gems/power_assert-2.0.3.gem. We don't use this gem with release version of Ruby. I, [2024-05-08T19:39:07.249234 #3137477] INFO -- : Unpacked gems/power_assert-2.0.4dev.gem I, [2024-05-08T19:39:07.251567 #3137477] INFO -- : $$$[end] "make after-update -j20" exit with 0. I, [2024-05-08T19:39:07.251700 #3137477] INFO -- : $$$[beg] make miniruby -j20 I, [2024-05-08T19:39:07.309314 #3137477] INFO -- : BASERUBY = /usr/bin/ruby --disable=gems I, [2024-05-08T19:39:07.309340 #3137477] INFO -- : CC = gcc I, [2024-05-08T19:39:07.309345 #3137477] INFO -- : LD = ld I, [2024-05-08T19:39:07.309349 #3137477] INFO -- : LDSHARED = gcc -shared I, [2024-05-08T19:39:07.309353 #3137477] INFO -- : CFLAGS = -O3 -fno-fast-math -ggdb3 -Wall -Wextra -Wdeprecated-declarations -Wdiv-by-zero -Wduplicated-cond -Wimplicit-function-declaration -Wimplicit-int -Wpointer-arith -Wwrite-strings -Wold-style-definition -Wimplicit-fallthrough=0 -Wmissing-noreturn -Wno-cast-function-type -Wno-constant-logical-operand -Wno-long-long -Wno-missing-field-initializers -Wno-overlength-strings -Wno-packed-bitfield-compat -Wno-parentheses-equality -Wno-self-assign -Wno-tautological-compare -Wno-unused-parameter -Wno-unused-value -Wsuggest-attribute=format -Wsuggest-attribute=noreturn -Wunused-variable -Wmisleading-indentation -Wundef -fPIC I, [2024-05-08T19:39:07.309362 #3137477] INFO -- : XCFLAGS = -U_FORTIFY_SOURCE -D_FORTIFY_SOURCE=2 -fstack-protector-strong -fno-strict-overflow -fvisibility=hidden -fexcess-precision=standard -DRUBY_EXPORT -I. -I.ext/include/x86_64-linux -I/tmp/ruby/src/trunk/include -I/tmp/ruby/src/trunk -I/tmp/ruby/src/trunk/prism -I/tmp/ruby/src/trunk/enc/unicode/15.0.0 I, [2024-05-08T19:39:07.309372 #3137477] INFO -- : CPPFLAGS = I, [2024-05-08T19:39:07.309376 #3137477] INFO -- : DLDFLAGS = -Wl,--compress-debug-sections=zlib -Wl,-soname,libruby.so.3.4 -fstack-protector-strong I, [2024-05-08T19:39:07.309380 #3137477] INFO -- : SOLIBS = -lz -lrt -lrt -lgmp -ldl -lcrypt -lm -lpthread I, [2024-05-08T19:39:07.309384 #3137477] INFO -- : LANG = en_US.UTF-8 I, [2024-05-08T19:39:07.309387 #3137477] INFO -- : LC_ALL = I, [2024-05-08T19:39:07.309391 #3137477] INFO -- : LC_CTYPE = I, [2024-05-08T19:39:07.309394 #3137477] INFO -- : MFLAGS = -j20 --jobserver-auth=4,5 I, [2024-05-08T19:39:07.309398 #3137477] INFO -- : RUSTC = no I, [2024-05-08T19:39:07.309401 #3137477] INFO -- : YJIT_RUSTC_ARGS = --crate-name=yjit --crate-type=staticlib --edition=2021 -g -C lto=thin -C opt-level=3 -C overflow-checks=on '--out-dir=/tmp/ruby/build/trunk/yjit/target/release/' /tmp/ruby/src/trunk/yjit/src/lib.rs I, [2024-05-08T19:39:07.310716 #3137477] INFO -- : gcc (Ubuntu 11.4.0-1ubuntu1~22.04) 11.4.0 I, [2024-05-08T19:39:07.310736 #3137477] INFO -- : Copyright (C) 2021 Free Software Foundation, Inc. I, [2024-05-08T19:39:07.310742 #3137477] INFO -- : This is free software; see the source for copying conditions. There is NO I, [2024-05-08T19:39:07.310746 #3137477] INFO -- : warranty; not even for MERCHANTABILITY or FITNESS FOR A PARTICULAR PURPOSE. I, [2024-05-08T19:39:07.310750 #3137477] INFO -- : I, [2024-05-08T19:39:07.332243 #3137477] INFO -- : compiling /tmp/ruby/src/trunk/version.c I, [2024-05-08T19:39:07.436782 #3137477] INFO -- : linking miniruby I, [2024-05-08T19:39:07.951526 #3137477] INFO -- : $$$[end] "make miniruby -j20" exit with 0. I, [2024-05-08T19:39:07.951635 #3137477] INFO -- : $$$[beg] make ruby -j20 I, [2024-05-08T19:39:08.011047 #3137477] INFO -- : BASERUBY = /usr/bin/ruby --disable=gems I, [2024-05-08T19:39:08.011086 #3137477] INFO -- : CC = gcc I, [2024-05-08T19:39:08.011099 #3137477] INFO -- : LD = ld I, [2024-05-08T19:39:08.011110 #3137477] INFO -- : LDSHARED = gcc -shared I, [2024-05-08T19:39:08.011126 #3137477] INFO -- : CFLAGS = -O3 -fno-fast-math -ggdb3 -Wall -Wextra -Wdeprecated-declarations -Wdiv-by-zero -Wduplicated-cond -Wimplicit-function-declaration -Wimplicit-int -Wpointer-arith -Wwrite-strings -Wold-style-definition -Wimplicit-fallthrough=0 -Wmissing-noreturn -Wno-cast-function-type -Wno-constant-logical-operand -Wno-long-long -Wno-missing-field-initializers -Wno-overlength-strings -Wno-packed-bitfield-compat -Wno-parentheses-equality -Wno-self-assign -Wno-tautological-compare -Wno-unused-parameter -Wno-unused-value -Wsuggest-attribute=format -Wsuggest-attribute=noreturn -Wunused-variable -Wmisleading-indentation -Wundef -fPIC I, [2024-05-08T19:39:08.011138 #3137477] INFO -- : XCFLAGS = -U_FORTIFY_SOURCE -D_FORTIFY_SOURCE=2 -fstack-protector-strong -fno-strict-overflow -fvisibility=hidden -fexcess-precision=standard -DRUBY_EXPORT -I. -I.ext/include/x86_64-linux -I/tmp/ruby/src/trunk/include -I/tmp/ruby/src/trunk -I/tmp/ruby/src/trunk/prism -I/tmp/ruby/src/trunk/enc/unicode/15.0.0 I, [2024-05-08T19:39:08.011148 #3137477] INFO -- : CPPFLAGS = I, [2024-05-08T19:39:08.011159 #3137477] INFO -- : DLDFLAGS = -Wl,--compress-debug-sections=zlib -Wl,-soname,libruby.so.3.4 -fstack-protector-strong I, [2024-05-08T19:39:08.011169 #3137477] INFO -- : SOLIBS = -lz -lrt -lrt -lgmp -ldl -lcrypt -lm -lpthread I, [2024-05-08T19:39:08.011179 #3137477] INFO -- : LANG = en_US.UTF-8 I, [2024-05-08T19:39:08.011188 #3137477] INFO -- : LC_ALL = I, [2024-05-08T19:39:08.011198 #3137477] INFO -- : LC_CTYPE = I, [2024-05-08T19:39:08.011207 #3137477] INFO -- : MFLAGS = -j20 --jobserver-auth=4,5 I, [2024-05-08T19:39:08.011217 #3137477] INFO -- : RUSTC = no I, [2024-05-08T19:39:08.011227 #3137477] INFO -- : YJIT_RUSTC_ARGS = --crate-name=yjit --crate-type=staticlib --edition=2021 -g -C lto=thin -C opt-level=3 -C overflow-checks=on '--out-dir=/tmp/ruby/build/trunk/yjit/target/release/' /tmp/ruby/src/trunk/yjit/src/lib.rs I, [2024-05-08T19:39:08.012341 #3137477] INFO -- : gcc (Ubuntu 11.4.0-1ubuntu1~22.04) 11.4.0 I, [2024-05-08T19:39:08.012387 #3137477] INFO -- : Copyright (C) 2021 Free Software Foundation, Inc. I, [2024-05-08T19:39:08.012400 #3137477] INFO -- : This is free software; see the source for copying conditions. There is NO I, [2024-05-08T19:39:08.012412 #3137477] INFO -- : warranty; not even for MERCHANTABILITY or FITNESS FOR A PARTICULAR PURPOSE. I, [2024-05-08T19:39:08.012422 #3137477] INFO -- : I, [2024-05-08T19:39:08.118933 #3137477] INFO -- : builtin_binary.inc updated I, [2024-05-08T19:39:08.123413 #3137477] INFO -- : c5234a9416e4f20f175185e840b25b0f08674d14078ed7083f37e655458e3ca9 builtin_binary.inc I, [2024-05-08T19:39:08.124222 #3137477] INFO -- : compiling /tmp/ruby/src/trunk/builtin.c I, [2024-05-08T19:39:08.308242 #3137477] INFO -- : linking static-library libruby-static.a I, [2024-05-08T19:39:08.624287 #3137477] INFO -- : linking shared-library libruby.so.3.4.0 I, [2024-05-08T19:39:10.166884 #3137477] INFO -- : linking ruby I, [2024-05-08T19:39:10.190106 #3137477] INFO -- : $$$[end] "make ruby -j20" exit with 0. I, [2024-05-08T19:39:10.190212 #3137477] INFO -- : $$$[beg] make all -j20 I, [2024-05-08T19:39:10.247036 #3137477] INFO -- : BASERUBY = /usr/bin/ruby --disable=gems I, [2024-05-08T19:39:10.247066 #3137477] INFO -- : CC = gcc I, [2024-05-08T19:39:10.247071 #3137477] INFO -- : LD = ld I, [2024-05-08T19:39:10.247074 #3137477] INFO -- : LDSHARED = gcc -shared I, [2024-05-08T19:39:10.247080 #3137477] INFO -- : CFLAGS = -O3 -fno-fast-math -ggdb3 -Wall -Wextra -Wdeprecated-declarations -Wdiv-by-zero -Wduplicated-cond -Wimplicit-function-declaration -Wimplicit-int -Wpointer-arith -Wwrite-strings -Wold-style-definition -Wimplicit-fallthrough=0 -Wmissing-noreturn -Wno-cast-function-type -Wno-constant-logical-operand -Wno-long-long -Wno-missing-field-initializers -Wno-overlength-strings -Wno-packed-bitfield-compat -Wno-parentheses-equality -Wno-self-assign -Wno-tautological-compare -Wno-unused-parameter -Wno-unused-value -Wsuggest-attribute=format -Wsuggest-attribute=noreturn -Wunused-variable -Wmisleading-indentation -Wundef -fPIC I, [2024-05-08T19:39:10.247084 #3137477] INFO -- : XCFLAGS = -U_FORTIFY_SOURCE -D_FORTIFY_SOURCE=2 -fstack-protector-strong -fno-strict-overflow -fvisibility=hidden -fexcess-precision=standard -DRUBY_EXPORT -I. -I.ext/include/x86_64-linux -I/tmp/ruby/src/trunk/include -I/tmp/ruby/src/trunk -I/tmp/ruby/src/trunk/prism -I/tmp/ruby/src/trunk/enc/unicode/15.0.0 I, [2024-05-08T19:39:10.247088 #3137477] INFO -- : CPPFLAGS = I, [2024-05-08T19:39:10.247091 #3137477] INFO -- : DLDFLAGS = -Wl,--compress-debug-sections=zlib -Wl,-soname,libruby.so.3.4 -fstack-protector-strong I, [2024-05-08T19:39:10.247095 #3137477] INFO -- : SOLIBS = -lz -lrt -lrt -lgmp -ldl -lcrypt -lm -lpthread I, [2024-05-08T19:39:10.247099 #3137477] INFO -- : LANG = en_US.UTF-8 I, [2024-05-08T19:39:10.247102 #3137477] INFO -- : LC_ALL = I, [2024-05-08T19:39:10.247105 #3137477] INFO -- : LC_CTYPE = I, [2024-05-08T19:39:10.247109 #3137477] INFO -- : MFLAGS = -j20 --jobserver-auth=4,5 I, [2024-05-08T19:39:10.247112 #3137477] INFO -- : RUSTC = no I, [2024-05-08T19:39:10.247117 #3137477] INFO -- : YJIT_RUSTC_ARGS = --crate-name=yjit --crate-type=staticlib --edition=2021 -g -C lto=thin -C opt-level=3 -C overflow-checks=on '--out-dir=/tmp/ruby/build/trunk/yjit/target/release/' /tmp/ruby/src/trunk/yjit/src/lib.rs I, [2024-05-08T19:39:10.248346 #3137477] INFO -- : gcc (Ubuntu 11.4.0-1ubuntu1~22.04) 11.4.0 I, [2024-05-08T19:39:10.248366 #3137477] INFO -- : Copyright (C) 2021 Free Software Foundation, Inc. I, [2024-05-08T19:39:10.248372 #3137477] INFO -- : This is free software; see the source for copying conditions. There is NO I, [2024-05-08T19:39:10.248375 #3137477] INFO -- : warranty; not even for MERCHANTABILITY or FITNESS FOR A PARTICULAR PURPOSE. I, [2024-05-08T19:39:10.248385 #3137477] INFO -- : I, [2024-05-08T19:39:10.276647 #3137477] INFO -- : generating enc.mk I, [2024-05-08T19:39:10.278557 #3137477] INFO -- : building spec/ruby/optional/capi/ext/array_spec.so I, [2024-05-08T19:39:10.278862 #3137477] INFO -- : building spec/ruby/optional/capi/ext/basic_object_spec.so I, [2024-05-08T19:39:10.279236 #3137477] INFO -- : building spec/ruby/optional/capi/ext/bignum_spec.so I, [2024-05-08T19:39:10.279738 #3137477] INFO -- : building spec/ruby/optional/capi/ext/binding_spec.so I, [2024-05-08T19:39:10.280085 #3137477] INFO -- : building spec/ruby/optional/capi/ext/boolean_spec.so I, [2024-05-08T19:39:10.280996 #3137477] INFO -- : building spec/ruby/optional/capi/ext/class_id_under_autoload_spec.so I, [2024-05-08T19:39:10.281600 #3137477] INFO -- : building spec/ruby/optional/capi/ext/class_spec.so I, [2024-05-08T19:39:10.282215 #3137477] INFO -- : building spec/ruby/optional/capi/ext/class_under_autoload_spec.so I, [2024-05-08T19:39:10.283228 #3137477] INFO -- : building spec/ruby/optional/capi/ext/complex_spec.so I, [2024-05-08T19:39:10.283929 #3137477] INFO -- : building spec/ruby/optional/capi/ext/constants_spec.so I, [2024-05-08T19:39:10.284282 #3137477] INFO -- : building spec/ruby/optional/capi/ext/data_spec.so I, [2024-05-08T19:39:10.285110 #3137477] INFO -- : building spec/ruby/optional/capi/ext/debug_spec.so I, [2024-05-08T19:39:10.285765 #3137477] INFO -- : building spec/ruby/optional/capi/ext/encoding_spec.so I, [2024-05-08T19:39:10.286056 #3137477] INFO -- : building spec/ruby/optional/capi/ext/enumerator_spec.so I, [2024-05-08T19:39:10.286883 #3137477] INFO -- : building spec/ruby/optional/capi/ext/exception_spec.so I, [2024-05-08T19:39:10.287161 #3137477] INFO -- : building spec/ruby/optional/capi/ext/fiber_spec.so I, [2024-05-08T19:39:10.287880 #3137477] INFO -- : building spec/ruby/optional/capi/ext/file_spec.so I, [2024-05-08T19:39:10.288450 #3137477] INFO -- : building spec/ruby/optional/capi/ext/fixnum_spec.so I, [2024-05-08T19:39:10.294059 #3137477] INFO -- : building spec/ruby/optional/capi/ext/float_spec.so I, [2024-05-08T19:39:10.410178 #3137477] INFO -- : building spec/ruby/optional/capi/ext/gc_spec.so I, [2024-05-08T19:39:10.416495 #3137477] INFO -- : building spec/ruby/optional/capi/ext/globals_spec.so I, [2024-05-08T19:39:10.418212 #3137477] INFO -- : building spec/ruby/optional/capi/ext/hash_spec.so I, [2024-05-08T19:39:10.446464 #3137477] INFO -- : building spec/ruby/optional/capi/ext/io_spec.so I, [2024-05-08T19:39:10.446712 #3137477] INFO -- : building spec/ruby/optional/capi/ext/integer_spec.so I, [2024-05-08T19:39:10.447410 #3137477] INFO -- : building spec/ruby/optional/capi/ext/kernel_spec.so I, [2024-05-08T19:39:10.451651 #3137477] INFO -- : building spec/ruby/optional/capi/ext/language_spec.so I, [2024-05-08T19:39:10.459023 #3137477] INFO -- : building spec/ruby/optional/capi/ext/marshal_spec.so I, [2024-05-08T19:39:10.460416 #3137477] INFO -- : building spec/ruby/optional/capi/ext/module_spec.so I, [2024-05-08T19:39:10.461129 #3137477] INFO -- : building spec/ruby/optional/capi/ext/module_under_autoload_spec.so I, [2024-05-08T19:39:10.470907 #3137477] INFO -- : building spec/ruby/optional/capi/ext/mutex_spec.so I, [2024-05-08T19:39:10.475257 #3137477] INFO -- : building spec/ruby/optional/capi/ext/numeric_spec.so I, [2024-05-08T19:39:10.476187 #3137477] INFO -- : building spec/ruby/optional/capi/ext/object_spec.so I, [2024-05-08T19:39:10.491347 #3137477] INFO -- : building spec/ruby/optional/capi/ext/proc_spec.so I, [2024-05-08T19:39:10.525096 #3137477] INFO -- : building spec/ruby/optional/capi/ext/range_spec.so I, [2024-05-08T19:39:10.525779 #3137477] INFO -- : building spec/ruby/optional/capi/ext/rational_spec.so I, [2024-05-08T19:39:10.535993 #3137477] INFO -- : building spec/ruby/optional/capi/ext/rbasic_spec.so I, [2024-05-08T19:39:10.542393 #3137477] INFO -- : building spec/ruby/optional/capi/ext/regexp_spec.so I, [2024-05-08T19:39:10.591154 #3137477] INFO -- : building spec/ruby/optional/capi/ext/string_spec.so I, [2024-05-08T19:39:10.597345 #3137477] INFO -- : building spec/ruby/optional/capi/ext/struct_spec.so I, [2024-05-08T19:39:10.600797 #3137477] INFO -- : building spec/ruby/optional/capi/ext/st_spec.so I, [2024-05-08T19:39:10.604632 #3137477] INFO -- : building spec/ruby/optional/capi/ext/symbol_spec.so I, [2024-05-08T19:39:10.608915 #3137477] INFO -- : building spec/ruby/optional/capi/ext/thread_spec.so I, [2024-05-08T19:39:10.638464 #3137477] INFO -- : building spec/ruby/optional/capi/ext/time_spec.so I, [2024-05-08T19:39:10.639675 #3137477] INFO -- : building spec/ruby/optional/capi/ext/tracepoint_spec.so I, [2024-05-08T19:39:10.639881 #3137477] INFO -- : building spec/ruby/optional/capi/ext/typed_data_spec.so I, [2024-05-08T19:39:10.640347 #3137477] INFO -- : building spec/ruby/optional/capi/ext/util_spec.so I, [2024-05-08T19:39:10.640530 #3137477] INFO -- : making enc I, [2024-05-08T19:39:10.671655 #3137477] INFO -- : making srcs under enc I, [2024-05-08T19:39:10.672256 #3137477] INFO -- : make[1]: Entering directory '/tmp/ruby/build/trunk' I, [2024-05-08T19:39:10.672294 #3137477] INFO -- : make[1]: Nothing to be done for 'enc'. I, [2024-05-08T19:39:10.672303 #3137477] INFO -- : make[1]: Leaving directory '/tmp/ruby/build/trunk' I, [2024-05-08T19:39:10.718553 #3137477] INFO -- : make[1]: Entering directory '/tmp/ruby/build/trunk' I, [2024-05-08T19:39:10.718606 #3137477] INFO -- : make[1]: Nothing to be done for 'srcs'. I, [2024-05-08T19:39:10.718617 #3137477] INFO -- : make[1]: Leaving directory '/tmp/ruby/build/trunk' I, [2024-05-08T19:39:10.719243 #3137477] INFO -- : generating transdb.h I, [2024-05-08T19:39:10.821344 #3137477] INFO -- : transdb.h unchanged I, [2024-05-08T19:39:10.822899 #3137477] INFO -- : generating makefiles ext/configure-ext.mk I, [2024-05-08T19:39:10.822930 #3137477] INFO -- : making trans I, [2024-05-08T19:39:10.849921 #3137477] INFO -- : ext/configure-ext.mk updated I, [2024-05-08T19:39:10.852449 #3137477] INFO -- : make[1]: Entering directory '/tmp/ruby/build/trunk' I, [2024-05-08T19:39:10.858011 #3137477] INFO -- : make[1]: Entering directory '/tmp/ruby/build/trunk' I, [2024-05-08T19:39:10.858101 #3137477] INFO -- : make[1]: Nothing to be done for 'trans'. I, [2024-05-08T19:39:10.859360 #3137477] INFO -- : make[1]: Leaving directory '/tmp/ruby/build/trunk' I, [2024-05-08T19:39:10.872893 #3137477] INFO -- : making encs I, [2024-05-08T19:39:10.984690 #3137477] INFO -- : make[1]: Entering directory '/tmp/ruby/build/trunk' I, [2024-05-08T19:39:10.984751 #3137477] INFO -- : make[1]: Nothing to be done for 'encs'. I, [2024-05-08T19:39:10.984758 #3137477] INFO -- : make[1]: Leaving directory '/tmp/ruby/build/trunk' I, [2024-05-08T19:39:11.018957 #3137477] INFO -- : make[1]: Leaving directory '/tmp/ruby/build/trunk' I, [2024-05-08T19:39:11.019509 #3137477] INFO -- : generating makefile exts.mk I, [2024-05-08T19:39:11.057160 #3137477] INFO -- : exts.mk unchanged I, [2024-05-08T19:39:11.061938 #3137477] INFO -- : make[1]: Entering directory '/tmp/ruby/build/trunk' I, [2024-05-08T19:39:11.082161 #3137477] INFO -- : make[2]: Entering directory '/tmp/ruby/build/trunk/ext/digest' I, [2024-05-08T19:39:11.083093 #3137477] INFO -- : make[2]: Entering directory '/tmp/ruby/build/trunk/ext/coverage' I, [2024-05-08T19:39:11.084042 #3137477] INFO -- : make[2]: Entering directory '/tmp/ruby/build/trunk/ext/date' I, [2024-05-08T19:39:11.084642 #3137477] INFO -- : make[2]: Entering directory '/tmp/ruby/build/trunk/ext/json' I, [2024-05-08T19:39:11.084942 #3137477] INFO -- : make[2]: Entering directory '/tmp/ruby/build/trunk/ext/io/console' I, [2024-05-08T19:39:11.085848 #3137477] INFO -- : make[2]: Leaving directory '/tmp/ruby/build/trunk/ext/coverage' I, [2024-05-08T19:39:11.086134 #3137477] INFO -- : make[2]: Leaving directory '/tmp/ruby/build/trunk/ext/digest' I, [2024-05-08T19:39:11.086752 #3137477] INFO -- : make[2]: Entering directory '/tmp/ruby/build/trunk/ext/monitor' I, [2024-05-08T19:39:11.087266 #3137477] INFO -- : make[2]: Entering directory '/tmp/ruby/build/trunk/ext/pathname' I, [2024-05-08T19:39:11.087382 #3137477] INFO -- : make[2]: Leaving directory '/tmp/ruby/build/trunk/ext/date' I, [2024-05-08T19:39:11.087408 #3137477] INFO -- : make[2]: Entering directory '/tmp/ruby/build/trunk/ext/rubyvm' I, [2024-05-08T19:39:11.087420 #3137477] INFO -- : make[2]: Entering directory '/tmp/ruby/build/trunk/ext/fiddle' I, [2024-05-08T19:39:11.087749 #3137477] INFO -- : make[2]: Leaving directory '/tmp/ruby/build/trunk/ext/io/console' I, [2024-05-08T19:39:11.088960 #3137477] INFO -- : make[2]: Entering directory '/tmp/ruby/build/trunk/ext/pty' I, [2024-05-08T19:39:11.089322 #3137477] INFO -- : make[2]: Entering directory '/tmp/ruby/build/trunk/ext/objspace' I, [2024-05-08T19:39:11.089643 #3137477] INFO -- : make[2]: Entering directory '/tmp/ruby/build/trunk/ext/psych' I, [2024-05-08T19:39:11.089832 #3137477] INFO -- : make[2]: Leaving directory '/tmp/ruby/build/trunk/ext/pathname' I, [2024-05-08T19:39:11.090004 #3137477] INFO -- : make[2]: Entering directory '/tmp/ruby/build/trunk/.bundle/gems/bigdecimal-3.1.7/ext/bigdecimal' I, [2024-05-08T19:39:11.090033 #3137477] INFO -- : make[2]: Leaving directory '/tmp/ruby/build/trunk/ext/monitor' I, [2024-05-08T19:39:11.090120 #3137477] INFO -- : make[2]: Leaving directory '/tmp/ruby/build/trunk/ext/rubyvm' I, [2024-05-08T19:39:11.090267 #3137477] INFO -- : make[2]: Entering directory '/tmp/ruby/build/trunk/.bundle/gems/bigdecimal-3.1.8/ext/bigdecimal' I, [2024-05-08T19:39:11.090370 #3137477] INFO -- : make[2]: Entering directory '/tmp/ruby/build/trunk/.bundle/gems/debug-1.9.2/ext/debug' I, [2024-05-08T19:39:11.090435 #3137477] INFO -- : make[2]: Leaving directory '/tmp/ruby/build/trunk/ext/json' I, [2024-05-08T19:39:11.091009 #3137477] INFO -- : make[2]: Entering directory '/tmp/ruby/build/trunk/.bundle/gems/nkf-0.2.0/ext/nkf' I, [2024-05-08T19:39:11.092245 #3137477] INFO -- : make[2]: Leaving directory '/tmp/ruby/build/trunk/ext/pty' I, [2024-05-08T19:39:11.092598 #3137477] INFO -- : make[2]: Entering directory '/tmp/ruby/build/trunk/.bundle/gems/racc-1.7.3/ext/racc/cparse' I, [2024-05-08T19:39:11.092831 #3137477] INFO -- : make[2]: Entering directory '/tmp/ruby/build/trunk/.bundle/gems/syslog-0.1.2/ext/syslog' I, [2024-05-08T19:39:11.093151 #3137477] INFO -- : make[2]: Entering directory '/tmp/ruby/build/trunk/ext/ripper' I, [2024-05-08T19:39:11.093454 #3137477] INFO -- : make[2]: Entering directory '/tmp/ruby/build/trunk/.bundle/gems/rbs-3.4.4/ext/rbs_extension' I, [2024-05-08T19:39:11.094563 #3137477] INFO -- : make[2]: Leaving directory '/tmp/ruby/build/trunk/ext/objspace' I, [2024-05-08T19:39:11.097007 #3137477] INFO -- : make[2]: Leaving directory '/tmp/ruby/build/trunk/ext/fiddle' I, [2024-05-08T19:39:11.097537 #3137477] INFO -- : make[2]: Entering directory '/tmp/ruby/build/trunk/ext/socket' I, [2024-05-08T19:39:11.100064 #3137477] INFO -- : make[2]: Leaving directory '/tmp/ruby/build/trunk/ext/ripper' I, [2024-05-08T19:39:11.100418 #3137477] INFO -- : make[2]: Entering directory '/tmp/ruby/build/trunk/ext/digest/sha2' I, [2024-05-08T19:39:11.101110 #3137477] INFO -- : make[2]: Leaving directory '/tmp/ruby/build/trunk/ext/psych' I, [2024-05-08T19:39:11.102003 #3137477] INFO -- : make[2]: Entering directory '/tmp/ruby/build/trunk/ext/openssl' I, [2024-05-08T19:39:11.102827 #3137477] INFO -- : make[2]: Leaving directory '/tmp/ruby/build/trunk/ext/digest/sha2' I, [2024-05-08T19:39:11.104852 #3137477] INFO -- : make[2]: Leaving directory '/tmp/ruby/build/trunk/ext/socket' I, [2024-05-08T19:39:11.113263 #3137477] INFO -- : make[2]: Leaving directory '/tmp/ruby/build/trunk/ext/openssl' I, [2024-05-08T19:39:11.114657 #3137477] INFO -- : make[2]: Leaving directory '/tmp/ruby/build/trunk/.bundle/gems/racc-1.7.3/ext/racc/cparse' I, [2024-05-08T19:39:11.114930 #3137477] INFO -- : make[2]: Leaving directory '/tmp/ruby/build/trunk/.bundle/gems/debug-1.9.2/ext/debug' I, [2024-05-08T19:39:11.119524 #3137477] INFO -- : make[2]: Leaving directory '/tmp/ruby/build/trunk/.bundle/gems/syslog-0.1.2/ext/syslog' I, [2024-05-08T19:39:11.122370 #3137477] INFO -- : make[2]: Leaving directory '/tmp/ruby/build/trunk/.bundle/gems/bigdecimal-3.1.7/ext/bigdecimal' I, [2024-05-08T19:39:11.123451 #3137477] INFO -- : make[2]: Leaving directory '/tmp/ruby/build/trunk/.bundle/gems/nkf-0.2.0/ext/nkf' I, [2024-05-08T19:39:11.123855 #3137477] INFO -- : make[2]: Leaving directory '/tmp/ruby/build/trunk/.bundle/gems/bigdecimal-3.1.8/ext/bigdecimal' I, [2024-05-08T19:39:11.125788 #3137477] INFO -- : make[2]: Leaving directory '/tmp/ruby/build/trunk/.bundle/gems/rbs-3.4.4/ext/rbs_extension' I, [2024-05-08T19:39:11.149433 #3137477] INFO -- : make[2]: Entering directory '/tmp/ruby/build/trunk' I, [2024-05-08T19:39:11.216039 #3137477] INFO -- : linking ruby I, [2024-05-08T19:39:11.238856 #3137477] INFO -- : make[2]: Leaving directory '/tmp/ruby/build/trunk' I, [2024-05-08T19:39:11.239349 #3137477] INFO -- : make[1]: Leaving directory '/tmp/ruby/build/trunk' I, [2024-05-08T19:39:11.243263 #3137477] INFO -- : make[1]: Entering directory '/tmp/ruby/build/trunk' I, [2024-05-08T19:39:11.243292 #3137477] INFO -- : make[1]: Nothing to be done for 'note'. I, [2024-05-08T19:39:11.243301 #3137477] INFO -- : make[1]: Leaving directory '/tmp/ruby/build/trunk' I, [2024-05-08T19:39:11.244100 #3137477] INFO -- : $$$[end] "make all -j20" exit with 0. I, [2024-05-08T19:39:11.244241 #3137477] INFO -- : $$$[beg] make install -j20 I, [2024-05-08T19:39:11.308142 #3137477] INFO -- : Update minitest to ea9caafc0754b1d6236a490d59e624b53209734a I, [2024-05-08T19:39:11.308253 #3137477] INFO -- : Update power_assert to 84e85124c5014a139af39161d484156cfe87a9ed I, [2024-05-08T19:39:11.308510 #3137477] INFO -- : Update rbs to ba7872795d5de04adb8ff500c0e6afdc81a041dd I, [2024-05-08T19:39:11.308891 #3137477] INFO -- : Update typeprof to b19a6416da3a05d57fadd6ffdadb382b6d236ca5 I, [2024-05-08T19:39:11.310459 #3137477] INFO -- : echo ea9caafc0754b1d6236a490d59e624b53209734a | /bin/sh /tmp/ruby/src/trunk/tool/ifchange /tmp/ruby/src/trunk/.bundle/.timestamp/minitest.revision - I, [2024-05-08T19:39:11.310657 #3137477] INFO -- : echo 84e85124c5014a139af39161d484156cfe87a9ed | /bin/sh /tmp/ruby/src/trunk/tool/ifchange /tmp/ruby/src/trunk/.bundle/.timestamp/power_assert.revision - I, [2024-05-08T19:39:11.310967 #3137477] INFO -- : echo ba7872795d5de04adb8ff500c0e6afdc81a041dd | /bin/sh /tmp/ruby/src/trunk/tool/ifchange /tmp/ruby/src/trunk/.bundle/.timestamp/rbs.revision - I, [2024-05-08T19:39:11.311790 #3137477] INFO -- : BASERUBY = /usr/bin/ruby --disable=gems I, [2024-05-08T19:39:11.311825 #3137477] INFO -- : CC = gcc I, [2024-05-08T19:39:11.311841 #3137477] INFO -- : LD = ld I, [2024-05-08T19:39:11.311854 #3137477] INFO -- : LDSHARED = gcc -shared I, [2024-05-08T19:39:11.311868 #3137477] INFO -- : CFLAGS = -O3 -fno-fast-math -ggdb3 -Wall -Wextra -Wdeprecated-declarations -Wdiv-by-zero -Wduplicated-cond -Wimplicit-function-declaration -Wimplicit-int -Wpointer-arith -Wwrite-strings -Wold-style-definition -Wimplicit-fallthrough=0 -Wmissing-noreturn -Wno-cast-function-type -Wno-constant-logical-operand -Wno-long-long -Wno-missing-field-initializers -Wno-overlength-strings -Wno-packed-bitfield-compat -Wno-parentheses-equality -Wno-self-assign -Wno-tautological-compare -Wno-unused-parameter -Wno-unused-value -Wsuggest-attribute=format -Wsuggest-attribute=noreturn -Wunused-variable -Wmisleading-indentation -Wundef -fPIC I, [2024-05-08T19:39:11.311882 #3137477] INFO -- : XCFLAGS = -U_FORTIFY_SOURCE -D_FORTIFY_SOURCE=2 -fstack-protector-strong -fno-strict-overflow -fvisibility=hidden -fexcess-precision=standard -DRUBY_EXPORT -I. -I.ext/include/x86_64-linux -I/tmp/ruby/src/trunk/include -I/tmp/ruby/src/trunk -I/tmp/ruby/src/trunk/prism -I/tmp/ruby/src/trunk/enc/unicode/15.0.0 I, [2024-05-08T19:39:11.311895 #3137477] INFO -- : CPPFLAGS = I, [2024-05-08T19:39:11.311908 #3137477] INFO -- : DLDFLAGS = -Wl,--compress-debug-sections=zlib -Wl,-soname,libruby.so.3.4 -fstack-protector-strong I, [2024-05-08T19:39:11.311930 #3137477] INFO -- : SOLIBS = -lz -lrt -lrt -lgmp -ldl -lcrypt -lm -lpthread I, [2024-05-08T19:39:11.311943 #3137477] INFO -- : LANG = en_US.UTF-8 I, [2024-05-08T19:39:11.311954 #3137477] INFO -- : LC_ALL = I, [2024-05-08T19:39:11.311966 #3137477] INFO -- : LC_CTYPE = I, [2024-05-08T19:39:11.311983 #3137477] INFO -- : MFLAGS = -j20 --jobserver-auth=4,5 I, [2024-05-08T19:39:11.311994 #3137477] INFO -- : RUSTC = no I, [2024-05-08T19:39:11.312006 #3137477] INFO -- : YJIT_RUSTC_ARGS = --crate-name=yjit --crate-type=staticlib --edition=2021 -g -C lto=thin -C opt-level=3 -C overflow-checks=on '--out-dir=/tmp/ruby/build/trunk/yjit/target/release/' /tmp/ruby/src/trunk/yjit/src/lib.rs I, [2024-05-08T19:39:11.312363 #3137477] INFO -- : /tmp/ruby/src/trunk/.bundle/.timestamp/minitest.revision unchanged I, [2024-05-08T19:39:11.312801 #3137477] INFO -- : /tmp/ruby/src/trunk/.bundle/.timestamp/rbs.revision unchanged I, [2024-05-08T19:39:11.312831 #3137477] INFO -- : /tmp/ruby/src/trunk/.bundle/.timestamp/power_assert.revision unchanged I, [2024-05-08T19:39:11.348896 #3137477] INFO -- : echo b19a6416da3a05d57fadd6ffdadb382b6d236ca5 | /bin/sh /tmp/ruby/src/trunk/tool/ifchange /tmp/ruby/src/trunk/.bundle/.timestamp/typeprof.revision - I, [2024-05-08T19:39:11.349625 #3137477] INFO -- : generating enc.mk I, [2024-05-08T19:39:11.349659 #3137477] INFO -- : gcc (Ubuntu 11.4.0-1ubuntu1~22.04) 11.4.0 I, [2024-05-08T19:39:11.349672 #3137477] INFO -- : Copyright (C) 2021 Free Software Foundation, Inc. I, [2024-05-08T19:39:11.349683 #3137477] INFO -- : This is free software; see the source for copying conditions. There is NO I, [2024-05-08T19:39:11.349695 #3137477] INFO -- : warranty; not even for MERCHANTABILITY or FITNESS FOR A PARTICULAR PURPOSE. I, [2024-05-08T19:39:11.349705 #3137477] INFO -- : I, [2024-05-08T19:39:11.350982 #3137477] INFO -- : /tmp/ruby/src/trunk/.bundle/.timestamp/typeprof.revision unchanged I, [2024-05-08T19:39:11.474284 #3137477] INFO -- : Building power_assert@84e85124c5014a139af39161d484156cfe87a9ed to /tmp/ruby/src/trunk/gems/power_assert-2.0.3.gem I, [2024-05-08T19:39:11.475200 #3137477] INFO -- : making srcs under enc I, [2024-05-08T19:39:11.475460 #3137477] INFO -- : making enc I, [2024-05-08T19:39:11.492418 #3137477] INFO -- : make[1]: Entering directory '/tmp/ruby/build/trunk' I, [2024-05-08T19:39:11.492482 #3137477] INFO -- : make[1]: Nothing to be done for 'enc'. I, [2024-05-08T19:39:11.492495 #3137477] INFO -- : make[1]: Leaving directory '/tmp/ruby/build/trunk' I, [2024-05-08T19:39:11.504909 #3137477] INFO -- : make[1]: Entering directory '/tmp/ruby/build/trunk' I, [2024-05-08T19:39:11.504964 #3137477] INFO -- : make[1]: Nothing to be done for 'srcs'. I, [2024-05-08T19:39:11.504977 #3137477] INFO -- : make[1]: Leaving directory '/tmp/ruby/build/trunk' I, [2024-05-08T19:39:11.505784 #3137477] INFO -- : generating transdb.h I, [2024-05-08T19:39:11.543411 #3137477] INFO -- : Successfully built RubyGem I, [2024-05-08T19:39:11.543479 #3137477] INFO -- : Name: power_assert I, [2024-05-08T19:39:11.543493 #3137477] INFO -- : Version: 2.0.4dev I, [2024-05-08T19:39:11.543505 #3137477] INFO -- : File: power_assert-2.0.4dev.gem I, [2024-05-08T19:39:11.545612 #3137477] INFO -- : Extracting bundle gem power_assert-2.0.3... I, [2024-05-08T19:39:11.600418 #3137477] INFO -- : transdb.h unchanged I, [2024-05-08T19:39:11.602033 #3137477] INFO -- : generating makefiles ext/configure-ext.mk I, [2024-05-08T19:39:11.602392 #3137477] INFO -- : making trans I, [2024-05-08T19:39:11.606669 #3137477] INFO -- : Try with hash version of bundled gems instead of gems/power_assert-2.0.3.gem. We don't use this gem with release version of Ruby. I, [2024-05-08T19:39:11.611659 #3137477] INFO -- : Unpacked gems/power_assert-2.0.4dev.gem I, [2024-05-08T19:39:11.628987 #3137477] INFO -- : ext/configure-ext.mk unchanged I, [2024-05-08T19:39:11.631591 #3137477] INFO -- : make[1]: Entering directory '/tmp/ruby/build/trunk' I, [2024-05-08T19:39:11.638228 #3137477] INFO -- : make[1]: Entering directory '/tmp/ruby/build/trunk' I, [2024-05-08T19:39:11.638322 #3137477] INFO -- : make[1]: Nothing to be done for 'trans'. I, [2024-05-08T19:39:11.638335 #3137477] INFO -- : make[1]: Leaving directory '/tmp/ruby/build/trunk' I, [2024-05-08T19:39:11.724816 #3137477] INFO -- : making encs I, [2024-05-08T19:39:11.775282 #3137477] INFO -- : make[1]: Entering directory '/tmp/ruby/build/trunk' I, [2024-05-08T19:39:11.775338 #3137477] INFO -- : make[1]: Nothing to be done for 'encs'. I, [2024-05-08T19:39:11.775347 #3137477] INFO -- : make[1]: Leaving directory '/tmp/ruby/build/trunk' I, [2024-05-08T19:39:11.790022 #3137477] INFO -- : make[1]: Leaving directory '/tmp/ruby/build/trunk' I, [2024-05-08T19:39:11.790663 #3137477] INFO -- : generating makefile exts.mk I, [2024-05-08T19:39:11.828246 #3137477] INFO -- : exts.mk unchanged I, [2024-05-08T19:39:11.832982 #3137477] INFO -- : make[1]: Entering directory '/tmp/ruby/build/trunk' I, [2024-05-08T19:39:11.852073 #3137477] INFO -- : make[2]: Entering directory '/tmp/ruby/build/trunk/ext/digest' I, [2024-05-08T19:39:11.853861 #3137477] INFO -- : make[2]: Entering directory '/tmp/ruby/build/trunk/ext/coverage' I, [2024-05-08T19:39:11.854253 #3137477] INFO -- : make[2]: Entering directory '/tmp/ruby/build/trunk/ext/date' I, [2024-05-08T19:39:11.854453 #3137477] INFO -- : make[2]: Entering directory '/tmp/ruby/build/trunk/ext/json' I, [2024-05-08T19:39:11.855607 #3137477] INFO -- : make[2]: Leaving directory '/tmp/ruby/build/trunk/ext/digest' I, [2024-05-08T19:39:11.855931 #3137477] INFO -- : make[2]: Entering directory '/tmp/ruby/build/trunk/ext/io/console' I, [2024-05-08T19:39:11.856064 #3137477] INFO -- : make[2]: Entering directory '/tmp/ruby/build/trunk/ext/rubyvm' I, [2024-05-08T19:39:11.856549 #3137477] INFO -- : make[2]: Entering directory '/tmp/ruby/build/trunk/ext/monitor' I, [2024-05-08T19:39:11.856917 #3137477] INFO -- : make[2]: Leaving directory '/tmp/ruby/build/trunk/ext/coverage' I, [2024-05-08T19:39:11.856958 #3137477] INFO -- : make[2]: Entering directory '/tmp/ruby/build/trunk/ext/fiddle' I, [2024-05-08T19:39:11.857091 #3137477] INFO -- : make[2]: Entering directory '/tmp/ruby/build/trunk/ext/pathname' I, [2024-05-08T19:39:11.857766 #3137477] INFO -- : make[2]: Entering directory '/tmp/ruby/build/trunk/ext/pty' I, [2024-05-08T19:39:11.858019 #3137477] INFO -- : make[2]: Leaving directory '/tmp/ruby/build/trunk/ext/rubyvm' I, [2024-05-08T19:39:11.858184 #3137477] INFO -- : make[2]: Leaving directory '/tmp/ruby/build/trunk/ext/io/console' I, [2024-05-08T19:39:11.858543 #3137477] INFO -- : make[2]: Leaving directory '/tmp/ruby/build/trunk/ext/date' I, [2024-05-08T19:39:11.858770 #3137477] INFO -- : make[2]: Entering directory '/tmp/ruby/build/trunk/ext/psych' I, [2024-05-08T19:39:11.858914 #3137477] INFO -- : make[2]: Entering directory '/tmp/ruby/build/trunk/ext/objspace' I, [2024-05-08T19:39:11.859269 #3137477] INFO -- : make[2]: Leaving directory '/tmp/ruby/build/trunk/ext/monitor' I, [2024-05-08T19:39:11.859720 #3137477] INFO -- : make[2]: Leaving directory '/tmp/ruby/build/trunk/ext/pathname' I, [2024-05-08T19:39:11.859913 #3137477] INFO -- : make[2]: Leaving directory '/tmp/ruby/build/trunk/ext/pty' I, [2024-05-08T19:39:11.862152 #3137477] INFO -- : make[2]: Entering directory '/tmp/ruby/build/trunk/.bundle/gems/bigdecimal-3.1.7/ext/bigdecimal' I, [2024-05-08T19:39:11.862186 #3137477] INFO -- : make[2]: Entering directory '/tmp/ruby/build/trunk/.bundle/gems/debug-1.9.2/ext/debug' I, [2024-05-08T19:39:11.862271 #3137477] INFO -- : make[2]: Entering directory '/tmp/ruby/build/trunk/.bundle/gems/bigdecimal-3.1.8/ext/bigdecimal' I, [2024-05-08T19:39:11.862322 #3137477] INFO -- : make[2]: Entering directory '/tmp/ruby/build/trunk/.bundle/gems/nkf-0.2.0/ext/nkf' I, [2024-05-08T19:39:11.862355 #3137477] INFO -- : make[2]: Entering directory '/tmp/ruby/build/trunk/.bundle/gems/racc-1.7.3/ext/racc/cparse' I, [2024-05-08T19:39:11.862547 #3137477] INFO -- : make[2]: Leaving directory '/tmp/ruby/build/trunk/ext/fiddle' I, [2024-05-08T19:39:11.862675 #3137477] INFO -- : make[2]: Entering directory '/tmp/ruby/build/trunk/.bundle/gems/syslog-0.1.2/ext/syslog' I, [2024-05-08T19:39:11.862695 #3137477] INFO -- : make[2]: Entering directory '/tmp/ruby/build/trunk/ext/ripper' I, [2024-05-08T19:39:11.862944 #3137477] INFO -- : make[2]: Entering directory '/tmp/ruby/build/trunk/.bundle/gems/rbs-3.4.4/ext/rbs_extension' I, [2024-05-08T19:39:11.863185 #3137477] INFO -- : make[2]: Leaving directory '/tmp/ruby/build/trunk/ext/objspace' I, [2024-05-08T19:39:11.863997 #3137477] INFO -- : make[2]: Leaving directory '/tmp/ruby/build/trunk/ext/json' I, [2024-05-08T19:39:11.867954 #3137477] INFO -- : make[2]: Entering directory '/tmp/ruby/build/trunk/ext/socket' I, [2024-05-08T19:39:11.868495 #3137477] INFO -- : make[2]: Entering directory '/tmp/ruby/build/trunk/ext/digest/sha2' I, [2024-05-08T19:39:11.870370 #3137477] INFO -- : make[2]: Leaving directory '/tmp/ruby/build/trunk/ext/ripper' I, [2024-05-08T19:39:11.870810 #3137477] INFO -- : make[2]: Entering directory '/tmp/ruby/build/trunk/ext/openssl' I, [2024-05-08T19:39:11.870861 #3137477] INFO -- : make[2]: Leaving directory '/tmp/ruby/build/trunk/ext/psych' I, [2024-05-08T19:39:11.871855 #3137477] INFO -- : make[2]: Leaving directory '/tmp/ruby/build/trunk/ext/digest/sha2' I, [2024-05-08T19:39:11.874040 #3137477] INFO -- : make[2]: Leaving directory '/tmp/ruby/build/trunk/ext/socket' I, [2024-05-08T19:39:11.882256 #3137477] INFO -- : make[2]: Leaving directory '/tmp/ruby/build/trunk/ext/openssl' I, [2024-05-08T19:39:11.885675 #3137477] INFO -- : make[2]: Leaving directory '/tmp/ruby/build/trunk/.bundle/gems/syslog-0.1.2/ext/syslog' I, [2024-05-08T19:39:11.886230 #3137477] INFO -- : make[2]: Leaving directory '/tmp/ruby/build/trunk/.bundle/gems/rbs-3.4.4/ext/rbs_extension' I, [2024-05-08T19:39:11.887307 #3137477] INFO -- : make[2]: Leaving directory '/tmp/ruby/build/trunk/.bundle/gems/nkf-0.2.0/ext/nkf' I, [2024-05-08T19:39:11.894151 #3137477] INFO -- : make[2]: Leaving directory '/tmp/ruby/build/trunk/.bundle/gems/debug-1.9.2/ext/debug' I, [2024-05-08T19:39:11.894665 #3137477] INFO -- : make[2]: Leaving directory '/tmp/ruby/build/trunk/.bundle/gems/racc-1.7.3/ext/racc/cparse' I, [2024-05-08T19:39:11.896432 #3137477] INFO -- : make[2]: Leaving directory '/tmp/ruby/build/trunk/.bundle/gems/bigdecimal-3.1.8/ext/bigdecimal' I, [2024-05-08T19:39:11.897141 #3137477] INFO -- : make[2]: Leaving directory '/tmp/ruby/build/trunk/.bundle/gems/bigdecimal-3.1.7/ext/bigdecimal' I, [2024-05-08T19:39:11.921890 #3137477] INFO -- : make[2]: Entering directory '/tmp/ruby/build/trunk' I, [2024-05-08T19:39:11.989447 #3137477] INFO -- : make[2]: 'ruby' is up to date. I, [2024-05-08T19:39:11.989511 #3137477] INFO -- : make[2]: Leaving directory '/tmp/ruby/build/trunk' I, [2024-05-08T19:39:11.989922 #3137477] INFO -- : make[1]: Leaving directory '/tmp/ruby/build/trunk' I, [2024-05-08T19:39:11.993781 #3137477] INFO -- : make[1]: Entering directory '/tmp/ruby/build/trunk' I, [2024-05-08T19:39:11.993835 #3137477] INFO -- : make[1]: Nothing to be done for 'note'. I, [2024-05-08T19:39:11.993849 #3137477] INFO -- : make[1]: Leaving directory '/tmp/ruby/build/trunk' I, [2024-05-08T19:39:11.994133 #3137477] INFO -- : ./miniruby -I/tmp/ruby/src/trunk/lib -I. -I.ext/common /tmp/ruby/src/trunk/tool/runruby.rb --extout=.ext -- --disable-gems -r./x86_64-linux-fake /tmp/ruby/src/trunk/tool/rbinstall.rb --make="make" --dest-dir="" --extout=".ext" --ext-build-dir="./ext" --mflags="-j20 --jobserver-auth=4,5" --make-flags=" -j20 --jobserver-auth=4,5" --data-mode=0644 --prog-mode=0755 --installed-list .installed.list --mantype="doc" --gnumake --install=all --exclude=doc I, [2024-05-08T19:39:12.090308 #3137477] INFO -- : Installing to I, [2024-05-08T19:39:12.090389 #3137477] INFO -- : installing binary commands: /tmp/ruby/install/trunk/bin I, [2024-05-08T19:39:12.090405 #3137477] INFO -- : installing base libraries: /tmp/ruby/install/trunk/lib I, [2024-05-08T19:39:12.097944 #3137477] INFO -- : installing arch files: /tmp/ruby/install/trunk/lib/ruby/3.4.0+0/x86_64-linux I, [2024-05-08T19:39:12.098010 #3137477] INFO -- : installing pkgconfig data: /tmp/ruby/install/trunk/lib/pkgconfig I, [2024-05-08T19:39:12.098024 #3137477] INFO -- : installing extension objects: /tmp/ruby/install/trunk/lib/ruby/3.4.0+0/x86_64-linux I, [2024-05-08T19:39:12.107812 #3137477] INFO -- : installing extension objects: /tmp/ruby/install/trunk/lib/ruby/site_ruby/3.4.0+0/x86_64-linux I, [2024-05-08T19:39:12.107872 #3137477] INFO -- : installing extension objects: /tmp/ruby/install/trunk/lib/ruby/vendor_ruby/3.4.0+0/x86_64-linux I, [2024-05-08T19:39:12.107887 #3137477] INFO -- : installing extension headers: /tmp/ruby/install/trunk/include/ruby-3.4.0+0/x86_64-linux I, [2024-05-08T19:39:12.107974 #3137477] INFO -- : installing extension scripts: /tmp/ruby/install/trunk/lib/ruby/3.4.0+0 I, [2024-05-08T19:39:12.111834 #3137477] INFO -- : installing extension scripts: /tmp/ruby/install/trunk/lib/ruby/site_ruby/3.4.0+0 I, [2024-05-08T19:39:12.111899 #3137477] INFO -- : installing extension scripts: /tmp/ruby/install/trunk/lib/ruby/vendor_ruby/3.4.0+0 I, [2024-05-08T19:39:12.111913 #3137477] INFO -- : installing extension headers: /tmp/ruby/install/trunk/include/ruby-3.4.0+0/ruby I, [2024-05-08T19:39:12.111925 #3137477] INFO -- : installing command scripts: /tmp/ruby/install/trunk/bin I, [2024-05-08T19:39:12.111936 #3137477] INFO -- : installing library scripts: /tmp/ruby/install/trunk/lib/ruby/3.4.0+0 I, [2024-05-08T19:39:12.146054 #3137477] INFO -- : installing common headers: /tmp/ruby/install/trunk/include/ruby-3.4.0+0 I, [2024-05-08T19:39:12.151472 #3137477] INFO -- : installing manpages: /tmp/ruby/install/trunk/share/man/man1 I, [2024-05-08T19:39:12.151546 #3137477] INFO -- : installing default gems from lib: /tmp/ruby/install/trunk/lib/ruby/gems/3.4.0+0 I, [2024-05-08T19:39:12.174371 #3137477] INFO -- : benchmark 0.3.0 I, [2024-05-08T19:39:12.181303 #3137477] INFO -- : bundler 2.6.0.dev I, [2024-05-08T19:39:12.183390 #3137477] INFO -- : cgi 0.4.1 I, [2024-05-08T19:39:12.183910 #3137477] INFO -- : delegate 0.3.1 I, [2024-05-08T19:39:12.184329 #3137477] INFO -- : did_you_mean 1.6.3 I, [2024-05-08T19:39:12.184876 #3137477] INFO -- : english 0.8.0 I, [2024-05-08T19:39:12.185274 #3137477] INFO -- : erb 4.0.4 I, [2024-05-08T19:39:12.185994 #3137477] INFO -- : error_highlight 0.6.0 I, [2024-05-08T19:39:12.186478 #3137477] INFO -- : fileutils 1.7.2 I, [2024-05-08T19:39:12.186939 #3137477] INFO -- : find 0.2.0 I, [2024-05-08T19:39:12.187328 #3137477] INFO -- : forwardable 1.3.3 I, [2024-05-08T19:39:12.187779 #3137477] INFO -- : ipaddr 1.2.6 I, [2024-05-08T19:39:12.188310 #3137477] INFO -- : irb 1.13.1 I, [2024-05-08T19:39:12.189767 #3137477] INFO -- : logger 1.6.0 I, [2024-05-08T19:39:12.190272 #3137477] INFO -- : net-http 0.4.1 I, [2024-05-08T19:39:12.190780 #3137477] INFO -- : net-protocol 0.2.2 I, [2024-05-08T19:39:12.191282 #3137477] INFO -- : open-uri 0.4.1 I, [2024-05-08T19:39:12.191794 #3137477] INFO -- : open3 0.2.1 I, [2024-05-08T19:39:12.192169 #3137477] INFO -- : optparse 0.5.0 I, [2024-05-08T19:39:12.192770 #3137477] INFO -- : ostruct 0.6.0 I, [2024-05-08T19:39:12.193170 #3137477] INFO -- : pp 0.5.0 I, [2024-05-08T19:39:12.193650 #3137477] INFO -- : prettyprint 0.2.0 I, [2024-05-08T19:39:12.194117 #3137477] INFO -- : prism 0.28.0 I, [2024-05-08T19:39:12.194674 #3137477] INFO -- : pstore 0.1.3 I, [2024-05-08T19:39:12.195056 #3137477] INFO -- : rdoc 6.6.3.1 I, [2024-05-08T19:39:12.196759 #3137477] INFO -- : readline 0.0.4 I, [2024-05-08T19:39:12.197248 #3137477] INFO -- : reline 0.5.5 I, [2024-05-08T19:39:12.197759 #3137477] INFO -- : resolv 0.4.0 I, [2024-05-08T19:39:12.198236 #3137477] INFO -- : ruby2_keywords 0.0.5 I, [2024-05-08T19:39:12.198718 #3137477] INFO -- : securerandom 0.3.1 I, [2024-05-08T19:39:12.199194 #3137477] INFO -- : set 1.1.0 I, [2024-05-08T19:39:12.199703 #3137477] INFO -- : shellwords 0.2.0 I, [2024-05-08T19:39:12.200212 #3137477] INFO -- : singleton 0.2.0 I, [2024-05-08T19:39:12.200830 #3137477] INFO -- : syntax_suggest 2.0.0 I, [2024-05-08T19:39:12.201495 #3137477] INFO -- : tempfile 0.2.1 I, [2024-05-08T19:39:12.201983 #3137477] INFO -- : time 0.3.0 I, [2024-05-08T19:39:12.202825 #3137477] INFO -- : timeout 0.4.1 I, [2024-05-08T19:39:12.203534 #3137477] INFO -- : tmpdir 0.2.0 I, [2024-05-08T19:39:12.204062 #3137477] INFO -- : tsort 0.2.0 I, [2024-05-08T19:39:12.204557 #3137477] INFO -- : un 0.3.0 I, [2024-05-08T19:39:12.205023 #3137477] INFO -- : uri 0.13.0 I, [2024-05-08T19:39:12.205518 #3137477] INFO -- : weakref 0.1.3 I, [2024-05-08T19:39:12.206006 #3137477] INFO -- : yaml 0.3.0 I, [2024-05-08T19:39:12.206355 #3137477] INFO -- : installing default gems from ext: /tmp/ruby/install/trunk/lib/ruby/gems/3.4.0+0 I, [2024-05-08T19:39:12.213047 #3137477] INFO -- : date 3.3.4 I, [2024-05-08T19:39:12.213556 #3137477] INFO -- : digest 3.1.1 I, [2024-05-08T19:39:12.214173 #3137477] INFO -- : etc 1.4.3 I, [2024-05-08T19:39:12.214677 #3137477] INFO -- : fcntl 1.1.0 I, [2024-05-08T19:39:12.215150 #3137477] INFO -- : fiddle 1.1.3 I, [2024-05-08T19:39:12.215634 #3137477] INFO -- : io-console 0.7.2 I, [2024-05-08T19:39:12.216080 #3137477] INFO -- : io-nonblock 0.3.0 I, [2024-05-08T19:39:12.216586 #3137477] INFO -- : io-wait 0.3.1 I, [2024-05-08T19:39:12.217037 #3137477] INFO -- : json 2.7.2 I, [2024-05-08T19:39:12.218166 #3137477] INFO -- : openssl 3.2.0 I, [2024-05-08T19:39:12.218700 #3137477] INFO -- : pathname 0.3.0 I, [2024-05-08T19:39:12.219201 #3137477] INFO -- : psych 5.1.2 I, [2024-05-08T19:39:12.219744 #3137477] INFO -- : stringio 3.1.1 I, [2024-05-08T19:39:12.220183 #3137477] INFO -- : strscan 3.1.1 I, [2024-05-08T19:39:12.220729 #3137477] INFO -- : zlib 3.1.0 I, [2024-05-08T19:39:12.221137 #3137477] INFO -- : installing bundled gems: /tmp/ruby/install/trunk/lib/ruby/gems/3.4.0+0 I, [2024-05-08T19:39:12.221410 #3137477] INFO -- : minitest 5.22.3 I, [2024-05-08T19:39:12.228962 #3137477] INFO -- : rake 13.2.1 I, [2024-05-08T19:39:12.232306 #3137477] INFO -- : test-unit 3.6.2 I, [2024-05-08T19:39:12.236799 #3137477] INFO -- : rexml 3.2.6 I, [2024-05-08T19:39:12.240139 #3137477] INFO -- : rss 0.3.0 I, [2024-05-08T19:39:12.243164 #3137477] INFO -- : net-ftp 0.3.4 I, [2024-05-08T19:39:12.244623 #3137477] INFO -- : net-imap 0.4.10 I, [2024-05-08T19:39:12.247533 #3137477] INFO -- : net-pop 0.1.2 I, [2024-05-08T19:39:12.248513 #3137477] INFO -- : net-smtp 0.5.0 I, [2024-05-08T19:39:12.249638 #3137477] INFO -- : matrix 0.4.2 I, [2024-05-08T19:39:12.253218 #3137477] INFO -- : prime 0.1.2 I, [2024-05-08T19:39:12.259098 #3137477] INFO -- : rbs 3.4.4 I, [2024-05-08T19:39:12.281620 #3137477] INFO -- : typeprof 0.21.11 I, [2024-05-08T19:39:12.284202 #3137477] INFO -- : debug 1.9.2 I, [2024-05-08T19:39:12.286897 #3137477] INFO -- : racc 1.7.3 I, [2024-05-08T19:39:12.289579 #3137477] INFO -- : mutex_m 0.2.0 I, [2024-05-08T19:39:12.290698 #3137477] INFO -- : getoptlong 0.2.1 I, [2024-05-08T19:39:12.291961 #3137477] INFO -- : base64 0.2.0 I, [2024-05-08T19:39:12.292960 #3137477] INFO -- : bigdecimal 3.1.8 I, [2024-05-08T19:39:12.294904 #3137477] INFO -- : observer 0.1.2 I, [2024-05-08T19:39:12.296605 #3137477] INFO -- : abbrev 0.1.2 I, [2024-05-08T19:39:12.297612 #3137477] INFO -- : resolv-replace 0.1.1 I, [2024-05-08T19:39:12.298920 #3137477] INFO -- : rinda 0.2.0 I, [2024-05-08T19:39:12.300092 #3137477] INFO -- : drb 2.2.1 I, [2024-05-08T19:39:12.301662 #3137477] INFO -- : nkf 0.2.0 I, [2024-05-08T19:39:12.303990 #3137477] INFO -- : syslog 0.1.2 I, [2024-05-08T19:39:12.305695 #3137477] INFO -- : csv 3.3.0 I, [2024-05-08T19:39:12.307745 #3137477] INFO -- : installing bundled gem cache: /tmp/ruby/install/trunk/lib/ruby/gems/3.4.0+0/cache I, [2024-05-08T19:39:12.309231 #3137477] INFO -- : skipped bundled gems: I, [2024-05-08T19:39:12.309253 #3137477] INFO -- : power_assert-2.0.4dev.gem not found in bundled_gems I, [2024-05-08T19:39:12.312431 #3137477] INFO -- : $$$[end] "make install -j20" exit with 0. I, [2024-05-08T19:39:12.312537 #3137477] INFO -- : $$$[beg] make yes-btest TESTOPTS='-q -j20' I, [2024-05-08T19:39:17.981754 #3137477] INFO -- : PASS all 1936 tests E, [2024-05-08T19:39:17.988861 #3137477] ERROR -- : I, [2024-05-08T19:39:17.989117 #3137477] INFO -- : $$$[end] "make yes-btest TESTOPTS='-q -j20'" exit with 0. I, [2024-05-08T19:39:17.989217 #3137477] INFO -- : $$$[beg] make yes-test-basic TESTS='-j20' I, [2024-05-08T19:39:18.049839 #3137477] INFO -- : BASERUBY = /usr/bin/ruby --disable=gems I, [2024-05-08T19:39:18.049876 #3137477] INFO -- : CC = gcc I, [2024-05-08T19:39:18.049882 #3137477] INFO -- : LD = ld I, [2024-05-08T19:39:18.049886 #3137477] INFO -- : LDSHARED = gcc -shared I, [2024-05-08T19:39:18.049890 #3137477] INFO -- : CFLAGS = -O3 -fno-fast-math -ggdb3 -Wall -Wextra -Wdeprecated-declarations -Wdiv-by-zero -Wduplicated-cond -Wimplicit-function-declaration -Wimplicit-int -Wpointer-arith -Wwrite-strings -Wold-style-definition -Wimplicit-fallthrough=0 -Wmissing-noreturn -Wno-cast-function-type -Wno-constant-logical-operand -Wno-long-long -Wno-missing-field-initializers -Wno-overlength-strings -Wno-packed-bitfield-compat -Wno-parentheses-equality -Wno-self-assign -Wno-tautological-compare -Wno-unused-parameter -Wno-unused-value -Wsuggest-attribute=format -Wsuggest-attribute=noreturn -Wunused-variable -Wmisleading-indentation -Wundef -fPIC I, [2024-05-08T19:39:18.049901 #3137477] INFO -- : XCFLAGS = -U_FORTIFY_SOURCE -D_FORTIFY_SOURCE=2 -fstack-protector-strong -fno-strict-overflow -fvisibility=hidden -fexcess-precision=standard -DRUBY_EXPORT -I. -I.ext/include/x86_64-linux -I/tmp/ruby/src/trunk/include -I/tmp/ruby/src/trunk -I/tmp/ruby/src/trunk/prism -I/tmp/ruby/src/trunk/enc/unicode/15.0.0 I, [2024-05-08T19:39:18.049906 #3137477] INFO -- : CPPFLAGS = I, [2024-05-08T19:39:18.049910 #3137477] INFO -- : DLDFLAGS = -Wl,--compress-debug-sections=zlib -Wl,-soname,libruby.so.3.4 -fstack-protector-strong I, [2024-05-08T19:39:18.049914 #3137477] INFO -- : SOLIBS = -lz -lrt -lrt -lgmp -ldl -lcrypt -lm -lpthread I, [2024-05-08T19:39:18.049917 #3137477] INFO -- : LANG = en_US.UTF-8 I, [2024-05-08T19:39:18.049921 #3137477] INFO -- : LC_ALL = I, [2024-05-08T19:39:18.049924 #3137477] INFO -- : LC_CTYPE = I, [2024-05-08T19:39:18.049928 #3137477] INFO -- : MFLAGS = I, [2024-05-08T19:39:18.049931 #3137477] INFO -- : RUSTC = no I, [2024-05-08T19:39:18.049935 #3137477] INFO -- : YJIT_RUSTC_ARGS = --crate-name=yjit --crate-type=staticlib --edition=2021 -g -C lto=thin -C opt-level=3 -C overflow-checks=on '--out-dir=/tmp/ruby/build/trunk/yjit/target/release/' /tmp/ruby/src/trunk/yjit/src/lib.rs I, [2024-05-08T19:39:18.050453 #3137477] INFO -- : gcc (Ubuntu 11.4.0-1ubuntu1~22.04) 11.4.0 I, [2024-05-08T19:39:18.050478 #3137477] INFO -- : Copyright (C) 2021 Free Software Foundation, Inc. I, [2024-05-08T19:39:18.050494 #3137477] INFO -- : This is free software; see the source for copying conditions. There is NO I, [2024-05-08T19:39:18.050500 #3137477] INFO -- : warranty; not even for MERCHANTABILITY or FITNESS FOR A PARTICULAR PURPOSE. I, [2024-05-08T19:39:18.050506 #3137477] INFO -- : I, [2024-05-08T19:39:18.156521 #3137477] INFO -- : Checking leaked global symbols...none I, [2024-05-08T19:39:18.198027 #3137477] INFO -- : /tmp/ruby/src/trunk/basictest/test.rb:assignment ....................................................................................................................................................................................................................................................................................................................................................................................OK 372 I, [2024-05-08T19:39:18.198089 #3137477] INFO -- : /tmp/ruby/src/trunk/basictest/test.rb:condition ..OK 2 I, [2024-05-08T19:39:18.198096 #3137477] INFO -- : /tmp/ruby/src/trunk/basictest/test.rb:if/unless ...OK 3 I, [2024-05-08T19:39:18.198100 #3137477] INFO -- : /tmp/ruby/src/trunk/basictest/test.rb:case .....OK 5 I, [2024-05-08T19:39:18.198301 #3137477] INFO -- : /tmp/ruby/src/trunk/basictest/test.rb:while/until ........OK 8 I, [2024-05-08T19:39:18.198355 #3137477] INFO -- : /tmp/ruby/src/trunk/basictest/test.rb:exception ..........OK 10 I, [2024-05-08T19:39:18.198631 #3137477] INFO -- : /tmp/ruby/src/trunk/basictest/test.rb:array .......................................OK 39 I, [2024-05-08T19:39:18.198731 #3137477] INFO -- : /tmp/ruby/src/trunk/basictest/test.rb:hash ...........................OK 27 I, [2024-05-08T19:39:18.199463 #3137477] INFO -- : /tmp/ruby/src/trunk/basictest/test.rb:iterator ...........................................................................................................OK 107 I, [2024-05-08T19:39:18.199747 #3137477] INFO -- : /tmp/ruby/src/trunk/basictest/test.rb:float ................................................................................OK 80 I, [2024-05-08T19:39:18.200753 #3137477] INFO -- : /tmp/ruby/src/trunk/basictest/test.rb:bignum ...............................OK 31 I, [2024-05-08T19:39:18.201525 #3137477] INFO -- : /tmp/ruby/src/trunk/basictest/test.rb:string & char ..............................................................OK 62 I, [2024-05-08T19:39:18.201558 #3137477] INFO -- : /tmp/ruby/src/trunk/basictest/test.rb:assignment ..........OK 10 I, [2024-05-08T19:39:18.201585 #3137477] INFO -- : /tmp/ruby/src/trunk/basictest/test.rb:call ......OK 6 I, [2024-05-08T19:39:18.201640 #3137477] INFO -- : /tmp/ruby/src/trunk/basictest/test.rb:proc .........OK 9 I, [2024-05-08T19:39:18.301933 #3137477] INFO -- : /tmp/ruby/src/trunk/basictest/test.rb:signal ..OK 2 I, [2024-05-08T19:39:18.302487 #3137477] INFO -- : /tmp/ruby/src/trunk/basictest/test.rb:eval ...........................OK 27 I, [2024-05-08T19:39:18.403158 #3137477] INFO -- : /tmp/ruby/src/trunk/basictest/test.rb:system ........OK 8 I, [2024-05-08T19:39:18.403213 #3137477] INFO -- : /tmp/ruby/src/trunk/basictest/test.rb:const .....OK 5 I, [2024-05-08T19:39:18.403220 #3137477] INFO -- : /tmp/ruby/src/trunk/basictest/test.rb:clone .....OK 5 I, [2024-05-08T19:39:18.403396 #3137477] INFO -- : /tmp/ruby/src/trunk/basictest/test.rb:marshal ....OK 4 I, [2024-05-08T19:39:18.403418 #3137477] INFO -- : /tmp/ruby/src/trunk/basictest/test.rb:pack ....OK 4 I, [2024-05-08T19:39:18.403425 #3137477] INFO -- : /tmp/ruby/src/trunk/basictest/test.rb:math ..OK 2 I, [2024-05-08T19:39:18.403507 #3137477] INFO -- : /tmp/ruby/src/trunk/basictest/test.rb:struct ......OK 6 I, [2024-05-08T19:39:18.403637 #3137477] INFO -- : /tmp/ruby/src/trunk/basictest/test.rb:variable ............OK 12 I, [2024-05-08T19:39:18.403658 #3137477] INFO -- : /tmp/ruby/src/trunk/basictest/test.rb:trace ...OK 3 I, [2024-05-08T19:39:18.403673 #3137477] INFO -- : /tmp/ruby/src/trunk/basictest/test.rb:defined? ............OK 12 I, [2024-05-08T19:39:18.403720 #3137477] INFO -- : /tmp/ruby/src/trunk/basictest/test.rb:alias ......OK 6 I, [2024-05-08T19:39:18.404187 #3137477] INFO -- : /tmp/ruby/src/trunk/basictest/test.rb:path .......................OK 23 I, [2024-05-08T19:39:18.437414 #3137477] INFO -- : /tmp/ruby/src/trunk/basictest/test.rb:gc ....OK 4 I, [2024-05-08T19:39:18.439727 #3137477] INFO -- : I, [2024-05-08T19:39:18.439750 #3137477] INFO -- : test succeeded I, [2024-05-08T19:39:18.441080 #3137477] INFO -- : $$$[end] "make yes-test-basic TESTS='-j20'" exit with 0. I, [2024-05-08T19:39:18.441174 #3137477] INFO -- : $$$[beg] make yes-test-all TESTOPTS='--stderr-on-failure' TESTS='-j20' I, [2024-05-08T19:39:18.528505 #3137477] INFO -- : BASERUBY = /usr/bin/ruby --disable=gems I, [2024-05-08T19:39:18.528546 #3137477] INFO -- : CC = gcc I, [2024-05-08T19:39:18.528552 #3137477] INFO -- : LD = ld I, [2024-05-08T19:39:18.528556 #3137477] INFO -- : LDSHARED = gcc -shared I, [2024-05-08T19:39:18.528560 #3137477] INFO -- : CFLAGS = -O3 -fno-fast-math -ggdb3 -Wall -Wextra -Wdeprecated-declarations -Wdiv-by-zero -Wduplicated-cond -Wimplicit-function-declaration -Wimplicit-int -Wpointer-arith -Wwrite-strings -Wold-style-definition -Wimplicit-fallthrough=0 -Wmissing-noreturn -Wno-cast-function-type -Wno-constant-logical-operand -Wno-long-long -Wno-missing-field-initializers -Wno-overlength-strings -Wno-packed-bitfield-compat -Wno-parentheses-equality -Wno-self-assign -Wno-tautological-compare -Wno-unused-parameter -Wno-unused-value -Wsuggest-attribute=format -Wsuggest-attribute=noreturn -Wunused-variable -Wmisleading-indentation -Wundef -fPIC I, [2024-05-08T19:39:18.528564 #3137477] INFO -- : XCFLAGS = -U_FORTIFY_SOURCE -D_FORTIFY_SOURCE=2 -fstack-protector-strong -fno-strict-overflow -fvisibility=hidden -fexcess-precision=standard -DRUBY_EXPORT -I. -I.ext/include/x86_64-linux -I/tmp/ruby/src/trunk/include -I/tmp/ruby/src/trunk -I/tmp/ruby/src/trunk/prism -I/tmp/ruby/src/trunk/enc/unicode/15.0.0 I, [2024-05-08T19:39:18.528568 #3137477] INFO -- : CPPFLAGS = I, [2024-05-08T19:39:18.528572 #3137477] INFO -- : DLDFLAGS = -Wl,--compress-debug-sections=zlib -Wl,-soname,libruby.so.3.4 -fstack-protector-strong I, [2024-05-08T19:39:18.528583 #3137477] INFO -- : SOLIBS = -lz -lrt -lrt -lgmp -ldl -lcrypt -lm -lpthread I, [2024-05-08T19:39:18.528587 #3137477] INFO -- : LANG = en_US.UTF-8 I, [2024-05-08T19:39:18.528591 #3137477] INFO -- : LC_ALL = I, [2024-05-08T19:39:18.528594 #3137477] INFO -- : LC_CTYPE = I, [2024-05-08T19:39:18.528598 #3137477] INFO -- : MFLAGS = I, [2024-05-08T19:39:18.528602 #3137477] INFO -- : RUSTC = no I, [2024-05-08T19:39:18.528605 #3137477] INFO -- : YJIT_RUSTC_ARGS = --crate-name=yjit --crate-type=staticlib --edition=2021 -g -C lto=thin -C opt-level=3 -C overflow-checks=on '--out-dir=/tmp/ruby/build/trunk/yjit/target/release/' /tmp/ruby/src/trunk/yjit/src/lib.rs I, [2024-05-08T19:39:18.529207 #3137477] INFO -- : gcc (Ubuntu 11.4.0-1ubuntu1~22.04) 11.4.0 I, [2024-05-08T19:39:18.529232 #3137477] INFO -- : Copyright (C) 2021 Free Software Foundation, Inc. I, [2024-05-08T19:39:18.529241 #3137477] INFO -- : This is free software; see the source for copying conditions. There is NO I, [2024-05-08T19:39:18.529247 #3137477] INFO -- : warranty; not even for MERCHANTABILITY or FITNESS FOR A PARTICULAR PURPOSE. I, [2024-05-08T19:39:18.529258 #3137477] INFO -- : I, [2024-05-08T19:39:18.530790 #3137477] INFO -- : generating enc.mk I, [2024-05-08T19:39:18.648910 #3137477] INFO -- : making enc I, [2024-05-08T19:39:18.666066 #3137477] INFO -- : make[1]: Entering directory '/tmp/ruby/build/trunk' I, [2024-05-08T19:39:18.666092 #3137477] INFO -- : make[1]: Nothing to be done for 'enc'. I, [2024-05-08T19:39:18.666099 #3137477] INFO -- : make[1]: Leaving directory '/tmp/ruby/build/trunk' I, [2024-05-08T19:39:18.666823 #3137477] INFO -- : making srcs under enc I, [2024-05-08T19:39:18.696633 #3137477] INFO -- : make[1]: Entering directory '/tmp/ruby/build/trunk' I, [2024-05-08T19:39:18.696657 #3137477] INFO -- : make[1]: Nothing to be done for 'srcs'. I, [2024-05-08T19:39:18.696666 #3137477] INFO -- : make[1]: Leaving directory '/tmp/ruby/build/trunk' I, [2024-05-08T19:39:18.697552 #3137477] INFO -- : generating transdb.h I, [2024-05-08T19:39:18.791864 #3137477] INFO -- : transdb.h unchanged I, [2024-05-08T19:39:18.793253 #3137477] INFO -- : making trans I, [2024-05-08T19:39:18.826649 #3137477] INFO -- : make[1]: Entering directory '/tmp/ruby/build/trunk' I, [2024-05-08T19:39:18.826670 #3137477] INFO -- : make[1]: Nothing to be done for 'trans'. I, [2024-05-08T19:39:18.826675 #3137477] INFO -- : make[1]: Leaving directory '/tmp/ruby/build/trunk' I, [2024-05-08T19:39:18.827417 #3137477] INFO -- : making encs I, [2024-05-08T19:39:18.864777 #3137477] INFO -- : make[1]: Entering directory '/tmp/ruby/build/trunk' I, [2024-05-08T19:39:18.864797 #3137477] INFO -- : make[1]: Nothing to be done for 'encs'. I, [2024-05-08T19:39:18.864803 #3137477] INFO -- : make[1]: Leaving directory '/tmp/ruby/build/trunk' I, [2024-05-08T19:39:18.866498 #3137477] INFO -- : generating makefiles ext/configure-ext.mk I, [2024-05-08T19:39:18.893704 #3137477] INFO -- : ext/configure-ext.mk updated I, [2024-05-08T19:39:18.896090 #3137477] INFO -- : make[1]: Entering directory '/tmp/ruby/build/trunk' I, [2024-05-08T19:39:20.294926 #3137477] INFO -- : make[1]: Leaving directory '/tmp/ruby/build/trunk' I, [2024-05-08T19:39:20.295617 #3137477] INFO -- : generating makefile exts.mk I, [2024-05-08T19:39:20.333041 #3137477] INFO -- : exts.mk unchanged I, [2024-05-08T19:39:20.337501 #3137477] INFO -- : make[1]: Entering directory '/tmp/ruby/build/trunk' I, [2024-05-08T19:39:20.547143 #3137477] INFO -- : make[2]: Entering directory '/tmp/ruby/build/trunk/ext/coverage' I, [2024-05-08T19:39:20.550017 #3137477] INFO -- : make[2]: Leaving directory '/tmp/ruby/build/trunk/ext/coverage' I, [2024-05-08T19:39:20.554012 #3137477] INFO -- : make[2]: Entering directory '/tmp/ruby/build/trunk/ext/date' I, [2024-05-08T19:39:20.557044 #3137477] INFO -- : make[2]: Leaving directory '/tmp/ruby/build/trunk/ext/date' I, [2024-05-08T19:39:20.559170 #3137477] INFO -- : make[2]: Entering directory '/tmp/ruby/build/trunk/ext/digest' I, [2024-05-08T19:39:20.564600 #3137477] INFO -- : make[2]: Leaving directory '/tmp/ruby/build/trunk/ext/digest' I, [2024-05-08T19:39:20.580256 #3137477] INFO -- : make[2]: Entering directory '/tmp/ruby/build/trunk/ext/digest/sha2' I, [2024-05-08T19:39:20.583139 #3137477] INFO -- : make[2]: Leaving directory '/tmp/ruby/build/trunk/ext/digest/sha2' I, [2024-05-08T19:39:20.595659 #3137477] INFO -- : make[2]: Entering directory '/tmp/ruby/build/trunk/ext/fiddle' I, [2024-05-08T19:39:20.602050 #3137477] INFO -- : make[2]: Leaving directory '/tmp/ruby/build/trunk/ext/fiddle' I, [2024-05-08T19:39:20.605067 #3137477] INFO -- : make[2]: Entering directory '/tmp/ruby/build/trunk/ext/io/console' I, [2024-05-08T19:39:20.607638 #3137477] INFO -- : make[2]: Leaving directory '/tmp/ruby/build/trunk/ext/io/console' I, [2024-05-08T19:39:20.615168 #3137477] INFO -- : make[2]: Entering directory '/tmp/ruby/build/trunk/ext/json' I, [2024-05-08T19:39:20.621376 #3137477] INFO -- : make[2]: Leaving directory '/tmp/ruby/build/trunk/ext/json' I, [2024-05-08T19:39:20.630261 #3137477] INFO -- : make[2]: Entering directory '/tmp/ruby/build/trunk/ext/monitor' I, [2024-05-08T19:39:20.632711 #3137477] INFO -- : make[2]: Leaving directory '/tmp/ruby/build/trunk/ext/monitor' I, [2024-05-08T19:39:20.636879 #3137477] INFO -- : make[2]: Entering directory '/tmp/ruby/build/trunk/ext/objspace' I, [2024-05-08T19:39:20.640593 #3137477] INFO -- : make[2]: Leaving directory '/tmp/ruby/build/trunk/ext/objspace' I, [2024-05-08T19:39:20.652605 #3137477] INFO -- : make[2]: Entering directory '/tmp/ruby/build/trunk/ext/openssl' I, [2024-05-08T19:39:20.665716 #3137477] INFO -- : make[2]: Leaving directory '/tmp/ruby/build/trunk/ext/openssl' I, [2024-05-08T19:39:20.668506 #3137477] INFO -- : make[2]: Entering directory '/tmp/ruby/build/trunk/ext/pathname' I, [2024-05-08T19:39:20.671054 #3137477] INFO -- : make[2]: Leaving directory '/tmp/ruby/build/trunk/ext/pathname' I, [2024-05-08T19:39:20.675210 #3137477] INFO -- : make[2]: Entering directory '/tmp/ruby/build/trunk/ext/psych' I, [2024-05-08T19:39:20.690056 #3137477] INFO -- : make[2]: Leaving directory '/tmp/ruby/build/trunk/ext/psych' I, [2024-05-08T19:39:20.693083 #3137477] INFO -- : make[2]: Entering directory '/tmp/ruby/build/trunk/ext/pty' I, [2024-05-08T19:39:20.695574 #3137477] INFO -- : make[2]: Leaving directory '/tmp/ruby/build/trunk/ext/pty' I, [2024-05-08T19:39:20.704888 #3137477] INFO -- : make[2]: Entering directory '/tmp/ruby/build/trunk/ext/ripper' I, [2024-05-08T19:39:20.709729 #3137477] INFO -- : make[2]: Leaving directory '/tmp/ruby/build/trunk/ext/ripper' I, [2024-05-08T19:39:20.711167 #3137477] INFO -- : make[2]: Entering directory '/tmp/ruby/build/trunk/ext/rubyvm' I, [2024-05-08T19:39:20.713130 #3137477] INFO -- : make[2]: Leaving directory '/tmp/ruby/build/trunk/ext/rubyvm' I, [2024-05-08T19:39:20.721143 #3137477] INFO -- : make[2]: Entering directory '/tmp/ruby/build/trunk/ext/socket' I, [2024-05-08T19:39:20.727538 #3137477] INFO -- : make[2]: Leaving directory '/tmp/ruby/build/trunk/ext/socket' I, [2024-05-08T19:39:20.738944 #3137477] INFO -- : make[2]: Entering directory '/tmp/ruby/build/trunk/.bundle/gems/bigdecimal-3.1.7/ext/bigdecimal' I, [2024-05-08T19:39:20.761573 #3137477] INFO -- : make[2]: Leaving directory '/tmp/ruby/build/trunk/.bundle/gems/bigdecimal-3.1.7/ext/bigdecimal' I, [2024-05-08T19:39:20.763575 #3137477] INFO -- : make[2]: Entering directory '/tmp/ruby/build/trunk/.bundle/gems/bigdecimal-3.1.8/ext/bigdecimal' I, [2024-05-08T19:39:20.785226 #3137477] INFO -- : make[2]: Leaving directory '/tmp/ruby/build/trunk/.bundle/gems/bigdecimal-3.1.8/ext/bigdecimal' I, [2024-05-08T19:39:20.787198 #3137477] INFO -- : make[2]: Entering directory '/tmp/ruby/build/trunk/.bundle/gems/debug-1.9.2/ext/debug' I, [2024-05-08T19:39:20.809209 #3137477] INFO -- : make[2]: Leaving directory '/tmp/ruby/build/trunk/.bundle/gems/debug-1.9.2/ext/debug' I, [2024-05-08T19:39:20.811216 #3137477] INFO -- : make[2]: Entering directory '/tmp/ruby/build/trunk/.bundle/gems/nkf-0.2.0/ext/nkf' I, [2024-05-08T19:39:20.833372 #3137477] INFO -- : make[2]: Leaving directory '/tmp/ruby/build/trunk/.bundle/gems/nkf-0.2.0/ext/nkf' I, [2024-05-08T19:39:20.835420 #3137477] INFO -- : make[2]: Entering directory '/tmp/ruby/build/trunk/.bundle/gems/racc-1.7.3/ext/racc/cparse' I, [2024-05-08T19:39:20.856867 #3137477] INFO -- : make[2]: Leaving directory '/tmp/ruby/build/trunk/.bundle/gems/racc-1.7.3/ext/racc/cparse' I, [2024-05-08T19:39:20.859253 #3137477] INFO -- : make[2]: Entering directory '/tmp/ruby/build/trunk/.bundle/gems/rbs-3.4.4/ext/rbs_extension' I, [2024-05-08T19:39:20.881263 #3137477] INFO -- : make[2]: Leaving directory '/tmp/ruby/build/trunk/.bundle/gems/rbs-3.4.4/ext/rbs_extension' I, [2024-05-08T19:39:20.883159 #3137477] INFO -- : make[2]: Entering directory '/tmp/ruby/build/trunk/.bundle/gems/syslog-0.1.2/ext/syslog' I, [2024-05-08T19:39:20.905123 #3137477] INFO -- : make[2]: Leaving directory '/tmp/ruby/build/trunk/.bundle/gems/syslog-0.1.2/ext/syslog' I, [2024-05-08T19:39:20.928432 #3137477] INFO -- : make[2]: Entering directory '/tmp/ruby/build/trunk' I, [2024-05-08T19:39:20.992626 #3137477] INFO -- : make[2]: 'ruby' is up to date. I, [2024-05-08T19:39:20.992662 #3137477] INFO -- : make[2]: Leaving directory '/tmp/ruby/build/trunk' I, [2024-05-08T19:39:20.993073 #3137477] INFO -- : make[1]: Leaving directory '/tmp/ruby/build/trunk' I, [2024-05-08T19:39:20.996868 #3137477] INFO -- : make[1]: Entering directory '/tmp/ruby/build/trunk' I, [2024-05-08T19:39:20.996890 #3137477] INFO -- : make[1]: Nothing to be done for 'note'. I, [2024-05-08T19:39:20.996896 #3137477] INFO -- : make[1]: Leaving directory '/tmp/ruby/build/trunk' I, [2024-05-08T19:39:21.073237 #3137477] INFO -- : Run options: I, [2024-05-08T19:39:21.073280 #3137477] INFO -- : --seed=30143 I, [2024-05-08T19:39:21.073286 #3137477] INFO -- : "--ruby=./miniruby -I/tmp/ruby/src/trunk/lib -I. -I.ext/common /tmp/ruby/src/trunk/tool/runruby.rb --extout=.ext -- --disable-gems" I, [2024-05-08T19:39:21.073291 #3137477] INFO -- : --excludes-dir=/tmp/ruby/src/trunk/test/.excludes I, [2024-05-08T19:39:21.073295 #3137477] INFO -- : --name=!/memory_leak/ I, [2024-05-08T19:39:21.073298 #3137477] INFO -- : --stderr-on-failure I, [2024-05-08T19:39:21.073302 #3137477] INFO -- : -j20 I, [2024-05-08T19:39:21.073317 #3137477] INFO -- : I, [2024-05-08T19:39:21.073321 #3137477] INFO -- : # Running tests: I, [2024-05-08T19:39:21.073325 #3137477] INFO -- : I, [2024-05-08T19:39:21.221134 #3137477] INFO -- : [ 1/885] 3178872=test_cgi_cookie I, [2024-05-08T19:39:21.221208 #3137477] INFO -- : [ 2/885] 3178856=test_require I, [2024-05-08T19:39:21.221295 #3137477] INFO -- : [ 3/885] 3178857=test_float I, [2024-05-08T19:39:21.221406 #3137477] INFO -- : [ 4/885] 3178858=test_gem_source_git I, [2024-05-08T19:39:21.224299 #3137477] INFO -- : [ 5/885] 3178855=test_gem_commands_signout_command I, [2024-05-08T19:39:21.224383 #3137477] INFO -- : [ 6/885] 3178868=test_refinement I, [2024-05-08T19:39:21.224453 #3137477] INFO -- : [ 7/885] 3178870=test_regex_casefold I, [2024-05-08T19:39:21.224548 #3137477] INFO -- : [ 8/885] 3178871=test_gem_resolver_installer_set I, [2024-05-08T19:39:21.226848 #3137477] INFO -- : [ 9/885] 3178869=test_dir_m17n I, [2024-05-08T19:39:21.231146 #3137477] INFO -- : [ 10/885] 3178872=test_metaclass I, [2024-05-08T19:39:21.233473 #3137477] INFO -- : [ 11/885] 3178859=test_rdoc_top_level I, [2024-05-08T19:39:21.239310 #3137477] INFO -- : [ 12/885] 3178872=test_rdoc_rd I, [2024-05-08T19:39:21.240335 #3137477] INFO -- : [ 13/885] 3178879=test_cgi_session I, [2024-05-08T19:39:21.255215 #3137477] INFO -- : [ 14/885] 3178862=test_x509crl I, [2024-05-08T19:39:21.255332 #3137477] INFO -- : [ 15/885] 3178864=test_fixnum I, [2024-05-08T19:39:21.255350 #3137477] INFO -- : [ 16/885] 3178867=test_signal I, [2024-05-08T19:39:21.256228 #3137477] INFO -- : [ 17/885] 3178866=test_process I, [2024-05-08T19:39:21.257083 #3137477] INFO -- : [ 18/885] 3178865=test_input_method I, [2024-05-08T19:39:21.265999 #3137477] INFO -- : [ 19/885] 3178879=test_windows_1252 I, [2024-05-08T19:39:21.266658 #3137477] INFO -- : [ 20/885] 3178863=test_digest_extend I, [2024-05-08T19:39:21.270937 #3137477] INFO -- : [ 21/885] 3178879=test_omap I, [2024-05-08T19:39:21.272318 #3137477] INFO -- : [ 22/885] 3178860=test_iterator I, [2024-05-08T19:39:21.281334 #3137477] INFO -- : [ 23/885] 3178873=test_string I, [2024-05-08T19:39:21.283445 #3137477] INFO -- : [ 24/885] 3178863=pattern_test I, [2024-05-08T19:39:21.286088 #3137477] INFO -- : [ 25/885] 3178861=test_memory_view I, [2024-05-08T19:39:21.286159 #3137477] INFO -- : [ 26/885] 3178873=test_debug I, [2024-05-08T19:39:21.292546 #3137477] INFO -- : [ 27/885] 3178864=test_shellwords I, [2024-05-08T19:39:21.293392 #3137477] INFO -- : [ 28/885] 3178879=test_new I, [2024-05-08T19:39:21.294902 #3137477] INFO -- : [ 29/885] 3178873=test_gem_security_signer I, [2024-05-08T19:39:21.301322 #3137477] INFO -- : [ 30/885] 3178864=test_cipher I, [2024-05-08T19:39:21.301735 #3137477] INFO -- : [ 31/885] 3178879=test_gem_resolver_git_set I, [2024-05-08T19:39:21.307285 #3137477] INFO -- : [ 32/885] 3178866=test_storage I, [2024-05-08T19:39:21.313792 #3137477] INFO -- : [ 33/885] 3178866=test_win32ole_variant_outarg I, [2024-05-08T19:39:21.313963 #3137477] INFO -- : [ 34/885] 3178866=json_common_interface_test I, [2024-05-08T19:39:21.326179 #3137477] INFO -- : [ 35/885] 3178861=test_gem_source_subpath_problem I, [2024-05-08T19:39:21.339311 #3137477] INFO -- : [ 36/885] 3178866=test_dln I, [2024-05-08T19:39:21.339485 #3137477] INFO -- : [ 37/885] 3178866=memsize_test I, [2024-05-08T19:39:21.352711 #3137477] INFO -- : [ 38/885] 3178860=json_parser_test I, [2024-05-08T19:39:21.377555 #3137477] INFO -- : [ 39/885] 3178872=test_nomethod_error I, [2024-05-08T19:39:21.380530 #3137477] INFO -- : [ 40/885] 3178872=test_config I, [2024-05-08T19:39:21.385009 #3137477] INFO -- : [ 41/885] 3178864=test_pkg_config I, [2024-05-08T19:39:21.400478 #3137477] INFO -- : [ 42/885] 3178860=test_cparser I, [2024-05-08T19:39:21.401028 #3137477] INFO -- : [ 43/885] 3178863=magic_comment_test I, [2024-05-08T19:39:21.406381 #3137477] INFO -- : [ 44/885] 3178863=test_rdoc_markup_to_html_snippet I, [2024-05-08T19:39:21.411495 #3137477] INFO -- : [ 45/885] 3178866=test_struct I, [2024-05-08T19:39:21.412274 #3137477] INFO -- : [ 46/885] 3178855=test_variable I, [2024-05-08T19:39:21.420336 #3137477] INFO -- : [ 47/885] 3178872=test_sexp I, [2024-05-08T19:39:21.437349 #3137477] INFO -- : [ 48/885] 3178864=test_rdoc_markup_include I, [2024-05-08T19:39:21.437411 #3137477] INFO -- : [ 49/885] 3178866=fuzzer_test I, [2024-05-08T19:39:21.444611 #3137477] INFO -- : [ 50/885] 3178866=test_div I, [2024-05-08T19:39:21.445748 #3137477] INFO -- : [ 51/885] 3178866=test_allocation I, [2024-05-08T19:39:21.451645 #3137477] INFO -- : [ 52/885] 3178872=test_engine I, [2024-05-08T19:39:21.452931 #3137477] INFO -- : [ 53/885] 3178872=test_win32ole_variant_m I, [2024-05-08T19:39:21.454966 #3137477] INFO -- : [ 54/885] 3178872=test_key_error I, [2024-05-08T19:39:21.461471 #3137477] INFO -- : [ 55/885] 3178872=test_serialize_subclasses I, [2024-05-08T19:39:21.474474 #3137477] INFO -- : [ 56/885] 3178872=test_insns_leaf I, [2024-05-08T19:39:21.475928 #3137477] INFO -- : [ 57/885] 3178862=test_color_printer I, [2024-05-08T19:39:21.492310 #3137477] INFO -- : [ 58/885] 3178872=test_deprecated I, [2024-05-08T19:39:21.501042 #3137477] INFO -- : [ 59/885] 3178872=test_files_test_1 I, [2024-05-08T19:39:21.527919 #3137477] INFO -- : [ 60/885] 3178865=test_gem_path_support I, [2024-05-08T19:39:21.551756 #3137477] INFO -- : [ 61/885] 3178864=test_struct I, [2024-05-08T19:39:21.552095 #3137477] INFO -- : [ 62/885] 3178873=test_set I, [2024-05-08T19:39:21.556529 #3137477] INFO -- : [ 63/885] 3178855=test_mutex I, [2024-05-08T19:39:21.565576 #3137477] INFO -- : [ 64/885] 3178862=test_x509req I, [2024-05-08T19:39:21.573790 #3137477] INFO -- : [ 65/885] 3178873=test_rdoc_rd_inline I, [2024-05-08T19:39:21.610169 #3137477] INFO -- : [ 66/885] 3178870=constant_path_node_test I, [2024-05-08T19:39:21.626437 #3137477] INFO -- : [ 67/885] 3178860=test_ssl I, [2024-05-08T19:39:21.660600 #3137477] INFO -- : [ 68/885] 3178863=test_gem_ext_cargo_builder I, [2024-05-08T19:39:21.672329 #3137477] INFO -- : [ 69/885] 3178861=test_module I, [2024-05-08T19:39:21.679480 #3137477] INFO -- : [ 70/885] 3178870=test_gem_request_set I, [2024-05-08T19:39:21.683355 #3137477] INFO -- : [ 71/885] 3178873=test_method_name_check I, [2024-05-08T19:39:21.688154 #3137477] INFO -- : [ 72/885] 3178871=test_arith_seq_extract I, [2024-05-08T19:39:21.707612 #3137477] INFO -- : [ 73/885] 3178873=test_parser I, [2024-05-08T19:39:21.710308 #3137477] INFO -- : [ 74/885] 3178865=test_rubyvm I, [2024-05-08T19:39:21.721256 #3137477] INFO -- : [ 75/885] 3178865=test_configuration I, [2024-05-08T19:39:21.741762 #3137477] INFO -- : [ 76/885] 3178873=test_monitor I, [2024-05-08T19:39:21.753709 #3137477] INFO -- : [ 77/885] 3178862=test_buffered_io I, [2024-05-08T19:39:21.790987 #3137477] INFO -- : [ 78/885] 3178859=test_whileuntil I, [2024-05-08T19:39:21.792858 #3137477] INFO -- : [ 79/885] 3178859=test_rdoc_generator_markup I, [2024-05-08T19:39:21.799481 #3137477] INFO -- : [ 80/885] 3178859=test_boolean I, [2024-05-08T19:39:21.812233 #3137477] INFO -- : [ 81/885] 3178865=test_instrumentation_api I, [2024-05-08T19:39:21.828828 #3137477] INFO -- : [ 82/885] 3178859=integer_parse_test I, [2024-05-08T19:39:21.836633 #3137477] INFO -- : [ 83/885] 3178862=test_stringify_symbols I, [2024-05-08T19:39:21.841223 #3137477] INFO -- : [ 84/885] 3178879=test_benchmark I, [2024-05-08T19:39:21.843631 #3137477] INFO -- : [ 85/885] 3178871=test_gem_dependency_list I, [2024-05-08T19:39:21.844242 #3137477] INFO -- : [ 86/885] 3178862=test_nesting_parser I, [2024-05-08T19:39:21.870175 #3137477] INFO -- : [ 87/885] 3178859=test_win32ole_method_event I, [2024-05-08T19:39:21.873275 #3137477] INFO -- : [ 88/885] 3178859=test_scalar_scanner I, [2024-05-08T19:39:21.879390 #3137477] INFO -- : [ 89/885] 3178859=test_gem_source I, [2024-05-08T19:39:21.879893 #3137477] INFO -- : [ 90/885] 3178863=test_helper_method I, [2024-05-08T19:39:21.910095 #3137477] INFO -- : [ 91/885] 3178871=test_gem_package_tar_writer I, [2024-05-08T19:39:21.913564 #3137477] INFO -- : [ 92/885] 3178862=test_array I, [2024-05-08T19:39:21.951107 #3137477] INFO -- : [ 93/885] 3178873=test_gem_commands_outdated_command I, [2024-05-08T19:39:21.987263 #3137477] INFO -- : [ 94/885] 3178863=test_provider I, [2024-05-08T19:39:22.000780 #3137477] INFO -- : [ 95/885] 3178858=test_abi I, [2024-05-08T19:39:22.008129 #3137477] INFO -- : [ 96/885] 3178871=test_yamldbm I, [2024-05-08T19:39:22.012673 #3137477] INFO -- : [ 97/885] 3178871=test_gem_commands_rebuild_command I, [2024-05-08T19:39:22.048582 #3137477] INFO -- : [ 98/885] 3178873=test_load I, [2024-05-08T19:39:22.048727 #3137477] INFO -- : [ 99/885] 3178873=test_rdoc_parser_simple I, [2024-05-08T19:39:22.057845 #3137477] INFO -- : [100/885] 3178871=test_gem_ext_builder I, [2024-05-08T19:39:22.089759 #3137477] INFO -- : [101/885] 3178873=test_https I, [2024-05-08T19:39:22.143476 #3137477] INFO -- : [102/885] 3178858=test_evaluation I, [2024-05-08T19:39:22.154091 #3137477] INFO -- : [103/885] 3178858=test_gem_source_installed I, [2024-05-08T19:39:22.185799 #3137477] INFO -- : [104/885] 3178858=test_erb I, [2024-05-08T19:39:22.203437 #3137477] INFO -- : [105/885] 3178870=test_x509ext I, [2024-05-08T19:39:22.217799 #3137477] INFO -- : [106/885] 3178858=test_yield_block I, [2024-05-08T19:39:22.218363 #3137477] INFO -- : [107/885] 3178858=test_len I, [2024-05-08T19:39:22.220551 #3137477] INFO -- : [108/885] 3178870=test_completion I, [2024-05-08T19:39:22.221961 #3137477] INFO -- : [109/885] 3178858=test_gem_commands_cert_command I, [2024-05-08T19:39:22.252283 #3137477] INFO -- : [110/885] 3178864=test_rational I, [2024-05-08T19:39:22.259969 #3137477] INFO -- : [111/885] 3178863=test_rational2 I, [2024-05-08T19:39:22.271500 #3137477] INFO -- : [112/885] 3178864=attribute_write_test I, [2024-05-08T19:39:22.278826 #3137477] INFO -- : [113/885] 3178863=test_propertyputref I, [2024-05-08T19:39:22.278896 #3137477] INFO -- : [114/885] 3178863=test_spell_checker I, [2024-05-08T19:39:22.292156 #3137477] INFO -- : [115/885] 3178863=test_assembler I, [2024-05-08T19:39:22.295429 #3137477] INFO -- : [116/885] 3178863=test_human_typo I, [2024-05-08T19:39:22.297557 #3137477] INFO -- : [117/885] 3178863=test_primitive I, [2024-05-08T19:39:22.305222 #3137477] INFO -- : [118/885] 3178859=test_rbconfig I, [2024-05-08T19:39:22.308569 #3137477] INFO -- : [119/885] 3178859=test_gem_commands_yank_command I, [2024-05-08T19:39:22.314554 #3137477] INFO -- : [120/885] 3178863=test_win32ole_param I, [2024-05-08T19:39:22.317187 #3137477] INFO -- : [121/885] 3178863=test_pair I, [2024-05-08T19:39:22.334129 #3137477] INFO -- : [122/885] 3178864=test_rdoc_generator_pot_po_entry I, [2024-05-08T19:39:22.340179 #3137477] INFO -- : [123/885] 3178864=test_euc_jp I, [2024-05-08T19:39:22.344622 #3137477] INFO -- : [124/885] 3178864=test_acceptable I, [2024-05-08T19:39:22.457494 #3137477] INFO -- : [125/885] 3178873=test_document I, [2024-05-08T19:39:22.468630 #3137477] INFO -- : [126/885] 3178873=test_rdoc_i18n_locale I, [2024-05-08T19:39:22.477508 #3137477] INFO -- : [127/885] 3178864=test_name_error_extension I, [2024-05-08T19:39:22.477825 #3137477] INFO -- : [128/885] 3178857=test_chilled I, [2024-05-08T19:39:22.484677 #3137477] INFO -- : [129/885] 3178857=test_httpresponses I, [2024-05-08T19:39:22.489293 #3137477] INFO -- : [130/885] 3178873=test_encoding I, [2024-05-08T19:39:22.492450 #3137477] INFO -- : [131/885] 3178864=test_set_len I, [2024-05-08T19:39:22.494954 #3137477] INFO -- : [132/885] 3178864=test_rdoc_ri_driver I, [2024-05-08T19:39:22.504099 #3137477] INFO -- : [133/885] 3178873=test_gem_resolver_local_specification I, [2024-05-08T19:39:22.533673 #3137477] INFO -- : [134/885] 3178857=test_httpheader I, [2024-05-08T19:39:22.535779 #3137477] INFO -- : [135/885] 3178873=test_rdoc_markup_to_label I, [2024-05-08T19:39:22.546554 #3137477] INFO -- : [136/885] 3178857=test_install I, [2024-05-08T19:39:22.565193 #3137477] INFO -- : [137/885] 3178873=test_sockopt I, [2024-05-08T19:39:22.566689 #3137477] INFO -- : [138/885] 3178873=test_color I, [2024-05-08T19:39:22.585471 #3137477] INFO -- : [139/885] 3178869=json_encoding_test I, [2024-05-08T19:39:22.592977 #3137477] INFO -- : [140/885] 3178869=test_key_stroke I, [2024-05-08T19:39:22.665687 #3137477] INFO -- : [141/885] 3178869=test_rdoc_markup_to_html I, [2024-05-08T19:39:22.673884 #3137477] INFO -- : [142/885] 3178873=test_date_compat I, [2024-05-08T19:39:22.675950 #3137477] INFO -- : [143/885] 3178873=test_bug-14834 I, [2024-05-08T19:39:22.691820 #3137477] INFO -- : [144/885] 3178855=test_compile_prism I, [2024-05-08T19:39:22.758374 #3137477] INFO -- : [145/885] 3178873=test_terminfo I, [2024-05-08T19:39:22.762177 #3137477] INFO -- : [146/885] 3178873=test_case_mapping I, [2024-05-08T19:39:22.773238 #3137477] INFO -- : [147/885] 3178873=redundant_return_test I, [2024-05-08T19:39:22.774177 #3137477] INFO -- : [148/885] 3178857=test_path I, [2024-05-08T19:39:22.786521 #3137477] INFO -- : [149/885] 3178857=test_win32ole_param_event I, [2024-05-08T19:39:22.788496 #3137477] INFO -- : [150/885] 3178859=test_bn I, [2024-05-08T19:39:22.792507 #3137477] INFO -- : [151/885] 3178857=test_addrinfo I, [2024-05-08T19:39:22.804774 #3137477] INFO -- : [152/885] 3178859=test_http I, [2024-05-08T19:39:22.834359 #3137477] INFO -- : [153/885] 3178873=test_tree_spell_checker I, [2024-05-08T19:39:22.835737 #3137477] INFO -- : [154/885] 3178870=static_literals_test I, [2024-05-08T19:39:22.840089 #3137477] INFO -- : [155/885] 3178870=test_data I, [2024-05-08T19:39:22.844460 #3137477] INFO -- : [156/885] 3178870=test_gem_gem_runner I, [2024-05-08T19:39:22.853147 #3137477] INFO -- : [157/885] 3178864=test_filter I, [2024-05-08T19:39:22.860933 #3137477] INFO -- : [158/885] 3178873=test_rdoc_method_attr I, [2024-05-08T19:39:22.886649 #3137477] INFO -- : [159/885] 3178870=test_unicode I, [2024-05-08T19:39:22.889338 #3137477] INFO -- : [160/885] 3178864=test_koi8 I, [2024-05-08T19:39:22.890009 #3137477] INFO -- : [161/885] 3178857=parameters_signature_test I, [2024-05-08T19:39:22.894316 #3137477] INFO -- : [162/885] 3178864=test_rdoc_parser_changelog I, [2024-05-08T19:39:22.896829 #3137477] INFO -- : [163/885] 3178870=test_enumerator I, [2024-05-08T19:39:22.902617 #3137477] INFO -- : [164/885] 3178870=test_rdoc_generator_pot I, [2024-05-08T19:39:22.948734 #3137477] INFO -- : [165/885] 3178864=test_lexer I, [2024-05-08T19:39:22.960459 #3137477] INFO -- : [166/885] 3178857=test_thread_cv I, [2024-05-08T19:39:22.962478 #3137477] INFO -- : [167/885] 3178864=test_ssl_session I, [2024-05-08T19:39:22.981027 #3137477] INFO -- : [168/885] 3178855=test_random I, [2024-05-08T19:39:22.984198 #3137477] INFO -- : [169/885] 3178869=test_notimplement I, [2024-05-08T19:39:22.985987 #3137477] INFO -- : [170/885] 3178855=test_key_event_record I, [2024-05-08T19:39:22.992640 #3137477] INFO -- : [171/885] 3178869=test_gem_uri I, [2024-05-08T19:39:23.012947 #3137477] INFO -- : [172/885] 3178873=test_gem_commands_update_command I, [2024-05-08T19:39:23.017778 #3137477] INFO -- : [173/885] 3178879=test_gem_resolver_vendor_specification I, [2024-05-08T19:39:23.038405 #3137477] INFO -- : [174/885] 3178879=test_gem_commands_build_command I, [2024-05-08T19:39:23.046841 #3137477] INFO -- : [175/885] 3178870=test_case_comprehensive I, [2024-05-08T19:39:23.047107 #3137477] INFO -- : [176/885] 3178855=test_interned_str I, [2024-05-08T19:39:23.053952 #3137477] INFO -- : [177/885] 3178855=test_gem_commands_server_command I, [2024-05-08T19:39:23.054886 #3137477] INFO -- : [178/885] 3178855=test_did_you_mean I, [2024-05-08T19:39:23.138357 #3137477] INFO -- : [179/885] 3178869=test_variable_name_check I, [2024-05-08T19:39:23.160769 #3137477] INFO -- : [180/885] 3178869=test_io_m17n I, [2024-05-08T19:39:23.220844 #3137477] INFO -- : [181/885] 3178879=test_tracer I, [2024-05-08T19:39:23.223531 #3137477] INFO -- : [182/885] 3178871=test_cmethod I, [2024-05-08T19:39:23.227861 #3137477] INFO -- : [183/885] 3178855=test_option I, [2024-05-08T19:39:23.231011 #3137477] INFO -- : [184/885] 3178871=test_append I, [2024-05-08T19:39:23.232106 #3137477] INFO -- : [185/885] 3178871=test_rdoc_markup_heading I, [2024-05-08T19:39:23.236557 #3137477] INFO -- : [186/885] 3178861=test_iseq I, [2024-05-08T19:39:23.306205 #3137477] INFO -- : [187/885] 3178879=test_exception_at_throwing I, [2024-05-08T19:39:23.344446 #3137477] INFO -- : [188/885] 3178871=test_pkey_dsa I, [2024-05-08T19:39:23.347875 #3137477] INFO -- : [189/885] 3178879=test_class I, [2024-05-08T19:39:23.350796 #3137477] INFO -- : [190/885] 3178879=test_ocsp I, [2024-05-08T19:39:23.395446 #3137477] INFO -- : [191/885] 3178855=test_scheduler I, [2024-05-08T19:39:23.409280 #3137477] INFO -- : [192/885] 3178867=reflection_test I, [2024-05-08T19:39:23.476451 #3137477] INFO -- : [193/885] 3178867=test_within_pipe I, [2024-05-08T19:39:23.534395 #3137477] INFO -- : [194/885] 3178855=test_gem_bundler_version_finder I, [2024-05-08T19:39:23.542575 #3137477] INFO -- : [195/885] 3178867=test_emoji_breaks I, [2024-05-08T19:39:23.544691 #3137477] INFO -- : [196/885] 3178867=test_help I, [2024-05-08T19:39:23.555167 #3137477] INFO -- : [197/885] 3178867=test_rdoc_markup_to_bs I, [2024-05-08T19:39:23.557192 #3137477] INFO -- : [198/885] 3178855=test_beginendblock I, [2024-05-08T19:39:23.597218 #3137477] INFO -- : [199/885] 3178857=test_gem_commands_unpack_command I, [2024-05-08T19:39:23.658288 #3137477] INFO -- : [200/885] 3178879=test_files_lib I, [2024-05-08T19:39:23.703621 #3137477] INFO -- : [201/885] 3178867=test_stream I, [2024-05-08T19:39:23.741080 #3137477] INFO -- : [202/885] 3178867=test_time I, [2024-05-08T19:39:23.805778 #3137477] INFO -- : [203/885] 3178868=test_webauthn_listener_response I, [2024-05-08T19:39:23.840615 #3137477] INFO -- : [204/885] 3178861=test_to_ary_concat I, [2024-05-08T19:39:23.866752 #3137477] INFO -- : [205/885] 3178858=test_printf I, [2024-05-08T19:39:23.885997 #3137477] INFO -- : [206/885] 3178858=test_rdoc_markup_pre_process I, [2024-05-08T19:39:23.904572 #3137477] INFO -- : [207/885] 3178867=test_pinned I, [2024-05-08T19:39:23.934521 #3137477] INFO -- : [208/885] 3178867=test_date_marshal I, [2024-05-08T19:39:23.935826 #3137477] INFO -- : [209/885] 3178867=test_mkmf I, [2024-05-08T19:39:23.954874 #3137477] INFO -- : [210/885] 3178868=test_history I, [2024-05-08T19:39:23.982795 #3137477] INFO -- : [211/885] 3178855=test_popen_deadlock I, [2024-05-08T19:39:23.993705 #3137477] INFO -- : [212/885] 3178867=test_delegate I, [2024-05-08T19:39:24.001296 #3137477] INFO -- : [213/885] 3178864=test_exit I, [2024-05-08T19:39:24.014015 #3137477] INFO -- : [214/885] 3178867=test_recursion I, [2024-05-08T19:39:24.017999 #3137477] INFO -- : [215/885] 3178867=test_rdoc_servlet I, [2024-05-08T19:39:24.032533 #3137477] INFO -- : [216/885] 3178871=test_gem_security I, [2024-05-08T19:39:24.073159 #3137477] INFO -- : [217/885] 3178858=test_ractor I, [2024-05-08T19:39:24.076415 #3137477] INFO -- : [218/885] 3178866=test_digest I, [2024-05-08T19:39:24.114520 #3137477] INFO -- : [219/885] 3178868=test_bundled_ca I, [2024-05-08T19:39:24.120634 #3137477] INFO -- : [220/885] 3178866=test_closure I, [2024-05-08T19:39:24.132362 #3137477] INFO -- : [221/885] 3178858=test_open3 I, [2024-05-08T19:39:24.134160 #3137477] INFO -- : [222/885] 3178873=test_fiber I, [2024-05-08T19:39:24.194949 #3137477] INFO -- : [223/885] 3178857=test_multi_irb_commands I, [2024-05-08T19:39:24.200852 #3137477] INFO -- : [224/885] 3178857=test_gem_commands_check_command I, [2024-05-08T19:39:24.206612 #3137477] INFO -- : [225/885] 3178864=test_regexp I, [2024-05-08T19:39:24.228884 #3137477] INFO -- : [226/885] 3178857=errors_test I, [2024-05-08T19:39:24.256022 #3137477] INFO -- : [227/885] 3178872=test_integer_comb I, [2024-05-08T19:39:24.273128 #3137477] INFO -- : [228/885] 3178867=test_rdoc_markup_document I, [2024-05-08T19:39:24.276535 #3137477] INFO -- : [229/885] 3178867=test_tmpdir I, [2024-05-08T19:39:24.283396 #3137477] INFO -- : [230/885] 3178856=test_vm_dump I, [2024-05-08T19:39:24.284885 #3137477] INFO -- : [231/885] 3178856=test_udp I, [2024-05-08T19:39:24.288527 #3137477] INFO -- : [232/885] 3178856=test_ostruct I, [2024-05-08T19:39:24.299715 #3137477] INFO -- : [233/885] 3178861=unescape_test I, [2024-05-08T19:39:24.332607 #3137477] INFO -- : [234/885] 3178866=test_force_exit I, [2024-05-08T19:39:24.354350 #3137477] INFO -- : [235/885] 3178857=test_file I, [2024-05-08T19:39:24.367814 #3137477] INFO -- : [236/885] 3178867=bom_test I, [2024-05-08T19:39:24.378164 #3137477] INFO -- : [237/885] 3178869=test_data_error I, [2024-05-08T19:39:24.384014 #3137477] INFO -- : [238/885] 3178867=static_inspect_test I, [2024-05-08T19:39:24.399091 #3137477] INFO -- : [239/885] 3178867=test_encoding I, [2024-05-08T19:39:24.440173 #3137477] INFO -- : [240/885] 3178856=test_erb_command I, [2024-05-08T19:39:24.450402 #3137477] INFO -- : [241/885] 3178866=test_helper I, [2024-05-08T19:39:24.450569 #3137477] INFO -- : [242/885] 3178866=test_gem_uri_formatter I, [2024-05-08T19:39:24.451761 #3137477] INFO -- : [243/885] 3178869=command_line_test I, [2024-05-08T19:39:24.468543 #3137477] INFO -- : [244/885] 3178856=test_constant I, [2024-05-08T19:39:24.514476 #3137477] INFO -- : [245/885] 3178869=test_dup I, [2024-05-08T19:39:24.558370 #3137477] INFO -- : [246/885] 3178867=test_pty I, [2024-05-08T19:39:24.611114 #3137477] INFO -- : [247/885] 3178855=test_range I, [2024-05-08T19:39:24.642019 #3137477] INFO -- : [248/885] 3178869=test_project_sanity I, [2024-05-08T19:39:24.651670 #3137477] INFO -- : [249/885] 3178866=test_rdoc_ri_paths I, [2024-05-08T19:39:24.732786 #3137477] INFO -- : [250/885] 3178869=test_locale I, [2024-05-08T19:39:24.777156 #3137477] INFO -- : [251/885] 3178865=test_addr I, [2024-05-08T19:39:24.782664 #3137477] INFO -- : [252/885] 3178869=library_symbols_test I, [2024-05-08T19:39:24.782737 #3137477] INFO -- : [253/885] 3178869=test_ensured I, [2024-05-08T19:39:24.807122 #3137477] INFO -- : [254/885] 3178865=test_ts I, [2024-05-08T19:39:24.830114 #3137477] INFO -- : [255/885] 3178866=test_enumerable I, [2024-05-08T19:39:24.836592 #3137477] INFO -- : [256/885] 3178869=test_gem_resolver_vendor_set I, [2024-05-08T19:39:24.842856 #3137477] INFO -- : [257/885] 3178866=test_config I, [2024-05-08T19:39:24.866813 #3137477] INFO -- : [258/885] 3178869=test_gem_resolver_api_set I, [2024-05-08T19:39:24.918163 #3137477] INFO -- : [259/885] 3178869=test_gem_safe_marshal I, [2024-05-08T19:39:25.010776 #3137477] INFO -- : [260/885] 3178867=test_transcode I, [2024-05-08T19:39:25.188885 #3137477] INFO -- : [261/885] 3178867=json_generator_test I, [2024-05-08T19:39:25.272220 #3137477] INFO -- : [262/885] 3178867=test_eval I, [2024-05-08T19:39:25.287951 #3137477] INFO -- : [263/885] 3178862=test_x509store I, [2024-05-08T19:39:25.303120 #3137477] INFO -- : [264/885] 3178855=test_rdoc_code_object I, [2024-05-08T19:39:25.312598 #3137477] INFO -- : [265/885] 3178865=test_x509name I, [2024-05-08T19:39:25.319451 #3137477] INFO -- : [266/885] 3178869=test_fips I, [2024-05-08T19:39:25.324955 #3137477] INFO -- : [267/885] 3178865=test_update I, [2024-05-08T19:39:25.332225 #3137477] INFO -- : [268/885] 3178865=test_jaro_winkler I, [2024-05-08T19:39:25.333911 #3137477] INFO -- : [269/885] 3178865=test_helper I, [2024-05-08T19:39:25.338900 #3137477] INFO -- : [270/885] 3178866=test_random_formatter I, [2024-05-08T19:39:25.358632 #3137477] INFO -- : [271/885] 3178866=test_ast I, [2024-05-08T19:39:25.393757 #3137477] INFO -- : [272/885] 3178865=test_gem_request_set_gem_dependency_api I, [2024-05-08T19:39:25.498960 #3137477] INFO -- : [273/885] 3178869=test_lambda I, [2024-05-08T19:39:25.527046 #3137477] INFO -- : [274/885] 3178865=test_webauthn_listener I, [2024-05-08T19:39:25.533058 #3137477] INFO -- : [275/885] 3178867=test_numhash I, [2024-05-08T19:39:25.535384 #3137477] INFO -- : [276/885] 3178867=test_gem_commands_push_command I, [2024-05-08T19:39:25.549246 #3137477] INFO -- : [277/885] 3178869=test_weakkeymap I, [2024-05-08T19:39:25.576300 #3137477] INFO -- : [278/885] 3178865=test_pkey_rsa I, [2024-05-08T19:39:25.634154 #3137477] INFO -- : [279/885] 3178861=test_gem_platform I, [2024-05-08T19:39:25.689695 #3137477] INFO -- : [280/885] 3178862=test_rdoc_markup_hard_break I, [2024-05-08T19:39:25.723200 #3137477] INFO -- : [281/885] 3178861=test_placearg I, [2024-05-08T19:39:25.783041 #3137477] INFO -- : [282/885] 3178868=test_gem_package_task I, [2024-05-08T19:39:25.783541 #3137477] INFO -- : [283/885] 3178868=test_date_strptime I, [2024-05-08T19:39:25.794934 #3137477] INFO -- : [284/885] 3178869=test_win32ole_method I, [2024-05-08T19:39:25.801392 #3137477] INFO -- : [285/885] 3178869=test_delete I, [2024-05-08T19:39:25.809420 #3137477] INFO -- : [286/885] 3178869=test_class_name_check I, [2024-05-08T19:39:25.812114 #3137477] INFO -- : [287/885] 3178862=test_keyword I, [2024-05-08T19:39:25.823743 #3137477] INFO -- : [288/885] 3178869=test_continuation I, [2024-05-08T19:39:25.827999 #3137477] INFO -- : [289/885] 3178869=test_fd_setsize I, [2024-05-08T19:39:25.830521 #3137477] INFO -- : [290/885] 3178869=test_gem_update_suggestion I, [2024-05-08T19:39:25.842406 #3137477] INFO -- : [291/885] 3178865=test_files_test I, [2024-05-08T19:39:25.845680 #3137477] INFO -- : [292/885] 3178863=test_file_exhaustive I, [2024-05-08T19:39:25.871920 #3137477] INFO -- : [293/885] 3178861=test_logger I, [2024-05-08T19:39:25.874688 #3137477] INFO -- : [294/885] 3178868=test_not I, [2024-05-08T19:39:25.880512 #3137477] INFO -- : [295/885] 3178868=test_gem_resolver_lock_set I, [2024-05-08T19:39:25.892596 #3137477] INFO -- : [296/885] 3178861=test_import I, [2024-05-08T19:39:25.909636 #3137477] INFO -- : [297/885] 3178869=test_rdoc_parser_markdown I, [2024-05-08T19:39:25.918567 #3137477] INFO -- : [298/885] 3178865=test_object I, [2024-05-08T19:39:25.921875 #3137477] INFO -- : [299/885] 3178869=heredoc_dedent_test I, [2024-05-08T19:39:25.925679 #3137477] INFO -- : [300/885] 3178868=test_cgi_header I, [2024-05-08T19:39:25.930213 #3137477] INFO -- : [301/885] 3178869=version_test I, [2024-05-08T19:39:25.938506 #3137477] INFO -- : [302/885] 3178869=test_gem_command_manager I, [2024-05-08T19:39:25.941298 #3137477] INFO -- : [303/885] 3178855=test_basicinstructions I, [2024-05-08T19:39:25.944396 #3137477] INFO -- : [304/885] 3178865=test_gem_gemcutter_utilities I, [2024-05-08T19:39:25.948456 #3137477] INFO -- : [305/885] 3178868=test_key_actor_emacs I, [2024-05-08T19:39:26.023348 #3137477] INFO -- : [306/885] 3178855=test_arithmetic_sequence I, [2024-05-08T19:39:26.034357 #3137477] INFO -- : [307/885] 3178855=test_normalize I, [2024-05-08T19:39:26.036430 #3137477] INFO -- : [308/885] 3178855=test_ossl I, [2024-05-08T19:39:26.078836 #3137477] INFO -- : [309/885] 3178868=test_timeout I, [2024-05-08T19:39:26.089185 #3137477] INFO -- : [310/885] 3178868=test_flip I, [2024-05-08T19:39:26.119567 #3137477] INFO -- : [311/885] 3178869=compiler_test I, [2024-05-08T19:39:26.121079 #3137477] INFO -- : [312/885] 3178868=test_change_word I, [2024-05-08T19:39:26.125688 #3137477] INFO -- : [313/885] 3178869=test_sleep I, [2024-05-08T19:39:26.132182 #3137477] INFO -- : [314/885] 3178868=test_gem_local_remote_options I, [2024-05-08T19:39:26.192854 #3137477] INFO -- : [315/885] 3178868=test_ruby_lex I, [2024-05-08T19:39:26.239125 #3137477] INFO -- : [316/885] 3178872=test_object I, [2024-05-08T19:39:26.255643 #3137477] INFO -- : [317/885] 3178867=test_date_arith I, [2024-05-08T19:39:26.266829 #3137477] INFO -- : [318/885] 3178867=test_pointer I, [2024-05-08T19:39:26.276853 #3137477] INFO -- : [319/885] 3178865=test_big5 I, [2024-05-08T19:39:26.280073 #3137477] INFO -- : [320/885] 3178865=test_func I, [2024-05-08T19:39:26.287712 #3137477] INFO -- : [321/885] 3178868=test_type I, [2024-05-08T19:39:26.293582 #3137477] INFO -- : [322/885] 3178868=test_ractor I, [2024-05-08T19:39:26.349852 #3137477] INFO -- : [323/885] 3178868=test_tsort I, [2024-05-08T19:39:26.356516 #3137477] INFO -- : [324/885] 3178868=test_signedness I, [2024-05-08T19:39:26.430862 #3137477] INFO -- : [325/885] 3178862=test_rdoc_rd_block_parser I, [2024-05-08T19:39:26.469789 #3137477] INFO -- : [326/885] 3178862=test_win32ole_event I, [2024-05-08T19:39:26.470967 #3137477] INFO -- : [327/885] 3178862=test_time_tz I, [2024-05-08T19:39:26.518823 #3137477] INFO -- : [328/885] 3178862=test_rdoc_generator_json_index I, [2024-05-08T19:39:26.574669 #3137477] INFO -- : [329/885] 3178861=ractor_test I, [2024-05-08T19:39:26.593666 #3137477] INFO -- : [330/885] 3178862=test_trace I, [2024-05-08T19:39:26.605127 #3137477] INFO -- : [331/885] 3178862=test_io_wait_uncommon I, [2024-05-08T19:39:26.613109 #3137477] INFO -- : [332/885] 3178862=test_arity I, [2024-05-08T19:39:26.614761 #3137477] INFO -- : [333/885] 3178862=test_stringio I, [2024-05-08T19:39:26.647069 #3137477] INFO -- : [334/885] 3178858=test_win32ole_variable I, [2024-05-08T19:39:26.653206 #3137477] INFO -- : [335/885] 3178858=test_gem_ci_detector I, [2024-05-08T19:39:26.659363 #3137477] INFO -- : [336/885] 3178861=test_bignum I, [2024-05-08T19:39:26.660132 #3137477] INFO -- : [337/885] 3178858=test_rdoc_class_module I, [2024-05-08T19:39:26.662401 #3137477] INFO -- : [338/885] 3178867=test_threadgroup I, [2024-05-08T19:39:26.690269 #3137477] INFO -- : [339/885] 3178872=test_gem_specification I, [2024-05-08T19:39:26.726892 #3137477] INFO -- : [340/885] 3178862=test_enum I, [2024-05-08T19:39:26.770978 #3137477] INFO -- : [341/885] 3178856=test_complex2 I, [2024-05-08T19:39:26.779355 #3137477] INFO -- : [342/885] 3178856=test_resolve_symbol I, [2024-05-08T19:39:26.788419 #3137477] INFO -- : [343/885] 3178861=test_gem_package I, [2024-05-08T19:39:26.872910 #3137477] INFO -- : [344/885] 3178856=test_have_macro I, [2024-05-08T19:39:27.197208 #3137477] INFO -- : [345/885] 3178861=test_merge_keys I, [2024-05-08T19:39:27.208473 #3137477] INFO -- : [346/885] 3178861=test_rdoc_extend I, [2024-05-08T19:39:27.257146 #3137477] INFO -- : [347/885] 3178856=test_rdoc_markup_to_ansi I, [2024-05-08T19:39:27.349276 #3137477] INFO -- : [348/885] 3178861=test_history I, [2024-05-08T19:39:27.353570 #3137477] INFO -- : [349/885] 3178865=test_mixed_unicode_escapes I, [2024-05-08T19:39:27.354015 #3137477] INFO -- : [350/885] 3178865=test_ipaddr I, [2024-05-08T19:39:27.362174 #3137477] INFO -- : [351/885] 3178858=test_win32ole_variant I, [2024-05-08T19:39:27.366572 #3137477] INFO -- : [352/885] 3178858=test_gem_resolver_api_specification I, [2024-05-08T19:39:27.374045 #3137477] INFO -- : [353/885] 3178865=test_word I, [2024-05-08T19:39:27.376535 #3137477] INFO -- : [354/885] 3178861=test_gem_commands_cleanup_command I, [2024-05-08T19:39:27.380952 #3137477] INFO -- : [355/885] 3178865=test_cgi_multipart I, [2024-05-08T19:39:27.415219 #3137477] INFO -- : [356/885] 3178858=test_member I, [2024-05-08T19:39:27.418277 #3137477] INFO -- : [357/885] 3178858=test_numeric I, [2024-05-08T19:39:27.431378 #3137477] INFO -- : [358/885] 3178858=test_eval I, [2024-05-08T19:39:27.436595 #3137477] INFO -- : [359/885] 3178858=test_autoconf I, [2024-05-08T19:39:27.441099 #3137477] INFO -- : [360/885] 3178858=format_errors_test I, [2024-05-08T19:39:27.444212 #3137477] INFO -- : [361/885] 3178856=test_dir I, [2024-05-08T19:39:27.502099 #3137477] INFO -- : [362/885] 3178865=test_gem_console_ui I, [2024-05-08T19:39:27.510125 #3137477] INFO -- : [363/885] 3178865=test_date_ractor I, [2024-05-08T19:39:27.522745 #3137477] INFO -- : [364/885] 3178858=test_ractor_compatibility I, [2024-05-08T19:39:27.664941 #3137477] INFO -- : [365/885] 3178867=test_mailto I, [2024-05-08T19:39:27.667413 #3137477] INFO -- : [366/885] 3178856=test_symbol I, [2024-05-08T19:39:27.668577 #3137477] INFO -- : [367/885] 3178862=location_test I, [2024-05-08T19:39:27.670124 #3137477] INFO -- : [368/885] 3178879=test_coderange I, [2024-05-08T19:39:27.671353 #3137477] INFO -- : [369/885] 3178856=json_generic_object_test I, [2024-05-08T19:39:27.673621 #3137477] INFO -- : [370/885] 3178867=test_gem_source_fetch_problem I, [2024-05-08T19:39:27.675756 #3137477] INFO -- : [371/885] 3178879=test_http_request I, [2024-05-08T19:39:27.679116 #3137477] INFO -- : [372/885] 3178856=test_resize I, [2024-05-08T19:39:27.684150 #3137477] INFO -- : [373/885] 3178856=test_error_highlight I, [2024-05-08T19:39:27.685599 #3137477] INFO -- : [374/885] 3178867=test_rdoc_comment I, [2024-05-08T19:39:27.692802 #3137477] INFO -- : [375/885] 3178861=test_rdoc_generator_darkfish I, [2024-05-08T19:39:27.746241 #3137477] INFO -- : [376/885] 3178867=test_function_entry I, [2024-05-08T19:39:27.748737 #3137477] INFO -- : [377/885] 3178879=test_arith_seq_beg_len_step I, [2024-05-08T19:39:27.754730 #3137477] INFO -- : [378/885] 3178867=test_gem_resolver_requirement_list I, [2024-05-08T19:39:27.776887 #3137477] INFO -- : [379/885] 3178867=test_pkcs7 I, [2024-05-08T19:39:27.797958 #3137477] INFO -- : [380/885] 3178865=test_enc_associate I, [2024-05-08T19:39:27.800702 #3137477] INFO -- : [381/885] 3178862=test_lazy_enumerator I, [2024-05-08T19:39:27.822500 #3137477] INFO -- : [382/885] 3178879=test_unix I, [2024-05-08T19:39:27.848685 #3137477] INFO -- : [383/885] 3178879=test_nofree I, [2024-05-08T19:39:27.850886 #3137477] INFO -- : [384/885] 3178879=test_context I, [2024-05-08T19:39:27.877703 #3137477] INFO -- : [385/885] 3178861=test_gem_commands_pristine_command I, [2024-05-08T19:39:27.933966 #3137477] INFO -- : [386/885] 3178879=test_symbol I, [2024-05-08T19:39:27.969345 #3137477] INFO -- : [387/885] 3178858=test_coder I, [2024-05-08T19:39:27.977824 #3137477] INFO -- : [388/885] 3178856=test_find_executable I, [2024-05-08T19:39:27.979865 #3137477] INFO -- : [389/885] 3178856=ruby_api_test I, [2024-05-08T19:39:27.988332 #3137477] INFO -- : [390/885] 3178858=test_rubygems I, [2024-05-08T19:39:27.999297 #3137477] INFO -- : [391/885] 3178867=test_https_proxy I, [2024-05-08T19:39:28.039872 #3137477] INFO -- : [392/885] 3178867=test_call I, [2024-05-08T19:39:28.049394 #3137477] INFO -- : [393/885] 3178862=test_integer I, [2024-05-08T19:39:28.123859 #3137477] INFO -- : [394/885] 3178856=test_cgi_modruby I, [2024-05-08T19:39:28.136764 #3137477] INFO -- : [395/885] 3178856=test_rubyoptions I, [2024-05-08T19:39:28.203303 #3137477] INFO -- : [396/885] 3178867=test_super I, [2024-05-08T19:39:28.209103 #3137477] INFO -- : [397/885] 3178858=test_gem_resolver_git_specification I, [2024-05-08T19:39:28.265374 #3137477] INFO -- : [398/885] 3178871=test_usrmarshal I, [2024-05-08T19:39:28.377615 #3137477] INFO -- : [399/885] 3178865=test_object_references I, [2024-05-08T19:39:28.383150 #3137477] INFO -- : [400/885] 3178865=test_capacity I, [2024-05-08T19:39:28.388553 #3137477] INFO -- : [401/885] 3178865=test_nextafter I, [2024-05-08T19:39:28.392987 #3137477] INFO -- : [402/885] 3178858=test_have_func I, [2024-05-08T19:39:28.417370 #3137477] INFO -- : [403/885] 3178871=test_stat I, [2024-05-08T19:39:28.420561 #3137477] INFO -- : [404/885] 3178871=test_gem_request_set_lockfile_tokenizer I, [2024-05-08T19:39:28.465924 #3137477] INFO -- : [405/885] 3178865=desugar_compiler_test I, [2024-05-08T19:39:28.474277 #3137477] INFO -- : [406/885] 3178865=test_integer I, [2024-05-08T19:39:28.495742 #3137477] INFO -- : [407/885] 3178871=test_dryrun I, [2024-05-08T19:39:28.520152 #3137477] INFO -- : [408/885] 3178871=test_rdoc_attr I, [2024-05-08T19:39:28.533713 #3137477] INFO -- : [409/885] 3178871=test_env I, [2024-05-08T19:39:28.580655 #3137477] INFO -- : [410/885] 3178865=test_gem_commands_setup_command I, [2024-05-08T19:39:28.792861 #3137477] INFO -- : [411/885] 3178868=test_parser I, [2024-05-08T19:39:28.808700 #3137477] INFO -- : [412/885] 3178868=test_cgi_core I, [2024-05-08T19:39:28.821477 #3137477] INFO -- : [413/885] 3178868=test_gem_commands_open_command I, [2024-05-08T19:39:28.847233 #3137477] INFO -- : [414/885] 3178872=test_dns I, [2024-05-08T19:39:28.902212 #3137477] INFO -- : [415/885] 3178861=test_ractor I, [2024-05-08T19:39:28.904684 #3137477] INFO -- : [416/885] 3178868=test_gem I, [2024-05-08T19:39:28.925169 #3137477] INFO -- : [417/885] 3178861=test_gem_source_lock I, [2024-05-08T19:39:28.966553 #3137477] INFO -- : [418/885] 3178861=test_registry I, [2024-05-08T19:39:28.970373 #3137477] INFO -- : [419/885] 3178861=parse_stream_test I, [2024-05-08T19:39:28.973745 #3137477] INFO -- : [420/885] 3178861=test_ractor I, [2024-05-08T19:39:28.975373 #3137477] INFO -- : [421/885] 3178865=test_debugger_integration I, [2024-05-08T19:39:28.996497 #3137477] INFO -- : [422/885] 3178865=test_rendering I, [2024-05-08T19:39:29.002963 #3137477] INFO -- : [423/885] 3178865=test_thread I, [2024-05-08T19:39:29.061008 #3137477] INFO -- : [424/885] 3178867=json_ext_parser_test I, [2024-05-08T19:39:29.065515 #3137477] INFO -- : [425/885] 3178867=test_my_integer I, [2024-05-08T19:39:29.071370 #3137477] INFO -- : [426/885] 3178867=test_ssl I, [2024-05-08T19:39:29.305632 #3137477] INFO -- : [427/885] 3178872=test_singleton_function I, [2024-05-08T19:39:29.310810 #3137477] INFO -- : [428/885] 3178872=test_ancdata I, [2024-05-08T19:39:29.315908 #3137477] INFO -- : [429/885] 3178872=test_reline_key I, [2024-05-08T19:39:29.349586 #3137477] INFO -- : [430/885] 3178872=test_rb_str_dup I, [2024-05-08T19:39:29.358456 #3137477] INFO -- : [431/885] 3178872=test_nonblock I, [2024-05-08T19:39:29.365403 #3137477] INFO -- : [432/885] 3178872=test_weakref I, [2024-05-08T19:39:29.424705 #3137477] INFO -- : [433/885] 3178861=test_unicode_normalize I, [2024-05-08T19:39:29.474136 #3137477] INFO -- : [434/885] 3178872=test_marshal I, [2024-05-08T19:39:29.492811 #3137477] INFO -- : [435/885] 3178867=test_timeout I, [2024-05-08T19:39:29.546833 #3137477] INFO -- : [436/885] 3178858=test_alias I, [2024-05-08T19:39:29.684882 #3137477] INFO -- : [437/885] 3178858=test_rdoc_cross_reference I, [2024-05-08T19:39:29.830441 #3137477] INFO -- : [438/885] 3178860=test_gem_commands_info_command I, [2024-05-08T19:39:29.932114 #3137477] INFO -- : [439/885] 3178872=test_scalar I, [2024-05-08T19:39:29.938835 #3137477] INFO -- : [440/885] 3178872=test_gem_dependency_installer I, [2024-05-08T19:39:30.046100 #3137477] INFO -- : [441/885] 3178860=test_case_options I, [2024-05-08T19:39:30.057404 #3137477] INFO -- : [442/885] 3178860=test_store I, [2024-05-08T19:39:30.079255 #3137477] INFO -- : [443/885] 3178879=test_exception I, [2024-05-08T19:39:30.086553 #3137477] INFO -- : [444/885] 3178858=test_bug_reporter I, [2024-05-08T19:39:30.088859 #3137477] INFO -- : [445/885] 3178873=test_gem_name_tuple I, [2024-05-08T19:39:30.106149 #3137477] INFO -- : [446/885] 3178873=test_gem_package_tar_reader_entry I, [2024-05-08T19:39:30.260739 #3137477] INFO -- : [447/885] 3178860=test_rand I, [2024-05-08T19:39:30.270452 #3137477] INFO -- : [448/885] 3178873=test_gem_commands_mirror I, [2024-05-08T19:39:30.276815 #3137477] INFO -- : [449/885] 3178873=test_gem_ext_cargo_builder_link_flag_converter I, [2024-05-08T19:39:30.333765 #3137477] INFO -- : [450/885] 3178873=test_gem_request I, [2024-05-08T19:39:30.366863 #3137477] INFO -- : [451/885] 3178867=test_method_cache I, [2024-05-08T19:39:30.373016 #3137477] INFO -- : [452/885] 3178867=test_sprintf_comb I, [2024-05-08T19:39:30.398683 #3137477] INFO -- : [453/885] 3178858=test_win32ole I, [2024-05-08T19:39:30.404210 #3137477] INFO -- : [454/885] 3178858=test_generic I, [2024-05-08T19:39:30.418278 #3137477] INFO -- : [455/885] 3178857=test_scan_args I, [2024-05-08T19:39:30.428902 #3137477] INFO -- : [456/885] 3178857=test_enumerator_kw I, [2024-05-08T19:39:30.430453 #3137477] INFO -- : [457/885] 3178857=test_gem_text I, [2024-05-08T19:39:30.443525 #3137477] INFO -- : [458/885] 3178858=test_settracefunc I, [2024-05-08T19:39:30.481458 #3137477] INFO -- : [459/885] 3178860=test_pkey I, [2024-05-08T19:39:30.483171 #3137477] INFO -- : [460/885] 3178857=test_case I, [2024-05-08T19:39:30.489856 #3137477] INFO -- : [461/885] 3178857=test_reline I, [2024-05-08T19:39:30.517750 #3137477] INFO -- : [462/885] 3178873=test_parser_events I, [2024-05-08T19:39:30.527253 #3137477] INFO -- : [463/885] 3178860=test_cclass I, [2024-05-08T19:39:30.551185 #3137477] INFO -- : [464/885] 3178867=test_gem_version_option I, [2024-05-08T19:39:30.580712 #3137477] INFO -- : [465/885] 3178873=test_grapheme_breaks I, [2024-05-08T19:39:30.600624 #3137477] INFO -- : [466/885] 3178867=test_gem_request_connection_pools I, [2024-05-08T19:39:30.604580 #3137477] INFO -- : [467/885] 3178873=test_memory_view I, [2024-05-08T19:39:30.643209 #3137477] INFO -- : [468/885] 3178860=test_m17n_comb I, [2024-05-08T19:39:30.665210 #3137477] INFO -- : [469/885] 3178857=test_ractor I, [2024-05-08T19:39:30.724916 #3137477] INFO -- : [470/885] 3178857=test_ansi_with_terminfo I, [2024-05-08T19:39:30.731226 #3137477] INFO -- : [471/885] 3178857=test_rdoc_generator_pot_po I, [2024-05-08T19:39:30.744433 #3137477] INFO -- : [472/885] 3178868=test_json_tree I, [2024-05-08T19:39:30.752930 #3137477] INFO -- : [473/885] 3178868=test_rdoc_markup_to_markdown I, [2024-05-08T19:39:30.851425 #3137477] INFO -- : [474/885] 3178873=test_severity I, [2024-05-08T19:39:30.859063 #3137477] INFO -- : [475/885] 3178857=test_ractor I, [2024-05-08T19:39:30.859908 #3137477] INFO -- : [476/885] 3178873=parse_test I, [2024-05-08T19:39:30.871748 #3137477] INFO -- : [477/885] 3178857=test_gem_install_update_options I, [2024-05-08T19:39:30.902730 #3137477] INFO -- : [478/885] 3178868=test_require_lib I, [2024-05-08T19:39:30.970580 #3137477] INFO -- : [479/885] 3178857=test_extlibs I, [2024-05-08T19:39:31.125559 #3137477] INFO -- : [480/885] 3178869=test_rdoc_generator_ri I, [2024-05-08T19:39:31.132821 #3137477] INFO -- : [481/885] 3178869=test_gem_stream_ui I, [2024-05-08T19:39:31.184408 #3137477] INFO -- : [482/885] 3178862=test_literal I, [2024-05-08T19:39:31.220538 #3137477] INFO -- : [483/885] 3178869=test_c_struct_builder I, [2024-05-08T19:39:31.340010 #3137477] INFO -- : [484/885] 3178863=test_dot_dot I, [2024-05-08T19:39:31.347545 #3137477] INFO -- : [485/885] 3178863=test_str2big I, [2024-05-08T19:39:31.352659 #3137477] INFO -- : [486/885] 3178863=test_rdoc_markup_to_table_of_contents I, [2024-05-08T19:39:31.355297 #3137477] INFO -- : [487/885] 3178869=test_objectspace I, [2024-05-08T19:39:31.372046 #3137477] INFO -- : [488/885] 3178863=test_socket I, [2024-05-08T19:39:31.406416 #3137477] INFO -- : [489/885] 3178858=test_thread I, [2024-05-08T19:39:31.550813 #3137477] INFO -- : [490/885] 3178871=test_securerandom I, [2024-05-08T19:39:31.578391 #3137477] INFO -- : [491/885] 3178871=test_logperiod I, [2024-05-08T19:39:31.586310 #3137477] INFO -- : [492/885] 3178871=test_rdoc_markdown_test I, [2024-05-08T19:39:31.628475 #3137477] INFO -- : [493/885] 3178858=test_c_union_entity I, [2024-05-08T19:39:31.635232 #3137477] INFO -- : [494/885] 3178867=test_rdoc_normal_module I, [2024-05-08T19:39:31.686401 #3137477] INFO -- : [495/885] 3178858=test_io_console I, [2024-05-08T19:39:31.687093 #3137477] INFO -- : [496/885] 3178867=test_singleton I, [2024-05-08T19:39:31.695897 #3137477] INFO -- : [497/885] 3178867=test_flush I, [2024-05-08T19:39:31.700334 #3137477] INFO -- : [498/885] 3178867=test_switch_hitter I, [2024-05-08T19:39:31.712603 #3137477] INFO -- : [499/885] 3178879=newline_test I, [2024-05-08T19:39:31.717392 #3137477] INFO -- : [500/885] 3178867=test_uncorrectable_name_check I, [2024-05-08T19:39:31.722249 #3137477] INFO -- : [501/885] 3178867=test_stringchar I, [2024-05-08T19:39:31.730487 #3137477] INFO -- : [502/885] 3178862=test_hash_create I, [2024-05-08T19:39:31.746749 #3137477] INFO -- : [503/885] 3178862=test_passing_block I, [2024-05-08T19:39:31.752027 #3137477] INFO -- : [504/885] 3178862=test_thread_fd_close I, [2024-05-08T19:39:31.761713 #3137477] INFO -- : [505/885] 3178862=test_process I, [2024-05-08T19:39:31.786716 #3137477] INFO -- : [506/885] 3178867=test_last_thread I, [2024-05-08T19:39:31.876172 #3137477] INFO -- : [507/885] 3178879=test_pack I, [2024-05-08T19:39:32.086754 #3137477] INFO -- : [508/885] 3178879=test_gem_source_local I, [2024-05-08T19:39:32.100389 #3137477] INFO -- : [509/885] 3178872=test_gem_security_policy I, [2024-05-08T19:39:32.256419 #3137477] INFO -- : [510/885] 3178859=test_gem_ext_rake_builder I, [2024-05-08T19:39:32.269530 #3137477] INFO -- : [511/885] 3178879=test_arity I, [2024-05-08T19:39:32.272535 #3137477] INFO -- : [512/885] 3178869=test_logdevice I, [2024-05-08T19:39:32.276634 #3137477] INFO -- : [513/885] 3178879=test_gem_resolver_lock_specification I, [2024-05-08T19:39:32.326128 #3137477] INFO -- : [514/885] 3178879=test_err_in_callback I, [2024-05-08T19:39:32.339417 #3137477] INFO -- : [515/885] 3178879=test_x509cert I, [2024-05-08T19:39:32.385998 #3137477] INFO -- : [516/885] 3178872=test_gc I, [2024-05-08T19:39:32.613817 #3137477] INFO -- : [517/885] 3178879=test_http I, [2024-05-08T19:39:32.616978 #3137477] INFO -- : [518/885] 3178879=test_shift_jis I, [2024-05-08T19:39:32.622788 #3137477] INFO -- : [519/885] 3178879=test_gem_commands_which_command I, [2024-05-08T19:39:32.657034 #3137477] INFO -- : [520/885] 3178879=test_inadvertent_creation I, [2024-05-08T19:39:32.669773 #3137477] INFO -- : [521/885] 3178857=test_flags I, [2024-05-08T19:39:32.790641 #3137477] INFO -- : [522/885] 3178879=test_enumerator I, [2024-05-08T19:39:32.829601 #3137477] INFO -- : [523/885] 3178871=test_gem_commands_specification_command I, [2024-05-08T19:39:32.841231 #3137477] INFO -- : [524/885] 3178863=test_gem_commands_dependency_command I, [2024-05-08T19:39:32.844276 #3137477] INFO -- : [525/885] 3178867=test_gem_resolver I, [2024-05-08T19:39:32.901422 #3137477] INFO -- : [526/885] 3178859=test_safe_load I, [2024-05-08T19:39:32.923304 #3137477] INFO -- : [527/885] 3178859=test_gem_resolver_composed_set I, [2024-05-08T19:39:32.939448 #3137477] INFO -- : [528/885] 3178859=test_rdoc_markup_attribute_manager I, [2024-05-08T19:39:32.958353 #3137477] INFO -- : [529/885] 3178871=test_name_error I, [2024-05-08T19:39:32.966855 #3137477] INFO -- : [530/885] 3178863=test_rdoc_parser_ruby I, [2024-05-08T19:39:32.972561 #3137477] INFO -- : [531/885] 3178859=test_open-uri I, [2024-05-08T19:39:33.044858 #3137477] INFO -- : [532/885] 3178871=test_httpresponse I, [2024-05-08T19:39:33.079232 #3137477] INFO -- : [533/885] 3178869=test_rdoc_context I, [2024-05-08T19:39:33.101036 #3137477] INFO -- : [534/885] 3178867=test_nil2vtempty I, [2024-05-08T19:39:33.106402 #3137477] INFO -- : [535/885] 3178867=test_stream I, [2024-05-08T19:39:33.109574 #3137477] INFO -- : [536/885] 3178871=test_tcp I, [2024-05-08T19:39:33.111512 #3137477] INFO -- : [537/885] 3178867=test_iso_8859 I, [2024-05-08T19:39:33.130353 #3137477] INFO -- : [538/885] 3178867=test_rdoc_text I, [2024-05-08T19:39:33.157319 #3137477] INFO -- : [539/885] 3178867=test_syntax I, [2024-05-08T19:39:33.198772 #3137477] INFO -- : [540/885] 3178860=test_gem_safe_yaml I, [2024-05-08T19:39:33.205307 #3137477] INFO -- : [541/885] 3178860=test_date_time I, [2024-05-08T19:39:33.219762 #3137477] INFO -- : [542/885] 3178860=test_rdoc_markup_to_joined_paragraph I, [2024-05-08T19:39:33.250261 #3137477] INFO -- : [543/885] 3178871=test_require I, [2024-05-08T19:39:33.252252 #3137477] INFO -- : [544/885] 3178871=test_data I, [2024-05-08T19:39:33.268326 #3137477] INFO -- : [545/885] 3178871=index_write_test I, [2024-05-08T19:39:33.320485 #3137477] INFO -- : [546/885] 3178855=test_date_new I, [2024-05-08T19:39:33.320844 #3137477] INFO -- : [547/885] 3178871=test_files_ext I, [2024-05-08T19:39:33.329954 #3137477] INFO -- : [548/885] 3178855=test_bug-5832 I, [2024-05-08T19:39:33.334101 #3137477] INFO -- : [549/885] 3178855=test_emitter I, [2024-05-08T19:39:33.345235 #3137477] INFO -- : [550/885] 3178860=test_gem_silent_ui I, [2024-05-08T19:39:33.375939 #3137477] INFO -- : [551/885] 3178860=test_gem_doctor I, [2024-05-08T19:39:33.388133 #3137477] INFO -- : [552/885] 3178855=test_kdf I, [2024-05-08T19:39:33.397885 #3137477] INFO -- : [553/885] 3178871=test_kernel I, [2024-05-08T19:39:33.417215 #3137477] INFO -- : [554/885] 3178860=dispatcher_test I, [2024-05-08T19:39:33.434984 #3137477] INFO -- : [555/885] 3178859=test_eval_history I, [2024-05-08T19:39:33.459732 #3137477] INFO -- : [556/885] 3178855=!Nothing_to_test I, [2024-05-08T19:39:33.460831 #3137477] INFO -- : [557/885] 3178855=test_psych I, [2024-05-08T19:39:33.476848 #3137477] INFO -- : [558/885] 3178855=test_enc_raise I, [2024-05-08T19:39:33.477007 #3137477] INFO -- : [559/885] 3178863=test_rdoc_markup_paragraph I, [2024-05-08T19:39:33.480769 #3137477] INFO -- : [560/885] 3178863=test_object_create_start I, [2024-05-08T19:39:33.492102 #3137477] INFO -- : [561/885] 3178855=test_gem_rdoc I, [2024-05-08T19:39:33.492273 #3137477] INFO -- : [562/885] 3178863=test_date I, [2024-05-08T19:39:33.503692 #3137477] INFO -- : [563/885] 3178863=test_gem_ext_cargo_builder_unit I, [2024-05-08T19:39:33.516949 #3137477] INFO -- : [564/885] 3178863=test_at_exit I, [2024-05-08T19:39:33.519280 #3137477] INFO -- : [565/885] 3178860=test_command I, [2024-05-08T19:39:33.535128 #3137477] INFO -- : [566/885] 3178863=test_rdoc_markup_to_tt_only I, [2024-05-08T19:39:33.548318 #3137477] INFO -- : [567/885] 3178859=test_hmac I, [2024-05-08T19:39:33.551163 #3137477] INFO -- : [568/885] 3178859=test_rdoc_tom_doc I, [2024-05-08T19:39:33.562172 #3137477] INFO -- : [569/885] 3178863=test_numeric I, [2024-05-08T19:39:33.573407 #3137477] INFO -- : [570/885] 3178859=test_gem_commands_lock_command I, [2024-05-08T19:39:33.595024 #3137477] INFO -- : [571/885] 3178859=test_assignment I, [2024-05-08T19:39:33.623068 #3137477] INFO -- : [572/885] 3178855=test_ifunless I, [2024-05-08T19:39:33.626788 #3137477] INFO -- : [573/885] 3178855=test_bug-3571 I, [2024-05-08T19:39:33.636914 #3137477] INFO -- : [574/885] 3178863=test_key_actor_vi I, [2024-05-08T19:39:33.644869 #3137477] INFO -- : [575/885] 3178855=test_gem_command I, [2024-05-08T19:39:33.700292 #3137477] INFO -- : [576/885] 3178857=test_gem_spec_fetcher I, [2024-05-08T19:39:33.733331 #3137477] INFO -- : [577/885] 3178863=test_common I, [2024-05-08T19:39:33.743966 #3137477] INFO -- : [578/885] 3178855=test_rdoc_token_stream I, [2024-05-08T19:39:33.753681 #3137477] INFO -- : [579/885] 3178855=test_address_resolve I, [2024-05-08T19:39:33.757946 #3137477] INFO -- : [580/885] 3178869=test_yaml_special_cases I, [2024-05-08T19:39:33.768531 #3137477] INFO -- : [581/885] 3178869=test_optarg I, [2024-05-08T19:39:33.796921 #3137477] INFO -- : [582/885] 3178873=test_gem_source_list I, [2024-05-08T19:39:33.815399 #3137477] INFO -- : [583/885] 3178855=test_config I, [2024-05-08T19:39:33.843632 #3137477] INFO -- : [584/885] 3178857=test_num2int I, [2024-05-08T19:39:33.846507 #3137477] INFO -- : [585/885] 3178855=test_nil I, [2024-05-08T19:39:33.849503 #3137477] INFO -- : [586/885] 3178855=test_rdoc_single_class I, [2024-05-08T19:39:33.851935 #3137477] INFO -- : [587/885] 3178857=test_verbose I, [2024-05-08T19:39:33.854913 #3137477] INFO -- : [588/885] 3178855=test_pp I, [2024-05-08T19:39:33.863188 #3137477] INFO -- : [589/885] 3178873=test_frozen I, [2024-05-08T19:39:33.868184 #3137477] INFO -- : [590/885] 3178873=test_gem_ext_configure_builder I, [2024-05-08T19:39:33.868843 #3137477] INFO -- : [591/885] 3178857=test_macro I, [2024-05-08T19:39:33.873884 #3137477] INFO -- : [592/885] 3178857=test_iter_break I, [2024-05-08T19:39:33.875790 #3137477] INFO -- : [593/885] 3178857=test_exception I, [2024-05-08T19:39:33.883327 #3137477] INFO -- : [594/885] 3178855=test_zsh_completion I, [2024-05-08T19:39:33.885923 #3137477] INFO -- : [595/885] 3178855=test_egrep_cpp I, [2024-05-08T19:39:33.894053 #3137477] INFO -- : [596/885] 3178857=test_zlib I, [2024-05-08T19:39:33.913681 #3137477] INFO -- : [597/885] 3178869=test_cgi_tag_helper I, [2024-05-08T19:39:33.921612 #3137477] INFO -- : [598/885] 3178860=test_optimization I, [2024-05-08T19:39:33.925812 #3137477] INFO -- : [599/885] 3178871=test_date_conv I, [2024-05-08T19:39:33.931563 #3137477] INFO -- : [600/885] 3178869=test_erb_m17n I, [2024-05-08T19:39:33.933764 #3137477] INFO -- : [601/885] 3178863=test_ole_methods I, [2024-05-08T19:39:33.937224 #3137477] INFO -- : [602/885] 3178869=test_string I, [2024-05-08T19:39:33.943334 #3137477] INFO -- : [603/885] 3178863=test_proc I, [2024-05-08T19:39:33.948374 #3137477] INFO -- : [604/885] 3178871=test_gc_compact I, [2024-05-08T19:39:33.990845 #3137477] INFO -- : [605/885] 3178873=test_gem_package_old I, [2024-05-08T19:39:34.028042 #3137477] INFO -- : [606/885] 3178873=test_gem_resolver_index_set I, [2024-05-08T19:39:34.060286 #3137477] INFO -- : [607/885] 3178855=test_gem_validator I, [2024-05-08T19:39:34.068800 #3137477] INFO -- : [608/885] 3178855=test_folderitem2_invokeverb I, [2024-05-08T19:39:34.070508 #3137477] INFO -- : [609/885] 3178873=test_rdoc_markup_parser I, [2024-05-08T19:39:34.080788 #3137477] INFO -- : [610/885] 3178855=test_require_path_check I, [2024-05-08T19:39:34.132567 #3137477] INFO -- : [611/885] 3178855=test_files_test_2 I, [2024-05-08T19:39:34.141395 #3137477] INFO -- : [612/885] 3178873=test_fnmatch I, [2024-05-08T19:39:34.193648 #3137477] INFO -- : [613/885] 3178873=test_pattern_matching I, [2024-05-08T19:39:34.269367 #3137477] INFO -- : [614/885] 3178873=test_rdoc_stats I, [2024-05-08T19:39:34.309856 #3137477] INFO -- : [615/885] 3178873=test_string I, [2024-05-08T19:39:34.358450 #3137477] INFO -- : [616/885] 3178873=test_rdoc_store I, [2024-05-08T19:39:34.414086 #3137477] INFO -- : [617/885] 3178858=test_x509attr I, [2024-05-08T19:39:34.464364 #3137477] INFO -- : [618/885] 3178858=test_raise I, [2024-05-08T19:39:34.468150 #3137477] INFO -- : [619/885] 3178858=test_depth_first I, [2024-05-08T19:39:34.484522 #3137477] INFO -- : [620/885] 3178858=test_gem_request_set_lockfile_parser I, [2024-05-08T19:39:34.496719 #3137477] INFO -- : [621/885] 3178861=test_custom_command I, [2024-05-08T19:39:34.560411 #3137477] INFO -- : [622/885] 3178868=json_addition_test I, [2024-05-08T19:39:34.571762 #3137477] INFO -- : [623/885] 3178868=test_qsort I, [2024-05-08T19:39:34.575032 #3137477] INFO -- : [624/885] 3178868=test_rdoc_parser I, [2024-05-08T19:39:34.597955 #3137477] INFO -- : [625/885] 3178858=test_gem_dependency_resolution_error I, [2024-05-08T19:39:34.603762 #3137477] INFO -- : [626/885] 3178858=test_mul I, [2024-05-08T19:39:34.604698 #3137477] INFO -- : [627/885] 3178861=test_null I, [2024-05-08T19:39:34.613001 #3137477] INFO -- : [628/885] 3178861=test_win32ole_type I, [2024-05-08T19:39:34.614750 #3137477] INFO -- : [629/885] 3178868=test_default_gems I, [2024-05-08T19:39:34.616538 #3137477] INFO -- : [630/885] 3178861=test_rdoc_markup_to_rdoc I, [2024-05-08T19:39:34.628005 #3137477] INFO -- : [631/885] 3178858=test_rdoc_rd_inline_parser I, [2024-05-08T19:39:34.647398 #3137477] INFO -- : [632/885] 3178858=test_rdoc_markup_attributes I, [2024-05-08T19:39:34.679023 #3137477] INFO -- : [633/885] 3178858=test_date_parse I, [2024-05-08T19:39:34.679096 #3137477] INFO -- : [634/885] 3178868=test_pipe I, [2024-05-08T19:39:34.691918 #3137477] INFO -- : [635/885] 3178861=test_thread I, [2024-05-08T19:39:34.695525 #3137477] INFO -- : [636/885] 3178861=test_trick I, [2024-05-08T19:39:34.792379 #3137477] INFO -- : [637/885] 3178858=test_pkey_ec I, [2024-05-08T19:39:34.819599 #3137477] INFO -- : [638/885] 3178863=test_key_name_check I, [2024-05-08T19:39:34.826576 #3137477] INFO -- : [639/885] 3178863=test_backtrace I, [2024-05-08T19:39:34.833630 #3137477] INFO -- : [640/885] 3178863=test_defined I, [2024-05-08T19:39:34.854271 #3137477] INFO -- : [641/885] 3178868=test_io_buffer I, [2024-05-08T19:39:34.876016 #3137477] INFO -- : [642/885] 3178864=test_rdoc_i18n_text I, [2024-05-08T19:39:34.880995 #3137477] INFO -- : [643/885] 3178858=test_time I, [2024-05-08T19:39:34.884187 #3137477] INFO -- : [644/885] 3178864=test_windows_1251 I, [2024-05-08T19:39:34.893352 #3137477] INFO -- : [645/885] 3178864=test_rdoc_rdoc I, [2024-05-08T19:39:34.920013 #3137477] INFO -- : [646/885] 3178863=test_gem_uninstaller I, [2024-05-08T19:39:34.949418 #3137477] INFO -- : [647/885] 3178868=test_gb18030 I, [2024-05-08T19:39:34.952874 #3137477] INFO -- : [648/885] 3178868=test_buffering I, [2024-05-08T19:39:34.965329 #3137477] INFO -- : [649/885] 3178868=test_svcb_https I, [2024-05-08T19:39:34.989809 #3137477] INFO -- : [650/885] 3178868=test_pkcs12 I, [2024-05-08T19:39:34.994521 #3137477] INFO -- : [651/885] 3178864=test_system I, [2024-05-08T19:39:35.006851 #3137477] INFO -- : [652/885] 3178873=test_bigzero I, [2024-05-08T19:39:35.011372 #3137477] INFO -- : [653/885] 3178873=test_pkey_dh I, [2024-05-08T19:39:35.013965 #3137477] INFO -- : [654/885] 3178858=test_iseq_load I, [2024-05-08T19:39:35.188418 #3137477] INFO -- : [655/885] 3178873=test_gem_util I, [2024-05-08T19:39:35.238995 #3137477] INFO -- : [656/885] 3178859=test_gem_package_tar_header I, [2024-05-08T19:39:35.296837 #3137477] INFO -- : [657/885] 3178859=test_ripper I, [2024-05-08T19:39:35.418045 #3137477] INFO -- : [658/885] 3178873=test_gem_config_file I, [2024-05-08T19:39:35.597164 #3137477] INFO -- : [659/885] 3178873=test_gem_resolver_activation_request I, [2024-05-08T19:39:35.639055 #3137477] INFO -- : [660/885] 3178873=test_protocol I, [2024-05-08T19:39:35.640127 #3137477] INFO -- : [661/885] 3178868=test_getopts I, [2024-05-08T19:39:35.663574 #3137477] INFO -- : [662/885] 3178868=test_yjit_exit_locations I, [2024-05-08T19:39:35.664085 #3137477] INFO -- : [663/885] 3178868=test_etc I, [2024-05-08T19:39:35.666179 #3137477] INFO -- : [664/885] 3178859=test_yaml_tree I, [2024-05-08T19:39:35.709475 #3137477] INFO -- : [665/885] 3178859=test_gc I, [2024-05-08T19:39:35.709751 #3137477] INFO -- : [666/885] 3178859=test_math I, [2024-05-08T19:39:35.730455 #3137477] INFO -- : [667/885] 3178859=test_gem_commands_fetch_command I, [2024-05-08T19:39:35.753046 #3137477] INFO -- : [668/885] 3178868=test_libs I, [2024-05-08T19:39:35.763575 #3137477] INFO -- : [669/885] 3178868=test_config I, [2024-05-08T19:39:35.810220 #3137477] INFO -- : [670/885] 3178868=test_sleep I, [2024-05-08T19:39:35.857007 #3137477] INFO -- : [671/885] 3178859=test_autoload I, [2024-05-08T19:39:35.865667 #3137477] INFO -- : [672/885] 3178858=test_utf16 I, [2024-05-08T19:39:35.872544 #3137477] INFO -- : [673/885] 3178858=test_unicode_escape I, [2024-05-08T19:39:35.896340 #3137477] INFO -- : [674/885] 3178863=test_io I, [2024-05-08T19:39:35.981771 #3137477] INFO -- : [675/885] 3178873=test_face I, [2024-05-08T19:39:35.997394 #3137477] INFO -- : [676/885] 3178858=test_case I, [2024-05-08T19:39:36.008249 #3137477] INFO -- : [677/885] 3178873=test_sizeof I, [2024-05-08T19:39:36.012343 #3137477] INFO -- : [678/885] 3178864=test_rendering I, [2024-05-08T19:39:36.034172 #3137477] INFO -- : [679/885] 3178858=test_io_buffer I, [2024-05-08T19:39:36.145953 #3137477] INFO -- : [680/885] 3178864=test_pack I, [2024-05-08T19:39:36.159800 #3137477] INFO -- : [681/885] 3178858=test_backtrace I, [2024-05-08T19:39:36.161618 #3137477] INFO -- : [682/885] 3178864=ruby_parser_test I, [2024-05-08T19:39:36.164448 #3137477] INFO -- : [683/885] 3178864=test_rdoc_task I, [2024-05-08T19:39:36.171692 #3137477] INFO -- : [684/885] 3178864=test_gem_resolver_conflict I, [2024-05-08T19:39:36.178033 #3137477] INFO -- : [685/885] 3178864=test_rdoc_markup_indented_paragraph I, [2024-05-08T19:39:36.184522 #3137477] INFO -- : [686/885] 3178864=locals_test I, [2024-05-08T19:39:36.458730 #3137477] INFO -- : [687/885] 3178864=test_rdoc_require I, [2024-05-08T19:39:36.461363 #3137477] INFO -- : [688/885] 3178864=test_clone I, [2024-05-08T19:39:36.559426 #3137477] INFO -- : [689/885] 3178871=test_gem_commands_install_command I, [2024-05-08T19:39:36.636869 #3137477] INFO -- : [690/885] 3178864=test_readpartial I, [2024-05-08T19:39:36.678083 #3137477] INFO -- : [691/885] 3178857=test_fstring I, [2024-05-08T19:39:36.815330 #3137477] INFO -- : [692/885] 3178857=test_array I, [2024-05-08T19:39:36.821538 #3137477] INFO -- : [693/885] 3178857=test_optparse I, [2024-05-08T19:39:36.896281 #3137477] INFO -- : [694/885] 3178857=test_rdoc_markup_raw I, [2024-05-08T19:39:36.906162 #3137477] INFO -- : [695/885] 3178857=test_webauthn_poller I, [2024-05-08T19:39:37.043538 #3137477] INFO -- : [696/885] 3178864=test_rat I, [2024-05-08T19:39:37.051699 #3137477] INFO -- : [697/885] 3178864=test_typeddata I, [2024-05-08T19:39:37.068422 #3137477] INFO -- : [698/885] 3178857=encoding_test I, [2024-05-08T19:39:37.131872 #3137477] INFO -- : [699/885] 3178857=test_gem_resolver_best_set I, [2024-05-08T19:39:37.183484 #3137477] INFO -- : [700/885] 3178857=test_rdoc_markup_to_html_crossref I, [2024-05-08T19:39:37.312160 #3137477] INFO -- : [701/885] 3178864=test_files_sample I, [2024-05-08T19:39:37.423091 #3137477] INFO -- : [702/885] 3178857=test_stringscanner I, [2024-05-08T19:39:37.435507 #3137477] INFO -- : [703/885] 3178858=parser_test I, [2024-05-08T19:39:37.440136 #3137477] INFO -- : [704/885] 3178858=test_convertible I, [2024-05-08T19:39:37.467705 #3137477] INFO -- : [705/885] 3178857=test_yield I, [2024-05-08T19:39:37.607125 #3137477] INFO -- : [706/885] 3178855=test_rdoc_alias I, [2024-05-08T19:39:37.636010 #3137477] INFO -- : [707/885] 3178855=test_undef I, [2024-05-08T19:39:37.652460 #3137477] INFO -- : [708/885] 3178856=test_line_editor I, [2024-05-08T19:39:37.657217 #3137477] INFO -- : [709/885] 3178855=test_objspace I, [2024-05-08T19:39:37.660401 #3137477] INFO -- : [710/885] 3178861=ripper_test I, [2024-05-08T19:39:37.687595 #3137477] INFO -- : [711/885] 3178864=test_gem_security_trust_dir I, [2024-05-08T19:39:37.719188 #3137477] INFO -- : [712/885] 3178856=test_sprintf I, [2024-05-08T19:39:37.720132 #3137477] INFO -- : [713/885] 3178864=test_gem_requirement I, [2024-05-08T19:39:37.756830 #3137477] INFO -- : [714/885] 3178871=comments_test I, [2024-05-08T19:39:37.761726 #3137477] INFO -- : [715/885] 3178871=test_string_memory I, [2024-05-08T19:39:37.847596 #3137477] INFO -- : [716/885] 3178864=test_set I, [2024-05-08T19:39:37.848817 #3137477] INFO -- : [717/885] 3178871=test_show_source I, [2024-05-08T19:39:37.867855 #3137477] INFO -- : [718/885] 3178868=test_have_library I, [2024-05-08T19:39:37.870696 #3137477] INFO -- : [719/885] 3178864=test_remote_fetch_error I, [2024-05-08T19:39:37.886883 #3137477] INFO -- : [720/885] 3178864=test_gem_commands_stale_command I, [2024-05-08T19:39:37.897237 #3137477] INFO -- : [721/885] 3178864=test_lock_native_thread I, [2024-05-08T19:39:37.906844 #3137477] INFO -- : [722/885] 3178856=test_c_struct_entry I, [2024-05-08T19:39:37.969056 #3137477] INFO -- : [723/885] 3178871=test_external_new I, [2024-05-08T19:39:37.974488 #3137477] INFO -- : [724/885] 3178871=test_alias_and_anchor I, [2024-05-08T19:39:37.979424 #3137477] INFO -- : [725/885] 3178871=test_postponed_job I, [2024-05-08T19:39:38.057840 #3137477] INFO -- : [726/885] 3178856=test_hash I, [2024-05-08T19:39:38.069241 #3137477] INFO -- : [727/885] 3178856=test_tree_builder I, [2024-05-08T19:39:38.073650 #3137477] INFO -- : [728/885] 3178856=test_gem_resolver_dependency_request I, [2024-05-08T19:39:38.176696 #3137477] INFO -- : [729/885] 3178864=test_win32ole_typelib I, [2024-05-08T19:39:38.180592 #3137477] INFO -- : [730/885] 3178864=test_protect I, [2024-05-08T19:39:38.185424 #3137477] INFO -- : [731/885] 3178864=test_raise_exception I, [2024-05-08T19:39:38.202271 #3137477] INFO -- : [732/885] 3178865=test_gem_request_set_lockfile I, [2024-05-08T19:39:38.229483 #3137477] INFO -- : [733/885] 3178856=test_yjit I, [2024-05-08T19:39:38.240763 #3137477] INFO -- : [734/885] 3178856=test_weakmap I, [2024-05-08T19:39:38.335586 #3137477] INFO -- : [735/885] 3178871=test_workspace I, [2024-05-08T19:39:38.348235 #3137477] INFO -- : [736/885] 3178861=test_m17n I, [2024-05-08T19:39:38.456394 #3137477] INFO -- : [737/885] 3178871=test_gem_commands_environment_command I, [2024-05-08T19:39:38.471030 #3137477] INFO -- : [738/885] 3178861=test_ws I, [2024-05-08T19:39:38.502626 #3137477] INFO -- : [739/885] 3178861=test_argf I, [2024-05-08T19:39:38.514317 #3137477] INFO -- : [740/885] 3178871=test_ns_spki I, [2024-05-08T19:39:38.541944 #3137477] INFO -- : [741/885] 3178871=test_framework I, [2024-05-08T19:39:38.562504 #3137477] INFO -- : [742/885] 3178871=test_kill_ring I, [2024-05-08T19:39:38.568478 #3137477] INFO -- : [743/885] 3178871=test_summary I, [2024-05-08T19:39:38.653387 #3137477] INFO -- : [744/885] 3178865=test_console_attr I, [2024-05-08T19:39:38.657025 #3137477] INFO -- : [745/885] 3178865=test_type_completor I, [2024-05-08T19:39:38.660131 #3137477] INFO -- : [746/885] 3178865=test_kwargs I, [2024-05-08T19:39:38.674770 #3137477] INFO -- : [747/885] 3178865=warnings_test I, [2024-05-08T19:39:38.685095 #3137477] INFO -- : [748/885] 3178865=test_gem_commands_exec_command I, [2024-05-08T19:39:38.701762 #3137477] INFO -- : [749/885] 3178871=test_io_wait I, [2024-05-08T19:39:38.867529 #3137477] INFO -- : [750/885] 3178864=test_date_attr I, [2024-05-08T19:39:38.876388 #3137477] INFO -- : [751/885] 3178864=test_ellipsize I, [2024-05-08T19:39:38.886924 #3137477] INFO -- : [752/885] 3178864=test_io I, [2024-05-08T19:39:39.013390 #3137477] INFO -- : [753/885] 3178868=test_ubf_async_safe I, [2024-05-08T19:39:39.020501 #3137477] INFO -- : [754/885] 3178868=test_hash I, [2024-05-08T19:39:39.039422 #3137477] INFO -- : [755/885] 3178871=test_win32ole_type_event I, [2024-05-08T19:39:39.051004 #3137477] INFO -- : [756/885] 3178871=test_emoji I, [2024-05-08T19:39:39.098740 #3137477] INFO -- : [757/885] 3178871=test_sorted_set I, [2024-05-08T19:39:39.197391 #3137477] INFO -- : [758/885] 3178864=test_win32ole_record I, [2024-05-08T19:39:39.208611 #3137477] INFO -- : [759/885] 3178864=test_gem_unsatisfiable_dependency_error I, [2024-05-08T19:39:39.237073 #3137477] INFO -- : [760/885] 3178864=test_foreach I, [2024-05-08T19:39:39.245772 #3137477] INFO -- : [761/885] 3178864=test_gem_source_specific_file I, [2024-05-08T19:39:39.311418 #3137477] INFO -- : [762/885] 3178871=test_condition I, [2024-05-08T19:39:39.320426 #3137477] INFO -- : [763/885] 3178871=test_gem_commands_uninstall_command I, [2024-05-08T19:39:39.320788 #3137477] INFO -- : [764/885] 3178873=test_cp949 I, [2024-05-08T19:39:39.328739 #3137477] INFO -- : [765/885] 3178873=test_rdoc_rubygems_hook I, [2024-05-08T19:39:39.345223 #3137477] INFO -- : [766/885] 3178864=test_method I, [2024-05-08T19:39:39.439844 #3137477] INFO -- : [767/885] 3178873=test_gem_commands_query_command I, [2024-05-08T19:39:39.868827 #3137477] INFO -- : [768/885] 3178872=test_array_create I, [2024-05-08T19:39:39.873229 #3137477] INFO -- : [769/885] 3178872=test_pack I, [2024-05-08T19:39:39.956896 #3137477] INFO -- : [770/885] 3178873=test_gem_impossible_dependencies_error I, [2024-05-08T19:39:39.970743 #3137477] INFO -- : [771/885] 3178873=test_to_ruby I, [2024-05-08T19:39:39.988757 #3137477] INFO -- : [772/885] 3178873=test_pattern_key_name_check I, [2024-05-08T19:39:39.992343 #3137477] INFO -- : [773/885] 3178873=test_ftp I, [2024-05-08T19:39:39.994310 #3137477] INFO -- : [774/885] 3178857=test_rdoc_context_section I, [2024-05-08T19:39:39.998410 #3137477] INFO -- : [775/885] 3178873=test_euc_kr I, [2024-05-08T19:39:40.003420 #3137477] INFO -- : [776/885] 3178857=test_gem_installer I, [2024-05-08T19:39:40.007307 #3137477] INFO -- : [777/885] 3178873=test_yamlstore I, [2024-05-08T19:39:40.013414 #3137477] INFO -- : [778/885] 3178873=test_rdoc_parser_rd I, [2024-05-08T19:39:40.052960 #3137477] INFO -- : [779/885] 3178873=test_date_strftime I, [2024-05-08T19:39:40.057627 #3137477] INFO -- : [780/885] 3178865=test_irb I, [2024-05-08T19:39:40.080767 #3137477] INFO -- : [781/885] 3178871=test_random I, [2024-05-08T19:39:40.083383 #3137477] INFO -- : [782/885] 3178872=test_asn1 I, [2024-05-08T19:39:40.096112 #3137477] INFO -- : [783/885] 3178871=test_const I, [2024-05-08T19:39:40.101261 #3137477] INFO -- : [784/885] 3178871=test_rdoc_normal_class I, [2024-05-08T19:39:40.147042 #3137477] INFO -- : [785/885] 3178872=test_class I, [2024-05-08T19:39:40.163932 #3137477] INFO -- : [786/885] 3178871=test_load I, [2024-05-08T19:39:40.171632 #3137477] INFO -- : [787/885] 3178871=json_string_matching_test I, [2024-05-08T19:39:40.183322 #3137477] INFO -- : [788/885] 3178871=test_noarg I, [2024-05-08T19:39:40.407006 #3137477] INFO -- : [789/885] 3178865=parse_comments_test I, [2024-05-08T19:39:40.411100 #3137477] INFO -- : [790/885] 3178865=test_tempfile I, [2024-05-08T19:39:40.423116 #3137477] INFO -- : [791/885] 3178871=test_queue I, [2024-05-08T19:39:40.434755 #3137477] INFO -- : [792/885] 3178871=test_function I, [2024-05-08T19:39:40.439677 #3137477] INFO -- : [793/885] 3178873=test_gem_resolver_index_specification I, [2024-05-08T19:39:40.494133 #3137477] INFO -- : [794/885] 3178873=test_internal_ivar I, [2024-05-08T19:39:40.512812 #3137477] INFO -- : [795/885] 3178873=test_gem_commands_help_command I, [2024-05-08T19:39:40.582628 #3137477] INFO -- : [796/885] 3178873=test_rdoc_markup I, [2024-05-08T19:39:40.589527 #3137477] INFO -- : [797/885] 3178873=test_tracepoint I, [2024-05-08T19:39:40.654395 #3137477] INFO -- : [798/885] 3178865=test_prettyprint I, [2024-05-08T19:39:40.663361 #3137477] INFO -- : [799/885] 3178871=test_basicsocket I, [2024-05-08T19:39:40.672988 #3137477] INFO -- : [800/885] 3178871=test_utf32 I, [2024-05-08T19:39:40.682995 #3137477] INFO -- : [801/885] 3178871=test_duplicate I, [2024-05-08T19:39:40.689150 #3137477] INFO -- : [802/885] 3178871=test_too_many_dummy_encodings I, [2024-05-08T19:39:40.719201 #3137477] INFO -- : [803/885] 3178865=test_reqarg I, [2024-05-08T19:39:40.758187 #3137477] INFO -- : [804/885] 3178871=test_rdoc_include I, [2024-05-08T19:39:40.778396 #3137477] INFO -- : [805/885] 3178871=test_stack I, [2024-05-08T19:39:40.834436 #3137477] INFO -- : [806/885] 3178873=test_gem_commands_list_command I, [2024-05-08T19:39:40.853025 #3137477] INFO -- : [807/885] 3178873=test_gem_commands_signin_command I, [2024-05-08T19:39:40.948402 #3137477] INFO -- : [808/885] 3178873=test_resource I, [2024-05-08T19:39:40.976804 #3137477] INFO -- : [809/885] 3178873=test_emitter I, [2024-05-08T19:39:40.985116 #3137477] INFO -- : [810/885] 3178873=test_ldap I, [2024-05-08T19:39:41.002200 #3137477] INFO -- : [811/885] 3178873=test_string_processing I, [2024-05-08T19:39:41.006418 #3137477] INFO -- : [812/885] 3178873=test_fileutils I, [2024-05-08T19:39:41.192058 #3137477] INFO -- : [813/885] 3178856=test_rdoc_options I, [2024-05-08T19:39:41.193343 #3137477] INFO -- : [814/885] 3178865=test_cesu8 I, [2024-05-08T19:39:41.200195 #3137477] INFO -- : [815/885] 3178865=test_econv I, [2024-05-08T19:39:41.442982 #3137477] INFO -- : [816/885] 3178873=test_gem_version I, [2024-05-08T19:39:41.494204 #3137477] INFO -- : [817/885] 3178856=test_gem_dependency I, [2024-05-08T19:39:41.602724 #3137477] INFO -- : [818/885] 3178873=test_gem_resolver_specification I, [2024-05-08T19:39:41.617190 #3137477] INFO -- : [819/885] 3178856=test_path_to_class I, [2024-05-08T19:39:41.621301 #3137477] INFO -- : [820/885] 3178856=test_rdoc_markup_verbatim I, [2024-05-08T19:39:41.623714 #3137477] INFO -- : [821/885] 3178873=test_inlinecache I, [2024-05-08T19:39:41.627314 #3137477] INFO -- : [822/885] 3178879=test_gem_commands_search_command I, [2024-05-08T19:39:41.627381 #3137477] INFO -- : [823/885] 3178856=test_complex I, [2024-05-08T19:39:41.632853 #3137477] INFO -- : [824/885] 3178879=test_gem_ext_ext_conf_builder I, [2024-05-08T19:39:41.680826 #3137477] INFO -- : [825/885] 3178873=test_gem_stub_specification I, [2024-05-08T19:39:41.684463 #3137477] INFO -- : [826/885] 3178867=test_method_cache I, [2024-05-08T19:39:41.686030 #3137477] INFO -- : [827/885] 3178867=test_frozen_error I, [2024-05-08T19:39:41.691689 #3137477] INFO -- : [828/885] 3178867=test_gem_resolver_installed_specification I, [2024-05-08T19:39:41.712025 #3137477] INFO -- : [829/885] 3178867=test_scanner_events I, [2024-05-08T19:39:41.787258 #3137477] INFO -- : [830/885] 3178856=test_gem_remote_fetcher I, [2024-05-08T19:39:41.809152 #3137477] INFO -- : [831/885] 3178867=test_mdns I, [2024-05-08T19:39:41.819416 #3137477] INFO -- : [832/885] 3178867=test_parse I, [2024-05-08T19:39:41.835020 #3137477] INFO -- : [833/885] 3178873=test_handle I, [2024-05-08T19:39:41.835266 #3137477] INFO -- : [834/885] 3178860=test_wait I, [2024-05-08T19:39:41.932466 #3137477] INFO -- : [835/885] 3178860=test_yaml I, [2024-05-08T19:39:42.071285 #3137477] INFO -- : [836/885] 3178860=test_forwardable I, [2024-05-08T19:39:42.102562 #3137477] INFO -- : [837/885] 3178871=test_big2str I, [2024-05-08T19:39:42.106194 #3137477] INFO -- : [838/885] 3178860=test_gem_commands_sources_command I, [2024-05-08T19:39:42.111137 #3137477] INFO -- : [839/885] 3178871=test_ansi_without_terminfo I, [2024-05-08T19:39:42.119857 #3137477] INFO -- : [840/885] 3178871=test_bmethod I, [2024-05-08T19:39:42.132780 #3137477] INFO -- : [841/885] 3178871=test_ractor I, [2024-05-08T19:39:42.148181 #3137477] INFO -- : [842/885] 3178871=test_euc_tw I, [2024-05-08T19:39:42.154284 #3137477] INFO -- : [843/885] 3178871=test_rdoc_markup_formatter I, [2024-05-08T19:39:42.161988 #3137477] INFO -- : [844/885] 3178871=test_nowrite I, [2024-05-08T19:39:42.177612 #3137477] INFO -- : [845/885] 3178871=test_thread_queue I, [2024-05-08T19:39:42.276351 #3137477] INFO -- : [846/885] 3178860=test_rdoc_parser_c I, [2024-05-08T19:39:42.280449 #3137477] INFO -- : [847/885] 3178865=test_comparable I, [2024-05-08T19:39:42.290172 #3137477] INFO -- : [848/885] 3178865=json_fixtures_test I, [2024-05-08T19:39:42.295046 #3137477] INFO -- : [849/885] 3178865=test_shapes I, [2024-05-08T19:39:42.301101 #3137477] INFO -- : [850/885] 3178865=test_io_timeout I, [2024-05-08T19:39:42.303484 #3137477] INFO -- : [851/885] 3178865=test_profile_frames I, [2024-05-08T19:39:42.462801 #3137477] INFO -- : [852/885] 3178873=test_cstr I, [2024-05-08T19:39:42.500172 #3137477] INFO -- : [853/885] 3178865=test_pstore I, [2024-05-08T19:39:42.557378 #3137477] INFO -- : [854/885] 3178865=test_enc_str_buf_cat I, [2024-05-08T19:39:42.559720 #3137477] INFO -- : [855/885] 3178867=test_gbk I, [2024-05-08T19:39:42.561052 #3137477] INFO -- : [856/885] 3178865=test_class2name I, [2024-05-08T19:39:42.570488 #3137477] INFO -- : [857/885] 3178865=test_cgi_util I, [2024-05-08T19:39:42.580370 #3137477] INFO -- : [858/885] 3178867=test_require I, [2024-05-08T19:39:42.599559 #3137477] INFO -- : [859/885] 3178860=test_gem_ext_cmake_builder I, [2024-05-08T19:39:42.623537 #3137477] INFO -- : [860/885] 3178860=test_gem_commands_contents_command I, [2024-05-08T19:39:42.627164 #3137477] INFO -- : [861/885] 3178858=test_digest I, [2024-05-08T19:39:42.744195 #3137477] INFO -- : [862/885] 3178860=test_marshalable I, [2024-05-08T19:39:42.751613 #3137477] INFO -- : [863/885] 3178860=test_find I, [2024-05-08T19:39:42.768180 #3137477] INFO -- : [864/885] 3178860=test_ractor I, [2024-05-08T19:39:42.845200 #3137477] INFO -- : [865/885] 3178865=test_wss I, [2024-05-08T19:39:42.868010 #3137477] INFO -- : [866/885] 3178865=test_fiddle I, [2024-05-08T19:39:42.903787 #3137477] INFO -- : [867/885] 3178860=test_file I, [2024-05-08T19:39:42.928744 #3137477] INFO -- : [868/885] 3178860=test_gem_available_set I, [2024-05-08T19:39:42.976792 #3137477] INFO -- : [869/885] 3178865=test_rdoc_markdown I, [2024-05-08T19:39:42.982850 #3137477] INFO -- : [870/885] 3178879=test_modify_expand I, [2024-05-08T19:39:42.994857 #3137477] INFO -- : [871/885] 3178879=test_rdoc_any_method I, [2024-05-08T19:39:43.042102 #3137477] INFO -- : [872/885] 3178860=test_complexrational I, [2024-05-08T19:39:43.049902 #3137477] INFO -- : [873/885] 3178860=test_init I, [2024-05-08T19:39:43.126268 #3137477] INFO -- : [874/885] 3178859=test_pathname I, [2024-05-08T19:39:43.202139 #3137477] INFO -- : [875/885] 3178861=test_rdoc_encoding I, [2024-05-08T19:39:43.296412 #3137477] INFO -- : [876/885] 3178865=test_coverage I, [2024-05-08T19:39:43.313116 #3137477] INFO -- : [877/885] 3178861=test_gem_package_tar_reader I, [2024-05-08T19:39:43.374661 #3137477] INFO -- : [878/885] 3178861=regexp_test I, [2024-05-08T19:39:43.388542 #3137477] INFO -- : [879/885] 3178861=test_gem_commands_owner_command I, [2024-05-08T19:39:43.476927 #3137477] INFO -- : [880/885] 3178859=test_gem_source_vendor I, [2024-05-08T19:39:43.489162 #3137477] INFO -- : [881/885] 3178859=test_recorder I, [2024-05-08T19:39:43.491082 #3137477] INFO -- : [882/885] 3178859=test_formatter I, [2024-05-08T19:39:43.502257 #3137477] INFO -- : [883/885] 3178859=test_bash_completion I, [2024-05-08T19:39:43.510097 #3137477] INFO -- : [884/885] 3178859=test_rdoc_constant I, [2024-05-08T19:39:43.513039 #3137477] INFO -- : [885/885] 3178860=test_deprecate I, [2024-05-08T19:39:55.885618 #3137477] INFO -- : Finished tests in 34.817484s, 757.9812 tests/s, 268696.6097 assertions/s. E, [2024-05-08T19:39:55.885885 #3137477] ERROR -- : Children under /tmp/rubytest.g7h9zp: E, [2024-05-08T19:39:55.885925 #3137477] ERROR -- : * drwx------ 4 80 2024-05-08 19:39:22 +0000 gem_rebuild20240508-3178871-1rdoa6/ E, [2024-05-08T19:39:55.885939 #3137477] ERROR -- : * drwxrwxr-x 2 60 2024-05-08 19:39:22 +0000 new/ E, [2024-05-08T19:39:55.885951 #3137477] ERROR -- : * -rw-rw-r-- 1 4096 2024-05-08 19:39:22 +0000 rebuild_test_gem-1.0.0.gem E, [2024-05-08T19:39:55.885962 #3137477] ERROR -- : * drwxrwxr-x 2 60 2024-05-08 19:39:22 +0000 old/ E, [2024-05-08T19:39:55.885972 #3137477] ERROR -- : * -rw-rw-r-- 1 4096 2024-05-08 19:39:22 +0000 rebuild_test_gem-1.0.0.gem I, [2024-05-08T19:39:55.887190 #3137477] INFO -- : 26391 tests, 9355340 assertions, 0 failures, 0 errors, 304 skips I, [2024-05-08T19:39:55.887221 #3137477] INFO -- : I, [2024-05-08T19:39:55.887229 #3137477] INFO -- : ruby -v: ruby 3.4.0dev (2024-05-08T18:56:14Z master 442e398e62) [x86_64-linux] I, [2024-05-08T19:39:55.889420 #3137477] INFO -- : $$$[end] "make yes-test-all TESTOPTS='--stderr-on-failure' TESTS='-j20'" exit with 0. I, [2024-05-08T19:39:55.889604 #3137477] INFO -- : $$$[beg] make yes-test-rubyspec MSPECOPT='--error-output stderr --debug -j' TESTS='-j20' I, [2024-05-08T19:39:55.975704 #3137477] INFO -- : BASERUBY = /usr/bin/ruby --disable=gems I, [2024-05-08T19:39:55.975739 #3137477] INFO -- : CC = gcc I, [2024-05-08T19:39:55.975746 #3137477] INFO -- : LD = ld I, [2024-05-08T19:39:55.975750 #3137477] INFO -- : LDSHARED = gcc -shared I, [2024-05-08T19:39:55.975755 #3137477] INFO -- : CFLAGS = -O3 -fno-fast-math -ggdb3 -Wall -Wextra -Wdeprecated-declarations -Wdiv-by-zero -Wduplicated-cond -Wimplicit-function-declaration -Wimplicit-int -Wpointer-arith -Wwrite-strings -Wold-style-definition -Wimplicit-fallthrough=0 -Wmissing-noreturn -Wno-cast-function-type -Wno-constant-logical-operand -Wno-long-long -Wno-missing-field-initializers -Wno-overlength-strings -Wno-packed-bitfield-compat -Wno-parentheses-equality -Wno-self-assign -Wno-tautological-compare -Wno-unused-parameter -Wno-unused-value -Wsuggest-attribute=format -Wsuggest-attribute=noreturn -Wunused-variable -Wmisleading-indentation -Wundef -fPIC I, [2024-05-08T19:39:55.975769 #3137477] INFO -- : XCFLAGS = -U_FORTIFY_SOURCE -D_FORTIFY_SOURCE=2 -fstack-protector-strong -fno-strict-overflow -fvisibility=hidden -fexcess-precision=standard -DRUBY_EXPORT -I. -I.ext/include/x86_64-linux -I/tmp/ruby/src/trunk/include -I/tmp/ruby/src/trunk -I/tmp/ruby/src/trunk/prism -I/tmp/ruby/src/trunk/enc/unicode/15.0.0 I, [2024-05-08T19:39:55.975773 #3137477] INFO -- : CPPFLAGS = I, [2024-05-08T19:39:55.975777 #3137477] INFO -- : DLDFLAGS = -Wl,--compress-debug-sections=zlib -Wl,-soname,libruby.so.3.4 -fstack-protector-strong I, [2024-05-08T19:39:55.975781 #3137477] INFO -- : SOLIBS = -lz -lrt -lrt -lgmp -ldl -lcrypt -lm -lpthread I, [2024-05-08T19:39:55.975785 #3137477] INFO -- : LANG = en_US.UTF-8 I, [2024-05-08T19:39:55.975788 #3137477] INFO -- : LC_ALL = I, [2024-05-08T19:39:55.975792 #3137477] INFO -- : LC_CTYPE = I, [2024-05-08T19:39:55.975796 #3137477] INFO -- : MFLAGS = I, [2024-05-08T19:39:55.975800 #3137477] INFO -- : RUSTC = no I, [2024-05-08T19:39:55.975804 #3137477] INFO -- : YJIT_RUSTC_ARGS = --crate-name=yjit --crate-type=staticlib --edition=2021 -g -C lto=thin -C opt-level=3 -C overflow-checks=on '--out-dir=/tmp/ruby/build/trunk/yjit/target/release/' /tmp/ruby/src/trunk/yjit/src/lib.rs I, [2024-05-08T19:39:55.976264 #3137477] INFO -- : gcc (Ubuntu 11.4.0-1ubuntu1~22.04) 11.4.0 I, [2024-05-08T19:39:55.976286 #3137477] INFO -- : Copyright (C) 2021 Free Software Foundation, Inc. I, [2024-05-08T19:39:55.976292 #3137477] INFO -- : This is free software; see the source for copying conditions. There is NO I, [2024-05-08T19:39:55.976297 #3137477] INFO -- : warranty; not even for MERCHANTABILITY or FITNESS FOR A PARTICULAR PURPOSE. I, [2024-05-08T19:39:55.976301 #3137477] INFO -- : I, [2024-05-08T19:39:55.978030 #3137477] INFO -- : generating enc.mk I, [2024-05-08T19:39:56.098162 #3137477] INFO -- : making enc I, [2024-05-08T19:39:56.115331 #3137477] INFO -- : make[1]: Entering directory '/tmp/ruby/build/trunk' I, [2024-05-08T19:39:56.115352 #3137477] INFO -- : make[1]: Nothing to be done for 'enc'. I, [2024-05-08T19:39:56.115358 #3137477] INFO -- : make[1]: Leaving directory '/tmp/ruby/build/trunk' I, [2024-05-08T19:39:56.115953 #3137477] INFO -- : making srcs under enc I, [2024-05-08T19:39:56.145086 #3137477] INFO -- : make[1]: Entering directory '/tmp/ruby/build/trunk' I, [2024-05-08T19:39:56.145107 #3137477] INFO -- : make[1]: Nothing to be done for 'srcs'. I, [2024-05-08T19:39:56.145112 #3137477] INFO -- : make[1]: Leaving directory '/tmp/ruby/build/trunk' I, [2024-05-08T19:39:56.146104 #3137477] INFO -- : generating transdb.h I, [2024-05-08T19:39:56.241144 #3137477] INFO -- : transdb.h unchanged I, [2024-05-08T19:39:56.242493 #3137477] INFO -- : making trans I, [2024-05-08T19:39:56.277429 #3137477] INFO -- : make[1]: Entering directory '/tmp/ruby/build/trunk' I, [2024-05-08T19:39:56.277450 #3137477] INFO -- : make[1]: Nothing to be done for 'trans'. I, [2024-05-08T19:39:56.277456 #3137477] INFO -- : make[1]: Leaving directory '/tmp/ruby/build/trunk' I, [2024-05-08T19:39:56.278128 #3137477] INFO -- : making encs I, [2024-05-08T19:39:56.315004 #3137477] INFO -- : make[1]: Entering directory '/tmp/ruby/build/trunk' I, [2024-05-08T19:39:56.315024 #3137477] INFO -- : make[1]: Nothing to be done for 'encs'. I, [2024-05-08T19:39:56.315030 #3137477] INFO -- : make[1]: Leaving directory '/tmp/ruby/build/trunk' I, [2024-05-08T19:39:56.316789 #3137477] INFO -- : generating makefiles ext/configure-ext.mk I, [2024-05-08T19:39:56.343916 #3137477] INFO -- : ext/configure-ext.mk updated I, [2024-05-08T19:39:56.346226 #3137477] INFO -- : make[1]: Entering directory '/tmp/ruby/build/trunk' I, [2024-05-08T19:39:57.741983 #3137477] INFO -- : make[1]: Leaving directory '/tmp/ruby/build/trunk' I, [2024-05-08T19:39:57.742735 #3137477] INFO -- : generating makefile exts.mk I, [2024-05-08T19:39:57.779879 #3137477] INFO -- : exts.mk unchanged I, [2024-05-08T19:39:57.784188 #3137477] INFO -- : make[1]: Entering directory '/tmp/ruby/build/trunk' I, [2024-05-08T19:39:57.995468 #3137477] INFO -- : make[2]: Entering directory '/tmp/ruby/build/trunk/ext/coverage' I, [2024-05-08T19:39:57.998373 #3137477] INFO -- : make[2]: Leaving directory '/tmp/ruby/build/trunk/ext/coverage' I, [2024-05-08T19:39:58.002246 #3137477] INFO -- : make[2]: Entering directory '/tmp/ruby/build/trunk/ext/date' I, [2024-05-08T19:39:58.005378 #3137477] INFO -- : make[2]: Leaving directory '/tmp/ruby/build/trunk/ext/date' I, [2024-05-08T19:39:58.007542 #3137477] INFO -- : make[2]: Entering directory '/tmp/ruby/build/trunk/ext/digest' I, [2024-05-08T19:39:58.013132 #3137477] INFO -- : make[2]: Leaving directory '/tmp/ruby/build/trunk/ext/digest' I, [2024-05-08T19:39:58.028595 #3137477] INFO -- : make[2]: Entering directory '/tmp/ruby/build/trunk/ext/digest/sha2' I, [2024-05-08T19:39:58.031611 #3137477] INFO -- : make[2]: Leaving directory '/tmp/ruby/build/trunk/ext/digest/sha2' I, [2024-05-08T19:39:58.044430 #3137477] INFO -- : make[2]: Entering directory '/tmp/ruby/build/trunk/ext/fiddle' I, [2024-05-08T19:39:58.050848 #3137477] INFO -- : make[2]: Leaving directory '/tmp/ruby/build/trunk/ext/fiddle' I, [2024-05-08T19:39:58.053796 #3137477] INFO -- : make[2]: Entering directory '/tmp/ruby/build/trunk/ext/io/console' I, [2024-05-08T19:39:58.056336 #3137477] INFO -- : make[2]: Leaving directory '/tmp/ruby/build/trunk/ext/io/console' I, [2024-05-08T19:39:58.064076 #3137477] INFO -- : make[2]: Entering directory '/tmp/ruby/build/trunk/ext/json' I, [2024-05-08T19:39:58.070456 #3137477] INFO -- : make[2]: Leaving directory '/tmp/ruby/build/trunk/ext/json' I, [2024-05-08T19:39:58.079568 #3137477] INFO -- : make[2]: Entering directory '/tmp/ruby/build/trunk/ext/monitor' I, [2024-05-08T19:39:58.082102 #3137477] INFO -- : make[2]: Leaving directory '/tmp/ruby/build/trunk/ext/monitor' I, [2024-05-08T19:39:58.086298 #3137477] INFO -- : make[2]: Entering directory '/tmp/ruby/build/trunk/ext/objspace' I, [2024-05-08T19:39:58.090026 #3137477] INFO -- : make[2]: Leaving directory '/tmp/ruby/build/trunk/ext/objspace' I, [2024-05-08T19:39:58.101872 #3137477] INFO -- : make[2]: Entering directory '/tmp/ruby/build/trunk/ext/openssl' I, [2024-05-08T19:39:58.114947 #3137477] INFO -- : make[2]: Leaving directory '/tmp/ruby/build/trunk/ext/openssl' I, [2024-05-08T19:39:58.117992 #3137477] INFO -- : make[2]: Entering directory '/tmp/ruby/build/trunk/ext/pathname' I, [2024-05-08T19:39:58.120461 #3137477] INFO -- : make[2]: Leaving directory '/tmp/ruby/build/trunk/ext/pathname' I, [2024-05-08T19:39:58.124708 #3137477] INFO -- : make[2]: Entering directory '/tmp/ruby/build/trunk/ext/psych' I, [2024-05-08T19:39:58.139657 #3137477] INFO -- : make[2]: Leaving directory '/tmp/ruby/build/trunk/ext/psych' I, [2024-05-08T19:39:58.142804 #3137477] INFO -- : make[2]: Entering directory '/tmp/ruby/build/trunk/ext/pty' I, [2024-05-08T19:39:58.145316 #3137477] INFO -- : make[2]: Leaving directory '/tmp/ruby/build/trunk/ext/pty' I, [2024-05-08T19:39:58.154669 #3137477] INFO -- : make[2]: Entering directory '/tmp/ruby/build/trunk/ext/ripper' I, [2024-05-08T19:39:58.159638 #3137477] INFO -- : make[2]: Leaving directory '/tmp/ruby/build/trunk/ext/ripper' I, [2024-05-08T19:39:58.161106 #3137477] INFO -- : make[2]: Entering directory '/tmp/ruby/build/trunk/ext/rubyvm' I, [2024-05-08T19:39:58.163139 #3137477] INFO -- : make[2]: Leaving directory '/tmp/ruby/build/trunk/ext/rubyvm' I, [2024-05-08T19:39:58.171017 #3137477] INFO -- : make[2]: Entering directory '/tmp/ruby/build/trunk/ext/socket' I, [2024-05-08T19:39:58.177450 #3137477] INFO -- : make[2]: Leaving directory '/tmp/ruby/build/trunk/ext/socket' I, [2024-05-08T19:39:58.188588 #3137477] INFO -- : make[2]: Entering directory '/tmp/ruby/build/trunk/.bundle/gems/bigdecimal-3.1.7/ext/bigdecimal' I, [2024-05-08T19:39:58.211412 #3137477] INFO -- : make[2]: Leaving directory '/tmp/ruby/build/trunk/.bundle/gems/bigdecimal-3.1.7/ext/bigdecimal' I, [2024-05-08T19:39:58.213447 #3137477] INFO -- : make[2]: Entering directory '/tmp/ruby/build/trunk/.bundle/gems/bigdecimal-3.1.8/ext/bigdecimal' I, [2024-05-08T19:39:58.235575 #3137477] INFO -- : make[2]: Leaving directory '/tmp/ruby/build/trunk/.bundle/gems/bigdecimal-3.1.8/ext/bigdecimal' I, [2024-05-08T19:39:58.237515 #3137477] INFO -- : make[2]: Entering directory '/tmp/ruby/build/trunk/.bundle/gems/debug-1.9.2/ext/debug' I, [2024-05-08T19:39:58.259415 #3137477] INFO -- : make[2]: Leaving directory '/tmp/ruby/build/trunk/.bundle/gems/debug-1.9.2/ext/debug' I, [2024-05-08T19:39:58.261575 #3137477] INFO -- : make[2]: Entering directory '/tmp/ruby/build/trunk/.bundle/gems/nkf-0.2.0/ext/nkf' I, [2024-05-08T19:39:58.283413 #3137477] INFO -- : make[2]: Leaving directory '/tmp/ruby/build/trunk/.bundle/gems/nkf-0.2.0/ext/nkf' I, [2024-05-08T19:39:58.285268 #3137477] INFO -- : make[2]: Entering directory '/tmp/ruby/build/trunk/.bundle/gems/racc-1.7.3/ext/racc/cparse' I, [2024-05-08T19:39:58.307542 #3137477] INFO -- : make[2]: Leaving directory '/tmp/ruby/build/trunk/.bundle/gems/racc-1.7.3/ext/racc/cparse' I, [2024-05-08T19:39:58.310000 #3137477] INFO -- : make[2]: Entering directory '/tmp/ruby/build/trunk/.bundle/gems/rbs-3.4.4/ext/rbs_extension' I, [2024-05-08T19:39:58.332402 #3137477] INFO -- : make[2]: Leaving directory '/tmp/ruby/build/trunk/.bundle/gems/rbs-3.4.4/ext/rbs_extension' I, [2024-05-08T19:39:58.334266 #3137477] INFO -- : make[2]: Entering directory '/tmp/ruby/build/trunk/.bundle/gems/syslog-0.1.2/ext/syslog' I, [2024-05-08T19:39:58.356045 #3137477] INFO -- : make[2]: Leaving directory '/tmp/ruby/build/trunk/.bundle/gems/syslog-0.1.2/ext/syslog' I, [2024-05-08T19:39:58.379359 #3137477] INFO -- : make[2]: Entering directory '/tmp/ruby/build/trunk' I, [2024-05-08T19:39:58.442404 #3137477] INFO -- : make[2]: 'ruby' is up to date. I, [2024-05-08T19:39:58.442450 #3137477] INFO -- : make[2]: Leaving directory '/tmp/ruby/build/trunk' I, [2024-05-08T19:39:58.442672 #3137477] INFO -- : make[1]: Leaving directory '/tmp/ruby/build/trunk' I, [2024-05-08T19:39:58.446488 #3137477] INFO -- : make[1]: Entering directory '/tmp/ruby/build/trunk' I, [2024-05-08T19:39:58.446511 #3137477] INFO -- : make[1]: Nothing to be done for 'note'. I, [2024-05-08T19:39:58.446517 #3137477] INFO -- : make[1]: Leaving directory '/tmp/ruby/build/trunk' E, [2024-05-08T19:39:58.504385 #3137477] ERROR -- : $ /tmp/ruby/build/trunk/miniruby -I/tmp/ruby/src/trunk/lib /tmp/ruby/src/trunk/tool/runruby.rb --archdir=/tmp/ruby/build/trunk --extout=.ext -- /tmp/ruby/src/trunk/spec/mspec/bin/mspec-run -B /tmp/ruby/src/trunk/spec/default.mspec --error-output stderr --debug -fy -o /tmp/rubytest.586sfu/1-mspec-multi-0 E, [2024-05-08T19:39:58.504691 #3137477] ERROR -- : $ /tmp/ruby/build/trunk/miniruby -I/tmp/ruby/src/trunk/lib /tmp/ruby/src/trunk/tool/runruby.rb --archdir=/tmp/ruby/build/trunk --extout=.ext -- /tmp/ruby/src/trunk/spec/mspec/bin/mspec-run -B /tmp/ruby/src/trunk/spec/default.mspec --error-output stderr --debug -fy -o /tmp/rubytest.586sfu/2-mspec-multi-1 E, [2024-05-08T19:39:58.504968 #3137477] ERROR -- : $ /tmp/ruby/build/trunk/miniruby -I/tmp/ruby/src/trunk/lib /tmp/ruby/src/trunk/tool/runruby.rb --archdir=/tmp/ruby/build/trunk --extout=.ext -- /tmp/ruby/src/trunk/spec/mspec/bin/mspec-run -B /tmp/ruby/src/trunk/spec/default.mspec --error-output stderr --debug -fy -o /tmp/rubytest.586sfu/3-mspec-multi-2 E, [2024-05-08T19:39:58.505189 #3137477] ERROR -- : $ /tmp/ruby/build/trunk/miniruby -I/tmp/ruby/src/trunk/lib /tmp/ruby/src/trunk/tool/runruby.rb --archdir=/tmp/ruby/build/trunk --extout=.ext -- /tmp/ruby/src/trunk/spec/mspec/bin/mspec-run -B /tmp/ruby/src/trunk/spec/default.mspec --error-output stderr --debug -fy -o /tmp/rubytest.586sfu/4-mspec-multi-3 E, [2024-05-08T19:39:58.505455 #3137477] ERROR -- : $ /tmp/ruby/build/trunk/miniruby -I/tmp/ruby/src/trunk/lib /tmp/ruby/src/trunk/tool/runruby.rb --archdir=/tmp/ruby/build/trunk --extout=.ext -- /tmp/ruby/src/trunk/spec/mspec/bin/mspec-run -B /tmp/ruby/src/trunk/spec/default.mspec --error-output stderr --debug -fy -o /tmp/rubytest.586sfu/5-mspec-multi-4 E, [2024-05-08T19:39:58.505585 #3137477] ERROR -- : $ /tmp/ruby/build/trunk/miniruby -I/tmp/ruby/src/trunk/lib /tmp/ruby/src/trunk/tool/runruby.rb --archdir=/tmp/ruby/build/trunk --extout=.ext -- /tmp/ruby/src/trunk/spec/mspec/bin/mspec-run -B /tmp/ruby/src/trunk/spec/default.mspec --error-output stderr --debug -fy -o /tmp/rubytest.586sfu/6-mspec-multi-5 E, [2024-05-08T19:39:58.505774 #3137477] ERROR -- : $ /tmp/ruby/build/trunk/miniruby -I/tmp/ruby/src/trunk/lib /tmp/ruby/src/trunk/tool/runruby.rb --archdir=/tmp/ruby/build/trunk --extout=.ext -- /tmp/ruby/src/trunk/spec/mspec/bin/mspec-run -B /tmp/ruby/src/trunk/spec/default.mspec --error-output stderr --debug -fy -o /tmp/rubytest.586sfu/7-mspec-multi-6 E, [2024-05-08T19:39:58.505928 #3137477] ERROR -- : $ /tmp/ruby/build/trunk/miniruby -I/tmp/ruby/src/trunk/lib /tmp/ruby/src/trunk/tool/runruby.rb --archdir=/tmp/ruby/build/trunk --extout=.ext -- /tmp/ruby/src/trunk/spec/mspec/bin/mspec-run -B /tmp/ruby/src/trunk/spec/default.mspec --error-output stderr --debug -fy -o /tmp/rubytest.586sfu/8-mspec-multi-7 E, [2024-05-08T19:39:58.506107 #3137477] ERROR -- : $ /tmp/ruby/build/trunk/miniruby -I/tmp/ruby/src/trunk/lib /tmp/ruby/src/trunk/tool/runruby.rb --archdir=/tmp/ruby/build/trunk --extout=.ext -- /tmp/ruby/src/trunk/spec/mspec/bin/mspec-run -B /tmp/ruby/src/trunk/spec/default.mspec --error-output stderr --debug -fy -o /tmp/rubytest.586sfu/9-mspec-multi-8 E, [2024-05-08T19:39:58.506405 #3137477] ERROR -- : $ /tmp/ruby/build/trunk/miniruby -I/tmp/ruby/src/trunk/lib /tmp/ruby/src/trunk/tool/runruby.rb --archdir=/tmp/ruby/build/trunk --extout=.ext -- /tmp/ruby/src/trunk/spec/mspec/bin/mspec-run -B /tmp/ruby/src/trunk/spec/default.mspec --error-output stderr --debug -fy -o /tmp/rubytest.586sfu/10-mspec-multi-9 E, [2024-05-08T19:39:58.506635 #3137477] ERROR -- : $ /tmp/ruby/build/trunk/miniruby -I/tmp/ruby/src/trunk/lib /tmp/ruby/src/trunk/tool/runruby.rb --archdir=/tmp/ruby/build/trunk --extout=.ext -- /tmp/ruby/src/trunk/spec/mspec/bin/mspec-run -B /tmp/ruby/src/trunk/spec/default.mspec --error-output stderr --debug -fy -o /tmp/rubytest.586sfu/11-mspec-multi-10 E, [2024-05-08T19:39:58.506851 #3137477] ERROR -- : $ /tmp/ruby/build/trunk/miniruby -I/tmp/ruby/src/trunk/lib /tmp/ruby/src/trunk/tool/runruby.rb --archdir=/tmp/ruby/build/trunk --extout=.ext -- /tmp/ruby/src/trunk/spec/mspec/bin/mspec-run -B /tmp/ruby/src/trunk/spec/default.mspec --error-output stderr --debug -fy -o /tmp/rubytest.586sfu/12-mspec-multi-11 E, [2024-05-08T19:39:58.507036 #3137477] ERROR -- : $ /tmp/ruby/build/trunk/miniruby -I/tmp/ruby/src/trunk/lib /tmp/ruby/src/trunk/tool/runruby.rb --archdir=/tmp/ruby/build/trunk --extout=.ext -- /tmp/ruby/src/trunk/spec/mspec/bin/mspec-run -B /tmp/ruby/src/trunk/spec/default.mspec --error-output stderr --debug -fy -o /tmp/rubytest.586sfu/13-mspec-multi-12 E, [2024-05-08T19:39:58.507213 #3137477] ERROR -- : $ /tmp/ruby/build/trunk/miniruby -I/tmp/ruby/src/trunk/lib /tmp/ruby/src/trunk/tool/runruby.rb --archdir=/tmp/ruby/build/trunk --extout=.ext -- /tmp/ruby/src/trunk/spec/mspec/bin/mspec-run -B /tmp/ruby/src/trunk/spec/default.mspec --error-output stderr --debug -fy -o /tmp/rubytest.586sfu/14-mspec-multi-13 E, [2024-05-08T19:39:58.507342 #3137477] ERROR -- : $ /tmp/ruby/build/trunk/miniruby -I/tmp/ruby/src/trunk/lib /tmp/ruby/src/trunk/tool/runruby.rb --archdir=/tmp/ruby/build/trunk --extout=.ext -- /tmp/ruby/src/trunk/spec/mspec/bin/mspec-run -B /tmp/ruby/src/trunk/spec/default.mspec --error-output stderr --debug -fy -o /tmp/rubytest.586sfu/15-mspec-multi-14 E, [2024-05-08T19:39:58.507505 #3137477] ERROR -- : $ /tmp/ruby/build/trunk/miniruby -I/tmp/ruby/src/trunk/lib /tmp/ruby/src/trunk/tool/runruby.rb --archdir=/tmp/ruby/build/trunk --extout=.ext -- /tmp/ruby/src/trunk/spec/mspec/bin/mspec-run -B /tmp/ruby/src/trunk/spec/default.mspec --error-output stderr --debug -fy -o /tmp/rubytest.586sfu/16-mspec-multi-15 E, [2024-05-08T19:39:58.507737 #3137477] ERROR -- : $ /tmp/ruby/build/trunk/miniruby -I/tmp/ruby/src/trunk/lib /tmp/ruby/src/trunk/tool/runruby.rb --archdir=/tmp/ruby/build/trunk --extout=.ext -- /tmp/ruby/src/trunk/spec/mspec/bin/mspec-run -B /tmp/ruby/src/trunk/spec/default.mspec --error-output stderr --debug -fy -o /tmp/rubytest.586sfu/17-mspec-multi-16 E, [2024-05-08T19:39:58.507842 #3137477] ERROR -- : $ /tmp/ruby/build/trunk/miniruby -I/tmp/ruby/src/trunk/lib /tmp/ruby/src/trunk/tool/runruby.rb --archdir=/tmp/ruby/build/trunk --extout=.ext -- /tmp/ruby/src/trunk/spec/mspec/bin/mspec-run -B /tmp/ruby/src/trunk/spec/default.mspec --error-output stderr --debug -fy -o /tmp/rubytest.586sfu/18-mspec-multi-17 E, [2024-05-08T19:39:58.510101 #3137477] ERROR -- : $ /tmp/ruby/build/trunk/miniruby -I/tmp/ruby/src/trunk/lib /tmp/ruby/src/trunk/tool/runruby.rb --archdir=/tmp/ruby/build/trunk --extout=.ext -- /tmp/ruby/src/trunk/spec/mspec/bin/mspec-run -B /tmp/ruby/src/trunk/spec/default.mspec --error-output stderr --debug -fy -o /tmp/rubytest.586sfu/19-mspec-multi-18 E, [2024-05-08T19:39:58.510552 #3137477] ERROR -- : $ /tmp/ruby/build/trunk/miniruby -I/tmp/ruby/src/trunk/lib /tmp/ruby/src/trunk/tool/runruby.rb --archdir=/tmp/ruby/build/trunk --extout=.ext -- /tmp/ruby/src/trunk/spec/mspec/bin/mspec-run -B /tmp/ruby/src/trunk/spec/default.mspec --error-output stderr --debug -fy -o /tmp/rubytest.586sfu/20-mspec-multi-19 I, [2024-05-08T19:39:58.689756 #3137477] INFO -- : ruby 3.4.0dev (2024-05-08T18:56:14Z master 442e398e62) [x86_64-linux] I, [2024-05-08T19:39:59.354363 #3137477] INFO -- : 0 ......................................................................... I, [2024-05-08T19:39:59.759744 #3137477] INFO -- : 73 ......................................................................... I, [2024-05-08T19:39:59.909066 #3137477] INFO -- : 146 ......................................................................... I, [2024-05-08T19:39:59.955996 #3137477] INFO -- : 219 ......................................................................... I, [2024-05-08T19:40:00.010724 #3137477] INFO -- : 292 ......................................................................... I, [2024-05-08T19:40:00.058591 #3137477] INFO -- : 365 ......................................................................... I, [2024-05-08T19:40:00.080917 #3137477] INFO -- : 438 ......................................................................... I, [2024-05-08T19:40:00.102538 #3137477] INFO -- : 511 ......................................................................... I, [2024-05-08T19:40:00.123489 #3137477] INFO -- : 584 ......................................................................... I, [2024-05-08T19:40:00.182339 #3137477] INFO -- : 657 ......................................................................... I, [2024-05-08T19:40:00.212063 #3137477] INFO -- : 730 ......................................................................... I, [2024-05-08T19:40:00.237563 #3137477] INFO -- : 803 ......................................................................... I, [2024-05-08T19:40:00.275658 #3137477] INFO -- : 876 ......................................................................... I, [2024-05-08T19:40:00.319894 #3137477] INFO -- : 949 ......................................................................... I, [2024-05-08T19:40:00.412438 #3137477] INFO -- : 1022 ......................................................................... I, [2024-05-08T19:40:00.578147 #3137477] INFO -- : 1095 ......................................................................... I, [2024-05-08T19:40:00.694703 #3137477] INFO -- : 1168 ......................................................................... I, [2024-05-08T19:40:00.755498 #3137477] INFO -- : 1241 ......................................................................... I, [2024-05-08T19:40:00.800676 #3137477] INFO -- : 1314 ......................................................................... I, [2024-05-08T19:40:00.824072 #3137477] INFO -- : 1387 ......................................................................... I, [2024-05-08T19:40:00.938333 #3137477] INFO -- : 1460 ......................................................................... I, [2024-05-08T19:40:01.397384 #3137477] INFO -- : 1533 ......................................................................... I, [2024-05-08T19:40:01.468213 #3137477] INFO -- : 1606 ......................................................................... I, [2024-05-08T19:40:01.559006 #3137477] INFO -- : 1679 ......................................................................... I, [2024-05-08T19:40:01.688257 #3137477] INFO -- : 1752 ......................................................................... I, [2024-05-08T19:40:01.778349 #3137477] INFO -- : 1825 ......................................................................... I, [2024-05-08T19:40:01.871779 #3137477] INFO -- : 1898 ......................................................................... I, [2024-05-08T19:40:01.973704 #3137477] INFO -- : 1971 ......................................................................... I, [2024-05-08T19:40:02.060212 #3137477] INFO -- : 2044 ......................................................................... I, [2024-05-08T19:40:02.096618 #3137477] INFO -- : 2117 ......................................................................... I, [2024-05-08T19:40:02.112716 #3137477] INFO -- : 2190 ......................................................................... I, [2024-05-08T19:40:02.132412 #3137477] INFO -- : 2263 ......................................................................... I, [2024-05-08T19:40:02.147322 #3137477] INFO -- : 2336 ......................................................................... I, [2024-05-08T19:40:02.188259 #3137477] INFO -- : 2409 ......................................................................... I, [2024-05-08T19:40:02.306264 #3137477] INFO -- : 2482 ......................................................................... I, [2024-05-08T19:40:02.328680 #3137477] INFO -- : 2555 ......................................................................... I, [2024-05-08T19:40:02.410596 #3137477] INFO -- : 2628 ......................................................................... I, [2024-05-08T19:40:02.524804 #3137477] INFO -- : 2701 ......................................................................... I, [2024-05-08T19:40:02.553447 #3137477] INFO -- : 2774 ......................................................................... I, [2024-05-08T19:40:02.608718 #3137477] INFO -- : 2847 ......................................................................... I, [2024-05-08T19:40:02.651889 #3137477] INFO -- : 2920 ......................................................................... I, [2024-05-08T19:40:02.676295 #3137477] INFO -- : 2993 ......................................................................... I, [2024-05-08T19:40:02.697665 #3137477] INFO -- : 3066 ......................................................................... I, [2024-05-08T19:40:02.707791 #3137477] INFO -- : 3139 ......................................................................... I, [2024-05-08T19:40:02.716930 #3137477] INFO -- : 3212 ......................................................................... I, [2024-05-08T19:40:02.744979 #3137477] INFO -- : 3285 ......................................................................... I, [2024-05-08T19:40:06.706793 #3137477] INFO -- : 3358 ........................................................................ I, [2024-05-08T19:40:06.706884 #3137477] INFO -- : I, [2024-05-08T19:40:06.706898 #3137477] INFO -- : Finished in 8.201557 seconds I, [2024-05-08T19:40:06.706910 #3137477] INFO -- : I, [2024-05-08T19:40:06.706921 #3137477] INFO -- : 3429 files, 32610 examples, 187716 expectations, 0 failures, 0 errors, 0 tagged I, [2024-05-08T19:40:06.709190 #3137477] INFO -- : $$$[end] "make yes-test-rubyspec MSPECOPT='--error-output stderr --debug -j' TESTS='-j20'" exit with 0.