# Logfile created on 2024-05-08 02:58:20 +0000 by logger.rb/v1.4.3 I, [2024-05-08T02:58:20.098027 #3183965] INFO -- : #, @formatter=nil, @logdev=#, @binmode=false, @mon_data=#, @mon_data_owner_object_id=860>>> I, [2024-05-08T02:58:20.098164 #3183965] INFO -- : $$$[beg] make update-unicode -j20 I, [2024-05-08T02:58:20.156346 #3183965] INFO -- : Downloading Unicode emoji 15.0 files... I, [2024-05-08T02:58:20.156499 #3183965] INFO -- : Downloading Unicode emoji 15.0 files... I, [2024-05-08T02:58:20.157010 #3183965] INFO -- : Downloading Unicode emoji 15.0 files... I, [2024-05-08T02:58:20.198034 #3183965] INFO -- : made symlink emoji/15.0/emoji-sequences.txt to /tmp/ruby/src/trunk/.downloaded-cache/emoji/15.0/emoji-sequences.txt E, [2024-05-08T02:58:20.659728 #3183965] ERROR -- : /tmp/ruby/src/trunk/tool/downloader.rb:302:in `rescue in download': failed to download emoji/15.0/emoji-test.txt (RuntimeError) E, [2024-05-08T02:58:20.659763 #3183965] ERROR -- : OpenURI::HTTPError: 403 Forbidden: https://www.unicode.org/Public/emoji/15.0/emoji-test.txt E, [2024-05-08T02:58:20.659768 #3183965] ERROR -- : from /tmp/ruby/src/trunk/tool/downloader.rb:201:in `download' E, [2024-05-08T02:58:20.659772 #3183965] ERROR -- : from /tmp/ruby/src/trunk/tool/downloader.rb:136:in `download' E, [2024-05-08T02:58:20.659776 #3183965] ERROR -- : from /tmp/ruby/src/trunk/tool/downloader.rb:482:in `block in
' E, [2024-05-08T02:58:20.659779 #3183965] ERROR -- : from /tmp/ruby/src/trunk/tool/downloader.rb:465:in `each' E, [2024-05-08T02:58:20.659783 #3183965] ERROR -- : from /tmp/ruby/src/trunk/tool/downloader.rb:465:in `
' E, [2024-05-08T02:58:20.659787 #3183965] ERROR -- : /usr/lib/ruby/3.0.0/open-uri.rb:364:in `open_http': 403 Forbidden (OpenURI::HTTPError) E, [2024-05-08T02:58:20.659791 #3183965] ERROR -- : from /usr/lib/ruby/3.0.0/open-uri.rb:741:in `buffer_open' E, [2024-05-08T02:58:20.659795 #3183965] ERROR -- : from /usr/lib/ruby/3.0.0/open-uri.rb:212:in `block in open_loop' E, [2024-05-08T02:58:20.659798 #3183965] ERROR -- : from /usr/lib/ruby/3.0.0/open-uri.rb:210:in `catch' E, [2024-05-08T02:58:20.659802 #3183965] ERROR -- : from /usr/lib/ruby/3.0.0/open-uri.rb:210:in `open_loop' E, [2024-05-08T02:58:20.659805 #3183965] ERROR -- : from /usr/lib/ruby/3.0.0/open-uri.rb:151:in `open_uri' E, [2024-05-08T02:58:20.659808 #3183965] ERROR -- : from /usr/lib/ruby/3.0.0/open-uri.rb:721:in `open' E, [2024-05-08T02:58:20.659812 #3183965] ERROR -- : from /usr/lib/ruby/3.0.0/open-uri.rb:729:in `read' E, [2024-05-08T02:58:20.659815 #3183965] ERROR -- : from /tmp/ruby/src/trunk/tool/downloader.rb:247:in `block in download' E, [2024-05-08T02:58:20.659818 #3183965] ERROR -- : from /tmp/ruby/src/trunk/tool/downloader.rb:378:in `with_retry' E, [2024-05-08T02:58:20.659823 #3183965] ERROR -- : from /tmp/ruby/src/trunk/tool/downloader.rb:246:in `download' E, [2024-05-08T02:58:20.659835 #3183965] ERROR -- : from /tmp/ruby/src/trunk/tool/downloader.rb:136:in `download' E, [2024-05-08T02:58:20.659838 #3183965] ERROR -- : from /tmp/ruby/src/trunk/tool/downloader.rb:482:in `block in
' E, [2024-05-08T02:58:20.659842 #3183965] ERROR -- : from /tmp/ruby/src/trunk/tool/downloader.rb:465:in `each' E, [2024-05-08T02:58:20.659845 #3183965] ERROR -- : from /tmp/ruby/src/trunk/tool/downloader.rb:465:in `
' E, [2024-05-08T02:58:20.661744 #3183965] ERROR -- : make: *** [uncommon.mk:1787: /tmp/ruby/src/trunk/enc/unicode/data/emoji/15.0/emoji-sequences.txt] Error 1 E, [2024-05-08T02:58:20.661765 #3183965] ERROR -- : make: *** Deleting file '/tmp/ruby/src/trunk/enc/unicode/data/emoji/15.0/emoji-sequences.txt' E, [2024-05-08T02:58:20.661771 #3183965] ERROR -- : make: *** Waiting for unfinished jobs.... E, [2024-05-08T02:58:21.094619 #3183965] ERROR -- : /tmp/ruby/src/trunk/tool/downloader.rb:302:in `rescue in download': failed to download emoji/15.0/emoji-sequences.txt (RuntimeError) E, [2024-05-08T02:58:21.094639 #3183965] ERROR -- : EOFError: end of file reached: https://www.unicode.org/Public/emoji/15.0/emoji-sequences.txt E, [2024-05-08T02:58:21.094644 #3183965] ERROR -- : from /tmp/ruby/src/trunk/tool/downloader.rb:201:in `download' E, [2024-05-08T02:58:21.094648 #3183965] ERROR -- : from /tmp/ruby/src/trunk/tool/downloader.rb:136:in `download' E, [2024-05-08T02:58:21.094651 #3183965] ERROR -- : from /tmp/ruby/src/trunk/tool/downloader.rb:482:in `block in
' E, [2024-05-08T02:58:21.094655 #3183965] ERROR -- : from /tmp/ruby/src/trunk/tool/downloader.rb:465:in `each' E, [2024-05-08T02:58:21.094658 #3183965] ERROR -- : from /tmp/ruby/src/trunk/tool/downloader.rb:465:in `
' E, [2024-05-08T02:58:21.094663 #3183965] ERROR -- : /usr/lib/ruby/3.0.0/net/protocol.rb:227:in `rbuf_fill': end of file reached (EOFError) E, [2024-05-08T02:58:21.094667 #3183965] ERROR -- : from /usr/lib/ruby/3.0.0/net/protocol.rb:193:in `readuntil' E, [2024-05-08T02:58:21.094671 #3183965] ERROR -- : from /usr/lib/ruby/3.0.0/net/protocol.rb:203:in `readline' E, [2024-05-08T02:58:21.094675 #3183965] ERROR -- : from /usr/lib/ruby/3.0.0/net/http/response.rb:42:in `read_status_line' E, [2024-05-08T02:58:21.094678 #3183965] ERROR -- : from /usr/lib/ruby/3.0.0/net/http/response.rb:31:in `read_new' E, [2024-05-08T02:58:21.094681 #3183965] ERROR -- : from /usr/lib/ruby/3.0.0/net/http.rb:1557:in `block in transport_request' E, [2024-05-08T02:58:21.094685 #3183965] ERROR -- : from /usr/lib/ruby/3.0.0/net/http.rb:1548:in `catch' E, [2024-05-08T02:58:21.094688 #3183965] ERROR -- : from /usr/lib/ruby/3.0.0/net/http.rb:1548:in `transport_request' E, [2024-05-08T02:58:21.094693 #3183965] ERROR -- : from /usr/lib/ruby/3.0.0/net/http.rb:1521:in `request' E, [2024-05-08T02:58:21.094696 #3183965] ERROR -- : from /usr/lib/ruby/3.0.0/open-uri.rb:329:in `block in open_http' E, [2024-05-08T02:58:21.094700 #3183965] ERROR -- : from /usr/lib/ruby/3.0.0/net/http.rb:960:in `start' E, [2024-05-08T02:58:21.094703 #3183965] ERROR -- : from /usr/lib/ruby/3.0.0/open-uri.rb:323:in `open_http' E, [2024-05-08T02:58:21.094706 #3183965] ERROR -- : from /usr/lib/ruby/3.0.0/open-uri.rb:741:in `buffer_open' E, [2024-05-08T02:58:21.094711 #3183965] ERROR -- : from /usr/lib/ruby/3.0.0/open-uri.rb:212:in `block in open_loop' E, [2024-05-08T02:58:21.094717 #3183965] ERROR -- : from /usr/lib/ruby/3.0.0/open-uri.rb:210:in `catch' E, [2024-05-08T02:58:21.094722 #3183965] ERROR -- : from /usr/lib/ruby/3.0.0/open-uri.rb:210:in `open_loop' E, [2024-05-08T02:58:21.094726 #3183965] ERROR -- : from /usr/lib/ruby/3.0.0/open-uri.rb:151:in `open_uri' E, [2024-05-08T02:58:21.094730 #3183965] ERROR -- : from /usr/lib/ruby/3.0.0/open-uri.rb:721:in `open' E, [2024-05-08T02:58:21.094734 #3183965] ERROR -- : from /usr/lib/ruby/3.0.0/open-uri.rb:729:in `read' E, [2024-05-08T02:58:21.094737 #3183965] ERROR -- : from /tmp/ruby/src/trunk/tool/downloader.rb:247:in `block in download' E, [2024-05-08T02:58:21.094745 #3183965] ERROR -- : from /tmp/ruby/src/trunk/tool/downloader.rb:378:in `with_retry' E, [2024-05-08T02:58:21.094748 #3183965] ERROR -- : from /tmp/ruby/src/trunk/tool/downloader.rb:246:in `download' E, [2024-05-08T02:58:21.094752 #3183965] ERROR -- : from /tmp/ruby/src/trunk/tool/downloader.rb:136:in `download' E, [2024-05-08T02:58:21.094755 #3183965] ERROR -- : from /tmp/ruby/src/trunk/tool/downloader.rb:482:in `block in
' E, [2024-05-08T02:58:21.094760 #3183965] ERROR -- : from /tmp/ruby/src/trunk/tool/downloader.rb:465:in `each' E, [2024-05-08T02:58:21.094765 #3183965] ERROR -- : from /tmp/ruby/src/trunk/tool/downloader.rb:465:in `
' E, [2024-05-08T02:58:21.096717 #3183965] ERROR -- : make: *** [uncommon.mk:1787: /tmp/ruby/src/trunk/enc/unicode/data/emoji/15.0/emoji-zwj-sequences.txt] Error 1 E, [2024-05-08T02:58:21.124566 #3183965] ERROR -- : /tmp/ruby/src/trunk/tool/downloader.rb:302:in `rescue in download': failed to download emoji/15.0/emoji-sequences.txt (RuntimeError) E, [2024-05-08T02:58:21.124586 #3183965] ERROR -- : EOFError: end of file reached: https://www.unicode.org/Public/emoji/15.0/emoji-sequences.txt E, [2024-05-08T02:58:21.124591 #3183965] ERROR -- : from /tmp/ruby/src/trunk/tool/downloader.rb:201:in `download' E, [2024-05-08T02:58:21.124594 #3183965] ERROR -- : from /tmp/ruby/src/trunk/tool/downloader.rb:136:in `download' E, [2024-05-08T02:58:21.124678 #3183965] ERROR -- : from /tmp/ruby/src/trunk/tool/downloader.rb:482:in `block in
' E, [2024-05-08T02:58:21.124683 #3183965] ERROR -- : from /tmp/ruby/src/trunk/tool/downloader.rb:465:in `each' E, [2024-05-08T02:58:21.124687 #3183965] ERROR -- : from /tmp/ruby/src/trunk/tool/downloader.rb:465:in `
' E, [2024-05-08T02:58:21.124690 #3183965] ERROR -- : /usr/lib/ruby/3.0.0/net/protocol.rb:227:in `rbuf_fill': end of file reached (EOFError) E, [2024-05-08T02:58:21.124694 #3183965] ERROR -- : from /usr/lib/ruby/3.0.0/net/protocol.rb:193:in `readuntil' E, [2024-05-08T02:58:21.124697 #3183965] ERROR -- : from /usr/lib/ruby/3.0.0/net/protocol.rb:203:in `readline' E, [2024-05-08T02:58:21.124703 #3183965] ERROR -- : from /usr/lib/ruby/3.0.0/net/http/response.rb:42:in `read_status_line' E, [2024-05-08T02:58:21.124707 #3183965] ERROR -- : from /usr/lib/ruby/3.0.0/net/http/response.rb:31:in `read_new' E, [2024-05-08T02:58:21.124710 #3183965] ERROR -- : from /usr/lib/ruby/3.0.0/net/http.rb:1557:in `block in transport_request' E, [2024-05-08T02:58:21.124714 #3183965] ERROR -- : from /usr/lib/ruby/3.0.0/net/http.rb:1548:in `catch' E, [2024-05-08T02:58:21.124717 #3183965] ERROR -- : from /usr/lib/ruby/3.0.0/net/http.rb:1548:in `transport_request' E, [2024-05-08T02:58:21.124721 #3183965] ERROR -- : from /usr/lib/ruby/3.0.0/net/http.rb:1521:in `request' E, [2024-05-08T02:58:21.124724 #3183965] ERROR -- : from /usr/lib/ruby/3.0.0/open-uri.rb:329:in `block in open_http' E, [2024-05-08T02:58:21.124727 #3183965] ERROR -- : from /usr/lib/ruby/3.0.0/net/http.rb:960:in `start' E, [2024-05-08T02:58:21.124731 #3183965] ERROR -- : from /usr/lib/ruby/3.0.0/open-uri.rb:323:in `open_http' E, [2024-05-08T02:58:21.124735 #3183965] ERROR -- : from /usr/lib/ruby/3.0.0/open-uri.rb:741:in `buffer_open' E, [2024-05-08T02:58:21.124739 #3183965] ERROR -- : from /usr/lib/ruby/3.0.0/open-uri.rb:212:in `block in open_loop' E, [2024-05-08T02:58:21.124742 #3183965] ERROR -- : from /usr/lib/ruby/3.0.0/open-uri.rb:210:in `catch' E, [2024-05-08T02:58:21.124746 #3183965] ERROR -- : from /usr/lib/ruby/3.0.0/open-uri.rb:210:in `open_loop' E, [2024-05-08T02:58:21.124749 #3183965] ERROR -- : from /usr/lib/ruby/3.0.0/open-uri.rb:151:in `open_uri' E, [2024-05-08T02:58:21.124752 #3183965] ERROR -- : from /usr/lib/ruby/3.0.0/open-uri.rb:721:in `open' E, [2024-05-08T02:58:21.124756 #3183965] ERROR -- : from /usr/lib/ruby/3.0.0/open-uri.rb:729:in `read' E, [2024-05-08T02:58:21.124760 #3183965] ERROR -- : from /tmp/ruby/src/trunk/tool/downloader.rb:247:in `block in download' E, [2024-05-08T02:58:21.124763 #3183965] ERROR -- : from /tmp/ruby/src/trunk/tool/downloader.rb:378:in `with_retry' E, [2024-05-08T02:58:21.124771 #3183965] ERROR -- : from /tmp/ruby/src/trunk/tool/downloader.rb:246:in `download' E, [2024-05-08T02:58:21.124775 #3183965] ERROR -- : from /tmp/ruby/src/trunk/tool/downloader.rb:136:in `download' E, [2024-05-08T02:58:21.124778 #3183965] ERROR -- : from /tmp/ruby/src/trunk/tool/downloader.rb:482:in `block in
' E, [2024-05-08T02:58:21.124782 #3183965] ERROR -- : from /tmp/ruby/src/trunk/tool/downloader.rb:465:in `each' E, [2024-05-08T02:58:21.124785 #3183965] ERROR -- : from /tmp/ruby/src/trunk/tool/downloader.rb:465:in `
' I, [2024-05-08T02:58:21.126729 #3183965] INFO -- : downloading emoji/15.0/emoji-sequences.txt ... downloading emoji/15.0/emoji-sequences.txt ... downloading emoji/15.0/emoji-test.txt ... E, [2024-05-08T02:58:21.126761 #3183965] ERROR -- : make: *** [uncommon.mk:1787: /tmp/ruby/src/trunk/enc/unicode/data/emoji/15.0/emoji-test.txt] Error 1 I, [2024-05-08T02:58:21.127055 #3183965] INFO -- : $$$[end] "make update-unicode -j20" exit with 512. I, [2024-05-08T02:58:21.127151 #3183965] INFO -- : $$$[beg] make update-download -j20 I, [2024-05-08T02:58:21.226417 #3183965] INFO -- : tool/config.guess already exists I, [2024-05-08T02:58:21.226456 #3183965] INFO -- : tool/config.sub already exists I, [2024-05-08T02:58:21.228505 #3183965] INFO -- : Update minitest to ea9caafc0754b1d6236a490d59e624b53209734a I, [2024-05-08T02:58:21.228677 #3183965] INFO -- : Update power_assert to 84e85124c5014a139af39161d484156cfe87a9ed I, [2024-05-08T02:58:21.229437 #3183965] INFO -- : Update rbs to ba7872795d5de04adb8ff500c0e6afdc81a041dd I, [2024-05-08T02:58:21.229583 #3183965] INFO -- : Update typeprof to b19a6416da3a05d57fadd6ffdadb382b6d236ca5 I, [2024-05-08T02:58:21.229869 #3183965] INFO -- : echo ea9caafc0754b1d6236a490d59e624b53209734a | /bin/sh /tmp/ruby/src/trunk/tool/ifchange /tmp/ruby/src/trunk/.bundle/.timestamp/minitest.revision - I, [2024-05-08T02:58:21.230085 #3183965] INFO -- : echo 84e85124c5014a139af39161d484156cfe87a9ed | /bin/sh /tmp/ruby/src/trunk/tool/ifchange /tmp/ruby/src/trunk/.bundle/.timestamp/power_assert.revision - I, [2024-05-08T02:58:21.230530 #3183965] INFO -- : echo ba7872795d5de04adb8ff500c0e6afdc81a041dd | /bin/sh /tmp/ruby/src/trunk/tool/ifchange /tmp/ruby/src/trunk/.bundle/.timestamp/rbs.revision - I, [2024-05-08T02:58:21.230720 #3183965] INFO -- : echo b19a6416da3a05d57fadd6ffdadb382b6d236ca5 | /bin/sh /tmp/ruby/src/trunk/tool/ifchange /tmp/ruby/src/trunk/.bundle/.timestamp/typeprof.revision - I, [2024-05-08T02:58:21.231552 #3183965] INFO -- : /tmp/ruby/src/trunk/.bundle/.timestamp/minitest.revision unchanged I, [2024-05-08T02:58:21.231849 #3183965] INFO -- : /tmp/ruby/src/trunk/.bundle/.timestamp/power_assert.revision unchanged I, [2024-05-08T02:58:21.232354 #3183965] INFO -- : /tmp/ruby/src/trunk/.bundle/.timestamp/rbs.revision unchanged I, [2024-05-08T02:58:21.232450 #3183965] INFO -- : /tmp/ruby/src/trunk/.bundle/.timestamp/typeprof.revision unchanged I, [2024-05-08T02:58:21.233190 #3183965] INFO -- : Building power_assert@84e85124c5014a139af39161d484156cfe87a9ed to /tmp/ruby/src/trunk/gems/power_assert-2.0.3.gem I, [2024-05-08T02:58:21.302087 #3183965] INFO -- : Successfully built RubyGem I, [2024-05-08T02:58:21.302142 #3183965] INFO -- : Name: power_assert I, [2024-05-08T02:58:21.302161 #3183965] INFO -- : Version: 2.0.4dev I, [2024-05-08T02:58:21.302172 #3183965] INFO -- : File: power_assert-2.0.4dev.gem I, [2024-05-08T02:58:21.347815 #3183965] INFO -- : $$$[end] "make update-download -j20" exit with 0. I, [2024-05-08T02:58:21.347873 #3183965] INFO -- : $$$[beg] make update-rubyspec -j20 I, [2024-05-08T02:58:21.405896 #3183965] INFO -- : make: Nothing to be done for 'update-rubyspec'. I, [2024-05-08T02:58:21.406230 #3183965] INFO -- : $$$[end] "make update-rubyspec -j20" exit with 0. I, [2024-05-08T02:58:21.406254 #3183965] INFO -- : $$$[beg] make update-src -j20 I, [2024-05-08T02:58:21.943691 #3183965] INFO -- : Already up to date. I, [2024-05-08T02:58:21.952761 #3183965] INFO -- : Latest commit hash = b4b39a6199 I, [2024-05-08T02:58:21.953831 #3183965] INFO -- : $$$[end] "make update-src -j20" exit with 0. I, [2024-05-08T02:58:21.953870 #3183965] INFO -- : $$$[beg] make after-update -j20 I, [2024-05-08T02:58:22.022261 #3183965] INFO -- : generating /tmp/ruby/src/trunk/ext/ripper/eventids2table.c I, [2024-05-08T02:58:22.026388 #3183965] INFO -- : make[1]: Entering directory '/tmp/ruby/src/trunk/ext/ripper' I, [2024-05-08T02:58:22.026410 #3183965] INFO -- : make[1]: Nothing to be done for 'src'. I, [2024-05-08T02:58:22.026415 #3183965] INFO -- : make[1]: Leaving directory '/tmp/ruby/src/trunk/ext/ripper' I, [2024-05-08T02:58:22.042927 #3183965] INFO -- : /tmp/ruby/src/trunk/revision.h updated I, [2024-05-08T02:58:22.044003 #3183965] INFO -- : generating x86_64-linux-fake.rb I, [2024-05-08T02:58:22.095047 #3183965] INFO -- : x86_64-linux-fake.rb updated I, [2024-05-08T02:58:22.096308 #3183965] INFO -- : generating enc.mk I, [2024-05-08T02:58:22.213776 #3183965] INFO -- : making srcs under enc I, [2024-05-08T02:58:22.243471 #3183965] INFO -- : make[1]: Entering directory '/tmp/ruby/build/trunk' I, [2024-05-08T02:58:22.243494 #3183965] INFO -- : make[1]: Nothing to be done for 'srcs'. I, [2024-05-08T02:58:22.243500 #3183965] INFO -- : make[1]: Leaving directory '/tmp/ruby/build/trunk' I, [2024-05-08T02:58:22.288431 #3183965] INFO -- : Update minitest to ea9caafc0754b1d6236a490d59e624b53209734a I, [2024-05-08T02:58:22.288627 #3183965] INFO -- : Update power_assert to 84e85124c5014a139af39161d484156cfe87a9ed I, [2024-05-08T02:58:22.289319 #3183965] INFO -- : Update rbs to ba7872795d5de04adb8ff500c0e6afdc81a041dd I, [2024-05-08T02:58:22.289522 #3183965] INFO -- : Update typeprof to b19a6416da3a05d57fadd6ffdadb382b6d236ca5 I, [2024-05-08T02:58:22.290681 #3183965] INFO -- : echo ea9caafc0754b1d6236a490d59e624b53209734a | /bin/sh /tmp/ruby/src/trunk/tool/ifchange /tmp/ruby/src/trunk/.bundle/.timestamp/minitest.revision - I, [2024-05-08T02:58:22.290899 #3183965] INFO -- : echo 84e85124c5014a139af39161d484156cfe87a9ed | /bin/sh /tmp/ruby/src/trunk/tool/ifchange /tmp/ruby/src/trunk/.bundle/.timestamp/power_assert.revision - I, [2024-05-08T02:58:22.292087 #3183965] INFO -- : echo ba7872795d5de04adb8ff500c0e6afdc81a041dd | /bin/sh /tmp/ruby/src/trunk/tool/ifchange /tmp/ruby/src/trunk/.bundle/.timestamp/rbs.revision - I, [2024-05-08T02:58:22.292320 #3183965] INFO -- : echo b19a6416da3a05d57fadd6ffdadb382b6d236ca5 | /bin/sh /tmp/ruby/src/trunk/tool/ifchange /tmp/ruby/src/trunk/.bundle/.timestamp/typeprof.revision - I, [2024-05-08T02:58:22.292436 #3183965] INFO -- : /tmp/ruby/src/trunk/.bundle/.timestamp/minitest.revision unchanged I, [2024-05-08T02:58:22.292918 #3183965] INFO -- : /tmp/ruby/src/trunk/.bundle/.timestamp/power_assert.revision unchanged I, [2024-05-08T02:58:22.293882 #3183965] INFO -- : /tmp/ruby/src/trunk/.bundle/.timestamp/rbs.revision unchanged I, [2024-05-08T02:58:22.294192 #3183965] INFO -- : /tmp/ruby/src/trunk/.bundle/.timestamp/typeprof.revision unchanged I, [2024-05-08T02:58:22.294217 #3183965] INFO -- : Building power_assert@84e85124c5014a139af39161d484156cfe87a9ed to /tmp/ruby/src/trunk/gems/power_assert-2.0.3.gem I, [2024-05-08T02:58:22.363595 #3183965] INFO -- : Successfully built RubyGem I, [2024-05-08T02:58:22.363661 #3183965] INFO -- : Name: power_assert I, [2024-05-08T02:58:22.363680 #3183965] INFO -- : Version: 2.0.4dev I, [2024-05-08T02:58:22.363696 #3183965] INFO -- : File: power_assert-2.0.4dev.gem I, [2024-05-08T02:58:22.365814 #3183965] INFO -- : Extracting bundle gem power_assert-2.0.3... I, [2024-05-08T02:58:22.427106 #3183965] INFO -- : Try with hash version of bundled gems instead of gems/power_assert-2.0.3.gem. We don't use this gem with release version of Ruby. I, [2024-05-08T02:58:22.432086 #3183965] INFO -- : Unpacked gems/power_assert-2.0.4dev.gem I, [2024-05-08T02:58:22.433978 #3183965] INFO -- : $$$[end] "make after-update -j20" exit with 0. I, [2024-05-08T02:58:22.434158 #3183965] INFO -- : $$$[beg] make miniruby -j20 I, [2024-05-08T02:58:22.490864 #3183965] INFO -- : BASERUBY = /usr/bin/ruby --disable=gems I, [2024-05-08T02:58:22.490904 #3183965] INFO -- : CC = gcc I, [2024-05-08T02:58:22.490916 #3183965] INFO -- : LD = ld I, [2024-05-08T02:58:22.490927 #3183965] INFO -- : LDSHARED = gcc -shared I, [2024-05-08T02:58:22.490938 #3183965] INFO -- : CFLAGS = -O3 -fno-fast-math -ggdb3 -Wall -Wextra -Wdeprecated-declarations -Wdiv-by-zero -Wduplicated-cond -Wimplicit-function-declaration -Wimplicit-int -Wpointer-arith -Wwrite-strings -Wold-style-definition -Wimplicit-fallthrough=0 -Wmissing-noreturn -Wno-cast-function-type -Wno-constant-logical-operand -Wno-long-long -Wno-missing-field-initializers -Wno-overlength-strings -Wno-packed-bitfield-compat -Wno-parentheses-equality -Wno-self-assign -Wno-tautological-compare -Wno-unused-parameter -Wno-unused-value -Wsuggest-attribute=format -Wsuggest-attribute=noreturn -Wunused-variable -Wmisleading-indentation -Wundef -fPIC I, [2024-05-08T02:58:22.490949 #3183965] INFO -- : XCFLAGS = -U_FORTIFY_SOURCE -D_FORTIFY_SOURCE=2 -fstack-protector-strong -fno-strict-overflow -fvisibility=hidden -fexcess-precision=standard -DRUBY_EXPORT -I. -I.ext/include/x86_64-linux -I/tmp/ruby/src/trunk/include -I/tmp/ruby/src/trunk -I/tmp/ruby/src/trunk/prism -I/tmp/ruby/src/trunk/enc/unicode/15.0.0 I, [2024-05-08T02:58:22.490960 #3183965] INFO -- : CPPFLAGS = I, [2024-05-08T02:58:22.490970 #3183965] INFO -- : DLDFLAGS = -Wl,--compress-debug-sections=zlib -Wl,-soname,libruby.so.3.4 -fstack-protector-strong I, [2024-05-08T02:58:22.490980 #3183965] INFO -- : SOLIBS = -lz -lrt -lrt -lgmp -ldl -lcrypt -lm -lpthread I, [2024-05-08T02:58:22.490990 #3183965] INFO -- : LANG = en_US.UTF-8 I, [2024-05-08T02:58:22.491000 #3183965] INFO -- : LC_ALL = I, [2024-05-08T02:58:22.491009 #3183965] INFO -- : LC_CTYPE = I, [2024-05-08T02:58:22.491019 #3183965] INFO -- : MFLAGS = -j20 --jobserver-auth=4,5 I, [2024-05-08T02:58:22.491029 #3183965] INFO -- : RUSTC = no I, [2024-05-08T02:58:22.491039 #3183965] INFO -- : YJIT_RUSTC_ARGS = --crate-name=yjit --crate-type=staticlib --edition=2021 -g -C lto=thin -C opt-level=3 -C overflow-checks=on '--out-dir=/tmp/ruby/build/trunk/yjit/target/release/' /tmp/ruby/src/trunk/yjit/src/lib.rs I, [2024-05-08T02:58:22.492310 #3183965] INFO -- : gcc (Ubuntu 11.4.0-1ubuntu1~22.04) 11.4.0 I, [2024-05-08T02:58:22.492351 #3183965] INFO -- : Copyright (C) 2021 Free Software Foundation, Inc. I, [2024-05-08T02:58:22.492364 #3183965] INFO -- : This is free software; see the source for copying conditions. There is NO I, [2024-05-08T02:58:22.492376 #3183965] INFO -- : warranty; not even for MERCHANTABILITY or FITNESS FOR A PARTICULAR PURPOSE. I, [2024-05-08T02:58:22.492386 #3183965] INFO -- : I, [2024-05-08T02:58:22.512619 #3183965] INFO -- : compiling /tmp/ruby/src/trunk/version.c I, [2024-05-08T02:58:22.615801 #3183965] INFO -- : linking miniruby I, [2024-05-08T02:58:23.174731 #3183965] INFO -- : $$$[end] "make miniruby -j20" exit with 0. I, [2024-05-08T02:58:23.174855 #3183965] INFO -- : $$$[beg] make ruby -j20 I, [2024-05-08T02:58:23.232318 #3183965] INFO -- : BASERUBY = /usr/bin/ruby --disable=gems I, [2024-05-08T02:58:23.232356 #3183965] INFO -- : CC = gcc I, [2024-05-08T02:58:23.232369 #3183965] INFO -- : LD = ld I, [2024-05-08T02:58:23.232380 #3183965] INFO -- : LDSHARED = gcc -shared I, [2024-05-08T02:58:23.232395 #3183965] INFO -- : CFLAGS = -O3 -fno-fast-math -ggdb3 -Wall -Wextra -Wdeprecated-declarations -Wdiv-by-zero -Wduplicated-cond -Wimplicit-function-declaration -Wimplicit-int -Wpointer-arith -Wwrite-strings -Wold-style-definition -Wimplicit-fallthrough=0 -Wmissing-noreturn -Wno-cast-function-type -Wno-constant-logical-operand -Wno-long-long -Wno-missing-field-initializers -Wno-overlength-strings -Wno-packed-bitfield-compat -Wno-parentheses-equality -Wno-self-assign -Wno-tautological-compare -Wno-unused-parameter -Wno-unused-value -Wsuggest-attribute=format -Wsuggest-attribute=noreturn -Wunused-variable -Wmisleading-indentation -Wundef -fPIC I, [2024-05-08T02:58:23.232416 #3183965] INFO -- : XCFLAGS = -U_FORTIFY_SOURCE -D_FORTIFY_SOURCE=2 -fstack-protector-strong -fno-strict-overflow -fvisibility=hidden -fexcess-precision=standard -DRUBY_EXPORT -I. -I.ext/include/x86_64-linux -I/tmp/ruby/src/trunk/include -I/tmp/ruby/src/trunk -I/tmp/ruby/src/trunk/prism -I/tmp/ruby/src/trunk/enc/unicode/15.0.0 I, [2024-05-08T02:58:23.232427 #3183965] INFO -- : CPPFLAGS = I, [2024-05-08T02:58:23.232437 #3183965] INFO -- : DLDFLAGS = -Wl,--compress-debug-sections=zlib -Wl,-soname,libruby.so.3.4 -fstack-protector-strong I, [2024-05-08T02:58:23.232448 #3183965] INFO -- : SOLIBS = -lz -lrt -lrt -lgmp -ldl -lcrypt -lm -lpthread I, [2024-05-08T02:58:23.232457 #3183965] INFO -- : LANG = en_US.UTF-8 I, [2024-05-08T02:58:23.232467 #3183965] INFO -- : LC_ALL = I, [2024-05-08T02:58:23.232477 #3183965] INFO -- : LC_CTYPE = I, [2024-05-08T02:58:23.232486 #3183965] INFO -- : MFLAGS = -j20 --jobserver-auth=4,5 I, [2024-05-08T02:58:23.232496 #3183965] INFO -- : RUSTC = no I, [2024-05-08T02:58:23.232507 #3183965] INFO -- : YJIT_RUSTC_ARGS = --crate-name=yjit --crate-type=staticlib --edition=2021 -g -C lto=thin -C opt-level=3 -C overflow-checks=on '--out-dir=/tmp/ruby/build/trunk/yjit/target/release/' /tmp/ruby/src/trunk/yjit/src/lib.rs I, [2024-05-08T02:58:23.233726 #3183965] INFO -- : gcc (Ubuntu 11.4.0-1ubuntu1~22.04) 11.4.0 I, [2024-05-08T02:58:23.233768 #3183965] INFO -- : Copyright (C) 2021 Free Software Foundation, Inc. I, [2024-05-08T02:58:23.233786 #3183965] INFO -- : This is free software; see the source for copying conditions. There is NO I, [2024-05-08T02:58:23.233798 #3183965] INFO -- : warranty; not even for MERCHANTABILITY or FITNESS FOR A PARTICULAR PURPOSE. I, [2024-05-08T02:58:23.233808 #3183965] INFO -- : I, [2024-05-08T02:58:23.343626 #3183965] INFO -- : builtin_binary.inc updated I, [2024-05-08T02:58:23.348050 #3183965] INFO -- : c5234a9416e4f20f175185e840b25b0f08674d14078ed7083f37e655458e3ca9 builtin_binary.inc I, [2024-05-08T02:58:23.348754 #3183965] INFO -- : compiling /tmp/ruby/src/trunk/builtin.c I, [2024-05-08T02:58:23.532384 #3183965] INFO -- : linking static-library libruby-static.a I, [2024-05-08T02:58:23.846532 #3183965] INFO -- : linking shared-library libruby.so.3.4.0 I, [2024-05-08T02:58:25.436146 #3183965] INFO -- : linking ruby I, [2024-05-08T02:58:25.459695 #3183965] INFO -- : $$$[end] "make ruby -j20" exit with 0. I, [2024-05-08T02:58:25.459839 #3183965] INFO -- : $$$[beg] make all -j20 I, [2024-05-08T02:58:25.517321 #3183965] INFO -- : BASERUBY = /usr/bin/ruby --disable=gems I, [2024-05-08T02:58:25.517362 #3183965] INFO -- : CC = gcc I, [2024-05-08T02:58:25.517375 #3183965] INFO -- : LD = ld I, [2024-05-08T02:58:25.517386 #3183965] INFO -- : LDSHARED = gcc -shared I, [2024-05-08T02:58:25.517400 #3183965] INFO -- : CFLAGS = -O3 -fno-fast-math -ggdb3 -Wall -Wextra -Wdeprecated-declarations -Wdiv-by-zero -Wduplicated-cond -Wimplicit-function-declaration -Wimplicit-int -Wpointer-arith -Wwrite-strings -Wold-style-definition -Wimplicit-fallthrough=0 -Wmissing-noreturn -Wno-cast-function-type -Wno-constant-logical-operand -Wno-long-long -Wno-missing-field-initializers -Wno-overlength-strings -Wno-packed-bitfield-compat -Wno-parentheses-equality -Wno-self-assign -Wno-tautological-compare -Wno-unused-parameter -Wno-unused-value -Wsuggest-attribute=format -Wsuggest-attribute=noreturn -Wunused-variable -Wmisleading-indentation -Wundef -fPIC I, [2024-05-08T02:58:25.517412 #3183965] INFO -- : XCFLAGS = -U_FORTIFY_SOURCE -D_FORTIFY_SOURCE=2 -fstack-protector-strong -fno-strict-overflow -fvisibility=hidden -fexcess-precision=standard -DRUBY_EXPORT -I. -I.ext/include/x86_64-linux -I/tmp/ruby/src/trunk/include -I/tmp/ruby/src/trunk -I/tmp/ruby/src/trunk/prism -I/tmp/ruby/src/trunk/enc/unicode/15.0.0 I, [2024-05-08T02:58:25.517423 #3183965] INFO -- : CPPFLAGS = I, [2024-05-08T02:58:25.517434 #3183965] INFO -- : DLDFLAGS = -Wl,--compress-debug-sections=zlib -Wl,-soname,libruby.so.3.4 -fstack-protector-strong I, [2024-05-08T02:58:25.517452 #3183965] INFO -- : SOLIBS = -lz -lrt -lrt -lgmp -ldl -lcrypt -lm -lpthread I, [2024-05-08T02:58:25.517463 #3183965] INFO -- : LANG = en_US.UTF-8 I, [2024-05-08T02:58:25.517473 #3183965] INFO -- : LC_ALL = I, [2024-05-08T02:58:25.517483 #3183965] INFO -- : LC_CTYPE = I, [2024-05-08T02:58:25.517494 #3183965] INFO -- : MFLAGS = -j20 --jobserver-auth=4,5 I, [2024-05-08T02:58:25.517504 #3183965] INFO -- : RUSTC = no I, [2024-05-08T02:58:25.517517 #3183965] INFO -- : YJIT_RUSTC_ARGS = --crate-name=yjit --crate-type=staticlib --edition=2021 -g -C lto=thin -C opt-level=3 -C overflow-checks=on '--out-dir=/tmp/ruby/build/trunk/yjit/target/release/' /tmp/ruby/src/trunk/yjit/src/lib.rs I, [2024-05-08T02:58:25.518757 #3183965] INFO -- : gcc (Ubuntu 11.4.0-1ubuntu1~22.04) 11.4.0 I, [2024-05-08T02:58:25.518799 #3183965] INFO -- : Copyright (C) 2021 Free Software Foundation, Inc. I, [2024-05-08T02:58:25.518812 #3183965] INFO -- : This is free software; see the source for copying conditions. There is NO I, [2024-05-08T02:58:25.518823 #3183965] INFO -- : warranty; not even for MERCHANTABILITY or FITNESS FOR A PARTICULAR PURPOSE. I, [2024-05-08T02:58:25.518834 #3183965] INFO -- : I, [2024-05-08T02:58:25.548514 #3183965] INFO -- : generating enc.mk I, [2024-05-08T02:58:25.550697 #3183965] INFO -- : building spec/ruby/optional/capi/ext/array_spec.so I, [2024-05-08T02:58:25.551004 #3183965] INFO -- : building spec/ruby/optional/capi/ext/basic_object_spec.so I, [2024-05-08T02:58:25.551581 #3183965] INFO -- : building spec/ruby/optional/capi/ext/bignum_spec.so I, [2024-05-08T02:58:25.551971 #3183965] INFO -- : building spec/ruby/optional/capi/ext/binding_spec.so I, [2024-05-08T02:58:25.552198 #3183965] INFO -- : building spec/ruby/optional/capi/ext/boolean_spec.so I, [2024-05-08T02:58:25.552959 #3183965] INFO -- : building spec/ruby/optional/capi/ext/class_id_under_autoload_spec.so I, [2024-05-08T02:58:25.554143 #3183965] INFO -- : building spec/ruby/optional/capi/ext/class_spec.so I, [2024-05-08T02:58:25.555043 #3183965] INFO -- : building spec/ruby/optional/capi/ext/class_under_autoload_spec.so I, [2024-05-08T02:58:25.555394 #3183965] INFO -- : building spec/ruby/optional/capi/ext/complex_spec.so I, [2024-05-08T02:58:25.556092 #3183965] INFO -- : building spec/ruby/optional/capi/ext/constants_spec.so I, [2024-05-08T02:58:25.556430 #3183965] INFO -- : building spec/ruby/optional/capi/ext/data_spec.so I, [2024-05-08T02:58:25.557357 #3183965] INFO -- : building spec/ruby/optional/capi/ext/debug_spec.so I, [2024-05-08T02:58:25.558276 #3183965] INFO -- : building spec/ruby/optional/capi/ext/encoding_spec.so I, [2024-05-08T02:58:25.558563 #3183965] INFO -- : building spec/ruby/optional/capi/ext/enumerator_spec.so I, [2024-05-08T02:58:25.559336 #3183965] INFO -- : building spec/ruby/optional/capi/ext/exception_spec.so I, [2024-05-08T02:58:25.559647 #3183965] INFO -- : building spec/ruby/optional/capi/ext/fiber_spec.so I, [2024-05-08T02:58:25.560313 #3183965] INFO -- : building spec/ruby/optional/capi/ext/file_spec.so I, [2024-05-08T02:58:25.576629 #3183965] INFO -- : building spec/ruby/optional/capi/ext/fixnum_spec.so I, [2024-05-08T02:58:25.577725 #3183965] INFO -- : building spec/ruby/optional/capi/ext/float_spec.so I, [2024-05-08T02:58:25.674736 #3183965] INFO -- : building spec/ruby/optional/capi/ext/gc_spec.so I, [2024-05-08T02:58:25.701214 #3183965] INFO -- : building spec/ruby/optional/capi/ext/globals_spec.so I, [2024-05-08T02:58:25.711096 #3183965] INFO -- : building spec/ruby/optional/capi/ext/hash_spec.so I, [2024-05-08T02:58:25.718328 #3183965] INFO -- : building spec/ruby/optional/capi/ext/integer_spec.so I, [2024-05-08T02:58:25.719352 #3183965] INFO -- : building spec/ruby/optional/capi/ext/io_spec.so I, [2024-05-08T02:58:25.720113 #3183965] INFO -- : building spec/ruby/optional/capi/ext/kernel_spec.so I, [2024-05-08T02:58:25.720447 #3183965] INFO -- : building spec/ruby/optional/capi/ext/language_spec.so I, [2024-05-08T02:58:25.724809 #3183965] INFO -- : building spec/ruby/optional/capi/ext/marshal_spec.so I, [2024-05-08T02:58:25.725137 #3183965] INFO -- : building spec/ruby/optional/capi/ext/module_spec.so I, [2024-05-08T02:58:25.728797 #3183965] INFO -- : building spec/ruby/optional/capi/ext/module_under_autoload_spec.so I, [2024-05-08T02:58:25.730950 #3183965] INFO -- : building spec/ruby/optional/capi/ext/mutex_spec.so I, [2024-05-08T02:58:25.739719 #3183965] INFO -- : building spec/ruby/optional/capi/ext/numeric_spec.so I, [2024-05-08T02:58:25.743813 #3183965] INFO -- : building spec/ruby/optional/capi/ext/object_spec.so I, [2024-05-08T02:58:25.746376 #3183965] INFO -- : building spec/ruby/optional/capi/ext/proc_spec.so I, [2024-05-08T02:58:25.774639 #3183965] INFO -- : building spec/ruby/optional/capi/ext/range_spec.so I, [2024-05-08T02:58:25.788709 #3183965] INFO -- : building spec/ruby/optional/capi/ext/rational_spec.so I, [2024-05-08T02:58:25.821959 #3183965] INFO -- : building spec/ruby/optional/capi/ext/rbasic_spec.so I, [2024-05-08T02:58:25.850037 #3183965] INFO -- : building spec/ruby/optional/capi/ext/regexp_spec.so I, [2024-05-08T02:58:25.850505 #3183965] INFO -- : building spec/ruby/optional/capi/ext/string_spec.so I, [2024-05-08T02:58:25.867060 #3183965] INFO -- : building spec/ruby/optional/capi/ext/struct_spec.so I, [2024-05-08T02:58:25.868846 #3183965] INFO -- : building spec/ruby/optional/capi/ext/st_spec.so I, [2024-05-08T02:58:25.898218 #3183965] INFO -- : building spec/ruby/optional/capi/ext/symbol_spec.so I, [2024-05-08T02:58:25.904076 #3183965] INFO -- : building spec/ruby/optional/capi/ext/thread_spec.so I, [2024-05-08T02:58:25.914492 #3183965] INFO -- : building spec/ruby/optional/capi/ext/time_spec.so I, [2024-05-08T02:58:25.933342 #3183965] INFO -- : building spec/ruby/optional/capi/ext/tracepoint_spec.so I, [2024-05-08T02:58:25.933543 #3183965] INFO -- : building spec/ruby/optional/capi/ext/typed_data_spec.so I, [2024-05-08T02:58:25.933875 #3183965] INFO -- : building spec/ruby/optional/capi/ext/util_spec.so I, [2024-05-08T02:58:25.944672 #3183965] INFO -- : making enc I, [2024-05-08T02:58:25.945738 #3183965] INFO -- : making srcs under enc I, [2024-05-08T02:58:25.971492 #3183965] INFO -- : make[1]: Entering directory '/tmp/ruby/build/trunk' I, [2024-05-08T02:58:25.971553 #3183965] INFO -- : make[1]: Nothing to be done for 'enc'. I, [2024-05-08T02:58:25.971567 #3183965] INFO -- : make[1]: Leaving directory '/tmp/ruby/build/trunk' I, [2024-05-08T02:58:25.985378 #3183965] INFO -- : make[1]: Entering directory '/tmp/ruby/build/trunk' I, [2024-05-08T02:58:25.986456 #3183965] INFO -- : make[1]: Nothing to be done for 'srcs'. I, [2024-05-08T02:58:25.986478 #3183965] INFO -- : make[1]: Leaving directory '/tmp/ruby/build/trunk' I, [2024-05-08T02:58:25.986489 #3183965] INFO -- : generating transdb.h I, [2024-05-08T02:58:26.098250 #3183965] INFO -- : transdb.h unchanged I, [2024-05-08T02:58:26.099579 #3183965] INFO -- : generating makefiles ext/configure-ext.mk I, [2024-05-08T02:58:26.099737 #3183965] INFO -- : making trans I, [2024-05-08T02:58:26.126080 #3183965] INFO -- : ext/configure-ext.mk updated I, [2024-05-08T02:58:26.128500 #3183965] INFO -- : make[1]: Entering directory '/tmp/ruby/build/trunk' I, [2024-05-08T02:58:26.133472 #3183965] INFO -- : make[1]: Entering directory '/tmp/ruby/build/trunk' I, [2024-05-08T02:58:26.133556 #3183965] INFO -- : make[1]: Nothing to be done for 'trans'. I, [2024-05-08T02:58:26.133564 #3183965] INFO -- : make[1]: Leaving directory '/tmp/ruby/build/trunk' I, [2024-05-08T02:58:26.134447 #3183965] INFO -- : making encs I, [2024-05-08T02:58:26.188977 #3183965] INFO -- : make[1]: Entering directory '/tmp/ruby/build/trunk' I, [2024-05-08T02:58:26.189046 #3183965] INFO -- : make[1]: Nothing to be done for 'encs'. I, [2024-05-08T02:58:26.189070 #3183965] INFO -- : make[1]: Leaving directory '/tmp/ruby/build/trunk' I, [2024-05-08T02:58:26.284435 #3183965] INFO -- : make[1]: Leaving directory '/tmp/ruby/build/trunk' I, [2024-05-08T02:58:26.285162 #3183965] INFO -- : generating makefile exts.mk I, [2024-05-08T02:58:26.322592 #3183965] INFO -- : exts.mk unchanged I, [2024-05-08T02:58:26.327164 #3183965] INFO -- : make[1]: Entering directory '/tmp/ruby/build/trunk' I, [2024-05-08T02:58:26.346415 #3183965] INFO -- : make[2]: Entering directory '/tmp/ruby/build/trunk/ext/digest' I, [2024-05-08T02:58:26.347663 #3183965] INFO -- : make[2]: Entering directory '/tmp/ruby/build/trunk/ext/coverage' I, [2024-05-08T02:58:26.348301 #3183965] INFO -- : make[2]: Entering directory '/tmp/ruby/build/trunk/ext/json' I, [2024-05-08T02:58:26.348707 #3183965] INFO -- : make[2]: Entering directory '/tmp/ruby/build/trunk/ext/io/console' I, [2024-05-08T02:58:26.348900 #3183965] INFO -- : make[2]: Entering directory '/tmp/ruby/build/trunk/ext/date' I, [2024-05-08T02:58:26.350771 #3183965] INFO -- : make[2]: Leaving directory '/tmp/ruby/build/trunk/ext/coverage' I, [2024-05-08T02:58:26.350794 #3183965] INFO -- : make[2]: Leaving directory '/tmp/ruby/build/trunk/ext/io/console' I, [2024-05-08T02:58:26.351106 #3183965] INFO -- : make[2]: Entering directory '/tmp/ruby/build/trunk/ext/fiddle' I, [2024-05-08T02:58:26.351138 #3183965] INFO -- : make[2]: Entering directory '/tmp/ruby/build/trunk/ext/monitor' I, [2024-05-08T02:58:26.351318 #3183965] INFO -- : make[2]: Leaving directory '/tmp/ruby/build/trunk/ext/digest' I, [2024-05-08T02:58:26.352180 #3183965] INFO -- : make[2]: Leaving directory '/tmp/ruby/build/trunk/ext/date' I, [2024-05-08T02:58:26.352292 #3183965] INFO -- : make[2]: Leaving directory '/tmp/ruby/build/trunk/ext/json' I, [2024-05-08T02:58:26.352582 #3183965] INFO -- : make[2]: Entering directory '/tmp/ruby/build/trunk/ext/pathname' I, [2024-05-08T02:58:26.353378 #3183965] INFO -- : make[2]: Entering directory '/tmp/ruby/build/trunk/ext/pty' I, [2024-05-08T02:58:26.353715 #3183965] INFO -- : make[2]: Entering directory '/tmp/ruby/build/trunk/ext/psych' I, [2024-05-08T02:58:26.353840 #3183965] INFO -- : make[2]: Leaving directory '/tmp/ruby/build/trunk/ext/monitor' I, [2024-05-08T02:58:26.354381 #3183965] INFO -- : make[2]: Entering directory '/tmp/ruby/build/trunk/ext/rubyvm' I, [2024-05-08T02:58:26.354412 #3183965] INFO -- : make[2]: Entering directory '/tmp/ruby/build/trunk/ext/objspace' I, [2024-05-08T02:58:26.355364 #3183965] INFO -- : make[2]: Leaving directory '/tmp/ruby/build/trunk/ext/pathname' I, [2024-05-08T02:58:26.355461 #3183965] INFO -- : make[2]: Entering directory '/tmp/ruby/build/trunk/.bundle/gems/bigdecimal-3.1.8/ext/bigdecimal' I, [2024-05-08T02:58:26.355567 #3183965] INFO -- : make[2]: Entering directory '/tmp/ruby/build/trunk/.bundle/gems/bigdecimal-3.1.7/ext/bigdecimal' I, [2024-05-08T02:58:26.355592 #3183965] INFO -- : make[2]: Entering directory '/tmp/ruby/build/trunk/.bundle/gems/debug-1.9.2/ext/debug' I, [2024-05-08T02:58:26.356143 #3183965] INFO -- : make[2]: Leaving directory '/tmp/ruby/build/trunk/ext/pty' I, [2024-05-08T02:58:26.356719 #3183965] INFO -- : make[2]: Entering directory '/tmp/ruby/build/trunk/.bundle/gems/racc-1.7.3/ext/racc/cparse' I, [2024-05-08T02:58:26.356747 #3183965] INFO -- : make[2]: Entering directory '/tmp/ruby/build/trunk/.bundle/gems/nkf-0.2.0/ext/nkf' I, [2024-05-08T02:58:26.357029 #3183965] INFO -- : make[2]: Leaving directory '/tmp/ruby/build/trunk/ext/rubyvm' I, [2024-05-08T02:58:26.357190 #3183965] INFO -- : make[2]: Leaving directory '/tmp/ruby/build/trunk/ext/fiddle' I, [2024-05-08T02:58:26.359434 #3183965] INFO -- : make[2]: Entering directory '/tmp/ruby/build/trunk/.bundle/gems/rbs-3.4.4/ext/rbs_extension' I, [2024-05-08T02:58:26.359605 #3183965] INFO -- : make[2]: Leaving directory '/tmp/ruby/build/trunk/ext/objspace' I, [2024-05-08T02:58:26.359767 #3183965] INFO -- : make[2]: Entering directory '/tmp/ruby/build/trunk/.bundle/gems/syslog-0.1.2/ext/syslog' I, [2024-05-08T02:58:26.360343 #3183965] INFO -- : make[2]: Entering directory '/tmp/ruby/build/trunk/ext/ripper' I, [2024-05-08T02:58:26.362516 #3183965] INFO -- : make[2]: Entering directory '/tmp/ruby/build/trunk/ext/digest/sha2' I, [2024-05-08T02:58:26.364384 #3183965] INFO -- : make[2]: Entering directory '/tmp/ruby/build/trunk/ext/socket' I, [2024-05-08T02:58:26.365010 #3183965] INFO -- : make[2]: Entering directory '/tmp/ruby/build/trunk/ext/openssl' I, [2024-05-08T02:58:26.365408 #3183965] INFO -- : make[2]: Leaving directory '/tmp/ruby/build/trunk/ext/ripper' I, [2024-05-08T02:58:26.365906 #3183965] INFO -- : make[2]: Leaving directory '/tmp/ruby/build/trunk/ext/digest/sha2' I, [2024-05-08T02:58:26.366719 #3183965] INFO -- : make[2]: Leaving directory '/tmp/ruby/build/trunk/ext/psych' I, [2024-05-08T02:58:26.371509 #3183965] INFO -- : make[2]: Leaving directory '/tmp/ruby/build/trunk/ext/socket' I, [2024-05-08T02:58:26.376376 #3183965] INFO -- : make[2]: Leaving directory '/tmp/ruby/build/trunk/ext/openssl' I, [2024-05-08T02:58:26.380063 #3183965] INFO -- : make[2]: Leaving directory '/tmp/ruby/build/trunk/.bundle/gems/nkf-0.2.0/ext/nkf' I, [2024-05-08T02:58:26.380314 #3183965] INFO -- : make[2]: Leaving directory '/tmp/ruby/build/trunk/.bundle/gems/debug-1.9.2/ext/debug' I, [2024-05-08T02:58:26.381503 #3183965] INFO -- : make[2]: Leaving directory '/tmp/ruby/build/trunk/.bundle/gems/bigdecimal-3.1.8/ext/bigdecimal' I, [2024-05-08T02:58:26.387723 #3183965] INFO -- : make[2]: Leaving directory '/tmp/ruby/build/trunk/.bundle/gems/bigdecimal-3.1.7/ext/bigdecimal' I, [2024-05-08T02:58:26.390323 #3183965] INFO -- : make[2]: Leaving directory '/tmp/ruby/build/trunk/.bundle/gems/racc-1.7.3/ext/racc/cparse' I, [2024-05-08T02:58:26.391992 #3183965] INFO -- : make[2]: Leaving directory '/tmp/ruby/build/trunk/.bundle/gems/syslog-0.1.2/ext/syslog' I, [2024-05-08T02:58:26.394266 #3183965] INFO -- : make[2]: Leaving directory '/tmp/ruby/build/trunk/.bundle/gems/rbs-3.4.4/ext/rbs_extension' I, [2024-05-08T02:58:26.418577 #3183965] INFO -- : make[2]: Entering directory '/tmp/ruby/build/trunk' I, [2024-05-08T02:58:26.485077 #3183965] INFO -- : linking ruby I, [2024-05-08T02:58:26.508330 #3183965] INFO -- : make[2]: Leaving directory '/tmp/ruby/build/trunk' I, [2024-05-08T02:58:26.508950 #3183965] INFO -- : make[1]: Leaving directory '/tmp/ruby/build/trunk' I, [2024-05-08T02:58:26.512884 #3183965] INFO -- : make[1]: Entering directory '/tmp/ruby/build/trunk' I, [2024-05-08T02:58:26.512909 #3183965] INFO -- : make[1]: Nothing to be done for 'note'. I, [2024-05-08T02:58:26.512919 #3183965] INFO -- : make[1]: Leaving directory '/tmp/ruby/build/trunk' I, [2024-05-08T02:58:26.513527 #3183965] INFO -- : $$$[end] "make all -j20" exit with 0. I, [2024-05-08T02:58:26.513653 #3183965] INFO -- : $$$[beg] make install -j20 I, [2024-05-08T02:58:26.576678 #3183965] INFO -- : Update minitest to ea9caafc0754b1d6236a490d59e624b53209734a I, [2024-05-08T02:58:26.576720 #3183965] INFO -- : Update power_assert to 84e85124c5014a139af39161d484156cfe87a9ed I, [2024-05-08T02:58:26.576892 #3183965] INFO -- : Update rbs to ba7872795d5de04adb8ff500c0e6afdc81a041dd I, [2024-05-08T02:58:26.577552 #3183965] INFO -- : Update typeprof to b19a6416da3a05d57fadd6ffdadb382b6d236ca5 I, [2024-05-08T02:58:26.578774 #3183965] INFO -- : echo ea9caafc0754b1d6236a490d59e624b53209734a | /bin/sh /tmp/ruby/src/trunk/tool/ifchange /tmp/ruby/src/trunk/.bundle/.timestamp/minitest.revision - I, [2024-05-08T02:58:26.578975 #3183965] INFO -- : echo 84e85124c5014a139af39161d484156cfe87a9ed | /bin/sh /tmp/ruby/src/trunk/tool/ifchange /tmp/ruby/src/trunk/.bundle/.timestamp/power_assert.revision - I, [2024-05-08T02:58:26.579251 #3183965] INFO -- : echo ba7872795d5de04adb8ff500c0e6afdc81a041dd | /bin/sh /tmp/ruby/src/trunk/tool/ifchange /tmp/ruby/src/trunk/.bundle/.timestamp/rbs.revision - I, [2024-05-08T02:58:26.579811 #3183965] INFO -- : BASERUBY = /usr/bin/ruby --disable=gems I, [2024-05-08T02:58:26.579830 #3183965] INFO -- : CC = gcc I, [2024-05-08T02:58:26.579835 #3183965] INFO -- : LD = ld I, [2024-05-08T02:58:26.579839 #3183965] INFO -- : LDSHARED = gcc -shared I, [2024-05-08T02:58:26.579843 #3183965] INFO -- : CFLAGS = -O3 -fno-fast-math -ggdb3 -Wall -Wextra -Wdeprecated-declarations -Wdiv-by-zero -Wduplicated-cond -Wimplicit-function-declaration -Wimplicit-int -Wpointer-arith -Wwrite-strings -Wold-style-definition -Wimplicit-fallthrough=0 -Wmissing-noreturn -Wno-cast-function-type -Wno-constant-logical-operand -Wno-long-long -Wno-missing-field-initializers -Wno-overlength-strings -Wno-packed-bitfield-compat -Wno-parentheses-equality -Wno-self-assign -Wno-tautological-compare -Wno-unused-parameter -Wno-unused-value -Wsuggest-attribute=format -Wsuggest-attribute=noreturn -Wunused-variable -Wmisleading-indentation -Wundef -fPIC I, [2024-05-08T02:58:26.579854 #3183965] INFO -- : XCFLAGS = -U_FORTIFY_SOURCE -D_FORTIFY_SOURCE=2 -fstack-protector-strong -fno-strict-overflow -fvisibility=hidden -fexcess-precision=standard -DRUBY_EXPORT -I. -I.ext/include/x86_64-linux -I/tmp/ruby/src/trunk/include -I/tmp/ruby/src/trunk -I/tmp/ruby/src/trunk/prism -I/tmp/ruby/src/trunk/enc/unicode/15.0.0 I, [2024-05-08T02:58:26.579858 #3183965] INFO -- : CPPFLAGS = I, [2024-05-08T02:58:26.579862 #3183965] INFO -- : DLDFLAGS = -Wl,--compress-debug-sections=zlib -Wl,-soname,libruby.so.3.4 -fstack-protector-strong I, [2024-05-08T02:58:26.579866 #3183965] INFO -- : SOLIBS = -lz -lrt -lrt -lgmp -ldl -lcrypt -lm -lpthread I, [2024-05-08T02:58:26.579869 #3183965] INFO -- : LANG = en_US.UTF-8 I, [2024-05-08T02:58:26.579873 #3183965] INFO -- : LC_ALL = I, [2024-05-08T02:58:26.579876 #3183965] INFO -- : LC_CTYPE = I, [2024-05-08T02:58:26.579879 #3183965] INFO -- : MFLAGS = -j20 --jobserver-auth=4,5 I, [2024-05-08T02:58:26.579883 #3183965] INFO -- : RUSTC = no I, [2024-05-08T02:58:26.579887 #3183965] INFO -- : YJIT_RUSTC_ARGS = --crate-name=yjit --crate-type=staticlib --edition=2021 -g -C lto=thin -C opt-level=3 -C overflow-checks=on '--out-dir=/tmp/ruby/build/trunk/yjit/target/release/' /tmp/ruby/src/trunk/yjit/src/lib.rs I, [2024-05-08T02:58:26.580741 #3183965] INFO -- : /tmp/ruby/src/trunk/.bundle/.timestamp/minitest.revision unchanged I, [2024-05-08T02:58:26.580762 #3183965] INFO -- : /tmp/ruby/src/trunk/.bundle/.timestamp/power_assert.revision unchanged I, [2024-05-08T02:58:26.580876 #3183965] INFO -- : /tmp/ruby/src/trunk/.bundle/.timestamp/rbs.revision unchanged I, [2024-05-08T02:58:26.607522 #3183965] INFO -- : echo b19a6416da3a05d57fadd6ffdadb382b6d236ca5 | /bin/sh /tmp/ruby/src/trunk/tool/ifchange /tmp/ruby/src/trunk/.bundle/.timestamp/typeprof.revision - I, [2024-05-08T02:58:26.608126 #3183965] INFO -- : generating enc.mk I, [2024-05-08T02:58:26.608249 #3183965] INFO -- : gcc (Ubuntu 11.4.0-1ubuntu1~22.04) 11.4.0 I, [2024-05-08T02:58:26.608271 #3183965] INFO -- : Copyright (C) 2021 Free Software Foundation, Inc. I, [2024-05-08T02:58:26.608277 #3183965] INFO -- : This is free software; see the source for copying conditions. There is NO I, [2024-05-08T02:58:26.608282 #3183965] INFO -- : warranty; not even for MERCHANTABILITY or FITNESS FOR A PARTICULAR PURPOSE. I, [2024-05-08T02:58:26.608286 #3183965] INFO -- : I, [2024-05-08T02:58:26.609426 #3183965] INFO -- : /tmp/ruby/src/trunk/.bundle/.timestamp/typeprof.revision unchanged I, [2024-05-08T02:58:26.730214 #3183965] INFO -- : Building power_assert@84e85124c5014a139af39161d484156cfe87a9ed to /tmp/ruby/src/trunk/gems/power_assert-2.0.3.gem I, [2024-05-08T02:58:26.730938 #3183965] INFO -- : making srcs under enc I, [2024-05-08T02:58:26.731181 #3183965] INFO -- : making enc I, [2024-05-08T02:58:26.747990 #3183965] INFO -- : make[1]: Entering directory '/tmp/ruby/build/trunk' I, [2024-05-08T02:58:26.748053 #3183965] INFO -- : make[1]: Nothing to be done for 'enc'. I, [2024-05-08T02:58:26.748067 #3183965] INFO -- : make[1]: Leaving directory '/tmp/ruby/build/trunk' I, [2024-05-08T02:58:26.760361 #3183965] INFO -- : make[1]: Entering directory '/tmp/ruby/build/trunk' I, [2024-05-08T02:58:26.760423 #3183965] INFO -- : make[1]: Nothing to be done for 'srcs'. I, [2024-05-08T02:58:26.760437 #3183965] INFO -- : make[1]: Leaving directory '/tmp/ruby/build/trunk' I, [2024-05-08T02:58:26.761097 #3183965] INFO -- : generating transdb.h I, [2024-05-08T02:58:26.798725 #3183965] INFO -- : Successfully built RubyGem I, [2024-05-08T02:58:26.798785 #3183965] INFO -- : Name: power_assert I, [2024-05-08T02:58:26.798798 #3183965] INFO -- : Version: 2.0.4dev I, [2024-05-08T02:58:26.798816 #3183965] INFO -- : File: power_assert-2.0.4dev.gem I, [2024-05-08T02:58:26.800931 #3183965] INFO -- : Extracting bundle gem power_assert-2.0.3... I, [2024-05-08T02:58:26.855557 #3183965] INFO -- : transdb.h unchanged I, [2024-05-08T02:58:26.857109 #3183965] INFO -- : generating makefiles ext/configure-ext.mk I, [2024-05-08T02:58:26.857490 #3183965] INFO -- : making trans I, [2024-05-08T02:58:26.862439 #3183965] INFO -- : Try with hash version of bundled gems instead of gems/power_assert-2.0.3.gem. We don't use this gem with release version of Ruby. I, [2024-05-08T02:58:26.867416 #3183965] INFO -- : Unpacked gems/power_assert-2.0.4dev.gem I, [2024-05-08T02:58:26.884753 #3183965] INFO -- : ext/configure-ext.mk unchanged I, [2024-05-08T02:58:26.887259 #3183965] INFO -- : make[1]: Entering directory '/tmp/ruby/build/trunk' I, [2024-05-08T02:58:26.892634 #3183965] INFO -- : make[1]: Entering directory '/tmp/ruby/build/trunk' I, [2024-05-08T02:58:26.892727 #3183965] INFO -- : make[1]: Nothing to be done for 'trans'. I, [2024-05-08T02:58:26.892738 #3183965] INFO -- : make[1]: Leaving directory '/tmp/ruby/build/trunk' I, [2024-05-08T02:58:26.893610 #3183965] INFO -- : making encs I, [2024-05-08T02:58:26.951505 #3183965] INFO -- : make[1]: Entering directory '/tmp/ruby/build/trunk' I, [2024-05-08T02:58:26.951583 #3183965] INFO -- : make[1]: Nothing to be done for 'encs'. I, [2024-05-08T02:58:26.951612 #3183965] INFO -- : make[1]: Leaving directory '/tmp/ruby/build/trunk' I, [2024-05-08T02:58:27.040738 #3183965] INFO -- : make[1]: Leaving directory '/tmp/ruby/build/trunk' I, [2024-05-08T02:58:27.041358 #3183965] INFO -- : generating makefile exts.mk I, [2024-05-08T02:58:27.078513 #3183965] INFO -- : exts.mk unchanged I, [2024-05-08T02:58:27.083504 #3183965] INFO -- : make[1]: Entering directory '/tmp/ruby/build/trunk' I, [2024-05-08T02:58:27.102736 #3183965] INFO -- : make[2]: Entering directory '/tmp/ruby/build/trunk/ext/digest' I, [2024-05-08T02:58:27.103799 #3183965] INFO -- : make[2]: Entering directory '/tmp/ruby/build/trunk/ext/coverage' I, [2024-05-08T02:58:27.103947 #3183965] INFO -- : make[2]: Entering directory '/tmp/ruby/build/trunk/ext/json' I, [2024-05-08T02:58:27.104381 #3183965] INFO -- : make[2]: Entering directory '/tmp/ruby/build/trunk/ext/date' I, [2024-05-08T02:58:27.105016 #3183965] INFO -- : make[2]: Entering directory '/tmp/ruby/build/trunk/ext/io/console' I, [2024-05-08T02:58:27.105847 #3183965] INFO -- : make[2]: Entering directory '/tmp/ruby/build/trunk/ext/monitor' I, [2024-05-08T02:58:27.106530 #3183965] INFO -- : make[2]: Entering directory '/tmp/ruby/build/trunk/ext/rubyvm' I, [2024-05-08T02:58:27.106664 #3183965] INFO -- : make[2]: Entering directory '/tmp/ruby/build/trunk/ext/pathname' I, [2024-05-08T02:58:27.107175 #3183965] INFO -- : make[2]: Entering directory '/tmp/ruby/build/trunk/ext/fiddle' I, [2024-05-08T02:58:27.107613 #3183965] INFO -- : make[2]: Leaving directory '/tmp/ruby/build/trunk/ext/coverage' I, [2024-05-08T02:58:27.108025 #3183965] INFO -- : make[2]: Entering directory '/tmp/ruby/build/trunk/ext/pty' I, [2024-05-08T02:58:27.108090 #3183965] INFO -- : make[2]: Entering directory '/tmp/ruby/build/trunk/ext/objspace' I, [2024-05-08T02:58:27.108113 #3183965] INFO -- : make[2]: Leaving directory '/tmp/ruby/build/trunk/ext/io/console' I, [2024-05-08T02:58:27.108630 #3183965] INFO -- : make[2]: Leaving directory '/tmp/ruby/build/trunk/ext/date' I, [2024-05-08T02:58:27.108714 #3183965] INFO -- : make[2]: Entering directory '/tmp/ruby/build/trunk/ext/psych' I, [2024-05-08T02:58:27.109066 #3183965] INFO -- : make[2]: Leaving directory '/tmp/ruby/build/trunk/ext/digest' I, [2024-05-08T02:58:27.109100 #3183965] INFO -- : make[2]: Leaving directory '/tmp/ruby/build/trunk/ext/monitor' I, [2024-05-08T02:58:27.109127 #3183965] INFO -- : make[2]: Leaving directory '/tmp/ruby/build/trunk/ext/rubyvm' I, [2024-05-08T02:58:27.109938 #3183965] INFO -- : make[2]: Leaving directory '/tmp/ruby/build/trunk/ext/pathname' I, [2024-05-08T02:58:27.110080 #3183965] INFO -- : make[2]: Leaving directory '/tmp/ruby/build/trunk/ext/json' I, [2024-05-08T02:58:27.110732 #3183965] INFO -- : make[2]: Leaving directory '/tmp/ruby/build/trunk/ext/pty' I, [2024-05-08T02:58:27.110956 #3183965] INFO -- : make[2]: Entering directory '/tmp/ruby/build/trunk/.bundle/gems/bigdecimal-3.1.7/ext/bigdecimal' I, [2024-05-08T02:58:27.111236 #3183965] INFO -- : make[2]: Entering directory '/tmp/ruby/build/trunk/ext/ripper' I, [2024-05-08T02:58:27.111361 #3183965] INFO -- : make[2]: Entering directory '/tmp/ruby/build/trunk/.bundle/gems/bigdecimal-3.1.8/ext/bigdecimal' I, [2024-05-08T02:58:27.111548 #3183965] INFO -- : make[2]: Entering directory '/tmp/ruby/build/trunk/.bundle/gems/nkf-0.2.0/ext/nkf' I, [2024-05-08T02:58:27.111595 #3183965] INFO -- : make[2]: Entering directory '/tmp/ruby/build/trunk/.bundle/gems/debug-1.9.2/ext/debug' I, [2024-05-08T02:58:27.112247 #3183965] INFO -- : make[2]: Leaving directory '/tmp/ruby/build/trunk/ext/objspace' I, [2024-05-08T02:58:27.112973 #3183965] INFO -- : make[2]: Entering directory '/tmp/ruby/build/trunk/.bundle/gems/racc-1.7.3/ext/racc/cparse' I, [2024-05-08T02:58:27.113425 #3183965] INFO -- : make[2]: Entering directory '/tmp/ruby/build/trunk/.bundle/gems/syslog-0.1.2/ext/syslog' I, [2024-05-08T02:58:27.113830 #3183965] INFO -- : make[2]: Entering directory '/tmp/ruby/build/trunk/.bundle/gems/rbs-3.4.4/ext/rbs_extension' I, [2024-05-08T02:58:27.114123 #3183965] INFO -- : make[2]: Leaving directory '/tmp/ruby/build/trunk/ext/fiddle' I, [2024-05-08T02:58:27.116501 #3183965] INFO -- : make[2]: Leaving directory '/tmp/ruby/build/trunk/ext/ripper' I, [2024-05-08T02:58:27.116865 #3183965] INFO -- : make[2]: Entering directory '/tmp/ruby/build/trunk/ext/socket' I, [2024-05-08T02:58:27.117922 #3183965] INFO -- : make[2]: Entering directory '/tmp/ruby/build/trunk/ext/digest/sha2' I, [2024-05-08T02:58:27.120142 #3183965] INFO -- : make[2]: Leaving directory '/tmp/ruby/build/trunk/ext/digest/sha2' I, [2024-05-08T02:58:27.120410 #3183965] INFO -- : make[2]: Entering directory '/tmp/ruby/build/trunk/ext/openssl' I, [2024-05-08T02:58:27.121454 #3183965] INFO -- : make[2]: Leaving directory '/tmp/ruby/build/trunk/ext/psych' I, [2024-05-08T02:58:27.123847 #3183965] INFO -- : make[2]: Leaving directory '/tmp/ruby/build/trunk/ext/socket' I, [2024-05-08T02:58:27.131868 #3183965] INFO -- : make[2]: Leaving directory '/tmp/ruby/build/trunk/ext/openssl' I, [2024-05-08T02:58:27.135720 #3183965] INFO -- : make[2]: Leaving directory '/tmp/ruby/build/trunk/.bundle/gems/bigdecimal-3.1.7/ext/bigdecimal' I, [2024-05-08T02:58:27.136818 #3183965] INFO -- : make[2]: Leaving directory '/tmp/ruby/build/trunk/.bundle/gems/debug-1.9.2/ext/debug' I, [2024-05-08T02:58:27.137677 #3183965] INFO -- : make[2]: Leaving directory '/tmp/ruby/build/trunk/.bundle/gems/syslog-0.1.2/ext/syslog' I, [2024-05-08T02:58:27.138183 #3183965] INFO -- : make[2]: Leaving directory '/tmp/ruby/build/trunk/.bundle/gems/racc-1.7.3/ext/racc/cparse' I, [2024-05-08T02:58:27.142292 #3183965] INFO -- : make[2]: Leaving directory '/tmp/ruby/build/trunk/.bundle/gems/nkf-0.2.0/ext/nkf' I, [2024-05-08T02:58:27.143179 #3183965] INFO -- : make[2]: Leaving directory '/tmp/ruby/build/trunk/.bundle/gems/bigdecimal-3.1.8/ext/bigdecimal' I, [2024-05-08T02:58:27.147235 #3183965] INFO -- : make[2]: Leaving directory '/tmp/ruby/build/trunk/.bundle/gems/rbs-3.4.4/ext/rbs_extension' I, [2024-05-08T02:58:27.170771 #3183965] INFO -- : make[2]: Entering directory '/tmp/ruby/build/trunk' I, [2024-05-08T02:58:27.236059 #3183965] INFO -- : make[2]: 'ruby' is up to date. I, [2024-05-08T02:58:27.236128 #3183965] INFO -- : make[2]: Leaving directory '/tmp/ruby/build/trunk' I, [2024-05-08T02:58:27.236487 #3183965] INFO -- : make[1]: Leaving directory '/tmp/ruby/build/trunk' I, [2024-05-08T02:58:27.240097 #3183965] INFO -- : make[1]: Entering directory '/tmp/ruby/build/trunk' I, [2024-05-08T02:58:27.240160 #3183965] INFO -- : make[1]: Nothing to be done for 'note'. I, [2024-05-08T02:58:27.240174 #3183965] INFO -- : make[1]: Leaving directory '/tmp/ruby/build/trunk' I, [2024-05-08T02:58:27.240419 #3183965] INFO -- : ./miniruby -I/tmp/ruby/src/trunk/lib -I. -I.ext/common /tmp/ruby/src/trunk/tool/runruby.rb --extout=.ext -- --disable-gems -r./x86_64-linux-fake /tmp/ruby/src/trunk/tool/rbinstall.rb --make="make" --dest-dir="" --extout=".ext" --ext-build-dir="./ext" --mflags="-j20 --jobserver-auth=4,5" --make-flags=" -j20 --jobserver-auth=4,5" --data-mode=0644 --prog-mode=0755 --installed-list .installed.list --mantype="doc" --gnumake --install=all --exclude=doc I, [2024-05-08T02:58:27.335367 #3183965] INFO -- : Installing to I, [2024-05-08T02:58:27.335448 #3183965] INFO -- : installing binary commands: /tmp/ruby/install/trunk/bin I, [2024-05-08T02:58:27.335462 #3183965] INFO -- : installing base libraries: /tmp/ruby/install/trunk/lib I, [2024-05-08T02:58:27.342992 #3183965] INFO -- : installing arch files: /tmp/ruby/install/trunk/lib/ruby/3.4.0+0/x86_64-linux I, [2024-05-08T02:58:27.343053 #3183965] INFO -- : installing pkgconfig data: /tmp/ruby/install/trunk/lib/pkgconfig I, [2024-05-08T02:58:27.343074 #3183965] INFO -- : installing extension objects: /tmp/ruby/install/trunk/lib/ruby/3.4.0+0/x86_64-linux I, [2024-05-08T02:58:27.352779 #3183965] INFO -- : installing extension objects: /tmp/ruby/install/trunk/lib/ruby/site_ruby/3.4.0+0/x86_64-linux I, [2024-05-08T02:58:27.352842 #3183965] INFO -- : installing extension objects: /tmp/ruby/install/trunk/lib/ruby/vendor_ruby/3.4.0+0/x86_64-linux I, [2024-05-08T02:58:27.352856 #3183965] INFO -- : installing extension headers: /tmp/ruby/install/trunk/include/ruby-3.4.0+0/x86_64-linux I, [2024-05-08T02:58:27.352890 #3183965] INFO -- : installing extension scripts: /tmp/ruby/install/trunk/lib/ruby/3.4.0+0 I, [2024-05-08T02:58:27.356723 #3183965] INFO -- : installing extension scripts: /tmp/ruby/install/trunk/lib/ruby/site_ruby/3.4.0+0 I, [2024-05-08T02:58:27.356783 #3183965] INFO -- : installing extension scripts: /tmp/ruby/install/trunk/lib/ruby/vendor_ruby/3.4.0+0 I, [2024-05-08T02:58:27.356803 #3183965] INFO -- : installing extension headers: /tmp/ruby/install/trunk/include/ruby-3.4.0+0/ruby I, [2024-05-08T02:58:27.356815 #3183965] INFO -- : installing command scripts: /tmp/ruby/install/trunk/bin I, [2024-05-08T02:58:27.356827 #3183965] INFO -- : installing library scripts: /tmp/ruby/install/trunk/lib/ruby/3.4.0+0 I, [2024-05-08T02:58:27.390981 #3183965] INFO -- : installing common headers: /tmp/ruby/install/trunk/include/ruby-3.4.0+0 I, [2024-05-08T02:58:27.396409 #3183965] INFO -- : installing manpages: /tmp/ruby/install/trunk/share/man/man1 I, [2024-05-08T02:58:27.396477 #3183965] INFO -- : installing default gems from lib: /tmp/ruby/install/trunk/lib/ruby/gems/3.4.0+0 I, [2024-05-08T02:58:27.419271 #3183965] INFO -- : benchmark 0.3.0 I, [2024-05-08T02:58:27.426262 #3183965] INFO -- : bundler 2.6.0.dev I, [2024-05-08T02:58:27.428396 #3183965] INFO -- : cgi 0.4.1 I, [2024-05-08T02:58:27.428936 #3183965] INFO -- : delegate 0.3.1 I, [2024-05-08T02:58:27.429382 #3183965] INFO -- : did_you_mean 1.6.3 I, [2024-05-08T02:58:27.429853 #3183965] INFO -- : english 0.8.0 I, [2024-05-08T02:58:27.430371 #3183965] INFO -- : erb 4.0.4 I, [2024-05-08T02:58:27.431069 #3183965] INFO -- : error_highlight 0.6.0 I, [2024-05-08T02:58:27.431518 #3183965] INFO -- : fileutils 1.7.2 I, [2024-05-08T02:58:27.431923 #3183965] INFO -- : find 0.2.0 I, [2024-05-08T02:58:27.432326 #3183965] INFO -- : forwardable 1.3.3 I, [2024-05-08T02:58:27.432791 #3183965] INFO -- : ipaddr 1.2.6 I, [2024-05-08T02:58:27.433304 #3183965] INFO -- : irb 1.13.1 I, [2024-05-08T02:58:27.434799 #3183965] INFO -- : logger 1.6.0 I, [2024-05-08T02:58:27.435193 #3183965] INFO -- : net-http 0.4.1 I, [2024-05-08T02:58:27.435758 #3183965] INFO -- : net-protocol 0.2.2 I, [2024-05-08T02:58:27.436292 #3183965] INFO -- : open-uri 0.4.1 I, [2024-05-08T02:58:27.436792 #3183965] INFO -- : open3 0.2.1 I, [2024-05-08T02:58:27.437280 #3183965] INFO -- : optparse 0.5.0 I, [2024-05-08T02:58:27.437794 #3183965] INFO -- : ostruct 0.6.0 I, [2024-05-08T02:58:27.438241 #3183965] INFO -- : pp 0.5.0 I, [2024-05-08T02:58:27.438735 #3183965] INFO -- : prettyprint 0.2.0 I, [2024-05-08T02:58:27.439214 #3183965] INFO -- : prism 0.27.0 I, [2024-05-08T02:58:27.439644 #3183965] INFO -- : pstore 0.1.3 I, [2024-05-08T02:58:27.440109 #3183965] INFO -- : rdoc 6.6.3.1 I, [2024-05-08T02:58:27.441745 #3183965] INFO -- : readline 0.0.4 I, [2024-05-08T02:58:27.442319 #3183965] INFO -- : reline 0.5.5 I, [2024-05-08T02:58:27.442838 #3183965] INFO -- : resolv 0.4.0 I, [2024-05-08T02:58:27.443311 #3183965] INFO -- : ruby2_keywords 0.0.5 I, [2024-05-08T02:58:27.443783 #3183965] INFO -- : securerandom 0.3.1 I, [2024-05-08T02:58:27.444304 #3183965] INFO -- : set 1.1.0 I, [2024-05-08T02:58:27.444842 #3183965] INFO -- : shellwords 0.2.0 I, [2024-05-08T02:58:27.445243 #3183965] INFO -- : singleton 0.2.0 I, [2024-05-08T02:58:27.445689 #3183965] INFO -- : syntax_suggest 2.0.0 I, [2024-05-08T02:58:27.446386 #3183965] INFO -- : tempfile 0.2.1 I, [2024-05-08T02:58:27.446933 #3183965] INFO -- : time 0.3.0 I, [2024-05-08T02:58:27.447786 #3183965] INFO -- : timeout 0.4.1 I, [2024-05-08T02:58:27.448417 #3183965] INFO -- : tmpdir 0.2.0 I, [2024-05-08T02:58:27.448991 #3183965] INFO -- : tsort 0.2.0 I, [2024-05-08T02:58:27.449470 #3183965] INFO -- : un 0.3.0 I, [2024-05-08T02:58:27.449951 #3183965] INFO -- : uri 0.13.0 I, [2024-05-08T02:58:27.450467 #3183965] INFO -- : weakref 0.1.3 I, [2024-05-08T02:58:27.450950 #3183965] INFO -- : yaml 0.3.0 I, [2024-05-08T02:58:27.451263 #3183965] INFO -- : installing default gems from ext: /tmp/ruby/install/trunk/lib/ruby/gems/3.4.0+0 I, [2024-05-08T02:58:27.458036 #3183965] INFO -- : date 3.3.4 I, [2024-05-08T02:58:27.458490 #3183965] INFO -- : digest 3.1.1 I, [2024-05-08T02:58:27.459041 #3183965] INFO -- : etc 1.4.3 I, [2024-05-08T02:58:27.459544 #3183965] INFO -- : fcntl 1.1.0 I, [2024-05-08T02:58:27.460018 #3183965] INFO -- : fiddle 1.1.3 I, [2024-05-08T02:58:27.460615 #3183965] INFO -- : io-console 0.7.2 I, [2024-05-08T02:58:27.461227 #3183965] INFO -- : io-nonblock 0.3.0 I, [2024-05-08T02:58:27.461707 #3183965] INFO -- : io-wait 0.3.1 I, [2024-05-08T02:58:27.462104 #3183965] INFO -- : json 2.7.2 I, [2024-05-08T02:58:27.463172 #3183965] INFO -- : openssl 3.2.0 I, [2024-05-08T02:58:27.463707 #3183965] INFO -- : pathname 0.3.0 I, [2024-05-08T02:58:27.464265 #3183965] INFO -- : psych 5.1.2 I, [2024-05-08T02:58:27.464857 #3183965] INFO -- : stringio 3.1.1 I, [2024-05-08T02:58:27.465363 #3183965] INFO -- : strscan 3.1.1 I, [2024-05-08T02:58:27.465847 #3183965] INFO -- : zlib 3.1.0 I, [2024-05-08T02:58:27.466257 #3183965] INFO -- : installing bundled gems: /tmp/ruby/install/trunk/lib/ruby/gems/3.4.0+0 I, [2024-05-08T02:58:27.466536 #3183965] INFO -- : minitest 5.22.3 I, [2024-05-08T02:58:27.473954 #3183965] INFO -- : rake 13.2.1 I, [2024-05-08T02:58:27.477437 #3183965] INFO -- : test-unit 3.6.2 I, [2024-05-08T02:58:27.481795 #3183965] INFO -- : rexml 3.2.6 I, [2024-05-08T02:58:27.485288 #3183965] INFO -- : rss 0.3.0 I, [2024-05-08T02:58:27.488262 #3183965] INFO -- : net-ftp 0.3.4 I, [2024-05-08T02:58:27.489739 #3183965] INFO -- : net-imap 0.4.10 I, [2024-05-08T02:58:27.492673 #3183965] INFO -- : net-pop 0.1.2 I, [2024-05-08T02:58:27.493595 #3183965] INFO -- : net-smtp 0.5.0 I, [2024-05-08T02:58:27.494747 #3183965] INFO -- : matrix 0.4.2 I, [2024-05-08T02:58:27.498252 #3183965] INFO -- : prime 0.1.2 I, [2024-05-08T02:58:27.503840 #3183965] INFO -- : rbs 3.4.4 I, [2024-05-08T02:58:27.526729 #3183965] INFO -- : typeprof 0.21.11 I, [2024-05-08T02:58:27.529335 #3183965] INFO -- : debug 1.9.2 I, [2024-05-08T02:58:27.532019 #3183965] INFO -- : racc 1.7.3 I, [2024-05-08T02:58:27.534789 #3183965] INFO -- : mutex_m 0.2.0 I, [2024-05-08T02:58:27.535925 #3183965] INFO -- : getoptlong 0.2.1 I, [2024-05-08T02:58:27.537194 #3183965] INFO -- : base64 0.2.0 I, [2024-05-08T02:58:27.538196 #3183965] INFO -- : bigdecimal 3.1.8 I, [2024-05-08T02:58:27.540181 #3183965] INFO -- : observer 0.1.2 I, [2024-05-08T02:58:27.541863 #3183965] INFO -- : abbrev 0.1.2 I, [2024-05-08T02:58:27.542871 #3183965] INFO -- : resolv-replace 0.1.1 I, [2024-05-08T02:58:27.544164 #3183965] INFO -- : rinda 0.2.0 I, [2024-05-08T02:58:27.545387 #3183965] INFO -- : drb 2.2.1 I, [2024-05-08T02:58:27.547052 #3183965] INFO -- : nkf 0.2.0 I, [2024-05-08T02:58:27.549584 #3183965] INFO -- : syslog 0.1.2 I, [2024-05-08T02:58:27.551193 #3183965] INFO -- : csv 3.3.0 I, [2024-05-08T02:58:27.553314 #3183965] INFO -- : installing bundled gem cache: /tmp/ruby/install/trunk/lib/ruby/gems/3.4.0+0/cache I, [2024-05-08T02:58:27.554774 #3183965] INFO -- : skipped bundled gems: I, [2024-05-08T02:58:27.554795 #3183965] INFO -- : power_assert-2.0.4dev.gem not found in bundled_gems I, [2024-05-08T02:58:27.557971 #3183965] INFO -- : $$$[end] "make install -j20" exit with 0. I, [2024-05-08T02:58:27.558069 #3183965] INFO -- : $$$[beg] make yes-btest TESTOPTS='-q -j20' I, [2024-05-08T02:58:33.934894 #3183965] INFO -- : PASS all 1936 tests E, [2024-05-08T02:58:33.940260 #3183965] ERROR -- : I, [2024-05-08T02:58:33.940500 #3183965] INFO -- : $$$[end] "make yes-btest TESTOPTS='-q -j20'" exit with 0. I, [2024-05-08T02:58:33.940581 #3183965] INFO -- : $$$[beg] make yes-test-basic TESTS='-j20' I, [2024-05-08T02:58:33.999900 #3183965] INFO -- : BASERUBY = /usr/bin/ruby --disable=gems I, [2024-05-08T02:58:33.999927 #3183965] INFO -- : CC = gcc I, [2024-05-08T02:58:33.999932 #3183965] INFO -- : LD = ld I, [2024-05-08T02:58:33.999936 #3183965] INFO -- : LDSHARED = gcc -shared I, [2024-05-08T02:58:33.999940 #3183965] INFO -- : CFLAGS = -O3 -fno-fast-math -ggdb3 -Wall -Wextra -Wdeprecated-declarations -Wdiv-by-zero -Wduplicated-cond -Wimplicit-function-declaration -Wimplicit-int -Wpointer-arith -Wwrite-strings -Wold-style-definition -Wimplicit-fallthrough=0 -Wmissing-noreturn -Wno-cast-function-type -Wno-constant-logical-operand -Wno-long-long -Wno-missing-field-initializers -Wno-overlength-strings -Wno-packed-bitfield-compat -Wno-parentheses-equality -Wno-self-assign -Wno-tautological-compare -Wno-unused-parameter -Wno-unused-value -Wsuggest-attribute=format -Wsuggest-attribute=noreturn -Wunused-variable -Wmisleading-indentation -Wundef -fPIC I, [2024-05-08T02:58:33.999944 #3183965] INFO -- : XCFLAGS = -U_FORTIFY_SOURCE -D_FORTIFY_SOURCE=2 -fstack-protector-strong -fno-strict-overflow -fvisibility=hidden -fexcess-precision=standard -DRUBY_EXPORT -I. -I.ext/include/x86_64-linux -I/tmp/ruby/src/trunk/include -I/tmp/ruby/src/trunk -I/tmp/ruby/src/trunk/prism -I/tmp/ruby/src/trunk/enc/unicode/15.0.0 I, [2024-05-08T02:58:33.999947 #3183965] INFO -- : CPPFLAGS = I, [2024-05-08T02:58:33.999951 #3183965] INFO -- : DLDFLAGS = -Wl,--compress-debug-sections=zlib -Wl,-soname,libruby.so.3.4 -fstack-protector-strong I, [2024-05-08T02:58:33.999955 #3183965] INFO -- : SOLIBS = -lz -lrt -lrt -lgmp -ldl -lcrypt -lm -lpthread I, [2024-05-08T02:58:33.999958 #3183965] INFO -- : LANG = en_US.UTF-8 I, [2024-05-08T02:58:33.999962 #3183965] INFO -- : LC_ALL = I, [2024-05-08T02:58:33.999965 #3183965] INFO -- : LC_CTYPE = I, [2024-05-08T02:58:33.999968 #3183965] INFO -- : MFLAGS = I, [2024-05-08T02:58:33.999972 #3183965] INFO -- : RUSTC = no I, [2024-05-08T02:58:33.999975 #3183965] INFO -- : YJIT_RUSTC_ARGS = --crate-name=yjit --crate-type=staticlib --edition=2021 -g -C lto=thin -C opt-level=3 -C overflow-checks=on '--out-dir=/tmp/ruby/build/trunk/yjit/target/release/' /tmp/ruby/src/trunk/yjit/src/lib.rs I, [2024-05-08T02:58:34.000437 #3183965] INFO -- : gcc (Ubuntu 11.4.0-1ubuntu1~22.04) 11.4.0 I, [2024-05-08T02:58:34.000483 #3183965] INFO -- : Copyright (C) 2021 Free Software Foundation, Inc. I, [2024-05-08T02:58:34.000495 #3183965] INFO -- : This is free software; see the source for copying conditions. There is NO I, [2024-05-08T02:58:34.000500 #3183965] INFO -- : warranty; not even for MERCHANTABILITY or FITNESS FOR A PARTICULAR PURPOSE. I, [2024-05-08T02:58:34.000504 #3183965] INFO -- : I, [2024-05-08T02:58:34.106964 #3183965] INFO -- : Checking leaked global symbols...none I, [2024-05-08T02:58:34.148101 #3183965] INFO -- : /tmp/ruby/src/trunk/basictest/test.rb:assignment ....................................................................................................................................................................................................................................................................................................................................................................................OK 372 I, [2024-05-08T02:58:34.148167 #3183965] INFO -- : /tmp/ruby/src/trunk/basictest/test.rb:condition ..OK 2 I, [2024-05-08T02:58:34.148189 #3183965] INFO -- : /tmp/ruby/src/trunk/basictest/test.rb:if/unless ...OK 3 I, [2024-05-08T02:58:34.148193 #3183965] INFO -- : /tmp/ruby/src/trunk/basictest/test.rb:case .....OK 5 I, [2024-05-08T02:58:34.148374 #3183965] INFO -- : /tmp/ruby/src/trunk/basictest/test.rb:while/until ........OK 8 I, [2024-05-08T02:58:34.148427 #3183965] INFO -- : /tmp/ruby/src/trunk/basictest/test.rb:exception ..........OK 10 I, [2024-05-08T02:58:34.148707 #3183965] INFO -- : /tmp/ruby/src/trunk/basictest/test.rb:array .......................................OK 39 I, [2024-05-08T02:58:34.148806 #3183965] INFO -- : /tmp/ruby/src/trunk/basictest/test.rb:hash ...........................OK 27 I, [2024-05-08T02:58:34.149532 #3183965] INFO -- : /tmp/ruby/src/trunk/basictest/test.rb:iterator ...........................................................................................................OK 107 I, [2024-05-08T02:58:34.149816 #3183965] INFO -- : /tmp/ruby/src/trunk/basictest/test.rb:float ................................................................................OK 80 I, [2024-05-08T02:58:34.150827 #3183965] INFO -- : /tmp/ruby/src/trunk/basictest/test.rb:bignum ...............................OK 31 I, [2024-05-08T02:58:34.151605 #3183965] INFO -- : /tmp/ruby/src/trunk/basictest/test.rb:string & char ..............................................................OK 62 I, [2024-05-08T02:58:34.151637 #3183965] INFO -- : /tmp/ruby/src/trunk/basictest/test.rb:assignment ..........OK 10 I, [2024-05-08T02:58:34.151665 #3183965] INFO -- : /tmp/ruby/src/trunk/basictest/test.rb:call ......OK 6 I, [2024-05-08T02:58:34.151719 #3183965] INFO -- : /tmp/ruby/src/trunk/basictest/test.rb:proc .........OK 9 I, [2024-05-08T02:58:34.252011 #3183965] INFO -- : /tmp/ruby/src/trunk/basictest/test.rb:signal ..OK 2 I, [2024-05-08T02:58:34.252495 #3183965] INFO -- : /tmp/ruby/src/trunk/basictest/test.rb:eval ...........................OK 27 I, [2024-05-08T02:58:34.353277 #3183965] INFO -- : /tmp/ruby/src/trunk/basictest/test.rb:system ........OK 8 I, [2024-05-08T02:58:34.353338 #3183965] INFO -- : /tmp/ruby/src/trunk/basictest/test.rb:const .....OK 5 I, [2024-05-08T02:58:34.353345 #3183965] INFO -- : /tmp/ruby/src/trunk/basictest/test.rb:clone .....OK 5 I, [2024-05-08T02:58:34.353428 #3183965] INFO -- : /tmp/ruby/src/trunk/basictest/test.rb:marshal ....OK 4 I, [2024-05-08T02:58:34.353532 #3183965] INFO -- : /tmp/ruby/src/trunk/basictest/test.rb:pack ....OK 4 I, [2024-05-08T02:58:34.353553 #3183965] INFO -- : /tmp/ruby/src/trunk/basictest/test.rb:math ..OK 2 I, [2024-05-08T02:58:34.353559 #3183965] INFO -- : /tmp/ruby/src/trunk/basictest/test.rb:struct ......OK 6 I, [2024-05-08T02:58:34.353622 #3183965] INFO -- : /tmp/ruby/src/trunk/basictest/test.rb:variable ............OK 12 I, [2024-05-08T02:58:34.353646 #3183965] INFO -- : /tmp/ruby/src/trunk/basictest/test.rb:trace ...OK 3 I, [2024-05-08T02:58:34.353705 #3183965] INFO -- : /tmp/ruby/src/trunk/basictest/test.rb:defined? ............OK 12 I, [2024-05-08T02:58:34.353751 #3183965] INFO -- : /tmp/ruby/src/trunk/basictest/test.rb:alias ......OK 6 I, [2024-05-08T02:58:34.354091 #3183965] INFO -- : /tmp/ruby/src/trunk/basictest/test.rb:path .......................OK 23 I, [2024-05-08T02:58:34.388082 #3183965] INFO -- : /tmp/ruby/src/trunk/basictest/test.rb:gc ....OK 4 I, [2024-05-08T02:58:34.390341 #3183965] INFO -- : I, [2024-05-08T02:58:34.390363 #3183965] INFO -- : test succeeded I, [2024-05-08T02:58:34.391750 #3183965] INFO -- : $$$[end] "make yes-test-basic TESTS='-j20'" exit with 0. I, [2024-05-08T02:58:34.391836 #3183965] INFO -- : $$$[beg] make yes-test-all TESTOPTS='--stderr-on-failure' TESTS='-j20' I, [2024-05-08T02:58:34.477060 #3183965] INFO -- : BASERUBY = /usr/bin/ruby --disable=gems I, [2024-05-08T02:58:34.477099 #3183965] INFO -- : CC = gcc I, [2024-05-08T02:58:34.477105 #3183965] INFO -- : LD = ld I, [2024-05-08T02:58:34.477109 #3183965] INFO -- : LDSHARED = gcc -shared I, [2024-05-08T02:58:34.477121 #3183965] INFO -- : CFLAGS = -O3 -fno-fast-math -ggdb3 -Wall -Wextra -Wdeprecated-declarations -Wdiv-by-zero -Wduplicated-cond -Wimplicit-function-declaration -Wimplicit-int -Wpointer-arith -Wwrite-strings -Wold-style-definition -Wimplicit-fallthrough=0 -Wmissing-noreturn -Wno-cast-function-type -Wno-constant-logical-operand -Wno-long-long -Wno-missing-field-initializers -Wno-overlength-strings -Wno-packed-bitfield-compat -Wno-parentheses-equality -Wno-self-assign -Wno-tautological-compare -Wno-unused-parameter -Wno-unused-value -Wsuggest-attribute=format -Wsuggest-attribute=noreturn -Wunused-variable -Wmisleading-indentation -Wundef -fPIC I, [2024-05-08T02:58:34.477125 #3183965] INFO -- : XCFLAGS = -U_FORTIFY_SOURCE -D_FORTIFY_SOURCE=2 -fstack-protector-strong -fno-strict-overflow -fvisibility=hidden -fexcess-precision=standard -DRUBY_EXPORT -I. -I.ext/include/x86_64-linux -I/tmp/ruby/src/trunk/include -I/tmp/ruby/src/trunk -I/tmp/ruby/src/trunk/prism -I/tmp/ruby/src/trunk/enc/unicode/15.0.0 I, [2024-05-08T02:58:34.477129 #3183965] INFO -- : CPPFLAGS = I, [2024-05-08T02:58:34.477132 #3183965] INFO -- : DLDFLAGS = -Wl,--compress-debug-sections=zlib -Wl,-soname,libruby.so.3.4 -fstack-protector-strong I, [2024-05-08T02:58:34.477136 #3183965] INFO -- : SOLIBS = -lz -lrt -lrt -lgmp -ldl -lcrypt -lm -lpthread I, [2024-05-08T02:58:34.477140 #3183965] INFO -- : LANG = en_US.UTF-8 I, [2024-05-08T02:58:34.477143 #3183965] INFO -- : LC_ALL = I, [2024-05-08T02:58:34.477147 #3183965] INFO -- : LC_CTYPE = I, [2024-05-08T02:58:34.477150 #3183965] INFO -- : MFLAGS = I, [2024-05-08T02:58:34.477153 #3183965] INFO -- : RUSTC = no I, [2024-05-08T02:58:34.477157 #3183965] INFO -- : YJIT_RUSTC_ARGS = --crate-name=yjit --crate-type=staticlib --edition=2021 -g -C lto=thin -C opt-level=3 -C overflow-checks=on '--out-dir=/tmp/ruby/build/trunk/yjit/target/release/' /tmp/ruby/src/trunk/yjit/src/lib.rs I, [2024-05-08T02:58:34.477732 #3183965] INFO -- : gcc (Ubuntu 11.4.0-1ubuntu1~22.04) 11.4.0 I, [2024-05-08T02:58:34.477756 #3183965] INFO -- : Copyright (C) 2021 Free Software Foundation, Inc. I, [2024-05-08T02:58:34.477765 #3183965] INFO -- : This is free software; see the source for copying conditions. There is NO I, [2024-05-08T02:58:34.477772 #3183965] INFO -- : warranty; not even for MERCHANTABILITY or FITNESS FOR A PARTICULAR PURPOSE. I, [2024-05-08T02:58:34.477783 #3183965] INFO -- : I, [2024-05-08T02:58:34.479398 #3183965] INFO -- : generating enc.mk I, [2024-05-08T02:58:34.596715 #3183965] INFO -- : making enc I, [2024-05-08T02:58:34.614024 #3183965] INFO -- : make[1]: Entering directory '/tmp/ruby/build/trunk' I, [2024-05-08T02:58:34.614051 #3183965] INFO -- : make[1]: Nothing to be done for 'enc'. I, [2024-05-08T02:58:34.614058 #3183965] INFO -- : make[1]: Leaving directory '/tmp/ruby/build/trunk' I, [2024-05-08T02:58:34.614735 #3183965] INFO -- : making srcs under enc I, [2024-05-08T02:58:34.644374 #3183965] INFO -- : make[1]: Entering directory '/tmp/ruby/build/trunk' I, [2024-05-08T02:58:34.644398 #3183965] INFO -- : make[1]: Nothing to be done for 'srcs'. I, [2024-05-08T02:58:34.644406 #3183965] INFO -- : make[1]: Leaving directory '/tmp/ruby/build/trunk' I, [2024-05-08T02:58:34.645285 #3183965] INFO -- : generating transdb.h I, [2024-05-08T02:58:34.739564 #3183965] INFO -- : transdb.h unchanged I, [2024-05-08T02:58:34.741023 #3183965] INFO -- : making trans I, [2024-05-08T02:58:34.775460 #3183965] INFO -- : make[1]: Entering directory '/tmp/ruby/build/trunk' I, [2024-05-08T02:58:34.775484 #3183965] INFO -- : make[1]: Nothing to be done for 'trans'. I, [2024-05-08T02:58:34.775493 #3183965] INFO -- : make[1]: Leaving directory '/tmp/ruby/build/trunk' I, [2024-05-08T02:58:34.776263 #3183965] INFO -- : making encs I, [2024-05-08T02:58:34.814561 #3183965] INFO -- : make[1]: Entering directory '/tmp/ruby/build/trunk' I, [2024-05-08T02:58:34.814582 #3183965] INFO -- : make[1]: Nothing to be done for 'encs'. I, [2024-05-08T02:58:34.814587 #3183965] INFO -- : make[1]: Leaving directory '/tmp/ruby/build/trunk' I, [2024-05-08T02:58:34.816422 #3183965] INFO -- : generating makefiles ext/configure-ext.mk I, [2024-05-08T02:58:34.844194 #3183965] INFO -- : ext/configure-ext.mk updated I, [2024-05-08T02:58:34.846647 #3183965] INFO -- : make[1]: Entering directory '/tmp/ruby/build/trunk' I, [2024-05-08T02:58:36.248009 #3183965] INFO -- : make[1]: Leaving directory '/tmp/ruby/build/trunk' I, [2024-05-08T02:58:36.248643 #3183965] INFO -- : generating makefile exts.mk I, [2024-05-08T02:58:36.285472 #3183965] INFO -- : exts.mk unchanged I, [2024-05-08T02:58:36.290296 #3183965] INFO -- : make[1]: Entering directory '/tmp/ruby/build/trunk' I, [2024-05-08T02:58:36.501357 #3183965] INFO -- : make[2]: Entering directory '/tmp/ruby/build/trunk/ext/coverage' I, [2024-05-08T02:58:36.504265 #3183965] INFO -- : make[2]: Leaving directory '/tmp/ruby/build/trunk/ext/coverage' I, [2024-05-08T02:58:36.507999 #3183965] INFO -- : make[2]: Entering directory '/tmp/ruby/build/trunk/ext/date' I, [2024-05-08T02:58:36.511108 #3183965] INFO -- : make[2]: Leaving directory '/tmp/ruby/build/trunk/ext/date' I, [2024-05-08T02:58:36.513311 #3183965] INFO -- : make[2]: Entering directory '/tmp/ruby/build/trunk/ext/digest' I, [2024-05-08T02:58:36.518738 #3183965] INFO -- : make[2]: Leaving directory '/tmp/ruby/build/trunk/ext/digest' I, [2024-05-08T02:58:36.534287 #3183965] INFO -- : make[2]: Entering directory '/tmp/ruby/build/trunk/ext/digest/sha2' I, [2024-05-08T02:58:36.537267 #3183965] INFO -- : make[2]: Leaving directory '/tmp/ruby/build/trunk/ext/digest/sha2' I, [2024-05-08T02:58:36.549961 #3183965] INFO -- : make[2]: Entering directory '/tmp/ruby/build/trunk/ext/fiddle' I, [2024-05-08T02:58:36.556345 #3183965] INFO -- : make[2]: Leaving directory '/tmp/ruby/build/trunk/ext/fiddle' I, [2024-05-08T02:58:36.559385 #3183965] INFO -- : make[2]: Entering directory '/tmp/ruby/build/trunk/ext/io/console' I, [2024-05-08T02:58:36.561967 #3183965] INFO -- : make[2]: Leaving directory '/tmp/ruby/build/trunk/ext/io/console' I, [2024-05-08T02:58:36.569648 #3183965] INFO -- : make[2]: Entering directory '/tmp/ruby/build/trunk/ext/json' I, [2024-05-08T02:58:36.575897 #3183965] INFO -- : make[2]: Leaving directory '/tmp/ruby/build/trunk/ext/json' I, [2024-05-08T02:58:36.584981 #3183965] INFO -- : make[2]: Entering directory '/tmp/ruby/build/trunk/ext/monitor' I, [2024-05-08T02:58:36.587443 #3183965] INFO -- : make[2]: Leaving directory '/tmp/ruby/build/trunk/ext/monitor' I, [2024-05-08T02:58:36.591527 #3183965] INFO -- : make[2]: Entering directory '/tmp/ruby/build/trunk/ext/objspace' I, [2024-05-08T02:58:36.595223 #3183965] INFO -- : make[2]: Leaving directory '/tmp/ruby/build/trunk/ext/objspace' I, [2024-05-08T02:58:36.607260 #3183965] INFO -- : make[2]: Entering directory '/tmp/ruby/build/trunk/ext/openssl' I, [2024-05-08T02:58:36.620319 #3183965] INFO -- : make[2]: Leaving directory '/tmp/ruby/build/trunk/ext/openssl' I, [2024-05-08T02:58:36.623134 #3183965] INFO -- : make[2]: Entering directory '/tmp/ruby/build/trunk/ext/pathname' I, [2024-05-08T02:58:36.625629 #3183965] INFO -- : make[2]: Leaving directory '/tmp/ruby/build/trunk/ext/pathname' I, [2024-05-08T02:58:36.629853 #3183965] INFO -- : make[2]: Entering directory '/tmp/ruby/build/trunk/ext/psych' I, [2024-05-08T02:58:36.644590 #3183965] INFO -- : make[2]: Leaving directory '/tmp/ruby/build/trunk/ext/psych' I, [2024-05-08T02:58:36.647663 #3183965] INFO -- : make[2]: Entering directory '/tmp/ruby/build/trunk/ext/pty' I, [2024-05-08T02:58:36.650106 #3183965] INFO -- : make[2]: Leaving directory '/tmp/ruby/build/trunk/ext/pty' I, [2024-05-08T02:58:36.659546 #3183965] INFO -- : make[2]: Entering directory '/tmp/ruby/build/trunk/ext/ripper' I, [2024-05-08T02:58:36.664449 #3183965] INFO -- : make[2]: Leaving directory '/tmp/ruby/build/trunk/ext/ripper' I, [2024-05-08T02:58:36.665923 #3183965] INFO -- : make[2]: Entering directory '/tmp/ruby/build/trunk/ext/rubyvm' I, [2024-05-08T02:58:36.667969 #3183965] INFO -- : make[2]: Leaving directory '/tmp/ruby/build/trunk/ext/rubyvm' I, [2024-05-08T02:58:36.675663 #3183965] INFO -- : make[2]: Entering directory '/tmp/ruby/build/trunk/ext/socket' I, [2024-05-08T02:58:36.682024 #3183965] INFO -- : make[2]: Leaving directory '/tmp/ruby/build/trunk/ext/socket' I, [2024-05-08T02:58:36.693010 #3183965] INFO -- : make[2]: Entering directory '/tmp/ruby/build/trunk/.bundle/gems/bigdecimal-3.1.7/ext/bigdecimal' I, [2024-05-08T02:58:36.715699 #3183965] INFO -- : make[2]: Leaving directory '/tmp/ruby/build/trunk/.bundle/gems/bigdecimal-3.1.7/ext/bigdecimal' I, [2024-05-08T02:58:36.717538 #3183965] INFO -- : make[2]: Entering directory '/tmp/ruby/build/trunk/.bundle/gems/bigdecimal-3.1.8/ext/bigdecimal' I, [2024-05-08T02:58:36.739803 #3183965] INFO -- : make[2]: Leaving directory '/tmp/ruby/build/trunk/.bundle/gems/bigdecimal-3.1.8/ext/bigdecimal' I, [2024-05-08T02:58:36.741861 #3183965] INFO -- : make[2]: Entering directory '/tmp/ruby/build/trunk/.bundle/gems/debug-1.9.2/ext/debug' I, [2024-05-08T02:58:36.763790 #3183965] INFO -- : make[2]: Leaving directory '/tmp/ruby/build/trunk/.bundle/gems/debug-1.9.2/ext/debug' I, [2024-05-08T02:58:36.765608 #3183965] INFO -- : make[2]: Entering directory '/tmp/ruby/build/trunk/.bundle/gems/nkf-0.2.0/ext/nkf' I, [2024-05-08T02:58:36.787170 #3183965] INFO -- : make[2]: Leaving directory '/tmp/ruby/build/trunk/.bundle/gems/nkf-0.2.0/ext/nkf' I, [2024-05-08T02:58:36.789248 #3183965] INFO -- : make[2]: Entering directory '/tmp/ruby/build/trunk/.bundle/gems/racc-1.7.3/ext/racc/cparse' I, [2024-05-08T02:58:36.810784 #3183965] INFO -- : make[2]: Leaving directory '/tmp/ruby/build/trunk/.bundle/gems/racc-1.7.3/ext/racc/cparse' I, [2024-05-08T02:58:36.812905 #3183965] INFO -- : make[2]: Entering directory '/tmp/ruby/build/trunk/.bundle/gems/rbs-3.4.4/ext/rbs_extension' I, [2024-05-08T02:58:36.834544 #3183965] INFO -- : make[2]: Leaving directory '/tmp/ruby/build/trunk/.bundle/gems/rbs-3.4.4/ext/rbs_extension' I, [2024-05-08T02:58:36.836522 #3183965] INFO -- : make[2]: Entering directory '/tmp/ruby/build/trunk/.bundle/gems/syslog-0.1.2/ext/syslog' I, [2024-05-08T02:58:36.858200 #3183965] INFO -- : make[2]: Leaving directory '/tmp/ruby/build/trunk/.bundle/gems/syslog-0.1.2/ext/syslog' I, [2024-05-08T02:58:36.881656 #3183965] INFO -- : make[2]: Entering directory '/tmp/ruby/build/trunk' I, [2024-05-08T02:58:36.945710 #3183965] INFO -- : make[2]: 'ruby' is up to date. I, [2024-05-08T02:58:36.945754 #3183965] INFO -- : make[2]: Leaving directory '/tmp/ruby/build/trunk' I, [2024-05-08T02:58:36.945964 #3183965] INFO -- : make[1]: Leaving directory '/tmp/ruby/build/trunk' I, [2024-05-08T02:58:36.949841 #3183965] INFO -- : make[1]: Entering directory '/tmp/ruby/build/trunk' I, [2024-05-08T02:58:36.949864 #3183965] INFO -- : make[1]: Nothing to be done for 'note'. I, [2024-05-08T02:58:36.949870 #3183965] INFO -- : make[1]: Leaving directory '/tmp/ruby/build/trunk' I, [2024-05-08T02:58:37.026251 #3183965] INFO -- : Run options: I, [2024-05-08T02:58:37.026309 #3183965] INFO -- : --seed=8526 I, [2024-05-08T02:58:37.026315 #3183965] INFO -- : "--ruby=./miniruby -I/tmp/ruby/src/trunk/lib -I. -I.ext/common /tmp/ruby/src/trunk/tool/runruby.rb --extout=.ext -- --disable-gems" I, [2024-05-08T02:58:37.026320 #3183965] INFO -- : --excludes-dir=/tmp/ruby/src/trunk/test/.excludes I, [2024-05-08T02:58:37.026325 #3183965] INFO -- : --name=!/memory_leak/ I, [2024-05-08T02:58:37.026328 #3183965] INFO -- : --stderr-on-failure I, [2024-05-08T02:58:37.026334 #3183965] INFO -- : -j20 I, [2024-05-08T02:58:37.026338 #3183965] INFO -- : I, [2024-05-08T02:58:37.026343 #3183965] INFO -- : # Running tests: I, [2024-05-08T02:58:37.026347 #3183965] INFO -- : I, [2024-05-08T02:58:37.175038 #3183965] INFO -- : [ 1/885] 3225358=test_storage I, [2024-05-08T02:58:37.175095 #3183965] INFO -- : [ 2/885] 3225341=test_gem_resolver_git_set I, [2024-05-08T02:58:37.175103 #3183965] INFO -- : [ 3/885] 3225344=test_cipher I, [2024-05-08T02:58:37.175220 #3183965] INFO -- : [ 4/885] 3225345=test_gem_security_signer I, [2024-05-08T02:58:37.175577 #3183965] INFO -- : [ 5/885] 3225342=test_new I, [2024-05-08T02:58:37.176997 #3183965] INFO -- : [ 6/885] 3225343=test_shellwords I, [2024-05-08T02:58:37.177137 #3183965] INFO -- : [ 7/885] 3225357=test_debug I, [2024-05-08T02:58:37.177356 #3183965] INFO -- : [ 8/885] 3225355=test_memory_view I, [2024-05-08T02:58:37.177590 #3183965] INFO -- : [ 9/885] 3225354=pattern_test I, [2024-05-08T02:58:37.178141 #3183965] INFO -- : [ 10/885] 3225356=test_iterator I, [2024-05-08T02:58:37.181231 #3183965] INFO -- : [ 11/885] 3225359=test_string I, [2024-05-08T02:58:37.182385 #3183965] INFO -- : [ 12/885] 3225359=test_omap I, [2024-05-08T02:58:37.182887 #3183965] INFO -- : [ 13/885] 3225343=test_digest_extend I, [2024-05-08T02:58:37.186088 #3183965] INFO -- : [ 14/885] 3225342=test_input_method I, [2024-05-08T02:58:37.196350 #3183965] INFO -- : [ 15/885] 3225343=test_windows_1252 I, [2024-05-08T02:58:37.199229 #3183965] INFO -- : [ 16/885] 3225343=test_process I, [2024-05-08T02:58:37.200591 #3183965] INFO -- : [ 17/885] 3225358=test_fixnum I, [2024-05-08T02:58:37.207325 #3183965] INFO -- : [ 18/885] 3225355=test_signal I, [2024-05-08T02:58:37.207383 #3183965] INFO -- : [ 19/885] 3225357=test_x509crl I, [2024-05-08T02:58:37.207392 #3183965] INFO -- : [ 20/885] 3225347=test_rdoc_rd I, [2024-05-08T02:58:37.207399 #3183965] INFO -- : [ 21/885] 3225349=test_cgi_session I, [2024-05-08T02:58:37.207407 #3183965] INFO -- : [ 22/885] 3225352=test_rdoc_top_level I, [2024-05-08T02:58:37.211915 #3183965] INFO -- : [ 23/885] 3225351=test_metaclass I, [2024-05-08T02:58:37.212019 #3183965] INFO -- : [ 24/885] 3225350=test_dir_m17n I, [2024-05-08T02:58:37.212729 #3183965] INFO -- : [ 25/885] 3225351=test_gem_resolver_installer_set I, [2024-05-08T02:58:37.217956 #3183965] INFO -- : [ 26/885] 3225358=test_regex_casefold I, [2024-05-08T02:58:37.218758 #3183965] INFO -- : [ 27/885] 3225348=test_refinement I, [2024-05-08T02:58:37.224819 #3183965] INFO -- : [ 28/885] 3225359=test_gem_commands_signout_command I, [2024-05-08T02:58:37.228427 #3183965] INFO -- : [ 29/885] 3225346=test_gem_source_git I, [2024-05-08T02:58:37.234769 #3183965] INFO -- : [ 30/885] 3225343=test_float I, [2024-05-08T02:58:37.239386 #3183965] INFO -- : [ 31/885] 3225353=test_require I, [2024-05-08T02:58:37.240386 #3183965] INFO -- : [ 32/885] 3225349=test_cgi_cookie I, [2024-05-08T02:58:37.249060 #3183965] INFO -- : [ 33/885] 3225349=test_rdoc_rd_inline I, [2024-05-08T02:58:37.261463 #3183965] INFO -- : [ 34/885] 3225356=test_mutex I, [2024-05-08T02:58:37.275323 #3183965] INFO -- : [ 35/885] 3225360=test_x509req I, [2024-05-08T02:58:37.277105 #3183965] INFO -- : [ 36/885] 3225344=test_set I, [2024-05-08T02:58:37.279653 #3183965] INFO -- : [ 37/885] 3225354=test_struct I, [2024-05-08T02:58:37.297932 #3183965] INFO -- : [ 38/885] 3225344=test_gem_path_support I, [2024-05-08T02:58:37.342654 #3183965] INFO -- : [ 39/885] 3225347=test_files_test_1 I, [2024-05-08T02:58:37.404461 #3183965] INFO -- : [ 40/885] 3225349=test_color_printer I, [2024-05-08T02:58:37.407674 #3183965] INFO -- : [ 41/885] 3225359=test_deprecated I, [2024-05-08T02:58:37.411485 #3183965] INFO -- : [ 42/885] 3225359=test_insns_leaf I, [2024-05-08T02:58:37.415361 #3183965] INFO -- : [ 43/885] 3225359=test_serialize_subclasses I, [2024-05-08T02:58:37.421663 #3183965] INFO -- : [ 44/885] 3225359=test_key_error I, [2024-05-08T02:58:37.428360 #3183965] INFO -- : [ 45/885] 3225359=test_allocation I, [2024-05-08T02:58:37.428507 #3183965] INFO -- : [ 46/885] 3225357=test_div I, [2024-05-08T02:58:37.433678 #3183965] INFO -- : [ 47/885] 3225345=test_win32ole_variant_m I, [2024-05-08T02:58:37.435448 #3183965] INFO -- : [ 48/885] 3225345=test_engine I, [2024-05-08T02:58:37.441523 #3183965] INFO -- : [ 49/885] 3225345=fuzzer_test I, [2024-05-08T02:58:37.445798 #3183965] INFO -- : [ 50/885] 3225357=test_sexp I, [2024-05-08T02:58:37.454056 #3183965] INFO -- : [ 51/885] 3225344=test_rdoc_markup_include I, [2024-05-08T02:58:37.489910 #3183965] INFO -- : [ 52/885] 3225349=test_variable I, [2024-05-08T02:58:37.498721 #3183965] INFO -- : [ 53/885] 3225345=test_struct I, [2024-05-08T02:58:37.502228 #3183965] INFO -- : [ 54/885] 3225357=magic_comment_test I, [2024-05-08T02:58:37.506246 #3183965] INFO -- : [ 55/885] 3225342=test_rdoc_markup_to_html_snippet I, [2024-05-08T02:58:37.525479 #3183965] INFO -- : [ 56/885] 3225360=test_cparser I, [2024-05-08T02:58:37.529146 #3183965] INFO -- : [ 57/885] 3225345=test_pkg_config I, [2024-05-08T02:58:37.564750 #3183965] INFO -- : [ 58/885] 3225345=test_config I, [2024-05-08T02:58:37.568982 #3183965] INFO -- : [ 59/885] 3225344=test_nomethod_error I, [2024-05-08T02:58:37.574310 #3183965] INFO -- : [ 60/885] 3225358=json_parser_test I, [2024-05-08T02:58:37.576261 #3183965] INFO -- : [ 61/885] 3225344=memsize_test I, [2024-05-08T02:58:37.580600 #3183965] INFO -- : [ 62/885] 3225357=test_dln I, [2024-05-08T02:58:37.581371 #3183965] INFO -- : [ 63/885] 3225349=test_gem_source_subpath_problem I, [2024-05-08T02:58:37.581867 #3183965] INFO -- : [ 64/885] 3225357=json_common_interface_test I, [2024-05-08T02:58:37.587168 #3183965] INFO -- : [ 65/885] 3225345=test_win32ole_variant_outarg I, [2024-05-08T02:58:37.588728 #3183965] INFO -- : [ 66/885] 3225345=test_stringify_symbols I, [2024-05-08T02:58:37.596308 #3183965] INFO -- : [ 67/885] 3225345=test_instrumentation_api I, [2024-05-08T02:58:37.604840 #3183965] INFO -- : [ 68/885] 3225357=integer_parse_test I, [2024-05-08T02:58:37.609039 #3183965] INFO -- : [ 69/885] 3225357=test_boolean I, [2024-05-08T02:58:37.609627 #3183965] INFO -- : [ 70/885] 3225358=test_rdoc_generator_markup I, [2024-05-08T02:58:37.622143 #3183965] INFO -- : [ 71/885] 3225342=test_whileuntil I, [2024-05-08T02:58:37.624436 #3183965] INFO -- : [ 72/885] 3225342=test_monitor I, [2024-05-08T02:58:37.629752 #3183965] INFO -- : [ 73/885] 3225357=test_buffered_io I, [2024-05-08T02:58:37.639421 #3183965] INFO -- : [ 74/885] 3225351=test_configuration I, [2024-05-08T02:58:37.655705 #3183965] INFO -- : [ 75/885] 3225344=test_rubyvm I, [2024-05-08T02:58:37.661270 #3183965] INFO -- : [ 76/885] 3225344=test_parser I, [2024-05-08T02:58:37.687953 #3183965] INFO -- : [ 77/885] 3225344=test_method_name_check I, [2024-05-08T02:58:37.697649 #3183965] INFO -- : [ 78/885] 3225352=test_arith_seq_extract I, [2024-05-08T02:58:37.704531 #3183965] INFO -- : [ 79/885] 3225341=test_gem_request_set I, [2024-05-08T02:58:37.707268 #3183965] INFO -- : [ 80/885] 3225357=test_module I, [2024-05-08T02:58:37.714616 #3183965] INFO -- : [ 81/885] 3225358=test_ssl I, [2024-05-08T02:58:37.719929 #3183965] INFO -- : [ 82/885] 3225360=test_gem_ext_cargo_builder I, [2024-05-08T02:58:37.721698 #3183965] INFO -- : [ 83/885] 3225344=constant_path_node_test I, [2024-05-08T02:58:37.727357 #3183965] INFO -- : [ 84/885] 3225344=test_assembler I, [2024-05-08T02:58:37.727503 #3183965] INFO -- : [ 85/885] 3225344=test_spell_checker I, [2024-05-08T02:58:37.738204 #3183965] INFO -- : [ 86/885] 3225344=test_propertyputref I, [2024-05-08T02:58:37.742416 #3183965] INFO -- : [ 87/885] 3225344=attribute_write_test I, [2024-05-08T02:58:37.746351 #3183965] INFO -- : [ 88/885] 3225344=test_rational2 I, [2024-05-08T02:58:37.767106 #3183965] INFO -- : [ 89/885] 3225344=test_rational I, [2024-05-08T02:58:37.780599 #3183965] INFO -- : [ 90/885] 3225344=test_gem_commands_cert_command I, [2024-05-08T02:58:37.789220 #3183965] INFO -- : [ 91/885] 3225351=test_completion I, [2024-05-08T02:58:37.836250 #3183965] INFO -- : [ 92/885] 3225342=test_len I, [2024-05-08T02:58:37.836451 #3183965] INFO -- : [ 93/885] 3225342=test_yield_block I, [2024-05-08T02:58:37.837689 #3183965] INFO -- : [ 94/885] 3225360=test_erb I, [2024-05-08T02:58:37.840477 #3183965] INFO -- : [ 95/885] 3225342=test_x509ext I, [2024-05-08T02:58:37.842088 #3183965] INFO -- : [ 96/885] 3225349=test_gem_source_installed I, [2024-05-08T02:58:37.854611 #3183965] INFO -- : [ 97/885] 3225349=test_evaluation I, [2024-05-08T02:58:37.858788 #3183965] INFO -- : [ 98/885] 3225349=test_https I, [2024-05-08T02:58:37.864055 #3183965] INFO -- : [ 99/885] 3225354=test_gem_ext_builder I, [2024-05-08T02:58:37.879345 #3183965] INFO -- : [100/885] 3225342=test_rdoc_parser_simple I, [2024-05-08T02:58:37.888200 #3183965] INFO -- : [101/885] 3225352=test_load I, [2024-05-08T02:58:37.890962 #3183965] INFO -- : [102/885] 3225360=test_yamldbm I, [2024-05-08T02:58:37.892976 #3183965] INFO -- : [103/885] 3225352=test_gem_commands_rebuild_command I, [2024-05-08T02:58:37.904184 #3183965] INFO -- : [104/885] 3225342=test_abi I, [2024-05-08T02:58:37.918022 #3183965] INFO -- : [105/885] 3225346=test_provider I, [2024-05-08T02:58:37.922561 #3183965] INFO -- : [106/885] 3225360=test_gem_commands_outdated_command I, [2024-05-08T02:58:37.982495 #3183965] INFO -- : [107/885] 3225360=test_array I, [2024-05-08T02:58:38.054553 #3183965] INFO -- : [108/885] 3225341=test_helper_method I, [2024-05-08T02:58:38.055219 #3183965] INFO -- : [109/885] 3225342=test_gem_package_tar_writer I, [2024-05-08T02:58:38.089645 #3183965] INFO -- : [110/885] 3225352=test_gem_source I, [2024-05-08T02:58:38.178293 #3183965] INFO -- : [111/885] 3225341=test_scalar_scanner I, [2024-05-08T02:58:38.191276 #3183965] INFO -- : [112/885] 3225341=test_win32ole_method_event I, [2024-05-08T02:58:38.197140 #3183965] INFO -- : [113/885] 3225341=test_nesting_parser I, [2024-05-08T02:58:38.220110 #3183965] INFO -- : [114/885] 3225341=test_gem_dependency_list I, [2024-05-08T02:58:38.241189 #3183965] INFO -- : [115/885] 3225346=test_benchmark I, [2024-05-08T02:58:38.268087 #3183965] INFO -- : [116/885] 3225349=test_key_stroke I, [2024-05-08T02:58:38.278525 #3183965] INFO -- : [117/885] 3225349=json_encoding_test I, [2024-05-08T02:58:38.283917 #3183965] INFO -- : [118/885] 3225341=test_color I, [2024-05-08T02:58:38.289821 #3183965] INFO -- : [119/885] 3225349=test_sockopt I, [2024-05-08T02:58:38.293022 #3183965] INFO -- : [120/885] 3225349=test_install I, [2024-05-08T02:58:38.293715 #3183965] INFO -- : [121/885] 3225352=test_rdoc_markup_to_label I, [2024-05-08T02:58:38.305576 #3183965] INFO -- : [122/885] 3225342=test_gem_resolver_local_specification I, [2024-05-08T02:58:38.309850 #3183965] INFO -- : [123/885] 3225351=test_httpheader I, [2024-05-08T02:58:38.329152 #3183965] INFO -- : [124/885] 3225352=test_rdoc_ri_driver I, [2024-05-08T02:58:38.346276 #3183965] INFO -- : [125/885] 3225351=test_set_len I, [2024-05-08T02:58:38.359442 #3183965] INFO -- : [126/885] 3225351=test_httpresponses I, [2024-05-08T02:58:38.359633 #3183965] INFO -- : [127/885] 3225341=test_encoding I, [2024-05-08T02:58:38.360692 #3183965] INFO -- : [128/885] 3225351=test_chilled I, [2024-05-08T02:58:38.362497 #3183965] INFO -- : [129/885] 3225351=test_name_error_extension I, [2024-05-08T02:58:38.369687 #3183965] INFO -- : [130/885] 3225351=test_rdoc_i18n_locale I, [2024-05-08T02:58:38.375462 #3183965] INFO -- : [131/885] 3225342=test_document I, [2024-05-08T02:58:38.378775 #3183965] INFO -- : [132/885] 3225341=test_acceptable I, [2024-05-08T02:58:38.381837 #3183965] INFO -- : [133/885] 3225342=test_rdoc_generator_pot_po_entry I, [2024-05-08T02:58:38.386235 #3183965] INFO -- : [134/885] 3225342=test_euc_jp I, [2024-05-08T02:58:38.390100 #3183965] INFO -- : [135/885] 3225342=test_pair I, [2024-05-08T02:58:38.428467 #3183965] INFO -- : [136/885] 3225356=test_gem_commands_yank_command I, [2024-05-08T02:58:38.454879 #3183965] INFO -- : [137/885] 3225351=test_win32ole_param I, [2024-05-08T02:58:38.457983 #3183965] INFO -- : [138/885] 3225351=test_rbconfig I, [2024-05-08T02:58:38.484107 #3183965] INFO -- : [139/885] 3225351=test_primitive I, [2024-05-08T02:58:38.502959 #3183965] INFO -- : [140/885] 3225351=test_human_typo I, [2024-05-08T02:58:38.503079 #3183965] INFO -- : [141/885] 3225351=test_gem_resolver_vendor_specification I, [2024-05-08T02:58:38.514046 #3183965] INFO -- : [142/885] 3225349=test_gem_commands_update_command I, [2024-05-08T02:58:38.530621 #3183965] INFO -- : [143/885] 3225351=test_gem_uri I, [2024-05-08T02:58:38.539345 #3183965] INFO -- : [144/885] 3225341=test_key_event_record I, [2024-05-08T02:58:38.542881 #3183965] INFO -- : [145/885] 3225341=test_notimplement I, [2024-05-08T02:58:38.545938 #3183965] INFO -- : [146/885] 3225343=test_random I, [2024-05-08T02:58:38.552982 #3183965] INFO -- : [147/885] 3225343=test_ssl_session I, [2024-05-08T02:58:38.554975 #3183965] INFO -- : [148/885] 3225341=test_lexer I, [2024-05-08T02:58:38.556536 #3183965] INFO -- : [149/885] 3225352=test_thread_cv I, [2024-05-08T02:58:38.564338 #3183965] INFO -- : [150/885] 3225351=test_rdoc_generator_pot I, [2024-05-08T02:58:38.566610 #3183965] INFO -- : [151/885] 3225341=test_enumerator I, [2024-05-08T02:58:38.580307 #3183965] INFO -- : [152/885] 3225341=test_rdoc_parser_changelog I, [2024-05-08T02:58:38.599828 #3183965] INFO -- : [153/885] 3225351=parameters_signature_test I, [2024-05-08T02:58:38.621456 #3183965] INFO -- : [154/885] 3225350=test_koi8 I, [2024-05-08T02:58:38.629839 #3183965] INFO -- : [155/885] 3225350=test_unicode I, [2024-05-08T02:58:38.665025 #3183965] INFO -- : [156/885] 3225351=test_rdoc_method_attr I, [2024-05-08T02:58:38.683722 #3183965] INFO -- : [157/885] 3225350=test_filter I, [2024-05-08T02:58:38.717309 #3183965] INFO -- : [158/885] 3225350=test_gem_gem_runner I, [2024-05-08T02:58:38.765081 #3183965] INFO -- : [159/885] 3225341=test_data I, [2024-05-08T02:58:38.772370 #3183965] INFO -- : [160/885] 3225341=static_literals_test I, [2024-05-08T02:58:38.774292 #3183965] INFO -- : [161/885] 3225351=test_tree_spell_checker I, [2024-05-08T02:58:38.802631 #3183965] INFO -- : [162/885] 3225351=test_http I, [2024-05-08T02:58:38.821858 #3183965] INFO -- : [163/885] 3225341=test_addrinfo I, [2024-05-08T02:58:38.838189 #3183965] INFO -- : [164/885] 3225341=test_bn I, [2024-05-08T02:58:38.851964 #3183965] INFO -- : [165/885] 3225341=test_win32ole_param_event I, [2024-05-08T02:58:38.853012 #3183965] INFO -- : [166/885] 3225341=test_path I, [2024-05-08T02:58:38.860733 #3183965] INFO -- : [167/885] 3225341=redundant_return_test I, [2024-05-08T02:58:38.863654 #3183965] INFO -- : [168/885] 3225341=test_case_mapping I, [2024-05-08T02:58:38.867178 #3183965] INFO -- : [169/885] 3225341=test_terminfo I, [2024-05-08T02:58:38.867684 #3183965] INFO -- : [170/885] 3225341=test_compile_prism I, [2024-05-08T02:58:38.982479 #3183965] INFO -- : [171/885] 3225350=test_bug-14834 I, [2024-05-08T02:58:39.031751 #3183965] INFO -- : [172/885] 3225350=test_date_compat I, [2024-05-08T02:58:39.034609 #3183965] INFO -- : [173/885] 3225350=test_rdoc_markup_to_html I, [2024-05-08T02:58:39.087307 #3183965] INFO -- : [174/885] 3225354=test_scheduler I, [2024-05-08T02:58:39.100974 #3183965] INFO -- : [175/885] 3225341=test_ocsp I, [2024-05-08T02:58:39.114174 #3183965] INFO -- : [176/885] 3225356=test_class I, [2024-05-08T02:58:39.141626 #3183965] INFO -- : [177/885] 3225356=test_pkey_dsa I, [2024-05-08T02:58:39.189321 #3183965] INFO -- : [178/885] 3225352=test_exception_at_throwing I, [2024-05-08T02:58:39.225411 #3183965] INFO -- : [179/885] 3225350=test_iseq I, [2024-05-08T02:58:39.237229 #3183965] INFO -- : [180/885] 3225354=test_rdoc_markup_heading I, [2024-05-08T02:58:39.247796 #3183965] INFO -- : [181/885] 3225352=test_append I, [2024-05-08T02:58:39.251797 #3183965] INFO -- : [182/885] 3225352=test_option I, [2024-05-08T02:58:39.294889 #3183965] INFO -- : [183/885] 3225355=test_cmethod I, [2024-05-08T02:58:39.299685 #3183965] INFO -- : [184/885] 3225355=test_tracer I, [2024-05-08T02:58:39.359319 #3183965] INFO -- : [185/885] 3225354=test_io_m17n I, [2024-05-08T02:58:39.362291 #3183965] INFO -- : [186/885] 3225341=test_variable_name_check I, [2024-05-08T02:58:39.380167 #3183965] INFO -- : [187/885] 3225355=test_did_you_mean I, [2024-05-08T02:58:39.387334 #3183965] INFO -- : [188/885] 3225341=test_gem_commands_server_command I, [2024-05-08T02:58:39.397917 #3183965] INFO -- : [189/885] 3225341=test_interned_str I, [2024-05-08T02:58:39.400036 #3183965] INFO -- : [190/885] 3225341=test_case_comprehensive I, [2024-05-08T02:58:39.408693 #3183965] INFO -- : [191/885] 3225352=test_gem_commands_build_command I, [2024-05-08T02:58:39.429660 #3183965] INFO -- : [192/885] 3225346=test_multi_irb_commands I, [2024-05-08T02:58:39.438820 #3183965] INFO -- : [193/885] 3225346=test_fiber I, [2024-05-08T02:58:39.510423 #3183965] INFO -- : [194/885] 3225355=test_open3 I, [2024-05-08T02:58:39.511774 #3183965] INFO -- : [195/885] 3225343=test_bundled_ca I, [2024-05-08T02:58:39.638946 #3183965] INFO -- : [196/885] 3225349=test_closure I, [2024-05-08T02:58:39.703005 #3183965] INFO -- : [197/885] 3225357=test_digest I, [2024-05-08T02:58:39.706054 #3183965] INFO -- : [198/885] 3225357=test_ractor I, [2024-05-08T02:58:39.723298 #3183965] INFO -- : [199/885] 3225352=test_rdoc_servlet I, [2024-05-08T02:58:39.759406 #3183965] INFO -- : [200/885] 3225359=test_gem_security I, [2024-05-08T02:58:39.764455 #3183965] INFO -- : [201/885] 3225357=test_recursion I, [2024-05-08T02:58:39.769418 #3183965] INFO -- : [202/885] 3225357=test_exit I, [2024-05-08T02:58:39.774772 #3183965] INFO -- : [203/885] 3225356=test_delegate I, [2024-05-08T02:58:39.788350 #3183965] INFO -- : [204/885] 3225356=test_popen_deadlock I, [2024-05-08T02:58:39.832662 #3183965] INFO -- : [205/885] 3225350=test_history I, [2024-05-08T02:58:39.874254 #3183965] INFO -- : [206/885] 3225352=test_mkmf I, [2024-05-08T02:58:39.884461 #3183965] INFO -- : [207/885] 3225350=test_date_marshal I, [2024-05-08T02:58:39.885323 #3183965] INFO -- : [208/885] 3225350=test_pinned I, [2024-05-08T02:58:39.900073 #3183965] INFO -- : [209/885] 3225352=test_rdoc_markup_pre_process I, [2024-05-08T02:58:39.900942 #3183965] INFO -- : [210/885] 3225349=test_printf I, [2024-05-08T02:58:39.910087 #3183965] INFO -- : [211/885] 3225350=test_to_ary_concat I, [2024-05-08T02:58:39.916636 #3183965] INFO -- : [212/885] 3225349=test_webauthn_listener_response I, [2024-05-08T02:58:39.927879 #3183965] INFO -- : [213/885] 3225349=test_time I, [2024-05-08T02:58:39.956404 #3183965] INFO -- : [214/885] 3225352=test_stream I, [2024-05-08T02:58:39.963457 #3183965] INFO -- : [215/885] 3225352=test_files_lib I, [2024-05-08T02:58:40.027160 #3183965] INFO -- : [216/885] 3225357=test_gem_commands_unpack_command I, [2024-05-08T02:58:40.046454 #3183965] INFO -- : [217/885] 3225348=test_beginendblock I, [2024-05-08T02:58:40.067970 #3183965] INFO -- : [218/885] 3225353=test_help I, [2024-05-08T02:58:40.073196 #3183965] INFO -- : [219/885] 3225353=test_rdoc_markup_to_bs I, [2024-05-08T02:58:40.083305 #3183965] INFO -- : [220/885] 3225349=test_emoji_breaks I, [2024-05-08T02:58:40.090863 #3183965] INFO -- : [221/885] 3225349=test_gem_bundler_version_finder I, [2024-05-08T02:58:40.117159 #3183965] INFO -- : [222/885] 3225349=test_within_pipe I, [2024-05-08T02:58:40.144186 #3183965] INFO -- : [223/885] 3225349=reflection_test I, [2024-05-08T02:58:40.185586 #3183965] INFO -- : [224/885] 3225353=test_ts I, [2024-05-08T02:58:40.209194 #3183965] INFO -- : [225/885] 3225349=test_ensured I, [2024-05-08T02:58:40.241583 #3183965] INFO -- : [226/885] 3225344=library_symbols_test I, [2024-05-08T02:58:40.241768 #3183965] INFO -- : [227/885] 3225344=test_locale I, [2024-05-08T02:58:40.280497 #3183965] INFO -- : [228/885] 3225349=test_addr I, [2024-05-08T02:58:40.287908 #3183965] INFO -- : [229/885] 3225349=test_rdoc_ri_paths I, [2024-05-08T02:58:40.323543 #3183965] INFO -- : [230/885] 3225349=test_project_sanity I, [2024-05-08T02:58:40.340304 #3183965] INFO -- : [231/885] 3225357=test_range I, [2024-05-08T02:58:40.373675 #3183965] INFO -- : [232/885] 3225349=test_constant I, [2024-05-08T02:58:40.383786 #3183965] INFO -- : [233/885] 3225344=test_pty I, [2024-05-08T02:58:40.394797 #3183965] INFO -- : [234/885] 3225347=test_dup I, [2024-05-08T02:58:40.449029 #3183965] INFO -- : [235/885] 3225348=command_line_test I, [2024-05-08T02:58:40.458895 #3183965] INFO -- : [236/885] 3225356=test_gem_uri_formatter I, [2024-05-08T02:58:40.482762 #3183965] INFO -- : [237/885] 3225356=test_helper I, [2024-05-08T02:58:40.485306 #3183965] INFO -- : [238/885] 3225356=test_erb_command I, [2024-05-08T02:58:40.532882 #3183965] INFO -- : [239/885] 3225356=test_encoding I, [2024-05-08T02:58:40.537037 #3183965] INFO -- : [240/885] 3225348=static_inspect_test I, [2024-05-08T02:58:40.545031 #3183965] INFO -- : [241/885] 3225348=test_data_error I, [2024-05-08T02:58:40.551092 #3183965] INFO -- : [242/885] 3225345=bom_test I, [2024-05-08T02:58:40.556412 #3183965] INFO -- : [243/885] 3225350=test_file I, [2024-05-08T02:58:40.559881 #3183965] INFO -- : [244/885] 3225345=test_force_exit I, [2024-05-08T02:58:40.586450 #3183965] INFO -- : [245/885] 3225347=test_ostruct I, [2024-05-08T02:58:40.602176 #3183965] INFO -- : [246/885] 3225348=unescape_test I, [2024-05-08T02:58:40.696833 #3183965] INFO -- : [247/885] 3225345=test_udp I, [2024-05-08T02:58:40.699665 #3183965] INFO -- : [248/885] 3225345=test_vm_dump I, [2024-05-08T02:58:40.699903 #3183965] INFO -- : [249/885] 3225345=test_rdoc_markup_document I, [2024-05-08T02:58:40.704786 #3183965] INFO -- : [250/885] 3225353=test_integer_comb I, [2024-05-08T02:58:40.748325 #3183965] INFO -- : [251/885] 3225356=test_tmpdir I, [2024-05-08T02:58:40.779784 #3183965] INFO -- : [252/885] 3225347=errors_test I, [2024-05-08T02:58:40.792025 #3183965] INFO -- : [253/885] 3225354=test_gem_commands_check_command I, [2024-05-08T02:58:40.813186 #3183965] INFO -- : [254/885] 3225354=test_regexp I, [2024-05-08T02:58:40.839654 #3183965] INFO -- : [255/885] 3225356=test_webauthn_listener I, [2024-05-08T02:58:40.868474 #3183965] INFO -- : [256/885] 3225345=test_gem_request_set_gem_dependency_api I, [2024-05-08T02:58:40.893277 #3183965] INFO -- : [257/885] 3225356=test_ast I, [2024-05-08T02:58:40.930299 #3183965] INFO -- : [258/885] 3225344=test_lambda I, [2024-05-08T02:58:40.958148 #3183965] INFO -- : [259/885] 3225347=test_random_formatter I, [2024-05-08T02:58:40.989931 #3183965] INFO -- : [260/885] 3225347=test_helper I, [2024-05-08T02:58:40.993417 #3183965] INFO -- : [261/885] 3225347=test_jaro_winkler I, [2024-05-08T02:58:41.004157 #3183965] INFO -- : [262/885] 3225347=test_update I, [2024-05-08T02:58:41.006533 #3183965] INFO -- : [263/885] 3225347=test_fips I, [2024-05-08T02:58:41.036259 #3183965] INFO -- : [264/885] 3225344=test_x509name I, [2024-05-08T02:58:41.037384 #3183965] INFO -- : [265/885] 3225357=test_rdoc_code_object I, [2024-05-08T02:58:41.046436 #3183965] INFO -- : [266/885] 3225344=test_x509store I, [2024-05-08T02:58:41.076581 #3183965] INFO -- : [267/885] 3225360=test_eval I, [2024-05-08T02:58:41.130309 #3183965] INFO -- : [268/885] 3225345=json_generator_test I, [2024-05-08T02:58:41.226412 #3183965] INFO -- : [269/885] 3225343=test_transcode I, [2024-05-08T02:58:41.234821 #3183965] INFO -- : [270/885] 3225345=test_gem_safe_marshal I, [2024-05-08T02:58:41.235387 #3183965] INFO -- : [271/885] 3225347=test_gem_resolver_api_set I, [2024-05-08T02:58:41.246233 #3183965] INFO -- : [272/885] 3225360=test_config I, [2024-05-08T02:58:41.339546 #3183965] INFO -- : [273/885] 3225344=test_gem_resolver_vendor_set I, [2024-05-08T02:58:41.376402 #3183965] INFO -- : [274/885] 3225344=test_enumerable I, [2024-05-08T02:58:41.405508 #3183965] INFO -- : [275/885] 3225344=test_rdoc_parser_markdown I, [2024-05-08T02:58:41.418926 #3183965] INFO -- : [276/885] 3225347=test_import I, [2024-05-08T02:58:41.436627 #3183965] INFO -- : [277/885] 3225343=test_gem_resolver_lock_set I, [2024-05-08T02:58:41.447255 #3183965] INFO -- : [278/885] 3225344=test_not I, [2024-05-08T02:58:41.452883 #3183965] INFO -- : [279/885] 3225344=test_logger I, [2024-05-08T02:58:41.474031 #3183965] INFO -- : [280/885] 3225343=test_file_exhaustive I, [2024-05-08T02:58:41.475869 #3183965] INFO -- : [281/885] 3225344=test_gem_update_suggestion I, [2024-05-08T02:58:41.550293 #3183965] INFO -- : [282/885] 3225344=test_files_test I, [2024-05-08T02:58:41.607971 #3183965] INFO -- : [283/885] 3225348=test_fd_setsize I, [2024-05-08T02:58:41.608242 #3183965] INFO -- : [284/885] 3225348=test_continuation I, [2024-05-08T02:58:41.610935 #3183965] INFO -- : [285/885] 3225344=test_class_name_check I, [2024-05-08T02:58:41.614500 #3183965] INFO -- : [286/885] 3225348=test_keyword I, [2024-05-08T02:58:41.627106 #3183965] INFO -- : [287/885] 3225344=test_delete I, [2024-05-08T02:58:41.633880 #3183965] INFO -- : [288/885] 3225344=test_win32ole_method I, [2024-05-08T02:58:41.638855 #3183965] INFO -- : [289/885] 3225344=test_date_strptime I, [2024-05-08T02:58:41.657838 #3183965] INFO -- : [290/885] 3225357=test_gem_package_task I, [2024-05-08T02:58:41.664312 #3183965] INFO -- : [291/885] 3225357=test_placearg I, [2024-05-08T02:58:41.683698 #3183965] INFO -- : [292/885] 3225342=test_rdoc_markup_hard_break I, [2024-05-08T02:58:41.689625 #3183965] INFO -- : [293/885] 3225342=test_gem_platform I, [2024-05-08T02:58:41.769210 #3183965] INFO -- : [294/885] 3225342=test_pkey_rsa I, [2024-05-08T02:58:41.774657 #3183965] INFO -- : [295/885] 3225360=test_weakkeymap I, [2024-05-08T02:58:41.791100 #3183965] INFO -- : [296/885] 3225345=test_gem_commands_push_command I, [2024-05-08T02:58:41.814315 #3183965] INFO -- : [297/885] 3225344=test_numhash I, [2024-05-08T02:58:41.822001 #3183965] INFO -- : [298/885] 3225344=test_rdoc_rd_block_parser I, [2024-05-08T02:58:41.824395 #3183965] INFO -- : [299/885] 3225357=test_signedness I, [2024-05-08T02:58:41.855028 #3183965] INFO -- : [300/885] 3225344=test_tsort I, [2024-05-08T02:58:41.863842 #3183965] INFO -- : [301/885] 3225344=test_ractor I, [2024-05-08T02:58:41.903283 #3183965] INFO -- : [302/885] 3225360=test_type I, [2024-05-08T02:58:41.908780 #3183965] INFO -- : [303/885] 3225360=test_pointer I, [2024-05-08T02:58:41.924662 #3183965] INFO -- : [304/885] 3225344=test_func I, [2024-05-08T02:58:42.007787 #3183965] INFO -- : [305/885] 3225342=test_big5 I, [2024-05-08T02:58:42.012884 #3183965] INFO -- : [306/885] 3225342=test_date_arith I, [2024-05-08T02:58:42.013651 #3183965] INFO -- : [307/885] 3225355=test_ruby_lex I, [2024-05-08T02:58:42.020836 #3183965] INFO -- : [308/885] 3225342=test_object I, [2024-05-08T02:58:42.079209 #3183965] INFO -- : [309/885] 3225348=test_gem_local_remote_options I, [2024-05-08T02:58:42.177584 #3183965] INFO -- : [310/885] 3225355=test_sleep I, [2024-05-08T02:58:42.199121 #3183965] INFO -- : [311/885] 3225347=test_change_word I, [2024-05-08T02:58:42.201275 #3183965] INFO -- : [312/885] 3225347=compiler_test I, [2024-05-08T02:58:42.208327 #3183965] INFO -- : [313/885] 3225347=test_flip I, [2024-05-08T02:58:42.240947 #3183965] INFO -- : [314/885] 3225347=test_timeout I, [2024-05-08T02:58:42.247307 #3183965] INFO -- : [315/885] 3225347=test_ossl I, [2024-05-08T02:58:42.261321 #3183965] INFO -- : [316/885] 3225348=test_normalize I, [2024-05-08T02:58:42.263323 #3183965] INFO -- : [317/885] 3225348=test_arithmetic_sequence I, [2024-05-08T02:58:42.273095 #3183965] INFO -- : [318/885] 3225348=test_key_actor_emacs I, [2024-05-08T02:58:42.278493 #3183965] INFO -- : [319/885] 3225360=test_gem_gemcutter_utilities I, [2024-05-08T02:58:42.302492 #3183965] INFO -- : [320/885] 3225345=test_basicinstructions I, [2024-05-08T02:58:42.377733 #3183965] INFO -- : [321/885] 3225345=test_gem_command_manager I, [2024-05-08T02:58:42.380295 #3183965] INFO -- : [322/885] 3225348=version_test I, [2024-05-08T02:58:42.385185 #3183965] INFO -- : [323/885] 3225348=test_cgi_header I, [2024-05-08T02:58:42.393482 #3183965] INFO -- : [324/885] 3225348=heredoc_dedent_test I, [2024-05-08T02:58:42.399796 #3183965] INFO -- : [325/885] 3225348=test_object I, [2024-05-08T02:58:42.421349 #3183965] INFO -- : [326/885] 3225348=test_gem_resolver_api_specification I, [2024-05-08T02:58:42.465617 #3183965] INFO -- : [327/885] 3225348=test_win32ole_variant I, [2024-05-08T02:58:42.476026 #3183965] INFO -- : [328/885] 3225348=test_ipaddr I, [2024-05-08T02:58:42.496590 #3183965] INFO -- : [329/885] 3225348=test_history I, [2024-05-08T02:58:42.499536 #3183965] INFO -- : [330/885] 3225342=test_mixed_unicode_escapes I, [2024-05-08T02:58:42.501162 #3183965] INFO -- : [331/885] 3225342=test_rdoc_markup_to_ansi I, [2024-05-08T02:58:42.507688 #3183965] INFO -- : [332/885] 3225348=test_rdoc_extend I, [2024-05-08T02:58:42.519120 #3183965] INFO -- : [333/885] 3225345=test_merge_keys I, [2024-05-08T02:58:42.525387 #3183965] INFO -- : [334/885] 3225345=test_have_macro I, [2024-05-08T02:58:42.537782 #3183965] INFO -- : [335/885] 3225342=test_resolve_symbol I, [2024-05-08T02:58:42.603205 #3183965] INFO -- : [336/885] 3225342=test_complex2 I, [2024-05-08T02:58:42.610107 #3183965] INFO -- : [337/885] 3225342=test_gem_package I, [2024-05-08T02:58:42.634663 #3183965] INFO -- : [338/885] 3225360=test_gem_specification I, [2024-05-08T02:58:42.664490 #3183965] INFO -- : [339/885] 3225348=test_enum I, [2024-05-08T02:58:42.874934 #3183965] INFO -- : [340/885] 3225349=test_threadgroup I, [2024-05-08T02:58:42.890946 #3183965] INFO -- : [341/885] 3225344=test_bignum I, [2024-05-08T02:58:42.968985 #3183965] INFO -- : [342/885] 3225344=test_rdoc_class_module I, [2024-05-08T02:58:42.999704 #3183965] INFO -- : [343/885] 3225345=test_gem_ci_detector I, [2024-05-08T02:58:43.004564 #3183965] INFO -- : [344/885] 3225345=test_win32ole_variable I, [2024-05-08T02:58:43.007477 #3183965] INFO -- : [345/885] 3225345=test_arity I, [2024-05-08T02:58:43.012823 #3183965] INFO -- : [346/885] 3225345=test_stringio I, [2024-05-08T02:58:43.109452 #3183965] INFO -- : [347/885] 3225345=test_io_wait_uncommon I, [2024-05-08T02:58:43.113234 #3183965] INFO -- : [348/885] 3225345=ractor_test I, [2024-05-08T02:58:43.133303 #3183965] INFO -- : [349/885] 3225342=test_trace I, [2024-05-08T02:58:43.149582 #3183965] INFO -- : [350/885] 3225342=test_rdoc_generator_json_index I, [2024-05-08T02:58:43.154566 #3183965] INFO -- : [351/885] 3225345=test_time_tz I, [2024-05-08T02:58:43.177532 #3183965] INFO -- : [352/885] 3225342=test_win32ole_event I, [2024-05-08T02:58:43.186564 #3183965] INFO -- : [353/885] 3225342=ruby_api_test I, [2024-05-08T02:58:43.220960 #3183965] INFO -- : [354/885] 3225345=test_find_executable I, [2024-05-08T02:58:43.225180 #3183965] INFO -- : [355/885] 3225345=test_coder I, [2024-05-08T02:58:43.241679 #3183965] INFO -- : [356/885] 3225345=test_symbol I, [2024-05-08T02:58:43.307769 #3183965] INFO -- : [357/885] 3225344=test_gem_commands_pristine_command I, [2024-05-08T02:58:43.366603 #3183965] INFO -- : [358/885] 3225342=test_context I, [2024-05-08T02:58:43.433735 #3183965] INFO -- : [359/885] 3225342=test_nofree I, [2024-05-08T02:58:43.438576 #3183965] INFO -- : [360/885] 3225342=test_unix I, [2024-05-08T02:58:43.459260 #3183965] INFO -- : [361/885] 3225342=test_lazy_enumerator I, [2024-05-08T02:58:43.618788 #3183965] INFO -- : [362/885] 3225348=test_enc_associate I, [2024-05-08T02:58:43.661286 #3183965] INFO -- : [363/885] 3225353=test_pkcs7 I, [2024-05-08T02:58:43.856050 #3183965] INFO -- : [364/885] 3225353=test_gem_resolver_requirement_list I, [2024-05-08T02:58:43.872463 #3183965] INFO -- : [365/885] 3225342=test_arith_seq_beg_len_step I, [2024-05-08T02:58:43.876021 #3183965] INFO -- : [366/885] 3225349=test_function_entry I, [2024-05-08T02:58:43.879515 #3183965] INFO -- : [367/885] 3225349=test_rdoc_generator_darkfish I, [2024-05-08T02:58:43.908195 #3183965] INFO -- : [368/885] 3225359=test_rdoc_comment I, [2024-05-08T02:58:43.937865 #3183965] INFO -- : [369/885] 3225342=test_resize I, [2024-05-08T02:58:43.946005 #3183965] INFO -- : [370/885] 3225342=test_error_highlight I, [2024-05-08T02:58:44.028369 #3183965] INFO -- : [371/885] 3225359=test_http_request I, [2024-05-08T02:58:44.035992 #3183965] INFO -- : [372/885] 3225353=json_generic_object_test I, [2024-05-08T02:58:44.045701 #3183965] INFO -- : [373/885] 3225357=test_gem_source_fetch_problem I, [2024-05-08T02:58:44.052619 #3183965] INFO -- : [374/885] 3225353=test_coderange I, [2024-05-08T02:58:44.057326 #3183965] INFO -- : [375/885] 3225357=location_test I, [2024-05-08T02:58:44.059138 #3183965] INFO -- : [376/885] 3225353=test_symbol I, [2024-05-08T02:58:44.070718 #3183965] INFO -- : [377/885] 3225359=test_mailto I, [2024-05-08T02:58:44.077479 #3183965] INFO -- : [378/885] 3225359=test_ractor_compatibility I, [2024-05-08T02:58:44.081119 #3183965] INFO -- : [379/885] 3225353=test_dir I, [2024-05-08T02:58:44.103851 #3183965] INFO -- : [380/885] 3225357=format_errors_test I, [2024-05-08T02:58:44.109414 #3183965] INFO -- : [381/885] 3225357=test_gem_console_ui I, [2024-05-08T02:58:44.120349 #3183965] INFO -- : [382/885] 3225357=test_date_ractor I, [2024-05-08T02:58:44.124726 #3183965] INFO -- : [383/885] 3225348=test_autoconf I, [2024-05-08T02:58:44.126381 #3183965] INFO -- : [384/885] 3225348=test_eval I, [2024-05-08T02:58:44.130104 #3183965] INFO -- : [385/885] 3225348=test_numeric I, [2024-05-08T02:58:44.134104 #3183965] INFO -- : [386/885] 3225348=test_member I, [2024-05-08T02:58:44.135616 #3183965] INFO -- : [387/885] 3225348=test_cgi_multipart I, [2024-05-08T02:58:44.136113 #3183965] INFO -- : [388/885] 3225349=test_word I, [2024-05-08T02:58:44.140652 #3183965] INFO -- : [389/885] 3225349=test_gem_commands_cleanup_command I, [2024-05-08T02:58:44.255243 #3183965] INFO -- : [390/885] 3225348=test_gem_commands_setup_command I, [2024-05-08T02:58:44.309414 #3183965] INFO -- : [391/885] 3225352=test_env I, [2024-05-08T02:58:44.352496 #3183965] INFO -- : [392/885] 3225353=test_rdoc_attr I, [2024-05-08T02:58:44.366209 #3183965] INFO -- : [393/885] 3225353=test_dryrun I, [2024-05-08T02:58:44.385618 #3183965] INFO -- : [394/885] 3225353=test_integer I, [2024-05-08T02:58:44.396346 #3183965] INFO -- : [395/885] 3225357=desugar_compiler_test I, [2024-05-08T02:58:44.408923 #3183965] INFO -- : [396/885] 3225357=test_stat I, [2024-05-08T02:58:44.420213 #3183965] INFO -- : [397/885] 3225357=test_gem_request_set_lockfile_tokenizer I, [2024-05-08T02:58:44.430976 #3183965] INFO -- : [398/885] 3225344=test_have_func I, [2024-05-08T02:58:44.456027 #3183965] INFO -- : [399/885] 3225353=test_nextafter I, [2024-05-08T02:58:44.470095 #3183965] INFO -- : [400/885] 3225359=test_capacity I, [2024-05-08T02:58:44.474936 #3183965] INFO -- : [401/885] 3225357=test_object_references I, [2024-05-08T02:58:44.475801 #3183965] INFO -- : [402/885] 3225359=test_usrmarshal I, [2024-05-08T02:58:44.486430 #3183965] INFO -- : [403/885] 3225357=test_gem_resolver_git_specification I, [2024-05-08T02:58:44.521733 #3183965] INFO -- : [404/885] 3225342=test_super I, [2024-05-08T02:58:44.528671 #3183965] INFO -- : [405/885] 3225353=test_rubyoptions I, [2024-05-08T02:58:44.572297 #3183965] INFO -- : [406/885] 3225349=test_cgi_modruby I, [2024-05-08T02:58:44.578914 #3183965] INFO -- : [407/885] 3225349=test_integer I, [2024-05-08T02:58:44.724559 #3183965] INFO -- : [408/885] 3225359=test_call I, [2024-05-08T02:58:44.744053 #3183965] INFO -- : [409/885] 3225357=test_https_proxy I, [2024-05-08T02:58:44.747642 #3183965] INFO -- : [410/885] 3225357=test_rubygems I, [2024-05-08T02:58:44.769815 #3183965] INFO -- : [411/885] 3225348=test_alias I, [2024-05-08T02:58:44.803054 #3183965] INFO -- : [412/885] 3225360=test_timeout I, [2024-05-08T02:58:44.859289 #3183965] INFO -- : [413/885] 3225359=test_marshal I, [2024-05-08T02:58:44.917640 #3183965] INFO -- : [414/885] 3225357=test_unicode_normalize I, [2024-05-08T02:58:44.925796 #3183965] INFO -- : [415/885] 3225348=test_weakref I, [2024-05-08T02:58:45.044538 #3183965] INFO -- : [416/885] 3225348=test_nonblock I, [2024-05-08T02:58:45.057388 #3183965] INFO -- : [417/885] 3225348=test_rb_str_dup I, [2024-05-08T02:58:45.061712 #3183965] INFO -- : [418/885] 3225348=test_reline_key I, [2024-05-08T02:58:45.063619 #3183965] INFO -- : [419/885] 3225348=test_ancdata I, [2024-05-08T02:58:45.069952 #3183965] INFO -- : [420/885] 3225348=test_singleton_function I, [2024-05-08T02:58:45.071666 #3183965] INFO -- : [421/885] 3225348=test_ssl I, [2024-05-08T02:58:45.123235 #3183965] INFO -- : [422/885] 3225342=test_my_integer I, [2024-05-08T02:58:45.127791 #3183965] INFO -- : [423/885] 3225342=json_ext_parser_test I, [2024-05-08T02:58:45.139332 #3183965] INFO -- : [424/885] 3225342=test_thread I, [2024-05-08T02:58:45.389760 #3183965] INFO -- : [425/885] 3225359=test_debugger_integration I, [2024-05-08T02:58:45.397113 #3183965] INFO -- : [426/885] 3225345=test_rendering I, [2024-05-08T02:58:45.404390 #3183965] INFO -- : [427/885] 3225359=test_ractor I, [2024-05-08T02:58:45.406070 #3183965] INFO -- : [428/885] 3225345=parse_stream_test I, [2024-05-08T02:58:45.414196 #3183965] INFO -- : [429/885] 3225345=test_registry I, [2024-05-08T02:58:45.424804 #3183965] INFO -- : [430/885] 3225345=test_gem_source_lock I, [2024-05-08T02:58:45.447387 #3183965] INFO -- : [431/885] 3225346=test_gem I, [2024-05-08T02:58:45.465358 #3183965] INFO -- : [432/885] 3225345=test_ractor I, [2024-05-08T02:58:45.482140 #3183965] INFO -- : [433/885] 3225345=test_gem_commands_open_command I, [2024-05-08T02:58:45.560513 #3183965] INFO -- : [434/885] 3225360=test_dns I, [2024-05-08T02:58:45.591771 #3183965] INFO -- : [435/885] 3225348=test_cgi_core I, [2024-05-08T02:58:45.594287 #3183965] INFO -- : [436/885] 3225345=test_parser I, [2024-05-08T02:58:45.601201 #3183965] INFO -- : [437/885] 3225348=test_gem_text I, [2024-05-08T02:58:45.616366 #3183965] INFO -- : [438/885] 3225345=test_settracefunc I, [2024-05-08T02:58:45.671102 #3183965] INFO -- : [439/885] 3225348=test_enumerator_kw I, [2024-05-08T02:58:45.676425 #3183965] INFO -- : [440/885] 3225348=test_scan_args I, [2024-05-08T02:58:45.691249 #3183965] INFO -- : [441/885] 3225348=test_generic I, [2024-05-08T02:58:45.708404 #3183965] INFO -- : [442/885] 3225348=test_win32ole I, [2024-05-08T02:58:45.711770 #3183965] INFO -- : [443/885] 3225348=test_sprintf_comb I, [2024-05-08T02:58:45.825009 #3183965] INFO -- : [444/885] 3225359=test_method_cache I, [2024-05-08T02:58:45.827337 #3183965] INFO -- : [445/885] 3225359=test_gem_request I, [2024-05-08T02:58:45.837735 #3183965] INFO -- : [446/885] 3225358=test_gem_commands_mirror I, [2024-05-08T02:58:45.842022 #3183965] INFO -- : [447/885] 3225344=test_gem_ext_cargo_builder_link_flag_converter I, [2024-05-08T02:58:45.849217 #3183965] INFO -- : [448/885] 3225348=test_rand I, [2024-05-08T02:58:45.923153 #3183965] INFO -- : [449/885] 3225344=test_gem_package_tar_reader_entry I, [2024-05-08T02:58:45.946913 #3183965] INFO -- : [450/885] 3225359=test_gem_name_tuple I, [2024-05-08T02:58:45.953013 #3183965] INFO -- : [451/885] 3225359=test_bug_reporter I, [2024-05-08T02:58:45.962931 #3183965] INFO -- : [452/885] 3225358=test_exception I, [2024-05-08T02:58:46.038971 #3183965] INFO -- : [453/885] 3225360=test_store I, [2024-05-08T02:58:46.139271 #3183965] INFO -- : [454/885] 3225344=test_case_options I, [2024-05-08T02:58:46.140022 #3183965] INFO -- : [455/885] 3225344=test_gem_dependency_installer I, [2024-05-08T02:58:46.156318 #3183965] INFO -- : [456/885] 3225360=test_scalar I, [2024-05-08T02:58:46.172415 #3183965] INFO -- : [457/885] 3225360=test_gem_commands_info_command I, [2024-05-08T02:58:46.179365 #3183965] INFO -- : [458/885] 3225348=test_rdoc_cross_reference I, [2024-05-08T02:58:46.184150 #3183965] INFO -- : [459/885] 3225360=test_thread I, [2024-05-08T02:58:46.310058 #3183965] INFO -- : [460/885] 3225359=test_socket I, [2024-05-08T02:58:46.381261 #3183965] INFO -- : [461/885] 3225343=test_objectspace I, [2024-05-08T02:58:46.407610 #3183965] INFO -- : [462/885] 3225360=test_rdoc_markup_to_table_of_contents I, [2024-05-08T02:58:46.484229 #3183965] INFO -- : [463/885] 3225348=test_str2big I, [2024-05-08T02:58:46.487833 #3183965] INFO -- : [464/885] 3225348=test_dot_dot I, [2024-05-08T02:58:46.491725 #3183965] INFO -- : [465/885] 3225348=test_c_struct_builder I, [2024-05-08T02:58:46.547025 #3183965] INFO -- : [466/885] 3225360=test_literal I, [2024-05-08T02:58:46.566177 #3183965] INFO -- : [467/885] 3225345=test_gem_stream_ui I, [2024-05-08T02:58:46.613519 #3183965] INFO -- : [468/885] 3225350=test_rdoc_generator_ri I, [2024-05-08T02:58:46.618203 #3183965] INFO -- : [469/885] 3225348=test_extlibs I, [2024-05-08T02:58:46.620585 #3183965] INFO -- : [470/885] 3225350=test_require_lib I, [2024-05-08T02:58:46.651934 #3183965] INFO -- : [471/885] 3225345=test_gem_install_update_options I, [2024-05-08T02:58:46.749287 #3183965] INFO -- : [472/885] 3225345=parse_test I, [2024-05-08T02:58:47.173457 #3183965] INFO -- : [473/885] 3225355=test_ractor I, [2024-05-08T02:58:47.199458 #3183965] INFO -- : [474/885] 3225355=test_severity I, [2024-05-08T02:58:47.204498 #3183965] INFO -- : [475/885] 3225355=test_rdoc_markup_to_markdown I, [2024-05-08T02:58:47.268167 #3183965] INFO -- : [476/885] 3225343=test_json_tree I, [2024-05-08T02:58:47.273850 #3183965] INFO -- : [477/885] 3225343=test_rdoc_generator_pot_po I, [2024-05-08T02:58:47.298499 #3183965] INFO -- : [478/885] 3225360=test_ansi_with_terminfo I, [2024-05-08T02:58:47.352775 #3183965] INFO -- : [479/885] 3225360=test_ractor I, [2024-05-08T02:58:47.372905 #3183965] INFO -- : [480/885] 3225355=test_m17n_comb I, [2024-05-08T02:58:47.381108 #3183965] INFO -- : [481/885] 3225352=test_memory_view I, [2024-05-08T02:58:47.406124 #3183965] INFO -- : [482/885] 3225360=test_gem_request_connection_pools I, [2024-05-08T02:58:47.426948 #3183965] INFO -- : [483/885] 3225343=test_grapheme_breaks I, [2024-05-08T02:58:47.481417 #3183965] INFO -- : [484/885] 3225343=test_gem_version_option I, [2024-05-08T02:58:47.517122 #3183965] INFO -- : [485/885] 3225352=test_cclass I, [2024-05-08T02:58:47.523978 #3183965] INFO -- : [486/885] 3225343=test_parser_events I, [2024-05-08T02:58:47.536651 #3183965] INFO -- : [487/885] 3225358=test_reline I, [2024-05-08T02:58:47.538505 #3183965] INFO -- : [488/885] 3225346=test_case I, [2024-05-08T02:58:47.546196 #3183965] INFO -- : [489/885] 3225346=test_pkey I, [2024-05-08T02:58:47.592055 #3183965] INFO -- : [490/885] 3225346=test_gc I, [2024-05-08T02:58:47.595962 #3183965] INFO -- : [491/885] 3225343=test_x509cert I, [2024-05-08T02:58:47.617191 #3183965] INFO -- : [492/885] 3225352=test_err_in_callback I, [2024-05-08T02:58:47.628281 #3183965] INFO -- : [493/885] 3225352=test_gem_resolver_lock_specification I, [2024-05-08T02:58:47.665630 #3183965] INFO -- : [494/885] 3225352=test_logdevice I, [2024-05-08T02:58:47.670459 #3183965] INFO -- : [495/885] 3225358=test_arity I, [2024-05-08T02:58:47.674497 #3183965] INFO -- : [496/885] 3225358=test_gem_ext_rake_builder I, [2024-05-08T02:58:47.681280 #3183965] INFO -- : [497/885] 3225349=test_gem_source_local I, [2024-05-08T02:58:47.839462 #3183965] INFO -- : [498/885] 3225359=test_gem_security_policy I, [2024-05-08T02:58:47.851426 #3183965] INFO -- : [499/885] 3225343=test_pack I, [2024-05-08T02:58:47.906827 #3183965] INFO -- : [500/885] 3225349=test_last_thread I, [2024-05-08T02:58:48.043323 #3183965] INFO -- : [501/885] 3225343=test_process I, [2024-05-08T02:58:48.147829 #3183965] INFO -- : [502/885] 3225359=test_thread_fd_close I, [2024-05-08T02:58:48.151050 #3183965] INFO -- : [503/885] 3225359=test_passing_block I, [2024-05-08T02:58:48.155600 #3183965] INFO -- : [504/885] 3225359=test_hash_create I, [2024-05-08T02:58:48.157564 #3183965] INFO -- : [505/885] 3225359=test_stringchar I, [2024-05-08T02:58:48.186964 #3183965] INFO -- : [506/885] 3225351=test_uncorrectable_name_check I, [2024-05-08T02:58:48.190781 #3183965] INFO -- : [507/885] 3225351=newline_test I, [2024-05-08T02:58:48.255339 #3183965] INFO -- : [508/885] 3225359=test_switch_hitter I, [2024-05-08T02:58:48.259691 #3183965] INFO -- : [509/885] 3225351=test_singleton I, [2024-05-08T02:58:48.264573 #3183965] INFO -- : [510/885] 3225351=test_flush I, [2024-05-08T02:58:48.269939 #3183965] INFO -- : [511/885] 3225351=test_io_console I, [2024-05-08T02:58:48.283342 #3183965] INFO -- : [512/885] 3225359=test_c_union_entity I, [2024-05-08T02:58:48.290545 #3183965] INFO -- : [513/885] 3225344=test_rdoc_normal_module I, [2024-05-08T02:58:48.327104 #3183965] INFO -- : [514/885] 3225344=test_rdoc_markdown_test I, [2024-05-08T02:58:48.336562 #3183965] INFO -- : [515/885] 3225359=test_logperiod I, [2024-05-08T02:58:48.343394 #3183965] INFO -- : [516/885] 3225348=test_securerandom I, [2024-05-08T02:58:48.345138 #3183965] INFO -- : [517/885] 3225359=test_data I, [2024-05-08T02:58:48.348090 #3183965] INFO -- : [518/885] 3225358=index_write_test I, [2024-05-08T02:58:48.352948 #3183965] INFO -- : [519/885] 3225359=test_date_new I, [2024-05-08T02:58:48.359931 #3183965] INFO -- : [520/885] 3225359=test_require I, [2024-05-08T02:58:48.361306 #3183965] INFO -- : [521/885] 3225359=test_date_time I, [2024-05-08T02:58:48.370546 #3183965] INFO -- : [522/885] 3225359=test_rdoc_markup_to_joined_paragraph I, [2024-05-08T02:58:48.377583 #3183965] INFO -- : [523/885] 3225359=test_gem_safe_yaml I, [2024-05-08T02:58:48.380398 #3183965] INFO -- : [524/885] 3225348=test_syntax I, [2024-05-08T02:58:48.386780 #3183965] INFO -- : [525/885] 3225359=test_rdoc_text I, [2024-05-08T02:58:48.425804 #3183965] INFO -- : [526/885] 3225359=test_iso_8859 I, [2024-05-08T02:58:48.435169 #3183965] INFO -- : [527/885] 3225358=test_tcp I, [2024-05-08T02:58:48.440516 #3183965] INFO -- : [528/885] 3225360=test_stream I, [2024-05-08T02:58:48.447181 #3183965] INFO -- : [529/885] 3225359=test_nil2vtempty I, [2024-05-08T02:58:48.447460 #3183965] INFO -- : [530/885] 3225359=test_rdoc_context I, [2024-05-08T02:58:48.458964 #3183965] INFO -- : [531/885] 3225360=test_rdoc_parser_ruby I, [2024-05-08T02:58:48.499420 #3183965] INFO -- : [532/885] 3225352=test_httpresponse I, [2024-05-08T02:58:48.502754 #3183965] INFO -- : [533/885] 3225358=test_open-uri I, [2024-05-08T02:58:48.572320 #3183965] INFO -- : [534/885] 3225352=test_rdoc_markup_attribute_manager I, [2024-05-08T02:58:48.601961 #3183965] INFO -- : [535/885] 3225352=test_name_error I, [2024-05-08T02:58:48.721543 #3183965] INFO -- : [536/885] 3225352=test_gem_resolver_composed_set I, [2024-05-08T02:58:48.736482 #3183965] INFO -- : [537/885] 3225352=test_safe_load I, [2024-05-08T02:58:48.749432 #3183965] INFO -- : [538/885] 3225352=test_gem_resolver I, [2024-05-08T02:58:48.979892 #3183965] INFO -- : [539/885] 3225349=test_gem_commands_dependency_command I, [2024-05-08T02:58:49.020689 #3183965] INFO -- : [540/885] 3225352=test_gem_commands_specification_command I, [2024-05-08T02:58:49.052664 #3183965] INFO -- : [541/885] 3225358=test_enumerator I, [2024-05-08T02:58:49.075369 #3183965] INFO -- : [542/885] 3225349=test_flags I, [2024-05-08T02:58:49.118329 #3183965] INFO -- : [543/885] 3225360=test_inadvertent_creation I, [2024-05-08T02:58:49.148860 #3183965] INFO -- : [544/885] 3225344=test_gem_commands_which_command I, [2024-05-08T02:58:49.154416 #3183965] INFO -- : [545/885] 3225352=test_shift_jis I, [2024-05-08T02:58:49.158281 #3183965] INFO -- : [546/885] 3225352=test_http I, [2024-05-08T02:58:49.163597 #3183965] INFO -- : [547/885] 3225352=test_at_exit I, [2024-05-08T02:58:49.176839 #3183965] INFO -- : [548/885] 3225344=test_command I, [2024-05-08T02:58:49.185918 #3183965] INFO -- : [549/885] 3225352=test_gem_ext_cargo_builder_unit I, [2024-05-08T02:58:49.204660 #3183965] INFO -- : [550/885] 3225352=test_gem_rdoc I, [2024-05-08T02:58:49.217507 #3183965] INFO -- : [551/885] 3225360=test_date I, [2024-05-08T02:58:49.220716 #3183965] INFO -- : [552/885] 3225360=test_object_create_start I, [2024-05-08T02:58:49.223191 #3183965] INFO -- : [553/885] 3225360=test_rdoc_markup_paragraph I, [2024-05-08T02:58:49.230910 #3183965] INFO -- : [554/885] 3225360=test_enc_raise I, [2024-05-08T02:58:49.231731 #3183965] INFO -- : [555/885] 3225359=test_psych I, [2024-05-08T02:58:49.232875 #3183965] INFO -- : [556/885] 3225360=!Nothing_to_test I, [2024-05-08T02:58:49.233160 #3183965] INFO -- : [557/885] 3225360=test_eval_history I, [2024-05-08T02:58:49.252473 #3183965] INFO -- : [558/885] 3225359=dispatcher_test I, [2024-05-08T02:58:49.290781 #3183965] INFO -- : [559/885] 3225357=test_kernel I, [2024-05-08T02:58:49.297634 #3183965] INFO -- : [560/885] 3225360=test_kdf I, [2024-05-08T02:58:49.301416 #3183965] INFO -- : [561/885] 3225352=test_gem_doctor I, [2024-05-08T02:58:49.327400 #3183965] INFO -- : [562/885] 3225359=test_gem_silent_ui I, [2024-05-08T02:58:49.340230 #3183965] INFO -- : [563/885] 3225352=test_emitter I, [2024-05-08T02:58:49.344302 #3183965] INFO -- : [564/885] 3225352=test_bug-5832 I, [2024-05-08T02:58:49.346476 #3183965] INFO -- : [565/885] 3225352=test_files_ext I, [2024-05-08T02:58:49.347464 #3183965] INFO -- : [566/885] 3225352=test_zsh_completion I, [2024-05-08T02:58:49.350700 #3183965] INFO -- : [567/885] 3225352=test_exception I, [2024-05-08T02:58:49.358319 #3183965] INFO -- : [568/885] 3225352=test_iter_break I, [2024-05-08T02:58:49.362578 #3183965] INFO -- : [569/885] 3225352=test_macro I, [2024-05-08T02:58:49.371071 #3183965] INFO -- : [570/885] 3225360=test_frozen I, [2024-05-08T02:58:49.371604 #3183965] INFO -- : [571/885] 3225359=test_gem_ext_configure_builder I, [2024-05-08T02:58:49.390629 #3183965] INFO -- : [572/885] 3225360=test_pp I, [2024-05-08T02:58:49.407456 #3183965] INFO -- : [573/885] 3225359=test_verbose I, [2024-05-08T02:58:49.410688 #3183965] INFO -- : [574/885] 3225352=test_rdoc_single_class I, [2024-05-08T02:58:49.413400 #3183965] INFO -- : [575/885] 3225352=test_nil I, [2024-05-08T02:58:49.434850 #3183965] INFO -- : [576/885] 3225359=test_num2int I, [2024-05-08T02:58:49.435262 #3183965] INFO -- : [577/885] 3225352=test_config I, [2024-05-08T02:58:49.440416 #3183965] INFO -- : [578/885] 3225359=test_optarg I, [2024-05-08T02:58:49.441239 #3183965] INFO -- : [579/885] 3225344=test_yaml_special_cases I, [2024-05-08T02:58:49.442916 #3183965] INFO -- : [580/885] 3225360=test_gem_source_list I, [2024-05-08T02:58:49.454855 #3183965] INFO -- : [581/885] 3225344=test_address_resolve I, [2024-05-08T02:58:49.474486 #3183965] INFO -- : [582/885] 3225344=test_rdoc_token_stream I, [2024-05-08T02:58:49.481260 #3183965] INFO -- : [583/885] 3225352=test_common I, [2024-05-08T02:58:49.483276 #3183965] INFO -- : [584/885] 3225344=test_gem_spec_fetcher I, [2024-05-08T02:58:49.520738 #3183965] INFO -- : [585/885] 3225360=test_gem_command I, [2024-05-08T02:58:49.583917 #3183965] INFO -- : [586/885] 3225359=test_key_actor_vi I, [2024-05-08T02:58:49.620952 #3183965] INFO -- : [587/885] 3225360=test_bug-3571 I, [2024-05-08T02:58:49.626709 #3183965] INFO -- : [588/885] 3225344=test_assignment I, [2024-05-08T02:58:49.639295 #3183965] INFO -- : [589/885] 3225360=test_ifunless I, [2024-05-08T02:58:49.639853 #3183965] INFO -- : [590/885] 3225360=test_gem_commands_lock_command I, [2024-05-08T02:58:49.660817 #3183965] INFO -- : [591/885] 3225360=test_numeric I, [2024-05-08T02:58:49.672041 #3183965] INFO -- : [592/885] 3225352=test_rdoc_tom_doc I, [2024-05-08T02:58:49.699991 #3183965] INFO -- : [593/885] 3225352=test_hmac I, [2024-05-08T02:58:49.708126 #3183965] INFO -- : [594/885] 3225345=test_rdoc_markup_to_tt_only I, [2024-05-08T02:58:49.713411 #3183965] INFO -- : [595/885] 3225352=test_gem_dependency_resolution_error I, [2024-05-08T02:58:49.721749 #3183965] INFO -- : [596/885] 3225352=test_rdoc_parser I, [2024-05-08T02:58:49.729831 #3183965] INFO -- : [597/885] 3225359=test_qsort I, [2024-05-08T02:58:49.734874 #3183965] INFO -- : [598/885] 3225345=test_custom_command I, [2024-05-08T02:58:49.738955 #3183965] INFO -- : [599/885] 3225352=json_addition_test I, [2024-05-08T02:58:49.741384 #3183965] INFO -- : [600/885] 3225345=test_depth_first I, [2024-05-08T02:58:49.742265 #3183965] INFO -- : [601/885] 3225345=test_gem_request_set_lockfile_parser I, [2024-05-08T02:58:49.745932 #3183965] INFO -- : [602/885] 3225347=test_raise I, [2024-05-08T02:58:49.745989 #3183965] INFO -- : [603/885] 3225347=test_x509attr I, [2024-05-08T02:58:49.751867 #3183965] INFO -- : [604/885] 3225360=test_rdoc_store I, [2024-05-08T02:58:49.753080 #3183965] INFO -- : [605/885] 3225359=test_string I, [2024-05-08T02:58:49.753134 #3183965] INFO -- : [606/885] 3225352=test_rdoc_stats I, [2024-05-08T02:58:49.760381 #3183965] INFO -- : [607/885] 3225347=test_pattern_matching I, [2024-05-08T02:58:49.765548 #3183965] INFO -- : [608/885] 3225359=test_fnmatch I, [2024-05-08T02:58:49.778196 #3183965] INFO -- : [609/885] 3225352=test_files_test_2 I, [2024-05-08T02:58:49.779347 #3183965] INFO -- : [610/885] 3225352=test_rdoc_markup_parser I, [2024-05-08T02:58:49.782290 #3183965] INFO -- : [611/885] 3225347=test_require_path_check I, [2024-05-08T02:58:49.831679 #3183965] INFO -- : [612/885] 3225352=test_folderitem2_invokeverb I, [2024-05-08T02:58:49.833855 #3183965] INFO -- : [613/885] 3225352=test_gem_validator I, [2024-05-08T02:58:49.841691 #3183965] INFO -- : [614/885] 3225345=test_gem_resolver_index_set I, [2024-05-08T02:58:49.849668 #3183965] INFO -- : [615/885] 3225359=test_gem_package_old I, [2024-05-08T02:58:49.852483 #3183965] INFO -- : [616/885] 3225352=test_gc_compact I, [2024-05-08T02:58:49.871961 #3183965] INFO -- : [617/885] 3225347=test_proc I, [2024-05-08T02:58:49.875594 #3183965] INFO -- : [618/885] 3225345=test_string I, [2024-05-08T02:58:49.902204 #3183965] INFO -- : [619/885] 3225359=test_erb_m17n I, [2024-05-08T02:58:49.915723 #3183965] INFO -- : [620/885] 3225359=test_ole_methods I, [2024-05-08T02:58:49.915794 #3183965] INFO -- : [621/885] 3225359=test_date_conv I, [2024-05-08T02:58:49.940170 #3183965] INFO -- : [622/885] 3225359=test_optimization I, [2024-05-08T02:58:49.961466 #3183965] INFO -- : [623/885] 3225357=test_zlib I, [2024-05-08T02:58:50.136494 #3183965] INFO -- : [624/885] 3225350=test_cgi_tag_helper I, [2024-05-08T02:58:50.146256 #3183965] INFO -- : [625/885] 3225349=test_egrep_cpp I, [2024-05-08T02:58:50.148412 #3183965] INFO -- : [626/885] 3225350=test_buffering I, [2024-05-08T02:58:50.164523 #3183965] INFO -- : [627/885] 3225350=test_svcb_https I, [2024-05-08T02:58:50.184070 #3183965] INFO -- : [628/885] 3225350=test_gb18030 I, [2024-05-08T02:58:50.206954 #3183965] INFO -- : [629/885] 3225350=test_gem_uninstaller I, [2024-05-08T02:58:50.293831 #3183965] INFO -- : [630/885] 3225349=test_rdoc_rdoc I, [2024-05-08T02:58:50.343017 #3183965] INFO -- : [631/885] 3225355=test_windows_1251 I, [2024-05-08T02:58:50.357777 #3183965] INFO -- : [632/885] 3225355=test_time I, [2024-05-08T02:58:50.365146 #3183965] INFO -- : [633/885] 3225349=test_rdoc_i18n_text I, [2024-05-08T02:58:50.365213 #3183965] INFO -- : [634/885] 3225360=test_io_buffer I, [2024-05-08T02:58:50.371605 #3183965] INFO -- : [635/885] 3225349=test_key_name_check I, [2024-05-08T02:58:50.398342 #3183965] INFO -- : [636/885] 3225349=test_defined I, [2024-05-08T02:58:50.470937 #3183965] INFO -- : [637/885] 3225360=test_backtrace I, [2024-05-08T02:58:50.473930 #3183965] INFO -- : [638/885] 3225349=test_pkey_ec I, [2024-05-08T02:58:50.482427 #3183965] INFO -- : [639/885] 3225355=test_trick I, [2024-05-08T02:58:50.487259 #3183965] INFO -- : [640/885] 3225360=test_thread I, [2024-05-08T02:58:50.493658 #3183965] INFO -- : [641/885] 3225360=test_pipe I, [2024-05-08T02:58:50.566565 #3183965] INFO -- : [642/885] 3225349=test_date_parse I, [2024-05-08T02:58:50.639007 #3183965] INFO -- : [643/885] 3225347=test_rdoc_markup_attributes I, [2024-05-08T02:58:50.648063 #3183965] INFO -- : [644/885] 3225347=test_rdoc_markup_to_rdoc I, [2024-05-08T02:58:50.671367 #3183965] INFO -- : [645/885] 3225360=test_rdoc_rd_inline_parser I, [2024-05-08T02:58:50.679294 #3183965] INFO -- : [646/885] 3225347=test_default_gems I, [2024-05-08T02:58:50.690623 #3183965] INFO -- : [647/885] 3225349=test_null I, [2024-05-08T02:58:50.696095 #3183965] INFO -- : [648/885] 3225349=test_win32ole_type I, [2024-05-08T02:58:50.698894 #3183965] INFO -- : [649/885] 3225349=test_mul I, [2024-05-08T02:58:50.707990 #3183965] INFO -- : [650/885] 3225349=test_rendering I, [2024-05-08T02:58:50.710747 #3183965] INFO -- : [651/885] 3225360=test_sizeof I, [2024-05-08T02:58:50.721302 #3183965] INFO -- : [652/885] 3225344=test_case I, [2024-05-08T02:58:50.735045 #3183965] INFO -- : [653/885] 3225347=test_face I, [2024-05-08T02:58:50.746597 #3183965] INFO -- : [654/885] 3225349=test_io I, [2024-05-08T02:58:50.763657 #3183965] INFO -- : [655/885] 3225344=test_unicode_escape I, [2024-05-08T02:58:50.820658 #3183965] INFO -- : [656/885] 3225347=test_utf16 I, [2024-05-08T02:58:50.838374 #3183965] INFO -- : [657/885] 3225347=test_autoload I, [2024-05-08T02:58:50.876175 #3183965] INFO -- : [658/885] 3225344=test_sleep I, [2024-05-08T02:58:51.006043 #3183965] INFO -- : [659/885] 3225351=test_config I, [2024-05-08T02:58:51.048659 #3183965] INFO -- : [660/885] 3225351=test_libs I, [2024-05-08T02:58:51.054046 #3183965] INFO -- : [661/885] 3225351=test_math I, [2024-05-08T02:58:51.074283 #3183965] INFO -- : [662/885] 3225351=test_gem_commands_fetch_command I, [2024-05-08T02:58:51.184739 #3183965] INFO -- : [663/885] 3225351=test_gc I, [2024-05-08T02:58:51.185472 #3183965] INFO -- : [664/885] 3225351=test_yaml_tree I, [2024-05-08T02:58:51.205547 #3183965] INFO -- : [665/885] 3225351=test_etc I, [2024-05-08T02:58:51.216074 #3183965] INFO -- : [666/885] 3225350=test_yjit_exit_locations I, [2024-05-08T02:58:51.217399 #3183965] INFO -- : [667/885] 3225350=test_getopts I, [2024-05-08T02:58:51.227321 #3183965] INFO -- : [668/885] 3225350=test_protocol I, [2024-05-08T02:58:51.307687 #3183965] INFO -- : [669/885] 3225351=test_gem_resolver_activation_request I, [2024-05-08T02:58:51.321729 #3183965] INFO -- : [670/885] 3225351=test_gem_config_file I, [2024-05-08T02:58:51.451784 #3183965] INFO -- : [671/885] 3225351=test_ripper I, [2024-05-08T02:58:51.484954 #3183965] INFO -- : [672/885] 3225354=test_gem_package_tar_header I, [2024-05-08T02:58:51.531076 #3183965] INFO -- : [673/885] 3225354=test_gem_util I, [2024-05-08T02:58:51.534097 #3183965] INFO -- : [674/885] 3225350=test_iseq_load I, [2024-05-08T02:58:51.707538 #3183965] INFO -- : [675/885] 3225354=test_pkey_dh I, [2024-05-08T02:58:51.782020 #3183965] INFO -- : [676/885] 3225351=test_bigzero I, [2024-05-08T02:58:51.782843 #3183965] INFO -- : [677/885] 3225354=test_system I, [2024-05-08T02:58:51.783103 #3183965] INFO -- : [678/885] 3225351=test_pkcs12 I, [2024-05-08T02:58:52.122886 #3183965] INFO -- : [679/885] 3225351=test_rdoc_alias I, [2024-05-08T02:58:52.124260 #3183965] INFO -- : [680/885] 3225351=test_yield I, [2024-05-08T02:58:52.529051 #3183965] INFO -- : [681/885] 3225350=parser_test I, [2024-05-08T02:58:52.635692 #3183965] INFO -- : [682/885] 3225350=test_convertible I, [2024-05-08T02:58:52.781595 #3183965] INFO -- : [683/885] 3225352=test_stringscanner I, [2024-05-08T02:58:52.816387 #3183965] INFO -- : [684/885] 3225352=test_files_sample I, [2024-05-08T02:58:52.817040 #3183965] INFO -- : [685/885] 3225352=test_rdoc_markup_to_html_crossref I, [2024-05-08T02:58:52.829281 #3183965] INFO -- : [686/885] 3225355=encoding_test I, [2024-05-08T02:58:52.880535 #3183965] INFO -- : [687/885] 3225354=test_gem_resolver_best_set I, [2024-05-08T02:58:52.918243 #3183965] INFO -- : [688/885] 3225344=test_typeddata I, [2024-05-08T02:58:52.929136 #3183965] INFO -- : [689/885] 3225355=test_rat I, [2024-05-08T02:58:52.931630 #3183965] INFO -- : [690/885] 3225354=test_webauthn_poller I, [2024-05-08T02:58:52.937564 #3183965] INFO -- : [691/885] 3225355=test_rdoc_markup_raw I, [2024-05-08T02:58:52.941056 #3183965] INFO -- : [692/885] 3225355=test_optparse I, [2024-05-08T02:58:52.941970 #3183965] INFO -- : [693/885] 3225355=test_array I, [2024-05-08T02:58:52.964462 #3183965] INFO -- : [694/885] 3225355=test_fstring I, [2024-05-08T02:58:53.076306 #3183965] INFO -- : [695/885] 3225355=test_readpartial I, [2024-05-08T02:58:53.079360 #3183965] INFO -- : [696/885] 3225354=test_clone I, [2024-05-08T02:58:53.133598 #3183965] INFO -- : [697/885] 3225352=test_gem_commands_install_command I, [2024-05-08T02:58:53.139419 #3183965] INFO -- : [698/885] 3225344=test_rdoc_require I, [2024-05-08T02:58:53.160147 #3183965] INFO -- : [699/885] 3225344=locals_test I, [2024-05-08T02:58:53.270082 #3183965] INFO -- : [700/885] 3225354=test_rdoc_markup_indented_paragraph I, [2024-05-08T02:58:53.276807 #3183965] INFO -- : [701/885] 3225354=test_gem_resolver_conflict I, [2024-05-08T02:58:53.303495 #3183965] INFO -- : [702/885] 3225354=test_rdoc_task I, [2024-05-08T02:58:53.308432 #3183965] INFO -- : [703/885] 3225354=test_backtrace I, [2024-05-08T02:58:53.485140 #3183965] INFO -- : [704/885] 3225355=test_pack I, [2024-05-08T02:58:53.500324 #3183965] INFO -- : [705/885] 3225355=ruby_parser_test I, [2024-05-08T02:58:53.503861 #3183965] INFO -- : [706/885] 3225355=test_io_buffer I, [2024-05-08T02:58:53.622389 #3183965] INFO -- : [707/885] 3225355=test_kill_ring I, [2024-05-08T02:58:53.632465 #3183965] INFO -- : [708/885] 3225355=test_ns_spki I, [2024-05-08T02:58:53.644068 #3183965] INFO -- : [709/885] 3225344=test_framework I, [2024-05-08T02:58:53.646085 #3183965] INFO -- : [710/885] 3225344=test_argf I, [2024-05-08T02:58:53.695978 #3183965] INFO -- : [711/885] 3225355=test_ws I, [2024-05-08T02:58:53.708541 #3183965] INFO -- : [712/885] 3225355=test_gem_commands_environment_command I, [2024-05-08T02:58:53.933040 #3183965] INFO -- : [713/885] 3225355=test_m17n I, [2024-05-08T02:58:53.993878 #3183965] INFO -- : [714/885] 3225355=test_workspace I, [2024-05-08T02:58:54.082994 #3183965] INFO -- : [715/885] 3225360=test_weakmap I, [2024-05-08T02:58:54.121344 #3183965] INFO -- : [716/885] 3225355=test_yjit I, [2024-05-08T02:58:54.126826 #3183965] INFO -- : [717/885] 3225355=test_gem_request_set_lockfile I, [2024-05-08T02:58:54.150909 #3183965] INFO -- : [718/885] 3225353=test_raise_exception I, [2024-05-08T02:58:54.330278 #3183965] INFO -- : [719/885] 3225342=test_protect I, [2024-05-08T02:58:54.353502 #3183965] INFO -- : [720/885] 3225342=test_win32ole_typelib I, [2024-05-08T02:58:54.357892 #3183965] INFO -- : [721/885] 3225342=test_tree_builder I, [2024-05-08T02:58:54.361764 #3183965] INFO -- : [722/885] 3225342=test_gem_resolver_dependency_request I, [2024-05-08T02:58:54.390686 #3183965] INFO -- : [723/885] 3225342=test_hash I, [2024-05-08T02:58:54.405959 #3183965] INFO -- : [724/885] 3225342=test_postponed_job I, [2024-05-08T02:58:54.488073 #3183965] INFO -- : [725/885] 3225355=test_alias_and_anchor I, [2024-05-08T02:58:54.507132 #3183965] INFO -- : [726/885] 3225355=test_external_new I, [2024-05-08T02:58:54.522295 #3183965] INFO -- : [727/885] 3225355=test_lock_native_thread I, [2024-05-08T02:58:54.590805 #3183965] INFO -- : [728/885] 3225354=test_c_struct_entry I, [2024-05-08T02:58:54.593549 #3183965] INFO -- : [729/885] 3225352=test_gem_commands_stale_command I, [2024-05-08T02:58:54.598239 #3183965] INFO -- : [730/885] 3225346=test_remote_fetch_error I, [2024-05-08T02:58:54.606363 #3183965] INFO -- : [731/885] 3225352=test_have_library I, [2024-05-08T02:58:54.623905 #3183965] INFO -- : [732/885] 3225346=test_show_source I, [2024-05-08T02:58:54.630210 #3183965] INFO -- : [733/885] 3225357=test_set I, [2024-05-08T02:58:54.637844 #3183965] INFO -- : [734/885] 3225357=test_string_memory I, [2024-05-08T02:58:54.784390 #3183965] INFO -- : [735/885] 3225346=comments_test I, [2024-05-08T02:58:54.796263 #3183965] INFO -- : [736/885] 3225354=test_sprintf I, [2024-05-08T02:58:54.815512 #3183965] INFO -- : [737/885] 3225342=test_gem_requirement I, [2024-05-08T02:58:54.822510 #3183965] INFO -- : [738/885] 3225357=test_gem_security_trust_dir I, [2024-05-08T02:58:54.842926 #3183965] INFO -- : [739/885] 3225355=test_line_editor I, [2024-05-08T02:58:54.852487 #3183965] INFO -- : [740/885] 3225355=test_objspace I, [2024-05-08T02:58:54.857749 #3183965] INFO -- : [741/885] 3225357=ripper_test I, [2024-05-08T02:58:54.870598 #3183965] INFO -- : [742/885] 3225346=test_undef I, [2024-05-08T02:58:54.882348 #3183965] INFO -- : [743/885] 3225346=test_rdoc_context_section I, [2024-05-08T02:58:54.922889 #3183965] INFO -- : [744/885] 3225353=test_euc_kr I, [2024-05-08T02:58:54.938501 #3183965] INFO -- : [745/885] 3225353=test_ftp I, [2024-05-08T02:58:54.956223 #3183965] INFO -- : [746/885] 3225353=test_pattern_key_name_check I, [2024-05-08T02:58:54.957120 #3183965] INFO -- : [747/885] 3225354=test_to_ruby I, [2024-05-08T02:58:54.962181 #3183965] INFO -- : [748/885] 3225353=test_gem_impossible_dependencies_error I, [2024-05-08T02:58:54.968864 #3183965] INFO -- : [749/885] 3225353=test_array_create I, [2024-05-08T02:58:54.971450 #3183965] INFO -- : [750/885] 3225353=test_pack I, [2024-05-08T02:58:54.992354 #3183965] INFO -- : [751/885] 3225342=test_gem_commands_query_command I, [2024-05-08T02:58:55.009761 #3183965] INFO -- : [752/885] 3225354=test_method I, [2024-05-08T02:58:55.056849 #3183965] INFO -- : [753/885] 3225346=test_rdoc_rubygems_hook I, [2024-05-08T02:58:55.179292 #3183965] INFO -- : [754/885] 3225346=test_cp949 I, [2024-05-08T02:58:55.183707 #3183965] INFO -- : [755/885] 3225346=test_gem_commands_uninstall_command I, [2024-05-08T02:58:55.211679 #3183965] INFO -- : [756/885] 3225353=test_gem_source_specific_file I, [2024-05-08T02:58:55.315665 #3183965] INFO -- : [757/885] 3225353=test_foreach I, [2024-05-08T02:58:55.321756 #3183965] INFO -- : [758/885] 3225353=test_condition I, [2024-05-08T02:58:55.327979 #3183965] INFO -- : [759/885] 3225353=test_gem_unsatisfiable_dependency_error I, [2024-05-08T02:58:55.340665 #3183965] INFO -- : [760/885] 3225353=test_win32ole_record I, [2024-05-08T02:58:55.343761 #3183965] INFO -- : [761/885] 3225353=test_sorted_set I, [2024-05-08T02:58:55.405796 #3183965] INFO -- : [762/885] 3225357=test_win32ole_type_event I, [2024-05-08T02:58:55.419105 #3183965] INFO -- : [763/885] 3225357=test_emoji I, [2024-05-08T02:58:55.493200 #3183965] INFO -- : [764/885] 3225357=test_ubf_async_safe I, [2024-05-08T02:58:55.509792 #3183965] INFO -- : [765/885] 3225357=test_hash I, [2024-05-08T02:58:55.549936 #3183965] INFO -- : [766/885] 3225342=test_io I, [2024-05-08T02:58:55.558699 #3183965] INFO -- : [767/885] 3225348=test_ellipsize I, [2024-05-08T02:58:55.573925 #3183965] INFO -- : [768/885] 3225348=test_date_attr I, [2024-05-08T02:58:55.606095 #3183965] INFO -- : [769/885] 3225348=test_io_wait I, [2024-05-08T02:58:55.607598 #3183965] INFO -- : [770/885] 3225353=test_gem_commands_exec_command I, [2024-05-08T02:58:55.779298 #3183965] INFO -- : [771/885] 3225351=warnings_test I, [2024-05-08T02:58:55.794526 #3183965] INFO -- : [772/885] 3225351=test_kwargs I, [2024-05-08T02:58:55.797951 #3183965] INFO -- : [773/885] 3225351=test_type_completor I, [2024-05-08T02:58:55.802586 #3183965] INFO -- : [774/885] 3225342=test_console_attr I, [2024-05-08T02:58:55.802705 #3183965] INFO -- : [775/885] 3225342=test_summary I, [2024-05-08T02:58:55.803065 #3183965] INFO -- : [776/885] 3225351=test_duplicate I, [2024-05-08T02:58:55.809435 #3183965] INFO -- : [777/885] 3225351=test_utf32 I, [2024-05-08T02:58:55.822225 #3183965] INFO -- : [778/885] 3225351=test_basicsocket I, [2024-05-08T02:58:55.835208 #3183965] INFO -- : [779/885] 3225351=test_prettyprint I, [2024-05-08T02:58:55.857747 #3183965] INFO -- : [780/885] 3225351=test_tracepoint I, [2024-05-08T02:58:55.926552 #3183965] INFO -- : [781/885] 3225352=test_gem_commands_help_command I, [2024-05-08T02:58:55.943047 #3183965] INFO -- : [782/885] 3225348=test_rdoc_markup I, [2024-05-08T02:58:55.974850 #3183965] INFO -- : [783/885] 3225346=test_internal_ivar I, [2024-05-08T02:58:55.992363 #3183965] INFO -- : [784/885] 3225346=test_gem_resolver_index_specification I, [2024-05-08T02:58:55.998444 #3183965] INFO -- : [785/885] 3225342=test_function I, [2024-05-08T02:58:56.027710 #3183965] INFO -- : [786/885] 3225348=test_queue I, [2024-05-08T02:58:56.031468 #3183965] INFO -- : [787/885] 3225348=test_tempfile I, [2024-05-08T02:58:56.043868 #3183965] INFO -- : [788/885] 3225352=parse_comments_test I, [2024-05-08T02:58:56.045233 #3183965] INFO -- : [789/885] 3225346=test_noarg I, [2024-05-08T02:58:56.128093 #3183965] INFO -- : [790/885] 3225351=json_string_matching_test I, [2024-05-08T02:58:56.135255 #3183965] INFO -- : [791/885] 3225352=test_load I, [2024-05-08T02:58:56.140096 #3183965] INFO -- : [792/885] 3225351=test_class I, [2024-05-08T02:58:56.146359 #3183965] INFO -- : [793/885] 3225352=test_rdoc_normal_class I, [2024-05-08T02:58:56.210553 #3183965] INFO -- : [794/885] 3225352=test_const I, [2024-05-08T02:58:56.217992 #3183965] INFO -- : [795/885] 3225352=test_asn1 I, [2024-05-08T02:58:56.228889 #3183965] INFO -- : [796/885] 3225342=test_random I, [2024-05-08T02:58:56.235910 #3183965] INFO -- : [797/885] 3225342=test_irb I, [2024-05-08T02:58:56.239714 #3183965] INFO -- : [798/885] 3225352=test_date_strftime I, [2024-05-08T02:58:56.271854 #3183965] INFO -- : [799/885] 3225346=test_rdoc_parser_rd I, [2024-05-08T02:58:56.296376 #3183965] INFO -- : [800/885] 3225348=test_yamlstore I, [2024-05-08T02:58:56.296941 #3183965] INFO -- : [801/885] 3225348=test_gem_installer I, [2024-05-08T02:58:56.310112 #3183965] INFO -- : [802/885] 3225346=test_parse I, [2024-05-08T02:58:56.499477 #3183965] INFO -- : [803/885] 3225342=test_mdns I, [2024-05-08T02:58:56.517167 #3183965] INFO -- : [804/885] 3225342=test_gem_remote_fetcher I, [2024-05-08T02:58:56.678859 #3183965] INFO -- : [805/885] 3225347=test_scanner_events I, [2024-05-08T02:58:56.718503 #3183965] INFO -- : [806/885] 3225347=test_gem_resolver_installed_specification I, [2024-05-08T02:58:56.733931 #3183965] INFO -- : [807/885] 3225359=test_frozen_error I, [2024-05-08T02:58:56.741504 #3183965] INFO -- : [808/885] 3225359=test_gem_stub_specification I, [2024-05-08T02:58:56.744348 #3183965] INFO -- : [809/885] 3225347=test_method_cache I, [2024-05-08T02:58:56.746205 #3183965] INFO -- : [810/885] 3225347=test_gem_ext_ext_conf_builder I, [2024-05-08T02:58:56.812163 #3183965] INFO -- : [811/885] 3225352=test_complex I, [2024-05-08T02:58:56.893161 #3183965] INFO -- : [812/885] 3225353=test_gem_commands_search_command I, [2024-05-08T02:58:56.897354 #3183965] INFO -- : [813/885] 3225353=test_inlinecache I, [2024-05-08T02:58:56.927669 #3183965] INFO -- : [814/885] 3225359=test_rdoc_markup_verbatim I, [2024-05-08T02:58:56.933300 #3183965] INFO -- : [815/885] 3225359=test_path_to_class I, [2024-05-08T02:58:56.941548 #3183965] INFO -- : [816/885] 3225359=test_gem_resolver_specification I, [2024-05-08T02:58:56.965709 #3183965] INFO -- : [817/885] 3225346=test_gem_dependency I, [2024-05-08T02:58:56.973901 #3183965] INFO -- : [818/885] 3225353=test_gem_version I, [2024-05-08T02:58:56.974437 #3183965] INFO -- : [819/885] 3225359=test_econv I, [2024-05-08T02:58:57.044411 #3183965] INFO -- : [820/885] 3225353=test_cesu8 I, [2024-05-08T02:58:57.051354 #3183965] INFO -- : [821/885] 3225352=test_rdoc_options I, [2024-05-08T02:58:57.055372 #3183965] INFO -- : [822/885] 3225353=test_string_processing I, [2024-05-08T02:58:57.129330 #3183965] INFO -- : [823/885] 3225346=test_fileutils I, [2024-05-08T02:58:57.139914 #3183965] INFO -- : [824/885] 3225353=test_ldap I, [2024-05-08T02:58:57.149175 #3183965] INFO -- : [825/885] 3225353=test_emitter I, [2024-05-08T02:58:57.153878 #3183965] INFO -- : [826/885] 3225353=test_resource I, [2024-05-08T02:58:57.180707 #3183965] INFO -- : [827/885] 3225353=test_gem_commands_signin_command I, [2024-05-08T02:58:57.301179 #3183965] INFO -- : [828/885] 3225353=test_rdoc_include I, [2024-05-08T02:58:57.357620 #3183965] INFO -- : [829/885] 3225352=test_reqarg I, [2024-05-08T02:58:57.404859 #3183965] INFO -- : [830/885] 3225353=test_gem_commands_list_command I, [2024-05-08T02:58:57.415994 #3183965] INFO -- : [831/885] 3225353=test_stack I, [2024-05-08T02:58:57.740311 #3183965] INFO -- : [832/885] 3225346=test_too_many_dummy_encodings I, [2024-05-08T02:58:57.791369 #3183965] INFO -- : [833/885] 3225352=test_class2name I, [2024-05-08T02:58:57.823527 #3183965] INFO -- : [834/885] 3225352=test_gbk I, [2024-05-08T02:58:57.827007 #3183965] INFO -- : [835/885] 3225352=test_enc_str_buf_cat I, [2024-05-08T02:58:57.829641 #3183965] INFO -- : [836/885] 3225346=test_pstore I, [2024-05-08T02:58:57.836208 #3183965] INFO -- : [837/885] 3225352=test_cstr I, [2024-05-08T02:58:57.881934 #3183965] INFO -- : [838/885] 3225346=test_profile_frames I, [2024-05-08T02:58:57.887452 #3183965] INFO -- : [839/885] 3225360=test_io_timeout I, [2024-05-08T02:58:57.893417 #3183965] INFO -- : [840/885] 3225360=test_shapes I, [2024-05-08T02:58:57.899235 #3183965] INFO -- : [841/885] 3225360=json_fixtures_test I, [2024-05-08T02:58:57.906196 #3183965] INFO -- : [842/885] 3225360=test_comparable I, [2024-05-08T02:58:57.913137 #3183965] INFO -- : [843/885] 3225360=test_rdoc_parser_c I, [2024-05-08T02:58:57.951038 #3183965] INFO -- : [844/885] 3225350=test_thread_queue I, [2024-05-08T02:58:58.071219 #3183965] INFO -- : [845/885] 3225346=test_nowrite I, [2024-05-08T02:58:58.093073 #3183965] INFO -- : [846/885] 3225346=test_rdoc_markup_formatter I, [2024-05-08T02:58:58.104880 #3183965] INFO -- : [847/885] 3225346=test_ractor I, [2024-05-08T02:58:58.109403 #3183965] INFO -- : [848/885] 3225347=test_euc_tw I, [2024-05-08T02:58:58.113449 #3183965] INFO -- : [849/885] 3225347=test_bmethod I, [2024-05-08T02:58:58.120293 #3183965] INFO -- : [850/885] 3225347=test_gem_commands_sources_command I, [2024-05-08T02:58:58.144469 #3183965] INFO -- : [851/885] 3225346=test_ansi_without_terminfo I, [2024-05-08T02:58:58.146888 #3183965] INFO -- : [852/885] 3225360=test_big2str I, [2024-05-08T02:58:58.151824 #3183965] INFO -- : [853/885] 3225360=test_forwardable I, [2024-05-08T02:58:58.156240 #3183965] INFO -- : [854/885] 3225346=test_yaml I, [2024-05-08T02:58:58.173180 #3183965] INFO -- : [855/885] 3225360=test_wait I, [2024-05-08T02:58:58.232390 #3183965] INFO -- : [856/885] 3225359=test_handle I, [2024-05-08T02:58:58.255983 #3183965] INFO -- : [857/885] 3225360=test_deprecate I, [2024-05-08T02:58:58.287406 #3183965] INFO -- : [858/885] 3225360=test_rdoc_constant I, [2024-05-08T02:58:58.316755 #3183965] INFO -- : [859/885] 3225346=test_bash_completion I, [2024-05-08T02:58:58.323201 #3183965] INFO -- : [860/885] 3225344=test_formatter I, [2024-05-08T02:58:58.330520 #3183965] INFO -- : [861/885] 3225346=test_recorder I, [2024-05-08T02:58:58.333209 #3183965] INFO -- : [862/885] 3225344=test_gem_source_vendor I, [2024-05-08T02:58:58.333698 #3183965] INFO -- : [863/885] 3225346=test_gem_commands_owner_command I, [2024-05-08T02:58:58.344905 #3183965] INFO -- : [864/885] 3225347=regexp_test I, [2024-05-08T02:58:58.347724 #3183965] INFO -- : [865/885] 3225344=test_gem_package_tar_reader I, [2024-05-08T02:58:58.363682 #3183965] INFO -- : [866/885] 3225347=test_rdoc_encoding I, [2024-05-08T02:58:58.402595 #3183965] INFO -- : [867/885] 3225360=test_coverage I, [2024-05-08T02:58:58.417780 #3183965] INFO -- : [868/885] 3225347=test_pathname I, [2024-05-08T02:58:58.431416 #3183965] INFO -- : [869/885] 3225344=test_complexrational I, [2024-05-08T02:58:58.439648 #3183965] INFO -- : [870/885] 3225344=test_init I, [2024-05-08T02:58:58.448774 #3183965] INFO -- : [871/885] 3225353=test_rdoc_any_method I, [2024-05-08T02:58:58.586376 #3183965] INFO -- : [872/885] 3225359=test_modify_expand I, [2024-05-08T02:58:58.590474 #3183965] INFO -- : [873/885] 3225359=test_rdoc_markdown I, [2024-05-08T02:58:58.628023 #3183965] INFO -- : [874/885] 3225347=test_gem_available_set I, [2024-05-08T02:58:58.702030 #3183965] INFO -- : [875/885] 3225354=test_file I, [2024-05-08T02:58:58.714179 #3183965] INFO -- : [876/885] 3225354=test_fiddle I, [2024-05-08T02:58:58.746954 #3183965] INFO -- : [877/885] 3225347=test_wss I, [2024-05-08T02:58:58.771979 #3183965] INFO -- : [878/885] 3225347=test_ractor I, [2024-05-08T02:58:58.783640 #3183965] INFO -- : [879/885] 3225354=test_find I, [2024-05-08T02:58:58.793406 #3183965] INFO -- : [880/885] 3225354=test_marshalable I, [2024-05-08T02:58:58.798367 #3183965] INFO -- : [881/885] 3225354=test_digest I, [2024-05-08T02:58:58.812916 #3183965] INFO -- : [882/885] 3225359=test_gem_commands_contents_command I, [2024-05-08T02:58:58.827031 #3183965] INFO -- : [883/885] 3225353=test_gem_ext_cmake_builder I, [2024-05-08T02:58:58.841277 #3183965] INFO -- : [884/885] 3225353=test_require I, [2024-05-08T02:58:58.845559 #3183965] INFO -- : [885/885] 3225344=test_cgi_util I, [2024-05-08T02:59:11.643818 #3183965] INFO -- : Finished tests in 34.622414s, 761.2121 tests/s, 270125.2984 assertions/s. E, [2024-05-08T02:59:11.643892 #3183965] ERROR -- : Children under /tmp/rubytest.9t1zs9: E, [2024-05-08T02:59:11.643940 #3183965] ERROR -- : * drwx------ 4 80 2024-05-08 02:58:38 +0000 gem_rebuild20240508-3225352-dmxud/ E, [2024-05-08T02:59:11.643963 #3183965] ERROR -- : * drwxrwxr-x 2 60 2024-05-08 02:58:38 +0000 new/ E, [2024-05-08T02:59:11.643981 #3183965] ERROR -- : * -rw-rw-r-- 1 4096 2024-05-08 02:58:38 +0000 rebuild_test_gem-1.0.0.gem E, [2024-05-08T02:59:11.644010 #3183965] ERROR -- : * drwxrwxr-x 2 60 2024-05-08 02:58:38 +0000 old/ E, [2024-05-08T02:59:11.644024 #3183965] ERROR -- : * -rw-rw-r-- 1 4096 2024-05-08 02:58:38 +0000 rebuild_test_gem-1.0.0.gem I, [2024-05-08T02:59:11.645221 #3183965] INFO -- : 26355 tests, 9352390 assertions, 0 failures, 0 errors, 304 skips I, [2024-05-08T02:59:11.645242 #3183965] INFO -- : I, [2024-05-08T02:59:11.645249 #3183965] INFO -- : ruby -v: ruby 3.4.0dev (2024-05-07T18:24:31Z master b4b39a6199) [x86_64-linux] I, [2024-05-08T02:59:11.647251 #3183965] INFO -- : $$$[end] "make yes-test-all TESTOPTS='--stderr-on-failure' TESTS='-j20'" exit with 0. I, [2024-05-08T02:59:11.647460 #3183965] INFO -- : $$$[beg] make yes-test-rubyspec MSPECOPT='--error-output stderr --debug -j' TESTS='-j20' I, [2024-05-08T02:59:11.734550 #3183965] INFO -- : BASERUBY = /usr/bin/ruby --disable=gems I, [2024-05-08T02:59:11.734588 #3183965] INFO -- : CC = gcc I, [2024-05-08T02:59:11.734594 #3183965] INFO -- : LD = ld I, [2024-05-08T02:59:11.734599 #3183965] INFO -- : LDSHARED = gcc -shared I, [2024-05-08T02:59:11.734604 #3183965] INFO -- : CFLAGS = -O3 -fno-fast-math -ggdb3 -Wall -Wextra -Wdeprecated-declarations -Wdiv-by-zero -Wduplicated-cond -Wimplicit-function-declaration -Wimplicit-int -Wpointer-arith -Wwrite-strings -Wold-style-definition -Wimplicit-fallthrough=0 -Wmissing-noreturn -Wno-cast-function-type -Wno-constant-logical-operand -Wno-long-long -Wno-missing-field-initializers -Wno-overlength-strings -Wno-packed-bitfield-compat -Wno-parentheses-equality -Wno-self-assign -Wno-tautological-compare -Wno-unused-parameter -Wno-unused-value -Wsuggest-attribute=format -Wsuggest-attribute=noreturn -Wunused-variable -Wmisleading-indentation -Wundef -fPIC I, [2024-05-08T02:59:11.734609 #3183965] INFO -- : XCFLAGS = -U_FORTIFY_SOURCE -D_FORTIFY_SOURCE=2 -fstack-protector-strong -fno-strict-overflow -fvisibility=hidden -fexcess-precision=standard -DRUBY_EXPORT -I. -I.ext/include/x86_64-linux -I/tmp/ruby/src/trunk/include -I/tmp/ruby/src/trunk -I/tmp/ruby/src/trunk/prism -I/tmp/ruby/src/trunk/enc/unicode/15.0.0 I, [2024-05-08T02:59:11.734613 #3183965] INFO -- : CPPFLAGS = I, [2024-05-08T02:59:11.734617 #3183965] INFO -- : DLDFLAGS = -Wl,--compress-debug-sections=zlib -Wl,-soname,libruby.so.3.4 -fstack-protector-strong I, [2024-05-08T02:59:11.734621 #3183965] INFO -- : SOLIBS = -lz -lrt -lrt -lgmp -ldl -lcrypt -lm -lpthread I, [2024-05-08T02:59:11.734625 #3183965] INFO -- : LANG = en_US.UTF-8 I, [2024-05-08T02:59:11.734629 #3183965] INFO -- : LC_ALL = I, [2024-05-08T02:59:11.734633 #3183965] INFO -- : LC_CTYPE = I, [2024-05-08T02:59:11.734636 #3183965] INFO -- : MFLAGS = I, [2024-05-08T02:59:11.734640 #3183965] INFO -- : RUSTC = no I, [2024-05-08T02:59:11.734644 #3183965] INFO -- : YJIT_RUSTC_ARGS = --crate-name=yjit --crate-type=staticlib --edition=2021 -g -C lto=thin -C opt-level=3 -C overflow-checks=on '--out-dir=/tmp/ruby/build/trunk/yjit/target/release/' /tmp/ruby/src/trunk/yjit/src/lib.rs I, [2024-05-08T02:59:11.735196 #3183965] INFO -- : gcc (Ubuntu 11.4.0-1ubuntu1~22.04) 11.4.0 I, [2024-05-08T02:59:11.735217 #3183965] INFO -- : Copyright (C) 2021 Free Software Foundation, Inc. I, [2024-05-08T02:59:11.735223 #3183965] INFO -- : This is free software; see the source for copying conditions. There is NO I, [2024-05-08T02:59:11.735228 #3183965] INFO -- : warranty; not even for MERCHANTABILITY or FITNESS FOR A PARTICULAR PURPOSE. I, [2024-05-08T02:59:11.735232 #3183965] INFO -- : I, [2024-05-08T02:59:11.736841 #3183965] INFO -- : generating enc.mk I, [2024-05-08T02:59:11.854839 #3183965] INFO -- : making enc I, [2024-05-08T02:59:11.872010 #3183965] INFO -- : make[1]: Entering directory '/tmp/ruby/build/trunk' I, [2024-05-08T02:59:11.872032 #3183965] INFO -- : make[1]: Nothing to be done for 'enc'. I, [2024-05-08T02:59:11.872039 #3183965] INFO -- : make[1]: Leaving directory '/tmp/ruby/build/trunk' I, [2024-05-08T02:59:11.872665 #3183965] INFO -- : making srcs under enc I, [2024-05-08T02:59:11.902676 #3183965] INFO -- : make[1]: Entering directory '/tmp/ruby/build/trunk' I, [2024-05-08T02:59:11.902697 #3183965] INFO -- : make[1]: Nothing to be done for 'srcs'. I, [2024-05-08T02:59:11.902703 #3183965] INFO -- : make[1]: Leaving directory '/tmp/ruby/build/trunk' I, [2024-05-08T02:59:11.903584 #3183965] INFO -- : generating transdb.h I, [2024-05-08T02:59:11.998707 #3183965] INFO -- : transdb.h unchanged I, [2024-05-08T02:59:11.999848 #3183965] INFO -- : making trans I, [2024-05-08T02:59:12.033442 #3183965] INFO -- : make[1]: Entering directory '/tmp/ruby/build/trunk' I, [2024-05-08T02:59:12.033468 #3183965] INFO -- : make[1]: Nothing to be done for 'trans'. I, [2024-05-08T02:59:12.033476 #3183965] INFO -- : make[1]: Leaving directory '/tmp/ruby/build/trunk' I, [2024-05-08T02:59:12.034038 #3183965] INFO -- : making encs I, [2024-05-08T02:59:12.070713 #3183965] INFO -- : make[1]: Entering directory '/tmp/ruby/build/trunk' I, [2024-05-08T02:59:12.070734 #3183965] INFO -- : make[1]: Nothing to be done for 'encs'. I, [2024-05-08T02:59:12.070739 #3183965] INFO -- : make[1]: Leaving directory '/tmp/ruby/build/trunk' I, [2024-05-08T02:59:12.072480 #3183965] INFO -- : generating makefiles ext/configure-ext.mk I, [2024-05-08T02:59:12.099403 #3183965] INFO -- : ext/configure-ext.mk updated I, [2024-05-08T02:59:12.101874 #3183965] INFO -- : make[1]: Entering directory '/tmp/ruby/build/trunk' I, [2024-05-08T02:59:13.507324 #3183965] INFO -- : make[1]: Leaving directory '/tmp/ruby/build/trunk' I, [2024-05-08T02:59:13.508028 #3183965] INFO -- : generating makefile exts.mk I, [2024-05-08T02:59:13.545099 #3183965] INFO -- : exts.mk unchanged I, [2024-05-08T02:59:13.549655 #3183965] INFO -- : make[1]: Entering directory '/tmp/ruby/build/trunk' I, [2024-05-08T02:59:13.760383 #3183965] INFO -- : make[2]: Entering directory '/tmp/ruby/build/trunk/ext/coverage' I, [2024-05-08T02:59:13.763221 #3183965] INFO -- : make[2]: Leaving directory '/tmp/ruby/build/trunk/ext/coverage' I, [2024-05-08T02:59:13.767022 #3183965] INFO -- : make[2]: Entering directory '/tmp/ruby/build/trunk/ext/date' I, [2024-05-08T02:59:13.770148 #3183965] INFO -- : make[2]: Leaving directory '/tmp/ruby/build/trunk/ext/date' I, [2024-05-08T02:59:13.772342 #3183965] INFO -- : make[2]: Entering directory '/tmp/ruby/build/trunk/ext/digest' I, [2024-05-08T02:59:13.777850 #3183965] INFO -- : make[2]: Leaving directory '/tmp/ruby/build/trunk/ext/digest' I, [2024-05-08T02:59:13.793640 #3183965] INFO -- : make[2]: Entering directory '/tmp/ruby/build/trunk/ext/digest/sha2' I, [2024-05-08T02:59:13.796590 #3183965] INFO -- : make[2]: Leaving directory '/tmp/ruby/build/trunk/ext/digest/sha2' I, [2024-05-08T02:59:13.809419 #3183965] INFO -- : make[2]: Entering directory '/tmp/ruby/build/trunk/ext/fiddle' I, [2024-05-08T02:59:13.815895 #3183965] INFO -- : make[2]: Leaving directory '/tmp/ruby/build/trunk/ext/fiddle' I, [2024-05-08T02:59:13.818775 #3183965] INFO -- : make[2]: Entering directory '/tmp/ruby/build/trunk/ext/io/console' I, [2024-05-08T02:59:13.821370 #3183965] INFO -- : make[2]: Leaving directory '/tmp/ruby/build/trunk/ext/io/console' I, [2024-05-08T02:59:13.828995 #3183965] INFO -- : make[2]: Entering directory '/tmp/ruby/build/trunk/ext/json' I, [2024-05-08T02:59:13.835352 #3183965] INFO -- : make[2]: Leaving directory '/tmp/ruby/build/trunk/ext/json' I, [2024-05-08T02:59:13.844347 #3183965] INFO -- : make[2]: Entering directory '/tmp/ruby/build/trunk/ext/monitor' I, [2024-05-08T02:59:13.846845 #3183965] INFO -- : make[2]: Leaving directory '/tmp/ruby/build/trunk/ext/monitor' I, [2024-05-08T02:59:13.851126 #3183965] INFO -- : make[2]: Entering directory '/tmp/ruby/build/trunk/ext/objspace' I, [2024-05-08T02:59:13.854849 #3183965] INFO -- : make[2]: Leaving directory '/tmp/ruby/build/trunk/ext/objspace' I, [2024-05-08T02:59:13.866873 #3183965] INFO -- : make[2]: Entering directory '/tmp/ruby/build/trunk/ext/openssl' I, [2024-05-08T02:59:13.879899 #3183965] INFO -- : make[2]: Leaving directory '/tmp/ruby/build/trunk/ext/openssl' I, [2024-05-08T02:59:13.882788 #3183965] INFO -- : make[2]: Entering directory '/tmp/ruby/build/trunk/ext/pathname' I, [2024-05-08T02:59:13.885277 #3183965] INFO -- : make[2]: Leaving directory '/tmp/ruby/build/trunk/ext/pathname' I, [2024-05-08T02:59:13.889501 #3183965] INFO -- : make[2]: Entering directory '/tmp/ruby/build/trunk/ext/psych' I, [2024-05-08T02:59:13.904326 #3183965] INFO -- : make[2]: Leaving directory '/tmp/ruby/build/trunk/ext/psych' I, [2024-05-08T02:59:13.907285 #3183965] INFO -- : make[2]: Entering directory '/tmp/ruby/build/trunk/ext/pty' I, [2024-05-08T02:59:13.909830 #3183965] INFO -- : make[2]: Leaving directory '/tmp/ruby/build/trunk/ext/pty' I, [2024-05-08T02:59:13.919224 #3183965] INFO -- : make[2]: Entering directory '/tmp/ruby/build/trunk/ext/ripper' I, [2024-05-08T02:59:13.924237 #3183965] INFO -- : make[2]: Leaving directory '/tmp/ruby/build/trunk/ext/ripper' I, [2024-05-08T02:59:13.925707 #3183965] INFO -- : make[2]: Entering directory '/tmp/ruby/build/trunk/ext/rubyvm' I, [2024-05-08T02:59:13.927751 #3183965] INFO -- : make[2]: Leaving directory '/tmp/ruby/build/trunk/ext/rubyvm' I, [2024-05-08T02:59:13.935491 #3183965] INFO -- : make[2]: Entering directory '/tmp/ruby/build/trunk/ext/socket' I, [2024-05-08T02:59:13.941917 #3183965] INFO -- : make[2]: Leaving directory '/tmp/ruby/build/trunk/ext/socket' I, [2024-05-08T02:59:13.952836 #3183965] INFO -- : make[2]: Entering directory '/tmp/ruby/build/trunk/.bundle/gems/bigdecimal-3.1.7/ext/bigdecimal' I, [2024-05-08T02:59:13.975565 #3183965] INFO -- : make[2]: Leaving directory '/tmp/ruby/build/trunk/.bundle/gems/bigdecimal-3.1.7/ext/bigdecimal' I, [2024-05-08T02:59:13.977663 #3183965] INFO -- : make[2]: Entering directory '/tmp/ruby/build/trunk/.bundle/gems/bigdecimal-3.1.8/ext/bigdecimal' I, [2024-05-08T02:59:14.000549 #3183965] INFO -- : make[2]: Leaving directory '/tmp/ruby/build/trunk/.bundle/gems/bigdecimal-3.1.8/ext/bigdecimal' I, [2024-05-08T02:59:14.002568 #3183965] INFO -- : make[2]: Entering directory '/tmp/ruby/build/trunk/.bundle/gems/debug-1.9.2/ext/debug' I, [2024-05-08T02:59:14.024254 #3183965] INFO -- : make[2]: Leaving directory '/tmp/ruby/build/trunk/.bundle/gems/debug-1.9.2/ext/debug' I, [2024-05-08T02:59:14.026104 #3183965] INFO -- : make[2]: Entering directory '/tmp/ruby/build/trunk/.bundle/gems/nkf-0.2.0/ext/nkf' I, [2024-05-08T02:59:14.047631 #3183965] INFO -- : make[2]: Leaving directory '/tmp/ruby/build/trunk/.bundle/gems/nkf-0.2.0/ext/nkf' I, [2024-05-08T02:59:14.049604 #3183965] INFO -- : make[2]: Entering directory '/tmp/ruby/build/trunk/.bundle/gems/racc-1.7.3/ext/racc/cparse' I, [2024-05-08T02:59:14.071109 #3183965] INFO -- : make[2]: Leaving directory '/tmp/ruby/build/trunk/.bundle/gems/racc-1.7.3/ext/racc/cparse' I, [2024-05-08T02:59:14.073339 #3183965] INFO -- : make[2]: Entering directory '/tmp/ruby/build/trunk/.bundle/gems/rbs-3.4.4/ext/rbs_extension' I, [2024-05-08T02:59:14.095110 #3183965] INFO -- : make[2]: Leaving directory '/tmp/ruby/build/trunk/.bundle/gems/rbs-3.4.4/ext/rbs_extension' I, [2024-05-08T02:59:14.097017 #3183965] INFO -- : make[2]: Entering directory '/tmp/ruby/build/trunk/.bundle/gems/syslog-0.1.2/ext/syslog' I, [2024-05-08T02:59:14.118803 #3183965] INFO -- : make[2]: Leaving directory '/tmp/ruby/build/trunk/.bundle/gems/syslog-0.1.2/ext/syslog' I, [2024-05-08T02:59:14.141938 #3183965] INFO -- : make[2]: Entering directory '/tmp/ruby/build/trunk' I, [2024-05-08T02:59:14.205380 #3183965] INFO -- : make[2]: 'ruby' is up to date. I, [2024-05-08T02:59:14.205419 #3183965] INFO -- : make[2]: Leaving directory '/tmp/ruby/build/trunk' I, [2024-05-08T02:59:14.205663 #3183965] INFO -- : make[1]: Leaving directory '/tmp/ruby/build/trunk' I, [2024-05-08T02:59:14.209388 #3183965] INFO -- : make[1]: Entering directory '/tmp/ruby/build/trunk' I, [2024-05-08T02:59:14.209410 #3183965] INFO -- : make[1]: Nothing to be done for 'note'. I, [2024-05-08T02:59:14.209415 #3183965] INFO -- : make[1]: Leaving directory '/tmp/ruby/build/trunk' E, [2024-05-08T02:59:14.266692 #3183965] ERROR -- : $ /tmp/ruby/build/trunk/miniruby -I/tmp/ruby/src/trunk/lib /tmp/ruby/src/trunk/tool/runruby.rb --archdir=/tmp/ruby/build/trunk --extout=.ext -- /tmp/ruby/src/trunk/spec/mspec/bin/mspec-run -B /tmp/ruby/src/trunk/spec/default.mspec --error-output stderr --debug -fy -o /tmp/rubytest.qk5lju/1-mspec-multi-0 E, [2024-05-08T02:59:14.266885 #3183965] ERROR -- : $ /tmp/ruby/build/trunk/miniruby -I/tmp/ruby/src/trunk/lib /tmp/ruby/src/trunk/tool/runruby.rb --archdir=/tmp/ruby/build/trunk --extout=.ext -- /tmp/ruby/src/trunk/spec/mspec/bin/mspec-run -B /tmp/ruby/src/trunk/spec/default.mspec --error-output stderr --debug -fy -o /tmp/rubytest.qk5lju/2-mspec-multi-1 E, [2024-05-08T02:59:14.267220 #3183965] ERROR -- : $ /tmp/ruby/build/trunk/miniruby -I/tmp/ruby/src/trunk/lib /tmp/ruby/src/trunk/tool/runruby.rb --archdir=/tmp/ruby/build/trunk --extout=.ext -- /tmp/ruby/src/trunk/spec/mspec/bin/mspec-run -B /tmp/ruby/src/trunk/spec/default.mspec --error-output stderr --debug -fy -o /tmp/rubytest.qk5lju/3-mspec-multi-2 E, [2024-05-08T02:59:14.267522 #3183965] ERROR -- : $ /tmp/ruby/build/trunk/miniruby -I/tmp/ruby/src/trunk/lib /tmp/ruby/src/trunk/tool/runruby.rb --archdir=/tmp/ruby/build/trunk --extout=.ext -- /tmp/ruby/src/trunk/spec/mspec/bin/mspec-run -B /tmp/ruby/src/trunk/spec/default.mspec --error-output stderr --debug -fy -o /tmp/rubytest.qk5lju/4-mspec-multi-3 E, [2024-05-08T02:59:14.267700 #3183965] ERROR -- : $ /tmp/ruby/build/trunk/miniruby -I/tmp/ruby/src/trunk/lib /tmp/ruby/src/trunk/tool/runruby.rb --archdir=/tmp/ruby/build/trunk --extout=.ext -- /tmp/ruby/src/trunk/spec/mspec/bin/mspec-run -B /tmp/ruby/src/trunk/spec/default.mspec --error-output stderr --debug -fy -o /tmp/rubytest.qk5lju/5-mspec-multi-4 E, [2024-05-08T02:59:14.267735 #3183965] ERROR -- : $ /tmp/ruby/build/trunk/miniruby -I/tmp/ruby/src/trunk/lib /tmp/ruby/src/trunk/tool/runruby.rb --archdir=/tmp/ruby/build/trunk --extout=.ext -- /tmp/ruby/src/trunk/spec/mspec/bin/mspec-run -B /tmp/ruby/src/trunk/spec/default.mspec --error-output stderr --debug -fy -o /tmp/rubytest.qk5lju/6-mspec-multi-5 E, [2024-05-08T02:59:14.267967 #3183965] ERROR -- : $ /tmp/ruby/build/trunk/miniruby -I/tmp/ruby/src/trunk/lib /tmp/ruby/src/trunk/tool/runruby.rb --archdir=/tmp/ruby/build/trunk --extout=.ext -- /tmp/ruby/src/trunk/spec/mspec/bin/mspec-run -B /tmp/ruby/src/trunk/spec/default.mspec --error-output stderr --debug -fy -o /tmp/rubytest.qk5lju/7-mspec-multi-6 E, [2024-05-08T02:59:14.268143 #3183965] ERROR -- : $ /tmp/ruby/build/trunk/miniruby -I/tmp/ruby/src/trunk/lib /tmp/ruby/src/trunk/tool/runruby.rb --archdir=/tmp/ruby/build/trunk --extout=.ext -- /tmp/ruby/src/trunk/spec/mspec/bin/mspec-run -B /tmp/ruby/src/trunk/spec/default.mspec --error-output stderr --debug -fy -o /tmp/rubytest.qk5lju/8-mspec-multi-7 E, [2024-05-08T02:59:14.268349 #3183965] ERROR -- : $ /tmp/ruby/build/trunk/miniruby -I/tmp/ruby/src/trunk/lib /tmp/ruby/src/trunk/tool/runruby.rb --archdir=/tmp/ruby/build/trunk --extout=.ext -- /tmp/ruby/src/trunk/spec/mspec/bin/mspec-run -B /tmp/ruby/src/trunk/spec/default.mspec --error-output stderr --debug -fy -o /tmp/rubytest.qk5lju/9-mspec-multi-8 E, [2024-05-08T02:59:14.268469 #3183965] ERROR -- : $ /tmp/ruby/build/trunk/miniruby -I/tmp/ruby/src/trunk/lib /tmp/ruby/src/trunk/tool/runruby.rb --archdir=/tmp/ruby/build/trunk --extout=.ext -- /tmp/ruby/src/trunk/spec/mspec/bin/mspec-run -B /tmp/ruby/src/trunk/spec/default.mspec --error-output stderr --debug -fy -o /tmp/rubytest.qk5lju/10-mspec-multi-9 E, [2024-05-08T02:59:14.268638 #3183965] ERROR -- : $ /tmp/ruby/build/trunk/miniruby -I/tmp/ruby/src/trunk/lib /tmp/ruby/src/trunk/tool/runruby.rb --archdir=/tmp/ruby/build/trunk --extout=.ext -- /tmp/ruby/src/trunk/spec/mspec/bin/mspec-run -B /tmp/ruby/src/trunk/spec/default.mspec --error-output stderr --debug -fy -o /tmp/rubytest.qk5lju/11-mspec-multi-10 E, [2024-05-08T02:59:14.268826 #3183965] ERROR -- : $ /tmp/ruby/build/trunk/miniruby -I/tmp/ruby/src/trunk/lib /tmp/ruby/src/trunk/tool/runruby.rb --archdir=/tmp/ruby/build/trunk --extout=.ext -- /tmp/ruby/src/trunk/spec/mspec/bin/mspec-run -B /tmp/ruby/src/trunk/spec/default.mspec --error-output stderr --debug -fy -o /tmp/rubytest.qk5lju/12-mspec-multi-11 E, [2024-05-08T02:59:14.269067 #3183965] ERROR -- : $ /tmp/ruby/build/trunk/miniruby -I/tmp/ruby/src/trunk/lib /tmp/ruby/src/trunk/tool/runruby.rb --archdir=/tmp/ruby/build/trunk --extout=.ext -- /tmp/ruby/src/trunk/spec/mspec/bin/mspec-run -B /tmp/ruby/src/trunk/spec/default.mspec --error-output stderr --debug -fy -o /tmp/rubytest.qk5lju/13-mspec-multi-12 E, [2024-05-08T02:59:14.269344 #3183965] ERROR -- : $ /tmp/ruby/build/trunk/miniruby -I/tmp/ruby/src/trunk/lib /tmp/ruby/src/trunk/tool/runruby.rb --archdir=/tmp/ruby/build/trunk --extout=.ext -- /tmp/ruby/src/trunk/spec/mspec/bin/mspec-run -B /tmp/ruby/src/trunk/spec/default.mspec --error-output stderr --debug -fy -o /tmp/rubytest.qk5lju/14-mspec-multi-13 E, [2024-05-08T02:59:14.269480 #3183965] ERROR -- : $ /tmp/ruby/build/trunk/miniruby -I/tmp/ruby/src/trunk/lib /tmp/ruby/src/trunk/tool/runruby.rb --archdir=/tmp/ruby/build/trunk --extout=.ext -- /tmp/ruby/src/trunk/spec/mspec/bin/mspec-run -B /tmp/ruby/src/trunk/spec/default.mspec --error-output stderr --debug -fy -o /tmp/rubytest.qk5lju/15-mspec-multi-14 E, [2024-05-08T02:59:14.269662 #3183965] ERROR -- : $ /tmp/ruby/build/trunk/miniruby -I/tmp/ruby/src/trunk/lib /tmp/ruby/src/trunk/tool/runruby.rb --archdir=/tmp/ruby/build/trunk --extout=.ext -- /tmp/ruby/src/trunk/spec/mspec/bin/mspec-run -B /tmp/ruby/src/trunk/spec/default.mspec --error-output stderr --debug -fy -o /tmp/rubytest.qk5lju/16-mspec-multi-15 E, [2024-05-08T02:59:14.269831 #3183965] ERROR -- : $ /tmp/ruby/build/trunk/miniruby -I/tmp/ruby/src/trunk/lib /tmp/ruby/src/trunk/tool/runruby.rb --archdir=/tmp/ruby/build/trunk --extout=.ext -- /tmp/ruby/src/trunk/spec/mspec/bin/mspec-run -B /tmp/ruby/src/trunk/spec/default.mspec --error-output stderr --debug -fy -o /tmp/rubytest.qk5lju/17-mspec-multi-16 E, [2024-05-08T02:59:14.270036 #3183965] ERROR -- : $ /tmp/ruby/build/trunk/miniruby -I/tmp/ruby/src/trunk/lib /tmp/ruby/src/trunk/tool/runruby.rb --archdir=/tmp/ruby/build/trunk --extout=.ext -- /tmp/ruby/src/trunk/spec/mspec/bin/mspec-run -B /tmp/ruby/src/trunk/spec/default.mspec --error-output stderr --debug -fy -o /tmp/rubytest.qk5lju/18-mspec-multi-17 E, [2024-05-08T02:59:14.272448 #3183965] ERROR -- : $ /tmp/ruby/build/trunk/miniruby -I/tmp/ruby/src/trunk/lib /tmp/ruby/src/trunk/tool/runruby.rb --archdir=/tmp/ruby/build/trunk --extout=.ext -- /tmp/ruby/src/trunk/spec/mspec/bin/mspec-run -B /tmp/ruby/src/trunk/spec/default.mspec --error-output stderr --debug -fy -o /tmp/rubytest.qk5lju/19-mspec-multi-18 E, [2024-05-08T02:59:14.272821 #3183965] ERROR -- : $ /tmp/ruby/build/trunk/miniruby -I/tmp/ruby/src/trunk/lib /tmp/ruby/src/trunk/tool/runruby.rb --archdir=/tmp/ruby/build/trunk --extout=.ext -- /tmp/ruby/src/trunk/spec/mspec/bin/mspec-run -B /tmp/ruby/src/trunk/spec/default.mspec --error-output stderr --debug -fy -o /tmp/rubytest.qk5lju/20-mspec-multi-19 I, [2024-05-08T02:59:14.481189 #3183965] INFO -- : ruby 3.4.0dev (2024-05-07T18:24:31Z master b4b39a6199) [x86_64-linux] I, [2024-05-08T02:59:15.113526 #3183965] INFO -- : 0 ......................................................................... I, [2024-05-08T02:59:15.558155 #3183965] INFO -- : 73 ......................................................................... I, [2024-05-08T02:59:15.689459 #3183965] INFO -- : 146 ......................................................................... I, [2024-05-08T02:59:15.731870 #3183965] INFO -- : 219 ......................................................................... I, [2024-05-08T02:59:15.793990 #3183965] INFO -- : 292 ......................................................................... I, [2024-05-08T02:59:15.837199 #3183965] INFO -- : 365 ......................................................................... I, [2024-05-08T02:59:15.858351 #3183965] INFO -- : 438 ......................................................................... I, [2024-05-08T02:59:15.877336 #3183965] INFO -- : 511 ......................................................................... I, [2024-05-08T02:59:15.895845 #3183965] INFO -- : 584 ......................................................................... I, [2024-05-08T02:59:15.967806 #3183965] INFO -- : 657 ......................................................................... I, [2024-05-08T02:59:16.004325 #3183965] INFO -- : 730 ......................................................................... I, [2024-05-08T02:59:16.022196 #3183965] INFO -- : 803 ......................................................................... I, [2024-05-08T02:59:16.049458 #3183965] INFO -- : 876 ......................................................................... I, [2024-05-08T02:59:16.091637 #3183965] INFO -- : 949 ......................................................................... I, [2024-05-08T02:59:16.178683 #3183965] INFO -- : 1022 ......................................................................... I, [2024-05-08T02:59:16.354329 #3183965] INFO -- : 1095 ......................................................................... I, [2024-05-08T02:59:16.470372 #3183965] INFO -- : 1168 ......................................................................... I, [2024-05-08T02:59:16.532238 #3183965] INFO -- : 1241 ......................................................................... I, [2024-05-08T02:59:16.581230 #3183965] INFO -- : 1314 ......................................................................... I, [2024-05-08T02:59:16.603527 #3183965] INFO -- : 1387 ......................................................................... I, [2024-05-08T02:59:16.711469 #3183965] INFO -- : 1460 ......................................................................... I, [2024-05-08T02:59:17.203939 #3183965] INFO -- : 1533 ......................................................................... I, [2024-05-08T02:59:17.256616 #3183965] INFO -- : 1606 ......................................................................... I, [2024-05-08T02:59:17.365865 #3183965] INFO -- : 1679 ......................................................................... I, [2024-05-08T02:59:17.484221 #3183965] INFO -- : 1752 ......................................................................... I, [2024-05-08T02:59:17.555825 #3183965] INFO -- : 1825 ......................................................................... I, [2024-05-08T02:59:17.649219 #3183965] INFO -- : 1898 ......................................................................... I, [2024-05-08T02:59:17.737148 #3183965] INFO -- : 1971 ......................................................................... I, [2024-05-08T02:59:17.806634 #3183965] INFO -- : 2044 ......................................................................... I, [2024-05-08T02:59:17.870864 #3183965] INFO -- : 2117 ......................................................................... I, [2024-05-08T02:59:17.883584 #3183965] INFO -- : 2190 ......................................................................... I, [2024-05-08T02:59:17.906374 #3183965] INFO -- : 2263 ......................................................................... I, [2024-05-08T02:59:17.921617 #3183965] INFO -- : 2336 ......................................................................... I, [2024-05-08T02:59:17.963503 #3183965] INFO -- : 2409 ......................................................................... I, [2024-05-08T02:59:18.079385 #3183965] INFO -- : 2482 ......................................................................... I, [2024-05-08T02:59:18.100666 #3183965] INFO -- : 2555 ......................................................................... I, [2024-05-08T02:59:18.186541 #3183965] INFO -- : 2628 ......................................................................... I, [2024-05-08T02:59:18.304799 #3183965] INFO -- : 2701 ......................................................................... I, [2024-05-08T02:59:18.332831 #3183965] INFO -- : 2774 ......................................................................... I, [2024-05-08T02:59:18.397686 #3183965] INFO -- : 2847 ......................................................................... I, [2024-05-08T02:59:18.435704 #3183965] INFO -- : 2920 ......................................................................... I, [2024-05-08T02:59:18.463052 #3183965] INFO -- : 2993 ......................................................................... I, [2024-05-08T02:59:18.483472 #3183965] INFO -- : 3066 ......................................................................... I, [2024-05-08T02:59:18.501879 #3183965] INFO -- : 3139 ......................................................................... I, [2024-05-08T02:59:18.510618 #3183965] INFO -- : 3212 ......................................................................... I, [2024-05-08T02:59:18.539307 #3183965] INFO -- : 3285 ......................................................................... I, [2024-05-08T02:59:22.496785 #3183965] INFO -- : 3358 ........................................................................ I, [2024-05-08T02:59:22.496832 #3183965] INFO -- : I, [2024-05-08T02:59:22.496840 #3183965] INFO -- : Finished in 8.229384 seconds I, [2024-05-08T02:59:22.496844 #3183965] INFO -- : I, [2024-05-08T02:59:22.496849 #3183965] INFO -- : 3429 files, 32610 examples, 166212 expectations, 0 failures, 0 errors, 0 tagged I, [2024-05-08T02:59:22.498712 #3183965] INFO -- : $$$[end] "make yes-test-rubyspec MSPECOPT='--error-output stderr --debug -j' TESTS='-j20'" exit with 0.