# Logfile created on 2024-05-07 14:01:21 +0000 by logger.rb/v1.4.3 I, [2024-05-07T14:01:21.243408 #1311354] INFO -- : #, @formatter=nil, @logdev=#, @binmode=false, @mon_data=#, @mon_data_owner_object_id=860>>> I, [2024-05-07T14:01:21.243535 #1311354] INFO -- : $$$[beg] make update-unicode -j20 I, [2024-05-07T14:01:21.302208 #1311354] INFO -- : Downloading Unicode emoji 15.0 files... I, [2024-05-07T14:01:21.302478 #1311354] INFO -- : Downloading Unicode emoji 15.0 files... I, [2024-05-07T14:01:21.302884 #1311354] INFO -- : Downloading Unicode emoji 15.0 files... I, [2024-05-07T14:01:21.343419 #1311354] INFO -- : made symlink emoji/15.0/emoji-sequences.txt to /tmp/ruby/src/trunk/.downloaded-cache/emoji/15.0/emoji-sequences.txt I, [2024-05-07T14:01:21.343468 #1311354] INFO -- : downloading emoji/15.0/emoji-test.txt ... /tmp/ruby/src/trunk/enc/unicode/data/emoji/15.0/emoji-sequences.txt already exists I, [2024-05-07T14:01:21.343780 #1311354] INFO -- : downloading emoji/15.0/emoji-test.txt ... /tmp/ruby/src/trunk/enc/unicode/data/emoji/15.0/emoji-sequences.txt already exists E, [2024-05-07T14:01:21.776498 #1311354] ERROR -- : /tmp/ruby/src/trunk/tool/downloader.rb:302:in `rescue in download': failed to download emoji/15.0/emoji-test.txt (RuntimeError) E, [2024-05-07T14:01:21.776548 #1311354] ERROR -- : OpenURI::HTTPError: 403 Forbidden: https://www.unicode.org/Public/emoji/15.0/emoji-test.txt E, [2024-05-07T14:01:21.776554 #1311354] ERROR -- : from /tmp/ruby/src/trunk/tool/downloader.rb:201:in `download' E, [2024-05-07T14:01:21.776557 #1311354] ERROR -- : from /tmp/ruby/src/trunk/tool/downloader.rb:136:in `download' E, [2024-05-07T14:01:21.776561 #1311354] ERROR -- : from /tmp/ruby/src/trunk/tool/downloader.rb:482:in `block in
' E, [2024-05-07T14:01:21.776565 #1311354] ERROR -- : from /tmp/ruby/src/trunk/tool/downloader.rb:465:in `each' E, [2024-05-07T14:01:21.776573 #1311354] ERROR -- : from /tmp/ruby/src/trunk/tool/downloader.rb:465:in `
' E, [2024-05-07T14:01:21.776576 #1311354] ERROR -- : /usr/lib/ruby/3.0.0/open-uri.rb:364:in `open_http': 403 Forbidden (OpenURI::HTTPError) E, [2024-05-07T14:01:21.776579 #1311354] ERROR -- : from /usr/lib/ruby/3.0.0/open-uri.rb:741:in `buffer_open' E, [2024-05-07T14:01:21.776584 #1311354] ERROR -- : from /usr/lib/ruby/3.0.0/open-uri.rb:212:in `block in open_loop' E, [2024-05-07T14:01:21.776588 #1311354] ERROR -- : from /usr/lib/ruby/3.0.0/open-uri.rb:210:in `catch' E, [2024-05-07T14:01:21.776591 #1311354] ERROR -- : from /usr/lib/ruby/3.0.0/open-uri.rb:210:in `open_loop' E, [2024-05-07T14:01:21.776594 #1311354] ERROR -- : from /usr/lib/ruby/3.0.0/open-uri.rb:151:in `open_uri' E, [2024-05-07T14:01:21.776598 #1311354] ERROR -- : from /usr/lib/ruby/3.0.0/open-uri.rb:721:in `open' E, [2024-05-07T14:01:21.776601 #1311354] ERROR -- : from /usr/lib/ruby/3.0.0/open-uri.rb:729:in `read' E, [2024-05-07T14:01:21.776612 #1311354] ERROR -- : from /tmp/ruby/src/trunk/tool/downloader.rb:247:in `block in download' E, [2024-05-07T14:01:21.776615 #1311354] ERROR -- : from /tmp/ruby/src/trunk/tool/downloader.rb:378:in `with_retry' E, [2024-05-07T14:01:21.776619 #1311354] ERROR -- : from /tmp/ruby/src/trunk/tool/downloader.rb:246:in `download' E, [2024-05-07T14:01:21.776623 #1311354] ERROR -- : from /tmp/ruby/src/trunk/tool/downloader.rb:136:in `download' E, [2024-05-07T14:01:21.776627 #1311354] ERROR -- : from /tmp/ruby/src/trunk/tool/downloader.rb:482:in `block in
' E, [2024-05-07T14:01:21.776630 #1311354] ERROR -- : from /tmp/ruby/src/trunk/tool/downloader.rb:465:in `each' E, [2024-05-07T14:01:21.776633 #1311354] ERROR -- : from /tmp/ruby/src/trunk/tool/downloader.rb:465:in `
' E, [2024-05-07T14:01:21.778559 #1311354] ERROR -- : make: *** [uncommon.mk:1787: /tmp/ruby/src/trunk/enc/unicode/data/emoji/15.0/emoji-zwj-sequences.txt] Error 1 E, [2024-05-07T14:01:21.778579 #1311354] ERROR -- : make: *** Waiting for unfinished jobs.... E, [2024-05-07T14:01:21.795838 #1311354] ERROR -- : /tmp/ruby/src/trunk/tool/downloader.rb:302:in `rescue in download': failed to download emoji/15.0/emoji-test.txt (RuntimeError) E, [2024-05-07T14:01:21.795862 #1311354] ERROR -- : OpenURI::HTTPError: 403 Forbidden: https://www.unicode.org/Public/emoji/15.0/emoji-test.txt E, [2024-05-07T14:01:21.795868 #1311354] ERROR -- : from /tmp/ruby/src/trunk/tool/downloader.rb:201:in `download' E, [2024-05-07T14:01:21.795872 #1311354] ERROR -- : from /tmp/ruby/src/trunk/tool/downloader.rb:136:in `download' E, [2024-05-07T14:01:21.795875 #1311354] ERROR -- : from /tmp/ruby/src/trunk/tool/downloader.rb:482:in `block in
' E, [2024-05-07T14:01:21.795878 #1311354] ERROR -- : from /tmp/ruby/src/trunk/tool/downloader.rb:465:in `each' E, [2024-05-07T14:01:21.795882 #1311354] ERROR -- : from /tmp/ruby/src/trunk/tool/downloader.rb:465:in `
' E, [2024-05-07T14:01:21.795885 #1311354] ERROR -- : /usr/lib/ruby/3.0.0/open-uri.rb:364:in `open_http': 403 Forbidden (OpenURI::HTTPError) E, [2024-05-07T14:01:21.795889 #1311354] ERROR -- : from /usr/lib/ruby/3.0.0/open-uri.rb:741:in `buffer_open' E, [2024-05-07T14:01:21.795894 #1311354] ERROR -- : from /usr/lib/ruby/3.0.0/open-uri.rb:212:in `block in open_loop' E, [2024-05-07T14:01:21.795897 #1311354] ERROR -- : from /usr/lib/ruby/3.0.0/open-uri.rb:210:in `catch' E, [2024-05-07T14:01:21.795900 #1311354] ERROR -- : from /usr/lib/ruby/3.0.0/open-uri.rb:210:in `open_loop' E, [2024-05-07T14:01:21.795904 #1311354] ERROR -- : from /usr/lib/ruby/3.0.0/open-uri.rb:151:in `open_uri' E, [2024-05-07T14:01:21.795907 #1311354] ERROR -- : from /usr/lib/ruby/3.0.0/open-uri.rb:721:in `open' E, [2024-05-07T14:01:21.795910 #1311354] ERROR -- : from /usr/lib/ruby/3.0.0/open-uri.rb:729:in `read' E, [2024-05-07T14:01:21.795914 #1311354] ERROR -- : from /tmp/ruby/src/trunk/tool/downloader.rb:247:in `block in download' E, [2024-05-07T14:01:21.795917 #1311354] ERROR -- : from /tmp/ruby/src/trunk/tool/downloader.rb:378:in `with_retry' E, [2024-05-07T14:01:21.795922 #1311354] ERROR -- : from /tmp/ruby/src/trunk/tool/downloader.rb:246:in `download' E, [2024-05-07T14:01:21.795925 #1311354] ERROR -- : from /tmp/ruby/src/trunk/tool/downloader.rb:136:in `download' E, [2024-05-07T14:01:21.795929 #1311354] ERROR -- : from /tmp/ruby/src/trunk/tool/downloader.rb:482:in `block in
' E, [2024-05-07T14:01:21.795932 #1311354] ERROR -- : from /tmp/ruby/src/trunk/tool/downloader.rb:465:in `each' E, [2024-05-07T14:01:21.795935 #1311354] ERROR -- : from /tmp/ruby/src/trunk/tool/downloader.rb:465:in `
' E, [2024-05-07T14:01:21.797874 #1311354] ERROR -- : make: *** [uncommon.mk:1787: /tmp/ruby/src/trunk/enc/unicode/data/emoji/15.0/emoji-sequences.txt] Error 1 E, [2024-05-07T14:01:21.797894 #1311354] ERROR -- : make: *** Deleting file '/tmp/ruby/src/trunk/enc/unicode/data/emoji/15.0/emoji-sequences.txt' E, [2024-05-07T14:01:21.807383 #1311354] ERROR -- : /tmp/ruby/src/trunk/tool/downloader.rb:302:in `rescue in download': failed to download emoji/15.0/emoji-test.txt (RuntimeError) E, [2024-05-07T14:01:21.807410 #1311354] ERROR -- : OpenURI::HTTPError: 403 Forbidden: https://www.unicode.org/Public/emoji/15.0/emoji-test.txt E, [2024-05-07T14:01:21.807416 #1311354] ERROR -- : from /tmp/ruby/src/trunk/tool/downloader.rb:201:in `download' E, [2024-05-07T14:01:21.807420 #1311354] ERROR -- : from /tmp/ruby/src/trunk/tool/downloader.rb:136:in `download' E, [2024-05-07T14:01:21.807423 #1311354] ERROR -- : from /tmp/ruby/src/trunk/tool/downloader.rb:482:in `block in
' E, [2024-05-07T14:01:21.807427 #1311354] ERROR -- : from /tmp/ruby/src/trunk/tool/downloader.rb:465:in `each' E, [2024-05-07T14:01:21.807430 #1311354] ERROR -- : from /tmp/ruby/src/trunk/tool/downloader.rb:465:in `
' E, [2024-05-07T14:01:21.807434 #1311354] ERROR -- : /usr/lib/ruby/3.0.0/open-uri.rb:364:in `open_http': 403 Forbidden (OpenURI::HTTPError) E, [2024-05-07T14:01:21.807438 #1311354] ERROR -- : from /usr/lib/ruby/3.0.0/open-uri.rb:741:in `buffer_open' E, [2024-05-07T14:01:21.807442 #1311354] ERROR -- : from /usr/lib/ruby/3.0.0/open-uri.rb:212:in `block in open_loop' E, [2024-05-07T14:01:21.807445 #1311354] ERROR -- : from /usr/lib/ruby/3.0.0/open-uri.rb:210:in `catch' E, [2024-05-07T14:01:21.807449 #1311354] ERROR -- : from /usr/lib/ruby/3.0.0/open-uri.rb:210:in `open_loop' E, [2024-05-07T14:01:21.807452 #1311354] ERROR -- : from /usr/lib/ruby/3.0.0/open-uri.rb:151:in `open_uri' E, [2024-05-07T14:01:21.807524 #1311354] ERROR -- : from /usr/lib/ruby/3.0.0/open-uri.rb:721:in `open' E, [2024-05-07T14:01:21.807528 #1311354] ERROR -- : from /usr/lib/ruby/3.0.0/open-uri.rb:729:in `read' E, [2024-05-07T14:01:21.807531 #1311354] ERROR -- : from /tmp/ruby/src/trunk/tool/downloader.rb:247:in `block in download' E, [2024-05-07T14:01:21.807535 #1311354] ERROR -- : from /tmp/ruby/src/trunk/tool/downloader.rb:378:in `with_retry' E, [2024-05-07T14:01:21.807538 #1311354] ERROR -- : from /tmp/ruby/src/trunk/tool/downloader.rb:246:in `download' E, [2024-05-07T14:01:21.807541 #1311354] ERROR -- : from /tmp/ruby/src/trunk/tool/downloader.rb:136:in `download' E, [2024-05-07T14:01:21.807545 #1311354] ERROR -- : from /tmp/ruby/src/trunk/tool/downloader.rb:482:in `block in
' E, [2024-05-07T14:01:21.807548 #1311354] ERROR -- : from /tmp/ruby/src/trunk/tool/downloader.rb:465:in `each' E, [2024-05-07T14:01:21.807553 #1311354] ERROR -- : from /tmp/ruby/src/trunk/tool/downloader.rb:465:in `
' E, [2024-05-07T14:01:21.808980 #1311354] ERROR -- : make: *** [uncommon.mk:1787: /tmp/ruby/src/trunk/enc/unicode/data/emoji/15.0/emoji-test.txt] Error 1 I, [2024-05-07T14:01:21.809043 #1311354] INFO -- : downloading emoji/15.0/emoji-test.txt ... I, [2024-05-07T14:01:21.809403 #1311354] INFO -- : $$$[end] "make update-unicode -j20" exit with 512. I, [2024-05-07T14:01:21.809431 #1311354] INFO -- : $$$[beg] make update-download -j20 I, [2024-05-07T14:01:21.908069 #1311354] INFO -- : tool/config.guess already exists I, [2024-05-07T14:01:21.908106 #1311354] INFO -- : tool/config.sub already exists I, [2024-05-07T14:01:21.910404 #1311354] INFO -- : Update minitest to ea9caafc0754b1d6236a490d59e624b53209734a I, [2024-05-07T14:01:21.910685 #1311354] INFO -- : Update power_assert to 84e85124c5014a139af39161d484156cfe87a9ed I, [2024-05-07T14:01:21.911214 #1311354] INFO -- : Update rbs to ba7872795d5de04adb8ff500c0e6afdc81a041dd I, [2024-05-07T14:01:21.911468 #1311354] INFO -- : Update typeprof to b19a6416da3a05d57fadd6ffdadb382b6d236ca5 I, [2024-05-07T14:01:21.911643 #1311354] INFO -- : echo ea9caafc0754b1d6236a490d59e624b53209734a | /bin/sh /tmp/ruby/src/trunk/tool/ifchange /tmp/ruby/src/trunk/.bundle/.timestamp/minitest.revision - I, [2024-05-07T14:01:21.911953 #1311354] INFO -- : echo 84e85124c5014a139af39161d484156cfe87a9ed | /bin/sh /tmp/ruby/src/trunk/tool/ifchange /tmp/ruby/src/trunk/.bundle/.timestamp/power_assert.revision - I, [2024-05-07T14:01:21.912612 #1311354] INFO -- : echo ba7872795d5de04adb8ff500c0e6afdc81a041dd | /bin/sh /tmp/ruby/src/trunk/tool/ifchange /tmp/ruby/src/trunk/.bundle/.timestamp/rbs.revision - I, [2024-05-07T14:01:21.912648 #1311354] INFO -- : echo b19a6416da3a05d57fadd6ffdadb382b6d236ca5 | /bin/sh /tmp/ruby/src/trunk/tool/ifchange /tmp/ruby/src/trunk/.bundle/.timestamp/typeprof.revision - I, [2024-05-07T14:01:21.913788 #1311354] INFO -- : /tmp/ruby/src/trunk/.bundle/.timestamp/minitest.revision unchanged I, [2024-05-07T14:01:21.914060 #1311354] INFO -- : /tmp/ruby/src/trunk/.bundle/.timestamp/power_assert.revision unchanged I, [2024-05-07T14:01:21.914301 #1311354] INFO -- : /tmp/ruby/src/trunk/.bundle/.timestamp/rbs.revision unchanged I, [2024-05-07T14:01:21.914701 #1311354] INFO -- : /tmp/ruby/src/trunk/.bundle/.timestamp/typeprof.revision unchanged I, [2024-05-07T14:01:21.915057 #1311354] INFO -- : Building power_assert@84e85124c5014a139af39161d484156cfe87a9ed to /tmp/ruby/src/trunk/gems/power_assert-2.0.3.gem I, [2024-05-07T14:01:21.984296 #1311354] INFO -- : Successfully built RubyGem I, [2024-05-07T14:01:21.984352 #1311354] INFO -- : Name: power_assert I, [2024-05-07T14:01:21.984372 #1311354] INFO -- : Version: 2.0.4dev I, [2024-05-07T14:01:21.984383 #1311354] INFO -- : File: power_assert-2.0.4dev.gem I, [2024-05-07T14:01:22.030209 #1311354] INFO -- : $$$[end] "make update-download -j20" exit with 0. I, [2024-05-07T14:01:22.030273 #1311354] INFO -- : $$$[beg] make update-rubyspec -j20 I, [2024-05-07T14:01:22.088154 #1311354] INFO -- : make: Nothing to be done for 'update-rubyspec'. I, [2024-05-07T14:01:22.088485 #1311354] INFO -- : $$$[end] "make update-rubyspec -j20" exit with 0. I, [2024-05-07T14:01:22.088524 #1311354] INFO -- : $$$[beg] make update-src -j20 I, [2024-05-07T14:01:22.630862 #1311354] INFO -- : Already up to date. I, [2024-05-07T14:01:22.640006 #1311354] INFO -- : Latest commit hash = e1e6b4972f I, [2024-05-07T14:01:22.641057 #1311354] INFO -- : $$$[end] "make update-src -j20" exit with 0. I, [2024-05-07T14:01:22.641113 #1311354] INFO -- : $$$[beg] make after-update -j20 I, [2024-05-07T14:01:22.709126 #1311354] INFO -- : generating /tmp/ruby/src/trunk/ext/ripper/eventids2table.c I, [2024-05-07T14:01:22.713269 #1311354] INFO -- : make[1]: Entering directory '/tmp/ruby/src/trunk/ext/ripper' I, [2024-05-07T14:01:22.713318 #1311354] INFO -- : make[1]: Nothing to be done for 'src'. I, [2024-05-07T14:01:22.713330 #1311354] INFO -- : make[1]: Leaving directory '/tmp/ruby/src/trunk/ext/ripper' I, [2024-05-07T14:01:22.730039 #1311354] INFO -- : /tmp/ruby/src/trunk/revision.h updated I, [2024-05-07T14:01:22.731479 #1311354] INFO -- : generating x86_64-linux-fake.rb I, [2024-05-07T14:01:22.782074 #1311354] INFO -- : x86_64-linux-fake.rb updated I, [2024-05-07T14:01:22.783483 #1311354] INFO -- : generating enc.mk I, [2024-05-07T14:01:22.901632 #1311354] INFO -- : making srcs under enc I, [2024-05-07T14:01:22.932024 #1311354] INFO -- : make[1]: Entering directory '/tmp/ruby/build/trunk' I, [2024-05-07T14:01:22.932088 #1311354] INFO -- : make[1]: Nothing to be done for 'srcs'. I, [2024-05-07T14:01:22.932102 #1311354] INFO -- : make[1]: Leaving directory '/tmp/ruby/build/trunk' I, [2024-05-07T14:01:22.977406 #1311354] INFO -- : Update minitest to ea9caafc0754b1d6236a490d59e624b53209734a I, [2024-05-07T14:01:22.977557 #1311354] INFO -- : Update power_assert to 84e85124c5014a139af39161d484156cfe87a9ed I, [2024-05-07T14:01:22.978389 #1311354] INFO -- : Update rbs to ba7872795d5de04adb8ff500c0e6afdc81a041dd I, [2024-05-07T14:01:22.978684 #1311354] INFO -- : Update typeprof to b19a6416da3a05d57fadd6ffdadb382b6d236ca5 I, [2024-05-07T14:01:22.979324 #1311354] INFO -- : echo ea9caafc0754b1d6236a490d59e624b53209734a | /bin/sh /tmp/ruby/src/trunk/tool/ifchange /tmp/ruby/src/trunk/.bundle/.timestamp/minitest.revision - I, [2024-05-07T14:01:22.979521 #1311354] INFO -- : echo 84e85124c5014a139af39161d484156cfe87a9ed | /bin/sh /tmp/ruby/src/trunk/tool/ifchange /tmp/ruby/src/trunk/.bundle/.timestamp/power_assert.revision - I, [2024-05-07T14:01:22.980821 #1311354] INFO -- : echo ba7872795d5de04adb8ff500c0e6afdc81a041dd | /bin/sh /tmp/ruby/src/trunk/tool/ifchange /tmp/ruby/src/trunk/.bundle/.timestamp/rbs.revision - I, [2024-05-07T14:01:22.980956 #1311354] INFO -- : echo b19a6416da3a05d57fadd6ffdadb382b6d236ca5 | /bin/sh /tmp/ruby/src/trunk/tool/ifchange /tmp/ruby/src/trunk/.bundle/.timestamp/typeprof.revision - I, [2024-05-07T14:01:22.981546 #1311354] INFO -- : /tmp/ruby/src/trunk/.bundle/.timestamp/minitest.revision unchanged I, [2024-05-07T14:01:22.981571 #1311354] INFO -- : /tmp/ruby/src/trunk/.bundle/.timestamp/power_assert.revision unchanged I, [2024-05-07T14:01:22.982614 #1311354] INFO -- : /tmp/ruby/src/trunk/.bundle/.timestamp/rbs.revision unchanged I, [2024-05-07T14:01:22.982765 #1311354] INFO -- : Building power_assert@84e85124c5014a139af39161d484156cfe87a9ed to /tmp/ruby/src/trunk/gems/power_assert-2.0.3.gem I, [2024-05-07T14:01:22.982865 #1311354] INFO -- : /tmp/ruby/src/trunk/.bundle/.timestamp/typeprof.revision unchanged I, [2024-05-07T14:01:23.051394 #1311354] INFO -- : Successfully built RubyGem I, [2024-05-07T14:01:23.051451 #1311354] INFO -- : Name: power_assert I, [2024-05-07T14:01:23.051469 #1311354] INFO -- : Version: 2.0.4dev I, [2024-05-07T14:01:23.051481 #1311354] INFO -- : File: power_assert-2.0.4dev.gem I, [2024-05-07T14:01:23.053562 #1311354] INFO -- : Extracting bundle gem power_assert-2.0.3... I, [2024-05-07T14:01:23.115485 #1311354] INFO -- : Try with hash version of bundled gems instead of gems/power_assert-2.0.3.gem. We don't use this gem with release version of Ruby. I, [2024-05-07T14:01:23.120482 #1311354] INFO -- : Unpacked gems/power_assert-2.0.4dev.gem I, [2024-05-07T14:01:23.122543 #1311354] INFO -- : $$$[end] "make after-update -j20" exit with 0. I, [2024-05-07T14:01:23.122748 #1311354] INFO -- : $$$[beg] make miniruby -j20 I, [2024-05-07T14:01:23.180019 #1311354] INFO -- : BASERUBY = /usr/bin/ruby --disable=gems I, [2024-05-07T14:01:23.180067 #1311354] INFO -- : CC = gcc I, [2024-05-07T14:01:23.180079 #1311354] INFO -- : LD = ld I, [2024-05-07T14:01:23.180090 #1311354] INFO -- : LDSHARED = gcc -shared I, [2024-05-07T14:01:23.180100 #1311354] INFO -- : CFLAGS = -O3 -fno-fast-math -ggdb3 -Wall -Wextra -Wdeprecated-declarations -Wdiv-by-zero -Wduplicated-cond -Wimplicit-function-declaration -Wimplicit-int -Wpointer-arith -Wwrite-strings -Wold-style-definition -Wimplicit-fallthrough=0 -Wmissing-noreturn -Wno-cast-function-type -Wno-constant-logical-operand -Wno-long-long -Wno-missing-field-initializers -Wno-overlength-strings -Wno-packed-bitfield-compat -Wno-parentheses-equality -Wno-self-assign -Wno-tautological-compare -Wno-unused-parameter -Wno-unused-value -Wsuggest-attribute=format -Wsuggest-attribute=noreturn -Wunused-variable -Wmisleading-indentation -Wundef -fPIC I, [2024-05-07T14:01:23.180110 #1311354] INFO -- : XCFLAGS = -U_FORTIFY_SOURCE -D_FORTIFY_SOURCE=2 -fstack-protector-strong -fno-strict-overflow -fvisibility=hidden -fexcess-precision=standard -DRUBY_EXPORT -I. -I.ext/include/x86_64-linux -I/tmp/ruby/src/trunk/include -I/tmp/ruby/src/trunk -I/tmp/ruby/src/trunk/prism -I/tmp/ruby/src/trunk/enc/unicode/15.0.0 I, [2024-05-07T14:01:23.180127 #1311354] INFO -- : CPPFLAGS = I, [2024-05-07T14:01:23.180137 #1311354] INFO -- : DLDFLAGS = -Wl,--compress-debug-sections=zlib -Wl,-soname,libruby.so.3.4 -fstack-protector-strong I, [2024-05-07T14:01:23.180148 #1311354] INFO -- : SOLIBS = -lz -lrt -lrt -lgmp -ldl -lcrypt -lm -lpthread I, [2024-05-07T14:01:23.180158 #1311354] INFO -- : LANG = en_US.UTF-8 I, [2024-05-07T14:01:23.180168 #1311354] INFO -- : LC_ALL = I, [2024-05-07T14:01:23.180177 #1311354] INFO -- : LC_CTYPE = I, [2024-05-07T14:01:23.180186 #1311354] INFO -- : MFLAGS = -j20 --jobserver-auth=4,5 I, [2024-05-07T14:01:23.180196 #1311354] INFO -- : RUSTC = no I, [2024-05-07T14:01:23.180206 #1311354] INFO -- : YJIT_RUSTC_ARGS = --crate-name=yjit --crate-type=staticlib --edition=2021 -g -C lto=thin -C opt-level=3 -C overflow-checks=on '--out-dir=/tmp/ruby/build/trunk/yjit/target/release/' /tmp/ruby/src/trunk/yjit/src/lib.rs I, [2024-05-07T14:01:23.181790 #1311354] INFO -- : gcc (Ubuntu 11.4.0-1ubuntu1~22.04) 11.4.0 I, [2024-05-07T14:01:23.181837 #1311354] INFO -- : Copyright (C) 2021 Free Software Foundation, Inc. I, [2024-05-07T14:01:23.181850 #1311354] INFO -- : This is free software; see the source for copying conditions. There is NO I, [2024-05-07T14:01:23.181861 #1311354] INFO -- : warranty; not even for MERCHANTABILITY or FITNESS FOR A PARTICULAR PURPOSE. I, [2024-05-07T14:01:23.181871 #1311354] INFO -- : I, [2024-05-07T14:01:23.203171 #1311354] INFO -- : compiling /tmp/ruby/src/trunk/version.c I, [2024-05-07T14:01:23.307786 #1311354] INFO -- : linking miniruby I, [2024-05-07T14:01:23.831026 #1311354] INFO -- : $$$[end] "make miniruby -j20" exit with 0. I, [2024-05-07T14:01:23.831176 #1311354] INFO -- : $$$[beg] make ruby -j20 I, [2024-05-07T14:01:23.888541 #1311354] INFO -- : BASERUBY = /usr/bin/ruby --disable=gems I, [2024-05-07T14:01:23.888583 #1311354] INFO -- : CC = gcc I, [2024-05-07T14:01:23.888589 #1311354] INFO -- : LD = ld I, [2024-05-07T14:01:23.888596 #1311354] INFO -- : LDSHARED = gcc -shared I, [2024-05-07T14:01:23.888600 #1311354] INFO -- : CFLAGS = -O3 -fno-fast-math -ggdb3 -Wall -Wextra -Wdeprecated-declarations -Wdiv-by-zero -Wduplicated-cond -Wimplicit-function-declaration -Wimplicit-int -Wpointer-arith -Wwrite-strings -Wold-style-definition -Wimplicit-fallthrough=0 -Wmissing-noreturn -Wno-cast-function-type -Wno-constant-logical-operand -Wno-long-long -Wno-missing-field-initializers -Wno-overlength-strings -Wno-packed-bitfield-compat -Wno-parentheses-equality -Wno-self-assign -Wno-tautological-compare -Wno-unused-parameter -Wno-unused-value -Wsuggest-attribute=format -Wsuggest-attribute=noreturn -Wunused-variable -Wmisleading-indentation -Wundef -fPIC I, [2024-05-07T14:01:23.888605 #1311354] INFO -- : XCFLAGS = -U_FORTIFY_SOURCE -D_FORTIFY_SOURCE=2 -fstack-protector-strong -fno-strict-overflow -fvisibility=hidden -fexcess-precision=standard -DRUBY_EXPORT -I. -I.ext/include/x86_64-linux -I/tmp/ruby/src/trunk/include -I/tmp/ruby/src/trunk -I/tmp/ruby/src/trunk/prism -I/tmp/ruby/src/trunk/enc/unicode/15.0.0 I, [2024-05-07T14:01:23.888608 #1311354] INFO -- : CPPFLAGS = I, [2024-05-07T14:01:23.888612 #1311354] INFO -- : DLDFLAGS = -Wl,--compress-debug-sections=zlib -Wl,-soname,libruby.so.3.4 -fstack-protector-strong I, [2024-05-07T14:01:23.888615 #1311354] INFO -- : SOLIBS = -lz -lrt -lrt -lgmp -ldl -lcrypt -lm -lpthread I, [2024-05-07T14:01:23.888619 #1311354] INFO -- : LANG = en_US.UTF-8 I, [2024-05-07T14:01:23.888622 #1311354] INFO -- : LC_ALL = I, [2024-05-07T14:01:23.888626 #1311354] INFO -- : LC_CTYPE = I, [2024-05-07T14:01:23.888630 #1311354] INFO -- : MFLAGS = -j20 --jobserver-auth=4,5 I, [2024-05-07T14:01:23.888633 #1311354] INFO -- : RUSTC = no I, [2024-05-07T14:01:23.888637 #1311354] INFO -- : YJIT_RUSTC_ARGS = --crate-name=yjit --crate-type=staticlib --edition=2021 -g -C lto=thin -C opt-level=3 -C overflow-checks=on '--out-dir=/tmp/ruby/build/trunk/yjit/target/release/' /tmp/ruby/src/trunk/yjit/src/lib.rs I, [2024-05-07T14:01:23.890596 #1311354] INFO -- : gcc (Ubuntu 11.4.0-1ubuntu1~22.04) 11.4.0 I, [2024-05-07T14:01:23.890615 #1311354] INFO -- : Copyright (C) 2021 Free Software Foundation, Inc. I, [2024-05-07T14:01:23.890621 #1311354] INFO -- : This is free software; see the source for copying conditions. There is NO I, [2024-05-07T14:01:23.890625 #1311354] INFO -- : warranty; not even for MERCHANTABILITY or FITNESS FOR A PARTICULAR PURPOSE. I, [2024-05-07T14:01:23.890628 #1311354] INFO -- : I, [2024-05-07T14:01:24.001316 #1311354] INFO -- : builtin_binary.inc updated I, [2024-05-07T14:01:24.005855 #1311354] INFO -- : c5234a9416e4f20f175185e840b25b0f08674d14078ed7083f37e655458e3ca9 builtin_binary.inc I, [2024-05-07T14:01:24.006506 #1311354] INFO -- : compiling /tmp/ruby/src/trunk/builtin.c I, [2024-05-07T14:01:24.189912 #1311354] INFO -- : linking static-library libruby-static.a I, [2024-05-07T14:01:24.505137 #1311354] INFO -- : linking shared-library libruby.so.3.4.0 I, [2024-05-07T14:01:26.046063 #1311354] INFO -- : linking ruby I, [2024-05-07T14:01:26.068556 #1311354] INFO -- : $$$[end] "make ruby -j20" exit with 0. I, [2024-05-07T14:01:26.068740 #1311354] INFO -- : $$$[beg] make all -j20 I, [2024-05-07T14:01:26.127292 #1311354] INFO -- : BASERUBY = /usr/bin/ruby --disable=gems I, [2024-05-07T14:01:26.127343 #1311354] INFO -- : CC = gcc I, [2024-05-07T14:01:26.127355 #1311354] INFO -- : LD = ld I, [2024-05-07T14:01:26.127367 #1311354] INFO -- : LDSHARED = gcc -shared I, [2024-05-07T14:01:26.127380 #1311354] INFO -- : CFLAGS = -O3 -fno-fast-math -ggdb3 -Wall -Wextra -Wdeprecated-declarations -Wdiv-by-zero -Wduplicated-cond -Wimplicit-function-declaration -Wimplicit-int -Wpointer-arith -Wwrite-strings -Wold-style-definition -Wimplicit-fallthrough=0 -Wmissing-noreturn -Wno-cast-function-type -Wno-constant-logical-operand -Wno-long-long -Wno-missing-field-initializers -Wno-overlength-strings -Wno-packed-bitfield-compat -Wno-parentheses-equality -Wno-self-assign -Wno-tautological-compare -Wno-unused-parameter -Wno-unused-value -Wsuggest-attribute=format -Wsuggest-attribute=noreturn -Wunused-variable -Wmisleading-indentation -Wundef -fPIC I, [2024-05-07T14:01:26.127392 #1311354] INFO -- : XCFLAGS = -U_FORTIFY_SOURCE -D_FORTIFY_SOURCE=2 -fstack-protector-strong -fno-strict-overflow -fvisibility=hidden -fexcess-precision=standard -DRUBY_EXPORT -I. -I.ext/include/x86_64-linux -I/tmp/ruby/src/trunk/include -I/tmp/ruby/src/trunk -I/tmp/ruby/src/trunk/prism -I/tmp/ruby/src/trunk/enc/unicode/15.0.0 I, [2024-05-07T14:01:26.127402 #1311354] INFO -- : CPPFLAGS = I, [2024-05-07T14:01:26.127413 #1311354] INFO -- : DLDFLAGS = -Wl,--compress-debug-sections=zlib -Wl,-soname,libruby.so.3.4 -fstack-protector-strong I, [2024-05-07T14:01:26.127423 #1311354] INFO -- : SOLIBS = -lz -lrt -lrt -lgmp -ldl -lcrypt -lm -lpthread I, [2024-05-07T14:01:26.127433 #1311354] INFO -- : LANG = en_US.UTF-8 I, [2024-05-07T14:01:26.127443 #1311354] INFO -- : LC_ALL = I, [2024-05-07T14:01:26.127453 #1311354] INFO -- : LC_CTYPE = I, [2024-05-07T14:01:26.127463 #1311354] INFO -- : MFLAGS = -j20 --jobserver-auth=4,5 I, [2024-05-07T14:01:26.127473 #1311354] INFO -- : RUSTC = no I, [2024-05-07T14:01:26.127485 #1311354] INFO -- : YJIT_RUSTC_ARGS = --crate-name=yjit --crate-type=staticlib --edition=2021 -g -C lto=thin -C opt-level=3 -C overflow-checks=on '--out-dir=/tmp/ruby/build/trunk/yjit/target/release/' /tmp/ruby/src/trunk/yjit/src/lib.rs I, [2024-05-07T14:01:26.129379 #1311354] INFO -- : gcc (Ubuntu 11.4.0-1ubuntu1~22.04) 11.4.0 I, [2024-05-07T14:01:26.129427 #1311354] INFO -- : Copyright (C) 2021 Free Software Foundation, Inc. I, [2024-05-07T14:01:26.129440 #1311354] INFO -- : This is free software; see the source for copying conditions. There is NO I, [2024-05-07T14:01:26.129451 #1311354] INFO -- : warranty; not even for MERCHANTABILITY or FITNESS FOR A PARTICULAR PURPOSE. I, [2024-05-07T14:01:26.129461 #1311354] INFO -- : I, [2024-05-07T14:01:26.159430 #1311354] INFO -- : generating enc.mk I, [2024-05-07T14:01:26.161450 #1311354] INFO -- : building spec/ruby/optional/capi/ext/array_spec.so I, [2024-05-07T14:01:26.161755 #1311354] INFO -- : building spec/ruby/optional/capi/ext/basic_object_spec.so I, [2024-05-07T14:01:26.162348 #1311354] INFO -- : building spec/ruby/optional/capi/ext/bignum_spec.so I, [2024-05-07T14:01:26.162818 #1311354] INFO -- : building spec/ruby/optional/capi/ext/binding_spec.so I, [2024-05-07T14:01:26.163150 #1311354] INFO -- : building spec/ruby/optional/capi/ext/boolean_spec.so I, [2024-05-07T14:01:26.163839 #1311354] INFO -- : building spec/ruby/optional/capi/ext/class_id_under_autoload_spec.so I, [2024-05-07T14:01:26.164143 #1311354] INFO -- : building spec/ruby/optional/capi/ext/class_spec.so I, [2024-05-07T14:01:26.165066 #1311354] INFO -- : building spec/ruby/optional/capi/ext/class_under_autoload_spec.so I, [2024-05-07T14:01:26.165376 #1311354] INFO -- : building spec/ruby/optional/capi/ext/complex_spec.so I, [2024-05-07T14:01:26.166020 #1311354] INFO -- : building spec/ruby/optional/capi/ext/constants_spec.so I, [2024-05-07T14:01:26.167037 #1311354] INFO -- : building spec/ruby/optional/capi/ext/data_spec.so I, [2024-05-07T14:01:26.167666 #1311354] INFO -- : building spec/ruby/optional/capi/ext/debug_spec.so I, [2024-05-07T14:01:26.167977 #1311354] INFO -- : building spec/ruby/optional/capi/ext/encoding_spec.so I, [2024-05-07T14:01:26.168573 #1311354] INFO -- : building spec/ruby/optional/capi/ext/enumerator_spec.so I, [2024-05-07T14:01:26.169204 #1311354] INFO -- : building spec/ruby/optional/capi/ext/exception_spec.so I, [2024-05-07T14:01:26.169560 #1311354] INFO -- : building spec/ruby/optional/capi/ext/fiber_spec.so I, [2024-05-07T14:01:26.170199 #1311354] INFO -- : building spec/ruby/optional/capi/ext/file_spec.so I, [2024-05-07T14:01:26.170866 #1311354] INFO -- : building spec/ruby/optional/capi/ext/fixnum_spec.so I, [2024-05-07T14:01:26.171458 #1311354] INFO -- : building spec/ruby/optional/capi/ext/float_spec.so I, [2024-05-07T14:01:26.293970 #1311354] INFO -- : building spec/ruby/optional/capi/ext/gc_spec.so I, [2024-05-07T14:01:26.301274 #1311354] INFO -- : building spec/ruby/optional/capi/ext/globals_spec.so I, [2024-05-07T14:01:26.301995 #1311354] INFO -- : building spec/ruby/optional/capi/ext/hash_spec.so I, [2024-05-07T14:01:26.310978 #1311354] INFO -- : building spec/ruby/optional/capi/ext/integer_spec.so I, [2024-05-07T14:01:26.311481 #1311354] INFO -- : building spec/ruby/optional/capi/ext/io_spec.so I, [2024-05-07T14:01:26.320628 #1311354] INFO -- : building spec/ruby/optional/capi/ext/kernel_spec.so I, [2024-05-07T14:01:26.327976 #1311354] INFO -- : building spec/ruby/optional/capi/ext/language_spec.so I, [2024-05-07T14:01:26.331718 #1311354] INFO -- : building spec/ruby/optional/capi/ext/marshal_spec.so I, [2024-05-07T14:01:26.339297 #1311354] INFO -- : building spec/ruby/optional/capi/ext/module_spec.so I, [2024-05-07T14:01:26.352820 #1311354] INFO -- : building spec/ruby/optional/capi/ext/module_under_autoload_spec.so I, [2024-05-07T14:01:26.359788 #1311354] INFO -- : building spec/ruby/optional/capi/ext/mutex_spec.so I, [2024-05-07T14:01:26.363630 #1311354] INFO -- : building spec/ruby/optional/capi/ext/numeric_spec.so I, [2024-05-07T14:01:26.364443 #1311354] INFO -- : building spec/ruby/optional/capi/ext/object_spec.so I, [2024-05-07T14:01:26.377881 #1311354] INFO -- : building spec/ruby/optional/capi/ext/proc_spec.so I, [2024-05-07T14:01:26.386172 #1311354] INFO -- : building spec/ruby/optional/capi/ext/range_spec.so I, [2024-05-07T14:01:26.397297 #1311354] INFO -- : building spec/ruby/optional/capi/ext/rational_spec.so I, [2024-05-07T14:01:26.426269 #1311354] INFO -- : building spec/ruby/optional/capi/ext/rbasic_spec.so I, [2024-05-07T14:01:26.469618 #1311354] INFO -- : building spec/ruby/optional/capi/ext/regexp_spec.so I, [2024-05-07T14:01:26.470183 #1311354] INFO -- : building spec/ruby/optional/capi/ext/string_spec.so I, [2024-05-07T14:01:26.470960 #1311354] INFO -- : building spec/ruby/optional/capi/ext/struct_spec.so I, [2024-05-07T14:01:26.486492 #1311354] INFO -- : building spec/ruby/optional/capi/ext/st_spec.so I, [2024-05-07T14:01:26.487626 #1311354] INFO -- : building spec/ruby/optional/capi/ext/symbol_spec.so I, [2024-05-07T14:01:26.491081 #1311354] INFO -- : building spec/ruby/optional/capi/ext/thread_spec.so I, [2024-05-07T14:01:26.501452 #1311354] INFO -- : building spec/ruby/optional/capi/ext/time_spec.so I, [2024-05-07T14:01:26.509989 #1311354] INFO -- : building spec/ruby/optional/capi/ext/tracepoint_spec.so I, [2024-05-07T14:01:26.528052 #1311354] INFO -- : building spec/ruby/optional/capi/ext/typed_data_spec.so I, [2024-05-07T14:01:26.534026 #1311354] INFO -- : building spec/ruby/optional/capi/ext/util_spec.so I, [2024-05-07T14:01:26.549007 #1311354] INFO -- : making enc I, [2024-05-07T14:01:26.555615 #1311354] INFO -- : making srcs under enc I, [2024-05-07T14:01:26.586797 #1311354] INFO -- : make[1]: Entering directory '/tmp/ruby/build/trunk' I, [2024-05-07T14:01:26.586892 #1311354] INFO -- : make[1]: Nothing to be done for 'enc'. I, [2024-05-07T14:01:26.586937 #1311354] INFO -- : make[1]: Leaving directory '/tmp/ruby/build/trunk' I, [2024-05-07T14:01:26.603199 #1311354] INFO -- : make[1]: Entering directory '/tmp/ruby/build/trunk' I, [2024-05-07T14:01:26.603259 #1311354] INFO -- : make[1]: Nothing to be done for 'srcs'. I, [2024-05-07T14:01:26.603268 #1311354] INFO -- : make[1]: Leaving directory '/tmp/ruby/build/trunk' I, [2024-05-07T14:01:26.604026 #1311354] INFO -- : generating transdb.h I, [2024-05-07T14:01:26.707765 #1311354] INFO -- : transdb.h unchanged I, [2024-05-07T14:01:26.709226 #1311354] INFO -- : generating makefiles ext/configure-ext.mk I, [2024-05-07T14:01:26.709648 #1311354] INFO -- : making trans I, [2024-05-07T14:01:26.737130 #1311354] INFO -- : ext/configure-ext.mk updated I, [2024-05-07T14:01:26.739744 #1311354] INFO -- : make[1]: Entering directory '/tmp/ruby/build/trunk' I, [2024-05-07T14:01:26.745329 #1311354] INFO -- : make[1]: Entering directory '/tmp/ruby/build/trunk' I, [2024-05-07T14:01:26.745415 #1311354] INFO -- : make[1]: Nothing to be done for 'trans'. I, [2024-05-07T14:01:26.745427 #1311354] INFO -- : make[1]: Leaving directory '/tmp/ruby/build/trunk' I, [2024-05-07T14:01:26.746479 #1311354] INFO -- : making encs I, [2024-05-07T14:01:26.804520 #1311354] INFO -- : make[1]: Entering directory '/tmp/ruby/build/trunk' I, [2024-05-07T14:01:26.804589 #1311354] INFO -- : make[1]: Nothing to be done for 'encs'. I, [2024-05-07T14:01:26.804614 #1311354] INFO -- : make[1]: Leaving directory '/tmp/ruby/build/trunk' I, [2024-05-07T14:01:26.909464 #1311354] INFO -- : make[1]: Leaving directory '/tmp/ruby/build/trunk' I, [2024-05-07T14:01:26.910364 #1311354] INFO -- : generating makefile exts.mk I, [2024-05-07T14:01:26.947511 #1311354] INFO -- : exts.mk unchanged I, [2024-05-07T14:01:26.951925 #1311354] INFO -- : make[1]: Entering directory '/tmp/ruby/build/trunk' I, [2024-05-07T14:01:26.971624 #1311354] INFO -- : make[2]: Entering directory '/tmp/ruby/build/trunk/ext/digest' I, [2024-05-07T14:01:26.971914 #1311354] INFO -- : make[2]: Entering directory '/tmp/ruby/build/trunk/ext/json' I, [2024-05-07T14:01:26.971953 #1311354] INFO -- : make[2]: Entering directory '/tmp/ruby/build/trunk/ext/coverage' I, [2024-05-07T14:01:26.972939 #1311354] INFO -- : make[2]: Entering directory '/tmp/ruby/build/trunk/ext/date' I, [2024-05-07T14:01:26.974338 #1311354] INFO -- : make[2]: Entering directory '/tmp/ruby/build/trunk/ext/io/console' I, [2024-05-07T14:01:26.974432 #1311354] INFO -- : make[2]: Entering directory '/tmp/ruby/build/trunk/ext/monitor' I, [2024-05-07T14:01:26.975067 #1311354] INFO -- : make[2]: Leaving directory '/tmp/ruby/build/trunk/ext/coverage' I, [2024-05-07T14:01:26.975091 #1311354] INFO -- : make[2]: Leaving directory '/tmp/ruby/build/trunk/ext/digest' I, [2024-05-07T14:01:26.975917 #1311354] INFO -- : make[2]: Entering directory '/tmp/ruby/build/trunk/ext/fiddle' I, [2024-05-07T14:01:26.976043 #1311354] INFO -- : make[2]: Entering directory '/tmp/ruby/build/trunk/ext/pathname' I, [2024-05-07T14:01:26.976381 #1311354] INFO -- : make[2]: Leaving directory '/tmp/ruby/build/trunk/ext/monitor' I, [2024-05-07T14:01:26.976620 #1311354] INFO -- : make[2]: Entering directory '/tmp/ruby/build/trunk/ext/pty' I, [2024-05-07T14:01:26.976889 #1311354] INFO -- : make[2]: Leaving directory '/tmp/ruby/build/trunk/ext/io/console' I, [2024-05-07T14:01:26.977076 #1311354] INFO -- : make[2]: Entering directory '/tmp/ruby/build/trunk/ext/objspace' I, [2024-05-07T14:01:26.977112 #1311354] INFO -- : make[2]: Leaving directory '/tmp/ruby/build/trunk/ext/date' I, [2024-05-07T14:01:26.977475 #1311354] INFO -- : make[2]: Leaving directory '/tmp/ruby/build/trunk/ext/json' I, [2024-05-07T14:01:26.977735 #1311354] INFO -- : make[2]: Entering directory '/tmp/ruby/build/trunk/ext/psych' I, [2024-05-07T14:01:26.978137 #1311354] INFO -- : make[2]: Leaving directory '/tmp/ruby/build/trunk/ext/pathname' I, [2024-05-07T14:01:26.978514 #1311354] INFO -- : make[2]: Leaving directory '/tmp/ruby/build/trunk/ext/pty' I, [2024-05-07T14:01:26.981140 #1311354] INFO -- : make[2]: Leaving directory '/tmp/ruby/build/trunk/ext/objspace' I, [2024-05-07T14:01:26.981478 #1311354] INFO -- : make[2]: Entering directory '/tmp/ruby/build/trunk/ext/rubyvm' I, [2024-05-07T14:01:26.982374 #1311354] INFO -- : make[2]: Leaving directory '/tmp/ruby/build/trunk/ext/fiddle' I, [2024-05-07T14:01:26.982975 #1311354] INFO -- : make[2]: Entering directory '/tmp/ruby/build/trunk/ext/ripper' I, [2024-05-07T14:01:26.983384 #1311354] INFO -- : make[2]: Leaving directory '/tmp/ruby/build/trunk/ext/rubyvm' I, [2024-05-07T14:01:26.983490 #1311354] INFO -- : make[2]: Entering directory '/tmp/ruby/build/trunk/.bundle/gems/bigdecimal-3.1.7/ext/bigdecimal' I, [2024-05-07T14:01:26.983523 #1311354] INFO -- : make[2]: Entering directory '/tmp/ruby/build/trunk/.bundle/gems/bigdecimal-3.1.8/ext/bigdecimal' I, [2024-05-07T14:01:26.983584 #1311354] INFO -- : make[2]: Entering directory '/tmp/ruby/build/trunk/.bundle/gems/nkf-0.2.0/ext/nkf' I, [2024-05-07T14:01:26.983617 #1311354] INFO -- : make[2]: Entering directory '/tmp/ruby/build/trunk/.bundle/gems/debug-1.9.2/ext/debug' I, [2024-05-07T14:01:26.983662 #1311354] INFO -- : make[2]: Entering directory '/tmp/ruby/build/trunk/.bundle/gems/racc-1.7.3/ext/racc/cparse' I, [2024-05-07T14:01:26.983966 #1311354] INFO -- : make[2]: Entering directory '/tmp/ruby/build/trunk/.bundle/gems/rbs-3.4.4/ext/rbs_extension' I, [2024-05-07T14:01:26.983990 #1311354] INFO -- : make[2]: Entering directory '/tmp/ruby/build/trunk/.bundle/gems/syslog-0.1.2/ext/syslog' I, [2024-05-07T14:01:26.988249 #1311354] INFO -- : make[2]: Entering directory '/tmp/ruby/build/trunk/ext/openssl' I, [2024-05-07T14:01:26.989587 #1311354] INFO -- : make[2]: Leaving directory '/tmp/ruby/build/trunk/ext/psych' I, [2024-05-07T14:01:26.990321 #1311354] INFO -- : make[2]: Leaving directory '/tmp/ruby/build/trunk/ext/ripper' I, [2024-05-07T14:01:26.990763 #1311354] INFO -- : make[2]: Entering directory '/tmp/ruby/build/trunk/ext/socket' I, [2024-05-07T14:01:26.991378 #1311354] INFO -- : make[2]: Entering directory '/tmp/ruby/build/trunk/ext/digest/sha2' I, [2024-05-07T14:01:26.993640 #1311354] INFO -- : make[2]: Leaving directory '/tmp/ruby/build/trunk/ext/digest/sha2' I, [2024-05-07T14:01:26.996784 #1311354] INFO -- : make[2]: Leaving directory '/tmp/ruby/build/trunk/ext/socket' I, [2024-05-07T14:01:27.006255 #1311354] INFO -- : make[2]: Leaving directory '/tmp/ruby/build/trunk/ext/openssl' I, [2024-05-07T14:01:27.007325 #1311354] INFO -- : make[2]: Leaving directory '/tmp/ruby/build/trunk/.bundle/gems/nkf-0.2.0/ext/nkf' I, [2024-05-07T14:01:27.007516 #1311354] INFO -- : make[2]: Leaving directory '/tmp/ruby/build/trunk/.bundle/gems/racc-1.7.3/ext/racc/cparse' I, [2024-05-07T14:01:27.012638 #1311354] INFO -- : make[2]: Leaving directory '/tmp/ruby/build/trunk/.bundle/gems/rbs-3.4.4/ext/rbs_extension' I, [2024-05-07T14:01:27.015785 #1311354] INFO -- : make[2]: Leaving directory '/tmp/ruby/build/trunk/.bundle/gems/syslog-0.1.2/ext/syslog' I, [2024-05-07T14:01:27.018183 #1311354] INFO -- : make[2]: Leaving directory '/tmp/ruby/build/trunk/.bundle/gems/debug-1.9.2/ext/debug' I, [2024-05-07T14:01:27.018754 #1311354] INFO -- : make[2]: Leaving directory '/tmp/ruby/build/trunk/.bundle/gems/bigdecimal-3.1.7/ext/bigdecimal' I, [2024-05-07T14:01:27.021120 #1311354] INFO -- : make[2]: Leaving directory '/tmp/ruby/build/trunk/.bundle/gems/bigdecimal-3.1.8/ext/bigdecimal' I, [2024-05-07T14:01:27.045499 #1311354] INFO -- : make[2]: Entering directory '/tmp/ruby/build/trunk' I, [2024-05-07T14:01:27.112360 #1311354] INFO -- : linking ruby I, [2024-05-07T14:01:27.134959 #1311354] INFO -- : make[2]: Leaving directory '/tmp/ruby/build/trunk' I, [2024-05-07T14:01:27.135627 #1311354] INFO -- : make[1]: Leaving directory '/tmp/ruby/build/trunk' I, [2024-05-07T14:01:27.139866 #1311354] INFO -- : make[1]: Entering directory '/tmp/ruby/build/trunk' I, [2024-05-07T14:01:27.139901 #1311354] INFO -- : make[1]: Nothing to be done for 'note'. I, [2024-05-07T14:01:27.139907 #1311354] INFO -- : make[1]: Leaving directory '/tmp/ruby/build/trunk' I, [2024-05-07T14:01:27.140452 #1311354] INFO -- : $$$[end] "make all -j20" exit with 0. I, [2024-05-07T14:01:27.140675 #1311354] INFO -- : $$$[beg] make install -j20 I, [2024-05-07T14:01:27.205407 #1311354] INFO -- : Update minitest to ea9caafc0754b1d6236a490d59e624b53209734a I, [2024-05-07T14:01:27.205648 #1311354] INFO -- : Update power_assert to 84e85124c5014a139af39161d484156cfe87a9ed I, [2024-05-07T14:01:27.206381 #1311354] INFO -- : Update rbs to ba7872795d5de04adb8ff500c0e6afdc81a041dd I, [2024-05-07T14:01:27.206703 #1311354] INFO -- : Update typeprof to b19a6416da3a05d57fadd6ffdadb382b6d236ca5 I, [2024-05-07T14:01:27.207821 #1311354] INFO -- : echo ea9caafc0754b1d6236a490d59e624b53209734a | /bin/sh /tmp/ruby/src/trunk/tool/ifchange /tmp/ruby/src/trunk/.bundle/.timestamp/minitest.revision - I, [2024-05-07T14:01:27.207982 #1311354] INFO -- : echo 84e85124c5014a139af39161d484156cfe87a9ed | /bin/sh /tmp/ruby/src/trunk/tool/ifchange /tmp/ruby/src/trunk/.bundle/.timestamp/power_assert.revision - I, [2024-05-07T14:01:27.208949 #1311354] INFO -- : BASERUBY = /usr/bin/ruby --disable=gems I, [2024-05-07T14:01:27.208980 #1311354] INFO -- : CC = gcc I, [2024-05-07T14:01:27.208994 #1311354] INFO -- : LD = ld I, [2024-05-07T14:01:27.209005 #1311354] INFO -- : LDSHARED = gcc -shared I, [2024-05-07T14:01:27.209016 #1311354] INFO -- : CFLAGS = -O3 -fno-fast-math -ggdb3 -Wall -Wextra -Wdeprecated-declarations -Wdiv-by-zero -Wduplicated-cond -Wimplicit-function-declaration -Wimplicit-int -Wpointer-arith -Wwrite-strings -Wold-style-definition -Wimplicit-fallthrough=0 -Wmissing-noreturn -Wno-cast-function-type -Wno-constant-logical-operand -Wno-long-long -Wno-missing-field-initializers -Wno-overlength-strings -Wno-packed-bitfield-compat -Wno-parentheses-equality -Wno-self-assign -Wno-tautological-compare -Wno-unused-parameter -Wno-unused-value -Wsuggest-attribute=format -Wsuggest-attribute=noreturn -Wunused-variable -Wmisleading-indentation -Wundef -fPIC I, [2024-05-07T14:01:27.209028 #1311354] INFO -- : XCFLAGS = -U_FORTIFY_SOURCE -D_FORTIFY_SOURCE=2 -fstack-protector-strong -fno-strict-overflow -fvisibility=hidden -fexcess-precision=standard -DRUBY_EXPORT -I. -I.ext/include/x86_64-linux -I/tmp/ruby/src/trunk/include -I/tmp/ruby/src/trunk -I/tmp/ruby/src/trunk/prism -I/tmp/ruby/src/trunk/enc/unicode/15.0.0 I, [2024-05-07T14:01:27.209039 #1311354] INFO -- : CPPFLAGS = I, [2024-05-07T14:01:27.209050 #1311354] INFO -- : DLDFLAGS = -Wl,--compress-debug-sections=zlib -Wl,-soname,libruby.so.3.4 -fstack-protector-strong I, [2024-05-07T14:01:27.209060 #1311354] INFO -- : SOLIBS = -lz -lrt -lrt -lgmp -ldl -lcrypt -lm -lpthread I, [2024-05-07T14:01:27.209070 #1311354] INFO -- : LANG = en_US.UTF-8 I, [2024-05-07T14:01:27.209085 #1311354] INFO -- : LC_ALL = I, [2024-05-07T14:01:27.209096 #1311354] INFO -- : LC_CTYPE = I, [2024-05-07T14:01:27.209106 #1311354] INFO -- : MFLAGS = -j20 --jobserver-auth=4,5 I, [2024-05-07T14:01:27.209116 #1311354] INFO -- : RUSTC = no I, [2024-05-07T14:01:27.209127 #1311354] INFO -- : YJIT_RUSTC_ARGS = --crate-name=yjit --crate-type=staticlib --edition=2021 -g -C lto=thin -C opt-level=3 -C overflow-checks=on '--out-dir=/tmp/ruby/build/trunk/yjit/target/release/' /tmp/ruby/src/trunk/yjit/src/lib.rs I, [2024-05-07T14:01:27.209910 #1311354] INFO -- : /tmp/ruby/src/trunk/.bundle/.timestamp/minitest.revision unchanged I, [2024-05-07T14:01:27.210024 #1311354] INFO -- : /tmp/ruby/src/trunk/.bundle/.timestamp/power_assert.revision unchanged I, [2024-05-07T14:01:27.238566 #1311354] INFO -- : echo ba7872795d5de04adb8ff500c0e6afdc81a041dd | /bin/sh /tmp/ruby/src/trunk/tool/ifchange /tmp/ruby/src/trunk/.bundle/.timestamp/rbs.revision - I, [2024-05-07T14:01:27.238751 #1311354] INFO -- : echo b19a6416da3a05d57fadd6ffdadb382b6d236ca5 | /bin/sh /tmp/ruby/src/trunk/tool/ifchange /tmp/ruby/src/trunk/.bundle/.timestamp/typeprof.revision - I, [2024-05-07T14:01:27.239321 #1311354] INFO -- : generating enc.mk I, [2024-05-07T14:01:27.239444 #1311354] INFO -- : gcc (Ubuntu 11.4.0-1ubuntu1~22.04) 11.4.0 I, [2024-05-07T14:01:27.239468 #1311354] INFO -- : Copyright (C) 2021 Free Software Foundation, Inc. I, [2024-05-07T14:01:27.239481 #1311354] INFO -- : This is free software; see the source for copying conditions. There is NO I, [2024-05-07T14:01:27.239491 #1311354] INFO -- : warranty; not even for MERCHANTABILITY or FITNESS FOR A PARTICULAR PURPOSE. I, [2024-05-07T14:01:27.239501 #1311354] INFO -- : I, [2024-05-07T14:01:27.240357 #1311354] INFO -- : /tmp/ruby/src/trunk/.bundle/.timestamp/rbs.revision unchanged I, [2024-05-07T14:01:27.240469 #1311354] INFO -- : /tmp/ruby/src/trunk/.bundle/.timestamp/typeprof.revision unchanged I, [2024-05-07T14:01:27.364620 #1311354] INFO -- : Building power_assert@84e85124c5014a139af39161d484156cfe87a9ed to /tmp/ruby/src/trunk/gems/power_assert-2.0.3.gem I, [2024-05-07T14:01:27.364969 #1311354] INFO -- : making srcs under enc I, [2024-05-07T14:01:27.365619 #1311354] INFO -- : making enc I, [2024-05-07T14:01:27.382714 #1311354] INFO -- : make[1]: Entering directory '/tmp/ruby/build/trunk' I, [2024-05-07T14:01:27.382777 #1311354] INFO -- : make[1]: Nothing to be done for 'enc'. I, [2024-05-07T14:01:27.382789 #1311354] INFO -- : make[1]: Leaving directory '/tmp/ruby/build/trunk' I, [2024-05-07T14:01:27.394500 #1311354] INFO -- : make[1]: Entering directory '/tmp/ruby/build/trunk' I, [2024-05-07T14:01:27.394559 #1311354] INFO -- : make[1]: Nothing to be done for 'srcs'. I, [2024-05-07T14:01:27.394578 #1311354] INFO -- : make[1]: Leaving directory '/tmp/ruby/build/trunk' I, [2024-05-07T14:01:27.395358 #1311354] INFO -- : generating transdb.h I, [2024-05-07T14:01:27.433504 #1311354] INFO -- : Successfully built RubyGem I, [2024-05-07T14:01:27.433565 #1311354] INFO -- : Name: power_assert I, [2024-05-07T14:01:27.433579 #1311354] INFO -- : Version: 2.0.4dev I, [2024-05-07T14:01:27.433591 #1311354] INFO -- : File: power_assert-2.0.4dev.gem I, [2024-05-07T14:01:27.435796 #1311354] INFO -- : Extracting bundle gem power_assert-2.0.3... I, [2024-05-07T14:01:27.491020 #1311354] INFO -- : transdb.h unchanged I, [2024-05-07T14:01:27.492823 #1311354] INFO -- : generating makefiles ext/configure-ext.mk I, [2024-05-07T14:01:27.492885 #1311354] INFO -- : making trans I, [2024-05-07T14:01:27.497423 #1311354] INFO -- : Try with hash version of bundled gems instead of gems/power_assert-2.0.3.gem. We don't use this gem with release version of Ruby. I, [2024-05-07T14:01:27.502398 #1311354] INFO -- : Unpacked gems/power_assert-2.0.4dev.gem I, [2024-05-07T14:01:27.519870 #1311354] INFO -- : ext/configure-ext.mk unchanged I, [2024-05-07T14:01:27.522385 #1311354] INFO -- : make[1]: Entering directory '/tmp/ruby/build/trunk' I, [2024-05-07T14:01:27.526912 #1311354] INFO -- : make[1]: Entering directory '/tmp/ruby/build/trunk' I, [2024-05-07T14:01:27.527007 #1311354] INFO -- : make[1]: Nothing to be done for 'trans'. I, [2024-05-07T14:01:27.527017 #1311354] INFO -- : make[1]: Leaving directory '/tmp/ruby/build/trunk' I, [2024-05-07T14:01:27.527881 #1311354] INFO -- : making encs I, [2024-05-07T14:01:27.587036 #1311354] INFO -- : make[1]: Entering directory '/tmp/ruby/build/trunk' I, [2024-05-07T14:01:27.587110 #1311354] INFO -- : make[1]: Nothing to be done for 'encs'. I, [2024-05-07T14:01:27.587141 #1311354] INFO -- : make[1]: Leaving directory '/tmp/ruby/build/trunk' I, [2024-05-07T14:01:27.679712 #1311354] INFO -- : make[1]: Leaving directory '/tmp/ruby/build/trunk' I, [2024-05-07T14:01:27.680355 #1311354] INFO -- : generating makefile exts.mk I, [2024-05-07T14:01:27.718191 #1311354] INFO -- : exts.mk unchanged I, [2024-05-07T14:01:27.722801 #1311354] INFO -- : make[1]: Entering directory '/tmp/ruby/build/trunk' I, [2024-05-07T14:01:27.742455 #1311354] INFO -- : make[2]: Entering directory '/tmp/ruby/build/trunk/ext/digest' I, [2024-05-07T14:01:27.743464 #1311354] INFO -- : make[2]: Entering directory '/tmp/ruby/build/trunk/ext/coverage' I, [2024-05-07T14:01:27.743828 #1311354] INFO -- : make[2]: Entering directory '/tmp/ruby/build/trunk/ext/json' I, [2024-05-07T14:01:27.744635 #1311354] INFO -- : make[2]: Entering directory '/tmp/ruby/build/trunk/ext/date' I, [2024-05-07T14:01:27.744742 #1311354] INFO -- : make[2]: Entering directory '/tmp/ruby/build/trunk/ext/io/console' I, [2024-05-07T14:01:27.745493 #1311354] INFO -- : make[2]: Entering directory '/tmp/ruby/build/trunk/ext/monitor' I, [2024-05-07T14:01:27.746493 #1311354] INFO -- : make[2]: Leaving directory '/tmp/ruby/build/trunk/ext/coverage' I, [2024-05-07T14:01:27.746592 #1311354] INFO -- : make[2]: Entering directory '/tmp/ruby/build/trunk/ext/pathname' I, [2024-05-07T14:01:27.746629 #1311354] INFO -- : make[2]: Entering directory '/tmp/ruby/build/trunk/ext/fiddle' I, [2024-05-07T14:01:27.747030 #1311354] INFO -- : make[2]: Entering directory '/tmp/ruby/build/trunk/ext/pty' I, [2024-05-07T14:01:27.747244 #1311354] INFO -- : make[2]: Leaving directory '/tmp/ruby/build/trunk/ext/digest' I, [2024-05-07T14:01:27.747647 #1311354] INFO -- : make[2]: Leaving directory '/tmp/ruby/build/trunk/ext/io/console' I, [2024-05-07T14:01:27.748266 #1311354] INFO -- : make[2]: Entering directory '/tmp/ruby/build/trunk/ext/objspace' I, [2024-05-07T14:01:27.748300 #1311354] INFO -- : make[2]: Entering directory '/tmp/ruby/build/trunk/ext/rubyvm' I, [2024-05-07T14:01:27.748357 #1311354] INFO -- : make[2]: Leaving directory '/tmp/ruby/build/trunk/ext/date' I, [2024-05-07T14:01:27.748806 #1311354] INFO -- : make[2]: Entering directory '/tmp/ruby/build/trunk/ext/psych' I, [2024-05-07T14:01:27.748874 #1311354] INFO -- : make[2]: Leaving directory '/tmp/ruby/build/trunk/ext/monitor' I, [2024-05-07T14:01:27.749177 #1311354] INFO -- : make[2]: Leaving directory '/tmp/ruby/build/trunk/ext/pathname' I, [2024-05-07T14:01:27.749879 #1311354] INFO -- : make[2]: Entering directory '/tmp/ruby/build/trunk/.bundle/gems/bigdecimal-3.1.8/ext/bigdecimal' I, [2024-05-07T14:01:27.750131 #1311354] INFO -- : make[2]: Leaving directory '/tmp/ruby/build/trunk/ext/pty' I, [2024-05-07T14:01:27.750144 #1311354] INFO -- : make[2]: Leaving directory '/tmp/ruby/build/trunk/ext/json' I, [2024-05-07T14:01:27.750278 #1311354] INFO -- : make[2]: Entering directory '/tmp/ruby/build/trunk/.bundle/gems/bigdecimal-3.1.7/ext/bigdecimal' I, [2024-05-07T14:01:27.751885 #1311354] INFO -- : make[2]: Leaving directory '/tmp/ruby/build/trunk/ext/objspace' I, [2024-05-07T14:01:27.752325 #1311354] INFO -- : make[2]: Leaving directory '/tmp/ruby/build/trunk/ext/rubyvm' I, [2024-05-07T14:01:27.752494 #1311354] INFO -- : make[2]: Entering directory '/tmp/ruby/build/trunk/ext/ripper' I, [2024-05-07T14:01:27.752507 #1311354] INFO -- : make[2]: Entering directory '/tmp/ruby/build/trunk/.bundle/gems/debug-1.9.2/ext/debug' I, [2024-05-07T14:01:27.752842 #1311354] INFO -- : make[2]: Entering directory '/tmp/ruby/build/trunk/.bundle/gems/nkf-0.2.0/ext/nkf' I, [2024-05-07T14:01:27.752876 #1311354] INFO -- : make[2]: Entering directory '/tmp/ruby/build/trunk/.bundle/gems/racc-1.7.3/ext/racc/cparse' I, [2024-05-07T14:01:27.753372 #1311354] INFO -- : make[2]: Entering directory '/tmp/ruby/build/trunk/.bundle/gems/rbs-3.4.4/ext/rbs_extension' I, [2024-05-07T14:01:27.753593 #1311354] INFO -- : make[2]: Entering directory '/tmp/ruby/build/trunk/.bundle/gems/syslog-0.1.2/ext/syslog' I, [2024-05-07T14:01:27.754011 #1311354] INFO -- : make[2]: Leaving directory '/tmp/ruby/build/trunk/ext/fiddle' I, [2024-05-07T14:01:27.757307 #1311354] INFO -- : make[2]: Leaving directory '/tmp/ruby/build/trunk/ext/ripper' I, [2024-05-07T14:01:27.758510 #1311354] INFO -- : make[2]: Entering directory '/tmp/ruby/build/trunk/ext/openssl' I, [2024-05-07T14:01:27.758624 #1311354] INFO -- : make[2]: Entering directory '/tmp/ruby/build/trunk/ext/socket' I, [2024-05-07T14:01:27.761106 #1311354] INFO -- : make[2]: Entering directory '/tmp/ruby/build/trunk/ext/digest/sha2' I, [2024-05-07T14:01:27.761578 #1311354] INFO -- : make[2]: Leaving directory '/tmp/ruby/build/trunk/ext/psych' I, [2024-05-07T14:01:27.764346 #1311354] INFO -- : make[2]: Leaving directory '/tmp/ruby/build/trunk/ext/digest/sha2' I, [2024-05-07T14:01:27.764646 #1311354] INFO -- : make[2]: Leaving directory '/tmp/ruby/build/trunk/ext/socket' I, [2024-05-07T14:01:27.769822 #1311354] INFO -- : make[2]: Leaving directory '/tmp/ruby/build/trunk/ext/openssl' I, [2024-05-07T14:01:27.775344 #1311354] INFO -- : make[2]: Leaving directory '/tmp/ruby/build/trunk/.bundle/gems/debug-1.9.2/ext/debug' I, [2024-05-07T14:01:27.776644 #1311354] INFO -- : make[2]: Leaving directory '/tmp/ruby/build/trunk/.bundle/gems/racc-1.7.3/ext/racc/cparse' I, [2024-05-07T14:01:27.776874 #1311354] INFO -- : make[2]: Leaving directory '/tmp/ruby/build/trunk/.bundle/gems/rbs-3.4.4/ext/rbs_extension' I, [2024-05-07T14:01:27.779486 #1311354] INFO -- : make[2]: Leaving directory '/tmp/ruby/build/trunk/.bundle/gems/bigdecimal-3.1.8/ext/bigdecimal' I, [2024-05-07T14:01:27.783387 #1311354] INFO -- : make[2]: Leaving directory '/tmp/ruby/build/trunk/.bundle/gems/bigdecimal-3.1.7/ext/bigdecimal' I, [2024-05-07T14:01:27.784554 #1311354] INFO -- : make[2]: Leaving directory '/tmp/ruby/build/trunk/.bundle/gems/nkf-0.2.0/ext/nkf' I, [2024-05-07T14:01:27.784630 #1311354] INFO -- : make[2]: Leaving directory '/tmp/ruby/build/trunk/.bundle/gems/syslog-0.1.2/ext/syslog' I, [2024-05-07T14:01:27.809953 #1311354] INFO -- : make[2]: Entering directory '/tmp/ruby/build/trunk' I, [2024-05-07T14:01:27.876298 #1311354] INFO -- : make[2]: 'ruby' is up to date. I, [2024-05-07T14:01:27.876361 #1311354] INFO -- : make[2]: Leaving directory '/tmp/ruby/build/trunk' I, [2024-05-07T14:01:27.876568 #1311354] INFO -- : make[1]: Leaving directory '/tmp/ruby/build/trunk' I, [2024-05-07T14:01:27.880440 #1311354] INFO -- : make[1]: Entering directory '/tmp/ruby/build/trunk' I, [2024-05-07T14:01:27.880497 #1311354] INFO -- : make[1]: Nothing to be done for 'note'. I, [2024-05-07T14:01:27.880510 #1311354] INFO -- : make[1]: Leaving directory '/tmp/ruby/build/trunk' I, [2024-05-07T14:01:27.880713 #1311354] INFO -- : ./miniruby -I/tmp/ruby/src/trunk/lib -I. -I.ext/common /tmp/ruby/src/trunk/tool/runruby.rb --extout=.ext -- --disable-gems -r./x86_64-linux-fake /tmp/ruby/src/trunk/tool/rbinstall.rb --make="make" --dest-dir="" --extout=".ext" --ext-build-dir="./ext" --mflags="-j20 --jobserver-auth=4,5" --make-flags=" -j20 --jobserver-auth=4,5" --data-mode=0644 --prog-mode=0755 --installed-list .installed.list --mantype="doc" --gnumake --install=all --exclude=doc I, [2024-05-07T14:01:27.976500 #1311354] INFO -- : Installing to I, [2024-05-07T14:01:27.976581 #1311354] INFO -- : installing binary commands: /tmp/ruby/install/trunk/bin I, [2024-05-07T14:01:27.976603 #1311354] INFO -- : installing base libraries: /tmp/ruby/install/trunk/lib I, [2024-05-07T14:01:27.983954 #1311354] INFO -- : installing arch files: /tmp/ruby/install/trunk/lib/ruby/3.4.0+0/x86_64-linux I, [2024-05-07T14:01:27.984015 #1311354] INFO -- : installing pkgconfig data: /tmp/ruby/install/trunk/lib/pkgconfig I, [2024-05-07T14:01:27.984028 #1311354] INFO -- : installing extension objects: /tmp/ruby/install/trunk/lib/ruby/3.4.0+0/x86_64-linux I, [2024-05-07T14:01:27.993638 #1311354] INFO -- : installing extension objects: /tmp/ruby/install/trunk/lib/ruby/site_ruby/3.4.0+0/x86_64-linux I, [2024-05-07T14:01:27.993699 #1311354] INFO -- : installing extension objects: /tmp/ruby/install/trunk/lib/ruby/vendor_ruby/3.4.0+0/x86_64-linux I, [2024-05-07T14:01:27.993713 #1311354] INFO -- : installing extension headers: /tmp/ruby/install/trunk/include/ruby-3.4.0+0/x86_64-linux I, [2024-05-07T14:01:27.993733 #1311354] INFO -- : installing extension scripts: /tmp/ruby/install/trunk/lib/ruby/3.4.0+0 I, [2024-05-07T14:01:27.997565 #1311354] INFO -- : installing extension scripts: /tmp/ruby/install/trunk/lib/ruby/site_ruby/3.4.0+0 I, [2024-05-07T14:01:27.997637 #1311354] INFO -- : installing extension scripts: /tmp/ruby/install/trunk/lib/ruby/vendor_ruby/3.4.0+0 I, [2024-05-07T14:01:27.997651 #1311354] INFO -- : installing extension headers: /tmp/ruby/install/trunk/include/ruby-3.4.0+0/ruby I, [2024-05-07T14:01:27.997663 #1311354] INFO -- : installing command scripts: /tmp/ruby/install/trunk/bin I, [2024-05-07T14:01:27.997676 #1311354] INFO -- : installing library scripts: /tmp/ruby/install/trunk/lib/ruby/3.4.0+0 I, [2024-05-07T14:01:28.031954 #1311354] INFO -- : installing common headers: /tmp/ruby/install/trunk/include/ruby-3.4.0+0 I, [2024-05-07T14:01:28.037414 #1311354] INFO -- : installing manpages: /tmp/ruby/install/trunk/share/man/man1 I, [2024-05-07T14:01:28.037481 #1311354] INFO -- : installing default gems from lib: /tmp/ruby/install/trunk/lib/ruby/gems/3.4.0+0 I, [2024-05-07T14:01:28.060013 #1311354] INFO -- : benchmark 0.3.0 I, [2024-05-07T14:01:28.067162 #1311354] INFO -- : bundler 2.6.0.dev I, [2024-05-07T14:01:28.069305 #1311354] INFO -- : cgi 0.4.1 I, [2024-05-07T14:01:28.069855 #1311354] INFO -- : delegate 0.3.1 I, [2024-05-07T14:01:28.070299 #1311354] INFO -- : did_you_mean 1.6.3 I, [2024-05-07T14:01:28.070770 #1311354] INFO -- : english 0.8.0 I, [2024-05-07T14:01:28.071252 #1311354] INFO -- : erb 4.0.4 I, [2024-05-07T14:01:28.071990 #1311354] INFO -- : error_highlight 0.6.0 I, [2024-05-07T14:01:28.072454 #1311354] INFO -- : fileutils 1.7.2 I, [2024-05-07T14:01:28.072852 #1311354] INFO -- : find 0.2.0 I, [2024-05-07T14:01:28.073287 #1311354] INFO -- : forwardable 1.3.3 I, [2024-05-07T14:01:28.073744 #1311354] INFO -- : ipaddr 1.2.6 I, [2024-05-07T14:01:28.074249 #1311354] INFO -- : irb 1.13.1 I, [2024-05-07T14:01:28.075742 #1311354] INFO -- : logger 1.6.0 I, [2024-05-07T14:01:28.076189 #1311354] INFO -- : net-http 0.4.1 I, [2024-05-07T14:01:28.076734 #1311354] INFO -- : net-protocol 0.2.2 I, [2024-05-07T14:01:28.077219 #1311354] INFO -- : open-uri 0.4.1 I, [2024-05-07T14:01:28.077737 #1311354] INFO -- : open3 0.2.1 I, [2024-05-07T14:01:28.078214 #1311354] INFO -- : optparse 0.5.0 I, [2024-05-07T14:01:28.078668 #1311354] INFO -- : ostruct 0.6.0 I, [2024-05-07T14:01:28.079132 #1311354] INFO -- : pp 0.5.0 I, [2024-05-07T14:01:28.079688 #1311354] INFO -- : prettyprint 0.2.0 I, [2024-05-07T14:01:28.080081 #1311354] INFO -- : prism 0.27.0 I, [2024-05-07T14:01:28.080659 #1311354] INFO -- : pstore 0.1.3 I, [2024-05-07T14:01:28.081112 #1311354] INFO -- : rdoc 6.6.3.1 I, [2024-05-07T14:01:28.082727 #1311354] INFO -- : readline 0.0.4 I, [2024-05-07T14:01:28.083273 #1311354] INFO -- : reline 0.5.5 I, [2024-05-07T14:01:28.083757 #1311354] INFO -- : resolv 0.4.0 I, [2024-05-07T14:01:28.084269 #1311354] INFO -- : ruby2_keywords 0.0.5 I, [2024-05-07T14:01:28.084703 #1311354] INFO -- : securerandom 0.3.1 I, [2024-05-07T14:01:28.085264 #1311354] INFO -- : set 1.1.0 I, [2024-05-07T14:01:28.085826 #1311354] INFO -- : shellwords 0.2.0 I, [2024-05-07T14:01:28.086365 #1311354] INFO -- : singleton 0.2.0 I, [2024-05-07T14:01:28.086968 #1311354] INFO -- : syntax_suggest 2.0.0 I, [2024-05-07T14:01:28.087505 #1311354] INFO -- : tempfile 0.2.1 I, [2024-05-07T14:01:28.088000 #1311354] INFO -- : time 0.3.0 I, [2024-05-07T14:01:28.088795 #1311354] INFO -- : timeout 0.4.1 I, [2024-05-07T14:01:28.089547 #1311354] INFO -- : tmpdir 0.2.0 I, [2024-05-07T14:01:28.090075 #1311354] INFO -- : tsort 0.2.0 I, [2024-05-07T14:01:28.090514 #1311354] INFO -- : un 0.3.0 I, [2024-05-07T14:01:28.090987 #1311354] INFO -- : uri 0.13.0 I, [2024-05-07T14:01:28.091568 #1311354] INFO -- : weakref 0.1.3 I, [2024-05-07T14:01:28.092056 #1311354] INFO -- : yaml 0.3.0 I, [2024-05-07T14:01:28.092548 #1311354] INFO -- : installing default gems from ext: /tmp/ruby/install/trunk/lib/ruby/gems/3.4.0+0 I, [2024-05-07T14:01:28.099351 #1311354] INFO -- : date 3.3.4 I, [2024-05-07T14:01:28.099891 #1311354] INFO -- : digest 3.1.1 I, [2024-05-07T14:01:28.100476 #1311354] INFO -- : etc 1.4.3 I, [2024-05-07T14:01:28.100945 #1311354] INFO -- : fcntl 1.1.0 I, [2024-05-07T14:01:28.101557 #1311354] INFO -- : fiddle 1.1.3 I, [2024-05-07T14:01:28.102042 #1311354] INFO -- : io-console 0.7.2 I, [2024-05-07T14:01:28.102463 #1311354] INFO -- : io-nonblock 0.3.0 I, [2024-05-07T14:01:28.102922 #1311354] INFO -- : io-wait 0.3.1 I, [2024-05-07T14:01:28.103428 #1311354] INFO -- : json 2.7.2 I, [2024-05-07T14:01:28.104441 #1311354] INFO -- : openssl 3.2.0 I, [2024-05-07T14:01:28.105035 #1311354] INFO -- : pathname 0.3.0 I, [2024-05-07T14:01:28.105549 #1311354] INFO -- : psych 5.1.2 I, [2024-05-07T14:01:28.106117 #1311354] INFO -- : stringio 3.1.1 I, [2024-05-07T14:01:28.106629 #1311354] INFO -- : strscan 3.1.1 I, [2024-05-07T14:01:28.107102 #1311354] INFO -- : zlib 3.1.0 I, [2024-05-07T14:01:28.107513 #1311354] INFO -- : installing bundled gems: /tmp/ruby/install/trunk/lib/ruby/gems/3.4.0+0 I, [2024-05-07T14:01:28.107781 #1311354] INFO -- : minitest 5.22.3 I, [2024-05-07T14:01:28.115392 #1311354] INFO -- : rake 13.2.1 I, [2024-05-07T14:01:28.118848 #1311354] INFO -- : test-unit 3.6.2 I, [2024-05-07T14:01:28.123191 #1311354] INFO -- : rexml 3.2.6 I, [2024-05-07T14:01:28.126664 #1311354] INFO -- : rss 0.3.0 I, [2024-05-07T14:01:28.129641 #1311354] INFO -- : net-ftp 0.3.4 I, [2024-05-07T14:01:28.131115 #1311354] INFO -- : net-imap 0.4.10 I, [2024-05-07T14:01:28.134071 #1311354] INFO -- : net-pop 0.1.2 I, [2024-05-07T14:01:28.134958 #1311354] INFO -- : net-smtp 0.5.0 I, [2024-05-07T14:01:28.136022 #1311354] INFO -- : matrix 0.4.2 I, [2024-05-07T14:01:28.139570 #1311354] INFO -- : prime 0.1.2 I, [2024-05-07T14:01:28.145275 #1311354] INFO -- : rbs 3.4.4 I, [2024-05-07T14:01:28.167738 #1311354] INFO -- : typeprof 0.21.11 I, [2024-05-07T14:01:28.170354 #1311354] INFO -- : debug 1.9.2 I, [2024-05-07T14:01:28.173531 #1311354] INFO -- : racc 1.7.3 I, [2024-05-07T14:01:28.176026 #1311354] INFO -- : mutex_m 0.2.0 I, [2024-05-07T14:01:28.177170 #1311354] INFO -- : getoptlong 0.2.1 I, [2024-05-07T14:01:28.178441 #1311354] INFO -- : base64 0.2.0 I, [2024-05-07T14:01:28.179429 #1311354] INFO -- : bigdecimal 3.1.8 I, [2024-05-07T14:01:28.181706 #1311354] INFO -- : observer 0.1.2 I, [2024-05-07T14:01:28.183224 #1311354] INFO -- : abbrev 0.1.2 I, [2024-05-07T14:01:28.184271 #1311354] INFO -- : resolv-replace 0.1.1 I, [2024-05-07T14:01:28.185522 #1311354] INFO -- : rinda 0.2.0 I, [2024-05-07T14:01:28.186695 #1311354] INFO -- : drb 2.2.1 I, [2024-05-07T14:01:28.188431 #1311354] INFO -- : nkf 0.2.0 I, [2024-05-07T14:01:28.190892 #1311354] INFO -- : syslog 0.1.2 I, [2024-05-07T14:01:28.192393 #1311354] INFO -- : csv 3.3.0 I, [2024-05-07T14:01:28.194509 #1311354] INFO -- : installing bundled gem cache: /tmp/ruby/install/trunk/lib/ruby/gems/3.4.0+0/cache I, [2024-05-07T14:01:28.195957 #1311354] INFO -- : skipped bundled gems: I, [2024-05-07T14:01:28.195978 #1311354] INFO -- : power_assert-2.0.4dev.gem not found in bundled_gems I, [2024-05-07T14:01:28.199271 #1311354] INFO -- : $$$[end] "make install -j20" exit with 0. I, [2024-05-07T14:01:28.199435 #1311354] INFO -- : $$$[beg] make yes-btest TESTOPTS='-q -j20' I, [2024-05-07T14:01:34.147968 #1311354] INFO -- : PASS all 1936 tests E, [2024-05-07T14:01:34.155702 #1311354] ERROR -- : I, [2024-05-07T14:01:34.155803 #1311354] INFO -- : $$$[end] "make yes-btest TESTOPTS='-q -j20'" exit with 0. I, [2024-05-07T14:01:34.155938 #1311354] INFO -- : $$$[beg] make yes-test-basic TESTS='-j20' I, [2024-05-07T14:01:34.216503 #1311354] INFO -- : BASERUBY = /usr/bin/ruby --disable=gems I, [2024-05-07T14:01:34.216529 #1311354] INFO -- : CC = gcc I, [2024-05-07T14:01:34.216534 #1311354] INFO -- : LD = ld I, [2024-05-07T14:01:34.216538 #1311354] INFO -- : LDSHARED = gcc -shared I, [2024-05-07T14:01:34.216543 #1311354] INFO -- : CFLAGS = -O3 -fno-fast-math -ggdb3 -Wall -Wextra -Wdeprecated-declarations -Wdiv-by-zero -Wduplicated-cond -Wimplicit-function-declaration -Wimplicit-int -Wpointer-arith -Wwrite-strings -Wold-style-definition -Wimplicit-fallthrough=0 -Wmissing-noreturn -Wno-cast-function-type -Wno-constant-logical-operand -Wno-long-long -Wno-missing-field-initializers -Wno-overlength-strings -Wno-packed-bitfield-compat -Wno-parentheses-equality -Wno-self-assign -Wno-tautological-compare -Wno-unused-parameter -Wno-unused-value -Wsuggest-attribute=format -Wsuggest-attribute=noreturn -Wunused-variable -Wmisleading-indentation -Wundef -fPIC I, [2024-05-07T14:01:34.216549 #1311354] INFO -- : XCFLAGS = -U_FORTIFY_SOURCE -D_FORTIFY_SOURCE=2 -fstack-protector-strong -fno-strict-overflow -fvisibility=hidden -fexcess-precision=standard -DRUBY_EXPORT -I. -I.ext/include/x86_64-linux -I/tmp/ruby/src/trunk/include -I/tmp/ruby/src/trunk -I/tmp/ruby/src/trunk/prism -I/tmp/ruby/src/trunk/enc/unicode/15.0.0 I, [2024-05-07T14:01:34.216552 #1311354] INFO -- : CPPFLAGS = I, [2024-05-07T14:01:34.216556 #1311354] INFO -- : DLDFLAGS = -Wl,--compress-debug-sections=zlib -Wl,-soname,libruby.so.3.4 -fstack-protector-strong I, [2024-05-07T14:01:34.216570 #1311354] INFO -- : SOLIBS = -lz -lrt -lrt -lgmp -ldl -lcrypt -lm -lpthread I, [2024-05-07T14:01:34.216574 #1311354] INFO -- : LANG = en_US.UTF-8 I, [2024-05-07T14:01:34.216578 #1311354] INFO -- : LC_ALL = I, [2024-05-07T14:01:34.216581 #1311354] INFO -- : LC_CTYPE = I, [2024-05-07T14:01:34.216585 #1311354] INFO -- : MFLAGS = I, [2024-05-07T14:01:34.216588 #1311354] INFO -- : RUSTC = no I, [2024-05-07T14:01:34.216591 #1311354] INFO -- : YJIT_RUSTC_ARGS = --crate-name=yjit --crate-type=staticlib --edition=2021 -g -C lto=thin -C opt-level=3 -C overflow-checks=on '--out-dir=/tmp/ruby/build/trunk/yjit/target/release/' /tmp/ruby/src/trunk/yjit/src/lib.rs I, [2024-05-07T14:01:34.217271 #1311354] INFO -- : gcc (Ubuntu 11.4.0-1ubuntu1~22.04) 11.4.0 I, [2024-05-07T14:01:34.217298 #1311354] INFO -- : Copyright (C) 2021 Free Software Foundation, Inc. I, [2024-05-07T14:01:34.217304 #1311354] INFO -- : This is free software; see the source for copying conditions. There is NO I, [2024-05-07T14:01:34.217308 #1311354] INFO -- : warranty; not even for MERCHANTABILITY or FITNESS FOR A PARTICULAR PURPOSE. I, [2024-05-07T14:01:34.217312 #1311354] INFO -- : I, [2024-05-07T14:01:34.323328 #1311354] INFO -- : Checking leaked global symbols...none I, [2024-05-07T14:01:34.365150 #1311354] INFO -- : /tmp/ruby/src/trunk/basictest/test.rb:assignment ....................................................................................................................................................................................................................................................................................................................................................................................OK 372 I, [2024-05-07T14:01:34.365212 #1311354] INFO -- : /tmp/ruby/src/trunk/basictest/test.rb:condition ..OK 2 I, [2024-05-07T14:01:34.365218 #1311354] INFO -- : /tmp/ruby/src/trunk/basictest/test.rb:if/unless ...OK 3 I, [2024-05-07T14:01:34.365222 #1311354] INFO -- : /tmp/ruby/src/trunk/basictest/test.rb:case .....OK 5 I, [2024-05-07T14:01:34.365481 #1311354] INFO -- : /tmp/ruby/src/trunk/basictest/test.rb:while/until ........OK 8 I, [2024-05-07T14:01:34.365548 #1311354] INFO -- : /tmp/ruby/src/trunk/basictest/test.rb:exception ..........OK 10 I, [2024-05-07T14:01:34.365870 #1311354] INFO -- : /tmp/ruby/src/trunk/basictest/test.rb:array .......................................OK 39 I, [2024-05-07T14:01:34.365990 #1311354] INFO -- : /tmp/ruby/src/trunk/basictest/test.rb:hash ...........................OK 27 I, [2024-05-07T14:01:34.366840 #1311354] INFO -- : /tmp/ruby/src/trunk/basictest/test.rb:iterator ...........................................................................................................OK 107 I, [2024-05-07T14:01:34.367169 #1311354] INFO -- : /tmp/ruby/src/trunk/basictest/test.rb:float ................................................................................OK 80 I, [2024-05-07T14:01:34.368328 #1311354] INFO -- : /tmp/ruby/src/trunk/basictest/test.rb:bignum ...............................OK 31 I, [2024-05-07T14:01:34.369214 #1311354] INFO -- : /tmp/ruby/src/trunk/basictest/test.rb:string & char ..............................................................OK 62 I, [2024-05-07T14:01:34.369254 #1311354] INFO -- : /tmp/ruby/src/trunk/basictest/test.rb:assignment ..........OK 10 I, [2024-05-07T14:01:34.369285 #1311354] INFO -- : /tmp/ruby/src/trunk/basictest/test.rb:call ......OK 6 I, [2024-05-07T14:01:34.369347 #1311354] INFO -- : /tmp/ruby/src/trunk/basictest/test.rb:proc .........OK 9 I, [2024-05-07T14:01:34.469639 #1311354] INFO -- : /tmp/ruby/src/trunk/basictest/test.rb:signal ..OK 2 I, [2024-05-07T14:01:34.470105 #1311354] INFO -- : /tmp/ruby/src/trunk/basictest/test.rb:eval ...........................OK 27 I, [2024-05-07T14:01:34.570860 #1311354] INFO -- : /tmp/ruby/src/trunk/basictest/test.rb:system ........OK 8 I, [2024-05-07T14:01:34.570919 #1311354] INFO -- : /tmp/ruby/src/trunk/basictest/test.rb:const .....OK 5 I, [2024-05-07T14:01:34.570925 #1311354] INFO -- : /tmp/ruby/src/trunk/basictest/test.rb:clone .....OK 5 I, [2024-05-07T14:01:34.571033 #1311354] INFO -- : /tmp/ruby/src/trunk/basictest/test.rb:marshal ....OK 4 I, [2024-05-07T14:01:34.571054 #1311354] INFO -- : /tmp/ruby/src/trunk/basictest/test.rb:pack ....OK 4 I, [2024-05-07T14:01:34.571060 #1311354] INFO -- : /tmp/ruby/src/trunk/basictest/test.rb:math ..OK 2 I, [2024-05-07T14:01:34.571080 #1311354] INFO -- : /tmp/ruby/src/trunk/basictest/test.rb:struct ......OK 6 I, [2024-05-07T14:01:34.571177 #1311354] INFO -- : /tmp/ruby/src/trunk/basictest/test.rb:variable ............OK 12 I, [2024-05-07T14:01:34.571200 #1311354] INFO -- : /tmp/ruby/src/trunk/basictest/test.rb:trace ...OK 3 I, [2024-05-07T14:01:34.571226 #1311354] INFO -- : /tmp/ruby/src/trunk/basictest/test.rb:defined? ............OK 12 I, [2024-05-07T14:01:34.571310 #1311354] INFO -- : /tmp/ruby/src/trunk/basictest/test.rb:alias ......OK 6 I, [2024-05-07T14:01:34.571582 #1311354] INFO -- : /tmp/ruby/src/trunk/basictest/test.rb:path .......................OK 23 I, [2024-05-07T14:01:34.606231 #1311354] INFO -- : /tmp/ruby/src/trunk/basictest/test.rb:gc ....OK 4 I, [2024-05-07T14:01:34.608643 #1311354] INFO -- : I, [2024-05-07T14:01:34.608668 #1311354] INFO -- : test succeeded I, [2024-05-07T14:01:34.610084 #1311354] INFO -- : $$$[end] "make yes-test-basic TESTS='-j20'" exit with 0. I, [2024-05-07T14:01:34.610214 #1311354] INFO -- : $$$[beg] make yes-test-all TESTOPTS='--stderr-on-failure' TESTS='-j20' I, [2024-05-07T14:01:34.696730 #1311354] INFO -- : BASERUBY = /usr/bin/ruby --disable=gems I, [2024-05-07T14:01:34.696767 #1311354] INFO -- : CC = gcc I, [2024-05-07T14:01:34.696774 #1311354] INFO -- : LD = ld I, [2024-05-07T14:01:34.696781 #1311354] INFO -- : LDSHARED = gcc -shared I, [2024-05-07T14:01:34.696788 #1311354] INFO -- : CFLAGS = -O3 -fno-fast-math -ggdb3 -Wall -Wextra -Wdeprecated-declarations -Wdiv-by-zero -Wduplicated-cond -Wimplicit-function-declaration -Wimplicit-int -Wpointer-arith -Wwrite-strings -Wold-style-definition -Wimplicit-fallthrough=0 -Wmissing-noreturn -Wno-cast-function-type -Wno-constant-logical-operand -Wno-long-long -Wno-missing-field-initializers -Wno-overlength-strings -Wno-packed-bitfield-compat -Wno-parentheses-equality -Wno-self-assign -Wno-tautological-compare -Wno-unused-parameter -Wno-unused-value -Wsuggest-attribute=format -Wsuggest-attribute=noreturn -Wunused-variable -Wmisleading-indentation -Wundef -fPIC I, [2024-05-07T14:01:34.696794 #1311354] INFO -- : XCFLAGS = -U_FORTIFY_SOURCE -D_FORTIFY_SOURCE=2 -fstack-protector-strong -fno-strict-overflow -fvisibility=hidden -fexcess-precision=standard -DRUBY_EXPORT -I. -I.ext/include/x86_64-linux -I/tmp/ruby/src/trunk/include -I/tmp/ruby/src/trunk -I/tmp/ruby/src/trunk/prism -I/tmp/ruby/src/trunk/enc/unicode/15.0.0 I, [2024-05-07T14:01:34.696800 #1311354] INFO -- : CPPFLAGS = I, [2024-05-07T14:01:34.696806 #1311354] INFO -- : DLDFLAGS = -Wl,--compress-debug-sections=zlib -Wl,-soname,libruby.so.3.4 -fstack-protector-strong I, [2024-05-07T14:01:34.696812 #1311354] INFO -- : SOLIBS = -lz -lrt -lrt -lgmp -ldl -lcrypt -lm -lpthread I, [2024-05-07T14:01:34.696817 #1311354] INFO -- : LANG = en_US.UTF-8 I, [2024-05-07T14:01:34.696823 #1311354] INFO -- : LC_ALL = I, [2024-05-07T14:01:34.696828 #1311354] INFO -- : LC_CTYPE = I, [2024-05-07T14:01:34.696834 #1311354] INFO -- : MFLAGS = I, [2024-05-07T14:01:34.696840 #1311354] INFO -- : RUSTC = no I, [2024-05-07T14:01:34.696845 #1311354] INFO -- : YJIT_RUSTC_ARGS = --crate-name=yjit --crate-type=staticlib --edition=2021 -g -C lto=thin -C opt-level=3 -C overflow-checks=on '--out-dir=/tmp/ruby/build/trunk/yjit/target/release/' /tmp/ruby/src/trunk/yjit/src/lib.rs I, [2024-05-07T14:01:34.697464 #1311354] INFO -- : gcc (Ubuntu 11.4.0-1ubuntu1~22.04) 11.4.0 I, [2024-05-07T14:01:34.697470 #1311354] INFO -- : Copyright (C) 2021 Free Software Foundation, Inc. I, [2024-05-07T14:01:34.697476 #1311354] INFO -- : This is free software; see the source for copying conditions. There is NO I, [2024-05-07T14:01:34.697494 #1311354] INFO -- : warranty; not even for MERCHANTABILITY or FITNESS FOR A PARTICULAR PURPOSE. I, [2024-05-07T14:01:34.697500 #1311354] INFO -- : I, [2024-05-07T14:01:34.699209 #1311354] INFO -- : generating enc.mk I, [2024-05-07T14:01:34.817687 #1311354] INFO -- : making enc I, [2024-05-07T14:01:34.834778 #1311354] INFO -- : make[1]: Entering directory '/tmp/ruby/build/trunk' I, [2024-05-07T14:01:34.834790 #1311354] INFO -- : make[1]: Nothing to be done for 'enc'. I, [2024-05-07T14:01:34.834796 #1311354] INFO -- : make[1]: Leaving directory '/tmp/ruby/build/trunk' I, [2024-05-07T14:01:34.835418 #1311354] INFO -- : making srcs under enc I, [2024-05-07T14:01:34.865440 #1311354] INFO -- : make[1]: Entering directory '/tmp/ruby/build/trunk' I, [2024-05-07T14:01:34.865453 #1311354] INFO -- : make[1]: Nothing to be done for 'srcs'. I, [2024-05-07T14:01:34.865462 #1311354] INFO -- : make[1]: Leaving directory '/tmp/ruby/build/trunk' I, [2024-05-07T14:01:34.866314 #1311354] INFO -- : generating transdb.h I, [2024-05-07T14:01:34.960610 #1311354] INFO -- : transdb.h unchanged I, [2024-05-07T14:01:34.961882 #1311354] INFO -- : making trans I, [2024-05-07T14:01:34.995146 #1311354] INFO -- : make[1]: Entering directory '/tmp/ruby/build/trunk' I, [2024-05-07T14:01:34.995157 #1311354] INFO -- : make[1]: Nothing to be done for 'trans'. I, [2024-05-07T14:01:34.995163 #1311354] INFO -- : make[1]: Leaving directory '/tmp/ruby/build/trunk' I, [2024-05-07T14:01:34.995915 #1311354] INFO -- : making encs I, [2024-05-07T14:01:35.034017 #1311354] INFO -- : make[1]: Entering directory '/tmp/ruby/build/trunk' I, [2024-05-07T14:01:35.034028 #1311354] INFO -- : make[1]: Nothing to be done for 'encs'. I, [2024-05-07T14:01:35.034040 #1311354] INFO -- : make[1]: Leaving directory '/tmp/ruby/build/trunk' I, [2024-05-07T14:01:35.035787 #1311354] INFO -- : generating makefiles ext/configure-ext.mk I, [2024-05-07T14:01:35.063003 #1311354] INFO -- : ext/configure-ext.mk updated I, [2024-05-07T14:01:35.065413 #1311354] INFO -- : make[1]: Entering directory '/tmp/ruby/build/trunk' I, [2024-05-07T14:01:36.470929 #1311354] INFO -- : make[1]: Leaving directory '/tmp/ruby/build/trunk' I, [2024-05-07T14:01:36.471589 #1311354] INFO -- : generating makefile exts.mk I, [2024-05-07T14:01:36.507820 #1311354] INFO -- : exts.mk unchanged I, [2024-05-07T14:01:36.512199 #1311354] INFO -- : make[1]: Entering directory '/tmp/ruby/build/trunk' I, [2024-05-07T14:01:36.721467 #1311354] INFO -- : make[2]: Entering directory '/tmp/ruby/build/trunk/ext/coverage' I, [2024-05-07T14:01:36.724334 #1311354] INFO -- : make[2]: Leaving directory '/tmp/ruby/build/trunk/ext/coverage' I, [2024-05-07T14:01:36.728115 #1311354] INFO -- : make[2]: Entering directory '/tmp/ruby/build/trunk/ext/date' I, [2024-05-07T14:01:36.731174 #1311354] INFO -- : make[2]: Leaving directory '/tmp/ruby/build/trunk/ext/date' I, [2024-05-07T14:01:36.733513 #1311354] INFO -- : make[2]: Entering directory '/tmp/ruby/build/trunk/ext/digest' I, [2024-05-07T14:01:36.738855 #1311354] INFO -- : make[2]: Leaving directory '/tmp/ruby/build/trunk/ext/digest' I, [2024-05-07T14:01:36.754245 #1311354] INFO -- : make[2]: Entering directory '/tmp/ruby/build/trunk/ext/digest/sha2' I, [2024-05-07T14:01:36.757333 #1311354] INFO -- : make[2]: Leaving directory '/tmp/ruby/build/trunk/ext/digest/sha2' I, [2024-05-07T14:01:36.769980 #1311354] INFO -- : make[2]: Entering directory '/tmp/ruby/build/trunk/ext/fiddle' I, [2024-05-07T14:01:36.776337 #1311354] INFO -- : make[2]: Leaving directory '/tmp/ruby/build/trunk/ext/fiddle' I, [2024-05-07T14:01:36.779247 #1311354] INFO -- : make[2]: Entering directory '/tmp/ruby/build/trunk/ext/io/console' I, [2024-05-07T14:01:36.781827 #1311354] INFO -- : make[2]: Leaving directory '/tmp/ruby/build/trunk/ext/io/console' I, [2024-05-07T14:01:36.789443 #1311354] INFO -- : make[2]: Entering directory '/tmp/ruby/build/trunk/ext/json' I, [2024-05-07T14:01:36.795771 #1311354] INFO -- : make[2]: Leaving directory '/tmp/ruby/build/trunk/ext/json' I, [2024-05-07T14:01:36.804909 #1311354] INFO -- : make[2]: Entering directory '/tmp/ruby/build/trunk/ext/monitor' I, [2024-05-07T14:01:36.807365 #1311354] INFO -- : make[2]: Leaving directory '/tmp/ruby/build/trunk/ext/monitor' I, [2024-05-07T14:01:36.811583 #1311354] INFO -- : make[2]: Entering directory '/tmp/ruby/build/trunk/ext/objspace' I, [2024-05-07T14:01:36.815281 #1311354] INFO -- : make[2]: Leaving directory '/tmp/ruby/build/trunk/ext/objspace' I, [2024-05-07T14:01:36.827281 #1311354] INFO -- : make[2]: Entering directory '/tmp/ruby/build/trunk/ext/openssl' I, [2024-05-07T14:01:36.840406 #1311354] INFO -- : make[2]: Leaving directory '/tmp/ruby/build/trunk/ext/openssl' I, [2024-05-07T14:01:36.843237 #1311354] INFO -- : make[2]: Entering directory '/tmp/ruby/build/trunk/ext/pathname' I, [2024-05-07T14:01:36.845741 #1311354] INFO -- : make[2]: Leaving directory '/tmp/ruby/build/trunk/ext/pathname' I, [2024-05-07T14:01:36.849953 #1311354] INFO -- : make[2]: Entering directory '/tmp/ruby/build/trunk/ext/psych' I, [2024-05-07T14:01:36.864659 #1311354] INFO -- : make[2]: Leaving directory '/tmp/ruby/build/trunk/ext/psych' I, [2024-05-07T14:01:36.867696 #1311354] INFO -- : make[2]: Entering directory '/tmp/ruby/build/trunk/ext/pty' I, [2024-05-07T14:01:36.870249 #1311354] INFO -- : make[2]: Leaving directory '/tmp/ruby/build/trunk/ext/pty' I, [2024-05-07T14:01:36.879721 #1311354] INFO -- : make[2]: Entering directory '/tmp/ruby/build/trunk/ext/ripper' I, [2024-05-07T14:01:36.884673 #1311354] INFO -- : make[2]: Leaving directory '/tmp/ruby/build/trunk/ext/ripper' I, [2024-05-07T14:01:36.886146 #1311354] INFO -- : make[2]: Entering directory '/tmp/ruby/build/trunk/ext/rubyvm' I, [2024-05-07T14:01:36.888188 #1311354] INFO -- : make[2]: Leaving directory '/tmp/ruby/build/trunk/ext/rubyvm' I, [2024-05-07T14:01:36.895905 #1311354] INFO -- : make[2]: Entering directory '/tmp/ruby/build/trunk/ext/socket' I, [2024-05-07T14:01:36.902259 #1311354] INFO -- : make[2]: Leaving directory '/tmp/ruby/build/trunk/ext/socket' I, [2024-05-07T14:01:36.913150 #1311354] INFO -- : make[2]: Entering directory '/tmp/ruby/build/trunk/.bundle/gems/bigdecimal-3.1.7/ext/bigdecimal' I, [2024-05-07T14:01:36.935918 #1311354] INFO -- : make[2]: Leaving directory '/tmp/ruby/build/trunk/.bundle/gems/bigdecimal-3.1.7/ext/bigdecimal' I, [2024-05-07T14:01:36.937881 #1311354] INFO -- : make[2]: Entering directory '/tmp/ruby/build/trunk/.bundle/gems/bigdecimal-3.1.8/ext/bigdecimal' I, [2024-05-07T14:01:36.960112 #1311354] INFO -- : make[2]: Leaving directory '/tmp/ruby/build/trunk/.bundle/gems/bigdecimal-3.1.8/ext/bigdecimal' I, [2024-05-07T14:01:36.962199 #1311354] INFO -- : make[2]: Entering directory '/tmp/ruby/build/trunk/.bundle/gems/debug-1.9.2/ext/debug' I, [2024-05-07T14:01:36.984168 #1311354] INFO -- : make[2]: Leaving directory '/tmp/ruby/build/trunk/.bundle/gems/debug-1.9.2/ext/debug' I, [2024-05-07T14:01:36.985966 #1311354] INFO -- : make[2]: Entering directory '/tmp/ruby/build/trunk/.bundle/gems/nkf-0.2.0/ext/nkf' I, [2024-05-07T14:01:37.007472 #1311354] INFO -- : make[2]: Leaving directory '/tmp/ruby/build/trunk/.bundle/gems/nkf-0.2.0/ext/nkf' I, [2024-05-07T14:01:37.009537 #1311354] INFO -- : make[2]: Entering directory '/tmp/ruby/build/trunk/.bundle/gems/racc-1.7.3/ext/racc/cparse' I, [2024-05-07T14:01:37.031444 #1311354] INFO -- : make[2]: Leaving directory '/tmp/ruby/build/trunk/.bundle/gems/racc-1.7.3/ext/racc/cparse' I, [2024-05-07T14:01:37.033748 #1311354] INFO -- : make[2]: Entering directory '/tmp/ruby/build/trunk/.bundle/gems/rbs-3.4.4/ext/rbs_extension' I, [2024-05-07T14:01:37.055585 #1311354] INFO -- : make[2]: Leaving directory '/tmp/ruby/build/trunk/.bundle/gems/rbs-3.4.4/ext/rbs_extension' I, [2024-05-07T14:01:37.057743 #1311354] INFO -- : make[2]: Entering directory '/tmp/ruby/build/trunk/.bundle/gems/syslog-0.1.2/ext/syslog' I, [2024-05-07T14:01:37.079808 #1311354] INFO -- : make[2]: Leaving directory '/tmp/ruby/build/trunk/.bundle/gems/syslog-0.1.2/ext/syslog' I, [2024-05-07T14:01:37.103128 #1311354] INFO -- : make[2]: Entering directory '/tmp/ruby/build/trunk' I, [2024-05-07T14:01:37.166224 #1311354] INFO -- : make[2]: 'ruby' is up to date. I, [2024-05-07T14:01:37.166237 #1311354] INFO -- : make[2]: Leaving directory '/tmp/ruby/build/trunk' I, [2024-05-07T14:01:37.166630 #1311354] INFO -- : make[1]: Leaving directory '/tmp/ruby/build/trunk' I, [2024-05-07T14:01:37.170345 #1311354] INFO -- : make[1]: Entering directory '/tmp/ruby/build/trunk' I, [2024-05-07T14:01:37.170354 #1311354] INFO -- : make[1]: Nothing to be done for 'note'. I, [2024-05-07T14:01:37.170360 #1311354] INFO -- : make[1]: Leaving directory '/tmp/ruby/build/trunk' I, [2024-05-07T14:01:37.247266 #1311354] INFO -- : Run options: I, [2024-05-07T14:01:37.247284 #1311354] INFO -- : --seed=64819 I, [2024-05-07T14:01:37.247290 #1311354] INFO -- : "--ruby=./miniruby -I/tmp/ruby/src/trunk/lib -I. -I.ext/common /tmp/ruby/src/trunk/tool/runruby.rb --extout=.ext -- --disable-gems" I, [2024-05-07T14:01:37.247297 #1311354] INFO -- : --excludes-dir=/tmp/ruby/src/trunk/test/.excludes I, [2024-05-07T14:01:37.247303 #1311354] INFO -- : --name=!/memory_leak/ I, [2024-05-07T14:01:37.247309 #1311354] INFO -- : --stderr-on-failure I, [2024-05-07T14:01:37.247315 #1311354] INFO -- : -j20 I, [2024-05-07T14:01:37.247321 #1311354] INFO -- : I, [2024-05-07T14:01:37.247327 #1311354] INFO -- : # Running tests: I, [2024-05-07T14:01:37.247333 #1311354] INFO -- : I, [2024-05-07T14:01:37.393709 #1311354] INFO -- : [ 1/885] 1352749=test_bn I, [2024-05-07T14:01:37.393921 #1311354] INFO -- : [ 2/885] 1352735=test_win32ole_param_event I, [2024-05-07T14:01:37.394011 #1311354] INFO -- : [ 3/885] 1352736=test_path I, [2024-05-07T14:01:37.394094 #1311354] INFO -- : [ 4/885] 1352733=test_case_mapping I, [2024-05-07T14:01:37.394661 #1311354] INFO -- : [ 5/885] 1352734=redundant_return_test I, [2024-05-07T14:01:37.396240 #1311354] INFO -- : [ 6/885] 1352737=test_tree_spell_checker I, [2024-05-07T14:01:37.397451 #1311354] INFO -- : [ 7/885] 1352735=test_addrinfo I, [2024-05-07T14:01:37.398388 #1311354] INFO -- : [ 8/885] 1352745=test_http I, [2024-05-07T14:01:37.398481 #1311354] INFO -- : [ 9/885] 1352746=test_bug-14834 I, [2024-05-07T14:01:37.398555 #1311354] INFO -- : [ 10/885] 1352747=test_date_compat I, [2024-05-07T14:01:37.398873 #1311354] INFO -- : [ 11/885] 1352748=test_rdoc_markup_to_html I, [2024-05-07T14:01:37.400795 #1311354] INFO -- : [ 12/885] 1352750=test_compile_prism I, [2024-05-07T14:01:37.405418 #1311354] INFO -- : [ 13/885] 1352736=test_terminfo I, [2024-05-07T14:01:37.409106 #1311354] INFO -- : [ 14/885] 1352733=test_lexer I, [2024-05-07T14:01:37.415709 #1311354] INFO -- : [ 15/885] 1352747=test_thread_cv I, [2024-05-07T14:01:37.428419 #1311354] INFO -- : [ 16/885] 1352742=test_ssl_session I, [2024-05-07T14:01:37.428494 #1311354] INFO -- : [ 17/885] 1352738=test_gem_commands_update_command I, [2024-05-07T14:01:37.428839 #1311354] INFO -- : [ 18/885] 1352740=test_gem_resolver_vendor_specification I, [2024-05-07T14:01:37.428920 #1311354] INFO -- : [ 19/885] 1352739=test_key_event_record I, [2024-05-07T14:01:37.429003 #1311354] INFO -- : [ 20/885] 1352741=test_gem_uri I, [2024-05-07T14:01:37.429075 #1311354] INFO -- : [ 21/885] 1352743=test_random I, [2024-05-07T14:01:37.430252 #1311354] INFO -- : [ 22/885] 1352744=test_notimplement I, [2024-05-07T14:01:37.432201 #1311354] INFO -- : [ 23/885] 1352749=test_rdoc_method_attr I, [2024-05-07T14:01:37.435259 #1311354] INFO -- : [ 24/885] 1352744=test_gem_gem_runner I, [2024-05-07T14:01:37.438361 #1311354] INFO -- : [ 25/885] 1352733=test_filter I, [2024-05-07T14:01:37.446772 #1311354] INFO -- : [ 26/885] 1352737=static_literals_test I, [2024-05-07T14:01:37.452049 #1311354] INFO -- : [ 27/885] 1352743=test_data I, [2024-05-07T14:01:37.457979 #1311354] INFO -- : [ 28/885] 1352736=test_rdoc_generator_pot I, [2024-05-07T14:01:37.458883 #1311354] INFO -- : [ 29/885] 1352735=test_koi8 I, [2024-05-07T14:01:37.465895 #1311354] INFO -- : [ 30/885] 1352743=parameters_signature_test I, [2024-05-07T14:01:37.465976 #1311354] INFO -- : [ 31/885] 1352734=test_rdoc_parser_changelog I, [2024-05-07T14:01:37.466813 #1311354] INFO -- : [ 32/885] 1352733=test_enumerator I, [2024-05-07T14:01:37.480193 #1311354] INFO -- : [ 33/885] 1352735=test_unicode I, [2024-05-07T14:01:37.480381 #1311354] INFO -- : [ 34/885] 1352751=test_document I, [2024-05-07T14:01:37.481504 #1311354] INFO -- : [ 35/885] 1352733=test_rdoc_generator_pot_po_entry I, [2024-05-07T14:01:37.482919 #1311354] INFO -- : [ 36/885] 1352746=test_euc_jp I, [2024-05-07T14:01:37.483000 #1311354] INFO -- : [ 37/885] 1352752=test_acceptable I, [2024-05-07T14:01:37.484832 #1311354] INFO -- : [ 38/885] 1352746=test_gem_commands_yank_command I, [2024-05-07T14:01:37.495388 #1311354] INFO -- : [ 39/885] 1352739=test_win32ole_param I, [2024-05-07T14:01:37.501976 #1311354] INFO -- : [ 40/885] 1352739=test_pair I, [2024-05-07T14:01:37.505040 #1311354] INFO -- : [ 41/885] 1352751=test_name_error_extension I, [2024-05-07T14:01:37.515193 #1311354] INFO -- : [ 42/885] 1352737=test_chilled I, [2024-05-07T14:01:37.516062 #1311354] INFO -- : [ 43/885] 1352751=test_rdoc_i18n_locale I, [2024-05-07T14:01:37.517949 #1311354] INFO -- : [ 44/885] 1352737=test_primitive I, [2024-05-07T14:01:37.527490 #1311354] INFO -- : [ 45/885] 1352737=test_human_typo I, [2024-05-07T14:01:37.535192 #1311354] INFO -- : [ 46/885] 1352737=test_rbconfig I, [2024-05-07T14:01:37.538206 #1311354] INFO -- : [ 47/885] 1352737=test_key_stroke I, [2024-05-07T14:01:37.542207 #1311354] INFO -- : [ 48/885] 1352735=test_color I, [2024-05-07T14:01:37.556222 #1311354] INFO -- : [ 49/885] 1352743=json_encoding_test I, [2024-05-07T14:01:37.575263 #1311354] INFO -- : [ 50/885] 1352743=test_gem_resolver_local_specification I, [2024-05-07T14:01:37.594967 #1311354] INFO -- : [ 51/885] 1352735=test_httpheader I, [2024-05-07T14:01:37.595244 #1311354] INFO -- : [ 52/885] 1352737=test_rdoc_ri_driver I, [2024-05-07T14:01:37.614152 #1311354] INFO -- : [ 53/885] 1352748=test_httpresponses I, [2024-05-07T14:01:37.617378 #1311354] INFO -- : [ 54/885] 1352740=test_encoding I, [2024-05-07T14:01:37.622052 #1311354] INFO -- : [ 55/885] 1352752=test_set_len I, [2024-05-07T14:01:37.626015 #1311354] INFO -- : [ 56/885] 1352733=test_sockopt I, [2024-05-07T14:01:37.626828 #1311354] INFO -- : [ 57/885] 1352752=test_install I, [2024-05-07T14:01:37.628594 #1311354] INFO -- : [ 58/885] 1352733=test_rdoc_markup_to_label I, [2024-05-07T14:01:37.633306 #1311354] INFO -- : [ 59/885] 1352736=test_printf I, [2024-05-07T14:01:37.635560 #1311354] INFO -- : [ 60/885] 1352751=test_rdoc_markup_pre_process I, [2024-05-07T14:01:37.645733 #1311354] INFO -- : [ 61/885] 1352740=test_time I, [2024-05-07T14:01:37.648739 #1311354] INFO -- : [ 62/885] 1352750=test_webauthn_listener_response I, [2024-05-07T14:01:37.651433 #1311354] INFO -- : [ 63/885] 1352736=test_to_ary_concat I, [2024-05-07T14:01:37.661210 #1311354] INFO -- : [ 64/885] 1352744=test_stream I, [2024-05-07T14:01:37.666078 #1311354] INFO -- : [ 65/885] 1352735=test_pinned I, [2024-05-07T14:01:37.666468 #1311354] INFO -- : [ 66/885] 1352741=test_gem_bundler_version_finder I, [2024-05-07T14:01:37.669939 #1311354] INFO -- : [ 67/885] 1352733=test_emoji_breaks I, [2024-05-07T14:01:37.676366 #1311354] INFO -- : [ 68/885] 1352733=test_within_pipe I, [2024-05-07T14:01:37.683409 #1311354] INFO -- : [ 69/885] 1352751=reflection_test I, [2024-05-07T14:01:37.684414 #1311354] INFO -- : [ 70/885] 1352734=test_gem_commands_unpack_command I, [2024-05-07T14:01:37.686441 #1311354] INFO -- : [ 71/885] 1352744=test_files_lib I, [2024-05-07T14:01:37.687171 #1311354] INFO -- : [ 72/885] 1352735=test_beginendblock I, [2024-05-07T14:01:37.694400 #1311354] INFO -- : [ 73/885] 1352748=test_help I, [2024-05-07T14:01:37.699509 #1311354] INFO -- : [ 74/885] 1352741=test_rdoc_markup_to_bs I, [2024-05-07T14:01:37.710939 #1311354] INFO -- : [ 75/885] 1352748=test_digest I, [2024-05-07T14:01:37.741276 #1311354] INFO -- : [ 76/885] 1352748=test_ractor I, [2024-05-07T14:01:37.752160 #1311354] INFO -- : [ 77/885] 1352751=test_rdoc_servlet I, [2024-05-07T14:01:37.774635 #1311354] INFO -- : [ 78/885] 1352733=test_gem_security I, [2024-05-07T14:01:37.790669 #1311354] INFO -- : [ 79/885] 1352740=test_fiber I, [2024-05-07T14:01:37.799914 #1311354] INFO -- : [ 80/885] 1352748=test_multi_irb_commands I, [2024-05-07T14:01:37.801890 #1311354] INFO -- : [ 81/885] 1352748=test_open3 I, [2024-05-07T14:01:37.814660 #1311354] INFO -- : [ 82/885] 1352749=test_bundled_ca I, [2024-05-07T14:01:37.827025 #1311354] INFO -- : [ 83/885] 1352750=test_closure I, [2024-05-07T14:01:37.851956 #1311354] INFO -- : [ 84/885] 1352741=test_delegate I, [2024-05-07T14:01:37.856712 #1311354] INFO -- : [ 85/885] 1352752=test_popen_deadlock I, [2024-05-07T14:01:37.858616 #1311354] INFO -- : [ 86/885] 1352743=test_history I, [2024-05-07T14:01:37.862820 #1311354] INFO -- : [ 87/885] 1352741=test_date_marshal I, [2024-05-07T14:01:37.869058 #1311354] INFO -- : [ 88/885] 1352741=test_mkmf I, [2024-05-07T14:01:37.904968 #1311354] INFO -- : [ 89/885] 1352741=test_recursion I, [2024-05-07T14:01:37.912362 #1311354] INFO -- : [ 90/885] 1352741=test_exit I, [2024-05-07T14:01:37.968385 #1311354] INFO -- : [ 91/885] 1352741=test_variable_name_check I, [2024-05-07T14:01:37.984076 #1311354] INFO -- : [ 92/885] 1352750=test_io_m17n I, [2024-05-07T14:01:37.998235 #1311354] INFO -- : [ 93/885] 1352751=test_did_you_mean I, [2024-05-07T14:01:38.010843 #1311354] INFO -- : [ 94/885] 1352741=test_gem_commands_server_command I, [2024-05-07T14:01:38.016610 #1311354] INFO -- : [ 95/885] 1352741=test_append I, [2024-05-07T14:01:38.017816 #1311354] INFO -- : [ 96/885] 1352743=test_option I, [2024-05-07T14:01:38.019168 #1311354] INFO -- : [ 97/885] 1352737=test_cmethod I, [2024-05-07T14:01:38.023013 #1311354] INFO -- : [ 98/885] 1352741=test_tracer I, [2024-05-07T14:01:38.024519 #1311354] INFO -- : [ 99/885] 1352737=test_gem_commands_build_command I, [2024-05-07T14:01:38.039134 #1311354] INFO -- : [100/885] 1352736=test_interned_str I, [2024-05-07T14:01:38.041578 #1311354] INFO -- : [101/885] 1352736=test_case_comprehensive I, [2024-05-07T14:01:38.060710 #1311354] INFO -- : [102/885] 1352747=test_class I, [2024-05-07T14:01:38.069024 #1311354] INFO -- : [103/885] 1352735=test_ocsp I, [2024-05-07T14:01:38.079313 #1311354] INFO -- : [104/885] 1352747=test_pkey_dsa I, [2024-05-07T14:01:38.111706 #1311354] INFO -- : [105/885] 1352751=test_scheduler I, [2024-05-07T14:01:38.132862 #1311354] INFO -- : [106/885] 1352746=test_iseq I, [2024-05-07T14:01:38.139004 #1311354] INFO -- : [107/885] 1352743=test_exception_at_throwing I, [2024-05-07T14:01:38.159891 #1311354] INFO -- : [108/885] 1352741=test_rdoc_markup_heading I, [2024-05-07T14:01:38.165758 #1311354] INFO -- : [109/885] 1352741=test_cparser I, [2024-05-07T14:01:38.179060 #1311354] INFO -- : [110/885] 1352734=test_pkg_config I, [2024-05-07T14:01:38.211062 #1311354] INFO -- : [111/885] 1352734=test_sexp I, [2024-05-07T14:01:38.224207 #1311354] INFO -- : [112/885] 1352743=test_rdoc_markup_include I, [2024-05-07T14:01:38.226478 #1311354] INFO -- : [113/885] 1352734=fuzzer_test I, [2024-05-07T14:01:38.248307 #1311354] INFO -- : [114/885] 1352734=test_variable I, [2024-05-07T14:01:38.258289 #1311354] INFO -- : [115/885] 1352751=test_struct I, [2024-05-07T14:01:38.264018 #1311354] INFO -- : [116/885] 1352751=magic_comment_test I, [2024-05-07T14:01:38.280483 #1311354] INFO -- : [117/885] 1352751=test_rdoc_markup_to_html_snippet I, [2024-05-07T14:01:38.340702 #1311354] INFO -- : [118/885] 1352743=test_gem_source_subpath_problem I, [2024-05-07T14:01:38.344888 #1311354] INFO -- : [119/885] 1352751=test_dln I, [2024-05-07T14:01:38.345400 #1311354] INFO -- : [120/885] 1352734=json_common_interface_test I, [2024-05-07T14:01:38.346117 #1311354] INFO -- : [121/885] 1352751=test_win32ole_variant_outarg I, [2024-05-07T14:01:38.350679 #1311354] INFO -- : [122/885] 1352751=test_config I, [2024-05-07T14:01:38.372081 #1311354] INFO -- : [123/885] 1352734=memsize_test I, [2024-05-07T14:01:38.372941 #1311354] INFO -- : [124/885] 1352734=json_parser_test I, [2024-05-07T14:01:38.381428 #1311354] INFO -- : [125/885] 1352735=test_nomethod_error I, [2024-05-07T14:01:38.384847 #1311354] INFO -- : [126/885] 1352735=test_set I, [2024-05-07T14:01:38.392561 #1311354] INFO -- : [127/885] 1352751=test_gem_path_support I, [2024-05-07T14:01:38.401849 #1311354] INFO -- : [128/885] 1352735=test_struct I, [2024-05-07T14:01:38.423177 #1311354] INFO -- : [129/885] 1352734=test_files_test_1 I, [2024-05-07T14:01:38.436688 #1311354] INFO -- : [130/885] 1352743=test_rdoc_rd_inline I, [2024-05-07T14:01:38.438634 #1311354] INFO -- : [131/885] 1352743=test_mutex I, [2024-05-07T14:01:38.463663 #1311354] INFO -- : [132/885] 1352752=test_x509req I, [2024-05-07T14:01:38.469231 #1311354] INFO -- : [133/885] 1352742=test_key_error I, [2024-05-07T14:01:38.475268 #1311354] INFO -- : [134/885] 1352742=test_div I, [2024-05-07T14:01:38.476788 #1311354] INFO -- : [135/885] 1352742=test_allocation I, [2024-05-07T14:01:38.510605 #1311354] INFO -- : [136/885] 1352737=test_engine I, [2024-05-07T14:01:38.517901 #1311354] INFO -- : [137/885] 1352737=test_win32ole_variant_m I, [2024-05-07T14:01:38.519368 #1311354] INFO -- : [138/885] 1352737=test_color_printer I, [2024-05-07T14:01:38.573498 #1311354] INFO -- : [139/885] 1352751=test_deprecated I, [2024-05-07T14:01:38.584470 #1311354] INFO -- : [140/885] 1352737=test_serialize_subclasses I, [2024-05-07T14:01:38.592801 #1311354] INFO -- : [141/885] 1352737=test_insns_leaf I, [2024-05-07T14:01:38.593193 #1311354] INFO -- : [142/885] 1352737=test_fixnum I, [2024-05-07T14:01:38.600622 #1311354] INFO -- : [143/885] 1352751=test_signal I, [2024-05-07T14:01:38.608329 #1311354] INFO -- : [144/885] 1352737=test_x509crl I, [2024-05-07T14:01:38.680507 #1311354] INFO -- : [145/885] 1352752=test_rdoc_rd I, [2024-05-07T14:01:38.708196 #1311354] INFO -- : [146/885] 1352741=test_cgi_session I, [2024-05-07T14:01:38.720645 #1311354] INFO -- : [147/885] 1352746=test_metaclass I, [2024-05-07T14:01:38.723625 #1311354] INFO -- : [148/885] 1352741=test_rdoc_top_level I, [2024-05-07T14:01:38.732540 #1311354] INFO -- : [149/885] 1352746=test_input_method I, [2024-05-07T14:01:38.735603 #1311354] INFO -- : [150/885] 1352737=test_windows_1252 I, [2024-05-07T14:01:38.738030 #1311354] INFO -- : [151/885] 1352737=test_process I, [2024-05-07T14:01:38.758769 #1311354] INFO -- : [152/885] 1352737=test_float I, [2024-05-07T14:01:38.802783 #1311354] INFO -- : [153/885] 1352752=test_cgi_cookie I, [2024-05-07T14:01:38.812096 #1311354] INFO -- : [154/885] 1352752=test_require I, [2024-05-07T14:01:38.817720 #1311354] INFO -- : [155/885] 1352735=test_dir_m17n I, [2024-05-07T14:01:38.937028 #1311354] INFO -- : [156/885] 1352741=test_gem_resolver_installer_set I, [2024-05-07T14:01:39.047567 #1311354] INFO -- : [157/885] 1352738=test_gem_commands_signout_command I, [2024-05-07T14:01:39.050255 #1311354] INFO -- : [158/885] 1352746=test_refinement I, [2024-05-07T14:01:39.059815 #1311354] INFO -- : [159/885] 1352738=test_regex_casefold I, [2024-05-07T14:01:39.105008 #1311354] INFO -- : [160/885] 1352741=test_gem_source_git I, [2024-05-07T14:01:39.242910 #1311354] INFO -- : [161/885] 1352750=test_cipher I, [2024-05-07T14:01:39.290864 #1311354] INFO -- : [162/885] 1352750=test_gem_security_signer I, [2024-05-07T14:01:39.295109 #1311354] INFO -- : [163/885] 1352747=test_new I, [2024-05-07T14:01:39.296098 #1311354] INFO -- : [164/885] 1352747=test_gem_resolver_git_set I, [2024-05-07T14:01:39.351489 #1311354] INFO -- : [165/885] 1352738=test_storage I, [2024-05-07T14:01:39.360873 #1311354] INFO -- : [166/885] 1352738=test_iterator I, [2024-05-07T14:01:39.400658 #1311354] INFO -- : [167/885] 1352750=test_string I, [2024-05-07T14:01:39.412833 #1311354] INFO -- : [168/885] 1352750=test_omap I, [2024-05-07T14:01:39.432793 #1311354] INFO -- : [169/885] 1352750=test_digest_extend I, [2024-05-07T14:01:39.439731 #1311354] INFO -- : [170/885] 1352738=test_shellwords I, [2024-05-07T14:01:39.442709 #1311354] INFO -- : [171/885] 1352750=test_debug I, [2024-05-07T14:01:39.445038 #1311354] INFO -- : [172/885] 1352750=pattern_test I, [2024-05-07T14:01:39.449594 #1311354] INFO -- : [173/885] 1352738=test_memory_view I, [2024-05-07T14:01:39.466325 #1311354] INFO -- : [174/885] 1352738=test_rdoc_parser_simple I, [2024-05-07T14:01:39.488451 #1311354] INFO -- : [175/885] 1352738=test_yamldbm I, [2024-05-07T14:01:39.498581 #1311354] INFO -- : [176/885] 1352738=test_gem_commands_rebuild_command I, [2024-05-07T14:01:39.536211 #1311354] INFO -- : [177/885] 1352750=test_load I, [2024-05-07T14:01:39.541764 #1311354] INFO -- : [178/885] 1352750=test_abi I, [2024-05-07T14:01:39.572551 #1311354] INFO -- : [179/885] 1352738=test_provider I, [2024-05-07T14:01:39.599217 #1311354] INFO -- : [180/885] 1352749=test_evaluation I, [2024-05-07T14:01:39.605227 #1311354] INFO -- : [181/885] 1352743=test_https I, [2024-05-07T14:01:39.607733 #1311354] INFO -- : [182/885] 1352749=test_gem_ext_builder I, [2024-05-07T14:01:39.627411 #1311354] INFO -- : [183/885] 1352741=test_win32ole_method_event I, [2024-05-07T14:01:39.629623 #1311354] INFO -- : [184/885] 1352741=test_nesting_parser I, [2024-05-07T14:01:39.646837 #1311354] INFO -- : [185/885] 1352741=test_gem_dependency_list I, [2024-05-07T14:01:39.707002 #1311354] INFO -- : [186/885] 1352750=test_benchmark I, [2024-05-07T14:01:39.738641 #1311354] INFO -- : [187/885] 1352741=test_gem_commands_outdated_command I, [2024-05-07T14:01:39.738809 #1311354] INFO -- : [188/885] 1352747=test_helper_method I, [2024-05-07T14:01:39.774374 #1311354] INFO -- : [189/885] 1352741=test_gem_package_tar_writer I, [2024-05-07T14:01:39.859991 #1311354] INFO -- : [190/885] 1352738=test_array I, [2024-05-07T14:01:39.878841 #1311354] INFO -- : [191/885] 1352741=test_gem_source I, [2024-05-07T14:01:39.887630 #1311354] INFO -- : [192/885] 1352747=test_scalar_scanner I, [2024-05-07T14:01:39.907550 #1311354] INFO -- : [193/885] 1352747=test_rational2 I, [2024-05-07T14:01:39.923660 #1311354] INFO -- : [194/885] 1352747=test_rational I, [2024-05-07T14:01:39.940256 #1311354] INFO -- : [195/885] 1352747=test_assembler I, [2024-05-07T14:01:39.942089 #1311354] INFO -- : [196/885] 1352747=attribute_write_test I, [2024-05-07T14:01:40.031519 #1311354] INFO -- : [197/885] 1352747=test_propertyputref I, [2024-05-07T14:01:40.032992 #1311354] INFO -- : [198/885] 1352747=test_spell_checker I, [2024-05-07T14:01:40.036829 #1311354] INFO -- : [199/885] 1352743=test_erb I, [2024-05-07T14:01:40.041793 #1311354] INFO -- : [200/885] 1352747=test_x509ext I, [2024-05-07T14:01:40.048845 #1311354] INFO -- : [201/885] 1352747=test_gem_source_installed I, [2024-05-07T14:01:40.075430 #1311354] INFO -- : [202/885] 1352741=test_completion I, [2024-05-07T14:01:40.081961 #1311354] INFO -- : [203/885] 1352747=test_gem_commands_cert_command I, [2024-05-07T14:01:40.095727 #1311354] INFO -- : [204/885] 1352743=test_len I, [2024-05-07T14:01:40.101709 #1311354] INFO -- : [205/885] 1352743=test_yield_block I, [2024-05-07T14:01:40.104734 #1311354] INFO -- : [206/885] 1352743=test_parser I, [2024-05-07T14:01:40.121230 #1311354] INFO -- : [207/885] 1352743=test_method_name_check I, [2024-05-07T14:01:40.125142 #1311354] INFO -- : [208/885] 1352748=test_arith_seq_extract I, [2024-05-07T14:01:40.146891 #1311354] INFO -- : [209/885] 1352743=test_ssl I, [2024-05-07T14:01:40.163921 #1311354] INFO -- : [210/885] 1352735=test_gem_ext_cargo_builder I, [2024-05-07T14:01:40.227779 #1311354] INFO -- : [211/885] 1352737=constant_path_node_test I, [2024-05-07T14:01:40.234769 #1311354] INFO -- : [212/885] 1352737=test_gem_request_set I, [2024-05-07T14:01:40.251065 #1311354] INFO -- : [213/885] 1352744=test_module I, [2024-05-07T14:01:40.276342 #1311354] INFO -- : [214/885] 1352748=test_boolean I, [2024-05-07T14:01:40.302669 #1311354] INFO -- : [215/885] 1352735=test_instrumentation_api I, [2024-05-07T14:01:40.306512 #1311354] INFO -- : [216/885] 1352748=integer_parse_test I, [2024-05-07T14:01:40.397570 #1311354] INFO -- : [217/885] 1352748=test_stringify_symbols I, [2024-05-07T14:01:40.403499 #1311354] INFO -- : [218/885] 1352748=test_monitor I, [2024-05-07T14:01:40.590489 #1311354] INFO -- : [219/885] 1352737=test_buffered_io I, [2024-05-07T14:01:40.612162 #1311354] INFO -- : [220/885] 1352748=test_configuration I, [2024-05-07T14:01:40.624476 #1311354] INFO -- : [221/885] 1352749=test_rubyvm I, [2024-05-07T14:01:40.631325 #1311354] INFO -- : [222/885] 1352749=test_rdoc_generator_markup I, [2024-05-07T14:01:40.633987 #1311354] INFO -- : [223/885] 1352749=test_whileuntil I, [2024-05-07T14:01:40.639370 #1311354] INFO -- : [224/885] 1352749=test_coderange I, [2024-05-07T14:01:40.640040 #1311354] INFO -- : [225/885] 1352749=test_symbol I, [2024-05-07T14:01:40.647176 #1311354] INFO -- : [226/885] 1352751=location_test I, [2024-05-07T14:01:40.653337 #1311354] INFO -- : [227/885] 1352737=test_mailto I, [2024-05-07T14:01:40.656213 #1311354] INFO -- : [228/885] 1352741=test_rdoc_generator_darkfish I, [2024-05-07T14:01:40.660075 #1311354] INFO -- : [229/885] 1352737=test_resize I, [2024-05-07T14:01:40.660389 #1311354] INFO -- : [230/885] 1352749=test_error_highlight I, [2024-05-07T14:01:40.665490 #1311354] INFO -- : [231/885] 1352737=test_rdoc_comment I, [2024-05-07T14:01:40.673373 #1311354] INFO -- : [232/885] 1352751=json_generic_object_test I, [2024-05-07T14:01:40.681824 #1311354] INFO -- : [233/885] 1352751=test_gem_source_fetch_problem I, [2024-05-07T14:01:40.694294 #1311354] INFO -- : [234/885] 1352751=test_http_request I, [2024-05-07T14:01:40.710082 #1311354] INFO -- : [235/885] 1352737=test_numeric I, [2024-05-07T14:01:40.714085 #1311354] INFO -- : [236/885] 1352737=test_member I, [2024-05-07T14:01:40.717379 #1311354] INFO -- : [237/885] 1352737=test_word I, [2024-05-07T14:01:40.722381 #1311354] INFO -- : [238/885] 1352737=test_gem_commands_cleanup_command I, [2024-05-07T14:01:40.732109 #1311354] INFO -- : [239/885] 1352751=test_cgi_multipart I, [2024-05-07T14:01:40.734762 #1311354] INFO -- : [240/885] 1352748=test_ractor_compatibility I, [2024-05-07T14:01:40.839936 #1311354] INFO -- : [241/885] 1352742=test_eval I, [2024-05-07T14:01:40.845013 #1311354] INFO -- : [242/885] 1352742=test_autoconf I, [2024-05-07T14:01:40.848593 #1311354] INFO -- : [243/885] 1352742=format_errors_test I, [2024-05-07T14:01:40.898484 #1311354] INFO -- : [244/885] 1352751=test_dir I, [2024-05-07T14:01:40.903567 #1311354] INFO -- : [245/885] 1352750=test_gem_console_ui I, [2024-05-07T14:01:40.904703 #1311354] INFO -- : [246/885] 1352750=test_date_ractor I, [2024-05-07T14:01:40.907280 #1311354] INFO -- : [247/885] 1352741=test_unix I, [2024-05-07T14:01:40.913377 #1311354] INFO -- : [248/885] 1352742=test_enc_associate I, [2024-05-07T14:01:40.934858 #1311354] INFO -- : [249/885] 1352739=test_lazy_enumerator I, [2024-05-07T14:01:40.942946 #1311354] INFO -- : [250/885] 1352741=ruby_api_test I, [2024-05-07T14:01:41.003111 #1311354] INFO -- : [251/885] 1352749=test_find_executable I, [2024-05-07T14:01:41.022769 #1311354] INFO -- : [252/885] 1352749=test_symbol I, [2024-05-07T14:01:41.125150 #1311354] INFO -- : [253/885] 1352748=test_coder I, [2024-05-07T14:01:41.128280 #1311354] INFO -- : [254/885] 1352750=test_nofree I, [2024-05-07T14:01:41.130626 #1311354] INFO -- : [255/885] 1352750=test_context I, [2024-05-07T14:01:41.143937 #1311354] INFO -- : [256/885] 1352748=test_gem_commands_pristine_command I, [2024-05-07T14:01:41.177669 #1311354] INFO -- : [257/885] 1352741=test_function_entry I, [2024-05-07T14:01:41.178601 #1311354] INFO -- : [258/885] 1352741=test_pkcs7 I, [2024-05-07T14:01:41.181935 #1311354] INFO -- : [259/885] 1352751=test_gem_resolver_requirement_list I, [2024-05-07T14:01:41.186358 #1311354] INFO -- : [260/885] 1352751=test_arith_seq_beg_len_step I, [2024-05-07T14:01:41.254653 #1311354] INFO -- : [261/885] 1352751=test_gem_specification I, [2024-05-07T14:01:41.299195 #1311354] INFO -- : [262/885] 1352737=test_enum I, [2024-05-07T14:01:41.339099 #1311354] INFO -- : [263/885] 1352739=test_threadgroup I, [2024-05-07T14:01:41.341194 #1311354] INFO -- : [264/885] 1352750=test_have_macro I, [2024-05-07T14:01:41.349574 #1311354] INFO -- : [265/885] 1352734=test_complex2 I, [2024-05-07T14:01:41.359339 #1311354] INFO -- : [266/885] 1352734=test_resolve_symbol I, [2024-05-07T14:01:41.407359 #1311354] INFO -- : [267/885] 1352741=test_gem_package I, [2024-05-07T14:01:41.409319 #1311354] INFO -- : [268/885] 1352747=ractor_test I, [2024-05-07T14:01:41.436892 #1311354] INFO -- : [269/885] 1352734=test_trace I, [2024-05-07T14:01:41.453757 #1311354] INFO -- : [270/885] 1352734=test_rdoc_generator_json_index I, [2024-05-07T14:01:41.459413 #1311354] INFO -- : [271/885] 1352742=test_win32ole_event I, [2024-05-07T14:01:41.463168 #1311354] INFO -- : [272/885] 1352742=test_time_tz I, [2024-05-07T14:01:41.464595 #1311354] INFO -- : [273/885] 1352747=test_gem_ci_detector I, [2024-05-07T14:01:41.469240 #1311354] INFO -- : [274/885] 1352747=test_bignum I, [2024-05-07T14:01:41.480233 #1311354] INFO -- : [275/885] 1352734=test_rdoc_class_module I, [2024-05-07T14:01:41.501066 #1311354] INFO -- : [276/885] 1352742=test_win32ole_variable I, [2024-05-07T14:01:41.504282 #1311354] INFO -- : [277/885] 1352742=test_io_wait_uncommon I, [2024-05-07T14:01:41.507412 #1311354] INFO -- : [278/885] 1352742=test_arity I, [2024-05-07T14:01:41.510159 #1311354] INFO -- : [279/885] 1352742=test_stringio I, [2024-05-07T14:01:41.514105 #1311354] INFO -- : [280/885] 1352752=test_win32ole_variant I, [2024-05-07T14:01:41.516312 #1311354] INFO -- : [281/885] 1352752=test_ipaddr I, [2024-05-07T14:01:41.531840 #1311354] INFO -- : [282/885] 1352752=test_rdoc_markup_to_ansi I, [2024-05-07T14:01:41.564250 #1311354] INFO -- : [283/885] 1352752=test_history I, [2024-05-07T14:01:41.597315 #1311354] INFO -- : [284/885] 1352747=test_mixed_unicode_escapes I, [2024-05-07T14:01:41.602934 #1311354] INFO -- : [285/885] 1352747=test_gem_resolver_api_specification I, [2024-05-07T14:01:41.629376 #1311354] INFO -- : [286/885] 1352742=test_merge_keys I, [2024-05-07T14:01:41.640895 #1311354] INFO -- : [287/885] 1352747=test_rdoc_extend I, [2024-05-07T14:01:41.648446 #1311354] INFO -- : [288/885] 1352752=test_gem_source_lock I, [2024-05-07T14:01:41.659775 #1311354] INFO -- : [289/885] 1352742=test_gem I, [2024-05-07T14:01:41.677623 #1311354] INFO -- : [290/885] 1352746=test_gem_commands_open_command I, [2024-05-07T14:01:41.774415 #1311354] INFO -- : [291/885] 1352746=test_dns I, [2024-05-07T14:01:41.832410 #1311354] INFO -- : [292/885] 1352747=test_ractor I, [2024-05-07T14:01:41.835863 #1311354] INFO -- : [293/885] 1352752=parse_stream_test I, [2024-05-07T14:01:41.846397 #1311354] INFO -- : [294/885] 1352747=test_registry I, [2024-05-07T14:01:41.846919 #1311354] INFO -- : [295/885] 1352747=test_parser I, [2024-05-07T14:01:41.847451 #1311354] INFO -- : [296/885] 1352750=test_cgi_core I, [2024-05-07T14:01:41.857759 #1311354] INFO -- : [297/885] 1352747=test_rb_str_dup I, [2024-05-07T14:01:41.862205 #1311354] INFO -- : [298/885] 1352747=test_reline_key I, [2024-05-07T14:01:41.866527 #1311354] INFO -- : [299/885] 1352750=test_singleton_function I, [2024-05-07T14:01:41.867572 #1311354] INFO -- : [300/885] 1352750=test_ancdata I, [2024-05-07T14:01:41.867768 #1311354] INFO -- : [301/885] 1352747=test_alias I, [2024-05-07T14:01:41.874139 #1311354] INFO -- : [302/885] 1352750=test_timeout I, [2024-05-07T14:01:41.911800 #1311354] INFO -- : [303/885] 1352752=test_unicode_normalize I, [2024-05-07T14:01:41.962943 #1311354] INFO -- : [304/885] 1352734=test_marshal I, [2024-05-07T14:01:42.028192 #1311354] INFO -- : [305/885] 1352744=test_nonblock I, [2024-05-07T14:01:42.040914 #1311354] INFO -- : [306/885] 1352744=test_weakref I, [2024-05-07T14:01:42.046201 #1311354] INFO -- : [307/885] 1352747=test_thread I, [2024-05-07T14:01:42.168668 #1311354] INFO -- : [308/885] 1352741=json_ext_parser_test I, [2024-05-07T14:01:42.172215 #1311354] INFO -- : [309/885] 1352744=test_my_integer I, [2024-05-07T14:01:42.176889 #1311354] INFO -- : [310/885] 1352744=test_debugger_integration I, [2024-05-07T14:01:42.181933 #1311354] INFO -- : [311/885] 1352741=test_rendering I, [2024-05-07T14:01:42.187813 #1311354] INFO -- : [312/885] 1352741=test_ractor I, [2024-05-07T14:01:42.191551 #1311354] INFO -- : [313/885] 1352744=test_ssl I, [2024-05-07T14:01:42.250497 #1311354] INFO -- : [314/885] 1352746=test_object_references I, [2024-05-07T14:01:42.279934 #1311354] INFO -- : [315/885] 1352746=test_usrmarshal I, [2024-05-07T14:01:42.284338 #1311354] INFO -- : [316/885] 1352737=test_gem_resolver_git_specification I, [2024-05-07T14:01:42.342260 #1311354] INFO -- : [317/885] 1352739=test_stat I, [2024-05-07T14:01:42.350811 #1311354] INFO -- : [318/885] 1352739=test_gem_request_set_lockfile_tokenizer I, [2024-05-07T14:01:42.432675 #1311354] INFO -- : [319/885] 1352746=test_have_func I, [2024-05-07T14:01:42.453051 #1311354] INFO -- : [320/885] 1352741=test_nextafter I, [2024-05-07T14:01:42.489680 #1311354] INFO -- : [321/885] 1352748=test_capacity I, [2024-05-07T14:01:42.494342 #1311354] INFO -- : [322/885] 1352748=test_https_proxy I, [2024-05-07T14:01:42.497609 #1311354] INFO -- : [323/885] 1352748=test_call I, [2024-05-07T14:01:42.526656 #1311354] INFO -- : [324/885] 1352737=test_rubygems I, [2024-05-07T14:01:42.543634 #1311354] INFO -- : [325/885] 1352741=test_super I, [2024-05-07T14:01:42.557915 #1311354] INFO -- : [326/885] 1352734=test_rubyoptions I, [2024-05-07T14:01:42.568019 #1311354] INFO -- : [327/885] 1352739=test_cgi_modruby I, [2024-05-07T14:01:42.578223 #1311354] INFO -- : [328/885] 1352739=test_integer I, [2024-05-07T14:01:42.579678 #1311354] INFO -- : [329/885] 1352750=test_gem_commands_setup_command I, [2024-05-07T14:01:42.592800 #1311354] INFO -- : [330/885] 1352749=test_dryrun I, [2024-05-07T14:01:42.601461 #1311354] INFO -- : [331/885] 1352748=desugar_compiler_test I, [2024-05-07T14:01:42.608315 #1311354] INFO -- : [332/885] 1352748=test_integer I, [2024-05-07T14:01:42.610335 #1311354] INFO -- : [333/885] 1352749=test_env I, [2024-05-07T14:01:42.650539 #1311354] INFO -- : [334/885] 1352748=test_rdoc_attr I, [2024-05-07T14:01:42.657411 #1311354] INFO -- : [335/885] 1352748=test_transcode I, [2024-05-07T14:01:42.668759 #1311354] INFO -- : [336/885] 1352737=test_eval I, [2024-05-07T14:01:42.735767 #1311354] INFO -- : [337/885] 1352744=json_generator_test I, [2024-05-07T14:01:42.799627 #1311354] INFO -- : [338/885] 1352751=test_config I, [2024-05-07T14:01:42.811900 #1311354] INFO -- : [339/885] 1352748=test_gem_resolver_vendor_set I, [2024-05-07T14:01:42.816830 #1311354] INFO -- : [340/885] 1352744=test_enumerable I, [2024-05-07T14:01:42.819877 #1311354] INFO -- : [341/885] 1352748=test_gem_safe_marshal I, [2024-05-07T14:01:42.826671 #1311354] INFO -- : [342/885] 1352744=test_gem_resolver_api_set I, [2024-05-07T14:01:42.874804 #1311354] INFO -- : [343/885] 1352744=test_ast I, [2024-05-07T14:01:42.898236 #1311354] INFO -- : [344/885] 1352737=test_gem_request_set_gem_dependency_api I, [2024-05-07T14:01:43.031964 #1311354] INFO -- : [345/885] 1352750=test_lambda I, [2024-05-07T14:01:43.106813 #1311354] INFO -- : [346/885] 1352750=test_helper I, [2024-05-07T14:01:43.107238 #1311354] INFO -- : [347/885] 1352750=test_random_formatter I, [2024-05-07T14:01:43.113650 #1311354] INFO -- : [348/885] 1352737=test_jaro_winkler I, [2024-05-07T14:01:43.117227 #1311354] INFO -- : [349/885] 1352737=test_webauthn_listener I, [2024-05-07T14:01:43.129940 #1311354] INFO -- : [350/885] 1352750=test_rdoc_code_object I, [2024-05-07T14:01:43.182199 #1311354] INFO -- : [351/885] 1352737=test_x509store I, [2024-05-07T14:01:43.246257 #1311354] INFO -- : [352/885] 1352735=test_update I, [2024-05-07T14:01:43.251488 #1311354] INFO -- : [353/885] 1352735=test_x509name I, [2024-05-07T14:01:43.267511 #1311354] INFO -- : [354/885] 1352735=test_fips I, [2024-05-07T14:01:43.269898 #1311354] INFO -- : [355/885] 1352751=bom_test I, [2024-05-07T14:01:43.274663 #1311354] INFO -- : [356/885] 1352751=test_data_error I, [2024-05-07T14:01:43.295144 #1311354] INFO -- : [357/885] 1352748=test_ostruct I, [2024-05-07T14:01:43.339687 #1311354] INFO -- : [358/885] 1352751=unescape_test I, [2024-05-07T14:01:43.461186 #1311354] INFO -- : [359/885] 1352748=test_force_exit I, [2024-05-07T14:01:43.465098 #1311354] INFO -- : [360/885] 1352741=test_file I, [2024-05-07T14:01:43.509161 #1311354] INFO -- : [361/885] 1352738=test_udp I, [2024-05-07T14:01:43.526473 #1311354] INFO -- : [362/885] 1352735=static_inspect_test I, [2024-05-07T14:01:43.538109 #1311354] INFO -- : [363/885] 1352738=errors_test I, [2024-05-07T14:01:43.583977 #1311354] INFO -- : [364/885] 1352748=test_gem_commands_check_command I, [2024-05-07T14:01:43.588268 #1311354] INFO -- : [365/885] 1352737=test_regexp I, [2024-05-07T14:01:43.605276 #1311354] INFO -- : [366/885] 1352750=test_vm_dump I, [2024-05-07T14:01:43.606234 #1311354] INFO -- : [367/885] 1352750=test_integer_comb I, [2024-05-07T14:01:43.606654 #1311354] INFO -- : [368/885] 1352735=test_rdoc_markup_document I, [2024-05-07T14:01:43.607165 #1311354] INFO -- : [369/885] 1352748=test_tmpdir I, [2024-05-07T14:01:43.634968 #1311354] INFO -- : [370/885] 1352746=test_rdoc_ri_paths I, [2024-05-07T14:01:43.667408 #1311354] INFO -- : [371/885] 1352738=test_ts I, [2024-05-07T14:01:43.671729 #1311354] INFO -- : [372/885] 1352746=test_ensured I, [2024-05-07T14:01:43.704345 #1311354] INFO -- : [373/885] 1352740=test_locale I, [2024-05-07T14:01:43.706195 #1311354] INFO -- : [374/885] 1352748=test_addr I, [2024-05-07T14:01:43.716515 #1311354] INFO -- : [375/885] 1352748=library_symbols_test I, [2024-05-07T14:01:43.720020 #1311354] INFO -- : [376/885] 1352748=test_gem_uri_formatter I, [2024-05-07T14:01:43.723669 #1311354] INFO -- : [377/885] 1352746=test_erb_command I, [2024-05-07T14:01:43.737372 #1311354] INFO -- : [378/885] 1352735=test_helper I, [2024-05-07T14:01:43.738401 #1311354] INFO -- : [379/885] 1352748=test_encoding I, [2024-05-07T14:01:43.741923 #1311354] INFO -- : [380/885] 1352735=test_range I, [2024-05-07T14:01:43.754441 #1311354] INFO -- : [381/885] 1352746=test_project_sanity I, [2024-05-07T14:01:43.835385 #1311354] INFO -- : [382/885] 1352740=command_line_test I, [2024-05-07T14:01:43.838451 #1311354] INFO -- : [383/885] 1352742=test_constant I, [2024-05-07T14:01:43.839298 #1311354] INFO -- : [384/885] 1352746=test_dup I, [2024-05-07T14:01:43.919097 #1311354] INFO -- : [385/885] 1352740=test_pty I, [2024-05-07T14:01:43.924155 #1311354] INFO -- : [386/885] 1352748=test_key_actor_emacs I, [2024-05-07T14:01:44.025376 #1311354] INFO -- : [387/885] 1352748=test_basicinstructions I, [2024-05-07T14:01:44.047796 #1311354] INFO -- : [388/885] 1352746=test_gem_gemcutter_utilities I, [2024-05-07T14:01:44.082507 #1311354] INFO -- : [389/885] 1352748=test_gem_command_manager I, [2024-05-07T14:01:44.108317 #1311354] INFO -- : [390/885] 1352738=test_arithmetic_sequence I, [2024-05-07T14:01:44.115268 #1311354] INFO -- : [391/885] 1352738=heredoc_dedent_test I, [2024-05-07T14:01:44.126409 #1311354] INFO -- : [392/885] 1352738=test_cgi_header I, [2024-05-07T14:01:44.133682 #1311354] INFO -- : [393/885] 1352738=test_object I, [2024-05-07T14:01:44.135690 #1311354] INFO -- : [394/885] 1352738=version_test I, [2024-05-07T14:01:44.136942 #1311354] INFO -- : [395/885] 1352738=test_ractor I, [2024-05-07T14:01:44.186702 #1311354] INFO -- : [396/885] 1352738=test_type I, [2024-05-07T14:01:44.190674 #1311354] INFO -- : [397/885] 1352738=test_pointer I, [2024-05-07T14:01:44.242516 #1311354] INFO -- : [398/885] 1352748=test_big5 I, [2024-05-07T14:01:44.246508 #1311354] INFO -- : [399/885] 1352748=test_func I, [2024-05-07T14:01:44.312592 #1311354] INFO -- : [400/885] 1352735=test_rdoc_rd_block_parser I, [2024-05-07T14:01:44.341954 #1311354] INFO -- : [401/885] 1352735=test_signedness I, [2024-05-07T14:01:44.388648 #1311354] INFO -- : [402/885] 1352746=test_tsort I, [2024-05-07T14:01:44.391618 #1311354] INFO -- : [403/885] 1352746=test_change_word I, [2024-05-07T14:01:44.395501 #1311354] INFO -- : [404/885] 1352746=test_flip I, [2024-05-07T14:01:44.419390 #1311354] INFO -- : [405/885] 1352746=compiler_test I, [2024-05-07T14:01:44.426736 #1311354] INFO -- : [406/885] 1352740=test_timeout I, [2024-05-07T14:01:44.437094 #1311354] INFO -- : [407/885] 1352740=test_normalize I, [2024-05-07T14:01:44.437352 #1311354] INFO -- : [408/885] 1352740=test_ossl I, [2024-05-07T14:01:44.506153 #1311354] INFO -- : [409/885] 1352746=test_ruby_lex I, [2024-05-07T14:01:44.596627 #1311354] INFO -- : [410/885] 1352746=test_object I, [2024-05-07T14:01:44.751077 #1311354] INFO -- : [411/885] 1352738=test_date_arith I, [2024-05-07T14:01:44.765898 #1311354] INFO -- : [412/885] 1352738=test_gem_local_remote_options I, [2024-05-07T14:01:44.809826 #1311354] INFO -- : [413/885] 1352738=test_sleep I, [2024-05-07T14:01:44.859185 #1311354] INFO -- : [414/885] 1352752=test_delete I, [2024-05-07T14:01:44.863361 #1311354] INFO -- : [415/885] 1352752=test_win32ole_method I, [2024-05-07T14:01:44.864464 #1311354] INFO -- : [416/885] 1352752=test_fd_setsize I, [2024-05-07T14:01:44.866271 #1311354] INFO -- : [417/885] 1352752=test_continuation I, [2024-05-07T14:01:44.875168 #1311354] INFO -- : [418/885] 1352752=test_class_name_check I, [2024-05-07T14:01:44.896982 #1311354] INFO -- : [419/885] 1352752=test_keyword I, [2024-05-07T14:01:44.978682 #1311354] INFO -- : [420/885] 1352746=test_pkey_rsa I, [2024-05-07T14:01:45.020676 #1311354] INFO -- : [421/885] 1352751=test_gem_commands_push_command I, [2024-05-07T14:01:45.110896 #1311354] INFO -- : [422/885] 1352739=test_weakkeymap I, [2024-05-07T14:01:45.244716 #1311354] INFO -- : [423/885] 1352746=test_numhash I, [2024-05-07T14:01:45.259207 #1311354] INFO -- : [424/885] 1352746=test_placearg I, [2024-05-07T14:01:45.286121 #1311354] INFO -- : [425/885] 1352739=test_gem_package_task I, [2024-05-07T14:01:45.287454 #1311354] INFO -- : [426/885] 1352739=test_date_strptime I, [2024-05-07T14:01:45.363498 #1311354] INFO -- : [427/885] 1352752=test_rdoc_markup_hard_break I, [2024-05-07T14:01:45.364047 #1311354] INFO -- : [428/885] 1352752=test_gem_platform I, [2024-05-07T14:01:45.393534 #1311354] INFO -- : [429/885] 1352746=test_import I, [2024-05-07T14:01:45.419419 #1311354] INFO -- : [430/885] 1352752=test_not I, [2024-05-07T14:01:45.424984 #1311354] INFO -- : [431/885] 1352752=test_gem_resolver_lock_set I, [2024-05-07T14:01:45.430513 #1311354] INFO -- : [432/885] 1352739=test_rdoc_parser_markdown I, [2024-05-07T14:01:45.435632 #1311354] INFO -- : [433/885] 1352749=test_file_exhaustive I, [2024-05-07T14:01:45.439007 #1311354] INFO -- : [434/885] 1352752=test_gem_update_suggestion I, [2024-05-07T14:01:45.504609 #1311354] INFO -- : [435/885] 1352752=test_files_test I, [2024-05-07T14:01:45.523700 #1311354] INFO -- : [436/885] 1352751=test_logger I, [2024-05-07T14:01:45.537705 #1311354] INFO -- : [437/885] 1352751=test_assignment I, [2024-05-07T14:01:45.597062 #1311354] INFO -- : [438/885] 1352739=test_ifunless I, [2024-05-07T14:01:45.603827 #1311354] INFO -- : [439/885] 1352739=test_gem_commands_lock_command I, [2024-05-07T14:01:45.618142 #1311354] INFO -- : [440/885] 1352739=test_numeric I, [2024-05-07T14:01:45.660568 #1311354] INFO -- : [441/885] 1352752=test_common I, [2024-05-07T14:01:45.687301 #1311354] INFO -- : [442/885] 1352739=test_gem_spec_fetcher I, [2024-05-07T14:01:45.852540 #1311354] INFO -- : [443/885] 1352752=test_gem_command I, [2024-05-07T14:01:45.867023 #1311354] INFO -- : [444/885] 1352739=test_bug-3571 I, [2024-05-07T14:01:45.883366 #1311354] INFO -- : [445/885] 1352739=test_key_actor_vi I, [2024-05-07T14:01:45.940156 #1311354] INFO -- : [446/885] 1352752=test_rdoc_markup_to_tt_only I, [2024-05-07T14:01:45.970044 #1311354] INFO -- : [447/885] 1352752=test_hmac I, [2024-05-07T14:01:45.970707 #1311354] INFO -- : [448/885] 1352739=test_rdoc_tom_doc I, [2024-05-07T14:01:45.975617 #1311354] INFO -- : [449/885] 1352752=test_macro I, [2024-05-07T14:01:45.982404 #1311354] INFO -- : [450/885] 1352752=test_pp I, [2024-05-07T14:01:45.990599 #1311354] INFO -- : [451/885] 1352739=test_frozen I, [2024-05-07T14:01:45.993123 #1311354] INFO -- : [452/885] 1352739=test_gem_ext_configure_builder I, [2024-05-07T14:01:46.028763 #1311354] INFO -- : [453/885] 1352739=test_verbose I, [2024-05-07T14:01:46.039479 #1311354] INFO -- : [454/885] 1352752=test_num2int I, [2024-05-07T14:01:46.047703 #1311354] INFO -- : [455/885] 1352739=test_nil I, [2024-05-07T14:01:46.051466 #1311354] INFO -- : [456/885] 1352739=test_rdoc_single_class I, [2024-05-07T14:01:46.055878 #1311354] INFO -- : [457/885] 1352752=test_exception I, [2024-05-07T14:01:46.056611 #1311354] INFO -- : [458/885] 1352739=test_zsh_completion I, [2024-05-07T14:01:46.060556 #1311354] INFO -- : [459/885] 1352739=test_iter_break I, [2024-05-07T14:01:46.065674 #1311354] INFO -- : [460/885] 1352739=test_address_resolve I, [2024-05-07T14:01:46.069934 #1311354] INFO -- : [461/885] 1352752=test_rdoc_token_stream I, [2024-05-07T14:01:46.076751 #1311354] INFO -- : [462/885] 1352739=test_yaml_special_cases I, [2024-05-07T14:01:46.080292 #1311354] INFO -- : [463/885] 1352752=test_optarg I, [2024-05-07T14:01:46.084468 #1311354] INFO -- : [464/885] 1352739=test_gem_source_list I, [2024-05-07T14:01:46.105474 #1311354] INFO -- : [465/885] 1352750=test_config I, [2024-05-07T14:01:46.118707 #1311354] INFO -- : [466/885] 1352739=test_gem_doctor I, [2024-05-07T14:01:46.131325 #1311354] INFO -- : [467/885] 1352750=test_kdf I, [2024-05-07T14:01:46.147526 #1311354] INFO -- : [468/885] 1352752=dispatcher_test I, [2024-05-07T14:01:46.154706 #1311354] INFO -- : [469/885] 1352739=test_eval_history I, [2024-05-07T14:01:46.172440 #1311354] INFO -- : [470/885] 1352752=test_kernel I, [2024-05-07T14:01:46.186118 #1311354] INFO -- : [471/885] 1352750=test_files_ext I, [2024-05-07T14:01:46.193098 #1311354] INFO -- : [472/885] 1352739=test_bug-5832 I, [2024-05-07T14:01:46.205807 #1311354] INFO -- : [473/885] 1352739=test_gem_silent_ui I, [2024-05-07T14:01:46.259231 #1311354] INFO -- : [474/885] 1352739=test_emitter I, [2024-05-07T14:01:46.268293 #1311354] INFO -- : [475/885] 1352739=test_object_create_start I, [2024-05-07T14:01:46.269382 #1311354] INFO -- : [476/885] 1352739=test_at_exit I, [2024-05-07T14:01:46.275921 #1311354] INFO -- : [477/885] 1352742=test_command I, [2024-05-07T14:01:46.287479 #1311354] INFO -- : [478/885] 1352750=test_gem_rdoc I, [2024-05-07T14:01:46.291467 #1311354] INFO -- : [479/885] 1352739=test_date I, [2024-05-07T14:01:46.295367 #1311354] INFO -- : [480/885] 1352739=test_gem_ext_cargo_builder_unit I, [2024-05-07T14:01:46.306741 #1311354] INFO -- : [481/885] 1352739=test_rdoc_markup_paragraph I, [2024-05-07T14:01:46.310620 #1311354] INFO -- : [482/885] 1352739=test_psych I, [2024-05-07T14:01:46.329183 #1311354] INFO -- : [483/885] 1352746=test_enc_raise I, [2024-05-07T14:01:46.331604 #1311354] INFO -- : [484/885] 1352739=!Nothing_to_test I, [2024-05-07T14:01:46.332602 #1311354] INFO -- : [485/885] 1352739=test_date_parse I, [2024-05-07T14:01:46.338407 #1311354] INFO -- : [486/885] 1352746=test_pkey_ec I, [2024-05-07T14:01:46.411050 #1311354] INFO -- : [487/885] 1352750=test_pipe I, [2024-05-07T14:01:46.412229 #1311354] INFO -- : [488/885] 1352746=test_thread I, [2024-05-07T14:01:46.415935 #1311354] INFO -- : [489/885] 1352746=test_trick I, [2024-05-07T14:01:46.481890 #1311354] INFO -- : [490/885] 1352739=test_rdoc_markup_to_rdoc I, [2024-05-07T14:01:46.487572 #1311354] INFO -- : [491/885] 1352748=test_rdoc_rd_inline_parser I, [2024-05-07T14:01:46.503695 #1311354] INFO -- : [492/885] 1352739=test_default_gems I, [2024-05-07T14:01:46.517539 #1311354] INFO -- : [493/885] 1352748=test_null I, [2024-05-07T14:01:46.518664 #1311354] INFO -- : [494/885] 1352748=test_win32ole_type I, [2024-05-07T14:01:46.523998 #1311354] INFO -- : [495/885] 1352748=test_mul I, [2024-05-07T14:01:46.525799 #1311354] INFO -- : [496/885] 1352750=test_rdoc_markup_attributes I, [2024-05-07T14:01:46.529479 #1311354] INFO -- : [497/885] 1352748=test_rdoc_rdoc I, [2024-05-07T14:01:46.533663 #1311354] INFO -- : [498/885] 1352750=test_time I, [2024-05-07T14:01:46.546798 #1311354] INFO -- : [499/885] 1352739=test_windows_1251 I, [2024-05-07T14:01:46.547063 #1311354] INFO -- : [500/885] 1352739=test_buffering I, [2024-05-07T14:01:46.549841 #1311354] INFO -- : [501/885] 1352739=test_svcb_https I, [2024-05-07T14:01:46.569667 #1311354] INFO -- : [502/885] 1352739=test_gb18030 I, [2024-05-07T14:01:46.577028 #1311354] INFO -- : [503/885] 1352739=test_gem_uninstaller I, [2024-05-07T14:01:46.603941 #1311354] INFO -- : [504/885] 1352748=test_rdoc_i18n_text I, [2024-05-07T14:01:46.613188 #1311354] INFO -- : [505/885] 1352748=test_key_name_check I, [2024-05-07T14:01:46.620680 #1311354] INFO -- : [506/885] 1352748=test_backtrace I, [2024-05-07T14:01:46.624344 #1311354] INFO -- : [507/885] 1352748=test_defined I, [2024-05-07T14:01:46.632810 #1311354] INFO -- : [508/885] 1352751=test_io_buffer I, [2024-05-07T14:01:46.642412 #1311354] INFO -- : [509/885] 1352750=test_gem_validator I, [2024-05-07T14:01:46.657886 #1311354] INFO -- : [510/885] 1352750=test_fnmatch I, [2024-05-07T14:01:46.672926 #1311354] INFO -- : [511/885] 1352751=test_files_test_2 I, [2024-05-07T14:01:46.696022 #1311354] INFO -- : [512/885] 1352748=test_folderitem2_invokeverb I, [2024-05-07T14:01:46.706261 #1311354] INFO -- : [513/885] 1352750=test_rdoc_markup_parser I, [2024-05-07T14:01:46.707044 #1311354] INFO -- : [514/885] 1352748=test_require_path_check I, [2024-05-07T14:01:46.720162 #1311354] INFO -- : [515/885] 1352752=test_erb_m17n I, [2024-05-07T14:01:46.732990 #1311354] INFO -- : [516/885] 1352752=test_ole_methods I, [2024-05-07T14:01:46.736225 #1311354] INFO -- : [517/885] 1352752=test_optimization I, [2024-05-07T14:01:46.738908 #1311354] INFO -- : [518/885] 1352750=test_date_conv I, [2024-05-07T14:01:46.748440 #1311354] INFO -- : [519/885] 1352750=test_zlib I, [2024-05-07T14:01:46.765968 #1311354] INFO -- : [520/885] 1352735=test_cgi_tag_helper I, [2024-05-07T14:01:46.784976 #1311354] INFO -- : [521/885] 1352748=test_egrep_cpp I, [2024-05-07T14:01:46.807918 #1311354] INFO -- : [522/885] 1352742=test_gem_resolver_index_set I, [2024-05-07T14:01:46.822070 #1311354] INFO -- : [523/885] 1352735=test_gem_package_old I, [2024-05-07T14:01:46.842676 #1311354] INFO -- : [524/885] 1352742=test_string I, [2024-05-07T14:01:46.874832 #1311354] INFO -- : [525/885] 1352735=test_proc I, [2024-05-07T14:01:46.891290 #1311354] INFO -- : [526/885] 1352748=test_gc_compact I, [2024-05-07T14:01:46.930725 #1311354] INFO -- : [527/885] 1352745=test_custom_command I, [2024-05-07T14:01:47.019655 #1311354] INFO -- : [528/885] 1352745=json_addition_test I, [2024-05-07T14:01:47.037664 #1311354] INFO -- : [529/885] 1352745=test_qsort I, [2024-05-07T14:01:47.043484 #1311354] INFO -- : [530/885] 1352745=test_rdoc_parser I, [2024-05-07T14:01:47.175778 #1311354] INFO -- : [531/885] 1352745=test_gem_dependency_resolution_error I, [2024-05-07T14:01:47.311923 #1311354] INFO -- : [532/885] 1352745=test_string I, [2024-05-07T14:01:47.354236 #1311354] INFO -- : [533/885] 1352745=test_pattern_matching I, [2024-05-07T14:01:47.375281 #1311354] INFO -- : [534/885] 1352745=test_rdoc_stats I, [2024-05-07T14:01:47.411570 #1311354] INFO -- : [535/885] 1352745=test_depth_first I, [2024-05-07T14:01:47.424993 #1311354] INFO -- : [536/885] 1352745=test_gem_request_set_lockfile_parser I, [2024-05-07T14:01:47.511571 #1311354] INFO -- : [537/885] 1352745=test_x509attr I, [2024-05-07T14:01:47.515878 #1311354] INFO -- : [538/885] 1352745=test_raise I, [2024-05-07T14:01:47.521401 #1311354] INFO -- : [539/885] 1352745=test_rdoc_store I, [2024-05-07T14:01:47.614422 #1311354] INFO -- : [540/885] 1352739=test_ractor I, [2024-05-07T14:01:47.702373 #1311354] INFO -- : [541/885] 1352739=test_memory_view I, [2024-05-07T14:01:47.757238 #1311354] INFO -- : [542/885] 1352735=test_m17n_comb I, [2024-05-07T14:01:47.889447 #1311354] INFO -- : [543/885] 1352739=test_json_tree I, [2024-05-07T14:01:47.901566 #1311354] INFO -- : [544/885] 1352739=test_rdoc_markup_to_markdown I, [2024-05-07T14:01:47.943748 #1311354] INFO -- : [545/885] 1352739=test_rdoc_generator_pot_po I, [2024-05-07T14:01:47.946456 #1311354] INFO -- : [546/885] 1352739=test_ansi_with_terminfo I, [2024-05-07T14:01:47.955098 #1311354] INFO -- : [547/885] 1352739=test_reline I, [2024-05-07T14:01:48.134786 #1311354] INFO -- : [548/885] 1352739=test_parser_events I, [2024-05-07T14:01:48.182265 #1311354] INFO -- : [549/885] 1352739=test_pkey I, [2024-05-07T14:01:48.230178 #1311354] INFO -- : [550/885] 1352739=test_case I, [2024-05-07T14:01:48.237518 #1311354] INFO -- : [551/885] 1352739=test_gem_request_connection_pools I, [2024-05-07T14:01:48.252171 #1311354] INFO -- : [552/885] 1352745=test_gem_version_option I, [2024-05-07T14:01:48.306279 #1311354] INFO -- : [553/885] 1352745=test_grapheme_breaks I, [2024-05-07T14:01:48.334325 #1311354] INFO -- : [554/885] 1352745=test_cclass I, [2024-05-07T14:01:48.423304 #1311354] INFO -- : [555/885] 1352745=test_str2big I, [2024-05-07T14:01:48.424083 #1311354] INFO -- : [556/885] 1352745=test_c_struct_builder I, [2024-05-07T14:01:48.484166 #1311354] INFO -- : [557/885] 1352743=test_dot_dot I, [2024-05-07T14:01:48.485506 #1311354] INFO -- : [558/885] 1352743=test_literal I, [2024-05-07T14:01:48.532129 #1311354] INFO -- : [559/885] 1352745=test_socket I, [2024-05-07T14:01:48.580858 #1311354] INFO -- : [560/885] 1352746=test_thread I, [2024-05-07T14:01:48.819615 #1311354] INFO -- : [561/885] 1352746=test_objectspace I, [2024-05-07T14:01:49.235703 #1311354] INFO -- : [562/885] 1352743=test_rdoc_markup_to_table_of_contents I, [2024-05-07T14:01:49.260707 #1311354] INFO -- : [563/885] 1352743=test_require_lib I, [2024-05-07T14:01:49.279265 #1311354] INFO -- : [564/885] 1352739=parse_test I, [2024-05-07T14:01:49.534226 #1311354] INFO -- : [565/885] 1352741=test_gem_install_update_options I, [2024-05-07T14:01:49.675356 #1311354] INFO -- : [566/885] 1352741=test_severity I, [2024-05-07T14:01:49.684739 #1311354] INFO -- : [567/885] 1352741=test_ractor I, [2024-05-07T14:01:49.706506 #1311354] INFO -- : [568/885] 1352741=test_gem_stream_ui I, [2024-05-07T14:01:49.706880 #1311354] INFO -- : [569/885] 1352745=test_extlibs I, [2024-05-07T14:01:49.716289 #1311354] INFO -- : [570/885] 1352746=test_rdoc_generator_ri I, [2024-05-07T14:01:49.725861 #1311354] INFO -- : [571/885] 1352746=test_exception I, [2024-05-07T14:01:49.787195 #1311354] INFO -- : [572/885] 1352748=test_rand I, [2024-05-07T14:01:49.793814 #1311354] INFO -- : [573/885] 1352741=test_gem_name_tuple I, [2024-05-07T14:01:49.810831 #1311354] INFO -- : [574/885] 1352738=test_gem_package_tar_reader_entry I, [2024-05-07T14:01:49.812444 #1311354] INFO -- : [575/885] 1352741=test_bug_reporter I, [2024-05-07T14:01:49.940806 #1311354] INFO -- : [576/885] 1352750=test_scalar I, [2024-05-07T14:01:49.959604 #1311354] INFO -- : [577/885] 1352750=test_gem_dependency_installer I, [2024-05-07T14:01:50.034250 #1311354] INFO -- : [578/885] 1352738=test_gem_commands_info_command I, [2024-05-07T14:01:50.063446 #1311354] INFO -- : [579/885] 1352738=test_rdoc_cross_reference I, [2024-05-07T14:01:50.173955 #1311354] INFO -- : [580/885] 1352741=test_store I, [2024-05-07T14:01:50.187477 #1311354] INFO -- : [581/885] 1352748=test_case_options I, [2024-05-07T14:01:50.191967 #1311354] INFO -- : [582/885] 1352748=test_scan_args I, [2024-05-07T14:01:50.201948 #1311354] INFO -- : [583/885] 1352748=test_win32ole I, [2024-05-07T14:01:50.207180 #1311354] INFO -- : [584/885] 1352748=test_generic I, [2024-05-07T14:01:50.251444 #1311354] INFO -- : [585/885] 1352748=test_gem_text I, [2024-05-07T14:01:50.304386 #1311354] INFO -- : [586/885] 1352748=test_settracefunc I, [2024-05-07T14:01:50.319327 #1311354] INFO -- : [587/885] 1352741=test_enumerator_kw I, [2024-05-07T14:01:50.321989 #1311354] INFO -- : [588/885] 1352751=test_gem_commands_mirror I, [2024-05-07T14:01:50.322051 #1311354] INFO -- : [589/885] 1352741=test_gem_ext_cargo_builder_link_flag_converter I, [2024-05-07T14:01:50.331645 #1311354] INFO -- : [590/885] 1352751=test_sprintf_comb I, [2024-05-07T14:01:50.376621 #1311354] INFO -- : [591/885] 1352741=test_gem_request I, [2024-05-07T14:01:50.572958 #1311354] INFO -- : [592/885] 1352751=test_method_cache I, [2024-05-07T14:01:50.585195 #1311354] INFO -- : [593/885] 1352751=test_safe_load I, [2024-05-07T14:01:50.590462 #1311354] INFO -- : [594/885] 1352741=test_gem_resolver_composed_set I, [2024-05-07T14:01:50.597923 #1311354] INFO -- : [595/885] 1352751=test_gem_resolver I, [2024-05-07T14:01:50.601094 #1311354] INFO -- : [596/885] 1352738=test_gem_commands_dependency_command I, [2024-05-07T14:01:50.607075 #1311354] INFO -- : [597/885] 1352741=test_rdoc_markup_attribute_manager I, [2024-05-07T14:01:50.631891 #1311354] INFO -- : [598/885] 1352741=test_name_error I, [2024-05-07T14:01:50.686348 #1311354] INFO -- : [599/885] 1352738=test_enumerator I, [2024-05-07T14:01:50.693229 #1311354] INFO -- : [600/885] 1352749=test_inadvertent_creation I, [2024-05-07T14:01:50.718454 #1311354] INFO -- : [601/885] 1352741=test_flags I, [2024-05-07T14:01:50.775695 #1311354] INFO -- : [602/885] 1352733=test_shift_jis I, [2024-05-07T14:01:50.778967 #1311354] INFO -- : [603/885] 1352733=test_gem_commands_which_command I, [2024-05-07T14:01:50.805101 #1311354] INFO -- : [604/885] 1352747=test_http I, [2024-05-07T14:01:50.832684 #1311354] INFO -- : [605/885] 1352733=test_gem_commands_specification_command I, [2024-05-07T14:01:50.839582 #1311354] INFO -- : [606/885] 1352749=test_rdoc_text I, [2024-05-07T14:01:50.841605 #1311354] INFO -- : [607/885] 1352747=test_iso_8859 I, [2024-05-07T14:01:50.856141 #1311354] INFO -- : [608/885] 1352740=test_tcp I, [2024-05-07T14:01:50.872702 #1311354] INFO -- : [609/885] 1352747=test_data I, [2024-05-07T14:01:50.889447 #1311354] INFO -- : [610/885] 1352749=index_write_test I, [2024-05-07T14:01:50.899153 #1311354] INFO -- : [611/885] 1352747=test_date_new I, [2024-05-07T14:01:50.914817 #1311354] INFO -- : [612/885] 1352747=test_date_time I, [2024-05-07T14:01:50.919713 #1311354] INFO -- : [613/885] 1352747=test_rdoc_markup_to_joined_paragraph I, [2024-05-07T14:01:50.927298 #1311354] INFO -- : [614/885] 1352747=test_require I, [2024-05-07T14:01:50.928530 #1311354] INFO -- : [615/885] 1352751=test_gem_safe_yaml I, [2024-05-07T14:01:50.928579 #1311354] INFO -- : [616/885] 1352747=test_syntax I, [2024-05-07T14:01:50.946750 #1311354] INFO -- : [617/885] 1352751=test_rdoc_parser_ruby I, [2024-05-07T14:01:50.962081 #1311354] INFO -- : [618/885] 1352749=test_open-uri I, [2024-05-07T14:01:51.019167 #1311354] INFO -- : [619/885] 1352733=test_httpresponse I, [2024-05-07T14:01:51.119731 #1311354] INFO -- : [620/885] 1352733=test_stream I, [2024-05-07T14:01:51.128172 #1311354] INFO -- : [621/885] 1352733=test_nil2vtempty I, [2024-05-07T14:01:51.132081 #1311354] INFO -- : [622/885] 1352733=test_rdoc_context I, [2024-05-07T14:01:51.140010 #1311354] INFO -- : [623/885] 1352740=test_hash_create I, [2024-05-07T14:01:51.143927 #1311354] INFO -- : [624/885] 1352740=test_stringchar I, [2024-05-07T14:01:51.206755 #1311354] INFO -- : [625/885] 1352740=test_uncorrectable_name_check I, [2024-05-07T14:01:51.220359 #1311354] INFO -- : [626/885] 1352740=newline_test I, [2024-05-07T14:01:51.295213 #1311354] INFO -- : [627/885] 1352740=test_thread_fd_close I, [2024-05-07T14:01:51.298498 #1311354] INFO -- : [628/885] 1352740=test_passing_block I, [2024-05-07T14:01:51.302957 #1311354] INFO -- : [629/885] 1352740=test_rdoc_markdown_test I, [2024-05-07T14:01:51.368296 #1311354] INFO -- : [630/885] 1352748=test_c_union_entity I, [2024-05-07T14:01:51.436764 #1311354] INFO -- : [631/885] 1352748=test_rdoc_normal_module I, [2024-05-07T14:01:51.474470 #1311354] INFO -- : [632/885] 1352735=test_logperiod I, [2024-05-07T14:01:51.484664 #1311354] INFO -- : [633/885] 1352748=test_securerandom I, [2024-05-07T14:01:51.487343 #1311354] INFO -- : [634/885] 1352735=test_switch_hitter I, [2024-05-07T14:01:51.490578 #1311354] INFO -- : [635/885] 1352751=test_io_console I, [2024-05-07T14:01:51.506459 #1311354] INFO -- : [636/885] 1352735=test_flush I, [2024-05-07T14:01:51.511533 #1311354] INFO -- : [637/885] 1352745=test_singleton I, [2024-05-07T14:01:51.513942 #1311354] INFO -- : [638/885] 1352735=test_logdevice I, [2024-05-07T14:01:51.521241 #1311354] INFO -- : [639/885] 1352745=test_gem_ext_rake_builder I, [2024-05-07T14:01:51.540775 #1311354] INFO -- : [640/885] 1352748=test_arity I, [2024-05-07T14:01:51.553051 #1311354] INFO -- : [641/885] 1352748=test_gc I, [2024-05-07T14:01:51.852685 #1311354] INFO -- : [642/885] 1352741=test_x509cert I, [2024-05-07T14:01:51.982655 #1311354] INFO -- : [643/885] 1352749=test_err_in_callback I, [2024-05-07T14:01:51.982819 #1311354] INFO -- : [644/885] 1352749=test_gem_resolver_lock_specification I, [2024-05-07T14:01:52.044581 #1311354] INFO -- : [645/885] 1352749=test_pack I, [2024-05-07T14:01:52.098923 #1311354] INFO -- : [646/885] 1352746=test_process I, [2024-05-07T14:01:52.124255 #1311354] INFO -- : [647/885] 1352741=test_last_thread I, [2024-05-07T14:01:52.159195 #1311354] INFO -- : [648/885] 1352733=test_gem_source_local I, [2024-05-07T14:01:52.255970 #1311354] INFO -- : [649/885] 1352749=test_gem_security_policy I, [2024-05-07T14:01:52.274232 #1311354] INFO -- : [650/885] 1352745=test_string_processing I, [2024-05-07T14:01:52.282256 #1311354] INFO -- : [651/885] 1352745=test_fileutils I, [2024-05-07T14:01:52.313188 #1311354] INFO -- : [652/885] 1352734=test_ldap I, [2024-05-07T14:01:52.329758 #1311354] INFO -- : [653/885] 1352734=test_gem_commands_signin_command I, [2024-05-07T14:01:52.402812 #1311354] INFO -- : [654/885] 1352735=test_resource I, [2024-05-07T14:01:52.411449 #1311354] INFO -- : [655/885] 1352735=test_emitter I, [2024-05-07T14:01:52.417414 #1311354] INFO -- : [656/885] 1352734=test_gem_version I, [2024-05-07T14:01:52.421608 #1311354] INFO -- : [657/885] 1352735=test_cesu8 I, [2024-05-07T14:01:52.424770 #1311354] INFO -- : [658/885] 1352735=test_econv I, [2024-05-07T14:01:52.428927 #1311354] INFO -- : [659/885] 1352740=test_rdoc_options I, [2024-05-07T14:01:52.471786 #1311354] INFO -- : [660/885] 1352733=test_too_many_dummy_encodings I, [2024-05-07T14:01:52.486132 #1311354] INFO -- : [661/885] 1352734=test_reqarg I, [2024-05-07T14:01:52.501073 #1311354] INFO -- : [662/885] 1352750=test_rdoc_include I, [2024-05-07T14:01:52.517638 #1311354] INFO -- : [663/885] 1352749=test_stack I, [2024-05-07T14:01:52.533767 #1311354] INFO -- : [664/885] 1352733=test_gem_commands_list_command I, [2024-05-07T14:01:52.545132 #1311354] INFO -- : [665/885] 1352750=test_scanner_events I, [2024-05-07T14:01:52.546743 #1311354] INFO -- : [666/885] 1352733=test_gem_resolver_installed_specification I, [2024-05-07T14:01:52.562745 #1311354] INFO -- : [667/885] 1352733=test_parse I, [2024-05-07T14:01:52.584257 #1311354] INFO -- : [668/885] 1352750=test_mdns I, [2024-05-07T14:01:52.600382 #1311354] INFO -- : [669/885] 1352750=test_gem_remote_fetcher I, [2024-05-07T14:01:52.630756 #1311354] INFO -- : [670/885] 1352739=test_rdoc_markup_verbatim I, [2024-05-07T14:01:52.633156 #1311354] INFO -- : [671/885] 1352739=test_inlinecache I, [2024-05-07T14:01:52.662122 #1311354] INFO -- : [672/885] 1352745=test_path_to_class I, [2024-05-07T14:01:52.665569 #1311354] INFO -- : [673/885] 1352745=test_gem_dependency I, [2024-05-07T14:01:52.694642 #1311354] INFO -- : [674/885] 1352740=test_gem_resolver_specification I, [2024-05-07T14:01:52.713301 #1311354] INFO -- : [675/885] 1352739=test_gem_stub_specification I, [2024-05-07T14:01:52.725942 #1311354] INFO -- : [676/885] 1352740=test_method_cache I, [2024-05-07T14:01:52.726940 #1311354] INFO -- : [677/885] 1352740=test_frozen_error I, [2024-05-07T14:01:52.729769 #1311354] INFO -- : [678/885] 1352740=test_gem_ext_ext_conf_builder I, [2024-05-07T14:01:52.799152 #1311354] INFO -- : [679/885] 1352745=test_complex I, [2024-05-07T14:01:52.888445 #1311354] INFO -- : [680/885] 1352734=test_gem_commands_search_command I, [2024-05-07T14:01:52.890057 #1311354] INFO -- : [681/885] 1352739=test_irb I, [2024-05-07T14:01:52.894490 #1311354] INFO -- : [682/885] 1352743=test_load I, [2024-05-07T14:01:52.897414 #1311354] INFO -- : [683/885] 1352734=json_string_matching_test I, [2024-05-07T14:01:52.900919 #1311354] INFO -- : [684/885] 1352734=test_const I, [2024-05-07T14:01:52.901477 #1311354] INFO -- : [685/885] 1352743=test_rdoc_normal_class I, [2024-05-07T14:01:52.905294 #1311354] INFO -- : [686/885] 1352734=test_class I, [2024-05-07T14:01:52.930937 #1311354] INFO -- : [687/885] 1352745=test_asn1 I, [2024-05-07T14:01:52.964167 #1311354] INFO -- : [688/885] 1352745=test_random I, [2024-05-07T14:01:52.978759 #1311354] INFO -- : [689/885] 1352745=test_yamlstore I, [2024-05-07T14:01:52.989774 #1311354] INFO -- : [690/885] 1352745=test_gem_installer I, [2024-05-07T14:01:53.007153 #1311354] INFO -- : [691/885] 1352743=test_rdoc_parser_rd I, [2024-05-07T14:01:53.032007 #1311354] INFO -- : [692/885] 1352743=test_date_strftime I, [2024-05-07T14:01:53.152905 #1311354] INFO -- : [693/885] 1352733=test_internal_ivar I, [2024-05-07T14:01:53.156732 #1311354] INFO -- : [694/885] 1352733=test_gem_resolver_index_specification I, [2024-05-07T14:01:53.192103 #1311354] INFO -- : [695/885] 1352739=test_duplicate I, [2024-05-07T14:01:53.200684 #1311354] INFO -- : [696/885] 1352739=test_basicsocket I, [2024-05-07T14:01:53.205943 #1311354] INFO -- : [697/885] 1352733=test_utf32 I, [2024-05-07T14:01:53.208759 #1311354] INFO -- : [698/885] 1352739=test_tracepoint I, [2024-05-07T14:01:53.217147 #1311354] INFO -- : [699/885] 1352733=test_prettyprint I, [2024-05-07T14:01:53.219365 #1311354] INFO -- : [700/885] 1352741=test_gem_commands_help_command I, [2024-05-07T14:01:53.273400 #1311354] INFO -- : [701/885] 1352733=test_rdoc_markup I, [2024-05-07T14:01:53.280489 #1311354] INFO -- : [702/885] 1352733=test_tempfile I, [2024-05-07T14:01:53.318357 #1311354] INFO -- : [703/885] 1352741=test_noarg I, [2024-05-07T14:01:53.376356 #1311354] INFO -- : [704/885] 1352752=parse_comments_test I, [2024-05-07T14:01:53.381657 #1311354] INFO -- : [705/885] 1352752=test_queue I, [2024-05-07T14:01:53.401541 #1311354] INFO -- : [706/885] 1352752=test_function I, [2024-05-07T14:01:53.455111 #1311354] INFO -- : [707/885] 1352739=test_ractor I, [2024-05-07T14:01:53.506789 #1311354] INFO -- : [708/885] 1352735=test_find I, [2024-05-07T14:01:53.523500 #1311354] INFO -- : [709/885] 1352735=test_fiddle I, [2024-05-07T14:01:53.533617 #1311354] INFO -- : [710/885] 1352741=test_wss I, [2024-05-07T14:01:53.540898 #1311354] INFO -- : [711/885] 1352741=test_gem_commands_contents_command I, [2024-05-07T14:01:53.545619 #1311354] INFO -- : [712/885] 1352743=test_gem_ext_cmake_builder I, [2024-05-07T14:01:53.559694 #1311354] INFO -- : [713/885] 1352733=test_require I, [2024-05-07T14:01:53.563211 #1311354] INFO -- : [714/885] 1352743=test_cgi_util I, [2024-05-07T14:01:53.572033 #1311354] INFO -- : [715/885] 1352739=test_marshalable I, [2024-05-07T14:01:53.576693 #1311354] INFO -- : [716/885] 1352739=test_digest I, [2024-05-07T14:01:53.595285 #1311354] INFO -- : [717/885] 1352749=test_recorder I, [2024-05-07T14:01:53.597996 #1311354] INFO -- : [718/885] 1352749=test_gem_commands_owner_command I, [2024-05-07T14:01:53.603405 #1311354] INFO -- : [719/885] 1352735=test_gem_source_vendor I, [2024-05-07T14:01:53.612068 #1311354] INFO -- : [720/885] 1352735=test_rdoc_constant I, [2024-05-07T14:01:53.646699 #1311354] INFO -- : [721/885] 1352741=test_deprecate I, [2024-05-07T14:01:53.647034 #1311354] INFO -- : [722/885] 1352752=test_formatter I, [2024-05-07T14:01:53.660448 #1311354] INFO -- : [723/885] 1352752=test_bash_completion I, [2024-05-07T14:01:53.667082 #1311354] INFO -- : [724/885] 1352752=test_modify_expand I, [2024-05-07T14:01:53.675106 #1311354] INFO -- : [725/885] 1352752=test_rdoc_any_method I, [2024-05-07T14:01:53.687730 #1311354] INFO -- : [726/885] 1352741=test_gem_available_set I, [2024-05-07T14:01:53.740679 #1311354] INFO -- : [727/885] 1352735=test_rdoc_markdown I, [2024-05-07T14:01:53.768968 #1311354] INFO -- : [728/885] 1352741=test_file I, [2024-05-07T14:01:53.777480 #1311354] INFO -- : [729/885] 1352741=test_gem_package_tar_reader I, [2024-05-07T14:01:53.812181 #1311354] INFO -- : [730/885] 1352741=regexp_test I, [2024-05-07T14:01:53.821808 #1311354] INFO -- : [731/885] 1352741=test_rdoc_encoding I, [2024-05-07T14:01:53.832859 #1311354] INFO -- : [732/885] 1352743=test_coverage I, [2024-05-07T14:01:53.860277 #1311354] INFO -- : [733/885] 1352741=test_pathname I, [2024-05-07T14:01:53.986377 #1311354] INFO -- : [734/885] 1352735=test_complexrational I, [2024-05-07T14:01:53.996351 #1311354] INFO -- : [735/885] 1352735=test_init I, [2024-05-07T14:01:54.020700 #1311354] INFO -- : [736/885] 1352752=test_ractor I, [2024-05-07T14:01:54.033589 #1311354] INFO -- : [737/885] 1352752=test_euc_tw I, [2024-05-07T14:01:54.035070 #1311354] INFO -- : [738/885] 1352740=test_bmethod I, [2024-05-07T14:01:54.041319 #1311354] INFO -- : [739/885] 1352752=test_gem_commands_sources_command I, [2024-05-07T14:01:54.055744 #1311354] INFO -- : [740/885] 1352740=test_ansi_without_terminfo I, [2024-05-07T14:01:54.064447 #1311354] INFO -- : [741/885] 1352741=test_thread_queue I, [2024-05-07T14:01:54.068738 #1311354] INFO -- : [742/885] 1352740=test_nowrite I, [2024-05-07T14:01:54.090465 #1311354] INFO -- : [743/885] 1352740=test_rdoc_markup_formatter I, [2024-05-07T14:01:54.103763 #1311354] INFO -- : [744/885] 1352740=test_forwardable I, [2024-05-07T14:01:54.126441 #1311354] INFO -- : [745/885] 1352740=test_yaml I, [2024-05-07T14:01:54.155798 #1311354] INFO -- : [746/885] 1352749=test_handle I, [2024-05-07T14:01:54.189960 #1311354] INFO -- : [747/885] 1352751=test_wait I, [2024-05-07T14:01:54.202468 #1311354] INFO -- : [748/885] 1352752=test_big2str I, [2024-05-07T14:01:54.205023 #1311354] INFO -- : [749/885] 1352752=test_cstr I, [2024-05-07T14:01:54.253188 #1311354] INFO -- : [750/885] 1352751=test_pstore I, [2024-05-07T14:01:54.261411 #1311354] INFO -- : [751/885] 1352740=test_profile_frames I, [2024-05-07T14:01:54.297484 #1311354] INFO -- : [752/885] 1352751=test_class2name I, [2024-05-07T14:01:54.303087 #1311354] INFO -- : [753/885] 1352751=test_gbk I, [2024-05-07T14:01:54.308268 #1311354] INFO -- : [754/885] 1352751=test_enc_str_buf_cat I, [2024-05-07T14:01:54.312462 #1311354] INFO -- : [755/885] 1352751=test_comparable I, [2024-05-07T14:01:54.322030 #1311354] INFO -- : [756/885] 1352751=test_rdoc_parser_c I, [2024-05-07T14:01:54.426714 #1311354] INFO -- : [757/885] 1352735=test_io_timeout I, [2024-05-07T14:01:54.427040 #1311354] INFO -- : [758/885] 1352739=json_fixtures_test I, [2024-05-07T14:01:54.430379 #1311354] INFO -- : [759/885] 1352735=test_shapes I, [2024-05-07T14:01:54.432626 #1311354] INFO -- : [760/885] 1352749=test_rdoc_require I, [2024-05-07T14:01:54.433675 #1311354] INFO -- : [761/885] 1352735=locals_test I, [2024-05-07T14:01:54.436436 #1311354] INFO -- : [762/885] 1352740=test_readpartial I, [2024-05-07T14:01:54.448368 #1311354] INFO -- : [763/885] 1352749=test_clone I, [2024-05-07T14:01:54.451395 #1311354] INFO -- : [764/885] 1352739=test_gem_commands_install_command I, [2024-05-07T14:01:54.619583 #1311354] INFO -- : [765/885] 1352751=test_gem_resolver_conflict I, [2024-05-07T14:01:54.633202 #1311354] INFO -- : [766/885] 1352751=test_rdoc_task I, [2024-05-07T14:01:54.634921 #1311354] INFO -- : [767/885] 1352749=test_io_buffer I, [2024-05-07T14:01:54.638684 #1311354] INFO -- : [768/885] 1352751=test_pack I, [2024-05-07T14:01:54.673896 #1311354] INFO -- : [769/885] 1352751=test_backtrace I, [2024-05-07T14:01:54.678588 #1311354] INFO -- : [770/885] 1352743=ruby_parser_test I, [2024-05-07T14:01:54.684455 #1311354] INFO -- : [771/885] 1352743=test_rdoc_markup_indented_paragraph I, [2024-05-07T14:01:54.718428 #1311354] INFO -- : [772/885] 1352743=test_stringscanner I, [2024-05-07T14:01:54.743679 #1311354] INFO -- : [773/885] 1352749=test_files_sample I, [2024-05-07T14:01:54.755370 #1311354] INFO -- : [774/885] 1352743=test_rdoc_alias I, [2024-05-07T14:01:54.775481 #1311354] INFO -- : [775/885] 1352743=test_yield I, [2024-05-07T14:01:54.795894 #1311354] INFO -- : [776/885] 1352735=parser_test I, [2024-05-07T14:01:54.796281 #1311354] INFO -- : [777/885] 1352735=test_convertible I, [2024-05-07T14:01:54.820033 #1311354] INFO -- : [778/885] 1352733=test_array I, [2024-05-07T14:01:54.839880 #1311354] INFO -- : [779/885] 1352733=test_optparse I, [2024-05-07T14:01:54.846497 #1311354] INFO -- : [780/885] 1352740=test_fstring I, [2024-05-07T14:01:54.860399 #1311354] INFO -- : [781/885] 1352749=test_rdoc_markup_to_html_crossref I, [2024-05-07T14:01:54.911743 #1311354] INFO -- : [782/885] 1352733=test_typeddata I, [2024-05-07T14:01:54.962042 #1311354] INFO -- : [783/885] 1352740=encoding_test I, [2024-05-07T14:01:54.991986 #1311354] INFO -- : [784/885] 1352750=test_gem_resolver_best_set I, [2024-05-07T14:01:55.023586 #1311354] INFO -- : [785/885] 1352740=test_rat I, [2024-05-07T14:01:55.036953 #1311354] INFO -- : [786/885] 1352740=test_rdoc_markup_raw I, [2024-05-07T14:01:55.040720 #1311354] INFO -- : [787/885] 1352740=test_webauthn_poller I, [2024-05-07T14:01:55.068516 #1311354] INFO -- : [788/885] 1352750=test_protocol I, [2024-05-07T14:01:55.138139 #1311354] INFO -- : [789/885] 1352733=test_getopts I, [2024-05-07T14:01:55.144561 #1311354] INFO -- : [790/885] 1352733=test_gem_resolver_activation_request I, [2024-05-07T14:01:55.160250 #1311354] INFO -- : [791/885] 1352733=test_gem_config_file I, [2024-05-07T14:01:55.196406 #1311354] INFO -- : [792/885] 1352740=test_ripper I, [2024-05-07T14:01:55.210570 #1311354] INFO -- : [793/885] 1352749=test_etc I, [2024-05-07T14:01:55.241472 #1311354] INFO -- : [794/885] 1352752=test_yjit_exit_locations I, [2024-05-07T14:01:55.244345 #1311354] INFO -- : [795/885] 1352752=test_system I, [2024-05-07T14:01:55.278740 #1311354] INFO -- : [796/885] 1352733=test_pkcs12 I, [2024-05-07T14:01:55.289444 #1311354] INFO -- : [797/885] 1352749=test_gem_package_tar_header I, [2024-05-07T14:01:55.331604 #1311354] INFO -- : [798/885] 1352749=test_iseq_load I, [2024-05-07T14:01:55.349077 #1311354] INFO -- : [799/885] 1352734=test_gem_util I, [2024-05-07T14:01:55.386835 #1311354] INFO -- : [800/885] 1352750=test_bigzero I, [2024-05-07T14:01:55.388948 #1311354] INFO -- : [801/885] 1352750=test_pkey_dh I, [2024-05-07T14:01:55.506604 #1311354] INFO -- : [802/885] 1352750=test_io I, [2024-05-07T14:01:55.547118 #1311354] INFO -- : [803/885] 1352734=test_unicode_escape I, [2024-05-07T14:01:55.630173 #1311354] INFO -- : [804/885] 1352734=test_autoload I, [2024-05-07T14:01:55.636395 #1311354] INFO -- : [805/885] 1352740=test_utf16 I, [2024-05-07T14:01:55.650753 #1311354] INFO -- : [806/885] 1352740=test_rendering I, [2024-05-07T14:01:55.653636 #1311354] INFO -- : [807/885] 1352733=test_case I, [2024-05-07T14:01:55.654868 #1311354] INFO -- : [808/885] 1352740=test_sizeof I, [2024-05-07T14:01:55.684443 #1311354] INFO -- : [809/885] 1352733=test_face I, [2024-05-07T14:01:55.708213 #1311354] INFO -- : [810/885] 1352733=test_yaml_tree I, [2024-05-07T14:01:55.736344 #1311354] INFO -- : [811/885] 1352733=test_sleep I, [2024-05-07T14:01:55.974025 #1311354] INFO -- : [812/885] 1352739=test_config I, [2024-05-07T14:01:56.021844 #1311354] INFO -- : [813/885] 1352751=test_libs I, [2024-05-07T14:01:56.031974 #1311354] INFO -- : [814/885] 1352751=test_gc I, [2024-05-07T14:01:56.032732 #1311354] INFO -- : [815/885] 1352739=test_math I, [2024-05-07T14:01:56.038740 #1311354] INFO -- : [816/885] 1352751=test_gem_commands_fetch_command I, [2024-05-07T14:01:56.045077 #1311354] INFO -- : [817/885] 1352739=test_win32ole_type_event I, [2024-05-07T14:01:56.052681 #1311354] INFO -- : [818/885] 1352739=test_emoji I, [2024-05-07T14:01:56.079603 #1311354] INFO -- : [819/885] 1352739=test_sorted_set I, [2024-05-07T14:01:56.162390 #1311354] INFO -- : [820/885] 1352751=test_ubf_async_safe I, [2024-05-07T14:01:56.170419 #1311354] INFO -- : [821/885] 1352751=test_hash I, [2024-05-07T14:01:56.206271 #1311354] INFO -- : [822/885] 1352752=test_io I, [2024-05-07T14:01:56.272381 #1311354] INFO -- : [823/885] 1352749=test_cp949 I, [2024-05-07T14:01:56.275066 #1311354] INFO -- : [824/885] 1352749=test_foreach I, [2024-05-07T14:01:56.278098 #1311354] INFO -- : [825/885] 1352749=test_gem_source_specific_file I, [2024-05-07T14:01:56.298350 #1311354] INFO -- : [826/885] 1352739=test_condition I, [2024-05-07T14:01:56.304302 #1311354] INFO -- : [827/885] 1352739=test_gem_commands_uninstall_command I, [2024-05-07T14:01:56.354980 #1311354] INFO -- : [828/885] 1352749=test_gem_unsatisfiable_dependency_error I, [2024-05-07T14:01:56.360216 #1311354] INFO -- : [829/885] 1352749=test_win32ole_record I, [2024-05-07T14:01:56.367924 #1311354] INFO -- : [830/885] 1352749=test_type_completor I, [2024-05-07T14:01:56.368921 #1311354] INFO -- : [831/885] 1352749=test_console_attr I, [2024-05-07T14:01:56.376901 #1311354] INFO -- : [832/885] 1352749=test_summary I, [2024-05-07T14:01:56.456100 #1311354] INFO -- : [833/885] 1352752=test_ellipsize I, [2024-05-07T14:01:56.473687 #1311354] INFO -- : [834/885] 1352752=test_date_attr I, [2024-05-07T14:01:56.474434 #1311354] INFO -- : [835/885] 1352752=test_gem_commands_exec_command I, [2024-05-07T14:01:56.499736 #1311354] INFO -- : [836/885] 1352749=test_io_wait I, [2024-05-07T14:01:56.829692 #1311354] INFO -- : [837/885] 1352749=test_kwargs I, [2024-05-07T14:01:56.840742 #1311354] INFO -- : [838/885] 1352749=warnings_test I, [2024-05-07T14:01:56.846810 #1311354] INFO -- : [839/885] 1352749=test_ftp I, [2024-05-07T14:01:56.855992 #1311354] INFO -- : [840/885] 1352749=test_rdoc_context_section I, [2024-05-07T14:01:56.862482 #1311354] INFO -- : [841/885] 1352749=test_euc_kr I, [2024-05-07T14:01:56.873845 #1311354] INFO -- : [842/885] 1352749=test_method I, [2024-05-07T14:01:57.114608 #1311354] INFO -- : [843/885] 1352743=test_gem_commands_query_command I, [2024-05-07T14:01:57.130106 #1311354] INFO -- : [844/885] 1352739=test_rdoc_rubygems_hook I, [2024-05-07T14:01:57.221516 #1311354] INFO -- : [845/885] 1352737=test_to_ruby I, [2024-05-07T14:01:57.224099 #1311354] INFO -- : [846/885] 1352739=test_pattern_key_name_check I, [2024-05-07T14:01:57.237492 #1311354] INFO -- : [847/885] 1352739=test_gem_impossible_dependencies_error I, [2024-05-07T14:01:57.241306 #1311354] INFO -- : [848/885] 1352739=test_array_create I, [2024-05-07T14:01:57.245302 #1311354] INFO -- : [849/885] 1352739=test_pack I, [2024-05-07T14:01:57.258755 #1311354] INFO -- : [850/885] 1352737=test_show_source I, [2024-05-07T14:01:57.298980 #1311354] INFO -- : [851/885] 1352737=test_set I, [2024-05-07T14:01:57.307986 #1311354] INFO -- : [852/885] 1352737=test_gem_commands_stale_command I, [2024-05-07T14:01:57.320879 #1311354] INFO -- : [853/885] 1352737=test_lock_native_thread I, [2024-05-07T14:01:57.426123 #1311354] INFO -- : [854/885] 1352739=test_c_struct_entry I, [2024-05-07T14:01:57.530717 #1311354] INFO -- : [855/885] 1352747=test_have_library I, [2024-05-07T14:01:57.594235 #1311354] INFO -- : [856/885] 1352737=test_remote_fetch_error I, [2024-05-07T14:01:57.609731 #1311354] INFO -- : [857/885] 1352737=test_line_editor I, [2024-05-07T14:01:57.611665 #1311354] INFO -- : [858/885] 1352743=test_objspace I, [2024-05-07T14:01:57.615323 #1311354] INFO -- : [859/885] 1352737=ripper_test I, [2024-05-07T14:01:57.663854 #1311354] INFO -- : [860/885] 1352752=test_undef I, [2024-05-07T14:01:57.671583 #1311354] INFO -- : [861/885] 1352752=test_string_memory I, [2024-05-07T14:01:57.722252 #1311354] INFO -- : [862/885] 1352745=test_sprintf I, [2024-05-07T14:01:57.766757 #1311354] INFO -- : [863/885] 1352739=test_gem_requirement I, [2024-05-07T14:01:57.778511 #1311354] INFO -- : [864/885] 1352733=comments_test I, [2024-05-07T14:01:57.839359 #1311354] INFO -- : [865/885] 1352752=test_gem_security_trust_dir I, [2024-05-07T14:01:57.876995 #1311354] INFO -- : [866/885] 1352752=test_ws I, [2024-05-07T14:01:57.899744 #1311354] INFO -- : [867/885] 1352752=test_m17n I, [2024-05-07T14:01:57.930209 #1311354] INFO -- : [868/885] 1352739=test_gem_commands_environment_command I, [2024-05-07T14:01:57.933062 #1311354] INFO -- : [869/885] 1352733=test_weakmap I, [2024-05-07T14:01:57.948945 #1311354] INFO -- : [870/885] 1352752=test_workspace I, [2024-05-07T14:01:58.013640 #1311354] INFO -- : [871/885] 1352737=test_yjit I, [2024-05-07T14:01:58.014250 #1311354] INFO -- : [872/885] 1352739=test_ns_spki I, [2024-05-07T14:01:58.017948 #1311354] INFO -- : [873/885] 1352745=test_framework I, [2024-05-07T14:01:58.023241 #1311354] INFO -- : [874/885] 1352737=test_kill_ring I, [2024-05-07T14:01:58.032658 #1311354] INFO -- : [875/885] 1352737=test_argf I, [2024-05-07T14:01:58.042546 #1311354] INFO -- : [876/885] 1352739=test_raise_exception I, [2024-05-07T14:01:58.060279 #1311354] INFO -- : [877/885] 1352745=test_gem_request_set_lockfile I, [2024-05-07T14:01:58.180299 #1311354] INFO -- : [878/885] 1352752=test_win32ole_typelib I, [2024-05-07T14:01:58.180411 #1311354] INFO -- : [879/885] 1352752=test_protect I, [2024-05-07T14:01:58.189087 #1311354] INFO -- : [880/885] 1352752=test_hash I, [2024-05-07T14:01:58.221932 #1311354] INFO -- : [881/885] 1352752=test_tree_builder I, [2024-05-07T14:01:58.227673 #1311354] INFO -- : [882/885] 1352752=test_gem_resolver_dependency_request I, [2024-05-07T14:01:58.250204 #1311354] INFO -- : [883/885] 1352752=test_external_new I, [2024-05-07T14:01:58.257360 #1311354] INFO -- : [884/885] 1352752=test_alias_and_anchor I, [2024-05-07T14:01:58.260583 #1311354] INFO -- : [885/885] 1352752=test_postponed_job I, [2024-05-07T14:02:13.742701 #1311354] INFO -- : Finished tests in 36.500122s, 722.9565 tests/s, 256258.2936 assertions/s. E, [2024-05-07T14:02:13.742816 #1311354] ERROR -- : Children under /tmp/rubytest.3nhaql: E, [2024-05-07T14:02:13.742838 #1311354] ERROR -- : * drwx------ 4 80 2024-05-07 14:01:39 +0000 gem_rebuild20240507-1352738-850g1i/ E, [2024-05-07T14:02:13.742844 #1311354] ERROR -- : * drwxrwxr-x 2 60 2024-05-07 14:01:39 +0000 new/ E, [2024-05-07T14:02:13.742849 #1311354] ERROR -- : * -rw-rw-r-- 1 4096 2024-05-07 14:01:39 +0000 rebuild_test_gem-1.0.0.gem E, [2024-05-07T14:02:13.742854 #1311354] ERROR -- : * drwxrwxr-x 2 60 2024-05-07 14:01:39 +0000 old/ E, [2024-05-07T14:02:13.742857 #1311354] ERROR -- : * -rw-rw-r-- 1 4096 2024-05-07 14:01:39 +0000 rebuild_test_gem-1.0.0.gem I, [2024-05-07T14:02:13.744096 #1311354] INFO -- : 26388 tests, 9353459 assertions, 0 failures, 0 errors, 306 skips I, [2024-05-07T14:02:13.744149 #1311354] INFO -- : I, [2024-05-07T14:02:13.744161 #1311354] INFO -- : ruby -v: ruby 3.4.0dev (2024-05-07T06:59:36Z master e1e6b4972f) [x86_64-linux] I, [2024-05-07T14:02:13.746096 #1311354] INFO -- : $$$[end] "make yes-test-all TESTOPTS='--stderr-on-failure' TESTS='-j20'" exit with 0. I, [2024-05-07T14:02:13.746274 #1311354] INFO -- : $$$[beg] make yes-test-rubyspec MSPECOPT='--error-output stderr --debug -j' TESTS='-j20' I, [2024-05-07T14:02:13.835708 #1311354] INFO -- : BASERUBY = /usr/bin/ruby --disable=gems I, [2024-05-07T14:02:13.835746 #1311354] INFO -- : CC = gcc I, [2024-05-07T14:02:13.835752 #1311354] INFO -- : LD = ld I, [2024-05-07T14:02:13.835756 #1311354] INFO -- : LDSHARED = gcc -shared I, [2024-05-07T14:02:13.835761 #1311354] INFO -- : CFLAGS = -O3 -fno-fast-math -ggdb3 -Wall -Wextra -Wdeprecated-declarations -Wdiv-by-zero -Wduplicated-cond -Wimplicit-function-declaration -Wimplicit-int -Wpointer-arith -Wwrite-strings -Wold-style-definition -Wimplicit-fallthrough=0 -Wmissing-noreturn -Wno-cast-function-type -Wno-constant-logical-operand -Wno-long-long -Wno-missing-field-initializers -Wno-overlength-strings -Wno-packed-bitfield-compat -Wno-parentheses-equality -Wno-self-assign -Wno-tautological-compare -Wno-unused-parameter -Wno-unused-value -Wsuggest-attribute=format -Wsuggest-attribute=noreturn -Wunused-variable -Wmisleading-indentation -Wundef -fPIC I, [2024-05-07T14:02:13.835766 #1311354] INFO -- : XCFLAGS = -U_FORTIFY_SOURCE -D_FORTIFY_SOURCE=2 -fstack-protector-strong -fno-strict-overflow -fvisibility=hidden -fexcess-precision=standard -DRUBY_EXPORT -I. -I.ext/include/x86_64-linux -I/tmp/ruby/src/trunk/include -I/tmp/ruby/src/trunk -I/tmp/ruby/src/trunk/prism -I/tmp/ruby/src/trunk/enc/unicode/15.0.0 I, [2024-05-07T14:02:13.835770 #1311354] INFO -- : CPPFLAGS = I, [2024-05-07T14:02:13.835774 #1311354] INFO -- : DLDFLAGS = -Wl,--compress-debug-sections=zlib -Wl,-soname,libruby.so.3.4 -fstack-protector-strong I, [2024-05-07T14:02:13.835786 #1311354] INFO -- : SOLIBS = -lz -lrt -lrt -lgmp -ldl -lcrypt -lm -lpthread I, [2024-05-07T14:02:13.835789 #1311354] INFO -- : LANG = en_US.UTF-8 I, [2024-05-07T14:02:13.835794 #1311354] INFO -- : LC_ALL = I, [2024-05-07T14:02:13.835798 #1311354] INFO -- : LC_CTYPE = I, [2024-05-07T14:02:13.835802 #1311354] INFO -- : MFLAGS = I, [2024-05-07T14:02:13.835805 #1311354] INFO -- : RUSTC = no I, [2024-05-07T14:02:13.835809 #1311354] INFO -- : YJIT_RUSTC_ARGS = --crate-name=yjit --crate-type=staticlib --edition=2021 -g -C lto=thin -C opt-level=3 -C overflow-checks=on '--out-dir=/tmp/ruby/build/trunk/yjit/target/release/' /tmp/ruby/src/trunk/yjit/src/lib.rs I, [2024-05-07T14:02:13.836272 #1311354] INFO -- : gcc (Ubuntu 11.4.0-1ubuntu1~22.04) 11.4.0 I, [2024-05-07T14:02:13.836293 #1311354] INFO -- : Copyright (C) 2021 Free Software Foundation, Inc. I, [2024-05-07T14:02:13.836299 #1311354] INFO -- : This is free software; see the source for copying conditions. There is NO I, [2024-05-07T14:02:13.836303 #1311354] INFO -- : warranty; not even for MERCHANTABILITY or FITNESS FOR A PARTICULAR PURPOSE. I, [2024-05-07T14:02:13.836307 #1311354] INFO -- : I, [2024-05-07T14:02:13.838015 #1311354] INFO -- : generating enc.mk I, [2024-05-07T14:02:13.956398 #1311354] INFO -- : making enc I, [2024-05-07T14:02:13.973729 #1311354] INFO -- : make[1]: Entering directory '/tmp/ruby/build/trunk' I, [2024-05-07T14:02:13.973752 #1311354] INFO -- : make[1]: Nothing to be done for 'enc'. I, [2024-05-07T14:02:13.973764 #1311354] INFO -- : make[1]: Leaving directory '/tmp/ruby/build/trunk' I, [2024-05-07T14:02:13.974392 #1311354] INFO -- : making srcs under enc I, [2024-05-07T14:02:14.004521 #1311354] INFO -- : make[1]: Entering directory '/tmp/ruby/build/trunk' I, [2024-05-07T14:02:14.004550 #1311354] INFO -- : make[1]: Nothing to be done for 'srcs'. I, [2024-05-07T14:02:14.004573 #1311354] INFO -- : make[1]: Leaving directory '/tmp/ruby/build/trunk' I, [2024-05-07T14:02:14.005492 #1311354] INFO -- : generating transdb.h I, [2024-05-07T14:02:14.100065 #1311354] INFO -- : transdb.h unchanged I, [2024-05-07T14:02:14.101359 #1311354] INFO -- : making trans I, [2024-05-07T14:02:14.135354 #1311354] INFO -- : make[1]: Entering directory '/tmp/ruby/build/trunk' I, [2024-05-07T14:02:14.135379 #1311354] INFO -- : make[1]: Nothing to be done for 'trans'. I, [2024-05-07T14:02:14.135387 #1311354] INFO -- : make[1]: Leaving directory '/tmp/ruby/build/trunk' I, [2024-05-07T14:02:14.136183 #1311354] INFO -- : making encs I, [2024-05-07T14:02:14.174034 #1311354] INFO -- : make[1]: Entering directory '/tmp/ruby/build/trunk' I, [2024-05-07T14:02:14.174056 #1311354] INFO -- : make[1]: Nothing to be done for 'encs'. I, [2024-05-07T14:02:14.174062 #1311354] INFO -- : make[1]: Leaving directory '/tmp/ruby/build/trunk' I, [2024-05-07T14:02:14.175756 #1311354] INFO -- : generating makefiles ext/configure-ext.mk I, [2024-05-07T14:02:14.203406 #1311354] INFO -- : ext/configure-ext.mk updated I, [2024-05-07T14:02:14.205851 #1311354] INFO -- : make[1]: Entering directory '/tmp/ruby/build/trunk' I, [2024-05-07T14:02:15.604752 #1311354] INFO -- : make[1]: Leaving directory '/tmp/ruby/build/trunk' I, [2024-05-07T14:02:15.605421 #1311354] INFO -- : generating makefile exts.mk I, [2024-05-07T14:02:15.642490 #1311354] INFO -- : exts.mk unchanged I, [2024-05-07T14:02:15.647106 #1311354] INFO -- : make[1]: Entering directory '/tmp/ruby/build/trunk' I, [2024-05-07T14:02:15.857651 #1311354] INFO -- : make[2]: Entering directory '/tmp/ruby/build/trunk/ext/coverage' I, [2024-05-07T14:02:15.860485 #1311354] INFO -- : make[2]: Leaving directory '/tmp/ruby/build/trunk/ext/coverage' I, [2024-05-07T14:02:15.864236 #1311354] INFO -- : make[2]: Entering directory '/tmp/ruby/build/trunk/ext/date' I, [2024-05-07T14:02:15.867266 #1311354] INFO -- : make[2]: Leaving directory '/tmp/ruby/build/trunk/ext/date' I, [2024-05-07T14:02:15.869578 #1311354] INFO -- : make[2]: Entering directory '/tmp/ruby/build/trunk/ext/digest' I, [2024-05-07T14:02:15.874954 #1311354] INFO -- : make[2]: Leaving directory '/tmp/ruby/build/trunk/ext/digest' I, [2024-05-07T14:02:15.890414 #1311354] INFO -- : make[2]: Entering directory '/tmp/ruby/build/trunk/ext/digest/sha2' I, [2024-05-07T14:02:15.893402 #1311354] INFO -- : make[2]: Leaving directory '/tmp/ruby/build/trunk/ext/digest/sha2' I, [2024-05-07T14:02:15.906227 #1311354] INFO -- : make[2]: Entering directory '/tmp/ruby/build/trunk/ext/fiddle' I, [2024-05-07T14:02:15.912591 #1311354] INFO -- : make[2]: Leaving directory '/tmp/ruby/build/trunk/ext/fiddle' I, [2024-05-07T14:02:15.915522 #1311354] INFO -- : make[2]: Entering directory '/tmp/ruby/build/trunk/ext/io/console' I, [2024-05-07T14:02:15.918149 #1311354] INFO -- : make[2]: Leaving directory '/tmp/ruby/build/trunk/ext/io/console' I, [2024-05-07T14:02:15.925699 #1311354] INFO -- : make[2]: Entering directory '/tmp/ruby/build/trunk/ext/json' I, [2024-05-07T14:02:15.931953 #1311354] INFO -- : make[2]: Leaving directory '/tmp/ruby/build/trunk/ext/json' I, [2024-05-07T14:02:15.940910 #1311354] INFO -- : make[2]: Entering directory '/tmp/ruby/build/trunk/ext/monitor' I, [2024-05-07T14:02:15.943487 #1311354] INFO -- : make[2]: Leaving directory '/tmp/ruby/build/trunk/ext/monitor' I, [2024-05-07T14:02:15.947595 #1311354] INFO -- : make[2]: Entering directory '/tmp/ruby/build/trunk/ext/objspace' I, [2024-05-07T14:02:15.951332 #1311354] INFO -- : make[2]: Leaving directory '/tmp/ruby/build/trunk/ext/objspace' I, [2024-05-07T14:02:15.963383 #1311354] INFO -- : make[2]: Entering directory '/tmp/ruby/build/trunk/ext/openssl' I, [2024-05-07T14:02:15.976574 #1311354] INFO -- : make[2]: Leaving directory '/tmp/ruby/build/trunk/ext/openssl' I, [2024-05-07T14:02:15.979663 #1311354] INFO -- : make[2]: Entering directory '/tmp/ruby/build/trunk/ext/pathname' I, [2024-05-07T14:02:15.982207 #1311354] INFO -- : make[2]: Leaving directory '/tmp/ruby/build/trunk/ext/pathname' I, [2024-05-07T14:02:15.986461 #1311354] INFO -- : make[2]: Entering directory '/tmp/ruby/build/trunk/ext/psych' I, [2024-05-07T14:02:16.001443 #1311354] INFO -- : make[2]: Leaving directory '/tmp/ruby/build/trunk/ext/psych' I, [2024-05-07T14:02:16.004490 #1311354] INFO -- : make[2]: Entering directory '/tmp/ruby/build/trunk/ext/pty' I, [2024-05-07T14:02:16.007120 #1311354] INFO -- : make[2]: Leaving directory '/tmp/ruby/build/trunk/ext/pty' I, [2024-05-07T14:02:16.016616 #1311354] INFO -- : make[2]: Entering directory '/tmp/ruby/build/trunk/ext/ripper' I, [2024-05-07T14:02:16.021606 #1311354] INFO -- : make[2]: Leaving directory '/tmp/ruby/build/trunk/ext/ripper' I, [2024-05-07T14:02:16.023084 #1311354] INFO -- : make[2]: Entering directory '/tmp/ruby/build/trunk/ext/rubyvm' I, [2024-05-07T14:02:16.025360 #1311354] INFO -- : make[2]: Leaving directory '/tmp/ruby/build/trunk/ext/rubyvm' I, [2024-05-07T14:02:16.033203 #1311354] INFO -- : make[2]: Entering directory '/tmp/ruby/build/trunk/ext/socket' I, [2024-05-07T14:02:16.039664 #1311354] INFO -- : make[2]: Leaving directory '/tmp/ruby/build/trunk/ext/socket' I, [2024-05-07T14:02:16.050786 #1311354] INFO -- : make[2]: Entering directory '/tmp/ruby/build/trunk/.bundle/gems/bigdecimal-3.1.7/ext/bigdecimal' I, [2024-05-07T14:02:16.073709 #1311354] INFO -- : make[2]: Leaving directory '/tmp/ruby/build/trunk/.bundle/gems/bigdecimal-3.1.7/ext/bigdecimal' I, [2024-05-07T14:02:16.075587 #1311354] INFO -- : make[2]: Entering directory '/tmp/ruby/build/trunk/.bundle/gems/bigdecimal-3.1.8/ext/bigdecimal' I, [2024-05-07T14:02:16.097762 #1311354] INFO -- : make[2]: Leaving directory '/tmp/ruby/build/trunk/.bundle/gems/bigdecimal-3.1.8/ext/bigdecimal' I, [2024-05-07T14:02:16.099860 #1311354] INFO -- : make[2]: Entering directory '/tmp/ruby/build/trunk/.bundle/gems/debug-1.9.2/ext/debug' I, [2024-05-07T14:02:16.122967 #1311354] INFO -- : make[2]: Leaving directory '/tmp/ruby/build/trunk/.bundle/gems/debug-1.9.2/ext/debug' I, [2024-05-07T14:02:16.124775 #1311354] INFO -- : make[2]: Entering directory '/tmp/ruby/build/trunk/.bundle/gems/nkf-0.2.0/ext/nkf' I, [2024-05-07T14:02:16.146453 #1311354] INFO -- : make[2]: Leaving directory '/tmp/ruby/build/trunk/.bundle/gems/nkf-0.2.0/ext/nkf' I, [2024-05-07T14:02:16.148613 #1311354] INFO -- : make[2]: Entering directory '/tmp/ruby/build/trunk/.bundle/gems/racc-1.7.3/ext/racc/cparse' I, [2024-05-07T14:02:16.170407 #1311354] INFO -- : make[2]: Leaving directory '/tmp/ruby/build/trunk/.bundle/gems/racc-1.7.3/ext/racc/cparse' I, [2024-05-07T14:02:16.172626 #1311354] INFO -- : make[2]: Entering directory '/tmp/ruby/build/trunk/.bundle/gems/rbs-3.4.4/ext/rbs_extension' I, [2024-05-07T14:02:16.193947 #1311354] INFO -- : make[2]: Leaving directory '/tmp/ruby/build/trunk/.bundle/gems/rbs-3.4.4/ext/rbs_extension' I, [2024-05-07T14:02:16.195822 #1311354] INFO -- : make[2]: Entering directory '/tmp/ruby/build/trunk/.bundle/gems/syslog-0.1.2/ext/syslog' I, [2024-05-07T14:02:16.217630 #1311354] INFO -- : make[2]: Leaving directory '/tmp/ruby/build/trunk/.bundle/gems/syslog-0.1.2/ext/syslog' I, [2024-05-07T14:02:16.241104 #1311354] INFO -- : make[2]: Entering directory '/tmp/ruby/build/trunk' I, [2024-05-07T14:02:16.304773 #1311354] INFO -- : make[2]: 'ruby' is up to date. I, [2024-05-07T14:02:16.304811 #1311354] INFO -- : make[2]: Leaving directory '/tmp/ruby/build/trunk' I, [2024-05-07T14:02:16.305031 #1311354] INFO -- : make[1]: Leaving directory '/tmp/ruby/build/trunk' I, [2024-05-07T14:02:16.308786 #1311354] INFO -- : make[1]: Entering directory '/tmp/ruby/build/trunk' I, [2024-05-07T14:02:16.308812 #1311354] INFO -- : make[1]: Nothing to be done for 'note'. I, [2024-05-07T14:02:16.308821 #1311354] INFO -- : make[1]: Leaving directory '/tmp/ruby/build/trunk' E, [2024-05-07T14:02:16.368074 #1311354] ERROR -- : $ /tmp/ruby/build/trunk/miniruby -I/tmp/ruby/src/trunk/lib /tmp/ruby/src/trunk/tool/runruby.rb --archdir=/tmp/ruby/build/trunk --extout=.ext -- /tmp/ruby/src/trunk/spec/mspec/bin/mspec-run -B /tmp/ruby/src/trunk/spec/default.mspec --error-output stderr --debug -fy -o /tmp/rubytest.2clofb/1-mspec-multi-0 E, [2024-05-07T14:02:16.368326 #1311354] ERROR -- : $ /tmp/ruby/build/trunk/miniruby -I/tmp/ruby/src/trunk/lib /tmp/ruby/src/trunk/tool/runruby.rb --archdir=/tmp/ruby/build/trunk --extout=.ext -- /tmp/ruby/src/trunk/spec/mspec/bin/mspec-run -B /tmp/ruby/src/trunk/spec/default.mspec --error-output stderr --debug -fy -o /tmp/rubytest.2clofb/2-mspec-multi-1 E, [2024-05-07T14:02:16.368542 #1311354] ERROR -- : $ /tmp/ruby/build/trunk/miniruby -I/tmp/ruby/src/trunk/lib /tmp/ruby/src/trunk/tool/runruby.rb --archdir=/tmp/ruby/build/trunk --extout=.ext -- /tmp/ruby/src/trunk/spec/mspec/bin/mspec-run -B /tmp/ruby/src/trunk/spec/default.mspec --error-output stderr --debug -fy -o /tmp/rubytest.2clofb/3-mspec-multi-2 E, [2024-05-07T14:02:16.368808 #1311354] ERROR -- : $ /tmp/ruby/build/trunk/miniruby -I/tmp/ruby/src/trunk/lib /tmp/ruby/src/trunk/tool/runruby.rb --archdir=/tmp/ruby/build/trunk --extout=.ext -- /tmp/ruby/src/trunk/spec/mspec/bin/mspec-run -B /tmp/ruby/src/trunk/spec/default.mspec --error-output stderr --debug -fy -o /tmp/rubytest.2clofb/4-mspec-multi-3 E, [2024-05-07T14:02:16.368927 #1311354] ERROR -- : $ /tmp/ruby/build/trunk/miniruby -I/tmp/ruby/src/trunk/lib /tmp/ruby/src/trunk/tool/runruby.rb --archdir=/tmp/ruby/build/trunk --extout=.ext -- /tmp/ruby/src/trunk/spec/mspec/bin/mspec-run -B /tmp/ruby/src/trunk/spec/default.mspec --error-output stderr --debug -fy -o /tmp/rubytest.2clofb/5-mspec-multi-4 E, [2024-05-07T14:02:16.369219 #1311354] ERROR -- : $ /tmp/ruby/build/trunk/miniruby -I/tmp/ruby/src/trunk/lib /tmp/ruby/src/trunk/tool/runruby.rb --archdir=/tmp/ruby/build/trunk --extout=.ext -- /tmp/ruby/src/trunk/spec/mspec/bin/mspec-run -B /tmp/ruby/src/trunk/spec/default.mspec --error-output stderr --debug -fy -o /tmp/rubytest.2clofb/6-mspec-multi-5 E, [2024-05-07T14:02:16.369409 #1311354] ERROR -- : $ /tmp/ruby/build/trunk/miniruby -I/tmp/ruby/src/trunk/lib /tmp/ruby/src/trunk/tool/runruby.rb --archdir=/tmp/ruby/build/trunk --extout=.ext -- /tmp/ruby/src/trunk/spec/mspec/bin/mspec-run -B /tmp/ruby/src/trunk/spec/default.mspec --error-output stderr --debug -fy -o /tmp/rubytest.2clofb/7-mspec-multi-6 E, [2024-05-07T14:02:16.369605 #1311354] ERROR -- : $ /tmp/ruby/build/trunk/miniruby -I/tmp/ruby/src/trunk/lib /tmp/ruby/src/trunk/tool/runruby.rb --archdir=/tmp/ruby/build/trunk --extout=.ext -- /tmp/ruby/src/trunk/spec/mspec/bin/mspec-run -B /tmp/ruby/src/trunk/spec/default.mspec --error-output stderr --debug -fy -o /tmp/rubytest.2clofb/8-mspec-multi-7 E, [2024-05-07T14:02:16.369796 #1311354] ERROR -- : $ /tmp/ruby/build/trunk/miniruby -I/tmp/ruby/src/trunk/lib /tmp/ruby/src/trunk/tool/runruby.rb --archdir=/tmp/ruby/build/trunk --extout=.ext -- /tmp/ruby/src/trunk/spec/mspec/bin/mspec-run -B /tmp/ruby/src/trunk/spec/default.mspec --error-output stderr --debug -fy -o /tmp/rubytest.2clofb/9-mspec-multi-8 E, [2024-05-07T14:02:16.369997 #1311354] ERROR -- : $ /tmp/ruby/build/trunk/miniruby -I/tmp/ruby/src/trunk/lib /tmp/ruby/src/trunk/tool/runruby.rb --archdir=/tmp/ruby/build/trunk --extout=.ext -- /tmp/ruby/src/trunk/spec/mspec/bin/mspec-run -B /tmp/ruby/src/trunk/spec/default.mspec --error-output stderr --debug -fy -o /tmp/rubytest.2clofb/10-mspec-multi-9 E, [2024-05-07T14:02:16.370381 #1311354] ERROR -- : $ /tmp/ruby/build/trunk/miniruby -I/tmp/ruby/src/trunk/lib /tmp/ruby/src/trunk/tool/runruby.rb --archdir=/tmp/ruby/build/trunk --extout=.ext -- /tmp/ruby/src/trunk/spec/mspec/bin/mspec-run -B /tmp/ruby/src/trunk/spec/default.mspec --error-output stderr --debug -fy -o /tmp/rubytest.2clofb/11-mspec-multi-10 E, [2024-05-07T14:02:16.370574 #1311354] ERROR -- : $ /tmp/ruby/build/trunk/miniruby -I/tmp/ruby/src/trunk/lib /tmp/ruby/src/trunk/tool/runruby.rb --archdir=/tmp/ruby/build/trunk --extout=.ext -- /tmp/ruby/src/trunk/spec/mspec/bin/mspec-run -B /tmp/ruby/src/trunk/spec/default.mspec --error-output stderr --debug -fy -o /tmp/rubytest.2clofb/12-mspec-multi-11 E, [2024-05-07T14:02:16.370738 #1311354] ERROR -- : $ /tmp/ruby/build/trunk/miniruby -I/tmp/ruby/src/trunk/lib /tmp/ruby/src/trunk/tool/runruby.rb --archdir=/tmp/ruby/build/trunk --extout=.ext -- /tmp/ruby/src/trunk/spec/mspec/bin/mspec-run -B /tmp/ruby/src/trunk/spec/default.mspec --error-output stderr --debug -fy -o /tmp/rubytest.2clofb/13-mspec-multi-12 E, [2024-05-07T14:02:16.370903 #1311354] ERROR -- : $ /tmp/ruby/build/trunk/miniruby -I/tmp/ruby/src/trunk/lib /tmp/ruby/src/trunk/tool/runruby.rb --archdir=/tmp/ruby/build/trunk --extout=.ext -- /tmp/ruby/src/trunk/spec/mspec/bin/mspec-run -B /tmp/ruby/src/trunk/spec/default.mspec --error-output stderr --debug -fy -o /tmp/rubytest.2clofb/14-mspec-multi-13 E, [2024-05-07T14:02:16.371078 #1311354] ERROR -- : $ /tmp/ruby/build/trunk/miniruby -I/tmp/ruby/src/trunk/lib /tmp/ruby/src/trunk/tool/runruby.rb --archdir=/tmp/ruby/build/trunk --extout=.ext -- /tmp/ruby/src/trunk/spec/mspec/bin/mspec-run -B /tmp/ruby/src/trunk/spec/default.mspec --error-output stderr --debug -fy -o /tmp/rubytest.2clofb/15-mspec-multi-14 E, [2024-05-07T14:02:16.371274 #1311354] ERROR -- : $ /tmp/ruby/build/trunk/miniruby -I/tmp/ruby/src/trunk/lib /tmp/ruby/src/trunk/tool/runruby.rb --archdir=/tmp/ruby/build/trunk --extout=.ext -- /tmp/ruby/src/trunk/spec/mspec/bin/mspec-run -B /tmp/ruby/src/trunk/spec/default.mspec --error-output stderr --debug -fy -o /tmp/rubytest.2clofb/16-mspec-multi-15 E, [2024-05-07T14:02:16.371501 #1311354] ERROR -- : $ /tmp/ruby/build/trunk/miniruby -I/tmp/ruby/src/trunk/lib /tmp/ruby/src/trunk/tool/runruby.rb --archdir=/tmp/ruby/build/trunk --extout=.ext -- /tmp/ruby/src/trunk/spec/mspec/bin/mspec-run -B /tmp/ruby/src/trunk/spec/default.mspec --error-output stderr --debug -fy -o /tmp/rubytest.2clofb/17-mspec-multi-16 E, [2024-05-07T14:02:16.371615 #1311354] ERROR -- : $ /tmp/ruby/build/trunk/miniruby -I/tmp/ruby/src/trunk/lib /tmp/ruby/src/trunk/tool/runruby.rb --archdir=/tmp/ruby/build/trunk --extout=.ext -- /tmp/ruby/src/trunk/spec/mspec/bin/mspec-run -B /tmp/ruby/src/trunk/spec/default.mspec --error-output stderr --debug -fy -o /tmp/rubytest.2clofb/18-mspec-multi-17 E, [2024-05-07T14:02:16.373903 #1311354] ERROR -- : $ /tmp/ruby/build/trunk/miniruby -I/tmp/ruby/src/trunk/lib /tmp/ruby/src/trunk/tool/runruby.rb --archdir=/tmp/ruby/build/trunk --extout=.ext -- /tmp/ruby/src/trunk/spec/mspec/bin/mspec-run -B /tmp/ruby/src/trunk/spec/default.mspec --error-output stderr --debug -fy -o /tmp/rubytest.2clofb/19-mspec-multi-18 E, [2024-05-07T14:02:16.374357 #1311354] ERROR -- : $ /tmp/ruby/build/trunk/miniruby -I/tmp/ruby/src/trunk/lib /tmp/ruby/src/trunk/tool/runruby.rb --archdir=/tmp/ruby/build/trunk --extout=.ext -- /tmp/ruby/src/trunk/spec/mspec/bin/mspec-run -B /tmp/ruby/src/trunk/spec/default.mspec --error-output stderr --debug -fy -o /tmp/rubytest.2clofb/20-mspec-multi-19 I, [2024-05-07T14:02:16.569184 #1311354] INFO -- : ruby 3.4.0dev (2024-05-07T06:59:36Z master e1e6b4972f) [x86_64-linux] I, [2024-05-07T14:02:17.230854 #1311354] INFO -- : 0 ......................................................................... I, [2024-05-07T14:02:17.649846 #1311354] INFO -- : 73 ......................................................................... I, [2024-05-07T14:02:17.816169 #1311354] INFO -- : 146 ......................................................................... I, [2024-05-07T14:02:17.859594 #1311354] INFO -- : 219 ......................................................................... I, [2024-05-07T14:02:17.913194 #1311354] INFO -- : 292 ......................................................................... I, [2024-05-07T14:02:17.955073 #1311354] INFO -- : 365 ......................................................................... I, [2024-05-07T14:02:17.974905 #1311354] INFO -- : 438 ......................................................................... I, [2024-05-07T14:02:17.993180 #1311354] INFO -- : 511 ......................................................................... I, [2024-05-07T14:02:18.010466 #1311354] INFO -- : 584 ......................................................................... I, [2024-05-07T14:02:18.070100 #1311354] INFO -- : 657 ......................................................................... I, [2024-05-07T14:02:18.099533 #1311354] INFO -- : 730 ......................................................................... I, [2024-05-07T14:02:18.125065 #1311354] INFO -- : 803 ......................................................................... I, [2024-05-07T14:02:18.157821 #1311354] INFO -- : 876 ......................................................................... I, [2024-05-07T14:02:18.205913 #1311354] INFO -- : 949 ......................................................................... I, [2024-05-07T14:02:18.297809 #1311354] INFO -- : 1022 ......................................................................... I, [2024-05-07T14:02:18.458046 #1311354] INFO -- : 1095 ......................................................................... I, [2024-05-07T14:02:18.560090 #1311354] INFO -- : 1168 ......................................................................... I, [2024-05-07T14:02:18.624893 #1311354] INFO -- : 1241 ......................................................................... I, [2024-05-07T14:02:18.671084 #1311354] INFO -- : 1314 ......................................................................... I, [2024-05-07T14:02:18.705668 #1311354] INFO -- : 1387 ......................................................................... I, [2024-05-07T14:02:18.814196 #1311354] INFO -- : 1460 ......................................................................... I, [2024-05-07T14:02:19.256168 #1311354] INFO -- : 1533 ......................................................................... I, [2024-05-07T14:02:19.318265 #1311354] INFO -- : 1606 ......................................................................... I, [2024-05-07T14:02:19.422241 #1311354] INFO -- : 1679 ......................................................................... I, [2024-05-07T14:02:19.548334 #1311354] INFO -- : 1752 ......................................................................... I, [2024-05-07T14:02:19.641950 #1311354] INFO -- : 1825 ......................................................................... I, [2024-05-07T14:02:19.763665 #1311354] INFO -- : 1898 ......................................................................... I, [2024-05-07T14:02:19.847308 #1311354] INFO -- : 1971 ......................................................................... I, [2024-05-07T14:02:19.910063 #1311354] INFO -- : 2044 ......................................................................... I, [2024-05-07T14:02:19.951923 #1311354] INFO -- : 2117 ......................................................................... I, [2024-05-07T14:02:19.964925 #1311354] INFO -- : 2190 ......................................................................... I, [2024-05-07T14:02:19.984084 #1311354] INFO -- : 2263 ......................................................................... I, [2024-05-07T14:02:19.997571 #1311354] INFO -- : 2336 ......................................................................... I, [2024-05-07T14:02:20.035058 #1311354] INFO -- : 2409 ......................................................................... I, [2024-05-07T14:02:20.140059 #1311354] INFO -- : 2482 ......................................................................... I, [2024-05-07T14:02:20.167216 #1311354] INFO -- : 2555 ......................................................................... I, [2024-05-07T14:02:20.270926 #1311354] INFO -- : 2628 ......................................................................... I, [2024-05-07T14:02:20.364607 #1311354] INFO -- : 2701 ......................................................................... I, [2024-05-07T14:02:20.397081 #1311354] INFO -- : 2774 ......................................................................... I, [2024-05-07T14:02:20.458663 #1311354] INFO -- : 2847 ......................................................................... I, [2024-05-07T14:02:20.498054 #1311354] INFO -- : 2920 ......................................................................... I, [2024-05-07T14:02:20.522659 #1311354] INFO -- : 2993 ......................................................................... I, [2024-05-07T14:02:20.550350 #1311354] INFO -- : 3066 ......................................................................... I, [2024-05-07T14:02:20.562410 #1311354] INFO -- : 3139 ......................................................................... I, [2024-05-07T14:02:20.570913 #1311354] INFO -- : 3212 ......................................................................... I, [2024-05-07T14:02:20.602675 #1311354] INFO -- : 3285 ......................................................................... I, [2024-05-07T14:02:24.554686 #1311354] INFO -- : 3358 ........................................................................ I, [2024-05-07T14:02:24.554728 #1311354] INFO -- : I, [2024-05-07T14:02:24.554734 #1311354] INFO -- : Finished in 8.185870 seconds I, [2024-05-07T14:02:24.554738 #1311354] INFO -- : I, [2024-05-07T14:02:24.554741 #1311354] INFO -- : 3429 files, 32610 examples, 193416 expectations, 0 failures, 0 errors, 0 tagged I, [2024-05-07T14:02:24.556729 #1311354] INFO -- : $$$[end] "make yes-test-rubyspec MSPECOPT='--error-output stderr --debug -j' TESTS='-j20'" exit with 0.