# Logfile created on 2024-05-07 10:23:45 +0000 by logger.rb/v1.4.3 I, [2024-05-07T10:23:45.686568 #3008779] INFO -- : #, @formatter=nil, @logdev=#, @binmode=false, @mon_data=#, @mon_data_owner_object_id=860>>> I, [2024-05-07T10:23:45.686695 #3008779] INFO -- : $$$[beg] make update-unicode -j20 I, [2024-05-07T10:23:45.745625 #3008779] INFO -- : Downloading Unicode emoji 15.0 files... I, [2024-05-07T10:23:45.745834 #3008779] INFO -- : Downloading Unicode emoji 15.0 files... I, [2024-05-07T10:23:45.746627 #3008779] INFO -- : Downloading Unicode emoji 15.0 files... I, [2024-05-07T10:23:45.787085 #3008779] INFO -- : made symlink emoji/15.0/emoji-sequences.txt to /tmp/ruby/src/trunk/.downloaded-cache/emoji/15.0/emoji-sequences.txt I, [2024-05-07T10:23:45.787713 #3008779] INFO -- : downloading emoji/15.0/emoji-sequences.txt ... downloading emoji/15.0/emoji-test.txt ... /tmp/ruby/src/trunk/enc/unicode/data/emoji/15.0/emoji-sequences.txt already exists E, [2024-05-07T10:23:46.289292 #3008779] ERROR -- : /tmp/ruby/src/trunk/tool/downloader.rb:302:in `rescue in download': failed to download emoji/15.0/emoji-test.txt (RuntimeError) E, [2024-05-07T10:23:46.289338 #3008779] ERROR -- : OpenURI::HTTPError: 403 Forbidden: https://www.unicode.org/Public/emoji/15.0/emoji-test.txt E, [2024-05-07T10:23:46.289344 #3008779] ERROR -- : from /tmp/ruby/src/trunk/tool/downloader.rb:201:in `download' E, [2024-05-07T10:23:46.289348 #3008779] ERROR -- : from /tmp/ruby/src/trunk/tool/downloader.rb:136:in `download' E, [2024-05-07T10:23:46.289351 #3008779] ERROR -- : from /tmp/ruby/src/trunk/tool/downloader.rb:482:in `block in
' E, [2024-05-07T10:23:46.289355 #3008779] ERROR -- : from /tmp/ruby/src/trunk/tool/downloader.rb:465:in `each' E, [2024-05-07T10:23:46.289358 #3008779] ERROR -- : from /tmp/ruby/src/trunk/tool/downloader.rb:465:in `
' E, [2024-05-07T10:23:46.289362 #3008779] ERROR -- : /usr/lib/ruby/3.0.0/open-uri.rb:364:in `open_http': 403 Forbidden (OpenURI::HTTPError) E, [2024-05-07T10:23:46.289370 #3008779] ERROR -- : from /usr/lib/ruby/3.0.0/open-uri.rb:741:in `buffer_open' E, [2024-05-07T10:23:46.289374 #3008779] ERROR -- : from /usr/lib/ruby/3.0.0/open-uri.rb:212:in `block in open_loop' E, [2024-05-07T10:23:46.289378 #3008779] ERROR -- : from /usr/lib/ruby/3.0.0/open-uri.rb:210:in `catch' E, [2024-05-07T10:23:46.289381 #3008779] ERROR -- : from /usr/lib/ruby/3.0.0/open-uri.rb:210:in `open_loop' E, [2024-05-07T10:23:46.289385 #3008779] ERROR -- : from /usr/lib/ruby/3.0.0/open-uri.rb:151:in `open_uri' E, [2024-05-07T10:23:46.289388 #3008779] ERROR -- : from /usr/lib/ruby/3.0.0/open-uri.rb:721:in `open' E, [2024-05-07T10:23:46.289392 #3008779] ERROR -- : from /usr/lib/ruby/3.0.0/open-uri.rb:729:in `read' E, [2024-05-07T10:23:46.289395 #3008779] ERROR -- : from /tmp/ruby/src/trunk/tool/downloader.rb:247:in `block in download' E, [2024-05-07T10:23:46.289407 #3008779] ERROR -- : from /tmp/ruby/src/trunk/tool/downloader.rb:378:in `with_retry' E, [2024-05-07T10:23:46.289410 #3008779] ERROR -- : from /tmp/ruby/src/trunk/tool/downloader.rb:246:in `download' E, [2024-05-07T10:23:46.289415 #3008779] ERROR -- : from /tmp/ruby/src/trunk/tool/downloader.rb:136:in `download' E, [2024-05-07T10:23:46.289418 #3008779] ERROR -- : from /tmp/ruby/src/trunk/tool/downloader.rb:482:in `block in
' E, [2024-05-07T10:23:46.289422 #3008779] ERROR -- : from /tmp/ruby/src/trunk/tool/downloader.rb:465:in `each' E, [2024-05-07T10:23:46.289425 #3008779] ERROR -- : from /tmp/ruby/src/trunk/tool/downloader.rb:465:in `
' E, [2024-05-07T10:23:46.289781 #3008779] ERROR -- : /tmp/ruby/src/trunk/tool/downloader.rb:302:in `rescue in download': failed to download emoji/15.0/emoji-test.txt (RuntimeError) E, [2024-05-07T10:23:46.289801 #3008779] ERROR -- : OpenURI::HTTPError: 403 Forbidden: https://www.unicode.org/Public/emoji/15.0/emoji-test.txt E, [2024-05-07T10:23:46.289807 #3008779] ERROR -- : from /tmp/ruby/src/trunk/tool/downloader.rb:201:in `download' E, [2024-05-07T10:23:46.289814 #3008779] ERROR -- : from /tmp/ruby/src/trunk/tool/downloader.rb:136:in `download' E, [2024-05-07T10:23:46.289817 #3008779] ERROR -- : from /tmp/ruby/src/trunk/tool/downloader.rb:482:in `block in
' E, [2024-05-07T10:23:46.289821 #3008779] ERROR -- : from /tmp/ruby/src/trunk/tool/downloader.rb:465:in `each' E, [2024-05-07T10:23:46.289824 #3008779] ERROR -- : from /tmp/ruby/src/trunk/tool/downloader.rb:465:in `
' E, [2024-05-07T10:23:46.289828 #3008779] ERROR -- : /usr/lib/ruby/3.0.0/open-uri.rb:364:in `open_http': 403 Forbidden (OpenURI::HTTPError) E, [2024-05-07T10:23:46.289833 #3008779] ERROR -- : from /usr/lib/ruby/3.0.0/open-uri.rb:741:in `buffer_open' E, [2024-05-07T10:23:46.289836 #3008779] ERROR -- : from /usr/lib/ruby/3.0.0/open-uri.rb:212:in `block in open_loop' E, [2024-05-07T10:23:46.289839 #3008779] ERROR -- : from /usr/lib/ruby/3.0.0/open-uri.rb:210:in `catch' E, [2024-05-07T10:23:46.289844 #3008779] ERROR -- : from /usr/lib/ruby/3.0.0/open-uri.rb:210:in `open_loop' E, [2024-05-07T10:23:46.289848 #3008779] ERROR -- : from /usr/lib/ruby/3.0.0/open-uri.rb:151:in `open_uri' E, [2024-05-07T10:23:46.289852 #3008779] ERROR -- : from /usr/lib/ruby/3.0.0/open-uri.rb:721:in `open' E, [2024-05-07T10:23:46.289856 #3008779] ERROR -- : from /usr/lib/ruby/3.0.0/open-uri.rb:729:in `read' E, [2024-05-07T10:23:46.289860 #3008779] ERROR -- : from /tmp/ruby/src/trunk/tool/downloader.rb:247:in `block in download' E, [2024-05-07T10:23:46.289863 #3008779] ERROR -- : from /tmp/ruby/src/trunk/tool/downloader.rb:378:in `with_retry' E, [2024-05-07T10:23:46.289867 #3008779] ERROR -- : from /tmp/ruby/src/trunk/tool/downloader.rb:246:in `download' E, [2024-05-07T10:23:46.289870 #3008779] ERROR -- : from /tmp/ruby/src/trunk/tool/downloader.rb:136:in `download' E, [2024-05-07T10:23:46.289873 #3008779] ERROR -- : from /tmp/ruby/src/trunk/tool/downloader.rb:482:in `block in
' E, [2024-05-07T10:23:46.289879 #3008779] ERROR -- : from /tmp/ruby/src/trunk/tool/downloader.rb:465:in `each' E, [2024-05-07T10:23:46.289883 #3008779] ERROR -- : from /tmp/ruby/src/trunk/tool/downloader.rb:465:in `
' E, [2024-05-07T10:23:46.291454 #3008779] ERROR -- : make: *** [uncommon.mk:1787: /tmp/ruby/src/trunk/enc/unicode/data/emoji/15.0/emoji-sequences.txt] Error 1 E, [2024-05-07T10:23:46.291475 #3008779] ERROR -- : make: *** Deleting file '/tmp/ruby/src/trunk/enc/unicode/data/emoji/15.0/emoji-sequences.txt' E, [2024-05-07T10:23:46.291481 #3008779] ERROR -- : make: *** Waiting for unfinished jobs.... E, [2024-05-07T10:23:46.291714 #3008779] ERROR -- : make: *** [uncommon.mk:1787: /tmp/ruby/src/trunk/enc/unicode/data/emoji/15.0/emoji-zwj-sequences.txt] Error 1 E, [2024-05-07T10:23:46.739923 #3008779] ERROR -- : /tmp/ruby/src/trunk/tool/downloader.rb:302:in `rescue in download': failed to download emoji/15.0/emoji-sequences.txt (RuntimeError) E, [2024-05-07T10:23:46.740033 #3008779] ERROR -- : EOFError: end of file reached: https://www.unicode.org/Public/emoji/15.0/emoji-sequences.txt E, [2024-05-07T10:23:46.740040 #3008779] ERROR -- : from /tmp/ruby/src/trunk/tool/downloader.rb:201:in `download' E, [2024-05-07T10:23:46.740044 #3008779] ERROR -- : from /tmp/ruby/src/trunk/tool/downloader.rb:136:in `download' E, [2024-05-07T10:23:46.740048 #3008779] ERROR -- : from /tmp/ruby/src/trunk/tool/downloader.rb:482:in `block in
' E, [2024-05-07T10:23:46.740052 #3008779] ERROR -- : from /tmp/ruby/src/trunk/tool/downloader.rb:465:in `each' E, [2024-05-07T10:23:46.740056 #3008779] ERROR -- : from /tmp/ruby/src/trunk/tool/downloader.rb:465:in `
' E, [2024-05-07T10:23:46.740060 #3008779] ERROR -- : /usr/lib/ruby/3.0.0/net/protocol.rb:227:in `rbuf_fill': end of file reached (EOFError) E, [2024-05-07T10:23:46.740065 #3008779] ERROR -- : from /usr/lib/ruby/3.0.0/net/protocol.rb:193:in `readuntil' E, [2024-05-07T10:23:46.740069 #3008779] ERROR -- : from /usr/lib/ruby/3.0.0/net/protocol.rb:203:in `readline' E, [2024-05-07T10:23:46.740073 #3008779] ERROR -- : from /usr/lib/ruby/3.0.0/net/http/response.rb:42:in `read_status_line' E, [2024-05-07T10:23:46.740077 #3008779] ERROR -- : from /usr/lib/ruby/3.0.0/net/http/response.rb:31:in `read_new' E, [2024-05-07T10:23:46.740081 #3008779] ERROR -- : from /usr/lib/ruby/3.0.0/net/http.rb:1557:in `block in transport_request' E, [2024-05-07T10:23:46.740085 #3008779] ERROR -- : from /usr/lib/ruby/3.0.0/net/http.rb:1548:in `catch' E, [2024-05-07T10:23:46.740089 #3008779] ERROR -- : from /usr/lib/ruby/3.0.0/net/http.rb:1548:in `transport_request' E, [2024-05-07T10:23:46.740207 #3008779] ERROR -- : from /usr/lib/ruby/3.0.0/net/http.rb:1521:in `request' E, [2024-05-07T10:23:46.740212 #3008779] ERROR -- : from /usr/lib/ruby/3.0.0/open-uri.rb:329:in `block in open_http' E, [2024-05-07T10:23:46.740215 #3008779] ERROR -- : from /usr/lib/ruby/3.0.0/net/http.rb:960:in `start' E, [2024-05-07T10:23:46.740219 #3008779] ERROR -- : from /usr/lib/ruby/3.0.0/open-uri.rb:323:in `open_http' E, [2024-05-07T10:23:46.740223 #3008779] ERROR -- : from /usr/lib/ruby/3.0.0/open-uri.rb:741:in `buffer_open' E, [2024-05-07T10:23:46.740228 #3008779] ERROR -- : from /usr/lib/ruby/3.0.0/open-uri.rb:212:in `block in open_loop' E, [2024-05-07T10:23:46.740232 #3008779] ERROR -- : from /usr/lib/ruby/3.0.0/open-uri.rb:210:in `catch' E, [2024-05-07T10:23:46.740236 #3008779] ERROR -- : from /usr/lib/ruby/3.0.0/open-uri.rb:210:in `open_loop' E, [2024-05-07T10:23:46.740240 #3008779] ERROR -- : from /usr/lib/ruby/3.0.0/open-uri.rb:151:in `open_uri' E, [2024-05-07T10:23:46.740244 #3008779] ERROR -- : from /usr/lib/ruby/3.0.0/open-uri.rb:721:in `open' E, [2024-05-07T10:23:46.740247 #3008779] ERROR -- : from /usr/lib/ruby/3.0.0/open-uri.rb:729:in `read' E, [2024-05-07T10:23:46.740251 #3008779] ERROR -- : from /tmp/ruby/src/trunk/tool/downloader.rb:247:in `block in download' E, [2024-05-07T10:23:46.740255 #3008779] ERROR -- : from /tmp/ruby/src/trunk/tool/downloader.rb:378:in `with_retry' E, [2024-05-07T10:23:46.740259 #3008779] ERROR -- : from /tmp/ruby/src/trunk/tool/downloader.rb:246:in `download' E, [2024-05-07T10:23:46.740264 #3008779] ERROR -- : from /tmp/ruby/src/trunk/tool/downloader.rb:136:in `download' E, [2024-05-07T10:23:46.740268 #3008779] ERROR -- : from /tmp/ruby/src/trunk/tool/downloader.rb:482:in `block in
' E, [2024-05-07T10:23:46.740272 #3008779] ERROR -- : from /tmp/ruby/src/trunk/tool/downloader.rb:465:in `each' E, [2024-05-07T10:23:46.740275 #3008779] ERROR -- : from /tmp/ruby/src/trunk/tool/downloader.rb:465:in `
' E, [2024-05-07T10:23:46.742123 #3008779] ERROR -- : make: *** [uncommon.mk:1787: /tmp/ruby/src/trunk/enc/unicode/data/emoji/15.0/emoji-test.txt] Error 1 I, [2024-05-07T10:23:46.742190 #3008779] INFO -- : downloading emoji/15.0/emoji-test.txt ... I, [2024-05-07T10:23:46.742560 #3008779] INFO -- : $$$[end] "make update-unicode -j20" exit with 512. I, [2024-05-07T10:23:46.742598 #3008779] INFO -- : $$$[beg] make update-download -j20 I, [2024-05-07T10:23:46.841974 #3008779] INFO -- : tool/config.guess already exists I, [2024-05-07T10:23:46.842021 #3008779] INFO -- : tool/config.sub already exists I, [2024-05-07T10:23:46.844186 #3008779] INFO -- : Update minitest to ea9caafc0754b1d6236a490d59e624b53209734a I, [2024-05-07T10:23:46.844336 #3008779] INFO -- : Update power_assert to 84e85124c5014a139af39161d484156cfe87a9ed I, [2024-05-07T10:23:46.844531 #3008779] INFO -- : Update rbs to ba7872795d5de04adb8ff500c0e6afdc81a041dd I, [2024-05-07T10:23:46.845389 #3008779] INFO -- : Update typeprof to b19a6416da3a05d57fadd6ffdadb382b6d236ca5 I, [2024-05-07T10:23:46.845421 #3008779] INFO -- : echo ea9caafc0754b1d6236a490d59e624b53209734a | /bin/sh /tmp/ruby/src/trunk/tool/ifchange /tmp/ruby/src/trunk/.bundle/.timestamp/minitest.revision - I, [2024-05-07T10:23:46.845807 #3008779] INFO -- : echo 84e85124c5014a139af39161d484156cfe87a9ed | /bin/sh /tmp/ruby/src/trunk/tool/ifchange /tmp/ruby/src/trunk/.bundle/.timestamp/power_assert.revision - I, [2024-05-07T10:23:46.846023 #3008779] INFO -- : echo ba7872795d5de04adb8ff500c0e6afdc81a041dd | /bin/sh /tmp/ruby/src/trunk/tool/ifchange /tmp/ruby/src/trunk/.bundle/.timestamp/rbs.revision - I, [2024-05-07T10:23:46.846648 #3008779] INFO -- : echo b19a6416da3a05d57fadd6ffdadb382b6d236ca5 | /bin/sh /tmp/ruby/src/trunk/tool/ifchange /tmp/ruby/src/trunk/.bundle/.timestamp/typeprof.revision - I, [2024-05-07T10:23:46.847373 #3008779] INFO -- : /tmp/ruby/src/trunk/.bundle/.timestamp/minitest.revision unchanged I, [2024-05-07T10:23:46.847500 #3008779] INFO -- : /tmp/ruby/src/trunk/.bundle/.timestamp/power_assert.revision unchanged I, [2024-05-07T10:23:46.847852 #3008779] INFO -- : /tmp/ruby/src/trunk/.bundle/.timestamp/rbs.revision unchanged I, [2024-05-07T10:23:46.848214 #3008779] INFO -- : /tmp/ruby/src/trunk/.bundle/.timestamp/typeprof.revision unchanged I, [2024-05-07T10:23:46.848502 #3008779] INFO -- : Building power_assert@84e85124c5014a139af39161d484156cfe87a9ed to /tmp/ruby/src/trunk/gems/power_assert-2.0.3.gem I, [2024-05-07T10:23:46.917576 #3008779] INFO -- : Successfully built RubyGem I, [2024-05-07T10:23:46.917641 #3008779] INFO -- : Name: power_assert I, [2024-05-07T10:23:46.917669 #3008779] INFO -- : Version: 2.0.4dev I, [2024-05-07T10:23:46.917685 #3008779] INFO -- : File: power_assert-2.0.4dev.gem I, [2024-05-07T10:23:46.963714 #3008779] INFO -- : $$$[end] "make update-download -j20" exit with 0. I, [2024-05-07T10:23:46.963765 #3008779] INFO -- : $$$[beg] make update-rubyspec -j20 I, [2024-05-07T10:23:47.021239 #3008779] INFO -- : make: Nothing to be done for 'update-rubyspec'. I, [2024-05-07T10:23:47.021504 #3008779] INFO -- : $$$[end] "make update-rubyspec -j20" exit with 0. I, [2024-05-07T10:23:47.021536 #3008779] INFO -- : $$$[beg] make update-src -j20 I, [2024-05-07T10:23:47.679369 #3008779] INFO -- : Already up to date. I, [2024-05-07T10:23:47.688859 #3008779] INFO -- : Latest commit hash = e1e6b4972f I, [2024-05-07T10:23:47.689879 #3008779] INFO -- : $$$[end] "make update-src -j20" exit with 0. I, [2024-05-07T10:23:47.689920 #3008779] INFO -- : $$$[beg] make after-update -j20 I, [2024-05-07T10:23:47.757702 #3008779] INFO -- : generating /tmp/ruby/src/trunk/ext/ripper/eventids2table.c I, [2024-05-07T10:23:47.761958 #3008779] INFO -- : make[1]: Entering directory '/tmp/ruby/src/trunk/ext/ripper' I, [2024-05-07T10:23:47.762005 #3008779] INFO -- : make[1]: Nothing to be done for 'src'. I, [2024-05-07T10:23:47.762018 #3008779] INFO -- : make[1]: Leaving directory '/tmp/ruby/src/trunk/ext/ripper' I, [2024-05-07T10:23:47.778342 #3008779] INFO -- : /tmp/ruby/src/trunk/revision.h updated I, [2024-05-07T10:23:47.779619 #3008779] INFO -- : generating x86_64-linux-fake.rb I, [2024-05-07T10:23:47.830792 #3008779] INFO -- : x86_64-linux-fake.rb updated I, [2024-05-07T10:23:47.832159 #3008779] INFO -- : generating enc.mk I, [2024-05-07T10:23:47.948462 #3008779] INFO -- : making srcs under enc I, [2024-05-07T10:23:47.978207 #3008779] INFO -- : make[1]: Entering directory '/tmp/ruby/build/trunk' I, [2024-05-07T10:23:47.978282 #3008779] INFO -- : make[1]: Nothing to be done for 'srcs'. I, [2024-05-07T10:23:47.978296 #3008779] INFO -- : make[1]: Leaving directory '/tmp/ruby/build/trunk' I, [2024-05-07T10:23:48.023823 #3008779] INFO -- : Update minitest to ea9caafc0754b1d6236a490d59e624b53209734a I, [2024-05-07T10:23:48.023874 #3008779] INFO -- : Update power_assert to 84e85124c5014a139af39161d484156cfe87a9ed I, [2024-05-07T10:23:48.024196 #3008779] INFO -- : Update rbs to ba7872795d5de04adb8ff500c0e6afdc81a041dd I, [2024-05-07T10:23:48.024420 #3008779] INFO -- : Update typeprof to b19a6416da3a05d57fadd6ffdadb382b6d236ca5 I, [2024-05-07T10:23:48.025116 #3008779] INFO -- : echo ea9caafc0754b1d6236a490d59e624b53209734a | /bin/sh /tmp/ruby/src/trunk/tool/ifchange /tmp/ruby/src/trunk/.bundle/.timestamp/minitest.revision - I, [2024-05-07T10:23:48.025167 #3008779] INFO -- : echo 84e85124c5014a139af39161d484156cfe87a9ed | /bin/sh /tmp/ruby/src/trunk/tool/ifchange /tmp/ruby/src/trunk/.bundle/.timestamp/power_assert.revision - I, [2024-05-07T10:23:48.025993 #3008779] INFO -- : echo ba7872795d5de04adb8ff500c0e6afdc81a041dd | /bin/sh /tmp/ruby/src/trunk/tool/ifchange /tmp/ruby/src/trunk/.bundle/.timestamp/rbs.revision - I, [2024-05-07T10:23:48.026255 #3008779] INFO -- : echo b19a6416da3a05d57fadd6ffdadb382b6d236ca5 | /bin/sh /tmp/ruby/src/trunk/tool/ifchange /tmp/ruby/src/trunk/.bundle/.timestamp/typeprof.revision - I, [2024-05-07T10:23:48.027005 #3008779] INFO -- : /tmp/ruby/src/trunk/.bundle/.timestamp/minitest.revision unchanged I, [2024-05-07T10:23:48.027394 #3008779] INFO -- : /tmp/ruby/src/trunk/.bundle/.timestamp/power_assert.revision unchanged I, [2024-05-07T10:23:48.027827 #3008779] INFO -- : /tmp/ruby/src/trunk/.bundle/.timestamp/rbs.revision unchanged I, [2024-05-07T10:23:48.027926 #3008779] INFO -- : /tmp/ruby/src/trunk/.bundle/.timestamp/typeprof.revision unchanged I, [2024-05-07T10:23:48.028398 #3008779] INFO -- : Building power_assert@84e85124c5014a139af39161d484156cfe87a9ed to /tmp/ruby/src/trunk/gems/power_assert-2.0.3.gem I, [2024-05-07T10:23:48.097578 #3008779] INFO -- : Successfully built RubyGem I, [2024-05-07T10:23:48.097641 #3008779] INFO -- : Name: power_assert I, [2024-05-07T10:23:48.097656 #3008779] INFO -- : Version: 2.0.4dev I, [2024-05-07T10:23:48.097675 #3008779] INFO -- : File: power_assert-2.0.4dev.gem I, [2024-05-07T10:23:48.099939 #3008779] INFO -- : Extracting bundle gem power_assert-2.0.3... I, [2024-05-07T10:23:48.161054 #3008779] INFO -- : Try with hash version of bundled gems instead of gems/power_assert-2.0.3.gem. We don't use this gem with release version of Ruby. I, [2024-05-07T10:23:48.166089 #3008779] INFO -- : Unpacked gems/power_assert-2.0.4dev.gem I, [2024-05-07T10:23:48.168381 #3008779] INFO -- : $$$[end] "make after-update -j20" exit with 0. I, [2024-05-07T10:23:48.168530 #3008779] INFO -- : $$$[beg] make miniruby -j20 I, [2024-05-07T10:23:48.226734 #3008779] INFO -- : BASERUBY = /usr/bin/ruby --disable=gems I, [2024-05-07T10:23:48.226773 #3008779] INFO -- : CC = gcc I, [2024-05-07T10:23:48.226786 #3008779] INFO -- : LD = ld I, [2024-05-07T10:23:48.226797 #3008779] INFO -- : LDSHARED = gcc -shared I, [2024-05-07T10:23:48.226808 #3008779] INFO -- : CFLAGS = -O3 -fno-fast-math -ggdb3 -Wall -Wextra -Wdeprecated-declarations -Wdiv-by-zero -Wduplicated-cond -Wimplicit-function-declaration -Wimplicit-int -Wpointer-arith -Wwrite-strings -Wold-style-definition -Wimplicit-fallthrough=0 -Wmissing-noreturn -Wno-cast-function-type -Wno-constant-logical-operand -Wno-long-long -Wno-missing-field-initializers -Wno-overlength-strings -Wno-packed-bitfield-compat -Wno-parentheses-equality -Wno-self-assign -Wno-tautological-compare -Wno-unused-parameter -Wno-unused-value -Wsuggest-attribute=format -Wsuggest-attribute=noreturn -Wunused-variable -Wmisleading-indentation -Wundef -fPIC I, [2024-05-07T10:23:48.226819 #3008779] INFO -- : XCFLAGS = -U_FORTIFY_SOURCE -D_FORTIFY_SOURCE=2 -fstack-protector-strong -fno-strict-overflow -fvisibility=hidden -fexcess-precision=standard -DRUBY_EXPORT -I. -I.ext/include/x86_64-linux -I/tmp/ruby/src/trunk/include -I/tmp/ruby/src/trunk -I/tmp/ruby/src/trunk/prism -I/tmp/ruby/src/trunk/enc/unicode/15.0.0 I, [2024-05-07T10:23:48.226839 #3008779] INFO -- : CPPFLAGS = I, [2024-05-07T10:23:48.226850 #3008779] INFO -- : DLDFLAGS = -Wl,--compress-debug-sections=zlib -Wl,-soname,libruby.so.3.4 -fstack-protector-strong I, [2024-05-07T10:23:48.226861 #3008779] INFO -- : SOLIBS = -lz -lrt -lrt -lgmp -ldl -lcrypt -lm -lpthread I, [2024-05-07T10:23:48.226871 #3008779] INFO -- : LANG = en_US.UTF-8 I, [2024-05-07T10:23:48.226881 #3008779] INFO -- : LC_ALL = I, [2024-05-07T10:23:48.226891 #3008779] INFO -- : LC_CTYPE = I, [2024-05-07T10:23:48.226901 #3008779] INFO -- : MFLAGS = -j20 --jobserver-auth=4,5 I, [2024-05-07T10:23:48.226910 #3008779] INFO -- : RUSTC = no I, [2024-05-07T10:23:48.226920 #3008779] INFO -- : YJIT_RUSTC_ARGS = --crate-name=yjit --crate-type=staticlib --edition=2021 -g -C lto=thin -C opt-level=3 -C overflow-checks=on '--out-dir=/tmp/ruby/build/trunk/yjit/target/release/' /tmp/ruby/src/trunk/yjit/src/lib.rs I, [2024-05-07T10:23:48.228206 #3008779] INFO -- : gcc (Ubuntu 11.4.0-1ubuntu1~22.04) 11.4.0 I, [2024-05-07T10:23:48.228247 #3008779] INFO -- : Copyright (C) 2021 Free Software Foundation, Inc. I, [2024-05-07T10:23:48.228260 #3008779] INFO -- : This is free software; see the source for copying conditions. There is NO I, [2024-05-07T10:23:48.228271 #3008779] INFO -- : warranty; not even for MERCHANTABILITY or FITNESS FOR A PARTICULAR PURPOSE. I, [2024-05-07T10:23:48.228282 #3008779] INFO -- : I, [2024-05-07T10:23:48.249796 #3008779] INFO -- : compiling /tmp/ruby/src/trunk/version.c I, [2024-05-07T10:23:48.354268 #3008779] INFO -- : linking miniruby I, [2024-05-07T10:23:48.885969 #3008779] INFO -- : $$$[end] "make miniruby -j20" exit with 0. I, [2024-05-07T10:23:48.886090 #3008779] INFO -- : $$$[beg] make ruby -j20 I, [2024-05-07T10:23:48.944610 #3008779] INFO -- : BASERUBY = /usr/bin/ruby --disable=gems I, [2024-05-07T10:23:48.944651 #3008779] INFO -- : CC = gcc I, [2024-05-07T10:23:48.944664 #3008779] INFO -- : LD = ld I, [2024-05-07T10:23:48.944674 #3008779] INFO -- : LDSHARED = gcc -shared I, [2024-05-07T10:23:48.944690 #3008779] INFO -- : CFLAGS = -O3 -fno-fast-math -ggdb3 -Wall -Wextra -Wdeprecated-declarations -Wdiv-by-zero -Wduplicated-cond -Wimplicit-function-declaration -Wimplicit-int -Wpointer-arith -Wwrite-strings -Wold-style-definition -Wimplicit-fallthrough=0 -Wmissing-noreturn -Wno-cast-function-type -Wno-constant-logical-operand -Wno-long-long -Wno-missing-field-initializers -Wno-overlength-strings -Wno-packed-bitfield-compat -Wno-parentheses-equality -Wno-self-assign -Wno-tautological-compare -Wno-unused-parameter -Wno-unused-value -Wsuggest-attribute=format -Wsuggest-attribute=noreturn -Wunused-variable -Wmisleading-indentation -Wundef -fPIC I, [2024-05-07T10:23:48.944703 #3008779] INFO -- : XCFLAGS = -U_FORTIFY_SOURCE -D_FORTIFY_SOURCE=2 -fstack-protector-strong -fno-strict-overflow -fvisibility=hidden -fexcess-precision=standard -DRUBY_EXPORT -I. -I.ext/include/x86_64-linux -I/tmp/ruby/src/trunk/include -I/tmp/ruby/src/trunk -I/tmp/ruby/src/trunk/prism -I/tmp/ruby/src/trunk/enc/unicode/15.0.0 I, [2024-05-07T10:23:48.944713 #3008779] INFO -- : CPPFLAGS = I, [2024-05-07T10:23:48.944723 #3008779] INFO -- : DLDFLAGS = -Wl,--compress-debug-sections=zlib -Wl,-soname,libruby.so.3.4 -fstack-protector-strong I, [2024-05-07T10:23:48.944734 #3008779] INFO -- : SOLIBS = -lz -lrt -lrt -lgmp -ldl -lcrypt -lm -lpthread I, [2024-05-07T10:23:48.944744 #3008779] INFO -- : LANG = en_US.UTF-8 I, [2024-05-07T10:23:48.944754 #3008779] INFO -- : LC_ALL = I, [2024-05-07T10:23:48.944764 #3008779] INFO -- : LC_CTYPE = I, [2024-05-07T10:23:48.944774 #3008779] INFO -- : MFLAGS = -j20 --jobserver-auth=4,5 I, [2024-05-07T10:23:48.944785 #3008779] INFO -- : RUSTC = no I, [2024-05-07T10:23:48.944795 #3008779] INFO -- : YJIT_RUSTC_ARGS = --crate-name=yjit --crate-type=staticlib --edition=2021 -g -C lto=thin -C opt-level=3 -C overflow-checks=on '--out-dir=/tmp/ruby/build/trunk/yjit/target/release/' /tmp/ruby/src/trunk/yjit/src/lib.rs I, [2024-05-07T10:23:48.946000 #3008779] INFO -- : gcc (Ubuntu 11.4.0-1ubuntu1~22.04) 11.4.0 I, [2024-05-07T10:23:48.946047 #3008779] INFO -- : Copyright (C) 2021 Free Software Foundation, Inc. I, [2024-05-07T10:23:48.946061 #3008779] INFO -- : This is free software; see the source for copying conditions. There is NO I, [2024-05-07T10:23:48.946072 #3008779] INFO -- : warranty; not even for MERCHANTABILITY or FITNESS FOR A PARTICULAR PURPOSE. I, [2024-05-07T10:23:48.946083 #3008779] INFO -- : I, [2024-05-07T10:23:49.055333 #3008779] INFO -- : builtin_binary.inc updated I, [2024-05-07T10:23:49.059745 #3008779] INFO -- : c5234a9416e4f20f175185e840b25b0f08674d14078ed7083f37e655458e3ca9 builtin_binary.inc I, [2024-05-07T10:23:49.060530 #3008779] INFO -- : compiling /tmp/ruby/src/trunk/builtin.c I, [2024-05-07T10:23:49.245109 #3008779] INFO -- : linking static-library libruby-static.a I, [2024-05-07T10:23:49.559775 #3008779] INFO -- : linking shared-library libruby.so.3.4.0 I, [2024-05-07T10:23:51.133335 #3008779] INFO -- : linking ruby I, [2024-05-07T10:23:51.156777 #3008779] INFO -- : $$$[end] "make ruby -j20" exit with 0. I, [2024-05-07T10:23:51.156929 #3008779] INFO -- : $$$[beg] make all -j20 I, [2024-05-07T10:23:51.213587 #3008779] INFO -- : BASERUBY = /usr/bin/ruby --disable=gems I, [2024-05-07T10:23:51.213628 #3008779] INFO -- : CC = gcc I, [2024-05-07T10:23:51.213642 #3008779] INFO -- : LD = ld I, [2024-05-07T10:23:51.213653 #3008779] INFO -- : LDSHARED = gcc -shared I, [2024-05-07T10:23:51.213664 #3008779] INFO -- : CFLAGS = -O3 -fno-fast-math -ggdb3 -Wall -Wextra -Wdeprecated-declarations -Wdiv-by-zero -Wduplicated-cond -Wimplicit-function-declaration -Wimplicit-int -Wpointer-arith -Wwrite-strings -Wold-style-definition -Wimplicit-fallthrough=0 -Wmissing-noreturn -Wno-cast-function-type -Wno-constant-logical-operand -Wno-long-long -Wno-missing-field-initializers -Wno-overlength-strings -Wno-packed-bitfield-compat -Wno-parentheses-equality -Wno-self-assign -Wno-tautological-compare -Wno-unused-parameter -Wno-unused-value -Wsuggest-attribute=format -Wsuggest-attribute=noreturn -Wunused-variable -Wmisleading-indentation -Wundef -fPIC I, [2024-05-07T10:23:51.213678 #3008779] INFO -- : XCFLAGS = -U_FORTIFY_SOURCE -D_FORTIFY_SOURCE=2 -fstack-protector-strong -fno-strict-overflow -fvisibility=hidden -fexcess-precision=standard -DRUBY_EXPORT -I. -I.ext/include/x86_64-linux -I/tmp/ruby/src/trunk/include -I/tmp/ruby/src/trunk -I/tmp/ruby/src/trunk/prism -I/tmp/ruby/src/trunk/enc/unicode/15.0.0 I, [2024-05-07T10:23:51.213689 #3008779] INFO -- : CPPFLAGS = I, [2024-05-07T10:23:51.213699 #3008779] INFO -- : DLDFLAGS = -Wl,--compress-debug-sections=zlib -Wl,-soname,libruby.so.3.4 -fstack-protector-strong I, [2024-05-07T10:23:51.213709 #3008779] INFO -- : SOLIBS = -lz -lrt -lrt -lgmp -ldl -lcrypt -lm -lpthread I, [2024-05-07T10:23:51.213719 #3008779] INFO -- : LANG = en_US.UTF-8 I, [2024-05-07T10:23:51.213729 #3008779] INFO -- : LC_ALL = I, [2024-05-07T10:23:51.213740 #3008779] INFO -- : LC_CTYPE = I, [2024-05-07T10:23:51.213750 #3008779] INFO -- : MFLAGS = -j20 --jobserver-auth=4,5 I, [2024-05-07T10:23:51.213761 #3008779] INFO -- : RUSTC = no I, [2024-05-07T10:23:51.213773 #3008779] INFO -- : YJIT_RUSTC_ARGS = --crate-name=yjit --crate-type=staticlib --edition=2021 -g -C lto=thin -C opt-level=3 -C overflow-checks=on '--out-dir=/tmp/ruby/build/trunk/yjit/target/release/' /tmp/ruby/src/trunk/yjit/src/lib.rs I, [2024-05-07T10:23:51.215025 #3008779] INFO -- : gcc (Ubuntu 11.4.0-1ubuntu1~22.04) 11.4.0 I, [2024-05-07T10:23:51.215068 #3008779] INFO -- : Copyright (C) 2021 Free Software Foundation, Inc. I, [2024-05-07T10:23:51.215080 #3008779] INFO -- : This is free software; see the source for copying conditions. There is NO I, [2024-05-07T10:23:51.215092 #3008779] INFO -- : warranty; not even for MERCHANTABILITY or FITNESS FOR A PARTICULAR PURPOSE. I, [2024-05-07T10:23:51.215112 #3008779] INFO -- : I, [2024-05-07T10:23:51.244560 #3008779] INFO -- : generating enc.mk I, [2024-05-07T10:23:51.246402 #3008779] INFO -- : building spec/ruby/optional/capi/ext/array_spec.so I, [2024-05-07T10:23:51.246541 #3008779] INFO -- : building spec/ruby/optional/capi/ext/basic_object_spec.so I, [2024-05-07T10:23:51.246848 #3008779] INFO -- : building spec/ruby/optional/capi/ext/bignum_spec.so I, [2024-05-07T10:23:51.247519 #3008779] INFO -- : building spec/ruby/optional/capi/ext/binding_spec.so I, [2024-05-07T10:23:51.248058 #3008779] INFO -- : building spec/ruby/optional/capi/ext/boolean_spec.so I, [2024-05-07T10:23:51.248437 #3008779] INFO -- : building spec/ruby/optional/capi/ext/class_id_under_autoload_spec.so I, [2024-05-07T10:23:51.248828 #3008779] INFO -- : building spec/ruby/optional/capi/ext/class_spec.so I, [2024-05-07T10:23:51.250156 #3008779] INFO -- : building spec/ruby/optional/capi/ext/class_under_autoload_spec.so I, [2024-05-07T10:23:51.250460 #3008779] INFO -- : building spec/ruby/optional/capi/ext/complex_spec.so I, [2024-05-07T10:23:51.251048 #3008779] INFO -- : building spec/ruby/optional/capi/ext/constants_spec.so I, [2024-05-07T10:23:51.251761 #3008779] INFO -- : building spec/ruby/optional/capi/ext/data_spec.so I, [2024-05-07T10:23:51.252003 #3008779] INFO -- : building spec/ruby/optional/capi/ext/debug_spec.so I, [2024-05-07T10:23:51.252579 #3008779] INFO -- : building spec/ruby/optional/capi/ext/encoding_spec.so I, [2024-05-07T10:23:51.252916 #3008779] INFO -- : building spec/ruby/optional/capi/ext/enumerator_spec.so I, [2024-05-07T10:23:51.253645 #3008779] INFO -- : building spec/ruby/optional/capi/ext/exception_spec.so I, [2024-05-07T10:23:51.253881 #3008779] INFO -- : building spec/ruby/optional/capi/ext/fiber_spec.so I, [2024-05-07T10:23:51.254592 #3008779] INFO -- : building spec/ruby/optional/capi/ext/file_spec.so I, [2024-05-07T10:23:51.254887 #3008779] INFO -- : building spec/ruby/optional/capi/ext/fixnum_spec.so I, [2024-05-07T10:23:51.269140 #3008779] INFO -- : building spec/ruby/optional/capi/ext/float_spec.so I, [2024-05-07T10:23:51.381656 #3008779] INFO -- : building spec/ruby/optional/capi/ext/gc_spec.so I, [2024-05-07T10:23:51.386415 #3008779] INFO -- : building spec/ruby/optional/capi/ext/globals_spec.so I, [2024-05-07T10:23:51.397020 #3008779] INFO -- : building spec/ruby/optional/capi/ext/hash_spec.so I, [2024-05-07T10:23:51.399301 #3008779] INFO -- : building spec/ruby/optional/capi/ext/integer_spec.so I, [2024-05-07T10:23:51.402922 #3008779] INFO -- : building spec/ruby/optional/capi/ext/io_spec.so I, [2024-05-07T10:23:51.416481 #3008779] INFO -- : building spec/ruby/optional/capi/ext/kernel_spec.so I, [2024-05-07T10:23:51.418892 #3008779] INFO -- : building spec/ruby/optional/capi/ext/language_spec.so I, [2024-05-07T10:23:51.424159 #3008779] INFO -- : building spec/ruby/optional/capi/ext/marshal_spec.so I, [2024-05-07T10:23:51.439203 #3008779] INFO -- : building spec/ruby/optional/capi/ext/module_spec.so I, [2024-05-07T10:23:51.445998 #3008779] INFO -- : building spec/ruby/optional/capi/ext/module_under_autoload_spec.so I, [2024-05-07T10:23:51.446768 #3008779] INFO -- : building spec/ruby/optional/capi/ext/mutex_spec.so I, [2024-05-07T10:23:51.447095 #3008779] INFO -- : building spec/ruby/optional/capi/ext/numeric_spec.so I, [2024-05-07T10:23:51.450727 #3008779] INFO -- : building spec/ruby/optional/capi/ext/object_spec.so I, [2024-05-07T10:23:51.461868 #3008779] INFO -- : building spec/ruby/optional/capi/ext/proc_spec.so I, [2024-05-07T10:23:51.477016 #3008779] INFO -- : building spec/ruby/optional/capi/ext/range_spec.so I, [2024-05-07T10:23:51.504112 #3008779] INFO -- : building spec/ruby/optional/capi/ext/rational_spec.so I, [2024-05-07T10:23:51.524950 #3008779] INFO -- : building spec/ruby/optional/capi/ext/rbasic_spec.so I, [2024-05-07T10:23:51.526104 #3008779] INFO -- : building spec/ruby/optional/capi/ext/regexp_spec.so I, [2024-05-07T10:23:51.563941 #3008779] INFO -- : building spec/ruby/optional/capi/ext/string_spec.so I, [2024-05-07T10:23:51.564604 #3008779] INFO -- : building spec/ruby/optional/capi/ext/struct_spec.so I, [2024-05-07T10:23:51.568570 #3008779] INFO -- : building spec/ruby/optional/capi/ext/st_spec.so I, [2024-05-07T10:23:51.570117 #3008779] INFO -- : building spec/ruby/optional/capi/ext/symbol_spec.so I, [2024-05-07T10:23:51.571257 #3008779] INFO -- : building spec/ruby/optional/capi/ext/thread_spec.so I, [2024-05-07T10:23:51.573832 #3008779] INFO -- : building spec/ruby/optional/capi/ext/time_spec.so I, [2024-05-07T10:23:51.587874 #3008779] INFO -- : building spec/ruby/optional/capi/ext/tracepoint_spec.so I, [2024-05-07T10:23:51.593707 #3008779] INFO -- : building spec/ruby/optional/capi/ext/typed_data_spec.so I, [2024-05-07T10:23:51.602846 #3008779] INFO -- : building spec/ruby/optional/capi/ext/util_spec.so I, [2024-05-07T10:23:51.603192 #3008779] INFO -- : making enc I, [2024-05-07T10:23:51.633447 #3008779] INFO -- : make[1]: Entering directory '/tmp/ruby/build/trunk' I, [2024-05-07T10:23:51.633517 #3008779] INFO -- : make[1]: Nothing to be done for 'enc'. I, [2024-05-07T10:23:51.633545 #3008779] INFO -- : make[1]: Leaving directory '/tmp/ruby/build/trunk' I, [2024-05-07T10:23:51.634455 #3008779] INFO -- : making srcs under enc I, [2024-05-07T10:23:51.682269 #3008779] INFO -- : make[1]: Entering directory '/tmp/ruby/build/trunk' I, [2024-05-07T10:23:51.682356 #3008779] INFO -- : make[1]: Nothing to be done for 'srcs'. I, [2024-05-07T10:23:51.682399 #3008779] INFO -- : make[1]: Leaving directory '/tmp/ruby/build/trunk' I, [2024-05-07T10:23:51.683308 #3008779] INFO -- : generating transdb.h I, [2024-05-07T10:23:51.807549 #3008779] INFO -- : transdb.h unchanged I, [2024-05-07T10:23:51.808829 #3008779] INFO -- : generating makefiles ext/configure-ext.mk I, [2024-05-07T10:23:51.808993 #3008779] INFO -- : making trans I, [2024-05-07T10:23:51.835374 #3008779] INFO -- : ext/configure-ext.mk updated I, [2024-05-07T10:23:51.837572 #3008779] INFO -- : make[1]: Entering directory '/tmp/ruby/build/trunk' I, [2024-05-07T10:23:51.845275 #3008779] INFO -- : make[1]: Entering directory '/tmp/ruby/build/trunk' I, [2024-05-07T10:23:51.845365 #3008779] INFO -- : make[1]: Nothing to be done for 'trans'. I, [2024-05-07T10:23:51.845395 #3008779] INFO -- : make[1]: Leaving directory '/tmp/ruby/build/trunk' I, [2024-05-07T10:23:51.932797 #3008779] INFO -- : making encs I, [2024-05-07T10:23:51.990612 #3008779] INFO -- : make[1]: Entering directory '/tmp/ruby/build/trunk' I, [2024-05-07T10:23:51.990659 #3008779] INFO -- : make[1]: Nothing to be done for 'encs'. I, [2024-05-07T10:23:51.990665 #3008779] INFO -- : make[1]: Leaving directory '/tmp/ruby/build/trunk' I, [2024-05-07T10:23:52.013817 #3008779] INFO -- : make[1]: Leaving directory '/tmp/ruby/build/trunk' I, [2024-05-07T10:23:52.014449 #3008779] INFO -- : generating makefile exts.mk I, [2024-05-07T10:23:52.052921 #3008779] INFO -- : exts.mk unchanged I, [2024-05-07T10:23:52.057844 #3008779] INFO -- : make[1]: Entering directory '/tmp/ruby/build/trunk' I, [2024-05-07T10:23:52.079178 #3008779] INFO -- : make[2]: Entering directory '/tmp/ruby/build/trunk/ext/digest' I, [2024-05-07T10:23:52.079421 #3008779] INFO -- : make[2]: Entering directory '/tmp/ruby/build/trunk/ext/json' I, [2024-05-07T10:23:52.081155 #3008779] INFO -- : make[2]: Entering directory '/tmp/ruby/build/trunk/ext/coverage' I, [2024-05-07T10:23:52.081322 #3008779] INFO -- : make[2]: Entering directory '/tmp/ruby/build/trunk/ext/io/console' I, [2024-05-07T10:23:52.081355 #3008779] INFO -- : make[2]: Entering directory '/tmp/ruby/build/trunk/ext/monitor' I, [2024-05-07T10:23:52.081951 #3008779] INFO -- : make[2]: Entering directory '/tmp/ruby/build/trunk/ext/date' I, [2024-05-07T10:23:52.083245 #3008779] INFO -- : make[2]: Entering directory '/tmp/ruby/build/trunk/ext/objspace' I, [2024-05-07T10:23:52.083299 #3008779] INFO -- : make[2]: Entering directory '/tmp/ruby/build/trunk/ext/pathname' I, [2024-05-07T10:23:52.083445 #3008779] INFO -- : make[2]: Entering directory '/tmp/ruby/build/trunk/ext/rubyvm' I, [2024-05-07T10:23:52.083792 #3008779] INFO -- : make[2]: Entering directory '/tmp/ruby/build/trunk/ext/fiddle' I, [2024-05-07T10:23:52.083814 #3008779] INFO -- : make[2]: Leaving directory '/tmp/ruby/build/trunk/ext/digest' I, [2024-05-07T10:23:52.084000 #3008779] INFO -- : make[2]: Entering directory '/tmp/ruby/build/trunk/ext/pty' I, [2024-05-07T10:23:52.084287 #3008779] INFO -- : make[2]: Leaving directory '/tmp/ruby/build/trunk/ext/coverage' I, [2024-05-07T10:23:52.084643 #3008779] INFO -- : make[2]: Leaving directory '/tmp/ruby/build/trunk/ext/monitor' I, [2024-05-07T10:23:52.084750 #3008779] INFO -- : make[2]: Leaving directory '/tmp/ruby/build/trunk/ext/io/console' I, [2024-05-07T10:23:52.085055 #3008779] INFO -- : make[2]: Leaving directory '/tmp/ruby/build/trunk/ext/json' I, [2024-05-07T10:23:52.085480 #3008779] INFO -- : make[2]: Leaving directory '/tmp/ruby/build/trunk/ext/rubyvm' I, [2024-05-07T10:23:52.085652 #3008779] INFO -- : make[2]: Leaving directory '/tmp/ruby/build/trunk/ext/date' I, [2024-05-07T10:23:52.085748 #3008779] INFO -- : make[2]: Entering directory '/tmp/ruby/build/trunk/ext/psych' I, [2024-05-07T10:23:52.086027 #3008779] INFO -- : make[2]: Leaving directory '/tmp/ruby/build/trunk/ext/pathname' I, [2024-05-07T10:23:52.086509 #3008779] INFO -- : make[2]: Leaving directory '/tmp/ruby/build/trunk/ext/pty' I, [2024-05-07T10:23:52.087004 #3008779] INFO -- : make[2]: Entering directory '/tmp/ruby/build/trunk/.bundle/gems/bigdecimal-3.1.7/ext/bigdecimal' I, [2024-05-07T10:23:52.087076 #3008779] INFO -- : make[2]: Entering directory '/tmp/ruby/build/trunk/.bundle/gems/debug-1.9.2/ext/debug' I, [2024-05-07T10:23:52.087563 #3008779] INFO -- : make[2]: Entering directory '/tmp/ruby/build/trunk/.bundle/gems/bigdecimal-3.1.8/ext/bigdecimal' I, [2024-05-07T10:23:52.087646 #3008779] INFO -- : make[2]: Entering directory '/tmp/ruby/build/trunk/.bundle/gems/nkf-0.2.0/ext/nkf' I, [2024-05-07T10:23:52.087944 #3008779] INFO -- : make[2]: Leaving directory '/tmp/ruby/build/trunk/ext/objspace' I, [2024-05-07T10:23:52.089535 #3008779] INFO -- : make[2]: Entering directory '/tmp/ruby/build/trunk/ext/ripper' I, [2024-05-07T10:23:52.090012 #3008779] INFO -- : make[2]: Leaving directory '/tmp/ruby/build/trunk/ext/fiddle' I, [2024-05-07T10:23:52.090426 #3008779] INFO -- : make[2]: Entering directory '/tmp/ruby/build/trunk/.bundle/gems/syslog-0.1.2/ext/syslog' I, [2024-05-07T10:23:52.090576 #3008779] INFO -- : make[2]: Entering directory '/tmp/ruby/build/trunk/.bundle/gems/racc-1.7.3/ext/racc/cparse' I, [2024-05-07T10:23:52.091049 #3008779] INFO -- : make[2]: Entering directory '/tmp/ruby/build/trunk/.bundle/gems/rbs-3.4.4/ext/rbs_extension' I, [2024-05-07T10:23:52.093419 #3008779] INFO -- : make[2]: Entering directory '/tmp/ruby/build/trunk/ext/socket' I, [2024-05-07T10:23:52.093567 #3008779] INFO -- : make[2]: Entering directory '/tmp/ruby/build/trunk/ext/openssl' I, [2024-05-07T10:23:52.094172 #3008779] INFO -- : make[2]: Entering directory '/tmp/ruby/build/trunk/ext/digest/sha2' I, [2024-05-07T10:23:52.094917 #3008779] INFO -- : make[2]: Leaving directory '/tmp/ruby/build/trunk/ext/ripper' I, [2024-05-07T10:23:52.097573 #3008779] INFO -- : make[2]: Leaving directory '/tmp/ruby/build/trunk/ext/digest/sha2' I, [2024-05-07T10:23:52.098456 #3008779] INFO -- : make[2]: Leaving directory '/tmp/ruby/build/trunk/ext/psych' I, [2024-05-07T10:23:52.100744 #3008779] INFO -- : make[2]: Leaving directory '/tmp/ruby/build/trunk/ext/socket' I, [2024-05-07T10:23:52.110269 #3008779] INFO -- : make[2]: Leaving directory '/tmp/ruby/build/trunk/ext/openssl' I, [2024-05-07T10:23:52.111018 #3008779] INFO -- : make[2]: Leaving directory '/tmp/ruby/build/trunk/.bundle/gems/debug-1.9.2/ext/debug' I, [2024-05-07T10:23:52.111387 #3008779] INFO -- : make[2]: Leaving directory '/tmp/ruby/build/trunk/.bundle/gems/nkf-0.2.0/ext/nkf' I, [2024-05-07T10:23:52.111466 #3008779] INFO -- : make[2]: Leaving directory '/tmp/ruby/build/trunk/.bundle/gems/bigdecimal-3.1.7/ext/bigdecimal' I, [2024-05-07T10:23:52.121406 #3008779] INFO -- : make[2]: Leaving directory '/tmp/ruby/build/trunk/.bundle/gems/bigdecimal-3.1.8/ext/bigdecimal' I, [2024-05-07T10:23:52.123580 #3008779] INFO -- : make[2]: Leaving directory '/tmp/ruby/build/trunk/.bundle/gems/rbs-3.4.4/ext/rbs_extension' I, [2024-05-07T10:23:52.126222 #3008779] INFO -- : make[2]: Leaving directory '/tmp/ruby/build/trunk/.bundle/gems/syslog-0.1.2/ext/syslog' I, [2024-05-07T10:23:52.127243 #3008779] INFO -- : make[2]: Leaving directory '/tmp/ruby/build/trunk/.bundle/gems/racc-1.7.3/ext/racc/cparse' I, [2024-05-07T10:23:52.151015 #3008779] INFO -- : make[2]: Entering directory '/tmp/ruby/build/trunk' I, [2024-05-07T10:23:52.215936 #3008779] INFO -- : linking ruby I, [2024-05-07T10:23:52.239109 #3008779] INFO -- : make[2]: Leaving directory '/tmp/ruby/build/trunk' I, [2024-05-07T10:23:52.239668 #3008779] INFO -- : make[1]: Leaving directory '/tmp/ruby/build/trunk' I, [2024-05-07T10:23:52.243516 #3008779] INFO -- : make[1]: Entering directory '/tmp/ruby/build/trunk' I, [2024-05-07T10:23:52.243541 #3008779] INFO -- : make[1]: Nothing to be done for 'note'. I, [2024-05-07T10:23:52.243547 #3008779] INFO -- : make[1]: Leaving directory '/tmp/ruby/build/trunk' I, [2024-05-07T10:23:52.244283 #3008779] INFO -- : $$$[end] "make all -j20" exit with 0. I, [2024-05-07T10:23:52.244424 #3008779] INFO -- : $$$[beg] make install -j20 I, [2024-05-07T10:23:52.308085 #3008779] INFO -- : Update minitest to ea9caafc0754b1d6236a490d59e624b53209734a I, [2024-05-07T10:23:52.308259 #3008779] INFO -- : Update power_assert to 84e85124c5014a139af39161d484156cfe87a9ed I, [2024-05-07T10:23:52.308366 #3008779] INFO -- : Update rbs to ba7872795d5de04adb8ff500c0e6afdc81a041dd I, [2024-05-07T10:23:52.309258 #3008779] INFO -- : Update typeprof to b19a6416da3a05d57fadd6ffdadb382b6d236ca5 I, [2024-05-07T10:23:52.309893 #3008779] INFO -- : echo ea9caafc0754b1d6236a490d59e624b53209734a | /bin/sh /tmp/ruby/src/trunk/tool/ifchange /tmp/ruby/src/trunk/.bundle/.timestamp/minitest.revision - I, [2024-05-07T10:23:52.310056 #3008779] INFO -- : echo 84e85124c5014a139af39161d484156cfe87a9ed | /bin/sh /tmp/ruby/src/trunk/tool/ifchange /tmp/ruby/src/trunk/.bundle/.timestamp/power_assert.revision - I, [2024-05-07T10:23:52.310368 #3008779] INFO -- : echo ba7872795d5de04adb8ff500c0e6afdc81a041dd | /bin/sh /tmp/ruby/src/trunk/tool/ifchange /tmp/ruby/src/trunk/.bundle/.timestamp/rbs.revision - I, [2024-05-07T10:23:52.310942 #3008779] INFO -- : BASERUBY = /usr/bin/ruby --disable=gems I, [2024-05-07T10:23:52.310987 #3008779] INFO -- : CC = gcc I, [2024-05-07T10:23:52.311000 #3008779] INFO -- : LD = ld I, [2024-05-07T10:23:52.311011 #3008779] INFO -- : LDSHARED = gcc -shared I, [2024-05-07T10:23:52.311023 #3008779] INFO -- : CFLAGS = -O3 -fno-fast-math -ggdb3 -Wall -Wextra -Wdeprecated-declarations -Wdiv-by-zero -Wduplicated-cond -Wimplicit-function-declaration -Wimplicit-int -Wpointer-arith -Wwrite-strings -Wold-style-definition -Wimplicit-fallthrough=0 -Wmissing-noreturn -Wno-cast-function-type -Wno-constant-logical-operand -Wno-long-long -Wno-missing-field-initializers -Wno-overlength-strings -Wno-packed-bitfield-compat -Wno-parentheses-equality -Wno-self-assign -Wno-tautological-compare -Wno-unused-parameter -Wno-unused-value -Wsuggest-attribute=format -Wsuggest-attribute=noreturn -Wunused-variable -Wmisleading-indentation -Wundef -fPIC I, [2024-05-07T10:23:52.311036 #3008779] INFO -- : XCFLAGS = -U_FORTIFY_SOURCE -D_FORTIFY_SOURCE=2 -fstack-protector-strong -fno-strict-overflow -fvisibility=hidden -fexcess-precision=standard -DRUBY_EXPORT -I. -I.ext/include/x86_64-linux -I/tmp/ruby/src/trunk/include -I/tmp/ruby/src/trunk -I/tmp/ruby/src/trunk/prism -I/tmp/ruby/src/trunk/enc/unicode/15.0.0 I, [2024-05-07T10:23:52.311053 #3008779] INFO -- : CPPFLAGS = I, [2024-05-07T10:23:52.311068 #3008779] INFO -- : DLDFLAGS = -Wl,--compress-debug-sections=zlib -Wl,-soname,libruby.so.3.4 -fstack-protector-strong I, [2024-05-07T10:23:52.311095 #3008779] INFO -- : SOLIBS = -lz -lrt -lrt -lgmp -ldl -lcrypt -lm -lpthread I, [2024-05-07T10:23:52.311110 #3008779] INFO -- : LANG = en_US.UTF-8 I, [2024-05-07T10:23:52.311125 #3008779] INFO -- : LC_ALL = I, [2024-05-07T10:23:52.311139 #3008779] INFO -- : LC_CTYPE = I, [2024-05-07T10:23:52.311160 #3008779] INFO -- : MFLAGS = -j20 --jobserver-auth=4,5 I, [2024-05-07T10:23:52.311175 #3008779] INFO -- : RUSTC = no I, [2024-05-07T10:23:52.311189 #3008779] INFO -- : YJIT_RUSTC_ARGS = --crate-name=yjit --crate-type=staticlib --edition=2021 -g -C lto=thin -C opt-level=3 -C overflow-checks=on '--out-dir=/tmp/ruby/build/trunk/yjit/target/release/' /tmp/ruby/src/trunk/yjit/src/lib.rs I, [2024-05-07T10:23:52.311752 #3008779] INFO -- : /tmp/ruby/src/trunk/.bundle/.timestamp/minitest.revision unchanged I, [2024-05-07T10:23:52.311887 #3008779] INFO -- : /tmp/ruby/src/trunk/.bundle/.timestamp/power_assert.revision unchanged I, [2024-05-07T10:23:52.312097 #3008779] INFO -- : /tmp/ruby/src/trunk/.bundle/.timestamp/rbs.revision unchanged I, [2024-05-07T10:23:52.337705 #3008779] INFO -- : echo b19a6416da3a05d57fadd6ffdadb382b6d236ca5 | /bin/sh /tmp/ruby/src/trunk/tool/ifchange /tmp/ruby/src/trunk/.bundle/.timestamp/typeprof.revision - I, [2024-05-07T10:23:52.338351 #3008779] INFO -- : generating enc.mk I, [2024-05-07T10:23:52.338403 #3008779] INFO -- : gcc (Ubuntu 11.4.0-1ubuntu1~22.04) 11.4.0 I, [2024-05-07T10:23:52.338416 #3008779] INFO -- : Copyright (C) 2021 Free Software Foundation, Inc. I, [2024-05-07T10:23:52.338428 #3008779] INFO -- : This is free software; see the source for copying conditions. There is NO I, [2024-05-07T10:23:52.338439 #3008779] INFO -- : warranty; not even for MERCHANTABILITY or FITNESS FOR A PARTICULAR PURPOSE. I, [2024-05-07T10:23:52.338449 #3008779] INFO -- : I, [2024-05-07T10:23:52.339500 #3008779] INFO -- : /tmp/ruby/src/trunk/.bundle/.timestamp/typeprof.revision unchanged I, [2024-05-07T10:23:52.460190 #3008779] INFO -- : Building power_assert@84e85124c5014a139af39161d484156cfe87a9ed to /tmp/ruby/src/trunk/gems/power_assert-2.0.3.gem I, [2024-05-07T10:23:52.460450 #3008779] INFO -- : making srcs under enc I, [2024-05-07T10:23:52.461102 #3008779] INFO -- : making enc I, [2024-05-07T10:23:52.477783 #3008779] INFO -- : make[1]: Entering directory '/tmp/ruby/build/trunk' I, [2024-05-07T10:23:52.477833 #3008779] INFO -- : make[1]: Nothing to be done for 'enc'. I, [2024-05-07T10:23:52.477846 #3008779] INFO -- : make[1]: Leaving directory '/tmp/ruby/build/trunk' I, [2024-05-07T10:23:52.490413 #3008779] INFO -- : make[1]: Entering directory '/tmp/ruby/build/trunk' I, [2024-05-07T10:23:52.490473 #3008779] INFO -- : make[1]: Nothing to be done for 'srcs'. I, [2024-05-07T10:23:52.490487 #3008779] INFO -- : make[1]: Leaving directory '/tmp/ruby/build/trunk' I, [2024-05-07T10:23:52.491230 #3008779] INFO -- : generating transdb.h I, [2024-05-07T10:23:52.529102 #3008779] INFO -- : Successfully built RubyGem I, [2024-05-07T10:23:52.529171 #3008779] INFO -- : Name: power_assert I, [2024-05-07T10:23:52.529185 #3008779] INFO -- : Version: 2.0.4dev I, [2024-05-07T10:23:52.529197 #3008779] INFO -- : File: power_assert-2.0.4dev.gem I, [2024-05-07T10:23:52.531330 #3008779] INFO -- : Extracting bundle gem power_assert-2.0.3... I, [2024-05-07T10:23:52.586261 #3008779] INFO -- : transdb.h unchanged I, [2024-05-07T10:23:52.587993 #3008779] INFO -- : generating makefiles ext/configure-ext.mk I, [2024-05-07T10:23:52.588305 #3008779] INFO -- : making trans I, [2024-05-07T10:23:52.593589 #3008779] INFO -- : Try with hash version of bundled gems instead of gems/power_assert-2.0.3.gem. We don't use this gem with release version of Ruby. I, [2024-05-07T10:23:52.598570 #3008779] INFO -- : Unpacked gems/power_assert-2.0.4dev.gem I, [2024-05-07T10:23:52.615125 #3008779] INFO -- : ext/configure-ext.mk unchanged I, [2024-05-07T10:23:52.617563 #3008779] INFO -- : make[1]: Entering directory '/tmp/ruby/build/trunk' I, [2024-05-07T10:23:52.625458 #3008779] INFO -- : make[1]: Entering directory '/tmp/ruby/build/trunk' I, [2024-05-07T10:23:52.625533 #3008779] INFO -- : make[1]: Nothing to be done for 'trans'. I, [2024-05-07T10:23:52.625547 #3008779] INFO -- : make[1]: Leaving directory '/tmp/ruby/build/trunk' I, [2024-05-07T10:23:52.626279 #3008779] INFO -- : making encs I, [2024-05-07T10:23:52.684818 #3008779] INFO -- : make[1]: Entering directory '/tmp/ruby/build/trunk' I, [2024-05-07T10:23:52.684890 #3008779] INFO -- : make[1]: Nothing to be done for 'encs'. I, [2024-05-07T10:23:52.684918 #3008779] INFO -- : make[1]: Leaving directory '/tmp/ruby/build/trunk' I, [2024-05-07T10:23:52.774706 #3008779] INFO -- : make[1]: Leaving directory '/tmp/ruby/build/trunk' I, [2024-05-07T10:23:52.775381 #3008779] INFO -- : generating makefile exts.mk I, [2024-05-07T10:23:52.813743 #3008779] INFO -- : exts.mk unchanged I, [2024-05-07T10:23:52.818604 #3008779] INFO -- : make[1]: Entering directory '/tmp/ruby/build/trunk' I, [2024-05-07T10:23:52.838100 #3008779] INFO -- : make[2]: Entering directory '/tmp/ruby/build/trunk/ext/digest' I, [2024-05-07T10:23:52.839489 #3008779] INFO -- : make[2]: Entering directory '/tmp/ruby/build/trunk/ext/coverage' I, [2024-05-07T10:23:52.840185 #3008779] INFO -- : make[2]: Entering directory '/tmp/ruby/build/trunk/ext/json' I, [2024-05-07T10:23:52.840327 #3008779] INFO -- : make[2]: Entering directory '/tmp/ruby/build/trunk/ext/date' I, [2024-05-07T10:23:52.841530 #3008779] INFO -- : make[2]: Entering directory '/tmp/ruby/build/trunk/ext/io/console' I, [2024-05-07T10:23:52.841846 #3008779] INFO -- : make[2]: Entering directory '/tmp/ruby/build/trunk/ext/monitor' I, [2024-05-07T10:23:52.842195 #3008779] INFO -- : make[2]: Entering directory '/tmp/ruby/build/trunk/ext/rubyvm' I, [2024-05-07T10:23:52.842446 #3008779] INFO -- : make[2]: Leaving directory '/tmp/ruby/build/trunk/ext/digest' I, [2024-05-07T10:23:52.842647 #3008779] INFO -- : make[2]: Entering directory '/tmp/ruby/build/trunk/ext/pathname' I, [2024-05-07T10:23:52.843098 #3008779] INFO -- : make[2]: Leaving directory '/tmp/ruby/build/trunk/ext/coverage' I, [2024-05-07T10:23:52.843128 #3008779] INFO -- : make[2]: Entering directory '/tmp/ruby/build/trunk/ext/fiddle' I, [2024-05-07T10:23:52.843191 #3008779] INFO -- : make[2]: Entering directory '/tmp/ruby/build/trunk/ext/pty' I, [2024-05-07T10:23:52.844184 #3008779] INFO -- : make[2]: Leaving directory '/tmp/ruby/build/trunk/ext/date' I, [2024-05-07T10:23:52.844207 #3008779] INFO -- : make[2]: Entering directory '/tmp/ruby/build/trunk/ext/objspace' I, [2024-05-07T10:23:52.844347 #3008779] INFO -- : make[2]: Leaving directory '/tmp/ruby/build/trunk/ext/monitor' I, [2024-05-07T10:23:52.844373 #3008779] INFO -- : make[2]: Leaving directory '/tmp/ruby/build/trunk/ext/rubyvm' I, [2024-05-07T10:23:52.844882 #3008779] INFO -- : make[2]: Leaving directory '/tmp/ruby/build/trunk/ext/io/console' I, [2024-05-07T10:23:52.844981 #3008779] INFO -- : make[2]: Entering directory '/tmp/ruby/build/trunk/ext/psych' I, [2024-05-07T10:23:52.845364 #3008779] INFO -- : make[2]: Leaving directory '/tmp/ruby/build/trunk/ext/pathname' I, [2024-05-07T10:23:52.845978 #3008779] INFO -- : make[2]: Leaving directory '/tmp/ruby/build/trunk/ext/pty' I, [2024-05-07T10:23:52.847340 #3008779] INFO -- : make[2]: Entering directory '/tmp/ruby/build/trunk/ext/ripper' I, [2024-05-07T10:23:52.847615 #3008779] INFO -- : make[2]: Entering directory '/tmp/ruby/build/trunk/.bundle/gems/bigdecimal-3.1.7/ext/bigdecimal' I, [2024-05-07T10:23:52.847696 #3008779] INFO -- : make[2]: Entering directory '/tmp/ruby/build/trunk/.bundle/gems/debug-1.9.2/ext/debug' I, [2024-05-07T10:23:52.847722 #3008779] INFO -- : make[2]: Entering directory '/tmp/ruby/build/trunk/.bundle/gems/bigdecimal-3.1.8/ext/bigdecimal' I, [2024-05-07T10:23:52.847790 #3008779] INFO -- : make[2]: Entering directory '/tmp/ruby/build/trunk/.bundle/gems/nkf-0.2.0/ext/nkf' I, [2024-05-07T10:23:52.847823 #3008779] INFO -- : make[2]: Entering directory '/tmp/ruby/build/trunk/.bundle/gems/racc-1.7.3/ext/racc/cparse' I, [2024-05-07T10:23:52.848735 #3008779] INFO -- : make[2]: Entering directory '/tmp/ruby/build/trunk/.bundle/gems/syslog-0.1.2/ext/syslog' I, [2024-05-07T10:23:52.848769 #3008779] INFO -- : make[2]: Entering directory '/tmp/ruby/build/trunk/.bundle/gems/rbs-3.4.4/ext/rbs_extension' I, [2024-05-07T10:23:52.848839 #3008779] INFO -- : make[2]: Leaving directory '/tmp/ruby/build/trunk/ext/json' I, [2024-05-07T10:23:52.849498 #3008779] INFO -- : make[2]: Leaving directory '/tmp/ruby/build/trunk/ext/fiddle' I, [2024-05-07T10:23:52.854265 #3008779] INFO -- : make[2]: Entering directory '/tmp/ruby/build/trunk/ext/socket' I, [2024-05-07T10:23:52.854320 #3008779] INFO -- : make[2]: Leaving directory '/tmp/ruby/build/trunk/ext/ripper' I, [2024-05-07T10:23:52.855650 #3008779] INFO -- : make[2]: Leaving directory '/tmp/ruby/build/trunk/ext/objspace' I, [2024-05-07T10:23:52.856573 #3008779] INFO -- : make[2]: Entering directory '/tmp/ruby/build/trunk/ext/openssl' I, [2024-05-07T10:23:52.856759 #3008779] INFO -- : make[2]: Entering directory '/tmp/ruby/build/trunk/ext/digest/sha2' I, [2024-05-07T10:23:52.857548 #3008779] INFO -- : make[2]: Leaving directory '/tmp/ruby/build/trunk/ext/psych' I, [2024-05-07T10:23:52.860068 #3008779] INFO -- : make[2]: Leaving directory '/tmp/ruby/build/trunk/ext/digest/sha2' I, [2024-05-07T10:23:52.862710 #3008779] INFO -- : make[2]: Leaving directory '/tmp/ruby/build/trunk/ext/socket' I, [2024-05-07T10:23:52.871229 #3008779] INFO -- : make[2]: Leaving directory '/tmp/ruby/build/trunk/.bundle/gems/syslog-0.1.2/ext/syslog' I, [2024-05-07T10:23:52.871974 #3008779] INFO -- : make[2]: Leaving directory '/tmp/ruby/build/trunk/ext/openssl' I, [2024-05-07T10:23:52.872392 #3008779] INFO -- : make[2]: Leaving directory '/tmp/ruby/build/trunk/.bundle/gems/bigdecimal-3.1.7/ext/bigdecimal' I, [2024-05-07T10:23:52.874565 #3008779] INFO -- : make[2]: Leaving directory '/tmp/ruby/build/trunk/.bundle/gems/debug-1.9.2/ext/debug' I, [2024-05-07T10:23:52.879376 #3008779] INFO -- : make[2]: Leaving directory '/tmp/ruby/build/trunk/.bundle/gems/racc-1.7.3/ext/racc/cparse' I, [2024-05-07T10:23:52.881351 #3008779] INFO -- : make[2]: Leaving directory '/tmp/ruby/build/trunk/.bundle/gems/nkf-0.2.0/ext/nkf' I, [2024-05-07T10:23:52.881811 #3008779] INFO -- : make[2]: Leaving directory '/tmp/ruby/build/trunk/.bundle/gems/rbs-3.4.4/ext/rbs_extension' I, [2024-05-07T10:23:52.884304 #3008779] INFO -- : make[2]: Leaving directory '/tmp/ruby/build/trunk/.bundle/gems/bigdecimal-3.1.8/ext/bigdecimal' I, [2024-05-07T10:23:52.907789 #3008779] INFO -- : make[2]: Entering directory '/tmp/ruby/build/trunk' I, [2024-05-07T10:23:52.974138 #3008779] INFO -- : make[2]: 'ruby' is up to date. I, [2024-05-07T10:23:52.974153 #3008779] INFO -- : make[2]: Leaving directory '/tmp/ruby/build/trunk' I, [2024-05-07T10:23:52.974582 #3008779] INFO -- : make[1]: Leaving directory '/tmp/ruby/build/trunk' I, [2024-05-07T10:23:52.978385 #3008779] INFO -- : make[1]: Entering directory '/tmp/ruby/build/trunk' I, [2024-05-07T10:23:52.978407 #3008779] INFO -- : make[1]: Nothing to be done for 'note'. I, [2024-05-07T10:23:52.978413 #3008779] INFO -- : make[1]: Leaving directory '/tmp/ruby/build/trunk' I, [2024-05-07T10:23:52.978643 #3008779] INFO -- : ./miniruby -I/tmp/ruby/src/trunk/lib -I. -I.ext/common /tmp/ruby/src/trunk/tool/runruby.rb --extout=.ext -- --disable-gems -r./x86_64-linux-fake /tmp/ruby/src/trunk/tool/rbinstall.rb --make="make" --dest-dir="" --extout=".ext" --ext-build-dir="./ext" --mflags="-j20 --jobserver-auth=4,5" --make-flags=" -j20 --jobserver-auth=4,5" --data-mode=0644 --prog-mode=0755 --installed-list .installed.list --mantype="doc" --gnumake --install=all --exclude=doc I, [2024-05-07T10:23:53.074697 #3008779] INFO -- : Installing to I, [2024-05-07T10:23:53.074756 #3008779] INFO -- : installing binary commands: /tmp/ruby/install/trunk/bin I, [2024-05-07T10:23:53.074846 #3008779] INFO -- : installing base libraries: /tmp/ruby/install/trunk/lib I, [2024-05-07T10:23:53.082180 #3008779] INFO -- : installing arch files: /tmp/ruby/install/trunk/lib/ruby/3.4.0+0/x86_64-linux I, [2024-05-07T10:23:53.082213 #3008779] INFO -- : installing pkgconfig data: /tmp/ruby/install/trunk/lib/pkgconfig I, [2024-05-07T10:23:53.082220 #3008779] INFO -- : installing extension objects: /tmp/ruby/install/trunk/lib/ruby/3.4.0+0/x86_64-linux I, [2024-05-07T10:23:53.092113 #3008779] INFO -- : installing extension objects: /tmp/ruby/install/trunk/lib/ruby/site_ruby/3.4.0+0/x86_64-linux I, [2024-05-07T10:23:53.092144 #3008779] INFO -- : installing extension objects: /tmp/ruby/install/trunk/lib/ruby/vendor_ruby/3.4.0+0/x86_64-linux I, [2024-05-07T10:23:53.092152 #3008779] INFO -- : installing extension headers: /tmp/ruby/install/trunk/include/ruby-3.4.0+0/x86_64-linux I, [2024-05-07T10:23:53.092305 #3008779] INFO -- : installing extension scripts: /tmp/ruby/install/trunk/lib/ruby/3.4.0+0 I, [2024-05-07T10:23:53.096143 #3008779] INFO -- : installing extension scripts: /tmp/ruby/install/trunk/lib/ruby/site_ruby/3.4.0+0 I, [2024-05-07T10:23:53.096168 #3008779] INFO -- : installing extension scripts: /tmp/ruby/install/trunk/lib/ruby/vendor_ruby/3.4.0+0 I, [2024-05-07T10:23:53.096174 #3008779] INFO -- : installing extension headers: /tmp/ruby/install/trunk/include/ruby-3.4.0+0/ruby I, [2024-05-07T10:23:53.096179 #3008779] INFO -- : installing command scripts: /tmp/ruby/install/trunk/bin I, [2024-05-07T10:23:53.096184 #3008779] INFO -- : installing library scripts: /tmp/ruby/install/trunk/lib/ruby/3.4.0+0 I, [2024-05-07T10:23:53.130678 #3008779] INFO -- : installing common headers: /tmp/ruby/install/trunk/include/ruby-3.4.0+0 I, [2024-05-07T10:23:53.136132 #3008779] INFO -- : installing manpages: /tmp/ruby/install/trunk/share/man/man1 I, [2024-05-07T10:23:53.136247 #3008779] INFO -- : installing default gems from lib: /tmp/ruby/install/trunk/lib/ruby/gems/3.4.0+0 I, [2024-05-07T10:23:53.158706 #3008779] INFO -- : benchmark 0.3.0 I, [2024-05-07T10:23:53.165761 #3008779] INFO -- : bundler 2.6.0.dev I, [2024-05-07T10:23:53.167837 #3008779] INFO -- : cgi 0.4.1 I, [2024-05-07T10:23:53.168336 #3008779] INFO -- : delegate 0.3.1 I, [2024-05-07T10:23:53.168869 #3008779] INFO -- : did_you_mean 1.6.3 I, [2024-05-07T10:23:53.169344 #3008779] INFO -- : english 0.8.0 I, [2024-05-07T10:23:53.169789 #3008779] INFO -- : erb 4.0.4 I, [2024-05-07T10:23:53.170575 #3008779] INFO -- : error_highlight 0.6.0 I, [2024-05-07T10:23:53.170990 #3008779] INFO -- : fileutils 1.7.2 I, [2024-05-07T10:23:53.171439 #3008779] INFO -- : find 0.2.0 I, [2024-05-07T10:23:53.171830 #3008779] INFO -- : forwardable 1.3.3 I, [2024-05-07T10:23:53.172330 #3008779] INFO -- : ipaddr 1.2.6 I, [2024-05-07T10:23:53.172837 #3008779] INFO -- : irb 1.13.1 I, [2024-05-07T10:23:53.174331 #3008779] INFO -- : logger 1.6.0 I, [2024-05-07T10:23:53.174847 #3008779] INFO -- : net-http 0.4.1 I, [2024-05-07T10:23:53.175365 #3008779] INFO -- : net-protocol 0.2.2 I, [2024-05-07T10:23:53.175834 #3008779] INFO -- : open-uri 0.4.1 I, [2024-05-07T10:23:53.176281 #3008779] INFO -- : open3 0.2.1 I, [2024-05-07T10:23:53.176816 #3008779] INFO -- : optparse 0.5.0 I, [2024-05-07T10:23:53.177333 #3008779] INFO -- : ostruct 0.6.0 I, [2024-05-07T10:23:53.177697 #3008779] INFO -- : pp 0.5.0 I, [2024-05-07T10:23:53.178167 #3008779] INFO -- : prettyprint 0.2.0 I, [2024-05-07T10:23:53.178614 #3008779] INFO -- : prism 0.27.0 I, [2024-05-07T10:23:53.179121 #3008779] INFO -- : pstore 0.1.3 I, [2024-05-07T10:23:53.179666 #3008779] INFO -- : rdoc 6.6.3.1 I, [2024-05-07T10:23:53.181387 #3008779] INFO -- : readline 0.0.4 I, [2024-05-07T10:23:53.181968 #3008779] INFO -- : reline 0.5.5 I, [2024-05-07T10:23:53.182513 #3008779] INFO -- : resolv 0.4.0 I, [2024-05-07T10:23:53.182986 #3008779] INFO -- : ruby2_keywords 0.0.5 I, [2024-05-07T10:23:53.183458 #3008779] INFO -- : securerandom 0.3.1 I, [2024-05-07T10:23:53.183941 #3008779] INFO -- : set 1.1.0 I, [2024-05-07T10:23:53.184438 #3008779] INFO -- : shellwords 0.2.0 I, [2024-05-07T10:23:53.184938 #3008779] INFO -- : singleton 0.2.0 I, [2024-05-07T10:23:53.185379 #3008779] INFO -- : syntax_suggest 2.0.0 I, [2024-05-07T10:23:53.186018 #3008779] INFO -- : tempfile 0.2.1 I, [2024-05-07T10:23:53.186550 #3008779] INFO -- : time 0.3.0 I, [2024-05-07T10:23:53.187417 #3008779] INFO -- : timeout 0.4.1 I, [2024-05-07T10:23:53.188113 #3008779] INFO -- : tmpdir 0.2.0 I, [2024-05-07T10:23:53.188721 #3008779] INFO -- : tsort 0.2.0 I, [2024-05-07T10:23:53.189240 #3008779] INFO -- : un 0.3.0 I, [2024-05-07T10:23:53.189805 #3008779] INFO -- : uri 0.13.0 I, [2024-05-07T10:23:53.190337 #3008779] INFO -- : weakref 0.1.3 I, [2024-05-07T10:23:53.190805 #3008779] INFO -- : yaml 0.3.0 I, [2024-05-07T10:23:53.191093 #3008779] INFO -- : installing default gems from ext: /tmp/ruby/install/trunk/lib/ruby/gems/3.4.0+0 I, [2024-05-07T10:23:53.198066 #3008779] INFO -- : date 3.3.4 I, [2024-05-07T10:23:53.198661 #3008779] INFO -- : digest 3.1.1 I, [2024-05-07T10:23:53.199140 #3008779] INFO -- : etc 1.4.3 I, [2024-05-07T10:23:53.199654 #3008779] INFO -- : fcntl 1.1.0 I, [2024-05-07T10:23:53.200233 #3008779] INFO -- : fiddle 1.1.3 I, [2024-05-07T10:23:53.200722 #3008779] INFO -- : io-console 0.7.2 I, [2024-05-07T10:23:53.201215 #3008779] INFO -- : io-nonblock 0.3.0 I, [2024-05-07T10:23:53.201608 #3008779] INFO -- : io-wait 0.3.1 I, [2024-05-07T10:23:53.202049 #3008779] INFO -- : json 2.7.2 I, [2024-05-07T10:23:53.203121 #3008779] INFO -- : openssl 3.2.0 I, [2024-05-07T10:23:53.203765 #3008779] INFO -- : pathname 0.3.0 I, [2024-05-07T10:23:53.204219 #3008779] INFO -- : psych 5.1.2 I, [2024-05-07T10:23:53.204816 #3008779] INFO -- : stringio 3.1.1 I, [2024-05-07T10:23:53.205394 #3008779] INFO -- : strscan 3.1.1 I, [2024-05-07T10:23:53.205875 #3008779] INFO -- : zlib 3.1.0 I, [2024-05-07T10:23:53.206235 #3008779] INFO -- : installing bundled gems: /tmp/ruby/install/trunk/lib/ruby/gems/3.4.0+0 I, [2024-05-07T10:23:53.206546 #3008779] INFO -- : minitest 5.22.3 I, [2024-05-07T10:23:53.214048 #3008779] INFO -- : rake 13.2.1 I, [2024-05-07T10:23:53.217576 #3008779] INFO -- : test-unit 3.6.2 I, [2024-05-07T10:23:53.222048 #3008779] INFO -- : rexml 3.2.6 I, [2024-05-07T10:23:53.225607 #3008779] INFO -- : rss 0.3.0 I, [2024-05-07T10:23:53.228563 #3008779] INFO -- : net-ftp 0.3.4 I, [2024-05-07T10:23:53.230054 #3008779] INFO -- : net-imap 0.4.10 I, [2024-05-07T10:23:53.233063 #3008779] INFO -- : net-pop 0.1.2 I, [2024-05-07T10:23:53.233959 #3008779] INFO -- : net-smtp 0.5.0 I, [2024-05-07T10:23:53.235009 #3008779] INFO -- : matrix 0.4.2 I, [2024-05-07T10:23:53.238538 #3008779] INFO -- : prime 0.1.2 I, [2024-05-07T10:23:53.244244 #3008779] INFO -- : rbs 3.4.4 I, [2024-05-07T10:23:53.266752 #3008779] INFO -- : typeprof 0.21.11 I, [2024-05-07T10:23:53.269396 #3008779] INFO -- : debug 1.9.2 I, [2024-05-07T10:23:53.272123 #3008779] INFO -- : racc 1.7.3 I, [2024-05-07T10:23:53.275259 #3008779] INFO -- : mutex_m 0.2.0 I, [2024-05-07T10:23:53.276324 #3008779] INFO -- : getoptlong 0.2.1 I, [2024-05-07T10:23:53.277661 #3008779] INFO -- : base64 0.2.0 I, [2024-05-07T10:23:53.278647 #3008779] INFO -- : bigdecimal 3.1.8 I, [2024-05-07T10:23:53.280834 #3008779] INFO -- : observer 0.1.2 I, [2024-05-07T10:23:53.282346 #3008779] INFO -- : abbrev 0.1.2 I, [2024-05-07T10:23:53.283367 #3008779] INFO -- : resolv-replace 0.1.1 I, [2024-05-07T10:23:53.284685 #3008779] INFO -- : rinda 0.2.0 I, [2024-05-07T10:23:53.285860 #3008779] INFO -- : drb 2.2.1 I, [2024-05-07T10:23:53.287463 #3008779] INFO -- : nkf 0.2.0 I, [2024-05-07T10:23:53.289806 #3008779] INFO -- : syslog 0.1.2 I, [2024-05-07T10:23:53.291347 #3008779] INFO -- : csv 3.3.0 I, [2024-05-07T10:23:53.293442 #3008779] INFO -- : installing bundled gem cache: /tmp/ruby/install/trunk/lib/ruby/gems/3.4.0+0/cache I, [2024-05-07T10:23:53.294908 #3008779] INFO -- : skipped bundled gems: I, [2024-05-07T10:23:53.294929 #3008779] INFO -- : power_assert-2.0.4dev.gem not found in bundled_gems I, [2024-05-07T10:23:53.298126 #3008779] INFO -- : $$$[end] "make install -j20" exit with 0. I, [2024-05-07T10:23:53.298223 #3008779] INFO -- : $$$[beg] make yes-btest TESTOPTS='-q -j20' I, [2024-05-07T10:23:58.758524 #3008779] INFO -- : PASS all 1936 tests E, [2024-05-07T10:23:58.764484 #3008779] ERROR -- : I, [2024-05-07T10:23:58.764797 #3008779] INFO -- : $$$[end] "make yes-btest TESTOPTS='-q -j20'" exit with 0. I, [2024-05-07T10:23:58.764879 #3008779] INFO -- : $$$[beg] make yes-test-basic TESTS='-j20' I, [2024-05-07T10:23:58.824752 #3008779] INFO -- : BASERUBY = /usr/bin/ruby --disable=gems I, [2024-05-07T10:23:58.824779 #3008779] INFO -- : CC = gcc I, [2024-05-07T10:23:58.824784 #3008779] INFO -- : LD = ld I, [2024-05-07T10:23:58.824788 #3008779] INFO -- : LDSHARED = gcc -shared I, [2024-05-07T10:23:58.824792 #3008779] INFO -- : CFLAGS = -O3 -fno-fast-math -ggdb3 -Wall -Wextra -Wdeprecated-declarations -Wdiv-by-zero -Wduplicated-cond -Wimplicit-function-declaration -Wimplicit-int -Wpointer-arith -Wwrite-strings -Wold-style-definition -Wimplicit-fallthrough=0 -Wmissing-noreturn -Wno-cast-function-type -Wno-constant-logical-operand -Wno-long-long -Wno-missing-field-initializers -Wno-overlength-strings -Wno-packed-bitfield-compat -Wno-parentheses-equality -Wno-self-assign -Wno-tautological-compare -Wno-unused-parameter -Wno-unused-value -Wsuggest-attribute=format -Wsuggest-attribute=noreturn -Wunused-variable -Wmisleading-indentation -Wundef -fPIC I, [2024-05-07T10:23:58.824802 #3008779] INFO -- : XCFLAGS = -U_FORTIFY_SOURCE -D_FORTIFY_SOURCE=2 -fstack-protector-strong -fno-strict-overflow -fvisibility=hidden -fexcess-precision=standard -DRUBY_EXPORT -I. -I.ext/include/x86_64-linux -I/tmp/ruby/src/trunk/include -I/tmp/ruby/src/trunk -I/tmp/ruby/src/trunk/prism -I/tmp/ruby/src/trunk/enc/unicode/15.0.0 I, [2024-05-07T10:23:58.824811 #3008779] INFO -- : CPPFLAGS = I, [2024-05-07T10:23:58.824815 #3008779] INFO -- : DLDFLAGS = -Wl,--compress-debug-sections=zlib -Wl,-soname,libruby.so.3.4 -fstack-protector-strong I, [2024-05-07T10:23:58.824819 #3008779] INFO -- : SOLIBS = -lz -lrt -lrt -lgmp -ldl -lcrypt -lm -lpthread I, [2024-05-07T10:23:58.824823 #3008779] INFO -- : LANG = en_US.UTF-8 I, [2024-05-07T10:23:58.824826 #3008779] INFO -- : LC_ALL = I, [2024-05-07T10:23:58.824830 #3008779] INFO -- : LC_CTYPE = I, [2024-05-07T10:23:58.824833 #3008779] INFO -- : MFLAGS = I, [2024-05-07T10:23:58.824836 #3008779] INFO -- : RUSTC = no I, [2024-05-07T10:23:58.824840 #3008779] INFO -- : YJIT_RUSTC_ARGS = --crate-name=yjit --crate-type=staticlib --edition=2021 -g -C lto=thin -C opt-level=3 -C overflow-checks=on '--out-dir=/tmp/ruby/build/trunk/yjit/target/release/' /tmp/ruby/src/trunk/yjit/src/lib.rs I, [2024-05-07T10:23:58.825412 #3008779] INFO -- : gcc (Ubuntu 11.4.0-1ubuntu1~22.04) 11.4.0 I, [2024-05-07T10:23:58.825433 #3008779] INFO -- : Copyright (C) 2021 Free Software Foundation, Inc. I, [2024-05-07T10:23:58.825446 #3008779] INFO -- : This is free software; see the source for copying conditions. There is NO I, [2024-05-07T10:23:58.825450 #3008779] INFO -- : warranty; not even for MERCHANTABILITY or FITNESS FOR A PARTICULAR PURPOSE. I, [2024-05-07T10:23:58.825454 #3008779] INFO -- : I, [2024-05-07T10:23:58.930970 #3008779] INFO -- : Checking leaked global symbols...none I, [2024-05-07T10:23:58.972056 #3008779] INFO -- : /tmp/ruby/src/trunk/basictest/test.rb:assignment ....................................................................................................................................................................................................................................................................................................................................................................................OK 372 I, [2024-05-07T10:23:58.972161 #3008779] INFO -- : /tmp/ruby/src/trunk/basictest/test.rb:condition ..OK 2 I, [2024-05-07T10:23:58.972169 #3008779] INFO -- : /tmp/ruby/src/trunk/basictest/test.rb:if/unless ...OK 3 I, [2024-05-07T10:23:58.972173 #3008779] INFO -- : /tmp/ruby/src/trunk/basictest/test.rb:case .....OK 5 I, [2024-05-07T10:23:58.972335 #3008779] INFO -- : /tmp/ruby/src/trunk/basictest/test.rb:while/until ........OK 8 I, [2024-05-07T10:23:58.972392 #3008779] INFO -- : /tmp/ruby/src/trunk/basictest/test.rb:exception ..........OK 10 I, [2024-05-07T10:23:58.972666 #3008779] INFO -- : /tmp/ruby/src/trunk/basictest/test.rb:array .......................................OK 39 I, [2024-05-07T10:23:58.972767 #3008779] INFO -- : /tmp/ruby/src/trunk/basictest/test.rb:hash ...........................OK 27 I, [2024-05-07T10:23:58.973491 #3008779] INFO -- : /tmp/ruby/src/trunk/basictest/test.rb:iterator ...........................................................................................................OK 107 I, [2024-05-07T10:23:58.973773 #3008779] INFO -- : /tmp/ruby/src/trunk/basictest/test.rb:float ................................................................................OK 80 I, [2024-05-07T10:23:58.974787 #3008779] INFO -- : /tmp/ruby/src/trunk/basictest/test.rb:bignum ...............................OK 31 I, [2024-05-07T10:23:58.975563 #3008779] INFO -- : /tmp/ruby/src/trunk/basictest/test.rb:string & char ..............................................................OK 62 I, [2024-05-07T10:23:58.975598 #3008779] INFO -- : /tmp/ruby/src/trunk/basictest/test.rb:assignment ..........OK 10 I, [2024-05-07T10:23:58.975627 #3008779] INFO -- : /tmp/ruby/src/trunk/basictest/test.rb:call ......OK 6 I, [2024-05-07T10:23:58.975681 #3008779] INFO -- : /tmp/ruby/src/trunk/basictest/test.rb:proc .........OK 9 I, [2024-05-07T10:23:59.075967 #3008779] INFO -- : /tmp/ruby/src/trunk/basictest/test.rb:signal ..OK 2 I, [2024-05-07T10:23:59.076447 #3008779] INFO -- : /tmp/ruby/src/trunk/basictest/test.rb:eval ...........................OK 27 I, [2024-05-07T10:23:59.177328 #3008779] INFO -- : /tmp/ruby/src/trunk/basictest/test.rb:system ........OK 8 I, [2024-05-07T10:23:59.177399 #3008779] INFO -- : /tmp/ruby/src/trunk/basictest/test.rb:const .....OK 5 I, [2024-05-07T10:23:59.177428 #3008779] INFO -- : /tmp/ruby/src/trunk/basictest/test.rb:clone .....OK 5 I, [2024-05-07T10:23:59.177585 #3008779] INFO -- : /tmp/ruby/src/trunk/basictest/test.rb:marshal ....OK 4 I, [2024-05-07T10:23:59.177642 #3008779] INFO -- : /tmp/ruby/src/trunk/basictest/test.rb:pack ....OK 4 I, [2024-05-07T10:23:59.177658 #3008779] INFO -- : /tmp/ruby/src/trunk/basictest/test.rb:math ..OK 2 I, [2024-05-07T10:23:59.177715 #3008779] INFO -- : /tmp/ruby/src/trunk/basictest/test.rb:struct ......OK 6 I, [2024-05-07T10:23:59.177809 #3008779] INFO -- : /tmp/ruby/src/trunk/basictest/test.rb:variable ............OK 12 I, [2024-05-07T10:23:59.177834 #3008779] INFO -- : /tmp/ruby/src/trunk/basictest/test.rb:trace ...OK 3 I, [2024-05-07T10:23:59.177894 #3008779] INFO -- : /tmp/ruby/src/trunk/basictest/test.rb:defined? ............OK 12 I, [2024-05-07T10:23:59.177943 #3008779] INFO -- : /tmp/ruby/src/trunk/basictest/test.rb:alias ......OK 6 I, [2024-05-07T10:23:59.178317 #3008779] INFO -- : /tmp/ruby/src/trunk/basictest/test.rb:path .......................OK 23 I, [2024-05-07T10:23:59.212897 #3008779] INFO -- : /tmp/ruby/src/trunk/basictest/test.rb:gc ....OK 4 I, [2024-05-07T10:23:59.215306 #3008779] INFO -- : I, [2024-05-07T10:23:59.215327 #3008779] INFO -- : test succeeded I, [2024-05-07T10:23:59.217111 #3008779] INFO -- : $$$[end] "make yes-test-basic TESTS='-j20'" exit with 0. I, [2024-05-07T10:23:59.217218 #3008779] INFO -- : $$$[beg] make yes-test-all TESTOPTS='--stderr-on-failure' TESTS='-j20' I, [2024-05-07T10:23:59.303714 #3008779] INFO -- : BASERUBY = /usr/bin/ruby --disable=gems I, [2024-05-07T10:23:59.303756 #3008779] INFO -- : CC = gcc I, [2024-05-07T10:23:59.303762 #3008779] INFO -- : LD = ld I, [2024-05-07T10:23:59.303768 #3008779] INFO -- : LDSHARED = gcc -shared I, [2024-05-07T10:23:59.303773 #3008779] INFO -- : CFLAGS = -O3 -fno-fast-math -ggdb3 -Wall -Wextra -Wdeprecated-declarations -Wdiv-by-zero -Wduplicated-cond -Wimplicit-function-declaration -Wimplicit-int -Wpointer-arith -Wwrite-strings -Wold-style-definition -Wimplicit-fallthrough=0 -Wmissing-noreturn -Wno-cast-function-type -Wno-constant-logical-operand -Wno-long-long -Wno-missing-field-initializers -Wno-overlength-strings -Wno-packed-bitfield-compat -Wno-parentheses-equality -Wno-self-assign -Wno-tautological-compare -Wno-unused-parameter -Wno-unused-value -Wsuggest-attribute=format -Wsuggest-attribute=noreturn -Wunused-variable -Wmisleading-indentation -Wundef -fPIC I, [2024-05-07T10:23:59.303779 #3008779] INFO -- : XCFLAGS = -U_FORTIFY_SOURCE -D_FORTIFY_SOURCE=2 -fstack-protector-strong -fno-strict-overflow -fvisibility=hidden -fexcess-precision=standard -DRUBY_EXPORT -I. -I.ext/include/x86_64-linux -I/tmp/ruby/src/trunk/include -I/tmp/ruby/src/trunk -I/tmp/ruby/src/trunk/prism -I/tmp/ruby/src/trunk/enc/unicode/15.0.0 I, [2024-05-07T10:23:59.303784 #3008779] INFO -- : CPPFLAGS = I, [2024-05-07T10:23:59.303788 #3008779] INFO -- : DLDFLAGS = -Wl,--compress-debug-sections=zlib -Wl,-soname,libruby.so.3.4 -fstack-protector-strong I, [2024-05-07T10:23:59.303801 #3008779] INFO -- : SOLIBS = -lz -lrt -lrt -lgmp -ldl -lcrypt -lm -lpthread I, [2024-05-07T10:23:59.303806 #3008779] INFO -- : LANG = en_US.UTF-8 I, [2024-05-07T10:23:59.303811 #3008779] INFO -- : LC_ALL = I, [2024-05-07T10:23:59.303815 #3008779] INFO -- : LC_CTYPE = I, [2024-05-07T10:23:59.303821 #3008779] INFO -- : MFLAGS = I, [2024-05-07T10:23:59.303825 #3008779] INFO -- : RUSTC = no I, [2024-05-07T10:23:59.303829 #3008779] INFO -- : YJIT_RUSTC_ARGS = --crate-name=yjit --crate-type=staticlib --edition=2021 -g -C lto=thin -C opt-level=3 -C overflow-checks=on '--out-dir=/tmp/ruby/build/trunk/yjit/target/release/' /tmp/ruby/src/trunk/yjit/src/lib.rs I, [2024-05-07T10:23:59.304357 #3008779] INFO -- : gcc (Ubuntu 11.4.0-1ubuntu1~22.04) 11.4.0 I, [2024-05-07T10:23:59.304381 #3008779] INFO -- : Copyright (C) 2021 Free Software Foundation, Inc. I, [2024-05-07T10:23:59.304387 #3008779] INFO -- : This is free software; see the source for copying conditions. There is NO I, [2024-05-07T10:23:59.304392 #3008779] INFO -- : warranty; not even for MERCHANTABILITY or FITNESS FOR A PARTICULAR PURPOSE. I, [2024-05-07T10:23:59.304397 #3008779] INFO -- : I, [2024-05-07T10:23:59.306048 #3008779] INFO -- : generating enc.mk I, [2024-05-07T10:23:59.424654 #3008779] INFO -- : making enc I, [2024-05-07T10:23:59.441818 #3008779] INFO -- : make[1]: Entering directory '/tmp/ruby/build/trunk' I, [2024-05-07T10:23:59.441840 #3008779] INFO -- : make[1]: Nothing to be done for 'enc'. I, [2024-05-07T10:23:59.441846 #3008779] INFO -- : make[1]: Leaving directory '/tmp/ruby/build/trunk' I, [2024-05-07T10:23:59.442515 #3008779] INFO -- : making srcs under enc I, [2024-05-07T10:23:59.472196 #3008779] INFO -- : make[1]: Entering directory '/tmp/ruby/build/trunk' I, [2024-05-07T10:23:59.472217 #3008779] INFO -- : make[1]: Nothing to be done for 'srcs'. I, [2024-05-07T10:23:59.472223 #3008779] INFO -- : make[1]: Leaving directory '/tmp/ruby/build/trunk' I, [2024-05-07T10:23:59.473085 #3008779] INFO -- : generating transdb.h I, [2024-05-07T10:23:59.567534 #3008779] INFO -- : transdb.h unchanged I, [2024-05-07T10:23:59.568787 #3008779] INFO -- : making trans I, [2024-05-07T10:23:59.603191 #3008779] INFO -- : make[1]: Entering directory '/tmp/ruby/build/trunk' I, [2024-05-07T10:23:59.603212 #3008779] INFO -- : make[1]: Nothing to be done for 'trans'. I, [2024-05-07T10:23:59.603217 #3008779] INFO -- : make[1]: Leaving directory '/tmp/ruby/build/trunk' I, [2024-05-07T10:23:59.603874 #3008779] INFO -- : making encs I, [2024-05-07T10:23:59.641985 #3008779] INFO -- : make[1]: Entering directory '/tmp/ruby/build/trunk' I, [2024-05-07T10:23:59.642005 #3008779] INFO -- : make[1]: Nothing to be done for 'encs'. I, [2024-05-07T10:23:59.642011 #3008779] INFO -- : make[1]: Leaving directory '/tmp/ruby/build/trunk' I, [2024-05-07T10:23:59.643787 #3008779] INFO -- : generating makefiles ext/configure-ext.mk I, [2024-05-07T10:23:59.671874 #3008779] INFO -- : ext/configure-ext.mk updated I, [2024-05-07T10:23:59.674372 #3008779] INFO -- : make[1]: Entering directory '/tmp/ruby/build/trunk' I, [2024-05-07T10:24:01.076713 #3008779] INFO -- : make[1]: Leaving directory '/tmp/ruby/build/trunk' I, [2024-05-07T10:24:01.077459 #3008779] INFO -- : generating makefile exts.mk I, [2024-05-07T10:24:01.114114 #3008779] INFO -- : exts.mk unchanged I, [2024-05-07T10:24:01.118716 #3008779] INFO -- : make[1]: Entering directory '/tmp/ruby/build/trunk' I, [2024-05-07T10:24:01.328623 #3008779] INFO -- : make[2]: Entering directory '/tmp/ruby/build/trunk/ext/coverage' I, [2024-05-07T10:24:01.331511 #3008779] INFO -- : make[2]: Leaving directory '/tmp/ruby/build/trunk/ext/coverage' I, [2024-05-07T10:24:01.335422 #3008779] INFO -- : make[2]: Entering directory '/tmp/ruby/build/trunk/ext/date' I, [2024-05-07T10:24:01.338522 #3008779] INFO -- : make[2]: Leaving directory '/tmp/ruby/build/trunk/ext/date' I, [2024-05-07T10:24:01.340874 #3008779] INFO -- : make[2]: Entering directory '/tmp/ruby/build/trunk/ext/digest' I, [2024-05-07T10:24:01.346327 #3008779] INFO -- : make[2]: Leaving directory '/tmp/ruby/build/trunk/ext/digest' I, [2024-05-07T10:24:01.362349 #3008779] INFO -- : make[2]: Entering directory '/tmp/ruby/build/trunk/ext/digest/sha2' I, [2024-05-07T10:24:01.365261 #3008779] INFO -- : make[2]: Leaving directory '/tmp/ruby/build/trunk/ext/digest/sha2' I, [2024-05-07T10:24:01.378153 #3008779] INFO -- : make[2]: Entering directory '/tmp/ruby/build/trunk/ext/fiddle' I, [2024-05-07T10:24:01.384489 #3008779] INFO -- : make[2]: Leaving directory '/tmp/ruby/build/trunk/ext/fiddle' I, [2024-05-07T10:24:01.387659 #3008779] INFO -- : make[2]: Entering directory '/tmp/ruby/build/trunk/ext/io/console' I, [2024-05-07T10:24:01.390249 #3008779] INFO -- : make[2]: Leaving directory '/tmp/ruby/build/trunk/ext/io/console' I, [2024-05-07T10:24:01.398201 #3008779] INFO -- : make[2]: Entering directory '/tmp/ruby/build/trunk/ext/json' I, [2024-05-07T10:24:01.404449 #3008779] INFO -- : make[2]: Leaving directory '/tmp/ruby/build/trunk/ext/json' I, [2024-05-07T10:24:01.413933 #3008779] INFO -- : make[2]: Entering directory '/tmp/ruby/build/trunk/ext/monitor' I, [2024-05-07T10:24:01.416419 #3008779] INFO -- : make[2]: Leaving directory '/tmp/ruby/build/trunk/ext/monitor' I, [2024-05-07T10:24:01.420637 #3008779] INFO -- : make[2]: Entering directory '/tmp/ruby/build/trunk/ext/objspace' I, [2024-05-07T10:24:01.424255 #3008779] INFO -- : make[2]: Leaving directory '/tmp/ruby/build/trunk/ext/objspace' I, [2024-05-07T10:24:01.436218 #3008779] INFO -- : make[2]: Entering directory '/tmp/ruby/build/trunk/ext/openssl' I, [2024-05-07T10:24:01.449178 #3008779] INFO -- : make[2]: Leaving directory '/tmp/ruby/build/trunk/ext/openssl' I, [2024-05-07T10:24:01.452089 #3008779] INFO -- : make[2]: Entering directory '/tmp/ruby/build/trunk/ext/pathname' I, [2024-05-07T10:24:01.454564 #3008779] INFO -- : make[2]: Leaving directory '/tmp/ruby/build/trunk/ext/pathname' I, [2024-05-07T10:24:01.458875 #3008779] INFO -- : make[2]: Entering directory '/tmp/ruby/build/trunk/ext/psych' I, [2024-05-07T10:24:01.473615 #3008779] INFO -- : make[2]: Leaving directory '/tmp/ruby/build/trunk/ext/psych' I, [2024-05-07T10:24:01.476720 #3008779] INFO -- : make[2]: Entering directory '/tmp/ruby/build/trunk/ext/pty' I, [2024-05-07T10:24:01.479203 #3008779] INFO -- : make[2]: Leaving directory '/tmp/ruby/build/trunk/ext/pty' I, [2024-05-07T10:24:01.488761 #3008779] INFO -- : make[2]: Entering directory '/tmp/ruby/build/trunk/ext/ripper' I, [2024-05-07T10:24:01.493663 #3008779] INFO -- : make[2]: Leaving directory '/tmp/ruby/build/trunk/ext/ripper' I, [2024-05-07T10:24:01.495199 #3008779] INFO -- : make[2]: Entering directory '/tmp/ruby/build/trunk/ext/rubyvm' I, [2024-05-07T10:24:01.497219 #3008779] INFO -- : make[2]: Leaving directory '/tmp/ruby/build/trunk/ext/rubyvm' I, [2024-05-07T10:24:01.505149 #3008779] INFO -- : make[2]: Entering directory '/tmp/ruby/build/trunk/ext/socket' I, [2024-05-07T10:24:01.511507 #3008779] INFO -- : make[2]: Leaving directory '/tmp/ruby/build/trunk/ext/socket' I, [2024-05-07T10:24:01.522654 #3008779] INFO -- : make[2]: Entering directory '/tmp/ruby/build/trunk/.bundle/gems/bigdecimal-3.1.7/ext/bigdecimal' I, [2024-05-07T10:24:01.545437 #3008779] INFO -- : make[2]: Leaving directory '/tmp/ruby/build/trunk/.bundle/gems/bigdecimal-3.1.7/ext/bigdecimal' I, [2024-05-07T10:24:01.547712 #3008779] INFO -- : make[2]: Entering directory '/tmp/ruby/build/trunk/.bundle/gems/bigdecimal-3.1.8/ext/bigdecimal' I, [2024-05-07T10:24:01.569913 #3008779] INFO -- : make[2]: Leaving directory '/tmp/ruby/build/trunk/.bundle/gems/bigdecimal-3.1.8/ext/bigdecimal' I, [2024-05-07T10:24:01.572071 #3008779] INFO -- : make[2]: Entering directory '/tmp/ruby/build/trunk/.bundle/gems/debug-1.9.2/ext/debug' I, [2024-05-07T10:24:01.593520 #3008779] INFO -- : make[2]: Leaving directory '/tmp/ruby/build/trunk/.bundle/gems/debug-1.9.2/ext/debug' I, [2024-05-07T10:24:01.595754 #3008779] INFO -- : make[2]: Entering directory '/tmp/ruby/build/trunk/.bundle/gems/nkf-0.2.0/ext/nkf' I, [2024-05-07T10:24:01.617623 #3008779] INFO -- : make[2]: Leaving directory '/tmp/ruby/build/trunk/.bundle/gems/nkf-0.2.0/ext/nkf' I, [2024-05-07T10:24:01.619663 #3008779] INFO -- : make[2]: Entering directory '/tmp/ruby/build/trunk/.bundle/gems/racc-1.7.3/ext/racc/cparse' I, [2024-05-07T10:24:01.641434 #3008779] INFO -- : make[2]: Leaving directory '/tmp/ruby/build/trunk/.bundle/gems/racc-1.7.3/ext/racc/cparse' I, [2024-05-07T10:24:01.644013 #3008779] INFO -- : make[2]: Entering directory '/tmp/ruby/build/trunk/.bundle/gems/rbs-3.4.4/ext/rbs_extension' I, [2024-05-07T10:24:01.665717 #3008779] INFO -- : make[2]: Leaving directory '/tmp/ruby/build/trunk/.bundle/gems/rbs-3.4.4/ext/rbs_extension' I, [2024-05-07T10:24:01.667685 #3008779] INFO -- : make[2]: Entering directory '/tmp/ruby/build/trunk/.bundle/gems/syslog-0.1.2/ext/syslog' I, [2024-05-07T10:24:01.689276 #3008779] INFO -- : make[2]: Leaving directory '/tmp/ruby/build/trunk/.bundle/gems/syslog-0.1.2/ext/syslog' I, [2024-05-07T10:24:01.712970 #3008779] INFO -- : make[2]: Entering directory '/tmp/ruby/build/trunk' I, [2024-05-07T10:24:01.777887 #3008779] INFO -- : make[2]: 'ruby' is up to date. I, [2024-05-07T10:24:01.777922 #3008779] INFO -- : make[2]: Leaving directory '/tmp/ruby/build/trunk' I, [2024-05-07T10:24:01.778391 #3008779] INFO -- : make[1]: Leaving directory '/tmp/ruby/build/trunk' I, [2024-05-07T10:24:01.781994 #3008779] INFO -- : make[1]: Entering directory '/tmp/ruby/build/trunk' I, [2024-05-07T10:24:01.782015 #3008779] INFO -- : make[1]: Nothing to be done for 'note'. I, [2024-05-07T10:24:01.782020 #3008779] INFO -- : make[1]: Leaving directory '/tmp/ruby/build/trunk' I, [2024-05-07T10:24:01.859285 #3008779] INFO -- : Run options: I, [2024-05-07T10:24:01.859339 #3008779] INFO -- : --seed=19526 I, [2024-05-07T10:24:01.859345 #3008779] INFO -- : "--ruby=./miniruby -I/tmp/ruby/src/trunk/lib -I. -I.ext/common /tmp/ruby/src/trunk/tool/runruby.rb --extout=.ext -- --disable-gems" I, [2024-05-07T10:24:01.859350 #3008779] INFO -- : --excludes-dir=/tmp/ruby/src/trunk/test/.excludes I, [2024-05-07T10:24:01.859353 #3008779] INFO -- : --name=!/memory_leak/ I, [2024-05-07T10:24:01.859357 #3008779] INFO -- : --stderr-on-failure I, [2024-05-07T10:24:01.859360 #3008779] INFO -- : -j20 I, [2024-05-07T10:24:01.859364 #3008779] INFO -- : I, [2024-05-07T10:24:01.859373 #3008779] INFO -- : # Running tests: I, [2024-05-07T10:24:01.859376 #3008779] INFO -- : I, [2024-05-07T10:24:02.006484 #3008779] INFO -- : [ 1/885] 3050179=test_case_options I, [2024-05-07T10:24:02.006746 #3008779] INFO -- : [ 2/885] 3050163=test_store I, [2024-05-07T10:24:02.006775 #3008779] INFO -- : [ 3/885] 3050164=test_rdoc_cross_reference I, [2024-05-07T10:24:02.006783 #3008779] INFO -- : [ 4/885] 3050165=test_gem_dependency_installer I, [2024-05-07T10:24:02.007307 #3008779] INFO -- : [ 5/885] 3050166=test_scalar I, [2024-05-07T10:24:02.007883 #3008779] INFO -- : [ 6/885] 3050167=test_gem_commands_info_command I, [2024-05-07T10:24:02.009543 #3008779] INFO -- : [ 7/885] 3050178=test_bug_reporter I, [2024-05-07T10:24:02.009647 #3008779] INFO -- : [ 8/885] 3050177=test_rand I, [2024-05-07T10:24:02.009728 #3008779] INFO -- : [ 9/885] 3050175=test_gem_name_tuple I, [2024-05-07T10:24:02.010483 #3008779] INFO -- : [ 10/885] 3050176=test_gem_package_tar_reader_entry I, [2024-05-07T10:24:02.011000 #3008779] INFO -- : [ 11/885] 3050180=test_exception I, [2024-05-07T10:24:02.016774 #3008779] INFO -- : [ 12/885] 3050179=test_gem_request I, [2024-05-07T10:24:02.040205 #3008779] INFO -- : [ 13/885] 3050168=test_method_cache I, [2024-05-07T10:24:02.040327 #3008779] INFO -- : [ 14/885] 3050172=test_sprintf_comb I, [2024-05-07T10:24:02.041009 #3008779] INFO -- : [ 15/885] 3050169=test_gem_ext_cargo_builder_link_flag_converter I, [2024-05-07T10:24:02.043549 #3008779] INFO -- : [ 16/885] 3050174=test_gem_commands_mirror I, [2024-05-07T10:24:02.046695 #3008779] INFO -- : [ 17/885] 3050168=test_enumerator_kw I, [2024-05-07T10:24:02.052790 #3008779] INFO -- : [ 18/885] 3050168=test_settracefunc I, [2024-05-07T10:24:02.052906 #3008779] INFO -- : [ 19/885] 3050173=test_gem_text I, [2024-05-07T10:24:02.053716 #3008779] INFO -- : [ 20/885] 3050170=test_generic I, [2024-05-07T10:24:02.055483 #3008779] INFO -- : [ 21/885] 3050166=test_win32ole I, [2024-05-07T10:24:02.058909 #3008779] INFO -- : [ 22/885] 3050171=test_scan_args I, [2024-05-07T10:24:02.067521 #3008779] INFO -- : [ 23/885] 3050166=test_cclass I, [2024-05-07T10:24:02.070886 #3008779] INFO -- : [ 24/885] 3050181=test_gem_request_connection_pools I, [2024-05-07T10:24:02.080653 #3008779] INFO -- : [ 25/885] 3050171=test_grapheme_breaks I, [2024-05-07T10:24:02.087210 #3008779] INFO -- : [ 26/885] 3050182=test_gem_version_option I, [2024-05-07T10:24:02.122343 #3008779] INFO -- : [ 27/885] 3050170=test_pkey I, [2024-05-07T10:24:02.130046 #3008779] INFO -- : [ 28/885] 3050171=test_case I, [2024-05-07T10:24:02.152959 #3008779] INFO -- : [ 29/885] 3050171=test_reline I, [2024-05-07T10:24:02.191919 #3008779] INFO -- : [ 30/885] 3050175=test_parser_events I, [2024-05-07T10:24:02.202676 #3008779] INFO -- : [ 31/885] 3050170=test_rdoc_generator_pot_po I, [2024-05-07T10:24:02.220974 #3008779] INFO -- : [ 32/885] 3050167=test_ansi_with_terminfo I, [2024-05-07T10:24:02.221570 #3008779] INFO -- : [ 33/885] 3050163=test_rdoc_markup_to_markdown I, [2024-05-07T10:24:02.227293 #3008779] INFO -- : [ 34/885] 3050166=test_json_tree I, [2024-05-07T10:24:02.236649 #3008779] INFO -- : [ 35/885] 3050172=test_memory_view I, [2024-05-07T10:24:02.246232 #3008779] INFO -- : [ 36/885] 3050166=test_m17n_comb I, [2024-05-07T10:24:02.250139 #3008779] INFO -- : [ 37/885] 3050174=test_ractor I, [2024-05-07T10:24:02.269218 #3008779] INFO -- : [ 38/885] 3050172=test_gem_stream_ui I, [2024-05-07T10:24:02.274818 #3008779] INFO -- : [ 39/885] 3050167=test_rdoc_generator_ri I, [2024-05-07T10:24:02.292693 #3008779] INFO -- : [ 40/885] 3050175=test_extlibs I, [2024-05-07T10:24:02.299791 #3008779] INFO -- : [ 41/885] 3050177=test_severity I, [2024-05-07T10:24:02.305690 #3008779] INFO -- : [ 42/885] 3050169=test_ractor I, [2024-05-07T10:24:02.306324 #3008779] INFO -- : [ 43/885] 3050177=test_require_lib I, [2024-05-07T10:24:02.318392 #3008779] INFO -- : [ 44/885] 3050173=parse_test I, [2024-05-07T10:24:02.334332 #3008779] INFO -- : [ 45/885] 3050174=test_gem_install_update_options I, [2024-05-07T10:24:02.347234 #3008779] INFO -- : [ 46/885] 3050176=test_rdoc_markup_to_table_of_contents I, [2024-05-07T10:24:02.348888 #3008779] INFO -- : [ 47/885] 3050169=test_socket I, [2024-05-07T10:24:02.354512 #3008779] INFO -- : [ 48/885] 3050182=test_thread I, [2024-05-07T10:24:02.373447 #3008779] INFO -- : [ 49/885] 3050171=test_objectspace I, [2024-05-07T10:24:02.374235 #3008779] INFO -- : [ 50/885] 3050179=test_literal I, [2024-05-07T10:24:02.375426 #3008779] INFO -- : [ 51/885] 3050170=test_str2big I, [2024-05-07T10:24:02.378542 #3008779] INFO -- : [ 52/885] 3050163=test_c_struct_builder I, [2024-05-07T10:24:02.380451 #3008779] INFO -- : [ 53/885] 3050170=test_dot_dot I, [2024-05-07T10:24:02.386114 #3008779] INFO -- : [ 54/885] 3050170=test_io_console I, [2024-05-07T10:24:02.415935 #3008779] INFO -- : [ 55/885] 3050178=test_flush I, [2024-05-07T10:24:02.420961 #3008779] INFO -- : [ 56/885] 3050178=test_singleton I, [2024-05-07T10:24:02.421891 #3008779] INFO -- : [ 57/885] 3050163=test_switch_hitter I, [2024-05-07T10:24:02.426707 #3008779] INFO -- : [ 58/885] 3050178=test_securerandom I, [2024-05-07T10:24:02.434037 #3008779] INFO -- : [ 59/885] 3050163=test_rdoc_markdown_test I, [2024-05-07T10:24:02.435467 #3008779] INFO -- : [ 60/885] 3050167=test_rdoc_normal_module I, [2024-05-07T10:24:02.476769 #3008779] INFO -- : [ 61/885] 3050178=test_c_union_entity I, [2024-05-07T10:24:02.497099 #3008779] INFO -- : [ 62/885] 3050178=test_logperiod I, [2024-05-07T10:24:02.497766 #3008779] INFO -- : [ 63/885] 3050174=test_passing_block I, [2024-05-07T10:24:02.502031 #3008779] INFO -- : [ 64/885] 3050164=test_thread_fd_close I, [2024-05-07T10:24:02.502725 #3008779] INFO -- : [ 65/885] 3050174=test_uncorrectable_name_check I, [2024-05-07T10:24:02.505485 #3008779] INFO -- : [ 66/885] 3050164=newline_test I, [2024-05-07T10:24:02.507377 #3008779] INFO -- : [ 67/885] 3050178=test_hash_create I, [2024-05-07T10:24:02.509218 #3008779] INFO -- : [ 68/885] 3050174=test_stringchar I, [2024-05-07T10:24:02.509334 #3008779] INFO -- : [ 69/885] 3050178=test_gem_security_policy I, [2024-05-07T10:24:02.520495 #3008779] INFO -- : [ 70/885] 3050172=test_gem_source_local I, [2024-05-07T10:24:02.535996 #3008779] INFO -- : [ 71/885] 3050176=test_process I, [2024-05-07T10:24:02.543372 #3008779] INFO -- : [ 72/885] 3050167=test_last_thread I, [2024-05-07T10:24:02.576582 #3008779] INFO -- : [ 73/885] 3050182=test_pack I, [2024-05-07T10:24:02.606526 #3008779] INFO -- : [ 74/885] 3050164=test_err_in_callback I, [2024-05-07T10:24:02.609776 #3008779] INFO -- : [ 75/885] 3050164=test_gem_resolver_lock_specification I, [2024-05-07T10:24:02.614829 #3008779] INFO -- : [ 76/885] 3050174=test_gc I, [2024-05-07T10:24:02.779425 #3008779] INFO -- : [ 77/885] 3050182=test_x509cert I, [2024-05-07T10:24:02.784899 #3008779] INFO -- : [ 78/885] 3050164=test_gem_ext_rake_builder I, [2024-05-07T10:24:02.800019 #3008779] INFO -- : [ 79/885] 3050172=test_arity I, [2024-05-07T10:24:02.805092 #3008779] INFO -- : [ 80/885] 3050172=test_logdevice I, [2024-05-07T10:24:02.882823 #3008779] INFO -- : [ 81/885] 3050178=test_gem_commands_specification_command I, [2024-05-07T10:24:02.978071 #3008779] INFO -- : [ 82/885] 3050178=test_shift_jis I, [2024-05-07T10:24:02.982619 #3008779] INFO -- : [ 83/885] 3050178=test_gem_commands_which_command I, [2024-05-07T10:24:03.011877 #3008779] INFO -- : [ 84/885] 3050178=test_http I, [2024-05-07T10:24:03.018243 #3008779] INFO -- : [ 85/885] 3050168=test_enumerator I, [2024-05-07T10:24:03.026933 #3008779] INFO -- : [ 86/885] 3050178=test_inadvertent_creation I, [2024-05-07T10:24:03.035846 #3008779] INFO -- : [ 87/885] 3050182=test_flags I, [2024-05-07T10:24:03.088937 #3008779] INFO -- : [ 88/885] 3050179=test_name_error I, [2024-05-07T10:24:03.114574 #3008779] INFO -- : [ 89/885] 3050178=test_rdoc_markup_attribute_manager I, [2024-05-07T10:24:03.211919 #3008779] INFO -- : [ 90/885] 3050179=test_gem_commands_dependency_command I, [2024-05-07T10:24:03.268875 #3008779] INFO -- : [ 91/885] 3050171=test_gem_resolver_composed_set I, [2024-05-07T10:24:03.282608 #3008779] INFO -- : [ 92/885] 3050181=test_safe_load I, [2024-05-07T10:24:03.282740 #3008779] INFO -- : [ 93/885] 3050178=test_gem_resolver I, [2024-05-07T10:24:03.310106 #3008779] INFO -- : [ 94/885] 3050181=test_rdoc_context I, [2024-05-07T10:24:03.347308 #3008779] INFO -- : [ 95/885] 3050179=test_stream I, [2024-05-07T10:24:03.360383 #3008779] INFO -- : [ 96/885] 3050163=test_nil2vtempty I, [2024-05-07T10:24:03.363485 #3008779] INFO -- : [ 97/885] 3050163=test_open-uri I, [2024-05-07T10:24:03.366271 #3008779] INFO -- : [ 98/885] 3050179=test_httpresponse I, [2024-05-07T10:24:03.376454 #3008779] INFO -- : [ 99/885] 3050180=test_rdoc_parser_ruby I, [2024-05-07T10:24:03.426207 #3008779] INFO -- : [100/885] 3050179=test_gem_safe_yaml I, [2024-05-07T10:24:03.442673 #3008779] INFO -- : [101/885] 3050164=test_syntax I, [2024-05-07T10:24:03.449416 #3008779] INFO -- : [102/885] 3050179=test_date_new I, [2024-05-07T10:24:03.460953 #3008779] INFO -- : [103/885] 3050179=index_write_test I, [2024-05-07T10:24:03.510760 #3008779] INFO -- : [104/885] 3050171=test_data I, [2024-05-07T10:24:03.515142 #3008779] INFO -- : [105/885] 3050171=test_rdoc_markup_to_joined_paragraph I, [2024-05-07T10:24:03.531298 #3008779] INFO -- : [106/885] 3050178=test_date_time I, [2024-05-07T10:24:03.538828 #3008779] INFO -- : [107/885] 3050178=test_require I, [2024-05-07T10:24:03.538893 #3008779] INFO -- : [108/885] 3050178=test_iso_8859 I, [2024-05-07T10:24:03.556938 #3008779] INFO -- : [109/885] 3050179=test_tcp I, [2024-05-07T10:24:03.566915 #3008779] INFO -- : [110/885] 3050178=test_rdoc_text I, [2024-05-07T10:24:03.606664 #3008779] INFO -- : [111/885] 3050172=test_emitter I, [2024-05-07T10:24:03.610556 #3008779] INFO -- : [112/885] 3050167=test_gem_silent_ui I, [2024-05-07T10:24:03.616240 #3008779] INFO -- : [113/885] 3050172=test_bug-5832 I, [2024-05-07T10:24:03.616508 #3008779] INFO -- : [114/885] 3050178=test_files_ext I, [2024-05-07T10:24:03.620927 #3008779] INFO -- : [115/885] 3050172=test_kernel I, [2024-05-07T10:24:03.638647 #3008779] INFO -- : [116/885] 3050171=dispatcher_test I, [2024-05-07T10:24:03.639954 #3008779] INFO -- : [117/885] 3050167=test_eval_history I, [2024-05-07T10:24:03.648099 #3008779] INFO -- : [118/885] 3050169=test_kdf I, [2024-05-07T10:24:03.701165 #3008779] INFO -- : [119/885] 3050167=test_gem_doctor I, [2024-05-07T10:24:03.717814 #3008779] INFO -- : [120/885] 3050171=test_psych I, [2024-05-07T10:24:03.719950 #3008779] INFO -- : [121/885] 3050169=test_enc_raise I, [2024-05-07T10:24:03.724539 #3008779] INFO -- : [122/885] 3050178=!Nothing_to_test I, [2024-05-07T10:24:03.725250 #3008779] INFO -- : [123/885] 3050178=test_rdoc_markup_paragraph I, [2024-05-07T10:24:03.728553 #3008779] INFO -- : [124/885] 3050178=test_command I, [2024-05-07T10:24:03.732345 #3008779] INFO -- : [125/885] 3050169=test_at_exit I, [2024-05-07T10:24:03.744319 #3008779] INFO -- : [126/885] 3050167=test_date I, [2024-05-07T10:24:03.747763 #3008779] INFO -- : [127/885] 3050169=test_gem_rdoc I, [2024-05-07T10:24:03.748603 #3008779] INFO -- : [128/885] 3050167=test_gem_ext_cargo_builder_unit I, [2024-05-07T10:24:03.762967 #3008779] INFO -- : [129/885] 3050171=test_object_create_start I, [2024-05-07T10:24:03.766412 #3008779] INFO -- : [130/885] 3050171=test_rdoc_tom_doc I, [2024-05-07T10:24:03.767962 #3008779] INFO -- : [131/885] 3050167=test_rdoc_markup_to_tt_only I, [2024-05-07T10:24:03.789892 #3008779] INFO -- : [132/885] 3050179=test_hmac I, [2024-05-07T10:24:03.789955 #3008779] INFO -- : [133/885] 3050171=test_gem_command I, [2024-05-07T10:24:03.795502 #3008779] INFO -- : [134/885] 3050179=test_key_actor_vi I, [2024-05-07T10:24:03.798635 #3008779] INFO -- : [135/885] 3050167=test_bug-3571 I, [2024-05-07T10:24:03.818433 #3008779] INFO -- : [136/885] 3050167=test_common I, [2024-05-07T10:24:03.872647 #3008779] INFO -- : [137/885] 3050171=test_gem_spec_fetcher I, [2024-05-07T10:24:03.875453 #3008779] INFO -- : [138/885] 3050180=test_numeric I, [2024-05-07T10:24:03.958202 #3008779] INFO -- : [139/885] 3050180=test_ifunless I, [2024-05-07T10:24:03.961891 #3008779] INFO -- : [140/885] 3050180=test_assignment I, [2024-05-07T10:24:03.971942 #3008779] INFO -- : [141/885] 3050179=test_gem_commands_lock_command I, [2024-05-07T10:24:03.990798 #3008779] INFO -- : [142/885] 3050179=test_gem_source_list I, [2024-05-07T10:24:04.015567 #3008779] INFO -- : [143/885] 3050169=test_yaml_special_cases I, [2024-05-07T10:24:04.020532 #3008779] INFO -- : [144/885] 3050171=test_optarg I, [2024-05-07T10:24:04.028814 #3008779] INFO -- : [145/885] 3050167=test_config I, [2024-05-07T10:24:04.031656 #3008779] INFO -- : [146/885] 3050169=test_rdoc_token_stream I, [2024-05-07T10:24:04.036442 #3008779] INFO -- : [147/885] 3050179=test_address_resolve I, [2024-05-07T10:24:04.049852 #3008779] INFO -- : [148/885] 3050167=test_exception I, [2024-05-07T10:24:04.052953 #3008779] INFO -- : [149/885] 3050169=test_zsh_completion I, [2024-05-07T10:24:04.057255 #3008779] INFO -- : [150/885] 3050169=test_iter_break I, [2024-05-07T10:24:04.057997 #3008779] INFO -- : [151/885] 3050167=test_verbose I, [2024-05-07T10:24:04.059255 #3008779] INFO -- : [152/885] 3050169=test_num2int I, [2024-05-07T10:24:04.059316 #3008779] INFO -- : [153/885] 3050182=test_nil I, [2024-05-07T10:24:04.071260 #3008779] INFO -- : [154/885] 3050169=test_rdoc_single_class I, [2024-05-07T10:24:04.079353 #3008779] INFO -- : [155/885] 3050163=test_macro I, [2024-05-07T10:24:04.080159 #3008779] INFO -- : [156/885] 3050169=test_pp I, [2024-05-07T10:24:04.080317 #3008779] INFO -- : [157/885] 3050182=test_gem_ext_configure_builder I, [2024-05-07T10:24:04.086923 #3008779] INFO -- : [158/885] 3050179=test_frozen I, [2024-05-07T10:24:04.090945 #3008779] INFO -- : [159/885] 3050179=test_proc I, [2024-05-07T10:24:04.093082 #3008779] INFO -- : [160/885] 3050167=test_string I, [2024-05-07T10:24:04.093842 #3008779] INFO -- : [161/885] 3050175=test_gc_compact I, [2024-05-07T10:24:04.113718 #3008779] INFO -- : [162/885] 3050169=test_gem_resolver_index_set I, [2024-05-07T10:24:04.121168 #3008779] INFO -- : [163/885] 3050163=test_gem_package_old I, [2024-05-07T10:24:04.131144 #3008779] INFO -- : [164/885] 3050178=test_cgi_tag_helper I, [2024-05-07T10:24:04.134516 #3008779] INFO -- : [165/885] 3050182=test_zlib I, [2024-05-07T10:24:04.145953 #3008779] INFO -- : [166/885] 3050169=test_egrep_cpp I, [2024-05-07T10:24:04.158410 #3008779] INFO -- : [167/885] 3050171=test_ole_methods I, [2024-05-07T10:24:04.161167 #3008779] INFO -- : [168/885] 3050171=test_erb_m17n I, [2024-05-07T10:24:04.162895 #3008779] INFO -- : [169/885] 3050178=test_optimization I, [2024-05-07T10:24:04.171102 #3008779] INFO -- : [170/885] 3050171=test_date_conv I, [2024-05-07T10:24:04.175344 #3008779] INFO -- : [171/885] 3050171=test_folderitem2_invokeverb I, [2024-05-07T10:24:04.177480 #3008779] INFO -- : [172/885] 3050171=test_require_path_check I, [2024-05-07T10:24:04.230181 #3008779] INFO -- : [173/885] 3050172=test_rdoc_markup_parser I, [2024-05-07T10:24:04.254615 #3008779] INFO -- : [174/885] 3050171=test_fnmatch I, [2024-05-07T10:24:04.295507 #3008779] INFO -- : [175/885] 3050171=test_files_test_2 I, [2024-05-07T10:24:04.329580 #3008779] INFO -- : [176/885] 3050163=test_gem_validator I, [2024-05-07T10:24:04.361785 #3008779] INFO -- : [177/885] 3050169=test_rdoc_store I, [2024-05-07T10:24:04.368617 #3008779] INFO -- : [178/885] 3050163=test_gem_request_set_lockfile_parser I, [2024-05-07T10:24:04.393371 #3008779] INFO -- : [179/885] 3050181=test_depth_first I, [2024-05-07T10:24:04.396588 #3008779] INFO -- : [180/885] 3050181=test_raise I, [2024-05-07T10:24:04.397726 #3008779] INFO -- : [181/885] 3050181=test_x509attr I, [2024-05-07T10:24:04.407452 #3008779] INFO -- : [182/885] 3050181=test_pattern_matching I, [2024-05-07T10:24:04.443985 #3008779] INFO -- : [183/885] 3050181=test_rdoc_stats I, [2024-05-07T10:24:04.450130 #3008779] INFO -- : [184/885] 3050172=test_string I, [2024-05-07T10:24:04.461130 #3008779] INFO -- : [185/885] 3050172=test_rdoc_parser I, [2024-05-07T10:24:04.471007 #3008779] INFO -- : [186/885] 3050163=test_qsort I, [2024-05-07T10:24:04.474184 #3008779] INFO -- : [187/885] 3050181=test_gem_dependency_resolution_error I, [2024-05-07T10:24:04.476356 #3008779] INFO -- : [188/885] 3050163=json_addition_test I, [2024-05-07T10:24:04.478803 #3008779] INFO -- : [189/885] 3050181=test_custom_command I, [2024-05-07T10:24:04.483429 #3008779] INFO -- : [190/885] 3050165=test_rdoc_markup_attributes I, [2024-05-07T10:24:04.503388 #3008779] INFO -- : [191/885] 3050172=test_win32ole_type I, [2024-05-07T10:24:04.506836 #3008779] INFO -- : [192/885] 3050172=test_null I, [2024-05-07T10:24:04.509620 #3008779] INFO -- : [193/885] 3050163=test_mul I, [2024-05-07T10:24:04.514262 #3008779] INFO -- : [194/885] 3050172=test_rdoc_rd_inline_parser I, [2024-05-07T10:24:04.522594 #3008779] INFO -- : [195/885] 3050163=test_rdoc_markup_to_rdoc I, [2024-05-07T10:24:04.538633 #3008779] INFO -- : [196/885] 3050172=test_default_gems I, [2024-05-07T10:24:04.581283 #3008779] INFO -- : [197/885] 3050163=test_pipe I, [2024-05-07T10:24:04.585306 #3008779] INFO -- : [198/885] 3050181=test_trick I, [2024-05-07T10:24:04.591157 #3008779] INFO -- : [199/885] 3050172=test_thread I, [2024-05-07T10:24:04.592866 #3008779] INFO -- : [200/885] 3050172=test_pkey_ec I, [2024-05-07T10:24:04.621335 #3008779] INFO -- : [201/885] 3050165=test_date_parse I, [2024-05-07T10:24:04.684712 #3008779] INFO -- : [202/885] 3050172=test_defined I, [2024-05-07T10:24:04.731996 #3008779] INFO -- : [203/885] 3050166=test_backtrace I, [2024-05-07T10:24:04.734187 #3008779] INFO -- : [204/885] 3050166=test_key_name_check I, [2024-05-07T10:24:04.739710 #3008779] INFO -- : [205/885] 3050165=test_io_buffer I, [2024-05-07T10:24:04.740432 #3008779] INFO -- : [206/885] 3050163=test_rdoc_i18n_text I, [2024-05-07T10:24:04.745030 #3008779] INFO -- : [207/885] 3050166=test_gem_uninstaller I, [2024-05-07T10:24:04.748540 #3008779] INFO -- : [208/885] 3050163=test_svcb_https I, [2024-05-07T10:24:04.755691 #3008779] INFO -- : [209/885] 3050163=test_buffering I, [2024-05-07T10:24:04.775853 #3008779] INFO -- : [210/885] 3050163=test_gb18030 I, [2024-05-07T10:24:04.780357 #3008779] INFO -- : [211/885] 3050165=test_windows_1251 I, [2024-05-07T10:24:04.780794 #3008779] INFO -- : [212/885] 3050163=test_time I, [2024-05-07T10:24:04.796173 #3008779] INFO -- : [213/885] 3050165=test_rdoc_rdoc I, [2024-05-07T10:24:04.843979 #3008779] INFO -- : [214/885] 3050172=test_bigzero I, [2024-05-07T10:24:04.851472 #3008779] INFO -- : [215/885] 3050172=test_pkey_dh I, [2024-05-07T10:24:04.925131 #3008779] INFO -- : [216/885] 3050179=test_gem_package_tar_header I, [2024-05-07T10:24:04.926992 #3008779] INFO -- : [217/885] 3050163=test_iseq_load I, [2024-05-07T10:24:04.970948 #3008779] INFO -- : [218/885] 3050165=test_gem_util I, [2024-05-07T10:24:04.972270 #3008779] INFO -- : [219/885] 3050172=test_system I, [2024-05-07T10:24:04.981958 #3008779] INFO -- : [220/885] 3050179=test_pkcs12 I, [2024-05-07T10:24:05.054894 #3008779] INFO -- : [221/885] 3050168=test_yjit_exit_locations I, [2024-05-07T10:24:05.056999 #3008779] INFO -- : [222/885] 3050168=test_etc I, [2024-05-07T10:24:05.136167 #3008779] INFO -- : [223/885] 3050170=test_gem_config_file I, [2024-05-07T10:24:05.146439 #3008779] INFO -- : [224/885] 3050168=test_ripper I, [2024-05-07T10:24:05.166968 #3008779] INFO -- : [225/885] 3050165=test_protocol I, [2024-05-07T10:24:05.212635 #3008779] INFO -- : [226/885] 3050169=test_getopts I, [2024-05-07T10:24:05.218767 #3008779] INFO -- : [227/885] 3050169=test_gem_resolver_activation_request I, [2024-05-07T10:24:05.233721 #3008779] INFO -- : [228/885] 3050169=test_libs I, [2024-05-07T10:24:05.241404 #3008779] INFO -- : [229/885] 3050169=test_gc I, [2024-05-07T10:24:05.245603 #3008779] INFO -- : [230/885] 3050169=test_gem_commands_fetch_command I, [2024-05-07T10:24:05.287307 #3008779] INFO -- : [231/885] 3050180=test_math I, [2024-05-07T10:24:05.297895 #3008779] INFO -- : [232/885] 3050180=test_sleep I, [2024-05-07T10:24:05.368350 #3008779] INFO -- : [233/885] 3050169=test_config I, [2024-05-07T10:24:05.404044 #3008779] INFO -- : [234/885] 3050169=test_yaml_tree I, [2024-05-07T10:24:05.421142 #3008779] INFO -- : [235/885] 3050169=test_case I, [2024-05-07T10:24:05.425765 #3008779] INFO -- : [236/885] 3050170=test_sizeof I, [2024-05-07T10:24:05.455493 #3008779] INFO -- : [237/885] 3050169=test_face I, [2024-05-07T10:24:05.480406 #3008779] INFO -- : [238/885] 3050165=test_rendering I, [2024-05-07T10:24:05.522135 #3008779] INFO -- : [239/885] 3050168=test_autoload I, [2024-05-07T10:24:05.540341 #3008779] INFO -- : [240/885] 3050169=test_utf16 I, [2024-05-07T10:24:05.553087 #3008779] INFO -- : [241/885] 3050169=test_io I, [2024-05-07T10:24:05.569360 #3008779] INFO -- : [242/885] 3050179=test_unicode_escape I, [2024-05-07T10:24:05.588417 #3008779] INFO -- : [243/885] 3050173=test_rdoc_markup_indented_paragraph I, [2024-05-07T10:24:05.598532 #3008779] INFO -- : [244/885] 3050165=test_io_buffer I, [2024-05-07T10:24:05.660725 #3008779] INFO -- : [245/885] 3050179=ruby_parser_test I, [2024-05-07T10:24:05.666514 #3008779] INFO -- : [246/885] 3050179=test_backtrace I, [2024-05-07T10:24:05.720024 #3008779] INFO -- : [247/885] 3050165=test_pack I, [2024-05-07T10:24:05.730405 #3008779] INFO -- : [248/885] 3050165=test_gem_resolver_conflict I, [2024-05-07T10:24:05.741397 #3008779] INFO -- : [249/885] 3050165=test_rdoc_task I, [2024-05-07T10:24:05.743712 #3008779] INFO -- : [250/885] 3050165=test_gem_commands_install_command I, [2024-05-07T10:24:05.747956 #3008779] INFO -- : [251/885] 3050177=test_clone I, [2024-05-07T10:24:05.756111 #3008779] INFO -- : [252/885] 3050173=test_readpartial I, [2024-05-07T10:24:05.949925 #3008779] INFO -- : [253/885] 3050172=locals_test I, [2024-05-07T10:24:05.955228 #3008779] INFO -- : [254/885] 3050166=test_rdoc_require I, [2024-05-07T10:24:05.967226 #3008779] INFO -- : [255/885] 3050177=test_rat I, [2024-05-07T10:24:05.981304 #3008779] INFO -- : [256/885] 3050177=test_rdoc_markup_raw I, [2024-05-07T10:24:06.078930 #3008779] INFO -- : [257/885] 3050182=test_webauthn_poller I, [2024-05-07T10:24:06.107956 #3008779] INFO -- : [258/885] 3050166=test_rdoc_markup_to_html_crossref I, [2024-05-07T10:24:06.133869 #3008779] INFO -- : [259/885] 3050177=test_typeddata I, [2024-05-07T10:24:06.158134 #3008779] INFO -- : [260/885] 3050173=test_gem_resolver_best_set I, [2024-05-07T10:24:06.162328 #3008779] INFO -- : [261/885] 3050163=encoding_test I, [2024-05-07T10:24:06.214671 #3008779] INFO -- : [262/885] 3050173=test_fstring I, [2024-05-07T10:24:06.224449 #3008779] INFO -- : [263/885] 3050182=test_array I, [2024-05-07T10:24:06.231909 #3008779] INFO -- : [264/885] 3050182=test_optparse I, [2024-05-07T10:24:06.295732 #3008779] INFO -- : [265/885] 3050182=test_convertible I, [2024-05-07T10:24:06.362232 #3008779] INFO -- : [266/885] 3050173=parser_test I, [2024-05-07T10:24:06.367878 #3008779] INFO -- : [267/885] 3050173=test_rdoc_alias I, [2024-05-07T10:24:06.368556 #3008779] INFO -- : [268/885] 3050163=test_yield I, [2024-05-07T10:24:06.373145 #3008779] INFO -- : [269/885] 3050166=test_stringscanner I, [2024-05-07T10:24:06.376890 #3008779] INFO -- : [270/885] 3050175=test_files_sample I, [2024-05-07T10:24:06.391015 #3008779] INFO -- : [271/885] 3050177=test_gem_security_trust_dir I, [2024-05-07T10:24:06.396311 #3008779] INFO -- : [272/885] 3050166=test_string_memory I, [2024-05-07T10:24:06.418637 #3008779] INFO -- : [273/885] 3050172=test_gem_requirement I, [2024-05-07T10:24:06.421202 #3008779] INFO -- : [274/885] 3050173=test_sprintf I, [2024-05-07T10:24:06.445751 #3008779] INFO -- : [275/885] 3050166=comments_test I, [2024-05-07T10:24:06.462280 #3008779] INFO -- : [276/885] 3050175=ripper_test I, [2024-05-07T10:24:06.507642 #3008779] INFO -- : [277/885] 3050166=test_objspace I, [2024-05-07T10:24:06.550043 #3008779] INFO -- : [278/885] 3050172=test_line_editor I, [2024-05-07T10:24:06.625169 #3008779] INFO -- : [279/885] 3050172=test_undef I, [2024-05-07T10:24:06.628960 #3008779] INFO -- : [280/885] 3050172=test_gem_commands_stale_command I, [2024-05-07T10:24:06.638514 #3008779] INFO -- : [281/885] 3050172=test_lock_native_thread I, [2024-05-07T10:24:06.690840 #3008779] INFO -- : [282/885] 3050177=test_c_struct_entry I, [2024-05-07T10:24:06.712443 #3008779] INFO -- : [283/885] 3050173=test_remote_fetch_error I, [2024-05-07T10:24:06.724296 #3008779] INFO -- : [284/885] 3050173=test_have_library I, [2024-05-07T10:24:06.812579 #3008779] INFO -- : [285/885] 3050177=test_show_source I, [2024-05-07T10:24:06.909821 #3008779] INFO -- : [286/885] 3050177=test_set I, [2024-05-07T10:24:06.936035 #3008779] INFO -- : [287/885] 3050172=test_hash I, [2024-05-07T10:24:06.936101 #3008779] INFO -- : [288/885] 3050177=test_gem_resolver_dependency_request I, [2024-05-07T10:24:06.947050 #3008779] INFO -- : [289/885] 3050172=test_tree_builder I, [2024-05-07T10:24:06.952178 #3008779] INFO -- : [290/885] 3050172=test_external_new I, [2024-05-07T10:24:06.961780 #3008779] INFO -- : [291/885] 3050172=test_postponed_job I, [2024-05-07T10:24:06.962507 #3008779] INFO -- : [292/885] 3050177=test_alias_and_anchor I, [2024-05-07T10:24:06.972258 #3008779] INFO -- : [293/885] 3050177=test_raise_exception I, [2024-05-07T10:24:07.008763 #3008779] INFO -- : [294/885] 3050179=test_gem_request_set_lockfile I, [2024-05-07T10:24:07.020900 #3008779] INFO -- : [295/885] 3050175=test_win32ole_typelib I, [2024-05-07T10:24:07.028776 #3008779] INFO -- : [296/885] 3050175=test_protect I, [2024-05-07T10:24:07.038693 #3008779] INFO -- : [297/885] 3050175=test_argf I, [2024-05-07T10:24:07.040060 #3008779] INFO -- : [298/885] 3050165=test_framework I, [2024-05-07T10:24:07.069283 #3008779] INFO -- : [299/885] 3050165=test_ns_spki I, [2024-05-07T10:24:07.094902 #3008779] INFO -- : [300/885] 3050165=test_kill_ring I, [2024-05-07T10:24:07.105128 #3008779] INFO -- : [301/885] 3050165=test_workspace I, [2024-05-07T10:24:07.282466 #3008779] INFO -- : [302/885] 3050165=test_weakmap I, [2024-05-07T10:24:07.364354 #3008779] INFO -- : [303/885] 3050180=test_yjit I, [2024-05-07T10:24:07.377827 #3008779] INFO -- : [304/885] 3050180=test_ws I, [2024-05-07T10:24:07.390728 #3008779] INFO -- : [305/885] 3050180=test_m17n I, [2024-05-07T10:24:07.412472 #3008779] INFO -- : [306/885] 3050172=test_gem_commands_environment_command I, [2024-05-07T10:24:07.433535 #3008779] INFO -- : [307/885] 3050179=test_gem_commands_exec_command I, [2024-05-07T10:24:07.455091 #3008779] INFO -- : [308/885] 3050181=test_io_wait I, [2024-05-07T10:24:07.459641 #3008779] INFO -- : [309/885] 3050172=warnings_test I, [2024-05-07T10:24:07.467676 #3008779] INFO -- : [310/885] 3050180=test_kwargs I, [2024-05-07T10:24:07.472180 #3008779] INFO -- : [311/885] 3050172=test_ellipsize I, [2024-05-07T10:24:07.475877 #3008779] INFO -- : [312/885] 3050180=test_date_attr I, [2024-05-07T10:24:07.476090 #3008779] INFO -- : [313/885] 3050180=test_console_attr I, [2024-05-07T10:24:07.477660 #3008779] INFO -- : [314/885] 3050180=test_summary I, [2024-05-07T10:24:07.485855 #3008779] INFO -- : [315/885] 3050172=test_type_completor I, [2024-05-07T10:24:07.486320 #3008779] INFO -- : [316/885] 3050172=test_gem_unsatisfiable_dependency_error I, [2024-05-07T10:24:07.499369 #3008779] INFO -- : [317/885] 3050172=test_win32ole_record I, [2024-05-07T10:24:07.508061 #3008779] INFO -- : [318/885] 3050172=test_cp949 I, [2024-05-07T10:24:07.511899 #3008779] INFO -- : [319/885] 3050172=test_condition I, [2024-05-07T10:24:07.512865 #3008779] INFO -- : [320/885] 3050172=test_gem_source_specific_file I, [2024-05-07T10:24:07.596871 #3008779] INFO -- : [321/885] 3050172=test_foreach I, [2024-05-07T10:24:07.624368 #3008779] INFO -- : [322/885] 3050172=test_gem_commands_uninstall_command I, [2024-05-07T10:24:07.632766 #3008779] INFO -- : [323/885] 3050180=test_io I, [2024-05-07T10:24:07.709869 #3008779] INFO -- : [324/885] 3050177=test_emoji I, [2024-05-07T10:24:07.741492 #3008779] INFO -- : [325/885] 3050177=test_win32ole_type_event I, [2024-05-07T10:24:07.747036 #3008779] INFO -- : [326/885] 3050177=test_sorted_set I, [2024-05-07T10:24:07.797322 #3008779] INFO -- : [327/885] 3050181=test_hash I, [2024-05-07T10:24:07.875858 #3008779] INFO -- : [328/885] 3050180=test_ubf_async_safe I, [2024-05-07T10:24:07.891466 #3008779] INFO -- : [329/885] 3050180=test_gem_impossible_dependencies_error I, [2024-05-07T10:24:07.934501 #3008779] INFO -- : [330/885] 3050173=test_pack I, [2024-05-07T10:24:07.935843 #3008779] INFO -- : [331/885] 3050171=test_array_create I, [2024-05-07T10:24:07.939067 #3008779] INFO -- : [332/885] 3050171=test_pattern_key_name_check I, [2024-05-07T10:24:07.942053 #3008779] INFO -- : [333/885] 3050171=test_to_ruby I, [2024-05-07T10:24:07.945640 #3008779] INFO -- : [334/885] 3050177=test_rdoc_rubygems_hook I, [2024-05-07T10:24:07.952681 #3008779] INFO -- : [335/885] 3050171=test_method I, [2024-05-07T10:24:08.044576 #3008779] INFO -- : [336/885] 3050177=test_gem_commands_query_command I, [2024-05-07T10:24:08.128330 #3008779] INFO -- : [337/885] 3050180=test_euc_kr I, [2024-05-07T10:24:08.132764 #3008779] INFO -- : [338/885] 3050180=test_rdoc_context_section I, [2024-05-07T10:24:08.141540 #3008779] INFO -- : [339/885] 3050180=test_ftp I, [2024-05-07T10:24:08.156883 #3008779] INFO -- : [340/885] 3050180=test_rdoc_parser_rd I, [2024-05-07T10:24:08.182387 #3008779] INFO -- : [341/885] 3050180=test_date_strftime I, [2024-05-07T10:24:08.209164 #3008779] INFO -- : [342/885] 3050173=test_gem_installer I, [2024-05-07T10:24:08.322765 #3008779] INFO -- : [343/885] 3050172=test_yamlstore I, [2024-05-07T10:24:08.337994 #3008779] INFO -- : [344/885] 3050172=test_asn1 I, [2024-05-07T10:24:08.354625 #3008779] INFO -- : [345/885] 3050172=test_random I, [2024-05-07T10:24:08.374066 #3008779] INFO -- : [346/885] 3050172=test_load I, [2024-05-07T10:24:08.390083 #3008779] INFO -- : [347/885] 3050172=json_string_matching_test I, [2024-05-07T10:24:08.420781 #3008779] INFO -- : [348/885] 3050172=test_const I, [2024-05-07T10:24:08.423203 #3008779] INFO -- : [349/885] 3050179=test_class I, [2024-05-07T10:24:08.432086 #3008779] INFO -- : [350/885] 3050172=test_rdoc_normal_class I, [2024-05-07T10:24:08.505466 #3008779] INFO -- : [351/885] 3050172=test_irb I, [2024-05-07T10:24:08.706553 #3008779] INFO -- : [352/885] 3050170=test_queue I, [2024-05-07T10:24:08.717779 #3008779] INFO -- : [353/885] 3050170=test_function I, [2024-05-07T10:24:08.745225 #3008779] INFO -- : [354/885] 3050177=parse_comments_test I, [2024-05-07T10:24:08.830724 #3008779] INFO -- : [355/885] 3050177=test_noarg I, [2024-05-07T10:24:08.868445 #3008779] INFO -- : [356/885] 3050172=test_tempfile I, [2024-05-07T10:24:08.943530 #3008779] INFO -- : [357/885] 3050180=test_tracepoint I, [2024-05-07T10:24:08.946380 #3008779] INFO -- : [358/885] 3050170=test_prettyprint I, [2024-05-07T10:24:08.972256 #3008779] INFO -- : [359/885] 3050170=test_rdoc_markup I, [2024-05-07T10:24:08.983414 #3008779] INFO -- : [360/885] 3050170=test_gem_commands_help_command I, [2024-05-07T10:24:09.044564 #3008779] INFO -- : [361/885] 3050177=test_duplicate I, [2024-05-07T10:24:09.050701 #3008779] INFO -- : [362/885] 3050177=test_basicsocket I, [2024-05-07T10:24:09.098677 #3008779] INFO -- : [363/885] 3050174=test_utf32 I, [2024-05-07T10:24:09.103002 #3008779] INFO -- : [364/885] 3050177=test_gem_resolver_index_specification I, [2024-05-07T10:24:09.116333 #3008779] INFO -- : [365/885] 3050174=test_internal_ivar I, [2024-05-07T10:24:09.119825 #3008779] INFO -- : [366/885] 3050174=test_stack I, [2024-05-07T10:24:09.124398 #3008779] INFO -- : [367/885] 3050170=test_gem_commands_list_command I, [2024-05-07T10:24:09.143628 #3008779] INFO -- : [368/885] 3050170=test_reqarg I, [2024-05-07T10:24:09.170461 #3008779] INFO -- : [369/885] 3050177=test_rdoc_include I, [2024-05-07T10:24:09.215151 #3008779] INFO -- : [370/885] 3050172=test_too_many_dummy_encodings I, [2024-05-07T10:24:09.217144 #3008779] INFO -- : [371/885] 3050177=test_cesu8 I, [2024-05-07T10:24:09.227858 #3008779] INFO -- : [372/885] 3050180=test_econv I, [2024-05-07T10:24:09.227920 #3008779] INFO -- : [373/885] 3050177=test_rdoc_options I, [2024-05-07T10:24:09.284547 #3008779] INFO -- : [374/885] 3050172=test_gem_version I, [2024-05-07T10:24:09.371415 #3008779] INFO -- : [375/885] 3050172=test_ldap I, [2024-05-07T10:24:09.385083 #3008779] INFO -- : [376/885] 3050172=test_resource I, [2024-05-07T10:24:09.408292 #3008779] INFO -- : [377/885] 3050172=test_gem_commands_signin_command I, [2024-05-07T10:24:09.467002 #3008779] INFO -- : [378/885] 3050177=test_emitter I, [2024-05-07T10:24:09.472847 #3008779] INFO -- : [379/885] 3050177=test_fileutils I, [2024-05-07T10:24:09.517195 #3008779] INFO -- : [380/885] 3050172=test_string_processing I, [2024-05-07T10:24:09.522612 #3008779] INFO -- : [381/885] 3050172=test_complex I, [2024-05-07T10:24:09.627961 #3008779] INFO -- : [382/885] 3050170=test_gem_commands_search_command I, [2024-05-07T10:24:09.635090 #3008779] INFO -- : [383/885] 3050170=test_method_cache I, [2024-05-07T10:24:09.636370 #3008779] INFO -- : [384/885] 3050170=test_gem_stub_specification I, [2024-05-07T10:24:09.682736 #3008779] INFO -- : [385/885] 3050172=test_frozen_error I, [2024-05-07T10:24:09.702439 #3008779] INFO -- : [386/885] 3050172=test_gem_ext_ext_conf_builder I, [2024-05-07T10:24:09.797315 #3008779] INFO -- : [387/885] 3050170=test_path_to_class I, [2024-05-07T10:24:09.801230 #3008779] INFO -- : [388/885] 3050170=test_gem_dependency I, [2024-05-07T10:24:09.932689 #3008779] INFO -- : [389/885] 3050170=test_gem_resolver_specification I, [2024-05-07T10:24:09.951804 #3008779] INFO -- : [390/885] 3050170=test_rdoc_markup_verbatim I, [2024-05-07T10:24:09.955268 #3008779] INFO -- : [391/885] 3050170=test_inlinecache I, [2024-05-07T10:24:10.001685 #3008779] INFO -- : [392/885] 3050177=test_gem_remote_fetcher I, [2024-05-07T10:24:10.009780 #3008779] INFO -- : [393/885] 3050170=test_parse I, [2024-05-07T10:24:10.071146 #3008779] INFO -- : [394/885] 3050164=test_mdns I, [2024-05-07T10:24:10.089153 #3008779] INFO -- : [395/885] 3050164=test_gem_resolver_installed_specification I, [2024-05-07T10:24:10.106318 #3008779] INFO -- : [396/885] 3050164=test_scanner_events I, [2024-05-07T10:24:10.141438 #3008779] INFO -- : [397/885] 3050164=test_big2str I, [2024-05-07T10:24:10.159069 #3008779] INFO -- : [398/885] 3050164=test_handle I, [2024-05-07T10:24:10.183131 #3008779] INFO -- : [399/885] 3050174=test_wait I, [2024-05-07T10:24:10.186065 #3008779] INFO -- : [400/885] 3050163=test_forwardable I, [2024-05-07T10:24:10.217465 #3008779] INFO -- : [401/885] 3050163=test_yaml I, [2024-05-07T10:24:10.267766 #3008779] INFO -- : [402/885] 3050174=test_rdoc_markup_formatter I, [2024-05-07T10:24:10.373511 #3008779] INFO -- : [403/885] 3050163=test_thread_queue I, [2024-05-07T10:24:10.381731 #3008779] INFO -- : [404/885] 3050164=test_nowrite I, [2024-05-07T10:24:10.412242 #3008779] INFO -- : [405/885] 3050164=test_ansi_without_terminfo I, [2024-05-07T10:24:10.428556 #3008779] INFO -- : [406/885] 3050180=test_gem_commands_sources_command I, [2024-05-07T10:24:10.447159 #3008779] INFO -- : [407/885] 3050174=test_euc_tw I, [2024-05-07T10:24:10.452442 #3008779] INFO -- : [408/885] 3050174=test_ractor I, [2024-05-07T10:24:10.468410 #3008779] INFO -- : [409/885] 3050174=test_bmethod I, [2024-05-07T10:24:10.474506 #3008779] INFO -- : [410/885] 3050174=json_fixtures_test I, [2024-05-07T10:24:10.484901 #3008779] INFO -- : [411/885] 3050164=test_shapes I, [2024-05-07T10:24:10.488042 #3008779] INFO -- : [412/885] 3050164=test_io_timeout I, [2024-05-07T10:24:10.490443 #3008779] INFO -- : [413/885] 3050174=test_rdoc_parser_c I, [2024-05-07T10:24:10.493943 #3008779] INFO -- : [414/885] 3050164=test_comparable I, [2024-05-07T10:24:10.498890 #3008779] INFO -- : [415/885] 3050164=test_enc_str_buf_cat I, [2024-05-07T10:24:10.506706 #3008779] INFO -- : [416/885] 3050164=test_class2name I, [2024-05-07T10:24:10.515591 #3008779] INFO -- : [417/885] 3050164=test_gbk I, [2024-05-07T10:24:10.524769 #3008779] INFO -- : [418/885] 3050164=test_profile_frames I, [2024-05-07T10:24:10.584341 #3008779] INFO -- : [419/885] 3050170=test_cstr I, [2024-05-07T10:24:10.614658 #3008779] INFO -- : [420/885] 3050180=test_pstore I, [2024-05-07T10:24:10.659239 #3008779] INFO -- : [421/885] 3050180=test_digest I, [2024-05-07T10:24:10.684222 #3008779] INFO -- : [422/885] 3050164=test_marshalable I, [2024-05-07T10:24:10.692233 #3008779] INFO -- : [423/885] 3050164=test_require I, [2024-05-07T10:24:10.826321 #3008779] INFO -- : [424/885] 3050174=test_cgi_util I, [2024-05-07T10:24:11.032007 #3008779] INFO -- : [425/885] 3050172=test_gem_commands_contents_command I, [2024-05-07T10:24:11.067127 #3008779] INFO -- : [426/885] 3050174=test_gem_ext_cmake_builder I, [2024-05-07T10:24:11.091095 #3008779] INFO -- : [427/885] 3050174=test_wss I, [2024-05-07T10:24:11.107566 #3008779] INFO -- : [428/885] 3050174=test_fiddle I, [2024-05-07T10:24:11.124107 #3008779] INFO -- : [429/885] 3050165=test_find I, [2024-05-07T10:24:11.137454 #3008779] INFO -- : [430/885] 3050165=test_ractor I, [2024-05-07T10:24:11.152609 #3008779] INFO -- : [431/885] 3050172=test_pathname I, [2024-05-07T10:24:11.197877 #3008779] INFO -- : [432/885] 3050174=test_init I, [2024-05-07T10:24:11.203125 #3008779] INFO -- : [433/885] 3050178=test_complexrational I, [2024-05-07T10:24:11.205230 #3008779] INFO -- : [434/885] 3050178=test_gem_package_tar_reader I, [2024-05-07T10:24:11.236034 #3008779] INFO -- : [435/885] 3050178=regexp_test I, [2024-05-07T10:24:11.239153 #3008779] INFO -- : [436/885] 3050165=test_coverage I, [2024-05-07T10:24:11.260463 #3008779] INFO -- : [437/885] 3050170=test_rdoc_encoding I, [2024-05-07T10:24:11.284132 #3008779] INFO -- : [438/885] 3050170=test_file I, [2024-05-07T10:24:11.291071 #3008779] INFO -- : [439/885] 3050170=test_modify_expand I, [2024-05-07T10:24:11.292525 #3008779] INFO -- : [440/885] 3050175=test_rdoc_any_method I, [2024-05-07T10:24:11.306013 #3008779] INFO -- : [441/885] 3050170=test_gem_available_set I, [2024-05-07T10:24:11.367542 #3008779] INFO -- : [442/885] 3050178=test_rdoc_markdown I, [2024-05-07T10:24:11.371185 #3008779] INFO -- : [443/885] 3050182=test_formatter I, [2024-05-07T10:24:11.374771 #3008779] INFO -- : [444/885] 3050182=test_bash_completion I, [2024-05-07T10:24:11.377344 #3008779] INFO -- : [445/885] 3050172=test_rdoc_constant I, [2024-05-07T10:24:11.379819 #3008779] INFO -- : [446/885] 3050182=test_deprecate I, [2024-05-07T10:24:11.391143 #3008779] INFO -- : [447/885] 3050170=test_recorder I, [2024-05-07T10:24:11.396972 #3008779] INFO -- : [448/885] 3050170=test_gem_commands_owner_command I, [2024-05-07T10:24:11.413415 #3008779] INFO -- : [449/885] 3050182=test_gem_source_vendor I, [2024-05-07T10:24:11.419162 #3008779] INFO -- : [450/885] 3050182=test_refinement I, [2024-05-07T10:24:11.472501 #3008779] INFO -- : [451/885] 3050168=test_gem_commands_signout_command I, [2024-05-07T10:24:11.490361 #3008779] INFO -- : [452/885] 3050172=test_regex_casefold I, [2024-05-07T10:24:11.499068 #3008779] INFO -- : [453/885] 3050179=test_gem_source_git I, [2024-05-07T10:24:11.509137 #3008779] INFO -- : [454/885] 3050180=test_dir_m17n I, [2024-05-07T10:24:11.585036 #3008779] INFO -- : [455/885] 3050178=test_gem_resolver_installer_set I, [2024-05-07T10:24:11.693736 #3008779] INFO -- : [456/885] 3050168=test_float I, [2024-05-07T10:24:11.701634 #3008779] INFO -- : [457/885] 3050174=test_cgi_cookie I, [2024-05-07T10:24:11.706739 #3008779] INFO -- : [458/885] 3050174=test_require I, [2024-05-07T10:24:11.770283 #3008779] INFO -- : [459/885] 3050178=test_process I, [2024-05-07T10:24:11.789479 #3008779] INFO -- : [460/885] 3050178=test_windows_1252 I, [2024-05-07T10:24:11.793899 #3008779] INFO -- : [461/885] 3050175=test_input_method I, [2024-05-07T10:24:11.794860 #3008779] INFO -- : [462/885] 3050178=test_cgi_session I, [2024-05-07T10:24:11.812751 #3008779] INFO -- : [463/885] 3050178=test_rdoc_rd I, [2024-05-07T10:24:11.822750 #3008779] INFO -- : [464/885] 3050178=test_metaclass I, [2024-05-07T10:24:11.826007 #3008779] INFO -- : [465/885] 3050178=test_rdoc_top_level I, [2024-05-07T10:24:11.945417 #3008779] INFO -- : [466/885] 3050170=test_signal I, [2024-05-07T10:24:11.953491 #3008779] INFO -- : [467/885] 3050164=test_fixnum I, [2024-05-07T10:24:11.957899 #3008779] INFO -- : [468/885] 3050175=test_x509crl I, [2024-05-07T10:24:11.969906 #3008779] INFO -- : [469/885] 3050164=test_debug I, [2024-05-07T10:24:11.971733 #3008779] INFO -- : [470/885] 3050164=pattern_test I, [2024-05-07T10:24:11.973906 #3008779] INFO -- : [471/885] 3050181=test_memory_view I, [2024-05-07T10:24:11.989970 #3008779] INFO -- : [472/885] 3050164=test_shellwords I, [2024-05-07T10:24:11.996427 #3008779] INFO -- : [473/885] 3050181=test_digest_extend I, [2024-05-07T10:24:12.001329 #3008779] INFO -- : [474/885] 3050164=test_string I, [2024-05-07T10:24:12.001840 #3008779] INFO -- : [475/885] 3050164=test_iterator I, [2024-05-07T10:24:12.010252 #3008779] INFO -- : [476/885] 3050181=test_omap I, [2024-05-07T10:24:12.012356 #3008779] INFO -- : [477/885] 3050171=test_gem_resolver_git_set I, [2024-05-07T10:24:12.014090 #3008779] INFO -- : [478/885] 3050181=test_storage I, [2024-05-07T10:24:12.018022 #3008779] INFO -- : [479/885] 3050181=test_new I, [2024-05-07T10:24:12.026017 #3008779] INFO -- : [480/885] 3050181=test_cipher I, [2024-05-07T10:24:12.077141 #3008779] INFO -- : [481/885] 3050181=test_gem_security_signer I, [2024-05-07T10:24:12.087918 #3008779] INFO -- : [482/885] 3050164=memsize_test I, [2024-05-07T10:24:12.089231 #3008779] INFO -- : [483/885] 3050164=json_parser_test I, [2024-05-07T10:24:12.089884 #3008779] INFO -- : [484/885] 3050165=test_nomethod_error I, [2024-05-07T10:24:12.100097 #3008779] INFO -- : [485/885] 3050165=test_config I, [2024-05-07T10:24:12.124438 #3008779] INFO -- : [486/885] 3050179=test_win32ole_variant_outarg I, [2024-05-07T10:24:12.124756 #3008779] INFO -- : [487/885] 3050179=test_gem_source_subpath_problem I, [2024-05-07T10:24:12.126128 #3008779] INFO -- : [488/885] 3050165=test_dln I, [2024-05-07T10:24:12.126533 #3008779] INFO -- : [489/885] 3050165=json_common_interface_test I, [2024-05-07T10:24:12.136017 #3008779] INFO -- : [490/885] 3050172=test_struct I, [2024-05-07T10:24:12.141168 #3008779] INFO -- : [491/885] 3050172=test_rdoc_markup_to_html_snippet I, [2024-05-07T10:24:12.142195 #3008779] INFO -- : [492/885] 3050175=magic_comment_test I, [2024-05-07T10:24:12.142546 #3008779] INFO -- : [493/885] 3050164=test_rdoc_markup_include I, [2024-05-07T10:24:12.145984 #3008779] INFO -- : [494/885] 3050164=test_sexp I, [2024-05-07T10:24:12.149234 #3008779] INFO -- : [495/885] 3050175=fuzzer_test I, [2024-05-07T10:24:12.159109 #3008779] INFO -- : [496/885] 3050165=test_variable I, [2024-05-07T10:24:12.159284 #3008779] INFO -- : [497/885] 3050175=test_pkg_config I, [2024-05-07T10:24:12.161404 #3008779] INFO -- : [498/885] 3050178=test_cparser I, [2024-05-07T10:24:12.166061 #3008779] INFO -- : [499/885] 3050164=test_serialize_subclasses I, [2024-05-07T10:24:12.170985 #3008779] INFO -- : [500/885] 3050164=test_insns_leaf I, [2024-05-07T10:24:12.175346 #3008779] INFO -- : [501/885] 3050181=test_deprecated I, [2024-05-07T10:24:12.176067 #3008779] INFO -- : [502/885] 3050177=test_color_printer I, [2024-05-07T10:24:12.179904 #3008779] INFO -- : [503/885] 3050181=test_win32ole_variant_m I, [2024-05-07T10:24:12.181570 #3008779] INFO -- : [504/885] 3050177=test_engine I, [2024-05-07T10:24:12.183210 #3008779] INFO -- : [505/885] 3050181=test_allocation I, [2024-05-07T10:24:12.184696 #3008779] INFO -- : [506/885] 3050164=test_div I, [2024-05-07T10:24:12.186899 #3008779] INFO -- : [507/885] 3050164=test_key_error I, [2024-05-07T10:24:12.188576 #3008779] INFO -- : [508/885] 3050177=test_x509req I, [2024-05-07T10:24:12.190440 #3008779] INFO -- : [509/885] 3050164=test_mutex I, [2024-05-07T10:24:12.202316 #3008779] INFO -- : [510/885] 3050175=test_rdoc_rd_inline I, [2024-05-07T10:24:12.206855 #3008779] INFO -- : [511/885] 3050175=test_files_test_1 I, [2024-05-07T10:24:12.207634 #3008779] INFO -- : [512/885] 3050175=test_set I, [2024-05-07T10:24:12.215858 #3008779] INFO -- : [513/885] 3050172=test_gem_path_support I, [2024-05-07T10:24:12.233203 #3008779] INFO -- : [514/885] 3050175=test_struct I, [2024-05-07T10:24:12.253327 #3008779] INFO -- : [515/885] 3050165=test_module I, [2024-05-07T10:24:12.254254 #3008779] INFO -- : [516/885] 3050172=test_gem_request_set I, [2024-05-07T10:24:12.262417 #3008779] INFO -- : [517/885] 3050179=constant_path_node_test I, [2024-05-07T10:24:12.267908 #3008779] INFO -- : [518/885] 3050179=test_gem_ext_cargo_builder I, [2024-05-07T10:24:12.292239 #3008779] INFO -- : [519/885] 3050179=test_ssl I, [2024-05-07T10:24:12.395504 #3008779] INFO -- : [520/885] 3050177=test_arith_seq_extract I, [2024-05-07T10:24:12.413737 #3008779] INFO -- : [521/885] 3050171=test_method_name_check I, [2024-05-07T10:24:12.431604 #3008779] INFO -- : [522/885] 3050171=test_parser I, [2024-05-07T10:24:12.476864 #3008779] INFO -- : [523/885] 3050171=test_whileuntil I, [2024-05-07T10:24:12.478036 #3008779] INFO -- : [524/885] 3050171=test_rdoc_generator_markup I, [2024-05-07T10:24:12.487436 #3008779] INFO -- : [525/885] 3050171=test_configuration I, [2024-05-07T10:24:12.530715 #3008779] INFO -- : [526/885] 3050177=test_rubyvm I, [2024-05-07T10:24:12.533820 #3008779] INFO -- : [527/885] 3050177=test_buffered_io I, [2024-05-07T10:24:12.571708 #3008779] INFO -- : [528/885] 3050177=test_monitor I, [2024-05-07T10:24:12.581525 #3008779] INFO -- : [529/885] 3050171=integer_parse_test I, [2024-05-07T10:24:12.593963 #3008779] INFO -- : [530/885] 3050171=test_instrumentation_api I, [2024-05-07T10:24:12.694603 #3008779] INFO -- : [531/885] 3050172=test_stringify_symbols I, [2024-05-07T10:24:12.709589 #3008779] INFO -- : [532/885] 3050172=test_boolean I, [2024-05-07T10:24:12.718031 #3008779] INFO -- : [533/885] 3050172=test_gem_source I, [2024-05-07T10:24:12.787884 #3008779] INFO -- : [534/885] 3050177=test_scalar_scanner I, [2024-05-07T10:24:12.795662 #3008779] INFO -- : [535/885] 3050177=test_gem_commands_outdated_command I, [2024-05-07T10:24:12.834090 #3008779] INFO -- : [536/885] 3050177=test_gem_package_tar_writer I, [2024-05-07T10:24:12.883971 #3008779] INFO -- : [537/885] 3050175=test_helper_method I, [2024-05-07T10:24:12.896517 #3008779] INFO -- : [538/885] 3050175=test_array I, [2024-05-07T10:24:12.942481 #3008779] INFO -- : [539/885] 3050177=test_gem_dependency_list I, [2024-05-07T10:24:12.978389 #3008779] INFO -- : [540/885] 3050180=test_benchmark I, [2024-05-07T10:24:12.981273 #3008779] INFO -- : [541/885] 3050172=test_win32ole_method_event I, [2024-05-07T10:24:12.981457 #3008779] INFO -- : [542/885] 3050172=test_nesting_parser I, [2024-05-07T10:24:12.992545 #3008779] INFO -- : [543/885] 3050172=test_https I, [2024-05-07T10:24:13.007382 #3008779] INFO -- : [544/885] 3050177=test_gem_ext_builder I, [2024-05-07T10:24:13.009973 #3008779] INFO -- : [545/885] 3050167=test_evaluation I, [2024-05-07T10:24:13.012744 #3008779] INFO -- : [546/885] 3050167=test_abi I, [2024-05-07T10:24:13.067903 #3008779] INFO -- : [547/885] 3050178=test_provider I, [2024-05-07T10:24:13.087360 #3008779] INFO -- : [548/885] 3050168=test_rdoc_parser_simple I, [2024-05-07T10:24:13.143578 #3008779] INFO -- : [549/885] 3050167=test_gem_commands_rebuild_command I, [2024-05-07T10:24:13.208180 #3008779] INFO -- : [550/885] 3050173=test_yamldbm I, [2024-05-07T10:24:13.208241 #3008779] INFO -- : [551/885] 3050173=test_load I, [2024-05-07T10:24:13.209833 #3008779] INFO -- : [552/885] 3050173=test_len I, [2024-05-07T10:24:13.211489 #3008779] INFO -- : [553/885] 3050173=test_yield_block I, [2024-05-07T10:24:13.213185 #3008779] INFO -- : [554/885] 3050167=test_completion I, [2024-05-07T10:24:13.216337 #3008779] INFO -- : [555/885] 3050173=test_gem_commands_cert_command I, [2024-05-07T10:24:13.244391 #3008779] INFO -- : [556/885] 3050168=test_x509ext I, [2024-05-07T10:24:13.253411 #3008779] INFO -- : [557/885] 3050168=test_erb I, [2024-05-07T10:24:13.300855 #3008779] INFO -- : [558/885] 3050168=test_gem_source_installed I, [2024-05-07T10:24:13.324223 #3008779] INFO -- : [559/885] 3050164=test_assembler I, [2024-05-07T10:24:13.328352 #3008779] INFO -- : [560/885] 3050164=test_spell_checker I, [2024-05-07T10:24:13.328599 #3008779] INFO -- : [561/885] 3050168=attribute_write_test I, [2024-05-07T10:24:13.337383 #3008779] INFO -- : [562/885] 3050172=test_propertyputref I, [2024-05-07T10:24:13.340713 #3008779] INFO -- : [563/885] 3050172=test_rational I, [2024-05-07T10:24:13.343648 #3008779] INFO -- : [564/885] 3050164=test_rational2 I, [2024-05-07T10:24:13.356145 #3008779] INFO -- : [565/885] 3050164=test_rbconfig I, [2024-05-07T10:24:13.359855 #3008779] INFO -- : [566/885] 3050164=test_human_typo I, [2024-05-07T10:24:13.363695 #3008779] INFO -- : [567/885] 3050164=test_primitive I, [2024-05-07T10:24:13.366317 #3008779] INFO -- : [568/885] 3050172=test_name_error_extension I, [2024-05-07T10:24:13.383059 #3008779] INFO -- : [569/885] 3050172=test_chilled I, [2024-05-07T10:24:13.386786 #3008779] INFO -- : [570/885] 3050172=test_rdoc_i18n_locale I, [2024-05-07T10:24:13.388568 #3008779] INFO -- : [571/885] 3050168=test_win32ole_param I, [2024-05-07T10:24:13.391765 #3008779] INFO -- : [572/885] 3050164=test_gem_commands_yank_command I, [2024-05-07T10:24:13.392102 #3008779] INFO -- : [573/885] 3050168=test_pair I, [2024-05-07T10:24:13.395965 #3008779] INFO -- : [574/885] 3050172=test_document I, [2024-05-07T10:24:13.397780 #3008779] INFO -- : [575/885] 3050172=test_euc_jp I, [2024-05-07T10:24:13.407833 #3008779] INFO -- : [576/885] 3050172=test_rdoc_generator_pot_po_entry I, [2024-05-07T10:24:13.410674 #3008779] INFO -- : [577/885] 3050172=test_acceptable I, [2024-05-07T10:24:13.416470 #3008779] INFO -- : [578/885] 3050178=test_install I, [2024-05-07T10:24:13.541618 #3008779] INFO -- : [579/885] 3050172=test_rdoc_markup_to_label I, [2024-05-07T10:24:13.562374 #3008779] INFO -- : [580/885] 3050172=test_sockopt I, [2024-05-07T10:24:13.572296 #3008779] INFO -- : [581/885] 3050172=test_encoding I, [2024-05-07T10:24:13.580373 #3008779] INFO -- : [582/885] 3050172=test_httpresponses I, [2024-05-07T10:24:13.583555 #3008779] INFO -- : [583/885] 3050172=test_set_len I, [2024-05-07T10:24:13.589944 #3008779] INFO -- : [584/885] 3050172=test_httpheader I, [2024-05-07T10:24:13.594191 #3008779] INFO -- : [585/885] 3050172=test_gem_resolver_local_specification I, [2024-05-07T10:24:13.629697 #3008779] INFO -- : [586/885] 3050172=test_rdoc_ri_driver I, [2024-05-07T10:24:13.630081 #3008779] INFO -- : [587/885] 3050178=test_color I, [2024-05-07T10:24:13.719692 #3008779] INFO -- : [588/885] 3050178=json_encoding_test I, [2024-05-07T10:24:13.723071 #3008779] INFO -- : [589/885] 3050169=test_key_stroke I, [2024-05-07T10:24:13.730114 #3008779] INFO -- : [590/885] 3050169=test_compile_prism I, [2024-05-07T10:24:13.737972 #3008779] INFO -- : [591/885] 3050178=test_terminfo I, [2024-05-07T10:24:13.742067 #3008779] INFO -- : [592/885] 3050178=test_date_compat I, [2024-05-07T10:24:13.746244 #3008779] INFO -- : [593/885] 3050178=test_rdoc_markup_to_html I, [2024-05-07T10:24:13.828309 #3008779] INFO -- : [594/885] 3050178=test_bug-14834 I, [2024-05-07T10:24:13.872685 #3008779] INFO -- : [595/885] 3050172=test_http I, [2024-05-07T10:24:13.876028 #3008779] INFO -- : [596/885] 3050167=test_addrinfo I, [2024-05-07T10:24:13.880711 #3008779] INFO -- : [597/885] 3050164=test_tree_spell_checker I, [2024-05-07T10:24:13.895371 #3008779] INFO -- : [598/885] 3050178=test_path I, [2024-05-07T10:24:13.902285 #3008779] INFO -- : [599/885] 3050178=test_case_mapping I, [2024-05-07T10:24:13.904522 #3008779] INFO -- : [600/885] 3050167=redundant_return_test I, [2024-05-07T10:24:13.913755 #3008779] INFO -- : [601/885] 3050178=test_bn I, [2024-05-07T10:24:13.921075 #3008779] INFO -- : [602/885] 3050178=test_win32ole_param_event I, [2024-05-07T10:24:13.922173 #3008779] INFO -- : [603/885] 3050178=parameters_signature_test I, [2024-05-07T10:24:13.931520 #3008779] INFO -- : [604/885] 3050178=test_koi8 I, [2024-05-07T10:24:13.934466 #3008779] INFO -- : [605/885] 3050164=test_enumerator I, [2024-05-07T10:24:13.935936 #3008779] INFO -- : [606/885] 3050164=test_rdoc_parser_changelog I, [2024-05-07T10:24:13.938572 #3008779] INFO -- : [607/885] 3050178=test_unicode I, [2024-05-07T10:24:13.944978 #3008779] INFO -- : [608/885] 3050178=test_rdoc_generator_pot I, [2024-05-07T10:24:13.955684 #3008779] INFO -- : [609/885] 3050178=test_gem_gem_runner I, [2024-05-07T10:24:13.965315 #3008779] INFO -- : [610/885] 3050167=test_filter I, [2024-05-07T10:24:13.967087 #3008779] INFO -- : [611/885] 3050177=test_data I, [2024-05-07T10:24:13.970338 #3008779] INFO -- : [612/885] 3050177=static_literals_test I, [2024-05-07T10:24:13.975592 #3008779] INFO -- : [613/885] 3050177=test_rdoc_method_attr I, [2024-05-07T10:24:13.978750 #3008779] INFO -- : [614/885] 3050167=test_key_event_record I, [2024-05-07T10:24:13.979574 #3008779] INFO -- : [615/885] 3050167=test_gem_uri I, [2024-05-07T10:24:13.998560 #3008779] INFO -- : [616/885] 3050167=test_random I, [2024-05-07T10:24:14.005164 #3008779] INFO -- : [617/885] 3050167=test_notimplement I, [2024-05-07T10:24:14.009589 #3008779] INFO -- : [618/885] 3050167=test_gem_commands_update_command I, [2024-05-07T10:24:14.009843 #3008779] INFO -- : [619/885] 3050178=test_gem_resolver_vendor_specification I, [2024-05-07T10:24:14.018131 #3008779] INFO -- : [620/885] 3050164=test_thread_cv I, [2024-05-07T10:24:14.023251 #3008779] INFO -- : [621/885] 3050169=test_lexer I, [2024-05-07T10:24:14.032382 #3008779] INFO -- : [622/885] 3050169=test_ssl_session I, [2024-05-07T10:24:14.051397 #3008779] INFO -- : [623/885] 3050178=test_interned_str I, [2024-05-07T10:24:14.051697 #3008779] INFO -- : [624/885] 3050178=test_case_comprehensive I, [2024-05-07T10:24:14.099235 #3008779] INFO -- : [625/885] 3050170=test_gem_commands_build_command I, [2024-05-07T10:24:14.116376 #3008779] INFO -- : [626/885] 3050177=test_cmethod I, [2024-05-07T10:24:14.121413 #3008779] INFO -- : [627/885] 3050177=test_tracer I, [2024-05-07T10:24:14.127332 #3008779] INFO -- : [628/885] 3050177=test_append I, [2024-05-07T10:24:14.129117 #3008779] INFO -- : [629/885] 3050177=test_option I, [2024-05-07T10:24:14.136889 #3008779] INFO -- : [630/885] 3050182=test_gem_commands_server_command I, [2024-05-07T10:24:14.139945 #3008779] INFO -- : [631/885] 3050182=test_variable_name_check I, [2024-05-07T10:24:14.176640 #3008779] INFO -- : [632/885] 3050182=test_io_m17n I, [2024-05-07T10:24:14.182838 #3008779] INFO -- : [633/885] 3050165=test_did_you_mean I, [2024-05-07T10:24:14.260568 #3008779] INFO -- : [634/885] 3050180=test_rdoc_markup_heading I, [2024-05-07T10:24:14.269477 #3008779] INFO -- : [635/885] 3050180=test_iseq I, [2024-05-07T10:24:14.278361 #3008779] INFO -- : [636/885] 3050177=test_exception_at_throwing I, [2024-05-07T10:24:14.306045 #3008779] INFO -- : [637/885] 3050165=test_scheduler I, [2024-05-07T10:24:14.331657 #3008779] INFO -- : [638/885] 3050170=test_pkey_dsa I, [2024-05-07T10:24:14.349803 #3008779] INFO -- : [639/885] 3050177=test_class I, [2024-05-07T10:24:14.353933 #3008779] INFO -- : [640/885] 3050177=test_ocsp I, [2024-05-07T10:24:14.413446 #3008779] INFO -- : [641/885] 3050174=test_rdoc_markup_to_bs I, [2024-05-07T10:24:14.453456 #3008779] INFO -- : [642/885] 3050165=test_help I, [2024-05-07T10:24:14.456730 #3008779] INFO -- : [643/885] 3050174=test_gem_commands_unpack_command I, [2024-05-07T10:24:14.462735 #3008779] INFO -- : [644/885] 3050165=test_files_lib I, [2024-05-07T10:24:14.606534 #3008779] INFO -- : [645/885] 3050177=test_beginendblock I, [2024-05-07T10:24:14.659411 #3008779] INFO -- : [646/885] 3050164=reflection_test I, [2024-05-07T10:24:14.664494 #3008779] INFO -- : [647/885] 3050164=test_gem_bundler_version_finder I, [2024-05-07T10:24:14.700090 #3008779] INFO -- : [648/885] 3050164=test_emoji_breaks I, [2024-05-07T10:24:14.717115 #3008779] INFO -- : [649/885] 3050164=test_within_pipe I, [2024-05-07T10:24:14.734594 #3008779] INFO -- : [650/885] 3050164=test_pinned I, [2024-05-07T10:24:14.772794 #3008779] INFO -- : [651/885] 3050164=test_time I, [2024-05-07T10:24:14.793435 #3008779] INFO -- : [652/885] 3050163=test_webauthn_listener_response I, [2024-05-07T10:24:14.817442 #3008779] INFO -- : [653/885] 3050163=test_to_ary_concat I, [2024-05-07T10:24:14.828131 #3008779] INFO -- : [654/885] 3050174=test_stream I, [2024-05-07T10:24:14.840049 #3008779] INFO -- : [655/885] 3050174=test_rdoc_markup_pre_process I, [2024-05-07T10:24:14.883435 #3008779] INFO -- : [656/885] 3050181=test_printf I, [2024-05-07T10:24:14.888433 #3008779] INFO -- : [657/885] 3050180=test_exit I, [2024-05-07T10:24:14.905294 #3008779] INFO -- : [658/885] 3050181=test_recursion I, [2024-05-07T10:24:14.920754 #3008779] INFO -- : [659/885] 3050181=test_history I, [2024-05-07T10:24:14.950480 #3008779] INFO -- : [660/885] 3050181=test_date_marshal I, [2024-05-07T10:24:14.955769 #3008779] INFO -- : [661/885] 3050181=test_mkmf I, [2024-05-07T10:24:14.956459 #3008779] INFO -- : [662/885] 3050164=test_delegate I, [2024-05-07T10:24:14.963044 #3008779] INFO -- : [663/885] 3050180=test_popen_deadlock I, [2024-05-07T10:24:14.968756 #3008779] INFO -- : [664/885] 3050164=test_closure I, [2024-05-07T10:24:14.980898 #3008779] INFO -- : [665/885] 3050174=test_bundled_ca I, [2024-05-07T10:24:14.987969 #3008779] INFO -- : [666/885] 3050181=test_fiber I, [2024-05-07T10:24:15.016062 #3008779] INFO -- : [667/885] 3050177=test_multi_irb_commands I, [2024-05-07T10:24:15.018226 #3008779] INFO -- : [668/885] 3050177=test_open3 I, [2024-05-07T10:24:15.060484 #3008779] INFO -- : [669/885] 3050169=test_ractor I, [2024-05-07T10:24:15.132427 #3008779] INFO -- : [670/885] 3050169=test_gem_security I, [2024-05-07T10:24:15.160647 #3008779] INFO -- : [671/885] 3050167=test_rdoc_servlet I, [2024-05-07T10:24:15.271455 #3008779] INFO -- : [672/885] 3050167=test_digest I, [2024-05-07T10:24:15.316354 #3008779] INFO -- : [673/885] 3050167=test_tmpdir I, [2024-05-07T10:24:15.348813 #3008779] INFO -- : [674/885] 3050182=test_rdoc_markup_document I, [2024-05-07T10:24:15.396163 #3008779] INFO -- : [675/885] 3050173=test_integer_comb I, [2024-05-07T10:24:15.418554 #3008779] INFO -- : [676/885] 3050167=test_vm_dump I, [2024-05-07T10:24:15.423832 #3008779] INFO -- : [677/885] 3050167=errors_test I, [2024-05-07T10:24:15.445227 #3008779] INFO -- : [678/885] 3050164=test_regexp I, [2024-05-07T10:24:15.503014 #3008779] INFO -- : [679/885] 3050182=test_gem_commands_check_command I, [2024-05-07T10:24:15.530387 #3008779] INFO -- : [680/885] 3050167=static_inspect_test I, [2024-05-07T10:24:15.534252 #3008779] INFO -- : [681/885] 3050182=test_udp I, [2024-05-07T10:24:15.534623 #3008779] INFO -- : [682/885] 3050170=bom_test I, [2024-05-07T10:24:15.536862 #3008779] INFO -- : [683/885] 3050167=test_data_error I, [2024-05-07T10:24:15.537123 #3008779] INFO -- : [684/885] 3050171=test_force_exit I, [2024-05-07T10:24:15.549585 #3008779] INFO -- : [685/885] 3050182=test_file I, [2024-05-07T10:24:15.597508 #3008779] INFO -- : [686/885] 3050171=unescape_test I, [2024-05-07T10:24:15.621819 #3008779] INFO -- : [687/885] 3050170=test_ostruct I, [2024-05-07T10:24:15.626996 #3008779] INFO -- : [688/885] 3050167=test_project_sanity I, [2024-05-07T10:24:15.642511 #3008779] INFO -- : [689/885] 3050180=test_range I, [2024-05-07T10:24:15.676417 #3008779] INFO -- : [690/885] 3050167=command_line_test I, [2024-05-07T10:24:15.678730 #3008779] INFO -- : [691/885] 3050167=test_pty I, [2024-05-07T10:24:15.795244 #3008779] INFO -- : [692/885] 3050170=test_dup I, [2024-05-07T10:24:15.884347 #3008779] INFO -- : [693/885] 3050163=test_constant I, [2024-05-07T10:24:16.022968 #3008779] INFO -- : [694/885] 3050170=test_erb_command I, [2024-05-07T10:24:16.060444 #3008779] INFO -- : [695/885] 3050170=test_helper I, [2024-05-07T10:24:16.064532 #3008779] INFO -- : [696/885] 3050170=test_encoding I, [2024-05-07T10:24:16.193320 #3008779] INFO -- : [697/885] 3050167=test_gem_uri_formatter I, [2024-05-07T10:24:16.220561 #3008779] INFO -- : [698/885] 3050167=test_ensured I, [2024-05-07T10:24:16.224401 #3008779] INFO -- : [699/885] 3050180=test_addr I, [2024-05-07T10:24:16.246296 #3008779] INFO -- : [700/885] 3050180=test_locale I, [2024-05-07T10:24:16.258908 #3008779] INFO -- : [701/885] 3050170=library_symbols_test I, [2024-05-07T10:24:16.260810 #3008779] INFO -- : [702/885] 3050170=test_ts I, [2024-05-07T10:24:16.282789 #3008779] INFO -- : [703/885] 3050167=test_rdoc_ri_paths I, [2024-05-07T10:24:16.314008 #3008779] INFO -- : [704/885] 3050167=test_gem_resolver_api_set I, [2024-05-07T10:24:16.368245 #3008779] INFO -- : [705/885] 3050180=test_gem_safe_marshal I, [2024-05-07T10:24:16.374432 #3008779] INFO -- : [706/885] 3050167=test_enumerable I, [2024-05-07T10:24:16.382311 #3008779] INFO -- : [707/885] 3050167=test_config I, [2024-05-07T10:24:16.477896 #3008779] INFO -- : [708/885] 3050171=test_gem_resolver_vendor_set I, [2024-05-07T10:24:16.493847 #3008779] INFO -- : [709/885] 3050171=json_generator_test I, [2024-05-07T10:24:16.590101 #3008779] INFO -- : [710/885] 3050171=test_eval I, [2024-05-07T10:24:16.675870 #3008779] INFO -- : [711/885] 3050170=test_transcode I, [2024-05-07T10:24:16.767608 #3008779] INFO -- : [712/885] 3050171=test_update I, [2024-05-07T10:24:16.768643 #3008779] INFO -- : [713/885] 3050171=test_x509name I, [2024-05-07T10:24:16.787268 #3008779] INFO -- : [714/885] 3050171=test_fips I, [2024-05-07T10:24:16.814083 #3008779] INFO -- : [715/885] 3050168=test_x509store I, [2024-05-07T10:24:16.877733 #3008779] INFO -- : [716/885] 3050167=test_rdoc_code_object I, [2024-05-07T10:24:16.909629 #3008779] INFO -- : [717/885] 3050170=test_webauthn_listener I, [2024-05-07T10:24:16.962570 #3008779] INFO -- : [718/885] 3050170=test_helper I, [2024-05-07T10:24:16.964258 #3008779] INFO -- : [719/885] 3050170=test_random_formatter I, [2024-05-07T10:24:16.983182 #3008779] INFO -- : [720/885] 3050170=test_jaro_winkler I, [2024-05-07T10:24:16.989910 #3008779] INFO -- : [721/885] 3050170=test_lambda I, [2024-05-07T10:24:17.031197 #3008779] INFO -- : [722/885] 3050171=test_ast I, [2024-05-07T10:24:17.053516 #3008779] INFO -- : [723/885] 3050170=test_gem_request_set_gem_dependency_api I, [2024-05-07T10:24:17.054087 #3008779] INFO -- : [724/885] 3050180=test_gem_platform I, [2024-05-07T10:24:17.081098 #3008779] INFO -- : [725/885] 3050174=test_placearg I, [2024-05-07T10:24:17.136411 #3008779] INFO -- : [726/885] 3050180=test_date_strptime I, [2024-05-07T10:24:17.137557 #3008779] INFO -- : [727/885] 3050168=test_gem_package_task I, [2024-05-07T10:24:17.142548 #3008779] INFO -- : [728/885] 3050168=test_rdoc_markup_hard_break I, [2024-05-07T10:24:17.144942 #3008779] INFO -- : [729/885] 3050168=test_weakkeymap I, [2024-05-07T10:24:17.154942 #3008779] INFO -- : [730/885] 3050167=test_gem_commands_push_command I, [2024-05-07T10:24:17.206380 #3008779] INFO -- : [731/885] 3050174=test_numhash I, [2024-05-07T10:24:17.217539 #3008779] INFO -- : [732/885] 3050174=test_pkey_rsa I, [2024-05-07T10:24:17.238001 #3008779] INFO -- : [733/885] 3050180=test_keyword I, [2024-05-07T10:24:17.258664 #3008779] INFO -- : [734/885] 3050170=test_class_name_check I, [2024-05-07T10:24:17.270133 #3008779] INFO -- : [735/885] 3050170=test_fd_setsize I, [2024-05-07T10:24:17.270878 #3008779] INFO -- : [736/885] 3050170=test_continuation I, [2024-05-07T10:24:17.274876 #3008779] INFO -- : [737/885] 3050170=test_win32ole_method I, [2024-05-07T10:24:17.278031 #3008779] INFO -- : [738/885] 3050170=test_delete I, [2024-05-07T10:24:17.283213 #3008779] INFO -- : [739/885] 3050170=test_logger I, [2024-05-07T10:24:17.298268 #3008779] INFO -- : [740/885] 3050170=test_file_exhaustive I, [2024-05-07T10:24:17.347425 #3008779] INFO -- : [741/885] 3050166=test_files_test I, [2024-05-07T10:24:17.379051 #3008779] INFO -- : [742/885] 3050168=test_gem_update_suggestion I, [2024-05-07T10:24:17.379888 #3008779] INFO -- : [743/885] 3050177=test_rdoc_parser_markdown I, [2024-05-07T10:24:17.392734 #3008779] INFO -- : [744/885] 3050177=test_not I, [2024-05-07T10:24:17.397319 #3008779] INFO -- : [745/885] 3050177=test_gem_resolver_lock_set I, [2024-05-07T10:24:17.407261 #3008779] INFO -- : [746/885] 3050166=test_import I, [2024-05-07T10:24:17.431994 #3008779] INFO -- : [747/885] 3050177=version_test I, [2024-05-07T10:24:17.436010 #3008779] INFO -- : [748/885] 3050177=test_object I, [2024-05-07T10:24:17.439498 #3008779] INFO -- : [749/885] 3050177=heredoc_dedent_test I, [2024-05-07T10:24:17.443111 #3008779] INFO -- : [750/885] 3050177=test_cgi_header I, [2024-05-07T10:24:17.443539 #3008779] INFO -- : [751/885] 3050168=test_arithmetic_sequence I, [2024-05-07T10:24:17.449551 #3008779] INFO -- : [752/885] 3050177=test_gem_gemcutter_utilities I, [2024-05-07T10:24:17.457360 #3008779] INFO -- : [753/885] 3050174=test_basicinstructions I, [2024-05-07T10:24:17.461669 #3008779] INFO -- : [754/885] 3050168=test_gem_command_manager I, [2024-05-07T10:24:17.516715 #3008779] INFO -- : [755/885] 3050174=test_key_actor_emacs I, [2024-05-07T10:24:17.581389 #3008779] INFO -- : [756/885] 3050168=test_sleep I, [2024-05-07T10:24:17.587520 #3008779] INFO -- : [757/885] 3050174=test_object I, [2024-05-07T10:24:17.626559 #3008779] INFO -- : [758/885] 3050167=test_ruby_lex I, [2024-05-07T10:24:17.627160 #3008779] INFO -- : [759/885] 3050165=test_date_arith I, [2024-05-07T10:24:17.633061 #3008779] INFO -- : [760/885] 3050165=test_gem_local_remote_options I, [2024-05-07T10:24:17.659948 #3008779] INFO -- : [761/885] 3050165=test_timeout I, [2024-05-07T10:24:17.665411 #3008779] INFO -- : [762/885] 3050165=test_normalize I, [2024-05-07T10:24:17.668697 #3008779] INFO -- : [763/885] 3050165=test_ossl I, [2024-05-07T10:24:17.695099 #3008779] INFO -- : [764/885] 3050180=test_change_word I, [2024-05-07T10:24:17.696584 #3008779] INFO -- : [765/885] 3050180=compiler_test I, [2024-05-07T10:24:17.743776 #3008779] INFO -- : [766/885] 3050180=test_flip I, [2024-05-07T10:24:17.752372 #3008779] INFO -- : [767/885] 3050180=test_signedness I, [2024-05-07T10:24:17.776159 #3008779] INFO -- : [768/885] 3050167=test_tsort I, [2024-05-07T10:24:17.780426 #3008779] INFO -- : [769/885] 3050177=test_rdoc_rd_block_parser I, [2024-05-07T10:24:17.783522 #3008779] INFO -- : [770/885] 3050167=test_big5 I, [2024-05-07T10:24:17.784503 #3008779] INFO -- : [771/885] 3050167=test_func I, [2024-05-07T10:24:17.830522 #3008779] INFO -- : [772/885] 3050177=test_pointer I, [2024-05-07T10:24:17.859627 #3008779] INFO -- : [773/885] 3050174=test_ractor I, [2024-05-07T10:24:17.928421 #3008779] INFO -- : [774/885] 3050174=test_type I, [2024-05-07T10:24:17.930259 #3008779] INFO -- : [775/885] 3050174=test_win32ole_variable I, [2024-05-07T10:24:17.934990 #3008779] INFO -- : [776/885] 3050174=test_io_wait_uncommon I, [2024-05-07T10:24:17.947905 #3008779] INFO -- : [777/885] 3050174=test_stringio I, [2024-05-07T10:24:18.025105 #3008779] INFO -- : [778/885] 3050166=test_arity I, [2024-05-07T10:24:18.029569 #3008779] INFO -- : [779/885] 3050166=test_gem_ci_detector I, [2024-05-07T10:24:18.033024 #3008779] INFO -- : [780/885] 3050166=test_rdoc_class_module I, [2024-05-07T10:24:18.043997 #3008779] INFO -- : [781/885] 3050174=test_bignum I, [2024-05-07T10:24:18.101660 #3008779] INFO -- : [782/885] 3050163=test_rdoc_generator_json_index I, [2024-05-07T10:24:18.156961 #3008779] INFO -- : [783/885] 3050163=test_time_tz I, [2024-05-07T10:24:18.162582 #3008779] INFO -- : [784/885] 3050174=test_win32ole_event I, [2024-05-07T10:24:18.167970 #3008779] INFO -- : [785/885] 3050174=test_trace I, [2024-05-07T10:24:18.184946 #3008779] INFO -- : [786/885] 3050174=ractor_test I, [2024-05-07T10:24:18.225595 #3008779] INFO -- : [787/885] 3050163=test_have_macro I, [2024-05-07T10:24:18.250623 #3008779] INFO -- : [788/885] 3050174=test_gem_package I, [2024-05-07T10:24:18.363289 #3008779] INFO -- : [789/885] 3050175=test_complex2 I, [2024-05-07T10:24:18.374587 #3008779] INFO -- : [790/885] 3050175=test_resolve_symbol I, [2024-05-07T10:24:18.456298 #3008779] INFO -- : [791/885] 3050175=test_threadgroup I, [2024-05-07T10:24:18.503524 #3008779] INFO -- : [792/885] 3050166=test_enum I, [2024-05-07T10:24:18.548186 #3008779] INFO -- : [793/885] 3050173=test_gem_specification I, [2024-05-07T10:24:18.600449 #3008779] INFO -- : [794/885] 3050177=test_rdoc_extend I, [2024-05-07T10:24:18.616113 #3008779] INFO -- : [795/885] 3050163=test_merge_keys I, [2024-05-07T10:24:18.623050 #3008779] INFO -- : [796/885] 3050163=test_gem_resolver_api_specification I, [2024-05-07T10:24:18.627887 #3008779] INFO -- : [797/885] 3050177=test_ipaddr I, [2024-05-07T10:24:18.645933 #3008779] INFO -- : [798/885] 3050163=test_rdoc_markup_to_ansi I, [2024-05-07T10:24:18.650132 #3008779] INFO -- : [799/885] 3050177=test_mixed_unicode_escapes I, [2024-05-07T10:24:18.651197 #3008779] INFO -- : [800/885] 3050177=test_history I, [2024-05-07T10:24:18.667611 #3008779] INFO -- : [801/885] 3050177=test_win32ole_variant I, [2024-05-07T10:24:18.673776 #3008779] INFO -- : [802/885] 3050177=test_ractor_compatibility I, [2024-05-07T10:24:18.684730 #3008779] INFO -- : [803/885] 3050163=test_autoconf I, [2024-05-07T10:24:18.689730 #3008779] INFO -- : [804/885] 3050163=test_eval I, [2024-05-07T10:24:18.698693 #3008779] INFO -- : [805/885] 3050163=test_date_ractor I, [2024-05-07T10:24:18.703624 #3008779] INFO -- : [806/885] 3050174=test_gem_console_ui I, [2024-05-07T10:24:18.709328 #3008779] INFO -- : [807/885] 3050174=test_dir I, [2024-05-07T10:24:18.919667 #3008779] INFO -- : [808/885] 3050174=format_errors_test I, [2024-05-07T10:24:18.941552 #3008779] INFO -- : [809/885] 3050163=test_gem_commands_cleanup_command I, [2024-05-07T10:24:18.996881 #3008779] INFO -- : [810/885] 3050177=test_word I, [2024-05-07T10:24:18.998203 #3008779] INFO -- : [811/885] 3050177=test_cgi_multipart I, [2024-05-07T10:24:19.019947 #3008779] INFO -- : [812/885] 3050174=test_numeric I, [2024-05-07T10:24:19.029400 #3008779] INFO -- : [813/885] 3050174=test_member I, [2024-05-07T10:24:19.036566 #3008779] INFO -- : [814/885] 3050174=test_gem_source_fetch_problem I, [2024-05-07T10:24:19.051534 #3008779] INFO -- : [815/885] 3050174=json_generic_object_test I, [2024-05-07T10:24:19.055577 #3008779] INFO -- : [816/885] 3050174=test_http_request I, [2024-05-07T10:24:19.107189 #3008779] INFO -- : [817/885] 3050174=test_rdoc_generator_darkfish I, [2024-05-07T10:24:19.131901 #3008779] INFO -- : [818/885] 3050177=test_error_highlight I, [2024-05-07T10:24:19.207453 #3008779] INFO -- : [819/885] 3050176=test_resize I, [2024-05-07T10:24:19.213746 #3008779] INFO -- : [820/885] 3050176=test_rdoc_comment I, [2024-05-07T10:24:19.267778 #3008779] INFO -- : [821/885] 3050163=test_mailto I, [2024-05-07T10:24:19.272125 #3008779] INFO -- : [822/885] 3050176=test_coderange I, [2024-05-07T10:24:19.274046 #3008779] INFO -- : [823/885] 3050163=test_symbol I, [2024-05-07T10:24:19.279679 #3008779] INFO -- : [824/885] 3050163=location_test I, [2024-05-07T10:24:19.280298 #3008779] INFO -- : [825/885] 3050176=test_gem_resolver_requirement_list I, [2024-05-07T10:24:19.286127 #3008779] INFO -- : [826/885] 3050176=test_arith_seq_beg_len_step I, [2024-05-07T10:24:19.303787 #3008779] INFO -- : [827/885] 3050163=test_pkcs7 I, [2024-05-07T10:24:19.357570 #3008779] INFO -- : [828/885] 3050176=test_function_entry I, [2024-05-07T10:24:19.363201 #3008779] INFO -- : [829/885] 3050176=test_symbol I, [2024-05-07T10:24:19.426646 #3008779] INFO -- : [830/885] 3050163=test_coder I, [2024-05-07T10:24:19.435183 #3008779] INFO -- : [831/885] 3050163=test_nofree I, [2024-05-07T10:24:19.436052 #3008779] INFO -- : [832/885] 3050163=test_gem_commands_pristine_command I, [2024-05-07T10:24:19.441384 #3008779] INFO -- : [833/885] 3050177=test_context I, [2024-05-07T10:24:19.442238 #3008779] INFO -- : [834/885] 3050167=ruby_api_test I, [2024-05-07T10:24:19.444875 #3008779] INFO -- : [835/885] 3050166=test_find_executable I, [2024-05-07T10:24:19.454147 #3008779] INFO -- : [836/885] 3050175=test_enc_associate I, [2024-05-07T10:24:19.478807 #3008779] INFO -- : [837/885] 3050166=test_lazy_enumerator I, [2024-05-07T10:24:19.498732 #3008779] INFO -- : [838/885] 3050180=test_unix I, [2024-05-07T10:24:19.506791 #3008779] INFO -- : [839/885] 3050177=test_cgi_modruby I, [2024-05-07T10:24:19.508656 #3008779] INFO -- : [840/885] 3050177=test_integer I, [2024-05-07T10:24:19.519452 #3008779] INFO -- : [841/885] 3050174=test_super I, [2024-05-07T10:24:19.528908 #3008779] INFO -- : [842/885] 3050180=test_rubyoptions I, [2024-05-07T10:24:19.551811 #3008779] INFO -- : [843/885] 3050167=test_https_proxy I, [2024-05-07T10:24:19.578575 #3008779] INFO -- : [844/885] 3050167=test_call I, [2024-05-07T10:24:19.734748 #3008779] INFO -- : [845/885] 3050167=test_rubygems I, [2024-05-07T10:24:19.772543 #3008779] INFO -- : [846/885] 3050166=test_nextafter I, [2024-05-07T10:24:19.832100 #3008779] INFO -- : [847/885] 3050166=test_capacity I, [2024-05-07T10:24:19.834273 #3008779] INFO -- : [848/885] 3050166=test_gem_request_set_lockfile_tokenizer I, [2024-05-07T10:24:19.882626 #3008779] INFO -- : [849/885] 3050166=test_stat I, [2024-05-07T10:24:19.889900 #3008779] INFO -- : [850/885] 3050166=test_have_func I, [2024-05-07T10:24:19.898036 #3008779] INFO -- : [851/885] 3050167=test_gem_resolver_git_specification I, [2024-05-07T10:24:19.904700 #3008779] INFO -- : [852/885] 3050175=test_object_references I, [2024-05-07T10:24:19.955616 #3008779] INFO -- : [853/885] 3050175=test_usrmarshal I, [2024-05-07T10:24:20.103796 #3008779] INFO -- : [854/885] 3050167=test_rdoc_attr I, [2024-05-07T10:24:20.110100 #3008779] INFO -- : [855/885] 3050167=test_env I, [2024-05-07T10:24:20.163959 #3008779] INFO -- : [856/885] 3050179=desugar_compiler_test I, [2024-05-07T10:24:20.175159 #3008779] INFO -- : [857/885] 3050179=test_integer I, [2024-05-07T10:24:20.182371 #3008779] INFO -- : [858/885] 3050175=test_dryrun I, [2024-05-07T10:24:20.194778 #3008779] INFO -- : [859/885] 3050175=test_gem_commands_setup_command I, [2024-05-07T10:24:20.265419 #3008779] INFO -- : [860/885] 3050179=test_cgi_core I, [2024-05-07T10:24:20.278472 #3008779] INFO -- : [861/885] 3050179=test_parser I, [2024-05-07T10:24:20.286717 #3008779] INFO -- : [862/885] 3050179=parse_stream_test I, [2024-05-07T10:24:20.293238 #3008779] INFO -- : [863/885] 3050179=test_registry I, [2024-05-07T10:24:20.298168 #3008779] INFO -- : [864/885] 3050179=test_dns I, [2024-05-07T10:24:20.438608 #3008779] INFO -- : [865/885] 3050163=test_gem_commands_open_command I, [2024-05-07T10:24:20.500086 #3008779] INFO -- : [866/885] 3050163=test_ractor I, [2024-05-07T10:24:20.517640 #3008779] INFO -- : [867/885] 3050163=test_gem_source_lock I, [2024-05-07T10:24:20.520691 #3008779] INFO -- : [868/885] 3050174=test_gem I, [2024-05-07T10:24:20.544994 #3008779] INFO -- : [869/885] 3050163=test_ssl I, [2024-05-07T10:24:20.682194 #3008779] INFO -- : [870/885] 3050175=test_ractor I, [2024-05-07T10:24:20.687009 #3008779] INFO -- : [871/885] 3050173=test_thread I, [2024-05-07T10:24:20.745505 #3008779] INFO -- : [872/885] 3050179=json_ext_parser_test I, [2024-05-07T10:24:20.754669 #3008779] INFO -- : [873/885] 3050179=test_my_integer I, [2024-05-07T10:24:20.759532 #3008779] INFO -- : [874/885] 3050179=test_rendering I, [2024-05-07T10:24:20.778140 #3008779] INFO -- : [875/885] 3050179=test_debugger_integration I, [2024-05-07T10:24:20.814866 #3008779] INFO -- : [876/885] 3050179=test_unicode_normalize I, [2024-05-07T10:24:20.858599 #3008779] INFO -- : [877/885] 3050176=test_marshal I, [2024-05-07T10:24:20.873618 #3008779] INFO -- : [878/885] 3050181=test_weakref I, [2024-05-07T10:24:20.945727 #3008779] INFO -- : [879/885] 3050163=test_nonblock I, [2024-05-07T10:24:20.960940 #3008779] INFO -- : [880/885] 3050163=test_alias I, [2024-05-07T10:24:21.011602 #3008779] INFO -- : [881/885] 3050181=test_timeout I, [2024-05-07T10:24:21.012140 #3008779] INFO -- : [882/885] 3050175=test_singleton_function I, [2024-05-07T10:24:21.018341 #3008779] INFO -- : [883/885] 3050175=test_ancdata I, [2024-05-07T10:24:21.020620 #3008779] INFO -- : [884/885] 3050175=test_rb_str_dup I, [2024-05-07T10:24:21.027071 #3008779] INFO -- : [885/885] 3050175=test_reline_key I, [2024-05-07T10:24:41.605064 #3008779] INFO -- : Finished tests in 39.750707s, 663.5102 tests/s, 235267.9905 assertions/s. E, [2024-05-07T10:24:41.605202 #3008779] ERROR -- : Children under /tmp/rubytest.8088rv: E, [2024-05-07T10:24:41.605239 #3008779] ERROR -- : * drwx------ 4 80 2024-05-07 10:24:13 +0000 gem_rebuild20240507-3050167-73qcs8/ E, [2024-05-07T10:24:41.605261 #3008779] ERROR -- : * drwxrwxr-x 2 60 2024-05-07 10:24:13 +0000 new/ E, [2024-05-07T10:24:41.605275 #3008779] ERROR -- : * -rw-rw-r-- 1 4096 2024-05-07 10:24:13 +0000 rebuild_test_gem-1.0.0.gem E, [2024-05-07T10:24:41.605288 #3008779] ERROR -- : * drwxrwxr-x 2 60 2024-05-07 10:24:13 +0000 old/ E, [2024-05-07T10:24:41.605299 #3008779] ERROR -- : * -rw-rw-r-- 1 4096 2024-05-07 10:24:13 +0000 rebuild_test_gem-1.0.0.gem I, [2024-05-07T10:24:41.606348 #3008779] INFO -- : 26375 tests, 9352069 assertions, 0 failures, 0 errors, 304 skips I, [2024-05-07T10:24:41.606380 #3008779] INFO -- : I, [2024-05-07T10:24:41.606387 #3008779] INFO -- : ruby -v: ruby 3.4.0dev (2024-05-07T06:59:36Z master e1e6b4972f) [x86_64-linux] I, [2024-05-07T10:24:41.608489 #3008779] INFO -- : $$$[end] "make yes-test-all TESTOPTS='--stderr-on-failure' TESTS='-j20'" exit with 0. I, [2024-05-07T10:24:41.608640 #3008779] INFO -- : $$$[beg] make yes-test-rubyspec MSPECOPT='--error-output stderr --debug -j' TESTS='-j20' I, [2024-05-07T10:24:41.696981 #3008779] INFO -- : BASERUBY = /usr/bin/ruby --disable=gems I, [2024-05-07T10:24:41.697021 #3008779] INFO -- : CC = gcc I, [2024-05-07T10:24:41.697029 #3008779] INFO -- : LD = ld I, [2024-05-07T10:24:41.697035 #3008779] INFO -- : LDSHARED = gcc -shared I, [2024-05-07T10:24:41.697042 #3008779] INFO -- : CFLAGS = -O3 -fno-fast-math -ggdb3 -Wall -Wextra -Wdeprecated-declarations -Wdiv-by-zero -Wduplicated-cond -Wimplicit-function-declaration -Wimplicit-int -Wpointer-arith -Wwrite-strings -Wold-style-definition -Wimplicit-fallthrough=0 -Wmissing-noreturn -Wno-cast-function-type -Wno-constant-logical-operand -Wno-long-long -Wno-missing-field-initializers -Wno-overlength-strings -Wno-packed-bitfield-compat -Wno-parentheses-equality -Wno-self-assign -Wno-tautological-compare -Wno-unused-parameter -Wno-unused-value -Wsuggest-attribute=format -Wsuggest-attribute=noreturn -Wunused-variable -Wmisleading-indentation -Wundef -fPIC I, [2024-05-07T10:24:41.697058 #3008779] INFO -- : XCFLAGS = -U_FORTIFY_SOURCE -D_FORTIFY_SOURCE=2 -fstack-protector-strong -fno-strict-overflow -fvisibility=hidden -fexcess-precision=standard -DRUBY_EXPORT -I. -I.ext/include/x86_64-linux -I/tmp/ruby/src/trunk/include -I/tmp/ruby/src/trunk -I/tmp/ruby/src/trunk/prism -I/tmp/ruby/src/trunk/enc/unicode/15.0.0 I, [2024-05-07T10:24:41.697064 #3008779] INFO -- : CPPFLAGS = I, [2024-05-07T10:24:41.697071 #3008779] INFO -- : DLDFLAGS = -Wl,--compress-debug-sections=zlib -Wl,-soname,libruby.so.3.4 -fstack-protector-strong I, [2024-05-07T10:24:41.697077 #3008779] INFO -- : SOLIBS = -lz -lrt -lrt -lgmp -ldl -lcrypt -lm -lpthread I, [2024-05-07T10:24:41.697082 #3008779] INFO -- : LANG = en_US.UTF-8 I, [2024-05-07T10:24:41.697088 #3008779] INFO -- : LC_ALL = I, [2024-05-07T10:24:41.697094 #3008779] INFO -- : LC_CTYPE = I, [2024-05-07T10:24:41.697099 #3008779] INFO -- : MFLAGS = I, [2024-05-07T10:24:41.697105 #3008779] INFO -- : RUSTC = no I, [2024-05-07T10:24:41.697111 #3008779] INFO -- : YJIT_RUSTC_ARGS = --crate-name=yjit --crate-type=staticlib --edition=2021 -g -C lto=thin -C opt-level=3 -C overflow-checks=on '--out-dir=/tmp/ruby/build/trunk/yjit/target/release/' /tmp/ruby/src/trunk/yjit/src/lib.rs I, [2024-05-07T10:24:41.697641 #3008779] INFO -- : gcc (Ubuntu 11.4.0-1ubuntu1~22.04) 11.4.0 I, [2024-05-07T10:24:41.697647 #3008779] INFO -- : Copyright (C) 2021 Free Software Foundation, Inc. I, [2024-05-07T10:24:41.697653 #3008779] INFO -- : This is free software; see the source for copying conditions. There is NO I, [2024-05-07T10:24:41.697659 #3008779] INFO -- : warranty; not even for MERCHANTABILITY or FITNESS FOR A PARTICULAR PURPOSE. I, [2024-05-07T10:24:41.697665 #3008779] INFO -- : I, [2024-05-07T10:24:41.699265 #3008779] INFO -- : generating enc.mk I, [2024-05-07T10:24:41.817058 #3008779] INFO -- : making enc I, [2024-05-07T10:24:41.834178 #3008779] INFO -- : make[1]: Entering directory '/tmp/ruby/build/trunk' I, [2024-05-07T10:24:41.834190 #3008779] INFO -- : make[1]: Nothing to be done for 'enc'. I, [2024-05-07T10:24:41.834197 #3008779] INFO -- : make[1]: Leaving directory '/tmp/ruby/build/trunk' I, [2024-05-07T10:24:41.834898 #3008779] INFO -- : making srcs under enc I, [2024-05-07T10:24:41.864682 #3008779] INFO -- : make[1]: Entering directory '/tmp/ruby/build/trunk' I, [2024-05-07T10:24:41.864697 #3008779] INFO -- : make[1]: Nothing to be done for 'srcs'. I, [2024-05-07T10:24:41.864703 #3008779] INFO -- : make[1]: Leaving directory '/tmp/ruby/build/trunk' I, [2024-05-07T10:24:41.865556 #3008779] INFO -- : generating transdb.h I, [2024-05-07T10:24:41.960635 #3008779] INFO -- : transdb.h unchanged I, [2024-05-07T10:24:41.961898 #3008779] INFO -- : making trans I, [2024-05-07T10:24:41.995866 #3008779] INFO -- : make[1]: Entering directory '/tmp/ruby/build/trunk' I, [2024-05-07T10:24:41.995876 #3008779] INFO -- : make[1]: Nothing to be done for 'trans'. I, [2024-05-07T10:24:41.995882 #3008779] INFO -- : make[1]: Leaving directory '/tmp/ruby/build/trunk' I, [2024-05-07T10:24:41.996563 #3008779] INFO -- : making encs I, [2024-05-07T10:24:42.033690 #3008779] INFO -- : make[1]: Entering directory '/tmp/ruby/build/trunk' I, [2024-05-07T10:24:42.033704 #3008779] INFO -- : make[1]: Nothing to be done for 'encs'. I, [2024-05-07T10:24:42.033710 #3008779] INFO -- : make[1]: Leaving directory '/tmp/ruby/build/trunk' I, [2024-05-07T10:24:42.035488 #3008779] INFO -- : generating makefiles ext/configure-ext.mk I, [2024-05-07T10:24:42.062908 #3008779] INFO -- : ext/configure-ext.mk updated I, [2024-05-07T10:24:42.065252 #3008779] INFO -- : make[1]: Entering directory '/tmp/ruby/build/trunk' I, [2024-05-07T10:24:43.468400 #3008779] INFO -- : make[1]: Leaving directory '/tmp/ruby/build/trunk' I, [2024-05-07T10:24:43.469167 #3008779] INFO -- : generating makefile exts.mk I, [2024-05-07T10:24:43.506167 #3008779] INFO -- : exts.mk unchanged I, [2024-05-07T10:24:43.510692 #3008779] INFO -- : make[1]: Entering directory '/tmp/ruby/build/trunk' I, [2024-05-07T10:24:43.722439 #3008779] INFO -- : make[2]: Entering directory '/tmp/ruby/build/trunk/ext/coverage' I, [2024-05-07T10:24:43.725319 #3008779] INFO -- : make[2]: Leaving directory '/tmp/ruby/build/trunk/ext/coverage' I, [2024-05-07T10:24:43.729219 #3008779] INFO -- : make[2]: Entering directory '/tmp/ruby/build/trunk/ext/date' I, [2024-05-07T10:24:43.732332 #3008779] INFO -- : make[2]: Leaving directory '/tmp/ruby/build/trunk/ext/date' I, [2024-05-07T10:24:43.734526 #3008779] INFO -- : make[2]: Entering directory '/tmp/ruby/build/trunk/ext/digest' I, [2024-05-07T10:24:43.739892 #3008779] INFO -- : make[2]: Leaving directory '/tmp/ruby/build/trunk/ext/digest' I, [2024-05-07T10:24:43.755551 #3008779] INFO -- : make[2]: Entering directory '/tmp/ruby/build/trunk/ext/digest/sha2' I, [2024-05-07T10:24:43.758563 #3008779] INFO -- : make[2]: Leaving directory '/tmp/ruby/build/trunk/ext/digest/sha2' I, [2024-05-07T10:24:43.771346 #3008779] INFO -- : make[2]: Entering directory '/tmp/ruby/build/trunk/ext/fiddle' I, [2024-05-07T10:24:43.777630 #3008779] INFO -- : make[2]: Leaving directory '/tmp/ruby/build/trunk/ext/fiddle' I, [2024-05-07T10:24:43.780602 #3008779] INFO -- : make[2]: Entering directory '/tmp/ruby/build/trunk/ext/io/console' I, [2024-05-07T10:24:43.783189 #3008779] INFO -- : make[2]: Leaving directory '/tmp/ruby/build/trunk/ext/io/console' I, [2024-05-07T10:24:43.791082 #3008779] INFO -- : make[2]: Entering directory '/tmp/ruby/build/trunk/ext/json' I, [2024-05-07T10:24:43.797435 #3008779] INFO -- : make[2]: Leaving directory '/tmp/ruby/build/trunk/ext/json' I, [2024-05-07T10:24:43.806555 #3008779] INFO -- : make[2]: Entering directory '/tmp/ruby/build/trunk/ext/monitor' I, [2024-05-07T10:24:43.808994 #3008779] INFO -- : make[2]: Leaving directory '/tmp/ruby/build/trunk/ext/monitor' I, [2024-05-07T10:24:43.813286 #3008779] INFO -- : make[2]: Entering directory '/tmp/ruby/build/trunk/ext/objspace' I, [2024-05-07T10:24:43.816923 #3008779] INFO -- : make[2]: Leaving directory '/tmp/ruby/build/trunk/ext/objspace' I, [2024-05-07T10:24:43.828995 #3008779] INFO -- : make[2]: Entering directory '/tmp/ruby/build/trunk/ext/openssl' I, [2024-05-07T10:24:43.842215 #3008779] INFO -- : make[2]: Leaving directory '/tmp/ruby/build/trunk/ext/openssl' I, [2024-05-07T10:24:43.845113 #3008779] INFO -- : make[2]: Entering directory '/tmp/ruby/build/trunk/ext/pathname' I, [2024-05-07T10:24:43.847640 #3008779] INFO -- : make[2]: Leaving directory '/tmp/ruby/build/trunk/ext/pathname' I, [2024-05-07T10:24:43.851911 #3008779] INFO -- : make[2]: Entering directory '/tmp/ruby/build/trunk/ext/psych' I, [2024-05-07T10:24:43.866839 #3008779] INFO -- : make[2]: Leaving directory '/tmp/ruby/build/trunk/ext/psych' I, [2024-05-07T10:24:43.869888 #3008779] INFO -- : make[2]: Entering directory '/tmp/ruby/build/trunk/ext/pty' I, [2024-05-07T10:24:43.872447 #3008779] INFO -- : make[2]: Leaving directory '/tmp/ruby/build/trunk/ext/pty' I, [2024-05-07T10:24:43.881863 #3008779] INFO -- : make[2]: Entering directory '/tmp/ruby/build/trunk/ext/ripper' I, [2024-05-07T10:24:43.886822 #3008779] INFO -- : make[2]: Leaving directory '/tmp/ruby/build/trunk/ext/ripper' I, [2024-05-07T10:24:43.888334 #3008779] INFO -- : make[2]: Entering directory '/tmp/ruby/build/trunk/ext/rubyvm' I, [2024-05-07T10:24:43.890325 #3008779] INFO -- : make[2]: Leaving directory '/tmp/ruby/build/trunk/ext/rubyvm' I, [2024-05-07T10:24:43.898199 #3008779] INFO -- : make[2]: Entering directory '/tmp/ruby/build/trunk/ext/socket' I, [2024-05-07T10:24:43.904678 #3008779] INFO -- : make[2]: Leaving directory '/tmp/ruby/build/trunk/ext/socket' I, [2024-05-07T10:24:43.915812 #3008779] INFO -- : make[2]: Entering directory '/tmp/ruby/build/trunk/.bundle/gems/bigdecimal-3.1.7/ext/bigdecimal' I, [2024-05-07T10:24:43.938413 #3008779] INFO -- : make[2]: Leaving directory '/tmp/ruby/build/trunk/.bundle/gems/bigdecimal-3.1.7/ext/bigdecimal' I, [2024-05-07T10:24:43.940443 #3008779] INFO -- : make[2]: Entering directory '/tmp/ruby/build/trunk/.bundle/gems/bigdecimal-3.1.8/ext/bigdecimal' I, [2024-05-07T10:24:43.962875 #3008779] INFO -- : make[2]: Leaving directory '/tmp/ruby/build/trunk/.bundle/gems/bigdecimal-3.1.8/ext/bigdecimal' I, [2024-05-07T10:24:43.965000 #3008779] INFO -- : make[2]: Entering directory '/tmp/ruby/build/trunk/.bundle/gems/debug-1.9.2/ext/debug' I, [2024-05-07T10:24:43.986959 #3008779] INFO -- : make[2]: Leaving directory '/tmp/ruby/build/trunk/.bundle/gems/debug-1.9.2/ext/debug' I, [2024-05-07T10:24:43.988846 #3008779] INFO -- : make[2]: Entering directory '/tmp/ruby/build/trunk/.bundle/gems/nkf-0.2.0/ext/nkf' I, [2024-05-07T10:24:44.011087 #3008779] INFO -- : make[2]: Leaving directory '/tmp/ruby/build/trunk/.bundle/gems/nkf-0.2.0/ext/nkf' I, [2024-05-07T10:24:44.013017 #3008779] INFO -- : make[2]: Entering directory '/tmp/ruby/build/trunk/.bundle/gems/racc-1.7.3/ext/racc/cparse' I, [2024-05-07T10:24:44.035653 #3008779] INFO -- : make[2]: Leaving directory '/tmp/ruby/build/trunk/.bundle/gems/racc-1.7.3/ext/racc/cparse' I, [2024-05-07T10:24:44.037952 #3008779] INFO -- : make[2]: Entering directory '/tmp/ruby/build/trunk/.bundle/gems/rbs-3.4.4/ext/rbs_extension' I, [2024-05-07T10:24:44.060299 #3008779] INFO -- : make[2]: Leaving directory '/tmp/ruby/build/trunk/.bundle/gems/rbs-3.4.4/ext/rbs_extension' I, [2024-05-07T10:24:44.062094 #3008779] INFO -- : make[2]: Entering directory '/tmp/ruby/build/trunk/.bundle/gems/syslog-0.1.2/ext/syslog' I, [2024-05-07T10:24:44.083935 #3008779] INFO -- : make[2]: Leaving directory '/tmp/ruby/build/trunk/.bundle/gems/syslog-0.1.2/ext/syslog' I, [2024-05-07T10:24:44.107185 #3008779] INFO -- : make[2]: Entering directory '/tmp/ruby/build/trunk' I, [2024-05-07T10:24:44.169694 #3008779] INFO -- : make[2]: 'ruby' is up to date. I, [2024-05-07T10:24:44.169706 #3008779] INFO -- : make[2]: Leaving directory '/tmp/ruby/build/trunk' I, [2024-05-07T10:24:44.170051 #3008779] INFO -- : make[1]: Leaving directory '/tmp/ruby/build/trunk' I, [2024-05-07T10:24:44.173690 #3008779] INFO -- : make[1]: Entering directory '/tmp/ruby/build/trunk' I, [2024-05-07T10:24:44.173699 #3008779] INFO -- : make[1]: Nothing to be done for 'note'. I, [2024-05-07T10:24:44.173705 #3008779] INFO -- : make[1]: Leaving directory '/tmp/ruby/build/trunk' E, [2024-05-07T10:24:44.231160 #3008779] ERROR -- : $ /tmp/ruby/build/trunk/miniruby -I/tmp/ruby/src/trunk/lib /tmp/ruby/src/trunk/tool/runruby.rb --archdir=/tmp/ruby/build/trunk --extout=.ext -- /tmp/ruby/src/trunk/spec/mspec/bin/mspec-run -B /tmp/ruby/src/trunk/spec/default.mspec --error-output stderr --debug -fy -o /tmp/rubytest.2sjvwf/1-mspec-multi-0 E, [2024-05-07T10:24:44.231334 #3008779] ERROR -- : $ /tmp/ruby/build/trunk/miniruby -I/tmp/ruby/src/trunk/lib /tmp/ruby/src/trunk/tool/runruby.rb --archdir=/tmp/ruby/build/trunk --extout=.ext -- /tmp/ruby/src/trunk/spec/mspec/bin/mspec-run -B /tmp/ruby/src/trunk/spec/default.mspec --error-output stderr --debug -fy -o /tmp/rubytest.2sjvwf/2-mspec-multi-1 E, [2024-05-07T10:24:44.231639 #3008779] ERROR -- : $ /tmp/ruby/build/trunk/miniruby -I/tmp/ruby/src/trunk/lib /tmp/ruby/src/trunk/tool/runruby.rb --archdir=/tmp/ruby/build/trunk --extout=.ext -- /tmp/ruby/src/trunk/spec/mspec/bin/mspec-run -B /tmp/ruby/src/trunk/spec/default.mspec --error-output stderr --debug -fy -o /tmp/rubytest.2sjvwf/3-mspec-multi-2 E, [2024-05-07T10:24:44.231859 #3008779] ERROR -- : $ /tmp/ruby/build/trunk/miniruby -I/tmp/ruby/src/trunk/lib /tmp/ruby/src/trunk/tool/runruby.rb --archdir=/tmp/ruby/build/trunk --extout=.ext -- /tmp/ruby/src/trunk/spec/mspec/bin/mspec-run -B /tmp/ruby/src/trunk/spec/default.mspec --error-output stderr --debug -fy -o /tmp/rubytest.2sjvwf/4-mspec-multi-3 E, [2024-05-07T10:24:44.232010 #3008779] ERROR -- : $ /tmp/ruby/build/trunk/miniruby -I/tmp/ruby/src/trunk/lib /tmp/ruby/src/trunk/tool/runruby.rb --archdir=/tmp/ruby/build/trunk --extout=.ext -- /tmp/ruby/src/trunk/spec/mspec/bin/mspec-run -B /tmp/ruby/src/trunk/spec/default.mspec --error-output stderr --debug -fy -o /tmp/rubytest.2sjvwf/5-mspec-multi-4 E, [2024-05-07T10:24:44.232057 #3008779] ERROR -- : $ /tmp/ruby/build/trunk/miniruby -I/tmp/ruby/src/trunk/lib /tmp/ruby/src/trunk/tool/runruby.rb --archdir=/tmp/ruby/build/trunk --extout=.ext -- /tmp/ruby/src/trunk/spec/mspec/bin/mspec-run -B /tmp/ruby/src/trunk/spec/default.mspec --error-output stderr --debug -fy -o /tmp/rubytest.2sjvwf/6-mspec-multi-5 E, [2024-05-07T10:24:44.232447 #3008779] ERROR -- : $ /tmp/ruby/build/trunk/miniruby -I/tmp/ruby/src/trunk/lib /tmp/ruby/src/trunk/tool/runruby.rb --archdir=/tmp/ruby/build/trunk --extout=.ext -- /tmp/ruby/src/trunk/spec/mspec/bin/mspec-run -B /tmp/ruby/src/trunk/spec/default.mspec --error-output stderr --debug -fy -o /tmp/rubytest.2sjvwf/7-mspec-multi-6 E, [2024-05-07T10:24:44.232637 #3008779] ERROR -- : $ /tmp/ruby/build/trunk/miniruby -I/tmp/ruby/src/trunk/lib /tmp/ruby/src/trunk/tool/runruby.rb --archdir=/tmp/ruby/build/trunk --extout=.ext -- /tmp/ruby/src/trunk/spec/mspec/bin/mspec-run -B /tmp/ruby/src/trunk/spec/default.mspec --error-output stderr --debug -fy -o /tmp/rubytest.2sjvwf/8-mspec-multi-7 E, [2024-05-07T10:24:44.233016 #3008779] ERROR -- : $ /tmp/ruby/build/trunk/miniruby -I/tmp/ruby/src/trunk/lib /tmp/ruby/src/trunk/tool/runruby.rb --archdir=/tmp/ruby/build/trunk --extout=.ext -- /tmp/ruby/src/trunk/spec/mspec/bin/mspec-run -B /tmp/ruby/src/trunk/spec/default.mspec --error-output stderr --debug -fy -o /tmp/rubytest.2sjvwf/9-mspec-multi-8 E, [2024-05-07T10:24:44.233250 #3008779] ERROR -- : $ /tmp/ruby/build/trunk/miniruby -I/tmp/ruby/src/trunk/lib /tmp/ruby/src/trunk/tool/runruby.rb --archdir=/tmp/ruby/build/trunk --extout=.ext -- /tmp/ruby/src/trunk/spec/mspec/bin/mspec-run -B /tmp/ruby/src/trunk/spec/default.mspec --error-output stderr --debug -fy -o /tmp/rubytest.2sjvwf/10-mspec-multi-9 E, [2024-05-07T10:24:44.233609 #3008779] ERROR -- : $ /tmp/ruby/build/trunk/miniruby -I/tmp/ruby/src/trunk/lib /tmp/ruby/src/trunk/tool/runruby.rb --archdir=/tmp/ruby/build/trunk --extout=.ext -- /tmp/ruby/src/trunk/spec/mspec/bin/mspec-run -B /tmp/ruby/src/trunk/spec/default.mspec --error-output stderr --debug -fy -o /tmp/rubytest.2sjvwf/11-mspec-multi-10 E, [2024-05-07T10:24:44.233928 #3008779] ERROR -- : $ /tmp/ruby/build/trunk/miniruby -I/tmp/ruby/src/trunk/lib /tmp/ruby/src/trunk/tool/runruby.rb --archdir=/tmp/ruby/build/trunk --extout=.ext -- /tmp/ruby/src/trunk/spec/mspec/bin/mspec-run -B /tmp/ruby/src/trunk/spec/default.mspec --error-output stderr --debug -fy -o /tmp/rubytest.2sjvwf/12-mspec-multi-11 E, [2024-05-07T10:24:44.234142 #3008779] ERROR -- : $ /tmp/ruby/build/trunk/miniruby -I/tmp/ruby/src/trunk/lib /tmp/ruby/src/trunk/tool/runruby.rb --archdir=/tmp/ruby/build/trunk --extout=.ext -- /tmp/ruby/src/trunk/spec/mspec/bin/mspec-run -B /tmp/ruby/src/trunk/spec/default.mspec --error-output stderr --debug -fy -o /tmp/rubytest.2sjvwf/13-mspec-multi-12 E, [2024-05-07T10:24:44.234425 #3008779] ERROR -- : $ /tmp/ruby/build/trunk/miniruby -I/tmp/ruby/src/trunk/lib /tmp/ruby/src/trunk/tool/runruby.rb --archdir=/tmp/ruby/build/trunk --extout=.ext -- /tmp/ruby/src/trunk/spec/mspec/bin/mspec-run -B /tmp/ruby/src/trunk/spec/default.mspec --error-output stderr --debug -fy -o /tmp/rubytest.2sjvwf/14-mspec-multi-13 E, [2024-05-07T10:24:44.234684 #3008779] ERROR -- : $ /tmp/ruby/build/trunk/miniruby -I/tmp/ruby/src/trunk/lib /tmp/ruby/src/trunk/tool/runruby.rb --archdir=/tmp/ruby/build/trunk --extout=.ext -- /tmp/ruby/src/trunk/spec/mspec/bin/mspec-run -B /tmp/ruby/src/trunk/spec/default.mspec --error-output stderr --debug -fy -o /tmp/rubytest.2sjvwf/15-mspec-multi-14 E, [2024-05-07T10:24:44.234927 #3008779] ERROR -- : $ /tmp/ruby/build/trunk/miniruby -I/tmp/ruby/src/trunk/lib /tmp/ruby/src/trunk/tool/runruby.rb --archdir=/tmp/ruby/build/trunk --extout=.ext -- /tmp/ruby/src/trunk/spec/mspec/bin/mspec-run -B /tmp/ruby/src/trunk/spec/default.mspec --error-output stderr --debug -fy -o /tmp/rubytest.2sjvwf/16-mspec-multi-15 E, [2024-05-07T10:24:44.235123 #3008779] ERROR -- : $ /tmp/ruby/build/trunk/miniruby -I/tmp/ruby/src/trunk/lib /tmp/ruby/src/trunk/tool/runruby.rb --archdir=/tmp/ruby/build/trunk --extout=.ext -- /tmp/ruby/src/trunk/spec/mspec/bin/mspec-run -B /tmp/ruby/src/trunk/spec/default.mspec --error-output stderr --debug -fy -o /tmp/rubytest.2sjvwf/17-mspec-multi-16 E, [2024-05-07T10:24:44.235325 #3008779] ERROR -- : $ /tmp/ruby/build/trunk/miniruby -I/tmp/ruby/src/trunk/lib /tmp/ruby/src/trunk/tool/runruby.rb --archdir=/tmp/ruby/build/trunk --extout=.ext -- /tmp/ruby/src/trunk/spec/mspec/bin/mspec-run -B /tmp/ruby/src/trunk/spec/default.mspec --error-output stderr --debug -fy -o /tmp/rubytest.2sjvwf/18-mspec-multi-17 E, [2024-05-07T10:24:44.238299 #3008779] ERROR -- : $ /tmp/ruby/build/trunk/miniruby -I/tmp/ruby/src/trunk/lib /tmp/ruby/src/trunk/tool/runruby.rb --archdir=/tmp/ruby/build/trunk --extout=.ext -- /tmp/ruby/src/trunk/spec/mspec/bin/mspec-run -B /tmp/ruby/src/trunk/spec/default.mspec --error-output stderr --debug -fy -o /tmp/rubytest.2sjvwf/19-mspec-multi-18 E, [2024-05-07T10:24:44.238764 #3008779] ERROR -- : $ /tmp/ruby/build/trunk/miniruby -I/tmp/ruby/src/trunk/lib /tmp/ruby/src/trunk/tool/runruby.rb --archdir=/tmp/ruby/build/trunk --extout=.ext -- /tmp/ruby/src/trunk/spec/mspec/bin/mspec-run -B /tmp/ruby/src/trunk/spec/default.mspec --error-output stderr --debug -fy -o /tmp/rubytest.2sjvwf/20-mspec-multi-19 I, [2024-05-07T10:24:44.425998 #3008779] INFO -- : ruby 3.4.0dev (2024-05-07T06:59:36Z master e1e6b4972f) [x86_64-linux] I, [2024-05-07T10:24:45.081089 #3008779] INFO -- : 0 ......................................................................... I, [2024-05-07T10:24:45.448873 #3008779] INFO -- : 73 ......................................................................... I, [2024-05-07T10:24:45.622641 #3008779] INFO -- : 146 ......................................................................... I, [2024-05-07T10:24:45.668502 #3008779] INFO -- : 219 ......................................................................... I, [2024-05-07T10:24:45.718942 #3008779] INFO -- : 292 ......................................................................... I, [2024-05-07T10:24:45.764443 #3008779] INFO -- : 365 ......................................................................... I, [2024-05-07T10:24:45.786595 #3008779] INFO -- : 438 ......................................................................... I, [2024-05-07T10:24:45.806064 #3008779] INFO -- : 511 ......................................................................... I, [2024-05-07T10:24:45.825679 #3008779] INFO -- : 584 ......................................................................... I, [2024-05-07T10:24:45.893024 #3008779] INFO -- : 657 ......................................................................... I, [2024-05-07T10:24:45.924372 #3008779] INFO -- : 730 ......................................................................... I, [2024-05-07T10:24:45.954698 #3008779] INFO -- : 803 ......................................................................... I, [2024-05-07T10:24:45.991429 #3008779] INFO -- : 876 ......................................................................... I, [2024-05-07T10:24:46.045752 #3008779] INFO -- : 949 ......................................................................... I, [2024-05-07T10:24:46.126146 #3008779] INFO -- : 1022 ......................................................................... I, [2024-05-07T10:24:46.271467 #3008779] INFO -- : 1095 ......................................................................... I, [2024-05-07T10:24:46.410650 #3008779] INFO -- : 1168 ......................................................................... I, [2024-05-07T10:24:46.472081 #3008779] INFO -- : 1241 ......................................................................... I, [2024-05-07T10:24:46.525503 #3008779] INFO -- : 1314 ......................................................................... I, [2024-05-07T10:24:46.543893 #3008779] INFO -- : 1387 ......................................................................... I, [2024-05-07T10:24:46.635820 #3008779] INFO -- : 1460 ......................................................................... I, [2024-05-07T10:24:47.168818 #3008779] INFO -- : 1533 ......................................................................... I, [2024-05-07T10:24:47.231165 #3008779] INFO -- : 1606 ......................................................................... I, [2024-05-07T10:24:47.347822 #3008779] INFO -- : 1679 ......................................................................... I, [2024-05-07T10:24:47.448980 #3008779] INFO -- : 1752 ......................................................................... I, [2024-05-07T10:24:47.527240 #3008779] INFO -- : 1825 ......................................................................... I, [2024-05-07T10:24:47.622544 #3008779] INFO -- : 1898 ......................................................................... I, [2024-05-07T10:24:47.712455 #3008779] INFO -- : 1971 ......................................................................... I, [2024-05-07T10:24:47.760242 #3008779] INFO -- : 2044 ......................................................................... I, [2024-05-07T10:24:47.795283 #3008779] INFO -- : 2117 ......................................................................... I, [2024-05-07T10:24:47.815862 #3008779] INFO -- : 2190 ......................................................................... I, [2024-05-07T10:24:47.846941 #3008779] INFO -- : 2263 ......................................................................... I, [2024-05-07T10:24:47.862454 #3008779] INFO -- : 2336 ......................................................................... I, [2024-05-07T10:24:47.908580 #3008779] INFO -- : 2409 ......................................................................... I, [2024-05-07T10:24:48.025351 #3008779] INFO -- : 2482 ......................................................................... I, [2024-05-07T10:24:48.050947 #3008779] INFO -- : 2555 ......................................................................... I, [2024-05-07T10:24:48.157171 #3008779] INFO -- : 2628 ......................................................................... I, [2024-05-07T10:24:48.264464 #3008779] INFO -- : 2701 ......................................................................... I, [2024-05-07T10:24:48.291914 #3008779] INFO -- : 2774 ......................................................................... I, [2024-05-07T10:24:48.347782 #3008779] INFO -- : 2847 ......................................................................... I, [2024-05-07T10:24:48.380308 #3008779] INFO -- : 2920 ......................................................................... I, [2024-05-07T10:24:48.413384 #3008779] INFO -- : 2993 ......................................................................... I, [2024-05-07T10:24:48.441214 #3008779] INFO -- : 3066 ......................................................................... I, [2024-05-07T10:24:48.454386 #3008779] INFO -- : 3139 ......................................................................... I, [2024-05-07T10:24:48.464659 #3008779] INFO -- : 3212 ......................................................................... I, [2024-05-07T10:24:48.494601 #3008779] INFO -- : 3285 ......................................................................... I, [2024-05-07T10:24:52.449084 #3008779] INFO -- : 3358 ........................................................................ I, [2024-05-07T10:24:52.449139 #3008779] INFO -- : I, [2024-05-07T10:24:52.449145 #3008779] INFO -- : Finished in 8.217206 seconds I, [2024-05-07T10:24:52.449150 #3008779] INFO -- : I, [2024-05-07T10:24:52.449154 #3008779] INFO -- : 3429 files, 32610 examples, 170772 expectations, 0 failures, 0 errors, 0 tagged I, [2024-05-07T10:24:52.451186 #3008779] INFO -- : $$$[end] "make yes-test-rubyspec MSPECOPT='--error-output stderr --debug -j' TESTS='-j20'" exit with 0.