# Logfile created on 2024-05-07 00:35:20 +0000 by logger.rb/v1.4.3 I, [2024-05-07T00:35:20.877450 #4028984] INFO -- : #, @formatter=nil, @logdev=#, @binmode=false, @mon_data=#, @mon_data_owner_object_id=860>>> I, [2024-05-07T00:35:20.877577 #4028984] INFO -- : $$$[beg] make update-unicode -j20 I, [2024-05-07T00:35:20.936030 #4028984] INFO -- : Downloading Unicode emoji 15.0 files... I, [2024-05-07T00:35:20.936194 #4028984] INFO -- : Downloading Unicode emoji 15.0 files... I, [2024-05-07T00:35:20.936339 #4028984] INFO -- : Downloading Unicode emoji 15.0 files... I, [2024-05-07T00:35:20.977373 #4028984] INFO -- : made symlink emoji/15.0/emoji-sequences.txt to /tmp/ruby/src/trunk/.downloaded-cache/emoji/15.0/emoji-sequences.txt E, [2024-05-07T00:35:22.303433 #4028984] ERROR -- : /tmp/ruby/src/trunk/tool/downloader.rb:302:in `rescue in download': failed to download emoji/15.0/emoji-sequences.txt (RuntimeError) E, [2024-05-07T00:35:22.303475 #4028984] ERROR -- : EOFError: end of file reached: https://www.unicode.org/Public/emoji/15.0/emoji-sequences.txt E, [2024-05-07T00:35:22.303486 #4028984] ERROR -- : from /tmp/ruby/src/trunk/tool/downloader.rb:201:in `download' E, [2024-05-07T00:35:22.303490 #4028984] ERROR -- : from /tmp/ruby/src/trunk/tool/downloader.rb:136:in `download' E, [2024-05-07T00:35:22.303495 #4028984] ERROR -- : from /tmp/ruby/src/trunk/tool/downloader.rb:482:in `block in
' E, [2024-05-07T00:35:22.303499 #4028984] ERROR -- : from /tmp/ruby/src/trunk/tool/downloader.rb:465:in `each' E, [2024-05-07T00:35:22.303503 #4028984] ERROR -- : from /tmp/ruby/src/trunk/tool/downloader.rb:465:in `
' E, [2024-05-07T00:35:22.303507 #4028984] ERROR -- : /usr/lib/ruby/3.0.0/net/protocol.rb:227:in `rbuf_fill': end of file reached (EOFError) E, [2024-05-07T00:35:22.303511 #4028984] ERROR -- : from /usr/lib/ruby/3.0.0/net/protocol.rb:193:in `readuntil' E, [2024-05-07T00:35:22.303516 #4028984] ERROR -- : from /usr/lib/ruby/3.0.0/net/protocol.rb:203:in `readline' E, [2024-05-07T00:35:22.303520 #4028984] ERROR -- : from /usr/lib/ruby/3.0.0/net/http/response.rb:42:in `read_status_line' E, [2024-05-07T00:35:22.303523 #4028984] ERROR -- : from /usr/lib/ruby/3.0.0/net/http/response.rb:31:in `read_new' E, [2024-05-07T00:35:22.303527 #4028984] ERROR -- : from /usr/lib/ruby/3.0.0/net/http.rb:1557:in `block in transport_request' E, [2024-05-07T00:35:22.303531 #4028984] ERROR -- : from /usr/lib/ruby/3.0.0/net/http.rb:1548:in `catch' E, [2024-05-07T00:35:22.303534 #4028984] ERROR -- : from /usr/lib/ruby/3.0.0/net/http.rb:1548:in `transport_request' E, [2024-05-07T00:35:22.303538 #4028984] ERROR -- : from /usr/lib/ruby/3.0.0/net/http.rb:1521:in `request' E, [2024-05-07T00:35:22.303541 #4028984] ERROR -- : from /usr/lib/ruby/3.0.0/open-uri.rb:329:in `block in open_http' E, [2024-05-07T00:35:22.303546 #4028984] ERROR -- : from /usr/lib/ruby/3.0.0/net/http.rb:960:in `start' E, [2024-05-07T00:35:22.303557 #4028984] ERROR -- : from /usr/lib/ruby/3.0.0/open-uri.rb:323:in `open_http' E, [2024-05-07T00:35:22.303561 #4028984] ERROR -- : from /usr/lib/ruby/3.0.0/open-uri.rb:741:in `buffer_open' E, [2024-05-07T00:35:22.303564 #4028984] ERROR -- : from /usr/lib/ruby/3.0.0/open-uri.rb:212:in `block in open_loop' E, [2024-05-07T00:35:22.303568 #4028984] ERROR -- : from /usr/lib/ruby/3.0.0/open-uri.rb:210:in `catch' E, [2024-05-07T00:35:22.303571 #4028984] ERROR -- : from /usr/lib/ruby/3.0.0/open-uri.rb:210:in `open_loop' E, [2024-05-07T00:35:22.303574 #4028984] ERROR -- : from /usr/lib/ruby/3.0.0/open-uri.rb:151:in `open_uri' E, [2024-05-07T00:35:22.303578 #4028984] ERROR -- : from /usr/lib/ruby/3.0.0/open-uri.rb:721:in `open' E, [2024-05-07T00:35:22.303581 #4028984] ERROR -- : from /usr/lib/ruby/3.0.0/open-uri.rb:729:in `read' E, [2024-05-07T00:35:22.303585 #4028984] ERROR -- : from /tmp/ruby/src/trunk/tool/downloader.rb:247:in `block in download' E, [2024-05-07T00:35:22.303589 #4028984] ERROR -- : from /tmp/ruby/src/trunk/tool/downloader.rb:378:in `with_retry' E, [2024-05-07T00:35:22.303593 #4028984] ERROR -- : from /tmp/ruby/src/trunk/tool/downloader.rb:246:in `download' E, [2024-05-07T00:35:22.303596 #4028984] ERROR -- : from /tmp/ruby/src/trunk/tool/downloader.rb:136:in `download' E, [2024-05-07T00:35:22.303599 #4028984] ERROR -- : from /tmp/ruby/src/trunk/tool/downloader.rb:482:in `block in
' E, [2024-05-07T00:35:22.303603 #4028984] ERROR -- : from /tmp/ruby/src/trunk/tool/downloader.rb:465:in `each' E, [2024-05-07T00:35:22.303606 #4028984] ERROR -- : from /tmp/ruby/src/trunk/tool/downloader.rb:465:in `
' E, [2024-05-07T00:35:22.305469 #4028984] ERROR -- : make: *** [uncommon.mk:1787: /tmp/ruby/src/trunk/enc/unicode/data/emoji/15.0/emoji-test.txt] Error 1 E, [2024-05-07T00:35:22.305495 #4028984] ERROR -- : make: *** Waiting for unfinished jobs.... E, [2024-05-07T00:35:22.330370 #4028984] ERROR -- : /tmp/ruby/src/trunk/tool/downloader.rb:302:in `rescue in download': failed to download emoji/15.0/emoji-sequences.txt (RuntimeError) E, [2024-05-07T00:35:22.330391 #4028984] ERROR -- : EOFError: end of file reached: https://www.unicode.org/Public/emoji/15.0/emoji-sequences.txt E, [2024-05-07T00:35:22.330397 #4028984] ERROR -- : from /tmp/ruby/src/trunk/tool/downloader.rb:201:in `download' E, [2024-05-07T00:35:22.330401 #4028984] ERROR -- : from /tmp/ruby/src/trunk/tool/downloader.rb:136:in `download' E, [2024-05-07T00:35:22.330404 #4028984] ERROR -- : from /tmp/ruby/src/trunk/tool/downloader.rb:482:in `block in
' E, [2024-05-07T00:35:22.330408 #4028984] ERROR -- : from /tmp/ruby/src/trunk/tool/downloader.rb:465:in `each' E, [2024-05-07T00:35:22.330415 #4028984] ERROR -- : from /tmp/ruby/src/trunk/tool/downloader.rb:465:in `
' E, [2024-05-07T00:35:22.330419 #4028984] ERROR -- : /usr/lib/ruby/3.0.0/net/protocol.rb:227:in `rbuf_fill': end of file reached (EOFError) E, [2024-05-07T00:35:22.330422 #4028984] ERROR -- : from /usr/lib/ruby/3.0.0/net/protocol.rb:193:in `readuntil' E, [2024-05-07T00:35:22.330426 #4028984] ERROR -- : from /usr/lib/ruby/3.0.0/net/protocol.rb:203:in `readline' E, [2024-05-07T00:35:22.330429 #4028984] ERROR -- : from /usr/lib/ruby/3.0.0/net/http/response.rb:42:in `read_status_line' E, [2024-05-07T00:35:22.330433 #4028984] ERROR -- : from /usr/lib/ruby/3.0.0/net/http/response.rb:31:in `read_new' E, [2024-05-07T00:35:22.330437 #4028984] ERROR -- : from /usr/lib/ruby/3.0.0/net/http.rb:1557:in `block in transport_request' E, [2024-05-07T00:35:22.330440 #4028984] ERROR -- : from /usr/lib/ruby/3.0.0/net/http.rb:1548:in `catch' E, [2024-05-07T00:35:22.330445 #4028984] ERROR -- : from /usr/lib/ruby/3.0.0/net/http.rb:1548:in `transport_request' E, [2024-05-07T00:35:22.330448 #4028984] ERROR -- : from /usr/lib/ruby/3.0.0/net/http.rb:1521:in `request' E, [2024-05-07T00:35:22.330452 #4028984] ERROR -- : from /usr/lib/ruby/3.0.0/open-uri.rb:329:in `block in open_http' E, [2024-05-07T00:35:22.330459 #4028984] ERROR -- : from /usr/lib/ruby/3.0.0/net/http.rb:960:in `start' E, [2024-05-07T00:35:22.330463 #4028984] ERROR -- : from /usr/lib/ruby/3.0.0/open-uri.rb:323:in `open_http' E, [2024-05-07T00:35:22.330466 #4028984] ERROR -- : from /usr/lib/ruby/3.0.0/open-uri.rb:741:in `buffer_open' E, [2024-05-07T00:35:22.330470 #4028984] ERROR -- : from /usr/lib/ruby/3.0.0/open-uri.rb:212:in `block in open_loop' E, [2024-05-07T00:35:22.330473 #4028984] ERROR -- : from /usr/lib/ruby/3.0.0/open-uri.rb:210:in `catch' E, [2024-05-07T00:35:22.330478 #4028984] ERROR -- : from /usr/lib/ruby/3.0.0/open-uri.rb:210:in `open_loop' E, [2024-05-07T00:35:22.330481 #4028984] ERROR -- : from /usr/lib/ruby/3.0.0/open-uri.rb:151:in `open_uri' E, [2024-05-07T00:35:22.330484 #4028984] ERROR -- : from /usr/lib/ruby/3.0.0/open-uri.rb:721:in `open' E, [2024-05-07T00:35:22.330488 #4028984] ERROR -- : from /usr/lib/ruby/3.0.0/open-uri.rb:729:in `read' E, [2024-05-07T00:35:22.330491 #4028984] ERROR -- : from /tmp/ruby/src/trunk/tool/downloader.rb:247:in `block in download' E, [2024-05-07T00:35:22.330495 #4028984] ERROR -- : from /tmp/ruby/src/trunk/tool/downloader.rb:378:in `with_retry' E, [2024-05-07T00:35:22.330585 #4028984] ERROR -- : from /tmp/ruby/src/trunk/tool/downloader.rb:246:in `download' E, [2024-05-07T00:35:22.330588 #4028984] ERROR -- : from /tmp/ruby/src/trunk/tool/downloader.rb:136:in `download' E, [2024-05-07T00:35:22.330592 #4028984] ERROR -- : from /tmp/ruby/src/trunk/tool/downloader.rb:482:in `block in
' E, [2024-05-07T00:35:22.330596 #4028984] ERROR -- : from /tmp/ruby/src/trunk/tool/downloader.rb:465:in `each' E, [2024-05-07T00:35:22.330599 #4028984] ERROR -- : from /tmp/ruby/src/trunk/tool/downloader.rb:465:in `
' E, [2024-05-07T00:35:22.332403 #4028984] ERROR -- : make: *** [uncommon.mk:1787: /tmp/ruby/src/trunk/enc/unicode/data/emoji/15.0/emoji-sequences.txt] Error 1 E, [2024-05-07T00:35:22.332424 #4028984] ERROR -- : make: *** Deleting file '/tmp/ruby/src/trunk/enc/unicode/data/emoji/15.0/emoji-sequences.txt' E, [2024-05-07T00:35:22.705795 #4028984] ERROR -- : /tmp/ruby/src/trunk/tool/downloader.rb:302:in `rescue in download': failed to download emoji/15.0/emoji-test.txt (RuntimeError) E, [2024-05-07T00:35:22.705816 #4028984] ERROR -- : OpenURI::HTTPError: 403 Forbidden: https://www.unicode.org/Public/emoji/15.0/emoji-test.txt E, [2024-05-07T00:35:22.705821 #4028984] ERROR -- : from /tmp/ruby/src/trunk/tool/downloader.rb:201:in `download' E, [2024-05-07T00:35:22.705825 #4028984] ERROR -- : from /tmp/ruby/src/trunk/tool/downloader.rb:136:in `download' E, [2024-05-07T00:35:22.705828 #4028984] ERROR -- : from /tmp/ruby/src/trunk/tool/downloader.rb:482:in `block in
' E, [2024-05-07T00:35:22.705832 #4028984] ERROR -- : from /tmp/ruby/src/trunk/tool/downloader.rb:465:in `each' E, [2024-05-07T00:35:22.705835 #4028984] ERROR -- : from /tmp/ruby/src/trunk/tool/downloader.rb:465:in `
' E, [2024-05-07T00:35:22.705839 #4028984] ERROR -- : /usr/lib/ruby/3.0.0/open-uri.rb:364:in `open_http': 403 Forbidden (OpenURI::HTTPError) E, [2024-05-07T00:35:22.705844 #4028984] ERROR -- : from /usr/lib/ruby/3.0.0/open-uri.rb:741:in `buffer_open' E, [2024-05-07T00:35:22.705847 #4028984] ERROR -- : from /usr/lib/ruby/3.0.0/open-uri.rb:212:in `block in open_loop' E, [2024-05-07T00:35:22.705850 #4028984] ERROR -- : from /usr/lib/ruby/3.0.0/open-uri.rb:210:in `catch' E, [2024-05-07T00:35:22.705854 #4028984] ERROR -- : from /usr/lib/ruby/3.0.0/open-uri.rb:210:in `open_loop' E, [2024-05-07T00:35:22.705857 #4028984] ERROR -- : from /usr/lib/ruby/3.0.0/open-uri.rb:151:in `open_uri' E, [2024-05-07T00:35:22.705860 #4028984] ERROR -- : from /usr/lib/ruby/3.0.0/open-uri.rb:721:in `open' E, [2024-05-07T00:35:22.705864 #4028984] ERROR -- : from /usr/lib/ruby/3.0.0/open-uri.rb:729:in `read' E, [2024-05-07T00:35:22.705867 #4028984] ERROR -- : from /tmp/ruby/src/trunk/tool/downloader.rb:247:in `block in download' E, [2024-05-07T00:35:22.705870 #4028984] ERROR -- : from /tmp/ruby/src/trunk/tool/downloader.rb:378:in `with_retry' E, [2024-05-07T00:35:22.705878 #4028984] ERROR -- : from /tmp/ruby/src/trunk/tool/downloader.rb:246:in `download' E, [2024-05-07T00:35:22.705882 #4028984] ERROR -- : from /tmp/ruby/src/trunk/tool/downloader.rb:136:in `download' E, [2024-05-07T00:35:22.705885 #4028984] ERROR -- : from /tmp/ruby/src/trunk/tool/downloader.rb:482:in `block in
' E, [2024-05-07T00:35:22.705889 #4028984] ERROR -- : from /tmp/ruby/src/trunk/tool/downloader.rb:465:in `each' E, [2024-05-07T00:35:22.705892 #4028984] ERROR -- : from /tmp/ruby/src/trunk/tool/downloader.rb:465:in `
' E, [2024-05-07T00:35:22.707637 #4028984] ERROR -- : make: *** [uncommon.mk:1787: /tmp/ruby/src/trunk/enc/unicode/data/emoji/15.0/emoji-zwj-sequences.txt] Error 1 I, [2024-05-07T00:35:22.707763 #4028984] INFO -- : downloading emoji/15.0/emoji-sequences.txt ... downloading emoji/15.0/emoji-sequences.txt ... downloading emoji/15.0/emoji-test.txt ... I, [2024-05-07T00:35:22.707929 #4028984] INFO -- : $$$[end] "make update-unicode -j20" exit with 512. I, [2024-05-07T00:35:22.707954 #4028984] INFO -- : $$$[beg] make update-download -j20 I, [2024-05-07T00:35:22.807758 #4028984] INFO -- : tool/config.guess already exists I, [2024-05-07T00:35:22.807803 #4028984] INFO -- : tool/config.sub already exists I, [2024-05-07T00:35:22.809921 #4028984] INFO -- : Update minitest to ea9caafc0754b1d6236a490d59e624b53209734a I, [2024-05-07T00:35:22.810067 #4028984] INFO -- : Update power_assert to 84e85124c5014a139af39161d484156cfe87a9ed I, [2024-05-07T00:35:22.810714 #4028984] INFO -- : Update rbs to ba7872795d5de04adb8ff500c0e6afdc81a041dd I, [2024-05-07T00:35:22.811126 #4028984] INFO -- : Update typeprof to b19a6416da3a05d57fadd6ffdadb382b6d236ca5 I, [2024-05-07T00:35:22.811231 #4028984] INFO -- : echo ea9caafc0754b1d6236a490d59e624b53209734a | /bin/sh /tmp/ruby/src/trunk/tool/ifchange /tmp/ruby/src/trunk/.bundle/.timestamp/minitest.revision - I, [2024-05-07T00:35:22.811392 #4028984] INFO -- : echo 84e85124c5014a139af39161d484156cfe87a9ed | /bin/sh /tmp/ruby/src/trunk/tool/ifchange /tmp/ruby/src/trunk/.bundle/.timestamp/power_assert.revision - I, [2024-05-07T00:35:22.811989 #4028984] INFO -- : echo ba7872795d5de04adb8ff500c0e6afdc81a041dd | /bin/sh /tmp/ruby/src/trunk/tool/ifchange /tmp/ruby/src/trunk/.bundle/.timestamp/rbs.revision - I, [2024-05-07T00:35:22.812538 #4028984] INFO -- : echo b19a6416da3a05d57fadd6ffdadb382b6d236ca5 | /bin/sh /tmp/ruby/src/trunk/tool/ifchange /tmp/ruby/src/trunk/.bundle/.timestamp/typeprof.revision - I, [2024-05-07T00:35:22.813221 #4028984] INFO -- : /tmp/ruby/src/trunk/.bundle/.timestamp/power_assert.revision unchanged I, [2024-05-07T00:35:22.813343 #4028984] INFO -- : /tmp/ruby/src/trunk/.bundle/.timestamp/minitest.revision unchanged I, [2024-05-07T00:35:22.813898 #4028984] INFO -- : /tmp/ruby/src/trunk/.bundle/.timestamp/rbs.revision unchanged I, [2024-05-07T00:35:22.814366 #4028984] INFO -- : Building power_assert@84e85124c5014a139af39161d484156cfe87a9ed to /tmp/ruby/src/trunk/gems/power_assert-2.0.3.gem I, [2024-05-07T00:35:22.814527 #4028984] INFO -- : /tmp/ruby/src/trunk/.bundle/.timestamp/typeprof.revision unchanged I, [2024-05-07T00:35:22.883203 #4028984] INFO -- : Successfully built RubyGem I, [2024-05-07T00:35:22.883269 #4028984] INFO -- : Name: power_assert I, [2024-05-07T00:35:22.883294 #4028984] INFO -- : Version: 2.0.4dev I, [2024-05-07T00:35:22.883310 #4028984] INFO -- : File: power_assert-2.0.4dev.gem I, [2024-05-07T00:35:22.929570 #4028984] INFO -- : $$$[end] "make update-download -j20" exit with 0. I, [2024-05-07T00:35:22.929616 #4028984] INFO -- : $$$[beg] make update-rubyspec -j20 I, [2024-05-07T00:35:22.986839 #4028984] INFO -- : make: Nothing to be done for 'update-rubyspec'. I, [2024-05-07T00:35:22.987212 #4028984] INFO -- : $$$[end] "make update-rubyspec -j20" exit with 0. I, [2024-05-07T00:35:22.987235 #4028984] INFO -- : $$$[beg] make update-src -j20 I, [2024-05-07T00:35:23.898186 #4028984] INFO -- : Already up to date. I, [2024-05-07T00:35:23.907475 #4028984] INFO -- : Latest commit hash = 481e16d58b I, [2024-05-07T00:35:23.908632 #4028984] INFO -- : $$$[end] "make update-src -j20" exit with 0. I, [2024-05-07T00:35:23.908679 #4028984] INFO -- : $$$[beg] make after-update -j20 I, [2024-05-07T00:35:23.976903 #4028984] INFO -- : generating /tmp/ruby/src/trunk/ext/ripper/eventids2table.c I, [2024-05-07T00:35:23.981056 #4028984] INFO -- : make[1]: Entering directory '/tmp/ruby/src/trunk/ext/ripper' I, [2024-05-07T00:35:23.981078 #4028984] INFO -- : make[1]: Nothing to be done for 'src'. I, [2024-05-07T00:35:23.981084 #4028984] INFO -- : make[1]: Leaving directory '/tmp/ruby/src/trunk/ext/ripper' I, [2024-05-07T00:35:23.997629 #4028984] INFO -- : /tmp/ruby/src/trunk/revision.h updated I, [2024-05-07T00:35:23.999021 #4028984] INFO -- : generating x86_64-linux-fake.rb I, [2024-05-07T00:35:24.050509 #4028984] INFO -- : x86_64-linux-fake.rb updated I, [2024-05-07T00:35:24.051841 #4028984] INFO -- : generating enc.mk I, [2024-05-07T00:35:24.169514 #4028984] INFO -- : making srcs under enc I, [2024-05-07T00:35:24.199585 #4028984] INFO -- : make[1]: Entering directory '/tmp/ruby/build/trunk' I, [2024-05-07T00:35:24.199608 #4028984] INFO -- : make[1]: Nothing to be done for 'srcs'. I, [2024-05-07T00:35:24.199614 #4028984] INFO -- : make[1]: Leaving directory '/tmp/ruby/build/trunk' I, [2024-05-07T00:35:24.244511 #4028984] INFO -- : Update minitest to ea9caafc0754b1d6236a490d59e624b53209734a I, [2024-05-07T00:35:24.244757 #4028984] INFO -- : Update power_assert to 84e85124c5014a139af39161d484156cfe87a9ed I, [2024-05-07T00:35:24.245170 #4028984] INFO -- : Update rbs to ba7872795d5de04adb8ff500c0e6afdc81a041dd I, [2024-05-07T00:35:24.245812 #4028984] INFO -- : Update typeprof to b19a6416da3a05d57fadd6ffdadb382b6d236ca5 I, [2024-05-07T00:35:24.246104 #4028984] INFO -- : echo ea9caafc0754b1d6236a490d59e624b53209734a | /bin/sh /tmp/ruby/src/trunk/tool/ifchange /tmp/ruby/src/trunk/.bundle/.timestamp/minitest.revision - I, [2024-05-07T00:35:24.246258 #4028984] INFO -- : echo 84e85124c5014a139af39161d484156cfe87a9ed | /bin/sh /tmp/ruby/src/trunk/tool/ifchange /tmp/ruby/src/trunk/.bundle/.timestamp/power_assert.revision - I, [2024-05-07T00:35:24.246426 #4028984] INFO -- : echo ba7872795d5de04adb8ff500c0e6afdc81a041dd | /bin/sh /tmp/ruby/src/trunk/tool/ifchange /tmp/ruby/src/trunk/.bundle/.timestamp/rbs.revision - I, [2024-05-07T00:35:24.247411 #4028984] INFO -- : echo b19a6416da3a05d57fadd6ffdadb382b6d236ca5 | /bin/sh /tmp/ruby/src/trunk/tool/ifchange /tmp/ruby/src/trunk/.bundle/.timestamp/typeprof.revision - I, [2024-05-07T00:35:24.247779 #4028984] INFO -- : /tmp/ruby/src/trunk/.bundle/.timestamp/minitest.revision unchanged I, [2024-05-07T00:35:24.247799 #4028984] INFO -- : /tmp/ruby/src/trunk/.bundle/.timestamp/power_assert.revision unchanged I, [2024-05-07T00:35:24.248252 #4028984] INFO -- : /tmp/ruby/src/trunk/.bundle/.timestamp/rbs.revision unchanged I, [2024-05-07T00:35:24.248785 #4028984] INFO -- : Building power_assert@84e85124c5014a139af39161d484156cfe87a9ed to /tmp/ruby/src/trunk/gems/power_assert-2.0.3.gem I, [2024-05-07T00:35:24.248976 #4028984] INFO -- : /tmp/ruby/src/trunk/.bundle/.timestamp/typeprof.revision unchanged I, [2024-05-07T00:35:24.317568 #4028984] INFO -- : Successfully built RubyGem I, [2024-05-07T00:35:24.317609 #4028984] INFO -- : Name: power_assert I, [2024-05-07T00:35:24.317615 #4028984] INFO -- : Version: 2.0.4dev I, [2024-05-07T00:35:24.317623 #4028984] INFO -- : File: power_assert-2.0.4dev.gem I, [2024-05-07T00:35:24.319750 #4028984] INFO -- : Extracting bundle gem power_assert-2.0.3... I, [2024-05-07T00:35:24.380188 #4028984] INFO -- : Try with hash version of bundled gems instead of gems/power_assert-2.0.3.gem. We don't use this gem with release version of Ruby. I, [2024-05-07T00:35:24.385130 #4028984] INFO -- : Unpacked gems/power_assert-2.0.4dev.gem I, [2024-05-07T00:35:24.386927 #4028984] INFO -- : $$$[end] "make after-update -j20" exit with 0. I, [2024-05-07T00:35:24.387037 #4028984] INFO -- : $$$[beg] make miniruby -j20 I, [2024-05-07T00:35:24.444836 #4028984] INFO -- : BASERUBY = /usr/bin/ruby --disable=gems I, [2024-05-07T00:35:24.444877 #4028984] INFO -- : CC = gcc I, [2024-05-07T00:35:24.444890 #4028984] INFO -- : LD = ld I, [2024-05-07T00:35:24.444901 #4028984] INFO -- : LDSHARED = gcc -shared I, [2024-05-07T00:35:24.444911 #4028984] INFO -- : CFLAGS = -O3 -fno-fast-math -ggdb3 -Wall -Wextra -Wdeprecated-declarations -Wdiv-by-zero -Wduplicated-cond -Wimplicit-function-declaration -Wimplicit-int -Wpointer-arith -Wwrite-strings -Wold-style-definition -Wimplicit-fallthrough=0 -Wmissing-noreturn -Wno-cast-function-type -Wno-constant-logical-operand -Wno-long-long -Wno-missing-field-initializers -Wno-overlength-strings -Wno-packed-bitfield-compat -Wno-parentheses-equality -Wno-self-assign -Wno-tautological-compare -Wno-unused-parameter -Wno-unused-value -Wsuggest-attribute=format -Wsuggest-attribute=noreturn -Wunused-variable -Wmisleading-indentation -Wundef -fPIC I, [2024-05-07T00:35:24.444922 #4028984] INFO -- : XCFLAGS = -U_FORTIFY_SOURCE -D_FORTIFY_SOURCE=2 -fstack-protector-strong -fno-strict-overflow -fvisibility=hidden -fexcess-precision=standard -DRUBY_EXPORT -I. -I.ext/include/x86_64-linux -I/tmp/ruby/src/trunk/include -I/tmp/ruby/src/trunk -I/tmp/ruby/src/trunk/prism -I/tmp/ruby/src/trunk/enc/unicode/15.0.0 I, [2024-05-07T00:35:24.444933 #4028984] INFO -- : CPPFLAGS = I, [2024-05-07T00:35:24.444943 #4028984] INFO -- : DLDFLAGS = -Wl,--compress-debug-sections=zlib -Wl,-soname,libruby.so.3.4 -fstack-protector-strong I, [2024-05-07T00:35:24.444953 #4028984] INFO -- : SOLIBS = -lz -lrt -lrt -lgmp -ldl -lcrypt -lm -lpthread I, [2024-05-07T00:35:24.444963 #4028984] INFO -- : LANG = en_US.UTF-8 I, [2024-05-07T00:35:24.444973 #4028984] INFO -- : LC_ALL = I, [2024-05-07T00:35:24.444982 #4028984] INFO -- : LC_CTYPE = I, [2024-05-07T00:35:24.444992 #4028984] INFO -- : MFLAGS = -j20 --jobserver-auth=4,5 I, [2024-05-07T00:35:24.445002 #4028984] INFO -- : RUSTC = no I, [2024-05-07T00:35:24.445012 #4028984] INFO -- : YJIT_RUSTC_ARGS = --crate-name=yjit --crate-type=staticlib --edition=2021 -g -C lto=thin -C opt-level=3 -C overflow-checks=on '--out-dir=/tmp/ruby/build/trunk/yjit/target/release/' /tmp/ruby/src/trunk/yjit/src/lib.rs I, [2024-05-07T00:35:24.446271 #4028984] INFO -- : gcc (Ubuntu 11.4.0-1ubuntu1~22.04) 11.4.0 I, [2024-05-07T00:35:24.446313 #4028984] INFO -- : Copyright (C) 2021 Free Software Foundation, Inc. I, [2024-05-07T00:35:24.446326 #4028984] INFO -- : This is free software; see the source for copying conditions. There is NO I, [2024-05-07T00:35:24.446337 #4028984] INFO -- : warranty; not even for MERCHANTABILITY or FITNESS FOR A PARTICULAR PURPOSE. I, [2024-05-07T00:35:24.446348 #4028984] INFO -- : I, [2024-05-07T00:35:24.467096 #4028984] INFO -- : compiling /tmp/ruby/src/trunk/version.c I, [2024-05-07T00:35:24.571039 #4028984] INFO -- : linking miniruby I, [2024-05-07T00:35:25.089720 #4028984] INFO -- : $$$[end] "make miniruby -j20" exit with 0. I, [2024-05-07T00:35:25.089843 #4028984] INFO -- : $$$[beg] make ruby -j20 I, [2024-05-07T00:35:25.146886 #4028984] INFO -- : BASERUBY = /usr/bin/ruby --disable=gems I, [2024-05-07T00:35:25.146913 #4028984] INFO -- : CC = gcc I, [2024-05-07T00:35:25.146919 #4028984] INFO -- : LD = ld I, [2024-05-07T00:35:25.146926 #4028984] INFO -- : LDSHARED = gcc -shared I, [2024-05-07T00:35:25.146930 #4028984] INFO -- : CFLAGS = -O3 -fno-fast-math -ggdb3 -Wall -Wextra -Wdeprecated-declarations -Wdiv-by-zero -Wduplicated-cond -Wimplicit-function-declaration -Wimplicit-int -Wpointer-arith -Wwrite-strings -Wold-style-definition -Wimplicit-fallthrough=0 -Wmissing-noreturn -Wno-cast-function-type -Wno-constant-logical-operand -Wno-long-long -Wno-missing-field-initializers -Wno-overlength-strings -Wno-packed-bitfield-compat -Wno-parentheses-equality -Wno-self-assign -Wno-tautological-compare -Wno-unused-parameter -Wno-unused-value -Wsuggest-attribute=format -Wsuggest-attribute=noreturn -Wunused-variable -Wmisleading-indentation -Wundef -fPIC I, [2024-05-07T00:35:25.146940 #4028984] INFO -- : XCFLAGS = -U_FORTIFY_SOURCE -D_FORTIFY_SOURCE=2 -fstack-protector-strong -fno-strict-overflow -fvisibility=hidden -fexcess-precision=standard -DRUBY_EXPORT -I. -I.ext/include/x86_64-linux -I/tmp/ruby/src/trunk/include -I/tmp/ruby/src/trunk -I/tmp/ruby/src/trunk/prism -I/tmp/ruby/src/trunk/enc/unicode/15.0.0 I, [2024-05-07T00:35:25.146944 #4028984] INFO -- : CPPFLAGS = I, [2024-05-07T00:35:25.146948 #4028984] INFO -- : DLDFLAGS = -Wl,--compress-debug-sections=zlib -Wl,-soname,libruby.so.3.4 -fstack-protector-strong I, [2024-05-07T00:35:25.146951 #4028984] INFO -- : SOLIBS = -lz -lrt -lrt -lgmp -ldl -lcrypt -lm -lpthread I, [2024-05-07T00:35:25.146955 #4028984] INFO -- : LANG = en_US.UTF-8 I, [2024-05-07T00:35:25.146958 #4028984] INFO -- : LC_ALL = I, [2024-05-07T00:35:25.146961 #4028984] INFO -- : LC_CTYPE = I, [2024-05-07T00:35:25.146965 #4028984] INFO -- : MFLAGS = -j20 --jobserver-auth=4,5 I, [2024-05-07T00:35:25.146968 #4028984] INFO -- : RUSTC = no I, [2024-05-07T00:35:25.146972 #4028984] INFO -- : YJIT_RUSTC_ARGS = --crate-name=yjit --crate-type=staticlib --edition=2021 -g -C lto=thin -C opt-level=3 -C overflow-checks=on '--out-dir=/tmp/ruby/build/trunk/yjit/target/release/' /tmp/ruby/src/trunk/yjit/src/lib.rs I, [2024-05-07T00:35:25.148255 #4028984] INFO -- : gcc (Ubuntu 11.4.0-1ubuntu1~22.04) 11.4.0 I, [2024-05-07T00:35:25.148276 #4028984] INFO -- : Copyright (C) 2021 Free Software Foundation, Inc. I, [2024-05-07T00:35:25.148284 #4028984] INFO -- : This is free software; see the source for copying conditions. There is NO I, [2024-05-07T00:35:25.148288 #4028984] INFO -- : warranty; not even for MERCHANTABILITY or FITNESS FOR A PARTICULAR PURPOSE. I, [2024-05-07T00:35:25.148292 #4028984] INFO -- : I, [2024-05-07T00:35:25.258438 #4028984] INFO -- : builtin_binary.inc updated I, [2024-05-07T00:35:25.262963 #4028984] INFO -- : c5234a9416e4f20f175185e840b25b0f08674d14078ed7083f37e655458e3ca9 builtin_binary.inc I, [2024-05-07T00:35:25.263664 #4028984] INFO -- : compiling /tmp/ruby/src/trunk/builtin.c I, [2024-05-07T00:35:25.447940 #4028984] INFO -- : linking static-library libruby-static.a I, [2024-05-07T00:35:25.762913 #4028984] INFO -- : linking shared-library libruby.so.3.4.0 I, [2024-05-07T00:35:27.322538 #4028984] INFO -- : linking ruby I, [2024-05-07T00:35:27.345658 #4028984] INFO -- : $$$[end] "make ruby -j20" exit with 0. I, [2024-05-07T00:35:27.345772 #4028984] INFO -- : $$$[beg] make all -j20 I, [2024-05-07T00:35:27.402363 #4028984] INFO -- : BASERUBY = /usr/bin/ruby --disable=gems I, [2024-05-07T00:35:27.402408 #4028984] INFO -- : CC = gcc I, [2024-05-07T00:35:27.402421 #4028984] INFO -- : LD = ld I, [2024-05-07T00:35:27.402433 #4028984] INFO -- : LDSHARED = gcc -shared I, [2024-05-07T00:35:27.402446 #4028984] INFO -- : CFLAGS = -O3 -fno-fast-math -ggdb3 -Wall -Wextra -Wdeprecated-declarations -Wdiv-by-zero -Wduplicated-cond -Wimplicit-function-declaration -Wimplicit-int -Wpointer-arith -Wwrite-strings -Wold-style-definition -Wimplicit-fallthrough=0 -Wmissing-noreturn -Wno-cast-function-type -Wno-constant-logical-operand -Wno-long-long -Wno-missing-field-initializers -Wno-overlength-strings -Wno-packed-bitfield-compat -Wno-parentheses-equality -Wno-self-assign -Wno-tautological-compare -Wno-unused-parameter -Wno-unused-value -Wsuggest-attribute=format -Wsuggest-attribute=noreturn -Wunused-variable -Wmisleading-indentation -Wundef -fPIC I, [2024-05-07T00:35:27.402459 #4028984] INFO -- : XCFLAGS = -U_FORTIFY_SOURCE -D_FORTIFY_SOURCE=2 -fstack-protector-strong -fno-strict-overflow -fvisibility=hidden -fexcess-precision=standard -DRUBY_EXPORT -I. -I.ext/include/x86_64-linux -I/tmp/ruby/src/trunk/include -I/tmp/ruby/src/trunk -I/tmp/ruby/src/trunk/prism -I/tmp/ruby/src/trunk/enc/unicode/15.0.0 I, [2024-05-07T00:35:27.402469 #4028984] INFO -- : CPPFLAGS = I, [2024-05-07T00:35:27.402480 #4028984] INFO -- : DLDFLAGS = -Wl,--compress-debug-sections=zlib -Wl,-soname,libruby.so.3.4 -fstack-protector-strong I, [2024-05-07T00:35:27.402499 #4028984] INFO -- : SOLIBS = -lz -lrt -lrt -lgmp -ldl -lcrypt -lm -lpthread I, [2024-05-07T00:35:27.402510 #4028984] INFO -- : LANG = en_US.UTF-8 I, [2024-05-07T00:35:27.402520 #4028984] INFO -- : LC_ALL = I, [2024-05-07T00:35:27.402529 #4028984] INFO -- : LC_CTYPE = I, [2024-05-07T00:35:27.402540 #4028984] INFO -- : MFLAGS = -j20 --jobserver-auth=4,5 I, [2024-05-07T00:35:27.402550 #4028984] INFO -- : RUSTC = no I, [2024-05-07T00:35:27.402562 #4028984] INFO -- : YJIT_RUSTC_ARGS = --crate-name=yjit --crate-type=staticlib --edition=2021 -g -C lto=thin -C opt-level=3 -C overflow-checks=on '--out-dir=/tmp/ruby/build/trunk/yjit/target/release/' /tmp/ruby/src/trunk/yjit/src/lib.rs I, [2024-05-07T00:35:27.403784 #4028984] INFO -- : gcc (Ubuntu 11.4.0-1ubuntu1~22.04) 11.4.0 I, [2024-05-07T00:35:27.403827 #4028984] INFO -- : Copyright (C) 2021 Free Software Foundation, Inc. I, [2024-05-07T00:35:27.403841 #4028984] INFO -- : This is free software; see the source for copying conditions. There is NO I, [2024-05-07T00:35:27.403852 #4028984] INFO -- : warranty; not even for MERCHANTABILITY or FITNESS FOR A PARTICULAR PURPOSE. I, [2024-05-07T00:35:27.403862 #4028984] INFO -- : I, [2024-05-07T00:35:27.433226 #4028984] INFO -- : generating enc.mk I, [2024-05-07T00:35:27.435109 #4028984] INFO -- : building spec/ruby/optional/capi/ext/array_spec.so I, [2024-05-07T00:35:27.435424 #4028984] INFO -- : building spec/ruby/optional/capi/ext/basic_object_spec.so I, [2024-05-07T00:35:27.436021 #4028984] INFO -- : building spec/ruby/optional/capi/ext/bignum_spec.so I, [2024-05-07T00:35:27.436378 #4028984] INFO -- : building spec/ruby/optional/capi/ext/binding_spec.so I, [2024-05-07T00:35:27.436717 #4028984] INFO -- : building spec/ruby/optional/capi/ext/boolean_spec.so I, [2024-05-07T00:35:27.437450 #4028984] INFO -- : building spec/ruby/optional/capi/ext/class_id_under_autoload_spec.so I, [2024-05-07T00:35:27.438327 #4028984] INFO -- : building spec/ruby/optional/capi/ext/class_spec.so I, [2024-05-07T00:35:27.438835 #4028984] INFO -- : building spec/ruby/optional/capi/ext/class_under_autoload_spec.so I, [2024-05-07T00:35:27.439345 #4028984] INFO -- : building spec/ruby/optional/capi/ext/complex_spec.so I, [2024-05-07T00:35:27.439751 #4028984] INFO -- : building spec/ruby/optional/capi/ext/constants_spec.so I, [2024-05-07T00:35:27.440792 #4028984] INFO -- : building spec/ruby/optional/capi/ext/data_spec.so I, [2024-05-07T00:35:27.441639 #4028984] INFO -- : building spec/ruby/optional/capi/ext/debug_spec.so I, [2024-05-07T00:35:27.441844 #4028984] INFO -- : building spec/ruby/optional/capi/ext/encoding_spec.so I, [2024-05-07T00:35:27.442548 #4028984] INFO -- : building spec/ruby/optional/capi/ext/enumerator_spec.so I, [2024-05-07T00:35:27.443182 #4028984] INFO -- : building spec/ruby/optional/capi/ext/exception_spec.so I, [2024-05-07T00:35:27.443481 #4028984] INFO -- : building spec/ruby/optional/capi/ext/fiber_spec.so I, [2024-05-07T00:35:27.444043 #4028984] INFO -- : building spec/ruby/optional/capi/ext/file_spec.so I, [2024-05-07T00:35:27.444312 #4028984] INFO -- : building spec/ruby/optional/capi/ext/fixnum_spec.so I, [2024-05-07T00:35:27.456621 #4028984] INFO -- : building spec/ruby/optional/capi/ext/float_spec.so I, [2024-05-07T00:35:27.588631 #4028984] INFO -- : building spec/ruby/optional/capi/ext/gc_spec.so I, [2024-05-07T00:35:27.590093 #4028984] INFO -- : building spec/ruby/optional/capi/ext/globals_spec.so I, [2024-05-07T00:35:27.590819 #4028984] INFO -- : building spec/ruby/optional/capi/ext/hash_spec.so I, [2024-05-07T00:35:27.595433 #4028984] INFO -- : building spec/ruby/optional/capi/ext/integer_spec.so I, [2024-05-07T00:35:27.598771 #4028984] INFO -- : building spec/ruby/optional/capi/ext/io_spec.so I, [2024-05-07T00:35:27.599234 #4028984] INFO -- : building spec/ruby/optional/capi/ext/kernel_spec.so I, [2024-05-07T00:35:27.603617 #4028984] INFO -- : building spec/ruby/optional/capi/ext/language_spec.so I, [2024-05-07T00:35:27.607610 #4028984] INFO -- : building spec/ruby/optional/capi/ext/marshal_spec.so I, [2024-05-07T00:35:27.609449 #4028984] INFO -- : building spec/ruby/optional/capi/ext/module_spec.so I, [2024-05-07T00:35:27.613064 #4028984] INFO -- : building spec/ruby/optional/capi/ext/module_under_autoload_spec.so I, [2024-05-07T00:35:27.614200 #4028984] INFO -- : building spec/ruby/optional/capi/ext/mutex_spec.so I, [2024-05-07T00:35:27.626190 #4028984] INFO -- : building spec/ruby/optional/capi/ext/numeric_spec.so I, [2024-05-07T00:35:27.629176 #4028984] INFO -- : building spec/ruby/optional/capi/ext/object_spec.so I, [2024-05-07T00:35:27.629719 #4028984] INFO -- : building spec/ruby/optional/capi/ext/proc_spec.so I, [2024-05-07T00:35:27.658671 #4028984] INFO -- : building spec/ruby/optional/capi/ext/range_spec.so I, [2024-05-07T00:35:27.672454 #4028984] INFO -- : building spec/ruby/optional/capi/ext/rational_spec.so I, [2024-05-07T00:35:27.707160 #4028984] INFO -- : building spec/ruby/optional/capi/ext/rbasic_spec.so I, [2024-05-07T00:35:27.724301 #4028984] INFO -- : building spec/ruby/optional/capi/ext/regexp_spec.so I, [2024-05-07T00:35:27.747911 #4028984] INFO -- : building spec/ruby/optional/capi/ext/string_spec.so I, [2024-05-07T00:35:27.753299 #4028984] INFO -- : building spec/ruby/optional/capi/ext/struct_spec.so I, [2024-05-07T00:35:27.756697 #4028984] INFO -- : building spec/ruby/optional/capi/ext/st_spec.so I, [2024-05-07T00:35:27.757971 #4028984] INFO -- : building spec/ruby/optional/capi/ext/symbol_spec.so I, [2024-05-07T00:35:27.759584 #4028984] INFO -- : building spec/ruby/optional/capi/ext/thread_spec.so I, [2024-05-07T00:35:27.773146 #4028984] INFO -- : building spec/ruby/optional/capi/ext/time_spec.so I, [2024-05-07T00:35:27.778889 #4028984] INFO -- : building spec/ruby/optional/capi/ext/tracepoint_spec.so I, [2024-05-07T00:35:27.795462 #4028984] INFO -- : building spec/ruby/optional/capi/ext/typed_data_spec.so I, [2024-05-07T00:35:27.821560 #4028984] INFO -- : building spec/ruby/optional/capi/ext/util_spec.so I, [2024-05-07T00:35:27.826898 #4028984] INFO -- : making enc I, [2024-05-07T00:35:27.831401 #4028984] INFO -- : making srcs under enc I, [2024-05-07T00:35:27.858398 #4028984] INFO -- : make[1]: Entering directory '/tmp/ruby/build/trunk' I, [2024-05-07T00:35:27.858448 #4028984] INFO -- : make[1]: Nothing to be done for 'enc'. I, [2024-05-07T00:35:27.858459 #4028984] INFO -- : make[1]: Leaving directory '/tmp/ruby/build/trunk' I, [2024-05-07T00:35:27.881730 #4028984] INFO -- : make[1]: Entering directory '/tmp/ruby/build/trunk' I, [2024-05-07T00:35:27.881803 #4028984] INFO -- : make[1]: Nothing to be done for 'srcs'. I, [2024-05-07T00:35:27.881816 #4028984] INFO -- : make[1]: Leaving directory '/tmp/ruby/build/trunk' I, [2024-05-07T00:35:27.881826 #4028984] INFO -- : generating transdb.h I, [2024-05-07T00:35:27.977617 #4028984] INFO -- : transdb.h unchanged I, [2024-05-07T00:35:27.978955 #4028984] INFO -- : generating makefiles ext/configure-ext.mk I, [2024-05-07T00:35:27.979324 #4028984] INFO -- : making trans I, [2024-05-07T00:35:28.005964 #4028984] INFO -- : ext/configure-ext.mk updated I, [2024-05-07T00:35:28.008444 #4028984] INFO -- : make[1]: Entering directory '/tmp/ruby/build/trunk' I, [2024-05-07T00:35:28.013837 #4028984] INFO -- : make[1]: Entering directory '/tmp/ruby/build/trunk' I, [2024-05-07T00:35:28.013939 #4028984] INFO -- : make[1]: Nothing to be done for 'trans'. I, [2024-05-07T00:35:28.013955 #4028984] INFO -- : make[1]: Leaving directory '/tmp/ruby/build/trunk' I, [2024-05-07T00:35:28.014887 #4028984] INFO -- : making encs I, [2024-05-07T00:35:28.073983 #4028984] INFO -- : make[1]: Entering directory '/tmp/ruby/build/trunk' I, [2024-05-07T00:35:28.074049 #4028984] INFO -- : make[1]: Nothing to be done for 'encs'. I, [2024-05-07T00:35:28.074075 #4028984] INFO -- : make[1]: Leaving directory '/tmp/ruby/build/trunk' I, [2024-05-07T00:35:28.164986 #4028984] INFO -- : make[1]: Leaving directory '/tmp/ruby/build/trunk' I, [2024-05-07T00:35:28.165755 #4028984] INFO -- : generating makefile exts.mk I, [2024-05-07T00:35:28.203140 #4028984] INFO -- : exts.mk unchanged I, [2024-05-07T00:35:28.207658 #4028984] INFO -- : make[1]: Entering directory '/tmp/ruby/build/trunk' I, [2024-05-07T00:35:28.227739 #4028984] INFO -- : make[2]: Entering directory '/tmp/ruby/build/trunk/ext/digest' I, [2024-05-07T00:35:28.228828 #4028984] INFO -- : make[2]: Entering directory '/tmp/ruby/build/trunk/ext/coverage' I, [2024-05-07T00:35:28.228865 #4028984] INFO -- : make[2]: Entering directory '/tmp/ruby/build/trunk/ext/date' I, [2024-05-07T00:35:28.229080 #4028984] INFO -- : make[2]: Entering directory '/tmp/ruby/build/trunk/ext/json' I, [2024-05-07T00:35:28.230714 #4028984] INFO -- : make[2]: Entering directory '/tmp/ruby/build/trunk/ext/monitor' I, [2024-05-07T00:35:28.230919 #4028984] INFO -- : make[2]: Entering directory '/tmp/ruby/build/trunk/ext/io/console' I, [2024-05-07T00:35:28.231399 #4028984] INFO -- : make[2]: Entering directory '/tmp/ruby/build/trunk/ext/pathname' I, [2024-05-07T00:35:28.231702 #4028984] INFO -- : make[2]: Entering directory '/tmp/ruby/build/trunk/ext/pty' I, [2024-05-07T00:35:28.232467 #4028984] INFO -- : make[2]: Entering directory '/tmp/ruby/build/trunk/ext/rubyvm' I, [2024-05-07T00:35:28.233055 #4028984] INFO -- : make[2]: Leaving directory '/tmp/ruby/build/trunk/ext/date' I, [2024-05-07T00:35:28.233079 #4028984] INFO -- : make[2]: Leaving directory '/tmp/ruby/build/trunk/ext/digest' I, [2024-05-07T00:35:28.233131 #4028984] INFO -- : make[2]: Leaving directory '/tmp/ruby/build/trunk/ext/monitor' I, [2024-05-07T00:35:28.233148 #4028984] INFO -- : make[2]: Entering directory '/tmp/ruby/build/trunk/ext/psych' I, [2024-05-07T00:35:28.233274 #4028984] INFO -- : make[2]: Entering directory '/tmp/ruby/build/trunk/ext/objspace' I, [2024-05-07T00:35:28.233415 #4028984] INFO -- : make[2]: Entering directory '/tmp/ruby/build/trunk/ext/fiddle' I, [2024-05-07T00:35:28.233984 #4028984] INFO -- : make[2]: Leaving directory '/tmp/ruby/build/trunk/ext/coverage' I, [2024-05-07T00:35:28.234167 #4028984] INFO -- : make[2]: Leaving directory '/tmp/ruby/build/trunk/ext/pathname' I, [2024-05-07T00:35:28.234364 #4028984] INFO -- : make[2]: Leaving directory '/tmp/ruby/build/trunk/ext/pty' I, [2024-05-07T00:35:28.234443 #4028984] INFO -- : make[2]: Leaving directory '/tmp/ruby/build/trunk/ext/io/console' I, [2024-05-07T00:35:28.234616 #4028984] INFO -- : make[2]: Leaving directory '/tmp/ruby/build/trunk/ext/rubyvm' I, [2024-05-07T00:35:28.235245 #4028984] INFO -- : make[2]: Entering directory '/tmp/ruby/build/trunk/.bundle/gems/bigdecimal-3.1.7/ext/bigdecimal' I, [2024-05-07T00:35:28.235456 #4028984] INFO -- : make[2]: Entering directory '/tmp/ruby/build/trunk/.bundle/gems/nkf-0.2.0/ext/nkf' I, [2024-05-07T00:35:28.235579 #4028984] INFO -- : make[2]: Entering directory '/tmp/ruby/build/trunk/.bundle/gems/debug-1.9.2/ext/debug' I, [2024-05-07T00:35:28.235850 #4028984] INFO -- : make[2]: Entering directory '/tmp/ruby/build/trunk/.bundle/gems/racc-1.7.3/ext/racc/cparse' I, [2024-05-07T00:35:28.236926 #4028984] INFO -- : make[2]: Entering directory '/tmp/ruby/build/trunk/.bundle/gems/syslog-0.1.2/ext/syslog' I, [2024-05-07T00:35:28.237137 #4028984] INFO -- : make[2]: Entering directory '/tmp/ruby/build/trunk/.bundle/gems/rbs-3.4.4/ext/rbs_extension' I, [2024-05-07T00:35:28.237408 #4028984] INFO -- : make[2]: Entering directory '/tmp/ruby/build/trunk/ext/ripper' I, [2024-05-07T00:35:28.238639 #4028984] INFO -- : make[2]: Leaving directory '/tmp/ruby/build/trunk/ext/objspace' I, [2024-05-07T00:35:28.240938 #4028984] INFO -- : make[2]: Entering directory '/tmp/ruby/build/trunk/ext/digest/sha2' I, [2024-05-07T00:35:28.242598 #4028984] INFO -- : make[2]: Entering directory '/tmp/ruby/build/trunk/ext/socket' I, [2024-05-07T00:35:28.243091 #4028984] INFO -- : make[2]: Leaving directory '/tmp/ruby/build/trunk/ext/fiddle' I, [2024-05-07T00:35:28.243755 #4028984] INFO -- : make[2]: Leaving directory '/tmp/ruby/build/trunk/ext/ripper' I, [2024-05-07T00:35:28.244145 #4028984] INFO -- : make[2]: Leaving directory '/tmp/ruby/build/trunk/ext/digest/sha2' I, [2024-05-07T00:35:28.244936 #4028984] INFO -- : make[2]: Entering directory '/tmp/ruby/build/trunk/ext/openssl' I, [2024-05-07T00:35:28.245803 #4028984] INFO -- : make[2]: Leaving directory '/tmp/ruby/build/trunk/ext/psych' I, [2024-05-07T00:35:28.245940 #4028984] INFO -- : make[2]: Leaving directory '/tmp/ruby/build/trunk/ext/json' I, [2024-05-07T00:35:28.248422 #4028984] INFO -- : make[2]: Leaving directory '/tmp/ruby/build/trunk/ext/socket' I, [2024-05-07T00:35:28.256143 #4028984] INFO -- : make[2]: Leaving directory '/tmp/ruby/build/trunk/ext/openssl' I, [2024-05-07T00:35:28.260213 #4028984] INFO -- : make[2]: Leaving directory '/tmp/ruby/build/trunk/.bundle/gems/racc-1.7.3/ext/racc/cparse' I, [2024-05-07T00:35:28.262262 #4028984] INFO -- : make[2]: Leaving directory '/tmp/ruby/build/trunk/.bundle/gems/rbs-3.4.4/ext/rbs_extension' I, [2024-05-07T00:35:28.262481 #4028984] INFO -- : make[2]: Leaving directory '/tmp/ruby/build/trunk/.bundle/gems/bigdecimal-3.1.7/ext/bigdecimal' I, [2024-05-07T00:35:28.267611 #4028984] INFO -- : make[2]: Leaving directory '/tmp/ruby/build/trunk/.bundle/gems/debug-1.9.2/ext/debug' I, [2024-05-07T00:35:28.271224 #4028984] INFO -- : make[2]: Leaving directory '/tmp/ruby/build/trunk/.bundle/gems/nkf-0.2.0/ext/nkf' I, [2024-05-07T00:35:28.272090 #4028984] INFO -- : make[2]: Leaving directory '/tmp/ruby/build/trunk/.bundle/gems/syslog-0.1.2/ext/syslog' I, [2024-05-07T00:35:28.296666 #4028984] INFO -- : make[2]: Entering directory '/tmp/ruby/build/trunk' I, [2024-05-07T00:35:28.363055 #4028984] INFO -- : linking ruby I, [2024-05-07T00:35:28.386780 #4028984] INFO -- : make[2]: Leaving directory '/tmp/ruby/build/trunk' I, [2024-05-07T00:35:28.387216 #4028984] INFO -- : make[1]: Leaving directory '/tmp/ruby/build/trunk' I, [2024-05-07T00:35:28.390781 #4028984] INFO -- : make[1]: Entering directory '/tmp/ruby/build/trunk' I, [2024-05-07T00:35:28.390830 #4028984] INFO -- : make[1]: Nothing to be done for 'note'. I, [2024-05-07T00:35:28.390844 #4028984] INFO -- : make[1]: Leaving directory '/tmp/ruby/build/trunk' I, [2024-05-07T00:35:28.391384 #4028984] INFO -- : $$$[end] "make all -j20" exit with 0. I, [2024-05-07T00:35:28.391571 #4028984] INFO -- : $$$[beg] make install -j20 I, [2024-05-07T00:35:28.454580 #4028984] INFO -- : Update minitest to ea9caafc0754b1d6236a490d59e624b53209734a I, [2024-05-07T00:35:28.454767 #4028984] INFO -- : Update power_assert to 84e85124c5014a139af39161d484156cfe87a9ed I, [2024-05-07T00:35:28.455497 #4028984] INFO -- : Update rbs to ba7872795d5de04adb8ff500c0e6afdc81a041dd I, [2024-05-07T00:35:28.455550 #4028984] INFO -- : Update typeprof to b19a6416da3a05d57fadd6ffdadb382b6d236ca5 I, [2024-05-07T00:35:28.456276 #4028984] INFO -- : echo ea9caafc0754b1d6236a490d59e624b53209734a | /bin/sh /tmp/ruby/src/trunk/tool/ifchange /tmp/ruby/src/trunk/.bundle/.timestamp/minitest.revision - I, [2024-05-07T00:35:28.456328 #4028984] INFO -- : echo 84e85124c5014a139af39161d484156cfe87a9ed | /bin/sh /tmp/ruby/src/trunk/tool/ifchange /tmp/ruby/src/trunk/.bundle/.timestamp/power_assert.revision - I, [2024-05-07T00:35:28.457437 #4028984] INFO -- : BASERUBY = /usr/bin/ruby --disable=gems I, [2024-05-07T00:35:28.457473 #4028984] INFO -- : CC = gcc I, [2024-05-07T00:35:28.457478 #4028984] INFO -- : LD = ld I, [2024-05-07T00:35:28.457482 #4028984] INFO -- : LDSHARED = gcc -shared I, [2024-05-07T00:35:28.457489 #4028984] INFO -- : CFLAGS = -O3 -fno-fast-math -ggdb3 -Wall -Wextra -Wdeprecated-declarations -Wdiv-by-zero -Wduplicated-cond -Wimplicit-function-declaration -Wimplicit-int -Wpointer-arith -Wwrite-strings -Wold-style-definition -Wimplicit-fallthrough=0 -Wmissing-noreturn -Wno-cast-function-type -Wno-constant-logical-operand -Wno-long-long -Wno-missing-field-initializers -Wno-overlength-strings -Wno-packed-bitfield-compat -Wno-parentheses-equality -Wno-self-assign -Wno-tautological-compare -Wno-unused-parameter -Wno-unused-value -Wsuggest-attribute=format -Wsuggest-attribute=noreturn -Wunused-variable -Wmisleading-indentation -Wundef -fPIC I, [2024-05-07T00:35:28.457500 #4028984] INFO -- : XCFLAGS = -U_FORTIFY_SOURCE -D_FORTIFY_SOURCE=2 -fstack-protector-strong -fno-strict-overflow -fvisibility=hidden -fexcess-precision=standard -DRUBY_EXPORT -I. -I.ext/include/x86_64-linux -I/tmp/ruby/src/trunk/include -I/tmp/ruby/src/trunk -I/tmp/ruby/src/trunk/prism -I/tmp/ruby/src/trunk/enc/unicode/15.0.0 I, [2024-05-07T00:35:28.457505 #4028984] INFO -- : CPPFLAGS = I, [2024-05-07T00:35:28.457508 #4028984] INFO -- : DLDFLAGS = -Wl,--compress-debug-sections=zlib -Wl,-soname,libruby.so.3.4 -fstack-protector-strong I, [2024-05-07T00:35:28.457512 #4028984] INFO -- : SOLIBS = -lz -lrt -lrt -lgmp -ldl -lcrypt -lm -lpthread I, [2024-05-07T00:35:28.457515 #4028984] INFO -- : LANG = en_US.UTF-8 I, [2024-05-07T00:35:28.457520 #4028984] INFO -- : LC_ALL = I, [2024-05-07T00:35:28.457524 #4028984] INFO -- : LC_CTYPE = I, [2024-05-07T00:35:28.457527 #4028984] INFO -- : MFLAGS = -j20 --jobserver-auth=4,5 I, [2024-05-07T00:35:28.457530 #4028984] INFO -- : RUSTC = no I, [2024-05-07T00:35:28.457535 #4028984] INFO -- : YJIT_RUSTC_ARGS = --crate-name=yjit --crate-type=staticlib --edition=2021 -g -C lto=thin -C opt-level=3 -C overflow-checks=on '--out-dir=/tmp/ruby/build/trunk/yjit/target/release/' /tmp/ruby/src/trunk/yjit/src/lib.rs I, [2024-05-07T00:35:28.458306 #4028984] INFO -- : /tmp/ruby/src/trunk/.bundle/.timestamp/power_assert.revision unchanged I, [2024-05-07T00:35:28.458328 #4028984] INFO -- : /tmp/ruby/src/trunk/.bundle/.timestamp/minitest.revision unchanged I, [2024-05-07T00:35:28.488203 #4028984] INFO -- : echo ba7872795d5de04adb8ff500c0e6afdc81a041dd | /bin/sh /tmp/ruby/src/trunk/tool/ifchange /tmp/ruby/src/trunk/.bundle/.timestamp/rbs.revision - I, [2024-05-07T00:35:28.488366 #4028984] INFO -- : echo b19a6416da3a05d57fadd6ffdadb382b6d236ca5 | /bin/sh /tmp/ruby/src/trunk/tool/ifchange /tmp/ruby/src/trunk/.bundle/.timestamp/typeprof.revision - I, [2024-05-07T00:35:28.489164 #4028984] INFO -- : gcc (Ubuntu 11.4.0-1ubuntu1~22.04) 11.4.0 I, [2024-05-07T00:35:28.489195 #4028984] INFO -- : Copyright (C) 2021 Free Software Foundation, Inc. I, [2024-05-07T00:35:28.489213 #4028984] INFO -- : This is free software; see the source for copying conditions. There is NO I, [2024-05-07T00:35:28.489225 #4028984] INFO -- : warranty; not even for MERCHANTABILITY or FITNESS FOR A PARTICULAR PURPOSE. I, [2024-05-07T00:35:28.489236 #4028984] INFO -- : I, [2024-05-07T00:35:28.489247 #4028984] INFO -- : generating enc.mk I, [2024-05-07T00:35:28.490251 #4028984] INFO -- : /tmp/ruby/src/trunk/.bundle/.timestamp/rbs.revision unchanged I, [2024-05-07T00:35:28.490294 #4028984] INFO -- : /tmp/ruby/src/trunk/.bundle/.timestamp/typeprof.revision unchanged I, [2024-05-07T00:35:28.612675 #4028984] INFO -- : Building power_assert@84e85124c5014a139af39161d484156cfe87a9ed to /tmp/ruby/src/trunk/gems/power_assert-2.0.3.gem I, [2024-05-07T00:35:28.613267 #4028984] INFO -- : making srcs under enc I, [2024-05-07T00:35:28.613618 #4028984] INFO -- : making enc I, [2024-05-07T00:35:28.630558 #4028984] INFO -- : make[1]: Entering directory '/tmp/ruby/build/trunk' I, [2024-05-07T00:35:28.630598 #4028984] INFO -- : make[1]: Nothing to be done for 'enc'. I, [2024-05-07T00:35:28.630612 #4028984] INFO -- : make[1]: Leaving directory '/tmp/ruby/build/trunk' I, [2024-05-07T00:35:28.643313 #4028984] INFO -- : make[1]: Entering directory '/tmp/ruby/build/trunk' I, [2024-05-07T00:35:28.643363 #4028984] INFO -- : make[1]: Nothing to be done for 'srcs'. I, [2024-05-07T00:35:28.643379 #4028984] INFO -- : make[1]: Leaving directory '/tmp/ruby/build/trunk' I, [2024-05-07T00:35:28.644096 #4028984] INFO -- : generating transdb.h I, [2024-05-07T00:35:28.681798 #4028984] INFO -- : Successfully built RubyGem I, [2024-05-07T00:35:28.681862 #4028984] INFO -- : Name: power_assert I, [2024-05-07T00:35:28.681877 #4028984] INFO -- : Version: 2.0.4dev I, [2024-05-07T00:35:28.681898 #4028984] INFO -- : File: power_assert-2.0.4dev.gem I, [2024-05-07T00:35:28.684084 #4028984] INFO -- : Extracting bundle gem power_assert-2.0.3... I, [2024-05-07T00:35:28.739103 #4028984] INFO -- : transdb.h unchanged I, [2024-05-07T00:35:28.740900 #4028984] INFO -- : generating makefiles ext/configure-ext.mk I, [2024-05-07T00:35:28.740957 #4028984] INFO -- : making trans I, [2024-05-07T00:35:28.745012 #4028984] INFO -- : Try with hash version of bundled gems instead of gems/power_assert-2.0.3.gem. We don't use this gem with release version of Ruby. I, [2024-05-07T00:35:28.750015 #4028984] INFO -- : Unpacked gems/power_assert-2.0.4dev.gem I, [2024-05-07T00:35:28.768579 #4028984] INFO -- : ext/configure-ext.mk unchanged I, [2024-05-07T00:35:28.771131 #4028984] INFO -- : make[1]: Entering directory '/tmp/ruby/build/trunk' I, [2024-05-07T00:35:28.776359 #4028984] INFO -- : make[1]: Entering directory '/tmp/ruby/build/trunk' I, [2024-05-07T00:35:28.776477 #4028984] INFO -- : make[1]: Nothing to be done for 'trans'. I, [2024-05-07T00:35:28.776510 #4028984] INFO -- : make[1]: Leaving directory '/tmp/ruby/build/trunk' I, [2024-05-07T00:35:28.777638 #4028984] INFO -- : making encs I, [2024-05-07T00:35:28.852698 #4028984] INFO -- : make[1]: Entering directory '/tmp/ruby/build/trunk' I, [2024-05-07T00:35:28.852773 #4028984] INFO -- : make[1]: Nothing to be done for 'encs'. I, [2024-05-07T00:35:28.852800 #4028984] INFO -- : make[1]: Leaving directory '/tmp/ruby/build/trunk' I, [2024-05-07T00:35:28.923964 #4028984] INFO -- : make[1]: Leaving directory '/tmp/ruby/build/trunk' I, [2024-05-07T00:35:28.924696 #4028984] INFO -- : generating makefile exts.mk I, [2024-05-07T00:35:28.961643 #4028984] INFO -- : exts.mk unchanged I, [2024-05-07T00:35:28.966377 #4028984] INFO -- : make[1]: Entering directory '/tmp/ruby/build/trunk' I, [2024-05-07T00:35:28.985413 #4028984] INFO -- : make[2]: Entering directory '/tmp/ruby/build/trunk/ext/digest' I, [2024-05-07T00:35:28.986502 #4028984] INFO -- : make[2]: Entering directory '/tmp/ruby/build/trunk/ext/coverage' I, [2024-05-07T00:35:28.987025 #4028984] INFO -- : make[2]: Entering directory '/tmp/ruby/build/trunk/ext/date' I, [2024-05-07T00:35:28.987688 #4028984] INFO -- : make[2]: Entering directory '/tmp/ruby/build/trunk/ext/json' I, [2024-05-07T00:35:28.989026 #4028984] INFO -- : make[2]: Entering directory '/tmp/ruby/build/trunk/ext/io/console' I, [2024-05-07T00:35:28.989294 #4028984] INFO -- : make[2]: Leaving directory '/tmp/ruby/build/trunk/ext/digest' I, [2024-05-07T00:35:28.989378 #4028984] INFO -- : make[2]: Entering directory '/tmp/ruby/build/trunk/ext/monitor' I, [2024-05-07T00:35:28.989832 #4028984] INFO -- : make[2]: Entering directory '/tmp/ruby/build/trunk/ext/rubyvm' I, [2024-05-07T00:35:28.990078 #4028984] INFO -- : make[2]: Entering directory '/tmp/ruby/build/trunk/ext/pathname' I, [2024-05-07T00:35:28.990389 #4028984] INFO -- : make[2]: Leaving directory '/tmp/ruby/build/trunk/ext/coverage' I, [2024-05-07T00:35:28.990448 #4028984] INFO -- : make[2]: Entering directory '/tmp/ruby/build/trunk/ext/pty' I, [2024-05-07T00:35:28.991209 #4028984] INFO -- : make[2]: Leaving directory '/tmp/ruby/build/trunk/ext/date' I, [2024-05-07T00:35:28.991233 #4028984] INFO -- : make[2]: Entering directory '/tmp/ruby/build/trunk/ext/fiddle' I, [2024-05-07T00:35:28.991630 #4028984] INFO -- : make[2]: Leaving directory '/tmp/ruby/build/trunk/ext/rubyvm' I, [2024-05-07T00:35:28.991987 #4028984] INFO -- : make[2]: Entering directory '/tmp/ruby/build/trunk/ext/objspace' I, [2024-05-07T00:35:28.992028 #4028984] INFO -- : make[2]: Entering directory '/tmp/ruby/build/trunk/ext/psych' I, [2024-05-07T00:35:28.992511 #4028984] INFO -- : make[2]: Leaving directory '/tmp/ruby/build/trunk/ext/monitor' I, [2024-05-07T00:35:28.992794 #4028984] INFO -- : make[2]: Entering directory '/tmp/ruby/build/trunk/.bundle/gems/bigdecimal-3.1.7/ext/bigdecimal' I, [2024-05-07T00:35:28.993076 #4028984] INFO -- : make[2]: Leaving directory '/tmp/ruby/build/trunk/ext/pty' I, [2024-05-07T00:35:28.993508 #4028984] INFO -- : make[2]: Entering directory '/tmp/ruby/build/trunk/.bundle/gems/debug-1.9.2/ext/debug' I, [2024-05-07T00:35:28.993948 #4028984] INFO -- : make[2]: Entering directory '/tmp/ruby/build/trunk/.bundle/gems/nkf-0.2.0/ext/nkf' I, [2024-05-07T00:35:28.995062 #4028984] INFO -- : make[2]: Leaving directory '/tmp/ruby/build/trunk/ext/pathname' I, [2024-05-07T00:35:28.995719 #4028984] INFO -- : make[2]: Entering directory '/tmp/ruby/build/trunk/ext/ripper' I, [2024-05-07T00:35:28.995947 #4028984] INFO -- : make[2]: Leaving directory '/tmp/ruby/build/trunk/ext/json' I, [2024-05-07T00:35:28.996318 #4028984] INFO -- : make[2]: Entering directory '/tmp/ruby/build/trunk/.bundle/gems/racc-1.7.3/ext/racc/cparse' I, [2024-05-07T00:35:28.996682 #4028984] INFO -- : make[2]: Entering directory '/tmp/ruby/build/trunk/.bundle/gems/syslog-0.1.2/ext/syslog' I, [2024-05-07T00:35:28.996985 #4028984] INFO -- : make[2]: Entering directory '/tmp/ruby/build/trunk/.bundle/gems/rbs-3.4.4/ext/rbs_extension' I, [2024-05-07T00:35:28.997200 #4028984] INFO -- : make[2]: Leaving directory '/tmp/ruby/build/trunk/ext/fiddle' I, [2024-05-07T00:35:28.999145 #4028984] INFO -- : make[2]: Entering directory '/tmp/ruby/build/trunk/ext/digest/sha2' I, [2024-05-07T00:35:28.999909 #4028984] INFO -- : make[2]: Entering directory '/tmp/ruby/build/trunk/ext/socket' I, [2024-05-07T00:35:29.000181 #4028984] INFO -- : make[2]: Leaving directory '/tmp/ruby/build/trunk/ext/objspace' I, [2024-05-07T00:35:29.002455 #4028984] INFO -- : make[2]: Leaving directory '/tmp/ruby/build/trunk/ext/digest/sha2' I, [2024-05-07T00:35:29.002521 #4028984] INFO -- : make[2]: Leaving directory '/tmp/ruby/build/trunk/ext/io/console' I, [2024-05-07T00:35:29.002999 #4028984] INFO -- : make[2]: Leaving directory '/tmp/ruby/build/trunk/ext/ripper' I, [2024-05-07T00:35:29.003902 #4028984] INFO -- : make[2]: Entering directory '/tmp/ruby/build/trunk/ext/openssl' I, [2024-05-07T00:35:29.004492 #4028984] INFO -- : make[2]: Leaving directory '/tmp/ruby/build/trunk/ext/psych' I, [2024-05-07T00:35:29.005960 #4028984] INFO -- : make[2]: Leaving directory '/tmp/ruby/build/trunk/ext/socket' I, [2024-05-07T00:35:29.015166 #4028984] INFO -- : make[2]: Leaving directory '/tmp/ruby/build/trunk/ext/openssl' I, [2024-05-07T00:35:29.017619 #4028984] INFO -- : make[2]: Leaving directory '/tmp/ruby/build/trunk/.bundle/gems/nkf-0.2.0/ext/nkf' I, [2024-05-07T00:35:29.020452 #4028984] INFO -- : make[2]: Leaving directory '/tmp/ruby/build/trunk/.bundle/gems/syslog-0.1.2/ext/syslog' I, [2024-05-07T00:35:29.020740 #4028984] INFO -- : make[2]: Leaving directory '/tmp/ruby/build/trunk/.bundle/gems/rbs-3.4.4/ext/rbs_extension' I, [2024-05-07T00:35:29.024150 #4028984] INFO -- : make[2]: Leaving directory '/tmp/ruby/build/trunk/.bundle/gems/bigdecimal-3.1.7/ext/bigdecimal' I, [2024-05-07T00:35:29.024176 #4028984] INFO -- : make[2]: Leaving directory '/tmp/ruby/build/trunk/.bundle/gems/debug-1.9.2/ext/debug' I, [2024-05-07T00:35:29.032988 #4028984] INFO -- : make[2]: Leaving directory '/tmp/ruby/build/trunk/.bundle/gems/racc-1.7.3/ext/racc/cparse' I, [2024-05-07T00:35:29.056875 #4028984] INFO -- : make[2]: Entering directory '/tmp/ruby/build/trunk' I, [2024-05-07T00:35:29.122204 #4028984] INFO -- : make[2]: 'ruby' is up to date. I, [2024-05-07T00:35:29.122235 #4028984] INFO -- : make[2]: Leaving directory '/tmp/ruby/build/trunk' I, [2024-05-07T00:35:29.122633 #4028984] INFO -- : make[1]: Leaving directory '/tmp/ruby/build/trunk' I, [2024-05-07T00:35:29.126237 #4028984] INFO -- : make[1]: Entering directory '/tmp/ruby/build/trunk' I, [2024-05-07T00:35:29.126258 #4028984] INFO -- : make[1]: Nothing to be done for 'note'. I, [2024-05-07T00:35:29.126263 #4028984] INFO -- : make[1]: Leaving directory '/tmp/ruby/build/trunk' I, [2024-05-07T00:35:29.126502 #4028984] INFO -- : ./miniruby -I/tmp/ruby/src/trunk/lib -I. -I.ext/common /tmp/ruby/src/trunk/tool/runruby.rb --extout=.ext -- --disable-gems -r./x86_64-linux-fake /tmp/ruby/src/trunk/tool/rbinstall.rb --make="make" --dest-dir="" --extout=".ext" --ext-build-dir="./ext" --mflags="-j20 --jobserver-auth=4,5" --make-flags=" -j20 --jobserver-auth=4,5" --data-mode=0644 --prog-mode=0755 --installed-list .installed.list --mantype="doc" --gnumake --install=all --exclude=doc I, [2024-05-07T00:35:29.222114 #4028984] INFO -- : Installing to I, [2024-05-07T00:35:29.222173 #4028984] INFO -- : installing binary commands: /tmp/ruby/install/trunk/bin I, [2024-05-07T00:35:29.222277 #4028984] INFO -- : installing base libraries: /tmp/ruby/install/trunk/lib I, [2024-05-07T00:35:29.229682 #4028984] INFO -- : installing arch files: /tmp/ruby/install/trunk/lib/ruby/3.4.0+0/x86_64-linux I, [2024-05-07T00:35:29.229707 #4028984] INFO -- : installing pkgconfig data: /tmp/ruby/install/trunk/lib/pkgconfig I, [2024-05-07T00:35:29.229714 #4028984] INFO -- : installing extension objects: /tmp/ruby/install/trunk/lib/ruby/3.4.0+0/x86_64-linux I, [2024-05-07T00:35:29.239397 #4028984] INFO -- : installing extension objects: /tmp/ruby/install/trunk/lib/ruby/site_ruby/3.4.0+0/x86_64-linux I, [2024-05-07T00:35:29.239419 #4028984] INFO -- : installing extension objects: /tmp/ruby/install/trunk/lib/ruby/vendor_ruby/3.4.0+0/x86_64-linux I, [2024-05-07T00:35:29.239426 #4028984] INFO -- : installing extension headers: /tmp/ruby/install/trunk/include/ruby-3.4.0+0/x86_64-linux I, [2024-05-07T00:35:29.239570 #4028984] INFO -- : installing extension scripts: /tmp/ruby/install/trunk/lib/ruby/3.4.0+0 I, [2024-05-07T00:35:29.243313 #4028984] INFO -- : installing extension scripts: /tmp/ruby/install/trunk/lib/ruby/site_ruby/3.4.0+0 I, [2024-05-07T00:35:29.243333 #4028984] INFO -- : installing extension scripts: /tmp/ruby/install/trunk/lib/ruby/vendor_ruby/3.4.0+0 I, [2024-05-07T00:35:29.243339 #4028984] INFO -- : installing extension headers: /tmp/ruby/install/trunk/include/ruby-3.4.0+0/ruby I, [2024-05-07T00:35:29.243343 #4028984] INFO -- : installing command scripts: /tmp/ruby/install/trunk/bin I, [2024-05-07T00:35:29.243347 #4028984] INFO -- : installing library scripts: /tmp/ruby/install/trunk/lib/ruby/3.4.0+0 I, [2024-05-07T00:35:29.277641 #4028984] INFO -- : installing common headers: /tmp/ruby/install/trunk/include/ruby-3.4.0+0 I, [2024-05-07T00:35:29.283074 #4028984] INFO -- : installing manpages: /tmp/ruby/install/trunk/share/man/man1 I, [2024-05-07T00:35:29.283184 #4028984] INFO -- : installing default gems from lib: /tmp/ruby/install/trunk/lib/ruby/gems/3.4.0+0 I, [2024-05-07T00:35:29.305729 #4028984] INFO -- : benchmark 0.3.0 I, [2024-05-07T00:35:29.312551 #4028984] INFO -- : bundler 2.6.0.dev I, [2024-05-07T00:35:29.314680 #4028984] INFO -- : cgi 0.4.1 I, [2024-05-07T00:35:29.315219 #4028984] INFO -- : delegate 0.3.1 I, [2024-05-07T00:35:29.315704 #4028984] INFO -- : did_you_mean 1.6.3 I, [2024-05-07T00:35:29.316200 #4028984] INFO -- : english 0.8.0 I, [2024-05-07T00:35:29.316702 #4028984] INFO -- : erb 4.0.4 I, [2024-05-07T00:35:29.317423 #4028984] INFO -- : error_highlight 0.6.0 I, [2024-05-07T00:35:29.317916 #4028984] INFO -- : fileutils 1.7.2 I, [2024-05-07T00:35:29.318374 #4028984] INFO -- : find 0.2.0 I, [2024-05-07T00:35:29.318758 #4028984] INFO -- : forwardable 1.3.3 I, [2024-05-07T00:35:29.319201 #4028984] INFO -- : ipaddr 1.2.6 I, [2024-05-07T00:35:29.319743 #4028984] INFO -- : irb 1.13.1 I, [2024-05-07T00:35:29.321222 #4028984] INFO -- : logger 1.6.0 I, [2024-05-07T00:35:29.321803 #4028984] INFO -- : net-http 0.4.1 I, [2024-05-07T00:35:29.322341 #4028984] INFO -- : net-protocol 0.2.2 I, [2024-05-07T00:35:29.322836 #4028984] INFO -- : open-uri 0.4.1 I, [2024-05-07T00:35:29.323429 #4028984] INFO -- : open3 0.2.1 I, [2024-05-07T00:35:29.323762 #4028984] INFO -- : optparse 0.5.0 I, [2024-05-07T00:35:29.324304 #4028984] INFO -- : ostruct 0.6.0 I, [2024-05-07T00:35:29.324854 #4028984] INFO -- : pp 0.5.0 I, [2024-05-07T00:35:29.325365 #4028984] INFO -- : prettyprint 0.2.0 I, [2024-05-07T00:35:29.325839 #4028984] INFO -- : prism 0.27.0 I, [2024-05-07T00:35:29.326358 #4028984] INFO -- : pstore 0.1.3 I, [2024-05-07T00:35:29.326812 #4028984] INFO -- : rdoc 6.6.3.1 I, [2024-05-07T00:35:29.328378 #4028984] INFO -- : readline 0.0.4 I, [2024-05-07T00:35:29.328946 #4028984] INFO -- : reline 0.5.5 I, [2024-05-07T00:35:29.329507 #4028984] INFO -- : resolv 0.4.0 I, [2024-05-07T00:35:29.330068 #4028984] INFO -- : ruby2_keywords 0.0.5 I, [2024-05-07T00:35:29.330550 #4028984] INFO -- : securerandom 0.3.1 I, [2024-05-07T00:35:29.331031 #4028984] INFO -- : set 1.1.0 I, [2024-05-07T00:35:29.331510 #4028984] INFO -- : shellwords 0.2.0 I, [2024-05-07T00:35:29.332021 #4028984] INFO -- : singleton 0.2.0 I, [2024-05-07T00:35:29.332491 #4028984] INFO -- : syntax_suggest 2.0.0 I, [2024-05-07T00:35:29.333240 #4028984] INFO -- : tempfile 0.2.1 I, [2024-05-07T00:35:29.333801 #4028984] INFO -- : time 0.3.0 I, [2024-05-07T00:35:29.334356 #4028984] INFO -- : timeout 0.4.1 I, [2024-05-07T00:35:29.335435 #4028984] INFO -- : tmpdir 0.2.0 I, [2024-05-07T00:35:29.335966 #4028984] INFO -- : tsort 0.2.0 I, [2024-05-07T00:35:29.336419 #4028984] INFO -- : un 0.3.0 I, [2024-05-07T00:35:29.336959 #4028984] INFO -- : uri 0.13.0 I, [2024-05-07T00:35:29.337454 #4028984] INFO -- : weakref 0.1.3 I, [2024-05-07T00:35:29.338036 #4028984] INFO -- : yaml 0.3.0 I, [2024-05-07T00:35:29.338407 #4028984] INFO -- : installing default gems from ext: /tmp/ruby/install/trunk/lib/ruby/gems/3.4.0+0 I, [2024-05-07T00:35:29.345161 #4028984] INFO -- : date 3.3.4 I, [2024-05-07T00:35:29.345678 #4028984] INFO -- : digest 3.1.1 I, [2024-05-07T00:35:29.346149 #4028984] INFO -- : etc 1.4.3 I, [2024-05-07T00:35:29.346678 #4028984] INFO -- : fcntl 1.1.0 I, [2024-05-07T00:35:29.347278 #4028984] INFO -- : fiddle 1.1.3 I, [2024-05-07T00:35:29.347756 #4028984] INFO -- : io-console 0.7.2 I, [2024-05-07T00:35:29.348282 #4028984] INFO -- : io-nonblock 0.3.0 I, [2024-05-07T00:35:29.348820 #4028984] INFO -- : io-wait 0.3.1 I, [2024-05-07T00:35:29.349278 #4028984] INFO -- : json 2.7.2 I, [2024-05-07T00:35:29.350186 #4028984] INFO -- : openssl 3.2.0 I, [2024-05-07T00:35:29.350899 #4028984] INFO -- : pathname 0.3.0 I, [2024-05-07T00:35:29.351415 #4028984] INFO -- : psych 5.1.2 I, [2024-05-07T00:35:29.351996 #4028984] INFO -- : stringio 3.1.1 I, [2024-05-07T00:35:29.352473 #4028984] INFO -- : strscan 3.1.1 I, [2024-05-07T00:35:29.352984 #4028984] INFO -- : zlib 3.1.0 I, [2024-05-07T00:35:29.353397 #4028984] INFO -- : installing bundled gems: /tmp/ruby/install/trunk/lib/ruby/gems/3.4.0+0 I, [2024-05-07T00:35:29.353804 #4028984] INFO -- : minitest 5.22.3 I, [2024-05-07T00:35:29.361283 #4028984] INFO -- : rake 13.2.1 I, [2024-05-07T00:35:29.364750 #4028984] INFO -- : test-unit 3.6.2 I, [2024-05-07T00:35:29.369154 #4028984] INFO -- : rexml 3.2.6 I, [2024-05-07T00:35:29.372482 #4028984] INFO -- : rss 0.3.0 I, [2024-05-07T00:35:29.375519 #4028984] INFO -- : net-ftp 0.3.4 I, [2024-05-07T00:35:29.377005 #4028984] INFO -- : net-imap 0.4.10 I, [2024-05-07T00:35:29.379871 #4028984] INFO -- : net-pop 0.1.2 I, [2024-05-07T00:35:29.380909 #4028984] INFO -- : net-smtp 0.5.0 I, [2024-05-07T00:35:29.381993 #4028984] INFO -- : matrix 0.4.2 I, [2024-05-07T00:35:29.385446 #4028984] INFO -- : prime 0.1.2 I, [2024-05-07T00:35:29.390821 #4028984] INFO -- : rbs 3.4.4 I, [2024-05-07T00:35:29.414311 #4028984] INFO -- : typeprof 0.21.11 I, [2024-05-07T00:35:29.416905 #4028984] INFO -- : debug 1.9.2 I, [2024-05-07T00:35:29.419639 #4028984] INFO -- : racc 1.7.3 I, [2024-05-07T00:35:29.422433 #4028984] INFO -- : mutex_m 0.2.0 I, [2024-05-07T00:35:29.423648 #4028984] INFO -- : getoptlong 0.2.1 I, [2024-05-07T00:35:29.424940 #4028984] INFO -- : base64 0.2.0 I, [2024-05-07T00:35:29.425927 #4028984] INFO -- : bigdecimal 3.1.7 I, [2024-05-07T00:35:29.427872 #4028984] INFO -- : observer 0.1.2 I, [2024-05-07T00:35:29.429198 #4028984] INFO -- : abbrev 0.1.2 I, [2024-05-07T00:35:29.430666 #4028984] INFO -- : resolv-replace 0.1.1 I, [2024-05-07T00:35:29.431869 #4028984] INFO -- : rinda 0.2.0 I, [2024-05-07T00:35:29.433288 #4028984] INFO -- : drb 2.2.1 I, [2024-05-07T00:35:29.434780 #4028984] INFO -- : nkf 0.2.0 I, [2024-05-07T00:35:29.437404 #4028984] INFO -- : syslog 0.1.2 I, [2024-05-07T00:35:29.438952 #4028984] INFO -- : csv 3.3.0 I, [2024-05-07T00:35:29.441016 #4028984] INFO -- : installing bundled gem cache: /tmp/ruby/install/trunk/lib/ruby/gems/3.4.0+0/cache I, [2024-05-07T00:35:29.442493 #4028984] INFO -- : skipped bundled gems: I, [2024-05-07T00:35:29.442513 #4028984] INFO -- : power_assert-2.0.4dev.gem not found in bundled_gems I, [2024-05-07T00:35:29.445850 #4028984] INFO -- : $$$[end] "make install -j20" exit with 0. I, [2024-05-07T00:35:29.445964 #4028984] INFO -- : $$$[beg] make yes-btest TESTOPTS='-q -j20' I, [2024-05-07T00:35:35.523890 #4028984] INFO -- : PASS all 1936 tests E, [2024-05-07T00:35:35.530086 #4028984] ERROR -- : I, [2024-05-07T00:35:35.530349 #4028984] INFO -- : $$$[end] "make yes-btest TESTOPTS='-q -j20'" exit with 0. I, [2024-05-07T00:35:35.530441 #4028984] INFO -- : $$$[beg] make yes-test-basic TESTS='-j20' I, [2024-05-07T00:35:35.591102 #4028984] INFO -- : BASERUBY = /usr/bin/ruby --disable=gems I, [2024-05-07T00:35:35.591132 #4028984] INFO -- : CC = gcc I, [2024-05-07T00:35:35.591138 #4028984] INFO -- : LD = ld I, [2024-05-07T00:35:35.591142 #4028984] INFO -- : LDSHARED = gcc -shared I, [2024-05-07T00:35:35.591147 #4028984] INFO -- : CFLAGS = -O3 -fno-fast-math -ggdb3 -Wall -Wextra -Wdeprecated-declarations -Wdiv-by-zero -Wduplicated-cond -Wimplicit-function-declaration -Wimplicit-int -Wpointer-arith -Wwrite-strings -Wold-style-definition -Wimplicit-fallthrough=0 -Wmissing-noreturn -Wno-cast-function-type -Wno-constant-logical-operand -Wno-long-long -Wno-missing-field-initializers -Wno-overlength-strings -Wno-packed-bitfield-compat -Wno-parentheses-equality -Wno-self-assign -Wno-tautological-compare -Wno-unused-parameter -Wno-unused-value -Wsuggest-attribute=format -Wsuggest-attribute=noreturn -Wunused-variable -Wmisleading-indentation -Wundef -fPIC I, [2024-05-07T00:35:35.591151 #4028984] INFO -- : XCFLAGS = -U_FORTIFY_SOURCE -D_FORTIFY_SOURCE=2 -fstack-protector-strong -fno-strict-overflow -fvisibility=hidden -fexcess-precision=standard -DRUBY_EXPORT -I. -I.ext/include/x86_64-linux -I/tmp/ruby/src/trunk/include -I/tmp/ruby/src/trunk -I/tmp/ruby/src/trunk/prism -I/tmp/ruby/src/trunk/enc/unicode/15.0.0 I, [2024-05-07T00:35:35.591155 #4028984] INFO -- : CPPFLAGS = I, [2024-05-07T00:35:35.591159 #4028984] INFO -- : DLDFLAGS = -Wl,--compress-debug-sections=zlib -Wl,-soname,libruby.so.3.4 -fstack-protector-strong I, [2024-05-07T00:35:35.591162 #4028984] INFO -- : SOLIBS = -lz -lrt -lrt -lgmp -ldl -lcrypt -lm -lpthread I, [2024-05-07T00:35:35.591166 #4028984] INFO -- : LANG = en_US.UTF-8 I, [2024-05-07T00:35:35.591181 #4028984] INFO -- : LC_ALL = I, [2024-05-07T00:35:35.591185 #4028984] INFO -- : LC_CTYPE = I, [2024-05-07T00:35:35.591188 #4028984] INFO -- : MFLAGS = I, [2024-05-07T00:35:35.591193 #4028984] INFO -- : RUSTC = no I, [2024-05-07T00:35:35.591196 #4028984] INFO -- : YJIT_RUSTC_ARGS = --crate-name=yjit --crate-type=staticlib --edition=2021 -g -C lto=thin -C opt-level=3 -C overflow-checks=on '--out-dir=/tmp/ruby/build/trunk/yjit/target/release/' /tmp/ruby/src/trunk/yjit/src/lib.rs I, [2024-05-07T00:35:35.591671 #4028984] INFO -- : gcc (Ubuntu 11.4.0-1ubuntu1~22.04) 11.4.0 I, [2024-05-07T00:35:35.591675 #4028984] INFO -- : Copyright (C) 2021 Free Software Foundation, Inc. I, [2024-05-07T00:35:35.591679 #4028984] INFO -- : This is free software; see the source for copying conditions. There is NO I, [2024-05-07T00:35:35.591682 #4028984] INFO -- : warranty; not even for MERCHANTABILITY or FITNESS FOR A PARTICULAR PURPOSE. I, [2024-05-07T00:35:35.591687 #4028984] INFO -- : I, [2024-05-07T00:35:35.697037 #4028984] INFO -- : Checking leaked global symbols...none I, [2024-05-07T00:35:35.739247 #4028984] INFO -- : /tmp/ruby/src/trunk/basictest/test.rb:assignment ....................................................................................................................................................................................................................................................................................................................................................................................OK 372 I, [2024-05-07T00:35:35.739317 #4028984] INFO -- : /tmp/ruby/src/trunk/basictest/test.rb:condition ..OK 2 I, [2024-05-07T00:35:35.739326 #4028984] INFO -- : /tmp/ruby/src/trunk/basictest/test.rb:if/unless ...OK 3 I, [2024-05-07T00:35:35.739342 #4028984] INFO -- : /tmp/ruby/src/trunk/basictest/test.rb:case .....OK 5 I, [2024-05-07T00:35:35.739551 #4028984] INFO -- : /tmp/ruby/src/trunk/basictest/test.rb:while/until ........OK 8 I, [2024-05-07T00:35:35.739626 #4028984] INFO -- : /tmp/ruby/src/trunk/basictest/test.rb:exception ..........OK 10 I, [2024-05-07T00:35:35.739960 #4028984] INFO -- : /tmp/ruby/src/trunk/basictest/test.rb:array .......................................OK 39 I, [2024-05-07T00:35:35.740105 #4028984] INFO -- : /tmp/ruby/src/trunk/basictest/test.rb:hash ...........................OK 27 I, [2024-05-07T00:35:35.741009 #4028984] INFO -- : /tmp/ruby/src/trunk/basictest/test.rb:iterator ...........................................................................................................OK 107 I, [2024-05-07T00:35:35.741406 #4028984] INFO -- : /tmp/ruby/src/trunk/basictest/test.rb:float ................................................................................OK 80 I, [2024-05-07T00:35:35.742469 #4028984] INFO -- : /tmp/ruby/src/trunk/basictest/test.rb:bignum ...............................OK 31 I, [2024-05-07T00:35:35.743334 #4028984] INFO -- : /tmp/ruby/src/trunk/basictest/test.rb:string & char ..............................................................OK 62 I, [2024-05-07T00:35:35.743381 #4028984] INFO -- : /tmp/ruby/src/trunk/basictest/test.rb:assignment ..........OK 10 I, [2024-05-07T00:35:35.743422 #4028984] INFO -- : /tmp/ruby/src/trunk/basictest/test.rb:call ......OK 6 I, [2024-05-07T00:35:35.743492 #4028984] INFO -- : /tmp/ruby/src/trunk/basictest/test.rb:proc .........OK 9 I, [2024-05-07T00:35:35.843735 #4028984] INFO -- : /tmp/ruby/src/trunk/basictest/test.rb:signal ..OK 2 I, [2024-05-07T00:35:35.844348 #4028984] INFO -- : /tmp/ruby/src/trunk/basictest/test.rb:eval ...........................OK 27 I, [2024-05-07T00:35:35.947897 #4028984] INFO -- : /tmp/ruby/src/trunk/basictest/test.rb:system ........OK 8 I, [2024-05-07T00:35:35.947956 #4028984] INFO -- : /tmp/ruby/src/trunk/basictest/test.rb:const .....OK 5 I, [2024-05-07T00:35:35.947983 #4028984] INFO -- : /tmp/ruby/src/trunk/basictest/test.rb:clone .....OK 5 I, [2024-05-07T00:35:35.948111 #4028984] INFO -- : /tmp/ruby/src/trunk/basictest/test.rb:marshal ....OK 4 I, [2024-05-07T00:35:35.948204 #4028984] INFO -- : /tmp/ruby/src/trunk/basictest/test.rb:pack ....OK 4 I, [2024-05-07T00:35:35.948226 #4028984] INFO -- : /tmp/ruby/src/trunk/basictest/test.rb:math ..OK 2 I, [2024-05-07T00:35:35.948285 #4028984] INFO -- : /tmp/ruby/src/trunk/basictest/test.rb:struct ......OK 6 I, [2024-05-07T00:35:35.948389 #4028984] INFO -- : /tmp/ruby/src/trunk/basictest/test.rb:variable ............OK 12 I, [2024-05-07T00:35:35.948418 #4028984] INFO -- : /tmp/ruby/src/trunk/basictest/test.rb:trace ...OK 3 I, [2024-05-07T00:35:35.948488 #4028984] INFO -- : /tmp/ruby/src/trunk/basictest/test.rb:defined? ............OK 12 I, [2024-05-07T00:35:35.948544 #4028984] INFO -- : /tmp/ruby/src/trunk/basictest/test.rb:alias ......OK 6 I, [2024-05-07T00:35:35.948881 #4028984] INFO -- : /tmp/ruby/src/trunk/basictest/test.rb:path .......................OK 23 I, [2024-05-07T00:35:35.982305 #4028984] INFO -- : /tmp/ruby/src/trunk/basictest/test.rb:gc ....OK 4 I, [2024-05-07T00:35:35.984782 #4028984] INFO -- : I, [2024-05-07T00:35:35.984812 #4028984] INFO -- : test succeeded I, [2024-05-07T00:35:35.986444 #4028984] INFO -- : $$$[end] "make yes-test-basic TESTS='-j20'" exit with 0. I, [2024-05-07T00:35:35.986526 #4028984] INFO -- : $$$[beg] make yes-test-all TESTOPTS='--stderr-on-failure' TESTS='-j20' I, [2024-05-07T00:35:36.072255 #4028984] INFO -- : BASERUBY = /usr/bin/ruby --disable=gems I, [2024-05-07T00:35:36.072310 #4028984] INFO -- : CC = gcc I, [2024-05-07T00:35:36.072323 #4028984] INFO -- : LD = ld I, [2024-05-07T00:35:36.072335 #4028984] INFO -- : LDSHARED = gcc -shared I, [2024-05-07T00:35:36.072346 #4028984] INFO -- : CFLAGS = -O3 -fno-fast-math -ggdb3 -Wall -Wextra -Wdeprecated-declarations -Wdiv-by-zero -Wduplicated-cond -Wimplicit-function-declaration -Wimplicit-int -Wpointer-arith -Wwrite-strings -Wold-style-definition -Wimplicit-fallthrough=0 -Wmissing-noreturn -Wno-cast-function-type -Wno-constant-logical-operand -Wno-long-long -Wno-missing-field-initializers -Wno-overlength-strings -Wno-packed-bitfield-compat -Wno-parentheses-equality -Wno-self-assign -Wno-tautological-compare -Wno-unused-parameter -Wno-unused-value -Wsuggest-attribute=format -Wsuggest-attribute=noreturn -Wunused-variable -Wmisleading-indentation -Wundef -fPIC I, [2024-05-07T00:35:36.072370 #4028984] INFO -- : XCFLAGS = -U_FORTIFY_SOURCE -D_FORTIFY_SOURCE=2 -fstack-protector-strong -fno-strict-overflow -fvisibility=hidden -fexcess-precision=standard -DRUBY_EXPORT -I. -I.ext/include/x86_64-linux -I/tmp/ruby/src/trunk/include -I/tmp/ruby/src/trunk -I/tmp/ruby/src/trunk/prism -I/tmp/ruby/src/trunk/enc/unicode/15.0.0 I, [2024-05-07T00:35:36.072381 #4028984] INFO -- : CPPFLAGS = I, [2024-05-07T00:35:36.072391 #4028984] INFO -- : DLDFLAGS = -Wl,--compress-debug-sections=zlib -Wl,-soname,libruby.so.3.4 -fstack-protector-strong I, [2024-05-07T00:35:36.072402 #4028984] INFO -- : SOLIBS = -lz -lrt -lrt -lgmp -ldl -lcrypt -lm -lpthread I, [2024-05-07T00:35:36.072411 #4028984] INFO -- : LANG = en_US.UTF-8 I, [2024-05-07T00:35:36.072421 #4028984] INFO -- : LC_ALL = I, [2024-05-07T00:35:36.072431 #4028984] INFO -- : LC_CTYPE = I, [2024-05-07T00:35:36.072440 #4028984] INFO -- : MFLAGS = I, [2024-05-07T00:35:36.072450 #4028984] INFO -- : RUSTC = no I, [2024-05-07T00:35:36.072462 #4028984] INFO -- : YJIT_RUSTC_ARGS = --crate-name=yjit --crate-type=staticlib --edition=2021 -g -C lto=thin -C opt-level=3 -C overflow-checks=on '--out-dir=/tmp/ruby/build/trunk/yjit/target/release/' /tmp/ruby/src/trunk/yjit/src/lib.rs I, [2024-05-07T00:35:36.072863 #4028984] INFO -- : gcc (Ubuntu 11.4.0-1ubuntu1~22.04) 11.4.0 I, [2024-05-07T00:35:36.072915 #4028984] INFO -- : Copyright (C) 2021 Free Software Foundation, Inc. I, [2024-05-07T00:35:36.072929 #4028984] INFO -- : This is free software; see the source for copying conditions. There is NO I, [2024-05-07T00:35:36.072941 #4028984] INFO -- : warranty; not even for MERCHANTABILITY or FITNESS FOR A PARTICULAR PURPOSE. I, [2024-05-07T00:35:36.072951 #4028984] INFO -- : I, [2024-05-07T00:35:36.074682 #4028984] INFO -- : generating enc.mk I, [2024-05-07T00:35:36.193303 #4028984] INFO -- : making enc I, [2024-05-07T00:35:36.210527 #4028984] INFO -- : make[1]: Entering directory '/tmp/ruby/build/trunk' I, [2024-05-07T00:35:36.210591 #4028984] INFO -- : make[1]: Nothing to be done for 'enc'. I, [2024-05-07T00:35:36.210605 #4028984] INFO -- : make[1]: Leaving directory '/tmp/ruby/build/trunk' I, [2024-05-07T00:35:36.211232 #4028984] INFO -- : making srcs under enc I, [2024-05-07T00:35:36.240794 #4028984] INFO -- : make[1]: Entering directory '/tmp/ruby/build/trunk' I, [2024-05-07T00:35:36.240856 #4028984] INFO -- : make[1]: Nothing to be done for 'srcs'. I, [2024-05-07T00:35:36.240870 #4028984] INFO -- : make[1]: Leaving directory '/tmp/ruby/build/trunk' I, [2024-05-07T00:35:36.241671 #4028984] INFO -- : generating transdb.h I, [2024-05-07T00:35:36.336398 #4028984] INFO -- : transdb.h unchanged I, [2024-05-07T00:35:36.337612 #4028984] INFO -- : making trans I, [2024-05-07T00:35:36.372054 #4028984] INFO -- : make[1]: Entering directory '/tmp/ruby/build/trunk' I, [2024-05-07T00:35:36.372147 #4028984] INFO -- : make[1]: Nothing to be done for 'trans'. I, [2024-05-07T00:35:36.372175 #4028984] INFO -- : make[1]: Leaving directory '/tmp/ruby/build/trunk' I, [2024-05-07T00:35:36.372730 #4028984] INFO -- : making encs I, [2024-05-07T00:35:36.410746 #4028984] INFO -- : make[1]: Entering directory '/tmp/ruby/build/trunk' I, [2024-05-07T00:35:36.410776 #4028984] INFO -- : make[1]: Nothing to be done for 'encs'. I, [2024-05-07T00:35:36.410790 #4028984] INFO -- : make[1]: Leaving directory '/tmp/ruby/build/trunk' I, [2024-05-07T00:35:36.412664 #4028984] INFO -- : generating makefiles ext/configure-ext.mk I, [2024-05-07T00:35:36.440591 #4028984] INFO -- : ext/configure-ext.mk updated I, [2024-05-07T00:35:36.442973 #4028984] INFO -- : make[1]: Entering directory '/tmp/ruby/build/trunk' I, [2024-05-07T00:35:37.805902 #4028984] INFO -- : make[1]: Leaving directory '/tmp/ruby/build/trunk' I, [2024-05-07T00:35:37.806508 #4028984] INFO -- : generating makefile exts.mk I, [2024-05-07T00:35:37.842874 #4028984] INFO -- : exts.mk unchanged I, [2024-05-07T00:35:37.847225 #4028984] INFO -- : make[1]: Entering directory '/tmp/ruby/build/trunk' I, [2024-05-07T00:35:38.057384 #4028984] INFO -- : make[2]: Entering directory '/tmp/ruby/build/trunk/ext/coverage' I, [2024-05-07T00:35:38.060289 #4028984] INFO -- : make[2]: Leaving directory '/tmp/ruby/build/trunk/ext/coverage' I, [2024-05-07T00:35:38.064020 #4028984] INFO -- : make[2]: Entering directory '/tmp/ruby/build/trunk/ext/date' I, [2024-05-07T00:35:38.067056 #4028984] INFO -- : make[2]: Leaving directory '/tmp/ruby/build/trunk/ext/date' I, [2024-05-07T00:35:38.069271 #4028984] INFO -- : make[2]: Entering directory '/tmp/ruby/build/trunk/ext/digest' I, [2024-05-07T00:35:38.074688 #4028984] INFO -- : make[2]: Leaving directory '/tmp/ruby/build/trunk/ext/digest' I, [2024-05-07T00:35:38.090437 #4028984] INFO -- : make[2]: Entering directory '/tmp/ruby/build/trunk/ext/digest/sha2' I, [2024-05-07T00:35:38.093604 #4028984] INFO -- : make[2]: Leaving directory '/tmp/ruby/build/trunk/ext/digest/sha2' I, [2024-05-07T00:35:38.106337 #4028984] INFO -- : make[2]: Entering directory '/tmp/ruby/build/trunk/ext/fiddle' I, [2024-05-07T00:35:38.112751 #4028984] INFO -- : make[2]: Leaving directory '/tmp/ruby/build/trunk/ext/fiddle' I, [2024-05-07T00:35:38.115785 #4028984] INFO -- : make[2]: Entering directory '/tmp/ruby/build/trunk/ext/io/console' I, [2024-05-07T00:35:38.118292 #4028984] INFO -- : make[2]: Leaving directory '/tmp/ruby/build/trunk/ext/io/console' I, [2024-05-07T00:35:38.125800 #4028984] INFO -- : make[2]: Entering directory '/tmp/ruby/build/trunk/ext/json' I, [2024-05-07T00:35:38.132086 #4028984] INFO -- : make[2]: Leaving directory '/tmp/ruby/build/trunk/ext/json' I, [2024-05-07T00:35:38.141068 #4028984] INFO -- : make[2]: Entering directory '/tmp/ruby/build/trunk/ext/monitor' I, [2024-05-07T00:35:38.143523 #4028984] INFO -- : make[2]: Leaving directory '/tmp/ruby/build/trunk/ext/monitor' I, [2024-05-07T00:35:38.147674 #4028984] INFO -- : make[2]: Entering directory '/tmp/ruby/build/trunk/ext/objspace' I, [2024-05-07T00:35:38.151393 #4028984] INFO -- : make[2]: Leaving directory '/tmp/ruby/build/trunk/ext/objspace' I, [2024-05-07T00:35:38.163209 #4028984] INFO -- : make[2]: Entering directory '/tmp/ruby/build/trunk/ext/openssl' I, [2024-05-07T00:35:38.176343 #4028984] INFO -- : make[2]: Leaving directory '/tmp/ruby/build/trunk/ext/openssl' I, [2024-05-07T00:35:38.179249 #4028984] INFO -- : make[2]: Entering directory '/tmp/ruby/build/trunk/ext/pathname' I, [2024-05-07T00:35:38.181750 #4028984] INFO -- : make[2]: Leaving directory '/tmp/ruby/build/trunk/ext/pathname' I, [2024-05-07T00:35:38.186005 #4028984] INFO -- : make[2]: Entering directory '/tmp/ruby/build/trunk/ext/psych' I, [2024-05-07T00:35:38.200874 #4028984] INFO -- : make[2]: Leaving directory '/tmp/ruby/build/trunk/ext/psych' I, [2024-05-07T00:35:38.203895 #4028984] INFO -- : make[2]: Entering directory '/tmp/ruby/build/trunk/ext/pty' I, [2024-05-07T00:35:38.206417 #4028984] INFO -- : make[2]: Leaving directory '/tmp/ruby/build/trunk/ext/pty' I, [2024-05-07T00:35:38.215883 #4028984] INFO -- : make[2]: Entering directory '/tmp/ruby/build/trunk/ext/ripper' I, [2024-05-07T00:35:38.220815 #4028984] INFO -- : make[2]: Leaving directory '/tmp/ruby/build/trunk/ext/ripper' I, [2024-05-07T00:35:38.222314 #4028984] INFO -- : make[2]: Entering directory '/tmp/ruby/build/trunk/ext/rubyvm' I, [2024-05-07T00:35:38.224317 #4028984] INFO -- : make[2]: Leaving directory '/tmp/ruby/build/trunk/ext/rubyvm' I, [2024-05-07T00:35:38.232152 #4028984] INFO -- : make[2]: Entering directory '/tmp/ruby/build/trunk/ext/socket' I, [2024-05-07T00:35:38.238449 #4028984] INFO -- : make[2]: Leaving directory '/tmp/ruby/build/trunk/ext/socket' I, [2024-05-07T00:35:38.249126 #4028984] INFO -- : make[2]: Entering directory '/tmp/ruby/build/trunk/.bundle/gems/bigdecimal-3.1.7/ext/bigdecimal' I, [2024-05-07T00:35:38.271685 #4028984] INFO -- : make[2]: Leaving directory '/tmp/ruby/build/trunk/.bundle/gems/bigdecimal-3.1.7/ext/bigdecimal' I, [2024-05-07T00:35:38.273568 #4028984] INFO -- : make[2]: Entering directory '/tmp/ruby/build/trunk/.bundle/gems/debug-1.9.2/ext/debug' I, [2024-05-07T00:35:38.296113 #4028984] INFO -- : make[2]: Leaving directory '/tmp/ruby/build/trunk/.bundle/gems/debug-1.9.2/ext/debug' I, [2024-05-07T00:35:38.297954 #4028984] INFO -- : make[2]: Entering directory '/tmp/ruby/build/trunk/.bundle/gems/nkf-0.2.0/ext/nkf' I, [2024-05-07T00:35:38.320015 #4028984] INFO -- : make[2]: Leaving directory '/tmp/ruby/build/trunk/.bundle/gems/nkf-0.2.0/ext/nkf' I, [2024-05-07T00:35:38.321940 #4028984] INFO -- : make[2]: Entering directory '/tmp/ruby/build/trunk/.bundle/gems/racc-1.7.3/ext/racc/cparse' I, [2024-05-07T00:35:38.343888 #4028984] INFO -- : make[2]: Leaving directory '/tmp/ruby/build/trunk/.bundle/gems/racc-1.7.3/ext/racc/cparse' I, [2024-05-07T00:35:38.346175 #4028984] INFO -- : make[2]: Entering directory '/tmp/ruby/build/trunk/.bundle/gems/rbs-3.4.4/ext/rbs_extension' I, [2024-05-07T00:35:38.368000 #4028984] INFO -- : make[2]: Leaving directory '/tmp/ruby/build/trunk/.bundle/gems/rbs-3.4.4/ext/rbs_extension' I, [2024-05-07T00:35:38.369919 #4028984] INFO -- : make[2]: Entering directory '/tmp/ruby/build/trunk/.bundle/gems/syslog-0.1.2/ext/syslog' I, [2024-05-07T00:35:38.391637 #4028984] INFO -- : make[2]: Leaving directory '/tmp/ruby/build/trunk/.bundle/gems/syslog-0.1.2/ext/syslog' I, [2024-05-07T00:35:38.414916 #4028984] INFO -- : make[2]: Entering directory '/tmp/ruby/build/trunk' I, [2024-05-07T00:35:38.478338 #4028984] INFO -- : make[2]: 'ruby' is up to date. I, [2024-05-07T00:35:38.478380 #4028984] INFO -- : make[2]: Leaving directory '/tmp/ruby/build/trunk' I, [2024-05-07T00:35:38.478640 #4028984] INFO -- : make[1]: Leaving directory '/tmp/ruby/build/trunk' I, [2024-05-07T00:35:38.482297 #4028984] INFO -- : make[1]: Entering directory '/tmp/ruby/build/trunk' I, [2024-05-07T00:35:38.482319 #4028984] INFO -- : make[1]: Nothing to be done for 'note'. I, [2024-05-07T00:35:38.482326 #4028984] INFO -- : make[1]: Leaving directory '/tmp/ruby/build/trunk' I, [2024-05-07T00:35:38.560585 #4028984] INFO -- : Run options: I, [2024-05-07T00:35:38.560626 #4028984] INFO -- : --seed=30142 I, [2024-05-07T00:35:38.560633 #4028984] INFO -- : "--ruby=./miniruby -I/tmp/ruby/src/trunk/lib -I. -I.ext/common /tmp/ruby/src/trunk/tool/runruby.rb --extout=.ext -- --disable-gems" I, [2024-05-07T00:35:38.560637 #4028984] INFO -- : --excludes-dir=/tmp/ruby/src/trunk/test/.excludes I, [2024-05-07T00:35:38.560641 #4028984] INFO -- : --name=!/memory_leak/ I, [2024-05-07T00:35:38.560645 #4028984] INFO -- : --stderr-on-failure I, [2024-05-07T00:35:38.560648 #4028984] INFO -- : -j20 I, [2024-05-07T00:35:38.560652 #4028984] INFO -- : I, [2024-05-07T00:35:38.560655 #4028984] INFO -- : # Running tests: I, [2024-05-07T00:35:38.560659 #4028984] INFO -- : I, [2024-05-07T00:35:38.707586 #4028984] INFO -- : [ 1/885] 4070360=test_interned_str I, [2024-05-07T00:35:38.707777 #4028984] INFO -- : [ 2/885] 4070343=test_case_comprehensive I, [2024-05-07T00:35:38.708030 #4028984] INFO -- : [ 3/885] 4070346=test_gem_commands_build_command I, [2024-05-07T00:35:38.708244 #4028984] INFO -- : [ 4/885] 4070344=test_append I, [2024-05-07T00:35:38.711259 #4028984] INFO -- : [ 5/885] 4070345=test_option I, [2024-05-07T00:35:38.711599 #4028984] INFO -- : [ 6/885] 4070357=test_cmethod I, [2024-05-07T00:35:38.712323 #4028984] INFO -- : [ 7/885] 4070358=test_tracer I, [2024-05-07T00:35:38.714148 #4028984] INFO -- : [ 8/885] 4070359=test_io_m17n I, [2024-05-07T00:35:38.714397 #4028984] INFO -- : [ 9/885] 4070357=test_variable_name_check I, [2024-05-07T00:35:38.723837 #4028984] INFO -- : [ 10/885] 4070344=test_did_you_mean I, [2024-05-07T00:35:38.725055 #4028984] INFO -- : [ 11/885] 4070356=test_gem_commands_server_command I, [2024-05-07T00:35:38.728475 #4028984] INFO -- : [ 12/885] 4070360=test_exception_at_throwing I, [2024-05-07T00:35:38.738844 #4028984] INFO -- : [ 13/885] 4070362=test_iseq I, [2024-05-07T00:35:38.742366 #4028984] INFO -- : [ 14/885] 4070354=test_rdoc_markup_heading I, [2024-05-07T00:35:38.742438 #4028984] INFO -- : [ 15/885] 4070355=test_scheduler I, [2024-05-07T00:35:38.742507 #4028984] INFO -- : [ 16/885] 4070348=test_ocsp I, [2024-05-07T00:35:38.742583 #4028984] INFO -- : [ 17/885] 4070349=test_class I, [2024-05-07T00:35:38.742659 #4028984] INFO -- : [ 18/885] 4070350=test_pkey_dsa I, [2024-05-07T00:35:38.742748 #4028984] INFO -- : [ 19/885] 4070351=test_files_lib I, [2024-05-07T00:35:38.742831 #4028984] INFO -- : [ 20/885] 4070352=test_gem_commands_unpack_command I, [2024-05-07T00:35:38.744664 #4028984] INFO -- : [ 21/885] 4070353=test_beginendblock I, [2024-05-07T00:35:38.745625 #4028984] INFO -- : [ 22/885] 4070347=test_help I, [2024-05-07T00:35:38.755469 #4028984] INFO -- : [ 23/885] 4070357=test_rdoc_markup_to_bs I, [2024-05-07T00:35:38.767063 #4028984] INFO -- : [ 24/885] 4070361=test_emoji_breaks I, [2024-05-07T00:35:38.771326 #4028984] INFO -- : [ 25/885] 4070361=test_gem_bundler_version_finder I, [2024-05-07T00:35:38.776958 #4028984] INFO -- : [ 26/885] 4070347=test_within_pipe I, [2024-05-07T00:35:38.801062 #4028984] INFO -- : [ 27/885] 4070360=reflection_test I, [2024-05-07T00:35:38.802141 #4028984] INFO -- : [ 28/885] 4070349=test_pinned I, [2024-05-07T00:35:38.802608 #4028984] INFO -- : [ 29/885] 4070358=test_rdoc_markup_pre_process I, [2024-05-07T00:35:38.831912 #4028984] INFO -- : [ 30/885] 4070349=test_printf I, [2024-05-07T00:35:38.844481 #4028984] INFO -- : [ 31/885] 4070347=test_to_ary_concat I, [2024-05-07T00:35:38.850057 #4028984] INFO -- : [ 32/885] 4070349=test_time I, [2024-05-07T00:35:38.864643 #4028984] INFO -- : [ 33/885] 4070345=test_webauthn_listener_response I, [2024-05-07T00:35:38.869017 #4028984] INFO -- : [ 34/885] 4070360=test_stream I, [2024-05-07T00:35:38.884048 #4028984] INFO -- : [ 35/885] 4070344=test_recursion I, [2024-05-07T00:35:38.889414 #4028984] INFO -- : [ 36/885] 4070344=test_exit I, [2024-05-07T00:35:38.892975 #4028984] INFO -- : [ 37/885] 4070360=test_delegate I, [2024-05-07T00:35:38.894786 #4028984] INFO -- : [ 38/885] 4070354=test_popen_deadlock I, [2024-05-07T00:35:38.909074 #4028984] INFO -- : [ 39/885] 4070360=test_history I, [2024-05-07T00:35:38.924866 #4028984] INFO -- : [ 40/885] 4070356=test_mkmf I, [2024-05-07T00:35:38.933022 #4028984] INFO -- : [ 41/885] 4070355=test_date_marshal I, [2024-05-07T00:35:38.940963 #4028984] INFO -- : [ 42/885] 4070355=test_multi_irb_commands I, [2024-05-07T00:35:38.949416 #4028984] INFO -- : [ 43/885] 4070357=test_fiber I, [2024-05-07T00:35:38.949718 #4028984] INFO -- : [ 44/885] 4070355=test_open3 I, [2024-05-07T00:35:38.955945 #4028984] INFO -- : [ 45/885] 4070361=test_bundled_ca I, [2024-05-07T00:35:38.973217 #4028984] INFO -- : [ 46/885] 4070356=test_closure I, [2024-05-07T00:35:38.979683 #4028984] INFO -- : [ 47/885] 4070358=test_digest I, [2024-05-07T00:35:39.023120 #4028984] INFO -- : [ 48/885] 4070358=test_ractor I, [2024-05-07T00:35:39.036441 #4028984] INFO -- : [ 49/885] 4070349=test_rdoc_servlet I, [2024-05-07T00:35:39.046007 #4028984] INFO -- : [ 50/885] 4070345=test_gem_security I, [2024-05-07T00:35:39.050690 #4028984] INFO -- : [ 51/885] 4070360=test_rbconfig I, [2024-05-07T00:35:39.053304 #4028984] INFO -- : [ 52/885] 4070360=test_primitive I, [2024-05-07T00:35:39.061164 #4028984] INFO -- : [ 53/885] 4070360=test_human_typo I, [2024-05-07T00:35:39.069560 #4028984] INFO -- : [ 54/885] 4070347=test_chilled I, [2024-05-07T00:35:39.071227 #4028984] INFO -- : [ 55/885] 4070360=test_name_error_extension I, [2024-05-07T00:35:39.071608 #4028984] INFO -- : [ 56/885] 4070347=test_rdoc_i18n_locale I, [2024-05-07T00:35:39.097411 #4028984] INFO -- : [ 57/885] 4070360=test_document I, [2024-05-07T00:35:39.098720 #4028984] INFO -- : [ 58/885] 4070360=test_acceptable I, [2024-05-07T00:35:39.103362 #4028984] INFO -- : [ 59/885] 4070358=test_rdoc_generator_pot_po_entry I, [2024-05-07T00:35:39.117663 #4028984] INFO -- : [ 60/885] 4070358=test_euc_jp I, [2024-05-07T00:35:39.128466 #4028984] INFO -- : [ 61/885] 4070358=test_pair I, [2024-05-07T00:35:39.130710 #4028984] INFO -- : [ 62/885] 4070348=test_gem_commands_yank_command I, [2024-05-07T00:35:39.137563 #4028984] INFO -- : [ 63/885] 4070346=test_win32ole_param I, [2024-05-07T00:35:39.142497 #4028984] INFO -- : [ 64/885] 4070346=test_sockopt I, [2024-05-07T00:35:39.159283 #4028984] INFO -- : [ 65/885] 4070353=test_install I, [2024-05-07T00:35:39.179687 #4028984] INFO -- : [ 66/885] 4070346=test_rdoc_markup_to_label I, [2024-05-07T00:35:39.184726 #4028984] INFO -- : [ 67/885] 4070344=test_gem_resolver_local_specification I, [2024-05-07T00:35:39.185720 #4028984] INFO -- : [ 68/885] 4070347=test_httpheader I, [2024-05-07T00:35:39.203152 #4028984] INFO -- : [ 69/885] 4070356=test_rdoc_ri_driver I, [2024-05-07T00:35:39.243731 #4028984] INFO -- : [ 70/885] 4070360=test_set_len I, [2024-05-07T00:35:39.255143 #4028984] INFO -- : [ 71/885] 4070360=test_httpresponses I, [2024-05-07T00:35:39.267905 #4028984] INFO -- : [ 72/885] 4070344=test_encoding I, [2024-05-07T00:35:39.288974 #4028984] INFO -- : [ 73/885] 4070347=test_key_stroke I, [2024-05-07T00:35:39.292002 #4028984] INFO -- : [ 74/885] 4070344=json_encoding_test I, [2024-05-07T00:35:39.294355 #4028984] INFO -- : [ 75/885] 4070347=test_color I, [2024-05-07T00:35:39.296752 #4028984] INFO -- : [ 76/885] 4070352=test_terminfo I, [2024-05-07T00:35:39.307834 #4028984] INFO -- : [ 77/885] 4070344=test_compile_prism I, [2024-05-07T00:35:39.311637 #4028984] INFO -- : [ 78/885] 4070360=test_bug-14834 I, [2024-05-07T00:35:39.319367 #4028984] INFO -- : [ 79/885] 4070346=test_date_compat I, [2024-05-07T00:35:39.320971 #4028984] INFO -- : [ 80/885] 4070346=test_rdoc_markup_to_html I, [2024-05-07T00:35:39.359693 #4028984] INFO -- : [ 81/885] 4070352=test_tree_spell_checker I, [2024-05-07T00:35:39.365690 #4028984] INFO -- : [ 82/885] 4070353=test_http I, [2024-05-07T00:35:39.377218 #4028984] INFO -- : [ 83/885] 4070347=test_addrinfo I, [2024-05-07T00:35:39.383664 #4028984] INFO -- : [ 84/885] 4070352=test_bn I, [2024-05-07T00:35:39.388667 #4028984] INFO -- : [ 85/885] 4070362=test_win32ole_param_event I, [2024-05-07T00:35:39.391197 #4028984] INFO -- : [ 86/885] 4070362=test_path I, [2024-05-07T00:35:39.393281 #4028984] INFO -- : [ 87/885] 4070347=redundant_return_test I, [2024-05-07T00:35:39.398377 #4028984] INFO -- : [ 88/885] 4070349=test_case_mapping I, [2024-05-07T00:35:39.398664 #4028984] INFO -- : [ 89/885] 4070362=test_rdoc_generator_pot I, [2024-05-07T00:35:39.399754 #4028984] INFO -- : [ 90/885] 4070352=test_enumerator I, [2024-05-07T00:35:39.401224 #4028984] INFO -- : [ 91/885] 4070360=test_rdoc_parser_changelog I, [2024-05-07T00:35:39.409740 #4028984] INFO -- : [ 92/885] 4070349=parameters_signature_test I, [2024-05-07T00:35:39.413224 #4028984] INFO -- : [ 93/885] 4070352=test_koi8 I, [2024-05-07T00:35:39.418217 #4028984] INFO -- : [ 94/885] 4070352=test_unicode I, [2024-05-07T00:35:39.425315 #4028984] INFO -- : [ 95/885] 4070352=test_rdoc_method_attr I, [2024-05-07T00:35:39.449340 #4028984] INFO -- : [ 96/885] 4070347=test_filter I, [2024-05-07T00:35:39.449946 #4028984] INFO -- : [ 97/885] 4070346=test_gem_gem_runner I, [2024-05-07T00:35:39.480090 #4028984] INFO -- : [ 98/885] 4070347=test_data I, [2024-05-07T00:35:39.480279 #4028984] INFO -- : [ 99/885] 4070349=static_literals_test I, [2024-05-07T00:35:39.483361 #4028984] INFO -- : [100/885] 4070349=test_gem_resolver_vendor_specification I, [2024-05-07T00:35:39.485064 #4028984] INFO -- : [101/885] 4070347=test_gem_commands_update_command I, [2024-05-07T00:35:39.502831 #4028984] INFO -- : [102/885] 4070346=test_gem_uri I, [2024-05-07T00:35:39.530048 #4028984] INFO -- : [103/885] 4070346=test_key_event_record I, [2024-05-07T00:35:39.554115 #4028984] INFO -- : [104/885] 4070362=test_notimplement I, [2024-05-07T00:35:39.557340 #4028984] INFO -- : [105/885] 4070362=test_random I, [2024-05-07T00:35:39.563599 #4028984] INFO -- : [106/885] 4070362=test_ssl_session I, [2024-05-07T00:35:39.580432 #4028984] INFO -- : [107/885] 4070356=test_lexer I, [2024-05-07T00:35:39.589717 #4028984] INFO -- : [108/885] 4070346=test_thread_cv I, [2024-05-07T00:35:39.592325 #4028984] INFO -- : [109/885] 4070356=test_gem_request_set I, [2024-05-07T00:35:39.631207 #4028984] INFO -- : [110/885] 4070354=test_module I, [2024-05-07T00:35:39.633679 #4028984] INFO -- : [111/885] 4070344=test_ssl I, [2024-05-07T00:35:39.642224 #4028984] INFO -- : [112/885] 4070349=test_gem_ext_cargo_builder I, [2024-05-07T00:35:39.656855 #4028984] INFO -- : [113/885] 4070349=constant_path_node_test I, [2024-05-07T00:35:39.658532 #4028984] INFO -- : [114/885] 4070360=test_parser I, [2024-05-07T00:35:39.665727 #4028984] INFO -- : [115/885] 4070349=test_method_name_check I, [2024-05-07T00:35:39.678581 #4028984] INFO -- : [116/885] 4070360=test_arith_seq_extract I, [2024-05-07T00:35:39.692536 #4028984] INFO -- : [117/885] 4070349=test_rdoc_generator_markup I, [2024-05-07T00:35:39.705975 #4028984] INFO -- : [118/885] 4070349=test_whileuntil I, [2024-05-07T00:35:39.721026 #4028984] INFO -- : [119/885] 4070349=test_monitor I, [2024-05-07T00:35:39.796342 #4028984] INFO -- : [120/885] 4070348=test_buffered_io I, [2024-05-07T00:35:39.801015 #4028984] INFO -- : [121/885] 4070352=test_configuration I, [2024-05-07T00:35:39.878970 #4028984] INFO -- : [122/885] 4070360=test_rubyvm I, [2024-05-07T00:35:39.884076 #4028984] INFO -- : [123/885] 4070360=test_stringify_symbols I, [2024-05-07T00:35:39.886190 #4028984] INFO -- : [124/885] 4070348=test_instrumentation_api I, [2024-05-07T00:35:39.889020 #4028984] INFO -- : [125/885] 4070360=integer_parse_test I, [2024-05-07T00:35:39.892138 #4028984] INFO -- : [126/885] 4070360=test_boolean I, [2024-05-07T00:35:39.898306 #4028984] INFO -- : [127/885] 4070360=test_gem_commands_outdated_command I, [2024-05-07T00:35:39.923879 #4028984] INFO -- : [128/885] 4070352=test_array I, [2024-05-07T00:35:39.958462 #4028984] INFO -- : [129/885] 4070349=test_helper_method I, [2024-05-07T00:35:39.973171 #4028984] INFO -- : [130/885] 4070356=test_gem_package_tar_writer I, [2024-05-07T00:35:40.035107 #4028984] INFO -- : [131/885] 4070356=test_gem_source I, [2024-05-07T00:35:40.067300 #4028984] INFO -- : [132/885] 4070349=test_scalar_scanner I, [2024-05-07T00:35:40.074391 #4028984] INFO -- : [133/885] 4070349=test_win32ole_method_event I, [2024-05-07T00:35:40.078282 #4028984] INFO -- : [134/885] 4070349=test_nesting_parser I, [2024-05-07T00:35:40.100384 #4028984] INFO -- : [135/885] 4070349=test_gem_dependency_list I, [2024-05-07T00:35:40.104589 #4028984] INFO -- : [136/885] 4070359=test_benchmark I, [2024-05-07T00:35:40.122098 #4028984] INFO -- : [137/885] 4070360=test_evaluation I, [2024-05-07T00:35:40.126986 #4028984] INFO -- : [138/885] 4070360=test_https I, [2024-05-07T00:35:40.150545 #4028984] INFO -- : [139/885] 4070349=test_gem_ext_builder I, [2024-05-07T00:35:40.224352 #4028984] INFO -- : [140/885] 4070346=test_rdoc_parser_simple I, [2024-05-07T00:35:40.243733 #4028984] INFO -- : [141/885] 4070346=test_load I, [2024-05-07T00:35:40.244436 #4028984] INFO -- : [142/885] 4070346=test_yamldbm I, [2024-05-07T00:35:40.256500 #4028984] INFO -- : [143/885] 4070346=test_gem_commands_rebuild_command I, [2024-05-07T00:35:40.274662 #4028984] INFO -- : [144/885] 4070356=test_abi I, [2024-05-07T00:35:40.319579 #4028984] INFO -- : [145/885] 4070346=test_provider I, [2024-05-07T00:35:40.424657 #4028984] INFO -- : [146/885] 4070356=test_gem_commands_cert_command I, [2024-05-07T00:35:40.469439 #4028984] INFO -- : [147/885] 4070360=test_completion I, [2024-05-07T00:35:40.579756 #4028984] INFO -- : [148/885] 4070362=test_len I, [2024-05-07T00:35:40.582314 #4028984] INFO -- : [149/885] 4070362=test_yield_block I, [2024-05-07T00:35:40.591396 #4028984] INFO -- : [150/885] 4070362=test_erb I, [2024-05-07T00:35:40.634401 #4028984] INFO -- : [151/885] 4070362=test_x509ext I, [2024-05-07T00:35:40.655597 #4028984] INFO -- : [152/885] 4070362=test_gem_source_installed I, [2024-05-07T00:35:40.658892 #4028984] INFO -- : [153/885] 4070346=test_assembler I, [2024-05-07T00:35:40.663253 #4028984] INFO -- : [154/885] 4070346=test_spell_checker I, [2024-05-07T00:35:40.687540 #4028984] INFO -- : [155/885] 4070346=attribute_write_test I, [2024-05-07T00:35:40.749300 #4028984] INFO -- : [156/885] 4070346=test_propertyputref I, [2024-05-07T00:35:40.759754 #4028984] INFO -- : [157/885] 4070346=test_rational2 I, [2024-05-07T00:35:40.765414 #4028984] INFO -- : [158/885] 4070346=test_rational I, [2024-05-07T00:35:40.789441 #4028984] INFO -- : [159/885] 4070346=test_dir_m17n I, [2024-05-07T00:35:40.852911 #4028984] INFO -- : [160/885] 4070362=test_gem_resolver_installer_set I, [2024-05-07T00:35:40.877089 #4028984] INFO -- : [161/885] 4070347=test_regex_casefold I, [2024-05-07T00:35:40.976823 #4028984] INFO -- : [162/885] 4070354=test_refinement I, [2024-05-07T00:35:40.978790 #4028984] INFO -- : [163/885] 4070350=test_gem_commands_signout_command I, [2024-05-07T00:35:41.013941 #4028984] INFO -- : [164/885] 4070362=test_gem_source_git I, [2024-05-07T00:35:41.032670 #4028984] INFO -- : [165/885] 4070355=test_float I, [2024-05-07T00:35:41.150781 #4028984] INFO -- : [166/885] 4070360=test_require I, [2024-05-07T00:35:41.167084 #4028984] INFO -- : [167/885] 4070350=test_cgi_cookie I, [2024-05-07T00:35:41.178577 #4028984] INFO -- : [168/885] 4070356=test_input_method I, [2024-05-07T00:35:41.182950 #4028984] INFO -- : [169/885] 4070350=test_windows_1252 I, [2024-05-07T00:35:41.193185 #4028984] INFO -- : [170/885] 4070350=test_process I, [2024-05-07T00:35:41.199402 #4028984] INFO -- : [171/885] 4070349=test_fixnum I, [2024-05-07T00:35:41.203704 #4028984] INFO -- : [172/885] 4070350=test_signal I, [2024-05-07T00:35:41.211280 #4028984] INFO -- : [173/885] 4070349=test_x509crl I, [2024-05-07T00:35:41.259569 #4028984] INFO -- : [174/885] 4070359=test_rdoc_rd I, [2024-05-07T00:35:41.275850 #4028984] INFO -- : [175/885] 4070356=test_cgi_session I, [2024-05-07T00:35:41.288536 #4028984] INFO -- : [176/885] 4070356=test_rdoc_top_level I, [2024-05-07T00:35:41.348023 #4028984] INFO -- : [177/885] 4070349=test_metaclass I, [2024-05-07T00:35:41.363524 #4028984] INFO -- : [178/885] 4070349=test_shellwords I, [2024-05-07T00:35:41.366156 #4028984] INFO -- : [179/885] 4070349=test_debug I, [2024-05-07T00:35:41.371116 #4028984] INFO -- : [180/885] 4070349=pattern_test I, [2024-05-07T00:35:41.372636 #4028984] INFO -- : [181/885] 4070359=test_memory_view I, [2024-05-07T00:35:41.391171 #4028984] INFO -- : [182/885] 4070349=test_iterator I, [2024-05-07T00:35:41.402740 #4028984] INFO -- : [183/885] 4070359=test_string I, [2024-05-07T00:35:41.403688 #4028984] INFO -- : [184/885] 4070359=test_omap I, [2024-05-07T00:35:41.430977 #4028984] INFO -- : [185/885] 4070359=test_digest_extend I, [2024-05-07T00:35:41.443995 #4028984] INFO -- : [186/885] 4070359=test_gem_resolver_git_set I, [2024-05-07T00:35:41.471811 #4028984] INFO -- : [187/885] 4070356=test_storage I, [2024-05-07T00:35:41.474109 #4028984] INFO -- : [188/885] 4070356=test_cipher I, [2024-05-07T00:35:41.479877 #4028984] INFO -- : [189/885] 4070349=test_gem_security_signer I, [2024-05-07T00:35:41.482645 #4028984] INFO -- : [190/885] 4070347=test_new I, [2024-05-07T00:35:41.486852 #4028984] INFO -- : [191/885] 4070347=test_config I, [2024-05-07T00:35:41.498468 #4028984] INFO -- : [192/885] 4070362=json_parser_test I, [2024-05-07T00:35:41.516957 #4028984] INFO -- : [193/885] 4070356=test_nomethod_error I, [2024-05-07T00:35:41.519747 #4028984] INFO -- : [194/885] 4070347=memsize_test I, [2024-05-07T00:35:41.521003 #4028984] INFO -- : [195/885] 4070356=test_gem_source_subpath_problem I, [2024-05-07T00:35:41.521273 #4028984] INFO -- : [196/885] 4070347=test_dln I, [2024-05-07T00:35:41.525227 #4028984] INFO -- : [197/885] 4070347=json_common_interface_test I, [2024-05-07T00:35:41.532230 #4028984] INFO -- : [198/885] 4070347=test_win32ole_variant_outarg I, [2024-05-07T00:35:41.540635 #4028984] INFO -- : [199/885] 4070347=fuzzer_test I, [2024-05-07T00:35:41.545652 #4028984] INFO -- : [200/885] 4070347=test_sexp I, [2024-05-07T00:35:41.551060 #4028984] INFO -- : [201/885] 4070362=test_rdoc_markup_include I, [2024-05-07T00:35:41.555018 #4028984] INFO -- : [202/885] 4070362=test_variable I, [2024-05-07T00:35:41.567638 #4028984] INFO -- : [203/885] 4070347=test_struct I, [2024-05-07T00:35:41.570539 #4028984] INFO -- : [204/885] 4070347=magic_comment_test I, [2024-05-07T00:35:41.578921 #4028984] INFO -- : [205/885] 4070347=test_rdoc_markup_to_html_snippet I, [2024-05-07T00:35:41.586406 #4028984] INFO -- : [206/885] 4070349=test_cparser I, [2024-05-07T00:35:41.598987 #4028984] INFO -- : [207/885] 4070356=test_pkg_config I, [2024-05-07T00:35:41.613388 #4028984] INFO -- : [208/885] 4070356=test_color_printer I, [2024-05-07T00:35:41.616706 #4028984] INFO -- : [209/885] 4070356=test_deprecated I, [2024-05-07T00:35:41.623988 #4028984] INFO -- : [210/885] 4070356=test_insns_leaf I, [2024-05-07T00:35:41.627423 #4028984] INFO -- : [211/885] 4070356=test_serialize_subclasses I, [2024-05-07T00:35:41.633593 #4028984] INFO -- : [212/885] 4070356=test_key_error I, [2024-05-07T00:35:41.635683 #4028984] INFO -- : [213/885] 4070356=test_allocation I, [2024-05-07T00:35:41.641247 #4028984] INFO -- : [214/885] 4070347=test_div I, [2024-05-07T00:35:41.641686 #4028984] INFO -- : [215/885] 4070347=test_win32ole_variant_m I, [2024-05-07T00:35:41.644594 #4028984] INFO -- : [216/885] 4070347=test_engine I, [2024-05-07T00:35:41.645276 #4028984] INFO -- : [217/885] 4070347=test_rdoc_rd_inline I, [2024-05-07T00:35:41.654021 #4028984] INFO -- : [218/885] 4070347=test_mutex I, [2024-05-07T00:35:41.671065 #4028984] INFO -- : [219/885] 4070362=test_x509req I, [2024-05-07T00:35:41.740422 #4028984] INFO -- : [220/885] 4070361=test_set I, [2024-05-07T00:35:41.758888 #4028984] INFO -- : [221/885] 4070361=test_struct I, [2024-05-07T00:35:41.789659 #4028984] INFO -- : [222/885] 4070351=test_gem_path_support I, [2024-05-07T00:35:41.832004 #4028984] INFO -- : [223/885] 4070362=test_files_test_1 I, [2024-05-07T00:35:41.892737 #4028984] INFO -- : [224/885] 4070359=test_super I, [2024-05-07T00:35:41.997609 #4028984] INFO -- : [225/885] 4070351=test_rubyoptions I, [2024-05-07T00:35:42.085596 #4028984] INFO -- : [226/885] 4070361=test_cgi_modruby I, [2024-05-07T00:35:42.090156 #4028984] INFO -- : [227/885] 4070349=test_integer I, [2024-05-07T00:35:42.096056 #4028984] INFO -- : [228/885] 4070361=test_call I, [2024-05-07T00:35:42.142276 #4028984] INFO -- : [229/885] 4070346=test_https_proxy I, [2024-05-07T00:35:42.185563 #4028984] INFO -- : [230/885] 4070346=test_rubygems I, [2024-05-07T00:35:42.219393 #4028984] INFO -- : [231/885] 4070361=test_stat I, [2024-05-07T00:35:42.221226 #4028984] INFO -- : [232/885] 4070361=test_gem_request_set_lockfile_tokenizer I, [2024-05-07T00:35:42.258413 #4028984] INFO -- : [233/885] 4070361=test_have_func I, [2024-05-07T00:35:42.291059 #4028984] INFO -- : [234/885] 4070359=test_nextafter I, [2024-05-07T00:35:42.307574 #4028984] INFO -- : [235/885] 4070355=test_capacity I, [2024-05-07T00:35:42.311495 #4028984] INFO -- : [236/885] 4070355=test_object_references I, [2024-05-07T00:35:42.348253 #4028984] INFO -- : [237/885] 4070355=test_usrmarshal I, [2024-05-07T00:35:42.373646 #4028984] INFO -- : [238/885] 4070359=test_gem_resolver_git_specification I, [2024-05-07T00:35:42.381577 #4028984] INFO -- : [239/885] 4070346=test_env I, [2024-05-07T00:35:42.554218 #4028984] INFO -- : [240/885] 4070355=test_rdoc_attr I, [2024-05-07T00:35:42.638481 #4028984] INFO -- : [241/885] 4070359=test_dryrun I, [2024-05-07T00:35:42.652150 #4028984] INFO -- : [242/885] 4070359=test_integer I, [2024-05-07T00:35:42.665665 #4028984] INFO -- : [243/885] 4070358=desugar_compiler_test I, [2024-05-07T00:35:42.670160 #4028984] INFO -- : [244/885] 4070355=test_gem_commands_setup_command I, [2024-05-07T00:35:42.714925 #4028984] INFO -- : [245/885] 4070358=test_cgi_core I, [2024-05-07T00:35:42.722824 #4028984] INFO -- : [246/885] 4070359=test_parser I, [2024-05-07T00:35:42.744455 #4028984] INFO -- : [247/885] 4070359=parse_stream_test I, [2024-05-07T00:35:42.746213 #4028984] INFO -- : [248/885] 4070358=test_registry I, [2024-05-07T00:35:42.753665 #4028984] INFO -- : [249/885] 4070358=test_gem_source_lock I, [2024-05-07T00:35:42.789179 #4028984] INFO -- : [250/885] 4070347=test_gem I, [2024-05-07T00:35:42.842071 #4028984] INFO -- : [251/885] 4070359=test_ractor I, [2024-05-07T00:35:42.855152 #4028984] INFO -- : [252/885] 4070348=test_gem_commands_open_command I, [2024-05-07T00:35:42.858215 #4028984] INFO -- : [253/885] 4070359=test_dns I, [2024-05-07T00:35:42.963445 #4028984] INFO -- : [254/885] 4070348=test_ssl I, [2024-05-07T00:35:42.978580 #4028984] INFO -- : [255/885] 4070358=test_my_integer I, [2024-05-07T00:35:43.005391 #4028984] INFO -- : [256/885] 4070358=test_thread I, [2024-05-07T00:35:43.058310 #4028984] INFO -- : [257/885] 4070345=json_ext_parser_test I, [2024-05-07T00:35:43.073888 #4028984] INFO -- : [258/885] 4070345=test_debugger_integration I, [2024-05-07T00:35:43.084321 #4028984] INFO -- : [259/885] 4070345=test_rendering I, [2024-05-07T00:35:43.155252 #4028984] INFO -- : [260/885] 4070345=test_ractor I, [2024-05-07T00:35:43.175979 #4028984] INFO -- : [261/885] 4070355=test_alias I, [2024-05-07T00:35:43.283235 #4028984] INFO -- : [262/885] 4070355=test_timeout I, [2024-05-07T00:35:43.338142 #4028984] INFO -- : [263/885] 4070359=test_marshal I, [2024-05-07T00:35:43.377961 #4028984] INFO -- : [264/885] 4070348=test_unicode_normalize I, [2024-05-07T00:35:43.392362 #4028984] INFO -- : [265/885] 4070350=test_weakref I, [2024-05-07T00:35:43.490892 #4028984] INFO -- : [266/885] 4070350=test_nonblock I, [2024-05-07T00:35:43.492471 #4028984] INFO -- : [267/885] 4070345=test_rb_str_dup I, [2024-05-07T00:35:43.494046 #4028984] INFO -- : [268/885] 4070345=test_reline_key I, [2024-05-07T00:35:43.495632 #4028984] INFO -- : [269/885] 4070350=test_singleton_function I, [2024-05-07T00:35:43.498278 #4028984] INFO -- : [270/885] 4070350=test_ancdata I, [2024-05-07T00:35:43.499750 #4028984] INFO -- : [271/885] 4070345=test_bignum I, [2024-05-07T00:35:43.528702 #4028984] INFO -- : [272/885] 4070350=test_rdoc_class_module I, [2024-05-07T00:35:43.621762 #4028984] INFO -- : [273/885] 4070345=test_gem_ci_detector I, [2024-05-07T00:35:43.623165 #4028984] INFO -- : [274/885] 4070345=test_win32ole_variable I, [2024-05-07T00:35:43.625687 #4028984] INFO -- : [275/885] 4070354=test_arity I, [2024-05-07T00:35:43.626060 #4028984] INFO -- : [276/885] 4070345=test_stringio I, [2024-05-07T00:35:43.629549 #4028984] INFO -- : [277/885] 4070354=test_io_wait_uncommon I, [2024-05-07T00:35:43.642094 #4028984] INFO -- : [278/885] 4070354=ractor_test I, [2024-05-07T00:35:43.713308 #4028984] INFO -- : [279/885] 4070354=test_trace I, [2024-05-07T00:35:43.724488 #4028984] INFO -- : [280/885] 4070354=test_rdoc_generator_json_index I, [2024-05-07T00:35:43.763485 #4028984] INFO -- : [281/885] 4070360=test_time_tz I, [2024-05-07T00:35:43.778019 #4028984] INFO -- : [282/885] 4070345=test_win32ole_event I, [2024-05-07T00:35:43.782618 #4028984] INFO -- : [283/885] 4070345=test_have_macro I, [2024-05-07T00:35:43.799064 #4028984] INFO -- : [284/885] 4070354=test_complex2 I, [2024-05-07T00:35:43.812173 #4028984] INFO -- : [285/885] 4070354=test_resolve_symbol I, [2024-05-07T00:35:43.840217 #4028984] INFO -- : [286/885] 4070360=test_gem_package I, [2024-05-07T00:35:43.864148 #4028984] INFO -- : [287/885] 4070354=test_gem_specification I, [2024-05-07T00:35:43.880767 #4028984] INFO -- : [288/885] 4070359=test_enum I, [2024-05-07T00:35:43.905477 #4028984] INFO -- : [289/885] 4070361=test_threadgroup I, [2024-05-07T00:35:44.062658 #4028984] INFO -- : [290/885] 4070350=test_rdoc_extend I, [2024-05-07T00:35:44.074787 #4028984] INFO -- : [291/885] 4070352=test_merge_keys I, [2024-05-07T00:35:44.077633 #4028984] INFO -- : [292/885] 4070350=test_gem_resolver_api_specification I, [2024-05-07T00:35:44.084228 #4028984] INFO -- : [293/885] 4070352=test_win32ole_variant I, [2024-05-07T00:35:44.092780 #4028984] INFO -- : [294/885] 4070352=test_ipaddr I, [2024-05-07T00:35:44.112149 #4028984] INFO -- : [295/885] 4070352=test_history I, [2024-05-07T00:35:44.119163 #4028984] INFO -- : [296/885] 4070352=test_mixed_unicode_escapes I, [2024-05-07T00:35:44.122370 #4028984] INFO -- : [297/885] 4070352=test_rdoc_markup_to_ansi I, [2024-05-07T00:35:44.124156 #4028984] INFO -- : [298/885] 4070355=test_ractor_compatibility I, [2024-05-07T00:35:44.126585 #4028984] INFO -- : [299/885] 4070350=test_dir I, [2024-05-07T00:35:44.150738 #4028984] INFO -- : [300/885] 4070352=format_errors_test I, [2024-05-07T00:35:44.221063 #4028984] INFO -- : [301/885] 4070352=test_gem_console_ui I, [2024-05-07T00:35:44.225918 #4028984] INFO -- : [302/885] 4070352=test_date_ractor I, [2024-05-07T00:35:44.277089 #4028984] INFO -- : [303/885] 4070356=test_autoconf I, [2024-05-07T00:35:44.284964 #4028984] INFO -- : [304/885] 4070356=test_eval I, [2024-05-07T00:35:44.289913 #4028984] INFO -- : [305/885] 4070356=test_numeric I, [2024-05-07T00:35:44.295968 #4028984] INFO -- : [306/885] 4070356=test_member I, [2024-05-07T00:35:44.302361 #4028984] INFO -- : [307/885] 4070356=test_cgi_multipart I, [2024-05-07T00:35:44.304084 #4028984] INFO -- : [308/885] 4070345=test_word I, [2024-05-07T00:35:44.305047 #4028984] INFO -- : [309/885] 4070345=test_gem_commands_cleanup_command I, [2024-05-07T00:35:44.346150 #4028984] INFO -- : [310/885] 4070350=test_rdoc_generator_darkfish I, [2024-05-07T00:35:44.366328 #4028984] INFO -- : [311/885] 4070360=test_rdoc_comment I, [2024-05-07T00:35:44.413904 #4028984] INFO -- : [312/885] 4070360=test_resize I, [2024-05-07T00:35:44.428904 #4028984] INFO -- : [313/885] 4070360=test_error_highlight I, [2024-05-07T00:35:44.477287 #4028984] INFO -- : [314/885] 4070356=test_http_request I, [2024-05-07T00:35:44.494674 #4028984] INFO -- : [315/885] 4070352=json_generic_object_test I, [2024-05-07T00:35:44.505623 #4028984] INFO -- : [316/885] 4070352=test_gem_source_fetch_problem I, [2024-05-07T00:35:44.515106 #4028984] INFO -- : [317/885] 4070352=test_coderange I, [2024-05-07T00:35:44.521298 #4028984] INFO -- : [318/885] 4070352=location_test I, [2024-05-07T00:35:44.523332 #4028984] INFO -- : [319/885] 4070355=test_symbol I, [2024-05-07T00:35:44.527842 #4028984] INFO -- : [320/885] 4070355=test_mailto I, [2024-05-07T00:35:44.534595 #4028984] INFO -- : [321/885] 4070356=test_pkcs7 I, [2024-05-07T00:35:44.547546 #4028984] INFO -- : [322/885] 4070355=test_gem_resolver_requirement_list I, [2024-05-07T00:35:44.554005 #4028984] INFO -- : [323/885] 4070355=test_arith_seq_beg_len_step I, [2024-05-07T00:35:44.570324 #4028984] INFO -- : [324/885] 4070352=test_function_entry I, [2024-05-07T00:35:44.575665 #4028984] INFO -- : [325/885] 4070352=ruby_api_test I, [2024-05-07T00:35:44.624978 #4028984] INFO -- : [326/885] 4070355=test_find_executable I, [2024-05-07T00:35:44.628954 #4028984] INFO -- : [327/885] 4070350=test_coder I, [2024-05-07T00:35:44.642951 #4028984] INFO -- : [328/885] 4070350=test_symbol I, [2024-05-07T00:35:44.645807 #4028984] INFO -- : [329/885] 4070355=test_gem_commands_pristine_command I, [2024-05-07T00:35:44.728046 #4028984] INFO -- : [330/885] 4070359=test_context I, [2024-05-07T00:35:44.729252 #4028984] INFO -- : [331/885] 4070352=test_nofree I, [2024-05-07T00:35:44.730273 #4028984] INFO -- : [332/885] 4070347=test_unix I, [2024-05-07T00:35:44.732542 #4028984] INFO -- : [333/885] 4070352=test_enc_associate I, [2024-05-07T00:35:44.740288 #4028984] INFO -- : [334/885] 4070356=test_lazy_enumerator I, [2024-05-07T00:35:44.754704 #4028984] INFO -- : [335/885] 4070347=test_date_strptime I, [2024-05-07T00:35:44.770430 #4028984] INFO -- : [336/885] 4070360=test_gem_package_task I, [2024-05-07T00:35:44.771452 #4028984] INFO -- : [337/885] 4070362=test_placearg I, [2024-05-07T00:35:44.772664 #4028984] INFO -- : [338/885] 4070345=test_rdoc_markup_hard_break I, [2024-05-07T00:35:44.773789 #4028984] INFO -- : [339/885] 4070360=test_gem_platform I, [2024-05-07T00:35:44.874655 #4028984] INFO -- : [340/885] 4070360=test_pkey_rsa I, [2024-05-07T00:35:44.890154 #4028984] INFO -- : [341/885] 4070345=test_weakkeymap I, [2024-05-07T00:35:44.906264 #4028984] INFO -- : [342/885] 4070347=test_gem_commands_push_command I, [2024-05-07T00:35:44.906538 #4028984] INFO -- : [343/885] 4070362=test_numhash I, [2024-05-07T00:35:44.906923 #4028984] INFO -- : [344/885] 4070361=test_fd_setsize I, [2024-05-07T00:35:44.909634 #4028984] INFO -- : [345/885] 4070361=test_continuation I, [2024-05-07T00:35:44.912996 #4028984] INFO -- : [346/885] 4070362=test_class_name_check I, [2024-05-07T00:35:44.916186 #4028984] INFO -- : [347/885] 4070361=test_keyword I, [2024-05-07T00:35:44.926102 #4028984] INFO -- : [348/885] 4070359=test_delete I, [2024-05-07T00:35:44.930409 #4028984] INFO -- : [349/885] 4070359=test_win32ole_method I, [2024-05-07T00:35:44.933747 #4028984] INFO -- : [350/885] 4070359=test_logger I, [2024-05-07T00:35:44.939450 #4028984] INFO -- : [351/885] 4070357=test_file_exhaustive I, [2024-05-07T00:35:44.941710 #4028984] INFO -- : [352/885] 4070362=test_gem_update_suggestion I, [2024-05-07T00:35:44.949852 #4028984] INFO -- : [353/885] 4070359=test_files_test I, [2024-05-07T00:35:44.990352 #4028984] INFO -- : [354/885] 4070349=test_rdoc_parser_markdown I, [2024-05-07T00:35:45.008521 #4028984] INFO -- : [355/885] 4070349=test_import I, [2024-05-07T00:35:45.016230 #4028984] INFO -- : [356/885] 4070362=test_gem_resolver_lock_set I, [2024-05-07T00:35:45.033864 #4028984] INFO -- : [357/885] 4070359=test_not I, [2024-05-07T00:35:45.036167 #4028984] INFO -- : [358/885] 4070359=version_test I, [2024-05-07T00:35:45.038221 #4028984] INFO -- : [359/885] 4070362=test_cgi_header I, [2024-05-07T00:35:45.041548 #4028984] INFO -- : [360/885] 4070359=heredoc_dedent_test I, [2024-05-07T00:35:45.046886 #4028984] INFO -- : [361/885] 4070359=test_object I, [2024-05-07T00:35:45.048939 #4028984] INFO -- : [362/885] 4070359=test_arithmetic_sequence I, [2024-05-07T00:35:45.052733 #4028984] INFO -- : [363/885] 4070362=test_key_actor_emacs I, [2024-05-07T00:35:45.053955 #4028984] INFO -- : [364/885] 4070345=test_gem_gemcutter_utilities I, [2024-05-07T00:35:45.064526 #4028984] INFO -- : [365/885] 4070359=test_basicinstructions I, [2024-05-07T00:35:45.136482 #4028984] INFO -- : [366/885] 4070359=test_gem_command_manager I, [2024-05-07T00:35:45.193865 #4028984] INFO -- : [367/885] 4070360=test_date_arith I, [2024-05-07T00:35:45.202986 #4028984] INFO -- : [368/885] 4070360=test_ruby_lex I, [2024-05-07T00:35:45.220103 #4028984] INFO -- : [369/885] 4070356=test_object I, [2024-05-07T00:35:45.240824 #4028984] INFO -- : [370/885] 4070359=test_gem_local_remote_options I, [2024-05-07T00:35:45.254307 #4028984] INFO -- : [371/885] 4070362=test_sleep I, [2024-05-07T00:35:45.273765 #4028984] INFO -- : [372/885] 4070359=test_change_word I, [2024-05-07T00:35:45.281863 #4028984] INFO -- : [373/885] 4070359=compiler_test I, [2024-05-07T00:35:45.287201 #4028984] INFO -- : [374/885] 4070359=test_flip I, [2024-05-07T00:35:45.305923 #4028984] INFO -- : [375/885] 4070352=test_timeout I, [2024-05-07T00:35:45.310291 #4028984] INFO -- : [376/885] 4070352=test_normalize I, [2024-05-07T00:35:45.311452 #4028984] INFO -- : [377/885] 4070359=test_ossl I, [2024-05-07T00:35:45.313766 #4028984] INFO -- : [378/885] 4070352=test_rdoc_rd_block_parser I, [2024-05-07T00:35:45.343057 #4028984] INFO -- : [379/885] 4070346=test_signedness I, [2024-05-07T00:35:45.358389 #4028984] INFO -- : [380/885] 4070360=test_tsort I, [2024-05-07T00:35:45.360187 #4028984] INFO -- : [381/885] 4070352=test_ractor I, [2024-05-07T00:35:45.364688 #4028984] INFO -- : [382/885] 4070360=test_type I, [2024-05-07T00:35:45.371538 #4028984] INFO -- : [383/885] 4070360=test_pointer I, [2024-05-07T00:35:45.398969 #4028984] INFO -- : [384/885] 4070345=test_big5 I, [2024-05-07T00:35:45.404329 #4028984] INFO -- : [385/885] 4070345=test_func I, [2024-05-07T00:35:45.417210 #4028984] INFO -- : [386/885] 4070347=test_vm_dump I, [2024-05-07T00:35:45.417439 #4028984] INFO -- : [387/885] 4070347=test_rdoc_markup_document I, [2024-05-07T00:35:45.426868 #4028984] INFO -- : [388/885] 4070352=test_integer_comb I, [2024-05-07T00:35:45.435698 #4028984] INFO -- : [389/885] 4070347=test_tmpdir I, [2024-05-07T00:35:45.493655 #4028984] INFO -- : [390/885] 4070361=errors_test I, [2024-05-07T00:35:45.506724 #4028984] INFO -- : [391/885] 4070347=test_gem_commands_check_command I, [2024-05-07T00:35:45.536059 #4028984] INFO -- : [392/885] 4070347=test_regexp I, [2024-05-07T00:35:45.635195 #4028984] INFO -- : [393/885] 4070356=static_inspect_test I, [2024-05-07T00:35:45.665889 #4028984] INFO -- : [394/885] 4070361=test_data_error I, [2024-05-07T00:35:45.704260 #4028984] INFO -- : [395/885] 4070356=bom_test I, [2024-05-07T00:35:45.707776 #4028984] INFO -- : [396/885] 4070356=test_force_exit I, [2024-05-07T00:35:45.718242 #4028984] INFO -- : [397/885] 4070356=test_file I, [2024-05-07T00:35:45.720096 #4028984] INFO -- : [398/885] 4070361=test_ostruct I, [2024-05-07T00:35:45.840304 #4028984] INFO -- : [399/885] 4070349=unescape_test I, [2024-05-07T00:35:45.856780 #4028984] INFO -- : [400/885] 4070361=test_udp I, [2024-05-07T00:35:45.862295 #4028984] INFO -- : [401/885] 4070361=test_project_sanity I, [2024-05-07T00:35:45.911827 #4028984] INFO -- : [402/885] 4070361=test_range I, [2024-05-07T00:35:45.928230 #4028984] INFO -- : [403/885] 4070360=test_constant I, [2024-05-07T00:35:45.967602 #4028984] INFO -- : [404/885] 4070355=test_pty I, [2024-05-07T00:35:46.236516 #4028984] INFO -- : [405/885] 4070354=test_dup I, [2024-05-07T00:35:46.424194 #4028984] INFO -- : [406/885] 4070354=command_line_test I, [2024-05-07T00:35:46.426630 #4028984] INFO -- : [407/885] 4070355=test_gem_uri_formatter I, [2024-05-07T00:35:46.454190 #4028984] INFO -- : [408/885] 4070355=test_erb_command I, [2024-05-07T00:35:46.483865 #4028984] INFO -- : [409/885] 4070355=test_helper I, [2024-05-07T00:35:46.491243 #4028984] INFO -- : [410/885] 4070355=test_encoding I, [2024-05-07T00:35:46.494131 #4028984] INFO -- : [411/885] 4070361=test_ts I, [2024-05-07T00:35:46.500830 #4028984] INFO -- : [412/885] 4070354=test_ensured I, [2024-05-07T00:35:46.561323 #4028984] INFO -- : [413/885] 4070354=library_symbols_test I, [2024-05-07T00:35:46.566176 #4028984] INFO -- : [414/885] 4070354=test_locale I, [2024-05-07T00:35:46.582649 #4028984] INFO -- : [415/885] 4070350=test_addr I, [2024-05-07T00:35:46.607725 #4028984] INFO -- : [416/885] 4070350=test_rdoc_ri_paths I, [2024-05-07T00:35:46.641108 #4028984] INFO -- : [417/885] 4070350=test_gem_safe_marshal I, [2024-05-07T00:35:46.685704 #4028984] INFO -- : [418/885] 4070354=test_gem_resolver_api_set I, [2024-05-07T00:35:46.692837 #4028984] INFO -- : [419/885] 4070355=test_config I, [2024-05-07T00:35:46.735074 #4028984] INFO -- : [420/885] 4070345=test_gem_resolver_vendor_set I, [2024-05-07T00:35:46.746005 #4028984] INFO -- : [421/885] 4070349=test_enumerable I, [2024-05-07T00:35:46.750844 #4028984] INFO -- : [422/885] 4070354=test_eval I, [2024-05-07T00:35:46.752793 #4028984] INFO -- : [423/885] 4070349=json_generator_test I, [2024-05-07T00:35:46.754000 #4028984] INFO -- : [424/885] 4070345=test_transcode I, [2024-05-07T00:35:46.846972 #4028984] INFO -- : [425/885] 4070349=test_update I, [2024-05-07T00:35:46.850333 #4028984] INFO -- : [426/885] 4070349=test_fips I, [2024-05-07T00:35:46.937853 #4028984] INFO -- : [427/885] 4070345=test_x509name I, [2024-05-07T00:35:46.954093 #4028984] INFO -- : [428/885] 4070345=test_rdoc_code_object I, [2024-05-07T00:35:46.987624 #4028984] INFO -- : [429/885] 4070361=test_x509store I, [2024-05-07T00:35:47.037825 #4028984] INFO -- : [430/885] 4070354=test_webauthn_listener I, [2024-05-07T00:35:47.079445 #4028984] INFO -- : [431/885] 4070349=test_ast I, [2024-05-07T00:35:47.096762 #4028984] INFO -- : [432/885] 4070354=test_gem_request_set_gem_dependency_api I, [2024-05-07T00:35:47.203135 #4028984] INFO -- : [433/885] 4070355=test_lambda I, [2024-05-07T00:35:47.205570 #4028984] INFO -- : [434/885] 4070361=test_random_formatter I, [2024-05-07T00:35:47.222682 #4028984] INFO -- : [435/885] 4070361=test_helper I, [2024-05-07T00:35:47.222827 #4028984] INFO -- : [436/885] 4070361=test_jaro_winkler I, [2024-05-07T00:35:47.233966 #4028984] INFO -- : [437/885] 4070361=test_gem_resolver_index_set I, [2024-05-07T00:35:47.258714 #4028984] INFO -- : [438/885] 4070350=test_gem_package_old I, [2024-05-07T00:35:47.261938 #4028984] INFO -- : [439/885] 4070355=test_gc_compact I, [2024-05-07T00:35:47.262319 #4028984] INFO -- : [440/885] 4070361=test_proc I, [2024-05-07T00:35:47.286919 #4028984] INFO -- : [441/885] 4070345=test_string I, [2024-05-07T00:35:47.303857 #4028984] INFO -- : [442/885] 4070350=test_erb_m17n I, [2024-05-07T00:35:47.311399 #4028984] INFO -- : [443/885] 4070350=test_ole_methods I, [2024-05-07T00:35:47.316615 #4028984] INFO -- : [444/885] 4070350=test_date_conv I, [2024-05-07T00:35:47.321066 #4028984] INFO -- : [445/885] 4070350=test_optimization I, [2024-05-07T00:35:47.344778 #4028984] INFO -- : [446/885] 4070354=test_zlib I, [2024-05-07T00:35:47.536570 #4028984] INFO -- : [447/885] 4070346=test_cgi_tag_helper I, [2024-05-07T00:35:47.538546 #4028984] INFO -- : [448/885] 4070346=test_egrep_cpp I, [2024-05-07T00:35:47.653814 #4028984] INFO -- : [449/885] 4070346=test_fnmatch I, [2024-05-07T00:35:47.690246 #4028984] INFO -- : [450/885] 4070346=test_files_test_2 I, [2024-05-07T00:35:47.718616 #4028984] INFO -- : [451/885] 4070344=test_rdoc_markup_parser I, [2024-05-07T00:35:47.855642 #4028984] INFO -- : [452/885] 4070352=test_require_path_check I, [2024-05-07T00:35:47.911915 #4028984] INFO -- : [453/885] 4070352=test_folderitem2_invokeverb I, [2024-05-07T00:35:47.914357 #4028984] INFO -- : [454/885] 4070352=test_gem_validator I, [2024-05-07T00:35:47.921349 #4028984] INFO -- : [455/885] 4070344=test_depth_first I, [2024-05-07T00:35:47.930372 #4028984] INFO -- : [456/885] 4070344=test_gem_request_set_lockfile_parser I, [2024-05-07T00:35:47.931606 #4028984] INFO -- : [457/885] 4070352=test_raise I, [2024-05-07T00:35:47.934725 #4028984] INFO -- : [458/885] 4070352=test_x509attr I, [2024-05-07T00:35:47.938889 #4028984] INFO -- : [459/885] 4070352=test_rdoc_store I, [2024-05-07T00:35:47.993777 #4028984] INFO -- : [460/885] 4070361=test_string I, [2024-05-07T00:35:48.017952 #4028984] INFO -- : [461/885] 4070361=test_rdoc_stats I, [2024-05-07T00:35:48.033997 #4028984] INFO -- : [462/885] 4070344=test_pattern_matching I, [2024-05-07T00:35:48.051663 #4028984] INFO -- : [463/885] 4070344=test_gem_dependency_resolution_error I, [2024-05-07T00:35:48.060897 #4028984] INFO -- : [464/885] 4070344=test_rdoc_parser I, [2024-05-07T00:35:48.101917 #4028984] INFO -- : [465/885] 4070344=test_qsort I, [2024-05-07T00:35:48.113267 #4028984] INFO -- : [466/885] 4070344=test_custom_command I, [2024-05-07T00:35:48.208590 #4028984] INFO -- : [467/885] 4070344=json_addition_test I, [2024-05-07T00:35:48.222095 #4028984] INFO -- : [468/885] 4070344=test_rdoc_markup_attributes I, [2024-05-07T00:35:48.225806 #4028984] INFO -- : [469/885] 4070344=test_rdoc_markup_to_rdoc I, [2024-05-07T00:35:48.232679 #4028984] INFO -- : [470/885] 4070361=test_rdoc_rd_inline_parser I, [2024-05-07T00:35:48.256770 #4028984] INFO -- : [471/885] 4070344=test_default_gems I, [2024-05-07T00:35:48.268065 #4028984] INFO -- : [472/885] 4070361=test_null I, [2024-05-07T00:35:48.272098 #4028984] INFO -- : [473/885] 4070361=test_win32ole_type I, [2024-05-07T00:35:48.276609 #4028984] INFO -- : [474/885] 4070361=test_mul I, [2024-05-07T00:35:48.280571 #4028984] INFO -- : [475/885] 4070361=test_pkey_ec I, [2024-05-07T00:35:48.291836 #4028984] INFO -- : [476/885] 4070360=test_trick I, [2024-05-07T00:35:48.317867 #4028984] INFO -- : [477/885] 4070344=test_thread I, [2024-05-07T00:35:48.324954 #4028984] INFO -- : [478/885] 4070344=test_pipe I, [2024-05-07T00:35:48.367130 #4028984] INFO -- : [479/885] 4070361=test_date_parse I, [2024-05-07T00:35:48.424525 #4028984] INFO -- : [480/885] 4070344=test_rdoc_i18n_text I, [2024-05-07T00:35:48.429607 #4028984] INFO -- : [481/885] 4070344=test_io_buffer I, [2024-05-07T00:35:48.458733 #4028984] INFO -- : [482/885] 4070348=test_key_name_check I, [2024-05-07T00:35:48.466201 #4028984] INFO -- : [483/885] 4070344=test_defined I, [2024-05-07T00:35:48.473713 #4028984] INFO -- : [484/885] 4070361=test_backtrace I, [2024-05-07T00:35:48.477533 #4028984] INFO -- : [485/885] 4070361=test_buffering I, [2024-05-07T00:35:48.480588 #4028984] INFO -- : [486/885] 4070348=test_svcb_https I, [2024-05-07T00:35:48.482182 #4028984] INFO -- : [487/885] 4070361=test_gb18030 I, [2024-05-07T00:35:48.488238 #4028984] INFO -- : [488/885] 4070361=test_gem_uninstaller I, [2024-05-07T00:35:48.500652 #4028984] INFO -- : [489/885] 4070348=test_rdoc_rdoc I, [2024-05-07T00:35:48.525823 #4028984] INFO -- : [490/885] 4070344=test_windows_1251 I, [2024-05-07T00:35:48.533676 #4028984] INFO -- : [491/885] 4070344=test_time I, [2024-05-07T00:35:48.595424 #4028984] INFO -- : [492/885] 4070352=test_gem_silent_ui I, [2024-05-07T00:35:48.621434 #4028984] INFO -- : [493/885] 4070352=test_emitter I, [2024-05-07T00:35:48.625968 #4028984] INFO -- : [494/885] 4070344=test_bug-5832 I, [2024-05-07T00:35:48.628421 #4028984] INFO -- : [495/885] 4070352=test_files_ext I, [2024-05-07T00:35:48.630019 #4028984] INFO -- : [496/885] 4070344=test_eval_history I, [2024-05-07T00:35:48.646835 #4028984] INFO -- : [497/885] 4070344=dispatcher_test I, [2024-05-07T00:35:48.734522 #4028984] INFO -- : [498/885] 4070344=test_kernel I, [2024-05-07T00:35:48.789517 #4028984] INFO -- : [499/885] 4070348=test_kdf I, [2024-05-07T00:35:48.831133 #4028984] INFO -- : [500/885] 4070352=test_gem_doctor I, [2024-05-07T00:35:48.856295 #4028984] INFO -- : [501/885] 4070352=test_rdoc_markup_paragraph I, [2024-05-07T00:35:48.860522 #4028984] INFO -- : [502/885] 4070352=test_enc_raise I, [2024-05-07T00:35:48.863049 #4028984] INFO -- : [503/885] 4070352=test_psych I, [2024-05-07T00:35:48.880229 #4028984] INFO -- : [504/885] 4070348=!Nothing_to_test I, [2024-05-07T00:35:48.881034 #4028984] INFO -- : [505/885] 4070348=test_at_exit I, [2024-05-07T00:35:48.886425 #4028984] INFO -- : [506/885] 4070352=test_command I, [2024-05-07T00:35:48.904474 #4028984] INFO -- : [507/885] 4070348=test_gem_ext_cargo_builder_unit I, [2024-05-07T00:35:48.933003 #4028984] INFO -- : [508/885] 4070348=test_gem_rdoc I, [2024-05-07T00:35:49.054815 #4028984] INFO -- : [509/885] 4070348=test_date I, [2024-05-07T00:35:49.071721 #4028984] INFO -- : [510/885] 4070348=test_object_create_start I, [2024-05-07T00:35:49.073775 #4028984] INFO -- : [511/885] 4070348=test_rdoc_tom_doc I, [2024-05-07T00:35:49.089248 #4028984] INFO -- : [512/885] 4070348=test_hmac I, [2024-05-07T00:35:49.093166 #4028984] INFO -- : [513/885] 4070348=test_rdoc_markup_to_tt_only I, [2024-05-07T00:35:49.119655 #4028984] INFO -- : [514/885] 4070348=test_common I, [2024-05-07T00:35:49.137937 #4028984] INFO -- : [515/885] 4070352=test_gem_spec_fetcher I, [2024-05-07T00:35:49.280682 #4028984] INFO -- : [516/885] 4070352=test_gem_command I, [2024-05-07T00:35:49.291514 #4028984] INFO -- : [517/885] 4070348=test_key_actor_vi I, [2024-05-07T00:35:49.318579 #4028984] INFO -- : [518/885] 4070353=test_bug-3571 I, [2024-05-07T00:35:49.332146 #4028984] INFO -- : [519/885] 4070353=test_assignment I, [2024-05-07T00:35:49.340211 #4028984] INFO -- : [520/885] 4070361=test_ifunless I, [2024-05-07T00:35:49.345670 #4028984] INFO -- : [521/885] 4070361=test_gem_commands_lock_command I, [2024-05-07T00:35:49.359301 #4028984] INFO -- : [522/885] 4070361=test_numeric I, [2024-05-07T00:35:49.369547 #4028984] INFO -- : [523/885] 4070352=test_config I, [2024-05-07T00:35:49.386646 #4028984] INFO -- : [524/885] 4070344=test_yaml_special_cases I, [2024-05-07T00:35:49.390054 #4028984] INFO -- : [525/885] 4070352=test_optarg I, [2024-05-07T00:35:49.395432 #4028984] INFO -- : [526/885] 4070348=test_gem_source_list I, [2024-05-07T00:35:49.401036 #4028984] INFO -- : [527/885] 4070344=test_address_resolve I, [2024-05-07T00:35:49.409579 #4028984] INFO -- : [528/885] 4070344=test_rdoc_token_stream I, [2024-05-07T00:35:49.415113 #4028984] INFO -- : [529/885] 4070344=test_zsh_completion I, [2024-05-07T00:35:49.416861 #4028984] INFO -- : [530/885] 4070344=test_exception I, [2024-05-07T00:35:49.426247 #4028984] INFO -- : [531/885] 4070344=test_iter_break I, [2024-05-07T00:35:49.428308 #4028984] INFO -- : [532/885] 4070361=test_macro I, [2024-05-07T00:35:49.429037 #4028984] INFO -- : [533/885] 4070344=test_frozen I, [2024-05-07T00:35:49.432766 #4028984] INFO -- : [534/885] 4070344=test_gem_ext_configure_builder I, [2024-05-07T00:35:49.444879 #4028984] INFO -- : [535/885] 4070348=test_pp I, [2024-05-07T00:35:49.464742 #4028984] INFO -- : [536/885] 4070344=test_verbose I, [2024-05-07T00:35:49.479322 #4028984] INFO -- : [537/885] 4070361=test_num2int I, [2024-05-07T00:35:49.483733 #4028984] INFO -- : [538/885] 4070344=test_nil I, [2024-05-07T00:35:49.488439 #4028984] INFO -- : [539/885] 4070344=test_rdoc_single_class I, [2024-05-07T00:35:49.490275 #4028984] INFO -- : [540/885] 4070344=test_switch_hitter I, [2024-05-07T00:35:49.494661 #4028984] INFO -- : [541/885] 4070361=test_flush I, [2024-05-07T00:35:49.499037 #4028984] INFO -- : [542/885] 4070361=test_singleton I, [2024-05-07T00:35:49.501605 #4028984] INFO -- : [543/885] 4070344=test_io_console I, [2024-05-07T00:35:49.503592 #4028984] INFO -- : [544/885] 4070361=test_rdoc_markdown_test I, [2024-05-07T00:35:49.528210 #4028984] INFO -- : [545/885] 4070352=test_c_union_entity I, [2024-05-07T00:35:49.528671 #4028984] INFO -- : [546/885] 4070348=test_rdoc_normal_module I, [2024-05-07T00:35:49.575551 #4028984] INFO -- : [547/885] 4070348=test_logperiod I, [2024-05-07T00:35:49.580472 #4028984] INFO -- : [548/885] 4070357=test_securerandom I, [2024-05-07T00:35:49.614756 #4028984] INFO -- : [549/885] 4070348=test_thread_fd_close I, [2024-05-07T00:35:49.615673 #4028984] INFO -- : [550/885] 4070348=test_passing_block I, [2024-05-07T00:35:49.617326 #4028984] INFO -- : [551/885] 4070352=test_hash_create I, [2024-05-07T00:35:49.619713 #4028984] INFO -- : [552/885] 4070352=test_stringchar I, [2024-05-07T00:35:49.621473 #4028984] INFO -- : [553/885] 4070348=test_uncorrectable_name_check I, [2024-05-07T00:35:49.623340 #4028984] INFO -- : [554/885] 4070357=newline_test I, [2024-05-07T00:35:49.624917 #4028984] INFO -- : [555/885] 4070348=test_gem_source_local I, [2024-05-07T00:35:49.654802 #4028984] INFO -- : [556/885] 4070355=test_gem_security_policy I, [2024-05-07T00:35:49.719570 #4028984] INFO -- : [557/885] 4070352=test_pack I, [2024-05-07T00:35:49.805738 #4028984] INFO -- : [558/885] 4070357=test_last_thread I, [2024-05-07T00:35:49.822713 #4028984] INFO -- : [559/885] 4070348=test_process I, [2024-05-07T00:35:49.930000 #4028984] INFO -- : [560/885] 4070352=test_gc I, [2024-05-07T00:35:50.017966 #4028984] INFO -- : [561/885] 4070355=test_x509cert I, [2024-05-07T00:35:50.258654 #4028984] INFO -- : [562/885] 4070362=test_err_in_callback I, [2024-05-07T00:35:50.267642 #4028984] INFO -- : [563/885] 4070362=test_gem_resolver_lock_specification I, [2024-05-07T00:35:50.288236 #4028984] INFO -- : [564/885] 4070362=test_logdevice I, [2024-05-07T00:35:50.310498 #4028984] INFO -- : [565/885] 4070354=test_arity I, [2024-05-07T00:35:50.314160 #4028984] INFO -- : [566/885] 4070355=test_gem_ext_rake_builder I, [2024-05-07T00:35:50.318385 #4028984] INFO -- : [567/885] 4070354=test_gem_commands_specification_command I, [2024-05-07T00:35:50.367376 #4028984] INFO -- : [568/885] 4070361=test_enumerator I, [2024-05-07T00:35:50.379293 #4028984] INFO -- : [569/885] 4070353=test_flags I, [2024-05-07T00:35:50.396801 #4028984] INFO -- : [570/885] 4070360=test_inadvertent_creation I, [2024-05-07T00:35:50.447716 #4028984] INFO -- : [571/885] 4070354=test_gem_commands_which_command I, [2024-05-07T00:35:50.471720 #4028984] INFO -- : [572/885] 4070354=test_shift_jis I, [2024-05-07T00:35:50.490546 #4028984] INFO -- : [573/885] 4070354=test_http I, [2024-05-07T00:35:50.496102 #4028984] INFO -- : [574/885] 4070354=test_rdoc_markup_attribute_manager I, [2024-05-07T00:35:50.509240 #4028984] INFO -- : [575/885] 4070346=test_name_error I, [2024-05-07T00:35:50.517671 #4028984] INFO -- : [576/885] 4070354=test_gem_resolver_composed_set I, [2024-05-07T00:35:50.521549 #4028984] INFO -- : [577/885] 4070360=test_safe_load I, [2024-05-07T00:35:50.531163 #4028984] INFO -- : [578/885] 4070360=test_gem_resolver I, [2024-05-07T00:35:50.538396 #4028984] INFO -- : [579/885] 4070354=test_gem_commands_dependency_command I, [2024-05-07T00:35:50.600725 #4028984] INFO -- : [580/885] 4070346=test_stream I, [2024-05-07T00:35:50.612883 #4028984] INFO -- : [581/885] 4070346=test_nil2vtempty I, [2024-05-07T00:35:50.615573 #4028984] INFO -- : [582/885] 4070346=test_rdoc_context I, [2024-05-07T00:35:50.615815 #4028984] INFO -- : [583/885] 4070354=test_rdoc_parser_ruby I, [2024-05-07T00:35:50.734264 #4028984] INFO -- : [584/885] 4070360=test_open-uri I, [2024-05-07T00:35:50.864809 #4028984] INFO -- : [585/885] 4070357=test_httpresponse I, [2024-05-07T00:35:50.957168 #4028984] INFO -- : [586/885] 4070357=test_data I, [2024-05-07T00:35:50.976650 #4028984] INFO -- : [587/885] 4070357=index_write_test I, [2024-05-07T00:35:50.981361 #4028984] INFO -- : [588/885] 4070357=test_date_new I, [2024-05-07T00:35:50.998578 #4028984] INFO -- : [589/885] 4070357=test_require I, [2024-05-07T00:35:50.999300 #4028984] INFO -- : [590/885] 4070357=test_date_time I, [2024-05-07T00:35:51.031236 #4028984] INFO -- : [591/885] 4070357=test_rdoc_markup_to_joined_paragraph I, [2024-05-07T00:35:51.037644 #4028984] INFO -- : [592/885] 4070357=test_gem_safe_yaml I, [2024-05-07T00:35:51.045572 #4028984] INFO -- : [593/885] 4070360=test_syntax I, [2024-05-07T00:35:51.075060 #4028984] INFO -- : [594/885] 4070355=test_rdoc_text I, [2024-05-07T00:35:51.082657 #4028984] INFO -- : [595/885] 4070362=test_iso_8859 I, [2024-05-07T00:35:51.114257 #4028984] INFO -- : [596/885] 4070362=test_tcp I, [2024-05-07T00:35:51.138759 #4028984] INFO -- : [597/885] 4070355=test_store I, [2024-05-07T00:35:51.167490 #4028984] INFO -- : [598/885] 4070362=test_case_options I, [2024-05-07T00:35:51.177164 #4028984] INFO -- : [599/885] 4070357=test_gem_dependency_installer I, [2024-05-07T00:35:51.184798 #4028984] INFO -- : [600/885] 4070362=test_scalar I, [2024-05-07T00:35:51.190525 #4028984] INFO -- : [601/885] 4070362=test_gem_commands_info_command I, [2024-05-07T00:35:51.209466 #4028984] INFO -- : [602/885] 4070354=test_rdoc_cross_reference I, [2024-05-07T00:35:51.215555 #4028984] INFO -- : [603/885] 4070362=test_rand I, [2024-05-07T00:35:51.249131 #4028984] INFO -- : [604/885] 4070351=test_gem_package_tar_reader_entry I, [2024-05-07T00:35:51.284934 #4028984] INFO -- : [605/885] 4070346=test_gem_name_tuple I, [2024-05-07T00:35:51.298365 #4028984] INFO -- : [606/885] 4070346=test_bug_reporter I, [2024-05-07T00:35:51.303997 #4028984] INFO -- : [607/885] 4070355=test_exception I, [2024-05-07T00:35:51.362656 #4028984] INFO -- : [608/885] 4070353=test_sprintf_comb I, [2024-05-07T00:35:51.374487 #4028984] INFO -- : [609/885] 4070351=test_method_cache I, [2024-05-07T00:35:51.380203 #4028984] INFO -- : [610/885] 4070351=test_gem_request I, [2024-05-07T00:35:51.520241 #4028984] INFO -- : [611/885] 4070362=test_gem_commands_mirror I, [2024-05-07T00:35:51.527824 #4028984] INFO -- : [612/885] 4070351=test_gem_ext_cargo_builder_link_flag_converter I, [2024-05-07T00:35:51.533785 #4028984] INFO -- : [613/885] 4070362=test_gem_text I, [2024-05-07T00:35:51.550458 #4028984] INFO -- : [614/885] 4070353=test_settracefunc I, [2024-05-07T00:35:51.568350 #4028984] INFO -- : [615/885] 4070351=test_enumerator_kw I, [2024-05-07T00:35:51.571789 #4028984] INFO -- : [616/885] 4070351=test_scan_args I, [2024-05-07T00:35:51.579448 #4028984] INFO -- : [617/885] 4070351=test_win32ole I, [2024-05-07T00:35:51.582325 #4028984] INFO -- : [618/885] 4070362=test_generic I, [2024-05-07T00:35:51.587375 #4028984] INFO -- : [619/885] 4070351=test_gem_request_connection_pools I, [2024-05-07T00:35:51.625242 #4028984] INFO -- : [620/885] 4070362=test_grapheme_breaks I, [2024-05-07T00:35:51.655302 #4028984] INFO -- : [621/885] 4070362=test_gem_version_option I, [2024-05-07T00:35:51.690145 #4028984] INFO -- : [622/885] 4070362=test_cclass I, [2024-05-07T00:35:51.723315 #4028984] INFO -- : [623/885] 4070346=test_parser_events I, [2024-05-07T00:35:51.741803 #4028984] INFO -- : [624/885] 4070362=test_reline I, [2024-05-07T00:35:51.751560 #4028984] INFO -- : [625/885] 4070354=test_case I, [2024-05-07T00:35:51.751665 #4028984] INFO -- : [626/885] 4070354=test_pkey I, [2024-05-07T00:35:51.777450 #4028984] INFO -- : [627/885] 4070356=test_rdoc_markup_to_markdown I, [2024-05-07T00:35:51.778624 #4028984] INFO -- : [628/885] 4070346=test_json_tree I, [2024-05-07T00:35:51.786732 #4028984] INFO -- : [629/885] 4070346=test_rdoc_generator_pot_po I, [2024-05-07T00:35:51.792250 #4028984] INFO -- : [630/885] 4070346=test_ansi_with_terminfo I, [2024-05-07T00:35:51.795543 #4028984] INFO -- : [631/885] 4070346=test_ractor I, [2024-05-07T00:35:51.802994 #4028984] INFO -- : [632/885] 4070354=test_memory_view I, [2024-05-07T00:35:51.816195 #4028984] INFO -- : [633/885] 4070356=test_m17n_comb I, [2024-05-07T00:35:51.868303 #4028984] INFO -- : [634/885] 4070346=test_gem_stream_ui I, [2024-05-07T00:35:51.923896 #4028984] INFO -- : [635/885] 4070362=test_rdoc_generator_ri I, [2024-05-07T00:35:51.931802 #4028984] INFO -- : [636/885] 4070362=test_extlibs I, [2024-05-07T00:35:51.950368 #4028984] INFO -- : [637/885] 4070358=test_require_lib I, [2024-05-07T00:35:51.956630 #4028984] INFO -- : [638/885] 4070346=test_gem_install_update_options I, [2024-05-07T00:35:51.977584 #4028984] INFO -- : [639/885] 4070354=parse_test I, [2024-05-07T00:35:52.060098 #4028984] INFO -- : [640/885] 4070346=test_ractor I, [2024-05-07T00:35:52.082418 #4028984] INFO -- : [641/885] 4070346=test_severity I, [2024-05-07T00:35:52.097811 #4028984] INFO -- : [642/885] 4070346=test_thread I, [2024-05-07T00:35:52.246305 #4028984] INFO -- : [643/885] 4070344=test_socket I, [2024-05-07T00:35:52.318231 #4028984] INFO -- : [644/885] 4070346=test_objectspace I, [2024-05-07T00:35:52.393250 #4028984] INFO -- : [645/885] 4070353=test_rdoc_markup_to_table_of_contents I, [2024-05-07T00:35:52.524428 #4028984] INFO -- : [646/885] 4070353=test_str2big I, [2024-05-07T00:35:52.528649 #4028984] INFO -- : [647/885] 4070353=test_dot_dot I, [2024-05-07T00:35:52.533497 #4028984] INFO -- : [648/885] 4070353=test_c_struct_builder I, [2024-05-07T00:35:52.623407 #4028984] INFO -- : [649/885] 4070351=test_literal I, [2024-05-07T00:35:52.637990 #4028984] INFO -- : [650/885] 4070353=test_big2str I, [2024-05-07T00:35:52.640269 #4028984] INFO -- : [651/885] 4070353=test_forwardable I, [2024-05-07T00:35:52.667859 #4028984] INFO -- : [652/885] 4070353=test_yaml I, [2024-05-07T00:35:52.831526 #4028984] INFO -- : [653/885] 4070353=test_wait I, [2024-05-07T00:35:52.921683 #4028984] INFO -- : [654/885] 4070353=test_handle I, [2024-05-07T00:35:53.184518 #4028984] INFO -- : [655/885] 4070353=test_thread_queue I, [2024-05-07T00:35:53.219672 #4028984] INFO -- : [656/885] 4070351=test_nowrite I, [2024-05-07T00:35:53.233379 #4028984] INFO -- : [657/885] 4070351=test_rdoc_markup_formatter I, [2024-05-07T00:35:53.319833 #4028984] INFO -- : [658/885] 4070346=test_ractor I, [2024-05-07T00:35:53.322820 #4028984] INFO -- : [659/885] 4070355=test_euc_tw I, [2024-05-07T00:35:53.327617 #4028984] INFO -- : [660/885] 4070355=test_bmethod I, [2024-05-07T00:35:53.334789 #4028984] INFO -- : [661/885] 4070355=test_gem_commands_sources_command I, [2024-05-07T00:35:53.338219 #4028984] INFO -- : [662/885] 4070346=test_ansi_without_terminfo I, [2024-05-07T00:35:53.346265 #4028984] INFO -- : [663/885] 4070346=test_io_timeout I, [2024-05-07T00:35:53.351012 #4028984] INFO -- : [664/885] 4070346=test_shapes I, [2024-05-07T00:35:53.355374 #4028984] INFO -- : [665/885] 4070346=json_fixtures_test I, [2024-05-07T00:35:53.358044 #4028984] INFO -- : [666/885] 4070351=test_comparable I, [2024-05-07T00:35:53.363744 #4028984] INFO -- : [667/885] 4070351=test_rdoc_parser_c I, [2024-05-07T00:35:53.366820 #4028984] INFO -- : [668/885] 4070346=test_class2name I, [2024-05-07T00:35:53.375997 #4028984] INFO -- : [669/885] 4070346=test_gbk I, [2024-05-07T00:35:53.383181 #4028984] INFO -- : [670/885] 4070346=test_enc_str_buf_cat I, [2024-05-07T00:35:53.388939 #4028984] INFO -- : [671/885] 4070346=test_pstore I, [2024-05-07T00:35:53.437300 #4028984] INFO -- : [672/885] 4070346=test_cstr I, [2024-05-07T00:35:53.497805 #4028984] INFO -- : [673/885] 4070355=test_profile_frames I, [2024-05-07T00:35:53.511376 #4028984] INFO -- : [674/885] 4070357=test_marshalable I, [2024-05-07T00:35:53.515823 #4028984] INFO -- : [675/885] 4070357=test_digest I, [2024-05-07T00:35:53.557735 #4028984] INFO -- : [676/885] 4070359=test_gem_commands_contents_command I, [2024-05-07T00:35:53.629217 #4028984] INFO -- : [677/885] 4070351=test_gem_ext_cmake_builder I, [2024-05-07T00:35:53.640945 #4028984] INFO -- : [678/885] 4070351=test_require I, [2024-05-07T00:35:53.686829 #4028984] INFO -- : [679/885] 4070359=test_cgi_util I, [2024-05-07T00:35:53.689775 #4028984] INFO -- : [680/885] 4070355=test_fiddle I, [2024-05-07T00:35:53.750284 #4028984] INFO -- : [681/885] 4070355=test_wss I, [2024-05-07T00:35:53.753661 #4028984] INFO -- : [682/885] 4070355=test_ractor I, [2024-05-07T00:35:53.810386 #4028984] INFO -- : [683/885] 4070362=test_find I, [2024-05-07T00:35:53.812218 #4028984] INFO -- : [684/885] 4070344=regexp_test I, [2024-05-07T00:35:53.823147 #4028984] INFO -- : [685/885] 4070344=test_gem_package_tar_reader I, [2024-05-07T00:35:53.825455 #4028984] INFO -- : [686/885] 4070362=test_rdoc_encoding I, [2024-05-07T00:35:53.851784 #4028984] INFO -- : [687/885] 4070362=test_coverage I, [2024-05-07T00:35:53.867977 #4028984] INFO -- : [688/885] 4070344=test_pathname I, [2024-05-07T00:35:53.912022 #4028984] INFO -- : [689/885] 4070355=test_complexrational I, [2024-05-07T00:35:53.915112 #4028984] INFO -- : [690/885] 4070355=test_init I, [2024-05-07T00:35:53.972351 #4028984] INFO -- : [691/885] 4070359=test_rdoc_any_method I, [2024-05-07T00:35:54.062669 #4028984] INFO -- : [692/885] 4070344=test_modify_expand I, [2024-05-07T00:35:54.072282 #4028984] INFO -- : [693/885] 4070344=test_rdoc_markdown I, [2024-05-07T00:35:54.334070 #4028984] INFO -- : [694/885] 4070344=test_gem_available_set I, [2024-05-07T00:35:54.353177 #4028984] INFO -- : [695/885] 4070357=test_file I, [2024-05-07T00:35:54.358757 #4028984] INFO -- : [696/885] 4070357=test_deprecate I, [2024-05-07T00:35:54.358828 #4028984] INFO -- : [697/885] 4070346=test_rdoc_constant I, [2024-05-07T00:35:54.359121 #4028984] INFO -- : [698/885] 4070355=test_formatter I, [2024-05-07T00:35:54.366471 #4028984] INFO -- : [699/885] 4070355=test_bash_completion I, [2024-05-07T00:35:54.371433 #4028984] INFO -- : [700/885] 4070355=test_recorder I, [2024-05-07T00:35:54.374064 #4028984] INFO -- : [701/885] 4070355=test_gem_source_vendor I, [2024-05-07T00:35:54.382145 #4028984] INFO -- : [702/885] 4070355=test_gem_commands_owner_command I, [2024-05-07T00:35:54.398654 #4028984] INFO -- : [703/885] 4070357=test_rdoc_parser_rd I, [2024-05-07T00:35:54.412656 #4028984] INFO -- : [704/885] 4070344=test_date_strftime I, [2024-05-07T00:35:54.463403 #4028984] INFO -- : [705/885] 4070346=test_yamlstore I, [2024-05-07T00:35:54.475997 #4028984] INFO -- : [706/885] 4070346=test_gem_installer I, [2024-05-07T00:35:54.478320 #4028984] INFO -- : [707/885] 4070357=json_string_matching_test I, [2024-05-07T00:35:54.490967 #4028984] INFO -- : [708/885] 4070357=test_load I, [2024-05-07T00:35:54.497955 #4028984] INFO -- : [709/885] 4070359=test_class I, [2024-05-07T00:35:54.499765 #4028984] INFO -- : [710/885] 4070357=test_rdoc_normal_class I, [2024-05-07T00:35:54.578286 #4028984] INFO -- : [711/885] 4070357=test_const I, [2024-05-07T00:35:54.583140 #4028984] INFO -- : [712/885] 4070357=test_asn1 I, [2024-05-07T00:35:54.611638 #4028984] INFO -- : [713/885] 4070357=test_random I, [2024-05-07T00:35:54.615055 #4028984] INFO -- : [714/885] 4070357=test_irb I, [2024-05-07T00:35:54.631628 #4028984] INFO -- : [715/885] 4070356=test_function I, [2024-05-07T00:35:54.751146 #4028984] INFO -- : [716/885] 4070350=test_queue I, [2024-05-07T00:35:54.756602 #4028984] INFO -- : [717/885] 4070350=test_tempfile I, [2024-05-07T00:35:54.829318 #4028984] INFO -- : [718/885] 4070362=parse_comments_test I, [2024-05-07T00:35:54.846998 #4028984] INFO -- : [719/885] 4070351=test_noarg I, [2024-05-07T00:35:54.872174 #4028984] INFO -- : [720/885] 4070356=test_duplicate I, [2024-05-07T00:35:54.877675 #4028984] INFO -- : [721/885] 4070356=test_utf32 I, [2024-05-07T00:35:54.887893 #4028984] INFO -- : [722/885] 4070356=test_basicsocket I, [2024-05-07T00:35:54.905262 #4028984] INFO -- : [723/885] 4070362=test_tracepoint I, [2024-05-07T00:35:54.929256 #4028984] INFO -- : [724/885] 4070356=test_prettyprint I, [2024-05-07T00:35:54.945020 #4028984] INFO -- : [725/885] 4070355=test_gem_commands_help_command I, [2024-05-07T00:35:54.949481 #4028984] INFO -- : [726/885] 4070354=test_rdoc_markup I, [2024-05-07T00:35:54.957184 #4028984] INFO -- : [727/885] 4070354=test_internal_ivar I, [2024-05-07T00:35:54.961851 #4028984] INFO -- : [728/885] 4070354=test_gem_resolver_index_specification I, [2024-05-07T00:35:54.971615 #4028984] INFO -- : [729/885] 4070356=test_reqarg I, [2024-05-07T00:35:54.990213 #4028984] INFO -- : [730/885] 4070344=test_rdoc_include I, [2024-05-07T00:35:55.008869 #4028984] INFO -- : [731/885] 4070354=test_stack I, [2024-05-07T00:35:55.015408 #4028984] INFO -- : [732/885] 4070357=test_gem_commands_list_command I, [2024-05-07T00:35:55.032230 #4028984] INFO -- : [733/885] 4070357=test_too_many_dummy_encodings I, [2024-05-07T00:35:55.036575 #4028984] INFO -- : [734/885] 4070355=test_gem_version I, [2024-05-07T00:35:55.070408 #4028984] INFO -- : [735/885] 4070351=test_econv I, [2024-05-07T00:35:55.077940 #4028984] INFO -- : [736/885] 4070344=test_cesu8 I, [2024-05-07T00:35:55.078789 #4028984] INFO -- : [737/885] 4070350=test_rdoc_options I, [2024-05-07T00:35:55.086346 #4028984] INFO -- : [738/885] 4070344=test_string_processing I, [2024-05-07T00:35:55.087750 #4028984] INFO -- : [739/885] 4070357=test_fileutils I, [2024-05-07T00:35:55.111772 #4028984] INFO -- : [740/885] 4070344=test_ldap I, [2024-05-07T00:35:55.130611 #4028984] INFO -- : [741/885] 4070344=test_emitter I, [2024-05-07T00:35:55.137101 #4028984] INFO -- : [742/885] 4070344=test_resource I, [2024-05-07T00:35:55.142127 #4028984] INFO -- : [743/885] 4070355=test_gem_commands_signin_command I, [2024-05-07T00:35:55.147101 #4028984] INFO -- : [744/885] 4070362=test_gem_stub_specification I, [2024-05-07T00:35:55.166530 #4028984] INFO -- : [745/885] 4070344=test_method_cache I, [2024-05-07T00:35:55.170374 #4028984] INFO -- : [746/885] 4070344=test_frozen_error I, [2024-05-07T00:35:55.177702 #4028984] INFO -- : [747/885] 4070344=test_gem_ext_ext_conf_builder I, [2024-05-07T00:35:55.267392 #4028984] INFO -- : [748/885] 4070355=test_complex I, [2024-05-07T00:35:55.292610 #4028984] INFO -- : [749/885] 4070362=test_gem_commands_search_command I, [2024-05-07T00:35:55.304004 #4028984] INFO -- : [750/885] 4070362=test_inlinecache I, [2024-05-07T00:35:55.318634 #4028984] INFO -- : [751/885] 4070350=test_rdoc_markup_verbatim I, [2024-05-07T00:35:55.323489 #4028984] INFO -- : [752/885] 4070350=test_path_to_class I, [2024-05-07T00:35:55.327199 #4028984] INFO -- : [753/885] 4070350=test_gem_resolver_specification I, [2024-05-07T00:35:55.357707 #4028984] INFO -- : [754/885] 4070350=test_gem_dependency I, [2024-05-07T00:35:55.364624 #4028984] INFO -- : [755/885] 4070362=test_parse I, [2024-05-07T00:35:55.419794 #4028984] INFO -- : [756/885] 4070355=test_mdns I, [2024-05-07T00:35:55.438238 #4028984] INFO -- : [757/885] 4070356=test_gem_remote_fetcher I, [2024-05-07T00:35:55.447396 #4028984] INFO -- : [758/885] 4070355=test_scanner_events I, [2024-05-07T00:35:55.480861 #4028984] INFO -- : [759/885] 4070350=test_gem_resolver_installed_specification I, [2024-05-07T00:35:55.488815 #4028984] INFO -- : [760/885] 4070355=test_string_memory I, [2024-05-07T00:35:55.515099 #4028984] INFO -- : [761/885] 4070350=comments_test I, [2024-05-07T00:35:55.564437 #4028984] INFO -- : [762/885] 4070355=test_sprintf I, [2024-05-07T00:35:55.615754 #4028984] INFO -- : [763/885] 4070350=test_gem_requirement I, [2024-05-07T00:35:55.658799 #4028984] INFO -- : [764/885] 4070357=test_gem_security_trust_dir I, [2024-05-07T00:35:55.698625 #4028984] INFO -- : [765/885] 4070357=test_line_editor I, [2024-05-07T00:35:55.716894 #4028984] INFO -- : [766/885] 4070357=test_objspace I, [2024-05-07T00:35:55.724402 #4028984] INFO -- : [767/885] 4070358=ripper_test I, [2024-05-07T00:35:55.754107 #4028984] INFO -- : [768/885] 4070350=test_undef I, [2024-05-07T00:35:55.762608 #4028984] INFO -- : [769/885] 4070350=test_lock_native_thread I, [2024-05-07T00:35:55.832193 #4028984] INFO -- : [770/885] 4070355=test_c_struct_entry I, [2024-05-07T00:35:55.936611 #4028984] INFO -- : [771/885] 4070362=test_gem_commands_stale_command I, [2024-05-07T00:35:55.948327 #4028984] INFO -- : [772/885] 4070362=test_remote_fetch_error I, [2024-05-07T00:35:55.963957 #4028984] INFO -- : [773/885] 4070362=test_have_library I, [2024-05-07T00:35:56.080708 #4028984] INFO -- : [774/885] 4070350=test_show_source I, [2024-05-07T00:35:56.176410 #4028984] INFO -- : [775/885] 4070354=test_set I, [2024-05-07T00:35:56.183726 #4028984] INFO -- : [776/885] 4070350=test_gem_request_set_lockfile I, [2024-05-07T00:35:56.184226 #4028984] INFO -- : [777/885] 4070354=test_raise_exception I, [2024-05-07T00:35:56.235497 #4028984] INFO -- : [778/885] 4070358=test_protect I, [2024-05-07T00:35:56.238073 #4028984] INFO -- : [779/885] 4070351=test_win32ole_typelib I, [2024-05-07T00:35:56.243126 #4028984] INFO -- : [780/885] 4070358=test_tree_builder I, [2024-05-07T00:35:56.245188 #4028984] INFO -- : [781/885] 4070358=test_gem_resolver_dependency_request I, [2024-05-07T00:35:56.245251 #4028984] INFO -- : [782/885] 4070351=test_hash I, [2024-05-07T00:35:56.264936 #4028984] INFO -- : [783/885] 4070351=test_postponed_job I, [2024-05-07T00:35:56.275766 #4028984] INFO -- : [784/885] 4070358=test_alias_and_anchor I, [2024-05-07T00:35:56.287938 #4028984] INFO -- : [785/885] 4070358=test_external_new I, [2024-05-07T00:35:56.292275 #4028984] INFO -- : [786/885] 4070358=test_kill_ring I, [2024-05-07T00:35:56.298011 #4028984] INFO -- : [787/885] 4070355=test_ns_spki I, [2024-05-07T00:35:56.307417 #4028984] INFO -- : [788/885] 4070358=test_framework I, [2024-05-07T00:35:56.324785 #4028984] INFO -- : [789/885] 4070358=test_argf I, [2024-05-07T00:35:56.338283 #4028984] INFO -- : [790/885] 4070355=test_ws I, [2024-05-07T00:35:56.341370 #4028984] INFO -- : [791/885] 4070355=test_gem_commands_environment_command I, [2024-05-07T00:35:56.392953 #4028984] INFO -- : [792/885] 4070355=test_m17n I, [2024-05-07T00:35:56.398933 #4028984] INFO -- : [793/885] 4070345=test_workspace I, [2024-05-07T00:35:56.457365 #4028984] INFO -- : [794/885] 4070355=test_weakmap I, [2024-05-07T00:35:56.459568 #4028984] INFO -- : [795/885] 4070344=test_yjit I, [2024-05-07T00:35:56.467275 #4028984] INFO -- : [796/885] 4070344=test_ellipsize I, [2024-05-07T00:35:56.483010 #4028984] INFO -- : [797/885] 4070344=test_date_attr I, [2024-05-07T00:35:56.488290 #4028984] INFO -- : [798/885] 4070344=test_io_wait I, [2024-05-07T00:35:56.534072 #4028984] INFO -- : [799/885] 4070350=test_gem_commands_exec_command I, [2024-05-07T00:35:56.570520 #4028984] INFO -- : [800/885] 4070345=warnings_test I, [2024-05-07T00:35:56.639562 #4028984] INFO -- : [801/885] 4070351=test_kwargs I, [2024-05-07T00:35:56.642684 #4028984] INFO -- : [802/885] 4070351=test_type_completor I, [2024-05-07T00:35:56.648318 #4028984] INFO -- : [803/885] 4070351=test_console_attr I, [2024-05-07T00:35:56.649076 #4028984] INFO -- : [804/885] 4070351=test_summary I, [2024-05-07T00:35:56.664454 #4028984] INFO -- : [805/885] 4070345=test_cp949 I, [2024-05-07T00:35:56.677362 #4028984] INFO -- : [806/885] 4070345=test_gem_commands_uninstall_command I, [2024-05-07T00:35:56.710907 #4028984] INFO -- : [807/885] 4070351=test_gem_source_specific_file I, [2024-05-07T00:35:56.799515 #4028984] INFO -- : [808/885] 4070351=test_foreach I, [2024-05-07T00:35:56.805032 #4028984] INFO -- : [809/885] 4070351=test_condition I, [2024-05-07T00:35:56.806283 #4028984] INFO -- : [810/885] 4070351=test_gem_unsatisfiable_dependency_error I, [2024-05-07T00:35:56.817507 #4028984] INFO -- : [811/885] 4070344=test_win32ole_record I, [2024-05-07T00:35:56.819004 #4028984] INFO -- : [812/885] 4070351=test_sorted_set I, [2024-05-07T00:35:56.820480 #4028984] INFO -- : [813/885] 4070354=test_win32ole_type_event I, [2024-05-07T00:35:56.824341 #4028984] INFO -- : [814/885] 4070344=test_emoji I, [2024-05-07T00:35:56.834362 #4028984] INFO -- : [815/885] 4070354=test_ubf_async_safe I, [2024-05-07T00:35:56.836517 #4028984] INFO -- : [816/885] 4070354=test_hash I, [2024-05-07T00:35:56.864025 #4028984] INFO -- : [817/885] 4070344=test_io I, [2024-05-07T00:35:56.875865 #4028984] INFO -- : [818/885] 4070352=test_pattern_key_name_check I, [2024-05-07T00:35:56.884456 #4028984] INFO -- : [819/885] 4070352=test_to_ruby I, [2024-05-07T00:35:56.898988 #4028984] INFO -- : [820/885] 4070352=test_gem_impossible_dependencies_error I, [2024-05-07T00:35:56.921238 #4028984] INFO -- : [821/885] 4070352=test_array_create I, [2024-05-07T00:35:56.922173 #4028984] INFO -- : [822/885] 4070352=test_pack I, [2024-05-07T00:35:57.034788 #4028984] INFO -- : [823/885] 4070351=test_gem_commands_query_command I, [2024-05-07T00:35:57.075320 #4028984] INFO -- : [824/885] 4070352=test_method I, [2024-05-07T00:35:57.096751 #4028984] INFO -- : [825/885] 4070344=test_rdoc_rubygems_hook I, [2024-05-07T00:35:57.167043 #4028984] INFO -- : [826/885] 4070362=test_rdoc_context_section I, [2024-05-07T00:35:57.184176 #4028984] INFO -- : [827/885] 4070362=test_euc_kr I, [2024-05-07T00:35:57.184238 #4028984] INFO -- : [828/885] 4070362=test_ftp I, [2024-05-07T00:35:57.185218 #4028984] INFO -- : [829/885] 4070362=test_gem_package_tar_header I, [2024-05-07T00:35:57.189889 #4028984] INFO -- : [830/885] 4070344=test_gem_util I, [2024-05-07T00:35:57.218913 #4028984] INFO -- : [831/885] 4070343=test_iseq_load I, [2024-05-07T00:35:57.233856 #4028984] INFO -- : [832/885] 4070362=test_pkey_dh I, [2024-05-07T00:35:57.314497 #4028984] INFO -- : [833/885] 4070362=test_bigzero I, [2024-05-07T00:35:57.318579 #4028984] INFO -- : [834/885] 4070362=test_system I, [2024-05-07T00:35:57.368946 #4028984] INFO -- : [835/885] 4070345=test_pkcs12 I, [2024-05-07T00:35:57.372721 #4028984] INFO -- : [836/885] 4070344=test_etc I, [2024-05-07T00:35:57.482962 #4028984] INFO -- : [837/885] 4070344=test_yjit_exit_locations I, [2024-05-07T00:35:57.484178 #4028984] INFO -- : [838/885] 4070344=test_getopts I, [2024-05-07T00:35:57.488966 #4028984] INFO -- : [839/885] 4070344=test_protocol I, [2024-05-07T00:35:57.525311 #4028984] INFO -- : [840/885] 4070351=test_gem_resolver_activation_request I, [2024-05-07T00:35:57.549245 #4028984] INFO -- : [841/885] 4070351=test_gem_config_file I, [2024-05-07T00:35:57.628108 #4028984] INFO -- : [842/885] 4070359=test_ripper I, [2024-05-07T00:35:57.682172 #4028984] INFO -- : [843/885] 4070351=test_sleep I, [2024-05-07T00:35:57.683964 #4028984] INFO -- : [844/885] 4070350=test_config I, [2024-05-07T00:35:57.725150 #4028984] INFO -- : [845/885] 4070350=test_libs I, [2024-05-07T00:35:57.730469 #4028984] INFO -- : [846/885] 4070345=test_math I, [2024-05-07T00:35:57.737234 #4028984] INFO -- : [847/885] 4070345=test_gem_commands_fetch_command I, [2024-05-07T00:35:57.751257 #4028984] INFO -- : [848/885] 4070350=test_gc I, [2024-05-07T00:35:57.752057 #4028984] INFO -- : [849/885] 4070350=test_yaml_tree I, [2024-05-07T00:35:57.778509 #4028984] INFO -- : [850/885] 4070350=test_rendering I, [2024-05-07T00:35:57.791847 #4028984] INFO -- : [851/885] 4070350=test_sizeof I, [2024-05-07T00:35:57.802129 #4028984] INFO -- : [852/885] 4070344=test_case I, [2024-05-07T00:35:57.819325 #4028984] INFO -- : [853/885] 4070356=test_face I, [2024-05-07T00:35:57.844583 #4028984] INFO -- : [854/885] 4070344=test_io I, [2024-05-07T00:35:57.862177 #4028984] INFO -- : [855/885] 4070356=test_unicode_escape I, [2024-05-07T00:35:57.891292 #4028984] INFO -- : [856/885] 4070353=test_utf16 I, [2024-05-07T00:35:57.893844 #4028984] INFO -- : [857/885] 4070345=test_autoload I, [2024-05-07T00:35:57.903117 #4028984] INFO -- : [858/885] 4070353=test_rdoc_markup_indented_paragraph I, [2024-05-07T00:35:57.909188 #4028984] INFO -- : [859/885] 4070353=test_gem_resolver_conflict I, [2024-05-07T00:35:57.918590 #4028984] INFO -- : [860/885] 4070343=test_rdoc_task I, [2024-05-07T00:35:57.928292 #4028984] INFO -- : [861/885] 4070343=test_backtrace I, [2024-05-07T00:35:57.936843 #4028984] INFO -- : [862/885] 4070356=test_pack I, [2024-05-07T00:35:57.964584 #4028984] INFO -- : [863/885] 4070356=ruby_parser_test I, [2024-05-07T00:35:57.968111 #4028984] INFO -- : [864/885] 4070356=test_io_buffer I, [2024-05-07T00:35:58.054995 #4028984] INFO -- : [865/885] 4070359=test_readpartial I, [2024-05-07T00:35:58.063376 #4028984] INFO -- : [866/885] 4070353=test_clone I, [2024-05-07T00:35:58.077971 #4028984] INFO -- : [867/885] 4070356=test_gem_commands_install_command I, [2024-05-07T00:35:58.257871 #4028984] INFO -- : [868/885] 4070353=test_rdoc_require I, [2024-05-07T00:35:58.306604 #4028984] INFO -- : [869/885] 4070353=locals_test I, [2024-05-07T00:35:58.459593 #4028984] INFO -- : [870/885] 4070359=test_rdoc_markup_to_html_crossref I, [2024-05-07T00:35:58.508025 #4028984] INFO -- : [871/885] 4070362=encoding_test I, [2024-05-07T00:35:58.592856 #4028984] INFO -- : [872/885] 4070362=test_gem_resolver_best_set I, [2024-05-07T00:35:58.648858 #4028984] INFO -- : [873/885] 4070362=test_typeddata I, [2024-05-07T00:35:58.706311 #4028984] INFO -- : [874/885] 4070353=test_rat I, [2024-05-07T00:35:58.726459 #4028984] INFO -- : [875/885] 4070353=test_rdoc_markup_raw I, [2024-05-07T00:35:58.730732 #4028984] INFO -- : [876/885] 4070353=test_webauthn_poller I, [2024-05-07T00:35:58.733338 #4028984] INFO -- : [877/885] 4070359=test_optparse I, [2024-05-07T00:35:58.794318 #4028984] INFO -- : [878/885] 4070359=test_array I, [2024-05-07T00:35:58.801187 #4028984] INFO -- : [879/885] 4070359=test_fstring I, [2024-05-07T00:35:58.857418 #4028984] INFO -- : [880/885] 4070360=test_rdoc_alias I, [2024-05-07T00:35:58.871817 #4028984] INFO -- : [881/885] 4070360=test_yield I, [2024-05-07T00:35:58.876378 #4028984] INFO -- : [882/885] 4070353=parser_test I, [2024-05-07T00:35:58.883886 #4028984] INFO -- : [883/885] 4070362=test_convertible I, [2024-05-07T00:35:58.887469 #4028984] INFO -- : [884/885] 4070353=test_stringscanner I, [2024-05-07T00:35:58.923341 #4028984] INFO -- : [885/885] 4070353=test_files_sample I, [2024-05-07T00:36:17.563754 #4028984] INFO -- : Finished tests in 39.008125s, 676.2437 tests/s, 239782.8417 assertions/s. E, [2024-05-07T00:36:17.563963 #4028984] ERROR -- : Children under /tmp/rubytest.hvd0eq: E, [2024-05-07T00:36:17.563993 #4028984] ERROR -- : * drwx------ 4 80 2024-05-07 00:35:40 +0000 gem_rebuild20240507-4070346-c3lbwr/ E, [2024-05-07T00:36:17.564001 #4028984] ERROR -- : * drwxrwxr-x 2 60 2024-05-07 00:35:40 +0000 new/ E, [2024-05-07T00:36:17.564006 #4028984] ERROR -- : * -rw-rw-r-- 1 4096 2024-05-07 00:35:40 +0000 rebuild_test_gem-1.0.0.gem E, [2024-05-07T00:36:17.564010 #4028984] ERROR -- : * drwxrwxr-x 2 60 2024-05-07 00:35:40 +0000 old/ E, [2024-05-07T00:36:17.564014 #4028984] ERROR -- : * -rw-rw-r-- 1 4096 2024-05-07 00:35:40 +0000 rebuild_test_gem-1.0.0.gem I, [2024-05-07T00:36:17.565177 #4028984] INFO -- : 26379 tests, 9353479 assertions, 0 failures, 0 errors, 306 skips I, [2024-05-07T00:36:17.565186 #4028984] INFO -- : I, [2024-05-07T00:36:17.565193 #4028984] INFO -- : ruby -v: ruby 3.4.0dev (2024-05-06T23:06:13Z master 481e16d58b) [x86_64-linux] I, [2024-05-07T00:36:17.567265 #4028984] INFO -- : $$$[end] "make yes-test-all TESTOPTS='--stderr-on-failure' TESTS='-j20'" exit with 0. I, [2024-05-07T00:36:17.567419 #4028984] INFO -- : $$$[beg] make yes-test-rubyspec MSPECOPT='--error-output stderr --debug -j' TESTS='-j20' I, [2024-05-07T00:36:17.654037 #4028984] INFO -- : BASERUBY = /usr/bin/ruby --disable=gems I, [2024-05-07T00:36:17.654086 #4028984] INFO -- : CC = gcc I, [2024-05-07T00:36:17.654093 #4028984] INFO -- : LD = ld I, [2024-05-07T00:36:17.654097 #4028984] INFO -- : LDSHARED = gcc -shared I, [2024-05-07T00:36:17.654102 #4028984] INFO -- : CFLAGS = -O3 -fno-fast-math -ggdb3 -Wall -Wextra -Wdeprecated-declarations -Wdiv-by-zero -Wduplicated-cond -Wimplicit-function-declaration -Wimplicit-int -Wpointer-arith -Wwrite-strings -Wold-style-definition -Wimplicit-fallthrough=0 -Wmissing-noreturn -Wno-cast-function-type -Wno-constant-logical-operand -Wno-long-long -Wno-missing-field-initializers -Wno-overlength-strings -Wno-packed-bitfield-compat -Wno-parentheses-equality -Wno-self-assign -Wno-tautological-compare -Wno-unused-parameter -Wno-unused-value -Wsuggest-attribute=format -Wsuggest-attribute=noreturn -Wunused-variable -Wmisleading-indentation -Wundef -fPIC I, [2024-05-07T00:36:17.654106 #4028984] INFO -- : XCFLAGS = -U_FORTIFY_SOURCE -D_FORTIFY_SOURCE=2 -fstack-protector-strong -fno-strict-overflow -fvisibility=hidden -fexcess-precision=standard -DRUBY_EXPORT -I. -I.ext/include/x86_64-linux -I/tmp/ruby/src/trunk/include -I/tmp/ruby/src/trunk -I/tmp/ruby/src/trunk/prism -I/tmp/ruby/src/trunk/enc/unicode/15.0.0 I, [2024-05-07T00:36:17.654110 #4028984] INFO -- : CPPFLAGS = I, [2024-05-07T00:36:17.654114 #4028984] INFO -- : DLDFLAGS = -Wl,--compress-debug-sections=zlib -Wl,-soname,libruby.so.3.4 -fstack-protector-strong I, [2024-05-07T00:36:17.654118 #4028984] INFO -- : SOLIBS = -lz -lrt -lrt -lgmp -ldl -lcrypt -lm -lpthread I, [2024-05-07T00:36:17.654122 #4028984] INFO -- : LANG = en_US.UTF-8 I, [2024-05-07T00:36:17.654125 #4028984] INFO -- : LC_ALL = I, [2024-05-07T00:36:17.654129 #4028984] INFO -- : LC_CTYPE = I, [2024-05-07T00:36:17.654133 #4028984] INFO -- : MFLAGS = I, [2024-05-07T00:36:17.654136 #4028984] INFO -- : RUSTC = no I, [2024-05-07T00:36:17.654144 #4028984] INFO -- : YJIT_RUSTC_ARGS = --crate-name=yjit --crate-type=staticlib --edition=2021 -g -C lto=thin -C opt-level=3 -C overflow-checks=on '--out-dir=/tmp/ruby/build/trunk/yjit/target/release/' /tmp/ruby/src/trunk/yjit/src/lib.rs I, [2024-05-07T00:36:17.654735 #4028984] INFO -- : gcc (Ubuntu 11.4.0-1ubuntu1~22.04) 11.4.0 I, [2024-05-07T00:36:17.654761 #4028984] INFO -- : Copyright (C) 2021 Free Software Foundation, Inc. I, [2024-05-07T00:36:17.654770 #4028984] INFO -- : This is free software; see the source for copying conditions. There is NO I, [2024-05-07T00:36:17.654777 #4028984] INFO -- : warranty; not even for MERCHANTABILITY or FITNESS FOR A PARTICULAR PURPOSE. I, [2024-05-07T00:36:17.654784 #4028984] INFO -- : I, [2024-05-07T00:36:17.656457 #4028984] INFO -- : generating enc.mk I, [2024-05-07T00:36:17.774651 #4028984] INFO -- : making enc I, [2024-05-07T00:36:17.791873 #4028984] INFO -- : make[1]: Entering directory '/tmp/ruby/build/trunk' I, [2024-05-07T00:36:17.791899 #4028984] INFO -- : make[1]: Nothing to be done for 'enc'. I, [2024-05-07T00:36:17.791907 #4028984] INFO -- : make[1]: Leaving directory '/tmp/ruby/build/trunk' I, [2024-05-07T00:36:17.792554 #4028984] INFO -- : making srcs under enc I, [2024-05-07T00:36:17.822813 #4028984] INFO -- : make[1]: Entering directory '/tmp/ruby/build/trunk' I, [2024-05-07T00:36:17.822837 #4028984] INFO -- : make[1]: Nothing to be done for 'srcs'. I, [2024-05-07T00:36:17.822845 #4028984] INFO -- : make[1]: Leaving directory '/tmp/ruby/build/trunk' I, [2024-05-07T00:36:17.823698 #4028984] INFO -- : generating transdb.h I, [2024-05-07T00:36:17.918038 #4028984] INFO -- : transdb.h unchanged I, [2024-05-07T00:36:17.919463 #4028984] INFO -- : making trans I, [2024-05-07T00:36:17.953376 #4028984] INFO -- : make[1]: Entering directory '/tmp/ruby/build/trunk' I, [2024-05-07T00:36:17.953400 #4028984] INFO -- : make[1]: Nothing to be done for 'trans'. I, [2024-05-07T00:36:17.953409 #4028984] INFO -- : make[1]: Leaving directory '/tmp/ruby/build/trunk' I, [2024-05-07T00:36:17.954210 #4028984] INFO -- : making encs I, [2024-05-07T00:36:17.991608 #4028984] INFO -- : make[1]: Entering directory '/tmp/ruby/build/trunk' I, [2024-05-07T00:36:17.991641 #4028984] INFO -- : make[1]: Nothing to be done for 'encs'. I, [2024-05-07T00:36:17.991650 #4028984] INFO -- : make[1]: Leaving directory '/tmp/ruby/build/trunk' I, [2024-05-07T00:36:17.993576 #4028984] INFO -- : generating makefiles ext/configure-ext.mk I, [2024-05-07T00:36:18.020711 #4028984] INFO -- : ext/configure-ext.mk updated I, [2024-05-07T00:36:18.023168 #4028984] INFO -- : make[1]: Entering directory '/tmp/ruby/build/trunk' I, [2024-05-07T00:36:19.385305 #4028984] INFO -- : make[1]: Leaving directory '/tmp/ruby/build/trunk' I, [2024-05-07T00:36:19.385861 #4028984] INFO -- : generating makefile exts.mk I, [2024-05-07T00:36:19.422940 #4028984] INFO -- : exts.mk unchanged I, [2024-05-07T00:36:19.427670 #4028984] INFO -- : make[1]: Entering directory '/tmp/ruby/build/trunk' I, [2024-05-07T00:36:19.640359 #4028984] INFO -- : make[2]: Entering directory '/tmp/ruby/build/trunk/ext/coverage' I, [2024-05-07T00:36:19.643425 #4028984] INFO -- : make[2]: Leaving directory '/tmp/ruby/build/trunk/ext/coverage' I, [2024-05-07T00:36:19.647219 #4028984] INFO -- : make[2]: Entering directory '/tmp/ruby/build/trunk/ext/date' I, [2024-05-07T00:36:19.650343 #4028984] INFO -- : make[2]: Leaving directory '/tmp/ruby/build/trunk/ext/date' I, [2024-05-07T00:36:19.652590 #4028984] INFO -- : make[2]: Entering directory '/tmp/ruby/build/trunk/ext/digest' I, [2024-05-07T00:36:19.658090 #4028984] INFO -- : make[2]: Leaving directory '/tmp/ruby/build/trunk/ext/digest' I, [2024-05-07T00:36:19.673579 #4028984] INFO -- : make[2]: Entering directory '/tmp/ruby/build/trunk/ext/digest/sha2' I, [2024-05-07T00:36:19.676563 #4028984] INFO -- : make[2]: Leaving directory '/tmp/ruby/build/trunk/ext/digest/sha2' I, [2024-05-07T00:36:19.689406 #4028984] INFO -- : make[2]: Entering directory '/tmp/ruby/build/trunk/ext/fiddle' I, [2024-05-07T00:36:19.695956 #4028984] INFO -- : make[2]: Leaving directory '/tmp/ruby/build/trunk/ext/fiddle' I, [2024-05-07T00:36:19.698955 #4028984] INFO -- : make[2]: Entering directory '/tmp/ruby/build/trunk/ext/io/console' I, [2024-05-07T00:36:19.701561 #4028984] INFO -- : make[2]: Leaving directory '/tmp/ruby/build/trunk/ext/io/console' I, [2024-05-07T00:36:19.709062 #4028984] INFO -- : make[2]: Entering directory '/tmp/ruby/build/trunk/ext/json' I, [2024-05-07T00:36:19.715560 #4028984] INFO -- : make[2]: Leaving directory '/tmp/ruby/build/trunk/ext/json' I, [2024-05-07T00:36:19.724663 #4028984] INFO -- : make[2]: Entering directory '/tmp/ruby/build/trunk/ext/monitor' I, [2024-05-07T00:36:19.727161 #4028984] INFO -- : make[2]: Leaving directory '/tmp/ruby/build/trunk/ext/monitor' I, [2024-05-07T00:36:19.731295 #4028984] INFO -- : make[2]: Entering directory '/tmp/ruby/build/trunk/ext/objspace' I, [2024-05-07T00:36:19.735168 #4028984] INFO -- : make[2]: Leaving directory '/tmp/ruby/build/trunk/ext/objspace' I, [2024-05-07T00:36:19.747060 #4028984] INFO -- : make[2]: Entering directory '/tmp/ruby/build/trunk/ext/openssl' I, [2024-05-07T00:36:19.760349 #4028984] INFO -- : make[2]: Leaving directory '/tmp/ruby/build/trunk/ext/openssl' I, [2024-05-07T00:36:19.763164 #4028984] INFO -- : make[2]: Entering directory '/tmp/ruby/build/trunk/ext/pathname' I, [2024-05-07T00:36:19.765606 #4028984] INFO -- : make[2]: Leaving directory '/tmp/ruby/build/trunk/ext/pathname' I, [2024-05-07T00:36:19.769790 #4028984] INFO -- : make[2]: Entering directory '/tmp/ruby/build/trunk/ext/psych' I, [2024-05-07T00:36:19.784480 #4028984] INFO -- : make[2]: Leaving directory '/tmp/ruby/build/trunk/ext/psych' I, [2024-05-07T00:36:19.787475 #4028984] INFO -- : make[2]: Entering directory '/tmp/ruby/build/trunk/ext/pty' I, [2024-05-07T00:36:19.789983 #4028984] INFO -- : make[2]: Leaving directory '/tmp/ruby/build/trunk/ext/pty' I, [2024-05-07T00:36:19.799357 #4028984] INFO -- : make[2]: Entering directory '/tmp/ruby/build/trunk/ext/ripper' I, [2024-05-07T00:36:19.804238 #4028984] INFO -- : make[2]: Leaving directory '/tmp/ruby/build/trunk/ext/ripper' I, [2024-05-07T00:36:19.805660 #4028984] INFO -- : make[2]: Entering directory '/tmp/ruby/build/trunk/ext/rubyvm' I, [2024-05-07T00:36:19.807750 #4028984] INFO -- : make[2]: Leaving directory '/tmp/ruby/build/trunk/ext/rubyvm' I, [2024-05-07T00:36:19.815484 #4028984] INFO -- : make[2]: Entering directory '/tmp/ruby/build/trunk/ext/socket' I, [2024-05-07T00:36:19.821990 #4028984] INFO -- : make[2]: Leaving directory '/tmp/ruby/build/trunk/ext/socket' I, [2024-05-07T00:36:19.832942 #4028984] INFO -- : make[2]: Entering directory '/tmp/ruby/build/trunk/.bundle/gems/bigdecimal-3.1.7/ext/bigdecimal' I, [2024-05-07T00:36:19.856003 #4028984] INFO -- : make[2]: Leaving directory '/tmp/ruby/build/trunk/.bundle/gems/bigdecimal-3.1.7/ext/bigdecimal' I, [2024-05-07T00:36:19.857923 #4028984] INFO -- : make[2]: Entering directory '/tmp/ruby/build/trunk/.bundle/gems/debug-1.9.2/ext/debug' I, [2024-05-07T00:36:19.880224 #4028984] INFO -- : make[2]: Leaving directory '/tmp/ruby/build/trunk/.bundle/gems/debug-1.9.2/ext/debug' I, [2024-05-07T00:36:19.882025 #4028984] INFO -- : make[2]: Entering directory '/tmp/ruby/build/trunk/.bundle/gems/nkf-0.2.0/ext/nkf' I, [2024-05-07T00:36:19.903544 #4028984] INFO -- : make[2]: Leaving directory '/tmp/ruby/build/trunk/.bundle/gems/nkf-0.2.0/ext/nkf' I, [2024-05-07T00:36:19.905575 #4028984] INFO -- : make[2]: Entering directory '/tmp/ruby/build/trunk/.bundle/gems/racc-1.7.3/ext/racc/cparse' I, [2024-05-07T00:36:19.927648 #4028984] INFO -- : make[2]: Leaving directory '/tmp/ruby/build/trunk/.bundle/gems/racc-1.7.3/ext/racc/cparse' I, [2024-05-07T00:36:19.930143 #4028984] INFO -- : make[2]: Entering directory '/tmp/ruby/build/trunk/.bundle/gems/rbs-3.4.4/ext/rbs_extension' I, [2024-05-07T00:36:19.951775 #4028984] INFO -- : make[2]: Leaving directory '/tmp/ruby/build/trunk/.bundle/gems/rbs-3.4.4/ext/rbs_extension' I, [2024-05-07T00:36:19.953681 #4028984] INFO -- : make[2]: Entering directory '/tmp/ruby/build/trunk/.bundle/gems/syslog-0.1.2/ext/syslog' I, [2024-05-07T00:36:19.976353 #4028984] INFO -- : make[2]: Leaving directory '/tmp/ruby/build/trunk/.bundle/gems/syslog-0.1.2/ext/syslog' I, [2024-05-07T00:36:20.000616 #4028984] INFO -- : make[2]: Entering directory '/tmp/ruby/build/trunk' I, [2024-05-07T00:36:20.065155 #4028984] INFO -- : make[2]: 'ruby' is up to date. I, [2024-05-07T00:36:20.065193 #4028984] INFO -- : make[2]: Leaving directory '/tmp/ruby/build/trunk' I, [2024-05-07T00:36:20.065512 #4028984] INFO -- : make[1]: Leaving directory '/tmp/ruby/build/trunk' I, [2024-05-07T00:36:20.069096 #4028984] INFO -- : make[1]: Entering directory '/tmp/ruby/build/trunk' I, [2024-05-07T00:36:20.069118 #4028984] INFO -- : make[1]: Nothing to be done for 'note'. I, [2024-05-07T00:36:20.069124 #4028984] INFO -- : make[1]: Leaving directory '/tmp/ruby/build/trunk' E, [2024-05-07T00:36:20.127590 #4028984] ERROR -- : $ /tmp/ruby/build/trunk/miniruby -I/tmp/ruby/src/trunk/lib /tmp/ruby/src/trunk/tool/runruby.rb --archdir=/tmp/ruby/build/trunk --extout=.ext -- /tmp/ruby/src/trunk/spec/mspec/bin/mspec-run -B /tmp/ruby/src/trunk/spec/default.mspec --error-output stderr --debug -fy -o /tmp/rubytest.91n2gx/1-mspec-multi-0 E, [2024-05-07T00:36:20.127691 #4028984] ERROR -- : $ /tmp/ruby/build/trunk/miniruby -I/tmp/ruby/src/trunk/lib /tmp/ruby/src/trunk/tool/runruby.rb --archdir=/tmp/ruby/build/trunk --extout=.ext -- /tmp/ruby/src/trunk/spec/mspec/bin/mspec-run -B /tmp/ruby/src/trunk/spec/default.mspec --error-output stderr --debug -fy -o /tmp/rubytest.91n2gx/2-mspec-multi-1 E, [2024-05-07T00:36:20.127885 #4028984] ERROR -- : $ /tmp/ruby/build/trunk/miniruby -I/tmp/ruby/src/trunk/lib /tmp/ruby/src/trunk/tool/runruby.rb --archdir=/tmp/ruby/build/trunk --extout=.ext -- /tmp/ruby/src/trunk/spec/mspec/bin/mspec-run -B /tmp/ruby/src/trunk/spec/default.mspec --error-output stderr --debug -fy -o /tmp/rubytest.91n2gx/3-mspec-multi-2 E, [2024-05-07T00:36:20.128076 #4028984] ERROR -- : $ /tmp/ruby/build/trunk/miniruby -I/tmp/ruby/src/trunk/lib /tmp/ruby/src/trunk/tool/runruby.rb --archdir=/tmp/ruby/build/trunk --extout=.ext -- /tmp/ruby/src/trunk/spec/mspec/bin/mspec-run -B /tmp/ruby/src/trunk/spec/default.mspec --error-output stderr --debug -fy -o /tmp/rubytest.91n2gx/4-mspec-multi-3 E, [2024-05-07T00:36:20.128393 #4028984] ERROR -- : $ /tmp/ruby/build/trunk/miniruby -I/tmp/ruby/src/trunk/lib /tmp/ruby/src/trunk/tool/runruby.rb --archdir=/tmp/ruby/build/trunk --extout=.ext -- /tmp/ruby/src/trunk/spec/mspec/bin/mspec-run -B /tmp/ruby/src/trunk/spec/default.mspec --error-output stderr --debug -fy -o /tmp/rubytest.91n2gx/5-mspec-multi-4 E, [2024-05-07T00:36:20.128722 #4028984] ERROR -- : $ /tmp/ruby/build/trunk/miniruby -I/tmp/ruby/src/trunk/lib /tmp/ruby/src/trunk/tool/runruby.rb --archdir=/tmp/ruby/build/trunk --extout=.ext -- /tmp/ruby/src/trunk/spec/mspec/bin/mspec-run -B /tmp/ruby/src/trunk/spec/default.mspec --error-output stderr --debug -fy -o /tmp/rubytest.91n2gx/6-mspec-multi-5 E, [2024-05-07T00:36:20.128970 #4028984] ERROR -- : $ /tmp/ruby/build/trunk/miniruby -I/tmp/ruby/src/trunk/lib /tmp/ruby/src/trunk/tool/runruby.rb --archdir=/tmp/ruby/build/trunk --extout=.ext -- /tmp/ruby/src/trunk/spec/mspec/bin/mspec-run -B /tmp/ruby/src/trunk/spec/default.mspec --error-output stderr --debug -fy -o /tmp/rubytest.91n2gx/7-mspec-multi-6 E, [2024-05-07T00:36:20.129264 #4028984] ERROR -- : $ /tmp/ruby/build/trunk/miniruby -I/tmp/ruby/src/trunk/lib /tmp/ruby/src/trunk/tool/runruby.rb --archdir=/tmp/ruby/build/trunk --extout=.ext -- /tmp/ruby/src/trunk/spec/mspec/bin/mspec-run -B /tmp/ruby/src/trunk/spec/default.mspec --error-output stderr --debug -fy -o /tmp/rubytest.91n2gx/8-mspec-multi-7 E, [2024-05-07T00:36:20.129644 #4028984] ERROR -- : $ /tmp/ruby/build/trunk/miniruby -I/tmp/ruby/src/trunk/lib /tmp/ruby/src/trunk/tool/runruby.rb --archdir=/tmp/ruby/build/trunk --extout=.ext -- /tmp/ruby/src/trunk/spec/mspec/bin/mspec-run -B /tmp/ruby/src/trunk/spec/default.mspec --error-output stderr --debug -fy -o /tmp/rubytest.91n2gx/9-mspec-multi-8 E, [2024-05-07T00:36:20.129944 #4028984] ERROR -- : $ /tmp/ruby/build/trunk/miniruby -I/tmp/ruby/src/trunk/lib /tmp/ruby/src/trunk/tool/runruby.rb --archdir=/tmp/ruby/build/trunk --extout=.ext -- /tmp/ruby/src/trunk/spec/mspec/bin/mspec-run -B /tmp/ruby/src/trunk/spec/default.mspec --error-output stderr --debug -fy -o /tmp/rubytest.91n2gx/10-mspec-multi-9 E, [2024-05-07T00:36:20.130200 #4028984] ERROR -- : $ /tmp/ruby/build/trunk/miniruby -I/tmp/ruby/src/trunk/lib /tmp/ruby/src/trunk/tool/runruby.rb --archdir=/tmp/ruby/build/trunk --extout=.ext -- /tmp/ruby/src/trunk/spec/mspec/bin/mspec-run -B /tmp/ruby/src/trunk/spec/default.mspec --error-output stderr --debug -fy -o /tmp/rubytest.91n2gx/11-mspec-multi-10 E, [2024-05-07T00:36:20.130487 #4028984] ERROR -- : $ /tmp/ruby/build/trunk/miniruby -I/tmp/ruby/src/trunk/lib /tmp/ruby/src/trunk/tool/runruby.rb --archdir=/tmp/ruby/build/trunk --extout=.ext -- /tmp/ruby/src/trunk/spec/mspec/bin/mspec-run -B /tmp/ruby/src/trunk/spec/default.mspec --error-output stderr --debug -fy -o /tmp/rubytest.91n2gx/12-mspec-multi-11 E, [2024-05-07T00:36:20.130664 #4028984] ERROR -- : $ /tmp/ruby/build/trunk/miniruby -I/tmp/ruby/src/trunk/lib /tmp/ruby/src/trunk/tool/runruby.rb --archdir=/tmp/ruby/build/trunk --extout=.ext -- /tmp/ruby/src/trunk/spec/mspec/bin/mspec-run -B /tmp/ruby/src/trunk/spec/default.mspec --error-output stderr --debug -fy -o /tmp/rubytest.91n2gx/13-mspec-multi-12 E, [2024-05-07T00:36:20.130832 #4028984] ERROR -- : $ /tmp/ruby/build/trunk/miniruby -I/tmp/ruby/src/trunk/lib /tmp/ruby/src/trunk/tool/runruby.rb --archdir=/tmp/ruby/build/trunk --extout=.ext -- /tmp/ruby/src/trunk/spec/mspec/bin/mspec-run -B /tmp/ruby/src/trunk/spec/default.mspec --error-output stderr --debug -fy -o /tmp/rubytest.91n2gx/14-mspec-multi-13 E, [2024-05-07T00:36:20.131056 #4028984] ERROR -- : $ /tmp/ruby/build/trunk/miniruby -I/tmp/ruby/src/trunk/lib /tmp/ruby/src/trunk/tool/runruby.rb --archdir=/tmp/ruby/build/trunk --extout=.ext -- /tmp/ruby/src/trunk/spec/mspec/bin/mspec-run -B /tmp/ruby/src/trunk/spec/default.mspec --error-output stderr --debug -fy -o /tmp/rubytest.91n2gx/15-mspec-multi-14 E, [2024-05-07T00:36:20.131226 #4028984] ERROR -- : $ /tmp/ruby/build/trunk/miniruby -I/tmp/ruby/src/trunk/lib /tmp/ruby/src/trunk/tool/runruby.rb --archdir=/tmp/ruby/build/trunk --extout=.ext -- /tmp/ruby/src/trunk/spec/mspec/bin/mspec-run -B /tmp/ruby/src/trunk/spec/default.mspec --error-output stderr --debug -fy -o /tmp/rubytest.91n2gx/16-mspec-multi-15 E, [2024-05-07T00:36:20.131394 #4028984] ERROR -- : $ /tmp/ruby/build/trunk/miniruby -I/tmp/ruby/src/trunk/lib /tmp/ruby/src/trunk/tool/runruby.rb --archdir=/tmp/ruby/build/trunk --extout=.ext -- /tmp/ruby/src/trunk/spec/mspec/bin/mspec-run -B /tmp/ruby/src/trunk/spec/default.mspec --error-output stderr --debug -fy -o /tmp/rubytest.91n2gx/17-mspec-multi-16 E, [2024-05-07T00:36:20.131590 #4028984] ERROR -- : $ /tmp/ruby/build/trunk/miniruby -I/tmp/ruby/src/trunk/lib /tmp/ruby/src/trunk/tool/runruby.rb --archdir=/tmp/ruby/build/trunk --extout=.ext -- /tmp/ruby/src/trunk/spec/mspec/bin/mspec-run -B /tmp/ruby/src/trunk/spec/default.mspec --error-output stderr --debug -fy -o /tmp/rubytest.91n2gx/18-mspec-multi-17 E, [2024-05-07T00:36:20.134562 #4028984] ERROR -- : $ /tmp/ruby/build/trunk/miniruby -I/tmp/ruby/src/trunk/lib /tmp/ruby/src/trunk/tool/runruby.rb --archdir=/tmp/ruby/build/trunk --extout=.ext -- /tmp/ruby/src/trunk/spec/mspec/bin/mspec-run -B /tmp/ruby/src/trunk/spec/default.mspec --error-output stderr --debug -fy -o /tmp/rubytest.91n2gx/19-mspec-multi-18 E, [2024-05-07T00:36:20.134934 #4028984] ERROR -- : $ /tmp/ruby/build/trunk/miniruby -I/tmp/ruby/src/trunk/lib /tmp/ruby/src/trunk/tool/runruby.rb --archdir=/tmp/ruby/build/trunk --extout=.ext -- /tmp/ruby/src/trunk/spec/mspec/bin/mspec-run -B /tmp/ruby/src/trunk/spec/default.mspec --error-output stderr --debug -fy -o /tmp/rubytest.91n2gx/20-mspec-multi-19 I, [2024-05-07T00:36:20.312709 #4028984] INFO -- : ruby 3.4.0dev (2024-05-06T23:06:13Z master 481e16d58b) [x86_64-linux] I, [2024-05-07T00:36:20.995951 #4028984] INFO -- : 0 ......................................................................... I, [2024-05-07T00:36:21.391865 #4028984] INFO -- : 73 ......................................................................... I, [2024-05-07T00:36:21.513933 #4028984] INFO -- : 146 ......................................................................... I, [2024-05-07T00:36:21.565625 #4028984] INFO -- : 219 ......................................................................... I, [2024-05-07T00:36:21.634276 #4028984] INFO -- : 292 ......................................................................... I, [2024-05-07T00:36:21.670851 #4028984] INFO -- : 365 ......................................................................... I, [2024-05-07T00:36:21.694386 #4028984] INFO -- : 438 ......................................................................... I, [2024-05-07T00:36:21.713952 #4028984] INFO -- : 511 ......................................................................... I, [2024-05-07T00:36:21.733643 #4028984] INFO -- : 584 ......................................................................... I, [2024-05-07T00:36:21.783369 #4028984] INFO -- : 657 ......................................................................... I, [2024-05-07T00:36:21.805238 #4028984] INFO -- : 730 ......................................................................... I, [2024-05-07T00:36:21.832777 #4028984] INFO -- : 803 ......................................................................... I, [2024-05-07T00:36:21.869133 #4028984] INFO -- : 876 ......................................................................... I, [2024-05-07T00:36:21.924360 #4028984] INFO -- : 949 ......................................................................... I, [2024-05-07T00:36:22.025711 #4028984] INFO -- : 1022 ......................................................................... I, [2024-05-07T00:36:22.199269 #4028984] INFO -- : 1095 ......................................................................... I, [2024-05-07T00:36:22.315027 #4028984] INFO -- : 1168 ......................................................................... I, [2024-05-07T00:36:22.377315 #4028984] INFO -- : 1241 ......................................................................... I, [2024-05-07T00:36:22.424044 #4028984] INFO -- : 1314 ......................................................................... I, [2024-05-07T00:36:22.441609 #4028984] INFO -- : 1387 ......................................................................... I, [2024-05-07T00:36:22.553947 #4028984] INFO -- : 1460 ......................................................................... I, [2024-05-07T00:36:23.025675 #4028984] INFO -- : 1533 ......................................................................... I, [2024-05-07T00:36:23.077249 #4028984] INFO -- : 1606 ......................................................................... I, [2024-05-07T00:36:23.180135 #4028984] INFO -- : 1679 ......................................................................... I, [2024-05-07T00:36:23.302261 #4028984] INFO -- : 1752 ......................................................................... I, [2024-05-07T00:36:23.394184 #4028984] INFO -- : 1825 ......................................................................... I, [2024-05-07T00:36:23.477151 #4028984] INFO -- : 1898 ......................................................................... I, [2024-05-07T00:36:23.588105 #4028984] INFO -- : 1971 ......................................................................... I, [2024-05-07T00:36:23.650011 #4028984] INFO -- : 2044 ......................................................................... I, [2024-05-07T00:36:23.702581 #4028984] INFO -- : 2117 ......................................................................... I, [2024-05-07T00:36:23.718884 #4028984] INFO -- : 2190 ......................................................................... I, [2024-05-07T00:36:23.740979 #4028984] INFO -- : 2263 ......................................................................... I, [2024-05-07T00:36:23.755890 #4028984] INFO -- : 2336 ......................................................................... I, [2024-05-07T00:36:23.794781 #4028984] INFO -- : 2409 ......................................................................... I, [2024-05-07T00:36:23.901557 #4028984] INFO -- : 2482 ......................................................................... I, [2024-05-07T00:36:23.925845 #4028984] INFO -- : 2555 ......................................................................... I, [2024-05-07T00:36:24.028805 #4028984] INFO -- : 2628 ......................................................................... I, [2024-05-07T00:36:24.120888 #4028984] INFO -- : 2701 ......................................................................... I, [2024-05-07T00:36:24.166288 #4028984] INFO -- : 2774 ......................................................................... I, [2024-05-07T00:36:24.225656 #4028984] INFO -- : 2847 ......................................................................... I, [2024-05-07T00:36:24.269058 #4028984] INFO -- : 2920 ......................................................................... I, [2024-05-07T00:36:24.296598 #4028984] INFO -- : 2993 ......................................................................... I, [2024-05-07T00:36:24.321517 #4028984] INFO -- : 3066 ......................................................................... I, [2024-05-07T00:36:24.334190 #4028984] INFO -- : 3139 ......................................................................... I, [2024-05-07T00:36:24.342909 #4028984] INFO -- : 3212 ......................................................................... I, [2024-05-07T00:36:24.374341 #4028984] INFO -- : 3285 ......................................................................... I, [2024-05-07T00:36:28.331248 #4028984] INFO -- : 3358 ........................................................................ I, [2024-05-07T00:36:28.331297 #4028984] INFO -- : I, [2024-05-07T00:36:28.331304 #4028984] INFO -- : Finished in 8.202932 seconds I, [2024-05-07T00:36:28.331309 #4028984] INFO -- : I, [2024-05-07T00:36:28.331312 #4028984] INFO -- : 3429 files, 32610 examples, 169276 expectations, 0 failures, 0 errors, 0 tagged I, [2024-05-07T00:36:28.333263 #4028984] INFO -- : $$$[end] "make yes-test-rubyspec MSPECOPT='--error-output stderr --debug -j' TESTS='-j20'" exit with 0.