# Logfile created on 2024-05-06 15:46:52 +0000 by logger.rb/v1.4.3 I, [2024-05-06T15:46:52.986778 #726151] INFO -- : #, @formatter=nil, @logdev=#, @binmode=false, @mon_data=#, @mon_data_owner_object_id=860>>> I, [2024-05-06T15:46:52.986907 #726151] INFO -- : $$$[beg] make update-unicode -j20 I, [2024-05-06T15:46:53.046702 #726151] INFO -- : Downloading Unicode emoji 15.0 files... I, [2024-05-06T15:46:53.046859 #726151] INFO -- : Downloading Unicode emoji 15.0 files... I, [2024-05-06T15:46:53.047355 #726151] INFO -- : Downloading Unicode emoji 15.0 files... I, [2024-05-06T15:46:53.087981 #726151] INFO -- : made symlink emoji/15.0/emoji-sequences.txt to /tmp/ruby/src/trunk/.downloaded-cache/emoji/15.0/emoji-sequences.txt I, [2024-05-06T15:46:53.088132 #726151] INFO -- : downloading emoji/15.0/emoji-sequences.txt ... downloading emoji/15.0/emoji-test.txt ... /tmp/ruby/src/trunk/enc/unicode/data/emoji/15.0/emoji-sequences.txt already exists E, [2024-05-06T15:46:53.555622 #726151] ERROR -- : /tmp/ruby/src/trunk/tool/downloader.rb:302:in `rescue in download': failed to download emoji/15.0/emoji-test.txt (RuntimeError) E, [2024-05-06T15:46:53.555678 #726151] ERROR -- : OpenURI::HTTPError: 403 Forbidden: https://www.unicode.org/Public/emoji/15.0/emoji-test.txt E, [2024-05-06T15:46:53.555684 #726151] ERROR -- : from /tmp/ruby/src/trunk/tool/downloader.rb:201:in `download' E, [2024-05-06T15:46:53.555687 #726151] ERROR -- : from /tmp/ruby/src/trunk/tool/downloader.rb:136:in `download' E, [2024-05-06T15:46:53.555691 #726151] ERROR -- : from /tmp/ruby/src/trunk/tool/downloader.rb:482:in `block in
' E, [2024-05-06T15:46:53.555695 #726151] ERROR -- : from /tmp/ruby/src/trunk/tool/downloader.rb:465:in `each' E, [2024-05-06T15:46:53.555698 #726151] ERROR -- : from /tmp/ruby/src/trunk/tool/downloader.rb:465:in `
' E, [2024-05-06T15:46:53.555702 #726151] ERROR -- : /usr/lib/ruby/3.0.0/open-uri.rb:364:in `open_http': 403 Forbidden (OpenURI::HTTPError) E, [2024-05-06T15:46:53.555705 #726151] ERROR -- : from /usr/lib/ruby/3.0.0/open-uri.rb:741:in `buffer_open' E, [2024-05-06T15:46:53.555709 #726151] ERROR -- : from /usr/lib/ruby/3.0.0/open-uri.rb:212:in `block in open_loop' E, [2024-05-06T15:46:53.555713 #726151] ERROR -- : from /usr/lib/ruby/3.0.0/open-uri.rb:210:in `catch' E, [2024-05-06T15:46:53.555716 #726151] ERROR -- : from /usr/lib/ruby/3.0.0/open-uri.rb:210:in `open_loop' E, [2024-05-06T15:46:53.555720 #726151] ERROR -- : from /usr/lib/ruby/3.0.0/open-uri.rb:151:in `open_uri' E, [2024-05-06T15:46:53.555723 #726151] ERROR -- : from /usr/lib/ruby/3.0.0/open-uri.rb:721:in `open' E, [2024-05-06T15:46:53.555726 #726151] ERROR -- : from /usr/lib/ruby/3.0.0/open-uri.rb:729:in `read' E, [2024-05-06T15:46:53.555735 #726151] ERROR -- : from /tmp/ruby/src/trunk/tool/downloader.rb:247:in `block in download' E, [2024-05-06T15:46:53.555747 #726151] ERROR -- : from /tmp/ruby/src/trunk/tool/downloader.rb:378:in `with_retry' E, [2024-05-06T15:46:53.555751 #726151] ERROR -- : from /tmp/ruby/src/trunk/tool/downloader.rb:246:in `download' E, [2024-05-06T15:46:53.555755 #726151] ERROR -- : from /tmp/ruby/src/trunk/tool/downloader.rb:136:in `download' E, [2024-05-06T15:46:53.555759 #726151] ERROR -- : from /tmp/ruby/src/trunk/tool/downloader.rb:482:in `block in
' E, [2024-05-06T15:46:53.555762 #726151] ERROR -- : from /tmp/ruby/src/trunk/tool/downloader.rb:465:in `each' E, [2024-05-06T15:46:53.555766 #726151] ERROR -- : from /tmp/ruby/src/trunk/tool/downloader.rb:465:in `
' E, [2024-05-06T15:46:53.557779 #726151] ERROR -- : make: *** [uncommon.mk:1787: /tmp/ruby/src/trunk/enc/unicode/data/emoji/15.0/emoji-test.txt] Error 1 E, [2024-05-06T15:46:53.557800 #726151] ERROR -- : make: *** Waiting for unfinished jobs.... E, [2024-05-06T15:46:53.601459 #726151] ERROR -- : /tmp/ruby/src/trunk/tool/downloader.rb:302:in `rescue in download': failed to download emoji/15.0/emoji-test.txt (RuntimeError) E, [2024-05-06T15:46:53.601483 #726151] ERROR -- : OpenURI::HTTPError: 403 Forbidden: https://www.unicode.org/Public/emoji/15.0/emoji-test.txt E, [2024-05-06T15:46:53.601489 #726151] ERROR -- : from /tmp/ruby/src/trunk/tool/downloader.rb:201:in `download' E, [2024-05-06T15:46:53.601492 #726151] ERROR -- : from /tmp/ruby/src/trunk/tool/downloader.rb:136:in `download' E, [2024-05-06T15:46:53.601496 #726151] ERROR -- : from /tmp/ruby/src/trunk/tool/downloader.rb:482:in `block in
' E, [2024-05-06T15:46:53.601499 #726151] ERROR -- : from /tmp/ruby/src/trunk/tool/downloader.rb:465:in `each' E, [2024-05-06T15:46:53.601503 #726151] ERROR -- : from /tmp/ruby/src/trunk/tool/downloader.rb:465:in `
' E, [2024-05-06T15:46:53.601506 #726151] ERROR -- : /usr/lib/ruby/3.0.0/open-uri.rb:364:in `open_http': 403 Forbidden (OpenURI::HTTPError) E, [2024-05-06T15:46:53.601510 #726151] ERROR -- : from /usr/lib/ruby/3.0.0/open-uri.rb:741:in `buffer_open' E, [2024-05-06T15:46:53.601515 #726151] ERROR -- : from /usr/lib/ruby/3.0.0/open-uri.rb:212:in `block in open_loop' E, [2024-05-06T15:46:53.601518 #726151] ERROR -- : from /usr/lib/ruby/3.0.0/open-uri.rb:210:in `catch' E, [2024-05-06T15:46:53.601521 #726151] ERROR -- : from /usr/lib/ruby/3.0.0/open-uri.rb:210:in `open_loop' E, [2024-05-06T15:46:53.601525 #726151] ERROR -- : from /usr/lib/ruby/3.0.0/open-uri.rb:151:in `open_uri' E, [2024-05-06T15:46:53.601528 #726151] ERROR -- : from /usr/lib/ruby/3.0.0/open-uri.rb:721:in `open' E, [2024-05-06T15:46:53.601531 #726151] ERROR -- : from /usr/lib/ruby/3.0.0/open-uri.rb:729:in `read' E, [2024-05-06T15:46:53.601535 #726151] ERROR -- : from /tmp/ruby/src/trunk/tool/downloader.rb:247:in `block in download' E, [2024-05-06T15:46:53.601538 #726151] ERROR -- : from /tmp/ruby/src/trunk/tool/downloader.rb:378:in `with_retry' E, [2024-05-06T15:46:53.601543 #726151] ERROR -- : from /tmp/ruby/src/trunk/tool/downloader.rb:246:in `download' E, [2024-05-06T15:46:53.601546 #726151] ERROR -- : from /tmp/ruby/src/trunk/tool/downloader.rb:136:in `download' E, [2024-05-06T15:46:53.601549 #726151] ERROR -- : from /tmp/ruby/src/trunk/tool/downloader.rb:482:in `block in
' E, [2024-05-06T15:46:53.601553 #726151] ERROR -- : from /tmp/ruby/src/trunk/tool/downloader.rb:465:in `each' E, [2024-05-06T15:46:53.601556 #726151] ERROR -- : from /tmp/ruby/src/trunk/tool/downloader.rb:465:in `
' E, [2024-05-06T15:46:53.603488 #726151] ERROR -- : make: *** [uncommon.mk:1787: /tmp/ruby/src/trunk/enc/unicode/data/emoji/15.0/emoji-zwj-sequences.txt] Error 1 E, [2024-05-06T15:46:53.950640 #726151] ERROR -- : /tmp/ruby/src/trunk/tool/downloader.rb:302:in `rescue in download': failed to download emoji/15.0/emoji-sequences.txt (RuntimeError) E, [2024-05-06T15:46:53.950666 #726151] ERROR -- : EOFError: end of file reached: https://www.unicode.org/Public/emoji/15.0/emoji-sequences.txt E, [2024-05-06T15:46:53.950674 #726151] ERROR -- : from /tmp/ruby/src/trunk/tool/downloader.rb:201:in `download' E, [2024-05-06T15:46:53.950685 #726151] ERROR -- : from /tmp/ruby/src/trunk/tool/downloader.rb:136:in `download' E, [2024-05-06T15:46:53.950691 #726151] ERROR -- : from /tmp/ruby/src/trunk/tool/downloader.rb:482:in `block in
' E, [2024-05-06T15:46:53.950696 #726151] ERROR -- : from /tmp/ruby/src/trunk/tool/downloader.rb:465:in `each' E, [2024-05-06T15:46:53.950702 #726151] ERROR -- : from /tmp/ruby/src/trunk/tool/downloader.rb:465:in `
' E, [2024-05-06T15:46:53.950707 #726151] ERROR -- : /usr/lib/ruby/3.0.0/net/protocol.rb:227:in `rbuf_fill': end of file reached (EOFError) E, [2024-05-06T15:46:53.950712 #726151] ERROR -- : from /usr/lib/ruby/3.0.0/net/protocol.rb:193:in `readuntil' E, [2024-05-06T15:46:53.950719 #726151] ERROR -- : from /usr/lib/ruby/3.0.0/net/protocol.rb:203:in `readline' E, [2024-05-06T15:46:53.950725 #726151] ERROR -- : from /usr/lib/ruby/3.0.0/net/http/response.rb:42:in `read_status_line' E, [2024-05-06T15:46:53.950730 #726151] ERROR -- : from /usr/lib/ruby/3.0.0/net/http/response.rb:31:in `read_new' E, [2024-05-06T15:46:53.950736 #726151] ERROR -- : from /usr/lib/ruby/3.0.0/net/http.rb:1557:in `block in transport_request' E, [2024-05-06T15:46:53.950741 #726151] ERROR -- : from /usr/lib/ruby/3.0.0/net/http.rb:1548:in `catch' E, [2024-05-06T15:46:53.950852 #726151] ERROR -- : from /usr/lib/ruby/3.0.0/net/http.rb:1548:in `transport_request' E, [2024-05-06T15:46:53.950861 #726151] ERROR -- : from /usr/lib/ruby/3.0.0/net/http.rb:1521:in `request' E, [2024-05-06T15:46:53.950867 #726151] ERROR -- : from /usr/lib/ruby/3.0.0/open-uri.rb:329:in `block in open_http' E, [2024-05-06T15:46:53.950873 #726151] ERROR -- : from /usr/lib/ruby/3.0.0/net/http.rb:960:in `start' E, [2024-05-06T15:46:53.950878 #726151] ERROR -- : from /usr/lib/ruby/3.0.0/open-uri.rb:323:in `open_http' E, [2024-05-06T15:46:53.950884 #726151] ERROR -- : from /usr/lib/ruby/3.0.0/open-uri.rb:741:in `buffer_open' E, [2024-05-06T15:46:53.950890 #726151] ERROR -- : from /usr/lib/ruby/3.0.0/open-uri.rb:212:in `block in open_loop' E, [2024-05-06T15:46:53.950898 #726151] ERROR -- : from /usr/lib/ruby/3.0.0/open-uri.rb:210:in `catch' E, [2024-05-06T15:46:53.950903 #726151] ERROR -- : from /usr/lib/ruby/3.0.0/open-uri.rb:210:in `open_loop' E, [2024-05-06T15:46:53.950909 #726151] ERROR -- : from /usr/lib/ruby/3.0.0/open-uri.rb:151:in `open_uri' E, [2024-05-06T15:46:53.950914 #726151] ERROR -- : from /usr/lib/ruby/3.0.0/open-uri.rb:721:in `open' E, [2024-05-06T15:46:53.950920 #726151] ERROR -- : from /usr/lib/ruby/3.0.0/open-uri.rb:729:in `read' E, [2024-05-06T15:46:53.950926 #726151] ERROR -- : from /tmp/ruby/src/trunk/tool/downloader.rb:247:in `block in download' E, [2024-05-06T15:46:53.950932 #726151] ERROR -- : from /tmp/ruby/src/trunk/tool/downloader.rb:378:in `with_retry' E, [2024-05-06T15:46:53.950938 #726151] ERROR -- : from /tmp/ruby/src/trunk/tool/downloader.rb:246:in `download' E, [2024-05-06T15:46:53.950943 #726151] ERROR -- : from /tmp/ruby/src/trunk/tool/downloader.rb:136:in `download' E, [2024-05-06T15:46:53.950950 #726151] ERROR -- : from /tmp/ruby/src/trunk/tool/downloader.rb:482:in `block in
' E, [2024-05-06T15:46:53.950955 #726151] ERROR -- : from /tmp/ruby/src/trunk/tool/downloader.rb:465:in `each' E, [2024-05-06T15:46:53.950961 #726151] ERROR -- : from /tmp/ruby/src/trunk/tool/downloader.rb:465:in `
' E, [2024-05-06T15:46:53.952868 #726151] ERROR -- : make: *** [uncommon.mk:1787: /tmp/ruby/src/trunk/enc/unicode/data/emoji/15.0/emoji-sequences.txt] Error 1 E, [2024-05-06T15:46:53.952888 #726151] ERROR -- : make: *** Deleting file '/tmp/ruby/src/trunk/enc/unicode/data/emoji/15.0/emoji-sequences.txt' I, [2024-05-06T15:46:53.952993 #726151] INFO -- : downloading emoji/15.0/emoji-test.txt ... I, [2024-05-06T15:46:53.953390 #726151] INFO -- : $$$[end] "make update-unicode -j20" exit with 512. I, [2024-05-06T15:46:53.953415 #726151] INFO -- : $$$[beg] make update-download -j20 I, [2024-05-06T15:46:54.052021 #726151] INFO -- : tool/config.guess already exists I, [2024-05-06T15:46:54.052071 #726151] INFO -- : tool/config.sub already exists I, [2024-05-06T15:46:54.054243 #726151] INFO -- : Update minitest to ea9caafc0754b1d6236a490d59e624b53209734a I, [2024-05-06T15:46:54.054657 #726151] INFO -- : Update power_assert to 84e85124c5014a139af39161d484156cfe87a9ed I, [2024-05-06T15:46:54.054954 #726151] INFO -- : Update rbs to ba7872795d5de04adb8ff500c0e6afdc81a041dd I, [2024-05-06T15:46:54.055611 #726151] INFO -- : Update typeprof to b19a6416da3a05d57fadd6ffdadb382b6d236ca5 I, [2024-05-06T15:46:54.055759 #726151] INFO -- : echo ea9caafc0754b1d6236a490d59e624b53209734a | /bin/sh /tmp/ruby/src/trunk/tool/ifchange /tmp/ruby/src/trunk/.bundle/.timestamp/minitest.revision - I, [2024-05-06T15:46:54.055912 #726151] INFO -- : echo 84e85124c5014a139af39161d484156cfe87a9ed | /bin/sh /tmp/ruby/src/trunk/tool/ifchange /tmp/ruby/src/trunk/.bundle/.timestamp/power_assert.revision - I, [2024-05-06T15:46:54.056288 #726151] INFO -- : echo ba7872795d5de04adb8ff500c0e6afdc81a041dd | /bin/sh /tmp/ruby/src/trunk/tool/ifchange /tmp/ruby/src/trunk/.bundle/.timestamp/rbs.revision - I, [2024-05-06T15:46:54.056605 #726151] INFO -- : echo b19a6416da3a05d57fadd6ffdadb382b6d236ca5 | /bin/sh /tmp/ruby/src/trunk/tool/ifchange /tmp/ruby/src/trunk/.bundle/.timestamp/typeprof.revision - I, [2024-05-06T15:46:54.057541 #726151] INFO -- : /tmp/ruby/src/trunk/.bundle/.timestamp/minitest.revision unchanged I, [2024-05-06T15:46:54.057855 #726151] INFO -- : /tmp/ruby/src/trunk/.bundle/.timestamp/rbs.revision unchanged I, [2024-05-06T15:46:54.058038 #726151] INFO -- : /tmp/ruby/src/trunk/.bundle/.timestamp/power_assert.revision unchanged I, [2024-05-06T15:46:54.058067 #726151] INFO -- : /tmp/ruby/src/trunk/.bundle/.timestamp/typeprof.revision unchanged I, [2024-05-06T15:46:54.059312 #726151] INFO -- : Building power_assert@84e85124c5014a139af39161d484156cfe87a9ed to /tmp/ruby/src/trunk/gems/power_assert-2.0.3.gem I, [2024-05-06T15:46:54.129029 #726151] INFO -- : Successfully built RubyGem I, [2024-05-06T15:46:54.129088 #726151] INFO -- : Name: power_assert I, [2024-05-06T15:46:54.129106 #726151] INFO -- : Version: 2.0.4dev I, [2024-05-06T15:46:54.129118 #726151] INFO -- : File: power_assert-2.0.4dev.gem I, [2024-05-06T15:46:54.175893 #726151] INFO -- : $$$[end] "make update-download -j20" exit with 0. I, [2024-05-06T15:46:54.175938 #726151] INFO -- : $$$[beg] make update-rubyspec -j20 I, [2024-05-06T15:46:54.233455 #726151] INFO -- : make: Nothing to be done for 'update-rubyspec'. I, [2024-05-06T15:46:54.233773 #726151] INFO -- : $$$[end] "make update-rubyspec -j20" exit with 0. I, [2024-05-06T15:46:54.233797 #726151] INFO -- : $$$[beg] make update-src -j20 I, [2024-05-06T15:46:54.742437 #726151] INFO -- : Already up to date. I, [2024-05-06T15:46:54.751626 #726151] INFO -- : Latest commit hash = 14d400829d I, [2024-05-06T15:46:54.752653 #726151] INFO -- : $$$[end] "make update-src -j20" exit with 0. I, [2024-05-06T15:46:54.752693 #726151] INFO -- : $$$[beg] make after-update -j20 I, [2024-05-06T15:46:54.822123 #726151] INFO -- : generating /tmp/ruby/src/trunk/ext/ripper/eventids2table.c I, [2024-05-06T15:46:54.826378 #726151] INFO -- : make[1]: Entering directory '/tmp/ruby/src/trunk/ext/ripper' I, [2024-05-06T15:46:54.826425 #726151] INFO -- : make[1]: Nothing to be done for 'src'. I, [2024-05-06T15:46:54.826438 #726151] INFO -- : make[1]: Leaving directory '/tmp/ruby/src/trunk/ext/ripper' I, [2024-05-06T15:46:54.842942 #726151] INFO -- : /tmp/ruby/src/trunk/revision.h updated I, [2024-05-06T15:46:54.844223 #726151] INFO -- : generating x86_64-linux-fake.rb I, [2024-05-06T15:46:54.894996 #726151] INFO -- : x86_64-linux-fake.rb updated I, [2024-05-06T15:46:54.896419 #726151] INFO -- : generating enc.mk I, [2024-05-06T15:46:55.013146 #726151] INFO -- : making srcs under enc I, [2024-05-06T15:46:55.043043 #726151] INFO -- : make[1]: Entering directory '/tmp/ruby/build/trunk' I, [2024-05-06T15:46:55.043064 #726151] INFO -- : make[1]: Nothing to be done for 'srcs'. I, [2024-05-06T15:46:55.043078 #726151] INFO -- : make[1]: Leaving directory '/tmp/ruby/build/trunk' I, [2024-05-06T15:46:55.088219 #726151] INFO -- : Update minitest to ea9caafc0754b1d6236a490d59e624b53209734a I, [2024-05-06T15:46:55.088377 #726151] INFO -- : Update power_assert to 84e85124c5014a139af39161d484156cfe87a9ed I, [2024-05-06T15:46:55.088834 #726151] INFO -- : Update rbs to ba7872795d5de04adb8ff500c0e6afdc81a041dd I, [2024-05-06T15:46:55.088960 #726151] INFO -- : Update typeprof to b19a6416da3a05d57fadd6ffdadb382b6d236ca5 I, [2024-05-06T15:46:55.089378 #726151] INFO -- : echo ea9caafc0754b1d6236a490d59e624b53209734a | /bin/sh /tmp/ruby/src/trunk/tool/ifchange /tmp/ruby/src/trunk/.bundle/.timestamp/minitest.revision - I, [2024-05-06T15:46:55.089562 #726151] INFO -- : echo 84e85124c5014a139af39161d484156cfe87a9ed | /bin/sh /tmp/ruby/src/trunk/tool/ifchange /tmp/ruby/src/trunk/.bundle/.timestamp/power_assert.revision - I, [2024-05-06T15:46:55.090727 #726151] INFO -- : echo ba7872795d5de04adb8ff500c0e6afdc81a041dd | /bin/sh /tmp/ruby/src/trunk/tool/ifchange /tmp/ruby/src/trunk/.bundle/.timestamp/rbs.revision - I, [2024-05-06T15:46:55.090928 #726151] INFO -- : echo b19a6416da3a05d57fadd6ffdadb382b6d236ca5 | /bin/sh /tmp/ruby/src/trunk/tool/ifchange /tmp/ruby/src/trunk/.bundle/.timestamp/typeprof.revision - I, [2024-05-06T15:46:55.091220 #726151] INFO -- : /tmp/ruby/src/trunk/.bundle/.timestamp/minitest.revision unchanged I, [2024-05-06T15:46:55.091313 #726151] INFO -- : /tmp/ruby/src/trunk/.bundle/.timestamp/power_assert.revision unchanged I, [2024-05-06T15:46:55.092201 #726151] INFO -- : Building power_assert@84e85124c5014a139af39161d484156cfe87a9ed to /tmp/ruby/src/trunk/gems/power_assert-2.0.3.gem I, [2024-05-06T15:46:55.092458 #726151] INFO -- : /tmp/ruby/src/trunk/.bundle/.timestamp/rbs.revision unchanged I, [2024-05-06T15:46:55.092472 #726151] INFO -- : /tmp/ruby/src/trunk/.bundle/.timestamp/typeprof.revision unchanged I, [2024-05-06T15:46:55.161501 #726151] INFO -- : Successfully built RubyGem I, [2024-05-06T15:46:55.161542 #726151] INFO -- : Name: power_assert I, [2024-05-06T15:46:55.161548 #726151] INFO -- : Version: 2.0.4dev I, [2024-05-06T15:46:55.161556 #726151] INFO -- : File: power_assert-2.0.4dev.gem I, [2024-05-06T15:46:55.163614 #726151] INFO -- : Extracting bundle gem power_assert-2.0.3... I, [2024-05-06T15:46:55.224243 #726151] INFO -- : Try with hash version of bundled gems instead of gems/power_assert-2.0.3.gem. We don't use this gem with release version of Ruby. I, [2024-05-06T15:46:55.229227 #726151] INFO -- : Unpacked gems/power_assert-2.0.4dev.gem I, [2024-05-06T15:46:55.231171 #726151] INFO -- : $$$[end] "make after-update -j20" exit with 0. I, [2024-05-06T15:46:55.231316 #726151] INFO -- : $$$[beg] make miniruby -j20 I, [2024-05-06T15:46:55.288238 #726151] INFO -- : BASERUBY = /usr/bin/ruby --disable=gems I, [2024-05-06T15:46:55.288344 #726151] INFO -- : CC = gcc I, [2024-05-06T15:46:55.288351 #726151] INFO -- : LD = ld I, [2024-05-06T15:46:55.288355 #726151] INFO -- : LDSHARED = gcc -shared I, [2024-05-06T15:46:55.288360 #726151] INFO -- : CFLAGS = -O3 -fno-fast-math -ggdb3 -Wall -Wextra -Wdeprecated-declarations -Wdiv-by-zero -Wduplicated-cond -Wimplicit-function-declaration -Wimplicit-int -Wpointer-arith -Wwrite-strings -Wold-style-definition -Wimplicit-fallthrough=0 -Wmissing-noreturn -Wno-cast-function-type -Wno-constant-logical-operand -Wno-long-long -Wno-missing-field-initializers -Wno-overlength-strings -Wno-packed-bitfield-compat -Wno-parentheses-equality -Wno-self-assign -Wno-tautological-compare -Wno-unused-parameter -Wno-unused-value -Wsuggest-attribute=format -Wsuggest-attribute=noreturn -Wunused-variable -Wmisleading-indentation -Wundef -fPIC I, [2024-05-06T15:46:55.288365 #726151] INFO -- : XCFLAGS = -U_FORTIFY_SOURCE -D_FORTIFY_SOURCE=2 -fstack-protector-strong -fno-strict-overflow -fvisibility=hidden -fexcess-precision=standard -DRUBY_EXPORT -I. -I.ext/include/x86_64-linux -I/tmp/ruby/src/trunk/include -I/tmp/ruby/src/trunk -I/tmp/ruby/src/trunk/prism -I/tmp/ruby/src/trunk/enc/unicode/15.0.0 I, [2024-05-06T15:46:55.288375 #726151] INFO -- : CPPFLAGS = I, [2024-05-06T15:46:55.288378 #726151] INFO -- : DLDFLAGS = -Wl,--compress-debug-sections=zlib -Wl,-soname,libruby.so.3.4 -fstack-protector-strong I, [2024-05-06T15:46:55.288382 #726151] INFO -- : SOLIBS = -lz -lrt -lrt -lgmp -ldl -lcrypt -lm -lpthread I, [2024-05-06T15:46:55.288386 #726151] INFO -- : LANG = en_US.UTF-8 I, [2024-05-06T15:46:55.288389 #726151] INFO -- : LC_ALL = I, [2024-05-06T15:46:55.288393 #726151] INFO -- : LC_CTYPE = I, [2024-05-06T15:46:55.288397 #726151] INFO -- : MFLAGS = -j20 --jobserver-auth=4,5 I, [2024-05-06T15:46:55.288400 #726151] INFO -- : RUSTC = no I, [2024-05-06T15:46:55.288404 #726151] INFO -- : YJIT_RUSTC_ARGS = --crate-name=yjit --crate-type=staticlib --edition=2021 -g -C lto=thin -C opt-level=3 -C overflow-checks=on '--out-dir=/tmp/ruby/build/trunk/yjit/target/release/' /tmp/ruby/src/trunk/yjit/src/lib.rs I, [2024-05-06T15:46:55.289614 #726151] INFO -- : gcc (Ubuntu 11.4.0-1ubuntu1~22.04) 11.4.0 I, [2024-05-06T15:46:55.289638 #726151] INFO -- : Copyright (C) 2021 Free Software Foundation, Inc. I, [2024-05-06T15:46:55.289643 #726151] INFO -- : This is free software; see the source for copying conditions. There is NO I, [2024-05-06T15:46:55.289647 #726151] INFO -- : warranty; not even for MERCHANTABILITY or FITNESS FOR A PARTICULAR PURPOSE. I, [2024-05-06T15:46:55.289651 #726151] INFO -- : I, [2024-05-06T15:46:55.311210 #726151] INFO -- : compiling /tmp/ruby/src/trunk/version.c I, [2024-05-06T15:46:55.414835 #726151] INFO -- : linking miniruby I, [2024-05-06T15:46:55.929644 #726151] INFO -- : $$$[end] "make miniruby -j20" exit with 0. I, [2024-05-06T15:46:55.929767 #726151] INFO -- : $$$[beg] make ruby -j20 I, [2024-05-06T15:46:55.987463 #726151] INFO -- : BASERUBY = /usr/bin/ruby --disable=gems I, [2024-05-06T15:46:55.987492 #726151] INFO -- : CC = gcc I, [2024-05-06T15:46:55.987497 #726151] INFO -- : LD = ld I, [2024-05-06T15:46:55.987501 #726151] INFO -- : LDSHARED = gcc -shared I, [2024-05-06T15:46:55.987509 #726151] INFO -- : CFLAGS = -O3 -fno-fast-math -ggdb3 -Wall -Wextra -Wdeprecated-declarations -Wdiv-by-zero -Wduplicated-cond -Wimplicit-function-declaration -Wimplicit-int -Wpointer-arith -Wwrite-strings -Wold-style-definition -Wimplicit-fallthrough=0 -Wmissing-noreturn -Wno-cast-function-type -Wno-constant-logical-operand -Wno-long-long -Wno-missing-field-initializers -Wno-overlength-strings -Wno-packed-bitfield-compat -Wno-parentheses-equality -Wno-self-assign -Wno-tautological-compare -Wno-unused-parameter -Wno-unused-value -Wsuggest-attribute=format -Wsuggest-attribute=noreturn -Wunused-variable -Wmisleading-indentation -Wundef -fPIC I, [2024-05-06T15:46:55.987514 #726151] INFO -- : XCFLAGS = -U_FORTIFY_SOURCE -D_FORTIFY_SOURCE=2 -fstack-protector-strong -fno-strict-overflow -fvisibility=hidden -fexcess-precision=standard -DRUBY_EXPORT -I. -I.ext/include/x86_64-linux -I/tmp/ruby/src/trunk/include -I/tmp/ruby/src/trunk -I/tmp/ruby/src/trunk/prism -I/tmp/ruby/src/trunk/enc/unicode/15.0.0 I, [2024-05-06T15:46:55.987517 #726151] INFO -- : CPPFLAGS = I, [2024-05-06T15:46:55.987521 #726151] INFO -- : DLDFLAGS = -Wl,--compress-debug-sections=zlib -Wl,-soname,libruby.so.3.4 -fstack-protector-strong I, [2024-05-06T15:46:55.987525 #726151] INFO -- : SOLIBS = -lz -lrt -lrt -lgmp -ldl -lcrypt -lm -lpthread I, [2024-05-06T15:46:55.987528 #726151] INFO -- : LANG = en_US.UTF-8 I, [2024-05-06T15:46:55.987532 #726151] INFO -- : LC_ALL = I, [2024-05-06T15:46:55.987535 #726151] INFO -- : LC_CTYPE = I, [2024-05-06T15:46:55.987539 #726151] INFO -- : MFLAGS = -j20 --jobserver-auth=4,5 I, [2024-05-06T15:46:55.987543 #726151] INFO -- : RUSTC = no I, [2024-05-06T15:46:55.987547 #726151] INFO -- : YJIT_RUSTC_ARGS = --crate-name=yjit --crate-type=staticlib --edition=2021 -g -C lto=thin -C opt-level=3 -C overflow-checks=on '--out-dir=/tmp/ruby/build/trunk/yjit/target/release/' /tmp/ruby/src/trunk/yjit/src/lib.rs I, [2024-05-06T15:46:55.988856 #726151] INFO -- : gcc (Ubuntu 11.4.0-1ubuntu1~22.04) 11.4.0 I, [2024-05-06T15:46:55.988879 #726151] INFO -- : Copyright (C) 2021 Free Software Foundation, Inc. I, [2024-05-06T15:46:55.988885 #726151] INFO -- : This is free software; see the source for copying conditions. There is NO I, [2024-05-06T15:46:55.988889 #726151] INFO -- : warranty; not even for MERCHANTABILITY or FITNESS FOR A PARTICULAR PURPOSE. I, [2024-05-06T15:46:55.988893 #726151] INFO -- : I, [2024-05-06T15:46:56.097113 #726151] INFO -- : builtin_binary.inc updated I, [2024-05-06T15:46:56.101831 #726151] INFO -- : c5234a9416e4f20f175185e840b25b0f08674d14078ed7083f37e655458e3ca9 builtin_binary.inc I, [2024-05-06T15:46:56.102574 #726151] INFO -- : compiling /tmp/ruby/src/trunk/builtin.c I, [2024-05-06T15:46:56.286796 #726151] INFO -- : linking static-library libruby-static.a I, [2024-05-06T15:46:56.601680 #726151] INFO -- : linking shared-library libruby.so.3.4.0 I, [2024-05-06T15:46:58.176918 #726151] INFO -- : linking ruby I, [2024-05-06T15:46:58.200729 #726151] INFO -- : $$$[end] "make ruby -j20" exit with 0. I, [2024-05-06T15:46:58.200855 #726151] INFO -- : $$$[beg] make all -j20 I, [2024-05-06T15:46:58.258124 #726151] INFO -- : BASERUBY = /usr/bin/ruby --disable=gems I, [2024-05-06T15:46:58.258153 #726151] INFO -- : CC = gcc I, [2024-05-06T15:46:58.258158 #726151] INFO -- : LD = ld I, [2024-05-06T15:46:58.258162 #726151] INFO -- : LDSHARED = gcc -shared I, [2024-05-06T15:46:58.258167 #726151] INFO -- : CFLAGS = -O3 -fno-fast-math -ggdb3 -Wall -Wextra -Wdeprecated-declarations -Wdiv-by-zero -Wduplicated-cond -Wimplicit-function-declaration -Wimplicit-int -Wpointer-arith -Wwrite-strings -Wold-style-definition -Wimplicit-fallthrough=0 -Wmissing-noreturn -Wno-cast-function-type -Wno-constant-logical-operand -Wno-long-long -Wno-missing-field-initializers -Wno-overlength-strings -Wno-packed-bitfield-compat -Wno-parentheses-equality -Wno-self-assign -Wno-tautological-compare -Wno-unused-parameter -Wno-unused-value -Wsuggest-attribute=format -Wsuggest-attribute=noreturn -Wunused-variable -Wmisleading-indentation -Wundef -fPIC I, [2024-05-06T15:46:58.258171 #726151] INFO -- : XCFLAGS = -U_FORTIFY_SOURCE -D_FORTIFY_SOURCE=2 -fstack-protector-strong -fno-strict-overflow -fvisibility=hidden -fexcess-precision=standard -DRUBY_EXPORT -I. -I.ext/include/x86_64-linux -I/tmp/ruby/src/trunk/include -I/tmp/ruby/src/trunk -I/tmp/ruby/src/trunk/prism -I/tmp/ruby/src/trunk/enc/unicode/15.0.0 I, [2024-05-06T15:46:58.258175 #726151] INFO -- : CPPFLAGS = I, [2024-05-06T15:46:58.258178 #726151] INFO -- : DLDFLAGS = -Wl,--compress-debug-sections=zlib -Wl,-soname,libruby.so.3.4 -fstack-protector-strong I, [2024-05-06T15:46:58.258182 #726151] INFO -- : SOLIBS = -lz -lrt -lrt -lgmp -ldl -lcrypt -lm -lpthread I, [2024-05-06T15:46:58.258186 #726151] INFO -- : LANG = en_US.UTF-8 I, [2024-05-06T15:46:58.258189 #726151] INFO -- : LC_ALL = I, [2024-05-06T15:46:58.258192 #726151] INFO -- : LC_CTYPE = I, [2024-05-06T15:46:58.258196 #726151] INFO -- : MFLAGS = -j20 --jobserver-auth=4,5 I, [2024-05-06T15:46:58.258199 #726151] INFO -- : RUSTC = no I, [2024-05-06T15:46:58.258204 #726151] INFO -- : YJIT_RUSTC_ARGS = --crate-name=yjit --crate-type=staticlib --edition=2021 -g -C lto=thin -C opt-level=3 -C overflow-checks=on '--out-dir=/tmp/ruby/build/trunk/yjit/target/release/' /tmp/ruby/src/trunk/yjit/src/lib.rs I, [2024-05-06T15:46:58.259568 #726151] INFO -- : gcc (Ubuntu 11.4.0-1ubuntu1~22.04) 11.4.0 I, [2024-05-06T15:46:58.259593 #726151] INFO -- : Copyright (C) 2021 Free Software Foundation, Inc. I, [2024-05-06T15:46:58.259598 #726151] INFO -- : This is free software; see the source for copying conditions. There is NO I, [2024-05-06T15:46:58.259602 #726151] INFO -- : warranty; not even for MERCHANTABILITY or FITNESS FOR A PARTICULAR PURPOSE. I, [2024-05-06T15:46:58.259606 #726151] INFO -- : I, [2024-05-06T15:46:58.289010 #726151] INFO -- : generating enc.mk I, [2024-05-06T15:46:58.290970 #726151] INFO -- : building spec/ruby/optional/capi/ext/array_spec.so I, [2024-05-06T15:46:58.291283 #726151] INFO -- : building spec/ruby/optional/capi/ext/basic_object_spec.so I, [2024-05-06T15:46:58.292035 #726151] INFO -- : building spec/ruby/optional/capi/ext/bignum_spec.so I, [2024-05-06T15:46:58.292364 #726151] INFO -- : building spec/ruby/optional/capi/ext/binding_spec.so I, [2024-05-06T15:46:58.292689 #726151] INFO -- : building spec/ruby/optional/capi/ext/boolean_spec.so I, [2024-05-06T15:46:58.293551 #726151] INFO -- : building spec/ruby/optional/capi/ext/class_id_under_autoload_spec.so I, [2024-05-06T15:46:58.294514 #726151] INFO -- : building spec/ruby/optional/capi/ext/class_spec.so I, [2024-05-06T15:46:58.294555 #726151] INFO -- : building spec/ruby/optional/capi/ext/class_under_autoload_spec.so I, [2024-05-06T15:46:58.295491 #726151] INFO -- : building spec/ruby/optional/capi/ext/complex_spec.so I, [2024-05-06T15:46:58.296367 #726151] INFO -- : building spec/ruby/optional/capi/ext/constants_spec.so I, [2024-05-06T15:46:58.296670 #726151] INFO -- : building spec/ruby/optional/capi/ext/data_spec.so I, [2024-05-06T15:46:58.297354 #726151] INFO -- : building spec/ruby/optional/capi/ext/debug_spec.so I, [2024-05-06T15:46:58.297620 #726151] INFO -- : building spec/ruby/optional/capi/ext/encoding_spec.so I, [2024-05-06T15:46:58.298658 #726151] INFO -- : building spec/ruby/optional/capi/ext/enumerator_spec.so I, [2024-05-06T15:46:58.299308 #726151] INFO -- : building spec/ruby/optional/capi/ext/exception_spec.so I, [2024-05-06T15:46:58.299585 #726151] INFO -- : building spec/ruby/optional/capi/ext/fiber_spec.so I, [2024-05-06T15:46:58.300077 #726151] INFO -- : building spec/ruby/optional/capi/ext/file_spec.so I, [2024-05-06T15:46:58.300464 #726151] INFO -- : building spec/ruby/optional/capi/ext/fixnum_spec.so I, [2024-05-06T15:46:58.332646 #726151] INFO -- : building spec/ruby/optional/capi/ext/float_spec.so I, [2024-05-06T15:46:58.396351 #726151] INFO -- : building spec/ruby/optional/capi/ext/gc_spec.so I, [2024-05-06T15:46:58.411069 #726151] INFO -- : building spec/ruby/optional/capi/ext/globals_spec.so I, [2024-05-06T15:46:58.450889 #726151] INFO -- : building spec/ruby/optional/capi/ext/hash_spec.so I, [2024-05-06T15:46:58.452511 #726151] INFO -- : building spec/ruby/optional/capi/ext/integer_spec.so I, [2024-05-06T15:46:58.459295 #726151] INFO -- : building spec/ruby/optional/capi/ext/io_spec.so I, [2024-05-06T15:46:58.461737 #726151] INFO -- : building spec/ruby/optional/capi/ext/kernel_spec.so I, [2024-05-06T15:46:58.469244 #726151] INFO -- : building spec/ruby/optional/capi/ext/language_spec.so I, [2024-05-06T15:46:58.478226 #726151] INFO -- : building spec/ruby/optional/capi/ext/marshal_spec.so I, [2024-05-06T15:46:58.487462 #726151] INFO -- : building spec/ruby/optional/capi/ext/module_under_autoload_spec.so I, [2024-05-06T15:46:58.487660 #726151] INFO -- : building spec/ruby/optional/capi/ext/module_spec.so I, [2024-05-06T15:46:58.488421 #726151] INFO -- : building spec/ruby/optional/capi/ext/mutex_spec.so I, [2024-05-06T15:46:58.489125 #726151] INFO -- : building spec/ruby/optional/capi/ext/numeric_spec.so I, [2024-05-06T15:46:58.492370 #726151] INFO -- : building spec/ruby/optional/capi/ext/object_spec.so I, [2024-05-06T15:46:58.505284 #726151] INFO -- : building spec/ruby/optional/capi/ext/proc_spec.so I, [2024-05-06T15:46:58.523121 #726151] INFO -- : building spec/ruby/optional/capi/ext/range_spec.so I, [2024-05-06T15:46:58.535587 #726151] INFO -- : building spec/ruby/optional/capi/ext/rational_spec.so I, [2024-05-06T15:46:58.547889 #726151] INFO -- : building spec/ruby/optional/capi/ext/rbasic_spec.so I, [2024-05-06T15:46:58.549954 #726151] INFO -- : building spec/ruby/optional/capi/ext/regexp_spec.so I, [2024-05-06T15:46:58.590890 #726151] INFO -- : building spec/ruby/optional/capi/ext/string_spec.so I, [2024-05-06T15:46:58.599175 #726151] INFO -- : building spec/ruby/optional/capi/ext/struct_spec.so I, [2024-05-06T15:46:58.613438 #726151] INFO -- : building spec/ruby/optional/capi/ext/st_spec.so I, [2024-05-06T15:46:58.619318 #726151] INFO -- : building spec/ruby/optional/capi/ext/thread_spec.so I, [2024-05-06T15:46:58.619440 #726151] INFO -- : building spec/ruby/optional/capi/ext/symbol_spec.so I, [2024-05-06T15:46:58.641601 #726151] INFO -- : building spec/ruby/optional/capi/ext/time_spec.so I, [2024-05-06T15:46:58.644075 #726151] INFO -- : building spec/ruby/optional/capi/ext/tracepoint_spec.so I, [2024-05-06T15:46:58.645544 #726151] INFO -- : building spec/ruby/optional/capi/ext/typed_data_spec.so I, [2024-05-06T15:46:58.682587 #726151] INFO -- : building spec/ruby/optional/capi/ext/util_spec.so I, [2024-05-06T15:46:58.686889 #726151] INFO -- : making enc I, [2024-05-06T15:46:58.695790 #726151] INFO -- : making srcs under enc I, [2024-05-06T15:46:58.715151 #726151] INFO -- : make[1]: Entering directory '/tmp/ruby/build/trunk' I, [2024-05-06T15:46:58.715244 #726151] INFO -- : make[1]: Nothing to be done for 'enc'. I, [2024-05-06T15:46:58.715287 #726151] INFO -- : make[1]: Leaving directory '/tmp/ruby/build/trunk' I, [2024-05-06T15:46:58.729011 #726151] INFO -- : make[1]: Entering directory '/tmp/ruby/build/trunk' I, [2024-05-06T15:46:58.729069 #726151] INFO -- : make[1]: Nothing to be done for 'srcs'. I, [2024-05-06T15:46:58.729082 #726151] INFO -- : make[1]: Leaving directory '/tmp/ruby/build/trunk' I, [2024-05-06T15:46:58.729622 #726151] INFO -- : generating transdb.h I, [2024-05-06T15:46:58.825467 #726151] INFO -- : transdb.h unchanged I, [2024-05-06T15:46:58.826641 #726151] INFO -- : generating makefiles ext/configure-ext.mk I, [2024-05-06T15:46:58.826946 #726151] INFO -- : making trans I, [2024-05-06T15:46:58.853347 #726151] INFO -- : ext/configure-ext.mk updated I, [2024-05-06T15:46:58.855579 #726151] INFO -- : make[1]: Entering directory '/tmp/ruby/build/trunk' I, [2024-05-06T15:46:58.869155 #726151] INFO -- : make[1]: Entering directory '/tmp/ruby/build/trunk' I, [2024-05-06T15:46:58.870159 #726151] INFO -- : make[1]: Nothing to be done for 'trans'. I, [2024-05-06T15:46:58.870170 #726151] INFO -- : make[1]: Leaving directory '/tmp/ruby/build/trunk' I, [2024-05-06T15:46:58.870178 #726151] INFO -- : making encs I, [2024-05-06T15:46:58.927123 #726151] INFO -- : make[1]: Entering directory '/tmp/ruby/build/trunk' I, [2024-05-06T15:46:58.927205 #726151] INFO -- : make[1]: Nothing to be done for 'encs'. I, [2024-05-06T15:46:58.927231 #726151] INFO -- : make[1]: Leaving directory '/tmp/ruby/build/trunk' I, [2024-05-06T15:46:59.014592 #726151] INFO -- : make[1]: Leaving directory '/tmp/ruby/build/trunk' I, [2024-05-06T15:46:59.015259 #726151] INFO -- : generating makefile exts.mk I, [2024-05-06T15:46:59.052420 #726151] INFO -- : exts.mk unchanged I, [2024-05-06T15:46:59.056727 #726151] INFO -- : make[1]: Entering directory '/tmp/ruby/build/trunk' I, [2024-05-06T15:46:59.074796 #726151] INFO -- : make[2]: Entering directory '/tmp/ruby/build/trunk/ext/digest' I, [2024-05-06T15:46:59.076021 #726151] INFO -- : make[2]: Entering directory '/tmp/ruby/build/trunk/ext/coverage' I, [2024-05-06T15:46:59.076622 #726151] INFO -- : make[2]: Entering directory '/tmp/ruby/build/trunk/ext/json' I, [2024-05-06T15:46:59.077325 #726151] INFO -- : make[2]: Entering directory '/tmp/ruby/build/trunk/ext/date' I, [2024-05-06T15:46:59.078171 #726151] INFO -- : make[2]: Entering directory '/tmp/ruby/build/trunk/ext/io/console' I, [2024-05-06T15:46:59.078237 #726151] INFO -- : make[2]: Entering directory '/tmp/ruby/build/trunk/ext/monitor' I, [2024-05-06T15:46:59.078845 #726151] INFO -- : make[2]: Leaving directory '/tmp/ruby/build/trunk/ext/digest' I, [2024-05-06T15:46:59.079388 #726151] INFO -- : make[2]: Entering directory '/tmp/ruby/build/trunk/ext/rubyvm' I, [2024-05-06T15:46:59.079692 #726151] INFO -- : make[2]: Leaving directory '/tmp/ruby/build/trunk/ext/coverage' I, [2024-05-06T15:46:59.079797 #726151] INFO -- : make[2]: Entering directory '/tmp/ruby/build/trunk/ext/pathname' I, [2024-05-06T15:46:59.080324 #726151] INFO -- : make[2]: Entering directory '/tmp/ruby/build/trunk/ext/fiddle' I, [2024-05-06T15:46:59.080512 #726151] INFO -- : make[2]: Entering directory '/tmp/ruby/build/trunk/ext/pty' I, [2024-05-06T15:46:59.080925 #726151] INFO -- : make[2]: Leaving directory '/tmp/ruby/build/trunk/ext/io/console' I, [2024-05-06T15:46:59.081315 #726151] INFO -- : make[2]: Leaving directory '/tmp/ruby/build/trunk/ext/monitor' I, [2024-05-06T15:46:59.081524 #726151] INFO -- : make[2]: Leaving directory '/tmp/ruby/build/trunk/ext/date' I, [2024-05-06T15:46:59.081643 #726151] INFO -- : make[2]: Entering directory '/tmp/ruby/build/trunk/ext/objspace' I, [2024-05-06T15:46:59.081691 #726151] INFO -- : make[2]: Leaving directory '/tmp/ruby/build/trunk/ext/json' I, [2024-05-06T15:46:59.081995 #726151] INFO -- : make[2]: Leaving directory '/tmp/ruby/build/trunk/ext/rubyvm' I, [2024-05-06T15:46:59.082362 #726151] INFO -- : make[2]: Entering directory '/tmp/ruby/build/trunk/ext/psych' I, [2024-05-06T15:46:59.082575 #726151] INFO -- : make[2]: Leaving directory '/tmp/ruby/build/trunk/ext/pty' I, [2024-05-06T15:46:59.082609 #726151] INFO -- : make[2]: Leaving directory '/tmp/ruby/build/trunk/ext/pathname' I, [2024-05-06T15:46:59.084413 #726151] INFO -- : make[2]: Entering directory '/tmp/ruby/build/trunk/.bundle/gems/bigdecimal-3.1.7/ext/bigdecimal' I, [2024-05-06T15:46:59.084852 #726151] INFO -- : make[2]: Entering directory '/tmp/ruby/build/trunk/.bundle/gems/nkf-0.2.0/ext/nkf' I, [2024-05-06T15:46:59.085099 #726151] INFO -- : make[2]: Entering directory '/tmp/ruby/build/trunk/.bundle/gems/debug-1.9.2/ext/debug' I, [2024-05-06T15:46:59.085197 #726151] INFO -- : make[2]: Entering directory '/tmp/ruby/build/trunk/.bundle/gems/racc-1.7.3/ext/racc/cparse' I, [2024-05-06T15:46:59.085377 #726151] INFO -- : make[2]: Entering directory '/tmp/ruby/build/trunk/.bundle/gems/syslog-0.1.2/ext/syslog' I, [2024-05-06T15:46:59.085464 #726151] INFO -- : make[2]: Entering directory '/tmp/ruby/build/trunk/ext/ripper' I, [2024-05-06T15:46:59.085949 #726151] INFO -- : make[2]: Entering directory '/tmp/ruby/build/trunk/.bundle/gems/rbs-3.4.4/ext/rbs_extension' I, [2024-05-06T15:46:59.087237 #726151] INFO -- : make[2]: Leaving directory '/tmp/ruby/build/trunk/ext/fiddle' I, [2024-05-06T15:46:59.088294 #726151] INFO -- : make[2]: Entering directory '/tmp/ruby/build/trunk/ext/digest/sha2' I, [2024-05-06T15:46:59.090310 #726151] INFO -- : make[2]: Leaving directory '/tmp/ruby/build/trunk/ext/objspace' I, [2024-05-06T15:46:59.090365 #726151] INFO -- : make[2]: Entering directory '/tmp/ruby/build/trunk/ext/socket' I, [2024-05-06T15:46:59.091132 #726151] INFO -- : make[2]: Leaving directory '/tmp/ruby/build/trunk/ext/digest/sha2' I, [2024-05-06T15:46:59.091613 #726151] INFO -- : make[2]: Entering directory '/tmp/ruby/build/trunk/ext/openssl' I, [2024-05-06T15:46:59.092805 #726151] INFO -- : make[2]: Leaving directory '/tmp/ruby/build/trunk/ext/ripper' I, [2024-05-06T15:46:59.095149 #726151] INFO -- : make[2]: Leaving directory '/tmp/ruby/build/trunk/ext/psych' I, [2024-05-06T15:46:59.096386 #726151] INFO -- : make[2]: Leaving directory '/tmp/ruby/build/trunk/ext/socket' I, [2024-05-06T15:46:59.102596 #726151] INFO -- : make[2]: Leaving directory '/tmp/ruby/build/trunk/ext/openssl' I, [2024-05-06T15:46:59.108140 #726151] INFO -- : make[2]: Leaving directory '/tmp/ruby/build/trunk/.bundle/gems/syslog-0.1.2/ext/syslog' I, [2024-05-06T15:46:59.108293 #726151] INFO -- : make[2]: Leaving directory '/tmp/ruby/build/trunk/.bundle/gems/bigdecimal-3.1.7/ext/bigdecimal' I, [2024-05-06T15:46:59.111631 #726151] INFO -- : make[2]: Leaving directory '/tmp/ruby/build/trunk/.bundle/gems/rbs-3.4.4/ext/rbs_extension' I, [2024-05-06T15:46:59.119471 #726151] INFO -- : make[2]: Leaving directory '/tmp/ruby/build/trunk/.bundle/gems/nkf-0.2.0/ext/nkf' I, [2024-05-06T15:46:59.120820 #726151] INFO -- : make[2]: Leaving directory '/tmp/ruby/build/trunk/.bundle/gems/debug-1.9.2/ext/debug' I, [2024-05-06T15:46:59.122602 #726151] INFO -- : make[2]: Leaving directory '/tmp/ruby/build/trunk/.bundle/gems/racc-1.7.3/ext/racc/cparse' I, [2024-05-06T15:46:59.146737 #726151] INFO -- : make[2]: Entering directory '/tmp/ruby/build/trunk' I, [2024-05-06T15:46:59.212777 #726151] INFO -- : linking ruby I, [2024-05-06T15:46:59.235183 #726151] INFO -- : make[2]: Leaving directory '/tmp/ruby/build/trunk' I, [2024-05-06T15:46:59.235494 #726151] INFO -- : make[1]: Leaving directory '/tmp/ruby/build/trunk' I, [2024-05-06T15:46:59.239235 #726151] INFO -- : make[1]: Entering directory '/tmp/ruby/build/trunk' I, [2024-05-06T15:46:59.239286 #726151] INFO -- : make[1]: Nothing to be done for 'note'. I, [2024-05-06T15:46:59.239300 #726151] INFO -- : make[1]: Leaving directory '/tmp/ruby/build/trunk' I, [2024-05-06T15:46:59.239792 #726151] INFO -- : $$$[end] "make all -j20" exit with 0. I, [2024-05-06T15:46:59.239962 #726151] INFO -- : $$$[beg] make install -j20 I, [2024-05-06T15:46:59.302920 #726151] INFO -- : Update minitest to ea9caafc0754b1d6236a490d59e624b53209734a I, [2024-05-06T15:46:59.303087 #726151] INFO -- : Update power_assert to 84e85124c5014a139af39161d484156cfe87a9ed I, [2024-05-06T15:46:59.303491 #726151] INFO -- : Update rbs to ba7872795d5de04adb8ff500c0e6afdc81a041dd I, [2024-05-06T15:46:59.303674 #726151] INFO -- : Update typeprof to b19a6416da3a05d57fadd6ffdadb382b6d236ca5 I, [2024-05-06T15:46:59.304343 #726151] INFO -- : echo ea9caafc0754b1d6236a490d59e624b53209734a | /bin/sh /tmp/ruby/src/trunk/tool/ifchange /tmp/ruby/src/trunk/.bundle/.timestamp/minitest.revision - I, [2024-05-06T15:46:59.304513 #726151] INFO -- : echo 84e85124c5014a139af39161d484156cfe87a9ed | /bin/sh /tmp/ruby/src/trunk/tool/ifchange /tmp/ruby/src/trunk/.bundle/.timestamp/power_assert.revision - I, [2024-05-06T15:46:59.305710 #726151] INFO -- : BASERUBY = /usr/bin/ruby --disable=gems I, [2024-05-06T15:46:59.305741 #726151] INFO -- : CC = gcc I, [2024-05-06T15:46:59.305755 #726151] INFO -- : LD = ld I, [2024-05-06T15:46:59.305767 #726151] INFO -- : LDSHARED = gcc -shared I, [2024-05-06T15:46:59.305779 #726151] INFO -- : CFLAGS = -O3 -fno-fast-math -ggdb3 -Wall -Wextra -Wdeprecated-declarations -Wdiv-by-zero -Wduplicated-cond -Wimplicit-function-declaration -Wimplicit-int -Wpointer-arith -Wwrite-strings -Wold-style-definition -Wimplicit-fallthrough=0 -Wmissing-noreturn -Wno-cast-function-type -Wno-constant-logical-operand -Wno-long-long -Wno-missing-field-initializers -Wno-overlength-strings -Wno-packed-bitfield-compat -Wno-parentheses-equality -Wno-self-assign -Wno-tautological-compare -Wno-unused-parameter -Wno-unused-value -Wsuggest-attribute=format -Wsuggest-attribute=noreturn -Wunused-variable -Wmisleading-indentation -Wundef -fPIC I, [2024-05-06T15:46:59.305792 #726151] INFO -- : XCFLAGS = -U_FORTIFY_SOURCE -D_FORTIFY_SOURCE=2 -fstack-protector-strong -fno-strict-overflow -fvisibility=hidden -fexcess-precision=standard -DRUBY_EXPORT -I. -I.ext/include/x86_64-linux -I/tmp/ruby/src/trunk/include -I/tmp/ruby/src/trunk -I/tmp/ruby/src/trunk/prism -I/tmp/ruby/src/trunk/enc/unicode/15.0.0 I, [2024-05-06T15:46:59.305803 #726151] INFO -- : CPPFLAGS = I, [2024-05-06T15:46:59.305815 #726151] INFO -- : DLDFLAGS = -Wl,--compress-debug-sections=zlib -Wl,-soname,libruby.so.3.4 -fstack-protector-strong I, [2024-05-06T15:46:59.305827 #726151] INFO -- : SOLIBS = -lz -lrt -lrt -lgmp -ldl -lcrypt -lm -lpthread I, [2024-05-06T15:46:59.305837 #726151] INFO -- : LANG = en_US.UTF-8 I, [2024-05-06T15:46:59.305848 #726151] INFO -- : LC_ALL = I, [2024-05-06T15:46:59.305858 #726151] INFO -- : LC_CTYPE = I, [2024-05-06T15:46:59.305871 #726151] INFO -- : MFLAGS = -j20 --jobserver-auth=4,5 I, [2024-05-06T15:46:59.305882 #726151] INFO -- : RUSTC = no I, [2024-05-06T15:46:59.305892 #726151] INFO -- : YJIT_RUSTC_ARGS = --crate-name=yjit --crate-type=staticlib --edition=2021 -g -C lto=thin -C opt-level=3 -C overflow-checks=on '--out-dir=/tmp/ruby/build/trunk/yjit/target/release/' /tmp/ruby/src/trunk/yjit/src/lib.rs I, [2024-05-06T15:46:59.306300 #726151] INFO -- : /tmp/ruby/src/trunk/.bundle/.timestamp/minitest.revision unchanged I, [2024-05-06T15:46:59.306452 #726151] INFO -- : /tmp/ruby/src/trunk/.bundle/.timestamp/power_assert.revision unchanged I, [2024-05-06T15:46:59.334796 #726151] INFO -- : echo ba7872795d5de04adb8ff500c0e6afdc81a041dd | /bin/sh /tmp/ruby/src/trunk/tool/ifchange /tmp/ruby/src/trunk/.bundle/.timestamp/rbs.revision - I, [2024-05-06T15:46:59.334903 #726151] INFO -- : echo b19a6416da3a05d57fadd6ffdadb382b6d236ca5 | /bin/sh /tmp/ruby/src/trunk/tool/ifchange /tmp/ruby/src/trunk/.bundle/.timestamp/typeprof.revision - I, [2024-05-06T15:46:59.335587 #726151] INFO -- : generating enc.mk I, [2024-05-06T15:46:59.335616 #726151] INFO -- : gcc (Ubuntu 11.4.0-1ubuntu1~22.04) 11.4.0 I, [2024-05-06T15:46:59.335629 #726151] INFO -- : Copyright (C) 2021 Free Software Foundation, Inc. I, [2024-05-06T15:46:59.335640 #726151] INFO -- : This is free software; see the source for copying conditions. There is NO I, [2024-05-06T15:46:59.335651 #726151] INFO -- : warranty; not even for MERCHANTABILITY or FITNESS FOR A PARTICULAR PURPOSE. I, [2024-05-06T15:46:59.335661 #726151] INFO -- : I, [2024-05-06T15:46:59.336514 #726151] INFO -- : /tmp/ruby/src/trunk/.bundle/.timestamp/rbs.revision unchanged I, [2024-05-06T15:46:59.336878 #726151] INFO -- : /tmp/ruby/src/trunk/.bundle/.timestamp/typeprof.revision unchanged I, [2024-05-06T15:46:59.457569 #726151] INFO -- : Building power_assert@84e85124c5014a139af39161d484156cfe87a9ed to /tmp/ruby/src/trunk/gems/power_assert-2.0.3.gem I, [2024-05-06T15:46:59.458169 #726151] INFO -- : making srcs under enc I, [2024-05-06T15:46:59.458533 #726151] INFO -- : making enc I, [2024-05-06T15:46:59.475597 #726151] INFO -- : make[1]: Entering directory '/tmp/ruby/build/trunk' I, [2024-05-06T15:46:59.475649 #726151] INFO -- : make[1]: Nothing to be done for 'enc'. I, [2024-05-06T15:46:59.475663 #726151] INFO -- : make[1]: Leaving directory '/tmp/ruby/build/trunk' I, [2024-05-06T15:46:59.488067 #726151] INFO -- : make[1]: Entering directory '/tmp/ruby/build/trunk' I, [2024-05-06T15:46:59.488134 #726151] INFO -- : make[1]: Nothing to be done for 'srcs'. I, [2024-05-06T15:46:59.488148 #726151] INFO -- : make[1]: Leaving directory '/tmp/ruby/build/trunk' I, [2024-05-06T15:46:59.488793 #726151] INFO -- : generating transdb.h I, [2024-05-06T15:46:59.526160 #726151] INFO -- : Successfully built RubyGem I, [2024-05-06T15:46:59.526219 #726151] INFO -- : Name: power_assert I, [2024-05-06T15:46:59.526233 #726151] INFO -- : Version: 2.0.4dev I, [2024-05-06T15:46:59.526244 #726151] INFO -- : File: power_assert-2.0.4dev.gem I, [2024-05-06T15:46:59.528515 #726151] INFO -- : Extracting bundle gem power_assert-2.0.3... I, [2024-05-06T15:46:59.583978 #726151] INFO -- : transdb.h unchanged I, [2024-05-06T15:46:59.585515 #726151] INFO -- : generating makefiles ext/configure-ext.mk I, [2024-05-06T15:46:59.585905 #726151] INFO -- : making trans I, [2024-05-06T15:46:59.589439 #726151] INFO -- : Try with hash version of bundled gems instead of gems/power_assert-2.0.3.gem. We don't use this gem with release version of Ruby. I, [2024-05-06T15:46:59.594486 #726151] INFO -- : Unpacked gems/power_assert-2.0.4dev.gem I, [2024-05-06T15:46:59.612490 #726151] INFO -- : ext/configure-ext.mk unchanged I, [2024-05-06T15:46:59.615121 #726151] INFO -- : make[1]: Entering directory '/tmp/ruby/build/trunk' I, [2024-05-06T15:46:59.620679 #726151] INFO -- : make[1]: Entering directory '/tmp/ruby/build/trunk' I, [2024-05-06T15:46:59.620771 #726151] INFO -- : make[1]: Nothing to be done for 'trans'. I, [2024-05-06T15:46:59.620782 #726151] INFO -- : make[1]: Leaving directory '/tmp/ruby/build/trunk' I, [2024-05-06T15:46:59.621638 #726151] INFO -- : making encs I, [2024-05-06T15:46:59.679907 #726151] INFO -- : make[1]: Entering directory '/tmp/ruby/build/trunk' I, [2024-05-06T15:46:59.679981 #726151] INFO -- : make[1]: Nothing to be done for 'encs'. I, [2024-05-06T15:46:59.680010 #726151] INFO -- : make[1]: Leaving directory '/tmp/ruby/build/trunk' I, [2024-05-06T15:46:59.770434 #726151] INFO -- : make[1]: Leaving directory '/tmp/ruby/build/trunk' I, [2024-05-06T15:46:59.771052 #726151] INFO -- : generating makefile exts.mk I, [2024-05-06T15:46:59.808388 #726151] INFO -- : exts.mk unchanged I, [2024-05-06T15:46:59.813069 #726151] INFO -- : make[1]: Entering directory '/tmp/ruby/build/trunk' I, [2024-05-06T15:46:59.833260 #726151] INFO -- : make[2]: Entering directory '/tmp/ruby/build/trunk/ext/digest' I, [2024-05-06T15:46:59.834671 #726151] INFO -- : make[2]: Entering directory '/tmp/ruby/build/trunk/ext/coverage' I, [2024-05-06T15:46:59.834773 #726151] INFO -- : make[2]: Entering directory '/tmp/ruby/build/trunk/ext/json' I, [2024-05-06T15:46:59.835080 #726151] INFO -- : make[2]: Entering directory '/tmp/ruby/build/trunk/ext/date' I, [2024-05-06T15:46:59.835302 #726151] INFO -- : make[2]: Entering directory '/tmp/ruby/build/trunk/ext/io/console' I, [2024-05-06T15:46:59.836562 #726151] INFO -- : make[2]: Entering directory '/tmp/ruby/build/trunk/ext/rubyvm' I, [2024-05-06T15:46:59.836926 #726151] INFO -- : make[2]: Entering directory '/tmp/ruby/build/trunk/ext/monitor' I, [2024-05-06T15:46:59.837371 #726151] INFO -- : make[2]: Entering directory '/tmp/ruby/build/trunk/ext/pathname' I, [2024-05-06T15:46:59.837664 #726151] INFO -- : make[2]: Entering directory '/tmp/ruby/build/trunk/ext/pty' I, [2024-05-06T15:46:59.837924 #726151] INFO -- : make[2]: Entering directory '/tmp/ruby/build/trunk/ext/fiddle' I, [2024-05-06T15:46:59.838181 #726151] INFO -- : make[2]: Leaving directory '/tmp/ruby/build/trunk/ext/digest' I, [2024-05-06T15:46:59.838432 #726151] INFO -- : make[2]: Leaving directory '/tmp/ruby/build/trunk/ext/coverage' I, [2024-05-06T15:46:59.838544 #726151] INFO -- : make[2]: Leaving directory '/tmp/ruby/build/trunk/ext/io/console' I, [2024-05-06T15:46:59.838625 #726151] INFO -- : make[2]: Leaving directory '/tmp/ruby/build/trunk/ext/rubyvm' I, [2024-05-06T15:46:59.838993 #726151] INFO -- : make[2]: Entering directory '/tmp/ruby/build/trunk/ext/objspace' I, [2024-05-06T15:46:59.839166 #726151] INFO -- : make[2]: Entering directory '/tmp/ruby/build/trunk/ext/psych' I, [2024-05-06T15:46:59.839264 #726151] INFO -- : make[2]: Leaving directory '/tmp/ruby/build/trunk/ext/date' I, [2024-05-06T15:46:59.839538 #726151] INFO -- : make[2]: Leaving directory '/tmp/ruby/build/trunk/ext/monitor' I, [2024-05-06T15:46:59.839625 #726151] INFO -- : make[2]: Leaving directory '/tmp/ruby/build/trunk/ext/pathname' I, [2024-05-06T15:46:59.840331 #726151] INFO -- : make[2]: Leaving directory '/tmp/ruby/build/trunk/ext/pty' I, [2024-05-06T15:46:59.842101 #726151] INFO -- : make[2]: Entering directory '/tmp/ruby/build/trunk/ext/ripper' I, [2024-05-06T15:46:59.842722 #726151] INFO -- : make[2]: Leaving directory '/tmp/ruby/build/trunk/ext/objspace' I, [2024-05-06T15:46:59.842946 #726151] INFO -- : make[2]: Entering directory '/tmp/ruby/build/trunk/.bundle/gems/bigdecimal-3.1.7/ext/bigdecimal' I, [2024-05-06T15:46:59.843000 #726151] INFO -- : make[2]: Entering directory '/tmp/ruby/build/trunk/.bundle/gems/nkf-0.2.0/ext/nkf' I, [2024-05-06T15:46:59.843025 #726151] INFO -- : make[2]: Entering directory '/tmp/ruby/build/trunk/.bundle/gems/debug-1.9.2/ext/debug' I, [2024-05-06T15:46:59.843193 #726151] INFO -- : make[2]: Entering directory '/tmp/ruby/build/trunk/.bundle/gems/racc-1.7.3/ext/racc/cparse' I, [2024-05-06T15:46:59.843427 #726151] INFO -- : make[2]: Leaving directory '/tmp/ruby/build/trunk/ext/json' I, [2024-05-06T15:46:59.843451 #726151] INFO -- : make[2]: Entering directory '/tmp/ruby/build/trunk/.bundle/gems/syslog-0.1.2/ext/syslog' I, [2024-05-06T15:46:59.843867 #726151] INFO -- : make[2]: Entering directory '/tmp/ruby/build/trunk/.bundle/gems/rbs-3.4.4/ext/rbs_extension' I, [2024-05-06T15:46:59.847092 #726151] INFO -- : make[2]: Leaving directory '/tmp/ruby/build/trunk/ext/fiddle' I, [2024-05-06T15:46:59.847159 #726151] INFO -- : make[2]: Leaving directory '/tmp/ruby/build/trunk/ext/ripper' I, [2024-05-06T15:46:59.847611 #726151] INFO -- : make[2]: Entering directory '/tmp/ruby/build/trunk/ext/socket' I, [2024-05-06T15:46:59.851102 #726151] INFO -- : make[2]: Leaving directory '/tmp/ruby/build/trunk/ext/psych' I, [2024-05-06T15:46:59.851220 #726151] INFO -- : make[2]: Entering directory '/tmp/ruby/build/trunk/ext/openssl' I, [2024-05-06T15:46:59.851748 #726151] INFO -- : make[2]: Entering directory '/tmp/ruby/build/trunk/ext/digest/sha2' I, [2024-05-06T15:46:59.855013 #726151] INFO -- : make[2]: Leaving directory '/tmp/ruby/build/trunk/ext/digest/sha2' I, [2024-05-06T15:46:59.856660 #726151] INFO -- : make[2]: Leaving directory '/tmp/ruby/build/trunk/ext/socket' I, [2024-05-06T15:46:59.862512 #726151] INFO -- : make[2]: Leaving directory '/tmp/ruby/build/trunk/ext/openssl' I, [2024-05-06T15:46:59.865340 #726151] INFO -- : make[2]: Leaving directory '/tmp/ruby/build/trunk/.bundle/gems/bigdecimal-3.1.7/ext/bigdecimal' I, [2024-05-06T15:46:59.866915 #726151] INFO -- : make[2]: Leaving directory '/tmp/ruby/build/trunk/.bundle/gems/racc-1.7.3/ext/racc/cparse' I, [2024-05-06T15:46:59.867270 #726151] INFO -- : make[2]: Leaving directory '/tmp/ruby/build/trunk/.bundle/gems/syslog-0.1.2/ext/syslog' I, [2024-05-06T15:46:59.867758 #726151] INFO -- : make[2]: Leaving directory '/tmp/ruby/build/trunk/.bundle/gems/nkf-0.2.0/ext/nkf' I, [2024-05-06T15:46:59.874577 #726151] INFO -- : make[2]: Leaving directory '/tmp/ruby/build/trunk/.bundle/gems/debug-1.9.2/ext/debug' I, [2024-05-06T15:46:59.875481 #726151] INFO -- : make[2]: Leaving directory '/tmp/ruby/build/trunk/.bundle/gems/rbs-3.4.4/ext/rbs_extension' I, [2024-05-06T15:46:59.899471 #726151] INFO -- : make[2]: Entering directory '/tmp/ruby/build/trunk' I, [2024-05-06T15:46:59.967320 #726151] INFO -- : make[2]: 'ruby' is up to date. I, [2024-05-06T15:46:59.967391 #726151] INFO -- : make[2]: Leaving directory '/tmp/ruby/build/trunk' I, [2024-05-06T15:46:59.967691 #726151] INFO -- : make[1]: Leaving directory '/tmp/ruby/build/trunk' I, [2024-05-06T15:46:59.971377 #726151] INFO -- : make[1]: Entering directory '/tmp/ruby/build/trunk' I, [2024-05-06T15:46:59.971438 #726151] INFO -- : make[1]: Nothing to be done for 'note'. I, [2024-05-06T15:46:59.971457 #726151] INFO -- : make[1]: Leaving directory '/tmp/ruby/build/trunk' I, [2024-05-06T15:46:59.971633 #726151] INFO -- : ./miniruby -I/tmp/ruby/src/trunk/lib -I. -I.ext/common /tmp/ruby/src/trunk/tool/runruby.rb --extout=.ext -- --disable-gems -r./x86_64-linux-fake /tmp/ruby/src/trunk/tool/rbinstall.rb --make="make" --dest-dir="" --extout=".ext" --ext-build-dir="./ext" --mflags="-j20 --jobserver-auth=4,5" --make-flags=" -j20 --jobserver-auth=4,5" --data-mode=0644 --prog-mode=0755 --installed-list .installed.list --mantype="doc" --gnumake --install=all --exclude=doc I, [2024-05-06T15:47:00.067256 #726151] INFO -- : Installing to I, [2024-05-06T15:47:00.067339 #726151] INFO -- : installing binary commands: /tmp/ruby/install/trunk/bin I, [2024-05-06T15:47:00.067354 #726151] INFO -- : installing base libraries: /tmp/ruby/install/trunk/lib I, [2024-05-06T15:47:00.074772 #726151] INFO -- : installing arch files: /tmp/ruby/install/trunk/lib/ruby/3.4.0+0/x86_64-linux I, [2024-05-06T15:47:00.074833 #726151] INFO -- : installing pkgconfig data: /tmp/ruby/install/trunk/lib/pkgconfig I, [2024-05-06T15:47:00.074847 #726151] INFO -- : installing extension objects: /tmp/ruby/install/trunk/lib/ruby/3.4.0+0/x86_64-linux I, [2024-05-06T15:47:00.084505 #726151] INFO -- : installing extension objects: /tmp/ruby/install/trunk/lib/ruby/site_ruby/3.4.0+0/x86_64-linux I, [2024-05-06T15:47:00.084565 #726151] INFO -- : installing extension objects: /tmp/ruby/install/trunk/lib/ruby/vendor_ruby/3.4.0+0/x86_64-linux I, [2024-05-06T15:47:00.084579 #726151] INFO -- : installing extension headers: /tmp/ruby/install/trunk/include/ruby-3.4.0+0/x86_64-linux I, [2024-05-06T15:47:00.084607 #726151] INFO -- : installing extension scripts: /tmp/ruby/install/trunk/lib/ruby/3.4.0+0 I, [2024-05-06T15:47:00.088482 #726151] INFO -- : installing extension scripts: /tmp/ruby/install/trunk/lib/ruby/site_ruby/3.4.0+0 I, [2024-05-06T15:47:00.088671 #726151] INFO -- : installing extension scripts: /tmp/ruby/install/trunk/lib/ruby/vendor_ruby/3.4.0+0 I, [2024-05-06T15:47:00.088691 #726151] INFO -- : installing extension headers: /tmp/ruby/install/trunk/include/ruby-3.4.0+0/ruby I, [2024-05-06T15:47:00.088703 #726151] INFO -- : installing command scripts: /tmp/ruby/install/trunk/bin I, [2024-05-06T15:47:00.088715 #726151] INFO -- : installing library scripts: /tmp/ruby/install/trunk/lib/ruby/3.4.0+0 I, [2024-05-06T15:47:00.122832 #726151] INFO -- : installing common headers: /tmp/ruby/install/trunk/include/ruby-3.4.0+0 I, [2024-05-06T15:47:00.128387 #726151] INFO -- : installing manpages: /tmp/ruby/install/trunk/share/man/man1 I, [2024-05-06T15:47:00.128456 #726151] INFO -- : installing default gems from lib: /tmp/ruby/install/trunk/lib/ruby/gems/3.4.0+0 I, [2024-05-06T15:47:00.150981 #726151] INFO -- : benchmark 0.3.0 I, [2024-05-06T15:47:00.157885 #726151] INFO -- : bundler 2.6.0.dev I, [2024-05-06T15:47:00.159987 #726151] INFO -- : cgi 0.4.1 I, [2024-05-06T15:47:00.160567 #726151] INFO -- : delegate 0.3.1 I, [2024-05-06T15:47:00.161023 #726151] INFO -- : did_you_mean 1.6.3 I, [2024-05-06T15:47:00.161535 #726151] INFO -- : english 0.8.0 I, [2024-05-06T15:47:00.161947 #726151] INFO -- : erb 4.0.4 I, [2024-05-06T15:47:00.162718 #726151] INFO -- : error_highlight 0.6.0 I, [2024-05-06T15:47:00.163158 #726151] INFO -- : fileutils 1.7.2 I, [2024-05-06T15:47:00.163618 #726151] INFO -- : find 0.2.0 I, [2024-05-06T15:47:00.164023 #726151] INFO -- : forwardable 1.3.3 I, [2024-05-06T15:47:00.164545 #726151] INFO -- : ipaddr 1.2.6 I, [2024-05-06T15:47:00.164985 #726151] INFO -- : irb 1.13.1 I, [2024-05-06T15:47:00.166439 #726151] INFO -- : logger 1.6.0 I, [2024-05-06T15:47:00.166958 #726151] INFO -- : net-http 0.4.1 I, [2024-05-06T15:47:00.167480 #726151] INFO -- : net-protocol 0.2.2 I, [2024-05-06T15:47:00.167969 #726151] INFO -- : open-uri 0.4.1 I, [2024-05-06T15:47:00.168477 #726151] INFO -- : open3 0.2.1 I, [2024-05-06T15:47:00.168954 #726151] INFO -- : optparse 0.5.0 I, [2024-05-06T15:47:00.169479 #726151] INFO -- : ostruct 0.6.0 I, [2024-05-06T15:47:00.170052 #726151] INFO -- : pp 0.5.0 I, [2024-05-06T15:47:00.170546 #726151] INFO -- : prettyprint 0.2.0 I, [2024-05-06T15:47:00.170948 #726151] INFO -- : prism 0.27.0 I, [2024-05-06T15:47:00.171512 #726151] INFO -- : pstore 0.1.3 I, [2024-05-06T15:47:00.171972 #726151] INFO -- : rdoc 6.6.3.1 I, [2024-05-06T15:47:00.173571 #726151] INFO -- : readline 0.0.4 I, [2024-05-06T15:47:00.174243 #726151] INFO -- : reline 0.5.5 I, [2024-05-06T15:47:00.174657 #726151] INFO -- : resolv 0.4.0 I, [2024-05-06T15:47:00.175128 #726151] INFO -- : ruby2_keywords 0.0.5 I, [2024-05-06T15:47:00.175610 #726151] INFO -- : securerandom 0.3.1 I, [2024-05-06T15:47:00.176036 #726151] INFO -- : set 1.1.0 I, [2024-05-06T15:47:00.176664 #726151] INFO -- : shellwords 0.2.0 I, [2024-05-06T15:47:00.177143 #726151] INFO -- : singleton 0.2.0 I, [2024-05-06T15:47:00.177551 #726151] INFO -- : syntax_suggest 2.0.0 I, [2024-05-06T15:47:00.178246 #726151] INFO -- : tempfile 0.2.1 I, [2024-05-06T15:47:00.178795 #726151] INFO -- : time 0.3.0 I, [2024-05-06T15:47:00.179291 #726151] INFO -- : timeout 0.4.1 I, [2024-05-06T15:47:00.180318 #726151] INFO -- : tmpdir 0.2.0 I, [2024-05-06T15:47:00.180876 #726151] INFO -- : tsort 0.2.0 I, [2024-05-06T15:47:00.181368 #726151] INFO -- : un 0.3.0 I, [2024-05-06T15:47:00.181870 #726151] INFO -- : uri 0.13.0 I, [2024-05-06T15:47:00.182383 #726151] INFO -- : weakref 0.1.3 I, [2024-05-06T15:47:00.182865 #726151] INFO -- : yaml 0.3.0 I, [2024-05-06T15:47:00.183352 #726151] INFO -- : installing default gems from ext: /tmp/ruby/install/trunk/lib/ruby/gems/3.4.0+0 I, [2024-05-06T15:47:00.189914 #726151] INFO -- : date 3.3.4 I, [2024-05-06T15:47:00.190379 #726151] INFO -- : digest 3.1.1 I, [2024-05-06T15:47:00.191044 #726151] INFO -- : etc 1.4.3 I, [2024-05-06T15:47:00.191563 #726151] INFO -- : fcntl 1.1.0 I, [2024-05-06T15:47:00.192040 #726151] INFO -- : fiddle 1.1.3 I, [2024-05-06T15:47:00.192750 #726151] INFO -- : io-console 0.7.2 I, [2024-05-06T15:47:00.193243 #726151] INFO -- : io-nonblock 0.3.0 I, [2024-05-06T15:47:00.193704 #726151] INFO -- : io-wait 0.3.1 I, [2024-05-06T15:47:00.194150 #726151] INFO -- : json 2.7.2 I, [2024-05-06T15:47:00.194987 #726151] INFO -- : openssl 3.2.0 I, [2024-05-06T15:47:00.195709 #726151] INFO -- : pathname 0.3.0 I, [2024-05-06T15:47:00.196229 #726151] INFO -- : psych 5.1.2 I, [2024-05-06T15:47:00.196881 #726151] INFO -- : stringio 3.1.1 I, [2024-05-06T15:47:00.197398 #726151] INFO -- : strscan 3.1.1 I, [2024-05-06T15:47:00.197878 #726151] INFO -- : zlib 3.1.0 I, [2024-05-06T15:47:00.198252 #726151] INFO -- : installing bundled gems: /tmp/ruby/install/trunk/lib/ruby/gems/3.4.0+0 I, [2024-05-06T15:47:00.198560 #726151] INFO -- : minitest 5.22.3 I, [2024-05-06T15:47:00.206104 #726151] INFO -- : rake 13.2.1 I, [2024-05-06T15:47:00.209547 #726151] INFO -- : test-unit 3.6.2 I, [2024-05-06T15:47:00.214234 #726151] INFO -- : rexml 3.2.6 I, [2024-05-06T15:47:00.217707 #726151] INFO -- : rss 0.3.0 I, [2024-05-06T15:47:00.220815 #726151] INFO -- : net-ftp 0.3.4 I, [2024-05-06T15:47:00.222288 #726151] INFO -- : net-imap 0.4.10 I, [2024-05-06T15:47:00.225216 #726151] INFO -- : net-pop 0.1.2 I, [2024-05-06T15:47:00.226123 #726151] INFO -- : net-smtp 0.5.0 I, [2024-05-06T15:47:00.227203 #726151] INFO -- : matrix 0.4.2 I, [2024-05-06T15:47:00.230843 #726151] INFO -- : prime 0.1.2 I, [2024-05-06T15:47:00.236107 #726151] INFO -- : rbs 3.4.4 I, [2024-05-06T15:47:00.258883 #726151] INFO -- : typeprof 0.21.11 I, [2024-05-06T15:47:00.261997 #726151] INFO -- : debug 1.9.2 I, [2024-05-06T15:47:00.264745 #726151] INFO -- : racc 1.7.3 I, [2024-05-06T15:47:00.267214 #726151] INFO -- : mutex_m 0.2.0 I, [2024-05-06T15:47:00.268649 #726151] INFO -- : getoptlong 0.2.1 I, [2024-05-06T15:47:00.269945 #726151] INFO -- : base64 0.2.0 I, [2024-05-06T15:47:00.270939 #726151] INFO -- : bigdecimal 3.1.7 I, [2024-05-06T15:47:00.272939 #726151] INFO -- : observer 0.1.2 I, [2024-05-06T15:47:00.274007 #726151] INFO -- : abbrev 0.1.2 I, [2024-05-06T15:47:00.275456 #726151] INFO -- : resolv-replace 0.1.1 I, [2024-05-06T15:47:00.276828 #726151] INFO -- : rinda 0.2.0 I, [2024-05-06T15:47:00.278259 #726151] INFO -- : drb 2.2.1 I, [2024-05-06T15:47:00.279750 #726151] INFO -- : nkf 0.2.0 I, [2024-05-06T15:47:00.282299 #726151] INFO -- : syslog 0.1.2 I, [2024-05-06T15:47:00.283870 #726151] INFO -- : csv 3.3.0 I, [2024-05-06T15:47:00.286142 #726151] INFO -- : installing bundled gem cache: /tmp/ruby/install/trunk/lib/ruby/gems/3.4.0+0/cache I, [2024-05-06T15:47:00.287595 #726151] INFO -- : skipped bundled gems: I, [2024-05-06T15:47:00.287662 #726151] INFO -- : power_assert-2.0.4dev.gem not found in bundled_gems I, [2024-05-06T15:47:00.291102 #726151] INFO -- : $$$[end] "make install -j20" exit with 0. I, [2024-05-06T15:47:00.291244 #726151] INFO -- : $$$[beg] make yes-btest TESTOPTS='-q -j20' I, [2024-05-06T15:47:05.871148 #726151] INFO -- : PASS all 1936 tests E, [2024-05-06T15:47:05.876923 #726151] ERROR -- : I, [2024-05-06T15:47:05.877198 #726151] INFO -- : $$$[end] "make yes-btest TESTOPTS='-q -j20'" exit with 0. I, [2024-05-06T15:47:05.877305 #726151] INFO -- : $$$[beg] make yes-test-basic TESTS='-j20' I, [2024-05-06T15:47:05.938809 #726151] INFO -- : BASERUBY = /usr/bin/ruby --disable=gems I, [2024-05-06T15:47:05.938857 #726151] INFO -- : CC = gcc I, [2024-05-06T15:47:05.938874 #726151] INFO -- : LD = ld I, [2024-05-06T15:47:05.938889 #726151] INFO -- : LDSHARED = gcc -shared I, [2024-05-06T15:47:05.938904 #726151] INFO -- : CFLAGS = -O3 -fno-fast-math -ggdb3 -Wall -Wextra -Wdeprecated-declarations -Wdiv-by-zero -Wduplicated-cond -Wimplicit-function-declaration -Wimplicit-int -Wpointer-arith -Wwrite-strings -Wold-style-definition -Wimplicit-fallthrough=0 -Wmissing-noreturn -Wno-cast-function-type -Wno-constant-logical-operand -Wno-long-long -Wno-missing-field-initializers -Wno-overlength-strings -Wno-packed-bitfield-compat -Wno-parentheses-equality -Wno-self-assign -Wno-tautological-compare -Wno-unused-parameter -Wno-unused-value -Wsuggest-attribute=format -Wsuggest-attribute=noreturn -Wunused-variable -Wmisleading-indentation -Wundef -fPIC I, [2024-05-06T15:47:05.938919 #726151] INFO -- : XCFLAGS = -U_FORTIFY_SOURCE -D_FORTIFY_SOURCE=2 -fstack-protector-strong -fno-strict-overflow -fvisibility=hidden -fexcess-precision=standard -DRUBY_EXPORT -I. -I.ext/include/x86_64-linux -I/tmp/ruby/src/trunk/include -I/tmp/ruby/src/trunk -I/tmp/ruby/src/trunk/prism -I/tmp/ruby/src/trunk/enc/unicode/15.0.0 I, [2024-05-06T15:47:05.938940 #726151] INFO -- : CPPFLAGS = I, [2024-05-06T15:47:05.938955 #726151] INFO -- : DLDFLAGS = -Wl,--compress-debug-sections=zlib -Wl,-soname,libruby.so.3.4 -fstack-protector-strong I, [2024-05-06T15:47:05.938969 #726151] INFO -- : SOLIBS = -lz -lrt -lrt -lgmp -ldl -lcrypt -lm -lpthread I, [2024-05-06T15:47:05.938999 #726151] INFO -- : LANG = en_US.UTF-8 I, [2024-05-06T15:47:05.939013 #726151] INFO -- : LC_ALL = I, [2024-05-06T15:47:05.939026 #726151] INFO -- : LC_CTYPE = I, [2024-05-06T15:47:05.939039 #726151] INFO -- : MFLAGS = I, [2024-05-06T15:47:05.939052 #726151] INFO -- : RUSTC = no I, [2024-05-06T15:47:05.939065 #726151] INFO -- : YJIT_RUSTC_ARGS = --crate-name=yjit --crate-type=staticlib --edition=2021 -g -C lto=thin -C opt-level=3 -C overflow-checks=on '--out-dir=/tmp/ruby/build/trunk/yjit/target/release/' /tmp/ruby/src/trunk/yjit/src/lib.rs I, [2024-05-06T15:47:05.939429 #726151] INFO -- : gcc (Ubuntu 11.4.0-1ubuntu1~22.04) 11.4.0 I, [2024-05-06T15:47:05.939478 #726151] INFO -- : Copyright (C) 2021 Free Software Foundation, Inc. I, [2024-05-06T15:47:05.939496 #726151] INFO -- : This is free software; see the source for copying conditions. There is NO I, [2024-05-06T15:47:05.939522 #726151] INFO -- : warranty; not even for MERCHANTABILITY or FITNESS FOR A PARTICULAR PURPOSE. I, [2024-05-06T15:47:05.939538 #726151] INFO -- : I, [2024-05-06T15:47:06.046726 #726151] INFO -- : Checking leaked global symbols...none I, [2024-05-06T15:47:06.087940 #726151] INFO -- : /tmp/ruby/src/trunk/basictest/test.rb:assignment ....................................................................................................................................................................................................................................................................................................................................................................................OK 372 I, [2024-05-06T15:47:06.088024 #726151] INFO -- : /tmp/ruby/src/trunk/basictest/test.rb:condition ..OK 2 I, [2024-05-06T15:47:06.088040 #726151] INFO -- : /tmp/ruby/src/trunk/basictest/test.rb:if/unless ...OK 3 I, [2024-05-06T15:47:06.088053 #726151] INFO -- : /tmp/ruby/src/trunk/basictest/test.rb:case .....OK 5 I, [2024-05-06T15:47:06.088219 #726151] INFO -- : /tmp/ruby/src/trunk/basictest/test.rb:while/until ........OK 8 I, [2024-05-06T15:47:06.088293 #726151] INFO -- : /tmp/ruby/src/trunk/basictest/test.rb:exception ..........OK 10 I, [2024-05-06T15:47:06.088548 #726151] INFO -- : /tmp/ruby/src/trunk/basictest/test.rb:array .......................................OK 39 I, [2024-05-06T15:47:06.088630 #726151] INFO -- : /tmp/ruby/src/trunk/basictest/test.rb:hash ...........................OK 27 I, [2024-05-06T15:47:06.089353 #726151] INFO -- : /tmp/ruby/src/trunk/basictest/test.rb:iterator ...........................................................................................................OK 107 I, [2024-05-06T15:47:06.089637 #726151] INFO -- : /tmp/ruby/src/trunk/basictest/test.rb:float ................................................................................OK 80 I, [2024-05-06T15:47:06.090653 #726151] INFO -- : /tmp/ruby/src/trunk/basictest/test.rb:bignum ...............................OK 31 I, [2024-05-06T15:47:06.091433 #726151] INFO -- : /tmp/ruby/src/trunk/basictest/test.rb:string & char ..............................................................OK 62 I, [2024-05-06T15:47:06.091471 #726151] INFO -- : /tmp/ruby/src/trunk/basictest/test.rb:assignment ..........OK 10 I, [2024-05-06T15:47:06.091493 #726151] INFO -- : /tmp/ruby/src/trunk/basictest/test.rb:call ......OK 6 I, [2024-05-06T15:47:06.091547 #726151] INFO -- : /tmp/ruby/src/trunk/basictest/test.rb:proc .........OK 9 I, [2024-05-06T15:47:06.191847 #726151] INFO -- : /tmp/ruby/src/trunk/basictest/test.rb:signal ..OK 2 I, [2024-05-06T15:47:06.192319 #726151] INFO -- : /tmp/ruby/src/trunk/basictest/test.rb:eval ...........................OK 27 I, [2024-05-06T15:47:06.294769 #726151] INFO -- : /tmp/ruby/src/trunk/basictest/test.rb:system ........OK 8 I, [2024-05-06T15:47:06.294845 #726151] INFO -- : /tmp/ruby/src/trunk/basictest/test.rb:const .....OK 5 I, [2024-05-06T15:47:06.294861 #726151] INFO -- : /tmp/ruby/src/trunk/basictest/test.rb:clone .....OK 5 I, [2024-05-06T15:47:06.294975 #726151] INFO -- : /tmp/ruby/src/trunk/basictest/test.rb:marshal ....OK 4 I, [2024-05-06T15:47:06.295009 #726151] INFO -- : /tmp/ruby/src/trunk/basictest/test.rb:pack ....OK 4 I, [2024-05-06T15:47:06.295025 #726151] INFO -- : /tmp/ruby/src/trunk/basictest/test.rb:math ..OK 2 I, [2024-05-06T15:47:06.295037 #726151] INFO -- : /tmp/ruby/src/trunk/basictest/test.rb:struct ......OK 6 I, [2024-05-06T15:47:06.295127 #726151] INFO -- : /tmp/ruby/src/trunk/basictest/test.rb:variable ............OK 12 I, [2024-05-06T15:47:06.295152 #726151] INFO -- : /tmp/ruby/src/trunk/basictest/test.rb:trace ...OK 3 I, [2024-05-06T15:47:06.295192 #726151] INFO -- : /tmp/ruby/src/trunk/basictest/test.rb:defined? ............OK 12 I, [2024-05-06T15:47:06.295291 #726151] INFO -- : /tmp/ruby/src/trunk/basictest/test.rb:alias ......OK 6 I, [2024-05-06T15:47:06.295627 #726151] INFO -- : /tmp/ruby/src/trunk/basictest/test.rb:path .......................OK 23 I, [2024-05-06T15:47:06.329594 #726151] INFO -- : /tmp/ruby/src/trunk/basictest/test.rb:gc ....OK 4 I, [2024-05-06T15:47:06.332086 #726151] INFO -- : I, [2024-05-06T15:47:06.332173 #726151] INFO -- : test succeeded I, [2024-05-06T15:47:06.333543 #726151] INFO -- : $$$[end] "make yes-test-basic TESTS='-j20'" exit with 0. I, [2024-05-06T15:47:06.333665 #726151] INFO -- : $$$[beg] make yes-test-all TESTOPTS='--stderr-on-failure' TESTS='-j20' I, [2024-05-06T15:47:06.420693 #726151] INFO -- : BASERUBY = /usr/bin/ruby --disable=gems I, [2024-05-06T15:47:06.420743 #726151] INFO -- : CC = gcc I, [2024-05-06T15:47:06.420757 #726151] INFO -- : LD = ld I, [2024-05-06T15:47:06.420768 #726151] INFO -- : LDSHARED = gcc -shared I, [2024-05-06T15:47:06.420779 #726151] INFO -- : CFLAGS = -O3 -fno-fast-math -ggdb3 -Wall -Wextra -Wdeprecated-declarations -Wdiv-by-zero -Wduplicated-cond -Wimplicit-function-declaration -Wimplicit-int -Wpointer-arith -Wwrite-strings -Wold-style-definition -Wimplicit-fallthrough=0 -Wmissing-noreturn -Wno-cast-function-type -Wno-constant-logical-operand -Wno-long-long -Wno-missing-field-initializers -Wno-overlength-strings -Wno-packed-bitfield-compat -Wno-parentheses-equality -Wno-self-assign -Wno-tautological-compare -Wno-unused-parameter -Wno-unused-value -Wsuggest-attribute=format -Wsuggest-attribute=noreturn -Wunused-variable -Wmisleading-indentation -Wundef -fPIC I, [2024-05-06T15:47:06.420792 #726151] INFO -- : XCFLAGS = -U_FORTIFY_SOURCE -D_FORTIFY_SOURCE=2 -fstack-protector-strong -fno-strict-overflow -fvisibility=hidden -fexcess-precision=standard -DRUBY_EXPORT -I. -I.ext/include/x86_64-linux -I/tmp/ruby/src/trunk/include -I/tmp/ruby/src/trunk -I/tmp/ruby/src/trunk/prism -I/tmp/ruby/src/trunk/enc/unicode/15.0.0 I, [2024-05-06T15:47:06.420802 #726151] INFO -- : CPPFLAGS = I, [2024-05-06T15:47:06.420812 #726151] INFO -- : DLDFLAGS = -Wl,--compress-debug-sections=zlib -Wl,-soname,libruby.so.3.4 -fstack-protector-strong I, [2024-05-06T15:47:06.420823 #726151] INFO -- : SOLIBS = -lz -lrt -lrt -lgmp -ldl -lcrypt -lm -lpthread I, [2024-05-06T15:47:06.420833 #726151] INFO -- : LANG = en_US.UTF-8 I, [2024-05-06T15:47:06.420842 #726151] INFO -- : LC_ALL = I, [2024-05-06T15:47:06.420852 #726151] INFO -- : LC_CTYPE = I, [2024-05-06T15:47:06.420862 #726151] INFO -- : MFLAGS = I, [2024-05-06T15:47:06.420872 #726151] INFO -- : RUSTC = no I, [2024-05-06T15:47:06.420883 #726151] INFO -- : YJIT_RUSTC_ARGS = --crate-name=yjit --crate-type=staticlib --edition=2021 -g -C lto=thin -C opt-level=3 -C overflow-checks=on '--out-dir=/tmp/ruby/build/trunk/yjit/target/release/' /tmp/ruby/src/trunk/yjit/src/lib.rs I, [2024-05-06T15:47:06.421385 #726151] INFO -- : gcc (Ubuntu 11.4.0-1ubuntu1~22.04) 11.4.0 I, [2024-05-06T15:47:06.421439 #726151] INFO -- : Copyright (C) 2021 Free Software Foundation, Inc. I, [2024-05-06T15:47:06.421451 #726151] INFO -- : This is free software; see the source for copying conditions. There is NO I, [2024-05-06T15:47:06.421463 #726151] INFO -- : warranty; not even for MERCHANTABILITY or FITNESS FOR A PARTICULAR PURPOSE. I, [2024-05-06T15:47:06.421485 #726151] INFO -- : I, [2024-05-06T15:47:06.423195 #726151] INFO -- : generating enc.mk I, [2024-05-06T15:47:06.540818 #726151] INFO -- : making enc I, [2024-05-06T15:47:06.557986 #726151] INFO -- : make[1]: Entering directory '/tmp/ruby/build/trunk' I, [2024-05-06T15:47:06.558050 #726151] INFO -- : make[1]: Nothing to be done for 'enc'. I, [2024-05-06T15:47:06.558064 #726151] INFO -- : make[1]: Leaving directory '/tmp/ruby/build/trunk' I, [2024-05-06T15:47:06.558640 #726151] INFO -- : making srcs under enc I, [2024-05-06T15:47:06.589219 #726151] INFO -- : make[1]: Entering directory '/tmp/ruby/build/trunk' I, [2024-05-06T15:47:06.589285 #726151] INFO -- : make[1]: Nothing to be done for 'srcs'. I, [2024-05-06T15:47:06.589299 #726151] INFO -- : make[1]: Leaving directory '/tmp/ruby/build/trunk' I, [2024-05-06T15:47:06.590093 #726151] INFO -- : generating transdb.h I, [2024-05-06T15:47:06.684212 #726151] INFO -- : transdb.h unchanged I, [2024-05-06T15:47:06.685441 #726151] INFO -- : making trans I, [2024-05-06T15:47:06.718846 #726151] INFO -- : make[1]: Entering directory '/tmp/ruby/build/trunk' I, [2024-05-06T15:47:06.718866 #726151] INFO -- : make[1]: Nothing to be done for 'trans'. I, [2024-05-06T15:47:06.718872 #726151] INFO -- : make[1]: Leaving directory '/tmp/ruby/build/trunk' I, [2024-05-06T15:47:06.719298 #726151] INFO -- : making encs I, [2024-05-06T15:47:06.756316 #726151] INFO -- : make[1]: Entering directory '/tmp/ruby/build/trunk' I, [2024-05-06T15:47:06.756337 #726151] INFO -- : make[1]: Nothing to be done for 'encs'. I, [2024-05-06T15:47:06.756343 #726151] INFO -- : make[1]: Leaving directory '/tmp/ruby/build/trunk' I, [2024-05-06T15:47:06.758161 #726151] INFO -- : generating makefiles ext/configure-ext.mk I, [2024-05-06T15:47:06.785636 #726151] INFO -- : ext/configure-ext.mk updated I, [2024-05-06T15:47:06.788004 #726151] INFO -- : make[1]: Entering directory '/tmp/ruby/build/trunk' I, [2024-05-06T15:47:08.143346 #726151] INFO -- : make[1]: Leaving directory '/tmp/ruby/build/trunk' I, [2024-05-06T15:47:08.143983 #726151] INFO -- : generating makefile exts.mk I, [2024-05-06T15:47:08.181108 #726151] INFO -- : exts.mk unchanged I, [2024-05-06T15:47:08.185982 #726151] INFO -- : make[1]: Entering directory '/tmp/ruby/build/trunk' I, [2024-05-06T15:47:08.396608 #726151] INFO -- : make[2]: Entering directory '/tmp/ruby/build/trunk/ext/coverage' I, [2024-05-06T15:47:08.399473 #726151] INFO -- : make[2]: Leaving directory '/tmp/ruby/build/trunk/ext/coverage' I, [2024-05-06T15:47:08.403652 #726151] INFO -- : make[2]: Entering directory '/tmp/ruby/build/trunk/ext/date' I, [2024-05-06T15:47:08.406771 #726151] INFO -- : make[2]: Leaving directory '/tmp/ruby/build/trunk/ext/date' I, [2024-05-06T15:47:08.408943 #726151] INFO -- : make[2]: Entering directory '/tmp/ruby/build/trunk/ext/digest' I, [2024-05-06T15:47:08.414384 #726151] INFO -- : make[2]: Leaving directory '/tmp/ruby/build/trunk/ext/digest' I, [2024-05-06T15:47:08.430335 #726151] INFO -- : make[2]: Entering directory '/tmp/ruby/build/trunk/ext/digest/sha2' I, [2024-05-06T15:47:08.433272 #726151] INFO -- : make[2]: Leaving directory '/tmp/ruby/build/trunk/ext/digest/sha2' I, [2024-05-06T15:47:08.445974 #726151] INFO -- : make[2]: Entering directory '/tmp/ruby/build/trunk/ext/fiddle' I, [2024-05-06T15:47:08.452369 #726151] INFO -- : make[2]: Leaving directory '/tmp/ruby/build/trunk/ext/fiddle' I, [2024-05-06T15:47:08.455296 #726151] INFO -- : make[2]: Entering directory '/tmp/ruby/build/trunk/ext/io/console' I, [2024-05-06T15:47:08.457833 #726151] INFO -- : make[2]: Leaving directory '/tmp/ruby/build/trunk/ext/io/console' I, [2024-05-06T15:47:08.465459 #726151] INFO -- : make[2]: Entering directory '/tmp/ruby/build/trunk/ext/json' I, [2024-05-06T15:47:08.471700 #726151] INFO -- : make[2]: Leaving directory '/tmp/ruby/build/trunk/ext/json' I, [2024-05-06T15:47:08.480701 #726151] INFO -- : make[2]: Entering directory '/tmp/ruby/build/trunk/ext/monitor' I, [2024-05-06T15:47:08.483167 #726151] INFO -- : make[2]: Leaving directory '/tmp/ruby/build/trunk/ext/monitor' I, [2024-05-06T15:47:08.487173 #726151] INFO -- : make[2]: Entering directory '/tmp/ruby/build/trunk/ext/objspace' I, [2024-05-06T15:47:08.490890 #726151] INFO -- : make[2]: Leaving directory '/tmp/ruby/build/trunk/ext/objspace' I, [2024-05-06T15:47:08.502929 #726151] INFO -- : make[2]: Entering directory '/tmp/ruby/build/trunk/ext/openssl' I, [2024-05-06T15:47:08.516204 #726151] INFO -- : make[2]: Leaving directory '/tmp/ruby/build/trunk/ext/openssl' I, [2024-05-06T15:47:08.519214 #726151] INFO -- : make[2]: Entering directory '/tmp/ruby/build/trunk/ext/pathname' I, [2024-05-06T15:47:08.521885 #726151] INFO -- : make[2]: Leaving directory '/tmp/ruby/build/trunk/ext/pathname' I, [2024-05-06T15:47:08.526132 #726151] INFO -- : make[2]: Entering directory '/tmp/ruby/build/trunk/ext/psych' I, [2024-05-06T15:47:08.540949 #726151] INFO -- : make[2]: Leaving directory '/tmp/ruby/build/trunk/ext/psych' I, [2024-05-06T15:47:08.543965 #726151] INFO -- : make[2]: Entering directory '/tmp/ruby/build/trunk/ext/pty' I, [2024-05-06T15:47:08.546411 #726151] INFO -- : make[2]: Leaving directory '/tmp/ruby/build/trunk/ext/pty' I, [2024-05-06T15:47:08.555824 #726151] INFO -- : make[2]: Entering directory '/tmp/ruby/build/trunk/ext/ripper' I, [2024-05-06T15:47:08.560713 #726151] INFO -- : make[2]: Leaving directory '/tmp/ruby/build/trunk/ext/ripper' I, [2024-05-06T15:47:08.562376 #726151] INFO -- : make[2]: Entering directory '/tmp/ruby/build/trunk/ext/rubyvm' I, [2024-05-06T15:47:08.564369 #726151] INFO -- : make[2]: Leaving directory '/tmp/ruby/build/trunk/ext/rubyvm' I, [2024-05-06T15:47:08.572252 #726151] INFO -- : make[2]: Entering directory '/tmp/ruby/build/trunk/ext/socket' I, [2024-05-06T15:47:08.578486 #726151] INFO -- : make[2]: Leaving directory '/tmp/ruby/build/trunk/ext/socket' I, [2024-05-06T15:47:08.589234 #726151] INFO -- : make[2]: Entering directory '/tmp/ruby/build/trunk/.bundle/gems/bigdecimal-3.1.7/ext/bigdecimal' I, [2024-05-06T15:47:08.611775 #726151] INFO -- : make[2]: Leaving directory '/tmp/ruby/build/trunk/.bundle/gems/bigdecimal-3.1.7/ext/bigdecimal' I, [2024-05-06T15:47:08.613615 #726151] INFO -- : make[2]: Entering directory '/tmp/ruby/build/trunk/.bundle/gems/debug-1.9.2/ext/debug' I, [2024-05-06T15:47:08.635594 #726151] INFO -- : make[2]: Leaving directory '/tmp/ruby/build/trunk/.bundle/gems/debug-1.9.2/ext/debug' I, [2024-05-06T15:47:08.637486 #726151] INFO -- : make[2]: Entering directory '/tmp/ruby/build/trunk/.bundle/gems/nkf-0.2.0/ext/nkf' I, [2024-05-06T15:47:08.658946 #726151] INFO -- : make[2]: Leaving directory '/tmp/ruby/build/trunk/.bundle/gems/nkf-0.2.0/ext/nkf' I, [2024-05-06T15:47:08.660838 #726151] INFO -- : make[2]: Entering directory '/tmp/ruby/build/trunk/.bundle/gems/racc-1.7.3/ext/racc/cparse' I, [2024-05-06T15:47:08.682561 #726151] INFO -- : make[2]: Leaving directory '/tmp/ruby/build/trunk/.bundle/gems/racc-1.7.3/ext/racc/cparse' I, [2024-05-06T15:47:08.684875 #726151] INFO -- : make[2]: Entering directory '/tmp/ruby/build/trunk/.bundle/gems/rbs-3.4.4/ext/rbs_extension' I, [2024-05-06T15:47:08.706564 #726151] INFO -- : make[2]: Leaving directory '/tmp/ruby/build/trunk/.bundle/gems/rbs-3.4.4/ext/rbs_extension' I, [2024-05-06T15:47:08.708385 #726151] INFO -- : make[2]: Entering directory '/tmp/ruby/build/trunk/.bundle/gems/syslog-0.1.2/ext/syslog' I, [2024-05-06T15:47:08.729947 #726151] INFO -- : make[2]: Leaving directory '/tmp/ruby/build/trunk/.bundle/gems/syslog-0.1.2/ext/syslog' I, [2024-05-06T15:47:08.753243 #726151] INFO -- : make[2]: Entering directory '/tmp/ruby/build/trunk' I, [2024-05-06T15:47:08.818143 #726151] INFO -- : make[2]: 'ruby' is up to date. I, [2024-05-06T15:47:08.818180 #726151] INFO -- : make[2]: Leaving directory '/tmp/ruby/build/trunk' I, [2024-05-06T15:47:08.818401 #726151] INFO -- : make[1]: Leaving directory '/tmp/ruby/build/trunk' I, [2024-05-06T15:47:08.821946 #726151] INFO -- : make[1]: Entering directory '/tmp/ruby/build/trunk' I, [2024-05-06T15:47:08.821977 #726151] INFO -- : make[1]: Nothing to be done for 'note'. I, [2024-05-06T15:47:08.821985 #726151] INFO -- : make[1]: Leaving directory '/tmp/ruby/build/trunk' I, [2024-05-06T15:47:08.900881 #726151] INFO -- : Run options: I, [2024-05-06T15:47:08.900924 #726151] INFO -- : --seed=27942 I, [2024-05-06T15:47:08.900930 #726151] INFO -- : "--ruby=./miniruby -I/tmp/ruby/src/trunk/lib -I. -I.ext/common /tmp/ruby/src/trunk/tool/runruby.rb --extout=.ext -- --disable-gems" I, [2024-05-06T15:47:08.900934 #726151] INFO -- : --excludes-dir=/tmp/ruby/src/trunk/test/.excludes I, [2024-05-06T15:47:08.900938 #726151] INFO -- : --name=!/memory_leak/ I, [2024-05-06T15:47:08.900942 #726151] INFO -- : --stderr-on-failure I, [2024-05-06T15:47:08.900945 #726151] INFO -- : -j20 I, [2024-05-06T15:47:08.900949 #726151] INFO -- : I, [2024-05-06T15:47:08.900953 #726151] INFO -- : # Running tests: I, [2024-05-06T15:47:08.900956 #726151] INFO -- : I, [2024-05-06T15:47:09.047678 #726151] INFO -- : [ 1/885] 767532=test_rdoc_rd_inline_parser I, [2024-05-06T15:47:09.047742 #726151] INFO -- : [ 2/885] 767515=test_rdoc_markup_to_rdoc I, [2024-05-06T15:47:09.047821 #726151] INFO -- : [ 3/885] 767516=test_default_gems I, [2024-05-06T15:47:09.049400 #726151] INFO -- : [ 4/885] 767518=test_win32ole_type I, [2024-05-06T15:47:09.051173 #726151] INFO -- : [ 5/885] 767517=test_null I, [2024-05-06T15:47:09.052032 #726151] INFO -- : [ 6/885] 767518=test_mul I, [2024-05-06T15:47:09.052154 #726151] INFO -- : [ 7/885] 767528=test_rdoc_markup_attributes I, [2024-05-06T15:47:09.052457 #726151] INFO -- : [ 8/885] 767531=test_date_parse I, [2024-05-06T15:47:09.052618 #726151] INFO -- : [ 9/885] 767529=test_pkey_ec I, [2024-05-06T15:47:09.053120 #726151] INFO -- : [ 10/885] 767530=test_pipe I, [2024-05-06T15:47:09.056165 #726151] INFO -- : [ 11/885] 767533=test_trick I, [2024-05-06T15:47:09.060814 #726151] INFO -- : [ 12/885] 767518=test_thread I, [2024-05-06T15:47:09.069786 #726151] INFO -- : [ 13/885] 767518=test_rdoc_i18n_text I, [2024-05-06T15:47:09.078098 #726151] INFO -- : [ 14/885] 767517=test_defined I, [2024-05-06T15:47:09.079653 #726151] INFO -- : [ 15/885] 767520=test_backtrace I, [2024-05-06T15:47:09.083837 #726151] INFO -- : [ 16/885] 767524=test_key_name_check I, [2024-05-06T15:47:09.083899 #726151] INFO -- : [ 17/885] 767525=test_io_buffer I, [2024-05-06T15:47:09.083907 #726151] INFO -- : [ 18/885] 767527=test_rdoc_rdoc I, [2024-05-06T15:47:09.084377 #726151] INFO -- : [ 19/885] 767523=test_windows_1251 I, [2024-05-06T15:47:09.084421 #726151] INFO -- : [ 20/885] 767521=test_time I, [2024-05-06T15:47:09.085662 #726151] INFO -- : [ 21/885] 767522=test_svcb_https I, [2024-05-06T15:47:09.087158 #726151] INFO -- : [ 22/885] 767520=test_buffering I, [2024-05-06T15:47:09.087429 #726151] INFO -- : [ 23/885] 767526=test_gb18030 I, [2024-05-06T15:47:09.095917 #726151] INFO -- : [ 24/885] 767524=test_gem_uninstaller I, [2024-05-06T15:47:09.097372 #726151] INFO -- : [ 25/885] 767526=test_erb_m17n I, [2024-05-06T15:47:09.099927 #726151] INFO -- : [ 26/885] 767523=test_ole_methods I, [2024-05-06T15:47:09.102622 #726151] INFO -- : [ 27/885] 767523=test_optimization I, [2024-05-06T15:47:09.110704 #726151] INFO -- : [ 28/885] 767516=test_date_conv I, [2024-05-06T15:47:09.113951 #726151] INFO -- : [ 29/885] 767526=test_cgi_tag_helper I, [2024-05-06T15:47:09.122989 #726151] INFO -- : [ 30/885] 767519=test_zlib I, [2024-05-06T15:47:09.123052 #726151] INFO -- : [ 31/885] 767534=test_egrep_cpp I, [2024-05-06T15:47:09.123365 #726151] INFO -- : [ 32/885] 767516=test_gem_resolver_index_set I, [2024-05-06T15:47:09.124009 #726151] INFO -- : [ 33/885] 767525=test_gem_package_old I, [2024-05-06T15:47:09.132067 #726151] INFO -- : [ 34/885] 767522=test_proc I, [2024-05-06T15:47:09.144420 #726151] INFO -- : [ 35/885] 767517=test_string I, [2024-05-06T15:47:09.149050 #726151] INFO -- : [ 36/885] 767526=test_gc_compact I, [2024-05-06T15:47:09.156147 #726151] INFO -- : [ 37/885] 767520=test_gem_validator I, [2024-05-06T15:47:09.164982 #726151] INFO -- : [ 38/885] 767528=test_fnmatch I, [2024-05-06T15:47:09.173336 #726151] INFO -- : [ 39/885] 767532=test_files_test_2 I, [2024-05-06T15:47:09.175881 #726151] INFO -- : [ 40/885] 767531=test_folderitem2_invokeverb I, [2024-05-06T15:47:09.176441 #726151] INFO -- : [ 41/885] 767531=test_require_path_check I, [2024-05-06T15:47:09.181969 #726151] INFO -- : [ 42/885] 767529=test_rdoc_markup_parser I, [2024-05-06T15:47:09.206144 #726151] INFO -- : [ 43/885] 767530=test_string I, [2024-05-06T15:47:09.212895 #726151] INFO -- : [ 44/885] 767528=test_pattern_matching I, [2024-05-06T15:47:09.221699 #726151] INFO -- : [ 45/885] 767515=test_rdoc_stats I, [2024-05-06T15:47:09.226938 #726151] INFO -- : [ 46/885] 767530=test_gem_request_set_lockfile_parser I, [2024-05-06T15:47:09.237906 #726151] INFO -- : [ 47/885] 767518=test_depth_first I, [2024-05-06T15:47:09.244531 #726151] INFO -- : [ 48/885] 767521=test_raise I, [2024-05-06T15:47:09.249744 #726151] INFO -- : [ 49/885] 767521=test_x509attr I, [2024-05-06T15:47:09.249804 #726151] INFO -- : [ 50/885] 767531=test_rdoc_store I, [2024-05-06T15:47:09.260153 #726151] INFO -- : [ 51/885] 767528=json_addition_test I, [2024-05-06T15:47:09.277359 #726151] INFO -- : [ 52/885] 767518=test_custom_command I, [2024-05-06T15:47:09.279866 #726151] INFO -- : [ 53/885] 767534=test_rdoc_parser I, [2024-05-06T15:47:09.280004 #726151] INFO -- : [ 54/885] 767528=test_qsort I, [2024-05-06T15:47:09.282236 #726151] INFO -- : [ 55/885] 767515=test_gem_dependency_resolution_error I, [2024-05-06T15:47:09.290462 #726151] INFO -- : [ 56/885] 767528=test_rdoc_markup_to_tt_only I, [2024-05-06T15:47:09.302681 #726151] INFO -- : [ 57/885] 767521=test_hmac I, [2024-05-06T15:47:09.315978 #726151] INFO -- : [ 58/885] 767528=test_rdoc_tom_doc I, [2024-05-06T15:47:09.325528 #726151] INFO -- : [ 59/885] 767521=test_ifunless I, [2024-05-06T15:47:09.326868 #726151] INFO -- : [ 60/885] 767528=test_assignment I, [2024-05-06T15:47:09.333429 #726151] INFO -- : [ 61/885] 767521=test_gem_commands_lock_command I, [2024-05-06T15:47:09.368367 #726151] INFO -- : [ 62/885] 767516=test_numeric I, [2024-05-06T15:47:09.382838 #726151] INFO -- : [ 63/885] 767525=test_common I, [2024-05-06T15:47:09.385597 #726151] INFO -- : [ 64/885] 767520=test_gem_spec_fetcher I, [2024-05-06T15:47:09.402426 #726151] INFO -- : [ 65/885] 767518=test_gem_command I, [2024-05-06T15:47:09.414519 #726151] INFO -- : [ 66/885] 767529=test_key_actor_vi I, [2024-05-06T15:47:09.425993 #726151] INFO -- : [ 67/885] 767527=test_bug-3571 I, [2024-05-06T15:47:09.446597 #726151] INFO -- : [ 68/885] 767534=test_address_resolve I, [2024-05-06T15:47:09.471853 #726151] INFO -- : [ 69/885] 767527=test_rdoc_token_stream I, [2024-05-06T15:47:09.478769 #726151] INFO -- : [ 70/885] 767516=test_gem_source_list I, [2024-05-06T15:47:09.482957 #726151] INFO -- : [ 71/885] 767527=test_optarg I, [2024-05-06T15:47:09.500962 #726151] INFO -- : [ 72/885] 767530=test_yaml_special_cases I, [2024-05-06T15:47:09.513147 #726151] INFO -- : [ 73/885] 767521=test_config I, [2024-05-06T15:47:09.513506 #726151] INFO -- : [ 74/885] 767530=test_macro I, [2024-05-06T15:47:09.516496 #726151] INFO -- : [ 75/885] 767515=test_pp I, [2024-05-06T15:47:09.522573 #726151] INFO -- : [ 76/885] 767516=test_gem_ext_configure_builder I, [2024-05-06T15:47:09.538143 #726151] INFO -- : [ 77/885] 767534=test_frozen I, [2024-05-06T15:47:09.540446 #726151] INFO -- : [ 78/885] 767534=test_verbose I, [2024-05-06T15:47:09.572309 #726151] INFO -- : [ 79/885] 767520=test_rdoc_single_class I, [2024-05-06T15:47:09.575852 #726151] INFO -- : [ 80/885] 767530=test_num2int I, [2024-05-06T15:47:09.576460 #726151] INFO -- : [ 81/885] 767534=test_nil I, [2024-05-06T15:47:09.578447 #726151] INFO -- : [ 82/885] 767515=test_exception I, [2024-05-06T15:47:09.593856 #726151] INFO -- : [ 83/885] 767515=test_zsh_completion I, [2024-05-06T15:47:09.598331 #726151] INFO -- : [ 84/885] 767515=test_iter_break I, [2024-05-06T15:47:09.599488 #726151] INFO -- : [ 85/885] 767529=test_bug-5832 I, [2024-05-06T15:47:09.601000 #726151] INFO -- : [ 86/885] 767515=test_files_ext I, [2024-05-06T15:47:09.602345 #726151] INFO -- : [ 87/885] 767529=test_gem_silent_ui I, [2024-05-06T15:47:09.607472 #726151] INFO -- : [ 88/885] 767534=test_emitter I, [2024-05-06T15:47:09.610401 #726151] INFO -- : [ 89/885] 767530=test_kdf I, [2024-05-06T15:47:09.616379 #726151] INFO -- : [ 90/885] 767534=test_gem_doctor I, [2024-05-06T15:47:09.617093 #726151] INFO -- : [ 91/885] 767516=dispatcher_test I, [2024-05-06T15:47:09.632344 #726151] INFO -- : [ 92/885] 767527=test_eval_history I, [2024-05-06T15:47:09.640240 #726151] INFO -- : [ 93/885] 767521=test_kernel I, [2024-05-06T15:47:09.652376 #726151] INFO -- : [ 94/885] 767525=test_rdoc_markup_paragraph I, [2024-05-06T15:47:09.656132 #726151] INFO -- : [ 95/885] 767518=test_psych I, [2024-05-06T15:47:09.666928 #726151] INFO -- : [ 96/885] 767515=test_enc_raise I, [2024-05-06T15:47:09.674389 #726151] INFO -- : [ 97/885] 767515=!Nothing_to_test I, [2024-05-06T15:47:09.675361 #726151] INFO -- : [ 98/885] 767515=test_object_create_start I, [2024-05-06T15:47:09.678384 #726151] INFO -- : [ 99/885] 767515=test_command I, [2024-05-06T15:47:09.704389 #726151] INFO -- : [100/885] 767518=test_at_exit I, [2024-05-06T15:47:09.709175 #726151] INFO -- : [101/885] 767530=test_date I, [2024-05-06T15:47:09.720326 #726151] INFO -- : [102/885] 767530=test_gem_rdoc I, [2024-05-06T15:47:09.726812 #726151] INFO -- : [103/885] 767518=test_gem_ext_cargo_builder_unit I, [2024-05-06T15:47:09.742747 #726151] INFO -- : [104/885] 767520=test_enumerator I, [2024-05-06T15:47:09.760920 #726151] INFO -- : [105/885] 767518=test_inadvertent_creation I, [2024-05-06T15:47:09.760998 #726151] INFO -- : [106/885] 767516=test_flags I, [2024-05-06T15:47:09.790705 #726151] INFO -- : [107/885] 767529=test_shift_jis I, [2024-05-06T15:47:09.790938 #726151] INFO -- : [108/885] 767527=test_gem_commands_which_command I, [2024-05-06T15:47:09.799568 #726151] INFO -- : [109/885] 767529=test_http I, [2024-05-06T15:47:09.808899 #726151] INFO -- : [110/885] 767525=test_gem_commands_specification_command I, [2024-05-06T15:47:09.826128 #726151] INFO -- : [111/885] 767529=test_gem_resolver_composed_set I, [2024-05-06T15:47:09.838771 #726151] INFO -- : [112/885] 767529=test_safe_load I, [2024-05-06T15:47:09.880345 #726151] INFO -- : [113/885] 767534=test_gem_resolver I, [2024-05-06T15:47:09.888541 #726151] INFO -- : [114/885] 767529=test_gem_commands_dependency_command I, [2024-05-06T15:47:09.896032 #726151] INFO -- : [115/885] 767518=test_name_error I, [2024-05-06T15:47:09.952836 #726151] INFO -- : [116/885] 767525=test_rdoc_markup_attribute_manager I, [2024-05-06T15:47:09.967499 #726151] INFO -- : [117/885] 767530=test_httpresponse I, [2024-05-06T15:47:09.982789 #726151] INFO -- : [118/885] 767529=test_open-uri I, [2024-05-06T15:47:09.997871 #726151] INFO -- : [119/885] 767531=test_rdoc_parser_ruby I, [2024-05-06T15:47:09.999598 #726151] INFO -- : [120/885] 767527=test_stream I, [2024-05-06T15:47:10.007317 #726151] INFO -- : [121/885] 767525=test_nil2vtempty I, [2024-05-06T15:47:10.008180 #726151] INFO -- : [122/885] 767525=test_rdoc_context I, [2024-05-06T15:47:10.024753 #726151] INFO -- : [123/885] 767518=test_rdoc_text I, [2024-05-06T15:47:10.041542 #726151] INFO -- : [124/885] 767527=test_iso_8859 I, [2024-05-06T15:47:10.068687 #726151] INFO -- : [125/885] 767530=test_tcp I, [2024-05-06T15:47:10.081525 #726151] INFO -- : [126/885] 767522=index_write_test I, [2024-05-06T15:47:10.087184 #726151] INFO -- : [127/885] 767515=test_date_new I, [2024-05-06T15:47:10.088305 #726151] INFO -- : [128/885] 767527=test_data I, [2024-05-06T15:47:10.095871 #726151] INFO -- : [129/885] 767518=test_rdoc_markup_to_joined_paragraph I, [2024-05-06T15:47:10.097917 #726151] INFO -- : [130/885] 767515=test_date_time I, [2024-05-06T15:47:10.100266 #726151] INFO -- : [131/885] 767518=test_require I, [2024-05-06T15:47:10.103436 #726151] INFO -- : [132/885] 767518=test_gem_safe_yaml I, [2024-05-06T15:47:10.103684 #726151] INFO -- : [133/885] 767527=test_syntax I, [2024-05-06T15:47:10.108294 #726151] INFO -- : [134/885] 767515=test_c_union_entity I, [2024-05-06T15:47:10.116868 #726151] INFO -- : [135/885] 767518=test_rdoc_normal_module I, [2024-05-06T15:47:10.155427 #726151] INFO -- : [136/885] 767515=test_rdoc_markdown_test I, [2024-05-06T15:47:10.198728 #726151] INFO -- : [137/885] 767534=test_logperiod I, [2024-05-06T15:47:10.201724 #726151] INFO -- : [138/885] 767522=test_securerandom I, [2024-05-06T15:47:10.205873 #726151] INFO -- : [139/885] 767534=test_switch_hitter I, [2024-05-06T15:47:10.210693 #726151] INFO -- : [140/885] 767518=test_io_console I, [2024-05-06T15:47:10.224632 #726151] INFO -- : [141/885] 767534=test_flush I, [2024-05-06T15:47:10.231455 #726151] INFO -- : [142/885] 767534=test_singleton I, [2024-05-06T15:47:10.236001 #726151] INFO -- : [143/885] 767534=test_hash_create I, [2024-05-06T15:47:10.238906 #726151] INFO -- : [144/885] 767534=test_stringchar I, [2024-05-06T15:47:10.255647 #726151] INFO -- : [145/885] 767522=test_uncorrectable_name_check I, [2024-05-06T15:47:10.268658 #726151] INFO -- : [146/885] 767522=newline_test I, [2024-05-06T15:47:10.269939 #726151] INFO -- : [147/885] 767521=test_thread_fd_close I, [2024-05-06T15:47:10.276722 #726151] INFO -- : [148/885] 767521=test_passing_block I, [2024-05-06T15:47:10.282891 #726151] INFO -- : [149/885] 767521=test_pack I, [2024-05-06T15:47:10.289699 #726151] INFO -- : [150/885] 767530=test_process I, [2024-05-06T15:47:10.304667 #726151] INFO -- : [151/885] 767519=test_last_thread I, [2024-05-06T15:47:10.314051 #726151] INFO -- : [152/885] 767534=test_gem_security_policy I, [2024-05-06T15:47:10.348066 #726151] INFO -- : [153/885] 767522=test_gem_source_local I, [2024-05-06T15:47:10.398833 #726151] INFO -- : [154/885] 767524=test_logdevice I, [2024-05-06T15:47:10.427579 #726151] INFO -- : [155/885] 767531=test_gem_ext_rake_builder I, [2024-05-06T15:47:10.446397 #726151] INFO -- : [156/885] 767528=test_arity I, [2024-05-06T15:47:10.449170 #726151] INFO -- : [157/885] 767528=test_gc I, [2024-05-06T15:47:10.529570 #726151] INFO -- : [158/885] 767521=test_x509cert I, [2024-05-06T15:47:10.623086 #726151] INFO -- : [159/885] 767529=test_err_in_callback I, [2024-05-06T15:47:10.625057 #726151] INFO -- : [160/885] 767529=test_gem_resolver_lock_specification I, [2024-05-06T15:47:10.661133 #726151] INFO -- : [161/885] 767534=test_reline I, [2024-05-06T15:47:10.668264 #726151] INFO -- : [162/885] 767529=test_parser_events I, [2024-05-06T15:47:10.730074 #726151] INFO -- : [163/885] 767516=test_pkey I, [2024-05-06T15:47:10.733350 #726151] INFO -- : [164/885] 767522=test_case I, [2024-05-06T15:47:10.740206 #726151] INFO -- : [165/885] 767522=test_gem_request_connection_pools I, [2024-05-06T15:47:10.768396 #726151] INFO -- : [166/885] 767529=test_grapheme_breaks I, [2024-05-06T15:47:10.804448 #726151] INFO -- : [167/885] 767529=test_gem_version_option I, [2024-05-06T15:47:10.812394 #726151] INFO -- : [168/885] 767521=test_cclass I, [2024-05-06T15:47:10.818493 #726151] INFO -- : [169/885] 767516=test_ractor I, [2024-05-06T15:47:10.852290 #726151] INFO -- : [170/885] 767529=test_m17n_comb I, [2024-05-06T15:47:10.879682 #726151] INFO -- : [171/885] 767516=test_memory_view I, [2024-05-06T15:47:10.913915 #726151] INFO -- : [172/885] 767534=test_rdoc_markup_to_markdown I, [2024-05-06T15:47:10.963812 #726151] INFO -- : [173/885] 767521=test_json_tree I, [2024-05-06T15:47:10.969550 #726151] INFO -- : [174/885] 767516=test_rdoc_generator_pot_po I, [2024-05-06T15:47:10.978647 #726151] INFO -- : [175/885] 767521=test_ansi_with_terminfo I, [2024-05-06T15:47:10.984561 #726151] INFO -- : [176/885] 767521=test_require_lib I, [2024-05-06T15:47:10.987608 #726151] INFO -- : [177/885] 767534=parse_test I, [2024-05-06T15:47:11.024518 #726151] INFO -- : [178/885] 767525=test_gem_install_update_options I, [2024-05-06T15:47:11.029053 #726151] INFO -- : [179/885] 767515=test_severity I, [2024-05-06T15:47:11.035987 #726151] INFO -- : [180/885] 767515=test_ractor I, [2024-05-06T15:47:11.059354 #726151] INFO -- : [181/885] 767515=test_gem_stream_ui I, [2024-05-06T15:47:11.102757 #726151] INFO -- : [182/885] 767516=test_rdoc_generator_ri I, [2024-05-06T15:47:11.115881 #726151] INFO -- : [183/885] 767516=test_extlibs I, [2024-05-06T15:47:11.145727 #726151] INFO -- : [184/885] 767515=test_str2big I, [2024-05-06T15:47:11.156097 #726151] INFO -- : [185/885] 767515=test_c_struct_builder I, [2024-05-06T15:47:11.169466 #726151] INFO -- : [186/885] 767525=test_dot_dot I, [2024-05-06T15:47:11.170677 #726151] INFO -- : [187/885] 767525=test_literal I, [2024-05-06T15:47:11.210357 #726151] INFO -- : [188/885] 767524=test_socket I, [2024-05-06T15:47:11.231558 #726151] INFO -- : [189/885] 767515=test_thread I, [2024-05-06T15:47:11.365515 #726151] INFO -- : [190/885] 767519=test_objectspace I, [2024-05-06T15:47:11.429455 #726151] INFO -- : [191/885] 767531=test_rdoc_markup_to_table_of_contents I, [2024-05-06T15:47:11.447895 #726151] INFO -- : [192/885] 767515=test_gem_dependency_installer I, [2024-05-06T15:47:11.454792 #726151] INFO -- : [193/885] 767531=test_scalar I, [2024-05-06T15:47:11.461109 #726151] INFO -- : [194/885] 767531=test_gem_commands_info_command I, [2024-05-06T15:47:11.517717 #726151] INFO -- : [195/885] 767531=test_rdoc_cross_reference I, [2024-05-06T15:47:11.597772 #726151] INFO -- : [196/885] 767533=test_store I, [2024-05-06T15:47:11.708877 #726151] INFO -- : [197/885] 767526=test_case_options I, [2024-05-06T15:47:11.714684 #726151] INFO -- : [198/885] 767526=test_exception I, [2024-05-06T15:47:11.779724 #726151] INFO -- : [199/885] 767522=test_rand I, [2024-05-06T15:47:11.838895 #726151] INFO -- : [200/885] 767533=test_gem_name_tuple I, [2024-05-06T15:47:11.964078 #726151] INFO -- : [201/885] 767531=test_gem_package_tar_reader_entry I, [2024-05-06T15:47:12.001377 #726151] INFO -- : [202/885] 767525=test_bug_reporter I, [2024-05-06T15:47:12.068594 #726151] INFO -- : [203/885] 767533=test_gem_commands_mirror I, [2024-05-06T15:47:12.073583 #726151] INFO -- : [204/885] 767533=test_gem_ext_cargo_builder_link_flag_converter I, [2024-05-06T15:47:12.120970 #726151] INFO -- : [205/885] 767531=test_sprintf_comb I, [2024-05-06T15:47:12.127927 #726151] INFO -- : [206/885] 767533=test_gem_request I, [2024-05-06T15:47:12.135431 #726151] INFO -- : [207/885] 767522=test_method_cache I, [2024-05-06T15:47:12.141921 #726151] INFO -- : [208/885] 767522=test_scan_args I, [2024-05-06T15:47:12.145243 #726151] INFO -- : [209/885] 767517=test_win32ole I, [2024-05-06T15:47:12.146955 #726151] INFO -- : [210/885] 767522=test_generic I, [2024-05-06T15:47:12.149011 #726151] INFO -- : [211/885] 767517=test_settracefunc I, [2024-05-06T15:47:12.200811 #726151] INFO -- : [212/885] 767522=test_gem_text I, [2024-05-06T15:47:12.248593 #726151] INFO -- : [213/885] 767522=test_enumerator_kw I, [2024-05-06T15:47:12.252826 #726151] INFO -- : [214/885] 767522=test_gem_commands_contents_command I, [2024-05-06T15:47:12.270580 #726151] INFO -- : [215/885] 767531=test_gem_ext_cmake_builder I, [2024-05-06T15:47:12.277333 #726151] INFO -- : [216/885] 767519=test_require I, [2024-05-06T15:47:12.285066 #726151] INFO -- : [217/885] 767531=test_cgi_util I, [2024-05-06T15:47:12.319553 #726151] INFO -- : [218/885] 767533=test_marshalable I, [2024-05-06T15:47:12.330331 #726151] INFO -- : [219/885] 767533=test_digest I, [2024-05-06T15:47:12.364225 #726151] INFO -- : [220/885] 767532=test_ractor I, [2024-05-06T15:47:12.373227 #726151] INFO -- : [221/885] 767522=test_find I, [2024-05-06T15:47:12.394441 #726151] INFO -- : [222/885] 767522=test_fiddle I, [2024-05-06T15:47:12.426233 #726151] INFO -- : [223/885] 767525=test_wss I, [2024-05-06T15:47:12.431379 #726151] INFO -- : [224/885] 767525=test_modify_expand I, [2024-05-06T15:47:12.433931 #726151] INFO -- : [225/885] 767525=test_rdoc_any_method I, [2024-05-06T15:47:12.438451 #726151] INFO -- : [226/885] 767522=test_gem_available_set I, [2024-05-06T15:47:12.506351 #726151] INFO -- : [227/885] 767532=test_rdoc_markdown I, [2024-05-06T15:47:12.510419 #726151] INFO -- : [228/885] 767531=test_file I, [2024-05-06T15:47:12.525754 #726151] INFO -- : [229/885] 767531=test_gem_package_tar_reader I, [2024-05-06T15:47:12.539538 #726151] INFO -- : [230/885] 767522=regexp_test I, [2024-05-06T15:47:12.552100 #726151] INFO -- : [231/885] 767522=test_coverage I, [2024-05-06T15:47:12.569532 #726151] INFO -- : [232/885] 767531=test_rdoc_encoding I, [2024-05-06T15:47:12.605232 #726151] INFO -- : [233/885] 767531=test_pathname I, [2024-05-06T15:47:12.722063 #726151] INFO -- : [234/885] 767532=test_init I, [2024-05-06T15:47:12.764514 #726151] INFO -- : [235/885] 767524=test_complexrational I, [2024-05-06T15:47:12.768429 #726151] INFO -- : [236/885] 767524=test_recorder I, [2024-05-06T15:47:12.782802 #726151] INFO -- : [237/885] 767524=test_gem_commands_owner_command I, [2024-05-06T15:47:12.801903 #726151] INFO -- : [238/885] 767531=test_gem_source_vendor I, [2024-05-06T15:47:12.809430 #726151] INFO -- : [239/885] 767531=test_rdoc_constant I, [2024-05-06T15:47:12.810624 #726151] INFO -- : [240/885] 767525=test_deprecate I, [2024-05-06T15:47:12.838412 #726151] INFO -- : [241/885] 767525=test_bash_completion I, [2024-05-06T15:47:12.863948 #726151] INFO -- : [242/885] 767525=test_formatter I, [2024-05-06T15:47:12.870207 #726151] INFO -- : [243/885] 767525=test_forwardable I, [2024-05-06T15:47:12.888649 #726151] INFO -- : [244/885] 767525=test_yaml I, [2024-05-06T15:47:12.902326 #726151] INFO -- : [245/885] 767531=test_handle I, [2024-05-06T15:47:12.949532 #726151] INFO -- : [246/885] 767518=test_wait I, [2024-05-06T15:47:12.981669 #726151] INFO -- : [247/885] 767525=test_big2str I, [2024-05-06T15:47:12.987043 #726151] INFO -- : [248/885] 767525=test_ractor I, [2024-05-06T15:47:13.012109 #726151] INFO -- : [249/885] 767525=test_euc_tw I, [2024-05-06T15:47:13.014402 #726151] INFO -- : [250/885] 767525=test_bmethod I, [2024-05-06T15:47:13.020361 #726151] INFO -- : [251/885] 767525=test_ansi_without_terminfo I, [2024-05-06T15:47:13.055218 #726151] INFO -- : [252/885] 767518=test_gem_commands_sources_command I, [2024-05-06T15:47:13.077721 #726151] INFO -- : [253/885] 767525=test_thread_queue I, [2024-05-06T15:47:13.104010 #726151] INFO -- : [254/885] 767516=test_nowrite I, [2024-05-06T15:47:13.107084 #726151] INFO -- : [255/885] 767532=test_rdoc_markup_formatter I, [2024-05-06T15:47:13.115807 #726151] INFO -- : [256/885] 767532=test_comparable I, [2024-05-06T15:47:13.118937 #726151] INFO -- : [257/885] 767516=test_rdoc_parser_c I, [2024-05-06T15:47:13.126889 #726151] INFO -- : [258/885] 767532=test_io_timeout I, [2024-05-06T15:47:13.131471 #726151] INFO -- : [259/885] 767532=json_fixtures_test I, [2024-05-06T15:47:13.142348 #726151] INFO -- : [260/885] 767532=test_shapes I, [2024-05-06T15:47:13.148677 #726151] INFO -- : [261/885] 767532=test_cstr I, [2024-05-06T15:47:13.164108 #726151] INFO -- : [262/885] 767526=test_pstore I, [2024-05-06T15:47:13.167284 #726151] INFO -- : [263/885] 767533=test_profile_frames I, [2024-05-06T15:47:13.187679 #726151] INFO -- : [264/885] 767517=test_class2name I, [2024-05-06T15:47:13.191755 #726151] INFO -- : [265/885] 767517=test_gbk I, [2024-05-06T15:47:13.195242 #726151] INFO -- : [266/885] 767517=test_enc_str_buf_cat I, [2024-05-06T15:47:13.198896 #726151] INFO -- : [267/885] 767517=test_too_many_dummy_encodings I, [2024-05-06T15:47:13.201764 #726151] INFO -- : [268/885] 767531=test_gem_commands_list_command I, [2024-05-06T15:47:13.209688 #726151] INFO -- : [269/885] 767531=test_stack I, [2024-05-06T15:47:13.244002 #726151] INFO -- : [270/885] 767526=test_rdoc_include I, [2024-05-06T15:47:13.258953 #726151] INFO -- : [271/885] 767517=test_reqarg I, [2024-05-06T15:47:13.275884 #726151] INFO -- : [272/885] 767518=test_fileutils I, [2024-05-06T15:47:13.283965 #726151] INFO -- : [273/885] 767529=test_string_processing I, [2024-05-06T15:47:13.288292 #726151] INFO -- : [274/885] 767529=test_ldap I, [2024-05-06T15:47:13.292607 #726151] INFO -- : [275/885] 767529=test_resource I, [2024-05-06T15:47:13.299375 #726151] INFO -- : [276/885] 767529=test_gem_commands_signin_command I, [2024-05-06T15:47:13.339513 #726151] INFO -- : [277/885] 767533=test_emitter I, [2024-05-06T15:47:13.343368 #726151] INFO -- : [278/885] 767533=test_gem_version I, [2024-05-06T15:47:13.349238 #726151] INFO -- : [279/885] 767516=test_cesu8 I, [2024-05-06T15:47:13.352104 #726151] INFO -- : [280/885] 767516=test_econv I, [2024-05-06T15:47:13.376140 #726151] INFO -- : [281/885] 767529=test_rdoc_options I, [2024-05-06T15:47:13.406765 #726151] INFO -- : [282/885] 767532=test_rdoc_markup_verbatim I, [2024-05-06T15:47:13.409738 #726151] INFO -- : [283/885] 767532=test_inlinecache I, [2024-05-06T15:47:13.413297 #726151] INFO -- : [284/885] 767524=test_path_to_class I, [2024-05-06T15:47:13.416000 #726151] INFO -- : [285/885] 767524=test_gem_dependency I, [2024-05-06T15:47:13.423995 #726151] INFO -- : [286/885] 767533=test_gem_resolver_specification I, [2024-05-06T15:47:13.443043 #726151] INFO -- : [287/885] 767522=test_frozen_error I, [2024-05-06T15:47:13.454833 #726151] INFO -- : [288/885] 767522=test_gem_stub_specification I, [2024-05-06T15:47:13.463884 #726151] INFO -- : [289/885] 767533=test_method_cache I, [2024-05-06T15:47:13.464936 #726151] INFO -- : [290/885] 767533=test_gem_ext_ext_conf_builder I, [2024-05-06T15:47:13.466790 #726151] INFO -- : [291/885] 767532=test_complex I, [2024-05-06T15:47:13.491729 #726151] INFO -- : [292/885] 767526=test_gem_commands_search_command I, [2024-05-06T15:47:13.528051 #726151] INFO -- : [293/885] 767524=test_scanner_events I, [2024-05-06T15:47:13.577025 #726151] INFO -- : [294/885] 767524=test_gem_resolver_installed_specification I, [2024-05-06T15:47:13.591566 #726151] INFO -- : [295/885] 767522=test_parse I, [2024-05-06T15:47:13.598175 #726151] INFO -- : [296/885] 767524=test_mdns I, [2024-05-06T15:47:13.612445 #726151] INFO -- : [297/885] 767532=test_gem_remote_fetcher I, [2024-05-06T15:47:13.617042 #726151] INFO -- : [298/885] 767524=test_yamlstore I, [2024-05-06T15:47:13.628160 #726151] INFO -- : [299/885] 767517=test_gem_installer I, [2024-05-06T15:47:13.630556 #726151] INFO -- : [300/885] 767524=test_date_strftime I, [2024-05-06T15:47:13.683877 #726151] INFO -- : [301/885] 767519=test_rdoc_parser_rd I, [2024-05-06T15:47:13.694909 #726151] INFO -- : [302/885] 767529=test_irb I, [2024-05-06T15:47:13.713816 #726151] INFO -- : [303/885] 767518=test_load I, [2024-05-06T15:47:13.714008 #726151] INFO -- : [304/885] 767518=json_string_matching_test I, [2024-05-06T15:47:13.731906 #726151] INFO -- : [305/885] 767518=test_const I, [2024-05-06T15:47:13.736088 #726151] INFO -- : [306/885] 767518=test_class I, [2024-05-06T15:47:13.769593 #726151] INFO -- : [307/885] 767526=test_rdoc_normal_class I, [2024-05-06T15:47:13.842815 #726151] INFO -- : [308/885] 767526=test_asn1 I, [2024-05-06T15:47:13.923848 #726151] INFO -- : [309/885] 767519=test_random I, [2024-05-06T15:47:13.940336 #726151] INFO -- : [310/885] 767519=test_tempfile I, [2024-05-06T15:47:13.949364 #726151] INFO -- : [311/885] 767526=parse_comments_test I, [2024-05-06T15:47:13.986740 #726151] INFO -- : [312/885] 767515=test_noarg I, [2024-05-06T15:47:14.020136 #726151] INFO -- : [313/885] 767524=test_queue I, [2024-05-06T15:47:14.026394 #726151] INFO -- : [314/885] 767524=test_function I, [2024-05-06T15:47:14.031953 #726151] INFO -- : [315/885] 767526=test_internal_ivar I, [2024-05-06T15:47:14.035278 #726151] INFO -- : [316/885] 767526=test_gem_resolver_index_specification I, [2024-05-06T15:47:14.055910 #726151] INFO -- : [317/885] 767529=test_duplicate I, [2024-05-06T15:47:14.060981 #726151] INFO -- : [318/885] 767529=test_basicsocket I, [2024-05-06T15:47:14.072508 #726151] INFO -- : [319/885] 767529=test_utf32 I, [2024-05-06T15:47:14.075094 #726151] INFO -- : [320/885] 767529=test_prettyprint I, [2024-05-06T15:47:14.090249 #726151] INFO -- : [321/885] 767529=test_tracepoint I, [2024-05-06T15:47:14.147526 #726151] INFO -- : [322/885] 767526=test_rdoc_markup I, [2024-05-06T15:47:14.158820 #726151] INFO -- : [323/885] 767526=test_gem_commands_help_command I, [2024-05-06T15:47:14.173610 #726151] INFO -- : [324/885] 767522=test_type_completor I, [2024-05-06T15:47:14.177416 #726151] INFO -- : [325/885] 767522=test_console_attr I, [2024-05-06T15:47:14.179476 #726151] INFO -- : [326/885] 767522=test_summary I, [2024-05-06T15:47:14.187945 #726151] INFO -- : [327/885] 767515=test_ellipsize I, [2024-05-06T15:47:14.200968 #726151] INFO -- : [328/885] 767515=test_date_attr I, [2024-05-06T15:47:14.202717 #726151] INFO -- : [329/885] 767515=test_gem_commands_exec_command I, [2024-05-06T15:47:14.211648 #726151] INFO -- : [330/885] 767531=test_io_wait I, [2024-05-06T15:47:14.232687 #726151] INFO -- : [331/885] 767519=warnings_test I, [2024-05-06T15:47:14.232751 #726151] INFO -- : [332/885] 767534=test_kwargs I, [2024-05-06T15:47:14.242468 #726151] INFO -- : [333/885] 767534=test_emoji I, [2024-05-06T15:47:14.245164 #726151] INFO -- : [334/885] 767524=test_win32ole_type_event I, [2024-05-06T15:47:14.249502 #726151] INFO -- : [335/885] 767524=test_sorted_set I, [2024-05-06T15:47:14.262311 #726151] INFO -- : [336/885] 767526=test_hash I, [2024-05-06T15:47:14.280424 #726151] INFO -- : [337/885] 767534=test_ubf_async_safe I, [2024-05-06T15:47:14.283894 #726151] INFO -- : [338/885] 767534=test_io I, [2024-05-06T15:47:14.301850 #726151] INFO -- : [339/885] 767522=test_cp949 I, [2024-05-06T15:47:14.303928 #726151] INFO -- : [340/885] 767529=test_condition I, [2024-05-06T15:47:14.304708 #726151] INFO -- : [341/885] 767519=test_gem_source_specific_file I, [2024-05-06T15:47:14.306035 #726151] INFO -- : [342/885] 767522=test_foreach I, [2024-05-06T15:47:14.306697 #726151] INFO -- : [343/885] 767529=test_gem_commands_uninstall_command I, [2024-05-06T15:47:14.310572 #726151] INFO -- : [344/885] 767522=test_gem_unsatisfiable_dependency_error I, [2024-05-06T15:47:14.325008 #726151] INFO -- : [345/885] 767522=test_win32ole_record I, [2024-05-06T15:47:14.332052 #726151] INFO -- : [346/885] 767522=test_method I, [2024-05-06T15:47:14.342686 #726151] INFO -- : [347/885] 767516=test_gem_commands_query_command I, [2024-05-06T15:47:14.374815 #726151] INFO -- : [348/885] 767519=test_rdoc_rubygems_hook I, [2024-05-06T15:47:14.441178 #726151] INFO -- : [349/885] 767524=test_pattern_key_name_check I, [2024-05-06T15:47:14.446103 #726151] INFO -- : [350/885] 767524=test_to_ruby I, [2024-05-06T15:47:14.448064 #726151] INFO -- : [351/885] 767519=test_gem_impossible_dependencies_error I, [2024-05-06T15:47:14.454397 #726151] INFO -- : [352/885] 767519=test_pack I, [2024-05-06T15:47:14.456169 #726151] INFO -- : [353/885] 767524=test_array_create I, [2024-05-06T15:47:14.459054 #726151] INFO -- : [354/885] 767524=test_ftp I, [2024-05-06T15:47:14.477085 #726151] INFO -- : [355/885] 767524=test_euc_kr I, [2024-05-06T15:47:14.481084 #726151] INFO -- : [356/885] 767524=test_rdoc_context_section I, [2024-05-06T15:47:14.550684 #726151] INFO -- : [357/885] 767531=test_objspace I, [2024-05-06T15:47:14.558946 #726151] INFO -- : [358/885] 767534=ripper_test I, [2024-05-06T15:47:14.584986 #726151] INFO -- : [359/885] 767521=test_line_editor I, [2024-05-06T15:47:14.601564 #726151] INFO -- : [360/885] 767521=test_undef I, [2024-05-06T15:47:14.616069 #726151] INFO -- : [361/885] 767521=test_string_memory I, [2024-05-06T15:47:14.623601 #726151] INFO -- : [362/885] 767524=test_gem_requirement I, [2024-05-06T15:47:14.654647 #726151] INFO -- : [363/885] 767521=test_sprintf I, [2024-05-06T15:47:14.677164 #726151] INFO -- : [364/885] 767533=comments_test I, [2024-05-06T15:47:14.692347 #726151] INFO -- : [365/885] 767519=test_gem_security_trust_dir I, [2024-05-06T15:47:14.735356 #726151] INFO -- : [366/885] 767519=test_show_source I, [2024-05-06T15:47:14.746767 #726151] INFO -- : [367/885] 767524=test_set I, [2024-05-06T15:47:14.751224 #726151] INFO -- : [368/885] 767533=test_gem_commands_stale_command I, [2024-05-06T15:47:14.751299 #726151] INFO -- : [369/885] 767524=test_c_struct_entry I, [2024-05-06T15:47:14.758395 #726151] INFO -- : [370/885] 767533=test_lock_native_thread I, [2024-05-06T15:47:14.896142 #726151] INFO -- : [371/885] 767519=test_remote_fetch_error I, [2024-05-06T15:47:14.906894 #726151] INFO -- : [372/885] 767519=test_have_library I, [2024-05-06T15:47:14.924882 #726151] INFO -- : [373/885] 767521=test_raise_exception I, [2024-05-06T15:47:14.950779 #726151] INFO -- : [374/885] 767524=test_gem_request_set_lockfile I, [2024-05-06T15:47:15.051429 #726151] INFO -- : [375/885] 767533=test_win32ole_typelib I, [2024-05-06T15:47:15.053342 #726151] INFO -- : [376/885] 767529=test_protect I, [2024-05-06T15:47:15.055665 #726151] INFO -- : [377/885] 767533=test_hash I, [2024-05-06T15:47:15.058042 #726151] INFO -- : [378/885] 767516=test_gem_resolver_dependency_request I, [2024-05-06T15:47:15.059572 #726151] INFO -- : [379/885] 767529=test_tree_builder I, [2024-05-06T15:47:15.066218 #726151] INFO -- : [380/885] 767529=test_external_new I, [2024-05-06T15:47:15.069848 #726151] INFO -- : [381/885] 767529=test_postponed_job I, [2024-05-06T15:47:15.073746 #726151] INFO -- : [382/885] 767533=test_alias_and_anchor I, [2024-05-06T15:47:15.085013 #726151] INFO -- : [383/885] 767533=test_ws I, [2024-05-06T15:47:15.089201 #726151] INFO -- : [384/885] 767533=test_m17n I, [2024-05-06T15:47:15.102296 #726151] INFO -- : [385/885] 767534=test_gem_commands_environment_command I, [2024-05-06T15:47:15.113558 #726151] INFO -- : [386/885] 767516=test_workspace I, [2024-05-06T15:47:15.149997 #726151] INFO -- : [387/885] 767534=test_weakmap I, [2024-05-06T15:47:15.204247 #726151] INFO -- : [388/885] 767533=test_yjit I, [2024-05-06T15:47:15.204727 #726151] INFO -- : [389/885] 767533=test_framework I, [2024-05-06T15:47:15.242484 #726151] INFO -- : [390/885] 767533=test_ns_spki I, [2024-05-06T15:47:15.260776 #726151] INFO -- : [391/885] 767533=test_kill_ring I, [2024-05-06T15:47:15.317071 #726151] INFO -- : [392/885] 767515=test_argf I, [2024-05-06T15:47:15.320420 #726151] INFO -- : [393/885] 767524=test_gem_resolver_conflict I, [2024-05-06T15:47:15.340547 #726151] INFO -- : [394/885] 767523=test_rdoc_task I, [2024-05-06T15:47:15.344146 #726151] INFO -- : [395/885] 767524=test_io_buffer I, [2024-05-06T15:47:15.349921 #726151] INFO -- : [396/885] 767533=ruby_parser_test I, [2024-05-06T15:47:15.355940 #726151] INFO -- : [397/885] 767533=test_backtrace I, [2024-05-06T15:47:15.365778 #726151] INFO -- : [398/885] 767523=test_pack I, [2024-05-06T15:47:15.377978 #726151] INFO -- : [399/885] 767523=test_rdoc_markup_indented_paragraph I, [2024-05-06T15:47:15.409345 #726151] INFO -- : [400/885] 767516=test_rdoc_require I, [2024-05-06T15:47:15.426984 #726151] INFO -- : [401/885] 767516=locals_test I, [2024-05-06T15:47:15.442017 #726151] INFO -- : [402/885] 767529=test_readpartial I, [2024-05-06T15:47:15.449857 #726151] INFO -- : [403/885] 767524=test_clone I, [2024-05-06T15:47:15.463979 #726151] INFO -- : [404/885] 767523=test_gem_commands_install_command I, [2024-05-06T15:47:15.574163 #726151] INFO -- : [405/885] 767521=test_array I, [2024-05-06T15:47:15.581659 #726151] INFO -- : [406/885] 767521=test_optparse I, [2024-05-06T15:47:15.581831 #726151] INFO -- : [407/885] 767521=test_fstring I, [2024-05-06T15:47:15.629767 #726151] INFO -- : [408/885] 767524=test_rdoc_markup_to_html_crossref I, [2024-05-06T15:47:15.741345 #726151] INFO -- : [409/885] 767521=test_typeddata I, [2024-05-06T15:47:15.791933 #726151] INFO -- : [410/885] 767518=test_gem_resolver_best_set I, [2024-05-06T15:47:15.831456 #726151] INFO -- : [411/885] 767516=encoding_test I, [2024-05-06T15:47:15.846736 #726151] INFO -- : [412/885] 767529=test_rat I, [2024-05-06T15:47:15.854429 #726151] INFO -- : [413/885] 767518=test_webauthn_poller I, [2024-05-06T15:47:15.869772 #726151] INFO -- : [414/885] 767529=test_rdoc_markup_raw I, [2024-05-06T15:47:15.875440 #726151] INFO -- : [415/885] 767529=test_stringscanner I, [2024-05-06T15:47:15.921447 #726151] INFO -- : [416/885] 767529=test_files_sample I, [2024-05-06T15:47:15.937312 #726151] INFO -- : [417/885] 767516=test_rdoc_alias I, [2024-05-06T15:47:15.960309 #726151] INFO -- : [418/885] 767516=test_yield I, [2024-05-06T15:47:15.980385 #726151] INFO -- : [419/885] 767521=test_convertible I, [2024-05-06T15:47:16.012948 #726151] INFO -- : [420/885] 767518=parser_test I, [2024-05-06T15:47:16.032278 #726151] INFO -- : [421/885] 767529=test_system I, [2024-05-06T15:47:16.053819 #726151] INFO -- : [422/885] 767524=test_pkcs12 I, [2024-05-06T15:47:16.125052 #726151] INFO -- : [423/885] 767518=test_gem_package_tar_header I, [2024-05-06T15:47:16.151132 #726151] INFO -- : [424/885] 767532=test_iseq_load I, [2024-05-06T15:47:16.198369 #726151] INFO -- : [425/885] 767518=test_gem_util I, [2024-05-06T15:47:16.212174 #726151] INFO -- : [426/885] 767519=test_bigzero I, [2024-05-06T15:47:16.214569 #726151] INFO -- : [427/885] 767519=test_pkey_dh I, [2024-05-06T15:47:16.295780 #726151] INFO -- : [428/885] 767519=test_protocol I, [2024-05-06T15:47:16.360956 #726151] INFO -- : [429/885] 767518=test_getopts I, [2024-05-06T15:47:16.368621 #726151] INFO -- : [430/885] 767518=test_gem_resolver_activation_request I, [2024-05-06T15:47:16.384192 #726151] INFO -- : [431/885] 767518=test_gem_config_file I, [2024-05-06T15:47:16.437958 #726151] INFO -- : [432/885] 767524=test_ripper I, [2024-05-06T15:47:16.441585 #726151] INFO -- : [433/885] 767520=test_etc I, [2024-05-06T15:47:16.506186 #726151] INFO -- : [434/885] 767518=test_yjit_exit_locations I, [2024-05-06T15:47:16.510379 #726151] INFO -- : [435/885] 767518=test_yaml_tree I, [2024-05-06T15:47:16.523974 #726151] INFO -- : [436/885] 767518=test_sleep I, [2024-05-06T15:47:16.540963 #726151] INFO -- : [437/885] 767520=test_config I, [2024-05-06T15:47:16.570055 #726151] INFO -- : [438/885] 767520=test_libs I, [2024-05-06T15:47:16.584777 #726151] INFO -- : [439/885] 767520=test_gc I, [2024-05-06T15:47:16.586256 #726151] INFO -- : [440/885] 767520=test_math I, [2024-05-06T15:47:16.602369 #726151] INFO -- : [441/885] 767520=test_gem_commands_fetch_command I, [2024-05-06T15:47:16.604274 #726151] INFO -- : [442/885] 767519=test_io I, [2024-05-06T15:47:16.680758 #726151] INFO -- : [443/885] 767528=test_unicode_escape I, [2024-05-06T15:47:16.703446 #726151] INFO -- : [444/885] 767533=test_autoload I, [2024-05-06T15:47:16.716290 #726151] INFO -- : [445/885] 767520=test_utf16 I, [2024-05-06T15:47:16.732881 #726151] INFO -- : [446/885] 767520=test_rendering I, [2024-05-06T15:47:16.737983 #726151] INFO -- : [447/885] 767527=test_case I, [2024-05-06T15:47:16.763550 #726151] INFO -- : [448/885] 767524=test_sizeof I, [2024-05-06T15:47:16.768633 #726151] INFO -- : [449/885] 767527=test_face I, [2024-05-06T15:47:16.777320 #726151] INFO -- : [450/885] 767528=test_gem_bundler_version_finder I, [2024-05-06T15:47:16.784007 #726151] INFO -- : [451/885] 767527=test_emoji_breaks I, [2024-05-06T15:47:16.790264 #726151] INFO -- : [452/885] 767527=test_within_pipe I, [2024-05-06T15:47:16.812593 #726151] INFO -- : [453/885] 767527=reflection_test I, [2024-05-06T15:47:16.821474 #726151] INFO -- : [454/885] 767520=test_gem_commands_unpack_command I, [2024-05-06T15:47:16.887547 #726151] INFO -- : [455/885] 767527=test_files_lib I, [2024-05-06T15:47:16.900272 #726151] INFO -- : [456/885] 767523=test_beginendblock I, [2024-05-06T15:47:17.032843 #726151] INFO -- : [457/885] 767528=test_rdoc_markup_to_bs I, [2024-05-06T15:47:17.049308 #726151] INFO -- : [458/885] 767529=test_help I, [2024-05-06T15:47:17.064306 #726151] INFO -- : [459/885] 767528=test_rdoc_markup_pre_process I, [2024-05-06T15:47:17.067336 #726151] INFO -- : [460/885] 767529=test_printf I, [2024-05-06T15:47:17.078292 #726151] INFO -- : [461/885] 767529=test_time I, [2024-05-06T15:47:17.085605 #726151] INFO -- : [462/885] 767520=test_webauthn_listener_response I, [2024-05-06T15:47:17.108085 #726151] INFO -- : [463/885] 767520=test_to_ary_concat I, [2024-05-06T15:47:17.169594 #726151] INFO -- : [464/885] 767528=test_stream I, [2024-05-06T15:47:17.202725 #726151] INFO -- : [465/885] 767528=test_pinned I, [2024-05-06T15:47:17.255413 #726151] INFO -- : [466/885] 767528=test_delegate I, [2024-05-06T15:47:17.272795 #726151] INFO -- : [467/885] 767528=test_popen_deadlock I, [2024-05-06T15:47:17.281320 #726151] INFO -- : [468/885] 767529=test_history I, [2024-05-06T15:47:17.299331 #726151] INFO -- : [469/885] 767529=test_date_marshal I, [2024-05-06T15:47:17.307795 #726151] INFO -- : [470/885] 767529=test_mkmf I, [2024-05-06T15:47:17.321302 #726151] INFO -- : [471/885] 767523=test_recursion I, [2024-05-06T15:47:17.330245 #726151] INFO -- : [472/885] 767523=test_exit I, [2024-05-06T15:47:17.343764 #726151] INFO -- : [473/885] 767529=test_digest I, [2024-05-06T15:47:17.360078 #726151] INFO -- : [474/885] 767529=test_ractor I, [2024-05-06T15:47:17.405544 #726151] INFO -- : [475/885] 767525=test_gem_security I, [2024-05-06T15:47:17.420356 #726151] INFO -- : [476/885] 767523=test_rdoc_servlet I, [2024-05-06T15:47:17.453718 #726151] INFO -- : [477/885] 767529=test_fiber I, [2024-05-06T15:47:17.560402 #726151] INFO -- : [478/885] 767523=test_multi_irb_commands I, [2024-05-06T15:47:17.574748 #726151] INFO -- : [479/885] 767523=test_open3 I, [2024-05-06T15:47:17.588443 #726151] INFO -- : [480/885] 767532=test_bundled_ca I, [2024-05-06T15:47:18.034701 #726151] INFO -- : [481/885] 767526=test_closure I, [2024-05-06T15:47:18.041855 #726151] INFO -- : [482/885] 767528=test_gem_commands_build_command I, [2024-05-06T15:47:18.143081 #726151] INFO -- : [483/885] 767522=test_interned_str I, [2024-05-06T15:47:18.144132 #726151] INFO -- : [484/885] 767522=test_case_comprehensive I, [2024-05-06T15:47:18.257825 #726151] INFO -- : [485/885] 767528=test_variable_name_check I, [2024-05-06T15:47:18.285022 #726151] INFO -- : [486/885] 767528=test_io_m17n I, [2024-05-06T15:47:18.294644 #726151] INFO -- : [487/885] 767520=test_did_you_mean I, [2024-05-06T15:47:18.302575 #726151] INFO -- : [488/885] 767526=test_gem_commands_server_command I, [2024-05-06T15:47:18.306320 #726151] INFO -- : [489/885] 767526=test_append I, [2024-05-06T15:47:18.318630 #726151] INFO -- : [490/885] 767526=test_option I, [2024-05-06T15:47:18.430637 #726151] INFO -- : [491/885] 767520=test_cmethod I, [2024-05-06T15:47:18.430768 #726151] INFO -- : [492/885] 767520=test_tracer I, [2024-05-06T15:47:18.435966 #726151] INFO -- : [493/885] 767516=test_iseq I, [2024-05-06T15:47:18.443252 #726151] INFO -- : [494/885] 767520=test_exception_at_throwing I, [2024-05-06T15:47:18.465773 #726151] INFO -- : [495/885] 767526=test_rdoc_markup_heading I, [2024-05-06T15:47:18.474454 #726151] INFO -- : [496/885] 767526=test_class I, [2024-05-06T15:47:18.481101 #726151] INFO -- : [497/885] 767526=test_ocsp I, [2024-05-06T15:47:18.481759 #726151] INFO -- : [498/885] 767520=test_pkey_dsa I, [2024-05-06T15:47:18.503267 #726151] INFO -- : [499/885] 767534=test_scheduler I, [2024-05-06T15:47:18.576679 #726151] INFO -- : [500/885] 767518=test_bug-14834 I, [2024-05-06T15:47:18.627732 #726151] INFO -- : [501/885] 767518=test_date_compat I, [2024-05-06T15:47:18.630375 #726151] INFO -- : [502/885] 767518=test_rdoc_markup_to_html I, [2024-05-06T15:47:18.640600 #726151] INFO -- : [503/885] 767534=test_compile_prism I, [2024-05-06T15:47:18.695505 #726151] INFO -- : [504/885] 767518=test_terminfo I, [2024-05-06T15:47:18.704089 #726151] INFO -- : [505/885] 767518=test_bn I, [2024-05-06T15:47:18.739330 #726151] INFO -- : [506/885] 767518=test_win32ole_param_event I, [2024-05-06T15:47:18.739388 #726151] INFO -- : [507/885] 767518=test_path I, [2024-05-06T15:47:18.751213 #726151] INFO -- : [508/885] 767518=test_case_mapping I, [2024-05-06T15:47:18.757417 #726151] INFO -- : [509/885] 767518=redundant_return_test I, [2024-05-06T15:47:18.767959 #726151] INFO -- : [510/885] 767518=test_tree_spell_checker I, [2024-05-06T15:47:18.788382 #726151] INFO -- : [511/885] 767518=test_http I, [2024-05-06T15:47:18.808032 #726151] INFO -- : [512/885] 767526=test_addrinfo I, [2024-05-06T15:47:18.872385 #726151] INFO -- : [513/885] 767526=test_rdoc_method_attr I, [2024-05-06T15:47:18.872726 #726151] INFO -- : [514/885] 767517=test_gem_gem_runner I, [2024-05-06T15:47:18.931326 #726151] INFO -- : [515/885] 767517=test_filter I, [2024-05-06T15:47:18.961748 #726151] INFO -- : [516/885] 767534=test_data I, [2024-05-06T15:47:18.968162 #726151] INFO -- : [517/885] 767534=static_literals_test I, [2024-05-06T15:47:18.968787 #726151] INFO -- : [518/885] 767534=test_rdoc_generator_pot I, [2024-05-06T15:47:18.976070 #726151] INFO -- : [519/885] 767534=parameters_signature_test I, [2024-05-06T15:47:18.981388 #726151] INFO -- : [520/885] 767534=test_koi8 I, [2024-05-06T15:47:18.984933 #726151] INFO -- : [521/885] 767534=test_enumerator I, [2024-05-06T15:47:18.987623 #726151] INFO -- : [522/885] 767517=test_rdoc_parser_changelog I, [2024-05-06T15:47:18.989061 #726151] INFO -- : [523/885] 767534=test_unicode I, [2024-05-06T15:47:18.990895 #726151] INFO -- : [524/885] 767526=test_thread_cv I, [2024-05-06T15:47:19.000276 #726151] INFO -- : [525/885] 767534=test_lexer I, [2024-05-06T15:47:19.016838 #726151] INFO -- : [526/885] 767534=test_ssl_session I, [2024-05-06T15:47:19.054412 #726151] INFO -- : [527/885] 767516=test_gem_commands_update_command I, [2024-05-06T15:47:19.079355 #726151] INFO -- : [528/885] 767532=test_gem_resolver_vendor_specification I, [2024-05-06T15:47:19.111070 #726151] INFO -- : [529/885] 767532=test_key_event_record I, [2024-05-06T15:47:19.116657 #726151] INFO -- : [530/885] 767532=test_gem_uri I, [2024-05-06T15:47:19.146773 #726151] INFO -- : [531/885] 767532=test_random I, [2024-05-06T15:47:19.156094 #726151] INFO -- : [532/885] 767532=test_notimplement I, [2024-05-06T15:47:19.159216 #726151] INFO -- : [533/885] 767532=test_primitive I, [2024-05-06T15:47:19.171043 #726151] INFO -- : [534/885] 767532=test_human_typo I, [2024-05-06T15:47:19.182837 #726151] INFO -- : [535/885] 767532=test_rbconfig I, [2024-05-06T15:47:19.186076 #726151] INFO -- : [536/885] 767532=test_document I, [2024-05-06T15:47:19.196621 #726151] INFO -- : [537/885] 767532=test_rdoc_generator_pot_po_entry I, [2024-05-06T15:47:19.203727 #726151] INFO -- : [538/885] 767532=test_euc_jp I, [2024-05-06T15:47:19.210614 #726151] INFO -- : [539/885] 767532=test_acceptable I, [2024-05-06T15:47:19.252333 #726151] INFO -- : [540/885] 767517=test_gem_commands_yank_command I, [2024-05-06T15:47:19.347973 #726151] INFO -- : [541/885] 767515=test_win32ole_param I, [2024-05-06T15:47:19.352021 #726151] INFO -- : [542/885] 767515=test_pair I, [2024-05-06T15:47:19.360443 #726151] INFO -- : [543/885] 767532=test_name_error_extension I, [2024-05-06T15:47:19.368805 #726151] INFO -- : [544/885] 767532=test_chilled I, [2024-05-06T15:47:19.373627 #726151] INFO -- : [545/885] 767532=test_rdoc_i18n_locale I, [2024-05-06T15:47:19.380954 #726151] INFO -- : [546/885] 767532=test_gem_resolver_local_specification I, [2024-05-06T15:47:19.385402 #726151] INFO -- : [547/885] 767528=test_httpheader I, [2024-05-06T15:47:19.407596 #726151] INFO -- : [548/885] 767532=test_rdoc_ri_driver I, [2024-05-06T15:47:19.474728 #726151] INFO -- : [549/885] 767528=test_encoding I, [2024-05-06T15:47:19.489895 #726151] INFO -- : [550/885] 767528=test_httpresponses I, [2024-05-06T15:47:19.499170 #726151] INFO -- : [551/885] 767528=test_set_len I, [2024-05-06T15:47:19.506123 #726151] INFO -- : [552/885] 767528=test_sockopt I, [2024-05-06T15:47:19.510512 #726151] INFO -- : [553/885] 767528=test_install I, [2024-05-06T15:47:19.623656 #726151] INFO -- : [554/885] 767526=test_rdoc_markup_to_label I, [2024-05-06T15:47:19.651208 #726151] INFO -- : [555/885] 767532=test_key_stroke I, [2024-05-06T15:47:19.656474 #726151] INFO -- : [556/885] 767532=test_color I, [2024-05-06T15:47:19.679807 #726151] INFO -- : [557/885] 767526=json_encoding_test I, [2024-05-06T15:47:19.681732 #726151] INFO -- : [558/885] 767528=test_win32ole_method_event I, [2024-05-06T15:47:19.686111 #726151] INFO -- : [559/885] 767528=test_nesting_parser I, [2024-05-06T15:47:19.692990 #726151] INFO -- : [560/885] 767526=test_gem_dependency_list I, [2024-05-06T15:47:19.699876 #726151] INFO -- : [561/885] 767532=test_benchmark I, [2024-05-06T15:47:19.740890 #726151] INFO -- : [562/885] 767517=test_gem_commands_outdated_command I, [2024-05-06T15:47:19.767289 #726151] INFO -- : [563/885] 767526=test_gem_package_tar_writer I, [2024-05-06T15:47:19.787727 #726151] INFO -- : [564/885] 767517=test_helper_method I, [2024-05-06T15:47:19.827378 #726151] INFO -- : [565/885] 767528=test_array I, [2024-05-06T15:47:19.858315 #726151] INFO -- : [566/885] 767526=test_gem_source I, [2024-05-06T15:47:19.883918 #726151] INFO -- : [567/885] 767517=test_scalar_scanner I, [2024-05-06T15:47:19.892063 #726151] INFO -- : [568/885] 767517=test_rdoc_parser_simple I, [2024-05-06T15:47:19.907651 #726151] INFO -- : [569/885] 767517=test_gem_commands_rebuild_command I, [2024-05-06T15:47:19.914899 #726151] INFO -- : [570/885] 767524=test_yamldbm I, [2024-05-06T15:47:19.920451 #726151] INFO -- : [571/885] 767524=test_load I, [2024-05-06T15:47:19.921686 #726151] INFO -- : [572/885] 767524=test_abi I, [2024-05-06T15:47:19.941866 #726151] INFO -- : [573/885] 767523=test_provider I, [2024-05-06T15:47:19.949066 #726151] INFO -- : [574/885] 767517=test_evaluation I, [2024-05-06T15:47:19.958008 #726151] INFO -- : [575/885] 767517=test_https I, [2024-05-06T15:47:19.965988 #726151] INFO -- : [576/885] 767534=test_gem_ext_builder I, [2024-05-06T15:47:20.059112 #726151] INFO -- : [577/885] 767526=test_x509ext I, [2024-05-06T15:47:20.065402 #726151] INFO -- : [578/885] 767526=test_erb I, [2024-05-06T15:47:20.114808 #726151] INFO -- : [579/885] 767526=test_gem_source_installed I, [2024-05-06T15:47:20.115473 #726151] INFO -- : [580/885] 767527=test_completion I, [2024-05-06T15:47:20.115549 #726151] INFO -- : [581/885] 767524=test_gem_commands_cert_command I, [2024-05-06T15:47:20.129516 #726151] INFO -- : [582/885] 767526=test_len I, [2024-05-06T15:47:20.131769 #726151] INFO -- : [583/885] 767526=test_yield_block I, [2024-05-06T15:47:20.134503 #726151] INFO -- : [584/885] 767526=test_rational2 I, [2024-05-06T15:47:20.139072 #726151] INFO -- : [585/885] 767520=test_rational I, [2024-05-06T15:47:20.147464 #726151] INFO -- : [586/885] 767526=test_assembler I, [2024-05-06T15:47:20.148706 #726151] INFO -- : [587/885] 767526=test_spell_checker I, [2024-05-06T15:47:20.157853 #726151] INFO -- : [588/885] 767526=test_propertyputref I, [2024-05-06T15:47:20.164175 #726151] INFO -- : [589/885] 767526=attribute_write_test I, [2024-05-06T15:47:20.166362 #726151] INFO -- : [590/885] 767520=test_gem_ext_cargo_builder I, [2024-05-06T15:47:20.173295 #726151] INFO -- : [591/885] 767526=test_ssl I, [2024-05-06T15:47:20.199472 #726151] INFO -- : [592/885] 767520=constant_path_node_test I, [2024-05-06T15:47:20.291267 #726151] INFO -- : [593/885] 767520=test_gem_request_set I, [2024-05-06T15:47:20.303262 #726151] INFO -- : [594/885] 767516=test_module I, [2024-05-06T15:47:20.330109 #726151] INFO -- : [595/885] 767523=test_parser I, [2024-05-06T15:47:20.348198 #726151] INFO -- : [596/885] 767523=test_arith_seq_extract I, [2024-05-06T15:47:20.374360 #726151] INFO -- : [597/885] 767517=test_method_name_check I, [2024-05-06T15:47:20.415145 #726151] INFO -- : [598/885] 767517=test_buffered_io I, [2024-05-06T15:47:20.425064 #726151] INFO -- : [599/885] 767517=test_monitor I, [2024-05-06T15:47:20.532667 #726151] INFO -- : [600/885] 767523=test_configuration I, [2024-05-06T15:47:20.617948 #726151] INFO -- : [601/885] 767523=test_rubyvm I, [2024-05-06T15:47:20.626156 #726151] INFO -- : [602/885] 767523=test_rdoc_generator_markup I, [2024-05-06T15:47:20.630494 #726151] INFO -- : [603/885] 767523=test_whileuntil I, [2024-05-06T15:47:20.643574 #726151] INFO -- : [604/885] 767517=test_boolean I, [2024-05-06T15:47:20.645839 #726151] INFO -- : [605/885] 767527=test_instrumentation_api I, [2024-05-06T15:47:20.648451 #726151] INFO -- : [606/885] 767523=integer_parse_test I, [2024-05-06T15:47:20.651712 #726151] INFO -- : [607/885] 767517=test_stringify_symbols I, [2024-05-06T15:47:20.652917 #726151] INFO -- : [608/885] 767521=test_dln I, [2024-05-06T15:47:20.655125 #726151] INFO -- : [609/885] 767521=test_gem_source_subpath_problem I, [2024-05-06T15:47:20.659624 #726151] INFO -- : [610/885] 767517=json_common_interface_test I, [2024-05-06T15:47:20.678936 #726151] INFO -- : [611/885] 767517=test_win32ole_variant_outarg I, [2024-05-06T15:47:20.680735 #726151] INFO -- : [612/885] 767517=test_config I, [2024-05-06T15:47:20.697150 #726151] INFO -- : [613/885] 767520=memsize_test I, [2024-05-06T15:47:20.701106 #726151] INFO -- : [614/885] 767520=test_nomethod_error I, [2024-05-06T15:47:20.702453 #726151] INFO -- : [615/885] 767523=json_parser_test I, [2024-05-06T15:47:20.705412 #726151] INFO -- : [616/885] 767520=test_cparser I, [2024-05-06T15:47:20.713356 #726151] INFO -- : [617/885] 767517=test_pkg_config I, [2024-05-06T15:47:20.745825 #726151] INFO -- : [618/885] 767517=test_sexp I, [2024-05-06T15:47:20.753375 #726151] INFO -- : [619/885] 767523=test_rdoc_markup_include I, [2024-05-06T15:47:20.754065 #726151] INFO -- : [620/885] 767523=fuzzer_test I, [2024-05-06T15:47:20.759481 #726151] INFO -- : [621/885] 767521=test_variable I, [2024-05-06T15:47:20.761168 #726151] INFO -- : [622/885] 767523=test_struct I, [2024-05-06T15:47:20.769502 #726151] INFO -- : [623/885] 767523=test_rdoc_markup_to_html_snippet I, [2024-05-06T15:47:20.773975 #726151] INFO -- : [624/885] 767517=magic_comment_test I, [2024-05-06T15:47:20.832823 #726151] INFO -- : [625/885] 767523=test_key_error I, [2024-05-06T15:47:20.837077 #726151] INFO -- : [626/885] 767523=test_win32ole_variant_m I, [2024-05-06T15:47:20.837137 #726151] INFO -- : [627/885] 767523=test_engine I, [2024-05-06T15:47:20.840663 #726151] INFO -- : [628/885] 767523=test_allocation I, [2024-05-06T15:47:20.864328 #726151] INFO -- : [629/885] 767517=test_div I, [2024-05-06T15:47:20.870342 #726151] INFO -- : [630/885] 767517=test_color_printer I, [2024-05-06T15:47:20.870614 #726151] INFO -- : [631/885] 767517=test_deprecated I, [2024-05-06T15:47:20.877679 #726151] INFO -- : [632/885] 767517=test_serialize_subclasses I, [2024-05-06T15:47:20.893258 #726151] INFO -- : [633/885] 767517=test_insns_leaf I, [2024-05-06T15:47:20.894491 #726151] INFO -- : [634/885] 767517=test_set I, [2024-05-06T15:47:20.894583 #726151] INFO -- : [635/885] 767521=test_gem_path_support I, [2024-05-06T15:47:20.920698 #726151] INFO -- : [636/885] 767521=test_struct I, [2024-05-06T15:47:20.923223 #726151] INFO -- : [637/885] 767517=test_files_test_1 I, [2024-05-06T15:47:21.008237 #726151] INFO -- : [638/885] 767532=test_rdoc_rd_inline I, [2024-05-06T15:47:21.016416 #726151] INFO -- : [639/885] 767532=test_x509req I, [2024-05-06T15:47:21.061169 #726151] INFO -- : [640/885] 767534=test_mutex I, [2024-05-06T15:47:21.230784 #726151] INFO -- : [641/885] 767532=test_float I, [2024-05-06T15:47:21.376706 #726151] INFO -- : [642/885] 767533=test_cgi_cookie I, [2024-05-06T15:47:21.381600 #726151] INFO -- : [643/885] 767521=test_require I, [2024-05-06T15:47:21.383531 #726151] INFO -- : [644/885] 767533=test_dir_m17n I, [2024-05-06T15:47:21.450784 #726151] INFO -- : [645/885] 767520=test_gem_resolver_installer_set I, [2024-05-06T15:47:21.652094 #726151] INFO -- : [646/885] 767524=test_refinement I, [2024-05-06T15:47:21.672570 #726151] INFO -- : [647/885] 767520=test_gem_commands_signout_command I, [2024-05-06T15:47:21.694155 #726151] INFO -- : [648/885] 767520=test_regex_casefold I, [2024-05-06T15:47:22.197251 #726151] INFO -- : [649/885] 767534=test_gem_source_git I, [2024-05-06T15:47:22.293295 #726151] INFO -- : [650/885] 767520=test_signal I, [2024-05-06T15:47:22.297675 #726151] INFO -- : [651/885] 767516=test_fixnum I, [2024-05-06T15:47:22.309370 #726151] INFO -- : [652/885] 767516=test_x509crl I, [2024-05-06T15:47:22.478239 #726151] INFO -- : [653/885] 767516=test_cgi_session I, [2024-05-06T15:47:22.506491 #726151] INFO -- : [654/885] 767516=test_rdoc_rd I, [2024-05-06T15:47:22.535428 #726151] INFO -- : [655/885] 767516=test_metaclass I, [2024-05-06T15:47:22.556313 #726151] INFO -- : [656/885] 767516=test_rdoc_top_level I, [2024-05-06T15:47:22.561431 #726151] INFO -- : [657/885] 767532=test_windows_1252 I, [2024-05-06T15:47:22.565464 #726151] INFO -- : [658/885] 767532=test_input_method I, [2024-05-06T15:47:22.588409 #726151] INFO -- : [659/885] 767532=test_process I, [2024-05-06T15:47:22.614343 #726151] INFO -- : [660/885] 767532=test_string I, [2024-05-06T15:47:22.616826 #726151] INFO -- : [661/885] 767532=test_iterator I, [2024-05-06T15:47:22.700563 #726151] INFO -- : [662/885] 767532=test_omap I, [2024-05-06T15:47:22.708486 #726151] INFO -- : [663/885] 767532=test_digest_extend I, [2024-05-06T15:47:22.717277 #726151] INFO -- : [664/885] 767532=test_shellwords I, [2024-05-06T15:47:22.723790 #726151] INFO -- : [665/885] 767532=test_debug I, [2024-05-06T15:47:22.730638 #726151] INFO -- : [666/885] 767532=test_memory_view I, [2024-05-06T15:47:22.737640 #726151] INFO -- : [667/885] 767534=pattern_test I, [2024-05-06T15:47:22.746777 #726151] INFO -- : [668/885] 767534=test_cipher I, [2024-05-06T15:47:22.755822 #726151] INFO -- : [669/885] 767532=test_gem_security_signer I, [2024-05-06T15:47:22.767780 #726151] INFO -- : [670/885] 767516=test_new I, [2024-05-06T15:47:22.771552 #726151] INFO -- : [671/885] 767516=test_storage I, [2024-05-06T15:47:22.783932 #726151] INFO -- : [672/885] 767516=test_gem_resolver_git_set I, [2024-05-06T15:47:22.790888 #726151] INFO -- : [673/885] 767534=test_parser I, [2024-05-06T15:47:22.793170 #726151] INFO -- : [674/885] 767515=test_cgi_core I, [2024-05-06T15:47:22.800065 #726151] INFO -- : [675/885] 767534=test_gem_source_lock I, [2024-05-06T15:47:22.812587 #726151] INFO -- : [676/885] 767515=test_gem I, [2024-05-06T15:47:22.839621 #726151] INFO -- : [677/885] 767534=test_dns I, [2024-05-06T15:47:22.846810 #726151] INFO -- : [678/885] 767533=test_gem_commands_open_command I, [2024-05-06T15:47:22.869827 #726151] INFO -- : [679/885] 767532=test_ractor I, [2024-05-06T15:47:22.884449 #726151] INFO -- : [680/885] 767532=parse_stream_test I, [2024-05-06T15:47:22.935138 #726151] INFO -- : [681/885] 767533=test_registry I, [2024-05-06T15:47:22.935394 #726151] INFO -- : [682/885] 767533=json_ext_parser_test I, [2024-05-06T15:47:22.944319 #726151] INFO -- : [683/885] 767532=test_thread I, [2024-05-06T15:47:22.944776 #726151] INFO -- : [684/885] 767533=test_my_integer I, [2024-05-06T15:47:22.955621 #726151] INFO -- : [685/885] 767533=test_rendering I, [2024-05-06T15:47:22.958578 #726151] INFO -- : [686/885] 767533=test_debugger_integration I, [2024-05-06T15:47:22.978862 #726151] INFO -- : [687/885] 767533=test_ractor I, [2024-05-06T15:47:23.109358 #726151] INFO -- : [688/885] 767516=test_ssl I, [2024-05-06T15:47:23.270891 #726151] INFO -- : [689/885] 767523=test_rb_str_dup I, [2024-05-06T15:47:23.273516 #726151] INFO -- : [690/885] 767523=test_reline_key I, [2024-05-06T15:47:23.311682 #726151] INFO -- : [691/885] 767523=test_ancdata I, [2024-05-06T15:47:23.313459 #726151] INFO -- : [692/885] 767534=test_singleton_function I, [2024-05-06T15:47:23.314344 #726151] INFO -- : [693/885] 767523=test_alias I, [2024-05-06T15:47:23.314385 #726151] INFO -- : [694/885] 767534=test_timeout I, [2024-05-06T15:47:23.419298 #726151] INFO -- : [695/885] 767533=test_unicode_normalize I, [2024-05-06T15:47:23.453602 #726151] INFO -- : [696/885] 767523=test_marshal I, [2024-05-06T15:47:23.460777 #726151] INFO -- : [697/885] 767529=test_weakref I, [2024-05-06T15:47:23.506784 #726151] INFO -- : [698/885] 767517=test_nonblock I, [2024-05-06T15:47:23.515204 #726151] INFO -- : [699/885] 767517=test_https_proxy I, [2024-05-06T15:47:23.520056 #726151] INFO -- : [700/885] 767517=test_call I, [2024-05-06T15:47:23.556410 #726151] INFO -- : [701/885] 767527=test_rubygems I, [2024-05-06T15:47:23.576318 #726151] INFO -- : [702/885] 767529=test_super I, [2024-05-06T15:47:23.631699 #726151] INFO -- : [703/885] 767516=test_rubyoptions I, [2024-05-06T15:47:23.681770 #726151] INFO -- : [704/885] 767517=test_cgi_modruby I, [2024-05-06T15:47:23.689276 #726151] INFO -- : [705/885] 767517=test_integer I, [2024-05-06T15:47:23.755874 #726151] INFO -- : [706/885] 767527=test_object_references I, [2024-05-06T15:47:23.765857 #726151] INFO -- : [707/885] 767527=test_usrmarshal I, [2024-05-06T15:47:23.851971 #726151] INFO -- : [708/885] 767521=test_gem_resolver_git_specification I, [2024-05-06T15:47:23.897674 #726151] INFO -- : [709/885] 767527=test_gem_request_set_lockfile_tokenizer I, [2024-05-06T15:47:23.975055 #726151] INFO -- : [710/885] 767527=test_stat I, [2024-05-06T15:47:23.982692 #726151] INFO -- : [711/885] 767523=test_have_func I, [2024-05-06T15:47:23.991698 #726151] INFO -- : [712/885] 767527=test_nextafter I, [2024-05-06T15:47:24.008185 #726151] INFO -- : [713/885] 767519=test_capacity I, [2024-05-06T15:47:24.032042 #726151] INFO -- : [714/885] 767519=test_dryrun I, [2024-05-06T15:47:24.041859 #726151] INFO -- : [715/885] 767527=desugar_compiler_test I, [2024-05-06T15:47:24.051233 #726151] INFO -- : [716/885] 767519=test_integer I, [2024-05-06T15:47:24.055049 #726151] INFO -- : [717/885] 767527=test_env I, [2024-05-06T15:47:24.076388 #726151] INFO -- : [718/885] 767521=test_rdoc_attr I, [2024-05-06T15:47:24.088990 #726151] INFO -- : [719/885] 767529=test_gem_commands_setup_command I, [2024-05-06T15:47:24.113046 #726151] INFO -- : [720/885] 767519=test_numeric I, [2024-05-06T15:47:24.130613 #726151] INFO -- : [721/885] 767519=test_member I, [2024-05-06T15:47:24.142071 #726151] INFO -- : [722/885] 767519=test_gem_commands_cleanup_command I, [2024-05-06T15:47:24.176414 #726151] INFO -- : [723/885] 767524=test_word I, [2024-05-06T15:47:24.188414 #726151] INFO -- : [724/885] 767524=test_cgi_multipart I, [2024-05-06T15:47:24.191274 #726151] INFO -- : [725/885] 767521=test_ractor_compatibility I, [2024-05-06T15:47:24.230699 #726151] INFO -- : [726/885] 767534=test_autoconf I, [2024-05-06T15:47:24.237307 #726151] INFO -- : [727/885] 767534=test_eval I, [2024-05-06T15:47:24.238379 #726151] INFO -- : [728/885] 767534=test_gem_console_ui I, [2024-05-06T15:47:24.254750 #726151] INFO -- : [729/885] 767534=test_date_ractor I, [2024-05-06T15:47:24.359737 #726151] INFO -- : [730/885] 767524=test_dir I, [2024-05-06T15:47:24.480838 #726151] INFO -- : [731/885] 767520=format_errors_test I, [2024-05-06T15:47:24.485068 #726151] INFO -- : [732/885] 767520=test_coderange I, [2024-05-06T15:47:24.488427 #726151] INFO -- : [733/885] 767520=test_symbol I, [2024-05-06T15:47:24.499008 #726151] INFO -- : [734/885] 767529=location_test I, [2024-05-06T15:47:24.509977 #726151] INFO -- : [735/885] 767520=test_mailto I, [2024-05-06T15:47:24.524958 #726151] INFO -- : [736/885] 767534=test_rdoc_generator_darkfish I, [2024-05-06T15:47:24.526140 #726151] INFO -- : [737/885] 767520=test_error_highlight I, [2024-05-06T15:47:24.536918 #726151] INFO -- : [738/885] 767519=test_resize I, [2024-05-06T15:47:24.542539 #726151] INFO -- : [739/885] 767519=test_rdoc_comment I, [2024-05-06T15:47:24.573419 #726151] INFO -- : [740/885] 767519=json_generic_object_test I, [2024-05-06T15:47:24.589520 #726151] INFO -- : [741/885] 767519=test_gem_source_fetch_problem I, [2024-05-06T15:47:24.590853 #726151] INFO -- : [742/885] 767521=test_http_request I, [2024-05-06T15:47:24.604356 #726151] INFO -- : [743/885] 767519=test_function_entry I, [2024-05-06T15:47:24.608467 #726151] INFO -- : [744/885] 767519=test_pkcs7 I, [2024-05-06T15:47:24.614858 #726151] INFO -- : [745/885] 767529=test_gem_resolver_requirement_list I, [2024-05-06T15:47:24.618431 #726151] INFO -- : [746/885] 767529=test_arith_seq_beg_len_step I, [2024-05-06T15:47:24.647527 #726151] INFO -- : [747/885] 767521=test_unix I, [2024-05-06T15:47:24.655314 #726151] INFO -- : [748/885] 767524=test_lazy_enumerator I, [2024-05-06T15:47:24.674459 #726151] INFO -- : [749/885] 767515=test_enc_associate I, [2024-05-06T15:47:24.677669 #726151] INFO -- : [750/885] 767521=ruby_api_test I, [2024-05-06T15:47:24.678786 #726151] INFO -- : [751/885] 767529=test_find_executable I, [2024-05-06T15:47:24.690175 #726151] INFO -- : [752/885] 767529=test_symbol I, [2024-05-06T15:47:24.809752 #726151] INFO -- : [753/885] 767534=test_coder I, [2024-05-06T15:47:24.819901 #726151] INFO -- : [754/885] 767519=test_nofree I, [2024-05-06T15:47:24.827982 #726151] INFO -- : [755/885] 767534=test_gem_commands_pristine_command I, [2024-05-06T15:47:24.843900 #726151] INFO -- : [756/885] 767519=test_context I, [2024-05-06T15:47:24.917465 #726151] INFO -- : [757/885] 767521=test_trace I, [2024-05-06T15:47:24.930357 #726151] INFO -- : [758/885] 767521=ractor_test I, [2024-05-06T15:47:24.974861 #726151] INFO -- : [759/885] 767519=test_rdoc_generator_json_index I, [2024-05-06T15:47:25.001162 #726151] INFO -- : [760/885] 767519=test_time_tz I, [2024-05-06T15:47:25.001437 #726151] INFO -- : [761/885] 767521=test_win32ole_event I, [2024-05-06T15:47:25.005343 #726151] INFO -- : [762/885] 767520=test_gem_ci_detector I, [2024-05-06T15:47:25.005650 #726151] INFO -- : [763/885] 767521=test_rdoc_class_module I, [2024-05-06T15:47:25.007410 #726151] INFO -- : [764/885] 767520=test_bignum I, [2024-05-06T15:47:25.073861 #726151] INFO -- : [765/885] 767519=test_win32ole_variable I, [2024-05-06T15:47:25.076392 #726151] INFO -- : [766/885] 767519=test_io_wait_uncommon I, [2024-05-06T15:47:25.078361 #726151] INFO -- : [767/885] 767519=test_stringio I, [2024-05-06T15:47:25.095155 #726151] INFO -- : [768/885] 767520=test_arity I, [2024-05-06T15:47:25.107887 #726151] INFO -- : [769/885] 767520=test_enum I, [2024-05-06T15:47:25.115338 #726151] INFO -- : [770/885] 767524=test_gem_specification I, [2024-05-06T15:47:25.243266 #726151] INFO -- : [771/885] 767519=test_threadgroup I, [2024-05-06T15:47:25.290919 #726151] INFO -- : [772/885] 767515=test_have_macro I, [2024-05-06T15:47:25.363174 #726151] INFO -- : [773/885] 767528=test_gem_package I, [2024-05-06T15:47:25.559674 #726151] INFO -- : [774/885] 767523=test_resolve_symbol I, [2024-05-06T15:47:25.611280 #726151] INFO -- : [775/885] 767523=test_complex2 I, [2024-05-06T15:47:25.622856 #726151] INFO -- : [776/885] 767523=test_merge_keys I, [2024-05-06T15:47:25.650446 #726151] INFO -- : [777/885] 767523=test_rdoc_extend I, [2024-05-06T15:47:25.653329 #726151] INFO -- : [778/885] 767521=test_win32ole_variant I, [2024-05-06T15:47:25.658097 #726151] INFO -- : [779/885] 767521=test_ipaddr I, [2024-05-06T15:47:25.675095 #726151] INFO -- : [780/885] 767523=test_rdoc_markup_to_ansi I, [2024-05-06T15:47:25.684288 #726151] INFO -- : [781/885] 767521=test_mixed_unicode_escapes I, [2024-05-06T15:47:25.687208 #726151] INFO -- : [782/885] 767521=test_history I, [2024-05-06T15:47:25.696852 #726151] INFO -- : [783/885] 767521=test_gem_resolver_api_specification I, [2024-05-06T15:47:25.708695 #726151] INFO -- : [784/885] 767523=heredoc_dedent_test I, [2024-05-06T15:47:25.718755 #726151] INFO -- : [785/885] 767523=test_cgi_header I, [2024-05-06T15:47:25.730684 #726151] INFO -- : [786/885] 767523=test_object I, [2024-05-06T15:47:25.735718 #726151] INFO -- : [787/885] 767521=version_test I, [2024-05-06T15:47:25.737603 #726151] INFO -- : [788/885] 767523=test_key_actor_emacs I, [2024-05-06T15:47:25.739697 #726151] INFO -- : [789/885] 767521=test_gem_gemcutter_utilities I, [2024-05-06T15:47:25.756260 #726151] INFO -- : [790/885] 767525=test_basicinstructions I, [2024-05-06T15:47:25.823688 #726151] INFO -- : [791/885] 767525=test_gem_command_manager I, [2024-05-06T15:47:25.842711 #726151] INFO -- : [792/885] 767528=test_arithmetic_sequence I, [2024-05-06T15:47:25.848371 #726151] INFO -- : [793/885] 767515=test_change_word I, [2024-05-06T15:47:25.855413 #726151] INFO -- : [794/885] 767515=compiler_test I, [2024-05-06T15:47:25.868485 #726151] INFO -- : [795/885] 767528=test_flip I, [2024-05-06T15:47:25.874399 #726151] INFO -- : [796/885] 767523=test_timeout I, [2024-05-06T15:47:25.875703 #726151] INFO -- : [797/885] 767528=test_ossl I, [2024-05-06T15:47:25.875913 #726151] INFO -- : [798/885] 767523=test_normalize I, [2024-05-06T15:47:25.881695 #726151] INFO -- : [799/885] 767523=test_object I, [2024-05-06T15:47:25.922112 #726151] INFO -- : [800/885] 767515=test_ruby_lex I, [2024-05-06T15:47:26.010038 #726151] INFO -- : [801/885] 767525=test_date_arith I, [2024-05-06T15:47:26.013829 #726151] INFO -- : [802/885] 767525=test_gem_local_remote_options I, [2024-05-06T15:47:26.048749 #726151] INFO -- : [803/885] 767525=test_sleep I, [2024-05-06T15:47:26.068938 #726151] INFO -- : [804/885] 767515=test_ractor I, [2024-05-06T15:47:26.074796 #726151] INFO -- : [805/885] 767520=test_type I, [2024-05-06T15:47:26.078346 #726151] INFO -- : [806/885] 767520=test_func I, [2024-05-06T15:47:26.081693 #726151] INFO -- : [807/885] 767521=test_big5 I, [2024-05-06T15:47:26.090770 #726151] INFO -- : [808/885] 767521=test_pointer I, [2024-05-06T15:47:26.145465 #726151] INFO -- : [809/885] 767515=test_rdoc_rd_block_parser I, [2024-05-06T15:47:26.149296 #726151] INFO -- : [810/885] 767534=test_signedness I, [2024-05-06T15:47:26.209479 #726151] INFO -- : [811/885] 767515=test_tsort I, [2024-05-06T15:47:26.213612 #726151] INFO -- : [812/885] 767515=test_pkey_rsa I, [2024-05-06T15:47:26.262286 #726151] INFO -- : [813/885] 767519=test_weakkeymap I, [2024-05-06T15:47:26.297043 #726151] INFO -- : [814/885] 767517=test_gem_commands_push_command I, [2024-05-06T15:47:26.306609 #726151] INFO -- : [815/885] 767523=test_numhash I, [2024-05-06T15:47:26.314759 #726151] INFO -- : [816/885] 767523=test_placearg I, [2024-05-06T15:47:26.444930 #726151] INFO -- : [817/885] 767523=test_date_strptime I, [2024-05-06T15:47:26.456164 #726151] INFO -- : [818/885] 767515=test_gem_package_task I, [2024-05-06T15:47:26.456492 #726151] INFO -- : [819/885] 767515=test_rdoc_markup_hard_break I, [2024-05-06T15:47:26.460726 #726151] INFO -- : [820/885] 767515=test_gem_platform I, [2024-05-06T15:47:26.471225 #726151] INFO -- : [821/885] 767519=test_delete I, [2024-05-06T15:47:26.478067 #726151] INFO -- : [822/885] 767519=test_win32ole_method I, [2024-05-06T15:47:26.478129 #726151] INFO -- : [823/885] 767519=test_fd_setsize I, [2024-05-06T15:47:26.480616 #726151] INFO -- : [824/885] 767519=test_continuation I, [2024-05-06T15:47:26.486618 #726151] INFO -- : [825/885] 767519=test_keyword I, [2024-05-06T15:47:26.526700 #726151] INFO -- : [826/885] 767523=test_class_name_check I, [2024-05-06T15:47:26.558203 #726151] INFO -- : [827/885] 767515=test_file_exhaustive I, [2024-05-06T15:47:26.606397 #726151] INFO -- : [828/885] 767523=test_files_test I, [2024-05-06T15:47:26.636549 #726151] INFO -- : [829/885] 767521=test_gem_update_suggestion I, [2024-05-06T15:47:26.684287 #726151] INFO -- : [830/885] 767523=test_logger I, [2024-05-06T15:47:26.696616 #726151] INFO -- : [831/885] 767521=test_import I, [2024-05-06T15:47:26.708220 #726151] INFO -- : [832/885] 767523=test_not I, [2024-05-06T15:47:26.717997 #726151] INFO -- : [833/885] 767523=test_gem_resolver_lock_set I, [2024-05-06T15:47:26.736708 #726151] INFO -- : [834/885] 767523=test_rdoc_parser_markdown I, [2024-05-06T15:47:26.749924 #726151] INFO -- : [835/885] 767523=test_config I, [2024-05-06T15:47:26.796448 #726151] INFO -- : [836/885] 767530=test_gem_resolver_vendor_set I, [2024-05-06T15:47:26.807457 #726151] INFO -- : [837/885] 767517=test_enumerable I, [2024-05-06T15:47:26.814236 #726151] INFO -- : [838/885] 767517=test_gem_safe_marshal I, [2024-05-06T15:47:26.831737 #726151] INFO -- : [839/885] 767530=test_gem_resolver_api_set I, [2024-05-06T15:47:26.840271 #726151] INFO -- : [840/885] 767527=test_transcode I, [2024-05-06T15:47:26.850971 #726151] INFO -- : [841/885] 767533=test_eval I, [2024-05-06T15:47:26.887888 #726151] INFO -- : [842/885] 767530=json_generator_test I, [2024-05-06T15:47:26.955452 #726151] INFO -- : [843/885] 767530=test_rdoc_code_object I, [2024-05-06T15:47:26.972332 #726151] INFO -- : [844/885] 767519=test_x509store I, [2024-05-06T15:47:27.054043 #726151] INFO -- : [845/885] 767529=test_update I, [2024-05-06T15:47:27.057154 #726151] INFO -- : [846/885] 767529=test_x509name I, [2024-05-06T15:47:27.068901 #726151] INFO -- : [847/885] 767529=test_fips I, [2024-05-06T15:47:27.079098 #726151] INFO -- : [848/885] 767527=test_lambda I, [2024-05-06T15:47:27.116399 #726151] INFO -- : [849/885] 767533=test_gem_request_set_gem_dependency_api I, [2024-05-06T15:47:27.142267 #726151] INFO -- : [850/885] 767527=test_ast I, [2024-05-06T15:47:27.209325 #726151] INFO -- : [851/885] 767523=test_helper I, [2024-05-06T15:47:27.209919 #726151] INFO -- : [852/885] 767523=test_random_formatter I, [2024-05-06T15:47:27.229570 #726151] INFO -- : [853/885] 767523=test_jaro_winkler I, [2024-05-06T15:47:27.231081 #726151] INFO -- : [854/885] 767519=test_webauthn_listener I, [2024-05-06T15:47:27.233560 #726151] INFO -- : [855/885] 767523=errors_test I, [2024-05-06T15:47:27.285520 #726151] INFO -- : [856/885] 767519=test_regexp I, [2024-05-06T15:47:27.300500 #726151] INFO -- : [857/885] 767523=test_gem_commands_check_command I, [2024-05-06T15:47:27.306537 #726151] INFO -- : [858/885] 767524=test_vm_dump I, [2024-05-06T15:47:27.307227 #726151] INFO -- : [859/885] 767524=test_tmpdir I, [2024-05-06T15:47:27.323421 #726151] INFO -- : [860/885] 767523=test_rdoc_markup_document I, [2024-05-06T15:47:27.332089 #726151] INFO -- : [861/885] 767533=test_integer_comb I, [2024-05-06T15:47:27.334604 #726151] INFO -- : [862/885] 767523=bom_test I, [2024-05-06T15:47:27.347923 #726151] INFO -- : [863/885] 767523=test_data_error I, [2024-05-06T15:47:27.382213 #726151] INFO -- : [864/885] 767524=test_file I, [2024-05-06T15:47:27.389043 #726151] INFO -- : [865/885] 767529=test_force_exit I, [2024-05-06T15:47:27.391733 #726151] INFO -- : [866/885] 767529=test_ostruct I, [2024-05-06T15:47:27.420654 #726151] INFO -- : [867/885] 767530=unescape_test I, [2024-05-06T15:47:27.431533 #726151] INFO -- : [868/885] 767523=test_udp I, [2024-05-06T15:47:27.435565 #726151] INFO -- : [869/885] 767523=static_inspect_test I, [2024-05-06T15:47:27.439623 #726151] INFO -- : [870/885] 767523=test_gem_uri_formatter I, [2024-05-06T15:47:27.452894 #726151] INFO -- : [871/885] 767523=test_helper I, [2024-05-06T15:47:27.455196 #726151] INFO -- : [872/885] 767523=test_erb_command I, [2024-05-06T15:47:27.518534 #726151] INFO -- : [873/885] 767523=test_encoding I, [2024-05-06T15:47:27.534460 #726151] INFO -- : [874/885] 767529=test_project_sanity I, [2024-05-06T15:47:27.594261 #726151] INFO -- : [875/885] 767517=test_range I, [2024-05-06T15:47:27.619709 #726151] INFO -- : [876/885] 767529=command_line_test I, [2024-05-06T15:47:27.622555 #726151] INFO -- : [877/885] 767529=test_pty I, [2024-05-06T15:47:27.718383 #726151] INFO -- : [878/885] 767523=test_dup I, [2024-05-06T15:47:27.819520 #726151] INFO -- : [879/885] 767521=test_constant I, [2024-05-06T15:47:27.901627 #726151] INFO -- : [880/885] 767526=test_rdoc_ri_paths I, [2024-05-06T15:47:27.914076 #726151] INFO -- : [881/885] 767523=test_ts I, [2024-05-06T15:47:27.937960 #726151] INFO -- : [882/885] 767526=test_ensured I, [2024-05-06T15:47:27.980539 #726151] INFO -- : [883/885] 767526=test_addr I, [2024-05-06T15:47:28.001822 #726151] INFO -- : [884/885] 767526=test_locale I, [2024-05-06T15:47:28.115580 #726151] INFO -- : [885/885] 767529=library_symbols_test I, [2024-05-06T15:47:51.227687 #726151] INFO -- : Finished tests in 42.331836s, 623.3606 tests/s, 220946.8772 assertions/s. E, [2024-05-06T15:47:51.227851 #726151] ERROR -- : Children under /tmp/rubytest.ooodkb: E, [2024-05-06T15:47:51.227882 #726151] ERROR -- : * drwx------ 4 80 2024-05-06 15:47:19 +0000 gem_rebuild20240506-767517-c9u0hb/ E, [2024-05-06T15:47:51.227889 #726151] ERROR -- : * drwxrwxr-x 2 60 2024-05-06 15:47:19 +0000 new/ E, [2024-05-06T15:47:51.227893 #726151] ERROR -- : * -rw-rw-r-- 1 4096 2024-05-06 15:47:19 +0000 rebuild_test_gem-1.0.0.gem E, [2024-05-06T15:47:51.227897 #726151] ERROR -- : * drwxrwxr-x 2 60 2024-05-06 15:47:19 +0000 old/ E, [2024-05-06T15:47:51.227901 #726151] ERROR -- : * -rw-rw-r-- 1 4096 2024-05-06 15:47:19 +0000 rebuild_test_gem-1.0.0.gem I, [2024-05-06T15:47:51.229053 #726151] INFO -- : 26388 tests, 9353087 assertions, 0 failures, 0 errors, 312 skips I, [2024-05-06T15:47:51.229076 #726151] INFO -- : I, [2024-05-06T15:47:51.229082 #726151] INFO -- : ruby -v: ruby 3.4.0dev (2024-05-06T15:12:30Z master 14d400829d) [x86_64-linux] I, [2024-05-06T15:47:51.231322 #726151] INFO -- : $$$[end] "make yes-test-all TESTOPTS='--stderr-on-failure' TESTS='-j20'" exit with 0. I, [2024-05-06T15:47:51.231480 #726151] INFO -- : $$$[beg] make yes-test-rubyspec MSPECOPT='--error-output stderr --debug -j' TESTS='-j20' I, [2024-05-06T15:47:51.319885 #726151] INFO -- : BASERUBY = /usr/bin/ruby --disable=gems I, [2024-05-06T15:47:51.319939 #726151] INFO -- : CC = gcc I, [2024-05-06T15:47:51.319953 #726151] INFO -- : LD = ld I, [2024-05-06T15:47:51.319965 #726151] INFO -- : LDSHARED = gcc -shared I, [2024-05-06T15:47:51.319977 #726151] INFO -- : CFLAGS = -O3 -fno-fast-math -ggdb3 -Wall -Wextra -Wdeprecated-declarations -Wdiv-by-zero -Wduplicated-cond -Wimplicit-function-declaration -Wimplicit-int -Wpointer-arith -Wwrite-strings -Wold-style-definition -Wimplicit-fallthrough=0 -Wmissing-noreturn -Wno-cast-function-type -Wno-constant-logical-operand -Wno-long-long -Wno-missing-field-initializers -Wno-overlength-strings -Wno-packed-bitfield-compat -Wno-parentheses-equality -Wno-self-assign -Wno-tautological-compare -Wno-unused-parameter -Wno-unused-value -Wsuggest-attribute=format -Wsuggest-attribute=noreturn -Wunused-variable -Wmisleading-indentation -Wundef -fPIC I, [2024-05-06T15:47:51.319989 #726151] INFO -- : XCFLAGS = -U_FORTIFY_SOURCE -D_FORTIFY_SOURCE=2 -fstack-protector-strong -fno-strict-overflow -fvisibility=hidden -fexcess-precision=standard -DRUBY_EXPORT -I. -I.ext/include/x86_64-linux -I/tmp/ruby/src/trunk/include -I/tmp/ruby/src/trunk -I/tmp/ruby/src/trunk/prism -I/tmp/ruby/src/trunk/enc/unicode/15.0.0 I, [2024-05-06T15:47:51.319999 #726151] INFO -- : CPPFLAGS = I, [2024-05-06T15:47:51.320009 #726151] INFO -- : DLDFLAGS = -Wl,--compress-debug-sections=zlib -Wl,-soname,libruby.so.3.4 -fstack-protector-strong I, [2024-05-06T15:47:51.320020 #726151] INFO -- : SOLIBS = -lz -lrt -lrt -lgmp -ldl -lcrypt -lm -lpthread I, [2024-05-06T15:47:51.320030 #726151] INFO -- : LANG = en_US.UTF-8 I, [2024-05-06T15:47:51.320040 #726151] INFO -- : LC_ALL = I, [2024-05-06T15:47:51.320050 #726151] INFO -- : LC_CTYPE = I, [2024-05-06T15:47:51.320061 #726151] INFO -- : MFLAGS = I, [2024-05-06T15:47:51.320071 #726151] INFO -- : RUSTC = no I, [2024-05-06T15:47:51.320082 #726151] INFO -- : YJIT_RUSTC_ARGS = --crate-name=yjit --crate-type=staticlib --edition=2021 -g -C lto=thin -C opt-level=3 -C overflow-checks=on '--out-dir=/tmp/ruby/build/trunk/yjit/target/release/' /tmp/ruby/src/trunk/yjit/src/lib.rs I, [2024-05-06T15:47:51.320485 #726151] INFO -- : gcc (Ubuntu 11.4.0-1ubuntu1~22.04) 11.4.0 I, [2024-05-06T15:47:51.320538 #726151] INFO -- : Copyright (C) 2021 Free Software Foundation, Inc. I, [2024-05-06T15:47:51.320552 #726151] INFO -- : This is free software; see the source for copying conditions. There is NO I, [2024-05-06T15:47:51.320564 #726151] INFO -- : warranty; not even for MERCHANTABILITY or FITNESS FOR A PARTICULAR PURPOSE. I, [2024-05-06T15:47:51.320582 #726151] INFO -- : I, [2024-05-06T15:47:51.322221 #726151] INFO -- : generating enc.mk I, [2024-05-06T15:47:51.440157 #726151] INFO -- : making enc I, [2024-05-06T15:47:51.457350 #726151] INFO -- : make[1]: Entering directory '/tmp/ruby/build/trunk' I, [2024-05-06T15:47:51.457403 #726151] INFO -- : make[1]: Nothing to be done for 'enc'. I, [2024-05-06T15:47:51.457418 #726151] INFO -- : make[1]: Leaving directory '/tmp/ruby/build/trunk' I, [2024-05-06T15:47:51.458142 #726151] INFO -- : making srcs under enc I, [2024-05-06T15:47:51.489451 #726151] INFO -- : make[1]: Entering directory '/tmp/ruby/build/trunk' I, [2024-05-06T15:47:51.489514 #726151] INFO -- : make[1]: Nothing to be done for 'srcs'. I, [2024-05-06T15:47:51.489528 #726151] INFO -- : make[1]: Leaving directory '/tmp/ruby/build/trunk' I, [2024-05-06T15:47:51.490321 #726151] INFO -- : generating transdb.h I, [2024-05-06T15:47:51.585093 #726151] INFO -- : transdb.h unchanged I, [2024-05-06T15:47:51.586366 #726151] INFO -- : making trans I, [2024-05-06T15:47:51.620965 #726151] INFO -- : make[1]: Entering directory '/tmp/ruby/build/trunk' I, [2024-05-06T15:47:51.621027 #726151] INFO -- : make[1]: Nothing to be done for 'trans'. I, [2024-05-06T15:47:51.621041 #726151] INFO -- : make[1]: Leaving directory '/tmp/ruby/build/trunk' I, [2024-05-06T15:47:51.621697 #726151] INFO -- : making encs I, [2024-05-06T15:47:51.659308 #726151] INFO -- : make[1]: Entering directory '/tmp/ruby/build/trunk' I, [2024-05-06T15:47:51.659370 #726151] INFO -- : make[1]: Nothing to be done for 'encs'. I, [2024-05-06T15:47:51.659384 #726151] INFO -- : make[1]: Leaving directory '/tmp/ruby/build/trunk' I, [2024-05-06T15:47:51.661125 #726151] INFO -- : generating makefiles ext/configure-ext.mk I, [2024-05-06T15:47:51.688457 #726151] INFO -- : ext/configure-ext.mk updated I, [2024-05-06T15:47:51.690755 #726151] INFO -- : make[1]: Entering directory '/tmp/ruby/build/trunk' I, [2024-05-06T15:47:53.052197 #726151] INFO -- : make[1]: Leaving directory '/tmp/ruby/build/trunk' I, [2024-05-06T15:47:53.052751 #726151] INFO -- : generating makefile exts.mk I, [2024-05-06T15:47:53.089546 #726151] INFO -- : exts.mk unchanged I, [2024-05-06T15:47:53.093982 #726151] INFO -- : make[1]: Entering directory '/tmp/ruby/build/trunk' I, [2024-05-06T15:47:53.303949 #726151] INFO -- : make[2]: Entering directory '/tmp/ruby/build/trunk/ext/coverage' I, [2024-05-06T15:47:53.306764 #726151] INFO -- : make[2]: Leaving directory '/tmp/ruby/build/trunk/ext/coverage' I, [2024-05-06T15:47:53.310539 #726151] INFO -- : make[2]: Entering directory '/tmp/ruby/build/trunk/ext/date' I, [2024-05-06T15:47:53.313709 #726151] INFO -- : make[2]: Leaving directory '/tmp/ruby/build/trunk/ext/date' I, [2024-05-06T15:47:53.316028 #726151] INFO -- : make[2]: Entering directory '/tmp/ruby/build/trunk/ext/digest' I, [2024-05-06T15:47:53.321420 #726151] INFO -- : make[2]: Leaving directory '/tmp/ruby/build/trunk/ext/digest' I, [2024-05-06T15:47:53.336917 #726151] INFO -- : make[2]: Entering directory '/tmp/ruby/build/trunk/ext/digest/sha2' I, [2024-05-06T15:47:53.339920 #726151] INFO -- : make[2]: Leaving directory '/tmp/ruby/build/trunk/ext/digest/sha2' I, [2024-05-06T15:47:53.352713 #726151] INFO -- : make[2]: Entering directory '/tmp/ruby/build/trunk/ext/fiddle' I, [2024-05-06T15:47:53.359082 #726151] INFO -- : make[2]: Leaving directory '/tmp/ruby/build/trunk/ext/fiddle' I, [2024-05-06T15:47:53.362020 #726151] INFO -- : make[2]: Entering directory '/tmp/ruby/build/trunk/ext/io/console' I, [2024-05-06T15:47:53.364597 #726151] INFO -- : make[2]: Leaving directory '/tmp/ruby/build/trunk/ext/io/console' I, [2024-05-06T15:47:53.372308 #726151] INFO -- : make[2]: Entering directory '/tmp/ruby/build/trunk/ext/json' I, [2024-05-06T15:47:53.378466 #726151] INFO -- : make[2]: Leaving directory '/tmp/ruby/build/trunk/ext/json' I, [2024-05-06T15:47:53.387561 #726151] INFO -- : make[2]: Entering directory '/tmp/ruby/build/trunk/ext/monitor' I, [2024-05-06T15:47:53.390062 #726151] INFO -- : make[2]: Leaving directory '/tmp/ruby/build/trunk/ext/monitor' I, [2024-05-06T15:47:53.394254 #726151] INFO -- : make[2]: Entering directory '/tmp/ruby/build/trunk/ext/objspace' I, [2024-05-06T15:47:53.398065 #726151] INFO -- : make[2]: Leaving directory '/tmp/ruby/build/trunk/ext/objspace' I, [2024-05-06T15:47:53.410050 #726151] INFO -- : make[2]: Entering directory '/tmp/ruby/build/trunk/ext/openssl' I, [2024-05-06T15:47:53.423158 #726151] INFO -- : make[2]: Leaving directory '/tmp/ruby/build/trunk/ext/openssl' I, [2024-05-06T15:47:53.426103 #726151] INFO -- : make[2]: Entering directory '/tmp/ruby/build/trunk/ext/pathname' I, [2024-05-06T15:47:53.428621 #726151] INFO -- : make[2]: Leaving directory '/tmp/ruby/build/trunk/ext/pathname' I, [2024-05-06T15:47:53.432957 #726151] INFO -- : make[2]: Entering directory '/tmp/ruby/build/trunk/ext/psych' I, [2024-05-06T15:47:53.447750 #726151] INFO -- : make[2]: Leaving directory '/tmp/ruby/build/trunk/ext/psych' I, [2024-05-06T15:47:53.450815 #726151] INFO -- : make[2]: Entering directory '/tmp/ruby/build/trunk/ext/pty' I, [2024-05-06T15:47:53.453492 #726151] INFO -- : make[2]: Leaving directory '/tmp/ruby/build/trunk/ext/pty' I, [2024-05-06T15:47:53.463075 #726151] INFO -- : make[2]: Entering directory '/tmp/ruby/build/trunk/ext/ripper' I, [2024-05-06T15:47:53.468049 #726151] INFO -- : make[2]: Leaving directory '/tmp/ruby/build/trunk/ext/ripper' I, [2024-05-06T15:47:53.469466 #726151] INFO -- : make[2]: Entering directory '/tmp/ruby/build/trunk/ext/rubyvm' I, [2024-05-06T15:47:53.471515 #726151] INFO -- : make[2]: Leaving directory '/tmp/ruby/build/trunk/ext/rubyvm' I, [2024-05-06T15:47:53.479313 #726151] INFO -- : make[2]: Entering directory '/tmp/ruby/build/trunk/ext/socket' I, [2024-05-06T15:47:53.485771 #726151] INFO -- : make[2]: Leaving directory '/tmp/ruby/build/trunk/ext/socket' I, [2024-05-06T15:47:53.496705 #726151] INFO -- : make[2]: Entering directory '/tmp/ruby/build/trunk/.bundle/gems/bigdecimal-3.1.7/ext/bigdecimal' I, [2024-05-06T15:47:53.519367 #726151] INFO -- : make[2]: Leaving directory '/tmp/ruby/build/trunk/.bundle/gems/bigdecimal-3.1.7/ext/bigdecimal' I, [2024-05-06T15:47:53.521331 #726151] INFO -- : make[2]: Entering directory '/tmp/ruby/build/trunk/.bundle/gems/debug-1.9.2/ext/debug' I, [2024-05-06T15:47:53.543383 #726151] INFO -- : make[2]: Leaving directory '/tmp/ruby/build/trunk/.bundle/gems/debug-1.9.2/ext/debug' I, [2024-05-06T15:47:53.545464 #726151] INFO -- : make[2]: Entering directory '/tmp/ruby/build/trunk/.bundle/gems/nkf-0.2.0/ext/nkf' I, [2024-05-06T15:47:53.566767 #726151] INFO -- : make[2]: Leaving directory '/tmp/ruby/build/trunk/.bundle/gems/nkf-0.2.0/ext/nkf' I, [2024-05-06T15:47:53.568959 #726151] INFO -- : make[2]: Entering directory '/tmp/ruby/build/trunk/.bundle/gems/racc-1.7.3/ext/racc/cparse' I, [2024-05-06T15:47:53.590278 #726151] INFO -- : make[2]: Leaving directory '/tmp/ruby/build/trunk/.bundle/gems/racc-1.7.3/ext/racc/cparse' I, [2024-05-06T15:47:53.592614 #726151] INFO -- : make[2]: Entering directory '/tmp/ruby/build/trunk/.bundle/gems/rbs-3.4.4/ext/rbs_extension' I, [2024-05-06T15:47:53.614716 #726151] INFO -- : make[2]: Leaving directory '/tmp/ruby/build/trunk/.bundle/gems/rbs-3.4.4/ext/rbs_extension' I, [2024-05-06T15:47:53.616659 #726151] INFO -- : make[2]: Entering directory '/tmp/ruby/build/trunk/.bundle/gems/syslog-0.1.2/ext/syslog' I, [2024-05-06T15:47:53.638159 #726151] INFO -- : make[2]: Leaving directory '/tmp/ruby/build/trunk/.bundle/gems/syslog-0.1.2/ext/syslog' I, [2024-05-06T15:47:53.661575 #726151] INFO -- : make[2]: Entering directory '/tmp/ruby/build/trunk' I, [2024-05-06T15:47:53.725837 #726151] INFO -- : make[2]: 'ruby' is up to date. I, [2024-05-06T15:47:53.725901 #726151] INFO -- : make[2]: Leaving directory '/tmp/ruby/build/trunk' I, [2024-05-06T15:47:53.726196 #726151] INFO -- : make[1]: Leaving directory '/tmp/ruby/build/trunk' I, [2024-05-06T15:47:53.730259 #726151] INFO -- : make[1]: Entering directory '/tmp/ruby/build/trunk' I, [2024-05-06T15:47:53.730319 #726151] INFO -- : make[1]: Nothing to be done for 'note'. I, [2024-05-06T15:47:53.730333 #726151] INFO -- : make[1]: Leaving directory '/tmp/ruby/build/trunk' E, [2024-05-06T15:47:53.787649 #726151] ERROR -- : $ /tmp/ruby/build/trunk/miniruby -I/tmp/ruby/src/trunk/lib /tmp/ruby/src/trunk/tool/runruby.rb --archdir=/tmp/ruby/build/trunk --extout=.ext -- /tmp/ruby/src/trunk/spec/mspec/bin/mspec-run -B /tmp/ruby/src/trunk/spec/default.mspec --error-output stderr --debug -fy -o /tmp/rubytest.px0va0/1-mspec-multi-0 E, [2024-05-06T15:47:53.787872 #726151] ERROR -- : $ /tmp/ruby/build/trunk/miniruby -I/tmp/ruby/src/trunk/lib /tmp/ruby/src/trunk/tool/runruby.rb --archdir=/tmp/ruby/build/trunk --extout=.ext -- /tmp/ruby/src/trunk/spec/mspec/bin/mspec-run -B /tmp/ruby/src/trunk/spec/default.mspec --error-output stderr --debug -fy -o /tmp/rubytest.px0va0/2-mspec-multi-1 E, [2024-05-06T15:47:53.788094 #726151] ERROR -- : $ /tmp/ruby/build/trunk/miniruby -I/tmp/ruby/src/trunk/lib /tmp/ruby/src/trunk/tool/runruby.rb --archdir=/tmp/ruby/build/trunk --extout=.ext -- /tmp/ruby/src/trunk/spec/mspec/bin/mspec-run -B /tmp/ruby/src/trunk/spec/default.mspec --error-output stderr --debug -fy -o /tmp/rubytest.px0va0/3-mspec-multi-2 E, [2024-05-06T15:47:53.788455 #726151] ERROR -- : $ /tmp/ruby/build/trunk/miniruby -I/tmp/ruby/src/trunk/lib /tmp/ruby/src/trunk/tool/runruby.rb --archdir=/tmp/ruby/build/trunk --extout=.ext -- /tmp/ruby/src/trunk/spec/mspec/bin/mspec-run -B /tmp/ruby/src/trunk/spec/default.mspec --error-output stderr --debug -fy -o /tmp/rubytest.px0va0/4-mspec-multi-3 E, [2024-05-06T15:47:53.788571 #726151] ERROR -- : $ /tmp/ruby/build/trunk/miniruby -I/tmp/ruby/src/trunk/lib /tmp/ruby/src/trunk/tool/runruby.rb --archdir=/tmp/ruby/build/trunk --extout=.ext -- /tmp/ruby/src/trunk/spec/mspec/bin/mspec-run -B /tmp/ruby/src/trunk/spec/default.mspec --error-output stderr --debug -fy -o /tmp/rubytest.px0va0/5-mspec-multi-4 E, [2024-05-06T15:47:53.788734 #726151] ERROR -- : $ /tmp/ruby/build/trunk/miniruby -I/tmp/ruby/src/trunk/lib /tmp/ruby/src/trunk/tool/runruby.rb --archdir=/tmp/ruby/build/trunk --extout=.ext -- /tmp/ruby/src/trunk/spec/mspec/bin/mspec-run -B /tmp/ruby/src/trunk/spec/default.mspec --error-output stderr --debug -fy -o /tmp/rubytest.px0va0/6-mspec-multi-5 E, [2024-05-06T15:47:53.788885 #726151] ERROR -- : $ /tmp/ruby/build/trunk/miniruby -I/tmp/ruby/src/trunk/lib /tmp/ruby/src/trunk/tool/runruby.rb --archdir=/tmp/ruby/build/trunk --extout=.ext -- /tmp/ruby/src/trunk/spec/mspec/bin/mspec-run -B /tmp/ruby/src/trunk/spec/default.mspec --error-output stderr --debug -fy -o /tmp/rubytest.px0va0/7-mspec-multi-6 E, [2024-05-06T15:47:53.789092 #726151] ERROR -- : $ /tmp/ruby/build/trunk/miniruby -I/tmp/ruby/src/trunk/lib /tmp/ruby/src/trunk/tool/runruby.rb --archdir=/tmp/ruby/build/trunk --extout=.ext -- /tmp/ruby/src/trunk/spec/mspec/bin/mspec-run -B /tmp/ruby/src/trunk/spec/default.mspec --error-output stderr --debug -fy -o /tmp/rubytest.px0va0/8-mspec-multi-7 E, [2024-05-06T15:47:53.789281 #726151] ERROR -- : $ /tmp/ruby/build/trunk/miniruby -I/tmp/ruby/src/trunk/lib /tmp/ruby/src/trunk/tool/runruby.rb --archdir=/tmp/ruby/build/trunk --extout=.ext -- /tmp/ruby/src/trunk/spec/mspec/bin/mspec-run -B /tmp/ruby/src/trunk/spec/default.mspec --error-output stderr --debug -fy -o /tmp/rubytest.px0va0/9-mspec-multi-8 E, [2024-05-06T15:47:53.789599 #726151] ERROR -- : $ /tmp/ruby/build/trunk/miniruby -I/tmp/ruby/src/trunk/lib /tmp/ruby/src/trunk/tool/runruby.rb --archdir=/tmp/ruby/build/trunk --extout=.ext -- /tmp/ruby/src/trunk/spec/mspec/bin/mspec-run -B /tmp/ruby/src/trunk/spec/default.mspec --error-output stderr --debug -fy -o /tmp/rubytest.px0va0/10-mspec-multi-9 E, [2024-05-06T15:47:53.789755 #726151] ERROR -- : $ /tmp/ruby/build/trunk/miniruby -I/tmp/ruby/src/trunk/lib /tmp/ruby/src/trunk/tool/runruby.rb --archdir=/tmp/ruby/build/trunk --extout=.ext -- /tmp/ruby/src/trunk/spec/mspec/bin/mspec-run -B /tmp/ruby/src/trunk/spec/default.mspec --error-output stderr --debug -fy -o /tmp/rubytest.px0va0/11-mspec-multi-10 E, [2024-05-06T15:47:53.790001 #726151] ERROR -- : $ /tmp/ruby/build/trunk/miniruby -I/tmp/ruby/src/trunk/lib /tmp/ruby/src/trunk/tool/runruby.rb --archdir=/tmp/ruby/build/trunk --extout=.ext -- /tmp/ruby/src/trunk/spec/mspec/bin/mspec-run -B /tmp/ruby/src/trunk/spec/default.mspec --error-output stderr --debug -fy -o /tmp/rubytest.px0va0/12-mspec-multi-11 E, [2024-05-06T15:47:53.790238 #726151] ERROR -- : $ /tmp/ruby/build/trunk/miniruby -I/tmp/ruby/src/trunk/lib /tmp/ruby/src/trunk/tool/runruby.rb --archdir=/tmp/ruby/build/trunk --extout=.ext -- /tmp/ruby/src/trunk/spec/mspec/bin/mspec-run -B /tmp/ruby/src/trunk/spec/default.mspec --error-output stderr --debug -fy -o /tmp/rubytest.px0va0/13-mspec-multi-12 E, [2024-05-06T15:47:53.790418 #726151] ERROR -- : $ /tmp/ruby/build/trunk/miniruby -I/tmp/ruby/src/trunk/lib /tmp/ruby/src/trunk/tool/runruby.rb --archdir=/tmp/ruby/build/trunk --extout=.ext -- /tmp/ruby/src/trunk/spec/mspec/bin/mspec-run -B /tmp/ruby/src/trunk/spec/default.mspec --error-output stderr --debug -fy -o /tmp/rubytest.px0va0/14-mspec-multi-13 E, [2024-05-06T15:47:53.790630 #726151] ERROR -- : $ /tmp/ruby/build/trunk/miniruby -I/tmp/ruby/src/trunk/lib /tmp/ruby/src/trunk/tool/runruby.rb --archdir=/tmp/ruby/build/trunk --extout=.ext -- /tmp/ruby/src/trunk/spec/mspec/bin/mspec-run -B /tmp/ruby/src/trunk/spec/default.mspec --error-output stderr --debug -fy -o /tmp/rubytest.px0va0/15-mspec-multi-14 E, [2024-05-06T15:47:53.790799 #726151] ERROR -- : $ /tmp/ruby/build/trunk/miniruby -I/tmp/ruby/src/trunk/lib /tmp/ruby/src/trunk/tool/runruby.rb --archdir=/tmp/ruby/build/trunk --extout=.ext -- /tmp/ruby/src/trunk/spec/mspec/bin/mspec-run -B /tmp/ruby/src/trunk/spec/default.mspec --error-output stderr --debug -fy -o /tmp/rubytest.px0va0/16-mspec-multi-15 E, [2024-05-06T15:47:53.790974 #726151] ERROR -- : $ /tmp/ruby/build/trunk/miniruby -I/tmp/ruby/src/trunk/lib /tmp/ruby/src/trunk/tool/runruby.rb --archdir=/tmp/ruby/build/trunk --extout=.ext -- /tmp/ruby/src/trunk/spec/mspec/bin/mspec-run -B /tmp/ruby/src/trunk/spec/default.mspec --error-output stderr --debug -fy -o /tmp/rubytest.px0va0/17-mspec-multi-16 E, [2024-05-06T15:47:53.791111 #726151] ERROR -- : $ /tmp/ruby/build/trunk/miniruby -I/tmp/ruby/src/trunk/lib /tmp/ruby/src/trunk/tool/runruby.rb --archdir=/tmp/ruby/build/trunk --extout=.ext -- /tmp/ruby/src/trunk/spec/mspec/bin/mspec-run -B /tmp/ruby/src/trunk/spec/default.mspec --error-output stderr --debug -fy -o /tmp/rubytest.px0va0/18-mspec-multi-17 E, [2024-05-06T15:47:53.793224 #726151] ERROR -- : $ /tmp/ruby/build/trunk/miniruby -I/tmp/ruby/src/trunk/lib /tmp/ruby/src/trunk/tool/runruby.rb --archdir=/tmp/ruby/build/trunk --extout=.ext -- /tmp/ruby/src/trunk/spec/mspec/bin/mspec-run -B /tmp/ruby/src/trunk/spec/default.mspec --error-output stderr --debug -fy -o /tmp/rubytest.px0va0/19-mspec-multi-18 E, [2024-05-06T15:47:53.793703 #726151] ERROR -- : $ /tmp/ruby/build/trunk/miniruby -I/tmp/ruby/src/trunk/lib /tmp/ruby/src/trunk/tool/runruby.rb --archdir=/tmp/ruby/build/trunk --extout=.ext -- /tmp/ruby/src/trunk/spec/mspec/bin/mspec-run -B /tmp/ruby/src/trunk/spec/default.mspec --error-output stderr --debug -fy -o /tmp/rubytest.px0va0/20-mspec-multi-19 I, [2024-05-06T15:47:53.979882 #726151] INFO -- : ruby 3.4.0dev (2024-05-06T15:12:30Z master 14d400829d) [x86_64-linux] I, [2024-05-06T15:47:54.630021 #726151] INFO -- : 0 ......................................................................... I, [2024-05-06T15:47:55.064545 #726151] INFO -- : 73 ......................................................................... I, [2024-05-06T15:47:55.209508 #726151] INFO -- : 146 ......................................................................... I, [2024-05-06T15:47:55.249362 #726151] INFO -- : 219 ......................................................................... I, [2024-05-06T15:47:55.298064 #726151] INFO -- : 292 ......................................................................... I, [2024-05-06T15:47:55.348529 #726151] INFO -- : 365 ......................................................................... I, [2024-05-06T15:47:55.371761 #726151] INFO -- : 438 ......................................................................... I, [2024-05-06T15:47:55.391149 #726151] INFO -- : 511 ......................................................................... I, [2024-05-06T15:47:55.408783 #726151] INFO -- : 584 ......................................................................... I, [2024-05-06T15:47:55.462862 #726151] INFO -- : 657 ......................................................................... I, [2024-05-06T15:47:55.490773 #726151] INFO -- : 730 ......................................................................... I, [2024-05-06T15:47:55.514642 #726151] INFO -- : 803 ......................................................................... I, [2024-05-06T15:47:55.545386 #726151] INFO -- : 876 ......................................................................... I, [2024-05-06T15:47:55.595761 #726151] INFO -- : 949 ......................................................................... I, [2024-05-06T15:47:55.701274 #726151] INFO -- : 1022 ......................................................................... I, [2024-05-06T15:47:55.847576 #726151] INFO -- : 1095 ......................................................................... I, [2024-05-06T15:47:55.970271 #726151] INFO -- : 1168 ......................................................................... I, [2024-05-06T15:47:56.034770 #726151] INFO -- : 1241 ......................................................................... I, [2024-05-06T15:47:56.083698 #726151] INFO -- : 1314 ......................................................................... I, [2024-05-06T15:47:56.100301 #726151] INFO -- : 1387 ......................................................................... I, [2024-05-06T15:47:56.211762 #726151] INFO -- : 1460 ......................................................................... I, [2024-05-06T15:47:56.692261 #726151] INFO -- : 1533 ......................................................................... I, [2024-05-06T15:47:56.755346 #726151] INFO -- : 1606 ......................................................................... I, [2024-05-06T15:47:56.855608 #726151] INFO -- : 1679 ......................................................................... I, [2024-05-06T15:47:56.954098 #726151] INFO -- : 1752 ......................................................................... I, [2024-05-06T15:47:57.058715 #726151] INFO -- : 1825 ......................................................................... I, [2024-05-06T15:47:57.156514 #726151] INFO -- : 1898 ......................................................................... I, [2024-05-06T15:47:57.236517 #726151] INFO -- : 1971 ......................................................................... I, [2024-05-06T15:47:57.311266 #726151] INFO -- : 2044 ......................................................................... I, [2024-05-06T15:47:57.366011 #726151] INFO -- : 2117 ......................................................................... I, [2024-05-06T15:47:57.380421 #726151] INFO -- : 2190 ......................................................................... I, [2024-05-06T15:47:57.399475 #726151] INFO -- : 2263 ......................................................................... I, [2024-05-06T15:47:57.413360 #726151] INFO -- : 2336 ......................................................................... I, [2024-05-06T15:47:57.454877 #726151] INFO -- : 2409 ......................................................................... I, [2024-05-06T15:47:57.566113 #726151] INFO -- : 2482 ......................................................................... I, [2024-05-06T15:47:57.590233 #726151] INFO -- : 2555 ......................................................................... I, [2024-05-06T15:47:57.695006 #726151] INFO -- : 2628 ......................................................................... I, [2024-05-06T15:47:57.797523 #726151] INFO -- : 2701 ......................................................................... I, [2024-05-06T15:47:57.829782 #726151] INFO -- : 2774 ......................................................................... I, [2024-05-06T15:47:57.894925 #726151] INFO -- : 2847 ......................................................................... I, [2024-05-06T15:47:57.931437 #726151] INFO -- : 2920 ......................................................................... I, [2024-05-06T15:47:57.959027 #726151] INFO -- : 2993 ......................................................................... I, [2024-05-06T15:47:57.982568 #726151] INFO -- : 3066 ......................................................................... I, [2024-05-06T15:47:57.996421 #726151] INFO -- : 3139 ......................................................................... I, [2024-05-06T15:47:58.011987 #726151] INFO -- : 3212 ......................................................................... I, [2024-05-06T15:47:58.044204 #726151] INFO -- : 3285 ......................................................................... I, [2024-05-06T15:48:02.007531 #726151] INFO -- : 3358 ........................................................................ I, [2024-05-06T15:48:02.007597 #726151] INFO -- : I, [2024-05-06T15:48:02.007604 #726151] INFO -- : Finished in 8.217317 seconds I, [2024-05-06T15:48:02.007609 #726151] INFO -- : I, [2024-05-06T15:48:02.007614 #726151] INFO -- : 3429 files, 32610 examples, 187112 expectations, 0 failures, 0 errors, 0 tagged I, [2024-05-06T15:48:02.010960 #726151] INFO -- : $$$[end] "make yes-test-rubyspec MSPECOPT='--error-output stderr --debug -j' TESTS='-j20'" exit with 0.