# Logfile created on 2024-05-05 22:08:16 +0000 by logger.rb/v1.4.3 I, [2024-05-05T22:08:16.353210 #4159776] INFO -- : #, @formatter=nil, @logdev=#, @binmode=false, @mon_data=#, @mon_data_owner_object_id=860>>> I, [2024-05-05T22:08:16.353333 #4159776] INFO -- : $$$[beg] make update-unicode -j20 I, [2024-05-05T22:08:16.411419 #4159776] INFO -- : Downloading Unicode emoji 15.0 files... I, [2024-05-05T22:08:16.411631 #4159776] INFO -- : Downloading Unicode emoji 15.0 files... I, [2024-05-05T22:08:16.412090 #4159776] INFO -- : Downloading Unicode emoji 15.0 files... I, [2024-05-05T22:08:16.453111 #4159776] INFO -- : made symlink emoji/15.0/emoji-sequences.txt to /tmp/ruby/src/trunk/.downloaded-cache/emoji/15.0/emoji-sequences.txt I, [2024-05-05T22:08:16.453149 #4159776] INFO -- : downloading emoji/15.0/emoji-sequences.txt ... downloading emoji/15.0/emoji-test.txt ... /tmp/ruby/src/trunk/enc/unicode/data/emoji/15.0/emoji-sequences.txt already exists E, [2024-05-05T22:08:16.911939 #4159776] ERROR -- : /tmp/ruby/src/trunk/tool/downloader.rb:302:in `rescue in download': failed to download emoji/15.0/emoji-test.txt (RuntimeError) E, [2024-05-05T22:08:16.911981 #4159776] ERROR -- : OpenURI::HTTPError: 403 Forbidden: https://www.unicode.org/Public/emoji/15.0/emoji-test.txt E, [2024-05-05T22:08:16.911992 #4159776] ERROR -- : from /tmp/ruby/src/trunk/tool/downloader.rb:201:in `download' E, [2024-05-05T22:08:16.911998 #4159776] ERROR -- : from /tmp/ruby/src/trunk/tool/downloader.rb:136:in `download' E, [2024-05-05T22:08:16.912004 #4159776] ERROR -- : from /tmp/ruby/src/trunk/tool/downloader.rb:482:in `block in
' E, [2024-05-05T22:08:16.912010 #4159776] ERROR -- : from /tmp/ruby/src/trunk/tool/downloader.rb:465:in `each' E, [2024-05-05T22:08:16.912016 #4159776] ERROR -- : from /tmp/ruby/src/trunk/tool/downloader.rb:465:in `
' E, [2024-05-05T22:08:16.912021 #4159776] ERROR -- : /usr/lib/ruby/3.0.0/open-uri.rb:364:in `open_http': 403 Forbidden (OpenURI::HTTPError) E, [2024-05-05T22:08:16.912027 #4159776] ERROR -- : from /usr/lib/ruby/3.0.0/open-uri.rb:741:in `buffer_open' E, [2024-05-05T22:08:16.912034 #4159776] ERROR -- : from /usr/lib/ruby/3.0.0/open-uri.rb:212:in `block in open_loop' E, [2024-05-05T22:08:16.912040 #4159776] ERROR -- : from /usr/lib/ruby/3.0.0/open-uri.rb:210:in `catch' E, [2024-05-05T22:08:16.912045 #4159776] ERROR -- : from /usr/lib/ruby/3.0.0/open-uri.rb:210:in `open_loop' E, [2024-05-05T22:08:16.912051 #4159776] ERROR -- : from /usr/lib/ruby/3.0.0/open-uri.rb:151:in `open_uri' E, [2024-05-05T22:08:16.912056 #4159776] ERROR -- : from /usr/lib/ruby/3.0.0/open-uri.rb:721:in `open' E, [2024-05-05T22:08:16.912062 #4159776] ERROR -- : from /usr/lib/ruby/3.0.0/open-uri.rb:729:in `read' E, [2024-05-05T22:08:16.912068 #4159776] ERROR -- : from /tmp/ruby/src/trunk/tool/downloader.rb:247:in `block in download' E, [2024-05-05T22:08:16.912083 #4159776] ERROR -- : from /tmp/ruby/src/trunk/tool/downloader.rb:378:in `with_retry' E, [2024-05-05T22:08:16.912090 #4159776] ERROR -- : from /tmp/ruby/src/trunk/tool/downloader.rb:246:in `download' E, [2024-05-05T22:08:16.912096 #4159776] ERROR -- : from /tmp/ruby/src/trunk/tool/downloader.rb:136:in `download' E, [2024-05-05T22:08:16.912102 #4159776] ERROR -- : from /tmp/ruby/src/trunk/tool/downloader.rb:482:in `block in
' E, [2024-05-05T22:08:16.912108 #4159776] ERROR -- : from /tmp/ruby/src/trunk/tool/downloader.rb:465:in `each' E, [2024-05-05T22:08:16.912113 #4159776] ERROR -- : from /tmp/ruby/src/trunk/tool/downloader.rb:465:in `
' E, [2024-05-05T22:08:16.914308 #4159776] ERROR -- : make: *** [uncommon.mk:1787: /tmp/ruby/src/trunk/enc/unicode/data/emoji/15.0/emoji-sequences.txt] Error 1 E, [2024-05-05T22:08:16.914328 #4159776] ERROR -- : make: *** Deleting file '/tmp/ruby/src/trunk/enc/unicode/data/emoji/15.0/emoji-sequences.txt' E, [2024-05-05T22:08:16.914334 #4159776] ERROR -- : make: *** Waiting for unfinished jobs.... E, [2024-05-05T22:08:16.918708 #4159776] ERROR -- : /tmp/ruby/src/trunk/tool/downloader.rb:302:in `rescue in download': failed to download emoji/15.0/emoji-test.txt (RuntimeError) E, [2024-05-05T22:08:16.918729 #4159776] ERROR -- : OpenURI::HTTPError: 403 Forbidden: https://www.unicode.org/Public/emoji/15.0/emoji-test.txt E, [2024-05-05T22:08:16.918735 #4159776] ERROR -- : from /tmp/ruby/src/trunk/tool/downloader.rb:201:in `download' E, [2024-05-05T22:08:16.918739 #4159776] ERROR -- : from /tmp/ruby/src/trunk/tool/downloader.rb:136:in `download' E, [2024-05-05T22:08:16.918742 #4159776] ERROR -- : from /tmp/ruby/src/trunk/tool/downloader.rb:482:in `block in
' E, [2024-05-05T22:08:16.918746 #4159776] ERROR -- : from /tmp/ruby/src/trunk/tool/downloader.rb:465:in `each' E, [2024-05-05T22:08:16.918749 #4159776] ERROR -- : from /tmp/ruby/src/trunk/tool/downloader.rb:465:in `
' E, [2024-05-05T22:08:16.918754 #4159776] ERROR -- : /usr/lib/ruby/3.0.0/open-uri.rb:364:in `open_http': 403 Forbidden (OpenURI::HTTPError) E, [2024-05-05T22:08:16.918758 #4159776] ERROR -- : from /usr/lib/ruby/3.0.0/open-uri.rb:741:in `buffer_open' E, [2024-05-05T22:08:16.918761 #4159776] ERROR -- : from /usr/lib/ruby/3.0.0/open-uri.rb:212:in `block in open_loop' E, [2024-05-05T22:08:16.918765 #4159776] ERROR -- : from /usr/lib/ruby/3.0.0/open-uri.rb:210:in `catch' E, [2024-05-05T22:08:16.918768 #4159776] ERROR -- : from /usr/lib/ruby/3.0.0/open-uri.rb:210:in `open_loop' E, [2024-05-05T22:08:16.918771 #4159776] ERROR -- : from /usr/lib/ruby/3.0.0/open-uri.rb:151:in `open_uri' E, [2024-05-05T22:08:16.918775 #4159776] ERROR -- : from /usr/lib/ruby/3.0.0/open-uri.rb:721:in `open' E, [2024-05-05T22:08:16.918778 #4159776] ERROR -- : from /usr/lib/ruby/3.0.0/open-uri.rb:729:in `read' E, [2024-05-05T22:08:16.918782 #4159776] ERROR -- : from /tmp/ruby/src/trunk/tool/downloader.rb:247:in `block in download' E, [2024-05-05T22:08:16.918787 #4159776] ERROR -- : from /tmp/ruby/src/trunk/tool/downloader.rb:378:in `with_retry' E, [2024-05-05T22:08:16.918790 #4159776] ERROR -- : from /tmp/ruby/src/trunk/tool/downloader.rb:246:in `download' E, [2024-05-05T22:08:16.918793 #4159776] ERROR -- : from /tmp/ruby/src/trunk/tool/downloader.rb:136:in `download' E, [2024-05-05T22:08:16.918797 #4159776] ERROR -- : from /tmp/ruby/src/trunk/tool/downloader.rb:482:in `block in
' E, [2024-05-05T22:08:16.918800 #4159776] ERROR -- : from /tmp/ruby/src/trunk/tool/downloader.rb:465:in `each' E, [2024-05-05T22:08:16.918804 #4159776] ERROR -- : from /tmp/ruby/src/trunk/tool/downloader.rb:465:in `
' E, [2024-05-05T22:08:16.920397 #4159776] ERROR -- : make: *** [uncommon.mk:1787: /tmp/ruby/src/trunk/enc/unicode/data/emoji/15.0/emoji-zwj-sequences.txt] Error 1 E, [2024-05-05T22:08:17.364608 #4159776] ERROR -- : /tmp/ruby/src/trunk/tool/downloader.rb:302:in `rescue in download': failed to download emoji/15.0/emoji-sequences.txt (RuntimeError) E, [2024-05-05T22:08:17.364634 #4159776] ERROR -- : EOFError: end of file reached: https://www.unicode.org/Public/emoji/15.0/emoji-sequences.txt E, [2024-05-05T22:08:17.364640 #4159776] ERROR -- : from /tmp/ruby/src/trunk/tool/downloader.rb:201:in `download' E, [2024-05-05T22:08:17.364643 #4159776] ERROR -- : from /tmp/ruby/src/trunk/tool/downloader.rb:136:in `download' E, [2024-05-05T22:08:17.364647 #4159776] ERROR -- : from /tmp/ruby/src/trunk/tool/downloader.rb:482:in `block in
' E, [2024-05-05T22:08:17.364650 #4159776] ERROR -- : from /tmp/ruby/src/trunk/tool/downloader.rb:465:in `each' E, [2024-05-05T22:08:17.364654 #4159776] ERROR -- : from /tmp/ruby/src/trunk/tool/downloader.rb:465:in `
' E, [2024-05-05T22:08:17.364657 #4159776] ERROR -- : /usr/lib/ruby/3.0.0/net/protocol.rb:227:in `rbuf_fill': end of file reached (EOFError) E, [2024-05-05T22:08:17.364662 #4159776] ERROR -- : from /usr/lib/ruby/3.0.0/net/protocol.rb:193:in `readuntil' E, [2024-05-05T22:08:17.364665 #4159776] ERROR -- : from /usr/lib/ruby/3.0.0/net/protocol.rb:203:in `readline' E, [2024-05-05T22:08:17.364669 #4159776] ERROR -- : from /usr/lib/ruby/3.0.0/net/http/response.rb:42:in `read_status_line' E, [2024-05-05T22:08:17.364672 #4159776] ERROR -- : from /usr/lib/ruby/3.0.0/net/http/response.rb:31:in `read_new' E, [2024-05-05T22:08:17.364676 #4159776] ERROR -- : from /usr/lib/ruby/3.0.0/net/http.rb:1557:in `block in transport_request' E, [2024-05-05T22:08:17.364679 #4159776] ERROR -- : from /usr/lib/ruby/3.0.0/net/http.rb:1548:in `catch' E, [2024-05-05T22:08:17.364762 #4159776] ERROR -- : from /usr/lib/ruby/3.0.0/net/http.rb:1548:in `transport_request' E, [2024-05-05T22:08:17.364765 #4159776] ERROR -- : from /usr/lib/ruby/3.0.0/net/http.rb:1521:in `request' E, [2024-05-05T22:08:17.364769 #4159776] ERROR -- : from /usr/lib/ruby/3.0.0/open-uri.rb:329:in `block in open_http' E, [2024-05-05T22:08:17.364772 #4159776] ERROR -- : from /usr/lib/ruby/3.0.0/net/http.rb:960:in `start' E, [2024-05-05T22:08:17.364775 #4159776] ERROR -- : from /usr/lib/ruby/3.0.0/open-uri.rb:323:in `open_http' E, [2024-05-05T22:08:17.364779 #4159776] ERROR -- : from /usr/lib/ruby/3.0.0/open-uri.rb:741:in `buffer_open' E, [2024-05-05T22:08:17.364783 #4159776] ERROR -- : from /usr/lib/ruby/3.0.0/open-uri.rb:212:in `block in open_loop' E, [2024-05-05T22:08:17.364787 #4159776] ERROR -- : from /usr/lib/ruby/3.0.0/open-uri.rb:210:in `catch' E, [2024-05-05T22:08:17.364790 #4159776] ERROR -- : from /usr/lib/ruby/3.0.0/open-uri.rb:210:in `open_loop' E, [2024-05-05T22:08:17.364793 #4159776] ERROR -- : from /usr/lib/ruby/3.0.0/open-uri.rb:151:in `open_uri' E, [2024-05-05T22:08:17.364797 #4159776] ERROR -- : from /usr/lib/ruby/3.0.0/open-uri.rb:721:in `open' E, [2024-05-05T22:08:17.364800 #4159776] ERROR -- : from /usr/lib/ruby/3.0.0/open-uri.rb:729:in `read' E, [2024-05-05T22:08:17.364803 #4159776] ERROR -- : from /tmp/ruby/src/trunk/tool/downloader.rb:247:in `block in download' E, [2024-05-05T22:08:17.364807 #4159776] ERROR -- : from /tmp/ruby/src/trunk/tool/downloader.rb:378:in `with_retry' E, [2024-05-05T22:08:17.364810 #4159776] ERROR -- : from /tmp/ruby/src/trunk/tool/downloader.rb:246:in `download' E, [2024-05-05T22:08:17.364815 #4159776] ERROR -- : from /tmp/ruby/src/trunk/tool/downloader.rb:136:in `download' E, [2024-05-05T22:08:17.364818 #4159776] ERROR -- : from /tmp/ruby/src/trunk/tool/downloader.rb:482:in `block in
' E, [2024-05-05T22:08:17.364822 #4159776] ERROR -- : from /tmp/ruby/src/trunk/tool/downloader.rb:465:in `each' E, [2024-05-05T22:08:17.364825 #4159776] ERROR -- : from /tmp/ruby/src/trunk/tool/downloader.rb:465:in `
' I, [2024-05-05T22:08:17.366902 #4159776] INFO -- : downloading emoji/15.0/emoji-test.txt ... E, [2024-05-05T22:08:17.366981 #4159776] ERROR -- : make: *** [uncommon.mk:1787: /tmp/ruby/src/trunk/enc/unicode/data/emoji/15.0/emoji-test.txt] Error 1 I, [2024-05-05T22:08:17.367263 #4159776] INFO -- : $$$[end] "make update-unicode -j20" exit with 512. I, [2024-05-05T22:08:17.367289 #4159776] INFO -- : $$$[beg] make update-download -j20 I, [2024-05-05T22:08:17.465956 #4159776] INFO -- : tool/config.guess already exists I, [2024-05-05T22:08:17.466004 #4159776] INFO -- : tool/config.sub already exists I, [2024-05-05T22:08:17.468241 #4159776] INFO -- : Update minitest to ea9caafc0754b1d6236a490d59e624b53209734a I, [2024-05-05T22:08:17.468415 #4159776] INFO -- : Update power_assert to 84e85124c5014a139af39161d484156cfe87a9ed I, [2024-05-05T22:08:17.469146 #4159776] INFO -- : Update rbs to ba7872795d5de04adb8ff500c0e6afdc81a041dd I, [2024-05-05T22:08:17.469183 #4159776] INFO -- : Update typeprof to b19a6416da3a05d57fadd6ffdadb382b6d236ca5 I, [2024-05-05T22:08:17.469386 #4159776] INFO -- : echo ea9caafc0754b1d6236a490d59e624b53209734a | /bin/sh /tmp/ruby/src/trunk/tool/ifchange /tmp/ruby/src/trunk/.bundle/.timestamp/minitest.revision - I, [2024-05-05T22:08:17.469600 #4159776] INFO -- : echo 84e85124c5014a139af39161d484156cfe87a9ed | /bin/sh /tmp/ruby/src/trunk/tool/ifchange /tmp/ruby/src/trunk/.bundle/.timestamp/power_assert.revision - I, [2024-05-05T22:08:17.470172 #4159776] INFO -- : echo b19a6416da3a05d57fadd6ffdadb382b6d236ca5 | /bin/sh /tmp/ruby/src/trunk/tool/ifchange /tmp/ruby/src/trunk/.bundle/.timestamp/typeprof.revision - I, [2024-05-05T22:08:17.470478 #4159776] INFO -- : echo ba7872795d5de04adb8ff500c0e6afdc81a041dd | /bin/sh /tmp/ruby/src/trunk/tool/ifchange /tmp/ruby/src/trunk/.bundle/.timestamp/rbs.revision - I, [2024-05-05T22:08:17.471207 #4159776] INFO -- : /tmp/ruby/src/trunk/.bundle/.timestamp/minitest.revision unchanged I, [2024-05-05T22:08:17.471525 #4159776] INFO -- : /tmp/ruby/src/trunk/.bundle/.timestamp/power_assert.revision unchanged I, [2024-05-05T22:08:17.471964 #4159776] INFO -- : /tmp/ruby/src/trunk/.bundle/.timestamp/typeprof.revision unchanged I, [2024-05-05T22:08:17.472343 #4159776] INFO -- : /tmp/ruby/src/trunk/.bundle/.timestamp/rbs.revision unchanged I, [2024-05-05T22:08:17.472598 #4159776] INFO -- : Building power_assert@84e85124c5014a139af39161d484156cfe87a9ed to /tmp/ruby/src/trunk/gems/power_assert-2.0.3.gem I, [2024-05-05T22:08:17.541885 #4159776] INFO -- : Successfully built RubyGem I, [2024-05-05T22:08:17.541930 #4159776] INFO -- : Name: power_assert I, [2024-05-05T22:08:17.541939 #4159776] INFO -- : Version: 2.0.4dev I, [2024-05-05T22:08:17.541943 #4159776] INFO -- : File: power_assert-2.0.4dev.gem I, [2024-05-05T22:08:17.587536 #4159776] INFO -- : $$$[end] "make update-download -j20" exit with 0. I, [2024-05-05T22:08:17.587571 #4159776] INFO -- : $$$[beg] make update-rubyspec -j20 I, [2024-05-05T22:08:17.645196 #4159776] INFO -- : make: Nothing to be done for 'update-rubyspec'. I, [2024-05-05T22:08:17.645443 #4159776] INFO -- : $$$[end] "make update-rubyspec -j20" exit with 0. I, [2024-05-05T22:08:17.645477 #4159776] INFO -- : $$$[beg] make update-src -j20 I, [2024-05-05T22:08:18.169970 #4159776] INFO -- : Already up to date. I, [2024-05-05T22:08:18.179154 #4159776] INFO -- : Latest commit hash = 6747fbe77d I, [2024-05-05T22:08:18.180285 #4159776] INFO -- : $$$[end] "make update-src -j20" exit with 0. I, [2024-05-05T22:08:18.180312 #4159776] INFO -- : $$$[beg] make after-update -j20 I, [2024-05-05T22:08:18.249467 #4159776] INFO -- : generating /tmp/ruby/src/trunk/ext/ripper/eventids2table.c I, [2024-05-05T22:08:18.253728 #4159776] INFO -- : make[1]: Entering directory '/tmp/ruby/src/trunk/ext/ripper' I, [2024-05-05T22:08:18.253777 #4159776] INFO -- : make[1]: Nothing to be done for 'src'. I, [2024-05-05T22:08:18.253790 #4159776] INFO -- : make[1]: Leaving directory '/tmp/ruby/src/trunk/ext/ripper' I, [2024-05-05T22:08:18.269666 #4159776] INFO -- : /tmp/ruby/src/trunk/revision.h updated I, [2024-05-05T22:08:18.270831 #4159776] INFO -- : generating x86_64-linux-fake.rb I, [2024-05-05T22:08:18.321823 #4159776] INFO -- : x86_64-linux-fake.rb updated I, [2024-05-05T22:08:18.323274 #4159776] INFO -- : generating enc.mk I, [2024-05-05T22:08:18.440994 #4159776] INFO -- : making srcs under enc I, [2024-05-05T22:08:18.470754 #4159776] INFO -- : make[1]: Entering directory '/tmp/ruby/build/trunk' I, [2024-05-05T22:08:18.470829 #4159776] INFO -- : make[1]: Nothing to be done for 'srcs'. I, [2024-05-05T22:08:18.470843 #4159776] INFO -- : make[1]: Leaving directory '/tmp/ruby/build/trunk' I, [2024-05-05T22:08:18.515636 #4159776] INFO -- : Update minitest to ea9caafc0754b1d6236a490d59e624b53209734a I, [2024-05-05T22:08:18.515771 #4159776] INFO -- : Update power_assert to 84e85124c5014a139af39161d484156cfe87a9ed I, [2024-05-05T22:08:18.516000 #4159776] INFO -- : Update rbs to ba7872795d5de04adb8ff500c0e6afdc81a041dd I, [2024-05-05T22:08:18.516274 #4159776] INFO -- : Update typeprof to b19a6416da3a05d57fadd6ffdadb382b6d236ca5 I, [2024-05-05T22:08:18.516821 #4159776] INFO -- : echo ea9caafc0754b1d6236a490d59e624b53209734a | /bin/sh /tmp/ruby/src/trunk/tool/ifchange /tmp/ruby/src/trunk/.bundle/.timestamp/minitest.revision - I, [2024-05-05T22:08:18.516997 #4159776] INFO -- : echo 84e85124c5014a139af39161d484156cfe87a9ed | /bin/sh /tmp/ruby/src/trunk/tool/ifchange /tmp/ruby/src/trunk/.bundle/.timestamp/power_assert.revision - I, [2024-05-05T22:08:18.517751 #4159776] INFO -- : echo ba7872795d5de04adb8ff500c0e6afdc81a041dd | /bin/sh /tmp/ruby/src/trunk/tool/ifchange /tmp/ruby/src/trunk/.bundle/.timestamp/rbs.revision - I, [2024-05-05T22:08:18.518110 #4159776] INFO -- : echo b19a6416da3a05d57fadd6ffdadb382b6d236ca5 | /bin/sh /tmp/ruby/src/trunk/tool/ifchange /tmp/ruby/src/trunk/.bundle/.timestamp/typeprof.revision - I, [2024-05-05T22:08:18.518738 #4159776] INFO -- : /tmp/ruby/src/trunk/.bundle/.timestamp/minitest.revision unchanged I, [2024-05-05T22:08:18.518963 #4159776] INFO -- : /tmp/ruby/src/trunk/.bundle/.timestamp/power_assert.revision unchanged I, [2024-05-05T22:08:18.519865 #4159776] INFO -- : /tmp/ruby/src/trunk/.bundle/.timestamp/rbs.revision unchanged I, [2024-05-05T22:08:18.519889 #4159776] INFO -- : Building power_assert@84e85124c5014a139af39161d484156cfe87a9ed to /tmp/ruby/src/trunk/gems/power_assert-2.0.3.gem I, [2024-05-05T22:08:18.519904 #4159776] INFO -- : /tmp/ruby/src/trunk/.bundle/.timestamp/typeprof.revision unchanged I, [2024-05-05T22:08:18.590203 #4159776] INFO -- : Successfully built RubyGem I, [2024-05-05T22:08:18.590263 #4159776] INFO -- : Name: power_assert I, [2024-05-05T22:08:18.590276 #4159776] INFO -- : Version: 2.0.4dev I, [2024-05-05T22:08:18.590293 #4159776] INFO -- : File: power_assert-2.0.4dev.gem I, [2024-05-05T22:08:18.592497 #4159776] INFO -- : Extracting bundle gem power_assert-2.0.3... I, [2024-05-05T22:08:18.653272 #4159776] INFO -- : Try with hash version of bundled gems instead of gems/power_assert-2.0.3.gem. We don't use this gem with release version of Ruby. I, [2024-05-05T22:08:18.658237 #4159776] INFO -- : Unpacked gems/power_assert-2.0.4dev.gem I, [2024-05-05T22:08:18.659996 #4159776] INFO -- : $$$[end] "make after-update -j20" exit with 0. I, [2024-05-05T22:08:18.660164 #4159776] INFO -- : $$$[beg] make miniruby -j20 I, [2024-05-05T22:08:18.716894 #4159776] INFO -- : BASERUBY = /usr/bin/ruby --disable=gems I, [2024-05-05T22:08:18.716937 #4159776] INFO -- : CC = gcc I, [2024-05-05T22:08:18.716953 #4159776] INFO -- : LD = ld I, [2024-05-05T22:08:18.716967 #4159776] INFO -- : LDSHARED = gcc -shared I, [2024-05-05T22:08:18.716980 #4159776] INFO -- : CFLAGS = -O3 -fno-fast-math -ggdb3 -Wall -Wextra -Wdeprecated-declarations -Wdiv-by-zero -Wduplicated-cond -Wimplicit-function-declaration -Wimplicit-int -Wpointer-arith -Wwrite-strings -Wold-style-definition -Wimplicit-fallthrough=0 -Wmissing-noreturn -Wno-cast-function-type -Wno-constant-logical-operand -Wno-long-long -Wno-missing-field-initializers -Wno-overlength-strings -Wno-packed-bitfield-compat -Wno-parentheses-equality -Wno-self-assign -Wno-tautological-compare -Wno-unused-parameter -Wno-unused-value -Wsuggest-attribute=format -Wsuggest-attribute=noreturn -Wunused-variable -Wmisleading-indentation -Wundef -fPIC I, [2024-05-05T22:08:18.716993 #4159776] INFO -- : XCFLAGS = -U_FORTIFY_SOURCE -D_FORTIFY_SOURCE=2 -fstack-protector-strong -fno-strict-overflow -fvisibility=hidden -fexcess-precision=standard -DRUBY_EXPORT -I. -I.ext/include/x86_64-linux -I/tmp/ruby/src/trunk/include -I/tmp/ruby/src/trunk -I/tmp/ruby/src/trunk/prism -I/tmp/ruby/src/trunk/enc/unicode/15.0.0 I, [2024-05-05T22:08:18.717022 #4159776] INFO -- : CPPFLAGS = I, [2024-05-05T22:08:18.717035 #4159776] INFO -- : DLDFLAGS = -Wl,--compress-debug-sections=zlib -Wl,-soname,libruby.so.3.4 -fstack-protector-strong I, [2024-05-05T22:08:18.717048 #4159776] INFO -- : SOLIBS = -lz -lrt -lrt -lgmp -ldl -lcrypt -lm -lpthread I, [2024-05-05T22:08:18.717060 #4159776] INFO -- : LANG = en_US.UTF-8 I, [2024-05-05T22:08:18.717072 #4159776] INFO -- : LC_ALL = I, [2024-05-05T22:08:18.717084 #4159776] INFO -- : LC_CTYPE = I, [2024-05-05T22:08:18.717096 #4159776] INFO -- : MFLAGS = -j20 --jobserver-auth=4,5 I, [2024-05-05T22:08:18.717107 #4159776] INFO -- : RUSTC = no I, [2024-05-05T22:08:18.717119 #4159776] INFO -- : YJIT_RUSTC_ARGS = --crate-name=yjit --crate-type=staticlib --edition=2021 -g -C lto=thin -C opt-level=3 -C overflow-checks=on '--out-dir=/tmp/ruby/build/trunk/yjit/target/release/' /tmp/ruby/src/trunk/yjit/src/lib.rs I, [2024-05-05T22:08:18.718307 #4159776] INFO -- : gcc (Ubuntu 11.4.0-1ubuntu1~22.04) 11.4.0 I, [2024-05-05T22:08:18.718351 #4159776] INFO -- : Copyright (C) 2021 Free Software Foundation, Inc. I, [2024-05-05T22:08:18.718365 #4159776] INFO -- : This is free software; see the source for copying conditions. There is NO I, [2024-05-05T22:08:18.718378 #4159776] INFO -- : warranty; not even for MERCHANTABILITY or FITNESS FOR A PARTICULAR PURPOSE. I, [2024-05-05T22:08:18.718391 #4159776] INFO -- : I, [2024-05-05T22:08:18.739156 #4159776] INFO -- : compiling /tmp/ruby/src/trunk/version.c I, [2024-05-05T22:08:18.842531 #4159776] INFO -- : linking miniruby I, [2024-05-05T22:08:19.372608 #4159776] INFO -- : $$$[end] "make miniruby -j20" exit with 0. I, [2024-05-05T22:08:19.372732 #4159776] INFO -- : $$$[beg] make ruby -j20 I, [2024-05-05T22:08:19.429835 #4159776] INFO -- : BASERUBY = /usr/bin/ruby --disable=gems I, [2024-05-05T22:08:19.429874 #4159776] INFO -- : CC = gcc I, [2024-05-05T22:08:19.429887 #4159776] INFO -- : LD = ld I, [2024-05-05T22:08:19.429898 #4159776] INFO -- : LDSHARED = gcc -shared I, [2024-05-05T22:08:19.429914 #4159776] INFO -- : CFLAGS = -O3 -fno-fast-math -ggdb3 -Wall -Wextra -Wdeprecated-declarations -Wdiv-by-zero -Wduplicated-cond -Wimplicit-function-declaration -Wimplicit-int -Wpointer-arith -Wwrite-strings -Wold-style-definition -Wimplicit-fallthrough=0 -Wmissing-noreturn -Wno-cast-function-type -Wno-constant-logical-operand -Wno-long-long -Wno-missing-field-initializers -Wno-overlength-strings -Wno-packed-bitfield-compat -Wno-parentheses-equality -Wno-self-assign -Wno-tautological-compare -Wno-unused-parameter -Wno-unused-value -Wsuggest-attribute=format -Wsuggest-attribute=noreturn -Wunused-variable -Wmisleading-indentation -Wundef -fPIC I, [2024-05-05T22:08:19.429926 #4159776] INFO -- : XCFLAGS = -U_FORTIFY_SOURCE -D_FORTIFY_SOURCE=2 -fstack-protector-strong -fno-strict-overflow -fvisibility=hidden -fexcess-precision=standard -DRUBY_EXPORT -I. -I.ext/include/x86_64-linux -I/tmp/ruby/src/trunk/include -I/tmp/ruby/src/trunk -I/tmp/ruby/src/trunk/prism -I/tmp/ruby/src/trunk/enc/unicode/15.0.0 I, [2024-05-05T22:08:19.429937 #4159776] INFO -- : CPPFLAGS = I, [2024-05-05T22:08:19.429947 #4159776] INFO -- : DLDFLAGS = -Wl,--compress-debug-sections=zlib -Wl,-soname,libruby.so.3.4 -fstack-protector-strong I, [2024-05-05T22:08:19.429958 #4159776] INFO -- : SOLIBS = -lz -lrt -lrt -lgmp -ldl -lcrypt -lm -lpthread I, [2024-05-05T22:08:19.429968 #4159776] INFO -- : LANG = en_US.UTF-8 I, [2024-05-05T22:08:19.429978 #4159776] INFO -- : LC_ALL = I, [2024-05-05T22:08:19.429987 #4159776] INFO -- : LC_CTYPE = I, [2024-05-05T22:08:19.429998 #4159776] INFO -- : MFLAGS = -j20 --jobserver-auth=4,5 I, [2024-05-05T22:08:19.430008 #4159776] INFO -- : RUSTC = no I, [2024-05-05T22:08:19.430018 #4159776] INFO -- : YJIT_RUSTC_ARGS = --crate-name=yjit --crate-type=staticlib --edition=2021 -g -C lto=thin -C opt-level=3 -C overflow-checks=on '--out-dir=/tmp/ruby/build/trunk/yjit/target/release/' /tmp/ruby/src/trunk/yjit/src/lib.rs I, [2024-05-05T22:08:19.431277 #4159776] INFO -- : gcc (Ubuntu 11.4.0-1ubuntu1~22.04) 11.4.0 I, [2024-05-05T22:08:19.431321 #4159776] INFO -- : Copyright (C) 2021 Free Software Foundation, Inc. I, [2024-05-05T22:08:19.431335 #4159776] INFO -- : This is free software; see the source for copying conditions. There is NO I, [2024-05-05T22:08:19.431346 #4159776] INFO -- : warranty; not even for MERCHANTABILITY or FITNESS FOR A PARTICULAR PURPOSE. I, [2024-05-05T22:08:19.431357 #4159776] INFO -- : I, [2024-05-05T22:08:19.539721 #4159776] INFO -- : builtin_binary.inc updated I, [2024-05-05T22:08:19.544094 #4159776] INFO -- : c5234a9416e4f20f175185e840b25b0f08674d14078ed7083f37e655458e3ca9 builtin_binary.inc I, [2024-05-05T22:08:19.544769 #4159776] INFO -- : compiling /tmp/ruby/src/trunk/builtin.c I, [2024-05-05T22:08:19.728391 #4159776] INFO -- : linking static-library libruby-static.a I, [2024-05-05T22:08:20.040523 #4159776] INFO -- : linking shared-library libruby.so.3.4.0 I, [2024-05-05T22:08:21.626592 #4159776] INFO -- : linking ruby I, [2024-05-05T22:08:21.649262 #4159776] INFO -- : $$$[end] "make ruby -j20" exit with 0. I, [2024-05-05T22:08:21.649394 #4159776] INFO -- : $$$[beg] make all -j20 I, [2024-05-05T22:08:21.706443 #4159776] INFO -- : BASERUBY = /usr/bin/ruby --disable=gems I, [2024-05-05T22:08:21.706486 #4159776] INFO -- : CC = gcc I, [2024-05-05T22:08:21.706499 #4159776] INFO -- : LD = ld I, [2024-05-05T22:08:21.706510 #4159776] INFO -- : LDSHARED = gcc -shared I, [2024-05-05T22:08:21.706521 #4159776] INFO -- : CFLAGS = -O3 -fno-fast-math -ggdb3 -Wall -Wextra -Wdeprecated-declarations -Wdiv-by-zero -Wduplicated-cond -Wimplicit-function-declaration -Wimplicit-int -Wpointer-arith -Wwrite-strings -Wold-style-definition -Wimplicit-fallthrough=0 -Wmissing-noreturn -Wno-cast-function-type -Wno-constant-logical-operand -Wno-long-long -Wno-missing-field-initializers -Wno-overlength-strings -Wno-packed-bitfield-compat -Wno-parentheses-equality -Wno-self-assign -Wno-tautological-compare -Wno-unused-parameter -Wno-unused-value -Wsuggest-attribute=format -Wsuggest-attribute=noreturn -Wunused-variable -Wmisleading-indentation -Wundef -fPIC I, [2024-05-05T22:08:21.706535 #4159776] INFO -- : XCFLAGS = -U_FORTIFY_SOURCE -D_FORTIFY_SOURCE=2 -fstack-protector-strong -fno-strict-overflow -fvisibility=hidden -fexcess-precision=standard -DRUBY_EXPORT -I. -I.ext/include/x86_64-linux -I/tmp/ruby/src/trunk/include -I/tmp/ruby/src/trunk -I/tmp/ruby/src/trunk/prism -I/tmp/ruby/src/trunk/enc/unicode/15.0.0 I, [2024-05-05T22:08:21.706545 #4159776] INFO -- : CPPFLAGS = I, [2024-05-05T22:08:21.706555 #4159776] INFO -- : DLDFLAGS = -Wl,--compress-debug-sections=zlib -Wl,-soname,libruby.so.3.4 -fstack-protector-strong I, [2024-05-05T22:08:21.706566 #4159776] INFO -- : SOLIBS = -lz -lrt -lrt -lgmp -ldl -lcrypt -lm -lpthread I, [2024-05-05T22:08:21.706576 #4159776] INFO -- : LANG = en_US.UTF-8 I, [2024-05-05T22:08:21.706586 #4159776] INFO -- : LC_ALL = I, [2024-05-05T22:08:21.706596 #4159776] INFO -- : LC_CTYPE = I, [2024-05-05T22:08:21.706606 #4159776] INFO -- : MFLAGS = -j20 --jobserver-auth=4,5 I, [2024-05-05T22:08:21.706616 #4159776] INFO -- : RUSTC = no I, [2024-05-05T22:08:21.706628 #4159776] INFO -- : YJIT_RUSTC_ARGS = --crate-name=yjit --crate-type=staticlib --edition=2021 -g -C lto=thin -C opt-level=3 -C overflow-checks=on '--out-dir=/tmp/ruby/build/trunk/yjit/target/release/' /tmp/ruby/src/trunk/yjit/src/lib.rs I, [2024-05-05T22:08:21.707873 #4159776] INFO -- : gcc (Ubuntu 11.4.0-1ubuntu1~22.04) 11.4.0 I, [2024-05-05T22:08:21.707917 #4159776] INFO -- : Copyright (C) 2021 Free Software Foundation, Inc. I, [2024-05-05T22:08:21.707930 #4159776] INFO -- : This is free software; see the source for copying conditions. There is NO I, [2024-05-05T22:08:21.707941 #4159776] INFO -- : warranty; not even for MERCHANTABILITY or FITNESS FOR A PARTICULAR PURPOSE. I, [2024-05-05T22:08:21.707960 #4159776] INFO -- : I, [2024-05-05T22:08:21.736930 #4159776] INFO -- : generating enc.mk I, [2024-05-05T22:08:21.738810 #4159776] INFO -- : building spec/ruby/optional/capi/ext/array_spec.so I, [2024-05-05T22:08:21.739134 #4159776] INFO -- : building spec/ruby/optional/capi/ext/basic_object_spec.so I, [2024-05-05T22:08:21.739850 #4159776] INFO -- : building spec/ruby/optional/capi/ext/bignum_spec.so I, [2024-05-05T22:08:21.740211 #4159776] INFO -- : building spec/ruby/optional/capi/ext/binding_spec.so I, [2024-05-05T22:08:21.740515 #4159776] INFO -- : building spec/ruby/optional/capi/ext/boolean_spec.so I, [2024-05-05T22:08:21.741241 #4159776] INFO -- : building spec/ruby/optional/capi/ext/class_id_under_autoload_spec.so I, [2024-05-05T22:08:21.741920 #4159776] INFO -- : building spec/ruby/optional/capi/ext/class_spec.so I, [2024-05-05T22:08:21.742306 #4159776] INFO -- : building spec/ruby/optional/capi/ext/class_under_autoload_spec.so I, [2024-05-05T22:08:21.742757 #4159776] INFO -- : building spec/ruby/optional/capi/ext/complex_spec.so I, [2024-05-05T22:08:21.743486 #4159776] INFO -- : building spec/ruby/optional/capi/ext/constants_spec.so I, [2024-05-05T22:08:21.744115 #4159776] INFO -- : building spec/ruby/optional/capi/ext/data_spec.so I, [2024-05-05T22:08:21.744439 #4159776] INFO -- : building spec/ruby/optional/capi/ext/debug_spec.so I, [2024-05-05T22:08:21.745041 #4159776] INFO -- : building spec/ruby/optional/capi/ext/encoding_spec.so I, [2024-05-05T22:08:21.745322 #4159776] INFO -- : building spec/ruby/optional/capi/ext/enumerator_spec.so I, [2024-05-05T22:08:21.745939 #4159776] INFO -- : building spec/ruby/optional/capi/ext/exception_spec.so I, [2024-05-05T22:08:21.746185 #4159776] INFO -- : building spec/ruby/optional/capi/ext/fiber_spec.so I, [2024-05-05T22:08:21.746889 #4159776] INFO -- : building spec/ruby/optional/capi/ext/file_spec.so I, [2024-05-05T22:08:21.747101 #4159776] INFO -- : building spec/ruby/optional/capi/ext/fixnum_spec.so I, [2024-05-05T22:08:21.804897 #4159776] INFO -- : building spec/ruby/optional/capi/ext/float_spec.so I, [2024-05-05T22:08:21.839112 #4159776] INFO -- : building spec/ruby/optional/capi/ext/gc_spec.so I, [2024-05-05T22:08:21.880178 #4159776] INFO -- : building spec/ruby/optional/capi/ext/globals_spec.so I, [2024-05-05T22:08:21.893158 #4159776] INFO -- : building spec/ruby/optional/capi/ext/hash_spec.so I, [2024-05-05T22:08:21.894414 #4159776] INFO -- : building spec/ruby/optional/capi/ext/integer_spec.so I, [2024-05-05T22:08:21.911528 #4159776] INFO -- : building spec/ruby/optional/capi/ext/io_spec.so I, [2024-05-05T22:08:21.913260 #4159776] INFO -- : building spec/ruby/optional/capi/ext/kernel_spec.so I, [2024-05-05T22:08:21.941426 #4159776] INFO -- : building spec/ruby/optional/capi/ext/language_spec.so I, [2024-05-05T22:08:21.941486 #4159776] INFO -- : building spec/ruby/optional/capi/ext/marshal_spec.so I, [2024-05-05T22:08:21.941907 #4159776] INFO -- : building spec/ruby/optional/capi/ext/module_spec.so I, [2024-05-05T22:08:21.942184 #4159776] INFO -- : building spec/ruby/optional/capi/ext/module_under_autoload_spec.so I, [2024-05-05T22:08:21.942500 #4159776] INFO -- : building spec/ruby/optional/capi/ext/mutex_spec.so I, [2024-05-05T22:08:21.943640 #4159776] INFO -- : building spec/ruby/optional/capi/ext/numeric_spec.so I, [2024-05-05T22:08:21.946666 #4159776] INFO -- : building spec/ruby/optional/capi/ext/object_spec.so I, [2024-05-05T22:08:21.955290 #4159776] INFO -- : building spec/ruby/optional/capi/ext/proc_spec.so I, [2024-05-05T22:08:21.973956 #4159776] INFO -- : building spec/ruby/optional/capi/ext/range_spec.so I, [2024-05-05T22:08:21.979270 #4159776] INFO -- : building spec/ruby/optional/capi/ext/rational_spec.so I, [2024-05-05T22:08:21.985851 #4159776] INFO -- : building spec/ruby/optional/capi/ext/rbasic_spec.so I, [2024-05-05T22:08:21.988423 #4159776] INFO -- : building spec/ruby/optional/capi/ext/regexp_spec.so I, [2024-05-05T22:08:22.034122 #4159776] INFO -- : building spec/ruby/optional/capi/ext/string_spec.so I, [2024-05-05T22:08:22.056886 #4159776] INFO -- : building spec/ruby/optional/capi/ext/struct_spec.so I, [2024-05-05T22:08:22.064972 #4159776] INFO -- : building spec/ruby/optional/capi/ext/st_spec.so I, [2024-05-05T22:08:22.074115 #4159776] INFO -- : building spec/ruby/optional/capi/ext/symbol_spec.so I, [2024-05-05T22:08:22.090022 #4159776] INFO -- : building spec/ruby/optional/capi/ext/thread_spec.so I, [2024-05-05T22:08:22.091720 #4159776] INFO -- : building spec/ruby/optional/capi/ext/time_spec.so I, [2024-05-05T22:08:22.099257 #4159776] INFO -- : building spec/ruby/optional/capi/ext/tracepoint_spec.so I, [2024-05-05T22:08:22.100371 #4159776] INFO -- : building spec/ruby/optional/capi/ext/typed_data_spec.so I, [2024-05-05T22:08:22.101743 #4159776] INFO -- : building spec/ruby/optional/capi/ext/util_spec.so I, [2024-05-05T22:08:22.128013 #4159776] INFO -- : making enc I, [2024-05-05T22:08:22.158174 #4159776] INFO -- : make[1]: Entering directory '/tmp/ruby/build/trunk' I, [2024-05-05T22:08:22.158245 #4159776] INFO -- : make[1]: Nothing to be done for 'enc'. I, [2024-05-05T22:08:22.158272 #4159776] INFO -- : make[1]: Leaving directory '/tmp/ruby/build/trunk' I, [2024-05-05T22:08:22.162234 #4159776] INFO -- : making srcs under enc I, [2024-05-05T22:08:22.205959 #4159776] INFO -- : make[1]: Entering directory '/tmp/ruby/build/trunk' I, [2024-05-05T22:08:22.206017 #4159776] INFO -- : make[1]: Nothing to be done for 'srcs'. I, [2024-05-05T22:08:22.206025 #4159776] INFO -- : make[1]: Leaving directory '/tmp/ruby/build/trunk' I, [2024-05-05T22:08:22.206537 #4159776] INFO -- : generating transdb.h I, [2024-05-05T22:08:22.301852 #4159776] INFO -- : transdb.h unchanged I, [2024-05-05T22:08:22.303018 #4159776] INFO -- : generating makefiles ext/configure-ext.mk I, [2024-05-05T22:08:22.303283 #4159776] INFO -- : making trans I, [2024-05-05T22:08:22.329403 #4159776] INFO -- : ext/configure-ext.mk updated I, [2024-05-05T22:08:22.332231 #4159776] INFO -- : make[1]: Entering directory '/tmp/ruby/build/trunk' I, [2024-05-05T22:08:22.338163 #4159776] INFO -- : make[1]: Entering directory '/tmp/ruby/build/trunk' I, [2024-05-05T22:08:22.338269 #4159776] INFO -- : make[1]: Nothing to be done for 'trans'. I, [2024-05-05T22:08:22.339602 #4159776] INFO -- : make[1]: Leaving directory '/tmp/ruby/build/trunk' I, [2024-05-05T22:08:22.340512 #4159776] INFO -- : making encs I, [2024-05-05T22:08:22.397452 #4159776] INFO -- : make[1]: Entering directory '/tmp/ruby/build/trunk' I, [2024-05-05T22:08:22.397530 #4159776] INFO -- : make[1]: Nothing to be done for 'encs'. I, [2024-05-05T22:08:22.397557 #4159776] INFO -- : make[1]: Leaving directory '/tmp/ruby/build/trunk' I, [2024-05-05T22:08:22.489103 #4159776] INFO -- : make[1]: Leaving directory '/tmp/ruby/build/trunk' I, [2024-05-05T22:08:22.489875 #4159776] INFO -- : generating makefile exts.mk I, [2024-05-05T22:08:22.527794 #4159776] INFO -- : exts.mk unchanged I, [2024-05-05T22:08:22.532646 #4159776] INFO -- : make[1]: Entering directory '/tmp/ruby/build/trunk' I, [2024-05-05T22:08:22.551391 #4159776] INFO -- : make[2]: Entering directory '/tmp/ruby/build/trunk/ext/digest' I, [2024-05-05T22:08:22.552388 #4159776] INFO -- : make[2]: Entering directory '/tmp/ruby/build/trunk/ext/coverage' I, [2024-05-05T22:08:22.554242 #4159776] INFO -- : make[2]: Entering directory '/tmp/ruby/build/trunk/ext/json' I, [2024-05-05T22:08:22.554567 #4159776] INFO -- : make[2]: Entering directory '/tmp/ruby/build/trunk/ext/date' I, [2024-05-05T22:08:22.554864 #4159776] INFO -- : make[2]: Leaving directory '/tmp/ruby/build/trunk/ext/digest' I, [2024-05-05T22:08:22.555392 #4159776] INFO -- : make[2]: Leaving directory '/tmp/ruby/build/trunk/ext/coverage' I, [2024-05-05T22:08:22.555438 #4159776] INFO -- : make[2]: Entering directory '/tmp/ruby/build/trunk/ext/rubyvm' I, [2024-05-05T22:08:22.556068 #4159776] INFO -- : make[2]: Entering directory '/tmp/ruby/build/trunk/ext/io/console' I, [2024-05-05T22:08:22.556577 #4159776] INFO -- : make[2]: Entering directory '/tmp/ruby/build/trunk/ext/monitor' I, [2024-05-05T22:08:22.556980 #4159776] INFO -- : make[2]: Entering directory '/tmp/ruby/build/trunk/ext/pathname' I, [2024-05-05T22:08:22.557199 #4159776] INFO -- : make[2]: Entering directory '/tmp/ruby/build/trunk/ext/pty' I, [2024-05-05T22:08:22.557511 #4159776] INFO -- : make[2]: Leaving directory '/tmp/ruby/build/trunk/ext/rubyvm' I, [2024-05-05T22:08:22.558443 #4159776] INFO -- : make[2]: Entering directory '/tmp/ruby/build/trunk/ext/fiddle' I, [2024-05-05T22:08:22.558511 #4159776] INFO -- : make[2]: Entering directory '/tmp/ruby/build/trunk/ext/objspace' I, [2024-05-05T22:08:22.558870 #4159776] INFO -- : make[2]: Leaving directory '/tmp/ruby/build/trunk/ext/date' I, [2024-05-05T22:08:22.559210 #4159776] INFO -- : make[2]: Entering directory '/tmp/ruby/build/trunk/ext/psych' I, [2024-05-05T22:08:22.559278 #4159776] INFO -- : make[2]: Leaving directory '/tmp/ruby/build/trunk/ext/monitor' I, [2024-05-05T22:08:22.559521 #4159776] INFO -- : make[2]: Leaving directory '/tmp/ruby/build/trunk/ext/io/console' I, [2024-05-05T22:08:22.559864 #4159776] INFO -- : make[2]: Entering directory '/tmp/ruby/build/trunk/.bundle/gems/bigdecimal-3.1.7/ext/bigdecimal' I, [2024-05-05T22:08:22.559951 #4159776] INFO -- : make[2]: Leaving directory '/tmp/ruby/build/trunk/ext/pathname' I, [2024-05-05T22:08:22.560109 #4159776] INFO -- : make[2]: Leaving directory '/tmp/ruby/build/trunk/ext/pty' I, [2024-05-05T22:08:22.560989 #4159776] INFO -- : make[2]: Entering directory '/tmp/ruby/build/trunk/.bundle/gems/debug-1.9.2/ext/debug' I, [2024-05-05T22:08:22.561048 #4159776] INFO -- : make[2]: Entering directory '/tmp/ruby/build/trunk/ext/ripper' I, [2024-05-05T22:08:22.561325 #4159776] INFO -- : make[2]: Leaving directory '/tmp/ruby/build/trunk/ext/json' I, [2024-05-05T22:08:22.561713 #4159776] INFO -- : make[2]: Entering directory '/tmp/ruby/build/trunk/.bundle/gems/nkf-0.2.0/ext/nkf' I, [2024-05-05T22:08:22.561881 #4159776] INFO -- : make[2]: Entering directory '/tmp/ruby/build/trunk/.bundle/gems/racc-1.7.3/ext/racc/cparse' I, [2024-05-05T22:08:22.562463 #4159776] INFO -- : make[2]: Entering directory '/tmp/ruby/build/trunk/.bundle/gems/rbs-3.4.4/ext/rbs_extension' I, [2024-05-05T22:08:22.562809 #4159776] INFO -- : make[2]: Entering directory '/tmp/ruby/build/trunk/.bundle/gems/syslog-0.1.2/ext/syslog' I, [2024-05-05T22:08:22.563388 #4159776] INFO -- : make[2]: Leaving directory '/tmp/ruby/build/trunk/ext/objspace' I, [2024-05-05T22:08:22.565540 #4159776] INFO -- : make[2]: Leaving directory '/tmp/ruby/build/trunk/ext/fiddle' I, [2024-05-05T22:08:22.566014 #4159776] INFO -- : make[2]: Entering directory '/tmp/ruby/build/trunk/ext/socket' I, [2024-05-05T22:08:22.566268 #4159776] INFO -- : make[2]: Leaving directory '/tmp/ruby/build/trunk/ext/ripper' I, [2024-05-05T22:08:22.568645 #4159776] INFO -- : make[2]: Leaving directory '/tmp/ruby/build/trunk/ext/psych' I, [2024-05-05T22:08:22.569096 #4159776] INFO -- : make[2]: Entering directory '/tmp/ruby/build/trunk/ext/digest/sha2' I, [2024-05-05T22:08:22.571453 #4159776] INFO -- : make[2]: Entering directory '/tmp/ruby/build/trunk/ext/openssl' I, [2024-05-05T22:08:22.571547 #4159776] INFO -- : make[2]: Leaving directory '/tmp/ruby/build/trunk/ext/digest/sha2' I, [2024-05-05T22:08:22.574550 #4159776] INFO -- : make[2]: Leaving directory '/tmp/ruby/build/trunk/ext/socket' I, [2024-05-05T22:08:22.582608 #4159776] INFO -- : make[2]: Leaving directory '/tmp/ruby/build/trunk/ext/openssl' I, [2024-05-05T22:08:22.583889 #4159776] INFO -- : make[2]: Leaving directory '/tmp/ruby/build/trunk/.bundle/gems/bigdecimal-3.1.7/ext/bigdecimal' I, [2024-05-05T22:08:22.584760 #4159776] INFO -- : make[2]: Leaving directory '/tmp/ruby/build/trunk/.bundle/gems/racc-1.7.3/ext/racc/cparse' I, [2024-05-05T22:08:22.586068 #4159776] INFO -- : make[2]: Leaving directory '/tmp/ruby/build/trunk/.bundle/gems/rbs-3.4.4/ext/rbs_extension' I, [2024-05-05T22:08:22.592229 #4159776] INFO -- : make[2]: Leaving directory '/tmp/ruby/build/trunk/.bundle/gems/syslog-0.1.2/ext/syslog' I, [2024-05-05T22:08:22.592272 #4159776] INFO -- : make[2]: Leaving directory '/tmp/ruby/build/trunk/.bundle/gems/nkf-0.2.0/ext/nkf' I, [2024-05-05T22:08:22.592805 #4159776] INFO -- : make[2]: Leaving directory '/tmp/ruby/build/trunk/.bundle/gems/debug-1.9.2/ext/debug' I, [2024-05-05T22:08:22.616166 #4159776] INFO -- : make[2]: Entering directory '/tmp/ruby/build/trunk' I, [2024-05-05T22:08:22.684145 #4159776] INFO -- : linking ruby I, [2024-05-05T22:08:22.707433 #4159776] INFO -- : make[2]: Leaving directory '/tmp/ruby/build/trunk' I, [2024-05-05T22:08:22.707601 #4159776] INFO -- : make[1]: Leaving directory '/tmp/ruby/build/trunk' I, [2024-05-05T22:08:22.711385 #4159776] INFO -- : make[1]: Entering directory '/tmp/ruby/build/trunk' I, [2024-05-05T22:08:22.711412 #4159776] INFO -- : make[1]: Nothing to be done for 'note'. I, [2024-05-05T22:08:22.711418 #4159776] INFO -- : make[1]: Leaving directory '/tmp/ruby/build/trunk' I, [2024-05-05T22:08:22.712335 #4159776] INFO -- : $$$[end] "make all -j20" exit with 0. I, [2024-05-05T22:08:22.712492 #4159776] INFO -- : $$$[beg] make install -j20 I, [2024-05-05T22:08:22.774871 #4159776] INFO -- : Update minitest to ea9caafc0754b1d6236a490d59e624b53209734a I, [2024-05-05T22:08:22.775043 #4159776] INFO -- : Update power_assert to 84e85124c5014a139af39161d484156cfe87a9ed I, [2024-05-05T22:08:22.775432 #4159776] INFO -- : Update rbs to ba7872795d5de04adb8ff500c0e6afdc81a041dd I, [2024-05-05T22:08:22.775840 #4159776] INFO -- : Update typeprof to b19a6416da3a05d57fadd6ffdadb382b6d236ca5 I, [2024-05-05T22:08:22.776526 #4159776] INFO -- : echo ea9caafc0754b1d6236a490d59e624b53209734a | /bin/sh /tmp/ruby/src/trunk/tool/ifchange /tmp/ruby/src/trunk/.bundle/.timestamp/minitest.revision - I, [2024-05-05T22:08:22.776687 #4159776] INFO -- : echo 84e85124c5014a139af39161d484156cfe87a9ed | /bin/sh /tmp/ruby/src/trunk/tool/ifchange /tmp/ruby/src/trunk/.bundle/.timestamp/power_assert.revision - I, [2024-05-05T22:08:22.776873 #4159776] INFO -- : echo ba7872795d5de04adb8ff500c0e6afdc81a041dd | /bin/sh /tmp/ruby/src/trunk/tool/ifchange /tmp/ruby/src/trunk/.bundle/.timestamp/rbs.revision - I, [2024-05-05T22:08:22.777734 #4159776] INFO -- : BASERUBY = /usr/bin/ruby --disable=gems I, [2024-05-05T22:08:22.777750 #4159776] INFO -- : CC = gcc I, [2024-05-05T22:08:22.777755 #4159776] INFO -- : LD = ld I, [2024-05-05T22:08:22.777759 #4159776] INFO -- : LDSHARED = gcc -shared I, [2024-05-05T22:08:22.777763 #4159776] INFO -- : CFLAGS = -O3 -fno-fast-math -ggdb3 -Wall -Wextra -Wdeprecated-declarations -Wdiv-by-zero -Wduplicated-cond -Wimplicit-function-declaration -Wimplicit-int -Wpointer-arith -Wwrite-strings -Wold-style-definition -Wimplicit-fallthrough=0 -Wmissing-noreturn -Wno-cast-function-type -Wno-constant-logical-operand -Wno-long-long -Wno-missing-field-initializers -Wno-overlength-strings -Wno-packed-bitfield-compat -Wno-parentheses-equality -Wno-self-assign -Wno-tautological-compare -Wno-unused-parameter -Wno-unused-value -Wsuggest-attribute=format -Wsuggest-attribute=noreturn -Wunused-variable -Wmisleading-indentation -Wundef -fPIC I, [2024-05-05T22:08:22.777768 #4159776] INFO -- : XCFLAGS = -U_FORTIFY_SOURCE -D_FORTIFY_SOURCE=2 -fstack-protector-strong -fno-strict-overflow -fvisibility=hidden -fexcess-precision=standard -DRUBY_EXPORT -I. -I.ext/include/x86_64-linux -I/tmp/ruby/src/trunk/include -I/tmp/ruby/src/trunk -I/tmp/ruby/src/trunk/prism -I/tmp/ruby/src/trunk/enc/unicode/15.0.0 I, [2024-05-05T22:08:22.777771 #4159776] INFO -- : CPPFLAGS = I, [2024-05-05T22:08:22.777776 #4159776] INFO -- : DLDFLAGS = -Wl,--compress-debug-sections=zlib -Wl,-soname,libruby.so.3.4 -fstack-protector-strong I, [2024-05-05T22:08:22.777779 #4159776] INFO -- : SOLIBS = -lz -lrt -lrt -lgmp -ldl -lcrypt -lm -lpthread I, [2024-05-05T22:08:22.777783 #4159776] INFO -- : LANG = en_US.UTF-8 I, [2024-05-05T22:08:22.777786 #4159776] INFO -- : LC_ALL = I, [2024-05-05T22:08:22.777795 #4159776] INFO -- : LC_CTYPE = I, [2024-05-05T22:08:22.777802 #4159776] INFO -- : MFLAGS = -j20 --jobserver-auth=4,5 I, [2024-05-05T22:08:22.777808 #4159776] INFO -- : RUSTC = no I, [2024-05-05T22:08:22.777813 #4159776] INFO -- : YJIT_RUSTC_ARGS = --crate-name=yjit --crate-type=staticlib --edition=2021 -g -C lto=thin -C opt-level=3 -C overflow-checks=on '--out-dir=/tmp/ruby/build/trunk/yjit/target/release/' /tmp/ruby/src/trunk/yjit/src/lib.rs I, [2024-05-05T22:08:22.778525 #4159776] INFO -- : /tmp/ruby/src/trunk/.bundle/.timestamp/minitest.revision unchanged I, [2024-05-05T22:08:22.778633 #4159776] INFO -- : /tmp/ruby/src/trunk/.bundle/.timestamp/power_assert.revision unchanged I, [2024-05-05T22:08:22.778837 #4159776] INFO -- : /tmp/ruby/src/trunk/.bundle/.timestamp/rbs.revision unchanged I, [2024-05-05T22:08:22.809341 #4159776] INFO -- : echo b19a6416da3a05d57fadd6ffdadb382b6d236ca5 | /bin/sh /tmp/ruby/src/trunk/tool/ifchange /tmp/ruby/src/trunk/.bundle/.timestamp/typeprof.revision - I, [2024-05-05T22:08:22.810131 #4159776] INFO -- : generating enc.mk I, [2024-05-05T22:08:22.810165 #4159776] INFO -- : gcc (Ubuntu 11.4.0-1ubuntu1~22.04) 11.4.0 I, [2024-05-05T22:08:22.810177 #4159776] INFO -- : Copyright (C) 2021 Free Software Foundation, Inc. I, [2024-05-05T22:08:22.810187 #4159776] INFO -- : This is free software; see the source for copying conditions. There is NO I, [2024-05-05T22:08:22.810199 #4159776] INFO -- : warranty; not even for MERCHANTABILITY or FITNESS FOR A PARTICULAR PURPOSE. I, [2024-05-05T22:08:22.810209 #4159776] INFO -- : I, [2024-05-05T22:08:22.811441 #4159776] INFO -- : /tmp/ruby/src/trunk/.bundle/.timestamp/typeprof.revision unchanged I, [2024-05-05T22:08:22.932644 #4159776] INFO -- : Building power_assert@84e85124c5014a139af39161d484156cfe87a9ed to /tmp/ruby/src/trunk/gems/power_assert-2.0.3.gem I, [2024-05-05T22:08:22.933455 #4159776] INFO -- : making srcs under enc I, [2024-05-05T22:08:22.933704 #4159776] INFO -- : making enc I, [2024-05-05T22:08:22.950638 #4159776] INFO -- : make[1]: Entering directory '/tmp/ruby/build/trunk' I, [2024-05-05T22:08:22.950690 #4159776] INFO -- : make[1]: Nothing to be done for 'enc'. I, [2024-05-05T22:08:22.950703 #4159776] INFO -- : make[1]: Leaving directory '/tmp/ruby/build/trunk' I, [2024-05-05T22:08:22.963252 #4159776] INFO -- : make[1]: Entering directory '/tmp/ruby/build/trunk' I, [2024-05-05T22:08:22.963310 #4159776] INFO -- : make[1]: Nothing to be done for 'srcs'. I, [2024-05-05T22:08:22.963324 #4159776] INFO -- : make[1]: Leaving directory '/tmp/ruby/build/trunk' I, [2024-05-05T22:08:22.963874 #4159776] INFO -- : generating transdb.h I, [2024-05-05T22:08:23.001601 #4159776] INFO -- : Successfully built RubyGem I, [2024-05-05T22:08:23.001667 #4159776] INFO -- : Name: power_assert I, [2024-05-05T22:08:23.001681 #4159776] INFO -- : Version: 2.0.4dev I, [2024-05-05T22:08:23.001692 #4159776] INFO -- : File: power_assert-2.0.4dev.gem I, [2024-05-05T22:08:23.003867 #4159776] INFO -- : Extracting bundle gem power_assert-2.0.3... I, [2024-05-05T22:08:23.061278 #4159776] INFO -- : transdb.h unchanged I, [2024-05-05T22:08:23.062991 #4159776] INFO -- : generating makefiles ext/configure-ext.mk I, [2024-05-05T22:08:23.063367 #4159776] INFO -- : making trans I, [2024-05-05T22:08:23.064608 #4159776] INFO -- : Try with hash version of bundled gems instead of gems/power_assert-2.0.3.gem. We don't use this gem with release version of Ruby. I, [2024-05-05T22:08:23.069548 #4159776] INFO -- : Unpacked gems/power_assert-2.0.4dev.gem I, [2024-05-05T22:08:23.090415 #4159776] INFO -- : ext/configure-ext.mk unchanged I, [2024-05-05T22:08:23.092803 #4159776] INFO -- : make[1]: Entering directory '/tmp/ruby/build/trunk' I, [2024-05-05T22:08:23.098478 #4159776] INFO -- : make[1]: Entering directory '/tmp/ruby/build/trunk' I, [2024-05-05T22:08:23.098572 #4159776] INFO -- : make[1]: Nothing to be done for 'trans'. I, [2024-05-05T22:08:23.098581 #4159776] INFO -- : make[1]: Leaving directory '/tmp/ruby/build/trunk' I, [2024-05-05T22:08:23.099510 #4159776] INFO -- : making encs I, [2024-05-05T22:08:23.158272 #4159776] INFO -- : make[1]: Entering directory '/tmp/ruby/build/trunk' I, [2024-05-05T22:08:23.158347 #4159776] INFO -- : make[1]: Nothing to be done for 'encs'. I, [2024-05-05T22:08:23.158376 #4159776] INFO -- : make[1]: Leaving directory '/tmp/ruby/build/trunk' I, [2024-05-05T22:08:23.249523 #4159776] INFO -- : make[1]: Leaving directory '/tmp/ruby/build/trunk' I, [2024-05-05T22:08:23.250198 #4159776] INFO -- : generating makefile exts.mk I, [2024-05-05T22:08:23.287896 #4159776] INFO -- : exts.mk unchanged I, [2024-05-05T22:08:23.293484 #4159776] INFO -- : make[1]: Entering directory '/tmp/ruby/build/trunk' I, [2024-05-05T22:08:23.313205 #4159776] INFO -- : make[2]: Entering directory '/tmp/ruby/build/trunk/ext/digest' I, [2024-05-05T22:08:23.314844 #4159776] INFO -- : make[2]: Entering directory '/tmp/ruby/build/trunk/ext/coverage' I, [2024-05-05T22:08:23.315425 #4159776] INFO -- : make[2]: Entering directory '/tmp/ruby/build/trunk/ext/date' I, [2024-05-05T22:08:23.315538 #4159776] INFO -- : make[2]: Entering directory '/tmp/ruby/build/trunk/ext/json' I, [2024-05-05T22:08:23.317124 #4159776] INFO -- : make[2]: Leaving directory '/tmp/ruby/build/trunk/ext/digest' I, [2024-05-05T22:08:23.317311 #4159776] INFO -- : make[2]: Entering directory '/tmp/ruby/build/trunk/ext/io/console' I, [2024-05-05T22:08:23.317552 #4159776] INFO -- : make[2]: Entering directory '/tmp/ruby/build/trunk/ext/monitor' I, [2024-05-05T22:08:23.317843 #4159776] INFO -- : make[2]: Entering directory '/tmp/ruby/build/trunk/ext/rubyvm' I, [2024-05-05T22:08:23.318039 #4159776] INFO -- : make[2]: Entering directory '/tmp/ruby/build/trunk/ext/pathname' I, [2024-05-05T22:08:23.318821 #4159776] INFO -- : make[2]: Leaving directory '/tmp/ruby/build/trunk/ext/coverage' I, [2024-05-05T22:08:23.318853 #4159776] INFO -- : make[2]: Entering directory '/tmp/ruby/build/trunk/ext/pty' I, [2024-05-05T22:08:23.319297 #4159776] INFO -- : make[2]: Entering directory '/tmp/ruby/build/trunk/ext/objspace' I, [2024-05-05T22:08:23.319327 #4159776] INFO -- : make[2]: Entering directory '/tmp/ruby/build/trunk/ext/fiddle' I, [2024-05-05T22:08:23.319888 #4159776] INFO -- : make[2]: Leaving directory '/tmp/ruby/build/trunk/ext/io/console' I, [2024-05-05T22:08:23.320408 #4159776] INFO -- : make[2]: Entering directory '/tmp/ruby/build/trunk/ext/psych' I, [2024-05-05T22:08:23.320422 #4159776] INFO -- : make[2]: Leaving directory '/tmp/ruby/build/trunk/ext/rubyvm' I, [2024-05-05T22:08:23.320429 #4159776] INFO -- : make[2]: Leaving directory '/tmp/ruby/build/trunk/ext/pathname' I, [2024-05-05T22:08:23.320842 #4159776] INFO -- : make[2]: Leaving directory '/tmp/ruby/build/trunk/ext/monitor' I, [2024-05-05T22:08:23.320996 #4159776] INFO -- : make[2]: Leaving directory '/tmp/ruby/build/trunk/ext/date' I, [2024-05-05T22:08:23.321525 #4159776] INFO -- : make[2]: Leaving directory '/tmp/ruby/build/trunk/ext/pty' I, [2024-05-05T22:08:23.321746 #4159776] INFO -- : make[2]: Entering directory '/tmp/ruby/build/trunk/.bundle/gems/debug-1.9.2/ext/debug' I, [2024-05-05T22:08:23.321859 #4159776] INFO -- : make[2]: Entering directory '/tmp/ruby/build/trunk/.bundle/gems/bigdecimal-3.1.7/ext/bigdecimal' I, [2024-05-05T22:08:23.322661 #4159776] INFO -- : make[2]: Entering directory '/tmp/ruby/build/trunk/ext/ripper' I, [2024-05-05T22:08:23.323101 #4159776] INFO -- : make[2]: Leaving directory '/tmp/ruby/build/trunk/ext/objspace' I, [2024-05-05T22:08:23.324777 #4159776] INFO -- : make[2]: Entering directory '/tmp/ruby/build/trunk/.bundle/gems/racc-1.7.3/ext/racc/cparse' I, [2024-05-05T22:08:23.325117 #4159776] INFO -- : make[2]: Leaving directory '/tmp/ruby/build/trunk/ext/json' I, [2024-05-05T22:08:23.325304 #4159776] INFO -- : make[2]: Entering directory '/tmp/ruby/build/trunk/.bundle/gems/nkf-0.2.0/ext/nkf' I, [2024-05-05T22:08:23.325397 #4159776] INFO -- : make[2]: Entering directory '/tmp/ruby/build/trunk/.bundle/gems/rbs-3.4.4/ext/rbs_extension' I, [2024-05-05T22:08:23.325682 #4159776] INFO -- : make[2]: Entering directory '/tmp/ruby/build/trunk/.bundle/gems/syslog-0.1.2/ext/syslog' I, [2024-05-05T22:08:23.326269 #4159776] INFO -- : make[2]: Leaving directory '/tmp/ruby/build/trunk/ext/fiddle' I, [2024-05-05T22:08:23.327845 #4159776] INFO -- : make[2]: Leaving directory '/tmp/ruby/build/trunk/ext/ripper' I, [2024-05-05T22:08:23.328690 #4159776] INFO -- : make[2]: Entering directory '/tmp/ruby/build/trunk/ext/socket' I, [2024-05-05T22:08:23.331608 #4159776] INFO -- : make[2]: Entering directory '/tmp/ruby/build/trunk/ext/openssl' I, [2024-05-05T22:08:23.332419 #4159776] INFO -- : make[2]: Entering directory '/tmp/ruby/build/trunk/ext/digest/sha2' I, [2024-05-05T22:08:23.333606 #4159776] INFO -- : make[2]: Leaving directory '/tmp/ruby/build/trunk/ext/psych' I, [2024-05-05T22:08:23.335625 #4159776] INFO -- : make[2]: Leaving directory '/tmp/ruby/build/trunk/ext/digest/sha2' I, [2024-05-05T22:08:23.335740 #4159776] INFO -- : make[2]: Leaving directory '/tmp/ruby/build/trunk/ext/socket' I, [2024-05-05T22:08:23.342942 #4159776] INFO -- : make[2]: Leaving directory '/tmp/ruby/build/trunk/ext/openssl' I, [2024-05-05T22:08:23.345577 #4159776] INFO -- : make[2]: Leaving directory '/tmp/ruby/build/trunk/.bundle/gems/debug-1.9.2/ext/debug' I, [2024-05-05T22:08:23.347519 #4159776] INFO -- : make[2]: Leaving directory '/tmp/ruby/build/trunk/.bundle/gems/bigdecimal-3.1.7/ext/bigdecimal' I, [2024-05-05T22:08:23.348230 #4159776] INFO -- : make[2]: Leaving directory '/tmp/ruby/build/trunk/.bundle/gems/racc-1.7.3/ext/racc/cparse' I, [2024-05-05T22:08:23.350534 #4159776] INFO -- : make[2]: Leaving directory '/tmp/ruby/build/trunk/.bundle/gems/nkf-0.2.0/ext/nkf' I, [2024-05-05T22:08:23.357906 #4159776] INFO -- : make[2]: Leaving directory '/tmp/ruby/build/trunk/.bundle/gems/rbs-3.4.4/ext/rbs_extension' I, [2024-05-05T22:08:23.360309 #4159776] INFO -- : make[2]: Leaving directory '/tmp/ruby/build/trunk/.bundle/gems/syslog-0.1.2/ext/syslog' I, [2024-05-05T22:08:23.383688 #4159776] INFO -- : make[2]: Entering directory '/tmp/ruby/build/trunk' I, [2024-05-05T22:08:23.450493 #4159776] INFO -- : make[2]: 'ruby' is up to date. I, [2024-05-05T22:08:23.450530 #4159776] INFO -- : make[2]: Leaving directory '/tmp/ruby/build/trunk' I, [2024-05-05T22:08:23.450934 #4159776] INFO -- : make[1]: Leaving directory '/tmp/ruby/build/trunk' I, [2024-05-05T22:08:23.454361 #4159776] INFO -- : make[1]: Entering directory '/tmp/ruby/build/trunk' I, [2024-05-05T22:08:23.454383 #4159776] INFO -- : make[1]: Nothing to be done for 'note'. I, [2024-05-05T22:08:23.454388 #4159776] INFO -- : make[1]: Leaving directory '/tmp/ruby/build/trunk' I, [2024-05-05T22:08:23.454596 #4159776] INFO -- : ./miniruby -I/tmp/ruby/src/trunk/lib -I. -I.ext/common /tmp/ruby/src/trunk/tool/runruby.rb --extout=.ext -- --disable-gems -r./x86_64-linux-fake /tmp/ruby/src/trunk/tool/rbinstall.rb --make="make" --dest-dir="" --extout=".ext" --ext-build-dir="./ext" --mflags="-j20 --jobserver-auth=4,5" --make-flags=" -j20 --jobserver-auth=4,5" --data-mode=0644 --prog-mode=0755 --installed-list .installed.list --mantype="doc" --gnumake --install=all --exclude=doc I, [2024-05-05T22:08:23.549714 #4159776] INFO -- : Installing to I, [2024-05-05T22:08:23.549777 #4159776] INFO -- : installing binary commands: /tmp/ruby/install/trunk/bin I, [2024-05-05T22:08:23.549864 #4159776] INFO -- : installing base libraries: /tmp/ruby/install/trunk/lib I, [2024-05-05T22:08:23.557229 #4159776] INFO -- : installing arch files: /tmp/ruby/install/trunk/lib/ruby/3.4.0+0/x86_64-linux I, [2024-05-05T22:08:23.557252 #4159776] INFO -- : installing pkgconfig data: /tmp/ruby/install/trunk/lib/pkgconfig I, [2024-05-05T22:08:23.557258 #4159776] INFO -- : installing extension objects: /tmp/ruby/install/trunk/lib/ruby/3.4.0+0/x86_64-linux I, [2024-05-05T22:08:23.566938 #4159776] INFO -- : installing extension objects: /tmp/ruby/install/trunk/lib/ruby/site_ruby/3.4.0+0/x86_64-linux I, [2024-05-05T22:08:23.566966 #4159776] INFO -- : installing extension objects: /tmp/ruby/install/trunk/lib/ruby/vendor_ruby/3.4.0+0/x86_64-linux I, [2024-05-05T22:08:23.566972 #4159776] INFO -- : installing extension headers: /tmp/ruby/install/trunk/include/ruby-3.4.0+0/x86_64-linux I, [2024-05-05T22:08:23.567103 #4159776] INFO -- : installing extension scripts: /tmp/ruby/install/trunk/lib/ruby/3.4.0+0 I, [2024-05-05T22:08:23.570877 #4159776] INFO -- : installing extension scripts: /tmp/ruby/install/trunk/lib/ruby/site_ruby/3.4.0+0 I, [2024-05-05T22:08:23.570898 #4159776] INFO -- : installing extension scripts: /tmp/ruby/install/trunk/lib/ruby/vendor_ruby/3.4.0+0 I, [2024-05-05T22:08:23.570904 #4159776] INFO -- : installing extension headers: /tmp/ruby/install/trunk/include/ruby-3.4.0+0/ruby I, [2024-05-05T22:08:23.570911 #4159776] INFO -- : installing command scripts: /tmp/ruby/install/trunk/bin I, [2024-05-05T22:08:23.570915 #4159776] INFO -- : installing library scripts: /tmp/ruby/install/trunk/lib/ruby/3.4.0+0 I, [2024-05-05T22:08:23.605280 #4159776] INFO -- : installing common headers: /tmp/ruby/install/trunk/include/ruby-3.4.0+0 I, [2024-05-05T22:08:23.610665 #4159776] INFO -- : installing manpages: /tmp/ruby/install/trunk/share/man/man1 I, [2024-05-05T22:08:23.610768 #4159776] INFO -- : installing default gems from lib: /tmp/ruby/install/trunk/lib/ruby/gems/3.4.0+0 I, [2024-05-05T22:08:23.633435 #4159776] INFO -- : benchmark 0.3.0 I, [2024-05-05T22:08:23.640334 #4159776] INFO -- : bundler 2.6.0.dev I, [2024-05-05T22:08:23.642479 #4159776] INFO -- : cgi 0.4.1 I, [2024-05-05T22:08:23.643023 #4159776] INFO -- : delegate 0.3.1 I, [2024-05-05T22:08:23.643506 #4159776] INFO -- : did_you_mean 1.6.3 I, [2024-05-05T22:08:23.644018 #4159776] INFO -- : english 0.8.0 I, [2024-05-05T22:08:23.644546 #4159776] INFO -- : erb 4.0.4 I, [2024-05-05T22:08:23.645248 #4159776] INFO -- : error_highlight 0.6.0 I, [2024-05-05T22:08:23.645706 #4159776] INFO -- : fileutils 1.7.2 I, [2024-05-05T22:08:23.646102 #4159776] INFO -- : find 0.2.0 I, [2024-05-05T22:08:23.646561 #4159776] INFO -- : forwardable 1.3.3 I, [2024-05-05T22:08:23.646985 #4159776] INFO -- : ipaddr 1.2.6 I, [2024-05-05T22:08:23.647548 #4159776] INFO -- : irb 1.13.1 I, [2024-05-05T22:08:23.649031 #4159776] INFO -- : logger 1.6.0 I, [2024-05-05T22:08:23.649533 #4159776] INFO -- : net-http 0.4.1 I, [2024-05-05T22:08:23.650055 #4159776] INFO -- : net-protocol 0.2.2 I, [2024-05-05T22:08:23.650553 #4159776] INFO -- : open-uri 0.4.1 I, [2024-05-05T22:08:23.651149 #4159776] INFO -- : open3 0.2.1 I, [2024-05-05T22:08:23.651664 #4159776] INFO -- : optparse 0.5.0 I, [2024-05-05T22:08:23.652085 #4159776] INFO -- : ostruct 0.6.0 I, [2024-05-05T22:08:23.652737 #4159776] INFO -- : pp 0.5.0 I, [2024-05-05T22:08:23.653160 #4159776] INFO -- : prettyprint 0.2.0 I, [2024-05-05T22:08:23.653702 #4159776] INFO -- : prism 0.27.0 I, [2024-05-05T22:08:23.654205 #4159776] INFO -- : pstore 0.1.3 I, [2024-05-05T22:08:23.654692 #4159776] INFO -- : rdoc 6.6.3.1 I, [2024-05-05T22:08:23.656310 #4159776] INFO -- : readline 0.0.4 I, [2024-05-05T22:08:23.656820 #4159776] INFO -- : reline 0.5.5 I, [2024-05-05T22:08:23.657352 #4159776] INFO -- : resolv 0.4.0 I, [2024-05-05T22:08:23.657739 #4159776] INFO -- : ruby2_keywords 0.0.5 I, [2024-05-05T22:08:23.658233 #4159776] INFO -- : securerandom 0.3.1 I, [2024-05-05T22:08:23.658701 #4159776] INFO -- : set 1.1.0 I, [2024-05-05T22:08:23.659317 #4159776] INFO -- : shellwords 0.2.0 I, [2024-05-05T22:08:23.659798 #4159776] INFO -- : singleton 0.2.0 I, [2024-05-05T22:08:23.660223 #4159776] INFO -- : syntax_suggest 2.0.0 I, [2024-05-05T22:08:23.660977 #4159776] INFO -- : tempfile 0.2.1 I, [2024-05-05T22:08:23.661446 #4159776] INFO -- : time 0.3.0 I, [2024-05-05T22:08:23.661960 #4159776] INFO -- : timeout 0.4.1 I, [2024-05-05T22:08:23.663007 #4159776] INFO -- : tmpdir 0.2.0 I, [2024-05-05T22:08:23.663541 #4159776] INFO -- : tsort 0.2.0 I, [2024-05-05T22:08:23.664026 #4159776] INFO -- : un 0.3.0 I, [2024-05-05T22:08:23.664672 #4159776] INFO -- : uri 0.13.0 I, [2024-05-05T22:08:23.665175 #4159776] INFO -- : weakref 0.1.3 I, [2024-05-05T22:08:23.665596 #4159776] INFO -- : yaml 0.3.0 I, [2024-05-05T22:08:23.666057 #4159776] INFO -- : installing default gems from ext: /tmp/ruby/install/trunk/lib/ruby/gems/3.4.0+0 I, [2024-05-05T22:08:23.672700 #4159776] INFO -- : date 3.3.4 I, [2024-05-05T22:08:23.673222 #4159776] INFO -- : digest 3.1.1 I, [2024-05-05T22:08:23.673707 #4159776] INFO -- : etc 1.4.3 I, [2024-05-05T22:08:23.674226 #4159776] INFO -- : fcntl 1.1.0 I, [2024-05-05T22:08:23.674649 #4159776] INFO -- : fiddle 1.1.3 I, [2024-05-05T22:08:23.675197 #4159776] INFO -- : io-console 0.7.2 I, [2024-05-05T22:08:23.675694 #4159776] INFO -- : io-nonblock 0.3.0 I, [2024-05-05T22:08:23.676372 #4159776] INFO -- : io-wait 0.3.1 I, [2024-05-05T22:08:23.676907 #4159776] INFO -- : json 2.7.2 I, [2024-05-05T22:08:23.677976 #4159776] INFO -- : openssl 3.2.0 I, [2024-05-05T22:08:23.678518 #4159776] INFO -- : pathname 0.3.0 I, [2024-05-05T22:08:23.679038 #4159776] INFO -- : psych 5.1.2 I, [2024-05-05T22:08:23.679612 #4159776] INFO -- : stringio 3.1.1 I, [2024-05-05T22:08:23.680142 #4159776] INFO -- : strscan 3.1.1 I, [2024-05-05T22:08:23.680643 #4159776] INFO -- : zlib 3.1.0 I, [2024-05-05T22:08:23.681132 #4159776] INFO -- : installing bundled gems: /tmp/ruby/install/trunk/lib/ruby/gems/3.4.0+0 I, [2024-05-05T22:08:23.681368 #4159776] INFO -- : minitest 5.22.3 I, [2024-05-05T22:08:23.688808 #4159776] INFO -- : rake 13.2.1 I, [2024-05-05T22:08:23.692324 #4159776] INFO -- : test-unit 3.6.2 I, [2024-05-05T22:08:23.696782 #4159776] INFO -- : rexml 3.2.6 I, [2024-05-05T22:08:23.700178 #4159776] INFO -- : rss 0.3.0 I, [2024-05-05T22:08:23.703286 #4159776] INFO -- : net-ftp 0.3.4 I, [2024-05-05T22:08:23.704770 #4159776] INFO -- : net-imap 0.4.10 I, [2024-05-05T22:08:23.707682 #4159776] INFO -- : net-pop 0.1.2 I, [2024-05-05T22:08:23.708604 #4159776] INFO -- : net-smtp 0.5.0 I, [2024-05-05T22:08:23.709664 #4159776] INFO -- : matrix 0.4.2 I, [2024-05-05T22:08:23.713534 #4159776] INFO -- : prime 0.1.2 I, [2024-05-05T22:08:23.718804 #4159776] INFO -- : rbs 3.4.4 I, [2024-05-05T22:08:23.741967 #4159776] INFO -- : typeprof 0.21.11 I, [2024-05-05T22:08:23.744588 #4159776] INFO -- : debug 1.9.2 I, [2024-05-05T22:08:23.747337 #4159776] INFO -- : racc 1.7.3 I, [2024-05-05T22:08:23.749917 #4159776] INFO -- : mutex_m 0.2.0 I, [2024-05-05T22:08:23.751104 #4159776] INFO -- : getoptlong 0.2.1 I, [2024-05-05T22:08:23.752398 #4159776] INFO -- : base64 0.2.0 I, [2024-05-05T22:08:23.753431 #4159776] INFO -- : bigdecimal 3.1.7 I, [2024-05-05T22:08:23.755581 #4159776] INFO -- : observer 0.1.2 I, [2024-05-05T22:08:23.757048 #4159776] INFO -- : abbrev 0.1.2 I, [2024-05-05T22:08:23.758495 #4159776] INFO -- : resolv-replace 0.1.1 I, [2024-05-05T22:08:23.759633 #4159776] INFO -- : rinda 0.2.0 I, [2024-05-05T22:08:23.761097 #4159776] INFO -- : drb 2.2.1 I, [2024-05-05T22:08:23.762610 #4159776] INFO -- : nkf 0.2.0 I, [2024-05-05T22:08:23.765136 #4159776] INFO -- : syslog 0.1.2 I, [2024-05-05T22:08:23.766689 #4159776] INFO -- : csv 3.3.0 I, [2024-05-05T22:08:23.769259 #4159776] INFO -- : installing bundled gem cache: /tmp/ruby/install/trunk/lib/ruby/gems/3.4.0+0/cache I, [2024-05-05T22:08:23.770696 #4159776] INFO -- : skipped bundled gems: I, [2024-05-05T22:08:23.770716 #4159776] INFO -- : power_assert-2.0.4dev.gem not found in bundled_gems I, [2024-05-05T22:08:23.773708 #4159776] INFO -- : $$$[end] "make install -j20" exit with 0. I, [2024-05-05T22:08:23.773819 #4159776] INFO -- : $$$[beg] make yes-btest TESTOPTS='-q -j20' I, [2024-05-05T22:08:28.908302 #4159776] INFO -- : PASS all 1936 tests E, [2024-05-05T22:08:28.913773 #4159776] ERROR -- : I, [2024-05-05T22:08:28.914037 #4159776] INFO -- : $$$[end] "make yes-btest TESTOPTS='-q -j20'" exit with 0. I, [2024-05-05T22:08:28.914168 #4159776] INFO -- : $$$[beg] make yes-test-basic TESTS='-j20' I, [2024-05-05T22:08:28.973843 #4159776] INFO -- : BASERUBY = /usr/bin/ruby --disable=gems I, [2024-05-05T22:08:28.973874 #4159776] INFO -- : CC = gcc I, [2024-05-05T22:08:28.973879 #4159776] INFO -- : LD = ld I, [2024-05-05T22:08:28.973883 #4159776] INFO -- : LDSHARED = gcc -shared I, [2024-05-05T22:08:28.973888 #4159776] INFO -- : CFLAGS = -O3 -fno-fast-math -ggdb3 -Wall -Wextra -Wdeprecated-declarations -Wdiv-by-zero -Wduplicated-cond -Wimplicit-function-declaration -Wimplicit-int -Wpointer-arith -Wwrite-strings -Wold-style-definition -Wimplicit-fallthrough=0 -Wmissing-noreturn -Wno-cast-function-type -Wno-constant-logical-operand -Wno-long-long -Wno-missing-field-initializers -Wno-overlength-strings -Wno-packed-bitfield-compat -Wno-parentheses-equality -Wno-self-assign -Wno-tautological-compare -Wno-unused-parameter -Wno-unused-value -Wsuggest-attribute=format -Wsuggest-attribute=noreturn -Wunused-variable -Wmisleading-indentation -Wundef -fPIC I, [2024-05-05T22:08:28.973893 #4159776] INFO -- : XCFLAGS = -U_FORTIFY_SOURCE -D_FORTIFY_SOURCE=2 -fstack-protector-strong -fno-strict-overflow -fvisibility=hidden -fexcess-precision=standard -DRUBY_EXPORT -I. -I.ext/include/x86_64-linux -I/tmp/ruby/src/trunk/include -I/tmp/ruby/src/trunk -I/tmp/ruby/src/trunk/prism -I/tmp/ruby/src/trunk/enc/unicode/15.0.0 I, [2024-05-05T22:08:28.973905 #4159776] INFO -- : CPPFLAGS = I, [2024-05-05T22:08:28.973909 #4159776] INFO -- : DLDFLAGS = -Wl,--compress-debug-sections=zlib -Wl,-soname,libruby.so.3.4 -fstack-protector-strong I, [2024-05-05T22:08:28.973913 #4159776] INFO -- : SOLIBS = -lz -lrt -lrt -lgmp -ldl -lcrypt -lm -lpthread I, [2024-05-05T22:08:28.973917 #4159776] INFO -- : LANG = en_US.UTF-8 I, [2024-05-05T22:08:28.973920 #4159776] INFO -- : LC_ALL = I, [2024-05-05T22:08:28.973924 #4159776] INFO -- : LC_CTYPE = I, [2024-05-05T22:08:28.973927 #4159776] INFO -- : MFLAGS = I, [2024-05-05T22:08:28.973930 #4159776] INFO -- : RUSTC = no I, [2024-05-05T22:08:28.973934 #4159776] INFO -- : YJIT_RUSTC_ARGS = --crate-name=yjit --crate-type=staticlib --edition=2021 -g -C lto=thin -C opt-level=3 -C overflow-checks=on '--out-dir=/tmp/ruby/build/trunk/yjit/target/release/' /tmp/ruby/src/trunk/yjit/src/lib.rs I, [2024-05-05T22:08:28.974495 #4159776] INFO -- : gcc (Ubuntu 11.4.0-1ubuntu1~22.04) 11.4.0 I, [2024-05-05T22:08:28.974515 #4159776] INFO -- : Copyright (C) 2021 Free Software Foundation, Inc. I, [2024-05-05T22:08:28.974521 #4159776] INFO -- : This is free software; see the source for copying conditions. There is NO I, [2024-05-05T22:08:28.974525 #4159776] INFO -- : warranty; not even for MERCHANTABILITY or FITNESS FOR A PARTICULAR PURPOSE. I, [2024-05-05T22:08:28.974528 #4159776] INFO -- : I, [2024-05-05T22:08:29.080439 #4159776] INFO -- : Checking leaked global symbols...none I, [2024-05-05T22:08:29.122523 #4159776] INFO -- : /tmp/ruby/src/trunk/basictest/test.rb:assignment ....................................................................................................................................................................................................................................................................................................................................................................................OK 372 I, [2024-05-05T22:08:29.122578 #4159776] INFO -- : /tmp/ruby/src/trunk/basictest/test.rb:condition ..OK 2 I, [2024-05-05T22:08:29.122584 #4159776] INFO -- : /tmp/ruby/src/trunk/basictest/test.rb:if/unless ...OK 3 I, [2024-05-05T22:08:29.122589 #4159776] INFO -- : /tmp/ruby/src/trunk/basictest/test.rb:case .....OK 5 I, [2024-05-05T22:08:29.122818 #4159776] INFO -- : /tmp/ruby/src/trunk/basictest/test.rb:while/until ........OK 8 I, [2024-05-05T22:08:29.122867 #4159776] INFO -- : /tmp/ruby/src/trunk/basictest/test.rb:exception ..........OK 10 I, [2024-05-05T22:08:29.123144 #4159776] INFO -- : /tmp/ruby/src/trunk/basictest/test.rb:array .......................................OK 39 I, [2024-05-05T22:08:29.123251 #4159776] INFO -- : /tmp/ruby/src/trunk/basictest/test.rb:hash ...........................OK 27 I, [2024-05-05T22:08:29.123985 #4159776] INFO -- : /tmp/ruby/src/trunk/basictest/test.rb:iterator ...........................................................................................................OK 107 I, [2024-05-05T22:08:29.124280 #4159776] INFO -- : /tmp/ruby/src/trunk/basictest/test.rb:float ................................................................................OK 80 I, [2024-05-05T22:08:29.125315 #4159776] INFO -- : /tmp/ruby/src/trunk/basictest/test.rb:bignum ...............................OK 31 I, [2024-05-05T22:08:29.126109 #4159776] INFO -- : /tmp/ruby/src/trunk/basictest/test.rb:string & char ..............................................................OK 62 I, [2024-05-05T22:08:29.126139 #4159776] INFO -- : /tmp/ruby/src/trunk/basictest/test.rb:assignment ..........OK 10 I, [2024-05-05T22:08:29.126169 #4159776] INFO -- : /tmp/ruby/src/trunk/basictest/test.rb:call ......OK 6 I, [2024-05-05T22:08:29.126224 #4159776] INFO -- : /tmp/ruby/src/trunk/basictest/test.rb:proc .........OK 9 I, [2024-05-05T22:08:29.226529 #4159776] INFO -- : /tmp/ruby/src/trunk/basictest/test.rb:signal ..OK 2 I, [2024-05-05T22:08:29.227090 #4159776] INFO -- : /tmp/ruby/src/trunk/basictest/test.rb:eval ...........................OK 27 I, [2024-05-05T22:08:29.328230 #4159776] INFO -- : /tmp/ruby/src/trunk/basictest/test.rb:system ........OK 8 I, [2024-05-05T22:08:29.328293 #4159776] INFO -- : /tmp/ruby/src/trunk/basictest/test.rb:const .....OK 5 I, [2024-05-05T22:08:29.328308 #4159776] INFO -- : /tmp/ruby/src/trunk/basictest/test.rb:clone .....OK 5 I, [2024-05-05T22:08:29.328401 #4159776] INFO -- : /tmp/ruby/src/trunk/basictest/test.rb:marshal ....OK 4 I, [2024-05-05T22:08:29.328519 #4159776] INFO -- : /tmp/ruby/src/trunk/basictest/test.rb:pack ....OK 4 I, [2024-05-05T22:08:29.328541 #4159776] INFO -- : /tmp/ruby/src/trunk/basictest/test.rb:math ..OK 2 I, [2024-05-05T22:08:29.328548 #4159776] INFO -- : /tmp/ruby/src/trunk/basictest/test.rb:struct ......OK 6 I, [2024-05-05T22:08:29.328670 #4159776] INFO -- : /tmp/ruby/src/trunk/basictest/test.rb:variable ............OK 12 I, [2024-05-05T22:08:29.328692 #4159776] INFO -- : /tmp/ruby/src/trunk/basictest/test.rb:trace ...OK 3 I, [2024-05-05T22:08:29.328699 #4159776] INFO -- : /tmp/ruby/src/trunk/basictest/test.rb:defined? ............OK 12 I, [2024-05-05T22:08:29.328741 #4159776] INFO -- : /tmp/ruby/src/trunk/basictest/test.rb:alias ......OK 6 I, [2024-05-05T22:08:29.329117 #4159776] INFO -- : /tmp/ruby/src/trunk/basictest/test.rb:path .......................OK 23 I, [2024-05-05T22:08:29.362932 #4159776] INFO -- : /tmp/ruby/src/trunk/basictest/test.rb:gc ....OK 4 I, [2024-05-05T22:08:29.365314 #4159776] INFO -- : I, [2024-05-05T22:08:29.365341 #4159776] INFO -- : test succeeded I, [2024-05-05T22:08:29.366752 #4159776] INFO -- : $$$[end] "make yes-test-basic TESTS='-j20'" exit with 0. I, [2024-05-05T22:08:29.366881 #4159776] INFO -- : $$$[beg] make yes-test-all TESTOPTS='--stderr-on-failure' TESTS='-j20' I, [2024-05-05T22:08:29.454467 #4159776] INFO -- : BASERUBY = /usr/bin/ruby --disable=gems I, [2024-05-05T22:08:29.454507 #4159776] INFO -- : CC = gcc I, [2024-05-05T22:08:29.454513 #4159776] INFO -- : LD = ld I, [2024-05-05T22:08:29.454516 #4159776] INFO -- : LDSHARED = gcc -shared I, [2024-05-05T22:08:29.454521 #4159776] INFO -- : CFLAGS = -O3 -fno-fast-math -ggdb3 -Wall -Wextra -Wdeprecated-declarations -Wdiv-by-zero -Wduplicated-cond -Wimplicit-function-declaration -Wimplicit-int -Wpointer-arith -Wwrite-strings -Wold-style-definition -Wimplicit-fallthrough=0 -Wmissing-noreturn -Wno-cast-function-type -Wno-constant-logical-operand -Wno-long-long -Wno-missing-field-initializers -Wno-overlength-strings -Wno-packed-bitfield-compat -Wno-parentheses-equality -Wno-self-assign -Wno-tautological-compare -Wno-unused-parameter -Wno-unused-value -Wsuggest-attribute=format -Wsuggest-attribute=noreturn -Wunused-variable -Wmisleading-indentation -Wundef -fPIC I, [2024-05-05T22:08:29.454526 #4159776] INFO -- : XCFLAGS = -U_FORTIFY_SOURCE -D_FORTIFY_SOURCE=2 -fstack-protector-strong -fno-strict-overflow -fvisibility=hidden -fexcess-precision=standard -DRUBY_EXPORT -I. -I.ext/include/x86_64-linux -I/tmp/ruby/src/trunk/include -I/tmp/ruby/src/trunk -I/tmp/ruby/src/trunk/prism -I/tmp/ruby/src/trunk/enc/unicode/15.0.0 I, [2024-05-05T22:08:29.454530 #4159776] INFO -- : CPPFLAGS = I, [2024-05-05T22:08:29.454534 #4159776] INFO -- : DLDFLAGS = -Wl,--compress-debug-sections=zlib -Wl,-soname,libruby.so.3.4 -fstack-protector-strong I, [2024-05-05T22:08:29.454538 #4159776] INFO -- : SOLIBS = -lz -lrt -lrt -lgmp -ldl -lcrypt -lm -lpthread I, [2024-05-05T22:08:29.454542 #4159776] INFO -- : LANG = en_US.UTF-8 I, [2024-05-05T22:08:29.454545 #4159776] INFO -- : LC_ALL = I, [2024-05-05T22:08:29.454549 #4159776] INFO -- : LC_CTYPE = I, [2024-05-05T22:08:29.454553 #4159776] INFO -- : MFLAGS = I, [2024-05-05T22:08:29.454556 #4159776] INFO -- : RUSTC = no I, [2024-05-05T22:08:29.454560 #4159776] INFO -- : YJIT_RUSTC_ARGS = --crate-name=yjit --crate-type=staticlib --edition=2021 -g -C lto=thin -C opt-level=3 -C overflow-checks=on '--out-dir=/tmp/ruby/build/trunk/yjit/target/release/' /tmp/ruby/src/trunk/yjit/src/lib.rs I, [2024-05-05T22:08:29.455106 #4159776] INFO -- : gcc (Ubuntu 11.4.0-1ubuntu1~22.04) 11.4.0 I, [2024-05-05T22:08:29.455126 #4159776] INFO -- : Copyright (C) 2021 Free Software Foundation, Inc. I, [2024-05-05T22:08:29.455132 #4159776] INFO -- : This is free software; see the source for copying conditions. There is NO I, [2024-05-05T22:08:29.455136 #4159776] INFO -- : warranty; not even for MERCHANTABILITY or FITNESS FOR A PARTICULAR PURPOSE. I, [2024-05-05T22:08:29.455140 #4159776] INFO -- : I, [2024-05-05T22:08:29.456800 #4159776] INFO -- : generating enc.mk I, [2024-05-05T22:08:29.574852 #4159776] INFO -- : making enc I, [2024-05-05T22:08:29.592023 #4159776] INFO -- : make[1]: Entering directory '/tmp/ruby/build/trunk' I, [2024-05-05T22:08:29.592045 #4159776] INFO -- : make[1]: Nothing to be done for 'enc'. I, [2024-05-05T22:08:29.592050 #4159776] INFO -- : make[1]: Leaving directory '/tmp/ruby/build/trunk' I, [2024-05-05T22:08:29.592724 #4159776] INFO -- : making srcs under enc I, [2024-05-05T22:08:29.622189 #4159776] INFO -- : make[1]: Entering directory '/tmp/ruby/build/trunk' I, [2024-05-05T22:08:29.622210 #4159776] INFO -- : make[1]: Nothing to be done for 'srcs'. I, [2024-05-05T22:08:29.622215 #4159776] INFO -- : make[1]: Leaving directory '/tmp/ruby/build/trunk' I, [2024-05-05T22:08:29.623048 #4159776] INFO -- : generating transdb.h I, [2024-05-05T22:08:29.717317 #4159776] INFO -- : transdb.h unchanged I, [2024-05-05T22:08:29.718729 #4159776] INFO -- : making trans I, [2024-05-05T22:08:29.753162 #4159776] INFO -- : make[1]: Entering directory '/tmp/ruby/build/trunk' I, [2024-05-05T22:08:29.753183 #4159776] INFO -- : make[1]: Nothing to be done for 'trans'. I, [2024-05-05T22:08:29.753189 #4159776] INFO -- : make[1]: Leaving directory '/tmp/ruby/build/trunk' I, [2024-05-05T22:08:29.753881 #4159776] INFO -- : making encs I, [2024-05-05T22:08:29.791104 #4159776] INFO -- : make[1]: Entering directory '/tmp/ruby/build/trunk' I, [2024-05-05T22:08:29.791125 #4159776] INFO -- : make[1]: Nothing to be done for 'encs'. I, [2024-05-05T22:08:29.791131 #4159776] INFO -- : make[1]: Leaving directory '/tmp/ruby/build/trunk' I, [2024-05-05T22:08:29.792860 #4159776] INFO -- : generating makefiles ext/configure-ext.mk I, [2024-05-05T22:08:29.820894 #4159776] INFO -- : ext/configure-ext.mk updated I, [2024-05-05T22:08:29.823325 #4159776] INFO -- : make[1]: Entering directory '/tmp/ruby/build/trunk' I, [2024-05-05T22:08:31.176845 #4159776] INFO -- : make[1]: Leaving directory '/tmp/ruby/build/trunk' I, [2024-05-05T22:08:31.177472 #4159776] INFO -- : generating makefile exts.mk I, [2024-05-05T22:08:31.214617 #4159776] INFO -- : exts.mk unchanged I, [2024-05-05T22:08:31.219239 #4159776] INFO -- : make[1]: Entering directory '/tmp/ruby/build/trunk' I, [2024-05-05T22:08:31.429455 #4159776] INFO -- : make[2]: Entering directory '/tmp/ruby/build/trunk/ext/coverage' I, [2024-05-05T22:08:31.432237 #4159776] INFO -- : make[2]: Leaving directory '/tmp/ruby/build/trunk/ext/coverage' I, [2024-05-05T22:08:31.436049 #4159776] INFO -- : make[2]: Entering directory '/tmp/ruby/build/trunk/ext/date' I, [2024-05-05T22:08:31.439079 #4159776] INFO -- : make[2]: Leaving directory '/tmp/ruby/build/trunk/ext/date' I, [2024-05-05T22:08:31.441323 #4159776] INFO -- : make[2]: Entering directory '/tmp/ruby/build/trunk/ext/digest' I, [2024-05-05T22:08:31.446796 #4159776] INFO -- : make[2]: Leaving directory '/tmp/ruby/build/trunk/ext/digest' I, [2024-05-05T22:08:31.462380 #4159776] INFO -- : make[2]: Entering directory '/tmp/ruby/build/trunk/ext/digest/sha2' I, [2024-05-05T22:08:31.465253 #4159776] INFO -- : make[2]: Leaving directory '/tmp/ruby/build/trunk/ext/digest/sha2' I, [2024-05-05T22:08:31.478053 #4159776] INFO -- : make[2]: Entering directory '/tmp/ruby/build/trunk/ext/fiddle' I, [2024-05-05T22:08:31.484345 #4159776] INFO -- : make[2]: Leaving directory '/tmp/ruby/build/trunk/ext/fiddle' I, [2024-05-05T22:08:31.487236 #4159776] INFO -- : make[2]: Entering directory '/tmp/ruby/build/trunk/ext/io/console' I, [2024-05-05T22:08:31.489781 #4159776] INFO -- : make[2]: Leaving directory '/tmp/ruby/build/trunk/ext/io/console' I, [2024-05-05T22:08:31.497418 #4159776] INFO -- : make[2]: Entering directory '/tmp/ruby/build/trunk/ext/json' I, [2024-05-05T22:08:31.503652 #4159776] INFO -- : make[2]: Leaving directory '/tmp/ruby/build/trunk/ext/json' I, [2024-05-05T22:08:31.512521 #4159776] INFO -- : make[2]: Entering directory '/tmp/ruby/build/trunk/ext/monitor' I, [2024-05-05T22:08:31.515067 #4159776] INFO -- : make[2]: Leaving directory '/tmp/ruby/build/trunk/ext/monitor' I, [2024-05-05T22:08:31.519224 #4159776] INFO -- : make[2]: Entering directory '/tmp/ruby/build/trunk/ext/objspace' I, [2024-05-05T22:08:31.522839 #4159776] INFO -- : make[2]: Leaving directory '/tmp/ruby/build/trunk/ext/objspace' I, [2024-05-05T22:08:31.534694 #4159776] INFO -- : make[2]: Entering directory '/tmp/ruby/build/trunk/ext/openssl' I, [2024-05-05T22:08:31.547814 #4159776] INFO -- : make[2]: Leaving directory '/tmp/ruby/build/trunk/ext/openssl' I, [2024-05-05T22:08:31.550649 #4159776] INFO -- : make[2]: Entering directory '/tmp/ruby/build/trunk/ext/pathname' I, [2024-05-05T22:08:31.552963 #4159776] INFO -- : make[2]: Leaving directory '/tmp/ruby/build/trunk/ext/pathname' I, [2024-05-05T22:08:31.557161 #4159776] INFO -- : make[2]: Entering directory '/tmp/ruby/build/trunk/ext/psych' I, [2024-05-05T22:08:31.571870 #4159776] INFO -- : make[2]: Leaving directory '/tmp/ruby/build/trunk/ext/psych' I, [2024-05-05T22:08:31.574909 #4159776] INFO -- : make[2]: Entering directory '/tmp/ruby/build/trunk/ext/pty' I, [2024-05-05T22:08:31.577395 #4159776] INFO -- : make[2]: Leaving directory '/tmp/ruby/build/trunk/ext/pty' I, [2024-05-05T22:08:31.586806 #4159776] INFO -- : make[2]: Entering directory '/tmp/ruby/build/trunk/ext/ripper' I, [2024-05-05T22:08:31.591795 #4159776] INFO -- : make[2]: Leaving directory '/tmp/ruby/build/trunk/ext/ripper' I, [2024-05-05T22:08:31.593309 #4159776] INFO -- : make[2]: Entering directory '/tmp/ruby/build/trunk/ext/rubyvm' I, [2024-05-05T22:08:31.595369 #4159776] INFO -- : make[2]: Leaving directory '/tmp/ruby/build/trunk/ext/rubyvm' I, [2024-05-05T22:08:31.603138 #4159776] INFO -- : make[2]: Entering directory '/tmp/ruby/build/trunk/ext/socket' I, [2024-05-05T22:08:31.609523 #4159776] INFO -- : make[2]: Leaving directory '/tmp/ruby/build/trunk/ext/socket' I, [2024-05-05T22:08:31.620316 #4159776] INFO -- : make[2]: Entering directory '/tmp/ruby/build/trunk/.bundle/gems/bigdecimal-3.1.7/ext/bigdecimal' I, [2024-05-05T22:08:31.643057 #4159776] INFO -- : make[2]: Leaving directory '/tmp/ruby/build/trunk/.bundle/gems/bigdecimal-3.1.7/ext/bigdecimal' I, [2024-05-05T22:08:31.644993 #4159776] INFO -- : make[2]: Entering directory '/tmp/ruby/build/trunk/.bundle/gems/debug-1.9.2/ext/debug' I, [2024-05-05T22:08:31.666775 #4159776] INFO -- : make[2]: Leaving directory '/tmp/ruby/build/trunk/.bundle/gems/debug-1.9.2/ext/debug' I, [2024-05-05T22:08:31.668824 #4159776] INFO -- : make[2]: Entering directory '/tmp/ruby/build/trunk/.bundle/gems/nkf-0.2.0/ext/nkf' I, [2024-05-05T22:08:31.690381 #4159776] INFO -- : make[2]: Leaving directory '/tmp/ruby/build/trunk/.bundle/gems/nkf-0.2.0/ext/nkf' I, [2024-05-05T22:08:31.692247 #4159776] INFO -- : make[2]: Entering directory '/tmp/ruby/build/trunk/.bundle/gems/racc-1.7.3/ext/racc/cparse' I, [2024-05-05T22:08:31.713577 #4159776] INFO -- : make[2]: Leaving directory '/tmp/ruby/build/trunk/.bundle/gems/racc-1.7.3/ext/racc/cparse' I, [2024-05-05T22:08:31.715940 #4159776] INFO -- : make[2]: Entering directory '/tmp/ruby/build/trunk/.bundle/gems/rbs-3.4.4/ext/rbs_extension' I, [2024-05-05T22:08:31.737810 #4159776] INFO -- : make[2]: Leaving directory '/tmp/ruby/build/trunk/.bundle/gems/rbs-3.4.4/ext/rbs_extension' I, [2024-05-05T22:08:31.739967 #4159776] INFO -- : make[2]: Entering directory '/tmp/ruby/build/trunk/.bundle/gems/syslog-0.1.2/ext/syslog' I, [2024-05-05T22:08:31.761889 #4159776] INFO -- : make[2]: Leaving directory '/tmp/ruby/build/trunk/.bundle/gems/syslog-0.1.2/ext/syslog' I, [2024-05-05T22:08:31.785249 #4159776] INFO -- : make[2]: Entering directory '/tmp/ruby/build/trunk' I, [2024-05-05T22:08:31.850462 #4159776] INFO -- : make[2]: 'ruby' is up to date. I, [2024-05-05T22:08:31.850505 #4159776] INFO -- : make[2]: Leaving directory '/tmp/ruby/build/trunk' I, [2024-05-05T22:08:31.850857 #4159776] INFO -- : make[1]: Leaving directory '/tmp/ruby/build/trunk' I, [2024-05-05T22:08:31.854611 #4159776] INFO -- : make[1]: Entering directory '/tmp/ruby/build/trunk' I, [2024-05-05T22:08:31.854632 #4159776] INFO -- : make[1]: Nothing to be done for 'note'. I, [2024-05-05T22:08:31.854642 #4159776] INFO -- : make[1]: Leaving directory '/tmp/ruby/build/trunk' I, [2024-05-05T22:08:31.929606 #4159776] INFO -- : Run options: I, [2024-05-05T22:08:31.929673 #4159776] INFO -- : --seed=49850 I, [2024-05-05T22:08:31.929680 #4159776] INFO -- : "--ruby=./miniruby -I/tmp/ruby/src/trunk/lib -I. -I.ext/common /tmp/ruby/src/trunk/tool/runruby.rb --extout=.ext -- --disable-gems" I, [2024-05-05T22:08:31.929685 #4159776] INFO -- : --excludes-dir=/tmp/ruby/src/trunk/test/.excludes I, [2024-05-05T22:08:31.929690 #4159776] INFO -- : --name=!/memory_leak/ I, [2024-05-05T22:08:31.929695 #4159776] INFO -- : --stderr-on-failure I, [2024-05-05T22:08:31.929699 #4159776] INFO -- : -j20 I, [2024-05-05T22:08:31.929704 #4159776] INFO -- : I, [2024-05-05T22:08:31.929708 #4159776] INFO -- : # Running tests: I, [2024-05-05T22:08:31.929713 #4159776] INFO -- : I, [2024-05-05T22:08:32.077214 #4159776] INFO -- : [ 1/885] 7254=test_yamlstore I, [2024-05-05T22:08:32.077316 #4159776] INFO -- : [ 2/885] 7239=test_gem_installer I, [2024-05-05T22:08:32.077395 #4159776] INFO -- : [ 3/885] 7240=test_rdoc_parser_rd I, [2024-05-05T22:08:32.077481 #4159776] INFO -- : [ 4/885] 7237=test_date_strftime I, [2024-05-05T22:08:32.077777 #4159776] INFO -- : [ 5/885] 7238=test_irb I, [2024-05-05T22:08:32.080397 #4159776] INFO -- : [ 6/885] 7241=test_const I, [2024-05-05T22:08:32.080720 #4159776] INFO -- : [ 7/885] 7252=test_class I, [2024-05-05T22:08:32.080751 #4159776] INFO -- : [ 8/885] 7251=test_rdoc_normal_class I, [2024-05-05T22:08:32.080991 #4159776] INFO -- : [ 9/885] 7253=test_load I, [2024-05-05T22:08:32.082861 #4159776] INFO -- : [ 10/885] 7250=json_string_matching_test I, [2024-05-05T22:08:32.088096 #4159776] INFO -- : [ 11/885] 7241=test_random I, [2024-05-05T22:08:32.095737 #4159776] INFO -- : [ 12/885] 7253=test_asn1 I, [2024-05-05T22:08:32.100199 #4159776] INFO -- : [ 13/885] 7250=test_tempfile I, [2024-05-05T22:08:32.110531 #4159776] INFO -- : [ 14/885] 7243=parse_comments_test I, [2024-05-05T22:08:32.110893 #4159776] INFO -- : [ 15/885] 7242=test_noarg I, [2024-05-05T22:08:32.116664 #4159776] INFO -- : [ 16/885] 7244=test_queue I, [2024-05-05T22:08:32.116729 #4159776] INFO -- : [ 17/885] 7245=test_function I, [2024-05-05T22:08:32.116743 #4159776] INFO -- : [ 18/885] 7246=test_internal_ivar I, [2024-05-05T22:08:32.116858 #4159776] INFO -- : [ 19/885] 7247=test_gem_resolver_index_specification I, [2024-05-05T22:08:32.116915 #4159776] INFO -- : [ 20/885] 7248=test_basicsocket I, [2024-05-05T22:08:32.117546 #4159776] INFO -- : [ 21/885] 7249=test_utf32 I, [2024-05-05T22:08:32.119793 #4159776] INFO -- : [ 22/885] 7254=test_duplicate I, [2024-05-05T22:08:32.120419 #4159776] INFO -- : [ 23/885] 7246=test_rdoc_markup I, [2024-05-05T22:08:32.122046 #4159776] INFO -- : [ 24/885] 7241=test_gem_commands_help_command I, [2024-05-05T22:08:32.124729 #4159776] INFO -- : [ 25/885] 7254=test_tracepoint I, [2024-05-05T22:08:32.129292 #4159776] INFO -- : [ 26/885] 7249=test_prettyprint I, [2024-05-05T22:08:32.138148 #4159776] INFO -- : [ 27/885] 7248=test_too_many_dummy_encodings I, [2024-05-05T22:08:32.143371 #4159776] INFO -- : [ 28/885] 7255=test_stack I, [2024-05-05T22:08:32.151368 #4159776] INFO -- : [ 29/885] 7253=test_gem_commands_list_command I, [2024-05-05T22:08:32.153477 #4159776] INFO -- : [ 30/885] 7256=test_reqarg I, [2024-05-05T22:08:32.162662 #4159776] INFO -- : [ 31/885] 7244=test_rdoc_include I, [2024-05-05T22:08:32.187026 #4159776] INFO -- : [ 32/885] 7249=test_fileutils I, [2024-05-05T22:08:32.205291 #4159776] INFO -- : [ 33/885] 7243=test_string_processing I, [2024-05-05T22:08:32.213323 #4159776] INFO -- : [ 34/885] 7248=test_resource I, [2024-05-05T22:08:32.260905 #4159776] INFO -- : [ 35/885] 7246=test_gem_commands_signin_command I, [2024-05-05T22:08:32.264184 #4159776] INFO -- : [ 36/885] 7248=test_emitter I, [2024-05-05T22:08:32.274799 #4159776] INFO -- : [ 37/885] 7243=test_ldap I, [2024-05-05T22:08:32.276380 #4159776] INFO -- : [ 38/885] 7240=test_gem_version I, [2024-05-05T22:08:32.284679 #4159776] INFO -- : [ 39/885] 7248=test_rdoc_options I, [2024-05-05T22:08:32.287598 #4159776] INFO -- : [ 40/885] 7253=test_cesu8 I, [2024-05-05T22:08:32.291062 #4159776] INFO -- : [ 41/885] 7253=test_econv I, [2024-05-05T22:08:32.303943 #4159776] INFO -- : [ 42/885] 7243=test_rdoc_markup_verbatim I, [2024-05-05T22:08:32.335603 #4159776] INFO -- : [ 43/885] 7251=test_inlinecache I, [2024-05-05T22:08:32.341207 #4159776] INFO -- : [ 44/885] 7245=test_gem_dependency I, [2024-05-05T22:08:32.341275 #4159776] INFO -- : [ 45/885] 7242=test_gem_resolver_specification I, [2024-05-05T22:08:32.343046 #4159776] INFO -- : [ 46/885] 7250=test_path_to_class I, [2024-05-05T22:08:32.353565 #4159776] INFO -- : [ 47/885] 7250=test_gem_ext_ext_conf_builder I, [2024-05-05T22:08:32.381111 #4159776] INFO -- : [ 48/885] 7244=test_gem_stub_specification I, [2024-05-05T22:08:32.387134 #4159776] INFO -- : [ 49/885] 7254=test_method_cache I, [2024-05-05T22:08:32.388868 #4159776] INFO -- : [ 50/885] 7254=test_frozen_error I, [2024-05-05T22:08:32.391826 #4159776] INFO -- : [ 51/885] 7254=test_gem_commands_search_command I, [2024-05-05T22:08:32.433274 #4159776] INFO -- : [ 52/885] 7238=test_complex I, [2024-05-05T22:08:32.433345 #4159776] INFO -- : [ 53/885] 7241=test_scanner_events I, [2024-05-05T22:08:32.438826 #4159776] INFO -- : [ 54/885] 7247=test_gem_resolver_installed_specification I, [2024-05-05T22:08:32.443341 #4159776] INFO -- : [ 55/885] 7251=test_mdns I, [2024-05-05T22:08:32.448220 #4159776] INFO -- : [ 56/885] 7243=test_parse I, [2024-05-05T22:08:32.462194 #4159776] INFO -- : [ 57/885] 7247=test_gem_remote_fetcher I, [2024-05-05T22:08:32.470047 #4159776] INFO -- : [ 58/885] 7251=test_yaml I, [2024-05-05T22:08:32.488522 #4159776] INFO -- : [ 59/885] 7237=test_forwardable I, [2024-05-05T22:08:32.504647 #4159776] INFO -- : [ 60/885] 7237=test_handle I, [2024-05-05T22:08:32.509707 #4159776] INFO -- : [ 61/885] 7241=test_wait I, [2024-05-05T22:08:32.544256 #4159776] INFO -- : [ 62/885] 7246=test_big2str I, [2024-05-05T22:08:32.549796 #4159776] INFO -- : [ 63/885] 7246=test_bmethod I, [2024-05-05T22:08:32.553811 #4159776] INFO -- : [ 64/885] 7256=test_ractor I, [2024-05-05T22:08:32.561412 #4159776] INFO -- : [ 65/885] 7237=test_euc_tw I, [2024-05-05T22:08:32.563795 #4159776] INFO -- : [ 66/885] 7237=test_ansi_without_terminfo I, [2024-05-05T22:08:32.567327 #4159776] INFO -- : [ 67/885] 7251=test_gem_commands_sources_command I, [2024-05-05T22:08:32.570999 #4159776] INFO -- : [ 68/885] 7241=test_nowrite I, [2024-05-05T22:08:32.575514 #4159776] INFO -- : [ 69/885] 7256=test_thread_queue I, [2024-05-05T22:08:32.575581 #4159776] INFO -- : [ 70/885] 7246=test_rdoc_markup_formatter I, [2024-05-05T22:08:32.580841 #4159776] INFO -- : [ 71/885] 7242=test_comparable I, [2024-05-05T22:08:32.580912 #4159776] INFO -- : [ 72/885] 7254=test_rdoc_parser_c I, [2024-05-05T22:08:32.587016 #4159776] INFO -- : [ 73/885] 7246=test_io_timeout I, [2024-05-05T22:08:32.587773 #4159776] INFO -- : [ 74/885] 7240=json_fixtures_test I, [2024-05-05T22:08:32.590534 #4159776] INFO -- : [ 75/885] 7246=test_shapes I, [2024-05-05T22:08:32.590600 #4159776] INFO -- : [ 76/885] 7242=test_cstr I, [2024-05-05T22:08:32.596990 #4159776] INFO -- : [ 77/885] 7241=test_pstore I, [2024-05-05T22:08:32.599226 #4159776] INFO -- : [ 78/885] 7246=test_profile_frames I, [2024-05-05T22:08:32.602030 #4159776] INFO -- : [ 79/885] 7238=test_gbk I, [2024-05-05T22:08:32.603065 #4159776] INFO -- : [ 80/885] 7240=test_class2name I, [2024-05-05T22:08:32.606588 #4159776] INFO -- : [ 81/885] 7238=test_enc_str_buf_cat I, [2024-05-05T22:08:32.607068 #4159776] INFO -- : [ 82/885] 7240=test_gem_ext_cmake_builder I, [2024-05-05T22:08:32.609624 #4159776] INFO -- : [ 83/885] 7238=test_gem_commands_contents_command I, [2024-05-05T22:08:32.611650 #4159776] INFO -- : [ 84/885] 7237=test_cgi_util I, [2024-05-05T22:08:32.629075 #4159776] INFO -- : [ 85/885] 7240=test_require I, [2024-05-05T22:08:32.642696 #4159776] INFO -- : [ 86/885] 7241=test_marshalable I, [2024-05-05T22:08:32.649513 #4159776] INFO -- : [ 87/885] 7241=test_digest I, [2024-05-05T22:08:32.677390 #4159776] INFO -- : [ 88/885] 7245=test_ractor I, [2024-05-05T22:08:32.684056 #4159776] INFO -- : [ 89/885] 7244=test_find I, [2024-05-05T22:08:32.726244 #4159776] INFO -- : [ 90/885] 7244=test_fiddle I, [2024-05-05T22:08:32.734289 #4159776] INFO -- : [ 91/885] 7249=test_wss I, [2024-05-05T22:08:32.749543 #4159776] INFO -- : [ 92/885] 7249=test_gem_available_set I, [2024-05-05T22:08:32.771139 #4159776] INFO -- : [ 93/885] 7248=test_rdoc_markdown I, [2024-05-05T22:08:32.774111 #4159776] INFO -- : [ 94/885] 7244=test_modify_expand I, [2024-05-05T22:08:32.778409 #4159776] INFO -- : [ 95/885] 7244=test_rdoc_any_method I, [2024-05-05T22:08:32.788311 #4159776] INFO -- : [ 96/885] 7246=test_file I, [2024-05-05T22:08:32.804749 #4159776] INFO -- : [ 97/885] 7246=test_coverage I, [2024-05-05T22:08:32.854018 #4159776] INFO -- : [ 98/885] 7245=test_rdoc_encoding I, [2024-05-05T22:08:32.879124 #4159776] INFO -- : [ 99/885] 7237=test_gem_package_tar_reader I, [2024-05-05T22:08:32.928762 #4159776] INFO -- : [100/885] 7251=regexp_test I, [2024-05-05T22:08:32.937760 #4159776] INFO -- : [101/885] 7238=test_init I, [2024-05-05T22:08:32.953154 #4159776] INFO -- : [102/885] 7242=test_complexrational I, [2024-05-05T22:08:32.957573 #4159776] INFO -- : [103/885] 7242=test_pathname I, [2024-05-05T22:08:32.976403 #4159776] INFO -- : [104/885] 7243=test_gem_commands_owner_command I, [2024-05-05T22:08:32.992506 #4159776] INFO -- : [105/885] 7251=test_gem_source_vendor I, [2024-05-05T22:08:32.995272 #4159776] INFO -- : [106/885] 7245=test_recorder I, [2024-05-05T22:08:33.002199 #4159776] INFO -- : [107/885] 7251=test_rdoc_constant I, [2024-05-05T22:08:33.008266 #4159776] INFO -- : [108/885] 7249=test_deprecate I, [2024-05-05T22:08:33.012747 #4159776] INFO -- : [109/885] 7254=test_formatter I, [2024-05-05T22:08:33.013649 #4159776] INFO -- : [110/885] 7245=test_bash_completion I, [2024-05-05T22:08:33.015112 #4159776] INFO -- : [111/885] 7248=test_pkcs12 I, [2024-05-05T22:08:33.020481 #4159776] INFO -- : [112/885] 7245=test_system I, [2024-05-05T22:08:33.021924 #4159776] INFO -- : [113/885] 7254=test_iseq_load I, [2024-05-05T22:08:33.032872 #4159776] INFO -- : [114/885] 7249=test_gem_util I, [2024-05-05T22:08:33.083457 #4159776] INFO -- : [115/885] 7251=test_gem_package_tar_header I, [2024-05-05T22:08:33.084088 #4159776] INFO -- : [116/885] 7244=test_bigzero I, [2024-05-05T22:08:33.088468 #4159776] INFO -- : [117/885] 7244=test_pkey_dh I, [2024-05-05T22:08:33.105639 #4159776] INFO -- : [118/885] 7255=test_gem_resolver_activation_request I, [2024-05-05T22:08:33.126212 #4159776] INFO -- : [119/885] 7251=test_protocol I, [2024-05-05T22:08:33.134784 #4159776] INFO -- : [120/885] 7237=test_getopts I, [2024-05-05T22:08:33.138864 #4159776] INFO -- : [121/885] 7237=test_ripper I, [2024-05-05T22:08:33.163288 #4159776] INFO -- : [122/885] 7244=test_gem_config_file I, [2024-05-05T22:08:33.169417 #4159776] INFO -- : [123/885] 7242=test_etc I, [2024-05-05T22:08:33.225482 #4159776] INFO -- : [124/885] 7249=test_yjit_exit_locations I, [2024-05-05T22:08:33.225626 #4159776] INFO -- : [125/885] 7249=test_yaml_tree I, [2024-05-05T22:08:33.255509 #4159776] INFO -- : [126/885] 7249=test_config I, [2024-05-05T22:08:33.256558 #4159776] INFO -- : [127/885] 7242=test_sleep I, [2024-05-05T22:08:33.260294 #4159776] INFO -- : [128/885] 7255=test_gc I, [2024-05-05T22:08:33.265410 #4159776] INFO -- : [129/885] 7255=test_math I, [2024-05-05T22:08:33.272073 #4159776] INFO -- : [130/885] 7244=test_gem_commands_fetch_command I, [2024-05-05T22:08:33.282094 #4159776] INFO -- : [131/885] 7255=test_libs I, [2024-05-05T22:08:33.292320 #4159776] INFO -- : [132/885] 7249=test_unicode_escape I, [2024-05-05T22:08:33.304062 #4159776] INFO -- : [133/885] 7238=test_io I, [2024-05-05T22:08:33.318630 #4159776] INFO -- : [134/885] 7255=test_autoload I, [2024-05-05T22:08:33.326429 #4159776] INFO -- : [135/885] 7253=test_utf16 I, [2024-05-05T22:08:33.334969 #4159776] INFO -- : [136/885] 7253=test_rendering I, [2024-05-05T22:08:33.340502 #4159776] INFO -- : [137/885] 7248=test_face I, [2024-05-05T22:08:33.386883 #4159776] INFO -- : [138/885] 7249=test_case I, [2024-05-05T22:08:33.396844 #4159776] INFO -- : [139/885] 7248=test_sizeof I, [2024-05-05T22:08:33.418153 #4159776] INFO -- : [140/885] 7249=test_rdoc_task I, [2024-05-05T22:08:33.430515 #4159776] INFO -- : [141/885] 7249=test_gem_resolver_conflict I, [2024-05-05T22:08:33.436293 #4159776] INFO -- : [142/885] 7251=test_io_buffer I, [2024-05-05T22:08:33.441070 #4159776] INFO -- : [143/885] 7249=ruby_parser_test I, [2024-05-05T22:08:33.463679 #4159776] INFO -- : [144/885] 7244=test_backtrace I, [2024-05-05T22:08:33.476507 #4159776] INFO -- : [145/885] 7253=test_pack I, [2024-05-05T22:08:33.490002 #4159776] INFO -- : [146/885] 7253=test_rdoc_markup_indented_paragraph I, [2024-05-05T22:08:33.521982 #4159776] INFO -- : [147/885] 7249=test_rdoc_require I, [2024-05-05T22:08:33.525157 #4159776] INFO -- : [148/885] 7241=locals_test I, [2024-05-05T22:08:33.537797 #4159776] INFO -- : [149/885] 7237=test_readpartial I, [2024-05-05T22:08:33.544917 #4159776] INFO -- : [150/885] 7251=test_clone I, [2024-05-05T22:08:33.575615 #4159776] INFO -- : [151/885] 7246=test_gem_commands_install_command I, [2024-05-05T22:08:33.661012 #4159776] INFO -- : [152/885] 7253=test_array I, [2024-05-05T22:08:33.680909 #4159776] INFO -- : [153/885] 7253=test_optparse I, [2024-05-05T22:08:33.741525 #4159776] INFO -- : [154/885] 7253=test_fstring I, [2024-05-05T22:08:33.746781 #4159776] INFO -- : [155/885] 7240=test_typeddata I, [2024-05-05T22:08:33.751775 #4159776] INFO -- : [156/885] 7249=test_gem_resolver_best_set I, [2024-05-05T22:08:33.753894 #4159776] INFO -- : [157/885] 7251=encoding_test I, [2024-05-05T22:08:33.757186 #4159776] INFO -- : [158/885] 7243=test_rdoc_markup_to_html_crossref I, [2024-05-05T22:08:33.794671 #4159776] INFO -- : [159/885] 7250=test_rdoc_markup_raw I, [2024-05-05T22:08:33.830466 #4159776] INFO -- : [160/885] 7249=test_webauthn_poller I, [2024-05-05T22:08:33.859750 #4159776] INFO -- : [161/885] 7251=test_rat I, [2024-05-05T22:08:33.860282 #4159776] INFO -- : [162/885] 7245=test_files_sample I, [2024-05-05T22:08:33.868104 #4159776] INFO -- : [163/885] 7253=test_stringscanner I, [2024-05-05T22:08:33.868470 #4159776] INFO -- : [164/885] 7251=test_yield I, [2024-05-05T22:08:33.887769 #4159776] INFO -- : [165/885] 7252=test_rdoc_alias I, [2024-05-05T22:08:33.898758 #4159776] INFO -- : [166/885] 7250=test_convertible I, [2024-05-05T22:08:33.904845 #4159776] INFO -- : [167/885] 7253=parser_test I, [2024-05-05T22:08:33.918393 #4159776] INFO -- : [168/885] 7245=test_undef I, [2024-05-05T22:08:33.923368 #4159776] INFO -- : [169/885] 7245=test_objspace I, [2024-05-05T22:08:33.923630 #4159776] INFO -- : [170/885] 7241=ripper_test I, [2024-05-05T22:08:33.943954 #4159776] INFO -- : [171/885] 7237=test_line_editor I, [2024-05-05T22:08:33.947323 #4159776] INFO -- : [172/885] 7240=test_gem_requirement I, [2024-05-05T22:08:33.949282 #4159776] INFO -- : [173/885] 7237=test_sprintf I, [2024-05-05T22:08:33.973962 #4159776] INFO -- : [174/885] 7249=comments_test I, [2024-05-05T22:08:33.979381 #4159776] INFO -- : [175/885] 7249=test_string_memory I, [2024-05-05T22:08:33.991108 #4159776] INFO -- : [176/885] 7253=test_gem_security_trust_dir I, [2024-05-05T22:08:34.029681 #4159776] INFO -- : [177/885] 7253=test_set I, [2024-05-05T22:08:34.032379 #4159776] INFO -- : [178/885] 7249=test_show_source I, [2024-05-05T22:08:34.042434 #4159776] INFO -- : [179/885] 7253=test_remote_fetch_error I, [2024-05-05T22:08:34.051230 #4159776] INFO -- : [180/885] 7252=test_have_library I, [2024-05-05T22:08:34.053791 #4159776] INFO -- : [181/885] 7253=test_gem_commands_stale_command I, [2024-05-05T22:08:34.055544 #4159776] INFO -- : [182/885] 7240=test_c_struct_entry I, [2024-05-05T22:08:34.072762 #4159776] INFO -- : [183/885] 7253=test_lock_native_thread I, [2024-05-05T22:08:34.133575 #4159776] INFO -- : [184/885] 7249=test_win32ole_typelib I, [2024-05-05T22:08:34.136570 #4159776] INFO -- : [185/885] 7249=test_protect I, [2024-05-05T22:08:34.140061 #4159776] INFO -- : [186/885] 7249=test_raise_exception I, [2024-05-05T22:08:34.150325 #4159776] INFO -- : [187/885] 7237=test_gem_request_set_lockfile I, [2024-05-05T22:08:34.151732 #4159776] INFO -- : [188/885] 7254=test_external_new I, [2024-05-05T22:08:34.157413 #4159776] INFO -- : [189/885] 7254=test_postponed_job I, [2024-05-05T22:08:34.190814 #4159776] INFO -- : [190/885] 7243=test_alias_and_anchor I, [2024-05-05T22:08:34.199612 #4159776] INFO -- : [191/885] 7243=test_hash I, [2024-05-05T22:08:34.215515 #4159776] INFO -- : [192/885] 7243=test_gem_resolver_dependency_request I, [2024-05-05T22:08:34.222462 #4159776] INFO -- : [193/885] 7240=test_tree_builder I, [2024-05-05T22:08:34.226122 #4159776] INFO -- : [194/885] 7240=test_m17n I, [2024-05-05T22:08:34.241763 #4159776] INFO -- : [195/885] 7243=test_gem_commands_environment_command I, [2024-05-05T22:08:34.293668 #4159776] INFO -- : [196/885] 7240=test_ws I, [2024-05-05T22:08:34.294706 #4159776] INFO -- : [197/885] 7243=test_yjit I, [2024-05-05T22:08:34.301622 #4159776] INFO -- : [198/885] 7243=test_workspace I, [2024-05-05T22:08:34.308328 #4159776] INFO -- : [199/885] 7240=test_weakmap I, [2024-05-05T22:08:34.374495 #4159776] INFO -- : [200/885] 7253=test_framework I, [2024-05-05T22:08:34.402783 #4159776] INFO -- : [201/885] 7253=test_ns_spki I, [2024-05-05T22:08:34.411716 #4159776] INFO -- : [202/885] 7247=test_kill_ring I, [2024-05-05T22:08:34.421963 #4159776] INFO -- : [203/885] 7241=test_argf I, [2024-05-05T22:08:34.422715 #4159776] INFO -- : [204/885] 7253=test_type_completor I, [2024-05-05T22:08:34.429151 #4159776] INFO -- : [205/885] 7253=test_summary I, [2024-05-05T22:08:34.452068 #4159776] INFO -- : [206/885] 7237=test_console_attr I, [2024-05-05T22:08:34.453979 #4159776] INFO -- : [207/885] 7237=test_date_attr I, [2024-05-05T22:08:34.460288 #4159776] INFO -- : [208/885] 7237=test_ellipsize I, [2024-05-05T22:08:34.461641 #4159776] INFO -- : [209/885] 7243=warnings_test I, [2024-05-05T22:08:34.464983 #4159776] INFO -- : [210/885] 7247=test_kwargs I, [2024-05-05T22:08:34.465894 #4159776] INFO -- : [211/885] 7247=test_gem_commands_exec_command I, [2024-05-05T22:08:34.467088 #4159776] INFO -- : [212/885] 7237=test_io_wait I, [2024-05-05T22:08:34.469847 #4159776] INFO -- : [213/885] 7243=test_hash I, [2024-05-05T22:08:34.480740 #4159776] INFO -- : [214/885] 7253=test_ubf_async_safe I, [2024-05-05T22:08:34.490413 #4159776] INFO -- : [215/885] 7253=test_emoji I, [2024-05-05T22:08:34.514491 #4159776] INFO -- : [216/885] 7253=test_win32ole_type_event I, [2024-05-05T22:08:34.514599 #4159776] INFO -- : [217/885] 7253=test_sorted_set I, [2024-05-05T22:08:34.521580 #4159776] INFO -- : [218/885] 7254=test_io I, [2024-05-05T22:08:34.717537 #4159776] INFO -- : [219/885] 7244=test_condition I, [2024-05-05T22:08:34.730517 #4159776] INFO -- : [220/885] 7244=test_gem_source_specific_file I, [2024-05-05T22:08:34.745819 #4159776] INFO -- : [221/885] 7249=test_foreach I, [2024-05-05T22:08:34.746330 #4159776] INFO -- : [222/885] 7254=test_gem_commands_uninstall_command I, [2024-05-05T22:08:34.757949 #4159776] INFO -- : [223/885] 7249=test_cp949 I, [2024-05-05T22:08:34.761128 #4159776] INFO -- : [224/885] 7253=test_win32ole_record I, [2024-05-05T22:08:34.762694 #4159776] INFO -- : [225/885] 7249=test_gem_unsatisfiable_dependency_error I, [2024-05-05T22:08:34.763275 #4159776] INFO -- : [226/885] 7253=test_method I, [2024-05-05T22:08:34.770740 #4159776] INFO -- : [227/885] 7249=test_gem_commands_query_command I, [2024-05-05T22:08:34.792180 #4159776] INFO -- : [228/885] 7244=test_rdoc_rubygems_hook I, [2024-05-05T22:08:34.796759 #4159776] INFO -- : [229/885] 7237=test_pattern_key_name_check I, [2024-05-05T22:08:34.803792 #4159776] INFO -- : [230/885] 7237=test_to_ruby I, [2024-05-05T22:08:34.821134 #4159776] INFO -- : [231/885] 7237=test_pack I, [2024-05-05T22:08:34.889197 #4159776] INFO -- : [232/885] 7244=test_array_create I, [2024-05-05T22:08:34.894370 #4159776] INFO -- : [233/885] 7244=test_gem_impossible_dependencies_error I, [2024-05-05T22:08:34.899733 #4159776] INFO -- : [234/885] 7244=test_ftp I, [2024-05-05T22:08:34.918617 #4159776] INFO -- : [235/885] 7244=test_euc_kr I, [2024-05-05T22:08:34.923493 #4159776] INFO -- : [236/885] 7244=test_rdoc_context_section I, [2024-05-05T22:08:34.932459 #4159776] INFO -- : [237/885] 7244=test_bug-5832 I, [2024-05-05T22:08:34.936655 #4159776] INFO -- : [238/885] 7244=test_files_ext I, [2024-05-05T22:08:34.969344 #4159776] INFO -- : [239/885] 7246=test_gem_silent_ui I, [2024-05-05T22:08:35.009218 #4159776] INFO -- : [240/885] 7246=test_emitter I, [2024-05-05T22:08:35.013096 #4159776] INFO -- : [241/885] 7237=test_kdf I, [2024-05-05T22:08:35.016545 #4159776] INFO -- : [242/885] 7244=test_gem_doctor I, [2024-05-05T22:08:35.020342 #4159776] INFO -- : [243/885] 7246=dispatcher_test I, [2024-05-05T22:08:35.065757 #4159776] INFO -- : [244/885] 7244=test_eval_history I, [2024-05-05T22:08:35.098179 #4159776] INFO -- : [245/885] 7237=test_kernel I, [2024-05-05T22:08:35.103163 #4159776] INFO -- : [246/885] 7246=test_rdoc_markup_paragraph I, [2024-05-05T22:08:35.104303 #4159776] INFO -- : [247/885] 7246=!Nothing_to_test I, [2024-05-05T22:08:35.110369 #4159776] INFO -- : [248/885] 7246=test_psych I, [2024-05-05T22:08:35.122307 #4159776] INFO -- : [249/885] 7252=test_enc_raise I, [2024-05-05T22:08:35.129317 #4159776] INFO -- : [250/885] 7252=test_object_create_start I, [2024-05-05T22:08:35.132851 #4159776] INFO -- : [251/885] 7252=test_date I, [2024-05-05T22:08:35.140463 #4159776] INFO -- : [252/885] 7246=test_gem_rdoc I, [2024-05-05T22:08:35.145544 #4159776] INFO -- : [253/885] 7252=test_gem_ext_cargo_builder_unit I, [2024-05-05T22:08:35.169132 #4159776] INFO -- : [254/885] 7249=test_command I, [2024-05-05T22:08:35.190525 #4159776] INFO -- : [255/885] 7244=test_at_exit I, [2024-05-05T22:08:35.214616 #4159776] INFO -- : [256/885] 7244=test_rdoc_markup_to_tt_only I, [2024-05-05T22:08:35.250652 #4159776] INFO -- : [257/885] 7244=test_hmac I, [2024-05-05T22:08:35.263250 #4159776] INFO -- : [258/885] 7244=test_rdoc_tom_doc I, [2024-05-05T22:08:35.285779 #4159776] INFO -- : [259/885] 7246=test_gem_commands_lock_command I, [2024-05-05T22:08:35.290184 #4159776] INFO -- : [260/885] 7244=test_ifunless I, [2024-05-05T22:08:35.291608 #4159776] INFO -- : [261/885] 7244=test_assignment I, [2024-05-05T22:08:35.306889 #4159776] INFO -- : [262/885] 7242=test_numeric I, [2024-05-05T22:08:35.313912 #4159776] INFO -- : [263/885] 7246=test_gem_spec_fetcher I, [2024-05-05T22:08:35.341127 #4159776] INFO -- : [264/885] 7249=test_common I, [2024-05-05T22:08:35.373046 #4159776] INFO -- : [265/885] 7242=test_key_actor_vi I, [2024-05-05T22:08:35.398278 #4159776] INFO -- : [266/885] 7252=test_bug-3571 I, [2024-05-05T22:08:35.411922 #4159776] INFO -- : [267/885] 7254=test_gem_command I, [2024-05-05T22:08:35.414629 #4159776] INFO -- : [268/885] 7252=test_address_resolve I, [2024-05-05T22:08:35.445783 #4159776] INFO -- : [269/885] 7252=test_rdoc_token_stream I, [2024-05-05T22:08:35.450519 #4159776] INFO -- : [270/885] 7252=test_gem_source_list I, [2024-05-05T22:08:35.491261 #4159776] INFO -- : [271/885] 7246=test_yaml_special_cases I, [2024-05-05T22:08:35.491992 #4159776] INFO -- : [272/885] 7252=test_optarg I, [2024-05-05T22:08:35.495331 #4159776] INFO -- : [273/885] 7254=test_config I, [2024-05-05T22:08:35.499683 #4159776] INFO -- : [274/885] 7246=test_pp I, [2024-05-05T22:08:35.521056 #4159776] INFO -- : [275/885] 7249=test_gem_ext_configure_builder I, [2024-05-05T22:08:35.523308 #4159776] INFO -- : [276/885] 7247=test_frozen I, [2024-05-05T22:08:35.530739 #4159776] INFO -- : [277/885] 7247=test_macro I, [2024-05-05T22:08:35.533741 #4159776] INFO -- : [278/885] 7242=test_nil I, [2024-05-05T22:08:35.535684 #4159776] INFO -- : [279/885] 7247=test_num2int I, [2024-05-05T22:08:35.540471 #4159776] INFO -- : [280/885] 7246=test_rdoc_single_class I, [2024-05-05T22:08:35.540998 #4159776] INFO -- : [281/885] 7246=test_verbose I, [2024-05-05T22:08:35.547048 #4159776] INFO -- : [282/885] 7247=test_iter_break I, [2024-05-05T22:08:35.547369 #4159776] INFO -- : [283/885] 7242=test_exception I, [2024-05-05T22:08:35.550721 #4159776] INFO -- : [284/885] 7247=test_zsh_completion I, [2024-05-05T22:08:35.552940 #4159776] INFO -- : [285/885] 7242=test_optimization I, [2024-05-05T22:08:35.558665 #4159776] INFO -- : [286/885] 7247=test_date_conv I, [2024-05-05T22:08:35.565311 #4159776] INFO -- : [287/885] 7247=test_erb_m17n I, [2024-05-05T22:08:35.573527 #4159776] INFO -- : [288/885] 7247=test_ole_methods I, [2024-05-05T22:08:35.577490 #4159776] INFO -- : [289/885] 7247=test_egrep_cpp I, [2024-05-05T22:08:35.585699 #4159776] INFO -- : [290/885] 7246=test_cgi_tag_helper I, [2024-05-05T22:08:35.589293 #4159776] INFO -- : [291/885] 7254=test_zlib I, [2024-05-05T22:08:35.595627 #4159776] INFO -- : [292/885] 7249=test_gem_package_old I, [2024-05-05T22:08:35.606320 #4159776] INFO -- : [293/885] 7246=test_gem_resolver_index_set I, [2024-05-05T22:08:35.629090 #4159776] INFO -- : [294/885] 7249=test_proc I, [2024-05-05T22:08:35.635446 #4159776] INFO -- : [295/885] 7252=test_string I, [2024-05-05T22:08:35.643673 #4159776] INFO -- : [296/885] 7246=test_gc_compact I, [2024-05-05T22:08:35.715561 #4159776] INFO -- : [297/885] 7247=test_gem_validator I, [2024-05-05T22:08:35.717190 #4159776] INFO -- : [298/885] 7247=test_files_test_2 I, [2024-05-05T22:08:35.717947 #4159776] INFO -- : [299/885] 7237=test_fnmatch I, [2024-05-05T22:08:35.767776 #4159776] INFO -- : [300/885] 7237=test_folderitem2_invokeverb I, [2024-05-05T22:08:35.790995 #4159776] INFO -- : [301/885] 7237=test_require_path_check I, [2024-05-05T22:08:35.851394 #4159776] INFO -- : [302/885] 7237=test_rdoc_markup_parser I, [2024-05-05T22:08:36.069715 #4159776] INFO -- : [303/885] 7237=test_string I, [2024-05-05T22:08:36.078415 #4159776] INFO -- : [304/885] 7237=test_pattern_matching I, [2024-05-05T22:08:36.104819 #4159776] INFO -- : [305/885] 7237=test_rdoc_stats I, [2024-05-05T22:08:36.173682 #4159776] INFO -- : [306/885] 7237=test_raise I, [2024-05-05T22:08:36.181201 #4159776] INFO -- : [307/885] 7237=test_x509attr I, [2024-05-05T22:08:36.181273 #4159776] INFO -- : [308/885] 7237=test_gem_request_set_lockfile_parser I, [2024-05-05T22:08:36.206989 #4159776] INFO -- : [309/885] 7248=test_depth_first I, [2024-05-05T22:08:36.212684 #4159776] INFO -- : [310/885] 7248=test_rdoc_store I, [2024-05-05T22:08:36.284564 #4159776] INFO -- : [311/885] 7237=json_addition_test I, [2024-05-05T22:08:36.309322 #4159776] INFO -- : [312/885] 7237=test_custom_command I, [2024-05-05T22:08:36.373466 #4159776] INFO -- : [313/885] 7237=test_rdoc_parser I, [2024-05-05T22:08:36.394152 #4159776] INFO -- : [314/885] 7237=test_qsort I, [2024-05-05T22:08:36.400364 #4159776] INFO -- : [315/885] 7237=test_gem_dependency_resolution_error I, [2024-05-05T22:08:36.404421 #4159776] INFO -- : [316/885] 7237=test_default_gems I, [2024-05-05T22:08:36.474335 #4159776] INFO -- : [317/885] 7237=test_rdoc_rd_inline_parser I, [2024-05-05T22:08:36.502626 #4159776] INFO -- : [318/885] 7249=test_rdoc_markup_to_rdoc I, [2024-05-05T22:08:36.505753 #4159776] INFO -- : [319/885] 7237=test_mul I, [2024-05-05T22:08:36.511875 #4159776] INFO -- : [320/885] 7237=test_win32ole_type I, [2024-05-05T22:08:36.514570 #4159776] INFO -- : [321/885] 7237=test_null I, [2024-05-05T22:08:36.517582 #4159776] INFO -- : [322/885] 7237=test_rdoc_markup_attributes I, [2024-05-05T22:08:36.520986 #4159776] INFO -- : [323/885] 7237=test_date_parse I, [2024-05-05T22:08:36.548085 #4159776] INFO -- : [324/885] 7249=test_pkey_ec I, [2024-05-05T22:08:36.601498 #4159776] INFO -- : [325/885] 7239=test_pipe I, [2024-05-05T22:08:36.634293 #4159776] INFO -- : [326/885] 7237=test_trick I, [2024-05-05T22:08:36.644021 #4159776] INFO -- : [327/885] 7249=test_thread I, [2024-05-05T22:08:36.644196 #4159776] INFO -- : [328/885] 7249=test_rdoc_i18n_text I, [2024-05-05T22:08:36.654100 #4159776] INFO -- : [329/885] 7249=test_defined I, [2024-05-05T22:08:36.728312 #4159776] INFO -- : [330/885] 7249=test_backtrace I, [2024-05-05T22:08:36.737624 #4159776] INFO -- : [331/885] 7239=test_key_name_check I, [2024-05-05T22:08:36.739276 #4159776] INFO -- : [332/885] 7249=test_io_buffer I, [2024-05-05T22:08:36.743791 #4159776] INFO -- : [333/885] 7239=test_rdoc_rdoc I, [2024-05-05T22:08:36.760246 #4159776] INFO -- : [334/885] 7240=test_windows_1251 I, [2024-05-05T22:08:36.767547 #4159776] INFO -- : [335/885] 7240=test_time I, [2024-05-05T22:08:36.783769 #4159776] INFO -- : [336/885] 7249=test_gb18030 I, [2024-05-05T22:08:36.797388 #4159776] INFO -- : [337/885] 7249=test_svcb_https I, [2024-05-05T22:08:36.817179 #4159776] INFO -- : [338/885] 7249=test_buffering I, [2024-05-05T22:08:36.827358 #4159776] INFO -- : [339/885] 7249=test_gem_uninstaller I, [2024-05-05T22:08:36.864723 #4159776] INFO -- : [340/885] 7248=test_gem_commands_info_command I, [2024-05-05T22:08:36.887931 #4159776] INFO -- : [341/885] 7240=test_gem_dependency_installer I, [2024-05-05T22:08:36.932345 #4159776] INFO -- : [342/885] 7256=test_scalar I, [2024-05-05T22:08:36.948393 #4159776] INFO -- : [343/885] 7256=test_rdoc_cross_reference I, [2024-05-05T22:08:36.997476 #4159776] INFO -- : [344/885] 7239=test_store I, [2024-05-05T22:08:37.063436 #4159776] INFO -- : [345/885] 7248=test_case_options I, [2024-05-05T22:08:37.066621 #4159776] INFO -- : [346/885] 7244=test_exception I, [2024-05-05T22:08:37.068420 #4159776] INFO -- : [347/885] 7248=test_gem_name_tuple I, [2024-05-05T22:08:37.081521 #4159776] INFO -- : [348/885] 7248=test_gem_package_tar_reader_entry I, [2024-05-05T22:08:37.172514 #4159776] INFO -- : [349/885] 7239=test_rand I, [2024-05-05T22:08:37.255044 #4159776] INFO -- : [350/885] 7248=test_bug_reporter I, [2024-05-05T22:08:37.351834 #4159776] INFO -- : [351/885] 7251=test_gem_commands_mirror I, [2024-05-05T22:08:37.359550 #4159776] INFO -- : [352/885] 7251=test_gem_ext_cargo_builder_link_flag_converter I, [2024-05-05T22:08:37.423544 #4159776] INFO -- : [353/885] 7251=test_sprintf_comb I, [2024-05-05T22:08:37.433268 #4159776] INFO -- : [354/885] 7239=test_gem_request I, [2024-05-05T22:08:37.586093 #4159776] INFO -- : [355/885] 7256=test_method_cache I, [2024-05-05T22:08:37.588923 #4159776] INFO -- : [356/885] 7256=test_scan_args I, [2024-05-05T22:08:37.598696 #4159776] INFO -- : [357/885] 7256=test_win32ole I, [2024-05-05T22:08:37.605406 #4159776] INFO -- : [358/885] 7256=test_generic I, [2024-05-05T22:08:37.611268 #4159776] INFO -- : [359/885] 7239=test_settracefunc I, [2024-05-05T22:08:37.630595 #4159776] INFO -- : [360/885] 7251=test_gem_text I, [2024-05-05T22:08:37.684282 #4159776] INFO -- : [361/885] 7251=test_enumerator_kw I, [2024-05-05T22:08:37.684957 #4159776] INFO -- : [362/885] 7248=test_reline I, [2024-05-05T22:08:37.690264 #4159776] INFO -- : [363/885] 7256=test_parser_events I, [2024-05-05T22:08:37.692809 #4159776] INFO -- : [364/885] 7251=test_pkey I, [2024-05-05T22:08:37.754628 #4159776] INFO -- : [365/885] 7251=test_case I, [2024-05-05T22:08:37.754971 #4159776] INFO -- : [366/885] 7251=test_grapheme_breaks I, [2024-05-05T22:08:37.783968 #4159776] INFO -- : [367/885] 7251=test_gem_version_option I, [2024-05-05T22:08:37.805583 #4159776] INFO -- : [368/885] 7256=test_gem_request_connection_pools I, [2024-05-05T22:08:37.832950 #4159776] INFO -- : [369/885] 7251=test_cclass I, [2024-05-05T22:08:37.838546 #4159776] INFO -- : [370/885] 7248=test_ractor I, [2024-05-05T22:08:37.913500 #4159776] INFO -- : [371/885] 7248=test_memory_view I, [2024-05-05T22:08:37.992394 #4159776] INFO -- : [372/885] 7251=test_m17n_comb I, [2024-05-05T22:08:38.060182 #4159776] INFO -- : [373/885] 7249=test_rdoc_markup_to_markdown I, [2024-05-05T22:08:38.064718 #4159776] INFO -- : [374/885] 7248=test_json_tree I, [2024-05-05T22:08:38.066790 #4159776] INFO -- : [375/885] 7248=test_ansi_with_terminfo I, [2024-05-05T22:08:38.071616 #4159776] INFO -- : [376/885] 7248=test_rdoc_generator_pot_po I, [2024-05-05T22:08:38.080400 #4159776] INFO -- : [377/885] 7248=parse_test I, [2024-05-05T22:08:38.104202 #4159776] INFO -- : [378/885] 7249=test_gem_install_update_options I, [2024-05-05T22:08:38.234979 #4159776] INFO -- : [379/885] 7249=test_require_lib I, [2024-05-05T22:08:38.482687 #4159776] INFO -- : [380/885] 7255=test_severity I, [2024-05-05T22:08:38.487454 #4159776] INFO -- : [381/885] 7255=test_ractor I, [2024-05-05T22:08:38.501624 #4159776] INFO -- : [382/885] 7255=test_rdoc_generator_ri I, [2024-05-05T22:08:38.577603 #4159776] INFO -- : [383/885] 7246=test_extlibs I, [2024-05-05T22:08:38.615963 #4159776] INFO -- : [384/885] 7239=test_gem_stream_ui I, [2024-05-05T22:08:38.626848 #4159776] INFO -- : [385/885] 7243=test_c_struct_builder I, [2024-05-05T22:08:38.630766 #4159776] INFO -- : [386/885] 7255=test_dot_dot I, [2024-05-05T22:08:38.632577 #4159776] INFO -- : [387/885] 7255=test_str2big I, [2024-05-05T22:08:38.636219 #4159776] INFO -- : [388/885] 7255=test_literal I, [2024-05-05T22:08:38.700312 #4159776] INFO -- : [389/885] 7239=test_objectspace I, [2024-05-05T22:08:38.745645 #4159776] INFO -- : [390/885] 7241=test_socket I, [2024-05-05T22:08:38.764147 #4159776] INFO -- : [391/885] 7243=test_thread I, [2024-05-05T22:08:38.862608 #4159776] INFO -- : [392/885] 7250=test_rdoc_markup_to_table_of_contents I, [2024-05-05T22:08:38.865942 #4159776] INFO -- : [393/885] 7254=test_logperiod I, [2024-05-05T22:08:38.868891 #4159776] INFO -- : [394/885] 7254=test_rdoc_markdown_test I, [2024-05-05T22:08:38.895165 #4159776] INFO -- : [395/885] 7250=test_c_union_entity I, [2024-05-05T22:08:38.918648 #4159776] INFO -- : [396/885] 7253=test_rdoc_normal_module I, [2024-05-05T22:08:38.934161 #4159776] INFO -- : [397/885] 7250=test_securerandom I, [2024-05-05T22:08:38.963055 #4159776] INFO -- : [398/885] 7250=test_switch_hitter I, [2024-05-05T22:08:38.979287 #4159776] INFO -- : [399/885] 7250=test_io_console I, [2024-05-05T22:08:38.983539 #4159776] INFO -- : [400/885] 7243=test_flush I, [2024-05-05T22:08:38.986475 #4159776] INFO -- : [401/885] 7253=test_singleton I, [2024-05-05T22:08:38.990322 #4159776] INFO -- : [402/885] 7243=test_stringchar I, [2024-05-05T22:08:38.992257 #4159776] INFO -- : [403/885] 7253=test_hash_create I, [2024-05-05T22:08:38.994793 #4159776] INFO -- : [404/885] 7253=newline_test I, [2024-05-05T22:08:39.057054 #4159776] INFO -- : [405/885] 7253=test_uncorrectable_name_check I, [2024-05-05T22:08:39.061959 #4159776] INFO -- : [406/885] 7253=test_thread_fd_close I, [2024-05-05T22:08:39.062182 #4159776] INFO -- : [407/885] 7253=test_passing_block I, [2024-05-05T22:08:39.065736 #4159776] INFO -- : [408/885] 7253=test_pack I, [2024-05-05T22:08:39.091800 #4159776] INFO -- : [409/885] 7256=test_process I, [2024-05-05T22:08:39.112864 #4159776] INFO -- : [410/885] 7247=test_last_thread I, [2024-05-05T22:08:39.132617 #4159776] INFO -- : [411/885] 7243=test_gem_security_policy I, [2024-05-05T22:08:39.238267 #4159776] INFO -- : [412/885] 7253=test_gem_source_local I, [2024-05-05T22:08:39.260533 #4159776] INFO -- : [413/885] 7237=test_logdevice I, [2024-05-05T22:08:39.337195 #4159776] INFO -- : [414/885] 7240=test_gem_ext_rake_builder I, [2024-05-05T22:08:39.364262 #4159776] INFO -- : [415/885] 7244=test_arity I, [2024-05-05T22:08:39.369524 #4159776] INFO -- : [416/885] 7244=test_x509cert I, [2024-05-05T22:08:39.384631 #4159776] INFO -- : [417/885] 7255=test_gc I, [2024-05-05T22:08:39.438174 #4159776] INFO -- : [418/885] 7243=test_gem_resolver_lock_specification I, [2024-05-05T22:08:39.479734 #4159776] INFO -- : [419/885] 7243=test_err_in_callback I, [2024-05-05T22:08:39.489696 #4159776] INFO -- : [420/885] 7243=test_inadvertent_creation I, [2024-05-05T22:08:39.492143 #4159776] INFO -- : [421/885] 7253=test_flags I, [2024-05-05T22:08:39.612787 #4159776] INFO -- : [422/885] 7243=test_enumerator I, [2024-05-05T22:08:39.645607 #4159776] INFO -- : [423/885] 7239=test_http I, [2024-05-05T22:08:39.652253 #4159776] INFO -- : [424/885] 7239=test_shift_jis I, [2024-05-05T22:08:39.654462 #4159776] INFO -- : [425/885] 7239=test_gem_commands_which_command I, [2024-05-05T22:08:39.663685 #4159776] INFO -- : [426/885] 7254=test_gem_commands_specification_command I, [2024-05-05T22:08:39.677372 #4159776] INFO -- : [427/885] 7244=test_gem_resolver I, [2024-05-05T22:08:39.696039 #4159776] INFO -- : [428/885] 7239=test_gem_resolver_composed_set I, [2024-05-05T22:08:39.711102 #4159776] INFO -- : [429/885] 7239=test_safe_load I, [2024-05-05T22:08:39.723837 #4159776] INFO -- : [430/885] 7239=test_gem_commands_dependency_command I, [2024-05-05T22:08:39.775981 #4159776] INFO -- : [431/885] 7254=test_name_error I, [2024-05-05T22:08:39.817379 #4159776] INFO -- : [432/885] 7239=test_rdoc_markup_attribute_manager I, [2024-05-05T22:08:39.853675 #4159776] INFO -- : [433/885] 7239=test_open-uri I, [2024-05-05T22:08:39.892165 #4159776] INFO -- : [434/885] 7254=test_httpresponse I, [2024-05-05T22:08:39.953753 #4159776] INFO -- : [435/885] 7254=test_rdoc_parser_ruby I, [2024-05-05T22:08:39.963347 #4159776] INFO -- : [436/885] 7244=test_nil2vtempty I, [2024-05-05T22:08:39.969519 #4159776] INFO -- : [437/885] 7244=test_stream I, [2024-05-05T22:08:39.984254 #4159776] INFO -- : [438/885] 7244=test_rdoc_context I, [2024-05-05T22:08:40.053956 #4159776] INFO -- : .Leaked thread: TestSocket#test_accept_loop: # I, [2024-05-05T22:08:40.054455 #4159776] INFO -- : Finished thread: TestSocket#test_unix: # I, [2024-05-05T22:08:40.080667 #4159776] INFO -- : [439/885] 7237=test_rdoc_text I, [2024-05-05T22:08:40.082739 #4159776] INFO -- : [440/885] 7240=test_tcp I, [2024-05-05T22:08:40.112209 #4159776] INFO -- : [441/885] 7237=test_iso_8859 I, [2024-05-05T22:08:40.129961 #4159776] INFO -- : [442/885] 7237=test_rdoc_markup_to_joined_paragraph I, [2024-05-05T22:08:40.135222 #4159776] INFO -- : [443/885] 7237=test_date_time I, [2024-05-05T22:08:40.142547 #4159776] INFO -- : [444/885] 7240=test_require I, [2024-05-05T22:08:40.144945 #4159776] INFO -- : [445/885] 7240=index_write_test I, [2024-05-05T22:08:40.150860 #4159776] INFO -- : [446/885] 7237=test_date_new I, [2024-05-05T22:08:40.165208 #4159776] INFO -- : [447/885] 7237=test_data I, [2024-05-05T22:08:40.174399 #4159776] INFO -- : [448/885] 7237=test_syntax I, [2024-05-05T22:08:40.199075 #4159776] INFO -- : [449/885] 7247=test_gem_safe_yaml I, [2024-05-05T22:08:40.204112 #4159776] INFO -- : [450/885] 7238=test_trace I, [2024-05-05T22:08:40.204204 #4159776] INFO -- : [451/885] 7240=ractor_test I, [2024-05-05T22:08:40.209209 #4159776] INFO -- : [452/885] 7247=test_time_tz I, [2024-05-05T22:08:40.225342 #4159776] INFO -- : [453/885] 7238=test_win32ole_event I, [2024-05-05T22:08:40.225414 #4159776] INFO -- : [454/885] 7238=test_rdoc_generator_json_index I, [2024-05-05T22:08:40.272791 #4159776] INFO -- : [455/885] 7247=test_gem_ci_detector I, [2024-05-05T22:08:40.280482 #4159776] INFO -- : [456/885] 7247=test_rdoc_class_module I, [2024-05-05T22:08:40.296457 #4159776] INFO -- : [457/885] 7240=test_bignum I, [2024-05-05T22:08:40.394239 #4159776] INFO -- : [458/885] 7246=test_io_wait_uncommon I, [2024-05-05T22:08:40.397003 #4159776] INFO -- : [459/885] 7246=test_stringio I, [2024-05-05T22:08:40.413254 #4159776] INFO -- : [460/885] 7240=test_arity I, [2024-05-05T22:08:40.416877 #4159776] INFO -- : [461/885] 7240=test_win32ole_variable I, [2024-05-05T22:08:40.421117 #4159776] INFO -- : [462/885] 7240=test_enum I, [2024-05-05T22:08:40.425024 #4159776] INFO -- : [463/885] 7241=test_gem_specification I, [2024-05-05T22:08:40.429065 #4159776] INFO -- : [464/885] 7239=test_threadgroup I, [2024-05-05T22:08:40.486523 #4159776] INFO -- : [465/885] 7238=test_gem_package I, [2024-05-05T22:08:40.504505 #4159776] INFO -- : [466/885] 7253=test_complex2 I, [2024-05-05T22:08:40.513165 #4159776] INFO -- : [467/885] 7253=test_resolve_symbol I, [2024-05-05T22:08:40.514379 #4159776] INFO -- : [468/885] 7246=test_have_macro I, [2024-05-05T22:08:40.587998 #4159776] INFO -- : [469/885] 7253=test_merge_keys I, [2024-05-05T22:08:40.593850 #4159776] INFO -- : [470/885] 7253=test_rdoc_extend I, [2024-05-05T22:08:40.620214 #4159776] INFO -- : [471/885] 7253=test_win32ole_variant I, [2024-05-05T22:08:40.626817 #4159776] INFO -- : [472/885] 7253=test_rdoc_markup_to_ansi I, [2024-05-05T22:08:40.634729 #4159776] INFO -- : [473/885] 7254=test_mixed_unicode_escapes I, [2024-05-05T22:08:40.639113 #4159776] INFO -- : [474/885] 7254=test_history I, [2024-05-05T22:08:40.647846 #4159776] INFO -- : [475/885] 7254=test_ipaddr I, [2024-05-05T22:08:40.661994 #4159776] INFO -- : [476/885] 7253=test_gem_resolver_api_specification I, [2024-05-05T22:08:40.672579 #4159776] INFO -- : [477/885] 7254=test_member I, [2024-05-05T22:08:40.677900 #4159776] INFO -- : [478/885] 7254=test_numeric I, [2024-05-05T22:08:40.685559 #4159776] INFO -- : [479/885] 7254=test_gem_commands_cleanup_command I, [2024-05-05T22:08:40.699792 #4159776] INFO -- : [480/885] 7253=test_word I, [2024-05-05T22:08:40.700637 #4159776] INFO -- : [481/885] 7253=test_cgi_multipart I, [2024-05-05T22:08:40.709441 #4159776] INFO -- : [482/885] 7251=test_autoconf I, [2024-05-05T22:08:40.716060 #4159776] INFO -- : [483/885] 7251=test_eval I, [2024-05-05T22:08:40.722259 #4159776] INFO -- : [484/885] 7251=test_gem_console_ui I, [2024-05-05T22:08:40.727986 #4159776] INFO -- : [485/885] 7244=test_date_ractor I, [2024-05-05T22:08:40.732694 #4159776] INFO -- : [486/885] 7251=test_dir I, [2024-05-05T22:08:40.877485 #4159776] INFO -- : [487/885] 7253=format_errors_test I, [2024-05-05T22:08:40.880366 #4159776] INFO -- : [488/885] 7253=test_ractor_compatibility I, [2024-05-05T22:08:40.941548 #4159776] INFO -- : [489/885] 7244=test_symbol I, [2024-05-05T22:08:40.946561 #4159776] INFO -- : [490/885] 7244=location_test I, [2024-05-05T22:08:40.970152 #4159776] INFO -- : [491/885] 7246=test_coderange I, [2024-05-05T22:08:40.974948 #4159776] INFO -- : [492/885] 7246=test_mailto I, [2024-05-05T22:08:40.981226 #4159776] INFO -- : [493/885] 7248=test_error_highlight I, [2024-05-05T22:08:40.983390 #4159776] INFO -- : [494/885] 7246=test_resize I, [2024-05-05T22:08:40.992671 #4159776] INFO -- : [495/885] 7246=test_rdoc_comment I, [2024-05-05T22:08:41.028415 #4159776] INFO -- : [496/885] 7251=test_rdoc_generator_darkfish I, [2024-05-05T22:08:41.061269 #4159776] INFO -- : [497/885] 7244=json_generic_object_test I, [2024-05-05T22:08:41.066084 #4159776] INFO -- : [498/885] 7246=test_gem_source_fetch_problem I, [2024-05-05T22:08:41.073530 #4159776] INFO -- : [499/885] 7244=test_http_request I, [2024-05-05T22:08:41.086694 #4159776] INFO -- : [500/885] 7246=test_function_entry I, [2024-05-05T22:08:41.099665 #4159776] INFO -- : [501/885] 7246=test_pkcs7 I, [2024-05-05T22:08:41.108734 #4159776] INFO -- : [502/885] 7254=test_arith_seq_beg_len_step I, [2024-05-05T22:08:41.111338 #4159776] INFO -- : [503/885] 7244=test_gem_resolver_requirement_list I, [2024-05-05T22:08:41.117802 #4159776] INFO -- : [504/885] 7244=test_unix I, [2024-05-05T22:08:41.173156 #4159776] INFO -- : [505/885] 7244=test_enc_associate I, [2024-05-05T22:08:41.199466 #4159776] INFO -- : [506/885] 7247=test_lazy_enumerator I, [2024-05-05T22:08:41.211644 #4159776] INFO -- : [507/885] 7254=test_find_executable I, [2024-05-05T22:08:41.233317 #4159776] INFO -- : [508/885] 7254=ruby_api_test I, [2024-05-05T22:08:41.275285 #4159776] INFO -- : [509/885] 7238=test_nofree I, [2024-05-05T22:08:41.278297 #4159776] INFO -- : [510/885] 7238=test_gem_commands_pristine_command I, [2024-05-05T22:08:41.288928 #4159776] INFO -- : [511/885] 7253=test_context I, [2024-05-05T22:08:41.300933 #4159776] INFO -- : [512/885] 7246=test_symbol I, [2024-05-05T22:08:41.330976 #4159776] INFO -- : [513/885] 7251=test_coder I, [2024-05-05T22:08:41.343677 #4159776] INFO -- : [514/885] 7251=test_rubygems I, [2024-05-05T22:08:41.391816 #4159776] INFO -- : [515/885] 7253=test_https_proxy I, [2024-05-05T22:08:41.442223 #4159776] INFO -- : [516/885] 7248=test_call I, [2024-05-05T22:08:41.449024 #4159776] INFO -- : [517/885] 7239=test_rubyoptions I, [2024-05-05T22:08:41.460432 #4159776] INFO -- : [518/885] 7240=test_super I, [2024-05-05T22:08:41.460685 #4159776] INFO -- : [519/885] 7254=test_integer I, [2024-05-05T22:08:41.468687 #4159776] INFO -- : [520/885] 7253=test_cgi_modruby I, [2024-05-05T22:08:41.474945 #4159776] INFO -- : [521/885] 7253=test_usrmarshal I, [2024-05-05T22:08:41.521866 #4159776] INFO -- : [522/885] 7251=test_object_references I, [2024-05-05T22:08:41.531425 #4159776] INFO -- : [523/885] 7251=test_gem_resolver_git_specification I, [2024-05-05T22:08:41.571041 #4159776] INFO -- : [524/885] 7248=test_have_func I, [2024-05-05T22:08:41.579649 #4159776] INFO -- : [525/885] 7250=test_gem_request_set_lockfile_tokenizer I, [2024-05-05T22:08:41.617276 #4159776] INFO -- : [526/885] 7244=test_stat I, [2024-05-05T22:08:41.619434 #4159776] INFO -- : [527/885] 7244=test_capacity I, [2024-05-05T22:08:41.625573 #4159776] INFO -- : [528/885] 7244=test_nextafter I, [2024-05-05T22:08:41.647466 #4159776] INFO -- : [529/885] 7247=test_dryrun I, [2024-05-05T22:08:41.663781 #4159776] INFO -- : [530/885] 7250=desugar_compiler_test I, [2024-05-05T22:08:41.681706 #4159776] INFO -- : [531/885] 7247=test_integer I, [2024-05-05T22:08:41.722037 #4159776] INFO -- : [532/885] 7253=test_env I, [2024-05-05T22:08:41.725680 #4159776] INFO -- : [533/885] 7244=test_rdoc_attr I, [2024-05-05T22:08:41.734612 #4159776] INFO -- : [534/885] 7244=test_gem_commands_setup_command I, [2024-05-05T22:08:41.752172 #4159776] INFO -- : [535/885] 7250=test_parser I, [2024-05-05T22:08:41.773536 #4159776] INFO -- : [536/885] 7247=test_cgi_core I, [2024-05-05T22:08:41.789952 #4159776] INFO -- : [537/885] 7247=test_gem I, [2024-05-05T22:08:41.795476 #4159776] INFO -- : [538/885] 7250=test_gem_source_lock I, [2024-05-05T22:08:41.862557 #4159776] INFO -- : [539/885] 7250=test_dns I, [2024-05-05T22:08:41.983754 #4159776] INFO -- : [540/885] 7251=test_gem_commands_open_command I, [2024-05-05T22:08:42.094796 #4159776] INFO -- : [541/885] 7251=test_ractor I, [2024-05-05T22:08:42.116790 #4159776] INFO -- : [542/885] 7251=test_registry I, [2024-05-05T22:08:42.116861 #4159776] INFO -- : [543/885] 7251=parse_stream_test I, [2024-05-05T22:08:42.116872 #4159776] INFO -- : [544/885] 7240=test_rendering I, [2024-05-05T22:08:42.124313 #4159776] INFO -- : [545/885] 7251=test_debugger_integration I, [2024-05-05T22:08:42.143810 #4159776] INFO -- : [546/885] 7251=test_thread I, [2024-05-05T22:08:42.168434 #4159776] INFO -- : [547/885] 7240=json_ext_parser_test I, [2024-05-05T22:08:42.176521 #4159776] INFO -- : [548/885] 7240=test_my_integer I, [2024-05-05T22:08:42.183903 #4159776] INFO -- : [549/885] 7240=test_ractor I, [2024-05-05T22:08:42.209042 #4159776] INFO -- : [550/885] 7249=test_ssl I, [2024-05-05T22:08:42.356532 #4159776] INFO -- : [551/885] 7244=test_reline_key I, [2024-05-05T22:08:42.365880 #4159776] INFO -- : [552/885] 7244=test_rb_str_dup I, [2024-05-05T22:08:42.368628 #4159776] INFO -- : [553/885] 7250=test_singleton_function I, [2024-05-05T22:08:42.370926 #4159776] INFO -- : [554/885] 7244=test_ancdata I, [2024-05-05T22:08:42.371675 #4159776] INFO -- : [555/885] 7250=test_timeout I, [2024-05-05T22:08:42.378737 #4159776] INFO -- : [556/885] 7244=test_alias I, [2024-05-05T22:08:42.595592 #4159776] INFO -- : [557/885] 7244=test_weakref I, [2024-05-05T22:08:42.658383 #4159776] INFO -- : [558/885] 7240=test_nonblock I, [2024-05-05T22:08:42.670506 #4159776] INFO -- : [559/885] 7240=test_unicode_normalize I, [2024-05-05T22:08:42.800261 #4159776] INFO -- : [560/885] 7249=test_marshal I, [2024-05-05T22:08:42.802697 #4159776] INFO -- : [561/885] 7244=test_regexp I, [2024-05-05T22:08:42.852826 #4159776] INFO -- : [562/885] 7238=test_gem_commands_check_command I, [2024-05-05T22:08:42.880854 #4159776] INFO -- : [563/885] 7238=errors_test I, [2024-05-05T22:08:42.919550 #4159776] INFO -- : [564/885] 7241=test_vm_dump I, [2024-05-05T22:08:42.923491 #4159776] INFO -- : [565/885] 7241=test_tmpdir I, [2024-05-05T22:08:42.985537 #4159776] INFO -- : [566/885] 7245=test_rdoc_markup_document I, [2024-05-05T22:08:42.998872 #4159776] INFO -- : [567/885] 7245=test_integer_comb I, [2024-05-05T22:08:43.011041 #4159776] INFO -- : [568/885] 7238=test_force_exit I, [2024-05-05T22:08:43.015214 #4159776] INFO -- : [569/885] 7241=test_file I, [2024-05-05T22:08:43.021330 #4159776] INFO -- : [570/885] 7238=test_ostruct I, [2024-05-05T22:08:43.052297 #4159776] INFO -- : [571/885] 7248=unescape_test I, [2024-05-05T22:08:43.188151 #4159776] INFO -- : [572/885] 7252=bom_test I, [2024-05-05T22:08:43.208774 #4159776] INFO -- : [573/885] 7238=test_data_error I, [2024-05-05T22:08:43.222153 #4159776] INFO -- : [574/885] 7250=test_udp I, [2024-05-05T22:08:43.227565 #4159776] INFO -- : [575/885] 7250=static_inspect_test I, [2024-05-05T22:08:43.238437 #4159776] INFO -- : [576/885] 7250=test_gem_uri_formatter I, [2024-05-05T22:08:43.259231 #4159776] INFO -- : [577/885] 7250=test_encoding I, [2024-05-05T22:08:43.275115 #4159776] INFO -- : [578/885] 7252=test_erb_command I, [2024-05-05T22:08:43.297601 #4159776] INFO -- : [579/885] 7238=test_helper I, [2024-05-05T22:08:43.303959 #4159776] INFO -- : [580/885] 7238=command_line_test I, [2024-05-05T22:08:43.312587 #4159776] INFO -- : [581/885] 7238=test_pty I, [2024-05-05T22:08:43.328727 #4159776] INFO -- : [582/885] 7252=test_dup I, [2024-05-05T22:08:43.519383 #4159776] INFO -- : [583/885] 7250=test_constant I, [2024-05-05T22:08:43.559567 #4159776] INFO -- : [584/885] 7252=test_project_sanity I, [2024-05-05T22:08:43.611135 #4159776] INFO -- : [585/885] 7252=test_range I, [2024-05-05T22:08:43.641991 #4159776] INFO -- : [586/885] 7249=test_rdoc_ri_paths I, [2024-05-05T22:08:43.674467 #4159776] INFO -- : [587/885] 7249=test_ts I, [2024-05-05T22:08:43.824718 #4159776] INFO -- : [588/885] 7238=test_addr I, [2024-05-05T22:08:43.841585 #4159776] INFO -- : [589/885] 7238=test_locale I, [2024-05-05T22:08:43.843056 #4159776] INFO -- : [590/885] 7247=library_symbols_test I, [2024-05-05T22:08:43.863165 #4159776] INFO -- : [591/885] 7242=test_ensured I, [2024-05-05T22:08:43.871179 #4159776] INFO -- : [592/885] 7238=test_gem_resolver_vendor_set I, [2024-05-05T22:08:43.900935 #4159776] INFO -- : [593/885] 7238=test_config I, [2024-05-05T22:08:43.923161 #4159776] INFO -- : [594/885] 7242=test_enumerable I, [2024-05-05T22:08:43.935533 #4159776] INFO -- : [595/885] 7242=test_gem_safe_marshal I, [2024-05-05T22:08:43.938794 #4159776] INFO -- : [596/885] 7247=test_gem_resolver_api_set I, [2024-05-05T22:08:43.993079 #4159776] INFO -- : [597/885] 7247=test_transcode I, [2024-05-05T22:08:44.177753 #4159776] INFO -- : [598/885] 7246=test_eval I, [2024-05-05T22:08:44.193170 #4159776] INFO -- : [599/885] 7247=json_generator_test I, [2024-05-05T22:08:44.258449 #4159776] INFO -- : [600/885] 7249=test_rdoc_code_object I, [2024-05-05T22:08:44.295352 #4159776] INFO -- : [601/885] 7247=test_x509store I, [2024-05-05T22:08:44.332794 #4159776] INFO -- : [602/885] 7238=test_x509name I, [2024-05-05T22:08:44.345674 #4159776] INFO -- : [603/885] 7238=test_fips I, [2024-05-05T22:08:44.386035 #4159776] INFO -- : [604/885] 7254=test_update I, [2024-05-05T22:08:44.396023 #4159776] INFO -- : [605/885] 7254=test_lambda I, [2024-05-05T22:08:44.410778 #4159776] INFO -- : [606/885] 7246=test_ast I, [2024-05-05T22:08:44.443003 #4159776] INFO -- : [607/885] 7252=test_gem_request_set_gem_dependency_api I, [2024-05-05T22:08:44.457882 #4159776] INFO -- : [608/885] 7242=test_jaro_winkler I, [2024-05-05T22:08:44.459799 #4159776] INFO -- : [609/885] 7254=test_helper I, [2024-05-05T22:08:44.462049 #4159776] INFO -- : [610/885] 7254=test_random_formatter I, [2024-05-05T22:08:44.464131 #4159776] INFO -- : [611/885] 7242=test_webauthn_listener I, [2024-05-05T22:08:44.478565 #4159776] INFO -- : [612/885] 7254=test_pkey_rsa I, [2024-05-05T22:08:44.564000 #4159776] INFO -- : [613/885] 7247=test_numhash I, [2024-05-05T22:08:44.568306 #4159776] INFO -- : [614/885] 7247=test_weakkeymap I, [2024-05-05T22:08:44.596308 #4159776] INFO -- : [615/885] 7242=test_gem_commands_push_command I, [2024-05-05T22:08:44.621275 #4159776] INFO -- : [616/885] 7238=test_rdoc_markup_hard_break I, [2024-05-05T22:08:44.629065 #4159776] INFO -- : [617/885] 7238=test_placearg I, [2024-05-05T22:08:44.714841 #4159776] INFO -- : [618/885] 7254=test_date_strptime I, [2024-05-05T22:08:44.739391 #4159776] INFO -- : [619/885] 7252=test_gem_package_task I, [2024-05-05T22:08:44.744978 #4159776] INFO -- : [620/885] 7252=test_gem_platform I, [2024-05-05T22:08:44.749076 #4159776] INFO -- : [621/885] 7249=test_delete I, [2024-05-05T22:08:44.756581 #4159776] INFO -- : [622/885] 7249=test_win32ole_method I, [2024-05-05T22:08:44.761524 #4159776] INFO -- : [623/885] 7249=test_continuation I, [2024-05-05T22:08:44.768351 #4159776] INFO -- : [624/885] 7249=test_fd_setsize I, [2024-05-05T22:08:44.770506 #4159776] INFO -- : [625/885] 7249=test_keyword I, [2024-05-05T22:08:44.788466 #4159776] INFO -- : [626/885] 7238=test_class_name_check I, [2024-05-05T22:08:44.800672 #4159776] INFO -- : [627/885] 7248=test_files_test I, [2024-05-05T22:08:44.817734 #4159776] INFO -- : [628/885] 7252=test_gem_update_suggestion I, [2024-05-05T22:08:44.822364 #4159776] INFO -- : [629/885] 7254=test_file_exhaustive I, [2024-05-05T22:08:44.855821 #4159776] INFO -- : [630/885] 7238=test_logger I, [2024-05-05T22:08:44.880314 #4159776] INFO -- : [631/885] 7252=test_import I, [2024-05-05T22:08:44.892414 #4159776] INFO -- : [632/885] 7238=test_not I, [2024-05-05T22:08:44.893805 #4159776] INFO -- : [633/885] 7238=test_gem_resolver_lock_set I, [2024-05-05T22:08:44.941141 #4159776] INFO -- : [634/885] 7238=test_rdoc_parser_markdown I, [2024-05-05T22:08:44.951731 #4159776] INFO -- : [635/885] 7248=heredoc_dedent_test I, [2024-05-05T22:08:44.953483 #4159776] INFO -- : [636/885] 7238=test_cgi_header I, [2024-05-05T22:08:44.958877 #4159776] INFO -- : [637/885] 7248=test_object I, [2024-05-05T22:08:44.962609 #4159776] INFO -- : [638/885] 7248=version_test I, [2024-05-05T22:08:44.965339 #4159776] INFO -- : [639/885] 7248=test_key_actor_emacs I, [2024-05-05T22:08:44.973039 #4159776] INFO -- : [640/885] 7238=test_gem_command_manager I, [2024-05-05T22:08:44.985474 #4159776] INFO -- : [641/885] 7253=test_gem_gemcutter_utilities I, [2024-05-05T22:08:44.985547 #4159776] INFO -- : [642/885] 7247=test_basicinstructions I, [2024-05-05T22:08:45.071793 #4159776] INFO -- : [643/885] 7247=test_arithmetic_sequence I, [2024-05-05T22:08:45.085720 #4159776] INFO -- : [644/885] 7247=compiler_test I, [2024-05-05T22:08:45.091610 #4159776] INFO -- : [645/885] 7247=test_flip I, [2024-05-05T22:08:45.113941 #4159776] INFO -- : [646/885] 7247=test_change_word I, [2024-05-05T22:08:45.121499 #4159776] INFO -- : [647/885] 7247=test_normalize I, [2024-05-05T22:08:45.125719 #4159776] INFO -- : [648/885] 7247=test_ossl I, [2024-05-05T22:08:45.130197 #4159776] INFO -- : [649/885] 7242=test_timeout I, [2024-05-05T22:08:45.135547 #4159776] INFO -- : [650/885] 7248=test_gem_local_remote_options I, [2024-05-05T22:08:45.137038 #4159776] INFO -- : [651/885] 7242=test_object I, [2024-05-05T22:08:45.152020 #4159776] INFO -- : [652/885] 7238=test_ruby_lex I, [2024-05-05T22:08:45.174782 #4159776] INFO -- : [653/885] 7248=test_date_arith I, [2024-05-05T22:08:45.180436 #4159776] INFO -- : [654/885] 7248=test_sleep I, [2024-05-05T22:08:45.275738 #4159776] INFO -- : [655/885] 7238=test_type I, [2024-05-05T22:08:45.290697 #4159776] INFO -- : [656/885] 7238=test_ractor I, [2024-05-05T22:08:45.356854 #4159776] INFO -- : [657/885] 7253=test_big5 I, [2024-05-05T22:08:45.363736 #4159776] INFO -- : [658/885] 7253=test_func I, [2024-05-05T22:08:45.374900 #4159776] INFO -- : [659/885] 7238=test_pointer I, [2024-05-05T22:08:45.448783 #4159776] INFO -- : [660/885] 7249=test_rdoc_rd_block_parser I, [2024-05-05T22:08:45.487649 #4159776] INFO -- : [661/885] 7249=test_tsort I, [2024-05-05T22:08:45.496853 #4159776] INFO -- : [662/885] 7249=test_signedness I, [2024-05-05T22:08:45.545023 #4159776] INFO -- : [663/885] 7242=test_primitive I, [2024-05-05T22:08:45.551748 #4159776] INFO -- : [664/885] 7242=test_human_typo I, [2024-05-05T22:08:45.555110 #4159776] INFO -- : [665/885] 7242=test_rbconfig I, [2024-05-05T22:08:45.558001 #4159776] INFO -- : [666/885] 7242=test_rdoc_generator_pot_po_entry I, [2024-05-05T22:08:45.684087 #4159776] INFO -- : [667/885] 7242=test_euc_jp I, [2024-05-05T22:08:45.687301 #4159776] INFO -- : [668/885] 7242=test_acceptable I, [2024-05-05T22:08:45.746199 #4159776] INFO -- : [669/885] 7242=test_document I, [2024-05-05T22:08:45.757518 #4159776] INFO -- : [670/885] 7242=test_gem_commands_yank_command I, [2024-05-05T22:08:45.820394 #4159776] INFO -- : [671/885] 7252=test_win32ole_param I, [2024-05-05T22:08:45.822430 #4159776] INFO -- : [672/885] 7252=test_pair I, [2024-05-05T22:08:45.872333 #4159776] INFO -- : [673/885] 7240=test_rdoc_i18n_locale I, [2024-05-05T22:08:45.880457 #4159776] INFO -- : [674/885] 7240=test_name_error_extension I, [2024-05-05T22:08:45.904926 #4159776] INFO -- : [675/885] 7240=test_chilled I, [2024-05-05T22:08:45.905493 #4159776] INFO -- : [676/885] 7240=test_rdoc_ri_driver I, [2024-05-05T22:08:45.958582 #4159776] INFO -- : [677/885] 7250=test_gem_resolver_local_specification I, [2024-05-05T22:08:45.992545 #4159776] INFO -- : [678/885] 7250=test_httpheader I, [2024-05-05T22:08:46.026658 #4159776] INFO -- : [679/885] 7238=test_encoding I, [2024-05-05T22:08:46.037420 #4159776] INFO -- : [680/885] 7238=test_httpresponses I, [2024-05-05T22:08:46.049189 #4159776] INFO -- : [681/885] 7250=test_set_len I, [2024-05-05T22:08:46.054241 #4159776] INFO -- : [682/885] 7250=test_sockopt I, [2024-05-05T22:08:46.062536 #4159776] INFO -- : [683/885] 7250=test_rdoc_markup_to_label I, [2024-05-05T22:08:46.066442 #4159776] INFO -- : [684/885] 7238=test_install I, [2024-05-05T22:08:46.084189 #4159776] INFO -- : [685/885] 7250=test_key_stroke I, [2024-05-05T22:08:46.159337 #4159776] INFO -- : [686/885] 7250=test_color I, [2024-05-05T22:08:46.166666 #4159776] INFO -- : [687/885] 7240=json_encoding_test I, [2024-05-05T22:08:46.170328 #4159776] INFO -- : [688/885] 7240=test_bug-14834 I, [2024-05-05T22:08:46.211222 #4159776] INFO -- : [689/885] 7250=test_rdoc_markup_to_html I, [2024-05-05T22:08:46.213768 #4159776] INFO -- : [690/885] 7242=test_date_compat I, [2024-05-05T22:08:46.218559 #4159776] INFO -- : [691/885] 7242=test_compile_prism I, [2024-05-05T22:08:46.241205 #4159776] INFO -- : [692/885] 7240=test_terminfo I, [2024-05-05T22:08:46.246919 #4159776] INFO -- : [693/885] 7240=test_win32ole_param_event I, [2024-05-05T22:08:46.248810 #4159776] INFO -- : [694/885] 7240=test_bn I, [2024-05-05T22:08:46.273400 #4159776] INFO -- : [695/885] 7238=test_case_mapping I, [2024-05-05T22:08:46.279148 #4159776] INFO -- : [696/885] 7240=redundant_return_test I, [2024-05-05T22:08:46.284127 #4159776] INFO -- : [697/885] 7238=test_path I, [2024-05-05T22:08:46.289310 #4159776] INFO -- : [698/885] 7240=test_tree_spell_checker I, [2024-05-05T22:08:46.294644 #4159776] INFO -- : [699/885] 7238=test_http I, [2024-05-05T22:08:46.323172 #4159776] INFO -- : [700/885] 7240=test_addrinfo I, [2024-05-05T22:08:46.330194 #4159776] INFO -- : [701/885] 7250=test_rdoc_method_attr I, [2024-05-05T22:08:46.391939 #4159776] INFO -- : [702/885] 7240=test_data I, [2024-05-05T22:08:46.399034 #4159776] INFO -- : [703/885] 7240=static_literals_test I, [2024-05-05T22:08:46.406503 #4159776] INFO -- : [704/885] 7240=test_gem_gem_runner I, [2024-05-05T22:08:46.445182 #4159776] INFO -- : [705/885] 7250=test_filter I, [2024-05-05T22:08:46.461732 #4159776] INFO -- : [706/885] 7250=test_rdoc_generator_pot I, [2024-05-05T22:08:46.464531 #4159776] INFO -- : [707/885] 7250=test_unicode I, [2024-05-05T22:08:46.470523 #4159776] INFO -- : [708/885] 7250=parameters_signature_test I, [2024-05-05T22:08:46.473979 #4159776] INFO -- : [709/885] 7240=test_koi8 I, [2024-05-05T22:08:46.478467 #4159776] INFO -- : [710/885] 7250=test_enumerator I, [2024-05-05T22:08:46.482925 #4159776] INFO -- : [711/885] 7242=test_rdoc_parser_changelog I, [2024-05-05T22:08:46.484523 #4159776] INFO -- : [712/885] 7240=test_thread_cv I, [2024-05-05T22:08:46.484950 #4159776] INFO -- : [713/885] 7250=test_lexer I, [2024-05-05T22:08:46.499341 #4159776] INFO -- : [714/885] 7250=test_ssl_session I, [2024-05-05T22:08:46.578111 #4159776] INFO -- : [715/885] 7242=test_gem_commands_update_command I, [2024-05-05T22:08:46.605677 #4159776] INFO -- : [716/885] 7245=test_gem_resolver_vendor_specification I, [2024-05-05T22:08:46.639420 #4159776] INFO -- : [717/885] 7245=test_random I, [2024-05-05T22:08:46.653568 #4159776] INFO -- : [718/885] 7245=test_notimplement I, [2024-05-05T22:08:46.667694 #4159776] INFO -- : [719/885] 7245=test_key_event_record I, [2024-05-05T22:08:46.705735 #4159776] INFO -- : [720/885] 7245=test_gem_uri I, [2024-05-05T22:08:46.725627 #4159776] INFO -- : [721/885] 7245=test_gem_commands_build_command I, [2024-05-05T22:08:46.854985 #4159776] INFO -- : [722/885] 7255=test_case_comprehensive I, [2024-05-05T22:08:46.943500 #4159776] INFO -- : [723/885] 7237=test_interned_str I, [2024-05-05T22:08:46.949619 #4159776] INFO -- : [724/885] 7237=test_did_you_mean I, [2024-05-05T22:08:47.001492 #4159776] INFO -- : [725/885] 7245=test_variable_name_check I, [2024-05-05T22:08:47.033760 #4159776] INFO -- : [726/885] 7245=test_io_m17n I, [2024-05-05T22:08:47.068828 #4159776] INFO -- : [727/885] 7237=test_gem_commands_server_command I, [2024-05-05T22:08:47.072315 #4159776] INFO -- : [728/885] 7237=test_option I, [2024-05-05T22:08:47.128880 #4159776] INFO -- : [729/885] 7240=test_append I, [2024-05-05T22:08:47.145773 #4159776] INFO -- : [730/885] 7240=test_tracer I, [2024-05-05T22:08:47.197275 #4159776] INFO -- : [731/885] 7240=test_cmethod I, [2024-05-05T22:08:47.197420 #4159776] INFO -- : [732/885] 7240=test_iseq I, [2024-05-05T22:08:47.228502 #4159776] INFO -- : [733/885] 7237=test_exception_at_throwing I, [2024-05-05T22:08:47.303142 #4159776] INFO -- : [734/885] 7237=test_rdoc_markup_heading I, [2024-05-05T22:08:47.312107 #4159776] INFO -- : [735/885] 7237=test_class I, [2024-05-05T22:08:47.321600 #4159776] INFO -- : [736/885] 7237=test_ocsp I, [2024-05-05T22:08:47.459667 #4159776] INFO -- : [737/885] 7253=test_pkey_dsa I, [2024-05-05T22:08:47.483033 #4159776] INFO -- : [738/885] 7250=test_scheduler I, [2024-05-05T22:08:47.623462 #4159776] INFO -- : [739/885] 7237=test_within_pipe I, [2024-05-05T22:08:47.632726 #4159776] INFO -- : [740/885] 7237=test_gem_bundler_version_finder I, [2024-05-05T22:08:47.637152 #4159776] INFO -- : [741/885] 7250=test_emoji_breaks I, [2024-05-05T22:08:47.659545 #4159776] INFO -- : [742/885] 7250=reflection_test I, [2024-05-05T22:08:47.661767 #4159776] INFO -- : [743/885] 7237=test_beginendblock I, [2024-05-05T22:08:47.664330 #4159776] INFO -- : [744/885] 7250=test_gem_commands_unpack_command I, [2024-05-05T22:08:47.741628 #4159776] INFO -- : [745/885] 7242=test_files_lib I, [2024-05-05T22:08:47.886393 #4159776] INFO -- : [746/885] 7249=test_rdoc_markup_to_bs I, [2024-05-05T22:08:47.926802 #4159776] INFO -- : [747/885] 7250=test_help I, [2024-05-05T22:08:47.931878 #4159776] INFO -- : [748/885] 7250=test_rdoc_markup_pre_process I, [2024-05-05T22:08:47.936456 #4159776] INFO -- : [749/885] 7249=test_printf I, [2024-05-05T22:08:47.954472 #4159776] INFO -- : [750/885] 7249=test_stream I, [2024-05-05T22:08:47.959589 #4159776] INFO -- : [751/885] 7249=test_webauthn_listener_response I, [2024-05-05T22:08:47.981864 #4159776] INFO -- : [752/885] 7249=test_time I, [2024-05-05T22:08:47.996941 #4159776] INFO -- : [753/885] 7250=test_to_ary_concat I, [2024-05-05T22:08:48.011904 #4159776] INFO -- : [754/885] 7240=test_pinned I, [2024-05-05T22:08:48.102391 #4159776] INFO -- : [755/885] 7253=test_popen_deadlock I, [2024-05-05T22:08:48.103000 #4159776] INFO -- : [756/885] 7237=test_delegate I, [2024-05-05T22:08:48.106817 #4159776] INFO -- : [757/885] 7240=test_date_marshal I, [2024-05-05T22:08:48.112575 #4159776] INFO -- : [758/885] 7240=test_mkmf I, [2024-05-05T22:08:48.131534 #4159776] INFO -- : [759/885] 7237=test_history I, [2024-05-05T22:08:48.151888 #4159776] INFO -- : [760/885] 7240=test_recursion I, [2024-05-05T22:08:48.152530 #4159776] INFO -- : [761/885] 7240=test_exit I, [2024-05-05T22:08:48.173886 #4159776] INFO -- : [762/885] 7249=test_digest I, [2024-05-05T22:08:48.173951 #4159776] INFO -- : [763/885] 7237=test_gem_security I, [2024-05-05T22:08:48.176484 #4159776] INFO -- : [764/885] 7249=test_rdoc_servlet I, [2024-05-05T22:08:48.247619 #4159776] INFO -- : [765/885] 7240=test_ractor I, [2024-05-05T22:08:48.284934 #4159776] INFO -- : [766/885] 7245=test_open3 I, [2024-05-05T22:08:48.298581 #4159776] INFO -- : [767/885] 7249=test_fiber I, [2024-05-05T22:08:48.326061 #4159776] INFO -- : [768/885] 7240=test_multi_irb_commands I, [2024-05-05T22:08:48.342416 #4159776] INFO -- : [769/885] 7240=test_bundled_ca I, [2024-05-05T22:08:48.535644 #4159776] INFO -- : [770/885] 7243=test_closure I, [2024-05-05T22:08:48.674895 #4159776] INFO -- : [771/885] 7253=test_cgi_cookie I, [2024-05-05T22:08:48.680624 #4159776] INFO -- : [772/885] 7253=test_require I, [2024-05-05T22:08:48.886937 #4159776] INFO -- : [773/885] 7243=test_float I, [2024-05-05T22:08:49.085740 #4159776] INFO -- : [774/885] 7241=test_gem_resolver_installer_set I, [2024-05-05T22:08:49.203092 #4159776] INFO -- : [775/885] 7252=test_dir_m17n I, [2024-05-05T22:08:49.281904 #4159776] INFO -- : [776/885] 7241=test_gem_source_git I, [2024-05-05T22:08:49.553307 #4159776] INFO -- : [777/885] 7250=test_refinement I, [2024-05-05T22:08:49.894710 #4159776] INFO -- : [778/885] 7240=test_gem_commands_signout_command I, [2024-05-05T22:08:49.904290 #4159776] INFO -- : [779/885] 7240=test_regex_casefold I, [2024-05-05T22:08:49.906523 #4159776] INFO -- : [780/885] 7241=test_x509crl I, [2024-05-05T22:08:50.051926 #4159776] INFO -- : [781/885] 7241=test_signal I, [2024-05-05T22:08:50.185475 #4159776] INFO -- : [782/885] 7248=test_fixnum I, [2024-05-05T22:08:50.194076 #4159776] INFO -- : [783/885] 7248=test_metaclass I, [2024-05-05T22:08:50.196298 #4159776] INFO -- : [784/885] 7248=test_rdoc_top_level I, [2024-05-05T22:08:50.292449 #4159776] INFO -- : [785/885] 7243=test_cgi_session I, [2024-05-05T22:08:50.318110 #4159776] INFO -- : [786/885] 7243=test_rdoc_rd I, [2024-05-05T22:08:50.334451 #4159776] INFO -- : [787/885] 7243=test_windows_1252 I, [2024-05-05T22:08:50.348172 #4159776] INFO -- : [788/885] 7243=test_input_method I, [2024-05-05T22:08:50.413934 #4159776] INFO -- : [789/885] 7243=test_process I, [2024-05-05T22:08:50.463464 #4159776] INFO -- : [790/885] 7243=test_omap I, [2024-05-05T22:08:50.468204 #4159776] INFO -- : [791/885] 7243=test_string I, [2024-05-05T22:08:50.471584 #4159776] INFO -- : [792/885] 7243=test_iterator I, [2024-05-05T22:08:50.497736 #4159776] INFO -- : [793/885] 7240=test_digest_extend I, [2024-05-05T22:08:50.506225 #4159776] INFO -- : [794/885] 7248=test_shellwords I, [2024-05-05T22:08:50.512104 #4159776] INFO -- : [795/885] 7248=pattern_test I, [2024-05-05T22:08:50.515720 #4159776] INFO -- : [796/885] 7240=test_memory_view I, [2024-05-05T22:08:50.520737 #4159776] INFO -- : [797/885] 7248=test_debug I, [2024-05-05T22:08:50.528230 #4159776] INFO -- : [798/885] 7248=test_gem_security_signer I, [2024-05-05T22:08:50.547133 #4159776] INFO -- : [799/885] 7240=test_cipher I, [2024-05-05T22:08:50.563221 #4159776] INFO -- : [800/885] 7243=test_new I, [2024-05-05T22:08:50.568004 #4159776] INFO -- : [801/885] 7243=test_gem_resolver_git_set I, [2024-05-05T22:08:50.590475 #4159776] INFO -- : [802/885] 7240=test_storage I, [2024-05-05T22:08:50.603040 #4159776] INFO -- : [803/885] 7240=json_common_interface_test I, [2024-05-05T22:08:50.616981 #4159776] INFO -- : [804/885] 7240=test_gem_source_subpath_problem I, [2024-05-05T22:08:50.623349 #4159776] INFO -- : [805/885] 7248=test_dln I, [2024-05-05T22:08:50.623484 #4159776] INFO -- : [806/885] 7248=test_win32ole_variant_outarg I, [2024-05-05T22:08:50.628473 #4159776] INFO -- : [807/885] 7245=test_config I, [2024-05-05T22:08:50.630490 #4159776] INFO -- : [808/885] 7248=memsize_test I, [2024-05-05T22:08:50.637415 #4159776] INFO -- : [809/885] 7248=json_parser_test I, [2024-05-05T22:08:50.638973 #4159776] INFO -- : [810/885] 7252=test_nomethod_error I, [2024-05-05T22:08:50.646268 #4159776] INFO -- : [811/885] 7252=test_cparser I, [2024-05-05T22:08:50.661772 #4159776] INFO -- : [812/885] 7245=test_pkg_config I, [2024-05-05T22:08:50.698368 #4159776] INFO -- : [813/885] 7248=test_variable I, [2024-05-05T22:08:50.707353 #4159776] INFO -- : [814/885] 7245=test_sexp I, [2024-05-05T22:08:50.722570 #4159776] INFO -- : [815/885] 7240=test_rdoc_markup_include I, [2024-05-05T22:08:50.725664 #4159776] INFO -- : [816/885] 7240=fuzzer_test I, [2024-05-05T22:08:50.733401 #4159776] INFO -- : [817/885] 7240=test_rdoc_markup_to_html_snippet I, [2024-05-05T22:08:50.740568 #4159776] INFO -- : [818/885] 7245=magic_comment_test I, [2024-05-05T22:08:50.807948 #4159776] INFO -- : [819/885] 7245=test_struct I, [2024-05-05T22:08:50.812221 #4159776] INFO -- : [820/885] 7248=test_key_error I, [2024-05-05T22:08:50.816248 #4159776] INFO -- : [821/885] 7248=test_win32ole_variant_m I, [2024-05-05T22:08:50.818545 #4159776] INFO -- : [822/885] 7248=test_engine I, [2024-05-05T22:08:50.819721 #4159776] INFO -- : [823/885] 7248=test_allocation I, [2024-05-05T22:08:50.826752 #4159776] INFO -- : [824/885] 7240=test_div I, [2024-05-05T22:08:50.831200 #4159776] INFO -- : [825/885] 7245=test_color_printer I, [2024-05-05T22:08:50.837548 #4159776] INFO -- : [826/885] 7240=test_deprecated I, [2024-05-05T22:08:50.840080 #4159776] INFO -- : [827/885] 7240=test_serialize_subclasses I, [2024-05-05T22:08:50.848765 #4159776] INFO -- : [828/885] 7245=test_insns_leaf I, [2024-05-05T22:08:50.849113 #4159776] INFO -- : [829/885] 7245=test_gem_path_support I, [2024-05-05T22:08:50.855528 #4159776] INFO -- : [830/885] 7240=test_struct I, [2024-05-05T22:08:50.875745 #4159776] INFO -- : [831/885] 7254=test_set I, [2024-05-05T22:08:50.877893 #4159776] INFO -- : [832/885] 7245=test_files_test_1 I, [2024-05-05T22:08:50.879039 #4159776] INFO -- : [833/885] 7245=test_rdoc_rd_inline I, [2024-05-05T22:08:50.884047 #4159776] INFO -- : [834/885] 7245=test_x509req I, [2024-05-05T22:08:50.900219 #4159776] INFO -- : [835/885] 7254=test_mutex I, [2024-05-05T22:08:50.913336 #4159776] INFO -- : [836/885] 7239=test_gem_ext_cargo_builder I, [2024-05-05T22:08:50.956767 #4159776] INFO -- : [837/885] 7239=test_ssl I, [2024-05-05T22:08:50.958795 #4159776] INFO -- : [838/885] 7243=constant_path_node_test I, [2024-05-05T22:08:50.966977 #4159776] INFO -- : [839/885] 7243=test_gem_request_set I, [2024-05-05T22:08:51.053333 #4159776] INFO -- : [840/885] 7245=test_module I, [2024-05-05T22:08:51.212017 #4159776] INFO -- : [841/885] 7242=test_parser I, [2024-05-05T22:08:51.249010 #4159776] INFO -- : [842/885] 7242=test_arith_seq_extract I, [2024-05-05T22:08:51.300858 #4159776] INFO -- : [843/885] 7251=test_method_name_check I, [2024-05-05T22:08:51.310725 #4159776] INFO -- : [844/885] 7243=test_buffered_io I, [2024-05-05T22:08:51.325514 #4159776] INFO -- : [845/885] 7251=test_monitor I, [2024-05-05T22:08:51.344675 #4159776] INFO -- : [846/885] 7253=test_rubyvm I, [2024-05-05T22:08:51.352332 #4159776] INFO -- : [847/885] 7253=test_configuration I, [2024-05-05T22:08:51.365575 #4159776] INFO -- : [848/885] 7243=test_rdoc_generator_markup I, [2024-05-05T22:08:51.370046 #4159776] INFO -- : [849/885] 7243=test_whileuntil I, [2024-05-05T22:08:51.371134 #4159776] INFO -- : [850/885] 7252=test_boolean I, [2024-05-05T22:08:51.371960 #4159776] INFO -- : [851/885] 7243=test_instrumentation_api I, [2024-05-05T22:08:51.383425 #4159776] INFO -- : [852/885] 7240=integer_parse_test I, [2024-05-05T22:08:51.385024 #4159776] INFO -- : [853/885] 7240=test_stringify_symbols I, [2024-05-05T22:08:51.397109 #4159776] INFO -- : [854/885] 7240=test_nesting_parser I, [2024-05-05T22:08:51.397840 #4159776] INFO -- : [855/885] 7252=test_win32ole_method_event I, [2024-05-05T22:08:51.401891 #4159776] INFO -- : [856/885] 7252=test_benchmark I, [2024-05-05T22:08:51.419591 #4159776] INFO -- : [857/885] 7240=test_gem_dependency_list I, [2024-05-05T22:08:51.450213 #4159776] INFO -- : [858/885] 7253=test_gem_package_tar_writer I, [2024-05-05T22:08:51.455718 #4159776] INFO -- : [859/885] 7242=test_helper_method I, [2024-05-05T22:08:51.487138 #4159776] INFO -- : [860/885] 7240=test_array I, [2024-05-05T22:08:51.504815 #4159776] INFO -- : [861/885] 7247=test_gem_commands_outdated_command I, [2024-05-05T22:08:51.522941 #4159776] INFO -- : [862/885] 7242=test_scalar_scanner I, [2024-05-05T22:08:51.529818 #4159776] INFO -- : [863/885] 7247=test_gem_source I, [2024-05-05T22:08:51.531739 #4159776] INFO -- : [864/885] 7242=test_gem_commands_rebuild_command I, [2024-05-05T22:08:51.535137 #4159776] INFO -- : [865/885] 7251=test_yamldbm I, [2024-05-05T22:08:51.539996 #4159776] INFO -- : [866/885] 7253=test_load I, [2024-05-05T22:08:51.540604 #4159776] INFO -- : [867/885] 7253=test_rdoc_parser_simple I, [2024-05-05T22:08:51.541185 #4159776] INFO -- : [868/885] 7251=test_provider I, [2024-05-05T22:08:51.558999 #4159776] INFO -- : [869/885] 7253=test_abi I, [2024-05-05T22:08:51.605653 #4159776] INFO -- : [870/885] 7242=test_evaluation I, [2024-05-05T22:08:51.616450 #4159776] INFO -- : [871/885] 7242=test_gem_ext_builder I, [2024-05-05T22:08:51.703851 #4159776] INFO -- : [872/885] 7247=test_https I, [2024-05-05T22:08:51.738215 #4159776] INFO -- : [873/885] 7253=test_gem_source_installed I, [2024-05-05T22:08:51.749990 #4159776] INFO -- : [874/885] 7253=test_x509ext I, [2024-05-05T22:08:51.753428 #4159776] INFO -- : [875/885] 7253=test_erb I, [2024-05-05T22:08:51.788537 #4159776] INFO -- : [876/885] 7253=test_completion I, [2024-05-05T22:08:51.871598 #4159776] INFO -- : [877/885] 7251=test_gem_commands_cert_command I, [2024-05-05T22:08:52.030466 #4159776] INFO -- : [878/885] 7254=test_yield_block I, [2024-05-05T22:08:52.033332 #4159776] INFO -- : [879/885] 7254=test_len I, [2024-05-05T22:08:52.035526 #4159776] INFO -- : [880/885] 7247=test_rational2 I, [2024-05-05T22:08:52.038076 #4159776] INFO -- : [881/885] 7254=test_rational I, [2024-05-05T22:08:52.058178 #4159776] INFO -- : [882/885] 7254=test_spell_checker I, [2024-05-05T22:08:52.066382 #4159776] INFO -- : [883/885] 7247=attribute_write_test I, [2024-05-05T22:08:52.068004 #4159776] INFO -- : [884/885] 7247=test_propertyputref I, [2024-05-05T22:08:52.072419 #4159776] INFO -- : [885/885] 7247=test_assembler E, [2024-05-05T22:09:10.630626 #4159776] ERROR -- : Failed tests: E, [2024-05-05T22:09:10.630682 #4159776] ERROR -- : TestObjSpace#test_dump_special_consts: Test::Unit::AssertionFailedError: <"{\"type\":\"SYMBOL\", \"value\":\"foo\"}"> expected but was E, [2024-05-05T22:09:10.630690 #4159776] ERROR -- : I, [2024-05-05T22:09:10.630718 #4159776] INFO -- : I, [2024-05-05T22:09:10.630760 #4159776] INFO -- : Retrying... I, [2024-05-05T22:09:12.626309 #4159776] INFO -- : Finished tests in 40.701546s, 647.5675 tests/s, 229760.9035 assertions/s. E, [2024-05-05T22:09:12.626387 #4159776] ERROR -- : Children under /tmp/rubytest.0cvreb: E, [2024-05-05T22:09:12.626422 #4159776] ERROR -- : * drwx------ 4 80 2024-05-05 22:08:51 +0000 gem_rebuild20240505-7242-p0rgo4/ E, [2024-05-05T22:09:12.626430 #4159776] ERROR -- : * drwxrwxr-x 2 60 2024-05-05 22:08:51 +0000 new/ E, [2024-05-05T22:09:12.626440 #4159776] ERROR -- : * -rw-rw-r-- 1 4096 2024-05-05 22:08:51 +0000 rebuild_test_gem-1.0.0.gem E, [2024-05-05T22:09:12.626445 #4159776] ERROR -- : * drwxrwxr-x 2 60 2024-05-05 22:08:51 +0000 old/ E, [2024-05-05T22:09:12.626448 #4159776] ERROR -- : * -rw-rw-r-- 1 4096 2024-05-05 22:08:51 +0000 rebuild_test_gem-1.0.0.gem I, [2024-05-05T22:09:12.627542 #4159776] INFO -- : 26357 tests, 9351624 assertions, 0 failures, 0 errors, 306 skips I, [2024-05-05T22:09:12.627572 #4159776] INFO -- : I, [2024-05-05T22:09:12.627586 #4159776] INFO -- : ruby -v: ruby 3.4.0dev (2024-05-05T15:14:53Z master 6747fbe77d) [x86_64-linux] I, [2024-05-05T22:09:12.631136 #4159776] INFO -- : $$$[end] "make yes-test-all TESTOPTS='--stderr-on-failure' TESTS='-j20'" exit with 0. I, [2024-05-05T22:09:12.631345 #4159776] INFO -- : $$$[beg] make yes-test-rubyspec MSPECOPT='--error-output stderr --debug -j' TESTS='-j20' I, [2024-05-05T22:09:12.719661 #4159776] INFO -- : BASERUBY = /usr/bin/ruby --disable=gems I, [2024-05-05T22:09:12.719694 #4159776] INFO -- : CC = gcc I, [2024-05-05T22:09:12.719700 #4159776] INFO -- : LD = ld I, [2024-05-05T22:09:12.719704 #4159776] INFO -- : LDSHARED = gcc -shared I, [2024-05-05T22:09:12.719708 #4159776] INFO -- : CFLAGS = -O3 -fno-fast-math -ggdb3 -Wall -Wextra -Wdeprecated-declarations -Wdiv-by-zero -Wduplicated-cond -Wimplicit-function-declaration -Wimplicit-int -Wpointer-arith -Wwrite-strings -Wold-style-definition -Wimplicit-fallthrough=0 -Wmissing-noreturn -Wno-cast-function-type -Wno-constant-logical-operand -Wno-long-long -Wno-missing-field-initializers -Wno-overlength-strings -Wno-packed-bitfield-compat -Wno-parentheses-equality -Wno-self-assign -Wno-tautological-compare -Wno-unused-parameter -Wno-unused-value -Wsuggest-attribute=format -Wsuggest-attribute=noreturn -Wunused-variable -Wmisleading-indentation -Wundef -fPIC I, [2024-05-05T22:09:12.719713 #4159776] INFO -- : XCFLAGS = -U_FORTIFY_SOURCE -D_FORTIFY_SOURCE=2 -fstack-protector-strong -fno-strict-overflow -fvisibility=hidden -fexcess-precision=standard -DRUBY_EXPORT -I. -I.ext/include/x86_64-linux -I/tmp/ruby/src/trunk/include -I/tmp/ruby/src/trunk -I/tmp/ruby/src/trunk/prism -I/tmp/ruby/src/trunk/enc/unicode/15.0.0 I, [2024-05-05T22:09:12.719717 #4159776] INFO -- : CPPFLAGS = I, [2024-05-05T22:09:12.719720 #4159776] INFO -- : DLDFLAGS = -Wl,--compress-debug-sections=zlib -Wl,-soname,libruby.so.3.4 -fstack-protector-strong I, [2024-05-05T22:09:12.719724 #4159776] INFO -- : SOLIBS = -lz -lrt -lrt -lgmp -ldl -lcrypt -lm -lpthread I, [2024-05-05T22:09:12.719728 #4159776] INFO -- : LANG = en_US.UTF-8 I, [2024-05-05T22:09:12.719732 #4159776] INFO -- : LC_ALL = I, [2024-05-05T22:09:12.719737 #4159776] INFO -- : LC_CTYPE = I, [2024-05-05T22:09:12.719740 #4159776] INFO -- : MFLAGS = I, [2024-05-05T22:09:12.719743 #4159776] INFO -- : RUSTC = no I, [2024-05-05T22:09:12.719747 #4159776] INFO -- : YJIT_RUSTC_ARGS = --crate-name=yjit --crate-type=staticlib --edition=2021 -g -C lto=thin -C opt-level=3 -C overflow-checks=on '--out-dir=/tmp/ruby/build/trunk/yjit/target/release/' /tmp/ruby/src/trunk/yjit/src/lib.rs I, [2024-05-05T22:09:12.720307 #4159776] INFO -- : gcc (Ubuntu 11.4.0-1ubuntu1~22.04) 11.4.0 I, [2024-05-05T22:09:12.720327 #4159776] INFO -- : Copyright (C) 2021 Free Software Foundation, Inc. I, [2024-05-05T22:09:12.720333 #4159776] INFO -- : This is free software; see the source for copying conditions. There is NO I, [2024-05-05T22:09:12.720338 #4159776] INFO -- : warranty; not even for MERCHANTABILITY or FITNESS FOR A PARTICULAR PURPOSE. I, [2024-05-05T22:09:12.720342 #4159776] INFO -- : I, [2024-05-05T22:09:12.722191 #4159776] INFO -- : generating enc.mk I, [2024-05-05T22:09:12.841540 #4159776] INFO -- : making enc I, [2024-05-05T22:09:12.858845 #4159776] INFO -- : make[1]: Entering directory '/tmp/ruby/build/trunk' I, [2024-05-05T22:09:12.858867 #4159776] INFO -- : make[1]: Nothing to be done for 'enc'. I, [2024-05-05T22:09:12.858878 #4159776] INFO -- : make[1]: Leaving directory '/tmp/ruby/build/trunk' I, [2024-05-05T22:09:12.859583 #4159776] INFO -- : making srcs under enc I, [2024-05-05T22:09:12.888877 #4159776] INFO -- : make[1]: Entering directory '/tmp/ruby/build/trunk' I, [2024-05-05T22:09:12.888900 #4159776] INFO -- : make[1]: Nothing to be done for 'srcs'. I, [2024-05-05T22:09:12.888909 #4159776] INFO -- : make[1]: Leaving directory '/tmp/ruby/build/trunk' I, [2024-05-05T22:09:12.889946 #4159776] INFO -- : generating transdb.h I, [2024-05-05T22:09:12.984385 #4159776] INFO -- : transdb.h unchanged I, [2024-05-05T22:09:12.985683 #4159776] INFO -- : making trans I, [2024-05-05T22:09:13.020023 #4159776] INFO -- : make[1]: Entering directory '/tmp/ruby/build/trunk' I, [2024-05-05T22:09:13.020044 #4159776] INFO -- : make[1]: Nothing to be done for 'trans'. I, [2024-05-05T22:09:13.020050 #4159776] INFO -- : make[1]: Leaving directory '/tmp/ruby/build/trunk' I, [2024-05-05T22:09:13.020692 #4159776] INFO -- : making encs I, [2024-05-05T22:09:13.058012 #4159776] INFO -- : make[1]: Entering directory '/tmp/ruby/build/trunk' I, [2024-05-05T22:09:13.058037 #4159776] INFO -- : make[1]: Nothing to be done for 'encs'. I, [2024-05-05T22:09:13.058042 #4159776] INFO -- : make[1]: Leaving directory '/tmp/ruby/build/trunk' I, [2024-05-05T22:09:13.059685 #4159776] INFO -- : generating makefiles ext/configure-ext.mk I, [2024-05-05T22:09:13.087050 #4159776] INFO -- : ext/configure-ext.mk updated I, [2024-05-05T22:09:13.089432 #4159776] INFO -- : make[1]: Entering directory '/tmp/ruby/build/trunk' I, [2024-05-05T22:09:14.442846 #4159776] INFO -- : make[1]: Leaving directory '/tmp/ruby/build/trunk' I, [2024-05-05T22:09:14.443376 #4159776] INFO -- : generating makefile exts.mk I, [2024-05-05T22:09:14.480255 #4159776] INFO -- : exts.mk unchanged I, [2024-05-05T22:09:14.485330 #4159776] INFO -- : make[1]: Entering directory '/tmp/ruby/build/trunk' I, [2024-05-05T22:09:14.697031 #4159776] INFO -- : make[2]: Entering directory '/tmp/ruby/build/trunk/ext/coverage' I, [2024-05-05T22:09:14.699942 #4159776] INFO -- : make[2]: Leaving directory '/tmp/ruby/build/trunk/ext/coverage' I, [2024-05-05T22:09:14.703696 #4159776] INFO -- : make[2]: Entering directory '/tmp/ruby/build/trunk/ext/date' I, [2024-05-05T22:09:14.706774 #4159776] INFO -- : make[2]: Leaving directory '/tmp/ruby/build/trunk/ext/date' I, [2024-05-05T22:09:14.709001 #4159776] INFO -- : make[2]: Entering directory '/tmp/ruby/build/trunk/ext/digest' I, [2024-05-05T22:09:14.714367 #4159776] INFO -- : make[2]: Leaving directory '/tmp/ruby/build/trunk/ext/digest' I, [2024-05-05T22:09:14.729962 #4159776] INFO -- : make[2]: Entering directory '/tmp/ruby/build/trunk/ext/digest/sha2' I, [2024-05-05T22:09:14.732891 #4159776] INFO -- : make[2]: Leaving directory '/tmp/ruby/build/trunk/ext/digest/sha2' I, [2024-05-05T22:09:14.745517 #4159776] INFO -- : make[2]: Entering directory '/tmp/ruby/build/trunk/ext/fiddle' I, [2024-05-05T22:09:14.751857 #4159776] INFO -- : make[2]: Leaving directory '/tmp/ruby/build/trunk/ext/fiddle' I, [2024-05-05T22:09:14.754806 #4159776] INFO -- : make[2]: Entering directory '/tmp/ruby/build/trunk/ext/io/console' I, [2024-05-05T22:09:14.757399 #4159776] INFO -- : make[2]: Leaving directory '/tmp/ruby/build/trunk/ext/io/console' I, [2024-05-05T22:09:14.764877 #4159776] INFO -- : make[2]: Entering directory '/tmp/ruby/build/trunk/ext/json' I, [2024-05-05T22:09:14.771003 #4159776] INFO -- : make[2]: Leaving directory '/tmp/ruby/build/trunk/ext/json' I, [2024-05-05T22:09:14.780028 #4159776] INFO -- : make[2]: Entering directory '/tmp/ruby/build/trunk/ext/monitor' I, [2024-05-05T22:09:14.782470 #4159776] INFO -- : make[2]: Leaving directory '/tmp/ruby/build/trunk/ext/monitor' I, [2024-05-05T22:09:14.786578 #4159776] INFO -- : make[2]: Entering directory '/tmp/ruby/build/trunk/ext/objspace' I, [2024-05-05T22:09:14.790282 #4159776] INFO -- : make[2]: Leaving directory '/tmp/ruby/build/trunk/ext/objspace' I, [2024-05-05T22:09:14.802220 #4159776] INFO -- : make[2]: Entering directory '/tmp/ruby/build/trunk/ext/openssl' I, [2024-05-05T22:09:14.815509 #4159776] INFO -- : make[2]: Leaving directory '/tmp/ruby/build/trunk/ext/openssl' I, [2024-05-05T22:09:14.818406 #4159776] INFO -- : make[2]: Entering directory '/tmp/ruby/build/trunk/ext/pathname' I, [2024-05-05T22:09:14.820828 #4159776] INFO -- : make[2]: Leaving directory '/tmp/ruby/build/trunk/ext/pathname' I, [2024-05-05T22:09:14.824969 #4159776] INFO -- : make[2]: Entering directory '/tmp/ruby/build/trunk/ext/psych' I, [2024-05-05T22:09:14.839884 #4159776] INFO -- : make[2]: Leaving directory '/tmp/ruby/build/trunk/ext/psych' I, [2024-05-05T22:09:14.842895 #4159776] INFO -- : make[2]: Entering directory '/tmp/ruby/build/trunk/ext/pty' I, [2024-05-05T22:09:14.845566 #4159776] INFO -- : make[2]: Leaving directory '/tmp/ruby/build/trunk/ext/pty' I, [2024-05-05T22:09:14.855085 #4159776] INFO -- : make[2]: Entering directory '/tmp/ruby/build/trunk/ext/ripper' I, [2024-05-05T22:09:14.860040 #4159776] INFO -- : make[2]: Leaving directory '/tmp/ruby/build/trunk/ext/ripper' I, [2024-05-05T22:09:14.861435 #4159776] INFO -- : make[2]: Entering directory '/tmp/ruby/build/trunk/ext/rubyvm' I, [2024-05-05T22:09:14.863427 #4159776] INFO -- : make[2]: Leaving directory '/tmp/ruby/build/trunk/ext/rubyvm' I, [2024-05-05T22:09:14.871207 #4159776] INFO -- : make[2]: Entering directory '/tmp/ruby/build/trunk/ext/socket' I, [2024-05-05T22:09:14.877627 #4159776] INFO -- : make[2]: Leaving directory '/tmp/ruby/build/trunk/ext/socket' I, [2024-05-05T22:09:14.888389 #4159776] INFO -- : make[2]: Entering directory '/tmp/ruby/build/trunk/.bundle/gems/bigdecimal-3.1.7/ext/bigdecimal' I, [2024-05-05T22:09:14.911315 #4159776] INFO -- : make[2]: Leaving directory '/tmp/ruby/build/trunk/.bundle/gems/bigdecimal-3.1.7/ext/bigdecimal' I, [2024-05-05T22:09:14.913203 #4159776] INFO -- : make[2]: Entering directory '/tmp/ruby/build/trunk/.bundle/gems/debug-1.9.2/ext/debug' I, [2024-05-05T22:09:14.934776 #4159776] INFO -- : make[2]: Leaving directory '/tmp/ruby/build/trunk/.bundle/gems/debug-1.9.2/ext/debug' I, [2024-05-05T22:09:14.936585 #4159776] INFO -- : make[2]: Entering directory '/tmp/ruby/build/trunk/.bundle/gems/nkf-0.2.0/ext/nkf' I, [2024-05-05T22:09:14.958521 #4159776] INFO -- : make[2]: Leaving directory '/tmp/ruby/build/trunk/.bundle/gems/nkf-0.2.0/ext/nkf' I, [2024-05-05T22:09:14.960348 #4159776] INFO -- : make[2]: Entering directory '/tmp/ruby/build/trunk/.bundle/gems/racc-1.7.3/ext/racc/cparse' I, [2024-05-05T22:09:14.982022 #4159776] INFO -- : make[2]: Leaving directory '/tmp/ruby/build/trunk/.bundle/gems/racc-1.7.3/ext/racc/cparse' I, [2024-05-05T22:09:14.984320 #4159776] INFO -- : make[2]: Entering directory '/tmp/ruby/build/trunk/.bundle/gems/rbs-3.4.4/ext/rbs_extension' I, [2024-05-05T22:09:15.006536 #4159776] INFO -- : make[2]: Leaving directory '/tmp/ruby/build/trunk/.bundle/gems/rbs-3.4.4/ext/rbs_extension' I, [2024-05-05T22:09:15.008465 #4159776] INFO -- : make[2]: Entering directory '/tmp/ruby/build/trunk/.bundle/gems/syslog-0.1.2/ext/syslog' I, [2024-05-05T22:09:15.030373 #4159776] INFO -- : make[2]: Leaving directory '/tmp/ruby/build/trunk/.bundle/gems/syslog-0.1.2/ext/syslog' I, [2024-05-05T22:09:15.054243 #4159776] INFO -- : make[2]: Entering directory '/tmp/ruby/build/trunk' I, [2024-05-05T22:09:15.118151 #4159776] INFO -- : make[2]: 'ruby' is up to date. I, [2024-05-05T22:09:15.118198 #4159776] INFO -- : make[2]: Leaving directory '/tmp/ruby/build/trunk' I, [2024-05-05T22:09:15.118517 #4159776] INFO -- : make[1]: Leaving directory '/tmp/ruby/build/trunk' I, [2024-05-05T22:09:15.122115 #4159776] INFO -- : make[1]: Entering directory '/tmp/ruby/build/trunk' I, [2024-05-05T22:09:15.122137 #4159776] INFO -- : make[1]: Nothing to be done for 'note'. I, [2024-05-05T22:09:15.122142 #4159776] INFO -- : make[1]: Leaving directory '/tmp/ruby/build/trunk' E, [2024-05-05T22:09:15.179310 #4159776] ERROR -- : $ /tmp/ruby/build/trunk/miniruby -I/tmp/ruby/src/trunk/lib /tmp/ruby/src/trunk/tool/runruby.rb --archdir=/tmp/ruby/build/trunk --extout=.ext -- /tmp/ruby/src/trunk/spec/mspec/bin/mspec-run -B /tmp/ruby/src/trunk/spec/default.mspec --error-output stderr --debug -fy -o /tmp/rubytest.zuwmrl/1-mspec-multi-0 E, [2024-05-05T22:09:15.179496 #4159776] ERROR -- : $ /tmp/ruby/build/trunk/miniruby -I/tmp/ruby/src/trunk/lib /tmp/ruby/src/trunk/tool/runruby.rb --archdir=/tmp/ruby/build/trunk --extout=.ext -- /tmp/ruby/src/trunk/spec/mspec/bin/mspec-run -B /tmp/ruby/src/trunk/spec/default.mspec --error-output stderr --debug -fy -o /tmp/rubytest.zuwmrl/2-mspec-multi-1 E, [2024-05-05T22:09:15.179752 #4159776] ERROR -- : $ /tmp/ruby/build/trunk/miniruby -I/tmp/ruby/src/trunk/lib /tmp/ruby/src/trunk/tool/runruby.rb --archdir=/tmp/ruby/build/trunk --extout=.ext -- /tmp/ruby/src/trunk/spec/mspec/bin/mspec-run -B /tmp/ruby/src/trunk/spec/default.mspec --error-output stderr --debug -fy -o /tmp/rubytest.zuwmrl/3-mspec-multi-2 E, [2024-05-05T22:09:15.179922 #4159776] ERROR -- : $ /tmp/ruby/build/trunk/miniruby -I/tmp/ruby/src/trunk/lib /tmp/ruby/src/trunk/tool/runruby.rb --archdir=/tmp/ruby/build/trunk --extout=.ext -- /tmp/ruby/src/trunk/spec/mspec/bin/mspec-run -B /tmp/ruby/src/trunk/spec/default.mspec --error-output stderr --debug -fy -o /tmp/rubytest.zuwmrl/4-mspec-multi-3 E, [2024-05-05T22:09:15.180142 #4159776] ERROR -- : $ /tmp/ruby/build/trunk/miniruby -I/tmp/ruby/src/trunk/lib /tmp/ruby/src/trunk/tool/runruby.rb --archdir=/tmp/ruby/build/trunk --extout=.ext -- /tmp/ruby/src/trunk/spec/mspec/bin/mspec-run -B /tmp/ruby/src/trunk/spec/default.mspec --error-output stderr --debug -fy -o /tmp/rubytest.zuwmrl/5-mspec-multi-4 E, [2024-05-05T22:09:15.180262 #4159776] ERROR -- : $ /tmp/ruby/build/trunk/miniruby -I/tmp/ruby/src/trunk/lib /tmp/ruby/src/trunk/tool/runruby.rb --archdir=/tmp/ruby/build/trunk --extout=.ext -- /tmp/ruby/src/trunk/spec/mspec/bin/mspec-run -B /tmp/ruby/src/trunk/spec/default.mspec --error-output stderr --debug -fy -o /tmp/rubytest.zuwmrl/6-mspec-multi-5 E, [2024-05-05T22:09:15.180541 #4159776] ERROR -- : $ /tmp/ruby/build/trunk/miniruby -I/tmp/ruby/src/trunk/lib /tmp/ruby/src/trunk/tool/runruby.rb --archdir=/tmp/ruby/build/trunk --extout=.ext -- /tmp/ruby/src/trunk/spec/mspec/bin/mspec-run -B /tmp/ruby/src/trunk/spec/default.mspec --error-output stderr --debug -fy -o /tmp/rubytest.zuwmrl/7-mspec-multi-6 E, [2024-05-05T22:09:15.180729 #4159776] ERROR -- : $ /tmp/ruby/build/trunk/miniruby -I/tmp/ruby/src/trunk/lib /tmp/ruby/src/trunk/tool/runruby.rb --archdir=/tmp/ruby/build/trunk --extout=.ext -- /tmp/ruby/src/trunk/spec/mspec/bin/mspec-run -B /tmp/ruby/src/trunk/spec/default.mspec --error-output stderr --debug -fy -o /tmp/rubytest.zuwmrl/8-mspec-multi-7 E, [2024-05-05T22:09:15.180932 #4159776] ERROR -- : $ /tmp/ruby/build/trunk/miniruby -I/tmp/ruby/src/trunk/lib /tmp/ruby/src/trunk/tool/runruby.rb --archdir=/tmp/ruby/build/trunk --extout=.ext -- /tmp/ruby/src/trunk/spec/mspec/bin/mspec-run -B /tmp/ruby/src/trunk/spec/default.mspec --error-output stderr --debug -fy -o /tmp/rubytest.zuwmrl/9-mspec-multi-8 E, [2024-05-05T22:09:15.181127 #4159776] ERROR -- : $ /tmp/ruby/build/trunk/miniruby -I/tmp/ruby/src/trunk/lib /tmp/ruby/src/trunk/tool/runruby.rb --archdir=/tmp/ruby/build/trunk --extout=.ext -- /tmp/ruby/src/trunk/spec/mspec/bin/mspec-run -B /tmp/ruby/src/trunk/spec/default.mspec --error-output stderr --debug -fy -o /tmp/rubytest.zuwmrl/10-mspec-multi-9 E, [2024-05-05T22:09:15.181387 #4159776] ERROR -- : $ /tmp/ruby/build/trunk/miniruby -I/tmp/ruby/src/trunk/lib /tmp/ruby/src/trunk/tool/runruby.rb --archdir=/tmp/ruby/build/trunk --extout=.ext -- /tmp/ruby/src/trunk/spec/mspec/bin/mspec-run -B /tmp/ruby/src/trunk/spec/default.mspec --error-output stderr --debug -fy -o /tmp/rubytest.zuwmrl/11-mspec-multi-10 E, [2024-05-05T22:09:15.181589 #4159776] ERROR -- : $ /tmp/ruby/build/trunk/miniruby -I/tmp/ruby/src/trunk/lib /tmp/ruby/src/trunk/tool/runruby.rb --archdir=/tmp/ruby/build/trunk --extout=.ext -- /tmp/ruby/src/trunk/spec/mspec/bin/mspec-run -B /tmp/ruby/src/trunk/spec/default.mspec --error-output stderr --debug -fy -o /tmp/rubytest.zuwmrl/12-mspec-multi-11 E, [2024-05-05T22:09:15.181837 #4159776] ERROR -- : $ /tmp/ruby/build/trunk/miniruby -I/tmp/ruby/src/trunk/lib /tmp/ruby/src/trunk/tool/runruby.rb --archdir=/tmp/ruby/build/trunk --extout=.ext -- /tmp/ruby/src/trunk/spec/mspec/bin/mspec-run -B /tmp/ruby/src/trunk/spec/default.mspec --error-output stderr --debug -fy -o /tmp/rubytest.zuwmrl/13-mspec-multi-12 E, [2024-05-05T22:09:15.182022 #4159776] ERROR -- : $ /tmp/ruby/build/trunk/miniruby -I/tmp/ruby/src/trunk/lib /tmp/ruby/src/trunk/tool/runruby.rb --archdir=/tmp/ruby/build/trunk --extout=.ext -- /tmp/ruby/src/trunk/spec/mspec/bin/mspec-run -B /tmp/ruby/src/trunk/spec/default.mspec --error-output stderr --debug -fy -o /tmp/rubytest.zuwmrl/14-mspec-multi-13 E, [2024-05-05T22:09:15.182100 #4159776] ERROR -- : $ /tmp/ruby/build/trunk/miniruby -I/tmp/ruby/src/trunk/lib /tmp/ruby/src/trunk/tool/runruby.rb --archdir=/tmp/ruby/build/trunk --extout=.ext -- /tmp/ruby/src/trunk/spec/mspec/bin/mspec-run -B /tmp/ruby/src/trunk/spec/default.mspec --error-output stderr --debug -fy -o /tmp/rubytest.zuwmrl/15-mspec-multi-14 E, [2024-05-05T22:09:15.182316 #4159776] ERROR -- : $ /tmp/ruby/build/trunk/miniruby -I/tmp/ruby/src/trunk/lib /tmp/ruby/src/trunk/tool/runruby.rb --archdir=/tmp/ruby/build/trunk --extout=.ext -- /tmp/ruby/src/trunk/spec/mspec/bin/mspec-run -B /tmp/ruby/src/trunk/spec/default.mspec --error-output stderr --debug -fy -o /tmp/rubytest.zuwmrl/16-mspec-multi-15 E, [2024-05-05T22:09:15.182479 #4159776] ERROR -- : $ /tmp/ruby/build/trunk/miniruby -I/tmp/ruby/src/trunk/lib /tmp/ruby/src/trunk/tool/runruby.rb --archdir=/tmp/ruby/build/trunk --extout=.ext -- /tmp/ruby/src/trunk/spec/mspec/bin/mspec-run -B /tmp/ruby/src/trunk/spec/default.mspec --error-output stderr --debug -fy -o /tmp/rubytest.zuwmrl/17-mspec-multi-16 E, [2024-05-05T22:09:15.182662 #4159776] ERROR -- : $ /tmp/ruby/build/trunk/miniruby -I/tmp/ruby/src/trunk/lib /tmp/ruby/src/trunk/tool/runruby.rb --archdir=/tmp/ruby/build/trunk --extout=.ext -- /tmp/ruby/src/trunk/spec/mspec/bin/mspec-run -B /tmp/ruby/src/trunk/spec/default.mspec --error-output stderr --debug -fy -o /tmp/rubytest.zuwmrl/18-mspec-multi-17 E, [2024-05-05T22:09:15.184773 #4159776] ERROR -- : $ /tmp/ruby/build/trunk/miniruby -I/tmp/ruby/src/trunk/lib /tmp/ruby/src/trunk/tool/runruby.rb --archdir=/tmp/ruby/build/trunk --extout=.ext -- /tmp/ruby/src/trunk/spec/mspec/bin/mspec-run -B /tmp/ruby/src/trunk/spec/default.mspec --error-output stderr --debug -fy -o /tmp/rubytest.zuwmrl/19-mspec-multi-18 E, [2024-05-05T22:09:15.185220 #4159776] ERROR -- : $ /tmp/ruby/build/trunk/miniruby -I/tmp/ruby/src/trunk/lib /tmp/ruby/src/trunk/tool/runruby.rb --archdir=/tmp/ruby/build/trunk --extout=.ext -- /tmp/ruby/src/trunk/spec/mspec/bin/mspec-run -B /tmp/ruby/src/trunk/spec/default.mspec --error-output stderr --debug -fy -o /tmp/rubytest.zuwmrl/20-mspec-multi-19 I, [2024-05-05T22:09:15.365601 #4159776] INFO -- : ruby 3.4.0dev (2024-05-05T15:14:53Z master 6747fbe77d) [x86_64-linux] I, [2024-05-05T22:09:16.018267 #4159776] INFO -- : 0 ......................................................................... I, [2024-05-05T22:09:16.356949 #4159776] INFO -- : 73 ......................................................................... I, [2024-05-05T22:09:16.528132 #4159776] INFO -- : 146 ......................................................................... I, [2024-05-05T22:09:16.590143 #4159776] INFO -- : 219 ......................................................................... I, [2024-05-05T22:09:16.666135 #4159776] INFO -- : 292 ......................................................................... I, [2024-05-05T22:09:16.711820 #4159776] INFO -- : 365 ......................................................................... I, [2024-05-05T22:09:16.738044 #4159776] INFO -- : 438 ......................................................................... I, [2024-05-05T22:09:16.759706 #4159776] INFO -- : 511 ......................................................................... I, [2024-05-05T22:09:16.777736 #4159776] INFO -- : 584 ......................................................................... I, [2024-05-05T22:09:16.830817 #4159776] INFO -- : 657 ......................................................................... I, [2024-05-05T22:09:16.857955 #4159776] INFO -- : 730 ......................................................................... I, [2024-05-05T22:09:16.882462 #4159776] INFO -- : 803 ......................................................................... I, [2024-05-05T22:09:16.929709 #4159776] INFO -- : 876 ......................................................................... I, [2024-05-05T22:09:16.980169 #4159776] INFO -- : 949 ......................................................................... I, [2024-05-05T22:09:17.062897 #4159776] INFO -- : 1022 ......................................................................... I, [2024-05-05T22:09:17.249764 #4159776] INFO -- : 1095 ......................................................................... I, [2024-05-05T22:09:17.361665 #4159776] INFO -- : 1168 ......................................................................... I, [2024-05-05T22:09:17.432170 #4159776] INFO -- : 1241 ......................................................................... I, [2024-05-05T22:09:17.471101 #4159776] INFO -- : 1314 ......................................................................... I, [2024-05-05T22:09:17.487772 #4159776] INFO -- : 1387 ......................................................................... I, [2024-05-05T22:09:17.598088 #4159776] INFO -- : 1460 ......................................................................... I, [2024-05-05T22:09:18.060415 #4159776] INFO -- : 1533 ......................................................................... I, [2024-05-05T22:09:18.121954 #4159776] INFO -- : 1606 ......................................................................... I, [2024-05-05T22:09:18.223925 #4159776] INFO -- : 1679 ......................................................................... I, [2024-05-05T22:09:18.355256 #4159776] INFO -- : 1752 ......................................................................... I, [2024-05-05T22:09:18.443079 #4159776] INFO -- : 1825 ......................................................................... I, [2024-05-05T22:09:18.545640 #4159776] INFO -- : 1898 ......................................................................... I, [2024-05-05T22:09:18.643556 #4159776] INFO -- : 1971 ......................................................................... I, [2024-05-05T22:09:18.747932 #4159776] INFO -- : 2044 ......................................................................... I, [2024-05-05T22:09:18.782471 #4159776] INFO -- : 2117 ......................................................................... I, [2024-05-05T22:09:18.793303 #4159776] INFO -- : 2190 ......................................................................... I, [2024-05-05T22:09:18.811602 #4159776] INFO -- : 2263 ......................................................................... I, [2024-05-05T22:09:18.826099 #4159776] INFO -- : 2336 ......................................................................... I, [2024-05-05T22:09:18.867995 #4159776] INFO -- : 2409 ......................................................................... I, [2024-05-05T22:09:18.977028 #4159776] INFO -- : 2482 ......................................................................... I, [2024-05-05T22:09:19.003244 #4159776] INFO -- : 2555 ......................................................................... I, [2024-05-05T22:09:19.090016 #4159776] INFO -- : 2628 ......................................................................... I, [2024-05-05T22:09:19.185233 #4159776] INFO -- : 2701 ......................................................................... I, [2024-05-05T22:09:19.222881 #4159776] INFO -- : 2774 ......................................................................... I, [2024-05-05T22:09:19.290383 #4159776] INFO -- : 2847 ......................................................................... I, [2024-05-05T22:09:19.329535 #4159776] INFO -- : 2920 ......................................................................... I, [2024-05-05T22:09:19.358185 #4159776] INFO -- : 2993 ......................................................................... I, [2024-05-05T22:09:19.381456 #4159776] INFO -- : 3066 ......................................................................... I, [2024-05-05T22:09:19.397058 #4159776] INFO -- : 3139 ......................................................................... I, [2024-05-05T22:09:19.407315 #4159776] INFO -- : 3212 ......................................................................... I, [2024-05-05T22:09:19.439698 #4159776] INFO -- : 3285 ......................................................................... I, [2024-05-05T22:09:23.394255 #4159776] INFO -- : 3358 ........................................................................ I, [2024-05-05T22:09:23.394305 #4159776] INFO -- : I, [2024-05-05T22:09:23.394312 #4159776] INFO -- : Finished in 8.214237 seconds I, [2024-05-05T22:09:23.394316 #4159776] INFO -- : I, [2024-05-05T22:09:23.394320 #4159776] INFO -- : 3429 files, 32610 examples, 168573 expectations, 0 failures, 0 errors, 0 tagged I, [2024-05-05T22:09:23.396398 #4159776] INFO -- : $$$[end] "make yes-test-rubyspec MSPECOPT='--error-output stderr --debug -j' TESTS='-j20'" exit with 0.