# Logfile created on 2024-05-05 00:23:20 +0000 by logger.rb/v1.4.3 I, [2024-05-05T00:23:20.154880 #4169020] INFO -- : #, @formatter=nil, @logdev=#, @binmode=false, @mon_data=#, @mon_data_owner_object_id=860>>> I, [2024-05-05T00:23:20.155004 #4169020] INFO -- : $$$[beg] make update-unicode -j20 I, [2024-05-05T00:23:20.213998 #4169020] INFO -- : Downloading Unicode emoji 15.0 files... I, [2024-05-05T00:23:20.214191 #4169020] INFO -- : Downloading Unicode emoji 15.0 files... I, [2024-05-05T00:23:20.214482 #4169020] INFO -- : Downloading Unicode emoji 15.0 files... I, [2024-05-05T00:23:20.254952 #4169020] INFO -- : made symlink emoji/15.0/emoji-sequences.txt to /tmp/ruby/src/trunk/.downloaded-cache/emoji/15.0/emoji-sequences.txt I, [2024-05-05T00:23:20.255311 #4169020] INFO -- : downloading emoji/15.0/emoji-test.txt ... /tmp/ruby/src/trunk/enc/unicode/data/emoji/15.0/emoji-sequences.txt already exists I, [2024-05-05T00:23:20.256573 #4169020] INFO -- : downloading emoji/15.0/emoji-test.txt ... /tmp/ruby/src/trunk/enc/unicode/data/emoji/15.0/emoji-sequences.txt already exists E, [2024-05-05T00:23:20.697265 #4169020] ERROR -- : /tmp/ruby/src/trunk/tool/downloader.rb:302:in `rescue in download': failed to download emoji/15.0/emoji-test.txt (RuntimeError) E, [2024-05-05T00:23:20.697292 #4169020] ERROR -- : OpenURI::HTTPError: 403 Forbidden: https://www.unicode.org/Public/emoji/15.0/emoji-test.txt E, [2024-05-05T00:23:20.697297 #4169020] ERROR -- : from /tmp/ruby/src/trunk/tool/downloader.rb:201:in `download' E, [2024-05-05T00:23:20.697302 #4169020] ERROR -- : from /tmp/ruby/src/trunk/tool/downloader.rb:136:in `download' E, [2024-05-05T00:23:20.697305 #4169020] ERROR -- : from /tmp/ruby/src/trunk/tool/downloader.rb:482:in `block in
' E, [2024-05-05T00:23:20.697309 #4169020] ERROR -- : from /tmp/ruby/src/trunk/tool/downloader.rb:465:in `each' E, [2024-05-05T00:23:20.697312 #4169020] ERROR -- : from /tmp/ruby/src/trunk/tool/downloader.rb:465:in `
' E, [2024-05-05T00:23:20.697315 #4169020] ERROR -- : /usr/lib/ruby/3.0.0/open-uri.rb:364:in `open_http': 403 Forbidden (OpenURI::HTTPError) E, [2024-05-05T00:23:20.697319 #4169020] ERROR -- : from /usr/lib/ruby/3.0.0/open-uri.rb:741:in `buffer_open' E, [2024-05-05T00:23:20.697323 #4169020] ERROR -- : from /usr/lib/ruby/3.0.0/open-uri.rb:212:in `block in open_loop' E, [2024-05-05T00:23:20.697327 #4169020] ERROR -- : from /usr/lib/ruby/3.0.0/open-uri.rb:210:in `catch' E, [2024-05-05T00:23:20.697330 #4169020] ERROR -- : from /usr/lib/ruby/3.0.0/open-uri.rb:210:in `open_loop' E, [2024-05-05T00:23:20.697333 #4169020] ERROR -- : from /usr/lib/ruby/3.0.0/open-uri.rb:151:in `open_uri' E, [2024-05-05T00:23:20.697337 #4169020] ERROR -- : from /usr/lib/ruby/3.0.0/open-uri.rb:721:in `open' E, [2024-05-05T00:23:20.697340 #4169020] ERROR -- : from /usr/lib/ruby/3.0.0/open-uri.rb:729:in `read' E, [2024-05-05T00:23:20.697351 #4169020] ERROR -- : from /tmp/ruby/src/trunk/tool/downloader.rb:247:in `block in download' E, [2024-05-05T00:23:20.697354 #4169020] ERROR -- : from /tmp/ruby/src/trunk/tool/downloader.rb:378:in `with_retry' E, [2024-05-05T00:23:20.697358 #4169020] ERROR -- : from /tmp/ruby/src/trunk/tool/downloader.rb:246:in `download' E, [2024-05-05T00:23:20.697362 #4169020] ERROR -- : from /tmp/ruby/src/trunk/tool/downloader.rb:136:in `download' E, [2024-05-05T00:23:20.697366 #4169020] ERROR -- : from /tmp/ruby/src/trunk/tool/downloader.rb:482:in `block in
' E, [2024-05-05T00:23:20.697369 #4169020] ERROR -- : from /tmp/ruby/src/trunk/tool/downloader.rb:465:in `each' E, [2024-05-05T00:23:20.697372 #4169020] ERROR -- : from /tmp/ruby/src/trunk/tool/downloader.rb:465:in `
' E, [2024-05-05T00:23:20.699470 #4169020] ERROR -- : make: *** [uncommon.mk:1787: /tmp/ruby/src/trunk/enc/unicode/data/emoji/15.0/emoji-sequences.txt] Error 1 E, [2024-05-05T00:23:20.699490 #4169020] ERROR -- : make: *** Deleting file '/tmp/ruby/src/trunk/enc/unicode/data/emoji/15.0/emoji-sequences.txt' E, [2024-05-05T00:23:20.699496 #4169020] ERROR -- : make: *** Waiting for unfinished jobs.... E, [2024-05-05T00:23:20.729358 #4169020] ERROR -- : /tmp/ruby/src/trunk/tool/downloader.rb:302:in `rescue in download': failed to download emoji/15.0/emoji-test.txt (RuntimeError) E, [2024-05-05T00:23:20.729379 #4169020] ERROR -- : OpenURI::HTTPError: 403 Forbidden: https://www.unicode.org/Public/emoji/15.0/emoji-test.txt E, [2024-05-05T00:23:20.729384 #4169020] ERROR -- : from /tmp/ruby/src/trunk/tool/downloader.rb:201:in `download' E, [2024-05-05T00:23:20.729387 #4169020] ERROR -- : from /tmp/ruby/src/trunk/tool/downloader.rb:136:in `download' E, [2024-05-05T00:23:20.729391 #4169020] ERROR -- : from /tmp/ruby/src/trunk/tool/downloader.rb:482:in `block in
' E, [2024-05-05T00:23:20.729394 #4169020] ERROR -- : from /tmp/ruby/src/trunk/tool/downloader.rb:465:in `each' E, [2024-05-05T00:23:20.729398 #4169020] ERROR -- : from /tmp/ruby/src/trunk/tool/downloader.rb:465:in `
' E, [2024-05-05T00:23:20.729402 #4169020] ERROR -- : /usr/lib/ruby/3.0.0/open-uri.rb:364:in `open_http': 403 Forbidden (OpenURI::HTTPError) E, [2024-05-05T00:23:20.729407 #4169020] ERROR -- : from /usr/lib/ruby/3.0.0/open-uri.rb:741:in `buffer_open' E, [2024-05-05T00:23:20.729410 #4169020] ERROR -- : from /usr/lib/ruby/3.0.0/open-uri.rb:212:in `block in open_loop' E, [2024-05-05T00:23:20.729413 #4169020] ERROR -- : from /usr/lib/ruby/3.0.0/open-uri.rb:210:in `catch' E, [2024-05-05T00:23:20.729417 #4169020] ERROR -- : from /usr/lib/ruby/3.0.0/open-uri.rb:210:in `open_loop' E, [2024-05-05T00:23:20.729420 #4169020] ERROR -- : from /usr/lib/ruby/3.0.0/open-uri.rb:151:in `open_uri' E, [2024-05-05T00:23:20.729424 #4169020] ERROR -- : from /usr/lib/ruby/3.0.0/open-uri.rb:721:in `open' E, [2024-05-05T00:23:20.729427 #4169020] ERROR -- : from /usr/lib/ruby/3.0.0/open-uri.rb:729:in `read' E, [2024-05-05T00:23:20.729430 #4169020] ERROR -- : from /tmp/ruby/src/trunk/tool/downloader.rb:247:in `block in download' E, [2024-05-05T00:23:20.729435 #4169020] ERROR -- : from /tmp/ruby/src/trunk/tool/downloader.rb:378:in `with_retry' E, [2024-05-05T00:23:20.729438 #4169020] ERROR -- : from /tmp/ruby/src/trunk/tool/downloader.rb:246:in `download' E, [2024-05-05T00:23:20.729442 #4169020] ERROR -- : from /tmp/ruby/src/trunk/tool/downloader.rb:136:in `download' E, [2024-05-05T00:23:20.729445 #4169020] ERROR -- : from /tmp/ruby/src/trunk/tool/downloader.rb:482:in `block in
' E, [2024-05-05T00:23:20.729449 #4169020] ERROR -- : from /tmp/ruby/src/trunk/tool/downloader.rb:465:in `each' E, [2024-05-05T00:23:20.729452 #4169020] ERROR -- : from /tmp/ruby/src/trunk/tool/downloader.rb:465:in `
' E, [2024-05-05T00:23:20.731366 #4169020] ERROR -- : make: *** [uncommon.mk:1787: /tmp/ruby/src/trunk/enc/unicode/data/emoji/15.0/emoji-test.txt] Error 1 E, [2024-05-05T00:23:20.750777 #4169020] ERROR -- : /tmp/ruby/src/trunk/tool/downloader.rb:302:in `rescue in download': failed to download emoji/15.0/emoji-test.txt (RuntimeError) E, [2024-05-05T00:23:20.750802 #4169020] ERROR -- : OpenURI::HTTPError: 403 Forbidden: https://www.unicode.org/Public/emoji/15.0/emoji-test.txt E, [2024-05-05T00:23:20.750807 #4169020] ERROR -- : from /tmp/ruby/src/trunk/tool/downloader.rb:201:in `download' E, [2024-05-05T00:23:20.750811 #4169020] ERROR -- : from /tmp/ruby/src/trunk/tool/downloader.rb:136:in `download' E, [2024-05-05T00:23:20.750814 #4169020] ERROR -- : from /tmp/ruby/src/trunk/tool/downloader.rb:482:in `block in
' E, [2024-05-05T00:23:20.750818 #4169020] ERROR -- : from /tmp/ruby/src/trunk/tool/downloader.rb:465:in `each' E, [2024-05-05T00:23:20.750821 #4169020] ERROR -- : from /tmp/ruby/src/trunk/tool/downloader.rb:465:in `
' E, [2024-05-05T00:23:20.750825 #4169020] ERROR -- : /usr/lib/ruby/3.0.0/open-uri.rb:364:in `open_http': 403 Forbidden (OpenURI::HTTPError) E, [2024-05-05T00:23:20.750829 #4169020] ERROR -- : from /usr/lib/ruby/3.0.0/open-uri.rb:741:in `buffer_open' E, [2024-05-05T00:23:20.750833 #4169020] ERROR -- : from /usr/lib/ruby/3.0.0/open-uri.rb:212:in `block in open_loop' E, [2024-05-05T00:23:20.750836 #4169020] ERROR -- : from /usr/lib/ruby/3.0.0/open-uri.rb:210:in `catch' E, [2024-05-05T00:23:20.750840 #4169020] ERROR -- : from /usr/lib/ruby/3.0.0/open-uri.rb:210:in `open_loop' E, [2024-05-05T00:23:20.750922 #4169020] ERROR -- : from /usr/lib/ruby/3.0.0/open-uri.rb:151:in `open_uri' E, [2024-05-05T00:23:20.750926 #4169020] ERROR -- : from /usr/lib/ruby/3.0.0/open-uri.rb:721:in `open' E, [2024-05-05T00:23:20.750930 #4169020] ERROR -- : from /usr/lib/ruby/3.0.0/open-uri.rb:729:in `read' E, [2024-05-05T00:23:20.750933 #4169020] ERROR -- : from /tmp/ruby/src/trunk/tool/downloader.rb:247:in `block in download' E, [2024-05-05T00:23:20.750937 #4169020] ERROR -- : from /tmp/ruby/src/trunk/tool/downloader.rb:378:in `with_retry' E, [2024-05-05T00:23:20.750940 #4169020] ERROR -- : from /tmp/ruby/src/trunk/tool/downloader.rb:246:in `download' E, [2024-05-05T00:23:20.750943 #4169020] ERROR -- : from /tmp/ruby/src/trunk/tool/downloader.rb:136:in `download' E, [2024-05-05T00:23:20.750947 #4169020] ERROR -- : from /tmp/ruby/src/trunk/tool/downloader.rb:482:in `block in
' E, [2024-05-05T00:23:20.750950 #4169020] ERROR -- : from /tmp/ruby/src/trunk/tool/downloader.rb:465:in `each' E, [2024-05-05T00:23:20.750955 #4169020] ERROR -- : from /tmp/ruby/src/trunk/tool/downloader.rb:465:in `
' E, [2024-05-05T00:23:20.752989 #4169020] ERROR -- : make: *** [uncommon.mk:1787: /tmp/ruby/src/trunk/enc/unicode/data/emoji/15.0/emoji-zwj-sequences.txt] Error 1 I, [2024-05-05T00:23:20.753085 #4169020] INFO -- : downloading emoji/15.0/emoji-test.txt ... I, [2024-05-05T00:23:20.753375 #4169020] INFO -- : $$$[end] "make update-unicode -j20" exit with 512. I, [2024-05-05T00:23:20.753417 #4169020] INFO -- : $$$[beg] make update-download -j20 I, [2024-05-05T00:23:20.855440 #4169020] INFO -- : tool/config.guess already exists I, [2024-05-05T00:23:20.855483 #4169020] INFO -- : tool/config.sub already exists I, [2024-05-05T00:23:20.857638 #4169020] INFO -- : Update minitest to ea9caafc0754b1d6236a490d59e624b53209734a I, [2024-05-05T00:23:20.857968 #4169020] INFO -- : Update power_assert to 84e85124c5014a139af39161d484156cfe87a9ed I, [2024-05-05T00:23:20.858469 #4169020] INFO -- : Update rbs to ba7872795d5de04adb8ff500c0e6afdc81a041dd I, [2024-05-05T00:23:20.858681 #4169020] INFO -- : Update typeprof to b19a6416da3a05d57fadd6ffdadb382b6d236ca5 I, [2024-05-05T00:23:20.859101 #4169020] INFO -- : echo ea9caafc0754b1d6236a490d59e624b53209734a | /bin/sh /tmp/ruby/src/trunk/tool/ifchange /tmp/ruby/src/trunk/.bundle/.timestamp/minitest.revision - I, [2024-05-05T00:23:20.859352 #4169020] INFO -- : echo 84e85124c5014a139af39161d484156cfe87a9ed | /bin/sh /tmp/ruby/src/trunk/tool/ifchange /tmp/ruby/src/trunk/.bundle/.timestamp/power_assert.revision - I, [2024-05-05T00:23:20.859658 #4169020] INFO -- : echo ba7872795d5de04adb8ff500c0e6afdc81a041dd | /bin/sh /tmp/ruby/src/trunk/tool/ifchange /tmp/ruby/src/trunk/.bundle/.timestamp/rbs.revision - I, [2024-05-05T00:23:20.859855 #4169020] INFO -- : echo b19a6416da3a05d57fadd6ffdadb382b6d236ca5 | /bin/sh /tmp/ruby/src/trunk/tool/ifchange /tmp/ruby/src/trunk/.bundle/.timestamp/typeprof.revision - I, [2024-05-05T00:23:20.860858 #4169020] INFO -- : /tmp/ruby/src/trunk/.bundle/.timestamp/minitest.revision unchanged I, [2024-05-05T00:23:20.860998 #4169020] INFO -- : /tmp/ruby/src/trunk/.bundle/.timestamp/power_assert.revision unchanged I, [2024-05-05T00:23:20.861382 #4169020] INFO -- : /tmp/ruby/src/trunk/.bundle/.timestamp/rbs.revision unchanged I, [2024-05-05T00:23:20.861550 #4169020] INFO -- : /tmp/ruby/src/trunk/.bundle/.timestamp/typeprof.revision unchanged I, [2024-05-05T00:23:20.861989 #4169020] INFO -- : Building power_assert@84e85124c5014a139af39161d484156cfe87a9ed to /tmp/ruby/src/trunk/gems/power_assert-2.0.3.gem I, [2024-05-05T00:23:20.931227 #4169020] INFO -- : Successfully built RubyGem I, [2024-05-05T00:23:20.931267 #4169020] INFO -- : Name: power_assert I, [2024-05-05T00:23:20.931277 #4169020] INFO -- : Version: 2.0.4dev I, [2024-05-05T00:23:20.931281 #4169020] INFO -- : File: power_assert-2.0.4dev.gem I, [2024-05-05T00:23:20.977158 #4169020] INFO -- : $$$[end] "make update-download -j20" exit with 0. I, [2024-05-05T00:23:20.977208 #4169020] INFO -- : $$$[beg] make update-rubyspec -j20 I, [2024-05-05T00:23:21.038046 #4169020] INFO -- : make: Nothing to be done for 'update-rubyspec'. I, [2024-05-05T00:23:21.038353 #4169020] INFO -- : $$$[end] "make update-rubyspec -j20" exit with 0. I, [2024-05-05T00:23:21.038382 #4169020] INFO -- : $$$[beg] make update-src -j20 I, [2024-05-05T00:23:21.604794 #4169020] INFO -- : Already up to date. I, [2024-05-05T00:23:21.614039 #4169020] INFO -- : Latest commit hash = b181ba7400 I, [2024-05-05T00:23:21.615110 #4169020] INFO -- : $$$[end] "make update-src -j20" exit with 0. I, [2024-05-05T00:23:21.615149 #4169020] INFO -- : $$$[beg] make after-update -j20 I, [2024-05-05T00:23:21.683850 #4169020] INFO -- : generating /tmp/ruby/src/trunk/ext/ripper/eventids2table.c I, [2024-05-05T00:23:21.688138 #4169020] INFO -- : make[1]: Entering directory '/tmp/ruby/src/trunk/ext/ripper' I, [2024-05-05T00:23:21.688185 #4169020] INFO -- : make[1]: Nothing to be done for 'src'. I, [2024-05-05T00:23:21.688199 #4169020] INFO -- : make[1]: Leaving directory '/tmp/ruby/src/trunk/ext/ripper' I, [2024-05-05T00:23:21.704423 #4169020] INFO -- : /tmp/ruby/src/trunk/revision.h updated I, [2024-05-05T00:23:21.705723 #4169020] INFO -- : generating x86_64-linux-fake.rb I, [2024-05-05T00:23:21.756960 #4169020] INFO -- : x86_64-linux-fake.rb updated I, [2024-05-05T00:23:21.758280 #4169020] INFO -- : generating enc.mk I, [2024-05-05T00:23:21.876296 #4169020] INFO -- : making srcs under enc I, [2024-05-05T00:23:21.906188 #4169020] INFO -- : make[1]: Entering directory '/tmp/ruby/build/trunk' I, [2024-05-05T00:23:21.906252 #4169020] INFO -- : make[1]: Nothing to be done for 'srcs'. I, [2024-05-05T00:23:21.906265 #4169020] INFO -- : make[1]: Leaving directory '/tmp/ruby/build/trunk' I, [2024-05-05T00:23:21.951173 #4169020] INFO -- : Update minitest to ea9caafc0754b1d6236a490d59e624b53209734a I, [2024-05-05T00:23:21.951310 #4169020] INFO -- : Update power_assert to 84e85124c5014a139af39161d484156cfe87a9ed I, [2024-05-05T00:23:21.951977 #4169020] INFO -- : Update rbs to ba7872795d5de04adb8ff500c0e6afdc81a041dd I, [2024-05-05T00:23:21.952110 #4169020] INFO -- : Update typeprof to b19a6416da3a05d57fadd6ffdadb382b6d236ca5 I, [2024-05-05T00:23:21.953012 #4169020] INFO -- : echo ea9caafc0754b1d6236a490d59e624b53209734a | /bin/sh /tmp/ruby/src/trunk/tool/ifchange /tmp/ruby/src/trunk/.bundle/.timestamp/minitest.revision - I, [2024-05-05T00:23:21.953299 #4169020] INFO -- : echo 84e85124c5014a139af39161d484156cfe87a9ed | /bin/sh /tmp/ruby/src/trunk/tool/ifchange /tmp/ruby/src/trunk/.bundle/.timestamp/power_assert.revision - I, [2024-05-05T00:23:21.954616 #4169020] INFO -- : echo ba7872795d5de04adb8ff500c0e6afdc81a041dd | /bin/sh /tmp/ruby/src/trunk/tool/ifchange /tmp/ruby/src/trunk/.bundle/.timestamp/rbs.revision - I, [2024-05-05T00:23:21.954915 #4169020] INFO -- : echo b19a6416da3a05d57fadd6ffdadb382b6d236ca5 | /bin/sh /tmp/ruby/src/trunk/tool/ifchange /tmp/ruby/src/trunk/.bundle/.timestamp/typeprof.revision - I, [2024-05-05T00:23:21.954939 #4169020] INFO -- : /tmp/ruby/src/trunk/.bundle/.timestamp/minitest.revision unchanged I, [2024-05-05T00:23:21.955104 #4169020] INFO -- : /tmp/ruby/src/trunk/.bundle/.timestamp/power_assert.revision unchanged I, [2024-05-05T00:23:21.956113 #4169020] INFO -- : Building power_assert@84e85124c5014a139af39161d484156cfe87a9ed to /tmp/ruby/src/trunk/gems/power_assert-2.0.3.gem I, [2024-05-05T00:23:21.956274 #4169020] INFO -- : /tmp/ruby/src/trunk/.bundle/.timestamp/rbs.revision unchanged I, [2024-05-05T00:23:21.956580 #4169020] INFO -- : /tmp/ruby/src/trunk/.bundle/.timestamp/typeprof.revision unchanged I, [2024-05-05T00:23:22.025160 #4169020] INFO -- : Successfully built RubyGem I, [2024-05-05T00:23:22.025225 #4169020] INFO -- : Name: power_assert I, [2024-05-05T00:23:22.025249 #4169020] INFO -- : Version: 2.0.4dev I, [2024-05-05T00:23:22.025262 #4169020] INFO -- : File: power_assert-2.0.4dev.gem I, [2024-05-05T00:23:22.027356 #4169020] INFO -- : Extracting bundle gem power_assert-2.0.3... I, [2024-05-05T00:23:22.089378 #4169020] INFO -- : Try with hash version of bundled gems instead of gems/power_assert-2.0.3.gem. We don't use this gem with release version of Ruby. I, [2024-05-05T00:23:22.094373 #4169020] INFO -- : Unpacked gems/power_assert-2.0.4dev.gem I, [2024-05-05T00:23:22.096514 #4169020] INFO -- : $$$[end] "make after-update -j20" exit with 0. I, [2024-05-05T00:23:22.096741 #4169020] INFO -- : $$$[beg] make miniruby -j20 I, [2024-05-05T00:23:22.155174 #4169020] INFO -- : BASERUBY = /usr/bin/ruby --disable=gems I, [2024-05-05T00:23:22.155219 #4169020] INFO -- : CC = gcc I, [2024-05-05T00:23:22.155232 #4169020] INFO -- : LD = ld I, [2024-05-05T00:23:22.155243 #4169020] INFO -- : LDSHARED = gcc -shared I, [2024-05-05T00:23:22.155253 #4169020] INFO -- : CFLAGS = -O3 -fno-fast-math -ggdb3 -Wall -Wextra -Wdeprecated-declarations -Wdiv-by-zero -Wduplicated-cond -Wimplicit-function-declaration -Wimplicit-int -Wpointer-arith -Wwrite-strings -Wold-style-definition -Wimplicit-fallthrough=0 -Wmissing-noreturn -Wno-cast-function-type -Wno-constant-logical-operand -Wno-long-long -Wno-missing-field-initializers -Wno-overlength-strings -Wno-packed-bitfield-compat -Wno-parentheses-equality -Wno-self-assign -Wno-tautological-compare -Wno-unused-parameter -Wno-unused-value -Wsuggest-attribute=format -Wsuggest-attribute=noreturn -Wunused-variable -Wmisleading-indentation -Wundef -fPIC I, [2024-05-05T00:23:22.155265 #4169020] INFO -- : XCFLAGS = -U_FORTIFY_SOURCE -D_FORTIFY_SOURCE=2 -fstack-protector-strong -fno-strict-overflow -fvisibility=hidden -fexcess-precision=standard -DRUBY_EXPORT -I. -I.ext/include/x86_64-linux -I/tmp/ruby/src/trunk/include -I/tmp/ruby/src/trunk -I/tmp/ruby/src/trunk/prism -I/tmp/ruby/src/trunk/enc/unicode/15.0.0 I, [2024-05-05T00:23:22.155276 #4169020] INFO -- : CPPFLAGS = I, [2024-05-05T00:23:22.155286 #4169020] INFO -- : DLDFLAGS = -Wl,--compress-debug-sections=zlib -Wl,-soname,libruby.so.3.4 -fstack-protector-strong I, [2024-05-05T00:23:22.155296 #4169020] INFO -- : SOLIBS = -lz -lrt -lrt -lgmp -ldl -lcrypt -lm -lpthread I, [2024-05-05T00:23:22.155307 #4169020] INFO -- : LANG = en_US.UTF-8 I, [2024-05-05T00:23:22.155316 #4169020] INFO -- : LC_ALL = I, [2024-05-05T00:23:22.155326 #4169020] INFO -- : LC_CTYPE = I, [2024-05-05T00:23:22.155336 #4169020] INFO -- : MFLAGS = -j20 --jobserver-auth=4,5 I, [2024-05-05T00:23:22.155346 #4169020] INFO -- : RUSTC = no I, [2024-05-05T00:23:22.155356 #4169020] INFO -- : YJIT_RUSTC_ARGS = --crate-name=yjit --crate-type=staticlib --edition=2021 -g -C lto=thin -C opt-level=3 -C overflow-checks=on '--out-dir=/tmp/ruby/build/trunk/yjit/target/release/' /tmp/ruby/src/trunk/yjit/src/lib.rs I, [2024-05-05T00:23:22.157345 #4169020] INFO -- : gcc (Ubuntu 11.4.0-1ubuntu1~22.04) 11.4.0 I, [2024-05-05T00:23:22.157391 #4169020] INFO -- : Copyright (C) 2021 Free Software Foundation, Inc. I, [2024-05-05T00:23:22.157403 #4169020] INFO -- : This is free software; see the source for copying conditions. There is NO I, [2024-05-05T00:23:22.157414 #4169020] INFO -- : warranty; not even for MERCHANTABILITY or FITNESS FOR A PARTICULAR PURPOSE. I, [2024-05-05T00:23:22.157424 #4169020] INFO -- : I, [2024-05-05T00:23:22.179769 #4169020] INFO -- : compiling /tmp/ruby/src/trunk/version.c I, [2024-05-05T00:23:22.283133 #4169020] INFO -- : linking miniruby I, [2024-05-05T00:23:22.812894 #4169020] INFO -- : $$$[end] "make miniruby -j20" exit with 0. I, [2024-05-05T00:23:22.813043 #4169020] INFO -- : $$$[beg] make ruby -j20 I, [2024-05-05T00:23:22.870265 #4169020] INFO -- : BASERUBY = /usr/bin/ruby --disable=gems I, [2024-05-05T00:23:22.870313 #4169020] INFO -- : CC = gcc I, [2024-05-05T00:23:22.870326 #4169020] INFO -- : LD = ld I, [2024-05-05T00:23:22.870341 #4169020] INFO -- : LDSHARED = gcc -shared I, [2024-05-05T00:23:22.870352 #4169020] INFO -- : CFLAGS = -O3 -fno-fast-math -ggdb3 -Wall -Wextra -Wdeprecated-declarations -Wdiv-by-zero -Wduplicated-cond -Wimplicit-function-declaration -Wimplicit-int -Wpointer-arith -Wwrite-strings -Wold-style-definition -Wimplicit-fallthrough=0 -Wmissing-noreturn -Wno-cast-function-type -Wno-constant-logical-operand -Wno-long-long -Wno-missing-field-initializers -Wno-overlength-strings -Wno-packed-bitfield-compat -Wno-parentheses-equality -Wno-self-assign -Wno-tautological-compare -Wno-unused-parameter -Wno-unused-value -Wsuggest-attribute=format -Wsuggest-attribute=noreturn -Wunused-variable -Wmisleading-indentation -Wundef -fPIC I, [2024-05-05T00:23:22.870363 #4169020] INFO -- : XCFLAGS = -U_FORTIFY_SOURCE -D_FORTIFY_SOURCE=2 -fstack-protector-strong -fno-strict-overflow -fvisibility=hidden -fexcess-precision=standard -DRUBY_EXPORT -I. -I.ext/include/x86_64-linux -I/tmp/ruby/src/trunk/include -I/tmp/ruby/src/trunk -I/tmp/ruby/src/trunk/prism -I/tmp/ruby/src/trunk/enc/unicode/15.0.0 I, [2024-05-05T00:23:22.870373 #4169020] INFO -- : CPPFLAGS = I, [2024-05-05T00:23:22.870383 #4169020] INFO -- : DLDFLAGS = -Wl,--compress-debug-sections=zlib -Wl,-soname,libruby.so.3.4 -fstack-protector-strong I, [2024-05-05T00:23:22.870394 #4169020] INFO -- : SOLIBS = -lz -lrt -lrt -lgmp -ldl -lcrypt -lm -lpthread I, [2024-05-05T00:23:22.870403 #4169020] INFO -- : LANG = en_US.UTF-8 I, [2024-05-05T00:23:22.870413 #4169020] INFO -- : LC_ALL = I, [2024-05-05T00:23:22.870423 #4169020] INFO -- : LC_CTYPE = I, [2024-05-05T00:23:22.870432 #4169020] INFO -- : MFLAGS = -j20 --jobserver-auth=4,5 I, [2024-05-05T00:23:22.870442 #4169020] INFO -- : RUSTC = no I, [2024-05-05T00:23:22.870451 #4169020] INFO -- : YJIT_RUSTC_ARGS = --crate-name=yjit --crate-type=staticlib --edition=2021 -g -C lto=thin -C opt-level=3 -C overflow-checks=on '--out-dir=/tmp/ruby/build/trunk/yjit/target/release/' /tmp/ruby/src/trunk/yjit/src/lib.rs I, [2024-05-05T00:23:22.872247 #4169020] INFO -- : gcc (Ubuntu 11.4.0-1ubuntu1~22.04) 11.4.0 I, [2024-05-05T00:23:22.872279 #4169020] INFO -- : Copyright (C) 2021 Free Software Foundation, Inc. I, [2024-05-05T00:23:22.872292 #4169020] INFO -- : This is free software; see the source for copying conditions. There is NO I, [2024-05-05T00:23:22.872303 #4169020] INFO -- : warranty; not even for MERCHANTABILITY or FITNESS FOR A PARTICULAR PURPOSE. I, [2024-05-05T00:23:22.872314 #4169020] INFO -- : I, [2024-05-05T00:23:22.984221 #4169020] INFO -- : builtin_binary.inc updated I, [2024-05-05T00:23:22.988629 #4169020] INFO -- : c5234a9416e4f20f175185e840b25b0f08674d14078ed7083f37e655458e3ca9 builtin_binary.inc I, [2024-05-05T00:23:22.989300 #4169020] INFO -- : compiling /tmp/ruby/src/trunk/builtin.c I, [2024-05-05T00:23:23.172525 #4169020] INFO -- : linking static-library libruby-static.a I, [2024-05-05T00:23:23.487506 #4169020] INFO -- : linking shared-library libruby.so.3.4.0 I, [2024-05-05T00:23:25.033716 #4169020] INFO -- : linking ruby I, [2024-05-05T00:23:25.056554 #4169020] INFO -- : $$$[end] "make ruby -j20" exit with 0. I, [2024-05-05T00:23:25.056722 #4169020] INFO -- : $$$[beg] make all -j20 I, [2024-05-05T00:23:25.114651 #4169020] INFO -- : BASERUBY = /usr/bin/ruby --disable=gems I, [2024-05-05T00:23:25.114695 #4169020] INFO -- : CC = gcc I, [2024-05-05T00:23:25.114707 #4169020] INFO -- : LD = ld I, [2024-05-05T00:23:25.114717 #4169020] INFO -- : LDSHARED = gcc -shared I, [2024-05-05T00:23:25.114728 #4169020] INFO -- : CFLAGS = -O3 -fno-fast-math -ggdb3 -Wall -Wextra -Wdeprecated-declarations -Wdiv-by-zero -Wduplicated-cond -Wimplicit-function-declaration -Wimplicit-int -Wpointer-arith -Wwrite-strings -Wold-style-definition -Wimplicit-fallthrough=0 -Wmissing-noreturn -Wno-cast-function-type -Wno-constant-logical-operand -Wno-long-long -Wno-missing-field-initializers -Wno-overlength-strings -Wno-packed-bitfield-compat -Wno-parentheses-equality -Wno-self-assign -Wno-tautological-compare -Wno-unused-parameter -Wno-unused-value -Wsuggest-attribute=format -Wsuggest-attribute=noreturn -Wunused-variable -Wmisleading-indentation -Wundef -fPIC I, [2024-05-05T00:23:25.114741 #4169020] INFO -- : XCFLAGS = -U_FORTIFY_SOURCE -D_FORTIFY_SOURCE=2 -fstack-protector-strong -fno-strict-overflow -fvisibility=hidden -fexcess-precision=standard -DRUBY_EXPORT -I. -I.ext/include/x86_64-linux -I/tmp/ruby/src/trunk/include -I/tmp/ruby/src/trunk -I/tmp/ruby/src/trunk/prism -I/tmp/ruby/src/trunk/enc/unicode/15.0.0 I, [2024-05-05T00:23:25.114752 #4169020] INFO -- : CPPFLAGS = I, [2024-05-05T00:23:25.114762 #4169020] INFO -- : DLDFLAGS = -Wl,--compress-debug-sections=zlib -Wl,-soname,libruby.so.3.4 -fstack-protector-strong I, [2024-05-05T00:23:25.114772 #4169020] INFO -- : SOLIBS = -lz -lrt -lrt -lgmp -ldl -lcrypt -lm -lpthread I, [2024-05-05T00:23:25.114782 #4169020] INFO -- : LANG = en_US.UTF-8 I, [2024-05-05T00:23:25.114791 #4169020] INFO -- : LC_ALL = I, [2024-05-05T00:23:25.114801 #4169020] INFO -- : LC_CTYPE = I, [2024-05-05T00:23:25.114810 #4169020] INFO -- : MFLAGS = -j20 --jobserver-auth=4,5 I, [2024-05-05T00:23:25.114820 #4169020] INFO -- : RUSTC = no I, [2024-05-05T00:23:25.114831 #4169020] INFO -- : YJIT_RUSTC_ARGS = --crate-name=yjit --crate-type=staticlib --edition=2021 -g -C lto=thin -C opt-level=3 -C overflow-checks=on '--out-dir=/tmp/ruby/build/trunk/yjit/target/release/' /tmp/ruby/src/trunk/yjit/src/lib.rs I, [2024-05-05T00:23:25.116814 #4169020] INFO -- : gcc (Ubuntu 11.4.0-1ubuntu1~22.04) 11.4.0 I, [2024-05-05T00:23:25.116857 #4169020] INFO -- : Copyright (C) 2021 Free Software Foundation, Inc. I, [2024-05-05T00:23:25.116869 #4169020] INFO -- : This is free software; see the source for copying conditions. There is NO I, [2024-05-05T00:23:25.116880 #4169020] INFO -- : warranty; not even for MERCHANTABILITY or FITNESS FOR A PARTICULAR PURPOSE. I, [2024-05-05T00:23:25.116890 #4169020] INFO -- : I, [2024-05-05T00:23:25.150515 #4169020] INFO -- : generating enc.mk I, [2024-05-05T00:23:25.152312 #4169020] INFO -- : building spec/ruby/optional/capi/ext/array_spec.so I, [2024-05-05T00:23:25.152535 #4169020] INFO -- : building spec/ruby/optional/capi/ext/basic_object_spec.so I, [2024-05-05T00:23:25.153326 #4169020] INFO -- : building spec/ruby/optional/capi/ext/bignum_spec.so I, [2024-05-05T00:23:25.154059 #4169020] INFO -- : building spec/ruby/optional/capi/ext/binding_spec.so I, [2024-05-05T00:23:25.154472 #4169020] INFO -- : building spec/ruby/optional/capi/ext/boolean_spec.so I, [2024-05-05T00:23:25.155232 #4169020] INFO -- : building spec/ruby/optional/capi/ext/class_id_under_autoload_spec.so I, [2024-05-05T00:23:25.156448 #4169020] INFO -- : building spec/ruby/optional/capi/ext/class_spec.so I, [2024-05-05T00:23:25.156850 #4169020] INFO -- : building spec/ruby/optional/capi/ext/class_under_autoload_spec.so I, [2024-05-05T00:23:25.157554 #4169020] INFO -- : building spec/ruby/optional/capi/ext/complex_spec.so I, [2024-05-05T00:23:25.158483 #4169020] INFO -- : building spec/ruby/optional/capi/ext/constants_spec.so I, [2024-05-05T00:23:25.159050 #4169020] INFO -- : building spec/ruby/optional/capi/ext/data_spec.so I, [2024-05-05T00:23:25.159360 #4169020] INFO -- : building spec/ruby/optional/capi/ext/debug_spec.so I, [2024-05-05T00:23:25.160067 #4169020] INFO -- : building spec/ruby/optional/capi/ext/encoding_spec.so I, [2024-05-05T00:23:25.160590 #4169020] INFO -- : building spec/ruby/optional/capi/ext/enumerator_spec.so I, [2024-05-05T00:23:25.161173 #4169020] INFO -- : building spec/ruby/optional/capi/ext/exception_spec.so I, [2024-05-05T00:23:25.161519 #4169020] INFO -- : building spec/ruby/optional/capi/ext/fiber_spec.so I, [2024-05-05T00:23:25.162175 #4169020] INFO -- : building spec/ruby/optional/capi/ext/file_spec.so I, [2024-05-05T00:23:25.162383 #4169020] INFO -- : building spec/ruby/optional/capi/ext/fixnum_spec.so I, [2024-05-05T00:23:25.163529 #4169020] INFO -- : building spec/ruby/optional/capi/ext/float_spec.so I, [2024-05-05T00:23:25.292711 #4169020] INFO -- : building spec/ruby/optional/capi/ext/gc_spec.so I, [2024-05-05T00:23:25.297031 #4169020] INFO -- : building spec/ruby/optional/capi/ext/globals_spec.so I, [2024-05-05T00:23:25.302430 #4169020] INFO -- : building spec/ruby/optional/capi/ext/integer_spec.so I, [2024-05-05T00:23:25.302566 #4169020] INFO -- : building spec/ruby/optional/capi/ext/hash_spec.so I, [2024-05-05T00:23:25.312415 #4169020] INFO -- : building spec/ruby/optional/capi/ext/io_spec.so I, [2024-05-05T00:23:25.328359 #4169020] INFO -- : building spec/ruby/optional/capi/ext/kernel_spec.so I, [2024-05-05T00:23:25.332429 #4169020] INFO -- : building spec/ruby/optional/capi/ext/language_spec.so I, [2024-05-05T00:23:25.337825 #4169020] INFO -- : building spec/ruby/optional/capi/ext/marshal_spec.so I, [2024-05-05T00:23:25.338212 #4169020] INFO -- : building spec/ruby/optional/capi/ext/module_spec.so I, [2024-05-05T00:23:25.341920 #4169020] INFO -- : building spec/ruby/optional/capi/ext/module_under_autoload_spec.so I, [2024-05-05T00:23:25.344153 #4169020] INFO -- : building spec/ruby/optional/capi/ext/mutex_spec.so I, [2024-05-05T00:23:25.345460 #4169020] INFO -- : building spec/ruby/optional/capi/ext/numeric_spec.so I, [2024-05-05T00:23:25.350260 #4169020] INFO -- : building spec/ruby/optional/capi/ext/object_spec.so I, [2024-05-05T00:23:25.354177 #4169020] INFO -- : building spec/ruby/optional/capi/ext/proc_spec.so I, [2024-05-05T00:23:25.365383 #4169020] INFO -- : building spec/ruby/optional/capi/ext/range_spec.so I, [2024-05-05T00:23:25.390426 #4169020] INFO -- : building spec/ruby/optional/capi/ext/rational_spec.so I, [2024-05-05T00:23:25.397927 #4169020] INFO -- : building spec/ruby/optional/capi/ext/rbasic_spec.so I, [2024-05-05T00:23:25.405012 #4169020] INFO -- : building spec/ruby/optional/capi/ext/regexp_spec.so I, [2024-05-05T00:23:25.453571 #4169020] INFO -- : building spec/ruby/optional/capi/ext/string_spec.so I, [2024-05-05T00:23:25.456077 #4169020] INFO -- : building spec/ruby/optional/capi/ext/struct_spec.so I, [2024-05-05T00:23:25.484290 #4169020] INFO -- : building spec/ruby/optional/capi/ext/st_spec.so I, [2024-05-05T00:23:25.486637 #4169020] INFO -- : building spec/ruby/optional/capi/ext/symbol_spec.so I, [2024-05-05T00:23:25.490389 #4169020] INFO -- : building spec/ruby/optional/capi/ext/thread_spec.so I, [2024-05-05T00:23:25.504566 #4169020] INFO -- : building spec/ruby/optional/capi/ext/time_spec.so I, [2024-05-05T00:23:25.508298 #4169020] INFO -- : building spec/ruby/optional/capi/ext/tracepoint_spec.so I, [2024-05-05T00:23:25.523849 #4169020] INFO -- : building spec/ruby/optional/capi/ext/typed_data_spec.so I, [2024-05-05T00:23:25.537260 #4169020] INFO -- : building spec/ruby/optional/capi/ext/util_spec.so I, [2024-05-05T00:23:25.542219 #4169020] INFO -- : making enc I, [2024-05-05T00:23:25.544573 #4169020] INFO -- : making srcs under enc I, [2024-05-05T00:23:25.568289 #4169020] INFO -- : make[1]: Entering directory '/tmp/ruby/build/trunk' I, [2024-05-05T00:23:25.568363 #4169020] INFO -- : make[1]: Nothing to be done for 'enc'. I, [2024-05-05T00:23:25.568376 #4169020] INFO -- : make[1]: Leaving directory '/tmp/ruby/build/trunk' I, [2024-05-05T00:23:25.589841 #4169020] INFO -- : make[1]: Entering directory '/tmp/ruby/build/trunk' I, [2024-05-05T00:23:25.589902 #4169020] INFO -- : make[1]: Nothing to be done for 'srcs'. I, [2024-05-05T00:23:25.589914 #4169020] INFO -- : make[1]: Leaving directory '/tmp/ruby/build/trunk' I, [2024-05-05T00:23:25.590746 #4169020] INFO -- : generating transdb.h I, [2024-05-05T00:23:25.686952 #4169020] INFO -- : transdb.h unchanged I, [2024-05-05T00:23:25.688068 #4169020] INFO -- : generating makefiles ext/configure-ext.mk I, [2024-05-05T00:23:25.688313 #4169020] INFO -- : making trans I, [2024-05-05T00:23:25.714608 #4169020] INFO -- : ext/configure-ext.mk updated I, [2024-05-05T00:23:25.716767 #4169020] INFO -- : make[1]: Entering directory '/tmp/ruby/build/trunk' I, [2024-05-05T00:23:25.724005 #4169020] INFO -- : make[1]: Entering directory '/tmp/ruby/build/trunk' I, [2024-05-05T00:23:25.724071 #4169020] INFO -- : make[1]: Nothing to be done for 'trans'. I, [2024-05-05T00:23:25.724080 #4169020] INFO -- : make[1]: Leaving directory '/tmp/ruby/build/trunk' I, [2024-05-05T00:23:25.798705 #4169020] INFO -- : making encs I, [2024-05-05T00:23:25.858806 #4169020] INFO -- : make[1]: Entering directory '/tmp/ruby/build/trunk' I, [2024-05-05T00:23:25.858861 #4169020] INFO -- : make[1]: Nothing to be done for 'encs'. I, [2024-05-05T00:23:25.858870 #4169020] INFO -- : make[1]: Leaving directory '/tmp/ruby/build/trunk' I, [2024-05-05T00:23:25.869617 #4169020] INFO -- : make[1]: Leaving directory '/tmp/ruby/build/trunk' I, [2024-05-05T00:23:25.870363 #4169020] INFO -- : generating makefile exts.mk I, [2024-05-05T00:23:25.907636 #4169020] INFO -- : exts.mk unchanged I, [2024-05-05T00:23:25.912477 #4169020] INFO -- : make[1]: Entering directory '/tmp/ruby/build/trunk' I, [2024-05-05T00:23:25.933736 #4169020] INFO -- : make[2]: Entering directory '/tmp/ruby/build/trunk/ext/coverage' I, [2024-05-05T00:23:25.933981 #4169020] INFO -- : make[2]: Entering directory '/tmp/ruby/build/trunk/ext/json' I, [2024-05-05T00:23:25.934208 #4169020] INFO -- : make[2]: Entering directory '/tmp/ruby/build/trunk/ext/digest' I, [2024-05-05T00:23:25.935733 #4169020] INFO -- : make[2]: Entering directory '/tmp/ruby/build/trunk/ext/io/console' I, [2024-05-05T00:23:25.936009 #4169020] INFO -- : make[2]: Entering directory '/tmp/ruby/build/trunk/ext/date' I, [2024-05-05T00:23:25.936033 #4169020] INFO -- : make[2]: Entering directory '/tmp/ruby/build/trunk/ext/monitor' I, [2024-05-05T00:23:25.936110 #4169020] INFO -- : make[2]: Entering directory '/tmp/ruby/build/trunk/ext/pathname' I, [2024-05-05T00:23:25.937006 #4169020] INFO -- : make[2]: Entering directory '/tmp/ruby/build/trunk/ext/pty' I, [2024-05-05T00:23:25.937035 #4169020] INFO -- : make[2]: Leaving directory '/tmp/ruby/build/trunk/ext/coverage' I, [2024-05-05T00:23:25.937208 #4169020] INFO -- : make[2]: Entering directory '/tmp/ruby/build/trunk/ext/rubyvm' I, [2024-05-05T00:23:25.938203 #4169020] INFO -- : make[2]: Entering directory '/tmp/ruby/build/trunk/ext/objspace' I, [2024-05-05T00:23:25.938296 #4169020] INFO -- : make[2]: Entering directory '/tmp/ruby/build/trunk/ext/fiddle' I, [2024-05-05T00:23:25.938547 #4169020] INFO -- : make[2]: Leaving directory '/tmp/ruby/build/trunk/ext/io/console' I, [2024-05-05T00:23:25.938571 #4169020] INFO -- : make[2]: Entering directory '/tmp/ruby/build/trunk/ext/psych' I, [2024-05-05T00:23:25.938581 #4169020] INFO -- : make[2]: Leaving directory '/tmp/ruby/build/trunk/ext/monitor' I, [2024-05-05T00:23:25.939058 #4169020] INFO -- : make[2]: Leaving directory '/tmp/ruby/build/trunk/ext/rubyvm' I, [2024-05-05T00:23:25.939571 #4169020] INFO -- : make[2]: Leaving directory '/tmp/ruby/build/trunk/ext/date' I, [2024-05-05T00:23:25.939581 #4169020] INFO -- : make[2]: Leaving directory '/tmp/ruby/build/trunk/ext/pty' I, [2024-05-05T00:23:25.939738 #4169020] INFO -- : make[2]: Leaving directory '/tmp/ruby/build/trunk/ext/digest' I, [2024-05-05T00:23:25.940829 #4169020] INFO -- : make[2]: Leaving directory '/tmp/ruby/build/trunk/ext/pathname' I, [2024-05-05T00:23:25.941809 #4169020] INFO -- : make[2]: Leaving directory '/tmp/ruby/build/trunk/ext/objspace' I, [2024-05-05T00:23:25.942745 #4169020] INFO -- : make[2]: Entering directory '/tmp/ruby/build/trunk/ext/ripper' I, [2024-05-05T00:23:25.943274 #4169020] INFO -- : make[2]: Leaving directory '/tmp/ruby/build/trunk/ext/fiddle' I, [2024-05-05T00:23:25.943488 #4169020] INFO -- : make[2]: Leaving directory '/tmp/ruby/build/trunk/ext/json' I, [2024-05-05T00:23:25.943575 #4169020] INFO -- : make[2]: Entering directory '/tmp/ruby/build/trunk/.bundle/gems/bigdecimal-3.1.7/ext/bigdecimal' I, [2024-05-05T00:23:25.943675 #4169020] INFO -- : make[2]: Entering directory '/tmp/ruby/build/trunk/.bundle/gems/nkf-0.2.0/ext/nkf' I, [2024-05-05T00:23:25.944379 #4169020] INFO -- : make[2]: Entering directory '/tmp/ruby/build/trunk/.bundle/gems/debug-1.9.2/ext/debug' I, [2024-05-05T00:23:25.944654 #4169020] INFO -- : make[2]: Entering directory '/tmp/ruby/build/trunk/.bundle/gems/racc-1.7.3/ext/racc/cparse' I, [2024-05-05T00:23:25.945020 #4169020] INFO -- : make[2]: Entering directory '/tmp/ruby/build/trunk/.bundle/gems/syslog-0.1.2/ext/syslog' I, [2024-05-05T00:23:25.945374 #4169020] INFO -- : make[2]: Entering directory '/tmp/ruby/build/trunk/.bundle/gems/rbs-3.4.4/ext/rbs_extension' I, [2024-05-05T00:23:25.947661 #4169020] INFO -- : make[2]: Entering directory '/tmp/ruby/build/trunk/ext/digest/sha2' I, [2024-05-05T00:23:25.947854 #4169020] INFO -- : make[2]: Leaving directory '/tmp/ruby/build/trunk/ext/ripper' I, [2024-05-05T00:23:25.948550 #4169020] INFO -- : make[2]: Entering directory '/tmp/ruby/build/trunk/ext/socket' I, [2024-05-05T00:23:25.948871 #4169020] INFO -- : make[2]: Leaving directory '/tmp/ruby/build/trunk/ext/psych' I, [2024-05-05T00:23:25.950266 #4169020] INFO -- : make[2]: Leaving directory '/tmp/ruby/build/trunk/ext/digest/sha2' I, [2024-05-05T00:23:25.950760 #4169020] INFO -- : make[2]: Entering directory '/tmp/ruby/build/trunk/ext/openssl' I, [2024-05-05T00:23:25.954639 #4169020] INFO -- : make[2]: Leaving directory '/tmp/ruby/build/trunk/ext/socket' I, [2024-05-05T00:23:25.962037 #4169020] INFO -- : make[2]: Leaving directory '/tmp/ruby/build/trunk/ext/openssl' I, [2024-05-05T00:23:25.966692 #4169020] INFO -- : make[2]: Leaving directory '/tmp/ruby/build/trunk/.bundle/gems/nkf-0.2.0/ext/nkf' I, [2024-05-05T00:23:25.967181 #4169020] INFO -- : make[2]: Leaving directory '/tmp/ruby/build/trunk/.bundle/gems/syslog-0.1.2/ext/syslog' I, [2024-05-05T00:23:25.969177 #4169020] INFO -- : make[2]: Leaving directory '/tmp/ruby/build/trunk/.bundle/gems/racc-1.7.3/ext/racc/cparse' I, [2024-05-05T00:23:25.973548 #4169020] INFO -- : make[2]: Leaving directory '/tmp/ruby/build/trunk/.bundle/gems/debug-1.9.2/ext/debug' I, [2024-05-05T00:23:25.974962 #4169020] INFO -- : make[2]: Leaving directory '/tmp/ruby/build/trunk/.bundle/gems/bigdecimal-3.1.7/ext/bigdecimal' I, [2024-05-05T00:23:25.976826 #4169020] INFO -- : make[2]: Leaving directory '/tmp/ruby/build/trunk/.bundle/gems/rbs-3.4.4/ext/rbs_extension' I, [2024-05-05T00:23:26.001186 #4169020] INFO -- : make[2]: Entering directory '/tmp/ruby/build/trunk' I, [2024-05-05T00:23:26.067051 #4169020] INFO -- : linking ruby I, [2024-05-05T00:23:26.089809 #4169020] INFO -- : make[2]: Leaving directory '/tmp/ruby/build/trunk' I, [2024-05-05T00:23:26.090125 #4169020] INFO -- : make[1]: Leaving directory '/tmp/ruby/build/trunk' I, [2024-05-05T00:23:26.093697 #4169020] INFO -- : make[1]: Entering directory '/tmp/ruby/build/trunk' I, [2024-05-05T00:23:26.093721 #4169020] INFO -- : make[1]: Nothing to be done for 'note'. I, [2024-05-05T00:23:26.093730 #4169020] INFO -- : make[1]: Leaving directory '/tmp/ruby/build/trunk' I, [2024-05-05T00:23:26.094984 #4169020] INFO -- : $$$[end] "make all -j20" exit with 0. I, [2024-05-05T00:23:26.095185 #4169020] INFO -- : $$$[beg] make install -j20 I, [2024-05-05T00:23:26.163257 #4169020] INFO -- : Update minitest to ea9caafc0754b1d6236a490d59e624b53209734a I, [2024-05-05T00:23:26.163443 #4169020] INFO -- : Update power_assert to 84e85124c5014a139af39161d484156cfe87a9ed I, [2024-05-05T00:23:26.164130 #4169020] INFO -- : Update rbs to ba7872795d5de04adb8ff500c0e6afdc81a041dd I, [2024-05-05T00:23:26.164155 #4169020] INFO -- : Update typeprof to b19a6416da3a05d57fadd6ffdadb382b6d236ca5 I, [2024-05-05T00:23:26.165244 #4169020] INFO -- : echo ea9caafc0754b1d6236a490d59e624b53209734a | /bin/sh /tmp/ruby/src/trunk/tool/ifchange /tmp/ruby/src/trunk/.bundle/.timestamp/minitest.revision - I, [2024-05-05T00:23:26.165440 #4169020] INFO -- : echo 84e85124c5014a139af39161d484156cfe87a9ed | /bin/sh /tmp/ruby/src/trunk/tool/ifchange /tmp/ruby/src/trunk/.bundle/.timestamp/power_assert.revision - I, [2024-05-05T00:23:26.166619 #4169020] INFO -- : BASERUBY = /usr/bin/ruby --disable=gems I, [2024-05-05T00:23:26.166640 #4169020] INFO -- : CC = gcc I, [2024-05-05T00:23:26.166646 #4169020] INFO -- : LD = ld I, [2024-05-05T00:23:26.166651 #4169020] INFO -- : LDSHARED = gcc -shared I, [2024-05-05T00:23:26.166654 #4169020] INFO -- : CFLAGS = -O3 -fno-fast-math -ggdb3 -Wall -Wextra -Wdeprecated-declarations -Wdiv-by-zero -Wduplicated-cond -Wimplicit-function-declaration -Wimplicit-int -Wpointer-arith -Wwrite-strings -Wold-style-definition -Wimplicit-fallthrough=0 -Wmissing-noreturn -Wno-cast-function-type -Wno-constant-logical-operand -Wno-long-long -Wno-missing-field-initializers -Wno-overlength-strings -Wno-packed-bitfield-compat -Wno-parentheses-equality -Wno-self-assign -Wno-tautological-compare -Wno-unused-parameter -Wno-unused-value -Wsuggest-attribute=format -Wsuggest-attribute=noreturn -Wunused-variable -Wmisleading-indentation -Wundef -fPIC I, [2024-05-05T00:23:26.166659 #4169020] INFO -- : XCFLAGS = -U_FORTIFY_SOURCE -D_FORTIFY_SOURCE=2 -fstack-protector-strong -fno-strict-overflow -fvisibility=hidden -fexcess-precision=standard -DRUBY_EXPORT -I. -I.ext/include/x86_64-linux -I/tmp/ruby/src/trunk/include -I/tmp/ruby/src/trunk -I/tmp/ruby/src/trunk/prism -I/tmp/ruby/src/trunk/enc/unicode/15.0.0 I, [2024-05-05T00:23:26.166663 #4169020] INFO -- : CPPFLAGS = I, [2024-05-05T00:23:26.166666 #4169020] INFO -- : DLDFLAGS = -Wl,--compress-debug-sections=zlib -Wl,-soname,libruby.so.3.4 -fstack-protector-strong I, [2024-05-05T00:23:26.166670 #4169020] INFO -- : SOLIBS = -lz -lrt -lrt -lgmp -ldl -lcrypt -lm -lpthread I, [2024-05-05T00:23:26.166673 #4169020] INFO -- : LANG = en_US.UTF-8 I, [2024-05-05T00:23:26.166681 #4169020] INFO -- : LC_ALL = I, [2024-05-05T00:23:26.166684 #4169020] INFO -- : LC_CTYPE = I, [2024-05-05T00:23:26.166688 #4169020] INFO -- : MFLAGS = -j20 --jobserver-auth=4,5 I, [2024-05-05T00:23:26.166691 #4169020] INFO -- : RUSTC = no I, [2024-05-05T00:23:26.166695 #4169020] INFO -- : YJIT_RUSTC_ARGS = --crate-name=yjit --crate-type=staticlib --edition=2021 -g -C lto=thin -C opt-level=3 -C overflow-checks=on '--out-dir=/tmp/ruby/build/trunk/yjit/target/release/' /tmp/ruby/src/trunk/yjit/src/lib.rs I, [2024-05-05T00:23:26.167279 #4169020] INFO -- : /tmp/ruby/src/trunk/.bundle/.timestamp/minitest.revision unchanged I, [2024-05-05T00:23:26.167540 #4169020] INFO -- : /tmp/ruby/src/trunk/.bundle/.timestamp/power_assert.revision unchanged I, [2024-05-05T00:23:26.196873 #4169020] INFO -- : echo ba7872795d5de04adb8ff500c0e6afdc81a041dd | /bin/sh /tmp/ruby/src/trunk/tool/ifchange /tmp/ruby/src/trunk/.bundle/.timestamp/rbs.revision - I, [2024-05-05T00:23:26.197039 #4169020] INFO -- : echo b19a6416da3a05d57fadd6ffdadb382b6d236ca5 | /bin/sh /tmp/ruby/src/trunk/tool/ifchange /tmp/ruby/src/trunk/.bundle/.timestamp/typeprof.revision - I, [2024-05-05T00:23:26.197752 #4169020] INFO -- : generating enc.mk I, [2024-05-05T00:23:26.197777 #4169020] INFO -- : gcc (Ubuntu 11.4.0-1ubuntu1~22.04) 11.4.0 I, [2024-05-05T00:23:26.197783 #4169020] INFO -- : Copyright (C) 2021 Free Software Foundation, Inc. I, [2024-05-05T00:23:26.197795 #4169020] INFO -- : This is free software; see the source for copying conditions. There is NO I, [2024-05-05T00:23:26.197800 #4169020] INFO -- : warranty; not even for MERCHANTABILITY or FITNESS FOR A PARTICULAR PURPOSE. I, [2024-05-05T00:23:26.197804 #4169020] INFO -- : I, [2024-05-05T00:23:26.198890 #4169020] INFO -- : /tmp/ruby/src/trunk/.bundle/.timestamp/typeprof.revision unchanged I, [2024-05-05T00:23:26.199141 #4169020] INFO -- : /tmp/ruby/src/trunk/.bundle/.timestamp/rbs.revision unchanged I, [2024-05-05T00:23:26.320591 #4169020] INFO -- : Building power_assert@84e85124c5014a139af39161d484156cfe87a9ed to /tmp/ruby/src/trunk/gems/power_assert-2.0.3.gem I, [2024-05-05T00:23:26.321289 #4169020] INFO -- : making srcs under enc I, [2024-05-05T00:23:26.321499 #4169020] INFO -- : making enc I, [2024-05-05T00:23:26.338456 #4169020] INFO -- : make[1]: Entering directory '/tmp/ruby/build/trunk' I, [2024-05-05T00:23:26.338516 #4169020] INFO -- : make[1]: Nothing to be done for 'enc'. I, [2024-05-05T00:23:26.338529 #4169020] INFO -- : make[1]: Leaving directory '/tmp/ruby/build/trunk' I, [2024-05-05T00:23:26.350884 #4169020] INFO -- : make[1]: Entering directory '/tmp/ruby/build/trunk' I, [2024-05-05T00:23:26.350941 #4169020] INFO -- : make[1]: Nothing to be done for 'srcs'. I, [2024-05-05T00:23:26.350961 #4169020] INFO -- : make[1]: Leaving directory '/tmp/ruby/build/trunk' I, [2024-05-05T00:23:26.351608 #4169020] INFO -- : generating transdb.h I, [2024-05-05T00:23:26.388970 #4169020] INFO -- : Successfully built RubyGem I, [2024-05-05T00:23:26.389031 #4169020] INFO -- : Name: power_assert I, [2024-05-05T00:23:26.389045 #4169020] INFO -- : Version: 2.0.4dev I, [2024-05-05T00:23:26.389056 #4169020] INFO -- : File: power_assert-2.0.4dev.gem I, [2024-05-05T00:23:26.391294 #4169020] INFO -- : Extracting bundle gem power_assert-2.0.3... I, [2024-05-05T00:23:26.446507 #4169020] INFO -- : transdb.h unchanged I, [2024-05-05T00:23:26.448230 #4169020] INFO -- : generating makefiles ext/configure-ext.mk I, [2024-05-05T00:23:26.448288 #4169020] INFO -- : making trans I, [2024-05-05T00:23:26.452149 #4169020] INFO -- : Try with hash version of bundled gems instead of gems/power_assert-2.0.3.gem. We don't use this gem with release version of Ruby. I, [2024-05-05T00:23:26.457133 #4169020] INFO -- : Unpacked gems/power_assert-2.0.4dev.gem I, [2024-05-05T00:23:26.474977 #4169020] INFO -- : ext/configure-ext.mk unchanged I, [2024-05-05T00:23:26.477243 #4169020] INFO -- : make[1]: Entering directory '/tmp/ruby/build/trunk' I, [2024-05-05T00:23:26.482526 #4169020] INFO -- : make[1]: Entering directory '/tmp/ruby/build/trunk' I, [2024-05-05T00:23:26.482620 #4169020] INFO -- : make[1]: Nothing to be done for 'trans'. I, [2024-05-05T00:23:26.482630 #4169020] INFO -- : make[1]: Leaving directory '/tmp/ruby/build/trunk' I, [2024-05-05T00:23:26.483433 #4169020] INFO -- : making encs I, [2024-05-05T00:23:26.542103 #4169020] INFO -- : make[1]: Entering directory '/tmp/ruby/build/trunk' I, [2024-05-05T00:23:26.542178 #4169020] INFO -- : make[1]: Nothing to be done for 'encs'. I, [2024-05-05T00:23:26.542209 #4169020] INFO -- : make[1]: Leaving directory '/tmp/ruby/build/trunk' I, [2024-05-05T00:23:26.633232 #4169020] INFO -- : make[1]: Leaving directory '/tmp/ruby/build/trunk' I, [2024-05-05T00:23:26.633921 #4169020] INFO -- : generating makefile exts.mk I, [2024-05-05T00:23:26.671221 #4169020] INFO -- : exts.mk unchanged I, [2024-05-05T00:23:26.675649 #4169020] INFO -- : make[1]: Entering directory '/tmp/ruby/build/trunk' I, [2024-05-05T00:23:26.694147 #4169020] INFO -- : make[2]: Entering directory '/tmp/ruby/build/trunk/ext/digest' I, [2024-05-05T00:23:26.695534 #4169020] INFO -- : make[2]: Entering directory '/tmp/ruby/build/trunk/ext/coverage' I, [2024-05-05T00:23:26.695682 #4169020] INFO -- : make[2]: Entering directory '/tmp/ruby/build/trunk/ext/json' I, [2024-05-05T00:23:26.696602 #4169020] INFO -- : make[2]: Entering directory '/tmp/ruby/build/trunk/ext/date' I, [2024-05-05T00:23:26.697099 #4169020] INFO -- : make[2]: Entering directory '/tmp/ruby/build/trunk/ext/rubyvm' I, [2024-05-05T00:23:26.697736 #4169020] INFO -- : make[2]: Entering directory '/tmp/ruby/build/trunk/ext/io/console' I, [2024-05-05T00:23:26.697770 #4169020] INFO -- : make[2]: Entering directory '/tmp/ruby/build/trunk/ext/monitor' I, [2024-05-05T00:23:26.698459 #4169020] INFO -- : make[2]: Entering directory '/tmp/ruby/build/trunk/ext/pathname' I, [2024-05-05T00:23:26.698836 #4169020] INFO -- : make[2]: Entering directory '/tmp/ruby/build/trunk/ext/fiddle' I, [2024-05-05T00:23:26.699124 #4169020] INFO -- : make[2]: Entering directory '/tmp/ruby/build/trunk/ext/pty' I, [2024-05-05T00:23:26.699261 #4169020] INFO -- : make[2]: Leaving directory '/tmp/ruby/build/trunk/ext/coverage' I, [2024-05-05T00:23:26.699423 #4169020] INFO -- : make[2]: Leaving directory '/tmp/ruby/build/trunk/ext/digest' I, [2024-05-05T00:23:26.699897 #4169020] INFO -- : make[2]: Entering directory '/tmp/ruby/build/trunk/ext/objspace' I, [2024-05-05T00:23:26.700452 #4169020] INFO -- : make[2]: Leaving directory '/tmp/ruby/build/trunk/ext/monitor' I, [2024-05-05T00:23:26.700672 #4169020] INFO -- : make[2]: Entering directory '/tmp/ruby/build/trunk/ext/psych' I, [2024-05-05T00:23:26.700906 #4169020] INFO -- : make[2]: Leaving directory '/tmp/ruby/build/trunk/ext/date' I, [2024-05-05T00:23:26.701171 #4169020] INFO -- : make[2]: Leaving directory '/tmp/ruby/build/trunk/ext/pathname' I, [2024-05-05T00:23:26.701251 #4169020] INFO -- : make[2]: Leaving directory '/tmp/ruby/build/trunk/ext/io/console' I, [2024-05-05T00:23:26.701326 #4169020] INFO -- : make[2]: Leaving directory '/tmp/ruby/build/trunk/ext/rubyvm' I, [2024-05-05T00:23:26.702264 #4169020] INFO -- : make[2]: Entering directory '/tmp/ruby/build/trunk/.bundle/gems/debug-1.9.2/ext/debug' I, [2024-05-05T00:23:26.702319 #4169020] INFO -- : make[2]: Entering directory '/tmp/ruby/build/trunk/.bundle/gems/bigdecimal-3.1.7/ext/bigdecimal' I, [2024-05-05T00:23:26.702465 #4169020] INFO -- : make[2]: Leaving directory '/tmp/ruby/build/trunk/ext/pty' I, [2024-05-05T00:23:26.703073 #4169020] INFO -- : make[2]: Entering directory '/tmp/ruby/build/trunk/.bundle/gems/nkf-0.2.0/ext/nkf' I, [2024-05-05T00:23:26.703104 #4169020] INFO -- : make[2]: Entering directory '/tmp/ruby/build/trunk/ext/ripper' I, [2024-05-05T00:23:26.704405 #4169020] INFO -- : make[2]: Entering directory '/tmp/ruby/build/trunk/.bundle/gems/racc-1.7.3/ext/racc/cparse' I, [2024-05-05T00:23:26.704631 #4169020] INFO -- : make[2]: Leaving directory '/tmp/ruby/build/trunk/ext/json' I, [2024-05-05T00:23:26.704808 #4169020] INFO -- : make[2]: Entering directory '/tmp/ruby/build/trunk/.bundle/gems/syslog-0.1.2/ext/syslog' I, [2024-05-05T00:23:26.704976 #4169020] INFO -- : make[2]: Leaving directory '/tmp/ruby/build/trunk/ext/objspace' I, [2024-05-05T00:23:26.705247 #4169020] INFO -- : make[2]: Entering directory '/tmp/ruby/build/trunk/.bundle/gems/rbs-3.4.4/ext/rbs_extension' I, [2024-05-05T00:23:26.705762 #4169020] INFO -- : make[2]: Leaving directory '/tmp/ruby/build/trunk/ext/fiddle' I, [2024-05-05T00:23:26.707581 #4169020] INFO -- : make[2]: Entering directory '/tmp/ruby/build/trunk/ext/socket' I, [2024-05-05T00:23:26.708362 #4169020] INFO -- : make[2]: Leaving directory '/tmp/ruby/build/trunk/ext/ripper' I, [2024-05-05T00:23:26.710201 #4169020] INFO -- : make[2]: Entering directory '/tmp/ruby/build/trunk/ext/openssl' I, [2024-05-05T00:23:26.713170 #4169020] INFO -- : make[2]: Entering directory '/tmp/ruby/build/trunk/ext/digest/sha2' I, [2024-05-05T00:23:26.714395 #4169020] INFO -- : make[2]: Leaving directory '/tmp/ruby/build/trunk/ext/socket' I, [2024-05-05T00:23:26.715453 #4169020] INFO -- : make[2]: Leaving directory '/tmp/ruby/build/trunk/ext/digest/sha2' I, [2024-05-05T00:23:26.724314 #4169020] INFO -- : make[2]: Leaving directory '/tmp/ruby/build/trunk/ext/psych' I, [2024-05-05T00:23:26.724988 #4169020] INFO -- : make[2]: Leaving directory '/tmp/ruby/build/trunk/.bundle/gems/nkf-0.2.0/ext/nkf' I, [2024-05-05T00:23:26.725524 #4169020] INFO -- : make[2]: Leaving directory '/tmp/ruby/build/trunk/.bundle/gems/debug-1.9.2/ext/debug' I, [2024-05-05T00:23:26.726973 #4169020] INFO -- : make[2]: Leaving directory '/tmp/ruby/build/trunk/ext/openssl' I, [2024-05-05T00:23:26.727228 #4169020] INFO -- : make[2]: Leaving directory '/tmp/ruby/build/trunk/.bundle/gems/rbs-3.4.4/ext/rbs_extension' I, [2024-05-05T00:23:26.730407 #4169020] INFO -- : make[2]: Leaving directory '/tmp/ruby/build/trunk/.bundle/gems/syslog-0.1.2/ext/syslog' I, [2024-05-05T00:23:26.734880 #4169020] INFO -- : make[2]: Leaving directory '/tmp/ruby/build/trunk/.bundle/gems/bigdecimal-3.1.7/ext/bigdecimal' I, [2024-05-05T00:23:26.739291 #4169020] INFO -- : make[2]: Leaving directory '/tmp/ruby/build/trunk/.bundle/gems/racc-1.7.3/ext/racc/cparse' I, [2024-05-05T00:23:26.764751 #4169020] INFO -- : make[2]: Entering directory '/tmp/ruby/build/trunk' I, [2024-05-05T00:23:26.830190 #4169020] INFO -- : make[2]: 'ruby' is up to date. I, [2024-05-05T00:23:26.830227 #4169020] INFO -- : make[2]: Leaving directory '/tmp/ruby/build/trunk' I, [2024-05-05T00:23:26.830716 #4169020] INFO -- : make[1]: Leaving directory '/tmp/ruby/build/trunk' I, [2024-05-05T00:23:26.834531 #4169020] INFO -- : make[1]: Entering directory '/tmp/ruby/build/trunk' I, [2024-05-05T00:23:26.834554 #4169020] INFO -- : make[1]: Nothing to be done for 'note'. I, [2024-05-05T00:23:26.834560 #4169020] INFO -- : make[1]: Leaving directory '/tmp/ruby/build/trunk' I, [2024-05-05T00:23:26.834767 #4169020] INFO -- : ./miniruby -I/tmp/ruby/src/trunk/lib -I. -I.ext/common /tmp/ruby/src/trunk/tool/runruby.rb --extout=.ext -- --disable-gems -r./x86_64-linux-fake /tmp/ruby/src/trunk/tool/rbinstall.rb --make="make" --dest-dir="" --extout=".ext" --ext-build-dir="./ext" --mflags="-j20 --jobserver-auth=4,5" --make-flags=" -j20 --jobserver-auth=4,5" --data-mode=0644 --prog-mode=0755 --installed-list .installed.list --mantype="doc" --gnumake --install=all --exclude=doc I, [2024-05-05T00:23:26.931741 #4169020] INFO -- : Installing to I, [2024-05-05T00:23:26.931815 #4169020] INFO -- : installing binary commands: /tmp/ruby/install/trunk/bin I, [2024-05-05T00:23:26.931955 #4169020] INFO -- : installing base libraries: /tmp/ruby/install/trunk/lib I, [2024-05-05T00:23:26.939448 #4169020] INFO -- : installing arch files: /tmp/ruby/install/trunk/lib/ruby/3.4.0+0/x86_64-linux I, [2024-05-05T00:23:26.939501 #4169020] INFO -- : installing pkgconfig data: /tmp/ruby/install/trunk/lib/pkgconfig I, [2024-05-05T00:23:26.939538 #4169020] INFO -- : installing extension objects: /tmp/ruby/install/trunk/lib/ruby/3.4.0+0/x86_64-linux I, [2024-05-05T00:23:26.949166 #4169020] INFO -- : installing extension objects: /tmp/ruby/install/trunk/lib/ruby/site_ruby/3.4.0+0/x86_64-linux I, [2024-05-05T00:23:26.949193 #4169020] INFO -- : installing extension objects: /tmp/ruby/install/trunk/lib/ruby/vendor_ruby/3.4.0+0/x86_64-linux I, [2024-05-05T00:23:26.949278 #4169020] INFO -- : installing extension headers: /tmp/ruby/install/trunk/include/ruby-3.4.0+0/x86_64-linux I, [2024-05-05T00:23:26.949425 #4169020] INFO -- : installing extension scripts: /tmp/ruby/install/trunk/lib/ruby/3.4.0+0 I, [2024-05-05T00:23:26.953077 #4169020] INFO -- : installing extension scripts: /tmp/ruby/install/trunk/lib/ruby/site_ruby/3.4.0+0 I, [2024-05-05T00:23:26.953105 #4169020] INFO -- : installing extension scripts: /tmp/ruby/install/trunk/lib/ruby/vendor_ruby/3.4.0+0 I, [2024-05-05T00:23:26.953114 #4169020] INFO -- : installing extension headers: /tmp/ruby/install/trunk/include/ruby-3.4.0+0/ruby I, [2024-05-05T00:23:26.953157 #4169020] INFO -- : installing command scripts: /tmp/ruby/install/trunk/bin I, [2024-05-05T00:23:26.953227 #4169020] INFO -- : installing library scripts: /tmp/ruby/install/trunk/lib/ruby/3.4.0+0 I, [2024-05-05T00:23:26.987352 #4169020] INFO -- : installing common headers: /tmp/ruby/install/trunk/include/ruby-3.4.0+0 I, [2024-05-05T00:23:26.992804 #4169020] INFO -- : installing manpages: /tmp/ruby/install/trunk/share/man/man1 I, [2024-05-05T00:23:26.992948 #4169020] INFO -- : installing default gems from lib: /tmp/ruby/install/trunk/lib/ruby/gems/3.4.0+0 I, [2024-05-05T00:23:27.015431 #4169020] INFO -- : benchmark 0.3.0 I, [2024-05-05T00:23:27.022437 #4169020] INFO -- : bundler 2.6.0.dev I, [2024-05-05T00:23:27.024570 #4169020] INFO -- : cgi 0.4.1 I, [2024-05-05T00:23:27.025140 #4169020] INFO -- : delegate 0.3.1 I, [2024-05-05T00:23:27.025658 #4169020] INFO -- : did_you_mean 1.6.3 I, [2024-05-05T00:23:27.026184 #4169020] INFO -- : english 0.8.0 I, [2024-05-05T00:23:27.026684 #4169020] INFO -- : erb 4.0.4 I, [2024-05-05T00:23:27.027435 #4169020] INFO -- : error_highlight 0.6.0 I, [2024-05-05T00:23:27.027940 #4169020] INFO -- : fileutils 1.7.2 I, [2024-05-05T00:23:27.028483 #4169020] INFO -- : find 0.2.0 I, [2024-05-05T00:23:27.028992 #4169020] INFO -- : forwardable 1.3.3 I, [2024-05-05T00:23:27.029493 #4169020] INFO -- : ipaddr 1.2.6 I, [2024-05-05T00:23:27.029972 #4169020] INFO -- : irb 1.13.0 I, [2024-05-05T00:23:27.031423 #4169020] INFO -- : logger 1.6.0 I, [2024-05-05T00:23:27.031962 #4169020] INFO -- : net-http 0.4.1 I, [2024-05-05T00:23:27.032516 #4169020] INFO -- : net-protocol 0.2.2 I, [2024-05-05T00:23:27.033047 #4169020] INFO -- : open-uri 0.4.1 I, [2024-05-05T00:23:27.033582 #4169020] INFO -- : open3 0.2.1 I, [2024-05-05T00:23:27.034108 #4169020] INFO -- : optparse 0.5.0 I, [2024-05-05T00:23:27.034626 #4169020] INFO -- : ostruct 0.6.0 I, [2024-05-05T00:23:27.035144 #4169020] INFO -- : pp 0.5.0 I, [2024-05-05T00:23:27.035683 #4169020] INFO -- : prettyprint 0.2.0 I, [2024-05-05T00:23:27.036227 #4169020] INFO -- : prism 0.27.0 I, [2024-05-05T00:23:27.036766 #4169020] INFO -- : pstore 0.1.3 I, [2024-05-05T00:23:27.037275 #4169020] INFO -- : rdoc 6.6.3.1 I, [2024-05-05T00:23:27.038917 #4169020] INFO -- : readline 0.0.4 I, [2024-05-05T00:23:27.039450 #4169020] INFO -- : reline 0.5.5 I, [2024-05-05T00:23:27.040029 #4169020] INFO -- : resolv 0.4.0 I, [2024-05-05T00:23:27.040551 #4169020] INFO -- : ruby2_keywords 0.0.5 I, [2024-05-05T00:23:27.041065 #4169020] INFO -- : securerandom 0.3.1 I, [2024-05-05T00:23:27.041568 #4169020] INFO -- : set 1.1.0 I, [2024-05-05T00:23:27.042087 #4169020] INFO -- : shellwords 0.2.0 I, [2024-05-05T00:23:27.042635 #4169020] INFO -- : singleton 0.2.0 I, [2024-05-05T00:23:27.043120 #4169020] INFO -- : syntax_suggest 2.0.0 I, [2024-05-05T00:23:27.043864 #4169020] INFO -- : tempfile 0.2.1 I, [2024-05-05T00:23:27.044450 #4169020] INFO -- : time 0.3.0 I, [2024-05-05T00:23:27.045096 #4169020] INFO -- : timeout 0.4.1 I, [2024-05-05T00:23:27.046127 #4169020] INFO -- : tmpdir 0.2.0 I, [2024-05-05T00:23:27.046672 #4169020] INFO -- : tsort 0.2.0 I, [2024-05-05T00:23:27.047206 #4169020] INFO -- : un 0.3.0 I, [2024-05-05T00:23:27.047723 #4169020] INFO -- : uri 0.13.0 I, [2024-05-05T00:23:27.048270 #4169020] INFO -- : weakref 0.1.3 I, [2024-05-05T00:23:27.048804 #4169020] INFO -- : yaml 0.3.0 I, [2024-05-05T00:23:27.049221 #4169020] INFO -- : installing default gems from ext: /tmp/ruby/install/trunk/lib/ruby/gems/3.4.0+0 I, [2024-05-05T00:23:27.055948 #4169020] INFO -- : date 3.3.4 I, [2024-05-05T00:23:27.056500 #4169020] INFO -- : digest 3.1.1 I, [2024-05-05T00:23:27.057017 #4169020] INFO -- : etc 1.4.3 I, [2024-05-05T00:23:27.057568 #4169020] INFO -- : fcntl 1.1.0 I, [2024-05-05T00:23:27.058090 #4169020] INFO -- : fiddle 1.1.3 I, [2024-05-05T00:23:27.058602 #4169020] INFO -- : io-console 0.7.2 I, [2024-05-05T00:23:27.059128 #4169020] INFO -- : io-nonblock 0.3.0 I, [2024-05-05T00:23:27.059761 #4169020] INFO -- : io-wait 0.3.1 I, [2024-05-05T00:23:27.060360 #4169020] INFO -- : json 2.7.2 I, [2024-05-05T00:23:27.061437 #4169020] INFO -- : openssl 3.2.0 I, [2024-05-05T00:23:27.062001 #4169020] INFO -- : pathname 0.3.0 I, [2024-05-05T00:23:27.062551 #4169020] INFO -- : psych 5.1.2 I, [2024-05-05T00:23:27.063150 #4169020] INFO -- : stringio 3.1.1 I, [2024-05-05T00:23:27.063692 #4169020] INFO -- : strscan 3.1.1 I, [2024-05-05T00:23:27.064207 #4169020] INFO -- : zlib 3.1.0 I, [2024-05-05T00:23:27.064644 #4169020] INFO -- : installing bundled gems: /tmp/ruby/install/trunk/lib/ruby/gems/3.4.0+0 I, [2024-05-05T00:23:27.065012 #4169020] INFO -- : minitest 5.22.3 I, [2024-05-05T00:23:27.072312 #4169020] INFO -- : rake 13.2.1 I, [2024-05-05T00:23:27.075705 #4169020] INFO -- : test-unit 3.6.2 I, [2024-05-05T00:23:27.080407 #4169020] INFO -- : rexml 3.2.6 I, [2024-05-05T00:23:27.083846 #4169020] INFO -- : rss 0.3.0 I, [2024-05-05T00:23:27.086877 #4169020] INFO -- : net-ftp 0.3.4 I, [2024-05-05T00:23:27.088597 #4169020] INFO -- : net-imap 0.4.10 I, [2024-05-05T00:23:27.091523 #4169020] INFO -- : net-pop 0.1.2 I, [2024-05-05T00:23:27.092460 #4169020] INFO -- : net-smtp 0.5.0 I, [2024-05-05T00:23:27.093557 #4169020] INFO -- : matrix 0.4.2 I, [2024-05-05T00:23:27.097073 #4169020] INFO -- : prime 0.1.2 I, [2024-05-05T00:23:27.102838 #4169020] INFO -- : rbs 3.4.4 I, [2024-05-05T00:23:27.125800 #4169020] INFO -- : typeprof 0.21.11 I, [2024-05-05T00:23:27.128448 #4169020] INFO -- : debug 1.9.2 I, [2024-05-05T00:23:27.131185 #4169020] INFO -- : racc 1.7.3 I, [2024-05-05T00:23:27.133722 #4169020] INFO -- : mutex_m 0.2.0 I, [2024-05-05T00:23:27.134893 #4169020] INFO -- : getoptlong 0.2.1 I, [2024-05-05T00:23:27.136717 #4169020] INFO -- : base64 0.2.0 I, [2024-05-05T00:23:27.137789 #4169020] INFO -- : bigdecimal 3.1.7 I, [2024-05-05T00:23:27.139890 #4169020] INFO -- : observer 0.1.2 I, [2024-05-05T00:23:27.141422 #4169020] INFO -- : abbrev 0.1.2 I, [2024-05-05T00:23:27.142473 #4169020] INFO -- : resolv-replace 0.1.1 I, [2024-05-05T00:23:27.143807 #4169020] INFO -- : rinda 0.2.0 I, [2024-05-05T00:23:27.145039 #4169020] INFO -- : drb 2.2.1 I, [2024-05-05T00:23:27.146659 #4169020] INFO -- : nkf 0.2.0 I, [2024-05-05T00:23:27.149291 #4169020] INFO -- : syslog 0.1.2 I, [2024-05-05T00:23:27.150856 #4169020] INFO -- : csv 3.3.0 I, [2024-05-05T00:23:27.152968 #4169020] INFO -- : installing bundled gem cache: /tmp/ruby/install/trunk/lib/ruby/gems/3.4.0+0/cache I, [2024-05-05T00:23:27.154418 #4169020] INFO -- : skipped bundled gems: I, [2024-05-05T00:23:27.154434 #4169020] INFO -- : power_assert-2.0.4dev.gem not found in bundled_gems I, [2024-05-05T00:23:27.157782 #4169020] INFO -- : $$$[end] "make install -j20" exit with 0. I, [2024-05-05T00:23:27.157961 #4169020] INFO -- : $$$[beg] make yes-btest TESTOPTS='-q -j20' I, [2024-05-05T00:23:33.728204 #4169020] INFO -- : PASS all 1935 tests E, [2024-05-05T00:23:33.733783 #4169020] ERROR -- : I, [2024-05-05T00:23:33.734050 #4169020] INFO -- : $$$[end] "make yes-btest TESTOPTS='-q -j20'" exit with 0. I, [2024-05-05T00:23:33.734172 #4169020] INFO -- : $$$[beg] make yes-test-basic TESTS='-j20' I, [2024-05-05T00:23:33.794003 #4169020] INFO -- : BASERUBY = /usr/bin/ruby --disable=gems I, [2024-05-05T00:23:33.794038 #4169020] INFO -- : CC = gcc I, [2024-05-05T00:23:33.794047 #4169020] INFO -- : LD = ld I, [2024-05-05T00:23:33.794051 #4169020] INFO -- : LDSHARED = gcc -shared I, [2024-05-05T00:23:33.794056 #4169020] INFO -- : CFLAGS = -O3 -fno-fast-math -ggdb3 -Wall -Wextra -Wdeprecated-declarations -Wdiv-by-zero -Wduplicated-cond -Wimplicit-function-declaration -Wimplicit-int -Wpointer-arith -Wwrite-strings -Wold-style-definition -Wimplicit-fallthrough=0 -Wmissing-noreturn -Wno-cast-function-type -Wno-constant-logical-operand -Wno-long-long -Wno-missing-field-initializers -Wno-overlength-strings -Wno-packed-bitfield-compat -Wno-parentheses-equality -Wno-self-assign -Wno-tautological-compare -Wno-unused-parameter -Wno-unused-value -Wsuggest-attribute=format -Wsuggest-attribute=noreturn -Wunused-variable -Wmisleading-indentation -Wundef -fPIC I, [2024-05-05T00:23:33.794064 #4169020] INFO -- : XCFLAGS = -U_FORTIFY_SOURCE -D_FORTIFY_SOURCE=2 -fstack-protector-strong -fno-strict-overflow -fvisibility=hidden -fexcess-precision=standard -DRUBY_EXPORT -I. -I.ext/include/x86_64-linux -I/tmp/ruby/src/trunk/include -I/tmp/ruby/src/trunk -I/tmp/ruby/src/trunk/prism -I/tmp/ruby/src/trunk/enc/unicode/15.0.0 I, [2024-05-05T00:23:33.794068 #4169020] INFO -- : CPPFLAGS = I, [2024-05-05T00:23:33.794072 #4169020] INFO -- : DLDFLAGS = -Wl,--compress-debug-sections=zlib -Wl,-soname,libruby.so.3.4 -fstack-protector-strong I, [2024-05-05T00:23:33.794076 #4169020] INFO -- : SOLIBS = -lz -lrt -lrt -lgmp -ldl -lcrypt -lm -lpthread I, [2024-05-05T00:23:33.794080 #4169020] INFO -- : LANG = en_US.UTF-8 I, [2024-05-05T00:23:33.794083 #4169020] INFO -- : LC_ALL = I, [2024-05-05T00:23:33.794087 #4169020] INFO -- : LC_CTYPE = I, [2024-05-05T00:23:33.794091 #4169020] INFO -- : MFLAGS = I, [2024-05-05T00:23:33.794094 #4169020] INFO -- : RUSTC = no I, [2024-05-05T00:23:33.794098 #4169020] INFO -- : YJIT_RUSTC_ARGS = --crate-name=yjit --crate-type=staticlib --edition=2021 -g -C lto=thin -C opt-level=3 -C overflow-checks=on '--out-dir=/tmp/ruby/build/trunk/yjit/target/release/' /tmp/ruby/src/trunk/yjit/src/lib.rs I, [2024-05-05T00:23:33.794736 #4169020] INFO -- : gcc (Ubuntu 11.4.0-1ubuntu1~22.04) 11.4.0 I, [2024-05-05T00:23:33.794756 #4169020] INFO -- : Copyright (C) 2021 Free Software Foundation, Inc. I, [2024-05-05T00:23:33.794762 #4169020] INFO -- : This is free software; see the source for copying conditions. There is NO I, [2024-05-05T00:23:33.794771 #4169020] INFO -- : warranty; not even for MERCHANTABILITY or FITNESS FOR A PARTICULAR PURPOSE. I, [2024-05-05T00:23:33.794775 #4169020] INFO -- : I, [2024-05-05T00:23:33.899722 #4169020] INFO -- : Checking leaked global symbols...none I, [2024-05-05T00:23:33.940986 #4169020] INFO -- : /tmp/ruby/src/trunk/basictest/test.rb:assignment ....................................................................................................................................................................................................................................................................................................................................................................................OK 372 I, [2024-05-05T00:23:33.941054 #4169020] INFO -- : /tmp/ruby/src/trunk/basictest/test.rb:condition ..OK 2 I, [2024-05-05T00:23:33.941063 #4169020] INFO -- : /tmp/ruby/src/trunk/basictest/test.rb:if/unless ...OK 3 I, [2024-05-05T00:23:33.941071 #4169020] INFO -- : /tmp/ruby/src/trunk/basictest/test.rb:case .....OK 5 I, [2024-05-05T00:23:33.941302 #4169020] INFO -- : /tmp/ruby/src/trunk/basictest/test.rb:while/until ........OK 8 I, [2024-05-05T00:23:33.941372 #4169020] INFO -- : /tmp/ruby/src/trunk/basictest/test.rb:exception ..........OK 10 I, [2024-05-05T00:23:33.941715 #4169020] INFO -- : /tmp/ruby/src/trunk/basictest/test.rb:array .......................................OK 39 I, [2024-05-05T00:23:33.941863 #4169020] INFO -- : /tmp/ruby/src/trunk/basictest/test.rb:hash ...........................OK 27 I, [2024-05-05T00:23:33.942778 #4169020] INFO -- : /tmp/ruby/src/trunk/basictest/test.rb:iterator ...........................................................................................................OK 107 I, [2024-05-05T00:23:33.943187 #4169020] INFO -- : /tmp/ruby/src/trunk/basictest/test.rb:float ................................................................................OK 80 I, [2024-05-05T00:23:33.944280 #4169020] INFO -- : /tmp/ruby/src/trunk/basictest/test.rb:bignum ...............................OK 31 I, [2024-05-05T00:23:33.945173 #4169020] INFO -- : /tmp/ruby/src/trunk/basictest/test.rb:string & char ..............................................................OK 62 I, [2024-05-05T00:23:33.945226 #4169020] INFO -- : /tmp/ruby/src/trunk/basictest/test.rb:assignment ..........OK 10 I, [2024-05-05T00:23:33.945267 #4169020] INFO -- : /tmp/ruby/src/trunk/basictest/test.rb:call ......OK 6 I, [2024-05-05T00:23:33.945339 #4169020] INFO -- : /tmp/ruby/src/trunk/basictest/test.rb:proc .........OK 9 I, [2024-05-05T00:23:34.045585 #4169020] INFO -- : /tmp/ruby/src/trunk/basictest/test.rb:signal ..OK 2 I, [2024-05-05T00:23:34.046391 #4169020] INFO -- : /tmp/ruby/src/trunk/basictest/test.rb:eval ...........................OK 27 I, [2024-05-05T00:23:34.148341 #4169020] INFO -- : /tmp/ruby/src/trunk/basictest/test.rb:system ........OK 8 I, [2024-05-05T00:23:34.148407 #4169020] INFO -- : /tmp/ruby/src/trunk/basictest/test.rb:const .....OK 5 I, [2024-05-05T00:23:34.148428 #4169020] INFO -- : /tmp/ruby/src/trunk/basictest/test.rb:clone .....OK 5 I, [2024-05-05T00:23:34.148547 #4169020] INFO -- : /tmp/ruby/src/trunk/basictest/test.rb:marshal ....OK 4 I, [2024-05-05T00:23:34.148602 #4169020] INFO -- : /tmp/ruby/src/trunk/basictest/test.rb:pack ....OK 4 I, [2024-05-05T00:23:34.148617 #4169020] INFO -- : /tmp/ruby/src/trunk/basictest/test.rb:math ..OK 2 I, [2024-05-05T00:23:34.148666 #4169020] INFO -- : /tmp/ruby/src/trunk/basictest/test.rb:struct ......OK 6 I, [2024-05-05T00:23:34.148756 #4169020] INFO -- : /tmp/ruby/src/trunk/basictest/test.rb:variable ............OK 12 I, [2024-05-05T00:23:34.148778 #4169020] INFO -- : /tmp/ruby/src/trunk/basictest/test.rb:trace ...OK 3 I, [2024-05-05T00:23:34.148832 #4169020] INFO -- : /tmp/ruby/src/trunk/basictest/test.rb:defined? ............OK 12 I, [2024-05-05T00:23:34.148873 #4169020] INFO -- : /tmp/ruby/src/trunk/basictest/test.rb:alias ......OK 6 I, [2024-05-05T00:23:34.149226 #4169020] INFO -- : /tmp/ruby/src/trunk/basictest/test.rb:path .......................OK 23 I, [2024-05-05T00:23:34.183187 #4169020] INFO -- : /tmp/ruby/src/trunk/basictest/test.rb:gc ....OK 4 I, [2024-05-05T00:23:34.185582 #4169020] INFO -- : I, [2024-05-05T00:23:34.185610 #4169020] INFO -- : test succeeded I, [2024-05-05T00:23:34.186988 #4169020] INFO -- : $$$[end] "make yes-test-basic TESTS='-j20'" exit with 0. I, [2024-05-05T00:23:34.187151 #4169020] INFO -- : $$$[beg] make yes-test-all TESTOPTS='--stderr-on-failure' TESTS='-j20' I, [2024-05-05T00:23:34.274528 #4169020] INFO -- : BASERUBY = /usr/bin/ruby --disable=gems I, [2024-05-05T00:23:34.274574 #4169020] INFO -- : CC = gcc I, [2024-05-05T00:23:34.274580 #4169020] INFO -- : LD = ld I, [2024-05-05T00:23:34.274585 #4169020] INFO -- : LDSHARED = gcc -shared I, [2024-05-05T00:23:34.274589 #4169020] INFO -- : CFLAGS = -O3 -fno-fast-math -ggdb3 -Wall -Wextra -Wdeprecated-declarations -Wdiv-by-zero -Wduplicated-cond -Wimplicit-function-declaration -Wimplicit-int -Wpointer-arith -Wwrite-strings -Wold-style-definition -Wimplicit-fallthrough=0 -Wmissing-noreturn -Wno-cast-function-type -Wno-constant-logical-operand -Wno-long-long -Wno-missing-field-initializers -Wno-overlength-strings -Wno-packed-bitfield-compat -Wno-parentheses-equality -Wno-self-assign -Wno-tautological-compare -Wno-unused-parameter -Wno-unused-value -Wsuggest-attribute=format -Wsuggest-attribute=noreturn -Wunused-variable -Wmisleading-indentation -Wundef -fPIC I, [2024-05-05T00:23:34.274593 #4169020] INFO -- : XCFLAGS = -U_FORTIFY_SOURCE -D_FORTIFY_SOURCE=2 -fstack-protector-strong -fno-strict-overflow -fvisibility=hidden -fexcess-precision=standard -DRUBY_EXPORT -I. -I.ext/include/x86_64-linux -I/tmp/ruby/src/trunk/include -I/tmp/ruby/src/trunk -I/tmp/ruby/src/trunk/prism -I/tmp/ruby/src/trunk/enc/unicode/15.0.0 I, [2024-05-05T00:23:34.274597 #4169020] INFO -- : CPPFLAGS = I, [2024-05-05T00:23:34.274601 #4169020] INFO -- : DLDFLAGS = -Wl,--compress-debug-sections=zlib -Wl,-soname,libruby.so.3.4 -fstack-protector-strong I, [2024-05-05T00:23:34.274604 #4169020] INFO -- : SOLIBS = -lz -lrt -lrt -lgmp -ldl -lcrypt -lm -lpthread I, [2024-05-05T00:23:34.274608 #4169020] INFO -- : LANG = en_US.UTF-8 I, [2024-05-05T00:23:34.274611 #4169020] INFO -- : LC_ALL = I, [2024-05-05T00:23:34.274615 #4169020] INFO -- : LC_CTYPE = I, [2024-05-05T00:23:34.274618 #4169020] INFO -- : MFLAGS = I, [2024-05-05T00:23:34.274622 #4169020] INFO -- : RUSTC = no I, [2024-05-05T00:23:34.274627 #4169020] INFO -- : YJIT_RUSTC_ARGS = --crate-name=yjit --crate-type=staticlib --edition=2021 -g -C lto=thin -C opt-level=3 -C overflow-checks=on '--out-dir=/tmp/ruby/build/trunk/yjit/target/release/' /tmp/ruby/src/trunk/yjit/src/lib.rs I, [2024-05-05T00:23:34.275306 #4169020] INFO -- : gcc (Ubuntu 11.4.0-1ubuntu1~22.04) 11.4.0 I, [2024-05-05T00:23:34.275326 #4169020] INFO -- : Copyright (C) 2021 Free Software Foundation, Inc. I, [2024-05-05T00:23:34.275332 #4169020] INFO -- : This is free software; see the source for copying conditions. There is NO I, [2024-05-05T00:23:34.275336 #4169020] INFO -- : warranty; not even for MERCHANTABILITY or FITNESS FOR A PARTICULAR PURPOSE. I, [2024-05-05T00:23:34.275339 #4169020] INFO -- : I, [2024-05-05T00:23:34.277099 #4169020] INFO -- : generating enc.mk I, [2024-05-05T00:23:34.395539 #4169020] INFO -- : making enc I, [2024-05-05T00:23:34.412910 #4169020] INFO -- : make[1]: Entering directory '/tmp/ruby/build/trunk' I, [2024-05-05T00:23:34.412939 #4169020] INFO -- : make[1]: Nothing to be done for 'enc'. I, [2024-05-05T00:23:34.412947 #4169020] INFO -- : make[1]: Leaving directory '/tmp/ruby/build/trunk' I, [2024-05-05T00:23:34.413658 #4169020] INFO -- : making srcs under enc I, [2024-05-05T00:23:34.443824 #4169020] INFO -- : make[1]: Entering directory '/tmp/ruby/build/trunk' I, [2024-05-05T00:23:34.443848 #4169020] INFO -- : make[1]: Nothing to be done for 'srcs'. I, [2024-05-05T00:23:34.443855 #4169020] INFO -- : make[1]: Leaving directory '/tmp/ruby/build/trunk' I, [2024-05-05T00:23:34.444694 #4169020] INFO -- : generating transdb.h I, [2024-05-05T00:23:34.539303 #4169020] INFO -- : transdb.h unchanged I, [2024-05-05T00:23:34.540579 #4169020] INFO -- : making trans I, [2024-05-05T00:23:34.574299 #4169020] INFO -- : make[1]: Entering directory '/tmp/ruby/build/trunk' I, [2024-05-05T00:23:34.574320 #4169020] INFO -- : make[1]: Nothing to be done for 'trans'. I, [2024-05-05T00:23:34.574326 #4169020] INFO -- : make[1]: Leaving directory '/tmp/ruby/build/trunk' I, [2024-05-05T00:23:34.575041 #4169020] INFO -- : making encs I, [2024-05-05T00:23:34.613010 #4169020] INFO -- : make[1]: Entering directory '/tmp/ruby/build/trunk' I, [2024-05-05T00:23:34.613035 #4169020] INFO -- : make[1]: Nothing to be done for 'encs'. I, [2024-05-05T00:23:34.613043 #4169020] INFO -- : make[1]: Leaving directory '/tmp/ruby/build/trunk' I, [2024-05-05T00:23:34.614914 #4169020] INFO -- : generating makefiles ext/configure-ext.mk I, [2024-05-05T00:23:34.642525 #4169020] INFO -- : ext/configure-ext.mk updated I, [2024-05-05T00:23:34.644831 #4169020] INFO -- : make[1]: Entering directory '/tmp/ruby/build/trunk' I, [2024-05-05T00:23:36.003212 #4169020] INFO -- : make[1]: Leaving directory '/tmp/ruby/build/trunk' I, [2024-05-05T00:23:36.003903 #4169020] INFO -- : generating makefile exts.mk I, [2024-05-05T00:23:36.040458 #4169020] INFO -- : exts.mk unchanged I, [2024-05-05T00:23:36.044964 #4169020] INFO -- : make[1]: Entering directory '/tmp/ruby/build/trunk' I, [2024-05-05T00:23:36.256102 #4169020] INFO -- : make[2]: Entering directory '/tmp/ruby/build/trunk/ext/coverage' I, [2024-05-05T00:23:36.258911 #4169020] INFO -- : make[2]: Leaving directory '/tmp/ruby/build/trunk/ext/coverage' I, [2024-05-05T00:23:36.262711 #4169020] INFO -- : make[2]: Entering directory '/tmp/ruby/build/trunk/ext/date' I, [2024-05-05T00:23:36.265886 #4169020] INFO -- : make[2]: Leaving directory '/tmp/ruby/build/trunk/ext/date' I, [2024-05-05T00:23:36.268105 #4169020] INFO -- : make[2]: Entering directory '/tmp/ruby/build/trunk/ext/digest' I, [2024-05-05T00:23:36.273492 #4169020] INFO -- : make[2]: Leaving directory '/tmp/ruby/build/trunk/ext/digest' I, [2024-05-05T00:23:36.289008 #4169020] INFO -- : make[2]: Entering directory '/tmp/ruby/build/trunk/ext/digest/sha2' I, [2024-05-05T00:23:36.291959 #4169020] INFO -- : make[2]: Leaving directory '/tmp/ruby/build/trunk/ext/digest/sha2' I, [2024-05-05T00:23:36.304604 #4169020] INFO -- : make[2]: Entering directory '/tmp/ruby/build/trunk/ext/fiddle' I, [2024-05-05T00:23:36.310997 #4169020] INFO -- : make[2]: Leaving directory '/tmp/ruby/build/trunk/ext/fiddle' I, [2024-05-05T00:23:36.313822 #4169020] INFO -- : make[2]: Entering directory '/tmp/ruby/build/trunk/ext/io/console' I, [2024-05-05T00:23:36.316565 #4169020] INFO -- : make[2]: Leaving directory '/tmp/ruby/build/trunk/ext/io/console' I, [2024-05-05T00:23:36.324159 #4169020] INFO -- : make[2]: Entering directory '/tmp/ruby/build/trunk/ext/json' I, [2024-05-05T00:23:36.330431 #4169020] INFO -- : make[2]: Leaving directory '/tmp/ruby/build/trunk/ext/json' I, [2024-05-05T00:23:36.339520 #4169020] INFO -- : make[2]: Entering directory '/tmp/ruby/build/trunk/ext/monitor' I, [2024-05-05T00:23:36.341947 #4169020] INFO -- : make[2]: Leaving directory '/tmp/ruby/build/trunk/ext/monitor' I, [2024-05-05T00:23:36.346101 #4169020] INFO -- : make[2]: Entering directory '/tmp/ruby/build/trunk/ext/objspace' I, [2024-05-05T00:23:36.349778 #4169020] INFO -- : make[2]: Leaving directory '/tmp/ruby/build/trunk/ext/objspace' I, [2024-05-05T00:23:36.361796 #4169020] INFO -- : make[2]: Entering directory '/tmp/ruby/build/trunk/ext/openssl' I, [2024-05-05T00:23:36.374839 #4169020] INFO -- : make[2]: Leaving directory '/tmp/ruby/build/trunk/ext/openssl' I, [2024-05-05T00:23:36.377732 #4169020] INFO -- : make[2]: Entering directory '/tmp/ruby/build/trunk/ext/pathname' I, [2024-05-05T00:23:36.380241 #4169020] INFO -- : make[2]: Leaving directory '/tmp/ruby/build/trunk/ext/pathname' I, [2024-05-05T00:23:36.384338 #4169020] INFO -- : make[2]: Entering directory '/tmp/ruby/build/trunk/ext/psych' I, [2024-05-05T00:23:36.399091 #4169020] INFO -- : make[2]: Leaving directory '/tmp/ruby/build/trunk/ext/psych' I, [2024-05-05T00:23:36.402153 #4169020] INFO -- : make[2]: Entering directory '/tmp/ruby/build/trunk/ext/pty' I, [2024-05-05T00:23:36.404697 #4169020] INFO -- : make[2]: Leaving directory '/tmp/ruby/build/trunk/ext/pty' I, [2024-05-05T00:23:36.414160 #4169020] INFO -- : make[2]: Entering directory '/tmp/ruby/build/trunk/ext/ripper' I, [2024-05-05T00:23:36.419179 #4169020] INFO -- : make[2]: Leaving directory '/tmp/ruby/build/trunk/ext/ripper' I, [2024-05-05T00:23:36.420680 #4169020] INFO -- : make[2]: Entering directory '/tmp/ruby/build/trunk/ext/rubyvm' I, [2024-05-05T00:23:36.422763 #4169020] INFO -- : make[2]: Leaving directory '/tmp/ruby/build/trunk/ext/rubyvm' I, [2024-05-05T00:23:36.430537 #4169020] INFO -- : make[2]: Entering directory '/tmp/ruby/build/trunk/ext/socket' I, [2024-05-05T00:23:36.436863 #4169020] INFO -- : make[2]: Leaving directory '/tmp/ruby/build/trunk/ext/socket' I, [2024-05-05T00:23:36.447846 #4169020] INFO -- : make[2]: Entering directory '/tmp/ruby/build/trunk/.bundle/gems/bigdecimal-3.1.7/ext/bigdecimal' I, [2024-05-05T00:23:36.470346 #4169020] INFO -- : make[2]: Leaving directory '/tmp/ruby/build/trunk/.bundle/gems/bigdecimal-3.1.7/ext/bigdecimal' I, [2024-05-05T00:23:36.472261 #4169020] INFO -- : make[2]: Entering directory '/tmp/ruby/build/trunk/.bundle/gems/debug-1.9.2/ext/debug' I, [2024-05-05T00:23:36.494278 #4169020] INFO -- : make[2]: Leaving directory '/tmp/ruby/build/trunk/.bundle/gems/debug-1.9.2/ext/debug' I, [2024-05-05T00:23:36.496214 #4169020] INFO -- : make[2]: Entering directory '/tmp/ruby/build/trunk/.bundle/gems/nkf-0.2.0/ext/nkf' I, [2024-05-05T00:23:36.517972 #4169020] INFO -- : make[2]: Leaving directory '/tmp/ruby/build/trunk/.bundle/gems/nkf-0.2.0/ext/nkf' I, [2024-05-05T00:23:36.519863 #4169020] INFO -- : make[2]: Entering directory '/tmp/ruby/build/trunk/.bundle/gems/racc-1.7.3/ext/racc/cparse' I, [2024-05-05T00:23:36.541331 #4169020] INFO -- : make[2]: Leaving directory '/tmp/ruby/build/trunk/.bundle/gems/racc-1.7.3/ext/racc/cparse' I, [2024-05-05T00:23:36.543772 #4169020] INFO -- : make[2]: Entering directory '/tmp/ruby/build/trunk/.bundle/gems/rbs-3.4.4/ext/rbs_extension' I, [2024-05-05T00:23:36.565261 #4169020] INFO -- : make[2]: Leaving directory '/tmp/ruby/build/trunk/.bundle/gems/rbs-3.4.4/ext/rbs_extension' I, [2024-05-05T00:23:36.567105 #4169020] INFO -- : make[2]: Entering directory '/tmp/ruby/build/trunk/.bundle/gems/syslog-0.1.2/ext/syslog' I, [2024-05-05T00:23:36.588856 #4169020] INFO -- : make[2]: Leaving directory '/tmp/ruby/build/trunk/.bundle/gems/syslog-0.1.2/ext/syslog' I, [2024-05-05T00:23:36.612306 #4169020] INFO -- : make[2]: Entering directory '/tmp/ruby/build/trunk' I, [2024-05-05T00:23:36.677065 #4169020] INFO -- : make[2]: 'ruby' is up to date. I, [2024-05-05T00:23:36.677101 #4169020] INFO -- : make[2]: Leaving directory '/tmp/ruby/build/trunk' I, [2024-05-05T00:23:36.677417 #4169020] INFO -- : make[1]: Leaving directory '/tmp/ruby/build/trunk' I, [2024-05-05T00:23:36.680951 #4169020] INFO -- : make[1]: Entering directory '/tmp/ruby/build/trunk' I, [2024-05-05T00:23:36.680973 #4169020] INFO -- : make[1]: Nothing to be done for 'note'. I, [2024-05-05T00:23:36.680979 #4169020] INFO -- : make[1]: Leaving directory '/tmp/ruby/build/trunk' I, [2024-05-05T00:23:36.758539 #4169020] INFO -- : Run options: I, [2024-05-05T00:23:36.758581 #4169020] INFO -- : --seed=1642 I, [2024-05-05T00:23:36.758587 #4169020] INFO -- : "--ruby=./miniruby -I/tmp/ruby/src/trunk/lib -I. -I.ext/common /tmp/ruby/src/trunk/tool/runruby.rb --extout=.ext -- --disable-gems" I, [2024-05-05T00:23:36.758598 #4169020] INFO -- : --excludes-dir=/tmp/ruby/src/trunk/test/.excludes I, [2024-05-05T00:23:36.758606 #4169020] INFO -- : --name=!/memory_leak/ I, [2024-05-05T00:23:36.758610 #4169020] INFO -- : --stderr-on-failure I, [2024-05-05T00:23:36.758614 #4169020] INFO -- : -j20 I, [2024-05-05T00:23:36.758617 #4169020] INFO -- : I, [2024-05-05T00:23:36.758621 #4169020] INFO -- : # Running tests: I, [2024-05-05T00:23:36.758625 #4169020] INFO -- : I, [2024-05-05T00:23:36.905999 #4169020] INFO -- : [ 1/885] 16493=test_random_formatter I, [2024-05-05T00:23:36.906075 #4169020] INFO -- : [ 2/885] 16480=test_helper I, [2024-05-05T00:23:36.906155 #4169020] INFO -- : [ 3/885] 16476=test_jaro_winkler I, [2024-05-05T00:23:36.906370 #4169020] INFO -- : [ 4/885] 16478=test_gem_request_set_gem_dependency_api I, [2024-05-05T00:23:36.906403 #4169020] INFO -- : [ 5/885] 16479=test_ast I, [2024-05-05T00:23:36.909366 #4169020] INFO -- : [ 6/885] 16477=test_lambda I, [2024-05-05T00:23:36.909652 #4169020] INFO -- : [ 7/885] 16491=test_webauthn_listener I, [2024-05-05T00:23:36.910053 #4169020] INFO -- : [ 8/885] 16492=test_x509store I, [2024-05-05T00:23:36.910078 #4169020] INFO -- : [ 9/885] 16489=test_rdoc_code_object I, [2024-05-05T00:23:36.912210 #4169020] INFO -- : [ 10/885] 16490=test_update I, [2024-05-05T00:23:36.920327 #4169020] INFO -- : [ 11/885] 16490=test_fips I, [2024-05-05T00:23:36.925445 #4169020] INFO -- : [ 12/885] 16493=test_x509name I, [2024-05-05T00:23:36.945694 #4169020] INFO -- : [ 13/885] 16476=test_transcode I, [2024-05-05T00:23:36.945800 #4169020] INFO -- : [ 14/885] 16481=json_generator_test I, [2024-05-05T00:23:36.945901 #4169020] INFO -- : [ 15/885] 16482=test_eval I, [2024-05-05T00:23:36.946007 #4169020] INFO -- : [ 16/885] 16483=test_enumerable I, [2024-05-05T00:23:36.946127 #4169020] INFO -- : [ 17/885] 16484=test_config I, [2024-05-05T00:23:36.946325 #4169020] INFO -- : [ 18/885] 16485=test_gem_resolver_vendor_set I, [2024-05-05T00:23:36.946355 #4169020] INFO -- : [ 19/885] 16486=test_gem_resolver_api_set I, [2024-05-05T00:23:36.946661 #4169020] INFO -- : [ 20/885] 16487=test_gem_safe_marshal I, [2024-05-05T00:23:36.948496 #4169020] INFO -- : [ 21/885] 16488=test_rdoc_ri_paths I, [2024-05-05T00:23:36.972009 #4169020] INFO -- : [ 22/885] 16493=test_ensured I, [2024-05-05T00:23:36.977589 #4169020] INFO -- : [ 23/885] 16483=library_symbols_test I, [2024-05-05T00:23:36.981754 #4169020] INFO -- : [ 24/885] 16495=test_locale I, [2024-05-05T00:23:36.993067 #4169020] INFO -- : [ 25/885] 16494=test_addr I, [2024-05-05T00:23:36.999029 #4169020] INFO -- : [ 26/885] 16480=test_ts I, [2024-05-05T00:23:37.028034 #4169020] INFO -- : [ 27/885] 16494=test_helper I, [2024-05-05T00:23:37.038114 #4169020] INFO -- : [ 28/885] 16477=test_erb_command I, [2024-05-05T00:23:37.038179 #4169020] INFO -- : [ 29/885] 16494=test_encoding I, [2024-05-05T00:23:37.052615 #4169020] INFO -- : [ 30/885] 16493=test_gem_uri_formatter I, [2024-05-05T00:23:37.065375 #4169020] INFO -- : [ 31/885] 16481=test_project_sanity I, [2024-05-05T00:23:37.067614 #4169020] INFO -- : [ 32/885] 16483=test_range I, [2024-05-05T00:23:37.099658 #4169020] INFO -- : [ 33/885] 16495=test_constant I, [2024-05-05T00:23:37.111423 #4169020] INFO -- : [ 34/885] 16477=test_pty I, [2024-05-05T00:23:37.146107 #4169020] INFO -- : [ 35/885] 16486=test_dup I, [2024-05-05T00:23:37.160356 #4169020] INFO -- : [ 36/885] 16488=command_line_test I, [2024-05-05T00:23:37.177317 #4169020] INFO -- : [ 37/885] 16485=test_udp I, [2024-05-05T00:23:37.185075 #4169020] INFO -- : [ 38/885] 16476=test_data_error I, [2024-05-05T00:23:37.186700 #4169020] INFO -- : [ 39/885] 16485=bom_test I, [2024-05-05T00:23:37.194373 #4169020] INFO -- : [ 40/885] 16492=test_file I, [2024-05-05T00:23:37.209075 #4169020] INFO -- : [ 41/885] 16493=test_force_exit I, [2024-05-05T00:23:37.226743 #4169020] INFO -- : Leaked file descriptor: WebauthnListenerTest#test_wait_for_otp_code_options_request: 9 : # I, [2024-05-05T00:23:37.229008 #4169020] INFO -- : [ 42/885] 16488=unescape_test I, [2024-05-05T00:23:37.248517 #4169020] INFO -- : [ 43/885] 16482=test_ostruct I, [2024-05-05T00:23:37.249061 #4169020] INFO -- : [ 44/885] 16476=static_inspect_test I, [2024-05-05T00:23:37.286803 #4169020] INFO -- : [ 45/885] 16485=errors_test I, [2024-05-05T00:23:37.289974 #4169020] INFO -- : COMMAND PID USER FD TYPE DEVICE SIZE/OFF NODE NAME I, [2024-05-05T00:23:37.290024 #4169020] INFO -- : ruby 16491 ko1 9u IPv4 1974930426 0t0 TCP localhost:41195->localhost:41644 (CLOSE_WAIT) I, [2024-05-05T00:23:37.303996 #4169020] INFO -- : [ 46/885] 16494=test_gem_commands_check_command I, [2024-05-05T00:23:37.316728 #4169020] INFO -- : [ 47/885] 16481=test_regexp I, [2024-05-05T00:23:37.316792 #4169020] INFO -- : Closed file descriptor: WebauthnListenerTest#test_wait_for_otp_code_get_follows_options: 9 I, [2024-05-05T00:23:37.317716 #4169020] INFO -- : [ 48/885] 16493=test_rdoc_markup_document I, [2024-05-05T00:23:37.318271 #4169020] INFO -- : [ 49/885] 16490=test_integer_comb I, [2024-05-05T00:23:37.318407 #4169020] INFO -- : [ 50/885] 16491=test_tmpdir I, [2024-05-05T00:23:37.320232 #4169020] INFO -- : [ 51/885] 16486=test_vm_dump I, [2024-05-05T00:23:37.320652 #4169020] INFO -- : [ 52/885] 16486=test_pointer I, [2024-05-05T00:23:37.326681 #4169020] INFO -- : [ 53/885] 16476=test_func I, [2024-05-05T00:23:37.368731 #4169020] INFO -- : [ 54/885] 16485=test_big5 I, [2024-05-05T00:23:37.376128 #4169020] INFO -- : [ 55/885] 16489=test_ractor I, [2024-05-05T00:23:37.388517 #4169020] INFO -- : [ 56/885] 16478=test_type I, [2024-05-05T00:23:37.389280 #4169020] INFO -- : [ 57/885] 16485=test_signedness I, [2024-05-05T00:23:37.396643 #4169020] INFO -- : [ 58/885] 16478=test_tsort I, [2024-05-05T00:23:37.404256 #4169020] INFO -- : [ 59/885] 16478=test_rdoc_rd_block_parser I, [2024-05-05T00:23:37.424544 #4169020] INFO -- : [ 60/885] 16491=test_timeout I, [2024-05-05T00:23:37.432390 #4169020] INFO -- : [ 61/885] 16484=test_ossl I, [2024-05-05T00:23:37.439347 #4169020] INFO -- : [ 62/885] 16489=test_normalize I, [2024-05-05T00:23:37.441294 #4169020] INFO -- : [ 63/885] 16489=test_change_word I, [2024-05-05T00:23:37.449380 #4169020] INFO -- : [ 64/885] 16489=compiler_test I, [2024-05-05T00:23:37.453753 #4169020] INFO -- : [ 65/885] 16482=test_flip I, [2024-05-05T00:23:37.474027 #4169020] INFO -- : [ 66/885] 16482=test_sleep I, [2024-05-05T00:23:37.480936 #4169020] INFO -- : [ 67/885] 16491=test_date_arith I, [2024-05-05T00:23:37.486848 #4169020] INFO -- : [ 68/885] 16491=test_ruby_lex I, [2024-05-05T00:23:37.497811 #4169020] INFO -- : [ 69/885] 16493=test_object I, [2024-05-05T00:23:37.517663 #4169020] INFO -- : [ 70/885] 16489=test_gem_local_remote_options I, [2024-05-05T00:23:37.533794 #4169020] INFO -- : [ 71/885] 16494=test_gem_gemcutter_utilities I, [2024-05-05T00:23:37.550112 #4169020] INFO -- : [ 72/885] 16486=test_basicinstructions I, [2024-05-05T00:23:37.607865 #4169020] INFO -- : [ 73/885] 16478=test_gem_command_manager I, [2024-05-05T00:23:37.613736 #4169020] INFO -- : [ 74/885] 16486=test_key_actor_emacs I, [2024-05-05T00:23:37.619102 #4169020] INFO -- : [ 75/885] 16480=test_arithmetic_sequence I, [2024-05-05T00:23:37.634581 #4169020] INFO -- : [ 76/885] 16480=test_object I, [2024-05-05T00:23:37.654612 #4169020] INFO -- : [ 77/885] 16487=test_cgi_header I, [2024-05-05T00:23:37.668590 #4169020] INFO -- : [ 78/885] 16491=heredoc_dedent_test I, [2024-05-05T00:23:37.669490 #4169020] INFO -- : [ 79/885] 16480=version_test I, [2024-05-05T00:23:37.670985 #4169020] INFO -- : [ 80/885] 16487=test_gem_resolver_lock_set I, [2024-05-05T00:23:37.673366 #4169020] INFO -- : [ 81/885] 16480=test_not I, [2024-05-05T00:23:37.675226 #4169020] INFO -- : [ 82/885] 16480=test_import I, [2024-05-05T00:23:37.687993 #4169020] INFO -- : [ 83/885] 16487=test_rdoc_parser_markdown I, [2024-05-05T00:23:37.709871 #4169020] INFO -- : [ 84/885] 16477=test_file_exhaustive I, [2024-05-05T00:23:37.728249 #4169020] INFO -- : [ 85/885] 16483=test_gem_update_suggestion I, [2024-05-05T00:23:37.737087 #4169020] INFO -- : [ 86/885] 16489=test_files_test I, [2024-05-05T00:23:37.745389 #4169020] INFO -- : [ 87/885] 16486=test_logger I, [2024-05-05T00:23:37.758820 #4169020] INFO -- : [ 88/885] 16486=test_win32ole_method I, [2024-05-05T00:23:37.759068 #4169020] INFO -- : [ 89/885] 16486=test_delete I, [2024-05-05T00:23:37.763326 #4169020] INFO -- : [ 90/885] 16486=test_class_name_check I, [2024-05-05T00:23:37.778852 #4169020] INFO -- : [ 91/885] 16486=test_keyword I, [2024-05-05T00:23:37.782874 #4169020] INFO -- : [ 92/885] 16491=test_fd_setsize I, [2024-05-05T00:23:37.784355 #4169020] INFO -- : [ 93/885] 16491=test_continuation I, [2024-05-05T00:23:37.791515 #4169020] INFO -- : [ 94/885] 16491=test_weakkeymap I, [2024-05-05T00:23:37.812929 #4169020] INFO -- : [ 95/885] 16478=test_gem_commands_push_command I, [2024-05-05T00:23:37.841645 #4169020] INFO -- : [ 96/885] 16489=test_numhash I, [2024-05-05T00:23:37.843918 #4169020] INFO -- : [ 97/885] 16489=test_pkey_rsa I, [2024-05-05T00:23:37.863707 #4169020] INFO -- : [ 98/885] 16487=test_gem_platform I, [2024-05-05T00:23:37.875107 #4169020] INFO -- : [ 99/885] 16476=test_date_strptime I, [2024-05-05T00:23:37.886082 #4169020] INFO -- : [100/885] 16494=test_gem_package_task I, [2024-05-05T00:23:37.889165 #4169020] INFO -- : [101/885] 16494=test_placearg I, [2024-05-05T00:23:37.928903 #4169020] INFO -- : [102/885] 16483=test_rdoc_markup_hard_break I, [2024-05-05T00:23:37.939244 #4169020] INFO -- : [103/885] 16493=test_lazy_enumerator I, [2024-05-05T00:23:37.953421 #4169020] INFO -- : [104/885] 16491=test_enc_associate I, [2024-05-05T00:23:37.956740 #4169020] INFO -- : [105/885] 16487=test_unix I, [2024-05-05T00:23:38.001073 #4169020] INFO -- : [106/885] 16480=test_coder I, [2024-05-05T00:23:38.003457 #4169020] INFO -- : [107/885] 16487=test_symbol I, [2024-05-05T00:23:38.009603 #4169020] INFO -- : [108/885] 16480=test_gem_commands_pristine_command I, [2024-05-05T00:23:38.024089 #4169020] INFO -- : [109/885] 16494=test_context I, [2024-05-05T00:23:38.029197 #4169020] INFO -- : [110/885] 16476=test_nofree I, [2024-05-05T00:23:38.031169 #4169020] INFO -- : [111/885] 16476=ruby_api_test I, [2024-05-05T00:23:38.041550 #4169020] INFO -- : [112/885] 16483=test_find_executable I, [2024-05-05T00:23:38.062219 #4169020] INFO -- : [113/885] 16483=test_function_entry I, [2024-05-05T00:23:38.064938 #4169020] INFO -- : [114/885] 16483=test_gem_resolver_requirement_list I, [2024-05-05T00:23:38.069709 #4169020] INFO -- : [115/885] 16483=test_arith_seq_beg_len_step I, [2024-05-05T00:23:38.085415 #4169020] INFO -- : [116/885] 16489=test_pkcs7 I, [2024-05-05T00:23:38.143880 #4169020] INFO -- : [117/885] 16483=test_mailto I, [2024-05-05T00:23:38.163934 #4169020] INFO -- : [118/885] 16483=test_coderange I, [2024-05-05T00:23:38.167580 #4169020] INFO -- : [119/885] 16483=location_test I, [2024-05-05T00:23:38.185448 #4169020] INFO -- : [120/885] 16494=test_symbol I, [2024-05-05T00:23:38.191242 #4169020] INFO -- : [121/885] 16494=test_http_request I, [2024-05-05T00:23:38.211861 #4169020] INFO -- : [122/885] 16476=test_gem_source_fetch_problem I, [2024-05-05T00:23:38.222010 #4169020] INFO -- : [123/885] 16483=json_generic_object_test I, [2024-05-05T00:23:38.239800 #4169020] INFO -- : [124/885] 16483=test_rdoc_generator_darkfish I, [2024-05-05T00:23:38.247375 #4169020] INFO -- : [125/885] 16494=test_rdoc_comment I, [2024-05-05T00:23:38.249946 #4169020] INFO -- : [126/885] 16489=test_resize I, [2024-05-05T00:23:38.253718 #4169020] INFO -- : [127/885] 16489=test_error_highlight I, [2024-05-05T00:23:38.328582 #4169020] INFO -- : [128/885] 16488=test_cgi_multipart I, [2024-05-05T00:23:38.339101 #4169020] INFO -- : [129/885] 16478=test_word I, [2024-05-05T00:23:38.342797 #4169020] INFO -- : [130/885] 16478=test_gem_commands_cleanup_command I, [2024-05-05T00:23:38.399201 #4169020] INFO -- : [131/885] 16486=test_numeric I, [2024-05-05T00:23:38.416562 #4169020] INFO -- : [132/885] 16493=test_member I, [2024-05-05T00:23:38.418571 #4169020] INFO -- : [133/885] 16493=test_ractor_compatibility I, [2024-05-05T00:23:38.423638 #4169020] INFO -- : [134/885] 16486=test_dir I, [2024-05-05T00:23:38.427923 #4169020] INFO -- : [135/885] 16476=format_errors_test I, [2024-05-05T00:23:38.443027 #4169020] INFO -- : [136/885] 16476=test_date_ractor I, [2024-05-05T00:23:38.470506 #4169020] INFO -- : [137/885] 16494=test_gem_console_ui I, [2024-05-05T00:23:38.477320 #4169020] INFO -- : [138/885] 16494=test_autoconf I, [2024-05-05T00:23:38.483381 #4169020] INFO -- : [139/885] 16494=test_eval I, [2024-05-05T00:23:38.486822 #4169020] INFO -- : [140/885] 16494=test_ipaddr I, [2024-05-05T00:23:38.513794 #4169020] INFO -- : [141/885] 16494=test_history I, [2024-05-05T00:23:38.531721 #4169020] INFO -- : [142/885] 16494=test_mixed_unicode_escapes I, [2024-05-05T00:23:38.532788 #4169020] INFO -- : [143/885] 16494=test_rdoc_markup_to_ansi I, [2024-05-05T00:23:38.550430 #4169020] INFO -- : [144/885] 16488=test_win32ole_variant I, [2024-05-05T00:23:38.551625 #4169020] INFO -- : [145/885] 16491=test_gem_resolver_api_specification I, [2024-05-05T00:23:38.556898 #4169020] INFO -- : [146/885] 16483=test_merge_keys I, [2024-05-05T00:23:38.559017 #4169020] INFO -- : [147/885] 16488=test_rdoc_extend I, [2024-05-05T00:23:38.564594 #4169020] INFO -- : [148/885] 16483=test_threadgroup I, [2024-05-05T00:23:38.567032 #4169020] INFO -- : [149/885] 16494=test_gem_specification I, [2024-05-05T00:23:38.621923 #4169020] INFO -- : [150/885] 16491=test_enum I, [2024-05-05T00:23:38.634571 #4169020] INFO -- : [151/885] 16476=test_have_macro I, [2024-05-05T00:23:38.644218 #4169020] INFO -- : [152/885] 16488=test_resolve_symbol I, [2024-05-05T00:23:38.676540 #4169020] INFO -- : [153/885] 16489=test_complex2 I, [2024-05-05T00:23:38.685602 #4169020] INFO -- : [154/885] 16489=test_gem_package I, [2024-05-05T00:23:38.696324 #4169020] INFO -- : [155/885] 16486=test_rdoc_generator_json_index I, [2024-05-05T00:23:38.708419 #4169020] INFO -- : [156/885] 16488=test_time_tz I, [2024-05-05T00:23:38.724128 #4169020] INFO -- : [157/885] 16478=test_win32ole_event I, [2024-05-05T00:23:38.728574 #4169020] INFO -- : [158/885] 16478=ractor_test I, [2024-05-05T00:23:38.768149 #4169020] INFO -- : [159/885] 16488=test_trace I, [2024-05-05T00:23:38.777286 #4169020] INFO -- : [160/885] 16488=test_win32ole_variable I, [2024-05-05T00:23:38.779783 #4169020] INFO -- : [161/885] 16488=test_arity I, [2024-05-05T00:23:38.783630 #4169020] INFO -- : [162/885] 16488=test_stringio I, [2024-05-05T00:23:38.824474 #4169020] INFO -- : [163/885] 16478=test_io_wait_uncommon I, [2024-05-05T00:23:38.832814 #4169020] INFO -- : [164/885] 16478=test_bignum I, [2024-05-05T00:23:38.852688 #4169020] INFO -- : [165/885] 16486=test_rdoc_class_module I, [2024-05-05T00:23:38.874104 #4169020] INFO -- : [166/885] 16493=test_gem_ci_detector I, [2024-05-05T00:23:38.878157 #4169020] INFO -- : [167/885] 16493=test_ancdata I, [2024-05-05T00:23:38.886253 #4169020] INFO -- : [168/885] 16493=test_singleton_function I, [2024-05-05T00:23:38.889173 #4169020] INFO -- : [169/885] 16493=test_rb_str_dup I, [2024-05-05T00:23:38.891387 #4169020] INFO -- : [170/885] 16493=test_reline_key I, [2024-05-05T00:23:38.896593 #4169020] INFO -- : [171/885] 16493=test_marshal I, [2024-05-05T00:23:38.938567 #4169020] INFO -- : [172/885] 16488=test_unicode_normalize I, [2024-05-05T00:23:38.949169 #4169020] INFO -- : [173/885] 16478=test_weakref I, [2024-05-05T00:23:39.085838 #4169020] INFO -- : [174/885] 16478=test_nonblock I, [2024-05-05T00:23:39.101232 #4169020] INFO -- : [175/885] 16478=test_alias I, [2024-05-05T00:23:39.105841 #4169020] INFO -- : [176/885] 16476=test_timeout I, [2024-05-05T00:23:39.219108 #4169020] INFO -- : [177/885] 16489=test_ractor I, [2024-05-05T00:23:39.240923 #4169020] INFO -- : [178/885] 16478=test_my_integer I, [2024-05-05T00:23:39.243728 #4169020] INFO -- : [179/885] 16478=json_ext_parser_test I, [2024-05-05T00:23:39.247253 #4169020] INFO -- : [180/885] 16478=test_thread I, [2024-05-05T00:23:39.255657 #4169020] INFO -- : [181/885] 16486=test_debugger_integration I, [2024-05-05T00:23:39.268760 #4169020] INFO -- : [182/885] 16486=test_rendering I, [2024-05-05T00:23:39.276791 #4169020] INFO -- : [183/885] 16486=test_ssl I, [2024-05-05T00:23:39.398036 #4169020] INFO -- : [184/885] 16480=test_ractor I, [2024-05-05T00:23:39.413398 #4169020] INFO -- : [185/885] 16493=test_gem_commands_open_command I, [2024-05-05T00:23:39.417398 #4169020] INFO -- : [186/885] 16480=test_dns I, [2024-05-05T00:23:39.516734 #4169020] INFO -- : [187/885] 16493=test_gem_source_lock I, [2024-05-05T00:23:39.519571 #4169020] INFO -- : [188/885] 16491=test_gem I, [2024-05-05T00:23:39.568267 #4169020] INFO -- : [189/885] 16483=parse_stream_test I, [2024-05-05T00:23:39.571267 #4169020] INFO -- : [190/885] 16489=test_registry I, [2024-05-05T00:23:39.571323 #4169020] INFO -- : [191/885] 16489=test_parser I, [2024-05-05T00:23:39.573746 #4169020] INFO -- : [192/885] 16483=test_cgi_core I, [2024-05-05T00:23:39.587970 #4169020] INFO -- : [193/885] 16489=test_gem_commands_setup_command I, [2024-05-05T00:23:39.588787 #4169020] INFO -- : [194/885] 16483=test_integer I, [2024-05-05T00:23:39.589687 #4169020] INFO -- : [195/885] 16493=desugar_compiler_test I, [2024-05-05T00:23:39.626314 #4169020] INFO -- : [196/885] 16495=test_dryrun I, [2024-05-05T00:23:39.646575 #4169020] INFO -- : [197/885] 16495=test_rdoc_attr I, [2024-05-05T00:23:39.651107 #4169020] INFO -- : [198/885] 16493=test_env I, [2024-05-05T00:23:39.658767 #4169020] INFO -- : [199/885] 16483=test_gem_resolver_git_specification I, [2024-05-05T00:23:39.762832 #4169020] INFO -- : [200/885] 16495=test_object_references I, [2024-05-05T00:23:39.773371 #4169020] INFO -- : [201/885] 16486=test_usrmarshal I, [2024-05-05T00:23:39.786210 #4169020] INFO -- : [202/885] 16495=test_nextafter I, [2024-05-05T00:23:39.836797 #4169020] INFO -- : [203/885] 16487=test_capacity I, [2024-05-05T00:23:39.841391 #4169020] INFO -- : [204/885] 16487=test_stat I, [2024-05-05T00:23:39.844423 #4169020] INFO -- : [205/885] 16495=test_gem_request_set_lockfile_tokenizer I, [2024-05-05T00:23:39.844809 #4169020] INFO -- : [206/885] 16487=test_have_func I, [2024-05-05T00:23:39.858912 #4169020] INFO -- : [207/885] 16483=test_call I, [2024-05-05T00:23:39.888163 #4169020] INFO -- : [208/885] 16480=test_https_proxy I, [2024-05-05T00:23:39.910011 #4169020] INFO -- : [209/885] 16485=test_rubygems I, [2024-05-05T00:23:39.931838 #4169020] INFO -- : [210/885] 16480=test_cgi_modruby I, [2024-05-05T00:23:39.942108 #4169020] INFO -- : [211/885] 16476=test_integer I, [2024-05-05T00:23:39.946791 #4169020] INFO -- : [212/885] 16480=test_super I, [2024-05-05T00:23:39.976438 #4169020] INFO -- : [213/885] 16486=test_rubyoptions I, [2024-05-05T00:23:39.990237 #4169020] INFO -- : [214/885] 16483=test_files_test_1 I, [2024-05-05T00:23:40.045217 #4169020] INFO -- : [215/885] 16495=test_set I, [2024-05-05T00:23:40.054523 #4169020] INFO -- : [216/885] 16485=test_struct I, [2024-05-05T00:23:40.069863 #4169020] INFO -- : [217/885] 16495=test_gem_path_support I, [2024-05-05T00:23:40.079133 #4169020] INFO -- : [218/885] 16490=test_mutex I, [2024-05-05T00:23:40.087506 #4169020] INFO -- : [219/885] 16495=test_x509req I, [2024-05-05T00:23:40.206864 #4169020] INFO -- : [220/885] 16489=test_rdoc_rd_inline I, [2024-05-05T00:23:40.211133 #4169020] INFO -- : [221/885] 16489=test_allocation I, [2024-05-05T00:23:40.274558 #4169020] INFO -- : [222/885] 16495=test_div I, [2024-05-05T00:23:40.275963 #4169020] INFO -- : [223/885] 16495=test_win32ole_variant_m I, [2024-05-05T00:23:40.279136 #4169020] INFO -- : [224/885] 16495=test_engine I, [2024-05-05T00:23:40.281197 #4169020] INFO -- : [225/885] 16495=test_key_error I, [2024-05-05T00:23:40.286491 #4169020] INFO -- : [226/885] 16495=test_insns_leaf I, [2024-05-05T00:23:40.291222 #4169020] INFO -- : [227/885] 16495=test_serialize_subclasses I, [2024-05-05T00:23:40.292903 #4169020] INFO -- : [228/885] 16495=test_color_printer I, [2024-05-05T00:23:40.298772 #4169020] INFO -- : [229/885] 16495=test_deprecated I, [2024-05-05T00:23:40.303691 #4169020] INFO -- : [230/885] 16495=test_pkg_config I, [2024-05-05T00:23:40.315106 #4169020] INFO -- : [231/885] 16495=test_cparser I, [2024-05-05T00:23:40.415050 #4169020] INFO -- : [232/885] 16485=test_struct I, [2024-05-05T00:23:40.434642 #4169020] INFO -- : [233/885] 16485=magic_comment_test I, [2024-05-05T00:23:40.443984 #4169020] INFO -- : [234/885] 16485=test_rdoc_markup_to_html_snippet I, [2024-05-05T00:23:40.604587 #4169020] INFO -- : [235/885] 16480=fuzzer_test I, [2024-05-05T00:23:40.612016 #4169020] INFO -- : [236/885] 16480=test_sexp I, [2024-05-05T00:23:40.627906 #4169020] INFO -- : [237/885] 16480=test_rdoc_markup_include I, [2024-05-05T00:23:40.639422 #4169020] INFO -- : [238/885] 16494=test_variable I, [2024-05-05T00:23:40.644061 #4169020] INFO -- : [239/885] 16485=test_win32ole_variant_outarg I, [2024-05-05T00:23:40.648347 #4169020] INFO -- : [240/885] 16485=test_dln I, [2024-05-05T00:23:40.653330 #4169020] INFO -- : [241/885] 16485=test_gem_source_subpath_problem I, [2024-05-05T00:23:40.735907 #4169020] INFO -- : [242/885] 16495=json_common_interface_test I, [2024-05-05T00:23:40.748863 #4169020] INFO -- : [243/885] 16485=test_nomethod_error I, [2024-05-05T00:23:40.750207 #4169020] INFO -- : [244/885] 16495=json_parser_test I, [2024-05-05T00:23:40.755064 #4169020] INFO -- : [245/885] 16485=memsize_test I, [2024-05-05T00:23:40.757524 #4169020] INFO -- : [246/885] 16485=test_config I, [2024-05-05T00:23:40.765521 #4169020] INFO -- : [247/885] 16494=test_new I, [2024-05-05T00:23:40.767728 #4169020] INFO -- : [248/885] 16494=test_cipher I, [2024-05-05T00:23:40.786649 #4169020] INFO -- : [249/885] 16485=test_gem_security_signer I, [2024-05-05T00:23:40.787353 #4169020] INFO -- : [250/885] 16480=test_storage I, [2024-05-05T00:23:40.795072 #4169020] INFO -- : [251/885] 16495=test_gem_resolver_git_set I, [2024-05-05T00:23:40.808940 #4169020] INFO -- : [252/885] 16480=test_digest_extend I, [2024-05-05T00:23:40.819249 #4169020] INFO -- : [253/885] 16480=test_iterator I, [2024-05-05T00:23:40.822328 #4169020] INFO -- : [254/885] 16494=test_string I, [2024-05-05T00:23:40.824548 #4169020] INFO -- : [255/885] 16494=test_omap I, [2024-05-05T00:23:40.828775 #4169020] INFO -- : [256/885] 16494=test_debug I, [2024-05-05T00:23:40.835301 #4169020] INFO -- : [257/885] 16494=test_memory_view I, [2024-05-05T00:23:40.856078 #4169020] INFO -- : [258/885] 16494=pattern_test I, [2024-05-05T00:23:40.884514 #4169020] INFO -- : [259/885] 16485=test_shellwords I, [2024-05-05T00:23:40.890537 #4169020] INFO -- : [260/885] 16485=test_rdoc_rd I, [2024-05-05T00:23:40.907293 #4169020] INFO -- : [261/885] 16485=test_cgi_session I, [2024-05-05T00:23:40.915784 #4169020] INFO -- : [262/885] 16480=test_rdoc_top_level I, [2024-05-05T00:23:40.931017 #4169020] INFO -- : [263/885] 16485=test_metaclass I, [2024-05-05T00:23:40.936717 #4169020] INFO -- : [264/885] 16485=test_fixnum I, [2024-05-05T00:23:40.950438 #4169020] INFO -- : [265/885] 16485=test_signal I, [2024-05-05T00:23:40.961880 #4169020] INFO -- : [266/885] 16494=test_x509crl I, [2024-05-05T00:23:41.084748 #4169020] INFO -- : [267/885] 16495=test_process I, [2024-05-05T00:23:41.100944 #4169020] INFO -- : [268/885] 16495=test_input_method I, [2024-05-05T00:23:41.132697 #4169020] INFO -- : [269/885] 16495=test_windows_1252 I, [2024-05-05T00:23:41.138690 #4169020] INFO -- : [270/885] 16495=test_float I, [2024-05-05T00:23:41.145093 #4169020] INFO -- : [271/885] 16487=test_require I, [2024-05-05T00:23:41.153919 #4169020] INFO -- : [272/885] 16494=test_cgi_cookie I, [2024-05-05T00:23:41.160539 #4169020] INFO -- : [273/885] 16494=test_regex_casefold I, [2024-05-05T00:23:41.213052 #4169020] INFO -- : [274/885] 16490=test_refinement I, [2024-05-05T00:23:41.280184 #4169020] INFO -- : [275/885] 16480=test_gem_commands_signout_command I, [2024-05-05T00:23:41.289876 #4169020] INFO -- : [276/885] 16480=test_gem_source_git I, [2024-05-05T00:23:41.410287 #4169020] INFO -- : [277/885] 16491=test_dir_m17n I, [2024-05-05T00:23:41.500040 #4169020] INFO -- : [278/885] 16494=test_gem_resolver_installer_set I, [2024-05-05T00:23:41.670959 #4169020] INFO -- : [279/885] 16494=test_rational I, [2024-05-05T00:23:41.681706 #4169020] INFO -- : [280/885] 16494=test_rational2 I, [2024-05-05T00:23:41.696139 #4169020] INFO -- : [281/885] 16494=test_assembler I, [2024-05-05T00:23:41.707493 #4169020] INFO -- : [282/885] 16494=test_spell_checker I, [2024-05-05T00:23:41.715302 #4169020] INFO -- : [283/885] 16494=test_propertyputref I, [2024-05-05T00:23:41.718386 #4169020] INFO -- : [284/885] 16494=attribute_write_test I, [2024-05-05T00:23:41.724929 #4169020] INFO -- : [285/885] 16494=test_erb I, [2024-05-05T00:23:41.779082 #4169020] INFO -- : [286/885] 16480=test_x509ext I, [2024-05-05T00:23:41.786044 #4169020] INFO -- : [287/885] 16480=test_gem_source_installed I, [2024-05-05T00:23:41.795955 #4169020] INFO -- : [288/885] 16480=test_len I, [2024-05-05T00:23:41.800575 #4169020] INFO -- : [289/885] 16480=test_yield_block I, [2024-05-05T00:23:41.802573 #4169020] INFO -- : [290/885] 16480=test_gem_commands_cert_command I, [2024-05-05T00:23:41.807248 #4169020] INFO -- : [291/885] 16494=test_completion I, [2024-05-05T00:23:42.107912 #4169020] INFO -- : [292/885] 16477=test_abi I, [2024-05-05T00:23:42.322812 #4169020] INFO -- : [293/885] 16477=test_provider I, [2024-05-05T00:23:42.346081 #4169020] INFO -- : [294/885] 16494=test_rdoc_parser_simple I, [2024-05-05T00:23:42.378524 #4169020] INFO -- : [295/885] 16494=test_load I, [2024-05-05T00:23:42.380419 #4169020] INFO -- : [296/885] 16494=test_yamldbm I, [2024-05-05T00:23:42.385574 #4169020] INFO -- : [297/885] 16494=test_gem_commands_rebuild_command I, [2024-05-05T00:23:42.426827 #4169020] INFO -- : [298/885] 16494=test_https I, [2024-05-05T00:23:42.459976 #4169020] INFO -- : [299/885] 16493=test_gem_ext_builder I, [2024-05-05T00:23:42.482529 #4169020] INFO -- : [300/885] 16482=test_evaluation I, [2024-05-05T00:23:42.486701 #4169020] INFO -- : [301/885] 16482=test_gem_dependency_list I, [2024-05-05T00:23:42.500507 #4169020] INFO -- : [302/885] 16495=test_benchmark I, [2024-05-05T00:23:42.567770 #4169020] INFO -- : [303/885] 16476=test_win32ole_method_event I, [2024-05-05T00:23:42.569865 #4169020] INFO -- : [304/885] 16483=test_nesting_parser I, [2024-05-05T00:23:42.575022 #4169020] INFO -- : [305/885] 16476=test_gem_source I, [2024-05-05T00:23:42.682167 #4169020] INFO -- : [306/885] 16483=test_scalar_scanner I, [2024-05-05T00:23:42.693232 #4169020] INFO -- : [307/885] 16483=test_gem_commands_outdated_command I, [2024-05-05T00:23:42.703744 #4169020] INFO -- : [308/885] 16477=test_array I, [2024-05-05T00:23:42.738136 #4169020] INFO -- : [309/885] 16488=test_helper_method I, [2024-05-05T00:23:42.748401 #4169020] INFO -- : [310/885] 16483=test_gem_package_tar_writer I, [2024-05-05T00:23:42.753348 #4169020] INFO -- : [311/885] 16489=test_boolean I, [2024-05-05T00:23:42.766430 #4169020] INFO -- : [312/885] 16489=test_stringify_symbols I, [2024-05-05T00:23:42.780079 #4169020] INFO -- : [313/885] 16489=test_instrumentation_api I, [2024-05-05T00:23:42.801770 #4169020] INFO -- : [314/885] 16482=integer_parse_test I, [2024-05-05T00:23:42.825809 #4169020] INFO -- : [315/885] 16494=test_configuration I, [2024-05-05T00:23:42.837729 #4169020] INFO -- : [316/885] 16491=test_rubyvm I, [2024-05-05T00:23:42.842984 #4169020] INFO -- : [317/885] 16491=test_monitor I, [2024-05-05T00:23:42.864416 #4169020] INFO -- : [318/885] 16488=test_buffered_io I, [2024-05-05T00:23:42.871713 #4169020] INFO -- : [319/885] 16483=test_whileuntil I, [2024-05-05T00:23:42.871977 #4169020] INFO -- : [320/885] 16482=test_rdoc_generator_markup I, [2024-05-05T00:23:42.880867 #4169020] INFO -- : [321/885] 16483=test_method_name_check I, [2024-05-05T00:23:42.900685 #4169020] INFO -- : [322/885] 16483=test_arith_seq_extract I, [2024-05-05T00:23:42.901279 #4169020] INFO -- : [323/885] 16483=test_parser I, [2024-05-05T00:23:42.924133 #4169020] INFO -- : [324/885] 16476=constant_path_node_test I, [2024-05-05T00:23:42.925870 #4169020] INFO -- : [325/885] 16483=test_ssl I, [2024-05-05T00:23:42.945889 #4169020] INFO -- : [326/885] 16476=test_gem_ext_cargo_builder I, [2024-05-05T00:23:42.957676 #4169020] INFO -- : [327/885] 16476=test_module I, [2024-05-05T00:23:42.973957 #4169020] INFO -- : [328/885] 16494=test_gem_request_set I, [2024-05-05T00:23:43.007948 #4169020] INFO -- : [329/885] 16488=test_ssl_session I, [2024-05-05T00:23:43.036945 #4169020] INFO -- : [330/885] 16482=test_lexer I, [2024-05-05T00:23:43.049155 #4169020] INFO -- : [331/885] 16485=test_thread_cv I, [2024-05-05T00:23:43.051213 #4169020] INFO -- : [332/885] 16491=test_gem_uri I, [2024-05-05T00:23:43.070447 #4169020] INFO -- : [333/885] 16482=test_key_event_record I, [2024-05-05T00:23:43.088551 #4169020] INFO -- : [334/885] 16491=test_notimplement I, [2024-05-05T00:23:43.099073 #4169020] INFO -- : [335/885] 16491=test_random I, [2024-05-05T00:23:43.108625 #4169020] INFO -- : [336/885] 16491=test_gem_resolver_vendor_specification I, [2024-05-05T00:23:43.131645 #4169020] INFO -- : [337/885] 16482=test_gem_commands_update_command I, [2024-05-05T00:23:43.140717 #4169020] INFO -- : [338/885] 16491=test_filter I, [2024-05-05T00:23:43.163901 #4169020] INFO -- : [339/885] 16491=test_gem_gem_runner I, [2024-05-05T00:23:43.221666 #4169020] INFO -- : [340/885] 16491=test_data I, [2024-05-05T00:23:43.223477 #4169020] INFO -- : [341/885] 16491=static_literals_test I, [2024-05-05T00:23:43.229277 #4169020] INFO -- : [342/885] 16491=test_rdoc_method_attr I, [2024-05-05T00:23:43.274484 #4169020] INFO -- : [343/885] 16492=test_enumerator I, [2024-05-05T00:23:43.275610 #4169020] INFO -- : [344/885] 16492=test_rdoc_parser_changelog I, [2024-05-05T00:23:43.284584 #4169020] INFO -- : [345/885] 16480=parameters_signature_test I, [2024-05-05T00:23:43.289362 #4169020] INFO -- : [346/885] 16480=test_koi8 I, [2024-05-05T00:23:43.294330 #4169020] INFO -- : [347/885] 16480=test_unicode I, [2024-05-05T00:23:43.332740 #4169020] INFO -- : [348/885] 16494=test_rdoc_generator_pot I, [2024-05-05T00:23:43.334164 #4169020] INFO -- : [349/885] 16494=test_path I, [2024-05-05T00:23:43.340710 #4169020] INFO -- : [350/885] 16480=redundant_return_test I, [2024-05-05T00:23:43.343659 #4169020] INFO -- : [351/885] 16494=test_case_mapping I, [2024-05-05T00:23:43.344967 #4169020] INFO -- : [352/885] 16480=test_bn I, [2024-05-05T00:23:43.350320 #4169020] INFO -- : [353/885] 16494=test_win32ole_param_event I, [2024-05-05T00:23:43.352893 #4169020] INFO -- : [354/885] 16494=test_http I, [2024-05-05T00:23:43.355840 #4169020] INFO -- : [355/885] 16480=test_addrinfo I, [2024-05-05T00:23:43.418861 #4169020] INFO -- : [356/885] 16480=test_tree_spell_checker I, [2024-05-05T00:23:43.468313 #4169020] INFO -- : [357/885] 16492=test_date_compat I, [2024-05-05T00:23:43.471147 #4169020] INFO -- : [358/885] 16492=test_rdoc_markup_to_html I, [2024-05-05T00:23:43.477160 #4169020] INFO -- : [359/885] 16480=test_bug-14834 I, [2024-05-05T00:23:43.541393 #4169020] INFO -- : [360/885] 16493=test_terminfo I, [2024-05-05T00:23:43.542439 #4169020] INFO -- : [361/885] 16493=test_compile_prism I, [2024-05-05T00:23:43.550103 #4169020] INFO -- : [362/885] 16492=json_encoding_test I, [2024-05-05T00:23:43.561476 #4169020] INFO -- : [363/885] 16480=test_color I, [2024-05-05T00:23:43.564813 #4169020] INFO -- : [364/885] 16492=test_key_stroke I, [2024-05-05T00:23:43.597390 #4169020] INFO -- : [365/885] 16491=test_set_len I, [2024-05-05T00:23:43.601883 #4169020] INFO -- : [366/885] 16491=test_httpresponses I, [2024-05-05T00:23:43.644243 #4169020] INFO -- : [367/885] 16492=test_encoding I, [2024-05-05T00:23:43.652107 #4169020] INFO -- : [368/885] 16480=test_httpheader I, [2024-05-05T00:23:43.660625 #4169020] INFO -- : [369/885] 16491=test_gem_resolver_local_specification I, [2024-05-05T00:23:43.669666 #4169020] INFO -- : [370/885] 16480=test_rdoc_ri_driver I, [2024-05-05T00:23:43.677461 #4169020] INFO -- : [371/885] 16492=test_install I, [2024-05-05T00:23:43.682114 #4169020] INFO -- : [372/885] 16485=test_rdoc_markup_to_label I, [2024-05-05T00:23:43.689395 #4169020] INFO -- : [373/885] 16491=test_sockopt I, [2024-05-05T00:23:43.694517 #4169020] INFO -- : [374/885] 16491=test_pair I, [2024-05-05T00:23:43.710177 #4169020] INFO -- : [375/885] 16485=test_win32ole_param I, [2024-05-05T00:23:43.714050 #4169020] INFO -- : [376/885] 16485=test_gem_commands_yank_command I, [2024-05-05T00:23:43.741434 #4169020] INFO -- : [377/885] 16487=test_document I, [2024-05-05T00:23:43.750145 #4169020] INFO -- : [378/885] 16487=test_acceptable I, [2024-05-05T00:23:43.786498 #4169020] INFO -- : [379/885] 16495=test_rdoc_generator_pot_po_entry I, [2024-05-05T00:23:43.792968 #4169020] INFO -- : [380/885] 16495=test_euc_jp I, [2024-05-05T00:23:43.797482 #4169020] INFO -- : [381/885] 16495=test_chilled I, [2024-05-05T00:23:43.800996 #4169020] INFO -- : [382/885] 16495=test_name_error_extension I, [2024-05-05T00:23:43.805166 #4169020] INFO -- : [383/885] 16495=test_rdoc_i18n_locale I, [2024-05-05T00:23:43.811713 #4169020] INFO -- : [384/885] 16495=test_human_typo I, [2024-05-05T00:23:43.815952 #4169020] INFO -- : [385/885] 16495=test_primitive I, [2024-05-05T00:23:43.821897 #4169020] INFO -- : [386/885] 16495=test_rbconfig I, [2024-05-05T00:23:43.826112 #4169020] INFO -- : [387/885] 16495=test_ractor I, [2024-05-05T00:23:43.877127 #4169020] INFO -- : [388/885] 16493=test_rdoc_servlet I, [2024-05-05T00:23:43.896881 #4169020] INFO -- : [389/885] 16487=test_gem_security I, [2024-05-05T00:23:43.897253 #4169020] INFO -- : [390/885] 16495=test_digest I, [2024-05-05T00:23:43.908183 #4169020] INFO -- : [391/885] 16495=test_bundled_ca I, [2024-05-05T00:23:43.917312 #4169020] INFO -- : [392/885] 16492=test_closure I, [2024-05-05T00:23:43.930999 #4169020] INFO -- : [393/885] 16480=test_multi_irb_commands I, [2024-05-05T00:23:43.934651 #4169020] INFO -- : [394/885] 16480=test_fiber I, [2024-05-05T00:23:43.986284 #4169020] INFO -- : [395/885] 16488=test_open3 I, [2024-05-05T00:23:44.040785 #4169020] INFO -- : [396/885] 16493=test_history I, [2024-05-05T00:23:44.051226 #4169020] INFO -- : [397/885] 16493=test_mkmf I, [2024-05-05T00:23:44.077428 #4169020] INFO -- : [398/885] 16493=test_date_marshal I, [2024-05-05T00:23:44.082096 #4169020] INFO -- : [399/885] 16493=test_delegate I, [2024-05-05T00:23:44.084507 #4169020] INFO -- : [400/885] 16492=test_popen_deadlock I, [2024-05-05T00:23:44.098320 #4169020] INFO -- : [401/885] 16493=test_exit I, [2024-05-05T00:23:44.156516 #4169020] INFO -- : [402/885] 16493=test_recursion I, [2024-05-05T00:23:44.166560 #4169020] INFO -- : [403/885] 16493=test_to_ary_concat I, [2024-05-05T00:23:44.167289 #4169020] INFO -- : [404/885] 16490=test_webauthn_listener_response I, [2024-05-05T00:23:44.207476 #4169020] INFO -- : [405/885] 16485=test_time I, [2024-05-05T00:23:44.359378 #4169020] INFO -- : [406/885] 16490=test_stream I, [2024-05-05T00:23:44.367619 #4169020] INFO -- : [407/885] 16482=test_rdoc_markup_pre_process I, [2024-05-05T00:23:44.378865 #4169020] INFO -- : [408/885] 16485=test_printf I, [2024-05-05T00:23:44.387923 #4169020] INFO -- : [409/885] 16485=test_pinned I, [2024-05-05T00:23:44.389448 #4169020] INFO -- : [410/885] 16490=reflection_test I, [2024-05-05T00:23:44.423364 #4169020] INFO -- : [411/885] 16485=test_emoji_breaks I, [2024-05-05T00:23:44.433448 #4169020] INFO -- : [412/885] 16485=test_gem_bundler_version_finder I, [2024-05-05T00:23:44.459814 #4169020] INFO -- : [413/885] 16485=test_within_pipe I, [2024-05-05T00:23:44.489465 #4169020] INFO -- : [414/885] 16482=test_help I, [2024-05-05T00:23:44.492005 #4169020] INFO -- : [415/885] 16482=test_rdoc_markup_to_bs I, [2024-05-05T00:23:44.496383 #4169020] INFO -- : [416/885] 16490=test_files_lib I, [2024-05-05T00:23:44.523611 #4169020] INFO -- : [417/885] 16482=test_gem_commands_unpack_command I, [2024-05-05T00:23:44.547990 #4169020] INFO -- : [418/885] 16485=test_beginendblock I, [2024-05-05T00:23:44.691307 #4169020] INFO -- : [419/885] 16492=test_pkey_dsa I, [2024-05-05T00:23:44.791255 #4169020] INFO -- : [420/885] 16482=test_ocsp I, [2024-05-05T00:23:44.920511 #4169020] INFO -- : [421/885] 16485=test_class I, [2024-05-05T00:23:44.924200 #4169020] INFO -- : [422/885] 16485=test_scheduler I, [2024-05-05T00:23:45.069884 #4169020] INFO -- : [423/885] 16476=test_rdoc_markup_heading I, [2024-05-05T00:23:45.079106 #4169020] INFO -- : [424/885] 16485=test_exception_at_throwing I, [2024-05-05T00:23:45.116623 #4169020] INFO -- : [425/885] 16482=test_iseq I, [2024-05-05T00:23:45.129500 #4169020] INFO -- : [426/885] 16485=test_gem_commands_server_command I, [2024-05-05T00:23:45.148759 #4169020] INFO -- : [427/885] 16485=test_io_m17n I, [2024-05-05T00:23:45.169566 #4169020] INFO -- : [428/885] 16484=test_variable_name_check I, [2024-05-05T00:23:45.177166 #4169020] INFO -- : [429/885] 16493=test_did_you_mean I, [2024-05-05T00:23:45.205430 #4169020] INFO -- : [430/885] 16484=test_cmethod I, [2024-05-05T00:23:45.206489 #4169020] INFO -- : [431/885] 16484=test_tracer I, [2024-05-05T00:23:45.212731 #4169020] INFO -- : [432/885] 16477=test_append I, [2024-05-05T00:23:45.214363 #4169020] INFO -- : [433/885] 16476=test_option I, [2024-05-05T00:23:45.215450 #4169020] INFO -- : [434/885] 16477=test_gem_commands_build_command I, [2024-05-05T00:23:45.286037 #4169020] INFO -- : [435/885] 16493=test_interned_str I, [2024-05-05T00:23:45.294726 #4169020] INFO -- : [436/885] 16493=test_case_comprehensive I, [2024-05-05T00:23:45.296201 #4169020] INFO -- : [437/885] 16484=test_stringscanner I, [2024-05-05T00:23:45.338762 #4169020] INFO -- : [438/885] 16484=test_files_sample I, [2024-05-05T00:23:45.357016 #4169020] INFO -- : [439/885] 16476=parser_test I, [2024-05-05T00:23:45.358480 #4169020] INFO -- : [440/885] 16476=test_convertible I, [2024-05-05T00:23:45.398737 #4169020] INFO -- : [441/885] 16495=test_rdoc_alias I, [2024-05-05T00:23:45.439805 #4169020] INFO -- : [442/885] 16495=test_yield I, [2024-05-05T00:23:45.532742 #4169020] INFO -- : [443/885] 16484=test_fstring I, [2024-05-05T00:23:45.581093 #4169020] INFO -- : [444/885] 16477=test_optparse I, [2024-05-05T00:23:45.630348 #4169020] INFO -- : [445/885] 16477=test_array I, [2024-05-05T00:23:45.634678 #4169020] INFO -- : [446/885] 16477=test_rat I, [2024-05-05T00:23:45.645121 #4169020] INFO -- : [447/885] 16477=test_webauthn_poller I, [2024-05-05T00:23:45.668507 #4169020] INFO -- : [448/885] 16484=test_rdoc_markup_raw I, [2024-05-05T00:23:45.761689 #4169020] INFO -- : [449/885] 16489=test_rdoc_markup_to_html_crossref I, [2024-05-05T00:23:45.776577 #4169020] INFO -- : [450/885] 16477=encoding_test I, [2024-05-05T00:23:45.783231 #4169020] INFO -- : [451/885] 16482=test_gem_resolver_best_set I, [2024-05-05T00:23:45.786908 #4169020] INFO -- : [452/885] 16484=test_typeddata I, [2024-05-05T00:23:45.848919 #4169020] INFO -- : [453/885] 16482=locals_test I, [2024-05-05T00:23:45.974822 #4169020] INFO -- : [454/885] 16477=test_rdoc_require I, [2024-05-05T00:23:46.008443 #4169020] INFO -- : [455/885] 16484=test_gem_commands_install_command I, [2024-05-05T00:23:46.134824 #4169020] INFO -- : [456/885] 16477=test_clone I, [2024-05-05T00:23:46.175717 #4169020] INFO -- : [457/885] 16489=test_readpartial I, [2024-05-05T00:23:46.215443 #4169020] INFO -- : [458/885] 16482=test_backtrace I, [2024-05-05T00:23:46.337086 #4169020] INFO -- : [459/885] 16485=test_pack I, [2024-05-05T00:23:46.358179 #4169020] INFO -- : [460/885] 16481=ruby_parser_test I, [2024-05-05T00:23:46.359220 #4169020] INFO -- : [461/885] 16485=test_io_buffer I, [2024-05-05T00:23:46.373737 #4169020] INFO -- : [462/885] 16477=test_gem_resolver_conflict I, [2024-05-05T00:23:46.375302 #4169020] INFO -- : [463/885] 16488=test_rdoc_task I, [2024-05-05T00:23:46.378084 #4169020] INFO -- : [464/885] 16488=test_rdoc_markup_indented_paragraph I, [2024-05-05T00:23:46.384933 #4169020] INFO -- : [465/885] 16477=test_utf16 I, [2024-05-05T00:23:46.394235 #4169020] INFO -- : [466/885] 16488=test_autoload I, [2024-05-05T00:23:46.420039 #4169020] INFO -- : [467/885] 16477=test_io I, [2024-05-05T00:23:46.425651 #4169020] INFO -- : [468/885] 16481=test_unicode_escape I, [2024-05-05T00:23:46.476394 #4169020] INFO -- : [469/885] 16485=test_sizeof I, [2024-05-05T00:23:46.517839 #4169020] INFO -- : [470/885] 16481=test_case I, [2024-05-05T00:23:46.548931 #4169020] INFO -- : [471/885] 16481=test_face I, [2024-05-05T00:23:46.582201 #4169020] INFO -- : [472/885] 16489=test_rendering I, [2024-05-05T00:23:46.642801 #4169020] INFO -- : [473/885] 16481=test_yaml_tree I, [2024-05-05T00:23:46.681841 #4169020] INFO -- : [474/885] 16481=test_libs I, [2024-05-05T00:23:46.708491 #4169020] INFO -- : [475/885] 16489=test_gem_commands_fetch_command I, [2024-05-05T00:23:46.715067 #4169020] INFO -- : [476/885] 16481=test_math I, [2024-05-05T00:23:46.732727 #4169020] INFO -- : [477/885] 16481=test_gc I, [2024-05-05T00:23:46.741858 #4169020] INFO -- : [478/885] 16481=test_sleep I, [2024-05-05T00:23:46.878438 #4169020] INFO -- : [479/885] 16489=test_config I, [2024-05-05T00:23:46.930935 #4169020] INFO -- : [480/885] 16489=test_gem_config_file I, [2024-05-05T00:23:46.960883 #4169020] INFO -- : [481/885] 16492=test_ripper I, [2024-05-05T00:23:47.094730 #4169020] INFO -- : [482/885] 16489=test_getopts I, [2024-05-05T00:23:47.104939 #4169020] INFO -- : [483/885] 16489=test_protocol I, [2024-05-05T00:23:47.207693 #4169020] INFO -- : [484/885] 16491=test_gem_resolver_activation_request I, [2024-05-05T00:23:47.235150 #4169020] INFO -- : [485/885] 16491=test_yjit_exit_locations I, [2024-05-05T00:23:47.237920 #4169020] INFO -- : [486/885] 16491=test_etc I, [2024-05-05T00:23:47.307413 #4169020] INFO -- : [487/885] 16492=test_system I, [2024-05-05T00:23:47.313266 #4169020] INFO -- : [488/885] 16491=test_pkcs12 I, [2024-05-05T00:23:47.413164 #4169020] INFO -- : [489/885] 16489=test_pkey_dh I, [2024-05-05T00:23:47.460530 #4169020] INFO -- : [490/885] 16495=test_bigzero I, [2024-05-05T00:23:47.464641 #4169020] INFO -- : [491/885] 16495=test_gem_package_tar_header I, [2024-05-05T00:23:47.487225 #4169020] INFO -- : [492/885] 16495=test_gem_util I, [2024-05-05T00:23:47.494480 #4169020] INFO -- : [493/885] 16482=test_iseq_load I, [2024-05-05T00:23:47.525285 #4169020] INFO -- : [494/885] 16484=test_ftp I, [2024-05-05T00:23:47.527429 #4169020] INFO -- : [495/885] 16489=test_rdoc_context_section I, [2024-05-05T00:23:47.537309 #4169020] INFO -- : [496/885] 16489=test_euc_kr I, [2024-05-05T00:23:47.549323 #4169020] INFO -- : [497/885] 16489=test_rdoc_rubygems_hook I, [2024-05-05T00:23:47.551287 #4169020] INFO -- : [498/885] 16484=test_gem_commands_query_command I, [2024-05-05T00:23:47.631760 #4169020] INFO -- : [499/885] 16489=test_method I, [2024-05-05T00:23:47.645890 #4169020] INFO -- : [500/885] 16495=test_gem_impossible_dependencies_error I, [2024-05-05T00:23:47.649466 #4169020] INFO -- : [501/885] 16495=test_array_create I, [2024-05-05T00:23:47.652676 #4169020] INFO -- : [502/885] 16495=test_pack I, [2024-05-05T00:23:47.762774 #4169020] INFO -- : [503/885] 16490=test_pattern_key_name_check I, [2024-05-05T00:23:47.766116 #4169020] INFO -- : [504/885] 16490=test_to_ruby I, [2024-05-05T00:23:47.782166 #4169020] INFO -- : [505/885] 16490=test_io I, [2024-05-05T00:23:47.883253 #4169020] INFO -- : [506/885] 16495=test_sorted_set I, [2024-05-05T00:23:47.888051 #4169020] INFO -- : [507/885] 16491=test_win32ole_type_event I, [2024-05-05T00:23:47.888486 #4169020] INFO -- : [508/885] 16491=test_emoji I, [2024-05-05T00:23:47.931287 #4169020] INFO -- : [509/885] 16491=test_ubf_async_safe I, [2024-05-05T00:23:47.935715 #4169020] INFO -- : [510/885] 16491=test_hash I, [2024-05-05T00:23:47.982623 #4169020] INFO -- : [511/885] 16484=test_gem_unsatisfiable_dependency_error I, [2024-05-05T00:23:47.992978 #4169020] INFO -- : [512/885] 16484=test_win32ole_record I, [2024-05-05T00:23:47.996800 #4169020] INFO -- : [513/885] 16484=test_cp949 I, [2024-05-05T00:23:47.999824 #4169020] INFO -- : [514/885] 16484=test_gem_commands_uninstall_command I, [2024-05-05T00:23:48.039062 #4169020] INFO -- : [515/885] 16490=test_gem_source_specific_file I, [2024-05-05T00:23:48.043420 #4169020] INFO -- : [516/885] 16478=test_foreach I, [2024-05-05T00:23:48.045901 #4169020] INFO -- : [517/885] 16478=test_condition I, [2024-05-05T00:23:48.046154 #4169020] INFO -- : [518/885] 16478=test_console_attr I, [2024-05-05T00:23:48.046456 #4169020] INFO -- : [519/885] 16495=test_summary I, [2024-05-05T00:23:48.049201 #4169020] INFO -- : [520/885] 16478=test_type_completor I, [2024-05-05T00:23:48.051857 #4169020] INFO -- : [521/885] 16478=test_io_wait I, [2024-05-05T00:23:48.097566 #4169020] INFO -- : [522/885] 16482=test_gem_commands_exec_command I, [2024-05-05T00:23:48.144412 #4169020] INFO -- : [523/885] 16490=warnings_test I, [2024-05-05T00:23:48.158514 #4169020] INFO -- : [524/885] 16495=test_kwargs I, [2024-05-05T00:23:48.160469 #4169020] INFO -- : [525/885] 16490=test_ellipsize I, [2024-05-05T00:23:48.162754 #4169020] INFO -- : [526/885] 16495=test_date_attr I, [2024-05-05T00:23:48.169704 #4169020] INFO -- : [527/885] 16495=test_workspace I, [2024-05-05T00:23:48.184269 #4169020] INFO -- : [528/885] 16490=test_weakmap I, [2024-05-05T00:23:48.238251 #4169020] INFO -- : [529/885] 16492=test_yjit I, [2024-05-05T00:23:48.238743 #4169020] INFO -- : [530/885] 16492=test_ws I, [2024-05-05T00:23:48.263594 #4169020] INFO -- : [531/885] 16492=test_gem_commands_environment_command I, [2024-05-05T00:23:48.323058 #4169020] INFO -- : [532/885] 16495=test_m17n I, [2024-05-05T00:23:48.379302 #4169020] INFO -- : [533/885] 16478=test_argf I, [2024-05-05T00:23:48.429167 #4169020] INFO -- : [534/885] 16495=test_kill_ring I, [2024-05-05T00:23:48.436390 #4169020] INFO -- : [535/885] 16495=test_ns_spki I, [2024-05-05T00:23:48.453911 #4169020] INFO -- : [536/885] 16495=test_framework I, [2024-05-05T00:23:48.457502 #4169020] INFO -- : [537/885] 16495=test_tree_builder I, [2024-05-05T00:23:48.461577 #4169020] INFO -- : [538/885] 16495=test_gem_resolver_dependency_request I, [2024-05-05T00:23:48.489214 #4169020] INFO -- : [539/885] 16495=test_hash I, [2024-05-05T00:23:48.498522 #4169020] INFO -- : [540/885] 16492=test_postponed_job I, [2024-05-05T00:23:48.511166 #4169020] INFO -- : [541/885] 16495=test_alias_and_anchor I, [2024-05-05T00:23:48.513501 #4169020] INFO -- : [542/885] 16495=test_external_new I, [2024-05-05T00:23:48.517456 #4169020] INFO -- : [543/885] 16495=test_gem_request_set_lockfile I, [2024-05-05T00:23:48.726976 #4169020] INFO -- : [544/885] 16484=test_raise_exception I, [2024-05-05T00:23:48.787863 #4169020] INFO -- : [545/885] 16481=test_protect I, [2024-05-05T00:23:48.789247 #4169020] INFO -- : [546/885] 16481=test_win32ole_typelib I, [2024-05-05T00:23:48.793789 #4169020] INFO -- : [547/885] 16481=test_show_source I, [2024-05-05T00:23:48.847407 #4169020] INFO -- : [548/885] 16481=test_set I, [2024-05-05T00:23:48.851958 #4169020] INFO -- : [549/885] 16481=test_lock_native_thread I, [2024-05-05T00:23:48.895244 #4169020] INFO -- : [550/885] 16492=test_c_struct_entry I, [2024-05-05T00:23:48.907034 #4169020] INFO -- : [551/885] 16495=test_gem_commands_stale_command I, [2024-05-05T00:23:48.925358 #4169020] INFO -- : [552/885] 16495=test_remote_fetch_error I, [2024-05-05T00:23:48.936136 #4169020] INFO -- : [553/885] 16495=test_have_library I, [2024-05-05T00:23:49.032811 #4169020] INFO -- : [554/885] 16486=test_line_editor I, [2024-05-05T00:23:49.036340 #4169020] INFO -- : [555/885] 16486=test_objspace I, [2024-05-05T00:23:49.057072 #4169020] INFO -- : [556/885] 16492=ripper_test I, [2024-05-05T00:23:49.059486 #4169020] INFO -- : [557/885] 16482=test_undef I, [2024-05-05T00:23:49.071159 #4169020] INFO -- : [558/885] 16482=test_gem_security_trust_dir I, [2024-05-05T00:23:49.109012 #4169020] INFO -- : [559/885] 16482=test_string_memory I, [2024-05-05T00:23:49.194021 #4169020] INFO -- : [560/885] 16481=comments_test I, [2024-05-05T00:23:49.198131 #4169020] INFO -- : [561/885] 16482=test_sprintf I, [2024-05-05T00:23:49.204422 #4169020] INFO -- : [562/885] 16481=test_gem_requirement I, [2024-05-05T00:23:49.331235 #4169020] INFO -- : [563/885] 16481=test_gem_resolver_installed_specification I, [2024-05-05T00:23:49.366808 #4169020] INFO -- : [564/885] 16481=test_scanner_events I, [2024-05-05T00:23:49.387151 #4169020] INFO -- : [565/885] 16484=test_gem_remote_fetcher I, [2024-05-05T00:23:49.393816 #4169020] INFO -- : [566/885] 16481=test_parse I, [2024-05-05T00:23:49.469225 #4169020] INFO -- : [567/885] 16482=test_mdns I, [2024-05-05T00:23:49.487226 #4169020] INFO -- : [568/885] 16482=test_path_to_class I, [2024-05-05T00:23:49.491048 #4169020] INFO -- : [569/885] 16492=test_gem_resolver_specification I, [2024-05-05T00:23:49.497671 #4169020] INFO -- : [570/885] 16482=test_gem_dependency I, [2024-05-05T00:23:49.526085 #4169020] INFO -- : [571/885] 16492=test_inlinecache I, [2024-05-05T00:23:49.571598 #4169020] INFO -- : [572/885] 16485=test_rdoc_markup_verbatim I, [2024-05-05T00:23:49.577785 #4169020] INFO -- : [573/885] 16485=test_complex I, [2024-05-05T00:23:49.603484 #4169020] INFO -- : [574/885] 16492=test_gem_commands_search_command I, [2024-05-05T00:23:49.611970 #4169020] INFO -- : [575/885] 16492=test_frozen_error I, [2024-05-05T00:23:49.612946 #4169020] INFO -- : [576/885] 16492=test_method_cache I, [2024-05-05T00:23:49.616483 #4169020] INFO -- : [577/885] 16492=test_gem_stub_specification I, [2024-05-05T00:23:49.629010 #4169020] INFO -- : [578/885] 16482=test_gem_ext_ext_conf_builder I, [2024-05-05T00:23:49.706395 #4169020] INFO -- : [579/885] 16485=test_ldap I, [2024-05-05T00:23:49.725530 #4169020] INFO -- : [580/885] 16485=test_emitter I, [2024-05-05T00:23:49.735530 #4169020] INFO -- : [581/885] 16485=test_resource I, [2024-05-05T00:23:49.752395 #4169020] INFO -- : [582/885] 16485=test_gem_commands_signin_command I, [2024-05-05T00:23:49.788687 #4169020] INFO -- : [583/885] 16492=test_string_processing I, [2024-05-05T00:23:49.792689 #4169020] INFO -- : [584/885] 16492=test_fileutils I, [2024-05-05T00:23:49.820556 #4169020] INFO -- : [585/885] 16485=test_econv I, [2024-05-05T00:23:49.875987 #4169020] INFO -- : [586/885] 16480=test_cesu8 I, [2024-05-05T00:23:49.882088 #4169020] INFO -- : [587/885] 16480=test_rdoc_options I, [2024-05-05T00:23:49.961895 #4169020] INFO -- : [588/885] 16495=test_gem_version I, [2024-05-05T00:23:49.983634 #4169020] INFO -- : [589/885] 16481=test_too_many_dummy_encodings I, [2024-05-05T00:23:50.006849 #4169020] INFO -- : [590/885] 16490=test_rdoc_include I, [2024-05-05T00:23:50.032447 #4169020] INFO -- : [591/885] 16495=test_reqarg I, [2024-05-05T00:23:50.041816 #4169020] INFO -- : [592/885] 16481=test_gem_commands_list_command I, [2024-05-05T00:23:50.056555 #4169020] INFO -- : [593/885] 16481=test_stack I, [2024-05-05T00:23:50.086870 #4169020] INFO -- : [594/885] 16476=test_gem_resolver_index_specification I, [2024-05-05T00:23:50.123389 #4169020] INFO -- : [595/885] 16492=test_internal_ivar I, [2024-05-05T00:23:50.127655 #4169020] INFO -- : [596/885] 16492=test_prettyprint I, [2024-05-05T00:23:50.142505 #4169020] INFO -- : [597/885] 16476=test_tracepoint I, [2024-05-05T00:23:50.156090 #4169020] INFO -- : [598/885] 16492=test_gem_commands_help_command I, [2024-05-05T00:23:50.168407 #4169020] INFO -- : [599/885] 16490=test_rdoc_markup I, [2024-05-05T00:23:50.177628 #4169020] INFO -- : [600/885] 16490=test_duplicate I, [2024-05-05T00:23:50.179192 #4169020] INFO -- : [601/885] 16490=test_utf32 I, [2024-05-05T00:23:50.183256 #4169020] INFO -- : [602/885] 16490=test_basicsocket I, [2024-05-05T00:23:50.183568 #4169020] INFO -- : [603/885] 16480=parse_comments_test I, [2024-05-05T00:23:50.188418 #4169020] INFO -- : [604/885] 16490=test_noarg I, [2024-05-05T00:23:50.193193 #4169020] INFO -- : [605/885] 16480=test_tempfile I, [2024-05-05T00:23:50.239934 #4169020] INFO -- : [606/885] 16492=test_function I, [2024-05-05T00:23:50.348597 #4169020] INFO -- : [607/885] 16495=test_queue I, [2024-05-05T00:23:50.350910 #4169020] INFO -- : [608/885] 16495=test_irb I, [2024-05-05T00:23:50.377330 #4169020] INFO -- : [609/885] 16490=test_asn1 I, [2024-05-05T00:23:50.379510 #4169020] INFO -- : [610/885] 16476=test_random I, [2024-05-05T00:23:50.385717 #4169020] INFO -- : [611/885] 16476=json_string_matching_test I, [2024-05-05T00:23:50.389117 #4169020] INFO -- : [612/885] 16487=test_load I, [2024-05-05T00:23:50.393406 #4169020] INFO -- : [613/885] 16476=test_class I, [2024-05-05T00:23:50.398309 #4169020] INFO -- : [614/885] 16487=test_rdoc_normal_class I, [2024-05-05T00:23:50.400959 #4169020] INFO -- : [615/885] 16490=test_const I, [2024-05-05T00:23:50.409407 #4169020] INFO -- : [616/885] 16490=test_gem_installer I, [2024-05-05T00:23:50.451489 #4169020] INFO -- : [617/885] 16487=test_yamlstore I, [2024-05-05T00:23:50.460820 #4169020] INFO -- : [618/885] 16487=test_date_strftime I, [2024-05-05T00:23:50.465506 #4169020] INFO -- : [619/885] 16492=test_rdoc_parser_rd I, [2024-05-05T00:23:50.483076 #4169020] INFO -- : [620/885] 16480=test_recorder I, [2024-05-05T00:23:50.488103 #4169020] INFO -- : [621/885] 16480=test_gem_source_vendor I, [2024-05-05T00:23:50.488277 #4169020] INFO -- : [622/885] 16492=test_gem_commands_owner_command I, [2024-05-05T00:23:50.495695 #4169020] INFO -- : [623/885] 16480=test_bash_completion I, [2024-05-05T00:23:50.501924 #4169020] INFO -- : [624/885] 16480=test_formatter I, [2024-05-05T00:23:50.513536 #4169020] INFO -- : [625/885] 16480=test_deprecate I, [2024-05-05T00:23:50.545857 #4169020] INFO -- : [626/885] 16480=test_rdoc_constant I, [2024-05-05T00:23:50.592925 #4169020] INFO -- : [627/885] 16488=test_file I, [2024-05-05T00:23:50.601184 #4169020] INFO -- : [628/885] 16488=test_rdoc_any_method I, [2024-05-05T00:23:50.646494 #4169020] INFO -- : [629/885] 16480=test_modify_expand I, [2024-05-05T00:23:50.648043 #4169020] INFO -- : [630/885] 16480=test_rdoc_markdown I, [2024-05-05T00:23:50.678677 #4169020] INFO -- : [631/885] 16495=test_gem_available_set I, [2024-05-05T00:23:50.717394 #4169020] INFO -- : [632/885] 16482=test_pathname I, [2024-05-05T00:23:50.758385 #4169020] INFO -- : [633/885] 16495=test_complexrational I, [2024-05-05T00:23:50.765528 #4169020] INFO -- : [634/885] 16495=test_init I, [2024-05-05T00:23:50.859114 #4169020] INFO -- : [635/885] 16480=regexp_test I, [2024-05-05T00:23:50.869181 #4169020] INFO -- : [636/885] 16480=test_gem_package_tar_reader I, [2024-05-05T00:23:50.893134 #4169020] INFO -- : [637/885] 16485=test_rdoc_encoding I, [2024-05-05T00:23:50.899421 #4169020] INFO -- : [638/885] 16480=test_coverage I, [2024-05-05T00:23:50.908442 #4169020] INFO -- : [639/885] 16487=test_find I, [2024-05-05T00:23:50.919259 #4169020] INFO -- : [640/885] 16487=test_ractor I, [2024-05-05T00:23:50.929346 #4169020] INFO -- : [641/885] 16485=test_wss I, [2024-05-05T00:23:50.932695 #4169020] INFO -- : [642/885] 16485=test_fiddle I, [2024-05-05T00:23:50.997387 #4169020] INFO -- : [643/885] 16482=test_require I, [2024-05-05T00:23:50.999854 #4169020] INFO -- : [644/885] 16485=test_cgi_util I, [2024-05-05T00:23:51.005862 #4169020] INFO -- : [645/885] 16481=test_gem_commands_contents_command I, [2024-05-05T00:23:51.029196 #4169020] INFO -- : [646/885] 16488=test_gem_ext_cmake_builder I, [2024-05-05T00:23:51.044855 #4169020] INFO -- : [647/885] 16487=test_digest I, [2024-05-05T00:23:51.046555 #4169020] INFO -- : [648/885] 16492=test_marshalable I, [2024-05-05T00:23:51.050035 #4169020] INFO -- : [649/885] 16492=test_profile_frames I, [2024-05-05T00:23:51.077431 #4169020] INFO -- : [650/885] 16481=test_pstore I, [2024-05-05T00:23:51.115269 #4169020] INFO -- : [651/885] 16481=test_cstr I, [2024-05-05T00:23:51.141209 #4169020] INFO -- : [652/885] 16495=test_enc_str_buf_cat I, [2024-05-05T00:23:51.146839 #4169020] INFO -- : [653/885] 16495=test_class2name I, [2024-05-05T00:23:51.169848 #4169020] INFO -- : [654/885] 16483=test_gbk I, [2024-05-05T00:23:51.175430 #4169020] INFO -- : [655/885] 16495=test_rdoc_parser_c I, [2024-05-05T00:23:51.181333 #4169020] INFO -- : [656/885] 16483=test_comparable I, [2024-05-05T00:23:51.186533 #4169020] INFO -- : [657/885] 16483=test_shapes I, [2024-05-05T00:23:51.187771 #4169020] INFO -- : [658/885] 16488=json_fixtures_test I, [2024-05-05T00:23:51.192205 #4169020] INFO -- : [659/885] 16483=test_io_timeout I, [2024-05-05T00:23:51.194975 #4169020] INFO -- : [660/885] 16483=test_gem_commands_sources_command I, [2024-05-05T00:23:51.202659 #4169020] INFO -- : [661/885] 16488=test_ansi_without_terminfo I, [2024-05-05T00:23:51.221740 #4169020] INFO -- : [662/885] 16488=test_ractor I, [2024-05-05T00:23:51.241325 #4169020] INFO -- : [663/885] 16488=test_euc_tw I, [2024-05-05T00:23:51.241399 #4169020] INFO -- : [664/885] 16492=test_bmethod I, [2024-05-05T00:23:51.247152 #4169020] INFO -- : [665/885] 16492=test_rdoc_markup_formatter I, [2024-05-05T00:23:51.247212 #4169020] INFO -- : [666/885] 16488=test_thread_queue I, [2024-05-05T00:23:51.254646 #4169020] INFO -- : [667/885] 16492=test_nowrite I, [2024-05-05T00:23:51.258781 #4169020] INFO -- : [668/885] 16485=test_wait I, [2024-05-05T00:23:51.274335 #4169020] INFO -- : [669/885] 16492=test_handle I, [2024-05-05T00:23:51.338844 #4169020] INFO -- : [670/885] 16485=test_forwardable I, [2024-05-05T00:23:51.349782 #4169020] INFO -- : [671/885] 16483=test_yaml I, [2024-05-05T00:23:51.356225 #4169020] INFO -- : [672/885] 16485=test_big2str I, [2024-05-05T00:23:51.365339 #4169020] INFO -- : [673/885] 16485=test_literal I, [2024-05-05T00:23:51.427237 #4169020] INFO -- : [674/885] 16495=test_str2big I, [2024-05-05T00:23:51.433439 #4169020] INFO -- : [675/885] 16495=test_dot_dot I, [2024-05-05T00:23:51.435177 #4169020] INFO -- : [676/885] 16495=test_c_struct_builder I, [2024-05-05T00:23:51.473097 #4169020] INFO -- : [677/885] 16483=test_rdoc_markup_to_table_of_contents I, [2024-05-05T00:23:51.495876 #4169020] INFO -- : [678/885] 16483=test_thread I, [2024-05-05T00:23:51.514623 #4169020] INFO -- : [679/885] 16484=test_socket I, [2024-05-05T00:23:51.585141 #4169020] INFO -- : [680/885] 16481=test_objectspace I, [2024-05-05T00:23:51.593100 #4169020] INFO -- : [681/885] 16495=test_ractor I, [2024-05-05T00:23:51.601365 #4169020] INFO -- : [682/885] 16492=test_severity I, [2024-05-05T00:23:51.607294 #4169020] INFO -- : [683/885] 16495=test_require_lib I, [2024-05-05T00:23:51.617360 #4169020] INFO -- : [684/885] 16492=test_gem_install_update_options I, [2024-05-05T00:23:51.695551 #4169020] INFO -- : [685/885] 16491=parse_test I, [2024-05-05T00:23:51.719142 #4169020] INFO -- : [686/885] 16483=test_gem_stream_ui I, [2024-05-05T00:23:51.741710 #4169020] INFO -- : [687/885] 16492=test_rdoc_generator_ri I, [2024-05-05T00:23:51.749449 #4169020] INFO -- : [688/885] 16492=test_extlibs I, [2024-05-05T00:23:51.770011 #4169020] INFO -- : [689/885] 16480=test_m17n_comb I, [2024-05-05T00:23:51.802431 #4169020] INFO -- : [690/885] 16483=test_memory_view I, [2024-05-05T00:23:51.836273 #4169020] INFO -- : [691/885] 16487=test_ractor I, [2024-05-05T00:23:51.905921 #4169020] INFO -- : [692/885] 16487=test_rdoc_generator_pot_po I, [2024-05-05T00:23:51.908952 #4169020] INFO -- : [693/885] 16485=test_ansi_with_terminfo I, [2024-05-05T00:23:51.914687 #4169020] INFO -- : [694/885] 16487=test_rdoc_markup_to_markdown I, [2024-05-05T00:23:51.915049 #4169020] INFO -- : [695/885] 16485=test_json_tree I, [2024-05-05T00:23:51.922959 #4169020] INFO -- : [696/885] 16485=test_case I, [2024-05-05T00:23:51.923020 #4169020] INFO -- : [697/885] 16485=test_pkey I, [2024-05-05T00:23:51.956314 #4169020] INFO -- : [698/885] 16487=test_parser_events I, [2024-05-05T00:23:51.969938 #4169020] INFO -- : [699/885] 16485=test_reline I, [2024-05-05T00:23:52.009819 #4169020] INFO -- : [700/885] 16487=test_cclass I, [2024-05-05T00:23:52.024301 #4169020] INFO -- : [701/885] 16483=test_gem_request_connection_pools I, [2024-05-05T00:23:52.067662 #4169020] INFO -- : [702/885] 16487=test_grapheme_breaks I, [2024-05-05T00:23:52.069464 #4169020] INFO -- : [703/885] 16485=test_gem_version_option I, [2024-05-05T00:23:52.091399 #4169020] INFO -- : [704/885] 16487=test_win32ole I, [2024-05-05T00:23:52.097026 #4169020] INFO -- : [705/885] 16485=test_generic I, [2024-05-05T00:23:52.099598 #4169020] INFO -- : [706/885] 16487=test_scan_args I, [2024-05-05T00:23:52.109508 #4169020] INFO -- : [707/885] 16487=test_enumerator_kw I, [2024-05-05T00:23:52.112682 #4169020] INFO -- : [708/885] 16487=test_gem_text I, [2024-05-05T00:23:52.118005 #4169020] INFO -- : [709/885] 16485=test_settracefunc I, [2024-05-05T00:23:52.162259 #4169020] INFO -- : [710/885] 16487=test_gem_ext_cargo_builder_link_flag_converter I, [2024-05-05T00:23:52.183475 #4169020] INFO -- : [711/885] 16482=test_gem_commands_mirror I, [2024-05-05T00:23:52.191463 #4169020] INFO -- : [712/885] 16482=test_method_cache I, [2024-05-05T00:23:52.194219 #4169020] INFO -- : [713/885] 16482=test_gem_request I, [2024-05-05T00:23:52.218107 #4169020] INFO -- : [714/885] 16489=test_sprintf_comb I, [2024-05-05T00:23:52.222144 #4169020] INFO -- : [715/885] 16487=test_exception I, [2024-05-05T00:23:52.364539 #4169020] INFO -- : [716/885] 16481=test_bug_reporter I, [2024-05-05T00:23:52.370205 #4169020] INFO -- : [717/885] 16489=test_rand I, [2024-05-05T00:23:52.404862 #4169020] INFO -- : [718/885] 16482=test_gem_package_tar_reader_entry I, [2024-05-05T00:23:52.679014 #4169020] INFO -- : [719/885] 16489=test_gem_name_tuple I, [2024-05-05T00:23:52.685738 #4169020] INFO -- : [720/885] 16482=test_rdoc_cross_reference I, [2024-05-05T00:23:52.687211 #4169020] INFO -- : [721/885] 16494=test_gem_dependency_installer I, [2024-05-05T00:23:52.698025 #4169020] INFO -- : [722/885] 16489=test_scalar I, [2024-05-05T00:23:52.702526 #4169020] INFO -- : [723/885] 16489=test_gem_commands_info_command I, [2024-05-05T00:23:52.726315 #4169020] INFO -- : [724/885] 16489=test_case_options I, [2024-05-05T00:23:52.733323 #4169020] INFO -- : [725/885] 16489=test_store I, [2024-05-05T00:23:52.738598 #4169020] INFO -- : [726/885] 16481=test_iso_8859 I, [2024-05-05T00:23:52.759487 #4169020] INFO -- : [727/885] 16481=test_tcp I, [2024-05-05T00:23:52.781664 #4169020] INFO -- : [728/885] 16478=test_rdoc_text I, [2024-05-05T00:23:52.838732 #4169020] INFO -- : [729/885] 16478=test_gem_safe_yaml I, [2024-05-05T00:23:52.842875 #4169020] INFO -- : [730/885] 16484=test_syntax I, [2024-05-05T00:23:52.850918 #4169020] INFO -- : [731/885] 16478=test_data I, [2024-05-05T00:23:52.858294 #4169020] INFO -- : [732/885] 16478=test_date_new I, [2024-05-05T00:23:52.862229 #4169020] INFO -- : [733/885] 16481=index_write_test I, [2024-05-05T00:23:52.864735 #4169020] INFO -- : [734/885] 16481=test_require I, [2024-05-05T00:23:52.865676 #4169020] INFO -- : [735/885] 16478=test_date_time I, [2024-05-05T00:23:52.868225 #4169020] INFO -- : [736/885] 16481=test_rdoc_markup_to_joined_paragraph I, [2024-05-05T00:23:52.878628 #4169020] INFO -- : [737/885] 16478=test_rdoc_parser_ruby I, [2024-05-05T00:23:52.932666 #4169020] INFO -- : [738/885] 16476=test_httpresponse I, [2024-05-05T00:23:52.954507 #4169020] INFO -- : [739/885] 16489=test_open-uri I, [2024-05-05T00:23:53.009982 #4169020] INFO -- : [740/885] 16476=test_rdoc_context I, [2024-05-05T00:23:53.026951 #4169020] INFO -- : [741/885] 16481=test_stream I, [2024-05-05T00:23:53.038360 #4169020] INFO -- : [742/885] 16481=test_nil2vtempty I, [2024-05-05T00:23:53.043192 #4169020] INFO -- : [743/885] 16481=test_gem_commands_dependency_command I, [2024-05-05T00:23:53.060316 #4169020] INFO -- : [744/885] 16483=test_gem_resolver_composed_set I, [2024-05-05T00:23:53.076002 #4169020] INFO -- : [745/885] 16483=test_safe_load I, [2024-05-05T00:23:53.083489 #4169020] INFO -- : [746/885] 16483=test_gem_resolver I, [2024-05-05T00:23:53.102957 #4169020] INFO -- : [747/885] 16482=test_rdoc_markup_attribute_manager I, [2024-05-05T00:23:53.109132 #4169020] INFO -- : [748/885] 16485=test_name_error I, [2024-05-05T00:23:53.127388 #4169020] INFO -- : [749/885] 16482=test_gem_commands_which_command I, [2024-05-05T00:23:53.139399 #4169020] INFO -- : [750/885] 16481=test_shift_jis I, [2024-05-05T00:23:53.143290 #4169020] INFO -- : [751/885] 16481=test_http I, [2024-05-05T00:23:53.158147 #4169020] INFO -- : [752/885] 16482=test_enumerator I, [2024-05-05T00:23:53.165274 #4169020] INFO -- : [753/885] 16481=test_flags I, [2024-05-05T00:23:53.231135 #4169020] INFO -- : [754/885] 16485=test_inadvertent_creation I, [2024-05-05T00:23:53.307995 #4169020] INFO -- : [755/885] 16485=test_gem_commands_specification_command I, [2024-05-05T00:23:53.311398 #4169020] INFO -- : [756/885] 16483=test_arity I, [2024-05-05T00:23:53.317299 #4169020] INFO -- : [757/885] 16483=test_gem_ext_rake_builder I, [2024-05-05T00:23:53.417870 #4169020] INFO -- : [758/885] 16485=test_logdevice I, [2024-05-05T00:23:53.433830 #4169020] INFO -- : [759/885] 16478=test_err_in_callback I, [2024-05-05T00:23:53.437110 #4169020] INFO -- : [760/885] 16478=test_gem_resolver_lock_specification I, [2024-05-05T00:23:53.463573 #4169020] INFO -- : [761/885] 16492=test_gc I, [2024-05-05T00:23:53.469691 #4169020] INFO -- : [762/885] 16478=test_x509cert I, [2024-05-05T00:23:53.608090 #4169020] INFO -- : [763/885] 16489=test_last_thread I, [2024-05-05T00:23:53.743612 #4169020] INFO -- : [764/885] 16478=test_process I, [2024-05-05T00:23:53.762153 #4169020] INFO -- : [765/885] 16476=test_pack I, [2024-05-05T00:23:53.955601 #4169020] INFO -- : [766/885] 16476=test_gem_source_local I, [2024-05-05T00:23:54.038908 #4169020] INFO -- : [767/885] 16483=test_gem_security_policy I, [2024-05-05T00:23:54.185443 #4169020] INFO -- : [768/885] 16491=test_uncorrectable_name_check I, [2024-05-05T00:23:54.185544 #4169020] INFO -- : [769/885] 16477=newline_test I, [2024-05-05T00:23:54.193886 #4169020] INFO -- : [770/885] 16476=test_hash_create I, [2024-05-05T00:23:54.195329 #4169020] INFO -- : [771/885] 16491=test_stringchar I, [2024-05-05T00:23:54.198137 #4169020] INFO -- : [772/885] 16476=test_passing_block I, [2024-05-05T00:23:54.206045 #4169020] INFO -- : [773/885] 16476=test_thread_fd_close I, [2024-05-05T00:23:54.209363 #4169020] INFO -- : [774/885] 16476=test_securerandom I, [2024-05-05T00:23:54.259692 #4169020] INFO -- : [775/885] 16476=test_c_union_entity I, [2024-05-05T00:23:54.277500 #4169020] INFO -- : [776/885] 16491=test_rdoc_normal_module I, [2024-05-05T00:23:54.277947 #4169020] INFO -- : [777/885] 16477=test_rdoc_markdown_test I, [2024-05-05T00:23:54.306229 #4169020] INFO -- : [778/885] 16485=test_logperiod I, [2024-05-05T00:23:54.310170 #4169020] INFO -- : [779/885] 16481=test_flush I, [2024-05-05T00:23:54.315822 #4169020] INFO -- : [780/885] 16485=test_singleton I, [2024-05-05T00:23:54.316207 #4169020] INFO -- : [781/885] 16485=test_io_console I, [2024-05-05T00:23:54.317627 #4169020] INFO -- : [782/885] 16481=test_switch_hitter I, [2024-05-05T00:23:54.318564 #4169020] INFO -- : [783/885] 16491=test_verbose I, [2024-05-05T00:23:54.329781 #4169020] INFO -- : [784/885] 16481=test_rdoc_single_class I, [2024-05-05T00:23:54.334685 #4169020] INFO -- : [785/885] 16481=test_nil I, [2024-05-05T00:23:54.339166 #4169020] INFO -- : [786/885] 16481=test_num2int I, [2024-05-05T00:23:54.340198 #4169020] INFO -- : [787/885] 16491=test_macro I, [2024-05-05T00:23:54.341092 #4169020] INFO -- : [788/885] 16476=test_frozen I, [2024-05-05T00:23:54.343743 #4169020] INFO -- : [789/885] 16476=test_gem_ext_configure_builder I, [2024-05-05T00:23:54.349607 #4169020] INFO -- : [790/885] 16480=test_pp I, [2024-05-05T00:23:54.350378 #4169020] INFO -- : [791/885] 16481=test_zsh_completion I, [2024-05-05T00:23:54.352267 #4169020] INFO -- : [792/885] 16491=test_exception I, [2024-05-05T00:23:54.355218 #4169020] INFO -- : [793/885] 16481=test_iter_break I, [2024-05-05T00:23:54.356854 #4169020] INFO -- : [794/885] 16483=test_rdoc_token_stream I, [2024-05-05T00:23:54.362873 #4169020] INFO -- : [795/885] 16487=test_address_resolve I, [2024-05-05T00:23:54.363650 #4169020] INFO -- : [796/885] 16491=test_config I, [2024-05-05T00:23:54.364218 #4169020] INFO -- : [797/885] 16483=test_optarg I, [2024-05-05T00:23:54.367814 #4169020] INFO -- : [798/885] 16481=test_yaml_special_cases I, [2024-05-05T00:23:54.374987 #4169020] INFO -- : [799/885] 16481=test_gem_source_list I, [2024-05-05T00:23:54.375827 #4169020] INFO -- : [800/885] 16487=test_numeric I, [2024-05-05T00:23:54.387090 #4169020] INFO -- : [801/885] 16480=test_assignment I, [2024-05-05T00:23:54.393587 #4169020] INFO -- : [802/885] 16491=test_ifunless I, [2024-05-05T00:23:54.395821 #4169020] INFO -- : [803/885] 16491=test_gem_commands_lock_command I, [2024-05-05T00:23:54.398125 #4169020] INFO -- : [804/885] 16476=test_gem_command I, [2024-05-05T00:23:54.415138 #4169020] INFO -- : [805/885] 16481=test_key_actor_vi I, [2024-05-05T00:23:54.424791 #4169020] INFO -- : [806/885] 16491=test_bug-3571 I, [2024-05-05T00:23:54.440279 #4169020] INFO -- : [807/885] 16487=test_common I, [2024-05-05T00:23:54.451177 #4169020] INFO -- : [808/885] 16491=test_gem_spec_fetcher I, [2024-05-05T00:23:54.485532 #4169020] INFO -- : [809/885] 16476=test_hmac I, [2024-05-05T00:23:54.487530 #4169020] INFO -- : [810/885] 16476=test_rdoc_markup_to_tt_only I, [2024-05-05T00:23:54.493578 #4169020] INFO -- : [811/885] 16481=test_rdoc_tom_doc I, [2024-05-05T00:23:54.497265 #4169020] INFO -- : [812/885] 16483=test_object_create_start I, [2024-05-05T00:23:54.497375 #4169020] INFO -- : [813/885] 16483=test_at_exit I, [2024-05-05T00:23:54.507344 #4169020] INFO -- : [814/885] 16481=test_command I, [2024-05-05T00:23:54.512462 #4169020] INFO -- : [815/885] 16483=test_gem_ext_cargo_builder_unit I, [2024-05-05T00:23:54.520689 #4169020] INFO -- : [816/885] 16476=test_gem_rdoc I, [2024-05-05T00:23:54.535016 #4169020] INFO -- : [817/885] 16483=test_date I, [2024-05-05T00:23:54.543648 #4169020] INFO -- : [818/885] 16483=test_enc_raise I, [2024-05-05T00:23:54.547230 #4169020] INFO -- : [819/885] 16483=test_psych I, [2024-05-05T00:23:54.565403 #4169020] INFO -- : [820/885] 16483=!Nothing_to_test I, [2024-05-05T00:23:54.566376 #4169020] INFO -- : [821/885] 16483=test_rdoc_markup_paragraph I, [2024-05-05T00:23:54.573228 #4169020] INFO -- : [822/885] 16483=test_kdf I, [2024-05-05T00:23:54.596747 #4169020] INFO -- : [823/885] 16476=test_gem_doctor I, [2024-05-05T00:23:54.623988 #4169020] INFO -- : [824/885] 16476=test_kernel I, [2024-05-05T00:23:54.638405 #4169020] INFO -- : [825/885] 16487=test_eval_history I, [2024-05-05T00:23:54.646112 #4169020] INFO -- : [826/885] 16483=dispatcher_test I, [2024-05-05T00:23:54.656879 #4169020] INFO -- : [827/885] 16483=test_bug-5832 I, [2024-05-05T00:23:54.658421 #4169020] INFO -- : [828/885] 16483=test_files_ext I, [2024-05-05T00:23:54.661639 #4169020] INFO -- : [829/885] 16483=test_emitter I, [2024-05-05T00:23:54.668975 #4169020] INFO -- : [830/885] 16483=test_gem_silent_ui I, [2024-05-05T00:23:54.669951 #4169020] INFO -- : [831/885] 16491=test_windows_1251 I, [2024-05-05T00:23:54.677105 #4169020] INFO -- : [832/885] 16491=test_time I, [2024-05-05T00:23:54.702785 #4169020] INFO -- : [833/885] 16483=test_rdoc_rdoc I, [2024-05-05T00:23:54.736187 #4169020] INFO -- : [834/885] 16489=test_gem_uninstaller I, [2024-05-05T00:23:54.743768 #4169020] INFO -- : [835/885] 16481=test_buffering I, [2024-05-05T00:23:54.762031 #4169020] INFO -- : [836/885] 16481=test_svcb_https I, [2024-05-05T00:23:54.769820 #4169020] INFO -- : [837/885] 16481=test_gb18030 I, [2024-05-05T00:23:54.771008 #4169020] INFO -- : [838/885] 16487=test_io_buffer I, [2024-05-05T00:23:54.775960 #4169020] INFO -- : [839/885] 16481=test_key_name_check I, [2024-05-05T00:23:54.777740 #4169020] INFO -- : [840/885] 16481=test_defined I, [2024-05-05T00:23:54.781459 #4169020] INFO -- : [841/885] 16483=test_backtrace I, [2024-05-05T00:23:54.786066 #4169020] INFO -- : [842/885] 16483=test_rdoc_i18n_text I, [2024-05-05T00:23:54.814743 #4169020] INFO -- : [843/885] 16491=test_date_parse I, [2024-05-05T00:23:54.819583 #4169020] INFO -- : [844/885] 16483=test_trick I, [2024-05-05T00:23:54.822184 #4169020] INFO -- : [845/885] 16487=test_thread I, [2024-05-05T00:23:54.823122 #4169020] INFO -- : [846/885] 16487=test_pipe I, [2024-05-05T00:23:54.865899 #4169020] INFO -- : [847/885] 16481=test_pkey_ec I, [2024-05-05T00:23:54.930697 #4169020] INFO -- : [848/885] 16491=test_null I, [2024-05-05T00:23:54.934967 #4169020] INFO -- : [849/885] 16491=test_win32ole_type I, [2024-05-05T00:23:54.937042 #4169020] INFO -- : [850/885] 16491=test_mul I, [2024-05-05T00:23:54.940045 #4169020] INFO -- : [851/885] 16487=test_rdoc_markup_to_rdoc I, [2024-05-05T00:23:54.943482 #4169020] INFO -- : [852/885] 16491=test_rdoc_rd_inline_parser I, [2024-05-05T00:23:54.951701 #4169020] INFO -- : [853/885] 16481=test_default_gems I, [2024-05-05T00:23:54.961210 #4169020] INFO -- : [854/885] 16495=test_rdoc_markup_attributes I, [2024-05-05T00:23:54.962584 #4169020] INFO -- : [855/885] 16487=test_custom_command I, [2024-05-05T00:23:54.966280 #4169020] INFO -- : [856/885] 16495=json_addition_test I, [2024-05-05T00:23:54.967194 #4169020] INFO -- : [857/885] 16487=test_gem_dependency_resolution_error I, [2024-05-05T00:23:54.973096 #4169020] INFO -- : [858/885] 16495=test_rdoc_parser I, [2024-05-05T00:23:54.974155 #4169020] INFO -- : [859/885] 16487=test_qsort I, [2024-05-05T00:23:54.977544 #4169020] INFO -- : [860/885] 16487=test_rdoc_stats I, [2024-05-05T00:23:54.988762 #4169020] INFO -- : [861/885] 16495=test_pattern_matching I, [2024-05-05T00:23:54.992953 #4169020] INFO -- : [862/885] 16491=test_string I, [2024-05-05T00:23:54.993679 #4169020] INFO -- : [863/885] 16481=test_rdoc_store I, [2024-05-05T00:23:55.011984 #4169020] INFO -- : [864/885] 16495=test_depth_first I, [2024-05-05T00:23:55.014899 #4169020] INFO -- : [865/885] 16491=test_gem_request_set_lockfile_parser I, [2024-05-05T00:23:55.019237 #4169020] INFO -- : [866/885] 16495=test_raise I, [2024-05-05T00:23:55.019467 #4169020] INFO -- : [867/885] 16495=test_x509attr I, [2024-05-05T00:23:55.021771 #4169020] INFO -- : [868/885] 16487=test_gem_validator I, [2024-05-05T00:23:55.028342 #4169020] INFO -- : [869/885] 16495=test_rdoc_markup_parser I, [2024-05-05T00:23:55.048603 #4169020] INFO -- : [870/885] 16487=test_require_path_check I, [2024-05-05T00:23:55.054915 #4169020] INFO -- : [871/885] 16490=test_folderitem2_invokeverb I, [2024-05-05T00:23:55.069411 #4169020] INFO -- : [872/885] 16495=test_fnmatch I, [2024-05-05T00:23:55.072232 #4169020] INFO -- : [873/885] 16490=test_files_test_2 I, [2024-05-05T00:23:55.072291 #4169020] INFO -- : [874/885] 16490=test_zlib I, [2024-05-05T00:23:55.106176 #4169020] INFO -- : [875/885] 16491=test_cgi_tag_helper I, [2024-05-05T00:23:55.109008 #4169020] INFO -- : [876/885] 16495=test_egrep_cpp I, [2024-05-05T00:23:55.119019 #4169020] INFO -- : [877/885] 16491=test_ole_methods I, [2024-05-05T00:23:55.119726 #4169020] INFO -- : [878/885] 16476=test_erb_m17n I, [2024-05-05T00:23:55.122316 #4169020] INFO -- : [879/885] 16491=test_date_conv I, [2024-05-05T00:23:55.124215 #4169020] INFO -- : [880/885] 16494=test_optimization I, [2024-05-05T00:23:55.126975 #4169020] INFO -- : [881/885] 16476=test_gc_compact I, [2024-05-05T00:23:55.131981 #4169020] INFO -- : [882/885] 16487=test_proc I, [2024-05-05T00:23:55.156341 #4169020] INFO -- : [883/885] 16491=test_string I, [2024-05-05T00:23:55.268431 #4169020] INFO -- : [884/885] 16495=test_gem_resolver_index_set I, [2024-05-05T00:23:55.308247 #4169020] INFO -- : [885/885] 16495=test_gem_package_old I, [2024-05-05T00:24:07.611418 #4169020] INFO -- : Finished tests in 30.857810s, 854.0139 tests/s, 303118.4980 assertions/s. E, [2024-05-05T00:24:07.611500 #4169020] ERROR -- : Children under /tmp/rubytest.95wiq3: E, [2024-05-05T00:24:07.611528 #4169020] ERROR -- : * drwx------ 4 80 2024-05-05 00:23:42 +0000 gem_rebuild20240505-16494-s7ejpq/ E, [2024-05-05T00:24:07.611535 #4169020] ERROR -- : * drwxrwxr-x 2 60 2024-05-05 00:23:42 +0000 new/ E, [2024-05-05T00:24:07.611540 #4169020] ERROR -- : * -rw-rw-r-- 1 4096 2024-05-05 00:23:42 +0000 rebuild_test_gem-1.0.0.gem E, [2024-05-05T00:24:07.611545 #4169020] ERROR -- : * drwxrwxr-x 2 60 2024-05-05 00:23:42 +0000 old/ E, [2024-05-05T00:24:07.611549 #4169020] ERROR -- : * -rw-rw-r-- 1 4096 2024-05-05 00:23:42 +0000 rebuild_test_gem-1.0.0.gem I, [2024-05-05T00:24:07.612544 #4169020] INFO -- : 26353 tests, 9353573 assertions, 0 failures, 0 errors, 306 skips I, [2024-05-05T00:24:07.612588 #4169020] INFO -- : I, [2024-05-05T00:24:07.612595 #4169020] INFO -- : ruby -v: ruby 3.4.0dev (2024-05-04T16:31:58Z master b181ba7400) [x86_64-linux] I, [2024-05-05T00:24:07.614650 #4169020] INFO -- : $$$[end] "make yes-test-all TESTOPTS='--stderr-on-failure' TESTS='-j20'" exit with 0. I, [2024-05-05T00:24:07.614836 #4169020] INFO -- : $$$[beg] make yes-test-rubyspec MSPECOPT='--error-output stderr --debug -j' TESTS='-j20' I, [2024-05-05T00:24:07.701473 #4169020] INFO -- : BASERUBY = /usr/bin/ruby --disable=gems I, [2024-05-05T00:24:07.701512 #4169020] INFO -- : CC = gcc I, [2024-05-05T00:24:07.701517 #4169020] INFO -- : LD = ld I, [2024-05-05T00:24:07.701522 #4169020] INFO -- : LDSHARED = gcc -shared I, [2024-05-05T00:24:07.701526 #4169020] INFO -- : CFLAGS = -O3 -fno-fast-math -ggdb3 -Wall -Wextra -Wdeprecated-declarations -Wdiv-by-zero -Wduplicated-cond -Wimplicit-function-declaration -Wimplicit-int -Wpointer-arith -Wwrite-strings -Wold-style-definition -Wimplicit-fallthrough=0 -Wmissing-noreturn -Wno-cast-function-type -Wno-constant-logical-operand -Wno-long-long -Wno-missing-field-initializers -Wno-overlength-strings -Wno-packed-bitfield-compat -Wno-parentheses-equality -Wno-self-assign -Wno-tautological-compare -Wno-unused-parameter -Wno-unused-value -Wsuggest-attribute=format -Wsuggest-attribute=noreturn -Wunused-variable -Wmisleading-indentation -Wundef -fPIC I, [2024-05-05T00:24:07.701531 #4169020] INFO -- : XCFLAGS = -U_FORTIFY_SOURCE -D_FORTIFY_SOURCE=2 -fstack-protector-strong -fno-strict-overflow -fvisibility=hidden -fexcess-precision=standard -DRUBY_EXPORT -I. -I.ext/include/x86_64-linux -I/tmp/ruby/src/trunk/include -I/tmp/ruby/src/trunk -I/tmp/ruby/src/trunk/prism -I/tmp/ruby/src/trunk/enc/unicode/15.0.0 I, [2024-05-05T00:24:07.701535 #4169020] INFO -- : CPPFLAGS = I, [2024-05-05T00:24:07.701539 #4169020] INFO -- : DLDFLAGS = -Wl,--compress-debug-sections=zlib -Wl,-soname,libruby.so.3.4 -fstack-protector-strong I, [2024-05-05T00:24:07.701543 #4169020] INFO -- : SOLIBS = -lz -lrt -lrt -lgmp -ldl -lcrypt -lm -lpthread I, [2024-05-05T00:24:07.701547 #4169020] INFO -- : LANG = en_US.UTF-8 I, [2024-05-05T00:24:07.701551 #4169020] INFO -- : LC_ALL = I, [2024-05-05T00:24:07.701554 #4169020] INFO -- : LC_CTYPE = I, [2024-05-05T00:24:07.701558 #4169020] INFO -- : MFLAGS = I, [2024-05-05T00:24:07.701562 #4169020] INFO -- : RUSTC = no I, [2024-05-05T00:24:07.701566 #4169020] INFO -- : YJIT_RUSTC_ARGS = --crate-name=yjit --crate-type=staticlib --edition=2021 -g -C lto=thin -C opt-level=3 -C overflow-checks=on '--out-dir=/tmp/ruby/build/trunk/yjit/target/release/' /tmp/ruby/src/trunk/yjit/src/lib.rs I, [2024-05-05T00:24:07.702194 #4169020] INFO -- : gcc (Ubuntu 11.4.0-1ubuntu1~22.04) 11.4.0 I, [2024-05-05T00:24:07.702214 #4169020] INFO -- : Copyright (C) 2021 Free Software Foundation, Inc. I, [2024-05-05T00:24:07.702219 #4169020] INFO -- : This is free software; see the source for copying conditions. There is NO I, [2024-05-05T00:24:07.702224 #4169020] INFO -- : warranty; not even for MERCHANTABILITY or FITNESS FOR A PARTICULAR PURPOSE. I, [2024-05-05T00:24:07.702227 #4169020] INFO -- : I, [2024-05-05T00:24:07.703976 #4169020] INFO -- : generating enc.mk I, [2024-05-05T00:24:07.821563 #4169020] INFO -- : making enc I, [2024-05-05T00:24:07.839011 #4169020] INFO -- : make[1]: Entering directory '/tmp/ruby/build/trunk' I, [2024-05-05T00:24:07.839032 #4169020] INFO -- : make[1]: Nothing to be done for 'enc'. I, [2024-05-05T00:24:07.839038 #4169020] INFO -- : make[1]: Leaving directory '/tmp/ruby/build/trunk' I, [2024-05-05T00:24:07.839784 #4169020] INFO -- : making srcs under enc I, [2024-05-05T00:24:07.870086 #4169020] INFO -- : make[1]: Entering directory '/tmp/ruby/build/trunk' I, [2024-05-05T00:24:07.870111 #4169020] INFO -- : make[1]: Nothing to be done for 'srcs'. I, [2024-05-05T00:24:07.870119 #4169020] INFO -- : make[1]: Leaving directory '/tmp/ruby/build/trunk' I, [2024-05-05T00:24:07.870960 #4169020] INFO -- : generating transdb.h I, [2024-05-05T00:24:07.965237 #4169020] INFO -- : transdb.h unchanged I, [2024-05-05T00:24:07.966511 #4169020] INFO -- : making trans I, [2024-05-05T00:24:08.001678 #4169020] INFO -- : make[1]: Entering directory '/tmp/ruby/build/trunk' I, [2024-05-05T00:24:08.001698 #4169020] INFO -- : make[1]: Nothing to be done for 'trans'. I, [2024-05-05T00:24:08.001703 #4169020] INFO -- : make[1]: Leaving directory '/tmp/ruby/build/trunk' I, [2024-05-05T00:24:08.002375 #4169020] INFO -- : making encs I, [2024-05-05T00:24:08.039499 #4169020] INFO -- : make[1]: Entering directory '/tmp/ruby/build/trunk' I, [2024-05-05T00:24:08.039522 #4169020] INFO -- : make[1]: Nothing to be done for 'encs'. I, [2024-05-05T00:24:08.039527 #4169020] INFO -- : make[1]: Leaving directory '/tmp/ruby/build/trunk' I, [2024-05-05T00:24:08.041322 #4169020] INFO -- : generating makefiles ext/configure-ext.mk I, [2024-05-05T00:24:08.068641 #4169020] INFO -- : ext/configure-ext.mk updated I, [2024-05-05T00:24:08.071021 #4169020] INFO -- : make[1]: Entering directory '/tmp/ruby/build/trunk' I, [2024-05-05T00:24:09.423697 #4169020] INFO -- : make[1]: Leaving directory '/tmp/ruby/build/trunk' I, [2024-05-05T00:24:09.424399 #4169020] INFO -- : generating makefile exts.mk I, [2024-05-05T00:24:09.461108 #4169020] INFO -- : exts.mk unchanged I, [2024-05-05T00:24:09.465894 #4169020] INFO -- : make[1]: Entering directory '/tmp/ruby/build/trunk' I, [2024-05-05T00:24:09.677451 #4169020] INFO -- : make[2]: Entering directory '/tmp/ruby/build/trunk/ext/coverage' I, [2024-05-05T00:24:09.680242 #4169020] INFO -- : make[2]: Leaving directory '/tmp/ruby/build/trunk/ext/coverage' I, [2024-05-05T00:24:09.683961 #4169020] INFO -- : make[2]: Entering directory '/tmp/ruby/build/trunk/ext/date' I, [2024-05-05T00:24:09.687017 #4169020] INFO -- : make[2]: Leaving directory '/tmp/ruby/build/trunk/ext/date' I, [2024-05-05T00:24:09.689239 #4169020] INFO -- : make[2]: Entering directory '/tmp/ruby/build/trunk/ext/digest' I, [2024-05-05T00:24:09.694663 #4169020] INFO -- : make[2]: Leaving directory '/tmp/ruby/build/trunk/ext/digest' I, [2024-05-05T00:24:09.710286 #4169020] INFO -- : make[2]: Entering directory '/tmp/ruby/build/trunk/ext/digest/sha2' I, [2024-05-05T00:24:09.713190 #4169020] INFO -- : make[2]: Leaving directory '/tmp/ruby/build/trunk/ext/digest/sha2' I, [2024-05-05T00:24:09.725884 #4169020] INFO -- : make[2]: Entering directory '/tmp/ruby/build/trunk/ext/fiddle' I, [2024-05-05T00:24:09.732239 #4169020] INFO -- : make[2]: Leaving directory '/tmp/ruby/build/trunk/ext/fiddle' I, [2024-05-05T00:24:09.735180 #4169020] INFO -- : make[2]: Entering directory '/tmp/ruby/build/trunk/ext/io/console' I, [2024-05-05T00:24:09.737830 #4169020] INFO -- : make[2]: Leaving directory '/tmp/ruby/build/trunk/ext/io/console' I, [2024-05-05T00:24:09.745457 #4169020] INFO -- : make[2]: Entering directory '/tmp/ruby/build/trunk/ext/json' I, [2024-05-05T00:24:09.752052 #4169020] INFO -- : make[2]: Leaving directory '/tmp/ruby/build/trunk/ext/json' I, [2024-05-05T00:24:09.761097 #4169020] INFO -- : make[2]: Entering directory '/tmp/ruby/build/trunk/ext/monitor' I, [2024-05-05T00:24:09.763625 #4169020] INFO -- : make[2]: Leaving directory '/tmp/ruby/build/trunk/ext/monitor' I, [2024-05-05T00:24:09.767836 #4169020] INFO -- : make[2]: Entering directory '/tmp/ruby/build/trunk/ext/objspace' I, [2024-05-05T00:24:09.771544 #4169020] INFO -- : make[2]: Leaving directory '/tmp/ruby/build/trunk/ext/objspace' I, [2024-05-05T00:24:09.783431 #4169020] INFO -- : make[2]: Entering directory '/tmp/ruby/build/trunk/ext/openssl' I, [2024-05-05T00:24:09.796459 #4169020] INFO -- : make[2]: Leaving directory '/tmp/ruby/build/trunk/ext/openssl' I, [2024-05-05T00:24:09.799310 #4169020] INFO -- : make[2]: Entering directory '/tmp/ruby/build/trunk/ext/pathname' I, [2024-05-05T00:24:09.801937 #4169020] INFO -- : make[2]: Leaving directory '/tmp/ruby/build/trunk/ext/pathname' I, [2024-05-05T00:24:09.806135 #4169020] INFO -- : make[2]: Entering directory '/tmp/ruby/build/trunk/ext/psych' I, [2024-05-05T00:24:09.821667 #4169020] INFO -- : make[2]: Leaving directory '/tmp/ruby/build/trunk/ext/psych' I, [2024-05-05T00:24:09.824649 #4169020] INFO -- : make[2]: Entering directory '/tmp/ruby/build/trunk/ext/pty' I, [2024-05-05T00:24:09.827184 #4169020] INFO -- : make[2]: Leaving directory '/tmp/ruby/build/trunk/ext/pty' I, [2024-05-05T00:24:09.836841 #4169020] INFO -- : make[2]: Entering directory '/tmp/ruby/build/trunk/ext/ripper' I, [2024-05-05T00:24:09.841721 #4169020] INFO -- : make[2]: Leaving directory '/tmp/ruby/build/trunk/ext/ripper' I, [2024-05-05T00:24:09.843044 #4169020] INFO -- : make[2]: Entering directory '/tmp/ruby/build/trunk/ext/rubyvm' I, [2024-05-05T00:24:09.845112 #4169020] INFO -- : make[2]: Leaving directory '/tmp/ruby/build/trunk/ext/rubyvm' I, [2024-05-05T00:24:09.853035 #4169020] INFO -- : make[2]: Entering directory '/tmp/ruby/build/trunk/ext/socket' I, [2024-05-05T00:24:09.859455 #4169020] INFO -- : make[2]: Leaving directory '/tmp/ruby/build/trunk/ext/socket' I, [2024-05-05T00:24:09.870334 #4169020] INFO -- : make[2]: Entering directory '/tmp/ruby/build/trunk/.bundle/gems/bigdecimal-3.1.7/ext/bigdecimal' I, [2024-05-05T00:24:09.893269 #4169020] INFO -- : make[2]: Leaving directory '/tmp/ruby/build/trunk/.bundle/gems/bigdecimal-3.1.7/ext/bigdecimal' I, [2024-05-05T00:24:09.895240 #4169020] INFO -- : make[2]: Entering directory '/tmp/ruby/build/trunk/.bundle/gems/debug-1.9.2/ext/debug' I, [2024-05-05T00:24:09.917253 #4169020] INFO -- : make[2]: Leaving directory '/tmp/ruby/build/trunk/.bundle/gems/debug-1.9.2/ext/debug' I, [2024-05-05T00:24:09.919187 #4169020] INFO -- : make[2]: Entering directory '/tmp/ruby/build/trunk/.bundle/gems/nkf-0.2.0/ext/nkf' I, [2024-05-05T00:24:09.941437 #4169020] INFO -- : make[2]: Leaving directory '/tmp/ruby/build/trunk/.bundle/gems/nkf-0.2.0/ext/nkf' I, [2024-05-05T00:24:09.943640 #4169020] INFO -- : make[2]: Entering directory '/tmp/ruby/build/trunk/.bundle/gems/racc-1.7.3/ext/racc/cparse' I, [2024-05-05T00:24:09.965408 #4169020] INFO -- : make[2]: Leaving directory '/tmp/ruby/build/trunk/.bundle/gems/racc-1.7.3/ext/racc/cparse' I, [2024-05-05T00:24:09.967853 #4169020] INFO -- : make[2]: Entering directory '/tmp/ruby/build/trunk/.bundle/gems/rbs-3.4.4/ext/rbs_extension' I, [2024-05-05T00:24:09.990107 #4169020] INFO -- : make[2]: Leaving directory '/tmp/ruby/build/trunk/.bundle/gems/rbs-3.4.4/ext/rbs_extension' I, [2024-05-05T00:24:09.992040 #4169020] INFO -- : make[2]: Entering directory '/tmp/ruby/build/trunk/.bundle/gems/syslog-0.1.2/ext/syslog' I, [2024-05-05T00:24:10.013729 #4169020] INFO -- : make[2]: Leaving directory '/tmp/ruby/build/trunk/.bundle/gems/syslog-0.1.2/ext/syslog' I, [2024-05-05T00:24:10.037023 #4169020] INFO -- : make[2]: Entering directory '/tmp/ruby/build/trunk' I, [2024-05-05T00:24:10.101390 #4169020] INFO -- : make[2]: 'ruby' is up to date. I, [2024-05-05T00:24:10.101433 #4169020] INFO -- : make[2]: Leaving directory '/tmp/ruby/build/trunk' I, [2024-05-05T00:24:10.101908 #4169020] INFO -- : make[1]: Leaving directory '/tmp/ruby/build/trunk' I, [2024-05-05T00:24:10.105719 #4169020] INFO -- : make[1]: Entering directory '/tmp/ruby/build/trunk' I, [2024-05-05T00:24:10.105740 #4169020] INFO -- : make[1]: Nothing to be done for 'note'. I, [2024-05-05T00:24:10.105745 #4169020] INFO -- : make[1]: Leaving directory '/tmp/ruby/build/trunk' E, [2024-05-05T00:24:10.162547 #4169020] ERROR -- : $ /tmp/ruby/build/trunk/miniruby -I/tmp/ruby/src/trunk/lib /tmp/ruby/src/trunk/tool/runruby.rb --archdir=/tmp/ruby/build/trunk --extout=.ext -- /tmp/ruby/src/trunk/spec/mspec/bin/mspec-run -B /tmp/ruby/src/trunk/spec/default.mspec --error-output stderr --debug -fy -o /tmp/rubytest.ekouwj/1-mspec-multi-0 E, [2024-05-05T00:24:10.162791 #4169020] ERROR -- : $ /tmp/ruby/build/trunk/miniruby -I/tmp/ruby/src/trunk/lib /tmp/ruby/src/trunk/tool/runruby.rb --archdir=/tmp/ruby/build/trunk --extout=.ext -- /tmp/ruby/src/trunk/spec/mspec/bin/mspec-run -B /tmp/ruby/src/trunk/spec/default.mspec --error-output stderr --debug -fy -o /tmp/rubytest.ekouwj/2-mspec-multi-1 E, [2024-05-05T00:24:10.163051 #4169020] ERROR -- : $ /tmp/ruby/build/trunk/miniruby -I/tmp/ruby/src/trunk/lib /tmp/ruby/src/trunk/tool/runruby.rb --archdir=/tmp/ruby/build/trunk --extout=.ext -- /tmp/ruby/src/trunk/spec/mspec/bin/mspec-run -B /tmp/ruby/src/trunk/spec/default.mspec --error-output stderr --debug -fy -o /tmp/rubytest.ekouwj/3-mspec-multi-2 E, [2024-05-05T00:24:10.163323 #4169020] ERROR -- : $ /tmp/ruby/build/trunk/miniruby -I/tmp/ruby/src/trunk/lib /tmp/ruby/src/trunk/tool/runruby.rb --archdir=/tmp/ruby/build/trunk --extout=.ext -- /tmp/ruby/src/trunk/spec/mspec/bin/mspec-run -B /tmp/ruby/src/trunk/spec/default.mspec --error-output stderr --debug -fy -o /tmp/rubytest.ekouwj/4-mspec-multi-3 E, [2024-05-05T00:24:10.163446 #4169020] ERROR -- : $ /tmp/ruby/build/trunk/miniruby -I/tmp/ruby/src/trunk/lib /tmp/ruby/src/trunk/tool/runruby.rb --archdir=/tmp/ruby/build/trunk --extout=.ext -- /tmp/ruby/src/trunk/spec/mspec/bin/mspec-run -B /tmp/ruby/src/trunk/spec/default.mspec --error-output stderr --debug -fy -o /tmp/rubytest.ekouwj/5-mspec-multi-4 E, [2024-05-05T00:24:10.163714 #4169020] ERROR -- : $ /tmp/ruby/build/trunk/miniruby -I/tmp/ruby/src/trunk/lib /tmp/ruby/src/trunk/tool/runruby.rb --archdir=/tmp/ruby/build/trunk --extout=.ext -- /tmp/ruby/src/trunk/spec/mspec/bin/mspec-run -B /tmp/ruby/src/trunk/spec/default.mspec --error-output stderr --debug -fy -o /tmp/rubytest.ekouwj/6-mspec-multi-5 E, [2024-05-05T00:24:10.163917 #4169020] ERROR -- : $ /tmp/ruby/build/trunk/miniruby -I/tmp/ruby/src/trunk/lib /tmp/ruby/src/trunk/tool/runruby.rb --archdir=/tmp/ruby/build/trunk --extout=.ext -- /tmp/ruby/src/trunk/spec/mspec/bin/mspec-run -B /tmp/ruby/src/trunk/spec/default.mspec --error-output stderr --debug -fy -o /tmp/rubytest.ekouwj/7-mspec-multi-6 E, [2024-05-05T00:24:10.164095 #4169020] ERROR -- : $ /tmp/ruby/build/trunk/miniruby -I/tmp/ruby/src/trunk/lib /tmp/ruby/src/trunk/tool/runruby.rb --archdir=/tmp/ruby/build/trunk --extout=.ext -- /tmp/ruby/src/trunk/spec/mspec/bin/mspec-run -B /tmp/ruby/src/trunk/spec/default.mspec --error-output stderr --debug -fy -o /tmp/rubytest.ekouwj/8-mspec-multi-7 E, [2024-05-05T00:24:10.164370 #4169020] ERROR -- : $ /tmp/ruby/build/trunk/miniruby -I/tmp/ruby/src/trunk/lib /tmp/ruby/src/trunk/tool/runruby.rb --archdir=/tmp/ruby/build/trunk --extout=.ext -- /tmp/ruby/src/trunk/spec/mspec/bin/mspec-run -B /tmp/ruby/src/trunk/spec/default.mspec --error-output stderr --debug -fy -o /tmp/rubytest.ekouwj/9-mspec-multi-8 E, [2024-05-05T00:24:10.164648 #4169020] ERROR -- : $ /tmp/ruby/build/trunk/miniruby -I/tmp/ruby/src/trunk/lib /tmp/ruby/src/trunk/tool/runruby.rb --archdir=/tmp/ruby/build/trunk --extout=.ext -- /tmp/ruby/src/trunk/spec/mspec/bin/mspec-run -B /tmp/ruby/src/trunk/spec/default.mspec --error-output stderr --debug -fy -o /tmp/rubytest.ekouwj/10-mspec-multi-9 E, [2024-05-05T00:24:10.164829 #4169020] ERROR -- : $ /tmp/ruby/build/trunk/miniruby -I/tmp/ruby/src/trunk/lib /tmp/ruby/src/trunk/tool/runruby.rb --archdir=/tmp/ruby/build/trunk --extout=.ext -- /tmp/ruby/src/trunk/spec/mspec/bin/mspec-run -B /tmp/ruby/src/trunk/spec/default.mspec --error-output stderr --debug -fy -o /tmp/rubytest.ekouwj/11-mspec-multi-10 E, [2024-05-05T00:24:10.165010 #4169020] ERROR -- : $ /tmp/ruby/build/trunk/miniruby -I/tmp/ruby/src/trunk/lib /tmp/ruby/src/trunk/tool/runruby.rb --archdir=/tmp/ruby/build/trunk --extout=.ext -- /tmp/ruby/src/trunk/spec/mspec/bin/mspec-run -B /tmp/ruby/src/trunk/spec/default.mspec --error-output stderr --debug -fy -o /tmp/rubytest.ekouwj/12-mspec-multi-11 E, [2024-05-05T00:24:10.165190 #4169020] ERROR -- : $ /tmp/ruby/build/trunk/miniruby -I/tmp/ruby/src/trunk/lib /tmp/ruby/src/trunk/tool/runruby.rb --archdir=/tmp/ruby/build/trunk --extout=.ext -- /tmp/ruby/src/trunk/spec/mspec/bin/mspec-run -B /tmp/ruby/src/trunk/spec/default.mspec --error-output stderr --debug -fy -o /tmp/rubytest.ekouwj/13-mspec-multi-12 E, [2024-05-05T00:24:10.165336 #4169020] ERROR -- : $ /tmp/ruby/build/trunk/miniruby -I/tmp/ruby/src/trunk/lib /tmp/ruby/src/trunk/tool/runruby.rb --archdir=/tmp/ruby/build/trunk --extout=.ext -- /tmp/ruby/src/trunk/spec/mspec/bin/mspec-run -B /tmp/ruby/src/trunk/spec/default.mspec --error-output stderr --debug -fy -o /tmp/rubytest.ekouwj/14-mspec-multi-13 E, [2024-05-05T00:24:10.165462 #4169020] ERROR -- : $ /tmp/ruby/build/trunk/miniruby -I/tmp/ruby/src/trunk/lib /tmp/ruby/src/trunk/tool/runruby.rb --archdir=/tmp/ruby/build/trunk --extout=.ext -- /tmp/ruby/src/trunk/spec/mspec/bin/mspec-run -B /tmp/ruby/src/trunk/spec/default.mspec --error-output stderr --debug -fy -o /tmp/rubytest.ekouwj/15-mspec-multi-14 E, [2024-05-05T00:24:10.165652 #4169020] ERROR -- : $ /tmp/ruby/build/trunk/miniruby -I/tmp/ruby/src/trunk/lib /tmp/ruby/src/trunk/tool/runruby.rb --archdir=/tmp/ruby/build/trunk --extout=.ext -- /tmp/ruby/src/trunk/spec/mspec/bin/mspec-run -B /tmp/ruby/src/trunk/spec/default.mspec --error-output stderr --debug -fy -o /tmp/rubytest.ekouwj/16-mspec-multi-15 E, [2024-05-05T00:24:10.165800 #4169020] ERROR -- : $ /tmp/ruby/build/trunk/miniruby -I/tmp/ruby/src/trunk/lib /tmp/ruby/src/trunk/tool/runruby.rb --archdir=/tmp/ruby/build/trunk --extout=.ext -- /tmp/ruby/src/trunk/spec/mspec/bin/mspec-run -B /tmp/ruby/src/trunk/spec/default.mspec --error-output stderr --debug -fy -o /tmp/rubytest.ekouwj/17-mspec-multi-16 E, [2024-05-05T00:24:10.166027 #4169020] ERROR -- : $ /tmp/ruby/build/trunk/miniruby -I/tmp/ruby/src/trunk/lib /tmp/ruby/src/trunk/tool/runruby.rb --archdir=/tmp/ruby/build/trunk --extout=.ext -- /tmp/ruby/src/trunk/spec/mspec/bin/mspec-run -B /tmp/ruby/src/trunk/spec/default.mspec --error-output stderr --debug -fy -o /tmp/rubytest.ekouwj/18-mspec-multi-17 E, [2024-05-05T00:24:10.168345 #4169020] ERROR -- : $ /tmp/ruby/build/trunk/miniruby -I/tmp/ruby/src/trunk/lib /tmp/ruby/src/trunk/tool/runruby.rb --archdir=/tmp/ruby/build/trunk --extout=.ext -- /tmp/ruby/src/trunk/spec/mspec/bin/mspec-run -B /tmp/ruby/src/trunk/spec/default.mspec --error-output stderr --debug -fy -o /tmp/rubytest.ekouwj/19-mspec-multi-18 E, [2024-05-05T00:24:10.168731 #4169020] ERROR -- : $ /tmp/ruby/build/trunk/miniruby -I/tmp/ruby/src/trunk/lib /tmp/ruby/src/trunk/tool/runruby.rb --archdir=/tmp/ruby/build/trunk --extout=.ext -- /tmp/ruby/src/trunk/spec/mspec/bin/mspec-run -B /tmp/ruby/src/trunk/spec/default.mspec --error-output stderr --debug -fy -o /tmp/rubytest.ekouwj/20-mspec-multi-19 I, [2024-05-05T00:24:10.339656 #4169020] INFO -- : ruby 3.4.0dev (2024-05-04T16:31:58Z master b181ba7400) [x86_64-linux] I, [2024-05-05T00:24:11.009535 #4169020] INFO -- : 0 ......................................................................... I, [2024-05-05T00:24:11.371180 #4169020] INFO -- : 73 ......................................................................... I, [2024-05-05T00:24:11.550023 #4169020] INFO -- : 146 ......................................................................... I, [2024-05-05T00:24:11.595910 #4169020] INFO -- : 219 ......................................................................... I, [2024-05-05T00:24:11.655043 #4169020] INFO -- : 292 ......................................................................... I, [2024-05-05T00:24:11.692677 #4169020] INFO -- : 365 ......................................................................... I, [2024-05-05T00:24:11.712807 #4169020] INFO -- : 438 ......................................................................... I, [2024-05-05T00:24:11.730015 #4169020] INFO -- : 511 ......................................................................... I, [2024-05-05T00:24:11.747931 #4169020] INFO -- : 584 ......................................................................... I, [2024-05-05T00:24:11.824110 #4169020] INFO -- : 657 ......................................................................... I, [2024-05-05T00:24:11.846932 #4169020] INFO -- : 730 ......................................................................... I, [2024-05-05T00:24:11.869415 #4169020] INFO -- : 803 ......................................................................... I, [2024-05-05T00:24:11.903283 #4169020] INFO -- : 876 ......................................................................... I, [2024-05-05T00:24:11.943960 #4169020] INFO -- : 949 ......................................................................... I, [2024-05-05T00:24:12.057761 #4169020] INFO -- : 1022 ......................................................................... I, [2024-05-05T00:24:12.225152 #4169020] INFO -- : 1095 ......................................................................... I, [2024-05-05T00:24:12.328794 #4169020] INFO -- : 1168 ......................................................................... I, [2024-05-05T00:24:12.395997 #4169020] INFO -- : 1241 ......................................................................... I, [2024-05-05T00:24:12.449811 #4169020] INFO -- : 1314 ......................................................................... I, [2024-05-05T00:24:12.473319 #4169020] INFO -- : 1387 ......................................................................... I, [2024-05-05T00:24:12.571207 #4169020] INFO -- : 1460 ......................................................................... I, [2024-05-05T00:24:13.049745 #4169020] INFO -- : 1533 ......................................................................... I, [2024-05-05T00:24:13.117437 #4169020] INFO -- : 1606 ......................................................................... I, [2024-05-05T00:24:13.227773 #4169020] INFO -- : 1679 ......................................................................... I, [2024-05-05T00:24:13.338357 #4169020] INFO -- : 1752 ......................................................................... I, [2024-05-05T00:24:13.430423 #4169020] INFO -- : 1825 ......................................................................... I, [2024-05-05T00:24:13.533727 #4169020] INFO -- : 1898 ......................................................................... I, [2024-05-05T00:24:13.644197 #4169020] INFO -- : 1971 ......................................................................... I, [2024-05-05T00:24:13.714681 #4169020] INFO -- : 2044 ......................................................................... I, [2024-05-05T00:24:13.771029 #4169020] INFO -- : 2117 ......................................................................... I, [2024-05-05T00:24:13.789933 #4169020] INFO -- : 2190 ......................................................................... I, [2024-05-05T00:24:13.811324 #4169020] INFO -- : 2263 ......................................................................... I, [2024-05-05T00:24:13.826913 #4169020] INFO -- : 2336 ......................................................................... I, [2024-05-05T00:24:13.868866 #4169020] INFO -- : 2409 ......................................................................... I, [2024-05-05T00:24:13.972551 #4169020] INFO -- : 2482 ......................................................................... I, [2024-05-05T00:24:13.997839 #4169020] INFO -- : 2555 ......................................................................... I, [2024-05-05T00:24:14.107986 #4169020] INFO -- : 2628 ......................................................................... I, [2024-05-05T00:24:14.215581 #4169020] INFO -- : 2701 ......................................................................... I, [2024-05-05T00:24:14.244968 #4169020] INFO -- : 2774 ......................................................................... I, [2024-05-05T00:24:14.301870 #4169020] INFO -- : 2847 ......................................................................... I, [2024-05-05T00:24:14.332635 #4169020] INFO -- : 2920 ......................................................................... I, [2024-05-05T00:24:14.357383 #4169020] INFO -- : 2993 ......................................................................... I, [2024-05-05T00:24:14.381597 #4169020] INFO -- : 3066 ......................................................................... I, [2024-05-05T00:24:14.396775 #4169020] INFO -- : 3139 ......................................................................... I, [2024-05-05T00:24:14.406375 #4169020] INFO -- : 3212 ......................................................................... I, [2024-05-05T00:24:14.435154 #4169020] INFO -- : 3285 ......................................................................... I, [2024-05-05T00:24:18.403545 #4169020] INFO -- : 3358 ........................................................................ I, [2024-05-05T00:24:18.403624 #4169020] INFO -- : I, [2024-05-05T00:24:18.403639 #4169020] INFO -- : Finished in 8.238489 seconds I, [2024-05-05T00:24:18.403650 #4169020] INFO -- : I, [2024-05-05T00:24:18.403661 #4169020] INFO -- : 3429 files, 32610 examples, 190115 expectations, 0 failures, 0 errors, 0 tagged I, [2024-05-05T00:24:18.406767 #4169020] INFO -- : $$$[end] "make yes-test-rubyspec MSPECOPT='--error-output stderr --debug -j' TESTS='-j20'" exit with 0.