# Logfile created on 2024-05-04 18:58:52 +0000 by logger.rb/v1.4.3 I, [2024-05-04T18:58:52.839132 #3610569] INFO -- : #, @formatter=nil, @logdev=#, @binmode=false, @mon_data=#, @mon_data_owner_object_id=860>>> I, [2024-05-04T18:58:52.839256 #3610569] INFO -- : $$$[beg] make update-unicode -j20 I, [2024-05-04T18:58:52.897834 #3610569] INFO -- : Downloading Unicode emoji 15.0 files... I, [2024-05-04T18:58:52.898005 #3610569] INFO -- : Downloading Unicode emoji 15.0 files... I, [2024-05-04T18:58:52.898602 #3610569] INFO -- : Downloading Unicode emoji 15.0 files... I, [2024-05-04T18:58:52.939284 #3610569] INFO -- : made symlink emoji/15.0/emoji-sequences.txt to /tmp/ruby/src/trunk/.downloaded-cache/emoji/15.0/emoji-sequences.txt I, [2024-05-04T18:58:52.940275 #3610569] INFO -- : downloading emoji/15.0/emoji-sequences.txt ... downloading emoji/15.0/emoji-test.txt ... /tmp/ruby/src/trunk/enc/unicode/data/emoji/15.0/emoji-sequences.txt already exists E, [2024-05-04T18:58:53.373578 #3610569] ERROR -- : /tmp/ruby/src/trunk/tool/downloader.rb:302:in `rescue in download': failed to download emoji/15.0/emoji-test.txt (RuntimeError) E, [2024-05-04T18:58:53.373603 #3610569] ERROR -- : OpenURI::HTTPError: 403 Forbidden: https://www.unicode.org/Public/emoji/15.0/emoji-test.txt E, [2024-05-04T18:58:53.373609 #3610569] ERROR -- : from /tmp/ruby/src/trunk/tool/downloader.rb:201:in `download' E, [2024-05-04T18:58:53.373612 #3610569] ERROR -- : from /tmp/ruby/src/trunk/tool/downloader.rb:136:in `download' E, [2024-05-04T18:58:53.373616 #3610569] ERROR -- : from /tmp/ruby/src/trunk/tool/downloader.rb:482:in `block in
' E, [2024-05-04T18:58:53.373620 #3610569] ERROR -- : from /tmp/ruby/src/trunk/tool/downloader.rb:465:in `each' E, [2024-05-04T18:58:53.373623 #3610569] ERROR -- : from /tmp/ruby/src/trunk/tool/downloader.rb:465:in `
' E, [2024-05-04T18:58:53.373626 #3610569] ERROR -- : /usr/lib/ruby/3.0.0/open-uri.rb:364:in `open_http': 403 Forbidden (OpenURI::HTTPError) E, [2024-05-04T18:58:53.373630 #3610569] ERROR -- : from /usr/lib/ruby/3.0.0/open-uri.rb:741:in `buffer_open' E, [2024-05-04T18:58:53.373634 #3610569] ERROR -- : from /usr/lib/ruby/3.0.0/open-uri.rb:212:in `block in open_loop' E, [2024-05-04T18:58:53.373638 #3610569] ERROR -- : from /usr/lib/ruby/3.0.0/open-uri.rb:210:in `catch' E, [2024-05-04T18:58:53.373641 #3610569] ERROR -- : from /usr/lib/ruby/3.0.0/open-uri.rb:210:in `open_loop' E, [2024-05-04T18:58:53.373644 #3610569] ERROR -- : from /usr/lib/ruby/3.0.0/open-uri.rb:151:in `open_uri' E, [2024-05-04T18:58:53.373647 #3610569] ERROR -- : from /usr/lib/ruby/3.0.0/open-uri.rb:721:in `open' E, [2024-05-04T18:58:53.373651 #3610569] ERROR -- : from /usr/lib/ruby/3.0.0/open-uri.rb:729:in `read' E, [2024-05-04T18:58:53.373654 #3610569] ERROR -- : from /tmp/ruby/src/trunk/tool/downloader.rb:247:in `block in download' E, [2024-05-04T18:58:53.373666 #3610569] ERROR -- : from /tmp/ruby/src/trunk/tool/downloader.rb:378:in `with_retry' E, [2024-05-04T18:58:53.373669 #3610569] ERROR -- : from /tmp/ruby/src/trunk/tool/downloader.rb:246:in `download' E, [2024-05-04T18:58:53.373674 #3610569] ERROR -- : from /tmp/ruby/src/trunk/tool/downloader.rb:136:in `download' E, [2024-05-04T18:58:53.373677 #3610569] ERROR -- : from /tmp/ruby/src/trunk/tool/downloader.rb:482:in `block in
' E, [2024-05-04T18:58:53.373681 #3610569] ERROR -- : from /tmp/ruby/src/trunk/tool/downloader.rb:465:in `each' E, [2024-05-04T18:58:53.373685 #3610569] ERROR -- : from /tmp/ruby/src/trunk/tool/downloader.rb:465:in `
' E, [2024-05-04T18:58:53.373767 #3610569] ERROR -- : /tmp/ruby/src/trunk/tool/downloader.rb:302:in `rescue in download': failed to download emoji/15.0/emoji-test.txt (RuntimeError) E, [2024-05-04T18:58:53.373787 #3610569] ERROR -- : OpenURI::HTTPError: 403 Forbidden: https://www.unicode.org/Public/emoji/15.0/emoji-test.txt E, [2024-05-04T18:58:53.373792 #3610569] ERROR -- : from /tmp/ruby/src/trunk/tool/downloader.rb:201:in `download' E, [2024-05-04T18:58:53.373800 #3610569] ERROR -- : from /tmp/ruby/src/trunk/tool/downloader.rb:136:in `download' E, [2024-05-04T18:58:53.373804 #3610569] ERROR -- : from /tmp/ruby/src/trunk/tool/downloader.rb:482:in `block in
' E, [2024-05-04T18:58:53.373807 #3610569] ERROR -- : from /tmp/ruby/src/trunk/tool/downloader.rb:465:in `each' E, [2024-05-04T18:58:53.373811 #3610569] ERROR -- : from /tmp/ruby/src/trunk/tool/downloader.rb:465:in `
' E, [2024-05-04T18:58:53.373814 #3610569] ERROR -- : /usr/lib/ruby/3.0.0/open-uri.rb:364:in `open_http': 403 Forbidden (OpenURI::HTTPError) E, [2024-05-04T18:58:53.373817 #3610569] ERROR -- : from /usr/lib/ruby/3.0.0/open-uri.rb:741:in `buffer_open' E, [2024-05-04T18:58:53.373821 #3610569] ERROR -- : from /usr/lib/ruby/3.0.0/open-uri.rb:212:in `block in open_loop' E, [2024-05-04T18:58:53.373824 #3610569] ERROR -- : from /usr/lib/ruby/3.0.0/open-uri.rb:210:in `catch' E, [2024-05-04T18:58:53.373828 #3610569] ERROR -- : from /usr/lib/ruby/3.0.0/open-uri.rb:210:in `open_loop' E, [2024-05-04T18:58:53.373833 #3610569] ERROR -- : from /usr/lib/ruby/3.0.0/open-uri.rb:151:in `open_uri' E, [2024-05-04T18:58:53.373836 #3610569] ERROR -- : from /usr/lib/ruby/3.0.0/open-uri.rb:721:in `open' E, [2024-05-04T18:58:53.373839 #3610569] ERROR -- : from /usr/lib/ruby/3.0.0/open-uri.rb:729:in `read' E, [2024-05-04T18:58:53.373843 #3610569] ERROR -- : from /tmp/ruby/src/trunk/tool/downloader.rb:247:in `block in download' E, [2024-05-04T18:58:53.373846 #3610569] ERROR -- : from /tmp/ruby/src/trunk/tool/downloader.rb:378:in `with_retry' E, [2024-05-04T18:58:53.373849 #3610569] ERROR -- : from /tmp/ruby/src/trunk/tool/downloader.rb:246:in `download' E, [2024-05-04T18:58:53.373852 #3610569] ERROR -- : from /tmp/ruby/src/trunk/tool/downloader.rb:136:in `download' E, [2024-05-04T18:58:53.373856 #3610569] ERROR -- : from /tmp/ruby/src/trunk/tool/downloader.rb:482:in `block in
' E, [2024-05-04T18:58:53.373860 #3610569] ERROR -- : from /tmp/ruby/src/trunk/tool/downloader.rb:465:in `each' E, [2024-05-04T18:58:53.373863 #3610569] ERROR -- : from /tmp/ruby/src/trunk/tool/downloader.rb:465:in `
' E, [2024-05-04T18:58:53.375976 #3610569] ERROR -- : make: *** [uncommon.mk:1787: /tmp/ruby/src/trunk/enc/unicode/data/emoji/15.0/emoji-sequences.txt] Error 1 E, [2024-05-04T18:58:53.375996 #3610569] ERROR -- : make: *** Deleting file '/tmp/ruby/src/trunk/enc/unicode/data/emoji/15.0/emoji-sequences.txt' E, [2024-05-04T18:58:53.376001 #3610569] ERROR -- : make: *** Waiting for unfinished jobs.... E, [2024-05-04T18:58:53.376005 #3610569] ERROR -- : make: *** [uncommon.mk:1787: /tmp/ruby/src/trunk/enc/unicode/data/emoji/15.0/emoji-zwj-sequences.txt] Error 1 E, [2024-05-04T18:58:53.811894 #3610569] ERROR -- : /tmp/ruby/src/trunk/tool/downloader.rb:302:in `rescue in download': failed to download emoji/15.0/emoji-sequences.txt (RuntimeError) E, [2024-05-04T18:58:53.812041 #3610569] ERROR -- : EOFError: end of file reached: https://www.unicode.org/Public/emoji/15.0/emoji-sequences.txt E, [2024-05-04T18:58:53.812047 #3610569] ERROR -- : from /tmp/ruby/src/trunk/tool/downloader.rb:201:in `download' E, [2024-05-04T18:58:53.812051 #3610569] ERROR -- : from /tmp/ruby/src/trunk/tool/downloader.rb:136:in `download' E, [2024-05-04T18:58:53.812054 #3610569] ERROR -- : from /tmp/ruby/src/trunk/tool/downloader.rb:482:in `block in
' E, [2024-05-04T18:58:53.812057 #3610569] ERROR -- : from /tmp/ruby/src/trunk/tool/downloader.rb:465:in `each' E, [2024-05-04T18:58:53.812061 #3610569] ERROR -- : from /tmp/ruby/src/trunk/tool/downloader.rb:465:in `
' E, [2024-05-04T18:58:53.812064 #3610569] ERROR -- : /usr/lib/ruby/3.0.0/net/protocol.rb:227:in `rbuf_fill': end of file reached (EOFError) E, [2024-05-04T18:58:53.812069 #3610569] ERROR -- : from /usr/lib/ruby/3.0.0/net/protocol.rb:193:in `readuntil' E, [2024-05-04T18:58:53.812073 #3610569] ERROR -- : from /usr/lib/ruby/3.0.0/net/protocol.rb:203:in `readline' E, [2024-05-04T18:58:53.812076 #3610569] ERROR -- : from /usr/lib/ruby/3.0.0/net/http/response.rb:42:in `read_status_line' E, [2024-05-04T18:58:53.812079 #3610569] ERROR -- : from /usr/lib/ruby/3.0.0/net/http/response.rb:31:in `read_new' E, [2024-05-04T18:58:53.812083 #3610569] ERROR -- : from /usr/lib/ruby/3.0.0/net/http.rb:1557:in `block in transport_request' E, [2024-05-04T18:58:53.812086 #3610569] ERROR -- : from /usr/lib/ruby/3.0.0/net/http.rb:1548:in `catch' E, [2024-05-04T18:58:53.812089 #3610569] ERROR -- : from /usr/lib/ruby/3.0.0/net/http.rb:1548:in `transport_request' E, [2024-05-04T18:58:53.812189 #3610569] ERROR -- : from /usr/lib/ruby/3.0.0/net/http.rb:1521:in `request' E, [2024-05-04T18:58:53.812193 #3610569] ERROR -- : from /usr/lib/ruby/3.0.0/open-uri.rb:329:in `block in open_http' E, [2024-05-04T18:58:53.812196 #3610569] ERROR -- : from /usr/lib/ruby/3.0.0/net/http.rb:960:in `start' E, [2024-05-04T18:58:53.812199 #3610569] ERROR -- : from /usr/lib/ruby/3.0.0/open-uri.rb:323:in `open_http' E, [2024-05-04T18:58:53.812203 #3610569] ERROR -- : from /usr/lib/ruby/3.0.0/open-uri.rb:741:in `buffer_open' E, [2024-05-04T18:58:53.812207 #3610569] ERROR -- : from /usr/lib/ruby/3.0.0/open-uri.rb:212:in `block in open_loop' E, [2024-05-04T18:58:53.812211 #3610569] ERROR -- : from /usr/lib/ruby/3.0.0/open-uri.rb:210:in `catch' E, [2024-05-04T18:58:53.812214 #3610569] ERROR -- : from /usr/lib/ruby/3.0.0/open-uri.rb:210:in `open_loop' E, [2024-05-04T18:58:53.812217 #3610569] ERROR -- : from /usr/lib/ruby/3.0.0/open-uri.rb:151:in `open_uri' E, [2024-05-04T18:58:53.812221 #3610569] ERROR -- : from /usr/lib/ruby/3.0.0/open-uri.rb:721:in `open' E, [2024-05-04T18:58:53.812224 #3610569] ERROR -- : from /usr/lib/ruby/3.0.0/open-uri.rb:729:in `read' E, [2024-05-04T18:58:53.812227 #3610569] ERROR -- : from /tmp/ruby/src/trunk/tool/downloader.rb:247:in `block in download' E, [2024-05-04T18:58:53.812231 #3610569] ERROR -- : from /tmp/ruby/src/trunk/tool/downloader.rb:378:in `with_retry' E, [2024-05-04T18:58:53.812234 #3610569] ERROR -- : from /tmp/ruby/src/trunk/tool/downloader.rb:246:in `download' E, [2024-05-04T18:58:53.812238 #3610569] ERROR -- : from /tmp/ruby/src/trunk/tool/downloader.rb:136:in `download' E, [2024-05-04T18:58:53.812242 #3610569] ERROR -- : from /tmp/ruby/src/trunk/tool/downloader.rb:482:in `block in
' E, [2024-05-04T18:58:53.812245 #3610569] ERROR -- : from /tmp/ruby/src/trunk/tool/downloader.rb:465:in `each' E, [2024-05-04T18:58:53.812248 #3610569] ERROR -- : from /tmp/ruby/src/trunk/tool/downloader.rb:465:in `
' E, [2024-05-04T18:58:53.814174 #3610569] ERROR -- : make: *** [uncommon.mk:1787: /tmp/ruby/src/trunk/enc/unicode/data/emoji/15.0/emoji-test.txt] Error 1 I, [2024-05-04T18:58:53.814214 #3610569] INFO -- : downloading emoji/15.0/emoji-test.txt ... I, [2024-05-04T18:58:53.814617 #3610569] INFO -- : $$$[end] "make update-unicode -j20" exit with 512. I, [2024-05-04T18:58:53.814641 #3610569] INFO -- : $$$[beg] make update-download -j20 I, [2024-05-04T18:58:53.913614 #3610569] INFO -- : tool/config.guess already exists I, [2024-05-04T18:58:53.913670 #3610569] INFO -- : tool/config.sub already exists I, [2024-05-04T18:58:53.915921 #3610569] INFO -- : Update minitest to ea9caafc0754b1d6236a490d59e624b53209734a I, [2024-05-04T18:58:53.916071 #3610569] INFO -- : Update power_assert to 84e85124c5014a139af39161d484156cfe87a9ed I, [2024-05-04T18:58:53.916427 #3610569] INFO -- : Update rbs to ba7872795d5de04adb8ff500c0e6afdc81a041dd I, [2024-05-04T18:58:53.916980 #3610569] INFO -- : Update typeprof to b19a6416da3a05d57fadd6ffdadb382b6d236ca5 I, [2024-05-04T18:58:53.917251 #3610569] INFO -- : echo ea9caafc0754b1d6236a490d59e624b53209734a | /bin/sh /tmp/ruby/src/trunk/tool/ifchange /tmp/ruby/src/trunk/.bundle/.timestamp/minitest.revision - I, [2024-05-04T18:58:53.917428 #3610569] INFO -- : echo ba7872795d5de04adb8ff500c0e6afdc81a041dd | /bin/sh /tmp/ruby/src/trunk/tool/ifchange /tmp/ruby/src/trunk/.bundle/.timestamp/rbs.revision - I, [2024-05-04T18:58:53.917592 #3610569] INFO -- : echo 84e85124c5014a139af39161d484156cfe87a9ed | /bin/sh /tmp/ruby/src/trunk/tool/ifchange /tmp/ruby/src/trunk/.bundle/.timestamp/power_assert.revision - I, [2024-05-04T18:58:53.918112 #3610569] INFO -- : echo b19a6416da3a05d57fadd6ffdadb382b6d236ca5 | /bin/sh /tmp/ruby/src/trunk/tool/ifchange /tmp/ruby/src/trunk/.bundle/.timestamp/typeprof.revision - I, [2024-05-04T18:58:53.919032 #3610569] INFO -- : /tmp/ruby/src/trunk/.bundle/.timestamp/minitest.revision unchanged I, [2024-05-04T18:58:53.919152 #3610569] INFO -- : /tmp/ruby/src/trunk/.bundle/.timestamp/rbs.revision unchanged I, [2024-05-04T18:58:53.919618 #3610569] INFO -- : /tmp/ruby/src/trunk/.bundle/.timestamp/power_assert.revision unchanged I, [2024-05-04T18:58:53.919818 #3610569] INFO -- : /tmp/ruby/src/trunk/.bundle/.timestamp/typeprof.revision unchanged I, [2024-05-04T18:58:53.920818 #3610569] INFO -- : Building power_assert@84e85124c5014a139af39161d484156cfe87a9ed to /tmp/ruby/src/trunk/gems/power_assert-2.0.3.gem I, [2024-05-04T18:58:53.989740 #3610569] INFO -- : Successfully built RubyGem I, [2024-05-04T18:58:53.989801 #3610569] INFO -- : Name: power_assert I, [2024-05-04T18:58:53.989822 #3610569] INFO -- : Version: 2.0.4dev I, [2024-05-04T18:58:53.989835 #3610569] INFO -- : File: power_assert-2.0.4dev.gem I, [2024-05-04T18:58:54.035365 #3610569] INFO -- : $$$[end] "make update-download -j20" exit with 0. I, [2024-05-04T18:58:54.035413 #3610569] INFO -- : $$$[beg] make update-rubyspec -j20 I, [2024-05-04T18:58:54.092136 #3610569] INFO -- : make: Nothing to be done for 'update-rubyspec'. I, [2024-05-04T18:58:54.092400 #3610569] INFO -- : $$$[end] "make update-rubyspec -j20" exit with 0. I, [2024-05-04T18:58:54.092425 #3610569] INFO -- : $$$[beg] make update-src -j20 I, [2024-05-04T18:58:54.615740 #3610569] INFO -- : Already up to date. I, [2024-05-04T18:58:54.625197 #3610569] INFO -- : Latest commit hash = b181ba7400 I, [2024-05-04T18:58:54.626094 #3610569] INFO -- : $$$[end] "make update-src -j20" exit with 0. I, [2024-05-04T18:58:54.626133 #3610569] INFO -- : $$$[beg] make after-update -j20 I, [2024-05-04T18:58:54.694847 #3610569] INFO -- : generating /tmp/ruby/src/trunk/ext/ripper/eventids2table.c I, [2024-05-04T18:58:54.699105 #3610569] INFO -- : make[1]: Entering directory '/tmp/ruby/src/trunk/ext/ripper' I, [2024-05-04T18:58:54.699152 #3610569] INFO -- : make[1]: Nothing to be done for 'src'. I, [2024-05-04T18:58:54.699164 #3610569] INFO -- : make[1]: Leaving directory '/tmp/ruby/src/trunk/ext/ripper' I, [2024-05-04T18:58:54.715757 #3610569] INFO -- : /tmp/ruby/src/trunk/revision.h updated I, [2024-05-04T18:58:54.717110 #3610569] INFO -- : generating x86_64-linux-fake.rb I, [2024-05-04T18:58:54.768017 #3610569] INFO -- : x86_64-linux-fake.rb updated I, [2024-05-04T18:58:54.769448 #3610569] INFO -- : generating enc.mk I, [2024-05-04T18:58:54.888069 #3610569] INFO -- : making srcs under enc I, [2024-05-04T18:58:54.918200 #3610569] INFO -- : make[1]: Entering directory '/tmp/ruby/build/trunk' I, [2024-05-04T18:58:54.918263 #3610569] INFO -- : make[1]: Nothing to be done for 'srcs'. I, [2024-05-04T18:58:54.918268 #3610569] INFO -- : make[1]: Leaving directory '/tmp/ruby/build/trunk' I, [2024-05-04T18:58:54.963349 #3610569] INFO -- : Update minitest to ea9caafc0754b1d6236a490d59e624b53209734a I, [2024-05-04T18:58:54.963690 #3610569] INFO -- : Update power_assert to 84e85124c5014a139af39161d484156cfe87a9ed I, [2024-05-04T18:58:54.963959 #3610569] INFO -- : Update rbs to ba7872795d5de04adb8ff500c0e6afdc81a041dd I, [2024-05-04T18:58:54.964066 #3610569] INFO -- : Update typeprof to b19a6416da3a05d57fadd6ffdadb382b6d236ca5 I, [2024-05-04T18:58:54.964680 #3610569] INFO -- : echo 84e85124c5014a139af39161d484156cfe87a9ed | /bin/sh /tmp/ruby/src/trunk/tool/ifchange /tmp/ruby/src/trunk/.bundle/.timestamp/power_assert.revision - I, [2024-05-04T18:58:54.964840 #3610569] INFO -- : echo ea9caafc0754b1d6236a490d59e624b53209734a | /bin/sh /tmp/ruby/src/trunk/tool/ifchange /tmp/ruby/src/trunk/.bundle/.timestamp/minitest.revision - I, [2024-05-04T18:58:54.965641 #3610569] INFO -- : echo ba7872795d5de04adb8ff500c0e6afdc81a041dd | /bin/sh /tmp/ruby/src/trunk/tool/ifchange /tmp/ruby/src/trunk/.bundle/.timestamp/rbs.revision - I, [2024-05-04T18:58:54.965932 #3610569] INFO -- : echo b19a6416da3a05d57fadd6ffdadb382b6d236ca5 | /bin/sh /tmp/ruby/src/trunk/tool/ifchange /tmp/ruby/src/trunk/.bundle/.timestamp/typeprof.revision - I, [2024-05-04T18:58:54.966588 #3610569] INFO -- : /tmp/ruby/src/trunk/.bundle/.timestamp/power_assert.revision unchanged I, [2024-05-04T18:58:54.966727 #3610569] INFO -- : /tmp/ruby/src/trunk/.bundle/.timestamp/minitest.revision unchanged I, [2024-05-04T18:58:54.967392 #3610569] INFO -- : /tmp/ruby/src/trunk/.bundle/.timestamp/rbs.revision unchanged I, [2024-05-04T18:58:54.967414 #3610569] INFO -- : Building power_assert@84e85124c5014a139af39161d484156cfe87a9ed to /tmp/ruby/src/trunk/gems/power_assert-2.0.3.gem I, [2024-05-04T18:58:54.967579 #3610569] INFO -- : /tmp/ruby/src/trunk/.bundle/.timestamp/typeprof.revision unchanged I, [2024-05-04T18:58:55.036726 #3610569] INFO -- : Successfully built RubyGem I, [2024-05-04T18:58:55.036793 #3610569] INFO -- : Name: power_assert I, [2024-05-04T18:58:55.036811 #3610569] INFO -- : Version: 2.0.4dev I, [2024-05-04T18:58:55.036834 #3610569] INFO -- : File: power_assert-2.0.4dev.gem I, [2024-05-04T18:58:55.039059 #3610569] INFO -- : Extracting bundle gem power_assert-2.0.3... I, [2024-05-04T18:58:55.100134 #3610569] INFO -- : Try with hash version of bundled gems instead of gems/power_assert-2.0.3.gem. We don't use this gem with release version of Ruby. I, [2024-05-04T18:58:55.105132 #3610569] INFO -- : Unpacked gems/power_assert-2.0.4dev.gem I, [2024-05-04T18:58:55.106990 #3610569] INFO -- : $$$[end] "make after-update -j20" exit with 0. I, [2024-05-04T18:58:55.107131 #3610569] INFO -- : $$$[beg] make miniruby -j20 I, [2024-05-04T18:58:55.163205 #3610569] INFO -- : BASERUBY = /usr/bin/ruby --disable=gems I, [2024-05-04T18:58:55.163247 #3610569] INFO -- : CC = gcc I, [2024-05-04T18:58:55.163260 #3610569] INFO -- : LD = ld I, [2024-05-04T18:58:55.163271 #3610569] INFO -- : LDSHARED = gcc -shared I, [2024-05-04T18:58:55.163281 #3610569] INFO -- : CFLAGS = -O3 -fno-fast-math -ggdb3 -Wall -Wextra -Wdeprecated-declarations -Wdiv-by-zero -Wduplicated-cond -Wimplicit-function-declaration -Wimplicit-int -Wpointer-arith -Wwrite-strings -Wold-style-definition -Wimplicit-fallthrough=0 -Wmissing-noreturn -Wno-cast-function-type -Wno-constant-logical-operand -Wno-long-long -Wno-missing-field-initializers -Wno-overlength-strings -Wno-packed-bitfield-compat -Wno-parentheses-equality -Wno-self-assign -Wno-tautological-compare -Wno-unused-parameter -Wno-unused-value -Wsuggest-attribute=format -Wsuggest-attribute=noreturn -Wunused-variable -Wmisleading-indentation -Wundef -fPIC I, [2024-05-04T18:58:55.163292 #3610569] INFO -- : XCFLAGS = -U_FORTIFY_SOURCE -D_FORTIFY_SOURCE=2 -fstack-protector-strong -fno-strict-overflow -fvisibility=hidden -fexcess-precision=standard -DRUBY_EXPORT -I. -I.ext/include/x86_64-linux -I/tmp/ruby/src/trunk/include -I/tmp/ruby/src/trunk -I/tmp/ruby/src/trunk/prism -I/tmp/ruby/src/trunk/enc/unicode/15.0.0 I, [2024-05-04T18:58:55.163312 #3610569] INFO -- : CPPFLAGS = I, [2024-05-04T18:58:55.163323 #3610569] INFO -- : DLDFLAGS = -Wl,--compress-debug-sections=zlib -Wl,-soname,libruby.so.3.4 -fstack-protector-strong I, [2024-05-04T18:58:55.163334 #3610569] INFO -- : SOLIBS = -lz -lrt -lrt -lgmp -ldl -lcrypt -lm -lpthread I, [2024-05-04T18:58:55.163344 #3610569] INFO -- : LANG = en_US.UTF-8 I, [2024-05-04T18:58:55.163354 #3610569] INFO -- : LC_ALL = I, [2024-05-04T18:58:55.163363 #3610569] INFO -- : LC_CTYPE = I, [2024-05-04T18:58:55.163373 #3610569] INFO -- : MFLAGS = -j20 --jobserver-auth=4,5 I, [2024-05-04T18:58:55.163383 #3610569] INFO -- : RUSTC = no I, [2024-05-04T18:58:55.163393 #3610569] INFO -- : YJIT_RUSTC_ARGS = --crate-name=yjit --crate-type=staticlib --edition=2021 -g -C lto=thin -C opt-level=3 -C overflow-checks=on '--out-dir=/tmp/ruby/build/trunk/yjit/target/release/' /tmp/ruby/src/trunk/yjit/src/lib.rs I, [2024-05-04T18:58:55.164579 #3610569] INFO -- : gcc (Ubuntu 11.4.0-1ubuntu1~22.04) 11.4.0 I, [2024-05-04T18:58:55.164622 #3610569] INFO -- : Copyright (C) 2021 Free Software Foundation, Inc. I, [2024-05-04T18:58:55.164635 #3610569] INFO -- : This is free software; see the source for copying conditions. There is NO I, [2024-05-04T18:58:55.164646 #3610569] INFO -- : warranty; not even for MERCHANTABILITY or FITNESS FOR A PARTICULAR PURPOSE. I, [2024-05-04T18:58:55.164656 #3610569] INFO -- : I, [2024-05-04T18:58:55.185220 #3610569] INFO -- : compiling /tmp/ruby/src/trunk/version.c I, [2024-05-04T18:58:55.287879 #3610569] INFO -- : linking miniruby I, [2024-05-04T18:58:55.815526 #3610569] INFO -- : $$$[end] "make miniruby -j20" exit with 0. I, [2024-05-04T18:58:55.815651 #3610569] INFO -- : $$$[beg] make ruby -j20 I, [2024-05-04T18:58:55.873184 #3610569] INFO -- : BASERUBY = /usr/bin/ruby --disable=gems I, [2024-05-04T18:58:55.873225 #3610569] INFO -- : CC = gcc I, [2024-05-04T18:58:55.873238 #3610569] INFO -- : LD = ld I, [2024-05-04T18:58:55.873249 #3610569] INFO -- : LDSHARED = gcc -shared I, [2024-05-04T18:58:55.873265 #3610569] INFO -- : CFLAGS = -O3 -fno-fast-math -ggdb3 -Wall -Wextra -Wdeprecated-declarations -Wdiv-by-zero -Wduplicated-cond -Wimplicit-function-declaration -Wimplicit-int -Wpointer-arith -Wwrite-strings -Wold-style-definition -Wimplicit-fallthrough=0 -Wmissing-noreturn -Wno-cast-function-type -Wno-constant-logical-operand -Wno-long-long -Wno-missing-field-initializers -Wno-overlength-strings -Wno-packed-bitfield-compat -Wno-parentheses-equality -Wno-self-assign -Wno-tautological-compare -Wno-unused-parameter -Wno-unused-value -Wsuggest-attribute=format -Wsuggest-attribute=noreturn -Wunused-variable -Wmisleading-indentation -Wundef -fPIC I, [2024-05-04T18:58:55.873278 #3610569] INFO -- : XCFLAGS = -U_FORTIFY_SOURCE -D_FORTIFY_SOURCE=2 -fstack-protector-strong -fno-strict-overflow -fvisibility=hidden -fexcess-precision=standard -DRUBY_EXPORT -I. -I.ext/include/x86_64-linux -I/tmp/ruby/src/trunk/include -I/tmp/ruby/src/trunk -I/tmp/ruby/src/trunk/prism -I/tmp/ruby/src/trunk/enc/unicode/15.0.0 I, [2024-05-04T18:58:55.873288 #3610569] INFO -- : CPPFLAGS = I, [2024-05-04T18:58:55.873299 #3610569] INFO -- : DLDFLAGS = -Wl,--compress-debug-sections=zlib -Wl,-soname,libruby.so.3.4 -fstack-protector-strong I, [2024-05-04T18:58:55.873309 #3610569] INFO -- : SOLIBS = -lz -lrt -lrt -lgmp -ldl -lcrypt -lm -lpthread I, [2024-05-04T18:58:55.873319 #3610569] INFO -- : LANG = en_US.UTF-8 I, [2024-05-04T18:58:55.873328 #3610569] INFO -- : LC_ALL = I, [2024-05-04T18:58:55.873338 #3610569] INFO -- : LC_CTYPE = I, [2024-05-04T18:58:55.873348 #3610569] INFO -- : MFLAGS = -j20 --jobserver-auth=4,5 I, [2024-05-04T18:58:55.873358 #3610569] INFO -- : RUSTC = no I, [2024-05-04T18:58:55.873369 #3610569] INFO -- : YJIT_RUSTC_ARGS = --crate-name=yjit --crate-type=staticlib --edition=2021 -g -C lto=thin -C opt-level=3 -C overflow-checks=on '--out-dir=/tmp/ruby/build/trunk/yjit/target/release/' /tmp/ruby/src/trunk/yjit/src/lib.rs I, [2024-05-04T18:58:55.874555 #3610569] INFO -- : gcc (Ubuntu 11.4.0-1ubuntu1~22.04) 11.4.0 I, [2024-05-04T18:58:55.874600 #3610569] INFO -- : Copyright (C) 2021 Free Software Foundation, Inc. I, [2024-05-04T18:58:55.874614 #3610569] INFO -- : This is free software; see the source for copying conditions. There is NO I, [2024-05-04T18:58:55.874624 #3610569] INFO -- : warranty; not even for MERCHANTABILITY or FITNESS FOR A PARTICULAR PURPOSE. I, [2024-05-04T18:58:55.874634 #3610569] INFO -- : I, [2024-05-04T18:58:55.985842 #3610569] INFO -- : builtin_binary.inc updated I, [2024-05-04T18:58:55.990330 #3610569] INFO -- : c5234a9416e4f20f175185e840b25b0f08674d14078ed7083f37e655458e3ca9 builtin_binary.inc I, [2024-05-04T18:58:55.991076 #3610569] INFO -- : compiling /tmp/ruby/src/trunk/builtin.c I, [2024-05-04T18:58:56.175418 #3610569] INFO -- : linking static-library libruby-static.a I, [2024-05-04T18:58:56.493547 #3610569] INFO -- : linking shared-library libruby.so.3.4.0 I, [2024-05-04T18:58:58.077203 #3610569] INFO -- : linking ruby I, [2024-05-04T18:58:58.100551 #3610569] INFO -- : $$$[end] "make ruby -j20" exit with 0. I, [2024-05-04T18:58:58.100703 #3610569] INFO -- : $$$[beg] make all -j20 I, [2024-05-04T18:58:58.157681 #3610569] INFO -- : BASERUBY = /usr/bin/ruby --disable=gems I, [2024-05-04T18:58:58.157722 #3610569] INFO -- : CC = gcc I, [2024-05-04T18:58:58.157735 #3610569] INFO -- : LD = ld I, [2024-05-04T18:58:58.157746 #3610569] INFO -- : LDSHARED = gcc -shared I, [2024-05-04T18:58:58.157756 #3610569] INFO -- : CFLAGS = -O3 -fno-fast-math -ggdb3 -Wall -Wextra -Wdeprecated-declarations -Wdiv-by-zero -Wduplicated-cond -Wimplicit-function-declaration -Wimplicit-int -Wpointer-arith -Wwrite-strings -Wold-style-definition -Wimplicit-fallthrough=0 -Wmissing-noreturn -Wno-cast-function-type -Wno-constant-logical-operand -Wno-long-long -Wno-missing-field-initializers -Wno-overlength-strings -Wno-packed-bitfield-compat -Wno-parentheses-equality -Wno-self-assign -Wno-tautological-compare -Wno-unused-parameter -Wno-unused-value -Wsuggest-attribute=format -Wsuggest-attribute=noreturn -Wunused-variable -Wmisleading-indentation -Wundef -fPIC I, [2024-05-04T18:58:58.157770 #3610569] INFO -- : XCFLAGS = -U_FORTIFY_SOURCE -D_FORTIFY_SOURCE=2 -fstack-protector-strong -fno-strict-overflow -fvisibility=hidden -fexcess-precision=standard -DRUBY_EXPORT -I. -I.ext/include/x86_64-linux -I/tmp/ruby/src/trunk/include -I/tmp/ruby/src/trunk -I/tmp/ruby/src/trunk/prism -I/tmp/ruby/src/trunk/enc/unicode/15.0.0 I, [2024-05-04T18:58:58.157781 #3610569] INFO -- : CPPFLAGS = I, [2024-05-04T18:58:58.157791 #3610569] INFO -- : DLDFLAGS = -Wl,--compress-debug-sections=zlib -Wl,-soname,libruby.so.3.4 -fstack-protector-strong I, [2024-05-04T18:58:58.157801 #3610569] INFO -- : SOLIBS = -lz -lrt -lrt -lgmp -ldl -lcrypt -lm -lpthread I, [2024-05-04T18:58:58.157811 #3610569] INFO -- : LANG = en_US.UTF-8 I, [2024-05-04T18:58:58.157821 #3610569] INFO -- : LC_ALL = I, [2024-05-04T18:58:58.157831 #3610569] INFO -- : LC_CTYPE = I, [2024-05-04T18:58:58.157841 #3610569] INFO -- : MFLAGS = -j20 --jobserver-auth=4,5 I, [2024-05-04T18:58:58.157851 #3610569] INFO -- : RUSTC = no I, [2024-05-04T18:58:58.157863 #3610569] INFO -- : YJIT_RUSTC_ARGS = --crate-name=yjit --crate-type=staticlib --edition=2021 -g -C lto=thin -C opt-level=3 -C overflow-checks=on '--out-dir=/tmp/ruby/build/trunk/yjit/target/release/' /tmp/ruby/src/trunk/yjit/src/lib.rs I, [2024-05-04T18:58:58.159097 #3610569] INFO -- : gcc (Ubuntu 11.4.0-1ubuntu1~22.04) 11.4.0 I, [2024-05-04T18:58:58.159140 #3610569] INFO -- : Copyright (C) 2021 Free Software Foundation, Inc. I, [2024-05-04T18:58:58.159153 #3610569] INFO -- : This is free software; see the source for copying conditions. There is NO I, [2024-05-04T18:58:58.159164 #3610569] INFO -- : warranty; not even for MERCHANTABILITY or FITNESS FOR A PARTICULAR PURPOSE. I, [2024-05-04T18:58:58.159255 #3610569] INFO -- : I, [2024-05-04T18:58:58.189938 #3610569] INFO -- : generating enc.mk I, [2024-05-04T18:58:58.191931 #3610569] INFO -- : building spec/ruby/optional/capi/ext/array_spec.so I, [2024-05-04T18:58:58.192158 #3610569] INFO -- : building spec/ruby/optional/capi/ext/basic_object_spec.so I, [2024-05-04T18:58:58.192379 #3610569] INFO -- : building spec/ruby/optional/capi/ext/bignum_spec.so I, [2024-05-04T18:58:58.192694 #3610569] INFO -- : building spec/ruby/optional/capi/ext/binding_spec.so I, [2024-05-04T18:58:58.193739 #3610569] INFO -- : building spec/ruby/optional/capi/ext/boolean_spec.so I, [2024-05-04T18:58:58.194487 #3610569] INFO -- : building spec/ruby/optional/capi/ext/class_id_under_autoload_spec.so I, [2024-05-04T18:58:58.195049 #3610569] INFO -- : building spec/ruby/optional/capi/ext/class_spec.so I, [2024-05-04T18:58:58.195733 #3610569] INFO -- : building spec/ruby/optional/capi/ext/class_under_autoload_spec.so I, [2024-05-04T18:58:58.196366 #3610569] INFO -- : building spec/ruby/optional/capi/ext/complex_spec.so I, [2024-05-04T18:58:58.196784 #3610569] INFO -- : building spec/ruby/optional/capi/ext/constants_spec.so I, [2024-05-04T18:58:58.197700 #3610569] INFO -- : building spec/ruby/optional/capi/ext/data_spec.so I, [2024-05-04T18:58:58.198590 #3610569] INFO -- : building spec/ruby/optional/capi/ext/debug_spec.so I, [2024-05-04T18:58:58.198938 #3610569] INFO -- : building spec/ruby/optional/capi/ext/encoding_spec.so I, [2024-05-04T18:58:58.199589 #3610569] INFO -- : building spec/ruby/optional/capi/ext/enumerator_spec.so I, [2024-05-04T18:58:58.199858 #3610569] INFO -- : building spec/ruby/optional/capi/ext/exception_spec.so I, [2024-05-04T18:58:58.200540 #3610569] INFO -- : building spec/ruby/optional/capi/ext/fiber_spec.so I, [2024-05-04T18:58:58.200841 #3610569] INFO -- : building spec/ruby/optional/capi/ext/file_spec.so I, [2024-05-04T18:58:58.202197 #3610569] INFO -- : building spec/ruby/optional/capi/ext/fixnum_spec.so I, [2024-05-04T18:58:58.213138 #3610569] INFO -- : building spec/ruby/optional/capi/ext/float_spec.so I, [2024-05-04T18:58:58.327569 #3610569] INFO -- : building spec/ruby/optional/capi/ext/gc_spec.so I, [2024-05-04T18:58:58.330768 #3610569] INFO -- : building spec/ruby/optional/capi/ext/globals_spec.so I, [2024-05-04T18:58:58.331341 #3610569] INFO -- : building spec/ruby/optional/capi/ext/hash_spec.so I, [2024-05-04T18:58:58.341411 #3610569] INFO -- : building spec/ruby/optional/capi/ext/integer_spec.so I, [2024-05-04T18:58:58.351797 #3610569] INFO -- : building spec/ruby/optional/capi/ext/io_spec.so I, [2024-05-04T18:58:58.352046 #3610569] INFO -- : building spec/ruby/optional/capi/ext/kernel_spec.so I, [2024-05-04T18:58:58.361757 #3610569] INFO -- : building spec/ruby/optional/capi/ext/language_spec.so I, [2024-05-04T18:58:58.366296 #3610569] INFO -- : building spec/ruby/optional/capi/ext/marshal_spec.so I, [2024-05-04T18:58:58.367438 #3610569] INFO -- : building spec/ruby/optional/capi/ext/module_spec.so I, [2024-05-04T18:58:58.373029 #3610569] INFO -- : building spec/ruby/optional/capi/ext/module_under_autoload_spec.so I, [2024-05-04T18:58:58.375252 #3610569] INFO -- : building spec/ruby/optional/capi/ext/mutex_spec.so I, [2024-05-04T18:58:58.395511 #3610569] INFO -- : building spec/ruby/optional/capi/ext/numeric_spec.so I, [2024-05-04T18:58:58.398438 #3610569] INFO -- : building spec/ruby/optional/capi/ext/object_spec.so I, [2024-05-04T18:58:58.413782 #3610569] INFO -- : building spec/ruby/optional/capi/ext/proc_spec.so I, [2024-05-04T18:58:58.423301 #3610569] INFO -- : building spec/ruby/optional/capi/ext/range_spec.so I, [2024-05-04T18:58:58.448286 #3610569] INFO -- : building spec/ruby/optional/capi/ext/rational_spec.so I, [2024-05-04T18:58:58.477721 #3610569] INFO -- : building spec/ruby/optional/capi/ext/rbasic_spec.so I, [2024-05-04T18:58:58.501399 #3610569] INFO -- : building spec/ruby/optional/capi/ext/regexp_spec.so I, [2024-05-04T18:58:58.501745 #3610569] INFO -- : building spec/ruby/optional/capi/ext/string_spec.so I, [2024-05-04T18:58:58.502222 #3610569] INFO -- : building spec/ruby/optional/capi/ext/struct_spec.so I, [2024-05-04T18:58:58.502514 #3610569] INFO -- : building spec/ruby/optional/capi/ext/st_spec.so I, [2024-05-04T18:58:58.513273 #3610569] INFO -- : building spec/ruby/optional/capi/ext/symbol_spec.so I, [2024-05-04T18:58:58.513777 #3610569] INFO -- : building spec/ruby/optional/capi/ext/thread_spec.so I, [2024-05-04T18:58:58.529638 #3610569] INFO -- : building spec/ruby/optional/capi/ext/time_spec.so I, [2024-05-04T18:58:58.531536 #3610569] INFO -- : building spec/ruby/optional/capi/ext/tracepoint_spec.so I, [2024-05-04T18:58:58.534332 #3610569] INFO -- : building spec/ruby/optional/capi/ext/typed_data_spec.so I, [2024-05-04T18:58:58.568177 #3610569] INFO -- : building spec/ruby/optional/capi/ext/util_spec.so I, [2024-05-04T18:58:58.588975 #3610569] INFO -- : making enc I, [2024-05-04T18:58:58.596390 #3610569] INFO -- : making srcs under enc I, [2024-05-04T18:58:58.615415 #3610569] INFO -- : make[1]: Entering directory '/tmp/ruby/build/trunk' I, [2024-05-04T18:58:58.615486 #3610569] INFO -- : make[1]: Nothing to be done for 'enc'. I, [2024-05-04T18:58:58.615511 #3610569] INFO -- : make[1]: Leaving directory '/tmp/ruby/build/trunk' I, [2024-05-04T18:58:58.643749 #3610569] INFO -- : make[1]: Entering directory '/tmp/ruby/build/trunk' I, [2024-05-04T18:58:58.643818 #3610569] INFO -- : make[1]: Nothing to be done for 'srcs'. I, [2024-05-04T18:58:58.643835 #3610569] INFO -- : make[1]: Leaving directory '/tmp/ruby/build/trunk' I, [2024-05-04T18:58:58.644600 #3610569] INFO -- : generating transdb.h I, [2024-05-04T18:58:58.757128 #3610569] INFO -- : transdb.h unchanged I, [2024-05-04T18:58:58.758869 #3610569] INFO -- : generating makefiles ext/configure-ext.mk I, [2024-05-04T18:58:58.759102 #3610569] INFO -- : making trans I, [2024-05-04T18:58:58.785286 #3610569] INFO -- : ext/configure-ext.mk updated I, [2024-05-04T18:58:58.788001 #3610569] INFO -- : make[1]: Entering directory '/tmp/ruby/build/trunk' I, [2024-05-04T18:58:58.794421 #3610569] INFO -- : make[1]: Entering directory '/tmp/ruby/build/trunk' I, [2024-05-04T18:58:58.794511 #3610569] INFO -- : make[1]: Nothing to be done for 'trans'. I, [2024-05-04T18:58:58.794522 #3610569] INFO -- : make[1]: Leaving directory '/tmp/ruby/build/trunk' I, [2024-05-04T18:58:58.795723 #3610569] INFO -- : making encs I, [2024-05-04T18:58:58.853748 #3610569] INFO -- : make[1]: Entering directory '/tmp/ruby/build/trunk' I, [2024-05-04T18:58:58.853818 #3610569] INFO -- : make[1]: Nothing to be done for 'encs'. I, [2024-05-04T18:58:58.853844 #3610569] INFO -- : make[1]: Leaving directory '/tmp/ruby/build/trunk' I, [2024-05-04T18:58:58.944418 #3610569] INFO -- : make[1]: Leaving directory '/tmp/ruby/build/trunk' I, [2024-05-04T18:58:58.945228 #3610569] INFO -- : generating makefile exts.mk I, [2024-05-04T18:58:58.982180 #3610569] INFO -- : exts.mk unchanged I, [2024-05-04T18:58:58.986796 #3610569] INFO -- : make[1]: Entering directory '/tmp/ruby/build/trunk' I, [2024-05-04T18:58:59.007289 #3610569] INFO -- : make[2]: Entering directory '/tmp/ruby/build/trunk/ext/coverage' I, [2024-05-04T18:58:59.007449 #3610569] INFO -- : make[2]: Entering directory '/tmp/ruby/build/trunk/ext/digest' I, [2024-05-04T18:58:59.008414 #3610569] INFO -- : make[2]: Entering directory '/tmp/ruby/build/trunk/ext/json' I, [2024-05-04T18:58:59.009186 #3610569] INFO -- : make[2]: Entering directory '/tmp/ruby/build/trunk/ext/io/console' I, [2024-05-04T18:58:59.009775 #3610569] INFO -- : make[2]: Entering directory '/tmp/ruby/build/trunk/ext/date' I, [2024-05-04T18:58:59.010193 #3610569] INFO -- : make[2]: Entering directory '/tmp/ruby/build/trunk/ext/rubyvm' I, [2024-05-04T18:58:59.010298 #3610569] INFO -- : make[2]: Entering directory '/tmp/ruby/build/trunk/ext/monitor' I, [2024-05-04T18:58:59.010545 #3610569] INFO -- : make[2]: Entering directory '/tmp/ruby/build/trunk/ext/pty' I, [2024-05-04T18:58:59.010638 #3610569] INFO -- : make[2]: Entering directory '/tmp/ruby/build/trunk/ext/fiddle' I, [2024-05-04T18:58:59.010966 #3610569] INFO -- : make[2]: Leaving directory '/tmp/ruby/build/trunk/ext/coverage' I, [2024-05-04T18:58:59.010994 #3610569] INFO -- : make[2]: Entering directory '/tmp/ruby/build/trunk/ext/pathname' I, [2024-05-04T18:58:59.011864 #3610569] INFO -- : make[2]: Leaving directory '/tmp/ruby/build/trunk/ext/io/console' I, [2024-05-04T18:58:59.012363 #3610569] INFO -- : make[2]: Leaving directory '/tmp/ruby/build/trunk/ext/rubyvm' I, [2024-05-04T18:58:59.012544 #3610569] INFO -- : make[2]: Entering directory '/tmp/ruby/build/trunk/ext/objspace' I, [2024-05-04T18:58:59.012812 #3610569] INFO -- : make[2]: Entering directory '/tmp/ruby/build/trunk/ext/psych' I, [2024-05-04T18:58:59.013243 #3610569] INFO -- : make[2]: Leaving directory '/tmp/ruby/build/trunk/ext/pty' I, [2024-05-04T18:58:59.013449 #3610569] INFO -- : make[2]: Leaving directory '/tmp/ruby/build/trunk/ext/monitor' I, [2024-05-04T18:58:59.013463 #3610569] INFO -- : make[2]: Leaving directory '/tmp/ruby/build/trunk/ext/date' I, [2024-05-04T18:58:59.014095 #3610569] INFO -- : make[2]: Leaving directory '/tmp/ruby/build/trunk/ext/digest' I, [2024-05-04T18:58:59.014201 #3610569] INFO -- : make[2]: Leaving directory '/tmp/ruby/build/trunk/ext/pathname' I, [2024-05-04T18:58:59.015587 #3610569] INFO -- : make[2]: Entering directory '/tmp/ruby/build/trunk/ext/ripper' I, [2024-05-04T18:58:59.016142 #3610569] INFO -- : make[2]: Leaving directory '/tmp/ruby/build/trunk/ext/json' I, [2024-05-04T18:58:59.016736 #3610569] INFO -- : make[2]: Leaving directory '/tmp/ruby/build/trunk/ext/objspace' I, [2024-05-04T18:58:59.017605 #3610569] INFO -- : make[2]: Entering directory '/tmp/ruby/build/trunk/.bundle/gems/nkf-0.2.0/ext/nkf' I, [2024-05-04T18:58:59.017802 #3610569] INFO -- : make[2]: Entering directory '/tmp/ruby/build/trunk/.bundle/gems/bigdecimal-3.1.7/ext/bigdecimal' I, [2024-05-04T18:58:59.018346 #3610569] INFO -- : make[2]: Entering directory '/tmp/ruby/build/trunk/.bundle/gems/debug-1.9.2/ext/debug' I, [2024-05-04T18:58:59.018465 #3610569] INFO -- : make[2]: Entering directory '/tmp/ruby/build/trunk/.bundle/gems/racc-1.7.3/ext/racc/cparse' I, [2024-05-04T18:58:59.018653 #3610569] INFO -- : make[2]: Entering directory '/tmp/ruby/build/trunk/.bundle/gems/syslog-0.1.2/ext/syslog' I, [2024-05-04T18:58:59.018722 #3610569] INFO -- : make[2]: Leaving directory '/tmp/ruby/build/trunk/ext/fiddle' I, [2024-05-04T18:58:59.018883 #3610569] INFO -- : make[2]: Entering directory '/tmp/ruby/build/trunk/.bundle/gems/rbs-3.4.4/ext/rbs_extension' I, [2024-05-04T18:58:59.021138 #3610569] INFO -- : make[2]: Entering directory '/tmp/ruby/build/trunk/ext/socket' I, [2024-05-04T18:58:59.021518 #3610569] INFO -- : make[2]: Leaving directory '/tmp/ruby/build/trunk/ext/ripper' I, [2024-05-04T18:58:59.021557 #3610569] INFO -- : make[2]: Entering directory '/tmp/ruby/build/trunk/ext/digest/sha2' I, [2024-05-04T18:58:59.023862 #3610569] INFO -- : make[2]: Leaving directory '/tmp/ruby/build/trunk/ext/digest/sha2' I, [2024-05-04T18:58:59.024665 #3610569] INFO -- : make[2]: Entering directory '/tmp/ruby/build/trunk/ext/openssl' I, [2024-05-04T18:58:59.025394 #3610569] INFO -- : make[2]: Leaving directory '/tmp/ruby/build/trunk/ext/psych' I, [2024-05-04T18:58:59.028028 #3610569] INFO -- : make[2]: Leaving directory '/tmp/ruby/build/trunk/ext/socket' I, [2024-05-04T18:58:59.041166 #3610569] INFO -- : make[2]: Leaving directory '/tmp/ruby/build/trunk/ext/openssl' I, [2024-05-04T18:58:59.041766 #3610569] INFO -- : make[2]: Leaving directory '/tmp/ruby/build/trunk/.bundle/gems/rbs-3.4.4/ext/rbs_extension' I, [2024-05-04T18:58:59.041995 #3610569] INFO -- : make[2]: Leaving directory '/tmp/ruby/build/trunk/.bundle/gems/racc-1.7.3/ext/racc/cparse' I, [2024-05-04T18:58:59.042286 #3610569] INFO -- : make[2]: Leaving directory '/tmp/ruby/build/trunk/.bundle/gems/nkf-0.2.0/ext/nkf' I, [2024-05-04T18:58:59.042433 #3610569] INFO -- : make[2]: Leaving directory '/tmp/ruby/build/trunk/.bundle/gems/debug-1.9.2/ext/debug' I, [2024-05-04T18:58:59.050497 #3610569] INFO -- : make[2]: Leaving directory '/tmp/ruby/build/trunk/.bundle/gems/bigdecimal-3.1.7/ext/bigdecimal' I, [2024-05-04T18:58:59.051541 #3610569] INFO -- : make[2]: Leaving directory '/tmp/ruby/build/trunk/.bundle/gems/syslog-0.1.2/ext/syslog' I, [2024-05-04T18:58:59.075423 #3610569] INFO -- : make[2]: Entering directory '/tmp/ruby/build/trunk' I, [2024-05-04T18:58:59.143457 #3610569] INFO -- : linking ruby I, [2024-05-04T18:58:59.166039 #3610569] INFO -- : make[2]: Leaving directory '/tmp/ruby/build/trunk' I, [2024-05-04T18:58:59.166375 #3610569] INFO -- : make[1]: Leaving directory '/tmp/ruby/build/trunk' I, [2024-05-04T18:58:59.170382 #3610569] INFO -- : make[1]: Entering directory '/tmp/ruby/build/trunk' I, [2024-05-04T18:58:59.170407 #3610569] INFO -- : make[1]: Nothing to be done for 'note'. I, [2024-05-04T18:58:59.170415 #3610569] INFO -- : make[1]: Leaving directory '/tmp/ruby/build/trunk' I, [2024-05-04T18:58:59.171427 #3610569] INFO -- : $$$[end] "make all -j20" exit with 0. I, [2024-05-04T18:58:59.171583 #3610569] INFO -- : $$$[beg] make install -j20 I, [2024-05-04T18:58:59.235150 #3610569] INFO -- : Update minitest to ea9caafc0754b1d6236a490d59e624b53209734a I, [2024-05-04T18:58:59.235291 #3610569] INFO -- : Update power_assert to 84e85124c5014a139af39161d484156cfe87a9ed I, [2024-05-04T18:58:59.235644 #3610569] INFO -- : Update rbs to ba7872795d5de04adb8ff500c0e6afdc81a041dd I, [2024-05-04T18:58:59.235988 #3610569] INFO -- : Update typeprof to b19a6416da3a05d57fadd6ffdadb382b6d236ca5 I, [2024-05-04T18:58:59.236578 #3610569] INFO -- : echo ea9caafc0754b1d6236a490d59e624b53209734a | /bin/sh /tmp/ruby/src/trunk/tool/ifchange /tmp/ruby/src/trunk/.bundle/.timestamp/minitest.revision - I, [2024-05-04T18:58:59.236794 #3610569] INFO -- : echo 84e85124c5014a139af39161d484156cfe87a9ed | /bin/sh /tmp/ruby/src/trunk/tool/ifchange /tmp/ruby/src/trunk/.bundle/.timestamp/power_assert.revision - I, [2024-05-04T18:58:59.237069 #3610569] INFO -- : echo ba7872795d5de04adb8ff500c0e6afdc81a041dd | /bin/sh /tmp/ruby/src/trunk/tool/ifchange /tmp/ruby/src/trunk/.bundle/.timestamp/rbs.revision - I, [2024-05-04T18:58:59.237840 #3610569] INFO -- : BASERUBY = /usr/bin/ruby --disable=gems I, [2024-05-04T18:58:59.237862 #3610569] INFO -- : CC = gcc I, [2024-05-04T18:58:59.237875 #3610569] INFO -- : LD = ld I, [2024-05-04T18:58:59.237887 #3610569] INFO -- : LDSHARED = gcc -shared I, [2024-05-04T18:58:59.237897 #3610569] INFO -- : CFLAGS = -O3 -fno-fast-math -ggdb3 -Wall -Wextra -Wdeprecated-declarations -Wdiv-by-zero -Wduplicated-cond -Wimplicit-function-declaration -Wimplicit-int -Wpointer-arith -Wwrite-strings -Wold-style-definition -Wimplicit-fallthrough=0 -Wmissing-noreturn -Wno-cast-function-type -Wno-constant-logical-operand -Wno-long-long -Wno-missing-field-initializers -Wno-overlength-strings -Wno-packed-bitfield-compat -Wno-parentheses-equality -Wno-self-assign -Wno-tautological-compare -Wno-unused-parameter -Wno-unused-value -Wsuggest-attribute=format -Wsuggest-attribute=noreturn -Wunused-variable -Wmisleading-indentation -Wundef -fPIC I, [2024-05-04T18:58:59.237909 #3610569] INFO -- : XCFLAGS = -U_FORTIFY_SOURCE -D_FORTIFY_SOURCE=2 -fstack-protector-strong -fno-strict-overflow -fvisibility=hidden -fexcess-precision=standard -DRUBY_EXPORT -I. -I.ext/include/x86_64-linux -I/tmp/ruby/src/trunk/include -I/tmp/ruby/src/trunk -I/tmp/ruby/src/trunk/prism -I/tmp/ruby/src/trunk/enc/unicode/15.0.0 I, [2024-05-04T18:58:59.237919 #3610569] INFO -- : CPPFLAGS = I, [2024-05-04T18:58:59.237930 #3610569] INFO -- : DLDFLAGS = -Wl,--compress-debug-sections=zlib -Wl,-soname,libruby.so.3.4 -fstack-protector-strong I, [2024-05-04T18:58:59.237941 #3610569] INFO -- : SOLIBS = -lz -lrt -lrt -lgmp -ldl -lcrypt -lm -lpthread I, [2024-05-04T18:58:59.237951 #3610569] INFO -- : LANG = en_US.UTF-8 I, [2024-05-04T18:58:59.237961 #3610569] INFO -- : LC_ALL = I, [2024-05-04T18:58:59.237980 #3610569] INFO -- : LC_CTYPE = I, [2024-05-04T18:58:59.237995 #3610569] INFO -- : MFLAGS = -j20 --jobserver-auth=4,5 I, [2024-05-04T18:58:59.238005 #3610569] INFO -- : RUSTC = no I, [2024-05-04T18:58:59.238015 #3610569] INFO -- : YJIT_RUSTC_ARGS = --crate-name=yjit --crate-type=staticlib --edition=2021 -g -C lto=thin -C opt-level=3 -C overflow-checks=on '--out-dir=/tmp/ruby/build/trunk/yjit/target/release/' /tmp/ruby/src/trunk/yjit/src/lib.rs I, [2024-05-04T18:58:59.238477 #3610569] INFO -- : /tmp/ruby/src/trunk/.bundle/.timestamp/minitest.revision unchanged I, [2024-05-04T18:58:59.238813 #3610569] INFO -- : /tmp/ruby/src/trunk/.bundle/.timestamp/power_assert.revision unchanged I, [2024-05-04T18:58:59.238836 #3610569] INFO -- : /tmp/ruby/src/trunk/.bundle/.timestamp/rbs.revision unchanged I, [2024-05-04T18:58:59.267547 #3610569] INFO -- : echo b19a6416da3a05d57fadd6ffdadb382b6d236ca5 | /bin/sh /tmp/ruby/src/trunk/tool/ifchange /tmp/ruby/src/trunk/.bundle/.timestamp/typeprof.revision - I, [2024-05-04T18:58:59.268251 #3610569] INFO -- : generating enc.mk I, [2024-05-04T18:58:59.268305 #3610569] INFO -- : gcc (Ubuntu 11.4.0-1ubuntu1~22.04) 11.4.0 I, [2024-05-04T18:58:59.268317 #3610569] INFO -- : Copyright (C) 2021 Free Software Foundation, Inc. I, [2024-05-04T18:58:59.268327 #3610569] INFO -- : This is free software; see the source for copying conditions. There is NO I, [2024-05-04T18:58:59.268337 #3610569] INFO -- : warranty; not even for MERCHANTABILITY or FITNESS FOR A PARTICULAR PURPOSE. I, [2024-05-04T18:58:59.268348 #3610569] INFO -- : I, [2024-05-04T18:58:59.269488 #3610569] INFO -- : /tmp/ruby/src/trunk/.bundle/.timestamp/typeprof.revision unchanged I, [2024-05-04T18:58:59.389741 #3610569] INFO -- : Building power_assert@84e85124c5014a139af39161d484156cfe87a9ed to /tmp/ruby/src/trunk/gems/power_assert-2.0.3.gem I, [2024-05-04T18:58:59.390459 #3610569] INFO -- : making srcs under enc I, [2024-05-04T18:58:59.390704 #3610569] INFO -- : making enc I, [2024-05-04T18:58:59.408467 #3610569] INFO -- : make[1]: Entering directory '/tmp/ruby/build/trunk' I, [2024-05-04T18:58:59.408521 #3610569] INFO -- : make[1]: Nothing to be done for 'enc'. I, [2024-05-04T18:58:59.408534 #3610569] INFO -- : make[1]: Leaving directory '/tmp/ruby/build/trunk' I, [2024-05-04T18:58:59.420543 #3610569] INFO -- : make[1]: Entering directory '/tmp/ruby/build/trunk' I, [2024-05-04T18:58:59.420606 #3610569] INFO -- : make[1]: Nothing to be done for 'srcs'. I, [2024-05-04T18:58:59.420619 #3610569] INFO -- : make[1]: Leaving directory '/tmp/ruby/build/trunk' I, [2024-05-04T18:58:59.421401 #3610569] INFO -- : generating transdb.h I, [2024-05-04T18:58:59.458389 #3610569] INFO -- : Successfully built RubyGem I, [2024-05-04T18:58:59.458455 #3610569] INFO -- : Name: power_assert I, [2024-05-04T18:58:59.458468 #3610569] INFO -- : Version: 2.0.4dev I, [2024-05-04T18:58:59.458479 #3610569] INFO -- : File: power_assert-2.0.4dev.gem I, [2024-05-04T18:58:59.460870 #3610569] INFO -- : Extracting bundle gem power_assert-2.0.3... I, [2024-05-04T18:58:59.517539 #3610569] INFO -- : transdb.h unchanged I, [2024-05-04T18:58:59.519245 #3610569] INFO -- : generating makefiles ext/configure-ext.mk I, [2024-05-04T18:58:59.519381 #3610569] INFO -- : making trans I, [2024-05-04T18:58:59.521633 #3610569] INFO -- : Try with hash version of bundled gems instead of gems/power_assert-2.0.3.gem. We don't use this gem with release version of Ruby. I, [2024-05-04T18:58:59.526599 #3610569] INFO -- : Unpacked gems/power_assert-2.0.4dev.gem I, [2024-05-04T18:58:59.545748 #3610569] INFO -- : ext/configure-ext.mk unchanged I, [2024-05-04T18:58:59.548230 #3610569] INFO -- : make[1]: Entering directory '/tmp/ruby/build/trunk' I, [2024-05-04T18:58:59.553220 #3610569] INFO -- : make[1]: Entering directory '/tmp/ruby/build/trunk' I, [2024-05-04T18:58:59.553336 #3610569] INFO -- : make[1]: Nothing to be done for 'trans'. I, [2024-05-04T18:58:59.553370 #3610569] INFO -- : make[1]: Leaving directory '/tmp/ruby/build/trunk' I, [2024-05-04T18:58:59.554332 #3610569] INFO -- : making encs I, [2024-05-04T18:58:59.613406 #3610569] INFO -- : make[1]: Entering directory '/tmp/ruby/build/trunk' I, [2024-05-04T18:58:59.613479 #3610569] INFO -- : make[1]: Nothing to be done for 'encs'. I, [2024-05-04T18:58:59.613506 #3610569] INFO -- : make[1]: Leaving directory '/tmp/ruby/build/trunk' I, [2024-05-04T18:58:59.706654 #3610569] INFO -- : make[1]: Leaving directory '/tmp/ruby/build/trunk' I, [2024-05-04T18:58:59.707337 #3610569] INFO -- : generating makefile exts.mk I, [2024-05-04T18:58:59.745538 #3610569] INFO -- : exts.mk unchanged I, [2024-05-04T18:58:59.750067 #3610569] INFO -- : make[1]: Entering directory '/tmp/ruby/build/trunk' I, [2024-05-04T18:58:59.770835 #3610569] INFO -- : make[2]: Entering directory '/tmp/ruby/build/trunk/ext/digest' I, [2024-05-04T18:58:59.770886 #3610569] INFO -- : make[2]: Entering directory '/tmp/ruby/build/trunk/ext/json' I, [2024-05-04T18:58:59.772552 #3610569] INFO -- : make[2]: Entering directory '/tmp/ruby/build/trunk/ext/monitor' I, [2024-05-04T18:58:59.772684 #3610569] INFO -- : make[2]: Entering directory '/tmp/ruby/build/trunk/ext/io/console' I, [2024-05-04T18:58:59.772775 #3610569] INFO -- : make[2]: Entering directory '/tmp/ruby/build/trunk/ext/coverage' I, [2024-05-04T18:58:59.772917 #3610569] INFO -- : make[2]: Entering directory '/tmp/ruby/build/trunk/ext/date' I, [2024-05-04T18:58:59.773515 #3610569] INFO -- : make[2]: Entering directory '/tmp/ruby/build/trunk/ext/pathname' I, [2024-05-04T18:58:59.774123 #3610569] INFO -- : make[2]: Entering directory '/tmp/ruby/build/trunk/ext/pty' I, [2024-05-04T18:58:59.774390 #3610569] INFO -- : make[2]: Entering directory '/tmp/ruby/build/trunk/ext/rubyvm' I, [2024-05-04T18:58:59.774975 #3610569] INFO -- : make[2]: Entering directory '/tmp/ruby/build/trunk/ext/objspace' I, [2024-05-04T18:58:59.775316 #3610569] INFO -- : make[2]: Entering directory '/tmp/ruby/build/trunk/ext/fiddle' I, [2024-05-04T18:58:59.775587 #3610569] INFO -- : make[2]: Entering directory '/tmp/ruby/build/trunk/ext/psych' I, [2024-05-04T18:58:59.776009 #3610569] INFO -- : make[2]: Leaving directory '/tmp/ruby/build/trunk/ext/io/console' I, [2024-05-04T18:58:59.776370 #3610569] INFO -- : make[2]: Leaving directory '/tmp/ruby/build/trunk/ext/monitor' I, [2024-05-04T18:58:59.776438 #3610569] INFO -- : make[2]: Leaving directory '/tmp/ruby/build/trunk/ext/coverage' I, [2024-05-04T18:58:59.776980 #3610569] INFO -- : make[2]: Leaving directory '/tmp/ruby/build/trunk/ext/pty' I, [2024-05-04T18:58:59.777051 #3610569] INFO -- : make[2]: Leaving directory '/tmp/ruby/build/trunk/ext/pathname' I, [2024-05-04T18:58:59.777107 #3610569] INFO -- : make[2]: Leaving directory '/tmp/ruby/build/trunk/ext/digest' I, [2024-05-04T18:58:59.777346 #3610569] INFO -- : make[2]: Leaving directory '/tmp/ruby/build/trunk/ext/date' I, [2024-05-04T18:58:59.777859 #3610569] INFO -- : make[2]: Entering directory '/tmp/ruby/build/trunk/ext/ripper' I, [2024-05-04T18:58:59.778155 #3610569] INFO -- : make[2]: Leaving directory '/tmp/ruby/build/trunk/ext/objspace' I, [2024-05-04T18:58:59.778381 #3610569] INFO -- : make[2]: Leaving directory '/tmp/ruby/build/trunk/ext/json' I, [2024-05-04T18:58:59.779994 #3610569] INFO -- : make[2]: Entering directory '/tmp/ruby/build/trunk/.bundle/gems/debug-1.9.2/ext/debug' I, [2024-05-04T18:58:59.780050 #3610569] INFO -- : make[2]: Entering directory '/tmp/ruby/build/trunk/.bundle/gems/bigdecimal-3.1.7/ext/bigdecimal' I, [2024-05-04T18:58:59.780084 #3610569] INFO -- : make[2]: Entering directory '/tmp/ruby/build/trunk/.bundle/gems/nkf-0.2.0/ext/nkf' I, [2024-05-04T18:58:59.780301 #3610569] INFO -- : make[2]: Entering directory '/tmp/ruby/build/trunk/.bundle/gems/racc-1.7.3/ext/racc/cparse' I, [2024-05-04T18:58:59.780438 #3610569] INFO -- : make[2]: Entering directory '/tmp/ruby/build/trunk/.bundle/gems/syslog-0.1.2/ext/syslog' I, [2024-05-04T18:58:59.780908 #3610569] INFO -- : make[2]: Entering directory '/tmp/ruby/build/trunk/.bundle/gems/rbs-3.4.4/ext/rbs_extension' I, [2024-05-04T18:58:59.781541 #3610569] INFO -- : make[2]: Leaving directory '/tmp/ruby/build/trunk/ext/fiddle' I, [2024-05-04T18:58:59.782880 #3610569] INFO -- : make[2]: Leaving directory '/tmp/ruby/build/trunk/ext/ripper' I, [2024-05-04T18:58:59.784672 #3610569] INFO -- : make[2]: Entering directory '/tmp/ruby/build/trunk/ext/socket' I, [2024-05-04T18:58:59.785310 #3610569] INFO -- : make[2]: Entering directory '/tmp/ruby/build/trunk/ext/openssl' I, [2024-05-04T18:58:59.785450 #3610569] INFO -- : make[2]: Leaving directory '/tmp/ruby/build/trunk/ext/rubyvm' I, [2024-05-04T18:58:59.786743 #3610569] INFO -- : make[2]: Entering directory '/tmp/ruby/build/trunk/ext/digest/sha2' I, [2024-05-04T18:58:59.788251 #3610569] INFO -- : make[2]: Leaving directory '/tmp/ruby/build/trunk/ext/psych' I, [2024-05-04T18:58:59.789896 #3610569] INFO -- : make[2]: Leaving directory '/tmp/ruby/build/trunk/ext/digest/sha2' I, [2024-05-04T18:58:59.793455 #3610569] INFO -- : make[2]: Leaving directory '/tmp/ruby/build/trunk/ext/socket' I, [2024-05-04T18:58:59.798520 #3610569] INFO -- : make[2]: Leaving directory '/tmp/ruby/build/trunk/ext/openssl' I, [2024-05-04T18:58:59.802969 #3610569] INFO -- : make[2]: Leaving directory '/tmp/ruby/build/trunk/.bundle/gems/racc-1.7.3/ext/racc/cparse' I, [2024-05-04T18:58:59.803125 #3610569] INFO -- : make[2]: Leaving directory '/tmp/ruby/build/trunk/.bundle/gems/debug-1.9.2/ext/debug' I, [2024-05-04T18:58:59.804605 #3610569] INFO -- : make[2]: Leaving directory '/tmp/ruby/build/trunk/.bundle/gems/nkf-0.2.0/ext/nkf' I, [2024-05-04T18:58:59.804968 #3610569] INFO -- : make[2]: Leaving directory '/tmp/ruby/build/trunk/.bundle/gems/rbs-3.4.4/ext/rbs_extension' I, [2024-05-04T18:58:59.814091 #3610569] INFO -- : make[2]: Leaving directory '/tmp/ruby/build/trunk/.bundle/gems/syslog-0.1.2/ext/syslog' I, [2024-05-04T18:58:59.815583 #3610569] INFO -- : make[2]: Leaving directory '/tmp/ruby/build/trunk/.bundle/gems/bigdecimal-3.1.7/ext/bigdecimal' I, [2024-05-04T18:58:59.840360 #3610569] INFO -- : make[2]: Entering directory '/tmp/ruby/build/trunk' I, [2024-05-04T18:58:59.905030 #3610569] INFO -- : make[2]: 'ruby' is up to date. I, [2024-05-04T18:58:59.905067 #3610569] INFO -- : make[2]: Leaving directory '/tmp/ruby/build/trunk' I, [2024-05-04T18:58:59.905511 #3610569] INFO -- : make[1]: Leaving directory '/tmp/ruby/build/trunk' I, [2024-05-04T18:58:59.909279 #3610569] INFO -- : make[1]: Entering directory '/tmp/ruby/build/trunk' I, [2024-05-04T18:58:59.909302 #3610569] INFO -- : make[1]: Nothing to be done for 'note'. I, [2024-05-04T18:58:59.909309 #3610569] INFO -- : make[1]: Leaving directory '/tmp/ruby/build/trunk' I, [2024-05-04T18:58:59.909811 #3610569] INFO -- : ./miniruby -I/tmp/ruby/src/trunk/lib -I. -I.ext/common /tmp/ruby/src/trunk/tool/runruby.rb --extout=.ext -- --disable-gems -r./x86_64-linux-fake /tmp/ruby/src/trunk/tool/rbinstall.rb --make="make" --dest-dir="" --extout=".ext" --ext-build-dir="./ext" --mflags="-j20 --jobserver-auth=4,5" --make-flags=" -j20 --jobserver-auth=4,5" --data-mode=0644 --prog-mode=0755 --installed-list .installed.list --mantype="doc" --gnumake --install=all --exclude=doc I, [2024-05-04T18:59:00.007026 #3610569] INFO -- : Installing to I, [2024-05-04T18:59:00.007087 #3610569] INFO -- : installing binary commands: /tmp/ruby/install/trunk/bin I, [2024-05-04T18:59:00.007177 #3610569] INFO -- : installing base libraries: /tmp/ruby/install/trunk/lib I, [2024-05-04T18:59:00.014853 #3610569] INFO -- : installing arch files: /tmp/ruby/install/trunk/lib/ruby/3.4.0+0/x86_64-linux I, [2024-05-04T18:59:00.014883 #3610569] INFO -- : installing pkgconfig data: /tmp/ruby/install/trunk/lib/pkgconfig I, [2024-05-04T18:59:00.014890 #3610569] INFO -- : installing extension objects: /tmp/ruby/install/trunk/lib/ruby/3.4.0+0/x86_64-linux I, [2024-05-04T18:59:00.024811 #3610569] INFO -- : installing extension objects: /tmp/ruby/install/trunk/lib/ruby/site_ruby/3.4.0+0/x86_64-linux I, [2024-05-04T18:59:00.024841 #3610569] INFO -- : installing extension objects: /tmp/ruby/install/trunk/lib/ruby/vendor_ruby/3.4.0+0/x86_64-linux I, [2024-05-04T18:59:00.024848 #3610569] INFO -- : installing extension headers: /tmp/ruby/install/trunk/include/ruby-3.4.0+0/x86_64-linux I, [2024-05-04T18:59:00.024993 #3610569] INFO -- : installing extension scripts: /tmp/ruby/install/trunk/lib/ruby/3.4.0+0 I, [2024-05-04T18:59:00.028915 #3610569] INFO -- : installing extension scripts: /tmp/ruby/install/trunk/lib/ruby/site_ruby/3.4.0+0 I, [2024-05-04T18:59:00.028937 #3610569] INFO -- : installing extension scripts: /tmp/ruby/install/trunk/lib/ruby/vendor_ruby/3.4.0+0 I, [2024-05-04T18:59:00.028942 #3610569] INFO -- : installing extension headers: /tmp/ruby/install/trunk/include/ruby-3.4.0+0/ruby I, [2024-05-04T18:59:00.028950 #3610569] INFO -- : installing command scripts: /tmp/ruby/install/trunk/bin I, [2024-05-04T18:59:00.028954 #3610569] INFO -- : installing library scripts: /tmp/ruby/install/trunk/lib/ruby/3.4.0+0 I, [2024-05-04T18:59:00.063538 #3610569] INFO -- : installing common headers: /tmp/ruby/install/trunk/include/ruby-3.4.0+0 I, [2024-05-04T18:59:00.069035 #3610569] INFO -- : installing manpages: /tmp/ruby/install/trunk/share/man/man1 I, [2024-05-04T18:59:00.069061 #3610569] INFO -- : installing default gems from lib: /tmp/ruby/install/trunk/lib/ruby/gems/3.4.0+0 I, [2024-05-04T18:59:00.091712 #3610569] INFO -- : benchmark 0.3.0 I, [2024-05-04T18:59:00.098587 #3610569] INFO -- : bundler 2.6.0.dev I, [2024-05-04T18:59:00.100699 #3610569] INFO -- : cgi 0.4.1 I, [2024-05-04T18:59:00.101239 #3610569] INFO -- : delegate 0.3.1 I, [2024-05-04T18:59:00.101721 #3610569] INFO -- : did_you_mean 1.6.3 I, [2024-05-04T18:59:00.102216 #3610569] INFO -- : english 0.8.0 I, [2024-05-04T18:59:00.102695 #3610569] INFO -- : erb 4.0.4 I, [2024-05-04T18:59:00.103395 #3610569] INFO -- : error_highlight 0.6.0 I, [2024-05-04T18:59:00.103863 #3610569] INFO -- : fileutils 1.7.2 I, [2024-05-04T18:59:00.104375 #3610569] INFO -- : find 0.2.0 I, [2024-05-04T18:59:00.104769 #3610569] INFO -- : forwardable 1.3.3 I, [2024-05-04T18:59:00.105229 #3610569] INFO -- : ipaddr 1.2.6 I, [2024-05-04T18:59:00.105768 #3610569] INFO -- : irb 1.13.0 I, [2024-05-04T18:59:00.107240 #3610569] INFO -- : logger 1.6.0 I, [2024-05-04T18:59:00.107747 #3610569] INFO -- : net-http 0.4.1 I, [2024-05-04T18:59:00.108231 #3610569] INFO -- : net-protocol 0.2.2 I, [2024-05-04T18:59:00.108766 #3610569] INFO -- : open-uri 0.4.1 I, [2024-05-04T18:59:00.109342 #3610569] INFO -- : open3 0.2.1 I, [2024-05-04T18:59:00.109884 #3610569] INFO -- : optparse 0.5.0 I, [2024-05-04T18:59:00.110289 #3610569] INFO -- : ostruct 0.6.0 I, [2024-05-04T18:59:00.110827 #3610569] INFO -- : pp 0.5.0 I, [2024-05-04T18:59:00.111374 #3610569] INFO -- : prettyprint 0.2.0 I, [2024-05-04T18:59:00.111772 #3610569] INFO -- : prism 0.27.0 I, [2024-05-04T18:59:00.112314 #3610569] INFO -- : pstore 0.1.3 I, [2024-05-04T18:59:00.112772 #3610569] INFO -- : rdoc 6.6.3.1 I, [2024-05-04T18:59:00.114514 #3610569] INFO -- : readline 0.0.4 I, [2024-05-04T18:59:00.115038 #3610569] INFO -- : reline 0.5.5 I, [2024-05-04T18:59:00.115562 #3610569] INFO -- : resolv 0.4.0 I, [2024-05-04T18:59:00.116047 #3610569] INFO -- : ruby2_keywords 0.0.5 I, [2024-05-04T18:59:00.116422 #3610569] INFO -- : securerandom 0.3.1 I, [2024-05-04T18:59:00.116925 #3610569] INFO -- : set 1.1.0 I, [2024-05-04T18:59:00.117521 #3610569] INFO -- : shellwords 0.2.0 I, [2024-05-04T18:59:00.117996 #3610569] INFO -- : singleton 0.2.0 I, [2024-05-04T18:59:00.118353 #3610569] INFO -- : syntax_suggest 2.0.0 I, [2024-05-04T18:59:00.119058 #3610569] INFO -- : tempfile 0.2.1 I, [2024-05-04T18:59:00.119528 #3610569] INFO -- : time 0.3.0 I, [2024-05-04T18:59:00.120122 #3610569] INFO -- : timeout 0.4.1 I, [2024-05-04T18:59:00.121154 #3610569] INFO -- : tmpdir 0.2.0 I, [2024-05-04T18:59:00.121665 #3610569] INFO -- : tsort 0.2.0 I, [2024-05-04T18:59:00.122093 #3610569] INFO -- : un 0.3.0 I, [2024-05-04T18:59:00.122556 #3610569] INFO -- : uri 0.13.0 I, [2024-05-04T18:59:00.123067 #3610569] INFO -- : weakref 0.1.3 I, [2024-05-04T18:59:00.123600 #3610569] INFO -- : yaml 0.3.0 I, [2024-05-04T18:59:00.123963 #3610569] INFO -- : installing default gems from ext: /tmp/ruby/install/trunk/lib/ruby/gems/3.4.0+0 I, [2024-05-04T18:59:00.130952 #3610569] INFO -- : date 3.3.4 I, [2024-05-04T18:59:00.131469 #3610569] INFO -- : digest 3.1.1 I, [2024-05-04T18:59:00.131955 #3610569] INFO -- : etc 1.4.3 I, [2024-05-04T18:59:00.132403 #3610569] INFO -- : fcntl 1.1.0 I, [2024-05-04T18:59:00.132925 #3610569] INFO -- : fiddle 1.1.3 I, [2024-05-04T18:59:00.133430 #3610569] INFO -- : io-console 0.7.2 I, [2024-05-04T18:59:00.133832 #3610569] INFO -- : io-nonblock 0.3.0 I, [2024-05-04T18:59:00.134513 #3610569] INFO -- : io-wait 0.3.1 I, [2024-05-04T18:59:00.134986 #3610569] INFO -- : json 2.7.2 I, [2024-05-04T18:59:00.135947 #3610569] INFO -- : openssl 3.2.0 I, [2024-05-04T18:59:00.136660 #3610569] INFO -- : pathname 0.3.0 I, [2024-05-04T18:59:00.137168 #3610569] INFO -- : psych 5.1.2 I, [2024-05-04T18:59:00.137721 #3610569] INFO -- : stringio 3.1.1 I, [2024-05-04T18:59:00.138223 #3610569] INFO -- : strscan 3.1.1 I, [2024-05-04T18:59:00.138693 #3610569] INFO -- : zlib 3.1.0 I, [2024-05-04T18:59:00.138996 #3610569] INFO -- : installing bundled gems: /tmp/ruby/install/trunk/lib/ruby/gems/3.4.0+0 I, [2024-05-04T18:59:00.139347 #3610569] INFO -- : minitest 5.22.3 I, [2024-05-04T18:59:00.146716 #3610569] INFO -- : rake 13.2.1 I, [2024-05-04T18:59:00.150131 #3610569] INFO -- : test-unit 3.6.2 I, [2024-05-04T18:59:00.154925 #3610569] INFO -- : rexml 3.2.6 I, [2024-05-04T18:59:00.158459 #3610569] INFO -- : rss 0.3.0 I, [2024-05-04T18:59:00.161565 #3610569] INFO -- : net-ftp 0.3.4 I, [2024-05-04T18:59:00.163044 #3610569] INFO -- : net-imap 0.4.10 I, [2024-05-04T18:59:00.165950 #3610569] INFO -- : net-pop 0.1.2 I, [2024-05-04T18:59:00.166869 #3610569] INFO -- : net-smtp 0.5.0 I, [2024-05-04T18:59:00.167930 #3610569] INFO -- : matrix 0.4.2 I, [2024-05-04T18:59:00.171729 #3610569] INFO -- : prime 0.1.2 I, [2024-05-04T18:59:00.177475 #3610569] INFO -- : rbs 3.4.4 I, [2024-05-04T18:59:00.200168 #3610569] INFO -- : typeprof 0.21.11 I, [2024-05-04T18:59:00.203288 #3610569] INFO -- : debug 1.9.2 I, [2024-05-04T18:59:00.206008 #3610569] INFO -- : racc 1.7.3 I, [2024-05-04T18:59:00.208768 #3610569] INFO -- : mutex_m 0.2.0 I, [2024-05-04T18:59:00.209919 #3610569] INFO -- : getoptlong 0.2.1 I, [2024-05-04T18:59:00.211200 #3610569] INFO -- : base64 0.2.0 I, [2024-05-04T18:59:00.212195 #3610569] INFO -- : bigdecimal 3.1.7 I, [2024-05-04T18:59:00.214142 #3610569] INFO -- : observer 0.1.2 I, [2024-05-04T18:59:00.215636 #3610569] INFO -- : abbrev 0.1.2 I, [2024-05-04T18:59:00.216876 #3610569] INFO -- : resolv-replace 0.1.1 I, [2024-05-04T18:59:00.218169 #3610569] INFO -- : rinda 0.2.0 I, [2024-05-04T18:59:00.219382 #3610569] INFO -- : drb 2.2.1 I, [2024-05-04T18:59:00.221024 #3610569] INFO -- : nkf 0.2.0 I, [2024-05-04T18:59:00.223570 #3610569] INFO -- : syslog 0.1.2 I, [2024-05-04T18:59:00.225425 #3610569] INFO -- : csv 3.3.0 I, [2024-05-04T18:59:00.227518 #3610569] INFO -- : installing bundled gem cache: /tmp/ruby/install/trunk/lib/ruby/gems/3.4.0+0/cache I, [2024-05-04T18:59:00.228989 #3610569] INFO -- : skipped bundled gems: I, [2024-05-04T18:59:00.229009 #3610569] INFO -- : power_assert-2.0.4dev.gem not found in bundled_gems I, [2024-05-04T18:59:00.232426 #3610569] INFO -- : $$$[end] "make install -j20" exit with 0. I, [2024-05-04T18:59:00.232531 #3610569] INFO -- : $$$[beg] make yes-btest TESTOPTS='-q -j20' I, [2024-05-04T18:59:05.750184 #3610569] INFO -- : PASS all 1935 tests E, [2024-05-04T18:59:05.757146 #3610569] ERROR -- : I, [2024-05-04T18:59:05.757407 #3610569] INFO -- : $$$[end] "make yes-btest TESTOPTS='-q -j20'" exit with 0. I, [2024-05-04T18:59:05.757497 #3610569] INFO -- : $$$[beg] make yes-test-basic TESTS='-j20' I, [2024-05-04T18:59:05.816551 #3610569] INFO -- : BASERUBY = /usr/bin/ruby --disable=gems I, [2024-05-04T18:59:05.816602 #3610569] INFO -- : CC = gcc I, [2024-05-04T18:59:05.816607 #3610569] INFO -- : LD = ld I, [2024-05-04T18:59:05.816611 #3610569] INFO -- : LDSHARED = gcc -shared I, [2024-05-04T18:59:05.816615 #3610569] INFO -- : CFLAGS = -O3 -fno-fast-math -ggdb3 -Wall -Wextra -Wdeprecated-declarations -Wdiv-by-zero -Wduplicated-cond -Wimplicit-function-declaration -Wimplicit-int -Wpointer-arith -Wwrite-strings -Wold-style-definition -Wimplicit-fallthrough=0 -Wmissing-noreturn -Wno-cast-function-type -Wno-constant-logical-operand -Wno-long-long -Wno-missing-field-initializers -Wno-overlength-strings -Wno-packed-bitfield-compat -Wno-parentheses-equality -Wno-self-assign -Wno-tautological-compare -Wno-unused-parameter -Wno-unused-value -Wsuggest-attribute=format -Wsuggest-attribute=noreturn -Wunused-variable -Wmisleading-indentation -Wundef -fPIC I, [2024-05-04T18:59:05.816620 #3610569] INFO -- : XCFLAGS = -U_FORTIFY_SOURCE -D_FORTIFY_SOURCE=2 -fstack-protector-strong -fno-strict-overflow -fvisibility=hidden -fexcess-precision=standard -DRUBY_EXPORT -I. -I.ext/include/x86_64-linux -I/tmp/ruby/src/trunk/include -I/tmp/ruby/src/trunk -I/tmp/ruby/src/trunk/prism -I/tmp/ruby/src/trunk/enc/unicode/15.0.0 I, [2024-05-04T18:59:05.816632 #3610569] INFO -- : CPPFLAGS = I, [2024-05-04T18:59:05.816636 #3610569] INFO -- : DLDFLAGS = -Wl,--compress-debug-sections=zlib -Wl,-soname,libruby.so.3.4 -fstack-protector-strong I, [2024-05-04T18:59:05.816640 #3610569] INFO -- : SOLIBS = -lz -lrt -lrt -lgmp -ldl -lcrypt -lm -lpthread I, [2024-05-04T18:59:05.816644 #3610569] INFO -- : LANG = en_US.UTF-8 I, [2024-05-04T18:59:05.816647 #3610569] INFO -- : LC_ALL = I, [2024-05-04T18:59:05.816650 #3610569] INFO -- : LC_CTYPE = I, [2024-05-04T18:59:05.816654 #3610569] INFO -- : MFLAGS = I, [2024-05-04T18:59:05.816657 #3610569] INFO -- : RUSTC = no I, [2024-05-04T18:59:05.816661 #3610569] INFO -- : YJIT_RUSTC_ARGS = --crate-name=yjit --crate-type=staticlib --edition=2021 -g -C lto=thin -C opt-level=3 -C overflow-checks=on '--out-dir=/tmp/ruby/build/trunk/yjit/target/release/' /tmp/ruby/src/trunk/yjit/src/lib.rs I, [2024-05-04T18:59:05.817286 #3610569] INFO -- : gcc (Ubuntu 11.4.0-1ubuntu1~22.04) 11.4.0 I, [2024-05-04T18:59:05.817306 #3610569] INFO -- : Copyright (C) 2021 Free Software Foundation, Inc. I, [2024-05-04T18:59:05.817312 #3610569] INFO -- : This is free software; see the source for copying conditions. There is NO I, [2024-05-04T18:59:05.817316 #3610569] INFO -- : warranty; not even for MERCHANTABILITY or FITNESS FOR A PARTICULAR PURPOSE. I, [2024-05-04T18:59:05.817326 #3610569] INFO -- : I, [2024-05-04T18:59:05.923493 #3610569] INFO -- : Checking leaked global symbols...none I, [2024-05-04T18:59:05.965140 #3610569] INFO -- : /tmp/ruby/src/trunk/basictest/test.rb:assignment ....................................................................................................................................................................................................................................................................................................................................................................................OK 372 I, [2024-05-04T18:59:05.965195 #3610569] INFO -- : /tmp/ruby/src/trunk/basictest/test.rb:condition ..OK 2 I, [2024-05-04T18:59:05.965201 #3610569] INFO -- : /tmp/ruby/src/trunk/basictest/test.rb:if/unless ...OK 3 I, [2024-05-04T18:59:05.965205 #3610569] INFO -- : /tmp/ruby/src/trunk/basictest/test.rb:case .....OK 5 I, [2024-05-04T18:59:05.965438 #3610569] INFO -- : /tmp/ruby/src/trunk/basictest/test.rb:while/until ........OK 8 I, [2024-05-04T18:59:05.965492 #3610569] INFO -- : /tmp/ruby/src/trunk/basictest/test.rb:exception ..........OK 10 I, [2024-05-04T18:59:05.965770 #3610569] INFO -- : /tmp/ruby/src/trunk/basictest/test.rb:array .......................................OK 39 I, [2024-05-04T18:59:05.965875 #3610569] INFO -- : /tmp/ruby/src/trunk/basictest/test.rb:hash ...........................OK 27 I, [2024-05-04T18:59:05.966612 #3610569] INFO -- : /tmp/ruby/src/trunk/basictest/test.rb:iterator ...........................................................................................................OK 107 I, [2024-05-04T18:59:05.966896 #3610569] INFO -- : /tmp/ruby/src/trunk/basictest/test.rb:float ................................................................................OK 80 I, [2024-05-04T18:59:05.967937 #3610569] INFO -- : /tmp/ruby/src/trunk/basictest/test.rb:bignum ...............................OK 31 I, [2024-05-04T18:59:05.968753 #3610569] INFO -- : /tmp/ruby/src/trunk/basictest/test.rb:string & char ..............................................................OK 62 I, [2024-05-04T18:59:05.968779 #3610569] INFO -- : /tmp/ruby/src/trunk/basictest/test.rb:assignment ..........OK 10 I, [2024-05-04T18:59:05.968798 #3610569] INFO -- : /tmp/ruby/src/trunk/basictest/test.rb:call ......OK 6 I, [2024-05-04T18:59:05.968851 #3610569] INFO -- : /tmp/ruby/src/trunk/basictest/test.rb:proc .........OK 9 I, [2024-05-04T18:59:06.069181 #3610569] INFO -- : /tmp/ruby/src/trunk/basictest/test.rb:signal ..OK 2 I, [2024-05-04T18:59:06.069629 #3610569] INFO -- : /tmp/ruby/src/trunk/basictest/test.rb:eval ...........................OK 27 I, [2024-05-04T18:59:06.168500 #3610569] INFO -- : /tmp/ruby/src/trunk/basictest/test.rb:system ........OK 8 I, [2024-05-04T18:59:06.168563 #3610569] INFO -- : /tmp/ruby/src/trunk/basictest/test.rb:const .....OK 5 I, [2024-05-04T18:59:06.168579 #3610569] INFO -- : /tmp/ruby/src/trunk/basictest/test.rb:clone .....OK 5 I, [2024-05-04T18:59:06.168666 #3610569] INFO -- : /tmp/ruby/src/trunk/basictest/test.rb:marshal ....OK 4 I, [2024-05-04T18:59:06.168702 #3610569] INFO -- : /tmp/ruby/src/trunk/basictest/test.rb:pack ....OK 4 I, [2024-05-04T18:59:06.168717 #3610569] INFO -- : /tmp/ruby/src/trunk/basictest/test.rb:math ..OK 2 I, [2024-05-04T18:59:06.168795 #3610569] INFO -- : /tmp/ruby/src/trunk/basictest/test.rb:struct ......OK 6 I, [2024-05-04T18:59:06.168902 #3610569] INFO -- : /tmp/ruby/src/trunk/basictest/test.rb:variable ............OK 12 I, [2024-05-04T18:59:06.168923 #3610569] INFO -- : /tmp/ruby/src/trunk/basictest/test.rb:trace ...OK 3 I, [2024-05-04T18:59:06.168930 #3610569] INFO -- : /tmp/ruby/src/trunk/basictest/test.rb:defined? ............OK 12 I, [2024-05-04T18:59:06.168960 #3610569] INFO -- : /tmp/ruby/src/trunk/basictest/test.rb:alias ......OK 6 I, [2024-05-04T18:59:06.169321 #3610569] INFO -- : /tmp/ruby/src/trunk/basictest/test.rb:path .......................OK 23 I, [2024-05-04T18:59:06.202750 #3610569] INFO -- : /tmp/ruby/src/trunk/basictest/test.rb:gc ....OK 4 I, [2024-05-04T18:59:06.205177 #3610569] INFO -- : I, [2024-05-04T18:59:06.205201 #3610569] INFO -- : test succeeded I, [2024-05-04T18:59:06.206623 #3610569] INFO -- : $$$[end] "make yes-test-basic TESTS='-j20'" exit with 0. I, [2024-05-04T18:59:06.206707 #3610569] INFO -- : $$$[beg] make yes-test-all TESTOPTS='--stderr-on-failure' TESTS='-j20' I, [2024-05-04T18:59:06.293124 #3610569] INFO -- : BASERUBY = /usr/bin/ruby --disable=gems I, [2024-05-04T18:59:06.293166 #3610569] INFO -- : CC = gcc I, [2024-05-04T18:59:06.293171 #3610569] INFO -- : LD = ld I, [2024-05-04T18:59:06.293175 #3610569] INFO -- : LDSHARED = gcc -shared I, [2024-05-04T18:59:06.293179 #3610569] INFO -- : CFLAGS = -O3 -fno-fast-math -ggdb3 -Wall -Wextra -Wdeprecated-declarations -Wdiv-by-zero -Wduplicated-cond -Wimplicit-function-declaration -Wimplicit-int -Wpointer-arith -Wwrite-strings -Wold-style-definition -Wimplicit-fallthrough=0 -Wmissing-noreturn -Wno-cast-function-type -Wno-constant-logical-operand -Wno-long-long -Wno-missing-field-initializers -Wno-overlength-strings -Wno-packed-bitfield-compat -Wno-parentheses-equality -Wno-self-assign -Wno-tautological-compare -Wno-unused-parameter -Wno-unused-value -Wsuggest-attribute=format -Wsuggest-attribute=noreturn -Wunused-variable -Wmisleading-indentation -Wundef -fPIC I, [2024-05-04T18:59:06.293183 #3610569] INFO -- : XCFLAGS = -U_FORTIFY_SOURCE -D_FORTIFY_SOURCE=2 -fstack-protector-strong -fno-strict-overflow -fvisibility=hidden -fexcess-precision=standard -DRUBY_EXPORT -I. -I.ext/include/x86_64-linux -I/tmp/ruby/src/trunk/include -I/tmp/ruby/src/trunk -I/tmp/ruby/src/trunk/prism -I/tmp/ruby/src/trunk/enc/unicode/15.0.0 I, [2024-05-04T18:59:06.293187 #3610569] INFO -- : CPPFLAGS = I, [2024-05-04T18:59:06.293190 #3610569] INFO -- : DLDFLAGS = -Wl,--compress-debug-sections=zlib -Wl,-soname,libruby.so.3.4 -fstack-protector-strong I, [2024-05-04T18:59:06.293194 #3610569] INFO -- : SOLIBS = -lz -lrt -lrt -lgmp -ldl -lcrypt -lm -lpthread I, [2024-05-04T18:59:06.293197 #3610569] INFO -- : LANG = en_US.UTF-8 I, [2024-05-04T18:59:06.293201 #3610569] INFO -- : LC_ALL = I, [2024-05-04T18:59:06.293204 #3610569] INFO -- : LC_CTYPE = I, [2024-05-04T18:59:06.293207 #3610569] INFO -- : MFLAGS = I, [2024-05-04T18:59:06.293211 #3610569] INFO -- : RUSTC = no I, [2024-05-04T18:59:06.293216 #3610569] INFO -- : YJIT_RUSTC_ARGS = --crate-name=yjit --crate-type=staticlib --edition=2021 -g -C lto=thin -C opt-level=3 -C overflow-checks=on '--out-dir=/tmp/ruby/build/trunk/yjit/target/release/' /tmp/ruby/src/trunk/yjit/src/lib.rs I, [2024-05-04T18:59:06.293787 #3610569] INFO -- : gcc (Ubuntu 11.4.0-1ubuntu1~22.04) 11.4.0 I, [2024-05-04T18:59:06.293812 #3610569] INFO -- : Copyright (C) 2021 Free Software Foundation, Inc. I, [2024-05-04T18:59:06.293821 #3610569] INFO -- : This is free software; see the source for copying conditions. There is NO I, [2024-05-04T18:59:06.293828 #3610569] INFO -- : warranty; not even for MERCHANTABILITY or FITNESS FOR A PARTICULAR PURPOSE. I, [2024-05-04T18:59:06.293834 #3610569] INFO -- : I, [2024-05-04T18:59:06.295423 #3610569] INFO -- : generating enc.mk I, [2024-05-04T18:59:06.412969 #3610569] INFO -- : making enc I, [2024-05-04T18:59:06.430212 #3610569] INFO -- : make[1]: Entering directory '/tmp/ruby/build/trunk' I, [2024-05-04T18:59:06.430238 #3610569] INFO -- : make[1]: Nothing to be done for 'enc'. I, [2024-05-04T18:59:06.430246 #3610569] INFO -- : make[1]: Leaving directory '/tmp/ruby/build/trunk' I, [2024-05-04T18:59:06.430933 #3610569] INFO -- : making srcs under enc I, [2024-05-04T18:59:06.460643 #3610569] INFO -- : make[1]: Entering directory '/tmp/ruby/build/trunk' I, [2024-05-04T18:59:06.460667 #3610569] INFO -- : make[1]: Nothing to be done for 'srcs'. I, [2024-05-04T18:59:06.460675 #3610569] INFO -- : make[1]: Leaving directory '/tmp/ruby/build/trunk' I, [2024-05-04T18:59:06.461571 #3610569] INFO -- : generating transdb.h I, [2024-05-04T18:59:06.556470 #3610569] INFO -- : transdb.h unchanged I, [2024-05-04T18:59:06.557809 #3610569] INFO -- : making trans I, [2024-05-04T18:59:06.591084 #3610569] INFO -- : make[1]: Entering directory '/tmp/ruby/build/trunk' I, [2024-05-04T18:59:06.591108 #3610569] INFO -- : make[1]: Nothing to be done for 'trans'. I, [2024-05-04T18:59:06.591116 #3610569] INFO -- : make[1]: Leaving directory '/tmp/ruby/build/trunk' I, [2024-05-04T18:59:06.591911 #3610569] INFO -- : making encs I, [2024-05-04T18:59:06.628502 #3610569] INFO -- : make[1]: Entering directory '/tmp/ruby/build/trunk' I, [2024-05-04T18:59:06.628527 #3610569] INFO -- : make[1]: Nothing to be done for 'encs'. I, [2024-05-04T18:59:06.628535 #3610569] INFO -- : make[1]: Leaving directory '/tmp/ruby/build/trunk' I, [2024-05-04T18:59:06.630331 #3610569] INFO -- : generating makefiles ext/configure-ext.mk I, [2024-05-04T18:59:06.657470 #3610569] INFO -- : ext/configure-ext.mk updated I, [2024-05-04T18:59:06.659847 #3610569] INFO -- : make[1]: Entering directory '/tmp/ruby/build/trunk' I, [2024-05-04T18:59:08.010958 #3610569] INFO -- : make[1]: Leaving directory '/tmp/ruby/build/trunk' I, [2024-05-04T18:59:08.011492 #3610569] INFO -- : generating makefile exts.mk I, [2024-05-04T18:59:08.048022 #3610569] INFO -- : exts.mk unchanged I, [2024-05-04T18:59:08.052401 #3610569] INFO -- : make[1]: Entering directory '/tmp/ruby/build/trunk' I, [2024-05-04T18:59:08.262422 #3610569] INFO -- : make[2]: Entering directory '/tmp/ruby/build/trunk/ext/coverage' I, [2024-05-04T18:59:08.265259 #3610569] INFO -- : make[2]: Leaving directory '/tmp/ruby/build/trunk/ext/coverage' I, [2024-05-04T18:59:08.269268 #3610569] INFO -- : make[2]: Entering directory '/tmp/ruby/build/trunk/ext/date' I, [2024-05-04T18:59:08.272305 #3610569] INFO -- : make[2]: Leaving directory '/tmp/ruby/build/trunk/ext/date' I, [2024-05-04T18:59:08.274666 #3610569] INFO -- : make[2]: Entering directory '/tmp/ruby/build/trunk/ext/digest' I, [2024-05-04T18:59:08.279965 #3610569] INFO -- : make[2]: Leaving directory '/tmp/ruby/build/trunk/ext/digest' I, [2024-05-04T18:59:08.295364 #3610569] INFO -- : make[2]: Entering directory '/tmp/ruby/build/trunk/ext/digest/sha2' I, [2024-05-04T18:59:08.298370 #3610569] INFO -- : make[2]: Leaving directory '/tmp/ruby/build/trunk/ext/digest/sha2' I, [2024-05-04T18:59:08.310929 #3610569] INFO -- : make[2]: Entering directory '/tmp/ruby/build/trunk/ext/fiddle' I, [2024-05-04T18:59:08.317530 #3610569] INFO -- : make[2]: Leaving directory '/tmp/ruby/build/trunk/ext/fiddle' I, [2024-05-04T18:59:08.320474 #3610569] INFO -- : make[2]: Entering directory '/tmp/ruby/build/trunk/ext/io/console' I, [2024-05-04T18:59:08.323048 #3610569] INFO -- : make[2]: Leaving directory '/tmp/ruby/build/trunk/ext/io/console' I, [2024-05-04T18:59:08.330594 #3610569] INFO -- : make[2]: Entering directory '/tmp/ruby/build/trunk/ext/json' I, [2024-05-04T18:59:08.336798 #3610569] INFO -- : make[2]: Leaving directory '/tmp/ruby/build/trunk/ext/json' I, [2024-05-04T18:59:08.346112 #3610569] INFO -- : make[2]: Entering directory '/tmp/ruby/build/trunk/ext/monitor' I, [2024-05-04T18:59:08.348543 #3610569] INFO -- : make[2]: Leaving directory '/tmp/ruby/build/trunk/ext/monitor' I, [2024-05-04T18:59:08.352820 #3610569] INFO -- : make[2]: Entering directory '/tmp/ruby/build/trunk/ext/objspace' I, [2024-05-04T18:59:08.356445 #3610569] INFO -- : make[2]: Leaving directory '/tmp/ruby/build/trunk/ext/objspace' I, [2024-05-04T18:59:08.368509 #3610569] INFO -- : make[2]: Entering directory '/tmp/ruby/build/trunk/ext/openssl' I, [2024-05-04T18:59:08.382011 #3610569] INFO -- : make[2]: Leaving directory '/tmp/ruby/build/trunk/ext/openssl' I, [2024-05-04T18:59:08.384916 #3610569] INFO -- : make[2]: Entering directory '/tmp/ruby/build/trunk/ext/pathname' I, [2024-05-04T18:59:08.387396 #3610569] INFO -- : make[2]: Leaving directory '/tmp/ruby/build/trunk/ext/pathname' I, [2024-05-04T18:59:08.391457 #3610569] INFO -- : make[2]: Entering directory '/tmp/ruby/build/trunk/ext/psych' I, [2024-05-04T18:59:08.406172 #3610569] INFO -- : make[2]: Leaving directory '/tmp/ruby/build/trunk/ext/psych' I, [2024-05-04T18:59:08.409310 #3610569] INFO -- : make[2]: Entering directory '/tmp/ruby/build/trunk/ext/pty' I, [2024-05-04T18:59:08.411803 #3610569] INFO -- : make[2]: Leaving directory '/tmp/ruby/build/trunk/ext/pty' I, [2024-05-04T18:59:08.421235 #3610569] INFO -- : make[2]: Entering directory '/tmp/ruby/build/trunk/ext/ripper' I, [2024-05-04T18:59:08.426196 #3610569] INFO -- : make[2]: Leaving directory '/tmp/ruby/build/trunk/ext/ripper' I, [2024-05-04T18:59:08.427551 #3610569] INFO -- : make[2]: Entering directory '/tmp/ruby/build/trunk/ext/rubyvm' I, [2024-05-04T18:59:08.429646 #3610569] INFO -- : make[2]: Leaving directory '/tmp/ruby/build/trunk/ext/rubyvm' I, [2024-05-04T18:59:08.437552 #3610569] INFO -- : make[2]: Entering directory '/tmp/ruby/build/trunk/ext/socket' I, [2024-05-04T18:59:08.443982 #3610569] INFO -- : make[2]: Leaving directory '/tmp/ruby/build/trunk/ext/socket' I, [2024-05-04T18:59:08.454938 #3610569] INFO -- : make[2]: Entering directory '/tmp/ruby/build/trunk/.bundle/gems/bigdecimal-3.1.7/ext/bigdecimal' I, [2024-05-04T18:59:08.477398 #3610569] INFO -- : make[2]: Leaving directory '/tmp/ruby/build/trunk/.bundle/gems/bigdecimal-3.1.7/ext/bigdecimal' I, [2024-05-04T18:59:08.479416 #3610569] INFO -- : make[2]: Entering directory '/tmp/ruby/build/trunk/.bundle/gems/debug-1.9.2/ext/debug' I, [2024-05-04T18:59:08.501520 #3610569] INFO -- : make[2]: Leaving directory '/tmp/ruby/build/trunk/.bundle/gems/debug-1.9.2/ext/debug' I, [2024-05-04T18:59:08.503460 #3610569] INFO -- : make[2]: Entering directory '/tmp/ruby/build/trunk/.bundle/gems/nkf-0.2.0/ext/nkf' I, [2024-05-04T18:59:08.525562 #3610569] INFO -- : make[2]: Leaving directory '/tmp/ruby/build/trunk/.bundle/gems/nkf-0.2.0/ext/nkf' I, [2024-05-04T18:59:08.527456 #3610569] INFO -- : make[2]: Entering directory '/tmp/ruby/build/trunk/.bundle/gems/racc-1.7.3/ext/racc/cparse' I, [2024-05-04T18:59:08.549178 #3610569] INFO -- : make[2]: Leaving directory '/tmp/ruby/build/trunk/.bundle/gems/racc-1.7.3/ext/racc/cparse' I, [2024-05-04T18:59:08.551522 #3610569] INFO -- : make[2]: Entering directory '/tmp/ruby/build/trunk/.bundle/gems/rbs-3.4.4/ext/rbs_extension' I, [2024-05-04T18:59:08.573080 #3610569] INFO -- : make[2]: Leaving directory '/tmp/ruby/build/trunk/.bundle/gems/rbs-3.4.4/ext/rbs_extension' I, [2024-05-04T18:59:08.575030 #3610569] INFO -- : make[2]: Entering directory '/tmp/ruby/build/trunk/.bundle/gems/syslog-0.1.2/ext/syslog' I, [2024-05-04T18:59:08.596448 #3610569] INFO -- : make[2]: Leaving directory '/tmp/ruby/build/trunk/.bundle/gems/syslog-0.1.2/ext/syslog' I, [2024-05-04T18:59:08.619817 #3610569] INFO -- : make[2]: Entering directory '/tmp/ruby/build/trunk' I, [2024-05-04T18:59:08.683259 #3610569] INFO -- : make[2]: 'ruby' is up to date. I, [2024-05-04T18:59:08.683301 #3610569] INFO -- : make[2]: Leaving directory '/tmp/ruby/build/trunk' I, [2024-05-04T18:59:08.683701 #3610569] INFO -- : make[1]: Leaving directory '/tmp/ruby/build/trunk' I, [2024-05-04T18:59:08.687203 #3610569] INFO -- : make[1]: Entering directory '/tmp/ruby/build/trunk' I, [2024-05-04T18:59:08.687224 #3610569] INFO -- : make[1]: Nothing to be done for 'note'. I, [2024-05-04T18:59:08.687236 #3610569] INFO -- : make[1]: Leaving directory '/tmp/ruby/build/trunk' I, [2024-05-04T18:59:08.764572 #3610569] INFO -- : Run options: I, [2024-05-04T18:59:08.764632 #3610569] INFO -- : --seed=57126 I, [2024-05-04T18:59:08.764638 #3610569] INFO -- : "--ruby=./miniruby -I/tmp/ruby/src/trunk/lib -I. -I.ext/common /tmp/ruby/src/trunk/tool/runruby.rb --extout=.ext -- --disable-gems" I, [2024-05-04T18:59:08.764643 #3610569] INFO -- : --excludes-dir=/tmp/ruby/src/trunk/test/.excludes I, [2024-05-04T18:59:08.764647 #3610569] INFO -- : --name=!/memory_leak/ I, [2024-05-04T18:59:08.764650 #3610569] INFO -- : --stderr-on-failure I, [2024-05-04T18:59:08.764654 #3610569] INFO -- : -j20 I, [2024-05-04T18:59:08.764658 #3610569] INFO -- : I, [2024-05-04T18:59:08.764662 #3610569] INFO -- : # Running tests: I, [2024-05-04T18:59:08.764666 #3610569] INFO -- : I, [2024-05-04T18:59:08.912455 #3610569] INFO -- : [ 1/885] 3651941=test_bug_reporter I, [2024-05-04T18:59:08.912722 #3610569] INFO -- : [ 2/885] 3651925=test_rand I, [2024-05-04T18:59:08.912879 #3610569] INFO -- : [ 3/885] 3651924=test_gem_name_tuple I, [2024-05-04T18:59:08.913089 #3610569] INFO -- : [ 4/885] 3651926=test_gem_package_tar_reader_entry I, [2024-05-04T18:59:08.913179 #3610569] INFO -- : [ 5/885] 3651928=test_exception I, [2024-05-04T18:59:08.914743 #3610569] INFO -- : [ 6/885] 3651927=test_case_options I, [2024-05-04T18:59:08.914905 #3610569] INFO -- : [ 7/885] 3651939=test_store I, [2024-05-04T18:59:08.915006 #3610569] INFO -- : [ 8/885] 3651938=test_rdoc_cross_reference I, [2024-05-04T18:59:08.915523 #3610569] INFO -- : [ 9/885] 3651937=test_gem_dependency_installer I, [2024-05-04T18:59:08.916261 #3610569] INFO -- : [ 10/885] 3651940=test_scalar I, [2024-05-04T18:59:08.916960 #3610569] INFO -- : [ 11/885] 3651942=test_gem_commands_info_command I, [2024-05-04T18:59:08.932553 #3610569] INFO -- : [ 12/885] 3651927=test_enumerator_kw I, [2024-05-04T18:59:08.935795 #3610569] INFO -- : [ 13/885] 3651927=test_settracefunc I, [2024-05-04T18:59:08.946241 #3610569] INFO -- : [ 14/885] 3651933=test_gem_text I, [2024-05-04T18:59:08.946300 #3610569] INFO -- : [ 15/885] 3651929=test_generic I, [2024-05-04T18:59:08.946309 #3610569] INFO -- : [ 16/885] 3651932=test_win32ole I, [2024-05-04T18:59:08.946315 #3610569] INFO -- : [ 17/885] 3651936=test_scan_args I, [2024-05-04T18:59:08.946321 #3610569] INFO -- : [ 18/885] 3651934=test_gem_request I, [2024-05-04T18:59:08.948230 #3610569] INFO -- : [ 19/885] 3651940=test_method_cache I, [2024-05-04T18:59:08.948516 #3610569] INFO -- : [ 20/885] 3651930=test_sprintf_comb I, [2024-05-04T18:59:08.949755 #3610569] INFO -- : [ 21/885] 3651940=test_gem_ext_cargo_builder_link_flag_converter I, [2024-05-04T18:59:08.950985 #3610569] INFO -- : [ 22/885] 3651935=test_gem_commands_mirror I, [2024-05-04T18:59:08.961202 #3610569] INFO -- : [ 23/885] 3651932=test_rdoc_generator_pot_po I, [2024-05-04T18:59:08.970111 #3610569] INFO -- : [ 24/885] 3651936=test_ansi_with_terminfo I, [2024-05-04T18:59:08.976411 #3610569] INFO -- : [ 25/885] 3651931=test_rdoc_markup_to_markdown I, [2024-05-04T18:59:09.031093 #3610569] INFO -- : [ 26/885] 3651943=test_json_tree I, [2024-05-04T18:59:09.039181 #3610569] INFO -- : [ 27/885] 3651936=test_memory_view I, [2024-05-04T18:59:09.061204 #3610569] INFO -- : [ 28/885] 3651929=test_m17n_comb I, [2024-05-04T18:59:09.063727 #3610569] INFO -- : [ 29/885] 3651943=test_ractor I, [2024-05-04T18:59:09.086014 #3610569] INFO -- : [ 30/885] 3651936=test_cclass I, [2024-05-04T18:59:09.090720 #3610569] INFO -- : [ 31/885] 3651932=test_gem_request_connection_pools I, [2024-05-04T18:59:09.091321 #3610569] INFO -- : [ 32/885] 3651939=test_grapheme_breaks I, [2024-05-04T18:59:09.102022 #3610569] INFO -- : [ 33/885] 3651924=test_gem_version_option I, [2024-05-04T18:59:09.108518 #3610569] INFO -- : [ 34/885] 3651942=test_pkey I, [2024-05-04T18:59:09.118357 #3610569] INFO -- : [ 35/885] 3651939=test_case I, [2024-05-04T18:59:09.124022 #3610569] INFO -- : [ 36/885] 3651939=test_reline I, [2024-05-04T18:59:09.131044 #3610569] INFO -- : [ 37/885] 3651925=test_parser_events I, [2024-05-04T18:59:09.134058 #3610569] INFO -- : [ 38/885] 3651924=test_rdoc_markup_to_table_of_contents I, [2024-05-04T18:59:09.156234 #3610569] INFO -- : [ 39/885] 3651930=test_socket I, [2024-05-04T18:59:09.162850 #3610569] INFO -- : [ 40/885] 3651935=test_thread I, [2024-05-04T18:59:09.182357 #3610569] INFO -- : [ 41/885] 3651943=test_objectspace I, [2024-05-04T18:59:09.188288 #3610569] INFO -- : [ 42/885] 3651942=test_literal I, [2024-05-04T18:59:09.196213 #3610569] INFO -- : [ 43/885] 3651925=test_str2big I, [2024-05-04T18:59:09.198927 #3610569] INFO -- : [ 44/885] 3651925=test_c_struct_builder I, [2024-05-04T18:59:09.202681 #3610569] INFO -- : [ 45/885] 3651940=test_dot_dot I, [2024-05-04T18:59:09.211654 #3610569] INFO -- : [ 46/885] 3651931=test_gem_stream_ui I, [2024-05-04T18:59:09.217087 #3610569] INFO -- : [ 47/885] 3651933=test_rdoc_generator_ri I, [2024-05-04T18:59:09.220566 #3610569] INFO -- : [ 48/885] 3651940=test_extlibs I, [2024-05-04T18:59:09.234420 #3610569] INFO -- : [ 49/885] 3651925=test_severity I, [2024-05-04T18:59:09.238891 #3610569] INFO -- : [ 50/885] 3651925=test_ractor I, [2024-05-04T18:59:09.240463 #3610569] INFO -- : [ 51/885] 3651926=test_require_lib I, [2024-05-04T18:59:09.260858 #3610569] INFO -- : [ 52/885] 3651936=parse_test I, [2024-05-04T18:59:09.264913 #3610569] INFO -- : [ 53/885] 3651925=test_gem_install_update_options I, [2024-05-04T18:59:09.289229 #3610569] INFO -- : [ 54/885] 3651934=test_passing_block I, [2024-05-04T18:59:09.292167 #3610569] INFO -- : [ 55/885] 3651934=test_thread_fd_close I, [2024-05-04T18:59:09.295121 #3610569] INFO -- : [ 56/885] 3651934=test_uncorrectable_name_check I, [2024-05-04T18:59:09.301410 #3610569] INFO -- : [ 57/885] 3651934=newline_test I, [2024-05-04T18:59:09.304126 #3610569] INFO -- : [ 58/885] 3651924=test_hash_create I, [2024-05-04T18:59:09.309201 #3610569] INFO -- : [ 59/885] 3651924=test_stringchar I, [2024-05-04T18:59:09.323427 #3610569] INFO -- : [ 60/885] 3651941=test_io_console I, [2024-05-04T18:59:09.351458 #3610569] INFO -- : [ 61/885] 3651939=test_singleton I, [2024-05-04T18:59:09.357524 #3610569] INFO -- : [ 62/885] 3651939=test_flush I, [2024-05-04T18:59:09.361725 #3610569] INFO -- : [ 63/885] 3651939=test_switch_hitter I, [2024-05-04T18:59:09.376479 #3610569] INFO -- : [ 64/885] 3651939=test_securerandom I, [2024-05-04T18:59:09.378334 #3610569] INFO -- : [ 65/885] 3651933=test_rdoc_markdown_test I, [2024-05-04T18:59:09.384595 #3610569] INFO -- : [ 66/885] 3651935=test_c_union_entity I, [2024-05-04T18:59:09.395693 #3610569] INFO -- : [ 67/885] 3651938=test_rdoc_normal_module I, [2024-05-04T18:59:09.408068 #3610569] INFO -- : [ 68/885] 3651934=test_logperiod I, [2024-05-04T18:59:09.412207 #3610569] INFO -- : [ 69/885] 3651934=test_err_in_callback I, [2024-05-04T18:59:09.414008 #3610569] INFO -- : [ 70/885] 3651924=test_gem_resolver_lock_specification I, [2024-05-04T18:59:09.414065 #3610569] INFO -- : [ 71/885] 3651934=test_gc I, [2024-05-04T18:59:09.415115 #3610569] INFO -- : [ 72/885] 3651935=test_x509cert I, [2024-05-04T18:59:09.433075 #3610569] INFO -- : [ 73/885] 3651938=test_gem_ext_rake_builder I, [2024-05-04T18:59:09.441455 #3610569] INFO -- : [ 74/885] 3651939=test_arity I, [2024-05-04T18:59:09.446747 #3610569] INFO -- : [ 75/885] 3651939=test_logdevice I, [2024-05-04T18:59:09.488582 #3610569] INFO -- : [ 76/885] 3651924=test_gem_security_policy I, [2024-05-04T18:59:09.516366 #3610569] INFO -- : [ 77/885] 3651931=test_gem_source_local I, [2024-05-04T18:59:09.547976 #3610569] INFO -- : [ 78/885] 3651925=test_process I, [2024-05-04T18:59:09.686262 #3610569] INFO -- : [ 79/885] 3651935=test_last_thread I, [2024-05-04T18:59:09.803263 #3610569] INFO -- : [ 80/885] 3651931=test_pack I, [2024-05-04T18:59:09.822311 #3610569] INFO -- : [ 81/885] 3651924=test_name_error I, [2024-05-04T18:59:09.882861 #3610569] INFO -- : [ 82/885] 3651942=test_rdoc_markup_attribute_manager I, [2024-05-04T18:59:09.931545 #3610569] INFO -- : [ 83/885] 3651924=test_gem_commands_dependency_command I, [2024-05-04T18:59:09.965263 #3610569] INFO -- : [ 84/885] 3651927=test_gem_resolver_composed_set I, [2024-05-04T18:59:10.013532 #3610569] INFO -- : [ 85/885] 3651924=test_safe_load I, [2024-05-04T18:59:10.027031 #3610569] INFO -- : [ 86/885] 3651942=test_gem_resolver I, [2024-05-04T18:59:10.033785 #3610569] INFO -- : [ 87/885] 3651924=test_gem_commands_specification_command I, [2024-05-04T18:59:10.045007 #3610569] INFO -- : [ 88/885] 3651931=test_shift_jis I, [2024-05-04T18:59:10.048633 #3610569] INFO -- : [ 89/885] 3651931=test_gem_commands_which_command I, [2024-05-04T18:59:10.079794 #3610569] INFO -- : [ 90/885] 3651931=test_http I, [2024-05-04T18:59:10.096134 #3610569] INFO -- : [ 91/885] 3651931=test_enumerator I, [2024-05-04T18:59:10.097783 #3610569] INFO -- : [ 92/885] 3651943=test_inadvertent_creation I, [2024-05-04T18:59:10.156053 #3610569] INFO -- : [ 93/885] 3651924=test_flags I, [2024-05-04T18:59:10.174247 #3610569] INFO -- : [ 94/885] 3651927=test_gem_safe_yaml I, [2024-05-04T18:59:10.204923 #3610569] INFO -- : [ 95/885] 3651943=test_syntax I, [2024-05-04T18:59:10.206615 #3610569] INFO -- : [ 96/885] 3651927=test_date_new I, [2024-05-04T18:59:10.212839 #3610569] INFO -- : [ 97/885] 3651942=index_write_test I, [2024-05-04T18:59:10.224654 #3610569] INFO -- : [ 98/885] 3651927=test_data I, [2024-05-04T18:59:10.234899 #3610569] INFO -- : [ 99/885] 3651927=test_rdoc_markup_to_joined_paragraph I, [2024-05-04T18:59:10.260498 #3610569] INFO -- : [100/885] 3651928=test_date_time I, [2024-05-04T18:59:10.277412 #3610569] INFO -- : [101/885] 3651939=test_require I, [2024-05-04T18:59:10.278570 #3610569] INFO -- : [102/885] 3651942=test_iso_8859 I, [2024-05-04T18:59:10.278749 #3610569] INFO -- : [103/885] 3651939=test_tcp I, [2024-05-04T18:59:10.285507 #3610569] INFO -- : [104/885] 3651932=test_rdoc_text I, [2024-05-04T18:59:10.293533 #3610569] INFO -- : [105/885] 3651928=test_rdoc_context I, [2024-05-04T18:59:10.345801 #3610569] INFO -- : [106/885] 3651942=test_stream I, [2024-05-04T18:59:10.354532 #3610569] INFO -- : [107/885] 3651932=test_nil2vtempty I, [2024-05-04T18:59:10.357116 #3610569] INFO -- : [108/885] 3651932=test_open-uri I, [2024-05-04T18:59:10.357949 #3610569] INFO -- : [109/885] 3651938=test_httpresponse I, [2024-05-04T18:59:10.358817 #3610569] INFO -- : [110/885] 3651942=test_rdoc_parser_ruby I, [2024-05-04T18:59:10.404866 #3610569] INFO -- : [111/885] 3651927=test_kernel I, [2024-05-04T18:59:10.443963 #3610569] INFO -- : [112/885] 3651938=dispatcher_test I, [2024-05-04T18:59:10.454568 #3610569] INFO -- : [113/885] 3651939=test_eval_history I, [2024-05-04T18:59:10.543258 #3610569] INFO -- : [114/885] 3651939=test_kdf I, [2024-05-04T18:59:10.550751 #3610569] INFO -- : [115/885] 3651938=test_gem_doctor I, [2024-05-04T18:59:10.589338 #3610569] INFO -- : [116/885] 3651938=test_emitter I, [2024-05-04T18:59:10.599631 #3610569] INFO -- : [117/885] 3651938=test_gem_silent_ui I, [2024-05-04T18:59:10.628130 #3610569] INFO -- : [118/885] 3651939=test_bug-5832 I, [2024-05-04T18:59:10.629430 #3610569] INFO -- : [119/885] 3651938=test_files_ext I, [2024-05-04T18:59:10.629812 #3610569] INFO -- : [120/885] 3651939=test_command I, [2024-05-04T18:59:10.653037 #3610569] INFO -- : [121/885] 3651930=test_at_exit I, [2024-05-04T18:59:10.673645 #3610569] INFO -- : [122/885] 3651930=test_date I, [2024-05-04T18:59:10.680964 #3610569] INFO -- : [123/885] 3651930=test_gem_rdoc I, [2024-05-04T18:59:10.695949 #3610569] INFO -- : [124/885] 3651933=test_gem_ext_cargo_builder_unit I, [2024-05-04T18:59:10.724929 #3610569] INFO -- : [125/885] 3651933=test_object_create_start I, [2024-05-04T18:59:10.728922 #3610569] INFO -- : [126/885] 3651933=test_psych I, [2024-05-04T18:59:10.733580 #3610569] INFO -- : [127/885] 3651935=test_enc_raise I, [2024-05-04T18:59:10.740955 #3610569] INFO -- : [128/885] 3651935=!Nothing_to_test I, [2024-05-04T18:59:10.741299 #3610569] INFO -- : [129/885] 3651935=test_rdoc_markup_paragraph I, [2024-05-04T18:59:10.784189 #3610569] INFO -- : [130/885] 3651933=test_gem_command I, [2024-05-04T18:59:10.796474 #3610569] INFO -- : [131/885] 3651938=test_key_actor_vi I, [2024-05-04T18:59:10.832815 #3610569] INFO -- : [132/885] 3651929=test_bug-3571 I, [2024-05-04T18:59:10.865098 #3610569] INFO -- : [133/885] 3651933=test_common I, [2024-05-04T18:59:10.882749 #3610569] INFO -- : [134/885] 3651929=test_gem_spec_fetcher I, [2024-05-04T18:59:10.911033 #3610569] INFO -- : [135/885] 3651935=test_numeric I, [2024-05-04T18:59:10.923992 #3610569] INFO -- : [136/885] 3651942=test_ifunless I, [2024-05-04T18:59:10.925567 #3610569] INFO -- : [137/885] 3651942=test_assignment I, [2024-05-04T18:59:10.953254 #3610569] INFO -- : [138/885] 3651939=test_gem_commands_lock_command I, [2024-05-04T18:59:10.999047 #3610569] INFO -- : [139/885] 3651935=test_rdoc_tom_doc I, [2024-05-04T18:59:11.008816 #3610569] INFO -- : [140/885] 3651938=test_rdoc_markup_to_tt_only I, [2024-05-04T18:59:11.027252 #3610569] INFO -- : [141/885] 3651935=test_hmac I, [2024-05-04T18:59:11.035761 #3610569] INFO -- : [142/885] 3651935=test_exception I, [2024-05-04T18:59:11.043476 #3610569] INFO -- : [143/885] 3651938=test_zsh_completion I, [2024-05-04T18:59:11.048583 #3610569] INFO -- : [144/885] 3651938=test_iter_break I, [2024-05-04T18:59:11.051201 #3610569] INFO -- : [145/885] 3651938=test_verbose I, [2024-05-04T18:59:11.057557 #3610569] INFO -- : [146/885] 3651927=test_nil I, [2024-05-04T18:59:11.070375 #3610569] INFO -- : [147/885] 3651935=test_num2int I, [2024-05-04T18:59:11.074271 #3610569] INFO -- : [148/885] 3651927=test_rdoc_single_class I, [2024-05-04T18:59:11.077795 #3610569] INFO -- : [149/885] 3651927=test_macro I, [2024-05-04T18:59:11.085091 #3610569] INFO -- : [150/885] 3651938=test_pp I, [2024-05-04T18:59:11.088093 #3610569] INFO -- : [151/885] 3651933=test_gem_ext_configure_builder I, [2024-05-04T18:59:11.095243 #3610569] INFO -- : [152/885] 3651935=test_frozen I, [2024-05-04T18:59:11.100380 #3610569] INFO -- : [153/885] 3651935=test_gem_source_list I, [2024-05-04T18:59:11.104894 #3610569] INFO -- : [154/885] 3651932=test_yaml_special_cases I, [2024-05-04T18:59:11.111074 #3610569] INFO -- : [155/885] 3651940=test_optarg I, [2024-05-04T18:59:11.120116 #3610569] INFO -- : [156/885] 3651938=test_config I, [2024-05-04T18:59:11.137395 #3610569] INFO -- : [157/885] 3651932=test_rdoc_token_stream I, [2024-05-04T18:59:11.141114 #3610569] INFO -- : [158/885] 3651928=test_address_resolve I, [2024-05-04T18:59:11.142333 #3610569] INFO -- : [159/885] 3651927=test_folderitem2_invokeverb I, [2024-05-04T18:59:11.144076 #3610569] INFO -- : [160/885] 3651932=test_require_path_check I, [2024-05-04T18:59:11.145567 #3610569] INFO -- : [161/885] 3651938=test_rdoc_markup_parser I, [2024-05-04T18:59:11.147048 #3610569] INFO -- : [162/885] 3651927=test_fnmatch I, [2024-05-04T18:59:11.150200 #3610569] INFO -- : [163/885] 3651933=test_files_test_2 I, [2024-05-04T18:59:11.157237 #3610569] INFO -- : [164/885] 3651935=test_gem_validator I, [2024-05-04T18:59:11.158163 #3610569] INFO -- : [165/885] 3651939=test_proc I, [2024-05-04T18:59:11.186801 #3610569] INFO -- : [166/885] 3651927=test_string I, [2024-05-04T18:59:11.203774 #3610569] INFO -- : [167/885] 3651928=test_gc_compact I, [2024-05-04T18:59:11.203835 #3610569] INFO -- : [168/885] 3651935=test_gem_resolver_index_set I, [2024-05-04T18:59:11.215167 #3610569] INFO -- : [169/885] 3651929=test_gem_package_old I, [2024-05-04T18:59:11.220342 #3610569] INFO -- : [170/885] 3651932=test_cgi_tag_helper I, [2024-05-04T18:59:11.232433 #3610569] INFO -- : [171/885] 3651924=test_zlib I, [2024-05-04T18:59:11.232760 #3610569] INFO -- : [172/885] 3651930=test_egrep_cpp I, [2024-05-04T18:59:11.233093 #3610569] INFO -- : [173/885] 3651932=test_ole_methods I, [2024-05-04T18:59:11.235663 #3610569] INFO -- : [174/885] 3651932=test_erb_m17n I, [2024-05-04T18:59:11.238621 #3610569] INFO -- : [175/885] 3651938=test_optimization I, [2024-05-04T18:59:11.243403 #3610569] INFO -- : [176/885] 3651935=test_date_conv I, [2024-05-04T18:59:11.244418 #3610569] INFO -- : [177/885] 3651932=test_rdoc_parser I, [2024-05-04T18:59:11.251399 #3610569] INFO -- : [178/885] 3651929=test_qsort I, [2024-05-04T18:59:11.254642 #3610569] INFO -- : [179/885] 3651929=test_gem_dependency_resolution_error I, [2024-05-04T18:59:11.255357 #3610569] INFO -- : [180/885] 3651935=json_addition_test I, [2024-05-04T18:59:11.260078 #3610569] INFO -- : [181/885] 3651929=test_custom_command I, [2024-05-04T18:59:11.268372 #3610569] INFO -- : [182/885] 3651940=test_rdoc_store I, [2024-05-04T18:59:11.302167 #3610569] INFO -- : [183/885] 3651935=test_gem_request_set_lockfile_parser I, [2024-05-04T18:59:11.302889 #3610569] INFO -- : [184/885] 3651932=test_depth_first I, [2024-05-04T18:59:11.326927 #3610569] INFO -- : [185/885] 3651932=test_raise I, [2024-05-04T18:59:11.336436 #3610569] INFO -- : [186/885] 3651932=test_x509attr I, [2024-05-04T18:59:11.356662 #3610569] INFO -- : [187/885] 3651929=test_pattern_matching I, [2024-05-04T18:59:11.359906 #3610569] INFO -- : [188/885] 3651937=test_rdoc_stats I, [2024-05-04T18:59:11.385254 #3610569] INFO -- : [189/885] 3651929=test_string I, [2024-05-04T18:59:11.391449 #3610569] INFO -- : [190/885] 3651932=test_pipe I, [2024-05-04T18:59:11.419702 #3610569] INFO -- : [191/885] 3651935=test_trick I, [2024-05-04T18:59:11.422362 #3610569] INFO -- : [192/885] 3651929=test_thread I, [2024-05-04T18:59:11.430481 #3610569] INFO -- : [193/885] 3651930=test_pkey_ec I, [2024-05-04T18:59:11.430550 #3610569] INFO -- : [194/885] 3651929=test_date_parse I, [2024-05-04T18:59:11.532125 #3610569] INFO -- : [195/885] 3651930=test_rdoc_markup_attributes I, [2024-05-04T18:59:11.538518 #3610569] INFO -- : [196/885] 3651932=test_win32ole_type I, [2024-05-04T18:59:11.538582 #3610569] INFO -- : [197/885] 3651932=test_null I, [2024-05-04T18:59:11.541568 #3610569] INFO -- : [198/885] 3651932=test_mul I, [2024-05-04T18:59:11.548089 #3610569] INFO -- : [199/885] 3651932=test_rdoc_rd_inline_parser I, [2024-05-04T18:59:11.569928 #3610569] INFO -- : [200/885] 3651932=test_rdoc_markup_to_rdoc I, [2024-05-04T18:59:11.577163 #3610569] INFO -- : [201/885] 3651930=test_default_gems I, [2024-05-04T18:59:11.587254 #3610569] INFO -- : [202/885] 3651929=test_gem_uninstaller I, [2024-05-04T18:59:11.606918 #3610569] INFO -- : [203/885] 3651932=test_svcb_https I, [2024-05-04T18:59:11.613230 #3610569] INFO -- : [204/885] 3651932=test_buffering I, [2024-05-04T18:59:11.617248 #3610569] INFO -- : [205/885] 3651932=test_gb18030 I, [2024-05-04T18:59:11.629137 #3610569] INFO -- : [206/885] 3651932=test_windows_1251 I, [2024-05-04T18:59:11.629531 #3610569] INFO -- : [207/885] 3651937=test_time I, [2024-05-04T18:59:11.632643 #3610569] INFO -- : [208/885] 3651932=test_rdoc_rdoc I, [2024-05-04T18:59:11.659093 #3610569] INFO -- : [209/885] 3651930=test_defined I, [2024-05-04T18:59:11.693547 #3610569] INFO -- : [210/885] 3651932=test_backtrace I, [2024-05-04T18:59:11.701505 #3610569] INFO -- : [211/885] 3651932=test_key_name_check I, [2024-05-04T18:59:11.708858 #3610569] INFO -- : [212/885] 3651932=test_io_buffer I, [2024-05-04T18:59:11.754023 #3610569] INFO -- : [213/885] 3651930=test_rdoc_i18n_text I, [2024-05-04T18:59:11.762560 #3610569] INFO -- : [214/885] 3651936=test_yjit_exit_locations I, [2024-05-04T18:59:11.767245 #3610569] INFO -- : [215/885] 3651930=test_etc I, [2024-05-04T18:59:11.767313 #3610569] INFO -- : [216/885] 3651936=test_gem_config_file I, [2024-05-04T18:59:11.779625 #3610569] INFO -- : [217/885] 3651932=test_ripper I, [2024-05-04T18:59:11.798289 #3610569] INFO -- : [218/885] 3651937=test_protocol I, [2024-05-04T18:59:11.874372 #3610569] INFO -- : [219/885] 3651930=test_getopts I, [2024-05-04T18:59:11.887936 #3610569] INFO -- : [220/885] 3651930=test_gem_resolver_activation_request I, [2024-05-04T18:59:11.899072 #3610569] INFO -- : [221/885] 3651930=test_bigzero I, [2024-05-04T18:59:11.905951 #3610569] INFO -- : [222/885] 3651930=test_pkey_dh I, [2024-05-04T18:59:11.976525 #3610569] INFO -- : [223/885] 3651930=test_gem_package_tar_header I, [2024-05-04T18:59:12.002681 #3610569] INFO -- : [224/885] 3651930=test_iseq_load I, [2024-05-04T18:59:12.005399 #3610569] INFO -- : [225/885] 3651939=test_gem_util I, [2024-05-04T18:59:12.031556 #3610569] INFO -- : [226/885] 3651942=test_system I, [2024-05-04T18:59:12.092981 #3610569] INFO -- : [227/885] 3651941=test_pkcs12 I, [2024-05-04T18:59:12.113346 #3610569] INFO -- : [228/885] 3651937=test_case I, [2024-05-04T18:59:12.139052 #3610569] INFO -- : [229/885] 3651936=test_sizeof I, [2024-05-04T18:59:12.171685 #3610569] INFO -- : [230/885] 3651937=test_face I, [2024-05-04T18:59:12.188409 #3610569] INFO -- : [231/885] 3651932=test_rendering I, [2024-05-04T18:59:12.218174 #3610569] INFO -- : [232/885] 3651939=test_autoload I, [2024-05-04T18:59:12.239541 #3610569] INFO -- : [233/885] 3651940=test_utf16 I, [2024-05-04T18:59:12.250305 #3610569] INFO -- : [234/885] 3651940=test_io I, [2024-05-04T18:59:12.297469 #3610569] INFO -- : [235/885] 3651937=test_unicode_escape I, [2024-05-04T18:59:12.323195 #3610569] INFO -- : [236/885] 3651932=test_libs I, [2024-05-04T18:59:12.349099 #3610569] INFO -- : [237/885] 3651932=test_gc I, [2024-05-04T18:59:12.351223 #3610569] INFO -- : [238/885] 3651932=test_gem_commands_fetch_command I, [2024-05-04T18:59:12.393919 #3610569] INFO -- : [239/885] 3651937=test_math I, [2024-05-04T18:59:12.409288 #3610569] INFO -- : [240/885] 3651937=test_sleep I, [2024-05-04T18:59:12.458517 #3610569] INFO -- : [241/885] 3651941=test_config I, [2024-05-04T18:59:12.572497 #3610569] INFO -- : [242/885] 3651932=test_yaml_tree I, [2024-05-04T18:59:12.607671 #3610569] INFO -- : [243/885] 3651932=test_gem_commands_install_command I, [2024-05-04T18:59:12.649407 #3610569] INFO -- : [244/885] 3651929=test_clone I, [2024-05-04T18:59:12.671482 #3610569] INFO -- : [245/885] 3651941=test_readpartial I, [2024-05-04T18:59:12.692559 #3610569] INFO -- : [246/885] 3651930=locals_test I, [2024-05-04T18:59:12.832688 #3610569] INFO -- : [247/885] 3651929=test_rdoc_require I, [2024-05-04T18:59:12.893269 #3610569] INFO -- : [248/885] 3651926=test_rdoc_markup_indented_paragraph I, [2024-05-04T18:59:13.016975 #3610569] INFO -- : [249/885] 3651929=test_io_buffer I, [2024-05-04T18:59:13.071097 #3610569] INFO -- : [250/885] 3651926=ruby_parser_test I, [2024-05-04T18:59:13.073285 #3610569] INFO -- : [251/885] 3651941=test_backtrace I, [2024-05-04T18:59:13.125222 #3610569] INFO -- : [252/885] 3651929=test_pack I, [2024-05-04T18:59:13.160613 #3610569] INFO -- : [253/885] 3651930=test_gem_resolver_conflict I, [2024-05-04T18:59:13.171961 #3610569] INFO -- : [254/885] 3651942=test_rdoc_task I, [2024-05-04T18:59:13.172023 #3610569] INFO -- : [255/885] 3651926=test_convertible I, [2024-05-04T18:59:13.172577 #3610569] INFO -- : [256/885] 3651942=parser_test I, [2024-05-04T18:59:13.175167 #3610569] INFO -- : [257/885] 3651929=test_rdoc_alias I, [2024-05-04T18:59:13.176244 #3610569] INFO -- : [258/885] 3651942=test_yield I, [2024-05-04T18:59:13.181727 #3610569] INFO -- : [259/885] 3651930=test_stringscanner I, [2024-05-04T18:59:13.197051 #3610569] INFO -- : [260/885] 3651929=test_files_sample I, [2024-05-04T18:59:13.225457 #3610569] INFO -- : [261/885] 3651930=test_rat I, [2024-05-04T18:59:13.235220 #3610569] INFO -- : [262/885] 3651930=test_rdoc_markup_raw I, [2024-05-04T18:59:13.240960 #3610569] INFO -- : [263/885] 3651930=test_webauthn_poller I, [2024-05-04T18:59:13.285790 #3610569] INFO -- : [264/885] 3651929=test_rdoc_markup_to_html_crossref I, [2024-05-04T18:59:13.380856 #3610569] INFO -- : [265/885] 3651930=test_typeddata I, [2024-05-04T18:59:13.428033 #3610569] INFO -- : [266/885] 3651928=test_gem_resolver_best_set I, [2024-05-04T18:59:13.500453 #3610569] INFO -- : [267/885] 3651924=encoding_test I, [2024-05-04T18:59:13.566951 #3610569] INFO -- : [268/885] 3651929=test_fstring I, [2024-05-04T18:59:13.602152 #3610569] INFO -- : [269/885] 3651930=test_array I, [2024-05-04T18:59:13.613883 #3610569] INFO -- : [270/885] 3651930=test_optparse I, [2024-05-04T18:59:13.646675 #3610569] INFO -- : [271/885] 3651928=test_gem_commands_stale_command I, [2024-05-04T18:59:13.665637 #3610569] INFO -- : [272/885] 3651928=test_lock_native_thread I, [2024-05-04T18:59:13.691707 #3610569] INFO -- : [273/885] 3651930=test_c_struct_entry I, [2024-05-04T18:59:13.692331 #3610569] INFO -- : [274/885] 3651929=test_remote_fetch_error I, [2024-05-04T18:59:13.707358 #3610569] INFO -- : [275/885] 3651929=test_have_library I, [2024-05-04T18:59:13.711762 #3610569] INFO -- : [276/885] 3651924=test_show_source I, [2024-05-04T18:59:13.839726 #3610569] INFO -- : [277/885] 3651924=test_set I, [2024-05-04T18:59:13.848309 #3610569] INFO -- : [278/885] 3651924=test_gem_security_trust_dir I, [2024-05-04T18:59:13.884387 #3610569] INFO -- : [279/885] 3651924=test_string_memory I, [2024-05-04T18:59:13.939407 #3610569] INFO -- : [280/885] 3651924=test_gem_requirement I, [2024-05-04T18:59:13.963444 #3610569] INFO -- : [281/885] 3651928=test_sprintf I, [2024-05-04T18:59:14.008431 #3610569] INFO -- : [282/885] 3651930=comments_test I, [2024-05-04T18:59:14.031270 #3610569] INFO -- : [283/885] 3651930=test_objspace I, [2024-05-04T18:59:14.031340 #3610569] INFO -- : [284/885] 3651932=ripper_test I, [2024-05-04T18:59:14.056064 #3610569] INFO -- : [285/885] 3651924=test_line_editor I, [2024-05-04T18:59:14.069928 #3610569] INFO -- : [286/885] 3651924=test_undef I, [2024-05-04T18:59:14.072775 #3610569] INFO -- : [287/885] 3651924=test_argf I, [2024-05-04T18:59:14.187088 #3610569] INFO -- : [288/885] 3651928=test_framework I, [2024-05-04T18:59:14.209272 #3610569] INFO -- : [289/885] 3651928=test_ns_spki I, [2024-05-04T18:59:14.245372 #3610569] INFO -- : [290/885] 3651935=test_kill_ring I, [2024-05-04T18:59:14.254456 #3610569] INFO -- : [291/885] 3651928=test_workspace I, [2024-05-04T18:59:14.289636 #3610569] INFO -- : [292/885] 3651935=test_weakmap I, [2024-05-04T18:59:14.428376 #3610569] INFO -- : [293/885] 3651941=test_yjit I, [2024-05-04T18:59:14.432159 #3610569] INFO -- : [294/885] 3651941=test_ws I, [2024-05-04T18:59:14.457604 #3610569] INFO -- : [295/885] 3651941=test_m17n I, [2024-05-04T18:59:14.459300 #3610569] INFO -- : [296/885] 3651937=test_gem_commands_environment_command I, [2024-05-04T18:59:14.525882 #3610569] INFO -- : [297/885] 3651937=test_hash I, [2024-05-04T18:59:14.543699 #3610569] INFO -- : [298/885] 3651937=test_gem_resolver_dependency_request I, [2024-05-04T18:59:14.550326 #3610569] INFO -- : [299/885] 3651941=test_tree_builder I, [2024-05-04T18:59:14.559514 #3610569] INFO -- : [300/885] 3651941=test_external_new I, [2024-05-04T18:59:14.562879 #3610569] INFO -- : [301/885] 3651941=test_postponed_job I, [2024-05-04T18:59:14.571685 #3610569] INFO -- : [302/885] 3651928=test_alias_and_anchor I, [2024-05-04T18:59:14.576679 #3610569] INFO -- : [303/885] 3651928=test_raise_exception I, [2024-05-04T18:59:14.578338 #3610569] INFO -- : [304/885] 3651937=test_gem_request_set_lockfile I, [2024-05-04T18:59:14.690457 #3610569] INFO -- : [305/885] 3651933=test_win32ole_typelib I, [2024-05-04T18:59:14.696244 #3610569] INFO -- : [306/885] 3651933=test_protect I, [2024-05-04T18:59:14.703539 #3610569] INFO -- : [307/885] 3651933=test_gem_unsatisfiable_dependency_error I, [2024-05-04T18:59:14.717365 #3610569] INFO -- : [308/885] 3651933=test_win32ole_record I, [2024-05-04T18:59:14.723236 #3610569] INFO -- : [309/885] 3651933=test_cp949 I, [2024-05-04T18:59:14.726955 #3610569] INFO -- : [310/885] 3651933=test_condition I, [2024-05-04T18:59:14.731316 #3610569] INFO -- : [311/885] 3651933=test_gem_source_specific_file I, [2024-05-04T18:59:14.824443 #3610569] INFO -- : [312/885] 3651932=test_foreach I, [2024-05-04T18:59:14.828570 #3610569] INFO -- : [313/885] 3651932=test_gem_commands_uninstall_command I, [2024-05-04T18:59:14.878176 #3610569] INFO -- : [314/885] 3651933=test_io I, [2024-05-04T18:59:14.915464 #3610569] INFO -- : [315/885] 3651941=test_emoji I, [2024-05-04T18:59:14.933069 #3610569] INFO -- : [316/885] 3651937=test_win32ole_type_event I, [2024-05-04T18:59:14.937522 #3610569] INFO -- : [317/885] 3651941=test_sorted_set I, [2024-05-04T18:59:14.937653 #3610569] INFO -- : [318/885] 3651937=test_hash I, [2024-05-04T18:59:14.949055 #3610569] INFO -- : [319/885] 3651929=test_ubf_async_safe I, [2024-05-04T18:59:14.959592 #3610569] INFO -- : [320/885] 3651929=test_gem_commands_exec_command I, [2024-05-04T18:59:15.166270 #3610569] INFO -- : [321/885] 3651933=test_io_wait I, [2024-05-04T18:59:15.195025 #3610569] INFO -- : [322/885] 3651941=warnings_test I, [2024-05-04T18:59:15.263701 #3610569] INFO -- : [323/885] 3651928=test_kwargs I, [2024-05-04T18:59:15.273995 #3610569] INFO -- : [324/885] 3651928=test_ellipsize I, [2024-05-04T18:59:15.276467 #3610569] INFO -- : [325/885] 3651928=test_date_attr I, [2024-05-04T18:59:15.293037 #3610569] INFO -- : [326/885] 3651928=test_console_attr I, [2024-05-04T18:59:15.297178 #3610569] INFO -- : [327/885] 3651928=test_summary I, [2024-05-04T18:59:15.330444 #3610569] INFO -- : [328/885] 3651941=test_type_completor I, [2024-05-04T18:59:15.332980 #3610569] INFO -- : [329/885] 3651941=test_euc_kr I, [2024-05-04T18:59:15.340804 #3610569] INFO -- : [330/885] 3651941=test_rdoc_context_section I, [2024-05-04T18:59:15.448511 #3610569] INFO -- : [331/885] 3651928=test_ftp I, [2024-05-04T18:59:15.451941 #3610569] INFO -- : [332/885] 3651928=test_gem_impossible_dependencies_error I, [2024-05-04T18:59:15.457305 #3610569] INFO -- : [333/885] 3651928=test_pack I, [2024-05-04T18:59:15.473251 #3610569] INFO -- : [334/885] 3651936=test_array_create I, [2024-05-04T18:59:15.474677 #3610569] INFO -- : [335/885] 3651936=test_pattern_key_name_check I, [2024-05-04T18:59:15.481162 #3610569] INFO -- : [336/885] 3651941=test_to_ruby I, [2024-05-04T18:59:15.484634 #3610569] INFO -- : [337/885] 3651936=test_rdoc_rubygems_hook I, [2024-05-04T18:59:15.496050 #3610569] INFO -- : [338/885] 3651941=test_method I, [2024-05-04T18:59:15.502183 #3610569] INFO -- : [339/885] 3651933=test_gem_commands_query_command I, [2024-05-04T18:59:15.514048 #3610569] INFO -- : [340/885] 3651931=test_asn1 I, [2024-05-04T18:59:15.587066 #3610569] INFO -- : [341/885] 3651931=test_random I, [2024-05-04T18:59:15.599542 #3610569] INFO -- : [342/885] 3651931=test_load I, [2024-05-04T18:59:15.608261 #3610569] INFO -- : [343/885] 3651931=json_string_matching_test I, [2024-05-04T18:59:15.618003 #3610569] INFO -- : [344/885] 3651931=test_const I, [2024-05-04T18:59:15.626403 #3610569] INFO -- : [345/885] 3651931=test_class I, [2024-05-04T18:59:15.645332 #3610569] INFO -- : [346/885] 3651928=test_rdoc_normal_class I, [2024-05-04T18:59:15.662922 #3610569] INFO -- : [347/885] 3651932=test_irb I, [2024-05-04T18:59:15.708607 #3610569] INFO -- : [348/885] 3651928=test_rdoc_parser_rd I, [2024-05-04T18:59:15.765994 #3610569] INFO -- : [349/885] 3651928=test_date_strftime I, [2024-05-04T18:59:15.789745 #3610569] INFO -- : [350/885] 3651936=test_gem_installer I, [2024-05-04T18:59:15.888663 #3610569] INFO -- : [351/885] 3651934=test_yamlstore I, [2024-05-04T18:59:15.920222 #3610569] INFO -- : [352/885] 3651934=test_tracepoint I, [2024-05-04T18:59:15.992881 #3610569] INFO -- : [353/885] 3651932=test_prettyprint I, [2024-05-04T18:59:16.020046 #3610569] INFO -- : [354/885] 3651933=test_rdoc_markup I, [2024-05-04T18:59:16.030922 #3610569] INFO -- : [355/885] 3651933=test_gem_commands_help_command I, [2024-05-04T18:59:16.045707 #3610569] INFO -- : [356/885] 3651932=test_duplicate I, [2024-05-04T18:59:16.048557 #3610569] INFO -- : [357/885] 3651932=test_basicsocket I, [2024-05-04T18:59:16.059367 #3610569] INFO -- : [358/885] 3651932=test_utf32 I, [2024-05-04T18:59:16.070419 #3610569] INFO -- : [359/885] 3651932=test_gem_resolver_index_specification I, [2024-05-04T18:59:16.104527 #3610569] INFO -- : [360/885] 3651933=test_internal_ivar I, [2024-05-04T18:59:16.106330 #3610569] INFO -- : [361/885] 3651933=test_queue I, [2024-05-04T18:59:16.108949 #3610569] INFO -- : [362/885] 3651933=test_function I, [2024-05-04T18:59:16.130633 #3610569] INFO -- : [363/885] 3651932=parse_comments_test I, [2024-05-04T18:59:16.134169 #3610569] INFO -- : [364/885] 3651932=test_noarg I, [2024-05-04T18:59:16.157954 #3610569] INFO -- : [365/885] 3651934=test_tempfile I, [2024-05-04T18:59:16.178515 #3610569] INFO -- : [366/885] 3651943=test_cesu8 I, [2024-05-04T18:59:16.182943 #3610569] INFO -- : [367/885] 3651943=test_econv I, [2024-05-04T18:59:16.225247 #3610569] INFO -- : [368/885] 3651928=test_rdoc_options I, [2024-05-04T18:59:16.321750 #3610569] INFO -- : [369/885] 3651929=test_gem_version I, [2024-05-04T18:59:16.343528 #3610569] INFO -- : [370/885] 3651933=test_ldap I, [2024-05-04T18:59:16.350194 #3610569] INFO -- : [371/885] 3651932=test_resource I, [2024-05-04T18:59:16.360596 #3610569] INFO -- : [372/885] 3651933=test_gem_commands_signin_command I, [2024-05-04T18:59:16.361939 #3610569] INFO -- : [373/885] 3651932=test_emitter I, [2024-05-04T18:59:16.366113 #3610569] INFO -- : [374/885] 3651932=test_fileutils I, [2024-05-04T18:59:16.410714 #3610569] INFO -- : [375/885] 3651929=test_string_processing I, [2024-05-04T18:59:16.416233 #3610569] INFO -- : [376/885] 3651929=test_stack I, [2024-05-04T18:59:16.469714 #3610569] INFO -- : [377/885] 3651928=test_gem_commands_list_command I, [2024-05-04T18:59:16.477746 #3610569] INFO -- : [378/885] 3651933=test_reqarg I, [2024-05-04T18:59:16.485457 #3610569] INFO -- : [379/885] 3651928=test_rdoc_include I, [2024-05-04T18:59:16.516819 #3610569] INFO -- : [380/885] 3651934=test_too_many_dummy_encodings I, [2024-05-04T18:59:16.519469 #3610569] INFO -- : [381/885] 3651928=test_gem_remote_fetcher I, [2024-05-04T18:59:16.606091 #3610569] INFO -- : [382/885] 3651934=test_parse I, [2024-05-04T18:59:16.752382 #3610569] INFO -- : [383/885] 3651942=test_mdns I, [2024-05-04T18:59:16.768882 #3610569] INFO -- : [384/885] 3651942=test_gem_resolver_installed_specification I, [2024-05-04T18:59:16.784736 #3610569] INFO -- : [385/885] 3651942=test_scanner_events I, [2024-05-04T18:59:16.786596 #3610569] INFO -- : [386/885] 3651935=test_complex I, [2024-05-04T18:59:16.827728 #3610569] INFO -- : [387/885] 3651942=test_gem_commands_search_command I, [2024-05-04T18:59:16.828669 #3610569] INFO -- : [388/885] 3651942=test_method_cache I, [2024-05-04T18:59:16.838415 #3610569] INFO -- : [389/885] 3651942=test_gem_stub_specification I, [2024-05-04T18:59:16.890151 #3610569] INFO -- : [390/885] 3651933=test_frozen_error I, [2024-05-04T18:59:16.897611 #3610569] INFO -- : [391/885] 3651933=test_gem_ext_ext_conf_builder I, [2024-05-04T18:59:16.942085 #3610569] INFO -- : [392/885] 3651935=test_path_to_class I, [2024-05-04T18:59:16.951861 #3610569] INFO -- : [393/885] 3651935=test_gem_dependency I, [2024-05-04T18:59:16.993495 #3610569] INFO -- : [394/885] 3651942=test_gem_resolver_specification I, [2024-05-04T18:59:17.036129 #3610569] INFO -- : [395/885] 3651942=test_rdoc_markup_verbatim I, [2024-05-04T18:59:17.039709 #3610569] INFO -- : [396/885] 3651942=test_inlinecache I, [2024-05-04T18:59:17.064832 #3610569] INFO -- : [397/885] 3651935=test_rdoc_markup_formatter I, [2024-05-04T18:59:17.076428 #3610569] INFO -- : [398/885] 3651932=test_thread_queue I, [2024-05-04T18:59:17.078612 #3610569] INFO -- : [399/885] 3651935=test_nowrite I, [2024-05-04T18:59:17.101346 #3610569] INFO -- : [400/885] 3651935=test_ansi_without_terminfo I, [2024-05-04T18:59:17.112027 #3610569] INFO -- : [401/885] 3651935=test_gem_commands_sources_command I, [2024-05-04T18:59:17.116954 #3610569] INFO -- : [402/885] 3651942=test_ractor I, [2024-05-04T18:59:17.130188 #3610569] INFO -- : [403/885] 3651942=test_euc_tw I, [2024-05-04T18:59:17.133582 #3610569] INFO -- : [404/885] 3651942=test_bmethod I, [2024-05-04T18:59:17.148879 #3610569] INFO -- : [405/885] 3651942=test_big2str I, [2024-05-04T18:59:17.150262 #3610569] INFO -- : [406/885] 3651942=test_handle I, [2024-05-04T18:59:17.164466 #3610569] INFO -- : [407/885] 3651934=test_wait I, [2024-05-04T18:59:17.244939 #3610569] INFO -- : [408/885] 3651934=test_forwardable I, [2024-05-04T18:59:17.273339 #3610569] INFO -- : [409/885] 3651934=test_yaml I, [2024-05-04T18:59:17.284506 #3610569] INFO -- : [410/885] 3651935=test_enc_str_buf_cat I, [2024-05-04T18:59:17.292539 #3610569] INFO -- : [411/885] 3651935=test_class2name I, [2024-05-04T18:59:17.298615 #3610569] INFO -- : [412/885] 3651935=test_gbk I, [2024-05-04T18:59:17.300969 #3610569] INFO -- : [413/885] 3651935=test_profile_frames I, [2024-05-04T18:59:17.324380 #3610569] INFO -- : [414/885] 3651943=test_cstr I, [2024-05-04T18:59:17.408023 #3610569] INFO -- : [415/885] 3651934=test_pstore I, [2024-05-04T18:59:17.452724 #3610569] INFO -- : [416/885] 3651942=json_fixtures_test I, [2024-05-04T18:59:17.455813 #3610569] INFO -- : [417/885] 3651942=test_shapes I, [2024-05-04T18:59:17.460910 #3610569] INFO -- : [418/885] 3651934=test_io_timeout I, [2024-05-04T18:59:17.461692 #3610569] INFO -- : [419/885] 3651942=test_rdoc_parser_c I, [2024-05-04T18:59:17.463338 #3610569] INFO -- : [420/885] 3651934=test_comparable I, [2024-05-04T18:59:17.475248 #3610569] INFO -- : [421/885] 3651934=test_wss I, [2024-05-04T18:59:17.486412 #3610569] INFO -- : [422/885] 3651934=test_fiddle I, [2024-05-04T18:59:17.491751 #3610569] INFO -- : [423/885] 3651935=test_find I, [2024-05-04T18:59:17.497345 #3610569] INFO -- : [424/885] 3651943=test_ractor I, [2024-05-04T18:59:17.506961 #3610569] INFO -- : [425/885] 3651935=test_digest I, [2024-05-04T18:59:17.508964 #3610569] INFO -- : [426/885] 3651929=test_marshalable I, [2024-05-04T18:59:17.512972 #3610569] INFO -- : [427/885] 3651929=test_require I, [2024-05-04T18:59:17.588133 #3610569] INFO -- : [428/885] 3651934=test_cgi_util I, [2024-05-04T18:59:17.638423 #3610569] INFO -- : [429/885] 3651943=test_gem_commands_contents_command I, [2024-05-04T18:59:17.739915 #3610569] INFO -- : [430/885] 3651942=test_gem_ext_cmake_builder I, [2024-05-04T18:59:17.765340 #3610569] INFO -- : [431/885] 3651942=test_formatter I, [2024-05-04T18:59:17.771056 #3610569] INFO -- : [432/885] 3651942=test_bash_completion I, [2024-05-04T18:59:17.775500 #3610569] INFO -- : [433/885] 3651942=test_rdoc_constant I, [2024-05-04T18:59:17.817364 #3610569] INFO -- : [434/885] 3651934=test_deprecate I, [2024-05-04T18:59:17.819915 #3610569] INFO -- : [435/885] 3651931=test_recorder I, [2024-05-04T18:59:17.824099 #3610569] INFO -- : [436/885] 3651931=test_gem_commands_owner_command I, [2024-05-04T18:59:17.849164 #3610569] INFO -- : [437/885] 3651934=test_gem_source_vendor I, [2024-05-04T18:59:17.861100 #3610569] INFO -- : [438/885] 3651934=test_pathname I, [2024-05-04T18:59:17.913711 #3610569] INFO -- : [439/885] 3651942=test_init I, [2024-05-04T18:59:17.950485 #3610569] INFO -- : [440/885] 3651943=test_complexrational I, [2024-05-04T18:59:17.959564 #3610569] INFO -- : [441/885] 3651943=test_gem_package_tar_reader I, [2024-05-04T18:59:18.014999 #3610569] INFO -- : [442/885] 3651943=regexp_test I, [2024-05-04T18:59:18.082648 #3610569] INFO -- : [443/885] 3651934=test_coverage I, [2024-05-04T18:59:18.091007 #3610569] INFO -- : [444/885] 3651939=test_rdoc_encoding I, [2024-05-04T18:59:18.110192 #3610569] INFO -- : [445/885] 3651943=test_file I, [2024-05-04T18:59:18.125692 #3610569] INFO -- : [446/885] 3651943=test_modify_expand I, [2024-05-04T18:59:18.132324 #3610569] INFO -- : [447/885] 3651939=test_rdoc_any_method I, [2024-05-04T18:59:18.133818 #3610569] INFO -- : [448/885] 3651943=test_gem_available_set I, [2024-05-04T18:59:18.196451 #3610569] INFO -- : [449/885] 3651938=test_rdoc_markdown I, [2024-05-04T18:59:18.226536 #3610569] INFO -- : [450/885] 3651926=test_process I, [2024-05-04T18:59:18.229044 #3610569] INFO -- : [451/885] 3651933=test_windows_1252 I, [2024-05-04T18:59:18.236301 #3610569] INFO -- : [452/885] 3651933=test_input_method I, [2024-05-04T18:59:18.245522 #3610569] INFO -- : [453/885] 3651926=test_cgi_session I, [2024-05-04T18:59:18.250070 #3610569] INFO -- : [454/885] 3651943=test_rdoc_rd I, [2024-05-04T18:59:18.259837 #3610569] INFO -- : [455/885] 3651926=test_metaclass I, [2024-05-04T18:59:18.268679 #3610569] INFO -- : [456/885] 3651926=test_rdoc_top_level I, [2024-05-04T18:59:18.383685 #3610569] INFO -- : [457/885] 3651935=test_signal I, [2024-05-04T18:59:18.384251 #3610569] INFO -- : [458/885] 3651931=test_fixnum I, [2024-05-04T18:59:18.399220 #3610569] INFO -- : [459/885] 3651931=test_x509crl I, [2024-05-04T18:59:18.403000 #3610569] INFO -- : [460/885] 3651943=test_refinement I, [2024-05-04T18:59:18.403860 #3610569] INFO -- : [461/885] 3651938=test_gem_commands_signout_command I, [2024-05-04T18:59:18.411705 #3610569] INFO -- : [462/885] 3651942=test_regex_casefold I, [2024-05-04T18:59:18.415419 #3610569] INFO -- : [463/885] 3651938=test_gem_source_git I, [2024-05-04T18:59:18.421634 #3610569] INFO -- : [464/885] 3651933=test_dir_m17n I, [2024-05-04T18:59:18.484059 #3610569] INFO -- : [465/885] 3651939=test_gem_resolver_installer_set I, [2024-05-04T18:59:18.551401 #3610569] INFO -- : [466/885] 3651926=test_float I, [2024-05-04T18:59:18.574650 #3610569] INFO -- : [467/885] 3651931=test_cgi_cookie I, [2024-05-04T18:59:18.590453 #3610569] INFO -- : [468/885] 3651931=test_require I, [2024-05-04T18:59:18.619207 #3610569] INFO -- : [469/885] 3651924=test_gem_resolver_git_set I, [2024-05-04T18:59:18.683008 #3610569] INFO -- : [470/885] 3651927=test_storage I, [2024-05-04T18:59:18.685885 #3610569] INFO -- : [471/885] 3651939=test_new I, [2024-05-04T18:59:18.690424 #3610569] INFO -- : [472/885] 3651927=test_cipher I, [2024-05-04T18:59:18.694881 #3610569] INFO -- : [473/885] 3651939=test_gem_security_signer I, [2024-05-04T18:59:18.753855 #3610569] INFO -- : [474/885] 3651937=test_debug I, [2024-05-04T18:59:18.754893 #3610569] INFO -- : [475/885] 3651928=pattern_test I, [2024-05-04T18:59:18.756151 #3610569] INFO -- : [476/885] 3651937=test_memory_view I, [2024-05-04T18:59:18.760673 #3610569] INFO -- : [477/885] 3651929=test_shellwords I, [2024-05-04T18:59:18.765249 #3610569] INFO -- : [478/885] 3651929=test_digest_extend I, [2024-05-04T18:59:18.774930 #3610569] INFO -- : [479/885] 3651939=test_string I, [2024-05-04T18:59:18.775660 #3610569] INFO -- : [480/885] 3651939=test_iterator I, [2024-05-04T18:59:18.776558 #3610569] INFO -- : [481/885] 3651927=test_omap I, [2024-05-04T18:59:18.781065 #3610569] INFO -- : [482/885] 3651929=test_struct I, [2024-05-04T18:59:18.783008 #3610569] INFO -- : [483/885] 3651927=test_rdoc_markup_to_html_snippet I, [2024-05-04T18:59:18.785579 #3610569] INFO -- : [484/885] 3651929=magic_comment_test I, [2024-05-04T18:59:18.786692 #3610569] INFO -- : [485/885] 3651937=test_sexp I, [2024-05-04T18:59:18.805739 #3610569] INFO -- : [486/885] 3651937=test_rdoc_markup_include I, [2024-05-04T18:59:18.807461 #3610569] INFO -- : [487/885] 3651937=fuzzer_test I, [2024-05-04T18:59:18.829490 #3610569] INFO -- : [488/885] 3651939=test_variable I, [2024-05-04T18:59:18.876000 #3610569] INFO -- : [489/885] 3651928=test_pkg_config I, [2024-05-04T18:59:18.889941 #3610569] INFO -- : [490/885] 3651937=test_cparser I, [2024-05-04T18:59:18.891231 #3610569] INFO -- : [491/885] 3651929=memsize_test I, [2024-05-04T18:59:18.891374 #3610569] INFO -- : [492/885] 3651928=json_parser_test I, [2024-05-04T18:59:18.893771 #3610569] INFO -- : [493/885] 3651929=test_nomethod_error I, [2024-05-04T18:59:18.897804 #3610569] INFO -- : [494/885] 3651934=test_config I, [2024-05-04T18:59:18.901123 #3610569] INFO -- : [495/885] 3651929=test_win32ole_variant_outarg I, [2024-05-04T18:59:18.904226 #3610569] INFO -- : [496/885] 3651929=test_gem_source_subpath_problem I, [2024-05-04T18:59:18.904523 #3610569] INFO -- : [497/885] 3651927=test_dln I, [2024-05-04T18:59:18.905942 #3610569] INFO -- : [498/885] 3651927=json_common_interface_test I, [2024-05-04T18:59:18.921829 #3610569] INFO -- : [499/885] 3651939=test_x509req I, [2024-05-04T18:59:18.929870 #3610569] INFO -- : [500/885] 3651927=test_mutex I, [2024-05-04T18:59:18.948532 #3610569] INFO -- : [501/885] 3651928=test_rdoc_rd_inline I, [2024-05-04T18:59:18.956577 #3610569] INFO -- : [502/885] 3651928=test_files_test_1 I, [2024-05-04T18:59:18.997668 #3610569] INFO -- : [503/885] 3651934=test_set I, [2024-05-04T18:59:19.014988 #3610569] INFO -- : [504/885] 3651929=test_gem_path_support I, [2024-05-04T18:59:19.025682 #3610569] INFO -- : [505/885] 3651938=test_struct I, [2024-05-04T18:59:19.026096 #3610569] INFO -- : [506/885] 3651924=test_serialize_subclasses I, [2024-05-04T18:59:19.029864 #3610569] INFO -- : [507/885] 3651934=test_insns_leaf I, [2024-05-04T18:59:19.030672 #3610569] INFO -- : [508/885] 3651924=test_color_printer I, [2024-05-04T18:59:19.033887 #3610569] INFO -- : [509/885] 3651934=test_deprecated I, [2024-05-04T18:59:19.037603 #3610569] INFO -- : [510/885] 3651924=test_win32ole_variant_m I, [2024-05-04T18:59:19.042157 #3610569] INFO -- : [511/885] 3651924=test_engine I, [2024-05-04T18:59:19.049311 #3610569] INFO -- : [512/885] 3651924=test_allocation I, [2024-05-04T18:59:19.050342 #3610569] INFO -- : [513/885] 3651934=test_div I, [2024-05-04T18:59:19.055136 #3610569] INFO -- : [514/885] 3651934=test_key_error I, [2024-05-04T18:59:19.058650 #3610569] INFO -- : [515/885] 3651929=test_arith_seq_extract I, [2024-05-04T18:59:19.059384 #3610569] INFO -- : [516/885] 3651942=test_method_name_check I, [2024-05-04T18:59:19.065729 #3610569] INFO -- : [517/885] 3651934=test_parser I, [2024-05-04T18:59:19.086901 #3610569] INFO -- : [518/885] 3651934=test_module I, [2024-05-04T18:59:19.090901 #3610569] INFO -- : [519/885] 3651942=test_gem_request_set I, [2024-05-04T18:59:19.122512 #3610569] INFO -- : [520/885] 3651939=constant_path_node_test I, [2024-05-04T18:59:19.239004 #3610569] INFO -- : [521/885] 3651939=test_gem_ext_cargo_builder I, [2024-05-04T18:59:19.255855 #3610569] INFO -- : [522/885] 3651939=test_ssl I, [2024-05-04T18:59:19.263366 #3610569] INFO -- : [523/885] 3651929=test_instrumentation_api I, [2024-05-04T18:59:19.424367 #3610569] INFO -- : [524/885] 3651938=integer_parse_test I, [2024-05-04T18:59:19.428003 #3610569] INFO -- : [525/885] 3651938=test_stringify_symbols I, [2024-05-04T18:59:19.437395 #3610569] INFO -- : [526/885] 3651938=test_boolean I, [2024-05-04T18:59:19.444046 #3610569] INFO -- : [527/885] 3651938=test_whileuntil I, [2024-05-04T18:59:19.453409 #3610569] INFO -- : [528/885] 3651938=test_rdoc_generator_markup I, [2024-05-04T18:59:19.455640 #3610569] INFO -- : [529/885] 3651938=test_configuration I, [2024-05-04T18:59:19.514912 #3610569] INFO -- : [530/885] 3651942=test_rubyvm I, [2024-05-04T18:59:19.533870 #3610569] INFO -- : [531/885] 3651942=test_buffered_io I, [2024-05-04T18:59:19.579029 #3610569] INFO -- : [532/885] 3651942=test_monitor I, [2024-05-04T18:59:19.581951 #3610569] INFO -- : [533/885] 3651938=test_https I, [2024-05-04T18:59:19.655677 #3610569] INFO -- : [534/885] 3651941=test_gem_ext_builder I, [2024-05-04T18:59:19.667131 #3610569] INFO -- : [535/885] 3651933=test_evaluation I, [2024-05-04T18:59:19.668451 #3610569] INFO -- : [536/885] 3651937=test_abi I, [2024-05-04T18:59:19.674015 #3610569] INFO -- : [537/885] 3651933=test_provider I, [2024-05-04T18:59:19.794129 #3610569] INFO -- : [538/885] 3651942=test_rdoc_parser_simple I, [2024-05-04T18:59:19.808911 #3610569] INFO -- : [539/885] 3651942=test_gem_commands_rebuild_command I, [2024-05-04T18:59:19.879775 #3610569] INFO -- : [540/885] 3651942=test_yamldbm I, [2024-05-04T18:59:19.880088 #3610569] INFO -- : [541/885] 3651937=test_load I, [2024-05-04T18:59:19.885110 #3610569] INFO -- : [542/885] 3651937=test_gem_source I, [2024-05-04T18:59:19.885760 #3610569] INFO -- : [543/885] 3651942=test_scalar_scanner I, [2024-05-04T18:59:19.897783 #3610569] INFO -- : [544/885] 3651942=test_gem_commands_outdated_command I, [2024-05-04T18:59:19.910103 #3610569] INFO -- : [545/885] 3651938=test_gem_package_tar_writer I, [2024-05-04T18:59:19.953694 #3610569] INFO -- : [546/885] 3651942=test_helper_method I, [2024-05-04T18:59:19.965934 #3610569] INFO -- : [547/885] 3651942=test_array I, [2024-05-04T18:59:19.972816 #3610569] INFO -- : [548/885] 3651926=test_gem_dependency_list I, [2024-05-04T18:59:20.018483 #3610569] INFO -- : [549/885] 3651933=test_benchmark I, [2024-05-04T18:59:20.024908 #3610569] INFO -- : [550/885] 3651938=test_win32ole_method_event I, [2024-05-04T18:59:20.030345 #3610569] INFO -- : [551/885] 3651938=test_nesting_parser I, [2024-05-04T18:59:20.051165 #3610569] INFO -- : [552/885] 3651926=test_assembler I, [2024-05-04T18:59:20.054641 #3610569] INFO -- : [553/885] 3651926=test_spell_checker I, [2024-05-04T18:59:20.059051 #3610569] INFO -- : [554/885] 3651927=attribute_write_test I, [2024-05-04T18:59:20.069229 #3610569] INFO -- : [555/885] 3651926=test_propertyputref I, [2024-05-04T18:59:20.071336 #3610569] INFO -- : [556/885] 3651926=test_rational I, [2024-05-04T18:59:20.082637 #3610569] INFO -- : [557/885] 3651938=test_rational2 I, [2024-05-04T18:59:20.086159 #3610569] INFO -- : [558/885] 3651926=test_len I, [2024-05-04T18:59:20.089601 #3610569] INFO -- : [559/885] 3651926=test_yield_block I, [2024-05-04T18:59:20.091058 #3610569] INFO -- : [560/885] 3651926=test_completion I, [2024-05-04T18:59:20.091673 #3610569] INFO -- : [561/885] 3651938=test_gem_commands_cert_command I, [2024-05-04T18:59:20.097331 #3610569] INFO -- : [562/885] 3651937=test_x509ext I, [2024-05-04T18:59:20.107851 #3610569] INFO -- : [563/885] 3651937=test_erb I, [2024-05-04T18:59:20.138046 #3610569] INFO -- : [564/885] 3651927=test_gem_source_installed I, [2024-05-04T18:59:20.143524 #3610569] INFO -- : [565/885] 3651937=test_name_error_extension I, [2024-05-04T18:59:20.148788 #3610569] INFO -- : [566/885] 3651937=test_chilled I, [2024-05-04T18:59:20.152325 #3610569] INFO -- : [567/885] 3651937=test_rdoc_i18n_locale I, [2024-05-04T18:59:20.154989 #3610569] INFO -- : [568/885] 3651927=test_win32ole_param I, [2024-05-04T18:59:20.158887 #3610569] INFO -- : [569/885] 3651937=test_gem_commands_yank_command I, [2024-05-04T18:59:20.159888 #3610569] INFO -- : [570/885] 3651927=test_pair I, [2024-05-04T18:59:20.250513 #3610569] INFO -- : [571/885] 3651940=test_document I, [2024-05-04T18:59:20.258628 #3610569] INFO -- : [572/885] 3651940=test_rdoc_generator_pot_po_entry I, [2024-05-04T18:59:20.265699 #3610569] INFO -- : [573/885] 3651940=test_euc_jp I, [2024-05-04T18:59:20.272594 #3610569] INFO -- : [574/885] 3651940=test_acceptable I, [2024-05-04T18:59:20.344579 #3610569] INFO -- : [575/885] 3651940=test_rbconfig I, [2024-05-04T18:59:20.347740 #3610569] INFO -- : [576/885] 3651940=test_human_typo I, [2024-05-04T18:59:20.357944 #3610569] INFO -- : [577/885] 3651940=test_primitive I, [2024-05-04T18:59:20.384279 #3610569] INFO -- : [578/885] 3651940=test_color I, [2024-05-04T18:59:20.519719 #3610569] INFO -- : [579/885] 3651940=json_encoding_test I, [2024-05-04T18:59:20.532097 #3610569] INFO -- : [580/885] 3651940=test_key_stroke I, [2024-05-04T18:59:20.535342 #3610569] INFO -- : [581/885] 3651935=test_install I, [2024-05-04T18:59:20.542770 #3610569] INFO -- : [582/885] 3651940=test_rdoc_markup_to_label I, [2024-05-04T18:59:20.565518 #3610569] INFO -- : [583/885] 3651940=test_sockopt I, [2024-05-04T18:59:20.569834 #3610569] INFO -- : [584/885] 3651940=test_encoding I, [2024-05-04T18:59:20.577300 #3610569] INFO -- : [585/885] 3651940=test_httpresponses I, [2024-05-04T18:59:20.627190 #3610569] INFO -- : [586/885] 3651940=test_set_len I, [2024-05-04T18:59:20.632220 #3610569] INFO -- : [587/885] 3651940=test_httpheader I, [2024-05-04T18:59:20.637436 #3610569] INFO -- : [588/885] 3651937=test_gem_resolver_local_specification I, [2024-05-04T18:59:20.648065 #3610569] INFO -- : [589/885] 3651940=test_rdoc_ri_driver I, [2024-05-04T18:59:20.664666 #3610569] INFO -- : [590/885] 3651937=test_http I, [2024-05-04T18:59:20.754998 #3610569] INFO -- : [591/885] 3651935=test_addrinfo I, [2024-05-04T18:59:20.788391 #3610569] INFO -- : [592/885] 3651935=test_tree_spell_checker I, [2024-05-04T18:59:20.794566 #3610569] INFO -- : [593/885] 3651941=test_path I, [2024-05-04T18:59:20.802112 #3610569] INFO -- : [594/885] 3651941=test_case_mapping I, [2024-05-04T18:59:20.809749 #3610569] INFO -- : [595/885] 3651941=redundant_return_test I, [2024-05-04T18:59:20.816008 #3610569] INFO -- : [596/885] 3651941=test_bn I, [2024-05-04T18:59:20.823289 #3610569] INFO -- : [597/885] 3651935=test_win32ole_param_event I, [2024-05-04T18:59:20.827933 #3610569] INFO -- : [598/885] 3651926=test_compile_prism I, [2024-05-04T18:59:20.829237 #3610569] INFO -- : [599/885] 3651935=test_terminfo I, [2024-05-04T18:59:20.829298 #3610569] INFO -- : [600/885] 3651935=test_date_compat I, [2024-05-04T18:59:20.832841 #3610569] INFO -- : [601/885] 3651935=test_rdoc_markup_to_html I, [2024-05-04T18:59:20.834587 #3610569] INFO -- : [602/885] 3651941=test_bug-14834 I, [2024-05-04T18:59:20.884710 #3610569] INFO -- : [603/885] 3651936=test_key_event_record I, [2024-05-04T18:59:20.885721 #3610569] INFO -- : [604/885] 3651936=test_gem_uri I, [2024-05-04T18:59:20.910727 #3610569] INFO -- : [605/885] 3651936=test_random I, [2024-05-04T18:59:20.919044 #3610569] INFO -- : [606/885] 3651936=test_notimplement I, [2024-05-04T18:59:20.921803 #3610569] INFO -- : [607/885] 3651935=test_gem_commands_update_command I, [2024-05-04T18:59:20.923079 #3610569] INFO -- : [608/885] 3651936=test_gem_resolver_vendor_specification I, [2024-05-04T18:59:20.923578 #3610569] INFO -- : [609/885] 3651941=test_thread_cv I, [2024-05-04T18:59:20.937362 #3610569] INFO -- : [610/885] 3651940=test_lexer I, [2024-05-04T18:59:20.951531 #3610569] INFO -- : [611/885] 3651940=test_ssl_session I, [2024-05-04T18:59:20.961847 #3610569] INFO -- : [612/885] 3651936=parameters_signature_test I, [2024-05-04T18:59:20.964815 #3610569] INFO -- : [613/885] 3651936=test_koi8 I, [2024-05-04T18:59:20.970681 #3610569] INFO -- : [614/885] 3651936=test_enumerator I, [2024-05-04T18:59:20.975256 #3610569] INFO -- : [615/885] 3651936=test_rdoc_parser_changelog I, [2024-05-04T18:59:21.041147 #3610569] INFO -- : [616/885] 3651936=test_unicode I, [2024-05-04T18:59:21.054025 #3610569] INFO -- : [617/885] 3651936=test_rdoc_generator_pot I, [2024-05-04T18:59:21.058099 #3610569] INFO -- : [618/885] 3651936=test_gem_gem_runner I, [2024-05-04T18:59:21.102757 #3610569] INFO -- : [619/885] 3651936=test_filter I, [2024-05-04T18:59:21.113721 #3610569] INFO -- : [620/885] 3651926=test_data I, [2024-05-04T18:59:21.116970 #3610569] INFO -- : [621/885] 3651926=static_literals_test I, [2024-05-04T18:59:21.120017 #3610569] INFO -- : [622/885] 3651926=test_rdoc_method_attr I, [2024-05-04T18:59:21.123406 #3610569] INFO -- : [623/885] 3651936=test_cmethod I, [2024-05-04T18:59:21.127864 #3610569] INFO -- : [624/885] 3651936=test_tracer I, [2024-05-04T18:59:21.159563 #3610569] INFO -- : [625/885] 3651938=test_append I, [2024-05-04T18:59:21.168435 #3610569] INFO -- : [626/885] 3651938=test_option I, [2024-05-04T18:59:21.171627 #3610569] INFO -- : [627/885] 3651936=test_gem_commands_server_command I, [2024-05-04T18:59:21.181229 #3610569] INFO -- : [628/885] 3651936=test_variable_name_check I, [2024-05-04T18:59:21.212116 #3610569] INFO -- : [629/885] 3651931=test_io_m17n I, [2024-05-04T18:59:21.221408 #3610569] INFO -- : [630/885] 3651926=test_did_you_mean I, [2024-05-04T18:59:21.233280 #3610569] INFO -- : [631/885] 3651936=test_interned_str I, [2024-05-04T18:59:21.237563 #3610569] INFO -- : [632/885] 3651936=test_case_comprehensive I, [2024-05-04T18:59:21.252114 #3610569] INFO -- : [633/885] 3651938=test_gem_commands_build_command I, [2024-05-04T18:59:21.298031 #3610569] INFO -- : [634/885] 3651933=test_scheduler I, [2024-05-04T18:59:21.314732 #3610569] INFO -- : [635/885] 3651926=test_pkey_dsa I, [2024-05-04T18:59:21.408149 #3610569] INFO -- : [636/885] 3651943=test_class I, [2024-05-04T18:59:21.415132 #3610569] INFO -- : [637/885] 3651943=test_ocsp I, [2024-05-04T18:59:21.440660 #3610569] INFO -- : [638/885] 3651933=test_rdoc_markup_heading I, [2024-05-04T18:59:21.452106 #3610569] INFO -- : [639/885] 3651933=test_iseq I, [2024-05-04T18:59:21.463177 #3610569] INFO -- : [640/885] 3651932=test_exception_at_throwing I, [2024-05-04T18:59:21.516508 #3610569] INFO -- : [641/885] 3651932=test_pinned I, [2024-05-04T18:59:21.524699 #3610569] INFO -- : [642/885] 3651934=test_webauthn_listener_response I, [2024-05-04T18:59:21.536234 #3610569] INFO -- : [643/885] 3651934=test_time I, [2024-05-04T18:59:21.552833 #3610569] INFO -- : [644/885] 3651938=test_to_ary_concat I, [2024-05-04T18:59:21.559151 #3610569] INFO -- : [645/885] 3651941=test_stream I, [2024-05-04T18:59:21.563351 #3610569] INFO -- : [646/885] 3651932=test_rdoc_markup_pre_process I, [2024-05-04T18:59:21.565426 #3610569] INFO -- : [647/885] 3651941=test_printf I, [2024-05-04T18:59:21.589374 #3610569] INFO -- : [648/885] 3651924=test_rdoc_markup_to_bs I, [2024-05-04T18:59:21.596854 #3610569] INFO -- : [649/885] 3651941=test_help I, [2024-05-04T18:59:21.617702 #3610569] INFO -- : [650/885] 3651941=test_gem_commands_unpack_command I, [2024-05-04T18:59:21.646544 #3610569] INFO -- : [651/885] 3651932=test_files_lib I, [2024-05-04T18:59:21.655577 #3610569] INFO -- : [652/885] 3651924=test_beginendblock I, [2024-05-04T18:59:21.670791 #3610569] INFO -- : [653/885] 3651928=reflection_test I, [2024-05-04T18:59:21.683486 #3610569] INFO -- : [654/885] 3651928=test_gem_bundler_version_finder I, [2024-05-04T18:59:21.720869 #3610569] INFO -- : [655/885] 3651928=test_emoji_breaks I, [2024-05-04T18:59:21.724512 #3610569] INFO -- : [656/885] 3651928=test_within_pipe I, [2024-05-04T18:59:21.753118 #3610569] INFO -- : [657/885] 3651928=test_bundled_ca I, [2024-05-04T18:59:21.756743 #3610569] INFO -- : [658/885] 3651943=test_closure I, [2024-05-04T18:59:21.762611 #3610569] INFO -- : [659/885] 3651934=test_fiber I, [2024-05-04T18:59:21.828510 #3610569] INFO -- : [660/885] 3651941=test_multi_irb_commands I, [2024-05-04T18:59:21.831754 #3610569] INFO -- : [661/885] 3651941=test_open3 I, [2024-05-04T18:59:22.028400 #3610569] INFO -- : [662/885] 3651943=test_ractor I, [2024-05-04T18:59:22.030779 #3610569] INFO -- : [663/885] 3651935=test_gem_security I, [2024-05-04T18:59:22.097613 #3610569] INFO -- : [664/885] 3651943=test_rdoc_servlet I, [2024-05-04T18:59:22.108405 #3610569] INFO -- : [665/885] 3651940=test_digest I, [2024-05-04T18:59:22.113436 #3610569] INFO -- : [666/885] 3651924=test_exit I, [2024-05-04T18:59:22.125892 #3610569] INFO -- : [667/885] 3651940=test_recursion I, [2024-05-04T18:59:22.128509 #3610569] INFO -- : [668/885] 3651940=test_history I, [2024-05-04T18:59:22.183982 #3610569] INFO -- : [669/885] 3651940=test_date_marshal I, [2024-05-04T18:59:22.187980 #3610569] INFO -- : [670/885] 3651940=test_mkmf I, [2024-05-04T18:59:22.192726 #3610569] INFO -- : [671/885] 3651943=test_delegate I, [2024-05-04T18:59:22.204735 #3610569] INFO -- : [672/885] 3651924=test_popen_deadlock I, [2024-05-04T18:59:22.205399 #3610569] INFO -- : [673/885] 3651933=static_inspect_test I, [2024-05-04T18:59:22.209586 #3610569] INFO -- : [674/885] 3651943=test_udp I, [2024-05-04T18:59:22.222061 #3610569] INFO -- : [675/885] 3651943=bom_test I, [2024-05-04T18:59:22.233640 #3610569] INFO -- : [676/885] 3651929=test_data_error I, [2024-05-04T18:59:22.249081 #3610569] INFO -- : [677/885] 3651943=test_force_exit I, [2024-05-04T18:59:22.263247 #3610569] INFO -- : [678/885] 3651940=test_file I, [2024-05-04T18:59:22.298069 #3610569] INFO -- : [679/885] 3651933=unescape_test I, [2024-05-04T18:59:22.313276 #3610569] INFO -- : [680/885] 3651929=test_ostruct I, [2024-05-04T18:59:22.322454 #3610569] INFO -- : [681/885] 3651943=test_tmpdir I, [2024-05-04T18:59:22.440506 #3610569] INFO -- : [682/885] 3651943=test_rdoc_markup_document I, [2024-05-04T18:59:22.446639 #3610569] INFO -- : [683/885] 3651943=test_integer_comb I, [2024-05-04T18:59:22.447712 #3610569] INFO -- : [684/885] 3651929=test_vm_dump I, [2024-05-04T18:59:22.451502 #3610569] INFO -- : [685/885] 3651929=errors_test I, [2024-05-04T18:59:22.461834 #3610569] INFO -- : [686/885] 3651926=test_regexp I, [2024-05-04T18:59:22.515188 #3610569] INFO -- : [687/885] 3651929=test_gem_commands_check_command I, [2024-05-04T18:59:22.536441 #3610569] INFO -- : [688/885] 3651929=test_ensured I, [2024-05-04T18:59:22.597692 #3610569] INFO -- : [689/885] 3651929=test_addr I, [2024-05-04T18:59:22.616259 #3610569] INFO -- : [690/885] 3651929=test_locale I, [2024-05-04T18:59:22.643146 #3610569] INFO -- : [691/885] 3651929=library_symbols_test I, [2024-05-04T18:59:22.660962 #3610569] INFO -- : [692/885] 3651929=test_ts I, [2024-05-04T18:59:22.673000 #3610569] INFO -- : [693/885] 3651931=test_rdoc_ri_paths I, [2024-05-04T18:59:22.695935 #3610569] INFO -- : [694/885] 3651931=test_project_sanity I, [2024-05-04T18:59:22.769979 #3610569] INFO -- : [695/885] 3651931=test_range I, [2024-05-04T18:59:22.816598 #3610569] INFO -- : [696/885] 3651924=command_line_test I, [2024-05-04T18:59:22.833615 #3610569] INFO -- : [697/885] 3651924=test_pty I, [2024-05-04T18:59:23.110491 #3610569] INFO -- : [698/885] 3651929=test_dup I, [2024-05-04T18:59:23.112266 #3610569] INFO -- : [699/885] 3651928=test_constant I, [2024-05-04T18:59:23.261673 #3610569] INFO -- : [700/885] 3651938=test_erb_command I, [2024-05-04T18:59:23.284696 #3610569] INFO -- : [701/885] 3651929=test_helper I, [2024-05-04T18:59:23.289068 #3610569] INFO -- : [702/885] 3651924=test_encoding I, [2024-05-04T18:59:23.289265 #3610569] INFO -- : [703/885] 3651929=test_gem_uri_formatter I, [2024-05-04T18:59:23.293969 #3610569] INFO -- : [704/885] 3651938=json_generator_test I, [2024-05-04T18:59:23.315258 #3610569] INFO -- : [705/885] 3651929=test_eval I, [2024-05-04T18:59:23.361831 #3610569] INFO -- : [706/885] 3651931=test_transcode I, [2024-05-04T18:59:23.385910 #3610569] INFO -- : [707/885] 3651938=test_gem_resolver_api_set I, [2024-05-04T18:59:23.447422 #3610569] INFO -- : [708/885] 3651938=test_gem_safe_marshal I, [2024-05-04T18:59:23.469963 #3610569] INFO -- : [709/885] 3651924=test_enumerable I, [2024-05-04T18:59:23.474610 #3610569] INFO -- : [710/885] 3651924=test_config I, [2024-05-04T18:59:23.487351 #3610569] INFO -- : [711/885] 3651929=test_gem_resolver_vendor_set I, [2024-05-04T18:59:23.502164 #3610569] INFO -- : [712/885] 3651929=test_webauthn_listener I, [2024-05-04T18:59:23.546572 #3610569] INFO -- : [713/885] 3651931=test_helper I, [2024-05-04T18:59:23.547878 #3610569] INFO -- : [714/885] 3651929=test_random_formatter I, [2024-05-04T18:59:23.565513 #3610569] INFO -- : [715/885] 3651929=test_jaro_winkler I, [2024-05-04T18:59:23.574652 #3610569] INFO -- : [716/885] 3651929=test_lambda I, [2024-05-04T18:59:23.613098 #3610569] INFO -- : [717/885] 3651931=test_ast I, [2024-05-04T18:59:23.629283 #3610569] INFO -- : [718/885] 3651929=test_gem_request_set_gem_dependency_api I, [2024-05-04T18:59:23.704970 #3610569] INFO -- : [719/885] 3651927=test_update I, [2024-05-04T18:59:23.738102 #3610569] INFO -- : [720/885] 3651927=test_x509name I, [2024-05-04T18:59:23.759120 #3610569] INFO -- : [721/885] 3651927=test_fips I, [2024-05-04T18:59:23.822031 #3610569] INFO -- : [722/885] 3651924=test_x509store I, [2024-05-04T18:59:23.883969 #3610569] INFO -- : [723/885] 3651929=test_rdoc_code_object I, [2024-05-04T18:59:24.061087 #3610569] INFO -- : [724/885] 3651938=test_keyword I, [2024-05-04T18:59:24.074444 #3610569] INFO -- : [725/885] 3651927=test_class_name_check I, [2024-05-04T18:59:24.085671 #3610569] INFO -- : [726/885] 3651924=test_fd_setsize I, [2024-05-04T18:59:24.085985 #3610569] INFO -- : [727/885] 3651924=test_continuation I, [2024-05-04T18:59:24.095959 #3610569] INFO -- : [728/885] 3651924=test_win32ole_method I, [2024-05-04T18:59:24.096622 #3610569] INFO -- : [729/885] 3651924=test_delete I, [2024-05-04T18:59:24.106747 #3610569] INFO -- : [730/885] 3651924=test_gem_platform I, [2024-05-04T18:59:24.122909 #3610569] INFO -- : [731/885] 3651927=test_placearg I, [2024-05-04T18:59:24.199837 #3610569] INFO -- : [732/885] 3651924=test_date_strptime I, [2024-05-04T18:59:24.255653 #3610569] INFO -- : [733/885] 3651941=test_gem_package_task I, [2024-05-04T18:59:24.260343 #3610569] INFO -- : [734/885] 3651941=test_rdoc_markup_hard_break I, [2024-05-04T18:59:24.265795 #3610569] INFO -- : [735/885] 3651941=test_weakkeymap I, [2024-05-04T18:59:24.273379 #3610569] INFO -- : [736/885] 3651927=test_gem_commands_push_command I, [2024-05-04T18:59:24.289609 #3610569] INFO -- : [737/885] 3651924=test_numhash I, [2024-05-04T18:59:24.294570 #3610569] INFO -- : [738/885] 3651924=test_pkey_rsa I, [2024-05-04T18:59:24.312679 #3610569] INFO -- : [739/885] 3651933=test_rdoc_parser_markdown I, [2024-05-04T18:59:24.316910 #3610569] INFO -- : [740/885] 3651929=test_not I, [2024-05-04T18:59:24.321714 #3610569] INFO -- : [741/885] 3651929=test_gem_resolver_lock_set I, [2024-05-04T18:59:24.348114 #3610569] INFO -- : [742/885] 3651929=test_import I, [2024-05-04T18:59:24.357962 #3610569] INFO -- : [743/885] 3651933=test_logger I, [2024-05-04T18:59:24.411349 #3610569] INFO -- : [744/885] 3651933=test_file_exhaustive I, [2024-05-04T18:59:24.485203 #3610569] INFO -- : [745/885] 3651924=test_files_test I, [2024-05-04T18:59:24.502992 #3610569] INFO -- : [746/885] 3651941=test_gem_update_suggestion I, [2024-05-04T18:59:24.540125 #3610569] INFO -- : [747/885] 3651941=test_arithmetic_sequence I, [2024-05-04T18:59:24.540740 #3610569] INFO -- : [748/885] 3651924=test_gem_gemcutter_utilities I, [2024-05-04T18:59:24.546016 #3610569] INFO -- : [749/885] 3651941=test_basicinstructions I, [2024-05-04T18:59:24.591440 #3610569] INFO -- : [750/885] 3651941=test_gem_command_manager I, [2024-05-04T18:59:24.653142 #3610569] INFO -- : [751/885] 3651938=test_key_actor_emacs I, [2024-05-04T18:59:24.695575 #3610569] INFO -- : [752/885] 3651941=version_test I, [2024-05-04T18:59:24.697465 #3610569] INFO -- : [753/885] 3651941=test_object I, [2024-05-04T18:59:24.701531 #3610569] INFO -- : [754/885] 3651941=heredoc_dedent_test I, [2024-05-04T18:59:24.704091 #3610569] INFO -- : [755/885] 3651941=test_cgi_header I, [2024-05-04T18:59:24.708733 #3610569] INFO -- : [756/885] 3651938=test_signedness I, [2024-05-04T18:59:24.713022 #3610569] INFO -- : [757/885] 3651941=test_tsort I, [2024-05-04T18:59:24.719084 #3610569] INFO -- : [758/885] 3651941=test_rdoc_rd_block_parser I, [2024-05-04T18:59:24.741441 #3610569] INFO -- : [759/885] 3651941=test_big5 I, [2024-05-04T18:59:24.742253 #3610569] INFO -- : [760/885] 3651941=test_func I, [2024-05-04T18:59:24.813472 #3610569] INFO -- : [761/885] 3651927=test_pointer I, [2024-05-04T18:59:24.859911 #3610569] INFO -- : [762/885] 3651924=test_ractor I, [2024-05-04T18:59:24.918479 #3610569] INFO -- : [763/885] 3651924=test_type I, [2024-05-04T18:59:24.929403 #3610569] INFO -- : [764/885] 3651924=test_sleep I, [2024-05-04T18:59:25.071251 #3610569] INFO -- : [765/885] 3651942=test_object I, [2024-05-04T18:59:25.178922 #3610569] INFO -- : [766/885] 3651927=test_ruby_lex I, [2024-05-04T18:59:25.314702 #3610569] INFO -- : [767/885] 3651927=test_date_arith I, [2024-05-04T18:59:25.323289 #3610569] INFO -- : [768/885] 3651927=test_gem_local_remote_options I, [2024-05-04T18:59:25.362299 #3610569] INFO -- : [769/885] 3651927=test_timeout I, [2024-05-04T18:59:25.365953 #3610569] INFO -- : [770/885] 3651927=test_normalize I, [2024-05-04T18:59:25.369726 #3610569] INFO -- : [771/885] 3651927=test_ossl I, [2024-05-04T18:59:25.383660 #3610569] INFO -- : [772/885] 3651928=test_change_word I, [2024-05-04T18:59:25.389181 #3610569] INFO -- : [773/885] 3651928=compiler_test I, [2024-05-04T18:59:25.396945 #3610569] INFO -- : [774/885] 3651928=test_flip I, [2024-05-04T18:59:25.423569 #3610569] INFO -- : [775/885] 3651928=test_have_macro I, [2024-05-04T18:59:25.458594 #3610569] INFO -- : [776/885] 3651942=test_gem_package I, [2024-05-04T18:59:25.529160 #3610569] INFO -- : [777/885] 3651929=test_complex2 I, [2024-05-04T18:59:25.535199 #3610569] INFO -- : [778/885] 3651929=test_resolve_symbol I, [2024-05-04T18:59:25.578220 #3610569] INFO -- : [779/885] 3651929=test_threadgroup I, [2024-05-04T18:59:25.600862 #3610569] INFO -- : [780/885] 3651943=test_enum I, [2024-05-04T18:59:25.610375 #3610569] INFO -- : [781/885] 3651930=test_gem_specification I, [2024-05-04T18:59:25.745026 #3610569] INFO -- : [782/885] 3651928=test_win32ole_variable I, [2024-05-04T18:59:25.745078 #3610569] INFO -- : [783/885] 3651928=test_io_wait_uncommon I, [2024-05-04T18:59:25.750616 #3610569] INFO -- : [784/885] 3651928=test_stringio I, [2024-05-04T18:59:25.857446 #3610569] INFO -- : [785/885] 3651928=test_arity I, [2024-05-04T18:59:25.866003 #3610569] INFO -- : [786/885] 3651928=test_gem_ci_detector I, [2024-05-04T18:59:25.871139 #3610569] INFO -- : [787/885] 3651928=test_rdoc_class_module I, [2024-05-04T18:59:25.901378 #3610569] INFO -- : [788/885] 3651932=test_bignum I, [2024-05-04T18:59:25.946847 #3610569] INFO -- : [789/885] 3651942=test_rdoc_generator_json_index I, [2024-05-04T18:59:25.963039 #3610569] INFO -- : [790/885] 3651942=test_time_tz I, [2024-05-04T18:59:26.001256 #3610569] INFO -- : [791/885] 3651942=test_win32ole_event I, [2024-05-04T18:59:26.003441 #3610569] INFO -- : [792/885] 3651942=test_trace I, [2024-05-04T18:59:26.007749 #3610569] INFO -- : [793/885] 3651941=ractor_test I, [2024-05-04T18:59:26.018339 #3610569] INFO -- : [794/885] 3651942=test_gem_resolver_api_specification I, [2024-05-04T18:59:26.036892 #3610569] INFO -- : [795/885] 3651932=test_ipaddr I, [2024-05-04T18:59:26.040276 #3610569] INFO -- : [796/885] 3651942=test_rdoc_markup_to_ansi I, [2024-05-04T18:59:26.057261 #3610569] INFO -- : [797/885] 3651941=test_mixed_unicode_escapes I, [2024-05-04T18:59:26.059191 #3610569] INFO -- : [798/885] 3651941=test_history I, [2024-05-04T18:59:26.062689 #3610569] INFO -- : [799/885] 3651942=test_win32ole_variant I, [2024-05-04T18:59:26.064736 #3610569] INFO -- : [800/885] 3651932=test_rdoc_extend I, [2024-05-04T18:59:26.070342 #3610569] INFO -- : [801/885] 3651942=test_merge_keys I, [2024-05-04T18:59:26.080951 #3610569] INFO -- : [802/885] 3651942=test_gem_source_fetch_problem I, [2024-05-04T18:59:26.091373 #3610569] INFO -- : [803/885] 3651942=json_generic_object_test I, [2024-05-04T18:59:26.091440 #3610569] INFO -- : [804/885] 3651932=test_http_request I, [2024-05-04T18:59:26.096280 #3610569] INFO -- : [805/885] 3651941=test_rdoc_generator_darkfish I, [2024-05-04T18:59:26.097567 #3610569] INFO -- : [806/885] 3651932=test_error_highlight I, [2024-05-04T18:59:26.100704 #3610569] INFO -- : [807/885] 3651942=test_resize I, [2024-05-04T18:59:26.108669 #3610569] INFO -- : [808/885] 3651942=test_rdoc_comment I, [2024-05-04T18:59:26.138653 #3610569] INFO -- : [809/885] 3651942=test_mailto I, [2024-05-04T18:59:26.143108 #3610569] INFO -- : [810/885] 3651942=test_coderange I, [2024-05-04T18:59:26.147929 #3610569] INFO -- : [811/885] 3651942=test_symbol I, [2024-05-04T18:59:26.149381 #3610569] INFO -- : [812/885] 3651942=location_test I, [2024-05-04T18:59:26.195726 #3610569] INFO -- : [813/885] 3651942=test_ractor_compatibility I, [2024-05-04T18:59:26.280982 #3610569] INFO -- : [814/885] 3651928=test_autoconf I, [2024-05-04T18:59:26.284077 #3610569] INFO -- : [815/885] 3651928=test_eval I, [2024-05-04T18:59:26.286105 #3610569] INFO -- : [816/885] 3651928=test_date_ractor I, [2024-05-04T18:59:26.303086 #3610569] INFO -- : [817/885] 3651941=test_gem_console_ui I, [2024-05-04T18:59:26.306148 #3610569] INFO -- : [818/885] 3651941=test_dir I, [2024-05-04T18:59:26.461653 #3610569] INFO -- : [819/885] 3651928=format_errors_test I, [2024-05-04T18:59:26.462455 #3610569] INFO -- : [820/885] 3651928=test_gem_commands_cleanup_command I, [2024-05-04T18:59:26.465613 #3610569] INFO -- : [821/885] 3651942=test_word I, [2024-05-04T18:59:26.470935 #3610569] INFO -- : [822/885] 3651942=test_cgi_multipart I, [2024-05-04T18:59:26.478874 #3610569] INFO -- : [823/885] 3651941=test_numeric I, [2024-05-04T18:59:26.483469 #3610569] INFO -- : [824/885] 3651941=test_member I, [2024-05-04T18:59:26.486034 #3610569] INFO -- : [825/885] 3651941=test_symbol I, [2024-05-04T18:59:26.580385 #3610569] INFO -- : [826/885] 3651929=test_coder I, [2024-05-04T18:59:26.592214 #3610569] INFO -- : [827/885] 3651929=test_nofree I, [2024-05-04T18:59:26.592685 #3610569] INFO -- : [828/885] 3651929=test_gem_commands_pristine_command I, [2024-05-04T18:59:26.600090 #3610569] INFO -- : [829/885] 3651943=test_context I, [2024-05-04T18:59:26.610358 #3610569] INFO -- : [830/885] 3651942=ruby_api_test I, [2024-05-04T18:59:26.631734 #3610569] INFO -- : [831/885] 3651932=test_find_executable I, [2024-05-04T18:59:26.642520 #3610569] INFO -- : [832/885] 3651932=test_enc_associate I, [2024-05-04T18:59:26.683234 #3610569] INFO -- : [833/885] 3651943=test_lazy_enumerator I, [2024-05-04T18:59:26.750701 #3610569] INFO -- : [834/885] 3651942=test_unix I, [2024-05-04T18:59:26.798635 #3610569] INFO -- : [835/885] 3651942=test_gem_resolver_requirement_list I, [2024-05-04T18:59:26.806509 #3610569] INFO -- : [836/885] 3651942=test_arith_seq_beg_len_step I, [2024-05-04T18:59:26.850567 #3610569] INFO -- : [837/885] 3651928=test_pkcs7 I, [2024-05-04T18:59:26.906498 #3610569] INFO -- : [838/885] 3651942=test_function_entry I, [2024-05-04T18:59:26.908360 #3610569] INFO -- : [839/885] 3651942=test_nextafter I, [2024-05-04T18:59:26.963535 #3610569] INFO -- : [840/885] 3651942=test_capacity I, [2024-05-04T18:59:26.965748 #3610569] INFO -- : [841/885] 3651942=test_gem_request_set_lockfile_tokenizer I, [2024-05-04T18:59:26.985983 #3610569] INFO -- : [842/885] 3651938=test_stat I, [2024-05-04T18:59:26.990511 #3610569] INFO -- : [843/885] 3651938=test_have_func I, [2024-05-04T18:59:26.998169 #3610569] INFO -- : [844/885] 3651925=test_gem_resolver_git_specification I, [2024-05-04T18:59:27.007670 #3610569] INFO -- : [845/885] 3651928=test_object_references I, [2024-05-04T18:59:27.009190 #3610569] INFO -- : [846/885] 3651942=test_usrmarshal I, [2024-05-04T18:59:27.012383 #3610569] INFO -- : [847/885] 3651928=test_cgi_modruby I, [2024-05-04T18:59:27.017584 #3610569] INFO -- : [848/885] 3651928=test_integer I, [2024-05-04T18:59:27.058716 #3610569] INFO -- : [849/885] 3651939=test_super I, [2024-05-04T18:59:27.114449 #3610569] INFO -- : [850/885] 3651943=test_rubyoptions I, [2024-05-04T18:59:27.170323 #3610569] INFO -- : [851/885] 3651925=test_https_proxy I, [2024-05-04T18:59:27.188501 #3610569] INFO -- : [852/885] 3651942=test_call I, [2024-05-04T18:59:27.230482 #3610569] INFO -- : [853/885] 3651925=test_rubygems I, [2024-05-04T18:59:27.238198 #3610569] INFO -- : [854/885] 3651932=test_gem_commands_setup_command I, [2024-05-04T18:59:27.321631 #3610569] INFO -- : [855/885] 3651942=test_rdoc_attr I, [2024-05-04T18:59:27.326111 #3610569] INFO -- : [856/885] 3651942=test_env I, [2024-05-04T18:59:27.371505 #3610569] INFO -- : [857/885] 3651930=desugar_compiler_test I, [2024-05-04T18:59:27.374600 #3610569] INFO -- : [858/885] 3651925=test_integer I, [2024-05-04T18:59:27.386209 #3610569] INFO -- : [859/885] 3651930=test_dryrun I, [2024-05-04T18:59:27.401984 #3610569] INFO -- : [860/885] 3651930=parse_stream_test I, [2024-05-04T18:59:27.404900 #3610569] INFO -- : [861/885] 3651930=test_registry I, [2024-05-04T18:59:27.420678 #3610569] INFO -- : [862/885] 3651930=test_dns I, [2024-05-04T18:59:27.422968 #3610569] INFO -- : [863/885] 3651925=test_gem_commands_open_command I, [2024-05-04T18:59:27.525586 #3610569] INFO -- : [864/885] 3651925=test_ractor I, [2024-05-04T18:59:27.543867 #3610569] INFO -- : [865/885] 3651925=test_gem_source_lock I, [2024-05-04T18:59:27.586993 #3610569] INFO -- : [866/885] 3651925=test_gem I, [2024-05-04T18:59:27.696437 #3610569] INFO -- : [867/885] 3651939=test_cgi_core I, [2024-05-04T18:59:27.706840 #3610569] INFO -- : [868/885] 3651939=test_parser I, [2024-05-04T18:59:27.717770 #3610569] INFO -- : [869/885] 3651939=test_unicode_normalize I, [2024-05-04T18:59:27.751845 #3610569] INFO -- : [870/885] 3651934=test_marshal I, [2024-05-04T18:59:27.754516 #3610569] INFO -- : [871/885] 3651929=test_weakref I, [2024-05-04T18:59:27.858381 #3610569] INFO -- : [872/885] 3651932=test_nonblock I, [2024-05-04T18:59:27.868111 #3610569] INFO -- : [873/885] 3651932=test_alias I, [2024-05-04T18:59:27.877407 #3610569] INFO -- : [874/885] 3651930=test_timeout I, [2024-05-04T18:59:27.904348 #3610569] INFO -- : [875/885] 3651929=test_singleton_function I, [2024-05-04T18:59:27.907197 #3610569] INFO -- : [876/885] 3651929=test_ancdata I, [2024-05-04T18:59:27.910261 #3610569] INFO -- : [877/885] 3651929=test_rb_str_dup I, [2024-05-04T18:59:27.912935 #3610569] INFO -- : [878/885] 3651929=test_reline_key I, [2024-05-04T18:59:27.913472 #3610569] INFO -- : [879/885] 3651929=test_ssl I, [2024-05-04T18:59:28.005071 #3610569] INFO -- : [880/885] 3651932=test_ractor I, [2024-05-04T18:59:28.276289 #3610569] INFO -- : [881/885] 3651934=test_thread I, [2024-05-04T18:59:28.320751 #3610569] INFO -- : [882/885] 3651940=json_ext_parser_test I, [2024-05-04T18:59:28.321840 #3610569] INFO -- : [883/885] 3651940=test_my_integer I, [2024-05-04T18:59:28.325484 #3610569] INFO -- : [884/885] 3651940=test_rendering I, [2024-05-04T18:59:28.334241 #3610569] INFO -- : [885/885] 3651940=test_debugger_integration I, [2024-05-04T18:59:48.550382 #3610569] INFO -- : Finished tests in 39.790958s, 663.1909 tests/s, 235025.8075 assertions/s. E, [2024-05-04T18:59:48.550450 #3610569] ERROR -- : Children under /tmp/rubytest.b5d6q8: E, [2024-05-04T18:59:48.550557 #3610569] ERROR -- : * drwx------ 4 80 2024-05-04 18:59:19 +0000 gem_rebuild20240504-3651942-oukozw/ E, [2024-05-04T18:59:48.550572 #3610569] ERROR -- : * drwxrwxr-x 2 60 2024-05-04 18:59:19 +0000 new/ E, [2024-05-04T18:59:48.550582 #3610569] ERROR -- : * -rw-rw-r-- 1 4096 2024-05-04 18:59:19 +0000 rebuild_test_gem-1.0.0.gem E, [2024-05-04T18:59:48.550612 #3610569] ERROR -- : * drwxrwxr-x 2 60 2024-05-04 18:59:19 +0000 old/ E, [2024-05-04T18:59:48.550635 #3610569] ERROR -- : * -rw-rw-r-- 1 4096 2024-05-04 18:59:19 +0000 rebuild_test_gem-1.0.0.gem I, [2024-05-04T18:59:48.552111 #3610569] INFO -- : 26389 tests, 9351902 assertions, 0 failures, 0 errors, 304 skips I, [2024-05-04T18:59:48.552159 #3610569] INFO -- : I, [2024-05-04T18:59:48.552175 #3610569] INFO -- : ruby -v: ruby 3.4.0dev (2024-05-04T16:31:58Z master b181ba7400) [x86_64-linux] I, [2024-05-04T18:59:48.554501 #3610569] INFO -- : $$$[end] "make yes-test-all TESTOPTS='--stderr-on-failure' TESTS='-j20'" exit with 0. I, [2024-05-04T18:59:48.554626 #3610569] INFO -- : $$$[beg] make yes-test-rubyspec MSPECOPT='--error-output stderr --debug -j' TESTS='-j20' I, [2024-05-04T18:59:48.642162 #3610569] INFO -- : BASERUBY = /usr/bin/ruby --disable=gems I, [2024-05-04T18:59:48.642210 #3610569] INFO -- : CC = gcc I, [2024-05-04T18:59:48.642224 #3610569] INFO -- : LD = ld I, [2024-05-04T18:59:48.642235 #3610569] INFO -- : LDSHARED = gcc -shared I, [2024-05-04T18:59:48.642246 #3610569] INFO -- : CFLAGS = -O3 -fno-fast-math -ggdb3 -Wall -Wextra -Wdeprecated-declarations -Wdiv-by-zero -Wduplicated-cond -Wimplicit-function-declaration -Wimplicit-int -Wpointer-arith -Wwrite-strings -Wold-style-definition -Wimplicit-fallthrough=0 -Wmissing-noreturn -Wno-cast-function-type -Wno-constant-logical-operand -Wno-long-long -Wno-missing-field-initializers -Wno-overlength-strings -Wno-packed-bitfield-compat -Wno-parentheses-equality -Wno-self-assign -Wno-tautological-compare -Wno-unused-parameter -Wno-unused-value -Wsuggest-attribute=format -Wsuggest-attribute=noreturn -Wunused-variable -Wmisleading-indentation -Wundef -fPIC I, [2024-05-04T18:59:48.642258 #3610569] INFO -- : XCFLAGS = -U_FORTIFY_SOURCE -D_FORTIFY_SOURCE=2 -fstack-protector-strong -fno-strict-overflow -fvisibility=hidden -fexcess-precision=standard -DRUBY_EXPORT -I. -I.ext/include/x86_64-linux -I/tmp/ruby/src/trunk/include -I/tmp/ruby/src/trunk -I/tmp/ruby/src/trunk/prism -I/tmp/ruby/src/trunk/enc/unicode/15.0.0 I, [2024-05-04T18:59:48.642281 #3610569] INFO -- : CPPFLAGS = I, [2024-05-04T18:59:48.642292 #3610569] INFO -- : DLDFLAGS = -Wl,--compress-debug-sections=zlib -Wl,-soname,libruby.so.3.4 -fstack-protector-strong I, [2024-05-04T18:59:48.642302 #3610569] INFO -- : SOLIBS = -lz -lrt -lrt -lgmp -ldl -lcrypt -lm -lpthread I, [2024-05-04T18:59:48.642313 #3610569] INFO -- : LANG = en_US.UTF-8 I, [2024-05-04T18:59:48.642322 #3610569] INFO -- : LC_ALL = I, [2024-05-04T18:59:48.642332 #3610569] INFO -- : LC_CTYPE = I, [2024-05-04T18:59:48.642342 #3610569] INFO -- : MFLAGS = I, [2024-05-04T18:59:48.642352 #3610569] INFO -- : RUSTC = no I, [2024-05-04T18:59:48.642363 #3610569] INFO -- : YJIT_RUSTC_ARGS = --crate-name=yjit --crate-type=staticlib --edition=2021 -g -C lto=thin -C opt-level=3 -C overflow-checks=on '--out-dir=/tmp/ruby/build/trunk/yjit/target/release/' /tmp/ruby/src/trunk/yjit/src/lib.rs I, [2024-05-04T18:59:48.642838 #3610569] INFO -- : gcc (Ubuntu 11.4.0-1ubuntu1~22.04) 11.4.0 I, [2024-05-04T18:59:48.642885 #3610569] INFO -- : Copyright (C) 2021 Free Software Foundation, Inc. I, [2024-05-04T18:59:48.642898 #3610569] INFO -- : This is free software; see the source for copying conditions. There is NO I, [2024-05-04T18:59:48.642910 #3610569] INFO -- : warranty; not even for MERCHANTABILITY or FITNESS FOR A PARTICULAR PURPOSE. I, [2024-05-04T18:59:48.642921 #3610569] INFO -- : I, [2024-05-04T18:59:48.644596 #3610569] INFO -- : generating enc.mk I, [2024-05-04T18:59:48.762528 #3610569] INFO -- : making enc I, [2024-05-04T18:59:48.779730 #3610569] INFO -- : make[1]: Entering directory '/tmp/ruby/build/trunk' I, [2024-05-04T18:59:48.779796 #3610569] INFO -- : make[1]: Nothing to be done for 'enc'. I, [2024-05-04T18:59:48.779811 #3610569] INFO -- : make[1]: Leaving directory '/tmp/ruby/build/trunk' I, [2024-05-04T18:59:48.780416 #3610569] INFO -- : making srcs under enc I, [2024-05-04T18:59:48.810653 #3610569] INFO -- : make[1]: Entering directory '/tmp/ruby/build/trunk' I, [2024-05-04T18:59:48.810717 #3610569] INFO -- : make[1]: Nothing to be done for 'srcs'. I, [2024-05-04T18:59:48.810731 #3610569] INFO -- : make[1]: Leaving directory '/tmp/ruby/build/trunk' I, [2024-05-04T18:59:48.811647 #3610569] INFO -- : generating transdb.h I, [2024-05-04T18:59:48.906106 #3610569] INFO -- : transdb.h unchanged I, [2024-05-04T18:59:48.907331 #3610569] INFO -- : making trans I, [2024-05-04T18:59:48.941885 #3610569] INFO -- : make[1]: Entering directory '/tmp/ruby/build/trunk' I, [2024-05-04T18:59:48.941946 #3610569] INFO -- : make[1]: Nothing to be done for 'trans'. I, [2024-05-04T18:59:48.941959 #3610569] INFO -- : make[1]: Leaving directory '/tmp/ruby/build/trunk' I, [2024-05-04T18:59:48.942518 #3610569] INFO -- : making encs I, [2024-05-04T18:59:48.979521 #3610569] INFO -- : make[1]: Entering directory '/tmp/ruby/build/trunk' I, [2024-05-04T18:59:48.979591 #3610569] INFO -- : make[1]: Nothing to be done for 'encs'. I, [2024-05-04T18:59:48.979610 #3610569] INFO -- : make[1]: Leaving directory '/tmp/ruby/build/trunk' I, [2024-05-04T18:59:48.981366 #3610569] INFO -- : generating makefiles ext/configure-ext.mk I, [2024-05-04T18:59:49.008528 #3610569] INFO -- : ext/configure-ext.mk updated I, [2024-05-04T18:59:49.010833 #3610569] INFO -- : make[1]: Entering directory '/tmp/ruby/build/trunk' I, [2024-05-04T18:59:50.366725 #3610569] INFO -- : make[1]: Leaving directory '/tmp/ruby/build/trunk' I, [2024-05-04T18:59:50.367344 #3610569] INFO -- : generating makefile exts.mk I, [2024-05-04T18:59:50.403889 #3610569] INFO -- : exts.mk unchanged I, [2024-05-04T18:59:50.408325 #3610569] INFO -- : make[1]: Entering directory '/tmp/ruby/build/trunk' I, [2024-05-04T18:59:50.619714 #3610569] INFO -- : make[2]: Entering directory '/tmp/ruby/build/trunk/ext/coverage' I, [2024-05-04T18:59:50.622523 #3610569] INFO -- : make[2]: Leaving directory '/tmp/ruby/build/trunk/ext/coverage' I, [2024-05-04T18:59:50.626283 #3610569] INFO -- : make[2]: Entering directory '/tmp/ruby/build/trunk/ext/date' I, [2024-05-04T18:59:50.629471 #3610569] INFO -- : make[2]: Leaving directory '/tmp/ruby/build/trunk/ext/date' I, [2024-05-04T18:59:50.631722 #3610569] INFO -- : make[2]: Entering directory '/tmp/ruby/build/trunk/ext/digest' I, [2024-05-04T18:59:50.637063 #3610569] INFO -- : make[2]: Leaving directory '/tmp/ruby/build/trunk/ext/digest' I, [2024-05-04T18:59:50.652741 #3610569] INFO -- : make[2]: Entering directory '/tmp/ruby/build/trunk/ext/digest/sha2' I, [2024-05-04T18:59:50.655728 #3610569] INFO -- : make[2]: Leaving directory '/tmp/ruby/build/trunk/ext/digest/sha2' I, [2024-05-04T18:59:50.668432 #3610569] INFO -- : make[2]: Entering directory '/tmp/ruby/build/trunk/ext/fiddle' I, [2024-05-04T18:59:50.674802 #3610569] INFO -- : make[2]: Leaving directory '/tmp/ruby/build/trunk/ext/fiddle' I, [2024-05-04T18:59:50.677807 #3610569] INFO -- : make[2]: Entering directory '/tmp/ruby/build/trunk/ext/io/console' I, [2024-05-04T18:59:50.680327 #3610569] INFO -- : make[2]: Leaving directory '/tmp/ruby/build/trunk/ext/io/console' I, [2024-05-04T18:59:50.687853 #3610569] INFO -- : make[2]: Entering directory '/tmp/ruby/build/trunk/ext/json' I, [2024-05-04T18:59:50.694241 #3610569] INFO -- : make[2]: Leaving directory '/tmp/ruby/build/trunk/ext/json' I, [2024-05-04T18:59:50.703087 #3610569] INFO -- : make[2]: Entering directory '/tmp/ruby/build/trunk/ext/monitor' I, [2024-05-04T18:59:50.705645 #3610569] INFO -- : make[2]: Leaving directory '/tmp/ruby/build/trunk/ext/monitor' I, [2024-05-04T18:59:50.709785 #3610569] INFO -- : make[2]: Entering directory '/tmp/ruby/build/trunk/ext/objspace' I, [2024-05-04T18:59:50.713634 #3610569] INFO -- : make[2]: Leaving directory '/tmp/ruby/build/trunk/ext/objspace' I, [2024-05-04T18:59:50.725522 #3610569] INFO -- : make[2]: Entering directory '/tmp/ruby/build/trunk/ext/openssl' I, [2024-05-04T18:59:50.740005 #3610569] INFO -- : make[2]: Leaving directory '/tmp/ruby/build/trunk/ext/openssl' I, [2024-05-04T18:59:50.742867 #3610569] INFO -- : make[2]: Entering directory '/tmp/ruby/build/trunk/ext/pathname' I, [2024-05-04T18:59:50.745372 #3610569] INFO -- : make[2]: Leaving directory '/tmp/ruby/build/trunk/ext/pathname' I, [2024-05-04T18:59:50.749517 #3610569] INFO -- : make[2]: Entering directory '/tmp/ruby/build/trunk/ext/psych' I, [2024-05-04T18:59:50.764352 #3610569] INFO -- : make[2]: Leaving directory '/tmp/ruby/build/trunk/ext/psych' I, [2024-05-04T18:59:50.767300 #3610569] INFO -- : make[2]: Entering directory '/tmp/ruby/build/trunk/ext/pty' I, [2024-05-04T18:59:50.769822 #3610569] INFO -- : make[2]: Leaving directory '/tmp/ruby/build/trunk/ext/pty' I, [2024-05-04T18:59:50.779199 #3610569] INFO -- : make[2]: Entering directory '/tmp/ruby/build/trunk/ext/ripper' I, [2024-05-04T18:59:50.784173 #3610569] INFO -- : make[2]: Leaving directory '/tmp/ruby/build/trunk/ext/ripper' I, [2024-05-04T18:59:50.785587 #3610569] INFO -- : make[2]: Entering directory '/tmp/ruby/build/trunk/ext/rubyvm' I, [2024-05-04T18:59:50.787630 #3610569] INFO -- : make[2]: Leaving directory '/tmp/ruby/build/trunk/ext/rubyvm' I, [2024-05-04T18:59:50.795501 #3610569] INFO -- : make[2]: Entering directory '/tmp/ruby/build/trunk/ext/socket' I, [2024-05-04T18:59:50.801898 #3610569] INFO -- : make[2]: Leaving directory '/tmp/ruby/build/trunk/ext/socket' I, [2024-05-04T18:59:50.812788 #3610569] INFO -- : make[2]: Entering directory '/tmp/ruby/build/trunk/.bundle/gems/bigdecimal-3.1.7/ext/bigdecimal' I, [2024-05-04T18:59:50.835205 #3610569] INFO -- : make[2]: Leaving directory '/tmp/ruby/build/trunk/.bundle/gems/bigdecimal-3.1.7/ext/bigdecimal' I, [2024-05-04T18:59:50.837346 #3610569] INFO -- : make[2]: Entering directory '/tmp/ruby/build/trunk/.bundle/gems/debug-1.9.2/ext/debug' I, [2024-05-04T18:59:50.859426 #3610569] INFO -- : make[2]: Leaving directory '/tmp/ruby/build/trunk/.bundle/gems/debug-1.9.2/ext/debug' I, [2024-05-04T18:59:50.861289 #3610569] INFO -- : make[2]: Entering directory '/tmp/ruby/build/trunk/.bundle/gems/nkf-0.2.0/ext/nkf' I, [2024-05-04T18:59:50.883839 #3610569] INFO -- : make[2]: Leaving directory '/tmp/ruby/build/trunk/.bundle/gems/nkf-0.2.0/ext/nkf' I, [2024-05-04T18:59:50.885827 #3610569] INFO -- : make[2]: Entering directory '/tmp/ruby/build/trunk/.bundle/gems/racc-1.7.3/ext/racc/cparse' I, [2024-05-04T18:59:50.907326 #3610569] INFO -- : make[2]: Leaving directory '/tmp/ruby/build/trunk/.bundle/gems/racc-1.7.3/ext/racc/cparse' I, [2024-05-04T18:59:50.909752 #3610569] INFO -- : make[2]: Entering directory '/tmp/ruby/build/trunk/.bundle/gems/rbs-3.4.4/ext/rbs_extension' I, [2024-05-04T18:59:50.931862 #3610569] INFO -- : make[2]: Leaving directory '/tmp/ruby/build/trunk/.bundle/gems/rbs-3.4.4/ext/rbs_extension' I, [2024-05-04T18:59:50.933770 #3610569] INFO -- : make[2]: Entering directory '/tmp/ruby/build/trunk/.bundle/gems/syslog-0.1.2/ext/syslog' I, [2024-05-04T18:59:50.955513 #3610569] INFO -- : make[2]: Leaving directory '/tmp/ruby/build/trunk/.bundle/gems/syslog-0.1.2/ext/syslog' I, [2024-05-04T18:59:50.980074 #3610569] INFO -- : make[2]: Entering directory '/tmp/ruby/build/trunk' I, [2024-05-04T18:59:51.042504 #3610569] INFO -- : make[2]: 'ruby' is up to date. I, [2024-05-04T18:59:51.042542 #3610569] INFO -- : make[2]: Leaving directory '/tmp/ruby/build/trunk' I, [2024-05-04T18:59:51.042771 #3610569] INFO -- : make[1]: Leaving directory '/tmp/ruby/build/trunk' I, [2024-05-04T18:59:51.046463 #3610569] INFO -- : make[1]: Entering directory '/tmp/ruby/build/trunk' I, [2024-05-04T18:59:51.046483 #3610569] INFO -- : make[1]: Nothing to be done for 'note'. I, [2024-05-04T18:59:51.046493 #3610569] INFO -- : make[1]: Leaving directory '/tmp/ruby/build/trunk' E, [2024-05-04T18:59:51.104681 #3610569] ERROR -- : $ /tmp/ruby/build/trunk/miniruby -I/tmp/ruby/src/trunk/lib /tmp/ruby/src/trunk/tool/runruby.rb --archdir=/tmp/ruby/build/trunk --extout=.ext -- /tmp/ruby/src/trunk/spec/mspec/bin/mspec-run -B /tmp/ruby/src/trunk/spec/default.mspec --error-output stderr --debug -fy -o /tmp/rubytest.t9and5/1-mspec-multi-0 E, [2024-05-04T18:59:51.104901 #3610569] ERROR -- : $ /tmp/ruby/build/trunk/miniruby -I/tmp/ruby/src/trunk/lib /tmp/ruby/src/trunk/tool/runruby.rb --archdir=/tmp/ruby/build/trunk --extout=.ext -- /tmp/ruby/src/trunk/spec/mspec/bin/mspec-run -B /tmp/ruby/src/trunk/spec/default.mspec --error-output stderr --debug -fy -o /tmp/rubytest.t9and5/2-mspec-multi-1 E, [2024-05-04T18:59:51.105180 #3610569] ERROR -- : $ /tmp/ruby/build/trunk/miniruby -I/tmp/ruby/src/trunk/lib /tmp/ruby/src/trunk/tool/runruby.rb --archdir=/tmp/ruby/build/trunk --extout=.ext -- /tmp/ruby/src/trunk/spec/mspec/bin/mspec-run -B /tmp/ruby/src/trunk/spec/default.mspec --error-output stderr --debug -fy -o /tmp/rubytest.t9and5/3-mspec-multi-2 E, [2024-05-04T18:59:51.105442 #3610569] ERROR -- : $ /tmp/ruby/build/trunk/miniruby -I/tmp/ruby/src/trunk/lib /tmp/ruby/src/trunk/tool/runruby.rb --archdir=/tmp/ruby/build/trunk --extout=.ext -- /tmp/ruby/src/trunk/spec/mspec/bin/mspec-run -B /tmp/ruby/src/trunk/spec/default.mspec --error-output stderr --debug -fy -o /tmp/rubytest.t9and5/4-mspec-multi-3 E, [2024-05-04T18:59:51.105562 #3610569] ERROR -- : $ /tmp/ruby/build/trunk/miniruby -I/tmp/ruby/src/trunk/lib /tmp/ruby/src/trunk/tool/runruby.rb --archdir=/tmp/ruby/build/trunk --extout=.ext -- /tmp/ruby/src/trunk/spec/mspec/bin/mspec-run -B /tmp/ruby/src/trunk/spec/default.mspec --error-output stderr --debug -fy -o /tmp/rubytest.t9and5/5-mspec-multi-4 E, [2024-05-04T18:59:51.105857 #3610569] ERROR -- : $ /tmp/ruby/build/trunk/miniruby -I/tmp/ruby/src/trunk/lib /tmp/ruby/src/trunk/tool/runruby.rb --archdir=/tmp/ruby/build/trunk --extout=.ext -- /tmp/ruby/src/trunk/spec/mspec/bin/mspec-run -B /tmp/ruby/src/trunk/spec/default.mspec --error-output stderr --debug -fy -o /tmp/rubytest.t9and5/6-mspec-multi-5 E, [2024-05-04T18:59:51.106068 #3610569] ERROR -- : $ /tmp/ruby/build/trunk/miniruby -I/tmp/ruby/src/trunk/lib /tmp/ruby/src/trunk/tool/runruby.rb --archdir=/tmp/ruby/build/trunk --extout=.ext -- /tmp/ruby/src/trunk/spec/mspec/bin/mspec-run -B /tmp/ruby/src/trunk/spec/default.mspec --error-output stderr --debug -fy -o /tmp/rubytest.t9and5/7-mspec-multi-6 E, [2024-05-04T18:59:51.106264 #3610569] ERROR -- : $ /tmp/ruby/build/trunk/miniruby -I/tmp/ruby/src/trunk/lib /tmp/ruby/src/trunk/tool/runruby.rb --archdir=/tmp/ruby/build/trunk --extout=.ext -- /tmp/ruby/src/trunk/spec/mspec/bin/mspec-run -B /tmp/ruby/src/trunk/spec/default.mspec --error-output stderr --debug -fy -o /tmp/rubytest.t9and5/8-mspec-multi-7 E, [2024-05-04T18:59:51.106462 #3610569] ERROR -- : $ /tmp/ruby/build/trunk/miniruby -I/tmp/ruby/src/trunk/lib /tmp/ruby/src/trunk/tool/runruby.rb --archdir=/tmp/ruby/build/trunk --extout=.ext -- /tmp/ruby/src/trunk/spec/mspec/bin/mspec-run -B /tmp/ruby/src/trunk/spec/default.mspec --error-output stderr --debug -fy -o /tmp/rubytest.t9and5/9-mspec-multi-8 E, [2024-05-04T18:59:51.106665 #3610569] ERROR -- : $ /tmp/ruby/build/trunk/miniruby -I/tmp/ruby/src/trunk/lib /tmp/ruby/src/trunk/tool/runruby.rb --archdir=/tmp/ruby/build/trunk --extout=.ext -- /tmp/ruby/src/trunk/spec/mspec/bin/mspec-run -B /tmp/ruby/src/trunk/spec/default.mspec --error-output stderr --debug -fy -o /tmp/rubytest.t9and5/10-mspec-multi-9 E, [2024-05-04T18:59:51.106986 #3610569] ERROR -- : $ /tmp/ruby/build/trunk/miniruby -I/tmp/ruby/src/trunk/lib /tmp/ruby/src/trunk/tool/runruby.rb --archdir=/tmp/ruby/build/trunk --extout=.ext -- /tmp/ruby/src/trunk/spec/mspec/bin/mspec-run -B /tmp/ruby/src/trunk/spec/default.mspec --error-output stderr --debug -fy -o /tmp/rubytest.t9and5/11-mspec-multi-10 E, [2024-05-04T18:59:51.107218 #3610569] ERROR -- : $ /tmp/ruby/build/trunk/miniruby -I/tmp/ruby/src/trunk/lib /tmp/ruby/src/trunk/tool/runruby.rb --archdir=/tmp/ruby/build/trunk --extout=.ext -- /tmp/ruby/src/trunk/spec/mspec/bin/mspec-run -B /tmp/ruby/src/trunk/spec/default.mspec --error-output stderr --debug -fy -o /tmp/rubytest.t9and5/12-mspec-multi-11 E, [2024-05-04T18:59:51.107395 #3610569] ERROR -- : $ /tmp/ruby/build/trunk/miniruby -I/tmp/ruby/src/trunk/lib /tmp/ruby/src/trunk/tool/runruby.rb --archdir=/tmp/ruby/build/trunk --extout=.ext -- /tmp/ruby/src/trunk/spec/mspec/bin/mspec-run -B /tmp/ruby/src/trunk/spec/default.mspec --error-output stderr --debug -fy -o /tmp/rubytest.t9and5/13-mspec-multi-12 E, [2024-05-04T18:59:51.107594 #3610569] ERROR -- : $ /tmp/ruby/build/trunk/miniruby -I/tmp/ruby/src/trunk/lib /tmp/ruby/src/trunk/tool/runruby.rb --archdir=/tmp/ruby/build/trunk --extout=.ext -- /tmp/ruby/src/trunk/spec/mspec/bin/mspec-run -B /tmp/ruby/src/trunk/spec/default.mspec --error-output stderr --debug -fy -o /tmp/rubytest.t9and5/14-mspec-multi-13 E, [2024-05-04T18:59:51.107731 #3610569] ERROR -- : $ /tmp/ruby/build/trunk/miniruby -I/tmp/ruby/src/trunk/lib /tmp/ruby/src/trunk/tool/runruby.rb --archdir=/tmp/ruby/build/trunk --extout=.ext -- /tmp/ruby/src/trunk/spec/mspec/bin/mspec-run -B /tmp/ruby/src/trunk/spec/default.mspec --error-output stderr --debug -fy -o /tmp/rubytest.t9and5/15-mspec-multi-14 E, [2024-05-04T18:59:51.107922 #3610569] ERROR -- : $ /tmp/ruby/build/trunk/miniruby -I/tmp/ruby/src/trunk/lib /tmp/ruby/src/trunk/tool/runruby.rb --archdir=/tmp/ruby/build/trunk --extout=.ext -- /tmp/ruby/src/trunk/spec/mspec/bin/mspec-run -B /tmp/ruby/src/trunk/spec/default.mspec --error-output stderr --debug -fy -o /tmp/rubytest.t9and5/16-mspec-multi-15 E, [2024-05-04T18:59:51.108136 #3610569] ERROR -- : $ /tmp/ruby/build/trunk/miniruby -I/tmp/ruby/src/trunk/lib /tmp/ruby/src/trunk/tool/runruby.rb --archdir=/tmp/ruby/build/trunk --extout=.ext -- /tmp/ruby/src/trunk/spec/mspec/bin/mspec-run -B /tmp/ruby/src/trunk/spec/default.mspec --error-output stderr --debug -fy -o /tmp/rubytest.t9and5/17-mspec-multi-16 E, [2024-05-04T18:59:51.108272 #3610569] ERROR -- : $ /tmp/ruby/build/trunk/miniruby -I/tmp/ruby/src/trunk/lib /tmp/ruby/src/trunk/tool/runruby.rb --archdir=/tmp/ruby/build/trunk --extout=.ext -- /tmp/ruby/src/trunk/spec/mspec/bin/mspec-run -B /tmp/ruby/src/trunk/spec/default.mspec --error-output stderr --debug -fy -o /tmp/rubytest.t9and5/18-mspec-multi-17 E, [2024-05-04T18:59:51.110576 #3610569] ERROR -- : $ /tmp/ruby/build/trunk/miniruby -I/tmp/ruby/src/trunk/lib /tmp/ruby/src/trunk/tool/runruby.rb --archdir=/tmp/ruby/build/trunk --extout=.ext -- /tmp/ruby/src/trunk/spec/mspec/bin/mspec-run -B /tmp/ruby/src/trunk/spec/default.mspec --error-output stderr --debug -fy -o /tmp/rubytest.t9and5/19-mspec-multi-18 E, [2024-05-04T18:59:51.110974 #3610569] ERROR -- : $ /tmp/ruby/build/trunk/miniruby -I/tmp/ruby/src/trunk/lib /tmp/ruby/src/trunk/tool/runruby.rb --archdir=/tmp/ruby/build/trunk --extout=.ext -- /tmp/ruby/src/trunk/spec/mspec/bin/mspec-run -B /tmp/ruby/src/trunk/spec/default.mspec --error-output stderr --debug -fy -o /tmp/rubytest.t9and5/20-mspec-multi-19 I, [2024-05-04T18:59:51.285858 #3610569] INFO -- : ruby 3.4.0dev (2024-05-04T16:31:58Z master b181ba7400) [x86_64-linux] I, [2024-05-04T18:59:51.970266 #3610569] INFO -- : 0 ......................................................................... I, [2024-05-04T18:59:52.374288 #3610569] INFO -- : 73 ......................................................................... I, [2024-05-04T18:59:52.505888 #3610569] INFO -- : 146 ......................................................................... I, [2024-05-04T18:59:52.548704 #3610569] INFO -- : 219 ......................................................................... I, [2024-05-04T18:59:52.603251 #3610569] INFO -- : 292 ......................................................................... I, [2024-05-04T18:59:52.646150 #3610569] INFO -- : 365 ......................................................................... I, [2024-05-04T18:59:52.666426 #3610569] INFO -- : 438 ......................................................................... I, [2024-05-04T18:59:52.685224 #3610569] INFO -- : 511 ......................................................................... I, [2024-05-04T18:59:52.703108 #3610569] INFO -- : 584 ......................................................................... I, [2024-05-04T18:59:52.773372 #3610569] INFO -- : 657 ......................................................................... I, [2024-05-04T18:59:52.799473 #3610569] INFO -- : 730 ......................................................................... I, [2024-05-04T18:59:52.826859 #3610569] INFO -- : 803 ......................................................................... I, [2024-05-04T18:59:52.856913 #3610569] INFO -- : 876 ......................................................................... I, [2024-05-04T18:59:52.904938 #3610569] INFO -- : 949 ......................................................................... I, [2024-05-04T18:59:52.996688 #3610569] INFO -- : 1022 ......................................................................... I, [2024-05-04T18:59:53.185793 #3610569] INFO -- : 1095 ......................................................................... I, [2024-05-04T18:59:53.293937 #3610569] INFO -- : 1168 ......................................................................... I, [2024-05-04T18:59:53.348838 #3610569] INFO -- : 1241 ......................................................................... I, [2024-05-04T18:59:53.402912 #3610569] INFO -- : 1314 ......................................................................... I, [2024-05-04T18:59:53.420497 #3610569] INFO -- : 1387 ......................................................................... I, [2024-05-04T18:59:53.532671 #3610569] INFO -- : 1460 ......................................................................... I, [2024-05-04T18:59:53.989740 #3610569] INFO -- : 1533 ......................................................................... I, [2024-05-04T18:59:54.047984 #3610569] INFO -- : 1606 ......................................................................... I, [2024-05-04T18:59:54.153990 #3610569] INFO -- : 1679 ......................................................................... I, [2024-05-04T18:59:54.258912 #3610569] INFO -- : 1752 ......................................................................... I, [2024-05-04T18:59:54.373171 #3610569] INFO -- : 1825 ......................................................................... I, [2024-05-04T18:59:54.484040 #3610569] INFO -- : 1898 ......................................................................... I, [2024-05-04T18:59:54.582266 #3610569] INFO -- : 1971 ......................................................................... I, [2024-05-04T18:59:54.632637 #3610569] INFO -- : 2044 ......................................................................... I, [2024-05-04T18:59:54.675394 #3610569] INFO -- : 2117 ......................................................................... I, [2024-05-04T18:59:54.698378 #3610569] INFO -- : 2190 ......................................................................... I, [2024-05-04T18:59:54.719117 #3610569] INFO -- : 2263 ......................................................................... I, [2024-05-04T18:59:54.736998 #3610569] INFO -- : 2336 ......................................................................... I, [2024-05-04T18:59:54.775504 #3610569] INFO -- : 2409 ......................................................................... I, [2024-05-04T18:59:54.893056 #3610569] INFO -- : 2482 ......................................................................... I, [2024-05-04T18:59:54.917154 #3610569] INFO -- : 2555 ......................................................................... I, [2024-05-04T18:59:55.007121 #3610569] INFO -- : 2628 ......................................................................... I, [2024-05-04T18:59:55.108416 #3610569] INFO -- : 2701 ......................................................................... I, [2024-05-04T18:59:55.142938 #3610569] INFO -- : 2774 ......................................................................... I, [2024-05-04T18:59:55.206630 #3610569] INFO -- : 2847 ......................................................................... I, [2024-05-04T18:59:55.245899 #3610569] INFO -- : 2920 ......................................................................... I, [2024-05-04T18:59:55.275822 #3610569] INFO -- : 2993 ......................................................................... I, [2024-05-04T18:59:55.307218 #3610569] INFO -- : 3066 ......................................................................... I, [2024-05-04T18:59:55.320832 #3610569] INFO -- : 3139 ......................................................................... I, [2024-05-04T18:59:55.330156 #3610569] INFO -- : 3212 ......................................................................... I, [2024-05-04T18:59:55.361092 #3610569] INFO -- : 3285 ......................................................................... I, [2024-05-04T18:59:59.310301 #3610569] INFO -- : 3358 ........................................................................ I, [2024-05-04T18:59:59.310350 #3610569] INFO -- : I, [2024-05-04T18:59:59.310357 #3610569] INFO -- : Finished in 8.204912 seconds I, [2024-05-04T18:59:59.310361 #3610569] INFO -- : I, [2024-05-04T18:59:59.310365 #3610569] INFO -- : 3429 files, 32610 examples, 166545 expectations, 0 failures, 0 errors, 0 tagged I, [2024-05-04T18:59:59.312334 #3610569] INFO -- : $$$[end] "make yes-test-rubyspec MSPECOPT='--error-output stderr --debug -j' TESTS='-j20'" exit with 0.