# Logfile created on 2024-05-04 15:59:40 +0000 by logger.rb/v1.4.3 I, [2024-05-04T15:59:40.832949 #2728330] INFO -- : #, @formatter=nil, @logdev=#, @binmode=false, @mon_data=#, @mon_data_owner_object_id=860>>> I, [2024-05-04T15:59:40.833070 #2728330] INFO -- : $$$[beg] make update-unicode -j20 I, [2024-05-04T15:59:40.891168 #2728330] INFO -- : Downloading Unicode emoji 15.0 files... I, [2024-05-04T15:59:40.891370 #2728330] INFO -- : Downloading Unicode emoji 15.0 files... I, [2024-05-04T15:59:40.891548 #2728330] INFO -- : Downloading Unicode emoji 15.0 files... I, [2024-05-04T15:59:40.932633 #2728330] INFO -- : made symlink emoji/15.0/emoji-sequences.txt to /tmp/ruby/src/trunk/.downloaded-cache/emoji/15.0/emoji-sequences.txt I, [2024-05-04T15:59:40.932669 #2728330] INFO -- : /tmp/ruby/src/trunk/enc/unicode/data/emoji/15.0/emoji-sequences.txt already exists E, [2024-05-04T15:59:41.364713 #2728330] ERROR -- : /tmp/ruby/src/trunk/tool/downloader.rb:302:in `rescue in download': failed to download emoji/15.0/emoji-test.txt (RuntimeError) E, [2024-05-04T15:59:41.364752 #2728330] ERROR -- : OpenURI::HTTPError: 403 Forbidden: https://www.unicode.org/Public/emoji/15.0/emoji-test.txt E, [2024-05-04T15:59:41.364757 #2728330] ERROR -- : from /tmp/ruby/src/trunk/tool/downloader.rb:201:in `download' E, [2024-05-04T15:59:41.364762 #2728330] ERROR -- : from /tmp/ruby/src/trunk/tool/downloader.rb:136:in `download' E, [2024-05-04T15:59:41.364766 #2728330] ERROR -- : from /tmp/ruby/src/trunk/tool/downloader.rb:482:in `block in
' E, [2024-05-04T15:59:41.364771 #2728330] ERROR -- : from /tmp/ruby/src/trunk/tool/downloader.rb:465:in `each' E, [2024-05-04T15:59:41.364775 #2728330] ERROR -- : from /tmp/ruby/src/trunk/tool/downloader.rb:465:in `
' E, [2024-05-04T15:59:41.364779 #2728330] ERROR -- : /usr/lib/ruby/3.0.0/open-uri.rb:364:in `open_http': 403 Forbidden (OpenURI::HTTPError) E, [2024-05-04T15:59:41.364783 #2728330] ERROR -- : from /usr/lib/ruby/3.0.0/open-uri.rb:741:in `buffer_open' E, [2024-05-04T15:59:41.364788 #2728330] ERROR -- : from /usr/lib/ruby/3.0.0/open-uri.rb:212:in `block in open_loop' E, [2024-05-04T15:59:41.364792 #2728330] ERROR -- : from /usr/lib/ruby/3.0.0/open-uri.rb:210:in `catch' E, [2024-05-04T15:59:41.364796 #2728330] ERROR -- : from /usr/lib/ruby/3.0.0/open-uri.rb:210:in `open_loop' E, [2024-05-04T15:59:41.364799 #2728330] ERROR -- : from /usr/lib/ruby/3.0.0/open-uri.rb:151:in `open_uri' E, [2024-05-04T15:59:41.364803 #2728330] ERROR -- : from /usr/lib/ruby/3.0.0/open-uri.rb:721:in `open' E, [2024-05-04T15:59:41.364806 #2728330] ERROR -- : from /usr/lib/ruby/3.0.0/open-uri.rb:729:in `read' E, [2024-05-04T15:59:41.364810 #2728330] ERROR -- : from /tmp/ruby/src/trunk/tool/downloader.rb:247:in `block in download' E, [2024-05-04T15:59:41.364813 #2728330] ERROR -- : from /tmp/ruby/src/trunk/tool/downloader.rb:378:in `with_retry' E, [2024-05-04T15:59:41.364826 #2728330] ERROR -- : from /tmp/ruby/src/trunk/tool/downloader.rb:246:in `download' E, [2024-05-04T15:59:41.364830 #2728330] ERROR -- : from /tmp/ruby/src/trunk/tool/downloader.rb:136:in `download' E, [2024-05-04T15:59:41.364833 #2728330] ERROR -- : from /tmp/ruby/src/trunk/tool/downloader.rb:482:in `block in
' E, [2024-05-04T15:59:41.364837 #2728330] ERROR -- : from /tmp/ruby/src/trunk/tool/downloader.rb:465:in `each' E, [2024-05-04T15:59:41.364840 #2728330] ERROR -- : from /tmp/ruby/src/trunk/tool/downloader.rb:465:in `
' E, [2024-05-04T15:59:41.366608 #2728330] ERROR -- : make: *** [uncommon.mk:1787: /tmp/ruby/src/trunk/enc/unicode/data/emoji/15.0/emoji-zwj-sequences.txt] Error 1 E, [2024-05-04T15:59:41.366628 #2728330] ERROR -- : make: *** Waiting for unfinished jobs.... E, [2024-05-04T15:59:41.385351 #2728330] ERROR -- : /tmp/ruby/src/trunk/tool/downloader.rb:302:in `rescue in download': failed to download emoji/15.0/emoji-test.txt (RuntimeError) E, [2024-05-04T15:59:41.385377 #2728330] ERROR -- : OpenURI::HTTPError: 403 Forbidden: https://www.unicode.org/Public/emoji/15.0/emoji-test.txt E, [2024-05-04T15:59:41.385383 #2728330] ERROR -- : from /tmp/ruby/src/trunk/tool/downloader.rb:201:in `download' E, [2024-05-04T15:59:41.385386 #2728330] ERROR -- : from /tmp/ruby/src/trunk/tool/downloader.rb:136:in `download' E, [2024-05-04T15:59:41.385390 #2728330] ERROR -- : from /tmp/ruby/src/trunk/tool/downloader.rb:482:in `block in
' E, [2024-05-04T15:59:41.385393 #2728330] ERROR -- : from /tmp/ruby/src/trunk/tool/downloader.rb:465:in `each' E, [2024-05-04T15:59:41.385397 #2728330] ERROR -- : from /tmp/ruby/src/trunk/tool/downloader.rb:465:in `
' E, [2024-05-04T15:59:41.385400 #2728330] ERROR -- : /usr/lib/ruby/3.0.0/open-uri.rb:364:in `open_http': 403 Forbidden (OpenURI::HTTPError) E, [2024-05-04T15:59:41.385403 #2728330] ERROR -- : from /usr/lib/ruby/3.0.0/open-uri.rb:741:in `buffer_open' E, [2024-05-04T15:59:41.385408 #2728330] ERROR -- : from /usr/lib/ruby/3.0.0/open-uri.rb:212:in `block in open_loop' E, [2024-05-04T15:59:41.385412 #2728330] ERROR -- : from /usr/lib/ruby/3.0.0/open-uri.rb:210:in `catch' E, [2024-05-04T15:59:41.385416 #2728330] ERROR -- : from /usr/lib/ruby/3.0.0/open-uri.rb:210:in `open_loop' E, [2024-05-04T15:59:41.385419 #2728330] ERROR -- : from /usr/lib/ruby/3.0.0/open-uri.rb:151:in `open_uri' E, [2024-05-04T15:59:41.385422 #2728330] ERROR -- : from /usr/lib/ruby/3.0.0/open-uri.rb:721:in `open' E, [2024-05-04T15:59:41.385425 #2728330] ERROR -- : from /usr/lib/ruby/3.0.0/open-uri.rb:729:in `read' E, [2024-05-04T15:59:41.385429 #2728330] ERROR -- : from /tmp/ruby/src/trunk/tool/downloader.rb:247:in `block in download' E, [2024-05-04T15:59:41.385432 #2728330] ERROR -- : from /tmp/ruby/src/trunk/tool/downloader.rb:378:in `with_retry' E, [2024-05-04T15:59:41.385437 #2728330] ERROR -- : from /tmp/ruby/src/trunk/tool/downloader.rb:246:in `download' E, [2024-05-04T15:59:41.385440 #2728330] ERROR -- : from /tmp/ruby/src/trunk/tool/downloader.rb:136:in `download' E, [2024-05-04T15:59:41.385444 #2728330] ERROR -- : from /tmp/ruby/src/trunk/tool/downloader.rb:482:in `block in
' E, [2024-05-04T15:59:41.385447 #2728330] ERROR -- : from /tmp/ruby/src/trunk/tool/downloader.rb:465:in `each' E, [2024-05-04T15:59:41.385450 #2728330] ERROR -- : from /tmp/ruby/src/trunk/tool/downloader.rb:465:in `
' E, [2024-05-04T15:59:41.387648 #2728330] ERROR -- : make: *** [uncommon.mk:1787: /tmp/ruby/src/trunk/enc/unicode/data/emoji/15.0/emoji-sequences.txt] Error 1 E, [2024-05-04T15:59:41.387668 #2728330] ERROR -- : make: *** Deleting file '/tmp/ruby/src/trunk/enc/unicode/data/emoji/15.0/emoji-sequences.txt' E, [2024-05-04T15:59:41.814530 #2728330] ERROR -- : /tmp/ruby/src/trunk/tool/downloader.rb:302:in `rescue in download': failed to download emoji/15.0/emoji-sequences.txt (RuntimeError) E, [2024-05-04T15:59:41.814564 #2728330] ERROR -- : EOFError: end of file reached: https://www.unicode.org/Public/emoji/15.0/emoji-sequences.txt E, [2024-05-04T15:59:41.814575 #2728330] ERROR -- : from /tmp/ruby/src/trunk/tool/downloader.rb:201:in `download' E, [2024-05-04T15:59:41.814579 #2728330] ERROR -- : from /tmp/ruby/src/trunk/tool/downloader.rb:136:in `download' E, [2024-05-04T15:59:41.814582 #2728330] ERROR -- : from /tmp/ruby/src/trunk/tool/downloader.rb:482:in `block in
' E, [2024-05-04T15:59:41.814586 #2728330] ERROR -- : from /tmp/ruby/src/trunk/tool/downloader.rb:465:in `each' E, [2024-05-04T15:59:41.814589 #2728330] ERROR -- : from /tmp/ruby/src/trunk/tool/downloader.rb:465:in `
' E, [2024-05-04T15:59:41.814593 #2728330] ERROR -- : /usr/lib/ruby/3.0.0/net/protocol.rb:227:in `rbuf_fill': end of file reached (EOFError) E, [2024-05-04T15:59:41.814597 #2728330] ERROR -- : from /usr/lib/ruby/3.0.0/net/protocol.rb:193:in `readuntil' E, [2024-05-04T15:59:41.814601 #2728330] ERROR -- : from /usr/lib/ruby/3.0.0/net/protocol.rb:203:in `readline' E, [2024-05-04T15:59:41.814604 #2728330] ERROR -- : from /usr/lib/ruby/3.0.0/net/http/response.rb:42:in `read_status_line' E, [2024-05-04T15:59:41.814608 #2728330] ERROR -- : from /usr/lib/ruby/3.0.0/net/http/response.rb:31:in `read_new' E, [2024-05-04T15:59:41.814612 #2728330] ERROR -- : from /usr/lib/ruby/3.0.0/net/http.rb:1557:in `block in transport_request' E, [2024-05-04T15:59:41.814615 #2728330] ERROR -- : from /usr/lib/ruby/3.0.0/net/http.rb:1548:in `catch' E, [2024-05-04T15:59:41.814689 #2728330] ERROR -- : from /usr/lib/ruby/3.0.0/net/http.rb:1548:in `transport_request' E, [2024-05-04T15:59:41.814694 #2728330] ERROR -- : from /usr/lib/ruby/3.0.0/net/http.rb:1521:in `request' E, [2024-05-04T15:59:41.814697 #2728330] ERROR -- : from /usr/lib/ruby/3.0.0/open-uri.rb:329:in `block in open_http' E, [2024-05-04T15:59:41.814701 #2728330] ERROR -- : from /usr/lib/ruby/3.0.0/net/http.rb:960:in `start' E, [2024-05-04T15:59:41.814704 #2728330] ERROR -- : from /usr/lib/ruby/3.0.0/open-uri.rb:323:in `open_http' E, [2024-05-04T15:59:41.814709 #2728330] ERROR -- : from /usr/lib/ruby/3.0.0/open-uri.rb:741:in `buffer_open' E, [2024-05-04T15:59:41.814714 #2728330] ERROR -- : from /usr/lib/ruby/3.0.0/open-uri.rb:212:in `block in open_loop' E, [2024-05-04T15:59:41.814718 #2728330] ERROR -- : from /usr/lib/ruby/3.0.0/open-uri.rb:210:in `catch' E, [2024-05-04T15:59:41.814721 #2728330] ERROR -- : from /usr/lib/ruby/3.0.0/open-uri.rb:210:in `open_loop' E, [2024-05-04T15:59:41.814725 #2728330] ERROR -- : from /usr/lib/ruby/3.0.0/open-uri.rb:151:in `open_uri' E, [2024-05-04T15:59:41.814728 #2728330] ERROR -- : from /usr/lib/ruby/3.0.0/open-uri.rb:721:in `open' E, [2024-05-04T15:59:41.814731 #2728330] ERROR -- : from /usr/lib/ruby/3.0.0/open-uri.rb:729:in `read' E, [2024-05-04T15:59:41.814735 #2728330] ERROR -- : from /tmp/ruby/src/trunk/tool/downloader.rb:247:in `block in download' E, [2024-05-04T15:59:41.814738 #2728330] ERROR -- : from /tmp/ruby/src/trunk/tool/downloader.rb:378:in `with_retry' E, [2024-05-04T15:59:41.814742 #2728330] ERROR -- : from /tmp/ruby/src/trunk/tool/downloader.rb:246:in `download' E, [2024-05-04T15:59:41.814746 #2728330] ERROR -- : from /tmp/ruby/src/trunk/tool/downloader.rb:136:in `download' E, [2024-05-04T15:59:41.814749 #2728330] ERROR -- : from /tmp/ruby/src/trunk/tool/downloader.rb:482:in `block in
' E, [2024-05-04T15:59:41.814753 #2728330] ERROR -- : from /tmp/ruby/src/trunk/tool/downloader.rb:465:in `each' E, [2024-05-04T15:59:41.814756 #2728330] ERROR -- : from /tmp/ruby/src/trunk/tool/downloader.rb:465:in `
' E, [2024-05-04T15:59:41.816591 #2728330] ERROR -- : make: *** [uncommon.mk:1787: /tmp/ruby/src/trunk/enc/unicode/data/emoji/15.0/emoji-test.txt] Error 1 I, [2024-05-04T15:59:41.816699 #2728330] INFO -- : downloading emoji/15.0/emoji-sequences.txt ... downloading emoji/15.0/emoji-test.txt ... downloading emoji/15.0/emoji-test.txt ... I, [2024-05-04T15:59:41.817086 #2728330] INFO -- : $$$[end] "make update-unicode -j20" exit with 512. I, [2024-05-04T15:59:41.817111 #2728330] INFO -- : $$$[beg] make update-download -j20 I, [2024-05-04T15:59:41.915857 #2728330] INFO -- : tool/config.guess already exists I, [2024-05-04T15:59:41.915896 #2728330] INFO -- : tool/config.sub already exists I, [2024-05-04T15:59:41.917984 #2728330] INFO -- : Update minitest to ea9caafc0754b1d6236a490d59e624b53209734a I, [2024-05-04T15:59:41.918228 #2728330] INFO -- : Update power_assert to 84e85124c5014a139af39161d484156cfe87a9ed I, [2024-05-04T15:59:41.918453 #2728330] INFO -- : Update rbs to ba7872795d5de04adb8ff500c0e6afdc81a041dd I, [2024-05-04T15:59:41.918999 #2728330] INFO -- : Update typeprof to b19a6416da3a05d57fadd6ffdadb382b6d236ca5 I, [2024-05-04T15:59:41.919556 #2728330] INFO -- : echo ea9caafc0754b1d6236a490d59e624b53209734a | /bin/sh /tmp/ruby/src/trunk/tool/ifchange /tmp/ruby/src/trunk/.bundle/.timestamp/minitest.revision - I, [2024-05-04T15:59:41.919626 #2728330] INFO -- : echo 84e85124c5014a139af39161d484156cfe87a9ed | /bin/sh /tmp/ruby/src/trunk/tool/ifchange /tmp/ruby/src/trunk/.bundle/.timestamp/power_assert.revision - I, [2024-05-04T15:59:41.919691 #2728330] INFO -- : echo ba7872795d5de04adb8ff500c0e6afdc81a041dd | /bin/sh /tmp/ruby/src/trunk/tool/ifchange /tmp/ruby/src/trunk/.bundle/.timestamp/rbs.revision - I, [2024-05-04T15:59:41.920340 #2728330] INFO -- : echo b19a6416da3a05d57fadd6ffdadb382b6d236ca5 | /bin/sh /tmp/ruby/src/trunk/tool/ifchange /tmp/ruby/src/trunk/.bundle/.timestamp/typeprof.revision - I, [2024-05-04T15:59:41.921503 #2728330] INFO -- : /tmp/ruby/src/trunk/.bundle/.timestamp/minitest.revision unchanged I, [2024-05-04T15:59:41.921540 #2728330] INFO -- : /tmp/ruby/src/trunk/.bundle/.timestamp/power_assert.revision unchanged I, [2024-05-04T15:59:41.921925 #2728330] INFO -- : /tmp/ruby/src/trunk/.bundle/.timestamp/rbs.revision unchanged I, [2024-05-04T15:59:41.922201 #2728330] INFO -- : /tmp/ruby/src/trunk/.bundle/.timestamp/typeprof.revision unchanged I, [2024-05-04T15:59:41.922646 #2728330] INFO -- : Building power_assert@84e85124c5014a139af39161d484156cfe87a9ed to /tmp/ruby/src/trunk/gems/power_assert-2.0.3.gem I, [2024-05-04T15:59:41.991557 #2728330] INFO -- : Successfully built RubyGem I, [2024-05-04T15:59:41.991616 #2728330] INFO -- : Name: power_assert I, [2024-05-04T15:59:41.991636 #2728330] INFO -- : Version: 2.0.4dev I, [2024-05-04T15:59:41.991647 #2728330] INFO -- : File: power_assert-2.0.4dev.gem I, [2024-05-04T15:59:42.037712 #2728330] INFO -- : $$$[end] "make update-download -j20" exit with 0. I, [2024-05-04T15:59:42.037752 #2728330] INFO -- : $$$[beg] make update-rubyspec -j20 I, [2024-05-04T15:59:42.094791 #2728330] INFO -- : make: Nothing to be done for 'update-rubyspec'. I, [2024-05-04T15:59:42.095027 #2728330] INFO -- : $$$[end] "make update-rubyspec -j20" exit with 0. I, [2024-05-04T15:59:42.095060 #2728330] INFO -- : $$$[beg] make update-src -j20 I, [2024-05-04T15:59:42.843215 #2728330] INFO -- : Already up to date. I, [2024-05-04T15:59:42.852581 #2728330] INFO -- : Latest commit hash = 96710a3139 I, [2024-05-04T15:59:42.853606 #2728330] INFO -- : $$$[end] "make update-src -j20" exit with 0. I, [2024-05-04T15:59:42.853646 #2728330] INFO -- : $$$[beg] make after-update -j20 I, [2024-05-04T15:59:42.925429 #2728330] INFO -- : generating /tmp/ruby/src/trunk/ext/ripper/eventids2table.c I, [2024-05-04T15:59:42.929751 #2728330] INFO -- : make[1]: Entering directory '/tmp/ruby/src/trunk/ext/ripper' I, [2024-05-04T15:59:42.929799 #2728330] INFO -- : make[1]: Nothing to be done for 'src'. I, [2024-05-04T15:59:42.929812 #2728330] INFO -- : make[1]: Leaving directory '/tmp/ruby/src/trunk/ext/ripper' I, [2024-05-04T15:59:42.946411 #2728330] INFO -- : /tmp/ruby/src/trunk/revision.h updated I, [2024-05-04T15:59:42.947586 #2728330] INFO -- : generating x86_64-linux-fake.rb I, [2024-05-04T15:59:43.000339 #2728330] INFO -- : x86_64-linux-fake.rb updated I, [2024-05-04T15:59:43.001669 #2728330] INFO -- : generating enc.mk I, [2024-05-04T15:59:43.118945 #2728330] INFO -- : making srcs under enc I, [2024-05-04T15:59:43.148341 #2728330] INFO -- : make[1]: Entering directory '/tmp/ruby/build/trunk' I, [2024-05-04T15:59:43.148372 #2728330] INFO -- : make[1]: Nothing to be done for 'srcs'. I, [2024-05-04T15:59:43.148377 #2728330] INFO -- : make[1]: Leaving directory '/tmp/ruby/build/trunk' I, [2024-05-04T15:59:43.194072 #2728330] INFO -- : Update minitest to ea9caafc0754b1d6236a490d59e624b53209734a I, [2024-05-04T15:59:43.194233 #2728330] INFO -- : Update power_assert to 84e85124c5014a139af39161d484156cfe87a9ed I, [2024-05-04T15:59:43.194933 #2728330] INFO -- : Update rbs to ba7872795d5de04adb8ff500c0e6afdc81a041dd I, [2024-05-04T15:59:43.195174 #2728330] INFO -- : Update typeprof to b19a6416da3a05d57fadd6ffdadb382b6d236ca5 I, [2024-05-04T15:59:43.195547 #2728330] INFO -- : echo ea9caafc0754b1d6236a490d59e624b53209734a | /bin/sh /tmp/ruby/src/trunk/tool/ifchange /tmp/ruby/src/trunk/.bundle/.timestamp/minitest.revision - I, [2024-05-04T15:59:43.195708 #2728330] INFO -- : echo 84e85124c5014a139af39161d484156cfe87a9ed | /bin/sh /tmp/ruby/src/trunk/tool/ifchange /tmp/ruby/src/trunk/.bundle/.timestamp/power_assert.revision - I, [2024-05-04T15:59:43.197033 #2728330] INFO -- : echo ba7872795d5de04adb8ff500c0e6afdc81a041dd | /bin/sh /tmp/ruby/src/trunk/tool/ifchange /tmp/ruby/src/trunk/.bundle/.timestamp/rbs.revision - I, [2024-05-04T15:59:43.197169 #2728330] INFO -- : echo b19a6416da3a05d57fadd6ffdadb382b6d236ca5 | /bin/sh /tmp/ruby/src/trunk/tool/ifchange /tmp/ruby/src/trunk/.bundle/.timestamp/typeprof.revision - I, [2024-05-04T15:59:43.197573 #2728330] INFO -- : /tmp/ruby/src/trunk/.bundle/.timestamp/power_assert.revision unchanged I, [2024-05-04T15:59:43.197663 #2728330] INFO -- : /tmp/ruby/src/trunk/.bundle/.timestamp/minitest.revision unchanged I, [2024-05-04T15:59:43.198522 #2728330] INFO -- : Building power_assert@84e85124c5014a139af39161d484156cfe87a9ed to /tmp/ruby/src/trunk/gems/power_assert-2.0.3.gem I, [2024-05-04T15:59:43.198876 #2728330] INFO -- : /tmp/ruby/src/trunk/.bundle/.timestamp/typeprof.revision unchanged I, [2024-05-04T15:59:43.198993 #2728330] INFO -- : /tmp/ruby/src/trunk/.bundle/.timestamp/rbs.revision unchanged I, [2024-05-04T15:59:43.268492 #2728330] INFO -- : Successfully built RubyGem I, [2024-05-04T15:59:43.268539 #2728330] INFO -- : Name: power_assert I, [2024-05-04T15:59:43.268547 #2728330] INFO -- : Version: 2.0.4dev I, [2024-05-04T15:59:43.268558 #2728330] INFO -- : File: power_assert-2.0.4dev.gem I, [2024-05-04T15:59:43.270912 #2728330] INFO -- : Extracting bundle gem power_assert-2.0.3... I, [2024-05-04T15:59:43.332964 #2728330] INFO -- : Try with hash version of bundled gems instead of gems/power_assert-2.0.3.gem. We don't use this gem with release version of Ruby. I, [2024-05-04T15:59:43.337959 #2728330] INFO -- : Unpacked gems/power_assert-2.0.4dev.gem I, [2024-05-04T15:59:43.340038 #2728330] INFO -- : $$$[end] "make after-update -j20" exit with 0. I, [2024-05-04T15:59:43.340198 #2728330] INFO -- : $$$[beg] make miniruby -j20 I, [2024-05-04T15:59:43.398222 #2728330] INFO -- : BASERUBY = /usr/bin/ruby --disable=gems I, [2024-05-04T15:59:43.398263 #2728330] INFO -- : CC = gcc I, [2024-05-04T15:59:43.398276 #2728330] INFO -- : LD = ld I, [2024-05-04T15:59:43.398286 #2728330] INFO -- : LDSHARED = gcc -shared I, [2024-05-04T15:59:43.398297 #2728330] INFO -- : CFLAGS = -O3 -fno-fast-math -ggdb3 -Wall -Wextra -Wdeprecated-declarations -Wdiv-by-zero -Wduplicated-cond -Wimplicit-function-declaration -Wimplicit-int -Wpointer-arith -Wwrite-strings -Wold-style-definition -Wimplicit-fallthrough=0 -Wmissing-noreturn -Wno-cast-function-type -Wno-constant-logical-operand -Wno-long-long -Wno-missing-field-initializers -Wno-overlength-strings -Wno-packed-bitfield-compat -Wno-parentheses-equality -Wno-self-assign -Wno-tautological-compare -Wno-unused-parameter -Wno-unused-value -Wsuggest-attribute=format -Wsuggest-attribute=noreturn -Wunused-variable -Wmisleading-indentation -Wundef -fPIC I, [2024-05-04T15:59:43.398308 #2728330] INFO -- : XCFLAGS = -U_FORTIFY_SOURCE -D_FORTIFY_SOURCE=2 -fstack-protector-strong -fno-strict-overflow -fvisibility=hidden -fexcess-precision=standard -DRUBY_EXPORT -I. -I.ext/include/x86_64-linux -I/tmp/ruby/src/trunk/include -I/tmp/ruby/src/trunk -I/tmp/ruby/src/trunk/prism -I/tmp/ruby/src/trunk/enc/unicode/15.0.0 I, [2024-05-04T15:59:43.398328 #2728330] INFO -- : CPPFLAGS = I, [2024-05-04T15:59:43.398339 #2728330] INFO -- : DLDFLAGS = -Wl,--compress-debug-sections=zlib -Wl,-soname,libruby.so.3.4 -fstack-protector-strong I, [2024-05-04T15:59:43.398350 #2728330] INFO -- : SOLIBS = -lz -lrt -lrt -lgmp -ldl -lcrypt -lm -lpthread I, [2024-05-04T15:59:43.398360 #2728330] INFO -- : LANG = en_US.UTF-8 I, [2024-05-04T15:59:43.398370 #2728330] INFO -- : LC_ALL = I, [2024-05-04T15:59:43.398379 #2728330] INFO -- : LC_CTYPE = I, [2024-05-04T15:59:43.398389 #2728330] INFO -- : MFLAGS = -j20 --jobserver-auth=4,5 I, [2024-05-04T15:59:43.398399 #2728330] INFO -- : RUSTC = no I, [2024-05-04T15:59:43.398409 #2728330] INFO -- : YJIT_RUSTC_ARGS = --crate-name=yjit --crate-type=staticlib --edition=2021 -g -C lto=thin -C opt-level=3 -C overflow-checks=on '--out-dir=/tmp/ruby/build/trunk/yjit/target/release/' /tmp/ruby/src/trunk/yjit/src/lib.rs I, [2024-05-04T15:59:43.399674 #2728330] INFO -- : gcc (Ubuntu 11.4.0-1ubuntu1~22.04) 11.4.0 I, [2024-05-04T15:59:43.399714 #2728330] INFO -- : Copyright (C) 2021 Free Software Foundation, Inc. I, [2024-05-04T15:59:43.399726 #2728330] INFO -- : This is free software; see the source for copying conditions. There is NO I, [2024-05-04T15:59:43.399738 #2728330] INFO -- : warranty; not even for MERCHANTABILITY or FITNESS FOR A PARTICULAR PURPOSE. I, [2024-05-04T15:59:43.399748 #2728330] INFO -- : I, [2024-05-04T15:59:43.421381 #2728330] INFO -- : compiling /tmp/ruby/src/trunk/version.c I, [2024-05-04T15:59:43.525623 #2728330] INFO -- : linking miniruby I, [2024-05-04T15:59:44.047819 #2728330] INFO -- : $$$[end] "make miniruby -j20" exit with 0. I, [2024-05-04T15:59:44.047937 #2728330] INFO -- : $$$[beg] make ruby -j20 I, [2024-05-04T15:59:44.105126 #2728330] INFO -- : BASERUBY = /usr/bin/ruby --disable=gems I, [2024-05-04T15:59:44.105151 #2728330] INFO -- : CC = gcc I, [2024-05-04T15:59:44.105156 #2728330] INFO -- : LD = ld I, [2024-05-04T15:59:44.105160 #2728330] INFO -- : LDSHARED = gcc -shared I, [2024-05-04T15:59:44.105167 #2728330] INFO -- : CFLAGS = -O3 -fno-fast-math -ggdb3 -Wall -Wextra -Wdeprecated-declarations -Wdiv-by-zero -Wduplicated-cond -Wimplicit-function-declaration -Wimplicit-int -Wpointer-arith -Wwrite-strings -Wold-style-definition -Wimplicit-fallthrough=0 -Wmissing-noreturn -Wno-cast-function-type -Wno-constant-logical-operand -Wno-long-long -Wno-missing-field-initializers -Wno-overlength-strings -Wno-packed-bitfield-compat -Wno-parentheses-equality -Wno-self-assign -Wno-tautological-compare -Wno-unused-parameter -Wno-unused-value -Wsuggest-attribute=format -Wsuggest-attribute=noreturn -Wunused-variable -Wmisleading-indentation -Wundef -fPIC I, [2024-05-04T15:59:44.105172 #2728330] INFO -- : XCFLAGS = -U_FORTIFY_SOURCE -D_FORTIFY_SOURCE=2 -fstack-protector-strong -fno-strict-overflow -fvisibility=hidden -fexcess-precision=standard -DRUBY_EXPORT -I. -I.ext/include/x86_64-linux -I/tmp/ruby/src/trunk/include -I/tmp/ruby/src/trunk -I/tmp/ruby/src/trunk/prism -I/tmp/ruby/src/trunk/enc/unicode/15.0.0 I, [2024-05-04T15:59:44.105175 #2728330] INFO -- : CPPFLAGS = I, [2024-05-04T15:59:44.105179 #2728330] INFO -- : DLDFLAGS = -Wl,--compress-debug-sections=zlib -Wl,-soname,libruby.so.3.4 -fstack-protector-strong I, [2024-05-04T15:59:44.105183 #2728330] INFO -- : SOLIBS = -lz -lrt -lrt -lgmp -ldl -lcrypt -lm -lpthread I, [2024-05-04T15:59:44.105193 #2728330] INFO -- : LANG = en_US.UTF-8 I, [2024-05-04T15:59:44.105196 #2728330] INFO -- : LC_ALL = I, [2024-05-04T15:59:44.105200 #2728330] INFO -- : LC_CTYPE = I, [2024-05-04T15:59:44.105203 #2728330] INFO -- : MFLAGS = -j20 --jobserver-auth=4,5 I, [2024-05-04T15:59:44.105207 #2728330] INFO -- : RUSTC = no I, [2024-05-04T15:59:44.105211 #2728330] INFO -- : YJIT_RUSTC_ARGS = --crate-name=yjit --crate-type=staticlib --edition=2021 -g -C lto=thin -C opt-level=3 -C overflow-checks=on '--out-dir=/tmp/ruby/build/trunk/yjit/target/release/' /tmp/ruby/src/trunk/yjit/src/lib.rs I, [2024-05-04T15:59:44.106559 #2728330] INFO -- : gcc (Ubuntu 11.4.0-1ubuntu1~22.04) 11.4.0 I, [2024-05-04T15:59:44.106582 #2728330] INFO -- : Copyright (C) 2021 Free Software Foundation, Inc. I, [2024-05-04T15:59:44.106588 #2728330] INFO -- : This is free software; see the source for copying conditions. There is NO I, [2024-05-04T15:59:44.106592 #2728330] INFO -- : warranty; not even for MERCHANTABILITY or FITNESS FOR A PARTICULAR PURPOSE. I, [2024-05-04T15:59:44.106596 #2728330] INFO -- : I, [2024-05-04T15:59:44.216729 #2728330] INFO -- : builtin_binary.inc updated I, [2024-05-04T15:59:44.221738 #2728330] INFO -- : c5234a9416e4f20f175185e840b25b0f08674d14078ed7083f37e655458e3ca9 builtin_binary.inc I, [2024-05-04T15:59:44.222578 #2728330] INFO -- : compiling /tmp/ruby/src/trunk/builtin.c I, [2024-05-04T15:59:44.407549 #2728330] INFO -- : linking static-library libruby-static.a I, [2024-05-04T15:59:44.722653 #2728330] INFO -- : linking shared-library libruby.so.3.4.0 I, [2024-05-04T15:59:46.274775 #2728330] INFO -- : linking ruby I, [2024-05-04T15:59:46.297830 #2728330] INFO -- : $$$[end] "make ruby -j20" exit with 0. I, [2024-05-04T15:59:46.297969 #2728330] INFO -- : $$$[beg] make all -j20 I, [2024-05-04T15:59:46.354673 #2728330] INFO -- : BASERUBY = /usr/bin/ruby --disable=gems I, [2024-05-04T15:59:46.354717 #2728330] INFO -- : CC = gcc I, [2024-05-04T15:59:46.354730 #2728330] INFO -- : LD = ld I, [2024-05-04T15:59:46.354740 #2728330] INFO -- : LDSHARED = gcc -shared I, [2024-05-04T15:59:46.354751 #2728330] INFO -- : CFLAGS = -O3 -fno-fast-math -ggdb3 -Wall -Wextra -Wdeprecated-declarations -Wdiv-by-zero -Wduplicated-cond -Wimplicit-function-declaration -Wimplicit-int -Wpointer-arith -Wwrite-strings -Wold-style-definition -Wimplicit-fallthrough=0 -Wmissing-noreturn -Wno-cast-function-type -Wno-constant-logical-operand -Wno-long-long -Wno-missing-field-initializers -Wno-overlength-strings -Wno-packed-bitfield-compat -Wno-parentheses-equality -Wno-self-assign -Wno-tautological-compare -Wno-unused-parameter -Wno-unused-value -Wsuggest-attribute=format -Wsuggest-attribute=noreturn -Wunused-variable -Wmisleading-indentation -Wundef -fPIC I, [2024-05-04T15:59:46.354765 #2728330] INFO -- : XCFLAGS = -U_FORTIFY_SOURCE -D_FORTIFY_SOURCE=2 -fstack-protector-strong -fno-strict-overflow -fvisibility=hidden -fexcess-precision=standard -DRUBY_EXPORT -I. -I.ext/include/x86_64-linux -I/tmp/ruby/src/trunk/include -I/tmp/ruby/src/trunk -I/tmp/ruby/src/trunk/prism -I/tmp/ruby/src/trunk/enc/unicode/15.0.0 I, [2024-05-04T15:59:46.354776 #2728330] INFO -- : CPPFLAGS = I, [2024-05-04T15:59:46.354786 #2728330] INFO -- : DLDFLAGS = -Wl,--compress-debug-sections=zlib -Wl,-soname,libruby.so.3.4 -fstack-protector-strong I, [2024-05-04T15:59:46.354797 #2728330] INFO -- : SOLIBS = -lz -lrt -lrt -lgmp -ldl -lcrypt -lm -lpthread I, [2024-05-04T15:59:46.354807 #2728330] INFO -- : LANG = en_US.UTF-8 I, [2024-05-04T15:59:46.354817 #2728330] INFO -- : LC_ALL = I, [2024-05-04T15:59:46.354827 #2728330] INFO -- : LC_CTYPE = I, [2024-05-04T15:59:46.354837 #2728330] INFO -- : MFLAGS = -j20 --jobserver-auth=4,5 I, [2024-05-04T15:59:46.354848 #2728330] INFO -- : RUSTC = no I, [2024-05-04T15:59:46.354860 #2728330] INFO -- : YJIT_RUSTC_ARGS = --crate-name=yjit --crate-type=staticlib --edition=2021 -g -C lto=thin -C opt-level=3 -C overflow-checks=on '--out-dir=/tmp/ruby/build/trunk/yjit/target/release/' /tmp/ruby/src/trunk/yjit/src/lib.rs I, [2024-05-04T15:59:46.356113 #2728330] INFO -- : gcc (Ubuntu 11.4.0-1ubuntu1~22.04) 11.4.0 I, [2024-05-04T15:59:46.356175 #2728330] INFO -- : Copyright (C) 2021 Free Software Foundation, Inc. I, [2024-05-04T15:59:46.356182 #2728330] INFO -- : This is free software; see the source for copying conditions. There is NO I, [2024-05-04T15:59:46.356186 #2728330] INFO -- : warranty; not even for MERCHANTABILITY or FITNESS FOR A PARTICULAR PURPOSE. I, [2024-05-04T15:59:46.356195 #2728330] INFO -- : I, [2024-05-04T15:59:46.385992 #2728330] INFO -- : generating enc.mk I, [2024-05-04T15:59:46.387885 #2728330] INFO -- : building spec/ruby/optional/capi/ext/array_spec.so I, [2024-05-04T15:59:46.388108 #2728330] INFO -- : building spec/ruby/optional/capi/ext/basic_object_spec.so I, [2024-05-04T15:59:46.388357 #2728330] INFO -- : building spec/ruby/optional/capi/ext/bignum_spec.so I, [2024-05-04T15:59:46.388715 #2728330] INFO -- : building spec/ruby/optional/capi/ext/binding_spec.so I, [2024-05-04T15:59:46.390069 #2728330] INFO -- : building spec/ruby/optional/capi/ext/boolean_spec.so I, [2024-05-04T15:59:46.390825 #2728330] INFO -- : building spec/ruby/optional/capi/ext/class_id_under_autoload_spec.so I, [2024-05-04T15:59:46.391456 #2728330] INFO -- : building spec/ruby/optional/capi/ext/class_spec.so I, [2024-05-04T15:59:46.392390 #2728330] INFO -- : building spec/ruby/optional/capi/ext/class_under_autoload_spec.so I, [2024-05-04T15:59:46.393229 #2728330] INFO -- : building spec/ruby/optional/capi/ext/complex_spec.so I, [2024-05-04T15:59:46.393494 #2728330] INFO -- : building spec/ruby/optional/capi/ext/constants_spec.so I, [2024-05-04T15:59:46.394402 #2728330] INFO -- : building spec/ruby/optional/capi/ext/data_spec.so I, [2024-05-04T15:59:46.395298 #2728330] INFO -- : building spec/ruby/optional/capi/ext/debug_spec.so I, [2024-05-04T15:59:46.395628 #2728330] INFO -- : building spec/ruby/optional/capi/ext/encoding_spec.so I, [2024-05-04T15:59:46.396184 #2728330] INFO -- : building spec/ruby/optional/capi/ext/enumerator_spec.so I, [2024-05-04T15:59:46.396416 #2728330] INFO -- : building spec/ruby/optional/capi/ext/exception_spec.so I, [2024-05-04T15:59:46.397177 #2728330] INFO -- : building spec/ruby/optional/capi/ext/fiber_spec.so I, [2024-05-04T15:59:46.397619 #2728330] INFO -- : building spec/ruby/optional/capi/ext/file_spec.so I, [2024-05-04T15:59:46.428638 #2728330] INFO -- : building spec/ruby/optional/capi/ext/fixnum_spec.so I, [2024-05-04T15:59:46.468594 #2728330] INFO -- : building spec/ruby/optional/capi/ext/float_spec.so I, [2024-05-04T15:59:46.507072 #2728330] INFO -- : building spec/ruby/optional/capi/ext/gc_spec.so I, [2024-05-04T15:59:46.525808 #2728330] INFO -- : building spec/ruby/optional/capi/ext/globals_spec.so I, [2024-05-04T15:59:46.534072 #2728330] INFO -- : building spec/ruby/optional/capi/ext/hash_spec.so I, [2024-05-04T15:59:46.549657 #2728330] INFO -- : building spec/ruby/optional/capi/ext/integer_spec.so I, [2024-05-04T15:59:46.550291 #2728330] INFO -- : building spec/ruby/optional/capi/ext/io_spec.so I, [2024-05-04T15:59:46.563534 #2728330] INFO -- : building spec/ruby/optional/capi/ext/kernel_spec.so I, [2024-05-04T15:59:46.567841 #2728330] INFO -- : building spec/ruby/optional/capi/ext/language_spec.so I, [2024-05-04T15:59:46.571082 #2728330] INFO -- : building spec/ruby/optional/capi/ext/marshal_spec.so I, [2024-05-04T15:59:46.576692 #2728330] INFO -- : building spec/ruby/optional/capi/ext/module_spec.so I, [2024-05-04T15:59:46.578286 #2728330] INFO -- : building spec/ruby/optional/capi/ext/module_under_autoload_spec.so I, [2024-05-04T15:59:46.582112 #2728330] INFO -- : building spec/ruby/optional/capi/ext/mutex_spec.so I, [2024-05-04T15:59:46.585394 #2728330] INFO -- : building spec/ruby/optional/capi/ext/numeric_spec.so I, [2024-05-04T15:59:46.590394 #2728330] INFO -- : building spec/ruby/optional/capi/ext/object_spec.so I, [2024-05-04T15:59:46.591947 #2728330] INFO -- : building spec/ruby/optional/capi/ext/proc_spec.so I, [2024-05-04T15:59:46.627635 #2728330] INFO -- : building spec/ruby/optional/capi/ext/range_spec.so I, [2024-05-04T15:59:46.632418 #2728330] INFO -- : building spec/ruby/optional/capi/ext/rational_spec.so I, [2024-05-04T15:59:46.645148 #2728330] INFO -- : building spec/ruby/optional/capi/ext/rbasic_spec.so I, [2024-05-04T15:59:46.700213 #2728330] INFO -- : building spec/ruby/optional/capi/ext/regexp_spec.so I, [2024-05-04T15:59:46.707074 #2728330] INFO -- : building spec/ruby/optional/capi/ext/string_spec.so I, [2024-05-04T15:59:46.708657 #2728330] INFO -- : building spec/ruby/optional/capi/ext/struct_spec.so I, [2024-05-04T15:59:46.710119 #2728330] INFO -- : building spec/ruby/optional/capi/ext/st_spec.so I, [2024-05-04T15:59:46.714203 #2728330] INFO -- : building spec/ruby/optional/capi/ext/symbol_spec.so I, [2024-05-04T15:59:46.718245 #2728330] INFO -- : building spec/ruby/optional/capi/ext/thread_spec.so I, [2024-05-04T15:59:46.721807 #2728330] INFO -- : building spec/ruby/optional/capi/ext/time_spec.so I, [2024-05-04T15:59:46.736176 #2728330] INFO -- : building spec/ruby/optional/capi/ext/tracepoint_spec.so I, [2024-05-04T15:59:46.746896 #2728330] INFO -- : building spec/ruby/optional/capi/ext/typed_data_spec.so I, [2024-05-04T15:59:46.780077 #2728330] INFO -- : building spec/ruby/optional/capi/ext/util_spec.so I, [2024-05-04T15:59:46.784081 #2728330] INFO -- : making enc I, [2024-05-04T15:59:46.784679 #2728330] INFO -- : making srcs under enc I, [2024-05-04T15:59:46.812251 #2728330] INFO -- : make[1]: Entering directory '/tmp/ruby/build/trunk' I, [2024-05-04T15:59:46.812331 #2728330] INFO -- : make[1]: Nothing to be done for 'enc'. I, [2024-05-04T15:59:46.812341 #2728330] INFO -- : make[1]: Leaving directory '/tmp/ruby/build/trunk' I, [2024-05-04T15:59:46.845100 #2728330] INFO -- : make[1]: Entering directory '/tmp/ruby/build/trunk' I, [2024-05-04T15:59:46.845159 #2728330] INFO -- : make[1]: Nothing to be done for 'srcs'. I, [2024-05-04T15:59:46.845168 #2728330] INFO -- : make[1]: Leaving directory '/tmp/ruby/build/trunk' I, [2024-05-04T15:59:46.845875 #2728330] INFO -- : generating transdb.h I, [2024-05-04T15:59:46.945148 #2728330] INFO -- : transdb.h unchanged I, [2024-05-04T15:59:46.946937 #2728330] INFO -- : generating makefiles ext/configure-ext.mk I, [2024-05-04T15:59:46.947452 #2728330] INFO -- : making trans I, [2024-05-04T15:59:46.974451 #2728330] INFO -- : ext/configure-ext.mk updated I, [2024-05-04T15:59:46.977015 #2728330] INFO -- : make[1]: Entering directory '/tmp/ruby/build/trunk' I, [2024-05-04T15:59:46.982732 #2728330] INFO -- : make[1]: Entering directory '/tmp/ruby/build/trunk' I, [2024-05-04T15:59:46.982828 #2728330] INFO -- : make[1]: Nothing to be done for 'trans'. I, [2024-05-04T15:59:46.984115 #2728330] INFO -- : make[1]: Leaving directory '/tmp/ruby/build/trunk' I, [2024-05-04T15:59:46.984194 #2728330] INFO -- : making encs I, [2024-05-04T15:59:47.042418 #2728330] INFO -- : make[1]: Entering directory '/tmp/ruby/build/trunk' I, [2024-05-04T15:59:47.042475 #2728330] INFO -- : make[1]: Nothing to be done for 'encs'. I, [2024-05-04T15:59:47.042482 #2728330] INFO -- : make[1]: Leaving directory '/tmp/ruby/build/trunk' I, [2024-05-04T15:59:47.134270 #2728330] INFO -- : make[1]: Leaving directory '/tmp/ruby/build/trunk' I, [2024-05-04T15:59:47.134808 #2728330] INFO -- : generating makefile exts.mk I, [2024-05-04T15:59:47.171784 #2728330] INFO -- : exts.mk unchanged I, [2024-05-04T15:59:47.176440 #2728330] INFO -- : make[1]: Entering directory '/tmp/ruby/build/trunk' I, [2024-05-04T15:59:47.195560 #2728330] INFO -- : make[2]: Entering directory '/tmp/ruby/build/trunk/ext/digest' I, [2024-05-04T15:59:47.197369 #2728330] INFO -- : make[2]: Entering directory '/tmp/ruby/build/trunk/ext/coverage' I, [2024-05-04T15:59:47.197575 #2728330] INFO -- : make[2]: Entering directory '/tmp/ruby/build/trunk/ext/date' I, [2024-05-04T15:59:47.197820 #2728330] INFO -- : make[2]: Entering directory '/tmp/ruby/build/trunk/ext/json' I, [2024-05-04T15:59:47.199172 #2728330] INFO -- : make[2]: Leaving directory '/tmp/ruby/build/trunk/ext/digest' I, [2024-05-04T15:59:47.199553 #2728330] INFO -- : make[2]: Entering directory '/tmp/ruby/build/trunk/ext/io/console' I, [2024-05-04T15:59:47.199592 #2728330] INFO -- : make[2]: Entering directory '/tmp/ruby/build/trunk/ext/rubyvm' I, [2024-05-04T15:59:47.199626 #2728330] INFO -- : make[2]: Entering directory '/tmp/ruby/build/trunk/ext/monitor' I, [2024-05-04T15:59:47.200353 #2728330] INFO -- : make[2]: Entering directory '/tmp/ruby/build/trunk/ext/pathname' I, [2024-05-04T15:59:47.200703 #2728330] INFO -- : make[2]: Entering directory '/tmp/ruby/build/trunk/ext/pty' I, [2024-05-04T15:59:47.201183 #2728330] INFO -- : make[2]: Leaving directory '/tmp/ruby/build/trunk/ext/coverage' I, [2024-05-04T15:59:47.201683 #2728330] INFO -- : make[2]: Entering directory '/tmp/ruby/build/trunk/ext/objspace' I, [2024-05-04T15:59:47.201921 #2728330] INFO -- : make[2]: Leaving directory '/tmp/ruby/build/trunk/ext/date' I, [2024-05-04T15:59:47.202008 #2728330] INFO -- : make[2]: Entering directory '/tmp/ruby/build/trunk/ext/fiddle' I, [2024-05-04T15:59:47.202301 #2728330] INFO -- : make[2]: Leaving directory '/tmp/ruby/build/trunk/ext/io/console' I, [2024-05-04T15:59:47.202436 #2728330] INFO -- : make[2]: Entering directory '/tmp/ruby/build/trunk/ext/psych' I, [2024-05-04T15:59:47.202606 #2728330] INFO -- : make[2]: Leaving directory '/tmp/ruby/build/trunk/ext/rubyvm' I, [2024-05-04T15:59:47.202937 #2728330] INFO -- : make[2]: Leaving directory '/tmp/ruby/build/trunk/ext/monitor' I, [2024-05-04T15:59:47.203048 #2728330] INFO -- : make[2]: Leaving directory '/tmp/ruby/build/trunk/ext/pathname' I, [2024-05-04T15:59:47.203359 #2728330] INFO -- : make[2]: Leaving directory '/tmp/ruby/build/trunk/ext/pty' I, [2024-05-04T15:59:47.204243 #2728330] INFO -- : make[2]: Entering directory '/tmp/ruby/build/trunk/.bundle/gems/debug-1.9.2/ext/debug' I, [2024-05-04T15:59:47.205739 #2728330] INFO -- : make[2]: Leaving directory '/tmp/ruby/build/trunk/ext/objspace' I, [2024-05-04T15:59:47.206114 #2728330] INFO -- : make[2]: Entering directory '/tmp/ruby/build/trunk/ext/ripper' I, [2024-05-04T15:59:47.206354 #2728330] INFO -- : make[2]: Entering directory '/tmp/ruby/build/trunk/.bundle/gems/nkf-0.2.0/ext/nkf' I, [2024-05-04T15:59:47.206469 #2728330] INFO -- : make[2]: Entering directory '/tmp/ruby/build/trunk/.bundle/gems/bigdecimal-3.1.7/ext/bigdecimal' I, [2024-05-04T15:59:47.206676 #2728330] INFO -- : make[2]: Entering directory '/tmp/ruby/build/trunk/.bundle/gems/racc-1.7.3/ext/racc/cparse' I, [2024-05-04T15:59:47.207034 #2728330] INFO -- : make[2]: Entering directory '/tmp/ruby/build/trunk/.bundle/gems/syslog-0.1.2/ext/syslog' I, [2024-05-04T15:59:47.207406 #2728330] INFO -- : make[2]: Leaving directory '/tmp/ruby/build/trunk/ext/json' I, [2024-05-04T15:59:47.207426 #2728330] INFO -- : make[2]: Entering directory '/tmp/ruby/build/trunk/.bundle/gems/rbs-3.4.4/ext/rbs_extension' I, [2024-05-04T15:59:47.208981 #2728330] INFO -- : make[2]: Leaving directory '/tmp/ruby/build/trunk/ext/fiddle' I, [2024-05-04T15:59:47.210450 #2728330] INFO -- : make[2]: Entering directory '/tmp/ruby/build/trunk/ext/socket' I, [2024-05-04T15:59:47.210513 #2728330] INFO -- : make[2]: Entering directory '/tmp/ruby/build/trunk/ext/digest/sha2' I, [2024-05-04T15:59:47.212743 #2728330] INFO -- : make[2]: Leaving directory '/tmp/ruby/build/trunk/ext/digest/sha2' I, [2024-05-04T15:59:47.213434 #2728330] INFO -- : make[2]: Leaving directory '/tmp/ruby/build/trunk/ext/ripper' I, [2024-05-04T15:59:47.213853 #2728330] INFO -- : make[2]: Entering directory '/tmp/ruby/build/trunk/ext/openssl' I, [2024-05-04T15:59:47.213901 #2728330] INFO -- : make[2]: Leaving directory '/tmp/ruby/build/trunk/ext/psych' I, [2024-05-04T15:59:47.218829 #2728330] INFO -- : make[2]: Leaving directory '/tmp/ruby/build/trunk/ext/socket' I, [2024-05-04T15:59:47.225212 #2728330] INFO -- : make[2]: Leaving directory '/tmp/ruby/build/trunk/ext/openssl' I, [2024-05-04T15:59:47.227826 #2728330] INFO -- : make[2]: Leaving directory '/tmp/ruby/build/trunk/.bundle/gems/debug-1.9.2/ext/debug' I, [2024-05-04T15:59:47.228332 #2728330] INFO -- : make[2]: Leaving directory '/tmp/ruby/build/trunk/.bundle/gems/nkf-0.2.0/ext/nkf' I, [2024-05-04T15:59:47.235087 #2728330] INFO -- : make[2]: Leaving directory '/tmp/ruby/build/trunk/.bundle/gems/racc-1.7.3/ext/racc/cparse' I, [2024-05-04T15:59:47.237186 #2728330] INFO -- : make[2]: Leaving directory '/tmp/ruby/build/trunk/.bundle/gems/syslog-0.1.2/ext/syslog' I, [2024-05-04T15:59:47.239234 #2728330] INFO -- : make[2]: Leaving directory '/tmp/ruby/build/trunk/.bundle/gems/bigdecimal-3.1.7/ext/bigdecimal' I, [2024-05-04T15:59:47.240212 #2728330] INFO -- : make[2]: Leaving directory '/tmp/ruby/build/trunk/.bundle/gems/rbs-3.4.4/ext/rbs_extension' I, [2024-05-04T15:59:47.265041 #2728330] INFO -- : make[2]: Entering directory '/tmp/ruby/build/trunk' I, [2024-05-04T15:59:47.331225 #2728330] INFO -- : linking ruby I, [2024-05-04T15:59:47.354205 #2728330] INFO -- : make[2]: Leaving directory '/tmp/ruby/build/trunk' I, [2024-05-04T15:59:47.354807 #2728330] INFO -- : make[1]: Leaving directory '/tmp/ruby/build/trunk' I, [2024-05-04T15:59:47.358465 #2728330] INFO -- : make[1]: Entering directory '/tmp/ruby/build/trunk' I, [2024-05-04T15:59:47.358488 #2728330] INFO -- : make[1]: Nothing to be done for 'note'. I, [2024-05-04T15:59:47.358494 #2728330] INFO -- : make[1]: Leaving directory '/tmp/ruby/build/trunk' I, [2024-05-04T15:59:47.359304 #2728330] INFO -- : $$$[end] "make all -j20" exit with 0. I, [2024-05-04T15:59:47.359446 #2728330] INFO -- : $$$[beg] make install -j20 I, [2024-05-04T15:59:47.423238 #2728330] INFO -- : Update minitest to ea9caafc0754b1d6236a490d59e624b53209734a I, [2024-05-04T15:59:47.423417 #2728330] INFO -- : Update power_assert to 84e85124c5014a139af39161d484156cfe87a9ed I, [2024-05-04T15:59:47.424094 #2728330] INFO -- : Update rbs to ba7872795d5de04adb8ff500c0e6afdc81a041dd I, [2024-05-04T15:59:47.424138 #2728330] INFO -- : Update typeprof to b19a6416da3a05d57fadd6ffdadb382b6d236ca5 I, [2024-05-04T15:59:47.424787 #2728330] INFO -- : echo ea9caafc0754b1d6236a490d59e624b53209734a | /bin/sh /tmp/ruby/src/trunk/tool/ifchange /tmp/ruby/src/trunk/.bundle/.timestamp/minitest.revision - I, [2024-05-04T15:59:47.424928 #2728330] INFO -- : echo 84e85124c5014a139af39161d484156cfe87a9ed | /bin/sh /tmp/ruby/src/trunk/tool/ifchange /tmp/ruby/src/trunk/.bundle/.timestamp/power_assert.revision - I, [2024-05-04T15:59:47.426059 #2728330] INFO -- : BASERUBY = /usr/bin/ruby --disable=gems I, [2024-05-04T15:59:47.426088 #2728330] INFO -- : CC = gcc I, [2024-05-04T15:59:47.426093 #2728330] INFO -- : LD = ld I, [2024-05-04T15:59:47.426097 #2728330] INFO -- : LDSHARED = gcc -shared I, [2024-05-04T15:59:47.426101 #2728330] INFO -- : CFLAGS = -O3 -fno-fast-math -ggdb3 -Wall -Wextra -Wdeprecated-declarations -Wdiv-by-zero -Wduplicated-cond -Wimplicit-function-declaration -Wimplicit-int -Wpointer-arith -Wwrite-strings -Wold-style-definition -Wimplicit-fallthrough=0 -Wmissing-noreturn -Wno-cast-function-type -Wno-constant-logical-operand -Wno-long-long -Wno-missing-field-initializers -Wno-overlength-strings -Wno-packed-bitfield-compat -Wno-parentheses-equality -Wno-self-assign -Wno-tautological-compare -Wno-unused-parameter -Wno-unused-value -Wsuggest-attribute=format -Wsuggest-attribute=noreturn -Wunused-variable -Wmisleading-indentation -Wundef -fPIC I, [2024-05-04T15:59:47.426106 #2728330] INFO -- : XCFLAGS = -U_FORTIFY_SOURCE -D_FORTIFY_SOURCE=2 -fstack-protector-strong -fno-strict-overflow -fvisibility=hidden -fexcess-precision=standard -DRUBY_EXPORT -I. -I.ext/include/x86_64-linux -I/tmp/ruby/src/trunk/include -I/tmp/ruby/src/trunk -I/tmp/ruby/src/trunk/prism -I/tmp/ruby/src/trunk/enc/unicode/15.0.0 I, [2024-05-04T15:59:47.426110 #2728330] INFO -- : CPPFLAGS = I, [2024-05-04T15:59:47.426113 #2728330] INFO -- : DLDFLAGS = -Wl,--compress-debug-sections=zlib -Wl,-soname,libruby.so.3.4 -fstack-protector-strong I, [2024-05-04T15:59:47.426117 #2728330] INFO -- : SOLIBS = -lz -lrt -lrt -lgmp -ldl -lcrypt -lm -lpthread I, [2024-05-04T15:59:47.426121 #2728330] INFO -- : LANG = en_US.UTF-8 I, [2024-05-04T15:59:47.426125 #2728330] INFO -- : LC_ALL = I, [2024-05-04T15:59:47.426128 #2728330] INFO -- : LC_CTYPE = I, [2024-05-04T15:59:47.426133 #2728330] INFO -- : MFLAGS = -j20 --jobserver-auth=4,5 I, [2024-05-04T15:59:47.426136 #2728330] INFO -- : RUSTC = no I, [2024-05-04T15:59:47.426146 #2728330] INFO -- : YJIT_RUSTC_ARGS = --crate-name=yjit --crate-type=staticlib --edition=2021 -g -C lto=thin -C opt-level=3 -C overflow-checks=on '--out-dir=/tmp/ruby/build/trunk/yjit/target/release/' /tmp/ruby/src/trunk/yjit/src/lib.rs I, [2024-05-04T15:59:47.426675 #2728330] INFO -- : /tmp/ruby/src/trunk/.bundle/.timestamp/minitest.revision unchanged I, [2024-05-04T15:59:47.426889 #2728330] INFO -- : /tmp/ruby/src/trunk/.bundle/.timestamp/power_assert.revision unchanged I, [2024-05-04T15:59:47.453914 #2728330] INFO -- : echo ba7872795d5de04adb8ff500c0e6afdc81a041dd | /bin/sh /tmp/ruby/src/trunk/tool/ifchange /tmp/ruby/src/trunk/.bundle/.timestamp/rbs.revision - I, [2024-05-04T15:59:47.454028 #2728330] INFO -- : echo b19a6416da3a05d57fadd6ffdadb382b6d236ca5 | /bin/sh /tmp/ruby/src/trunk/tool/ifchange /tmp/ruby/src/trunk/.bundle/.timestamp/typeprof.revision - I, [2024-05-04T15:59:47.454792 #2728330] INFO -- : gcc (Ubuntu 11.4.0-1ubuntu1~22.04) 11.4.0 I, [2024-05-04T15:59:47.454816 #2728330] INFO -- : Copyright (C) 2021 Free Software Foundation, Inc. I, [2024-05-04T15:59:47.454822 #2728330] INFO -- : This is free software; see the source for copying conditions. There is NO I, [2024-05-04T15:59:47.454827 #2728330] INFO -- : warranty; not even for MERCHANTABILITY or FITNESS FOR A PARTICULAR PURPOSE. I, [2024-05-04T15:59:47.454831 #2728330] INFO -- : I, [2024-05-04T15:59:47.454835 #2728330] INFO -- : generating enc.mk I, [2024-05-04T15:59:47.455667 #2728330] INFO -- : /tmp/ruby/src/trunk/.bundle/.timestamp/rbs.revision unchanged I, [2024-05-04T15:59:47.455785 #2728330] INFO -- : /tmp/ruby/src/trunk/.bundle/.timestamp/typeprof.revision unchanged I, [2024-05-04T15:59:47.579842 #2728330] INFO -- : Building power_assert@84e85124c5014a139af39161d484156cfe87a9ed to /tmp/ruby/src/trunk/gems/power_assert-2.0.3.gem I, [2024-05-04T15:59:47.580198 #2728330] INFO -- : making srcs under enc I, [2024-05-04T15:59:47.580845 #2728330] INFO -- : making enc I, [2024-05-04T15:59:47.597709 #2728330] INFO -- : make[1]: Entering directory '/tmp/ruby/build/trunk' I, [2024-05-04T15:59:47.597743 #2728330] INFO -- : make[1]: Nothing to be done for 'enc'. I, [2024-05-04T15:59:47.597752 #2728330] INFO -- : make[1]: Leaving directory '/tmp/ruby/build/trunk' I, [2024-05-04T15:59:47.609536 #2728330] INFO -- : make[1]: Entering directory '/tmp/ruby/build/trunk' I, [2024-05-04T15:59:47.609562 #2728330] INFO -- : make[1]: Nothing to be done for 'srcs'. I, [2024-05-04T15:59:47.609571 #2728330] INFO -- : make[1]: Leaving directory '/tmp/ruby/build/trunk' I, [2024-05-04T15:59:47.610484 #2728330] INFO -- : generating transdb.h I, [2024-05-04T15:59:47.648673 #2728330] INFO -- : Successfully built RubyGem I, [2024-05-04T15:59:47.648718 #2728330] INFO -- : Name: power_assert I, [2024-05-04T15:59:47.648725 #2728330] INFO -- : Version: 2.0.4dev I, [2024-05-04T15:59:47.648730 #2728330] INFO -- : File: power_assert-2.0.4dev.gem I, [2024-05-04T15:59:47.651070 #2728330] INFO -- : Extracting bundle gem power_assert-2.0.3... I, [2024-05-04T15:59:47.706354 #2728330] INFO -- : transdb.h unchanged I, [2024-05-04T15:59:47.707977 #2728330] INFO -- : generating makefiles ext/configure-ext.mk I, [2024-05-04T15:59:47.708091 #2728330] INFO -- : making trans I, [2024-05-04T15:59:47.712203 #2728330] INFO -- : Try with hash version of bundled gems instead of gems/power_assert-2.0.3.gem. We don't use this gem with release version of Ruby. I, [2024-05-04T15:59:47.717177 #2728330] INFO -- : Unpacked gems/power_assert-2.0.4dev.gem I, [2024-05-04T15:59:47.735036 #2728330] INFO -- : ext/configure-ext.mk unchanged I, [2024-05-04T15:59:47.737385 #2728330] INFO -- : make[1]: Entering directory '/tmp/ruby/build/trunk' I, [2024-05-04T15:59:47.742172 #2728330] INFO -- : make[1]: Entering directory '/tmp/ruby/build/trunk' I, [2024-05-04T15:59:47.742274 #2728330] INFO -- : make[1]: Nothing to be done for 'trans'. I, [2024-05-04T15:59:47.742306 #2728330] INFO -- : make[1]: Leaving directory '/tmp/ruby/build/trunk' I, [2024-05-04T15:59:47.743350 #2728330] INFO -- : making encs I, [2024-05-04T15:59:47.801962 #2728330] INFO -- : make[1]: Entering directory '/tmp/ruby/build/trunk' I, [2024-05-04T15:59:47.802028 #2728330] INFO -- : make[1]: Nothing to be done for 'encs'. I, [2024-05-04T15:59:47.802049 #2728330] INFO -- : make[1]: Leaving directory '/tmp/ruby/build/trunk' I, [2024-05-04T15:59:47.890288 #2728330] INFO -- : make[1]: Leaving directory '/tmp/ruby/build/trunk' I, [2024-05-04T15:59:47.890821 #2728330] INFO -- : generating makefile exts.mk I, [2024-05-04T15:59:47.928283 #2728330] INFO -- : exts.mk unchanged I, [2024-05-04T15:59:47.933221 #2728330] INFO -- : make[1]: Entering directory '/tmp/ruby/build/trunk' I, [2024-05-04T15:59:47.954428 #2728330] INFO -- : make[2]: Entering directory '/tmp/ruby/build/trunk/ext/json' I, [2024-05-04T15:59:47.954563 #2728330] INFO -- : make[2]: Entering directory '/tmp/ruby/build/trunk/ext/digest' I, [2024-05-04T15:59:47.956140 #2728330] INFO -- : make[2]: Entering directory '/tmp/ruby/build/trunk/ext/io/console' I, [2024-05-04T15:59:47.956211 #2728330] INFO -- : make[2]: Entering directory '/tmp/ruby/build/trunk/ext/coverage' I, [2024-05-04T15:59:47.956300 #2728330] INFO -- : make[2]: Entering directory '/tmp/ruby/build/trunk/ext/monitor' I, [2024-05-04T15:59:47.956979 #2728330] INFO -- : make[2]: Entering directory '/tmp/ruby/build/trunk/ext/date' I, [2024-05-04T15:59:47.957091 #2728330] INFO -- : make[2]: Entering directory '/tmp/ruby/build/trunk/ext/pathname' I, [2024-05-04T15:59:47.958018 #2728330] INFO -- : make[2]: Entering directory '/tmp/ruby/build/trunk/ext/pty' I, [2024-05-04T15:59:47.958142 #2728330] INFO -- : make[2]: Entering directory '/tmp/ruby/build/trunk/ext/rubyvm' I, [2024-05-04T15:59:47.958205 #2728330] INFO -- : make[2]: Entering directory '/tmp/ruby/build/trunk/ext/objspace' I, [2024-05-04T15:59:47.958794 #2728330] INFO -- : make[2]: Entering directory '/tmp/ruby/build/trunk/ext/fiddle' I, [2024-05-04T15:59:47.958920 #2728330] INFO -- : make[2]: Leaving directory '/tmp/ruby/build/trunk/ext/monitor' I, [2024-05-04T15:59:47.958945 #2728330] INFO -- : make[2]: Entering directory '/tmp/ruby/build/trunk/ext/psych' I, [2024-05-04T15:59:47.959072 #2728330] INFO -- : make[2]: Leaving directory '/tmp/ruby/build/trunk/ext/io/console' I, [2024-05-04T15:59:47.959116 #2728330] INFO -- : make[2]: Leaving directory '/tmp/ruby/build/trunk/ext/coverage' I, [2024-05-04T15:59:47.959733 #2728330] INFO -- : make[2]: Leaving directory '/tmp/ruby/build/trunk/ext/pathname' I, [2024-05-04T15:59:47.960207 #2728330] INFO -- : make[2]: Leaving directory '/tmp/ruby/build/trunk/ext/date' I, [2024-05-04T15:59:47.960319 #2728330] INFO -- : make[2]: Leaving directory '/tmp/ruby/build/trunk/ext/rubyvm' I, [2024-05-04T15:59:47.960538 #2728330] INFO -- : make[2]: Leaving directory '/tmp/ruby/build/trunk/ext/pty' I, [2024-05-04T15:59:47.961080 #2728330] INFO -- : make[2]: Leaving directory '/tmp/ruby/build/trunk/ext/objspace' I, [2024-05-04T15:59:47.962385 #2728330] INFO -- : make[2]: Entering directory '/tmp/ruby/build/trunk/ext/ripper' I, [2024-05-04T15:59:47.963542 #2728330] INFO -- : make[2]: Leaving directory '/tmp/ruby/build/trunk/ext/json' I, [2024-05-04T15:59:47.964025 #2728330] INFO -- : make[2]: Entering directory '/tmp/ruby/build/trunk/.bundle/gems/bigdecimal-3.1.7/ext/bigdecimal' I, [2024-05-04T15:59:47.964093 #2728330] INFO -- : make[2]: Entering directory '/tmp/ruby/build/trunk/.bundle/gems/debug-1.9.2/ext/debug' I, [2024-05-04T15:59:47.964132 #2728330] INFO -- : make[2]: Entering directory '/tmp/ruby/build/trunk/.bundle/gems/nkf-0.2.0/ext/nkf' I, [2024-05-04T15:59:47.964326 #2728330] INFO -- : make[2]: Entering directory '/tmp/ruby/build/trunk/.bundle/gems/syslog-0.1.2/ext/syslog' I, [2024-05-04T15:59:47.964651 #2728330] INFO -- : make[2]: Entering directory '/tmp/ruby/build/trunk/.bundle/gems/rbs-3.4.4/ext/rbs_extension' I, [2024-05-04T15:59:47.965274 #2728330] INFO -- : make[2]: Entering directory '/tmp/ruby/build/trunk/.bundle/gems/racc-1.7.3/ext/racc/cparse' I, [2024-05-04T15:59:47.965421 #2728330] INFO -- : make[2]: Leaving directory '/tmp/ruby/build/trunk/ext/fiddle' I, [2024-05-04T15:59:47.965608 #2728330] INFO -- : make[2]: Leaving directory '/tmp/ruby/build/trunk/ext/digest' I, [2024-05-04T15:59:47.967263 #2728330] INFO -- : make[2]: Leaving directory '/tmp/ruby/build/trunk/ext/ripper' I, [2024-05-04T15:59:47.968609 #2728330] INFO -- : make[2]: Leaving directory '/tmp/ruby/build/trunk/ext/psych' I, [2024-05-04T15:59:47.969166 #2728330] INFO -- : make[2]: Entering directory '/tmp/ruby/build/trunk/ext/socket' I, [2024-05-04T15:59:47.970685 #2728330] INFO -- : make[2]: Entering directory '/tmp/ruby/build/trunk/ext/openssl' I, [2024-05-04T15:59:47.972271 #2728330] INFO -- : make[2]: Entering directory '/tmp/ruby/build/trunk/ext/digest/sha2' I, [2024-05-04T15:59:47.974367 #2728330] INFO -- : make[2]: Leaving directory '/tmp/ruby/build/trunk/ext/digest/sha2' I, [2024-05-04T15:59:47.975171 #2728330] INFO -- : make[2]: Leaving directory '/tmp/ruby/build/trunk/ext/socket' I, [2024-05-04T15:59:47.981999 #2728330] INFO -- : make[2]: Leaving directory '/tmp/ruby/build/trunk/ext/openssl' I, [2024-05-04T15:59:47.987248 #2728330] INFO -- : make[2]: Leaving directory '/tmp/ruby/build/trunk/.bundle/gems/rbs-3.4.4/ext/rbs_extension' I, [2024-05-04T15:59:47.989321 #2728330] INFO -- : make[2]: Leaving directory '/tmp/ruby/build/trunk/.bundle/gems/racc-1.7.3/ext/racc/cparse' I, [2024-05-04T15:59:47.992881 #2728330] INFO -- : make[2]: Leaving directory '/tmp/ruby/build/trunk/.bundle/gems/nkf-0.2.0/ext/nkf' I, [2024-05-04T15:59:47.996037 #2728330] INFO -- : make[2]: Leaving directory '/tmp/ruby/build/trunk/.bundle/gems/bigdecimal-3.1.7/ext/bigdecimal' I, [2024-05-04T15:59:47.999348 #2728330] INFO -- : make[2]: Leaving directory '/tmp/ruby/build/trunk/.bundle/gems/syslog-0.1.2/ext/syslog' I, [2024-05-04T15:59:47.999703 #2728330] INFO -- : make[2]: Leaving directory '/tmp/ruby/build/trunk/.bundle/gems/debug-1.9.2/ext/debug' I, [2024-05-04T15:59:48.023193 #2728330] INFO -- : make[2]: Entering directory '/tmp/ruby/build/trunk' I, [2024-05-04T15:59:48.087646 #2728330] INFO -- : make[2]: 'ruby' is up to date. I, [2024-05-04T15:59:48.087682 #2728330] INFO -- : make[2]: Leaving directory '/tmp/ruby/build/trunk' I, [2024-05-04T15:59:48.088099 #2728330] INFO -- : make[1]: Leaving directory '/tmp/ruby/build/trunk' I, [2024-05-04T15:59:48.091773 #2728330] INFO -- : make[1]: Entering directory '/tmp/ruby/build/trunk' I, [2024-05-04T15:59:48.091810 #2728330] INFO -- : make[1]: Nothing to be done for 'note'. I, [2024-05-04T15:59:48.091825 #2728330] INFO -- : make[1]: Leaving directory '/tmp/ruby/build/trunk' I, [2024-05-04T15:59:48.092026 #2728330] INFO -- : ./miniruby -I/tmp/ruby/src/trunk/lib -I. -I.ext/common /tmp/ruby/src/trunk/tool/runruby.rb --extout=.ext -- --disable-gems -r./x86_64-linux-fake /tmp/ruby/src/trunk/tool/rbinstall.rb --make="make" --dest-dir="" --extout=".ext" --ext-build-dir="./ext" --mflags="-j20 --jobserver-auth=4,5" --make-flags=" -j20 --jobserver-auth=4,5" --data-mode=0644 --prog-mode=0755 --installed-list .installed.list --mantype="doc" --gnumake --install=all --exclude=doc I, [2024-05-04T15:59:48.187183 #2728330] INFO -- : Installing to I, [2024-05-04T15:59:48.187265 #2728330] INFO -- : installing binary commands: /tmp/ruby/install/trunk/bin I, [2024-05-04T15:59:48.187280 #2728330] INFO -- : installing base libraries: /tmp/ruby/install/trunk/lib I, [2024-05-04T15:59:48.194772 #2728330] INFO -- : installing arch files: /tmp/ruby/install/trunk/lib/ruby/3.4.0+0/x86_64-linux I, [2024-05-04T15:59:48.194833 #2728330] INFO -- : installing pkgconfig data: /tmp/ruby/install/trunk/lib/pkgconfig I, [2024-05-04T15:59:48.194847 #2728330] INFO -- : installing extension objects: /tmp/ruby/install/trunk/lib/ruby/3.4.0+0/x86_64-linux I, [2024-05-04T15:59:48.204427 #2728330] INFO -- : installing extension objects: /tmp/ruby/install/trunk/lib/ruby/site_ruby/3.4.0+0/x86_64-linux I, [2024-05-04T15:59:48.204498 #2728330] INFO -- : installing extension objects: /tmp/ruby/install/trunk/lib/ruby/vendor_ruby/3.4.0+0/x86_64-linux I, [2024-05-04T15:59:48.204514 #2728330] INFO -- : installing extension headers: /tmp/ruby/install/trunk/include/ruby-3.4.0+0/x86_64-linux I, [2024-05-04T15:59:48.204540 #2728330] INFO -- : installing extension scripts: /tmp/ruby/install/trunk/lib/ruby/3.4.0+0 I, [2024-05-04T15:59:48.208359 #2728330] INFO -- : installing extension scripts: /tmp/ruby/install/trunk/lib/ruby/site_ruby/3.4.0+0 I, [2024-05-04T15:59:48.208418 #2728330] INFO -- : installing extension scripts: /tmp/ruby/install/trunk/lib/ruby/vendor_ruby/3.4.0+0 I, [2024-05-04T15:59:48.208437 #2728330] INFO -- : installing extension headers: /tmp/ruby/install/trunk/include/ruby-3.4.0+0/ruby I, [2024-05-04T15:59:48.208449 #2728330] INFO -- : installing command scripts: /tmp/ruby/install/trunk/bin I, [2024-05-04T15:59:48.208461 #2728330] INFO -- : installing library scripts: /tmp/ruby/install/trunk/lib/ruby/3.4.0+0 I, [2024-05-04T15:59:48.242754 #2728330] INFO -- : installing common headers: /tmp/ruby/install/trunk/include/ruby-3.4.0+0 I, [2024-05-04T15:59:48.248203 #2728330] INFO -- : installing manpages: /tmp/ruby/install/trunk/share/man/man1 I, [2024-05-04T15:59:48.248300 #2728330] INFO -- : installing default gems from lib: /tmp/ruby/install/trunk/lib/ruby/gems/3.4.0+0 I, [2024-05-04T15:59:48.271162 #2728330] INFO -- : benchmark 0.3.0 I, [2024-05-04T15:59:48.277990 #2728330] INFO -- : bundler 2.6.0.dev I, [2024-05-04T15:59:48.280087 #2728330] INFO -- : cgi 0.4.1 I, [2024-05-04T15:59:48.280645 #2728330] INFO -- : delegate 0.3.1 I, [2024-05-04T15:59:48.281130 #2728330] INFO -- : did_you_mean 1.6.3 I, [2024-05-04T15:59:48.281627 #2728330] INFO -- : english 0.8.0 I, [2024-05-04T15:59:48.282103 #2728330] INFO -- : erb 4.0.4 I, [2024-05-04T15:59:48.282812 #2728330] INFO -- : error_highlight 0.6.0 I, [2024-05-04T15:59:48.283295 #2728330] INFO -- : fileutils 1.7.2 I, [2024-05-04T15:59:48.283770 #2728330] INFO -- : find 0.2.0 I, [2024-05-04T15:59:48.284178 #2728330] INFO -- : forwardable 1.3.3 I, [2024-05-04T15:59:48.284745 #2728330] INFO -- : ipaddr 1.2.6 I, [2024-05-04T15:59:48.285202 #2728330] INFO -- : irb 1.13.0 I, [2024-05-04T15:59:48.286631 #2728330] INFO -- : logger 1.6.0 I, [2024-05-04T15:59:48.287132 #2728330] INFO -- : net-http 0.4.1 I, [2024-05-04T15:59:48.287648 #2728330] INFO -- : net-protocol 0.2.2 I, [2024-05-04T15:59:48.288135 #2728330] INFO -- : open-uri 0.4.1 I, [2024-05-04T15:59:48.288671 #2728330] INFO -- : open3 0.2.1 I, [2024-05-04T15:59:48.289152 #2728330] INFO -- : optparse 0.5.0 I, [2024-05-04T15:59:48.289646 #2728330] INFO -- : ostruct 0.6.0 I, [2024-05-04T15:59:48.290115 #2728330] INFO -- : pp 0.5.0 I, [2024-05-04T15:59:48.290538 #2728330] INFO -- : prettyprint 0.2.0 I, [2024-05-04T15:59:48.290996 #2728330] INFO -- : prism 0.27.0 I, [2024-05-04T15:59:48.291482 #2728330] INFO -- : pstore 0.1.3 I, [2024-05-04T15:59:48.291939 #2728330] INFO -- : rdoc 6.6.3.1 I, [2024-05-04T15:59:48.293626 #2728330] INFO -- : readline 0.0.4 I, [2024-05-04T15:59:48.294146 #2728330] INFO -- : reline 0.5.5 I, [2024-05-04T15:59:48.294682 #2728330] INFO -- : resolv 0.4.0 I, [2024-05-04T15:59:48.295181 #2728330] INFO -- : ruby2_keywords 0.0.5 I, [2024-05-04T15:59:48.295619 #2728330] INFO -- : securerandom 0.3.1 I, [2024-05-04T15:59:48.296104 #2728330] INFO -- : set 1.1.0 I, [2024-05-04T15:59:48.296638 #2728330] INFO -- : shellwords 0.2.0 I, [2024-05-04T15:59:48.297109 #2728330] INFO -- : singleton 0.2.0 I, [2024-05-04T15:59:48.297556 #2728330] INFO -- : syntax_suggest 2.0.0 I, [2024-05-04T15:59:48.298254 #2728330] INFO -- : tempfile 0.2.1 I, [2024-05-04T15:59:48.298742 #2728330] INFO -- : time 0.3.0 I, [2024-05-04T15:59:48.299228 #2728330] INFO -- : timeout 0.4.1 I, [2024-05-04T15:59:48.300232 #2728330] INFO -- : tmpdir 0.2.0 I, [2024-05-04T15:59:48.300845 #2728330] INFO -- : tsort 0.2.0 I, [2024-05-04T15:59:48.301264 #2728330] INFO -- : un 0.3.0 I, [2024-05-04T15:59:48.301731 #2728330] INFO -- : uri 0.13.0 I, [2024-05-04T15:59:48.302374 #2728330] INFO -- : weakref 0.1.3 I, [2024-05-04T15:59:48.302966 #2728330] INFO -- : yaml 0.3.0 I, [2024-05-04T15:59:48.303260 #2728330] INFO -- : installing default gems from ext: /tmp/ruby/install/trunk/lib/ruby/gems/3.4.0+0 I, [2024-05-04T15:59:48.310144 #2728330] INFO -- : date 3.3.4 I, [2024-05-04T15:59:48.310668 #2728330] INFO -- : digest 3.1.1 I, [2024-05-04T15:59:48.311140 #2728330] INFO -- : etc 1.4.3 I, [2024-05-04T15:59:48.311656 #2728330] INFO -- : fcntl 1.1.0 I, [2024-05-04T15:59:48.312114 #2728330] INFO -- : fiddle 1.1.3 I, [2024-05-04T15:59:48.312641 #2728330] INFO -- : io-console 0.7.2 I, [2024-05-04T15:59:48.313111 #2728330] INFO -- : io-nonblock 0.3.0 I, [2024-05-04T15:59:48.313471 #2728330] INFO -- : io-wait 0.3.1 I, [2024-05-04T15:59:48.314159 #2728330] INFO -- : json 2.7.2 I, [2024-05-04T15:59:48.315051 #2728330] INFO -- : openssl 3.2.0 I, [2024-05-04T15:59:48.315752 #2728330] INFO -- : pathname 0.3.0 I, [2024-05-04T15:59:48.316239 #2728330] INFO -- : psych 5.1.2 I, [2024-05-04T15:59:48.316846 #2728330] INFO -- : stringio 3.1.1 I, [2024-05-04T15:59:48.317355 #2728330] INFO -- : strscan 3.1.1 I, [2024-05-04T15:59:48.317826 #2728330] INFO -- : zlib 3.1.0 I, [2024-05-04T15:59:48.318231 #2728330] INFO -- : installing bundled gems: /tmp/ruby/install/trunk/lib/ruby/gems/3.4.0+0 I, [2024-05-04T15:59:48.318508 #2728330] INFO -- : minitest 5.22.3 I, [2024-05-04T15:59:48.326040 #2728330] INFO -- : rake 13.2.1 I, [2024-05-04T15:59:48.329476 #2728330] INFO -- : test-unit 3.6.2 I, [2024-05-04T15:59:48.334104 #2728330] INFO -- : rexml 3.2.6 I, [2024-05-04T15:59:48.337478 #2728330] INFO -- : rss 0.3.0 I, [2024-05-04T15:59:48.340507 #2728330] INFO -- : net-ftp 0.3.4 I, [2024-05-04T15:59:48.342046 #2728330] INFO -- : net-imap 0.4.10 I, [2024-05-04T15:59:48.345036 #2728330] INFO -- : net-pop 0.1.2 I, [2024-05-04T15:59:48.345950 #2728330] INFO -- : net-smtp 0.5.0 I, [2024-05-04T15:59:48.347017 #2728330] INFO -- : matrix 0.4.2 I, [2024-05-04T15:59:48.350708 #2728330] INFO -- : prime 0.1.2 I, [2024-05-04T15:59:48.356028 #2728330] INFO -- : rbs 3.4.4 I, [2024-05-04T15:59:48.378821 #2728330] INFO -- : typeprof 0.21.11 I, [2024-05-04T15:59:48.381882 #2728330] INFO -- : debug 1.9.2 I, [2024-05-04T15:59:48.384542 #2728330] INFO -- : racc 1.7.3 I, [2024-05-04T15:59:48.387055 #2728330] INFO -- : mutex_m 0.2.0 I, [2024-05-04T15:59:48.388194 #2728330] INFO -- : getoptlong 0.2.1 I, [2024-05-04T15:59:48.389750 #2728330] INFO -- : base64 0.2.0 I, [2024-05-04T15:59:48.390728 #2728330] INFO -- : bigdecimal 3.1.7 I, [2024-05-04T15:59:48.392839 #2728330] INFO -- : observer 0.1.2 I, [2024-05-04T15:59:48.394328 #2728330] INFO -- : abbrev 0.1.2 I, [2024-05-04T15:59:48.395335 #2728330] INFO -- : resolv-replace 0.1.1 I, [2024-05-04T15:59:48.396921 #2728330] INFO -- : rinda 0.2.0 I, [2024-05-04T15:59:48.398090 #2728330] INFO -- : drb 2.2.1 I, [2024-05-04T15:59:48.399668 #2728330] INFO -- : nkf 0.2.0 I, [2024-05-04T15:59:48.402057 #2728330] INFO -- : syslog 0.1.2 I, [2024-05-04T15:59:48.403626 #2728330] INFO -- : csv 3.3.0 I, [2024-05-04T15:59:48.405898 #2728330] INFO -- : installing bundled gem cache: /tmp/ruby/install/trunk/lib/ruby/gems/3.4.0+0/cache I, [2024-05-04T15:59:48.407416 #2728330] INFO -- : skipped bundled gems: I, [2024-05-04T15:59:48.407437 #2728330] INFO -- : power_assert-2.0.4dev.gem not found in bundled_gems I, [2024-05-04T15:59:48.410541 #2728330] INFO -- : $$$[end] "make install -j20" exit with 0. I, [2024-05-04T15:59:48.410652 #2728330] INFO -- : $$$[beg] make yes-btest TESTOPTS='-q -j20' I, [2024-05-04T15:59:54.726054 #2728330] INFO -- : PASS all 1935 tests E, [2024-05-04T15:59:54.731284 #2728330] ERROR -- : I, [2024-05-04T15:59:54.731509 #2728330] INFO -- : $$$[end] "make yes-btest TESTOPTS='-q -j20'" exit with 0. I, [2024-05-04T15:59:54.731607 #2728330] INFO -- : $$$[beg] make yes-test-basic TESTS='-j20' I, [2024-05-04T15:59:54.792791 #2728330] INFO -- : BASERUBY = /usr/bin/ruby --disable=gems I, [2024-05-04T15:59:54.792818 #2728330] INFO -- : CC = gcc I, [2024-05-04T15:59:54.792824 #2728330] INFO -- : LD = ld I, [2024-05-04T15:59:54.792828 #2728330] INFO -- : LDSHARED = gcc -shared I, [2024-05-04T15:59:54.792832 #2728330] INFO -- : CFLAGS = -O3 -fno-fast-math -ggdb3 -Wall -Wextra -Wdeprecated-declarations -Wdiv-by-zero -Wduplicated-cond -Wimplicit-function-declaration -Wimplicit-int -Wpointer-arith -Wwrite-strings -Wold-style-definition -Wimplicit-fallthrough=0 -Wmissing-noreturn -Wno-cast-function-type -Wno-constant-logical-operand -Wno-long-long -Wno-missing-field-initializers -Wno-overlength-strings -Wno-packed-bitfield-compat -Wno-parentheses-equality -Wno-self-assign -Wno-tautological-compare -Wno-unused-parameter -Wno-unused-value -Wsuggest-attribute=format -Wsuggest-attribute=noreturn -Wunused-variable -Wmisleading-indentation -Wundef -fPIC I, [2024-05-04T15:59:54.792837 #2728330] INFO -- : XCFLAGS = -U_FORTIFY_SOURCE -D_FORTIFY_SOURCE=2 -fstack-protector-strong -fno-strict-overflow -fvisibility=hidden -fexcess-precision=standard -DRUBY_EXPORT -I. -I.ext/include/x86_64-linux -I/tmp/ruby/src/trunk/include -I/tmp/ruby/src/trunk -I/tmp/ruby/src/trunk/prism -I/tmp/ruby/src/trunk/enc/unicode/15.0.0 I, [2024-05-04T15:59:54.792849 #2728330] INFO -- : CPPFLAGS = I, [2024-05-04T15:59:54.792853 #2728330] INFO -- : DLDFLAGS = -Wl,--compress-debug-sections=zlib -Wl,-soname,libruby.so.3.4 -fstack-protector-strong I, [2024-05-04T15:59:54.792857 #2728330] INFO -- : SOLIBS = -lz -lrt -lrt -lgmp -ldl -lcrypt -lm -lpthread I, [2024-05-04T15:59:54.792860 #2728330] INFO -- : LANG = en_US.UTF-8 I, [2024-05-04T15:59:54.792863 #2728330] INFO -- : LC_ALL = I, [2024-05-04T15:59:54.792867 #2728330] INFO -- : LC_CTYPE = I, [2024-05-04T15:59:54.792870 #2728330] INFO -- : MFLAGS = I, [2024-05-04T15:59:54.792874 #2728330] INFO -- : RUSTC = no I, [2024-05-04T15:59:54.792877 #2728330] INFO -- : YJIT_RUSTC_ARGS = --crate-name=yjit --crate-type=staticlib --edition=2021 -g -C lto=thin -C opt-level=3 -C overflow-checks=on '--out-dir=/tmp/ruby/build/trunk/yjit/target/release/' /tmp/ruby/src/trunk/yjit/src/lib.rs I, [2024-05-04T15:59:54.793563 #2728330] INFO -- : gcc (Ubuntu 11.4.0-1ubuntu1~22.04) 11.4.0 I, [2024-05-04T15:59:54.793584 #2728330] INFO -- : Copyright (C) 2021 Free Software Foundation, Inc. I, [2024-05-04T15:59:54.793589 #2728330] INFO -- : This is free software; see the source for copying conditions. There is NO I, [2024-05-04T15:59:54.793593 #2728330] INFO -- : warranty; not even for MERCHANTABILITY or FITNESS FOR A PARTICULAR PURPOSE. I, [2024-05-04T15:59:54.793603 #2728330] INFO -- : I, [2024-05-04T15:59:54.899725 #2728330] INFO -- : Checking leaked global symbols...none I, [2024-05-04T15:59:54.941709 #2728330] INFO -- : /tmp/ruby/src/trunk/basictest/test.rb:assignment ....................................................................................................................................................................................................................................................................................................................................................................................OK 372 I, [2024-05-04T15:59:54.941764 #2728330] INFO -- : /tmp/ruby/src/trunk/basictest/test.rb:condition ..OK 2 I, [2024-05-04T15:59:54.941771 #2728330] INFO -- : /tmp/ruby/src/trunk/basictest/test.rb:if/unless ...OK 3 I, [2024-05-04T15:59:54.941774 #2728330] INFO -- : /tmp/ruby/src/trunk/basictest/test.rb:case .....OK 5 I, [2024-05-04T15:59:54.941989 #2728330] INFO -- : /tmp/ruby/src/trunk/basictest/test.rb:while/until ........OK 8 I, [2024-05-04T15:59:54.942041 #2728330] INFO -- : /tmp/ruby/src/trunk/basictest/test.rb:exception ..........OK 10 I, [2024-05-04T15:59:54.942311 #2728330] INFO -- : /tmp/ruby/src/trunk/basictest/test.rb:array .......................................OK 39 I, [2024-05-04T15:59:54.942413 #2728330] INFO -- : /tmp/ruby/src/trunk/basictest/test.rb:hash ...........................OK 27 I, [2024-05-04T15:59:54.943131 #2728330] INFO -- : /tmp/ruby/src/trunk/basictest/test.rb:iterator ...........................................................................................................OK 107 I, [2024-05-04T15:59:54.943412 #2728330] INFO -- : /tmp/ruby/src/trunk/basictest/test.rb:float ................................................................................OK 80 I, [2024-05-04T15:59:54.944487 #2728330] INFO -- : /tmp/ruby/src/trunk/basictest/test.rb:bignum ...............................OK 31 I, [2024-05-04T15:59:54.945297 #2728330] INFO -- : /tmp/ruby/src/trunk/basictest/test.rb:string & char ..............................................................OK 62 I, [2024-05-04T15:59:54.945322 #2728330] INFO -- : /tmp/ruby/src/trunk/basictest/test.rb:assignment ..........OK 10 I, [2024-05-04T15:59:54.945353 #2728330] INFO -- : /tmp/ruby/src/trunk/basictest/test.rb:call ......OK 6 I, [2024-05-04T15:59:54.945410 #2728330] INFO -- : /tmp/ruby/src/trunk/basictest/test.rb:proc .........OK 9 I, [2024-05-04T15:59:55.045703 #2728330] INFO -- : /tmp/ruby/src/trunk/basictest/test.rb:signal ..OK 2 I, [2024-05-04T15:59:55.046175 #2728330] INFO -- : /tmp/ruby/src/trunk/basictest/test.rb:eval ...........................OK 27 I, [2024-05-04T15:59:55.147463 #2728330] INFO -- : /tmp/ruby/src/trunk/basictest/test.rb:system ........OK 8 I, [2024-05-04T15:59:55.147523 #2728330] INFO -- : /tmp/ruby/src/trunk/basictest/test.rb:const .....OK 5 I, [2024-05-04T15:59:55.147537 #2728330] INFO -- : /tmp/ruby/src/trunk/basictest/test.rb:clone .....OK 5 I, [2024-05-04T15:59:55.147591 #2728330] INFO -- : /tmp/ruby/src/trunk/basictest/test.rb:marshal ....OK 4 I, [2024-05-04T15:59:55.147645 #2728330] INFO -- : /tmp/ruby/src/trunk/basictest/test.rb:pack ....OK 4 I, [2024-05-04T15:59:55.147665 #2728330] INFO -- : /tmp/ruby/src/trunk/basictest/test.rb:math ..OK 2 I, [2024-05-04T15:59:55.147712 #2728330] INFO -- : /tmp/ruby/src/trunk/basictest/test.rb:struct ......OK 6 I, [2024-05-04T15:59:55.147804 #2728330] INFO -- : /tmp/ruby/src/trunk/basictest/test.rb:variable ............OK 12 I, [2024-05-04T15:59:55.147828 #2728330] INFO -- : /tmp/ruby/src/trunk/basictest/test.rb:trace ...OK 3 I, [2024-05-04T15:59:55.147886 #2728330] INFO -- : /tmp/ruby/src/trunk/basictest/test.rb:defined? ............OK 12 I, [2024-05-04T15:59:55.147933 #2728330] INFO -- : /tmp/ruby/src/trunk/basictest/test.rb:alias ......OK 6 I, [2024-05-04T15:59:55.148333 #2728330] INFO -- : /tmp/ruby/src/trunk/basictest/test.rb:path .......................OK 23 I, [2024-05-04T15:59:55.181812 #2728330] INFO -- : /tmp/ruby/src/trunk/basictest/test.rb:gc ....OK 4 I, [2024-05-04T15:59:55.184211 #2728330] INFO -- : I, [2024-05-04T15:59:55.184251 #2728330] INFO -- : test succeeded I, [2024-05-04T15:59:55.185861 #2728330] INFO -- : $$$[end] "make yes-test-basic TESTS='-j20'" exit with 0. I, [2024-05-04T15:59:55.185956 #2728330] INFO -- : $$$[beg] make yes-test-all TESTOPTS='--stderr-on-failure' TESTS='-j20' I, [2024-05-04T15:59:55.272527 #2728330] INFO -- : BASERUBY = /usr/bin/ruby --disable=gems I, [2024-05-04T15:59:55.272578 #2728330] INFO -- : CC = gcc I, [2024-05-04T15:59:55.272591 #2728330] INFO -- : LD = ld I, [2024-05-04T15:59:55.272601 #2728330] INFO -- : LDSHARED = gcc -shared I, [2024-05-04T15:59:55.272612 #2728330] INFO -- : CFLAGS = -O3 -fno-fast-math -ggdb3 -Wall -Wextra -Wdeprecated-declarations -Wdiv-by-zero -Wduplicated-cond -Wimplicit-function-declaration -Wimplicit-int -Wpointer-arith -Wwrite-strings -Wold-style-definition -Wimplicit-fallthrough=0 -Wmissing-noreturn -Wno-cast-function-type -Wno-constant-logical-operand -Wno-long-long -Wno-missing-field-initializers -Wno-overlength-strings -Wno-packed-bitfield-compat -Wno-parentheses-equality -Wno-self-assign -Wno-tautological-compare -Wno-unused-parameter -Wno-unused-value -Wsuggest-attribute=format -Wsuggest-attribute=noreturn -Wunused-variable -Wmisleading-indentation -Wundef -fPIC I, [2024-05-04T15:59:55.272623 #2728330] INFO -- : XCFLAGS = -U_FORTIFY_SOURCE -D_FORTIFY_SOURCE=2 -fstack-protector-strong -fno-strict-overflow -fvisibility=hidden -fexcess-precision=standard -DRUBY_EXPORT -I. -I.ext/include/x86_64-linux -I/tmp/ruby/src/trunk/include -I/tmp/ruby/src/trunk -I/tmp/ruby/src/trunk/prism -I/tmp/ruby/src/trunk/enc/unicode/15.0.0 I, [2024-05-04T15:59:55.272634 #2728330] INFO -- : CPPFLAGS = I, [2024-05-04T15:59:55.272645 #2728330] INFO -- : DLDFLAGS = -Wl,--compress-debug-sections=zlib -Wl,-soname,libruby.so.3.4 -fstack-protector-strong I, [2024-05-04T15:59:55.272656 #2728330] INFO -- : SOLIBS = -lz -lrt -lrt -lgmp -ldl -lcrypt -lm -lpthread I, [2024-05-04T15:59:55.272666 #2728330] INFO -- : LANG = en_US.UTF-8 I, [2024-05-04T15:59:55.272677 #2728330] INFO -- : LC_ALL = I, [2024-05-04T15:59:55.272687 #2728330] INFO -- : LC_CTYPE = I, [2024-05-04T15:59:55.272697 #2728330] INFO -- : MFLAGS = I, [2024-05-04T15:59:55.272708 #2728330] INFO -- : RUSTC = no I, [2024-05-04T15:59:55.272722 #2728330] INFO -- : YJIT_RUSTC_ARGS = --crate-name=yjit --crate-type=staticlib --edition=2021 -g -C lto=thin -C opt-level=3 -C overflow-checks=on '--out-dir=/tmp/ruby/build/trunk/yjit/target/release/' /tmp/ruby/src/trunk/yjit/src/lib.rs I, [2024-05-04T15:59:55.273112 #2728330] INFO -- : gcc (Ubuntu 11.4.0-1ubuntu1~22.04) 11.4.0 I, [2024-05-04T15:59:55.273161 #2728330] INFO -- : Copyright (C) 2021 Free Software Foundation, Inc. I, [2024-05-04T15:59:55.273175 #2728330] INFO -- : This is free software; see the source for copying conditions. There is NO I, [2024-05-04T15:59:55.273186 #2728330] INFO -- : warranty; not even for MERCHANTABILITY or FITNESS FOR A PARTICULAR PURPOSE. I, [2024-05-04T15:59:55.273196 #2728330] INFO -- : I, [2024-05-04T15:59:55.274836 #2728330] INFO -- : generating enc.mk I, [2024-05-04T15:59:55.394364 #2728330] INFO -- : making enc I, [2024-05-04T15:59:55.411499 #2728330] INFO -- : make[1]: Entering directory '/tmp/ruby/build/trunk' I, [2024-05-04T15:59:55.411553 #2728330] INFO -- : make[1]: Nothing to be done for 'enc'. I, [2024-05-04T15:59:55.411566 #2728330] INFO -- : make[1]: Leaving directory '/tmp/ruby/build/trunk' I, [2024-05-04T15:59:55.412269 #2728330] INFO -- : making srcs under enc I, [2024-05-04T15:59:55.441643 #2728330] INFO -- : make[1]: Entering directory '/tmp/ruby/build/trunk' I, [2024-05-04T15:59:55.441707 #2728330] INFO -- : make[1]: Nothing to be done for 'srcs'. I, [2024-05-04T15:59:55.441721 #2728330] INFO -- : make[1]: Leaving directory '/tmp/ruby/build/trunk' I, [2024-05-04T15:59:55.442521 #2728330] INFO -- : generating transdb.h I, [2024-05-04T15:59:55.537566 #2728330] INFO -- : transdb.h unchanged I, [2024-05-04T15:59:55.538918 #2728330] INFO -- : making trans I, [2024-05-04T15:59:55.573185 #2728330] INFO -- : make[1]: Entering directory '/tmp/ruby/build/trunk' I, [2024-05-04T15:59:55.573247 #2728330] INFO -- : make[1]: Nothing to be done for 'trans'. I, [2024-05-04T15:59:55.573261 #2728330] INFO -- : make[1]: Leaving directory '/tmp/ruby/build/trunk' I, [2024-05-04T15:59:55.573881 #2728330] INFO -- : making encs I, [2024-05-04T15:59:55.611101 #2728330] INFO -- : make[1]: Entering directory '/tmp/ruby/build/trunk' I, [2024-05-04T15:59:55.611164 #2728330] INFO -- : make[1]: Nothing to be done for 'encs'. I, [2024-05-04T15:59:55.611177 #2728330] INFO -- : make[1]: Leaving directory '/tmp/ruby/build/trunk' I, [2024-05-04T15:59:55.612898 #2728330] INFO -- : generating makefiles ext/configure-ext.mk I, [2024-05-04T15:59:55.640249 #2728330] INFO -- : ext/configure-ext.mk updated I, [2024-05-04T15:59:55.642523 #2728330] INFO -- : make[1]: Entering directory '/tmp/ruby/build/trunk' I, [2024-05-04T15:59:56.994955 #2728330] INFO -- : make[1]: Leaving directory '/tmp/ruby/build/trunk' I, [2024-05-04T15:59:56.995480 #2728330] INFO -- : generating makefile exts.mk I, [2024-05-04T15:59:57.032344 #2728330] INFO -- : exts.mk unchanged I, [2024-05-04T15:59:57.036499 #2728330] INFO -- : make[1]: Entering directory '/tmp/ruby/build/trunk' I, [2024-05-04T15:59:57.246336 #2728330] INFO -- : make[2]: Entering directory '/tmp/ruby/build/trunk/ext/coverage' I, [2024-05-04T15:59:57.249180 #2728330] INFO -- : make[2]: Leaving directory '/tmp/ruby/build/trunk/ext/coverage' I, [2024-05-04T15:59:57.252979 #2728330] INFO -- : make[2]: Entering directory '/tmp/ruby/build/trunk/ext/date' I, [2024-05-04T15:59:57.256020 #2728330] INFO -- : make[2]: Leaving directory '/tmp/ruby/build/trunk/ext/date' I, [2024-05-04T15:59:57.258363 #2728330] INFO -- : make[2]: Entering directory '/tmp/ruby/build/trunk/ext/digest' I, [2024-05-04T15:59:57.263728 #2728330] INFO -- : make[2]: Leaving directory '/tmp/ruby/build/trunk/ext/digest' I, [2024-05-04T15:59:57.279289 #2728330] INFO -- : make[2]: Entering directory '/tmp/ruby/build/trunk/ext/digest/sha2' I, [2024-05-04T15:59:57.282250 #2728330] INFO -- : make[2]: Leaving directory '/tmp/ruby/build/trunk/ext/digest/sha2' I, [2024-05-04T15:59:57.294863 #2728330] INFO -- : make[2]: Entering directory '/tmp/ruby/build/trunk/ext/fiddle' I, [2024-05-04T15:59:57.301326 #2728330] INFO -- : make[2]: Leaving directory '/tmp/ruby/build/trunk/ext/fiddle' I, [2024-05-04T15:59:57.304245 #2728330] INFO -- : make[2]: Entering directory '/tmp/ruby/build/trunk/ext/io/console' I, [2024-05-04T15:59:57.306885 #2728330] INFO -- : make[2]: Leaving directory '/tmp/ruby/build/trunk/ext/io/console' I, [2024-05-04T15:59:57.314568 #2728330] INFO -- : make[2]: Entering directory '/tmp/ruby/build/trunk/ext/json' I, [2024-05-04T15:59:57.320901 #2728330] INFO -- : make[2]: Leaving directory '/tmp/ruby/build/trunk/ext/json' I, [2024-05-04T15:59:57.329969 #2728330] INFO -- : make[2]: Entering directory '/tmp/ruby/build/trunk/ext/monitor' I, [2024-05-04T15:59:57.332404 #2728330] INFO -- : make[2]: Leaving directory '/tmp/ruby/build/trunk/ext/monitor' I, [2024-05-04T15:59:57.336764 #2728330] INFO -- : make[2]: Entering directory '/tmp/ruby/build/trunk/ext/objspace' I, [2024-05-04T15:59:57.340377 #2728330] INFO -- : make[2]: Leaving directory '/tmp/ruby/build/trunk/ext/objspace' I, [2024-05-04T15:59:57.352277 #2728330] INFO -- : make[2]: Entering directory '/tmp/ruby/build/trunk/ext/openssl' I, [2024-05-04T15:59:57.365279 #2728330] INFO -- : make[2]: Leaving directory '/tmp/ruby/build/trunk/ext/openssl' I, [2024-05-04T15:59:57.368206 #2728330] INFO -- : make[2]: Entering directory '/tmp/ruby/build/trunk/ext/pathname' I, [2024-05-04T15:59:57.370629 #2728330] INFO -- : make[2]: Leaving directory '/tmp/ruby/build/trunk/ext/pathname' I, [2024-05-04T15:59:57.374798 #2728330] INFO -- : make[2]: Entering directory '/tmp/ruby/build/trunk/ext/psych' I, [2024-05-04T15:59:57.389580 #2728330] INFO -- : make[2]: Leaving directory '/tmp/ruby/build/trunk/ext/psych' I, [2024-05-04T15:59:57.392630 #2728330] INFO -- : make[2]: Entering directory '/tmp/ruby/build/trunk/ext/pty' I, [2024-05-04T15:59:57.395165 #2728330] INFO -- : make[2]: Leaving directory '/tmp/ruby/build/trunk/ext/pty' I, [2024-05-04T15:59:57.404660 #2728330] INFO -- : make[2]: Entering directory '/tmp/ruby/build/trunk/ext/ripper' I, [2024-05-04T15:59:57.409657 #2728330] INFO -- : make[2]: Leaving directory '/tmp/ruby/build/trunk/ext/ripper' I, [2024-05-04T15:59:57.411181 #2728330] INFO -- : make[2]: Entering directory '/tmp/ruby/build/trunk/ext/rubyvm' I, [2024-05-04T15:59:57.413225 #2728330] INFO -- : make[2]: Leaving directory '/tmp/ruby/build/trunk/ext/rubyvm' I, [2024-05-04T15:59:57.421124 #2728330] INFO -- : make[2]: Entering directory '/tmp/ruby/build/trunk/ext/socket' I, [2024-05-04T15:59:57.427642 #2728330] INFO -- : make[2]: Leaving directory '/tmp/ruby/build/trunk/ext/socket' I, [2024-05-04T15:59:57.438617 #2728330] INFO -- : make[2]: Entering directory '/tmp/ruby/build/trunk/.bundle/gems/bigdecimal-3.1.7/ext/bigdecimal' I, [2024-05-04T15:59:57.461158 #2728330] INFO -- : make[2]: Leaving directory '/tmp/ruby/build/trunk/.bundle/gems/bigdecimal-3.1.7/ext/bigdecimal' I, [2024-05-04T15:59:57.463187 #2728330] INFO -- : make[2]: Entering directory '/tmp/ruby/build/trunk/.bundle/gems/debug-1.9.2/ext/debug' I, [2024-05-04T15:59:57.485207 #2728330] INFO -- : make[2]: Leaving directory '/tmp/ruby/build/trunk/.bundle/gems/debug-1.9.2/ext/debug' I, [2024-05-04T15:59:57.487085 #2728330] INFO -- : make[2]: Entering directory '/tmp/ruby/build/trunk/.bundle/gems/nkf-0.2.0/ext/nkf' I, [2024-05-04T15:59:57.508785 #2728330] INFO -- : make[2]: Leaving directory '/tmp/ruby/build/trunk/.bundle/gems/nkf-0.2.0/ext/nkf' I, [2024-05-04T15:59:57.510754 #2728330] INFO -- : make[2]: Entering directory '/tmp/ruby/build/trunk/.bundle/gems/racc-1.7.3/ext/racc/cparse' I, [2024-05-04T15:59:57.531932 #2728330] INFO -- : make[2]: Leaving directory '/tmp/ruby/build/trunk/.bundle/gems/racc-1.7.3/ext/racc/cparse' I, [2024-05-04T15:59:57.534088 #2728330] INFO -- : make[2]: Entering directory '/tmp/ruby/build/trunk/.bundle/gems/rbs-3.4.4/ext/rbs_extension' I, [2024-05-04T15:59:57.555663 #2728330] INFO -- : make[2]: Leaving directory '/tmp/ruby/build/trunk/.bundle/gems/rbs-3.4.4/ext/rbs_extension' I, [2024-05-04T15:59:57.557709 #2728330] INFO -- : make[2]: Entering directory '/tmp/ruby/build/trunk/.bundle/gems/syslog-0.1.2/ext/syslog' I, [2024-05-04T15:59:57.579320 #2728330] INFO -- : make[2]: Leaving directory '/tmp/ruby/build/trunk/.bundle/gems/syslog-0.1.2/ext/syslog' I, [2024-05-04T15:59:57.602555 #2728330] INFO -- : make[2]: Entering directory '/tmp/ruby/build/trunk' I, [2024-05-04T15:59:57.667402 #2728330] INFO -- : make[2]: 'ruby' is up to date. I, [2024-05-04T15:59:57.667445 #2728330] INFO -- : make[2]: Leaving directory '/tmp/ruby/build/trunk' I, [2024-05-04T15:59:57.667699 #2728330] INFO -- : make[1]: Leaving directory '/tmp/ruby/build/trunk' I, [2024-05-04T15:59:57.671224 #2728330] INFO -- : make[1]: Entering directory '/tmp/ruby/build/trunk' I, [2024-05-04T15:59:57.671250 #2728330] INFO -- : make[1]: Nothing to be done for 'note'. I, [2024-05-04T15:59:57.671256 #2728330] INFO -- : make[1]: Leaving directory '/tmp/ruby/build/trunk' I, [2024-05-04T15:59:57.747295 #2728330] INFO -- : Run options: I, [2024-05-04T15:59:57.747357 #2728330] INFO -- : --seed=49956 I, [2024-05-04T15:59:57.747364 #2728330] INFO -- : "--ruby=./miniruby -I/tmp/ruby/src/trunk/lib -I. -I.ext/common /tmp/ruby/src/trunk/tool/runruby.rb --extout=.ext -- --disable-gems" I, [2024-05-04T15:59:57.747369 #2728330] INFO -- : --excludes-dir=/tmp/ruby/src/trunk/test/.excludes I, [2024-05-04T15:59:57.747373 #2728330] INFO -- : --name=!/memory_leak/ I, [2024-05-04T15:59:57.747377 #2728330] INFO -- : --stderr-on-failure I, [2024-05-04T15:59:57.747381 #2728330] INFO -- : -j20 I, [2024-05-04T15:59:57.747385 #2728330] INFO -- : I, [2024-05-04T15:59:57.747389 #2728330] INFO -- : # Running tests: I, [2024-05-04T15:59:57.747392 #2728330] INFO -- : I, [2024-05-04T15:59:57.897255 #2728330] INFO -- : [ 1/885] 2769690=test_digest I, [2024-05-04T15:59:57.897315 #2728330] INFO -- : [ 2/885] 2769691=test_marshalable I, [2024-05-04T15:59:57.897417 #2728330] INFO -- : [ 3/885] 2769692=test_cgi_util I, [2024-05-04T15:59:57.897491 #2728330] INFO -- : [ 4/885] 2769693=test_require I, [2024-05-04T15:59:57.899139 #2728330] INFO -- : [ 5/885] 2769694=test_gem_ext_cmake_builder I, [2024-05-04T15:59:57.899228 #2728330] INFO -- : [ 6/885] 2769705=test_gem_commands_contents_command I, [2024-05-04T15:59:57.899316 #2728330] INFO -- : [ 7/885] 2769706=test_wss I, [2024-05-04T15:59:57.899490 #2728330] INFO -- : [ 8/885] 2769703=test_fiddle I, [2024-05-04T15:59:57.899582 #2728330] INFO -- : [ 9/885] 2769704=test_find I, [2024-05-04T15:59:57.903046 #2728330] INFO -- : [ 10/885] 2769708=test_ractor I, [2024-05-04T15:59:57.917716 #2728330] INFO -- : [ 11/885] 2769707=test_init I, [2024-05-04T15:59:57.919318 #2728330] INFO -- : [ 12/885] 2769704=test_complexrational I, [2024-05-04T15:59:57.924080 #2728330] INFO -- : [ 13/885] 2769691=test_pathname I, [2024-05-04T15:59:57.924893 #2728330] INFO -- : [ 14/885] 2769706=test_coverage I, [2024-05-04T15:59:57.928344 #2728330] INFO -- : [ 15/885] 2769704=test_rdoc_encoding I, [2024-05-04T15:59:57.929365 #2728330] INFO -- : [ 16/885] 2769699=regexp_test I, [2024-05-04T15:59:57.929461 #2728330] INFO -- : [ 17/885] 2769701=test_gem_package_tar_reader I, [2024-05-04T15:59:57.929669 #2728330] INFO -- : [ 18/885] 2769697=test_file I, [2024-05-04T15:59:57.929745 #2728330] INFO -- : [ 19/885] 2769700=test_rdoc_markdown I, [2024-05-04T15:59:57.930081 #2728330] INFO -- : [ 20/885] 2769698=test_gem_available_set I, [2024-05-04T15:59:57.930251 #2728330] INFO -- : [ 21/885] 2769695=test_rdoc_any_method I, [2024-05-04T15:59:57.931222 #2728330] INFO -- : [ 22/885] 2769696=test_modify_expand I, [2024-05-04T15:59:57.932796 #2728330] INFO -- : [ 23/885] 2769703=test_formatter I, [2024-05-04T15:59:57.938358 #2728330] INFO -- : [ 24/885] 2769696=test_bash_completion I, [2024-05-04T15:59:57.938962 #2728330] INFO -- : [ 25/885] 2769703=test_deprecate I, [2024-05-04T15:59:57.946550 #2728330] INFO -- : [ 26/885] 2769696=test_rdoc_constant I, [2024-05-04T15:59:57.957814 #2728330] INFO -- : [ 27/885] 2769702=test_gem_source_vendor I, [2024-05-04T15:59:57.963528 #2728330] INFO -- : [ 28/885] 2769697=test_gem_commands_owner_command I, [2024-05-04T15:59:57.963660 #2728330] INFO -- : [ 29/885] 2769709=test_recorder I, [2024-05-04T15:59:58.010435 #2728330] INFO -- : [ 30/885] 2769709=test_big2str I, [2024-05-04T15:59:58.016482 #2728330] INFO -- : [ 31/885] 2769709=test_wait I, [2024-05-04T15:59:58.048288 #2728330] INFO -- : [ 32/885] 2769699=test_handle I, [2024-05-04T15:59:58.079976 #2728330] INFO -- : [ 33/885] 2769709=test_yaml I, [2024-05-04T15:59:58.090850 #2728330] INFO -- : [ 34/885] 2769708=test_forwardable I, [2024-05-04T15:59:58.101876 #2728330] INFO -- : [ 35/885] 2769694=test_rdoc_markup_formatter I, [2024-05-04T15:59:58.107726 #2728330] INFO -- : [ 36/885] 2769708=test_nowrite I, [2024-05-04T15:59:58.113972 #2728330] INFO -- : [ 37/885] 2769704=test_thread_queue I, [2024-05-04T15:59:58.116781 #2728330] INFO -- : [ 38/885] 2769692=test_ansi_without_terminfo I, [2024-05-04T15:59:58.128139 #2728330] INFO -- : [ 39/885] 2769708=test_gem_commands_sources_command I, [2024-05-04T15:59:58.132620 #2728330] INFO -- : [ 40/885] 2769699=test_bmethod I, [2024-05-04T15:59:58.137785 #2728330] INFO -- : [ 41/885] 2769702=test_euc_tw I, [2024-05-04T15:59:58.138761 #2728330] INFO -- : [ 42/885] 2769691=test_ractor I, [2024-05-04T15:59:58.139834 #2728330] INFO -- : [ 43/885] 2769699=test_shapes I, [2024-05-04T15:59:58.144016 #2728330] INFO -- : [ 44/885] 2769702=json_fixtures_test I, [2024-05-04T15:59:58.146992 #2728330] INFO -- : [ 45/885] 2769705=test_io_timeout I, [2024-05-04T15:59:58.147752 #2728330] INFO -- : [ 46/885] 2769699=test_rdoc_parser_c I, [2024-05-04T15:59:58.151863 #2728330] INFO -- : [ 47/885] 2769705=test_comparable I, [2024-05-04T15:59:58.153747 #2728330] INFO -- : [ 48/885] 2769705=test_enc_str_buf_cat I, [2024-05-04T15:59:58.155259 #2728330] INFO -- : [ 49/885] 2769702=test_gbk I, [2024-05-04T15:59:58.157166 #2728330] INFO -- : [ 50/885] 2769705=test_class2name I, [2024-05-04T15:59:58.157714 #2728330] INFO -- : [ 51/885] 2769702=test_profile_frames I, [2024-05-04T15:59:58.160801 #2728330] INFO -- : [ 52/885] 2769705=test_pstore I, [2024-05-04T15:59:58.162359 #2728330] INFO -- : [ 53/885] 2769691=test_cstr I, [2024-05-04T15:59:58.164443 #2728330] INFO -- : [ 54/885] 2769703=test_stack I, [2024-05-04T15:59:58.171332 #2728330] INFO -- : [ 55/885] 2769701=test_gem_commands_list_command I, [2024-05-04T15:59:58.171816 #2728330] INFO -- : [ 56/885] 2769692=test_reqarg I, [2024-05-04T15:59:58.177853 #2728330] INFO -- : [ 57/885] 2769709=test_rdoc_include I, [2024-05-04T15:59:58.186460 #2728330] INFO -- : [ 58/885] 2769701=test_too_many_dummy_encodings I, [2024-05-04T15:59:58.201283 #2728330] INFO -- : [ 59/885] 2769705=test_rdoc_options I, [2024-05-04T15:59:58.233695 #2728330] INFO -- : [ 60/885] 2769694=test_econv I, [2024-05-04T15:59:58.246894 #2728330] INFO -- : [ 61/885] 2769701=test_cesu8 I, [2024-05-04T15:59:58.250098 #2728330] INFO -- : [ 62/885] 2769701=test_gem_version I, [2024-05-04T15:59:58.253426 #2728330] INFO -- : [ 63/885] 2769696=test_emitter I, [2024-05-04T15:59:58.274543 #2728330] INFO -- : [ 64/885] 2769696=test_gem_commands_signin_command I, [2024-05-04T15:59:58.282413 #2728330] INFO -- : [ 65/885] 2769698=test_resource I, [2024-05-04T15:59:58.293294 #2728330] INFO -- : [ 66/885] 2769691=test_ldap I, [2024-05-04T15:59:58.300584 #2728330] INFO -- : [ 67/885] 2769698=test_fileutils I, [2024-05-04T15:59:58.307160 #2728330] INFO -- : [ 68/885] 2769691=test_string_processing I, [2024-05-04T15:59:58.320224 #2728330] INFO -- : [ 69/885] 2769701=test_gem_commands_search_command I, [2024-05-04T15:59:58.324905 #2728330] INFO -- : [ 70/885] 2769701=test_complex I, [2024-05-04T15:59:58.345753 #2728330] INFO -- : [ 71/885] 2769702=test_gem_ext_ext_conf_builder I, [2024-05-04T15:59:58.353980 #2728330] INFO -- : [ 72/885] 2769707=test_method_cache I, [2024-05-04T15:59:58.356277 #2728330] INFO -- : [ 73/885] 2769707=test_gem_stub_specification I, [2024-05-04T15:59:58.358790 #2728330] INFO -- : [ 74/885] 2769700=test_frozen_error I, [2024-05-04T15:59:58.358928 #2728330] INFO -- : [ 75/885] 2769709=test_gem_resolver_specification I, [2024-05-04T15:59:58.363158 #2728330] INFO -- : [ 76/885] 2769691=test_gem_dependency I, [2024-05-04T15:59:58.366232 #2728330] INFO -- : [ 77/885] 2769700=test_path_to_class I, [2024-05-04T15:59:58.368791 #2728330] INFO -- : [ 78/885] 2769700=test_inlinecache I, [2024-05-04T15:59:58.443233 #2728330] INFO -- : [ 79/885] 2769700=test_rdoc_markup_verbatim I, [2024-05-04T15:59:58.447241 #2728330] INFO -- : [ 80/885] 2769700=test_gem_remote_fetcher I, [2024-05-04T15:59:58.465539 #2728330] INFO -- : [ 81/885] 2769701=test_mdns I, [2024-05-04T15:59:58.481165 #2728330] INFO -- : [ 82/885] 2769701=test_parse I, [2024-05-04T15:59:58.493451 #2728330] INFO -- : [ 83/885] 2769695=test_gem_resolver_installed_specification I, [2024-05-04T15:59:58.529981 #2728330] INFO -- : [ 84/885] 2769699=test_scanner_events I, [2024-05-04T15:59:58.543256 #2728330] INFO -- : [ 85/885] 2769696=test_rdoc_parser_rd I, [2024-05-04T15:59:58.554327 #2728330] INFO -- : [ 86/885] 2769709=test_date_strftime I, [2024-05-04T15:59:58.559541 #2728330] INFO -- : [ 87/885] 2769699=test_gem_installer I, [2024-05-04T15:59:58.560698 #2728330] INFO -- : [ 88/885] 2769708=test_yamlstore I, [2024-05-04T15:59:58.566716 #2728330] INFO -- : [ 89/885] 2769692=test_random I, [2024-05-04T15:59:58.573905 #2728330] INFO -- : [ 90/885] 2769708=test_asn1 I, [2024-05-04T15:59:58.574348 #2728330] INFO -- : [ 91/885] 2769696=test_rdoc_normal_class I, [2024-05-04T15:59:58.597332 #2728330] INFO -- : [ 92/885] 2769708=test_class I, [2024-05-04T15:59:58.605773 #2728330] INFO -- : [ 93/885] 2769692=test_const I, [2024-05-04T15:59:58.615910 #2728330] INFO -- : [ 94/885] 2769692=json_string_matching_test I, [2024-05-04T15:59:58.638762 #2728330] INFO -- : [ 95/885] 2769692=test_load I, [2024-05-04T15:59:58.641006 #2728330] INFO -- : [ 96/885] 2769696=test_irb I, [2024-05-04T15:59:58.645499 #2728330] INFO -- : [ 97/885] 2769692=test_function I, [2024-05-04T15:59:58.655605 #2728330] INFO -- : [ 98/885] 2769707=test_queue I, [2024-05-04T15:59:58.660003 #2728330] INFO -- : [ 99/885] 2769707=test_noarg I, [2024-05-04T15:59:58.680195 #2728330] INFO -- : [100/885] 2769705=parse_comments_test I, [2024-05-04T15:59:58.698070 #2728330] INFO -- : [101/885] 2769695=test_tempfile I, [2024-05-04T15:59:58.715230 #2728330] INFO -- : [102/885] 2769691=test_rdoc_markup I, [2024-05-04T15:59:58.727375 #2728330] INFO -- : [103/885] 2769697=test_gem_commands_help_command I, [2024-05-04T15:59:58.752377 #2728330] INFO -- : [104/885] 2769698=test_tracepoint I, [2024-05-04T15:59:58.762954 #2728330] INFO -- : [105/885] 2769690=test_prettyprint I, [2024-05-04T15:59:58.780224 #2728330] INFO -- : [106/885] 2769705=test_utf32 I, [2024-05-04T15:59:58.780786 #2728330] INFO -- : [107/885] 2769690=test_basicsocket I, [2024-05-04T15:59:58.786633 #2728330] INFO -- : [108/885] 2769705=test_duplicate I, [2024-05-04T15:59:58.790921 #2728330] INFO -- : [109/885] 2769705=test_gem_resolver_index_specification I, [2024-05-04T15:59:58.800837 #2728330] INFO -- : [110/885] 2769697=test_internal_ivar I, [2024-05-04T15:59:58.803274 #2728330] INFO -- : [111/885] 2769690=test_kwargs I, [2024-05-04T15:59:58.803623 #2728330] INFO -- : [112/885] 2769697=warnings_test I, [2024-05-04T15:59:58.803988 #2728330] INFO -- : [113/885] 2769690=test_io_wait I, [2024-05-04T15:59:58.842682 #2728330] INFO -- : [114/885] 2769691=test_gem_commands_exec_command I, [2024-05-04T15:59:58.849668 #2728330] INFO -- : [115/885] 2769707=test_date_attr I, [2024-05-04T15:59:58.855984 #2728330] INFO -- : [116/885] 2769707=test_ellipsize I, [2024-05-04T15:59:58.857650 #2728330] INFO -- : [117/885] 2769705=test_summary I, [2024-05-04T15:59:58.863801 #2728330] INFO -- : [118/885] 2769706=test_console_attr I, [2024-05-04T15:59:58.866002 #2728330] INFO -- : [119/885] 2769706=test_type_completor I, [2024-05-04T15:59:58.867911 #2728330] INFO -- : [120/885] 2769706=test_win32ole_record I, [2024-05-04T15:59:58.870288 #2728330] INFO -- : [121/885] 2769707=test_gem_unsatisfiable_dependency_error I, [2024-05-04T15:59:58.870990 #2728330] INFO -- : [122/885] 2769706=test_gem_commands_uninstall_command I, [2024-05-04T15:59:58.875829 #2728330] INFO -- : [123/885] 2769692=test_condition I, [2024-05-04T15:59:58.877810 #2728330] INFO -- : [124/885] 2769692=test_foreach I, [2024-05-04T15:59:58.879918 #2728330] INFO -- : [125/885] 2769697=test_gem_source_specific_file I, [2024-05-04T15:59:58.880581 #2728330] INFO -- : [126/885] 2769692=test_cp949 I, [2024-05-04T15:59:58.882439 #2728330] INFO -- : [127/885] 2769707=test_io I, [2024-05-04T15:59:58.884191 #2728330] INFO -- : [128/885] 2769692=test_hash I, [2024-05-04T15:59:58.951618 #2728330] INFO -- : [129/885] 2769695=test_ubf_async_safe I, [2024-05-04T15:59:58.957954 #2728330] INFO -- : [130/885] 2769695=test_sorted_set I, [2024-05-04T15:59:58.962367 #2728330] INFO -- : [131/885] 2769698=test_emoji I, [2024-05-04T15:59:58.972347 #2728330] INFO -- : [132/885] 2769697=test_win32ole_type_event I, [2024-05-04T15:59:58.976445 #2728330] INFO -- : [133/885] 2769697=test_pack I, [2024-05-04T15:59:58.986808 #2728330] INFO -- : [134/885] 2769698=test_array_create I, [2024-05-04T15:59:58.991113 #2728330] INFO -- : [135/885] 2769698=test_gem_impossible_dependencies_error I, [2024-05-04T15:59:58.999781 #2728330] INFO -- : [136/885] 2769698=test_to_ruby I, [2024-05-04T15:59:59.009910 #2728330] INFO -- : [137/885] 2769698=test_pattern_key_name_check I, [2024-05-04T15:59:59.016808 #2728330] INFO -- : [138/885] 2769705=test_rdoc_rubygems_hook I, [2024-05-04T15:59:59.017926 #2728330] INFO -- : [139/885] 2769698=test_gem_commands_query_command I, [2024-05-04T15:59:59.019972 #2728330] INFO -- : [140/885] 2769701=test_method I, [2024-05-04T15:59:59.059110 #2728330] INFO -- : [141/885] 2769703=test_euc_kr I, [2024-05-04T15:59:59.060916 #2728330] INFO -- : [142/885] 2769703=test_rdoc_context_section I, [2024-05-04T15:59:59.066864 #2728330] INFO -- : [143/885] 2769696=test_ftp I, [2024-05-04T15:59:59.077022 #2728330] INFO -- : [144/885] 2769696=test_gem_security_trust_dir I, [2024-05-04T15:59:59.101712 #2728330] INFO -- : [145/885] 2769696=comments_test I, [2024-05-04T15:59:59.102477 #2728330] INFO -- : [146/885] 2769707=test_gem_requirement I, [2024-05-04T15:59:59.119194 #2728330] INFO -- : [147/885] 2769697=test_sprintf I, [2024-05-04T15:59:59.121056 #2728330] INFO -- : [148/885] 2769705=test_string_memory I, [2024-05-04T15:59:59.136437 #2728330] INFO -- : [149/885] 2769709=test_undef I, [2024-05-04T15:59:59.138826 #2728330] INFO -- : [150/885] 2769690=ripper_test I, [2024-05-04T15:59:59.140599 #2728330] INFO -- : [151/885] 2769709=test_objspace I, [2024-05-04T15:59:59.176679 #2728330] INFO -- : [152/885] 2769696=test_line_editor I, [2024-05-04T15:59:59.183240 #2728330] INFO -- : [153/885] 2769705=test_have_library I, [2024-05-04T15:59:59.184659 #2728330] INFO -- : [154/885] 2769696=test_remote_fetch_error I, [2024-05-04T15:59:59.207043 #2728330] INFO -- : [155/885] 2769695=test_c_struct_entry I, [2024-05-04T15:59:59.207106 #2728330] INFO -- : [156/885] 2769696=test_lock_native_thread I, [2024-05-04T15:59:59.215062 #2728330] INFO -- : [157/885] 2769703=test_gem_commands_stale_command I, [2024-05-04T15:59:59.225680 #2728330] INFO -- : [158/885] 2769707=test_set I, [2024-05-04T15:59:59.235293 #2728330] INFO -- : [159/885] 2769703=test_show_source I, [2024-05-04T15:59:59.240816 #2728330] INFO -- : [160/885] 2769694=test_alias_and_anchor I, [2024-05-04T15:59:59.253745 #2728330] INFO -- : [161/885] 2769707=test_postponed_job I, [2024-05-04T15:59:59.274447 #2728330] INFO -- : [162/885] 2769694=test_external_new I, [2024-05-04T15:59:59.285464 #2728330] INFO -- : [163/885] 2769697=test_gem_resolver_dependency_request I, [2024-05-04T15:59:59.285699 #2728330] INFO -- : [164/885] 2769694=test_tree_builder I, [2024-05-04T15:59:59.294599 #2728330] INFO -- : [165/885] 2769694=test_hash I, [2024-05-04T15:59:59.309058 #2728330] INFO -- : [166/885] 2769693=test_protect I, [2024-05-04T15:59:59.309139 #2728330] INFO -- : [167/885] 2769697=test_win32ole_typelib I, [2024-05-04T15:59:59.310085 #2728330] INFO -- : [168/885] 2769694=test_gem_request_set_lockfile I, [2024-05-04T15:59:59.312447 #2728330] INFO -- : [169/885] 2769693=test_raise_exception I, [2024-05-04T15:59:59.313994 #2728330] INFO -- : [170/885] 2769697=test_argf I, [2024-05-04T15:59:59.361976 #2728330] INFO -- : [171/885] 2769703=test_kill_ring I, [2024-05-04T15:59:59.367403 #2728330] INFO -- : [172/885] 2769695=test_framework I, [2024-05-04T15:59:59.372491 #2728330] INFO -- : [173/885] 2769703=test_ns_spki I, [2024-05-04T15:59:59.383893 #2728330] INFO -- : [174/885] 2769695=test_yjit I, [2024-05-04T15:59:59.393304 #2728330] INFO -- : [175/885] 2769695=test_weakmap I, [2024-05-04T15:59:59.424355 #2728330] INFO -- : [176/885] 2769703=test_workspace I, [2024-05-04T15:59:59.513680 #2728330] INFO -- : [177/885] 2769696=test_gem_commands_environment_command I, [2024-05-04T15:59:59.547992 #2728330] INFO -- : [178/885] 2769703=test_m17n I, [2024-05-04T15:59:59.550968 #2728330] INFO -- : [179/885] 2769702=test_ws I, [2024-05-04T15:59:59.558957 #2728330] INFO -- : [180/885] 2769696=test_rdoc_markup_indented_paragraph I, [2024-05-04T15:59:59.563773 #2728330] INFO -- : [181/885] 2769696=ruby_parser_test I, [2024-05-04T15:59:59.567585 #2728330] INFO -- : [182/885] 2769696=test_pack I, [2024-05-04T15:59:59.571180 #2728330] INFO -- : [183/885] 2769702=test_backtrace I, [2024-05-04T15:59:59.586523 #2728330] INFO -- : [184/885] 2769696=test_io_buffer I, [2024-05-04T15:59:59.605246 #2728330] INFO -- : [185/885] 2769703=test_rdoc_task I, [2024-05-04T15:59:59.608106 #2728330] INFO -- : [186/885] 2769703=test_gem_resolver_conflict I, [2024-05-04T15:59:59.616101 #2728330] INFO -- : [187/885] 2769698=test_gem_commands_install_command I, [2024-05-04T15:59:59.622347 #2728330] INFO -- : [188/885] 2769703=test_clone I, [2024-05-04T15:59:59.634265 #2728330] INFO -- : [189/885] 2769707=test_readpartial I, [2024-05-04T15:59:59.697897 #2728330] INFO -- : [190/885] 2769696=locals_test I, [2024-05-04T15:59:59.735764 #2728330] INFO -- : [191/885] 2769706=test_rdoc_require I, [2024-05-04T15:59:59.762490 #2728330] INFO -- : [192/885] 2769690=test_rdoc_markup_raw I, [2024-05-04T15:59:59.780667 #2728330] INFO -- : [193/885] 2769694=test_webauthn_poller I, [2024-05-04T15:59:59.803992 #2728330] INFO -- : [194/885] 2769703=test_rat I, [2024-05-04T15:59:59.810317 #2728330] INFO -- : [195/885] 2769703=test_gem_resolver_best_set I, [2024-05-04T15:59:59.869129 #2728330] INFO -- : [196/885] 2769691=encoding_test I, [2024-05-04T15:59:59.889334 #2728330] INFO -- : [197/885] 2769703=test_typeddata I, [2024-05-04T15:59:59.905408 #2728330] INFO -- : [198/885] 2769690=test_rdoc_markup_to_html_crossref I, [2024-05-04T15:59:59.920734 #2728330] INFO -- : [199/885] 2769706=test_fstring I, [2024-05-04T15:59:59.923953 #2728330] INFO -- : [200/885] 2769694=test_optparse I, [2024-05-04T15:59:59.989348 #2728330] INFO -- : [201/885] 2769694=test_array I, [2024-05-04T15:59:59.997799 #2728330] INFO -- : [202/885] 2769694=test_convertible I, [2024-05-04T16:00:00.006466 #2728330] INFO -- : [203/885] 2769691=parser_test I, [2024-05-04T16:00:00.012818 #2728330] INFO -- : [204/885] 2769691=test_yield I, [2024-05-04T16:00:00.040384 #2728330] INFO -- : [205/885] 2769707=test_rdoc_alias I, [2024-05-04T16:00:00.042730 #2728330] INFO -- : [206/885] 2769706=test_files_sample I, [2024-05-04T16:00:00.054246 #2728330] INFO -- : [207/885] 2769693=test_stringscanner I, [2024-05-04T16:00:00.065727 #2728330] INFO -- : [208/885] 2769696=test_pkey_dh I, [2024-05-04T16:00:00.125288 #2728330] INFO -- : [209/885] 2769693=test_bigzero I, [2024-05-04T16:00:00.125991 #2728330] INFO -- : [210/885] 2769693=test_gem_util I, [2024-05-04T16:00:00.143233 #2728330] INFO -- : [211/885] 2769703=test_iseq_load I, [2024-05-04T16:00:00.192016 #2728330] INFO -- : [212/885] 2769696=test_gem_package_tar_header I, [2024-05-04T16:00:00.212536 #2728330] INFO -- : [213/885] 2769690=test_pkcs12 I, [2024-05-04T16:00:00.221215 #2728330] INFO -- : [214/885] 2769707=test_system I, [2024-05-04T16:00:00.242136 #2728330] INFO -- : [215/885] 2769696=test_yjit_exit_locations I, [2024-05-04T16:00:00.249216 #2728330] INFO -- : [216/885] 2769696=test_etc I, [2024-05-04T16:00:00.330431 #2728330] INFO -- : [217/885] 2769693=test_ripper I, [2024-05-04T16:00:00.339176 #2728330] INFO -- : [218/885] 2769696=test_gem_config_file I, [2024-05-04T16:00:00.375812 #2728330] INFO -- : [219/885] 2769705=test_gem_resolver_activation_request I, [2024-05-04T16:00:00.386923 #2728330] INFO -- : [220/885] 2769705=test_getopts I, [2024-05-04T16:00:00.390653 #2728330] INFO -- : [221/885] 2769705=test_protocol I, [2024-05-04T16:00:00.428550 #2728330] INFO -- : [222/885] 2769706=test_gem_commands_fetch_command I, [2024-05-04T16:00:00.497010 #2728330] INFO -- : [223/885] 2769696=test_math I, [2024-05-04T16:00:00.525219 #2728330] INFO -- : [224/885] 2769696=test_gc I, [2024-05-04T16:00:00.526514 #2728330] INFO -- : [225/885] 2769696=test_libs I, [2024-05-04T16:00:00.565342 #2728330] INFO -- : [226/885] 2769696=test_config I, [2024-05-04T16:00:00.597240 #2728330] INFO -- : [227/885] 2769706=test_sleep I, [2024-05-04T16:00:00.623565 #2728330] INFO -- : [228/885] 2769696=test_yaml_tree I, [2024-05-04T16:00:00.662480 #2728330] INFO -- : [229/885] 2769696=test_face I, [2024-05-04T16:00:00.676418 #2728330] INFO -- : [230/885] 2769696=test_sizeof I, [2024-05-04T16:00:00.701835 #2728330] INFO -- : [231/885] 2769705=test_case I, [2024-05-04T16:00:00.729465 #2728330] INFO -- : [232/885] 2769705=test_rendering I, [2024-05-04T16:00:00.741439 #2728330] INFO -- : [233/885] 2769693=test_utf16 I, [2024-05-04T16:00:00.743962 #2728330] INFO -- : [234/885] 2769693=test_autoload I, [2024-05-04T16:00:00.778344 #2728330] INFO -- : [235/885] 2769700=test_unicode_escape I, [2024-05-04T16:00:00.823616 #2728330] INFO -- : [236/885] 2769705=test_io I, [2024-05-04T16:00:00.845927 #2728330] INFO -- : [237/885] 2769690=test_rdoc_markup_attributes I, [2024-05-04T16:00:00.847623 #2728330] INFO -- : [238/885] 2769690=test_mul I, [2024-05-04T16:00:00.848445 #2728330] INFO -- : [239/885] 2769700=test_win32ole_type I, [2024-05-04T16:00:00.852580 #2728330] INFO -- : [240/885] 2769700=test_null I, [2024-05-04T16:00:00.855060 #2728330] INFO -- : [241/885] 2769690=test_default_gems I, [2024-05-04T16:00:00.861349 #2728330] INFO -- : [242/885] 2769700=test_rdoc_rd_inline_parser I, [2024-05-04T16:00:00.882580 #2728330] INFO -- : [243/885] 2769708=test_rdoc_markup_to_rdoc I, [2024-05-04T16:00:00.886748 #2728330] INFO -- : [244/885] 2769700=test_thread I, [2024-05-04T16:00:00.895556 #2728330] INFO -- : [245/885] 2769700=test_trick I, [2024-05-04T16:00:00.913510 #2728330] INFO -- : [246/885] 2769702=test_pipe I, [2024-05-04T16:00:00.917202 #2728330] INFO -- : [247/885] 2769690=test_pkey_ec I, [2024-05-04T16:00:01.015049 #2728330] INFO -- : [248/885] 2769690=test_date_parse I, [2024-05-04T16:00:01.034361 #2728330] INFO -- : [249/885] 2769702=test_io_buffer I, [2024-05-04T16:00:01.064720 #2728330] INFO -- : [250/885] 2769702=test_backtrace I, [2024-05-04T16:00:01.068329 #2728330] INFO -- : [251/885] 2769708=test_defined I, [2024-05-04T16:00:01.070260 #2728330] INFO -- : [252/885] 2769702=test_key_name_check I, [2024-05-04T16:00:01.082200 #2728330] INFO -- : [253/885] 2769702=test_rdoc_i18n_text I, [2024-05-04T16:00:01.121319 #2728330] INFO -- : [254/885] 2769690=test_gem_uninstaller I, [2024-05-04T16:00:01.132565 #2728330] INFO -- : [255/885] 2769698=test_gb18030 I, [2024-05-04T16:00:01.138435 #2728330] INFO -- : [256/885] 2769698=test_svcb_https I, [2024-05-04T16:00:01.141343 #2728330] INFO -- : [257/885] 2769698=test_buffering I, [2024-05-04T16:00:01.145335 #2728330] INFO -- : [258/885] 2769708=test_time I, [2024-05-04T16:00:01.157614 #2728330] INFO -- : [259/885] 2769698=test_windows_1251 I, [2024-05-04T16:00:01.168291 #2728330] INFO -- : [260/885] 2769698=test_rdoc_rdoc I, [2024-05-04T16:00:01.192079 #2728330] INFO -- : [261/885] 2769707=test_gc_compact I, [2024-05-04T16:00:01.253931 #2728330] INFO -- : [262/885] 2769698=test_string I, [2024-05-04T16:00:01.266150 #2728330] INFO -- : [263/885] 2769702=test_proc I, [2024-05-04T16:00:01.277520 #2728330] INFO -- : [264/885] 2769708=test_gem_package_old I, [2024-05-04T16:00:01.284069 #2728330] INFO -- : [265/885] 2769695=test_gem_resolver_index_set I, [2024-05-04T16:00:01.319228 #2728330] INFO -- : [266/885] 2769695=test_egrep_cpp I, [2024-05-04T16:00:01.319632 #2728330] INFO -- : [267/885] 2769708=test_cgi_tag_helper I, [2024-05-04T16:00:01.331741 #2728330] INFO -- : [268/885] 2769703=test_zlib I, [2024-05-04T16:00:01.336022 #2728330] INFO -- : [269/885] 2769708=test_date_conv I, [2024-05-04T16:00:01.346978 #2728330] INFO -- : [270/885] 2769708=test_optimization I, [2024-05-04T16:00:01.442840 #2728330] INFO -- : [271/885] 2769695=test_ole_methods I, [2024-05-04T16:00:01.449685 #2728330] INFO -- : [272/885] 2769695=test_erb_m17n I, [2024-05-04T16:00:01.464315 #2728330] INFO -- : [273/885] 2769695=test_require_path_check I, [2024-05-04T16:00:01.554639 #2728330] INFO -- : [274/885] 2769695=test_rdoc_markup_parser I, [2024-05-04T16:00:01.601162 #2728330] INFO -- : [275/885] 2769695=test_folderitem2_invokeverb I, [2024-05-04T16:00:01.604991 #2728330] INFO -- : [276/885] 2769695=test_files_test_2 I, [2024-05-04T16:00:01.838803 #2728330] INFO -- : [277/885] 2769701=test_fnmatch I, [2024-05-04T16:00:01.887967 #2728330] INFO -- : [278/885] 2769701=test_gem_validator I, [2024-05-04T16:00:01.932743 #2728330] INFO -- : [279/885] 2769701=test_rdoc_store I, [2024-05-04T16:00:01.999181 #2728330] INFO -- : [280/885] 2769690=test_x509attr I, [2024-05-04T16:00:02.004067 #2728330] INFO -- : [281/885] 2769690=test_raise I, [2024-05-04T16:00:02.013702 #2728330] INFO -- : [282/885] 2769690=test_gem_request_set_lockfile_parser I, [2024-05-04T16:00:02.057734 #2728330] INFO -- : [283/885] 2769702=test_depth_first I, [2024-05-04T16:00:02.087187 #2728330] INFO -- : [284/885] 2769702=test_rdoc_stats I, [2024-05-04T16:00:02.119592 #2728330] INFO -- : [285/885] 2769690=test_pattern_matching I, [2024-05-04T16:00:02.142007 #2728330] INFO -- : [286/885] 2769690=test_string I, [2024-05-04T16:00:02.151159 #2728330] INFO -- : [287/885] 2769690=test_gem_dependency_resolution_error I, [2024-05-04T16:00:02.156714 #2728330] INFO -- : [288/885] 2769690=test_qsort I, [2024-05-04T16:00:02.160976 #2728330] INFO -- : [289/885] 2769690=test_rdoc_parser I, [2024-05-04T16:00:02.177387 #2728330] INFO -- : [290/885] 2769690=json_addition_test I, [2024-05-04T16:00:02.195566 #2728330] INFO -- : [291/885] 2769702=test_custom_command I, [2024-05-04T16:00:02.216683 #2728330] INFO -- : [292/885] 2769690=test_rdoc_tom_doc I, [2024-05-04T16:00:02.232556 #2728330] INFO -- : [293/885] 2769690=test_hmac I, [2024-05-04T16:00:02.236213 #2728330] INFO -- : [294/885] 2769690=test_rdoc_markup_to_tt_only I, [2024-05-04T16:00:02.265618 #2728330] INFO -- : [295/885] 2769690=test_bug-3571 I, [2024-05-04T16:00:02.277683 #2728330] INFO -- : [296/885] 2769690=test_key_actor_vi I, [2024-05-04T16:00:02.318424 #2728330] INFO -- : [297/885] 2769702=test_gem_command I, [2024-05-04T16:00:02.404293 #2728330] INFO -- : [298/885] 2769704=test_gem_spec_fetcher I, [2024-05-04T16:00:02.428785 #2728330] INFO -- : [299/885] 2769702=test_common I, [2024-05-04T16:00:02.449602 #2728330] INFO -- : [300/885] 2769690=test_numeric I, [2024-05-04T16:00:02.492467 #2728330] INFO -- : [301/885] 2769692=test_gem_commands_lock_command I, [2024-05-04T16:00:02.503077 #2728330] INFO -- : [302/885] 2769691=test_ifunless I, [2024-05-04T16:00:02.505653 #2728330] INFO -- : [303/885] 2769691=test_assignment I, [2024-05-04T16:00:02.515858 #2728330] INFO -- : [304/885] 2769690=test_config I, [2024-05-04T16:00:02.548383 #2728330] INFO -- : [305/885] 2769690=test_gem_source_list I, [2024-05-04T16:00:02.594540 #2728330] INFO -- : [306/885] 2769690=test_yaml_special_cases I, [2024-05-04T16:00:02.605006 #2728330] INFO -- : [307/885] 2769690=test_optarg I, [2024-05-04T16:00:02.637880 #2728330] INFO -- : [308/885] 2769706=test_rdoc_token_stream I, [2024-05-04T16:00:02.645179 #2728330] INFO -- : [309/885] 2769706=test_address_resolve I, [2024-05-04T16:00:02.679779 #2728330] INFO -- : [310/885] 2769702=test_iter_break I, [2024-05-04T16:00:02.686572 #2728330] INFO -- : [311/885] 2769702=test_zsh_completion I, [2024-05-04T16:00:02.687385 #2728330] INFO -- : [312/885] 2769702=test_exception I, [2024-05-04T16:00:02.696871 #2728330] INFO -- : [313/885] 2769702=test_nil I, [2024-05-04T16:00:02.697740 #2728330] INFO -- : [314/885] 2769702=test_num2int I, [2024-05-04T16:00:02.717867 #2728330] INFO -- : [315/885] 2769702=test_rdoc_single_class I, [2024-05-04T16:00:02.725426 #2728330] INFO -- : [316/885] 2769702=test_verbose I, [2024-05-04T16:00:02.727537 #2728330] INFO -- : [317/885] 2769690=test_gem_ext_configure_builder I, [2024-05-04T16:00:02.728623 #2728330] INFO -- : [318/885] 2769692=test_frozen I, [2024-05-04T16:00:02.732510 #2728330] INFO -- : [319/885] 2769692=test_pp I, [2024-05-04T16:00:02.749922 #2728330] INFO -- : [320/885] 2769702=test_macro I, [2024-05-04T16:00:02.755909 #2728330] INFO -- : [321/885] 2769706=test_emitter I, [2024-05-04T16:00:02.756395 #2728330] INFO -- : [322/885] 2769702=test_gem_silent_ui I, [2024-05-04T16:00:02.764106 #2728330] INFO -- : [323/885] 2769706=test_files_ext I, [2024-05-04T16:00:02.765342 #2728330] INFO -- : [324/885] 2769706=test_bug-5832 I, [2024-05-04T16:00:02.768020 #2728330] INFO -- : [325/885] 2769704=test_kernel I, [2024-05-04T16:00:02.768283 #2728330] INFO -- : [326/885] 2769692=test_eval_history I, [2024-05-04T16:00:02.769995 #2728330] INFO -- : [327/885] 2769706=dispatcher_test I, [2024-05-04T16:00:02.774764 #2728330] INFO -- : [328/885] 2769701=test_gem_doctor I, [2024-05-04T16:00:02.796157 #2728330] INFO -- : [329/885] 2769690=test_kdf I, [2024-05-04T16:00:02.797809 #2728330] INFO -- : [330/885] 2769702=!Nothing_to_test I, [2024-05-04T16:00:02.801050 #2728330] INFO -- : [331/885] 2769702=test_enc_raise I, [2024-05-04T16:00:02.809074 #2728330] INFO -- : [332/885] 2769702=test_psych I, [2024-05-04T16:00:02.823061 #2728330] INFO -- : [333/885] 2769701=test_rdoc_markup_paragraph I, [2024-05-04T16:00:02.828910 #2728330] INFO -- : [334/885] 2769701=test_gem_ext_cargo_builder_unit I, [2024-05-04T16:00:02.830215 #2728330] INFO -- : [335/885] 2769692=test_date I, [2024-05-04T16:00:02.835069 #2728330] INFO -- : [336/885] 2769692=test_gem_rdoc I, [2024-05-04T16:00:02.838847 #2728330] INFO -- : [337/885] 2769702=test_command I, [2024-05-04T16:00:02.842250 #2728330] INFO -- : [338/885] 2769706=test_at_exit I, [2024-05-04T16:00:02.854317 #2728330] INFO -- : [339/885] 2769701=test_object_create_start I, [2024-05-04T16:00:02.856065 #2728330] INFO -- : [340/885] 2769701=test_gem_commands_specification_command I, [2024-05-04T16:00:02.860761 #2728330] INFO -- : [341/885] 2769706=test_http I, [2024-05-04T16:00:02.863378 #2728330] INFO -- : [342/885] 2769690=test_gem_commands_which_command I, [2024-05-04T16:00:02.866990 #2728330] INFO -- : [343/885] 2769706=test_shift_jis I, [2024-05-04T16:00:02.870629 #2728330] INFO -- : [344/885] 2769706=test_flags I, [2024-05-04T16:00:02.894328 #2728330] INFO -- : [345/885] 2769690=test_inadvertent_creation I, [2024-05-04T16:00:02.970237 #2728330] INFO -- : [346/885] 2769701=test_enumerator I, [2024-05-04T16:00:03.020876 #2728330] INFO -- : [347/885] 2769690=test_name_error I, [2024-05-04T16:00:03.109559 #2728330] INFO -- : [348/885] 2769692=test_rdoc_markup_attribute_manager I, [2024-05-04T16:00:03.138245 #2728330] INFO -- : [349/885] 2769690=test_gem_commands_dependency_command I, [2024-05-04T16:00:03.160341 #2728330] INFO -- : [350/885] 2769692=test_gem_resolver I, [2024-05-04T16:00:03.202431 #2728330] INFO -- : [351/885] 2769702=test_safe_load I, [2024-05-04T16:00:03.215641 #2728330] INFO -- : [352/885] 2769702=test_gem_resolver_composed_set I, [2024-05-04T16:00:03.219255 #2728330] INFO -- : [353/885] 2769690=test_rdoc_context I, [2024-05-04T16:00:03.245925 #2728330] INFO -- : [354/885] 2769702=test_nil2vtempty I, [2024-05-04T16:00:03.252498 #2728330] INFO -- : [355/885] 2769702=test_stream I, [2024-05-04T16:00:03.261131 #2728330] INFO -- : [356/885] 2769702=test_open-uri I, [2024-05-04T16:00:03.275271 #2728330] INFO -- : [357/885] 2769704=test_httpresponse I, [2024-05-04T16:00:03.375793 #2728330] INFO -- : [358/885] 2769704=test_rdoc_parser_ruby I, [2024-05-04T16:00:03.412386 #2728330] INFO -- : [359/885] 2769692=test_syntax I, [2024-05-04T16:00:03.417868 #2728330] INFO -- : [360/885] 2769699=test_gem_safe_yaml I, [2024-05-04T16:00:03.425223 #2728330] INFO -- : [361/885] 2769699=test_require I, [2024-05-04T16:00:03.426151 #2728330] INFO -- : [362/885] 2769699=test_rdoc_markup_to_joined_paragraph I, [2024-05-04T16:00:03.434106 #2728330] INFO -- : [363/885] 2769699=test_date_time I, [2024-05-04T16:00:03.449302 #2728330] INFO -- : [364/885] 2769699=test_date_new I, [2024-05-04T16:00:03.457225 #2728330] INFO -- : [365/885] 2769699=index_write_test I, [2024-05-04T16:00:03.459727 #2728330] INFO -- : [366/885] 2769699=test_data I, [2024-05-04T16:00:03.467080 #2728330] INFO -- : [367/885] 2769699=test_tcp I, [2024-05-04T16:00:03.540458 #2728330] INFO -- : [368/885] 2769697=test_iso_8859 I, [2024-05-04T16:00:03.552804 #2728330] INFO -- : [369/885] 2769699=test_rdoc_text I, [2024-05-04T16:00:03.593422 #2728330] INFO -- : [370/885] 2769697=test_singleton I, [2024-05-04T16:00:03.600667 #2728330] INFO -- : [371/885] 2769697=test_flush I, [2024-05-04T16:00:03.627984 #2728330] INFO -- : [372/885] 2769697=test_io_console I, [2024-05-04T16:00:03.642361 #2728330] INFO -- : [373/885] 2769699=test_switch_hitter I, [2024-05-04T16:00:03.648575 #2728330] INFO -- : [374/885] 2769700=test_securerandom I, [2024-05-04T16:00:03.656137 #2728330] INFO -- : [375/885] 2769699=test_logperiod I, [2024-05-04T16:00:03.663799 #2728330] INFO -- : [376/885] 2769699=test_rdoc_markdown_test I, [2024-05-04T16:00:03.703716 #2728330] INFO -- : [377/885] 2769700=test_rdoc_normal_module I, [2024-05-04T16:00:03.772756 #2728330] INFO -- : [378/885] 2769691=test_c_union_entity I, [2024-05-04T16:00:03.802109 #2728330] INFO -- : [379/885] 2769700=test_passing_block I, [2024-05-04T16:00:03.807180 #2728330] INFO -- : [380/885] 2769700=test_thread_fd_close I, [2024-05-04T16:00:03.812392 #2728330] INFO -- : [381/885] 2769700=newline_test I, [2024-05-04T16:00:03.831096 #2728330] INFO -- : [382/885] 2769691=test_uncorrectable_name_check I, [2024-05-04T16:00:03.848238 #2728330] INFO -- : [383/885] 2769691=test_stringchar I, [2024-05-04T16:00:03.914521 #2728330] INFO -- : [384/885] 2769704=test_hash_create I, [2024-05-04T16:00:03.916942 #2728330] INFO -- : [385/885] 2769690=test_gem_security_policy I, [2024-05-04T16:00:03.918092 #2728330] INFO -- : [386/885] 2769704=test_gem_source_local I, [2024-05-04T16:00:03.921348 #2728330] INFO -- : [387/885] 2769696=test_last_thread I, [2024-05-04T16:00:03.963196 #2728330] INFO -- : [388/885] 2769700=test_process I, [2024-05-04T16:00:03.970863 #2728330] INFO -- : [389/885] 2769691=test_pack I, [2024-05-04T16:00:03.989996 #2728330] INFO -- : [390/885] 2769702=test_gem_resolver_lock_specification I, [2024-05-04T16:00:04.003546 #2728330] INFO -- : [391/885] 2769707=test_err_in_callback I, [2024-05-04T16:00:04.005773 #2728330] INFO -- : [392/885] 2769707=test_x509cert I, [2024-05-04T16:00:04.056106 #2728330] INFO -- : [393/885] 2769702=test_gc I, [2024-05-04T16:00:04.084200 #2728330] INFO -- : [394/885] 2769706=test_arity I, [2024-05-04T16:00:04.095852 #2728330] INFO -- : [395/885] 2769706=test_gem_ext_rake_builder I, [2024-05-04T16:00:04.129253 #2728330] INFO -- : [396/885] 2769704=test_logdevice I, [2024-05-04T16:00:04.203478 #2728330] INFO -- : [397/885] 2769691=test_cclass I, [2024-05-04T16:00:04.204029 #2728330] INFO -- : [398/885] 2769690=test_gem_version_option I, [2024-05-04T16:00:04.257567 #2728330] INFO -- : [399/885] 2769690=test_grapheme_breaks I, [2024-05-04T16:00:04.272186 #2728330] INFO -- : [400/885] 2769690=test_gem_request_connection_pools I, [2024-05-04T16:00:04.276495 #2728330] INFO -- : [401/885] 2769707=test_case I, [2024-05-04T16:00:04.277299 #2728330] INFO -- : [402/885] 2769707=test_pkey I, [2024-05-04T16:00:04.329398 #2728330] INFO -- : [403/885] 2769707=test_parser_events I, [2024-05-04T16:00:04.360370 #2728330] INFO -- : [404/885] 2769691=test_reline I, [2024-05-04T16:00:04.387029 #2728330] INFO -- : [405/885] 2769707=test_ansi_with_terminfo I, [2024-05-04T16:00:04.397798 #2728330] INFO -- : [406/885] 2769707=test_rdoc_generator_pot_po I, [2024-05-04T16:00:04.404238 #2728330] INFO -- : [407/885] 2769707=test_json_tree I, [2024-05-04T16:00:04.413564 #2728330] INFO -- : [408/885] 2769707=test_rdoc_markup_to_markdown I, [2024-05-04T16:00:04.448017 #2728330] INFO -- : [409/885] 2769699=test_memory_view I, [2024-05-04T16:00:04.462068 #2728330] INFO -- : [410/885] 2769707=test_m17n_comb I, [2024-05-04T16:00:04.482812 #2728330] INFO -- : [411/885] 2769691=test_ractor I, [2024-05-04T16:00:04.548469 #2728330] INFO -- : [412/885] 2769703=test_extlibs I, [2024-05-04T16:00:04.562032 #2728330] INFO -- : [413/885] 2769691=test_rdoc_generator_ri I, [2024-05-04T16:00:04.571500 #2728330] INFO -- : [414/885] 2769691=test_gem_stream_ui I, [2024-05-04T16:00:04.581809 #2728330] INFO -- : [415/885] 2769699=test_ractor I, [2024-05-04T16:00:04.597064 #2728330] INFO -- : [416/885] 2769699=test_severity I, [2024-05-04T16:00:04.600512 #2728330] INFO -- : [417/885] 2769699=test_gem_install_update_options I, [2024-05-04T16:00:04.696205 #2728330] INFO -- : [418/885] 2769691=parse_test I, [2024-05-04T16:00:04.738125 #2728330] INFO -- : [419/885] 2769699=test_require_lib I, [2024-05-04T16:00:04.830913 #2728330] INFO -- : [420/885] 2769706=test_rdoc_markup_to_table_of_contents I, [2024-05-04T16:00:04.859025 #2728330] INFO -- : [421/885] 2769706=test_objectspace I, [2024-05-04T16:00:04.978747 #2728330] INFO -- : [422/885] 2769696=test_thread I, [2024-05-04T16:00:05.020660 #2728330] INFO -- : [423/885] 2769704=test_socket I, [2024-05-04T16:00:05.133858 #2728330] INFO -- : [424/885] 2769694=test_literal I, [2024-05-04T16:00:05.194889 #2728330] INFO -- : [425/885] 2769696=test_dot_dot I, [2024-05-04T16:00:05.195253 #2728330] INFO -- : [426/885] 2769696=test_c_struct_builder I, [2024-05-04T16:00:05.291882 #2728330] INFO -- : [427/885] 2769696=test_str2big I, [2024-05-04T16:00:05.296624 #2728330] INFO -- : [428/885] 2769696=test_case_options I, [2024-05-04T16:00:05.301277 #2728330] INFO -- : [429/885] 2769696=test_store I, [2024-05-04T16:00:05.327999 #2728330] INFO -- : [430/885] 2769690=test_rdoc_cross_reference I, [2024-05-04T16:00:05.380424 #2728330] INFO -- : [431/885] 2769695=test_gem_commands_info_command I, [2024-05-04T16:00:05.412148 #2728330] INFO -- : [432/885] 2769695=test_scalar I, [2024-05-04T16:00:05.426738 #2728330] INFO -- : [433/885] 2769695=test_gem_dependency_installer I, [2024-05-04T16:00:05.511442 #2728330] INFO -- : [434/885] 2769696=test_bug_reporter I, [2024-05-04T16:00:05.608011 #2728330] INFO -- : [435/885] 2769694=test_gem_package_tar_reader_entry I, [2024-05-04T16:00:05.686935 #2728330] INFO -- : [436/885] 2769690=test_gem_name_tuple I, [2024-05-04T16:00:05.700229 #2728330] INFO -- : [437/885] 2769690=test_rand I, [2024-05-04T16:00:05.772701 #2728330] INFO -- : [438/885] 2769694=test_exception I, [2024-05-04T16:00:05.794093 #2728330] INFO -- : [439/885] 2769706=test_method_cache I, [2024-05-04T16:00:05.797380 #2728330] INFO -- : [440/885] 2769706=test_gem_request I, [2024-05-04T16:00:05.840646 #2728330] INFO -- : [441/885] 2769696=test_sprintf_comb I, [2024-05-04T16:00:05.962129 #2728330] INFO -- : [442/885] 2769706=test_gem_ext_cargo_builder_link_flag_converter I, [2024-05-04T16:00:06.012398 #2728330] INFO -- : [443/885] 2769706=test_gem_commands_mirror I, [2024-05-04T16:00:06.019560 #2728330] INFO -- : [444/885] 2769706=test_enumerator_kw I, [2024-05-04T16:00:06.030267 #2728330] INFO -- : [445/885] 2769706=test_settracefunc I, [2024-05-04T16:00:06.046991 #2728330] INFO -- : [446/885] 2769696=test_gem_text I, [2024-05-04T16:00:06.067238 #2728330] INFO -- : [447/885] 2769690=test_win32ole I, [2024-05-04T16:00:06.072074 #2728330] INFO -- : [448/885] 2769690=test_generic I, [2024-05-04T16:00:06.099126 #2728330] INFO -- : [449/885] 2769690=test_scan_args I, [2024-05-04T16:00:06.101847 #2728330] INFO -- : [450/885] 2769696=test_cgi_core I, [2024-05-04T16:00:06.106923 #2728330] INFO -- : [451/885] 2769690=test_parser I, [2024-05-04T16:00:06.115914 #2728330] INFO -- : [452/885] 2769696=test_registry I, [2024-05-04T16:00:06.117277 #2728330] INFO -- : [453/885] 2769690=parse_stream_test I, [2024-05-04T16:00:06.118217 #2728330] INFO -- : [454/885] 2769696=test_ractor I, [2024-05-04T16:00:06.128377 #2728330] INFO -- : [455/885] 2769690=test_dns I, [2024-05-04T16:00:06.135680 #2728330] INFO -- : [456/885] 2769696=test_gem_commands_open_command I, [2024-05-04T16:00:06.247436 #2728330] INFO -- : [457/885] 2769696=test_gem I, [2024-05-04T16:00:06.272270 #2728330] INFO -- : [458/885] 2769704=test_gem_source_lock I, [2024-05-04T16:00:06.321178 #2728330] INFO -- : [459/885] 2769704=test_ssl I, [2024-05-04T16:00:06.374738 #2728330] INFO -- : [460/885] 2769697=test_ractor I, [2024-05-04T16:00:06.474944 #2728330] INFO -- : [461/885] 2769693=test_rendering I, [2024-05-04T16:00:06.477355 #2728330] INFO -- : [462/885] 2769703=test_debugger_integration I, [2024-05-04T16:00:06.487027 #2728330] INFO -- : [463/885] 2769703=test_my_integer I, [2024-05-04T16:00:06.492373 #2728330] INFO -- : [464/885] 2769703=test_thread I, [2024-05-04T16:00:06.548112 #2728330] INFO -- : [465/885] 2769693=json_ext_parser_test I, [2024-05-04T16:00:06.564069 #2728330] INFO -- : [466/885] 2769690=test_nonblock I, [2024-05-04T16:00:06.566636 #2728330] INFO -- : [467/885] 2769693=test_weakref I, [2024-05-04T16:00:06.595939 #2728330] INFO -- : [468/885] 2769690=test_marshal I, [2024-05-04T16:00:06.737543 #2728330] INFO -- : [469/885] 2769693=test_unicode_normalize I, [2024-05-04T16:00:06.774476 #2728330] INFO -- : [470/885] 2769697=test_timeout I, [2024-05-04T16:00:06.859856 #2728330] INFO -- : [471/885] 2769704=test_alias I, [2024-05-04T16:00:06.915113 #2728330] INFO -- : [472/885] 2769707=test_singleton_function I, [2024-05-04T16:00:06.918867 #2728330] INFO -- : [473/885] 2769707=test_ancdata I, [2024-05-04T16:00:06.945967 #2728330] INFO -- : [474/885] 2769707=test_reline_key I, [2024-05-04T16:00:06.950028 #2728330] INFO -- : [475/885] 2769707=test_rb_str_dup I, [2024-05-04T16:00:06.955052 #2728330] INFO -- : [476/885] 2769707=test_integer I, [2024-05-04T16:00:07.041363 #2728330] INFO -- : [477/885] 2769704=test_cgi_modruby I, [2024-05-04T16:00:07.072828 #2728330] INFO -- : [478/885] 2769704=test_rubyoptions I, [2024-05-04T16:00:07.148014 #2728330] INFO -- : [479/885] 2769706=test_super I, [2024-05-04T16:00:07.415086 #2728330] INFO -- : [480/885] 2769695=test_rubygems I, [2024-05-04T16:00:07.458171 #2728330] INFO -- : [481/885] 2769690=test_call I, [2024-05-04T16:00:07.575326 #2728330] INFO -- : [482/885] 2769690=test_https_proxy I, [2024-05-04T16:00:07.617445 #2728330] INFO -- : [483/885] 2769695=test_capacity I, [2024-05-04T16:00:07.619954 #2728330] INFO -- : [484/885] 2769695=test_nextafter I, [2024-05-04T16:00:07.624871 #2728330] INFO -- : [485/885] 2769690=test_have_func I, [2024-05-04T16:00:07.658412 #2728330] INFO -- : [486/885] 2769697=test_gem_request_set_lockfile_tokenizer I, [2024-05-04T16:00:07.712130 #2728330] INFO -- : [487/885] 2769697=test_stat I, [2024-05-04T16:00:07.713578 #2728330] INFO -- : [488/885] 2769695=test_gem_resolver_git_specification I, [2024-05-04T16:00:07.718896 #2728330] INFO -- : [489/885] 2769697=test_usrmarshal I, [2024-05-04T16:00:07.767506 #2728330] INFO -- : [490/885] 2769691=test_object_references I, [2024-05-04T16:00:07.781215 #2728330] INFO -- : [491/885] 2769691=test_rdoc_attr I, [2024-05-04T16:00:07.796391 #2728330] INFO -- : [492/885] 2769691=test_env I, [2024-05-04T16:00:07.861217 #2728330] INFO -- : [493/885] 2769706=test_integer I, [2024-05-04T16:00:07.917179 #2728330] INFO -- : [494/885] 2769706=desugar_compiler_test I, [2024-05-04T16:00:07.932673 #2728330] INFO -- : [495/885] 2769706=test_dryrun I, [2024-05-04T16:00:07.934917 #2728330] INFO -- : [496/885] 2769697=test_gem_commands_setup_command I, [2024-05-04T16:00:07.959826 #2728330] INFO -- : [497/885] 2769706=test_date_ractor I, [2024-05-04T16:00:08.021794 #2728330] INFO -- : [498/885] 2769695=test_gem_console_ui I, [2024-05-04T16:00:08.029981 #2728330] INFO -- : [499/885] 2769695=format_errors_test I, [2024-05-04T16:00:08.097974 #2728330] INFO -- : [500/885] 2769695=test_dir I, [2024-05-04T16:00:08.163985 #2728330] INFO -- : [501/885] 2769694=test_eval I, [2024-05-04T16:00:08.174885 #2728330] INFO -- : [502/885] 2769694=test_autoconf I, [2024-05-04T16:00:08.190591 #2728330] INFO -- : [503/885] 2769694=test_ractor_compatibility I, [2024-05-04T16:00:08.197957 #2728330] INFO -- : [504/885] 2769706=test_cgi_multipart I, [2024-05-04T16:00:08.333220 #2728330] INFO -- : [505/885] 2769696=test_gem_commands_cleanup_command I, [2024-05-04T16:00:08.333534 #2728330] INFO -- : [506/885] 2769695=test_word I, [2024-05-04T16:00:08.341862 #2728330] INFO -- : [507/885] 2769695=test_member I, [2024-05-04T16:00:08.346396 #2728330] INFO -- : [508/885] 2769695=test_numeric I, [2024-05-04T16:00:08.356436 #2728330] INFO -- : [509/885] 2769695=test_http_request I, [2024-05-04T16:00:08.397601 #2728330] INFO -- : [510/885] 2769706=test_gem_source_fetch_problem I, [2024-05-04T16:00:08.410485 #2728330] INFO -- : [511/885] 2769706=json_generic_object_test I, [2024-05-04T16:00:08.418324 #2728330] INFO -- : [512/885] 2769695=test_rdoc_comment I, [2024-05-04T16:00:08.431508 #2728330] INFO -- : [513/885] 2769706=test_error_highlight I, [2024-05-04T16:00:08.468829 #2728330] INFO -- : [514/885] 2769705=test_resize I, [2024-05-04T16:00:08.498688 #2728330] INFO -- : [515/885] 2769705=test_rdoc_generator_darkfish I, [2024-05-04T16:00:08.507684 #2728330] INFO -- : [516/885] 2769695=test_mailto I, [2024-05-04T16:00:08.512793 #2728330] INFO -- : [517/885] 2769697=location_test I, [2024-05-04T16:00:08.517578 #2728330] INFO -- : [518/885] 2769695=test_symbol I, [2024-05-04T16:00:08.528394 #2728330] INFO -- : [519/885] 2769695=test_coderange I, [2024-05-04T16:00:08.529597 #2728330] INFO -- : [520/885] 2769699=test_arith_seq_beg_len_step I, [2024-05-04T16:00:08.531490 #2728330] INFO -- : [521/885] 2769695=test_gem_resolver_requirement_list I, [2024-05-04T16:00:08.535702 #2728330] INFO -- : [522/885] 2769695=test_pkcs7 I, [2024-05-04T16:00:08.557924 #2728330] INFO -- : [523/885] 2769697=test_function_entry I, [2024-05-04T16:00:08.562230 #2728330] INFO -- : [524/885] 2769697=test_context I, [2024-05-04T16:00:08.611756 #2728330] INFO -- : [525/885] 2769699=test_gem_commands_pristine_command I, [2024-05-04T16:00:08.655695 #2728330] INFO -- : [526/885] 2769694=test_nofree I, [2024-05-04T16:00:08.666733 #2728330] INFO -- : [527/885] 2769694=test_coder I, [2024-05-04T16:00:08.710652 #2728330] INFO -- : [528/885] 2769694=test_symbol I, [2024-05-04T16:00:08.712592 #2728330] INFO -- : [529/885] 2769695=test_find_executable I, [2024-05-04T16:00:08.723422 #2728330] INFO -- : [530/885] 2769695=ruby_api_test I, [2024-05-04T16:00:08.781226 #2728330] INFO -- : [531/885] 2769697=test_enc_associate I, [2024-05-04T16:00:08.882663 #2728330] INFO -- : [532/885] 2769706=test_lazy_enumerator I, [2024-05-04T16:00:08.891102 #2728330] INFO -- : [533/885] 2769695=test_unix I, [2024-05-04T16:00:08.894459 #2728330] INFO -- : [534/885] 2769705=test_stringio I, [2024-05-04T16:00:08.955659 #2728330] INFO -- : [535/885] 2769696=test_arity I, [2024-05-04T16:00:08.962999 #2728330] INFO -- : [536/885] 2769696=test_io_wait_uncommon I, [2024-05-04T16:00:08.971650 #2728330] INFO -- : [537/885] 2769696=test_win32ole_variable I, [2024-05-04T16:00:08.976677 #2728330] INFO -- : [538/885] 2769696=test_rdoc_class_module I, [2024-05-04T16:00:08.996981 #2728330] INFO -- : [539/885] 2769695=test_bignum I, [2024-05-04T16:00:09.051594 #2728330] INFO -- : [540/885] 2769705=test_gem_ci_detector I, [2024-05-04T16:00:09.053784 #2728330] INFO -- : [541/885] 2769705=test_win32ole_event I, [2024-05-04T16:00:09.072639 #2728330] INFO -- : [542/885] 2769705=test_time_tz I, [2024-05-04T16:00:09.106327 #2728330] INFO -- : [543/885] 2769705=test_rdoc_generator_json_index I, [2024-05-04T16:00:09.131196 #2728330] INFO -- : [544/885] 2769705=test_trace I, [2024-05-04T16:00:09.148722 #2728330] INFO -- : [545/885] 2769695=ractor_test I, [2024-05-04T16:00:09.151715 #2728330] INFO -- : [546/885] 2769705=test_gem_package I, [2024-05-04T16:00:09.228090 #2728330] INFO -- : [547/885] 2769695=test_complex2 I, [2024-05-04T16:00:09.236457 #2728330] INFO -- : [548/885] 2769695=test_resolve_symbol I, [2024-05-04T16:00:09.257172 #2728330] INFO -- : [549/885] 2769707=test_have_macro I, [2024-05-04T16:00:09.311056 #2728330] INFO -- : [550/885] 2769695=test_threadgroup I, [2024-05-04T16:00:09.382000 #2728330] INFO -- : [551/885] 2769697=test_enum I, [2024-05-04T16:00:09.383580 #2728330] INFO -- : [552/885] 2769706=test_gem_specification I, [2024-05-04T16:00:09.401303 #2728330] INFO -- : [553/885] 2769690=test_rdoc_extend I, [2024-05-04T16:00:09.412621 #2728330] INFO -- : [554/885] 2769690=test_merge_keys I, [2024-05-04T16:00:09.437301 #2728330] INFO -- : [555/885] 2769690=test_gem_resolver_api_specification I, [2024-05-04T16:00:09.494592 #2728330] INFO -- : [556/885] 2769690=test_mixed_unicode_escapes I, [2024-05-04T16:00:09.498348 #2728330] INFO -- : [557/885] 2769690=test_history I, [2024-05-04T16:00:09.509964 #2728330] INFO -- : [558/885] 2769690=test_rdoc_markup_to_ansi I, [2024-05-04T16:00:09.585799 #2728330] INFO -- : [559/885] 2769690=test_ipaddr I, [2024-05-04T16:00:09.606893 #2728330] INFO -- : [560/885] 2769690=test_win32ole_variant I, [2024-05-04T16:00:09.618124 #2728330] INFO -- : [561/885] 2769690=version_test I, [2024-05-04T16:00:09.619727 #2728330] INFO -- : [562/885] 2769690=test_object I, [2024-05-04T16:00:09.624952 #2728330] INFO -- : [563/885] 2769690=test_cgi_header I, [2024-05-04T16:00:09.634156 #2728330] INFO -- : [564/885] 2769696=heredoc_dedent_test I, [2024-05-04T16:00:09.638755 #2728330] INFO -- : [565/885] 2769708=test_arithmetic_sequence I, [2024-05-04T16:00:09.642579 #2728330] INFO -- : [566/885] 2769696=test_gem_command_manager I, [2024-05-04T16:00:09.647586 #2728330] INFO -- : [567/885] 2769708=test_basicinstructions I, [2024-05-04T16:00:09.655008 #2728330] INFO -- : [568/885] 2769690=test_gem_gemcutter_utilities I, [2024-05-04T16:00:09.776611 #2728330] INFO -- : [569/885] 2769708=test_key_actor_emacs I, [2024-05-04T16:00:09.803051 #2728330] INFO -- : [570/885] 2769707=test_sleep I, [2024-05-04T16:00:09.831609 #2728330] INFO -- : [571/885] 2769696=test_gem_local_remote_options I, [2024-05-04T16:00:09.882278 #2728330] INFO -- : [572/885] 2769705=test_date_arith I, [2024-05-04T16:00:09.891625 #2728330] INFO -- : [573/885] 2769705=test_object I, [2024-05-04T16:00:09.893877 #2728330] INFO -- : [574/885] 2769696=test_ruby_lex I, [2024-05-04T16:00:09.943387 #2728330] INFO -- : [575/885] 2769708=test_normalize I, [2024-05-04T16:00:09.960295 #2728330] INFO -- : [576/885] 2769708=test_ossl I, [2024-05-04T16:00:09.993272 #2728330] INFO -- : [577/885] 2769696=test_timeout I, [2024-05-04T16:00:10.000386 #2728330] INFO -- : [578/885] 2769696=test_flip I, [2024-05-04T16:00:10.004184 #2728330] INFO -- : [579/885] 2769690=compiler_test I, [2024-05-04T16:00:10.012276 #2728330] INFO -- : [580/885] 2769690=test_change_word I, [2024-05-04T16:00:10.015318 #2728330] INFO -- : [581/885] 2769690=test_tsort I, [2024-05-04T16:00:10.027696 #2728330] INFO -- : [582/885] 2769690=test_signedness I, [2024-05-04T16:00:10.036413 #2728330] INFO -- : [583/885] 2769696=test_rdoc_rd_block_parser I, [2024-05-04T16:00:10.060201 #2728330] INFO -- : [584/885] 2769696=test_big5 I, [2024-05-04T16:00:10.065760 #2728330] INFO -- : [585/885] 2769696=test_func I, [2024-05-04T16:00:10.118431 #2728330] INFO -- : [586/885] 2769698=test_pointer I, [2024-05-04T16:00:10.214451 #2728330] INFO -- : [587/885] 2769699=test_type I, [2024-05-04T16:00:10.219438 #2728330] INFO -- : [588/885] 2769699=test_ractor I, [2024-05-04T16:00:10.303661 #2728330] INFO -- : [589/885] 2769699=test_gem_platform I, [2024-05-04T16:00:10.306427 #2728330] INFO -- : [590/885] 2769697=test_rdoc_markup_hard_break I, [2024-05-04T16:00:10.326928 #2728330] INFO -- : [591/885] 2769695=test_gem_package_task I, [2024-05-04T16:00:10.333058 #2728330] INFO -- : [592/885] 2769695=test_date_strptime I, [2024-05-04T16:00:10.335522 #2728330] INFO -- : [593/885] 2769705=test_placearg I, [2024-05-04T16:00:10.345976 #2728330] INFO -- : [594/885] 2769692=test_numhash I, [2024-05-04T16:00:10.350138 #2728330] INFO -- : [595/885] 2769692=test_gem_commands_push_command I, [2024-05-04T16:00:10.402710 #2728330] INFO -- : [596/885] 2769699=test_weakkeymap I, [2024-05-04T16:00:10.435159 #2728330] INFO -- : [597/885] 2769705=test_pkey_rsa I, [2024-05-04T16:00:10.474926 #2728330] INFO -- : [598/885] 2769697=test_keyword I, [2024-05-04T16:00:10.501088 #2728330] INFO -- : [599/885] 2769695=test_class_name_check I, [2024-05-04T16:00:10.559505 #2728330] INFO -- : [600/885] 2769695=test_continuation I, [2024-05-04T16:00:10.570385 #2728330] INFO -- : [601/885] 2769695=test_fd_setsize I, [2024-05-04T16:00:10.573057 #2728330] INFO -- : [602/885] 2769695=test_win32ole_method I, [2024-05-04T16:00:10.575115 #2728330] INFO -- : [603/885] 2769695=test_delete I, [2024-05-04T16:00:10.585120 #2728330] INFO -- : [604/885] 2769695=test_logger I, [2024-05-04T16:00:10.603944 #2728330] INFO -- : [605/885] 2769699=test_files_test I, [2024-05-04T16:00:10.605059 #2728330] INFO -- : [606/885] 2769695=test_gem_update_suggestion I, [2024-05-04T16:00:10.643196 #2728330] INFO -- : [607/885] 2769694=test_file_exhaustive I, [2024-05-04T16:00:10.689722 #2728330] INFO -- : [608/885] 2769695=test_rdoc_parser_markdown I, [2024-05-04T16:00:10.692776 #2728330] INFO -- : [609/885] 2769698=test_gem_resolver_lock_set I, [2024-05-04T16:00:10.703908 #2728330] INFO -- : [610/885] 2769695=test_not I, [2024-05-04T16:00:10.718561 #2728330] INFO -- : [611/885] 2769699=test_import I, [2024-05-04T16:00:10.718876 #2728330] INFO -- : [612/885] 2769695=test_gem_resolver_api_set I, [2024-05-04T16:00:10.719092 #2728330] INFO -- : [613/885] 2769698=test_gem_safe_marshal I, [2024-05-04T16:00:10.735601 #2728330] INFO -- : [614/885] 2769705=test_enumerable I, [2024-05-04T16:00:10.745539 #2728330] INFO -- : [615/885] 2769705=test_gem_resolver_vendor_set I, [2024-05-04T16:00:10.765494 #2728330] INFO -- : [616/885] 2769705=test_config I, [2024-05-04T16:00:10.779486 #2728330] INFO -- : [617/885] 2769695=json_generator_test I, [2024-05-04T16:00:10.784021 #2728330] INFO -- : [618/885] 2769701=test_eval I, [2024-05-04T16:00:10.845777 #2728330] INFO -- : [619/885] 2769692=test_transcode I, [2024-05-04T16:00:10.849140 #2728330] INFO -- : [620/885] 2769695=test_fips I, [2024-05-04T16:00:10.961767 #2728330] INFO -- : [621/885] 2769691=test_x509name I, [2024-05-04T16:00:10.972522 #2728330] INFO -- : [622/885] 2769691=test_update I, [2024-05-04T16:00:10.981227 #2728330] INFO -- : [623/885] 2769691=test_x509store I, [2024-05-04T16:00:11.002579 #2728330] INFO -- : [624/885] 2769701=test_rdoc_code_object I, [2024-05-04T16:00:11.029193 #2728330] INFO -- : [625/885] 2769692=test_webauthn_listener I, [2024-05-04T16:00:11.065187 #2728330] INFO -- : [626/885] 2769692=test_jaro_winkler I, [2024-05-04T16:00:11.072744 #2728330] INFO -- : [627/885] 2769692=test_random_formatter I, [2024-05-04T16:00:11.093152 #2728330] INFO -- : [628/885] 2769692=test_helper I, [2024-05-04T16:00:11.095353 #2728330] INFO -- : [629/885] 2769695=test_lambda I, [2024-05-04T16:00:11.114073 #2728330] INFO -- : [630/885] 2769697=test_ast I, [2024-05-04T16:00:11.143239 #2728330] INFO -- : [631/885] 2769692=test_gem_request_set_gem_dependency_api I, [2024-05-04T16:00:11.186356 #2728330] INFO -- : [632/885] 2769695=test_tmpdir I, [2024-05-04T16:00:11.208586 #2728330] INFO -- : [633/885] 2769705=test_integer_comb I, [2024-05-04T16:00:11.283729 #2728330] INFO -- : [634/885] 2769695=test_rdoc_markup_document I, [2024-05-04T16:00:11.292476 #2728330] INFO -- : [635/885] 2769695=test_vm_dump I, [2024-05-04T16:00:11.292538 #2728330] INFO -- : [636/885] 2769695=test_regexp I, [2024-05-04T16:00:11.296541 #2728330] INFO -- : [637/885] 2769701=test_gem_commands_check_command I, [2024-05-04T16:00:11.315895 #2728330] INFO -- : [638/885] 2769701=errors_test I, [2024-05-04T16:00:11.319968 #2728330] INFO -- : [639/885] 2769702=static_inspect_test I, [2024-05-04T16:00:11.363950 #2728330] INFO -- : [640/885] 2769692=test_udp I, [2024-05-04T16:00:11.367035 #2728330] INFO -- : [641/885] 2769692=unescape_test I, [2024-05-04T16:00:11.384875 #2728330] INFO -- : [642/885] 2769691=test_ostruct I, [2024-05-04T16:00:11.417261 #2728330] INFO -- : [643/885] 2769702=test_force_exit I, [2024-05-04T16:00:11.422258 #2728330] INFO -- : [644/885] 2769702=test_file I, [2024-05-04T16:00:11.482561 #2728330] INFO -- : [645/885] 2769701=test_data_error I, [2024-05-04T16:00:11.485861 #2728330] INFO -- : [646/885] 2769698=bom_test I, [2024-05-04T16:00:11.529146 #2728330] INFO -- : [647/885] 2769693=test_dup I, [2024-05-04T16:00:11.556583 #2728330] INFO -- : [648/885] 2769691=test_pty I, [2024-05-04T16:00:11.568323 #2728330] INFO -- : [649/885] 2769701=test_constant I, [2024-05-04T16:00:11.579957 #2728330] INFO -- : [650/885] 2769698=command_line_test I, [2024-05-04T16:00:11.583061 #2728330] INFO -- : [651/885] 2769698=test_range I, [2024-05-04T16:00:11.750136 #2728330] INFO -- : [652/885] 2769699=test_project_sanity I, [2024-05-04T16:00:11.758842 #2728330] INFO -- : [653/885] 2769693=test_encoding I, [2024-05-04T16:00:11.807400 #2728330] INFO -- : [654/885] 2769706=test_erb_command I, [2024-05-04T16:00:11.816798 #2728330] INFO -- : [655/885] 2769699=test_helper I, [2024-05-04T16:00:11.833707 #2728330] INFO -- : [656/885] 2769699=test_gem_uri_formatter I, [2024-05-04T16:00:11.839299 #2728330] INFO -- : [657/885] 2769706=library_symbols_test I, [2024-05-04T16:00:11.842969 #2728330] INFO -- : [658/885] 2769706=test_addr I, [2024-05-04T16:00:11.851453 #2728330] INFO -- : [659/885] 2769699=test_locale I, [2024-05-04T16:00:11.859314 #2728330] INFO -- : [660/885] 2769709=test_ensured I, [2024-05-04T16:00:11.886604 #2728330] INFO -- : [661/885] 2769706=test_ts I, [2024-05-04T16:00:11.929886 #2728330] INFO -- : [662/885] 2769709=test_rdoc_ri_paths I, [2024-05-04T16:00:11.949619 #2728330] INFO -- : [663/885] 2769709=test_rdoc_markup_to_bs I, [2024-05-04T16:00:11.968674 #2728330] INFO -- : [664/885] 2769699=test_help I, [2024-05-04T16:00:11.973540 #2728330] INFO -- : [665/885] 2769699=test_beginendblock I, [2024-05-04T16:00:12.000087 #2728330] INFO -- : [666/885] 2769709=test_files_lib I, [2024-05-04T16:00:12.009854 #2728330] INFO -- : [667/885] 2769693=test_gem_commands_unpack_command I, [2024-05-04T16:00:12.097041 #2728330] INFO -- : [668/885] 2769691=reflection_test I, [2024-05-04T16:00:12.132460 #2728330] INFO -- : [669/885] 2769691=test_within_pipe I, [2024-05-04T16:00:12.149453 #2728330] INFO -- : [670/885] 2769691=test_emoji_breaks I, [2024-05-04T16:00:12.159310 #2728330] INFO -- : [671/885] 2769691=test_gem_bundler_version_finder I, [2024-05-04T16:00:12.183599 #2728330] INFO -- : [672/885] 2769691=test_pinned I, [2024-05-04T16:00:12.259352 #2728330] INFO -- : [673/885] 2769691=test_stream I, [2024-05-04T16:00:12.263573 #2728330] INFO -- : [674/885] 2769691=test_to_ary_concat I, [2024-05-04T16:00:12.275972 #2728330] INFO -- : [675/885] 2769698=test_webauthn_listener_response I, [2024-05-04T16:00:12.292462 #2728330] INFO -- : [676/885] 2769693=test_time I, [2024-05-04T16:00:12.299844 #2728330] INFO -- : [677/885] 2769698=test_printf I, [2024-05-04T16:00:12.318053 #2728330] INFO -- : [678/885] 2769698=test_rdoc_markup_pre_process I, [2024-05-04T16:00:12.329901 #2728330] INFO -- : [679/885] 2769706=test_exit I, [2024-05-04T16:00:12.385764 #2728330] INFO -- : [680/885] 2769699=test_recursion I, [2024-05-04T16:00:12.390411 #2728330] INFO -- : [681/885] 2769699=test_mkmf I, [2024-05-04T16:00:12.402532 #2728330] INFO -- : [682/885] 2769706=test_date_marshal I, [2024-05-04T16:00:12.405536 #2728330] INFO -- : [683/885] 2769706=test_history I, [2024-05-04T16:00:12.417747 #2728330] INFO -- : [684/885] 2769698=test_popen_deadlock I, [2024-05-04T16:00:12.434038 #2728330] INFO -- : [685/885] 2769699=test_delegate I, [2024-05-04T16:00:12.438392 #2728330] INFO -- : [686/885] 2769690=test_closure I, [2024-05-04T16:00:12.456727 #2728330] INFO -- : [687/885] 2769699=test_bundled_ca I, [2024-05-04T16:00:12.465674 #2728330] INFO -- : [688/885] 2769693=test_open3 I, [2024-05-04T16:00:12.469795 #2728330] INFO -- : [689/885] 2769692=test_multi_irb_commands I, [2024-05-04T16:00:12.469964 #2728330] INFO -- : [690/885] 2769692=test_fiber I, [2024-05-04T16:00:12.546820 #2728330] INFO -- : [691/885] 2769706=test_gem_security I, [2024-05-04T16:00:12.716064 #2728330] INFO -- : [692/885] 2769696=test_rdoc_servlet I, [2024-05-04T16:00:12.872400 #2728330] INFO -- : [693/885] 2769696=test_ractor I, [2024-05-04T16:00:12.873898 #2728330] INFO -- : [694/885] 2769690=test_digest I, [2024-05-04T16:00:12.902965 #2728330] INFO -- : [695/885] 2769690=test_case_comprehensive I, [2024-05-04T16:00:12.935675 #2728330] INFO -- : [696/885] 2769696=test_interned_str I, [2024-05-04T16:00:12.947258 #2728330] INFO -- : [697/885] 2769696=test_gem_commands_build_command I, [2024-05-04T16:00:13.045130 #2728330] INFO -- : [698/885] 2769698=test_tracer I, [2024-05-04T16:00:13.155612 #2728330] INFO -- : [699/885] 2769698=test_cmethod I, [2024-05-04T16:00:13.160100 #2728330] INFO -- : [700/885] 2769698=test_option I, [2024-05-04T16:00:13.238544 #2728330] INFO -- : [701/885] 2769696=test_append I, [2024-05-04T16:00:13.247925 #2728330] INFO -- : [702/885] 2769696=test_gem_commands_server_command I, [2024-05-04T16:00:13.248871 #2728330] INFO -- : [703/885] 2769696=test_did_you_mean I, [2024-05-04T16:00:13.280508 #2728330] INFO -- : [704/885] 2769691=test_io_m17n I, [2024-05-04T16:00:13.299207 #2728330] INFO -- : [705/885] 2769698=test_variable_name_check I, [2024-05-04T16:00:13.333229 #2728330] INFO -- : [706/885] 2769698=test_rdoc_markup_heading I, [2024-05-04T16:00:13.342559 #2728330] INFO -- : [707/885] 2769698=test_exception_at_throwing I, [2024-05-04T16:00:13.371824 #2728330] INFO -- : [708/885] 2769705=test_iseq I, [2024-05-04T16:00:13.381539 #2728330] INFO -- : [709/885] 2769696=test_scheduler I, [2024-05-04T16:00:13.387552 #2728330] INFO -- : [710/885] 2769698=test_pkey_dsa I, [2024-05-04T16:00:13.560434 #2728330] INFO -- : [711/885] 2769696=test_ocsp I, [2024-05-04T16:00:13.820769 #2728330] INFO -- : [712/885] 2769696=test_class I, [2024-05-04T16:00:13.823723 #2728330] INFO -- : [713/885] 2769696=test_terminfo I, [2024-05-04T16:00:13.839865 #2728330] INFO -- : [714/885] 2769696=test_compile_prism I, [2024-05-04T16:00:13.844878 #2728330] INFO -- : [715/885] 2769699=test_rdoc_markup_to_html I, [2024-05-04T16:00:13.941871 #2728330] INFO -- : [716/885] 2769699=test_date_compat I, [2024-05-04T16:00:13.953885 #2728330] INFO -- : [717/885] 2769699=test_bug-14834 I, [2024-05-04T16:00:14.026791 #2728330] INFO -- : [718/885] 2769699=test_addrinfo I, [2024-05-04T16:00:14.036692 #2728330] INFO -- : [719/885] 2769705=test_http I, [2024-05-04T16:00:14.057557 #2728330] INFO -- : [720/885] 2769699=test_tree_spell_checker I, [2024-05-04T16:00:14.089164 #2728330] INFO -- : [721/885] 2769699=redundant_return_test I, [2024-05-04T16:00:14.093721 #2728330] INFO -- : [722/885] 2769699=test_case_mapping I, [2024-05-04T16:00:14.105993 #2728330] INFO -- : [723/885] 2769699=test_path I, [2024-05-04T16:00:14.120547 #2728330] INFO -- : [724/885] 2769701=test_win32ole_param_event I, [2024-05-04T16:00:14.124036 #2728330] INFO -- : [725/885] 2769701=test_bn I, [2024-05-04T16:00:14.131912 #2728330] INFO -- : [726/885] 2769699=test_unicode I, [2024-05-04T16:00:14.135996 #2728330] INFO -- : [727/885] 2769699=test_rdoc_parser_changelog I, [2024-05-04T16:00:14.144656 #2728330] INFO -- : [728/885] 2769701=test_enumerator I, [2024-05-04T16:00:14.149541 #2728330] INFO -- : [729/885] 2769701=test_koi8 I, [2024-05-04T16:00:14.156979 #2728330] INFO -- : [730/885] 2769701=parameters_signature_test I, [2024-05-04T16:00:14.164474 #2728330] INFO -- : [731/885] 2769701=test_rdoc_generator_pot I, [2024-05-04T16:00:14.170221 #2728330] INFO -- : [732/885] 2769701=static_literals_test I, [2024-05-04T16:00:14.175374 #2728330] INFO -- : [733/885] 2769701=test_data I, [2024-05-04T16:00:14.180010 #2728330] INFO -- : [734/885] 2769701=test_filter I, [2024-05-04T16:00:14.195315 #2728330] INFO -- : [735/885] 2769699=test_gem_gem_runner I, [2024-05-04T16:00:14.213894 #2728330] INFO -- : [736/885] 2769701=test_rdoc_method_attr I, [2024-05-04T16:00:14.222912 #2728330] INFO -- : [737/885] 2769696=test_notimplement I, [2024-05-04T16:00:14.224577 #2728330] INFO -- : [738/885] 2769696=test_random I, [2024-05-04T16:00:14.238115 #2728330] INFO -- : [739/885] 2769696=test_gem_uri I, [2024-05-04T16:00:14.250131 #2728330] INFO -- : [740/885] 2769699=test_key_event_record I, [2024-05-04T16:00:14.253034 #2728330] INFO -- : [741/885] 2769699=test_gem_resolver_vendor_specification I, [2024-05-04T16:00:14.263883 #2728330] INFO -- : [742/885] 2769696=test_gem_commands_update_command I, [2024-05-04T16:00:14.294818 #2728330] INFO -- : [743/885] 2769699=test_ssl_session I, [2024-05-04T16:00:14.346694 #2728330] INFO -- : [744/885] 2769701=test_thread_cv I, [2024-05-04T16:00:14.601823 #2728330] INFO -- : [745/885] 2769691=test_lexer I, [2024-05-04T16:00:14.620510 #2728330] INFO -- : [746/885] 2769691=test_rbconfig I, [2024-05-04T16:00:14.641023 #2728330] INFO -- : [747/885] 2769691=test_human_typo I, [2024-05-04T16:00:14.649289 #2728330] INFO -- : [748/885] 2769691=test_primitive I, [2024-05-04T16:00:14.657674 #2728330] INFO -- : [749/885] 2769691=test_rdoc_i18n_locale I, [2024-05-04T16:00:14.666876 #2728330] INFO -- : [750/885] 2769691=test_chilled I, [2024-05-04T16:00:14.671833 #2728330] INFO -- : [751/885] 2769691=test_name_error_extension I, [2024-05-04T16:00:14.680642 #2728330] INFO -- : [752/885] 2769691=test_pair I, [2024-05-04T16:00:14.824551 #2728330] INFO -- : [753/885] 2769707=test_win32ole_param I, [2024-05-04T16:00:14.825061 #2728330] INFO -- : [754/885] 2769707=test_gem_commands_yank_command I, [2024-05-04T16:00:14.978450 #2728330] INFO -- : [755/885] 2769693=test_acceptable I, [2024-05-04T16:00:14.984548 #2728330] INFO -- : [756/885] 2769701=test_euc_jp I, [2024-05-04T16:00:14.994846 #2728330] INFO -- : [757/885] 2769701=test_rdoc_generator_pot_po_entry I, [2024-05-04T16:00:15.000945 #2728330] INFO -- : [758/885] 2769701=test_document I, [2024-05-04T16:00:15.012882 #2728330] INFO -- : [759/885] 2769701=test_rdoc_markup_to_label I, [2024-05-04T16:00:15.053378 #2728330] INFO -- : [760/885] 2769701=test_install I, [2024-05-04T16:00:15.076214 #2728330] INFO -- : [761/885] 2769709=test_sockopt I, [2024-05-04T16:00:15.081159 #2728330] INFO -- : [762/885] 2769709=test_set_len I, [2024-05-04T16:00:15.093126 #2728330] INFO -- : [763/885] 2769709=test_encoding I, [2024-05-04T16:00:15.102669 #2728330] INFO -- : [764/885] 2769709=test_httpresponses I, [2024-05-04T16:00:15.131953 #2728330] INFO -- : [765/885] 2769693=test_rdoc_ri_driver I, [2024-05-04T16:00:15.173770 #2728330] INFO -- : [766/885] 2769709=test_httpheader I, [2024-05-04T16:00:15.194122 #2728330] INFO -- : [767/885] 2769709=test_gem_resolver_local_specification I, [2024-05-04T16:00:15.208103 #2728330] INFO -- : [768/885] 2769709=json_encoding_test I, [2024-05-04T16:00:15.227264 #2728330] INFO -- : [769/885] 2769709=test_color I, [2024-05-04T16:00:15.264605 #2728330] INFO -- : [770/885] 2769701=test_key_stroke I, [2024-05-04T16:00:15.316770 #2728330] INFO -- : [771/885] 2769707=test_scalar_scanner I, [2024-05-04T16:00:15.319129 #2728330] INFO -- : [772/885] 2769701=test_gem_source I, [2024-05-04T16:00:15.331269 #2728330] INFO -- : [773/885] 2769707=test_array I, [2024-05-04T16:00:15.349978 #2728330] INFO -- : [774/885] 2769709=test_gem_package_tar_writer I, [2024-05-04T16:00:15.383498 #2728330] INFO -- : [775/885] 2769698=test_helper_method I, [2024-05-04T16:00:15.391615 #2728330] INFO -- : [776/885] 2769698=test_gem_commands_outdated_command I, [2024-05-04T16:00:15.421774 #2728330] INFO -- : [777/885] 2769698=test_benchmark I, [2024-05-04T16:00:15.436832 #2728330] INFO -- : [778/885] 2769699=test_gem_dependency_list I, [2024-05-04T16:00:15.447235 #2728330] INFO -- : [779/885] 2769709=test_nesting_parser I, [2024-05-04T16:00:15.482701 #2728330] INFO -- : [780/885] 2769696=test_win32ole_method_event I, [2024-05-04T16:00:15.488046 #2728330] INFO -- : [781/885] 2769696=test_gem_ext_builder I, [2024-05-04T16:00:15.501170 #2728330] INFO -- : [782/885] 2769709=test_https I, [2024-05-04T16:00:15.520906 #2728330] INFO -- : [783/885] 2769699=test_evaluation I, [2024-05-04T16:00:15.521634 #2728330] INFO -- : [784/885] 2769699=test_provider I, [2024-05-04T16:00:15.602308 #2728330] INFO -- : [785/885] 2769701=test_abi I, [2024-05-04T16:00:15.620696 #2728330] INFO -- : [786/885] 2769703=test_load I, [2024-05-04T16:00:15.624453 #2728330] INFO -- : [787/885] 2769703=test_gem_commands_rebuild_command I, [2024-05-04T16:00:15.672780 #2728330] INFO -- : [788/885] 2769693=test_yamldbm I, [2024-05-04T16:00:15.690290 #2728330] INFO -- : [789/885] 2769693=test_rdoc_parser_simple I, [2024-05-04T16:00:15.693728 #2728330] INFO -- : [790/885] 2769703=test_yield_block I, [2024-05-04T16:00:15.698948 #2728330] INFO -- : [791/885] 2769703=test_len I, [2024-05-04T16:00:15.702502 #2728330] INFO -- : [792/885] 2769703=test_gem_commands_cert_command I, [2024-05-04T16:00:15.711057 #2728330] INFO -- : [793/885] 2769693=test_completion I, [2024-05-04T16:00:15.800452 #2728330] INFO -- : [794/885] 2769701=test_gem_source_installed I, [2024-05-04T16:00:15.811138 #2728330] INFO -- : [795/885] 2769701=test_x509ext I, [2024-05-04T16:00:15.823320 #2728330] INFO -- : [796/885] 2769701=test_erb I, [2024-05-04T16:00:15.865733 #2728330] INFO -- : [797/885] 2769709=attribute_write_test I, [2024-05-04T16:00:15.875697 #2728330] INFO -- : [798/885] 2769701=test_propertyputref I, [2024-05-04T16:00:15.880466 #2728330] INFO -- : [799/885] 2769701=test_spell_checker I, [2024-05-04T16:00:15.882836 #2728330] INFO -- : [800/885] 2769699=test_assembler I, [2024-05-04T16:00:15.886249 #2728330] INFO -- : [801/885] 2769699=test_rational I, [2024-05-04T16:00:15.897344 #2728330] INFO -- : [802/885] 2769701=test_rational2 I, [2024-05-04T16:00:15.901170 #2728330] INFO -- : [803/885] 2769699=test_module I, [2024-05-04T16:00:15.915355 #2728330] INFO -- : [804/885] 2769701=test_gem_request_set I, [2024-05-04T16:00:15.939030 #2728330] INFO -- : [805/885] 2769709=constant_path_node_test I, [2024-05-04T16:00:15.939991 #2728330] INFO -- : [806/885] 2769709=test_gem_ext_cargo_builder I, [2024-05-04T16:00:15.961382 #2728330] INFO -- : [807/885] 2769709=test_ssl I, [2024-05-04T16:00:16.019755 #2728330] INFO -- : [808/885] 2769694=test_arith_seq_extract I, [2024-05-04T16:00:16.215285 #2728330] INFO -- : [809/885] 2769693=test_method_name_check I, [2024-05-04T16:00:16.225082 #2728330] INFO -- : [810/885] 2769694=test_parser I, [2024-05-04T16:00:16.240739 #2728330] INFO -- : [811/885] 2769693=test_whileuntil I, [2024-05-04T16:00:16.244560 #2728330] INFO -- : [812/885] 2769693=test_rdoc_generator_markup I, [2024-05-04T16:00:16.250443 #2728330] INFO -- : [813/885] 2769693=test_rubyvm I, [2024-05-04T16:00:16.258720 #2728330] INFO -- : [814/885] 2769693=test_configuration I, [2024-05-04T16:00:16.271294 #2728330] INFO -- : [815/885] 2769694=test_buffered_io I, [2024-05-04T16:00:16.334586 #2728330] INFO -- : [816/885] 2769694=test_monitor I, [2024-05-04T16:00:16.337022 #2728330] INFO -- : [817/885] 2769701=test_stringify_symbols I, [2024-05-04T16:00:16.345292 #2728330] INFO -- : [818/885] 2769693=integer_parse_test I, [2024-05-04T16:00:16.366472 #2728330] INFO -- : [819/885] 2769701=test_instrumentation_api I, [2024-05-04T16:00:16.425983 #2728330] INFO -- : [820/885] 2769693=test_boolean I, [2024-05-04T16:00:16.432409 #2728330] INFO -- : [821/885] 2769693=json_parser_test I, [2024-05-04T16:00:16.501146 #2728330] INFO -- : [822/885] 2769693=test_nomethod_error I, [2024-05-04T16:00:16.519462 #2728330] INFO -- : [823/885] 2769693=memsize_test I, [2024-05-04T16:00:16.523545 #2728330] INFO -- : [824/885] 2769693=test_config I, [2024-05-04T16:00:16.545678 #2728330] INFO -- : [825/885] 2769694=test_win32ole_variant_outarg I, [2024-05-04T16:00:16.549697 #2728330] INFO -- : [826/885] 2769694=json_common_interface_test I, [2024-05-04T16:00:16.561930 #2728330] INFO -- : [827/885] 2769694=test_gem_source_subpath_problem I, [2024-05-04T16:00:16.595145 #2728330] INFO -- : [828/885] 2769704=test_dln I, [2024-05-04T16:00:16.597179 #2728330] INFO -- : [829/885] 2769704=test_rdoc_markup_to_html_snippet I, [2024-05-04T16:00:16.612840 #2728330] INFO -- : [830/885] 2769693=magic_comment_test I, [2024-05-04T16:00:16.615767 #2728330] INFO -- : [831/885] 2769693=test_struct I, [2024-05-04T16:00:16.620190 #2728330] INFO -- : [832/885] 2769693=test_variable I, [2024-05-04T16:00:16.664161 #2728330] INFO -- : [833/885] 2769704=fuzzer_test I, [2024-05-04T16:00:16.670062 #2728330] INFO -- : [834/885] 2769694=test_rdoc_markup_include I, [2024-05-04T16:00:16.672330 #2728330] INFO -- : [835/885] 2769694=test_sexp I, [2024-05-04T16:00:16.680203 #2728330] INFO -- : [836/885] 2769696=test_pkg_config I, [2024-05-04T16:00:16.688350 #2728330] INFO -- : [837/885] 2769694=test_cparser I, [2024-05-04T16:00:16.691347 #2728330] INFO -- : [838/885] 2769696=test_insns_leaf I, [2024-05-04T16:00:16.691914 #2728330] INFO -- : [839/885] 2769696=test_serialize_subclasses I, [2024-05-04T16:00:16.698214 #2728330] INFO -- : [840/885] 2769696=test_deprecated I, [2024-05-04T16:00:16.701899 #2728330] INFO -- : [841/885] 2769696=test_color_printer I, [2024-05-04T16:00:16.703808 #2728330] INFO -- : [842/885] 2769693=test_engine I, [2024-05-04T16:00:16.704857 #2728330] INFO -- : [843/885] 2769696=test_win32ole_variant_m I, [2024-05-04T16:00:16.705155 #2728330] INFO -- : [844/885] 2769693=test_div I, [2024-05-04T16:00:16.712291 #2728330] INFO -- : [845/885] 2769696=test_allocation I, [2024-05-04T16:00:16.714561 #2728330] INFO -- : [846/885] 2769693=test_key_error I, [2024-05-04T16:00:16.720749 #2728330] INFO -- : [847/885] 2769693=test_x509req I, [2024-05-04T16:00:16.736033 #2728330] INFO -- : [848/885] 2769704=test_mutex I, [2024-05-04T16:00:16.764865 #2728330] INFO -- : [849/885] 2769698=test_rdoc_rd_inline I, [2024-05-04T16:00:16.768532 #2728330] INFO -- : [850/885] 2769698=test_files_test_1 I, [2024-05-04T16:00:16.851069 #2728330] INFO -- : [851/885] 2769708=test_struct I, [2024-05-04T16:00:16.929417 #2728330] INFO -- : [852/885] 2769693=test_gem_path_support I, [2024-05-04T16:00:16.963205 #2728330] INFO -- : [853/885] 2769693=test_set I, [2024-05-04T16:00:17.015982 #2728330] INFO -- : [854/885] 2769693=test_gem_source_git I, [2024-05-04T16:00:17.173674 #2728330] INFO -- : [855/885] 2769694=test_regex_casefold I, [2024-05-04T16:00:17.434914 #2728330] INFO -- : [856/885] 2769694=test_gem_commands_signout_command I, [2024-05-04T16:00:17.440544 #2728330] INFO -- : [857/885] 2769694=test_refinement I, [2024-05-04T16:00:17.495295 #2728330] INFO -- : [858/885] 2769708=test_gem_resolver_installer_set I, [2024-05-04T16:00:17.500849 #2728330] INFO -- : [859/885] 2769702=test_dir_m17n I, [2024-05-04T16:00:17.511974 #2728330] INFO -- : [860/885] 2769693=test_require I, [2024-05-04T16:00:17.630725 #2728330] INFO -- : [861/885] 2769708=test_cgi_cookie I, [2024-05-04T16:00:17.634933 #2728330] INFO -- : [862/885] 2769708=test_float I, [2024-05-04T16:00:17.646344 #2728330] INFO -- : [863/885] 2769703=test_process I, [2024-05-04T16:00:17.673210 #2728330] INFO -- : [864/885] 2769703=test_windows_1252 I, [2024-05-04T16:00:17.673786 #2728330] INFO -- : [865/885] 2769703=test_input_method I, [2024-05-04T16:00:17.748816 #2728330] INFO -- : [866/885] 2769703=test_rdoc_top_level I, [2024-05-04T16:00:17.873784 #2728330] INFO -- : [867/885] 2769704=test_metaclass I, [2024-05-04T16:00:17.876069 #2728330] INFO -- : [868/885] 2769704=test_cgi_session I, [2024-05-04T16:00:17.889546 #2728330] INFO -- : [869/885] 2769704=test_rdoc_rd I, [2024-05-04T16:00:17.907627 #2728330] INFO -- : [870/885] 2769704=test_x509crl I, [2024-05-04T16:00:18.036303 #2728330] INFO -- : [871/885] 2769704=test_signal I, [2024-05-04T16:00:18.060878 #2728330] INFO -- : [872/885] 2769691=test_fixnum I, [2024-05-04T16:00:18.075255 #2728330] INFO -- : [873/885] 2769691=pattern_test I, [2024-05-04T16:00:18.088420 #2728330] INFO -- : [874/885] 2769691=test_memory_view I, [2024-05-04T16:00:18.102313 #2728330] INFO -- : [875/885] 2769691=test_debug I, [2024-05-04T16:00:18.109695 #2728330] INFO -- : [876/885] 2769691=test_shellwords I, [2024-05-04T16:00:18.111070 #2728330] INFO -- : [877/885] 2769703=test_digest_extend I, [2024-05-04T16:00:18.114068 #2728330] INFO -- : [878/885] 2769691=test_omap I, [2024-05-04T16:00:18.117232 #2728330] INFO -- : [879/885] 2769691=test_string I, [2024-05-04T16:00:18.118966 #2728330] INFO -- : [880/885] 2769691=test_iterator I, [2024-05-04T16:00:18.124024 #2728330] INFO -- : [881/885] 2769703=test_gem_resolver_git_set I, [2024-05-04T16:00:18.253040 #2728330] INFO -- : [882/885] 2769691=test_storage I, [2024-05-04T16:00:18.265722 #2728330] INFO -- : [883/885] 2769691=test_new I, [2024-05-04T16:00:18.279839 #2728330] INFO -- : [884/885] 2769691=test_gem_security_signer I, [2024-05-04T16:00:18.359231 #2728330] INFO -- : [885/885] 2769691=test_cipher I, [2024-05-04T16:00:36.634584 #2728330] INFO -- : Finished tests in 38.892213s, 678.4906 tests/s, 240504.5703 assertions/s. E, [2024-05-04T16:00:36.634694 #2728330] ERROR -- : Children under /tmp/rubytest.vyy2je: E, [2024-05-04T16:00:36.634720 #2728330] ERROR -- : * drwx------ 4 80 2024-05-04 16:00:15 +0000 gem_rebuild20240504-2769703-6d9y2b/ E, [2024-05-04T16:00:36.634833 #2728330] ERROR -- : * drwxrwxr-x 2 60 2024-05-04 16:00:15 +0000 new/ E, [2024-05-04T16:00:36.634854 #2728330] ERROR -- : * -rw-rw-r-- 1 4096 2024-05-04 16:00:15 +0000 rebuild_test_gem-1.0.0.gem E, [2024-05-04T16:00:36.634861 #2728330] ERROR -- : * drwxrwxr-x 2 60 2024-05-04 16:00:15 +0000 old/ E, [2024-05-04T16:00:36.634865 #2728330] ERROR -- : * -rw-rw-r-- 1 4096 2024-05-04 16:00:15 +0000 rebuild_test_gem-1.0.0.gem I, [2024-05-04T16:00:36.636057 #2728330] INFO -- : 26388 tests, 9353755 assertions, 0 failures, 0 errors, 306 skips I, [2024-05-04T16:00:36.636089 #2728330] INFO -- : I, [2024-05-04T16:00:36.636097 #2728330] INFO -- : ruby -v: ruby 3.4.0dev (2024-05-04T09:03:55Z master 96710a3139) [x86_64-linux] I, [2024-05-04T16:00:36.638099 #2728330] INFO -- : $$$[end] "make yes-test-all TESTOPTS='--stderr-on-failure' TESTS='-j20'" exit with 0. I, [2024-05-04T16:00:36.638224 #2728330] INFO -- : $$$[beg] make yes-test-rubyspec MSPECOPT='--error-output stderr --debug -j' TESTS='-j20' I, [2024-05-04T16:00:36.725017 #2728330] INFO -- : BASERUBY = /usr/bin/ruby --disable=gems I, [2024-05-04T16:00:36.725050 #2728330] INFO -- : CC = gcc I, [2024-05-04T16:00:36.725056 #2728330] INFO -- : LD = ld I, [2024-05-04T16:00:36.725060 #2728330] INFO -- : LDSHARED = gcc -shared I, [2024-05-04T16:00:36.725064 #2728330] INFO -- : CFLAGS = -O3 -fno-fast-math -ggdb3 -Wall -Wextra -Wdeprecated-declarations -Wdiv-by-zero -Wduplicated-cond -Wimplicit-function-declaration -Wimplicit-int -Wpointer-arith -Wwrite-strings -Wold-style-definition -Wimplicit-fallthrough=0 -Wmissing-noreturn -Wno-cast-function-type -Wno-constant-logical-operand -Wno-long-long -Wno-missing-field-initializers -Wno-overlength-strings -Wno-packed-bitfield-compat -Wno-parentheses-equality -Wno-self-assign -Wno-tautological-compare -Wno-unused-parameter -Wno-unused-value -Wsuggest-attribute=format -Wsuggest-attribute=noreturn -Wunused-variable -Wmisleading-indentation -Wundef -fPIC I, [2024-05-04T16:00:36.725069 #2728330] INFO -- : XCFLAGS = -U_FORTIFY_SOURCE -D_FORTIFY_SOURCE=2 -fstack-protector-strong -fno-strict-overflow -fvisibility=hidden -fexcess-precision=standard -DRUBY_EXPORT -I. -I.ext/include/x86_64-linux -I/tmp/ruby/src/trunk/include -I/tmp/ruby/src/trunk -I/tmp/ruby/src/trunk/prism -I/tmp/ruby/src/trunk/enc/unicode/15.0.0 I, [2024-05-04T16:00:36.725080 #2728330] INFO -- : CPPFLAGS = I, [2024-05-04T16:00:36.725084 #2728330] INFO -- : DLDFLAGS = -Wl,--compress-debug-sections=zlib -Wl,-soname,libruby.so.3.4 -fstack-protector-strong I, [2024-05-04T16:00:36.725088 #2728330] INFO -- : SOLIBS = -lz -lrt -lrt -lgmp -ldl -lcrypt -lm -lpthread I, [2024-05-04T16:00:36.725091 #2728330] INFO -- : LANG = en_US.UTF-8 I, [2024-05-04T16:00:36.725095 #2728330] INFO -- : LC_ALL = I, [2024-05-04T16:00:36.725098 #2728330] INFO -- : LC_CTYPE = I, [2024-05-04T16:00:36.725102 #2728330] INFO -- : MFLAGS = I, [2024-05-04T16:00:36.725105 #2728330] INFO -- : RUSTC = no I, [2024-05-04T16:00:36.725109 #2728330] INFO -- : YJIT_RUSTC_ARGS = --crate-name=yjit --crate-type=staticlib --edition=2021 -g -C lto=thin -C opt-level=3 -C overflow-checks=on '--out-dir=/tmp/ruby/build/trunk/yjit/target/release/' /tmp/ruby/src/trunk/yjit/src/lib.rs I, [2024-05-04T16:00:36.725662 #2728330] INFO -- : gcc (Ubuntu 11.4.0-1ubuntu1~22.04) 11.4.0 I, [2024-05-04T16:00:36.725682 #2728330] INFO -- : Copyright (C) 2021 Free Software Foundation, Inc. I, [2024-05-04T16:00:36.725687 #2728330] INFO -- : This is free software; see the source for copying conditions. There is NO I, [2024-05-04T16:00:36.725692 #2728330] INFO -- : warranty; not even for MERCHANTABILITY or FITNESS FOR A PARTICULAR PURPOSE. I, [2024-05-04T16:00:36.725696 #2728330] INFO -- : I, [2024-05-04T16:00:36.727387 #2728330] INFO -- : generating enc.mk I, [2024-05-04T16:00:36.846383 #2728330] INFO -- : making enc I, [2024-05-04T16:00:36.863704 #2728330] INFO -- : make[1]: Entering directory '/tmp/ruby/build/trunk' I, [2024-05-04T16:00:36.863732 #2728330] INFO -- : make[1]: Nothing to be done for 'enc'. I, [2024-05-04T16:00:36.863740 #2728330] INFO -- : make[1]: Leaving directory '/tmp/ruby/build/trunk' I, [2024-05-04T16:00:36.864336 #2728330] INFO -- : making srcs under enc I, [2024-05-04T16:00:36.894176 #2728330] INFO -- : make[1]: Entering directory '/tmp/ruby/build/trunk' I, [2024-05-04T16:00:36.894198 #2728330] INFO -- : make[1]: Nothing to be done for 'srcs'. I, [2024-05-04T16:00:36.894204 #2728330] INFO -- : make[1]: Leaving directory '/tmp/ruby/build/trunk' I, [2024-05-04T16:00:36.895091 #2728330] INFO -- : generating transdb.h I, [2024-05-04T16:00:36.989595 #2728330] INFO -- : transdb.h unchanged I, [2024-05-04T16:00:36.990956 #2728330] INFO -- : making trans I, [2024-05-04T16:00:37.025626 #2728330] INFO -- : make[1]: Entering directory '/tmp/ruby/build/trunk' I, [2024-05-04T16:00:37.025647 #2728330] INFO -- : make[1]: Nothing to be done for 'trans'. I, [2024-05-04T16:00:37.025653 #2728330] INFO -- : make[1]: Leaving directory '/tmp/ruby/build/trunk' I, [2024-05-04T16:00:37.026336 #2728330] INFO -- : making encs I, [2024-05-04T16:00:37.063833 #2728330] INFO -- : make[1]: Entering directory '/tmp/ruby/build/trunk' I, [2024-05-04T16:00:37.063860 #2728330] INFO -- : make[1]: Nothing to be done for 'encs'. I, [2024-05-04T16:00:37.063868 #2728330] INFO -- : make[1]: Leaving directory '/tmp/ruby/build/trunk' I, [2024-05-04T16:00:37.065724 #2728330] INFO -- : generating makefiles ext/configure-ext.mk I, [2024-05-04T16:00:37.093461 #2728330] INFO -- : ext/configure-ext.mk updated I, [2024-05-04T16:00:37.095892 #2728330] INFO -- : make[1]: Entering directory '/tmp/ruby/build/trunk' I, [2024-05-04T16:00:38.457350 #2728330] INFO -- : make[1]: Leaving directory '/tmp/ruby/build/trunk' I, [2024-05-04T16:00:38.457886 #2728330] INFO -- : generating makefile exts.mk I, [2024-05-04T16:00:38.494462 #2728330] INFO -- : exts.mk unchanged I, [2024-05-04T16:00:38.498954 #2728330] INFO -- : make[1]: Entering directory '/tmp/ruby/build/trunk' I, [2024-05-04T16:00:38.711509 #2728330] INFO -- : make[2]: Entering directory '/tmp/ruby/build/trunk/ext/coverage' I, [2024-05-04T16:00:38.714316 #2728330] INFO -- : make[2]: Leaving directory '/tmp/ruby/build/trunk/ext/coverage' I, [2024-05-04T16:00:38.718089 #2728330] INFO -- : make[2]: Entering directory '/tmp/ruby/build/trunk/ext/date' I, [2024-05-04T16:00:38.721361 #2728330] INFO -- : make[2]: Leaving directory '/tmp/ruby/build/trunk/ext/date' I, [2024-05-04T16:00:38.723634 #2728330] INFO -- : make[2]: Entering directory '/tmp/ruby/build/trunk/ext/digest' I, [2024-05-04T16:00:38.729018 #2728330] INFO -- : make[2]: Leaving directory '/tmp/ruby/build/trunk/ext/digest' I, [2024-05-04T16:00:38.744549 #2728330] INFO -- : make[2]: Entering directory '/tmp/ruby/build/trunk/ext/digest/sha2' I, [2024-05-04T16:00:38.747613 #2728330] INFO -- : make[2]: Leaving directory '/tmp/ruby/build/trunk/ext/digest/sha2' I, [2024-05-04T16:00:38.760651 #2728330] INFO -- : make[2]: Entering directory '/tmp/ruby/build/trunk/ext/fiddle' I, [2024-05-04T16:00:38.767041 #2728330] INFO -- : make[2]: Leaving directory '/tmp/ruby/build/trunk/ext/fiddle' I, [2024-05-04T16:00:38.769927 #2728330] INFO -- : make[2]: Entering directory '/tmp/ruby/build/trunk/ext/io/console' I, [2024-05-04T16:00:38.772442 #2728330] INFO -- : make[2]: Leaving directory '/tmp/ruby/build/trunk/ext/io/console' I, [2024-05-04T16:00:38.780251 #2728330] INFO -- : make[2]: Entering directory '/tmp/ruby/build/trunk/ext/json' I, [2024-05-04T16:00:38.786463 #2728330] INFO -- : make[2]: Leaving directory '/tmp/ruby/build/trunk/ext/json' I, [2024-05-04T16:00:38.795455 #2728330] INFO -- : make[2]: Entering directory '/tmp/ruby/build/trunk/ext/monitor' I, [2024-05-04T16:00:38.797943 #2728330] INFO -- : make[2]: Leaving directory '/tmp/ruby/build/trunk/ext/monitor' I, [2024-05-04T16:00:38.802118 #2728330] INFO -- : make[2]: Entering directory '/tmp/ruby/build/trunk/ext/objspace' I, [2024-05-04T16:00:38.805798 #2728330] INFO -- : make[2]: Leaving directory '/tmp/ruby/build/trunk/ext/objspace' I, [2024-05-04T16:00:38.817755 #2728330] INFO -- : make[2]: Entering directory '/tmp/ruby/build/trunk/ext/openssl' I, [2024-05-04T16:00:38.830861 #2728330] INFO -- : make[2]: Leaving directory '/tmp/ruby/build/trunk/ext/openssl' I, [2024-05-04T16:00:38.833664 #2728330] INFO -- : make[2]: Entering directory '/tmp/ruby/build/trunk/ext/pathname' I, [2024-05-04T16:00:38.836141 #2728330] INFO -- : make[2]: Leaving directory '/tmp/ruby/build/trunk/ext/pathname' I, [2024-05-04T16:00:38.840235 #2728330] INFO -- : make[2]: Entering directory '/tmp/ruby/build/trunk/ext/psych' I, [2024-05-04T16:00:38.855028 #2728330] INFO -- : make[2]: Leaving directory '/tmp/ruby/build/trunk/ext/psych' I, [2024-05-04T16:00:38.858143 #2728330] INFO -- : make[2]: Entering directory '/tmp/ruby/build/trunk/ext/pty' I, [2024-05-04T16:00:38.860689 #2728330] INFO -- : make[2]: Leaving directory '/tmp/ruby/build/trunk/ext/pty' I, [2024-05-04T16:00:38.870225 #2728330] INFO -- : make[2]: Entering directory '/tmp/ruby/build/trunk/ext/ripper' I, [2024-05-04T16:00:38.875207 #2728330] INFO -- : make[2]: Leaving directory '/tmp/ruby/build/trunk/ext/ripper' I, [2024-05-04T16:00:38.876701 #2728330] INFO -- : make[2]: Entering directory '/tmp/ruby/build/trunk/ext/rubyvm' I, [2024-05-04T16:00:38.878793 #2728330] INFO -- : make[2]: Leaving directory '/tmp/ruby/build/trunk/ext/rubyvm' I, [2024-05-04T16:00:38.886560 #2728330] INFO -- : make[2]: Entering directory '/tmp/ruby/build/trunk/ext/socket' I, [2024-05-04T16:00:38.892966 #2728330] INFO -- : make[2]: Leaving directory '/tmp/ruby/build/trunk/ext/socket' I, [2024-05-04T16:00:38.903830 #2728330] INFO -- : make[2]: Entering directory '/tmp/ruby/build/trunk/.bundle/gems/bigdecimal-3.1.7/ext/bigdecimal' I, [2024-05-04T16:00:38.926829 #2728330] INFO -- : make[2]: Leaving directory '/tmp/ruby/build/trunk/.bundle/gems/bigdecimal-3.1.7/ext/bigdecimal' I, [2024-05-04T16:00:38.929141 #2728330] INFO -- : make[2]: Entering directory '/tmp/ruby/build/trunk/.bundle/gems/debug-1.9.2/ext/debug' I, [2024-05-04T16:00:38.950934 #2728330] INFO -- : make[2]: Leaving directory '/tmp/ruby/build/trunk/.bundle/gems/debug-1.9.2/ext/debug' I, [2024-05-04T16:00:38.952809 #2728330] INFO -- : make[2]: Entering directory '/tmp/ruby/build/trunk/.bundle/gems/nkf-0.2.0/ext/nkf' I, [2024-05-04T16:00:38.974358 #2728330] INFO -- : make[2]: Leaving directory '/tmp/ruby/build/trunk/.bundle/gems/nkf-0.2.0/ext/nkf' I, [2024-05-04T16:00:38.976254 #2728330] INFO -- : make[2]: Entering directory '/tmp/ruby/build/trunk/.bundle/gems/racc-1.7.3/ext/racc/cparse' I, [2024-05-04T16:00:38.998475 #2728330] INFO -- : make[2]: Leaving directory '/tmp/ruby/build/trunk/.bundle/gems/racc-1.7.3/ext/racc/cparse' I, [2024-05-04T16:00:39.000724 #2728330] INFO -- : make[2]: Entering directory '/tmp/ruby/build/trunk/.bundle/gems/rbs-3.4.4/ext/rbs_extension' I, [2024-05-04T16:00:39.022078 #2728330] INFO -- : make[2]: Leaving directory '/tmp/ruby/build/trunk/.bundle/gems/rbs-3.4.4/ext/rbs_extension' I, [2024-05-04T16:00:39.023984 #2728330] INFO -- : make[2]: Entering directory '/tmp/ruby/build/trunk/.bundle/gems/syslog-0.1.2/ext/syslog' I, [2024-05-04T16:00:39.045536 #2728330] INFO -- : make[2]: Leaving directory '/tmp/ruby/build/trunk/.bundle/gems/syslog-0.1.2/ext/syslog' I, [2024-05-04T16:00:39.069185 #2728330] INFO -- : make[2]: Entering directory '/tmp/ruby/build/trunk' I, [2024-05-04T16:00:39.131823 #2728330] INFO -- : make[2]: 'ruby' is up to date. I, [2024-05-04T16:00:39.131863 #2728330] INFO -- : make[2]: Leaving directory '/tmp/ruby/build/trunk' I, [2024-05-04T16:00:39.132114 #2728330] INFO -- : make[1]: Leaving directory '/tmp/ruby/build/trunk' I, [2024-05-04T16:00:39.135767 #2728330] INFO -- : make[1]: Entering directory '/tmp/ruby/build/trunk' I, [2024-05-04T16:00:39.135790 #2728330] INFO -- : make[1]: Nothing to be done for 'note'. I, [2024-05-04T16:00:39.135795 #2728330] INFO -- : make[1]: Leaving directory '/tmp/ruby/build/trunk' E, [2024-05-04T16:00:39.192649 #2728330] ERROR -- : $ /tmp/ruby/build/trunk/miniruby -I/tmp/ruby/src/trunk/lib /tmp/ruby/src/trunk/tool/runruby.rb --archdir=/tmp/ruby/build/trunk --extout=.ext -- /tmp/ruby/src/trunk/spec/mspec/bin/mspec-run -B /tmp/ruby/src/trunk/spec/default.mspec --error-output stderr --debug -fy -o /tmp/rubytest.e9n2sn/1-mspec-multi-0 E, [2024-05-04T16:00:39.192860 #2728330] ERROR -- : $ /tmp/ruby/build/trunk/miniruby -I/tmp/ruby/src/trunk/lib /tmp/ruby/src/trunk/tool/runruby.rb --archdir=/tmp/ruby/build/trunk --extout=.ext -- /tmp/ruby/src/trunk/spec/mspec/bin/mspec-run -B /tmp/ruby/src/trunk/spec/default.mspec --error-output stderr --debug -fy -o /tmp/rubytest.e9n2sn/2-mspec-multi-1 E, [2024-05-04T16:00:39.193117 #2728330] ERROR -- : $ /tmp/ruby/build/trunk/miniruby -I/tmp/ruby/src/trunk/lib /tmp/ruby/src/trunk/tool/runruby.rb --archdir=/tmp/ruby/build/trunk --extout=.ext -- /tmp/ruby/src/trunk/spec/mspec/bin/mspec-run -B /tmp/ruby/src/trunk/spec/default.mspec --error-output stderr --debug -fy -o /tmp/rubytest.e9n2sn/3-mspec-multi-2 E, [2024-05-04T16:00:39.193383 #2728330] ERROR -- : $ /tmp/ruby/build/trunk/miniruby -I/tmp/ruby/src/trunk/lib /tmp/ruby/src/trunk/tool/runruby.rb --archdir=/tmp/ruby/build/trunk --extout=.ext -- /tmp/ruby/src/trunk/spec/mspec/bin/mspec-run -B /tmp/ruby/src/trunk/spec/default.mspec --error-output stderr --debug -fy -o /tmp/rubytest.e9n2sn/4-mspec-multi-3 E, [2024-05-04T16:00:39.193503 #2728330] ERROR -- : $ /tmp/ruby/build/trunk/miniruby -I/tmp/ruby/src/trunk/lib /tmp/ruby/src/trunk/tool/runruby.rb --archdir=/tmp/ruby/build/trunk --extout=.ext -- /tmp/ruby/src/trunk/spec/mspec/bin/mspec-run -B /tmp/ruby/src/trunk/spec/default.mspec --error-output stderr --debug -fy -o /tmp/rubytest.e9n2sn/5-mspec-multi-4 E, [2024-05-04T16:00:39.193815 #2728330] ERROR -- : $ /tmp/ruby/build/trunk/miniruby -I/tmp/ruby/src/trunk/lib /tmp/ruby/src/trunk/tool/runruby.rb --archdir=/tmp/ruby/build/trunk --extout=.ext -- /tmp/ruby/src/trunk/spec/mspec/bin/mspec-run -B /tmp/ruby/src/trunk/spec/default.mspec --error-output stderr --debug -fy -o /tmp/rubytest.e9n2sn/6-mspec-multi-5 E, [2024-05-04T16:00:39.194050 #2728330] ERROR -- : $ /tmp/ruby/build/trunk/miniruby -I/tmp/ruby/src/trunk/lib /tmp/ruby/src/trunk/tool/runruby.rb --archdir=/tmp/ruby/build/trunk --extout=.ext -- /tmp/ruby/src/trunk/spec/mspec/bin/mspec-run -B /tmp/ruby/src/trunk/spec/default.mspec --error-output stderr --debug -fy -o /tmp/rubytest.e9n2sn/7-mspec-multi-6 E, [2024-05-04T16:00:39.194241 #2728330] ERROR -- : $ /tmp/ruby/build/trunk/miniruby -I/tmp/ruby/src/trunk/lib /tmp/ruby/src/trunk/tool/runruby.rb --archdir=/tmp/ruby/build/trunk --extout=.ext -- /tmp/ruby/src/trunk/spec/mspec/bin/mspec-run -B /tmp/ruby/src/trunk/spec/default.mspec --error-output stderr --debug -fy -o /tmp/rubytest.e9n2sn/8-mspec-multi-7 E, [2024-05-04T16:00:39.194416 #2728330] ERROR -- : $ /tmp/ruby/build/trunk/miniruby -I/tmp/ruby/src/trunk/lib /tmp/ruby/src/trunk/tool/runruby.rb --archdir=/tmp/ruby/build/trunk --extout=.ext -- /tmp/ruby/src/trunk/spec/mspec/bin/mspec-run -B /tmp/ruby/src/trunk/spec/default.mspec --error-output stderr --debug -fy -o /tmp/rubytest.e9n2sn/9-mspec-multi-8 E, [2024-05-04T16:00:39.194579 #2728330] ERROR -- : $ /tmp/ruby/build/trunk/miniruby -I/tmp/ruby/src/trunk/lib /tmp/ruby/src/trunk/tool/runruby.rb --archdir=/tmp/ruby/build/trunk --extout=.ext -- /tmp/ruby/src/trunk/spec/mspec/bin/mspec-run -B /tmp/ruby/src/trunk/spec/default.mspec --error-output stderr --debug -fy -o /tmp/rubytest.e9n2sn/10-mspec-multi-9 E, [2024-05-04T16:00:39.194933 #2728330] ERROR -- : $ /tmp/ruby/build/trunk/miniruby -I/tmp/ruby/src/trunk/lib /tmp/ruby/src/trunk/tool/runruby.rb --archdir=/tmp/ruby/build/trunk --extout=.ext -- /tmp/ruby/src/trunk/spec/mspec/bin/mspec-run -B /tmp/ruby/src/trunk/spec/default.mspec --error-output stderr --debug -fy -o /tmp/rubytest.e9n2sn/11-mspec-multi-10 E, [2024-05-04T16:00:39.195179 #2728330] ERROR -- : $ /tmp/ruby/build/trunk/miniruby -I/tmp/ruby/src/trunk/lib /tmp/ruby/src/trunk/tool/runruby.rb --archdir=/tmp/ruby/build/trunk --extout=.ext -- /tmp/ruby/src/trunk/spec/mspec/bin/mspec-run -B /tmp/ruby/src/trunk/spec/default.mspec --error-output stderr --debug -fy -o /tmp/rubytest.e9n2sn/12-mspec-multi-11 E, [2024-05-04T16:00:39.195364 #2728330] ERROR -- : $ /tmp/ruby/build/trunk/miniruby -I/tmp/ruby/src/trunk/lib /tmp/ruby/src/trunk/tool/runruby.rb --archdir=/tmp/ruby/build/trunk --extout=.ext -- /tmp/ruby/src/trunk/spec/mspec/bin/mspec-run -B /tmp/ruby/src/trunk/spec/default.mspec --error-output stderr --debug -fy -o /tmp/rubytest.e9n2sn/13-mspec-multi-12 E, [2024-05-04T16:00:39.195583 #2728330] ERROR -- : $ /tmp/ruby/build/trunk/miniruby -I/tmp/ruby/src/trunk/lib /tmp/ruby/src/trunk/tool/runruby.rb --archdir=/tmp/ruby/build/trunk --extout=.ext -- /tmp/ruby/src/trunk/spec/mspec/bin/mspec-run -B /tmp/ruby/src/trunk/spec/default.mspec --error-output stderr --debug -fy -o /tmp/rubytest.e9n2sn/14-mspec-multi-13 E, [2024-05-04T16:00:39.195777 #2728330] ERROR -- : $ /tmp/ruby/build/trunk/miniruby -I/tmp/ruby/src/trunk/lib /tmp/ruby/src/trunk/tool/runruby.rb --archdir=/tmp/ruby/build/trunk --extout=.ext -- /tmp/ruby/src/trunk/spec/mspec/bin/mspec-run -B /tmp/ruby/src/trunk/spec/default.mspec --error-output stderr --debug -fy -o /tmp/rubytest.e9n2sn/15-mspec-multi-14 E, [2024-05-04T16:00:39.195942 #2728330] ERROR -- : $ /tmp/ruby/build/trunk/miniruby -I/tmp/ruby/src/trunk/lib /tmp/ruby/src/trunk/tool/runruby.rb --archdir=/tmp/ruby/build/trunk --extout=.ext -- /tmp/ruby/src/trunk/spec/mspec/bin/mspec-run -B /tmp/ruby/src/trunk/spec/default.mspec --error-output stderr --debug -fy -o /tmp/rubytest.e9n2sn/16-mspec-multi-15 E, [2024-05-04T16:00:39.196130 #2728330] ERROR -- : $ /tmp/ruby/build/trunk/miniruby -I/tmp/ruby/src/trunk/lib /tmp/ruby/src/trunk/tool/runruby.rb --archdir=/tmp/ruby/build/trunk --extout=.ext -- /tmp/ruby/src/trunk/spec/mspec/bin/mspec-run -B /tmp/ruby/src/trunk/spec/default.mspec --error-output stderr --debug -fy -o /tmp/rubytest.e9n2sn/17-mspec-multi-16 E, [2024-05-04T16:00:39.196326 #2728330] ERROR -- : $ /tmp/ruby/build/trunk/miniruby -I/tmp/ruby/src/trunk/lib /tmp/ruby/src/trunk/tool/runruby.rb --archdir=/tmp/ruby/build/trunk --extout=.ext -- /tmp/ruby/src/trunk/spec/mspec/bin/mspec-run -B /tmp/ruby/src/trunk/spec/default.mspec --error-output stderr --debug -fy -o /tmp/rubytest.e9n2sn/18-mspec-multi-17 E, [2024-05-04T16:00:39.198903 #2728330] ERROR -- : $ /tmp/ruby/build/trunk/miniruby -I/tmp/ruby/src/trunk/lib /tmp/ruby/src/trunk/tool/runruby.rb --archdir=/tmp/ruby/build/trunk --extout=.ext -- /tmp/ruby/src/trunk/spec/mspec/bin/mspec-run -B /tmp/ruby/src/trunk/spec/default.mspec --error-output stderr --debug -fy -o /tmp/rubytest.e9n2sn/19-mspec-multi-18 E, [2024-05-04T16:00:39.212467 #2728330] ERROR -- : $ /tmp/ruby/build/trunk/miniruby -I/tmp/ruby/src/trunk/lib /tmp/ruby/src/trunk/tool/runruby.rb --archdir=/tmp/ruby/build/trunk --extout=.ext -- /tmp/ruby/src/trunk/spec/mspec/bin/mspec-run -B /tmp/ruby/src/trunk/spec/default.mspec --error-output stderr --debug -fy -o /tmp/rubytest.e9n2sn/20-mspec-multi-19 I, [2024-05-04T16:00:39.374838 #2728330] INFO -- : ruby 3.4.0dev (2024-05-04T09:03:55Z master 96710a3139) [x86_64-linux] I, [2024-05-04T16:00:40.021277 #2728330] INFO -- : 0 ......................................................................... I, [2024-05-04T16:00:40.409901 #2728330] INFO -- : 73 ......................................................................... I, [2024-05-04T16:00:40.563179 #2728330] INFO -- : 146 ......................................................................... I, [2024-05-04T16:00:40.624715 #2728330] INFO -- : 219 ......................................................................... I, [2024-05-04T16:00:40.690743 #2728330] INFO -- : 292 ......................................................................... I, [2024-05-04T16:00:40.730421 #2728330] INFO -- : 365 ......................................................................... I, [2024-05-04T16:00:40.753652 #2728330] INFO -- : 438 ......................................................................... I, [2024-05-04T16:00:40.776631 #2728330] INFO -- : 511 ......................................................................... I, [2024-05-04T16:00:40.798107 #2728330] INFO -- : 584 ......................................................................... I, [2024-05-04T16:00:40.864591 #2728330] INFO -- : 657 ......................................................................... I, [2024-05-04T16:00:40.898697 #2728330] INFO -- : 730 ......................................................................... I, [2024-05-04T16:00:40.922579 #2728330] INFO -- : 803 ......................................................................... I, [2024-05-04T16:00:40.958353 #2728330] INFO -- : 876 ......................................................................... I, [2024-05-04T16:00:41.000290 #2728330] INFO -- : 949 ......................................................................... I, [2024-05-04T16:00:41.101368 #2728330] INFO -- : 1022 ......................................................................... I, [2024-05-04T16:00:41.254829 #2728330] INFO -- : 1095 ......................................................................... I, [2024-05-04T16:00:41.382814 #2728330] INFO -- : 1168 ......................................................................... I, [2024-05-04T16:00:41.442321 #2728330] INFO -- : 1241 ......................................................................... I, [2024-05-04T16:00:41.495202 #2728330] INFO -- : 1314 ......................................................................... I, [2024-05-04T16:00:41.510398 #2728330] INFO -- : 1387 ......................................................................... I, [2024-05-04T16:00:41.610427 #2728330] INFO -- : 1460 ......................................................................... I, [2024-05-04T16:00:42.074800 #2728330] INFO -- : 1533 ......................................................................... I, [2024-05-04T16:00:42.132822 #2728330] INFO -- : 1606 ......................................................................... I, [2024-05-04T16:00:42.243243 #2728330] INFO -- : 1679 ......................................................................... I, [2024-05-04T16:00:42.370906 #2728330] INFO -- : 1752 ......................................................................... I, [2024-05-04T16:00:42.451979 #2728330] INFO -- : 1825 ......................................................................... I, [2024-05-04T16:00:42.573152 #2728330] INFO -- : 1898 ......................................................................... I, [2024-05-04T16:00:42.645017 #2728330] INFO -- : 1971 ......................................................................... I, [2024-05-04T16:00:42.717999 #2728330] INFO -- : 2044 ......................................................................... I, [2024-05-04T16:00:42.767553 #2728330] INFO -- : 2117 ......................................................................... I, [2024-05-04T16:00:42.794444 #2728330] INFO -- : 2190 ......................................................................... I, [2024-05-04T16:00:42.812992 #2728330] INFO -- : 2263 ......................................................................... I, [2024-05-04T16:00:42.828613 #2728330] INFO -- : 2336 ......................................................................... I, [2024-05-04T16:00:42.867632 #2728330] INFO -- : 2409 ......................................................................... I, [2024-05-04T16:00:42.971951 #2728330] INFO -- : 2482 ......................................................................... I, [2024-05-04T16:00:43.001447 #2728330] INFO -- : 2555 ......................................................................... I, [2024-05-04T16:00:43.111890 #2728330] INFO -- : 2628 ......................................................................... I, [2024-05-04T16:00:43.217649 #2728330] INFO -- : 2701 ......................................................................... I, [2024-05-04T16:00:43.247358 #2728330] INFO -- : 2774 ......................................................................... I, [2024-05-04T16:00:43.310735 #2728330] INFO -- : 2847 ......................................................................... I, [2024-05-04T16:00:43.350723 #2728330] INFO -- : 2920 ......................................................................... I, [2024-05-04T16:00:43.378796 #2728330] INFO -- : 2993 ......................................................................... I, [2024-05-04T16:00:43.400617 #2728330] INFO -- : 3066 ......................................................................... I, [2024-05-04T16:00:43.414512 #2728330] INFO -- : 3139 ......................................................................... I, [2024-05-04T16:00:43.423831 #2728330] INFO -- : 3212 ......................................................................... I, [2024-05-04T16:00:43.457845 #2728330] INFO -- : 3285 ......................................................................... I, [2024-05-04T16:00:47.423302 #2728330] INFO -- : 3358 ........................................................................ I, [2024-05-04T16:00:47.423374 #2728330] INFO -- : I, [2024-05-04T16:00:47.423383 #2728330] INFO -- : Finished in 8.228267 seconds I, [2024-05-04T16:00:47.423389 #2728330] INFO -- : I, [2024-05-04T16:00:47.423395 #2728330] INFO -- : 3429 files, 32610 examples, 176714 expectations, 0 failures, 0 errors, 0 tagged I, [2024-05-04T16:00:47.426276 #2728330] INFO -- : $$$[end] "make yes-test-rubyspec MSPECOPT='--error-output stderr --debug -j' TESTS='-j20'" exit with 0.