# Logfile created on 2024-05-04 03:32:31 +0000 by logger.rb/v1.4.3
I, [2024-05-04T03:32:31.875235 #942863]  INFO -- : #<BuildRuby:0x0000559f73862c80 @REPOSITORY="https://github.com/ruby/ruby.git", @REPOSITORY_TYPE=:git, @git_branch=nil, @git_worktree=nil, @svn_revision=nil, @SRC_DIR="/tmp/ruby/src", @BUILD_DIR="/tmp/ruby/build", @INSTALL_DIR="/tmp/ruby/install", @TARGET_NAME="trunk", @TARGET_SRC_DIR="/tmp/ruby/src/trunk", @TARGET_BUILD_DIR="/tmp/ruby/build/trunk", @TARGET_INSTALL_DIR="/tmp/ruby/install/trunk", @configure_opts=["--enable-shared"], @build_opts="-j20", @btest_opts="-j20", @test_opts="TESTS='-j20'", @spec_opts="-j", @incremental=true, @steps=["checkout", "autoconf", "configure", "build_up", "build_miniruby", "build_ruby", "build_all", "build_install", "test_btest", "test_basic", "test_all", "test_rubyspec"], @quiet=false, @gist=false, @timeout=10800, @logfile="/home/ko1/ruby/logs/brlog.trunk.20240504-033231", @ruby_env=[["RUBY_DEBUG", "ci"]], @make="make", @logger=#<Logger:0x0000559f738fb278 @level=0, @progname=nil, @default_formatter=#<Logger::Formatter:0x0000559f738fb0e8 @datetime_format=nil>, @formatter=nil, @logdev=#<Logger::LogDevice:0x0000559f738faf58 @shift_period_suffix="%Y%m%d", @shift_size=1048576, @shift_age=0, @filename="/home/ko1/ruby/logs/brlog.trunk.20240504-033231", @dev=#<File:/home/ko1/ruby/logs/brlog.trunk.20240504-033231>, @binmode=false, @mon_data=#<Monitor:0x0000559f738fae90>, @mon_data_owner_object_id=860>>>
I, [2024-05-04T03:32:31.875358 #942863]  INFO -- : $$$[beg] make update-unicode  -j20
I, [2024-05-04T03:32:31.934234 #942863]  INFO -- : Downloading Unicode emoji 15.0 files...
I, [2024-05-04T03:32:31.934434 #942863]  INFO -- : Downloading Unicode emoji 15.0 files...
I, [2024-05-04T03:32:31.935140 #942863]  INFO -- : Downloading Unicode emoji 15.0 files...
I, [2024-05-04T03:32:31.975801 #942863]  INFO -- : made symlink emoji/15.0/emoji-sequences.txt to /tmp/ruby/src/trunk/.downloaded-cache/emoji/15.0/emoji-sequences.txt
I, [2024-05-04T03:32:31.975849 #942863]  INFO -- : downloading emoji/15.0/emoji-test.txt ... /tmp/ruby/src/trunk/enc/unicode/data/emoji/15.0/emoji-sequences.txt already exists
I, [2024-05-04T03:32:31.976361 #942863]  INFO -- : downloading emoji/15.0/emoji-test.txt ... /tmp/ruby/src/trunk/enc/unicode/data/emoji/15.0/emoji-sequences.txt already exists
E, [2024-05-04T03:32:32.413442 #942863] ERROR -- : /tmp/ruby/src/trunk/tool/downloader.rb:302:in `rescue in download': failed to download emoji/15.0/emoji-test.txt (RuntimeError)
E, [2024-05-04T03:32:32.413489 #942863] ERROR -- : OpenURI::HTTPError: 403 Forbidden: https://www.unicode.org/Public/emoji/15.0/emoji-test.txt
E, [2024-05-04T03:32:32.413495 #942863] ERROR -- : 	from /tmp/ruby/src/trunk/tool/downloader.rb:201:in `download'
E, [2024-05-04T03:32:32.413500 #942863] ERROR -- : 	from /tmp/ruby/src/trunk/tool/downloader.rb:136:in `download'
E, [2024-05-04T03:32:32.413503 #942863] ERROR -- : 	from /tmp/ruby/src/trunk/tool/downloader.rb:482:in `block in <main>'
E, [2024-05-04T03:32:32.413507 #942863] ERROR -- : 	from /tmp/ruby/src/trunk/tool/downloader.rb:465:in `each'
E, [2024-05-04T03:32:32.413511 #942863] ERROR -- : 	from /tmp/ruby/src/trunk/tool/downloader.rb:465:in `<main>'
E, [2024-05-04T03:32:32.413514 #942863] ERROR -- : /usr/lib/ruby/3.0.0/open-uri.rb:364:in `open_http': 403 Forbidden (OpenURI::HTTPError)
E, [2024-05-04T03:32:32.413518 #942863] ERROR -- : 	from /usr/lib/ruby/3.0.0/open-uri.rb:741:in `buffer_open'
E, [2024-05-04T03:32:32.413523 #942863] ERROR -- : 	from /usr/lib/ruby/3.0.0/open-uri.rb:212:in `block in open_loop'
E, [2024-05-04T03:32:32.413527 #942863] ERROR -- : 	from /usr/lib/ruby/3.0.0/open-uri.rb:210:in `catch'
E, [2024-05-04T03:32:32.413531 #942863] ERROR -- : 	from /usr/lib/ruby/3.0.0/open-uri.rb:210:in `open_loop'
E, [2024-05-04T03:32:32.413534 #942863] ERROR -- : 	from /usr/lib/ruby/3.0.0/open-uri.rb:151:in `open_uri'
E, [2024-05-04T03:32:32.413538 #942863] ERROR -- : 	from /usr/lib/ruby/3.0.0/open-uri.rb:721:in `open'
E, [2024-05-04T03:32:32.413541 #942863] ERROR -- : 	from /usr/lib/ruby/3.0.0/open-uri.rb:729:in `read'
E, [2024-05-04T03:32:32.413553 #942863] ERROR -- : 	from /tmp/ruby/src/trunk/tool/downloader.rb:247:in `block in download'
E, [2024-05-04T03:32:32.413557 #942863] ERROR -- : 	from /tmp/ruby/src/trunk/tool/downloader.rb:378:in `with_retry'
E, [2024-05-04T03:32:32.413561 #942863] ERROR -- : 	from /tmp/ruby/src/trunk/tool/downloader.rb:246:in `download'
E, [2024-05-04T03:32:32.413565 #942863] ERROR -- : 	from /tmp/ruby/src/trunk/tool/downloader.rb:136:in `download'
E, [2024-05-04T03:32:32.413569 #942863] ERROR -- : 	from /tmp/ruby/src/trunk/tool/downloader.rb:482:in `block in <main>'
E, [2024-05-04T03:32:32.413573 #942863] ERROR -- : 	from /tmp/ruby/src/trunk/tool/downloader.rb:465:in `each'
E, [2024-05-04T03:32:32.413581 #942863] ERROR -- : 	from /tmp/ruby/src/trunk/tool/downloader.rb:465:in `<main>'
E, [2024-05-04T03:32:32.415529 #942863] ERROR -- : make: *** [uncommon.mk:1787: /tmp/ruby/src/trunk/enc/unicode/data/emoji/15.0/emoji-sequences.txt] Error 1
E, [2024-05-04T03:32:32.415551 #942863] ERROR -- : make: *** Deleting file '/tmp/ruby/src/trunk/enc/unicode/data/emoji/15.0/emoji-sequences.txt'
E, [2024-05-04T03:32:32.415557 #942863] ERROR -- : make: *** Waiting for unfinished jobs....
E, [2024-05-04T03:32:32.434852 #942863] ERROR -- : /tmp/ruby/src/trunk/tool/downloader.rb:302:in `rescue in download': failed to download emoji/15.0/emoji-test.txt (RuntimeError)
E, [2024-05-04T03:32:32.434872 #942863] ERROR -- : OpenURI::HTTPError: 403 Forbidden: https://www.unicode.org/Public/emoji/15.0/emoji-test.txt
E, [2024-05-04T03:32:32.434878 #942863] ERROR -- : 	from /tmp/ruby/src/trunk/tool/downloader.rb:201:in `download'
E, [2024-05-04T03:32:32.434881 #942863] ERROR -- : 	from /tmp/ruby/src/trunk/tool/downloader.rb:136:in `download'
E, [2024-05-04T03:32:32.434885 #942863] ERROR -- : 	from /tmp/ruby/src/trunk/tool/downloader.rb:482:in `block in <main>'
E, [2024-05-04T03:32:32.434888 #942863] ERROR -- : 	from /tmp/ruby/src/trunk/tool/downloader.rb:465:in `each'
E, [2024-05-04T03:32:32.434892 #942863] ERROR -- : 	from /tmp/ruby/src/trunk/tool/downloader.rb:465:in `<main>'
E, [2024-05-04T03:32:32.434896 #942863] ERROR -- : /usr/lib/ruby/3.0.0/open-uri.rb:364:in `open_http': 403 Forbidden (OpenURI::HTTPError)
E, [2024-05-04T03:32:32.434901 #942863] ERROR -- : 	from /usr/lib/ruby/3.0.0/open-uri.rb:741:in `buffer_open'
E, [2024-05-04T03:32:32.434904 #942863] ERROR -- : 	from /usr/lib/ruby/3.0.0/open-uri.rb:212:in `block in open_loop'
E, [2024-05-04T03:32:32.434908 #942863] ERROR -- : 	from /usr/lib/ruby/3.0.0/open-uri.rb:210:in `catch'
E, [2024-05-04T03:32:32.434911 #942863] ERROR -- : 	from /usr/lib/ruby/3.0.0/open-uri.rb:210:in `open_loop'
E, [2024-05-04T03:32:32.434914 #942863] ERROR -- : 	from /usr/lib/ruby/3.0.0/open-uri.rb:151:in `open_uri'
E, [2024-05-04T03:32:32.434918 #942863] ERROR -- : 	from /usr/lib/ruby/3.0.0/open-uri.rb:721:in `open'
E, [2024-05-04T03:32:32.434921 #942863] ERROR -- : 	from /usr/lib/ruby/3.0.0/open-uri.rb:729:in `read'
E, [2024-05-04T03:32:32.434924 #942863] ERROR -- : 	from /tmp/ruby/src/trunk/tool/downloader.rb:247:in `block in download'
E, [2024-05-04T03:32:32.434931 #942863] ERROR -- : 	from /tmp/ruby/src/trunk/tool/downloader.rb:378:in `with_retry'
E, [2024-05-04T03:32:32.434934 #942863] ERROR -- : 	from /tmp/ruby/src/trunk/tool/downloader.rb:246:in `download'
E, [2024-05-04T03:32:32.434937 #942863] ERROR -- : 	from /tmp/ruby/src/trunk/tool/downloader.rb:136:in `download'
E, [2024-05-04T03:32:32.434941 #942863] ERROR -- : 	from /tmp/ruby/src/trunk/tool/downloader.rb:482:in `block in <main>'
E, [2024-05-04T03:32:32.434944 #942863] ERROR -- : 	from /tmp/ruby/src/trunk/tool/downloader.rb:465:in `each'
E, [2024-05-04T03:32:32.434948 #942863] ERROR -- : 	from /tmp/ruby/src/trunk/tool/downloader.rb:465:in `<main>'
E, [2024-05-04T03:32:32.437098 #942863] ERROR -- : make: *** [uncommon.mk:1787: /tmp/ruby/src/trunk/enc/unicode/data/emoji/15.0/emoji-zwj-sequences.txt] Error 1
E, [2024-05-04T03:32:32.444029 #942863] ERROR -- : /tmp/ruby/src/trunk/tool/downloader.rb:302:in `rescue in download': failed to download emoji/15.0/emoji-test.txt (RuntimeError)
E, [2024-05-04T03:32:32.444054 #942863] ERROR -- : OpenURI::HTTPError: 403 Forbidden: https://www.unicode.org/Public/emoji/15.0/emoji-test.txt
E, [2024-05-04T03:32:32.444060 #942863] ERROR -- : 	from /tmp/ruby/src/trunk/tool/downloader.rb:201:in `download'
E, [2024-05-04T03:32:32.444064 #942863] ERROR -- : 	from /tmp/ruby/src/trunk/tool/downloader.rb:136:in `download'
E, [2024-05-04T03:32:32.444067 #942863] ERROR -- : 	from /tmp/ruby/src/trunk/tool/downloader.rb:482:in `block in <main>'
E, [2024-05-04T03:32:32.444071 #942863] ERROR -- : 	from /tmp/ruby/src/trunk/tool/downloader.rb:465:in `each'
E, [2024-05-04T03:32:32.444074 #942863] ERROR -- : 	from /tmp/ruby/src/trunk/tool/downloader.rb:465:in `<main>'
E, [2024-05-04T03:32:32.444077 #942863] ERROR -- : /usr/lib/ruby/3.0.0/open-uri.rb:364:in `open_http': 403 Forbidden (OpenURI::HTTPError)
E, [2024-05-04T03:32:32.444082 #942863] ERROR -- : 	from /usr/lib/ruby/3.0.0/open-uri.rb:741:in `buffer_open'
E, [2024-05-04T03:32:32.444085 #942863] ERROR -- : 	from /usr/lib/ruby/3.0.0/open-uri.rb:212:in `block in open_loop'
E, [2024-05-04T03:32:32.444089 #942863] ERROR -- : 	from /usr/lib/ruby/3.0.0/open-uri.rb:210:in `catch'
E, [2024-05-04T03:32:32.444092 #942863] ERROR -- : 	from /usr/lib/ruby/3.0.0/open-uri.rb:210:in `open_loop'
E, [2024-05-04T03:32:32.444173 #942863] ERROR -- : 	from /usr/lib/ruby/3.0.0/open-uri.rb:151:in `open_uri'
E, [2024-05-04T03:32:32.444177 #942863] ERROR -- : 	from /usr/lib/ruby/3.0.0/open-uri.rb:721:in `open'
E, [2024-05-04T03:32:32.444181 #942863] ERROR -- : 	from /usr/lib/ruby/3.0.0/open-uri.rb:729:in `read'
E, [2024-05-04T03:32:32.444184 #942863] ERROR -- : 	from /tmp/ruby/src/trunk/tool/downloader.rb:247:in `block in download'
E, [2024-05-04T03:32:32.444187 #942863] ERROR -- : 	from /tmp/ruby/src/trunk/tool/downloader.rb:378:in `with_retry'
E, [2024-05-04T03:32:32.444191 #942863] ERROR -- : 	from /tmp/ruby/src/trunk/tool/downloader.rb:246:in `download'
E, [2024-05-04T03:32:32.444194 #942863] ERROR -- : 	from /tmp/ruby/src/trunk/tool/downloader.rb:136:in `download'
E, [2024-05-04T03:32:32.444198 #942863] ERROR -- : 	from /tmp/ruby/src/trunk/tool/downloader.rb:482:in `block in <main>'
E, [2024-05-04T03:32:32.444202 #942863] ERROR -- : 	from /tmp/ruby/src/trunk/tool/downloader.rb:465:in `each'
E, [2024-05-04T03:32:32.444206 #942863] ERROR -- : 	from /tmp/ruby/src/trunk/tool/downloader.rb:465:in `<main>'
E, [2024-05-04T03:32:32.445985 #942863] ERROR -- : make: *** [uncommon.mk:1787: /tmp/ruby/src/trunk/enc/unicode/data/emoji/15.0/emoji-test.txt] Error 1
I, [2024-05-04T03:32:32.446027 #942863]  INFO -- : downloading emoji/15.0/emoji-test.txt ... 
I, [2024-05-04T03:32:32.446443 #942863]  INFO -- : $$$[end] "make update-unicode  -j20" exit with 512.
I, [2024-05-04T03:32:32.446472 #942863]  INFO -- : $$$[beg] make update-download -j20
I, [2024-05-04T03:32:32.545125 #942863]  INFO -- : tool/config.guess already exists
I, [2024-05-04T03:32:32.545163 #942863]  INFO -- : tool/config.sub already exists
I, [2024-05-04T03:32:32.547148 #942863]  INFO -- : Update minitest to ea9caafc0754b1d6236a490d59e624b53209734a
I, [2024-05-04T03:32:32.547326 #942863]  INFO -- : Update power_assert to 84e85124c5014a139af39161d484156cfe87a9ed
I, [2024-05-04T03:32:32.547842 #942863]  INFO -- : Update rbs to ba7872795d5de04adb8ff500c0e6afdc81a041dd
I, [2024-05-04T03:32:32.548065 #942863]  INFO -- : Update typeprof to b19a6416da3a05d57fadd6ffdadb382b6d236ca5
I, [2024-05-04T03:32:32.548442 #942863]  INFO -- : echo ea9caafc0754b1d6236a490d59e624b53209734a | /bin/sh /tmp/ruby/src/trunk/tool/ifchange /tmp/ruby/src/trunk/.bundle/.timestamp/minitest.revision -
I, [2024-05-04T03:32:32.548613 #942863]  INFO -- : echo 84e85124c5014a139af39161d484156cfe87a9ed | /bin/sh /tmp/ruby/src/trunk/tool/ifchange /tmp/ruby/src/trunk/.bundle/.timestamp/power_assert.revision -
I, [2024-05-04T03:32:32.548862 #942863]  INFO -- : echo ba7872795d5de04adb8ff500c0e6afdc81a041dd | /bin/sh /tmp/ruby/src/trunk/tool/ifchange /tmp/ruby/src/trunk/.bundle/.timestamp/rbs.revision -
I, [2024-05-04T03:32:32.549011 #942863]  INFO -- : echo b19a6416da3a05d57fadd6ffdadb382b6d236ca5 | /bin/sh /tmp/ruby/src/trunk/tool/ifchange /tmp/ruby/src/trunk/.bundle/.timestamp/typeprof.revision -
I, [2024-05-04T03:32:32.550613 #942863]  INFO -- : /tmp/ruby/src/trunk/.bundle/.timestamp/power_assert.revision unchanged
I, [2024-05-04T03:32:32.550637 #942863]  INFO -- : /tmp/ruby/src/trunk/.bundle/.timestamp/minitest.revision unchanged
I, [2024-05-04T03:32:32.550715 #942863]  INFO -- : /tmp/ruby/src/trunk/.bundle/.timestamp/rbs.revision unchanged
I, [2024-05-04T03:32:32.551055 #942863]  INFO -- : /tmp/ruby/src/trunk/.bundle/.timestamp/typeprof.revision unchanged
I, [2024-05-04T03:32:32.551362 #942863]  INFO -- : Building power_assert@84e85124c5014a139af39161d484156cfe87a9ed to /tmp/ruby/src/trunk/gems/power_assert-2.0.3.gem
I, [2024-05-04T03:32:32.620289 #942863]  INFO -- :   Successfully built RubyGem
I, [2024-05-04T03:32:32.620345 #942863]  INFO -- :   Name: power_assert
I, [2024-05-04T03:32:32.620364 #942863]  INFO -- :   Version: 2.0.4dev
I, [2024-05-04T03:32:32.620375 #942863]  INFO -- :   File: power_assert-2.0.4dev.gem
I, [2024-05-04T03:32:32.666164 #942863]  INFO -- : $$$[end] "make update-download -j20" exit with 0.
I, [2024-05-04T03:32:32.666206 #942863]  INFO -- : $$$[beg] make update-rubyspec -j20
I, [2024-05-04T03:32:32.722957 #942863]  INFO -- : make: Nothing to be done for 'update-rubyspec'.
I, [2024-05-04T03:32:32.723189 #942863]  INFO -- : $$$[end] "make update-rubyspec -j20" exit with 0.
I, [2024-05-04T03:32:32.723222 #942863]  INFO -- : $$$[beg] make update-src      -j20
I, [2024-05-04T03:32:33.231130 #942863]  INFO -- : Already up to date.
I, [2024-05-04T03:32:33.240327 #942863]  INFO -- : Latest commit hash = fb2ea7084f
I, [2024-05-04T03:32:33.241274 #942863]  INFO -- : $$$[end] "make update-src      -j20" exit with 0.
I, [2024-05-04T03:32:33.241317 #942863]  INFO -- : $$$[beg] make after-update    -j20
I, [2024-05-04T03:32:33.310099 #942863]  INFO -- : generating /tmp/ruby/src/trunk/ext/ripper/eventids2table.c
I, [2024-05-04T03:32:33.314315 #942863]  INFO -- : make[1]: Entering directory '/tmp/ruby/src/trunk/ext/ripper'
I, [2024-05-04T03:32:33.314362 #942863]  INFO -- : make[1]: Nothing to be done for 'src'.
I, [2024-05-04T03:32:33.314375 #942863]  INFO -- : make[1]: Leaving directory '/tmp/ruby/src/trunk/ext/ripper'
I, [2024-05-04T03:32:33.331073 #942863]  INFO -- : /tmp/ruby/src/trunk/revision.h updated
I, [2024-05-04T03:32:33.332329 #942863]  INFO -- : generating x86_64-linux-fake.rb
I, [2024-05-04T03:32:33.383443 #942863]  INFO -- : x86_64-linux-fake.rb updated
I, [2024-05-04T03:32:33.384829 #942863]  INFO -- : generating enc.mk
I, [2024-05-04T03:32:33.502132 #942863]  INFO -- : making srcs under enc
I, [2024-05-04T03:32:33.531798 #942863]  INFO -- : make[1]: Entering directory '/tmp/ruby/build/trunk'
I, [2024-05-04T03:32:33.531863 #942863]  INFO -- : make[1]: Nothing to be done for 'srcs'.
I, [2024-05-04T03:32:33.531877 #942863]  INFO -- : make[1]: Leaving directory '/tmp/ruby/build/trunk'
I, [2024-05-04T03:32:33.576457 #942863]  INFO -- : Update minitest to ea9caafc0754b1d6236a490d59e624b53209734a
I, [2024-05-04T03:32:33.576506 #942863]  INFO -- : Update power_assert to 84e85124c5014a139af39161d484156cfe87a9ed
I, [2024-05-04T03:32:33.576700 #942863]  INFO -- : Update rbs to ba7872795d5de04adb8ff500c0e6afdc81a041dd
I, [2024-05-04T03:32:33.577591 #942863]  INFO -- : Update typeprof to b19a6416da3a05d57fadd6ffdadb382b6d236ca5
I, [2024-05-04T03:32:33.577890 #942863]  INFO -- : echo ea9caafc0754b1d6236a490d59e624b53209734a | /bin/sh /tmp/ruby/src/trunk/tool/ifchange /tmp/ruby/src/trunk/.bundle/.timestamp/minitest.revision -
I, [2024-05-04T03:32:33.578055 #942863]  INFO -- : echo 84e85124c5014a139af39161d484156cfe87a9ed | /bin/sh /tmp/ruby/src/trunk/tool/ifchange /tmp/ruby/src/trunk/.bundle/.timestamp/power_assert.revision -
I, [2024-05-04T03:32:33.578189 #942863]  INFO -- : echo ba7872795d5de04adb8ff500c0e6afdc81a041dd | /bin/sh /tmp/ruby/src/trunk/tool/ifchange /tmp/ruby/src/trunk/.bundle/.timestamp/rbs.revision -
I, [2024-05-04T03:32:33.579355 #942863]  INFO -- : echo b19a6416da3a05d57fadd6ffdadb382b6d236ca5 | /bin/sh /tmp/ruby/src/trunk/tool/ifchange /tmp/ruby/src/trunk/.bundle/.timestamp/typeprof.revision -
I, [2024-05-04T03:32:33.579857 #942863]  INFO -- : /tmp/ruby/src/trunk/.bundle/.timestamp/power_assert.revision unchanged
I, [2024-05-04T03:32:33.579881 #942863]  INFO -- : /tmp/ruby/src/trunk/.bundle/.timestamp/minitest.revision unchanged
I, [2024-05-04T03:32:33.579972 #942863]  INFO -- : /tmp/ruby/src/trunk/.bundle/.timestamp/rbs.revision unchanged
I, [2024-05-04T03:32:33.580910 #942863]  INFO -- : Building power_assert@84e85124c5014a139af39161d484156cfe87a9ed to /tmp/ruby/src/trunk/gems/power_assert-2.0.3.gem
I, [2024-05-04T03:32:33.581152 #942863]  INFO -- : /tmp/ruby/src/trunk/.bundle/.timestamp/typeprof.revision unchanged
I, [2024-05-04T03:32:33.649635 #942863]  INFO -- :   Successfully built RubyGem
I, [2024-05-04T03:32:33.649693 #942863]  INFO -- :   Name: power_assert
I, [2024-05-04T03:32:33.649713 #942863]  INFO -- :   Version: 2.0.4dev
I, [2024-05-04T03:32:33.649724 #942863]  INFO -- :   File: power_assert-2.0.4dev.gem
I, [2024-05-04T03:32:33.651838 #942863]  INFO -- : Extracting bundle gem power_assert-2.0.3...
I, [2024-05-04T03:32:33.712298 #942863]  INFO -- : Try with hash version of bundled gems instead of gems/power_assert-2.0.3.gem. We don't use this gem with release version of Ruby.
I, [2024-05-04T03:32:33.717378 #942863]  INFO -- : Unpacked gems/power_assert-2.0.4dev.gem
I, [2024-05-04T03:32:33.719374 #942863]  INFO -- : $$$[end] "make after-update    -j20" exit with 0.
I, [2024-05-04T03:32:33.719555 #942863]  INFO -- : $$$[beg] make miniruby -j20
I, [2024-05-04T03:32:33.777382 #942863]  INFO -- : 	BASERUBY = /usr/bin/ruby --disable=gems
I, [2024-05-04T03:32:33.777422 #942863]  INFO -- : 	CC = gcc
I, [2024-05-04T03:32:33.777435 #942863]  INFO -- : 	LD = ld
I, [2024-05-04T03:32:33.777446 #942863]  INFO -- : 	LDSHARED = gcc -shared
I, [2024-05-04T03:32:33.777456 #942863]  INFO -- : 	CFLAGS = -O3 -fno-fast-math -ggdb3 -Wall -Wextra -Wdeprecated-declarations -Wdiv-by-zero -Wduplicated-cond -Wimplicit-function-declaration -Wimplicit-int -Wpointer-arith -Wwrite-strings -Wold-style-definition -Wimplicit-fallthrough=0 -Wmissing-noreturn -Wno-cast-function-type -Wno-constant-logical-operand -Wno-long-long -Wno-missing-field-initializers -Wno-overlength-strings -Wno-packed-bitfield-compat -Wno-parentheses-equality -Wno-self-assign -Wno-tautological-compare -Wno-unused-parameter -Wno-unused-value -Wsuggest-attribute=format -Wsuggest-attribute=noreturn -Wunused-variable -Wmisleading-indentation -Wundef   -fPIC 
I, [2024-05-04T03:32:33.777468 #942863]  INFO -- : 	XCFLAGS = -U_FORTIFY_SOURCE -D_FORTIFY_SOURCE=2 -fstack-protector-strong -fno-strict-overflow -fvisibility=hidden -fexcess-precision=standard -DRUBY_EXPORT -I. -I.ext/include/x86_64-linux -I/tmp/ruby/src/trunk/include -I/tmp/ruby/src/trunk -I/tmp/ruby/src/trunk/prism -I/tmp/ruby/src/trunk/enc/unicode/15.0.0  
I, [2024-05-04T03:32:33.777478 #942863]  INFO -- : 	CPPFLAGS =   
I, [2024-05-04T03:32:33.777488 #942863]  INFO -- : 	DLDFLAGS = -Wl,--compress-debug-sections=zlib -Wl,-soname,libruby.so.3.4  -fstack-protector-strong  
I, [2024-05-04T03:32:33.777498 #942863]  INFO -- : 	SOLIBS = -lz -lrt -lrt -lgmp -ldl -lcrypt -lm -lpthread 
I, [2024-05-04T03:32:33.777508 #942863]  INFO -- : 	LANG = en_US.UTF-8
I, [2024-05-04T03:32:33.777518 #942863]  INFO -- : 	LC_ALL = 
I, [2024-05-04T03:32:33.777527 #942863]  INFO -- : 	LC_CTYPE = 
I, [2024-05-04T03:32:33.777537 #942863]  INFO -- : 	MFLAGS = -j20 --jobserver-auth=4,5
I, [2024-05-04T03:32:33.777546 #942863]  INFO -- : 	RUSTC = no
I, [2024-05-04T03:32:33.777556 #942863]  INFO -- : 	YJIT_RUSTC_ARGS = --crate-name=yjit --crate-type=staticlib --edition=2021 -g -C lto=thin -C opt-level=3 -C overflow-checks=on '--out-dir=/tmp/ruby/build/trunk/yjit/target/release/' /tmp/ruby/src/trunk/yjit/src/lib.rs
I, [2024-05-04T03:32:33.778814 #942863]  INFO -- : gcc (Ubuntu 11.4.0-1ubuntu1~22.04) 11.4.0
I, [2024-05-04T03:32:33.778861 #942863]  INFO -- : Copyright (C) 2021 Free Software Foundation, Inc.
I, [2024-05-04T03:32:33.778874 #942863]  INFO -- : This is free software; see the source for copying conditions.  There is NO
I, [2024-05-04T03:32:33.778885 #942863]  INFO -- : warranty; not even for MERCHANTABILITY or FITNESS FOR A PARTICULAR PURPOSE.
I, [2024-05-04T03:32:33.778896 #942863]  INFO -- : 
I, [2024-05-04T03:32:33.799516 #942863]  INFO -- : compiling /tmp/ruby/src/trunk/version.c
I, [2024-05-04T03:32:33.903344 #942863]  INFO -- : linking miniruby
I, [2024-05-04T03:32:34.462975 #942863]  INFO -- : $$$[end] "make miniruby -j20" exit with 0.
I, [2024-05-04T03:32:34.463098 #942863]  INFO -- : $$$[beg] make ruby -j20
I, [2024-05-04T03:32:34.519810 #942863]  INFO -- : 	BASERUBY = /usr/bin/ruby --disable=gems
I, [2024-05-04T03:32:34.519849 #942863]  INFO -- : 	CC = gcc
I, [2024-05-04T03:32:34.519861 #942863]  INFO -- : 	LD = ld
I, [2024-05-04T03:32:34.519879 #942863]  INFO -- : 	LDSHARED = gcc -shared
I, [2024-05-04T03:32:34.519890 #942863]  INFO -- : 	CFLAGS = -O3 -fno-fast-math -ggdb3 -Wall -Wextra -Wdeprecated-declarations -Wdiv-by-zero -Wduplicated-cond -Wimplicit-function-declaration -Wimplicit-int -Wpointer-arith -Wwrite-strings -Wold-style-definition -Wimplicit-fallthrough=0 -Wmissing-noreturn -Wno-cast-function-type -Wno-constant-logical-operand -Wno-long-long -Wno-missing-field-initializers -Wno-overlength-strings -Wno-packed-bitfield-compat -Wno-parentheses-equality -Wno-self-assign -Wno-tautological-compare -Wno-unused-parameter -Wno-unused-value -Wsuggest-attribute=format -Wsuggest-attribute=noreturn -Wunused-variable -Wmisleading-indentation -Wundef   -fPIC 
I, [2024-05-04T03:32:34.519900 #942863]  INFO -- : 	XCFLAGS = -U_FORTIFY_SOURCE -D_FORTIFY_SOURCE=2 -fstack-protector-strong -fno-strict-overflow -fvisibility=hidden -fexcess-precision=standard -DRUBY_EXPORT -I. -I.ext/include/x86_64-linux -I/tmp/ruby/src/trunk/include -I/tmp/ruby/src/trunk -I/tmp/ruby/src/trunk/prism -I/tmp/ruby/src/trunk/enc/unicode/15.0.0  
I, [2024-05-04T03:32:34.519911 #942863]  INFO -- : 	CPPFLAGS =   
I, [2024-05-04T03:32:34.519920 #942863]  INFO -- : 	DLDFLAGS = -Wl,--compress-debug-sections=zlib -Wl,-soname,libruby.so.3.4  -fstack-protector-strong  
I, [2024-05-04T03:32:34.519931 #942863]  INFO -- : 	SOLIBS = -lz -lrt -lrt -lgmp -ldl -lcrypt -lm -lpthread 
I, [2024-05-04T03:32:34.519941 #942863]  INFO -- : 	LANG = en_US.UTF-8
I, [2024-05-04T03:32:34.519951 #942863]  INFO -- : 	LC_ALL = 
I, [2024-05-04T03:32:34.519960 #942863]  INFO -- : 	LC_CTYPE = 
I, [2024-05-04T03:32:34.519970 #942863]  INFO -- : 	MFLAGS = -j20 --jobserver-auth=4,5
I, [2024-05-04T03:32:34.519980 #942863]  INFO -- : 	RUSTC = no
I, [2024-05-04T03:32:34.519990 #942863]  INFO -- : 	YJIT_RUSTC_ARGS = --crate-name=yjit --crate-type=staticlib --edition=2021 -g -C lto=thin -C opt-level=3 -C overflow-checks=on '--out-dir=/tmp/ruby/build/trunk/yjit/target/release/' /tmp/ruby/src/trunk/yjit/src/lib.rs
I, [2024-05-04T03:32:34.521272 #942863]  INFO -- : gcc (Ubuntu 11.4.0-1ubuntu1~22.04) 11.4.0
I, [2024-05-04T03:32:34.521314 #942863]  INFO -- : Copyright (C) 2021 Free Software Foundation, Inc.
I, [2024-05-04T03:32:34.521327 #942863]  INFO -- : This is free software; see the source for copying conditions.  There is NO
I, [2024-05-04T03:32:34.521337 #942863]  INFO -- : warranty; not even for MERCHANTABILITY or FITNESS FOR A PARTICULAR PURPOSE.
I, [2024-05-04T03:32:34.521347 #942863]  INFO -- : 
I, [2024-05-04T03:32:34.631073 #942863]  INFO -- : builtin_binary.inc updated
I, [2024-05-04T03:32:34.635545 #942863]  INFO -- : c5234a9416e4f20f175185e840b25b0f08674d14078ed7083f37e655458e3ca9  builtin_binary.inc
I, [2024-05-04T03:32:34.636395 #942863]  INFO -- : compiling /tmp/ruby/src/trunk/builtin.c
I, [2024-05-04T03:32:34.820982 #942863]  INFO -- : linking static-library libruby-static.a
I, [2024-05-04T03:32:35.135074 #942863]  INFO -- : linking shared-library libruby.so.3.4.0
I, [2024-05-04T03:32:36.692412 #942863]  INFO -- : linking ruby
I, [2024-05-04T03:32:36.715459 #942863]  INFO -- : $$$[end] "make ruby -j20" exit with 0.
I, [2024-05-04T03:32:36.715625 #942863]  INFO -- : $$$[beg] make all -j20
I, [2024-05-04T03:32:36.773230 #942863]  INFO -- : 	BASERUBY = /usr/bin/ruby --disable=gems
I, [2024-05-04T03:32:36.773272 #942863]  INFO -- : 	CC = gcc
I, [2024-05-04T03:32:36.773284 #942863]  INFO -- : 	LD = ld
I, [2024-05-04T03:32:36.773295 #942863]  INFO -- : 	LDSHARED = gcc -shared
I, [2024-05-04T03:32:36.773308 #942863]  INFO -- : 	CFLAGS = -O3 -fno-fast-math -ggdb3 -Wall -Wextra -Wdeprecated-declarations -Wdiv-by-zero -Wduplicated-cond -Wimplicit-function-declaration -Wimplicit-int -Wpointer-arith -Wwrite-strings -Wold-style-definition -Wimplicit-fallthrough=0 -Wmissing-noreturn -Wno-cast-function-type -Wno-constant-logical-operand -Wno-long-long -Wno-missing-field-initializers -Wno-overlength-strings -Wno-packed-bitfield-compat -Wno-parentheses-equality -Wno-self-assign -Wno-tautological-compare -Wno-unused-parameter -Wno-unused-value -Wsuggest-attribute=format -Wsuggest-attribute=noreturn -Wunused-variable -Wmisleading-indentation -Wundef   -fPIC 
I, [2024-05-04T03:32:36.773320 #942863]  INFO -- : 	XCFLAGS = -U_FORTIFY_SOURCE -D_FORTIFY_SOURCE=2 -fstack-protector-strong -fno-strict-overflow -fvisibility=hidden -fexcess-precision=standard -DRUBY_EXPORT -I. -I.ext/include/x86_64-linux -I/tmp/ruby/src/trunk/include -I/tmp/ruby/src/trunk -I/tmp/ruby/src/trunk/prism -I/tmp/ruby/src/trunk/enc/unicode/15.0.0  
I, [2024-05-04T03:32:36.773330 #942863]  INFO -- : 	CPPFLAGS =   
I, [2024-05-04T03:32:36.773340 #942863]  INFO -- : 	DLDFLAGS = -Wl,--compress-debug-sections=zlib -Wl,-soname,libruby.so.3.4  -fstack-protector-strong  
I, [2024-05-04T03:32:36.773351 #942863]  INFO -- : 	SOLIBS = -lz -lrt -lrt -lgmp -ldl -lcrypt -lm -lpthread 
I, [2024-05-04T03:32:36.773360 #942863]  INFO -- : 	LANG = en_US.UTF-8
I, [2024-05-04T03:32:36.773370 #942863]  INFO -- : 	LC_ALL = 
I, [2024-05-04T03:32:36.773379 #942863]  INFO -- : 	LC_CTYPE = 
I, [2024-05-04T03:32:36.773389 #942863]  INFO -- : 	MFLAGS = -j20 --jobserver-auth=4,5
I, [2024-05-04T03:32:36.773399 #942863]  INFO -- : 	RUSTC = no
I, [2024-05-04T03:32:36.773411 #942863]  INFO -- : 	YJIT_RUSTC_ARGS = --crate-name=yjit --crate-type=staticlib --edition=2021 -g -C lto=thin -C opt-level=3 -C overflow-checks=on '--out-dir=/tmp/ruby/build/trunk/yjit/target/release/' /tmp/ruby/src/trunk/yjit/src/lib.rs
I, [2024-05-04T03:32:36.774686 #942863]  INFO -- : gcc (Ubuntu 11.4.0-1ubuntu1~22.04) 11.4.0
I, [2024-05-04T03:32:36.774731 #942863]  INFO -- : Copyright (C) 2021 Free Software Foundation, Inc.
I, [2024-05-04T03:32:36.774744 #942863]  INFO -- : This is free software; see the source for copying conditions.  There is NO
I, [2024-05-04T03:32:36.774755 #942863]  INFO -- : warranty; not even for MERCHANTABILITY or FITNESS FOR A PARTICULAR PURPOSE.
I, [2024-05-04T03:32:36.774766 #942863]  INFO -- : 
I, [2024-05-04T03:32:36.802980 #942863]  INFO -- : generating enc.mk
I, [2024-05-04T03:32:36.804796 #942863]  INFO -- : building spec/ruby/optional/capi/ext/array_spec.so
I, [2024-05-04T03:32:36.805124 #942863]  INFO -- : building spec/ruby/optional/capi/ext/basic_object_spec.so
I, [2024-05-04T03:32:36.805913 #942863]  INFO -- : building spec/ruby/optional/capi/ext/bignum_spec.so
I, [2024-05-04T03:32:36.806703 #942863]  INFO -- : building spec/ruby/optional/capi/ext/binding_spec.so
I, [2024-05-04T03:32:36.807147 #942863]  INFO -- : building spec/ruby/optional/capi/ext/boolean_spec.so
I, [2024-05-04T03:32:36.807445 #942863]  INFO -- : building spec/ruby/optional/capi/ext/class_id_under_autoload_spec.so
I, [2024-05-04T03:32:36.808507 #942863]  INFO -- : building spec/ruby/optional/capi/ext/class_spec.so
I, [2024-05-04T03:32:36.809497 #942863]  INFO -- : building spec/ruby/optional/capi/ext/class_under_autoload_spec.so
I, [2024-05-04T03:32:36.809866 #942863]  INFO -- : building spec/ruby/optional/capi/ext/complex_spec.so
I, [2024-05-04T03:32:36.810777 #942863]  INFO -- : building spec/ruby/optional/capi/ext/constants_spec.so
I, [2024-05-04T03:32:36.811517 #942863]  INFO -- : building spec/ruby/optional/capi/ext/data_spec.so
I, [2024-05-04T03:32:36.811783 #942863]  INFO -- : building spec/ruby/optional/capi/ext/debug_spec.so
I, [2024-05-04T03:32:36.812334 #942863]  INFO -- : building spec/ruby/optional/capi/ext/encoding_spec.so
I, [2024-05-04T03:32:36.812665 #942863]  INFO -- : building spec/ruby/optional/capi/ext/enumerator_spec.so
I, [2024-05-04T03:32:36.813607 #942863]  INFO -- : building spec/ruby/optional/capi/ext/exception_spec.so
I, [2024-05-04T03:32:36.814195 #942863]  INFO -- : building spec/ruby/optional/capi/ext/fiber_spec.so
I, [2024-05-04T03:32:36.814514 #942863]  INFO -- : building spec/ruby/optional/capi/ext/file_spec.so
I, [2024-05-04T03:32:36.815044 #942863]  INFO -- : building spec/ruby/optional/capi/ext/fixnum_spec.so
I, [2024-05-04T03:32:36.828650 #942863]  INFO -- : building spec/ruby/optional/capi/ext/float_spec.so
I, [2024-05-04T03:32:36.947717 #942863]  INFO -- : building spec/ruby/optional/capi/ext/gc_spec.so
I, [2024-05-04T03:32:36.952233 #942863]  INFO -- : building spec/ruby/optional/capi/ext/globals_spec.so
I, [2024-05-04T03:32:36.961220 #942863]  INFO -- : building spec/ruby/optional/capi/ext/hash_spec.so
I, [2024-05-04T03:32:36.962241 #942863]  INFO -- : building spec/ruby/optional/capi/ext/integer_spec.so
I, [2024-05-04T03:32:36.964932 #942863]  INFO -- : building spec/ruby/optional/capi/ext/io_spec.so
I, [2024-05-04T03:32:36.974353 #942863]  INFO -- : building spec/ruby/optional/capi/ext/kernel_spec.so
I, [2024-05-04T03:32:36.974859 #942863]  INFO -- : building spec/ruby/optional/capi/ext/language_spec.so
I, [2024-05-04T03:32:36.987843 #942863]  INFO -- : building spec/ruby/optional/capi/ext/marshal_spec.so
I, [2024-05-04T03:32:36.991489 #942863]  INFO -- : building spec/ruby/optional/capi/ext/module_spec.so
I, [2024-05-04T03:32:36.993091 #942863]  INFO -- : building spec/ruby/optional/capi/ext/module_under_autoload_spec.so
I, [2024-05-04T03:32:36.999545 #942863]  INFO -- : building spec/ruby/optional/capi/ext/mutex_spec.so
I, [2024-05-04T03:32:37.016477 #942863]  INFO -- : building spec/ruby/optional/capi/ext/numeric_spec.so
I, [2024-05-04T03:32:37.018174 #942863]  INFO -- : building spec/ruby/optional/capi/ext/object_spec.so
I, [2024-05-04T03:32:37.033464 #942863]  INFO -- : building spec/ruby/optional/capi/ext/proc_spec.so
I, [2024-05-04T03:32:37.042053 #942863]  INFO -- : building spec/ruby/optional/capi/ext/range_spec.so
I, [2024-05-04T03:32:37.044404 #942863]  INFO -- : building spec/ruby/optional/capi/ext/rational_spec.so
I, [2024-05-04T03:32:37.045128 #942863]  INFO -- : building spec/ruby/optional/capi/ext/rbasic_spec.so
I, [2024-05-04T03:32:37.099439 #942863]  INFO -- : building spec/ruby/optional/capi/ext/regexp_spec.so
I, [2024-05-04T03:32:37.101875 #942863]  INFO -- : building spec/ruby/optional/capi/ext/string_spec.so
I, [2024-05-04T03:32:37.109671 #942863]  INFO -- : building spec/ruby/optional/capi/ext/struct_spec.so
I, [2024-05-04T03:32:37.128897 #942863]  INFO -- : building spec/ruby/optional/capi/ext/st_spec.so
I, [2024-05-04T03:32:37.133974 #942863]  INFO -- : building spec/ruby/optional/capi/ext/symbol_spec.so
I, [2024-05-04T03:32:37.156861 #942863]  INFO -- : building spec/ruby/optional/capi/ext/thread_spec.so
I, [2024-05-04T03:32:37.157343 #942863]  INFO -- : building spec/ruby/optional/capi/ext/time_spec.so
I, [2024-05-04T03:32:37.158277 #942863]  INFO -- : building spec/ruby/optional/capi/ext/tracepoint_spec.so
I, [2024-05-04T03:32:37.158532 #942863]  INFO -- : building spec/ruby/optional/capi/ext/typed_data_spec.so
I, [2024-05-04T03:32:37.159109 #942863]  INFO -- : building spec/ruby/optional/capi/ext/util_spec.so
I, [2024-05-04T03:32:37.162628 #942863]  INFO -- : making enc
I, [2024-05-04T03:32:37.193302 #942863]  INFO -- : make[1]: Entering directory '/tmp/ruby/build/trunk'
I, [2024-05-04T03:32:37.193385 #942863]  INFO -- : make[1]: Nothing to be done for 'enc'.
I, [2024-05-04T03:32:37.193433 #942863]  INFO -- : make[1]: Leaving directory '/tmp/ruby/build/trunk'
I, [2024-05-04T03:32:37.194373 #942863]  INFO -- : making srcs under enc
I, [2024-05-04T03:32:37.241753 #942863]  INFO -- : make[1]: Entering directory '/tmp/ruby/build/trunk'
I, [2024-05-04T03:32:37.241813 #942863]  INFO -- : make[1]: Nothing to be done for 'srcs'.
I, [2024-05-04T03:32:37.241822 #942863]  INFO -- : make[1]: Leaving directory '/tmp/ruby/build/trunk'
I, [2024-05-04T03:32:37.242687 #942863]  INFO -- : generating transdb.h
I, [2024-05-04T03:32:37.372748 #942863]  INFO -- : transdb.h unchanged
I, [2024-05-04T03:32:37.374508 #942863]  INFO -- : generating makefiles ext/configure-ext.mk
I, [2024-05-04T03:32:37.374668 #942863]  INFO -- : making trans
I, [2024-05-04T03:32:37.402353 #942863]  INFO -- : ext/configure-ext.mk updated
I, [2024-05-04T03:32:37.404977 #942863]  INFO -- : make[1]: Entering directory '/tmp/ruby/build/trunk'
I, [2024-05-04T03:32:37.409403 #942863]  INFO -- : make[1]: Entering directory '/tmp/ruby/build/trunk'
I, [2024-05-04T03:32:37.409479 #942863]  INFO -- : make[1]: Nothing to be done for 'trans'.
I, [2024-05-04T03:32:37.409489 #942863]  INFO -- : make[1]: Leaving directory '/tmp/ruby/build/trunk'
I, [2024-05-04T03:32:37.410290 #942863]  INFO -- : making encs
I, [2024-05-04T03:32:37.469082 #942863]  INFO -- : make[1]: Entering directory '/tmp/ruby/build/trunk'
I, [2024-05-04T03:32:37.469163 #942863]  INFO -- : make[1]: Nothing to be done for 'encs'.
I, [2024-05-04T03:32:37.469189 #942863]  INFO -- : make[1]: Leaving directory '/tmp/ruby/build/trunk'
I, [2024-05-04T03:32:37.566400 #942863]  INFO -- : make[1]: Leaving directory '/tmp/ruby/build/trunk'
I, [2024-05-04T03:32:37.566996 #942863]  INFO -- : generating makefile exts.mk
I, [2024-05-04T03:32:37.604157 #942863]  INFO -- : exts.mk unchanged
I, [2024-05-04T03:32:37.608908 #942863]  INFO -- : make[1]: Entering directory '/tmp/ruby/build/trunk'
I, [2024-05-04T03:32:37.628186 #942863]  INFO -- : make[2]: Entering directory '/tmp/ruby/build/trunk/ext/digest'
I, [2024-05-04T03:32:37.629883 #942863]  INFO -- : make[2]: Entering directory '/tmp/ruby/build/trunk/ext/coverage'
I, [2024-05-04T03:32:37.629921 #942863]  INFO -- : make[2]: Entering directory '/tmp/ruby/build/trunk/ext/json'
I, [2024-05-04T03:32:37.630628 #942863]  INFO -- : make[2]: Entering directory '/tmp/ruby/build/trunk/ext/date'
I, [2024-05-04T03:32:37.631342 #942863]  INFO -- : make[2]: Entering directory '/tmp/ruby/build/trunk/ext/io/console'
I, [2024-05-04T03:32:37.631829 #942863]  INFO -- : make[2]: Entering directory '/tmp/ruby/build/trunk/ext/monitor'
I, [2024-05-04T03:32:37.632135 #942863]  INFO -- : make[2]: Leaving directory '/tmp/ruby/build/trunk/ext/digest'
I, [2024-05-04T03:32:37.632838 #942863]  INFO -- : make[2]: Entering directory '/tmp/ruby/build/trunk/ext/pathname'
I, [2024-05-04T03:32:37.633028 #942863]  INFO -- : make[2]: Entering directory '/tmp/ruby/build/trunk/ext/fiddle'
I, [2024-05-04T03:32:37.633054 #942863]  INFO -- : make[2]: Entering directory '/tmp/ruby/build/trunk/ext/rubyvm'
I, [2024-05-04T03:32:37.633305 #942863]  INFO -- : make[2]: Entering directory '/tmp/ruby/build/trunk/ext/pty'
I, [2024-05-04T03:32:37.633890 #942863]  INFO -- : make[2]: Leaving directory '/tmp/ruby/build/trunk/ext/coverage'
I, [2024-05-04T03:32:37.634094 #942863]  INFO -- : make[2]: Leaving directory '/tmp/ruby/build/trunk/ext/io/console'
I, [2024-05-04T03:32:37.634221 #942863]  INFO -- : make[2]: Leaving directory '/tmp/ruby/build/trunk/ext/date'
I, [2024-05-04T03:32:37.634364 #942863]  INFO -- : make[2]: Entering directory '/tmp/ruby/build/trunk/ext/objspace'
I, [2024-05-04T03:32:37.635032 #942863]  INFO -- : make[2]: Leaving directory '/tmp/ruby/build/trunk/ext/monitor'
I, [2024-05-04T03:32:37.635050 #942863]  INFO -- : make[2]: Entering directory '/tmp/ruby/build/trunk/ext/psych'
I, [2024-05-04T03:32:37.635361 #942863]  INFO -- : make[2]: Leaving directory '/tmp/ruby/build/trunk/ext/rubyvm'
I, [2024-05-04T03:32:37.635749 #942863]  INFO -- : make[2]: Leaving directory '/tmp/ruby/build/trunk/ext/pathname'
I, [2024-05-04T03:32:37.636366 #942863]  INFO -- : make[2]: Leaving directory '/tmp/ruby/build/trunk/ext/pty'
I, [2024-05-04T03:32:37.636593 #942863]  INFO -- : make[2]: Entering directory '/tmp/ruby/build/trunk/.bundle/gems/bigdecimal-3.1.7/ext/bigdecimal'
I, [2024-05-04T03:32:37.637580 #942863]  INFO -- : make[2]: Leaving directory '/tmp/ruby/build/trunk/ext/json'
I, [2024-05-04T03:32:37.638039 #942863]  INFO -- : make[2]: Leaving directory '/tmp/ruby/build/trunk/ext/objspace'
I, [2024-05-04T03:32:37.638353 #942863]  INFO -- : make[2]: Entering directory '/tmp/ruby/build/trunk/ext/ripper'
I, [2024-05-04T03:32:37.638731 #942863]  INFO -- : make[2]: Entering directory '/tmp/ruby/build/trunk/.bundle/gems/racc-1.7.3/ext/racc/cparse'
I, [2024-05-04T03:32:37.638772 #942863]  INFO -- : make[2]: Entering directory '/tmp/ruby/build/trunk/.bundle/gems/nkf-0.2.0/ext/nkf'
I, [2024-05-04T03:32:37.638798 #942863]  INFO -- : make[2]: Entering directory '/tmp/ruby/build/trunk/.bundle/gems/debug-1.9.2/ext/debug'
I, [2024-05-04T03:32:37.639030 #942863]  INFO -- : make[2]: Entering directory '/tmp/ruby/build/trunk/.bundle/gems/syslog-0.1.2/ext/syslog'
I, [2024-05-04T03:32:37.639686 #942863]  INFO -- : make[2]: Entering directory '/tmp/ruby/build/trunk/.bundle/gems/rbs-3.4.4/ext/rbs_extension'
I, [2024-05-04T03:32:37.640101 #942863]  INFO -- : make[2]: Leaving directory '/tmp/ruby/build/trunk/ext/fiddle'
I, [2024-05-04T03:32:37.642440 #942863]  INFO -- : make[2]: Entering directory '/tmp/ruby/build/trunk/ext/digest/sha2'
I, [2024-05-04T03:32:37.643128 #942863]  INFO -- : make[2]: Leaving directory '/tmp/ruby/build/trunk/ext/ripper'
I, [2024-05-04T03:32:37.644102 #942863]  INFO -- : make[2]: Entering directory '/tmp/ruby/build/trunk/ext/openssl'
I, [2024-05-04T03:32:37.644218 #942863]  INFO -- : make[2]: Entering directory '/tmp/ruby/build/trunk/ext/socket'
I, [2024-05-04T03:32:37.645762 #942863]  INFO -- : make[2]: Leaving directory '/tmp/ruby/build/trunk/ext/digest/sha2'
I, [2024-05-04T03:32:37.645975 #942863]  INFO -- : make[2]: Leaving directory '/tmp/ruby/build/trunk/ext/psych'
I, [2024-05-04T03:32:37.652712 #942863]  INFO -- : make[2]: Leaving directory '/tmp/ruby/build/trunk/ext/socket'
I, [2024-05-04T03:32:37.655168 #942863]  INFO -- : make[2]: Leaving directory '/tmp/ruby/build/trunk/ext/openssl'
I, [2024-05-04T03:32:37.660417 #942863]  INFO -- : make[2]: Leaving directory '/tmp/ruby/build/trunk/.bundle/gems/bigdecimal-3.1.7/ext/bigdecimal'
I, [2024-05-04T03:32:37.662229 #942863]  INFO -- : make[2]: Leaving directory '/tmp/ruby/build/trunk/.bundle/gems/racc-1.7.3/ext/racc/cparse'
I, [2024-05-04T03:32:37.662494 #942863]  INFO -- : make[2]: Leaving directory '/tmp/ruby/build/trunk/.bundle/gems/debug-1.9.2/ext/debug'
I, [2024-05-04T03:32:37.669656 #942863]  INFO -- : make[2]: Leaving directory '/tmp/ruby/build/trunk/.bundle/gems/syslog-0.1.2/ext/syslog'
I, [2024-05-04T03:32:37.669796 #942863]  INFO -- : make[2]: Leaving directory '/tmp/ruby/build/trunk/.bundle/gems/nkf-0.2.0/ext/nkf'
I, [2024-05-04T03:32:37.671847 #942863]  INFO -- : make[2]: Leaving directory '/tmp/ruby/build/trunk/.bundle/gems/rbs-3.4.4/ext/rbs_extension'
I, [2024-05-04T03:32:37.695775 #942863]  INFO -- : make[2]: Entering directory '/tmp/ruby/build/trunk'
I, [2024-05-04T03:32:37.763766 #942863]  INFO -- : linking ruby
I, [2024-05-04T03:32:37.787018 #942863]  INFO -- : make[2]: Leaving directory '/tmp/ruby/build/trunk'
I, [2024-05-04T03:32:37.787491 #942863]  INFO -- : make[1]: Leaving directory '/tmp/ruby/build/trunk'
I, [2024-05-04T03:32:37.791145 #942863]  INFO -- : make[1]: Entering directory '/tmp/ruby/build/trunk'
I, [2024-05-04T03:32:37.791165 #942863]  INFO -- : make[1]: Nothing to be done for 'note'.
I, [2024-05-04T03:32:37.791171 #942863]  INFO -- : make[1]: Leaving directory '/tmp/ruby/build/trunk'
I, [2024-05-04T03:32:37.791953 #942863]  INFO -- : $$$[end] "make all -j20" exit with 0.
I, [2024-05-04T03:32:37.792085 #942863]  INFO -- : $$$[beg] make install -j20
I, [2024-05-04T03:32:37.855730 #942863]  INFO -- : Update minitest to ea9caafc0754b1d6236a490d59e624b53209734a
I, [2024-05-04T03:32:37.855860 #942863]  INFO -- : Update power_assert to 84e85124c5014a139af39161d484156cfe87a9ed
I, [2024-05-04T03:32:37.856036 #942863]  INFO -- : Update rbs to ba7872795d5de04adb8ff500c0e6afdc81a041dd
I, [2024-05-04T03:32:37.856391 #942863]  INFO -- : Update typeprof to b19a6416da3a05d57fadd6ffdadb382b6d236ca5
I, [2024-05-04T03:32:37.857099 #942863]  INFO -- : echo ea9caafc0754b1d6236a490d59e624b53209734a | /bin/sh /tmp/ruby/src/trunk/tool/ifchange /tmp/ruby/src/trunk/.bundle/.timestamp/minitest.revision -
I, [2024-05-04T03:32:37.857263 #942863]  INFO -- : echo 84e85124c5014a139af39161d484156cfe87a9ed | /bin/sh /tmp/ruby/src/trunk/tool/ifchange /tmp/ruby/src/trunk/.bundle/.timestamp/power_assert.revision -
I, [2024-05-04T03:32:37.857641 #942863]  INFO -- : echo ba7872795d5de04adb8ff500c0e6afdc81a041dd | /bin/sh /tmp/ruby/src/trunk/tool/ifchange /tmp/ruby/src/trunk/.bundle/.timestamp/rbs.revision -
I, [2024-05-04T03:32:37.858497 #942863]  INFO -- : 	BASERUBY = /usr/bin/ruby --disable=gems
I, [2024-05-04T03:32:37.858523 #942863]  INFO -- : 	CC = gcc
I, [2024-05-04T03:32:37.858537 #942863]  INFO -- : 	LD = ld
I, [2024-05-04T03:32:37.858548 #942863]  INFO -- : 	LDSHARED = gcc -shared
I, [2024-05-04T03:32:37.858559 #942863]  INFO -- : 	CFLAGS = -O3 -fno-fast-math -ggdb3 -Wall -Wextra -Wdeprecated-declarations -Wdiv-by-zero -Wduplicated-cond -Wimplicit-function-declaration -Wimplicit-int -Wpointer-arith -Wwrite-strings -Wold-style-definition -Wimplicit-fallthrough=0 -Wmissing-noreturn -Wno-cast-function-type -Wno-constant-logical-operand -Wno-long-long -Wno-missing-field-initializers -Wno-overlength-strings -Wno-packed-bitfield-compat -Wno-parentheses-equality -Wno-self-assign -Wno-tautological-compare -Wno-unused-parameter -Wno-unused-value -Wsuggest-attribute=format -Wsuggest-attribute=noreturn -Wunused-variable -Wmisleading-indentation -Wundef   -fPIC 
I, [2024-05-04T03:32:37.858570 #942863]  INFO -- : 	XCFLAGS = -U_FORTIFY_SOURCE -D_FORTIFY_SOURCE=2 -fstack-protector-strong -fno-strict-overflow -fvisibility=hidden -fexcess-precision=standard -DRUBY_EXPORT -I. -I.ext/include/x86_64-linux -I/tmp/ruby/src/trunk/include -I/tmp/ruby/src/trunk -I/tmp/ruby/src/trunk/prism -I/tmp/ruby/src/trunk/enc/unicode/15.0.0  
I, [2024-05-04T03:32:37.858581 #942863]  INFO -- : 	CPPFLAGS =   
I, [2024-05-04T03:32:37.858594 #942863]  INFO -- : 	DLDFLAGS = -Wl,--compress-debug-sections=zlib -Wl,-soname,libruby.so.3.4  -fstack-protector-strong  
I, [2024-05-04T03:32:37.858607 #942863]  INFO -- : 	SOLIBS = -lz -lrt -lrt -lgmp -ldl -lcrypt -lm -lpthread 
I, [2024-05-04T03:32:37.858620 #942863]  INFO -- : 	LANG = en_US.UTF-8
I, [2024-05-04T03:32:37.858640 #942863]  INFO -- : 	LC_ALL = 
I, [2024-05-04T03:32:37.858653 #942863]  INFO -- : 	LC_CTYPE = 
I, [2024-05-04T03:32:37.858666 #942863]  INFO -- : 	MFLAGS = -j20 --jobserver-auth=4,5
I, [2024-05-04T03:32:37.858680 #942863]  INFO -- : 	RUSTC = no
I, [2024-05-04T03:32:37.858694 #942863]  INFO -- : 	YJIT_RUSTC_ARGS = --crate-name=yjit --crate-type=staticlib --edition=2021 -g -C lto=thin -C opt-level=3 -C overflow-checks=on '--out-dir=/tmp/ruby/build/trunk/yjit/target/release/' /tmp/ruby/src/trunk/yjit/src/lib.rs
I, [2024-05-04T03:32:37.859015 #942863]  INFO -- : /tmp/ruby/src/trunk/.bundle/.timestamp/minitest.revision unchanged
I, [2024-05-04T03:32:37.859252 #942863]  INFO -- : /tmp/ruby/src/trunk/.bundle/.timestamp/power_assert.revision unchanged
I, [2024-05-04T03:32:37.859399 #942863]  INFO -- : /tmp/ruby/src/trunk/.bundle/.timestamp/rbs.revision unchanged
I, [2024-05-04T03:32:37.887070 #942863]  INFO -- : echo b19a6416da3a05d57fadd6ffdadb382b6d236ca5 | /bin/sh /tmp/ruby/src/trunk/tool/ifchange /tmp/ruby/src/trunk/.bundle/.timestamp/typeprof.revision -
I, [2024-05-04T03:32:37.887733 #942863]  INFO -- : generating enc.mk
I, [2024-05-04T03:32:37.887782 #942863]  INFO -- : gcc (Ubuntu 11.4.0-1ubuntu1~22.04) 11.4.0
I, [2024-05-04T03:32:37.887794 #942863]  INFO -- : Copyright (C) 2021 Free Software Foundation, Inc.
I, [2024-05-04T03:32:37.887805 #942863]  INFO -- : This is free software; see the source for copying conditions.  There is NO
I, [2024-05-04T03:32:37.887815 #942863]  INFO -- : warranty; not even for MERCHANTABILITY or FITNESS FOR A PARTICULAR PURPOSE.
I, [2024-05-04T03:32:37.887835 #942863]  INFO -- : 
I, [2024-05-04T03:32:37.888901 #942863]  INFO -- : /tmp/ruby/src/trunk/.bundle/.timestamp/typeprof.revision unchanged
I, [2024-05-04T03:32:38.010062 #942863]  INFO -- : Building power_assert@84e85124c5014a139af39161d484156cfe87a9ed to /tmp/ruby/src/trunk/gems/power_assert-2.0.3.gem
I, [2024-05-04T03:32:38.010815 #942863]  INFO -- : making srcs under enc
I, [2024-05-04T03:32:38.010987 #942863]  INFO -- : making enc
I, [2024-05-04T03:32:38.027875 #942863]  INFO -- : make[1]: Entering directory '/tmp/ruby/build/trunk'
I, [2024-05-04T03:32:38.027928 #942863]  INFO -- : make[1]: Nothing to be done for 'enc'.
I, [2024-05-04T03:32:38.027941 #942863]  INFO -- : make[1]: Leaving directory '/tmp/ruby/build/trunk'
I, [2024-05-04T03:32:38.039905 #942863]  INFO -- : make[1]: Entering directory '/tmp/ruby/build/trunk'
I, [2024-05-04T03:32:38.039964 #942863]  INFO -- : make[1]: Nothing to be done for 'srcs'.
I, [2024-05-04T03:32:38.039978 #942863]  INFO -- : make[1]: Leaving directory '/tmp/ruby/build/trunk'
I, [2024-05-04T03:32:38.040554 #942863]  INFO -- : generating transdb.h
I, [2024-05-04T03:32:38.078663 #942863]  INFO -- :   Successfully built RubyGem
I, [2024-05-04T03:32:38.078725 #942863]  INFO -- :   Name: power_assert
I, [2024-05-04T03:32:38.078738 #942863]  INFO -- :   Version: 2.0.4dev
I, [2024-05-04T03:32:38.078749 #942863]  INFO -- :   File: power_assert-2.0.4dev.gem
I, [2024-05-04T03:32:38.080825 #942863]  INFO -- : Extracting bundle gem power_assert-2.0.3...
I, [2024-05-04T03:32:38.136937 #942863]  INFO -- : transdb.h unchanged
I, [2024-05-04T03:32:38.138672 #942863]  INFO -- : generating makefiles ext/configure-ext.mk
I, [2024-05-04T03:32:38.138824 #942863]  INFO -- : making trans
I, [2024-05-04T03:32:38.141621 #942863]  INFO -- : Try with hash version of bundled gems instead of gems/power_assert-2.0.3.gem. We don't use this gem with release version of Ruby.
I, [2024-05-04T03:32:38.146587 #942863]  INFO -- : Unpacked gems/power_assert-2.0.4dev.gem
I, [2024-05-04T03:32:38.165578 #942863]  INFO -- : ext/configure-ext.mk unchanged
I, [2024-05-04T03:32:38.168167 #942863]  INFO -- : make[1]: Entering directory '/tmp/ruby/build/trunk'
I, [2024-05-04T03:32:38.174128 #942863]  INFO -- : make[1]: Entering directory '/tmp/ruby/build/trunk'
I, [2024-05-04T03:32:38.174241 #942863]  INFO -- : make[1]: Nothing to be done for 'trans'.
I, [2024-05-04T03:32:38.174272 #942863]  INFO -- : make[1]: Leaving directory '/tmp/ruby/build/trunk'
I, [2024-05-04T03:32:38.175356 #942863]  INFO -- : making encs
I, [2024-05-04T03:32:38.235186 #942863]  INFO -- : make[1]: Entering directory '/tmp/ruby/build/trunk'
I, [2024-05-04T03:32:38.235245 #942863]  INFO -- : make[1]: Nothing to be done for 'encs'.
I, [2024-05-04T03:32:38.235255 #942863]  INFO -- : make[1]: Leaving directory '/tmp/ruby/build/trunk'
I, [2024-05-04T03:32:38.321367 #942863]  INFO -- : make[1]: Leaving directory '/tmp/ruby/build/trunk'
I, [2024-05-04T03:32:38.321962 #942863]  INFO -- : generating makefile exts.mk
I, [2024-05-04T03:32:38.358570 #942863]  INFO -- : exts.mk unchanged
I, [2024-05-04T03:32:38.363081 #942863]  INFO -- : make[1]: Entering directory '/tmp/ruby/build/trunk'
I, [2024-05-04T03:32:38.382165 #942863]  INFO -- : make[2]: Entering directory '/tmp/ruby/build/trunk/ext/digest'
I, [2024-05-04T03:32:38.383589 #942863]  INFO -- : make[2]: Entering directory '/tmp/ruby/build/trunk/ext/coverage'
I, [2024-05-04T03:32:38.383624 #942863]  INFO -- : make[2]: Entering directory '/tmp/ruby/build/trunk/ext/json'
I, [2024-05-04T03:32:38.384493 #942863]  INFO -- : make[2]: Entering directory '/tmp/ruby/build/trunk/ext/date'
I, [2024-05-04T03:32:38.384689 #942863]  INFO -- : make[2]: Entering directory '/tmp/ruby/build/trunk/ext/io/console'
I, [2024-05-04T03:32:38.385740 #942863]  INFO -- : make[2]: Entering directory '/tmp/ruby/build/trunk/ext/monitor'
I, [2024-05-04T03:32:38.386190 #942863]  INFO -- : make[2]: Entering directory '/tmp/ruby/build/trunk/ext/pathname'
I, [2024-05-04T03:32:38.386215 #942863]  INFO -- : make[2]: Entering directory '/tmp/ruby/build/trunk/ext/fiddle'
I, [2024-05-04T03:32:38.386588 #942863]  INFO -- : make[2]: Entering directory '/tmp/ruby/build/trunk/ext/pty'
I, [2024-05-04T03:32:38.386868 #942863]  INFO -- : make[2]: Leaving directory '/tmp/ruby/build/trunk/ext/coverage'
I, [2024-05-04T03:32:38.387142 #942863]  INFO -- : make[2]: Leaving directory '/tmp/ruby/build/trunk/ext/digest'
I, [2024-05-04T03:32:38.387434 #942863]  INFO -- : make[2]: Entering directory '/tmp/ruby/build/trunk/ext/rubyvm'
I, [2024-05-04T03:32:38.387591 #942863]  INFO -- : make[2]: Entering directory '/tmp/ruby/build/trunk/ext/objspace'
I, [2024-05-04T03:32:38.387889 #942863]  INFO -- : make[2]: Leaving directory '/tmp/ruby/build/trunk/ext/io/console'
I, [2024-05-04T03:32:38.388171 #942863]  INFO -- : make[2]: Leaving directory '/tmp/ruby/build/trunk/ext/date'
I, [2024-05-04T03:32:38.388798 #942863]  INFO -- : make[2]: Entering directory '/tmp/ruby/build/trunk/ext/psych'
I, [2024-05-04T03:32:38.388913 #942863]  INFO -- : make[2]: Leaving directory '/tmp/ruby/build/trunk/ext/rubyvm'
I, [2024-05-04T03:32:38.388946 #942863]  INFO -- : make[2]: Leaving directory '/tmp/ruby/build/trunk/ext/pathname'
I, [2024-05-04T03:32:38.389026 #942863]  INFO -- : make[2]: Leaving directory '/tmp/ruby/build/trunk/ext/json'
I, [2024-05-04T03:32:38.389225 #942863]  INFO -- : make[2]: Leaving directory '/tmp/ruby/build/trunk/ext/pty'
I, [2024-05-04T03:32:38.390774 #942863]  INFO -- : make[2]: Leaving directory '/tmp/ruby/build/trunk/ext/monitor'
I, [2024-05-04T03:32:38.390897 #942863]  INFO -- : make[2]: Leaving directory '/tmp/ruby/build/trunk/ext/objspace'
I, [2024-05-04T03:32:38.391696 #942863]  INFO -- : make[2]: Entering directory '/tmp/ruby/build/trunk/.bundle/gems/debug-1.9.2/ext/debug'
I, [2024-05-04T03:32:38.391723 #942863]  INFO -- : make[2]: Entering directory '/tmp/ruby/build/trunk/.bundle/gems/nkf-0.2.0/ext/nkf'
I, [2024-05-04T03:32:38.391759 #942863]  INFO -- : make[2]: Entering directory '/tmp/ruby/build/trunk/.bundle/gems/bigdecimal-3.1.7/ext/bigdecimal'
I, [2024-05-04T03:32:38.391792 #942863]  INFO -- : make[2]: Entering directory '/tmp/ruby/build/trunk/.bundle/gems/racc-1.7.3/ext/racc/cparse'
I, [2024-05-04T03:32:38.391969 #942863]  INFO -- : make[2]: Entering directory '/tmp/ruby/build/trunk/.bundle/gems/syslog-0.1.2/ext/syslog'
I, [2024-05-04T03:32:38.391995 #942863]  INFO -- : make[2]: Entering directory '/tmp/ruby/build/trunk/ext/ripper'
I, [2024-05-04T03:32:38.392293 #942863]  INFO -- : make[2]: Entering directory '/tmp/ruby/build/trunk/.bundle/gems/rbs-3.4.4/ext/rbs_extension'
I, [2024-05-04T03:32:38.393039 #942863]  INFO -- : make[2]: Leaving directory '/tmp/ruby/build/trunk/ext/fiddle'
I, [2024-05-04T03:32:38.397569 #942863]  INFO -- : make[2]: Entering directory '/tmp/ruby/build/trunk/ext/socket'
I, [2024-05-04T03:32:38.398564 #942863]  INFO -- : make[2]: Entering directory '/tmp/ruby/build/trunk/ext/openssl'
I, [2024-05-04T03:32:38.399270 #942863]  INFO -- : make[2]: Leaving directory '/tmp/ruby/build/trunk/ext/ripper'
I, [2024-05-04T03:32:38.399431 #942863]  INFO -- : make[2]: Leaving directory '/tmp/ruby/build/trunk/ext/psych'
I, [2024-05-04T03:32:38.399629 #942863]  INFO -- : make[2]: Entering directory '/tmp/ruby/build/trunk/ext/digest/sha2'
I, [2024-05-04T03:32:38.402863 #942863]  INFO -- : make[2]: Leaving directory '/tmp/ruby/build/trunk/ext/digest/sha2'
I, [2024-05-04T03:32:38.405722 #942863]  INFO -- : make[2]: Leaving directory '/tmp/ruby/build/trunk/ext/socket'
I, [2024-05-04T03:32:38.409634 #942863]  INFO -- : make[2]: Leaving directory '/tmp/ruby/build/trunk/ext/openssl'
I, [2024-05-04T03:32:38.414827 #942863]  INFO -- : make[2]: Leaving directory '/tmp/ruby/build/trunk/.bundle/gems/debug-1.9.2/ext/debug'
I, [2024-05-04T03:32:38.416441 #942863]  INFO -- : make[2]: Leaving directory '/tmp/ruby/build/trunk/.bundle/gems/rbs-3.4.4/ext/rbs_extension'
I, [2024-05-04T03:32:38.417156 #942863]  INFO -- : make[2]: Leaving directory '/tmp/ruby/build/trunk/.bundle/gems/syslog-0.1.2/ext/syslog'
I, [2024-05-04T03:32:38.419090 #942863]  INFO -- : make[2]: Leaving directory '/tmp/ruby/build/trunk/.bundle/gems/nkf-0.2.0/ext/nkf'
I, [2024-05-04T03:32:38.422306 #942863]  INFO -- : make[2]: Leaving directory '/tmp/ruby/build/trunk/.bundle/gems/bigdecimal-3.1.7/ext/bigdecimal'
I, [2024-05-04T03:32:38.425887 #942863]  INFO -- : make[2]: Leaving directory '/tmp/ruby/build/trunk/.bundle/gems/racc-1.7.3/ext/racc/cparse'
I, [2024-05-04T03:32:38.450889 #942863]  INFO -- : make[2]: Entering directory '/tmp/ruby/build/trunk'
I, [2024-05-04T03:32:38.515778 #942863]  INFO -- : make[2]: 'ruby' is up to date.
I, [2024-05-04T03:32:38.515833 #942863]  INFO -- : make[2]: Leaving directory '/tmp/ruby/build/trunk'
I, [2024-05-04T03:32:38.515999 #942863]  INFO -- : make[1]: Leaving directory '/tmp/ruby/build/trunk'
I, [2024-05-04T03:32:38.519900 #942863]  INFO -- : make[1]: Entering directory '/tmp/ruby/build/trunk'
I, [2024-05-04T03:32:38.519954 #942863]  INFO -- : make[1]: Nothing to be done for 'note'.
I, [2024-05-04T03:32:38.519968 #942863]  INFO -- : make[1]: Leaving directory '/tmp/ruby/build/trunk'
I, [2024-05-04T03:32:38.520233 #942863]  INFO -- : ./miniruby -I/tmp/ruby/src/trunk/lib -I. -I.ext/common  /tmp/ruby/src/trunk/tool/runruby.rb --extout=.ext  -- --disable-gems -r./x86_64-linux-fake /tmp/ruby/src/trunk/tool/rbinstall.rb --make="make" --dest-dir="" --extout=".ext" --ext-build-dir="./ext" --mflags="-j20 --jobserver-auth=4,5" --make-flags=" -j20 --jobserver-auth=4,5" --data-mode=0644 --prog-mode=0755 --installed-list .installed.list --mantype="doc"  --gnumake --install=all --exclude=doc
I, [2024-05-04T03:32:38.616330 #942863]  INFO -- : Installing to 
I, [2024-05-04T03:32:38.616413 #942863]  INFO -- : installing binary commands:         /tmp/ruby/install/trunk/bin
I, [2024-05-04T03:32:38.616428 #942863]  INFO -- : installing base libraries:          /tmp/ruby/install/trunk/lib
I, [2024-05-04T03:32:38.623993 #942863]  INFO -- : installing arch files:              /tmp/ruby/install/trunk/lib/ruby/3.4.0+0/x86_64-linux
I, [2024-05-04T03:32:38.624053 #942863]  INFO -- : installing pkgconfig data:          /tmp/ruby/install/trunk/lib/pkgconfig
I, [2024-05-04T03:32:38.624073 #942863]  INFO -- : installing extension objects:       /tmp/ruby/install/trunk/lib/ruby/3.4.0+0/x86_64-linux
I, [2024-05-04T03:32:38.633884 #942863]  INFO -- : installing extension objects:       /tmp/ruby/install/trunk/lib/ruby/site_ruby/3.4.0+0/x86_64-linux
I, [2024-05-04T03:32:38.633944 #942863]  INFO -- : installing extension objects:       /tmp/ruby/install/trunk/lib/ruby/vendor_ruby/3.4.0+0/x86_64-linux
I, [2024-05-04T03:32:38.633958 #942863]  INFO -- : installing extension headers:       /tmp/ruby/install/trunk/include/ruby-3.4.0+0/x86_64-linux
I, [2024-05-04T03:32:38.634038 #942863]  INFO -- : installing extension scripts:       /tmp/ruby/install/trunk/lib/ruby/3.4.0+0
I, [2024-05-04T03:32:38.637835 #942863]  INFO -- : installing extension scripts:       /tmp/ruby/install/trunk/lib/ruby/site_ruby/3.4.0+0
I, [2024-05-04T03:32:38.637895 #942863]  INFO -- : installing extension scripts:       /tmp/ruby/install/trunk/lib/ruby/vendor_ruby/3.4.0+0
I, [2024-05-04T03:32:38.637915 #942863]  INFO -- : installing extension headers:       /tmp/ruby/install/trunk/include/ruby-3.4.0+0/ruby
I, [2024-05-04T03:32:38.637927 #942863]  INFO -- : installing command scripts:         /tmp/ruby/install/trunk/bin
I, [2024-05-04T03:32:38.637940 #942863]  INFO -- : installing library scripts:         /tmp/ruby/install/trunk/lib/ruby/3.4.0+0
I, [2024-05-04T03:32:38.672285 #942863]  INFO -- : installing common headers:          /tmp/ruby/install/trunk/include/ruby-3.4.0+0
I, [2024-05-04T03:32:38.677812 #942863]  INFO -- : installing manpages:                /tmp/ruby/install/trunk/share/man/man1
I, [2024-05-04T03:32:38.677879 #942863]  INFO -- : installing default gems from lib:   /tmp/ruby/install/trunk/lib/ruby/gems/3.4.0+0
I, [2024-05-04T03:32:38.700493 #942863]  INFO -- :                                     benchmark 0.3.0
I, [2024-05-04T03:32:38.707494 #942863]  INFO -- :                                     bundler 2.6.0.dev
I, [2024-05-04T03:32:38.709654 #942863]  INFO -- :                                     cgi 0.4.1
I, [2024-05-04T03:32:38.710189 #942863]  INFO -- :                                     delegate 0.3.1
I, [2024-05-04T03:32:38.710651 #942863]  INFO -- :                                     did_you_mean 1.6.3
I, [2024-05-04T03:32:38.711164 #942863]  INFO -- :                                     english 0.8.0
I, [2024-05-04T03:32:38.711577 #942863]  INFO -- :                                     erb 4.0.4
I, [2024-05-04T03:32:38.712328 #942863]  INFO -- :                                     error_highlight 0.6.0
I, [2024-05-04T03:32:38.712777 #942863]  INFO -- :                                     fileutils 1.7.2
I, [2024-05-04T03:32:38.713187 #942863]  INFO -- :                                     find 0.2.0
I, [2024-05-04T03:32:38.713596 #942863]  INFO -- :                                     forwardable 1.3.3
I, [2024-05-04T03:32:38.714044 #942863]  INFO -- :                                     ipaddr 1.2.6
I, [2024-05-04T03:32:38.714561 #942863]  INFO -- :                                     irb 1.13.0
I, [2024-05-04T03:32:38.716067 #942863]  INFO -- :                                     logger 1.6.0
I, [2024-05-04T03:32:38.716563 #942863]  INFO -- :                                     net-http 0.4.1
I, [2024-05-04T03:32:38.717083 #942863]  INFO -- :                                     net-protocol 0.2.2
I, [2024-05-04T03:32:38.717574 #942863]  INFO -- :                                     open-uri 0.4.1
I, [2024-05-04T03:32:38.718086 #942863]  INFO -- :                                     open3 0.2.1
I, [2024-05-04T03:32:38.718560 #942863]  INFO -- :                                     optparse 0.5.0
I, [2024-05-04T03:32:38.718991 #942863]  INFO -- :                                     ostruct 0.6.0
I, [2024-05-04T03:32:38.719460 #942863]  INFO -- :                                     pp 0.5.0
I, [2024-05-04T03:32:38.720003 #942863]  INFO -- :                                     prettyprint 0.2.0
I, [2024-05-04T03:32:38.720415 #942863]  INFO -- :                                     prism 0.27.0
I, [2024-05-04T03:32:38.720964 #942863]  INFO -- :                                     pstore 0.1.3
I, [2024-05-04T03:32:38.721417 #942863]  INFO -- :                                     rdoc 6.6.3.1
I, [2024-05-04T03:32:38.723066 #942863]  INFO -- :                                     readline 0.0.4
I, [2024-05-04T03:32:38.723588 #942863]  INFO -- :                                     reline 0.5.5
I, [2024-05-04T03:32:38.724128 #942863]  INFO -- :                                     resolv 0.4.0
I, [2024-05-04T03:32:38.724642 #942863]  INFO -- :                                     ruby2_keywords 0.0.5
I, [2024-05-04T03:32:38.725086 #942863]  INFO -- :                                     securerandom 0.3.1
I, [2024-05-04T03:32:38.725618 #942863]  INFO -- :                                     set 1.1.0
I, [2024-05-04T03:32:38.726206 #942863]  INFO -- :                                     shellwords 0.2.0
I, [2024-05-04T03:32:38.726685 #942863]  INFO -- :                                     singleton 0.2.0
I, [2024-05-04T03:32:38.727134 #942863]  INFO -- :                                     syntax_suggest 2.0.0
I, [2024-05-04T03:32:38.727783 #942863]  INFO -- :                                     tempfile 0.2.1
I, [2024-05-04T03:32:38.728330 #942863]  INFO -- :                                     time 0.3.0
I, [2024-05-04T03:32:38.728767 #942863]  INFO -- :                                     timeout 0.4.1
I, [2024-05-04T03:32:38.729894 #942863]  INFO -- :                                     tmpdir 0.2.0
I, [2024-05-04T03:32:38.730415 #942863]  INFO -- :                                     tsort 0.2.0
I, [2024-05-04T03:32:38.730900 #942863]  INFO -- :                                     un 0.3.0
I, [2024-05-04T03:32:38.731394 #942863]  INFO -- :                                     uri 0.13.0
I, [2024-05-04T03:32:38.731907 #942863]  INFO -- :                                     weakref 0.1.3
I, [2024-05-04T03:32:38.732421 #942863]  INFO -- :                                     yaml 0.3.0
I, [2024-05-04T03:32:38.732923 #942863]  INFO -- : installing default gems from ext:   /tmp/ruby/install/trunk/lib/ruby/gems/3.4.0+0
I, [2024-05-04T03:32:38.739659 #942863]  INFO -- :                                     date 3.3.4
I, [2024-05-04T03:32:38.740199 #942863]  INFO -- :                                     digest 3.1.1
I, [2024-05-04T03:32:38.740802 #942863]  INFO -- :                                     etc 1.4.3
I, [2024-05-04T03:32:38.741321 #942863]  INFO -- :                                     fcntl 1.1.0
I, [2024-05-04T03:32:38.741790 #942863]  INFO -- :                                     fiddle 1.1.3
I, [2024-05-04T03:32:38.742274 #942863]  INFO -- :                                     io-console 0.7.2
I, [2024-05-04T03:32:38.742750 #942863]  INFO -- :                                     io-nonblock 0.3.0
I, [2024-05-04T03:32:38.743181 #942863]  INFO -- :                                     io-wait 0.3.1
I, [2024-05-04T03:32:38.743761 #942863]  INFO -- :                                     json 2.7.2
I, [2024-05-04T03:32:38.744751 #942863]  INFO -- :                                     openssl 3.2.0
I, [2024-05-04T03:32:38.745469 #942863]  INFO -- :                                     pathname 0.3.0
I, [2024-05-04T03:32:38.745994 #942863]  INFO -- :                                     psych 5.1.2
I, [2024-05-04T03:32:38.746494 #942863]  INFO -- :                                     stringio 3.1.1
I, [2024-05-04T03:32:38.747061 #942863]  INFO -- :                                     strscan 3.1.1
I, [2024-05-04T03:32:38.747534 #942863]  INFO -- :                                     zlib 3.1.0
I, [2024-05-04T03:32:38.747942 #942863]  INFO -- : installing bundled gems:            /tmp/ruby/install/trunk/lib/ruby/gems/3.4.0+0
I, [2024-05-04T03:32:38.748363 #942863]  INFO -- :                                     minitest 5.22.3
I, [2024-05-04T03:32:38.755821 #942863]  INFO -- :                                     rake 13.2.1
I, [2024-05-04T03:32:38.759426 #942863]  INFO -- :                                     test-unit 3.6.2
I, [2024-05-04T03:32:38.763923 #942863]  INFO -- :                                     rexml 3.2.6
I, [2024-05-04T03:32:38.767439 #942863]  INFO -- :                                     rss 0.3.0
I, [2024-05-04T03:32:38.770462 #942863]  INFO -- :                                     net-ftp 0.3.4
I, [2024-05-04T03:32:38.771948 #942863]  INFO -- :                                     net-imap 0.4.10
I, [2024-05-04T03:32:38.774929 #942863]  INFO -- :                                     net-pop 0.1.2
I, [2024-05-04T03:32:38.775832 #942863]  INFO -- :                                     net-smtp 0.5.0
I, [2024-05-04T03:32:38.776903 #942863]  INFO -- :                                     matrix 0.4.2
I, [2024-05-04T03:32:38.780689 #942863]  INFO -- :                                     prime 0.1.2
I, [2024-05-04T03:32:38.786111 #942863]  INFO -- :                                     rbs 3.4.4
I, [2024-05-04T03:32:38.809318 #942863]  INFO -- :                                     typeprof 0.21.11
I, [2024-05-04T03:32:38.811955 #942863]  INFO -- :                                     debug 1.9.2
I, [2024-05-04T03:32:38.815229 #942863]  INFO -- :                                     racc 1.7.3
I, [2024-05-04T03:32:38.817796 #942863]  INFO -- :                                     mutex_m 0.2.0
I, [2024-05-04T03:32:38.818947 #942863]  INFO -- :                                     getoptlong 0.2.1
I, [2024-05-04T03:32:38.820317 #942863]  INFO -- :                                     base64 0.2.0
I, [2024-05-04T03:32:38.821464 #942863]  INFO -- :                                     bigdecimal 3.1.7
I, [2024-05-04T03:32:38.823438 #942863]  INFO -- :                                     observer 0.1.2
I, [2024-05-04T03:32:38.824948 #942863]  INFO -- :                                     abbrev 0.1.2
I, [2024-05-04T03:32:38.825957 #942863]  INFO -- :                                     resolv-replace 0.1.1
I, [2024-05-04T03:32:38.827321 #942863]  INFO -- :                                     rinda 0.2.0
I, [2024-05-04T03:32:38.828679 #942863]  INFO -- :                                     drb 2.2.1
I, [2024-05-04T03:32:38.830225 #942863]  INFO -- :                                     nkf 0.2.0
I, [2024-05-04T03:32:38.832775 #942863]  INFO -- :                                     syslog 0.1.2
I, [2024-05-04T03:32:38.834339 #942863]  INFO -- :                                     csv 3.3.0
I, [2024-05-04T03:32:38.836673 #942863]  INFO -- : installing bundled gem cache:       /tmp/ruby/install/trunk/lib/ruby/gems/3.4.0+0/cache
I, [2024-05-04T03:32:38.838215 #942863]  INFO -- : skipped bundled gems:
I, [2024-05-04T03:32:38.838236 #942863]  INFO -- :     power_assert-2.0.4dev.gem       not found in bundled_gems
I, [2024-05-04T03:32:38.841564 #942863]  INFO -- : $$$[end] "make install -j20" exit with 0.
I, [2024-05-04T03:32:38.841676 #942863]  INFO -- : $$$[beg] make yes-btest TESTOPTS='-q -j20'
I, [2024-05-04T03:32:45.433997 #942863]  INFO -- : PASS all 1935 tests
E, [2024-05-04T03:32:45.439534 #942863] ERROR -- :  
I, [2024-05-04T03:32:45.439699 #942863]  INFO -- : $$$[end] "make yes-btest TESTOPTS='-q -j20'" exit with 0.
I, [2024-05-04T03:32:45.439787 #942863]  INFO -- : $$$[beg] make yes-test-basic TESTS='-j20'
I, [2024-05-04T03:32:45.498925 #942863]  INFO -- : 	BASERUBY = /usr/bin/ruby --disable=gems
I, [2024-05-04T03:32:45.498958 #942863]  INFO -- : 	CC = gcc
I, [2024-05-04T03:32:45.498966 #942863]  INFO -- : 	LD = ld
I, [2024-05-04T03:32:45.498972 #942863]  INFO -- : 	LDSHARED = gcc -shared
I, [2024-05-04T03:32:45.498977 #942863]  INFO -- : 	CFLAGS = -O3 -fno-fast-math -ggdb3 -Wall -Wextra -Wdeprecated-declarations -Wdiv-by-zero -Wduplicated-cond -Wimplicit-function-declaration -Wimplicit-int -Wpointer-arith -Wwrite-strings -Wold-style-definition -Wimplicit-fallthrough=0 -Wmissing-noreturn -Wno-cast-function-type -Wno-constant-logical-operand -Wno-long-long -Wno-missing-field-initializers -Wno-overlength-strings -Wno-packed-bitfield-compat -Wno-parentheses-equality -Wno-self-assign -Wno-tautological-compare -Wno-unused-parameter -Wno-unused-value -Wsuggest-attribute=format -Wsuggest-attribute=noreturn -Wunused-variable -Wmisleading-indentation -Wundef   -fPIC 
I, [2024-05-04T03:32:45.498985 #942863]  INFO -- : 	XCFLAGS = -U_FORTIFY_SOURCE -D_FORTIFY_SOURCE=2 -fstack-protector-strong -fno-strict-overflow -fvisibility=hidden -fexcess-precision=standard -DRUBY_EXPORT -I. -I.ext/include/x86_64-linux -I/tmp/ruby/src/trunk/include -I/tmp/ruby/src/trunk -I/tmp/ruby/src/trunk/prism -I/tmp/ruby/src/trunk/enc/unicode/15.0.0  
I, [2024-05-04T03:32:45.498989 #942863]  INFO -- : 	CPPFLAGS =   
I, [2024-05-04T03:32:45.498993 #942863]  INFO -- : 	DLDFLAGS = -Wl,--compress-debug-sections=zlib -Wl,-soname,libruby.so.3.4  -fstack-protector-strong  
I, [2024-05-04T03:32:45.498996 #942863]  INFO -- : 	SOLIBS = -lz -lrt -lrt -lgmp -ldl -lcrypt -lm -lpthread 
I, [2024-05-04T03:32:45.499000 #942863]  INFO -- : 	LANG = en_US.UTF-8
I, [2024-05-04T03:32:45.499003 #942863]  INFO -- : 	LC_ALL = 
I, [2024-05-04T03:32:45.499008 #942863]  INFO -- : 	LC_CTYPE = 
I, [2024-05-04T03:32:45.499011 #942863]  INFO -- : 	MFLAGS = 
I, [2024-05-04T03:32:45.499014 #942863]  INFO -- : 	RUSTC = no
I, [2024-05-04T03:32:45.499018 #942863]  INFO -- : 	YJIT_RUSTC_ARGS = --crate-name=yjit --crate-type=staticlib --edition=2021 -g -C lto=thin -C opt-level=3 -C overflow-checks=on '--out-dir=/tmp/ruby/build/trunk/yjit/target/release/' /tmp/ruby/src/trunk/yjit/src/lib.rs
I, [2024-05-04T03:32:45.499685 #942863]  INFO -- : gcc (Ubuntu 11.4.0-1ubuntu1~22.04) 11.4.0
I, [2024-05-04T03:32:45.499705 #942863]  INFO -- : Copyright (C) 2021 Free Software Foundation, Inc.
I, [2024-05-04T03:32:45.499711 #942863]  INFO -- : This is free software; see the source for copying conditions.  There is NO
I, [2024-05-04T03:32:45.499715 #942863]  INFO -- : warranty; not even for MERCHANTABILITY or FITNESS FOR A PARTICULAR PURPOSE.
I, [2024-05-04T03:32:45.499718 #942863]  INFO -- : 
I, [2024-05-04T03:32:45.605084 #942863]  INFO -- : Checking leaked global symbols...none
I, [2024-05-04T03:32:45.646567 #942863]  INFO -- : /tmp/ruby/src/trunk/basictest/test.rb:assignment ....................................................................................................................................................................................................................................................................................................................................................................................OK 372
I, [2024-05-04T03:32:45.646624 #942863]  INFO -- : /tmp/ruby/src/trunk/basictest/test.rb:condition ..OK 2
I, [2024-05-04T03:32:45.646630 #942863]  INFO -- : /tmp/ruby/src/trunk/basictest/test.rb:if/unless ...OK 3
I, [2024-05-04T03:32:45.646635 #942863]  INFO -- : /tmp/ruby/src/trunk/basictest/test.rb:case .....OK 5
I, [2024-05-04T03:32:45.646849 #942863]  INFO -- : /tmp/ruby/src/trunk/basictest/test.rb:while/until ........OK 8
I, [2024-05-04T03:32:45.646908 #942863]  INFO -- : /tmp/ruby/src/trunk/basictest/test.rb:exception ..........OK 10
I, [2024-05-04T03:32:45.647186 #942863]  INFO -- : /tmp/ruby/src/trunk/basictest/test.rb:array .......................................OK 39
I, [2024-05-04T03:32:45.647282 #942863]  INFO -- : /tmp/ruby/src/trunk/basictest/test.rb:hash ...........................OK 27
I, [2024-05-04T03:32:45.648013 #942863]  INFO -- : /tmp/ruby/src/trunk/basictest/test.rb:iterator ...........................................................................................................OK 107
I, [2024-05-04T03:32:45.648300 #942863]  INFO -- : /tmp/ruby/src/trunk/basictest/test.rb:float ................................................................................OK 80
I, [2024-05-04T03:32:45.649308 #942863]  INFO -- : /tmp/ruby/src/trunk/basictest/test.rb:bignum ...............................OK 31
I, [2024-05-04T03:32:45.650089 #942863]  INFO -- : /tmp/ruby/src/trunk/basictest/test.rb:string & char ..............................................................OK 62
I, [2024-05-04T03:32:45.650119 #942863]  INFO -- : /tmp/ruby/src/trunk/basictest/test.rb:assignment ..........OK 10
I, [2024-05-04T03:32:45.650149 #942863]  INFO -- : /tmp/ruby/src/trunk/basictest/test.rb:call ......OK 6
I, [2024-05-04T03:32:45.650203 #942863]  INFO -- : /tmp/ruby/src/trunk/basictest/test.rb:proc .........OK 9
I, [2024-05-04T03:32:45.750495 #942863]  INFO -- : /tmp/ruby/src/trunk/basictest/test.rb:signal ..OK 2
I, [2024-05-04T03:32:45.750959 #942863]  INFO -- : /tmp/ruby/src/trunk/basictest/test.rb:eval ...........................OK 27
I, [2024-05-04T03:32:45.851568 #942863]  INFO -- : /tmp/ruby/src/trunk/basictest/test.rb:system ........OK 8
I, [2024-05-04T03:32:45.851631 #942863]  INFO -- : /tmp/ruby/src/trunk/basictest/test.rb:const .....OK 5
I, [2024-05-04T03:32:45.851637 #942863]  INFO -- : /tmp/ruby/src/trunk/basictest/test.rb:clone .....OK 5
I, [2024-05-04T03:32:45.851696 #942863]  INFO -- : /tmp/ruby/src/trunk/basictest/test.rb:marshal ....OK 4
I, [2024-05-04T03:32:45.851745 #942863]  INFO -- : /tmp/ruby/src/trunk/basictest/test.rb:pack ....OK 4
I, [2024-05-04T03:32:45.851758 #942863]  INFO -- : /tmp/ruby/src/trunk/basictest/test.rb:math ..OK 2
I, [2024-05-04T03:32:45.851809 #942863]  INFO -- : /tmp/ruby/src/trunk/basictest/test.rb:struct ......OK 6
I, [2024-05-04T03:32:45.851896 #942863]  INFO -- : /tmp/ruby/src/trunk/basictest/test.rb:variable ............OK 12
I, [2024-05-04T03:32:45.851919 #942863]  INFO -- : /tmp/ruby/src/trunk/basictest/test.rb:trace ...OK 3
I, [2024-05-04T03:32:45.851977 #942863]  INFO -- : /tmp/ruby/src/trunk/basictest/test.rb:defined? ............OK 12
I, [2024-05-04T03:32:45.852022 #942863]  INFO -- : /tmp/ruby/src/trunk/basictest/test.rb:alias ......OK 6
I, [2024-05-04T03:32:45.852403 #942863]  INFO -- : /tmp/ruby/src/trunk/basictest/test.rb:path .......................OK 23
I, [2024-05-04T03:32:45.885926 #942863]  INFO -- : /tmp/ruby/src/trunk/basictest/test.rb:gc ....OK 4
I, [2024-05-04T03:32:45.888260 #942863]  INFO -- : 
I, [2024-05-04T03:32:45.888302 #942863]  INFO -- : test succeeded
I, [2024-05-04T03:32:45.889878 #942863]  INFO -- : $$$[end] "make yes-test-basic TESTS='-j20'" exit with 0.
I, [2024-05-04T03:32:45.889958 #942863]  INFO -- : $$$[beg] make yes-test-all TESTOPTS='--stderr-on-failure' TESTS='-j20'
I, [2024-05-04T03:32:45.977379 #942863]  INFO -- : 	BASERUBY = /usr/bin/ruby --disable=gems
I, [2024-05-04T03:32:45.977412 #942863]  INFO -- : 	CC = gcc
I, [2024-05-04T03:32:45.977418 #942863]  INFO -- : 	LD = ld
I, [2024-05-04T03:32:45.977422 #942863]  INFO -- : 	LDSHARED = gcc -shared
I, [2024-05-04T03:32:45.977426 #942863]  INFO -- : 	CFLAGS = -O3 -fno-fast-math -ggdb3 -Wall -Wextra -Wdeprecated-declarations -Wdiv-by-zero -Wduplicated-cond -Wimplicit-function-declaration -Wimplicit-int -Wpointer-arith -Wwrite-strings -Wold-style-definition -Wimplicit-fallthrough=0 -Wmissing-noreturn -Wno-cast-function-type -Wno-constant-logical-operand -Wno-long-long -Wno-missing-field-initializers -Wno-overlength-strings -Wno-packed-bitfield-compat -Wno-parentheses-equality -Wno-self-assign -Wno-tautological-compare -Wno-unused-parameter -Wno-unused-value -Wsuggest-attribute=format -Wsuggest-attribute=noreturn -Wunused-variable -Wmisleading-indentation -Wundef   -fPIC 
I, [2024-05-04T03:32:45.977430 #942863]  INFO -- : 	XCFLAGS = -U_FORTIFY_SOURCE -D_FORTIFY_SOURCE=2 -fstack-protector-strong -fno-strict-overflow -fvisibility=hidden -fexcess-precision=standard -DRUBY_EXPORT -I. -I.ext/include/x86_64-linux -I/tmp/ruby/src/trunk/include -I/tmp/ruby/src/trunk -I/tmp/ruby/src/trunk/prism -I/tmp/ruby/src/trunk/enc/unicode/15.0.0  
I, [2024-05-04T03:32:45.977434 #942863]  INFO -- : 	CPPFLAGS =   
I, [2024-05-04T03:32:45.977438 #942863]  INFO -- : 	DLDFLAGS = -Wl,--compress-debug-sections=zlib -Wl,-soname,libruby.so.3.4  -fstack-protector-strong  
I, [2024-05-04T03:32:45.977441 #942863]  INFO -- : 	SOLIBS = -lz -lrt -lrt -lgmp -ldl -lcrypt -lm -lpthread 
I, [2024-05-04T03:32:45.977445 #942863]  INFO -- : 	LANG = en_US.UTF-8
I, [2024-05-04T03:32:45.977448 #942863]  INFO -- : 	LC_ALL = 
I, [2024-05-04T03:32:45.977451 #942863]  INFO -- : 	LC_CTYPE = 
I, [2024-05-04T03:32:45.977455 #942863]  INFO -- : 	MFLAGS = 
I, [2024-05-04T03:32:45.977458 #942863]  INFO -- : 	RUSTC = no
I, [2024-05-04T03:32:45.977463 #942863]  INFO -- : 	YJIT_RUSTC_ARGS = --crate-name=yjit --crate-type=staticlib --edition=2021 -g -C lto=thin -C opt-level=3 -C overflow-checks=on '--out-dir=/tmp/ruby/build/trunk/yjit/target/release/' /tmp/ruby/src/trunk/yjit/src/lib.rs
I, [2024-05-04T03:32:45.978082 #942863]  INFO -- : gcc (Ubuntu 11.4.0-1ubuntu1~22.04) 11.4.0
I, [2024-05-04T03:32:45.978102 #942863]  INFO -- : Copyright (C) 2021 Free Software Foundation, Inc.
I, [2024-05-04T03:32:45.978108 #942863]  INFO -- : This is free software; see the source for copying conditions.  There is NO
I, [2024-05-04T03:32:45.978112 #942863]  INFO -- : warranty; not even for MERCHANTABILITY or FITNESS FOR A PARTICULAR PURPOSE.
I, [2024-05-04T03:32:45.978116 #942863]  INFO -- : 
I, [2024-05-04T03:32:45.979756 #942863]  INFO -- : generating enc.mk
I, [2024-05-04T03:32:46.097531 #942863]  INFO -- : making enc
I, [2024-05-04T03:32:46.115081 #942863]  INFO -- : make[1]: Entering directory '/tmp/ruby/build/trunk'
I, [2024-05-04T03:32:46.115104 #942863]  INFO -- : make[1]: Nothing to be done for 'enc'.
I, [2024-05-04T03:32:46.115110 #942863]  INFO -- : make[1]: Leaving directory '/tmp/ruby/build/trunk'
I, [2024-05-04T03:32:46.115764 #942863]  INFO -- : making srcs under enc
I, [2024-05-04T03:32:46.145399 #942863]  INFO -- : make[1]: Entering directory '/tmp/ruby/build/trunk'
I, [2024-05-04T03:32:46.145420 #942863]  INFO -- : make[1]: Nothing to be done for 'srcs'.
I, [2024-05-04T03:32:46.145425 #942863]  INFO -- : make[1]: Leaving directory '/tmp/ruby/build/trunk'
I, [2024-05-04T03:32:46.146272 #942863]  INFO -- : generating transdb.h
I, [2024-05-04T03:32:46.240793 #942863]  INFO -- : transdb.h unchanged
I, [2024-05-04T03:32:46.242129 #942863]  INFO -- : making trans
I, [2024-05-04T03:32:46.275410 #942863]  INFO -- : make[1]: Entering directory '/tmp/ruby/build/trunk'
I, [2024-05-04T03:32:46.275438 #942863]  INFO -- : make[1]: Nothing to be done for 'trans'.
I, [2024-05-04T03:32:46.275444 #942863]  INFO -- : make[1]: Leaving directory '/tmp/ruby/build/trunk'
I, [2024-05-04T03:32:46.276100 #942863]  INFO -- : making encs
I, [2024-05-04T03:32:46.313718 #942863]  INFO -- : make[1]: Entering directory '/tmp/ruby/build/trunk'
I, [2024-05-04T03:32:46.313740 #942863]  INFO -- : make[1]: Nothing to be done for 'encs'.
I, [2024-05-04T03:32:46.313746 #942863]  INFO -- : make[1]: Leaving directory '/tmp/ruby/build/trunk'
I, [2024-05-04T03:32:46.315527 #942863]  INFO -- : generating makefiles ext/configure-ext.mk
I, [2024-05-04T03:32:46.342309 #942863]  INFO -- : ext/configure-ext.mk updated
I, [2024-05-04T03:32:46.344802 #942863]  INFO -- : make[1]: Entering directory '/tmp/ruby/build/trunk'
I, [2024-05-04T03:32:47.693261 #942863]  INFO -- : make[1]: Leaving directory '/tmp/ruby/build/trunk'
I, [2024-05-04T03:32:47.693930 #942863]  INFO -- : generating makefile exts.mk
I, [2024-05-04T03:32:47.730862 #942863]  INFO -- : exts.mk unchanged
I, [2024-05-04T03:32:47.735280 #942863]  INFO -- : make[1]: Entering directory '/tmp/ruby/build/trunk'
I, [2024-05-04T03:32:47.946548 #942863]  INFO -- : make[2]: Entering directory '/tmp/ruby/build/trunk/ext/coverage'
I, [2024-05-04T03:32:47.949430 #942863]  INFO -- : make[2]: Leaving directory '/tmp/ruby/build/trunk/ext/coverage'
I, [2024-05-04T03:32:47.953300 #942863]  INFO -- : make[2]: Entering directory '/tmp/ruby/build/trunk/ext/date'
I, [2024-05-04T03:32:47.956354 #942863]  INFO -- : make[2]: Leaving directory '/tmp/ruby/build/trunk/ext/date'
I, [2024-05-04T03:32:47.958578 #942863]  INFO -- : make[2]: Entering directory '/tmp/ruby/build/trunk/ext/digest'
I, [2024-05-04T03:32:47.963897 #942863]  INFO -- : make[2]: Leaving directory '/tmp/ruby/build/trunk/ext/digest'
I, [2024-05-04T03:32:47.979199 #942863]  INFO -- : make[2]: Entering directory '/tmp/ruby/build/trunk/ext/digest/sha2'
I, [2024-05-04T03:32:47.982279 #942863]  INFO -- : make[2]: Leaving directory '/tmp/ruby/build/trunk/ext/digest/sha2'
I, [2024-05-04T03:32:47.994808 #942863]  INFO -- : make[2]: Entering directory '/tmp/ruby/build/trunk/ext/fiddle'
I, [2024-05-04T03:32:48.001260 #942863]  INFO -- : make[2]: Leaving directory '/tmp/ruby/build/trunk/ext/fiddle'
I, [2024-05-04T03:32:48.004423 #942863]  INFO -- : make[2]: Entering directory '/tmp/ruby/build/trunk/ext/io/console'
I, [2024-05-04T03:32:48.006988 #942863]  INFO -- : make[2]: Leaving directory '/tmp/ruby/build/trunk/ext/io/console'
I, [2024-05-04T03:32:48.014545 #942863]  INFO -- : make[2]: Entering directory '/tmp/ruby/build/trunk/ext/json'
I, [2024-05-04T03:32:48.020776 #942863]  INFO -- : make[2]: Leaving directory '/tmp/ruby/build/trunk/ext/json'
I, [2024-05-04T03:32:48.029955 #942863]  INFO -- : make[2]: Entering directory '/tmp/ruby/build/trunk/ext/monitor'
I, [2024-05-04T03:32:48.032332 #942863]  INFO -- : make[2]: Leaving directory '/tmp/ruby/build/trunk/ext/monitor'
I, [2024-05-04T03:32:48.036466 #942863]  INFO -- : make[2]: Entering directory '/tmp/ruby/build/trunk/ext/objspace'
I, [2024-05-04T03:32:48.040172 #942863]  INFO -- : make[2]: Leaving directory '/tmp/ruby/build/trunk/ext/objspace'
I, [2024-05-04T03:32:48.052213 #942863]  INFO -- : make[2]: Entering directory '/tmp/ruby/build/trunk/ext/openssl'
I, [2024-05-04T03:32:48.065284 #942863]  INFO -- : make[2]: Leaving directory '/tmp/ruby/build/trunk/ext/openssl'
I, [2024-05-04T03:32:48.068247 #942863]  INFO -- : make[2]: Entering directory '/tmp/ruby/build/trunk/ext/pathname'
I, [2024-05-04T03:32:48.070728 #942863]  INFO -- : make[2]: Leaving directory '/tmp/ruby/build/trunk/ext/pathname'
I, [2024-05-04T03:32:48.074917 #942863]  INFO -- : make[2]: Entering directory '/tmp/ruby/build/trunk/ext/psych'
I, [2024-05-04T03:32:48.089743 #942863]  INFO -- : make[2]: Leaving directory '/tmp/ruby/build/trunk/ext/psych'
I, [2024-05-04T03:32:48.092864 #942863]  INFO -- : make[2]: Entering directory '/tmp/ruby/build/trunk/ext/pty'
I, [2024-05-04T03:32:48.095383 #942863]  INFO -- : make[2]: Leaving directory '/tmp/ruby/build/trunk/ext/pty'
I, [2024-05-04T03:32:48.104859 #942863]  INFO -- : make[2]: Entering directory '/tmp/ruby/build/trunk/ext/ripper'
I, [2024-05-04T03:32:48.109661 #942863]  INFO -- : make[2]: Leaving directory '/tmp/ruby/build/trunk/ext/ripper'
I, [2024-05-04T03:32:48.111121 #942863]  INFO -- : make[2]: Entering directory '/tmp/ruby/build/trunk/ext/rubyvm'
I, [2024-05-04T03:32:48.113151 #942863]  INFO -- : make[2]: Leaving directory '/tmp/ruby/build/trunk/ext/rubyvm'
I, [2024-05-04T03:32:48.120998 #942863]  INFO -- : make[2]: Entering directory '/tmp/ruby/build/trunk/ext/socket'
I, [2024-05-04T03:32:48.127335 #942863]  INFO -- : make[2]: Leaving directory '/tmp/ruby/build/trunk/ext/socket'
I, [2024-05-04T03:32:48.138179 #942863]  INFO -- : make[2]: Entering directory '/tmp/ruby/build/trunk/.bundle/gems/bigdecimal-3.1.7/ext/bigdecimal'
I, [2024-05-04T03:32:48.161476 #942863]  INFO -- : make[2]: Leaving directory '/tmp/ruby/build/trunk/.bundle/gems/bigdecimal-3.1.7/ext/bigdecimal'
I, [2024-05-04T03:32:48.163494 #942863]  INFO -- : make[2]: Entering directory '/tmp/ruby/build/trunk/.bundle/gems/debug-1.9.2/ext/debug'
I, [2024-05-04T03:32:48.185288 #942863]  INFO -- : make[2]: Leaving directory '/tmp/ruby/build/trunk/.bundle/gems/debug-1.9.2/ext/debug'
I, [2024-05-04T03:32:48.187172 #942863]  INFO -- : make[2]: Entering directory '/tmp/ruby/build/trunk/.bundle/gems/nkf-0.2.0/ext/nkf'
I, [2024-05-04T03:32:48.208694 #942863]  INFO -- : make[2]: Leaving directory '/tmp/ruby/build/trunk/.bundle/gems/nkf-0.2.0/ext/nkf'
I, [2024-05-04T03:32:48.210625 #942863]  INFO -- : make[2]: Entering directory '/tmp/ruby/build/trunk/.bundle/gems/racc-1.7.3/ext/racc/cparse'
I, [2024-05-04T03:32:48.232776 #942863]  INFO -- : make[2]: Leaving directory '/tmp/ruby/build/trunk/.bundle/gems/racc-1.7.3/ext/racc/cparse'
I, [2024-05-04T03:32:48.235118 #942863]  INFO -- : make[2]: Entering directory '/tmp/ruby/build/trunk/.bundle/gems/rbs-3.4.4/ext/rbs_extension'
I, [2024-05-04T03:32:48.256965 #942863]  INFO -- : make[2]: Leaving directory '/tmp/ruby/build/trunk/.bundle/gems/rbs-3.4.4/ext/rbs_extension'
I, [2024-05-04T03:32:48.258800 #942863]  INFO -- : make[2]: Entering directory '/tmp/ruby/build/trunk/.bundle/gems/syslog-0.1.2/ext/syslog'
I, [2024-05-04T03:32:48.280060 #942863]  INFO -- : make[2]: Leaving directory '/tmp/ruby/build/trunk/.bundle/gems/syslog-0.1.2/ext/syslog'
I, [2024-05-04T03:32:48.304279 #942863]  INFO -- : make[2]: Entering directory '/tmp/ruby/build/trunk'
I, [2024-05-04T03:32:48.367923 #942863]  INFO -- : make[2]: 'ruby' is up to date.
I, [2024-05-04T03:32:48.367965 #942863]  INFO -- : make[2]: Leaving directory '/tmp/ruby/build/trunk'
I, [2024-05-04T03:32:48.368309 #942863]  INFO -- : make[1]: Leaving directory '/tmp/ruby/build/trunk'
I, [2024-05-04T03:32:48.372940 #942863]  INFO -- : make[1]: Entering directory '/tmp/ruby/build/trunk'
I, [2024-05-04T03:32:48.372963 #942863]  INFO -- : make[1]: Nothing to be done for 'note'.
I, [2024-05-04T03:32:48.372969 #942863]  INFO -- : make[1]: Leaving directory '/tmp/ruby/build/trunk'
I, [2024-05-04T03:32:48.449145 #942863]  INFO -- : Run options: 
I, [2024-05-04T03:32:48.449193 #942863]  INFO -- :   --seed=37956
I, [2024-05-04T03:32:48.449199 #942863]  INFO -- :   "--ruby=./miniruby -I/tmp/ruby/src/trunk/lib -I. -I.ext/common  /tmp/ruby/src/trunk/tool/runruby.rb --extout=.ext  -- --disable-gems"
I, [2024-05-04T03:32:48.449204 #942863]  INFO -- :   --excludes-dir=/tmp/ruby/src/trunk/test/.excludes
I, [2024-05-04T03:32:48.449209 #942863]  INFO -- :   --name=!/memory_leak/
I, [2024-05-04T03:32:48.449212 #942863]  INFO -- :   --stderr-on-failure
I, [2024-05-04T03:32:48.449215 #942863]  INFO -- :   -j20
I, [2024-05-04T03:32:48.449219 #942863]  INFO -- : 
I, [2024-05-04T03:32:48.449223 #942863]  INFO -- : # Running tests:
I, [2024-05-04T03:32:48.449227 #942863]  INFO -- : 
I, [2024-05-04T03:32:48.596788 #942863]  INFO -- : [  1/885] 984234=test_human_typo
I, [2024-05-04T03:32:48.596844 #942863]  INFO -- : [  2/885] 984217=test_primitive
I, [2024-05-04T03:32:48.596860 #942863]  INFO -- : [  3/885] 984218=test_rbconfig
I, [2024-05-04T03:32:48.596866 #942863]  INFO -- : [  4/885] 984219=test_pair
I, [2024-05-04T03:32:48.597190 #942863]  INFO -- : [  5/885] 984221=test_gem_commands_yank_command
I, [2024-05-04T03:32:48.597611 #942863]  INFO -- : [  6/885] 984220=test_win32ole_param
I, [2024-05-04T03:32:48.598863 #942863]  INFO -- : [  7/885] 984234=test_document
I, [2024-05-04T03:32:48.599267 #942863]  INFO -- : [  8/885] 984230=test_acceptable
I, [2024-05-04T03:32:48.599577 #942863]  INFO -- : [  9/885] 984231=test_euc_jp
I, [2024-05-04T03:32:48.600068 #942863]  INFO -- : [ 10/885] 984232=test_rdoc_generator_pot_po_entry
I, [2024-05-04T03:32:48.600134 #942863]  INFO -- : [ 11/885] 984235=test_chilled
I, [2024-05-04T03:32:48.600218 #942863]  INFO -- : [ 12/885] 984220=test_name_error_extension
I, [2024-05-04T03:32:48.604063 #942863]  INFO -- : [ 13/885] 984233=test_rdoc_i18n_locale
I, [2024-05-04T03:32:48.605683 #942863]  INFO -- : [ 14/885] 984218=test_set_len
I, [2024-05-04T03:32:48.607183 #942863]  INFO -- : [ 15/885] 984217=test_httpresponses
I, [2024-05-04T03:32:48.607608 #942863]  INFO -- : [ 16/885] 984231=test_encoding
I, [2024-05-04T03:32:48.610804 #942863]  INFO -- : [ 17/885] 984235=test_gem_resolver_local_specification
I, [2024-05-04T03:32:48.611352 #942863]  INFO -- : [ 18/885] 984220=test_httpheader
I, [2024-05-04T03:32:48.620771 #942863]  INFO -- : [ 19/885] 984218=test_rdoc_ri_driver
I, [2024-05-04T03:32:48.629881 #942863]  INFO -- : [ 20/885] 984229=test_install
I, [2024-05-04T03:32:48.630445 #942863]  INFO -- : [ 21/885] 984223=test_rdoc_markup_to_label
I, [2024-05-04T03:32:48.630658 #942863]  INFO -- : [ 22/885] 984224=test_sockopt
I, [2024-05-04T03:32:48.630788 #942863]  INFO -- : [ 23/885] 984222=json_encoding_test
I, [2024-05-04T03:32:48.631250 #942863]  INFO -- : [ 24/885] 984227=test_color
I, [2024-05-04T03:32:48.631366 #942863]  INFO -- : [ 25/885] 984228=test_key_stroke
I, [2024-05-04T03:32:48.633867 #942863]  INFO -- : [ 26/885] 984226=test_date_compat
I, [2024-05-04T03:32:48.635862 #942863]  INFO -- : [ 27/885] 984226=test_rdoc_markup_to_html
I, [2024-05-04T03:32:48.643409 #942863]  INFO -- : [ 28/885] 984234=test_bug-14834
I, [2024-05-04T03:32:48.652092 #942863]  INFO -- : [ 29/885] 984224=test_terminfo
I, [2024-05-04T03:32:48.653677 #942863]  INFO -- : [ 30/885] 984222=test_compile_prism
I, [2024-05-04T03:32:48.657435 #942863]  INFO -- : [ 31/885] 984231=test_path
I, [2024-05-04T03:32:48.669885 #942863]  INFO -- : [ 32/885] 984231=redundant_return_test
I, [2024-05-04T03:32:48.674362 #942863]  INFO -- : [ 33/885] 984217=test_case_mapping
I, [2024-05-04T03:32:48.674424 #942863]  INFO -- : [ 34/885] 984225=test_bn
I, [2024-05-04T03:32:48.679656 #942863]  INFO -- : [ 35/885] 984217=test_win32ole_param_event
I, [2024-05-04T03:32:48.691132 #942863]  INFO -- : [ 36/885] 984217=test_http
I, [2024-05-04T03:32:48.691200 #942863]  INFO -- : [ 37/885] 984236=test_addrinfo
I, [2024-05-04T03:32:48.715069 #942863]  INFO -- : [ 38/885] 984220=test_tree_spell_checker
I, [2024-05-04T03:32:48.721276 #942863]  INFO -- : [ 39/885] 984232=test_filter
I, [2024-05-04T03:32:48.721669 #942863]  INFO -- : [ 40/885] 984224=test_gem_gem_runner
I, [2024-05-04T03:32:48.732247 #942863]  INFO -- : [ 41/885] 984228=test_data
I, [2024-05-04T03:32:48.748430 #942863]  INFO -- : [ 42/885] 984234=static_literals_test
I, [2024-05-04T03:32:48.749059 #942863]  INFO -- : [ 43/885] 984228=test_rdoc_method_attr
I, [2024-05-04T03:32:48.749723 #942863]  INFO -- : [ 44/885] 984233=test_enumerator
I, [2024-05-04T03:32:48.753329 #942863]  INFO -- : [ 45/885] 984225=test_rdoc_parser_changelog
I, [2024-05-04T03:32:48.754034 #942863]  INFO -- : [ 46/885] 984230=parameters_signature_test
I, [2024-05-04T03:32:48.761210 #942863]  INFO -- : [ 47/885] 984232=test_koi8
I, [2024-05-04T03:32:48.761863 #942863]  INFO -- : [ 48/885] 984233=test_unicode
I, [2024-05-04T03:32:48.764447 #942863]  INFO -- : [ 49/885] 984220=test_rdoc_generator_pot
I, [2024-05-04T03:32:48.767046 #942863]  INFO -- : [ 50/885] 984232=test_ssl_session
I, [2024-05-04T03:32:48.767335 #942863]  INFO -- : [ 51/885] 984231=test_lexer
I, [2024-05-04T03:32:48.771043 #942863]  INFO -- : [ 52/885] 984236=test_thread_cv
I, [2024-05-04T03:32:48.777278 #942863]  INFO -- : [ 53/885] 984231=test_gem_uri
I, [2024-05-04T03:32:48.787543 #942863]  INFO -- : [ 54/885] 984227=test_key_event_record
I, [2024-05-04T03:32:48.791585 #942863]  INFO -- : [ 55/885] 984227=test_notimplement
I, [2024-05-04T03:32:48.795461 #942863]  INFO -- : [ 56/885] 984227=test_random
I, [2024-05-04T03:32:48.799810 #942863]  INFO -- : [ 57/885] 984227=test_gem_resolver_vendor_specification
I, [2024-05-04T03:32:48.813844 #942863]  INFO -- : [ 58/885] 984230=test_gem_commands_update_command
I, [2024-05-04T03:32:48.818723 #942863]  INFO -- : [ 59/885] 984233=test_gem_commands_build_command
I, [2024-05-04T03:32:48.820712 #942863]  INFO -- : [ 60/885] 984223=test_interned_str
I, [2024-05-04T03:32:48.823510 #942863]  INFO -- : [ 61/885] 984223=test_case_comprehensive
I, [2024-05-04T03:32:48.834021 #942863]  INFO -- : [ 62/885] 984229=test_gem_commands_server_command
I, [2024-05-04T03:32:48.834746 #942863]  INFO -- : [ 63/885] 984234=test_io_m17n
I, [2024-05-04T03:32:48.841367 #942863]  INFO -- : [ 64/885] 984226=test_variable_name_check
I, [2024-05-04T03:32:48.867995 #942863]  INFO -- : [ 65/885] 984226=test_did_you_mean
I, [2024-05-04T03:32:48.894244 #942863]  INFO -- : [ 66/885] 984235=test_cmethod
I, [2024-05-04T03:32:48.897549 #942863]  INFO -- : [ 67/885] 984235=test_tracer
I, [2024-05-04T03:32:48.931156 #942863]  INFO -- : [ 68/885] 984224=test_append
I, [2024-05-04T03:32:48.931753 #942863]  INFO -- : [ 69/885] 984224=test_option
I, [2024-05-04T03:32:48.939642 #942863]  INFO -- : [ 70/885] 984225=test_rdoc_markup_heading
I, [2024-05-04T03:32:48.950033 #942863]  INFO -- : [ 71/885] 984225=test_exception_at_throwing
I, [2024-05-04T03:32:48.956828 #942863]  INFO -- : [ 72/885] 984220=test_iseq
I, [2024-05-04T03:32:48.978894 #942863]  INFO -- : [ 73/885] 984231=test_pkey_dsa
I, [2024-05-04T03:32:48.998518 #942863]  INFO -- : [ 74/885] 984235=test_ocsp
I, [2024-05-04T03:32:49.005460 #942863]  INFO -- : [ 75/885] 984229=test_class
I, [2024-05-04T03:32:49.008294 #942863]  INFO -- : [ 76/885] 984226=test_scheduler
I, [2024-05-04T03:32:49.013072 #942863]  INFO -- : [ 77/885] 984222=reflection_test
I, [2024-05-04T03:32:49.013351 #942863]  INFO -- : [ 78/885] 984225=test_emoji_breaks
I, [2024-05-04T03:32:49.017537 #942863]  INFO -- : [ 79/885] 984225=test_gem_bundler_version_finder
I, [2024-05-04T03:32:49.025092 #942863]  INFO -- : [ 80/885] 984227=test_within_pipe
I, [2024-05-04T03:32:49.029508 #942863]  INFO -- : [ 81/885] 984229=test_help
I, [2024-05-04T03:32:49.037822 #942863]  INFO -- : [ 82/885] 984229=test_rdoc_markup_to_bs
I, [2024-05-04T03:32:49.047471 #942863]  INFO -- : [ 83/885] 984224=test_files_lib
I, [2024-05-04T03:32:49.053520 #942863]  INFO -- : [ 84/885] 984227=test_gem_commands_unpack_command
I, [2024-05-04T03:32:49.068795 #942863]  INFO -- : [ 85/885] 984218=test_beginendblock
I, [2024-05-04T03:32:49.088336 #942863]  INFO -- : [ 86/885] 984228=test_to_ary_concat
I, [2024-05-04T03:32:49.100379 #942863]  INFO -- : [ 87/885] 984222=test_time
I, [2024-05-04T03:32:49.175815 #942863]  INFO -- : [ 88/885] 984226=test_webauthn_listener_response
I, [2024-05-04T03:32:49.205256 #942863]  INFO -- : [ 89/885] 984225=test_stream
I, [2024-05-04T03:32:49.228747 #942863]  INFO -- : [ 90/885] 984221=test_rdoc_markup_pre_process
I, [2024-05-04T03:32:49.231915 #942863]  INFO -- : [ 91/885] 984225=test_printf
I, [2024-05-04T03:32:49.241699 #942863]  INFO -- : [ 92/885] 984225=test_pinned
I, [2024-05-04T03:32:49.253710 #942863]  INFO -- : [ 93/885] 984229=test_history
I, [2024-05-04T03:32:49.266517 #942863]  INFO -- : [ 94/885] 984225=test_mkmf
I, [2024-05-04T03:32:49.278319 #942863]  INFO -- : [ 95/885] 984222=test_date_marshal
I, [2024-05-04T03:32:49.279352 #942863]  INFO -- : [ 96/885] 984222=test_delegate
I, [2024-05-04T03:32:49.292158 #942863]  INFO -- : [ 97/885] 984222=test_popen_deadlock
I, [2024-05-04T03:32:49.295328 #942863]  INFO -- : [ 98/885] 984225=test_exit
I, [2024-05-04T03:32:49.316581 #942863]  INFO -- : [ 99/885] 984235=test_recursion
I, [2024-05-04T03:32:49.320451 #942863]  INFO -- : [100/885] 984235=test_ractor
I, [2024-05-04T03:32:49.331254 #942863]  INFO -- : [101/885] 984233=test_rdoc_servlet
I, [2024-05-04T03:32:49.342599 #942863]  INFO -- : [102/885] 984226=test_gem_security
I, [2024-05-04T03:32:49.379206 #942863]  INFO -- : [103/885] 984235=test_digest
I, [2024-05-04T03:32:49.379765 #942863]  INFO -- : [104/885] 984225=test_closure
I, [2024-05-04T03:32:49.386581 #942863]  INFO -- : [105/885] 984235=test_bundled_ca
I, [2024-05-04T03:32:49.389420 #942863]  INFO -- : [106/885] 984229=test_multi_irb_commands
I, [2024-05-04T03:32:49.396435 #942863]  INFO -- : [107/885] 984229=test_fiber
I, [2024-05-04T03:32:49.424942 #942863]  INFO -- : [108/885] 984221=test_open3
I, [2024-05-04T03:32:49.433041 #942863]  INFO -- : [109/885] 984236=test_float
I, [2024-05-04T03:32:49.438231 #942863]  INFO -- : [110/885] 984228=test_require
I, [2024-05-04T03:32:49.439965 #942863]  INFO -- : [111/885] 984227=test_cgi_cookie
I, [2024-05-04T03:32:49.451647 #942863]  INFO -- : [112/885] 984227=test_regex_casefold
I, [2024-05-04T03:32:49.517230 #942863]  INFO -- : [113/885] 984218=test_refinement
I, [2024-05-04T03:32:49.517305 #942863]  INFO -- : [114/885] 984233=test_gem_commands_signout_command
I, [2024-05-04T03:32:49.531275 #942863]  INFO -- : [115/885] 984233=test_gem_source_git
I, [2024-05-04T03:32:49.571811 #942863]  INFO -- : [116/885] 984231=test_dir_m17n
I, [2024-05-04T03:32:49.572817 #942863]  INFO -- : [117/885] 984225=test_gem_resolver_installer_set
I, [2024-05-04T03:32:49.575896 #942863]  INFO -- : [118/885] 984220=test_rdoc_rd
I, [2024-05-04T03:32:49.593904 #942863]  INFO -- : [119/885] 984220=test_cgi_session
I, [2024-05-04T03:32:49.628976 #942863]  INFO -- : [120/885] 984220=test_rdoc_top_level
I, [2024-05-04T03:32:49.759217 #942863]  INFO -- : [121/885] 984225=test_metaclass
I, [2024-05-04T03:32:49.761847 #942863]  INFO -- : [122/885] 984225=test_fixnum
I, [2024-05-04T03:32:49.775535 #942863]  INFO -- : [123/885] 984225=test_signal
I, [2024-05-04T03:32:49.828386 #942863]  INFO -- : [124/885] 984232=test_x509crl
I, [2024-05-04T03:32:49.858936 #942863]  INFO -- : [125/885] 984220=test_process
I, [2024-05-04T03:32:49.872847 #942863]  INFO -- : [126/885] 984220=test_input_method
I, [2024-05-04T03:32:49.923111 #942863]  INFO -- : [127/885] 984222=test_windows_1252
I, [2024-05-04T03:32:49.925798 #942863]  INFO -- : [128/885] 984222=test_digest_extend
I, [2024-05-04T03:32:49.935944 #942863]  INFO -- : [129/885] 984222=test_iterator
I, [2024-05-04T03:32:49.980032 #942863]  INFO -- : [130/885] 984220=test_string
I, [2024-05-04T03:32:49.980676 #942863]  INFO -- : [131/885] 984220=test_omap
I, [2024-05-04T03:32:49.987665 #942863]  INFO -- : [132/885] 984222=test_debug
I, [2024-05-04T03:32:49.990941 #942863]  INFO -- : [133/885] 984222=pattern_test
I, [2024-05-04T03:32:49.993781 #942863]  INFO -- : [134/885] 984220=test_memory_view
I, [2024-05-04T03:32:49.994441 #942863]  INFO -- : [135/885] 984232=test_shellwords
I, [2024-05-04T03:32:50.000365 #942863]  INFO -- : [136/885] 984232=test_new
I, [2024-05-04T03:32:50.003694 #942863]  INFO -- : [137/885] 984232=test_cipher
I, [2024-05-04T03:32:50.010998 #942863]  INFO -- : [138/885] 984220=test_gem_security_signer
I, [2024-05-04T03:32:50.022947 #942863]  INFO -- : [139/885] 984222=test_gem_resolver_git_set
I, [2024-05-04T03:32:50.044592 #942863]  INFO -- : [140/885] 984227=test_storage
I, [2024-05-04T03:32:50.050333 #942863]  INFO -- : [141/885] 984227=test_win32ole_variant_outarg
I, [2024-05-04T03:32:50.052243 #942863]  INFO -- : [142/885] 984232=test_gem_source_subpath_problem
I, [2024-05-04T03:32:50.053283 #942863]  INFO -- : [143/885] 984227=test_dln
I, [2024-05-04T03:32:50.053927 #942863]  INFO -- : [144/885] 984227=json_common_interface_test
I, [2024-05-04T03:32:50.070756 #942863]  INFO -- : [145/885] 984227=json_parser_test
I, [2024-05-04T03:32:50.108350 #942863]  INFO -- : [146/885] 984233=test_nomethod_error
I, [2024-05-04T03:32:50.113602 #942863]  INFO -- : [147/885] 984233=memsize_test
I, [2024-05-04T03:32:50.128007 #942863]  INFO -- : [148/885] 984227=test_config
I, [2024-05-04T03:32:50.153503 #942863]  INFO -- : [149/885] 984227=test_pkg_config
I, [2024-05-04T03:32:50.169037 #942863]  INFO -- : [150/885] 984227=test_cparser
I, [2024-05-04T03:32:50.178510 #942863]  INFO -- : [151/885] 984233=test_struct
I, [2024-05-04T03:32:50.182596 #942863]  INFO -- : [152/885] 984233=magic_comment_test
I, [2024-05-04T03:32:50.184213 #942863]  INFO -- : [153/885] 984234=test_rdoc_markup_to_html_snippet
I, [2024-05-04T03:32:50.187716 #942863]  INFO -- : [154/885] 984233=fuzzer_test
I, [2024-05-04T03:32:50.200496 #942863]  INFO -- : [155/885] 984233=test_rdoc_markup_include
I, [2024-05-04T03:32:50.203404 #942863]  INFO -- : [156/885] 984233=test_sexp
I, [2024-05-04T03:32:50.223775 #942863]  INFO -- : [157/885] 984233=test_variable
I, [2024-05-04T03:32:50.262233 #942863]  INFO -- : [158/885] 984220=test_allocation
I, [2024-05-04T03:32:50.294360 #942863]  INFO -- : [159/885] 984232=test_div
I, [2024-05-04T03:32:50.300983 #942863]  INFO -- : [160/885] 984232=test_win32ole_variant_m
I, [2024-05-04T03:32:50.302012 #942863]  INFO -- : [161/885] 984232=test_engine
I, [2024-05-04T03:32:50.303714 #942863]  INFO -- : [162/885] 984232=test_key_error
I, [2024-05-04T03:32:50.308921 #942863]  INFO -- : [163/885] 984232=test_insns_leaf
I, [2024-05-04T03:32:50.314102 #942863]  INFO -- : [164/885] 984232=test_serialize_subclasses
I, [2024-05-04T03:32:50.316826 #942863]  INFO -- : [165/885] 984232=test_deprecated
I, [2024-05-04T03:32:50.319016 #942863]  INFO -- : [166/885] 984233=test_color_printer
I, [2024-05-04T03:32:50.319742 #942863]  INFO -- : [167/885] 984232=test_files_test_1
I, [2024-05-04T03:32:50.331063 #942863]  INFO -- : [168/885] 984230=test_set
I, [2024-05-04T03:32:50.338663 #942863]  INFO -- : [169/885] 984233=test_struct
I, [2024-05-04T03:32:50.354232 #942863]  INFO -- : [170/885] 984230=test_gem_path_support
I, [2024-05-04T03:32:50.385613 #942863]  INFO -- : [171/885] 984230=test_mutex
I, [2024-05-04T03:32:50.421658 #942863]  INFO -- : [172/885] 984234=test_x509req
I, [2024-05-04T03:32:50.478913 #942863]  INFO -- : [173/885] 984227=test_rdoc_rd_inline
I, [2024-05-04T03:32:50.584649 #942863]  INFO -- : [174/885] 984227=constant_path_node_test
I, [2024-05-04T03:32:50.604791 #942863]  INFO -- : [175/885] 984222=test_ssl
I, [2024-05-04T03:32:50.629441 #942863]  INFO -- : [176/885] 984227=test_gem_ext_cargo_builder
I, [2024-05-04T03:32:50.648680 #942863]  INFO -- : [177/885] 984227=test_module
I, [2024-05-04T03:32:50.652489 #942863]  INFO -- : [178/885] 984234=test_gem_request_set
I, [2024-05-04T03:32:50.666831 #942863]  INFO -- : [179/885] 984236=test_method_name_check
I, [2024-05-04T03:32:50.685799 #942863]  INFO -- : [180/885] 984236=test_arith_seq_extract
I, [2024-05-04T03:32:50.784752 #942863]  INFO -- : [181/885] 984235=test_parser
I, [2024-05-04T03:32:50.829979 #942863]  INFO -- : [182/885] 984235=test_configuration
I, [2024-05-04T03:32:50.888891 #942863]  INFO -- : [183/885] 984236=test_rubyvm
I, [2024-05-04T03:32:50.910491 #942863]  INFO -- : [184/885] 984236=test_monitor
I, [2024-05-04T03:32:50.948113 #942863]  INFO -- : [185/885] 984235=test_buffered_io
I, [2024-05-04T03:32:50.979617 #942863]  INFO -- : [186/885] 984231=test_whileuntil
I, [2024-05-04T03:32:51.004732 #942863]  INFO -- : [187/885] 984231=test_rdoc_generator_markup
I, [2024-05-04T03:32:51.038828 #942863]  INFO -- : [188/885] 984233=test_boolean
I, [2024-05-04T03:32:51.048896 #942863]  INFO -- : [189/885] 984233=test_stringify_symbols
I, [2024-05-04T03:32:51.050067 #942863]  INFO -- : [190/885] 984235=integer_parse_test
I, [2024-05-04T03:32:51.058493 #942863]  INFO -- : [191/885] 984233=test_instrumentation_api
I, [2024-05-04T03:32:51.128892 #942863]  INFO -- : [192/885] 984231=test_gem_dependency_list
I, [2024-05-04T03:32:51.138662 #942863]  INFO -- : [193/885] 984235=test_benchmark
I, [2024-05-04T03:32:51.150940 #942863]  INFO -- : [194/885] 984236=test_win32ole_method_event
I, [2024-05-04T03:32:51.152355 #942863]  INFO -- : [195/885] 984236=test_nesting_parser
I, [2024-05-04T03:32:51.196653 #942863]  INFO -- : [196/885] 984231=test_gem_source
I, [2024-05-04T03:32:51.234219 #942863]  INFO -- : [197/885] 984236=test_scalar_scanner
I, [2024-05-04T03:32:51.253218 #942863]  INFO -- : [198/885] 984236=test_gem_commands_outdated_command
I, [2024-05-04T03:32:51.273922 #942863]  INFO -- : [199/885] 984234=test_array
I, [2024-05-04T03:32:51.355150 #942863]  INFO -- : [200/885] 984231=test_helper_method
I, [2024-05-04T03:32:51.434282 #942863]  INFO -- : [201/885] 984236=test_gem_package_tar_writer
I, [2024-05-04T03:32:51.446221 #942863]  INFO -- : [202/885] 984231=test_abi
I, [2024-05-04T03:32:51.511416 #942863]  INFO -- : [203/885] 984236=test_provider
I, [2024-05-04T03:32:51.525491 #942863]  INFO -- : [204/885] 984230=test_rdoc_parser_simple
I, [2024-05-04T03:32:51.539731 #942863]  INFO -- : [205/885] 984230=test_load
I, [2024-05-04T03:32:51.548317 #942863]  INFO -- : [206/885] 984230=test_yamldbm
I, [2024-05-04T03:32:51.553894 #942863]  INFO -- : [207/885] 984230=test_gem_commands_rebuild_command
I, [2024-05-04T03:32:51.593062 #942863]  INFO -- : [208/885] 984230=test_https
I, [2024-05-04T03:32:51.622988 #942863]  INFO -- : [209/885] 984231=test_gem_ext_builder
I, [2024-05-04T03:32:51.860620 #942863]  INFO -- : [210/885] 984221=test_evaluation
I, [2024-05-04T03:32:51.880874 #942863]  INFO -- : [211/885] 984221=test_erb
I, [2024-05-04T03:32:51.891506 #942863]  INFO -- : [212/885] 984236=test_x509ext
I, [2024-05-04T03:32:51.898327 #942863]  INFO -- : [213/885] 984236=test_gem_source_installed
I, [2024-05-04T03:32:51.909322 #942863]  INFO -- : [214/885] 984225=test_len
I, [2024-05-04T03:32:51.911413 #942863]  INFO -- : [215/885] 984236=test_yield_block
I, [2024-05-04T03:32:51.912906 #942863]  INFO -- : [216/885] 984225=test_gem_commands_cert_command
I, [2024-05-04T03:32:51.914014 #942863]  INFO -- : [217/885] 984236=test_completion
I, [2024-05-04T03:32:51.940998 #942863]  INFO -- : [218/885] 984221=test_rational
I, [2024-05-04T03:32:51.960743 #942863]  INFO -- : [219/885] 984221=test_rational2
I, [2024-05-04T03:32:51.974796 #942863]  INFO -- : [220/885] 984221=test_assembler
I, [2024-05-04T03:32:51.976660 #942863]  INFO -- : [221/885] 984221=test_spell_checker
I, [2024-05-04T03:32:51.985915 #942863]  INFO -- : [222/885] 984221=attribute_write_test
I, [2024-05-04T03:32:52.010100 #942863]  INFO -- : [223/885] 984224=test_propertyputref
I, [2024-05-04T03:32:52.011527 #942863]  INFO -- : [224/885] 984224=test_rdoc_generator_json_index
I, [2024-05-04T03:32:52.032463 #942863]  INFO -- : [225/885] 984219=test_time_tz
I, [2024-05-04T03:32:52.037753 #942863]  INFO -- : [226/885] 984230=test_win32ole_event
I, [2024-05-04T03:32:52.040297 #942863]  INFO -- : [227/885] 984230=ractor_test
I, [2024-05-04T03:32:52.070814 #942863]  INFO -- : [228/885] 984219=test_trace
I, [2024-05-04T03:32:52.072830 #942863]  INFO -- : [229/885] 984221=test_win32ole_variable
I, [2024-05-04T03:32:52.075397 #942863]  INFO -- : [230/885] 984219=test_arity
I, [2024-05-04T03:32:52.076700 #942863]  INFO -- : [231/885] 984221=test_stringio
I, [2024-05-04T03:32:52.079380 #942863]  INFO -- : [232/885] 984219=test_io_wait_uncommon
I, [2024-05-04T03:32:52.084216 #942863]  INFO -- : [233/885] 984219=test_bignum
I, [2024-05-04T03:32:52.086917 #942863]  INFO -- : [234/885] 984228=test_rdoc_class_module
I, [2024-05-04T03:32:52.088762 #942863]  INFO -- : [235/885] 984218=test_gem_ci_detector
I, [2024-05-04T03:32:52.122334 #942863]  INFO -- : [236/885] 984230=test_threadgroup
I, [2024-05-04T03:32:52.181293 #942863]  INFO -- : [237/885] 984221=test_gem_specification
I, [2024-05-04T03:32:52.202995 #942863]  INFO -- : [238/885] 984219=test_enum
I, [2024-05-04T03:32:52.237532 #942863]  INFO -- : [239/885] 984224=test_have_macro
I, [2024-05-04T03:32:52.285265 #942863]  INFO -- : [240/885] 984218=test_complex2
I, [2024-05-04T03:32:52.293870 #942863]  INFO -- : [241/885] 984218=test_resolve_symbol
I, [2024-05-04T03:32:52.364381 #942863]  INFO -- : [242/885] 984218=test_gem_package
I, [2024-05-04T03:32:52.396376 #942863]  INFO -- : [243/885] 984235=test_merge_keys
I, [2024-05-04T03:32:52.410814 #942863]  INFO -- : [244/885] 984235=test_rdoc_extend
I, [2024-05-04T03:32:52.503031 #942863]  INFO -- : [245/885] 984227=test_ipaddr
I, [2024-05-04T03:32:52.536824 #942863]  INFO -- : [246/885] 984228=test_history
I, [2024-05-04T03:32:52.538028 #942863]  INFO -- : [247/885] 984227=test_mixed_unicode_escapes
I, [2024-05-04T03:32:52.540572 #942863]  INFO -- : [248/885] 984227=test_rdoc_markup_to_ansi
I, [2024-05-04T03:32:52.545667 #942863]  INFO -- : [249/885] 984228=test_win32ole_variant
I, [2024-05-04T03:32:52.549811 #942863]  INFO -- : [250/885] 984228=test_gem_resolver_api_specification
I, [2024-05-04T03:32:52.563900 #942863]  INFO -- : [251/885] 984232=test_cgi_multipart
I, [2024-05-04T03:32:52.580866 #942863]  INFO -- : [252/885] 984236=test_word
I, [2024-05-04T03:32:52.584973 #942863]  INFO -- : [253/885] 984227=test_gem_commands_cleanup_command
I, [2024-05-04T03:32:52.585887 #942863]  INFO -- : [254/885] 984236=test_numeric
I, [2024-05-04T03:32:52.594341 #942863]  INFO -- : [255/885] 984236=test_member
I, [2024-05-04T03:32:52.604485 #942863]  INFO -- : [256/885] 984236=test_ractor_compatibility
I, [2024-05-04T03:32:52.635427 #942863]  INFO -- : [257/885] 984235=test_dir
I, [2024-05-04T03:32:52.710672 #942863]  INFO -- : [258/885] 984224=format_errors_test
I, [2024-05-04T03:32:52.718520 #942863]  INFO -- : [259/885] 984232=test_gem_console_ui
I, [2024-05-04T03:32:52.727580 #942863]  INFO -- : [260/885] 984232=test_date_ractor
I, [2024-05-04T03:32:52.750906 #942863]  INFO -- : [261/885] 984231=test_autoconf
I, [2024-05-04T03:32:52.755379 #942863]  INFO -- : [262/885] 984231=test_eval
I, [2024-05-04T03:32:52.757570 #942863]  INFO -- : [263/885] 984231=test_mailto
I, [2024-05-04T03:32:52.762903 #942863]  INFO -- : [264/885] 984228=test_coderange
I, [2024-05-04T03:32:52.767374 #942863]  INFO -- : [265/885] 984228=location_test
I, [2024-05-04T03:32:52.777844 #942863]  INFO -- : [266/885] 984224=test_symbol
I, [2024-05-04T03:32:52.780578 #942863]  INFO -- : [267/885] 984231=test_http_request
I, [2024-05-04T03:32:52.795634 #942863]  INFO -- : [268/885] 984224=json_generic_object_test
I, [2024-05-04T03:32:52.811172 #942863]  INFO -- : [269/885] 984224=test_gem_source_fetch_problem
I, [2024-05-04T03:32:52.820784 #942863]  INFO -- : [270/885] 984224=test_rdoc_generator_darkfish
I, [2024-05-04T03:32:52.826797 #942863]  INFO -- : [271/885] 984231=test_rdoc_comment
I, [2024-05-04T03:32:52.873835 #942863]  INFO -- : [272/885] 984220=test_resize
I, [2024-05-04T03:32:52.883824 #942863]  INFO -- : [273/885] 984220=test_error_highlight
I, [2024-05-04T03:32:52.885478 #942863]  INFO -- : [274/885] 984228=test_function_entry
I, [2024-05-04T03:32:52.888799 #942863]  INFO -- : [275/885] 984228=test_gem_resolver_requirement_list
I, [2024-05-04T03:32:52.903242 #942863]  INFO -- : [276/885] 984228=test_arith_seq_beg_len_step
I, [2024-05-04T03:32:52.905896 #942863]  INFO -- : [277/885] 984231=test_pkcs7
I, [2024-05-04T03:32:52.912588 #942863]  INFO -- : [278/885] 984235=test_enc_associate
I, [2024-05-04T03:32:52.970637 #942863]  INFO -- : [279/885] 984236=test_lazy_enumerator
I, [2024-05-04T03:32:52.973640 #942863]  INFO -- : [280/885] 984232=test_unix
I, [2024-05-04T03:32:52.974146 #942863]  INFO -- : [281/885] 984228=test_coder
I, [2024-05-04T03:32:52.989553 #942863]  INFO -- : [282/885] 984228=test_symbol
I, [2024-05-04T03:32:53.001973 #942863]  INFO -- : [283/885] 984232=test_gem_commands_pristine_command
I, [2024-05-04T03:32:53.036614 #942863]  INFO -- : [284/885] 984218=test_context
I, [2024-05-04T03:32:53.049816 #942863]  INFO -- : [285/885] 984227=test_nofree
I, [2024-05-04T03:32:53.052113 #942863]  INFO -- : [286/885] 984227=ruby_api_test
I, [2024-05-04T03:32:53.085986 #942863]  INFO -- : [287/885] 984219=test_find_executable
I, [2024-05-04T03:32:53.089026 #942863]  INFO -- : [288/885] 984224=test_call
I, [2024-05-04T03:32:53.110202 #942863]  INFO -- : [289/885] 984219=test_https_proxy
I, [2024-05-04T03:32:53.110671 #942863]  INFO -- : [290/885] 984231=test_rubygems
I, [2024-05-04T03:32:53.126658 #942863]  INFO -- : [291/885] 984230=test_cgi_modruby
I, [2024-05-04T03:32:53.137016 #942863]  INFO -- : [292/885] 984230=test_integer
I, [2024-05-04T03:32:53.175319 #942863]  INFO -- : [293/885] 984227=test_super
I, [2024-05-04T03:32:53.181178 #942863]  INFO -- : [294/885] 984219=test_rubyoptions
I, [2024-05-04T03:32:53.201812 #942863]  INFO -- : [295/885] 984224=test_gem_resolver_git_specification
I, [2024-05-04T03:32:53.217017 #942863]  INFO -- : [296/885] 984218=test_object_references
I, [2024-05-04T03:32:53.224164 #942863]  INFO -- : [297/885] 984218=test_usrmarshal
I, [2024-05-04T03:32:53.298934 #942863]  INFO -- : [298/885] 984231=test_nextafter
I, [2024-05-04T03:32:53.344212 #942863]  INFO -- : [299/885] 984236=test_capacity
I, [2024-05-04T03:32:53.353870 #942863]  INFO -- : [300/885] 984236=test_stat
I, [2024-05-04T03:32:53.372545 #942863]  INFO -- : [301/885] 984236=test_gem_request_set_lockfile_tokenizer
I, [2024-05-04T03:32:53.387352 #942863]  INFO -- : [302/885] 984231=test_have_func
I, [2024-05-04T03:32:53.402777 #942863]  INFO -- : [303/885] 984235=test_integer
I, [2024-05-04T03:32:53.422295 #942863]  INFO -- : [304/885] 984236=desugar_compiler_test
I, [2024-05-04T03:32:53.426910 #942863]  INFO -- : [305/885] 984218=test_dryrun
I, [2024-05-04T03:32:53.440658 #942863]  INFO -- : [306/885] 984220=test_rdoc_attr
I, [2024-05-04T03:32:53.443650 #942863]  INFO -- : [307/885] 984218=test_env
I, [2024-05-04T03:32:53.454545 #942863]  INFO -- : [308/885] 984220=test_gem_commands_setup_command
I, [2024-05-04T03:32:53.460751 #942863]  INFO -- : [309/885] 984224=test_parser
I, [2024-05-04T03:32:53.470717 #942863]  INFO -- : [310/885] 984224=test_cgi_core
I, [2024-05-04T03:32:53.479214 #942863]  INFO -- : [311/885] 984235=test_ractor
I, [2024-05-04T03:32:53.487077 #942863]  INFO -- : [312/885] 984224=test_gem_commands_open_command
I, [2024-05-04T03:32:53.488417 #942863]  INFO -- : [313/885] 984236=test_dns
I, [2024-05-04T03:32:53.497516 #942863]  INFO -- : [314/885] 984235=test_gem_source_lock
I, [2024-05-04T03:32:53.544179 #942863]  INFO -- : [315/885] 984235=test_gem
I, [2024-05-04T03:32:53.582316 #942863]  INFO -- : [316/885] 984224=parse_stream_test
I, [2024-05-04T03:32:53.585914 #942863]  INFO -- : [317/885] 984224=test_registry
I, [2024-05-04T03:32:53.586939 #942863]  INFO -- : [318/885] 984224=test_ractor
I, [2024-05-04T03:32:53.733704 #942863]  INFO -- : [319/885] 984227=test_my_integer
I, [2024-05-04T03:32:53.736352 #942863]  INFO -- : [320/885] 984227=test_thread
I, [2024-05-04T03:32:53.918124 #942863]  INFO -- : [321/885] 984220=json_ext_parser_test
I, [2024-05-04T03:32:53.925977 #942863]  INFO -- : [322/885] 984220=test_debugger_integration
I, [2024-05-04T03:32:53.937337 #942863]  INFO -- : [323/885] 984220=test_rendering
I, [2024-05-04T03:32:53.951817 #942863]  INFO -- : [324/885] 984220=test_ssl
I, [2024-05-04T03:32:53.963537 #942863]  INFO -- : [325/885] 984224=test_singleton_function
I, [2024-05-04T03:32:53.966851 #942863]  INFO -- : [326/885] 984224=test_ancdata
I, [2024-05-04T03:32:53.970526 #942863]  INFO -- : [327/885] 984224=test_rb_str_dup
I, [2024-05-04T03:32:53.973446 #942863]  INFO -- : [328/885] 984224=test_reline_key
I, [2024-05-04T03:32:53.975749 #942863]  INFO -- : [329/885] 984224=test_marshal
I, [2024-05-04T03:32:53.986417 #942863]  INFO -- : [330/885] 984236=test_unicode_normalize
I, [2024-05-04T03:32:54.029203 #942863]  INFO -- : [331/885] 984233=test_weakref
I, [2024-05-04T03:32:54.067519 #942863]  INFO -- : [332/885] 984221=test_nonblock
I, [2024-05-04T03:32:54.074870 #942863]  INFO -- : [333/885] 984221=test_alias
I, [2024-05-04T03:32:54.163643 #942863]  INFO -- : [334/885] 984233=test_timeout
I, [2024-05-04T03:32:54.227581 #942863]  INFO -- : [335/885] 984221=errors_test
I, [2024-05-04T03:32:54.281131 #942863]  INFO -- : [336/885] 984221=test_gem_commands_check_command
I, [2024-05-04T03:32:54.287761 #942863]  INFO -- : [337/885] 984232=test_regexp
I, [2024-05-04T03:32:54.303576 #942863]  INFO -- : [338/885] 984221=test_rdoc_markup_document
I, [2024-05-04T03:32:54.317265 #942863]  INFO -- : [339/885] 984221=test_integer_comb
I, [2024-05-04T03:32:54.408342 #942863]  INFO -- : [340/885] 984220=test_tmpdir
I, [2024-05-04T03:32:54.490362 #942863]  INFO -- : [341/885] 984220=test_vm_dump
I, [2024-05-04T03:32:54.493787 #942863]  INFO -- : [342/885] 984220=test_udp
I, [2024-05-04T03:32:54.495103 #942863]  INFO -- : [343/885] 984220=test_data_error
I, [2024-05-04T03:32:54.577196 #942863]  INFO -- : [344/885] 984220=bom_test
I, [2024-05-04T03:32:54.584564 #942863]  INFO -- : [345/885] 984224=test_force_exit
I, [2024-05-04T03:32:54.630843 #942863]  INFO -- : [346/885] 984224=test_file
I, [2024-05-04T03:32:54.659208 #942863]  INFO -- : [347/885] 984220=test_ostruct
I, [2024-05-04T03:32:54.661467 #942863]  INFO -- : [348/885] 984231=unescape_test
I, [2024-05-04T03:32:54.800050 #942863]  INFO -- : [349/885] 984220=static_inspect_test
I, [2024-05-04T03:32:54.804480 #942863]  INFO -- : [350/885] 984220=test_erb_command
I, [2024-05-04T03:32:54.849369 #942863]  INFO -- : [351/885] 984220=test_helper
I, [2024-05-04T03:32:54.850960 #942863]  INFO -- : [352/885] 984220=test_encoding
I, [2024-05-04T03:32:54.871122 #942863]  INFO -- : [353/885] 984234=test_gem_uri_formatter
I, [2024-05-04T03:32:54.887354 #942863]  INFO -- : [354/885] 984234=test_project_sanity
I, [2024-05-04T03:32:54.947219 #942863]  INFO -- : [355/885] 984234=test_range
I, [2024-05-04T03:32:54.984277 #942863]  INFO -- : [356/885] 984233=test_constant
I, [2024-05-04T03:32:55.050053 #942863]  INFO -- : [357/885] 984220=test_pty
I, [2024-05-04T03:32:55.276250 #942863]  INFO -- : [358/885] 984230=test_dup
I, [2024-05-04T03:32:55.295910 #942863]  INFO -- : [359/885] 984225=command_line_test
I, [2024-05-04T03:32:55.311393 #942863]  INFO -- : [360/885] 984229=test_rdoc_ri_paths
I, [2024-05-04T03:32:55.323817 #942863]  INFO -- : [361/885] 984228=test_ensured
I, [2024-05-04T03:32:55.343197 #942863]  INFO -- : [362/885] 984229=library_symbols_test
I, [2024-05-04T03:32:55.384138 #942863]  INFO -- : [363/885] 984225=test_locale
I, [2024-05-04T03:32:55.414228 #942863]  INFO -- : [364/885] 984228=test_addr
I, [2024-05-04T03:32:55.420569 #942863]  INFO -- : [365/885] 984229=test_ts
I, [2024-05-04T03:32:55.435287 #942863]  INFO -- : [366/885] 984230=test_enumerable
I, [2024-05-04T03:32:55.440097 #942863]  INFO -- : [367/885] 984230=test_config
I, [2024-05-04T03:32:55.454342 #942863]  INFO -- : [368/885] 984228=test_gem_resolver_vendor_set
I, [2024-05-04T03:32:55.480475 #942863]  INFO -- : [369/885] 984228=test_gem_resolver_api_set
I, [2024-05-04T03:32:55.531382 #942863]  INFO -- : [370/885] 984235=test_gem_safe_marshal
I, [2024-05-04T03:32:55.537250 #942863]  INFO -- : [371/885] 984228=test_transcode
I, [2024-05-04T03:32:55.555442 #942863]  INFO -- : [372/885] 984220=json_generator_test
I, [2024-05-04T03:32:55.558478 #942863]  INFO -- : [373/885] 984225=test_eval
I, [2024-05-04T03:32:55.567010 #942863]  INFO -- : [374/885] 984234=test_x509store
I, [2024-05-04T03:32:55.639549 #942863]  INFO -- : [375/885] 984220=test_rdoc_code_object
I, [2024-05-04T03:32:55.707711 #942863]  INFO -- : [376/885] 984231=test_update
I, [2024-05-04T03:32:55.713087 #942863]  INFO -- : [377/885] 984231=test_fips
I, [2024-05-04T03:32:55.729967 #942863]  INFO -- : [378/885] 984228=test_x509name
I, [2024-05-04T03:32:55.744794 #942863]  INFO -- : [379/885] 984228=test_random_formatter
I, [2024-05-04T03:32:55.760450 #942863]  INFO -- : [380/885] 984228=test_helper
I, [2024-05-04T03:32:55.761929 #942863]  INFO -- : [381/885] 984228=test_jaro_winkler
I, [2024-05-04T03:32:55.770371 #942863]  INFO -- : [382/885] 984225=test_ast
I, [2024-05-04T03:32:55.770656 #942863]  INFO -- : [383/885] 984228=test_gem_request_set_gem_dependency_api
I, [2024-05-04T03:32:55.828426 #942863]  INFO -- : [384/885] 984234=test_lambda
I, [2024-05-04T03:32:55.897149 #942863]  INFO -- : [385/885] 984234=test_webauthn_listener
I, [2024-05-04T03:32:55.938745 #942863]  INFO -- : [386/885] 984234=test_weakkeymap
I, [2024-05-04T03:32:55.950144 #942863]  INFO -- : [387/885] 984230=test_gem_commands_push_command
I, [2024-05-04T03:32:55.952835 #942863]  INFO -- : [388/885] 984228=test_numhash
I, [2024-05-04T03:32:55.958362 #942863]  INFO -- : [389/885] 984228=test_pkey_rsa
I, [2024-05-04T03:32:55.970947 #942863]  INFO -- : [390/885] 984220=test_gem_platform
I, [2024-05-04T03:32:56.000081 #942863]  INFO -- : [391/885] 984231=test_date_strptime
I, [2024-05-04T03:32:56.006864 #942863]  INFO -- : [392/885] 984229=test_gem_package_task
I, [2024-05-04T03:32:56.012581 #942863]  INFO -- : [393/885] 984229=test_placearg
I, [2024-05-04T03:32:56.044204 #942863]  INFO -- : [394/885] 984220=test_rdoc_markup_hard_break
I, [2024-05-04T03:32:56.048138 #942863]  INFO -- : [395/885] 984220=test_win32ole_method
I, [2024-05-04T03:32:56.054795 #942863]  INFO -- : [396/885] 984220=test_delete
I, [2024-05-04T03:32:56.063143 #942863]  INFO -- : [397/885] 984220=test_class_name_check
I, [2024-05-04T03:32:56.090061 #942863]  INFO -- : [398/885] 984231=test_keyword
I, [2024-05-04T03:32:56.092636 #942863]  INFO -- : [399/885] 984220=test_fd_setsize
I, [2024-05-04T03:32:56.092792 #942863]  INFO -- : [400/885] 984220=test_continuation
I, [2024-05-04T03:32:56.098024 #942863]  INFO -- : [401/885] 984220=test_file_exhaustive
I, [2024-05-04T03:32:56.140150 #942863]  INFO -- : [402/885] 984234=test_gem_update_suggestion
I, [2024-05-04T03:32:56.147398 #942863]  INFO -- : [403/885] 984228=test_files_test
I, [2024-05-04T03:32:56.153819 #942863]  INFO -- : [404/885] 984229=test_logger
I, [2024-05-04T03:32:56.170126 #942863]  INFO -- : [405/885] 984229=test_gem_resolver_lock_set
I, [2024-05-04T03:32:56.192768 #942863]  INFO -- : [406/885] 984234=test_not
I, [2024-05-04T03:32:56.195545 #942863]  INFO -- : [407/885] 984234=test_import
I, [2024-05-04T03:32:56.197746 #942863]  INFO -- : [408/885] 984229=test_rdoc_parser_markdown
I, [2024-05-04T03:32:56.239838 #942863]  INFO -- : [409/885] 984229=test_object
I, [2024-05-04T03:32:56.244582 #942863]  INFO -- : [410/885] 984229=test_cgi_header
I, [2024-05-04T03:32:56.245107 #942863]  INFO -- : [411/885] 984235=heredoc_dedent_test
I, [2024-05-04T03:32:56.245826 #942863]  INFO -- : [412/885] 984218=version_test
I, [2024-05-04T03:32:56.249590 #942863]  INFO -- : [413/885] 984229=test_gem_gemcutter_utilities
I, [2024-05-04T03:32:56.250508 #942863]  INFO -- : [414/885] 984228=test_basicinstructions
I, [2024-05-04T03:32:56.253066 #942863]  INFO -- : [415/885] 984235=test_gem_command_manager
I, [2024-05-04T03:32:56.317267 #942863]  INFO -- : [416/885] 984218=test_key_actor_emacs
I, [2024-05-04T03:32:56.324172 #942863]  INFO -- : [417/885] 984228=test_arithmetic_sequence
I, [2024-05-04T03:32:56.331254 #942863]  INFO -- : [418/885] 984228=test_timeout
I, [2024-05-04T03:32:56.336968 #942863]  INFO -- : [419/885] 984228=test_normalize
I, [2024-05-04T03:32:56.339398 #942863]  INFO -- : [420/885] 984228=test_ossl
I, [2024-05-04T03:32:56.431159 #942863]  INFO -- : [421/885] 984235=test_change_word
I, [2024-05-04T03:32:56.438394 #942863]  INFO -- : [422/885] 984218=compiler_test
I, [2024-05-04T03:32:56.439298 #942863]  INFO -- : [423/885] 984235=test_flip
I, [2024-05-04T03:32:56.457492 #942863]  INFO -- : [424/885] 984218=test_sleep
I, [2024-05-04T03:32:56.457839 #942863]  INFO -- : [425/885] 984230=test_date_arith
I, [2024-05-04T03:32:56.463185 #942863]  INFO -- : [426/885] 984235=test_ruby_lex
I, [2024-05-04T03:32:56.468012 #942863]  INFO -- : [427/885] 984230=test_object
I, [2024-05-04T03:32:56.500979 #942863]  INFO -- : [428/885] 984221=test_gem_local_remote_options
I, [2024-05-04T03:32:56.532819 #942863]  INFO -- : [429/885] 984221=test_pointer
I, [2024-05-04T03:32:56.586559 #942863]  INFO -- : [430/885] 984235=test_big5
I, [2024-05-04T03:32:56.588177 #942863]  INFO -- : [431/885] 984235=test_func
I, [2024-05-04T03:32:56.616238 #942863]  INFO -- : [432/885] 984231=test_ractor
I, [2024-05-04T03:32:56.625332 #942863]  INFO -- : [433/885] 984229=test_type
I, [2024-05-04T03:32:56.633457 #942863]  INFO -- : [434/885] 984229=test_signedness
I, [2024-05-04T03:32:56.695071 #942863]  INFO -- : [435/885] 984231=test_tsort
I, [2024-05-04T03:32:56.697524 #942863]  INFO -- : [436/885] 984231=test_rdoc_rd_block_parser
I, [2024-05-04T03:32:56.727271 #942863]  INFO -- : [437/885] 984231=test_bug-5832
I, [2024-05-04T03:32:56.729368 #942863]  INFO -- : [438/885] 984231=test_files_ext
I, [2024-05-04T03:32:56.824376 #942863]  INFO -- : [439/885] 984234=test_emitter
I, [2024-05-04T03:32:56.826535 #942863]  INFO -- : [440/885] 984231=test_gem_silent_ui
I, [2024-05-04T03:32:56.834411 #942863]  INFO -- : [441/885] 984234=test_kdf
I, [2024-05-04T03:32:56.856452 #942863]  INFO -- : [442/885] 984231=test_gem_doctor
I, [2024-05-04T03:32:56.859344 #942863]  INFO -- : [443/885] 984230=test_kernel
I, [2024-05-04T03:32:56.890542 #942863]  INFO -- : [444/885] 984231=test_eval_history
I, [2024-05-04T03:32:56.893769 #942863]  INFO -- : [445/885] 984221=dispatcher_test
I, [2024-05-04T03:32:56.898609 #942863]  INFO -- : [446/885] 984231=test_enc_raise
I, [2024-05-04T03:32:56.899709 #942863]  INFO -- : [447/885] 984234=test_psych
I, [2024-05-04T03:32:56.900424 #942863]  INFO -- : [448/885] 984221=!Nothing_to_test
I, [2024-05-04T03:32:56.901132 #942863]  INFO -- : [449/885] 984231=test_rdoc_markup_paragraph
I, [2024-05-04T03:32:56.902937 #942863]  INFO -- : [450/885] 984221=test_object_create_start
I, [2024-05-04T03:32:56.903753 #942863]  INFO -- : [451/885] 984221=test_at_exit
I, [2024-05-04T03:32:56.906484 #942863]  INFO -- : [452/885] 984231=test_command
I, [2024-05-04T03:32:56.915429 #942863]  INFO -- : [453/885] 984234=test_gem_ext_cargo_builder_unit
I, [2024-05-04T03:32:56.925435 #942863]  INFO -- : [454/885] 984221=test_gem_rdoc
I, [2024-05-04T03:32:56.932705 #942863]  INFO -- : [455/885] 984234=test_date
I, [2024-05-04T03:32:56.938971 #942863]  INFO -- : [456/885] 984234=test_hmac
I, [2024-05-04T03:32:56.942523 #942863]  INFO -- : [457/885] 984234=test_rdoc_markup_to_tt_only
I, [2024-05-04T03:32:56.966237 #942863]  INFO -- : [458/885] 984234=test_rdoc_tom_doc
I, [2024-05-04T03:32:56.982714 #942863]  INFO -- : [459/885] 984234=test_numeric
I, [2024-05-04T03:32:57.037165 #942863]  INFO -- : [460/885] 984234=test_assignment
I, [2024-05-04T03:32:57.050484 #942863]  INFO -- : [461/885] 984221=test_ifunless
I, [2024-05-04T03:32:57.071109 #942863]  INFO -- : [462/885] 984221=test_gem_commands_lock_command
I, [2024-05-04T03:32:57.088397 #942863]  INFO -- : [463/885] 984221=test_gem_command
I, [2024-05-04T03:32:57.113246 #942863]  INFO -- : [464/885] 984231=test_key_actor_vi
I, [2024-05-04T03:32:57.175706 #942863]  INFO -- : [465/885] 984221=test_bug-3571
I, [2024-05-04T03:32:57.187162 #942863]  INFO -- : [466/885] 984221=test_common
I, [2024-05-04T03:32:57.245079 #942863]  INFO -- : [467/885] 984231=test_gem_spec_fetcher
I, [2024-05-04T03:32:57.357874 #942863]  INFO -- : [468/885] 984230=test_rdoc_token_stream
I, [2024-05-04T03:32:57.362653 #942863]  INFO -- : [469/885] 984230=test_address_resolve
I, [2024-05-04T03:32:57.368589 #942863]  INFO -- : [470/885] 984230=test_config
I, [2024-05-04T03:32:57.371381 #942863]  INFO -- : [471/885] 984231=test_yaml_special_cases
I, [2024-05-04T03:32:57.381303 #942863]  INFO -- : [472/885] 984231=test_optarg
I, [2024-05-04T03:32:57.403776 #942863]  INFO -- : [473/885] 984221=test_gem_source_list
I, [2024-05-04T03:32:57.407785 #942863]  INFO -- : [474/885] 984233=test_verbose
I, [2024-05-04T03:32:57.419795 #942863]  INFO -- : [475/885] 984233=test_num2int
I, [2024-05-04T03:32:57.422373 #942863]  INFO -- : [476/885] 984230=test_nil
I, [2024-05-04T03:32:57.424604 #942863]  INFO -- : [477/885] 984230=test_rdoc_single_class
I, [2024-05-04T03:32:57.431176 #942863]  INFO -- : [478/885] 984233=test_macro
I, [2024-05-04T03:32:57.433366 #942863]  INFO -- : [479/885] 984230=test_frozen
I, [2024-05-04T03:32:57.435713 #942863]  INFO -- : [480/885] 984233=test_gem_ext_configure_builder
I, [2024-05-04T03:32:57.440507 #942863]  INFO -- : [481/885] 984230=test_pp
I, [2024-05-04T03:32:57.449878 #942863]  INFO -- : [482/885] 984221=test_zsh_completion
I, [2024-05-04T03:32:57.452333 #942863]  INFO -- : [483/885] 984221=test_exception
I, [2024-05-04T03:32:57.461310 #942863]  INFO -- : [484/885] 984233=test_iter_break
I, [2024-05-04T03:32:57.462465 #942863]  INFO -- : [485/885] 984221=test_zlib
I, [2024-05-04T03:32:57.464709 #942863]  INFO -- : [486/885] 984230=test_cgi_tag_helper
I, [2024-05-04T03:32:57.469177 #942863]  INFO -- : [487/885] 984233=test_egrep_cpp
I, [2024-05-04T03:32:57.475177 #942863]  INFO -- : [488/885] 984230=test_erb_m17n
I, [2024-05-04T03:32:57.480607 #942863]  INFO -- : [489/885] 984230=test_ole_methods
I, [2024-05-04T03:32:57.486693 #942863]  INFO -- : [490/885] 984230=test_date_conv
I, [2024-05-04T03:32:57.488761 #942863]  INFO -- : [491/885] 984230=test_optimization
I, [2024-05-04T03:32:57.506665 #942863]  INFO -- : [492/885] 984231=test_gc_compact
I, [2024-05-04T03:32:57.586363 #942863]  INFO -- : [493/885] 984233=test_proc
I, [2024-05-04T03:32:57.982964 #942863]  INFO -- : [494/885] 984217=test_string
I, [2024-05-04T03:32:58.305853 #942863]  INFO -- : [495/885] 984233=test_gem_resolver_index_set
I, [2024-05-04T03:32:58.335600 #942863]  INFO -- : [496/885] 984233=test_gem_package_old
I, [2024-05-04T03:32:58.370917 #942863]  INFO -- : [497/885] 984233=test_gem_validator
I, [2024-05-04T03:32:58.394728 #942863]  INFO -- : [498/885] 984233=test_rdoc_markup_parser
I, [2024-05-04T03:32:58.443900 #942863]  INFO -- : [499/885] 984233=test_require_path_check
I, [2024-05-04T03:32:58.578481 #942863]  INFO -- : [500/885] 984233=test_folderitem2_invokeverb
I, [2024-05-04T03:32:58.582790 #942863]  INFO -- : [501/885] 984233=test_fnmatch
I, [2024-05-04T03:32:58.626586 #942863]  INFO -- : [502/885] 984233=test_files_test_2
I, [2024-05-04T03:32:58.732008 #942863]  INFO -- : [503/885] 984234=test_rdoc_stats
I, [2024-05-04T03:32:58.756145 #942863]  INFO -- : [504/885] 984235=test_pattern_matching
I, [2024-05-04T03:32:58.771803 #942863]  INFO -- : [505/885] 984234=test_string
I, [2024-05-04T03:32:58.784658 #942863]  INFO -- : [506/885] 984235=test_rdoc_store
I, [2024-05-04T03:32:58.793634 #942863]  INFO -- : [507/885] 984234=test_depth_first
I, [2024-05-04T03:32:58.795240 #942863]  INFO -- : [508/885] 984234=test_gem_request_set_lockfile_parser
I, [2024-05-04T03:32:58.902548 #942863]  INFO -- : [509/885] 984234=test_raise
I, [2024-05-04T03:32:58.905669 #942863]  INFO -- : [510/885] 984234=test_x509attr
I, [2024-05-04T03:32:58.909890 #942863]  INFO -- : [511/885] 984234=test_custom_command
I, [2024-05-04T03:32:58.948192 #942863]  INFO -- : [512/885] 984222=json_addition_test
I, [2024-05-04T03:32:58.970382 #942863]  INFO -- : [513/885] 984222=test_gem_dependency_resolution_error
I, [2024-05-04T03:32:58.971743 #942863]  INFO -- : [514/885] 984222=test_rdoc_parser
I, [2024-05-04T03:32:58.994295 #942863]  INFO -- : [515/885] 984234=test_qsort
I, [2024-05-04T03:32:59.002206 #942863]  INFO -- : [516/885] 984234=test_null
I, [2024-05-04T03:32:59.003492 #942863]  INFO -- : [517/885] 984234=test_win32ole_type
I, [2024-05-04T03:32:59.008352 #942863]  INFO -- : [518/885] 984234=test_mul
I, [2024-05-04T03:32:59.015392 #942863]  INFO -- : [519/885] 984234=test_rdoc_markup_to_rdoc
I, [2024-05-04T03:32:59.020835 #942863]  INFO -- : [520/885] 984229=test_rdoc_rd_inline_parser
I, [2024-05-04T03:32:59.051924 #942863]  INFO -- : [521/885] 984229=test_default_gems
I, [2024-05-04T03:32:59.057687 #942863]  INFO -- : [522/885] 984234=test_rdoc_markup_attributes
I, [2024-05-04T03:32:59.062332 #942863]  INFO -- : [523/885] 984234=test_date_parse
I, [2024-05-04T03:32:59.119100 #942863]  INFO -- : [524/885] 984229=test_trick
I, [2024-05-04T03:32:59.144194 #942863]  INFO -- : [525/885] 984222=test_thread
I, [2024-05-04T03:32:59.144268 #942863]  INFO -- : [526/885] 984222=test_pipe
I, [2024-05-04T03:32:59.149675 #942863]  INFO -- : [527/885] 984236=test_pkey_ec
I, [2024-05-04T03:32:59.196368 #942863]  INFO -- : [528/885] 984234=test_io_buffer
I, [2024-05-04T03:32:59.250576 #942863]  INFO -- : [529/885] 984234=test_key_name_check
I, [2024-05-04T03:32:59.252143 #942863]  INFO -- : [530/885] 984234=test_defined
I, [2024-05-04T03:32:59.257083 #942863]  INFO -- : [531/885] 984236=test_backtrace
I, [2024-05-04T03:32:59.264073 #942863]  INFO -- : [532/885] 984236=test_rdoc_i18n_text
I, [2024-05-04T03:32:59.299034 #942863]  INFO -- : [533/885] 984222=test_windows_1251
I, [2024-05-04T03:32:59.303951 #942863]  INFO -- : [534/885] 984222=test_time
I, [2024-05-04T03:32:59.348398 #942863]  INFO -- : [535/885] 984234=test_rdoc_rdoc
I, [2024-05-04T03:32:59.363935 #942863]  INFO -- : [536/885] 984236=test_gem_uninstaller
I, [2024-05-04T03:32:59.425545 #942863]  INFO -- : [537/885] 984222=test_buffering
I, [2024-05-04T03:32:59.429378 #942863]  INFO -- : [538/885] 984222=test_svcb_https
I, [2024-05-04T03:32:59.439963 #942863]  INFO -- : [539/885] 984234=test_gb18030
I, [2024-05-04T03:32:59.442477 #942863]  INFO -- : [540/885] 984234=test_rdoc_cross_reference
I, [2024-05-04T03:32:59.454912 #942863]  INFO -- : [541/885] 984222=test_gem_dependency_installer
I, [2024-05-04T03:32:59.508159 #942863]  INFO -- : [542/885] 984235=test_scalar
I, [2024-05-04T03:32:59.517265 #942863]  INFO -- : [543/885] 984235=test_gem_commands_info_command
I, [2024-05-04T03:32:59.528329 #942863]  INFO -- : [544/885] 984235=test_case_options
I, [2024-05-04T03:32:59.535824 #942863]  INFO -- : [545/885] 984235=test_store
I, [2024-05-04T03:32:59.704073 #942863]  INFO -- : [546/885] 984235=test_exception
I, [2024-05-04T03:32:59.839620 #942863]  INFO -- : [547/885] 984234=test_bug_reporter
I, [2024-05-04T03:33:00.193854 #942863]  INFO -- : [548/885] 984234=test_rand
I, [2024-05-04T03:33:00.211846 #942863]  INFO -- : [549/885] 984221=test_gem_package_tar_reader_entry
I, [2024-05-04T03:33:00.387674 #942863]  INFO -- : [550/885] 984236=test_gem_name_tuple
I, [2024-05-04T03:33:00.401670 #942863]  INFO -- : [551/885] 984221=test_gem_commands_mirror
I, [2024-05-04T03:33:00.408568 #942863]  INFO -- : [552/885] 984221=test_gem_ext_cargo_builder_link_flag_converter
I, [2024-05-04T03:33:00.413168 #942863]  INFO -- : [553/885] 984236=test_method_cache
I, [2024-05-04T03:33:00.420660 #942863]  INFO -- : [554/885] 984236=test_gem_request
I, [2024-05-04T03:33:00.459194 #942863]  INFO -- : [555/885] 984221=test_sprintf_comb
I, [2024-05-04T03:33:00.508331 #942863]  INFO -- : [556/885] 984234=test_generic
I, [2024-05-04T03:33:00.542849 #942863]  INFO -- : [557/885] 984231=test_win32ole
I, [2024-05-04T03:33:00.547833 #942863]  INFO -- : [558/885] 984231=test_scan_args
I, [2024-05-04T03:33:00.555361 #942863]  INFO -- : [559/885] 984234=test_enumerator_kw
I, [2024-05-04T03:33:00.558779 #942863]  INFO -- : [560/885] 984231=test_gem_text
I, [2024-05-04T03:33:00.578721 #942863]  INFO -- : [561/885] 984234=test_settracefunc
I, [2024-05-04T03:33:00.594241 #942863]  INFO -- : [562/885] 984221=test_case
I, [2024-05-04T03:33:00.594603 #942863]  INFO -- : [563/885] 984221=test_pkey
I, [2024-05-04T03:33:00.611000 #942863]  INFO -- : [564/885] 984231=test_parser_events
I, [2024-05-04T03:33:00.624375 #942863]  INFO -- : [565/885] 984236=test_reline
I, [2024-05-04T03:33:00.642069 #942863]  INFO -- : [566/885] 984221=test_cclass
I, [2024-05-04T03:33:00.667526 #942863]  INFO -- : [567/885] 984231=test_gem_request_connection_pools
I, [2024-05-04T03:33:00.683176 #942863]  INFO -- : [568/885] 984224=test_grapheme_breaks
I, [2024-05-04T03:33:00.725550 #942863]  INFO -- : [569/885] 984224=test_gem_version_option
I, [2024-05-04T03:33:00.768701 #942863]  INFO -- : [570/885] 984224=test_memory_view
I, [2024-05-04T03:33:00.773943 #942863]  INFO -- : [571/885] 984221=test_m17n_comb
I, [2024-05-04T03:33:00.790350 #942863]  INFO -- : [572/885] 984236=test_ractor
I, [2024-05-04T03:33:00.834078 #942863]  INFO -- : [573/885] 984236=test_rdoc_generator_pot_po
I, [2024-05-04T03:33:00.838177 #942863]  INFO -- : [574/885] 984236=test_ansi_with_terminfo
I, [2024-05-04T03:33:00.839951 #942863]  INFO -- : [575/885] 984236=test_rdoc_markup_to_markdown
I, [2024-05-04T03:33:00.881547 #942863]  INFO -- : [576/885] 984236=test_json_tree
I, [2024-05-04T03:33:00.885602 #942863]  INFO -- : [577/885] 984236=test_ractor
I, [2024-05-04T03:33:00.902300 #942863]  INFO -- : [578/885] 984236=test_severity
I, [2024-05-04T03:33:00.917655 #942863]  INFO -- : [579/885] 984236=test_require_lib
I, [2024-05-04T03:33:00.968524 #942863]  INFO -- : [580/885] 984224=test_gem_install_update_options
I, [2024-05-04T03:33:01.070126 #942863]  INFO -- : [581/885] 984229=parse_test
I, [2024-05-04T03:33:01.095509 #942863]  INFO -- : [582/885] 984224=test_gem_stream_ui
I, [2024-05-04T03:33:01.106872 #942863]  INFO -- : [583/885] 984226=test_rdoc_generator_ri
I, [2024-05-04T03:33:01.114972 #942863]  INFO -- : [584/885] 984226=test_extlibs
I, [2024-05-04T03:33:01.183601 #942863]  INFO -- : [585/885] 984224=test_literal
I, [2024-05-04T03:33:01.463416 #942863]  INFO -- : [586/885] 984218=test_str2big
I, [2024-05-04T03:33:01.466163 #942863]  INFO -- : [587/885] 984218=test_dot_dot
I, [2024-05-04T03:33:01.470136 #942863]  INFO -- : [588/885] 984218=test_c_struct_builder
I, [2024-05-04T03:33:01.503992 #942863]  INFO -- : [589/885] 984222=test_rdoc_markup_to_table_of_contents
I, [2024-05-04T03:33:01.528337 #942863]  INFO -- : [590/885] 984222=test_thread
I, [2024-05-04T03:33:01.564744 #942863]  INFO -- : [591/885] 984218=test_socket
I, [2024-05-04T03:33:01.583430 #942863]  INFO -- : [592/885] 984234=test_objectspace
I, [2024-05-04T03:33:01.618370 #942863]  INFO -- : [593/885] 984233=test_securerandom
I, [2024-05-04T03:33:01.659643 #942863]  INFO -- : [594/885] 984233=test_rdoc_markdown_test
I, [2024-05-04T03:33:01.683203 #942863]  INFO -- : [595/885] 984224=test_rdoc_normal_module
I, [2024-05-04T03:33:01.707360 #942863]  INFO -- : [596/885] 984231=test_c_union_entity
I, [2024-05-04T03:33:01.735201 #942863]  INFO -- : [597/885] 984224=test_logperiod
I, [2024-05-04T03:33:01.743594 #942863]  INFO -- : [598/885] 984224=test_flush
I, [2024-05-04T03:33:01.747862 #942863]  INFO -- : [599/885] 984224=test_singleton
I, [2024-05-04T03:33:01.751306 #942863]  INFO -- : [600/885] 984222=test_io_console
I, [2024-05-04T03:33:01.756003 #942863]  INFO -- : [601/885] 984224=test_switch_hitter
I, [2024-05-04T03:33:01.770134 #942863]  INFO -- : [602/885] 984224=test_uncorrectable_name_check
I, [2024-05-04T03:33:01.787404 #942863]  INFO -- : [603/885] 984224=newline_test
I, [2024-05-04T03:33:01.790183 #942863]  INFO -- : [604/885] 984231=test_hash_create
I, [2024-05-04T03:33:01.794457 #942863]  INFO -- : [605/885] 984231=test_stringchar
I, [2024-05-04T03:33:01.851990 #942863]  INFO -- : [606/885] 984231=test_passing_block
I, [2024-05-04T03:33:01.857918 #942863]  INFO -- : [607/885] 984231=test_thread_fd_close
I, [2024-05-04T03:33:01.859694 #942863]  INFO -- : [608/885] 984224=test_last_thread
I, [2024-05-04T03:33:01.861990 #942863]  INFO -- : [609/885] 984231=test_process
I, [2024-05-04T03:33:02.227188 #942863]  INFO -- : [610/885] 984235=test_pack
I, [2024-05-04T03:33:02.455126 #942863]  INFO -- : [611/885] 984221=test_gem_source_local
I, [2024-05-04T03:33:02.457856 #942863]  INFO -- : [612/885] 984227=test_gem_security_policy
I, [2024-05-04T03:33:02.465340 #942863]  INFO -- : [613/885] 984219=test_arity
I, [2024-05-04T03:33:02.469531 #942863]  INFO -- : [614/885] 984235=test_gem_ext_rake_builder
I, [2024-05-04T03:33:02.469632 #942863]  INFO -- : [615/885] 984219=test_logdevice
I, [2024-05-04T03:33:02.472132 #942863]  INFO -- : [616/885] 984220=test_err_in_callback
I, [2024-05-04T03:33:02.475425 #942863]  INFO -- : [617/885] 984220=test_gem_resolver_lock_specification
I, [2024-05-04T03:33:02.512502 #942863]  INFO -- : [618/885] 984220=test_gc
I, [2024-05-04T03:33:02.523140 #942863]  INFO -- : [619/885] 984217=test_x509cert
I, [2024-05-04T03:33:02.599395 #942863]  INFO -- : [620/885] 984234=test_gem_commands_which_command
I, [2024-05-04T03:33:02.635145 #942863]  INFO -- : [621/885] 984234=test_shift_jis
I, [2024-05-04T03:33:02.640748 #942863]  INFO -- : [622/885] 984234=test_http
I, [2024-05-04T03:33:02.642144 #942863]  INFO -- : [623/885] 984233=test_enumerator
I, [2024-05-04T03:33:02.647870 #942863]  INFO -- : [624/885] 984234=test_flags
I, [2024-05-04T03:33:02.652535 #942863]  INFO -- : [625/885] 984221=test_inadvertent_creation
I, [2024-05-04T03:33:02.746238 #942863]  INFO -- : [626/885] 984228=test_gem_commands_specification_command
I, [2024-05-04T03:33:02.757959 #942863]  INFO -- : [627/885] 984221=test_gem_commands_dependency_command
I, [2024-05-04T03:33:02.785529 #942863]  INFO -- : [628/885] 984217=test_gem_resolver_composed_set
I, [2024-05-04T03:33:02.803334 #942863]  INFO -- : [629/885] 984227=test_safe_load
I, [2024-05-04T03:33:02.821454 #942863]  INFO -- : [630/885] 984227=test_gem_resolver
I, [2024-05-04T03:33:02.837059 #942863]  INFO -- : [631/885] 984221=test_rdoc_markup_attribute_manager
I, [2024-05-04T03:33:02.864670 #942863]  INFO -- : [632/885] 984221=test_name_error
I, [2024-05-04T03:33:02.865153 #942863]  INFO -- : [633/885] 984228=test_rdoc_parser_ruby
I, [2024-05-04T03:33:02.902414 #942863]  INFO -- : [634/885] 984226=test_open-uri
I, [2024-05-04T03:33:02.914346 #942863]  INFO -- : [635/885] 984224=test_httpresponse
I, [2024-05-04T03:33:02.922250 #942863]  INFO -- : [636/885] 984218=test_rdoc_context
I, [2024-05-04T03:33:02.954128 #942863]  INFO -- : [637/885] 984221=test_stream
I, [2024-05-04T03:33:02.958692 #942863]  INFO -- : [638/885] 984217=test_nil2vtempty
I, [2024-05-04T03:33:02.961119 #942863]  INFO -- : [639/885] 984221=test_iso_8859
I, [2024-05-04T03:33:02.962305 #942863]  INFO -- : [640/885] 984217=test_tcp
I, [2024-05-04T03:33:03.004605 #942863]  INFO -- : [641/885] 984221=test_rdoc_text
I, [2024-05-04T03:33:03.022644 #942863]  INFO -- : [642/885] 984224=test_gem_safe_yaml
I, [2024-05-04T03:33:03.034260 #942863]  INFO -- : [643/885] 984224=test_syntax
I, [2024-05-04T03:33:03.047576 #942863]  INFO -- : [644/885] 984221=test_data
I, [2024-05-04T03:33:03.052505 #942863]  INFO -- : [645/885] 984227=index_write_test
I, [2024-05-04T03:33:03.055216 #942863]  INFO -- : [646/885] 984221=test_date_new
I, [2024-05-04T03:33:03.055667 #942863]  INFO -- : [647/885] 984227=test_require
I, [2024-05-04T03:33:03.058363 #942863]  INFO -- : [648/885] 984227=test_date_time
I, [2024-05-04T03:33:03.069946 #942863]  INFO -- : [649/885] 984227=test_rdoc_markup_to_joined_paragraph
I, [2024-05-04T03:33:03.073644 #942863]  INFO -- : [650/885] 984221=test_gem_installer
I, [2024-05-04T03:33:03.075141 #942863]  INFO -- : [651/885] 984227=test_yamlstore
I, [2024-05-04T03:33:03.082482 #942863]  INFO -- : [652/885] 984227=test_rdoc_parser_rd
I, [2024-05-04T03:33:03.131552 #942863]  INFO -- : [653/885] 984227=test_date_strftime
I, [2024-05-04T03:33:03.148366 #942863]  INFO -- : [654/885] 984217=test_irb
I, [2024-05-04T03:33:03.154222 #942863]  INFO -- : [655/885] 984235=test_asn1
I, [2024-05-04T03:33:03.168477 #942863]  INFO -- : [656/885] 984235=test_random
I, [2024-05-04T03:33:03.172407 #942863]  INFO -- : [657/885] 984235=json_string_matching_test
I, [2024-05-04T03:33:03.183425 #942863]  INFO -- : [658/885] 984235=test_load
I, [2024-05-04T03:33:03.190864 #942863]  INFO -- : [659/885] 984235=test_class
I, [2024-05-04T03:33:03.350593 #942863]  INFO -- : [660/885] 984219=test_rdoc_normal_class
I, [2024-05-04T03:33:03.460339 #942863]  INFO -- : [661/885] 984217=test_const
I, [2024-05-04T03:33:03.465905 #942863]  INFO -- : [662/885] 984217=parse_comments_test
I, [2024-05-04T03:33:03.489053 #942863]  INFO -- : [663/885] 984227=test_noarg
I, [2024-05-04T03:33:03.512679 #942863]  INFO -- : [664/885] 984228=test_tempfile
I, [2024-05-04T03:33:03.545333 #942863]  INFO -- : [665/885] 984226=test_function
I, [2024-05-04T03:33:03.572466 #942863]  INFO -- : [666/885] 984217=test_queue
I, [2024-05-04T03:33:03.577810 #942863]  INFO -- : [667/885] 984217=test_gem_resolver_index_specification
I, [2024-05-04T03:33:03.611065 #942863]  INFO -- : [668/885] 984219=test_internal_ivar
I, [2024-05-04T03:33:03.614508 #942863]  INFO -- : [669/885] 984219=test_tracepoint
I, [2024-05-04T03:33:03.666457 #942863]  INFO -- : [670/885] 984218=test_prettyprint
I, [2024-05-04T03:33:03.680547 #942863]  INFO -- : [671/885] 984217=test_gem_commands_help_command
I, [2024-05-04T03:33:03.682030 #942863]  INFO -- : [672/885] 984218=test_rdoc_markup
I, [2024-05-04T03:33:03.684695 #942863]  INFO -- : [673/885] 984234=test_duplicate
I, [2024-05-04T03:33:03.688106 #942863]  INFO -- : [674/885] 984218=test_utf32
I, [2024-05-04T03:33:03.689570 #942863]  INFO -- : [675/885] 984234=test_basicsocket
I, [2024-05-04T03:33:03.694930 #942863]  INFO -- : [676/885] 984218=test_too_many_dummy_encodings
I, [2024-05-04T03:33:03.697567 #942863]  INFO -- : [677/885] 984234=test_reqarg
I, [2024-05-04T03:33:03.697833 #942863]  INFO -- : [678/885] 984227=test_rdoc_include
I, [2024-05-04T03:33:03.734692 #942863]  INFO -- : [679/885] 984227=test_stack
I, [2024-05-04T03:33:03.760485 #942863]  INFO -- : [680/885] 984229=test_gem_commands_list_command
I, [2024-05-04T03:33:03.764567 #942863]  INFO -- : [681/885] 984226=test_ldap
I, [2024-05-04T03:33:03.768718 #942863]  INFO -- : [682/885] 984226=test_emitter
I, [2024-05-04T03:33:03.781717 #942863]  INFO -- : [683/885] 984229=test_resource
I, [2024-05-04T03:33:03.791088 #942863]  INFO -- : [684/885] 984218=test_gem_commands_signin_command
I, [2024-05-04T03:33:03.792568 #942863]  INFO -- : [685/885] 984229=test_string_processing
I, [2024-05-04T03:33:03.800423 #942863]  INFO -- : [686/885] 984226=test_fileutils
I, [2024-05-04T03:33:03.801244 #942863]  INFO -- : [687/885] 984229=test_econv
I, [2024-05-04T03:33:03.806970 #942863]  INFO -- : [688/885] 984228=test_cesu8
I, [2024-05-04T03:33:03.819524 #942863]  INFO -- : [689/885] 984217=test_rdoc_options
I, [2024-05-04T03:33:03.827940 #942863]  INFO -- : [690/885] 984228=test_gem_version
I, [2024-05-04T03:33:03.872604 #942863]  INFO -- : [691/885] 984218=test_path_to_class
I, [2024-05-04T03:33:03.877114 #942863]  INFO -- : [692/885] 984218=test_gem_resolver_specification
I, [2024-05-04T03:33:03.904000 #942863]  INFO -- : [693/885] 984218=test_gem_dependency
I, [2024-05-04T03:33:03.923432 #942863]  INFO -- : [694/885] 984219=test_inlinecache
I, [2024-05-04T03:33:03.927979 #942863]  INFO -- : [695/885] 984228=test_rdoc_markup_verbatim
I, [2024-05-04T03:33:03.929461 #942863]  INFO -- : [696/885] 984228=test_complex
I, [2024-05-04T03:33:04.001388 #942863]  INFO -- : [697/885] 984219=test_gem_commands_search_command
I, [2024-05-04T03:33:04.037152 #942863]  INFO -- : [698/885] 984218=test_gem_stub_specification
I, [2024-05-04T03:33:04.095253 #942863]  INFO -- : [699/885] 984234=test_method_cache
I, [2024-05-04T03:33:04.097950 #942863]  INFO -- : [700/885] 984234=test_frozen_error
I, [2024-05-04T03:33:04.103231 #942863]  INFO -- : [701/885] 984234=test_gem_ext_ext_conf_builder
I, [2024-05-04T03:33:04.113049 #942863]  INFO -- : [702/885] 984228=test_gem_resolver_installed_specification
I, [2024-05-04T03:33:04.137005 #942863]  INFO -- : [703/885] 984228=test_scanner_events
I, [2024-05-04T03:33:04.186856 #942863]  INFO -- : [704/885] 984219=test_gem_remote_fetcher
I, [2024-05-04T03:33:04.187931 #942863]  INFO -- : [705/885] 984228=test_parse
I, [2024-05-04T03:33:04.232314 #942863]  INFO -- : [706/885] 984226=test_mdns
I, [2024-05-04T03:33:04.235787 #942863]  INFO -- : [707/885] 984236=test_wait
I, [2024-05-04T03:33:04.236213 #942863]  INFO -- : [708/885] 984226=test_handle
I, [2024-05-04T03:33:04.241460 #942863]  INFO -- : [709/885] 984218=test_forwardable
I, [2024-05-04T03:33:04.279137 #942863]  INFO -- : [710/885] 984218=test_yaml
I, [2024-05-04T03:33:04.312139 #942863]  INFO -- : [711/885] 984236=test_big2str
I, [2024-05-04T03:33:04.317046 #942863]  INFO -- : [712/885] 984236=test_gem_commands_sources_command
I, [2024-05-04T03:33:04.339619 #942863]  INFO -- : [713/885] 984217=test_ansi_without_terminfo
I, [2024-05-04T03:33:04.362739 #942863]  INFO -- : [714/885] 984218=test_euc_tw
I, [2024-05-04T03:33:04.366227 #942863]  INFO -- : [715/885] 984217=test_ractor
I, [2024-05-04T03:33:04.371549 #942863]  INFO -- : [716/885] 984218=test_bmethod
I, [2024-05-04T03:33:04.392631 #942863]  INFO -- : [717/885] 984217=test_rdoc_markup_formatter
I, [2024-05-04T03:33:04.405830 #942863]  INFO -- : [718/885] 984218=test_thread_queue
I, [2024-05-04T03:33:04.406742 #942863]  INFO -- : [719/885] 984217=test_nowrite
I, [2024-05-04T03:33:04.431168 #942863]  INFO -- : [720/885] 984217=test_rdoc_parser_c
I, [2024-05-04T03:33:04.437153 #942863]  INFO -- : [721/885] 984226=test_comparable
I, [2024-05-04T03:33:04.442665 #942863]  INFO -- : [722/885] 984226=test_shapes
I, [2024-05-04T03:33:04.446743 #942863]  INFO -- : [723/885] 984222=json_fixtures_test
I, [2024-05-04T03:33:04.448709 #942863]  INFO -- : [724/885] 984226=test_io_timeout
I, [2024-05-04T03:33:04.450331 #942863]  INFO -- : [725/885] 984222=test_profile_frames
I, [2024-05-04T03:33:04.452519 #942863]  INFO -- : [726/885] 984226=test_pstore
I, [2024-05-04T03:33:04.495682 #942863]  INFO -- : [727/885] 984226=test_cstr
I, [2024-05-04T03:33:04.499048 #942863]  INFO -- : [728/885] 984236=test_enc_str_buf_cat
I, [2024-05-04T03:33:04.509578 #942863]  INFO -- : [729/885] 984236=test_class2name
I, [2024-05-04T03:33:04.519679 #942863]  INFO -- : [730/885] 984236=test_gbk
I, [2024-05-04T03:33:04.527604 #942863]  INFO -- : [731/885] 984236=test_require
I, [2024-05-04T03:33:04.610942 #942863]  INFO -- : [732/885] 984227=test_cgi_util
I, [2024-05-04T03:33:04.616441 #942863]  INFO -- : [733/885] 984222=test_gem_commands_contents_command
I, [2024-05-04T03:33:04.717859 #942863]  INFO -- : [734/885] 984222=test_gem_ext_cmake_builder
I, [2024-05-04T03:33:04.725782 #942863]  INFO -- : [735/885] 984217=test_digest
I, [2024-05-04T03:33:04.739554 #942863]  INFO -- : [736/885] 984222=test_marshalable
I, [2024-05-04T03:33:04.750473 #942863]  INFO -- : [737/885] 984222=test_find
I, [2024-05-04T03:33:04.768230 #942863]  INFO -- : [738/885] 984222=test_ractor
I, [2024-05-04T03:33:04.772028 #942863]  INFO -- : [739/885] 984228=test_wss
I, [2024-05-04T03:33:04.789824 #942863]  INFO -- : [740/885] 984227=test_fiddle
I, [2024-05-04T03:33:04.792663 #942863]  INFO -- : [741/885] 984228=test_file
I, [2024-05-04T03:33:04.797633 #942863]  INFO -- : [742/885] 984228=test_rdoc_any_method
I, [2024-05-04T03:33:04.860919 #942863]  INFO -- : [743/885] 984227=test_modify_expand
I, [2024-05-04T03:33:04.875400 #942863]  INFO -- : [744/885] 984227=test_rdoc_markdown
I, [2024-05-04T03:33:04.875742 #942863]  INFO -- : [745/885] 984222=test_gem_available_set
I, [2024-05-04T03:33:04.955658 #942863]  INFO -- : [746/885] 984229=test_pathname
I, [2024-05-04T03:33:04.955730 #942863]  INFO -- : [747/885] 984226=test_complexrational
I, [2024-05-04T03:33:04.962292 #942863]  INFO -- : [748/885] 984226=test_init
I, [2024-05-04T03:33:04.986573 #942863]  INFO -- : [749/885] 984222=regexp_test
I, [2024-05-04T03:33:04.998208 #942863]  INFO -- : [750/885] 984222=test_gem_package_tar_reader
I, [2024-05-04T03:33:05.037986 #942863]  INFO -- : [751/885] 984222=test_rdoc_encoding
I, [2024-05-04T03:33:05.063800 #942863]  INFO -- : [752/885] 984222=test_coverage
I, [2024-05-04T03:33:05.074550 #942863]  INFO -- : [753/885] 984227=test_recorder
I, [2024-05-04T03:33:05.081534 #942863]  INFO -- : [754/885] 984227=test_gem_source_vendor
I, [2024-05-04T03:33:05.098995 #942863]  INFO -- : [755/885] 984227=test_gem_commands_owner_command
I, [2024-05-04T03:33:05.119969 #942863]  INFO -- : [756/885] 984228=test_formatter
I, [2024-05-04T03:33:05.128372 #942863]  INFO -- : [757/885] 984228=test_bash_completion
I, [2024-05-04T03:33:05.134440 #942863]  INFO -- : [758/885] 984228=test_deprecate
I, [2024-05-04T03:33:05.136539 #942863]  INFO -- : [759/885] 984235=test_rdoc_constant
I, [2024-05-04T03:33:05.158565 #942863]  INFO -- : [760/885] 984230=test_system
I, [2024-05-04T03:33:05.170184 #942863]  INFO -- : [761/885] 984228=test_pkcs12
I, [2024-05-04T03:33:05.242840 #942863]  INFO -- : [762/885] 984229=test_pkey_dh
I, [2024-05-04T03:33:05.253972 #942863]  INFO -- : [763/885] 984235=test_bigzero
I, [2024-05-04T03:33:05.265038 #942863]  INFO -- : [764/885] 984235=test_gem_package_tar_header
I, [2024-05-04T03:33:05.307952 #942863]  INFO -- : [765/885] 984235=test_gem_util
I, [2024-05-04T03:33:05.311127 #942863]  INFO -- : [766/885] 984234=test_iseq_load
I, [2024-05-04T03:33:05.320259 #942863]  INFO -- : [767/885] 984229=test_gem_config_file
I, [2024-05-04T03:33:05.336068 #942863]  INFO -- : [768/885] 984226=test_ripper
I, [2024-05-04T03:33:05.440763 #942863]  INFO -- : [769/885] 984229=test_getopts
I, [2024-05-04T03:33:05.443752 #942863]  INFO -- : [770/885] 984229=test_protocol
I, [2024-05-04T03:33:05.500887 #942863]  INFO -- : [771/885] 984235=test_gem_resolver_activation_request
I, [2024-05-04T03:33:05.509227 #942863]  INFO -- : [772/885] 984235=test_yjit_exit_locations
I, [2024-05-04T03:33:05.513283 #942863]  INFO -- : [773/885] 984235=test_etc
I, [2024-05-04T03:33:05.529705 #942863]  INFO -- : [774/885] 984228=test_yaml_tree
I, [2024-05-04T03:33:05.542604 #942863]  INFO -- : [775/885] 984228=test_libs
I, [2024-05-04T03:33:05.567990 #942863]  INFO -- : [776/885] 984228=test_math
I, [2024-05-04T03:33:05.576550 #942863]  INFO -- : [777/885] 984228=test_gem_commands_fetch_command
I, [2024-05-04T03:33:05.586591 #942863]  INFO -- : [778/885] 984235=test_gc
I, [2024-05-04T03:33:05.590504 #942863]  INFO -- : [779/885] 984235=test_sleep
I, [2024-05-04T03:33:05.602663 #942863]  INFO -- : [780/885] 984217=test_config
I, [2024-05-04T03:33:05.647641 #942863]  INFO -- : [781/885] 984217=test_utf16
I, [2024-05-04T03:33:05.661364 #942863]  INFO -- : [782/885] 984217=test_autoload
I, [2024-05-04T03:33:05.671341 #942863]  INFO -- : [783/885] 984227=test_io
I, [2024-05-04T03:33:05.688554 #942863]  INFO -- : [784/885] 984228=test_unicode_escape
I, [2024-05-04T03:33:05.730607 #942863]  INFO -- : [785/885] 984226=test_sizeof
I, [2024-05-04T03:33:05.745931 #942863]  INFO -- : [786/885] 984236=test_case
I, [2024-05-04T03:33:05.751945 #942863]  INFO -- : [787/885] 984229=test_face
I, [2024-05-04T03:33:05.770809 #942863]  INFO -- : [788/885] 984229=test_rendering
I, [2024-05-04T03:33:05.774627 #942863]  INFO -- : [789/885] 984228=test_backtrace
I, [2024-05-04T03:33:05.774954 #942863]  INFO -- : [790/885] 984229=test_pack
I, [2024-05-04T03:33:05.775582 #942863]  INFO -- : [791/885] 984236=ruby_parser_test
I, [2024-05-04T03:33:05.787509 #942863]  INFO -- : [792/885] 984236=test_io_buffer
I, [2024-05-04T03:33:05.808029 #942863]  INFO -- : [793/885] 984229=test_gem_resolver_conflict
I, [2024-05-04T03:33:05.824112 #942863]  INFO -- : [794/885] 984229=test_rdoc_task
I, [2024-05-04T03:33:05.826153 #942863]  INFO -- : [795/885] 984229=test_rdoc_markup_indented_paragraph
I, [2024-05-04T03:33:05.835302 #942863]  INFO -- : [796/885] 984229=locals_test
I, [2024-05-04T03:33:05.907316 #942863]  INFO -- : [797/885] 984236=test_rdoc_require
I, [2024-05-04T03:33:05.928791 #942863]  INFO -- : [798/885] 984234=test_clone
I, [2024-05-04T03:33:05.954608 #942863]  INFO -- : [799/885] 984236=test_gem_commands_install_command
I, [2024-05-04T03:33:05.961458 #942863]  INFO -- : [800/885] 984222=test_readpartial
I, [2024-05-04T03:33:06.024086 #942863]  INFO -- : [801/885] 984230=test_fstring
I, [2024-05-04T03:33:06.092020 #942863]  INFO -- : [802/885] 984234=test_optparse
I, [2024-05-04T03:33:06.092213 #942863]  INFO -- : [803/885] 984234=test_array
I, [2024-05-04T03:33:06.099569 #942863]  INFO -- : [804/885] 984234=test_rat
I, [2024-05-04T03:33:06.108112 #942863]  INFO -- : [805/885] 984234=test_rdoc_markup_raw
I, [2024-05-04T03:33:06.113510 #942863]  INFO -- : [806/885] 984234=test_webauthn_poller
I, [2024-05-04T03:33:06.114357 #942863]  INFO -- : [807/885] 984230=test_rdoc_markup_to_html_crossref
I, [2024-05-04T03:33:06.259966 #942863]  INFO -- : [808/885] 984234=encoding_test
I, [2024-05-04T03:33:06.262956 #942863]  INFO -- : [809/885] 984229=test_gem_resolver_best_set
I, [2024-05-04T03:33:06.310438 #942863]  INFO -- : [810/885] 984219=test_typeddata
I, [2024-05-04T03:33:06.329698 #942863]  INFO -- : [811/885] 984230=test_stringscanner
I, [2024-05-04T03:33:06.333439 #942863]  INFO -- : [812/885] 984229=test_files_sample
I, [2024-05-04T03:33:06.354010 #942863]  INFO -- : [813/885] 984230=parser_test
I, [2024-05-04T03:33:06.355454 #942863]  INFO -- : [814/885] 984230=test_convertible
I, [2024-05-04T03:33:06.365678 #942863]  INFO -- : [815/885] 984234=test_rdoc_alias
I, [2024-05-04T03:33:06.366822 #942863]  INFO -- : [816/885] 984222=test_yield
I, [2024-05-04T03:33:06.386310 #942863]  INFO -- : [817/885] 984234=test_line_editor
I, [2024-05-04T03:33:06.395570 #942863]  INFO -- : [818/885] 984234=ripper_test
I, [2024-05-04T03:33:06.426415 #942863]  INFO -- : [819/885] 984232=test_objspace
I, [2024-05-04T03:33:06.455567 #942863]  INFO -- : [820/885] 984229=test_undef
I, [2024-05-04T03:33:06.460270 #942863]  INFO -- : [821/885] 984229=test_gem_security_trust_dir
I, [2024-05-04T03:33:06.504853 #942863]  INFO -- : [822/885] 984229=test_string_memory
I, [2024-05-04T03:33:06.564523 #942863]  INFO -- : [823/885] 984219=comments_test
I, [2024-05-04T03:33:06.581818 #942863]  INFO -- : [824/885] 984229=test_sprintf
I, [2024-05-04T03:33:06.619146 #942863]  INFO -- : [825/885] 984219=test_gem_requirement
I, [2024-05-04T03:33:06.734267 #942863]  INFO -- : [826/885] 984229=test_show_source
I, [2024-05-04T03:33:06.741477 #942863]  INFO -- : [827/885] 984229=test_set
I, [2024-05-04T03:33:06.745562 #942863]  INFO -- : [828/885] 984229=test_lock_native_thread
I, [2024-05-04T03:33:06.757395 #942863]  INFO -- : [829/885] 984219=test_c_struct_entry
I, [2024-05-04T03:33:06.814216 #942863]  INFO -- : [830/885] 984234=test_gem_commands_stale_command
I, [2024-05-04T03:33:06.828103 #942863]  INFO -- : [831/885] 984234=test_remote_fetch_error
I, [2024-05-04T03:33:06.836707 #942863]  INFO -- : [832/885] 984234=test_have_library
I, [2024-05-04T03:33:07.007780 #942863]  INFO -- : [833/885] 984219=test_tree_builder
I, [2024-05-04T03:33:07.014716 #942863]  INFO -- : [834/885] 984219=test_gem_resolver_dependency_request
I, [2024-05-04T03:33:07.026281 #942863]  INFO -- : [835/885] 984229=test_hash
I, [2024-05-04T03:33:07.036654 #942863]  INFO -- : [836/885] 984229=test_postponed_job
I, [2024-05-04T03:33:07.038610 #942863]  INFO -- : [837/885] 984219=test_alias_and_anchor
I, [2024-05-04T03:33:07.042571 #942863]  INFO -- : [838/885] 984219=test_external_new
I, [2024-05-04T03:33:07.049071 #942863]  INFO -- : [839/885] 984219=test_gem_request_set_lockfile
I, [2024-05-04T03:33:07.094361 #942863]  INFO -- : [840/885] 984228=test_raise_exception
I, [2024-05-04T03:33:07.247153 #942863]  INFO -- : [841/885] 984236=test_protect
I, [2024-05-04T03:33:07.256202 #942863]  INFO -- : [842/885] 984236=test_win32ole_typelib
I, [2024-05-04T03:33:07.258557 #942863]  INFO -- : [843/885] 984236=test_workspace
I, [2024-05-04T03:33:07.357169 #942863]  INFO -- : [844/885] 984229=test_weakmap
I, [2024-05-04T03:33:07.383470 #942863]  INFO -- : [845/885] 984219=test_yjit
I, [2024-05-04T03:33:07.389945 #942863]  INFO -- : [846/885] 984219=test_ws
I, [2024-05-04T03:33:07.394810 #942863]  INFO -- : [847/885] 984236=test_gem_commands_environment_command
I, [2024-05-04T03:33:07.396316 #942863]  INFO -- : [848/885] 984219=test_m17n
I, [2024-05-04T03:33:07.440324 #942863]  INFO -- : [849/885] 984236=test_argf
I, [2024-05-04T03:33:07.478873 #942863]  INFO -- : [850/885] 984219=test_kill_ring
I, [2024-05-04T03:33:07.552149 #942863]  INFO -- : [851/885] 984219=test_ns_spki
I, [2024-05-04T03:33:07.558209 #942863]  INFO -- : [852/885] 984219=test_framework
I, [2024-05-04T03:33:07.559275 #942863]  INFO -- : [853/885] 984219=test_console_attr
I, [2024-05-04T03:33:07.572692 #942863]  INFO -- : [854/885] 984219=test_summary
I, [2024-05-04T03:33:07.640597 #942863]  INFO -- : [855/885] 984235=test_type_completor
I, [2024-05-04T03:33:07.647435 #942863]  INFO -- : [856/885] 984235=test_io_wait
I, [2024-05-04T03:33:07.649783 #942863]  INFO -- : [857/885] 984221=test_gem_commands_exec_command
I, [2024-05-04T03:33:07.688827 #942863]  INFO -- : [858/885] 984219=warnings_test
I, [2024-05-04T03:33:07.710510 #942863]  INFO -- : [859/885] 984219=test_kwargs
I, [2024-05-04T03:33:07.718493 #942863]  INFO -- : [860/885] 984219=test_ellipsize
I, [2024-05-04T03:33:07.729428 #942863]  INFO -- : [861/885] 984219=test_date_attr
I, [2024-05-04T03:33:07.731274 #942863]  INFO -- : [862/885] 984219=test_io
I, [2024-05-04T03:33:07.841237 #942863]  INFO -- : [863/885] 984228=test_sorted_set
I, [2024-05-04T03:33:07.976661 #942863]  INFO -- : [864/885] 984219=test_win32ole_type_event
I, [2024-05-04T03:33:07.986617 #942863]  INFO -- : [865/885] 984219=test_emoji
I, [2024-05-04T03:33:07.988976 #942863]  INFO -- : [866/885] 984235=test_ubf_async_safe
I, [2024-05-04T03:33:08.000403 #942863]  INFO -- : [867/885] 984234=test_hash
I, [2024-05-04T03:33:08.000688 #942863]  INFO -- : [868/885] 984235=test_gem_unsatisfiable_dependency_error
I, [2024-05-04T03:33:08.010216 #942863]  INFO -- : [869/885] 984219=test_win32ole_record
I, [2024-05-04T03:33:08.014559 #942863]  INFO -- : [870/885] 984219=test_cp949
I, [2024-05-04T03:33:08.016985 #942863]  INFO -- : [871/885] 984219=test_gem_commands_uninstall_command
I, [2024-05-04T03:33:08.018715 #942863]  INFO -- : [872/885] 984235=test_gem_source_specific_file
I, [2024-05-04T03:33:08.042253 #942863]  INFO -- : [873/885] 984228=test_foreach
I, [2024-05-04T03:33:08.060731 #942863]  INFO -- : [874/885] 984228=test_condition
I, [2024-05-04T03:33:08.064878 #942863]  INFO -- : [875/885] 984228=test_rdoc_rubygems_hook
I, [2024-05-04T03:33:08.122585 #942863]  INFO -- : [876/885] 984235=test_gem_commands_query_command
I, [2024-05-04T03:33:08.152887 #942863]  INFO -- : [877/885] 984228=test_method
I, [2024-05-04T03:33:08.659005 #942863]  INFO -- : [878/885] 984221=test_gem_impossible_dependencies_error
I, [2024-05-04T03:33:08.660470 #942863]  INFO -- : [879/885] 984221=test_array_create
I, [2024-05-04T03:33:08.668102 #942863]  INFO -- : [880/885] 984221=test_pack
I, [2024-05-04T03:33:08.680078 #942863]  INFO -- : [881/885] 984226=test_pattern_key_name_check
I, [2024-05-04T03:33:08.687318 #942863]  INFO -- : [882/885] 984226=test_to_ruby
I, [2024-05-04T03:33:08.702906 #942863]  INFO -- : [883/885] 984226=test_ftp
I, [2024-05-04T03:33:08.708759 #942863]  INFO -- : [884/885] 984226=test_rdoc_context_section
I, [2024-05-04T03:33:08.716303 #942863]  INFO -- : [885/885] 984226=test_euc_kr
I, [2024-05-04T03:33:25.914446 #942863]  INFO -- : Finished tests in 37.470166s, 704.2670 tests/s, 249567.0537 assertions/s.
E, [2024-05-04T03:33:25.914539 #942863] ERROR -- : Children under /tmp/rubytest.tbefy2:
E, [2024-05-04T03:33:25.914581 #942863] ERROR -- : * drwx------ 4 80 2024-05-04 03:32:51 +0000 gem_rebuild20240504-984230-6452rs/
E, [2024-05-04T03:33:25.914588 #942863] ERROR -- :   * drwxrwxr-x 2 60 2024-05-04 03:32:51 +0000 new/
E, [2024-05-04T03:33:25.914593 #942863] ERROR -- :     * -rw-rw-r-- 1 4096 2024-05-04 03:32:51 +0000 rebuild_test_gem-1.0.0.gem
E, [2024-05-04T03:33:25.914597 #942863] ERROR -- :   * drwxrwxr-x 2 60 2024-05-04 03:32:51 +0000 old/
E, [2024-05-04T03:33:25.914600 #942863] ERROR -- :     * -rw-rw-r-- 1 4096 2024-05-04 03:32:51 +0000 rebuild_test_gem-1.0.0.gem
I, [2024-05-04T03:33:25.915816 #942863]  INFO -- : 26389 tests, 9351319 assertions, 0 failures, 0 errors, 306 skips
I, [2024-05-04T03:33:25.915851 #942863]  INFO -- : 
I, [2024-05-04T03:33:25.915867 #942863]  INFO -- : ruby -v: ruby 3.4.0dev (2024-05-04T03:22:17Z master fb2ea7084f) [x86_64-linux]
I, [2024-05-04T03:33:25.917980 #942863]  INFO -- : $$$[end] "make yes-test-all TESTOPTS='--stderr-on-failure' TESTS='-j20'" exit with 0.
I, [2024-05-04T03:33:25.918107 #942863]  INFO -- : $$$[beg] make yes-test-rubyspec MSPECOPT='--error-output stderr --debug -j' TESTS='-j20'
I, [2024-05-04T03:33:26.005809 #942863]  INFO -- : 	BASERUBY = /usr/bin/ruby --disable=gems
I, [2024-05-04T03:33:26.005844 #942863]  INFO -- : 	CC = gcc
I, [2024-05-04T03:33:26.005850 #942863]  INFO -- : 	LD = ld
I, [2024-05-04T03:33:26.005854 #942863]  INFO -- : 	LDSHARED = gcc -shared
I, [2024-05-04T03:33:26.005858 #942863]  INFO -- : 	CFLAGS = -O3 -fno-fast-math -ggdb3 -Wall -Wextra -Wdeprecated-declarations -Wdiv-by-zero -Wduplicated-cond -Wimplicit-function-declaration -Wimplicit-int -Wpointer-arith -Wwrite-strings -Wold-style-definition -Wimplicit-fallthrough=0 -Wmissing-noreturn -Wno-cast-function-type -Wno-constant-logical-operand -Wno-long-long -Wno-missing-field-initializers -Wno-overlength-strings -Wno-packed-bitfield-compat -Wno-parentheses-equality -Wno-self-assign -Wno-tautological-compare -Wno-unused-parameter -Wno-unused-value -Wsuggest-attribute=format -Wsuggest-attribute=noreturn -Wunused-variable -Wmisleading-indentation -Wundef   -fPIC 
I, [2024-05-04T03:33:26.005870 #942863]  INFO -- : 	XCFLAGS = -U_FORTIFY_SOURCE -D_FORTIFY_SOURCE=2 -fstack-protector-strong -fno-strict-overflow -fvisibility=hidden -fexcess-precision=standard -DRUBY_EXPORT -I. -I.ext/include/x86_64-linux -I/tmp/ruby/src/trunk/include -I/tmp/ruby/src/trunk -I/tmp/ruby/src/trunk/prism -I/tmp/ruby/src/trunk/enc/unicode/15.0.0  
I, [2024-05-04T03:33:26.005874 #942863]  INFO -- : 	CPPFLAGS =   
I, [2024-05-04T03:33:26.005878 #942863]  INFO -- : 	DLDFLAGS = -Wl,--compress-debug-sections=zlib -Wl,-soname,libruby.so.3.4  -fstack-protector-strong  
I, [2024-05-04T03:33:26.005882 #942863]  INFO -- : 	SOLIBS = -lz -lrt -lrt -lgmp -ldl -lcrypt -lm -lpthread 
I, [2024-05-04T03:33:26.005886 #942863]  INFO -- : 	LANG = en_US.UTF-8
I, [2024-05-04T03:33:26.005889 #942863]  INFO -- : 	LC_ALL = 
I, [2024-05-04T03:33:26.005893 #942863]  INFO -- : 	LC_CTYPE = 
I, [2024-05-04T03:33:26.005896 #942863]  INFO -- : 	MFLAGS = 
I, [2024-05-04T03:33:26.005899 #942863]  INFO -- : 	RUSTC = no
I, [2024-05-04T03:33:26.005903 #942863]  INFO -- : 	YJIT_RUSTC_ARGS = --crate-name=yjit --crate-type=staticlib --edition=2021 -g -C lto=thin -C opt-level=3 -C overflow-checks=on '--out-dir=/tmp/ruby/build/trunk/yjit/target/release/' /tmp/ruby/src/trunk/yjit/src/lib.rs
I, [2024-05-04T03:33:26.006470 #942863]  INFO -- : gcc (Ubuntu 11.4.0-1ubuntu1~22.04) 11.4.0
I, [2024-05-04T03:33:26.006490 #942863]  INFO -- : Copyright (C) 2021 Free Software Foundation, Inc.
I, [2024-05-04T03:33:26.006496 #942863]  INFO -- : This is free software; see the source for copying conditions.  There is NO
I, [2024-05-04T03:33:26.006501 #942863]  INFO -- : warranty; not even for MERCHANTABILITY or FITNESS FOR A PARTICULAR PURPOSE.
I, [2024-05-04T03:33:26.006504 #942863]  INFO -- : 
I, [2024-05-04T03:33:26.008298 #942863]  INFO -- : generating enc.mk
I, [2024-05-04T03:33:26.126518 #942863]  INFO -- : making enc
I, [2024-05-04T03:33:26.143752 #942863]  INFO -- : make[1]: Entering directory '/tmp/ruby/build/trunk'
I, [2024-05-04T03:33:26.143775 #942863]  INFO -- : make[1]: Nothing to be done for 'enc'.
I, [2024-05-04T03:33:26.143781 #942863]  INFO -- : make[1]: Leaving directory '/tmp/ruby/build/trunk'
I, [2024-05-04T03:33:26.144249 #942863]  INFO -- : making srcs under enc
I, [2024-05-04T03:33:26.173607 #942863]  INFO -- : make[1]: Entering directory '/tmp/ruby/build/trunk'
I, [2024-05-04T03:33:26.173630 #942863]  INFO -- : make[1]: Nothing to be done for 'srcs'.
I, [2024-05-04T03:33:26.173636 #942863]  INFO -- : make[1]: Leaving directory '/tmp/ruby/build/trunk'
I, [2024-05-04T03:33:26.174512 #942863]  INFO -- : generating transdb.h
I, [2024-05-04T03:33:26.269322 #942863]  INFO -- : transdb.h unchanged
I, [2024-05-04T03:33:26.270696 #942863]  INFO -- : making trans
I, [2024-05-04T03:33:26.304356 #942863]  INFO -- : make[1]: Entering directory '/tmp/ruby/build/trunk'
I, [2024-05-04T03:33:26.304377 #942863]  INFO -- : make[1]: Nothing to be done for 'trans'.
I, [2024-05-04T03:33:26.304384 #942863]  INFO -- : make[1]: Leaving directory '/tmp/ruby/build/trunk'
I, [2024-05-04T03:33:26.305152 #942863]  INFO -- : making encs
I, [2024-05-04T03:33:26.341929 #942863]  INFO -- : make[1]: Entering directory '/tmp/ruby/build/trunk'
I, [2024-05-04T03:33:26.341951 #942863]  INFO -- : make[1]: Nothing to be done for 'encs'.
I, [2024-05-04T03:33:26.341956 #942863]  INFO -- : make[1]: Leaving directory '/tmp/ruby/build/trunk'
I, [2024-05-04T03:33:26.343789 #942863]  INFO -- : generating makefiles ext/configure-ext.mk
I, [2024-05-04T03:33:26.370937 #942863]  INFO -- : ext/configure-ext.mk updated
I, [2024-05-04T03:33:26.373349 #942863]  INFO -- : make[1]: Entering directory '/tmp/ruby/build/trunk'
I, [2024-05-04T03:33:27.736288 #942863]  INFO -- : make[1]: Leaving directory '/tmp/ruby/build/trunk'
I, [2024-05-04T03:33:27.736949 #942863]  INFO -- : generating makefile exts.mk
I, [2024-05-04T03:33:27.773689 #942863]  INFO -- : exts.mk unchanged
I, [2024-05-04T03:33:27.778370 #942863]  INFO -- : make[1]: Entering directory '/tmp/ruby/build/trunk'
I, [2024-05-04T03:33:27.990775 #942863]  INFO -- : make[2]: Entering directory '/tmp/ruby/build/trunk/ext/coverage'
I, [2024-05-04T03:33:27.993688 #942863]  INFO -- : make[2]: Leaving directory '/tmp/ruby/build/trunk/ext/coverage'
I, [2024-05-04T03:33:27.997558 #942863]  INFO -- : make[2]: Entering directory '/tmp/ruby/build/trunk/ext/date'
I, [2024-05-04T03:33:28.000687 #942863]  INFO -- : make[2]: Leaving directory '/tmp/ruby/build/trunk/ext/date'
I, [2024-05-04T03:33:28.002937 #942863]  INFO -- : make[2]: Entering directory '/tmp/ruby/build/trunk/ext/digest'
I, [2024-05-04T03:33:28.008348 #942863]  INFO -- : make[2]: Leaving directory '/tmp/ruby/build/trunk/ext/digest'
I, [2024-05-04T03:33:28.023924 #942863]  INFO -- : make[2]: Entering directory '/tmp/ruby/build/trunk/ext/digest/sha2'
I, [2024-05-04T03:33:28.026835 #942863]  INFO -- : make[2]: Leaving directory '/tmp/ruby/build/trunk/ext/digest/sha2'
I, [2024-05-04T03:33:28.039559 #942863]  INFO -- : make[2]: Entering directory '/tmp/ruby/build/trunk/ext/fiddle'
I, [2024-05-04T03:33:28.045912 #942863]  INFO -- : make[2]: Leaving directory '/tmp/ruby/build/trunk/ext/fiddle'
I, [2024-05-04T03:33:28.048838 #942863]  INFO -- : make[2]: Entering directory '/tmp/ruby/build/trunk/ext/io/console'
I, [2024-05-04T03:33:28.051438 #942863]  INFO -- : make[2]: Leaving directory '/tmp/ruby/build/trunk/ext/io/console'
I, [2024-05-04T03:33:28.059079 #942863]  INFO -- : make[2]: Entering directory '/tmp/ruby/build/trunk/ext/json'
I, [2024-05-04T03:33:28.065434 #942863]  INFO -- : make[2]: Leaving directory '/tmp/ruby/build/trunk/ext/json'
I, [2024-05-04T03:33:28.074293 #942863]  INFO -- : make[2]: Entering directory '/tmp/ruby/build/trunk/ext/monitor'
I, [2024-05-04T03:33:28.076769 #942863]  INFO -- : make[2]: Leaving directory '/tmp/ruby/build/trunk/ext/monitor'
I, [2024-05-04T03:33:28.080933 #942863]  INFO -- : make[2]: Entering directory '/tmp/ruby/build/trunk/ext/objspace'
I, [2024-05-04T03:33:28.084656 #942863]  INFO -- : make[2]: Leaving directory '/tmp/ruby/build/trunk/ext/objspace'
I, [2024-05-04T03:33:28.096625 #942863]  INFO -- : make[2]: Entering directory '/tmp/ruby/build/trunk/ext/openssl'
I, [2024-05-04T03:33:28.109683 #942863]  INFO -- : make[2]: Leaving directory '/tmp/ruby/build/trunk/ext/openssl'
I, [2024-05-04T03:33:28.112475 #942863]  INFO -- : make[2]: Entering directory '/tmp/ruby/build/trunk/ext/pathname'
I, [2024-05-04T03:33:28.114958 #942863]  INFO -- : make[2]: Leaving directory '/tmp/ruby/build/trunk/ext/pathname'
I, [2024-05-04T03:33:28.119177 #942863]  INFO -- : make[2]: Entering directory '/tmp/ruby/build/trunk/ext/psych'
I, [2024-05-04T03:33:28.133998 #942863]  INFO -- : make[2]: Leaving directory '/tmp/ruby/build/trunk/ext/psych'
I, [2024-05-04T03:33:28.136997 #942863]  INFO -- : make[2]: Entering directory '/tmp/ruby/build/trunk/ext/pty'
I, [2024-05-04T03:33:28.139495 #942863]  INFO -- : make[2]: Leaving directory '/tmp/ruby/build/trunk/ext/pty'
I, [2024-05-04T03:33:28.148908 #942863]  INFO -- : make[2]: Entering directory '/tmp/ruby/build/trunk/ext/ripper'
I, [2024-05-04T03:33:28.153756 #942863]  INFO -- : make[2]: Leaving directory '/tmp/ruby/build/trunk/ext/ripper'
I, [2024-05-04T03:33:28.155230 #942863]  INFO -- : make[2]: Entering directory '/tmp/ruby/build/trunk/ext/rubyvm'
I, [2024-05-04T03:33:28.157245 #942863]  INFO -- : make[2]: Leaving directory '/tmp/ruby/build/trunk/ext/rubyvm'
I, [2024-05-04T03:33:28.165030 #942863]  INFO -- : make[2]: Entering directory '/tmp/ruby/build/trunk/ext/socket'
I, [2024-05-04T03:33:28.171410 #942863]  INFO -- : make[2]: Leaving directory '/tmp/ruby/build/trunk/ext/socket'
I, [2024-05-04T03:33:28.182311 #942863]  INFO -- : make[2]: Entering directory '/tmp/ruby/build/trunk/.bundle/gems/bigdecimal-3.1.7/ext/bigdecimal'
I, [2024-05-04T03:33:28.205070 #942863]  INFO -- : make[2]: Leaving directory '/tmp/ruby/build/trunk/.bundle/gems/bigdecimal-3.1.7/ext/bigdecimal'
I, [2024-05-04T03:33:28.207250 #942863]  INFO -- : make[2]: Entering directory '/tmp/ruby/build/trunk/.bundle/gems/debug-1.9.2/ext/debug'
I, [2024-05-04T03:33:28.229205 #942863]  INFO -- : make[2]: Leaving directory '/tmp/ruby/build/trunk/.bundle/gems/debug-1.9.2/ext/debug'
I, [2024-05-04T03:33:28.231052 #942863]  INFO -- : make[2]: Entering directory '/tmp/ruby/build/trunk/.bundle/gems/nkf-0.2.0/ext/nkf'
I, [2024-05-04T03:33:28.253378 #942863]  INFO -- : make[2]: Leaving directory '/tmp/ruby/build/trunk/.bundle/gems/nkf-0.2.0/ext/nkf'
I, [2024-05-04T03:33:28.255354 #942863]  INFO -- : make[2]: Entering directory '/tmp/ruby/build/trunk/.bundle/gems/racc-1.7.3/ext/racc/cparse'
I, [2024-05-04T03:33:28.277227 #942863]  INFO -- : make[2]: Leaving directory '/tmp/ruby/build/trunk/.bundle/gems/racc-1.7.3/ext/racc/cparse'
I, [2024-05-04T03:33:28.279462 #942863]  INFO -- : make[2]: Entering directory '/tmp/ruby/build/trunk/.bundle/gems/rbs-3.4.4/ext/rbs_extension'
I, [2024-05-04T03:33:28.301228 #942863]  INFO -- : make[2]: Leaving directory '/tmp/ruby/build/trunk/.bundle/gems/rbs-3.4.4/ext/rbs_extension'
I, [2024-05-04T03:33:28.303259 #942863]  INFO -- : make[2]: Entering directory '/tmp/ruby/build/trunk/.bundle/gems/syslog-0.1.2/ext/syslog'
I, [2024-05-04T03:33:28.325045 #942863]  INFO -- : make[2]: Leaving directory '/tmp/ruby/build/trunk/.bundle/gems/syslog-0.1.2/ext/syslog'
I, [2024-05-04T03:33:28.348258 #942863]  INFO -- : make[2]: Entering directory '/tmp/ruby/build/trunk'
I, [2024-05-04T03:33:28.413111 #942863]  INFO -- : make[2]: 'ruby' is up to date.
I, [2024-05-04T03:33:28.413151 #942863]  INFO -- : make[2]: Leaving directory '/tmp/ruby/build/trunk'
I, [2024-05-04T03:33:28.413282 #942863]  INFO -- : make[1]: Leaving directory '/tmp/ruby/build/trunk'
I, [2024-05-04T03:33:28.417179 #942863]  INFO -- : make[1]: Entering directory '/tmp/ruby/build/trunk'
I, [2024-05-04T03:33:28.417201 #942863]  INFO -- : make[1]: Nothing to be done for 'note'.
I, [2024-05-04T03:33:28.417206 #942863]  INFO -- : make[1]: Leaving directory '/tmp/ruby/build/trunk'
E, [2024-05-04T03:33:28.474538 #942863] ERROR -- : $ /tmp/ruby/build/trunk/miniruby -I/tmp/ruby/src/trunk/lib /tmp/ruby/src/trunk/tool/runruby.rb --archdir=/tmp/ruby/build/trunk --extout=.ext -- /tmp/ruby/src/trunk/spec/mspec/bin/mspec-run -B /tmp/ruby/src/trunk/spec/default.mspec --error-output stderr --debug -fy -o /tmp/rubytest.fq0400/1-mspec-multi-0
E, [2024-05-04T03:33:28.474722 #942863] ERROR -- : $ /tmp/ruby/build/trunk/miniruby -I/tmp/ruby/src/trunk/lib /tmp/ruby/src/trunk/tool/runruby.rb --archdir=/tmp/ruby/build/trunk --extout=.ext -- /tmp/ruby/src/trunk/spec/mspec/bin/mspec-run -B /tmp/ruby/src/trunk/spec/default.mspec --error-output stderr --debug -fy -o /tmp/rubytest.fq0400/2-mspec-multi-1
E, [2024-05-04T03:33:28.475043 #942863] ERROR -- : $ /tmp/ruby/build/trunk/miniruby -I/tmp/ruby/src/trunk/lib /tmp/ruby/src/trunk/tool/runruby.rb --archdir=/tmp/ruby/build/trunk --extout=.ext -- /tmp/ruby/src/trunk/spec/mspec/bin/mspec-run -B /tmp/ruby/src/trunk/spec/default.mspec --error-output stderr --debug -fy -o /tmp/rubytest.fq0400/3-mspec-multi-2
E, [2024-05-04T03:33:28.475336 #942863] ERROR -- : $ /tmp/ruby/build/trunk/miniruby -I/tmp/ruby/src/trunk/lib /tmp/ruby/src/trunk/tool/runruby.rb --archdir=/tmp/ruby/build/trunk --extout=.ext -- /tmp/ruby/src/trunk/spec/mspec/bin/mspec-run -B /tmp/ruby/src/trunk/spec/default.mspec --error-output stderr --debug -fy -o /tmp/rubytest.fq0400/4-mspec-multi-3
E, [2024-05-04T03:33:28.475580 #942863] ERROR -- : $ /tmp/ruby/build/trunk/miniruby -I/tmp/ruby/src/trunk/lib /tmp/ruby/src/trunk/tool/runruby.rb --archdir=/tmp/ruby/build/trunk --extout=.ext -- /tmp/ruby/src/trunk/spec/mspec/bin/mspec-run -B /tmp/ruby/src/trunk/spec/default.mspec --error-output stderr --debug -fy -o /tmp/rubytest.fq0400/5-mspec-multi-4
E, [2024-05-04T03:33:28.475673 #942863] ERROR -- : $ /tmp/ruby/build/trunk/miniruby -I/tmp/ruby/src/trunk/lib /tmp/ruby/src/trunk/tool/runruby.rb --archdir=/tmp/ruby/build/trunk --extout=.ext -- /tmp/ruby/src/trunk/spec/mspec/bin/mspec-run -B /tmp/ruby/src/trunk/spec/default.mspec --error-output stderr --debug -fy -o /tmp/rubytest.fq0400/6-mspec-multi-5
E, [2024-05-04T03:33:28.475859 #942863] ERROR -- : $ /tmp/ruby/build/trunk/miniruby -I/tmp/ruby/src/trunk/lib /tmp/ruby/src/trunk/tool/runruby.rb --archdir=/tmp/ruby/build/trunk --extout=.ext -- /tmp/ruby/src/trunk/spec/mspec/bin/mspec-run -B /tmp/ruby/src/trunk/spec/default.mspec --error-output stderr --debug -fy -o /tmp/rubytest.fq0400/7-mspec-multi-6
E, [2024-05-04T03:33:28.476040 #942863] ERROR -- : $ /tmp/ruby/build/trunk/miniruby -I/tmp/ruby/src/trunk/lib /tmp/ruby/src/trunk/tool/runruby.rb --archdir=/tmp/ruby/build/trunk --extout=.ext -- /tmp/ruby/src/trunk/spec/mspec/bin/mspec-run -B /tmp/ruby/src/trunk/spec/default.mspec --error-output stderr --debug -fy -o /tmp/rubytest.fq0400/8-mspec-multi-7
E, [2024-05-04T03:33:28.476431 #942863] ERROR -- : $ /tmp/ruby/build/trunk/miniruby -I/tmp/ruby/src/trunk/lib /tmp/ruby/src/trunk/tool/runruby.rb --archdir=/tmp/ruby/build/trunk --extout=.ext -- /tmp/ruby/src/trunk/spec/mspec/bin/mspec-run -B /tmp/ruby/src/trunk/spec/default.mspec --error-output stderr --debug -fy -o /tmp/rubytest.fq0400/9-mspec-multi-8
E, [2024-05-04T03:33:28.476593 #942863] ERROR -- : $ /tmp/ruby/build/trunk/miniruby -I/tmp/ruby/src/trunk/lib /tmp/ruby/src/trunk/tool/runruby.rb --archdir=/tmp/ruby/build/trunk --extout=.ext -- /tmp/ruby/src/trunk/spec/mspec/bin/mspec-run -B /tmp/ruby/src/trunk/spec/default.mspec --error-output stderr --debug -fy -o /tmp/rubytest.fq0400/10-mspec-multi-9
E, [2024-05-04T03:33:28.476796 #942863] ERROR -- : $ /tmp/ruby/build/trunk/miniruby -I/tmp/ruby/src/trunk/lib /tmp/ruby/src/trunk/tool/runruby.rb --archdir=/tmp/ruby/build/trunk --extout=.ext -- /tmp/ruby/src/trunk/spec/mspec/bin/mspec-run -B /tmp/ruby/src/trunk/spec/default.mspec --error-output stderr --debug -fy -o /tmp/rubytest.fq0400/11-mspec-multi-10
E, [2024-05-04T03:33:28.477117 #942863] ERROR -- : $ /tmp/ruby/build/trunk/miniruby -I/tmp/ruby/src/trunk/lib /tmp/ruby/src/trunk/tool/runruby.rb --archdir=/tmp/ruby/build/trunk --extout=.ext -- /tmp/ruby/src/trunk/spec/mspec/bin/mspec-run -B /tmp/ruby/src/trunk/spec/default.mspec --error-output stderr --debug -fy -o /tmp/rubytest.fq0400/12-mspec-multi-11
E, [2024-05-04T03:33:28.477301 #942863] ERROR -- : $ /tmp/ruby/build/trunk/miniruby -I/tmp/ruby/src/trunk/lib /tmp/ruby/src/trunk/tool/runruby.rb --archdir=/tmp/ruby/build/trunk --extout=.ext -- /tmp/ruby/src/trunk/spec/mspec/bin/mspec-run -B /tmp/ruby/src/trunk/spec/default.mspec --error-output stderr --debug -fy -o /tmp/rubytest.fq0400/13-mspec-multi-12
E, [2024-05-04T03:33:28.477491 #942863] ERROR -- : $ /tmp/ruby/build/trunk/miniruby -I/tmp/ruby/src/trunk/lib /tmp/ruby/src/trunk/tool/runruby.rb --archdir=/tmp/ruby/build/trunk --extout=.ext -- /tmp/ruby/src/trunk/spec/mspec/bin/mspec-run -B /tmp/ruby/src/trunk/spec/default.mspec --error-output stderr --debug -fy -o /tmp/rubytest.fq0400/14-mspec-multi-13
E, [2024-05-04T03:33:28.477706 #942863] ERROR -- : $ /tmp/ruby/build/trunk/miniruby -I/tmp/ruby/src/trunk/lib /tmp/ruby/src/trunk/tool/runruby.rb --archdir=/tmp/ruby/build/trunk --extout=.ext -- /tmp/ruby/src/trunk/spec/mspec/bin/mspec-run -B /tmp/ruby/src/trunk/spec/default.mspec --error-output stderr --debug -fy -o /tmp/rubytest.fq0400/15-mspec-multi-14
E, [2024-05-04T03:33:28.477835 #942863] ERROR -- : $ /tmp/ruby/build/trunk/miniruby -I/tmp/ruby/src/trunk/lib /tmp/ruby/src/trunk/tool/runruby.rb --archdir=/tmp/ruby/build/trunk --extout=.ext -- /tmp/ruby/src/trunk/spec/mspec/bin/mspec-run -B /tmp/ruby/src/trunk/spec/default.mspec --error-output stderr --debug -fy -o /tmp/rubytest.fq0400/16-mspec-multi-15
E, [2024-05-04T03:33:28.477996 #942863] ERROR -- : $ /tmp/ruby/build/trunk/miniruby -I/tmp/ruby/src/trunk/lib /tmp/ruby/src/trunk/tool/runruby.rb --archdir=/tmp/ruby/build/trunk --extout=.ext -- /tmp/ruby/src/trunk/spec/mspec/bin/mspec-run -B /tmp/ruby/src/trunk/spec/default.mspec --error-output stderr --debug -fy -o /tmp/rubytest.fq0400/17-mspec-multi-16
E, [2024-05-04T03:33:28.480342 #942863] ERROR -- : $ /tmp/ruby/build/trunk/miniruby -I/tmp/ruby/src/trunk/lib /tmp/ruby/src/trunk/tool/runruby.rb --archdir=/tmp/ruby/build/trunk --extout=.ext -- /tmp/ruby/src/trunk/spec/mspec/bin/mspec-run -B /tmp/ruby/src/trunk/spec/default.mspec --error-output stderr --debug -fy -o /tmp/rubytest.fq0400/18-mspec-multi-17
E, [2024-05-04T03:33:28.480856 #942863] ERROR -- : $ /tmp/ruby/build/trunk/miniruby -I/tmp/ruby/src/trunk/lib /tmp/ruby/src/trunk/tool/runruby.rb --archdir=/tmp/ruby/build/trunk --extout=.ext -- /tmp/ruby/src/trunk/spec/mspec/bin/mspec-run -B /tmp/ruby/src/trunk/spec/default.mspec --error-output stderr --debug -fy -o /tmp/rubytest.fq0400/19-mspec-multi-18
E, [2024-05-04T03:33:28.481278 #942863] ERROR -- : $ /tmp/ruby/build/trunk/miniruby -I/tmp/ruby/src/trunk/lib /tmp/ruby/src/trunk/tool/runruby.rb --archdir=/tmp/ruby/build/trunk --extout=.ext -- /tmp/ruby/src/trunk/spec/mspec/bin/mspec-run -B /tmp/ruby/src/trunk/spec/default.mspec --error-output stderr --debug -fy -o /tmp/rubytest.fq0400/20-mspec-multi-19
I, [2024-05-04T03:33:28.676092 #942863]  INFO -- : ruby 3.4.0dev (2024-05-04T03:22:17Z master fb2ea7084f) [x86_64-linux]
I, [2024-05-04T03:33:29.325976 #942863]  INFO -- :      0 .........................................................................
I, [2024-05-04T03:33:29.752290 #942863]  INFO -- :     73 .........................................................................
I, [2024-05-04T03:33:29.906667 #942863]  INFO -- :    146 .........................................................................
I, [2024-05-04T03:33:29.964914 #942863]  INFO -- :    219 .........................................................................
I, [2024-05-04T03:33:30.017219 #942863]  INFO -- :    292 .........................................................................
I, [2024-05-04T03:33:30.060004 #942863]  INFO -- :    365 .........................................................................
I, [2024-05-04T03:33:30.080838 #942863]  INFO -- :    438 .........................................................................
I, [2024-05-04T03:33:30.098777 #942863]  INFO -- :    511 .........................................................................
I, [2024-05-04T03:33:30.115491 #942863]  INFO -- :    584 .........................................................................
I, [2024-05-04T03:33:30.166841 #942863]  INFO -- :    657 .........................................................................
I, [2024-05-04T03:33:30.193890 #942863]  INFO -- :    730 .........................................................................
I, [2024-05-04T03:33:30.218886 #942863]  INFO -- :    803 .........................................................................
I, [2024-05-04T03:33:30.259944 #942863]  INFO -- :    876 .........................................................................
I, [2024-05-04T03:33:30.309411 #942863]  INFO -- :    949 .........................................................................
I, [2024-05-04T03:33:30.390117 #942863]  INFO -- :   1022 .........................................................................
I, [2024-05-04T03:33:30.566600 #942863]  INFO -- :   1095 .........................................................................
I, [2024-05-04T03:33:30.683204 #942863]  INFO -- :   1168 .........................................................................
I, [2024-05-04T03:33:30.748006 #942863]  INFO -- :   1241 .........................................................................
I, [2024-05-04T03:33:30.794384 #942863]  INFO -- :   1314 .........................................................................
I, [2024-05-04T03:33:30.817993 #942863]  INFO -- :   1387 .........................................................................
I, [2024-05-04T03:33:30.930855 #942863]  INFO -- :   1460 .........................................................................
I, [2024-05-04T03:33:31.418663 #942863]  INFO -- :   1533 .........................................................................
I, [2024-05-04T03:33:31.479501 #942863]  INFO -- :   1606 .........................................................................
I, [2024-05-04T03:33:31.577508 #942863]  INFO -- :   1679 .........................................................................
I, [2024-05-04T03:33:31.713305 #942863]  INFO -- :   1752 .........................................................................
I, [2024-05-04T03:33:31.808910 #942863]  INFO -- :   1825 .........................................................................
I, [2024-05-04T03:33:31.908821 #942863]  INFO -- :   1898 .........................................................................
I, [2024-05-04T03:33:32.006282 #942863]  INFO -- :   1971 .........................................................................
I, [2024-05-04T03:33:32.080402 #942863]  INFO -- :   2044 .........................................................................
I, [2024-05-04T03:33:32.123667 #942863]  INFO -- :   2117 .........................................................................
I, [2024-05-04T03:33:32.142070 #942863]  INFO -- :   2190 .........................................................................
I, [2024-05-04T03:33:32.159718 #942863]  INFO -- :   2263 .........................................................................
I, [2024-05-04T03:33:32.172845 #942863]  INFO -- :   2336 .........................................................................
I, [2024-05-04T03:33:32.207566 #942863]  INFO -- :   2409 .........................................................................
I, [2024-05-04T03:33:32.323783 #942863]  INFO -- :   2482 .........................................................................
I, [2024-05-04T03:33:32.348010 #942863]  INFO -- :   2555 .........................................................................
I, [2024-05-04T03:33:32.475489 #942863]  INFO -- :   2628 .........................................................................
I, [2024-05-04T03:33:32.573636 #942863]  INFO -- :   2701 .........................................................................
I, [2024-05-04T03:33:32.603747 #942863]  INFO -- :   2774 .........................................................................
I, [2024-05-04T03:33:32.665039 #942863]  INFO -- :   2847 .........................................................................
I, [2024-05-04T03:33:32.701809 #942863]  INFO -- :   2920 .........................................................................
I, [2024-05-04T03:33:32.728098 #942863]  INFO -- :   2993 .........................................................................
I, [2024-05-04T03:33:32.753056 #942863]  INFO -- :   3066 .........................................................................
I, [2024-05-04T03:33:32.765481 #942863]  INFO -- :   3139 .........................................................................
I, [2024-05-04T03:33:32.772710 #942863]  INFO -- :   3212 .........................................................................
I, [2024-05-04T03:33:32.800606 #942863]  INFO -- :   3285 .........................................................................
I, [2024-05-04T03:33:36.760448 #942863]  INFO -- :   3358 ........................................................................
I, [2024-05-04T03:33:36.760511 #942863]  INFO -- : 
I, [2024-05-04T03:33:36.760526 #942863]  INFO -- : Finished in 8.285144 seconds
I, [2024-05-04T03:33:36.760540 #942863]  INFO -- : 
I, [2024-05-04T03:33:36.760552 #942863]  INFO -- : 3429 files, 32610 examples, 178203 expectations, 0 failures, 0 errors, 0 tagged
I, [2024-05-04T03:33:36.762540 #942863]  INFO -- : $$$[end] "make yes-test-rubyspec MSPECOPT='--error-output stderr --debug -j' TESTS='-j20'" exit with 0.