# Logfile created on 2024-05-03 21:42:09 +0000 by logger.rb/v1.4.3 I, [2024-05-03T21:42:09.521603 #2047952] INFO -- : #, @formatter=nil, @logdev=#, @binmode=false, @mon_data=#, @mon_data_owner_object_id=860>>> I, [2024-05-03T21:42:09.521724 #2047952] INFO -- : $$$[beg] make update-unicode -j20 I, [2024-05-03T21:42:09.580056 #2047952] INFO -- : Downloading Unicode emoji 15.0 files... I, [2024-05-03T21:42:09.580238 #2047952] INFO -- : Downloading Unicode emoji 15.0 files... I, [2024-05-03T21:42:09.580972 #2047952] INFO -- : Downloading Unicode emoji 15.0 files... I, [2024-05-03T21:42:09.621813 #2047952] INFO -- : made symlink emoji/15.0/emoji-sequences.txt to /tmp/ruby/src/trunk/.downloaded-cache/emoji/15.0/emoji-sequences.txt I, [2024-05-03T21:42:09.621869 #2047952] INFO -- : /tmp/ruby/src/trunk/enc/unicode/data/emoji/15.0/emoji-sequences.txt already exists I, [2024-05-03T21:42:09.622731 #2047952] INFO -- : downloading emoji/15.0/emoji-test.txt ... downloading emoji/15.0/emoji-test.txt ... /tmp/ruby/src/trunk/enc/unicode/data/emoji/15.0/emoji-sequences.txt already exists E, [2024-05-03T21:42:10.056263 #2047952] ERROR -- : /tmp/ruby/src/trunk/tool/downloader.rb:302:in `rescue in download': failed to download emoji/15.0/emoji-test.txt (RuntimeError) E, [2024-05-03T21:42:10.056314 #2047952] ERROR -- : OpenURI::HTTPError: 403 Forbidden: https://www.unicode.org/Public/emoji/15.0/emoji-test.txt E, [2024-05-03T21:42:10.056320 #2047952] ERROR -- : from /tmp/ruby/src/trunk/tool/downloader.rb:201:in `download' E, [2024-05-03T21:42:10.056324 #2047952] ERROR -- : from /tmp/ruby/src/trunk/tool/downloader.rb:136:in `download' E, [2024-05-03T21:42:10.056328 #2047952] ERROR -- : from /tmp/ruby/src/trunk/tool/downloader.rb:482:in `block in
' E, [2024-05-03T21:42:10.056332 #2047952] ERROR -- : from /tmp/ruby/src/trunk/tool/downloader.rb:465:in `each' E, [2024-05-03T21:42:10.056335 #2047952] ERROR -- : from /tmp/ruby/src/trunk/tool/downloader.rb:465:in `
' E, [2024-05-03T21:42:10.056339 #2047952] ERROR -- : /usr/lib/ruby/3.0.0/open-uri.rb:364:in `open_http': 403 Forbidden (OpenURI::HTTPError) E, [2024-05-03T21:42:10.056342 #2047952] ERROR -- : from /usr/lib/ruby/3.0.0/open-uri.rb:741:in `buffer_open' E, [2024-05-03T21:42:10.056347 #2047952] ERROR -- : from /usr/lib/ruby/3.0.0/open-uri.rb:212:in `block in open_loop' E, [2024-05-03T21:42:10.056350 #2047952] ERROR -- : from /usr/lib/ruby/3.0.0/open-uri.rb:210:in `catch' E, [2024-05-03T21:42:10.056354 #2047952] ERROR -- : from /usr/lib/ruby/3.0.0/open-uri.rb:210:in `open_loop' E, [2024-05-03T21:42:10.056357 #2047952] ERROR -- : from /usr/lib/ruby/3.0.0/open-uri.rb:151:in `open_uri' E, [2024-05-03T21:42:10.056360 #2047952] ERROR -- : from /usr/lib/ruby/3.0.0/open-uri.rb:721:in `open' E, [2024-05-03T21:42:10.056364 #2047952] ERROR -- : from /usr/lib/ruby/3.0.0/open-uri.rb:729:in `read' E, [2024-05-03T21:42:10.056375 #2047952] ERROR -- : from /tmp/ruby/src/trunk/tool/downloader.rb:247:in `block in download' E, [2024-05-03T21:42:10.056379 #2047952] ERROR -- : from /tmp/ruby/src/trunk/tool/downloader.rb:378:in `with_retry' E, [2024-05-03T21:42:10.056382 #2047952] ERROR -- : from /tmp/ruby/src/trunk/tool/downloader.rb:246:in `download' E, [2024-05-03T21:42:10.056387 #2047952] ERROR -- : from /tmp/ruby/src/trunk/tool/downloader.rb:136:in `download' E, [2024-05-03T21:42:10.056390 #2047952] ERROR -- : from /tmp/ruby/src/trunk/tool/downloader.rb:482:in `block in
' E, [2024-05-03T21:42:10.056393 #2047952] ERROR -- : from /tmp/ruby/src/trunk/tool/downloader.rb:465:in `each' E, [2024-05-03T21:42:10.056397 #2047952] ERROR -- : from /tmp/ruby/src/trunk/tool/downloader.rb:465:in `
' E, [2024-05-03T21:42:10.056811 #2047952] ERROR -- : /tmp/ruby/src/trunk/tool/downloader.rb:302:in `rescue in download': failed to download emoji/15.0/emoji-test.txt (RuntimeError) E, [2024-05-03T21:42:10.056832 #2047952] ERROR -- : OpenURI::HTTPError: 403 Forbidden: https://www.unicode.org/Public/emoji/15.0/emoji-test.txt E, [2024-05-03T21:42:10.056837 #2047952] ERROR -- : from /tmp/ruby/src/trunk/tool/downloader.rb:201:in `download' E, [2024-05-03T21:42:10.056845 #2047952] ERROR -- : from /tmp/ruby/src/trunk/tool/downloader.rb:136:in `download' E, [2024-05-03T21:42:10.056848 #2047952] ERROR -- : from /tmp/ruby/src/trunk/tool/downloader.rb:482:in `block in
' E, [2024-05-03T21:42:10.056852 #2047952] ERROR -- : from /tmp/ruby/src/trunk/tool/downloader.rb:465:in `each' E, [2024-05-03T21:42:10.056855 #2047952] ERROR -- : from /tmp/ruby/src/trunk/tool/downloader.rb:465:in `
' E, [2024-05-03T21:42:10.056858 #2047952] ERROR -- : /usr/lib/ruby/3.0.0/open-uri.rb:364:in `open_http': 403 Forbidden (OpenURI::HTTPError) E, [2024-05-03T21:42:10.056862 #2047952] ERROR -- : from /usr/lib/ruby/3.0.0/open-uri.rb:741:in `buffer_open' E, [2024-05-03T21:42:10.056865 #2047952] ERROR -- : from /usr/lib/ruby/3.0.0/open-uri.rb:212:in `block in open_loop' E, [2024-05-03T21:42:10.056869 #2047952] ERROR -- : from /usr/lib/ruby/3.0.0/open-uri.rb:210:in `catch' E, [2024-05-03T21:42:10.056874 #2047952] ERROR -- : from /usr/lib/ruby/3.0.0/open-uri.rb:210:in `open_loop' E, [2024-05-03T21:42:10.056877 #2047952] ERROR -- : from /usr/lib/ruby/3.0.0/open-uri.rb:151:in `open_uri' E, [2024-05-03T21:42:10.056881 #2047952] ERROR -- : from /usr/lib/ruby/3.0.0/open-uri.rb:721:in `open' E, [2024-05-03T21:42:10.056884 #2047952] ERROR -- : from /usr/lib/ruby/3.0.0/open-uri.rb:729:in `read' E, [2024-05-03T21:42:10.056887 #2047952] ERROR -- : from /tmp/ruby/src/trunk/tool/downloader.rb:247:in `block in download' E, [2024-05-03T21:42:10.056891 #2047952] ERROR -- : from /tmp/ruby/src/trunk/tool/downloader.rb:378:in `with_retry' E, [2024-05-03T21:42:10.056894 #2047952] ERROR -- : from /tmp/ruby/src/trunk/tool/downloader.rb:246:in `download' E, [2024-05-03T21:42:10.056897 #2047952] ERROR -- : from /tmp/ruby/src/trunk/tool/downloader.rb:136:in `download' E, [2024-05-03T21:42:10.056901 #2047952] ERROR -- : from /tmp/ruby/src/trunk/tool/downloader.rb:482:in `block in
' E, [2024-05-03T21:42:10.056906 #2047952] ERROR -- : from /tmp/ruby/src/trunk/tool/downloader.rb:465:in `each' E, [2024-05-03T21:42:10.056909 #2047952] ERROR -- : from /tmp/ruby/src/trunk/tool/downloader.rb:465:in `
' E, [2024-05-03T21:42:10.058375 #2047952] ERROR -- : make: *** [uncommon.mk:1787: /tmp/ruby/src/trunk/enc/unicode/data/emoji/15.0/emoji-test.txt] Error 1 E, [2024-05-03T21:42:10.058396 #2047952] ERROR -- : make: *** Waiting for unfinished jobs.... E, [2024-05-03T21:42:10.058617 #2047952] ERROR -- : make: *** [uncommon.mk:1787: /tmp/ruby/src/trunk/enc/unicode/data/emoji/15.0/emoji-zwj-sequences.txt] Error 1 E, [2024-05-03T21:42:10.101954 #2047952] ERROR -- : /tmp/ruby/src/trunk/tool/downloader.rb:302:in `rescue in download': failed to download emoji/15.0/emoji-test.txt (RuntimeError) E, [2024-05-03T21:42:10.101980 #2047952] ERROR -- : OpenURI::HTTPError: 403 Forbidden: https://www.unicode.org/Public/emoji/15.0/emoji-test.txt E, [2024-05-03T21:42:10.101990 #2047952] ERROR -- : from /tmp/ruby/src/trunk/tool/downloader.rb:201:in `download' E, [2024-05-03T21:42:10.101994 #2047952] ERROR -- : from /tmp/ruby/src/trunk/tool/downloader.rb:136:in `download' E, [2024-05-03T21:42:10.101998 #2047952] ERROR -- : from /tmp/ruby/src/trunk/tool/downloader.rb:482:in `block in
' E, [2024-05-03T21:42:10.102002 #2047952] ERROR -- : from /tmp/ruby/src/trunk/tool/downloader.rb:465:in `each' E, [2024-05-03T21:42:10.102005 #2047952] ERROR -- : from /tmp/ruby/src/trunk/tool/downloader.rb:465:in `
' E, [2024-05-03T21:42:10.102009 #2047952] ERROR -- : /usr/lib/ruby/3.0.0/open-uri.rb:364:in `open_http': 403 Forbidden (OpenURI::HTTPError) E, [2024-05-03T21:42:10.102014 #2047952] ERROR -- : from /usr/lib/ruby/3.0.0/open-uri.rb:741:in `buffer_open' E, [2024-05-03T21:42:10.102019 #2047952] ERROR -- : from /usr/lib/ruby/3.0.0/open-uri.rb:212:in `block in open_loop' E, [2024-05-03T21:42:10.102023 #2047952] ERROR -- : from /usr/lib/ruby/3.0.0/open-uri.rb:210:in `catch' E, [2024-05-03T21:42:10.102026 #2047952] ERROR -- : from /usr/lib/ruby/3.0.0/open-uri.rb:210:in `open_loop' E, [2024-05-03T21:42:10.102029 #2047952] ERROR -- : from /usr/lib/ruby/3.0.0/open-uri.rb:151:in `open_uri' E, [2024-05-03T21:42:10.102033 #2047952] ERROR -- : from /usr/lib/ruby/3.0.0/open-uri.rb:721:in `open' E, [2024-05-03T21:42:10.102118 #2047952] ERROR -- : from /usr/lib/ruby/3.0.0/open-uri.rb:729:in `read' E, [2024-05-03T21:42:10.102123 #2047952] ERROR -- : from /tmp/ruby/src/trunk/tool/downloader.rb:247:in `block in download' E, [2024-05-03T21:42:10.102127 #2047952] ERROR -- : from /tmp/ruby/src/trunk/tool/downloader.rb:378:in `with_retry' E, [2024-05-03T21:42:10.102131 #2047952] ERROR -- : from /tmp/ruby/src/trunk/tool/downloader.rb:246:in `download' E, [2024-05-03T21:42:10.102134 #2047952] ERROR -- : from /tmp/ruby/src/trunk/tool/downloader.rb:136:in `download' E, [2024-05-03T21:42:10.102138 #2047952] ERROR -- : from /tmp/ruby/src/trunk/tool/downloader.rb:482:in `block in
' E, [2024-05-03T21:42:10.102142 #2047952] ERROR -- : from /tmp/ruby/src/trunk/tool/downloader.rb:465:in `each' E, [2024-05-03T21:42:10.102145 #2047952] ERROR -- : from /tmp/ruby/src/trunk/tool/downloader.rb:465:in `
' E, [2024-05-03T21:42:10.104004 #2047952] ERROR -- : make: *** [uncommon.mk:1787: /tmp/ruby/src/trunk/enc/unicode/data/emoji/15.0/emoji-sequences.txt] Error 1 E, [2024-05-03T21:42:10.104040 #2047952] ERROR -- : make: *** Deleting file '/tmp/ruby/src/trunk/enc/unicode/data/emoji/15.0/emoji-sequences.txt' I, [2024-05-03T21:42:10.104153 #2047952] INFO -- : downloading emoji/15.0/emoji-test.txt ... I, [2024-05-03T21:42:10.104421 #2047952] INFO -- : $$$[end] "make update-unicode -j20" exit with 512. I, [2024-05-03T21:42:10.104450 #2047952] INFO -- : $$$[beg] make update-download -j20 I, [2024-05-03T21:42:10.202961 #2047952] INFO -- : tool/config.guess already exists I, [2024-05-03T21:42:10.203017 #2047952] INFO -- : tool/config.sub already exists I, [2024-05-03T21:42:10.205327 #2047952] INFO -- : Update minitest to ea9caafc0754b1d6236a490d59e624b53209734a I, [2024-05-03T21:42:10.205724 #2047952] INFO -- : Update power_assert to 84e85124c5014a139af39161d484156cfe87a9ed I, [2024-05-03T21:42:10.206449 #2047952] INFO -- : Update rbs to ba7872795d5de04adb8ff500c0e6afdc81a041dd I, [2024-05-03T21:42:10.206692 #2047952] INFO -- : Update typeprof to b19a6416da3a05d57fadd6ffdadb382b6d236ca5 I, [2024-05-03T21:42:10.206969 #2047952] INFO -- : echo 84e85124c5014a139af39161d484156cfe87a9ed | /bin/sh /tmp/ruby/src/trunk/tool/ifchange /tmp/ruby/src/trunk/.bundle/.timestamp/power_assert.revision - I, [2024-05-03T21:42:10.207135 #2047952] INFO -- : echo ea9caafc0754b1d6236a490d59e624b53209734a | /bin/sh /tmp/ruby/src/trunk/tool/ifchange /tmp/ruby/src/trunk/.bundle/.timestamp/minitest.revision - I, [2024-05-03T21:42:10.207560 #2047952] INFO -- : echo ba7872795d5de04adb8ff500c0e6afdc81a041dd | /bin/sh /tmp/ruby/src/trunk/tool/ifchange /tmp/ruby/src/trunk/.bundle/.timestamp/rbs.revision - I, [2024-05-03T21:42:10.207920 #2047952] INFO -- : echo b19a6416da3a05d57fadd6ffdadb382b6d236ca5 | /bin/sh /tmp/ruby/src/trunk/tool/ifchange /tmp/ruby/src/trunk/.bundle/.timestamp/typeprof.revision - I, [2024-05-03T21:42:10.208944 #2047952] INFO -- : /tmp/ruby/src/trunk/.bundle/.timestamp/power_assert.revision unchanged I, [2024-05-03T21:42:10.209429 #2047952] INFO -- : /tmp/ruby/src/trunk/.bundle/.timestamp/minitest.revision unchanged I, [2024-05-03T21:42:10.209523 #2047952] INFO -- : /tmp/ruby/src/trunk/.bundle/.timestamp/typeprof.revision unchanged I, [2024-05-03T21:42:10.209577 #2047952] INFO -- : /tmp/ruby/src/trunk/.bundle/.timestamp/rbs.revision unchanged I, [2024-05-03T21:42:10.210030 #2047952] INFO -- : Building power_assert@84e85124c5014a139af39161d484156cfe87a9ed to /tmp/ruby/src/trunk/gems/power_assert-2.0.3.gem I, [2024-05-03T21:42:10.279179 #2047952] INFO -- : Successfully built RubyGem I, [2024-05-03T21:42:10.279226 #2047952] INFO -- : Name: power_assert I, [2024-05-03T21:42:10.279239 #2047952] INFO -- : Version: 2.0.4dev I, [2024-05-03T21:42:10.279244 #2047952] INFO -- : File: power_assert-2.0.4dev.gem I, [2024-05-03T21:42:10.324882 #2047952] INFO -- : $$$[end] "make update-download -j20" exit with 0. I, [2024-05-03T21:42:10.324919 #2047952] INFO -- : $$$[beg] make update-rubyspec -j20 I, [2024-05-03T21:42:10.381894 #2047952] INFO -- : make: Nothing to be done for 'update-rubyspec'. I, [2024-05-03T21:42:10.382249 #2047952] INFO -- : $$$[end] "make update-rubyspec -j20" exit with 0. I, [2024-05-03T21:42:10.382287 #2047952] INFO -- : $$$[beg] make update-src -j20 I, [2024-05-03T21:42:10.881035 #2047952] INFO -- : Already up to date. I, [2024-05-03T21:42:10.890806 #2047952] INFO -- : Latest commit hash = 70db150fbc I, [2024-05-03T21:42:10.892230 #2047952] INFO -- : $$$[end] "make update-src -j20" exit with 0. I, [2024-05-03T21:42:10.892399 #2047952] INFO -- : $$$[beg] make after-update -j20 I, [2024-05-03T21:42:10.965204 #2047952] INFO -- : generating /tmp/ruby/src/trunk/ext/ripper/eventids2table.c I, [2024-05-03T21:42:10.969421 #2047952] INFO -- : make[1]: Entering directory '/tmp/ruby/src/trunk/ext/ripper' I, [2024-05-03T21:42:10.969469 #2047952] INFO -- : make[1]: Nothing to be done for 'src'. I, [2024-05-03T21:42:10.969482 #2047952] INFO -- : make[1]: Leaving directory '/tmp/ruby/src/trunk/ext/ripper' I, [2024-05-03T21:42:10.986087 #2047952] INFO -- : /tmp/ruby/src/trunk/revision.h updated I, [2024-05-03T21:42:10.987415 #2047952] INFO -- : generating x86_64-linux-fake.rb I, [2024-05-03T21:42:11.038806 #2047952] INFO -- : x86_64-linux-fake.rb updated I, [2024-05-03T21:42:11.040168 #2047952] INFO -- : generating enc.mk I, [2024-05-03T21:42:11.158317 #2047952] INFO -- : making srcs under enc I, [2024-05-03T21:42:11.187927 #2047952] INFO -- : make[1]: Entering directory '/tmp/ruby/build/trunk' I, [2024-05-03T21:42:11.187990 #2047952] INFO -- : make[1]: Nothing to be done for 'srcs'. I, [2024-05-03T21:42:11.188003 #2047952] INFO -- : make[1]: Leaving directory '/tmp/ruby/build/trunk' I, [2024-05-03T21:42:11.233806 #2047952] INFO -- : Update minitest to ea9caafc0754b1d6236a490d59e624b53209734a I, [2024-05-03T21:42:11.233946 #2047952] INFO -- : Update power_assert to 84e85124c5014a139af39161d484156cfe87a9ed I, [2024-05-03T21:42:11.234859 #2047952] INFO -- : Update rbs to ba7872795d5de04adb8ff500c0e6afdc81a041dd I, [2024-05-03T21:42:11.235017 #2047952] INFO -- : Update typeprof to b19a6416da3a05d57fadd6ffdadb382b6d236ca5 I, [2024-05-03T21:42:11.235973 #2047952] INFO -- : echo ea9caafc0754b1d6236a490d59e624b53209734a | /bin/sh /tmp/ruby/src/trunk/tool/ifchange /tmp/ruby/src/trunk/.bundle/.timestamp/minitest.revision - I, [2024-05-03T21:42:11.236208 #2047952] INFO -- : echo 84e85124c5014a139af39161d484156cfe87a9ed | /bin/sh /tmp/ruby/src/trunk/tool/ifchange /tmp/ruby/src/trunk/.bundle/.timestamp/power_assert.revision - I, [2024-05-03T21:42:11.237436 #2047952] INFO -- : echo ba7872795d5de04adb8ff500c0e6afdc81a041dd | /bin/sh /tmp/ruby/src/trunk/tool/ifchange /tmp/ruby/src/trunk/.bundle/.timestamp/rbs.revision - I, [2024-05-03T21:42:11.237674 #2047952] INFO -- : echo b19a6416da3a05d57fadd6ffdadb382b6d236ca5 | /bin/sh /tmp/ruby/src/trunk/tool/ifchange /tmp/ruby/src/trunk/.bundle/.timestamp/typeprof.revision - I, [2024-05-03T21:42:11.238126 #2047952] INFO -- : /tmp/ruby/src/trunk/.bundle/.timestamp/minitest.revision unchanged I, [2024-05-03T21:42:11.238151 #2047952] INFO -- : /tmp/ruby/src/trunk/.bundle/.timestamp/power_assert.revision unchanged I, [2024-05-03T21:42:11.239065 #2047952] INFO -- : /tmp/ruby/src/trunk/.bundle/.timestamp/rbs.revision unchanged I, [2024-05-03T21:42:11.239249 #2047952] INFO -- : /tmp/ruby/src/trunk/.bundle/.timestamp/typeprof.revision unchanged I, [2024-05-03T21:42:11.239259 #2047952] INFO -- : Building power_assert@84e85124c5014a139af39161d484156cfe87a9ed to /tmp/ruby/src/trunk/gems/power_assert-2.0.3.gem I, [2024-05-03T21:42:11.308502 #2047952] INFO -- : Successfully built RubyGem I, [2024-05-03T21:42:11.308544 #2047952] INFO -- : Name: power_assert I, [2024-05-03T21:42:11.308554 #2047952] INFO -- : Version: 2.0.4dev I, [2024-05-03T21:42:11.308558 #2047952] INFO -- : File: power_assert-2.0.4dev.gem I, [2024-05-03T21:42:11.310891 #2047952] INFO -- : Extracting bundle gem power_assert-2.0.3... I, [2024-05-03T21:42:11.372012 #2047952] INFO -- : Try with hash version of bundled gems instead of gems/power_assert-2.0.3.gem. We don't use this gem with release version of Ruby. I, [2024-05-03T21:42:11.377015 #2047952] INFO -- : Unpacked gems/power_assert-2.0.4dev.gem I, [2024-05-03T21:42:11.379224 #2047952] INFO -- : $$$[end] "make after-update -j20" exit with 0. I, [2024-05-03T21:42:11.379434 #2047952] INFO -- : $$$[beg] make miniruby -j20 I, [2024-05-03T21:42:11.437361 #2047952] INFO -- : BASERUBY = /usr/bin/ruby --disable=gems I, [2024-05-03T21:42:11.437393 #2047952] INFO -- : CC = gcc I, [2024-05-03T21:42:11.437399 #2047952] INFO -- : LD = ld I, [2024-05-03T21:42:11.437403 #2047952] INFO -- : LDSHARED = gcc -shared I, [2024-05-03T21:42:11.437407 #2047952] INFO -- : CFLAGS = -O3 -fno-fast-math -ggdb3 -Wall -Wextra -Wdeprecated-declarations -Wdiv-by-zero -Wduplicated-cond -Wimplicit-function-declaration -Wimplicit-int -Wpointer-arith -Wwrite-strings -Wold-style-definition -Wimplicit-fallthrough=0 -Wmissing-noreturn -Wno-cast-function-type -Wno-constant-logical-operand -Wno-long-long -Wno-missing-field-initializers -Wno-overlength-strings -Wno-packed-bitfield-compat -Wno-parentheses-equality -Wno-self-assign -Wno-tautological-compare -Wno-unused-parameter -Wno-unused-value -Wsuggest-attribute=format -Wsuggest-attribute=noreturn -Wunused-variable -Wmisleading-indentation -Wundef -fPIC I, [2024-05-03T21:42:11.437412 #2047952] INFO -- : XCFLAGS = -U_FORTIFY_SOURCE -D_FORTIFY_SOURCE=2 -fstack-protector-strong -fno-strict-overflow -fvisibility=hidden -fexcess-precision=standard -DRUBY_EXPORT -I. -I.ext/include/x86_64-linux -I/tmp/ruby/src/trunk/include -I/tmp/ruby/src/trunk -I/tmp/ruby/src/trunk/prism -I/tmp/ruby/src/trunk/enc/unicode/15.0.0 I, [2024-05-03T21:42:11.437415 #2047952] INFO -- : CPPFLAGS = I, [2024-05-03T21:42:11.437419 #2047952] INFO -- : DLDFLAGS = -Wl,--compress-debug-sections=zlib -Wl,-soname,libruby.so.3.4 -fstack-protector-strong I, [2024-05-03T21:42:11.437423 #2047952] INFO -- : SOLIBS = -lz -lrt -lrt -lgmp -ldl -lcrypt -lm -lpthread I, [2024-05-03T21:42:11.437427 #2047952] INFO -- : LANG = en_US.UTF-8 I, [2024-05-03T21:42:11.437430 #2047952] INFO -- : LC_ALL = I, [2024-05-03T21:42:11.437434 #2047952] INFO -- : LC_CTYPE = I, [2024-05-03T21:42:11.437437 #2047952] INFO -- : MFLAGS = -j20 --jobserver-auth=4,5 I, [2024-05-03T21:42:11.437441 #2047952] INFO -- : RUSTC = no I, [2024-05-03T21:42:11.437444 #2047952] INFO -- : YJIT_RUSTC_ARGS = --crate-name=yjit --crate-type=staticlib --edition=2021 -g -C lto=thin -C opt-level=3 -C overflow-checks=on '--out-dir=/tmp/ruby/build/trunk/yjit/target/release/' /tmp/ruby/src/trunk/yjit/src/lib.rs I, [2024-05-03T21:42:11.438800 #2047952] INFO -- : gcc (Ubuntu 11.4.0-1ubuntu1~22.04) 11.4.0 I, [2024-05-03T21:42:11.438820 #2047952] INFO -- : Copyright (C) 2021 Free Software Foundation, Inc. I, [2024-05-03T21:42:11.438826 #2047952] INFO -- : This is free software; see the source for copying conditions. There is NO I, [2024-05-03T21:42:11.438830 #2047952] INFO -- : warranty; not even for MERCHANTABILITY or FITNESS FOR A PARTICULAR PURPOSE. I, [2024-05-03T21:42:11.438833 #2047952] INFO -- : I, [2024-05-03T21:42:11.459489 #2047952] INFO -- : compiling /tmp/ruby/src/trunk/version.c I, [2024-05-03T21:42:11.563816 #2047952] INFO -- : linking miniruby I, [2024-05-03T21:42:12.105289 #2047952] INFO -- : $$$[end] "make miniruby -j20" exit with 0. I, [2024-05-03T21:42:12.105437 #2047952] INFO -- : $$$[beg] make ruby -j20 I, [2024-05-03T21:42:12.164707 #2047952] INFO -- : BASERUBY = /usr/bin/ruby --disable=gems I, [2024-05-03T21:42:12.164745 #2047952] INFO -- : CC = gcc I, [2024-05-03T21:42:12.164751 #2047952] INFO -- : LD = ld I, [2024-05-03T21:42:12.164758 #2047952] INFO -- : LDSHARED = gcc -shared I, [2024-05-03T21:42:12.164763 #2047952] INFO -- : CFLAGS = -O3 -fno-fast-math -ggdb3 -Wall -Wextra -Wdeprecated-declarations -Wdiv-by-zero -Wduplicated-cond -Wimplicit-function-declaration -Wimplicit-int -Wpointer-arith -Wwrite-strings -Wold-style-definition -Wimplicit-fallthrough=0 -Wmissing-noreturn -Wno-cast-function-type -Wno-constant-logical-operand -Wno-long-long -Wno-missing-field-initializers -Wno-overlength-strings -Wno-packed-bitfield-compat -Wno-parentheses-equality -Wno-self-assign -Wno-tautological-compare -Wno-unused-parameter -Wno-unused-value -Wsuggest-attribute=format -Wsuggest-attribute=noreturn -Wunused-variable -Wmisleading-indentation -Wundef -fPIC I, [2024-05-03T21:42:12.164767 #2047952] INFO -- : XCFLAGS = -U_FORTIFY_SOURCE -D_FORTIFY_SOURCE=2 -fstack-protector-strong -fno-strict-overflow -fvisibility=hidden -fexcess-precision=standard -DRUBY_EXPORT -I. -I.ext/include/x86_64-linux -I/tmp/ruby/src/trunk/include -I/tmp/ruby/src/trunk -I/tmp/ruby/src/trunk/prism -I/tmp/ruby/src/trunk/enc/unicode/15.0.0 I, [2024-05-03T21:42:12.164771 #2047952] INFO -- : CPPFLAGS = I, [2024-05-03T21:42:12.164774 #2047952] INFO -- : DLDFLAGS = -Wl,--compress-debug-sections=zlib -Wl,-soname,libruby.so.3.4 -fstack-protector-strong I, [2024-05-03T21:42:12.164778 #2047952] INFO -- : SOLIBS = -lz -lrt -lrt -lgmp -ldl -lcrypt -lm -lpthread I, [2024-05-03T21:42:12.164782 #2047952] INFO -- : LANG = en_US.UTF-8 I, [2024-05-03T21:42:12.164785 #2047952] INFO -- : LC_ALL = I, [2024-05-03T21:42:12.164789 #2047952] INFO -- : LC_CTYPE = I, [2024-05-03T21:42:12.164792 #2047952] INFO -- : MFLAGS = -j20 --jobserver-auth=4,5 I, [2024-05-03T21:42:12.164796 #2047952] INFO -- : RUSTC = no I, [2024-05-03T21:42:12.164800 #2047952] INFO -- : YJIT_RUSTC_ARGS = --crate-name=yjit --crate-type=staticlib --edition=2021 -g -C lto=thin -C opt-level=3 -C overflow-checks=on '--out-dir=/tmp/ruby/build/trunk/yjit/target/release/' /tmp/ruby/src/trunk/yjit/src/lib.rs I, [2024-05-03T21:42:12.167070 #2047952] INFO -- : gcc (Ubuntu 11.4.0-1ubuntu1~22.04) 11.4.0 I, [2024-05-03T21:42:12.167090 #2047952] INFO -- : Copyright (C) 2021 Free Software Foundation, Inc. I, [2024-05-03T21:42:12.167096 #2047952] INFO -- : This is free software; see the source for copying conditions. There is NO I, [2024-05-03T21:42:12.167100 #2047952] INFO -- : warranty; not even for MERCHANTABILITY or FITNESS FOR A PARTICULAR PURPOSE. I, [2024-05-03T21:42:12.167103 #2047952] INFO -- : I, [2024-05-03T21:42:12.279925 #2047952] INFO -- : builtin_binary.inc updated I, [2024-05-03T21:42:12.284369 #2047952] INFO -- : c5234a9416e4f20f175185e840b25b0f08674d14078ed7083f37e655458e3ca9 builtin_binary.inc I, [2024-05-03T21:42:12.285062 #2047952] INFO -- : compiling /tmp/ruby/src/trunk/builtin.c I, [2024-05-03T21:42:12.469698 #2047952] INFO -- : linking static-library libruby-static.a I, [2024-05-03T21:42:12.784668 #2047952] INFO -- : linking shared-library libruby.so.3.4.0 I, [2024-05-03T21:42:14.358827 #2047952] INFO -- : linking ruby I, [2024-05-03T21:42:14.382018 #2047952] INFO -- : $$$[end] "make ruby -j20" exit with 0. I, [2024-05-03T21:42:14.382214 #2047952] INFO -- : $$$[beg] make all -j20 I, [2024-05-03T21:42:14.440103 #2047952] INFO -- : BASERUBY = /usr/bin/ruby --disable=gems I, [2024-05-03T21:42:14.440147 #2047952] INFO -- : CC = gcc I, [2024-05-03T21:42:14.440152 #2047952] INFO -- : LD = ld I, [2024-05-03T21:42:14.440156 #2047952] INFO -- : LDSHARED = gcc -shared I, [2024-05-03T21:42:14.440161 #2047952] INFO -- : CFLAGS = -O3 -fno-fast-math -ggdb3 -Wall -Wextra -Wdeprecated-declarations -Wdiv-by-zero -Wduplicated-cond -Wimplicit-function-declaration -Wimplicit-int -Wpointer-arith -Wwrite-strings -Wold-style-definition -Wimplicit-fallthrough=0 -Wmissing-noreturn -Wno-cast-function-type -Wno-constant-logical-operand -Wno-long-long -Wno-missing-field-initializers -Wno-overlength-strings -Wno-packed-bitfield-compat -Wno-parentheses-equality -Wno-self-assign -Wno-tautological-compare -Wno-unused-parameter -Wno-unused-value -Wsuggest-attribute=format -Wsuggest-attribute=noreturn -Wunused-variable -Wmisleading-indentation -Wundef -fPIC I, [2024-05-03T21:42:14.440166 #2047952] INFO -- : XCFLAGS = -U_FORTIFY_SOURCE -D_FORTIFY_SOURCE=2 -fstack-protector-strong -fno-strict-overflow -fvisibility=hidden -fexcess-precision=standard -DRUBY_EXPORT -I. -I.ext/include/x86_64-linux -I/tmp/ruby/src/trunk/include -I/tmp/ruby/src/trunk -I/tmp/ruby/src/trunk/prism -I/tmp/ruby/src/trunk/enc/unicode/15.0.0 I, [2024-05-03T21:42:14.440169 #2047952] INFO -- : CPPFLAGS = I, [2024-05-03T21:42:14.440173 #2047952] INFO -- : DLDFLAGS = -Wl,--compress-debug-sections=zlib -Wl,-soname,libruby.so.3.4 -fstack-protector-strong I, [2024-05-03T21:42:14.440177 #2047952] INFO -- : SOLIBS = -lz -lrt -lrt -lgmp -ldl -lcrypt -lm -lpthread I, [2024-05-03T21:42:14.440180 #2047952] INFO -- : LANG = en_US.UTF-8 I, [2024-05-03T21:42:14.440183 #2047952] INFO -- : LC_ALL = I, [2024-05-03T21:42:14.440187 #2047952] INFO -- : LC_CTYPE = I, [2024-05-03T21:42:14.440190 #2047952] INFO -- : MFLAGS = -j20 --jobserver-auth=4,5 I, [2024-05-03T21:42:14.440194 #2047952] INFO -- : RUSTC = no I, [2024-05-03T21:42:14.440198 #2047952] INFO -- : YJIT_RUSTC_ARGS = --crate-name=yjit --crate-type=staticlib --edition=2021 -g -C lto=thin -C opt-level=3 -C overflow-checks=on '--out-dir=/tmp/ruby/build/trunk/yjit/target/release/' /tmp/ruby/src/trunk/yjit/src/lib.rs I, [2024-05-03T21:42:14.441734 #2047952] INFO -- : gcc (Ubuntu 11.4.0-1ubuntu1~22.04) 11.4.0 I, [2024-05-03T21:42:14.441754 #2047952] INFO -- : Copyright (C) 2021 Free Software Foundation, Inc. I, [2024-05-03T21:42:14.441759 #2047952] INFO -- : This is free software; see the source for copying conditions. There is NO I, [2024-05-03T21:42:14.441763 #2047952] INFO -- : warranty; not even for MERCHANTABILITY or FITNESS FOR A PARTICULAR PURPOSE. I, [2024-05-03T21:42:14.441767 #2047952] INFO -- : I, [2024-05-03T21:42:14.470849 #2047952] INFO -- : generating enc.mk I, [2024-05-03T21:42:14.472669 #2047952] INFO -- : building spec/ruby/optional/capi/ext/array_spec.so I, [2024-05-03T21:42:14.473100 #2047952] INFO -- : building spec/ruby/optional/capi/ext/basic_object_spec.so I, [2024-05-03T21:42:14.473626 #2047952] INFO -- : building spec/ruby/optional/capi/ext/bignum_spec.so I, [2024-05-03T21:42:14.474244 #2047952] INFO -- : building spec/ruby/optional/capi/ext/binding_spec.so I, [2024-05-03T21:42:14.474562 #2047952] INFO -- : building spec/ruby/optional/capi/ext/boolean_spec.so I, [2024-05-03T21:42:14.475296 #2047952] INFO -- : building spec/ruby/optional/capi/ext/class_id_under_autoload_spec.so I, [2024-05-03T21:42:14.476390 #2047952] INFO -- : building spec/ruby/optional/capi/ext/class_spec.so I, [2024-05-03T21:42:14.476964 #2047952] INFO -- : building spec/ruby/optional/capi/ext/class_under_autoload_spec.so I, [2024-05-03T21:42:14.477544 #2047952] INFO -- : building spec/ruby/optional/capi/ext/complex_spec.so I, [2024-05-03T21:42:14.477971 #2047952] INFO -- : building spec/ruby/optional/capi/ext/constants_spec.so I, [2024-05-03T21:42:14.478746 #2047952] INFO -- : building spec/ruby/optional/capi/ext/data_spec.so I, [2024-05-03T21:42:14.479054 #2047952] INFO -- : building spec/ruby/optional/capi/ext/debug_spec.so I, [2024-05-03T21:42:14.479825 #2047952] INFO -- : building spec/ruby/optional/capi/ext/encoding_spec.so I, [2024-05-03T21:42:14.480063 #2047952] INFO -- : building spec/ruby/optional/capi/ext/enumerator_spec.so I, [2024-05-03T21:42:14.480798 #2047952] INFO -- : building spec/ruby/optional/capi/ext/exception_spec.so I, [2024-05-03T21:42:14.481446 #2047952] INFO -- : building spec/ruby/optional/capi/ext/fiber_spec.so I, [2024-05-03T21:42:14.481909 #2047952] INFO -- : building spec/ruby/optional/capi/ext/file_spec.so I, [2024-05-03T21:42:14.482364 #2047952] INFO -- : building spec/ruby/optional/capi/ext/fixnum_spec.so I, [2024-05-03T21:42:14.496629 #2047952] INFO -- : building spec/ruby/optional/capi/ext/float_spec.so I, [2024-05-03T21:42:14.619208 #2047952] INFO -- : building spec/ruby/optional/capi/ext/gc_spec.so I, [2024-05-03T21:42:14.621662 #2047952] INFO -- : building spec/ruby/optional/capi/ext/globals_spec.so I, [2024-05-03T21:42:14.624315 #2047952] INFO -- : building spec/ruby/optional/capi/ext/hash_spec.so I, [2024-05-03T21:42:14.633176 #2047952] INFO -- : building spec/ruby/optional/capi/ext/integer_spec.so I, [2024-05-03T21:42:14.635764 #2047952] INFO -- : building spec/ruby/optional/capi/ext/io_spec.so I, [2024-05-03T21:42:14.637982 #2047952] INFO -- : building spec/ruby/optional/capi/ext/kernel_spec.so I, [2024-05-03T21:42:14.641991 #2047952] INFO -- : building spec/ruby/optional/capi/ext/language_spec.so I, [2024-05-03T21:42:14.644746 #2047952] INFO -- : building spec/ruby/optional/capi/ext/marshal_spec.so I, [2024-05-03T21:42:14.645178 #2047952] INFO -- : building spec/ruby/optional/capi/ext/module_spec.so I, [2024-05-03T21:42:14.646274 #2047952] INFO -- : building spec/ruby/optional/capi/ext/module_under_autoload_spec.so I, [2024-05-03T21:42:14.653105 #2047952] INFO -- : building spec/ruby/optional/capi/ext/mutex_spec.so I, [2024-05-03T21:42:14.673288 #2047952] INFO -- : building spec/ruby/optional/capi/ext/numeric_spec.so I, [2024-05-03T21:42:14.689434 #2047952] INFO -- : building spec/ruby/optional/capi/ext/object_spec.so I, [2024-05-03T21:42:14.709554 #2047952] INFO -- : building spec/ruby/optional/capi/ext/proc_spec.so I, [2024-05-03T21:42:14.710264 #2047952] INFO -- : building spec/ruby/optional/capi/ext/range_spec.so I, [2024-05-03T21:42:14.711907 #2047952] INFO -- : building spec/ruby/optional/capi/ext/rational_spec.so I, [2024-05-03T21:42:14.739869 #2047952] INFO -- : building spec/ruby/optional/capi/ext/rbasic_spec.so I, [2024-05-03T21:42:14.778208 #2047952] INFO -- : building spec/ruby/optional/capi/ext/regexp_spec.so I, [2024-05-03T21:42:14.781832 #2047952] INFO -- : building spec/ruby/optional/capi/ext/string_spec.so I, [2024-05-03T21:42:14.789575 #2047952] INFO -- : building spec/ruby/optional/capi/ext/struct_spec.so I, [2024-05-03T21:42:14.790225 #2047952] INFO -- : building spec/ruby/optional/capi/ext/st_spec.so I, [2024-05-03T21:42:14.798991 #2047952] INFO -- : building spec/ruby/optional/capi/ext/symbol_spec.so I, [2024-05-03T21:42:14.799502 #2047952] INFO -- : building spec/ruby/optional/capi/ext/thread_spec.so I, [2024-05-03T21:42:14.805541 #2047952] INFO -- : building spec/ruby/optional/capi/ext/time_spec.so I, [2024-05-03T21:42:14.825951 #2047952] INFO -- : building spec/ruby/optional/capi/ext/tracepoint_spec.so I, [2024-05-03T21:42:14.831093 #2047952] INFO -- : building spec/ruby/optional/capi/ext/typed_data_spec.so I, [2024-05-03T21:42:14.855198 #2047952] INFO -- : building spec/ruby/optional/capi/ext/util_spec.so I, [2024-05-03T21:42:14.856665 #2047952] INFO -- : making enc I, [2024-05-03T21:42:14.863258 #2047952] INFO -- : making srcs under enc I, [2024-05-03T21:42:14.886610 #2047952] INFO -- : make[1]: Entering directory '/tmp/ruby/build/trunk' I, [2024-05-03T21:42:14.886693 #2047952] INFO -- : make[1]: Nothing to be done for 'enc'. I, [2024-05-03T21:42:14.886719 #2047952] INFO -- : make[1]: Leaving directory '/tmp/ruby/build/trunk' I, [2024-05-03T21:42:14.906016 #2047952] INFO -- : make[1]: Entering directory '/tmp/ruby/build/trunk' I, [2024-05-03T21:42:14.906071 #2047952] INFO -- : make[1]: Nothing to be done for 'srcs'. I, [2024-05-03T21:42:14.906080 #2047952] INFO -- : make[1]: Leaving directory '/tmp/ruby/build/trunk' I, [2024-05-03T21:42:14.906596 #2047952] INFO -- : generating transdb.h I, [2024-05-03T21:42:15.007746 #2047952] INFO -- : transdb.h unchanged I, [2024-05-03T21:42:15.008927 #2047952] INFO -- : generating makefiles ext/configure-ext.mk I, [2024-05-03T21:42:15.009380 #2047952] INFO -- : making trans I, [2024-05-03T21:42:15.035426 #2047952] INFO -- : ext/configure-ext.mk updated I, [2024-05-03T21:42:15.037508 #2047952] INFO -- : make[1]: Entering directory '/tmp/ruby/build/trunk' I, [2024-05-03T21:42:15.044957 #2047952] INFO -- : make[1]: Entering directory '/tmp/ruby/build/trunk' I, [2024-05-03T21:42:15.045015 #2047952] INFO -- : make[1]: Nothing to be done for 'trans'. I, [2024-05-03T21:42:15.045025 #2047952] INFO -- : make[1]: Leaving directory '/tmp/ruby/build/trunk' I, [2024-05-03T21:42:15.045763 #2047952] INFO -- : making encs I, [2024-05-03T21:42:15.105350 #2047952] INFO -- : make[1]: Entering directory '/tmp/ruby/build/trunk' I, [2024-05-03T21:42:15.105418 #2047952] INFO -- : make[1]: Nothing to be done for 'encs'. I, [2024-05-03T21:42:15.105439 #2047952] INFO -- : make[1]: Leaving directory '/tmp/ruby/build/trunk' I, [2024-05-03T21:42:15.195948 #2047952] INFO -- : make[1]: Leaving directory '/tmp/ruby/build/trunk' I, [2024-05-03T21:42:15.196425 #2047952] INFO -- : generating makefile exts.mk I, [2024-05-03T21:42:15.233948 #2047952] INFO -- : exts.mk unchanged I, [2024-05-03T21:42:15.238446 #2047952] INFO -- : make[1]: Entering directory '/tmp/ruby/build/trunk' I, [2024-05-03T21:42:15.257375 #2047952] INFO -- : make[2]: Entering directory '/tmp/ruby/build/trunk/ext/digest' I, [2024-05-03T21:42:15.259280 #2047952] INFO -- : make[2]: Entering directory '/tmp/ruby/build/trunk/ext/coverage' I, [2024-05-03T21:42:15.259623 #2047952] INFO -- : make[2]: Entering directory '/tmp/ruby/build/trunk/ext/json' I, [2024-05-03T21:42:15.259915 #2047952] INFO -- : make[2]: Entering directory '/tmp/ruby/build/trunk/ext/date' I, [2024-05-03T21:42:15.260998 #2047952] INFO -- : make[2]: Entering directory '/tmp/ruby/build/trunk/ext/io/console' I, [2024-05-03T21:42:15.261073 #2047952] INFO -- : make[2]: Leaving directory '/tmp/ruby/build/trunk/ext/digest' I, [2024-05-03T21:42:15.261569 #2047952] INFO -- : make[2]: Entering directory '/tmp/ruby/build/trunk/ext/monitor' I, [2024-05-03T21:42:15.262105 #2047952] INFO -- : make[2]: Entering directory '/tmp/ruby/build/trunk/ext/pathname' I, [2024-05-03T21:42:15.262156 #2047952] INFO -- : make[2]: Leaving directory '/tmp/ruby/build/trunk/ext/coverage' I, [2024-05-03T21:42:15.262714 #2047952] INFO -- : make[2]: Entering directory '/tmp/ruby/build/trunk/ext/objspace' I, [2024-05-03T21:42:15.262929 #2047952] INFO -- : make[2]: Entering directory '/tmp/ruby/build/trunk/ext/fiddle' I, [2024-05-03T21:42:15.263446 #2047952] INFO -- : make[2]: Entering directory '/tmp/ruby/build/trunk/ext/rubyvm' I, [2024-05-03T21:42:15.263675 #2047952] INFO -- : make[2]: Leaving directory '/tmp/ruby/build/trunk/ext/date' I, [2024-05-03T21:42:15.263699 #2047952] INFO -- : make[2]: Leaving directory '/tmp/ruby/build/trunk/ext/io/console' I, [2024-05-03T21:42:15.263707 #2047952] INFO -- : make[2]: Entering directory '/tmp/ruby/build/trunk/ext/pty' I, [2024-05-03T21:42:15.264073 #2047952] INFO -- : make[2]: Leaving directory '/tmp/ruby/build/trunk/ext/monitor' I, [2024-05-03T21:42:15.264572 #2047952] INFO -- : make[2]: Entering directory '/tmp/ruby/build/trunk/ext/psych' I, [2024-05-03T21:42:15.265005 #2047952] INFO -- : make[2]: Entering directory '/tmp/ruby/build/trunk/.bundle/gems/debug-1.9.2/ext/debug' I, [2024-05-03T21:42:15.265039 #2047952] INFO -- : make[2]: Entering directory '/tmp/ruby/build/trunk/.bundle/gems/bigdecimal-3.1.7/ext/bigdecimal' I, [2024-05-03T21:42:15.265752 #2047952] INFO -- : make[2]: Entering directory '/tmp/ruby/build/trunk/.bundle/gems/nkf-0.2.0/ext/nkf' I, [2024-05-03T21:42:15.265943 #2047952] INFO -- : make[2]: Leaving directory '/tmp/ruby/build/trunk/ext/rubyvm' I, [2024-05-03T21:42:15.266045 #2047952] INFO -- : make[2]: Entering directory '/tmp/ruby/build/trunk/.bundle/gems/racc-1.7.3/ext/racc/cparse' I, [2024-05-03T21:42:15.266599 #2047952] INFO -- : make[2]: Leaving directory '/tmp/ruby/build/trunk/ext/pathname' I, [2024-05-03T21:42:15.267828 #2047952] INFO -- : make[2]: Leaving directory '/tmp/ruby/build/trunk/ext/objspace' I, [2024-05-03T21:42:15.268473 #2047952] INFO -- : make[2]: Entering directory '/tmp/ruby/build/trunk/ext/ripper' I, [2024-05-03T21:42:15.268865 #2047952] INFO -- : make[2]: Entering directory '/tmp/ruby/build/trunk/.bundle/gems/rbs-3.4.4/ext/rbs_extension' I, [2024-05-03T21:42:15.268939 #2047952] INFO -- : make[2]: Leaving directory '/tmp/ruby/build/trunk/ext/json' I, [2024-05-03T21:42:15.270401 #2047952] INFO -- : make[2]: Leaving directory '/tmp/ruby/build/trunk/ext/fiddle' I, [2024-05-03T21:42:15.271344 #2047952] INFO -- : make[2]: Entering directory '/tmp/ruby/build/trunk/.bundle/gems/syslog-0.1.2/ext/syslog' I, [2024-05-03T21:42:15.271558 #2047952] INFO -- : make[2]: Leaving directory '/tmp/ruby/build/trunk/ext/pty' I, [2024-05-03T21:42:15.273617 #2047952] INFO -- : make[2]: Entering directory '/tmp/ruby/build/trunk/ext/socket' I, [2024-05-03T21:42:15.273968 #2047952] INFO -- : make[2]: Leaving directory '/tmp/ruby/build/trunk/ext/ripper' I, [2024-05-03T21:42:15.274255 #2047952] INFO -- : make[2]: Entering directory '/tmp/ruby/build/trunk/ext/digest/sha2' I, [2024-05-03T21:42:15.275753 #2047952] INFO -- : make[2]: Entering directory '/tmp/ruby/build/trunk/ext/openssl' I, [2024-05-03T21:42:15.276455 #2047952] INFO -- : make[2]: Leaving directory '/tmp/ruby/build/trunk/ext/digest/sha2' I, [2024-05-03T21:42:15.278715 #2047952] INFO -- : make[2]: Leaving directory '/tmp/ruby/build/trunk/ext/psych' I, [2024-05-03T21:42:15.281999 #2047952] INFO -- : make[2]: Leaving directory '/tmp/ruby/build/trunk/ext/socket' I, [2024-05-03T21:42:15.286961 #2047952] INFO -- : make[2]: Leaving directory '/tmp/ruby/build/trunk/ext/openssl' I, [2024-05-03T21:42:15.290587 #2047952] INFO -- : make[2]: Leaving directory '/tmp/ruby/build/trunk/.bundle/gems/bigdecimal-3.1.7/ext/bigdecimal' I, [2024-05-03T21:42:15.290947 #2047952] INFO -- : make[2]: Leaving directory '/tmp/ruby/build/trunk/.bundle/gems/debug-1.9.2/ext/debug' I, [2024-05-03T21:42:15.297555 #2047952] INFO -- : make[2]: Leaving directory '/tmp/ruby/build/trunk/.bundle/gems/nkf-0.2.0/ext/nkf' I, [2024-05-03T21:42:15.298994 #2047952] INFO -- : make[2]: Leaving directory '/tmp/ruby/build/trunk/.bundle/gems/racc-1.7.3/ext/racc/cparse' I, [2024-05-03T21:42:15.299222 #2047952] INFO -- : make[2]: Leaving directory '/tmp/ruby/build/trunk/.bundle/gems/rbs-3.4.4/ext/rbs_extension' I, [2024-05-03T21:42:15.304438 #2047952] INFO -- : make[2]: Leaving directory '/tmp/ruby/build/trunk/.bundle/gems/syslog-0.1.2/ext/syslog' I, [2024-05-03T21:42:15.329148 #2047952] INFO -- : make[2]: Entering directory '/tmp/ruby/build/trunk' I, [2024-05-03T21:42:15.396242 #2047952] INFO -- : linking ruby I, [2024-05-03T21:42:15.418725 #2047952] INFO -- : make[2]: Leaving directory '/tmp/ruby/build/trunk' I, [2024-05-03T21:42:15.418963 #2047952] INFO -- : make[1]: Leaving directory '/tmp/ruby/build/trunk' I, [2024-05-03T21:42:15.422821 #2047952] INFO -- : make[1]: Entering directory '/tmp/ruby/build/trunk' I, [2024-05-03T21:42:15.422870 #2047952] INFO -- : make[1]: Nothing to be done for 'note'. I, [2024-05-03T21:42:15.422883 #2047952] INFO -- : make[1]: Leaving directory '/tmp/ruby/build/trunk' I, [2024-05-03T21:42:15.423666 #2047952] INFO -- : $$$[end] "make all -j20" exit with 0. I, [2024-05-03T21:42:15.423881 #2047952] INFO -- : $$$[beg] make install -j20 I, [2024-05-03T21:42:15.487064 #2047952] INFO -- : Update minitest to ea9caafc0754b1d6236a490d59e624b53209734a I, [2024-05-03T21:42:15.487261 #2047952] INFO -- : Update power_assert to 84e85124c5014a139af39161d484156cfe87a9ed I, [2024-05-03T21:42:15.487828 #2047952] INFO -- : Update rbs to ba7872795d5de04adb8ff500c0e6afdc81a041dd I, [2024-05-03T21:42:15.487885 #2047952] INFO -- : Update typeprof to b19a6416da3a05d57fadd6ffdadb382b6d236ca5 I, [2024-05-03T21:42:15.488580 #2047952] INFO -- : echo ea9caafc0754b1d6236a490d59e624b53209734a | /bin/sh /tmp/ruby/src/trunk/tool/ifchange /tmp/ruby/src/trunk/.bundle/.timestamp/minitest.revision - I, [2024-05-03T21:42:15.488780 #2047952] INFO -- : echo 84e85124c5014a139af39161d484156cfe87a9ed | /bin/sh /tmp/ruby/src/trunk/tool/ifchange /tmp/ruby/src/trunk/.bundle/.timestamp/power_assert.revision - I, [2024-05-03T21:42:15.489938 #2047952] INFO -- : BASERUBY = /usr/bin/ruby --disable=gems I, [2024-05-03T21:42:15.489958 #2047952] INFO -- : CC = gcc I, [2024-05-03T21:42:15.489964 #2047952] INFO -- : LD = ld I, [2024-05-03T21:42:15.489969 #2047952] INFO -- : LDSHARED = gcc -shared I, [2024-05-03T21:42:15.489973 #2047952] INFO -- : CFLAGS = -O3 -fno-fast-math -ggdb3 -Wall -Wextra -Wdeprecated-declarations -Wdiv-by-zero -Wduplicated-cond -Wimplicit-function-declaration -Wimplicit-int -Wpointer-arith -Wwrite-strings -Wold-style-definition -Wimplicit-fallthrough=0 -Wmissing-noreturn -Wno-cast-function-type -Wno-constant-logical-operand -Wno-long-long -Wno-missing-field-initializers -Wno-overlength-strings -Wno-packed-bitfield-compat -Wno-parentheses-equality -Wno-self-assign -Wno-tautological-compare -Wno-unused-parameter -Wno-unused-value -Wsuggest-attribute=format -Wsuggest-attribute=noreturn -Wunused-variable -Wmisleading-indentation -Wundef -fPIC I, [2024-05-03T21:42:15.489978 #2047952] INFO -- : XCFLAGS = -U_FORTIFY_SOURCE -D_FORTIFY_SOURCE=2 -fstack-protector-strong -fno-strict-overflow -fvisibility=hidden -fexcess-precision=standard -DRUBY_EXPORT -I. -I.ext/include/x86_64-linux -I/tmp/ruby/src/trunk/include -I/tmp/ruby/src/trunk -I/tmp/ruby/src/trunk/prism -I/tmp/ruby/src/trunk/enc/unicode/15.0.0 I, [2024-05-03T21:42:15.489981 #2047952] INFO -- : CPPFLAGS = I, [2024-05-03T21:42:15.489985 #2047952] INFO -- : DLDFLAGS = -Wl,--compress-debug-sections=zlib -Wl,-soname,libruby.so.3.4 -fstack-protector-strong I, [2024-05-03T21:42:15.489988 #2047952] INFO -- : SOLIBS = -lz -lrt -lrt -lgmp -ldl -lcrypt -lm -lpthread I, [2024-05-03T21:42:15.489992 #2047952] INFO -- : LANG = en_US.UTF-8 I, [2024-05-03T21:42:15.489999 #2047952] INFO -- : LC_ALL = I, [2024-05-03T21:42:15.490002 #2047952] INFO -- : LC_CTYPE = I, [2024-05-03T21:42:15.490006 #2047952] INFO -- : MFLAGS = -j20 --jobserver-auth=4,5 I, [2024-05-03T21:42:15.490009 #2047952] INFO -- : RUSTC = no I, [2024-05-03T21:42:15.490013 #2047952] INFO -- : YJIT_RUSTC_ARGS = --crate-name=yjit --crate-type=staticlib --edition=2021 -g -C lto=thin -C opt-level=3 -C overflow-checks=on '--out-dir=/tmp/ruby/build/trunk/yjit/target/release/' /tmp/ruby/src/trunk/yjit/src/lib.rs I, [2024-05-03T21:42:15.490636 #2047952] INFO -- : /tmp/ruby/src/trunk/.bundle/.timestamp/minitest.revision unchanged I, [2024-05-03T21:42:15.490812 #2047952] INFO -- : /tmp/ruby/src/trunk/.bundle/.timestamp/power_assert.revision unchanged I, [2024-05-03T21:42:15.515732 #2047952] INFO -- : echo ba7872795d5de04adb8ff500c0e6afdc81a041dd | /bin/sh /tmp/ruby/src/trunk/tool/ifchange /tmp/ruby/src/trunk/.bundle/.timestamp/rbs.revision - I, [2024-05-03T21:42:15.515798 #2047952] INFO -- : echo b19a6416da3a05d57fadd6ffdadb382b6d236ca5 | /bin/sh /tmp/ruby/src/trunk/tool/ifchange /tmp/ruby/src/trunk/.bundle/.timestamp/typeprof.revision - I, [2024-05-03T21:42:15.516563 #2047952] INFO -- : generating enc.mk I, [2024-05-03T21:42:15.516585 #2047952] INFO -- : gcc (Ubuntu 11.4.0-1ubuntu1~22.04) 11.4.0 I, [2024-05-03T21:42:15.516591 #2047952] INFO -- : Copyright (C) 2021 Free Software Foundation, Inc. I, [2024-05-03T21:42:15.516603 #2047952] INFO -- : This is free software; see the source for copying conditions. There is NO I, [2024-05-03T21:42:15.516607 #2047952] INFO -- : warranty; not even for MERCHANTABILITY or FITNESS FOR A PARTICULAR PURPOSE. I, [2024-05-03T21:42:15.516611 #2047952] INFO -- : I, [2024-05-03T21:42:15.517803 #2047952] INFO -- : /tmp/ruby/src/trunk/.bundle/.timestamp/typeprof.revision unchanged I, [2024-05-03T21:42:15.518049 #2047952] INFO -- : /tmp/ruby/src/trunk/.bundle/.timestamp/rbs.revision unchanged I, [2024-05-03T21:42:15.637979 #2047952] INFO -- : Building power_assert@84e85124c5014a139af39161d484156cfe87a9ed to /tmp/ruby/src/trunk/gems/power_assert-2.0.3.gem I, [2024-05-03T21:42:15.638669 #2047952] INFO -- : making srcs under enc I, [2024-05-03T21:42:15.638702 #2047952] INFO -- : making enc I, [2024-05-03T21:42:15.657144 #2047952] INFO -- : make[1]: Entering directory '/tmp/ruby/build/trunk' I, [2024-05-03T21:42:15.657189 #2047952] INFO -- : make[1]: Nothing to be done for 'enc'. I, [2024-05-03T21:42:15.657201 #2047952] INFO -- : make[1]: Leaving directory '/tmp/ruby/build/trunk' I, [2024-05-03T21:42:15.668007 #2047952] INFO -- : make[1]: Entering directory '/tmp/ruby/build/trunk' I, [2024-05-03T21:42:15.668054 #2047952] INFO -- : make[1]: Nothing to be done for 'srcs'. I, [2024-05-03T21:42:15.668073 #2047952] INFO -- : make[1]: Leaving directory '/tmp/ruby/build/trunk' I, [2024-05-03T21:42:15.668701 #2047952] INFO -- : generating transdb.h I, [2024-05-03T21:42:15.706137 #2047952] INFO -- : Successfully built RubyGem I, [2024-05-03T21:42:15.706196 #2047952] INFO -- : Name: power_assert I, [2024-05-03T21:42:15.706210 #2047952] INFO -- : Version: 2.0.4dev I, [2024-05-03T21:42:15.706222 #2047952] INFO -- : File: power_assert-2.0.4dev.gem I, [2024-05-03T21:42:15.708469 #2047952] INFO -- : Extracting bundle gem power_assert-2.0.3... I, [2024-05-03T21:42:15.763063 #2047952] INFO -- : transdb.h unchanged I, [2024-05-03T21:42:15.764732 #2047952] INFO -- : generating makefiles ext/configure-ext.mk I, [2024-05-03T21:42:15.764782 #2047952] INFO -- : making trans I, [2024-05-03T21:42:15.769601 #2047952] INFO -- : Try with hash version of bundled gems instead of gems/power_assert-2.0.3.gem. We don't use this gem with release version of Ruby. I, [2024-05-03T21:42:15.774612 #2047952] INFO -- : Unpacked gems/power_assert-2.0.4dev.gem I, [2024-05-03T21:42:15.791562 #2047952] INFO -- : ext/configure-ext.mk unchanged I, [2024-05-03T21:42:15.794011 #2047952] INFO -- : make[1]: Entering directory '/tmp/ruby/build/trunk' I, [2024-05-03T21:42:15.799689 #2047952] INFO -- : make[1]: Entering directory '/tmp/ruby/build/trunk' I, [2024-05-03T21:42:15.799781 #2047952] INFO -- : make[1]: Nothing to be done for 'trans'. I, [2024-05-03T21:42:15.799791 #2047952] INFO -- : make[1]: Leaving directory '/tmp/ruby/build/trunk' I, [2024-05-03T21:42:15.800735 #2047952] INFO -- : making encs I, [2024-05-03T21:42:15.858808 #2047952] INFO -- : make[1]: Entering directory '/tmp/ruby/build/trunk' I, [2024-05-03T21:42:15.858884 #2047952] INFO -- : make[1]: Nothing to be done for 'encs'. I, [2024-05-03T21:42:15.858913 #2047952] INFO -- : make[1]: Leaving directory '/tmp/ruby/build/trunk' I, [2024-05-03T21:42:15.954419 #2047952] INFO -- : make[1]: Leaving directory '/tmp/ruby/build/trunk' I, [2024-05-03T21:42:15.955227 #2047952] INFO -- : generating makefile exts.mk I, [2024-05-03T21:42:15.992817 #2047952] INFO -- : exts.mk unchanged I, [2024-05-03T21:42:15.997296 #2047952] INFO -- : make[1]: Entering directory '/tmp/ruby/build/trunk' I, [2024-05-03T21:42:16.016292 #2047952] INFO -- : make[2]: Entering directory '/tmp/ruby/build/trunk/ext/digest' I, [2024-05-03T21:42:16.017995 #2047952] INFO -- : make[2]: Entering directory '/tmp/ruby/build/trunk/ext/coverage' I, [2024-05-03T21:42:16.018560 #2047952] INFO -- : make[2]: Entering directory '/tmp/ruby/build/trunk/ext/json' I, [2024-05-03T21:42:16.018749 #2047952] INFO -- : make[2]: Entering directory '/tmp/ruby/build/trunk/ext/date' I, [2024-05-03T21:42:16.020127 #2047952] INFO -- : make[2]: Entering directory '/tmp/ruby/build/trunk/ext/io/console' I, [2024-05-03T21:42:16.020279 #2047952] INFO -- : make[2]: Entering directory '/tmp/ruby/build/trunk/ext/monitor' I, [2024-05-03T21:42:16.020526 #2047952] INFO -- : make[2]: Entering directory '/tmp/ruby/build/trunk/ext/pathname' I, [2024-05-03T21:42:16.021178 #2047952] INFO -- : make[2]: Entering directory '/tmp/ruby/build/trunk/ext/pty' I, [2024-05-03T21:42:16.021843 #2047952] INFO -- : make[2]: Leaving directory '/tmp/ruby/build/trunk/ext/coverage' I, [2024-05-03T21:42:16.021900 #2047952] INFO -- : make[2]: Entering directory '/tmp/ruby/build/trunk/ext/fiddle' I, [2024-05-03T21:42:16.022393 #2047952] INFO -- : make[2]: Leaving directory '/tmp/ruby/build/trunk/ext/io/console' I, [2024-05-03T21:42:16.022400 #2047952] INFO -- : make[2]: Leaving directory '/tmp/ruby/build/trunk/ext/date' I, [2024-05-03T21:42:16.022514 #2047952] INFO -- : make[2]: Entering directory '/tmp/ruby/build/trunk/ext/objspace' I, [2024-05-03T21:42:16.022906 #2047952] INFO -- : make[2]: Leaving directory '/tmp/ruby/build/trunk/ext/monitor' I, [2024-05-03T21:42:16.022950 #2047952] INFO -- : make[2]: Leaving directory '/tmp/ruby/build/trunk/ext/digest' I, [2024-05-03T21:42:16.023293 #2047952] INFO -- : make[2]: Entering directory '/tmp/ruby/build/trunk/ext/psych' I, [2024-05-03T21:42:16.023728 #2047952] INFO -- : make[2]: Leaving directory '/tmp/ruby/build/trunk/ext/pathname' I, [2024-05-03T21:42:16.023854 #2047952] INFO -- : make[2]: Leaving directory '/tmp/ruby/build/trunk/ext/pty' I, [2024-05-03T21:42:16.024251 #2047952] INFO -- : make[2]: Entering directory '/tmp/ruby/build/trunk/ext/rubyvm' I, [2024-05-03T21:42:16.025660 #2047952] INFO -- : make[2]: Entering directory '/tmp/ruby/build/trunk/ext/ripper' I, [2024-05-03T21:42:16.025915 #2047952] INFO -- : make[2]: Entering directory '/tmp/ruby/build/trunk/.bundle/gems/debug-1.9.2/ext/debug' I, [2024-05-03T21:42:16.025984 #2047952] INFO -- : make[2]: Entering directory '/tmp/ruby/build/trunk/.bundle/gems/bigdecimal-3.1.7/ext/bigdecimal' I, [2024-05-03T21:42:16.026009 #2047952] INFO -- : make[2]: Entering directory '/tmp/ruby/build/trunk/.bundle/gems/nkf-0.2.0/ext/nkf' I, [2024-05-03T21:42:16.026145 #2047952] INFO -- : make[2]: Leaving directory '/tmp/ruby/build/trunk/ext/objspace' I, [2024-05-03T21:42:16.026238 #2047952] INFO -- : make[2]: Leaving directory '/tmp/ruby/build/trunk/ext/rubyvm' I, [2024-05-03T21:42:16.026261 #2047952] INFO -- : make[2]: Entering directory '/tmp/ruby/build/trunk/.bundle/gems/racc-1.7.3/ext/racc/cparse' I, [2024-05-03T21:42:16.026754 #2047952] INFO -- : make[2]: Entering directory '/tmp/ruby/build/trunk/.bundle/gems/rbs-3.4.4/ext/rbs_extension' I, [2024-05-03T21:42:16.028038 #2047952] INFO -- : make[2]: Leaving directory '/tmp/ruby/build/trunk/ext/fiddle' I, [2024-05-03T21:42:16.028078 #2047952] INFO -- : make[2]: Leaving directory '/tmp/ruby/build/trunk/ext/json' I, [2024-05-03T21:42:16.030501 #2047952] INFO -- : make[2]: Entering directory '/tmp/ruby/build/trunk/.bundle/gems/syslog-0.1.2/ext/syslog' I, [2024-05-03T21:42:16.031979 #2047952] INFO -- : make[2]: Leaving directory '/tmp/ruby/build/trunk/ext/ripper' I, [2024-05-03T21:42:16.033056 #2047952] INFO -- : make[2]: Entering directory '/tmp/ruby/build/trunk/ext/digest/sha2' I, [2024-05-03T21:42:16.033900 #2047952] INFO -- : make[2]: Entering directory '/tmp/ruby/build/trunk/ext/socket' I, [2024-05-03T21:42:16.034166 #2047952] INFO -- : make[2]: Entering directory '/tmp/ruby/build/trunk/ext/openssl' I, [2024-05-03T21:42:16.035145 #2047952] INFO -- : make[2]: Leaving directory '/tmp/ruby/build/trunk/ext/psych' I, [2024-05-03T21:42:16.035256 #2047952] INFO -- : make[2]: Leaving directory '/tmp/ruby/build/trunk/ext/digest/sha2' I, [2024-05-03T21:42:16.042249 #2047952] INFO -- : make[2]: Leaving directory '/tmp/ruby/build/trunk/ext/socket' I, [2024-05-03T21:42:16.045465 #2047952] INFO -- : make[2]: Leaving directory '/tmp/ruby/build/trunk/ext/openssl' I, [2024-05-03T21:42:16.051054 #2047952] INFO -- : make[2]: Leaving directory '/tmp/ruby/build/trunk/.bundle/gems/debug-1.9.2/ext/debug' I, [2024-05-03T21:42:16.052655 #2047952] INFO -- : make[2]: Leaving directory '/tmp/ruby/build/trunk/.bundle/gems/syslog-0.1.2/ext/syslog' I, [2024-05-03T21:42:16.052922 #2047952] INFO -- : make[2]: Leaving directory '/tmp/ruby/build/trunk/.bundle/gems/racc-1.7.3/ext/racc/cparse' I, [2024-05-03T21:42:16.055156 #2047952] INFO -- : make[2]: Leaving directory '/tmp/ruby/build/trunk/.bundle/gems/nkf-0.2.0/ext/nkf' I, [2024-05-03T21:42:16.058919 #2047952] INFO -- : make[2]: Leaving directory '/tmp/ruby/build/trunk/.bundle/gems/bigdecimal-3.1.7/ext/bigdecimal' I, [2024-05-03T21:42:16.058946 #2047952] INFO -- : make[2]: Leaving directory '/tmp/ruby/build/trunk/.bundle/gems/rbs-3.4.4/ext/rbs_extension' I, [2024-05-03T21:42:16.083006 #2047952] INFO -- : make[2]: Entering directory '/tmp/ruby/build/trunk' I, [2024-05-03T21:42:16.147917 #2047952] INFO -- : make[2]: 'ruby' is up to date. I, [2024-05-03T21:42:16.147955 #2047952] INFO -- : make[2]: Leaving directory '/tmp/ruby/build/trunk' I, [2024-05-03T21:42:16.148414 #2047952] INFO -- : make[1]: Leaving directory '/tmp/ruby/build/trunk' I, [2024-05-03T21:42:16.152259 #2047952] INFO -- : make[1]: Entering directory '/tmp/ruby/build/trunk' I, [2024-05-03T21:42:16.152286 #2047952] INFO -- : make[1]: Nothing to be done for 'note'. I, [2024-05-03T21:42:16.152292 #2047952] INFO -- : make[1]: Leaving directory '/tmp/ruby/build/trunk' I, [2024-05-03T21:42:16.152518 #2047952] INFO -- : ./miniruby -I/tmp/ruby/src/trunk/lib -I. -I.ext/common /tmp/ruby/src/trunk/tool/runruby.rb --extout=.ext -- --disable-gems -r./x86_64-linux-fake /tmp/ruby/src/trunk/tool/rbinstall.rb --make="make" --dest-dir="" --extout=".ext" --ext-build-dir="./ext" --mflags="-j20 --jobserver-auth=4,5" --make-flags=" -j20 --jobserver-auth=4,5" --data-mode=0644 --prog-mode=0755 --installed-list .installed.list --mantype="doc" --gnumake --install=all --exclude=doc I, [2024-05-03T21:42:16.250173 #2047952] INFO -- : Installing to I, [2024-05-03T21:42:16.250235 #2047952] INFO -- : installing binary commands: /tmp/ruby/install/trunk/bin I, [2024-05-03T21:42:16.250321 #2047952] INFO -- : installing base libraries: /tmp/ruby/install/trunk/lib I, [2024-05-03T21:42:16.257755 #2047952] INFO -- : installing arch files: /tmp/ruby/install/trunk/lib/ruby/3.4.0+0/x86_64-linux I, [2024-05-03T21:42:16.257778 #2047952] INFO -- : installing pkgconfig data: /tmp/ruby/install/trunk/lib/pkgconfig I, [2024-05-03T21:42:16.257789 #2047952] INFO -- : installing extension objects: /tmp/ruby/install/trunk/lib/ruby/3.4.0+0/x86_64-linux I, [2024-05-03T21:42:16.267681 #2047952] INFO -- : installing extension objects: /tmp/ruby/install/trunk/lib/ruby/site_ruby/3.4.0+0/x86_64-linux I, [2024-05-03T21:42:16.267703 #2047952] INFO -- : installing extension objects: /tmp/ruby/install/trunk/lib/ruby/vendor_ruby/3.4.0+0/x86_64-linux I, [2024-05-03T21:42:16.267710 #2047952] INFO -- : installing extension headers: /tmp/ruby/install/trunk/include/ruby-3.4.0+0/x86_64-linux I, [2024-05-03T21:42:16.267869 #2047952] INFO -- : installing extension scripts: /tmp/ruby/install/trunk/lib/ruby/3.4.0+0 I, [2024-05-03T21:42:16.271869 #2047952] INFO -- : installing extension scripts: /tmp/ruby/install/trunk/lib/ruby/site_ruby/3.4.0+0 I, [2024-05-03T21:42:16.271899 #2047952] INFO -- : installing extension scripts: /tmp/ruby/install/trunk/lib/ruby/vendor_ruby/3.4.0+0 I, [2024-05-03T21:42:16.271905 #2047952] INFO -- : installing extension headers: /tmp/ruby/install/trunk/include/ruby-3.4.0+0/ruby I, [2024-05-03T21:42:16.271909 #2047952] INFO -- : installing command scripts: /tmp/ruby/install/trunk/bin I, [2024-05-03T21:42:16.271913 #2047952] INFO -- : installing library scripts: /tmp/ruby/install/trunk/lib/ruby/3.4.0+0 I, [2024-05-03T21:42:16.306491 #2047952] INFO -- : installing common headers: /tmp/ruby/install/trunk/include/ruby-3.4.0+0 I, [2024-05-03T21:42:16.311928 #2047952] INFO -- : installing manpages: /tmp/ruby/install/trunk/share/man/man1 I, [2024-05-03T21:42:16.311959 #2047952] INFO -- : installing default gems from lib: /tmp/ruby/install/trunk/lib/ruby/gems/3.4.0+0 I, [2024-05-03T21:42:16.334696 #2047952] INFO -- : benchmark 0.3.0 I, [2024-05-03T21:42:16.341637 #2047952] INFO -- : bundler 2.6.0.dev I, [2024-05-03T21:42:16.343716 #2047952] INFO -- : cgi 0.4.1 I, [2024-05-03T21:42:16.344306 #2047952] INFO -- : delegate 0.3.1 I, [2024-05-03T21:42:16.344780 #2047952] INFO -- : did_you_mean 1.6.3 I, [2024-05-03T21:42:16.345268 #2047952] INFO -- : english 0.8.0 I, [2024-05-03T21:42:16.345741 #2047952] INFO -- : erb 4.0.4 I, [2024-05-03T21:42:16.346444 #2047952] INFO -- : error_highlight 0.6.0 I, [2024-05-03T21:42:16.346930 #2047952] INFO -- : fileutils 1.7.2 I, [2024-05-03T21:42:16.347405 #2047952] INFO -- : find 0.2.0 I, [2024-05-03T21:42:16.347788 #2047952] INFO -- : forwardable 1.3.3 I, [2024-05-03T21:42:16.348275 #2047952] INFO -- : ipaddr 1.2.6 I, [2024-05-03T21:42:16.348767 #2047952] INFO -- : irb 1.13.0 I, [2024-05-03T21:42:16.350270 #2047952] INFO -- : logger 1.6.0 I, [2024-05-03T21:42:16.350773 #2047952] INFO -- : net-http 0.4.1 I, [2024-05-03T21:42:16.351286 #2047952] INFO -- : net-protocol 0.2.2 I, [2024-05-03T21:42:16.351770 #2047952] INFO -- : open-uri 0.4.1 I, [2024-05-03T21:42:16.352322 #2047952] INFO -- : open3 0.2.1 I, [2024-05-03T21:42:16.352920 #2047952] INFO -- : optparse 0.5.0 I, [2024-05-03T21:42:16.353414 #2047952] INFO -- : ostruct 0.6.0 I, [2024-05-03T21:42:16.353837 #2047952] INFO -- : pp 0.5.0 I, [2024-05-03T21:42:16.354303 #2047952] INFO -- : prettyprint 0.2.0 I, [2024-05-03T21:42:16.354759 #2047952] INFO -- : prism 0.27.0 I, [2024-05-03T21:42:16.355361 #2047952] INFO -- : pstore 0.1.3 I, [2024-05-03T21:42:16.355827 #2047952] INFO -- : rdoc 6.6.3.1 I, [2024-05-03T21:42:16.357494 #2047952] INFO -- : readline 0.0.4 I, [2024-05-03T21:42:16.358016 #2047952] INFO -- : reline 0.5.5 I, [2024-05-03T21:42:16.358544 #2047952] INFO -- : resolv 0.4.0 I, [2024-05-03T21:42:16.359025 #2047952] INFO -- : ruby2_keywords 0.0.5 I, [2024-05-03T21:42:16.359501 #2047952] INFO -- : securerandom 0.3.1 I, [2024-05-03T21:42:16.359910 #2047952] INFO -- : set 1.1.0 I, [2024-05-03T21:42:16.360517 #2047952] INFO -- : shellwords 0.2.0 I, [2024-05-03T21:42:16.361112 #2047952] INFO -- : singleton 0.2.0 I, [2024-05-03T21:42:16.361595 #2047952] INFO -- : syntax_suggest 2.0.0 I, [2024-05-03T21:42:16.362284 #2047952] INFO -- : tempfile 0.2.1 I, [2024-05-03T21:42:16.362784 #2047952] INFO -- : time 0.3.0 I, [2024-05-03T21:42:16.363288 #2047952] INFO -- : timeout 0.4.1 I, [2024-05-03T21:42:16.364316 #2047952] INFO -- : tmpdir 0.2.0 I, [2024-05-03T21:42:16.364889 #2047952] INFO -- : tsort 0.2.0 I, [2024-05-03T21:42:16.365390 #2047952] INFO -- : un 0.3.0 I, [2024-05-03T21:42:16.365859 #2047952] INFO -- : uri 0.13.0 I, [2024-05-03T21:42:16.366368 #2047952] INFO -- : weakref 0.1.3 I, [2024-05-03T21:42:16.366823 #2047952] INFO -- : yaml 0.3.0 I, [2024-05-03T21:42:16.367179 #2047952] INFO -- : installing default gems from ext: /tmp/ruby/install/trunk/lib/ruby/gems/3.4.0+0 I, [2024-05-03T21:42:16.374161 #2047952] INFO -- : date 3.3.4 I, [2024-05-03T21:42:16.374617 #2047952] INFO -- : digest 3.1.1 I, [2024-05-03T21:42:16.375176 #2047952] INFO -- : etc 1.4.3 I, [2024-05-03T21:42:16.375694 #2047952] INFO -- : fcntl 1.1.0 I, [2024-05-03T21:42:16.376172 #2047952] INFO -- : fiddle 1.1.3 I, [2024-05-03T21:42:16.376743 #2047952] INFO -- : io-console 0.7.2 I, [2024-05-03T21:42:16.377243 #2047952] INFO -- : io-nonblock 0.3.0 I, [2024-05-03T21:42:16.377835 #2047952] INFO -- : io-wait 0.3.1 I, [2024-05-03T21:42:16.378294 #2047952] INFO -- : json 2.7.2 I, [2024-05-03T21:42:16.379308 #2047952] INFO -- : openssl 3.2.0 I, [2024-05-03T21:42:16.379833 #2047952] INFO -- : pathname 0.3.0 I, [2024-05-03T21:42:16.380388 #2047952] INFO -- : psych 5.1.2 I, [2024-05-03T21:42:16.381075 #2047952] INFO -- : stringio 3.1.1 I, [2024-05-03T21:42:16.381588 #2047952] INFO -- : strscan 3.1.1 I, [2024-05-03T21:42:16.382053 #2047952] INFO -- : zlib 3.1.0 I, [2024-05-03T21:42:16.382381 #2047952] INFO -- : installing bundled gems: /tmp/ruby/install/trunk/lib/ruby/gems/3.4.0+0 I, [2024-05-03T21:42:16.382803 #2047952] INFO -- : minitest 5.22.3 I, [2024-05-03T21:42:16.390310 #2047952] INFO -- : rake 13.2.1 I, [2024-05-03T21:42:16.393786 #2047952] INFO -- : test-unit 3.6.2 I, [2024-05-03T21:42:16.398173 #2047952] INFO -- : rexml 3.2.6 I, [2024-05-03T21:42:16.401701 #2047952] INFO -- : rss 0.3.0 I, [2024-05-03T21:42:16.404672 #2047952] INFO -- : net-ftp 0.3.4 I, [2024-05-03T21:42:16.406137 #2047952] INFO -- : net-imap 0.4.10 I, [2024-05-03T21:42:16.409152 #2047952] INFO -- : net-pop 0.1.2 I, [2024-05-03T21:42:16.410065 #2047952] INFO -- : net-smtp 0.5.0 I, [2024-05-03T21:42:16.411139 #2047952] INFO -- : matrix 0.4.2 I, [2024-05-03T21:42:16.414660 #2047952] INFO -- : prime 0.1.2 I, [2024-05-03T21:42:16.420436 #2047952] INFO -- : rbs 3.4.4 I, [2024-05-03T21:42:16.443536 #2047952] INFO -- : typeprof 0.21.11 I, [2024-05-03T21:42:16.446183 #2047952] INFO -- : debug 1.9.2 I, [2024-05-03T21:42:16.448958 #2047952] INFO -- : racc 1.7.3 I, [2024-05-03T21:42:16.451496 #2047952] INFO -- : mutex_m 0.2.0 I, [2024-05-03T21:42:16.452648 #2047952] INFO -- : getoptlong 0.2.1 I, [2024-05-03T21:42:16.453941 #2047952] INFO -- : base64 0.2.0 I, [2024-05-03T21:42:16.454957 #2047952] INFO -- : bigdecimal 3.1.7 I, [2024-05-03T21:42:16.457567 #2047952] INFO -- : observer 0.1.2 I, [2024-05-03T21:42:16.459083 #2047952] INFO -- : abbrev 0.1.2 I, [2024-05-03T21:42:16.460097 #2047952] INFO -- : resolv-replace 0.1.1 I, [2024-05-03T21:42:16.461409 #2047952] INFO -- : rinda 0.2.0 I, [2024-05-03T21:42:16.462594 #2047952] INFO -- : drb 2.2.1 I, [2024-05-03T21:42:16.464206 #2047952] INFO -- : nkf 0.2.0 I, [2024-05-03T21:42:16.466815 #2047952] INFO -- : syslog 0.1.2 I, [2024-05-03T21:42:16.468378 #2047952] INFO -- : csv 3.3.0 I, [2024-05-03T21:42:16.470461 #2047952] INFO -- : installing bundled gem cache: /tmp/ruby/install/trunk/lib/ruby/gems/3.4.0+0/cache I, [2024-05-03T21:42:16.471911 #2047952] INFO -- : skipped bundled gems: I, [2024-05-03T21:42:16.471931 #2047952] INFO -- : power_assert-2.0.4dev.gem not found in bundled_gems I, [2024-05-03T21:42:16.475688 #2047952] INFO -- : $$$[end] "make install -j20" exit with 0. I, [2024-05-03T21:42:16.475828 #2047952] INFO -- : $$$[beg] make yes-btest TESTOPTS='-q -j20' I, [2024-05-03T21:42:21.970664 #2047952] INFO -- : PASS all 1935 tests E, [2024-05-03T21:42:21.976303 #2047952] ERROR -- : I, [2024-05-03T21:42:21.976554 #2047952] INFO -- : $$$[end] "make yes-btest TESTOPTS='-q -j20'" exit with 0. I, [2024-05-03T21:42:21.976681 #2047952] INFO -- : $$$[beg] make yes-test-basic TESTS='-j20' I, [2024-05-03T21:42:22.038606 #2047952] INFO -- : BASERUBY = /usr/bin/ruby --disable=gems I, [2024-05-03T21:42:22.038640 #2047952] INFO -- : CC = gcc I, [2024-05-03T21:42:22.038646 #2047952] INFO -- : LD = ld I, [2024-05-03T21:42:22.038650 #2047952] INFO -- : LDSHARED = gcc -shared I, [2024-05-03T21:42:22.038654 #2047952] INFO -- : CFLAGS = -O3 -fno-fast-math -ggdb3 -Wall -Wextra -Wdeprecated-declarations -Wdiv-by-zero -Wduplicated-cond -Wimplicit-function-declaration -Wimplicit-int -Wpointer-arith -Wwrite-strings -Wold-style-definition -Wimplicit-fallthrough=0 -Wmissing-noreturn -Wno-cast-function-type -Wno-constant-logical-operand -Wno-long-long -Wno-missing-field-initializers -Wno-overlength-strings -Wno-packed-bitfield-compat -Wno-parentheses-equality -Wno-self-assign -Wno-tautological-compare -Wno-unused-parameter -Wno-unused-value -Wsuggest-attribute=format -Wsuggest-attribute=noreturn -Wunused-variable -Wmisleading-indentation -Wundef -fPIC I, [2024-05-03T21:42:22.038660 #2047952] INFO -- : XCFLAGS = -U_FORTIFY_SOURCE -D_FORTIFY_SOURCE=2 -fstack-protector-strong -fno-strict-overflow -fvisibility=hidden -fexcess-precision=standard -DRUBY_EXPORT -I. -I.ext/include/x86_64-linux -I/tmp/ruby/src/trunk/include -I/tmp/ruby/src/trunk -I/tmp/ruby/src/trunk/prism -I/tmp/ruby/src/trunk/enc/unicode/15.0.0 I, [2024-05-03T21:42:22.038664 #2047952] INFO -- : CPPFLAGS = I, [2024-05-03T21:42:22.038668 #2047952] INFO -- : DLDFLAGS = -Wl,--compress-debug-sections=zlib -Wl,-soname,libruby.so.3.4 -fstack-protector-strong I, [2024-05-03T21:42:22.038672 #2047952] INFO -- : SOLIBS = -lz -lrt -lrt -lgmp -ldl -lcrypt -lm -lpthread I, [2024-05-03T21:42:22.038676 #2047952] INFO -- : LANG = en_US.UTF-8 I, [2024-05-03T21:42:22.038679 #2047952] INFO -- : LC_ALL = I, [2024-05-03T21:42:22.038683 #2047952] INFO -- : LC_CTYPE = I, [2024-05-03T21:42:22.038686 #2047952] INFO -- : MFLAGS = I, [2024-05-03T21:42:22.038689 #2047952] INFO -- : RUSTC = no I, [2024-05-03T21:42:22.038693 #2047952] INFO -- : YJIT_RUSTC_ARGS = --crate-name=yjit --crate-type=staticlib --edition=2021 -g -C lto=thin -C opt-level=3 -C overflow-checks=on '--out-dir=/tmp/ruby/build/trunk/yjit/target/release/' /tmp/ruby/src/trunk/yjit/src/lib.rs I, [2024-05-03T21:42:22.039228 #2047952] INFO -- : gcc (Ubuntu 11.4.0-1ubuntu1~22.04) 11.4.0 I, [2024-05-03T21:42:22.039248 #2047952] INFO -- : Copyright (C) 2021 Free Software Foundation, Inc. I, [2024-05-03T21:42:22.039254 #2047952] INFO -- : This is free software; see the source for copying conditions. There is NO I, [2024-05-03T21:42:22.039263 #2047952] INFO -- : warranty; not even for MERCHANTABILITY or FITNESS FOR A PARTICULAR PURPOSE. I, [2024-05-03T21:42:22.039267 #2047952] INFO -- : I, [2024-05-03T21:42:22.147553 #2047952] INFO -- : Checking leaked global symbols...none I, [2024-05-03T21:42:22.189068 #2047952] INFO -- : /tmp/ruby/src/trunk/basictest/test.rb:assignment ....................................................................................................................................................................................................................................................................................................................................................................................OK 372 I, [2024-05-03T21:42:22.189143 #2047952] INFO -- : /tmp/ruby/src/trunk/basictest/test.rb:condition ..OK 2 I, [2024-05-03T21:42:22.189157 #2047952] INFO -- : /tmp/ruby/src/trunk/basictest/test.rb:if/unless ...OK 3 I, [2024-05-03T21:42:22.189168 #2047952] INFO -- : /tmp/ruby/src/trunk/basictest/test.rb:case .....OK 5 I, [2024-05-03T21:42:22.189353 #2047952] INFO -- : /tmp/ruby/src/trunk/basictest/test.rb:while/until ........OK 8 I, [2024-05-03T21:42:22.189404 #2047952] INFO -- : /tmp/ruby/src/trunk/basictest/test.rb:exception ..........OK 10 I, [2024-05-03T21:42:22.189677 #2047952] INFO -- : /tmp/ruby/src/trunk/basictest/test.rb:array .......................................OK 39 I, [2024-05-03T21:42:22.189787 #2047952] INFO -- : /tmp/ruby/src/trunk/basictest/test.rb:hash ...........................OK 27 I, [2024-05-03T21:42:22.190507 #2047952] INFO -- : /tmp/ruby/src/trunk/basictest/test.rb:iterator ...........................................................................................................OK 107 I, [2024-05-03T21:42:22.190794 #2047952] INFO -- : /tmp/ruby/src/trunk/basictest/test.rb:float ................................................................................OK 80 I, [2024-05-03T21:42:22.191810 #2047952] INFO -- : /tmp/ruby/src/trunk/basictest/test.rb:bignum ...............................OK 31 I, [2024-05-03T21:42:22.192595 #2047952] INFO -- : /tmp/ruby/src/trunk/basictest/test.rb:string & char ..............................................................OK 62 I, [2024-05-03T21:42:22.192626 #2047952] INFO -- : /tmp/ruby/src/trunk/basictest/test.rb:assignment ..........OK 10 I, [2024-05-03T21:42:22.192652 #2047952] INFO -- : /tmp/ruby/src/trunk/basictest/test.rb:call ......OK 6 I, [2024-05-03T21:42:22.192705 #2047952] INFO -- : /tmp/ruby/src/trunk/basictest/test.rb:proc .........OK 9 I, [2024-05-03T21:42:22.293058 #2047952] INFO -- : /tmp/ruby/src/trunk/basictest/test.rb:signal ..OK 2 I, [2024-05-03T21:42:22.293536 #2047952] INFO -- : /tmp/ruby/src/trunk/basictest/test.rb:eval ...........................OK 27 I, [2024-05-03T21:42:22.394792 #2047952] INFO -- : /tmp/ruby/src/trunk/basictest/test.rb:system ........OK 8 I, [2024-05-03T21:42:22.394878 #2047952] INFO -- : /tmp/ruby/src/trunk/basictest/test.rb:const .....OK 5 I, [2024-05-03T21:42:22.394896 #2047952] INFO -- : /tmp/ruby/src/trunk/basictest/test.rb:clone .....OK 5 I, [2024-05-03T21:42:22.394911 #2047952] INFO -- : /tmp/ruby/src/trunk/basictest/test.rb:marshal ....OK 4 I, [2024-05-03T21:42:22.395026 #2047952] INFO -- : /tmp/ruby/src/trunk/basictest/test.rb:pack ....OK 4 I, [2024-05-03T21:42:22.395054 #2047952] INFO -- : /tmp/ruby/src/trunk/basictest/test.rb:math ..OK 2 I, [2024-05-03T21:42:22.395080 #2047952] INFO -- : /tmp/ruby/src/trunk/basictest/test.rb:struct ......OK 6 I, [2024-05-03T21:42:22.395113 #2047952] INFO -- : /tmp/ruby/src/trunk/basictest/test.rb:variable ............OK 12 I, [2024-05-03T21:42:22.395140 #2047952] INFO -- : /tmp/ruby/src/trunk/basictest/test.rb:trace ...OK 3 I, [2024-05-03T21:42:22.395197 #2047952] INFO -- : /tmp/ruby/src/trunk/basictest/test.rb:defined? ............OK 12 I, [2024-05-03T21:42:22.395299 #2047952] INFO -- : /tmp/ruby/src/trunk/basictest/test.rb:alias ......OK 6 I, [2024-05-03T21:42:22.395697 #2047952] INFO -- : /tmp/ruby/src/trunk/basictest/test.rb:path .......................OK 23 I, [2024-05-03T21:42:22.429624 #2047952] INFO -- : /tmp/ruby/src/trunk/basictest/test.rb:gc ....OK 4 I, [2024-05-03T21:42:22.432057 #2047952] INFO -- : I, [2024-05-03T21:42:22.432137 #2047952] INFO -- : test succeeded I, [2024-05-03T21:42:22.433265 #2047952] INFO -- : $$$[end] "make yes-test-basic TESTS='-j20'" exit with 0. I, [2024-05-03T21:42:22.433415 #2047952] INFO -- : $$$[beg] make yes-test-all TESTOPTS='--stderr-on-failure' TESTS='-j20' I, [2024-05-03T21:42:22.521451 #2047952] INFO -- : BASERUBY = /usr/bin/ruby --disable=gems I, [2024-05-03T21:42:22.521502 #2047952] INFO -- : CC = gcc I, [2024-05-03T21:42:22.521516 #2047952] INFO -- : LD = ld I, [2024-05-03T21:42:22.521528 #2047952] INFO -- : LDSHARED = gcc -shared I, [2024-05-03T21:42:22.521540 #2047952] INFO -- : CFLAGS = -O3 -fno-fast-math -ggdb3 -Wall -Wextra -Wdeprecated-declarations -Wdiv-by-zero -Wduplicated-cond -Wimplicit-function-declaration -Wimplicit-int -Wpointer-arith -Wwrite-strings -Wold-style-definition -Wimplicit-fallthrough=0 -Wmissing-noreturn -Wno-cast-function-type -Wno-constant-logical-operand -Wno-long-long -Wno-missing-field-initializers -Wno-overlength-strings -Wno-packed-bitfield-compat -Wno-parentheses-equality -Wno-self-assign -Wno-tautological-compare -Wno-unused-parameter -Wno-unused-value -Wsuggest-attribute=format -Wsuggest-attribute=noreturn -Wunused-variable -Wmisleading-indentation -Wundef -fPIC I, [2024-05-03T21:42:22.521553 #2047952] INFO -- : XCFLAGS = -U_FORTIFY_SOURCE -D_FORTIFY_SOURCE=2 -fstack-protector-strong -fno-strict-overflow -fvisibility=hidden -fexcess-precision=standard -DRUBY_EXPORT -I. -I.ext/include/x86_64-linux -I/tmp/ruby/src/trunk/include -I/tmp/ruby/src/trunk -I/tmp/ruby/src/trunk/prism -I/tmp/ruby/src/trunk/enc/unicode/15.0.0 I, [2024-05-03T21:42:22.521564 #2047952] INFO -- : CPPFLAGS = I, [2024-05-03T21:42:22.521574 #2047952] INFO -- : DLDFLAGS = -Wl,--compress-debug-sections=zlib -Wl,-soname,libruby.so.3.4 -fstack-protector-strong I, [2024-05-03T21:42:22.521584 #2047952] INFO -- : SOLIBS = -lz -lrt -lrt -lgmp -ldl -lcrypt -lm -lpthread I, [2024-05-03T21:42:22.521594 #2047952] INFO -- : LANG = en_US.UTF-8 I, [2024-05-03T21:42:22.521604 #2047952] INFO -- : LC_ALL = I, [2024-05-03T21:42:22.521613 #2047952] INFO -- : LC_CTYPE = I, [2024-05-03T21:42:22.521623 #2047952] INFO -- : MFLAGS = I, [2024-05-03T21:42:22.521633 #2047952] INFO -- : RUSTC = no I, [2024-05-03T21:42:22.521646 #2047952] INFO -- : YJIT_RUSTC_ARGS = --crate-name=yjit --crate-type=staticlib --edition=2021 -g -C lto=thin -C opt-level=3 -C overflow-checks=on '--out-dir=/tmp/ruby/build/trunk/yjit/target/release/' /tmp/ruby/src/trunk/yjit/src/lib.rs I, [2024-05-03T21:42:22.522095 #2047952] INFO -- : gcc (Ubuntu 11.4.0-1ubuntu1~22.04) 11.4.0 I, [2024-05-03T21:42:22.522146 #2047952] INFO -- : Copyright (C) 2021 Free Software Foundation, Inc. I, [2024-05-03T21:42:22.522159 #2047952] INFO -- : This is free software; see the source for copying conditions. There is NO I, [2024-05-03T21:42:22.522170 #2047952] INFO -- : warranty; not even for MERCHANTABILITY or FITNESS FOR A PARTICULAR PURPOSE. I, [2024-05-03T21:42:22.522181 #2047952] INFO -- : I, [2024-05-03T21:42:22.523850 #2047952] INFO -- : generating enc.mk I, [2024-05-03T21:42:22.643026 #2047952] INFO -- : making enc I, [2024-05-03T21:42:22.660346 #2047952] INFO -- : make[1]: Entering directory '/tmp/ruby/build/trunk' I, [2024-05-03T21:42:22.660411 #2047952] INFO -- : make[1]: Nothing to be done for 'enc'. I, [2024-05-03T21:42:22.660425 #2047952] INFO -- : make[1]: Leaving directory '/tmp/ruby/build/trunk' I, [2024-05-03T21:42:22.660926 #2047952] INFO -- : making srcs under enc I, [2024-05-03T21:42:22.690167 #2047952] INFO -- : make[1]: Entering directory '/tmp/ruby/build/trunk' I, [2024-05-03T21:42:22.690230 #2047952] INFO -- : make[1]: Nothing to be done for 'srcs'. I, [2024-05-03T21:42:22.690243 #2047952] INFO -- : make[1]: Leaving directory '/tmp/ruby/build/trunk' I, [2024-05-03T21:42:22.691062 #2047952] INFO -- : generating transdb.h I, [2024-05-03T21:42:22.785482 #2047952] INFO -- : transdb.h unchanged I, [2024-05-03T21:42:22.786769 #2047952] INFO -- : making trans I, [2024-05-03T21:42:22.820746 #2047952] INFO -- : make[1]: Entering directory '/tmp/ruby/build/trunk' I, [2024-05-03T21:42:22.820810 #2047952] INFO -- : make[1]: Nothing to be done for 'trans'. I, [2024-05-03T21:42:22.820823 #2047952] INFO -- : make[1]: Leaving directory '/tmp/ruby/build/trunk' I, [2024-05-03T21:42:22.821430 #2047952] INFO -- : making encs I, [2024-05-03T21:42:22.858758 #2047952] INFO -- : make[1]: Entering directory '/tmp/ruby/build/trunk' I, [2024-05-03T21:42:22.858822 #2047952] INFO -- : make[1]: Nothing to be done for 'encs'. I, [2024-05-03T21:42:22.858835 #2047952] INFO -- : make[1]: Leaving directory '/tmp/ruby/build/trunk' I, [2024-05-03T21:42:22.860483 #2047952] INFO -- : generating makefiles ext/configure-ext.mk I, [2024-05-03T21:42:22.887734 #2047952] INFO -- : ext/configure-ext.mk updated I, [2024-05-03T21:42:22.890041 #2047952] INFO -- : make[1]: Entering directory '/tmp/ruby/build/trunk' I, [2024-05-03T21:42:24.252680 #2047952] INFO -- : make[1]: Leaving directory '/tmp/ruby/build/trunk' I, [2024-05-03T21:42:24.253396 #2047952] INFO -- : generating makefile exts.mk I, [2024-05-03T21:42:24.290505 #2047952] INFO -- : exts.mk unchanged I, [2024-05-03T21:42:24.294999 #2047952] INFO -- : make[1]: Entering directory '/tmp/ruby/build/trunk' I, [2024-05-03T21:42:24.506521 #2047952] INFO -- : make[2]: Entering directory '/tmp/ruby/build/trunk/ext/coverage' I, [2024-05-03T21:42:24.509415 #2047952] INFO -- : make[2]: Leaving directory '/tmp/ruby/build/trunk/ext/coverage' I, [2024-05-03T21:42:24.513255 #2047952] INFO -- : make[2]: Entering directory '/tmp/ruby/build/trunk/ext/date' I, [2024-05-03T21:42:24.516426 #2047952] INFO -- : make[2]: Leaving directory '/tmp/ruby/build/trunk/ext/date' I, [2024-05-03T21:42:24.518588 #2047952] INFO -- : make[2]: Entering directory '/tmp/ruby/build/trunk/ext/digest' I, [2024-05-03T21:42:24.523956 #2047952] INFO -- : make[2]: Leaving directory '/tmp/ruby/build/trunk/ext/digest' I, [2024-05-03T21:42:24.539409 #2047952] INFO -- : make[2]: Entering directory '/tmp/ruby/build/trunk/ext/digest/sha2' I, [2024-05-03T21:42:24.542629 #2047952] INFO -- : make[2]: Leaving directory '/tmp/ruby/build/trunk/ext/digest/sha2' I, [2024-05-03T21:42:24.555515 #2047952] INFO -- : make[2]: Entering directory '/tmp/ruby/build/trunk/ext/fiddle' I, [2024-05-03T21:42:24.561855 #2047952] INFO -- : make[2]: Leaving directory '/tmp/ruby/build/trunk/ext/fiddle' I, [2024-05-03T21:42:24.564910 #2047952] INFO -- : make[2]: Entering directory '/tmp/ruby/build/trunk/ext/io/console' I, [2024-05-03T21:42:24.567507 #2047952] INFO -- : make[2]: Leaving directory '/tmp/ruby/build/trunk/ext/io/console' I, [2024-05-03T21:42:24.575139 #2047952] INFO -- : make[2]: Entering directory '/tmp/ruby/build/trunk/ext/json' I, [2024-05-03T21:42:24.581552 #2047952] INFO -- : make[2]: Leaving directory '/tmp/ruby/build/trunk/ext/json' I, [2024-05-03T21:42:24.590745 #2047952] INFO -- : make[2]: Entering directory '/tmp/ruby/build/trunk/ext/monitor' I, [2024-05-03T21:42:24.593172 #2047952] INFO -- : make[2]: Leaving directory '/tmp/ruby/build/trunk/ext/monitor' I, [2024-05-03T21:42:24.597346 #2047952] INFO -- : make[2]: Entering directory '/tmp/ruby/build/trunk/ext/objspace' I, [2024-05-03T21:42:24.600983 #2047952] INFO -- : make[2]: Leaving directory '/tmp/ruby/build/trunk/ext/objspace' I, [2024-05-03T21:42:24.612896 #2047952] INFO -- : make[2]: Entering directory '/tmp/ruby/build/trunk/ext/openssl' I, [2024-05-03T21:42:24.625964 #2047952] INFO -- : make[2]: Leaving directory '/tmp/ruby/build/trunk/ext/openssl' I, [2024-05-03T21:42:24.628967 #2047952] INFO -- : make[2]: Entering directory '/tmp/ruby/build/trunk/ext/pathname' I, [2024-05-03T21:42:24.631482 #2047952] INFO -- : make[2]: Leaving directory '/tmp/ruby/build/trunk/ext/pathname' I, [2024-05-03T21:42:24.635743 #2047952] INFO -- : make[2]: Entering directory '/tmp/ruby/build/trunk/ext/psych' I, [2024-05-03T21:42:24.650502 #2047952] INFO -- : make[2]: Leaving directory '/tmp/ruby/build/trunk/ext/psych' I, [2024-05-03T21:42:24.653568 #2047952] INFO -- : make[2]: Entering directory '/tmp/ruby/build/trunk/ext/pty' I, [2024-05-03T21:42:24.656093 #2047952] INFO -- : make[2]: Leaving directory '/tmp/ruby/build/trunk/ext/pty' I, [2024-05-03T21:42:24.665553 #2047952] INFO -- : make[2]: Entering directory '/tmp/ruby/build/trunk/ext/ripper' I, [2024-05-03T21:42:24.670562 #2047952] INFO -- : make[2]: Leaving directory '/tmp/ruby/build/trunk/ext/ripper' I, [2024-05-03T21:42:24.671965 #2047952] INFO -- : make[2]: Entering directory '/tmp/ruby/build/trunk/ext/rubyvm' I, [2024-05-03T21:42:24.673947 #2047952] INFO -- : make[2]: Leaving directory '/tmp/ruby/build/trunk/ext/rubyvm' I, [2024-05-03T21:42:24.681852 #2047952] INFO -- : make[2]: Entering directory '/tmp/ruby/build/trunk/ext/socket' I, [2024-05-03T21:42:24.688490 #2047952] INFO -- : make[2]: Leaving directory '/tmp/ruby/build/trunk/ext/socket' I, [2024-05-03T21:42:24.699359 #2047952] INFO -- : make[2]: Entering directory '/tmp/ruby/build/trunk/.bundle/gems/bigdecimal-3.1.7/ext/bigdecimal' I, [2024-05-03T21:42:24.722202 #2047952] INFO -- : make[2]: Leaving directory '/tmp/ruby/build/trunk/.bundle/gems/bigdecimal-3.1.7/ext/bigdecimal' I, [2024-05-03T21:42:24.724313 #2047952] INFO -- : make[2]: Entering directory '/tmp/ruby/build/trunk/.bundle/gems/debug-1.9.2/ext/debug' I, [2024-05-03T21:42:24.746313 #2047952] INFO -- : make[2]: Leaving directory '/tmp/ruby/build/trunk/.bundle/gems/debug-1.9.2/ext/debug' I, [2024-05-03T21:42:24.748399 #2047952] INFO -- : make[2]: Entering directory '/tmp/ruby/build/trunk/.bundle/gems/nkf-0.2.0/ext/nkf' I, [2024-05-03T21:42:24.770219 #2047952] INFO -- : make[2]: Leaving directory '/tmp/ruby/build/trunk/.bundle/gems/nkf-0.2.0/ext/nkf' I, [2024-05-03T21:42:24.772154 #2047952] INFO -- : make[2]: Entering directory '/tmp/ruby/build/trunk/.bundle/gems/racc-1.7.3/ext/racc/cparse' I, [2024-05-03T21:42:24.793910 #2047952] INFO -- : make[2]: Leaving directory '/tmp/ruby/build/trunk/.bundle/gems/racc-1.7.3/ext/racc/cparse' I, [2024-05-03T21:42:24.796356 #2047952] INFO -- : make[2]: Entering directory '/tmp/ruby/build/trunk/.bundle/gems/rbs-3.4.4/ext/rbs_extension' I, [2024-05-03T21:42:24.818467 #2047952] INFO -- : make[2]: Leaving directory '/tmp/ruby/build/trunk/.bundle/gems/rbs-3.4.4/ext/rbs_extension' I, [2024-05-03T21:42:24.820294 #2047952] INFO -- : make[2]: Entering directory '/tmp/ruby/build/trunk/.bundle/gems/syslog-0.1.2/ext/syslog' I, [2024-05-03T21:42:24.842146 #2047952] INFO -- : make[2]: Leaving directory '/tmp/ruby/build/trunk/.bundle/gems/syslog-0.1.2/ext/syslog' I, [2024-05-03T21:42:24.866205 #2047952] INFO -- : make[2]: Entering directory '/tmp/ruby/build/trunk' I, [2024-05-03T21:42:24.929952 #2047952] INFO -- : make[2]: 'ruby' is up to date. I, [2024-05-03T21:42:24.929998 #2047952] INFO -- : make[2]: Leaving directory '/tmp/ruby/build/trunk' I, [2024-05-03T21:42:24.930390 #2047952] INFO -- : make[1]: Leaving directory '/tmp/ruby/build/trunk' I, [2024-05-03T21:42:24.933866 #2047952] INFO -- : make[1]: Entering directory '/tmp/ruby/build/trunk' I, [2024-05-03T21:42:24.933887 #2047952] INFO -- : make[1]: Nothing to be done for 'note'. I, [2024-05-03T21:42:24.933893 #2047952] INFO -- : make[1]: Leaving directory '/tmp/ruby/build/trunk' I, [2024-05-03T21:42:25.010309 #2047952] INFO -- : Run options: I, [2024-05-03T21:42:25.010364 #2047952] INFO -- : --seed=46935 I, [2024-05-03T21:42:25.010371 #2047952] INFO -- : "--ruby=./miniruby -I/tmp/ruby/src/trunk/lib -I. -I.ext/common /tmp/ruby/src/trunk/tool/runruby.rb --extout=.ext -- --disable-gems" I, [2024-05-03T21:42:25.010389 #2047952] INFO -- : --excludes-dir=/tmp/ruby/src/trunk/test/.excludes I, [2024-05-03T21:42:25.010392 #2047952] INFO -- : --name=!/memory_leak/ I, [2024-05-03T21:42:25.010396 #2047952] INFO -- : --stderr-on-failure I, [2024-05-03T21:42:25.010400 #2047952] INFO -- : -j20 I, [2024-05-03T21:42:25.010403 #2047952] INFO -- : I, [2024-05-03T21:42:25.010407 #2047952] INFO -- : # Running tests: I, [2024-05-03T21:42:25.010410 #2047952] INFO -- : I, [2024-05-03T21:42:25.158426 #2047952] INFO -- : [ 1/885] 2089324=test_modify_expand I, [2024-05-03T21:42:25.158488 #2047952] INFO -- : [ 2/885] 2089309=test_rdoc_any_method I, [2024-05-03T21:42:25.158689 #2047952] INFO -- : [ 3/885] 2089311=test_gem_available_set I, [2024-05-03T21:42:25.158799 #2047952] INFO -- : [ 4/885] 2089310=test_rdoc_markdown I, [2024-05-03T21:42:25.159622 #2047952] INFO -- : [ 5/885] 2089308=test_file I, [2024-05-03T21:42:25.161798 #2047952] INFO -- : [ 6/885] 2089312=test_gem_package_tar_reader I, [2024-05-03T21:42:25.161976 #2047952] INFO -- : [ 7/885] 2089322=regexp_test I, [2024-05-03T21:42:25.162232 #2047952] INFO -- : [ 8/885] 2089323=test_rdoc_encoding I, [2024-05-03T21:42:25.162349 #2047952] INFO -- : [ 9/885] 2089320=test_coverage I, [2024-05-03T21:42:25.162439 #2047952] INFO -- : [ 10/885] 2089321=test_pathname I, [2024-05-03T21:42:25.168986 #2047952] INFO -- : [ 11/885] 2089325=test_complexrational I, [2024-05-03T21:42:25.174779 #2047952] INFO -- : [ 12/885] 2089324=test_init I, [2024-05-03T21:42:25.179285 #2047952] INFO -- : [ 13/885] 2089325=test_recorder I, [2024-05-03T21:42:25.180881 #2047952] INFO -- : [ 14/885] 2089308=test_gem_commands_owner_command I, [2024-05-03T21:42:25.192478 #2047952] INFO -- : [ 15/885] 2089317=test_gem_source_vendor I, [2024-05-03T21:42:25.192591 #2047952] INFO -- : [ 16/885] 2089319=test_rdoc_constant I, [2024-05-03T21:42:25.192681 #2047952] INFO -- : [ 17/885] 2089314=test_deprecate I, [2024-05-03T21:42:25.192779 #2047952] INFO -- : [ 18/885] 2089315=test_formatter I, [2024-05-03T21:42:25.192888 #2047952] INFO -- : [ 19/885] 2089316=test_bash_completion I, [2024-05-03T21:42:25.193233 #2047952] INFO -- : [ 20/885] 2089318=test_gem_commands_contents_command I, [2024-05-03T21:42:25.195141 #2047952] INFO -- : [ 21/885] 2089313=test_gem_ext_cmake_builder I, [2024-05-03T21:42:25.203295 #2047952] INFO -- : [ 22/885] 2089315=test_require I, [2024-05-03T21:42:25.207055 #2047952] INFO -- : [ 23/885] 2089316=test_cgi_util I, [2024-05-03T21:42:25.218141 #2047952] INFO -- : [ 24/885] 2089326=test_marshalable I, [2024-05-03T21:42:25.231162 #2047952] INFO -- : [ 25/885] 2089325=test_digest I, [2024-05-03T21:42:25.241416 #2047952] INFO -- : [ 26/885] 2089327=test_ractor I, [2024-05-03T21:42:25.246462 #2047952] INFO -- : [ 27/885] 2089322=test_find I, [2024-05-03T21:42:25.272516 #2047952] INFO -- : [ 28/885] 2089322=test_fiddle I, [2024-05-03T21:42:25.284313 #2047952] INFO -- : [ 29/885] 2089326=test_wss I, [2024-05-03T21:42:25.294327 #2047952] INFO -- : [ 30/885] 2089326=test_comparable I, [2024-05-03T21:42:25.299210 #2047952] INFO -- : [ 31/885] 2089326=test_rdoc_parser_c I, [2024-05-03T21:42:25.301628 #2047952] INFO -- : [ 32/885] 2089323=test_io_timeout I, [2024-05-03T21:42:25.302034 #2047952] INFO -- : [ 33/885] 2089322=json_fixtures_test I, [2024-05-03T21:42:25.314458 #2047952] INFO -- : [ 34/885] 2089322=test_shapes I, [2024-05-03T21:42:25.314521 #2047952] INFO -- : [ 35/885] 2089323=test_cstr I, [2024-05-03T21:42:25.320274 #2047952] INFO -- : [ 36/885] 2089322=test_pstore I, [2024-05-03T21:42:25.360336 #2047952] INFO -- : [ 37/885] 2089322=test_profile_frames I, [2024-05-03T21:42:25.372823 #2047952] INFO -- : [ 38/885] 2089312=test_class2name I, [2024-05-03T21:42:25.378427 #2047952] INFO -- : [ 39/885] 2089312=test_gbk I, [2024-05-03T21:42:25.381465 #2047952] INFO -- : [ 40/885] 2089312=test_enc_str_buf_cat I, [2024-05-03T21:42:25.389587 #2047952] INFO -- : [ 41/885] 2089312=test_forwardable I, [2024-05-03T21:42:25.397404 #2047952] INFO -- : [ 42/885] 2089321=test_yaml I, [2024-05-03T21:42:25.402431 #2047952] INFO -- : [ 43/885] 2089327=test_handle I, [2024-05-03T21:42:25.409246 #2047952] INFO -- : [ 44/885] 2089312=test_wait I, [2024-05-03T21:42:25.423722 #2047952] INFO -- : [ 45/885] 2089317=test_big2str I, [2024-05-03T21:42:25.426985 #2047952] INFO -- : [ 46/885] 2089317=test_ractor I, [2024-05-03T21:42:25.429046 #2047952] INFO -- : [ 47/885] 2089311=test_euc_tw I, [2024-05-03T21:42:25.429912 #2047952] INFO -- : [ 48/885] 2089313=test_bmethod I, [2024-05-03T21:42:25.431903 #2047952] INFO -- : [ 49/885] 2089311=test_gem_commands_sources_command I, [2024-05-03T21:42:25.431956 #2047952] INFO -- : [ 50/885] 2089314=test_ansi_without_terminfo I, [2024-05-03T21:42:25.433774 #2047952] INFO -- : [ 51/885] 2089313=test_thread_queue I, [2024-05-03T21:42:25.441524 #2047952] INFO -- : [ 52/885] 2089317=test_nowrite I, [2024-05-03T21:42:25.456559 #2047952] INFO -- : [ 53/885] 2089327=test_rdoc_markup_formatter I, [2024-05-03T21:42:25.466260 #2047952] INFO -- : [ 54/885] 2089310=test_rdoc_markup_verbatim I, [2024-05-03T21:42:25.468762 #2047952] INFO -- : [ 55/885] 2089310=test_inlinecache I, [2024-05-03T21:42:25.469349 #2047952] INFO -- : [ 56/885] 2089317=test_path_to_class I, [2024-05-03T21:42:25.473623 #2047952] INFO -- : [ 57/885] 2089317=test_gem_dependency I, [2024-05-03T21:42:25.484190 #2047952] INFO -- : [ 58/885] 2089316=test_gem_resolver_specification I, [2024-05-03T21:42:25.490033 #2047952] INFO -- : [ 59/885] 2089312=test_method_cache I, [2024-05-03T21:42:25.496525 #2047952] INFO -- : [ 60/885] 2089312=test_gem_stub_specification I, [2024-05-03T21:42:25.506732 #2047952] INFO -- : [ 61/885] 2089314=test_frozen_error I, [2024-05-03T21:42:25.509714 #2047952] INFO -- : [ 62/885] 2089314=test_gem_ext_ext_conf_builder I, [2024-05-03T21:42:25.510228 #2047952] INFO -- : [ 63/885] 2089321=test_complex I, [2024-05-03T21:42:25.517322 #2047952] INFO -- : [ 64/885] 2089318=test_gem_commands_search_command I, [2024-05-03T21:42:25.525457 #2047952] INFO -- : [ 65/885] 2089319=test_scanner_events I, [2024-05-03T21:42:25.526806 #2047952] INFO -- : [ 66/885] 2089318=test_gem_resolver_installed_specification I, [2024-05-03T21:42:25.550171 #2047952] INFO -- : [ 67/885] 2089322=test_parse I, [2024-05-03T21:42:25.560180 #2047952] INFO -- : [ 68/885] 2089323=test_mdns I, [2024-05-03T21:42:25.562775 #2047952] INFO -- : [ 69/885] 2089319=test_gem_remote_fetcher I, [2024-05-03T21:42:25.566887 #2047952] INFO -- : [ 70/885] 2089311=test_too_many_dummy_encodings I, [2024-05-03T21:42:25.568846 #2047952] INFO -- : [ 71/885] 2089318=test_reqarg I, [2024-05-03T21:42:25.574255 #2047952] INFO -- : [ 72/885] 2089310=test_rdoc_include I, [2024-05-03T21:42:25.576068 #2047952] INFO -- : [ 73/885] 2089327=test_stack I, [2024-05-03T21:42:25.585643 #2047952] INFO -- : [ 74/885] 2089323=test_gem_commands_list_command I, [2024-05-03T21:42:25.588642 #2047952] INFO -- : [ 75/885] 2089317=test_string_processing I, [2024-05-03T21:42:25.594481 #2047952] INFO -- : [ 76/885] 2089309=test_fileutils I, [2024-05-03T21:42:25.608083 #2047952] INFO -- : [ 77/885] 2089324=test_ldap I, [2024-05-03T21:42:25.628940 #2047952] INFO -- : [ 78/885] 2089324=test_gem_commands_signin_command I, [2024-05-03T21:42:25.638447 #2047952] INFO -- : [ 79/885] 2089311=test_resource I, [2024-05-03T21:42:25.646134 #2047952] INFO -- : [ 80/885] 2089312=test_emitter I, [2024-05-03T21:42:25.647997 #2047952] INFO -- : [ 81/885] 2089321=test_gem_version I, [2024-05-03T21:42:25.656633 #2047952] INFO -- : [ 82/885] 2089317=test_cesu8 I, [2024-05-03T21:42:25.658930 #2047952] INFO -- : [ 83/885] 2089317=test_econv I, [2024-05-03T21:42:25.662092 #2047952] INFO -- : [ 84/885] 2089311=test_rdoc_options I, [2024-05-03T21:42:25.666525 #2047952] INFO -- : [ 85/885] 2089312=test_tempfile I, [2024-05-03T21:42:25.673078 #2047952] INFO -- : [ 86/885] 2089310=test_noarg I, [2024-05-03T21:42:25.677053 #2047952] INFO -- : [ 87/885] 2089326=parse_comments_test I, [2024-05-03T21:42:25.745195 #2047952] INFO -- : [ 88/885] 2089326=test_queue I, [2024-05-03T21:42:25.757739 #2047952] INFO -- : [ 89/885] 2089316=test_function I, [2024-05-03T21:42:25.757975 #2047952] INFO -- : [ 90/885] 2089326=test_internal_ivar I, [2024-05-03T21:42:25.763701 #2047952] INFO -- : [ 91/885] 2089323=test_gem_resolver_index_specification I, [2024-05-03T21:42:25.766150 #2047952] INFO -- : [ 92/885] 2089326=test_duplicate I, [2024-05-03T21:42:25.768445 #2047952] INFO -- : [ 93/885] 2089326=test_basicsocket I, [2024-05-03T21:42:25.776966 #2047952] INFO -- : [ 94/885] 2089326=test_utf32 I, [2024-05-03T21:42:25.784098 #2047952] INFO -- : [ 95/885] 2089326=test_tracepoint I, [2024-05-03T21:42:25.834492 #2047952] INFO -- : [ 96/885] 2089310=test_prettyprint I, [2024-05-03T21:42:25.847744 #2047952] INFO -- : [ 97/885] 2089310=test_gem_commands_help_command I, [2024-05-03T21:42:25.850200 #2047952] INFO -- : [ 98/885] 2089323=test_rdoc_markup I, [2024-05-03T21:42:25.852151 #2047952] INFO -- : [ 99/885] 2089321=test_yamlstore I, [2024-05-03T21:42:25.857737 #2047952] INFO -- : [100/885] 2089321=test_gem_installer I, [2024-05-03T21:42:25.861480 #2047952] INFO -- : [101/885] 2089323=test_rdoc_parser_rd I, [2024-05-03T21:42:25.914152 #2047952] INFO -- : [102/885] 2089323=test_date_strftime I, [2024-05-03T21:42:25.946869 #2047952] INFO -- : [103/885] 2089312=test_irb I, [2024-05-03T21:42:25.954459 #2047952] INFO -- : [104/885] 2089318=test_load I, [2024-05-03T21:42:25.963781 #2047952] INFO -- : [105/885] 2089318=json_string_matching_test I, [2024-05-03T21:42:25.964559 #2047952] INFO -- : [106/885] 2089324=test_const I, [2024-05-03T21:42:25.968615 #2047952] INFO -- : [107/885] 2089309=test_rdoc_normal_class I, [2024-05-03T21:42:25.968858 #2047952] INFO -- : [108/885] 2089324=test_class I, [2024-05-03T21:42:25.973155 #2047952] INFO -- : [109/885] 2089308=test_asn1 I, [2024-05-03T21:42:25.981612 #2047952] INFO -- : [110/885] 2089318=test_random I, [2024-05-03T21:42:25.985838 #2047952] INFO -- : [111/885] 2089318=test_method I, [2024-05-03T21:42:25.989366 #2047952] INFO -- : [112/885] 2089316=test_gem_commands_query_command I, [2024-05-03T21:42:25.994303 #2047952] INFO -- : [113/885] 2089308=test_rdoc_rubygems_hook I, [2024-05-03T21:42:26.007755 #2047952] INFO -- : [114/885] 2089325=test_to_ruby I, [2024-05-03T21:42:26.016769 #2047952] INFO -- : [115/885] 2089325=test_pattern_key_name_check I, [2024-05-03T21:42:26.017597 #2047952] INFO -- : [116/885] 2089326=test_gem_impossible_dependencies_error I, [2024-05-03T21:42:26.026006 #2047952] INFO -- : [117/885] 2089325=test_array_create I, [2024-05-03T21:42:26.030098 #2047952] INFO -- : [118/885] 2089325=test_pack I, [2024-05-03T21:42:26.062050 #2047952] INFO -- : [119/885] 2089309=test_ftp I, [2024-05-03T21:42:26.080329 #2047952] INFO -- : [120/885] 2089322=test_rdoc_context_section I, [2024-05-03T21:42:26.082272 #2047952] INFO -- : [121/885] 2089320=test_euc_kr I, [2024-05-03T21:42:26.083963 #2047952] INFO -- : [122/885] 2089309=test_type_completor I, [2024-05-03T21:42:26.085476 #2047952] INFO -- : [123/885] 2089320=test_console_attr I, [2024-05-03T21:42:26.086400 #2047952] INFO -- : [124/885] 2089309=test_summary I, [2024-05-03T21:42:26.088935 #2047952] INFO -- : [125/885] 2089320=test_ellipsize I, [2024-05-03T21:42:26.101101 #2047952] INFO -- : [126/885] 2089320=test_date_attr I, [2024-05-03T21:42:26.120230 #2047952] INFO -- : [127/885] 2089320=test_gem_commands_exec_command I, [2024-05-03T21:42:26.163446 #2047952] INFO -- : [128/885] 2089311=test_io_wait I, [2024-05-03T21:42:26.173523 #2047952] INFO -- : [129/885] 2089326=test_kwargs I, [2024-05-03T21:42:26.183957 #2047952] INFO -- : [130/885] 2089326=warnings_test I, [2024-05-03T21:42:26.189044 #2047952] INFO -- : [131/885] 2089326=test_win32ole_type_event I, [2024-05-03T21:42:26.198412 #2047952] INFO -- : [132/885] 2089326=test_emoji I, [2024-05-03T21:42:26.204397 #2047952] INFO -- : [133/885] 2089309=test_sorted_set I, [2024-05-03T21:42:26.214073 #2047952] INFO -- : [134/885] 2089310=test_ubf_async_safe I, [2024-05-03T21:42:26.221178 #2047952] INFO -- : [135/885] 2089310=test_hash I, [2024-05-03T21:42:26.243404 #2047952] INFO -- : [136/885] 2089322=test_io I, [2024-05-03T21:42:26.244795 #2047952] INFO -- : [137/885] 2089326=test_cp949 I, [2024-05-03T21:42:26.250963 #2047952] INFO -- : [138/885] 2089326=test_foreach I, [2024-05-03T21:42:26.255321 #2047952] INFO -- : [139/885] 2089325=test_gem_source_specific_file I, [2024-05-03T21:42:26.257035 #2047952] INFO -- : [140/885] 2089323=test_condition I, [2024-05-03T21:42:26.260562 #2047952] INFO -- : [141/885] 2089323=test_gem_commands_uninstall_command I, [2024-05-03T21:42:26.260629 #2047952] INFO -- : [142/885] 2089312=test_gem_unsatisfiable_dependency_error I, [2024-05-03T21:42:26.272243 #2047952] INFO -- : [143/885] 2089312=test_win32ole_record I, [2024-05-03T21:42:26.275347 #2047952] INFO -- : [144/885] 2089308=test_raise_exception I, [2024-05-03T21:42:26.278494 #2047952] INFO -- : [145/885] 2089326=test_gem_request_set_lockfile I, [2024-05-03T21:42:26.278960 #2047952] INFO -- : [146/885] 2089312=test_win32ole_typelib I, [2024-05-03T21:42:26.282108 #2047952] INFO -- : [147/885] 2089312=test_protect I, [2024-05-03T21:42:26.284967 #2047952] INFO -- : [148/885] 2089312=test_hash I, [2024-05-03T21:42:26.299685 #2047952] INFO -- : [149/885] 2089312=test_tree_builder I, [2024-05-03T21:42:26.306660 #2047952] INFO -- : [150/885] 2089312=test_gem_resolver_dependency_request I, [2024-05-03T21:42:26.313628 #2047952] INFO -- : [151/885] 2089327=test_external_new I, [2024-05-03T21:42:26.318457 #2047952] INFO -- : [152/885] 2089327=test_alias_and_anchor I, [2024-05-03T21:42:26.330090 #2047952] INFO -- : [153/885] 2089312=test_postponed_job I, [2024-05-03T21:42:26.344471 #2047952] INFO -- : [154/885] 2089327=test_ws I, [2024-05-03T21:42:26.364332 #2047952] INFO -- : [155/885] 2089327=test_m17n I, [2024-05-03T21:42:26.427950 #2047952] INFO -- : [156/885] 2089327=test_gem_commands_environment_command I, [2024-05-03T21:42:26.452989 #2047952] INFO -- : [157/885] 2089309=test_weakmap I, [2024-05-03T21:42:26.468438 #2047952] INFO -- : [158/885] 2089316=test_workspace I, [2024-05-03T21:42:26.497458 #2047952] INFO -- : [159/885] 2089311=test_yjit I, [2024-05-03T21:42:26.507083 #2047952] INFO -- : [160/885] 2089311=test_ns_spki I, [2024-05-03T21:42:26.527237 #2047952] INFO -- : [161/885] 2089322=test_framework I, [2024-05-03T21:42:26.553393 #2047952] INFO -- : [162/885] 2089322=test_kill_ring I, [2024-05-03T21:42:26.557496 #2047952] INFO -- : [163/885] 2089311=test_argf I, [2024-05-03T21:42:26.582251 #2047952] INFO -- : [164/885] 2089325=test_line_editor I, [2024-05-03T21:42:26.588016 #2047952] INFO -- : [165/885] 2089315=test_objspace I, [2024-05-03T21:42:26.611034 #2047952] INFO -- : [166/885] 2089322=ripper_test I, [2024-05-03T21:42:26.629169 #2047952] INFO -- : [167/885] 2089326=test_undef I, [2024-05-03T21:42:26.631157 #2047952] INFO -- : [168/885] 2089326=test_string_memory I, [2024-05-03T21:42:26.637255 #2047952] INFO -- : [169/885] 2089327=test_sprintf I, [2024-05-03T21:42:26.652671 #2047952] INFO -- : [170/885] 2089325=test_gem_requirement I, [2024-05-03T21:42:26.682889 #2047952] INFO -- : [171/885] 2089314=comments_test I, [2024-05-03T21:42:26.700459 #2047952] INFO -- : [172/885] 2089326=test_gem_security_trust_dir I, [2024-05-03T21:42:26.700520 #2047952] INFO -- : [173/885] 2089316=test_show_source I, [2024-05-03T21:42:26.710854 #2047952] INFO -- : [174/885] 2089316=test_set I, [2024-05-03T21:42:26.719618 #2047952] INFO -- : [175/885] 2089316=test_gem_commands_stale_command I, [2024-05-03T21:42:26.727053 #2047952] INFO -- : [176/885] 2089312=test_lock_native_thread I, [2024-05-03T21:42:26.727113 #2047952] INFO -- : [177/885] 2089316=test_c_struct_entry I, [2024-05-03T21:42:26.729482 #2047952] INFO -- : [178/885] 2089326=test_have_library I, [2024-05-03T21:42:26.784492 #2047952] INFO -- : [179/885] 2089317=test_remote_fetch_error I, [2024-05-03T21:42:26.788289 #2047952] INFO -- : [180/885] 2089314=test_array I, [2024-05-03T21:42:26.799415 #2047952] INFO -- : [181/885] 2089325=test_optparse I, [2024-05-03T21:42:26.801133 #2047952] INFO -- : [182/885] 2089317=test_fstring I, [2024-05-03T21:42:26.829357 #2047952] INFO -- : [183/885] 2089314=test_rdoc_markup_to_html_crossref I, [2024-05-03T21:42:26.864126 #2047952] INFO -- : [184/885] 2089325=test_typeddata I, [2024-05-03T21:42:26.881702 #2047952] INFO -- : [185/885] 2089323=encoding_test I, [2024-05-03T21:42:26.899680 #2047952] INFO -- : [186/885] 2089327=test_gem_resolver_best_set I, [2024-05-03T21:42:26.904683 #2047952] INFO -- : [187/885] 2089316=test_rat I, [2024-05-03T21:42:26.911156 #2047952] INFO -- : [188/885] 2089316=test_rdoc_markup_raw I, [2024-05-03T21:42:26.954422 #2047952] INFO -- : [189/885] 2089327=test_webauthn_poller I, [2024-05-03T21:42:26.959104 #2047952] INFO -- : [190/885] 2089317=test_stringscanner I, [2024-05-03T21:42:26.983759 #2047952] INFO -- : [191/885] 2089308=test_files_sample I, [2024-05-03T21:42:26.995552 #2047952] INFO -- : [192/885] 2089317=test_rdoc_alias I, [2024-05-03T21:42:27.034232 #2047952] INFO -- : [193/885] 2089312=test_yield I, [2024-05-03T21:42:27.034304 #2047952] INFO -- : [194/885] 2089316=parser_test I, [2024-05-03T21:42:27.034315 #2047952] INFO -- : [195/885] 2089323=test_convertible I, [2024-05-03T21:42:27.067278 #2047952] INFO -- : [196/885] 2089308=test_gem_resolver_conflict I, [2024-05-03T21:42:27.081176 #2047952] INFO -- : [197/885] 2089308=test_rdoc_task I, [2024-05-03T21:42:27.093337 #2047952] INFO -- : [198/885] 2089308=test_io_buffer I, [2024-05-03T21:42:27.095536 #2047952] INFO -- : [199/885] 2089316=test_pack I, [2024-05-03T21:42:27.096652 #2047952] INFO -- : [200/885] 2089327=test_backtrace I, [2024-05-03T21:42:27.121508 #2047952] INFO -- : [201/885] 2089316=ruby_parser_test I, [2024-05-03T21:42:27.123882 #2047952] INFO -- : [202/885] 2089316=test_rdoc_markup_indented_paragraph I, [2024-05-03T21:42:27.128299 #2047952] INFO -- : [203/885] 2089316=test_rdoc_require I, [2024-05-03T21:42:27.129640 #2047952] INFO -- : [204/885] 2089325=locals_test I, [2024-05-03T21:42:27.175378 #2047952] INFO -- : [205/885] 2089316=test_readpartial I, [2024-05-03T21:42:27.196334 #2047952] INFO -- : [206/885] 2089322=test_gem_commands_install_command I, [2024-05-03T21:42:27.225055 #2047952] INFO -- : [207/885] 2089308=test_clone I, [2024-05-03T21:42:27.248356 #2047952] INFO -- : [208/885] 2089317=test_yaml_tree I, [2024-05-03T21:42:27.295511 #2047952] INFO -- : [209/885] 2089317=test_sleep I, [2024-05-03T21:42:27.329926 #2047952] INFO -- : [210/885] 2089320=test_config I, [2024-05-03T21:42:27.365806 #2047952] INFO -- : [211/885] 2089320=test_libs I, [2024-05-03T21:42:27.370767 #2047952] INFO -- : [212/885] 2089308=test_gc I, [2024-05-03T21:42:27.374016 #2047952] INFO -- : [213/885] 2089308=test_gem_commands_fetch_command I, [2024-05-03T21:42:27.374240 #2047952] INFO -- : [214/885] 2089314=test_math I, [2024-05-03T21:42:27.386286 #2047952] INFO -- : [215/885] 2089314=test_io I, [2024-05-03T21:42:27.390062 #2047952] INFO -- : [216/885] 2089320=test_unicode_escape I, [2024-05-03T21:42:27.468193 #2047952] INFO -- : [217/885] 2089320=test_autoload I, [2024-05-03T21:42:27.567062 #2047952] INFO -- : [218/885] 2089325=test_utf16 I, [2024-05-03T21:42:27.574178 #2047952] INFO -- : [219/885] 2089308=test_rendering I, [2024-05-03T21:42:27.581739 #2047952] INFO -- : [220/885] 2089316=test_case I, [2024-05-03T21:42:27.582847 #2047952] INFO -- : [221/885] 2089325=test_sizeof I, [2024-05-03T21:42:27.636234 #2047952] INFO -- : [222/885] 2089316=test_face I, [2024-05-03T21:42:27.658127 #2047952] INFO -- : [223/885] 2089316=test_system I, [2024-05-03T21:42:27.697425 #2047952] INFO -- : [224/885] 2089308=test_pkcs12 I, [2024-05-03T21:42:27.820692 #2047952] INFO -- : [225/885] 2089319=test_gem_package_tar_header I, [2024-05-03T21:42:27.861425 #2047952] INFO -- : [226/885] 2089319=test_iseq_load I, [2024-05-03T21:42:27.906334 #2047952] INFO -- : [227/885] 2089309=test_gem_util I, [2024-05-03T21:42:27.911457 #2047952] INFO -- : [228/885] 2089326=test_bigzero I, [2024-05-03T21:42:27.911530 #2047952] INFO -- : [229/885] 2089326=test_pkey_dh I, [2024-05-03T21:42:27.993188 #2047952] INFO -- : [230/885] 2089326=test_protocol I, [2024-05-03T21:42:28.260762 #2047952] INFO -- : [231/885] 2089324=test_getopts I, [2024-05-03T21:42:28.261639 #2047952] INFO -- : [232/885] 2089308=test_gem_resolver_activation_request I, [2024-05-03T21:42:28.263970 #2047952] INFO -- : [233/885] 2089324=test_gem_config_file I, [2024-05-03T21:42:28.274445 #2047952] INFO -- : [234/885] 2089309=test_ripper I, [2024-05-03T21:42:28.274854 #2047952] INFO -- : [235/885] 2089308=test_etc I, [2024-05-03T21:42:28.301163 #2047952] INFO -- : [236/885] 2089326=test_yjit_exit_locations I, [2024-05-03T21:42:28.302181 #2047952] INFO -- : [237/885] 2089326=test_rdoc_i18n_text I, [2024-05-03T21:42:28.310159 #2047952] INFO -- : [238/885] 2089326=test_key_name_check I, [2024-05-03T21:42:28.319799 #2047952] INFO -- : [239/885] 2089326=test_backtrace I, [2024-05-03T21:42:28.324186 #2047952] INFO -- : [240/885] 2089326=test_defined I, [2024-05-03T21:42:28.355076 #2047952] INFO -- : [241/885] 2089327=test_io_buffer I, [2024-05-03T21:42:28.371215 #2047952] INFO -- : [242/885] 2089308=test_rdoc_rdoc I, [2024-05-03T21:42:28.401011 #2047952] INFO -- : [243/885] 2089324=test_time I, [2024-05-03T21:42:28.405416 #2047952] INFO -- : [244/885] 2089326=test_windows_1251 I, [2024-05-03T21:42:28.409223 #2047952] INFO -- : [245/885] 2089327=test_buffering I, [2024-05-03T21:42:28.414126 #2047952] INFO -- : [246/885] 2089326=test_svcb_https I, [2024-05-03T21:42:28.418123 #2047952] INFO -- : [247/885] 2089327=test_gb18030 I, [2024-05-03T21:42:28.426322 #2047952] INFO -- : [248/885] 2089327=test_gem_uninstaller I, [2024-05-03T21:42:28.434999 #2047952] INFO -- : [249/885] 2089326=test_rdoc_markup_to_rdoc I, [2024-05-03T21:42:28.464539 #2047952] INFO -- : [250/885] 2089308=test_rdoc_rd_inline_parser I, [2024-05-03T21:42:28.478167 #2047952] INFO -- : [251/885] 2089326=test_default_gems I, [2024-05-03T21:42:28.485032 #2047952] INFO -- : [252/885] 2089308=test_null I, [2024-05-03T21:42:28.494408 #2047952] INFO -- : [253/885] 2089308=test_win32ole_type I, [2024-05-03T21:42:28.498506 #2047952] INFO -- : [254/885] 2089308=test_mul I, [2024-05-03T21:42:28.504936 #2047952] INFO -- : [255/885] 2089308=test_rdoc_markup_attributes I, [2024-05-03T21:42:28.508564 #2047952] INFO -- : [256/885] 2089308=test_date_parse I, [2024-05-03T21:42:28.526892 #2047952] INFO -- : [257/885] 2089324=test_pkey_ec I, [2024-05-03T21:42:28.544883 #2047952] INFO -- : [258/885] 2089326=test_pipe I, [2024-05-03T21:42:28.581664 #2047952] INFO -- : [259/885] 2089319=test_thread I, [2024-05-03T21:42:28.581730 #2047952] INFO -- : [260/885] 2089319=test_trick I, [2024-05-03T21:42:28.604524 #2047952] INFO -- : [261/885] 2089324=test_string I, [2024-05-03T21:42:28.646252 #2047952] INFO -- : [262/885] 2089324=test_pattern_matching I, [2024-05-03T21:42:28.662301 #2047952] INFO -- : [263/885] 2089309=test_rdoc_stats I, [2024-05-03T21:42:28.667475 #2047952] INFO -- : [264/885] 2089324=test_depth_first I, [2024-05-03T21:42:28.669033 #2047952] INFO -- : [265/885] 2089324=test_gem_request_set_lockfile_parser I, [2024-05-03T21:42:28.670787 #2047952] INFO -- : [266/885] 2089308=test_x509attr I, [2024-05-03T21:42:28.676551 #2047952] INFO -- : [267/885] 2089308=test_raise I, [2024-05-03T21:42:28.678763 #2047952] INFO -- : [268/885] 2089308=test_rdoc_store I, [2024-05-03T21:42:28.683840 #2047952] INFO -- : [269/885] 2089316=test_custom_command I, [2024-05-03T21:42:28.684879 #2047952] INFO -- : [270/885] 2089326=json_addition_test I, [2024-05-03T21:42:28.688276 #2047952] INFO -- : [271/885] 2089316=test_qsort I, [2024-05-03T21:42:28.691686 #2047952] INFO -- : [272/885] 2089316=test_rdoc_parser I, [2024-05-03T21:42:28.696700 #2047952] INFO -- : [273/885] 2089309=test_gem_dependency_resolution_error I, [2024-05-03T21:42:28.701644 #2047952] INFO -- : [274/885] 2089309=test_ole_methods I, [2024-05-03T21:42:28.703682 #2047952] INFO -- : [275/885] 2089309=test_erb_m17n I, [2024-05-03T21:42:28.707481 #2047952] INFO -- : [276/885] 2089326=test_optimization I, [2024-05-03T21:42:28.709462 #2047952] INFO -- : [277/885] 2089309=test_date_conv I, [2024-05-03T21:42:28.713276 #2047952] INFO -- : [278/885] 2089316=test_zlib I, [2024-05-03T21:42:28.715512 #2047952] INFO -- : [279/885] 2089309=test_cgi_tag_helper I, [2024-05-03T21:42:28.731633 #2047952] INFO -- : [280/885] 2089309=test_egrep_cpp I, [2024-05-03T21:42:28.733121 #2047952] INFO -- : [281/885] 2089322=test_gem_resolver_index_set I, [2024-05-03T21:42:28.764461 #2047952] INFO -- : [282/885] 2089322=test_gem_package_old I, [2024-05-03T21:42:28.778815 #2047952] INFO -- : [283/885] 2089324=test_string I, [2024-05-03T21:42:28.807602 #2047952] INFO -- : [284/885] 2089322=test_proc I, [2024-05-03T21:42:28.861025 #2047952] INFO -- : [285/885] 2089318=test_gc_compact I, [2024-05-03T21:42:28.877032 #2047952] INFO -- : [286/885] 2089309=test_gem_validator I, [2024-05-03T21:42:28.948867 #2047952] INFO -- : [287/885] 2089309=test_fnmatch I, [2024-05-03T21:42:28.991656 #2047952] INFO -- : [288/885] 2089309=test_files_test_2 I, [2024-05-03T21:42:29.160280 #2047952] INFO -- : [289/885] 2089312=test_folderitem2_invokeverb I, [2024-05-03T21:42:29.167299 #2047952] INFO -- : [290/885] 2089312=test_rdoc_markup_parser I, [2024-05-03T21:42:29.309688 #2047952] INFO -- : [291/885] 2089312=test_require_path_check I, [2024-05-03T21:42:29.344556 #2047952] INFO -- : [292/885] 2089308=test_address_resolve I, [2024-05-03T21:42:29.350041 #2047952] INFO -- : [293/885] 2089317=test_rdoc_token_stream I, [2024-05-03T21:42:29.357700 #2047952] INFO -- : [294/885] 2089317=test_yaml_special_cases I, [2024-05-03T21:42:29.360795 #2047952] INFO -- : [295/885] 2089312=test_optarg I, [2024-05-03T21:42:29.364404 #2047952] INFO -- : [296/885] 2089308=test_gem_source_list I, [2024-05-03T21:42:29.364470 #2047952] INFO -- : [297/885] 2089317=test_config I, [2024-05-03T21:42:29.384112 #2047952] INFO -- : [298/885] 2089317=test_macro I, [2024-05-03T21:42:29.406413 #2047952] INFO -- : [299/885] 2089317=test_pp I, [2024-05-03T21:42:29.415643 #2047952] INFO -- : [300/885] 2089308=test_frozen I, [2024-05-03T21:42:29.420830 #2047952] INFO -- : [301/885] 2089308=test_gem_ext_configure_builder I, [2024-05-03T21:42:29.439490 #2047952] INFO -- : [302/885] 2089317=test_verbose I, [2024-05-03T21:42:29.456894 #2047952] INFO -- : [303/885] 2089317=test_nil I, [2024-05-03T21:42:29.458093 #2047952] INFO -- : [304/885] 2089317=test_num2int I, [2024-05-03T21:42:29.468721 #2047952] INFO -- : [305/885] 2089317=test_rdoc_single_class I, [2024-05-03T21:42:29.472651 #2047952] INFO -- : [306/885] 2089317=test_exception I, [2024-05-03T21:42:29.482925 #2047952] INFO -- : [307/885] 2089317=test_zsh_completion I, [2024-05-03T21:42:29.486004 #2047952] INFO -- : [308/885] 2089317=test_iter_break I, [2024-05-03T21:42:29.489700 #2047952] INFO -- : [309/885] 2089317=test_rdoc_markup_to_tt_only I, [2024-05-03T21:42:29.493891 #2047952] INFO -- : [310/885] 2089312=test_hmac I, [2024-05-03T21:42:29.505982 #2047952] INFO -- : [311/885] 2089312=test_rdoc_tom_doc I, [2024-05-03T21:42:29.515000 #2047952] INFO -- : [312/885] 2089317=test_assignment I, [2024-05-03T21:42:29.522361 #2047952] INFO -- : [313/885] 2089327=test_ifunless I, [2024-05-03T21:42:29.526401 #2047952] INFO -- : [314/885] 2089327=test_gem_commands_lock_command I, [2024-05-03T21:42:29.533739 #2047952] INFO -- : [315/885] 2089312=test_numeric I, [2024-05-03T21:42:29.541862 #2047952] INFO -- : [316/885] 2089308=test_common I, [2024-05-03T21:42:29.551764 #2047952] INFO -- : [317/885] 2089327=test_gem_spec_fetcher I, [2024-05-03T21:42:29.610891 #2047952] INFO -- : [318/885] 2089312=test_gem_command I, [2024-05-03T21:42:29.645466 #2047952] INFO -- : [319/885] 2089322=test_bug-3571 I, [2024-05-03T21:42:29.658597 #2047952] INFO -- : [320/885] 2089322=test_key_actor_vi I, [2024-05-03T21:42:29.722155 #2047952] INFO -- : [321/885] 2089312=test_rdoc_markup_paragraph I, [2024-05-03T21:42:29.727446 #2047952] INFO -- : [322/885] 2089312=test_psych I, [2024-05-03T21:42:29.734015 #2047952] INFO -- : [323/885] 2089327=test_enc_raise I, [2024-05-03T21:42:29.735155 #2047952] INFO -- : [324/885] 2089313=!Nothing_to_test I, [2024-05-03T21:42:29.736263 #2047952] INFO -- : [325/885] 2089313=test_object_create_start I, [2024-05-03T21:42:29.739183 #2047952] INFO -- : [326/885] 2089327=test_at_exit I, [2024-05-03T21:42:29.739500 #2047952] INFO -- : [327/885] 2089313=test_command I, [2024-05-03T21:42:29.757963 #2047952] INFO -- : [328/885] 2089322=test_gem_rdoc I, [2024-05-03T21:42:29.761850 #2047952] INFO -- : [329/885] 2089312=test_date I, [2024-05-03T21:42:29.763459 #2047952] INFO -- : [330/885] 2089327=test_gem_ext_cargo_builder_unit I, [2024-05-03T21:42:29.765136 #2047952] INFO -- : [331/885] 2089308=test_files_ext I, [2024-05-03T21:42:29.767136 #2047952] INFO -- : [332/885] 2089308=test_bug-5832 I, [2024-05-03T21:42:29.768710 #2047952] INFO -- : [333/885] 2089312=test_gem_silent_ui I, [2024-05-03T21:42:29.773131 #2047952] INFO -- : [334/885] 2089308=test_emitter I, [2024-05-03T21:42:29.777817 #2047952] INFO -- : [335/885] 2089308=test_gem_doctor I, [2024-05-03T21:42:29.791360 #2047952] INFO -- : [336/885] 2089327=test_kdf I, [2024-05-03T21:42:29.813801 #2047952] INFO -- : [337/885] 2089312=dispatcher_test I, [2024-05-03T21:42:29.824590 #2047952] INFO -- : [338/885] 2089308=test_eval_history I, [2024-05-03T21:42:29.837262 #2047952] INFO -- : [339/885] 2089308=test_kernel I, [2024-05-03T21:42:29.867524 #2047952] INFO -- : [340/885] 2089322=test_rdoc_parser_ruby I, [2024-05-03T21:42:29.871620 #2047952] INFO -- : [341/885] 2089327=test_open-uri I, [2024-05-03T21:42:29.902024 #2047952] INFO -- : [342/885] 2089312=test_httpresponse I, [2024-05-03T21:42:30.040422 #2047952] INFO -- : [343/885] 2089312=test_stream I, [2024-05-03T21:42:30.047988 #2047952] INFO -- : [344/885] 2089312=test_nil2vtempty I, [2024-05-03T21:42:30.052073 #2047952] INFO -- : [345/885] 2089312=test_rdoc_context I, [2024-05-03T21:42:30.298177 #2047952] INFO -- : [346/885] 2089313=test_rdoc_text I, [2024-05-03T21:42:30.389276 #2047952] INFO -- : [347/885] 2089308=test_iso_8859 I, [2024-05-03T21:42:30.427184 #2047952] INFO -- : [348/885] 2089308=test_tcp I, [2024-05-03T21:42:30.455627 #2047952] INFO -- : [349/885] 2089313=test_data I, [2024-05-03T21:42:30.465193 #2047952] INFO -- : [350/885] 2089322=test_date_new I, [2024-05-03T21:42:30.466729 #2047952] INFO -- : [351/885] 2089321=index_write_test I, [2024-05-03T21:42:30.470472 #2047952] INFO -- : [352/885] 2089313=test_date_time I, [2024-05-03T21:42:30.476823 #2047952] INFO -- : [353/885] 2089322=test_rdoc_markup_to_joined_paragraph I, [2024-05-03T21:42:30.481093 #2047952] INFO -- : [354/885] 2089322=test_require I, [2024-05-03T21:42:30.481624 #2047952] INFO -- : [355/885] 2089322=test_gem_safe_yaml I, [2024-05-03T21:42:30.492699 #2047952] INFO -- : [356/885] 2089322=test_syntax I, [2024-05-03T21:42:30.512558 #2047952] INFO -- : [357/885] 2089313=test_enumerator I, [2024-05-03T21:42:30.553159 #2047952] INFO -- : [358/885] 2089321=test_inadvertent_creation I, [2024-05-03T21:42:30.566237 #2047952] INFO -- : [359/885] 2089308=test_flags I, [2024-05-03T21:42:30.619660 #2047952] INFO -- : [360/885] 2089310=test_shift_jis I, [2024-05-03T21:42:30.625465 #2047952] INFO -- : [361/885] 2089310=test_gem_commands_which_command I, [2024-05-03T21:42:30.654452 #2047952] INFO -- : [362/885] 2089321=test_http I, [2024-05-03T21:42:30.670053 #2047952] INFO -- : [363/885] 2089321=test_gem_commands_specification_command I, [2024-05-03T21:42:30.670685 #2047952] INFO -- : [364/885] 2089310=test_safe_load I, [2024-05-03T21:42:30.685871 #2047952] INFO -- : [365/885] 2089310=test_gem_resolver_composed_set I, [2024-05-03T21:42:30.698666 #2047952] INFO -- : [366/885] 2089310=test_gem_resolver I, [2024-05-03T21:42:30.743228 #2047952] INFO -- : [367/885] 2089327=test_gem_commands_dependency_command I, [2024-05-03T21:42:30.757057 #2047952] INFO -- : [368/885] 2089317=test_rdoc_markup_attribute_manager I, [2024-05-03T21:42:30.776929 #2047952] INFO -- : [369/885] 2089311=test_name_error I, [2024-05-03T21:42:30.793447 #2047952] INFO -- : [370/885] 2089321=test_pack I, [2024-05-03T21:42:30.804087 #2047952] INFO -- : [371/885] 2089317=test_process I, [2024-05-03T21:42:30.818588 #2047952] INFO -- : [372/885] 2089327=test_last_thread I, [2024-05-03T21:42:30.885058 #2047952] INFO -- : [373/885] 2089325=test_gem_source_local I, [2024-05-03T21:42:30.890583 #2047952] INFO -- : [374/885] 2089311=test_gem_security_policy I, [2024-05-03T21:42:30.922609 #2047952] INFO -- : [375/885] 2089319=test_logdevice I, [2024-05-03T21:42:30.937858 #2047952] INFO -- : [376/885] 2089310=test_gem_ext_rake_builder I, [2024-05-03T21:42:31.017796 #2047952] INFO -- : [377/885] 2089321=test_arity I, [2024-05-03T21:42:31.019598 #2047952] INFO -- : [378/885] 2089321=test_gc I, [2024-05-03T21:42:31.034253 #2047952] INFO -- : [379/885] 2089312=test_x509cert I, [2024-05-03T21:42:31.149382 #2047952] INFO -- : [380/885] 2089325=test_err_in_callback I, [2024-05-03T21:42:31.153795 #2047952] INFO -- : [381/885] 2089325=test_gem_resolver_lock_specification I, [2024-05-03T21:42:31.187467 #2047952] INFO -- : [382/885] 2089325=test_rdoc_markdown_test I, [2024-05-03T21:42:31.225698 #2047952] INFO -- : [383/885] 2089311=test_c_union_entity I, [2024-05-03T21:42:31.260563 #2047952] INFO -- : [384/885] 2089311=test_rdoc_normal_module I, [2024-05-03T21:42:31.331227 #2047952] INFO -- : [385/885] 2089311=test_logperiod I, [2024-05-03T21:42:31.334650 #2047952] INFO -- : [386/885] 2089312=test_securerandom I, [2024-05-03T21:42:31.341652 #2047952] INFO -- : [387/885] 2089311=test_switch_hitter I, [2024-05-03T21:42:31.357776 #2047952] INFO -- : [388/885] 2089311=test_io_console I, [2024-05-03T21:42:31.385031 #2047952] INFO -- : [389/885] 2089312=test_singleton I, [2024-05-03T21:42:31.397436 #2047952] INFO -- : [390/885] 2089312=test_flush I, [2024-05-03T21:42:31.399166 #2047952] INFO -- : [391/885] 2089312=test_hash_create I, [2024-05-03T21:42:31.403940 #2047952] INFO -- : [392/885] 2089312=test_stringchar I, [2024-05-03T21:42:31.507213 #2047952] INFO -- : [393/885] 2089312=test_uncorrectable_name_check I, [2024-05-03T21:42:31.512634 #2047952] INFO -- : [394/885] 2089312=newline_test I, [2024-05-03T21:42:31.550640 #2047952] INFO -- : [395/885] 2089318=test_thread_fd_close I, [2024-05-03T21:42:31.555570 #2047952] INFO -- : [396/885] 2089318=test_passing_block I, [2024-05-03T21:42:31.560367 #2047952] INFO -- : [397/885] 2089318=test_require_lib I, [2024-05-03T21:42:31.570778 #2047952] INFO -- : [398/885] 2089310=parse_test I, [2024-05-03T21:42:31.595606 #2047952] INFO -- : [399/885] 2089312=test_gem_install_update_options I, [2024-05-03T21:42:31.721202 #2047952] INFO -- : [400/885] 2089312=test_severity I, [2024-05-03T21:42:31.736575 #2047952] INFO -- : [401/885] 2089312=test_ractor I, [2024-05-03T21:42:31.755820 #2047952] INFO -- : [402/885] 2089308=test_gem_stream_ui I, [2024-05-03T21:42:31.760880 #2047952] INFO -- : [403/885] 2089312=test_extlibs I, [2024-05-03T21:42:31.830246 #2047952] INFO -- : [404/885] 2089319=test_rdoc_generator_ri I, [2024-05-03T21:42:31.833896 #2047952] INFO -- : [405/885] 2089319=test_str2big I, [2024-05-03T21:42:31.837522 #2047952] INFO -- : [406/885] 2089319=test_c_struct_builder I, [2024-05-03T21:42:31.847535 #2047952] INFO -- : [407/885] 2089308=test_dot_dot I, [2024-05-03T21:42:31.852388 #2047952] INFO -- : [408/885] 2089308=test_literal I, [2024-05-03T21:42:31.888324 #2047952] INFO -- : [409/885] 2089327=test_socket I, [2024-05-03T21:42:31.958091 #2047952] INFO -- : [410/885] 2089319=test_thread I, [2024-05-03T21:42:32.179619 #2047952] INFO -- : [411/885] 2089319=test_objectspace I, [2024-05-03T21:42:32.236559 #2047952] INFO -- : [412/885] 2089309=test_rdoc_markup_to_table_of_contents I, [2024-05-03T21:42:32.245530 #2047952] INFO -- : [413/885] 2089325=test_reline I, [2024-05-03T21:42:32.263091 #2047952] INFO -- : [414/885] 2089309=test_parser_events I, [2024-05-03T21:42:32.275638 #2047952] INFO -- : [415/885] 2089323=test_pkey I, [2024-05-03T21:42:32.322750 #2047952] INFO -- : [416/885] 2089309=test_case I, [2024-05-03T21:42:32.322816 #2047952] INFO -- : [417/885] 2089309=test_gem_request_connection_pools I, [2024-05-03T21:42:32.343009 #2047952] INFO -- : [418/885] 2089323=test_gem_version_option I, [2024-05-03T21:42:32.372711 #2047952] INFO -- : [419/885] 2089325=test_grapheme_breaks I, [2024-05-03T21:42:32.385716 #2047952] INFO -- : [420/885] 2089323=test_cclass I, [2024-05-03T21:42:32.421145 #2047952] INFO -- : [421/885] 2089325=test_ractor I, [2024-05-03T21:42:32.436783 #2047952] INFO -- : [422/885] 2089308=test_memory_view I, [2024-05-03T21:42:32.477139 #2047952] INFO -- : [423/885] 2089325=test_m17n_comb I, [2024-05-03T21:42:32.518803 #2047952] INFO -- : [424/885] 2089316=test_json_tree I, [2024-05-03T21:42:32.524549 #2047952] INFO -- : [425/885] 2089316=test_rdoc_markup_to_markdown I, [2024-05-03T21:42:32.544692 #2047952] INFO -- : [426/885] 2089323=test_rdoc_generator_pot_po I, [2024-05-03T21:42:32.546946 #2047952] INFO -- : [427/885] 2089323=test_ansi_with_terminfo I, [2024-05-03T21:42:32.576030 #2047952] INFO -- : [428/885] 2089316=test_gem_ext_cargo_builder_link_flag_converter I, [2024-05-03T21:42:32.589181 #2047952] INFO -- : [429/885] 2089323=test_gem_commands_mirror I, [2024-05-03T21:42:32.593411 #2047952] INFO -- : [430/885] 2089323=test_sprintf_comb I, [2024-05-03T21:42:32.629963 #2047952] INFO -- : [431/885] 2089308=test_gem_request I, [2024-05-03T21:42:32.639945 #2047952] INFO -- : [432/885] 2089316=test_method_cache I, [2024-05-03T21:42:32.641208 #2047952] INFO -- : [433/885] 2089316=test_scan_args I, [2024-05-03T21:42:32.652231 #2047952] INFO -- : [434/885] 2089316=test_generic I, [2024-05-03T21:42:32.695071 #2047952] INFO -- : [435/885] 2089316=test_win32ole I, [2024-05-03T21:42:32.699996 #2047952] INFO -- : [436/885] 2089316=test_gem_text I, [2024-05-03T21:42:32.706360 #2047952] INFO -- : [437/885] 2089323=test_settracefunc I, [2024-05-03T21:42:32.738297 #2047952] INFO -- : [438/885] 2089316=test_enumerator_kw I, [2024-05-03T21:42:32.740342 #2047952] INFO -- : [439/885] 2089316=test_scalar I, [2024-05-03T21:42:32.743810 #2047952] INFO -- : [440/885] 2089316=test_gem_dependency_installer I, [2024-05-03T21:42:32.827203 #2047952] INFO -- : [441/885] 2089308=test_gem_commands_info_command I, [2024-05-03T21:42:32.846682 #2047952] INFO -- : [442/885] 2089308=test_rdoc_cross_reference I, [2024-05-03T21:42:33.038090 #2047952] INFO -- : [443/885] 2089319=test_store I, [2024-05-03T21:42:33.142947 #2047952] INFO -- : [444/885] 2089319=test_case_options I, [2024-05-03T21:42:33.146792 #2047952] INFO -- : [445/885] 2089319=test_exception I, [2024-05-03T21:42:33.219574 #2047952] INFO -- : [446/885] 2089308=test_rand I, [2024-05-03T21:42:33.360681 #2047952] INFO -- : [447/885] 2089309=test_gem_name_tuple I, [2024-05-03T21:42:33.369653 #2047952] INFO -- : [448/885] 2089309=test_gem_package_tar_reader_entry I, [2024-05-03T21:42:33.388998 #2047952] INFO -- : [449/885] 2089327=test_bug_reporter I, [2024-05-03T21:42:33.519539 #2047952] INFO -- : [450/885] 2089309=test_thread I, [2024-05-03T21:42:33.530749 #2047952] INFO -- : [451/885] 2089308=json_ext_parser_test I, [2024-05-03T21:42:33.537163 #2047952] INFO -- : [452/885] 2089308=test_my_integer I, [2024-05-03T21:42:33.544657 #2047952] INFO -- : [453/885] 2089308=test_debugger_integration I, [2024-05-03T21:42:33.554919 #2047952] INFO -- : [454/885] 2089308=test_rendering I, [2024-05-03T21:42:33.567087 #2047952] INFO -- : [455/885] 2089308=test_ractor I, [2024-05-03T21:42:33.609676 #2047952] INFO -- : [456/885] 2089320=test_ssl I, [2024-05-03T21:42:33.669336 #2047952] INFO -- : [457/885] 2089312=test_rb_str_dup I, [2024-05-03T21:42:33.672589 #2047952] INFO -- : [458/885] 2089312=test_reline_key I, [2024-05-03T21:42:33.708418 #2047952] INFO -- : [459/885] 2089323=test_singleton_function I, [2024-05-03T21:42:33.711124 #2047952] INFO -- : [460/885] 2089323=test_ancdata I, [2024-05-03T21:42:33.713784 #2047952] INFO -- : [461/885] 2089312=test_alias I, [2024-05-03T21:42:33.731847 #2047952] INFO -- : [462/885] 2089323=test_timeout I, [2024-05-03T21:42:33.762638 #2047952] INFO -- : [463/885] 2089327=test_unicode_normalize I, [2024-05-03T21:42:33.860397 #2047952] INFO -- : [464/885] 2089312=test_marshal I, [2024-05-03T21:42:33.970885 #2047952] INFO -- : [465/885] 2089311=test_nonblock I, [2024-05-03T21:42:33.980630 #2047952] INFO -- : [466/885] 2089311=test_weakref I, [2024-05-03T21:42:34.036423 #2047952] INFO -- : [467/885] 2089308=test_parser I, [2024-05-03T21:42:34.038687 #2047952] INFO -- : [468/885] 2089308=test_cgi_core I, [2024-05-03T21:42:34.052617 #2047952] INFO -- : [469/885] 2089308=test_gem_source_lock I, [2024-05-03T21:42:34.113998 #2047952] INFO -- : [470/885] 2089308=test_gem I, [2024-05-03T21:42:34.120505 #2047952] INFO -- : [471/885] 2089311=test_gem_commands_open_command I, [2024-05-03T21:42:34.185240 #2047952] INFO -- : [472/885] 2089315=test_dns I, [2024-05-03T21:42:34.208612 #2047952] INFO -- : [473/885] 2089311=test_ractor I, [2024-05-03T21:42:34.222219 #2047952] INFO -- : [474/885] 2089311=parse_stream_test I, [2024-05-03T21:42:34.259538 #2047952] INFO -- : [475/885] 2089320=test_registry I, [2024-05-03T21:42:34.261287 #2047952] INFO -- : [476/885] 2089320=test_dryrun I, [2024-05-03T21:42:34.277624 #2047952] INFO -- : [477/885] 2089310=desugar_compiler_test I, [2024-05-03T21:42:34.287237 #2047952] INFO -- : [478/885] 2089320=test_integer I, [2024-05-03T21:42:34.289757 #2047952] INFO -- : [479/885] 2089311=test_env I, [2024-05-03T21:42:34.292752 #2047952] INFO -- : [480/885] 2089310=test_rdoc_attr I, [2024-05-03T21:42:34.302064 #2047952] INFO -- : [481/885] 2089310=test_gem_commands_setup_command I, [2024-05-03T21:42:34.353609 #2047952] INFO -- : [482/885] 2089320=test_https_proxy I, [2024-05-03T21:42:34.361958 #2047952] INFO -- : [483/885] 2089320=test_call I, [2024-05-03T21:42:34.513649 #2047952] INFO -- : [484/885] 2089320=test_rubygems I, [2024-05-03T21:42:34.524507 #2047952] INFO -- : [485/885] 2089323=test_super I, [2024-05-03T21:42:34.694330 #2047952] INFO -- : [486/885] 2089312=test_rubyoptions I, [2024-05-03T21:42:34.706800 #2047952] INFO -- : [487/885] 2089320=test_cgi_modruby I, [2024-05-03T21:42:34.715037 #2047952] INFO -- : [488/885] 2089320=test_integer I, [2024-05-03T21:42:34.732714 #2047952] INFO -- : [489/885] 2089315=test_object_references I, [2024-05-03T21:42:34.733811 #2047952] INFO -- : [490/885] 2089315=test_usrmarshal I, [2024-05-03T21:42:34.785206 #2047952] INFO -- : [491/885] 2089314=test_gem_resolver_git_specification I, [2024-05-03T21:42:34.897131 #2047952] INFO -- : [492/885] 2089310=test_stat I, [2024-05-03T21:42:34.903357 #2047952] INFO -- : [493/885] 2089310=test_gem_request_set_lockfile_tokenizer I, [2024-05-03T21:42:34.946457 #2047952] INFO -- : [494/885] 2089315=test_have_func I, [2024-05-03T21:42:34.970452 #2047952] INFO -- : [495/885] 2089310=test_nextafter I, [2024-05-03T21:42:35.039735 #2047952] INFO -- : [496/885] 2089310=test_capacity I, [2024-05-03T21:42:35.043876 #2047952] INFO -- : [497/885] 2089310=test_function_entry I, [2024-05-03T21:42:35.045126 #2047952] INFO -- : [498/885] 2089310=test_pkcs7 I, [2024-05-03T21:42:35.050434 #2047952] INFO -- : [499/885] 2089318=test_gem_resolver_requirement_list I, [2024-05-03T21:42:35.062564 #2047952] INFO -- : [500/885] 2089318=test_arith_seq_beg_len_step I, [2024-05-03T21:42:35.120165 #2047952] INFO -- : [501/885] 2089318=test_unix I, [2024-05-03T21:42:35.124520 #2047952] INFO -- : [502/885] 2089319=test_enc_associate I, [2024-05-03T21:42:35.145320 #2047952] INFO -- : [503/885] 2089318=test_lazy_enumerator I, [2024-05-03T21:42:35.158890 #2047952] INFO -- : [504/885] 2089314=ruby_api_test I, [2024-05-03T21:42:35.194841 #2047952] INFO -- : [505/885] 2089323=test_find_executable I, [2024-05-03T21:42:35.202131 #2047952] INFO -- : [506/885] 2089323=test_symbol I, [2024-05-03T21:42:35.216263 #2047952] INFO -- : [507/885] 2089310=test_coder I, [2024-05-03T21:42:35.221444 #2047952] INFO -- : [508/885] 2089310=test_nofree I, [2024-05-03T21:42:35.226094 #2047952] INFO -- : [509/885] 2089310=test_context I, [2024-05-03T21:42:35.258590 #2047952] INFO -- : [510/885] 2089316=test_gem_commands_pristine_command I, [2024-05-03T21:42:35.349509 #2047952] INFO -- : [511/885] 2089314=test_numeric I, [2024-05-03T21:42:35.354630 #2047952] INFO -- : [512/885] 2089314=test_member I, [2024-05-03T21:42:35.356743 #2047952] INFO -- : [513/885] 2089314=test_word I, [2024-05-03T21:42:35.359821 #2047952] INFO -- : [514/885] 2089314=test_gem_commands_cleanup_command I, [2024-05-03T21:42:35.415201 #2047952] INFO -- : [515/885] 2089310=test_cgi_multipart I, [2024-05-03T21:42:35.488784 #2047952] INFO -- : [516/885] 2089325=test_ractor_compatibility I, [2024-05-03T21:42:35.494134 #2047952] INFO -- : [517/885] 2089318=test_eval I, [2024-05-03T21:42:35.497263 #2047952] INFO -- : [518/885] 2089318=test_autoconf I, [2024-05-03T21:42:35.506663 #2047952] INFO -- : [519/885] 2089318=format_errors_test I, [2024-05-03T21:42:35.574162 #2047952] INFO -- : [520/885] 2089318=test_dir I, [2024-05-03T21:42:35.617126 #2047952] INFO -- : [521/885] 2089319=test_date_ractor I, [2024-05-03T21:42:35.637064 #2047952] INFO -- : [522/885] 2089310=test_gem_console_ui I, [2024-05-03T21:42:35.647122 #2047952] INFO -- : [523/885] 2089310=test_coderange I, [2024-05-03T21:42:35.647193 #2047952] INFO -- : [524/885] 2089310=test_symbol I, [2024-05-03T21:42:35.654030 #2047952] INFO -- : [525/885] 2089310=location_test I, [2024-05-03T21:42:35.709873 #2047952] INFO -- : [526/885] 2089310=test_mailto I, [2024-05-03T21:42:35.734394 #2047952] INFO -- : [527/885] 2089310=test_rdoc_generator_darkfish I, [2024-05-03T21:42:35.750604 #2047952] INFO -- : [528/885] 2089326=test_resize I, [2024-05-03T21:42:35.766692 #2047952] INFO -- : [529/885] 2089326=test_error_highlight I, [2024-05-03T21:42:35.859988 #2047952] INFO -- : [530/885] 2089318=test_rdoc_comment I, [2024-05-03T21:42:35.899162 #2047952] INFO -- : [531/885] 2089319=test_gem_source_fetch_problem I, [2024-05-03T21:42:35.929797 #2047952] INFO -- : [532/885] 2089319=json_generic_object_test I, [2024-05-03T21:42:35.947726 #2047952] INFO -- : [533/885] 2089325=test_http_request I, [2024-05-03T21:42:35.947800 #2047952] INFO -- : [534/885] 2089319=test_merge_keys I, [2024-05-03T21:42:35.964546 #2047952] INFO -- : [535/885] 2089319=test_rdoc_extend I, [2024-05-03T21:42:35.990394 #2047952] INFO -- : [536/885] 2089314=test_win32ole_variant I, [2024-05-03T21:42:35.993161 #2047952] INFO -- : [537/885] 2089319=test_ipaddr I, [2024-05-03T21:42:35.994444 #2047952] INFO -- : [538/885] 2089325=test_rdoc_markup_to_ansi I, [2024-05-03T21:42:35.999099 #2047952] INFO -- : [539/885] 2089314=test_history I, [2024-05-03T21:42:36.019462 #2047952] INFO -- : [540/885] 2089314=test_mixed_unicode_escapes I, [2024-05-03T21:42:36.026182 #2047952] INFO -- : [541/885] 2089319=test_gem_resolver_api_specification I, [2024-05-03T21:42:36.038010 #2047952] INFO -- : [542/885] 2089314=ractor_test I, [2024-05-03T21:42:36.043845 #2047952] INFO -- : [543/885] 2089325=test_trace I, [2024-05-03T21:42:36.052929 #2047952] INFO -- : [544/885] 2089318=test_rdoc_generator_json_index I, [2024-05-03T21:42:36.059359 #2047952] INFO -- : [545/885] 2089325=test_win32ole_event I, [2024-05-03T21:42:36.064057 #2047952] INFO -- : [546/885] 2089325=test_time_tz I, [2024-05-03T21:42:36.074458 #2047952] INFO -- : [547/885] 2089319=test_gem_ci_detector I, [2024-05-03T21:42:36.085418 #2047952] INFO -- : [548/885] 2089319=test_bignum I, [2024-05-03T21:42:36.120262 #2047952] INFO -- : [549/885] 2089314=test_rdoc_class_module I, [2024-05-03T21:42:36.131427 #2047952] INFO -- : [550/885] 2089318=test_win32ole_variable I, [2024-05-03T21:42:36.148750 #2047952] INFO -- : [551/885] 2089318=test_io_wait_uncommon I, [2024-05-03T21:42:36.168095 #2047952] INFO -- : [552/885] 2089310=test_arity I, [2024-05-03T21:42:36.169051 #2047952] INFO -- : [553/885] 2089318=test_stringio I, [2024-05-03T21:42:36.172663 #2047952] INFO -- : [554/885] 2089325=test_gem_specification I, [2024-05-03T21:42:36.173171 #2047952] INFO -- : [555/885] 2089308=test_enum I, [2024-05-03T21:42:36.184692 #2047952] INFO -- : [556/885] 2089310=test_threadgroup I, [2024-05-03T21:42:36.230467 #2047952] INFO -- : [557/885] 2089319=test_have_macro I, [2024-05-03T21:42:36.278661 #2047952] INFO -- : [558/885] 2089318=test_complex2 I, [2024-05-03T21:42:36.284642 #2047952] INFO -- : [559/885] 2089326=test_resolve_symbol I, [2024-05-03T21:42:36.289733 #2047952] INFO -- : [560/885] 2089318=test_gem_package I, [2024-05-03T21:42:36.363364 #2047952] INFO -- : [561/885] 2089326=test_change_word I, [2024-05-03T21:42:36.369453 #2047952] INFO -- : [562/885] 2089326=test_flip I, [2024-05-03T21:42:36.402601 #2047952] INFO -- : [563/885] 2089326=compiler_test I, [2024-05-03T21:42:36.408342 #2047952] INFO -- : [564/885] 2089326=test_timeout I, [2024-05-03T21:42:36.411765 #2047952] INFO -- : [565/885] 2089326=test_normalize I, [2024-05-03T21:42:36.411911 #2047952] INFO -- : [566/885] 2089326=test_ossl I, [2024-05-03T21:42:36.547007 #2047952] INFO -- : [567/885] 2089314=test_ruby_lex I, [2024-05-03T21:42:36.573560 #2047952] INFO -- : [568/885] 2089316=test_object I, [2024-05-03T21:42:36.667950 #2047952] INFO -- : [569/885] 2089315=test_date_arith I, [2024-05-03T21:42:36.674972 #2047952] INFO -- : [570/885] 2089314=test_gem_local_remote_options I, [2024-05-03T21:42:36.678300 #2047952] INFO -- : [571/885] 2089315=test_sleep I, [2024-05-03T21:42:36.709065 #2047952] INFO -- : [572/885] 2089314=test_ractor I, [2024-05-03T21:42:36.753518 #2047952] INFO -- : [573/885] 2089319=test_type I, [2024-05-03T21:42:36.760715 #2047952] INFO -- : [574/885] 2089319=test_pointer I, [2024-05-03T21:42:36.767075 #2047952] INFO -- : [575/885] 2089314=test_big5 I, [2024-05-03T21:42:36.771281 #2047952] INFO -- : [576/885] 2089314=test_func I, [2024-05-03T21:42:36.865672 #2047952] INFO -- : [577/885] 2089318=test_rdoc_rd_block_parser I, [2024-05-03T21:42:36.897386 #2047952] INFO -- : [578/885] 2089318=test_signedness I, [2024-05-03T21:42:36.981111 #2047952] INFO -- : [579/885] 2089316=test_tsort I, [2024-05-03T21:42:36.988937 #2047952] INFO -- : [580/885] 2089316=heredoc_dedent_test I, [2024-05-03T21:42:36.993423 #2047952] INFO -- : [581/885] 2089316=test_cgi_header I, [2024-05-03T21:42:36.999592 #2047952] INFO -- : [582/885] 2089316=test_object I, [2024-05-03T21:42:37.002471 #2047952] INFO -- : [583/885] 2089316=version_test I, [2024-05-03T21:42:37.007155 #2047952] INFO -- : [584/885] 2089316=test_key_actor_emacs I, [2024-05-03T21:42:37.104515 #2047952] INFO -- : [585/885] 2089316=test_basicinstructions I, [2024-05-03T21:42:37.158064 #2047952] INFO -- : [586/885] 2089313=test_gem_gemcutter_utilities I, [2024-05-03T21:42:37.166657 #2047952] INFO -- : [587/885] 2089308=test_gem_command_manager I, [2024-05-03T21:42:37.175539 #2047952] INFO -- : [588/885] 2089316=test_arithmetic_sequence I, [2024-05-03T21:42:37.184256 #2047952] INFO -- : [589/885] 2089319=test_file_exhaustive I, [2024-05-03T21:42:37.194624 #2047952] INFO -- : [590/885] 2089316=test_gem_update_suggestion I, [2024-05-03T21:42:37.195288 #2047952] INFO -- : [591/885] 2089310=test_files_test I, [2024-05-03T21:42:37.277660 #2047952] INFO -- : [592/885] 2089316=test_logger I, [2024-05-03T21:42:37.288366 #2047952] INFO -- : [593/885] 2089311=test_import I, [2024-05-03T21:42:37.295377 #2047952] INFO -- : [594/885] 2089310=test_not I, [2024-05-03T21:42:37.298886 #2047952] INFO -- : [595/885] 2089310=test_gem_resolver_lock_set I, [2024-05-03T21:42:37.321403 #2047952] INFO -- : [596/885] 2089310=test_rdoc_parser_markdown I, [2024-05-03T21:42:37.327010 #2047952] INFO -- : [597/885] 2089308=test_pkey_rsa I, [2024-05-03T21:42:37.330822 #2047952] INFO -- : [598/885] 2089316=test_gem_commands_push_command I, [2024-05-03T21:42:37.334405 #2047952] INFO -- : [599/885] 2089310=test_weakkeymap I, [2024-05-03T21:42:37.407097 #2047952] INFO -- : [600/885] 2089323=test_numhash I, [2024-05-03T21:42:37.413458 #2047952] INFO -- : [601/885] 2089323=test_placearg I, [2024-05-03T21:42:37.485026 #2047952] INFO -- : [602/885] 2089323=test_gem_package_task I, [2024-05-03T21:42:37.491041 #2047952] INFO -- : [603/885] 2089323=test_date_strptime I, [2024-05-03T21:42:37.524652 #2047952] INFO -- : [604/885] 2089313=test_rdoc_markup_hard_break I, [2024-05-03T21:42:37.531181 #2047952] INFO -- : [605/885] 2089313=test_gem_platform I, [2024-05-03T21:42:37.571207 #2047952] INFO -- : [606/885] 2089308=test_delete I, [2024-05-03T21:42:37.574321 #2047952] INFO -- : [607/885] 2089308=test_win32ole_method I, [2024-05-03T21:42:37.580542 #2047952] INFO -- : [608/885] 2089308=test_fd_setsize I, [2024-05-03T21:42:37.581626 #2047952] INFO -- : [609/885] 2089308=test_continuation I, [2024-05-03T21:42:37.586878 #2047952] INFO -- : [610/885] 2089323=test_class_name_check I, [2024-05-03T21:42:37.586936 #2047952] INFO -- : [611/885] 2089308=test_keyword I, [2024-05-03T21:42:37.631159 #2047952] INFO -- : [612/885] 2089323=test_rdoc_code_object I, [2024-05-03T21:42:37.634316 #2047952] INFO -- : [613/885] 2089313=test_x509store I, [2024-05-03T21:42:37.694421 #2047952] INFO -- : [614/885] 2089310=test_update I, [2024-05-03T21:42:37.699534 #2047952] INFO -- : [615/885] 2089310=test_x509name I, [2024-05-03T21:42:37.704418 #2047952] INFO -- : [616/885] 2089310=test_fips I, [2024-05-03T21:42:37.835498 #2047952] INFO -- : [617/885] 2089316=test_ast I, [2024-05-03T21:42:37.929502 #2047952] INFO -- : [618/885] 2089310=test_gem_request_set_gem_dependency_api I, [2024-05-03T21:42:37.965275 #2047952] INFO -- : [619/885] 2089322=test_lambda I, [2024-05-03T21:42:37.968734 #2047952] INFO -- : [620/885] 2089323=test_helper I, [2024-05-03T21:42:37.968799 #2047952] INFO -- : [621/885] 2089323=test_random_formatter I, [2024-05-03T21:42:37.983366 #2047952] INFO -- : [622/885] 2089323=test_jaro_winkler I, [2024-05-03T21:42:37.987247 #2047952] INFO -- : [623/885] 2089323=test_webauthn_listener I, [2024-05-03T21:42:37.996887 #2047952] INFO -- : [624/885] 2089324=test_config I, [2024-05-03T21:42:38.031434 #2047952] INFO -- : [625/885] 2089322=test_gem_resolver_vendor_set I, [2024-05-03T21:42:38.046232 #2047952] INFO -- : [626/885] 2089313=test_enumerable I, [2024-05-03T21:42:38.057984 #2047952] INFO -- : [627/885] 2089313=test_gem_safe_marshal I, [2024-05-03T21:42:38.058047 #2047952] INFO -- : [628/885] 2089322=test_gem_resolver_api_set I, [2024-05-03T21:42:38.058057 #2047952] INFO -- : [629/885] 2089323=test_transcode I, [2024-05-03T21:42:38.087140 #2047952] INFO -- : [630/885] 2089311=test_eval I, [2024-05-03T21:42:38.109650 #2047952] INFO -- : [631/885] 2089322=json_generator_test I, [2024-05-03T21:42:38.127921 #2047952] INFO -- : [632/885] 2089310=test_gem_uri_formatter I, [2024-05-03T21:42:38.142200 #2047952] INFO -- : [633/885] 2089310=test_erb_command I, [2024-05-03T21:42:38.143806 #2047952] INFO -- : [634/885] 2089308=test_helper I, [2024-05-03T21:42:38.143867 #2047952] INFO -- : [635/885] 2089308=test_encoding I, [2024-05-03T21:42:38.200677 #2047952] INFO -- : [636/885] 2089310=test_range I, [2024-05-03T21:42:38.206982 #2047952] INFO -- : [637/885] 2089322=test_project_sanity I, [2024-05-03T21:42:38.265063 #2047952] INFO -- : [638/885] 2089322=command_line_test I, [2024-05-03T21:42:38.269488 #2047952] INFO -- : [639/885] 2089322=test_constant I, [2024-05-03T21:42:38.271433 #2047952] INFO -- : [640/885] 2089323=test_dup I, [2024-05-03T21:42:38.328745 #2047952] INFO -- : [641/885] 2089311=test_pty I, [2024-05-03T21:42:38.359010 #2047952] INFO -- : [642/885] 2089308=test_rdoc_ri_paths I, [2024-05-03T21:42:38.378360 #2047952] INFO -- : [643/885] 2089308=test_ts I, [2024-05-03T21:42:38.458211 #2047952] INFO -- : [644/885] 2089323=test_ensured I, [2024-05-03T21:42:38.471251 #2047952] INFO -- : [645/885] 2089324=test_locale I, [2024-05-03T21:42:38.490757 #2047952] INFO -- : [646/885] 2089324=test_addr I, [2024-05-03T21:42:38.515753 #2047952] INFO -- : [647/885] 2089324=library_symbols_test I, [2024-05-03T21:42:38.536324 #2047952] INFO -- : [648/885] 2089323=errors_test I, [2024-05-03T21:42:38.536583 #2047952] INFO -- : [649/885] 2089327=test_gem_commands_check_command I, [2024-05-03T21:42:38.567195 #2047952] INFO -- : [650/885] 2089327=test_regexp I, [2024-05-03T21:42:38.580327 #2047952] INFO -- : [651/885] 2089324=test_vm_dump I, [2024-05-03T21:42:38.582369 #2047952] INFO -- : [652/885] 2089324=test_integer_comb I, [2024-05-03T21:42:38.667316 #2047952] INFO -- : [653/885] 2089323=test_rdoc_markup_document I, [2024-05-03T21:42:38.675683 #2047952] INFO -- : [654/885] 2089313=test_tmpdir I, [2024-05-03T21:42:38.679293 #2047952] INFO -- : [655/885] 2089323=bom_test I, [2024-05-03T21:42:38.691358 #2047952] INFO -- : [656/885] 2089323=test_data_error I, [2024-05-03T21:42:38.771366 #2047952] INFO -- : [657/885] 2089313=unescape_test I, [2024-05-03T21:42:38.775656 #2047952] INFO -- : [658/885] 2089323=test_ostruct I, [2024-05-03T21:42:38.785890 #2047952] INFO -- : [659/885] 2089325=test_force_exit I, [2024-05-03T21:42:38.830681 #2047952] INFO -- : [660/885] 2089311=test_file I, [2024-05-03T21:42:38.837421 #2047952] INFO -- : [661/885] 2089325=test_udp I, [2024-05-03T21:42:38.839088 #2047952] INFO -- : [662/885] 2089308=static_inspect_test I, [2024-05-03T21:42:38.845909 #2047952] INFO -- : [663/885] 2089325=test_delegate I, [2024-05-03T21:42:38.862257 #2047952] INFO -- : [664/885] 2089325=test_popen_deadlock I, [2024-05-03T21:42:38.893294 #2047952] INFO -- : [665/885] 2089308=test_history I, [2024-05-03T21:42:38.910868 #2047952] INFO -- : [666/885] 2089308=test_date_marshal I, [2024-05-03T21:42:38.915468 #2047952] INFO -- : [667/885] 2089308=test_mkmf I, [2024-05-03T21:42:38.938358 #2047952] INFO -- : [668/885] 2089308=test_recursion I, [2024-05-03T21:42:38.945458 #2047952] INFO -- : [669/885] 2089308=test_exit I, [2024-05-03T21:42:38.946226 #2047952] INFO -- : [670/885] 2089314=test_digest I, [2024-05-03T21:42:38.964502 #2047952] INFO -- : [671/885] 2089314=test_ractor I, [2024-05-03T21:42:38.978928 #2047952] INFO -- : [672/885] 2089323=test_rdoc_servlet I, [2024-05-03T21:42:39.009300 #2047952] INFO -- : [673/885] 2089310=test_gem_security I, [2024-05-03T21:42:39.022778 #2047952] INFO -- : [674/885] 2089308=test_fiber I, [2024-05-03T21:42:39.058594 #2047952] INFO -- : [675/885] 2089314=test_multi_irb_commands I, [2024-05-03T21:42:39.061118 #2047952] INFO -- : [676/885] 2089314=test_open3 I, [2024-05-03T21:42:39.180276 #2047952] INFO -- : [677/885] 2089321=test_bundled_ca I, [2024-05-03T21:42:39.197930 #2047952] INFO -- : [678/885] 2089323=test_closure I, [2024-05-03T21:42:39.412679 #2047952] INFO -- : [679/885] 2089320=test_gem_bundler_version_finder I, [2024-05-03T21:42:39.443806 #2047952] INFO -- : [680/885] 2089320=test_emoji_breaks I, [2024-05-03T21:42:39.445907 #2047952] INFO -- : [681/885] 2089320=test_within_pipe I, [2024-05-03T21:42:39.477409 #2047952] INFO -- : [682/885] 2089318=reflection_test I, [2024-05-03T21:42:39.488999 #2047952] INFO -- : [683/885] 2089318=test_gem_commands_unpack_command I, [2024-05-03T21:42:39.537447 #2047952] INFO -- : [684/885] 2089320=test_files_lib I, [2024-05-03T21:42:39.736626 #2047952] INFO -- : [685/885] 2089323=test_beginendblock I, [2024-05-03T21:42:39.789968 #2047952] INFO -- : [686/885] 2089325=test_help I, [2024-05-03T21:42:39.796043 #2047952] INFO -- : [687/885] 2089325=test_rdoc_markup_to_bs I, [2024-05-03T21:42:39.847965 #2047952] INFO -- : [688/885] 2089325=test_printf I, [2024-05-03T21:42:39.853770 #2047952] INFO -- : [689/885] 2089318=test_rdoc_markup_pre_process I, [2024-05-03T21:42:39.872608 #2047952] INFO -- : [690/885] 2089325=test_webauthn_listener_response I, [2024-05-03T21:42:39.924189 #2047952] INFO -- : [691/885] 2089318=test_time I, [2024-05-03T21:42:39.937549 #2047952] INFO -- : [692/885] 2089325=test_to_ary_concat I, [2024-05-03T21:42:39.966673 #2047952] INFO -- : [693/885] 2089313=test_stream I, [2024-05-03T21:42:39.992075 #2047952] INFO -- : [694/885] 2089313=test_pinned I, [2024-05-03T21:42:40.014230 #2047952] INFO -- : [695/885] 2089313=test_iseq I, [2024-05-03T21:42:40.105137 #2047952] INFO -- : [696/885] 2089318=test_exception_at_throwing I, [2024-05-03T21:42:40.180472 #2047952] INFO -- : [697/885] 2089318=test_rdoc_markup_heading I, [2024-05-03T21:42:40.181886 #2047952] INFO -- : [698/885] 2089323=test_class I, [2024-05-03T21:42:40.192138 #2047952] INFO -- : [699/885] 2089318=test_ocsp I, [2024-05-03T21:42:40.205804 #2047952] INFO -- : [700/885] 2089323=test_pkey_dsa I, [2024-05-03T21:42:40.641992 #2047952] INFO -- : [701/885] 2089318=test_scheduler I, [2024-05-03T21:42:40.738730 #2047952] INFO -- : [702/885] 2089321=test_gem_commands_build_command I, [2024-05-03T21:42:40.802590 #2047952] INFO -- : [703/885] 2089318=test_interned_str I, [2024-05-03T21:42:40.811824 #2047952] INFO -- : [704/885] 2089318=test_case_comprehensive I, [2024-05-03T21:42:40.937841 #2047952] INFO -- : [705/885] 2089313=test_variable_name_check I, [2024-05-03T21:42:40.977684 #2047952] INFO -- : [706/885] 2089313=test_io_m17n I, [2024-05-03T21:42:41.074285 #2047952] INFO -- : [707/885] 2089321=test_did_you_mean I, [2024-05-03T21:42:41.250694 #2047952] INFO -- : [708/885] 2089321=test_gem_commands_server_command I, [2024-05-03T21:42:41.251213 #2047952] INFO -- : [709/885] 2089321=test_append I, [2024-05-03T21:42:41.301691 #2047952] INFO -- : [710/885] 2089321=test_option I, [2024-05-03T21:42:41.360466 #2047952] INFO -- : [711/885] 2089322=test_cmethod I, [2024-05-03T21:42:41.366110 #2047952] INFO -- : [712/885] 2089322=test_tracer I, [2024-05-03T21:42:41.445721 #2047952] INFO -- : [713/885] 2089322=test_rdoc_method_attr I, [2024-05-03T21:42:41.487406 #2047952] INFO -- : [714/885] 2089321=test_gem_gem_runner I, [2024-05-03T21:42:41.551934 #2047952] INFO -- : [715/885] 2089321=test_filter I, [2024-05-03T21:42:41.594090 #2047952] INFO -- : [716/885] 2089321=static_literals_test I, [2024-05-03T21:42:41.598702 #2047952] INFO -- : [717/885] 2089321=test_data I, [2024-05-03T21:42:41.602183 #2047952] INFO -- : [718/885] 2089321=test_rdoc_generator_pot I, [2024-05-03T21:42:41.630909 #2047952] INFO -- : [719/885] 2089322=test_koi8 I, [2024-05-03T21:42:41.638175 #2047952] INFO -- : [720/885] 2089322=parameters_signature_test I, [2024-05-03T21:42:41.644110 #2047952] INFO -- : [721/885] 2089322=test_rdoc_parser_changelog I, [2024-05-03T21:42:41.685088 #2047952] INFO -- : [722/885] 2089315=test_enumerator I, [2024-05-03T21:42:41.700293 #2047952] INFO -- : [723/885] 2089315=test_unicode I, [2024-05-03T21:42:41.751920 #2047952] INFO -- : [724/885] 2089322=test_lexer I, [2024-05-03T21:42:41.765879 #2047952] INFO -- : [725/885] 2089322=test_thread_cv I, [2024-05-03T21:42:41.782824 #2047952] INFO -- : [726/885] 2089315=test_ssl_session I, [2024-05-03T21:42:41.823268 #2047952] INFO -- : [727/885] 2089321=test_gem_commands_update_command I, [2024-05-03T21:42:41.889194 #2047952] INFO -- : [728/885] 2089324=test_gem_resolver_vendor_specification I, [2024-05-03T21:42:41.896857 #2047952] INFO -- : [729/885] 2089325=test_key_event_record I, [2024-05-03T21:42:41.904493 #2047952] INFO -- : [730/885] 2089325=test_gem_uri I, [2024-05-03T21:42:41.929900 #2047952] INFO -- : [731/885] 2089324=test_random I, [2024-05-03T21:42:41.934192 #2047952] INFO -- : [732/885] 2089325=test_notimplement I, [2024-05-03T21:42:41.943087 #2047952] INFO -- : [733/885] 2089325=test_bug-14834 I, [2024-05-03T21:42:41.965617 #2047952] INFO -- : [734/885] 2089324=test_date_compat I, [2024-05-03T21:42:41.970939 #2047952] INFO -- : [735/885] 2089324=test_rdoc_markup_to_html I, [2024-05-03T21:42:42.053149 #2047952] INFO -- : [736/885] 2089325=test_compile_prism I, [2024-05-03T21:42:42.190119 #2047952] INFO -- : [737/885] 2089314=test_terminfo I, [2024-05-03T21:42:42.193366 #2047952] INFO -- : [738/885] 2089314=test_bn I, [2024-05-03T21:42:42.233341 #2047952] INFO -- : [739/885] 2089314=test_win32ole_param_event I, [2024-05-03T21:42:42.235828 #2047952] INFO -- : [740/885] 2089314=test_path I, [2024-05-03T21:42:42.244034 #2047952] INFO -- : [741/885] 2089314=test_case_mapping I, [2024-05-03T21:42:42.252367 #2047952] INFO -- : [742/885] 2089314=redundant_return_test I, [2024-05-03T21:42:42.257599 #2047952] INFO -- : [743/885] 2089314=test_tree_spell_checker I, [2024-05-03T21:42:42.297722 #2047952] INFO -- : [744/885] 2089314=test_addrinfo I, [2024-05-03T21:42:42.309705 #2047952] INFO -- : [745/885] 2089324=test_http I, [2024-05-03T21:42:42.330064 #2047952] INFO -- : [746/885] 2089314=test_httpheader I, [2024-05-03T21:42:42.405550 #2047952] INFO -- : [747/885] 2089322=test_gem_resolver_local_specification I, [2024-05-03T21:42:42.414265 #2047952] INFO -- : [748/885] 2089314=test_rdoc_ri_driver I, [2024-05-03T21:42:42.434627 #2047952] INFO -- : [749/885] 2089325=test_httpresponses I, [2024-05-03T21:42:42.444314 #2047952] INFO -- : [750/885] 2089325=test_encoding I, [2024-05-03T21:42:42.449084 #2047952] INFO -- : [751/885] 2089322=test_set_len I, [2024-05-03T21:42:42.455410 #2047952] INFO -- : [752/885] 2089322=test_sockopt I, [2024-05-03T21:42:42.457327 #2047952] INFO -- : [753/885] 2089325=test_install I, [2024-05-03T21:42:42.460643 #2047952] INFO -- : [754/885] 2089322=test_rdoc_markup_to_label I, [2024-05-03T21:42:42.510260 #2047952] INFO -- : [755/885] 2089322=test_key_stroke I, [2024-05-03T21:42:42.516719 #2047952] INFO -- : [756/885] 2089322=test_color I, [2024-05-03T21:42:42.613429 #2047952] INFO -- : [757/885] 2089322=json_encoding_test I, [2024-05-03T21:42:42.622559 #2047952] INFO -- : [758/885] 2089322=test_primitive I, [2024-05-03T21:42:42.637286 #2047952] INFO -- : [759/885] 2089322=test_human_typo I, [2024-05-03T21:42:42.642711 #2047952] INFO -- : [760/885] 2089322=test_rbconfig I, [2024-05-03T21:42:42.649046 #2047952] INFO -- : [761/885] 2089322=test_document I, [2024-05-03T21:42:42.662831 #2047952] INFO -- : [762/885] 2089322=test_rdoc_generator_pot_po_entry I, [2024-05-03T21:42:42.665317 #2047952] INFO -- : [763/885] 2089313=test_euc_jp I, [2024-05-03T21:42:42.670654 #2047952] INFO -- : [764/885] 2089313=test_acceptable I, [2024-05-03T21:42:42.675138 #2047952] INFO -- : [765/885] 2089322=test_win32ole_param I, [2024-05-03T21:42:42.677861 #2047952] INFO -- : [766/885] 2089322=test_gem_commands_yank_command I, [2024-05-03T21:42:42.683513 #2047952] INFO -- : [767/885] 2089309=test_pair I, [2024-05-03T21:42:42.757240 #2047952] INFO -- : [768/885] 2089325=test_name_error_extension I, [2024-05-03T21:42:42.767215 #2047952] INFO -- : [769/885] 2089325=test_chilled I, [2024-05-03T21:42:42.774257 #2047952] INFO -- : [770/885] 2089325=test_rdoc_i18n_locale I, [2024-05-03T21:42:42.785868 #2047952] INFO -- : [771/885] 2089325=test_erb I, [2024-05-03T21:42:42.806173 #2047952] INFO -- : [772/885] 2089314=test_x509ext I, [2024-05-03T21:42:42.816026 #2047952] INFO -- : [773/885] 2089314=test_gem_source_installed I, [2024-05-03T21:42:42.832521 #2047952] INFO -- : [774/885] 2089314=test_completion I, [2024-05-03T21:42:42.835190 #2047952] INFO -- : [775/885] 2089325=test_gem_commands_cert_command I, [2024-05-03T21:42:42.851587 #2047952] INFO -- : [776/885] 2089313=test_len I, [2024-05-03T21:42:42.855991 #2047952] INFO -- : [777/885] 2089313=test_yield_block I, [2024-05-03T21:42:42.863702 #2047952] INFO -- : [778/885] 2089313=test_rational2 I, [2024-05-03T21:42:42.884208 #2047952] INFO -- : [779/885] 2089313=test_rational I, [2024-05-03T21:42:42.906051 #2047952] INFO -- : [780/885] 2089313=test_assembler I, [2024-05-03T21:42:42.910292 #2047952] INFO -- : [781/885] 2089313=attribute_write_test I, [2024-05-03T21:42:42.912329 #2047952] INFO -- : [782/885] 2089313=test_propertyputref I, [2024-05-03T21:42:42.920445 #2047952] INFO -- : [783/885] 2089313=test_spell_checker I, [2024-05-03T21:42:42.927703 #2047952] INFO -- : [784/885] 2089313=test_win32ole_method_event I, [2024-05-03T21:42:42.928799 #2047952] INFO -- : [785/885] 2089313=test_nesting_parser I, [2024-05-03T21:42:42.956620 #2047952] INFO -- : [786/885] 2089313=test_gem_dependency_list I, [2024-05-03T21:42:42.985080 #2047952] INFO -- : [787/885] 2089315=test_benchmark I, [2024-05-03T21:42:43.066600 #2047952] INFO -- : [788/885] 2089313=test_gem_commands_outdated_command I, [2024-05-03T21:42:43.153607 #2047952] INFO -- : [789/885] 2089313=test_helper_method I, [2024-05-03T21:42:43.161378 #2047952] INFO -- : [790/885] 2089313=test_gem_package_tar_writer I, [2024-05-03T21:42:43.170171 #2047952] INFO -- : [791/885] 2089322=test_array I, [2024-05-03T21:42:43.333425 #2047952] INFO -- : [792/885] 2089313=test_gem_source I, [2024-05-03T21:42:43.348775 #2047952] INFO -- : [793/885] 2089321=test_scalar_scanner I, [2024-05-03T21:42:43.359659 #2047952] INFO -- : [794/885] 2089321=test_rdoc_parser_simple I, [2024-05-03T21:42:43.363773 #2047952] INFO -- : [795/885] 2089319=test_yamldbm I, [2024-05-03T21:42:43.373326 #2047952] INFO -- : [796/885] 2089319=test_gem_commands_rebuild_command I, [2024-05-03T21:42:43.388168 #2047952] INFO -- : [797/885] 2089321=test_load I, [2024-05-03T21:42:43.395979 #2047952] INFO -- : [798/885] 2089321=test_abi I, [2024-05-03T21:42:43.442518 #2047952] INFO -- : [799/885] 2089319=test_provider I, [2024-05-03T21:42:43.639838 #2047952] INFO -- : [800/885] 2089314=test_evaluation I, [2024-05-03T21:42:43.642139 #2047952] INFO -- : [801/885] 2089314=test_https I, [2024-05-03T21:42:43.653564 #2047952] INFO -- : [802/885] 2089321=test_gem_ext_builder I, [2024-05-03T21:42:43.715635 #2047952] INFO -- : [803/885] 2089313=test_monitor I, [2024-05-03T21:42:43.807623 #2047952] INFO -- : [804/885] 2089310=test_buffered_io I, [2024-05-03T21:42:43.838189 #2047952] INFO -- : [805/885] 2089323=test_configuration I, [2024-05-03T21:42:43.914451 #2047952] INFO -- : [806/885] 2089310=test_rubyvm I, [2024-05-03T21:42:43.917781 #2047952] INFO -- : [807/885] 2089310=test_rdoc_generator_markup I, [2024-05-03T21:42:43.920272 #2047952] INFO -- : [808/885] 2089310=test_whileuntil I, [2024-05-03T21:42:43.921977 #2047952] INFO -- : [809/885] 2089313=test_boolean I, [2024-05-03T21:42:43.924539 #2047952] INFO -- : [810/885] 2089310=test_instrumentation_api I, [2024-05-03T21:42:43.936278 #2047952] INFO -- : [811/885] 2089313=integer_parse_test I, [2024-05-03T21:42:43.943045 #2047952] INFO -- : [812/885] 2089313=test_stringify_symbols I, [2024-05-03T21:42:43.950445 #2047952] INFO -- : [813/885] 2089313=test_ssl I, [2024-05-03T21:42:43.952154 #2047952] INFO -- : [814/885] 2089319=test_gem_ext_cargo_builder I, [2024-05-03T21:42:43.977073 #2047952] INFO -- : [815/885] 2089319=constant_path_node_test I, [2024-05-03T21:42:44.010640 #2047952] INFO -- : [816/885] 2089323=test_gem_request_set I, [2024-05-03T21:42:44.043170 #2047952] INFO -- : [817/885] 2089314=test_module I, [2024-05-03T21:42:44.069036 #2047952] INFO -- : [818/885] 2089319=test_parser I, [2024-05-03T21:42:44.094782 #2047952] INFO -- : [819/885] 2089319=test_method_name_check I, [2024-05-03T21:42:44.113652 #2047952] INFO -- : [820/885] 2089319=test_arith_seq_extract I, [2024-05-03T21:42:44.194354 #2047952] INFO -- : [821/885] 2089315=test_key_error I, [2024-05-03T21:42:44.205291 #2047952] INFO -- : [822/885] 2089315=test_div I, [2024-05-03T21:42:44.209026 #2047952] INFO -- : [823/885] 2089315=test_allocation I, [2024-05-03T21:42:44.279809 #2047952] INFO -- : [824/885] 2089326=test_engine I, [2024-05-03T21:42:44.280254 #2047952] INFO -- : [825/885] 2089326=test_win32ole_variant_m I, [2024-05-03T21:42:44.284327 #2047952] INFO -- : [826/885] 2089326=test_color_printer I, [2024-05-03T21:42:44.348794 #2047952] INFO -- : [827/885] 2089326=test_deprecated I, [2024-05-03T21:42:44.353916 #2047952] INFO -- : [828/885] 2089326=test_serialize_subclasses I, [2024-05-03T21:42:44.354762 #2047952] INFO -- : [829/885] 2089326=test_insns_leaf I, [2024-05-03T21:42:44.365042 #2047952] INFO -- : [830/885] 2089326=test_set I, [2024-05-03T21:42:44.386567 #2047952] INFO -- : [831/885] 2089326=test_gem_path_support I, [2024-05-03T21:42:44.403079 #2047952] INFO -- : [832/885] 2089319=test_struct I, [2024-05-03T21:42:44.409939 #2047952] INFO -- : [833/885] 2089320=test_files_test_1 I, [2024-05-03T21:42:44.412350 #2047952] INFO -- : [834/885] 2089320=test_rdoc_rd_inline I, [2024-05-03T21:42:44.421939 #2047952] INFO -- : [835/885] 2089326=test_mutex I, [2024-05-03T21:42:44.505295 #2047952] INFO -- : [836/885] 2089323=test_x509req I, [2024-05-03T21:42:44.566341 #2047952] INFO -- : [837/885] 2089320=test_gem_source_subpath_problem I, [2024-05-03T21:42:44.693512 #2047952] INFO -- : [838/885] 2089320=test_dln I, [2024-05-03T21:42:44.694181 #2047952] INFO -- : [839/885] 2089320=json_common_interface_test I, [2024-05-03T21:42:44.723767 #2047952] INFO -- : [840/885] 2089320=test_win32ole_variant_outarg I, [2024-05-03T21:42:44.724717 #2047952] INFO -- : [841/885] 2089323=test_config I, [2024-05-03T21:42:44.729253 #2047952] INFO -- : [842/885] 2089320=memsize_test I, [2024-05-03T21:42:44.771960 #2047952] INFO -- : [843/885] 2089323=json_parser_test I, [2024-05-03T21:42:44.814163 #2047952] INFO -- : [844/885] 2089323=test_nomethod_error I, [2024-05-03T21:42:44.818007 #2047952] INFO -- : [845/885] 2089323=test_cparser I, [2024-05-03T21:42:44.821513 #2047952] INFO -- : [846/885] 2089320=test_pkg_config I, [2024-05-03T21:42:44.840886 #2047952] INFO -- : [847/885] 2089320=test_sexp I, [2024-05-03T21:42:44.854516 #2047952] INFO -- : [848/885] 2089320=test_rdoc_markup_include I, [2024-05-03T21:42:44.856933 #2047952] INFO -- : [849/885] 2089320=fuzzer_test I, [2024-05-03T21:42:44.870027 #2047952] INFO -- : [850/885] 2089320=test_variable I, [2024-05-03T21:42:44.914327 #2047952] INFO -- : [851/885] 2089311=test_struct I, [2024-05-03T21:42:44.915114 #2047952] INFO -- : [852/885] 2089311=magic_comment_test I, [2024-05-03T21:42:44.927447 #2047952] INFO -- : [853/885] 2089311=test_rdoc_markup_to_html_snippet I, [2024-05-03T21:42:45.021666 #2047952] INFO -- : [854/885] 2089311=test_iterator I, [2024-05-03T21:42:45.040183 #2047952] INFO -- : [855/885] 2089320=test_string I, [2024-05-03T21:42:45.040269 #2047952] INFO -- : [856/885] 2089320=test_omap I, [2024-05-03T21:42:45.064389 #2047952] INFO -- : [857/885] 2089320=test_digest_extend I, [2024-05-03T21:42:45.096991 #2047952] INFO -- : [858/885] 2089320=test_shellwords I, [2024-05-03T21:42:45.101730 #2047952] INFO -- : [859/885] 2089320=test_debug I, [2024-05-03T21:42:45.106461 #2047952] INFO -- : [860/885] 2089311=pattern_test I, [2024-05-03T21:42:45.111694 #2047952] INFO -- : [861/885] 2089321=test_memory_view I, [2024-05-03T21:42:45.127456 #2047952] INFO -- : [862/885] 2089320=test_cipher I, [2024-05-03T21:42:45.146281 #2047952] INFO -- : [863/885] 2089311=test_gem_security_signer I, [2024-05-03T21:42:45.150504 #2047952] INFO -- : [864/885] 2089321=test_new I, [2024-05-03T21:42:45.159145 #2047952] INFO -- : [865/885] 2089321=test_gem_resolver_git_set I, [2024-05-03T21:42:45.201687 #2047952] INFO -- : [866/885] 2089320=test_storage I, [2024-05-03T21:42:45.209471 #2047952] INFO -- : [867/885] 2089320=test_float I, [2024-05-03T21:42:45.278136 #2047952] INFO -- : [868/885] 2089311=test_cgi_cookie I, [2024-05-03T21:42:45.292696 #2047952] INFO -- : [869/885] 2089311=test_require I, [2024-05-03T21:42:45.329031 #2047952] INFO -- : [870/885] 2089308=test_dir_m17n I, [2024-05-03T21:42:45.341985 #2047952] INFO -- : [871/885] 2089319=test_gem_resolver_installer_set I, [2024-05-03T21:42:45.543741 #2047952] INFO -- : [872/885] 2089321=test_gem_commands_signout_command I, [2024-05-03T21:42:45.559229 #2047952] INFO -- : [873/885] 2089326=test_refinement I, [2024-05-03T21:42:45.564690 #2047952] INFO -- : [874/885] 2089321=test_regex_casefold I, [2024-05-03T21:42:45.568586 #2047952] INFO -- : [875/885] 2089319=test_gem_source_git I, [2024-05-03T21:42:45.601114 #2047952] INFO -- : [876/885] 2089323=test_fixnum I, [2024-05-03T21:42:45.614623 #2047952] INFO -- : [877/885] 2089323=test_signal I, [2024-05-03T21:42:45.630789 #2047952] INFO -- : [878/885] 2089325=test_x509crl I, [2024-05-03T21:42:45.880996 #2047952] INFO -- : [879/885] 2089325=test_rdoc_rd I, [2024-05-03T21:42:45.911469 #2047952] INFO -- : [880/885] 2089325=test_cgi_session I, [2024-05-03T21:42:45.942386 #2047952] INFO -- : [881/885] 2089325=test_metaclass I, [2024-05-03T21:42:45.951973 #2047952] INFO -- : [882/885] 2089325=test_rdoc_top_level I, [2024-05-03T21:42:45.982779 #2047952] INFO -- : [883/885] 2089312=test_input_method I, [2024-05-03T21:42:46.033791 #2047952] INFO -- : [884/885] 2089312=test_windows_1252 I, [2024-05-03T21:42:46.042472 #2047952] INFO -- : [885/885] 2089312=test_process I, [2024-05-03T21:43:05.422900 #2047952] INFO -- : Finished tests in 40.417488s, 652.2919 tests/s, 231393.7244 assertions/s. E, [2024-05-03T21:43:05.423003 #2047952] ERROR -- : Children under /tmp/rubytest.7ourzf: E, [2024-05-03T21:43:05.423028 #2047952] ERROR -- : * drwx------ 4 80 2024-05-03 21:42:43 +0000 gem_rebuild20240503-2089319-11w0y8/ E, [2024-05-03T21:43:05.423035 #2047952] ERROR -- : * drwxrwxr-x 2 60 2024-05-03 21:42:43 +0000 new/ E, [2024-05-03T21:43:05.423039 #2047952] ERROR -- : * -rw-rw-r-- 1 4096 2024-05-03 21:42:43 +0000 rebuild_test_gem-1.0.0.gem E, [2024-05-03T21:43:05.423044 #2047952] ERROR -- : * drwxrwxr-x 2 60 2024-05-03 21:42:43 +0000 old/ E, [2024-05-03T21:43:05.423064 #2047952] ERROR -- : * -rw-rw-r-- 1 4096 2024-05-03 21:42:43 +0000 rebuild_test_gem-1.0.0.gem I, [2024-05-03T21:43:05.424332 #2047952] INFO -- : 26364 tests, 9352353 assertions, 0 failures, 0 errors, 308 skips I, [2024-05-03T21:43:05.424357 #2047952] INFO -- : I, [2024-05-03T21:43:05.424364 #2047952] INFO -- : ruby -v: ruby 3.4.0dev (2024-05-03T21:34:34Z master 70db150fbc) [x86_64-linux] I, [2024-05-03T21:43:05.426345 #2047952] INFO -- : $$$[end] "make yes-test-all TESTOPTS='--stderr-on-failure' TESTS='-j20'" exit with 0. I, [2024-05-03T21:43:05.426570 #2047952] INFO -- : $$$[beg] make yes-test-rubyspec MSPECOPT='--error-output stderr --debug -j' TESTS='-j20' I, [2024-05-03T21:43:05.512859 #2047952] INFO -- : BASERUBY = /usr/bin/ruby --disable=gems I, [2024-05-03T21:43:05.512898 #2047952] INFO -- : CC = gcc I, [2024-05-03T21:43:05.512904 #2047952] INFO -- : LD = ld I, [2024-05-03T21:43:05.512908 #2047952] INFO -- : LDSHARED = gcc -shared I, [2024-05-03T21:43:05.512912 #2047952] INFO -- : CFLAGS = -O3 -fno-fast-math -ggdb3 -Wall -Wextra -Wdeprecated-declarations -Wdiv-by-zero -Wduplicated-cond -Wimplicit-function-declaration -Wimplicit-int -Wpointer-arith -Wwrite-strings -Wold-style-definition -Wimplicit-fallthrough=0 -Wmissing-noreturn -Wno-cast-function-type -Wno-constant-logical-operand -Wno-long-long -Wno-missing-field-initializers -Wno-overlength-strings -Wno-packed-bitfield-compat -Wno-parentheses-equality -Wno-self-assign -Wno-tautological-compare -Wno-unused-parameter -Wno-unused-value -Wsuggest-attribute=format -Wsuggest-attribute=noreturn -Wunused-variable -Wmisleading-indentation -Wundef -fPIC I, [2024-05-03T21:43:05.512917 #2047952] INFO -- : XCFLAGS = -U_FORTIFY_SOURCE -D_FORTIFY_SOURCE=2 -fstack-protector-strong -fno-strict-overflow -fvisibility=hidden -fexcess-precision=standard -DRUBY_EXPORT -I. -I.ext/include/x86_64-linux -I/tmp/ruby/src/trunk/include -I/tmp/ruby/src/trunk -I/tmp/ruby/src/trunk/prism -I/tmp/ruby/src/trunk/enc/unicode/15.0.0 I, [2024-05-03T21:43:05.512921 #2047952] INFO -- : CPPFLAGS = I, [2024-05-03T21:43:05.512925 #2047952] INFO -- : DLDFLAGS = -Wl,--compress-debug-sections=zlib -Wl,-soname,libruby.so.3.4 -fstack-protector-strong I, [2024-05-03T21:43:05.512929 #2047952] INFO -- : SOLIBS = -lz -lrt -lrt -lgmp -ldl -lcrypt -lm -lpthread I, [2024-05-03T21:43:05.512933 #2047952] INFO -- : LANG = en_US.UTF-8 I, [2024-05-03T21:43:05.512936 #2047952] INFO -- : LC_ALL = I, [2024-05-03T21:43:05.512940 #2047952] INFO -- : LC_CTYPE = I, [2024-05-03T21:43:05.512943 #2047952] INFO -- : MFLAGS = I, [2024-05-03T21:43:05.512947 #2047952] INFO -- : RUSTC = no I, [2024-05-03T21:43:05.512951 #2047952] INFO -- : YJIT_RUSTC_ARGS = --crate-name=yjit --crate-type=staticlib --edition=2021 -g -C lto=thin -C opt-level=3 -C overflow-checks=on '--out-dir=/tmp/ruby/build/trunk/yjit/target/release/' /tmp/ruby/src/trunk/yjit/src/lib.rs I, [2024-05-03T21:43:05.513648 #2047952] INFO -- : gcc (Ubuntu 11.4.0-1ubuntu1~22.04) 11.4.0 I, [2024-05-03T21:43:05.513677 #2047952] INFO -- : Copyright (C) 2021 Free Software Foundation, Inc. I, [2024-05-03T21:43:05.513683 #2047952] INFO -- : This is free software; see the source for copying conditions. There is NO I, [2024-05-03T21:43:05.513688 #2047952] INFO -- : warranty; not even for MERCHANTABILITY or FITNESS FOR A PARTICULAR PURPOSE. I, [2024-05-03T21:43:05.513692 #2047952] INFO -- : I, [2024-05-03T21:43:05.515286 #2047952] INFO -- : generating enc.mk I, [2024-05-03T21:43:05.633710 #2047952] INFO -- : making enc I, [2024-05-03T21:43:05.650995 #2047952] INFO -- : make[1]: Entering directory '/tmp/ruby/build/trunk' I, [2024-05-03T21:43:05.651017 #2047952] INFO -- : make[1]: Nothing to be done for 'enc'. I, [2024-05-03T21:43:05.651023 #2047952] INFO -- : make[1]: Leaving directory '/tmp/ruby/build/trunk' I, [2024-05-03T21:43:05.651625 #2047952] INFO -- : making srcs under enc I, [2024-05-03T21:43:05.680640 #2047952] INFO -- : make[1]: Entering directory '/tmp/ruby/build/trunk' I, [2024-05-03T21:43:05.680663 #2047952] INFO -- : make[1]: Nothing to be done for 'srcs'. I, [2024-05-03T21:43:05.680672 #2047952] INFO -- : make[1]: Leaving directory '/tmp/ruby/build/trunk' I, [2024-05-03T21:43:05.681630 #2047952] INFO -- : generating transdb.h I, [2024-05-03T21:43:05.776207 #2047952] INFO -- : transdb.h unchanged I, [2024-05-03T21:43:05.777607 #2047952] INFO -- : making trans I, [2024-05-03T21:43:05.812561 #2047952] INFO -- : make[1]: Entering directory '/tmp/ruby/build/trunk' I, [2024-05-03T21:43:05.812582 #2047952] INFO -- : make[1]: Nothing to be done for 'trans'. I, [2024-05-03T21:43:05.812588 #2047952] INFO -- : make[1]: Leaving directory '/tmp/ruby/build/trunk' I, [2024-05-03T21:43:05.813198 #2047952] INFO -- : making encs I, [2024-05-03T21:43:05.851852 #2047952] INFO -- : make[1]: Entering directory '/tmp/ruby/build/trunk' I, [2024-05-03T21:43:05.851876 #2047952] INFO -- : make[1]: Nothing to be done for 'encs'. I, [2024-05-03T21:43:05.851884 #2047952] INFO -- : make[1]: Leaving directory '/tmp/ruby/build/trunk' I, [2024-05-03T21:43:05.853681 #2047952] INFO -- : generating makefiles ext/configure-ext.mk I, [2024-05-03T21:43:05.881006 #2047952] INFO -- : ext/configure-ext.mk updated I, [2024-05-03T21:43:05.883381 #2047952] INFO -- : make[1]: Entering directory '/tmp/ruby/build/trunk' I, [2024-05-03T21:43:07.236885 #2047952] INFO -- : make[1]: Leaving directory '/tmp/ruby/build/trunk' I, [2024-05-03T21:43:07.237444 #2047952] INFO -- : generating makefile exts.mk I, [2024-05-03T21:43:07.274796 #2047952] INFO -- : exts.mk unchanged I, [2024-05-03T21:43:07.279083 #2047952] INFO -- : make[1]: Entering directory '/tmp/ruby/build/trunk' I, [2024-05-03T21:43:07.489512 #2047952] INFO -- : make[2]: Entering directory '/tmp/ruby/build/trunk/ext/coverage' I, [2024-05-03T21:43:07.492245 #2047952] INFO -- : make[2]: Leaving directory '/tmp/ruby/build/trunk/ext/coverage' I, [2024-05-03T21:43:07.495925 #2047952] INFO -- : make[2]: Entering directory '/tmp/ruby/build/trunk/ext/date' I, [2024-05-03T21:43:07.498983 #2047952] INFO -- : make[2]: Leaving directory '/tmp/ruby/build/trunk/ext/date' I, [2024-05-03T21:43:07.501400 #2047952] INFO -- : make[2]: Entering directory '/tmp/ruby/build/trunk/ext/digest' I, [2024-05-03T21:43:07.506867 #2047952] INFO -- : make[2]: Leaving directory '/tmp/ruby/build/trunk/ext/digest' I, [2024-05-03T21:43:07.522389 #2047952] INFO -- : make[2]: Entering directory '/tmp/ruby/build/trunk/ext/digest/sha2' I, [2024-05-03T21:43:07.525362 #2047952] INFO -- : make[2]: Leaving directory '/tmp/ruby/build/trunk/ext/digest/sha2' I, [2024-05-03T21:43:07.538095 #2047952] INFO -- : make[2]: Entering directory '/tmp/ruby/build/trunk/ext/fiddle' I, [2024-05-03T21:43:07.544538 #2047952] INFO -- : make[2]: Leaving directory '/tmp/ruby/build/trunk/ext/fiddle' I, [2024-05-03T21:43:07.547601 #2047952] INFO -- : make[2]: Entering directory '/tmp/ruby/build/trunk/ext/io/console' I, [2024-05-03T21:43:07.550211 #2047952] INFO -- : make[2]: Leaving directory '/tmp/ruby/build/trunk/ext/io/console' I, [2024-05-03T21:43:07.557728 #2047952] INFO -- : make[2]: Entering directory '/tmp/ruby/build/trunk/ext/json' I, [2024-05-03T21:43:07.563926 #2047952] INFO -- : make[2]: Leaving directory '/tmp/ruby/build/trunk/ext/json' I, [2024-05-03T21:43:07.573039 #2047952] INFO -- : make[2]: Entering directory '/tmp/ruby/build/trunk/ext/monitor' I, [2024-05-03T21:43:07.575465 #2047952] INFO -- : make[2]: Leaving directory '/tmp/ruby/build/trunk/ext/monitor' I, [2024-05-03T21:43:07.579640 #2047952] INFO -- : make[2]: Entering directory '/tmp/ruby/build/trunk/ext/objspace' I, [2024-05-03T21:43:07.583351 #2047952] INFO -- : make[2]: Leaving directory '/tmp/ruby/build/trunk/ext/objspace' I, [2024-05-03T21:43:07.595142 #2047952] INFO -- : make[2]: Entering directory '/tmp/ruby/build/trunk/ext/openssl' I, [2024-05-03T21:43:07.608194 #2047952] INFO -- : make[2]: Leaving directory '/tmp/ruby/build/trunk/ext/openssl' I, [2024-05-03T21:43:07.611070 #2047952] INFO -- : make[2]: Entering directory '/tmp/ruby/build/trunk/ext/pathname' I, [2024-05-03T21:43:07.613577 #2047952] INFO -- : make[2]: Leaving directory '/tmp/ruby/build/trunk/ext/pathname' I, [2024-05-03T21:43:07.617650 #2047952] INFO -- : make[2]: Entering directory '/tmp/ruby/build/trunk/ext/psych' I, [2024-05-03T21:43:07.632596 #2047952] INFO -- : make[2]: Leaving directory '/tmp/ruby/build/trunk/ext/psych' I, [2024-05-03T21:43:07.635763 #2047952] INFO -- : make[2]: Entering directory '/tmp/ruby/build/trunk/ext/pty' I, [2024-05-03T21:43:07.638341 #2047952] INFO -- : make[2]: Leaving directory '/tmp/ruby/build/trunk/ext/pty' I, [2024-05-03T21:43:07.647850 #2047952] INFO -- : make[2]: Entering directory '/tmp/ruby/build/trunk/ext/ripper' I, [2024-05-03T21:43:07.652759 #2047952] INFO -- : make[2]: Leaving directory '/tmp/ruby/build/trunk/ext/ripper' I, [2024-05-03T21:43:07.654246 #2047952] INFO -- : make[2]: Entering directory '/tmp/ruby/build/trunk/ext/rubyvm' I, [2024-05-03T21:43:07.656200 #2047952] INFO -- : make[2]: Leaving directory '/tmp/ruby/build/trunk/ext/rubyvm' I, [2024-05-03T21:43:07.664018 #2047952] INFO -- : make[2]: Entering directory '/tmp/ruby/build/trunk/ext/socket' I, [2024-05-03T21:43:07.670415 #2047952] INFO -- : make[2]: Leaving directory '/tmp/ruby/build/trunk/ext/socket' I, [2024-05-03T21:43:07.681109 #2047952] INFO -- : make[2]: Entering directory '/tmp/ruby/build/trunk/.bundle/gems/bigdecimal-3.1.7/ext/bigdecimal' I, [2024-05-03T21:43:07.703599 #2047952] INFO -- : make[2]: Leaving directory '/tmp/ruby/build/trunk/.bundle/gems/bigdecimal-3.1.7/ext/bigdecimal' I, [2024-05-03T21:43:07.705540 #2047952] INFO -- : make[2]: Entering directory '/tmp/ruby/build/trunk/.bundle/gems/debug-1.9.2/ext/debug' I, [2024-05-03T21:43:07.727511 #2047952] INFO -- : make[2]: Leaving directory '/tmp/ruby/build/trunk/.bundle/gems/debug-1.9.2/ext/debug' I, [2024-05-03T21:43:07.729603 #2047952] INFO -- : make[2]: Entering directory '/tmp/ruby/build/trunk/.bundle/gems/nkf-0.2.0/ext/nkf' I, [2024-05-03T21:43:07.751565 #2047952] INFO -- : make[2]: Leaving directory '/tmp/ruby/build/trunk/.bundle/gems/nkf-0.2.0/ext/nkf' I, [2024-05-03T21:43:07.753498 #2047952] INFO -- : make[2]: Entering directory '/tmp/ruby/build/trunk/.bundle/gems/racc-1.7.3/ext/racc/cparse' I, [2024-05-03T21:43:07.775360 #2047952] INFO -- : make[2]: Leaving directory '/tmp/ruby/build/trunk/.bundle/gems/racc-1.7.3/ext/racc/cparse' I, [2024-05-03T21:43:07.777599 #2047952] INFO -- : make[2]: Entering directory '/tmp/ruby/build/trunk/.bundle/gems/rbs-3.4.4/ext/rbs_extension' I, [2024-05-03T21:43:07.799129 #2047952] INFO -- : make[2]: Leaving directory '/tmp/ruby/build/trunk/.bundle/gems/rbs-3.4.4/ext/rbs_extension' I, [2024-05-03T21:43:07.801258 #2047952] INFO -- : make[2]: Entering directory '/tmp/ruby/build/trunk/.bundle/gems/syslog-0.1.2/ext/syslog' I, [2024-05-03T21:43:07.823031 #2047952] INFO -- : make[2]: Leaving directory '/tmp/ruby/build/trunk/.bundle/gems/syslog-0.1.2/ext/syslog' I, [2024-05-03T21:43:07.846361 #2047952] INFO -- : make[2]: Entering directory '/tmp/ruby/build/trunk' I, [2024-05-03T21:43:07.909925 #2047952] INFO -- : make[2]: 'ruby' is up to date. I, [2024-05-03T21:43:07.909967 #2047952] INFO -- : make[2]: Leaving directory '/tmp/ruby/build/trunk' I, [2024-05-03T21:43:07.910267 #2047952] INFO -- : make[1]: Leaving directory '/tmp/ruby/build/trunk' I, [2024-05-03T21:43:07.914018 #2047952] INFO -- : make[1]: Entering directory '/tmp/ruby/build/trunk' I, [2024-05-03T21:43:07.914044 #2047952] INFO -- : make[1]: Nothing to be done for 'note'. I, [2024-05-03T21:43:07.914052 #2047952] INFO -- : make[1]: Leaving directory '/tmp/ruby/build/trunk' E, [2024-05-03T21:43:07.970957 #2047952] ERROR -- : $ /tmp/ruby/build/trunk/miniruby -I/tmp/ruby/src/trunk/lib /tmp/ruby/src/trunk/tool/runruby.rb --archdir=/tmp/ruby/build/trunk --extout=.ext -- /tmp/ruby/src/trunk/spec/mspec/bin/mspec-run -B /tmp/ruby/src/trunk/spec/default.mspec --error-output stderr --debug -fy -o /tmp/rubytest.oh343k/1-mspec-multi-0 E, [2024-05-03T21:43:07.971232 #2047952] ERROR -- : $ /tmp/ruby/build/trunk/miniruby -I/tmp/ruby/src/trunk/lib /tmp/ruby/src/trunk/tool/runruby.rb --archdir=/tmp/ruby/build/trunk --extout=.ext -- /tmp/ruby/src/trunk/spec/mspec/bin/mspec-run -B /tmp/ruby/src/trunk/spec/default.mspec --error-output stderr --debug -fy -o /tmp/rubytest.oh343k/2-mspec-multi-1 E, [2024-05-03T21:43:07.971512 #2047952] ERROR -- : $ /tmp/ruby/build/trunk/miniruby -I/tmp/ruby/src/trunk/lib /tmp/ruby/src/trunk/tool/runruby.rb --archdir=/tmp/ruby/build/trunk --extout=.ext -- /tmp/ruby/src/trunk/spec/mspec/bin/mspec-run -B /tmp/ruby/src/trunk/spec/default.mspec --error-output stderr --debug -fy -o /tmp/rubytest.oh343k/3-mspec-multi-2 E, [2024-05-03T21:43:07.971728 #2047952] ERROR -- : $ /tmp/ruby/build/trunk/miniruby -I/tmp/ruby/src/trunk/lib /tmp/ruby/src/trunk/tool/runruby.rb --archdir=/tmp/ruby/build/trunk --extout=.ext -- /tmp/ruby/src/trunk/spec/mspec/bin/mspec-run -B /tmp/ruby/src/trunk/spec/default.mspec --error-output stderr --debug -fy -o /tmp/rubytest.oh343k/4-mspec-multi-3 E, [2024-05-03T21:43:07.971935 #2047952] ERROR -- : $ /tmp/ruby/build/trunk/miniruby -I/tmp/ruby/src/trunk/lib /tmp/ruby/src/trunk/tool/runruby.rb --archdir=/tmp/ruby/build/trunk --extout=.ext -- /tmp/ruby/src/trunk/spec/mspec/bin/mspec-run -B /tmp/ruby/src/trunk/spec/default.mspec --error-output stderr --debug -fy -o /tmp/rubytest.oh343k/5-mspec-multi-4 E, [2024-05-03T21:43:07.972179 #2047952] ERROR -- : $ /tmp/ruby/build/trunk/miniruby -I/tmp/ruby/src/trunk/lib /tmp/ruby/src/trunk/tool/runruby.rb --archdir=/tmp/ruby/build/trunk --extout=.ext -- /tmp/ruby/src/trunk/spec/mspec/bin/mspec-run -B /tmp/ruby/src/trunk/spec/default.mspec --error-output stderr --debug -fy -o /tmp/rubytest.oh343k/6-mspec-multi-5 E, [2024-05-03T21:43:07.972380 #2047952] ERROR -- : $ /tmp/ruby/build/trunk/miniruby -I/tmp/ruby/src/trunk/lib /tmp/ruby/src/trunk/tool/runruby.rb --archdir=/tmp/ruby/build/trunk --extout=.ext -- /tmp/ruby/src/trunk/spec/mspec/bin/mspec-run -B /tmp/ruby/src/trunk/spec/default.mspec --error-output stderr --debug -fy -o /tmp/rubytest.oh343k/7-mspec-multi-6 E, [2024-05-03T21:43:07.972680 #2047952] ERROR -- : $ /tmp/ruby/build/trunk/miniruby -I/tmp/ruby/src/trunk/lib /tmp/ruby/src/trunk/tool/runruby.rb --archdir=/tmp/ruby/build/trunk --extout=.ext -- /tmp/ruby/src/trunk/spec/mspec/bin/mspec-run -B /tmp/ruby/src/trunk/spec/default.mspec --error-output stderr --debug -fy -o /tmp/rubytest.oh343k/8-mspec-multi-7 E, [2024-05-03T21:43:07.972974 #2047952] ERROR -- : $ /tmp/ruby/build/trunk/miniruby -I/tmp/ruby/src/trunk/lib /tmp/ruby/src/trunk/tool/runruby.rb --archdir=/tmp/ruby/build/trunk --extout=.ext -- /tmp/ruby/src/trunk/spec/mspec/bin/mspec-run -B /tmp/ruby/src/trunk/spec/default.mspec --error-output stderr --debug -fy -o /tmp/rubytest.oh343k/9-mspec-multi-8 E, [2024-05-03T21:43:07.973393 #2047952] ERROR -- : $ /tmp/ruby/build/trunk/miniruby -I/tmp/ruby/src/trunk/lib /tmp/ruby/src/trunk/tool/runruby.rb --archdir=/tmp/ruby/build/trunk --extout=.ext -- /tmp/ruby/src/trunk/spec/mspec/bin/mspec-run -B /tmp/ruby/src/trunk/spec/default.mspec --error-output stderr --debug -fy -o /tmp/rubytest.oh343k/10-mspec-multi-9 E, [2024-05-03T21:43:07.973694 #2047952] ERROR -- : $ /tmp/ruby/build/trunk/miniruby -I/tmp/ruby/src/trunk/lib /tmp/ruby/src/trunk/tool/runruby.rb --archdir=/tmp/ruby/build/trunk --extout=.ext -- /tmp/ruby/src/trunk/spec/mspec/bin/mspec-run -B /tmp/ruby/src/trunk/spec/default.mspec --error-output stderr --debug -fy -o /tmp/rubytest.oh343k/11-mspec-multi-10 E, [2024-05-03T21:43:07.973976 #2047952] ERROR -- : $ /tmp/ruby/build/trunk/miniruby -I/tmp/ruby/src/trunk/lib /tmp/ruby/src/trunk/tool/runruby.rb --archdir=/tmp/ruby/build/trunk --extout=.ext -- /tmp/ruby/src/trunk/spec/mspec/bin/mspec-run -B /tmp/ruby/src/trunk/spec/default.mspec --error-output stderr --debug -fy -o /tmp/rubytest.oh343k/12-mspec-multi-11 E, [2024-05-03T21:43:07.974297 #2047952] ERROR -- : $ /tmp/ruby/build/trunk/miniruby -I/tmp/ruby/src/trunk/lib /tmp/ruby/src/trunk/tool/runruby.rb --archdir=/tmp/ruby/build/trunk --extout=.ext -- /tmp/ruby/src/trunk/spec/mspec/bin/mspec-run -B /tmp/ruby/src/trunk/spec/default.mspec --error-output stderr --debug -fy -o /tmp/rubytest.oh343k/13-mspec-multi-12 E, [2024-05-03T21:43:07.974507 #2047952] ERROR -- : $ /tmp/ruby/build/trunk/miniruby -I/tmp/ruby/src/trunk/lib /tmp/ruby/src/trunk/tool/runruby.rb --archdir=/tmp/ruby/build/trunk --extout=.ext -- /tmp/ruby/src/trunk/spec/mspec/bin/mspec-run -B /tmp/ruby/src/trunk/spec/default.mspec --error-output stderr --debug -fy -o /tmp/rubytest.oh343k/14-mspec-multi-13 E, [2024-05-03T21:43:07.974690 #2047952] ERROR -- : $ /tmp/ruby/build/trunk/miniruby -I/tmp/ruby/src/trunk/lib /tmp/ruby/src/trunk/tool/runruby.rb --archdir=/tmp/ruby/build/trunk --extout=.ext -- /tmp/ruby/src/trunk/spec/mspec/bin/mspec-run -B /tmp/ruby/src/trunk/spec/default.mspec --error-output stderr --debug -fy -o /tmp/rubytest.oh343k/15-mspec-multi-14 E, [2024-05-03T21:43:07.974884 #2047952] ERROR -- : $ /tmp/ruby/build/trunk/miniruby -I/tmp/ruby/src/trunk/lib /tmp/ruby/src/trunk/tool/runruby.rb --archdir=/tmp/ruby/build/trunk --extout=.ext -- /tmp/ruby/src/trunk/spec/mspec/bin/mspec-run -B /tmp/ruby/src/trunk/spec/default.mspec --error-output stderr --debug -fy -o /tmp/rubytest.oh343k/16-mspec-multi-15 E, [2024-05-03T21:43:07.975079 #2047952] ERROR -- : $ /tmp/ruby/build/trunk/miniruby -I/tmp/ruby/src/trunk/lib /tmp/ruby/src/trunk/tool/runruby.rb --archdir=/tmp/ruby/build/trunk --extout=.ext -- /tmp/ruby/src/trunk/spec/mspec/bin/mspec-run -B /tmp/ruby/src/trunk/spec/default.mspec --error-output stderr --debug -fy -o /tmp/rubytest.oh343k/17-mspec-multi-16 E, [2024-05-03T21:43:07.975260 #2047952] ERROR -- : $ /tmp/ruby/build/trunk/miniruby -I/tmp/ruby/src/trunk/lib /tmp/ruby/src/trunk/tool/runruby.rb --archdir=/tmp/ruby/build/trunk --extout=.ext -- /tmp/ruby/src/trunk/spec/mspec/bin/mspec-run -B /tmp/ruby/src/trunk/spec/default.mspec --error-output stderr --debug -fy -o /tmp/rubytest.oh343k/18-mspec-multi-17 E, [2024-05-03T21:43:07.978169 #2047952] ERROR -- : $ /tmp/ruby/build/trunk/miniruby -I/tmp/ruby/src/trunk/lib /tmp/ruby/src/trunk/tool/runruby.rb --archdir=/tmp/ruby/build/trunk --extout=.ext -- /tmp/ruby/src/trunk/spec/mspec/bin/mspec-run -B /tmp/ruby/src/trunk/spec/default.mspec --error-output stderr --debug -fy -o /tmp/rubytest.oh343k/19-mspec-multi-18 E, [2024-05-03T21:43:07.978656 #2047952] ERROR -- : $ /tmp/ruby/build/trunk/miniruby -I/tmp/ruby/src/trunk/lib /tmp/ruby/src/trunk/tool/runruby.rb --archdir=/tmp/ruby/build/trunk --extout=.ext -- /tmp/ruby/src/trunk/spec/mspec/bin/mspec-run -B /tmp/ruby/src/trunk/spec/default.mspec --error-output stderr --debug -fy -o /tmp/rubytest.oh343k/20-mspec-multi-19 I, [2024-05-03T21:43:08.167360 #2047952] INFO -- : ruby 3.4.0dev (2024-05-03T21:34:34Z master 70db150fbc) [x86_64-linux] I, [2024-05-03T21:43:08.805616 #2047952] INFO -- : 0 ......................................................................... I, [2024-05-03T21:43:09.255705 #2047952] INFO -- : 73 ......................................................................... I, [2024-05-03T21:43:09.413513 #2047952] INFO -- : 146 ......................................................................... I, [2024-05-03T21:43:09.454311 #2047952] INFO -- : 219 ......................................................................... I, [2024-05-03T21:43:09.507012 #2047952] INFO -- : 292 ......................................................................... I, [2024-05-03T21:43:09.549521 #2047952] INFO -- : 365 ......................................................................... I, [2024-05-03T21:43:09.568246 #2047952] INFO -- : 438 ......................................................................... I, [2024-05-03T21:43:09.586843 #2047952] INFO -- : 511 ......................................................................... I, [2024-05-03T21:43:09.606724 #2047952] INFO -- : 584 ......................................................................... I, [2024-05-03T21:43:09.656536 #2047952] INFO -- : 657 ......................................................................... I, [2024-05-03T21:43:09.685322 #2047952] INFO -- : 730 ......................................................................... I, [2024-05-03T21:43:09.712377 #2047952] INFO -- : 803 ......................................................................... I, [2024-05-03T21:43:09.745589 #2047952] INFO -- : 876 ......................................................................... I, [2024-05-03T21:43:09.792185 #2047952] INFO -- : 949 ......................................................................... I, [2024-05-03T21:43:09.902956 #2047952] INFO -- : 1022 ......................................................................... I, [2024-05-03T21:43:10.057256 #2047952] INFO -- : 1095 ......................................................................... I, [2024-05-03T21:43:10.189328 #2047952] INFO -- : 1168 ......................................................................... I, [2024-05-03T21:43:10.242908 #2047952] INFO -- : 1241 ......................................................................... I, [2024-05-03T21:43:10.293921 #2047952] INFO -- : 1314 ......................................................................... I, [2024-05-03T21:43:10.317284 #2047952] INFO -- : 1387 ......................................................................... I, [2024-05-03T21:43:10.417127 #2047952] INFO -- : 1460 ......................................................................... I, [2024-05-03T21:43:10.927735 #2047952] INFO -- : 1533 ......................................................................... I, [2024-05-03T21:43:10.972678 #2047952] INFO -- : 1606 ......................................................................... I, [2024-05-03T21:43:11.069048 #2047952] INFO -- : 1679 ......................................................................... I, [2024-05-03T21:43:11.196196 #2047952] INFO -- : 1752 ......................................................................... I, [2024-05-03T21:43:11.266720 #2047952] INFO -- : 1825 ......................................................................... I, [2024-05-03T21:43:11.341380 #2047952] INFO -- : 1898 ......................................................................... I, [2024-05-03T21:43:11.432785 #2047952] INFO -- : 1971 ......................................................................... I, [2024-05-03T21:43:11.500441 #2047952] INFO -- : 2044 ......................................................................... I, [2024-05-03T21:43:11.547598 #2047952] INFO -- : 2117 ......................................................................... I, [2024-05-03T21:43:11.570559 #2047952] INFO -- : 2190 ......................................................................... I, [2024-05-03T21:43:11.595591 #2047952] INFO -- : 2263 ......................................................................... I, [2024-05-03T21:43:11.613783 #2047952] INFO -- : 2336 ......................................................................... I, [2024-05-03T21:43:11.652483 #2047952] INFO -- : 2409 ......................................................................... I, [2024-05-03T21:43:11.767569 #2047952] INFO -- : 2482 ......................................................................... I, [2024-05-03T21:43:11.793154 #2047952] INFO -- : 2555 ......................................................................... I, [2024-05-03T21:43:11.911018 #2047952] INFO -- : 2628 ......................................................................... I, [2024-05-03T21:43:12.017339 #2047952] INFO -- : 2701 ......................................................................... I, [2024-05-03T21:43:12.053739 #2047952] INFO -- : 2774 ......................................................................... I, [2024-05-03T21:43:12.113756 #2047952] INFO -- : 2847 ......................................................................... I, [2024-05-03T21:43:12.151362 #2047952] INFO -- : 2920 ......................................................................... I, [2024-05-03T21:43:12.173805 #2047952] INFO -- : 2993 ......................................................................... I, [2024-05-03T21:43:12.194192 #2047952] INFO -- : 3066 ......................................................................... I, [2024-05-03T21:43:12.206324 #2047952] INFO -- : 3139 ......................................................................... I, [2024-05-03T21:43:12.214891 #2047952] INFO -- : 3212 ......................................................................... I, [2024-05-03T21:43:12.247175 #2047952] INFO -- : 3285 ......................................................................... I, [2024-05-03T21:43:16.214722 #2047952] INFO -- : 3358 ........................................................................ I, [2024-05-03T21:43:16.214803 #2047952] INFO -- : I, [2024-05-03T21:43:16.214819 #2047952] INFO -- : Finished in 8.241192 seconds I, [2024-05-03T21:43:16.214830 #2047952] INFO -- : I, [2024-05-03T21:43:16.214842 #2047952] INFO -- : 3429 files, 32610 examples, 173339 expectations, 0 failures, 0 errors, 0 tagged I, [2024-05-03T21:43:16.218310 #2047952] INFO -- : $$$[end] "make yes-test-rubyspec MSPECOPT='--error-output stderr --debug -j' TESTS='-j20'" exit with 0.