# Logfile created on 2024-05-03 15:53:37 +0000 by logger.rb/v1.4.3 I, [2024-05-03T15:53:37.107696 #3548468] INFO -- : #, @formatter=nil, @logdev=#, @binmode=false, @mon_data=#, @mon_data_owner_object_id=860>>> I, [2024-05-03T15:53:37.107820 #3548468] INFO -- : $$$[beg] make update-unicode -j20 I, [2024-05-03T15:53:37.166320 #3548468] INFO -- : Downloading Unicode emoji 15.0 files... I, [2024-05-03T15:53:37.166577 #3548468] INFO -- : Downloading Unicode emoji 15.0 files... I, [2024-05-03T15:53:37.167283 #3548468] INFO -- : Downloading Unicode emoji 15.0 files... I, [2024-05-03T15:53:37.207943 #3548468] INFO -- : made symlink emoji/15.0/emoji-sequences.txt to /tmp/ruby/src/trunk/.downloaded-cache/emoji/15.0/emoji-sequences.txt I, [2024-05-03T15:53:37.207993 #3548468] INFO -- : downloading emoji/15.0/emoji-test.txt ... /tmp/ruby/src/trunk/enc/unicode/data/emoji/15.0/emoji-sequences.txt already exists I, [2024-05-03T15:53:37.208006 #3548468] INFO -- : /tmp/ruby/src/trunk/enc/unicode/data/emoji/15.0/emoji-sequences.txt already exists E, [2024-05-03T15:53:37.656663 #3548468] ERROR -- : /tmp/ruby/src/trunk/tool/downloader.rb:302:in `rescue in download': failed to download emoji/15.0/emoji-test.txt (RuntimeError) E, [2024-05-03T15:53:37.656715 #3548468] ERROR -- : OpenURI::HTTPError: 403 Forbidden: https://www.unicode.org/Public/emoji/15.0/emoji-test.txt E, [2024-05-03T15:53:37.656722 #3548468] ERROR -- : from /tmp/ruby/src/trunk/tool/downloader.rb:201:in `download' E, [2024-05-03T15:53:37.656726 #3548468] ERROR -- : from /tmp/ruby/src/trunk/tool/downloader.rb:136:in `download' E, [2024-05-03T15:53:37.656730 #3548468] ERROR -- : from /tmp/ruby/src/trunk/tool/downloader.rb:482:in `block in
' E, [2024-05-03T15:53:37.656734 #3548468] ERROR -- : from /tmp/ruby/src/trunk/tool/downloader.rb:465:in `each' E, [2024-05-03T15:53:37.656738 #3548468] ERROR -- : from /tmp/ruby/src/trunk/tool/downloader.rb:465:in `
' E, [2024-05-03T15:53:37.656742 #3548468] ERROR -- : /usr/lib/ruby/3.0.0/open-uri.rb:364:in `open_http': 403 Forbidden (OpenURI::HTTPError) E, [2024-05-03T15:53:37.656745 #3548468] ERROR -- : from /usr/lib/ruby/3.0.0/open-uri.rb:741:in `buffer_open' E, [2024-05-03T15:53:37.656750 #3548468] ERROR -- : from /usr/lib/ruby/3.0.0/open-uri.rb:212:in `block in open_loop' E, [2024-05-03T15:53:37.656754 #3548468] ERROR -- : from /usr/lib/ruby/3.0.0/open-uri.rb:210:in `catch' E, [2024-05-03T15:53:37.656758 #3548468] ERROR -- : from /usr/lib/ruby/3.0.0/open-uri.rb:210:in `open_loop' E, [2024-05-03T15:53:37.656762 #3548468] ERROR -- : from /usr/lib/ruby/3.0.0/open-uri.rb:151:in `open_uri' E, [2024-05-03T15:53:37.656766 #3548468] ERROR -- : from /usr/lib/ruby/3.0.0/open-uri.rb:721:in `open' E, [2024-05-03T15:53:37.656769 #3548468] ERROR -- : from /usr/lib/ruby/3.0.0/open-uri.rb:729:in `read' E, [2024-05-03T15:53:37.656786 #3548468] ERROR -- : from /tmp/ruby/src/trunk/tool/downloader.rb:247:in `block in download' E, [2024-05-03T15:53:37.656790 #3548468] ERROR -- : from /tmp/ruby/src/trunk/tool/downloader.rb:378:in `with_retry' E, [2024-05-03T15:53:37.656795 #3548468] ERROR -- : from /tmp/ruby/src/trunk/tool/downloader.rb:246:in `download' E, [2024-05-03T15:53:37.656803 #3548468] ERROR -- : from /tmp/ruby/src/trunk/tool/downloader.rb:136:in `download' E, [2024-05-03T15:53:37.656807 #3548468] ERROR -- : from /tmp/ruby/src/trunk/tool/downloader.rb:482:in `block in
' E, [2024-05-03T15:53:37.656810 #3548468] ERROR -- : from /tmp/ruby/src/trunk/tool/downloader.rb:465:in `each' E, [2024-05-03T15:53:37.656814 #3548468] ERROR -- : from /tmp/ruby/src/trunk/tool/downloader.rb:465:in `
' E, [2024-05-03T15:53:37.658778 #3548468] ERROR -- : make: *** [uncommon.mk:1787: /tmp/ruby/src/trunk/enc/unicode/data/emoji/15.0/emoji-sequences.txt] Error 1 E, [2024-05-03T15:53:37.658800 #3548468] ERROR -- : make: *** Deleting file '/tmp/ruby/src/trunk/enc/unicode/data/emoji/15.0/emoji-sequences.txt' E, [2024-05-03T15:53:37.658806 #3548468] ERROR -- : make: *** Waiting for unfinished jobs.... E, [2024-05-03T15:53:37.658968 #3548468] ERROR -- : /tmp/ruby/src/trunk/tool/downloader.rb:302:in `rescue in download': failed to download emoji/15.0/emoji-test.txt (RuntimeError) E, [2024-05-03T15:53:37.658990 #3548468] ERROR -- : OpenURI::HTTPError: 403 Forbidden: https://www.unicode.org/Public/emoji/15.0/emoji-test.txt E, [2024-05-03T15:53:37.658996 #3548468] ERROR -- : from /tmp/ruby/src/trunk/tool/downloader.rb:201:in `download' E, [2024-05-03T15:53:37.659000 #3548468] ERROR -- : from /tmp/ruby/src/trunk/tool/downloader.rb:136:in `download' E, [2024-05-03T15:53:37.659004 #3548468] ERROR -- : from /tmp/ruby/src/trunk/tool/downloader.rb:482:in `block in
' E, [2024-05-03T15:53:37.659008 #3548468] ERROR -- : from /tmp/ruby/src/trunk/tool/downloader.rb:465:in `each' E, [2024-05-03T15:53:37.659011 #3548468] ERROR -- : from /tmp/ruby/src/trunk/tool/downloader.rb:465:in `
' E, [2024-05-03T15:53:37.659015 #3548468] ERROR -- : /usr/lib/ruby/3.0.0/open-uri.rb:364:in `open_http': 403 Forbidden (OpenURI::HTTPError) E, [2024-05-03T15:53:37.659021 #3548468] ERROR -- : from /usr/lib/ruby/3.0.0/open-uri.rb:741:in `buffer_open' E, [2024-05-03T15:53:37.659024 #3548468] ERROR -- : from /usr/lib/ruby/3.0.0/open-uri.rb:212:in `block in open_loop' E, [2024-05-03T15:53:37.659028 #3548468] ERROR -- : from /usr/lib/ruby/3.0.0/open-uri.rb:210:in `catch' E, [2024-05-03T15:53:37.659032 #3548468] ERROR -- : from /usr/lib/ruby/3.0.0/open-uri.rb:210:in `open_loop' E, [2024-05-03T15:53:37.659036 #3548468] ERROR -- : from /usr/lib/ruby/3.0.0/open-uri.rb:151:in `open_uri' E, [2024-05-03T15:53:37.659039 #3548468] ERROR -- : from /usr/lib/ruby/3.0.0/open-uri.rb:721:in `open' E, [2024-05-03T15:53:37.659043 #3548468] ERROR -- : from /usr/lib/ruby/3.0.0/open-uri.rb:729:in `read' E, [2024-05-03T15:53:37.659047 #3548468] ERROR -- : from /tmp/ruby/src/trunk/tool/downloader.rb:247:in `block in download' E, [2024-05-03T15:53:37.659052 #3548468] ERROR -- : from /tmp/ruby/src/trunk/tool/downloader.rb:378:in `with_retry' E, [2024-05-03T15:53:37.659056 #3548468] ERROR -- : from /tmp/ruby/src/trunk/tool/downloader.rb:246:in `download' E, [2024-05-03T15:53:37.659060 #3548468] ERROR -- : from /tmp/ruby/src/trunk/tool/downloader.rb:136:in `download' E, [2024-05-03T15:53:37.659063 #3548468] ERROR -- : from /tmp/ruby/src/trunk/tool/downloader.rb:482:in `block in
' E, [2024-05-03T15:53:37.659067 #3548468] ERROR -- : from /tmp/ruby/src/trunk/tool/downloader.rb:465:in `each' E, [2024-05-03T15:53:37.659071 #3548468] ERROR -- : from /tmp/ruby/src/trunk/tool/downloader.rb:465:in `
' E, [2024-05-03T15:53:37.660781 #3548468] ERROR -- : make: *** [uncommon.mk:1787: /tmp/ruby/src/trunk/enc/unicode/data/emoji/15.0/emoji-zwj-sequences.txt] Error 1 E, [2024-05-03T15:53:37.661015 #3548468] ERROR -- : /tmp/ruby/src/trunk/tool/downloader.rb:302:in `rescue in download': failed to download emoji/15.0/emoji-test.txt (RuntimeError) E, [2024-05-03T15:53:37.661042 #3548468] ERROR -- : OpenURI::HTTPError: 403 Forbidden: https://www.unicode.org/Public/emoji/15.0/emoji-test.txt E, [2024-05-03T15:53:37.661048 #3548468] ERROR -- : from /tmp/ruby/src/trunk/tool/downloader.rb:201:in `download' E, [2024-05-03T15:53:37.661052 #3548468] ERROR -- : from /tmp/ruby/src/trunk/tool/downloader.rb:136:in `download' E, [2024-05-03T15:53:37.661055 #3548468] ERROR -- : from /tmp/ruby/src/trunk/tool/downloader.rb:482:in `block in
' E, [2024-05-03T15:53:37.661059 #3548468] ERROR -- : from /tmp/ruby/src/trunk/tool/downloader.rb:465:in `each' E, [2024-05-03T15:53:37.661063 #3548468] ERROR -- : from /tmp/ruby/src/trunk/tool/downloader.rb:465:in `
' E, [2024-05-03T15:53:37.661066 #3548468] ERROR -- : /usr/lib/ruby/3.0.0/open-uri.rb:364:in `open_http': 403 Forbidden (OpenURI::HTTPError) E, [2024-05-03T15:53:37.661071 #3548468] ERROR -- : from /usr/lib/ruby/3.0.0/open-uri.rb:741:in `buffer_open' E, [2024-05-03T15:53:37.661075 #3548468] ERROR -- : from /usr/lib/ruby/3.0.0/open-uri.rb:212:in `block in open_loop' E, [2024-05-03T15:53:37.661079 #3548468] ERROR -- : from /usr/lib/ruby/3.0.0/open-uri.rb:210:in `catch' E, [2024-05-03T15:53:37.661082 #3548468] ERROR -- : from /usr/lib/ruby/3.0.0/open-uri.rb:210:in `open_loop' E, [2024-05-03T15:53:37.661086 #3548468] ERROR -- : from /usr/lib/ruby/3.0.0/open-uri.rb:151:in `open_uri' E, [2024-05-03T15:53:37.661159 #3548468] ERROR -- : from /usr/lib/ruby/3.0.0/open-uri.rb:721:in `open' E, [2024-05-03T15:53:37.661165 #3548468] ERROR -- : from /usr/lib/ruby/3.0.0/open-uri.rb:729:in `read' E, [2024-05-03T15:53:37.661169 #3548468] ERROR -- : from /tmp/ruby/src/trunk/tool/downloader.rb:247:in `block in download' E, [2024-05-03T15:53:37.661174 #3548468] ERROR -- : from /tmp/ruby/src/trunk/tool/downloader.rb:378:in `with_retry' E, [2024-05-03T15:53:37.661177 #3548468] ERROR -- : from /tmp/ruby/src/trunk/tool/downloader.rb:246:in `download' E, [2024-05-03T15:53:37.661181 #3548468] ERROR -- : from /tmp/ruby/src/trunk/tool/downloader.rb:136:in `download' E, [2024-05-03T15:53:37.661184 #3548468] ERROR -- : from /tmp/ruby/src/trunk/tool/downloader.rb:482:in `block in
' E, [2024-05-03T15:53:37.661188 #3548468] ERROR -- : from /tmp/ruby/src/trunk/tool/downloader.rb:465:in `each' E, [2024-05-03T15:53:37.661193 #3548468] ERROR -- : from /tmp/ruby/src/trunk/tool/downloader.rb:465:in `
' E, [2024-05-03T15:53:37.662969 #3548468] ERROR -- : make: *** [uncommon.mk:1787: /tmp/ruby/src/trunk/enc/unicode/data/emoji/15.0/emoji-test.txt] Error 1 I, [2024-05-03T15:53:37.663026 #3548468] INFO -- : downloading emoji/15.0/emoji-test.txt ... downloading emoji/15.0/emoji-test.txt ... I, [2024-05-03T15:53:37.663324 #3548468] INFO -- : $$$[end] "make update-unicode -j20" exit with 512. I, [2024-05-03T15:53:37.663353 #3548468] INFO -- : $$$[beg] make update-download -j20 I, [2024-05-03T15:53:37.761804 #3548468] INFO -- : tool/config.guess already exists I, [2024-05-03T15:53:37.761856 #3548468] INFO -- : tool/config.sub already exists I, [2024-05-03T15:53:37.764241 #3548468] INFO -- : Update minitest to ea9caafc0754b1d6236a490d59e624b53209734a I, [2024-05-03T15:53:37.764515 #3548468] INFO -- : Update power_assert to 84e85124c5014a139af39161d484156cfe87a9ed I, [2024-05-03T15:53:37.765073 #3548468] INFO -- : Update rbs to ba7872795d5de04adb8ff500c0e6afdc81a041dd I, [2024-05-03T15:53:37.765291 #3548468] INFO -- : Update typeprof to b19a6416da3a05d57fadd6ffdadb382b6d236ca5 I, [2024-05-03T15:53:37.765573 #3548468] INFO -- : echo ea9caafc0754b1d6236a490d59e624b53209734a | /bin/sh /tmp/ruby/src/trunk/tool/ifchange /tmp/ruby/src/trunk/.bundle/.timestamp/minitest.revision - I, [2024-05-03T15:53:37.765745 #3548468] INFO -- : echo 84e85124c5014a139af39161d484156cfe87a9ed | /bin/sh /tmp/ruby/src/trunk/tool/ifchange /tmp/ruby/src/trunk/.bundle/.timestamp/power_assert.revision - I, [2024-05-03T15:53:37.766215 #3548468] INFO -- : echo ba7872795d5de04adb8ff500c0e6afdc81a041dd | /bin/sh /tmp/ruby/src/trunk/tool/ifchange /tmp/ruby/src/trunk/.bundle/.timestamp/rbs.revision - I, [2024-05-03T15:53:37.766378 #3548468] INFO -- : echo b19a6416da3a05d57fadd6ffdadb382b6d236ca5 | /bin/sh /tmp/ruby/src/trunk/tool/ifchange /tmp/ruby/src/trunk/.bundle/.timestamp/typeprof.revision - I, [2024-05-03T15:53:37.767445 #3548468] INFO -- : /tmp/ruby/src/trunk/.bundle/.timestamp/minitest.revision unchanged I, [2024-05-03T15:53:37.767706 #3548468] INFO -- : /tmp/ruby/src/trunk/.bundle/.timestamp/power_assert.revision unchanged I, [2024-05-03T15:53:37.768184 #3548468] INFO -- : /tmp/ruby/src/trunk/.bundle/.timestamp/rbs.revision unchanged I, [2024-05-03T15:53:37.768358 #3548468] INFO -- : /tmp/ruby/src/trunk/.bundle/.timestamp/typeprof.revision unchanged I, [2024-05-03T15:53:37.768929 #3548468] INFO -- : Building power_assert@84e85124c5014a139af39161d484156cfe87a9ed to /tmp/ruby/src/trunk/gems/power_assert-2.0.3.gem I, [2024-05-03T15:53:37.838199 #3548468] INFO -- : Successfully built RubyGem I, [2024-05-03T15:53:37.838243 #3548468] INFO -- : Name: power_assert I, [2024-05-03T15:53:37.838255 #3548468] INFO -- : Version: 2.0.4dev I, [2024-05-03T15:53:37.838261 #3548468] INFO -- : File: power_assert-2.0.4dev.gem I, [2024-05-03T15:53:37.883735 #3548468] INFO -- : $$$[end] "make update-download -j20" exit with 0. I, [2024-05-03T15:53:37.883778 #3548468] INFO -- : $$$[beg] make update-rubyspec -j20 I, [2024-05-03T15:53:37.941875 #3548468] INFO -- : make: Nothing to be done for 'update-rubyspec'. I, [2024-05-03T15:53:37.942156 #3548468] INFO -- : $$$[end] "make update-rubyspec -j20" exit with 0. I, [2024-05-03T15:53:37.942181 #3548468] INFO -- : $$$[beg] make update-src -j20 I, [2024-05-03T15:53:38.446816 #3548468] INFO -- : Already up to date. I, [2024-05-03T15:53:38.455844 #3548468] INFO -- : Latest commit hash = 281df1e495 I, [2024-05-03T15:53:38.456986 #3548468] INFO -- : $$$[end] "make update-src -j20" exit with 0. I, [2024-05-03T15:53:38.457012 #3548468] INFO -- : $$$[beg] make after-update -j20 I, [2024-05-03T15:53:38.525492 #3548468] INFO -- : generating /tmp/ruby/src/trunk/ext/ripper/eventids2table.c I, [2024-05-03T15:53:38.529770 #3548468] INFO -- : make[1]: Entering directory '/tmp/ruby/src/trunk/ext/ripper' I, [2024-05-03T15:53:38.529791 #3548468] INFO -- : make[1]: Nothing to be done for 'src'. I, [2024-05-03T15:53:38.529797 #3548468] INFO -- : make[1]: Leaving directory '/tmp/ruby/src/trunk/ext/ripper' I, [2024-05-03T15:53:38.546224 #3548468] INFO -- : /tmp/ruby/src/trunk/revision.h updated I, [2024-05-03T15:53:38.547429 #3548468] INFO -- : generating x86_64-linux-fake.rb I, [2024-05-03T15:53:38.598506 #3548468] INFO -- : x86_64-linux-fake.rb updated I, [2024-05-03T15:53:38.599785 #3548468] INFO -- : generating enc.mk I, [2024-05-03T15:53:38.718203 #3548468] INFO -- : making srcs under enc I, [2024-05-03T15:53:38.748303 #3548468] INFO -- : make[1]: Entering directory '/tmp/ruby/build/trunk' I, [2024-05-03T15:53:38.748326 #3548468] INFO -- : make[1]: Nothing to be done for 'srcs'. I, [2024-05-03T15:53:38.748331 #3548468] INFO -- : make[1]: Leaving directory '/tmp/ruby/build/trunk' I, [2024-05-03T15:53:38.794061 #3548468] INFO -- : Update minitest to ea9caafc0754b1d6236a490d59e624b53209734a I, [2024-05-03T15:53:38.794217 #3548468] INFO -- : Update power_assert to 84e85124c5014a139af39161d484156cfe87a9ed I, [2024-05-03T15:53:38.794734 #3548468] INFO -- : Update rbs to ba7872795d5de04adb8ff500c0e6afdc81a041dd I, [2024-05-03T15:53:38.794915 #3548468] INFO -- : Update typeprof to b19a6416da3a05d57fadd6ffdadb382b6d236ca5 I, [2024-05-03T15:53:38.795383 #3548468] INFO -- : echo ea9caafc0754b1d6236a490d59e624b53209734a | /bin/sh /tmp/ruby/src/trunk/tool/ifchange /tmp/ruby/src/trunk/.bundle/.timestamp/minitest.revision - I, [2024-05-03T15:53:38.795562 #3548468] INFO -- : echo 84e85124c5014a139af39161d484156cfe87a9ed | /bin/sh /tmp/ruby/src/trunk/tool/ifchange /tmp/ruby/src/trunk/.bundle/.timestamp/power_assert.revision - I, [2024-05-03T15:53:38.796893 #3548468] INFO -- : echo ba7872795d5de04adb8ff500c0e6afdc81a041dd | /bin/sh /tmp/ruby/src/trunk/tool/ifchange /tmp/ruby/src/trunk/.bundle/.timestamp/rbs.revision - I, [2024-05-03T15:53:38.797116 #3548468] INFO -- : echo b19a6416da3a05d57fadd6ffdadb382b6d236ca5 | /bin/sh /tmp/ruby/src/trunk/tool/ifchange /tmp/ruby/src/trunk/.bundle/.timestamp/typeprof.revision - I, [2024-05-03T15:53:38.797402 #3548468] INFO -- : /tmp/ruby/src/trunk/.bundle/.timestamp/power_assert.revision unchanged I, [2024-05-03T15:53:38.797527 #3548468] INFO -- : /tmp/ruby/src/trunk/.bundle/.timestamp/minitest.revision unchanged I, [2024-05-03T15:53:38.798721 #3548468] INFO -- : /tmp/ruby/src/trunk/.bundle/.timestamp/rbs.revision unchanged I, [2024-05-03T15:53:38.798747 #3548468] INFO -- : Building power_assert@84e85124c5014a139af39161d484156cfe87a9ed to /tmp/ruby/src/trunk/gems/power_assert-2.0.3.gem I, [2024-05-03T15:53:38.798901 #3548468] INFO -- : /tmp/ruby/src/trunk/.bundle/.timestamp/typeprof.revision unchanged I, [2024-05-03T15:53:38.868868 #3548468] INFO -- : Successfully built RubyGem I, [2024-05-03T15:53:38.868918 #3548468] INFO -- : Name: power_assert I, [2024-05-03T15:53:38.868925 #3548468] INFO -- : Version: 2.0.4dev I, [2024-05-03T15:53:38.868929 #3548468] INFO -- : File: power_assert-2.0.4dev.gem I, [2024-05-03T15:53:38.871230 #3548468] INFO -- : Extracting bundle gem power_assert-2.0.3... I, [2024-05-03T15:53:38.931517 #3548468] INFO -- : Try with hash version of bundled gems instead of gems/power_assert-2.0.3.gem. We don't use this gem with release version of Ruby. I, [2024-05-03T15:53:38.936514 #3548468] INFO -- : Unpacked gems/power_assert-2.0.4dev.gem I, [2024-05-03T15:53:38.938223 #3548468] INFO -- : $$$[end] "make after-update -j20" exit with 0. I, [2024-05-03T15:53:38.938389 #3548468] INFO -- : $$$[beg] make miniruby -j20 I, [2024-05-03T15:53:38.995294 #3548468] INFO -- : BASERUBY = /usr/bin/ruby --disable=gems I, [2024-05-03T15:53:38.995333 #3548468] INFO -- : CC = gcc I, [2024-05-03T15:53:38.995346 #3548468] INFO -- : LD = ld I, [2024-05-03T15:53:38.995357 #3548468] INFO -- : LDSHARED = gcc -shared I, [2024-05-03T15:53:38.995368 #3548468] INFO -- : CFLAGS = -O3 -fno-fast-math -ggdb3 -Wall -Wextra -Wdeprecated-declarations -Wdiv-by-zero -Wduplicated-cond -Wimplicit-function-declaration -Wimplicit-int -Wpointer-arith -Wwrite-strings -Wold-style-definition -Wimplicit-fallthrough=0 -Wmissing-noreturn -Wno-cast-function-type -Wno-constant-logical-operand -Wno-long-long -Wno-missing-field-initializers -Wno-overlength-strings -Wno-packed-bitfield-compat -Wno-parentheses-equality -Wno-self-assign -Wno-tautological-compare -Wno-unused-parameter -Wno-unused-value -Wsuggest-attribute=format -Wsuggest-attribute=noreturn -Wunused-variable -Wmisleading-indentation -Wundef -fPIC I, [2024-05-03T15:53:38.995379 #3548468] INFO -- : XCFLAGS = -U_FORTIFY_SOURCE -D_FORTIFY_SOURCE=2 -fstack-protector-strong -fno-strict-overflow -fvisibility=hidden -fexcess-precision=standard -DRUBY_EXPORT -I. -I.ext/include/x86_64-linux -I/tmp/ruby/src/trunk/include -I/tmp/ruby/src/trunk -I/tmp/ruby/src/trunk/prism -I/tmp/ruby/src/trunk/enc/unicode/15.0.0 I, [2024-05-03T15:53:38.995390 #3548468] INFO -- : CPPFLAGS = I, [2024-05-03T15:53:38.995401 #3548468] INFO -- : DLDFLAGS = -Wl,--compress-debug-sections=zlib -Wl,-soname,libruby.so.3.4 -fstack-protector-strong I, [2024-05-03T15:53:38.995411 #3548468] INFO -- : SOLIBS = -lz -lrt -lrt -lgmp -ldl -lcrypt -lm -lpthread I, [2024-05-03T15:53:38.995421 #3548468] INFO -- : LANG = en_US.UTF-8 I, [2024-05-03T15:53:38.995430 #3548468] INFO -- : LC_ALL = I, [2024-05-03T15:53:38.995440 #3548468] INFO -- : LC_CTYPE = I, [2024-05-03T15:53:38.995449 #3548468] INFO -- : MFLAGS = -j20 --jobserver-auth=4,5 I, [2024-05-03T15:53:38.995459 #3548468] INFO -- : RUSTC = no I, [2024-05-03T15:53:38.995469 #3548468] INFO -- : YJIT_RUSTC_ARGS = --crate-name=yjit --crate-type=staticlib --edition=2021 -g -C lto=thin -C opt-level=3 -C overflow-checks=on '--out-dir=/tmp/ruby/build/trunk/yjit/target/release/' /tmp/ruby/src/trunk/yjit/src/lib.rs I, [2024-05-03T15:53:38.996648 #3548468] INFO -- : gcc (Ubuntu 11.4.0-1ubuntu1~22.04) 11.4.0 I, [2024-05-03T15:53:38.996690 #3548468] INFO -- : Copyright (C) 2021 Free Software Foundation, Inc. I, [2024-05-03T15:53:38.996702 #3548468] INFO -- : This is free software; see the source for copying conditions. There is NO I, [2024-05-03T15:53:38.996713 #3548468] INFO -- : warranty; not even for MERCHANTABILITY or FITNESS FOR A PARTICULAR PURPOSE. I, [2024-05-03T15:53:38.996724 #3548468] INFO -- : I, [2024-05-03T15:53:39.017190 #3548468] INFO -- : compiling /tmp/ruby/src/trunk/version.c I, [2024-05-03T15:53:39.121272 #3548468] INFO -- : linking miniruby I, [2024-05-03T15:53:39.650974 #3548468] INFO -- : $$$[end] "make miniruby -j20" exit with 0. I, [2024-05-03T15:53:39.651083 #3548468] INFO -- : $$$[beg] make ruby -j20 I, [2024-05-03T15:53:39.709092 #3548468] INFO -- : BASERUBY = /usr/bin/ruby --disable=gems I, [2024-05-03T15:53:39.709120 #3548468] INFO -- : CC = gcc I, [2024-05-03T15:53:39.709126 #3548468] INFO -- : LD = ld I, [2024-05-03T15:53:39.709130 #3548468] INFO -- : LDSHARED = gcc -shared I, [2024-05-03T15:53:39.709143 #3548468] INFO -- : CFLAGS = -O3 -fno-fast-math -ggdb3 -Wall -Wextra -Wdeprecated-declarations -Wdiv-by-zero -Wduplicated-cond -Wimplicit-function-declaration -Wimplicit-int -Wpointer-arith -Wwrite-strings -Wold-style-definition -Wimplicit-fallthrough=0 -Wmissing-noreturn -Wno-cast-function-type -Wno-constant-logical-operand -Wno-long-long -Wno-missing-field-initializers -Wno-overlength-strings -Wno-packed-bitfield-compat -Wno-parentheses-equality -Wno-self-assign -Wno-tautological-compare -Wno-unused-parameter -Wno-unused-value -Wsuggest-attribute=format -Wsuggest-attribute=noreturn -Wunused-variable -Wmisleading-indentation -Wundef -fPIC I, [2024-05-03T15:53:39.709147 #3548468] INFO -- : XCFLAGS = -U_FORTIFY_SOURCE -D_FORTIFY_SOURCE=2 -fstack-protector-strong -fno-strict-overflow -fvisibility=hidden -fexcess-precision=standard -DRUBY_EXPORT -I. -I.ext/include/x86_64-linux -I/tmp/ruby/src/trunk/include -I/tmp/ruby/src/trunk -I/tmp/ruby/src/trunk/prism -I/tmp/ruby/src/trunk/enc/unicode/15.0.0 I, [2024-05-03T15:53:39.709151 #3548468] INFO -- : CPPFLAGS = I, [2024-05-03T15:53:39.709156 #3548468] INFO -- : DLDFLAGS = -Wl,--compress-debug-sections=zlib -Wl,-soname,libruby.so.3.4 -fstack-protector-strong I, [2024-05-03T15:53:39.709160 #3548468] INFO -- : SOLIBS = -lz -lrt -lrt -lgmp -ldl -lcrypt -lm -lpthread I, [2024-05-03T15:53:39.709164 #3548468] INFO -- : LANG = en_US.UTF-8 I, [2024-05-03T15:53:39.709168 #3548468] INFO -- : LC_ALL = I, [2024-05-03T15:53:39.709172 #3548468] INFO -- : LC_CTYPE = I, [2024-05-03T15:53:39.709176 #3548468] INFO -- : MFLAGS = -j20 --jobserver-auth=4,5 I, [2024-05-03T15:53:39.709180 #3548468] INFO -- : RUSTC = no I, [2024-05-03T15:53:39.709185 #3548468] INFO -- : YJIT_RUSTC_ARGS = --crate-name=yjit --crate-type=staticlib --edition=2021 -g -C lto=thin -C opt-level=3 -C overflow-checks=on '--out-dir=/tmp/ruby/build/trunk/yjit/target/release/' /tmp/ruby/src/trunk/yjit/src/lib.rs I, [2024-05-03T15:53:39.710545 #3548468] INFO -- : gcc (Ubuntu 11.4.0-1ubuntu1~22.04) 11.4.0 I, [2024-05-03T15:53:39.710566 #3548468] INFO -- : Copyright (C) 2021 Free Software Foundation, Inc. I, [2024-05-03T15:53:39.710572 #3548468] INFO -- : This is free software; see the source for copying conditions. There is NO I, [2024-05-03T15:53:39.710576 #3548468] INFO -- : warranty; not even for MERCHANTABILITY or FITNESS FOR A PARTICULAR PURPOSE. I, [2024-05-03T15:53:39.710580 #3548468] INFO -- : I, [2024-05-03T15:53:39.819208 #3548468] INFO -- : builtin_binary.inc updated I, [2024-05-03T15:53:39.824228 #3548468] INFO -- : c5234a9416e4f20f175185e840b25b0f08674d14078ed7083f37e655458e3ca9 builtin_binary.inc I, [2024-05-03T15:53:39.824918 #3548468] INFO -- : compiling /tmp/ruby/src/trunk/builtin.c I, [2024-05-03T15:53:40.009871 #3548468] INFO -- : linking static-library libruby-static.a I, [2024-05-03T15:53:40.324739 #3548468] INFO -- : linking shared-library libruby.so.3.4.0 I, [2024-05-03T15:53:41.877423 #3548468] INFO -- : linking ruby I, [2024-05-03T15:53:41.900490 #3548468] INFO -- : $$$[end] "make ruby -j20" exit with 0. I, [2024-05-03T15:53:41.900621 #3548468] INFO -- : $$$[beg] make all -j20 I, [2024-05-03T15:53:41.957324 #3548468] INFO -- : BASERUBY = /usr/bin/ruby --disable=gems I, [2024-05-03T15:53:41.957362 #3548468] INFO -- : CC = gcc I, [2024-05-03T15:53:41.957375 #3548468] INFO -- : LD = ld I, [2024-05-03T15:53:41.957386 #3548468] INFO -- : LDSHARED = gcc -shared I, [2024-05-03T15:53:41.957396 #3548468] INFO -- : CFLAGS = -O3 -fno-fast-math -ggdb3 -Wall -Wextra -Wdeprecated-declarations -Wdiv-by-zero -Wduplicated-cond -Wimplicit-function-declaration -Wimplicit-int -Wpointer-arith -Wwrite-strings -Wold-style-definition -Wimplicit-fallthrough=0 -Wmissing-noreturn -Wno-cast-function-type -Wno-constant-logical-operand -Wno-long-long -Wno-missing-field-initializers -Wno-overlength-strings -Wno-packed-bitfield-compat -Wno-parentheses-equality -Wno-self-assign -Wno-tautological-compare -Wno-unused-parameter -Wno-unused-value -Wsuggest-attribute=format -Wsuggest-attribute=noreturn -Wunused-variable -Wmisleading-indentation -Wundef -fPIC I, [2024-05-03T15:53:41.957411 #3548468] INFO -- : XCFLAGS = -U_FORTIFY_SOURCE -D_FORTIFY_SOURCE=2 -fstack-protector-strong -fno-strict-overflow -fvisibility=hidden -fexcess-precision=standard -DRUBY_EXPORT -I. -I.ext/include/x86_64-linux -I/tmp/ruby/src/trunk/include -I/tmp/ruby/src/trunk -I/tmp/ruby/src/trunk/prism -I/tmp/ruby/src/trunk/enc/unicode/15.0.0 I, [2024-05-03T15:53:41.957421 #3548468] INFO -- : CPPFLAGS = I, [2024-05-03T15:53:41.957432 #3548468] INFO -- : DLDFLAGS = -Wl,--compress-debug-sections=zlib -Wl,-soname,libruby.so.3.4 -fstack-protector-strong I, [2024-05-03T15:53:41.957442 #3548468] INFO -- : SOLIBS = -lz -lrt -lrt -lgmp -ldl -lcrypt -lm -lpthread I, [2024-05-03T15:53:41.957452 #3548468] INFO -- : LANG = en_US.UTF-8 I, [2024-05-03T15:53:41.957461 #3548468] INFO -- : LC_ALL = I, [2024-05-03T15:53:41.957471 #3548468] INFO -- : LC_CTYPE = I, [2024-05-03T15:53:41.957480 #3548468] INFO -- : MFLAGS = -j20 --jobserver-auth=4,5 I, [2024-05-03T15:53:41.957490 #3548468] INFO -- : RUSTC = no I, [2024-05-03T15:53:41.957502 #3548468] INFO -- : YJIT_RUSTC_ARGS = --crate-name=yjit --crate-type=staticlib --edition=2021 -g -C lto=thin -C opt-level=3 -C overflow-checks=on '--out-dir=/tmp/ruby/build/trunk/yjit/target/release/' /tmp/ruby/src/trunk/yjit/src/lib.rs I, [2024-05-03T15:53:41.958757 #3548468] INFO -- : gcc (Ubuntu 11.4.0-1ubuntu1~22.04) 11.4.0 I, [2024-05-03T15:53:41.958799 #3548468] INFO -- : Copyright (C) 2021 Free Software Foundation, Inc. I, [2024-05-03T15:53:41.958811 #3548468] INFO -- : This is free software; see the source for copying conditions. There is NO I, [2024-05-03T15:53:41.958823 #3548468] INFO -- : warranty; not even for MERCHANTABILITY or FITNESS FOR A PARTICULAR PURPOSE. I, [2024-05-03T15:53:41.958833 #3548468] INFO -- : I, [2024-05-03T15:53:41.987569 #3548468] INFO -- : generating enc.mk I, [2024-05-03T15:53:41.989494 #3548468] INFO -- : building spec/ruby/optional/capi/ext/array_spec.so I, [2024-05-03T15:53:41.989811 #3548468] INFO -- : building spec/ruby/optional/capi/ext/basic_object_spec.so I, [2024-05-03T15:53:41.990582 #3548468] INFO -- : building spec/ruby/optional/capi/ext/bignum_spec.so I, [2024-05-03T15:53:41.991144 #3548468] INFO -- : building spec/ruby/optional/capi/ext/binding_spec.so I, [2024-05-03T15:53:41.991581 #3548468] INFO -- : building spec/ruby/optional/capi/ext/boolean_spec.so I, [2024-05-03T15:53:41.992138 #3548468] INFO -- : building spec/ruby/optional/capi/ext/class_id_under_autoload_spec.so I, [2024-05-03T15:53:41.992510 #3548468] INFO -- : building spec/ruby/optional/capi/ext/class_spec.so I, [2024-05-03T15:53:41.993807 #3548468] INFO -- : building spec/ruby/optional/capi/ext/class_under_autoload_spec.so I, [2024-05-03T15:53:41.994798 #3548468] INFO -- : building spec/ruby/optional/capi/ext/complex_spec.so I, [2024-05-03T15:53:41.995192 #3548468] INFO -- : building spec/ruby/optional/capi/ext/constants_spec.so I, [2024-05-03T15:53:41.995851 #3548468] INFO -- : building spec/ruby/optional/capi/ext/data_spec.so I, [2024-05-03T15:53:41.996264 #3548468] INFO -- : building spec/ruby/optional/capi/ext/debug_spec.so I, [2024-05-03T15:53:41.996990 #3548468] INFO -- : building spec/ruby/optional/capi/ext/encoding_spec.so I, [2024-05-03T15:53:41.997925 #3548468] INFO -- : building spec/ruby/optional/capi/ext/enumerator_spec.so I, [2024-05-03T15:53:41.998286 #3548468] INFO -- : building spec/ruby/optional/capi/ext/exception_spec.so I, [2024-05-03T15:53:41.998947 #3548468] INFO -- : building spec/ruby/optional/capi/ext/fiber_spec.so I, [2024-05-03T15:53:41.999139 #3548468] INFO -- : building spec/ruby/optional/capi/ext/file_spec.so I, [2024-05-03T15:53:42.000051 #3548468] INFO -- : building spec/ruby/optional/capi/ext/fixnum_spec.so I, [2024-05-03T15:53:42.012629 #3548468] INFO -- : building spec/ruby/optional/capi/ext/float_spec.so I, [2024-05-03T15:53:42.096173 #3548468] INFO -- : building spec/ruby/optional/capi/ext/gc_spec.so I, [2024-05-03T15:53:42.127752 #3548468] INFO -- : building spec/ruby/optional/capi/ext/globals_spec.so I, [2024-05-03T15:53:42.129305 #3548468] INFO -- : building spec/ruby/optional/capi/ext/hash_spec.so I, [2024-05-03T15:53:42.148644 #3548468] INFO -- : building spec/ruby/optional/capi/ext/integer_spec.so I, [2024-05-03T15:53:42.152001 #3548468] INFO -- : building spec/ruby/optional/capi/ext/io_spec.so I, [2024-05-03T15:53:42.183179 #3548468] INFO -- : building spec/ruby/optional/capi/ext/kernel_spec.so I, [2024-05-03T15:53:42.183517 #3548468] INFO -- : building spec/ruby/optional/capi/ext/language_spec.so I, [2024-05-03T15:53:42.183876 #3548468] INFO -- : building spec/ruby/optional/capi/ext/marshal_spec.so I, [2024-05-03T15:53:42.184711 #3548468] INFO -- : building spec/ruby/optional/capi/ext/module_spec.so I, [2024-05-03T15:53:42.185163 #3548468] INFO -- : building spec/ruby/optional/capi/ext/module_under_autoload_spec.so I, [2024-05-03T15:53:42.201226 #3548468] INFO -- : building spec/ruby/optional/capi/ext/mutex_spec.so I, [2024-05-03T15:53:42.216777 #3548468] INFO -- : building spec/ruby/optional/capi/ext/numeric_spec.so I, [2024-05-03T15:53:42.217733 #3548468] INFO -- : building spec/ruby/optional/capi/ext/proc_spec.so I, [2024-05-03T15:53:42.217776 #3548468] INFO -- : building spec/ruby/optional/capi/ext/object_spec.so I, [2024-05-03T15:53:42.218670 #3548468] INFO -- : building spec/ruby/optional/capi/ext/range_spec.so I, [2024-05-03T15:53:42.218983 #3548468] INFO -- : building spec/ruby/optional/capi/ext/rational_spec.so I, [2024-05-03T15:53:42.225736 #3548468] INFO -- : building spec/ruby/optional/capi/ext/rbasic_spec.so I, [2024-05-03T15:53:42.249536 #3548468] INFO -- : building spec/ruby/optional/capi/ext/regexp_spec.so I, [2024-05-03T15:53:42.276100 #3548468] INFO -- : building spec/ruby/optional/capi/ext/string_spec.so I, [2024-05-03T15:53:42.279266 #3548468] INFO -- : building spec/ruby/optional/capi/ext/struct_spec.so I, [2024-05-03T15:53:42.303760 #3548468] INFO -- : building spec/ruby/optional/capi/ext/st_spec.so I, [2024-05-03T15:53:42.308220 #3548468] INFO -- : building spec/ruby/optional/capi/ext/symbol_spec.so I, [2024-05-03T15:53:42.309928 #3548468] INFO -- : building spec/ruby/optional/capi/ext/thread_spec.so I, [2024-05-03T15:53:42.338068 #3548468] INFO -- : building spec/ruby/optional/capi/ext/time_spec.so I, [2024-05-03T15:53:42.347909 #3548468] INFO -- : building spec/ruby/optional/capi/ext/tracepoint_spec.so I, [2024-05-03T15:53:42.364704 #3548468] INFO -- : building spec/ruby/optional/capi/ext/typed_data_spec.so I, [2024-05-03T15:53:42.371914 #3548468] INFO -- : building spec/ruby/optional/capi/ext/util_spec.so I, [2024-05-03T15:53:42.380901 #3548468] INFO -- : making enc I, [2024-05-03T15:53:42.382181 #3548468] INFO -- : making srcs under enc I, [2024-05-03T15:53:42.408395 #3548468] INFO -- : make[1]: Entering directory '/tmp/ruby/build/trunk' I, [2024-05-03T15:53:42.408463 #3548468] INFO -- : make[1]: Nothing to be done for 'enc'. I, [2024-05-03T15:53:42.408475 #3548468] INFO -- : make[1]: Leaving directory '/tmp/ruby/build/trunk' I, [2024-05-03T15:53:42.421588 #3548468] INFO -- : make[1]: Entering directory '/tmp/ruby/build/trunk' I, [2024-05-03T15:53:42.421646 #3548468] INFO -- : make[1]: Nothing to be done for 'srcs'. I, [2024-05-03T15:53:42.421656 #3548468] INFO -- : make[1]: Leaving directory '/tmp/ruby/build/trunk' I, [2024-05-03T15:53:42.422142 #3548468] INFO -- : generating transdb.h I, [2024-05-03T15:53:42.557107 #3548468] INFO -- : transdb.h unchanged I, [2024-05-03T15:53:42.558762 #3548468] INFO -- : generating makefiles ext/configure-ext.mk I, [2024-05-03T15:53:42.559016 #3548468] INFO -- : making trans I, [2024-05-03T15:53:42.586720 #3548468] INFO -- : ext/configure-ext.mk updated I, [2024-05-03T15:53:42.588992 #3548468] INFO -- : make[1]: Entering directory '/tmp/ruby/build/trunk' I, [2024-05-03T15:53:42.592258 #3548468] INFO -- : make[1]: Entering directory '/tmp/ruby/build/trunk' I, [2024-05-03T15:53:42.592304 #3548468] INFO -- : make[1]: Nothing to be done for 'trans'. I, [2024-05-03T15:53:42.592313 #3548468] INFO -- : make[1]: Leaving directory '/tmp/ruby/build/trunk' I, [2024-05-03T15:53:42.593010 #3548468] INFO -- : making encs I, [2024-05-03T15:53:42.650480 #3548468] INFO -- : make[1]: Entering directory '/tmp/ruby/build/trunk' I, [2024-05-03T15:53:42.650551 #3548468] INFO -- : make[1]: Nothing to be done for 'encs'. I, [2024-05-03T15:53:42.650577 #3548468] INFO -- : make[1]: Leaving directory '/tmp/ruby/build/trunk' I, [2024-05-03T15:53:42.746463 #3548468] INFO -- : make[1]: Leaving directory '/tmp/ruby/build/trunk' I, [2024-05-03T15:53:42.747183 #3548468] INFO -- : generating makefile exts.mk I, [2024-05-03T15:53:42.785277 #3548468] INFO -- : exts.mk unchanged I, [2024-05-03T15:53:42.789959 #3548468] INFO -- : make[1]: Entering directory '/tmp/ruby/build/trunk' I, [2024-05-03T15:53:42.808605 #3548468] INFO -- : make[2]: Entering directory '/tmp/ruby/build/trunk/ext/digest' I, [2024-05-03T15:53:42.809861 #3548468] INFO -- : make[2]: Entering directory '/tmp/ruby/build/trunk/ext/coverage' I, [2024-05-03T15:53:42.810687 #3548468] INFO -- : make[2]: Entering directory '/tmp/ruby/build/trunk/ext/json' I, [2024-05-03T15:53:42.810911 #3548468] INFO -- : make[2]: Entering directory '/tmp/ruby/build/trunk/ext/date' I, [2024-05-03T15:53:42.811088 #3548468] INFO -- : make[2]: Entering directory '/tmp/ruby/build/trunk/ext/io/console' I, [2024-05-03T15:53:42.812222 #3548468] INFO -- : make[2]: Leaving directory '/tmp/ruby/build/trunk/ext/coverage' I, [2024-05-03T15:53:42.812358 #3548468] INFO -- : make[2]: Entering directory '/tmp/ruby/build/trunk/ext/monitor' I, [2024-05-03T15:53:42.812422 #3548468] INFO -- : make[2]: Leaving directory '/tmp/ruby/build/trunk/ext/digest' I, [2024-05-03T15:53:42.813325 #3548468] INFO -- : make[2]: Leaving directory '/tmp/ruby/build/trunk/ext/io/console' I, [2024-05-03T15:53:42.813501 #3548468] INFO -- : make[2]: Leaving directory '/tmp/ruby/build/trunk/ext/date' I, [2024-05-03T15:53:42.813690 #3548468] INFO -- : make[2]: Entering directory '/tmp/ruby/build/trunk/ext/fiddle' I, [2024-05-03T15:53:42.814975 #3548468] INFO -- : make[2]: Entering directory '/tmp/ruby/build/trunk/ext/rubyvm' I, [2024-05-03T15:53:42.814999 #3548468] INFO -- : make[2]: Leaving directory '/tmp/ruby/build/trunk/ext/monitor' I, [2024-05-03T15:53:42.815736 #3548468] INFO -- : make[2]: Leaving directory '/tmp/ruby/build/trunk/ext/json' I, [2024-05-03T15:53:42.816401 #3548468] INFO -- : make[2]: Entering directory '/tmp/ruby/build/trunk/.bundle/gems/debug-1.9.2/ext/debug' I, [2024-05-03T15:53:42.816426 #3548468] INFO -- : make[2]: Entering directory '/tmp/ruby/build/trunk/.bundle/gems/nkf-0.2.0/ext/nkf' I, [2024-05-03T15:53:42.816538 #3548468] INFO -- : make[2]: Entering directory '/tmp/ruby/build/trunk/.bundle/gems/bigdecimal-3.1.7/ext/bigdecimal' I, [2024-05-03T15:53:42.816596 #3548468] INFO -- : make[2]: Entering directory '/tmp/ruby/build/trunk/ext/pty' I, [2024-05-03T15:53:42.816708 #3548468] INFO -- : make[2]: Entering directory '/tmp/ruby/build/trunk/ext/pathname' I, [2024-05-03T15:53:42.817093 #3548468] INFO -- : make[2]: Leaving directory '/tmp/ruby/build/trunk/ext/rubyvm' I, [2024-05-03T15:53:42.818296 #3548468] INFO -- : make[2]: Entering directory '/tmp/ruby/build/trunk/ext/psych' I, [2024-05-03T15:53:42.818349 #3548468] INFO -- : make[2]: Entering directory '/tmp/ruby/build/trunk/ext/objspace' I, [2024-05-03T15:53:42.819637 #3548468] INFO -- : make[2]: Leaving directory '/tmp/ruby/build/trunk/ext/pathname' I, [2024-05-03T15:53:42.820054 #3548468] INFO -- : make[2]: Leaving directory '/tmp/ruby/build/trunk/ext/pty' I, [2024-05-03T15:53:42.820358 #3548468] INFO -- : make[2]: Entering directory '/tmp/ruby/build/trunk/.bundle/gems/racc-1.7.3/ext/racc/cparse' I, [2024-05-03T15:53:42.820507 #3548468] INFO -- : make[2]: Entering directory '/tmp/ruby/build/trunk/.bundle/gems/syslog-0.1.2/ext/syslog' I, [2024-05-03T15:53:42.820552 #3548468] INFO -- : make[2]: Leaving directory '/tmp/ruby/build/trunk/ext/fiddle' I, [2024-05-03T15:53:42.821330 #3548468] INFO -- : make[2]: Entering directory '/tmp/ruby/build/trunk/ext/ripper' I, [2024-05-03T15:53:42.821457 #3548468] INFO -- : make[2]: Entering directory '/tmp/ruby/build/trunk/.bundle/gems/rbs-3.4.4/ext/rbs_extension' I, [2024-05-03T15:53:42.822594 #3548468] INFO -- : make[2]: Leaving directory '/tmp/ruby/build/trunk/ext/objspace' I, [2024-05-03T15:53:42.824647 #3548468] INFO -- : make[2]: Entering directory '/tmp/ruby/build/trunk/ext/socket' I, [2024-05-03T15:53:42.827796 #3548468] INFO -- : make[2]: Entering directory '/tmp/ruby/build/trunk/ext/digest/sha2' I, [2024-05-03T15:53:42.828574 #3548468] INFO -- : make[2]: Leaving directory '/tmp/ruby/build/trunk/ext/ripper' I, [2024-05-03T15:53:42.828622 #3548468] INFO -- : make[2]: Entering directory '/tmp/ruby/build/trunk/ext/openssl' I, [2024-05-03T15:53:42.828766 #3548468] INFO -- : make[2]: Leaving directory '/tmp/ruby/build/trunk/ext/psych' I, [2024-05-03T15:53:42.830125 #3548468] INFO -- : make[2]: Leaving directory '/tmp/ruby/build/trunk/ext/digest/sha2' I, [2024-05-03T15:53:42.831741 #3548468] INFO -- : make[2]: Leaving directory '/tmp/ruby/build/trunk/ext/socket' I, [2024-05-03T15:53:42.840063 #3548468] INFO -- : make[2]: Leaving directory '/tmp/ruby/build/trunk/ext/openssl' I, [2024-05-03T15:53:42.846941 #3548468] INFO -- : make[2]: Leaving directory '/tmp/ruby/build/trunk/.bundle/gems/rbs-3.4.4/ext/rbs_extension' I, [2024-05-03T15:53:42.854161 #3548468] INFO -- : make[2]: Leaving directory '/tmp/ruby/build/trunk/.bundle/gems/nkf-0.2.0/ext/nkf' I, [2024-05-03T15:53:42.854207 #3548468] INFO -- : make[2]: Leaving directory '/tmp/ruby/build/trunk/.bundle/gems/debug-1.9.2/ext/debug' I, [2024-05-03T15:53:42.854420 #3548468] INFO -- : make[2]: Leaving directory '/tmp/ruby/build/trunk/.bundle/gems/bigdecimal-3.1.7/ext/bigdecimal' I, [2024-05-03T15:53:42.855286 #3548468] INFO -- : make[2]: Leaving directory '/tmp/ruby/build/trunk/.bundle/gems/syslog-0.1.2/ext/syslog' I, [2024-05-03T15:53:42.857686 #3548468] INFO -- : make[2]: Leaving directory '/tmp/ruby/build/trunk/.bundle/gems/racc-1.7.3/ext/racc/cparse' I, [2024-05-03T15:53:42.881841 #3548468] INFO -- : make[2]: Entering directory '/tmp/ruby/build/trunk' I, [2024-05-03T15:53:42.948771 #3548468] INFO -- : linking ruby I, [2024-05-03T15:53:42.971322 #3548468] INFO -- : make[2]: Leaving directory '/tmp/ruby/build/trunk' I, [2024-05-03T15:53:42.971913 #3548468] INFO -- : make[1]: Leaving directory '/tmp/ruby/build/trunk' I, [2024-05-03T15:53:42.975551 #3548468] INFO -- : make[1]: Entering directory '/tmp/ruby/build/trunk' I, [2024-05-03T15:53:42.975574 #3548468] INFO -- : make[1]: Nothing to be done for 'note'. I, [2024-05-03T15:53:42.975580 #3548468] INFO -- : make[1]: Leaving directory '/tmp/ruby/build/trunk' I, [2024-05-03T15:53:42.976158 #3548468] INFO -- : $$$[end] "make all -j20" exit with 0. I, [2024-05-03T15:53:42.976295 #3548468] INFO -- : $$$[beg] make install -j20 I, [2024-05-03T15:53:43.039610 #3548468] INFO -- : Update minitest to ea9caafc0754b1d6236a490d59e624b53209734a I, [2024-05-03T15:53:43.039816 #3548468] INFO -- : Update power_assert to 84e85124c5014a139af39161d484156cfe87a9ed I, [2024-05-03T15:53:43.040203 #3548468] INFO -- : Update rbs to ba7872795d5de04adb8ff500c0e6afdc81a041dd I, [2024-05-03T15:53:43.040271 #3548468] INFO -- : Update typeprof to b19a6416da3a05d57fadd6ffdadb382b6d236ca5 I, [2024-05-03T15:53:43.041033 #3548468] INFO -- : echo ea9caafc0754b1d6236a490d59e624b53209734a | /bin/sh /tmp/ruby/src/trunk/tool/ifchange /tmp/ruby/src/trunk/.bundle/.timestamp/minitest.revision - I, [2024-05-03T15:53:43.041529 #3548468] INFO -- : echo 84e85124c5014a139af39161d484156cfe87a9ed | /bin/sh /tmp/ruby/src/trunk/tool/ifchange /tmp/ruby/src/trunk/.bundle/.timestamp/power_assert.revision - I, [2024-05-03T15:53:43.042538 #3548468] INFO -- : BASERUBY = /usr/bin/ruby --disable=gems I, [2024-05-03T15:53:43.042590 #3548468] INFO -- : CC = gcc I, [2024-05-03T15:53:43.042604 #3548468] INFO -- : LD = ld I, [2024-05-03T15:53:43.042616 #3548468] INFO -- : LDSHARED = gcc -shared I, [2024-05-03T15:53:43.042627 #3548468] INFO -- : CFLAGS = -O3 -fno-fast-math -ggdb3 -Wall -Wextra -Wdeprecated-declarations -Wdiv-by-zero -Wduplicated-cond -Wimplicit-function-declaration -Wimplicit-int -Wpointer-arith -Wwrite-strings -Wold-style-definition -Wimplicit-fallthrough=0 -Wmissing-noreturn -Wno-cast-function-type -Wno-constant-logical-operand -Wno-long-long -Wno-missing-field-initializers -Wno-overlength-strings -Wno-packed-bitfield-compat -Wno-parentheses-equality -Wno-self-assign -Wno-tautological-compare -Wno-unused-parameter -Wno-unused-value -Wsuggest-attribute=format -Wsuggest-attribute=noreturn -Wunused-variable -Wmisleading-indentation -Wundef -fPIC I, [2024-05-03T15:53:43.042640 #3548468] INFO -- : XCFLAGS = -U_FORTIFY_SOURCE -D_FORTIFY_SOURCE=2 -fstack-protector-strong -fno-strict-overflow -fvisibility=hidden -fexcess-precision=standard -DRUBY_EXPORT -I. -I.ext/include/x86_64-linux -I/tmp/ruby/src/trunk/include -I/tmp/ruby/src/trunk -I/tmp/ruby/src/trunk/prism -I/tmp/ruby/src/trunk/enc/unicode/15.0.0 I, [2024-05-03T15:53:43.042651 #3548468] INFO -- : CPPFLAGS = I, [2024-05-03T15:53:43.042662 #3548468] INFO -- : DLDFLAGS = -Wl,--compress-debug-sections=zlib -Wl,-soname,libruby.so.3.4 -fstack-protector-strong I, [2024-05-03T15:53:43.042672 #3548468] INFO -- : SOLIBS = -lz -lrt -lrt -lgmp -ldl -lcrypt -lm -lpthread I, [2024-05-03T15:53:43.042686 #3548468] INFO -- : LANG = en_US.UTF-8 I, [2024-05-03T15:53:43.042698 #3548468] INFO -- : LC_ALL = I, [2024-05-03T15:53:43.042708 #3548468] INFO -- : LC_CTYPE = I, [2024-05-03T15:53:43.042718 #3548468] INFO -- : MFLAGS = -j20 --jobserver-auth=4,5 I, [2024-05-03T15:53:43.042727 #3548468] INFO -- : RUSTC = no I, [2024-05-03T15:53:43.042738 #3548468] INFO -- : YJIT_RUSTC_ARGS = --crate-name=yjit --crate-type=staticlib --edition=2021 -g -C lto=thin -C opt-level=3 -C overflow-checks=on '--out-dir=/tmp/ruby/build/trunk/yjit/target/release/' /tmp/ruby/src/trunk/yjit/src/lib.rs I, [2024-05-03T15:53:43.042899 #3548468] INFO -- : /tmp/ruby/src/trunk/.bundle/.timestamp/minitest.revision unchanged I, [2024-05-03T15:53:43.043508 #3548468] INFO -- : /tmp/ruby/src/trunk/.bundle/.timestamp/power_assert.revision unchanged I, [2024-05-03T15:53:43.070232 #3548468] INFO -- : echo ba7872795d5de04adb8ff500c0e6afdc81a041dd | /bin/sh /tmp/ruby/src/trunk/tool/ifchange /tmp/ruby/src/trunk/.bundle/.timestamp/rbs.revision - I, [2024-05-03T15:53:43.070370 #3548468] INFO -- : echo b19a6416da3a05d57fadd6ffdadb382b6d236ca5 | /bin/sh /tmp/ruby/src/trunk/tool/ifchange /tmp/ruby/src/trunk/.bundle/.timestamp/typeprof.revision - I, [2024-05-03T15:53:43.071129 #3548468] INFO -- : gcc (Ubuntu 11.4.0-1ubuntu1~22.04) 11.4.0 I, [2024-05-03T15:53:43.071173 #3548468] INFO -- : Copyright (C) 2021 Free Software Foundation, Inc. I, [2024-05-03T15:53:43.071196 #3548468] INFO -- : This is free software; see the source for copying conditions. There is NO I, [2024-05-03T15:53:43.071208 #3548468] INFO -- : warranty; not even for MERCHANTABILITY or FITNESS FOR A PARTICULAR PURPOSE. I, [2024-05-03T15:53:43.071219 #3548468] INFO -- : I, [2024-05-03T15:53:43.071229 #3548468] INFO -- : generating enc.mk I, [2024-05-03T15:53:43.072082 #3548468] INFO -- : /tmp/ruby/src/trunk/.bundle/.timestamp/rbs.revision unchanged I, [2024-05-03T15:53:43.072425 #3548468] INFO -- : /tmp/ruby/src/trunk/.bundle/.timestamp/typeprof.revision unchanged I, [2024-05-03T15:53:43.192996 #3548468] INFO -- : Building power_assert@84e85124c5014a139af39161d484156cfe87a9ed to /tmp/ruby/src/trunk/gems/power_assert-2.0.3.gem I, [2024-05-03T15:53:43.193691 #3548468] INFO -- : making srcs under enc I, [2024-05-03T15:53:43.194019 #3548468] INFO -- : making enc I, [2024-05-03T15:53:43.210945 #3548468] INFO -- : make[1]: Entering directory '/tmp/ruby/build/trunk' I, [2024-05-03T15:53:43.211007 #3548468] INFO -- : make[1]: Nothing to be done for 'enc'. I, [2024-05-03T15:53:43.211020 #3548468] INFO -- : make[1]: Leaving directory '/tmp/ruby/build/trunk' I, [2024-05-03T15:53:43.223397 #3548468] INFO -- : make[1]: Entering directory '/tmp/ruby/build/trunk' I, [2024-05-03T15:53:43.223455 #3548468] INFO -- : make[1]: Nothing to be done for 'srcs'. I, [2024-05-03T15:53:43.223468 #3548468] INFO -- : make[1]: Leaving directory '/tmp/ruby/build/trunk' I, [2024-05-03T15:53:43.224211 #3548468] INFO -- : generating transdb.h I, [2024-05-03T15:53:43.261782 #3548468] INFO -- : Successfully built RubyGem I, [2024-05-03T15:53:43.261844 #3548468] INFO -- : Name: power_assert I, [2024-05-03T15:53:43.261856 #3548468] INFO -- : Version: 2.0.4dev I, [2024-05-03T15:53:43.261869 #3548468] INFO -- : File: power_assert-2.0.4dev.gem I, [2024-05-03T15:53:43.263969 #3548468] INFO -- : Extracting bundle gem power_assert-2.0.3... I, [2024-05-03T15:53:43.318875 #3548468] INFO -- : transdb.h unchanged I, [2024-05-03T15:53:43.320424 #3548468] INFO -- : generating makefiles ext/configure-ext.mk I, [2024-05-03T15:53:43.320592 #3548468] INFO -- : making trans I, [2024-05-03T15:53:43.325080 #3548468] INFO -- : Try with hash version of bundled gems instead of gems/power_assert-2.0.3.gem. We don't use this gem with release version of Ruby. I, [2024-05-03T15:53:43.330110 #3548468] INFO -- : Unpacked gems/power_assert-2.0.4dev.gem I, [2024-05-03T15:53:43.348021 #3548468] INFO -- : ext/configure-ext.mk unchanged I, [2024-05-03T15:53:43.350321 #3548468] INFO -- : make[1]: Entering directory '/tmp/ruby/build/trunk' I, [2024-05-03T15:53:43.355248 #3548468] INFO -- : make[1]: Entering directory '/tmp/ruby/build/trunk' I, [2024-05-03T15:53:43.355341 #3548468] INFO -- : make[1]: Nothing to be done for 'trans'. I, [2024-05-03T15:53:43.355350 #3548468] INFO -- : make[1]: Leaving directory '/tmp/ruby/build/trunk' I, [2024-05-03T15:53:43.356263 #3548468] INFO -- : making encs I, [2024-05-03T15:53:43.415126 #3548468] INFO -- : make[1]: Entering directory '/tmp/ruby/build/trunk' I, [2024-05-03T15:53:43.415196 #3548468] INFO -- : make[1]: Nothing to be done for 'encs'. I, [2024-05-03T15:53:43.415220 #3548468] INFO -- : make[1]: Leaving directory '/tmp/ruby/build/trunk' I, [2024-05-03T15:53:43.506378 #3548468] INFO -- : make[1]: Leaving directory '/tmp/ruby/build/trunk' I, [2024-05-03T15:53:43.506983 #3548468] INFO -- : generating makefile exts.mk I, [2024-05-03T15:53:43.544900 #3548468] INFO -- : exts.mk unchanged I, [2024-05-03T15:53:43.549736 #3548468] INFO -- : make[1]: Entering directory '/tmp/ruby/build/trunk' I, [2024-05-03T15:53:43.570556 #3548468] INFO -- : make[2]: Entering directory '/tmp/ruby/build/trunk/ext/digest' I, [2024-05-03T15:53:43.571610 #3548468] INFO -- : make[2]: Entering directory '/tmp/ruby/build/trunk/ext/json' I, [2024-05-03T15:53:43.571903 #3548468] INFO -- : make[2]: Entering directory '/tmp/ruby/build/trunk/ext/coverage' I, [2024-05-03T15:53:43.572325 #3548468] INFO -- : make[2]: Entering directory '/tmp/ruby/build/trunk/ext/date' I, [2024-05-03T15:53:43.572729 #3548468] INFO -- : make[2]: Entering directory '/tmp/ruby/build/trunk/ext/io/console' I, [2024-05-03T15:53:43.574479 #3548468] INFO -- : make[2]: Leaving directory '/tmp/ruby/build/trunk/ext/digest' I, [2024-05-03T15:53:43.574666 #3548468] INFO -- : make[2]: Entering directory '/tmp/ruby/build/trunk/ext/monitor' I, [2024-05-03T15:53:43.574840 #3548468] INFO -- : make[2]: Entering directory '/tmp/ruby/build/trunk/ext/fiddle' I, [2024-05-03T15:53:43.574988 #3548468] INFO -- : make[2]: Entering directory '/tmp/ruby/build/trunk/ext/rubyvm' I, [2024-05-03T15:53:43.575158 #3548468] INFO -- : make[2]: Leaving directory '/tmp/ruby/build/trunk/ext/coverage' I, [2024-05-03T15:53:43.575436 #3548468] INFO -- : make[2]: Entering directory '/tmp/ruby/build/trunk/ext/pathname' I, [2024-05-03T15:53:43.575468 #3548468] INFO -- : make[2]: Leaving directory '/tmp/ruby/build/trunk/ext/io/console' I, [2024-05-03T15:53:43.576008 #3548468] INFO -- : make[2]: Entering directory '/tmp/ruby/build/trunk/ext/pty' I, [2024-05-03T15:53:43.576232 #3548468] INFO -- : make[2]: Leaving directory '/tmp/ruby/build/trunk/ext/date' I, [2024-05-03T15:53:43.576922 #3548468] INFO -- : make[2]: Entering directory '/tmp/ruby/build/trunk/ext/objspace' I, [2024-05-03T15:53:43.577224 #3548468] INFO -- : make[2]: Leaving directory '/tmp/ruby/build/trunk/ext/monitor' I, [2024-05-03T15:53:43.577489 #3548468] INFO -- : make[2]: Leaving directory '/tmp/ruby/build/trunk/ext/rubyvm' I, [2024-05-03T15:53:43.577553 #3548468] INFO -- : make[2]: Entering directory '/tmp/ruby/build/trunk/.bundle/gems/bigdecimal-3.1.7/ext/bigdecimal' I, [2024-05-03T15:53:43.577574 #3548468] INFO -- : make[2]: Entering directory '/tmp/ruby/build/trunk/ext/psych' I, [2024-05-03T15:53:43.577876 #3548468] INFO -- : make[2]: Entering directory '/tmp/ruby/build/trunk/.bundle/gems/debug-1.9.2/ext/debug' I, [2024-05-03T15:53:43.578151 #3548468] INFO -- : make[2]: Entering directory '/tmp/ruby/build/trunk/.bundle/gems/nkf-0.2.0/ext/nkf' I, [2024-05-03T15:53:43.578580 #3548468] INFO -- : make[2]: Entering directory '/tmp/ruby/build/trunk/.bundle/gems/racc-1.7.3/ext/racc/cparse' I, [2024-05-03T15:53:43.579405 #3548468] INFO -- : make[2]: Leaving directory '/tmp/ruby/build/trunk/ext/pty' I, [2024-05-03T15:53:43.579953 #3548468] INFO -- : make[2]: Leaving directory '/tmp/ruby/build/trunk/ext/pathname' I, [2024-05-03T15:53:43.580390 #3548468] INFO -- : make[2]: Entering directory '/tmp/ruby/build/trunk/.bundle/gems/syslog-0.1.2/ext/syslog' I, [2024-05-03T15:53:43.580604 #3548468] INFO -- : make[2]: Entering directory '/tmp/ruby/build/trunk/.bundle/gems/rbs-3.4.4/ext/rbs_extension' I, [2024-05-03T15:53:43.580928 #3548468] INFO -- : make[2]: Leaving directory '/tmp/ruby/build/trunk/ext/json' I, [2024-05-03T15:53:43.581271 #3548468] INFO -- : make[2]: Entering directory '/tmp/ruby/build/trunk/ext/ripper' I, [2024-05-03T15:53:43.582038 #3548468] INFO -- : make[2]: Leaving directory '/tmp/ruby/build/trunk/ext/objspace' I, [2024-05-03T15:53:43.583938 #3548468] INFO -- : make[2]: Entering directory '/tmp/ruby/build/trunk/ext/socket' I, [2024-05-03T15:53:43.584434 #3548468] INFO -- : make[2]: Leaving directory '/tmp/ruby/build/trunk/ext/fiddle' I, [2024-05-03T15:53:43.586581 #3548468] INFO -- : make[2]: Leaving directory '/tmp/ruby/build/trunk/ext/ripper' I, [2024-05-03T15:53:43.587552 #3548468] INFO -- : make[2]: Entering directory '/tmp/ruby/build/trunk/ext/digest/sha2' I, [2024-05-03T15:53:43.589382 #3548468] INFO -- : make[2]: Leaving directory '/tmp/ruby/build/trunk/ext/psych' I, [2024-05-03T15:53:43.589403 #3548468] INFO -- : make[2]: Entering directory '/tmp/ruby/build/trunk/ext/openssl' I, [2024-05-03T15:53:43.589788 #3548468] INFO -- : make[2]: Leaving directory '/tmp/ruby/build/trunk/ext/digest/sha2' I, [2024-05-03T15:53:43.592592 #3548468] INFO -- : make[2]: Leaving directory '/tmp/ruby/build/trunk/ext/socket' I, [2024-05-03T15:53:43.600506 #3548468] INFO -- : make[2]: Leaving directory '/tmp/ruby/build/trunk/ext/openssl' I, [2024-05-03T15:53:43.600758 #3548468] INFO -- : make[2]: Leaving directory '/tmp/ruby/build/trunk/.bundle/gems/bigdecimal-3.1.7/ext/bigdecimal' I, [2024-05-03T15:53:43.601220 #3548468] INFO -- : make[2]: Leaving directory '/tmp/ruby/build/trunk/.bundle/gems/nkf-0.2.0/ext/nkf' I, [2024-05-03T15:53:43.605027 #3548468] INFO -- : make[2]: Leaving directory '/tmp/ruby/build/trunk/.bundle/gems/racc-1.7.3/ext/racc/cparse' I, [2024-05-03T15:53:43.612234 #3548468] INFO -- : make[2]: Leaving directory '/tmp/ruby/build/trunk/.bundle/gems/rbs-3.4.4/ext/rbs_extension' I, [2024-05-03T15:53:43.614787 #3548468] INFO -- : make[2]: Leaving directory '/tmp/ruby/build/trunk/.bundle/gems/syslog-0.1.2/ext/syslog' I, [2024-05-03T15:53:43.615423 #3548468] INFO -- : make[2]: Leaving directory '/tmp/ruby/build/trunk/.bundle/gems/debug-1.9.2/ext/debug' I, [2024-05-03T15:53:43.640273 #3548468] INFO -- : make[2]: Entering directory '/tmp/ruby/build/trunk' I, [2024-05-03T15:53:43.705951 #3548468] INFO -- : make[2]: 'ruby' is up to date. I, [2024-05-03T15:53:43.705989 #3548468] INFO -- : make[2]: Leaving directory '/tmp/ruby/build/trunk' I, [2024-05-03T15:53:43.706389 #3548468] INFO -- : make[1]: Leaving directory '/tmp/ruby/build/trunk' I, [2024-05-03T15:53:43.710067 #3548468] INFO -- : make[1]: Entering directory '/tmp/ruby/build/trunk' I, [2024-05-03T15:53:43.710091 #3548468] INFO -- : make[1]: Nothing to be done for 'note'. I, [2024-05-03T15:53:43.710101 #3548468] INFO -- : make[1]: Leaving directory '/tmp/ruby/build/trunk' I, [2024-05-03T15:53:43.710589 #3548468] INFO -- : ./miniruby -I/tmp/ruby/src/trunk/lib -I. -I.ext/common /tmp/ruby/src/trunk/tool/runruby.rb --extout=.ext -- --disable-gems -r./x86_64-linux-fake /tmp/ruby/src/trunk/tool/rbinstall.rb --make="make" --dest-dir="" --extout=".ext" --ext-build-dir="./ext" --mflags="-j20 --jobserver-auth=4,5" --make-flags=" -j20 --jobserver-auth=4,5" --data-mode=0644 --prog-mode=0755 --installed-list .installed.list --mantype="doc" --gnumake --install=all --exclude=doc I, [2024-05-03T15:53:43.807127 #3548468] INFO -- : Installing to I, [2024-05-03T15:53:43.807197 #3548468] INFO -- : installing binary commands: /tmp/ruby/install/trunk/bin I, [2024-05-03T15:53:43.807283 #3548468] INFO -- : installing base libraries: /tmp/ruby/install/trunk/lib I, [2024-05-03T15:53:43.814507 #3548468] INFO -- : installing arch files: /tmp/ruby/install/trunk/lib/ruby/3.4.0+0/x86_64-linux I, [2024-05-03T15:53:43.814532 #3548468] INFO -- : installing pkgconfig data: /tmp/ruby/install/trunk/lib/pkgconfig I, [2024-05-03T15:53:43.814538 #3548468] INFO -- : installing extension objects: /tmp/ruby/install/trunk/lib/ruby/3.4.0+0/x86_64-linux I, [2024-05-03T15:53:43.824191 #3548468] INFO -- : installing extension objects: /tmp/ruby/install/trunk/lib/ruby/site_ruby/3.4.0+0/x86_64-linux I, [2024-05-03T15:53:43.824226 #3548468] INFO -- : installing extension objects: /tmp/ruby/install/trunk/lib/ruby/vendor_ruby/3.4.0+0/x86_64-linux I, [2024-05-03T15:53:43.824233 #3548468] INFO -- : installing extension headers: /tmp/ruby/install/trunk/include/ruby-3.4.0+0/x86_64-linux I, [2024-05-03T15:53:43.824360 #3548468] INFO -- : installing extension scripts: /tmp/ruby/install/trunk/lib/ruby/3.4.0+0 I, [2024-05-03T15:53:43.828096 #3548468] INFO -- : installing extension scripts: /tmp/ruby/install/trunk/lib/ruby/site_ruby/3.4.0+0 I, [2024-05-03T15:53:43.828124 #3548468] INFO -- : installing extension scripts: /tmp/ruby/install/trunk/lib/ruby/vendor_ruby/3.4.0+0 I, [2024-05-03T15:53:43.828132 #3548468] INFO -- : installing extension headers: /tmp/ruby/install/trunk/include/ruby-3.4.0+0/ruby I, [2024-05-03T15:53:43.828141 #3548468] INFO -- : installing command scripts: /tmp/ruby/install/trunk/bin I, [2024-05-03T15:53:43.828146 #3548468] INFO -- : installing library scripts: /tmp/ruby/install/trunk/lib/ruby/3.4.0+0 I, [2024-05-03T15:53:43.862327 #3548468] INFO -- : installing common headers: /tmp/ruby/install/trunk/include/ruby-3.4.0+0 I, [2024-05-03T15:53:43.867794 #3548468] INFO -- : installing manpages: /tmp/ruby/install/trunk/share/man/man1 I, [2024-05-03T15:53:43.867831 #3548468] INFO -- : installing default gems from lib: /tmp/ruby/install/trunk/lib/ruby/gems/3.4.0+0 I, [2024-05-03T15:53:43.890543 #3548468] INFO -- : benchmark 0.3.0 I, [2024-05-03T15:53:43.897523 #3548468] INFO -- : bundler 2.6.0.dev I, [2024-05-03T15:53:43.899621 #3548468] INFO -- : cgi 0.4.1 I, [2024-05-03T15:53:43.900160 #3548468] INFO -- : delegate 0.3.1 I, [2024-05-03T15:53:43.900675 #3548468] INFO -- : did_you_mean 1.6.3 I, [2024-05-03T15:53:43.901157 #3548468] INFO -- : english 0.8.0 I, [2024-05-03T15:53:43.901628 #3548468] INFO -- : erb 4.0.4 I, [2024-05-03T15:53:43.902341 #3548468] INFO -- : error_highlight 0.6.0 I, [2024-05-03T15:53:43.902809 #3548468] INFO -- : fileutils 1.7.2 I, [2024-05-03T15:53:43.903303 #3548468] INFO -- : find 0.2.0 I, [2024-05-03T15:53:43.903698 #3548468] INFO -- : forwardable 1.3.3 I, [2024-05-03T15:53:43.904172 #3548468] INFO -- : ipaddr 1.2.6 I, [2024-05-03T15:53:43.904703 #3548468] INFO -- : irb 1.13.0 I, [2024-05-03T15:53:43.906193 #3548468] INFO -- : logger 1.6.0 I, [2024-05-03T15:53:43.906792 #3548468] INFO -- : net-http 0.4.1 I, [2024-05-03T15:53:43.907311 #3548468] INFO -- : net-protocol 0.2.2 I, [2024-05-03T15:53:43.907715 #3548468] INFO -- : open-uri 0.4.1 I, [2024-05-03T15:53:43.908299 #3548468] INFO -- : open3 0.2.1 I, [2024-05-03T15:53:43.908861 #3548468] INFO -- : optparse 0.5.0 I, [2024-05-03T15:53:43.909456 #3548468] INFO -- : ostruct 0.6.0 I, [2024-05-03T15:53:43.909993 #3548468] INFO -- : pp 0.5.0 I, [2024-05-03T15:53:43.910503 #3548468] INFO -- : prettyprint 0.2.0 I, [2024-05-03T15:53:43.910972 #3548468] INFO -- : prism 0.27.0 I, [2024-05-03T15:53:43.911465 #3548468] INFO -- : pstore 0.1.3 I, [2024-05-03T15:53:43.911921 #3548468] INFO -- : rdoc 6.6.3.1 I, [2024-05-03T15:53:43.913468 #3548468] INFO -- : readline 0.0.4 I, [2024-05-03T15:53:43.914063 #3548468] INFO -- : reline 0.5.5 I, [2024-05-03T15:53:43.914584 #3548468] INFO -- : resolv 0.4.0 I, [2024-05-03T15:53:43.915064 #3548468] INFO -- : ruby2_keywords 0.0.5 I, [2024-05-03T15:53:43.915547 #3548468] INFO -- : securerandom 0.3.1 I, [2024-05-03T15:53:43.916021 #3548468] INFO -- : set 1.1.0 I, [2024-05-03T15:53:43.916563 #3548468] INFO -- : shellwords 0.2.0 I, [2024-05-03T15:53:43.916978 #3548468] INFO -- : singleton 0.2.0 I, [2024-05-03T15:53:43.917425 #3548468] INFO -- : syntax_suggest 2.0.0 I, [2024-05-03T15:53:43.918214 #3548468] INFO -- : tempfile 0.2.1 I, [2024-05-03T15:53:43.918707 #3548468] INFO -- : time 0.3.0 I, [2024-05-03T15:53:43.919198 #3548468] INFO -- : timeout 0.4.1 I, [2024-05-03T15:53:43.920078 #3548468] INFO -- : tmpdir 0.2.0 I, [2024-05-03T15:53:43.920860 #3548468] INFO -- : tsort 0.2.0 I, [2024-05-03T15:53:43.921221 #3548468] INFO -- : un 0.3.0 I, [2024-05-03T15:53:43.921733 #3548468] INFO -- : uri 0.13.0 I, [2024-05-03T15:53:43.922250 #3548468] INFO -- : weakref 0.1.3 I, [2024-05-03T15:53:43.922733 #3548468] INFO -- : yaml 0.3.0 I, [2024-05-03T15:53:43.923057 #3548468] INFO -- : installing default gems from ext: /tmp/ruby/install/trunk/lib/ruby/gems/3.4.0+0 I, [2024-05-03T15:53:43.929935 #3548468] INFO -- : date 3.3.4 I, [2024-05-03T15:53:43.930460 #3548468] INFO -- : digest 3.1.1 I, [2024-05-03T15:53:43.931064 #3548468] INFO -- : etc 1.4.3 I, [2024-05-03T15:53:43.931580 #3548468] INFO -- : fcntl 1.1.0 I, [2024-05-03T15:53:43.932074 #3548468] INFO -- : fiddle 1.1.3 I, [2024-05-03T15:53:43.932669 #3548468] INFO -- : io-console 0.7.2 I, [2024-05-03T15:53:43.933146 #3548468] INFO -- : io-nonblock 0.3.0 I, [2024-05-03T15:53:43.933605 #3548468] INFO -- : io-wait 0.3.1 I, [2024-05-03T15:53:43.934069 #3548468] INFO -- : json 2.7.2 I, [2024-05-03T15:53:43.934911 #3548468] INFO -- : openssl 3.2.0 I, [2024-05-03T15:53:43.935622 #3548468] INFO -- : pathname 0.3.0 I, [2024-05-03T15:53:43.936135 #3548468] INFO -- : psych 5.1.2 I, [2024-05-03T15:53:43.936699 #3548468] INFO -- : stringio 3.1.1 I, [2024-05-03T15:53:43.937195 #3548468] INFO -- : strscan 3.1.1 I, [2024-05-03T15:53:43.937661 #3548468] INFO -- : zlib 3.1.0 I, [2024-05-03T15:53:43.937940 #3548468] INFO -- : installing bundled gems: /tmp/ruby/install/trunk/lib/ruby/gems/3.4.0+0 I, [2024-05-03T15:53:43.938312 #3548468] INFO -- : minitest 5.22.3 I, [2024-05-03T15:53:43.945979 #3548468] INFO -- : rake 13.2.1 I, [2024-05-03T15:53:43.949456 #3548468] INFO -- : test-unit 3.6.2 I, [2024-05-03T15:53:43.953925 #3548468] INFO -- : rexml 3.2.6 I, [2024-05-03T15:53:43.957474 #3548468] INFO -- : rss 0.3.0 I, [2024-05-03T15:53:43.960409 #3548468] INFO -- : net-ftp 0.3.4 I, [2024-05-03T15:53:43.961943 #3548468] INFO -- : net-imap 0.4.10 I, [2024-05-03T15:53:43.964938 #3548468] INFO -- : net-pop 0.1.2 I, [2024-05-03T15:53:43.965848 #3548468] INFO -- : net-smtp 0.5.0 I, [2024-05-03T15:53:43.966905 #3548468] INFO -- : matrix 0.4.2 I, [2024-05-03T15:53:43.970396 #3548468] INFO -- : prime 0.1.2 I, [2024-05-03T15:53:43.976065 #3548468] INFO -- : rbs 3.4.4 I, [2024-05-03T15:53:43.998920 #3548468] INFO -- : typeprof 0.21.11 I, [2024-05-03T15:53:44.001519 #3548468] INFO -- : debug 1.9.2 I, [2024-05-03T15:53:44.004225 #3548468] INFO -- : racc 1.7.3 I, [2024-05-03T15:53:44.007038 #3548468] INFO -- : mutex_m 0.2.0 I, [2024-05-03T15:53:44.008215 #3548468] INFO -- : getoptlong 0.2.1 I, [2024-05-03T15:53:44.009498 #3548468] INFO -- : base64 0.2.0 I, [2024-05-03T15:53:44.010506 #3548468] INFO -- : bigdecimal 3.1.7 I, [2024-05-03T15:53:44.012390 #3548468] INFO -- : observer 0.1.2 I, [2024-05-03T15:53:44.013531 #3548468] INFO -- : abbrev 0.1.2 I, [2024-05-03T15:53:44.014934 #3548468] INFO -- : resolv-replace 0.1.1 I, [2024-05-03T15:53:44.016080 #3548468] INFO -- : rinda 0.2.0 I, [2024-05-03T15:53:44.017519 #3548468] INFO -- : drb 2.2.1 I, [2024-05-03T15:53:44.019014 #3548468] INFO -- : nkf 0.2.0 I, [2024-05-03T15:53:44.021947 #3548468] INFO -- : syslog 0.1.2 I, [2024-05-03T15:53:44.023507 #3548468] INFO -- : csv 3.3.0 I, [2024-05-03T15:53:44.025597 #3548468] INFO -- : installing bundled gem cache: /tmp/ruby/install/trunk/lib/ruby/gems/3.4.0+0/cache I, [2024-05-03T15:53:44.027032 #3548468] INFO -- : skipped bundled gems: I, [2024-05-03T15:53:44.027053 #3548468] INFO -- : power_assert-2.0.4dev.gem not found in bundled_gems I, [2024-05-03T15:53:44.030394 #3548468] INFO -- : $$$[end] "make install -j20" exit with 0. I, [2024-05-03T15:53:44.030503 #3548468] INFO -- : $$$[beg] make yes-btest TESTOPTS='-q -j20' I, [2024-05-03T15:53:50.629940 #3548468] INFO -- : PASS all 1935 tests E, [2024-05-03T15:53:50.637911 #3548468] ERROR -- : I, [2024-05-03T15:53:50.638202 #3548468] INFO -- : $$$[end] "make yes-btest TESTOPTS='-q -j20'" exit with 0. I, [2024-05-03T15:53:50.638294 #3548468] INFO -- : $$$[beg] make yes-test-basic TESTS='-j20' I, [2024-05-03T15:53:50.698252 #3548468] INFO -- : BASERUBY = /usr/bin/ruby --disable=gems I, [2024-05-03T15:53:50.698295 #3548468] INFO -- : CC = gcc I, [2024-05-03T15:53:50.698308 #3548468] INFO -- : LD = ld I, [2024-05-03T15:53:50.698320 #3548468] INFO -- : LDSHARED = gcc -shared I, [2024-05-03T15:53:50.698331 #3548468] INFO -- : CFLAGS = -O3 -fno-fast-math -ggdb3 -Wall -Wextra -Wdeprecated-declarations -Wdiv-by-zero -Wduplicated-cond -Wimplicit-function-declaration -Wimplicit-int -Wpointer-arith -Wwrite-strings -Wold-style-definition -Wimplicit-fallthrough=0 -Wmissing-noreturn -Wno-cast-function-type -Wno-constant-logical-operand -Wno-long-long -Wno-missing-field-initializers -Wno-overlength-strings -Wno-packed-bitfield-compat -Wno-parentheses-equality -Wno-self-assign -Wno-tautological-compare -Wno-unused-parameter -Wno-unused-value -Wsuggest-attribute=format -Wsuggest-attribute=noreturn -Wunused-variable -Wmisleading-indentation -Wundef -fPIC I, [2024-05-03T15:53:50.698343 #3548468] INFO -- : XCFLAGS = -U_FORTIFY_SOURCE -D_FORTIFY_SOURCE=2 -fstack-protector-strong -fno-strict-overflow -fvisibility=hidden -fexcess-precision=standard -DRUBY_EXPORT -I. -I.ext/include/x86_64-linux -I/tmp/ruby/src/trunk/include -I/tmp/ruby/src/trunk -I/tmp/ruby/src/trunk/prism -I/tmp/ruby/src/trunk/enc/unicode/15.0.0 I, [2024-05-03T15:53:50.698353 #3548468] INFO -- : CPPFLAGS = I, [2024-05-03T15:53:50.698363 #3548468] INFO -- : DLDFLAGS = -Wl,--compress-debug-sections=zlib -Wl,-soname,libruby.so.3.4 -fstack-protector-strong I, [2024-05-03T15:53:50.698374 #3548468] INFO -- : SOLIBS = -lz -lrt -lrt -lgmp -ldl -lcrypt -lm -lpthread I, [2024-05-03T15:53:50.698384 #3548468] INFO -- : LANG = en_US.UTF-8 I, [2024-05-03T15:53:50.698394 #3548468] INFO -- : LC_ALL = I, [2024-05-03T15:53:50.698404 #3548468] INFO -- : LC_CTYPE = I, [2024-05-03T15:53:50.698414 #3548468] INFO -- : MFLAGS = I, [2024-05-03T15:53:50.698424 #3548468] INFO -- : RUSTC = no I, [2024-05-03T15:53:50.698437 #3548468] INFO -- : YJIT_RUSTC_ARGS = --crate-name=yjit --crate-type=staticlib --edition=2021 -g -C lto=thin -C opt-level=3 -C overflow-checks=on '--out-dir=/tmp/ruby/build/trunk/yjit/target/release/' /tmp/ruby/src/trunk/yjit/src/lib.rs I, [2024-05-03T15:53:50.698825 #3548468] INFO -- : gcc (Ubuntu 11.4.0-1ubuntu1~22.04) 11.4.0 I, [2024-05-03T15:53:50.698868 #3548468] INFO -- : Copyright (C) 2021 Free Software Foundation, Inc. I, [2024-05-03T15:53:50.698881 #3548468] INFO -- : This is free software; see the source for copying conditions. There is NO I, [2024-05-03T15:53:50.698893 #3548468] INFO -- : warranty; not even for MERCHANTABILITY or FITNESS FOR A PARTICULAR PURPOSE. I, [2024-05-03T15:53:50.698903 #3548468] INFO -- : I, [2024-05-03T15:53:50.804240 #3548468] INFO -- : Checking leaked global symbols...none I, [2024-05-03T15:53:50.845689 #3548468] INFO -- : /tmp/ruby/src/trunk/basictest/test.rb:assignment ....................................................................................................................................................................................................................................................................................................................................................................................OK 372 I, [2024-05-03T15:53:50.845776 #3548468] INFO -- : /tmp/ruby/src/trunk/basictest/test.rb:condition ..OK 2 I, [2024-05-03T15:53:50.845795 #3548468] INFO -- : /tmp/ruby/src/trunk/basictest/test.rb:if/unless ...OK 3 I, [2024-05-03T15:53:50.845809 #3548468] INFO -- : /tmp/ruby/src/trunk/basictest/test.rb:case .....OK 5 I, [2024-05-03T15:53:50.845942 #3548468] INFO -- : /tmp/ruby/src/trunk/basictest/test.rb:while/until ........OK 8 I, [2024-05-03T15:53:50.845991 #3548468] INFO -- : /tmp/ruby/src/trunk/basictest/test.rb:exception ..........OK 10 I, [2024-05-03T15:53:50.846275 #3548468] INFO -- : /tmp/ruby/src/trunk/basictest/test.rb:array .......................................OK 39 I, [2024-05-03T15:53:50.846359 #3548468] INFO -- : /tmp/ruby/src/trunk/basictest/test.rb:hash ...........................OK 27 I, [2024-05-03T15:53:50.847073 #3548468] INFO -- : /tmp/ruby/src/trunk/basictest/test.rb:iterator ...........................................................................................................OK 107 I, [2024-05-03T15:53:50.847345 #3548468] INFO -- : /tmp/ruby/src/trunk/basictest/test.rb:float ................................................................................OK 80 I, [2024-05-03T15:53:50.848401 #3548468] INFO -- : /tmp/ruby/src/trunk/basictest/test.rb:bignum ...............................OK 31 I, [2024-05-03T15:53:50.849228 #3548468] INFO -- : /tmp/ruby/src/trunk/basictest/test.rb:string & char ..............................................................OK 62 I, [2024-05-03T15:53:50.849250 #3548468] INFO -- : /tmp/ruby/src/trunk/basictest/test.rb:assignment ..........OK 10 I, [2024-05-03T15:53:50.849281 #3548468] INFO -- : /tmp/ruby/src/trunk/basictest/test.rb:call ......OK 6 I, [2024-05-03T15:53:50.849334 #3548468] INFO -- : /tmp/ruby/src/trunk/basictest/test.rb:proc .........OK 9 I, [2024-05-03T15:53:50.949687 #3548468] INFO -- : /tmp/ruby/src/trunk/basictest/test.rb:signal ..OK 2 I, [2024-05-03T15:53:50.950164 #3548468] INFO -- : /tmp/ruby/src/trunk/basictest/test.rb:eval ...........................OK 27 I, [2024-05-03T15:53:51.050305 #3548468] INFO -- : /tmp/ruby/src/trunk/basictest/test.rb:system ........OK 8 I, [2024-05-03T15:53:51.050392 #3548468] INFO -- : /tmp/ruby/src/trunk/basictest/test.rb:const .....OK 5 I, [2024-05-03T15:53:51.050409 #3548468] INFO -- : /tmp/ruby/src/trunk/basictest/test.rb:clone .....OK 5 I, [2024-05-03T15:53:51.050422 #3548468] INFO -- : /tmp/ruby/src/trunk/basictest/test.rb:marshal ....OK 4 I, [2024-05-03T15:53:51.050446 #3548468] INFO -- : /tmp/ruby/src/trunk/basictest/test.rb:pack ....OK 4 I, [2024-05-03T15:53:51.050474 #3548468] INFO -- : /tmp/ruby/src/trunk/basictest/test.rb:math ..OK 2 I, [2024-05-03T15:53:51.050508 #3548468] INFO -- : /tmp/ruby/src/trunk/basictest/test.rb:struct ......OK 6 I, [2024-05-03T15:53:51.050618 #3548468] INFO -- : /tmp/ruby/src/trunk/basictest/test.rb:variable ............OK 12 I, [2024-05-03T15:53:51.050656 #3548468] INFO -- : /tmp/ruby/src/trunk/basictest/test.rb:trace ...OK 3 I, [2024-05-03T15:53:51.050673 #3548468] INFO -- : /tmp/ruby/src/trunk/basictest/test.rb:defined? ............OK 12 I, [2024-05-03T15:53:51.050710 #3548468] INFO -- : /tmp/ruby/src/trunk/basictest/test.rb:alias ......OK 6 I, [2024-05-03T15:53:51.051157 #3548468] INFO -- : /tmp/ruby/src/trunk/basictest/test.rb:path .......................OK 23 I, [2024-05-03T15:53:51.084778 #3548468] INFO -- : /tmp/ruby/src/trunk/basictest/test.rb:gc ....OK 4 I, [2024-05-03T15:53:51.087143 #3548468] INFO -- : I, [2024-05-03T15:53:51.087218 #3548468] INFO -- : test succeeded I, [2024-05-03T15:53:51.088732 #3548468] INFO -- : $$$[end] "make yes-test-basic TESTS='-j20'" exit with 0. I, [2024-05-03T15:53:51.088856 #3548468] INFO -- : $$$[beg] make yes-test-all TESTOPTS='--stderr-on-failure' TESTS='-j20' I, [2024-05-03T15:53:51.174883 #3548468] INFO -- : BASERUBY = /usr/bin/ruby --disable=gems I, [2024-05-03T15:53:51.174925 #3548468] INFO -- : CC = gcc I, [2024-05-03T15:53:51.174932 #3548468] INFO -- : LD = ld I, [2024-05-03T15:53:51.174936 #3548468] INFO -- : LDSHARED = gcc -shared I, [2024-05-03T15:53:51.174940 #3548468] INFO -- : CFLAGS = -O3 -fno-fast-math -ggdb3 -Wall -Wextra -Wdeprecated-declarations -Wdiv-by-zero -Wduplicated-cond -Wimplicit-function-declaration -Wimplicit-int -Wpointer-arith -Wwrite-strings -Wold-style-definition -Wimplicit-fallthrough=0 -Wmissing-noreturn -Wno-cast-function-type -Wno-constant-logical-operand -Wno-long-long -Wno-missing-field-initializers -Wno-overlength-strings -Wno-packed-bitfield-compat -Wno-parentheses-equality -Wno-self-assign -Wno-tautological-compare -Wno-unused-parameter -Wno-unused-value -Wsuggest-attribute=format -Wsuggest-attribute=noreturn -Wunused-variable -Wmisleading-indentation -Wundef -fPIC I, [2024-05-03T15:53:51.174945 #3548468] INFO -- : XCFLAGS = -U_FORTIFY_SOURCE -D_FORTIFY_SOURCE=2 -fstack-protector-strong -fno-strict-overflow -fvisibility=hidden -fexcess-precision=standard -DRUBY_EXPORT -I. -I.ext/include/x86_64-linux -I/tmp/ruby/src/trunk/include -I/tmp/ruby/src/trunk -I/tmp/ruby/src/trunk/prism -I/tmp/ruby/src/trunk/enc/unicode/15.0.0 I, [2024-05-03T15:53:51.174949 #3548468] INFO -- : CPPFLAGS = I, [2024-05-03T15:53:51.174953 #3548468] INFO -- : DLDFLAGS = -Wl,--compress-debug-sections=zlib -Wl,-soname,libruby.so.3.4 -fstack-protector-strong I, [2024-05-03T15:53:51.174956 #3548468] INFO -- : SOLIBS = -lz -lrt -lrt -lgmp -ldl -lcrypt -lm -lpthread I, [2024-05-03T15:53:51.174960 #3548468] INFO -- : LANG = en_US.UTF-8 I, [2024-05-03T15:53:51.174963 #3548468] INFO -- : LC_ALL = I, [2024-05-03T15:53:51.174967 #3548468] INFO -- : LC_CTYPE = I, [2024-05-03T15:53:51.174970 #3548468] INFO -- : MFLAGS = I, [2024-05-03T15:53:51.174974 #3548468] INFO -- : RUSTC = no I, [2024-05-03T15:53:51.174979 #3548468] INFO -- : YJIT_RUSTC_ARGS = --crate-name=yjit --crate-type=staticlib --edition=2021 -g -C lto=thin -C opt-level=3 -C overflow-checks=on '--out-dir=/tmp/ruby/build/trunk/yjit/target/release/' /tmp/ruby/src/trunk/yjit/src/lib.rs I, [2024-05-03T15:53:51.175546 #3548468] INFO -- : gcc (Ubuntu 11.4.0-1ubuntu1~22.04) 11.4.0 I, [2024-05-03T15:53:51.175567 #3548468] INFO -- : Copyright (C) 2021 Free Software Foundation, Inc. I, [2024-05-03T15:53:51.175573 #3548468] INFO -- : This is free software; see the source for copying conditions. There is NO I, [2024-05-03T15:53:51.175577 #3548468] INFO -- : warranty; not even for MERCHANTABILITY or FITNESS FOR A PARTICULAR PURPOSE. I, [2024-05-03T15:53:51.175583 #3548468] INFO -- : I, [2024-05-03T15:53:51.177222 #3548468] INFO -- : generating enc.mk I, [2024-05-03T15:53:51.296265 #3548468] INFO -- : making enc I, [2024-05-03T15:53:51.313327 #3548468] INFO -- : make[1]: Entering directory '/tmp/ruby/build/trunk' I, [2024-05-03T15:53:51.313351 #3548468] INFO -- : make[1]: Nothing to be done for 'enc'. I, [2024-05-03T15:53:51.313359 #3548468] INFO -- : make[1]: Leaving directory '/tmp/ruby/build/trunk' I, [2024-05-03T15:53:51.314032 #3548468] INFO -- : making srcs under enc I, [2024-05-03T15:53:51.343402 #3548468] INFO -- : make[1]: Entering directory '/tmp/ruby/build/trunk' I, [2024-05-03T15:53:51.343422 #3548468] INFO -- : make[1]: Nothing to be done for 'srcs'. I, [2024-05-03T15:53:51.343428 #3548468] INFO -- : make[1]: Leaving directory '/tmp/ruby/build/trunk' I, [2024-05-03T15:53:51.344305 #3548468] INFO -- : generating transdb.h I, [2024-05-03T15:53:51.439110 #3548468] INFO -- : transdb.h unchanged I, [2024-05-03T15:53:51.440545 #3548468] INFO -- : making trans I, [2024-05-03T15:53:51.473833 #3548468] INFO -- : make[1]: Entering directory '/tmp/ruby/build/trunk' I, [2024-05-03T15:53:51.473857 #3548468] INFO -- : make[1]: Nothing to be done for 'trans'. I, [2024-05-03T15:53:51.473864 #3548468] INFO -- : make[1]: Leaving directory '/tmp/ruby/build/trunk' I, [2024-05-03T15:53:51.474532 #3548468] INFO -- : making encs I, [2024-05-03T15:53:51.511102 #3548468] INFO -- : make[1]: Entering directory '/tmp/ruby/build/trunk' I, [2024-05-03T15:53:51.511126 #3548468] INFO -- : make[1]: Nothing to be done for 'encs'. I, [2024-05-03T15:53:51.511134 #3548468] INFO -- : make[1]: Leaving directory '/tmp/ruby/build/trunk' I, [2024-05-03T15:53:51.512828 #3548468] INFO -- : generating makefiles ext/configure-ext.mk I, [2024-05-03T15:53:51.540837 #3548468] INFO -- : ext/configure-ext.mk updated I, [2024-05-03T15:53:51.543375 #3548468] INFO -- : make[1]: Entering directory '/tmp/ruby/build/trunk' I, [2024-05-03T15:53:52.904513 #3548468] INFO -- : make[1]: Leaving directory '/tmp/ruby/build/trunk' I, [2024-05-03T15:53:52.905120 #3548468] INFO -- : generating makefile exts.mk I, [2024-05-03T15:53:52.942508 #3548468] INFO -- : exts.mk unchanged I, [2024-05-03T15:53:52.947350 #3548468] INFO -- : make[1]: Entering directory '/tmp/ruby/build/trunk' I, [2024-05-03T15:53:53.158846 #3548468] INFO -- : make[2]: Entering directory '/tmp/ruby/build/trunk/ext/coverage' I, [2024-05-03T15:53:53.161754 #3548468] INFO -- : make[2]: Leaving directory '/tmp/ruby/build/trunk/ext/coverage' I, [2024-05-03T15:53:53.165641 #3548468] INFO -- : make[2]: Entering directory '/tmp/ruby/build/trunk/ext/date' I, [2024-05-03T15:53:53.168704 #3548468] INFO -- : make[2]: Leaving directory '/tmp/ruby/build/trunk/ext/date' I, [2024-05-03T15:53:53.171011 #3548468] INFO -- : make[2]: Entering directory '/tmp/ruby/build/trunk/ext/digest' I, [2024-05-03T15:53:53.176358 #3548468] INFO -- : make[2]: Leaving directory '/tmp/ruby/build/trunk/ext/digest' I, [2024-05-03T15:53:53.192192 #3548468] INFO -- : make[2]: Entering directory '/tmp/ruby/build/trunk/ext/digest/sha2' I, [2024-05-03T15:53:53.195128 #3548468] INFO -- : make[2]: Leaving directory '/tmp/ruby/build/trunk/ext/digest/sha2' I, [2024-05-03T15:53:53.207735 #3548468] INFO -- : make[2]: Entering directory '/tmp/ruby/build/trunk/ext/fiddle' I, [2024-05-03T15:53:53.214055 #3548468] INFO -- : make[2]: Leaving directory '/tmp/ruby/build/trunk/ext/fiddle' I, [2024-05-03T15:53:53.216978 #3548468] INFO -- : make[2]: Entering directory '/tmp/ruby/build/trunk/ext/io/console' I, [2024-05-03T15:53:53.219576 #3548468] INFO -- : make[2]: Leaving directory '/tmp/ruby/build/trunk/ext/io/console' I, [2024-05-03T15:53:53.227337 #3548468] INFO -- : make[2]: Entering directory '/tmp/ruby/build/trunk/ext/json' I, [2024-05-03T15:53:53.233654 #3548468] INFO -- : make[2]: Leaving directory '/tmp/ruby/build/trunk/ext/json' I, [2024-05-03T15:53:53.242655 #3548468] INFO -- : make[2]: Entering directory '/tmp/ruby/build/trunk/ext/monitor' I, [2024-05-03T15:53:53.245042 #3548468] INFO -- : make[2]: Leaving directory '/tmp/ruby/build/trunk/ext/monitor' I, [2024-05-03T15:53:53.249200 #3548468] INFO -- : make[2]: Entering directory '/tmp/ruby/build/trunk/ext/objspace' I, [2024-05-03T15:53:53.252920 #3548468] INFO -- : make[2]: Leaving directory '/tmp/ruby/build/trunk/ext/objspace' I, [2024-05-03T15:53:53.264927 #3548468] INFO -- : make[2]: Entering directory '/tmp/ruby/build/trunk/ext/openssl' I, [2024-05-03T15:53:53.278059 #3548468] INFO -- : make[2]: Leaving directory '/tmp/ruby/build/trunk/ext/openssl' I, [2024-05-03T15:53:53.281006 #3548468] INFO -- : make[2]: Entering directory '/tmp/ruby/build/trunk/ext/pathname' I, [2024-05-03T15:53:53.283536 #3548468] INFO -- : make[2]: Leaving directory '/tmp/ruby/build/trunk/ext/pathname' I, [2024-05-03T15:53:53.287751 #3548468] INFO -- : make[2]: Entering directory '/tmp/ruby/build/trunk/ext/psych' I, [2024-05-03T15:53:53.302432 #3548468] INFO -- : make[2]: Leaving directory '/tmp/ruby/build/trunk/ext/psych' I, [2024-05-03T15:53:53.305768 #3548468] INFO -- : make[2]: Entering directory '/tmp/ruby/build/trunk/ext/pty' I, [2024-05-03T15:53:53.308245 #3548468] INFO -- : make[2]: Leaving directory '/tmp/ruby/build/trunk/ext/pty' I, [2024-05-03T15:53:53.317636 #3548468] INFO -- : make[2]: Entering directory '/tmp/ruby/build/trunk/ext/ripper' I, [2024-05-03T15:53:53.322668 #3548468] INFO -- : make[2]: Leaving directory '/tmp/ruby/build/trunk/ext/ripper' I, [2024-05-03T15:53:53.324136 #3548468] INFO -- : make[2]: Entering directory '/tmp/ruby/build/trunk/ext/rubyvm' I, [2024-05-03T15:53:53.326154 #3548468] INFO -- : make[2]: Leaving directory '/tmp/ruby/build/trunk/ext/rubyvm' I, [2024-05-03T15:53:53.333983 #3548468] INFO -- : make[2]: Entering directory '/tmp/ruby/build/trunk/ext/socket' I, [2024-05-03T15:53:53.340342 #3548468] INFO -- : make[2]: Leaving directory '/tmp/ruby/build/trunk/ext/socket' I, [2024-05-03T15:53:53.351362 #3548468] INFO -- : make[2]: Entering directory '/tmp/ruby/build/trunk/.bundle/gems/bigdecimal-3.1.7/ext/bigdecimal' I, [2024-05-03T15:53:53.374149 #3548468] INFO -- : make[2]: Leaving directory '/tmp/ruby/build/trunk/.bundle/gems/bigdecimal-3.1.7/ext/bigdecimal' I, [2024-05-03T15:53:53.376244 #3548468] INFO -- : make[2]: Entering directory '/tmp/ruby/build/trunk/.bundle/gems/debug-1.9.2/ext/debug' I, [2024-05-03T15:53:53.397924 #3548468] INFO -- : make[2]: Leaving directory '/tmp/ruby/build/trunk/.bundle/gems/debug-1.9.2/ext/debug' I, [2024-05-03T15:53:53.400046 #3548468] INFO -- : make[2]: Entering directory '/tmp/ruby/build/trunk/.bundle/gems/nkf-0.2.0/ext/nkf' I, [2024-05-03T15:53:53.422456 #3548468] INFO -- : make[2]: Leaving directory '/tmp/ruby/build/trunk/.bundle/gems/nkf-0.2.0/ext/nkf' I, [2024-05-03T15:53:53.424339 #3548468] INFO -- : make[2]: Entering directory '/tmp/ruby/build/trunk/.bundle/gems/racc-1.7.3/ext/racc/cparse' I, [2024-05-03T15:53:53.445967 #3548468] INFO -- : make[2]: Leaving directory '/tmp/ruby/build/trunk/.bundle/gems/racc-1.7.3/ext/racc/cparse' I, [2024-05-03T15:53:53.448210 #3548468] INFO -- : make[2]: Entering directory '/tmp/ruby/build/trunk/.bundle/gems/rbs-3.4.4/ext/rbs_extension' I, [2024-05-03T15:53:53.469978 #3548468] INFO -- : make[2]: Leaving directory '/tmp/ruby/build/trunk/.bundle/gems/rbs-3.4.4/ext/rbs_extension' I, [2024-05-03T15:53:53.471886 #3548468] INFO -- : make[2]: Entering directory '/tmp/ruby/build/trunk/.bundle/gems/syslog-0.1.2/ext/syslog' I, [2024-05-03T15:53:53.493179 #3548468] INFO -- : make[2]: Leaving directory '/tmp/ruby/build/trunk/.bundle/gems/syslog-0.1.2/ext/syslog' I, [2024-05-03T15:53:53.516780 #3548468] INFO -- : make[2]: Entering directory '/tmp/ruby/build/trunk' I, [2024-05-03T15:53:53.579508 #3548468] INFO -- : make[2]: 'ruby' is up to date. I, [2024-05-03T15:53:53.579636 #3548468] INFO -- : make[2]: Leaving directory '/tmp/ruby/build/trunk' I, [2024-05-03T15:53:53.579762 #3548468] INFO -- : make[1]: Leaving directory '/tmp/ruby/build/trunk' I, [2024-05-03T15:53:53.583330 #3548468] INFO -- : make[1]: Entering directory '/tmp/ruby/build/trunk' I, [2024-05-03T15:53:53.583350 #3548468] INFO -- : make[1]: Nothing to be done for 'note'. I, [2024-05-03T15:53:53.583355 #3548468] INFO -- : make[1]: Leaving directory '/tmp/ruby/build/trunk' I, [2024-05-03T15:53:53.660391 #3548468] INFO -- : Run options: I, [2024-05-03T15:53:53.660458 #3548468] INFO -- : --seed=40391 I, [2024-05-03T15:53:53.660465 #3548468] INFO -- : "--ruby=./miniruby -I/tmp/ruby/src/trunk/lib -I. -I.ext/common /tmp/ruby/src/trunk/tool/runruby.rb --extout=.ext -- --disable-gems" I, [2024-05-03T15:53:53.660486 #3548468] INFO -- : --excludes-dir=/tmp/ruby/src/trunk/test/.excludes I, [2024-05-03T15:53:53.660490 #3548468] INFO -- : --name=!/memory_leak/ I, [2024-05-03T15:53:53.660494 #3548468] INFO -- : --stderr-on-failure I, [2024-05-03T15:53:53.660498 #3548468] INFO -- : -j20 I, [2024-05-03T15:53:53.660502 #3548468] INFO -- : I, [2024-05-03T15:53:53.660506 #3548468] INFO -- : # Running tests: I, [2024-05-03T15:53:53.660510 #3548468] INFO -- : I, [2024-05-03T15:53:53.809096 #3548468] INFO -- : [ 1/885] 3589837=test_gem_commands_setup_command I, [2024-05-03T15:53:53.809196 #3548468] INFO -- : [ 2/885] 3589824=test_integer I, [2024-05-03T15:53:53.809280 #3548468] INFO -- : [ 3/885] 3589821=desugar_compiler_test I, [2024-05-03T15:53:53.809377 #3548468] INFO -- : [ 4/885] 3589823=test_dryrun I, [2024-05-03T15:53:53.810602 #3548468] INFO -- : [ 5/885] 3589822=test_rdoc_attr I, [2024-05-03T15:53:53.812307 #3548468] INFO -- : [ 6/885] 3589834=test_env I, [2024-05-03T15:53:53.812342 #3548468] INFO -- : [ 7/885] 3589838=test_gem_resolver_git_specification I, [2024-05-03T15:53:53.812350 #3548468] INFO -- : [ 8/885] 3589836=test_object_references I, [2024-05-03T15:53:53.812439 #3548468] INFO -- : [ 9/885] 3589833=test_usrmarshal I, [2024-05-03T15:53:53.813472 #3548468] INFO -- : [ 10/885] 3589820=test_nextafter I, [2024-05-03T15:53:53.815187 #3548468] INFO -- : [ 11/885] 3589835=test_capacity I, [2024-05-03T15:53:53.824449 #3548468] INFO -- : [ 12/885] 3589835=test_gem_request_set_lockfile_tokenizer I, [2024-05-03T15:53:53.836175 #3548468] INFO -- : [ 13/885] 3589823=test_stat I, [2024-05-03T15:53:53.842108 #3548468] INFO -- : [ 14/885] 3589826=test_have_func I, [2024-05-03T15:53:53.842218 #3548468] INFO -- : [ 15/885] 3589827=test_call I, [2024-05-03T15:53:53.842314 #3548468] INFO -- : [ 16/885] 3589828=test_https_proxy I, [2024-05-03T15:53:53.842471 #3548468] INFO -- : [ 17/885] 3589829=test_rubygems I, [2024-05-03T15:53:53.842554 #3548468] INFO -- : [ 18/885] 3589831=test_cgi_modruby I, [2024-05-03T15:53:53.843609 #3548468] INFO -- : [ 19/885] 3589832=test_integer I, [2024-05-03T15:53:53.848737 #3548468] INFO -- : [ 20/885] 3589825=test_super I, [2024-05-03T15:53:53.867111 #3548468] INFO -- : [ 21/885] 3589823=test_rubyoptions I, [2024-05-03T15:53:53.873585 #3548468] INFO -- : [ 22/885] 3589836=test_singleton_function I, [2024-05-03T15:53:53.885048 #3548468] INFO -- : [ 23/885] 3589836=test_ancdata I, [2024-05-03T15:53:53.896356 #3548468] INFO -- : [ 24/885] 3589824=test_rb_str_dup I, [2024-05-03T15:53:53.896419 #3548468] INFO -- : [ 25/885] 3589831=test_reline_key I, [2024-05-03T15:53:53.896795 #3548468] INFO -- : [ 26/885] 3589839=test_marshal I, [2024-05-03T15:53:53.897688 #3548468] INFO -- : [ 27/885] 3589821=test_unicode_normalize I, [2024-05-03T15:53:53.912313 #3548468] INFO -- : [ 28/885] 3589824=test_nonblock I, [2024-05-03T15:53:53.912816 #3548468] INFO -- : [ 29/885] 3589830=test_weakref I, [2024-05-03T15:53:53.913272 #3548468] INFO -- : [ 30/885] 3589836=test_alias I, [2024-05-03T15:53:53.923081 #3548468] INFO -- : [ 31/885] 3589824=test_timeout I, [2024-05-03T15:53:53.948789 #3548468] INFO -- : [ 32/885] 3589820=test_ractor I, [2024-05-03T15:53:53.950759 #3548468] INFO -- : [ 33/885] 3589828=test_my_integer I, [2024-05-03T15:53:53.952380 #3548468] INFO -- : [ 34/885] 3589828=test_thread I, [2024-05-03T15:53:53.980487 #3548468] INFO -- : [ 35/885] 3589827=json_ext_parser_test I, [2024-05-03T15:53:53.987361 #3548468] INFO -- : [ 36/885] 3589822=test_rendering I, [2024-05-03T15:53:53.988423 #3548468] INFO -- : [ 37/885] 3589831=test_debugger_integration I, [2024-05-03T15:53:53.989646 #3548468] INFO -- : [ 38/885] 3589827=test_ssl I, [2024-05-03T15:53:54.005225 #3548468] INFO -- : [ 39/885] 3589831=test_ractor I, [2024-05-03T15:53:54.005492 #3548468] INFO -- : [ 40/885] 3589833=test_dns I, [2024-05-03T15:53:54.036951 #3548468] INFO -- : [ 41/885] 3589831=test_gem_commands_open_command I, [2024-05-03T15:53:54.039910 #3548468] INFO -- : [ 42/885] 3589822=test_gem_source_lock I, [2024-05-03T15:53:54.050511 #3548468] INFO -- : [ 43/885] 3589830=test_gem I, [2024-05-03T15:53:54.078707 #3548468] INFO -- : [ 44/885] 3589835=parse_stream_test I, [2024-05-03T15:53:54.091968 #3548468] INFO -- : [ 45/885] 3589836=test_registry I, [2024-05-03T15:53:54.094694 #3548468] INFO -- : [ 46/885] 3589836=test_parser I, [2024-05-03T15:53:54.109779 #3548468] INFO -- : [ 47/885] 3589835=test_cgi_core I, [2024-05-03T15:53:54.137847 #3548468] INFO -- : [ 48/885] 3589836=test_ipaddr I, [2024-05-03T15:53:54.148639 #3548468] INFO -- : [ 49/885] 3589835=test_mixed_unicode_escapes I, [2024-05-03T15:53:54.158164 #3548468] INFO -- : [ 50/885] 3589835=test_history I, [2024-05-03T15:53:54.162119 #3548468] INFO -- : [ 51/885] 3589836=test_rdoc_markup_to_ansi I, [2024-05-03T15:53:54.175441 #3548468] INFO -- : [ 52/885] 3589825=test_win32ole_variant I, [2024-05-03T15:53:54.180937 #3548468] INFO -- : [ 53/885] 3589825=test_gem_resolver_api_specification I, [2024-05-03T15:53:54.207483 #3548468] INFO -- : [ 54/885] 3589839=test_merge_keys I, [2024-05-03T15:53:54.219203 #3548468] INFO -- : [ 55/885] 3589839=test_rdoc_extend I, [2024-05-03T15:53:54.234013 #3548468] INFO -- : [ 56/885] 3589829=test_threadgroup I, [2024-05-03T15:53:54.249699 #3548468] INFO -- : [ 57/885] 3589835=test_enum I, [2024-05-03T15:53:54.279723 #3548468] INFO -- : [ 58/885] 3589838=test_gem_specification I, [2024-05-03T15:53:54.283048 #3548468] INFO -- : [ 59/885] 3589822=test_have_macro I, [2024-05-03T15:53:54.304478 #3548468] INFO -- : [ 60/885] 3589836=test_gem_package I, [2024-05-03T15:53:54.308857 #3548468] INFO -- : [ 61/885] 3589831=test_complex2 I, [2024-05-03T15:53:54.319002 #3548468] INFO -- : [ 62/885] 3589831=test_resolve_symbol I, [2024-05-03T15:53:54.379506 #3548468] INFO -- : [ 63/885] 3589831=test_rdoc_generator_json_index I, [2024-05-03T15:53:54.401325 #3548468] INFO -- : [ 64/885] 3589839=test_win32ole_event I, [2024-05-03T15:53:54.404905 #3548468] INFO -- : [ 65/885] 3589839=test_time_tz I, [2024-05-03T15:53:54.414875 #3548468] INFO -- : [ 66/885] 3589820=test_trace I, [2024-05-03T15:53:54.420274 #3548468] INFO -- : [ 67/885] 3589820=ractor_test I, [2024-05-03T15:53:54.433905 #3548468] INFO -- : [ 68/885] 3589837=test_win32ole_variable I, [2024-05-03T15:53:54.438152 #3548468] INFO -- : [ 69/885] 3589837=test_stringio I, [2024-05-03T15:53:54.444774 #3548468] INFO -- : [ 70/885] 3589839=test_arity I, [2024-05-03T15:53:54.449130 #3548468] INFO -- : [ 71/885] 3589839=test_io_wait_uncommon I, [2024-05-03T15:53:54.451025 #3548468] INFO -- : [ 72/885] 3589839=test_rdoc_class_module I, [2024-05-03T15:53:54.474170 #3548468] INFO -- : [ 73/885] 3589825=test_bignum I, [2024-05-03T15:53:54.478231 #3548468] INFO -- : [ 74/885] 3589833=test_gem_ci_detector I, [2024-05-03T15:53:54.512433 #3548468] INFO -- : [ 75/885] 3589820=test_enc_associate I, [2024-05-03T15:53:54.526974 #3548468] INFO -- : [ 76/885] 3589837=test_lazy_enumerator I, [2024-05-03T15:53:54.555855 #3548468] INFO -- : [ 77/885] 3589827=test_unix I, [2024-05-03T15:53:54.573531 #3548468] INFO -- : [ 78/885] 3589831=test_coder I, [2024-05-03T15:53:54.590048 #3548468] INFO -- : [ 79/885] 3589827=test_symbol I, [2024-05-03T15:53:54.611632 #3548468] INFO -- : [ 80/885] 3589831=test_context I, [2024-05-03T15:53:54.635994 #3548468] INFO -- : [ 81/885] 3589825=test_gem_commands_pristine_command I, [2024-05-03T15:53:54.642490 #3548468] INFO -- : [ 82/885] 3589833=test_nofree I, [2024-05-03T15:53:54.643662 #3548468] INFO -- : [ 83/885] 3589833=ruby_api_test I, [2024-05-03T15:53:54.722385 #3548468] INFO -- : [ 84/885] 3589831=test_find_executable I, [2024-05-03T15:53:54.746694 #3548468] INFO -- : [ 85/885] 3589831=test_function_entry I, [2024-05-03T15:53:54.748413 #3548468] INFO -- : [ 86/885] 3589831=test_gem_resolver_requirement_list I, [2024-05-03T15:53:54.755964 #3548468] INFO -- : [ 87/885] 3589831=test_arith_seq_beg_len_step I, [2024-05-03T15:53:54.764633 #3548468] INFO -- : [ 88/885] 3589824=test_pkcs7 I, [2024-05-03T15:53:54.827717 #3548468] INFO -- : [ 89/885] 3589833=test_mailto I, [2024-05-03T15:53:54.841009 #3548468] INFO -- : [ 90/885] 3589833=test_coderange I, [2024-05-03T15:53:54.843458 #3548468] INFO -- : [ 91/885] 3589833=location_test I, [2024-05-03T15:53:54.845737 #3548468] INFO -- : [ 92/885] 3589831=test_symbol I, [2024-05-03T15:53:54.849536 #3548468] INFO -- : [ 93/885] 3589831=test_http_request I, [2024-05-03T15:53:54.880922 #3548468] INFO -- : [ 94/885] 3589822=json_generic_object_test I, [2024-05-03T15:53:54.881459 #3548468] INFO -- : [ 95/885] 3589833=test_gem_source_fetch_problem I, [2024-05-03T15:53:54.892839 #3548468] INFO -- : [ 96/885] 3589822=test_rdoc_generator_darkfish I, [2024-05-03T15:53:54.903523 #3548468] INFO -- : [ 97/885] 3589837=test_rdoc_comment I, [2024-05-03T15:53:54.905632 #3548468] INFO -- : [ 98/885] 3589831=test_error_highlight I, [2024-05-03T15:53:54.906763 #3548468] INFO -- : [ 99/885] 3589833=test_resize I, [2024-05-03T15:53:54.916390 #3548468] INFO -- : [100/885] 3589839=test_cgi_multipart I, [2024-05-03T15:53:54.930698 #3548468] INFO -- : [101/885] 3589833=test_gem_commands_cleanup_command I, [2024-05-03T15:53:55.045339 #3548468] INFO -- : [102/885] 3589824=test_word I, [2024-05-03T15:53:55.049029 #3548468] INFO -- : [103/885] 3589824=test_numeric I, [2024-05-03T15:53:55.072190 #3548468] INFO -- : [104/885] 3589835=test_member I, [2024-05-03T15:53:55.073764 #3548468] INFO -- : [105/885] 3589835=test_ractor_compatibility I, [2024-05-03T15:53:55.082782 #3548468] INFO -- : [106/885] 3589837=test_gem_console_ui I, [2024-05-03T15:53:55.087314 #3548468] INFO -- : [107/885] 3589824=test_date_ractor I, [2024-05-03T15:53:55.088803 #3548468] INFO -- : [108/885] 3589837=format_errors_test I, [2024-05-03T15:53:55.093374 #3548468] INFO -- : [109/885] 3589839=test_dir I, [2024-05-03T15:53:55.097965 #3548468] INFO -- : [110/885] 3589820=test_eval I, [2024-05-03T15:53:55.099913 #3548468] INFO -- : [111/885] 3589820=test_autoconf I, [2024-05-03T15:53:55.103904 #3548468] INFO -- : [112/885] 3589820=test_gem_resolver_lock_set I, [2024-05-03T15:53:55.184379 #3548468] INFO -- : [113/885] 3589837=test_not I, [2024-05-03T15:53:55.187894 #3548468] INFO -- : [114/885] 3589837=test_import I, [2024-05-03T15:53:55.209647 #3548468] INFO -- : [115/885] 3589822=test_rdoc_parser_markdown I, [2024-05-03T15:53:55.211305 #3548468] INFO -- : [116/885] 3589836=test_file_exhaustive I, [2024-05-03T15:53:55.243275 #3548468] INFO -- : [117/885] 3589829=test_files_test I, [2024-05-03T15:53:55.244198 #3548468] INFO -- : [118/885] 3589822=test_gem_update_suggestion I, [2024-05-03T15:53:55.293402 #3548468] INFO -- : [119/885] 3589820=test_logger I, [2024-05-03T15:53:55.304488 #3548468] INFO -- : [120/885] 3589822=test_win32ole_method I, [2024-05-03T15:53:55.309025 #3548468] INFO -- : [121/885] 3589822=test_delete I, [2024-05-03T15:53:55.310385 #3548468] INFO -- : [122/885] 3589820=test_keyword I, [2024-05-03T15:53:55.326441 #3548468] INFO -- : [123/885] 3589824=test_class_name_check I, [2024-05-03T15:53:55.332491 #3548468] INFO -- : [124/885] 3589822=test_fd_setsize I, [2024-05-03T15:53:55.333798 #3548468] INFO -- : [125/885] 3589822=test_continuation I, [2024-05-03T15:53:55.337048 #3548468] INFO -- : [126/885] 3589839=test_gem_commands_push_command I, [2024-05-03T15:53:55.337765 #3548468] INFO -- : [127/885] 3589831=test_weakkeymap I, [2024-05-03T15:53:55.348097 #3548468] INFO -- : [128/885] 3589824=test_numhash I, [2024-05-03T15:53:55.351360 #3548468] INFO -- : [129/885] 3589824=test_pkey_rsa I, [2024-05-03T15:53:55.360618 #3548468] INFO -- : [130/885] 3589822=test_gem_platform I, [2024-05-03T15:53:55.362763 #3548468] INFO -- : [131/885] 3589829=test_gem_package_task I, [2024-05-03T15:53:55.367541 #3548468] INFO -- : [132/885] 3589829=test_date_strptime I, [2024-05-03T15:53:55.459151 #3548468] INFO -- : [133/885] 3589822=test_placearg I, [2024-05-03T15:53:55.485090 #3548468] INFO -- : [134/885] 3589833=test_rdoc_markup_hard_break I, [2024-05-03T15:53:55.499363 #3548468] INFO -- : [135/885] 3589831=test_big5 I, [2024-05-03T15:53:55.503374 #3548468] INFO -- : [136/885] 3589831=test_func I, [2024-05-03T15:53:55.513804 #3548468] INFO -- : [137/885] 3589835=test_pointer I, [2024-05-03T15:53:55.520348 #3548468] INFO -- : [138/885] 3589826=test_ractor I, [2024-05-03T15:53:55.537537 #3548468] INFO -- : [139/885] 3589829=test_type I, [2024-05-03T15:53:55.543525 #3548468] INFO -- : [140/885] 3589829=test_signedness I, [2024-05-03T15:53:55.596181 #3548468] INFO -- : [141/885] 3589826=test_tsort I, [2024-05-03T15:53:55.600334 #3548468] INFO -- : [142/885] 3589826=test_rdoc_rd_block_parser I, [2024-05-03T15:53:55.606823 #3548468] INFO -- : [143/885] 3589824=test_timeout I, [2024-05-03T15:53:55.617809 #3548468] INFO -- : [144/885] 3589824=test_normalize I, [2024-05-03T15:53:55.621067 #3548468] INFO -- : [145/885] 3589824=test_ossl I, [2024-05-03T15:53:55.626994 #3548468] INFO -- : [146/885] 3589822=test_change_word I, [2024-05-03T15:53:55.631771 #3548468] INFO -- : [147/885] 3589822=test_flip I, [2024-05-03T15:53:55.633627 #3548468] INFO -- : [148/885] 3589833=compiler_test I, [2024-05-03T15:53:55.638145 #3548468] INFO -- : [149/885] 3589833=test_sleep I, [2024-05-03T15:53:55.681976 #3548468] INFO -- : [150/885] 3589822=test_date_arith I, [2024-05-03T15:53:55.695188 #3548468] INFO -- : [151/885] 3589822=test_object I, [2024-05-03T15:53:55.747815 #3548468] INFO -- : [152/885] 3589826=test_ruby_lex I, [2024-05-03T15:53:55.792806 #3548468] INFO -- : [153/885] 3589837=test_gem_local_remote_options I, [2024-05-03T15:53:55.816924 #3548468] INFO -- : [154/885] 3589837=test_basicinstructions I, [2024-05-03T15:53:55.900207 #3548468] INFO -- : [155/885] 3589837=test_gem_gemcutter_utilities I, [2024-05-03T15:53:55.907986 #3548468] INFO -- : [156/885] 3589820=test_gem_command_manager I, [2024-05-03T15:53:55.952131 #3548468] INFO -- : [157/885] 3589826=test_key_actor_emacs I, [2024-05-03T15:53:55.982653 #3548468] INFO -- : [158/885] 3589825=test_arithmetic_sequence I, [2024-05-03T15:53:55.988867 #3548468] INFO -- : [159/885] 3589835=test_object I, [2024-05-03T15:53:55.994051 #3548468] INFO -- : [160/885] 3589825=test_cgi_header I, [2024-05-03T15:53:56.004653 #3548468] INFO -- : [161/885] 3589839=heredoc_dedent_test I, [2024-05-03T15:53:56.008790 #3548468] INFO -- : [162/885] 3589825=version_test I, [2024-05-03T15:53:56.020831 #3548468] INFO -- : [163/885] 3589835=test_rdoc_ri_paths I, [2024-05-03T15:53:56.067835 #3548468] INFO -- : [164/885] 3589827=test_ensured I, [2024-05-03T15:53:56.078671 #3548468] INFO -- : [165/885] 3589825=library_symbols_test I, [2024-05-03T15:53:56.081865 #3548468] INFO -- : [166/885] 3589825=test_addr I, [2024-05-03T15:53:56.085132 #3548468] INFO -- : [167/885] 3589826=test_locale I, [2024-05-03T15:53:56.089768 #3548468] INFO -- : [168/885] 3589820=test_ts I, [2024-05-03T15:53:56.094128 #3548468] INFO -- : [169/885] 3589839=test_erb_command I, [2024-05-03T15:53:56.109588 #3548468] INFO -- : [170/885] 3589826=test_helper I, [2024-05-03T15:53:56.115614 #3548468] INFO -- : [171/885] 3589827=test_encoding I, [2024-05-03T15:53:56.118470 #3548468] INFO -- : [172/885] 3589826=test_gem_uri_formatter I, [2024-05-03T15:53:56.132798 #3548468] INFO -- : [173/885] 3589839=test_range I, [2024-05-03T15:53:56.139256 #3548468] INFO -- : [174/885] 3589822=test_project_sanity I, [2024-05-03T15:53:56.145833 #3548468] INFO -- : [175/885] 3589825=test_dup I, [2024-05-03T15:53:56.151557 #3548468] INFO -- : [176/885] 3589838=test_pty I, [2024-05-03T15:53:56.169744 #3548468] INFO -- : [177/885] 3589830=test_constant I, [2024-05-03T15:53:56.175007 #3548468] INFO -- : [178/885] 3589835=command_line_test I, [2024-05-03T15:53:56.180232 #3548468] INFO -- : [179/885] 3589835=test_udp I, [2024-05-03T15:53:56.183014 #3548468] INFO -- : [180/885] 3589835=test_data_error I, [2024-05-03T15:53:56.196906 #3548468] INFO -- : [181/885] 3589822=bom_test I, [2024-05-03T15:53:56.269271 #3548468] INFO -- : [182/885] 3589835=test_ostruct I, [2024-05-03T15:53:56.274854 #3548468] INFO -- : [183/885] 3589837=unescape_test I, [2024-05-03T15:53:56.294502 #3548468] INFO -- : [184/885] 3589822=test_force_exit I, [2024-05-03T15:53:56.341108 #3548468] INFO -- : [185/885] 3589822=test_file I, [2024-05-03T15:53:56.343290 #3548468] INFO -- : [186/885] 3589827=static_inspect_test I, [2024-05-03T15:53:56.343649 #3548468] INFO -- : [187/885] 3589826=errors_test I, [2024-05-03T15:53:56.345281 #3548468] INFO -- : [188/885] 3589825=test_regexp I, [2024-05-03T15:53:56.440460 #3548468] INFO -- : [189/885] 3589827=test_gem_commands_check_command I, [2024-05-03T15:53:56.457365 #3548468] INFO -- : [190/885] 3589831=test_tmpdir I, [2024-05-03T15:53:56.500683 #3548468] INFO -- : [191/885] 3589826=test_integer_comb I, [2024-05-03T15:53:56.510063 #3548468] INFO -- : [192/885] 3589835=test_rdoc_markup_document I, [2024-05-03T15:53:56.519290 #3548468] INFO -- : [193/885] 3589831=test_vm_dump I, [2024-05-03T15:53:56.519820 #3548468] INFO -- : [194/885] 3589831=test_random_formatter I, [2024-05-03T15:53:56.522733 #3548468] INFO -- : [195/885] 3589835=test_helper I, [2024-05-03T15:53:56.522809 #3548468] INFO -- : [196/885] 3589835=test_jaro_winkler I, [2024-05-03T15:53:56.527289 #3548468] INFO -- : [197/885] 3589835=test_lambda I, [2024-05-03T15:53:56.531408 #3548468] INFO -- : [198/885] 3589831=test_ast I, [2024-05-03T15:53:56.609791 #3548468] INFO -- : [199/885] 3589835=test_gem_request_set_gem_dependency_api I, [2024-05-03T15:53:56.664721 #3548468] INFO -- : [200/885] 3589827=test_webauthn_listener I, [2024-05-03T15:53:56.671168 #3548468] INFO -- : [201/885] 3589820=test_x509store I, [2024-05-03T15:53:56.688741 #3548468] INFO -- : [202/885] 3589838=test_rdoc_code_object I, [2024-05-03T15:53:56.718372 #3548468] INFO -- : [203/885] 3589827=test_update I, [2024-05-03T15:53:56.722000 #3548468] INFO -- : [204/885] 3589827=test_fips I, [2024-05-03T15:53:56.843038 #3548468] INFO -- : [205/885] 3589835=test_x509name I, [2024-05-03T15:53:56.851003 #3548468] INFO -- : [206/885] 3589832=test_transcode I, [2024-05-03T15:53:56.864733 #3548468] INFO -- : [207/885] 3589835=json_generator_test I, [2024-05-03T15:53:56.888672 #3548468] INFO -- : [208/885] 3589839=test_eval I, [2024-05-03T15:53:56.931800 #3548468] INFO -- : [209/885] 3589834=test_enumerable I, [2024-05-03T15:53:56.950417 #3548468] INFO -- : [210/885] 3589834=test_config I, [2024-05-03T15:53:56.968657 #3548468] INFO -- : [211/885] 3589835=test_gem_resolver_vendor_set I, [2024-05-03T15:53:56.997338 #3548468] INFO -- : [212/885] 3589827=test_gem_resolver_api_set I, [2024-05-03T15:53:57.010981 #3548468] INFO -- : [213/885] 3589835=test_gem_safe_marshal I, [2024-05-03T15:53:57.066218 #3548468] INFO -- : [214/885] 3589827=test_pkey_dsa I, [2024-05-03T15:53:57.070678 #3548468] INFO -- : [215/885] 3589832=test_ocsp I, [2024-05-03T15:53:57.081719 #3548468] INFO -- : [216/885] 3589820=test_class I, [2024-05-03T15:53:57.085190 #3548468] INFO -- : [217/885] 3589820=test_scheduler I, [2024-05-03T15:53:57.110311 #3548468] INFO -- : [218/885] 3589838=test_rdoc_markup_heading I, [2024-05-03T15:53:57.120131 #3548468] INFO -- : [219/885] 3589838=test_exception_at_throwing I, [2024-05-03T15:53:57.171371 #3548468] INFO -- : [220/885] 3589838=test_iseq I, [2024-05-03T15:53:57.171436 #3548468] INFO -- : [221/885] 3589839=test_gem_commands_server_command I, [2024-05-03T15:53:57.171522 #3548468] INFO -- : [222/885] 3589839=test_io_m17n I, [2024-05-03T15:53:57.212364 #3548468] INFO -- : [223/885] 3589837=test_variable_name_check I, [2024-05-03T15:53:57.238420 #3548468] INFO -- : [224/885] 3589837=test_did_you_mean I, [2024-05-03T15:53:57.241980 #3548468] INFO -- : [225/885] 3589820=test_cmethod I, [2024-05-03T15:53:57.248737 #3548468] INFO -- : [226/885] 3589820=test_tracer I, [2024-05-03T15:53:57.362677 #3548468] INFO -- : [227/885] 3589837=test_append I, [2024-05-03T15:53:57.363836 #3548468] INFO -- : [228/885] 3589834=test_option I, [2024-05-03T15:53:57.365384 #3548468] INFO -- : [229/885] 3589837=test_gem_commands_build_command I, [2024-05-03T15:53:57.384479 #3548468] INFO -- : [230/885] 3589820=test_interned_str I, [2024-05-03T15:53:57.385711 #3548468] INFO -- : [231/885] 3589820=test_case_comprehensive I, [2024-05-03T15:53:57.435808 #3548468] INFO -- : [232/885] 3589832=test_ractor I, [2024-05-03T15:53:57.511594 #3548468] INFO -- : [233/885] 3589832=test_gem_security I, [2024-05-03T15:53:57.518942 #3548468] INFO -- : [234/885] 3589834=test_rdoc_servlet I, [2024-05-03T15:53:57.600160 #3548468] INFO -- : [235/885] 3589835=test_digest I, [2024-05-03T15:53:57.604011 #3548468] INFO -- : [236/885] 3589835=test_closure I, [2024-05-03T15:53:57.607656 #3548468] INFO -- : [237/885] 3589837=test_bundled_ca I, [2024-05-03T15:53:57.823622 #3548468] INFO -- : [238/885] 3589834=test_multi_irb_commands I, [2024-05-03T15:53:57.826079 #3548468] INFO -- : [239/885] 3589834=test_fiber I, [2024-05-03T15:53:57.864628 #3548468] INFO -- : [240/885] 3589838=test_open3 I, [2024-05-03T15:53:57.934776 #3548468] INFO -- : [241/885] 3589835=test_history I, [2024-05-03T15:53:57.977932 #3548468] INFO -- : [242/885] 3589829=test_mkmf I, [2024-05-03T15:53:57.986279 #3548468] INFO -- : [243/885] 3589835=test_date_marshal I, [2024-05-03T15:53:57.988693 #3548468] INFO -- : [244/885] 3589829=test_delegate I, [2024-05-03T15:53:57.991626 #3548468] INFO -- : [245/885] 3589835=test_popen_deadlock I, [2024-05-03T15:53:57.999132 #3548468] INFO -- : [246/885] 3589829=test_exit I, [2024-05-03T15:53:58.014420 #3548468] INFO -- : [247/885] 3589827=test_recursion I, [2024-05-03T15:53:58.015228 #3548468] INFO -- : [248/885] 3589827=test_to_ary_concat I, [2024-05-03T15:53:58.087699 #3548468] INFO -- : [249/885] 3589829=test_time I, [2024-05-03T15:53:58.244944 #3548468] INFO -- : [250/885] 3589829=test_webauthn_listener_response I, [2024-05-03T15:53:58.267047 #3548468] INFO -- : [251/885] 3589829=test_stream I, [2024-05-03T15:53:58.282650 #3548468] INFO -- : [252/885] 3589829=test_printf I, [2024-05-03T15:53:58.306808 #3548468] INFO -- : [253/885] 3589829=test_rdoc_markup_pre_process I, [2024-05-03T15:53:58.454339 #3548468] INFO -- : [254/885] 3589839=test_pinned I, [2024-05-03T15:53:58.493787 #3548468] INFO -- : [255/885] 3589839=reflection_test I, [2024-05-03T15:53:58.497255 #3548468] INFO -- : [256/885] 3589839=test_emoji_breaks I, [2024-05-03T15:53:58.500660 #3548468] INFO -- : [257/885] 3589829=test_gem_bundler_version_finder I, [2024-05-03T15:53:58.502119 #3548468] INFO -- : [258/885] 3589839=test_within_pipe I, [2024-05-03T15:53:58.536112 #3548468] INFO -- : [259/885] 3589829=test_rdoc_markup_to_bs I, [2024-05-03T15:53:58.542930 #3548468] INFO -- : [260/885] 3589826=test_help I, [2024-05-03T15:53:58.546131 #3548468] INFO -- : [261/885] 3589826=test_files_lib I, [2024-05-03T15:53:58.565701 #3548468] INFO -- : [262/885] 3589839=test_gem_commands_unpack_command I, [2024-05-03T15:53:58.569713 #3548468] INFO -- : [263/885] 3589829=test_beginendblock I, [2024-05-03T15:53:58.635213 #3548468] INFO -- : [264/885] 3589821=json_encoding_test I, [2024-05-03T15:53:58.664167 #3548468] INFO -- : [265/885] 3589821=test_color I, [2024-05-03T15:53:58.693505 #3548468] INFO -- : [266/885] 3589835=test_key_stroke I, [2024-05-03T15:53:58.694675 #3548468] INFO -- : [267/885] 3589835=test_set_len I, [2024-05-03T15:53:58.698788 #3548468] INFO -- : [268/885] 3589835=test_encoding I, [2024-05-03T15:53:58.728648 #3548468] INFO -- : [269/885] 3589835=test_httpresponses I, [2024-05-03T15:53:58.737689 #3548468] INFO -- : [270/885] 3589830=test_gem_resolver_local_specification I, [2024-05-03T15:53:58.756030 #3548468] INFO -- : [271/885] 3589830=test_httpheader I, [2024-05-03T15:53:58.784944 #3548468] INFO -- : [272/885] 3589835=test_rdoc_ri_driver I, [2024-05-03T15:53:58.817844 #3548468] INFO -- : [273/885] 3589830=test_install I, [2024-05-03T15:53:58.827355 #3548468] INFO -- : [274/885] 3589821=test_rdoc_markup_to_label I, [2024-05-03T15:53:58.837991 #3548468] INFO -- : [275/885] 3589839=test_sockopt I, [2024-05-03T15:53:58.840774 #3548468] INFO -- : [276/885] 3589839=test_pair I, [2024-05-03T15:53:58.935123 #3548468] INFO -- : [277/885] 3589829=test_gem_commands_yank_command I, [2024-05-03T15:53:58.990926 #3548468] INFO -- : [278/885] 3589821=test_win32ole_param I, [2024-05-03T15:53:58.995058 #3548468] INFO -- : [279/885] 3589821=test_document I, [2024-05-03T15:53:59.011751 #3548468] INFO -- : [280/885] 3589830=test_acceptable I, [2024-05-03T15:53:59.015013 #3548468] INFO -- : [281/885] 3589821=test_euc_jp I, [2024-05-03T15:53:59.017628 #3548468] INFO -- : [282/885] 3589821=test_rdoc_generator_pot_po_entry I, [2024-05-03T15:53:59.024364 #3548468] INFO -- : [283/885] 3589821=test_chilled I, [2024-05-03T15:53:59.027531 #3548468] INFO -- : [284/885] 3589821=test_name_error_extension I, [2024-05-03T15:53:59.037573 #3548468] INFO -- : [285/885] 3589821=test_rdoc_i18n_locale I, [2024-05-03T15:53:59.043862 #3548468] INFO -- : [286/885] 3589821=test_human_typo I, [2024-05-03T15:53:59.047656 #3548468] INFO -- : [287/885] 3589821=test_primitive I, [2024-05-03T15:53:59.066571 #3548468] INFO -- : [288/885] 3589827=test_rbconfig I, [2024-05-03T15:53:59.069733 #3548468] INFO -- : [289/885] 3589821=test_ssl_session I, [2024-05-03T15:53:59.070837 #3548468] INFO -- : [290/885] 3589827=test_thread_cv I, [2024-05-03T15:53:59.125340 #3548468] INFO -- : [291/885] 3589830=test_lexer I, [2024-05-03T15:53:59.138840 #3548468] INFO -- : [292/885] 3589835=test_gem_uri I, [2024-05-03T15:53:59.150423 #3548468] INFO -- : [293/885] 3589830=test_key_event_record I, [2024-05-03T15:53:59.175557 #3548468] INFO -- : [294/885] 3589835=test_notimplement I, [2024-05-03T15:53:59.181029 #3548468] INFO -- : [295/885] 3589835=test_random I, [2024-05-03T15:53:59.188906 #3548468] INFO -- : [296/885] 3589835=test_gem_resolver_vendor_specification I, [2024-05-03T15:53:59.210581 #3548468] INFO -- : [297/885] 3589830=test_gem_commands_update_command I, [2024-05-03T15:53:59.226656 #3548468] INFO -- : [298/885] 3589835=test_filter I, [2024-05-03T15:53:59.256187 #3548468] INFO -- : [299/885] 3589835=test_gem_gem_runner I, [2024-05-03T15:53:59.297714 #3548468] INFO -- : [300/885] 3589837=static_literals_test I, [2024-05-03T15:53:59.304941 #3548468] INFO -- : [301/885] 3589837=test_data I, [2024-05-03T15:53:59.314044 #3548468] INFO -- : [302/885] 3589837=test_rdoc_method_attr I, [2024-05-03T15:53:59.317140 #3548468] INFO -- : [303/885] 3589835=test_rdoc_parser_changelog I, [2024-05-03T15:53:59.383629 #3548468] INFO -- : [304/885] 3589835=test_enumerator I, [2024-05-03T15:53:59.387029 #3548468] INFO -- : [305/885] 3589835=test_koi8 I, [2024-05-03T15:53:59.391525 #3548468] INFO -- : [306/885] 3589835=parameters_signature_test I, [2024-05-03T15:53:59.396767 #3548468] INFO -- : [307/885] 3589835=test_unicode I, [2024-05-03T15:53:59.402553 #3548468] INFO -- : [308/885] 3589835=test_rdoc_generator_pot I, [2024-05-03T15:53:59.404521 #3548468] INFO -- : [309/885] 3589835=test_path I, [2024-05-03T15:53:59.410496 #3548468] INFO -- : [310/885] 3589835=redundant_return_test I, [2024-05-03T15:53:59.415939 #3548468] INFO -- : [311/885] 3589835=test_case_mapping I, [2024-05-03T15:53:59.427483 #3548468] INFO -- : [312/885] 3589835=test_bn I, [2024-05-03T15:53:59.428959 #3548468] INFO -- : [313/885] 3589829=test_win32ole_param_event I, [2024-05-03T15:53:59.432692 #3548468] INFO -- : [314/885] 3589835=test_addrinfo I, [2024-05-03T15:53:59.434768 #3548468] INFO -- : [315/885] 3589829=test_http I, [2024-05-03T15:53:59.459577 #3548468] INFO -- : [316/885] 3589835=test_tree_spell_checker I, [2024-05-03T15:53:59.482154 #3548468] INFO -- : [317/885] 3589835=test_date_compat I, [2024-05-03T15:53:59.492100 #3548468] INFO -- : [318/885] 3589835=test_rdoc_markup_to_html I, [2024-05-03T15:53:59.494856 #3548468] INFO -- : [319/885] 3589837=test_bug-14834 I, [2024-05-03T15:53:59.542796 #3548468] INFO -- : [320/885] 3589835=test_terminfo I, [2024-05-03T15:53:59.546170 #3548468] INFO -- : [321/885] 3589835=test_compile_prism I, [2024-05-03T15:53:59.576616 #3548468] INFO -- : [322/885] 3589837=test_boolean I, [2024-05-03T15:53:59.585044 #3548468] INFO -- : [323/885] 3589837=test_stringify_symbols I, [2024-05-03T15:53:59.591436 #3548468] INFO -- : [324/885] 3589837=integer_parse_test I, [2024-05-03T15:53:59.593631 #3548468] INFO -- : [325/885] 3589837=test_instrumentation_api I, [2024-05-03T15:53:59.720350 #3548468] INFO -- : [326/885] 3589827=test_configuration I, [2024-05-03T15:53:59.819218 #3548468] INFO -- : [327/885] 3589835=test_rubyvm I, [2024-05-03T15:53:59.824491 #3548468] INFO -- : [328/885] 3589835=test_buffered_io I, [2024-05-03T15:53:59.845908 #3548468] INFO -- : [329/885] 3589827=test_monitor I, [2024-05-03T15:53:59.863434 #3548468] INFO -- : [330/885] 3589835=test_whileuntil I, [2024-05-03T15:53:59.866752 #3548468] INFO -- : [331/885] 3589835=test_rdoc_generator_markup I, [2024-05-03T15:53:59.873940 #3548468] INFO -- : [332/885] 3589835=test_arith_seq_extract I, [2024-05-03T15:54:00.017777 #3548468] INFO -- : [333/885] 3589838=test_method_name_check I, [2024-05-03T15:54:00.051096 #3548468] INFO -- : [334/885] 3589838=test_parser I, [2024-05-03T15:54:00.058376 #3548468] INFO -- : [335/885] 3589827=constant_path_node_test I, [2024-05-03T15:54:00.065674 #3548468] INFO -- : [336/885] 3589827=test_gem_ext_cargo_builder I, [2024-05-03T15:54:00.079524 #3548468] INFO -- : [337/885] 3589827=test_ssl I, [2024-05-03T15:54:00.081803 #3548468] INFO -- : [338/885] 3589838=test_module I, [2024-05-03T15:54:00.084702 #3548468] INFO -- : [339/885] 3589835=test_gem_request_set I, [2024-05-03T15:54:00.160483 #3548468] INFO -- : [340/885] 3589821=test_rational I, [2024-05-03T15:54:00.183275 #3548468] INFO -- : [341/885] 3589821=test_rational2 I, [2024-05-03T15:54:00.198969 #3548468] INFO -- : [342/885] 3589821=test_assembler I, [2024-05-03T15:54:00.200563 #3548468] INFO -- : [343/885] 3589821=attribute_write_test I, [2024-05-03T15:54:00.206854 #3548468] INFO -- : [344/885] 3589821=test_propertyputref I, [2024-05-03T15:54:00.212812 #3548468] INFO -- : [345/885] 3589821=test_spell_checker I, [2024-05-03T15:54:00.224790 #3548468] INFO -- : [346/885] 3589821=test_x509ext I, [2024-05-03T15:54:00.260029 #3548468] INFO -- : [347/885] 3589821=test_erb I, [2024-05-03T15:54:00.305324 #3548468] INFO -- : [348/885] 3589830=test_gem_source_installed I, [2024-05-03T15:54:00.308328 #3548468] INFO -- : [349/885] 3589821=test_len I, [2024-05-03T15:54:00.313069 #3548468] INFO -- : [350/885] 3589821=test_yield_block I, [2024-05-03T15:54:00.317979 #3548468] INFO -- : [351/885] 3589830=test_gem_commands_cert_command I, [2024-05-03T15:54:00.324167 #3548468] INFO -- : [352/885] 3589821=test_completion I, [2024-05-03T15:54:00.459943 #3548468] INFO -- : [353/885] 3589836=test_abi I, [2024-05-03T15:54:00.491298 #3548468] INFO -- : [354/885] 3589835=test_provider I, [2024-05-03T15:54:00.645808 #3548468] INFO -- : [355/885] 3589833=test_rdoc_parser_simple I, [2024-05-03T15:54:00.647327 #3548468] INFO -- : [356/885] 3589836=test_load I, [2024-05-03T15:54:00.650645 #3548468] INFO -- : [357/885] 3589836=test_gem_commands_rebuild_command I, [2024-05-03T15:54:00.688058 #3548468] INFO -- : [358/885] 3589836=test_yamldbm I, [2024-05-03T15:54:00.693428 #3548468] INFO -- : [359/885] 3589833=test_https I, [2024-05-03T15:54:00.696767 #3548468] INFO -- : [360/885] 3589836=test_gem_ext_builder I, [2024-05-03T15:54:00.821062 #3548468] INFO -- : [361/885] 3589835=test_evaluation I, [2024-05-03T15:54:00.831772 #3548468] INFO -- : [362/885] 3589835=test_gem_dependency_list I, [2024-05-03T15:54:00.837753 #3548468] INFO -- : [363/885] 3589821=test_benchmark I, [2024-05-03T15:54:00.939619 #3548468] INFO -- : [364/885] 3589835=test_win32ole_method_event I, [2024-05-03T15:54:00.940456 #3548468] INFO -- : [365/885] 3589835=test_nesting_parser I, [2024-05-03T15:54:00.968344 #3548468] INFO -- : [366/885] 3589835=test_gem_source I, [2024-05-03T15:54:01.080913 #3548468] INFO -- : [367/885] 3589833=test_scalar_scanner I, [2024-05-03T15:54:01.113083 #3548468] INFO -- : [368/885] 3589833=test_gem_commands_outdated_command I, [2024-05-03T15:54:01.153813 #3548468] INFO -- : [369/885] 3589833=test_array I, [2024-05-03T15:54:01.267527 #3548468] INFO -- : [370/885] 3589835=test_gem_package_tar_writer I, [2024-05-03T15:54:01.402207 #3548468] INFO -- : [371/885] 3589835=test_helper_method I, [2024-05-03T15:54:01.414227 #3548468] INFO -- : [372/885] 3589835=test_new I, [2024-05-03T15:54:01.424783 #3548468] INFO -- : [373/885] 3589835=test_cipher I, [2024-05-03T15:54:01.469781 #3548468] INFO -- : [374/885] 3589835=test_gem_security_signer I, [2024-05-03T15:54:01.596638 #3548468] INFO -- : [375/885] 3589835=test_gem_resolver_git_set I, [2024-05-03T15:54:01.633412 #3548468] INFO -- : [376/885] 3589826=test_storage I, [2024-05-03T15:54:01.640910 #3548468] INFO -- : [377/885] 3589826=test_digest_extend I, [2024-05-03T15:54:01.657995 #3548468] INFO -- : [378/885] 3589826=test_string I, [2024-05-03T15:54:01.659485 #3548468] INFO -- : [379/885] 3589826=test_iterator I, [2024-05-03T15:54:01.747404 #3548468] INFO -- : [380/885] 3589826=test_omap I, [2024-05-03T15:54:01.750310 #3548468] INFO -- : [381/885] 3589836=test_debug I, [2024-05-03T15:54:01.765664 #3548468] INFO -- : [382/885] 3589836=pattern_test I, [2024-05-03T15:54:01.786657 #3548468] INFO -- : [383/885] 3589826=test_memory_view I, [2024-05-03T15:54:01.806188 #3548468] INFO -- : [384/885] 3589826=test_shellwords I, [2024-05-03T15:54:01.821679 #3548468] INFO -- : [385/885] 3589826=test_cgi_session I, [2024-05-03T15:54:01.829882 #3548468] INFO -- : [386/885] 3589826=test_rdoc_rd I, [2024-05-03T15:54:01.831424 #3548468] INFO -- : [387/885] 3589826=test_rdoc_top_level I, [2024-05-03T15:54:01.853650 #3548468] INFO -- : [388/885] 3589838=test_metaclass I, [2024-05-03T15:54:01.860444 #3548468] INFO -- : [389/885] 3589838=test_signal I, [2024-05-03T15:54:01.886679 #3548468] INFO -- : [390/885] 3589836=test_fixnum I, [2024-05-03T15:54:01.892365 #3548468] INFO -- : [391/885] 3589836=test_x509crl I, [2024-05-03T15:54:01.903676 #3548468] INFO -- : [392/885] 3589835=test_process I, [2024-05-03T15:54:01.942063 #3548468] INFO -- : [393/885] 3589835=test_windows_1252 I, [2024-05-03T15:54:01.947468 #3548468] INFO -- : [394/885] 3589835=test_input_method I, [2024-05-03T15:54:01.972961 #3548468] INFO -- : [395/885] 3589835=test_float I, [2024-05-03T15:54:02.069647 #3548468] INFO -- : [396/885] 3589836=test_require I, [2024-05-03T15:54:02.170143 #3548468] INFO -- : [397/885] 3589824=test_cgi_cookie I, [2024-05-03T15:54:02.179434 #3548468] INFO -- : [398/885] 3589824=test_regex_casefold I, [2024-05-03T15:54:02.204033 #3548468] INFO -- : [399/885] 3589821=test_gem_commands_signout_command I, [2024-05-03T15:54:02.227274 #3548468] INFO -- : [400/885] 3589826=test_refinement I, [2024-05-03T15:54:02.322284 #3548468] INFO -- : [401/885] 3589839=test_gem_source_git I, [2024-05-03T15:54:02.344159 #3548468] INFO -- : [402/885] 3589821=test_dir_m17n I, [2024-05-03T15:54:02.411460 #3548468] INFO -- : [403/885] 3589822=test_gem_resolver_installer_set I, [2024-05-03T15:54:02.561623 #3548468] INFO -- : [404/885] 3589837=test_files_test_1 I, [2024-05-03T15:54:02.639652 #3548468] INFO -- : [405/885] 3589822=test_set I, [2024-05-03T15:54:02.667535 #3548468] INFO -- : [406/885] 3589822=test_struct I, [2024-05-03T15:54:02.751068 #3548468] INFO -- : [407/885] 3589824=test_gem_path_support I, [2024-05-03T15:54:02.820374 #3548468] INFO -- : [408/885] 3589839=test_x509req I, [2024-05-03T15:54:02.833925 #3548468] INFO -- : [409/885] 3589828=test_mutex I, [2024-05-03T15:54:02.946694 #3548468] INFO -- : [410/885] 3589824=test_rdoc_rd_inline I, [2024-05-03T15:54:03.065950 #3548468] INFO -- : [411/885] 3589839=test_engine I, [2024-05-03T15:54:03.070448 #3548468] INFO -- : [412/885] 3589839=test_win32ole_variant_m I, [2024-05-03T15:54:03.074438 #3548468] INFO -- : [413/885] 3589839=test_div I, [2024-05-03T15:54:03.080341 #3548468] INFO -- : [414/885] 3589839=test_allocation I, [2024-05-03T15:54:03.083982 #3548468] INFO -- : [415/885] 3589830=test_key_error I, [2024-05-03T15:54:03.088902 #3548468] INFO -- : [416/885] 3589830=test_insns_leaf I, [2024-05-03T15:54:03.098242 #3548468] INFO -- : [417/885] 3589830=test_serialize_subclasses I, [2024-05-03T15:54:03.100622 #3548468] INFO -- : [418/885] 3589830=test_deprecated I, [2024-05-03T15:54:03.105094 #3548468] INFO -- : [419/885] 3589830=test_color_printer I, [2024-05-03T15:54:03.125213 #3548468] INFO -- : [420/885] 3589830=test_pkg_config I, [2024-05-03T15:54:03.137619 #3548468] INFO -- : [421/885] 3589830=test_cparser I, [2024-05-03T15:54:03.148654 #3548468] INFO -- : [422/885] 3589824=test_struct I, [2024-05-03T15:54:03.158171 #3548468] INFO -- : [423/885] 3589824=test_rdoc_markup_to_html_snippet I, [2024-05-03T15:54:03.217283 #3548468] INFO -- : [424/885] 3589823=magic_comment_test I, [2024-05-03T15:54:03.319448 #3548468] INFO -- : [425/885] 3589824=fuzzer_test I, [2024-05-03T15:54:03.345381 #3548468] INFO -- : [426/885] 3589823=test_rdoc_markup_include I, [2024-05-03T15:54:03.415538 #3548468] INFO -- : [427/885] 3589824=test_sexp I, [2024-05-03T15:54:03.421328 #3548468] INFO -- : [428/885] 3589822=test_variable I, [2024-05-03T15:54:03.438788 #3548468] INFO -- : [429/885] 3589824=test_win32ole_variant_outarg I, [2024-05-03T15:54:03.442612 #3548468] INFO -- : [430/885] 3589824=test_gem_source_subpath_problem I, [2024-05-03T15:54:03.448766 #3548468] INFO -- : [431/885] 3589835=test_dln I, [2024-05-03T15:54:03.450115 #3548468] INFO -- : [432/885] 3589835=json_common_interface_test I, [2024-05-03T15:54:03.461417 #3548468] INFO -- : [433/885] 3589835=json_parser_test I, [2024-05-03T15:54:03.495187 #3548468] INFO -- : [434/885] 3589835=test_nomethod_error I, [2024-05-03T15:54:03.499995 #3548468] INFO -- : [435/885] 3589835=memsize_test I, [2024-05-03T15:54:03.506990 #3548468] INFO -- : [436/885] 3589835=test_config I, [2024-05-03T15:54:03.542869 #3548468] INFO -- : [437/885] 3589823=test_profile_frames I, [2024-05-03T15:54:03.563212 #3548468] INFO -- : [438/885] 3589835=test_pstore I, [2024-05-03T15:54:03.571866 #3548468] INFO -- : [439/885] 3589822=test_cstr I, [2024-05-03T15:54:03.596517 #3548468] INFO -- : [440/885] 3589824=test_enc_str_buf_cat I, [2024-05-03T15:54:03.602193 #3548468] INFO -- : [441/885] 3589824=test_class2name I, [2024-05-03T15:54:03.606945 #3548468] INFO -- : [442/885] 3589824=test_gbk I, [2024-05-03T15:54:03.608101 #3548468] INFO -- : [443/885] 3589824=test_rdoc_parser_c I, [2024-05-03T15:54:03.608538 #3548468] INFO -- : [444/885] 3589830=test_comparable I, [2024-05-03T15:54:03.616157 #3548468] INFO -- : [445/885] 3589830=test_shapes I, [2024-05-03T15:54:03.619366 #3548468] INFO -- : [446/885] 3589830=json_fixtures_test I, [2024-05-03T15:54:03.622508 #3548468] INFO -- : [447/885] 3589835=test_io_timeout I, [2024-05-03T15:54:03.625783 #3548468] INFO -- : [448/885] 3589835=test_ansi_without_terminfo I, [2024-05-03T15:54:03.627942 #3548468] INFO -- : [449/885] 3589830=test_gem_commands_sources_command I, [2024-05-03T15:54:03.635793 #3548468] INFO -- : [450/885] 3589835=test_euc_tw I, [2024-05-03T15:54:03.639867 #3548468] INFO -- : [451/885] 3589835=test_ractor I, [2024-05-03T15:54:03.661812 #3548468] INFO -- : [452/885] 3589835=test_bmethod I, [2024-05-03T15:54:03.674059 #3548468] INFO -- : [453/885] 3589835=test_rdoc_markup_formatter I, [2024-05-03T15:54:03.683098 #3548468] INFO -- : [454/885] 3589835=test_thread_queue I, [2024-05-03T15:54:03.762658 #3548468] INFO -- : [455/885] 3589823=test_nowrite I, [2024-05-03T15:54:03.782258 #3548468] INFO -- : [456/885] 3589830=test_wait I, [2024-05-03T15:54:03.796824 #3548468] INFO -- : [457/885] 3589823=test_handle I, [2024-05-03T15:54:03.838485 #3548468] INFO -- : [458/885] 3589824=test_forwardable I, [2024-05-03T15:54:03.858366 #3548468] INFO -- : [459/885] 3589824=test_yaml I, [2024-05-03T15:54:03.886275 #3548468] INFO -- : [460/885] 3589830=test_big2str I, [2024-05-03T15:54:03.887700 #3548468] INFO -- : [461/885] 3589830=test_recorder I, [2024-05-03T15:54:03.894215 #3548468] INFO -- : [462/885] 3589830=test_gem_source_vendor I, [2024-05-03T15:54:03.907918 #3548468] INFO -- : [463/885] 3589830=test_gem_commands_owner_command I, [2024-05-03T15:54:03.937944 #3548468] INFO -- : [464/885] 3589823=test_formatter I, [2024-05-03T15:54:03.943593 #3548468] INFO -- : [465/885] 3589823=test_bash_completion I, [2024-05-03T15:54:03.947254 #3548468] INFO -- : [466/885] 3589823=test_deprecate I, [2024-05-03T15:54:03.953246 #3548468] INFO -- : [467/885] 3589821=test_rdoc_constant I, [2024-05-03T15:54:03.956027 #3548468] INFO -- : [468/885] 3589828=test_file I, [2024-05-03T15:54:03.957546 #3548468] INFO -- : [469/885] 3589828=test_rdoc_any_method I, [2024-05-03T15:54:03.959471 #3548468] INFO -- : [470/885] 3589824=test_modify_expand I, [2024-05-03T15:54:03.962607 #3548468] INFO -- : [471/885] 3589824=test_rdoc_markdown I, [2024-05-03T15:54:04.070630 #3548468] INFO -- : [472/885] 3589834=test_gem_available_set I, [2024-05-03T15:54:04.144506 #3548468] INFO -- : [473/885] 3589823=test_pathname I, [2024-05-03T15:54:04.149700 #3548468] INFO -- : [474/885] 3589821=test_init I, [2024-05-03T15:54:04.228398 #3548468] INFO -- : [475/885] 3589824=test_complexrational I, [2024-05-03T15:54:04.229982 #3548468] INFO -- : [476/885] 3589824=regexp_test I, [2024-05-03T15:54:04.235261 #3548468] INFO -- : [477/885] 3589838=test_gem_package_tar_reader I, [2024-05-03T15:54:04.244083 #3548468] INFO -- : [478/885] 3589824=test_coverage I, [2024-05-03T15:54:04.305562 #3548468] INFO -- : [479/885] 3589838=test_rdoc_encoding I, [2024-05-03T15:54:04.341966 #3548468] INFO -- : [480/885] 3589838=test_find I, [2024-05-03T15:54:04.361216 #3548468] INFO -- : [481/885] 3589823=test_ractor I, [2024-05-03T15:54:04.367842 #3548468] INFO -- : [482/885] 3589838=test_wss I, [2024-05-03T15:54:04.371322 #3548468] INFO -- : [483/885] 3589838=test_fiddle I, [2024-05-03T15:54:04.440115 #3548468] INFO -- : [484/885] 3589838=test_require I, [2024-05-03T15:54:04.478375 #3548468] INFO -- : [485/885] 3589834=test_cgi_util I, [2024-05-03T15:54:04.491753 #3548468] INFO -- : [486/885] 3589822=test_gem_commands_contents_command I, [2024-05-03T15:54:04.494719 #3548468] INFO -- : [487/885] 3589823=test_gem_ext_cmake_builder I, [2024-05-03T15:54:04.522673 #3548468] INFO -- : [488/885] 3589823=test_digest I, [2024-05-03T15:54:04.534213 #3548468] INFO -- : [489/885] 3589830=test_marshalable I, [2024-05-03T15:54:04.540843 #3548468] INFO -- : [490/885] 3589830=test_gem_resolver_index_specification I, [2024-05-03T15:54:04.589294 #3548468] INFO -- : [491/885] 3589821=test_internal_ivar I, [2024-05-03T15:54:04.594410 #3548468] INFO -- : [492/885] 3589830=test_tracepoint I, [2024-05-03T15:54:04.595056 #3548468] INFO -- : [493/885] 3589821=test_prettyprint I, [2024-05-03T15:54:04.624583 #3548468] INFO -- : [494/885] 3589822=test_rdoc_markup I, [2024-05-03T15:54:04.631548 #3548468] INFO -- : [495/885] 3589821=test_gem_commands_help_command I, [2024-05-03T15:54:04.636403 #3548468] INFO -- : [496/885] 3589822=test_duplicate I, [2024-05-03T15:54:04.639938 #3548468] INFO -- : [497/885] 3589822=test_utf32 I, [2024-05-03T15:54:04.647515 #3548468] INFO -- : [498/885] 3589822=test_basicsocket I, [2024-05-03T15:54:04.659144 #3548468] INFO -- : [499/885] 3589822=test_noarg I, [2024-05-03T15:54:04.752429 #3548468] INFO -- : [500/885] 3589821=parse_comments_test I, [2024-05-03T15:54:04.755483 #3548468] INFO -- : [501/885] 3589821=test_tempfile I, [2024-05-03T15:54:04.820507 #3548468] INFO -- : [502/885] 3589822=test_function I, [2024-05-03T15:54:04.828783 #3548468] INFO -- : [503/885] 3589832=test_queue I, [2024-05-03T15:54:04.833740 #3548468] INFO -- : [504/885] 3589832=test_irb I, [2024-05-03T15:54:04.836048 #3548468] INFO -- : [505/885] 3589834=test_asn1 I, [2024-05-03T15:54:04.863430 #3548468] INFO -- : [506/885] 3589828=test_random I, [2024-05-03T15:54:04.872753 #3548468] INFO -- : [507/885] 3589828=json_string_matching_test I, [2024-05-03T15:54:04.886656 #3548468] INFO -- : [508/885] 3589828=test_load I, [2024-05-03T15:54:04.891285 #3548468] INFO -- : [509/885] 3589834=test_rdoc_normal_class I, [2024-05-03T15:54:04.896144 #3548468] INFO -- : [510/885] 3589828=test_class I, [2024-05-03T15:54:04.942474 #3548468] INFO -- : [511/885] 3589830=test_const I, [2024-05-03T15:54:04.956956 #3548468] INFO -- : [512/885] 3589830=test_gem_installer I, [2024-05-03T15:54:04.997723 #3548468] INFO -- : [513/885] 3589834=test_yamlstore I, [2024-05-03T15:54:05.014115 #3548468] INFO -- : [514/885] 3589834=test_rdoc_parser_rd I, [2024-05-03T15:54:05.052609 #3548468] INFO -- : [515/885] 3589834=test_date_strftime I, [2024-05-03T15:54:05.075789 #3548468] INFO -- : [516/885] 3589822=test_gem_resolver_installed_specification I, [2024-05-03T15:54:05.111962 #3548468] INFO -- : [517/885] 3589822=test_scanner_events I, [2024-05-03T15:54:05.148886 #3548468] INFO -- : [518/885] 3589822=test_gem_remote_fetcher I, [2024-05-03T15:54:05.202459 #3548468] INFO -- : [519/885] 3589821=test_parse I, [2024-05-03T15:54:05.339975 #3548468] INFO -- : [520/885] 3589832=test_mdns I, [2024-05-03T15:54:05.354741 #3548468] INFO -- : [521/885] 3589833=test_path_to_class I, [2024-05-03T15:54:05.361027 #3548468] INFO -- : [522/885] 3589832=test_gem_resolver_specification I, [2024-05-03T15:54:05.364850 #3548468] INFO -- : [523/885] 3589833=test_gem_dependency I, [2024-05-03T15:54:05.394616 #3548468] INFO -- : [524/885] 3589824=test_inlinecache I, [2024-05-03T15:54:05.453234 #3548468] INFO -- : [525/885] 3589832=test_rdoc_markup_verbatim I, [2024-05-03T15:54:05.462298 #3548468] INFO -- : [526/885] 3589823=test_complex I, [2024-05-03T15:54:05.494379 #3548468] INFO -- : [527/885] 3589833=test_gem_commands_search_command I, [2024-05-03T15:54:05.502036 #3548468] INFO -- : [528/885] 3589824=test_gem_stub_specification I, [2024-05-03T15:54:05.540820 #3548468] INFO -- : [529/885] 3589833=test_method_cache I, [2024-05-03T15:54:05.548274 #3548468] INFO -- : [530/885] 3589833=test_frozen_error I, [2024-05-03T15:54:05.550023 #3548468] INFO -- : [531/885] 3589833=test_gem_ext_ext_conf_builder I, [2024-05-03T15:54:05.611121 #3548468] INFO -- : [532/885] 3589832=test_ldap I, [2024-05-03T15:54:05.629438 #3548468] INFO -- : [533/885] 3589823=test_emitter I, [2024-05-03T15:54:05.635891 #3548468] INFO -- : [534/885] 3589832=test_gem_commands_signin_command I, [2024-05-03T15:54:05.656000 #3548468] INFO -- : [535/885] 3589824=test_resource I, [2024-05-03T15:54:05.669366 #3548468] INFO -- : [536/885] 3589823=test_fileutils I, [2024-05-03T15:54:05.683189 #3548468] INFO -- : [537/885] 3589824=test_string_processing I, [2024-05-03T15:54:05.740098 #3548468] INFO -- : [538/885] 3589832=test_econv I, [2024-05-03T15:54:05.743057 #3548468] INFO -- : [539/885] 3589824=test_cesu8 I, [2024-05-03T15:54:05.747408 #3548468] INFO -- : [540/885] 3589824=test_rdoc_options I, [2024-05-03T15:54:05.789658 #3548468] INFO -- : [541/885] 3589826=test_gem_version I, [2024-05-03T15:54:05.802002 #3548468] INFO -- : [542/885] 3589836=test_too_many_dummy_encodings I, [2024-05-03T15:54:05.898535 #3548468] INFO -- : [543/885] 3589836=test_stack I, [2024-05-03T15:54:05.902399 #3548468] INFO -- : [544/885] 3589826=test_gem_commands_list_command I, [2024-05-03T15:54:05.920575 #3548468] INFO -- : [545/885] 3589826=test_reqarg I, [2024-05-03T15:54:05.940801 #3548468] INFO -- : [546/885] 3589834=test_rdoc_include I, [2024-05-03T15:54:05.959529 #3548468] INFO -- : [547/885] 3589821=test_weakmap I, [2024-05-03T15:54:06.014847 #3548468] INFO -- : [548/885] 3589834=test_workspace I, [2024-05-03T15:54:06.049612 #3548468] INFO -- : [549/885] 3589823=test_yjit I, [2024-05-03T15:54:06.055289 #3548468] INFO -- : [550/885] 3589824=test_ws I, [2024-05-03T15:54:06.058985 #3548468] INFO -- : [551/885] 3589823=test_gem_commands_environment_command I, [2024-05-03T15:54:06.075824 #3548468] INFO -- : [552/885] 3589824=test_m17n I, [2024-05-03T15:54:06.126553 #3548468] INFO -- : [553/885] 3589823=test_argf I, [2024-05-03T15:54:06.132139 #3548468] INFO -- : [554/885] 3589838=test_kill_ring I, [2024-05-03T15:54:06.134690 #3548468] INFO -- : [555/885] 3589824=test_framework I, [2024-05-03T15:54:06.177120 #3548468] INFO -- : [556/885] 3589824=test_ns_spki I, [2024-05-03T15:54:06.197198 #3548468] INFO -- : [557/885] 3589824=test_gem_resolver_dependency_request I, [2024-05-03T15:54:06.202386 #3548468] INFO -- : [558/885] 3589838=test_tree_builder I, [2024-05-03T15:54:06.203343 #3548468] INFO -- : [559/885] 3589838=test_hash I, [2024-05-03T15:54:06.218311 #3548468] INFO -- : [560/885] 3589838=test_alias_and_anchor I, [2024-05-03T15:54:06.222182 #3548468] INFO -- : [561/885] 3589824=test_postponed_job I, [2024-05-03T15:54:06.226712 #3548468] INFO -- : [562/885] 3589838=test_external_new I, [2024-05-03T15:54:06.229720 #3548468] INFO -- : [563/885] 3589838=test_gem_request_set_lockfile I, [2024-05-03T15:54:06.300554 #3548468] INFO -- : [564/885] 3589834=test_raise_exception I, [2024-05-03T15:54:06.477891 #3548468] INFO -- : [565/885] 3589826=test_protect I, [2024-05-03T15:54:06.485169 #3548468] INFO -- : [566/885] 3589826=test_win32ole_typelib I, [2024-05-03T15:54:06.488929 #3548468] INFO -- : [567/885] 3589826=test_show_source I, [2024-05-03T15:54:06.500871 #3548468] INFO -- : [568/885] 3589826=test_set I, [2024-05-03T15:54:06.528820 #3548468] INFO -- : [569/885] 3589826=test_c_struct_entry I, [2024-05-03T15:54:06.630718 #3548468] INFO -- : [570/885] 3589838=test_lock_native_thread I, [2024-05-03T15:54:06.647866 #3548468] INFO -- : [571/885] 3589839=test_gem_commands_stale_command I, [2024-05-03T15:54:06.661646 #3548468] INFO -- : [572/885] 3589839=test_have_library I, [2024-05-03T15:54:06.774679 #3548468] INFO -- : [573/885] 3589824=test_remote_fetch_error I, [2024-05-03T15:54:06.778058 #3548468] INFO -- : [574/885] 3589826=ripper_test I, [2024-05-03T15:54:06.802331 #3548468] INFO -- : [575/885] 3589824=test_objspace I, [2024-05-03T15:54:06.806299 #3548468] INFO -- : [576/885] 3589837=test_line_editor E, [2024-05-03T15:54:06.814727 #3548468] ERROR -- : DEPRECATED: ConstantPathTargetNode#child is deprecated and will be removed in the next major version. Use ConstantPathTargetNode#name/ConstantPathTargetNode#name_loc instead. Called from /tmp/ruby/src/trunk/lib/prism/translation/ripper.rb:1491:in 'Prism::Translation::Ripper#visit_constant_path_write_node_target'. E, [2024-05-03T15:54:06.814797 #3548468] ERROR -- : DEPRECATED: ConstantPathTargetNode#child is deprecated and will be removed in the next major version. Use ConstantPathTargetNode#name/ConstantPathTargetNode#name_loc instead. Called from /tmp/ruby/src/trunk/lib/prism/translation/ripper.rb:1492:in 'Prism::Translation::Ripper#visit_constant_path_write_node_target'. E, [2024-05-03T15:54:06.814810 #3548468] ERROR -- : DEPRECATED: ConstantPathTargetNode#child is deprecated and will be removed in the next major version. Use ConstantPathTargetNode#name/ConstantPathTargetNode#name_loc instead. Called from /tmp/ruby/src/trunk/lib/prism/translation/ripper.rb:1499:in 'Prism::Translation::Ripper#visit_constant_path_write_node_target'. E, [2024-05-03T15:54:06.814820 #3548468] ERROR -- : DEPRECATED: ConstantPathTargetNode#child is deprecated and will be removed in the next major version. Use ConstantPathTargetNode#name/ConstantPathTargetNode#name_loc instead. Called from /tmp/ruby/src/trunk/lib/prism/translation/ripper.rb:1500:in 'Prism::Translation::Ripper#visit_constant_path_write_node_target'. E, [2024-05-03T15:54:06.836409 #3548468] ERROR -- : DEPRECATED: ConstantPathNode#child is deprecated and will be removed in the next major version. Use ConstantPathNode#name/ConstantPathNode#name_loc instead. Called from /tmp/ruby/src/trunk/lib/prism/translation/ripper.rb:1499:in 'Prism::Translation::Ripper#visit_constant_path_write_node_target'. E, [2024-05-03T15:54:06.836472 #3548468] ERROR -- : DEPRECATED: ConstantPathNode#child is deprecated and will be removed in the next major version. Use ConstantPathNode#name/ConstantPathNode#name_loc instead. Called from /tmp/ruby/src/trunk/lib/prism/translation/ripper.rb:1500:in 'Prism::Translation::Ripper#visit_constant_path_write_node_target'. E, [2024-05-03T15:54:06.845924 #3548468] ERROR -- : DEPRECATED: ConstantPathNode#child is deprecated and will be removed in the next major version. Use ConstantPathNode#name/ConstantPathNode#name_loc instead. Called from /tmp/ruby/src/trunk/lib/prism/translation/ripper.rb:1499:in 'Prism::Translation::Ripper#visit_constant_path_write_node_target'. E, [2024-05-03T15:54:06.845995 #3548468] ERROR -- : DEPRECATED: ConstantPathNode#child is deprecated and will be removed in the next major version. Use ConstantPathNode#name/ConstantPathNode#name_loc instead. Called from /tmp/ruby/src/trunk/lib/prism/translation/ripper.rb:1500:in 'Prism::Translation::Ripper#visit_constant_path_write_node_target'. E, [2024-05-03T15:54:06.846468 #3548468] ERROR -- : DEPRECATED: ConstantPathNode#child is deprecated and will be removed in the next major version. Use ConstantPathNode#name/ConstantPathNode#name_loc instead. Called from /tmp/ruby/src/trunk/lib/prism/translation/ripper.rb:1491:in 'Prism::Translation::Ripper#visit_constant_path_write_node_target'. E, [2024-05-03T15:54:06.846497 #3548468] ERROR -- : DEPRECATED: ConstantPathNode#child is deprecated and will be removed in the next major version. Use ConstantPathNode#name/ConstantPathNode#name_loc instead. Called from /tmp/ruby/src/trunk/lib/prism/translation/ripper.rb:1492:in 'Prism::Translation::Ripper#visit_constant_path_write_node_target'. E, [2024-05-03T15:54:06.846509 #3548468] ERROR -- : DEPRECATED: ConstantPathNode#child is deprecated and will be removed in the next major version. Use ConstantPathNode#name/ConstantPathNode#name_loc instead. Called from /tmp/ruby/src/trunk/lib/prism/translation/ripper.rb:1499:in 'Prism::Translation::Ripper#visit_constant_path_write_node_target'. E, [2024-05-03T15:54:06.846516 #3548468] ERROR -- : DEPRECATED: ConstantPathNode#child is deprecated and will be removed in the next major version. Use ConstantPathNode#name/ConstantPathNode#name_loc instead. Called from /tmp/ruby/src/trunk/lib/prism/translation/ripper.rb:1500:in 'Prism::Translation::Ripper#visit_constant_path_write_node_target'. E, [2024-05-03T15:54:06.881369 #3548468] ERROR -- : DEPRECATED: ConstantPathNode#child is deprecated and will be removed in the next major version. Use ConstantPathNode#name/ConstantPathNode#name_loc instead. Called from /tmp/ruby/src/trunk/lib/prism/translation/ripper.rb:1491:in 'Prism::Translation::Ripper#visit_constant_path_write_node_target'. E, [2024-05-03T15:54:06.881453 #3548468] ERROR -- : DEPRECATED: ConstantPathNode#child is deprecated and will be removed in the next major version. Use ConstantPathNode#name/ConstantPathNode#name_loc instead. Called from /tmp/ruby/src/trunk/lib/prism/translation/ripper.rb:1492:in 'Prism::Translation::Ripper#visit_constant_path_write_node_target'. E, [2024-05-03T15:54:06.881662 #3548468] ERROR -- : DEPRECATED: ConstantPathNode#child is deprecated and will be removed in the next major version. Use ConstantPathNode#name/ConstantPathNode#name_loc instead. Called from /tmp/ruby/src/trunk/lib/prism/translation/ripper.rb:1499:in 'Prism::Translation::Ripper#visit_constant_path_write_node_target'. E, [2024-05-03T15:54:06.881720 #3548468] ERROR -- : DEPRECATED: ConstantPathNode#child is deprecated and will be removed in the next major version. Use ConstantPathNode#name/ConstantPathNode#name_loc instead. Called from /tmp/ruby/src/trunk/lib/prism/translation/ripper.rb:1500:in 'Prism::Translation::Ripper#visit_constant_path_write_node_target'. I, [2024-05-03T15:54:06.892984 #3548468] INFO -- : [577/885] 3589837=test_undef E, [2024-05-03T15:54:06.901391 #3548468] ERROR -- : DEPRECATED: ConstantPathNode#child is deprecated and will be removed in the next major version. Use ConstantPathNode#name/ConstantPathNode#name_loc instead. Called from /tmp/ruby/src/trunk/lib/prism/translation/ripper.rb:1499:in 'Prism::Translation::Ripper#visit_constant_path_write_node_target'. E, [2024-05-03T15:54:06.901511 #3548468] ERROR -- : DEPRECATED: ConstantPathNode#child is deprecated and will be removed in the next major version. Use ConstantPathNode#name/ConstantPathNode#name_loc instead. Called from /tmp/ruby/src/trunk/lib/prism/translation/ripper.rb:1500:in 'Prism::Translation::Ripper#visit_constant_path_write_node_target'. I, [2024-05-03T15:54:06.901608 #3548468] INFO -- : [578/885] 3589837=test_gem_security_trust_dir I, [2024-05-03T15:54:06.952388 #3548468] INFO -- : [579/885] 3589838=test_string_memory I, [2024-05-03T15:54:06.955827 #3548468] INFO -- : [580/885] 3589837=comments_test I, [2024-05-03T15:54:06.962130 #3548468] INFO -- : [581/885] 3589837=test_gem_requirement I, [2024-05-03T15:54:07.016854 #3548468] INFO -- : [582/885] 3589832=test_sprintf I, [2024-05-03T15:54:07.037637 #3548468] INFO -- : [583/885] 3589838=test_ftp I, [2024-05-03T15:54:07.042400 #3548468] INFO -- : [584/885] 3589838=test_euc_kr I, [2024-05-03T15:54:07.047187 #3548468] INFO -- : [585/885] 3589838=test_rdoc_context_section I, [2024-05-03T15:54:07.055713 #3548468] INFO -- : [586/885] 3589838=test_rdoc_rubygems_hook E, [2024-05-03T15:54:07.071278 #3548468] ERROR -- : DEPRECATED: ConstantPathNode#child is deprecated and will be removed in the next major version. Use ConstantPathNode#name/ConstantPathNode#name_loc instead. Called from /tmp/ruby/src/trunk/lib/prism/translation/ripper.rb:1499:in 'Prism::Translation::Ripper#visit_constant_path_write_node_target'. E, [2024-05-03T15:54:07.071350 #3548468] ERROR -- : DEPRECATED: ConstantPathNode#child is deprecated and will be removed in the next major version. Use ConstantPathNode#name/ConstantPathNode#name_loc instead. Called from /tmp/ruby/src/trunk/lib/prism/translation/ripper.rb:1500:in 'Prism::Translation::Ripper#visit_constant_path_write_node_target'. E, [2024-05-03T15:54:07.071461 #3548468] ERROR -- : DEPRECATED: ConstantPathNode#child is deprecated and will be removed in the next major version. Use ConstantPathNode#name/ConstantPathNode#name_loc instead. Called from /tmp/ruby/src/trunk/lib/prism/translation/ripper.rb:1499:in 'Prism::Translation::Ripper#visit_constant_path_write_node_target'. E, [2024-05-03T15:54:07.071476 #3548468] ERROR -- : DEPRECATED: ConstantPathNode#child is deprecated and will be removed in the next major version. Use ConstantPathNode#name/ConstantPathNode#name_loc instead. Called from /tmp/ruby/src/trunk/lib/prism/translation/ripper.rb:1500:in 'Prism::Translation::Ripper#visit_constant_path_write_node_target'. E, [2024-05-03T15:54:07.073548 #3548468] ERROR -- : DEPRECATED: ConstantPathNode#child is deprecated and will be removed in the next major version. Use ConstantPathNode#name/ConstantPathNode#name_loc instead. Called from /tmp/ruby/src/trunk/lib/prism/translation/ripper.rb:1491:in 'Prism::Translation::Ripper#visit_constant_path_write_node_target'. E, [2024-05-03T15:54:07.073674 #3548468] ERROR -- : DEPRECATED: ConstantPathNode#child is deprecated and will be removed in the next major version. Use ConstantPathNode#name/ConstantPathNode#name_loc instead. Called from /tmp/ruby/src/trunk/lib/prism/translation/ripper.rb:1492:in 'Prism::Translation::Ripper#visit_constant_path_write_node_target'. I, [2024-05-03T15:54:07.077743 #3548468] INFO -- : [587/885] 3589833=test_gem_commands_query_command I, [2024-05-03T15:54:07.091416 #3548468] INFO -- : [588/885] 3589837=test_method E, [2024-05-03T15:54:07.132830 #3548468] ERROR -- : DEPRECATED: ConstantPathTargetNode#child is deprecated and will be removed in the next major version. Use ConstantPathTargetNode#name/ConstantPathTargetNode#name_loc instead. Called from /tmp/ruby/src/trunk/lib/prism/translation/ripper.rb:1499:in 'Prism::Translation::Ripper#visit_constant_path_write_node_target'. E, [2024-05-03T15:54:07.132968 #3548468] ERROR -- : DEPRECATED: ConstantPathTargetNode#child is deprecated and will be removed in the next major version. Use ConstantPathTargetNode#name/ConstantPathTargetNode#name_loc instead. Called from /tmp/ruby/src/trunk/lib/prism/translation/ripper.rb:1500:in 'Prism::Translation::Ripper#visit_constant_path_write_node_target'. I, [2024-05-03T15:54:07.154526 #3548468] INFO -- : [589/885] 3589838=test_gem_impossible_dependencies_error I, [2024-05-03T15:54:07.160390 #3548468] INFO -- : [590/885] 3589838=test_pack I, [2024-05-03T15:54:07.216083 #3548468] INFO -- : [591/885] 3589834=test_array_create I, [2024-05-03T15:54:07.216177 #3548468] INFO -- : [592/885] 3589836=test_to_ruby I, [2024-05-03T15:54:07.225358 #3548468] INFO -- : [593/885] 3589834=test_pattern_key_name_check I, [2024-05-03T15:54:07.227885 #3548468] INFO -- : [594/885] 3589836=test_io E, [2024-05-03T15:54:07.231778 #3548468] ERROR -- : DEPRECATED: ConstantPathNode#child is deprecated and will be removed in the next major version. Use ConstantPathNode#name/ConstantPathNode#name_loc instead. Called from /tmp/ruby/src/trunk/lib/prism/translation/ripper.rb:1491:in 'Prism::Translation::Ripper#visit_constant_path_write_node_target'. E, [2024-05-03T15:54:07.231909 #3548468] ERROR -- : DEPRECATED: ConstantPathNode#child is deprecated and will be removed in the next major version. Use ConstantPathNode#name/ConstantPathNode#name_loc instead. Called from /tmp/ruby/src/trunk/lib/prism/translation/ripper.rb:1492:in 'Prism::Translation::Ripper#visit_constant_path_write_node_target'. E, [2024-05-03T15:54:07.232141 #3548468] ERROR -- : DEPRECATED: ConstantPathNode#child is deprecated and will be removed in the next major version. Use ConstantPathNode#name/ConstantPathNode#name_loc instead. Called from /tmp/ruby/src/trunk/lib/prism/translation/ripper.rb:1499:in 'Prism::Translation::Ripper#visit_constant_path_write_node_target'. E, [2024-05-03T15:54:07.232207 #3548468] ERROR -- : DEPRECATED: ConstantPathNode#child is deprecated and will be removed in the next major version. Use ConstantPathNode#name/ConstantPathNode#name_loc instead. Called from /tmp/ruby/src/trunk/lib/prism/translation/ripper.rb:1500:in 'Prism::Translation::Ripper#visit_constant_path_write_node_target'. I, [2024-05-03T15:54:07.242894 #3548468] INFO -- : [595/885] 3589834=test_sorted_set I, [2024-05-03T15:54:07.252925 #3548468] INFO -- : [596/885] 3589832=test_emoji I, [2024-05-03T15:54:07.288314 #3548468] INFO -- : [597/885] 3589832=test_win32ole_type_event I, [2024-05-03T15:54:07.289880 #3548468] INFO -- : [598/885] 3589832=test_hash I, [2024-05-03T15:54:07.309619 #3548468] INFO -- : [599/885] 3589825=test_ubf_async_safe I, [2024-05-03T15:54:07.317052 #3548468] INFO -- : [600/885] 3589825=test_gem_unsatisfiable_dependency_error I, [2024-05-03T15:54:07.331457 #3548468] INFO -- : [601/885] 3589825=test_win32ole_record I, [2024-05-03T15:54:07.337488 #3548468] INFO -- : [602/885] 3589825=test_cp949 I, [2024-05-03T15:54:07.343910 #3548468] INFO -- : [603/885] 3589825=test_gem_commands_uninstall_command I, [2024-05-03T15:54:07.366955 #3548468] INFO -- : [604/885] 3589838=test_condition I, [2024-05-03T15:54:07.369769 #3548468] INFO -- : [605/885] 3589838=test_foreach I, [2024-05-03T15:54:07.374615 #3548468] INFO -- : [606/885] 3589838=test_gem_source_specific_file E, [2024-05-03T15:54:07.378808 #3548468] ERROR -- : DEPRECATED: ConstantPathNode#child is deprecated and will be removed in the next major version. Use ConstantPathNode#name/ConstantPathNode#name_loc instead. Called from /tmp/ruby/src/trunk/lib/prism/translation/ripper.rb:1499:in 'Prism::Translation::Ripper#visit_constant_path_write_node_target'. E, [2024-05-03T15:54:07.378869 #3548468] ERROR -- : DEPRECATED: ConstantPathNode#child is deprecated and will be removed in the next major version. Use ConstantPathNode#name/ConstantPathNode#name_loc instead. Called from /tmp/ruby/src/trunk/lib/prism/translation/ripper.rb:1500:in 'Prism::Translation::Ripper#visit_constant_path_write_node_target'. E, [2024-05-03T15:54:07.407028 #3548468] ERROR -- : DEPRECATED: ConstantPathNode#child is deprecated and will be removed in the next major version. Use ConstantPathNode#name/ConstantPathNode#name_loc instead. Called from /tmp/ruby/src/trunk/lib/prism/translation/ripper.rb:1499:in 'Prism::Translation::Ripper#visit_constant_path_write_node_target'. E, [2024-05-03T15:54:07.407151 #3548468] ERROR -- : DEPRECATED: ConstantPathNode#child is deprecated and will be removed in the next major version. Use ConstantPathNode#name/ConstantPathNode#name_loc instead. Called from /tmp/ruby/src/trunk/lib/prism/translation/ripper.rb:1500:in 'Prism::Translation::Ripper#visit_constant_path_write_node_target'. I, [2024-05-03T15:54:07.465777 #3548468] INFO -- : [607/885] 3589834=test_console_attr I, [2024-05-03T15:54:07.467365 #3548468] INFO -- : [608/885] 3589834=test_summary E, [2024-05-03T15:54:07.469276 #3548468] ERROR -- : DEPRECATED: ConstantPathNode#child is deprecated and will be removed in the next major version. Use ConstantPathNode#name/ConstantPathNode#name_loc instead. Called from /tmp/ruby/src/trunk/lib/prism/translation/ripper.rb:1499:in 'Prism::Translation::Ripper#visit_constant_path_write_node_target'. E, [2024-05-03T15:54:07.469387 #3548468] ERROR -- : DEPRECATED: ConstantPathNode#child is deprecated and will be removed in the next major version. Use ConstantPathNode#name/ConstantPathNode#name_loc instead. Called from /tmp/ruby/src/trunk/lib/prism/translation/ripper.rb:1500:in 'Prism::Translation::Ripper#visit_constant_path_write_node_target'. E, [2024-05-03T15:54:07.480731 #3548468] ERROR -- : DEPRECATED: ConstantPathTargetNode#child is deprecated and will be removed in the next major version. Use ConstantPathTargetNode#name/ConstantPathTargetNode#name_loc instead. Called from /tmp/ruby/src/trunk/lib/prism/translation/ripper.rb:1491:in 'Prism::Translation::Ripper#visit_constant_path_write_node_target'. E, [2024-05-03T15:54:07.480802 #3548468] ERROR -- : DEPRECATED: ConstantPathTargetNode#child is deprecated and will be removed in the next major version. Use ConstantPathTargetNode#name/ConstantPathTargetNode#name_loc instead. Called from /tmp/ruby/src/trunk/lib/prism/translation/ripper.rb:1492:in 'Prism::Translation::Ripper#visit_constant_path_write_node_target'. E, [2024-05-03T15:54:07.480813 #3548468] ERROR -- : DEPRECATED: ConstantPathTargetNode#child is deprecated and will be removed in the next major version. Use ConstantPathTargetNode#name/ConstantPathTargetNode#name_loc instead. Called from /tmp/ruby/src/trunk/lib/prism/translation/ripper.rb:1491:in 'Prism::Translation::Ripper#visit_constant_path_write_node_target'. E, [2024-05-03T15:54:07.480822 #3548468] ERROR -- : DEPRECATED: ConstantPathTargetNode#child is deprecated and will be removed in the next major version. Use ConstantPathTargetNode#name/ConstantPathTargetNode#name_loc instead. Called from /tmp/ruby/src/trunk/lib/prism/translation/ripper.rb:1492:in 'Prism::Translation::Ripper#visit_constant_path_write_node_target'. E, [2024-05-03T15:54:07.482941 #3548468] ERROR -- : DEPRECATED: ConstantPathNode#child is deprecated and will be removed in the next major version. Use ConstantPathNode#name/ConstantPathNode#name_loc instead. Called from /tmp/ruby/src/trunk/lib/prism/translation/ripper.rb:1491:in 'Prism::Translation::Ripper#visit_constant_path_write_node_target'. E, [2024-05-03T15:54:07.483017 #3548468] ERROR -- : DEPRECATED: ConstantPathNode#child is deprecated and will be removed in the next major version. Use ConstantPathNode#name/ConstantPathNode#name_loc instead. Called from /tmp/ruby/src/trunk/lib/prism/translation/ripper.rb:1492:in 'Prism::Translation::Ripper#visit_constant_path_write_node_target'. E, [2024-05-03T15:54:07.483051 #3548468] ERROR -- : DEPRECATED: ConstantPathNode#child is deprecated and will be removed in the next major version. Use ConstantPathNode#name/ConstantPathNode#name_loc instead. Called from /tmp/ruby/src/trunk/lib/prism/translation/ripper.rb:1499:in 'Prism::Translation::Ripper#visit_constant_path_write_node_target'. E, [2024-05-03T15:54:07.483072 #3548468] ERROR -- : DEPRECATED: ConstantPathNode#child is deprecated and will be removed in the next major version. Use ConstantPathNode#name/ConstantPathNode#name_loc instead. Called from /tmp/ruby/src/trunk/lib/prism/translation/ripper.rb:1500:in 'Prism::Translation::Ripper#visit_constant_path_write_node_target'. E, [2024-05-03T15:54:07.483181 #3548468] ERROR -- : DEPRECATED: ConstantPathNode#child is deprecated and will be removed in the next major version. Use ConstantPathNode#name/ConstantPathNode#name_loc instead. Called from /tmp/ruby/src/trunk/lib/prism/translation/ripper.rb:1491:in 'Prism::Translation::Ripper#visit_constant_path_write_node_target'. E, [2024-05-03T15:54:07.483244 #3548468] ERROR -- : DEPRECATED: ConstantPathNode#child is deprecated and will be removed in the next major version. Use ConstantPathNode#name/ConstantPathNode#name_loc instead. Called from /tmp/ruby/src/trunk/lib/prism/translation/ripper.rb:1492:in 'Prism::Translation::Ripper#visit_constant_path_write_node_target'. E, [2024-05-03T15:54:07.483275 #3548468] ERROR -- : DEPRECATED: ConstantPathNode#child is deprecated and will be removed in the next major version. Use ConstantPathNode#name/ConstantPathNode#name_loc instead. Called from /tmp/ruby/src/trunk/lib/prism/translation/ripper.rb:1499:in 'Prism::Translation::Ripper#visit_constant_path_write_node_target'. E, [2024-05-03T15:54:07.483290 #3548468] ERROR -- : DEPRECATED: ConstantPathNode#child is deprecated and will be removed in the next major version. Use ConstantPathNode#name/ConstantPathNode#name_loc instead. Called from /tmp/ruby/src/trunk/lib/prism/translation/ripper.rb:1500:in 'Prism::Translation::Ripper#visit_constant_path_write_node_target'. E, [2024-05-03T15:54:07.487006 #3548468] ERROR -- : DEPRECATED: ConstantPathNode#child is deprecated and will be removed in the next major version. Use ConstantPathNode#name/ConstantPathNode#name_loc instead. Called from /tmp/ruby/src/trunk/lib/prism/translation/ripper.rb:1499:in 'Prism::Translation::Ripper#visit_constant_path_write_node_target'. E, [2024-05-03T15:54:07.487040 #3548468] ERROR -- : DEPRECATED: ConstantPathNode#child is deprecated and will be removed in the next major version. Use ConstantPathNode#name/ConstantPathNode#name_loc instead. Called from /tmp/ruby/src/trunk/lib/prism/translation/ripper.rb:1500:in 'Prism::Translation::Ripper#visit_constant_path_write_node_target'. E, [2024-05-03T15:54:07.495921 #3548468] ERROR -- : DEPRECATED: ConstantPathNode#child is deprecated and will be removed in the next major version. Use ConstantPathNode#name/ConstantPathNode#name_loc instead. Called from /tmp/ruby/src/trunk/lib/prism/translation/ripper.rb:1491:in 'Prism::Translation::Ripper#visit_constant_path_write_node_target'. E, [2024-05-03T15:54:07.496006 #3548468] ERROR -- : DEPRECATED: ConstantPathNode#child is deprecated and will be removed in the next major version. Use ConstantPathNode#name/ConstantPathNode#name_loc instead. Called from /tmp/ruby/src/trunk/lib/prism/translation/ripper.rb:1492:in 'Prism::Translation::Ripper#visit_constant_path_write_node_target'. I, [2024-05-03T15:54:07.499346 #3548468] INFO -- : [609/885] 3589838=test_type_completor E, [2024-05-03T15:54:07.501235 #3548468] ERROR -- : DEPRECATED: ConstantPathNode#child is deprecated and will be removed in the next major version. Use ConstantPathNode#name/ConstantPathNode#name_loc instead. Called from /tmp/ruby/src/trunk/lib/prism/translation/ripper.rb:1491:in 'Prism::Translation::Ripper#visit_constant_path_write_node_target'. E, [2024-05-03T15:54:07.501310 #3548468] ERROR -- : DEPRECATED: ConstantPathNode#child is deprecated and will be removed in the next major version. Use ConstantPathNode#name/ConstantPathNode#name_loc instead. Called from /tmp/ruby/src/trunk/lib/prism/translation/ripper.rb:1492:in 'Prism::Translation::Ripper#visit_constant_path_write_node_target'. I, [2024-05-03T15:54:07.506840 #3548468] INFO -- : [610/885] 3589838=test_io_wait I, [2024-05-03T15:54:07.522091 #3548468] INFO -- : [611/885] 3589836=test_gem_commands_exec_command I, [2024-05-03T15:54:07.524054 #3548468] INFO -- : [612/885] 3589822=test_kwargs I, [2024-05-03T15:54:07.528353 #3548468] INFO -- : [613/885] 3589822=warnings_test I, [2024-05-03T15:54:07.533369 #3548468] INFO -- : [614/885] 3589826=test_ellipsize I, [2024-05-03T15:54:07.544031 #3548468] INFO -- : [615/885] 3589822=test_date_attr I, [2024-05-03T15:54:07.548477 #3548468] INFO -- : [616/885] 3589826=test_utf16 I, [2024-05-03T15:54:07.549036 #3548468] INFO -- : [617/885] 3589822=test_autoload I, [2024-05-03T15:54:07.552773 #3548468] INFO -- : [618/885] 3589828=test_io I, [2024-05-03T15:54:07.562319 #3548468] INFO -- : [619/885] 3589826=test_unicode_escape I, [2024-05-03T15:54:07.613108 #3548468] INFO -- : [620/885] 3589834=test_sizeof I, [2024-05-03T15:54:07.661582 #3548468] INFO -- : [621/885] 3589826=test_case I, [2024-05-03T15:54:07.700995 #3548468] INFO -- : [622/885] 3589826=test_face I, [2024-05-03T15:54:07.716602 #3548468] INFO -- : [623/885] 3589826=test_rendering I, [2024-05-03T15:54:07.725545 #3548468] INFO -- : [624/885] 3589826=test_yaml_tree I, [2024-05-03T15:54:07.746150 #3548468] INFO -- : [625/885] 3589826=test_libs I, [2024-05-03T15:54:07.764453 #3548468] INFO -- : [626/885] 3589826=test_math I, [2024-05-03T15:54:07.781710 #3548468] INFO -- : [627/885] 3589826=test_gem_commands_fetch_command I, [2024-05-03T15:54:07.856191 #3548468] INFO -- : [628/885] 3589838=test_gc I, [2024-05-03T15:54:07.860060 #3548468] INFO -- : [629/885] 3589838=test_sleep I, [2024-05-03T15:54:07.886607 #3548468] INFO -- : [630/885] 3589833=test_config I, [2024-05-03T15:54:07.946558 #3548468] INFO -- : [631/885] 3589833=test_gem_config_file I, [2024-05-03T15:54:07.954594 #3548468] INFO -- : [632/885] 3589826=test_ripper I, [2024-05-03T15:54:08.121787 #3548468] INFO -- : [633/885] 3589825=test_getopts I, [2024-05-03T15:54:08.130968 #3548468] INFO -- : [634/885] 3589825=test_protocol I, [2024-05-03T15:54:08.145909 #3548468] INFO -- : [635/885] 3589839=test_gem_resolver_activation_request I, [2024-05-03T15:54:08.158486 #3548468] INFO -- : [636/885] 3589833=test_yjit_exit_locations I, [2024-05-03T15:54:08.160715 #3548468] INFO -- : [637/885] 3589839=test_etc I, [2024-05-03T15:54:08.164409 #3548468] INFO -- : [638/885] 3589833=test_system I, [2024-05-03T15:54:08.220739 #3548468] INFO -- : [639/885] 3589835=test_pkcs12 I, [2024-05-03T15:54:08.293965 #3548468] INFO -- : [640/885] 3589839=test_pkey_dh I, [2024-05-03T15:54:08.340052 #3548468] INFO -- : [641/885] 3589826=test_bigzero I, [2024-05-03T15:54:08.353232 #3548468] INFO -- : [642/885] 3589826=test_gem_package_tar_header I, [2024-05-03T15:54:08.392199 #3548468] INFO -- : [643/885] 3589826=test_gem_util I, [2024-05-03T15:54:08.398764 #3548468] INFO -- : [644/885] 3589839=test_iseq_load I, [2024-05-03T15:54:08.448234 #3548468] INFO -- : [645/885] 3589825=test_stringscanner I, [2024-05-03T15:54:08.475003 #3548468] INFO -- : [646/885] 3589825=test_files_sample I, [2024-05-03T15:54:08.513052 #3548468] INFO -- : [647/885] 3589836=test_convertible I, [2024-05-03T15:54:08.564704 #3548468] INFO -- : [648/885] 3589825=parser_test I, [2024-05-03T15:54:08.586898 #3548468] INFO -- : [649/885] 3589825=test_rdoc_alias I, [2024-05-03T15:54:08.621821 #3548468] INFO -- : [650/885] 3589826=test_yield I, [2024-05-03T15:54:08.733381 #3548468] INFO -- : [651/885] 3589835=test_fstring I, [2024-05-03T15:54:08.766145 #3548468] INFO -- : [652/885] 3589829=test_optparse I, [2024-05-03T15:54:08.801571 #3548468] INFO -- : [653/885] 3589825=test_array I, [2024-05-03T15:54:08.830999 #3548468] INFO -- : [654/885] 3589825=test_rat I, [2024-05-03T15:54:08.834487 #3548468] INFO -- : [655/885] 3589829=test_rdoc_markup_raw I, [2024-05-03T15:54:08.840176 #3548468] INFO -- : [656/885] 3589829=test_webauthn_poller I, [2024-05-03T15:54:08.844314 #3548468] INFO -- : [657/885] 3589825=test_rdoc_markup_to_html_crossref I, [2024-05-03T15:54:08.881814 #3548468] INFO -- : [658/885] 3589835=test_gem_resolver_best_set I, [2024-05-03T15:54:08.988176 #3548468] INFO -- : [659/885] 3589829=encoding_test I, [2024-05-03T15:54:09.001083 #3548468] INFO -- : [660/885] 3589835=test_typeddata I, [2024-05-03T15:54:09.229577 #3548468] INFO -- : [661/885] 3589829=locals_test I, [2024-05-03T15:54:09.234579 #3548468] INFO -- : [662/885] 3589825=test_rdoc_require I, [2024-05-03T15:54:09.246597 #3548468] INFO -- : [663/885] 3589825=test_clone I, [2024-05-03T15:54:09.274120 #3548468] INFO -- : [664/885] 3589835=test_gem_commands_install_command I, [2024-05-03T15:54:09.392738 #3548468] INFO -- : [665/885] 3589839=test_readpartial I, [2024-05-03T15:54:09.448081 #3548468] INFO -- : [666/885] 3589833=ruby_parser_test I, [2024-05-03T15:54:09.452857 #3548468] INFO -- : [667/885] 3589833=test_pack I, [2024-05-03T15:54:09.477465 #3548468] INFO -- : [668/885] 3589833=test_backtrace I, [2024-05-03T15:54:09.521284 #3548468] INFO -- : [669/885] 3589827=test_io_buffer I, [2024-05-03T15:54:09.534905 #3548468] INFO -- : [670/885] 3589825=test_gem_resolver_conflict I, [2024-05-03T15:54:09.545551 #3548468] INFO -- : [671/885] 3589825=test_rdoc_task I, [2024-05-03T15:54:09.549453 #3548468] INFO -- : [672/885] 3589825=test_rdoc_markup_indented_paragraph I, [2024-05-03T15:54:09.553782 #3548468] INFO -- : [673/885] 3589825=json_addition_test I, [2024-05-03T15:54:09.573680 #3548468] INFO -- : [674/885] 3589825=test_custom_command I, [2024-05-03T15:54:09.636054 #3548468] INFO -- : [675/885] 3589827=test_gem_dependency_resolution_error I, [2024-05-03T15:54:09.642844 #3548468] INFO -- : [676/885] 3589827=test_qsort I, [2024-05-03T15:54:09.646598 #3548468] INFO -- : [677/885] 3589827=test_rdoc_parser I, [2024-05-03T15:54:09.688940 #3548468] INFO -- : [678/885] 3589825=test_rdoc_stats I, [2024-05-03T15:54:09.734613 #3548468] INFO -- : [679/885] 3589829=test_pattern_matching I, [2024-05-03T15:54:09.741571 #3548468] INFO -- : [680/885] 3589825=test_string I, [2024-05-03T15:54:09.762666 #3548468] INFO -- : [681/885] 3589825=test_rdoc_store I, [2024-05-03T15:54:09.777880 #3548468] INFO -- : [682/885] 3589829=test_gem_request_set_lockfile_parser I, [2024-05-03T15:54:09.802969 #3548468] INFO -- : [683/885] 3589839=test_depth_first I, [2024-05-03T15:54:09.807437 #3548468] INFO -- : [684/885] 3589839=test_x509attr I, [2024-05-03T15:54:09.810865 #3548468] INFO -- : [685/885] 3589839=test_raise I, [2024-05-03T15:54:09.813466 #3548468] INFO -- : [686/885] 3589839=test_gem_validator I, [2024-05-03T15:54:09.835920 #3548468] INFO -- : [687/885] 3589827=test_require_path_check I, [2024-05-03T15:54:09.839804 #3548468] INFO -- : [688/885] 3589839=test_rdoc_markup_parser I, [2024-05-03T15:54:09.875260 #3548468] INFO -- : [689/885] 3589829=test_folderitem2_invokeverb I, [2024-05-03T15:54:09.879189 #3548468] INFO -- : [690/885] 3589829=test_fnmatch I, [2024-05-03T15:54:09.903921 #3548468] INFO -- : [691/885] 3589839=test_files_test_2 I, [2024-05-03T15:54:09.907171 #3548468] INFO -- : [692/885] 3589838=test_cgi_tag_helper I, [2024-05-03T15:54:09.923333 #3548468] INFO -- : [693/885] 3589829=test_zlib I, [2024-05-03T15:54:09.938601 #3548468] INFO -- : [694/885] 3589838=test_egrep_cpp I, [2024-05-03T15:54:09.939179 #3548468] INFO -- : [695/885] 3589827=test_erb_m17n I, [2024-05-03T15:54:09.949975 #3548468] INFO -- : [696/885] 3589827=test_ole_methods I, [2024-05-03T15:54:09.954354 #3548468] INFO -- : [697/885] 3589827=test_date_conv I, [2024-05-03T15:54:09.963651 #3548468] INFO -- : [698/885] 3589827=test_optimization I, [2024-05-03T15:54:10.161321 #3548468] INFO -- : [699/885] 3589838=test_gc_compact I, [2024-05-03T15:54:10.617587 #3548468] INFO -- : [700/885] 3589830=test_string I, [2024-05-03T15:54:10.808644 #3548468] INFO -- : [701/885] 3589825=test_proc I, [2024-05-03T15:54:10.825448 #3548468] INFO -- : [702/885] 3589833=test_gem_resolver_index_set I, [2024-05-03T15:54:10.861547 #3548468] INFO -- : [703/885] 3589833=test_gem_package_old I, [2024-05-03T15:54:10.916305 #3548468] INFO -- : [704/885] 3589833=test_time I, [2024-05-03T15:54:11.141497 #3548468] INFO -- : [705/885] 3589833=test_windows_1251 I, [2024-05-03T15:54:11.154706 #3548468] INFO -- : [706/885] 3589833=test_rdoc_rdoc I, [2024-05-03T15:54:11.158260 #3548468] INFO -- : [707/885] 3589835=test_gem_uninstaller I, [2024-05-03T15:54:11.168653 #3548468] INFO -- : [708/885] 3589823=test_svcb_https I, [2024-05-03T15:54:11.192019 #3548468] INFO -- : [709/885] 3589823=test_buffering I, [2024-05-03T15:54:11.198697 #3548468] INFO -- : [710/885] 3589823=test_gb18030 I, [2024-05-03T15:54:11.202424 #3548468] INFO -- : [711/885] 3589823=test_io_buffer I, [2024-05-03T15:54:11.260108 #3548468] INFO -- : [712/885] 3589823=test_backtrace I, [2024-05-03T15:54:11.267092 #3548468] INFO -- : [713/885] 3589823=test_defined I, [2024-05-03T15:54:11.308008 #3548468] INFO -- : [714/885] 3589833=test_key_name_check I, [2024-05-03T15:54:11.330069 #3548468] INFO -- : [715/885] 3589833=test_rdoc_i18n_text I, [2024-05-03T15:54:11.368274 #3548468] INFO -- : [716/885] 3589833=test_date_parse I, [2024-05-03T15:54:11.378570 #3548468] INFO -- : [717/885] 3589823=test_thread I, [2024-05-03T15:54:11.378647 #3548468] INFO -- : [718/885] 3589823=test_trick I, [2024-05-03T15:54:11.518988 #3548468] INFO -- : [719/885] 3589833=test_pipe I, [2024-05-03T15:54:11.714991 #3548468] INFO -- : [720/885] 3589833=test_pkey_ec I, [2024-05-03T15:54:11.831601 #3548468] INFO -- : [721/885] 3589833=test_win32ole_type I, [2024-05-03T15:54:11.831673 #3548468] INFO -- : [722/885] 3589833=test_null I, [2024-05-03T15:54:11.841812 #3548468] INFO -- : [723/885] 3589833=test_mul I, [2024-05-03T15:54:11.857787 #3548468] INFO -- : [724/885] 3589832=test_rdoc_rd_inline_parser I, [2024-05-03T15:54:11.860158 #3548468] INFO -- : [725/885] 3589833=test_rdoc_markup_to_rdoc I, [2024-05-03T15:54:11.895134 #3548468] INFO -- : [726/885] 3589834=test_default_gems I, [2024-05-03T15:54:11.917810 #3548468] INFO -- : [727/885] 3589832=test_rdoc_markup_attributes I, [2024-05-03T15:54:11.924354 #3548468] INFO -- : [728/885] 3589832=test_object_create_start I, [2024-05-03T15:54:11.927631 #3548468] INFO -- : [729/885] 3589832=test_command I, [2024-05-03T15:54:11.945512 #3548468] INFO -- : [730/885] 3589833=test_at_exit I, [2024-05-03T15:54:11.954533 #3548468] INFO -- : [731/885] 3589825=test_gem_ext_cargo_builder_unit I, [2024-05-03T15:54:11.967806 #3548468] INFO -- : [732/885] 3589833=test_date I, [2024-05-03T15:54:11.974084 #3548468] INFO -- : [733/885] 3589833=test_gem_rdoc I, [2024-05-03T15:54:11.977009 #3548468] INFO -- : [734/885] 3589825=test_enc_raise I, [2024-05-03T15:54:11.986443 #3548468] INFO -- : [735/885] 3589825=test_psych I, [2024-05-03T15:54:12.013167 #3548468] INFO -- : [736/885] 3589834=!Nothing_to_test I, [2024-05-03T15:54:12.014800 #3548468] INFO -- : [737/885] 3589834=test_rdoc_markup_paragraph I, [2024-05-03T15:54:12.026620 #3548468] INFO -- : [738/885] 3589825=test_gem_doctor I, [2024-05-03T15:54:12.041303 #3548468] INFO -- : [739/885] 3589834=test_kdf I, [2024-05-03T15:54:12.084268 #3548468] INFO -- : [740/885] 3589825=test_kernel I, [2024-05-03T15:54:12.098169 #3548468] INFO -- : [741/885] 3589837=test_eval_history I, [2024-05-03T15:54:12.103187 #3548468] INFO -- : [742/885] 3589833=dispatcher_test I, [2024-05-03T15:54:12.119761 #3548468] INFO -- : [743/885] 3589833=test_files_ext I, [2024-05-03T15:54:12.125388 #3548468] INFO -- : [744/885] 3589834=test_bug-5832 I, [2024-05-03T15:54:12.130645 #3548468] INFO -- : [745/885] 3589834=test_emitter I, [2024-05-03T15:54:12.142480 #3548468] INFO -- : [746/885] 3589834=test_gem_silent_ui I, [2024-05-03T15:54:12.158354 #3548468] INFO -- : [747/885] 3589837=test_verbose I, [2024-05-03T15:54:12.172208 #3548468] INFO -- : [748/885] 3589837=test_num2int I, [2024-05-03T15:54:12.181716 #3548468] INFO -- : [749/885] 3589837=test_nil I, [2024-05-03T15:54:12.184093 #3548468] INFO -- : [750/885] 3589834=test_rdoc_single_class I, [2024-05-03T15:54:12.185872 #3548468] INFO -- : [751/885] 3589837=test_macro I, [2024-05-03T15:54:12.189634 #3548468] INFO -- : [752/885] 3589834=test_gem_ext_configure_builder I, [2024-05-03T15:54:12.189892 #3548468] INFO -- : [753/885] 3589837=test_frozen I, [2024-05-03T15:54:12.209467 #3548468] INFO -- : [754/885] 3589837=test_pp I, [2024-05-03T15:54:12.229847 #3548468] INFO -- : [755/885] 3589832=test_zsh_completion I, [2024-05-03T15:54:12.233599 #3548468] INFO -- : [756/885] 3589832=test_exception I, [2024-05-03T15:54:12.235766 #3548468] INFO -- : [757/885] 3589834=test_iter_break I, [2024-05-03T15:54:12.242663 #3548468] INFO -- : [758/885] 3589834=test_rdoc_token_stream I, [2024-05-03T15:54:12.244935 #3548468] INFO -- : [759/885] 3589832=test_address_resolve I, [2024-05-03T15:54:12.246216 #3548468] INFO -- : [760/885] 3589834=test_config I, [2024-05-03T15:54:12.254548 #3548468] INFO -- : [761/885] 3589837=test_gem_source_list I, [2024-05-03T15:54:12.264625 #3548468] INFO -- : [762/885] 3589832=test_yaml_special_cases I, [2024-05-03T15:54:12.269615 #3548468] INFO -- : [763/885] 3589832=test_optarg I, [2024-05-03T15:54:12.276314 #3548468] INFO -- : [764/885] 3589833=test_numeric I, [2024-05-03T15:54:12.280394 #3548468] INFO -- : [765/885] 3589834=test_ifunless I, [2024-05-03T15:54:12.283510 #3548468] INFO -- : [766/885] 3589834=test_assignment I, [2024-05-03T15:54:12.318970 #3548468] INFO -- : [767/885] 3589837=test_gem_commands_lock_command I, [2024-05-03T15:54:12.343807 #3548468] INFO -- : [768/885] 3589837=test_gem_command I, [2024-05-03T15:54:12.371345 #3548468] INFO -- : [769/885] 3589833=test_bug-3571 I, [2024-05-03T15:54:12.401089 #3548468] INFO -- : [770/885] 3589835=test_key_actor_vi I, [2024-05-03T15:54:12.418900 #3548468] INFO -- : [771/885] 3589833=test_common I, [2024-05-03T15:54:12.433713 #3548468] INFO -- : [772/885] 3589832=test_gem_spec_fetcher I, [2024-05-03T15:54:12.443213 #3548468] INFO -- : [773/885] 3589837=test_hmac I, [2024-05-03T15:54:12.457316 #3548468] INFO -- : [774/885] 3589837=test_rdoc_markup_to_tt_only I, [2024-05-03T15:54:12.493555 #3548468] INFO -- : [775/885] 3589837=test_rdoc_tom_doc I, [2024-05-03T15:54:12.508473 #3548468] INFO -- : [776/885] 3589837=test_arity I, [2024-05-03T15:54:12.515289 #3548468] INFO -- : [777/885] 3589835=test_gem_ext_rake_builder I, [2024-05-03T15:54:12.534735 #3548468] INFO -- : [778/885] 3589837=test_logdevice I, [2024-05-03T15:54:12.633003 #3548468] INFO -- : [779/885] 3589832=test_err_in_callback I, [2024-05-03T15:54:12.649961 #3548468] INFO -- : [780/885] 3589832=test_gem_resolver_lock_specification I, [2024-05-03T15:54:12.684491 #3548468] INFO -- : [781/885] 3589832=test_gc I, [2024-05-03T15:54:12.744709 #3548468] INFO -- : [782/885] 3589833=test_x509cert I, [2024-05-03T15:54:12.895084 #3548468] INFO -- : [783/885] 3589822=test_last_thread I, [2024-05-03T15:54:12.911254 #3548468] INFO -- : [784/885] 3589825=test_process I, [2024-05-03T15:54:13.128028 #3548468] INFO -- : [785/885] 3589833=test_pack I, [2024-05-03T15:54:13.188489 #3548468] INFO -- : [786/885] 3589838=test_gem_security_policy I, [2024-05-03T15:54:13.377160 #3548468] INFO -- : [787/885] 3589833=test_gem_source_local I, [2024-05-03T15:54:13.471359 #3548468] INFO -- : [788/885] 3589835=test_uncorrectable_name_check I, [2024-05-03T15:54:13.479382 #3548468] INFO -- : [789/885] 3589835=newline_test I, [2024-05-03T15:54:13.568671 #3548468] INFO -- : [790/885] 3589835=test_hash_create I, [2024-05-03T15:54:13.570415 #3548468] INFO -- : [791/885] 3589838=test_stringchar I, [2024-05-03T15:54:13.572712 #3548468] INFO -- : [792/885] 3589835=test_passing_block I, [2024-05-03T15:54:13.580180 #3548468] INFO -- : [793/885] 3589835=test_thread_fd_close I, [2024-05-03T15:54:13.593390 #3548468] INFO -- : [794/885] 3589826=test_securerandom I, [2024-05-03T15:54:13.596358 #3548468] INFO -- : [795/885] 3589835=test_rdoc_markdown_test I, [2024-05-03T15:54:13.631999 #3548468] INFO -- : [796/885] 3589833=test_rdoc_normal_module I, [2024-05-03T15:54:13.642493 #3548468] INFO -- : [797/885] 3589826=test_c_union_entity I, [2024-05-03T15:54:13.655015 #3548468] INFO -- : [798/885] 3589838=test_logperiod I, [2024-05-03T15:54:13.661301 #3548468] INFO -- : [799/885] 3589838=test_singleton I, [2024-05-03T15:54:13.671482 #3548468] INFO -- : [800/885] 3589838=test_flush I, [2024-05-03T15:54:13.673058 #3548468] INFO -- : [801/885] 3589838=test_io_console I, [2024-05-03T15:54:13.694825 #3548468] INFO -- : [802/885] 3589833=test_switch_hitter I, [2024-05-03T15:54:13.705522 #3548468] INFO -- : [803/885] 3589826=test_iso_8859 I, [2024-05-03T15:54:13.726213 #3548468] INFO -- : [804/885] 3589826=test_tcp I, [2024-05-03T15:54:13.731553 #3548468] INFO -- : [805/885] 3589833=test_rdoc_text I, [2024-05-03T15:54:13.736803 #3548468] INFO -- : [806/885] 3589837=test_gem_safe_yaml I, [2024-05-03T15:54:13.750713 #3548468] INFO -- : [807/885] 3589837=test_syntax I, [2024-05-03T15:54:13.761872 #3548468] INFO -- : [808/885] 3589833=index_write_test I, [2024-05-03T15:54:13.762314 #3548468] INFO -- : [809/885] 3589833=test_date_new I, [2024-05-03T15:54:13.772523 #3548468] INFO -- : [810/885] 3589833=test_data I, [2024-05-03T15:54:13.782938 #3548468] INFO -- : [811/885] 3589833=test_require I, [2024-05-03T15:54:13.788780 #3548468] INFO -- : [812/885] 3589833=test_rdoc_markup_to_joined_paragraph I, [2024-05-03T15:54:13.790165 #3548468] INFO -- : [813/885] 3589833=test_date_time I, [2024-05-03T15:54:13.800249 #3548468] INFO -- : [814/885] 3589829=test_open-uri I, [2024-05-03T15:54:13.809040 #3548468] INFO -- : [815/885] 3589833=test_httpresponse I, [2024-05-03T15:54:13.841555 #3548468] INFO -- : [816/885] 3589833=test_rdoc_parser_ruby I, [2024-05-03T15:54:13.873084 #3548468] INFO -- : [817/885] 3589826=test_rdoc_context I, [2024-05-03T15:54:13.887219 #3548468] INFO -- : [818/885] 3589834=test_stream I, [2024-05-03T15:54:13.897261 #3548468] INFO -- : [819/885] 3589834=test_nil2vtempty I, [2024-05-03T15:54:13.900109 #3548468] INFO -- : [820/885] 3589834=test_gem_commands_dependency_command I, [2024-05-03T15:54:14.000720 #3548468] INFO -- : [821/885] 3589834=test_safe_load I, [2024-05-03T15:54:14.014025 #3548468] INFO -- : [822/885] 3589834=test_gem_resolver_composed_set I, [2024-05-03T15:54:14.037651 #3548468] INFO -- : [823/885] 3589834=test_gem_resolver I, [2024-05-03T15:54:14.041964 #3548468] INFO -- : [824/885] 3589822=test_name_error I, [2024-05-03T15:54:14.148782 #3548468] INFO -- : [825/885] 3589822=test_rdoc_markup_attribute_manager I, [2024-05-03T15:54:14.179976 #3548468] INFO -- : [826/885] 3589822=test_gem_commands_which_command I, [2024-05-03T15:54:14.240073 #3548468] INFO -- : [827/885] 3589822=test_shift_jis I, [2024-05-03T15:54:14.247870 #3548468] INFO -- : [828/885] 3589822=test_http I, [2024-05-03T15:54:14.251987 #3548468] INFO -- : [829/885] 3589822=test_enumerator I, [2024-05-03T15:54:14.410329 #3548468] INFO -- : [830/885] 3589829=test_flags I, [2024-05-03T15:54:14.451294 #3548468] INFO -- : [831/885] 3589834=test_inadvertent_creation I, [2024-05-03T15:54:14.636349 #3548468] INFO -- : [832/885] 3589834=test_gem_commands_specification_command I, [2024-05-03T15:54:14.663782 #3548468] INFO -- : [833/885] 3589833=test_generic I, [2024-05-03T15:54:14.746329 #3548468] INFO -- : [834/885] 3589833=test_win32ole I, [2024-05-03T15:54:14.758786 #3548468] INFO -- : [835/885] 3589833=test_scan_args I, [2024-05-03T15:54:14.775434 #3548468] INFO -- : [836/885] 3589833=test_enumerator_kw I, [2024-05-03T15:54:14.784552 #3548468] INFO -- : [837/885] 3589833=test_settracefunc I, [2024-05-03T15:54:14.808533 #3548468] INFO -- : [838/885] 3589834=test_gem_text I, [2024-05-03T15:54:14.855939 #3548468] INFO -- : [839/885] 3589836=test_gem_commands_mirror I, [2024-05-03T15:54:14.862512 #3548468] INFO -- : [840/885] 3589836=test_gem_ext_cargo_builder_link_flag_converter I, [2024-05-03T15:54:14.879950 #3548468] INFO -- : [841/885] 3589834=test_method_cache I, [2024-05-03T15:54:14.884313 #3548468] INFO -- : [842/885] 3589834=test_gem_request I, [2024-05-03T15:54:14.935278 #3548468] INFO -- : [843/885] 3589821=test_sprintf_comb I, [2024-05-03T15:54:14.936888 #3548468] INFO -- : [844/885] 3589835=test_exception I, [2024-05-03T15:54:14.955207 #3548468] INFO -- : [845/885] 3589836=test_bug_reporter I, [2024-05-03T15:54:15.065685 #3548468] INFO -- : [846/885] 3589834=test_rand I, [2024-05-03T15:54:15.129731 #3548468] INFO -- : [847/885] 3589821=test_gem_package_tar_reader_entry I, [2024-05-03T15:54:15.133869 #3548468] INFO -- : [848/885] 3589823=test_gem_name_tuple I, [2024-05-03T15:54:15.151777 #3548468] INFO -- : [849/885] 3589823=test_rdoc_cross_reference I, [2024-05-03T15:54:15.154451 #3548468] INFO -- : [850/885] 3589839=test_scalar I, [2024-05-03T15:54:15.195039 #3548468] INFO -- : [851/885] 3589839=test_gem_dependency_installer I, [2024-05-03T15:54:15.223050 #3548468] INFO -- : [852/885] 3589826=test_gem_commands_info_command I, [2024-05-03T15:54:15.247449 #3548468] INFO -- : [853/885] 3589826=test_case_options I, [2024-05-03T15:54:15.249335 #3548468] INFO -- : [854/885] 3589826=test_store I, [2024-05-03T15:54:15.431742 #3548468] INFO -- : [855/885] 3589821=test_literal I, [2024-05-03T15:54:15.444389 #3548468] INFO -- : [856/885] 3589836=test_str2big I, [2024-05-03T15:54:15.445913 #3548468] INFO -- : [857/885] 3589834=test_dot_dot I, [2024-05-03T15:54:15.449654 #3548468] INFO -- : [858/885] 3589834=test_c_struct_builder I, [2024-05-03T15:54:15.453856 #3548468] INFO -- : [859/885] 3589836=test_rdoc_markup_to_table_of_contents I, [2024-05-03T15:54:15.478394 #3548468] INFO -- : [860/885] 3589836=test_thread I, [2024-05-03T15:54:15.577756 #3548468] INFO -- : [861/885] 3589826=test_socket I, [2024-05-03T15:54:15.658059 #3548468] INFO -- : [862/885] 3589834=test_objectspace I, [2024-05-03T15:54:15.695200 #3548468] INFO -- : [863/885] 3589823=test_ractor I, [2024-05-03T15:54:15.705927 #3548468] INFO -- : [864/885] 3589836=test_severity I, [2024-05-03T15:54:15.710055 #3548468] INFO -- : [865/885] 3589836=test_require_lib I, [2024-05-03T15:54:15.721121 #3548468] INFO -- : [866/885] 3589823=test_gem_install_update_options I, [2024-05-03T15:54:15.825743 #3548468] INFO -- : [867/885] 3589829=parse_test I, [2024-05-03T15:54:15.877348 #3548468] INFO -- : [868/885] 3589823=test_gem_stream_ui I, [2024-05-03T15:54:15.995210 #3548468] INFO -- : [869/885] 3589823=test_extlibs I, [2024-05-03T15:54:16.108267 #3548468] INFO -- : [870/885] 3589821=test_rdoc_generator_ri I, [2024-05-03T15:54:16.120473 #3548468] INFO -- : [871/885] 3589821=test_memory_view I, [2024-05-03T15:54:16.156490 #3548468] INFO -- : .Leaked thread: TestSocket#test_accept_loop: # I, [2024-05-03T15:54:16.258481 #3548468] INFO -- : [872/885] 3589828=test_m17n_comb I, [2024-05-03T15:54:16.264049 #3548468] INFO -- : .Finished thread: TestSocket#test_tcp_socket_v6_address_passed: # I, [2024-05-03T15:54:16.330319 #3548468] INFO -- : [873/885] 3589833=test_ractor I, [2024-05-03T15:54:16.369074 #3548468] INFO -- : [874/885] 3589838=test_rdoc_generator_pot_po I, [2024-05-03T15:54:16.372232 #3548468] INFO -- : [875/885] 3589838=test_ansi_with_terminfo I, [2024-05-03T15:54:16.376616 #3548468] INFO -- : [876/885] 3589838=test_json_tree I, [2024-05-03T15:54:16.384890 #3548468] INFO -- : [877/885] 3589838=test_rdoc_markup_to_markdown I, [2024-05-03T15:54:16.430506 #3548468] INFO -- : [878/885] 3589838=test_case I, [2024-05-03T15:54:16.432996 #3548468] INFO -- : [879/885] 3589838=test_pkey I, [2024-05-03T15:54:16.440765 #3548468] INFO -- : [880/885] 3589833=test_parser_events I, [2024-05-03T15:54:16.445240 #3548468] INFO -- : [881/885] 3589821=test_reline I, [2024-05-03T15:54:16.507098 #3548468] INFO -- : [882/885] 3589838=test_cclass I, [2024-05-03T15:54:16.552594 #3548468] INFO -- : [883/885] 3589833=test_gem_request_connection_pools I, [2024-05-03T15:54:16.603776 #3548468] INFO -- : .Leaked thread: TestSocket#test_accept_loop_multi_port: # I, [2024-05-03T15:54:16.604102 #3548468] INFO -- : .Finished thread: TestSocket#test_resolurion_error_error_code: # I, [2024-05-03T15:54:16.635300 #3548468] INFO -- : [884/885] 3589821=test_gem_version_option I, [2024-05-03T15:54:16.666967 #3548468] INFO -- : [885/885] 3589838=test_grapheme_breaks I, [2024-05-03T15:54:31.595028 #3548468] INFO -- : Finished tests in 37.939647s, 695.3939 tests/s, 246453.0052 assertions/s. E, [2024-05-03T15:54:31.595174 #3548468] ERROR -- : Children under /tmp/rubytest.kz0vck: E, [2024-05-03T15:54:31.595207 #3548468] ERROR -- : * drwx------ 4 80 2024-05-03 15:54:00 +0000 gem_rebuild20240503-3589836-7hnnvu/ E, [2024-05-03T15:54:31.595234 #3548468] ERROR -- : * drwxrwxr-x 2 60 2024-05-03 15:54:00 +0000 new/ E, [2024-05-03T15:54:31.595246 #3548468] ERROR -- : * -rw-rw-r-- 1 4096 2024-05-03 15:54:00 +0000 rebuild_test_gem-1.0.0.gem E, [2024-05-03T15:54:31.595259 #3548468] ERROR -- : * drwxrwxr-x 2 60 2024-05-03 15:54:00 +0000 old/ E, [2024-05-03T15:54:31.595270 #3548468] ERROR -- : * -rw-rw-r-- 1 4096 2024-05-03 15:54:00 +0000 rebuild_test_gem-1.0.0.gem I, [2024-05-03T15:54:31.596493 #3548468] INFO -- : 26383 tests, 9350340 assertions, 0 failures, 0 errors, 302 skips I, [2024-05-03T15:54:31.596546 #3548468] INFO -- : I, [2024-05-03T15:54:31.596555 #3548468] INFO -- : ruby -v: ruby 3.4.0dev (2024-05-03T15:12:55Z master 281df1e495) [x86_64-linux] I, [2024-05-03T15:54:31.598509 #3548468] INFO -- : $$$[end] "make yes-test-all TESTOPTS='--stderr-on-failure' TESTS='-j20'" exit with 0. I, [2024-05-03T15:54:31.598666 #3548468] INFO -- : $$$[beg] make yes-test-rubyspec MSPECOPT='--error-output stderr --debug -j' TESTS='-j20' I, [2024-05-03T15:54:31.686541 #3548468] INFO -- : BASERUBY = /usr/bin/ruby --disable=gems I, [2024-05-03T15:54:31.686589 #3548468] INFO -- : CC = gcc I, [2024-05-03T15:54:31.686602 #3548468] INFO -- : LD = ld I, [2024-05-03T15:54:31.686614 #3548468] INFO -- : LDSHARED = gcc -shared I, [2024-05-03T15:54:31.686625 #3548468] INFO -- : CFLAGS = -O3 -fno-fast-math -ggdb3 -Wall -Wextra -Wdeprecated-declarations -Wdiv-by-zero -Wduplicated-cond -Wimplicit-function-declaration -Wimplicit-int -Wpointer-arith -Wwrite-strings -Wold-style-definition -Wimplicit-fallthrough=0 -Wmissing-noreturn -Wno-cast-function-type -Wno-constant-logical-operand -Wno-long-long -Wno-missing-field-initializers -Wno-overlength-strings -Wno-packed-bitfield-compat -Wno-parentheses-equality -Wno-self-assign -Wno-tautological-compare -Wno-unused-parameter -Wno-unused-value -Wsuggest-attribute=format -Wsuggest-attribute=noreturn -Wunused-variable -Wmisleading-indentation -Wundef -fPIC I, [2024-05-03T15:54:31.686643 #3548468] INFO -- : XCFLAGS = -U_FORTIFY_SOURCE -D_FORTIFY_SOURCE=2 -fstack-protector-strong -fno-strict-overflow -fvisibility=hidden -fexcess-precision=standard -DRUBY_EXPORT -I. -I.ext/include/x86_64-linux -I/tmp/ruby/src/trunk/include -I/tmp/ruby/src/trunk -I/tmp/ruby/src/trunk/prism -I/tmp/ruby/src/trunk/enc/unicode/15.0.0 I, [2024-05-03T15:54:31.686654 #3548468] INFO -- : CPPFLAGS = I, [2024-05-03T15:54:31.686664 #3548468] INFO -- : DLDFLAGS = -Wl,--compress-debug-sections=zlib -Wl,-soname,libruby.so.3.4 -fstack-protector-strong I, [2024-05-03T15:54:31.686674 #3548468] INFO -- : SOLIBS = -lz -lrt -lrt -lgmp -ldl -lcrypt -lm -lpthread I, [2024-05-03T15:54:31.686684 #3548468] INFO -- : LANG = en_US.UTF-8 I, [2024-05-03T15:54:31.686693 #3548468] INFO -- : LC_ALL = I, [2024-05-03T15:54:31.686703 #3548468] INFO -- : LC_CTYPE = I, [2024-05-03T15:54:31.686712 #3548468] INFO -- : MFLAGS = I, [2024-05-03T15:54:31.686722 #3548468] INFO -- : RUSTC = no I, [2024-05-03T15:54:31.686732 #3548468] INFO -- : YJIT_RUSTC_ARGS = --crate-name=yjit --crate-type=staticlib --edition=2021 -g -C lto=thin -C opt-level=3 -C overflow-checks=on '--out-dir=/tmp/ruby/build/trunk/yjit/target/release/' /tmp/ruby/src/trunk/yjit/src/lib.rs I, [2024-05-03T15:54:31.687212 #3548468] INFO -- : gcc (Ubuntu 11.4.0-1ubuntu1~22.04) 11.4.0 I, [2024-05-03T15:54:31.687261 #3548468] INFO -- : Copyright (C) 2021 Free Software Foundation, Inc. I, [2024-05-03T15:54:31.687274 #3548468] INFO -- : This is free software; see the source for copying conditions. There is NO I, [2024-05-03T15:54:31.687285 #3548468] INFO -- : warranty; not even for MERCHANTABILITY or FITNESS FOR A PARTICULAR PURPOSE. I, [2024-05-03T15:54:31.687295 #3548468] INFO -- : I, [2024-05-03T15:54:31.688917 #3548468] INFO -- : generating enc.mk I, [2024-05-03T15:54:31.806660 #3548468] INFO -- : making enc I, [2024-05-03T15:54:31.823878 #3548468] INFO -- : make[1]: Entering directory '/tmp/ruby/build/trunk' I, [2024-05-03T15:54:31.823933 #3548468] INFO -- : make[1]: Nothing to be done for 'enc'. I, [2024-05-03T15:54:31.823957 #3548468] INFO -- : make[1]: Leaving directory '/tmp/ruby/build/trunk' I, [2024-05-03T15:54:31.824496 #3548468] INFO -- : making srcs under enc I, [2024-05-03T15:54:31.853768 #3548468] INFO -- : make[1]: Entering directory '/tmp/ruby/build/trunk' I, [2024-05-03T15:54:31.853832 #3548468] INFO -- : make[1]: Nothing to be done for 'srcs'. I, [2024-05-03T15:54:31.853846 #3548468] INFO -- : make[1]: Leaving directory '/tmp/ruby/build/trunk' I, [2024-05-03T15:54:31.854623 #3548468] INFO -- : generating transdb.h I, [2024-05-03T15:54:31.949076 #3548468] INFO -- : transdb.h unchanged I, [2024-05-03T15:54:31.950371 #3548468] INFO -- : making trans I, [2024-05-03T15:54:31.984793 #3548468] INFO -- : make[1]: Entering directory '/tmp/ruby/build/trunk' I, [2024-05-03T15:54:31.984858 #3548468] INFO -- : make[1]: Nothing to be done for 'trans'. I, [2024-05-03T15:54:31.984872 #3548468] INFO -- : make[1]: Leaving directory '/tmp/ruby/build/trunk' I, [2024-05-03T15:54:31.985496 #3548468] INFO -- : making encs I, [2024-05-03T15:54:32.023815 #3548468] INFO -- : make[1]: Entering directory '/tmp/ruby/build/trunk' I, [2024-05-03T15:54:32.023878 #3548468] INFO -- : make[1]: Nothing to be done for 'encs'. I, [2024-05-03T15:54:32.023892 #3548468] INFO -- : make[1]: Leaving directory '/tmp/ruby/build/trunk' I, [2024-05-03T15:54:32.025792 #3548468] INFO -- : generating makefiles ext/configure-ext.mk I, [2024-05-03T15:54:32.052901 #3548468] INFO -- : ext/configure-ext.mk updated I, [2024-05-03T15:54:32.055295 #3548468] INFO -- : make[1]: Entering directory '/tmp/ruby/build/trunk' I, [2024-05-03T15:54:33.417547 #3548468] INFO -- : make[1]: Leaving directory '/tmp/ruby/build/trunk' I, [2024-05-03T15:54:33.418232 #3548468] INFO -- : generating makefile exts.mk I, [2024-05-03T15:54:33.455169 #3548468] INFO -- : exts.mk unchanged I, [2024-05-03T15:54:33.459701 #3548468] INFO -- : make[1]: Entering directory '/tmp/ruby/build/trunk' I, [2024-05-03T15:54:33.671916 #3548468] INFO -- : make[2]: Entering directory '/tmp/ruby/build/trunk/ext/coverage' I, [2024-05-03T15:54:33.674844 #3548468] INFO -- : make[2]: Leaving directory '/tmp/ruby/build/trunk/ext/coverage' I, [2024-05-03T15:54:33.678724 #3548468] INFO -- : make[2]: Entering directory '/tmp/ruby/build/trunk/ext/date' I, [2024-05-03T15:54:33.681858 #3548468] INFO -- : make[2]: Leaving directory '/tmp/ruby/build/trunk/ext/date' I, [2024-05-03T15:54:33.684223 #3548468] INFO -- : make[2]: Entering directory '/tmp/ruby/build/trunk/ext/digest' I, [2024-05-03T15:54:33.689634 #3548468] INFO -- : make[2]: Leaving directory '/tmp/ruby/build/trunk/ext/digest' I, [2024-05-03T15:54:33.705539 #3548468] INFO -- : make[2]: Entering directory '/tmp/ruby/build/trunk/ext/digest/sha2' I, [2024-05-03T15:54:33.708458 #3548468] INFO -- : make[2]: Leaving directory '/tmp/ruby/build/trunk/ext/digest/sha2' I, [2024-05-03T15:54:33.721356 #3548468] INFO -- : make[2]: Entering directory '/tmp/ruby/build/trunk/ext/fiddle' I, [2024-05-03T15:54:33.727813 #3548468] INFO -- : make[2]: Leaving directory '/tmp/ruby/build/trunk/ext/fiddle' I, [2024-05-03T15:54:33.730837 #3548468] INFO -- : make[2]: Entering directory '/tmp/ruby/build/trunk/ext/io/console' I, [2024-05-03T15:54:33.733444 #3548468] INFO -- : make[2]: Leaving directory '/tmp/ruby/build/trunk/ext/io/console' I, [2024-05-03T15:54:33.741062 #3548468] INFO -- : make[2]: Entering directory '/tmp/ruby/build/trunk/ext/json' I, [2024-05-03T15:54:33.747423 #3548468] INFO -- : make[2]: Leaving directory '/tmp/ruby/build/trunk/ext/json' I, [2024-05-03T15:54:33.756382 #3548468] INFO -- : make[2]: Entering directory '/tmp/ruby/build/trunk/ext/monitor' I, [2024-05-03T15:54:33.758820 #3548468] INFO -- : make[2]: Leaving directory '/tmp/ruby/build/trunk/ext/monitor' I, [2024-05-03T15:54:33.763059 #3548468] INFO -- : make[2]: Entering directory '/tmp/ruby/build/trunk/ext/objspace' I, [2024-05-03T15:54:33.766865 #3548468] INFO -- : make[2]: Leaving directory '/tmp/ruby/build/trunk/ext/objspace' I, [2024-05-03T15:54:33.778838 #3548468] INFO -- : make[2]: Entering directory '/tmp/ruby/build/trunk/ext/openssl' I, [2024-05-03T15:54:33.792075 #3548468] INFO -- : make[2]: Leaving directory '/tmp/ruby/build/trunk/ext/openssl' I, [2024-05-03T15:54:33.794928 #3548468] INFO -- : make[2]: Entering directory '/tmp/ruby/build/trunk/ext/pathname' I, [2024-05-03T15:54:33.797477 #3548468] INFO -- : make[2]: Leaving directory '/tmp/ruby/build/trunk/ext/pathname' I, [2024-05-03T15:54:33.801741 #3548468] INFO -- : make[2]: Entering directory '/tmp/ruby/build/trunk/ext/psych' I, [2024-05-03T15:54:33.816679 #3548468] INFO -- : make[2]: Leaving directory '/tmp/ruby/build/trunk/ext/psych' I, [2024-05-03T15:54:33.819676 #3548468] INFO -- : make[2]: Entering directory '/tmp/ruby/build/trunk/ext/pty' I, [2024-05-03T15:54:33.822306 #3548468] INFO -- : make[2]: Leaving directory '/tmp/ruby/build/trunk/ext/pty' I, [2024-05-03T15:54:33.831775 #3548468] INFO -- : make[2]: Entering directory '/tmp/ruby/build/trunk/ext/ripper' I, [2024-05-03T15:54:33.836774 #3548468] INFO -- : make[2]: Leaving directory '/tmp/ruby/build/trunk/ext/ripper' I, [2024-05-03T15:54:33.838260 #3548468] INFO -- : make[2]: Entering directory '/tmp/ruby/build/trunk/ext/rubyvm' I, [2024-05-03T15:54:33.840357 #3548468] INFO -- : make[2]: Leaving directory '/tmp/ruby/build/trunk/ext/rubyvm' I, [2024-05-03T15:54:33.848313 #3548468] INFO -- : make[2]: Entering directory '/tmp/ruby/build/trunk/ext/socket' I, [2024-05-03T15:54:33.855155 #3548468] INFO -- : make[2]: Leaving directory '/tmp/ruby/build/trunk/ext/socket' I, [2024-05-03T15:54:33.866061 #3548468] INFO -- : make[2]: Entering directory '/tmp/ruby/build/trunk/.bundle/gems/bigdecimal-3.1.7/ext/bigdecimal' I, [2024-05-03T15:54:33.889113 #3548468] INFO -- : make[2]: Leaving directory '/tmp/ruby/build/trunk/.bundle/gems/bigdecimal-3.1.7/ext/bigdecimal' I, [2024-05-03T15:54:33.891205 #3548468] INFO -- : make[2]: Entering directory '/tmp/ruby/build/trunk/.bundle/gems/debug-1.9.2/ext/debug' I, [2024-05-03T15:54:33.913839 #3548468] INFO -- : make[2]: Leaving directory '/tmp/ruby/build/trunk/.bundle/gems/debug-1.9.2/ext/debug' I, [2024-05-03T15:54:33.915902 #3548468] INFO -- : make[2]: Entering directory '/tmp/ruby/build/trunk/.bundle/gems/nkf-0.2.0/ext/nkf' I, [2024-05-03T15:54:33.937995 #3548468] INFO -- : make[2]: Leaving directory '/tmp/ruby/build/trunk/.bundle/gems/nkf-0.2.0/ext/nkf' I, [2024-05-03T15:54:33.939952 #3548468] INFO -- : make[2]: Entering directory '/tmp/ruby/build/trunk/.bundle/gems/racc-1.7.3/ext/racc/cparse' I, [2024-05-03T15:54:33.961276 #3548468] INFO -- : make[2]: Leaving directory '/tmp/ruby/build/trunk/.bundle/gems/racc-1.7.3/ext/racc/cparse' I, [2024-05-03T15:54:33.963505 #3548468] INFO -- : make[2]: Entering directory '/tmp/ruby/build/trunk/.bundle/gems/rbs-3.4.4/ext/rbs_extension' I, [2024-05-03T15:54:33.985422 #3548468] INFO -- : make[2]: Leaving directory '/tmp/ruby/build/trunk/.bundle/gems/rbs-3.4.4/ext/rbs_extension' I, [2024-05-03T15:54:33.987424 #3548468] INFO -- : make[2]: Entering directory '/tmp/ruby/build/trunk/.bundle/gems/syslog-0.1.2/ext/syslog' I, [2024-05-03T15:54:34.009179 #3548468] INFO -- : make[2]: Leaving directory '/tmp/ruby/build/trunk/.bundle/gems/syslog-0.1.2/ext/syslog' I, [2024-05-03T15:54:34.032264 #3548468] INFO -- : make[2]: Entering directory '/tmp/ruby/build/trunk' I, [2024-05-03T15:54:34.095169 #3548468] INFO -- : make[2]: 'ruby' is up to date. I, [2024-05-03T15:54:34.095205 #3548468] INFO -- : make[2]: Leaving directory '/tmp/ruby/build/trunk' I, [2024-05-03T15:54:34.095527 #3548468] INFO -- : make[1]: Leaving directory '/tmp/ruby/build/trunk' I, [2024-05-03T15:54:34.099000 #3548468] INFO -- : make[1]: Entering directory '/tmp/ruby/build/trunk' I, [2024-05-03T15:54:34.099026 #3548468] INFO -- : make[1]: Nothing to be done for 'note'. I, [2024-05-03T15:54:34.099032 #3548468] INFO -- : make[1]: Leaving directory '/tmp/ruby/build/trunk' E, [2024-05-03T15:54:34.157064 #3548468] ERROR -- : $ /tmp/ruby/build/trunk/miniruby -I/tmp/ruby/src/trunk/lib /tmp/ruby/src/trunk/tool/runruby.rb --archdir=/tmp/ruby/build/trunk --extout=.ext -- /tmp/ruby/src/trunk/spec/mspec/bin/mspec-run -B /tmp/ruby/src/trunk/spec/default.mspec --error-output stderr --debug -fy -o /tmp/rubytest.hwnvq9/1-mspec-multi-0 E, [2024-05-03T15:54:34.157172 #3548468] ERROR -- : $ /tmp/ruby/build/trunk/miniruby -I/tmp/ruby/src/trunk/lib /tmp/ruby/src/trunk/tool/runruby.rb --archdir=/tmp/ruby/build/trunk --extout=.ext -- /tmp/ruby/src/trunk/spec/mspec/bin/mspec-run -B /tmp/ruby/src/trunk/spec/default.mspec --error-output stderr --debug -fy -o /tmp/rubytest.hwnvq9/2-mspec-multi-1 E, [2024-05-03T15:54:34.157570 #3548468] ERROR -- : $ /tmp/ruby/build/trunk/miniruby -I/tmp/ruby/src/trunk/lib /tmp/ruby/src/trunk/tool/runruby.rb --archdir=/tmp/ruby/build/trunk --extout=.ext -- /tmp/ruby/src/trunk/spec/mspec/bin/mspec-run -B /tmp/ruby/src/trunk/spec/default.mspec --error-output stderr --debug -fy -o /tmp/rubytest.hwnvq9/3-mspec-multi-2 E, [2024-05-03T15:54:34.157807 #3548468] ERROR -- : $ /tmp/ruby/build/trunk/miniruby -I/tmp/ruby/src/trunk/lib /tmp/ruby/src/trunk/tool/runruby.rb --archdir=/tmp/ruby/build/trunk --extout=.ext -- /tmp/ruby/src/trunk/spec/mspec/bin/mspec-run -B /tmp/ruby/src/trunk/spec/default.mspec --error-output stderr --debug -fy -o /tmp/rubytest.hwnvq9/4-mspec-multi-3 E, [2024-05-03T15:54:34.158092 #3548468] ERROR -- : $ /tmp/ruby/build/trunk/miniruby -I/tmp/ruby/src/trunk/lib /tmp/ruby/src/trunk/tool/runruby.rb --archdir=/tmp/ruby/build/trunk --extout=.ext -- /tmp/ruby/src/trunk/spec/mspec/bin/mspec-run -B /tmp/ruby/src/trunk/spec/default.mspec --error-output stderr --debug -fy -o /tmp/rubytest.hwnvq9/5-mspec-multi-4 E, [2024-05-03T15:54:34.158175 #3548468] ERROR -- : $ /tmp/ruby/build/trunk/miniruby -I/tmp/ruby/src/trunk/lib /tmp/ruby/src/trunk/tool/runruby.rb --archdir=/tmp/ruby/build/trunk --extout=.ext -- /tmp/ruby/src/trunk/spec/mspec/bin/mspec-run -B /tmp/ruby/src/trunk/spec/default.mspec --error-output stderr --debug -fy -o /tmp/rubytest.hwnvq9/6-mspec-multi-5 E, [2024-05-03T15:54:34.158356 #3548468] ERROR -- : $ /tmp/ruby/build/trunk/miniruby -I/tmp/ruby/src/trunk/lib /tmp/ruby/src/trunk/tool/runruby.rb --archdir=/tmp/ruby/build/trunk --extout=.ext -- /tmp/ruby/src/trunk/spec/mspec/bin/mspec-run -B /tmp/ruby/src/trunk/spec/default.mspec --error-output stderr --debug -fy -o /tmp/rubytest.hwnvq9/7-mspec-multi-6 E, [2024-05-03T15:54:34.158555 #3548468] ERROR -- : $ /tmp/ruby/build/trunk/miniruby -I/tmp/ruby/src/trunk/lib /tmp/ruby/src/trunk/tool/runruby.rb --archdir=/tmp/ruby/build/trunk --extout=.ext -- /tmp/ruby/src/trunk/spec/mspec/bin/mspec-run -B /tmp/ruby/src/trunk/spec/default.mspec --error-output stderr --debug -fy -o /tmp/rubytest.hwnvq9/8-mspec-multi-7 E, [2024-05-03T15:54:34.158740 #3548468] ERROR -- : $ /tmp/ruby/build/trunk/miniruby -I/tmp/ruby/src/trunk/lib /tmp/ruby/src/trunk/tool/runruby.rb --archdir=/tmp/ruby/build/trunk --extout=.ext -- /tmp/ruby/src/trunk/spec/mspec/bin/mspec-run -B /tmp/ruby/src/trunk/spec/default.mspec --error-output stderr --debug -fy -o /tmp/rubytest.hwnvq9/9-mspec-multi-8 E, [2024-05-03T15:54:34.159059 #3548468] ERROR -- : $ /tmp/ruby/build/trunk/miniruby -I/tmp/ruby/src/trunk/lib /tmp/ruby/src/trunk/tool/runruby.rb --archdir=/tmp/ruby/build/trunk --extout=.ext -- /tmp/ruby/src/trunk/spec/mspec/bin/mspec-run -B /tmp/ruby/src/trunk/spec/default.mspec --error-output stderr --debug -fy -o /tmp/rubytest.hwnvq9/10-mspec-multi-9 E, [2024-05-03T15:54:34.159385 #3548468] ERROR -- : $ /tmp/ruby/build/trunk/miniruby -I/tmp/ruby/src/trunk/lib /tmp/ruby/src/trunk/tool/runruby.rb --archdir=/tmp/ruby/build/trunk --extout=.ext -- /tmp/ruby/src/trunk/spec/mspec/bin/mspec-run -B /tmp/ruby/src/trunk/spec/default.mspec --error-output stderr --debug -fy -o /tmp/rubytest.hwnvq9/11-mspec-multi-10 E, [2024-05-03T15:54:34.159628 #3548468] ERROR -- : $ /tmp/ruby/build/trunk/miniruby -I/tmp/ruby/src/trunk/lib /tmp/ruby/src/trunk/tool/runruby.rb --archdir=/tmp/ruby/build/trunk --extout=.ext -- /tmp/ruby/src/trunk/spec/mspec/bin/mspec-run -B /tmp/ruby/src/trunk/spec/default.mspec --error-output stderr --debug -fy -o /tmp/rubytest.hwnvq9/12-mspec-multi-11 E, [2024-05-03T15:54:34.159827 #3548468] ERROR -- : $ /tmp/ruby/build/trunk/miniruby -I/tmp/ruby/src/trunk/lib /tmp/ruby/src/trunk/tool/runruby.rb --archdir=/tmp/ruby/build/trunk --extout=.ext -- /tmp/ruby/src/trunk/spec/mspec/bin/mspec-run -B /tmp/ruby/src/trunk/spec/default.mspec --error-output stderr --debug -fy -o /tmp/rubytest.hwnvq9/13-mspec-multi-12 E, [2024-05-03T15:54:34.160082 #3548468] ERROR -- : $ /tmp/ruby/build/trunk/miniruby -I/tmp/ruby/src/trunk/lib /tmp/ruby/src/trunk/tool/runruby.rb --archdir=/tmp/ruby/build/trunk --extout=.ext -- /tmp/ruby/src/trunk/spec/mspec/bin/mspec-run -B /tmp/ruby/src/trunk/spec/default.mspec --error-output stderr --debug -fy -o /tmp/rubytest.hwnvq9/14-mspec-multi-13 E, [2024-05-03T15:54:34.160236 #3548468] ERROR -- : $ /tmp/ruby/build/trunk/miniruby -I/tmp/ruby/src/trunk/lib /tmp/ruby/src/trunk/tool/runruby.rb --archdir=/tmp/ruby/build/trunk --extout=.ext -- /tmp/ruby/src/trunk/spec/mspec/bin/mspec-run -B /tmp/ruby/src/trunk/spec/default.mspec --error-output stderr --debug -fy -o /tmp/rubytest.hwnvq9/15-mspec-multi-14 E, [2024-05-03T15:54:34.160435 #3548468] ERROR -- : $ /tmp/ruby/build/trunk/miniruby -I/tmp/ruby/src/trunk/lib /tmp/ruby/src/trunk/tool/runruby.rb --archdir=/tmp/ruby/build/trunk --extout=.ext -- /tmp/ruby/src/trunk/spec/mspec/bin/mspec-run -B /tmp/ruby/src/trunk/spec/default.mspec --error-output stderr --debug -fy -o /tmp/rubytest.hwnvq9/16-mspec-multi-15 E, [2024-05-03T15:54:34.160658 #3548468] ERROR -- : $ /tmp/ruby/build/trunk/miniruby -I/tmp/ruby/src/trunk/lib /tmp/ruby/src/trunk/tool/runruby.rb --archdir=/tmp/ruby/build/trunk --extout=.ext -- /tmp/ruby/src/trunk/spec/mspec/bin/mspec-run -B /tmp/ruby/src/trunk/spec/default.mspec --error-output stderr --debug -fy -o /tmp/rubytest.hwnvq9/17-mspec-multi-16 E, [2024-05-03T15:54:34.160858 #3548468] ERROR -- : $ /tmp/ruby/build/trunk/miniruby -I/tmp/ruby/src/trunk/lib /tmp/ruby/src/trunk/tool/runruby.rb --archdir=/tmp/ruby/build/trunk --extout=.ext -- /tmp/ruby/src/trunk/spec/mspec/bin/mspec-run -B /tmp/ruby/src/trunk/spec/default.mspec --error-output stderr --debug -fy -o /tmp/rubytest.hwnvq9/18-mspec-multi-17 E, [2024-05-03T15:54:34.163361 #3548468] ERROR -- : $ /tmp/ruby/build/trunk/miniruby -I/tmp/ruby/src/trunk/lib /tmp/ruby/src/trunk/tool/runruby.rb --archdir=/tmp/ruby/build/trunk --extout=.ext -- /tmp/ruby/src/trunk/spec/mspec/bin/mspec-run -B /tmp/ruby/src/trunk/spec/default.mspec --error-output stderr --debug -fy -o /tmp/rubytest.hwnvq9/19-mspec-multi-18 E, [2024-05-03T15:54:34.176486 #3548468] ERROR -- : $ /tmp/ruby/build/trunk/miniruby -I/tmp/ruby/src/trunk/lib /tmp/ruby/src/trunk/tool/runruby.rb --archdir=/tmp/ruby/build/trunk --extout=.ext -- /tmp/ruby/src/trunk/spec/mspec/bin/mspec-run -B /tmp/ruby/src/trunk/spec/default.mspec --error-output stderr --debug -fy -o /tmp/rubytest.hwnvq9/20-mspec-multi-19 I, [2024-05-03T15:54:34.364703 #3548468] INFO -- : ruby 3.4.0dev (2024-05-03T15:12:55Z master 281df1e495) [x86_64-linux] I, [2024-05-03T15:54:35.003349 #3548468] INFO -- : 0 ......................................................................... I, [2024-05-03T15:54:35.397847 #3548468] INFO -- : 73 ......................................................................... I, [2024-05-03T15:54:35.536955 #3548468] INFO -- : 146 ......................................................................... I, [2024-05-03T15:54:35.588631 #3548468] INFO -- : 219 ......................................................................... I, [2024-05-03T15:54:35.669038 #3548468] INFO -- : 292 ......................................................................... I, [2024-05-03T15:54:35.708381 #3548468] INFO -- : 365 ......................................................................... I, [2024-05-03T15:54:35.731553 #3548468] INFO -- : 438 ......................................................................... I, [2024-05-03T15:54:35.752355 #3548468] INFO -- : 511 ......................................................................... I, [2024-05-03T15:54:35.771250 #3548468] INFO -- : 584 ......................................................................... I, [2024-05-03T15:54:35.831379 #3548468] INFO -- : 657 ......................................................................... I, [2024-05-03T15:54:35.860177 #3548468] INFO -- : 730 ......................................................................... I, [2024-05-03T15:54:35.888731 #3548468] INFO -- : 803 ......................................................................... I, [2024-05-03T15:54:35.929338 #3548468] INFO -- : 876 ......................................................................... I, [2024-05-03T15:54:35.986379 #3548468] INFO -- : 949 ......................................................................... I, [2024-05-03T15:54:36.069934 #3548468] INFO -- : 1022 ......................................................................... I, [2024-05-03T15:54:36.236228 #3548468] INFO -- : 1095 ......................................................................... I, [2024-05-03T15:54:36.366032 #3548468] INFO -- : 1168 ......................................................................... I, [2024-05-03T15:54:36.431439 #3548468] INFO -- : 1241 ......................................................................... I, [2024-05-03T15:54:36.478264 #3548468] INFO -- : 1314 ......................................................................... I, [2024-05-03T15:54:36.498583 #3548468] INFO -- : 1387 ......................................................................... I, [2024-05-03T15:54:36.620191 #3548468] INFO -- : 1460 ......................................................................... I, [2024-05-03T15:54:37.084339 #3548468] INFO -- : 1533 ......................................................................... I, [2024-05-03T15:54:37.164189 #3548468] INFO -- : 1606 ......................................................................... I, [2024-05-03T15:54:37.264225 #3548468] INFO -- : 1679 ......................................................................... I, [2024-05-03T15:54:37.377526 #3548468] INFO -- : 1752 ......................................................................... I, [2024-05-03T15:54:37.455631 #3548468] INFO -- : 1825 ......................................................................... I, [2024-05-03T15:54:37.588079 #3548468] INFO -- : 1898 ......................................................................... I, [2024-05-03T15:54:37.667549 #3548468] INFO -- : 1971 ......................................................................... I, [2024-05-03T15:54:37.743847 #3548468] INFO -- : 2044 ......................................................................... I, [2024-05-03T15:54:37.778429 #3548468] INFO -- : 2117 ......................................................................... I, [2024-05-03T15:54:37.797099 #3548468] INFO -- : 2190 ......................................................................... I, [2024-05-03T15:54:37.820209 #3548468] INFO -- : 2263 ......................................................................... I, [2024-05-03T15:54:37.834256 #3548468] INFO -- : 2336 ......................................................................... I, [2024-05-03T15:54:37.868710 #3548468] INFO -- : 2409 ......................................................................... I, [2024-05-03T15:54:37.992430 #3548468] INFO -- : 2482 ......................................................................... I, [2024-05-03T15:54:38.013575 #3548468] INFO -- : 2555 ......................................................................... I, [2024-05-03T15:54:38.127337 #3548468] INFO -- : 2628 ......................................................................... I, [2024-05-03T15:54:38.238307 #3548468] INFO -- : 2701 ......................................................................... I, [2024-05-03T15:54:38.267007 #3548468] INFO -- : 2774 ......................................................................... I, [2024-05-03T15:54:38.336070 #3548468] INFO -- : 2847 ......................................................................... I, [2024-05-03T15:54:38.375584 #3548468] INFO -- : 2920 ......................................................................... I, [2024-05-03T15:54:38.404134 #3548468] INFO -- : 2993 ......................................................................... I, [2024-05-03T15:54:38.425903 #3548468] INFO -- : 3066 ......................................................................... I, [2024-05-03T15:54:38.440714 #3548468] INFO -- : 3139 ......................................................................... I, [2024-05-03T15:54:38.451175 #3548468] INFO -- : 3212 ......................................................................... I, [2024-05-03T15:54:38.480054 #3548468] INFO -- : 3285 ......................................................................... I, [2024-05-03T15:54:42.447992 #3548468] INFO -- : 3358 ........................................................................ I, [2024-05-03T15:54:42.448047 #3548468] INFO -- : I, [2024-05-03T15:54:42.448054 #3548468] INFO -- : Finished in 8.288515 seconds I, [2024-05-03T15:54:42.448057 #3548468] INFO -- : I, [2024-05-03T15:54:42.448061 #3548468] INFO -- : 3429 files, 32610 examples, 170479 expectations, 0 failures, 0 errors, 0 tagged I, [2024-05-03T15:54:42.451118 #3548468] INFO -- : $$$[end] "make yes-test-rubyspec MSPECOPT='--error-output stderr --debug -j' TESTS='-j20'" exit with 0.