# Logfile created on 2024-05-03 05:56:32 +0000 by logger.rb/v1.4.3 I, [2024-05-03T05:56:32.219666 #3737750] INFO -- : #, @formatter=nil, @logdev=#, @binmode=false, @mon_data=#, @mon_data_owner_object_id=860>>> I, [2024-05-03T05:56:32.219795 #3737750] INFO -- : $$$[beg] make update-unicode -j20 I, [2024-05-03T05:56:32.278645 #3737750] INFO -- : Downloading Unicode emoji 15.0 files... I, [2024-05-03T05:56:32.278885 #3737750] INFO -- : Downloading Unicode emoji 15.0 files... I, [2024-05-03T05:56:32.279537 #3737750] INFO -- : Downloading Unicode emoji 15.0 files... I, [2024-05-03T05:56:32.319849 #3737750] INFO -- : made symlink emoji/15.0/emoji-sequences.txt to /tmp/ruby/src/trunk/.downloaded-cache/emoji/15.0/emoji-sequences.txt I, [2024-05-03T05:56:32.321394 #3737750] INFO -- : downloading emoji/15.0/emoji-sequences.txt ... downloading emoji/15.0/emoji-test.txt ... /tmp/ruby/src/trunk/enc/unicode/data/emoji/15.0/emoji-sequences.txt already exists E, [2024-05-03T05:56:32.776338 #3737750] ERROR -- : /tmp/ruby/src/trunk/tool/downloader.rb:302:in `rescue in download': failed to download emoji/15.0/emoji-test.txt (RuntimeError) E, [2024-05-03T05:56:32.776366 #3737750] ERROR -- : OpenURI::HTTPError: 403 Forbidden: https://www.unicode.org/Public/emoji/15.0/emoji-test.txt E, [2024-05-03T05:56:32.776371 #3737750] ERROR -- : from /tmp/ruby/src/trunk/tool/downloader.rb:201:in `download' E, [2024-05-03T05:56:32.776375 #3737750] ERROR -- : from /tmp/ruby/src/trunk/tool/downloader.rb:136:in `download' E, [2024-05-03T05:56:32.776379 #3737750] ERROR -- : from /tmp/ruby/src/trunk/tool/downloader.rb:482:in `block in
' E, [2024-05-03T05:56:32.776383 #3737750] ERROR -- : from /tmp/ruby/src/trunk/tool/downloader.rb:465:in `each' E, [2024-05-03T05:56:32.776386 #3737750] ERROR -- : from /tmp/ruby/src/trunk/tool/downloader.rb:465:in `
' E, [2024-05-03T05:56:32.776389 #3737750] ERROR -- : /usr/lib/ruby/3.0.0/open-uri.rb:364:in `open_http': 403 Forbidden (OpenURI::HTTPError) E, [2024-05-03T05:56:32.776393 #3737750] ERROR -- : from /usr/lib/ruby/3.0.0/open-uri.rb:741:in `buffer_open' E, [2024-05-03T05:56:32.776397 #3737750] ERROR -- : from /usr/lib/ruby/3.0.0/open-uri.rb:212:in `block in open_loop' E, [2024-05-03T05:56:32.776401 #3737750] ERROR -- : from /usr/lib/ruby/3.0.0/open-uri.rb:210:in `catch' E, [2024-05-03T05:56:32.776404 #3737750] ERROR -- : from /usr/lib/ruby/3.0.0/open-uri.rb:210:in `open_loop' E, [2024-05-03T05:56:32.776408 #3737750] ERROR -- : from /usr/lib/ruby/3.0.0/open-uri.rb:151:in `open_uri' E, [2024-05-03T05:56:32.776411 #3737750] ERROR -- : from /usr/lib/ruby/3.0.0/open-uri.rb:721:in `open' E, [2024-05-03T05:56:32.776414 #3737750] ERROR -- : from /usr/lib/ruby/3.0.0/open-uri.rb:729:in `read' E, [2024-05-03T05:56:32.776418 #3737750] ERROR -- : from /tmp/ruby/src/trunk/tool/downloader.rb:247:in `block in download' E, [2024-05-03T05:56:32.776428 #3737750] ERROR -- : from /tmp/ruby/src/trunk/tool/downloader.rb:378:in `with_retry' E, [2024-05-03T05:56:32.776432 #3737750] ERROR -- : from /tmp/ruby/src/trunk/tool/downloader.rb:246:in `download' E, [2024-05-03T05:56:32.776436 #3737750] ERROR -- : from /tmp/ruby/src/trunk/tool/downloader.rb:136:in `download' E, [2024-05-03T05:56:32.776440 #3737750] ERROR -- : from /tmp/ruby/src/trunk/tool/downloader.rb:482:in `block in
' E, [2024-05-03T05:56:32.776443 #3737750] ERROR -- : from /tmp/ruby/src/trunk/tool/downloader.rb:465:in `each' E, [2024-05-03T05:56:32.776447 #3737750] ERROR -- : from /tmp/ruby/src/trunk/tool/downloader.rb:465:in `
' E, [2024-05-03T05:56:32.778476 #3737750] ERROR -- : make: *** [uncommon.mk:1787: /tmp/ruby/src/trunk/enc/unicode/data/emoji/15.0/emoji-sequences.txt] Error 1 E, [2024-05-03T05:56:32.778496 #3737750] ERROR -- : make: *** Deleting file '/tmp/ruby/src/trunk/enc/unicode/data/emoji/15.0/emoji-sequences.txt' E, [2024-05-03T05:56:32.778502 #3737750] ERROR -- : make: *** Waiting for unfinished jobs.... E, [2024-05-03T05:56:32.811619 #3737750] ERROR -- : /tmp/ruby/src/trunk/tool/downloader.rb:302:in `rescue in download': failed to download emoji/15.0/emoji-test.txt (RuntimeError) E, [2024-05-03T05:56:32.811642 #3737750] ERROR -- : OpenURI::HTTPError: 403 Forbidden: https://www.unicode.org/Public/emoji/15.0/emoji-test.txt E, [2024-05-03T05:56:32.811648 #3737750] ERROR -- : from /tmp/ruby/src/trunk/tool/downloader.rb:201:in `download' E, [2024-05-03T05:56:32.811652 #3737750] ERROR -- : from /tmp/ruby/src/trunk/tool/downloader.rb:136:in `download' E, [2024-05-03T05:56:32.811656 #3737750] ERROR -- : from /tmp/ruby/src/trunk/tool/downloader.rb:482:in `block in
' E, [2024-05-03T05:56:32.811659 #3737750] ERROR -- : from /tmp/ruby/src/trunk/tool/downloader.rb:465:in `each' E, [2024-05-03T05:56:32.811663 #3737750] ERROR -- : from /tmp/ruby/src/trunk/tool/downloader.rb:465:in `
' E, [2024-05-03T05:56:32.811667 #3737750] ERROR -- : /usr/lib/ruby/3.0.0/open-uri.rb:364:in `open_http': 403 Forbidden (OpenURI::HTTPError) E, [2024-05-03T05:56:32.811673 #3737750] ERROR -- : from /usr/lib/ruby/3.0.0/open-uri.rb:741:in `buffer_open' E, [2024-05-03T05:56:32.811676 #3737750] ERROR -- : from /usr/lib/ruby/3.0.0/open-uri.rb:212:in `block in open_loop' E, [2024-05-03T05:56:32.811680 #3737750] ERROR -- : from /usr/lib/ruby/3.0.0/open-uri.rb:210:in `catch' E, [2024-05-03T05:56:32.811684 #3737750] ERROR -- : from /usr/lib/ruby/3.0.0/open-uri.rb:210:in `open_loop' E, [2024-05-03T05:56:32.811687 #3737750] ERROR -- : from /usr/lib/ruby/3.0.0/open-uri.rb:151:in `open_uri' E, [2024-05-03T05:56:32.811691 #3737750] ERROR -- : from /usr/lib/ruby/3.0.0/open-uri.rb:721:in `open' E, [2024-05-03T05:56:32.811695 #3737750] ERROR -- : from /usr/lib/ruby/3.0.0/open-uri.rb:729:in `read' E, [2024-05-03T05:56:32.811698 #3737750] ERROR -- : from /tmp/ruby/src/trunk/tool/downloader.rb:247:in `block in download' E, [2024-05-03T05:56:32.811703 #3737750] ERROR -- : from /tmp/ruby/src/trunk/tool/downloader.rb:378:in `with_retry' E, [2024-05-03T05:56:32.811707 #3737750] ERROR -- : from /tmp/ruby/src/trunk/tool/downloader.rb:246:in `download' E, [2024-05-03T05:56:32.811711 #3737750] ERROR -- : from /tmp/ruby/src/trunk/tool/downloader.rb:136:in `download' E, [2024-05-03T05:56:32.811714 #3737750] ERROR -- : from /tmp/ruby/src/trunk/tool/downloader.rb:482:in `block in
' E, [2024-05-03T05:56:32.811718 #3737750] ERROR -- : from /tmp/ruby/src/trunk/tool/downloader.rb:465:in `each' E, [2024-05-03T05:56:32.811722 #3737750] ERROR -- : from /tmp/ruby/src/trunk/tool/downloader.rb:465:in `
' E, [2024-05-03T05:56:32.813624 #3737750] ERROR -- : make: *** [uncommon.mk:1787: /tmp/ruby/src/trunk/enc/unicode/data/emoji/15.0/emoji-zwj-sequences.txt] Error 1 E, [2024-05-03T05:56:33.218663 #3737750] ERROR -- : /tmp/ruby/src/trunk/tool/downloader.rb:302:in `rescue in download': failed to download emoji/15.0/emoji-sequences.txt (RuntimeError) E, [2024-05-03T05:56:33.218688 #3737750] ERROR -- : EOFError: end of file reached: https://www.unicode.org/Public/emoji/15.0/emoji-sequences.txt E, [2024-05-03T05:56:33.218693 #3737750] ERROR -- : from /tmp/ruby/src/trunk/tool/downloader.rb:201:in `download' E, [2024-05-03T05:56:33.218697 #3737750] ERROR -- : from /tmp/ruby/src/trunk/tool/downloader.rb:136:in `download' E, [2024-05-03T05:56:33.218700 #3737750] ERROR -- : from /tmp/ruby/src/trunk/tool/downloader.rb:482:in `block in
' E, [2024-05-03T05:56:33.218704 #3737750] ERROR -- : from /tmp/ruby/src/trunk/tool/downloader.rb:465:in `each' E, [2024-05-03T05:56:33.218707 #3737750] ERROR -- : from /tmp/ruby/src/trunk/tool/downloader.rb:465:in `
' E, [2024-05-03T05:56:33.218710 #3737750] ERROR -- : /usr/lib/ruby/3.0.0/net/protocol.rb:227:in `rbuf_fill': end of file reached (EOFError) E, [2024-05-03T05:56:33.218715 #3737750] ERROR -- : from /usr/lib/ruby/3.0.0/net/protocol.rb:193:in `readuntil' E, [2024-05-03T05:56:33.218719 #3737750] ERROR -- : from /usr/lib/ruby/3.0.0/net/protocol.rb:203:in `readline' E, [2024-05-03T05:56:33.218722 #3737750] ERROR -- : from /usr/lib/ruby/3.0.0/net/http/response.rb:42:in `read_status_line' E, [2024-05-03T05:56:33.218726 #3737750] ERROR -- : from /usr/lib/ruby/3.0.0/net/http/response.rb:31:in `read_new' E, [2024-05-03T05:56:33.218729 #3737750] ERROR -- : from /usr/lib/ruby/3.0.0/net/http.rb:1557:in `block in transport_request' E, [2024-05-03T05:56:33.218815 #3737750] ERROR -- : from /usr/lib/ruby/3.0.0/net/http.rb:1548:in `catch' E, [2024-05-03T05:56:33.218818 #3737750] ERROR -- : from /usr/lib/ruby/3.0.0/net/http.rb:1548:in `transport_request' E, [2024-05-03T05:56:33.218822 #3737750] ERROR -- : from /usr/lib/ruby/3.0.0/net/http.rb:1521:in `request' E, [2024-05-03T05:56:33.218825 #3737750] ERROR -- : from /usr/lib/ruby/3.0.0/open-uri.rb:329:in `block in open_http' E, [2024-05-03T05:56:33.218828 #3737750] ERROR -- : from /usr/lib/ruby/3.0.0/net/http.rb:960:in `start' E, [2024-05-03T05:56:33.218832 #3737750] ERROR -- : from /usr/lib/ruby/3.0.0/open-uri.rb:323:in `open_http' E, [2024-05-03T05:56:33.218835 #3737750] ERROR -- : from /usr/lib/ruby/3.0.0/open-uri.rb:741:in `buffer_open' E, [2024-05-03T05:56:33.218840 #3737750] ERROR -- : from /usr/lib/ruby/3.0.0/open-uri.rb:212:in `block in open_loop' E, [2024-05-03T05:56:33.218843 #3737750] ERROR -- : from /usr/lib/ruby/3.0.0/open-uri.rb:210:in `catch' E, [2024-05-03T05:56:33.218847 #3737750] ERROR -- : from /usr/lib/ruby/3.0.0/open-uri.rb:210:in `open_loop' E, [2024-05-03T05:56:33.218850 #3737750] ERROR -- : from /usr/lib/ruby/3.0.0/open-uri.rb:151:in `open_uri' E, [2024-05-03T05:56:33.218853 #3737750] ERROR -- : from /usr/lib/ruby/3.0.0/open-uri.rb:721:in `open' E, [2024-05-03T05:56:33.218856 #3737750] ERROR -- : from /usr/lib/ruby/3.0.0/open-uri.rb:729:in `read' E, [2024-05-03T05:56:33.218860 #3737750] ERROR -- : from /tmp/ruby/src/trunk/tool/downloader.rb:247:in `block in download' E, [2024-05-03T05:56:33.218863 #3737750] ERROR -- : from /tmp/ruby/src/trunk/tool/downloader.rb:378:in `with_retry' E, [2024-05-03T05:56:33.218867 #3737750] ERROR -- : from /tmp/ruby/src/trunk/tool/downloader.rb:246:in `download' E, [2024-05-03T05:56:33.218871 #3737750] ERROR -- : from /tmp/ruby/src/trunk/tool/downloader.rb:136:in `download' E, [2024-05-03T05:56:33.218874 #3737750] ERROR -- : from /tmp/ruby/src/trunk/tool/downloader.rb:482:in `block in
' E, [2024-05-03T05:56:33.218878 #3737750] ERROR -- : from /tmp/ruby/src/trunk/tool/downloader.rb:465:in `each' E, [2024-05-03T05:56:33.218881 #3737750] ERROR -- : from /tmp/ruby/src/trunk/tool/downloader.rb:465:in `
' E, [2024-05-03T05:56:33.220807 #3737750] ERROR -- : make: *** [uncommon.mk:1787: /tmp/ruby/src/trunk/enc/unicode/data/emoji/15.0/emoji-test.txt] Error 1 I, [2024-05-03T05:56:33.220870 #3737750] INFO -- : downloading emoji/15.0/emoji-test.txt ... I, [2024-05-03T05:56:33.221267 #3737750] INFO -- : $$$[end] "make update-unicode -j20" exit with 512. I, [2024-05-03T05:56:33.221294 #3737750] INFO -- : $$$[beg] make update-download -j20 I, [2024-05-03T05:56:33.320483 #3737750] INFO -- : tool/config.guess already exists I, [2024-05-03T05:56:33.320521 #3737750] INFO -- : tool/config.sub already exists I, [2024-05-03T05:56:33.322691 #3737750] INFO -- : Update minitest to ea9caafc0754b1d6236a490d59e624b53209734a I, [2024-05-03T05:56:33.322919 #3737750] INFO -- : Update power_assert to 84e85124c5014a139af39161d484156cfe87a9ed I, [2024-05-03T05:56:33.323651 #3737750] INFO -- : Update rbs to ba7872795d5de04adb8ff500c0e6afdc81a041dd I, [2024-05-03T05:56:33.323708 #3737750] INFO -- : Update typeprof to b19a6416da3a05d57fadd6ffdadb382b6d236ca5 I, [2024-05-03T05:56:33.323900 #3737750] INFO -- : echo ea9caafc0754b1d6236a490d59e624b53209734a | /bin/sh /tmp/ruby/src/trunk/tool/ifchange /tmp/ruby/src/trunk/.bundle/.timestamp/minitest.revision - I, [2024-05-03T05:56:33.324043 #3737750] INFO -- : echo 84e85124c5014a139af39161d484156cfe87a9ed | /bin/sh /tmp/ruby/src/trunk/tool/ifchange /tmp/ruby/src/trunk/.bundle/.timestamp/power_assert.revision - I, [2024-05-03T05:56:33.324658 #3737750] INFO -- : echo ba7872795d5de04adb8ff500c0e6afdc81a041dd | /bin/sh /tmp/ruby/src/trunk/tool/ifchange /tmp/ruby/src/trunk/.bundle/.timestamp/rbs.revision - I, [2024-05-03T05:56:33.324789 #3737750] INFO -- : echo b19a6416da3a05d57fadd6ffdadb382b6d236ca5 | /bin/sh /tmp/ruby/src/trunk/tool/ifchange /tmp/ruby/src/trunk/.bundle/.timestamp/typeprof.revision - I, [2024-05-03T05:56:33.326127 #3737750] INFO -- : /tmp/ruby/src/trunk/.bundle/.timestamp/power_assert.revision unchanged I, [2024-05-03T05:56:33.326327 #3737750] INFO -- : /tmp/ruby/src/trunk/.bundle/.timestamp/minitest.revision unchanged I, [2024-05-03T05:56:33.326448 #3737750] INFO -- : /tmp/ruby/src/trunk/.bundle/.timestamp/rbs.revision unchanged I, [2024-05-03T05:56:33.326941 #3737750] INFO -- : /tmp/ruby/src/trunk/.bundle/.timestamp/typeprof.revision unchanged I, [2024-05-03T05:56:33.327423 #3737750] INFO -- : Building power_assert@84e85124c5014a139af39161d484156cfe87a9ed to /tmp/ruby/src/trunk/gems/power_assert-2.0.3.gem I, [2024-05-03T05:56:33.396928 #3737750] INFO -- : Successfully built RubyGem I, [2024-05-03T05:56:33.396997 #3737750] INFO -- : Name: power_assert I, [2024-05-03T05:56:33.397022 #3737750] INFO -- : Version: 2.0.4dev I, [2024-05-03T05:56:33.397038 #3737750] INFO -- : File: power_assert-2.0.4dev.gem I, [2024-05-03T05:56:33.443734 #3737750] INFO -- : $$$[end] "make update-download -j20" exit with 0. I, [2024-05-03T05:56:33.443777 #3737750] INFO -- : $$$[beg] make update-rubyspec -j20 I, [2024-05-03T05:56:33.500986 #3737750] INFO -- : make: Nothing to be done for 'update-rubyspec'. I, [2024-05-03T05:56:33.501253 #3737750] INFO -- : $$$[end] "make update-rubyspec -j20" exit with 0. I, [2024-05-03T05:56:33.501285 #3737750] INFO -- : $$$[beg] make update-src -j20 I, [2024-05-03T05:56:34.010048 #3737750] INFO -- : Already up to date. I, [2024-05-03T05:56:34.019421 #3737750] INFO -- : Latest commit hash = 9f8e87c44b I, [2024-05-03T05:56:34.020571 #3737750] INFO -- : $$$[end] "make update-src -j20" exit with 0. I, [2024-05-03T05:56:34.020611 #3737750] INFO -- : $$$[beg] make after-update -j20 I, [2024-05-03T05:56:34.089514 #3737750] INFO -- : generating /tmp/ruby/src/trunk/ext/ripper/eventids2table.c I, [2024-05-03T05:56:34.093737 #3737750] INFO -- : make[1]: Entering directory '/tmp/ruby/src/trunk/ext/ripper' I, [2024-05-03T05:56:34.093787 #3737750] INFO -- : make[1]: Nothing to be done for 'src'. I, [2024-05-03T05:56:34.093799 #3737750] INFO -- : make[1]: Leaving directory '/tmp/ruby/src/trunk/ext/ripper' I, [2024-05-03T05:56:34.109882 #3737750] INFO -- : /tmp/ruby/src/trunk/revision.h updated I, [2024-05-03T05:56:34.111144 #3737750] INFO -- : generating x86_64-linux-fake.rb I, [2024-05-03T05:56:34.162348 #3737750] INFO -- : x86_64-linux-fake.rb updated I, [2024-05-03T05:56:34.163856 #3737750] INFO -- : generating enc.mk I, [2024-05-03T05:56:34.281101 #3737750] INFO -- : making srcs under enc I, [2024-05-03T05:56:34.310967 #3737750] INFO -- : make[1]: Entering directory '/tmp/ruby/build/trunk' I, [2024-05-03T05:56:34.311048 #3737750] INFO -- : make[1]: Nothing to be done for 'srcs'. I, [2024-05-03T05:56:34.311061 #3737750] INFO -- : make[1]: Leaving directory '/tmp/ruby/build/trunk' I, [2024-05-03T05:56:34.356162 #3737750] INFO -- : Update minitest to ea9caafc0754b1d6236a490d59e624b53209734a I, [2024-05-03T05:56:34.356212 #3737750] INFO -- : Update power_assert to 84e85124c5014a139af39161d484156cfe87a9ed I, [2024-05-03T05:56:34.356479 #3737750] INFO -- : Update rbs to ba7872795d5de04adb8ff500c0e6afdc81a041dd I, [2024-05-03T05:56:34.357332 #3737750] INFO -- : Update typeprof to b19a6416da3a05d57fadd6ffdadb382b6d236ca5 I, [2024-05-03T05:56:34.357915 #3737750] INFO -- : echo ea9caafc0754b1d6236a490d59e624b53209734a | /bin/sh /tmp/ruby/src/trunk/tool/ifchange /tmp/ruby/src/trunk/.bundle/.timestamp/minitest.revision - I, [2024-05-03T05:56:34.357965 #3737750] INFO -- : echo 84e85124c5014a139af39161d484156cfe87a9ed | /bin/sh /tmp/ruby/src/trunk/tool/ifchange /tmp/ruby/src/trunk/.bundle/.timestamp/power_assert.revision - I, [2024-05-03T05:56:34.358278 #3737750] INFO -- : echo ba7872795d5de04adb8ff500c0e6afdc81a041dd | /bin/sh /tmp/ruby/src/trunk/tool/ifchange /tmp/ruby/src/trunk/.bundle/.timestamp/rbs.revision - I, [2024-05-03T05:56:34.359373 #3737750] INFO -- : echo b19a6416da3a05d57fadd6ffdadb382b6d236ca5 | /bin/sh /tmp/ruby/src/trunk/tool/ifchange /tmp/ruby/src/trunk/.bundle/.timestamp/typeprof.revision - I, [2024-05-03T05:56:34.359794 #3737750] INFO -- : /tmp/ruby/src/trunk/.bundle/.timestamp/minitest.revision unchanged I, [2024-05-03T05:56:34.359824 #3737750] INFO -- : /tmp/ruby/src/trunk/.bundle/.timestamp/power_assert.revision unchanged I, [2024-05-03T05:56:34.359861 #3737750] INFO -- : /tmp/ruby/src/trunk/.bundle/.timestamp/rbs.revision unchanged I, [2024-05-03T05:56:34.360953 #3737750] INFO -- : Building power_assert@84e85124c5014a139af39161d484156cfe87a9ed to /tmp/ruby/src/trunk/gems/power_assert-2.0.3.gem I, [2024-05-03T05:56:34.361102 #3737750] INFO -- : /tmp/ruby/src/trunk/.bundle/.timestamp/typeprof.revision unchanged I, [2024-05-03T05:56:34.429874 #3737750] INFO -- : Successfully built RubyGem I, [2024-05-03T05:56:34.429933 #3737750] INFO -- : Name: power_assert I, [2024-05-03T05:56:34.429945 #3737750] INFO -- : Version: 2.0.4dev I, [2024-05-03T05:56:34.429961 #3737750] INFO -- : File: power_assert-2.0.4dev.gem I, [2024-05-03T05:56:34.432106 #3737750] INFO -- : Extracting bundle gem power_assert-2.0.3... I, [2024-05-03T05:56:34.494272 #3737750] INFO -- : Try with hash version of bundled gems instead of gems/power_assert-2.0.3.gem. We don't use this gem with release version of Ruby. I, [2024-05-03T05:56:34.499260 #3737750] INFO -- : Unpacked gems/power_assert-2.0.4dev.gem I, [2024-05-03T05:56:34.501299 #3737750] INFO -- : $$$[end] "make after-update -j20" exit with 0. I, [2024-05-03T05:56:34.501442 #3737750] INFO -- : $$$[beg] make miniruby -j20 I, [2024-05-03T05:56:34.559075 #3737750] INFO -- : BASERUBY = /usr/bin/ruby --disable=gems I, [2024-05-03T05:56:34.559115 #3737750] INFO -- : CC = gcc I, [2024-05-03T05:56:34.559127 #3737750] INFO -- : LD = ld I, [2024-05-03T05:56:34.559138 #3737750] INFO -- : LDSHARED = gcc -shared I, [2024-05-03T05:56:34.559148 #3737750] INFO -- : CFLAGS = -O3 -fno-fast-math -ggdb3 -Wall -Wextra -Wdeprecated-declarations -Wdiv-by-zero -Wduplicated-cond -Wimplicit-function-declaration -Wimplicit-int -Wpointer-arith -Wwrite-strings -Wold-style-definition -Wimplicit-fallthrough=0 -Wmissing-noreturn -Wno-cast-function-type -Wno-constant-logical-operand -Wno-long-long -Wno-missing-field-initializers -Wno-overlength-strings -Wno-packed-bitfield-compat -Wno-parentheses-equality -Wno-self-assign -Wno-tautological-compare -Wno-unused-parameter -Wno-unused-value -Wsuggest-attribute=format -Wsuggest-attribute=noreturn -Wunused-variable -Wmisleading-indentation -Wundef -fPIC I, [2024-05-03T05:56:34.559158 #3737750] INFO -- : XCFLAGS = -U_FORTIFY_SOURCE -D_FORTIFY_SOURCE=2 -fstack-protector-strong -fno-strict-overflow -fvisibility=hidden -fexcess-precision=standard -DRUBY_EXPORT -I. -I.ext/include/x86_64-linux -I/tmp/ruby/src/trunk/include -I/tmp/ruby/src/trunk -I/tmp/ruby/src/trunk/prism -I/tmp/ruby/src/trunk/enc/unicode/15.0.0 I, [2024-05-03T05:56:34.559177 #3737750] INFO -- : CPPFLAGS = I, [2024-05-03T05:56:34.559188 #3737750] INFO -- : DLDFLAGS = -Wl,--compress-debug-sections=zlib -Wl,-soname,libruby.so.3.4 -fstack-protector-strong I, [2024-05-03T05:56:34.559198 #3737750] INFO -- : SOLIBS = -lz -lrt -lrt -lgmp -ldl -lcrypt -lm -lpthread I, [2024-05-03T05:56:34.559208 #3737750] INFO -- : LANG = en_US.UTF-8 I, [2024-05-03T05:56:34.559217 #3737750] INFO -- : LC_ALL = I, [2024-05-03T05:56:34.559227 #3737750] INFO -- : LC_CTYPE = I, [2024-05-03T05:56:34.559236 #3737750] INFO -- : MFLAGS = -j20 --jobserver-auth=4,5 I, [2024-05-03T05:56:34.559245 #3737750] INFO -- : RUSTC = no I, [2024-05-03T05:56:34.559255 #3737750] INFO -- : YJIT_RUSTC_ARGS = --crate-name=yjit --crate-type=staticlib --edition=2021 -g -C lto=thin -C opt-level=3 -C overflow-checks=on '--out-dir=/tmp/ruby/build/trunk/yjit/target/release/' /tmp/ruby/src/trunk/yjit/src/lib.rs I, [2024-05-03T05:56:34.560443 #3737750] INFO -- : gcc (Ubuntu 11.4.0-1ubuntu1~22.04) 11.4.0 I, [2024-05-03T05:56:34.560485 #3737750] INFO -- : Copyright (C) 2021 Free Software Foundation, Inc. I, [2024-05-03T05:56:34.560497 #3737750] INFO -- : This is free software; see the source for copying conditions. There is NO I, [2024-05-03T05:56:34.560508 #3737750] INFO -- : warranty; not even for MERCHANTABILITY or FITNESS FOR A PARTICULAR PURPOSE. I, [2024-05-03T05:56:34.560518 #3737750] INFO -- : I, [2024-05-03T05:56:34.581808 #3737750] INFO -- : compiling /tmp/ruby/src/trunk/version.c I, [2024-05-03T05:56:34.685147 #3737750] INFO -- : linking miniruby I, [2024-05-03T05:56:35.213122 #3737750] INFO -- : $$$[end] "make miniruby -j20" exit with 0. I, [2024-05-03T05:56:35.213242 #3737750] INFO -- : $$$[beg] make ruby -j20 I, [2024-05-03T05:56:35.270569 #3737750] INFO -- : BASERUBY = /usr/bin/ruby --disable=gems I, [2024-05-03T05:56:35.270608 #3737750] INFO -- : CC = gcc I, [2024-05-03T05:56:35.270621 #3737750] INFO -- : LD = ld I, [2024-05-03T05:56:35.270631 #3737750] INFO -- : LDSHARED = gcc -shared I, [2024-05-03T05:56:35.270647 #3737750] INFO -- : CFLAGS = -O3 -fno-fast-math -ggdb3 -Wall -Wextra -Wdeprecated-declarations -Wdiv-by-zero -Wduplicated-cond -Wimplicit-function-declaration -Wimplicit-int -Wpointer-arith -Wwrite-strings -Wold-style-definition -Wimplicit-fallthrough=0 -Wmissing-noreturn -Wno-cast-function-type -Wno-constant-logical-operand -Wno-long-long -Wno-missing-field-initializers -Wno-overlength-strings -Wno-packed-bitfield-compat -Wno-parentheses-equality -Wno-self-assign -Wno-tautological-compare -Wno-unused-parameter -Wno-unused-value -Wsuggest-attribute=format -Wsuggest-attribute=noreturn -Wunused-variable -Wmisleading-indentation -Wundef -fPIC I, [2024-05-03T05:56:35.270659 #3737750] INFO -- : XCFLAGS = -U_FORTIFY_SOURCE -D_FORTIFY_SOURCE=2 -fstack-protector-strong -fno-strict-overflow -fvisibility=hidden -fexcess-precision=standard -DRUBY_EXPORT -I. -I.ext/include/x86_64-linux -I/tmp/ruby/src/trunk/include -I/tmp/ruby/src/trunk -I/tmp/ruby/src/trunk/prism -I/tmp/ruby/src/trunk/enc/unicode/15.0.0 I, [2024-05-03T05:56:35.270670 #3737750] INFO -- : CPPFLAGS = I, [2024-05-03T05:56:35.270680 #3737750] INFO -- : DLDFLAGS = -Wl,--compress-debug-sections=zlib -Wl,-soname,libruby.so.3.4 -fstack-protector-strong I, [2024-05-03T05:56:35.270690 #3737750] INFO -- : SOLIBS = -lz -lrt -lrt -lgmp -ldl -lcrypt -lm -lpthread I, [2024-05-03T05:56:35.270700 #3737750] INFO -- : LANG = en_US.UTF-8 I, [2024-05-03T05:56:35.270710 #3737750] INFO -- : LC_ALL = I, [2024-05-03T05:56:35.270719 #3737750] INFO -- : LC_CTYPE = I, [2024-05-03T05:56:35.270729 #3737750] INFO -- : MFLAGS = -j20 --jobserver-auth=4,5 I, [2024-05-03T05:56:35.270739 #3737750] INFO -- : RUSTC = no I, [2024-05-03T05:56:35.270749 #3737750] INFO -- : YJIT_RUSTC_ARGS = --crate-name=yjit --crate-type=staticlib --edition=2021 -g -C lto=thin -C opt-level=3 -C overflow-checks=on '--out-dir=/tmp/ruby/build/trunk/yjit/target/release/' /tmp/ruby/src/trunk/yjit/src/lib.rs I, [2024-05-03T05:56:35.271939 #3737750] INFO -- : gcc (Ubuntu 11.4.0-1ubuntu1~22.04) 11.4.0 I, [2024-05-03T05:56:35.271981 #3737750] INFO -- : Copyright (C) 2021 Free Software Foundation, Inc. I, [2024-05-03T05:56:35.271994 #3737750] INFO -- : This is free software; see the source for copying conditions. There is NO I, [2024-05-03T05:56:35.272005 #3737750] INFO -- : warranty; not even for MERCHANTABILITY or FITNESS FOR A PARTICULAR PURPOSE. I, [2024-05-03T05:56:35.272015 #3737750] INFO -- : I, [2024-05-03T05:56:35.379618 #3737750] INFO -- : builtin_binary.inc updated I, [2024-05-03T05:56:35.383944 #3737750] INFO -- : c5234a9416e4f20f175185e840b25b0f08674d14078ed7083f37e655458e3ca9 builtin_binary.inc I, [2024-05-03T05:56:35.384633 #3737750] INFO -- : compiling /tmp/ruby/src/trunk/builtin.c I, [2024-05-03T05:56:35.569101 #3737750] INFO -- : linking static-library libruby-static.a I, [2024-05-03T05:56:35.880569 #3737750] INFO -- : linking shared-library libruby.so.3.4.0 I, [2024-05-03T05:56:37.435814 #3737750] INFO -- : linking ruby I, [2024-05-03T05:56:37.459083 #3737750] INFO -- : $$$[end] "make ruby -j20" exit with 0. I, [2024-05-03T05:56:37.459238 #3737750] INFO -- : $$$[beg] make all -j20 I, [2024-05-03T05:56:37.516074 #3737750] INFO -- : BASERUBY = /usr/bin/ruby --disable=gems I, [2024-05-03T05:56:37.516125 #3737750] INFO -- : CC = gcc I, [2024-05-03T05:56:37.516140 #3737750] INFO -- : LD = ld I, [2024-05-03T05:56:37.516150 #3737750] INFO -- : LDSHARED = gcc -shared I, [2024-05-03T05:56:37.516164 #3737750] INFO -- : CFLAGS = -O3 -fno-fast-math -ggdb3 -Wall -Wextra -Wdeprecated-declarations -Wdiv-by-zero -Wduplicated-cond -Wimplicit-function-declaration -Wimplicit-int -Wpointer-arith -Wwrite-strings -Wold-style-definition -Wimplicit-fallthrough=0 -Wmissing-noreturn -Wno-cast-function-type -Wno-constant-logical-operand -Wno-long-long -Wno-missing-field-initializers -Wno-overlength-strings -Wno-packed-bitfield-compat -Wno-parentheses-equality -Wno-self-assign -Wno-tautological-compare -Wno-unused-parameter -Wno-unused-value -Wsuggest-attribute=format -Wsuggest-attribute=noreturn -Wunused-variable -Wmisleading-indentation -Wundef -fPIC I, [2024-05-03T05:56:37.516176 #3737750] INFO -- : XCFLAGS = -U_FORTIFY_SOURCE -D_FORTIFY_SOURCE=2 -fstack-protector-strong -fno-strict-overflow -fvisibility=hidden -fexcess-precision=standard -DRUBY_EXPORT -I. -I.ext/include/x86_64-linux -I/tmp/ruby/src/trunk/include -I/tmp/ruby/src/trunk -I/tmp/ruby/src/trunk/prism -I/tmp/ruby/src/trunk/enc/unicode/15.0.0 I, [2024-05-03T05:56:37.516186 #3737750] INFO -- : CPPFLAGS = I, [2024-05-03T05:56:37.516196 #3737750] INFO -- : DLDFLAGS = -Wl,--compress-debug-sections=zlib -Wl,-soname,libruby.so.3.4 -fstack-protector-strong I, [2024-05-03T05:56:37.516206 #3737750] INFO -- : SOLIBS = -lz -lrt -lrt -lgmp -ldl -lcrypt -lm -lpthread I, [2024-05-03T05:56:37.516216 #3737750] INFO -- : LANG = en_US.UTF-8 I, [2024-05-03T05:56:37.516325 #3737750] INFO -- : LC_ALL = I, [2024-05-03T05:56:37.516356 #3737750] INFO -- : LC_CTYPE = I, [2024-05-03T05:56:37.516362 #3737750] INFO -- : MFLAGS = -j20 --jobserver-auth=4,5 I, [2024-05-03T05:56:37.516366 #3737750] INFO -- : RUSTC = no I, [2024-05-03T05:56:37.516374 #3737750] INFO -- : YJIT_RUSTC_ARGS = --crate-name=yjit --crate-type=staticlib --edition=2021 -g -C lto=thin -C opt-level=3 -C overflow-checks=on '--out-dir=/tmp/ruby/build/trunk/yjit/target/release/' /tmp/ruby/src/trunk/yjit/src/lib.rs I, [2024-05-03T05:56:37.517418 #3737750] INFO -- : gcc (Ubuntu 11.4.0-1ubuntu1~22.04) 11.4.0 I, [2024-05-03T05:56:37.517438 #3737750] INFO -- : Copyright (C) 2021 Free Software Foundation, Inc. I, [2024-05-03T05:56:37.517443 #3737750] INFO -- : This is free software; see the source for copying conditions. There is NO I, [2024-05-03T05:56:37.517448 #3737750] INFO -- : warranty; not even for MERCHANTABILITY or FITNESS FOR A PARTICULAR PURPOSE. I, [2024-05-03T05:56:37.517458 #3737750] INFO -- : I, [2024-05-03T05:56:37.546743 #3737750] INFO -- : generating enc.mk I, [2024-05-03T05:56:37.548504 #3737750] INFO -- : building spec/ruby/optional/capi/ext/array_spec.so I, [2024-05-03T05:56:37.548784 #3737750] INFO -- : building spec/ruby/optional/capi/ext/basic_object_spec.so I, [2024-05-03T05:56:37.549556 #3737750] INFO -- : building spec/ruby/optional/capi/ext/bignum_spec.so I, [2024-05-03T05:56:37.550227 #3737750] INFO -- : building spec/ruby/optional/capi/ext/binding_spec.so I, [2024-05-03T05:56:37.550614 #3737750] INFO -- : building spec/ruby/optional/capi/ext/boolean_spec.so I, [2024-05-03T05:56:37.551345 #3737750] INFO -- : building spec/ruby/optional/capi/ext/class_id_under_autoload_spec.so I, [2024-05-03T05:56:37.552140 #3737750] INFO -- : building spec/ruby/optional/capi/ext/class_spec.so I, [2024-05-03T05:56:37.552969 #3737750] INFO -- : building spec/ruby/optional/capi/ext/class_under_autoload_spec.so I, [2024-05-03T05:56:37.553747 #3737750] INFO -- : building spec/ruby/optional/capi/ext/complex_spec.so I, [2024-05-03T05:56:37.554379 #3737750] INFO -- : building spec/ruby/optional/capi/ext/constants_spec.so I, [2024-05-03T05:56:37.554728 #3737750] INFO -- : building spec/ruby/optional/capi/ext/data_spec.so I, [2024-05-03T05:56:37.555382 #3737750] INFO -- : building spec/ruby/optional/capi/ext/debug_spec.so I, [2024-05-03T05:56:37.555972 #3737750] INFO -- : building spec/ruby/optional/capi/ext/encoding_spec.so I, [2024-05-03T05:56:37.556220 #3737750] INFO -- : building spec/ruby/optional/capi/ext/enumerator_spec.so I, [2024-05-03T05:56:37.556956 #3737750] INFO -- : building spec/ruby/optional/capi/ext/exception_spec.so I, [2024-05-03T05:56:37.557666 #3737750] INFO -- : building spec/ruby/optional/capi/ext/fiber_spec.so I, [2024-05-03T05:56:37.557991 #3737750] INFO -- : building spec/ruby/optional/capi/ext/file_spec.so I, [2024-05-03T05:56:37.572633 #3737750] INFO -- : building spec/ruby/optional/capi/ext/fixnum_spec.so I, [2024-05-03T05:56:37.629175 #3737750] INFO -- : building spec/ruby/optional/capi/ext/float_spec.so I, [2024-05-03T05:56:37.648679 #3737750] INFO -- : building spec/ruby/optional/capi/ext/gc_spec.so I, [2024-05-03T05:56:37.661061 #3737750] INFO -- : building spec/ruby/optional/capi/ext/globals_spec.so I, [2024-05-03T05:56:37.687701 #3737750] INFO -- : building spec/ruby/optional/capi/ext/hash_spec.so I, [2024-05-03T05:56:37.687976 #3737750] INFO -- : building spec/ruby/optional/capi/ext/integer_spec.so I, [2024-05-03T05:56:37.708763 #3737750] INFO -- : building spec/ruby/optional/capi/ext/io_spec.so I, [2024-05-03T05:56:37.711298 #3737750] INFO -- : building spec/ruby/optional/capi/ext/kernel_spec.so I, [2024-05-03T05:56:37.733646 #3737750] INFO -- : building spec/ruby/optional/capi/ext/language_spec.so I, [2024-05-03T05:56:37.734095 #3737750] INFO -- : building spec/ruby/optional/capi/ext/marshal_spec.so I, [2024-05-03T05:56:37.740437 #3737750] INFO -- : building spec/ruby/optional/capi/ext/module_spec.so I, [2024-05-03T05:56:37.745294 #3737750] INFO -- : building spec/ruby/optional/capi/ext/module_under_autoload_spec.so I, [2024-05-03T05:56:37.764959 #3737750] INFO -- : building spec/ruby/optional/capi/ext/mutex_spec.so I, [2024-05-03T05:56:37.766854 #3737750] INFO -- : building spec/ruby/optional/capi/ext/numeric_spec.so I, [2024-05-03T05:56:37.768594 #3737750] INFO -- : building spec/ruby/optional/capi/ext/object_spec.so I, [2024-05-03T05:56:37.790163 #3737750] INFO -- : building spec/ruby/optional/capi/ext/range_spec.so I, [2024-05-03T05:56:37.790321 #3737750] INFO -- : building spec/ruby/optional/capi/ext/proc_spec.so I, [2024-05-03T05:56:37.797322 #3737750] INFO -- : building spec/ruby/optional/capi/ext/rational_spec.so I, [2024-05-03T05:56:37.807024 #3737750] INFO -- : building spec/ruby/optional/capi/ext/rbasic_spec.so I, [2024-05-03T05:56:37.814973 #3737750] INFO -- : building spec/ruby/optional/capi/ext/regexp_spec.so I, [2024-05-03T05:56:37.820262 #3737750] INFO -- : building spec/ruby/optional/capi/ext/string_spec.so I, [2024-05-03T05:56:37.837974 #3737750] INFO -- : building spec/ruby/optional/capi/ext/struct_spec.so I, [2024-05-03T05:56:37.857679 #3737750] INFO -- : building spec/ruby/optional/capi/ext/st_spec.so I, [2024-05-03T05:56:37.859586 #3737750] INFO -- : building spec/ruby/optional/capi/ext/symbol_spec.so I, [2024-05-03T05:56:37.873565 #3737750] INFO -- : building spec/ruby/optional/capi/ext/thread_spec.so I, [2024-05-03T05:56:37.897613 #3737750] INFO -- : building spec/ruby/optional/capi/ext/time_spec.so I, [2024-05-03T05:56:37.919540 #3737750] INFO -- : building spec/ruby/optional/capi/ext/tracepoint_spec.so I, [2024-05-03T05:56:37.932857 #3737750] INFO -- : building spec/ruby/optional/capi/ext/typed_data_spec.so I, [2024-05-03T05:56:37.948344 #3737750] INFO -- : building spec/ruby/optional/capi/ext/util_spec.so I, [2024-05-03T05:56:37.955040 #3737750] INFO -- : making enc I, [2024-05-03T05:56:37.958139 #3737750] INFO -- : making srcs under enc I, [2024-05-03T05:56:37.981625 #3737750] INFO -- : make[1]: Entering directory '/tmp/ruby/build/trunk' I, [2024-05-03T05:56:37.981685 #3737750] INFO -- : make[1]: Nothing to be done for 'enc'. I, [2024-05-03T05:56:37.981694 #3737750] INFO -- : make[1]: Leaving directory '/tmp/ruby/build/trunk' I, [2024-05-03T05:56:38.007177 #3737750] INFO -- : make[1]: Entering directory '/tmp/ruby/build/trunk' I, [2024-05-03T05:56:38.007235 #3737750] INFO -- : make[1]: Nothing to be done for 'srcs'. I, [2024-05-03T05:56:38.007244 #3737750] INFO -- : make[1]: Leaving directory '/tmp/ruby/build/trunk' I, [2024-05-03T05:56:38.008168 #3737750] INFO -- : generating transdb.h I, [2024-05-03T05:56:38.116066 #3737750] INFO -- : transdb.h unchanged I, [2024-05-03T05:56:38.117562 #3737750] INFO -- : generating makefiles ext/configure-ext.mk I, [2024-05-03T05:56:38.117876 #3737750] INFO -- : making trans I, [2024-05-03T05:56:38.144190 #3737750] INFO -- : ext/configure-ext.mk updated I, [2024-05-03T05:56:38.146890 #3737750] INFO -- : make[1]: Entering directory '/tmp/ruby/build/trunk' I, [2024-05-03T05:56:38.151739 #3737750] INFO -- : make[1]: Entering directory '/tmp/ruby/build/trunk' I, [2024-05-03T05:56:38.151827 #3737750] INFO -- : make[1]: Nothing to be done for 'trans'. I, [2024-05-03T05:56:38.151839 #3737750] INFO -- : make[1]: Leaving directory '/tmp/ruby/build/trunk' I, [2024-05-03T05:56:38.152781 #3737750] INFO -- : making encs I, [2024-05-03T05:56:38.210397 #3737750] INFO -- : make[1]: Entering directory '/tmp/ruby/build/trunk' I, [2024-05-03T05:56:38.210474 #3737750] INFO -- : make[1]: Nothing to be done for 'encs'. I, [2024-05-03T05:56:38.210499 #3737750] INFO -- : make[1]: Leaving directory '/tmp/ruby/build/trunk' I, [2024-05-03T05:56:38.304757 #3737750] INFO -- : make[1]: Leaving directory '/tmp/ruby/build/trunk' I, [2024-05-03T05:56:38.305626 #3737750] INFO -- : generating makefile exts.mk I, [2024-05-03T05:56:38.344000 #3737750] INFO -- : exts.mk unchanged I, [2024-05-03T05:56:38.349135 #3737750] INFO -- : make[1]: Entering directory '/tmp/ruby/build/trunk' I, [2024-05-03T05:56:38.370070 #3737750] INFO -- : make[2]: Entering directory '/tmp/ruby/build/trunk/ext/digest' I, [2024-05-03T05:56:38.371826 #3737750] INFO -- : make[2]: Entering directory '/tmp/ruby/build/trunk/ext/coverage' I, [2024-05-03T05:56:38.371857 #3737750] INFO -- : make[2]: Entering directory '/tmp/ruby/build/trunk/ext/io/console' I, [2024-05-03T05:56:38.372057 #3737750] INFO -- : make[2]: Entering directory '/tmp/ruby/build/trunk/ext/json' I, [2024-05-03T05:56:38.372565 #3737750] INFO -- : make[2]: Entering directory '/tmp/ruby/build/trunk/ext/date' I, [2024-05-03T05:56:38.374045 #3737750] INFO -- : make[2]: Entering directory '/tmp/ruby/build/trunk/ext/monitor' I, [2024-05-03T05:56:38.374332 #3737750] INFO -- : make[2]: Leaving directory '/tmp/ruby/build/trunk/ext/digest' I, [2024-05-03T05:56:38.374357 #3737750] INFO -- : make[2]: Entering directory '/tmp/ruby/build/trunk/ext/rubyvm' I, [2024-05-03T05:56:38.374371 #3737750] INFO -- : make[2]: Entering directory '/tmp/ruby/build/trunk/ext/pathname' I, [2024-05-03T05:56:38.374524 #3737750] INFO -- : make[2]: Entering directory '/tmp/ruby/build/trunk/ext/fiddle' I, [2024-05-03T05:56:38.374552 #3737750] INFO -- : make[2]: Leaving directory '/tmp/ruby/build/trunk/ext/io/console' I, [2024-05-03T05:56:38.375528 #3737750] INFO -- : make[2]: Entering directory '/tmp/ruby/build/trunk/ext/pty' I, [2024-05-03T05:56:38.375770 #3737750] INFO -- : make[2]: Leaving directory '/tmp/ruby/build/trunk/ext/coverage' I, [2024-05-03T05:56:38.376233 #3737750] INFO -- : make[2]: Leaving directory '/tmp/ruby/build/trunk/ext/date' I, [2024-05-03T05:56:38.376262 #3737750] INFO -- : make[2]: Entering directory '/tmp/ruby/build/trunk/ext/objspace' I, [2024-05-03T05:56:38.376782 #3737750] INFO -- : make[2]: Leaving directory '/tmp/ruby/build/trunk/ext/rubyvm' I, [2024-05-03T05:56:38.377061 #3737750] INFO -- : make[2]: Entering directory '/tmp/ruby/build/trunk/ext/psych' I, [2024-05-03T05:56:38.377083 #3737750] INFO -- : make[2]: Entering directory '/tmp/ruby/build/trunk/.bundle/gems/bigdecimal-3.1.7/ext/bigdecimal' I, [2024-05-03T05:56:38.377133 #3737750] INFO -- : make[2]: Leaving directory '/tmp/ruby/build/trunk/ext/monitor' I, [2024-05-03T05:56:38.377409 #3737750] INFO -- : make[2]: Leaving directory '/tmp/ruby/build/trunk/ext/pathname' I, [2024-05-03T05:56:38.378215 #3737750] INFO -- : make[2]: Leaving directory '/tmp/ruby/build/trunk/ext/pty' I, [2024-05-03T05:56:38.378335 #3737750] INFO -- : make[2]: Entering directory '/tmp/ruby/build/trunk/.bundle/gems/debug-1.9.2/ext/debug' I, [2024-05-03T05:56:38.379760 #3737750] INFO -- : make[2]: Entering directory '/tmp/ruby/build/trunk/.bundle/gems/nkf-0.2.0/ext/nkf' I, [2024-05-03T05:56:38.379998 #3737750] INFO -- : make[2]: Entering directory '/tmp/ruby/build/trunk/ext/ripper' I, [2024-05-03T05:56:38.380367 #3737750] INFO -- : make[2]: Leaving directory '/tmp/ruby/build/trunk/ext/json' I, [2024-05-03T05:56:38.380784 #3737750] INFO -- : make[2]: Entering directory '/tmp/ruby/build/trunk/.bundle/gems/racc-1.7.3/ext/racc/cparse' I, [2024-05-03T05:56:38.380920 #3737750] INFO -- : make[2]: Entering directory '/tmp/ruby/build/trunk/.bundle/gems/syslog-0.1.2/ext/syslog' I, [2024-05-03T05:56:38.380961 #3737750] INFO -- : make[2]: Leaving directory '/tmp/ruby/build/trunk/ext/fiddle' I, [2024-05-03T05:56:38.380986 #3737750] INFO -- : make[2]: Leaving directory '/tmp/ruby/build/trunk/ext/objspace' I, [2024-05-03T05:56:38.381580 #3737750] INFO -- : make[2]: Entering directory '/tmp/ruby/build/trunk/.bundle/gems/rbs-3.4.4/ext/rbs_extension' I, [2024-05-03T05:56:38.384610 #3737750] INFO -- : make[2]: Entering directory '/tmp/ruby/build/trunk/ext/socket' I, [2024-05-03T05:56:38.385386 #3737750] INFO -- : make[2]: Leaving directory '/tmp/ruby/build/trunk/ext/ripper' I, [2024-05-03T05:56:38.386132 #3737750] INFO -- : make[2]: Entering directory '/tmp/ruby/build/trunk/ext/digest/sha2' I, [2024-05-03T05:56:38.388237 #3737750] INFO -- : make[2]: Leaving directory '/tmp/ruby/build/trunk/ext/digest/sha2' I, [2024-05-03T05:56:38.388262 #3737750] INFO -- : make[2]: Entering directory '/tmp/ruby/build/trunk/ext/openssl' I, [2024-05-03T05:56:38.389304 #3737750] INFO -- : make[2]: Leaving directory '/tmp/ruby/build/trunk/ext/psych' I, [2024-05-03T05:56:38.393213 #3737750] INFO -- : make[2]: Leaving directory '/tmp/ruby/build/trunk/ext/socket' I, [2024-05-03T05:56:38.399371 #3737750] INFO -- : make[2]: Leaving directory '/tmp/ruby/build/trunk/ext/openssl' I, [2024-05-03T05:56:38.402051 #3737750] INFO -- : make[2]: Leaving directory '/tmp/ruby/build/trunk/.bundle/gems/nkf-0.2.0/ext/nkf' I, [2024-05-03T05:56:38.404027 #3737750] INFO -- : make[2]: Leaving directory '/tmp/ruby/build/trunk/.bundle/gems/rbs-3.4.4/ext/rbs_extension' I, [2024-05-03T05:56:38.404213 #3737750] INFO -- : make[2]: Leaving directory '/tmp/ruby/build/trunk/.bundle/gems/syslog-0.1.2/ext/syslog' I, [2024-05-03T05:56:38.411924 #3737750] INFO -- : make[2]: Leaving directory '/tmp/ruby/build/trunk/.bundle/gems/debug-1.9.2/ext/debug' I, [2024-05-03T05:56:38.412328 #3737750] INFO -- : make[2]: Leaving directory '/tmp/ruby/build/trunk/.bundle/gems/bigdecimal-3.1.7/ext/bigdecimal' I, [2024-05-03T05:56:38.412366 #3737750] INFO -- : make[2]: Leaving directory '/tmp/ruby/build/trunk/.bundle/gems/racc-1.7.3/ext/racc/cparse' I, [2024-05-03T05:56:38.435973 #3737750] INFO -- : make[2]: Entering directory '/tmp/ruby/build/trunk' I, [2024-05-03T05:56:38.502284 #3737750] INFO -- : linking ruby I, [2024-05-03T05:56:38.525190 #3737750] INFO -- : make[2]: Leaving directory '/tmp/ruby/build/trunk' I, [2024-05-03T05:56:38.525680 #3737750] INFO -- : make[1]: Leaving directory '/tmp/ruby/build/trunk' I, [2024-05-03T05:56:38.529498 #3737750] INFO -- : make[1]: Entering directory '/tmp/ruby/build/trunk' I, [2024-05-03T05:56:38.529508 #3737750] INFO -- : make[1]: Nothing to be done for 'note'. I, [2024-05-03T05:56:38.529514 #3737750] INFO -- : make[1]: Leaving directory '/tmp/ruby/build/trunk' I, [2024-05-03T05:56:38.530344 #3737750] INFO -- : $$$[end] "make all -j20" exit with 0. I, [2024-05-03T05:56:38.530517 #3737750] INFO -- : $$$[beg] make install -j20 I, [2024-05-03T05:56:38.594438 #3737750] INFO -- : Update minitest to ea9caafc0754b1d6236a490d59e624b53209734a I, [2024-05-03T05:56:38.594682 #3737750] INFO -- : Update power_assert to 84e85124c5014a139af39161d484156cfe87a9ed I, [2024-05-03T05:56:38.595140 #3737750] INFO -- : Update rbs to ba7872795d5de04adb8ff500c0e6afdc81a041dd I, [2024-05-03T05:56:38.595270 #3737750] INFO -- : Update typeprof to b19a6416da3a05d57fadd6ffdadb382b6d236ca5 I, [2024-05-03T05:56:38.596532 #3737750] INFO -- : echo ea9caafc0754b1d6236a490d59e624b53209734a | /bin/sh /tmp/ruby/src/trunk/tool/ifchange /tmp/ruby/src/trunk/.bundle/.timestamp/minitest.revision - I, [2024-05-03T05:56:38.596759 #3737750] INFO -- : echo 84e85124c5014a139af39161d484156cfe87a9ed | /bin/sh /tmp/ruby/src/trunk/tool/ifchange /tmp/ruby/src/trunk/.bundle/.timestamp/power_assert.revision - I, [2024-05-03T05:56:38.597991 #3737750] INFO -- : BASERUBY = /usr/bin/ruby --disable=gems I, [2024-05-03T05:56:38.598022 #3737750] INFO -- : CC = gcc I, [2024-05-03T05:56:38.598035 #3737750] INFO -- : LD = ld I, [2024-05-03T05:56:38.598046 #3737750] INFO -- : LDSHARED = gcc -shared I, [2024-05-03T05:56:38.598057 #3737750] INFO -- : CFLAGS = -O3 -fno-fast-math -ggdb3 -Wall -Wextra -Wdeprecated-declarations -Wdiv-by-zero -Wduplicated-cond -Wimplicit-function-declaration -Wimplicit-int -Wpointer-arith -Wwrite-strings -Wold-style-definition -Wimplicit-fallthrough=0 -Wmissing-noreturn -Wno-cast-function-type -Wno-constant-logical-operand -Wno-long-long -Wno-missing-field-initializers -Wno-overlength-strings -Wno-packed-bitfield-compat -Wno-parentheses-equality -Wno-self-assign -Wno-tautological-compare -Wno-unused-parameter -Wno-unused-value -Wsuggest-attribute=format -Wsuggest-attribute=noreturn -Wunused-variable -Wmisleading-indentation -Wundef -fPIC I, [2024-05-03T05:56:38.598068 #3737750] INFO -- : XCFLAGS = -U_FORTIFY_SOURCE -D_FORTIFY_SOURCE=2 -fstack-protector-strong -fno-strict-overflow -fvisibility=hidden -fexcess-precision=standard -DRUBY_EXPORT -I. -I.ext/include/x86_64-linux -I/tmp/ruby/src/trunk/include -I/tmp/ruby/src/trunk -I/tmp/ruby/src/trunk/prism -I/tmp/ruby/src/trunk/enc/unicode/15.0.0 I, [2024-05-03T05:56:38.598080 #3737750] INFO -- : CPPFLAGS = I, [2024-05-03T05:56:38.598091 #3737750] INFO -- : DLDFLAGS = -Wl,--compress-debug-sections=zlib -Wl,-soname,libruby.so.3.4 -fstack-protector-strong I, [2024-05-03T05:56:38.598102 #3737750] INFO -- : SOLIBS = -lz -lrt -lrt -lgmp -ldl -lcrypt -lm -lpthread I, [2024-05-03T05:56:38.598112 #3737750] INFO -- : LANG = en_US.UTF-8 I, [2024-05-03T05:56:38.598122 #3737750] INFO -- : LC_ALL = I, [2024-05-03T05:56:38.598132 #3737750] INFO -- : LC_CTYPE = I, [2024-05-03T05:56:38.598153 #3737750] INFO -- : MFLAGS = -j20 --jobserver-auth=4,5 I, [2024-05-03T05:56:38.598164 #3737750] INFO -- : RUSTC = no I, [2024-05-03T05:56:38.598182 #3737750] INFO -- : YJIT_RUSTC_ARGS = --crate-name=yjit --crate-type=staticlib --edition=2021 -g -C lto=thin -C opt-level=3 -C overflow-checks=on '--out-dir=/tmp/ruby/build/trunk/yjit/target/release/' /tmp/ruby/src/trunk/yjit/src/lib.rs I, [2024-05-03T05:56:38.598672 #3737750] INFO -- : /tmp/ruby/src/trunk/.bundle/.timestamp/minitest.revision unchanged I, [2024-05-03T05:56:38.598837 #3737750] INFO -- : /tmp/ruby/src/trunk/.bundle/.timestamp/power_assert.revision unchanged I, [2024-05-03T05:56:38.628682 #3737750] INFO -- : echo ba7872795d5de04adb8ff500c0e6afdc81a041dd | /bin/sh /tmp/ruby/src/trunk/tool/ifchange /tmp/ruby/src/trunk/.bundle/.timestamp/rbs.revision - I, [2024-05-03T05:56:38.628878 #3737750] INFO -- : echo b19a6416da3a05d57fadd6ffdadb382b6d236ca5 | /bin/sh /tmp/ruby/src/trunk/tool/ifchange /tmp/ruby/src/trunk/.bundle/.timestamp/typeprof.revision - I, [2024-05-03T05:56:38.629770 #3737750] INFO -- : generating enc.mk I, [2024-05-03T05:56:38.629799 #3737750] INFO -- : gcc (Ubuntu 11.4.0-1ubuntu1~22.04) 11.4.0 I, [2024-05-03T05:56:38.629811 #3737750] INFO -- : Copyright (C) 2021 Free Software Foundation, Inc. I, [2024-05-03T05:56:38.629823 #3737750] INFO -- : This is free software; see the source for copying conditions. There is NO I, [2024-05-03T05:56:38.629833 #3737750] INFO -- : warranty; not even for MERCHANTABILITY or FITNESS FOR A PARTICULAR PURPOSE. I, [2024-05-03T05:56:38.629844 #3737750] INFO -- : I, [2024-05-03T05:56:38.630830 #3737750] INFO -- : /tmp/ruby/src/trunk/.bundle/.timestamp/rbs.revision unchanged I, [2024-05-03T05:56:38.630861 #3737750] INFO -- : /tmp/ruby/src/trunk/.bundle/.timestamp/typeprof.revision unchanged I, [2024-05-03T05:56:38.751481 #3737750] INFO -- : Building power_assert@84e85124c5014a139af39161d484156cfe87a9ed to /tmp/ruby/src/trunk/gems/power_assert-2.0.3.gem I, [2024-05-03T05:56:38.752087 #3737750] INFO -- : making srcs under enc I, [2024-05-03T05:56:38.752226 #3737750] INFO -- : making enc I, [2024-05-03T05:56:38.769735 #3737750] INFO -- : make[1]: Entering directory '/tmp/ruby/build/trunk' I, [2024-05-03T05:56:38.769771 #3737750] INFO -- : make[1]: Nothing to be done for 'enc'. I, [2024-05-03T05:56:38.769779 #3737750] INFO -- : make[1]: Leaving directory '/tmp/ruby/build/trunk' I, [2024-05-03T05:56:38.782812 #3737750] INFO -- : make[1]: Entering directory '/tmp/ruby/build/trunk' I, [2024-05-03T05:56:38.782845 #3737750] INFO -- : make[1]: Nothing to be done for 'srcs'. I, [2024-05-03T05:56:38.782856 #3737750] INFO -- : make[1]: Leaving directory '/tmp/ruby/build/trunk' I, [2024-05-03T05:56:38.783741 #3737750] INFO -- : generating transdb.h I, [2024-05-03T05:56:38.821651 #3737750] INFO -- : Successfully built RubyGem I, [2024-05-03T05:56:38.821698 #3737750] INFO -- : Name: power_assert I, [2024-05-03T05:56:38.821706 #3737750] INFO -- : Version: 2.0.4dev I, [2024-05-03T05:56:38.821713 #3737750] INFO -- : File: power_assert-2.0.4dev.gem I, [2024-05-03T05:56:38.824254 #3737750] INFO -- : Extracting bundle gem power_assert-2.0.3... I, [2024-05-03T05:56:38.878352 #3737750] INFO -- : transdb.h unchanged I, [2024-05-03T05:56:38.880100 #3737750] INFO -- : generating makefiles ext/configure-ext.mk I, [2024-05-03T05:56:38.880268 #3737750] INFO -- : making trans I, [2024-05-03T05:56:38.885511 #3737750] INFO -- : Try with hash version of bundled gems instead of gems/power_assert-2.0.3.gem. We don't use this gem with release version of Ruby. I, [2024-05-03T05:56:38.890470 #3737750] INFO -- : Unpacked gems/power_assert-2.0.4dev.gem I, [2024-05-03T05:56:38.907067 #3737750] INFO -- : ext/configure-ext.mk unchanged I, [2024-05-03T05:56:38.909951 #3737750] INFO -- : make[1]: Entering directory '/tmp/ruby/build/trunk' I, [2024-05-03T05:56:38.915258 #3737750] INFO -- : make[1]: Entering directory '/tmp/ruby/build/trunk' I, [2024-05-03T05:56:38.915348 #3737750] INFO -- : make[1]: Nothing to be done for 'trans'. I, [2024-05-03T05:56:38.915357 #3737750] INFO -- : make[1]: Leaving directory '/tmp/ruby/build/trunk' I, [2024-05-03T05:56:38.916281 #3737750] INFO -- : making encs I, [2024-05-03T05:56:38.976198 #3737750] INFO -- : make[1]: Entering directory '/tmp/ruby/build/trunk' I, [2024-05-03T05:56:38.976271 #3737750] INFO -- : make[1]: Nothing to be done for 'encs'. I, [2024-05-03T05:56:38.976296 #3737750] INFO -- : make[1]: Leaving directory '/tmp/ruby/build/trunk' I, [2024-05-03T05:56:39.064787 #3737750] INFO -- : make[1]: Leaving directory '/tmp/ruby/build/trunk' I, [2024-05-03T05:56:39.065474 #3737750] INFO -- : generating makefile exts.mk I, [2024-05-03T05:56:39.103394 #3737750] INFO -- : exts.mk unchanged I, [2024-05-03T05:56:39.107751 #3737750] INFO -- : make[1]: Entering directory '/tmp/ruby/build/trunk' I, [2024-05-03T05:56:39.127131 #3737750] INFO -- : make[2]: Entering directory '/tmp/ruby/build/trunk/ext/digest' I, [2024-05-03T05:56:39.127711 #3737750] INFO -- : make[2]: Entering directory '/tmp/ruby/build/trunk/ext/coverage' I, [2024-05-03T05:56:39.127848 #3737750] INFO -- : make[2]: Entering directory '/tmp/ruby/build/trunk/ext/date' I, [2024-05-03T05:56:39.128226 #3737750] INFO -- : make[2]: Entering directory '/tmp/ruby/build/trunk/ext/json' I, [2024-05-03T05:56:39.129401 #3737750] INFO -- : make[2]: Entering directory '/tmp/ruby/build/trunk/ext/io/console' I, [2024-05-03T05:56:39.129815 #3737750] INFO -- : make[2]: Entering directory '/tmp/ruby/build/trunk/ext/monitor' I, [2024-05-03T05:56:39.130481 #3737750] INFO -- : make[2]: Entering directory '/tmp/ruby/build/trunk/ext/rubyvm' I, [2024-05-03T05:56:39.130513 #3737750] INFO -- : make[2]: Entering directory '/tmp/ruby/build/trunk/ext/pathname' I, [2024-05-03T05:56:39.131144 #3737750] INFO -- : make[2]: Entering directory '/tmp/ruby/build/trunk/ext/pty' I, [2024-05-03T05:56:39.131651 #3737750] INFO -- : make[2]: Leaving directory '/tmp/ruby/build/trunk/ext/coverage' I, [2024-05-03T05:56:39.131682 #3737750] INFO -- : make[2]: Entering directory '/tmp/ruby/build/trunk/ext/fiddle' I, [2024-05-03T05:56:39.131979 #3737750] INFO -- : make[2]: Leaving directory '/tmp/ruby/build/trunk/ext/date' I, [2024-05-03T05:56:39.132005 #3737750] INFO -- : make[2]: Entering directory '/tmp/ruby/build/trunk/ext/objspace' I, [2024-05-03T05:56:39.132175 #3737750] INFO -- : make[2]: Leaving directory '/tmp/ruby/build/trunk/ext/io/console' I, [2024-05-03T05:56:39.132333 #3737750] INFO -- : make[2]: Leaving directory '/tmp/ruby/build/trunk/ext/monitor' I, [2024-05-03T05:56:39.132662 #3737750] INFO -- : make[2]: Leaving directory '/tmp/ruby/build/trunk/ext/rubyvm' I, [2024-05-03T05:56:39.132855 #3737750] INFO -- : make[2]: Entering directory '/tmp/ruby/build/trunk/ext/psych' I, [2024-05-03T05:56:39.132933 #3737750] INFO -- : make[2]: Leaving directory '/tmp/ruby/build/trunk/ext/digest' I, [2024-05-03T05:56:39.133133 #3737750] INFO -- : make[2]: Leaving directory '/tmp/ruby/build/trunk/ext/pathname' I, [2024-05-03T05:56:39.133858 #3737750] INFO -- : make[2]: Leaving directory '/tmp/ruby/build/trunk/ext/pty' I, [2024-05-03T05:56:39.134933 #3737750] INFO -- : make[2]: Entering directory '/tmp/ruby/build/trunk/.bundle/gems/nkf-0.2.0/ext/nkf' I, [2024-05-03T05:56:39.135450 #3737750] INFO -- : make[2]: Entering directory '/tmp/ruby/build/trunk/.bundle/gems/bigdecimal-3.1.7/ext/bigdecimal' I, [2024-05-03T05:56:39.135579 #3737750] INFO -- : make[2]: Entering directory '/tmp/ruby/build/trunk/.bundle/gems/racc-1.7.3/ext/racc/cparse' I, [2024-05-03T05:56:39.135604 #3737750] INFO -- : make[2]: Entering directory '/tmp/ruby/build/trunk/.bundle/gems/debug-1.9.2/ext/debug' I, [2024-05-03T05:56:39.135614 #3737750] INFO -- : make[2]: Leaving directory '/tmp/ruby/build/trunk/ext/objspace' I, [2024-05-03T05:56:39.136214 #3737750] INFO -- : make[2]: Entering directory '/tmp/ruby/build/trunk/.bundle/gems/rbs-3.4.4/ext/rbs_extension' I, [2024-05-03T05:56:39.136238 #3737750] INFO -- : make[2]: Entering directory '/tmp/ruby/build/trunk/ext/ripper' I, [2024-05-03T05:56:39.136884 #3737750] INFO -- : make[2]: Leaving directory '/tmp/ruby/build/trunk/ext/json' I, [2024-05-03T05:56:39.136953 #3737750] INFO -- : make[2]: Entering directory '/tmp/ruby/build/trunk/.bundle/gems/syslog-0.1.2/ext/syslog' I, [2024-05-03T05:56:39.138534 #3737750] INFO -- : make[2]: Leaving directory '/tmp/ruby/build/trunk/ext/fiddle' I, [2024-05-03T05:56:39.139865 #3737750] INFO -- : make[2]: Entering directory '/tmp/ruby/build/trunk/ext/socket' I, [2024-05-03T05:56:39.141643 #3737750] INFO -- : make[2]: Leaving directory '/tmp/ruby/build/trunk/ext/ripper' I, [2024-05-03T05:56:39.144477 #3737750] INFO -- : make[2]: Entering directory '/tmp/ruby/build/trunk/ext/openssl' I, [2024-05-03T05:56:39.144637 #3737750] INFO -- : make[2]: Entering directory '/tmp/ruby/build/trunk/ext/digest/sha2' I, [2024-05-03T05:56:39.145560 #3737750] INFO -- : make[2]: Leaving directory '/tmp/ruby/build/trunk/ext/psych' I, [2024-05-03T05:56:39.146777 #3737750] INFO -- : make[2]: Leaving directory '/tmp/ruby/build/trunk/ext/digest/sha2' I, [2024-05-03T05:56:39.149320 #3737750] INFO -- : make[2]: Leaving directory '/tmp/ruby/build/trunk/ext/socket' I, [2024-05-03T05:56:39.155704 #3737750] INFO -- : make[2]: Leaving directory '/tmp/ruby/build/trunk/ext/openssl' I, [2024-05-03T05:56:39.157766 #3737750] INFO -- : make[2]: Leaving directory '/tmp/ruby/build/trunk/.bundle/gems/racc-1.7.3/ext/racc/cparse' I, [2024-05-03T05:56:39.160251 #3737750] INFO -- : make[2]: Leaving directory '/tmp/ruby/build/trunk/.bundle/gems/syslog-0.1.2/ext/syslog' I, [2024-05-03T05:56:39.161238 #3737750] INFO -- : make[2]: Leaving directory '/tmp/ruby/build/trunk/.bundle/gems/rbs-3.4.4/ext/rbs_extension' I, [2024-05-03T05:56:39.165898 #3737750] INFO -- : make[2]: Leaving directory '/tmp/ruby/build/trunk/.bundle/gems/nkf-0.2.0/ext/nkf' I, [2024-05-03T05:56:39.167875 #3737750] INFO -- : make[2]: Leaving directory '/tmp/ruby/build/trunk/.bundle/gems/debug-1.9.2/ext/debug' I, [2024-05-03T05:56:39.171434 #3737750] INFO -- : make[2]: Leaving directory '/tmp/ruby/build/trunk/.bundle/gems/bigdecimal-3.1.7/ext/bigdecimal' I, [2024-05-03T05:56:39.195526 #3737750] INFO -- : make[2]: Entering directory '/tmp/ruby/build/trunk' I, [2024-05-03T05:56:39.260723 #3737750] INFO -- : make[2]: 'ruby' is up to date. I, [2024-05-03T05:56:39.260779 #3737750] INFO -- : make[2]: Leaving directory '/tmp/ruby/build/trunk' I, [2024-05-03T05:56:39.261046 #3737750] INFO -- : make[1]: Leaving directory '/tmp/ruby/build/trunk' I, [2024-05-03T05:56:39.264734 #3737750] INFO -- : make[1]: Entering directory '/tmp/ruby/build/trunk' I, [2024-05-03T05:56:39.264790 #3737750] INFO -- : make[1]: Nothing to be done for 'note'. I, [2024-05-03T05:56:39.264803 #3737750] INFO -- : make[1]: Leaving directory '/tmp/ruby/build/trunk' I, [2024-05-03T05:56:39.265048 #3737750] INFO -- : ./miniruby -I/tmp/ruby/src/trunk/lib -I. -I.ext/common /tmp/ruby/src/trunk/tool/runruby.rb --extout=.ext -- --disable-gems -r./x86_64-linux-fake /tmp/ruby/src/trunk/tool/rbinstall.rb --make="make" --dest-dir="" --extout=".ext" --ext-build-dir="./ext" --mflags="-j20 --jobserver-auth=4,5" --make-flags=" -j20 --jobserver-auth=4,5" --data-mode=0644 --prog-mode=0755 --installed-list .installed.list --mantype="doc" --gnumake --install=all --exclude=doc I, [2024-05-03T05:56:39.360766 #3737750] INFO -- : Installing to I, [2024-05-03T05:56:39.360846 #3737750] INFO -- : installing binary commands: /tmp/ruby/install/trunk/bin I, [2024-05-03T05:56:39.360861 #3737750] INFO -- : installing base libraries: /tmp/ruby/install/trunk/lib I, [2024-05-03T05:56:39.368198 #3737750] INFO -- : installing arch files: /tmp/ruby/install/trunk/lib/ruby/3.4.0+0/x86_64-linux I, [2024-05-03T05:56:39.368258 #3737750] INFO -- : installing pkgconfig data: /tmp/ruby/install/trunk/lib/pkgconfig I, [2024-05-03T05:56:39.368272 #3737750] INFO -- : installing extension objects: /tmp/ruby/install/trunk/lib/ruby/3.4.0+0/x86_64-linux I, [2024-05-03T05:56:39.377805 #3737750] INFO -- : installing extension objects: /tmp/ruby/install/trunk/lib/ruby/site_ruby/3.4.0+0/x86_64-linux I, [2024-05-03T05:56:39.377876 #3737750] INFO -- : installing extension objects: /tmp/ruby/install/trunk/lib/ruby/vendor_ruby/3.4.0+0/x86_64-linux I, [2024-05-03T05:56:39.377890 #3737750] INFO -- : installing extension headers: /tmp/ruby/install/trunk/include/ruby-3.4.0+0/x86_64-linux I, [2024-05-03T05:56:39.377903 #3737750] INFO -- : installing extension scripts: /tmp/ruby/install/trunk/lib/ruby/3.4.0+0 I, [2024-05-03T05:56:39.381757 #3737750] INFO -- : installing extension scripts: /tmp/ruby/install/trunk/lib/ruby/site_ruby/3.4.0+0 I, [2024-05-03T05:56:39.381818 #3737750] INFO -- : installing extension scripts: /tmp/ruby/install/trunk/lib/ruby/vendor_ruby/3.4.0+0 I, [2024-05-03T05:56:39.381837 #3737750] INFO -- : installing extension headers: /tmp/ruby/install/trunk/include/ruby-3.4.0+0/ruby I, [2024-05-03T05:56:39.381850 #3737750] INFO -- : installing command scripts: /tmp/ruby/install/trunk/bin I, [2024-05-03T05:56:39.381863 #3737750] INFO -- : installing library scripts: /tmp/ruby/install/trunk/lib/ruby/3.4.0+0 I, [2024-05-03T05:56:39.415894 #3737750] INFO -- : installing common headers: /tmp/ruby/install/trunk/include/ruby-3.4.0+0 I, [2024-05-03T05:56:39.421335 #3737750] INFO -- : installing manpages: /tmp/ruby/install/trunk/share/man/man1 I, [2024-05-03T05:56:39.421404 #3737750] INFO -- : installing default gems from lib: /tmp/ruby/install/trunk/lib/ruby/gems/3.4.0+0 I, [2024-05-03T05:56:39.443907 #3737750] INFO -- : benchmark 0.3.0 I, [2024-05-03T05:56:39.450787 #3737750] INFO -- : bundler 2.6.0.dev I, [2024-05-03T05:56:39.452921 #3737750] INFO -- : cgi 0.4.1 I, [2024-05-03T05:56:39.453463 #3737750] INFO -- : delegate 0.3.1 I, [2024-05-03T05:56:39.453927 #3737750] INFO -- : did_you_mean 1.6.3 I, [2024-05-03T05:56:39.454459 #3737750] INFO -- : english 0.8.0 I, [2024-05-03T05:56:39.454907 #3737750] INFO -- : erb 4.0.4 I, [2024-05-03T05:56:39.455633 #3737750] INFO -- : error_highlight 0.6.0 I, [2024-05-03T05:56:39.456074 #3737750] INFO -- : fileutils 1.7.2 I, [2024-05-03T05:56:39.456462 #3737750] INFO -- : find 0.2.0 I, [2024-05-03T05:56:39.456923 #3737750] INFO -- : forwardable 1.3.3 I, [2024-05-03T05:56:39.457366 #3737750] INFO -- : ipaddr 1.2.6 I, [2024-05-03T05:56:39.457878 #3737750] INFO -- : irb 1.13.0 I, [2024-05-03T05:56:39.459368 #3737750] INFO -- : logger 1.6.0 I, [2024-05-03T05:56:39.459831 #3737750] INFO -- : net-http 0.4.1 I, [2024-05-03T05:56:39.460366 #3737750] INFO -- : net-protocol 0.2.2 I, [2024-05-03T05:56:39.460863 #3737750] INFO -- : open-uri 0.4.1 I, [2024-05-03T05:56:39.461373 #3737750] INFO -- : open3 0.2.1 I, [2024-05-03T05:56:39.461854 #3737750] INFO -- : optparse 0.5.0 I, [2024-05-03T05:56:39.462278 #3737750] INFO -- : ostruct 0.6.0 I, [2024-05-03T05:56:39.462768 #3737750] INFO -- : pp 0.5.0 I, [2024-05-03T05:56:39.463321 #3737750] INFO -- : prettyprint 0.2.0 I, [2024-05-03T05:56:39.463726 #3737750] INFO -- : prism 0.27.0 I, [2024-05-03T05:56:39.464266 #3737750] INFO -- : pstore 0.1.3 I, [2024-05-03T05:56:39.464761 #3737750] INFO -- : rdoc 6.6.3.1 I, [2024-05-03T05:56:39.466372 #3737750] INFO -- : readline 0.0.4 I, [2024-05-03T05:56:39.466839 #3737750] INFO -- : reline 0.5.5 I, [2024-05-03T05:56:39.467419 #3737750] INFO -- : resolv 0.4.0 I, [2024-05-03T05:56:39.467895 #3737750] INFO -- : ruby2_keywords 0.0.5 I, [2024-05-03T05:56:39.468391 #3737750] INFO -- : securerandom 0.3.1 I, [2024-05-03T05:56:39.468888 #3737750] INFO -- : set 1.1.0 I, [2024-05-03T05:56:39.469312 #3737750] INFO -- : shellwords 0.2.0 I, [2024-05-03T05:56:39.469812 #3737750] INFO -- : singleton 0.2.0 I, [2024-05-03T05:56:39.470347 #3737750] INFO -- : syntax_suggest 2.0.0 I, [2024-05-03T05:56:39.471039 #3737750] INFO -- : tempfile 0.2.1 I, [2024-05-03T05:56:39.471523 #3737750] INFO -- : time 0.3.0 I, [2024-05-03T05:56:39.472032 #3737750] INFO -- : timeout 0.4.1 I, [2024-05-03T05:56:39.473094 #3737750] INFO -- : tmpdir 0.2.0 I, [2024-05-03T05:56:39.473617 #3737750] INFO -- : tsort 0.2.0 I, [2024-05-03T05:56:39.474108 #3737750] INFO -- : un 0.3.0 I, [2024-05-03T05:56:39.474605 #3737750] INFO -- : uri 0.13.0 I, [2024-05-03T05:56:39.475107 #3737750] INFO -- : weakref 0.1.3 I, [2024-05-03T05:56:39.475518 #3737750] INFO -- : yaml 0.3.0 I, [2024-05-03T05:56:39.475970 #3737750] INFO -- : installing default gems from ext: /tmp/ruby/install/trunk/lib/ruby/gems/3.4.0+0 I, [2024-05-03T05:56:39.482766 #3737750] INFO -- : date 3.3.4 I, [2024-05-03T05:56:39.483320 #3737750] INFO -- : digest 3.1.1 I, [2024-05-03T05:56:39.483791 #3737750] INFO -- : etc 1.4.3 I, [2024-05-03T05:56:39.484400 #3737750] INFO -- : fcntl 1.1.0 I, [2024-05-03T05:56:39.484901 #3737750] INFO -- : fiddle 1.1.3 I, [2024-05-03T05:56:39.485390 #3737750] INFO -- : io-console 0.7.2 I, [2024-05-03T05:56:39.485817 #3737750] INFO -- : io-nonblock 0.3.0 I, [2024-05-03T05:56:39.486352 #3737750] INFO -- : io-wait 0.3.1 I, [2024-05-03T05:56:39.486799 #3737750] INFO -- : json 2.7.2 I, [2024-05-03T05:56:39.487625 #3737750] INFO -- : openssl 3.2.0 I, [2024-05-03T05:56:39.488356 #3737750] INFO -- : pathname 0.3.0 I, [2024-05-03T05:56:39.488916 #3737750] INFO -- : psych 5.1.2 I, [2024-05-03T05:56:39.489504 #3737750] INFO -- : stringio 3.1.1 I, [2024-05-03T05:56:39.490008 #3737750] INFO -- : strscan 3.1.1 I, [2024-05-03T05:56:39.490506 #3737750] INFO -- : zlib 3.1.0 I, [2024-05-03T05:56:39.490858 #3737750] INFO -- : installing bundled gems: /tmp/ruby/install/trunk/lib/ruby/gems/3.4.0+0 I, [2024-05-03T05:56:39.491200 #3737750] INFO -- : minitest 5.22.3 I, [2024-05-03T05:56:39.498817 #3737750] INFO -- : rake 13.2.1 I, [2024-05-03T05:56:39.502301 #3737750] INFO -- : test-unit 3.6.2 I, [2024-05-03T05:56:39.506718 #3737750] INFO -- : rexml 3.2.6 I, [2024-05-03T05:56:39.510205 #3737750] INFO -- : rss 0.3.0 I, [2024-05-03T05:56:39.513204 #3737750] INFO -- : net-ftp 0.3.4 I, [2024-05-03T05:56:39.514681 #3737750] INFO -- : net-imap 0.4.10 I, [2024-05-03T05:56:39.517655 #3737750] INFO -- : net-pop 0.1.2 I, [2024-05-03T05:56:39.518562 #3737750] INFO -- : net-smtp 0.5.0 I, [2024-05-03T05:56:39.519622 #3737750] INFO -- : matrix 0.4.2 I, [2024-05-03T05:56:39.523210 #3737750] INFO -- : prime 0.1.2 I, [2024-05-03T05:56:39.528290 #3737750] INFO -- : rbs 3.4.4 I, [2024-05-03T05:56:39.551448 #3737750] INFO -- : typeprof 0.21.11 I, [2024-05-03T05:56:39.554044 #3737750] INFO -- : debug 1.9.2 I, [2024-05-03T05:56:39.556901 #3737750] INFO -- : racc 1.7.3 I, [2024-05-03T05:56:39.559540 #3737750] INFO -- : mutex_m 0.2.0 I, [2024-05-03T05:56:39.560737 #3737750] INFO -- : getoptlong 0.2.1 I, [2024-05-03T05:56:39.562049 #3737750] INFO -- : base64 0.2.0 I, [2024-05-03T05:56:39.563053 #3737750] INFO -- : bigdecimal 3.1.7 I, [2024-05-03T05:56:39.565296 #3737750] INFO -- : observer 0.1.2 I, [2024-05-03T05:56:39.566370 #3737750] INFO -- : abbrev 0.1.2 I, [2024-05-03T05:56:39.567817 #3737750] INFO -- : resolv-replace 0.1.1 I, [2024-05-03T05:56:39.568995 #3737750] INFO -- : rinda 0.2.0 I, [2024-05-03T05:56:39.570427 #3737750] INFO -- : drb 2.2.1 I, [2024-05-03T05:56:39.571916 #3737750] INFO -- : nkf 0.2.0 I, [2024-05-03T05:56:39.574555 #3737750] INFO -- : syslog 0.1.2 I, [2024-05-03T05:56:39.576133 #3737750] INFO -- : csv 3.3.0 I, [2024-05-03T05:56:39.578201 #3737750] INFO -- : installing bundled gem cache: /tmp/ruby/install/trunk/lib/ruby/gems/3.4.0+0/cache I, [2024-05-03T05:56:39.579645 #3737750] INFO -- : skipped bundled gems: I, [2024-05-03T05:56:39.579711 #3737750] INFO -- : power_assert-2.0.4dev.gem not found in bundled_gems I, [2024-05-03T05:56:39.582664 #3737750] INFO -- : $$$[end] "make install -j20" exit with 0. I, [2024-05-03T05:56:39.582809 #3737750] INFO -- : $$$[beg] make yes-btest TESTOPTS='-q -j20' I, [2024-05-03T05:56:46.363231 #3737750] INFO -- : PASS all 1935 tests E, [2024-05-03T05:56:46.368778 #3737750] ERROR -- : I, [2024-05-03T05:56:46.369059 #3737750] INFO -- : $$$[end] "make yes-btest TESTOPTS='-q -j20'" exit with 0. I, [2024-05-03T05:56:46.369154 #3737750] INFO -- : $$$[beg] make yes-test-basic TESTS='-j20' I, [2024-05-03T05:56:46.428389 #3737750] INFO -- : BASERUBY = /usr/bin/ruby --disable=gems I, [2024-05-03T05:56:46.428434 #3737750] INFO -- : CC = gcc I, [2024-05-03T05:56:46.428449 #3737750] INFO -- : LD = ld I, [2024-05-03T05:56:46.428461 #3737750] INFO -- : LDSHARED = gcc -shared I, [2024-05-03T05:56:46.428473 #3737750] INFO -- : CFLAGS = -O3 -fno-fast-math -ggdb3 -Wall -Wextra -Wdeprecated-declarations -Wdiv-by-zero -Wduplicated-cond -Wimplicit-function-declaration -Wimplicit-int -Wpointer-arith -Wwrite-strings -Wold-style-definition -Wimplicit-fallthrough=0 -Wmissing-noreturn -Wno-cast-function-type -Wno-constant-logical-operand -Wno-long-long -Wno-missing-field-initializers -Wno-overlength-strings -Wno-packed-bitfield-compat -Wno-parentheses-equality -Wno-self-assign -Wno-tautological-compare -Wno-unused-parameter -Wno-unused-value -Wsuggest-attribute=format -Wsuggest-attribute=noreturn -Wunused-variable -Wmisleading-indentation -Wundef -fPIC I, [2024-05-03T05:56:46.428486 #3737750] INFO -- : XCFLAGS = -U_FORTIFY_SOURCE -D_FORTIFY_SOURCE=2 -fstack-protector-strong -fno-strict-overflow -fvisibility=hidden -fexcess-precision=standard -DRUBY_EXPORT -I. -I.ext/include/x86_64-linux -I/tmp/ruby/src/trunk/include -I/tmp/ruby/src/trunk -I/tmp/ruby/src/trunk/prism -I/tmp/ruby/src/trunk/enc/unicode/15.0.0 I, [2024-05-03T05:56:46.428520 #3737750] INFO -- : CPPFLAGS = I, [2024-05-03T05:56:46.428534 #3737750] INFO -- : DLDFLAGS = -Wl,--compress-debug-sections=zlib -Wl,-soname,libruby.so.3.4 -fstack-protector-strong I, [2024-05-03T05:56:46.428546 #3737750] INFO -- : SOLIBS = -lz -lrt -lrt -lgmp -ldl -lcrypt -lm -lpthread I, [2024-05-03T05:56:46.428558 #3737750] INFO -- : LANG = en_US.UTF-8 I, [2024-05-03T05:56:46.428570 #3737750] INFO -- : LC_ALL = I, [2024-05-03T05:56:46.428581 #3737750] INFO -- : LC_CTYPE = I, [2024-05-03T05:56:46.428592 #3737750] INFO -- : MFLAGS = I, [2024-05-03T05:56:46.428603 #3737750] INFO -- : RUSTC = no I, [2024-05-03T05:56:46.428615 #3737750] INFO -- : YJIT_RUSTC_ARGS = --crate-name=yjit --crate-type=staticlib --edition=2021 -g -C lto=thin -C opt-level=3 -C overflow-checks=on '--out-dir=/tmp/ruby/build/trunk/yjit/target/release/' /tmp/ruby/src/trunk/yjit/src/lib.rs I, [2024-05-03T05:56:46.429006 #3737750] INFO -- : gcc (Ubuntu 11.4.0-1ubuntu1~22.04) 11.4.0 I, [2024-05-03T05:56:46.429051 #3737750] INFO -- : Copyright (C) 2021 Free Software Foundation, Inc. I, [2024-05-03T05:56:46.429066 #3737750] INFO -- : This is free software; see the source for copying conditions. There is NO I, [2024-05-03T05:56:46.429088 #3737750] INFO -- : warranty; not even for MERCHANTABILITY or FITNESS FOR A PARTICULAR PURPOSE. I, [2024-05-03T05:56:46.429101 #3737750] INFO -- : I, [2024-05-03T05:56:46.533655 #3737750] INFO -- : Checking leaked global symbols...none I, [2024-05-03T05:56:46.575421 #3737750] INFO -- : /tmp/ruby/src/trunk/basictest/test.rb:assignment ....................................................................................................................................................................................................................................................................................................................................................................................OK 372 I, [2024-05-03T05:56:46.575502 #3737750] INFO -- : /tmp/ruby/src/trunk/basictest/test.rb:condition ..OK 2 I, [2024-05-03T05:56:46.575517 #3737750] INFO -- : /tmp/ruby/src/trunk/basictest/test.rb:if/unless ...OK 3 I, [2024-05-03T05:56:46.575529 #3737750] INFO -- : /tmp/ruby/src/trunk/basictest/test.rb:case .....OK 5 I, [2024-05-03T05:56:46.575696 #3737750] INFO -- : /tmp/ruby/src/trunk/basictest/test.rb:while/until ........OK 8 I, [2024-05-03T05:56:46.575746 #3737750] INFO -- : /tmp/ruby/src/trunk/basictest/test.rb:exception ..........OK 10 I, [2024-05-03T05:56:46.576016 #3737750] INFO -- : /tmp/ruby/src/trunk/basictest/test.rb:array .......................................OK 39 I, [2024-05-03T05:56:46.576114 #3737750] INFO -- : /tmp/ruby/src/trunk/basictest/test.rb:hash ...........................OK 27 I, [2024-05-03T05:56:46.576836 #3737750] INFO -- : /tmp/ruby/src/trunk/basictest/test.rb:iterator ...........................................................................................................OK 107 I, [2024-05-03T05:56:46.577116 #3737750] INFO -- : /tmp/ruby/src/trunk/basictest/test.rb:float ................................................................................OK 80 I, [2024-05-03T05:56:46.578120 #3737750] INFO -- : /tmp/ruby/src/trunk/basictest/test.rb:bignum ...............................OK 31 I, [2024-05-03T05:56:46.578920 #3737750] INFO -- : /tmp/ruby/src/trunk/basictest/test.rb:string & char ..............................................................OK 62 I, [2024-05-03T05:56:46.578942 #3737750] INFO -- : /tmp/ruby/src/trunk/basictest/test.rb:assignment ..........OK 10 I, [2024-05-03T05:56:46.578958 #3737750] INFO -- : /tmp/ruby/src/trunk/basictest/test.rb:call ......OK 6 I, [2024-05-03T05:56:46.579005 #3737750] INFO -- : /tmp/ruby/src/trunk/basictest/test.rb:proc .........OK 9 I, [2024-05-03T05:56:46.679356 #3737750] INFO -- : /tmp/ruby/src/trunk/basictest/test.rb:signal ..OK 2 I, [2024-05-03T05:56:46.679852 #3737750] INFO -- : /tmp/ruby/src/trunk/basictest/test.rb:eval ...........................OK 27 I, [2024-05-03T05:56:46.783120 #3737750] INFO -- : /tmp/ruby/src/trunk/basictest/test.rb:system ........OK 8 I, [2024-05-03T05:56:46.783204 #3737750] INFO -- : /tmp/ruby/src/trunk/basictest/test.rb:const .....OK 5 I, [2024-05-03T05:56:46.783220 #3737750] INFO -- : /tmp/ruby/src/trunk/basictest/test.rb:clone .....OK 5 I, [2024-05-03T05:56:46.783233 #3737750] INFO -- : /tmp/ruby/src/trunk/basictest/test.rb:marshal ....OK 4 I, [2024-05-03T05:56:46.783332 #3737750] INFO -- : /tmp/ruby/src/trunk/basictest/test.rb:pack ....OK 4 I, [2024-05-03T05:56:46.783368 #3737750] INFO -- : /tmp/ruby/src/trunk/basictest/test.rb:math ..OK 2 I, [2024-05-03T05:56:46.783383 #3737750] INFO -- : /tmp/ruby/src/trunk/basictest/test.rb:struct ......OK 6 I, [2024-05-03T05:56:46.783491 #3737750] INFO -- : /tmp/ruby/src/trunk/basictest/test.rb:variable ............OK 12 I, [2024-05-03T05:56:46.783515 #3737750] INFO -- : /tmp/ruby/src/trunk/basictest/test.rb:trace ...OK 3 I, [2024-05-03T05:56:46.783531 #3737750] INFO -- : /tmp/ruby/src/trunk/basictest/test.rb:defined? ............OK 12 I, [2024-05-03T05:56:46.783543 #3737750] INFO -- : /tmp/ruby/src/trunk/basictest/test.rb:alias ......OK 6 I, [2024-05-03T05:56:46.783860 #3737750] INFO -- : /tmp/ruby/src/trunk/basictest/test.rb:path .......................OK 23 I, [2024-05-03T05:56:46.816729 #3737750] INFO -- : /tmp/ruby/src/trunk/basictest/test.rb:gc ....OK 4 I, [2024-05-03T05:56:46.818997 #3737750] INFO -- : I, [2024-05-03T05:56:46.819092 #3737750] INFO -- : test succeeded I, [2024-05-03T05:56:46.820713 #3737750] INFO -- : $$$[end] "make yes-test-basic TESTS='-j20'" exit with 0. I, [2024-05-03T05:56:46.820822 #3737750] INFO -- : $$$[beg] make yes-test-all TESTOPTS='--stderr-on-failure' TESTS='-j20' I, [2024-05-03T05:56:46.906145 #3737750] INFO -- : BASERUBY = /usr/bin/ruby --disable=gems I, [2024-05-03T05:56:46.906179 #3737750] INFO -- : CC = gcc I, [2024-05-03T05:56:46.906185 #3737750] INFO -- : LD = ld I, [2024-05-03T05:56:46.906191 #3737750] INFO -- : LDSHARED = gcc -shared I, [2024-05-03T05:56:46.906201 #3737750] INFO -- : CFLAGS = -O3 -fno-fast-math -ggdb3 -Wall -Wextra -Wdeprecated-declarations -Wdiv-by-zero -Wduplicated-cond -Wimplicit-function-declaration -Wimplicit-int -Wpointer-arith -Wwrite-strings -Wold-style-definition -Wimplicit-fallthrough=0 -Wmissing-noreturn -Wno-cast-function-type -Wno-constant-logical-operand -Wno-long-long -Wno-missing-field-initializers -Wno-overlength-strings -Wno-packed-bitfield-compat -Wno-parentheses-equality -Wno-self-assign -Wno-tautological-compare -Wno-unused-parameter -Wno-unused-value -Wsuggest-attribute=format -Wsuggest-attribute=noreturn -Wunused-variable -Wmisleading-indentation -Wundef -fPIC I, [2024-05-03T05:56:46.906208 #3737750] INFO -- : XCFLAGS = -U_FORTIFY_SOURCE -D_FORTIFY_SOURCE=2 -fstack-protector-strong -fno-strict-overflow -fvisibility=hidden -fexcess-precision=standard -DRUBY_EXPORT -I. -I.ext/include/x86_64-linux -I/tmp/ruby/src/trunk/include -I/tmp/ruby/src/trunk -I/tmp/ruby/src/trunk/prism -I/tmp/ruby/src/trunk/enc/unicode/15.0.0 I, [2024-05-03T05:56:46.906214 #3737750] INFO -- : CPPFLAGS = I, [2024-05-03T05:56:46.906220 #3737750] INFO -- : DLDFLAGS = -Wl,--compress-debug-sections=zlib -Wl,-soname,libruby.so.3.4 -fstack-protector-strong I, [2024-05-03T05:56:46.906226 #3737750] INFO -- : SOLIBS = -lz -lrt -lrt -lgmp -ldl -lcrypt -lm -lpthread I, [2024-05-03T05:56:46.906232 #3737750] INFO -- : LANG = en_US.UTF-8 I, [2024-05-03T05:56:46.906237 #3737750] INFO -- : LC_ALL = I, [2024-05-03T05:56:46.906243 #3737750] INFO -- : LC_CTYPE = I, [2024-05-03T05:56:46.906249 #3737750] INFO -- : MFLAGS = I, [2024-05-03T05:56:46.906256 #3737750] INFO -- : RUSTC = no I, [2024-05-03T05:56:46.906263 #3737750] INFO -- : YJIT_RUSTC_ARGS = --crate-name=yjit --crate-type=staticlib --edition=2021 -g -C lto=thin -C opt-level=3 -C overflow-checks=on '--out-dir=/tmp/ruby/build/trunk/yjit/target/release/' /tmp/ruby/src/trunk/yjit/src/lib.rs I, [2024-05-03T05:56:46.906859 #3737750] INFO -- : gcc (Ubuntu 11.4.0-1ubuntu1~22.04) 11.4.0 I, [2024-05-03T05:56:46.906866 #3737750] INFO -- : Copyright (C) 2021 Free Software Foundation, Inc. I, [2024-05-03T05:56:46.906872 #3737750] INFO -- : This is free software; see the source for copying conditions. There is NO I, [2024-05-03T05:56:46.906878 #3737750] INFO -- : warranty; not even for MERCHANTABILITY or FITNESS FOR A PARTICULAR PURPOSE. I, [2024-05-03T05:56:46.906884 #3737750] INFO -- : I, [2024-05-03T05:56:46.908464 #3737750] INFO -- : generating enc.mk I, [2024-05-03T05:56:47.026506 #3737750] INFO -- : making enc I, [2024-05-03T05:56:47.043611 #3737750] INFO -- : make[1]: Entering directory '/tmp/ruby/build/trunk' I, [2024-05-03T05:56:47.043621 #3737750] INFO -- : make[1]: Nothing to be done for 'enc'. I, [2024-05-03T05:56:47.043628 #3737750] INFO -- : make[1]: Leaving directory '/tmp/ruby/build/trunk' I, [2024-05-03T05:56:47.044256 #3737750] INFO -- : making srcs under enc I, [2024-05-03T05:56:47.074098 #3737750] INFO -- : make[1]: Entering directory '/tmp/ruby/build/trunk' I, [2024-05-03T05:56:47.074108 #3737750] INFO -- : make[1]: Nothing to be done for 'srcs'. I, [2024-05-03T05:56:47.074115 #3737750] INFO -- : make[1]: Leaving directory '/tmp/ruby/build/trunk' I, [2024-05-03T05:56:47.075043 #3737750] INFO -- : generating transdb.h I, [2024-05-03T05:56:47.170061 #3737750] INFO -- : transdb.h unchanged I, [2024-05-03T05:56:47.171458 #3737750] INFO -- : making trans I, [2024-05-03T05:56:47.204999 #3737750] INFO -- : make[1]: Entering directory '/tmp/ruby/build/trunk' I, [2024-05-03T05:56:47.205008 #3737750] INFO -- : make[1]: Nothing to be done for 'trans'. I, [2024-05-03T05:56:47.205014 #3737750] INFO -- : make[1]: Leaving directory '/tmp/ruby/build/trunk' I, [2024-05-03T05:56:47.205690 #3737750] INFO -- : making encs I, [2024-05-03T05:56:47.243306 #3737750] INFO -- : make[1]: Entering directory '/tmp/ruby/build/trunk' I, [2024-05-03T05:56:47.243316 #3737750] INFO -- : make[1]: Nothing to be done for 'encs'. I, [2024-05-03T05:56:47.243322 #3737750] INFO -- : make[1]: Leaving directory '/tmp/ruby/build/trunk' I, [2024-05-03T05:56:47.244981 #3737750] INFO -- : generating makefiles ext/configure-ext.mk I, [2024-05-03T05:56:47.272249 #3737750] INFO -- : ext/configure-ext.mk updated I, [2024-05-03T05:56:47.274583 #3737750] INFO -- : make[1]: Entering directory '/tmp/ruby/build/trunk' I, [2024-05-03T05:56:48.644354 #3737750] INFO -- : make[1]: Leaving directory '/tmp/ruby/build/trunk' I, [2024-05-03T05:56:48.645041 #3737750] INFO -- : generating makefile exts.mk I, [2024-05-03T05:56:48.681748 #3737750] INFO -- : exts.mk unchanged I, [2024-05-03T05:56:48.686585 #3737750] INFO -- : make[1]: Entering directory '/tmp/ruby/build/trunk' I, [2024-05-03T05:56:48.897292 #3737750] INFO -- : make[2]: Entering directory '/tmp/ruby/build/trunk/ext/coverage' I, [2024-05-03T05:56:48.900157 #3737750] INFO -- : make[2]: Leaving directory '/tmp/ruby/build/trunk/ext/coverage' I, [2024-05-03T05:56:48.903890 #3737750] INFO -- : make[2]: Entering directory '/tmp/ruby/build/trunk/ext/date' I, [2024-05-03T05:56:48.907007 #3737750] INFO -- : make[2]: Leaving directory '/tmp/ruby/build/trunk/ext/date' I, [2024-05-03T05:56:48.909299 #3737750] INFO -- : make[2]: Entering directory '/tmp/ruby/build/trunk/ext/digest' I, [2024-05-03T05:56:48.914772 #3737750] INFO -- : make[2]: Leaving directory '/tmp/ruby/build/trunk/ext/digest' I, [2024-05-03T05:56:48.930373 #3737750] INFO -- : make[2]: Entering directory '/tmp/ruby/build/trunk/ext/digest/sha2' I, [2024-05-03T05:56:48.933449 #3737750] INFO -- : make[2]: Leaving directory '/tmp/ruby/build/trunk/ext/digest/sha2' I, [2024-05-03T05:56:48.946194 #3737750] INFO -- : make[2]: Entering directory '/tmp/ruby/build/trunk/ext/fiddle' I, [2024-05-03T05:56:48.952605 #3737750] INFO -- : make[2]: Leaving directory '/tmp/ruby/build/trunk/ext/fiddle' I, [2024-05-03T05:56:48.955569 #3737750] INFO -- : make[2]: Entering directory '/tmp/ruby/build/trunk/ext/io/console' I, [2024-05-03T05:56:48.958134 #3737750] INFO -- : make[2]: Leaving directory '/tmp/ruby/build/trunk/ext/io/console' I, [2024-05-03T05:56:48.965669 #3737750] INFO -- : make[2]: Entering directory '/tmp/ruby/build/trunk/ext/json' I, [2024-05-03T05:56:48.971900 #3737750] INFO -- : make[2]: Leaving directory '/tmp/ruby/build/trunk/ext/json' I, [2024-05-03T05:56:48.980948 #3737750] INFO -- : make[2]: Entering directory '/tmp/ruby/build/trunk/ext/monitor' I, [2024-05-03T05:56:48.983406 #3737750] INFO -- : make[2]: Leaving directory '/tmp/ruby/build/trunk/ext/monitor' I, [2024-05-03T05:56:48.987564 #3737750] INFO -- : make[2]: Entering directory '/tmp/ruby/build/trunk/ext/objspace' I, [2024-05-03T05:56:48.991279 #3737750] INFO -- : make[2]: Leaving directory '/tmp/ruby/build/trunk/ext/objspace' I, [2024-05-03T05:56:49.003286 #3737750] INFO -- : make[2]: Entering directory '/tmp/ruby/build/trunk/ext/openssl' I, [2024-05-03T05:56:49.016346 #3737750] INFO -- : make[2]: Leaving directory '/tmp/ruby/build/trunk/ext/openssl' I, [2024-05-03T05:56:49.019181 #3737750] INFO -- : make[2]: Entering directory '/tmp/ruby/build/trunk/ext/pathname' I, [2024-05-03T05:56:49.021673 #3737750] INFO -- : make[2]: Leaving directory '/tmp/ruby/build/trunk/ext/pathname' I, [2024-05-03T05:56:49.025911 #3737750] INFO -- : make[2]: Entering directory '/tmp/ruby/build/trunk/ext/psych' I, [2024-05-03T05:56:49.040759 #3737750] INFO -- : make[2]: Leaving directory '/tmp/ruby/build/trunk/ext/psych' I, [2024-05-03T05:56:49.043834 #3737750] INFO -- : make[2]: Entering directory '/tmp/ruby/build/trunk/ext/pty' I, [2024-05-03T05:56:49.046348 #3737750] INFO -- : make[2]: Leaving directory '/tmp/ruby/build/trunk/ext/pty' I, [2024-05-03T05:56:49.055819 #3737750] INFO -- : make[2]: Entering directory '/tmp/ruby/build/trunk/ext/ripper' I, [2024-05-03T05:56:49.060730 #3737750] INFO -- : make[2]: Leaving directory '/tmp/ruby/build/trunk/ext/ripper' I, [2024-05-03T05:56:49.062248 #3737750] INFO -- : make[2]: Entering directory '/tmp/ruby/build/trunk/ext/rubyvm' I, [2024-05-03T05:56:49.064321 #3737750] INFO -- : make[2]: Leaving directory '/tmp/ruby/build/trunk/ext/rubyvm' I, [2024-05-03T05:56:49.072164 #3737750] INFO -- : make[2]: Entering directory '/tmp/ruby/build/trunk/ext/socket' I, [2024-05-03T05:56:49.078415 #3737750] INFO -- : make[2]: Leaving directory '/tmp/ruby/build/trunk/ext/socket' I, [2024-05-03T05:56:49.089212 #3737750] INFO -- : make[2]: Entering directory '/tmp/ruby/build/trunk/.bundle/gems/bigdecimal-3.1.7/ext/bigdecimal' I, [2024-05-03T05:56:49.112131 #3737750] INFO -- : make[2]: Leaving directory '/tmp/ruby/build/trunk/.bundle/gems/bigdecimal-3.1.7/ext/bigdecimal' I, [2024-05-03T05:56:49.113974 #3737750] INFO -- : make[2]: Entering directory '/tmp/ruby/build/trunk/.bundle/gems/debug-1.9.2/ext/debug' I, [2024-05-03T05:56:49.135526 #3737750] INFO -- : make[2]: Leaving directory '/tmp/ruby/build/trunk/.bundle/gems/debug-1.9.2/ext/debug' I, [2024-05-03T05:56:49.137462 #3737750] INFO -- : make[2]: Entering directory '/tmp/ruby/build/trunk/.bundle/gems/nkf-0.2.0/ext/nkf' I, [2024-05-03T05:56:49.159698 #3737750] INFO -- : make[2]: Leaving directory '/tmp/ruby/build/trunk/.bundle/gems/nkf-0.2.0/ext/nkf' I, [2024-05-03T05:56:49.161636 #3737750] INFO -- : make[2]: Entering directory '/tmp/ruby/build/trunk/.bundle/gems/racc-1.7.3/ext/racc/cparse' I, [2024-05-03T05:56:49.183757 #3737750] INFO -- : make[2]: Leaving directory '/tmp/ruby/build/trunk/.bundle/gems/racc-1.7.3/ext/racc/cparse' I, [2024-05-03T05:56:49.186291 #3737750] INFO -- : make[2]: Entering directory '/tmp/ruby/build/trunk/.bundle/gems/rbs-3.4.4/ext/rbs_extension' I, [2024-05-03T05:56:49.207953 #3737750] INFO -- : make[2]: Leaving directory '/tmp/ruby/build/trunk/.bundle/gems/rbs-3.4.4/ext/rbs_extension' I, [2024-05-03T05:56:49.209835 #3737750] INFO -- : make[2]: Entering directory '/tmp/ruby/build/trunk/.bundle/gems/syslog-0.1.2/ext/syslog' I, [2024-05-03T05:56:49.231762 #3737750] INFO -- : make[2]: Leaving directory '/tmp/ruby/build/trunk/.bundle/gems/syslog-0.1.2/ext/syslog' I, [2024-05-03T05:56:49.255060 #3737750] INFO -- : make[2]: Entering directory '/tmp/ruby/build/trunk' I, [2024-05-03T05:56:49.318386 #3737750] INFO -- : make[2]: 'ruby' is up to date. I, [2024-05-03T05:56:49.318399 #3737750] INFO -- : make[2]: Leaving directory '/tmp/ruby/build/trunk' I, [2024-05-03T05:56:49.318794 #3737750] INFO -- : make[1]: Leaving directory '/tmp/ruby/build/trunk' I, [2024-05-03T05:56:49.322320 #3737750] INFO -- : make[1]: Entering directory '/tmp/ruby/build/trunk' I, [2024-05-03T05:56:49.322329 #3737750] INFO -- : make[1]: Nothing to be done for 'note'. I, [2024-05-03T05:56:49.322335 #3737750] INFO -- : make[1]: Leaving directory '/tmp/ruby/build/trunk' I, [2024-05-03T05:56:49.398772 #3737750] INFO -- : Run options: I, [2024-05-03T05:56:49.398799 #3737750] INFO -- : --seed=23356 I, [2024-05-03T05:56:49.398806 #3737750] INFO -- : "--ruby=./miniruby -I/tmp/ruby/src/trunk/lib -I. -I.ext/common /tmp/ruby/src/trunk/tool/runruby.rb --extout=.ext -- --disable-gems" I, [2024-05-03T05:56:49.398818 #3737750] INFO -- : --excludes-dir=/tmp/ruby/src/trunk/test/.excludes I, [2024-05-03T05:56:49.398824 #3737750] INFO -- : --name=!/memory_leak/ I, [2024-05-03T05:56:49.398830 #3737750] INFO -- : --stderr-on-failure I, [2024-05-03T05:56:49.398835 #3737750] INFO -- : -j20 I, [2024-05-03T05:56:49.398842 #3737750] INFO -- : I, [2024-05-03T05:56:49.398847 #3737750] INFO -- : # Running tests: I, [2024-05-03T05:56:49.398853 #3737750] INFO -- : I, [2024-05-03T05:56:49.548642 #3737750] INFO -- : [ 1/885] 3779122=test_allocation I, [2024-05-03T05:56:49.548706 #3737750] INFO -- : [ 2/885] 3779105=test_div I, [2024-05-03T05:56:49.548718 #3737750] INFO -- : [ 3/885] 3779109=test_win32ole_variant_m I, [2024-05-03T05:56:49.548745 #3737750] INFO -- : [ 4/885] 3779107=test_engine I, [2024-05-03T05:56:49.550493 #3737750] INFO -- : [ 5/885] 3779106=test_key_error I, [2024-05-03T05:56:49.550553 #3737750] INFO -- : [ 6/885] 3779118=test_serialize_subclasses I, [2024-05-03T05:56:49.550717 #3737750] INFO -- : [ 7/885] 3779119=test_insns_leaf I, [2024-05-03T05:56:49.550753 #3737750] INFO -- : [ 8/885] 3779120=test_deprecated I, [2024-05-03T05:56:49.550843 #3737750] INFO -- : [ 9/885] 3779121=test_color_printer I, [2024-05-03T05:56:49.551111 #3737750] INFO -- : [ 10/885] 3779123=test_files_test_1 I, [2024-05-03T05:56:49.551869 #3737750] INFO -- : [ 11/885] 3779109=test_set I, [2024-05-03T05:56:49.553060 #3737750] INFO -- : [ 12/885] 3779105=test_gem_path_support I, [2024-05-03T05:56:49.560315 #3737750] INFO -- : [ 13/885] 3779106=test_struct I, [2024-05-03T05:56:49.571524 #3737750] INFO -- : [ 14/885] 3779108=test_mutex I, [2024-05-03T05:56:49.574047 #3737750] INFO -- : [ 15/885] 3779119=test_x509req I, [2024-05-03T05:56:49.575442 #3737750] INFO -- : [ 16/885] 3779109=test_rdoc_rd_inline I, [2024-05-03T05:56:49.579025 #3737750] INFO -- : [ 17/885] 3779118=test_win32ole_variant_outarg I, [2024-05-03T05:56:49.580485 #3737750] INFO -- : [ 18/885] 3779118=test_dln I, [2024-05-03T05:56:49.581449 #3737750] INFO -- : [ 19/885] 3779118=test_gem_source_subpath_problem I, [2024-05-03T05:56:49.581674 #3737750] INFO -- : [ 20/885] 3779110=json_common_interface_test I, [2024-05-03T05:56:49.581937 #3737750] INFO -- : [ 21/885] 3779117=memsize_test I, [2024-05-03T05:56:49.581966 #3737750] INFO -- : [ 22/885] 3779115=test_nomethod_error I, [2024-05-03T05:56:49.582984 #3737750] INFO -- : [ 23/885] 3779116=json_parser_test I, [2024-05-03T05:56:49.586283 #3737750] INFO -- : [ 24/885] 3779111=test_config I, [2024-05-03T05:56:49.586340 #3737750] INFO -- : [ 25/885] 3779113=test_pkg_config I, [2024-05-03T05:56:49.591876 #3737750] INFO -- : [ 26/885] 3779120=test_cparser I, [2024-05-03T05:56:49.591961 #3737750] INFO -- : [ 27/885] 3779112=test_struct I, [2024-05-03T05:56:49.596071 #3737750] INFO -- : [ 28/885] 3779115=magic_comment_test I, [2024-05-03T05:56:49.604432 #3737750] INFO -- : [ 29/885] 3779110=test_rdoc_markup_to_html_snippet I, [2024-05-03T05:56:49.606238 #3737750] INFO -- : [ 30/885] 3779114=test_rdoc_markup_include I, [2024-05-03T05:56:49.614278 #3737750] INFO -- : [ 31/885] 3779107=test_sexp I, [2024-05-03T05:56:49.625107 #3737750] INFO -- : [ 32/885] 3779121=fuzzer_test I, [2024-05-03T05:56:49.631587 #3737750] INFO -- : [ 33/885] 3779112=test_variable I, [2024-05-03T05:56:49.631747 #3737750] INFO -- : [ 34/885] 3779124=test_digest_extend I, [2024-05-03T05:56:49.652305 #3737750] INFO -- : [ 35/885] 3779107=test_iterator I, [2024-05-03T05:56:49.653124 #3737750] INFO -- : [ 36/885] 3779113=test_string I, [2024-05-03T05:56:49.655957 #3737750] INFO -- : [ 37/885] 3779111=test_omap I, [2024-05-03T05:56:49.657110 #3737750] INFO -- : [ 38/885] 3779113=test_debug I, [2024-05-03T05:56:49.658431 #3737750] INFO -- : [ 39/885] 3779124=test_memory_view I, [2024-05-03T05:56:49.658486 #3737750] INFO -- : [ 40/885] 3779116=pattern_test I, [2024-05-03T05:56:49.660392 #3737750] INFO -- : [ 41/885] 3779117=test_shellwords I, [2024-05-03T05:56:49.660551 #3737750] INFO -- : [ 42/885] 3779113=test_new I, [2024-05-03T05:56:49.675917 #3737750] INFO -- : [ 43/885] 3779113=test_cipher I, [2024-05-03T05:56:49.680051 #3737750] INFO -- : [ 44/885] 3779117=test_gem_security_signer I, [2024-05-03T05:56:49.680835 #3737750] INFO -- : [ 45/885] 3779111=test_storage I, [2024-05-03T05:56:49.687087 #3737750] INFO -- : [ 46/885] 3779109=test_gem_resolver_git_set I, [2024-05-03T05:56:49.690348 #3737750] INFO -- : [ 47/885] 3779115=test_float I, [2024-05-03T05:56:49.694623 #3737750] INFO -- : [ 48/885] 3779124=test_cgi_cookie I, [2024-05-03T05:56:49.697571 #3737750] INFO -- : [ 49/885] 3779121=test_require I, [2024-05-03T05:56:49.700053 #3737750] INFO -- : [ 50/885] 3779111=test_refinement I, [2024-05-03T05:56:49.709857 #3737750] INFO -- : [ 51/885] 3779120=test_gem_commands_signout_command I, [2024-05-03T05:56:49.716984 #3737750] INFO -- : [ 52/885] 3779124=test_regex_casefold I, [2024-05-03T05:56:49.724307 #3737750] INFO -- : [ 53/885] 3779107=test_gem_source_git I, [2024-05-03T05:56:49.738238 #3737750] INFO -- : [ 54/885] 3779112=test_dir_m17n I, [2024-05-03T05:56:49.740526 #3737750] INFO -- : [ 55/885] 3779113=test_gem_resolver_installer_set I, [2024-05-03T05:56:49.756164 #3737750] INFO -- : [ 56/885] 3779105=test_rdoc_rd I, [2024-05-03T05:56:49.788057 #3737750] INFO -- : [ 57/885] 3779116=test_cgi_session I, [2024-05-03T05:56:49.795386 #3737750] INFO -- : [ 58/885] 3779114=test_metaclass I, [2024-05-03T05:56:49.805812 #3737750] INFO -- : [ 59/885] 3779119=test_rdoc_top_level I, [2024-05-03T05:56:49.806774 #3737750] INFO -- : [ 60/885] 3779116=test_fixnum I, [2024-05-03T05:56:49.806824 #3737750] INFO -- : [ 61/885] 3779114=test_signal I, [2024-05-03T05:56:49.822456 #3737750] INFO -- : [ 62/885] 3779116=test_x509crl I, [2024-05-03T05:56:49.882290 #3737750] INFO -- : [ 63/885] 3779110=test_process I, [2024-05-03T05:56:49.883030 #3737750] INFO -- : [ 64/885] 3779120=test_input_method I, [2024-05-03T05:56:49.929554 #3737750] INFO -- : [ 65/885] 3779110=test_windows_1252 I, [2024-05-03T05:56:49.935233 #3737750] INFO -- : [ 66/885] 3779110=test_erb I, [2024-05-03T05:56:49.938287 #3737750] INFO -- : [ 67/885] 3779105=test_x509ext I, [2024-05-03T05:56:49.943648 #3737750] INFO -- : [ 68/885] 3779118=test_gem_source_installed I, [2024-05-03T05:56:49.946798 #3737750] INFO -- : [ 69/885] 3779105=test_len I, [2024-05-03T05:56:49.947187 #3737750] INFO -- : [ 70/885] 3779105=test_yield_block I, [2024-05-03T05:56:49.954324 #3737750] INFO -- : [ 71/885] 3779105=test_completion I, [2024-05-03T05:56:49.956901 #3737750] INFO -- : [ 72/885] 3779118=test_gem_commands_cert_command I, [2024-05-03T05:56:49.965748 #3737750] INFO -- : [ 73/885] 3779117=test_rational I, [2024-05-03T05:56:49.985878 #3737750] INFO -- : [ 74/885] 3779110=test_rational2 I, [2024-05-03T05:56:49.989249 #3737750] INFO -- : [ 75/885] 3779117=test_assembler I, [2024-05-03T05:56:49.995111 #3737750] INFO -- : [ 76/885] 3779117=test_spell_checker I, [2024-05-03T05:56:50.002796 #3737750] INFO -- : [ 77/885] 3779110=test_propertyputref I, [2024-05-03T05:56:50.002863 #3737750] INFO -- : [ 78/885] 3779110=attribute_write_test I, [2024-05-03T05:56:50.004739 #3737750] INFO -- : [ 79/885] 3779117=test_gem_dependency_list I, [2024-05-03T05:56:50.014262 #3737750] INFO -- : [ 80/885] 3779116=test_benchmark I, [2024-05-03T05:56:50.061749 #3737750] INFO -- : [ 81/885] 3779117=test_win32ole_method_event I, [2024-05-03T05:56:50.064815 #3737750] INFO -- : [ 82/885] 3779117=test_nesting_parser I, [2024-05-03T05:56:50.071063 #3737750] INFO -- : [ 83/885] 3779110=test_gem_source I, [2024-05-03T05:56:50.124144 #3737750] INFO -- : [ 84/885] 3779106=test_scalar_scanner I, [2024-05-03T05:56:50.124599 #3737750] INFO -- : [ 85/885] 3779113=test_gem_commands_outdated_command I, [2024-05-03T05:56:50.125598 #3737750] INFO -- : [ 86/885] 3779120=test_helper_method I, [2024-05-03T05:56:50.133240 #3737750] INFO -- : [ 87/885] 3779120=test_gem_package_tar_writer I, [2024-05-03T05:56:50.163728 #3737750] INFO -- : [ 88/885] 3779106=test_array I, [2024-05-03T05:56:50.166562 #3737750] INFO -- : [ 89/885] 3779117=test_abi I, [2024-05-03T05:56:50.167754 #3737750] INFO -- : [ 90/885] 3779113=test_provider I, [2024-05-03T05:56:50.189818 #3737750] INFO -- : [ 91/885] 3779109=test_rdoc_parser_simple I, [2024-05-03T05:56:50.210234 #3737750] INFO -- : [ 92/885] 3779120=test_yamldbm I, [2024-05-03T05:56:50.211082 #3737750] INFO -- : [ 93/885] 3779120=test_gem_commands_rebuild_command I, [2024-05-03T05:56:50.235641 #3737750] INFO -- : [ 94/885] 3779119=test_load I, [2024-05-03T05:56:50.237653 #3737750] INFO -- : [ 95/885] 3779119=test_https I, [2024-05-03T05:56:50.252864 #3737750] INFO -- : [ 96/885] 3779120=test_gem_ext_builder I, [2024-05-03T05:56:50.270771 #3737750] INFO -- : [ 97/885] 3779109=test_evaluation I, [2024-05-03T05:56:50.274839 #3737750] INFO -- : [ 98/885] 3779109=test_configuration I, [2024-05-03T05:56:50.315550 #3737750] INFO -- : [ 99/885] 3779124=test_rubyvm I, [2024-05-03T05:56:50.317138 #3737750] INFO -- : [100/885] 3779124=test_monitor I, [2024-05-03T05:56:50.345122 #3737750] INFO -- : [101/885] 3779117=test_buffered_io I, [2024-05-03T05:56:50.378690 #3737750] INFO -- : [102/885] 3779109=test_whileuntil I, [2024-05-03T05:56:50.380358 #3737750] INFO -- : [103/885] 3779109=test_rdoc_generator_markup I, [2024-05-03T05:56:50.392956 #3737750] INFO -- : [104/885] 3779109=test_boolean I, [2024-05-03T05:56:50.412285 #3737750] INFO -- : [105/885] 3779109=integer_parse_test I, [2024-05-03T05:56:50.420433 #3737750] INFO -- : [106/885] 3779110=test_instrumentation_api I, [2024-05-03T05:56:50.433820 #3737750] INFO -- : [107/885] 3779117=test_stringify_symbols I, [2024-05-03T05:56:50.434146 #3737750] INFO -- : [108/885] 3779107=constant_path_node_test I, [2024-05-03T05:56:50.436830 #3737750] INFO -- : [109/885] 3779117=test_ssl I, [2024-05-03T05:56:50.471003 #3737750] INFO -- : [110/885] 3779109=test_gem_ext_cargo_builder I, [2024-05-03T05:56:50.479402 #3737750] INFO -- : [111/885] 3779107=test_module I, [2024-05-03T05:56:50.494489 #3737750] INFO -- : [112/885] 3779109=test_gem_request_set I, [2024-05-03T05:56:50.510549 #3737750] INFO -- : [113/885] 3779113=test_method_name_check I, [2024-05-03T05:56:50.525351 #3737750] INFO -- : [114/885] 3779124=test_arith_seq_extract I, [2024-05-03T05:56:50.537461 #3737750] INFO -- : [115/885] 3779113=test_parser I, [2024-05-03T05:56:50.569353 #3737750] INFO -- : [116/885] 3779113=test_gem_gem_runner I, [2024-05-03T05:56:50.622435 #3737750] INFO -- : [117/885] 3779113=test_filter I, [2024-05-03T05:56:50.628767 #3737750] INFO -- : [118/885] 3779119=test_data I, [2024-05-03T05:56:50.631300 #3737750] INFO -- : [119/885] 3779119=static_literals_test I, [2024-05-03T05:56:50.671115 #3737750] INFO -- : [120/885] 3779119=test_rdoc_method_attr I, [2024-05-03T05:56:50.673612 #3737750] INFO -- : [121/885] 3779124=parameters_signature_test I, [2024-05-03T05:56:50.680040 #3737750] INFO -- : [122/885] 3779113=test_koi8 I, [2024-05-03T05:56:50.681827 #3737750] INFO -- : [123/885] 3779113=test_enumerator I, [2024-05-03T05:56:50.689431 #3737750] INFO -- : [124/885] 3779113=test_rdoc_parser_changelog I, [2024-05-03T05:56:50.723371 #3737750] INFO -- : [125/885] 3779108=test_unicode I, [2024-05-03T05:56:50.733179 #3737750] INFO -- : [126/885] 3779105=test_rdoc_generator_pot I, [2024-05-03T05:56:50.735247 #3737750] INFO -- : [127/885] 3779124=test_lexer I, [2024-05-03T05:56:50.747069 #3737750] INFO -- : [128/885] 3779124=test_thread_cv I, [2024-05-03T05:56:50.749188 #3737750] INFO -- : [129/885] 3779119=test_ssl_session I, [2024-05-03T05:56:50.763508 #3737750] INFO -- : [130/885] 3779105=test_key_event_record I, [2024-05-03T05:56:50.773750 #3737750] INFO -- : [131/885] 3779105=test_gem_uri I, [2024-05-03T05:56:50.790722 #3737750] INFO -- : [132/885] 3779108=test_random I, [2024-05-03T05:56:50.796921 #3737750] INFO -- : [133/885] 3779108=test_notimplement I, [2024-05-03T05:56:50.798463 #3737750] INFO -- : [134/885] 3779105=test_gem_commands_update_command I, [2024-05-03T05:56:50.806791 #3737750] INFO -- : [135/885] 3779108=test_gem_resolver_vendor_specification I, [2024-05-03T05:56:50.850188 #3737750] INFO -- : [136/885] 3779109=test_date_compat I, [2024-05-03T05:56:50.851377 #3737750] INFO -- : [137/885] 3779109=test_rdoc_markup_to_html I, [2024-05-03T05:56:50.857765 #3737750] INFO -- : [138/885] 3779113=test_bug-14834 I, [2024-05-03T05:56:50.901437 #3737750] INFO -- : [139/885] 3779113=test_compile_prism I, [2024-05-03T05:56:50.910109 #3737750] INFO -- : [140/885] 3779109=test_terminfo I, [2024-05-03T05:56:50.950920 #3737750] INFO -- : [141/885] 3779109=test_path I, [2024-05-03T05:56:50.957222 #3737750] INFO -- : [142/885] 3779109=test_case_mapping I, [2024-05-03T05:56:50.964740 #3737750] INFO -- : [143/885] 3779109=redundant_return_test I, [2024-05-03T05:56:50.970431 #3737750] INFO -- : [144/885] 3779109=test_bn I, [2024-05-03T05:56:50.994757 #3737750] INFO -- : [145/885] 3779109=test_win32ole_param_event I, [2024-05-03T05:56:50.996979 #3737750] INFO -- : [146/885] 3779109=test_http I, [2024-05-03T05:56:51.030539 #3737750] INFO -- : [147/885] 3779108=test_addrinfo I, [2024-05-03T05:56:51.036384 #3737750] INFO -- : [148/885] 3779115=test_tree_spell_checker I, [2024-05-03T05:56:51.051334 #3737750] INFO -- : [149/885] 3779108=test_httpresponses I, [2024-05-03T05:56:51.054128 #3737750] INFO -- : [150/885] 3779112=test_encoding I, [2024-05-03T05:56:51.062813 #3737750] INFO -- : [151/885] 3779112=test_set_len I, [2024-05-03T05:56:51.066006 #3737750] INFO -- : [152/885] 3779112=test_httpheader I, [2024-05-03T05:56:51.076949 #3737750] INFO -- : [153/885] 3779115=test_gem_resolver_local_specification I, [2024-05-03T05:56:51.107869 #3737750] INFO -- : [154/885] 3779108=test_rdoc_ri_driver I, [2024-05-03T05:56:51.126038 #3737750] INFO -- : [155/885] 3779113=test_install I, [2024-05-03T05:56:51.132538 #3737750] INFO -- : [156/885] 3779112=test_rdoc_markup_to_label I, [2024-05-03T05:56:51.198945 #3737750] INFO -- : [157/885] 3779116=test_sockopt I, [2024-05-03T05:56:51.199736 #3737750] INFO -- : [158/885] 3779116=test_color I, [2024-05-03T05:56:51.227221 #3737750] INFO -- : [159/885] 3779120=json_encoding_test I, [2024-05-03T05:56:51.232574 #3737750] INFO -- : [160/885] 3779120=test_key_stroke I, [2024-05-03T05:56:51.239153 #3737750] INFO -- : [161/885] 3779120=test_human_typo I, [2024-05-03T05:56:51.262509 #3737750] INFO -- : [162/885] 3779120=test_primitive I, [2024-05-03T05:56:51.268529 #3737750] INFO -- : [163/885] 3779120=test_rbconfig I, [2024-05-03T05:56:51.271482 #3737750] INFO -- : [164/885] 3779112=test_win32ole_param I, [2024-05-03T05:56:51.275979 #3737750] INFO -- : [165/885] 3779112=test_gem_commands_yank_command I, [2024-05-03T05:56:51.285345 #3737750] INFO -- : [166/885] 3779115=test_pair I, [2024-05-03T05:56:51.286161 #3737750] INFO -- : [167/885] 3779120=test_document I, [2024-05-03T05:56:51.289570 #3737750] INFO -- : [168/885] 3779120=test_euc_jp I, [2024-05-03T05:56:51.295689 #3737750] INFO -- : [169/885] 3779120=test_rdoc_generator_pot_po_entry I, [2024-05-03T05:56:51.305423 #3737750] INFO -- : [170/885] 3779116=test_acceptable I, [2024-05-03T05:56:51.314845 #3737750] INFO -- : [171/885] 3779113=test_name_error_extension I, [2024-05-03T05:56:51.315906 #3737750] INFO -- : [172/885] 3779120=test_chilled I, [2024-05-03T05:56:51.318773 #3737750] INFO -- : [173/885] 3779113=test_rdoc_i18n_locale I, [2024-05-03T05:56:51.319701 #3737750] INFO -- : [174/885] 3779120=test_history I, [2024-05-03T05:56:51.327092 #3737750] INFO -- : [175/885] 3779113=test_date_marshal I, [2024-05-03T05:56:51.331944 #3737750] INFO -- : [176/885] 3779113=test_mkmf I, [2024-05-03T05:56:51.343133 #3737750] INFO -- : [177/885] 3779120=test_delegate I, [2024-05-03T05:56:51.344017 #3737750] INFO -- : [178/885] 3779113=test_popen_deadlock I, [2024-05-03T05:56:51.352900 #3737750] INFO -- : [179/885] 3779120=test_exit I, [2024-05-03T05:56:51.387183 #3737750] INFO -- : [180/885] 3779124=test_recursion I, [2024-05-03T05:56:51.391369 #3737750] INFO -- : [181/885] 3779124=test_ractor I, [2024-05-03T05:56:51.412213 #3737750] INFO -- : [182/885] 3779120=test_rdoc_servlet I, [2024-05-03T05:56:51.412427 #3737750] INFO -- : [183/885] 3779116=test_gem_security I, [2024-05-03T05:56:51.443933 #3737750] INFO -- : [184/885] 3779124=test_digest I, [2024-05-03T05:56:51.483805 #3737750] INFO -- : [185/885] 3779124=test_closure I, [2024-05-03T05:56:51.561536 #3737750] INFO -- : [186/885] 3779108=test_bundled_ca I, [2024-05-03T05:56:51.583185 #3737750] INFO -- : [187/885] 3779120=test_fiber I, [2024-05-03T05:56:51.589030 #3737750] INFO -- : [188/885] 3779124=test_multi_irb_commands I, [2024-05-03T05:56:51.612724 #3737750] INFO -- : [189/885] 3779124=test_open3 I, [2024-05-03T05:56:51.719281 #3737750] INFO -- : [190/885] 3779119=reflection_test I, [2024-05-03T05:56:51.725921 #3737750] INFO -- : [191/885] 3779119=test_gem_bundler_version_finder I, [2024-05-03T05:56:51.863303 #3737750] INFO -- : [192/885] 3779105=test_emoji_breaks I, [2024-05-03T05:56:51.865502 #3737750] INFO -- : [193/885] 3779105=test_within_pipe I, [2024-05-03T05:56:51.888623 #3737750] INFO -- : [194/885] 3779105=test_help I, [2024-05-03T05:56:51.895116 #3737750] INFO -- : [195/885] 3779105=test_rdoc_markup_to_bs I, [2024-05-03T05:56:51.900983 #3737750] INFO -- : [196/885] 3779114=test_gem_commands_unpack_command I, [2024-05-03T05:56:51.910641 #3737750] INFO -- : [197/885] 3779122=test_files_lib I, [2024-05-03T05:56:51.919755 #3737750] INFO -- : [198/885] 3779105=test_beginendblock I, [2024-05-03T05:56:51.935371 #3737750] INFO -- : [199/885] 3779112=test_time I, [2024-05-03T05:56:51.939242 #3737750] INFO -- : [200/885] 3779119=test_webauthn_listener_response I, [2024-05-03T05:56:51.955042 #3737750] INFO -- : [201/885] 3779113=test_to_ary_concat I, [2024-05-03T05:56:51.955463 #3737750] INFO -- : [202/885] 3779119=test_stream I, [2024-05-03T05:56:51.986792 #3737750] INFO -- : [203/885] 3779119=test_rdoc_markup_pre_process I, [2024-05-03T05:56:52.013862 #3737750] INFO -- : [204/885] 3779118=test_printf I, [2024-05-03T05:56:52.031278 #3737750] INFO -- : [205/885] 3779118=test_pinned I, [2024-05-03T05:56:52.046880 #3737750] INFO -- : [206/885] 3779119=test_rdoc_markup_heading I, [2024-05-03T05:56:52.054667 #3737750] INFO -- : [207/885] 3779119=test_iseq I, [2024-05-03T05:56:52.054991 #3737750] INFO -- : [208/885] 3779118=test_exception_at_throwing I, [2024-05-03T05:56:52.107365 #3737750] INFO -- : [209/885] 3779112=test_pkey_dsa I, [2024-05-03T05:56:52.119655 #3737750] INFO -- : [210/885] 3779118=test_class I, [2024-05-03T05:56:52.123771 #3737750] INFO -- : [211/885] 3779118=test_ocsp I, [2024-05-03T05:56:52.329076 #3737750] INFO -- : [212/885] 3779121=test_scheduler I, [2024-05-03T05:56:52.341424 #3737750] INFO -- : [213/885] 3779105=test_gem_commands_build_command I, [2024-05-03T05:56:52.371388 #3737750] INFO -- : [214/885] 3779114=test_interned_str I, [2024-05-03T05:56:52.422461 #3737750] INFO -- : [215/885] 3779114=test_case_comprehensive I, [2024-05-03T05:56:52.437917 #3737750] INFO -- : [216/885] 3779118=test_gem_commands_server_command I, [2024-05-03T05:56:52.446368 #3737750] INFO -- : [217/885] 3779106=test_variable_name_check I, [2024-05-03T05:56:52.446817 #3737750] INFO -- : [218/885] 3779118=test_io_m17n I, [2024-05-03T05:56:52.451531 #3737750] INFO -- : [219/885] 3779107=test_did_you_mean I, [2024-05-03T05:56:52.471074 #3737750] INFO -- : [220/885] 3779106=test_cmethod I, [2024-05-03T05:56:52.474332 #3737750] INFO -- : [221/885] 3779106=test_tracer I, [2024-05-03T05:56:52.520199 #3737750] INFO -- : [222/885] 3779121=test_append I, [2024-05-03T05:56:52.526206 #3737750] INFO -- : [223/885] 3779121=test_option I, [2024-05-03T05:56:52.575562 #3737750] INFO -- : [224/885] 3779106=test_x509store I, [2024-05-03T05:56:52.582352 #3737750] INFO -- : [225/885] 3779107=test_rdoc_code_object I, [2024-05-03T05:56:52.608359 #3737750] INFO -- : [226/885] 3779123=test_update I, [2024-05-03T05:56:52.610691 #3737750] INFO -- : [227/885] 3779123=test_x509name I, [2024-05-03T05:56:52.611555 #3737750] INFO -- : [228/885] 3779105=test_fips I, [2024-05-03T05:56:52.648083 #3737750] INFO -- : [229/885] 3779121=test_helper I, [2024-05-03T05:56:52.648220 #3737750] INFO -- : [230/885] 3779121=test_random_formatter I, [2024-05-03T05:56:52.651823 #3737750] INFO -- : [231/885] 3779123=test_jaro_winkler I, [2024-05-03T05:56:52.659328 #3737750] INFO -- : [232/885] 3779123=test_gem_request_set_gem_dependency_api I, [2024-05-03T05:56:52.674561 #3737750] INFO -- : [233/885] 3779121=test_ast I, [2024-05-03T05:56:52.685381 #3737750] INFO -- : [234/885] 3779113=test_lambda I, [2024-05-03T05:56:52.709833 #3737750] INFO -- : [235/885] 3779119=test_webauthn_listener I, [2024-05-03T05:56:52.740574 #3737750] INFO -- : [236/885] 3779113=test_enumerable I, [2024-05-03T05:56:52.747572 #3737750] INFO -- : [237/885] 3779113=test_config I, [2024-05-03T05:56:52.751687 #3737750] INFO -- : [238/885] 3779119=test_gem_resolver_vendor_set I, [2024-05-03T05:56:52.768834 #3737750] INFO -- : [239/885] 3779119=test_gem_resolver_api_set I, [2024-05-03T05:56:52.817975 #3737750] INFO -- : [240/885] 3779119=test_gem_safe_marshal I, [2024-05-03T05:56:52.868596 #3737750] INFO -- : [241/885] 3779105=test_transcode I, [2024-05-03T05:56:52.919761 #3737750] INFO -- : [242/885] 3779108=json_generator_test I, [2024-05-03T05:56:52.999443 #3737750] INFO -- : [243/885] 3779123=test_eval I, [2024-05-03T05:56:53.017954 #3737750] INFO -- : [244/885] 3779108=test_helper I, [2024-05-03T05:56:53.021221 #3737750] INFO -- : [245/885] 3779108=test_erb_command I, [2024-05-03T05:56:53.038655 #3737750] INFO -- : [246/885] 3779106=test_encoding I, [2024-05-03T05:56:53.041687 #3737750] INFO -- : [247/885] 3779105=test_gem_uri_formatter I, [2024-05-03T05:56:53.056181 #3737750] INFO -- : [248/885] 3779108=test_project_sanity I, [2024-05-03T05:56:53.060507 #3737750] INFO -- : [249/885] 3779105=test_range I, [2024-05-03T05:56:53.119790 #3737750] INFO -- : [250/885] 3779108=command_line_test I, [2024-05-03T05:56:53.128104 #3737750] INFO -- : [251/885] 3779111=test_constant I, [2024-05-03T05:56:53.190185 #3737750] INFO -- : [252/885] 3779108=test_pty I, [2024-05-03T05:56:53.217713 #3737750] INFO -- : [253/885] 3779107=test_dup I, [2024-05-03T05:56:53.224447 #3737750] INFO -- : [254/885] 3779123=test_rdoc_ri_paths I, [2024-05-03T05:56:53.234475 #3737750] INFO -- : [255/885] 3779113=test_ensured I, [2024-05-03T05:56:53.280003 #3737750] INFO -- : [256/885] 3779106=test_locale I, [2024-05-03T05:56:53.291826 #3737750] INFO -- : [257/885] 3779106=test_addr I, [2024-05-03T05:56:53.302285 #3737750] INFO -- : [258/885] 3779113=library_symbols_test I, [2024-05-03T05:56:53.316209 #3737750] INFO -- : [259/885] 3779106=test_ts I, [2024-05-03T05:56:53.352574 #3737750] INFO -- : [260/885] 3779110=errors_test I, [2024-05-03T05:56:53.360656 #3737750] INFO -- : [261/885] 3779123=test_gem_commands_check_command I, [2024-05-03T05:56:53.380969 #3737750] INFO -- : [262/885] 3779113=test_regexp I, [2024-05-03T05:56:53.385713 #3737750] INFO -- : [263/885] 3779123=test_rdoc_markup_document I, [2024-05-03T05:56:53.397899 #3737750] INFO -- : [264/885] 3779123=test_integer_comb I, [2024-05-03T05:56:53.438591 #3737750] INFO -- : [265/885] 3779110=test_tmpdir I, [2024-05-03T05:56:53.450081 #3737750] INFO -- : [266/885] 3779119=test_vm_dump I, [2024-05-03T05:56:53.451072 #3737750] INFO -- : [267/885] 3779119=test_udp I, [2024-05-03T05:56:53.455732 #3737750] INFO -- : [268/885] 3779119=bom_test I, [2024-05-03T05:56:53.464345 #3737750] INFO -- : [269/885] 3779107=test_data_error I, [2024-05-03T05:56:53.480362 #3737750] INFO -- : [270/885] 3779119=test_file I, [2024-05-03T05:56:53.558229 #3737750] INFO -- : [271/885] 3779107=test_force_exit I, [2024-05-03T05:56:53.566148 #3737750] INFO -- : [272/885] 3779110=unescape_test I, [2024-05-03T05:56:53.644839 #3737750] INFO -- : [273/885] 3779105=test_ostruct I, [2024-05-03T05:56:53.672619 #3737750] INFO -- : [274/885] 3779107=static_inspect_test I, [2024-05-03T05:56:53.677350 #3737750] INFO -- : [275/885] 3779107=test_timeout I, [2024-05-03T05:56:53.690682 #3737750] INFO -- : [276/885] 3779107=test_ossl I, [2024-05-03T05:56:53.697553 #3737750] INFO -- : [277/885] 3779108=test_normalize I, [2024-05-03T05:56:53.700380 #3737750] INFO -- : [278/885] 3779108=test_change_word I, [2024-05-03T05:56:53.704900 #3737750] INFO -- : [279/885] 3779108=compiler_test I, [2024-05-03T05:56:53.714268 #3737750] INFO -- : [280/885] 3779108=test_flip I, [2024-05-03T05:56:53.736652 #3737750] INFO -- : [281/885] 3779108=test_sleep I, [2024-05-03T05:56:53.773610 #3737750] INFO -- : [282/885] 3779118=test_ruby_lex I, [2024-05-03T05:56:53.783608 #3737750] INFO -- : [283/885] 3779124=test_object I, [2024-05-03T05:56:53.789764 #3737750] INFO -- : [284/885] 3779105=test_date_arith I, [2024-05-03T05:56:53.794651 #3737750] INFO -- : [285/885] 3779105=test_gem_local_remote_options I, [2024-05-03T05:56:53.812546 #3737750] INFO -- : [286/885] 3779106=test_pointer I, [2024-05-03T05:56:53.829033 #3737750] INFO -- : [287/885] 3779105=test_func I, [2024-05-03T05:56:53.957701 #3737750] INFO -- : [288/885] 3779118=test_big5 I, [2024-05-03T05:56:53.964149 #3737750] INFO -- : [289/885] 3779118=test_ractor I, [2024-05-03T05:56:54.017279 #3737750] INFO -- : [290/885] 3779106=test_type I, [2024-05-03T05:56:54.019198 #3737750] INFO -- : [291/885] 3779106=test_signedness I, [2024-05-03T05:56:54.022682 #3737750] INFO -- : [292/885] 3779118=test_tsort I, [2024-05-03T05:56:54.031113 #3737750] INFO -- : [293/885] 3779118=test_rdoc_rd_block_parser I, [2024-05-03T05:56:54.213947 #3737750] INFO -- : [294/885] 3779118=test_object I, [2024-05-03T05:56:54.217667 #3737750] INFO -- : [295/885] 3779118=heredoc_dedent_test I, [2024-05-03T05:56:54.227041 #3737750] INFO -- : [296/885] 3779124=test_cgi_header I, [2024-05-03T05:56:54.230710 #3737750] INFO -- : [297/885] 3779124=version_test I, [2024-05-03T05:56:54.242121 #3737750] INFO -- : [298/885] 3779124=test_gem_gemcutter_utilities I, [2024-05-03T05:56:54.319296 #3737750] INFO -- : [299/885] 3779118=test_basicinstructions I, [2024-05-03T05:56:54.390853 #3737750] INFO -- : [300/885] 3779118=test_gem_command_manager I, [2024-05-03T05:56:54.526476 #3737750] INFO -- : [301/885] 3779118=test_key_actor_emacs I, [2024-05-03T05:56:54.644971 #3737750] INFO -- : [302/885] 3779118=test_arithmetic_sequence I, [2024-05-03T05:56:54.656423 #3737750] INFO -- : [303/885] 3779118=test_file_exhaustive I, [2024-05-03T05:56:54.690162 #3737750] INFO -- : [304/885] 3779115=test_gem_update_suggestion I, [2024-05-03T05:56:54.765372 #3737750] INFO -- : [305/885] 3779124=test_files_test I, [2024-05-03T05:56:54.766700 #3737750] INFO -- : [306/885] 3779115=test_logger I, [2024-05-03T05:56:54.786424 #3737750] INFO -- : [307/885] 3779115=test_not I, [2024-05-03T05:56:54.787909 #3737750] INFO -- : [308/885] 3779115=test_gem_resolver_lock_set I, [2024-05-03T05:56:54.790998 #3737750] INFO -- : [309/885] 3779105=test_import I, [2024-05-03T05:56:54.815939 #3737750] INFO -- : [310/885] 3779115=test_rdoc_parser_markdown I, [2024-05-03T05:56:54.845290 #3737750] INFO -- : [311/885] 3779124=test_weakkeymap I, [2024-05-03T05:56:54.913749 #3737750] INFO -- : [312/885] 3779112=test_gem_commands_push_command I, [2024-05-03T05:56:55.010454 #3737750] INFO -- : [313/885] 3779115=test_numhash I, [2024-05-03T05:56:55.012537 #3737750] INFO -- : [314/885] 3779115=test_pkey_rsa I, [2024-05-03T05:56:55.013203 #3737750] INFO -- : [315/885] 3779124=test_gem_platform I, [2024-05-03T05:56:55.102151 #3737750] INFO -- : [316/885] 3779124=test_placearg I, [2024-05-03T05:56:55.235205 #3737750] INFO -- : [317/885] 3779124=test_date_strptime I, [2024-05-03T05:56:55.312259 #3737750] INFO -- : [318/885] 3779115=test_gem_package_task I, [2024-05-03T05:56:55.314655 #3737750] INFO -- : [319/885] 3779105=test_rdoc_markup_hard_break I, [2024-05-03T05:56:55.317386 #3737750] INFO -- : [320/885] 3779105=test_win32ole_method I, [2024-05-03T05:56:55.319001 #3737750] INFO -- : [321/885] 3779105=test_delete I, [2024-05-03T05:56:55.319587 #3737750] INFO -- : [322/885] 3779122=test_class_name_check I, [2024-05-03T05:56:55.321324 #3737750] INFO -- : [323/885] 3779115=test_keyword I, [2024-05-03T05:56:55.322194 #3737750] INFO -- : [324/885] 3779105=test_fd_setsize I, [2024-05-03T05:56:55.323628 #3737750] INFO -- : [325/885] 3779105=test_continuation I, [2024-05-03T05:56:55.327342 #3737750] INFO -- : [326/885] 3779124=test_function_entry I, [2024-05-03T05:56:55.328479 #3737750] INFO -- : [327/885] 3779105=test_gem_resolver_requirement_list I, [2024-05-03T05:56:55.330275 #3737750] INFO -- : [328/885] 3779124=test_arith_seq_beg_len_step I, [2024-05-03T05:56:55.332341 #3737750] INFO -- : [329/885] 3779124=test_pkcs7 I, [2024-05-03T05:56:55.334892 #3737750] INFO -- : [330/885] 3779105=test_lazy_enumerator I, [2024-05-03T05:56:55.338043 #3737750] INFO -- : [331/885] 3779122=test_enc_associate I, [2024-05-03T05:56:55.453954 #3737750] INFO -- : [332/885] 3779112=test_unix I, [2024-05-03T05:56:55.482579 #3737750] INFO -- : [333/885] 3779111=test_symbol I, [2024-05-03T05:56:55.486385 #3737750] INFO -- : [334/885] 3779112=test_coder I, [2024-05-03T05:56:55.498104 #3737750] INFO -- : [335/885] 3779112=test_nofree I, [2024-05-03T05:56:55.502351 #3737750] INFO -- : [336/885] 3779112=test_gem_commands_pristine_command I, [2024-05-03T05:56:55.522344 #3737750] INFO -- : [337/885] 3779110=test_context I, [2024-05-03T05:56:55.531791 #3737750] INFO -- : [338/885] 3779124=ruby_api_test I, [2024-05-03T05:56:55.680323 #3737750] INFO -- : [339/885] 3779124=test_find_executable I, [2024-05-03T05:56:55.698103 #3737750] INFO -- : [340/885] 3779124=test_word I, [2024-05-03T05:56:55.702167 #3737750] INFO -- : [341/885] 3779124=test_gem_commands_cleanup_command I, [2024-05-03T05:56:55.748774 #3737750] INFO -- : [342/885] 3779105=test_cgi_multipart I, [2024-05-03T05:56:55.788328 #3737750] INFO -- : [343/885] 3779110=test_numeric I, [2024-05-03T05:56:55.795590 #3737750] INFO -- : [344/885] 3779110=test_member I, [2024-05-03T05:56:55.799772 #3737750] INFO -- : [345/885] 3779110=test_ractor_compatibility I, [2024-05-03T05:56:55.808597 #3737750] INFO -- : [346/885] 3779115=test_autoconf I, [2024-05-03T05:56:55.813706 #3737750] INFO -- : [347/885] 3779115=test_eval I, [2024-05-03T05:56:55.816531 #3737750] INFO -- : [348/885] 3779115=test_dir I, [2024-05-03T05:56:55.868799 #3737750] INFO -- : [349/885] 3779123=format_errors_test I, [2024-05-03T05:56:55.928476 #3737750] INFO -- : [350/885] 3779105=test_date_ractor I, [2024-05-03T05:56:55.935160 #3737750] INFO -- : [351/885] 3779123=test_gem_console_ui I, [2024-05-03T05:56:55.941094 #3737750] INFO -- : [352/885] 3779123=test_mailto I, [2024-05-03T05:56:55.954082 #3737750] INFO -- : [353/885] 3779123=test_coderange I, [2024-05-03T05:56:55.959332 #3737750] INFO -- : [354/885] 3779122=test_symbol I, [2024-05-03T05:56:55.959890 #3737750] INFO -- : [355/885] 3779123=location_test I, [2024-05-03T05:56:55.985047 #3737750] INFO -- : [356/885] 3779122=test_gem_source_fetch_problem I, [2024-05-03T05:56:56.019121 #3737750] INFO -- : [357/885] 3779123=json_generic_object_test I, [2024-05-03T05:56:56.027838 #3737750] INFO -- : [358/885] 3779123=test_http_request I, [2024-05-03T05:56:56.077313 #3737750] INFO -- : [359/885] 3779123=test_rdoc_generator_darkfish I, [2024-05-03T05:56:56.095834 #3737750] INFO -- : [360/885] 3779115=test_resize I, [2024-05-03T05:56:56.101252 #3737750] INFO -- : [361/885] 3779115=test_error_highlight I, [2024-05-03T05:56:56.136541 #3737750] INFO -- : [362/885] 3779124=test_rdoc_comment I, [2024-05-03T05:56:56.185224 #3737750] INFO -- : [363/885] 3779105=test_merge_keys I, [2024-05-03T05:56:56.192792 #3737750] INFO -- : [364/885] 3779122=test_rdoc_extend I, [2024-05-03T05:56:56.194895 #3737750] INFO -- : [365/885] 3779105=test_ipaddr I, [2024-05-03T05:56:56.215607 #3737750] INFO -- : [366/885] 3779105=test_rdoc_markup_to_ansi I, [2024-05-03T05:56:56.254890 #3737750] INFO -- : [367/885] 3779105=test_history I, [2024-05-03T05:56:56.267317 #3737750] INFO -- : [368/885] 3779124=test_mixed_unicode_escapes I, [2024-05-03T05:56:56.269464 #3737750] INFO -- : [369/885] 3779105=test_win32ole_variant I, [2024-05-03T05:56:56.275873 #3737750] INFO -- : [370/885] 3779110=test_gem_resolver_api_specification I, [2024-05-03T05:56:56.276559 #3737750] INFO -- : [371/885] 3779124=test_rdoc_generator_json_index I, [2024-05-03T05:56:56.279750 #3737750] INFO -- : [372/885] 3779105=test_time_tz I, [2024-05-03T05:56:56.311340 #3737750] INFO -- : [373/885] 3779110=test_win32ole_event I, [2024-05-03T05:56:56.315444 #3737750] INFO -- : [374/885] 3779105=ractor_test I, [2024-05-03T05:56:56.318731 #3737750] INFO -- : [375/885] 3779110=test_trace I, [2024-05-03T05:56:56.321717 #3737750] INFO -- : [376/885] 3779124=test_win32ole_variable I, [2024-05-03T05:56:56.325105 #3737750] INFO -- : [377/885] 3779124=test_io_wait_uncommon I, [2024-05-03T05:56:56.332965 #3737750] INFO -- : [378/885] 3779124=test_arity I, [2024-05-03T05:56:56.335145 #3737750] INFO -- : [379/885] 3779124=test_stringio I, [2024-05-03T05:56:56.345627 #3737750] INFO -- : [380/885] 3779110=test_gem_ci_detector I, [2024-05-03T05:56:56.354252 #3737750] INFO -- : [381/885] 3779110=test_bignum I, [2024-05-03T05:56:56.372706 #3737750] INFO -- : [382/885] 3779105=test_rdoc_class_module I, [2024-05-03T05:56:56.393605 #3737750] INFO -- : [383/885] 3779106=test_threadgroup I, [2024-05-03T05:56:56.433427 #3737750] INFO -- : [384/885] 3779122=test_gem_specification I, [2024-05-03T05:56:56.472080 #3737750] INFO -- : [385/885] 3779124=test_enum I, [2024-05-03T05:56:56.473626 #3737750] INFO -- : [386/885] 3779123=test_have_macro I, [2024-05-03T05:56:56.494112 #3737750] INFO -- : [387/885] 3779110=test_resolve_symbol I, [2024-05-03T05:56:56.552496 #3737750] INFO -- : [388/885] 3779110=test_complex2 I, [2024-05-03T05:56:56.559039 #3737750] INFO -- : [389/885] 3779115=test_gem_package I, [2024-05-03T05:56:56.568001 #3737750] INFO -- : [390/885] 3779110=test_ractor I, [2024-05-03T05:56:56.611646 #3737750] INFO -- : [391/885] 3779116=json_ext_parser_test I, [2024-05-03T05:56:56.613239 #3737750] INFO -- : [392/885] 3779116=test_thread I, [2024-05-03T05:56:56.844085 #3737750] INFO -- : [393/885] 3779110=test_my_integer I, [2024-05-03T05:56:56.846292 #3737750] INFO -- : [394/885] 3779110=test_debugger_integration I, [2024-05-03T05:56:56.857002 #3737750] INFO -- : [395/885] 3779110=test_rendering I, [2024-05-03T05:56:56.866930 #3737750] INFO -- : [396/885] 3779110=test_ssl I, [2024-05-03T05:56:56.868977 #3737750] INFO -- : [397/885] 3779112=test_ancdata I, [2024-05-03T05:56:56.874478 #3737750] INFO -- : [398/885] 3779112=test_singleton_function I, [2024-05-03T05:56:56.875792 #3737750] INFO -- : [399/885] 3779112=test_rb_str_dup I, [2024-05-03T05:56:56.879339 #3737750] INFO -- : [400/885] 3779112=test_reline_key I, [2024-05-03T05:56:56.936622 #3737750] INFO -- : [401/885] 3779105=test_unicode_normalize I, [2024-05-03T05:56:56.940108 #3737750] INFO -- : [402/885] 3779112=test_marshal I, [2024-05-03T05:56:56.983410 #3737750] INFO -- : [403/885] 3779123=test_weakref I, [2024-05-03T05:56:57.150153 #3737750] INFO -- : [404/885] 3779123=test_nonblock I, [2024-05-03T05:56:57.157109 #3737750] INFO -- : [405/885] 3779123=test_alias I, [2024-05-03T05:56:57.171458 #3737750] INFO -- : [406/885] 3779111=test_timeout I, [2024-05-03T05:56:57.242919 #3737750] INFO -- : [407/885] 3779115=test_parser I, [2024-05-03T05:56:57.251525 #3737750] INFO -- : [408/885] 3779115=test_cgi_core I, [2024-05-03T05:56:57.266586 #3737750] INFO -- : [409/885] 3779115=test_gem_commands_open_command I, [2024-05-03T05:56:57.294941 #3737750] INFO -- : [410/885] 3779123=test_dns I, [2024-05-03T05:56:57.340352 #3737750] INFO -- : [411/885] 3779124=test_ractor I, [2024-05-03T05:56:57.355396 #3737750] INFO -- : [412/885] 3779124=test_gem_source_lock I, [2024-05-03T05:56:57.372971 #3737750] INFO -- : [413/885] 3779115=test_gem I, [2024-05-03T05:56:57.373951 #3737750] INFO -- : [414/885] 3779110=parse_stream_test I, [2024-05-03T05:56:57.379161 #3737750] INFO -- : [415/885] 3779110=test_registry I, [2024-05-03T05:56:57.382392 #3737750] INFO -- : [416/885] 3779110=desugar_compiler_test I, [2024-05-03T05:56:57.396726 #3737750] INFO -- : [417/885] 3779106=test_integer I, [2024-05-03T05:56:57.406850 #3737750] INFO -- : [418/885] 3779110=test_dryrun I, [2024-05-03T05:56:57.412482 #3737750] INFO -- : [419/885] 3779124=test_rdoc_attr I, [2024-05-03T05:56:57.415598 #3737750] INFO -- : [420/885] 3779112=test_env I, [2024-05-03T05:56:57.435886 #3737750] INFO -- : [421/885] 3779110=test_gem_commands_setup_command I, [2024-05-03T05:56:57.440267 #3737750] INFO -- : [422/885] 3779124=test_https_proxy I, [2024-05-03T05:56:57.473985 #3737750] INFO -- : [423/885] 3779106=test_call I, [2024-05-03T05:56:57.500001 #3737750] INFO -- : [424/885] 3779124=test_rubygems I, [2024-05-03T05:56:57.586001 #3737750] INFO -- : [425/885] 3779120=test_cgi_modruby I, [2024-05-03T05:56:57.590380 #3737750] INFO -- : [426/885] 3779120=test_integer I, [2024-05-03T05:56:57.618023 #3737750] INFO -- : [427/885] 3779106=test_super I, [2024-05-03T05:56:57.693881 #3737750] INFO -- : [428/885] 3779124=test_rubyoptions I, [2024-05-03T05:56:57.750143 #3737750] INFO -- : [429/885] 3779123=test_gem_resolver_git_specification I, [2024-05-03T05:56:57.788162 #3737750] INFO -- : [430/885] 3779110=test_object_references I, [2024-05-03T05:56:57.798380 #3737750] INFO -- : [431/885] 3779110=test_usrmarshal I, [2024-05-03T05:56:57.990704 #3737750] INFO -- : [432/885] 3779123=test_nextafter I, [2024-05-03T05:56:58.010953 #3737750] INFO -- : [433/885] 3779111=test_capacity I, [2024-05-03T05:56:58.014947 #3737750] INFO -- : [434/885] 3779111=test_stat I, [2024-05-03T05:56:58.017832 #3737750] INFO -- : [435/885] 3779111=test_gem_request_set_lockfile_tokenizer I, [2024-05-03T05:56:58.023791 #3737750] INFO -- : [436/885] 3779110=test_have_func I, [2024-05-03T05:56:58.067004 #3737750] INFO -- : [437/885] 3779123=test_severity I, [2024-05-03T05:56:58.071142 #3737750] INFO -- : [438/885] 3779123=test_ractor I, [2024-05-03T05:56:58.082577 #3737750] INFO -- : [439/885] 3779123=test_require_lib I, [2024-05-03T05:56:58.162435 #3737750] INFO -- : [440/885] 3779106=parse_test I, [2024-05-03T05:56:58.260921 #3737750] INFO -- : [441/885] 3779111=test_gem_install_update_options I, [2024-05-03T05:56:58.370545 #3737750] INFO -- : [442/885] 3779111=test_gem_stream_ui I, [2024-05-03T05:56:58.434983 #3737750] INFO -- : [443/885] 3779111=test_rdoc_generator_ri I, [2024-05-03T05:56:58.602330 #3737750] INFO -- : [444/885] 3779111=test_extlibs I, [2024-05-03T05:56:58.746668 #3737750] INFO -- : [445/885] 3779108=test_literal I, [2024-05-03T05:56:58.791758 #3737750] INFO -- : [446/885] 3779122=test_str2big I, [2024-05-03T05:56:58.793433 #3737750] INFO -- : [447/885] 3779122=test_c_struct_builder I, [2024-05-03T05:56:58.857134 #3737750] INFO -- : [448/885] 3779122=test_dot_dot I, [2024-05-03T05:56:58.860109 #3737750] INFO -- : [449/885] 3779122=test_rdoc_markup_to_table_of_contents I, [2024-05-03T05:56:58.881013 #3737750] INFO -- : [450/885] 3779122=test_socket I, [2024-05-03T05:56:59.017495 #3737750] INFO -- : [451/885] 3779117=test_thread I, [2024-05-03T05:56:59.241909 #3737750] INFO -- : [452/885] 3779117=test_objectspace I, [2024-05-03T05:56:59.354824 #3737750] INFO -- : [453/885] 3779115=test_pkey I, [2024-05-03T05:56:59.395114 #3737750] INFO -- : [454/885] 3779115=test_case I, [2024-05-03T05:56:59.397615 #3737750] INFO -- : [455/885] 3779115=test_reline I, [2024-05-03T05:56:59.459930 #3737750] INFO -- : [456/885] 3779108=test_parser_events I, [2024-05-03T05:56:59.561858 #3737750] INFO -- : [457/885] 3779108=test_cclass I, [2024-05-03T05:56:59.571921 #3737750] INFO -- : [458/885] 3779119=test_gem_request_connection_pools I, [2024-05-03T05:56:59.641119 #3737750] INFO -- : [459/885] 3779115=test_grapheme_breaks I, [2024-05-03T05:56:59.667139 #3737750] INFO -- : [460/885] 3779115=test_gem_version_option I, [2024-05-03T05:56:59.680546 #3737750] INFO -- : [461/885] 3779108=test_m17n_comb I, [2024-05-03T05:56:59.698077 #3737750] INFO -- : [462/885] 3779110=test_memory_view I, [2024-05-03T05:56:59.721238 #3737750] INFO -- : [463/885] 3779115=test_ractor I, [2024-05-03T05:56:59.797150 #3737750] INFO -- : [464/885] 3779115=test_rdoc_generator_pot_po I, [2024-05-03T05:56:59.797914 #3737750] INFO -- : [465/885] 3779115=test_ansi_with_terminfo I, [2024-05-03T05:56:59.806994 #3737750] INFO -- : [466/885] 3779115=test_rdoc_markup_to_markdown I, [2024-05-03T05:56:59.848479 #3737750] INFO -- : [467/885] 3779115=test_json_tree I, [2024-05-03T05:56:59.853022 #3737750] INFO -- : [468/885] 3779115=test_gem_ext_cargo_builder_link_flag_converter I, [2024-05-03T05:56:59.859578 #3737750] INFO -- : [469/885] 3779110=test_gem_commands_mirror I, [2024-05-03T05:56:59.865092 #3737750] INFO -- : [470/885] 3779110=test_gem_request I, [2024-05-03T05:56:59.919459 #3737750] INFO -- : [471/885] 3779115=test_method_cache I, [2024-05-03T05:56:59.924315 #3737750] INFO -- : [472/885] 3779115=test_sprintf_comb I, [2024-05-03T05:57:00.042772 #3737750] INFO -- : [473/885] 3779122=test_generic I, [2024-05-03T05:57:00.048633 #3737750] INFO -- : [474/885] 3779110=test_win32ole I, [2024-05-03T05:57:00.057100 #3737750] INFO -- : [475/885] 3779110=test_scan_args I, [2024-05-03T05:57:00.064576 #3737750] INFO -- : [476/885] 3779110=test_enumerator_kw I, [2024-05-03T05:57:00.066967 #3737750] INFO -- : [477/885] 3779110=test_gem_text I, [2024-05-03T05:57:00.093928 #3737750] INFO -- : [478/885] 3779122=test_settracefunc I, [2024-05-03T05:57:00.100583 #3737750] INFO -- : [479/885] 3779110=test_rdoc_cross_reference I, [2024-05-03T05:57:00.103647 #3737750] INFO -- : [480/885] 3779115=test_gem_dependency_installer I, [2024-05-03T05:57:00.127438 #3737750] INFO -- : [481/885] 3779109=test_scalar I, [2024-05-03T05:57:00.135270 #3737750] INFO -- : [482/885] 3779109=test_gem_commands_info_command I, [2024-05-03T05:57:00.149942 #3737750] INFO -- : [483/885] 3779109=test_case_options I, [2024-05-03T05:57:00.155970 #3737750] INFO -- : [484/885] 3779109=test_store I, [2024-05-03T05:57:00.239402 #3737750] INFO -- : [485/885] 3779117=test_exception I, [2024-05-03T05:57:00.295970 #3737750] INFO -- : [486/885] 3779105=test_bug_reporter I, [2024-05-03T05:57:00.307685 #3737750] INFO -- : [487/885] 3779107=test_rand I, [2024-05-03T05:57:00.348040 #3737750] INFO -- : [488/885] 3779120=test_gem_name_tuple I, [2024-05-03T05:57:00.366810 #3737750] INFO -- : [489/885] 3779109=test_gem_package_tar_reader_entry I, [2024-05-03T05:57:00.368267 #3737750] INFO -- : [490/885] 3779120=test_rdoc_parser_ruby I, [2024-05-03T05:57:00.455410 #3737750] INFO -- : [491/885] 3779110=test_httpresponse I, [2024-05-03T05:57:00.475314 #3737750] INFO -- : [492/885] 3779110=test_open-uri I, [2024-05-03T05:57:00.488899 #3737750] INFO -- : [493/885] 3779111=test_rdoc_context I, [2024-05-03T05:57:00.529559 #3737750] INFO -- : [494/885] 3779112=test_stream I, [2024-05-03T05:57:00.538276 #3737750] INFO -- : [495/885] 3779112=test_nil2vtempty I, [2024-05-03T05:57:00.544113 #3737750] INFO -- : [496/885] 3779112=test_iso_8859 I, [2024-05-03T05:57:00.577295 #3737750] INFO -- : [497/885] 3779112=test_tcp I, [2024-05-03T05:57:00.579842 #3737750] INFO -- : [498/885] 3779109=test_rdoc_text I, [2024-05-03T05:57:00.602442 #3737750] INFO -- : [499/885] 3779107=test_gem_safe_yaml I, [2024-05-03T05:57:00.613392 #3737750] INFO -- : [500/885] 3779119=test_syntax I, [2024-05-03T05:57:00.621619 #3737750] INFO -- : [501/885] 3779109=test_data I, [2024-05-03T05:57:00.628692 #3737750] INFO -- : [502/885] 3779107=test_date_new I, [2024-05-03T05:57:00.630905 #3737750] INFO -- : [503/885] 3779109=index_write_test I, [2024-05-03T05:57:00.635626 #3737750] INFO -- : [504/885] 3779109=test_date_time I, [2024-05-03T05:57:00.640903 #3737750] INFO -- : [505/885] 3779107=test_rdoc_markup_to_joined_paragraph I, [2024-05-03T05:57:00.647611 #3737750] INFO -- : [506/885] 3779109=test_require I, [2024-05-03T05:57:00.648842 #3737750] INFO -- : [507/885] 3779107=test_shift_jis I, [2024-05-03T05:57:00.651217 #3737750] INFO -- : [508/885] 3779109=test_gem_commands_which_command I, [2024-05-03T05:57:00.652729 #3737750] INFO -- : [509/885] 3779107=test_http I, [2024-05-03T05:57:00.657425 #3737750] INFO -- : [510/885] 3779118=test_enumerator I, [2024-05-03T05:57:00.680357 #3737750] INFO -- : [511/885] 3779107=test_inadvertent_creation I, [2024-05-03T05:57:00.682535 #3737750] INFO -- : [512/885] 3779105=test_flags I, [2024-05-03T05:57:00.691404 #3737750] INFO -- : [513/885] 3779109=test_gem_commands_specification_command I, [2024-05-03T05:57:00.724772 #3737750] INFO -- : [514/885] 3779112=test_gem_commands_dependency_command I, [2024-05-03T05:57:00.786921 #3737750] INFO -- : [515/885] 3779107=test_gem_resolver_composed_set I, [2024-05-03T05:57:00.809885 #3737750] INFO -- : [516/885] 3779109=test_safe_load I, [2024-05-03T05:57:00.814778 #3737750] INFO -- : [517/885] 3779107=test_gem_resolver I, [2024-05-03T05:57:00.818094 #3737750] INFO -- : [518/885] 3779112=test_rdoc_markup_attribute_manager I, [2024-05-03T05:57:00.821480 #3737750] INFO -- : [519/885] 3779109=test_name_error I, [2024-05-03T05:57:00.862327 #3737750] INFO -- : [520/885] 3779112=test_process I, [2024-05-03T05:57:00.942401 #3737750] INFO -- : [521/885] 3779109=test_last_thread I, [2024-05-03T05:57:00.965681 #3737750] INFO -- : [522/885] 3779106=test_pack I, [2024-05-03T05:57:00.987257 #3737750] INFO -- : [523/885] 3779120=test_gem_source_local I, [2024-05-03T05:57:01.098270 #3737750] INFO -- : [524/885] 3779122=test_gem_security_policy I, [2024-05-03T05:57:01.125462 #3737750] INFO -- : [525/885] 3779110=test_gem_ext_rake_builder I, [2024-05-03T05:57:01.154976 #3737750] INFO -- : [526/885] 3779107=test_arity I, [2024-05-03T05:57:01.164437 #3737750] INFO -- : [527/885] 3779107=test_logdevice I, [2024-05-03T05:57:01.194742 #3737750] INFO -- : [528/885] 3779106=test_err_in_callback I, [2024-05-03T05:57:01.194820 #3737750] INFO -- : [529/885] 3779106=test_gem_resolver_lock_specification I, [2024-05-03T05:57:01.247267 #3737750] INFO -- : [530/885] 3779120=test_gc I, [2024-05-03T05:57:01.351966 #3737750] INFO -- : [531/885] 3779111=test_x509cert I, [2024-05-03T05:57:01.425447 #3737750] INFO -- : [532/885] 3779106=test_securerandom I, [2024-05-03T05:57:01.492492 #3737750] INFO -- : [533/885] 3779122=test_rdoc_normal_module I, [2024-05-03T05:57:01.528254 #3737750] INFO -- : [534/885] 3779106=test_c_union_entity I, [2024-05-03T05:57:01.551159 #3737750] INFO -- : [535/885] 3779122=test_rdoc_markdown_test I, [2024-05-03T05:57:01.595483 #3737750] INFO -- : [536/885] 3779106=test_logperiod I, [2024-05-03T05:57:01.600156 #3737750] INFO -- : [537/885] 3779106=test_io_console I, [2024-05-03T05:57:01.621545 #3737750] INFO -- : [538/885] 3779111=test_flush I, [2024-05-03T05:57:01.627730 #3737750] INFO -- : [539/885] 3779111=test_singleton I, [2024-05-03T05:57:01.632513 #3737750] INFO -- : [540/885] 3779111=test_switch_hitter I, [2024-05-03T05:57:01.652847 #3737750] INFO -- : [541/885] 3779111=test_uncorrectable_name_check I, [2024-05-03T05:57:01.661873 #3737750] INFO -- : [542/885] 3779108=newline_test I, [2024-05-03T05:57:01.662947 #3737750] INFO -- : [543/885] 3779111=test_hash_create I, [2024-05-03T05:57:01.669016 #3737750] INFO -- : [544/885] 3779111=test_stringchar I, [2024-05-03T05:57:01.732200 #3737750] INFO -- : [545/885] 3779108=test_passing_block I, [2024-05-03T05:57:01.746070 #3737750] INFO -- : [546/885] 3779108=test_thread_fd_close I, [2024-05-03T05:57:01.749456 #3737750] INFO -- : [547/885] 3779108=test_rdoc_token_stream I, [2024-05-03T05:57:01.755025 #3737750] INFO -- : [548/885] 3779108=test_address_resolve I, [2024-05-03T05:57:01.765629 #3737750] INFO -- : [549/885] 3779108=test_optarg I, [2024-05-03T05:57:01.784826 #3737750] INFO -- : [550/885] 3779111=test_yaml_special_cases I, [2024-05-03T05:57:01.793899 #3737750] INFO -- : [551/885] 3779111=test_gem_source_list I, [2024-05-03T05:57:01.798848 #3737750] INFO -- : [552/885] 3779105=test_config I, [2024-05-03T05:57:01.832697 #3737750] INFO -- : [553/885] 3779108=test_verbose I, [2024-05-03T05:57:01.840295 #3737750] INFO -- : [554/885] 3779105=test_rdoc_single_class I, [2024-05-03T05:57:01.840614 #3737750] INFO -- : [555/885] 3779111=test_num2int I, [2024-05-03T05:57:01.847526 #3737750] INFO -- : [556/885] 3779105=test_nil I, [2024-05-03T05:57:01.851063 #3737750] INFO -- : [557/885] 3779108=test_macro I, [2024-05-03T05:57:01.854258 #3737750] INFO -- : [558/885] 3779105=test_pp I, [2024-05-03T05:57:01.856843 #3737750] INFO -- : [559/885] 3779108=test_frozen I, [2024-05-03T05:57:01.859340 #3737750] INFO -- : [560/885] 3779108=test_gem_ext_configure_builder I, [2024-05-03T05:57:01.871617 #3737750] INFO -- : [561/885] 3779111=test_exception I, [2024-05-03T05:57:01.885720 #3737750] INFO -- : [562/885] 3779111=test_zsh_completion I, [2024-05-03T05:57:01.888325 #3737750] INFO -- : [563/885] 3779111=test_iter_break I, [2024-05-03T05:57:01.890402 #3737750] INFO -- : [564/885] 3779123=test_rdoc_markup_to_tt_only I, [2024-05-03T05:57:01.891410 #3737750] INFO -- : [565/885] 3779111=test_hmac I, [2024-05-03T05:57:01.896457 #3737750] INFO -- : [566/885] 3779111=test_rdoc_tom_doc I, [2024-05-03T05:57:01.915185 #3737750] INFO -- : [567/885] 3779123=test_numeric I, [2024-05-03T05:57:01.921390 #3737750] INFO -- : [568/885] 3779111=test_assignment I, [2024-05-03T05:57:01.923500 #3737750] INFO -- : [569/885] 3779105=test_ifunless I, [2024-05-03T05:57:01.932221 #3737750] INFO -- : [570/885] 3779105=test_gem_commands_lock_command I, [2024-05-03T05:57:01.951164 #3737750] INFO -- : [571/885] 3779108=test_gem_command I, [2024-05-03T05:57:01.952202 #3737750] INFO -- : [572/885] 3779105=test_key_actor_vi I, [2024-05-03T05:57:01.987961 #3737750] INFO -- : [573/885] 3779123=test_bug-3571 I, [2024-05-03T05:57:02.002118 #3737750] INFO -- : [574/885] 3779110=test_common I, [2024-05-03T05:57:02.008265 #3737750] INFO -- : [575/885] 3779123=test_gem_spec_fetcher I, [2024-05-03T05:57:02.010966 #3737750] INFO -- : [576/885] 3779105=test_psych I, [2024-05-03T05:57:02.016023 #3737750] INFO -- : [577/885] 3779109=test_enc_raise I, [2024-05-03T05:57:02.017651 #3737750] INFO -- : [578/885] 3779109=!Nothing_to_test I, [2024-05-03T05:57:02.019185 #3737750] INFO -- : [579/885] 3779109=test_rdoc_markup_paragraph I, [2024-05-03T05:57:02.022623 #3737750] INFO -- : [580/885] 3779109=test_object_create_start I, [2024-05-03T05:57:02.024971 #3737750] INFO -- : [581/885] 3779109=test_at_exit I, [2024-05-03T05:57:02.029653 #3737750] INFO -- : [582/885] 3779107=test_command I, [2024-05-03T05:57:02.036536 #3737750] INFO -- : [583/885] 3779105=test_gem_rdoc I, [2024-05-03T05:57:02.045607 #3737750] INFO -- : [584/885] 3779108=test_date I, [2024-05-03T05:57:02.052460 #3737750] INFO -- : [585/885] 3779108=test_gem_ext_cargo_builder_unit I, [2024-05-03T05:57:02.055717 #3737750] INFO -- : [586/885] 3779109=test_bug-5832 I, [2024-05-03T05:57:02.069887 #3737750] INFO -- : [587/885] 3779108=test_files_ext I, [2024-05-03T05:57:02.078246 #3737750] INFO -- : [588/885] 3779109=test_emitter I, [2024-05-03T05:57:02.085909 #3737750] INFO -- : [589/885] 3779109=test_gem_silent_ui I, [2024-05-03T05:57:02.122705 #3737750] INFO -- : [590/885] 3779109=test_kdf I, [2024-05-03T05:57:02.136792 #3737750] INFO -- : [591/885] 3779105=test_gem_doctor I, [2024-05-03T05:57:02.160143 #3737750] INFO -- : [592/885] 3779108=test_kernel I, [2024-05-03T05:57:02.172706 #3737750] INFO -- : [593/885] 3779123=dispatcher_test I, [2024-05-03T05:57:02.177424 #3737750] INFO -- : [594/885] 3779110=test_eval_history I, [2024-05-03T05:57:02.189044 #3737750] INFO -- : [595/885] 3779110=test_key_name_check I, [2024-05-03T05:57:02.195661 #3737750] INFO -- : [596/885] 3779109=test_defined I, [2024-05-03T05:57:02.198944 #3737750] INFO -- : [597/885] 3779105=test_backtrace I, [2024-05-03T05:57:02.204651 #3737750] INFO -- : [598/885] 3779123=test_io_buffer I, [2024-05-03T05:57:02.218125 #3737750] INFO -- : [599/885] 3779117=test_rdoc_i18n_text I, [2024-05-03T05:57:02.218192 #3737750] INFO -- : [600/885] 3779110=test_windows_1251 I, [2024-05-03T05:57:02.218208 #3737750] INFO -- : [601/885] 3779105=test_time I, [2024-05-03T05:57:02.222829 #3737750] INFO -- : [602/885] 3779110=test_rdoc_rdoc I, [2024-05-03T05:57:02.244894 #3737750] INFO -- : [603/885] 3779107=test_gem_uninstaller I, [2024-05-03T05:57:02.265002 #3737750] INFO -- : [604/885] 3779123=test_buffering I, [2024-05-03T05:57:02.268899 #3737750] INFO -- : [605/885] 3779109=test_svcb_https I, [2024-05-03T05:57:02.275379 #3737750] INFO -- : [606/885] 3779123=test_gb18030 I, [2024-05-03T05:57:02.279987 #3737750] INFO -- : [607/885] 3779123=test_null I, [2024-05-03T05:57:02.283891 #3737750] INFO -- : [608/885] 3779109=test_win32ole_type I, [2024-05-03T05:57:02.285064 #3737750] INFO -- : [609/885] 3779109=test_mul I, [2024-05-03T05:57:02.285325 #3737750] INFO -- : [610/885] 3779123=test_rdoc_markup_to_rdoc I, [2024-05-03T05:57:02.290615 #3737750] INFO -- : [611/885] 3779109=test_rdoc_rd_inline_parser I, [2024-05-03T05:57:02.305873 #3737750] INFO -- : [612/885] 3779109=test_default_gems I, [2024-05-03T05:57:02.311881 #3737750] INFO -- : [613/885] 3779123=test_rdoc_markup_attributes I, [2024-05-03T05:57:02.314263 #3737750] INFO -- : [614/885] 3779123=test_date_parse I, [2024-05-03T05:57:02.330010 #3737750] INFO -- : [615/885] 3779110=test_pipe I, [2024-05-03T05:57:02.345462 #3737750] INFO -- : [616/885] 3779105=test_trick I, [2024-05-03T05:57:02.388356 #3737750] INFO -- : [617/885] 3779117=test_thread I, [2024-05-03T05:57:02.388663 #3737750] INFO -- : [618/885] 3779117=test_pkey_ec I, [2024-05-03T05:57:02.397412 #3737750] INFO -- : [619/885] 3779109=test_pattern_matching I, [2024-05-03T05:57:02.430985 #3737750] INFO -- : [620/885] 3779109=test_rdoc_stats I, [2024-05-03T05:57:02.442445 #3737750] INFO -- : [621/885] 3779123=test_string I, [2024-05-03T05:57:02.461014 #3737750] INFO -- : [622/885] 3779109=test_rdoc_store I, [2024-05-03T05:57:02.472101 #3737750] INFO -- : [623/885] 3779123=test_depth_first I, [2024-05-03T05:57:02.472355 #3737750] INFO -- : [624/885] 3779110=test_gem_request_set_lockfile_parser I, [2024-05-03T05:57:02.476614 #3737750] INFO -- : [625/885] 3779123=test_raise I, [2024-05-03T05:57:02.479196 #3737750] INFO -- : [626/885] 3779117=test_x509attr I, [2024-05-03T05:57:02.486346 #3737750] INFO -- : [627/885] 3779123=test_custom_command I, [2024-05-03T05:57:02.508039 #3737750] INFO -- : [628/885] 3779115=json_addition_test I, [2024-05-03T05:57:02.508618 #3737750] INFO -- : [629/885] 3779117=test_rdoc_parser I, [2024-05-03T05:57:02.531111 #3737750] INFO -- : [630/885] 3779115=test_qsort I, [2024-05-03T05:57:02.533795 #3737750] INFO -- : [631/885] 3779115=test_gem_dependency_resolution_error I, [2024-05-03T05:57:02.541811 #3737750] INFO -- : [632/885] 3779115=test_zlib I, [2024-05-03T05:57:02.570605 #3737750] INFO -- : [633/885] 3779122=test_cgi_tag_helper I, [2024-05-03T05:57:02.577567 #3737750] INFO -- : [634/885] 3779110=test_egrep_cpp I, [2024-05-03T05:57:02.587278 #3737750] INFO -- : [635/885] 3779117=test_ole_methods I, [2024-05-03T05:57:02.587366 #3737750] INFO -- : [636/885] 3779117=test_erb_m17n I, [2024-05-03T05:57:02.594854 #3737750] INFO -- : [637/885] 3779122=test_optimization I, [2024-05-03T05:57:02.602330 #3737750] INFO -- : [638/885] 3779117=test_date_conv I, [2024-05-03T05:57:02.612221 #3737750] INFO -- : [639/885] 3779117=test_proc I, [2024-05-03T05:57:02.620644 #3737750] INFO -- : [640/885] 3779123=test_string I, [2024-05-03T05:57:02.724002 #3737750] INFO -- : [641/885] 3779108=test_gc_compact I, [2024-05-03T05:57:02.730805 #3737750] INFO -- : [642/885] 3779110=test_gem_resolver_index_set I, [2024-05-03T05:57:02.758221 #3737750] INFO -- : [643/885] 3779110=test_gem_package_old I, [2024-05-03T05:57:02.804183 #3737750] INFO -- : [644/885] 3779110=test_gem_validator I, [2024-05-03T05:57:02.819230 #3737750] INFO -- : [645/885] 3779110=test_folderitem2_invokeverb I, [2024-05-03T05:57:02.825074 #3737750] INFO -- : [646/885] 3779110=test_rdoc_markup_parser I, [2024-05-03T05:57:02.873176 #3737750] INFO -- : [647/885] 3779110=test_require_path_check I, [2024-05-03T05:57:03.007180 #3737750] INFO -- : [648/885] 3779110=test_fnmatch I, [2024-05-03T05:57:03.051742 #3737750] INFO -- : [649/885] 3779110=test_files_test_2 I, [2024-05-03T05:57:03.121560 #3737750] INFO -- : [650/885] 3779109=test_fstring I, [2024-05-03T05:57:03.249505 #3737750] INFO -- : [651/885] 3779109=test_array I, [2024-05-03T05:57:03.251821 #3737750] INFO -- : [652/885] 3779107=test_optparse I, [2024-05-03T05:57:03.252348 #3737750] INFO -- : [653/885] 3779107=test_rat I, [2024-05-03T05:57:03.255992 #3737750] INFO -- : [654/885] 3779109=test_webauthn_poller I, [2024-05-03T05:57:03.263692 #3737750] INFO -- : [655/885] 3779107=test_rdoc_markup_raw I, [2024-05-03T05:57:03.275694 #3737750] INFO -- : [656/885] 3779107=test_rdoc_markup_to_html_crossref I, [2024-05-03T05:57:03.440018 #3737750] INFO -- : [657/885] 3779109=test_typeddata I, [2024-05-03T05:57:03.462589 #3737750] INFO -- : [658/885] 3779117=encoding_test I, [2024-05-03T05:57:03.534833 #3737750] INFO -- : [659/885] 3779117=test_gem_resolver_best_set I, [2024-05-03T05:57:03.599068 #3737750] INFO -- : [660/885] 3779111=test_stringscanner I, [2024-05-03T05:57:03.624564 #3737750] INFO -- : [661/885] 3779117=test_files_sample I, [2024-05-03T05:57:03.651398 #3737750] INFO -- : [662/885] 3779111=parser_test I, [2024-05-03T05:57:03.671800 #3737750] INFO -- : [663/885] 3779107=test_convertible I, [2024-05-03T05:57:03.713917 #3737750] INFO -- : [664/885] 3779109=test_rdoc_alias I, [2024-05-03T05:57:03.714746 #3737750] INFO -- : [665/885] 3779109=test_yield I, [2024-05-03T05:57:03.732082 #3737750] INFO -- : [666/885] 3779117=test_io_buffer I, [2024-05-03T05:57:03.752434 #3737750] INFO -- : [667/885] 3779111=test_backtrace I, [2024-05-03T05:57:03.872324 #3737750] INFO -- : [668/885] 3779117=test_pack I, [2024-05-03T05:57:03.876035 #3737750] INFO -- : [669/885] 3779117=ruby_parser_test I, [2024-05-03T05:57:03.877584 #3737750] INFO -- : [670/885] 3779117=test_gem_resolver_conflict I, [2024-05-03T05:57:03.896124 #3737750] INFO -- : [671/885] 3779117=test_rdoc_task I, [2024-05-03T05:57:03.899647 #3737750] INFO -- : [672/885] 3779117=test_rdoc_markup_indented_paragraph I, [2024-05-03T05:57:03.903761 #3737750] INFO -- : [673/885] 3779117=locals_test I, [2024-05-03T05:57:04.323064 #3737750] INFO -- : [674/885] 3779117=test_rdoc_require I, [2024-05-03T05:57:04.346208 #3737750] INFO -- : [675/885] 3779117=test_gem_commands_install_command I, [2024-05-03T05:57:04.348819 #3737750] INFO -- : [676/885] 3779106=test_clone I, [2024-05-03T05:57:04.551005 #3737750] INFO -- : [677/885] 3779106=test_readpartial I, [2024-05-03T05:57:04.961514 #3737750] INFO -- : [678/885] 3779106=test_yaml_tree I, [2024-05-03T05:57:04.976837 #3737750] INFO -- : [679/885] 3779106=test_libs I, [2024-05-03T05:57:04.985681 #3737750] INFO -- : [680/885] 3779106=test_gc I, [2024-05-03T05:57:04.985890 #3737750] INFO -- : [681/885] 3779106=test_gem_commands_fetch_command I, [2024-05-03T05:57:05.162952 #3737750] INFO -- : [682/885] 3779106=test_math I, [2024-05-03T05:57:05.169365 #3737750] INFO -- : [683/885] 3779111=test_sleep I, [2024-05-03T05:57:05.178974 #3737750] INFO -- : [684/885] 3779106=test_config I, [2024-05-03T05:57:05.234245 #3737750] INFO -- : [685/885] 3779106=test_autoload I, [2024-05-03T05:57:05.343934 #3737750] INFO -- : [686/885] 3779108=test_utf16 I, [2024-05-03T05:57:05.351667 #3737750] INFO -- : [687/885] 3779113=test_io I, [2024-05-03T05:57:05.359707 #3737750] INFO -- : [688/885] 3779108=test_unicode_escape I, [2024-05-03T05:57:05.393856 #3737750] INFO -- : [689/885] 3779105=test_case I, [2024-05-03T05:57:05.427429 #3737750] INFO -- : [690/885] 3779108=test_sizeof I, [2024-05-03T05:57:05.467099 #3737750] INFO -- : [691/885] 3779105=test_face I, [2024-05-03T05:57:05.494468 #3737750] INFO -- : [692/885] 3779105=test_rendering I, [2024-05-03T05:57:05.502340 #3737750] INFO -- : [693/885] 3779105=test_system I, [2024-05-03T05:57:05.780826 #3737750] INFO -- : [694/885] 3779116=test_pkcs12 I, [2024-05-03T05:57:05.907532 #3737750] INFO -- : [695/885] 3779115=test_bigzero I, [2024-05-03T05:57:05.926252 #3737750] INFO -- : [696/885] 3779115=test_pkey_dh I, [2024-05-03T05:57:06.036600 #3737750] INFO -- : [697/885] 3779115=test_gem_package_tar_header I, [2024-05-03T05:57:06.100887 #3737750] INFO -- : [698/885] 3779115=test_iseq_load I, [2024-05-03T05:57:06.104268 #3737750] INFO -- : [699/885] 3779117=test_gem_util I, [2024-05-03T05:57:06.212897 #3737750] INFO -- : [700/885] 3779116=test_gem_config_file I, [2024-05-03T05:57:06.247712 #3737750] INFO -- : [701/885] 3779117=test_ripper I, [2024-05-03T05:57:06.330162 #3737750] INFO -- : [702/885] 3779110=test_protocol I, [2024-05-03T05:57:06.387694 #3737750] INFO -- : [703/885] 3779116=test_getopts I, [2024-05-03T05:57:06.391973 #3737750] INFO -- : [704/885] 3779116=test_gem_resolver_activation_request I, [2024-05-03T05:57:06.404437 #3737750] INFO -- : [705/885] 3779116=test_yjit_exit_locations I, [2024-05-03T05:57:06.412493 #3737750] INFO -- : [706/885] 3779116=test_etc I, [2024-05-03T05:57:06.480964 #3737750] INFO -- : [707/885] 3779109=test_rdoc_rubygems_hook I, [2024-05-03T05:57:06.499278 #3737750] INFO -- : [708/885] 3779116=test_method I, [2024-05-03T05:57:06.528322 #3737750] INFO -- : [709/885] 3779109=test_gem_commands_query_command I, [2024-05-03T05:57:06.572872 #3737750] INFO -- : [710/885] 3779105=test_gem_impossible_dependencies_error I, [2024-05-03T05:57:06.588251 #3737750] INFO -- : [711/885] 3779105=test_array_create I, [2024-05-03T05:57:06.590134 #3737750] INFO -- : [712/885] 3779105=test_pack I, [2024-05-03T05:57:06.637637 #3737750] INFO -- : [713/885] 3779110=test_pattern_key_name_check I, [2024-05-03T05:57:06.642268 #3737750] INFO -- : [714/885] 3779110=test_to_ruby I, [2024-05-03T05:57:06.654154 #3737750] INFO -- : [715/885] 3779110=test_ftp I, [2024-05-03T05:57:06.661454 #3737750] INFO -- : [716/885] 3779117=test_rdoc_context_section I, [2024-05-03T05:57:06.662197 #3737750] INFO -- : [717/885] 3779110=test_euc_kr I, [2024-05-03T05:57:06.689324 #3737750] INFO -- : [718/885] 3779110=test_console_attr I, [2024-05-03T05:57:06.694196 #3737750] INFO -- : [719/885] 3779110=test_summary I, [2024-05-03T05:57:06.710470 #3737750] INFO -- : [720/885] 3779117=test_type_completor I, [2024-05-03T05:57:06.710979 #3737750] INFO -- : [721/885] 3779117=test_gem_commands_exec_command I, [2024-05-03T05:57:06.832306 #3737750] INFO -- : [722/885] 3779110=test_io_wait I, [2024-05-03T05:57:06.841413 #3737750] INFO -- : [723/885] 3779105=warnings_test I, [2024-05-03T05:57:06.934467 #3737750] INFO -- : [724/885] 3779105=test_kwargs I, [2024-05-03T05:57:06.936353 #3737750] INFO -- : [725/885] 3779105=test_ellipsize I, [2024-05-03T05:57:06.938769 #3737750] INFO -- : [726/885] 3779115=test_date_attr I, [2024-05-03T05:57:06.945425 #3737750] INFO -- : [727/885] 3779105=test_io I, [2024-05-03T05:57:06.947823 #3737750] INFO -- : [728/885] 3779115=test_win32ole_type_event I, [2024-05-03T05:57:06.953430 #3737750] INFO -- : [729/885] 3779115=test_emoji I, [2024-05-03T05:57:06.993277 #3737750] INFO -- : [730/885] 3779115=test_sorted_set I, [2024-05-03T05:57:07.118264 #3737750] INFO -- : [731/885] 3779109=test_ubf_async_safe I, [2024-05-03T05:57:07.130920 #3737750] INFO -- : [732/885] 3779109=test_hash I, [2024-05-03T05:57:07.144749 #3737750] INFO -- : [733/885] 3779105=test_gem_unsatisfiable_dependency_error I, [2024-05-03T05:57:07.164007 #3737750] INFO -- : [734/885] 3779110=test_win32ole_record I, [2024-05-03T05:57:07.165897 #3737750] INFO -- : [735/885] 3779105=test_cp949 I, [2024-05-03T05:57:07.166866 #3737750] INFO -- : [736/885] 3779110=test_gem_source_specific_file I, [2024-05-03T05:57:07.174807 #3737750] INFO -- : [737/885] 3779105=test_foreach I, [2024-05-03T05:57:07.182539 #3737750] INFO -- : [738/885] 3779105=test_condition I, [2024-05-03T05:57:07.188087 #3737750] INFO -- : [739/885] 3779105=test_gem_commands_uninstall_command I, [2024-05-03T05:57:07.232871 #3737750] INFO -- : [740/885] 3779115=test_hash I, [2024-05-03T05:57:07.235303 #3737750] INFO -- : [741/885] 3779111=test_tree_builder I, [2024-05-03T05:57:07.243837 #3737750] INFO -- : [742/885] 3779111=test_gem_resolver_dependency_request I, [2024-05-03T05:57:07.249176 #3737750] INFO -- : [743/885] 3779115=test_external_new I, [2024-05-03T05:57:07.253555 #3737750] INFO -- : [744/885] 3779110=test_postponed_job I, [2024-05-03T05:57:07.255911 #3737750] INFO -- : [745/885] 3779115=test_alias_and_anchor I, [2024-05-03T05:57:07.260958 #3737750] INFO -- : [746/885] 3779115=test_raise_exception I, [2024-05-03T05:57:07.271727 #3737750] INFO -- : [747/885] 3779111=test_gem_request_set_lockfile I, [2024-05-03T05:57:07.548296 #3737750] INFO -- : [748/885] 3779119=test_win32ole_typelib I, [2024-05-03T05:57:07.551297 #3737750] INFO -- : [749/885] 3779119=test_protect I, [2024-05-03T05:57:07.554896 #3737750] INFO -- : [750/885] 3779119=test_workspace I, [2024-05-03T05:57:07.718146 #3737750] INFO -- : [751/885] 3779111=test_weakmap I, [2024-05-03T05:57:07.735701 #3737750] INFO -- : [752/885] 3779110=test_yjit I, [2024-05-03T05:57:07.737816 #3737750] INFO -- : [753/885] 3779110=test_ws I, [2024-05-03T05:57:07.758159 #3737750] INFO -- : [754/885] 3779110=test_m17n I, [2024-05-03T05:57:07.758358 #3737750] INFO -- : [755/885] 3779119=test_gem_commands_environment_command I, [2024-05-03T05:57:07.769460 #3737750] INFO -- : [756/885] 3779117=test_argf I, [2024-05-03T05:57:07.771239 #3737750] INFO -- : [757/885] 3779124=test_ns_spki I, [2024-05-03T05:57:07.813051 #3737750] INFO -- : [758/885] 3779119=test_framework I, [2024-05-03T05:57:07.820102 #3737750] INFO -- : [759/885] 3779110=test_kill_ring I, [2024-05-03T05:57:07.825334 #3737750] INFO -- : [760/885] 3779124=test_line_editor I, [2024-05-03T05:57:07.833646 #3737750] INFO -- : [761/885] 3779119=ripper_test I, [2024-05-03T05:57:07.837563 #3737750] INFO -- : [762/885] 3779110=test_objspace I, [2024-05-03T05:57:07.886467 #3737750] INFO -- : [763/885] 3779124=test_undef I, [2024-05-03T05:57:07.894044 #3737750] INFO -- : [764/885] 3779124=test_gem_security_trust_dir I, [2024-05-03T05:57:07.945289 #3737750] INFO -- : [765/885] 3779124=test_string_memory I, [2024-05-03T05:57:07.956177 #3737750] INFO -- : [766/885] 3779105=test_sprintf I, [2024-05-03T05:57:08.050681 #3737750] INFO -- : [767/885] 3779124=test_gem_requirement I, [2024-05-03T05:57:08.052953 #3737750] INFO -- : [768/885] 3779115=comments_test I, [2024-05-03T05:57:08.059320 #3737750] INFO -- : [769/885] 3779115=test_show_source I, [2024-05-03T05:57:08.132406 #3737750] INFO -- : [770/885] 3779115=test_set I, [2024-05-03T05:57:08.140062 #3737750] INFO -- : [771/885] 3779115=test_gem_commands_stale_command I, [2024-05-03T05:57:08.153500 #3737750] INFO -- : [772/885] 3779115=test_c_struct_entry I, [2024-05-03T05:57:08.199086 #3737750] INFO -- : [773/885] 3779105=test_lock_native_thread I, [2024-05-03T05:57:08.215180 #3737750] INFO -- : [774/885] 3779124=test_remote_fetch_error I, [2024-05-03T05:57:08.234990 #3737750] INFO -- : [775/885] 3779124=test_have_library I, [2024-05-03T05:57:08.446966 #3737750] INFO -- : [776/885] 3779119=test_path_to_class I, [2024-05-03T05:57:08.465845 #3737750] INFO -- : [777/885] 3779119=test_gem_dependency I, [2024-05-03T05:57:08.532280 #3737750] INFO -- : [778/885] 3779105=test_gem_resolver_specification I, [2024-05-03T05:57:08.555680 #3737750] INFO -- : [779/885] 3779105=test_rdoc_markup_verbatim I, [2024-05-03T05:57:08.564413 #3737750] INFO -- : [780/885] 3779105=test_inlinecache I, [2024-05-03T05:57:08.601273 #3737750] INFO -- : [781/885] 3779119=test_complex I, [2024-05-03T05:57:08.615073 #3737750] INFO -- : [782/885] 3779115=test_gem_commands_search_command I, [2024-05-03T05:57:08.625872 #3737750] INFO -- : [783/885] 3779115=test_frozen_error I, [2024-05-03T05:57:08.630370 #3737750] INFO -- : [784/885] 3779115=test_method_cache I, [2024-05-03T05:57:08.633027 #3737750] INFO -- : [785/885] 3779105=test_gem_stub_specification I, [2024-05-03T05:57:08.640259 #3737750] INFO -- : [786/885] 3779115=test_gem_ext_ext_conf_builder I, [2024-05-03T05:57:08.731444 #3737750] INFO -- : [787/885] 3779108=test_gem_resolver_installed_specification I, [2024-05-03T05:57:08.752895 #3737750] INFO -- : [788/885] 3779119=test_scanner_events I, [2024-05-03T05:57:08.753407 #3737750] INFO -- : [789/885] 3779108=test_gem_remote_fetcher I, [2024-05-03T05:57:08.773143 #3737750] INFO -- : [790/885] 3779107=test_parse I, [2024-05-03T05:57:08.776896 #3737750] INFO -- : [791/885] 3779119=test_mdns I, [2024-05-03T05:57:08.828413 #3737750] INFO -- : [792/885] 3779119=test_too_many_dummy_encodings I, [2024-05-03T05:57:08.863670 #3737750] INFO -- : [793/885] 3779119=test_rdoc_include I, [2024-05-03T05:57:08.882214 #3737750] INFO -- : [794/885] 3779105=test_reqarg I, [2024-05-03T05:57:08.917636 #3737750] INFO -- : [795/885] 3779119=test_gem_commands_list_command I, [2024-05-03T05:57:08.933465 #3737750] INFO -- : [796/885] 3779119=test_stack I, [2024-05-03T05:57:09.429240 #3737750] INFO -- : [797/885] 3779105=test_ldap I, [2024-05-03T05:57:09.434143 #3737750] INFO -- : [798/885] 3779107=test_resource I, [2024-05-03T05:57:09.458304 #3737750] INFO -- : [799/885] 3779107=test_gem_commands_signin_command I, [2024-05-03T05:57:09.458983 #3737750] INFO -- : [800/885] 3779105=test_emitter I, [2024-05-03T05:57:09.476519 #3737750] INFO -- : [801/885] 3779105=test_string_processing I, [2024-05-03T05:57:09.478141 #3737750] INFO -- : [802/885] 3779105=test_fileutils I, [2024-05-03T05:57:09.533086 #3737750] INFO -- : [803/885] 3779124=test_cesu8 I, [2024-05-03T05:57:09.540159 #3737750] INFO -- : [804/885] 3779124=test_econv I, [2024-05-03T05:57:09.574793 #3737750] INFO -- : [805/885] 3779107=test_rdoc_options I, [2024-05-03T05:57:09.605551 #3737750] INFO -- : [806/885] 3779122=test_gem_version I, [2024-05-03T05:57:09.748539 #3737750] INFO -- : [807/885] 3779122=parse_comments_test I, [2024-05-03T05:57:09.822157 #3737750] INFO -- : [808/885] 3779122=test_noarg I, [2024-05-03T05:57:09.857412 #3737750] INFO -- : [809/885] 3779119=test_tempfile I, [2024-05-03T05:57:09.876083 #3737750] INFO -- : [810/885] 3779116=test_queue I, [2024-05-03T05:57:09.886159 #3737750] INFO -- : [811/885] 3779116=test_function I, [2024-05-03T05:57:09.906249 #3737750] INFO -- : [812/885] 3779107=test_gem_resolver_index_specification I, [2024-05-03T05:57:09.922632 #3737750] INFO -- : [813/885] 3779120=test_internal_ivar I, [2024-05-03T05:57:09.928111 #3737750] INFO -- : [814/885] 3779120=test_prettyprint I, [2024-05-03T05:57:09.951181 #3737750] INFO -- : [815/885] 3779115=test_tracepoint I, [2024-05-03T05:57:09.961428 #3737750] INFO -- : [816/885] 3779107=test_gem_commands_help_command I, [2024-05-03T05:57:09.964929 #3737750] INFO -- : [817/885] 3779120=test_rdoc_markup I, [2024-05-03T05:57:09.971324 #3737750] INFO -- : [818/885] 3779120=test_duplicate I, [2024-05-03T05:57:09.976573 #3737750] INFO -- : [819/885] 3779120=test_basicsocket I, [2024-05-03T05:57:09.987994 #3737750] INFO -- : [820/885] 3779120=test_utf32 I, [2024-05-03T05:57:10.009670 #3737750] INFO -- : [821/885] 3779105=test_gem_installer I, [2024-05-03T05:57:10.015723 #3737750] INFO -- : [822/885] 3779120=test_yamlstore I, [2024-05-03T05:57:10.028925 #3737750] INFO -- : [823/885] 3779120=test_date_strftime I, [2024-05-03T05:57:10.053961 #3737750] INFO -- : [824/885] 3779107=test_rdoc_parser_rd I, [2024-05-03T05:57:10.061449 #3737750] INFO -- : [825/885] 3779122=test_irb I, [2024-05-03T05:57:10.091131 #3737750] INFO -- : [826/885] 3779107=test_asn1 I, [2024-05-03T05:57:10.116493 #3737750] INFO -- : [827/885] 3779116=test_random I, [2024-05-03T05:57:10.116777 #3737750] INFO -- : [828/885] 3779116=test_load I, [2024-05-03T05:57:10.119079 #3737750] INFO -- : [829/885] 3779107=json_string_matching_test I, [2024-05-03T05:57:10.129478 #3737750] INFO -- : [830/885] 3779107=test_const I, [2024-05-03T05:57:10.134209 #3737750] INFO -- : [831/885] 3779116=test_class I, [2024-05-03T05:57:10.136315 #3737750] INFO -- : [832/885] 3779107=test_rdoc_normal_class I, [2024-05-03T05:57:10.148091 #3737750] INFO -- : [833/885] 3779119=test_file I, [2024-05-03T05:57:10.166463 #3737750] INFO -- : [834/885] 3779119=test_modify_expand I, [2024-05-03T05:57:10.187248 #3737750] INFO -- : [835/885] 3779119=test_rdoc_any_method I, [2024-05-03T05:57:10.228647 #3737750] INFO -- : [836/885] 3779107=test_gem_available_set I, [2024-05-03T05:57:10.247243 #3737750] INFO -- : [837/885] 3779115=test_rdoc_markdown I, [2024-05-03T05:57:10.315218 #3737750] INFO -- : [838/885] 3779107=test_pathname I, [2024-05-03T05:57:10.507992 #3737750] INFO -- : [839/885] 3779122=test_complexrational I, [2024-05-03T05:57:10.517812 #3737750] INFO -- : [840/885] 3779122=test_init I, [2024-05-03T05:57:10.558391 #3737750] INFO -- : [841/885] 3779107=test_gem_package_tar_reader I, [2024-05-03T05:57:10.559268 #3737750] INFO -- : [842/885] 3779115=regexp_test I, [2024-05-03T05:57:10.583495 #3737750] INFO -- : [843/885] 3779115=test_rdoc_encoding I, [2024-05-03T05:57:10.603826 #3737750] INFO -- : [844/885] 3779107=test_coverage I, [2024-05-03T05:57:10.623624 #3737750] INFO -- : [845/885] 3779124=test_recorder I, [2024-05-03T05:57:10.625714 #3737750] INFO -- : [846/885] 3779115=test_gem_commands_owner_command I, [2024-05-03T05:57:10.629817 #3737750] INFO -- : [847/885] 3779124=test_gem_source_vendor I, [2024-05-03T05:57:10.640541 #3737750] INFO -- : [848/885] 3779124=test_bash_completion I, [2024-05-03T05:57:10.649400 #3737750] INFO -- : [849/885] 3779124=test_formatter I, [2024-05-03T05:57:10.662224 #3737750] INFO -- : [850/885] 3779124=test_rdoc_constant I, [2024-05-03T05:57:10.675547 #3737750] INFO -- : [851/885] 3779120=test_deprecate I, [2024-05-03T05:57:10.690457 #3737750] INFO -- : [852/885] 3779119=test_require I, [2024-05-03T05:57:10.728566 #3737750] INFO -- : [853/885] 3779120=test_cgi_util I, [2024-05-03T05:57:10.775746 #3737750] INFO -- : [854/885] 3779124=test_gem_commands_contents_command I, [2024-05-03T05:57:10.891362 #3737750] INFO -- : [855/885] 3779124=test_gem_ext_cmake_builder I, [2024-05-03T05:57:10.916951 #3737750] INFO -- : [856/885] 3779124=test_digest I, [2024-05-03T05:57:10.928445 #3737750] INFO -- : [857/885] 3779122=test_marshalable I, [2024-05-03T05:57:10.934297 #3737750] INFO -- : [858/885] 3779122=test_find I, [2024-05-03T05:57:10.955945 #3737750] INFO -- : [859/885] 3779122=test_ractor I, [2024-05-03T05:57:10.957695 #3737750] INFO -- : [860/885] 3779120=test_wss I, [2024-05-03T05:57:10.974315 #3737750] INFO -- : [861/885] 3779120=test_fiddle I, [2024-05-03T05:57:11.098587 #3737750] INFO -- : [862/885] 3779120=test_rdoc_parser_c I, [2024-05-03T05:57:11.122394 #3737750] INFO -- : [863/885] 3779122=test_comparable I, [2024-05-03T05:57:11.127654 #3737750] INFO -- : [864/885] 3779122=json_fixtures_test I, [2024-05-03T05:57:11.141145 #3737750] INFO -- : [865/885] 3779122=test_shapes I, [2024-05-03T05:57:11.146044 #3737750] INFO -- : [866/885] 3779122=test_io_timeout I, [2024-05-03T05:57:11.151086 #3737750] INFO -- : [867/885] 3779122=test_profile_frames I, [2024-05-03T05:57:11.253236 #3737750] INFO -- : [868/885] 3779115=test_cstr I, [2024-05-03T05:57:11.327331 #3737750] INFO -- : [869/885] 3779122=test_pstore I, [2024-05-03T05:57:11.381587 #3737750] INFO -- : [870/885] 3779122=test_enc_str_buf_cat I, [2024-05-03T05:57:11.390575 #3737750] INFO -- : [871/885] 3779122=test_class2name I, [2024-05-03T05:57:11.395801 #3737750] INFO -- : [872/885] 3779122=test_gbk I, [2024-05-03T05:57:11.401493 #3737750] INFO -- : [873/885] 3779122=test_handle I, [2024-05-03T05:57:11.432701 #3737750] INFO -- : [874/885] 3779108=test_wait I, [2024-05-03T05:57:11.489522 #3737750] INFO -- : [875/885] 3779118=test_forwardable I, [2024-05-03T05:57:11.493587 #3737750] INFO -- : [876/885] 3779108=test_yaml I, [2024-05-03T05:57:11.509672 #3737750] INFO -- : [877/885] 3779118=test_big2str I, [2024-05-03T05:57:11.515377 #3737750] INFO -- : [878/885] 3779107=test_gem_commands_sources_command I, [2024-05-03T05:57:11.515852 #3737750] INFO -- : [879/885] 3779118=test_ansi_without_terminfo I, [2024-05-03T05:57:11.521307 #3737750] INFO -- : [880/885] 3779120=test_euc_tw I, [2024-05-03T05:57:11.523856 #3737750] INFO -- : [881/885] 3779118=test_ractor I, [2024-05-03T05:57:11.527178 #3737750] INFO -- : [882/885] 3779120=test_bmethod I, [2024-05-03T05:57:11.535067 #3737750] INFO -- : [883/885] 3779120=test_rdoc_markup_formatter I, [2024-05-03T05:57:11.542395 #3737750] INFO -- : [884/885] 3779118=test_thread_queue I, [2024-05-03T05:57:11.549033 #3737750] INFO -- : [885/885] 3779120=test_nowrite I, [2024-05-03T05:57:24.184341 #3737750] INFO -- : Finished tests in 34.790351s, 758.0263 tests/s, 268732.7284 assertions/s. E, [2024-05-03T05:57:24.184525 #3737750] ERROR -- : Children under /tmp/rubytest.hfe91m: E, [2024-05-03T05:57:24.184568 #3737750] ERROR -- : * drwx------ 4 80 2024-05-03 05:56:50 +0000 gem_rebuild20240503-3779120-7a8lbm/ E, [2024-05-03T05:57:24.184589 #3737750] ERROR -- : * drwxrwxr-x 2 60 2024-05-03 05:56:50 +0000 new/ E, [2024-05-03T05:57:24.184605 #3737750] ERROR -- : * -rw-rw-r-- 1 4096 2024-05-03 05:56:50 +0000 rebuild_test_gem-1.0.0.gem E, [2024-05-03T05:57:24.184621 #3737750] ERROR -- : * drwxrwxr-x 2 60 2024-05-03 05:56:50 +0000 old/ E, [2024-05-03T05:57:24.184635 #3737750] ERROR -- : * -rw-rw-r-- 1 4096 2024-05-03 05:56:50 +0000 rebuild_test_gem-1.0.0.gem I, [2024-05-03T05:57:24.185676 #3737750] INFO -- : 26372 tests, 9349306 assertions, 0 failures, 0 errors, 302 skips I, [2024-05-03T05:57:24.185717 #3737750] INFO -- : I, [2024-05-03T05:57:24.185724 #3737750] INFO -- : ruby -v: ruby 3.4.0dev (2024-05-03T05:47:18Z master 9f8e87c44b) [x86_64-linux] I, [2024-05-03T05:57:24.187751 #3737750] INFO -- : $$$[end] "make yes-test-all TESTOPTS='--stderr-on-failure' TESTS='-j20'" exit with 0. I, [2024-05-03T05:57:24.187899 #3737750] INFO -- : $$$[beg] make yes-test-rubyspec MSPECOPT='--error-output stderr --debug -j' TESTS='-j20' I, [2024-05-03T05:57:24.274730 #3737750] INFO -- : BASERUBY = /usr/bin/ruby --disable=gems I, [2024-05-03T05:57:24.274764 #3737750] INFO -- : CC = gcc I, [2024-05-03T05:57:24.274770 #3737750] INFO -- : LD = ld I, [2024-05-03T05:57:24.274774 #3737750] INFO -- : LDSHARED = gcc -shared I, [2024-05-03T05:57:24.274778 #3737750] INFO -- : CFLAGS = -O3 -fno-fast-math -ggdb3 -Wall -Wextra -Wdeprecated-declarations -Wdiv-by-zero -Wduplicated-cond -Wimplicit-function-declaration -Wimplicit-int -Wpointer-arith -Wwrite-strings -Wold-style-definition -Wimplicit-fallthrough=0 -Wmissing-noreturn -Wno-cast-function-type -Wno-constant-logical-operand -Wno-long-long -Wno-missing-field-initializers -Wno-overlength-strings -Wno-packed-bitfield-compat -Wno-parentheses-equality -Wno-self-assign -Wno-tautological-compare -Wno-unused-parameter -Wno-unused-value -Wsuggest-attribute=format -Wsuggest-attribute=noreturn -Wunused-variable -Wmisleading-indentation -Wundef -fPIC I, [2024-05-03T05:57:24.274783 #3737750] INFO -- : XCFLAGS = -U_FORTIFY_SOURCE -D_FORTIFY_SOURCE=2 -fstack-protector-strong -fno-strict-overflow -fvisibility=hidden -fexcess-precision=standard -DRUBY_EXPORT -I. -I.ext/include/x86_64-linux -I/tmp/ruby/src/trunk/include -I/tmp/ruby/src/trunk -I/tmp/ruby/src/trunk/prism -I/tmp/ruby/src/trunk/enc/unicode/15.0.0 I, [2024-05-03T05:57:24.274794 #3737750] INFO -- : CPPFLAGS = I, [2024-05-03T05:57:24.274798 #3737750] INFO -- : DLDFLAGS = -Wl,--compress-debug-sections=zlib -Wl,-soname,libruby.so.3.4 -fstack-protector-strong I, [2024-05-03T05:57:24.274802 #3737750] INFO -- : SOLIBS = -lz -lrt -lrt -lgmp -ldl -lcrypt -lm -lpthread I, [2024-05-03T05:57:24.274806 #3737750] INFO -- : LANG = en_US.UTF-8 I, [2024-05-03T05:57:24.274809 #3737750] INFO -- : LC_ALL = I, [2024-05-03T05:57:24.274812 #3737750] INFO -- : LC_CTYPE = I, [2024-05-03T05:57:24.274816 #3737750] INFO -- : MFLAGS = I, [2024-05-03T05:57:24.274819 #3737750] INFO -- : RUSTC = no I, [2024-05-03T05:57:24.274823 #3737750] INFO -- : YJIT_RUSTC_ARGS = --crate-name=yjit --crate-type=staticlib --edition=2021 -g -C lto=thin -C opt-level=3 -C overflow-checks=on '--out-dir=/tmp/ruby/build/trunk/yjit/target/release/' /tmp/ruby/src/trunk/yjit/src/lib.rs I, [2024-05-03T05:57:24.275501 #3737750] INFO -- : gcc (Ubuntu 11.4.0-1ubuntu1~22.04) 11.4.0 I, [2024-05-03T05:57:24.275521 #3737750] INFO -- : Copyright (C) 2021 Free Software Foundation, Inc. I, [2024-05-03T05:57:24.275525 #3737750] INFO -- : This is free software; see the source for copying conditions. There is NO I, [2024-05-03T05:57:24.275529 #3737750] INFO -- : warranty; not even for MERCHANTABILITY or FITNESS FOR A PARTICULAR PURPOSE. I, [2024-05-03T05:57:24.275533 #3737750] INFO -- : I, [2024-05-03T05:57:24.277367 #3737750] INFO -- : generating enc.mk I, [2024-05-03T05:57:24.395976 #3737750] INFO -- : making enc I, [2024-05-03T05:57:24.413208 #3737750] INFO -- : make[1]: Entering directory '/tmp/ruby/build/trunk' I, [2024-05-03T05:57:24.413235 #3737750] INFO -- : make[1]: Nothing to be done for 'enc'. I, [2024-05-03T05:57:24.413241 #3737750] INFO -- : make[1]: Leaving directory '/tmp/ruby/build/trunk' I, [2024-05-03T05:57:24.413874 #3737750] INFO -- : making srcs under enc I, [2024-05-03T05:57:24.444154 #3737750] INFO -- : make[1]: Entering directory '/tmp/ruby/build/trunk' I, [2024-05-03T05:57:24.444177 #3737750] INFO -- : make[1]: Nothing to be done for 'srcs'. I, [2024-05-03T05:57:24.444182 #3737750] INFO -- : make[1]: Leaving directory '/tmp/ruby/build/trunk' I, [2024-05-03T05:57:24.445086 #3737750] INFO -- : generating transdb.h I, [2024-05-03T05:57:24.540241 #3737750] INFO -- : transdb.h unchanged I, [2024-05-03T05:57:24.541667 #3737750] INFO -- : making trans I, [2024-05-03T05:57:24.575797 #3737750] INFO -- : make[1]: Entering directory '/tmp/ruby/build/trunk' I, [2024-05-03T05:57:24.575820 #3737750] INFO -- : make[1]: Nothing to be done for 'trans'. I, [2024-05-03T05:57:24.575825 #3737750] INFO -- : make[1]: Leaving directory '/tmp/ruby/build/trunk' I, [2024-05-03T05:57:24.576408 #3737750] INFO -- : making encs I, [2024-05-03T05:57:24.613420 #3737750] INFO -- : make[1]: Entering directory '/tmp/ruby/build/trunk' I, [2024-05-03T05:57:24.613441 #3737750] INFO -- : make[1]: Nothing to be done for 'encs'. I, [2024-05-03T05:57:24.613447 #3737750] INFO -- : make[1]: Leaving directory '/tmp/ruby/build/trunk' I, [2024-05-03T05:57:24.615194 #3737750] INFO -- : generating makefiles ext/configure-ext.mk I, [2024-05-03T05:57:24.642914 #3737750] INFO -- : ext/configure-ext.mk updated I, [2024-05-03T05:57:24.645332 #3737750] INFO -- : make[1]: Entering directory '/tmp/ruby/build/trunk' I, [2024-05-03T05:57:26.008424 #3737750] INFO -- : make[1]: Leaving directory '/tmp/ruby/build/trunk' I, [2024-05-03T05:57:26.009234 #3737750] INFO -- : generating makefile exts.mk I, [2024-05-03T05:57:26.045973 #3737750] INFO -- : exts.mk unchanged I, [2024-05-03T05:57:26.050560 #3737750] INFO -- : make[1]: Entering directory '/tmp/ruby/build/trunk' I, [2024-05-03T05:57:26.261427 #3737750] INFO -- : make[2]: Entering directory '/tmp/ruby/build/trunk/ext/coverage' I, [2024-05-03T05:57:26.264263 #3737750] INFO -- : make[2]: Leaving directory '/tmp/ruby/build/trunk/ext/coverage' I, [2024-05-03T05:57:26.267936 #3737750] INFO -- : make[2]: Entering directory '/tmp/ruby/build/trunk/ext/date' I, [2024-05-03T05:57:26.271057 #3737750] INFO -- : make[2]: Leaving directory '/tmp/ruby/build/trunk/ext/date' I, [2024-05-03T05:57:26.273290 #3737750] INFO -- : make[2]: Entering directory '/tmp/ruby/build/trunk/ext/digest' I, [2024-05-03T05:57:26.278756 #3737750] INFO -- : make[2]: Leaving directory '/tmp/ruby/build/trunk/ext/digest' I, [2024-05-03T05:57:26.294329 #3737750] INFO -- : make[2]: Entering directory '/tmp/ruby/build/trunk/ext/digest/sha2' I, [2024-05-03T05:57:26.297129 #3737750] INFO -- : make[2]: Leaving directory '/tmp/ruby/build/trunk/ext/digest/sha2' I, [2024-05-03T05:57:26.309716 #3737750] INFO -- : make[2]: Entering directory '/tmp/ruby/build/trunk/ext/fiddle' I, [2024-05-03T05:57:26.316246 #3737750] INFO -- : make[2]: Leaving directory '/tmp/ruby/build/trunk/ext/fiddle' I, [2024-05-03T05:57:26.319183 #3737750] INFO -- : make[2]: Entering directory '/tmp/ruby/build/trunk/ext/io/console' I, [2024-05-03T05:57:26.321733 #3737750] INFO -- : make[2]: Leaving directory '/tmp/ruby/build/trunk/ext/io/console' I, [2024-05-03T05:57:26.329471 #3737750] INFO -- : make[2]: Entering directory '/tmp/ruby/build/trunk/ext/json' I, [2024-05-03T05:57:26.335676 #3737750] INFO -- : make[2]: Leaving directory '/tmp/ruby/build/trunk/ext/json' I, [2024-05-03T05:57:26.344919 #3737750] INFO -- : make[2]: Entering directory '/tmp/ruby/build/trunk/ext/monitor' I, [2024-05-03T05:57:26.347491 #3737750] INFO -- : make[2]: Leaving directory '/tmp/ruby/build/trunk/ext/monitor' I, [2024-05-03T05:57:26.351592 #3737750] INFO -- : make[2]: Entering directory '/tmp/ruby/build/trunk/ext/objspace' I, [2024-05-03T05:57:26.355313 #3737750] INFO -- : make[2]: Leaving directory '/tmp/ruby/build/trunk/ext/objspace' I, [2024-05-03T05:57:26.367475 #3737750] INFO -- : make[2]: Entering directory '/tmp/ruby/build/trunk/ext/openssl' I, [2024-05-03T05:57:26.380543 #3737750] INFO -- : make[2]: Leaving directory '/tmp/ruby/build/trunk/ext/openssl' I, [2024-05-03T05:57:26.383506 #3737750] INFO -- : make[2]: Entering directory '/tmp/ruby/build/trunk/ext/pathname' I, [2024-05-03T05:57:26.386001 #3737750] INFO -- : make[2]: Leaving directory '/tmp/ruby/build/trunk/ext/pathname' I, [2024-05-03T05:57:26.390212 #3737750] INFO -- : make[2]: Entering directory '/tmp/ruby/build/trunk/ext/psych' I, [2024-05-03T05:57:26.405070 #3737750] INFO -- : make[2]: Leaving directory '/tmp/ruby/build/trunk/ext/psych' I, [2024-05-03T05:57:26.408139 #3737750] INFO -- : make[2]: Entering directory '/tmp/ruby/build/trunk/ext/pty' I, [2024-05-03T05:57:26.410613 #3737750] INFO -- : make[2]: Leaving directory '/tmp/ruby/build/trunk/ext/pty' I, [2024-05-03T05:57:26.420006 #3737750] INFO -- : make[2]: Entering directory '/tmp/ruby/build/trunk/ext/ripper' I, [2024-05-03T05:57:26.424976 #3737750] INFO -- : make[2]: Leaving directory '/tmp/ruby/build/trunk/ext/ripper' I, [2024-05-03T05:57:26.426463 #3737750] INFO -- : make[2]: Entering directory '/tmp/ruby/build/trunk/ext/rubyvm' I, [2024-05-03T05:57:26.428404 #3737750] INFO -- : make[2]: Leaving directory '/tmp/ruby/build/trunk/ext/rubyvm' I, [2024-05-03T05:57:26.436228 #3737750] INFO -- : make[2]: Entering directory '/tmp/ruby/build/trunk/ext/socket' I, [2024-05-03T05:57:26.442581 #3737750] INFO -- : make[2]: Leaving directory '/tmp/ruby/build/trunk/ext/socket' I, [2024-05-03T05:57:26.453430 #3737750] INFO -- : make[2]: Entering directory '/tmp/ruby/build/trunk/.bundle/gems/bigdecimal-3.1.7/ext/bigdecimal' I, [2024-05-03T05:57:26.475952 #3737750] INFO -- : make[2]: Leaving directory '/tmp/ruby/build/trunk/.bundle/gems/bigdecimal-3.1.7/ext/bigdecimal' I, [2024-05-03T05:57:26.477995 #3737750] INFO -- : make[2]: Entering directory '/tmp/ruby/build/trunk/.bundle/gems/debug-1.9.2/ext/debug' I, [2024-05-03T05:57:26.501172 #3737750] INFO -- : make[2]: Leaving directory '/tmp/ruby/build/trunk/.bundle/gems/debug-1.9.2/ext/debug' I, [2024-05-03T05:57:26.503071 #3737750] INFO -- : make[2]: Entering directory '/tmp/ruby/build/trunk/.bundle/gems/nkf-0.2.0/ext/nkf' I, [2024-05-03T05:57:26.525167 #3737750] INFO -- : make[2]: Leaving directory '/tmp/ruby/build/trunk/.bundle/gems/nkf-0.2.0/ext/nkf' I, [2024-05-03T05:57:26.527068 #3737750] INFO -- : make[2]: Entering directory '/tmp/ruby/build/trunk/.bundle/gems/racc-1.7.3/ext/racc/cparse' I, [2024-05-03T05:57:26.549325 #3737750] INFO -- : make[2]: Leaving directory '/tmp/ruby/build/trunk/.bundle/gems/racc-1.7.3/ext/racc/cparse' I, [2024-05-03T05:57:26.551667 #3737750] INFO -- : make[2]: Entering directory '/tmp/ruby/build/trunk/.bundle/gems/rbs-3.4.4/ext/rbs_extension' I, [2024-05-03T05:57:26.573914 #3737750] INFO -- : make[2]: Leaving directory '/tmp/ruby/build/trunk/.bundle/gems/rbs-3.4.4/ext/rbs_extension' I, [2024-05-03T05:57:26.575811 #3737750] INFO -- : make[2]: Entering directory '/tmp/ruby/build/trunk/.bundle/gems/syslog-0.1.2/ext/syslog' I, [2024-05-03T05:57:26.597285 #3737750] INFO -- : make[2]: Leaving directory '/tmp/ruby/build/trunk/.bundle/gems/syslog-0.1.2/ext/syslog' I, [2024-05-03T05:57:26.620577 #3737750] INFO -- : make[2]: Entering directory '/tmp/ruby/build/trunk' I, [2024-05-03T05:57:26.685662 #3737750] INFO -- : make[2]: 'ruby' is up to date. I, [2024-05-03T05:57:26.685702 #3737750] INFO -- : make[2]: Leaving directory '/tmp/ruby/build/trunk' I, [2024-05-03T05:57:26.685954 #3737750] INFO -- : make[1]: Leaving directory '/tmp/ruby/build/trunk' I, [2024-05-03T05:57:26.689779 #3737750] INFO -- : make[1]: Entering directory '/tmp/ruby/build/trunk' I, [2024-05-03T05:57:26.689800 #3737750] INFO -- : make[1]: Nothing to be done for 'note'. I, [2024-05-03T05:57:26.689805 #3737750] INFO -- : make[1]: Leaving directory '/tmp/ruby/build/trunk' E, [2024-05-03T05:57:26.746729 #3737750] ERROR -- : $ /tmp/ruby/build/trunk/miniruby -I/tmp/ruby/src/trunk/lib /tmp/ruby/src/trunk/tool/runruby.rb --archdir=/tmp/ruby/build/trunk --extout=.ext -- /tmp/ruby/src/trunk/spec/mspec/bin/mspec-run -B /tmp/ruby/src/trunk/spec/default.mspec --error-output stderr --debug -fy -o /tmp/rubytest.tix93j/1-mspec-multi-0 E, [2024-05-03T05:57:26.746967 #3737750] ERROR -- : $ /tmp/ruby/build/trunk/miniruby -I/tmp/ruby/src/trunk/lib /tmp/ruby/src/trunk/tool/runruby.rb --archdir=/tmp/ruby/build/trunk --extout=.ext -- /tmp/ruby/src/trunk/spec/mspec/bin/mspec-run -B /tmp/ruby/src/trunk/spec/default.mspec --error-output stderr --debug -fy -o /tmp/rubytest.tix93j/2-mspec-multi-1 E, [2024-05-03T05:57:26.747239 #3737750] ERROR -- : $ /tmp/ruby/build/trunk/miniruby -I/tmp/ruby/src/trunk/lib /tmp/ruby/src/trunk/tool/runruby.rb --archdir=/tmp/ruby/build/trunk --extout=.ext -- /tmp/ruby/src/trunk/spec/mspec/bin/mspec-run -B /tmp/ruby/src/trunk/spec/default.mspec --error-output stderr --debug -fy -o /tmp/rubytest.tix93j/3-mspec-multi-2 E, [2024-05-03T05:57:26.747469 #3737750] ERROR -- : $ /tmp/ruby/build/trunk/miniruby -I/tmp/ruby/src/trunk/lib /tmp/ruby/src/trunk/tool/runruby.rb --archdir=/tmp/ruby/build/trunk --extout=.ext -- /tmp/ruby/src/trunk/spec/mspec/bin/mspec-run -B /tmp/ruby/src/trunk/spec/default.mspec --error-output stderr --debug -fy -o /tmp/rubytest.tix93j/4-mspec-multi-3 E, [2024-05-03T05:57:26.747621 #3737750] ERROR -- : $ /tmp/ruby/build/trunk/miniruby -I/tmp/ruby/src/trunk/lib /tmp/ruby/src/trunk/tool/runruby.rb --archdir=/tmp/ruby/build/trunk --extout=.ext -- /tmp/ruby/src/trunk/spec/mspec/bin/mspec-run -B /tmp/ruby/src/trunk/spec/default.mspec --error-output stderr --debug -fy -o /tmp/rubytest.tix93j/5-mspec-multi-4 E, [2024-05-03T05:57:26.747655 #3737750] ERROR -- : $ /tmp/ruby/build/trunk/miniruby -I/tmp/ruby/src/trunk/lib /tmp/ruby/src/trunk/tool/runruby.rb --archdir=/tmp/ruby/build/trunk --extout=.ext -- /tmp/ruby/src/trunk/spec/mspec/bin/mspec-run -B /tmp/ruby/src/trunk/spec/default.mspec --error-output stderr --debug -fy -o /tmp/rubytest.tix93j/6-mspec-multi-5 E, [2024-05-03T05:57:26.747874 #3737750] ERROR -- : $ /tmp/ruby/build/trunk/miniruby -I/tmp/ruby/src/trunk/lib /tmp/ruby/src/trunk/tool/runruby.rb --archdir=/tmp/ruby/build/trunk --extout=.ext -- /tmp/ruby/src/trunk/spec/mspec/bin/mspec-run -B /tmp/ruby/src/trunk/spec/default.mspec --error-output stderr --debug -fy -o /tmp/rubytest.tix93j/7-mspec-multi-6 E, [2024-05-03T05:57:26.748055 #3737750] ERROR -- : $ /tmp/ruby/build/trunk/miniruby -I/tmp/ruby/src/trunk/lib /tmp/ruby/src/trunk/tool/runruby.rb --archdir=/tmp/ruby/build/trunk --extout=.ext -- /tmp/ruby/src/trunk/spec/mspec/bin/mspec-run -B /tmp/ruby/src/trunk/spec/default.mspec --error-output stderr --debug -fy -o /tmp/rubytest.tix93j/8-mspec-multi-7 E, [2024-05-03T05:57:26.748308 #3737750] ERROR -- : $ /tmp/ruby/build/trunk/miniruby -I/tmp/ruby/src/trunk/lib /tmp/ruby/src/trunk/tool/runruby.rb --archdir=/tmp/ruby/build/trunk --extout=.ext -- /tmp/ruby/src/trunk/spec/mspec/bin/mspec-run -B /tmp/ruby/src/trunk/spec/default.mspec --error-output stderr --debug -fy -o /tmp/rubytest.tix93j/9-mspec-multi-8 E, [2024-05-03T05:57:26.748773 #3737750] ERROR -- : $ /tmp/ruby/build/trunk/miniruby -I/tmp/ruby/src/trunk/lib /tmp/ruby/src/trunk/tool/runruby.rb --archdir=/tmp/ruby/build/trunk --extout=.ext -- /tmp/ruby/src/trunk/spec/mspec/bin/mspec-run -B /tmp/ruby/src/trunk/spec/default.mspec --error-output stderr --debug -fy -o /tmp/rubytest.tix93j/10-mspec-multi-9 E, [2024-05-03T05:57:26.749049 #3737750] ERROR -- : $ /tmp/ruby/build/trunk/miniruby -I/tmp/ruby/src/trunk/lib /tmp/ruby/src/trunk/tool/runruby.rb --archdir=/tmp/ruby/build/trunk --extout=.ext -- /tmp/ruby/src/trunk/spec/mspec/bin/mspec-run -B /tmp/ruby/src/trunk/spec/default.mspec --error-output stderr --debug -fy -o /tmp/rubytest.tix93j/11-mspec-multi-10 E, [2024-05-03T05:57:26.749326 #3737750] ERROR -- : $ /tmp/ruby/build/trunk/miniruby -I/tmp/ruby/src/trunk/lib /tmp/ruby/src/trunk/tool/runruby.rb --archdir=/tmp/ruby/build/trunk --extout=.ext -- /tmp/ruby/src/trunk/spec/mspec/bin/mspec-run -B /tmp/ruby/src/trunk/spec/default.mspec --error-output stderr --debug -fy -o /tmp/rubytest.tix93j/12-mspec-multi-11 E, [2024-05-03T05:57:26.749608 #3737750] ERROR -- : $ /tmp/ruby/build/trunk/miniruby -I/tmp/ruby/src/trunk/lib /tmp/ruby/src/trunk/tool/runruby.rb --archdir=/tmp/ruby/build/trunk --extout=.ext -- /tmp/ruby/src/trunk/spec/mspec/bin/mspec-run -B /tmp/ruby/src/trunk/spec/default.mspec --error-output stderr --debug -fy -o /tmp/rubytest.tix93j/13-mspec-multi-12 E, [2024-05-03T05:57:26.749863 #3737750] ERROR -- : $ /tmp/ruby/build/trunk/miniruby -I/tmp/ruby/src/trunk/lib /tmp/ruby/src/trunk/tool/runruby.rb --archdir=/tmp/ruby/build/trunk --extout=.ext -- /tmp/ruby/src/trunk/spec/mspec/bin/mspec-run -B /tmp/ruby/src/trunk/spec/default.mspec --error-output stderr --debug -fy -o /tmp/rubytest.tix93j/14-mspec-multi-13 E, [2024-05-03T05:57:26.750073 #3737750] ERROR -- : $ /tmp/ruby/build/trunk/miniruby -I/tmp/ruby/src/trunk/lib /tmp/ruby/src/trunk/tool/runruby.rb --archdir=/tmp/ruby/build/trunk --extout=.ext -- /tmp/ruby/src/trunk/spec/mspec/bin/mspec-run -B /tmp/ruby/src/trunk/spec/default.mspec --error-output stderr --debug -fy -o /tmp/rubytest.tix93j/15-mspec-multi-14 E, [2024-05-03T05:57:26.750272 #3737750] ERROR -- : $ /tmp/ruby/build/trunk/miniruby -I/tmp/ruby/src/trunk/lib /tmp/ruby/src/trunk/tool/runruby.rb --archdir=/tmp/ruby/build/trunk --extout=.ext -- /tmp/ruby/src/trunk/spec/mspec/bin/mspec-run -B /tmp/ruby/src/trunk/spec/default.mspec --error-output stderr --debug -fy -o /tmp/rubytest.tix93j/16-mspec-multi-15 E, [2024-05-03T05:57:26.750415 #3737750] ERROR -- : $ /tmp/ruby/build/trunk/miniruby -I/tmp/ruby/src/trunk/lib /tmp/ruby/src/trunk/tool/runruby.rb --archdir=/tmp/ruby/build/trunk --extout=.ext -- /tmp/ruby/src/trunk/spec/mspec/bin/mspec-run -B /tmp/ruby/src/trunk/spec/default.mspec --error-output stderr --debug -fy -o /tmp/rubytest.tix93j/17-mspec-multi-16 E, [2024-05-03T05:57:26.750644 #3737750] ERROR -- : $ /tmp/ruby/build/trunk/miniruby -I/tmp/ruby/src/trunk/lib /tmp/ruby/src/trunk/tool/runruby.rb --archdir=/tmp/ruby/build/trunk --extout=.ext -- /tmp/ruby/src/trunk/spec/mspec/bin/mspec-run -B /tmp/ruby/src/trunk/spec/default.mspec --error-output stderr --debug -fy -o /tmp/rubytest.tix93j/18-mspec-multi-17 E, [2024-05-03T05:57:26.753419 #3737750] ERROR -- : $ /tmp/ruby/build/trunk/miniruby -I/tmp/ruby/src/trunk/lib /tmp/ruby/src/trunk/tool/runruby.rb --archdir=/tmp/ruby/build/trunk --extout=.ext -- /tmp/ruby/src/trunk/spec/mspec/bin/mspec-run -B /tmp/ruby/src/trunk/spec/default.mspec --error-output stderr --debug -fy -o /tmp/rubytest.tix93j/19-mspec-multi-18 E, [2024-05-03T05:57:26.753872 #3737750] ERROR -- : $ /tmp/ruby/build/trunk/miniruby -I/tmp/ruby/src/trunk/lib /tmp/ruby/src/trunk/tool/runruby.rb --archdir=/tmp/ruby/build/trunk --extout=.ext -- /tmp/ruby/src/trunk/spec/mspec/bin/mspec-run -B /tmp/ruby/src/trunk/spec/default.mspec --error-output stderr --debug -fy -o /tmp/rubytest.tix93j/20-mspec-multi-19 I, [2024-05-03T05:57:26.946735 #3737750] INFO -- : ruby 3.4.0dev (2024-05-03T05:47:18Z master 9f8e87c44b) [x86_64-linux] I, [2024-05-03T05:57:27.597668 #3737750] INFO -- : 0 ......................................................................... I, [2024-05-03T05:57:27.968910 #3737750] INFO -- : 73 ......................................................................... I, [2024-05-03T05:57:28.148220 #3737750] INFO -- : 146 ......................................................................... I, [2024-05-03T05:57:28.203584 #3737750] INFO -- : 219 ......................................................................... I, [2024-05-03T05:57:28.272829 #3737750] INFO -- : 292 ......................................................................... I, [2024-05-03T05:57:28.314539 #3737750] INFO -- : 365 ......................................................................... I, [2024-05-03T05:57:28.336586 #3737750] INFO -- : 438 ......................................................................... I, [2024-05-03T05:57:28.357648 #3737750] INFO -- : 511 ......................................................................... I, [2024-05-03T05:57:28.379511 #3737750] INFO -- : 584 ......................................................................... I, [2024-05-03T05:57:28.438426 #3737750] INFO -- : 657 ......................................................................... I, [2024-05-03T05:57:28.473279 #3737750] INFO -- : 730 ......................................................................... I, [2024-05-03T05:57:28.497062 #3737750] INFO -- : 803 ......................................................................... I, [2024-05-03T05:57:28.527596 #3737750] INFO -- : 876 ......................................................................... I, [2024-05-03T05:57:28.574159 #3737750] INFO -- : 949 ......................................................................... I, [2024-05-03T05:57:28.657713 #3737750] INFO -- : 1022 ......................................................................... I, [2024-05-03T05:57:28.841637 #3737750] INFO -- : 1095 ......................................................................... I, [2024-05-03T05:57:28.967791 #3737750] INFO -- : 1168 ......................................................................... I, [2024-05-03T05:57:29.024022 #3737750] INFO -- : 1241 ......................................................................... I, [2024-05-03T05:57:29.070261 #3737750] INFO -- : 1314 ......................................................................... I, [2024-05-03T05:57:29.096158 #3737750] INFO -- : 1387 ......................................................................... I, [2024-05-03T05:57:29.208472 #3737750] INFO -- : 1460 ......................................................................... I, [2024-05-03T05:57:29.650998 #3737750] INFO -- : 1533 ......................................................................... I, [2024-05-03T05:57:29.721992 #3737750] INFO -- : 1606 ......................................................................... I, [2024-05-03T05:57:29.859650 #3737750] INFO -- : 1679 ......................................................................... I, [2024-05-03T05:57:29.970421 #3737750] INFO -- : 1752 ......................................................................... I, [2024-05-03T05:57:30.048238 #3737750] INFO -- : 1825 ......................................................................... I, [2024-05-03T05:57:30.183142 #3737750] INFO -- : 1898 ......................................................................... I, [2024-05-03T05:57:30.271625 #3737750] INFO -- : 1971 ......................................................................... I, [2024-05-03T05:57:30.331519 #3737750] INFO -- : 2044 ......................................................................... I, [2024-05-03T05:57:30.384608 #3737750] INFO -- : 2117 ......................................................................... I, [2024-05-03T05:57:30.399654 #3737750] INFO -- : 2190 ......................................................................... I, [2024-05-03T05:57:30.419557 #3737750] INFO -- : 2263 ......................................................................... I, [2024-05-03T05:57:30.434943 #3737750] INFO -- : 2336 ......................................................................... I, [2024-05-03T05:57:30.472357 #3737750] INFO -- : 2409 ......................................................................... I, [2024-05-03T05:57:30.589774 #3737750] INFO -- : 2482 ......................................................................... I, [2024-05-03T05:57:30.616440 #3737750] INFO -- : 2555 ......................................................................... I, [2024-05-03T05:57:30.722175 #3737750] INFO -- : 2628 ......................................................................... I, [2024-05-03T05:57:30.825323 #3737750] INFO -- : 2701 ......................................................................... I, [2024-05-03T05:57:30.854780 #3737750] INFO -- : 2774 ......................................................................... I, [2024-05-03T05:57:30.912112 #3737750] INFO -- : 2847 ......................................................................... I, [2024-05-03T05:57:30.949134 #3737750] INFO -- : 2920 ......................................................................... I, [2024-05-03T05:57:30.972423 #3737750] INFO -- : 2993 ......................................................................... I, [2024-05-03T05:57:30.992978 #3737750] INFO -- : 3066 ......................................................................... I, [2024-05-03T05:57:31.005463 #3737750] INFO -- : 3139 ......................................................................... I, [2024-05-03T05:57:31.015958 #3737750] INFO -- : 3212 ......................................................................... I, [2024-05-03T05:57:31.044238 #3737750] INFO -- : 3285 ......................................................................... I, [2024-05-03T05:57:35.004168 #3737750] INFO -- : 3358 ........................................................................ I, [2024-05-03T05:57:35.004248 #3737750] INFO -- : I, [2024-05-03T05:57:35.004264 #3737750] INFO -- : Finished in 8.256673 seconds I, [2024-05-03T05:57:35.004277 #3737750] INFO -- : I, [2024-05-03T05:57:35.004289 #3737750] INFO -- : 3429 files, 32610 examples, 168439 expectations, 0 failures, 0 errors, 0 tagged I, [2024-05-03T05:57:35.006171 #3737750] INFO -- : $$$[end] "make yes-test-rubyspec MSPECOPT='--error-output stderr --debug -j' TESTS='-j20'" exit with 0.