# Logfile created on 2024-05-03 00:49:27 +0000 by logger.rb/v1.4.3 I, [2024-05-03T00:49:27.290405 #1029333] INFO -- : #, @formatter=nil, @logdev=#, @binmode=false, @mon_data=#, @mon_data_owner_object_id=860>>> I, [2024-05-03T00:49:27.290525 #1029333] INFO -- : $$$[beg] make update-unicode -j20 I, [2024-05-03T00:49:27.348675 #1029333] INFO -- : Downloading Unicode emoji 15.0 files... I, [2024-05-03T00:49:27.348840 #1029333] INFO -- : Downloading Unicode emoji 15.0 files... I, [2024-05-03T00:49:27.349286 #1029333] INFO -- : Downloading Unicode emoji 15.0 files... I, [2024-05-03T00:49:27.389927 #1029333] INFO -- : made symlink emoji/15.0/emoji-sequences.txt to /tmp/ruby/src/trunk/.downloaded-cache/emoji/15.0/emoji-sequences.txt I, [2024-05-03T00:49:27.389983 #1029333] INFO -- : downloading emoji/15.0/emoji-test.txt ... /tmp/ruby/src/trunk/enc/unicode/data/emoji/15.0/emoji-sequences.txt already exists I, [2024-05-03T00:49:27.390136 #1029333] INFO -- : downloading emoji/15.0/emoji-test.txt ... /tmp/ruby/src/trunk/enc/unicode/data/emoji/15.0/emoji-sequences.txt already exists E, [2024-05-03T00:49:27.817476 #1029333] ERROR -- : /tmp/ruby/src/trunk/tool/downloader.rb:302:in `rescue in download': failed to download emoji/15.0/emoji-test.txt (RuntimeError) E, [2024-05-03T00:49:27.817523 #1029333] ERROR -- : OpenURI::HTTPError: 403 Forbidden: https://www.unicode.org/Public/emoji/15.0/emoji-test.txt E, [2024-05-03T00:49:27.817529 #1029333] ERROR -- : from /tmp/ruby/src/trunk/tool/downloader.rb:201:in `download' E, [2024-05-03T00:49:27.817533 #1029333] ERROR -- : from /tmp/ruby/src/trunk/tool/downloader.rb:136:in `download' E, [2024-05-03T00:49:27.817537 #1029333] ERROR -- : from /tmp/ruby/src/trunk/tool/downloader.rb:482:in `block in
' E, [2024-05-03T00:49:27.817541 #1029333] ERROR -- : from /tmp/ruby/src/trunk/tool/downloader.rb:465:in `each' E, [2024-05-03T00:49:27.817544 #1029333] ERROR -- : from /tmp/ruby/src/trunk/tool/downloader.rb:465:in `
' E, [2024-05-03T00:49:27.817547 #1029333] ERROR -- : /usr/lib/ruby/3.0.0/open-uri.rb:364:in `open_http': 403 Forbidden (OpenURI::HTTPError) E, [2024-05-03T00:49:27.817551 #1029333] ERROR -- : from /usr/lib/ruby/3.0.0/open-uri.rb:741:in `buffer_open' E, [2024-05-03T00:49:27.817556 #1029333] ERROR -- : from /usr/lib/ruby/3.0.0/open-uri.rb:212:in `block in open_loop' E, [2024-05-03T00:49:27.817560 #1029333] ERROR -- : from /usr/lib/ruby/3.0.0/open-uri.rb:210:in `catch' E, [2024-05-03T00:49:27.817563 #1029333] ERROR -- : from /usr/lib/ruby/3.0.0/open-uri.rb:210:in `open_loop' E, [2024-05-03T00:49:27.817566 #1029333] ERROR -- : from /usr/lib/ruby/3.0.0/open-uri.rb:151:in `open_uri' E, [2024-05-03T00:49:27.817570 #1029333] ERROR -- : from /usr/lib/ruby/3.0.0/open-uri.rb:721:in `open' E, [2024-05-03T00:49:27.817573 #1029333] ERROR -- : from /usr/lib/ruby/3.0.0/open-uri.rb:729:in `read' E, [2024-05-03T00:49:27.817585 #1029333] ERROR -- : from /tmp/ruby/src/trunk/tool/downloader.rb:247:in `block in download' E, [2024-05-03T00:49:27.817588 #1029333] ERROR -- : from /tmp/ruby/src/trunk/tool/downloader.rb:378:in `with_retry' E, [2024-05-03T00:49:27.817592 #1029333] ERROR -- : from /tmp/ruby/src/trunk/tool/downloader.rb:246:in `download' E, [2024-05-03T00:49:27.817597 #1029333] ERROR -- : from /tmp/ruby/src/trunk/tool/downloader.rb:136:in `download' E, [2024-05-03T00:49:27.817600 #1029333] ERROR -- : from /tmp/ruby/src/trunk/tool/downloader.rb:482:in `block in
' E, [2024-05-03T00:49:27.817604 #1029333] ERROR -- : from /tmp/ruby/src/trunk/tool/downloader.rb:465:in `each' E, [2024-05-03T00:49:27.817607 #1029333] ERROR -- : from /tmp/ruby/src/trunk/tool/downloader.rb:465:in `
' E, [2024-05-03T00:49:27.819522 #1029333] ERROR -- : make: *** [uncommon.mk:1787: /tmp/ruby/src/trunk/enc/unicode/data/emoji/15.0/emoji-test.txt] Error 1 E, [2024-05-03T00:49:27.819543 #1029333] ERROR -- : make: *** Waiting for unfinished jobs.... E, [2024-05-03T00:49:27.832745 #1029333] ERROR -- : /tmp/ruby/src/trunk/tool/downloader.rb:302:in `rescue in download': failed to download emoji/15.0/emoji-test.txt (RuntimeError) E, [2024-05-03T00:49:27.832770 #1029333] ERROR -- : OpenURI::HTTPError: 403 Forbidden: https://www.unicode.org/Public/emoji/15.0/emoji-test.txt E, [2024-05-03T00:49:27.832776 #1029333] ERROR -- : from /tmp/ruby/src/trunk/tool/downloader.rb:201:in `download' E, [2024-05-03T00:49:27.832780 #1029333] ERROR -- : from /tmp/ruby/src/trunk/tool/downloader.rb:136:in `download' E, [2024-05-03T00:49:27.832785 #1029333] ERROR -- : from /tmp/ruby/src/trunk/tool/downloader.rb:482:in `block in
' E, [2024-05-03T00:49:27.832788 #1029333] ERROR -- : from /tmp/ruby/src/trunk/tool/downloader.rb:465:in `each' E, [2024-05-03T00:49:27.832791 #1029333] ERROR -- : from /tmp/ruby/src/trunk/tool/downloader.rb:465:in `
' E, [2024-05-03T00:49:27.832795 #1029333] ERROR -- : /usr/lib/ruby/3.0.0/open-uri.rb:364:in `open_http': 403 Forbidden (OpenURI::HTTPError) E, [2024-05-03T00:49:27.832798 #1029333] ERROR -- : from /usr/lib/ruby/3.0.0/open-uri.rb:741:in `buffer_open' E, [2024-05-03T00:49:27.832804 #1029333] ERROR -- : from /usr/lib/ruby/3.0.0/open-uri.rb:212:in `block in open_loop' E, [2024-05-03T00:49:27.832808 #1029333] ERROR -- : from /usr/lib/ruby/3.0.0/open-uri.rb:210:in `catch' E, [2024-05-03T00:49:27.832811 #1029333] ERROR -- : from /usr/lib/ruby/3.0.0/open-uri.rb:210:in `open_loop' E, [2024-05-03T00:49:27.832815 #1029333] ERROR -- : from /usr/lib/ruby/3.0.0/open-uri.rb:151:in `open_uri' E, [2024-05-03T00:49:27.832818 #1029333] ERROR -- : from /usr/lib/ruby/3.0.0/open-uri.rb:721:in `open' E, [2024-05-03T00:49:27.832821 #1029333] ERROR -- : from /usr/lib/ruby/3.0.0/open-uri.rb:729:in `read' E, [2024-05-03T00:49:27.832825 #1029333] ERROR -- : from /tmp/ruby/src/trunk/tool/downloader.rb:247:in `block in download' E, [2024-05-03T00:49:27.832828 #1029333] ERROR -- : from /tmp/ruby/src/trunk/tool/downloader.rb:378:in `with_retry' E, [2024-05-03T00:49:27.832833 #1029333] ERROR -- : from /tmp/ruby/src/trunk/tool/downloader.rb:246:in `download' E, [2024-05-03T00:49:27.832836 #1029333] ERROR -- : from /tmp/ruby/src/trunk/tool/downloader.rb:136:in `download' E, [2024-05-03T00:49:27.832839 #1029333] ERROR -- : from /tmp/ruby/src/trunk/tool/downloader.rb:482:in `block in
' E, [2024-05-03T00:49:27.832843 #1029333] ERROR -- : from /tmp/ruby/src/trunk/tool/downloader.rb:465:in `each' E, [2024-05-03T00:49:27.832846 #1029333] ERROR -- : from /tmp/ruby/src/trunk/tool/downloader.rb:465:in `
' E, [2024-05-03T00:49:27.834853 #1029333] ERROR -- : make: *** [uncommon.mk:1787: /tmp/ruby/src/trunk/enc/unicode/data/emoji/15.0/emoji-zwj-sequences.txt] Error 1 E, [2024-05-03T00:49:27.836710 #1029333] ERROR -- : /tmp/ruby/src/trunk/tool/downloader.rb:302:in `rescue in download': failed to download emoji/15.0/emoji-test.txt (RuntimeError) E, [2024-05-03T00:49:27.836734 #1029333] ERROR -- : OpenURI::HTTPError: 403 Forbidden: https://www.unicode.org/Public/emoji/15.0/emoji-test.txt E, [2024-05-03T00:49:27.836743 #1029333] ERROR -- : from /tmp/ruby/src/trunk/tool/downloader.rb:201:in `download' E, [2024-05-03T00:49:27.836747 #1029333] ERROR -- : from /tmp/ruby/src/trunk/tool/downloader.rb:136:in `download' E, [2024-05-03T00:49:27.836751 #1029333] ERROR -- : from /tmp/ruby/src/trunk/tool/downloader.rb:482:in `block in
' E, [2024-05-03T00:49:27.836754 #1029333] ERROR -- : from /tmp/ruby/src/trunk/tool/downloader.rb:465:in `each' E, [2024-05-03T00:49:27.836758 #1029333] ERROR -- : from /tmp/ruby/src/trunk/tool/downloader.rb:465:in `
' E, [2024-05-03T00:49:27.836761 #1029333] ERROR -- : /usr/lib/ruby/3.0.0/open-uri.rb:364:in `open_http': 403 Forbidden (OpenURI::HTTPError) E, [2024-05-03T00:49:27.836765 #1029333] ERROR -- : from /usr/lib/ruby/3.0.0/open-uri.rb:741:in `buffer_open' E, [2024-05-03T00:49:27.836769 #1029333] ERROR -- : from /usr/lib/ruby/3.0.0/open-uri.rb:212:in `block in open_loop' E, [2024-05-03T00:49:27.836773 #1029333] ERROR -- : from /usr/lib/ruby/3.0.0/open-uri.rb:210:in `catch' E, [2024-05-03T00:49:27.836776 #1029333] ERROR -- : from /usr/lib/ruby/3.0.0/open-uri.rb:210:in `open_loop' E, [2024-05-03T00:49:27.836779 #1029333] ERROR -- : from /usr/lib/ruby/3.0.0/open-uri.rb:151:in `open_uri' E, [2024-05-03T00:49:27.836783 #1029333] ERROR -- : from /usr/lib/ruby/3.0.0/open-uri.rb:721:in `open' E, [2024-05-03T00:49:27.836853 #1029333] ERROR -- : from /usr/lib/ruby/3.0.0/open-uri.rb:729:in `read' E, [2024-05-03T00:49:27.836859 #1029333] ERROR -- : from /tmp/ruby/src/trunk/tool/downloader.rb:247:in `block in download' E, [2024-05-03T00:49:27.836863 #1029333] ERROR -- : from /tmp/ruby/src/trunk/tool/downloader.rb:378:in `with_retry' E, [2024-05-03T00:49:27.836867 #1029333] ERROR -- : from /tmp/ruby/src/trunk/tool/downloader.rb:246:in `download' E, [2024-05-03T00:49:27.836870 #1029333] ERROR -- : from /tmp/ruby/src/trunk/tool/downloader.rb:136:in `download' E, [2024-05-03T00:49:27.836873 #1029333] ERROR -- : from /tmp/ruby/src/trunk/tool/downloader.rb:482:in `block in
' E, [2024-05-03T00:49:27.836877 #1029333] ERROR -- : from /tmp/ruby/src/trunk/tool/downloader.rb:465:in `each' E, [2024-05-03T00:49:27.836880 #1029333] ERROR -- : from /tmp/ruby/src/trunk/tool/downloader.rb:465:in `
' E, [2024-05-03T00:49:27.838419 #1029333] ERROR -- : make: *** [uncommon.mk:1787: /tmp/ruby/src/trunk/enc/unicode/data/emoji/15.0/emoji-sequences.txt] Error 1 E, [2024-05-03T00:49:27.838443 #1029333] ERROR -- : make: *** Deleting file '/tmp/ruby/src/trunk/enc/unicode/data/emoji/15.0/emoji-sequences.txt' I, [2024-05-03T00:49:27.838545 #1029333] INFO -- : downloading emoji/15.0/emoji-test.txt ... I, [2024-05-03T00:49:27.838835 #1029333] INFO -- : $$$[end] "make update-unicode -j20" exit with 512. I, [2024-05-03T00:49:27.838865 #1029333] INFO -- : $$$[beg] make update-download -j20 I, [2024-05-03T00:49:27.939106 #1029333] INFO -- : tool/config.guess already exists I, [2024-05-03T00:49:27.939153 #1029333] INFO -- : tool/config.sub already exists I, [2024-05-03T00:49:27.941210 #1029333] INFO -- : Update minitest to ea9caafc0754b1d6236a490d59e624b53209734a I, [2024-05-03T00:49:27.941368 #1029333] INFO -- : Update power_assert to 84e85124c5014a139af39161d484156cfe87a9ed I, [2024-05-03T00:49:27.941957 #1029333] INFO -- : Update rbs to ba7872795d5de04adb8ff500c0e6afdc81a041dd I, [2024-05-03T00:49:27.942187 #1029333] INFO -- : Update typeprof to b19a6416da3a05d57fadd6ffdadb382b6d236ca5 I, [2024-05-03T00:49:27.942549 #1029333] INFO -- : echo ea9caafc0754b1d6236a490d59e624b53209734a | /bin/sh /tmp/ruby/src/trunk/tool/ifchange /tmp/ruby/src/trunk/.bundle/.timestamp/minitest.revision - I, [2024-05-03T00:49:27.942789 #1029333] INFO -- : echo 84e85124c5014a139af39161d484156cfe87a9ed | /bin/sh /tmp/ruby/src/trunk/tool/ifchange /tmp/ruby/src/trunk/.bundle/.timestamp/power_assert.revision - I, [2024-05-03T00:49:27.943295 #1029333] INFO -- : echo ba7872795d5de04adb8ff500c0e6afdc81a041dd | /bin/sh /tmp/ruby/src/trunk/tool/ifchange /tmp/ruby/src/trunk/.bundle/.timestamp/rbs.revision - I, [2024-05-03T00:49:27.943503 #1029333] INFO -- : echo b19a6416da3a05d57fadd6ffdadb382b6d236ca5 | /bin/sh /tmp/ruby/src/trunk/tool/ifchange /tmp/ruby/src/trunk/.bundle/.timestamp/typeprof.revision - I, [2024-05-03T00:49:27.944459 #1029333] INFO -- : /tmp/ruby/src/trunk/.bundle/.timestamp/minitest.revision unchanged I, [2024-05-03T00:49:27.944591 #1029333] INFO -- : /tmp/ruby/src/trunk/.bundle/.timestamp/power_assert.revision unchanged I, [2024-05-03T00:49:27.945133 #1029333] INFO -- : /tmp/ruby/src/trunk/.bundle/.timestamp/rbs.revision unchanged I, [2024-05-03T00:49:27.945450 #1029333] INFO -- : /tmp/ruby/src/trunk/.bundle/.timestamp/typeprof.revision unchanged I, [2024-05-03T00:49:27.945551 #1029333] INFO -- : Building power_assert@84e85124c5014a139af39161d484156cfe87a9ed to /tmp/ruby/src/trunk/gems/power_assert-2.0.3.gem I, [2024-05-03T00:49:28.015017 #1029333] INFO -- : Successfully built RubyGem I, [2024-05-03T00:49:28.015073 #1029333] INFO -- : Name: power_assert I, [2024-05-03T00:49:28.015092 #1029333] INFO -- : Version: 2.0.4dev I, [2024-05-03T00:49:28.015105 #1029333] INFO -- : File: power_assert-2.0.4dev.gem I, [2024-05-03T00:49:28.060875 #1029333] INFO -- : $$$[end] "make update-download -j20" exit with 0. I, [2024-05-03T00:49:28.060936 #1029333] INFO -- : $$$[beg] make update-rubyspec -j20 I, [2024-05-03T00:49:28.118813 #1029333] INFO -- : make: Nothing to be done for 'update-rubyspec'. I, [2024-05-03T00:49:28.119080 #1029333] INFO -- : $$$[end] "make update-rubyspec -j20" exit with 0. I, [2024-05-03T00:49:28.119114 #1029333] INFO -- : $$$[beg] make update-src -j20 I, [2024-05-03T00:49:28.641462 #1029333] INFO -- : Already up to date. I, [2024-05-03T00:49:28.651108 #1029333] INFO -- : Latest commit hash = b5cefa79dd I, [2024-05-03T00:49:28.652295 #1029333] INFO -- : $$$[end] "make update-src -j20" exit with 0. I, [2024-05-03T00:49:28.652343 #1029333] INFO -- : $$$[beg] make after-update -j20 I, [2024-05-03T00:49:28.742387 #1029333] INFO -- : /tmp/ruby/src/trunk/revision.h updated I, [2024-05-03T00:49:28.743803 #1029333] INFO -- : generating x86_64-linux-fake.rb I, [2024-05-03T00:49:28.795062 #1029333] INFO -- : x86_64-linux-fake.rb updated I, [2024-05-03T00:49:28.796542 #1029333] INFO -- : generating enc.mk I, [2024-05-03T00:49:28.913903 #1029333] INFO -- : making srcs under enc I, [2024-05-03T00:49:28.943810 #1029333] INFO -- : make[1]: Entering directory '/tmp/ruby/build/trunk' I, [2024-05-03T00:49:28.943873 #1029333] INFO -- : make[1]: Nothing to be done for 'srcs'. I, [2024-05-03T00:49:28.943888 #1029333] INFO -- : make[1]: Leaving directory '/tmp/ruby/build/trunk' I, [2024-05-03T00:49:28.989450 #1029333] INFO -- : Update minitest to ea9caafc0754b1d6236a490d59e624b53209734a I, [2024-05-03T00:49:28.989681 #1029333] INFO -- : Update power_assert to 84e85124c5014a139af39161d484156cfe87a9ed I, [2024-05-03T00:49:28.990513 #1029333] INFO -- : Update rbs to ba7872795d5de04adb8ff500c0e6afdc81a041dd I, [2024-05-03T00:49:28.990827 #1029333] INFO -- : Update typeprof to b19a6416da3a05d57fadd6ffdadb382b6d236ca5 I, [2024-05-03T00:49:28.991802 #1029333] INFO -- : echo ea9caafc0754b1d6236a490d59e624b53209734a | /bin/sh /tmp/ruby/src/trunk/tool/ifchange /tmp/ruby/src/trunk/.bundle/.timestamp/minitest.revision - I, [2024-05-03T00:49:28.991983 #1029333] INFO -- : echo 84e85124c5014a139af39161d484156cfe87a9ed | /bin/sh /tmp/ruby/src/trunk/tool/ifchange /tmp/ruby/src/trunk/.bundle/.timestamp/power_assert.revision - I, [2024-05-03T00:49:28.993252 #1029333] INFO -- : echo ba7872795d5de04adb8ff500c0e6afdc81a041dd | /bin/sh /tmp/ruby/src/trunk/tool/ifchange /tmp/ruby/src/trunk/.bundle/.timestamp/rbs.revision - I, [2024-05-03T00:49:28.993523 #1029333] INFO -- : echo b19a6416da3a05d57fadd6ffdadb382b6d236ca5 | /bin/sh /tmp/ruby/src/trunk/tool/ifchange /tmp/ruby/src/trunk/.bundle/.timestamp/typeprof.revision - I, [2024-05-03T00:49:28.993895 #1029333] INFO -- : /tmp/ruby/src/trunk/.bundle/.timestamp/power_assert.revision unchanged I, [2024-05-03T00:49:28.994077 #1029333] INFO -- : /tmp/ruby/src/trunk/.bundle/.timestamp/minitest.revision unchanged I, [2024-05-03T00:49:28.995035 #1029333] INFO -- : Building power_assert@84e85124c5014a139af39161d484156cfe87a9ed to /tmp/ruby/src/trunk/gems/power_assert-2.0.3.gem I, [2024-05-03T00:49:28.995070 #1029333] INFO -- : /tmp/ruby/src/trunk/.bundle/.timestamp/rbs.revision unchanged I, [2024-05-03T00:49:28.995281 #1029333] INFO -- : /tmp/ruby/src/trunk/.bundle/.timestamp/typeprof.revision unchanged I, [2024-05-03T00:49:29.064987 #1029333] INFO -- : Successfully built RubyGem I, [2024-05-03T00:49:29.065028 #1029333] INFO -- : Name: power_assert I, [2024-05-03T00:49:29.065034 #1029333] INFO -- : Version: 2.0.4dev I, [2024-05-03T00:49:29.065037 #1029333] INFO -- : File: power_assert-2.0.4dev.gem I, [2024-05-03T00:49:29.067328 #1029333] INFO -- : Extracting bundle gem power_assert-2.0.3... I, [2024-05-03T00:49:29.129705 #1029333] INFO -- : Try with hash version of bundled gems instead of gems/power_assert-2.0.3.gem. We don't use this gem with release version of Ruby. I, [2024-05-03T00:49:29.134695 #1029333] INFO -- : Unpacked gems/power_assert-2.0.4dev.gem I, [2024-05-03T00:49:29.136506 #1029333] INFO -- : $$$[end] "make after-update -j20" exit with 0. I, [2024-05-03T00:49:29.136698 #1029333] INFO -- : $$$[beg] make miniruby -j20 I, [2024-05-03T00:49:29.193323 #1029333] INFO -- : BASERUBY = /usr/bin/ruby --disable=gems I, [2024-05-03T00:49:29.193371 #1029333] INFO -- : CC = gcc I, [2024-05-03T00:49:29.193384 #1029333] INFO -- : LD = ld I, [2024-05-03T00:49:29.193395 #1029333] INFO -- : LDSHARED = gcc -shared I, [2024-05-03T00:49:29.193406 #1029333] INFO -- : CFLAGS = -O3 -fno-fast-math -ggdb3 -Wall -Wextra -Wdeprecated-declarations -Wdiv-by-zero -Wduplicated-cond -Wimplicit-function-declaration -Wimplicit-int -Wpointer-arith -Wwrite-strings -Wold-style-definition -Wimplicit-fallthrough=0 -Wmissing-noreturn -Wno-cast-function-type -Wno-constant-logical-operand -Wno-long-long -Wno-missing-field-initializers -Wno-overlength-strings -Wno-packed-bitfield-compat -Wno-parentheses-equality -Wno-self-assign -Wno-tautological-compare -Wno-unused-parameter -Wno-unused-value -Wsuggest-attribute=format -Wsuggest-attribute=noreturn -Wunused-variable -Wmisleading-indentation -Wundef -fPIC I, [2024-05-03T00:49:29.193418 #1029333] INFO -- : XCFLAGS = -U_FORTIFY_SOURCE -D_FORTIFY_SOURCE=2 -fstack-protector-strong -fno-strict-overflow -fvisibility=hidden -fexcess-precision=standard -DRUBY_EXPORT -I. -I.ext/include/x86_64-linux -I/tmp/ruby/src/trunk/include -I/tmp/ruby/src/trunk -I/tmp/ruby/src/trunk/prism -I/tmp/ruby/src/trunk/enc/unicode/15.0.0 I, [2024-05-03T00:49:29.193430 #1029333] INFO -- : CPPFLAGS = I, [2024-05-03T00:49:29.193440 #1029333] INFO -- : DLDFLAGS = -Wl,--compress-debug-sections=zlib -Wl,-soname,libruby.so.3.4 -fstack-protector-strong I, [2024-05-03T00:49:29.193451 #1029333] INFO -- : SOLIBS = -lz -lrt -lrt -lgmp -ldl -lcrypt -lm -lpthread I, [2024-05-03T00:49:29.193461 #1029333] INFO -- : LANG = en_US.UTF-8 I, [2024-05-03T00:49:29.193471 #1029333] INFO -- : LC_ALL = I, [2024-05-03T00:49:29.193480 #1029333] INFO -- : LC_CTYPE = I, [2024-05-03T00:49:29.193490 #1029333] INFO -- : MFLAGS = -j20 --jobserver-auth=4,5 I, [2024-05-03T00:49:29.193500 #1029333] INFO -- : RUSTC = no I, [2024-05-03T00:49:29.193510 #1029333] INFO -- : YJIT_RUSTC_ARGS = --crate-name=yjit --crate-type=staticlib --edition=2021 -g -C lto=thin -C opt-level=3 -C overflow-checks=on '--out-dir=/tmp/ruby/build/trunk/yjit/target/release/' /tmp/ruby/src/trunk/yjit/src/lib.rs I, [2024-05-03T00:49:29.194810 #1029333] INFO -- : gcc (Ubuntu 11.4.0-1ubuntu1~22.04) 11.4.0 I, [2024-05-03T00:49:29.194856 #1029333] INFO -- : Copyright (C) 2021 Free Software Foundation, Inc. I, [2024-05-03T00:49:29.194870 #1029333] INFO -- : This is free software; see the source for copying conditions. There is NO I, [2024-05-03T00:49:29.194880 #1029333] INFO -- : warranty; not even for MERCHANTABILITY or FITNESS FOR A PARTICULAR PURPOSE. I, [2024-05-03T00:49:29.194901 #1029333] INFO -- : I, [2024-05-03T00:49:29.215365 #1029333] INFO -- : compiling /tmp/ruby/src/trunk/version.c I, [2024-05-03T00:49:29.318509 #1029333] INFO -- : linking miniruby I, [2024-05-03T00:49:29.839837 #1029333] INFO -- : $$$[end] "make miniruby -j20" exit with 0. I, [2024-05-03T00:49:29.839996 #1029333] INFO -- : $$$[beg] make ruby -j20 I, [2024-05-03T00:49:29.897031 #1029333] INFO -- : BASERUBY = /usr/bin/ruby --disable=gems I, [2024-05-03T00:49:29.897067 #1029333] INFO -- : CC = gcc I, [2024-05-03T00:49:29.897072 #1029333] INFO -- : LD = ld I, [2024-05-03T00:49:29.897079 #1029333] INFO -- : LDSHARED = gcc -shared I, [2024-05-03T00:49:29.897083 #1029333] INFO -- : CFLAGS = -O3 -fno-fast-math -ggdb3 -Wall -Wextra -Wdeprecated-declarations -Wdiv-by-zero -Wduplicated-cond -Wimplicit-function-declaration -Wimplicit-int -Wpointer-arith -Wwrite-strings -Wold-style-definition -Wimplicit-fallthrough=0 -Wmissing-noreturn -Wno-cast-function-type -Wno-constant-logical-operand -Wno-long-long -Wno-missing-field-initializers -Wno-overlength-strings -Wno-packed-bitfield-compat -Wno-parentheses-equality -Wno-self-assign -Wno-tautological-compare -Wno-unused-parameter -Wno-unused-value -Wsuggest-attribute=format -Wsuggest-attribute=noreturn -Wunused-variable -Wmisleading-indentation -Wundef -fPIC I, [2024-05-03T00:49:29.897087 #1029333] INFO -- : XCFLAGS = -U_FORTIFY_SOURCE -D_FORTIFY_SOURCE=2 -fstack-protector-strong -fno-strict-overflow -fvisibility=hidden -fexcess-precision=standard -DRUBY_EXPORT -I. -I.ext/include/x86_64-linux -I/tmp/ruby/src/trunk/include -I/tmp/ruby/src/trunk -I/tmp/ruby/src/trunk/prism -I/tmp/ruby/src/trunk/enc/unicode/15.0.0 I, [2024-05-03T00:49:29.897091 #1029333] INFO -- : CPPFLAGS = I, [2024-05-03T00:49:29.897094 #1029333] INFO -- : DLDFLAGS = -Wl,--compress-debug-sections=zlib -Wl,-soname,libruby.so.3.4 -fstack-protector-strong I, [2024-05-03T00:49:29.897099 #1029333] INFO -- : SOLIBS = -lz -lrt -lrt -lgmp -ldl -lcrypt -lm -lpthread I, [2024-05-03T00:49:29.897102 #1029333] INFO -- : LANG = en_US.UTF-8 I, [2024-05-03T00:49:29.897106 #1029333] INFO -- : LC_ALL = I, [2024-05-03T00:49:29.897109 #1029333] INFO -- : LC_CTYPE = I, [2024-05-03T00:49:29.897112 #1029333] INFO -- : MFLAGS = -j20 --jobserver-auth=4,5 I, [2024-05-03T00:49:29.897116 #1029333] INFO -- : RUSTC = no I, [2024-05-03T00:49:29.897120 #1029333] INFO -- : YJIT_RUSTC_ARGS = --crate-name=yjit --crate-type=staticlib --edition=2021 -g -C lto=thin -C opt-level=3 -C overflow-checks=on '--out-dir=/tmp/ruby/build/trunk/yjit/target/release/' /tmp/ruby/src/trunk/yjit/src/lib.rs I, [2024-05-03T00:49:29.898459 #1029333] INFO -- : gcc (Ubuntu 11.4.0-1ubuntu1~22.04) 11.4.0 I, [2024-05-03T00:49:29.898481 #1029333] INFO -- : Copyright (C) 2021 Free Software Foundation, Inc. I, [2024-05-03T00:49:29.898490 #1029333] INFO -- : This is free software; see the source for copying conditions. There is NO I, [2024-05-03T00:49:29.898494 #1029333] INFO -- : warranty; not even for MERCHANTABILITY or FITNESS FOR A PARTICULAR PURPOSE. I, [2024-05-03T00:49:29.898498 #1029333] INFO -- : I, [2024-05-03T00:49:30.005270 #1029333] INFO -- : builtin_binary.inc updated I, [2024-05-03T00:49:30.009862 #1029333] INFO -- : c5234a9416e4f20f175185e840b25b0f08674d14078ed7083f37e655458e3ca9 builtin_binary.inc I, [2024-05-03T00:49:30.010429 #1029333] INFO -- : compiling /tmp/ruby/src/trunk/builtin.c I, [2024-05-03T00:49:30.194588 #1029333] INFO -- : linking static-library libruby-static.a I, [2024-05-03T00:49:30.512538 #1029333] INFO -- : linking shared-library libruby.so.3.4.0 I, [2024-05-03T00:49:32.069099 #1029333] INFO -- : linking ruby I, [2024-05-03T00:49:32.092851 #1029333] INFO -- : $$$[end] "make ruby -j20" exit with 0. I, [2024-05-03T00:49:32.093035 #1029333] INFO -- : $$$[beg] make all -j20 I, [2024-05-03T00:49:32.150053 #1029333] INFO -- : BASERUBY = /usr/bin/ruby --disable=gems I, [2024-05-03T00:49:32.150107 #1029333] INFO -- : CC = gcc I, [2024-05-03T00:49:32.150120 #1029333] INFO -- : LD = ld I, [2024-05-03T00:49:32.150132 #1029333] INFO -- : LDSHARED = gcc -shared I, [2024-05-03T00:49:32.150145 #1029333] INFO -- : CFLAGS = -O3 -fno-fast-math -ggdb3 -Wall -Wextra -Wdeprecated-declarations -Wdiv-by-zero -Wduplicated-cond -Wimplicit-function-declaration -Wimplicit-int -Wpointer-arith -Wwrite-strings -Wold-style-definition -Wimplicit-fallthrough=0 -Wmissing-noreturn -Wno-cast-function-type -Wno-constant-logical-operand -Wno-long-long -Wno-missing-field-initializers -Wno-overlength-strings -Wno-packed-bitfield-compat -Wno-parentheses-equality -Wno-self-assign -Wno-tautological-compare -Wno-unused-parameter -Wno-unused-value -Wsuggest-attribute=format -Wsuggest-attribute=noreturn -Wunused-variable -Wmisleading-indentation -Wundef -fPIC I, [2024-05-03T00:49:32.150157 #1029333] INFO -- : XCFLAGS = -U_FORTIFY_SOURCE -D_FORTIFY_SOURCE=2 -fstack-protector-strong -fno-strict-overflow -fvisibility=hidden -fexcess-precision=standard -DRUBY_EXPORT -I. -I.ext/include/x86_64-linux -I/tmp/ruby/src/trunk/include -I/tmp/ruby/src/trunk -I/tmp/ruby/src/trunk/prism -I/tmp/ruby/src/trunk/enc/unicode/15.0.0 I, [2024-05-03T00:49:32.150168 #1029333] INFO -- : CPPFLAGS = I, [2024-05-03T00:49:32.150178 #1029333] INFO -- : DLDFLAGS = -Wl,--compress-debug-sections=zlib -Wl,-soname,libruby.so.3.4 -fstack-protector-strong I, [2024-05-03T00:49:32.150189 #1029333] INFO -- : SOLIBS = -lz -lrt -lrt -lgmp -ldl -lcrypt -lm -lpthread I, [2024-05-03T00:49:32.150198 #1029333] INFO -- : LANG = en_US.UTF-8 I, [2024-05-03T00:49:32.150208 #1029333] INFO -- : LC_ALL = I, [2024-05-03T00:49:32.150218 #1029333] INFO -- : LC_CTYPE = I, [2024-05-03T00:49:32.150228 #1029333] INFO -- : MFLAGS = -j20 --jobserver-auth=4,5 I, [2024-05-03T00:49:32.150238 #1029333] INFO -- : RUSTC = no I, [2024-05-03T00:49:32.150250 #1029333] INFO -- : YJIT_RUSTC_ARGS = --crate-name=yjit --crate-type=staticlib --edition=2021 -g -C lto=thin -C opt-level=3 -C overflow-checks=on '--out-dir=/tmp/ruby/build/trunk/yjit/target/release/' /tmp/ruby/src/trunk/yjit/src/lib.rs I, [2024-05-03T00:49:32.151466 #1029333] INFO -- : gcc (Ubuntu 11.4.0-1ubuntu1~22.04) 11.4.0 I, [2024-05-03T00:49:32.151510 #1029333] INFO -- : Copyright (C) 2021 Free Software Foundation, Inc. I, [2024-05-03T00:49:32.151523 #1029333] INFO -- : This is free software; see the source for copying conditions. There is NO I, [2024-05-03T00:49:32.151534 #1029333] INFO -- : warranty; not even for MERCHANTABILITY or FITNESS FOR A PARTICULAR PURPOSE. I, [2024-05-03T00:49:32.151545 #1029333] INFO -- : I, [2024-05-03T00:49:32.179231 #1029333] INFO -- : generating enc.mk I, [2024-05-03T00:49:32.181062 #1029333] INFO -- : building spec/ruby/optional/capi/ext/array_spec.so I, [2024-05-03T00:49:32.181420 #1029333] INFO -- : building spec/ruby/optional/capi/ext/basic_object_spec.so I, [2024-05-03T00:49:32.182285 #1029333] INFO -- : building spec/ruby/optional/capi/ext/bignum_spec.so I, [2024-05-03T00:49:32.182892 #1029333] INFO -- : building spec/ruby/optional/capi/ext/binding_spec.so I, [2024-05-03T00:49:32.183188 #1029333] INFO -- : building spec/ruby/optional/capi/ext/boolean_spec.so I, [2024-05-03T00:49:32.184275 #1029333] INFO -- : building spec/ruby/optional/capi/ext/class_id_under_autoload_spec.so I, [2024-05-03T00:49:32.185465 #1029333] INFO -- : building spec/ruby/optional/capi/ext/class_spec.so I, [2024-05-03T00:49:32.185979 #1029333] INFO -- : building spec/ruby/optional/capi/ext/class_under_autoload_spec.so I, [2024-05-03T00:49:32.186663 #1029333] INFO -- : building spec/ruby/optional/capi/ext/complex_spec.so I, [2024-05-03T00:49:32.187478 #1029333] INFO -- : building spec/ruby/optional/capi/ext/constants_spec.so I, [2024-05-03T00:49:32.187815 #1029333] INFO -- : building spec/ruby/optional/capi/ext/data_spec.so I, [2024-05-03T00:49:32.188405 #1029333] INFO -- : building spec/ruby/optional/capi/ext/debug_spec.so I, [2024-05-03T00:49:32.188654 #1029333] INFO -- : building spec/ruby/optional/capi/ext/encoding_spec.so I, [2024-05-03T00:49:32.189421 #1029333] INFO -- : building spec/ruby/optional/capi/ext/enumerator_spec.so I, [2024-05-03T00:49:32.189649 #1029333] INFO -- : building spec/ruby/optional/capi/ext/exception_spec.so I, [2024-05-03T00:49:32.190522 #1029333] INFO -- : building spec/ruby/optional/capi/ext/fiber_spec.so I, [2024-05-03T00:49:32.191189 #1029333] INFO -- : building spec/ruby/optional/capi/ext/file_spec.so I, [2024-05-03T00:49:32.191722 #1029333] INFO -- : building spec/ruby/optional/capi/ext/fixnum_spec.so I, [2024-05-03T00:49:32.204633 #1029333] INFO -- : building spec/ruby/optional/capi/ext/float_spec.so I, [2024-05-03T00:49:32.315726 #1029333] INFO -- : building spec/ruby/optional/capi/ext/gc_spec.so I, [2024-05-03T00:49:32.331006 #1029333] INFO -- : building spec/ruby/optional/capi/ext/globals_spec.so I, [2024-05-03T00:49:32.331456 #1029333] INFO -- : building spec/ruby/optional/capi/ext/hash_spec.so I, [2024-05-03T00:49:32.341177 #1029333] INFO -- : building spec/ruby/optional/capi/ext/integer_spec.so I, [2024-05-03T00:49:32.353513 #1029333] INFO -- : building spec/ruby/optional/capi/ext/io_spec.so I, [2024-05-03T00:49:32.363331 #1029333] INFO -- : building spec/ruby/optional/capi/ext/kernel_spec.so I, [2024-05-03T00:49:32.363774 #1029333] INFO -- : building spec/ruby/optional/capi/ext/language_spec.so I, [2024-05-03T00:49:32.364050 #1029333] INFO -- : building spec/ruby/optional/capi/ext/marshal_spec.so I, [2024-05-03T00:49:32.364476 #1029333] INFO -- : building spec/ruby/optional/capi/ext/module_spec.so I, [2024-05-03T00:49:32.364819 #1029333] INFO -- : building spec/ruby/optional/capi/ext/module_under_autoload_spec.so I, [2024-05-03T00:49:32.366346 #1029333] INFO -- : building spec/ruby/optional/capi/ext/mutex_spec.so I, [2024-05-03T00:49:32.381754 #1029333] INFO -- : building spec/ruby/optional/capi/ext/numeric_spec.so I, [2024-05-03T00:49:32.382365 #1029333] INFO -- : building spec/ruby/optional/capi/ext/object_spec.so I, [2024-05-03T00:49:32.382824 #1029333] INFO -- : building spec/ruby/optional/capi/ext/proc_spec.so I, [2024-05-03T00:49:32.383223 #1029333] INFO -- : building spec/ruby/optional/capi/ext/range_spec.so I, [2024-05-03T00:49:32.435110 #1029333] INFO -- : building spec/ruby/optional/capi/ext/rational_spec.so I, [2024-05-03T00:49:32.437282 #1029333] INFO -- : building spec/ruby/optional/capi/ext/rbasic_spec.so I, [2024-05-03T00:49:32.497800 #1029333] INFO -- : building spec/ruby/optional/capi/ext/regexp_spec.so I, [2024-05-03T00:49:32.498499 #1029333] INFO -- : building spec/ruby/optional/capi/ext/string_spec.so I, [2024-05-03T00:49:32.509489 #1029333] INFO -- : building spec/ruby/optional/capi/ext/st_spec.so I, [2024-05-03T00:49:32.509551 #1029333] INFO -- : building spec/ruby/optional/capi/ext/struct_spec.so I, [2024-05-03T00:49:32.509819 #1029333] INFO -- : building spec/ruby/optional/capi/ext/symbol_spec.so I, [2024-05-03T00:49:32.514560 #1029333] INFO -- : building spec/ruby/optional/capi/ext/thread_spec.so I, [2024-05-03T00:49:32.517835 #1029333] INFO -- : building spec/ruby/optional/capi/ext/time_spec.so I, [2024-05-03T00:49:32.518073 #1029333] INFO -- : building spec/ruby/optional/capi/ext/tracepoint_spec.so I, [2024-05-03T00:49:32.542185 #1029333] INFO -- : building spec/ruby/optional/capi/ext/typed_data_spec.so I, [2024-05-03T00:49:32.543996 #1029333] INFO -- : building spec/ruby/optional/capi/ext/util_spec.so I, [2024-05-03T00:49:32.577819 #1029333] INFO -- : making enc I, [2024-05-03T00:49:32.578439 #1029333] INFO -- : making srcs under enc I, [2024-05-03T00:49:32.605091 #1029333] INFO -- : make[1]: Entering directory '/tmp/ruby/build/trunk' I, [2024-05-03T00:49:32.605206 #1029333] INFO -- : make[1]: Nothing to be done for 'enc'. I, [2024-05-03T00:49:32.605252 #1029333] INFO -- : make[1]: Leaving directory '/tmp/ruby/build/trunk' I, [2024-05-03T00:49:32.634303 #1029333] INFO -- : make[1]: Entering directory '/tmp/ruby/build/trunk' I, [2024-05-03T00:49:32.634364 #1029333] INFO -- : make[1]: Nothing to be done for 'srcs'. I, [2024-05-03T00:49:32.634381 #1029333] INFO -- : make[1]: Leaving directory '/tmp/ruby/build/trunk' I, [2024-05-03T00:49:32.635068 #1029333] INFO -- : generating transdb.h I, [2024-05-03T00:49:32.730450 #1029333] INFO -- : transdb.h unchanged I, [2024-05-03T00:49:32.731526 #1029333] INFO -- : generating makefiles ext/configure-ext.mk I, [2024-05-03T00:49:32.731580 #1029333] INFO -- : making trans I, [2024-05-03T00:49:32.757898 #1029333] INFO -- : ext/configure-ext.mk updated I, [2024-05-03T00:49:32.760463 #1029333] INFO -- : make[1]: Entering directory '/tmp/ruby/build/trunk' I, [2024-05-03T00:49:32.768371 #1029333] INFO -- : make[1]: Entering directory '/tmp/ruby/build/trunk' I, [2024-05-03T00:49:32.768446 #1029333] INFO -- : make[1]: Nothing to be done for 'trans'. I, [2024-05-03T00:49:32.768457 #1029333] INFO -- : make[1]: Leaving directory '/tmp/ruby/build/trunk' I, [2024-05-03T00:49:32.769219 #1029333] INFO -- : making encs I, [2024-05-03T00:49:32.860128 #1029333] INFO -- : make[1]: Entering directory '/tmp/ruby/build/trunk' I, [2024-05-03T00:49:32.860218 #1029333] INFO -- : make[1]: Nothing to be done for 'encs'. I, [2024-05-03T00:49:32.860259 #1029333] INFO -- : make[1]: Leaving directory '/tmp/ruby/build/trunk' I, [2024-05-03T00:49:32.922642 #1029333] INFO -- : make[1]: Leaving directory '/tmp/ruby/build/trunk' I, [2024-05-03T00:49:32.923318 #1029333] INFO -- : generating makefile exts.mk I, [2024-05-03T00:49:32.960260 #1029333] INFO -- : exts.mk unchanged I, [2024-05-03T00:49:32.964719 #1029333] INFO -- : make[1]: Entering directory '/tmp/ruby/build/trunk' I, [2024-05-03T00:49:32.986365 #1029333] INFO -- : make[2]: Entering directory '/tmp/ruby/build/trunk/ext/digest' I, [2024-05-03T00:49:32.986427 #1029333] INFO -- : make[2]: Entering directory '/tmp/ruby/build/trunk/ext/json' I, [2024-05-03T00:49:32.987462 #1029333] INFO -- : make[2]: Entering directory '/tmp/ruby/build/trunk/ext/coverage' I, [2024-05-03T00:49:32.988108 #1029333] INFO -- : make[2]: Entering directory '/tmp/ruby/build/trunk/ext/io/console' I, [2024-05-03T00:49:32.988639 #1029333] INFO -- : make[2]: Entering directory '/tmp/ruby/build/trunk/ext/date' I, [2024-05-03T00:49:32.988780 #1029333] INFO -- : make[2]: Entering directory '/tmp/ruby/build/trunk/ext/monitor' I, [2024-05-03T00:49:32.989934 #1029333] INFO -- : make[2]: Entering directory '/tmp/ruby/build/trunk/ext/pathname' I, [2024-05-03T00:49:32.990175 #1029333] INFO -- : make[2]: Entering directory '/tmp/ruby/build/trunk/ext/fiddle' I, [2024-05-03T00:49:32.990323 #1029333] INFO -- : make[2]: Leaving directory '/tmp/ruby/build/trunk/ext/io/console' I, [2024-05-03T00:49:32.990679 #1029333] INFO -- : make[2]: Leaving directory '/tmp/ruby/build/trunk/ext/coverage' I, [2024-05-03T00:49:32.991266 #1029333] INFO -- : make[2]: Entering directory '/tmp/ruby/build/trunk/ext/pty' I, [2024-05-03T00:49:32.991447 #1029333] INFO -- : make[2]: Leaving directory '/tmp/ruby/build/trunk/ext/digest' I, [2024-05-03T00:49:32.991494 #1029333] INFO -- : make[2]: Leaving directory '/tmp/ruby/build/trunk/ext/monitor' I, [2024-05-03T00:49:32.991699 #1029333] INFO -- : make[2]: Entering directory '/tmp/ruby/build/trunk/ext/objspace' I, [2024-05-03T00:49:32.992178 #1029333] INFO -- : make[2]: Leaving directory '/tmp/ruby/build/trunk/ext/pathname' I, [2024-05-03T00:49:32.992295 #1029333] INFO -- : make[2]: Leaving directory '/tmp/ruby/build/trunk/ext/date' I, [2024-05-03T00:49:32.992604 #1029333] INFO -- : make[2]: Entering directory '/tmp/ruby/build/trunk/ext/psych' I, [2024-05-03T00:49:32.993148 #1029333] INFO -- : make[2]: Entering directory '/tmp/ruby/build/trunk/ext/rubyvm' I, [2024-05-03T00:49:32.993881 #1029333] INFO -- : make[2]: Leaving directory '/tmp/ruby/build/trunk/ext/pty' I, [2024-05-03T00:49:32.994377 #1029333] INFO -- : make[2]: Entering directory '/tmp/ruby/build/trunk/.bundle/gems/bigdecimal-3.1.7/ext/bigdecimal' I, [2024-05-03T00:49:32.994579 #1029333] INFO -- : make[2]: Entering directory '/tmp/ruby/build/trunk/.bundle/gems/debug-1.9.2/ext/debug' I, [2024-05-03T00:49:32.994600 #1029333] INFO -- : make[2]: Entering directory '/tmp/ruby/build/trunk/.bundle/gems/nkf-0.2.0/ext/nkf' I, [2024-05-03T00:49:32.994778 #1029333] INFO -- : make[2]: Leaving directory '/tmp/ruby/build/trunk/ext/objspace' I, [2024-05-03T00:49:32.994792 #1029333] INFO -- : make[2]: Entering directory '/tmp/ruby/build/trunk/.bundle/gems/racc-1.7.3/ext/racc/cparse' I, [2024-05-03T00:49:32.994987 #1029333] INFO -- : make[2]: Leaving directory '/tmp/ruby/build/trunk/ext/json' I, [2024-05-03T00:49:32.995279 #1029333] INFO -- : make[2]: Leaving directory '/tmp/ruby/build/trunk/ext/rubyvm' I, [2024-05-03T00:49:32.995824 #1029333] INFO -- : make[2]: Entering directory '/tmp/ruby/build/trunk/ext/ripper' I, [2024-05-03T00:49:32.996332 #1029333] INFO -- : make[2]: Leaving directory '/tmp/ruby/build/trunk/ext/fiddle' I, [2024-05-03T00:49:32.996589 #1029333] INFO -- : make[2]: Entering directory '/tmp/ruby/build/trunk/.bundle/gems/rbs-3.4.4/ext/rbs_extension' I, [2024-05-03T00:49:32.998547 #1029333] INFO -- : make[2]: Entering directory '/tmp/ruby/build/trunk/.bundle/gems/syslog-0.1.2/ext/syslog' I, [2024-05-03T00:49:33.000072 #1029333] INFO -- : make[2]: Entering directory '/tmp/ruby/build/trunk/ext/openssl' I, [2024-05-03T00:49:33.001467 #1029333] INFO -- : make[2]: Leaving directory '/tmp/ruby/build/trunk/ext/ripper' I, [2024-05-03T00:49:33.001503 #1029333] INFO -- : make[2]: Entering directory '/tmp/ruby/build/trunk/ext/digest/sha2' I, [2024-05-03T00:49:33.002644 #1029333] INFO -- : make[2]: Entering directory '/tmp/ruby/build/trunk/ext/socket' I, [2024-05-03T00:49:33.004746 #1029333] INFO -- : make[2]: Leaving directory '/tmp/ruby/build/trunk/ext/digest/sha2' I, [2024-05-03T00:49:33.008451 #1029333] INFO -- : make[2]: Leaving directory '/tmp/ruby/build/trunk/ext/socket' I, [2024-05-03T00:49:33.011569 #1029333] INFO -- : make[2]: Leaving directory '/tmp/ruby/build/trunk/ext/psych' I, [2024-05-03T00:49:33.014998 #1029333] INFO -- : make[2]: Leaving directory '/tmp/ruby/build/trunk/ext/openssl' I, [2024-05-03T00:49:33.018519 #1029333] INFO -- : make[2]: Leaving directory '/tmp/ruby/build/trunk/.bundle/gems/debug-1.9.2/ext/debug' I, [2024-05-03T00:49:33.020386 #1029333] INFO -- : make[2]: Leaving directory '/tmp/ruby/build/trunk/.bundle/gems/syslog-0.1.2/ext/syslog' I, [2024-05-03T00:49:33.021585 #1029333] INFO -- : make[2]: Leaving directory '/tmp/ruby/build/trunk/.bundle/gems/racc-1.7.3/ext/racc/cparse' I, [2024-05-03T00:49:33.024814 #1029333] INFO -- : make[2]: Leaving directory '/tmp/ruby/build/trunk/.bundle/gems/bigdecimal-3.1.7/ext/bigdecimal' I, [2024-05-03T00:49:33.029228 #1029333] INFO -- : make[2]: Leaving directory '/tmp/ruby/build/trunk/.bundle/gems/rbs-3.4.4/ext/rbs_extension' I, [2024-05-03T00:49:33.030012 #1029333] INFO -- : make[2]: Leaving directory '/tmp/ruby/build/trunk/.bundle/gems/nkf-0.2.0/ext/nkf' I, [2024-05-03T00:49:33.054805 #1029333] INFO -- : make[2]: Entering directory '/tmp/ruby/build/trunk' I, [2024-05-03T00:49:33.121758 #1029333] INFO -- : linking ruby I, [2024-05-03T00:49:33.144510 #1029333] INFO -- : make[2]: Leaving directory '/tmp/ruby/build/trunk' I, [2024-05-03T00:49:33.144898 #1029333] INFO -- : make[1]: Leaving directory '/tmp/ruby/build/trunk' I, [2024-05-03T00:49:33.148479 #1029333] INFO -- : make[1]: Entering directory '/tmp/ruby/build/trunk' I, [2024-05-03T00:49:33.148501 #1029333] INFO -- : make[1]: Nothing to be done for 'note'. I, [2024-05-03T00:49:33.148508 #1029333] INFO -- : make[1]: Leaving directory '/tmp/ruby/build/trunk' I, [2024-05-03T00:49:33.149244 #1029333] INFO -- : $$$[end] "make all -j20" exit with 0. I, [2024-05-03T00:49:33.149465 #1029333] INFO -- : $$$[beg] make install -j20 I, [2024-05-03T00:49:33.212161 #1029333] INFO -- : Update minitest to ea9caafc0754b1d6236a490d59e624b53209734a I, [2024-05-03T00:49:33.212295 #1029333] INFO -- : Update power_assert to 84e85124c5014a139af39161d484156cfe87a9ed I, [2024-05-03T00:49:33.212469 #1029333] INFO -- : Update rbs to ba7872795d5de04adb8ff500c0e6afdc81a041dd I, [2024-05-03T00:49:33.213462 #1029333] INFO -- : Update typeprof to b19a6416da3a05d57fadd6ffdadb382b6d236ca5 I, [2024-05-03T00:49:33.214918 #1029333] INFO -- : echo ea9caafc0754b1d6236a490d59e624b53209734a | /bin/sh /tmp/ruby/src/trunk/tool/ifchange /tmp/ruby/src/trunk/.bundle/.timestamp/minitest.revision - I, [2024-05-03T00:49:33.215174 #1029333] INFO -- : echo 84e85124c5014a139af39161d484156cfe87a9ed | /bin/sh /tmp/ruby/src/trunk/tool/ifchange /tmp/ruby/src/trunk/.bundle/.timestamp/power_assert.revision - I, [2024-05-03T00:49:33.215457 #1029333] INFO -- : echo ba7872795d5de04adb8ff500c0e6afdc81a041dd | /bin/sh /tmp/ruby/src/trunk/tool/ifchange /tmp/ruby/src/trunk/.bundle/.timestamp/rbs.revision - I, [2024-05-03T00:49:33.216071 #1029333] INFO -- : BASERUBY = /usr/bin/ruby --disable=gems I, [2024-05-03T00:49:33.216098 #1029333] INFO -- : CC = gcc I, [2024-05-03T00:49:33.216113 #1029333] INFO -- : LD = ld I, [2024-05-03T00:49:33.216159 #1029333] INFO -- : LDSHARED = gcc -shared I, [2024-05-03T00:49:33.216171 #1029333] INFO -- : CFLAGS = -O3 -fno-fast-math -ggdb3 -Wall -Wextra -Wdeprecated-declarations -Wdiv-by-zero -Wduplicated-cond -Wimplicit-function-declaration -Wimplicit-int -Wpointer-arith -Wwrite-strings -Wold-style-definition -Wimplicit-fallthrough=0 -Wmissing-noreturn -Wno-cast-function-type -Wno-constant-logical-operand -Wno-long-long -Wno-missing-field-initializers -Wno-overlength-strings -Wno-packed-bitfield-compat -Wno-parentheses-equality -Wno-self-assign -Wno-tautological-compare -Wno-unused-parameter -Wno-unused-value -Wsuggest-attribute=format -Wsuggest-attribute=noreturn -Wunused-variable -Wmisleading-indentation -Wundef -fPIC I, [2024-05-03T00:49:33.216177 #1029333] INFO -- : XCFLAGS = -U_FORTIFY_SOURCE -D_FORTIFY_SOURCE=2 -fstack-protector-strong -fno-strict-overflow -fvisibility=hidden -fexcess-precision=standard -DRUBY_EXPORT -I. -I.ext/include/x86_64-linux -I/tmp/ruby/src/trunk/include -I/tmp/ruby/src/trunk -I/tmp/ruby/src/trunk/prism -I/tmp/ruby/src/trunk/enc/unicode/15.0.0 I, [2024-05-03T00:49:33.216182 #1029333] INFO -- : CPPFLAGS = I, [2024-05-03T00:49:33.216186 #1029333] INFO -- : DLDFLAGS = -Wl,--compress-debug-sections=zlib -Wl,-soname,libruby.so.3.4 -fstack-protector-strong I, [2024-05-03T00:49:33.216190 #1029333] INFO -- : SOLIBS = -lz -lrt -lrt -lgmp -ldl -lcrypt -lm -lpthread I, [2024-05-03T00:49:33.216194 #1029333] INFO -- : LANG = en_US.UTF-8 I, [2024-05-03T00:49:33.216197 #1029333] INFO -- : LC_ALL = I, [2024-05-03T00:49:33.216201 #1029333] INFO -- : LC_CTYPE = I, [2024-05-03T00:49:33.216205 #1029333] INFO -- : MFLAGS = -j20 --jobserver-auth=4,5 I, [2024-05-03T00:49:33.216210 #1029333] INFO -- : RUSTC = no I, [2024-05-03T00:49:33.216214 #1029333] INFO -- : YJIT_RUSTC_ARGS = --crate-name=yjit --crate-type=staticlib --edition=2021 -g -C lto=thin -C opt-level=3 -C overflow-checks=on '--out-dir=/tmp/ruby/build/trunk/yjit/target/release/' /tmp/ruby/src/trunk/yjit/src/lib.rs I, [2024-05-03T00:49:33.216966 #1029333] INFO -- : /tmp/ruby/src/trunk/.bundle/.timestamp/minitest.revision unchanged I, [2024-05-03T00:49:33.217075 #1029333] INFO -- : /tmp/ruby/src/trunk/.bundle/.timestamp/power_assert.revision unchanged I, [2024-05-03T00:49:33.217200 #1029333] INFO -- : /tmp/ruby/src/trunk/.bundle/.timestamp/rbs.revision unchanged I, [2024-05-03T00:49:33.246413 #1029333] INFO -- : echo b19a6416da3a05d57fadd6ffdadb382b6d236ca5 | /bin/sh /tmp/ruby/src/trunk/tool/ifchange /tmp/ruby/src/trunk/.bundle/.timestamp/typeprof.revision - I, [2024-05-03T00:49:33.247216 #1029333] INFO -- : generating enc.mk I, [2024-05-03T00:49:33.247250 #1029333] INFO -- : gcc (Ubuntu 11.4.0-1ubuntu1~22.04) 11.4.0 I, [2024-05-03T00:49:33.247262 #1029333] INFO -- : Copyright (C) 2021 Free Software Foundation, Inc. I, [2024-05-03T00:49:33.247274 #1029333] INFO -- : This is free software; see the source for copying conditions. There is NO I, [2024-05-03T00:49:33.247285 #1029333] INFO -- : warranty; not even for MERCHANTABILITY or FITNESS FOR A PARTICULAR PURPOSE. I, [2024-05-03T00:49:33.247303 #1029333] INFO -- : I, [2024-05-03T00:49:33.248301 #1029333] INFO -- : /tmp/ruby/src/trunk/.bundle/.timestamp/typeprof.revision unchanged I, [2024-05-03T00:49:33.369911 #1029333] INFO -- : Building power_assert@84e85124c5014a139af39161d484156cfe87a9ed to /tmp/ruby/src/trunk/gems/power_assert-2.0.3.gem I, [2024-05-03T00:49:33.370687 #1029333] INFO -- : making srcs under enc I, [2024-05-03T00:49:33.370744 #1029333] INFO -- : making enc I, [2024-05-03T00:49:33.387628 #1029333] INFO -- : make[1]: Entering directory '/tmp/ruby/build/trunk' I, [2024-05-03T00:49:33.387681 #1029333] INFO -- : make[1]: Nothing to be done for 'enc'. I, [2024-05-03T00:49:33.387695 #1029333] INFO -- : make[1]: Leaving directory '/tmp/ruby/build/trunk' I, [2024-05-03T00:49:33.400442 #1029333] INFO -- : make[1]: Entering directory '/tmp/ruby/build/trunk' I, [2024-05-03T00:49:33.400501 #1029333] INFO -- : make[1]: Nothing to be done for 'srcs'. I, [2024-05-03T00:49:33.400515 #1029333] INFO -- : make[1]: Leaving directory '/tmp/ruby/build/trunk' I, [2024-05-03T00:49:33.401097 #1029333] INFO -- : generating transdb.h I, [2024-05-03T00:49:33.438536 #1029333] INFO -- : Successfully built RubyGem I, [2024-05-03T00:49:33.438596 #1029333] INFO -- : Name: power_assert I, [2024-05-03T00:49:33.438610 #1029333] INFO -- : Version: 2.0.4dev I, [2024-05-03T00:49:33.438628 #1029333] INFO -- : File: power_assert-2.0.4dev.gem I, [2024-05-03T00:49:33.440781 #1029333] INFO -- : Extracting bundle gem power_assert-2.0.3... I, [2024-05-03T00:49:33.495004 #1029333] INFO -- : transdb.h unchanged I, [2024-05-03T00:49:33.496549 #1029333] INFO -- : generating makefiles ext/configure-ext.mk I, [2024-05-03T00:49:33.496611 #1029333] INFO -- : making trans I, [2024-05-03T00:49:33.502508 #1029333] INFO -- : Try with hash version of bundled gems instead of gems/power_assert-2.0.3.gem. We don't use this gem with release version of Ruby. I, [2024-05-03T00:49:33.507466 #1029333] INFO -- : Unpacked gems/power_assert-2.0.4dev.gem I, [2024-05-03T00:49:33.523622 #1029333] INFO -- : ext/configure-ext.mk unchanged I, [2024-05-03T00:49:33.526198 #1029333] INFO -- : make[1]: Entering directory '/tmp/ruby/build/trunk' I, [2024-05-03T00:49:33.531893 #1029333] INFO -- : make[1]: Entering directory '/tmp/ruby/build/trunk' I, [2024-05-03T00:49:33.531987 #1029333] INFO -- : make[1]: Nothing to be done for 'trans'. I, [2024-05-03T00:49:33.531997 #1029333] INFO -- : make[1]: Leaving directory '/tmp/ruby/build/trunk' I, [2024-05-03T00:49:33.532881 #1029333] INFO -- : making encs I, [2024-05-03T00:49:33.590463 #1029333] INFO -- : make[1]: Entering directory '/tmp/ruby/build/trunk' I, [2024-05-03T00:49:33.590538 #1029333] INFO -- : make[1]: Nothing to be done for 'encs'. I, [2024-05-03T00:49:33.590565 #1029333] INFO -- : make[1]: Leaving directory '/tmp/ruby/build/trunk' I, [2024-05-03T00:49:33.680744 #1029333] INFO -- : make[1]: Leaving directory '/tmp/ruby/build/trunk' I, [2024-05-03T00:49:33.681355 #1029333] INFO -- : generating makefile exts.mk I, [2024-05-03T00:49:33.718516 #1029333] INFO -- : exts.mk unchanged I, [2024-05-03T00:49:33.723235 #1029333] INFO -- : make[1]: Entering directory '/tmp/ruby/build/trunk' I, [2024-05-03T00:49:33.742590 #1029333] INFO -- : make[2]: Entering directory '/tmp/ruby/build/trunk/ext/digest' I, [2024-05-03T00:49:33.743999 #1029333] INFO -- : make[2]: Entering directory '/tmp/ruby/build/trunk/ext/json' I, [2024-05-03T00:49:33.744101 #1029333] INFO -- : make[2]: Entering directory '/tmp/ruby/build/trunk/ext/coverage' I, [2024-05-03T00:49:33.744849 #1029333] INFO -- : make[2]: Entering directory '/tmp/ruby/build/trunk/ext/io/console' I, [2024-05-03T00:49:33.745164 #1029333] INFO -- : make[2]: Entering directory '/tmp/ruby/build/trunk/ext/date' I, [2024-05-03T00:49:33.746213 #1029333] INFO -- : make[2]: Entering directory '/tmp/ruby/build/trunk/ext/monitor' I, [2024-05-03T00:49:33.746345 #1029333] INFO -- : make[2]: Leaving directory '/tmp/ruby/build/trunk/ext/coverage' I, [2024-05-03T00:49:33.746696 #1029333] INFO -- : make[2]: Leaving directory '/tmp/ruby/build/trunk/ext/io/console' I, [2024-05-03T00:49:33.746791 #1029333] INFO -- : make[2]: Entering directory '/tmp/ruby/build/trunk/ext/pathname' I, [2024-05-03T00:49:33.747145 #1029333] INFO -- : make[2]: Entering directory '/tmp/ruby/build/trunk/ext/fiddle' I, [2024-05-03T00:49:33.748460 #1029333] INFO -- : make[2]: Leaving directory '/tmp/ruby/build/trunk/ext/monitor' I, [2024-05-03T00:49:33.748486 #1029333] INFO -- : make[2]: Leaving directory '/tmp/ruby/build/trunk/ext/digest' I, [2024-05-03T00:49:33.748788 #1029333] INFO -- : make[2]: Entering directory '/tmp/ruby/build/trunk/ext/objspace' I, [2024-05-03T00:49:33.748820 #1029333] INFO -- : make[2]: Entering directory '/tmp/ruby/build/trunk/ext/rubyvm' I, [2024-05-03T00:49:33.748935 #1029333] INFO -- : make[2]: Leaving directory '/tmp/ruby/build/trunk/ext/date' I, [2024-05-03T00:49:33.749358 #1029333] INFO -- : make[2]: Leaving directory '/tmp/ruby/build/trunk/ext/pathname' I, [2024-05-03T00:49:33.749570 #1029333] INFO -- : make[2]: Leaving directory '/tmp/ruby/build/trunk/ext/json' I, [2024-05-03T00:49:33.750347 #1029333] INFO -- : make[2]: Entering directory '/tmp/ruby/build/trunk/ext/pty' I, [2024-05-03T00:49:33.750654 #1029333] INFO -- : make[2]: Leaving directory '/tmp/ruby/build/trunk/ext/rubyvm' I, [2024-05-03T00:49:33.752055 #1029333] INFO -- : make[2]: Entering directory '/tmp/ruby/build/trunk/.bundle/gems/nkf-0.2.0/ext/nkf' I, [2024-05-03T00:49:33.752249 #1029333] INFO -- : make[2]: Entering directory '/tmp/ruby/build/trunk/.bundle/gems/debug-1.9.2/ext/debug' I, [2024-05-03T00:49:33.752380 #1029333] INFO -- : make[2]: Entering directory '/tmp/ruby/build/trunk/ext/psych' I, [2024-05-03T00:49:33.752436 #1029333] INFO -- : make[2]: Entering directory '/tmp/ruby/build/trunk/.bundle/gems/racc-1.7.3/ext/racc/cparse' I, [2024-05-03T00:49:33.752482 #1029333] INFO -- : make[2]: Entering directory '/tmp/ruby/build/trunk/.bundle/gems/bigdecimal-3.1.7/ext/bigdecimal' I, [2024-05-03T00:49:33.752686 #1029333] INFO -- : make[2]: Entering directory '/tmp/ruby/build/trunk/.bundle/gems/syslog-0.1.2/ext/syslog' I, [2024-05-03T00:49:33.752944 #1029333] INFO -- : make[2]: Leaving directory '/tmp/ruby/build/trunk/ext/pty' I, [2024-05-03T00:49:33.752964 #1029333] INFO -- : make[2]: Leaving directory '/tmp/ruby/build/trunk/ext/objspace' I, [2024-05-03T00:49:33.753281 #1029333] INFO -- : make[2]: Entering directory '/tmp/ruby/build/trunk/.bundle/gems/rbs-3.4.4/ext/rbs_extension' I, [2024-05-03T00:49:33.754015 #1029333] INFO -- : make[2]: Leaving directory '/tmp/ruby/build/trunk/ext/fiddle' I, [2024-05-03T00:49:33.754164 #1029333] INFO -- : make[2]: Entering directory '/tmp/ruby/build/trunk/ext/ripper' I, [2024-05-03T00:49:33.757775 #1029333] INFO -- : make[2]: Entering directory '/tmp/ruby/build/trunk/ext/digest/sha2' I, [2024-05-03T00:49:33.758981 #1029333] INFO -- : make[2]: Entering directory '/tmp/ruby/build/trunk/ext/socket' I, [2024-05-03T00:49:33.759523 #1029333] INFO -- : make[2]: Leaving directory '/tmp/ruby/build/trunk/ext/ripper' I, [2024-05-03T00:49:33.759998 #1029333] INFO -- : make[2]: Leaving directory '/tmp/ruby/build/trunk/ext/digest/sha2' I, [2024-05-03T00:49:33.760478 #1029333] INFO -- : make[2]: Entering directory '/tmp/ruby/build/trunk/ext/openssl' I, [2024-05-03T00:49:33.767634 #1029333] INFO -- : make[2]: Leaving directory '/tmp/ruby/build/trunk/ext/socket' I, [2024-05-03T00:49:33.771532 #1029333] INFO -- : make[2]: Leaving directory '/tmp/ruby/build/trunk/ext/openssl' I, [2024-05-03T00:49:33.772005 #1029333] INFO -- : make[2]: Leaving directory '/tmp/ruby/build/trunk/ext/psych' I, [2024-05-03T00:49:33.775394 #1029333] INFO -- : make[2]: Leaving directory '/tmp/ruby/build/trunk/.bundle/gems/rbs-3.4.4/ext/rbs_extension' I, [2024-05-03T00:49:33.775445 #1029333] INFO -- : make[2]: Leaving directory '/tmp/ruby/build/trunk/.bundle/gems/nkf-0.2.0/ext/nkf' I, [2024-05-03T00:49:33.776597 #1029333] INFO -- : make[2]: Leaving directory '/tmp/ruby/build/trunk/.bundle/gems/racc-1.7.3/ext/racc/cparse' I, [2024-05-03T00:49:33.777696 #1029333] INFO -- : make[2]: Leaving directory '/tmp/ruby/build/trunk/.bundle/gems/syslog-0.1.2/ext/syslog' I, [2024-05-03T00:49:33.783266 #1029333] INFO -- : make[2]: Leaving directory '/tmp/ruby/build/trunk/.bundle/gems/debug-1.9.2/ext/debug' I, [2024-05-03T00:49:33.785798 #1029333] INFO -- : make[2]: Leaving directory '/tmp/ruby/build/trunk/.bundle/gems/bigdecimal-3.1.7/ext/bigdecimal' I, [2024-05-03T00:49:33.810891 #1029333] INFO -- : make[2]: Entering directory '/tmp/ruby/build/trunk' I, [2024-05-03T00:49:33.875214 #1029333] INFO -- : make[2]: 'ruby' is up to date. I, [2024-05-03T00:49:33.875293 #1029333] INFO -- : make[2]: Leaving directory '/tmp/ruby/build/trunk' I, [2024-05-03T00:49:33.875578 #1029333] INFO -- : make[1]: Leaving directory '/tmp/ruby/build/trunk' I, [2024-05-03T00:49:33.879348 #1029333] INFO -- : make[1]: Entering directory '/tmp/ruby/build/trunk' I, [2024-05-03T00:49:33.879413 #1029333] INFO -- : make[1]: Nothing to be done for 'note'. I, [2024-05-03T00:49:33.879433 #1029333] INFO -- : make[1]: Leaving directory '/tmp/ruby/build/trunk' I, [2024-05-03T00:49:33.879669 #1029333] INFO -- : ./miniruby -I/tmp/ruby/src/trunk/lib -I. -I.ext/common /tmp/ruby/src/trunk/tool/runruby.rb --extout=.ext -- --disable-gems -r./x86_64-linux-fake /tmp/ruby/src/trunk/tool/rbinstall.rb --make="make" --dest-dir="" --extout=".ext" --ext-build-dir="./ext" --mflags="-j20 --jobserver-auth=4,5" --make-flags=" -j20 --jobserver-auth=4,5" --data-mode=0644 --prog-mode=0755 --installed-list .installed.list --mantype="doc" --gnumake --install=all --exclude=doc I, [2024-05-03T00:49:33.975825 #1029333] INFO -- : Installing to I, [2024-05-03T00:49:33.975905 #1029333] INFO -- : installing binary commands: /tmp/ruby/install/trunk/bin I, [2024-05-03T00:49:33.975921 #1029333] INFO -- : installing base libraries: /tmp/ruby/install/trunk/lib I, [2024-05-03T00:49:33.983349 #1029333] INFO -- : installing arch files: /tmp/ruby/install/trunk/lib/ruby/3.4.0+0/x86_64-linux I, [2024-05-03T00:49:33.983410 #1029333] INFO -- : installing pkgconfig data: /tmp/ruby/install/trunk/lib/pkgconfig I, [2024-05-03T00:49:33.983424 #1029333] INFO -- : installing extension objects: /tmp/ruby/install/trunk/lib/ruby/3.4.0+0/x86_64-linux I, [2024-05-03T00:49:33.993024 #1029333] INFO -- : installing extension objects: /tmp/ruby/install/trunk/lib/ruby/site_ruby/3.4.0+0/x86_64-linux I, [2024-05-03T00:49:33.993092 #1029333] INFO -- : installing extension objects: /tmp/ruby/install/trunk/lib/ruby/vendor_ruby/3.4.0+0/x86_64-linux I, [2024-05-03T00:49:33.993107 #1029333] INFO -- : installing extension headers: /tmp/ruby/install/trunk/include/ruby-3.4.0+0/x86_64-linux I, [2024-05-03T00:49:33.993142 #1029333] INFO -- : installing extension scripts: /tmp/ruby/install/trunk/lib/ruby/3.4.0+0 I, [2024-05-03T00:49:33.996925 #1029333] INFO -- : installing extension scripts: /tmp/ruby/install/trunk/lib/ruby/site_ruby/3.4.0+0 I, [2024-05-03T00:49:33.996987 #1029333] INFO -- : installing extension scripts: /tmp/ruby/install/trunk/lib/ruby/vendor_ruby/3.4.0+0 I, [2024-05-03T00:49:33.997002 #1029333] INFO -- : installing extension headers: /tmp/ruby/install/trunk/include/ruby-3.4.0+0/ruby I, [2024-05-03T00:49:33.997019 #1029333] INFO -- : installing command scripts: /tmp/ruby/install/trunk/bin I, [2024-05-03T00:49:33.997033 #1029333] INFO -- : installing library scripts: /tmp/ruby/install/trunk/lib/ruby/3.4.0+0 I, [2024-05-03T00:49:34.031383 #1029333] INFO -- : installing common headers: /tmp/ruby/install/trunk/include/ruby-3.4.0+0 I, [2024-05-03T00:49:34.036880 #1029333] INFO -- : installing manpages: /tmp/ruby/install/trunk/share/man/man1 I, [2024-05-03T00:49:34.036947 #1029333] INFO -- : installing default gems from lib: /tmp/ruby/install/trunk/lib/ruby/gems/3.4.0+0 I, [2024-05-03T00:49:34.059675 #1029333] INFO -- : benchmark 0.3.0 I, [2024-05-03T00:49:34.066653 #1029333] INFO -- : bundler 2.6.0.dev I, [2024-05-03T00:49:34.068820 #1029333] INFO -- : cgi 0.4.1 I, [2024-05-03T00:49:34.069364 #1029333] INFO -- : delegate 0.3.1 I, [2024-05-03T00:49:34.069810 #1029333] INFO -- : did_you_mean 1.6.3 I, [2024-05-03T00:49:34.070350 #1029333] INFO -- : english 0.8.0 I, [2024-05-03T00:49:34.070795 #1029333] INFO -- : erb 4.0.4 I, [2024-05-03T00:49:34.071544 #1029333] INFO -- : error_highlight 0.6.0 I, [2024-05-03T00:49:34.071996 #1029333] INFO -- : fileutils 1.7.2 I, [2024-05-03T00:49:34.072418 #1029333] INFO -- : find 0.2.0 I, [2024-05-03T00:49:34.072845 #1029333] INFO -- : forwardable 1.3.3 I, [2024-05-03T00:49:34.073289 #1029333] INFO -- : ipaddr 1.2.6 I, [2024-05-03T00:49:34.073824 #1029333] INFO -- : irb 1.13.0 I, [2024-05-03T00:49:34.075329 #1029333] INFO -- : logger 1.6.0 I, [2024-05-03T00:49:34.075788 #1029333] INFO -- : net-http 0.4.1 I, [2024-05-03T00:49:34.076354 #1029333] INFO -- : net-protocol 0.2.2 I, [2024-05-03T00:49:34.076848 #1029333] INFO -- : open-uri 0.4.1 I, [2024-05-03T00:49:34.077368 #1029333] INFO -- : open3 0.2.1 I, [2024-05-03T00:49:34.077851 #1029333] INFO -- : optparse 0.5.0 I, [2024-05-03T00:49:34.078284 #1029333] INFO -- : ostruct 0.6.0 I, [2024-05-03T00:49:34.078766 #1029333] INFO -- : pp 0.5.0 I, [2024-05-03T00:49:34.079332 #1029333] INFO -- : prettyprint 0.2.0 I, [2024-05-03T00:49:34.079731 #1029333] INFO -- : prism 0.27.0 I, [2024-05-03T00:49:34.080303 #1029333] INFO -- : pstore 0.1.3 I, [2024-05-03T00:49:34.080759 #1029333] INFO -- : rdoc 6.6.3.1 I, [2024-05-03T00:49:34.082393 #1029333] INFO -- : readline 0.0.4 I, [2024-05-03T00:49:34.082903 #1029333] INFO -- : reline 0.5.5 I, [2024-05-03T00:49:34.083448 #1029333] INFO -- : resolv 0.4.0 I, [2024-05-03T00:49:34.083920 #1029333] INFO -- : ruby2_keywords 0.0.5 I, [2024-05-03T00:49:34.084383 #1029333] INFO -- : securerandom 0.3.1 I, [2024-05-03T00:49:34.085025 #1029333] INFO -- : set 1.1.0 I, [2024-05-03T00:49:34.085518 #1029333] INFO -- : shellwords 0.2.0 I, [2024-05-03T00:49:34.086055 #1029333] INFO -- : singleton 0.2.0 I, [2024-05-03T00:49:34.086515 #1029333] INFO -- : syntax_suggest 2.0.0 I, [2024-05-03T00:49:34.087233 #1029333] INFO -- : tempfile 0.2.1 I, [2024-05-03T00:49:34.087719 #1029333] INFO -- : time 0.3.0 I, [2024-05-03T00:49:34.088248 #1029333] INFO -- : timeout 0.4.1 I, [2024-05-03T00:49:34.089269 #1029333] INFO -- : tmpdir 0.2.0 I, [2024-05-03T00:49:34.089742 #1029333] INFO -- : tsort 0.2.0 I, [2024-05-03T00:49:34.090310 #1029333] INFO -- : un 0.3.0 I, [2024-05-03T00:49:34.090783 #1029333] INFO -- : uri 0.13.0 I, [2024-05-03T00:49:34.091274 #1029333] INFO -- : weakref 0.1.3 I, [2024-05-03T00:49:34.091897 #1029333] INFO -- : yaml 0.3.0 I, [2024-05-03T00:49:34.092049 #1029333] INFO -- : installing default gems from ext: /tmp/ruby/install/trunk/lib/ruby/gems/3.4.0+0 I, [2024-05-03T00:49:34.099039 #1029333] INFO -- : date 3.3.4 I, [2024-05-03T00:49:34.099587 #1029333] INFO -- : digest 3.1.1 I, [2024-05-03T00:49:34.100066 #1029333] INFO -- : etc 1.4.3 I, [2024-05-03T00:49:34.100575 #1029333] INFO -- : fcntl 1.1.0 I, [2024-05-03T00:49:34.101053 #1029333] INFO -- : fiddle 1.1.3 I, [2024-05-03T00:49:34.101558 #1029333] INFO -- : io-console 0.7.2 I, [2024-05-03T00:49:34.102042 #1029333] INFO -- : io-nonblock 0.3.0 I, [2024-05-03T00:49:34.102455 #1029333] INFO -- : io-wait 0.3.1 I, [2024-05-03T00:49:34.102900 #1029333] INFO -- : json 2.7.2 I, [2024-05-03T00:49:34.103973 #1029333] INFO -- : openssl 3.2.0 I, [2024-05-03T00:49:34.104690 #1029333] INFO -- : pathname 0.3.0 I, [2024-05-03T00:49:34.105207 #1029333] INFO -- : psych 5.1.2 I, [2024-05-03T00:49:34.105768 #1029333] INFO -- : stringio 3.1.1 I, [2024-05-03T00:49:34.106278 #1029333] INFO -- : strscan 3.1.1 I, [2024-05-03T00:49:34.106744 #1029333] INFO -- : zlib 3.1.0 I, [2024-05-03T00:49:34.107202 #1029333] INFO -- : installing bundled gems: /tmp/ruby/install/trunk/lib/ruby/gems/3.4.0+0 I, [2024-05-03T00:49:34.107414 #1029333] INFO -- : minitest 5.22.3 I, [2024-05-03T00:49:34.115054 #1029333] INFO -- : rake 13.2.1 I, [2024-05-03T00:49:34.118556 #1029333] INFO -- : test-unit 3.6.2 I, [2024-05-03T00:49:34.123084 #1029333] INFO -- : rexml 3.2.6 I, [2024-05-03T00:49:34.126507 #1029333] INFO -- : rss 0.3.0 I, [2024-05-03T00:49:34.129597 #1029333] INFO -- : net-ftp 0.3.4 I, [2024-05-03T00:49:34.131075 #1029333] INFO -- : net-imap 0.4.10 I, [2024-05-03T00:49:34.133987 #1029333] INFO -- : net-pop 0.1.2 I, [2024-05-03T00:49:34.134893 #1029333] INFO -- : net-smtp 0.5.0 I, [2024-05-03T00:49:34.135976 #1029333] INFO -- : matrix 0.4.2 I, [2024-05-03T00:49:34.139639 #1029333] INFO -- : prime 0.1.2 I, [2024-05-03T00:49:34.145248 #1029333] INFO -- : rbs 3.4.4 I, [2024-05-03T00:49:34.167804 #1029333] INFO -- : typeprof 0.21.11 I, [2024-05-03T00:49:34.170906 #1029333] INFO -- : debug 1.9.2 I, [2024-05-03T00:49:34.173615 #1029333] INFO -- : racc 1.7.3 I, [2024-05-03T00:49:34.176126 #1029333] INFO -- : mutex_m 0.2.0 I, [2024-05-03T00:49:34.177554 #1029333] INFO -- : getoptlong 0.2.1 I, [2024-05-03T00:49:34.178840 #1029333] INFO -- : base64 0.2.0 I, [2024-05-03T00:49:34.179865 #1029333] INFO -- : bigdecimal 3.1.7 I, [2024-05-03T00:49:34.181805 #1029333] INFO -- : observer 0.1.2 I, [2024-05-03T00:49:34.182894 #1029333] INFO -- : abbrev 0.1.2 I, [2024-05-03T00:49:34.184539 #1029333] INFO -- : resolv-replace 0.1.1 I, [2024-05-03T00:49:34.185703 #1029333] INFO -- : rinda 0.2.0 I, [2024-05-03T00:49:34.187140 #1029333] INFO -- : drb 2.2.1 I, [2024-05-03T00:49:34.188670 #1029333] INFO -- : nkf 0.2.0 I, [2024-05-03T00:49:34.191111 #1029333] INFO -- : syslog 0.1.2 I, [2024-05-03T00:49:34.192841 #1029333] INFO -- : csv 3.3.0 I, [2024-05-03T00:49:34.194960 #1029333] INFO -- : installing bundled gem cache: /tmp/ruby/install/trunk/lib/ruby/gems/3.4.0+0/cache I, [2024-05-03T00:49:34.196364 #1029333] INFO -- : skipped bundled gems: I, [2024-05-03T00:49:34.196430 #1029333] INFO -- : power_assert-2.0.4dev.gem not found in bundled_gems I, [2024-05-03T00:49:34.199596 #1029333] INFO -- : $$$[end] "make install -j20" exit with 0. I, [2024-05-03T00:49:34.199810 #1029333] INFO -- : $$$[beg] make yes-btest TESTOPTS='-q -j20' I, [2024-05-03T00:49:39.525501 #1029333] INFO -- : PASS all 1935 tests E, [2024-05-03T00:49:39.532330 #1029333] ERROR -- : I, [2024-05-03T00:49:39.532633 #1029333] INFO -- : $$$[end] "make yes-btest TESTOPTS='-q -j20'" exit with 0. I, [2024-05-03T00:49:39.532727 #1029333] INFO -- : $$$[beg] make yes-test-basic TESTS='-j20' I, [2024-05-03T00:49:39.593792 #1029333] INFO -- : BASERUBY = /usr/bin/ruby --disable=gems I, [2024-05-03T00:49:39.593835 #1029333] INFO -- : CC = gcc I, [2024-05-03T00:49:39.593850 #1029333] INFO -- : LD = ld I, [2024-05-03T00:49:39.593862 #1029333] INFO -- : LDSHARED = gcc -shared I, [2024-05-03T00:49:39.593875 #1029333] INFO -- : CFLAGS = -O3 -fno-fast-math -ggdb3 -Wall -Wextra -Wdeprecated-declarations -Wdiv-by-zero -Wduplicated-cond -Wimplicit-function-declaration -Wimplicit-int -Wpointer-arith -Wwrite-strings -Wold-style-definition -Wimplicit-fallthrough=0 -Wmissing-noreturn -Wno-cast-function-type -Wno-constant-logical-operand -Wno-long-long -Wno-missing-field-initializers -Wno-overlength-strings -Wno-packed-bitfield-compat -Wno-parentheses-equality -Wno-self-assign -Wno-tautological-compare -Wno-unused-parameter -Wno-unused-value -Wsuggest-attribute=format -Wsuggest-attribute=noreturn -Wunused-variable -Wmisleading-indentation -Wundef -fPIC I, [2024-05-03T00:49:39.593889 #1029333] INFO -- : XCFLAGS = -U_FORTIFY_SOURCE -D_FORTIFY_SOURCE=2 -fstack-protector-strong -fno-strict-overflow -fvisibility=hidden -fexcess-precision=standard -DRUBY_EXPORT -I. -I.ext/include/x86_64-linux -I/tmp/ruby/src/trunk/include -I/tmp/ruby/src/trunk -I/tmp/ruby/src/trunk/prism -I/tmp/ruby/src/trunk/enc/unicode/15.0.0 I, [2024-05-03T00:49:39.593907 #1029333] INFO -- : CPPFLAGS = I, [2024-05-03T00:49:39.593920 #1029333] INFO -- : DLDFLAGS = -Wl,--compress-debug-sections=zlib -Wl,-soname,libruby.so.3.4 -fstack-protector-strong I, [2024-05-03T00:49:39.593933 #1029333] INFO -- : SOLIBS = -lz -lrt -lrt -lgmp -ldl -lcrypt -lm -lpthread I, [2024-05-03T00:49:39.593945 #1029333] INFO -- : LANG = en_US.UTF-8 I, [2024-05-03T00:49:39.593956 #1029333] INFO -- : LC_ALL = I, [2024-05-03T00:49:39.593968 #1029333] INFO -- : LC_CTYPE = I, [2024-05-03T00:49:39.593980 #1029333] INFO -- : MFLAGS = I, [2024-05-03T00:49:39.593992 #1029333] INFO -- : RUSTC = no I, [2024-05-03T00:49:39.594004 #1029333] INFO -- : YJIT_RUSTC_ARGS = --crate-name=yjit --crate-type=staticlib --edition=2021 -g -C lto=thin -C opt-level=3 -C overflow-checks=on '--out-dir=/tmp/ruby/build/trunk/yjit/target/release/' /tmp/ruby/src/trunk/yjit/src/lib.rs I, [2024-05-03T00:49:39.594451 #1029333] INFO -- : gcc (Ubuntu 11.4.0-1ubuntu1~22.04) 11.4.0 I, [2024-05-03T00:49:39.594493 #1029333] INFO -- : Copyright (C) 2021 Free Software Foundation, Inc. I, [2024-05-03T00:49:39.594509 #1029333] INFO -- : This is free software; see the source for copying conditions. There is NO I, [2024-05-03T00:49:39.594532 #1029333] INFO -- : warranty; not even for MERCHANTABILITY or FITNESS FOR A PARTICULAR PURPOSE. I, [2024-05-03T00:49:39.594545 #1029333] INFO -- : I, [2024-05-03T00:49:39.702828 #1029333] INFO -- : Checking leaked global symbols...none I, [2024-05-03T00:49:39.743781 #1029333] INFO -- : /tmp/ruby/src/trunk/basictest/test.rb:assignment ....................................................................................................................................................................................................................................................................................................................................................................................OK 372 I, [2024-05-03T00:49:39.743870 #1029333] INFO -- : /tmp/ruby/src/trunk/basictest/test.rb:condition ..OK 2 I, [2024-05-03T00:49:39.743900 #1029333] INFO -- : /tmp/ruby/src/trunk/basictest/test.rb:if/unless ...OK 3 I, [2024-05-03T00:49:39.743916 #1029333] INFO -- : /tmp/ruby/src/trunk/basictest/test.rb:case .....OK 5 I, [2024-05-03T00:49:39.744032 #1029333] INFO -- : /tmp/ruby/src/trunk/basictest/test.rb:while/until ........OK 8 I, [2024-05-03T00:49:39.744082 #1029333] INFO -- : /tmp/ruby/src/trunk/basictest/test.rb:exception ..........OK 10 I, [2024-05-03T00:49:39.744410 #1029333] INFO -- : /tmp/ruby/src/trunk/basictest/test.rb:array .......................................OK 39 I, [2024-05-03T00:49:39.744512 #1029333] INFO -- : /tmp/ruby/src/trunk/basictest/test.rb:hash ...........................OK 27 I, [2024-05-03T00:49:39.745268 #1029333] INFO -- : /tmp/ruby/src/trunk/basictest/test.rb:iterator ...........................................................................................................OK 107 I, [2024-05-03T00:49:39.745553 #1029333] INFO -- : /tmp/ruby/src/trunk/basictest/test.rb:float ................................................................................OK 80 I, [2024-05-03T00:49:39.746609 #1029333] INFO -- : /tmp/ruby/src/trunk/basictest/test.rb:bignum ...............................OK 31 I, [2024-05-03T00:49:39.747409 #1029333] INFO -- : /tmp/ruby/src/trunk/basictest/test.rb:string & char ..............................................................OK 62 I, [2024-05-03T00:49:39.747429 #1029333] INFO -- : /tmp/ruby/src/trunk/basictest/test.rb:assignment ..........OK 10 I, [2024-05-03T00:49:39.747443 #1029333] INFO -- : /tmp/ruby/src/trunk/basictest/test.rb:call ......OK 6 I, [2024-05-03T00:49:39.747495 #1029333] INFO -- : /tmp/ruby/src/trunk/basictest/test.rb:proc .........OK 9 I, [2024-05-03T00:49:39.847844 #1029333] INFO -- : /tmp/ruby/src/trunk/basictest/test.rb:signal ..OK 2 I, [2024-05-03T00:49:39.848356 #1029333] INFO -- : /tmp/ruby/src/trunk/basictest/test.rb:eval ...........................OK 27 I, [2024-05-03T00:49:39.948580 #1029333] INFO -- : /tmp/ruby/src/trunk/basictest/test.rb:system ........OK 8 I, [2024-05-03T00:49:39.948673 #1029333] INFO -- : /tmp/ruby/src/trunk/basictest/test.rb:const .....OK 5 I, [2024-05-03T00:49:39.948692 #1029333] INFO -- : /tmp/ruby/src/trunk/basictest/test.rb:clone .....OK 5 I, [2024-05-03T00:49:39.948707 #1029333] INFO -- : /tmp/ruby/src/trunk/basictest/test.rb:marshal ....OK 4 I, [2024-05-03T00:49:39.948750 #1029333] INFO -- : /tmp/ruby/src/trunk/basictest/test.rb:pack ....OK 4 I, [2024-05-03T00:49:39.948766 #1029333] INFO -- : /tmp/ruby/src/trunk/basictest/test.rb:math ..OK 2 I, [2024-05-03T00:49:39.948850 #1029333] INFO -- : /tmp/ruby/src/trunk/basictest/test.rb:struct ......OK 6 I, [2024-05-03T00:49:39.948960 #1029333] INFO -- : /tmp/ruby/src/trunk/basictest/test.rb:variable ............OK 12 I, [2024-05-03T00:49:39.948986 #1029333] INFO -- : /tmp/ruby/src/trunk/basictest/test.rb:trace ...OK 3 I, [2024-05-03T00:49:39.949004 #1029333] INFO -- : /tmp/ruby/src/trunk/basictest/test.rb:defined? ............OK 12 I, [2024-05-03T00:49:39.949036 #1029333] INFO -- : /tmp/ruby/src/trunk/basictest/test.rb:alias ......OK 6 I, [2024-05-03T00:49:39.949404 #1029333] INFO -- : /tmp/ruby/src/trunk/basictest/test.rb:path .......................OK 23 I, [2024-05-03T00:49:39.982996 #1029333] INFO -- : /tmp/ruby/src/trunk/basictest/test.rb:gc ....OK 4 I, [2024-05-03T00:49:39.985417 #1029333] INFO -- : I, [2024-05-03T00:49:39.985498 #1029333] INFO -- : test succeeded I, [2024-05-03T00:49:39.986981 #1029333] INFO -- : $$$[end] "make yes-test-basic TESTS='-j20'" exit with 0. I, [2024-05-03T00:49:39.987098 #1029333] INFO -- : $$$[beg] make yes-test-all TESTOPTS='--stderr-on-failure' TESTS='-j20' I, [2024-05-03T00:49:40.072234 #1029333] INFO -- : BASERUBY = /usr/bin/ruby --disable=gems I, [2024-05-03T00:49:40.072271 #1029333] INFO -- : CC = gcc I, [2024-05-03T00:49:40.072277 #1029333] INFO -- : LD = ld I, [2024-05-03T00:49:40.072281 #1029333] INFO -- : LDSHARED = gcc -shared I, [2024-05-03T00:49:40.072285 #1029333] INFO -- : CFLAGS = -O3 -fno-fast-math -ggdb3 -Wall -Wextra -Wdeprecated-declarations -Wdiv-by-zero -Wduplicated-cond -Wimplicit-function-declaration -Wimplicit-int -Wpointer-arith -Wwrite-strings -Wold-style-definition -Wimplicit-fallthrough=0 -Wmissing-noreturn -Wno-cast-function-type -Wno-constant-logical-operand -Wno-long-long -Wno-missing-field-initializers -Wno-overlength-strings -Wno-packed-bitfield-compat -Wno-parentheses-equality -Wno-self-assign -Wno-tautological-compare -Wno-unused-parameter -Wno-unused-value -Wsuggest-attribute=format -Wsuggest-attribute=noreturn -Wunused-variable -Wmisleading-indentation -Wundef -fPIC I, [2024-05-03T00:49:40.072289 #1029333] INFO -- : XCFLAGS = -U_FORTIFY_SOURCE -D_FORTIFY_SOURCE=2 -fstack-protector-strong -fno-strict-overflow -fvisibility=hidden -fexcess-precision=standard -DRUBY_EXPORT -I. -I.ext/include/x86_64-linux -I/tmp/ruby/src/trunk/include -I/tmp/ruby/src/trunk -I/tmp/ruby/src/trunk/prism -I/tmp/ruby/src/trunk/enc/unicode/15.0.0 I, [2024-05-03T00:49:40.072293 #1029333] INFO -- : CPPFLAGS = I, [2024-05-03T00:49:40.072297 #1029333] INFO -- : DLDFLAGS = -Wl,--compress-debug-sections=zlib -Wl,-soname,libruby.so.3.4 -fstack-protector-strong I, [2024-05-03T00:49:40.072302 #1029333] INFO -- : SOLIBS = -lz -lrt -lrt -lgmp -ldl -lcrypt -lm -lpthread I, [2024-05-03T00:49:40.072306 #1029333] INFO -- : LANG = en_US.UTF-8 I, [2024-05-03T00:49:40.072310 #1029333] INFO -- : LC_ALL = I, [2024-05-03T00:49:40.072314 #1029333] INFO -- : LC_CTYPE = I, [2024-05-03T00:49:40.072317 #1029333] INFO -- : MFLAGS = I, [2024-05-03T00:49:40.072320 #1029333] INFO -- : RUSTC = no I, [2024-05-03T00:49:40.072324 #1029333] INFO -- : YJIT_RUSTC_ARGS = --crate-name=yjit --crate-type=staticlib --edition=2021 -g -C lto=thin -C opt-level=3 -C overflow-checks=on '--out-dir=/tmp/ruby/build/trunk/yjit/target/release/' /tmp/ruby/src/trunk/yjit/src/lib.rs I, [2024-05-03T00:49:40.072871 #1029333] INFO -- : gcc (Ubuntu 11.4.0-1ubuntu1~22.04) 11.4.0 I, [2024-05-03T00:49:40.072891 #1029333] INFO -- : Copyright (C) 2021 Free Software Foundation, Inc. I, [2024-05-03T00:49:40.072897 #1029333] INFO -- : This is free software; see the source for copying conditions. There is NO I, [2024-05-03T00:49:40.072901 #1029333] INFO -- : warranty; not even for MERCHANTABILITY or FITNESS FOR A PARTICULAR PURPOSE. I, [2024-05-03T00:49:40.072905 #1029333] INFO -- : I, [2024-05-03T00:49:40.074649 #1029333] INFO -- : generating enc.mk I, [2024-05-03T00:49:40.193828 #1029333] INFO -- : making enc I, [2024-05-03T00:49:40.211005 #1029333] INFO -- : make[1]: Entering directory '/tmp/ruby/build/trunk' I, [2024-05-03T00:49:40.211028 #1029333] INFO -- : make[1]: Nothing to be done for 'enc'. I, [2024-05-03T00:49:40.211034 #1029333] INFO -- : make[1]: Leaving directory '/tmp/ruby/build/trunk' I, [2024-05-03T00:49:40.211722 #1029333] INFO -- : making srcs under enc I, [2024-05-03T00:49:40.241156 #1029333] INFO -- : make[1]: Entering directory '/tmp/ruby/build/trunk' I, [2024-05-03T00:49:40.241178 #1029333] INFO -- : make[1]: Nothing to be done for 'srcs'. I, [2024-05-03T00:49:40.241183 #1029333] INFO -- : make[1]: Leaving directory '/tmp/ruby/build/trunk' I, [2024-05-03T00:49:40.242081 #1029333] INFO -- : generating transdb.h I, [2024-05-03T00:49:40.336889 #1029333] INFO -- : transdb.h unchanged I, [2024-05-03T00:49:40.338148 #1029333] INFO -- : making trans I, [2024-05-03T00:49:40.372229 #1029333] INFO -- : make[1]: Entering directory '/tmp/ruby/build/trunk' I, [2024-05-03T00:49:40.372250 #1029333] INFO -- : make[1]: Nothing to be done for 'trans'. I, [2024-05-03T00:49:40.372256 #1029333] INFO -- : make[1]: Leaving directory '/tmp/ruby/build/trunk' I, [2024-05-03T00:49:40.372883 #1029333] INFO -- : making encs I, [2024-05-03T00:49:40.410645 #1029333] INFO -- : make[1]: Entering directory '/tmp/ruby/build/trunk' I, [2024-05-03T00:49:40.410666 #1029333] INFO -- : make[1]: Nothing to be done for 'encs'. I, [2024-05-03T00:49:40.410672 #1029333] INFO -- : make[1]: Leaving directory '/tmp/ruby/build/trunk' I, [2024-05-03T00:49:40.412364 #1029333] INFO -- : generating makefiles ext/configure-ext.mk I, [2024-05-03T00:49:40.439341 #1029333] INFO -- : ext/configure-ext.mk updated I, [2024-05-03T00:49:40.441778 #1029333] INFO -- : make[1]: Entering directory '/tmp/ruby/build/trunk' I, [2024-05-03T00:49:41.798332 #1029333] INFO -- : make[1]: Leaving directory '/tmp/ruby/build/trunk' I, [2024-05-03T00:49:41.798925 #1029333] INFO -- : generating makefile exts.mk I, [2024-05-03T00:49:41.834889 #1029333] INFO -- : exts.mk unchanged I, [2024-05-03T00:49:41.839157 #1029333] INFO -- : make[1]: Entering directory '/tmp/ruby/build/trunk' I, [2024-05-03T00:49:42.048826 #1029333] INFO -- : make[2]: Entering directory '/tmp/ruby/build/trunk/ext/coverage' I, [2024-05-03T00:49:42.051666 #1029333] INFO -- : make[2]: Leaving directory '/tmp/ruby/build/trunk/ext/coverage' I, [2024-05-03T00:49:42.055632 #1029333] INFO -- : make[2]: Entering directory '/tmp/ruby/build/trunk/ext/date' I, [2024-05-03T00:49:42.058732 #1029333] INFO -- : make[2]: Leaving directory '/tmp/ruby/build/trunk/ext/date' I, [2024-05-03T00:49:42.061008 #1029333] INFO -- : make[2]: Entering directory '/tmp/ruby/build/trunk/ext/digest' I, [2024-05-03T00:49:42.066456 #1029333] INFO -- : make[2]: Leaving directory '/tmp/ruby/build/trunk/ext/digest' I, [2024-05-03T00:49:42.082120 #1029333] INFO -- : make[2]: Entering directory '/tmp/ruby/build/trunk/ext/digest/sha2' I, [2024-05-03T00:49:42.084945 #1029333] INFO -- : make[2]: Leaving directory '/tmp/ruby/build/trunk/ext/digest/sha2' I, [2024-05-03T00:49:42.097497 #1029333] INFO -- : make[2]: Entering directory '/tmp/ruby/build/trunk/ext/fiddle' I, [2024-05-03T00:49:42.103817 #1029333] INFO -- : make[2]: Leaving directory '/tmp/ruby/build/trunk/ext/fiddle' I, [2024-05-03T00:49:42.106736 #1029333] INFO -- : make[2]: Entering directory '/tmp/ruby/build/trunk/ext/io/console' I, [2024-05-03T00:49:42.109312 #1029333] INFO -- : make[2]: Leaving directory '/tmp/ruby/build/trunk/ext/io/console' I, [2024-05-03T00:49:42.116731 #1029333] INFO -- : make[2]: Entering directory '/tmp/ruby/build/trunk/ext/json' I, [2024-05-03T00:49:42.122928 #1029333] INFO -- : make[2]: Leaving directory '/tmp/ruby/build/trunk/ext/json' I, [2024-05-03T00:49:42.131876 #1029333] INFO -- : make[2]: Entering directory '/tmp/ruby/build/trunk/ext/monitor' I, [2024-05-03T00:49:42.134344 #1029333] INFO -- : make[2]: Leaving directory '/tmp/ruby/build/trunk/ext/monitor' I, [2024-05-03T00:49:42.138547 #1029333] INFO -- : make[2]: Entering directory '/tmp/ruby/build/trunk/ext/objspace' I, [2024-05-03T00:49:42.142192 #1029333] INFO -- : make[2]: Leaving directory '/tmp/ruby/build/trunk/ext/objspace' I, [2024-05-03T00:49:42.154115 #1029333] INFO -- : make[2]: Entering directory '/tmp/ruby/build/trunk/ext/openssl' I, [2024-05-03T00:49:42.167728 #1029333] INFO -- : make[2]: Leaving directory '/tmp/ruby/build/trunk/ext/openssl' I, [2024-05-03T00:49:42.170712 #1029333] INFO -- : make[2]: Entering directory '/tmp/ruby/build/trunk/ext/pathname' I, [2024-05-03T00:49:42.173252 #1029333] INFO -- : make[2]: Leaving directory '/tmp/ruby/build/trunk/ext/pathname' I, [2024-05-03T00:49:42.177434 #1029333] INFO -- : make[2]: Entering directory '/tmp/ruby/build/trunk/ext/psych' I, [2024-05-03T00:49:42.192246 #1029333] INFO -- : make[2]: Leaving directory '/tmp/ruby/build/trunk/ext/psych' I, [2024-05-03T00:49:42.195247 #1029333] INFO -- : make[2]: Entering directory '/tmp/ruby/build/trunk/ext/pty' I, [2024-05-03T00:49:42.197717 #1029333] INFO -- : make[2]: Leaving directory '/tmp/ruby/build/trunk/ext/pty' I, [2024-05-03T00:49:42.207138 #1029333] INFO -- : make[2]: Entering directory '/tmp/ruby/build/trunk/ext/ripper' I, [2024-05-03T00:49:42.212042 #1029333] INFO -- : make[2]: Leaving directory '/tmp/ruby/build/trunk/ext/ripper' I, [2024-05-03T00:49:42.213531 #1029333] INFO -- : make[2]: Entering directory '/tmp/ruby/build/trunk/ext/rubyvm' I, [2024-05-03T00:49:42.215543 #1029333] INFO -- : make[2]: Leaving directory '/tmp/ruby/build/trunk/ext/rubyvm' I, [2024-05-03T00:49:42.223424 #1029333] INFO -- : make[2]: Entering directory '/tmp/ruby/build/trunk/ext/socket' I, [2024-05-03T00:49:42.229773 #1029333] INFO -- : make[2]: Leaving directory '/tmp/ruby/build/trunk/ext/socket' I, [2024-05-03T00:49:42.240657 #1029333] INFO -- : make[2]: Entering directory '/tmp/ruby/build/trunk/.bundle/gems/bigdecimal-3.1.7/ext/bigdecimal' I, [2024-05-03T00:49:42.263186 #1029333] INFO -- : make[2]: Leaving directory '/tmp/ruby/build/trunk/.bundle/gems/bigdecimal-3.1.7/ext/bigdecimal' I, [2024-05-03T00:49:42.265056 #1029333] INFO -- : make[2]: Entering directory '/tmp/ruby/build/trunk/.bundle/gems/debug-1.9.2/ext/debug' I, [2024-05-03T00:49:42.286946 #1029333] INFO -- : make[2]: Leaving directory '/tmp/ruby/build/trunk/.bundle/gems/debug-1.9.2/ext/debug' I, [2024-05-03T00:49:42.289168 #1029333] INFO -- : make[2]: Entering directory '/tmp/ruby/build/trunk/.bundle/gems/nkf-0.2.0/ext/nkf' I, [2024-05-03T00:49:42.310495 #1029333] INFO -- : make[2]: Leaving directory '/tmp/ruby/build/trunk/.bundle/gems/nkf-0.2.0/ext/nkf' I, [2024-05-03T00:49:42.312325 #1029333] INFO -- : make[2]: Entering directory '/tmp/ruby/build/trunk/.bundle/gems/racc-1.7.3/ext/racc/cparse' I, [2024-05-03T00:49:42.333714 #1029333] INFO -- : make[2]: Leaving directory '/tmp/ruby/build/trunk/.bundle/gems/racc-1.7.3/ext/racc/cparse' I, [2024-05-03T00:49:42.336065 #1029333] INFO -- : make[2]: Entering directory '/tmp/ruby/build/trunk/.bundle/gems/rbs-3.4.4/ext/rbs_extension' I, [2024-05-03T00:49:42.357583 #1029333] INFO -- : make[2]: Leaving directory '/tmp/ruby/build/trunk/.bundle/gems/rbs-3.4.4/ext/rbs_extension' I, [2024-05-03T00:49:42.359589 #1029333] INFO -- : make[2]: Entering directory '/tmp/ruby/build/trunk/.bundle/gems/syslog-0.1.2/ext/syslog' I, [2024-05-03T00:49:42.381235 #1029333] INFO -- : make[2]: Leaving directory '/tmp/ruby/build/trunk/.bundle/gems/syslog-0.1.2/ext/syslog' I, [2024-05-03T00:49:42.404956 #1029333] INFO -- : make[2]: Entering directory '/tmp/ruby/build/trunk' I, [2024-05-03T00:49:42.469905 #1029333] INFO -- : make[2]: 'ruby' is up to date. I, [2024-05-03T00:49:42.469946 #1029333] INFO -- : make[2]: Leaving directory '/tmp/ruby/build/trunk' I, [2024-05-03T00:49:42.470180 #1029333] INFO -- : make[1]: Leaving directory '/tmp/ruby/build/trunk' I, [2024-05-03T00:49:42.473936 #1029333] INFO -- : make[1]: Entering directory '/tmp/ruby/build/trunk' I, [2024-05-03T00:49:42.473957 #1029333] INFO -- : make[1]: Nothing to be done for 'note'. I, [2024-05-03T00:49:42.474080 #1029333] INFO -- : make[1]: Leaving directory '/tmp/ruby/build/trunk' I, [2024-05-03T00:49:42.552090 #1029333] INFO -- : Run options: I, [2024-05-03T00:49:42.552155 #1029333] INFO -- : --seed=15888 I, [2024-05-03T00:49:42.552171 #1029333] INFO -- : "--ruby=./miniruby -I/tmp/ruby/src/trunk/lib -I. -I.ext/common /tmp/ruby/src/trunk/tool/runruby.rb --extout=.ext -- --disable-gems" I, [2024-05-03T00:49:42.552182 #1029333] INFO -- : --excludes-dir=/tmp/ruby/src/trunk/test/.excludes I, [2024-05-03T00:49:42.552186 #1029333] INFO -- : --name=!/memory_leak/ I, [2024-05-03T00:49:42.552190 #1029333] INFO -- : --stderr-on-failure I, [2024-05-03T00:49:42.552193 #1029333] INFO -- : -j20 I, [2024-05-03T00:49:42.552202 #1029333] INFO -- : I, [2024-05-03T00:49:42.552206 #1029333] INFO -- : # Running tests: I, [2024-05-03T00:49:42.552209 #1029333] INFO -- : I, [2024-05-03T00:49:42.700089 #1029333] INFO -- : [ 1/884] 1070699=reflection_test I, [2024-05-03T00:49:42.700267 #1029333] INFO -- : [ 2/884] 1070682=test_within_pipe I, [2024-05-03T00:49:42.700378 #1029333] INFO -- : [ 3/884] 1070683=test_emoji_breaks I, [2024-05-03T00:49:42.700465 #1029333] INFO -- : [ 4/884] 1070685=test_gem_bundler_version_finder I, [2024-05-03T00:49:42.700968 #1029333] INFO -- : [ 5/884] 1070686=test_help I, [2024-05-03T00:49:42.702810 #1029333] INFO -- : [ 6/884] 1070684=test_rdoc_markup_to_bs I, [2024-05-03T00:49:42.702985 #1029333] INFO -- : [ 7/884] 1070695=test_beginendblock I, [2024-05-03T00:49:42.703400 #1029333] INFO -- : [ 8/884] 1070698=test_files_lib I, [2024-05-03T00:49:42.704082 #1029333] INFO -- : [ 9/884] 1070696=test_gem_commands_unpack_command I, [2024-05-03T00:49:42.704712 #1029333] INFO -- : [ 10/884] 1070697=test_stream I, [2024-05-03T00:49:42.706891 #1029333] INFO -- : [ 11/884] 1070700=test_to_ary_concat I, [2024-05-03T00:49:42.713816 #1029333] INFO -- : [ 12/884] 1070683=test_webauthn_listener_response I, [2024-05-03T00:49:42.717717 #1029333] INFO -- : [ 13/884] 1070686=test_time I, [2024-05-03T00:49:42.733817 #1029333] INFO -- : [ 14/884] 1070687=test_rdoc_markup_pre_process I, [2024-05-03T00:49:42.733898 #1029333] INFO -- : [ 15/884] 1070690=test_printf I, [2024-05-03T00:49:42.734382 #1029333] INFO -- : [ 16/884] 1070692=test_pinned I, [2024-05-03T00:49:42.734595 #1029333] INFO -- : [ 17/884] 1070693=test_mkmf I, [2024-05-03T00:49:42.740026 #1029333] INFO -- : [ 18/884] 1070689=test_date_marshal I, [2024-05-03T00:49:42.747023 #1029333] INFO -- : [ 19/884] 1070697=test_history I, [2024-05-03T00:49:42.751725 #1029333] INFO -- : [ 20/884] 1070692=test_popen_deadlock I, [2024-05-03T00:49:42.754023 #1029333] INFO -- : [ 21/884] 1070690=test_delegate I, [2024-05-03T00:49:42.761003 #1029333] INFO -- : [ 22/884] 1070689=test_exit I, [2024-05-03T00:49:42.761345 #1029333] INFO -- : [ 23/884] 1070694=test_recursion I, [2024-05-03T00:49:42.762469 #1029333] INFO -- : [ 24/884] 1070688=test_rdoc_servlet I, [2024-05-03T00:49:42.763159 #1029333] INFO -- : [ 25/884] 1070699=test_gem_security I, [2024-05-03T00:49:42.763730 #1029333] INFO -- : [ 26/884] 1070691=test_ractor I, [2024-05-03T00:49:42.767519 #1029333] INFO -- : [ 27/884] 1070694=test_digest I, [2024-05-03T00:49:42.772533 #1029333] INFO -- : [ 28/884] 1070701=test_bundled_ca I, [2024-05-03T00:49:42.773265 #1029333] INFO -- : [ 29/884] 1070690=test_closure I, [2024-05-03T00:49:42.781240 #1029333] INFO -- : [ 30/884] 1070682=test_open3 I, [2024-05-03T00:49:42.813528 #1029333] INFO -- : [ 31/884] 1070693=test_multi_irb_commands I, [2024-05-03T00:49:42.837564 #1029333] INFO -- : [ 32/884] 1070694=test_fiber I, [2024-05-03T00:49:42.843585 #1029333] INFO -- : [ 33/884] 1070693=test_gem_commands_build_command I, [2024-05-03T00:49:42.860843 #1029333] INFO -- : [ 34/884] 1070691=test_case_comprehensive I, [2024-05-03T00:49:42.866343 #1029333] INFO -- : [ 35/884] 1070697=test_interned_str I, [2024-05-03T00:49:42.871893 #1029333] INFO -- : [ 36/884] 1070697=test_gem_commands_server_command I, [2024-05-03T00:49:42.907907 #1029333] INFO -- : [ 37/884] 1070685=test_did_you_mean I, [2024-05-03T00:49:42.910224 #1029333] INFO -- : [ 38/884] 1070684=test_io_m17n I, [2024-05-03T00:49:42.924286 #1029333] INFO -- : [ 39/884] 1070687=test_variable_name_check I, [2024-05-03T00:49:42.935934 #1029333] INFO -- : [ 40/884] 1070690=test_tracer I, [2024-05-03T00:49:42.948630 #1029333] INFO -- : [ 41/884] 1070686=test_cmethod I, [2024-05-03T00:49:42.948698 #1029333] INFO -- : [ 42/884] 1070700=test_option I, [2024-05-03T00:49:42.948872 #1029333] INFO -- : [ 43/884] 1070683=test_append I, [2024-05-03T00:49:42.951831 #1029333] INFO -- : [ 44/884] 1070686=test_rdoc_markup_heading I, [2024-05-03T00:49:42.953082 #1029333] INFO -- : [ 45/884] 1070683=test_exception_at_throwing I, [2024-05-03T00:49:42.982061 #1029333] INFO -- : [ 46/884] 1070687=test_iseq I, [2024-05-03T00:49:43.033103 #1029333] INFO -- : [ 47/884] 1070683=test_pkey_dsa I, [2024-05-03T00:49:43.035571 #1029333] INFO -- : [ 48/884] 1070690=test_ocsp I, [2024-05-03T00:49:43.039000 #1029333] INFO -- : [ 49/884] 1070697=test_class I, [2024-05-03T00:49:43.039760 #1029333] INFO -- : [ 50/884] 1070689=test_scheduler I, [2024-05-03T00:49:43.042693 #1029333] INFO -- : [ 51/884] 1070697=test_rdoc_markup_to_html I, [2024-05-03T00:49:43.055113 #1029333] INFO -- : [ 52/884] 1070685=test_date_compat I, [2024-05-03T00:49:43.056258 #1029333] INFO -- : [ 53/884] 1070685=test_bug-14834 I, [2024-05-03T00:49:43.099096 #1029333] INFO -- : [ 54/884] 1070686=test_terminfo I, [2024-05-03T00:49:43.112254 #1029333] INFO -- : [ 55/884] 1070700=test_compile_prism I, [2024-05-03T00:49:43.141522 #1029333] INFO -- : [ 56/884] 1070685=redundant_return_test I, [2024-05-03T00:49:43.149308 #1029333] INFO -- : [ 57/884] 1070688=test_case_mapping I, [2024-05-03T00:49:43.156692 #1029333] INFO -- : [ 58/884] 1070688=test_path I, [2024-05-03T00:49:43.162449 #1029333] INFO -- : [ 59/884] 1070686=test_win32ole_param_event I, [2024-05-03T00:49:43.165041 #1029333] INFO -- : [ 60/884] 1070686=test_bn I, [2024-05-03T00:49:43.168409 #1029333] INFO -- : [ 61/884] 1070688=test_http I, [2024-05-03T00:49:43.198708 #1029333] INFO -- : [ 62/884] 1070695=test_addrinfo I, [2024-05-03T00:49:43.213399 #1029333] INFO -- : [ 63/884] 1070686=test_tree_spell_checker I, [2024-05-03T00:49:43.213890 #1029333] INFO -- : [ 64/884] 1070689=test_data I, [2024-05-03T00:49:43.216759 #1029333] INFO -- : [ 65/884] 1070685=static_literals_test I, [2024-05-03T00:49:43.217993 #1029333] INFO -- : [ 66/884] 1070689=test_filter I, [2024-05-03T00:49:43.219855 #1029333] INFO -- : [ 67/884] 1070685=test_gem_gem_runner I, [2024-05-03T00:49:43.260086 #1029333] INFO -- : [ 68/884] 1070689=test_rdoc_method_attr I, [2024-05-03T00:49:43.263219 #1029333] INFO -- : [ 69/884] 1070685=test_unicode I, [2024-05-03T00:49:43.264626 #1029333] INFO -- : [ 70/884] 1070686=test_enumerator I, [2024-05-03T00:49:43.269399 #1029333] INFO -- : [ 71/884] 1070686=test_rdoc_parser_changelog I, [2024-05-03T00:49:43.270165 #1029333] INFO -- : [ 72/884] 1070695=parameters_signature_test I, [2024-05-03T00:49:43.301279 #1029333] INFO -- : [ 73/884] 1070697=test_koi8 I, [2024-05-03T00:49:43.304805 #1029333] INFO -- : [ 74/884] 1070697=test_rdoc_generator_pot I, [2024-05-03T00:49:43.308836 #1029333] INFO -- : [ 75/884] 1070696=test_ssl_session I, [2024-05-03T00:49:43.312577 #1029333] INFO -- : [ 76/884] 1070697=test_lexer I, [2024-05-03T00:49:43.325163 #1029333] INFO -- : [ 77/884] 1070685=test_thread_cv I, [2024-05-03T00:49:43.329983 #1029333] INFO -- : [ 78/884] 1070697=test_notimplement I, [2024-05-03T00:49:43.334409 #1029333] INFO -- : [ 79/884] 1070697=test_random I, [2024-05-03T00:49:43.341491 #1029333] INFO -- : [ 80/884] 1070695=test_gem_uri I, [2024-05-03T00:49:43.342403 #1029333] INFO -- : [ 81/884] 1070697=test_key_event_record I, [2024-05-03T00:49:43.345997 #1029333] INFO -- : [ 82/884] 1070697=test_gem_resolver_vendor_specification I, [2024-05-03T00:49:43.351386 #1029333] INFO -- : [ 83/884] 1070686=test_gem_commands_update_command I, [2024-05-03T00:49:43.354864 #1029333] INFO -- : [ 84/884] 1070700=test_human_typo I, [2024-05-03T00:49:43.366084 #1029333] INFO -- : [ 85/884] 1070700=test_primitive I, [2024-05-03T00:49:43.368167 #1029333] INFO -- : [ 86/884] 1070697=test_rbconfig I, [2024-05-03T00:49:43.369383 #1029333] INFO -- : [ 87/884] 1070693=test_pair I, [2024-05-03T00:49:43.370206 #1029333] INFO -- : [ 88/884] 1070697=test_win32ole_param I, [2024-05-03T00:49:43.373709 #1029333] INFO -- : [ 89/884] 1070700=test_gem_commands_yank_command I, [2024-05-03T00:49:43.377955 #1029333] INFO -- : [ 90/884] 1070697=test_acceptable I, [2024-05-03T00:49:43.396645 #1029333] INFO -- : [ 91/884] 1070692=test_rdoc_generator_pot_po_entry I, [2024-05-03T00:49:43.400631 #1029333] INFO -- : [ 92/884] 1070690=test_euc_jp I, [2024-05-03T00:49:43.401546 #1029333] INFO -- : [ 93/884] 1070690=test_document I, [2024-05-03T00:49:43.432702 #1029333] INFO -- : [ 94/884] 1070690=test_rdoc_i18n_locale I, [2024-05-03T00:49:43.480882 #1029333] INFO -- : [ 95/884] 1070683=test_chilled I, [2024-05-03T00:49:43.482201 #1029333] INFO -- : [ 96/884] 1070689=test_name_error_extension I, [2024-05-03T00:49:43.484934 #1029333] INFO -- : [ 97/884] 1070683=test_set_len I, [2024-05-03T00:49:43.485848 #1029333] INFO -- : [ 98/884] 1070683=test_httpresponses I, [2024-05-03T00:49:43.494157 #1029333] INFO -- : [ 99/884] 1070689=test_encoding I, [2024-05-03T00:49:43.511920 #1029333] INFO -- : [100/884] 1070692=test_rdoc_ri_driver I, [2024-05-03T00:49:43.521223 #1029333] INFO -- : [101/884] 1070689=test_httpheader I, [2024-05-03T00:49:43.530714 #1029333] INFO -- : [102/884] 1070683=test_gem_resolver_local_specification I, [2024-05-03T00:49:43.535298 #1029333] INFO -- : [103/884] 1070697=test_rdoc_markup_to_label I, [2024-05-03T00:49:43.539773 #1029333] INFO -- : [104/884] 1070687=test_install I, [2024-05-03T00:49:43.561450 #1029333] INFO -- : [105/884] 1070697=test_sockopt I, [2024-05-03T00:49:43.562186 #1029333] INFO -- : [106/884] 1070690=json_encoding_test I, [2024-05-03T00:49:43.566106 #1029333] INFO -- : [107/884] 1070697=test_color I, [2024-05-03T00:49:43.568402 #1029333] INFO -- : [108/884] 1070695=test_key_stroke I, [2024-05-03T00:49:43.574466 #1029333] INFO -- : [109/884] 1070689=test_benchmark I, [2024-05-03T00:49:43.585102 #1029333] INFO -- : [110/884] 1070690=test_gem_dependency_list I, [2024-05-03T00:49:43.586424 #1029333] INFO -- : [111/884] 1070683=test_nesting_parser I, [2024-05-03T00:49:43.632029 #1029333] INFO -- : [112/884] 1070697=test_win32ole_method_event I, [2024-05-03T00:49:43.636103 #1029333] INFO -- : [113/884] 1070697=test_scalar_scanner I, [2024-05-03T00:49:43.645135 #1029333] INFO -- : [114/884] 1070697=test_gem_source I, [2024-05-03T00:49:43.646833 #1029333] INFO -- : [115/884] 1070695=test_array I, [2024-05-03T00:49:43.699508 #1029333] INFO -- : [116/884] 1070687=test_helper_method I, [2024-05-03T00:49:43.723402 #1029333] INFO -- : [117/884] 1070683=test_gem_package_tar_writer I, [2024-05-03T00:49:43.728351 #1029333] INFO -- : [118/884] 1070690=test_gem_commands_outdated_command I, [2024-05-03T00:49:43.777366 #1029333] INFO -- : [119/884] 1070690=test_provider I, [2024-05-03T00:49:43.795871 #1029333] INFO -- : [120/884] 1070687=test_abi I, [2024-05-03T00:49:43.830921 #1029333] INFO -- : [121/884] 1070683=test_load I, [2024-05-03T00:49:43.833094 #1029333] INFO -- : [122/884] 1070683=test_yamldbm I, [2024-05-03T00:49:43.843264 #1029333] INFO -- : [123/884] 1070683=test_gem_commands_rebuild_command I, [2024-05-03T00:49:43.871570 #1029333] INFO -- : [124/884] 1070701=test_rdoc_parser_simple I, [2024-05-03T00:49:43.874011 #1029333] INFO -- : [125/884] 1070692=test_gem_ext_builder I, [2024-05-03T00:49:43.891599 #1029333] INFO -- : [126/884] 1070683=test_https I, [2024-05-03T00:49:43.953231 #1029333] INFO -- : [127/884] 1070697=test_evaluation I, [2024-05-03T00:49:43.955678 #1029333] INFO -- : [128/884] 1070685=test_gem_source_installed I, [2024-05-03T00:49:43.957961 #1029333] INFO -- : [129/884] 1070697=test_erb I, [2024-05-03T00:49:43.969886 #1029333] INFO -- : [130/884] 1070687=test_x509ext I, [2024-05-03T00:49:44.001329 #1029333] INFO -- : [131/884] 1070685=test_yield_block I, [2024-05-03T00:49:44.003687 #1029333] INFO -- : [132/884] 1070685=test_len I, [2024-05-03T00:49:44.004218 #1029333] INFO -- : [133/884] 1070685=test_gem_commands_cert_command I, [2024-05-03T00:49:44.008619 #1029333] INFO -- : [134/884] 1070687=test_completion I, [2024-05-03T00:49:44.018666 #1029333] INFO -- : [135/884] 1070697=test_rational I, [2024-05-03T00:49:44.035733 #1029333] INFO -- : [136/884] 1070697=test_rational2 I, [2024-05-03T00:49:44.045593 #1029333] INFO -- : [137/884] 1070697=test_spell_checker I, [2024-05-03T00:49:44.059441 #1029333] INFO -- : [138/884] 1070700=test_propertyputref I, [2024-05-03T00:49:44.060490 #1029333] INFO -- : [139/884] 1070697=attribute_write_test I, [2024-05-03T00:49:44.065353 #1029333] INFO -- : [140/884] 1070700=test_assembler I, [2024-05-03T00:49:44.066564 #1029333] INFO -- : [141/884] 1070700=constant_path_node_test I, [2024-05-03T00:49:44.075429 #1029333] INFO -- : [142/884] 1070701=test_ssl I, [2024-05-03T00:49:44.128489 #1029333] INFO -- : [143/884] 1070690=test_gem_ext_cargo_builder I, [2024-05-03T00:49:44.130954 #1029333] INFO -- : [144/884] 1070700=test_module I, [2024-05-03T00:49:44.140430 #1029333] INFO -- : [145/884] 1070697=test_gem_request_set I, [2024-05-03T00:49:44.144427 #1029333] INFO -- : [146/884] 1070690=test_method_name_check I, [2024-05-03T00:49:44.166211 #1029333] INFO -- : [147/884] 1070690=test_arith_seq_extract I, [2024-05-03T00:49:44.235683 #1029333] INFO -- : [148/884] 1070683=test_parser I, [2024-05-03T00:49:44.255777 #1029333] INFO -- : [149/884] 1070683=test_rubyvm I, [2024-05-03T00:49:44.264350 #1029333] INFO -- : [150/884] 1070683=test_configuration I, [2024-05-03T00:49:44.309470 #1029333] INFO -- : [151/884] 1070690=test_monitor I, [2024-05-03T00:49:44.320625 #1029333] INFO -- : [152/884] 1070684=test_buffered_io I, [2024-05-03T00:49:44.340722 #1029333] INFO -- : [153/884] 1070696=test_whileuntil I, [2024-05-03T00:49:44.341170 #1029333] INFO -- : [154/884] 1070696=test_rdoc_generator_markup I, [2024-05-03T00:49:44.394929 #1029333] INFO -- : [155/884] 1070683=test_boolean I, [2024-05-03T00:49:44.400868 #1029333] INFO -- : [156/884] 1070683=test_stringify_symbols I, [2024-05-03T00:49:44.407520 #1029333] INFO -- : [157/884] 1070683=test_instrumentation_api I, [2024-05-03T00:49:44.411678 #1029333] INFO -- : [158/884] 1070687=integer_parse_test I, [2024-05-03T00:49:44.449453 #1029333] INFO -- : [159/884] 1070684=test_win32ole_variant_outarg I, [2024-05-03T00:49:44.453188 #1029333] INFO -- : [160/884] 1070684=json_common_interface_test I, [2024-05-03T00:49:44.464893 #1029333] INFO -- : [161/884] 1070687=test_dln I, [2024-05-03T00:49:44.474025 #1029333] INFO -- : [162/884] 1070687=test_gem_source_subpath_problem I, [2024-05-03T00:49:44.481871 #1029333] INFO -- : [163/884] 1070684=test_nomethod_error I, [2024-05-03T00:49:44.486076 #1029333] INFO -- : [164/884] 1070684=json_parser_test I, [2024-05-03T00:49:44.515900 #1029333] INFO -- : [165/884] 1070696=memsize_test I, [2024-05-03T00:49:44.518346 #1029333] INFO -- : [166/884] 1070684=test_config I, [2024-05-03T00:49:44.524161 #1029333] INFO -- : [167/884] 1070690=test_pkg_config I, [2024-05-03T00:49:44.545557 #1029333] INFO -- : [168/884] 1070697=test_cparser I, [2024-05-03T00:49:44.550466 #1029333] INFO -- : [169/884] 1070684=magic_comment_test I, [2024-05-03T00:49:44.564052 #1029333] INFO -- : [170/884] 1070690=test_rdoc_markup_to_html_snippet I, [2024-05-03T00:49:44.609667 #1029333] INFO -- : [171/884] 1070696=test_struct I, [2024-05-03T00:49:44.615891 #1029333] INFO -- : [172/884] 1070696=test_variable I, [2024-05-03T00:49:44.625520 #1029333] INFO -- : [173/884] 1070684=fuzzer_test I, [2024-05-03T00:49:44.632203 #1029333] INFO -- : [174/884] 1070684=test_sexp I, [2024-05-03T00:49:44.648270 #1029333] INFO -- : [175/884] 1070690=test_rdoc_markup_include I, [2024-05-03T00:49:44.648604 #1029333] INFO -- : [176/884] 1070690=test_allocation I, [2024-05-03T00:49:44.651865 #1029333] INFO -- : [177/884] 1070684=test_div I, [2024-05-03T00:49:44.653371 #1029333] INFO -- : [178/884] 1070684=test_win32ole_variant_m I, [2024-05-03T00:49:44.654044 #1029333] INFO -- : [179/884] 1070684=test_engine I, [2024-05-03T00:49:44.656243 #1029333] INFO -- : [180/884] 1070684=test_key_error I, [2024-05-03T00:49:44.656791 #1029333] INFO -- : [181/884] 1070684=test_insns_leaf I, [2024-05-03T00:49:44.669199 #1029333] INFO -- : [182/884] 1070684=test_serialize_subclasses I, [2024-05-03T00:49:44.672585 #1029333] INFO -- : [183/884] 1070687=test_color_printer I, [2024-05-03T00:49:44.675484 #1029333] INFO -- : [184/884] 1070687=test_deprecated I, [2024-05-03T00:49:44.678899 #1029333] INFO -- : [185/884] 1070684=test_files_test_1 I, [2024-05-03T00:49:44.680451 #1029333] INFO -- : [186/884] 1070687=test_struct I, [2024-05-03T00:49:44.731056 #1029333] INFO -- : [187/884] 1070686=test_gem_path_support I, [2024-05-03T00:49:44.753188 #1029333] INFO -- : [188/884] 1070696=test_set I, [2024-05-03T00:49:44.771880 #1029333] INFO -- : [189/884] 1070686=test_mutex I, [2024-05-03T00:49:44.786886 #1029333] INFO -- : [190/884] 1070696=test_x509req I, [2024-05-03T00:49:44.802583 #1029333] INFO -- : [191/884] 1070689=test_rdoc_rd_inline I, [2024-05-03T00:49:44.806991 #1029333] INFO -- : [192/884] 1070689=test_require I, [2024-05-03T00:49:44.976572 #1029333] INFO -- : [193/884] 1070696=test_cgi_cookie I, [2024-05-03T00:49:44.988951 #1029333] INFO -- : [194/884] 1070696=test_float I, [2024-05-03T00:49:45.103258 #1029333] INFO -- : [195/884] 1070687=test_gem_source_git I, [2024-05-03T00:49:45.147083 #1029333] INFO -- : [196/884] 1070682=test_regex_casefold I, [2024-05-03T00:49:45.286497 #1029333] INFO -- : [197/884] 1070697=test_refinement I, [2024-05-03T00:49:45.294722 #1029333] INFO -- : [198/884] 1070692=test_gem_commands_signout_command I, [2024-05-03T00:49:45.316927 #1029333] INFO -- : [199/884] 1070692=test_gem_resolver_installer_set I, [2024-05-03T00:49:45.515569 #1029333] INFO -- : [200/884] 1070682=test_dir_m17n I, [2024-05-03T00:49:45.538029 #1029333] INFO -- : [201/884] 1070692=test_rdoc_top_level I, [2024-05-03T00:49:45.663795 #1029333] INFO -- : [202/884] 1070687=test_metaclass I, [2024-05-03T00:49:45.664609 #1029333] INFO -- : [203/884] 1070687=test_rdoc_rd I, [2024-05-03T00:49:45.672246 #1029333] INFO -- : [204/884] 1070685=test_cgi_session I, [2024-05-03T00:49:45.687422 #1029333] INFO -- : [205/884] 1070685=test_x509crl I, [2024-05-03T00:49:45.692974 #1029333] INFO -- : [206/884] 1070687=test_fixnum I, [2024-05-03T00:49:45.703550 #1029333] INFO -- : [207/884] 1070687=test_signal I, [2024-05-03T00:49:45.801275 #1029333] INFO -- : [208/884] 1070685=test_process I, [2024-05-03T00:49:45.816588 #1029333] INFO -- : [209/884] 1070685=test_input_method I, [2024-05-03T00:49:45.868159 #1029333] INFO -- : [210/884] 1070692=test_windows_1252 I, [2024-05-03T00:49:45.876749 #1029333] INFO -- : [211/884] 1070692=test_digest_extend I, [2024-05-03T00:49:45.889742 #1029333] INFO -- : [212/884] 1070692=test_omap I, [2024-05-03T00:49:45.893581 #1029333] INFO -- : [213/884] 1070692=test_iterator I, [2024-05-03T00:49:45.924305 #1029333] INFO -- : [214/884] 1070686=test_string I, [2024-05-03T00:49:45.929288 #1029333] INFO -- : [215/884] 1070686=test_memory_view I, [2024-05-03T00:49:45.946662 #1029333] INFO -- : [216/884] 1070686=pattern_test I, [2024-05-03T00:49:45.950924 #1029333] INFO -- : [217/884] 1070692=test_debug I, [2024-05-03T00:49:45.954556 #1029333] INFO -- : [218/884] 1070692=test_shellwords I, [2024-05-03T00:49:45.961241 #1029333] INFO -- : [219/884] 1070692=test_new I, [2024-05-03T00:49:45.962878 #1029333] INFO -- : [220/884] 1070692=test_gem_security_signer I, [2024-05-03T00:49:45.963493 #1029333] INFO -- : [221/884] 1070685=test_cipher I, [2024-05-03T00:49:45.997864 #1029333] INFO -- : [222/884] 1070685=test_storage I, [2024-05-03T00:49:46.000843 #1029333] INFO -- : [223/884] 1070685=test_gem_resolver_git_set I, [2024-05-03T00:49:46.013974 #1029333] INFO -- : [224/884] 1070686=test_parser I, [2024-05-03T00:49:46.023537 #1029333] INFO -- : [225/884] 1070686=test_cgi_core I, [2024-05-03T00:49:46.034857 #1029333] INFO -- : [226/884] 1070686=test_ractor I, [2024-05-03T00:49:46.056709 #1029333] INFO -- : [227/884] 1070686=test_gem_commands_open_command I, [2024-05-03T00:49:46.069371 #1029333] INFO -- : [228/884] 1070700=test_dns I, [2024-05-03T00:49:46.081065 #1029333] INFO -- : [229/884] 1070692=test_gem I, [2024-05-03T00:49:46.108788 #1029333] INFO -- : [230/884] 1070686=test_gem_source_lock I, [2024-05-03T00:49:46.162544 #1029333] INFO -- : [231/884] 1070686=parse_stream_test I, [2024-05-03T00:49:46.169608 #1029333] INFO -- : [232/884] 1070686=test_ractor I, [2024-05-03T00:49:46.285287 #1029333] INFO -- : [233/884] 1070685=test_debugger_integration I, [2024-05-03T00:49:46.291230 #1029333] INFO -- : [234/884] 1070685=test_rendering I, [2024-05-03T00:49:46.295942 #1029333] INFO -- : [235/884] 1070685=test_my_integer I, [2024-05-03T00:49:46.299479 #1029333] INFO -- : [236/884] 1070685=json_ext_parser_test I, [2024-05-03T00:49:46.305614 #1029333] INFO -- : [237/884] 1070685=test_thread I, [2024-05-03T00:49:46.386587 #1029333] INFO -- : [238/884] 1070696=test_ssl I, [2024-05-03T00:49:46.495893 #1029333] INFO -- : [239/884] 1070698=test_ancdata I, [2024-05-03T00:49:46.510230 #1029333] INFO -- : [240/884] 1070698=test_singleton_function I, [2024-05-03T00:49:46.516170 #1029333] INFO -- : [241/884] 1070698=test_reline_key I, [2024-05-03T00:49:46.530011 #1029333] INFO -- : [242/884] 1070700=test_rb_str_dup I, [2024-05-03T00:49:46.531844 #1029333] INFO -- : [243/884] 1070700=test_weakref I, [2024-05-03T00:49:46.574475 #1029333] INFO -- : [244/884] 1070698=test_nonblock I, [2024-05-03T00:49:46.591983 #1029333] INFO -- : [245/884] 1070698=test_marshal I, [2024-05-03T00:49:46.618191 #1029333] INFO -- : [246/884] 1070686=test_unicode_normalize I, [2024-05-03T00:49:46.649916 #1029333] INFO -- : [247/884] 1070682=test_timeout I, [2024-05-03T00:49:46.665336 #1029333] INFO -- : [248/884] 1070700=test_alias I, [2024-05-03T00:49:46.789458 #1029333] INFO -- : [249/884] 1070693=test_rubygems I, [2024-05-03T00:49:46.813456 #1029333] INFO -- : [250/884] 1070695=test_call I, [2024-05-03T00:49:46.851547 #1029333] INFO -- : [251/884] 1070700=test_https_proxy I, [2024-05-03T00:49:46.862367 #1029333] INFO -- : [252/884] 1070696=test_integer I, [2024-05-03T00:49:46.892408 #1029333] INFO -- : [253/884] 1070698=test_cgi_modruby I, [2024-05-03T00:49:46.893721 #1029333] INFO -- : [254/884] 1070700=test_rubyoptions I, [2024-05-03T00:49:46.900407 #1029333] INFO -- : [255/884] 1070698=test_super I, [2024-05-03T00:49:46.935866 #1029333] INFO -- : [256/884] 1070695=test_gem_resolver_git_specification I, [2024-05-03T00:49:46.963281 #1029333] INFO -- : [257/884] 1070693=test_usrmarshal I, [2024-05-03T00:49:47.113922 #1029333] INFO -- : [258/884] 1070690=test_object_references I, [2024-05-03T00:49:47.126163 #1029333] INFO -- : [259/884] 1070690=test_capacity I, [2024-05-03T00:49:47.144042 #1029333] INFO -- : [260/884] 1070690=test_nextafter I, [2024-05-03T00:49:47.175968 #1029333] INFO -- : [261/884] 1070693=test_have_func I, [2024-05-03T00:49:47.194636 #1029333] INFO -- : [262/884] 1070695=test_stat I, [2024-05-03T00:49:47.197471 #1029333] INFO -- : [263/884] 1070695=test_gem_request_set_lockfile_tokenizer I, [2024-05-03T00:49:47.208994 #1029333] INFO -- : [264/884] 1070690=test_integer I, [2024-05-03T00:49:47.248173 #1029333] INFO -- : [265/884] 1070695=desugar_compiler_test I, [2024-05-03T00:49:47.252009 #1029333] INFO -- : [266/884] 1070695=test_dryrun I, [2024-05-03T00:49:47.268156 #1029333] INFO -- : [267/884] 1070695=test_rdoc_attr I, [2024-05-03T00:49:47.269387 #1029333] INFO -- : [268/884] 1070690=test_env I, [2024-05-03T00:49:47.334150 #1029333] INFO -- : [269/884] 1070698=test_gem_commands_setup_command I, [2024-05-03T00:49:47.384229 #1029333] INFO -- : [270/884] 1070683=test_cgi_multipart I, [2024-05-03T00:49:47.394419 #1029333] INFO -- : [271/884] 1070695=test_word I, [2024-05-03T00:49:47.397436 #1029333] INFO -- : [272/884] 1070695=test_gem_commands_cleanup_command I, [2024-05-03T00:49:47.416116 #1029333] INFO -- : [273/884] 1070689=test_member I, [2024-05-03T00:49:47.419000 #1029333] INFO -- : [274/884] 1070689=test_numeric I, [2024-05-03T00:49:47.424762 #1029333] INFO -- : [275/884] 1070689=test_dir I, [2024-05-03T00:49:47.534465 #1029333] INFO -- : [276/884] 1070683=format_errors_test I, [2024-05-03T00:49:47.572562 #1029333] INFO -- : [277/884] 1070682=test_date_ractor I, [2024-05-03T00:49:47.592675 #1029333] INFO -- : [278/884] 1070683=test_gem_console_ui I, [2024-05-03T00:49:47.594840 #1029333] INFO -- : [279/884] 1070683=test_autoconf I, [2024-05-03T00:49:47.597457 #1029333] INFO -- : [280/884] 1070683=test_eval I, [2024-05-03T00:49:47.600437 #1029333] INFO -- : [281/884] 1070683=test_ractor_compatibility I, [2024-05-03T00:49:47.671000 #1029333] INFO -- : [282/884] 1070689=test_mailto I, [2024-05-03T00:49:47.678502 #1029333] INFO -- : [283/884] 1070689=location_test I, [2024-05-03T00:49:47.782858 #1029333] INFO -- : [284/884] 1070682=test_symbol I, [2024-05-03T00:49:47.801006 #1029333] INFO -- : [285/884] 1070689=test_coderange I, [2024-05-03T00:49:47.801656 #1029333] INFO -- : [286/884] 1070687=test_http_request I, [2024-05-03T00:49:47.803816 #1029333] INFO -- : [287/884] 1070689=test_gem_source_fetch_problem I, [2024-05-03T00:49:47.809171 #1029333] INFO -- : [288/884] 1070682=json_generic_object_test I, [2024-05-03T00:49:47.813526 #1029333] INFO -- : [289/884] 1070689=test_rdoc_comment I, [2024-05-03T00:49:47.819248 #1029333] INFO -- : [290/884] 1070682=test_resize I, [2024-05-03T00:49:47.827026 #1029333] INFO -- : [291/884] 1070682=test_error_highlight I, [2024-05-03T00:49:47.832379 #1029333] INFO -- : [292/884] 1070697=test_rdoc_generator_darkfish I, [2024-05-03T00:49:47.865376 #1029333] INFO -- : [293/884] 1070689=test_function_entry I, [2024-05-03T00:49:47.867959 #1029333] INFO -- : [294/884] 1070687=test_arith_seq_beg_len_step I, [2024-05-03T00:49:47.870529 #1029333] INFO -- : [295/884] 1070689=test_gem_resolver_requirement_list I, [2024-05-03T00:49:47.874765 #1029333] INFO -- : [296/884] 1070689=test_pkcs7 I, [2024-05-03T00:49:47.876028 #1029333] INFO -- : [297/884] 1070695=test_lazy_enumerator I, [2024-05-03T00:49:47.919048 #1029333] INFO -- : [298/884] 1070687=test_enc_associate I, [2024-05-03T00:49:47.941250 #1029333] INFO -- : [299/884] 1070684=test_unix I, [2024-05-03T00:49:47.973062 #1029333] INFO -- : [300/884] 1070684=test_gem_commands_pristine_command I, [2024-05-03T00:49:47.995943 #1029333] INFO -- : [301/884] 1070698=test_context I, [2024-05-03T00:49:47.998718 #1029333] INFO -- : [302/884] 1070683=test_nofree I, [2024-05-03T00:49:48.001818 #1029333] INFO -- : [303/884] 1070683=test_coder I, [2024-05-03T00:49:48.036708 #1029333] INFO -- : [304/884] 1070683=test_symbol I, [2024-05-03T00:49:48.064658 #1029333] INFO -- : [305/884] 1070689=test_find_executable I, [2024-05-03T00:49:48.089961 #1029333] INFO -- : [306/884] 1070692=ruby_api_test I, [2024-05-03T00:49:48.112636 #1029333] INFO -- : [307/884] 1070689=test_time_tz I, [2024-05-03T00:49:48.127363 #1029333] INFO -- : [308/884] 1070698=test_win32ole_event I, [2024-05-03T00:49:48.130393 #1029333] INFO -- : [309/884] 1070698=test_rdoc_generator_json_index I, [2024-05-03T00:49:48.169077 #1029333] INFO -- : [310/884] 1070689=ractor_test I, [2024-05-03T00:49:48.215370 #1029333] INFO -- : [311/884] 1070697=test_trace I, [2024-05-03T00:49:48.233876 #1029333] INFO -- : [312/884] 1070697=test_arity I, [2024-05-03T00:49:48.240082 #1029333] INFO -- : [313/884] 1070697=test_stringio I, [2024-05-03T00:49:48.253337 #1029333] INFO -- : [314/884] 1070689=test_io_wait_uncommon I, [2024-05-03T00:49:48.259509 #1029333] INFO -- : [315/884] 1070689=test_win32ole_variable I, [2024-05-03T00:49:48.264743 #1029333] INFO -- : [316/884] 1070689=test_bignum I, [2024-05-03T00:49:48.278036 #1029333] INFO -- : [317/884] 1070695=test_rdoc_class_module I, [2024-05-03T00:49:48.323639 #1029333] INFO -- : [318/884] 1070682=test_gem_ci_detector I, [2024-05-03T00:49:48.336471 #1029333] INFO -- : [319/884] 1070698=test_threadgroup I, [2024-05-03T00:49:48.345821 #1029333] INFO -- : [320/884] 1070692=test_gem_specification I, [2024-05-03T00:49:48.372049 #1029333] INFO -- : [321/884] 1070689=test_enum I, [2024-05-03T00:49:48.381502 #1029333] INFO -- : [322/884] 1070697=test_resolve_symbol I, [2024-05-03T00:49:48.432388 #1029333] INFO -- : [323/884] 1070687=test_complex2 I, [2024-05-03T00:49:48.440359 #1029333] INFO -- : [324/884] 1070687=test_gem_package I, [2024-05-03T00:49:48.452198 #1029333] INFO -- : [325/884] 1070697=test_have_macro I, [2024-05-03T00:49:48.527951 #1029333] INFO -- : [326/884] 1070682=test_merge_keys I, [2024-05-03T00:49:48.543982 #1029333] INFO -- : [327/884] 1070682=test_rdoc_extend I, [2024-05-03T00:49:48.722740 #1029333] INFO -- : [328/884] 1070682=test_history I, [2024-05-03T00:49:48.732976 #1029333] INFO -- : [329/884] 1070694=test_mixed_unicode_escapes I, [2024-05-03T00:49:48.735063 #1029333] INFO -- : [330/884] 1070694=test_rdoc_markup_to_ansi I, [2024-05-03T00:49:48.738230 #1029333] INFO -- : [331/884] 1070682=test_ipaddr I, [2024-05-03T00:49:48.761117 #1029333] INFO -- : [332/884] 1070682=test_win32ole_variant I, [2024-05-03T00:49:48.768443 #1029333] INFO -- : [333/884] 1070682=test_gem_resolver_api_specification I, [2024-05-03T00:49:48.791688 #1029333] INFO -- : [334/884] 1070695=test_object I, [2024-05-03T00:49:48.799020 #1029333] INFO -- : [335/884] 1070695=test_cgi_header I, [2024-05-03T00:49:48.808411 #1029333] INFO -- : [336/884] 1070695=heredoc_dedent_test I, [2024-05-03T00:49:48.813251 #1029333] INFO -- : [337/884] 1070695=version_test I, [2024-05-03T00:49:48.817953 #1029333] INFO -- : [338/884] 1070695=test_gem_command_manager I, [2024-05-03T00:49:48.825166 #1029333] INFO -- : [339/884] 1070693=test_gem_gemcutter_utilities I, [2024-05-03T00:49:48.836937 #1029333] INFO -- : [340/884] 1070682=test_basicinstructions I, [2024-05-03T00:49:48.896510 #1029333] INFO -- : [341/884] 1070694=test_key_actor_emacs I, [2024-05-03T00:49:48.899827 #1029333] INFO -- : [342/884] 1070682=test_arithmetic_sequence I, [2024-05-03T00:49:48.915360 #1029333] INFO -- : [343/884] 1070682=test_ossl I, [2024-05-03T00:49:48.924858 #1029333] INFO -- : [344/884] 1070695=test_normalize I, [2024-05-03T00:49:48.928282 #1029333] INFO -- : [345/884] 1070695=test_timeout I, [2024-05-03T00:49:48.932746 #1029333] INFO -- : [346/884] 1070695=compiler_test I, [2024-05-03T00:49:48.936751 #1029333] INFO -- : [347/884] 1070695=test_flip I, [2024-05-03T00:49:48.952958 #1029333] INFO -- : [348/884] 1070695=test_change_word I, [2024-05-03T00:49:48.965555 #1029333] INFO -- : [349/884] 1070695=test_sleep I, [2024-05-03T00:49:48.966347 #1029333] INFO -- : [350/884] 1070697=test_gem_local_remote_options I, [2024-05-03T00:49:49.018773 #1029333] INFO -- : [351/884] 1070697=test_date_arith I, [2024-05-03T00:49:49.024971 #1029333] INFO -- : [352/884] 1070697=test_ruby_lex I, [2024-05-03T00:49:49.086313 #1029333] INFO -- : [353/884] 1070694=test_object I, [2024-05-03T00:49:49.115274 #1029333] INFO -- : [354/884] 1070687=test_pointer I, [2024-05-03T00:49:49.168401 #1029333] INFO -- : [355/884] 1070693=test_func I, [2024-05-03T00:49:49.179007 #1029333] INFO -- : [356/884] 1070697=test_big5 I, [2024-05-03T00:49:49.185482 #1029333] INFO -- : [357/884] 1070697=test_type I, [2024-05-03T00:49:49.192958 #1029333] INFO -- : [358/884] 1070697=test_ractor I, [2024-05-03T00:49:49.254014 #1029333] INFO -- : [359/884] 1070697=test_tsort I, [2024-05-03T00:49:49.256170 #1029333] INFO -- : [360/884] 1070689=test_signedness I, [2024-05-03T00:49:49.263320 #1029333] INFO -- : [361/884] 1070697=test_rdoc_rd_block_parser I, [2024-05-03T00:49:49.311129 #1029333] INFO -- : [362/884] 1070697=test_numhash I, [2024-05-03T00:49:49.316638 #1029333] INFO -- : [363/884] 1070697=test_weakkeymap I, [2024-05-03T00:49:49.342667 #1029333] INFO -- : [364/884] 1070698=test_gem_commands_push_command I, [2024-05-03T00:49:49.449114 #1029333] INFO -- : [365/884] 1070694=test_pkey_rsa I, [2024-05-03T00:49:49.512244 #1029333] INFO -- : [366/884] 1070684=test_gem_platform I, [2024-05-03T00:49:49.559605 #1029333] INFO -- : [367/884] 1070687=test_rdoc_markup_hard_break I, [2024-05-03T00:49:49.561173 #1029333] INFO -- : [368/884] 1070687=test_date_strptime I, [2024-05-03T00:49:49.580617 #1029333] INFO -- : [369/884] 1070697=test_gem_package_task I, [2024-05-03T00:49:49.583328 #1029333] INFO -- : [370/884] 1070697=test_placearg I, [2024-05-03T00:49:49.601374 #1029333] INFO -- : [371/884] 1070684=test_win32ole_method I, [2024-05-03T00:49:49.606214 #1029333] INFO -- : [372/884] 1070684=test_delete I, [2024-05-03T00:49:49.612661 #1029333] INFO -- : [373/884] 1070684=test_class_name_check I, [2024-05-03T00:49:49.632979 #1029333] INFO -- : [374/884] 1070684=test_keyword I, [2024-05-03T00:49:49.649457 #1029333] INFO -- : [375/884] 1070697=test_continuation I, [2024-05-03T00:49:49.655141 #1029333] INFO -- : [376/884] 1070697=test_fd_setsize I, [2024-05-03T00:49:49.657339 #1029333] INFO -- : [377/884] 1070697=test_gem_update_suggestion I, [2024-05-03T00:49:49.674221 #1029333] INFO -- : [378/884] 1070687=test_files_test I, [2024-05-03T00:49:49.675540 #1029333] INFO -- : [379/884] 1070694=test_file_exhaustive I, [2024-05-03T00:49:49.702810 #1029333] INFO -- : [380/884] 1070697=test_logger I, [2024-05-03T00:49:49.714015 #1029333] INFO -- : [381/884] 1070697=test_gem_resolver_lock_set I, [2024-05-03T00:49:49.735808 #1029333] INFO -- : [382/884] 1070696=test_not I, [2024-05-03T00:49:49.736387 #1029333] INFO -- : [383/884] 1070697=test_import I, [2024-05-03T00:49:49.737509 #1029333] INFO -- : [384/884] 1070696=test_rdoc_parser_markdown I, [2024-05-03T00:49:49.751256 #1029333] INFO -- : [385/884] 1070687=test_enumerable I, [2024-05-03T00:49:49.755862 #1029333] INFO -- : [386/884] 1070687=test_gem_resolver_vendor_set I, [2024-05-03T00:49:49.776479 #1029333] INFO -- : [387/884] 1070687=test_config I, [2024-05-03T00:49:49.780934 #1029333] INFO -- : [388/884] 1070696=test_gem_resolver_api_set I, [2024-05-03T00:49:49.832915 #1029333] INFO -- : [389/884] 1070698=test_gem_safe_marshal I, [2024-05-03T00:49:49.836130 #1029333] INFO -- : [390/884] 1070696=test_transcode I, [2024-05-03T00:49:50.019942 #1029333] INFO -- : [391/884] 1070696=json_generator_test I, [2024-05-03T00:49:50.111263 #1029333] INFO -- : [392/884] 1070696=test_eval I, [2024-05-03T00:49:50.114006 #1029333] INFO -- : [393/884] 1070683=test_x509store I, [2024-05-03T00:49:50.124544 #1029333] INFO -- : [394/884] 1070684=test_rdoc_code_object I, [2024-05-03T00:49:50.149829 #1029333] INFO -- : [395/884] 1070690=test_fips I, [2024-05-03T00:49:50.174228 #1029333] INFO -- : [396/884] 1070693=test_x509name I, [2024-05-03T00:49:50.185764 #1029333] INFO -- : [397/884] 1070693=test_update I, [2024-05-03T00:49:50.188109 #1029333] INFO -- : [398/884] 1070693=test_jaro_winkler I, [2024-05-03T00:49:50.193872 #1029333] INFO -- : [399/884] 1070693=test_random_formatter I, [2024-05-03T00:49:50.225709 #1029333] INFO -- : [400/884] 1070693=test_helper I, [2024-05-03T00:49:50.251116 #1029333] INFO -- : [401/884] 1070687=test_gem_request_set_gem_dependency_api I, [2024-05-03T00:49:50.315333 #1029333] INFO -- : [402/884] 1070693=test_ast I, [2024-05-03T00:49:50.342941 #1029333] INFO -- : [403/884] 1070683=test_lambda I, [2024-05-03T00:49:50.359437 #1029333] INFO -- : [404/884] 1070698=test_webauthn_listener I, [2024-05-03T00:49:50.387072 #1029333] INFO -- : [405/884] 1070696=test_gem_commands_check_command I, [2024-05-03T00:49:50.407036 #1029333] INFO -- : [406/884] 1070698=test_regexp I, [2024-05-03T00:49:50.415617 #1029333] INFO -- : [407/884] 1070696=errors_test I, [2024-05-03T00:49:50.427628 #1029333] INFO -- : [408/884] 1070683=test_rdoc_markup_document I, [2024-05-03T00:49:50.444245 #1029333] INFO -- : [409/884] 1070690=test_integer_comb I, [2024-05-03T00:49:50.488877 #1029333] INFO -- : [410/884] 1070687=test_tmpdir I, [2024-05-03T00:49:50.499123 #1029333] INFO -- : [411/884] 1070699=test_vm_dump I, [2024-05-03T00:49:50.500273 #1029333] INFO -- : [412/884] 1070699=test_udp I, [2024-05-03T00:49:50.515341 #1029333] INFO -- : [413/884] 1070699=test_file I, [2024-05-03T00:49:50.537461 #1029333] INFO -- : [414/884] 1070696=test_force_exit I, [2024-05-03T00:49:50.554169 #1029333] INFO -- : [415/884] 1070683=unescape_test I, [2024-05-03T00:49:50.572329 #1029333] INFO -- : [416/884] 1070684=test_ostruct I, [2024-05-03T00:49:50.588076 #1029333] INFO -- : [417/884] 1070687=test_data_error I, [2024-05-03T00:49:50.649622 #1029333] INFO -- : [418/884] 1070696=bom_test I, [2024-05-03T00:49:50.661404 #1029333] INFO -- : [419/884] 1070687=static_inspect_test I, [2024-05-03T00:49:50.663522 #1029333] INFO -- : [420/884] 1070696=test_encoding I, [2024-05-03T00:49:50.667648 #1029333] INFO -- : [421/884] 1070687=test_helper I, [2024-05-03T00:49:50.675901 #1029333] INFO -- : [422/884] 1070687=test_erb_command I, [2024-05-03T00:49:50.718644 #1029333] INFO -- : [423/884] 1070687=test_gem_uri_formatter I, [2024-05-03T00:49:50.731363 #1029333] INFO -- : [424/884] 1070684=test_constant I, [2024-05-03T00:49:50.742808 #1029333] INFO -- : [425/884] 1070687=test_pty I, [2024-05-03T00:49:50.782778 #1029333] INFO -- : [426/884] 1070692=test_dup I, [2024-05-03T00:49:50.905761 #1029333] INFO -- : [427/884] 1070696=command_line_test I, [2024-05-03T00:49:50.907285 #1029333] INFO -- : [428/884] 1070696=test_project_sanity I, [2024-05-03T00:49:50.914672 #1029333] INFO -- : [429/884] 1070697=test_range I, [2024-05-03T00:49:50.966367 #1029333] INFO -- : [430/884] 1070692=test_rdoc_ri_paths I, [2024-05-03T00:49:50.973750 #1029333] INFO -- : [431/884] 1070696=library_symbols_test I, [2024-05-03T00:49:50.985915 #1029333] INFO -- : [432/884] 1070696=test_locale I, [2024-05-03T00:49:51.012989 #1029333] INFO -- : [433/884] 1070692=test_addr I, [2024-05-03T00:49:51.020818 #1029333] INFO -- : [434/884] 1070696=test_ensured I, [2024-05-03T00:49:51.034835 #1029333] INFO -- : [435/884] 1070692=test_ts I, [2024-05-03T00:49:51.090700 #1029333] INFO -- : [436/884] 1070696=test_mul I, [2024-05-03T00:49:51.095799 #1029333] INFO -- : [437/884] 1070696=test_null I, [2024-05-03T00:49:51.097686 #1029333] INFO -- : [438/884] 1070696=test_win32ole_type I, [2024-05-03T00:49:51.099809 #1029333] INFO -- : [439/884] 1070696=test_default_gems I, [2024-05-03T00:49:51.151320 #1029333] INFO -- : [440/884] 1070696=test_rdoc_markup_to_rdoc I, [2024-05-03T00:49:51.184072 #1029333] INFO -- : [441/884] 1070696=test_rdoc_rd_inline_parser I, [2024-05-03T00:49:51.211003 #1029333] INFO -- : [442/884] 1070696=test_rdoc_markup_attributes I, [2024-05-03T00:49:51.213645 #1029333] INFO -- : [443/884] 1070696=test_date_parse I, [2024-05-03T00:49:51.261966 #1029333] INFO -- : [444/884] 1070687=test_trick I, [2024-05-03T00:49:51.324288 #1029333] INFO -- : [445/884] 1070696=test_thread I, [2024-05-03T00:49:51.327880 #1029333] INFO -- : [446/884] 1070696=test_pipe I, [2024-05-03T00:49:51.420962 #1029333] INFO -- : [447/884] 1070697=test_pkey_ec I, [2024-05-03T00:49:51.455114 #1029333] INFO -- : [448/884] 1070683=test_io_buffer I, [2024-05-03T00:49:51.470100 #1029333] INFO -- : [449/884] 1070696=test_key_name_check I, [2024-05-03T00:49:51.479100 #1029333] INFO -- : [450/884] 1070696=test_defined I, [2024-05-03T00:49:51.487518 #1029333] INFO -- : [451/884] 1070697=test_backtrace I, [2024-05-03T00:49:51.490253 #1029333] INFO -- : [452/884] 1070697=test_rdoc_i18n_text I, [2024-05-03T00:49:51.493654 #1029333] INFO -- : [453/884] 1070683=test_windows_1251 I, [2024-05-03T00:49:51.497296 #1029333] INFO -- : [454/884] 1070697=test_time I, [2024-05-03T00:49:51.497673 #1029333] INFO -- : [455/884] 1070683=test_rdoc_rdoc I, [2024-05-03T00:49:51.541813 #1029333] INFO -- : [456/884] 1070692=test_gem_uninstaller I, [2024-05-03T00:49:51.567444 #1029333] INFO -- : [457/884] 1070696=test_gb18030 I, [2024-05-03T00:49:51.584630 #1029333] INFO -- : [458/884] 1070696=test_buffering I, [2024-05-03T00:49:51.585546 #1029333] INFO -- : [459/884] 1070683=test_svcb_https I, [2024-05-03T00:49:51.589589 #1029333] INFO -- : [460/884] 1070696=test_egrep_cpp I, [2024-05-03T00:49:51.597749 #1029333] INFO -- : [461/884] 1070683=test_zlib I, [2024-05-03T00:49:51.629584 #1029333] INFO -- : [462/884] 1070697=test_cgi_tag_helper I, [2024-05-03T00:49:51.653325 #1029333] INFO -- : [463/884] 1070697=test_date_conv I, [2024-05-03T00:49:51.659974 #1029333] INFO -- : [464/884] 1070697=test_optimization I, [2024-05-03T00:49:51.697998 #1029333] INFO -- : [465/884] 1070696=test_ole_methods I, [2024-05-03T00:49:51.699597 #1029333] INFO -- : [466/884] 1070696=test_erb_m17n I, [2024-05-03T00:49:51.710134 #1029333] INFO -- : [467/884] 1070696=test_gc_compact I, [2024-05-03T00:49:51.749040 #1029333] INFO -- : [468/884] 1070689=test_proc I, [2024-05-03T00:49:51.820259 #1029333] INFO -- : [469/884] 1070686=test_string I, [2024-05-03T00:49:52.496588 #1029333] INFO -- : [470/884] 1070689=test_gem_package_old I, [2024-05-03T00:49:52.507315 #1029333] INFO -- : [471/884] 1070688=test_gem_resolver_index_set I, [2024-05-03T00:49:52.545011 #1029333] INFO -- : [472/884] 1070689=test_gem_validator I, [2024-05-03T00:49:52.585918 #1029333] INFO -- : [473/884] 1070690=test_rdoc_markup_parser I, [2024-05-03T00:49:52.588979 #1029333] INFO -- : [474/884] 1070701=test_require_path_check I, [2024-05-03T00:49:52.590231 #1029333] INFO -- : [475/884] 1070689=test_folderitem2_invokeverb I, [2024-05-03T00:49:52.595682 #1029333] INFO -- : [476/884] 1070689=test_files_test_2 I, [2024-05-03T00:49:52.630466 #1029333] INFO -- : [477/884] 1070690=test_fnmatch I, [2024-05-03T00:49:52.661929 #1029333] INFO -- : [478/884] 1070701=test_rdoc_stats I, [2024-05-03T00:49:52.679637 #1029333] INFO -- : [479/884] 1070690=test_pattern_matching I, [2024-05-03T00:49:52.702913 #1029333] INFO -- : [480/884] 1070701=test_string I, [2024-05-03T00:49:52.716313 #1029333] INFO -- : [481/884] 1070690=test_rdoc_store I, [2024-05-03T00:49:52.719828 #1029333] INFO -- : [482/884] 1070692=test_raise I, [2024-05-03T00:49:52.721924 #1029333] INFO -- : [483/884] 1070692=test_x509attr I, [2024-05-03T00:49:52.723959 #1029333] INFO -- : [484/884] 1070688=test_depth_first I, [2024-05-03T00:49:52.739286 #1029333] INFO -- : [485/884] 1070692=test_gem_request_set_lockfile_parser I, [2024-05-03T00:49:52.742259 #1029333] INFO -- : [486/884] 1070701=test_custom_command I, [2024-05-03T00:49:52.753762 #1029333] INFO -- : [487/884] 1070688=json_addition_test I, [2024-05-03T00:49:52.780766 #1029333] INFO -- : [488/884] 1070688=test_gem_dependency_resolution_error I, [2024-05-03T00:49:52.786003 #1029333] INFO -- : [489/884] 1070688=test_rdoc_parser I, [2024-05-03T00:49:52.806692 #1029333] INFO -- : [490/884] 1070688=test_qsort I, [2024-05-03T00:49:52.809858 #1029333] INFO -- : [491/884] 1070688=test_hmac I, [2024-05-03T00:49:52.820735 #1029333] INFO -- : [492/884] 1070688=test_rdoc_markup_to_tt_only I, [2024-05-03T00:49:52.845632 #1029333] INFO -- : [493/884] 1070688=test_rdoc_tom_doc I, [2024-05-03T00:49:52.860307 #1029333] INFO -- : [494/884] 1070688=test_numeric I, [2024-05-03T00:49:52.865724 #1029333] INFO -- : [495/884] 1070701=test_gem_commands_lock_command I, [2024-05-03T00:49:52.888689 #1029333] INFO -- : [496/884] 1070692=test_assignment I, [2024-05-03T00:49:52.898591 #1029333] INFO -- : [497/884] 1070701=test_ifunless I, [2024-05-03T00:49:52.904868 #1029333] INFO -- : [498/884] 1070701=test_key_actor_vi I, [2024-05-03T00:49:52.928955 #1029333] INFO -- : [499/884] 1070688=test_bug-3571 I, [2024-05-03T00:49:52.942366 #1029333] INFO -- : [500/884] 1070688=test_gem_command I, [2024-05-03T00:49:53.032911 #1029333] INFO -- : [501/884] 1070701=test_gem_spec_fetcher I, [2024-05-03T00:49:53.044882 #1029333] INFO -- : [502/884] 1070688=test_common I, [2024-05-03T00:49:53.174797 #1029333] INFO -- : [503/884] 1070684=test_rdoc_token_stream I, [2024-05-03T00:49:53.177707 #1029333] INFO -- : [504/884] 1070684=test_address_resolve I, [2024-05-03T00:49:53.216335 #1029333] INFO -- : [505/884] 1070684=test_config I, [2024-05-03T00:49:53.217300 #1029333] INFO -- : [506/884] 1070701=test_optarg I, [2024-05-03T00:49:53.242128 #1029333] INFO -- : [507/884] 1070688=test_yaml_special_cases I, [2024-05-03T00:49:53.250684 #1029333] INFO -- : [508/884] 1070688=test_gem_source_list I, [2024-05-03T00:49:53.292987 #1029333] INFO -- : [509/884] 1070684=test_rdoc_single_class I, [2024-05-03T00:49:53.298175 #1029333] INFO -- : [510/884] 1070688=test_nil I, [2024-05-03T00:49:53.304073 #1029333] INFO -- : [511/884] 1070688=test_num2int I, [2024-05-03T00:49:53.312607 #1029333] INFO -- : [512/884] 1070684=test_verbose I, [2024-05-03T00:49:53.317116 #1029333] INFO -- : [513/884] 1070688=test_frozen I, [2024-05-03T00:49:53.320345 #1029333] INFO -- : [514/884] 1070688=test_gem_ext_configure_builder I, [2024-05-03T00:49:53.338124 #1029333] INFO -- : [515/884] 1070684=test_pp I, [2024-05-03T00:49:53.355048 #1029333] INFO -- : [516/884] 1070688=test_macro I, [2024-05-03T00:49:53.361740 #1029333] INFO -- : [517/884] 1070701=test_iter_break I, [2024-05-03T00:49:53.366538 #1029333] INFO -- : [518/884] 1070701=test_zsh_completion I, [2024-05-03T00:49:53.368088 #1029333] INFO -- : [519/884] 1070701=test_exception I, [2024-05-03T00:49:53.374170 #1029333] INFO -- : [520/884] 1070701=test_bug-5832 I, [2024-05-03T00:49:53.377998 #1029333] INFO -- : [521/884] 1070701=test_files_ext I, [2024-05-03T00:49:53.406706 #1029333] INFO -- : [522/884] 1070684=test_emitter I, [2024-05-03T00:49:53.408556 #1029333] INFO -- : [523/884] 1070684=test_gem_silent_ui I, [2024-05-03T00:49:53.410169 #1029333] INFO -- : [524/884] 1070688=test_kdf I, [2024-05-03T00:49:53.443633 #1029333] INFO -- : [525/884] 1070684=test_gem_doctor I, [2024-05-03T00:49:53.467951 #1029333] INFO -- : [526/884] 1070701=test_kernel I, [2024-05-03T00:49:53.486056 #1029333] INFO -- : [527/884] 1070684=test_eval_history I, [2024-05-03T00:49:53.497093 #1029333] INFO -- : [528/884] 1070688=dispatcher_test I, [2024-05-03T00:49:53.518189 #1029333] INFO -- : [529/884] 1070690=!Nothing_to_test I, [2024-05-03T00:49:53.520333 #1029333] INFO -- : [530/884] 1070690=test_enc_raise I, [2024-05-03T00:49:53.527394 #1029333] INFO -- : [531/884] 1070690=test_psych I, [2024-05-03T00:49:53.535941 #1029333] INFO -- : [532/884] 1070684=test_rdoc_markup_paragraph I, [2024-05-03T00:49:53.542377 #1029333] INFO -- : [533/884] 1070690=test_object_create_start I, [2024-05-03T00:49:53.544529 #1029333] INFO -- : [534/884] 1070684=test_gem_ext_cargo_builder_unit I, [2024-05-03T00:49:53.549196 #1029333] INFO -- : [535/884] 1070690=test_gem_rdoc I, [2024-05-03T00:49:53.564312 #1029333] INFO -- : [536/884] 1070684=test_date I, [2024-05-03T00:49:53.571935 #1029333] INFO -- : [537/884] 1070684=test_at_exit I, [2024-05-03T00:49:53.594746 #1029333] INFO -- : [538/884] 1070684=test_command I, [2024-05-03T00:49:53.606196 #1029333] INFO -- : [539/884] 1070688=test_http I, [2024-05-03T00:49:53.619885 #1029333] INFO -- : [540/884] 1070688=test_gem_commands_which_command I, [2024-05-03T00:49:53.639559 #1029333] INFO -- : [541/884] 1070690=test_shift_jis I, [2024-05-03T00:49:53.652031 #1029333] INFO -- : [542/884] 1070690=test_flags I, [2024-05-03T00:49:53.658295 #1029333] INFO -- : [543/884] 1070688=test_inadvertent_creation I, [2024-05-03T00:49:53.765129 #1029333] INFO -- : [544/884] 1070688=test_enumerator I, [2024-05-03T00:49:53.838941 #1029333] INFO -- : [545/884] 1070684=test_gem_commands_specification_command I, [2024-05-03T00:49:53.934311 #1029333] INFO -- : [546/884] 1070687=test_gem_commands_dependency_command I, [2024-05-03T00:49:53.941217 #1029333] INFO -- : [547/884] 1070701=test_gem_resolver I, [2024-05-03T00:49:53.955438 #1029333] INFO -- : [548/884] 1070684=test_gem_resolver_composed_set I, [2024-05-03T00:49:53.963846 #1029333] INFO -- : [549/884] 1070695=test_safe_load I, [2024-05-03T00:49:53.970680 #1029333] INFO -- : [550/884] 1070695=test_rdoc_markup_attribute_manager I, [2024-05-03T00:49:53.975000 #1029333] INFO -- : [551/884] 1070684=test_name_error I, [2024-05-03T00:49:53.997523 #1029333] INFO -- : [552/884] 1070695=test_rdoc_parser_ruby I, [2024-05-03T00:49:54.017234 #1029333] INFO -- : [553/884] 1070687=test_httpresponse I, [2024-05-03T00:49:54.038671 #1029333] INFO -- : [554/884] 1070687=test_open-uri I, [2024-05-03T00:49:54.108335 #1029333] INFO -- : [555/884] 1070684=test_rdoc_context I, [2024-05-03T00:49:54.200684 #1029333] INFO -- : [556/884] 1070701=test_nil2vtempty I, [2024-05-03T00:49:54.206513 #1029333] INFO -- : [557/884] 1070701=test_stream I, [2024-05-03T00:49:54.214771 #1029333] INFO -- : [558/884] 1070701=test_tcp I, [2024-05-03T00:49:54.263168 #1029333] INFO -- : [559/884] 1070701=test_iso_8859 I, [2024-05-03T00:49:54.283389 #1029333] INFO -- : [560/884] 1070701=test_rdoc_text I, [2024-05-03T00:49:54.326331 #1029333] INFO -- : [561/884] 1070701=test_syntax I, [2024-05-03T00:49:54.391188 #1029333] INFO -- : [562/884] 1070687=test_gem_safe_yaml I, [2024-05-03T00:49:54.401392 #1029333] INFO -- : [563/884] 1070687=test_require I, [2024-05-03T00:49:54.405867 #1029333] INFO -- : [564/884] 1070687=test_date_time I, [2024-05-03T00:49:54.414590 #1029333] INFO -- : [565/884] 1070687=test_rdoc_markup_to_joined_paragraph I, [2024-05-03T00:49:54.420613 #1029333] INFO -- : [566/884] 1070687=test_data I, [2024-05-03T00:49:54.426509 #1029333] INFO -- : [567/884] 1070687=test_date_new I, [2024-05-03T00:49:54.434570 #1029333] INFO -- : [568/884] 1070687=index_write_test I, [2024-05-03T00:49:54.438462 #1029333] INFO -- : [569/884] 1070687=test_securerandom I, [2024-05-03T00:49:54.469096 #1029333] INFO -- : [570/884] 1070687=test_logperiod I, [2024-05-03T00:49:54.481981 #1029333] INFO -- : [571/884] 1070687=test_c_union_entity I, [2024-05-03T00:49:54.526687 #1029333] INFO -- : [572/884] 1070694=test_rdoc_normal_module I, [2024-05-03T00:49:54.555968 #1029333] INFO -- : [573/884] 1070695=test_rdoc_markdown_test I, [2024-05-03T00:49:54.561852 #1029333] INFO -- : [574/884] 1070687=test_singleton I, [2024-05-03T00:49:54.564940 #1029333] INFO -- : [575/884] 1070687=test_flush I, [2024-05-03T00:49:54.568381 #1029333] INFO -- : [576/884] 1070687=test_io_console I, [2024-05-03T00:49:54.607710 #1029333] INFO -- : [577/884] 1070694=test_switch_hitter I, [2024-05-03T00:49:54.616221 #1029333] INFO -- : [578/884] 1070683=newline_test I, [2024-05-03T00:49:54.623754 #1029333] INFO -- : [579/884] 1070694=test_uncorrectable_name_check I, [2024-05-03T00:49:54.633023 #1029333] INFO -- : [580/884] 1070694=test_stringchar I, [2024-05-03T00:49:54.644018 #1029333] INFO -- : [581/884] 1070690=test_hash_create I, [2024-05-03T00:49:54.646071 #1029333] INFO -- : [582/884] 1070690=test_passing_block I, [2024-05-03T00:49:54.650790 #1029333] INFO -- : [583/884] 1070690=test_thread_fd_close I, [2024-05-03T00:49:54.658289 #1029333] INFO -- : [584/884] 1070690=test_last_thread I, [2024-05-03T00:49:54.709612 #1029333] INFO -- : [585/884] 1070692=test_process I, [2024-05-03T00:49:54.726762 #1029333] INFO -- : [586/884] 1070683=test_pack I, [2024-05-03T00:49:54.731339 #1029333] INFO -- : [587/884] 1070694=test_gem_source_local I, [2024-05-03T00:49:54.731502 #1029333] INFO -- : [588/884] 1070696=test_gem_security_policy I, [2024-05-03T00:49:54.954874 #1029333] INFO -- : [589/884] 1070683=test_arity I, [2024-05-03T00:49:54.963066 #1029333] INFO -- : [590/884] 1070683=test_gem_ext_rake_builder I, [2024-05-03T00:49:54.992148 #1029333] INFO -- : [591/884] 1070684=test_logdevice I, [2024-05-03T00:49:55.013765 #1029333] INFO -- : [592/884] 1070696=test_gem_resolver_lock_specification I, [2024-05-03T00:49:55.041394 #1029333] INFO -- : [593/884] 1070696=test_err_in_callback I, [2024-05-03T00:49:55.045678 #1029333] INFO -- : [594/884] 1070685=test_x509cert I, [2024-05-03T00:49:55.047453 #1029333] INFO -- : [595/884] 1070696=test_gc I, [2024-05-03T00:49:55.220960 #1029333] INFO -- : [596/884] 1070694=test_case I, [2024-05-03T00:49:55.229164 #1029333] INFO -- : [597/884] 1070694=test_pkey I, [2024-05-03T00:49:55.261755 #1029333] INFO -- : [598/884] 1070682=test_parser_events I, [2024-05-03T00:49:55.273704 #1029333] INFO -- : [599/884] 1070694=test_reline I, [2024-05-03T00:49:55.329350 #1029333] INFO -- : [600/884] 1070682=test_cclass I, [2024-05-03T00:49:55.339158 #1029333] INFO -- : [601/884] 1070695=test_grapheme_breaks I, [2024-05-03T00:49:55.356257 #1029333] INFO -- : [602/884] 1070685=test_gem_version_option I, [2024-05-03T00:49:55.371798 #1029333] INFO -- : [603/884] 1070695=test_gem_request_connection_pools I, [2024-05-03T00:49:55.418591 #1029333] INFO -- : [604/884] 1070685=test_m17n_comb I, [2024-05-03T00:49:55.447427 #1029333] INFO -- : [605/884] 1070694=test_memory_view I, [2024-05-03T00:49:55.465597 #1029333] INFO -- : [606/884] 1070682=test_ractor I, [2024-05-03T00:49:55.531016 #1029333] INFO -- : [607/884] 1070682=test_ansi_with_terminfo I, [2024-05-03T00:49:55.532630 #1029333] INFO -- : [608/884] 1070682=test_rdoc_generator_pot_po I, [2024-05-03T00:49:55.534434 #1029333] INFO -- : [609/884] 1070682=test_rdoc_markup_to_markdown I, [2024-05-03T00:49:55.570303 #1029333] INFO -- : [610/884] 1070682=test_json_tree I, [2024-05-03T00:49:55.581591 #1029333] INFO -- : [611/884] 1070682=test_ractor I, [2024-05-03T00:49:55.590476 #1029333] INFO -- : [612/884] 1070694=test_severity I, [2024-05-03T00:49:55.596000 #1029333] INFO -- : [613/884] 1070682=test_gem_install_update_options I, [2024-05-03T00:49:55.606120 #1029333] INFO -- : [614/884] 1070694=parse_test I, [2024-05-03T00:49:55.645710 #1029333] INFO -- : [615/884] 1070683=test_require_lib I, [2024-05-03T00:49:55.691390 #1029333] INFO -- : [616/884] 1070689=test_rdoc_generator_ri I, [2024-05-03T00:49:55.700873 #1029333] INFO -- : [617/884] 1070689=test_extlibs I, [2024-05-03T00:49:55.729845 #1029333] INFO -- : [618/884] 1070682=test_gem_stream_ui I, [2024-05-03T00:49:55.730925 #1029333] INFO -- : [619/884] 1070690=test_literal I, [2024-05-03T00:49:55.742372 #1029333] INFO -- : [620/884] 1070684=test_dot_dot I, [2024-05-03T00:49:55.746653 #1029333] INFO -- : [621/884] 1070684=test_c_struct_builder I, [2024-05-03T00:49:55.831779 #1029333] INFO -- : [622/884] 1070682=test_str2big I, [2024-05-03T00:49:55.837273 #1029333] INFO -- : [623/884] 1070682=test_rdoc_markup_to_table_of_contents I, [2024-05-03T00:49:55.859165 #1029333] INFO -- : [624/884] 1070682=test_objectspace I, [2024-05-03T00:49:55.938208 #1029333] INFO -- : [625/884] 1070684=test_thread I, [2024-05-03T00:49:56.152935 #1029333] INFO -- : [626/884] 1070684=test_socket I, [2024-05-03T00:49:56.278982 #1029333] INFO -- : [627/884] 1070690=test_rdoc_cross_reference I, [2024-05-03T00:49:56.333104 #1029333] INFO -- : [628/884] 1070700=test_gem_commands_info_command I, [2024-05-03T00:49:56.392596 #1029333] INFO -- : [629/884] 1070700=test_gem_dependency_installer I, [2024-05-03T00:49:56.412814 #1029333] INFO -- : [630/884] 1070695=test_scalar I, [2024-05-03T00:49:56.418812 #1029333] INFO -- : [631/884] 1070695=test_case_options I, [2024-05-03T00:49:56.422498 #1029333] INFO -- : [632/884] 1070695=test_store I, [2024-05-03T00:49:56.560403 #1029333] INFO -- : [633/884] 1070690=test_exception I, [2024-05-03T00:49:56.583431 #1029333] INFO -- : [634/884] 1070699=test_bug_reporter I, [2024-05-03T00:49:56.638302 #1029333] INFO -- : [635/884] 1070695=test_gem_package_tar_reader_entry I, [2024-05-03T00:49:56.770504 #1029333] INFO -- : [636/884] 1070682=test_gem_name_tuple I, [2024-05-03T00:49:56.796889 #1029333] INFO -- : [637/884] 1070682=test_rand I, [2024-05-03T00:49:56.843621 #1029333] INFO -- : [638/884] 1070695=test_gem_ext_cargo_builder_link_flag_converter I, [2024-05-03T00:49:56.924680 #1029333] INFO -- : [639/884] 1070695=test_gem_commands_mirror I, [2024-05-03T00:49:56.934103 #1029333] INFO -- : [640/884] 1070695=test_method_cache I, [2024-05-03T00:49:56.939935 #1029333] INFO -- : [641/884] 1070695=test_gem_request I, [2024-05-03T00:49:56.997121 #1029333] INFO -- : [642/884] 1070699=test_sprintf_comb I, [2024-05-03T00:49:57.096847 #1029333] INFO -- : [643/884] 1070682=test_win32ole I, [2024-05-03T00:49:57.108073 #1029333] INFO -- : [644/884] 1070682=test_generic I, [2024-05-03T00:49:57.117819 #1029333] INFO -- : [645/884] 1070695=test_scan_args I, [2024-05-03T00:49:57.125661 #1029333] INFO -- : [646/884] 1070699=test_enumerator_kw I, [2024-05-03T00:49:57.130452 #1029333] INFO -- : [647/884] 1070695=test_gem_text I, [2024-05-03T00:49:57.138159 #1029333] INFO -- : [648/884] 1070699=test_settracefunc I, [2024-05-03T00:49:57.168821 #1029333] INFO -- : [649/884] 1070682=test_cgi_util I, [2024-05-03T00:49:57.186059 #1029333] INFO -- : [650/884] 1070695=test_require I, [2024-05-03T00:49:57.250868 #1029333] INFO -- : [651/884] 1070687=test_gem_ext_cmake_builder I, [2024-05-03T00:49:57.276658 #1029333] INFO -- : [652/884] 1070687=test_gem_commands_contents_command I, [2024-05-03T00:49:57.396670 #1029333] INFO -- : [653/884] 1070687=test_digest I, [2024-05-03T00:49:57.473772 #1029333] INFO -- : [654/884] 1070682=test_marshalable I, [2024-05-03T00:49:57.479396 #1029333] INFO -- : [655/884] 1070682=test_find I, [2024-05-03T00:49:57.524607 #1029333] INFO -- : [656/884] 1070682=test_ractor I, [2024-05-03T00:49:57.562543 #1029333] INFO -- : [657/884] 1070689=test_wss I, [2024-05-03T00:49:57.570059 #1029333] INFO -- : [658/884] 1070689=test_fiddle I, [2024-05-03T00:49:57.639651 #1029333] INFO -- : [659/884] 1070689=test_file I, [2024-05-03T00:49:57.644362 #1029333] INFO -- : [660/884] 1070689=test_rdoc_markdown I, [2024-05-03T00:49:57.742091 #1029333] INFO -- : [661/884] 1070682=test_gem_available_set I, [2024-05-03T00:49:57.869625 #1029333] INFO -- : [662/884] 1070684=test_rdoc_any_method I, [2024-05-03T00:49:57.905608 #1029333] INFO -- : [663/884] 1070689=test_modify_expand I, [2024-05-03T00:49:57.915293 #1029333] INFO -- : [664/884] 1070682=test_complexrational I, [2024-05-03T00:49:57.927271 #1029333] INFO -- : [665/884] 1070689=test_init I, [2024-05-03T00:49:57.935994 #1029333] INFO -- : [666/884] 1070682=test_pathname I, [2024-05-03T00:49:58.098727 #1029333] INFO -- : [667/884] 1070685=test_rdoc_encoding I, [2024-05-03T00:49:58.142868 #1029333] INFO -- : [668/884] 1070682=test_coverage I, [2024-05-03T00:49:58.145544 #1029333] INFO -- : [669/884] 1070685=regexp_test I, [2024-05-03T00:49:58.172565 #1029333] INFO -- : [670/884] 1070685=test_gem_package_tar_reader I, [2024-05-03T00:49:58.179975 #1029333] INFO -- : [671/884] 1070699=test_gem_source_vendor I, [2024-05-03T00:49:58.189104 #1029333] INFO -- : [672/884] 1070699=test_gem_commands_owner_command I, [2024-05-03T00:49:58.221146 #1029333] INFO -- : [673/884] 1070685=test_recorder I, [2024-05-03T00:49:58.230394 #1029333] INFO -- : [674/884] 1070685=test_bash_completion I, [2024-05-03T00:49:58.236484 #1029333] INFO -- : [675/884] 1070685=test_formatter I, [2024-05-03T00:49:58.244051 #1029333] INFO -- : [676/884] 1070684=test_deprecate I, [2024-05-03T00:49:58.244193 #1029333] INFO -- : [677/884] 1070685=test_rdoc_constant I, [2024-05-03T00:49:58.283825 #1029333] INFO -- : [678/884] 1070684=test_wait I, [2024-05-03T00:49:58.340561 #1029333] INFO -- : [679/884] 1070687=test_handle I, [2024-05-03T00:49:58.351340 #1029333] INFO -- : [680/884] 1070684=test_yaml I, [2024-05-03T00:49:58.382870 #1029333] INFO -- : [681/884] 1070685=test_forwardable I, [2024-05-03T00:49:58.412782 #1029333] INFO -- : [682/884] 1070685=test_big2str I, [2024-05-03T00:49:58.419233 #1029333] INFO -- : [683/884] 1070685=test_gem_commands_sources_command I, [2024-05-03T00:49:58.448848 #1029333] INFO -- : [684/884] 1070689=test_ansi_without_terminfo I, [2024-05-03T00:49:58.452397 #1029333] INFO -- : [685/884] 1070684=test_bmethod I, [2024-05-03T00:49:58.457007 #1029333] INFO -- : [686/884] 1070689=test_ractor I, [2024-05-03T00:49:58.468359 #1029333] INFO -- : [687/884] 1070684=test_euc_tw I, [2024-05-03T00:49:58.472562 #1029333] INFO -- : [688/884] 1070689=test_rdoc_markup_formatter I, [2024-05-03T00:49:58.479824 #1029333] INFO -- : [689/884] 1070684=test_nowrite I, [2024-05-03T00:49:58.482244 #1029333] INFO -- : [690/884] 1070689=test_thread_queue I, [2024-05-03T00:49:58.499263 #1029333] INFO -- : [691/884] 1070684=test_rdoc_parser_c I, [2024-05-03T00:49:58.603459 #1029333] INFO -- : [692/884] 1070694=test_comparable I, [2024-05-03T00:49:58.609083 #1029333] INFO -- : [693/884] 1070694=test_shapes I, [2024-05-03T00:49:58.617628 #1029333] INFO -- : [694/884] 1070694=json_fixtures_test I, [2024-05-03T00:49:58.617953 #1029333] INFO -- : [695/884] 1070685=test_io_timeout I, [2024-05-03T00:49:58.623181 #1029333] INFO -- : [696/884] 1070685=test_profile_frames I, [2024-05-03T00:49:58.624768 #1029333] INFO -- : [697/884] 1070694=test_pstore I, [2024-05-03T00:49:58.637060 #1029333] INFO -- : [698/884] 1070697=test_cstr I, [2024-05-03T00:49:58.640133 #1029333] INFO -- : [699/884] 1070695=test_enc_str_buf_cat I, [2024-05-03T00:49:58.650182 #1029333] INFO -- : [700/884] 1070695=test_gbk I, [2024-05-03T00:49:58.655698 #1029333] INFO -- : [701/884] 1070695=test_class2name I, [2024-05-03T00:49:58.665020 #1029333] INFO -- : [702/884] 1070695=test_too_many_dummy_encodings I, [2024-05-03T00:49:58.672291 #1029333] INFO -- : [703/884] 1070694=test_rdoc_include I, [2024-05-03T00:49:58.701364 #1029333] INFO -- : [704/884] 1070687=test_reqarg I, [2024-05-03T00:49:58.708914 #1029333] INFO -- : [705/884] 1070690=test_gem_commands_list_command I, [2024-05-03T00:49:58.715827 #1029333] INFO -- : [706/884] 1070694=test_stack I, [2024-05-03T00:49:58.720542 #1029333] INFO -- : [707/884] 1070690=test_emitter I, [2024-05-03T00:49:58.723471 #1029333] INFO -- : [708/884] 1070690=test_resource I, [2024-05-03T00:49:58.734935 #1029333] INFO -- : [709/884] 1070695=test_gem_commands_signin_command I, [2024-05-03T00:49:58.757938 #1029333] INFO -- : [710/884] 1070699=test_ldap I, [2024-05-03T00:49:58.777913 #1029333] INFO -- : [711/884] 1070699=test_string_processing I, [2024-05-03T00:49:58.786180 #1029333] INFO -- : [712/884] 1070684=test_fileutils I, [2024-05-03T00:49:58.789106 #1029333] INFO -- : [713/884] 1070690=test_rdoc_options I, [2024-05-03T00:49:58.800559 #1029333] INFO -- : [714/884] 1070685=test_econv I, [2024-05-03T00:49:58.817697 #1029333] INFO -- : [715/884] 1070695=test_cesu8 I, [2024-05-03T00:49:58.825233 #1029333] INFO -- : [716/884] 1070695=test_gem_version I, [2024-05-03T00:49:58.828434 #1029333] INFO -- : [717/884] 1070699=test_gem_resolver_specification I, [2024-05-03T00:49:58.878766 #1029333] INFO -- : [718/884] 1070699=test_gem_dependency I, [2024-05-03T00:49:58.908391 #1029333] INFO -- : [719/884] 1070695=test_path_to_class I, [2024-05-03T00:49:58.914259 #1029333] INFO -- : [720/884] 1070695=test_inlinecache I, [2024-05-03T00:49:58.982448 #1029333] INFO -- : [721/884] 1070695=test_rdoc_markup_verbatim I, [2024-05-03T00:49:58.984287 #1029333] INFO -- : [722/884] 1070695=test_gem_commands_search_command I, [2024-05-03T00:49:58.990176 #1029333] INFO -- : [723/884] 1070699=test_complex I, [2024-05-03T00:49:58.993251 #1029333] INFO -- : [724/884] 1070695=test_gem_ext_ext_conf_builder I, [2024-05-03T00:49:59.045407 #1029333] INFO -- : [725/884] 1070682=test_frozen_error I, [2024-05-03T00:49:59.048617 #1029333] INFO -- : [726/884] 1070682=test_method_cache I, [2024-05-03T00:49:59.049884 #1029333] INFO -- : [727/884] 1070690=test_gem_stub_specification I, [2024-05-03T00:49:59.055644 #1029333] INFO -- : [728/884] 1070682=test_gem_resolver_installed_specification I, [2024-05-03T00:49:59.056368 #1029333] INFO -- : [729/884] 1070700=test_scanner_events I, [2024-05-03T00:49:59.069713 #1029333] INFO -- : [730/884] 1070682=test_gem_remote_fetcher I, [2024-05-03T00:49:59.112300 #1029333] INFO -- : [731/884] 1070700=test_mdns I, [2024-05-03T00:49:59.119878 #1029333] INFO -- : [732/884] 1070700=test_parse I, [2024-05-03T00:49:59.147040 #1029333] INFO -- : [733/884] 1070699=test_gem_installer I, [2024-05-03T00:49:59.163186 #1029333] INFO -- : [734/884] 1070687=test_yamlstore I, [2024-05-03T00:49:59.171535 #1029333] INFO -- : [735/884] 1070687=test_date_strftime I, [2024-05-03T00:49:59.199106 #1029333] INFO -- : [736/884] 1070690=test_rdoc_parser_rd I, [2024-05-03T00:49:59.227076 #1029333] INFO -- : [737/884] 1070690=test_irb I, [2024-05-03T00:49:59.299930 #1029333] INFO -- : [738/884] 1070684=test_random I, [2024-05-03T00:49:59.301231 #1029333] INFO -- : [739/884] 1070684=test_asn1 I, [2024-05-03T00:49:59.333754 #1029333] INFO -- : [740/884] 1070684=test_class I, [2024-05-03T00:49:59.342127 #1029333] INFO -- : [741/884] 1070683=test_rdoc_normal_class I, [2024-05-03T00:49:59.425020 #1029333] INFO -- : [742/884] 1070683=test_const I, [2024-05-03T00:49:59.425540 #1029333] INFO -- : [743/884] 1070683=json_string_matching_test I, [2024-05-03T00:49:59.437343 #1029333] INFO -- : [744/884] 1070683=test_load I, [2024-05-03T00:49:59.440295 #1029333] INFO -- : [745/884] 1070691=parse_comments_test I, [2024-05-03T00:49:59.468599 #1029333] INFO -- : [746/884] 1070690=test_noarg I, [2024-05-03T00:49:59.480078 #1029333] INFO -- : [747/884] 1070683=test_tempfile I, [2024-05-03T00:49:59.511174 #1029333] INFO -- : [748/884] 1070691=test_function I, [2024-05-03T00:49:59.523555 #1029333] INFO -- : [749/884] 1070687=test_queue I, [2024-05-03T00:49:59.529793 #1029333] INFO -- : [750/884] 1070687=test_gem_resolver_index_specification I, [2024-05-03T00:49:59.581324 #1029333] INFO -- : [751/884] 1070697=test_internal_ivar I, [2024-05-03T00:49:59.585014 #1029333] INFO -- : [752/884] 1070687=test_gem_commands_help_command I, [2024-05-03T00:49:59.587929 #1029333] INFO -- : [753/884] 1070697=test_rdoc_markup I, [2024-05-03T00:49:59.596821 #1029333] INFO -- : [754/884] 1070697=test_prettyprint I, [2024-05-03T00:49:59.635810 #1029333] INFO -- : [755/884] 1070697=test_tracepoint I, [2024-05-03T00:49:59.684683 #1029333] INFO -- : [756/884] 1070687=test_utf32 I, [2024-05-03T00:49:59.691406 #1029333] INFO -- : [757/884] 1070690=test_basicsocket I, [2024-05-03T00:49:59.695627 #1029333] INFO -- : [758/884] 1070683=test_duplicate I, [2024-05-03T00:49:59.700767 #1029333] INFO -- : [759/884] 1070687=test_summary I, [2024-05-03T00:49:59.702155 #1029333] INFO -- : [760/884] 1070683=test_console_attr I, [2024-05-03T00:49:59.702539 #1029333] INFO -- : [761/884] 1070683=test_type_completor I, [2024-05-03T00:49:59.706029 #1029333] INFO -- : [762/884] 1070694=warnings_test I, [2024-05-03T00:49:59.706093 #1029333] INFO -- : [763/884] 1070683=test_kwargs I, [2024-05-03T00:49:59.709471 #1029333] INFO -- : [764/884] 1070690=test_io_wait I, [2024-05-03T00:49:59.718145 #1029333] INFO -- : [765/884] 1070683=test_gem_commands_exec_command I, [2024-05-03T00:49:59.721228 #1029333] INFO -- : [766/884] 1070694=test_date_attr I, [2024-05-03T00:49:59.726496 #1029333] INFO -- : [767/884] 1070694=test_ellipsize I, [2024-05-03T00:49:59.733695 #1029333] INFO -- : [768/884] 1070691=test_io I, [2024-05-03T00:49:59.735030 #1029333] INFO -- : [769/884] 1070700=test_ubf_async_safe I, [2024-05-03T00:49:59.740363 #1029333] INFO -- : [770/884] 1070694=test_hash I, [2024-05-03T00:49:59.741937 #1029333] INFO -- : [771/884] 1070700=test_sorted_set I, [2024-05-03T00:49:59.784579 #1029333] INFO -- : [772/884] 1070687=test_win32ole_type_event I, [2024-05-03T00:49:59.786057 #1029333] INFO -- : [773/884] 1070687=test_emoji I, [2024-05-03T00:49:59.819956 #1029333] INFO -- : [774/884] 1070687=test_win32ole_record I, [2024-05-03T00:49:59.822548 #1029333] INFO -- : [775/884] 1070687=test_gem_unsatisfiable_dependency_error I, [2024-05-03T00:49:59.840054 #1029333] INFO -- : [776/884] 1070687=test_gem_commands_uninstall_command I, [2024-05-03T00:49:59.872391 #1029333] INFO -- : [777/884] 1070697=test_gem_source_specific_file I, [2024-05-03T00:49:59.876872 #1029333] INFO -- : [778/884] 1070685=test_foreach I, [2024-05-03T00:49:59.882854 #1029333] INFO -- : [779/884] 1070685=test_condition I, [2024-05-03T00:49:59.883725 #1029333] INFO -- : [780/884] 1070685=test_cp949 I, [2024-05-03T00:49:59.895096 #1029333] INFO -- : [781/884] 1070685=test_rdoc_rubygems_hook I, [2024-05-03T00:49:59.931549 #1029333] INFO -- : [782/884] 1070697=test_gem_commands_query_command I, [2024-05-03T00:49:59.984952 #1029333] INFO -- : [783/884] 1070685=test_method I, [2024-05-03T00:49:59.992391 #1029333] INFO -- : [784/884] 1070691=test_array_create I, [2024-05-03T00:49:59.994393 #1029333] INFO -- : [785/884] 1070691=test_pack I, [2024-05-03T00:50:00.018943 #1029333] INFO -- : [786/884] 1070700=test_gem_impossible_dependencies_error I, [2024-05-03T00:50:00.026060 #1029333] INFO -- : [787/884] 1070700=test_pattern_key_name_check I, [2024-05-03T00:50:00.028307 #1029333] INFO -- : [788/884] 1070700=test_to_ruby I, [2024-05-03T00:50:00.041265 #1029333] INFO -- : [789/884] 1070690=test_ftp I, [2024-05-03T00:50:00.055244 #1029333] INFO -- : [790/884] 1070700=test_rdoc_context_section I, [2024-05-03T00:50:00.058693 #1029333] INFO -- : [791/884] 1070690=test_euc_kr I, [2024-05-03T00:50:00.063608 #1029333] INFO -- : [792/884] 1070690=test_undef I, [2024-05-03T00:50:00.066263 #1029333] INFO -- : [793/884] 1070690=test_line_editor I, [2024-05-03T00:50:00.086440 #1029333] INFO -- : [794/884] 1070690=test_objspace I, [2024-05-03T00:50:00.206990 #1029333] INFO -- : [795/884] 1070700=ripper_test I, [2024-05-03T00:50:00.234411 #1029333] INFO -- : [796/884] 1070691=test_gem_security_trust_dir I, [2024-05-03T00:50:00.333609 #1029333] INFO -- : [797/884] 1070695=comments_test I, [2024-05-03T00:50:00.342402 #1029333] INFO -- : [798/884] 1070695=test_sprintf I, [2024-05-03T00:50:00.425540 #1029333] INFO -- : [799/884] 1070697=test_gem_requirement I, [2024-05-03T00:50:00.474880 #1029333] INFO -- : [800/884] 1070691=test_string_memory I, [2024-05-03T00:50:00.529315 #1029333] INFO -- : [801/884] 1070691=test_set I, [2024-05-03T00:50:00.537142 #1029333] INFO -- : [802/884] 1070697=test_show_source I, [2024-05-03T00:50:00.554779 #1029333] INFO -- : [803/884] 1070691=test_remote_fetch_error I, [2024-05-03T00:50:00.566370 #1029333] INFO -- : [804/884] 1070691=test_have_library I, [2024-05-03T00:50:00.567602 #1029333] INFO -- : [805/884] 1070697=test_c_struct_entry I, [2024-05-03T00:50:00.669440 #1029333] INFO -- : [806/884] 1070695=test_lock_native_thread I, [2024-05-03T00:50:00.674625 #1029333] INFO -- : [807/884] 1070687=test_gem_commands_stale_command I, [2024-05-03T00:50:00.678753 #1029333] INFO -- : [808/884] 1070700=test_postponed_job I, [2024-05-03T00:50:00.700225 #1029333] INFO -- : [809/884] 1070687=test_alias_and_anchor I, [2024-05-03T00:50:00.709868 #1029333] INFO -- : [810/884] 1070687=test_external_new I, [2024-05-03T00:50:00.714356 #1029333] INFO -- : [811/884] 1070687=test_tree_builder I, [2024-05-03T00:50:00.719391 #1029333] INFO -- : [812/884] 1070687=test_gem_resolver_dependency_request I, [2024-05-03T00:50:00.754352 #1029333] INFO -- : [813/884] 1070687=test_hash I, [2024-05-03T00:50:00.765472 #1029333] INFO -- : [814/884] 1070687=test_protect I, [2024-05-03T00:50:00.768988 #1029333] INFO -- : [815/884] 1070687=test_win32ole_typelib I, [2024-05-03T00:50:00.771459 #1029333] INFO -- : [816/884] 1070687=test_gem_request_set_lockfile I, [2024-05-03T00:50:00.795675 #1029333] INFO -- : [817/884] 1070683=test_raise_exception I, [2024-05-03T00:50:00.930499 #1029333] INFO -- : [818/884] 1070697=test_yjit I, [2024-05-03T00:50:00.936416 #1029333] INFO -- : [819/884] 1070697=test_workspace I, [2024-05-03T00:50:00.979926 #1029333] INFO -- : [820/884] 1070695=test_weakmap I, [2024-05-03T00:50:01.071915 #1029333] INFO -- : [821/884] 1070697=test_gem_commands_environment_command I, [2024-05-03T00:50:01.102916 #1029333] INFO -- : [822/884] 1070700=test_m17n I, [2024-05-03T00:50:01.128811 #1029333] INFO -- : [823/884] 1070697=test_ws I, [2024-05-03T00:50:01.142069 #1029333] INFO -- : [824/884] 1070697=test_argf I, [2024-05-03T00:50:01.173048 #1029333] INFO -- : [825/884] 1070700=test_kill_ring I, [2024-05-03T00:50:01.260037 #1029333] INFO -- : [826/884] 1070700=test_ns_spki I, [2024-05-03T00:50:01.262358 #1029333] INFO -- : [827/884] 1070687=test_framework I, [2024-05-03T00:50:01.287205 #1029333] INFO -- : [828/884] 1070687=test_backtrace I, [2024-05-03T00:50:01.307859 #1029333] INFO -- : [829/884] 1070700=test_pack I, [2024-05-03T00:50:01.324785 #1029333] INFO -- : [830/884] 1070682=ruby_parser_test I, [2024-05-03T00:50:01.328053 #1029333] INFO -- : [831/884] 1070700=test_io_buffer I, [2024-05-03T00:50:01.406404 #1029333] INFO -- : [832/884] 1070682=test_rdoc_task I, [2024-05-03T00:50:01.410397 #1029333] INFO -- : [833/884] 1070682=test_gem_resolver_conflict I, [2024-05-03T00:50:01.422962 #1029333] INFO -- : [834/884] 1070682=test_rdoc_markup_indented_paragraph I, [2024-05-03T00:50:01.441710 #1029333] INFO -- : [835/884] 1070701=locals_test I, [2024-05-03T00:50:01.442526 #1029333] INFO -- : [836/884] 1070682=test_rdoc_require I, [2024-05-03T00:50:01.444812 #1029333] INFO -- : [837/884] 1070700=test_gem_commands_install_command I, [2024-05-03T00:50:01.465221 #1029333] INFO -- : [838/884] 1070682=test_clone I, [2024-05-03T00:50:01.481145 #1029333] INFO -- : [839/884] 1070683=test_readpartial I, [2024-05-03T00:50:01.673285 #1029333] INFO -- : [840/884] 1070682=test_fstring I, [2024-05-03T00:50:01.800408 #1029333] INFO -- : [841/884] 1070691=test_optparse I, [2024-05-03T00:50:01.818468 #1029333] INFO -- : [842/884] 1070682=test_array I, [2024-05-03T00:50:01.825006 #1029333] INFO -- : [843/884] 1070682=test_webauthn_poller I, [2024-05-03T00:50:01.864063 #1029333] INFO -- : [844/884] 1070691=test_rdoc_markup_raw I, [2024-05-03T00:50:01.885460 #1029333] INFO -- : [845/884] 1070683=test_rat I, [2024-05-03T00:50:01.889152 #1029333] INFO -- : [846/884] 1070701=encoding_test I, [2024-05-03T00:50:01.895553 #1029333] INFO -- : [847/884] 1070683=test_gem_resolver_best_set I, [2024-05-03T00:50:01.949582 #1029333] INFO -- : [848/884] 1070683=test_typeddata I, [2024-05-03T00:50:01.971785 #1029333] INFO -- : [849/884] 1070682=test_rdoc_markup_to_html_crossref I, [2024-05-03T00:50:01.996550 #1029333] INFO -- : [850/884] 1070701=test_files_sample I, [2024-05-03T00:50:01.997662 #1029333] INFO -- : [851/884] 1070701=test_stringscanner I, [2024-05-03T00:50:02.021339 #1029333] INFO -- : [852/884] 1070691=parser_test I, [2024-05-03T00:50:02.022914 #1029333] INFO -- : [853/884] 1070691=test_convertible I, [2024-05-03T00:50:02.040395 #1029333] INFO -- : [854/884] 1070701=test_yield I, [2024-05-03T00:50:02.179934 #1029333] INFO -- : [855/884] 1070683=test_rdoc_alias I, [2024-05-03T00:50:02.192436 #1029333] INFO -- : [856/884] 1070684=test_pkcs12 I, [2024-05-03T00:50:02.197631 #1029333] INFO -- : [857/884] 1070683=test_system I, [2024-05-03T00:50:02.253982 #1029333] INFO -- : [858/884] 1070682=test_pkey_dh I, [2024-05-03T00:50:02.321740 #1029333] INFO -- : [859/884] 1070682=test_bigzero I, [2024-05-03T00:50:02.327831 #1029333] INFO -- : [860/884] 1070682=test_gem_util I, [2024-05-03T00:50:02.484774 #1029333] INFO -- : [861/884] 1070682=test_iseq_load I, [2024-05-03T00:50:02.718369 #1029333] INFO -- : [862/884] 1070687=test_gem_package_tar_header I, [2024-05-03T00:50:02.783395 #1029333] INFO -- : [863/884] 1070684=test_ripper I, [2024-05-03T00:50:02.792792 #1029333] INFO -- : [864/884] 1070687=test_gem_config_file I, [2024-05-03T00:50:02.923466 #1029333] INFO -- : [865/884] 1070696=test_gem_resolver_activation_request I, [2024-05-03T00:50:02.936928 #1029333] INFO -- : [866/884] 1070696=test_getopts I, [2024-05-03T00:50:02.939346 #1029333] INFO -- : [867/884] 1070700=test_protocol I, [2024-05-03T00:50:02.958896 #1029333] INFO -- : [868/884] 1070696=test_yjit_exit_locations I, [2024-05-03T00:50:02.962079 #1029333] INFO -- : [869/884] 1070696=test_etc I, [2024-05-03T00:50:02.971731 #1029333] INFO -- : [870/884] 1070687=test_yaml_tree I, [2024-05-03T00:50:03.012076 #1029333] INFO -- : [871/884] 1070687=test_gem_commands_fetch_command I, [2024-05-03T00:50:03.022522 #1029333] INFO -- : [872/884] 1070689=test_math I, [2024-05-03T00:50:03.047430 #1029333] INFO -- : [873/884] 1070689=test_gc I, [2024-05-03T00:50:03.049398 #1029333] INFO -- : [874/884] 1070689=test_libs I, [2024-05-03T00:50:03.073352 #1029333] INFO -- : [875/884] 1070696=test_config I, [2024-05-03T00:50:03.078790 #1029333] INFO -- : [876/884] 1070689=test_sleep I, [2024-05-03T00:50:03.125629 #1029333] INFO -- : [877/884] 1070696=test_utf16 I, [2024-05-03T00:50:03.142430 #1029333] INFO -- : [878/884] 1070696=test_autoload I, [2024-05-03T00:50:03.154522 #1029333] INFO -- : [879/884] 1070687=test_unicode_escape I, [2024-05-03T00:50:03.204543 #1029333] INFO -- : [880/884] 1070683=test_io I, [2024-05-03T00:50:03.213411 #1029333] INFO -- : [881/884] 1070684=test_face I, [2024-05-03T00:50:03.232184 #1029333] INFO -- : [882/884] 1070684=test_sizeof I, [2024-05-03T00:50:03.269556 #1029333] INFO -- : [883/884] 1070687=test_case I, [2024-05-03T00:50:03.289702 #1029333] INFO -- : [884/884] 1070687=test_rendering I, [2024-05-03T00:50:20.202796 #1029333] INFO -- : Finished tests in 37.655559s, 700.2419 tests/s, 248274.1815 assertions/s. E, [2024-05-03T00:50:20.202936 #1029333] ERROR -- : Children under /tmp/rubytest.vk2oe3: E, [2024-05-03T00:50:20.202991 #1029333] ERROR -- : * drwx------ 4 80 2024-05-03 00:49:43 +0000 gem_rebuild20240503-1070683-5ldi3n/ E, [2024-05-03T00:50:20.203011 #1029333] ERROR -- : * drwxrwxr-x 2 60 2024-05-03 00:49:43 +0000 new/ E, [2024-05-03T00:50:20.203027 #1029333] ERROR -- : * -rw-rw-r-- 1 4096 2024-05-03 00:49:43 +0000 rebuild_test_gem-1.0.0.gem E, [2024-05-03T00:50:20.203044 #1029333] ERROR -- : * drwxrwxr-x 2 60 2024-05-03 00:49:43 +0000 old/ E, [2024-05-03T00:50:20.203059 #1029333] ERROR -- : * -rw-rw-r-- 1 4096 2024-05-03 00:49:43 +0000 rebuild_test_gem-1.0.0.gem I, [2024-05-03T00:50:20.204170 #1029333] INFO -- : 26368 tests, 9348903 assertions, 0 failures, 0 errors, 300 skips I, [2024-05-03T00:50:20.204216 #1029333] INFO -- : I, [2024-05-03T00:50:20.204223 #1029333] INFO -- : ruby -v: ruby 3.4.0dev (2024-05-02T21:32:43Z master b5cefa79dd) [x86_64-linux] I, [2024-05-03T00:50:20.206129 #1029333] INFO -- : $$$[end] "make yes-test-all TESTOPTS='--stderr-on-failure' TESTS='-j20'" exit with 0. I, [2024-05-03T00:50:20.206338 #1029333] INFO -- : $$$[beg] make yes-test-rubyspec MSPECOPT='--error-output stderr --debug -j' TESTS='-j20' I, [2024-05-03T00:50:20.294403 #1029333] INFO -- : BASERUBY = /usr/bin/ruby --disable=gems I, [2024-05-03T00:50:20.294450 #1029333] INFO -- : CC = gcc I, [2024-05-03T00:50:20.294456 #1029333] INFO -- : LD = ld I, [2024-05-03T00:50:20.294460 #1029333] INFO -- : LDSHARED = gcc -shared I, [2024-05-03T00:50:20.294465 #1029333] INFO -- : CFLAGS = -O3 -fno-fast-math -ggdb3 -Wall -Wextra -Wdeprecated-declarations -Wdiv-by-zero -Wduplicated-cond -Wimplicit-function-declaration -Wimplicit-int -Wpointer-arith -Wwrite-strings -Wold-style-definition -Wimplicit-fallthrough=0 -Wmissing-noreturn -Wno-cast-function-type -Wno-constant-logical-operand -Wno-long-long -Wno-missing-field-initializers -Wno-overlength-strings -Wno-packed-bitfield-compat -Wno-parentheses-equality -Wno-self-assign -Wno-tautological-compare -Wno-unused-parameter -Wno-unused-value -Wsuggest-attribute=format -Wsuggest-attribute=noreturn -Wunused-variable -Wmisleading-indentation -Wundef -fPIC I, [2024-05-03T00:50:20.294470 #1029333] INFO -- : XCFLAGS = -U_FORTIFY_SOURCE -D_FORTIFY_SOURCE=2 -fstack-protector-strong -fno-strict-overflow -fvisibility=hidden -fexcess-precision=standard -DRUBY_EXPORT -I. -I.ext/include/x86_64-linux -I/tmp/ruby/src/trunk/include -I/tmp/ruby/src/trunk -I/tmp/ruby/src/trunk/prism -I/tmp/ruby/src/trunk/enc/unicode/15.0.0 I, [2024-05-03T00:50:20.294474 #1029333] INFO -- : CPPFLAGS = I, [2024-05-03T00:50:20.294477 #1029333] INFO -- : DLDFLAGS = -Wl,--compress-debug-sections=zlib -Wl,-soname,libruby.so.3.4 -fstack-protector-strong I, [2024-05-03T00:50:20.294481 #1029333] INFO -- : SOLIBS = -lz -lrt -lrt -lgmp -ldl -lcrypt -lm -lpthread I, [2024-05-03T00:50:20.294485 #1029333] INFO -- : LANG = en_US.UTF-8 I, [2024-05-03T00:50:20.294489 #1029333] INFO -- : LC_ALL = I, [2024-05-03T00:50:20.294492 #1029333] INFO -- : LC_CTYPE = I, [2024-05-03T00:50:20.294496 #1029333] INFO -- : MFLAGS = I, [2024-05-03T00:50:20.294499 #1029333] INFO -- : RUSTC = no I, [2024-05-03T00:50:20.294503 #1029333] INFO -- : YJIT_RUSTC_ARGS = --crate-name=yjit --crate-type=staticlib --edition=2021 -g -C lto=thin -C opt-level=3 -C overflow-checks=on '--out-dir=/tmp/ruby/build/trunk/yjit/target/release/' /tmp/ruby/src/trunk/yjit/src/lib.rs I, [2024-05-03T00:50:20.295176 #1029333] INFO -- : gcc (Ubuntu 11.4.0-1ubuntu1~22.04) 11.4.0 I, [2024-05-03T00:50:20.295201 #1029333] INFO -- : Copyright (C) 2021 Free Software Foundation, Inc. I, [2024-05-03T00:50:20.295206 #1029333] INFO -- : This is free software; see the source for copying conditions. There is NO I, [2024-05-03T00:50:20.295211 #1029333] INFO -- : warranty; not even for MERCHANTABILITY or FITNESS FOR A PARTICULAR PURPOSE. I, [2024-05-03T00:50:20.295215 #1029333] INFO -- : I, [2024-05-03T00:50:20.296757 #1029333] INFO -- : generating enc.mk I, [2024-05-03T00:50:20.414667 #1029333] INFO -- : making enc I, [2024-05-03T00:50:20.432188 #1029333] INFO -- : make[1]: Entering directory '/tmp/ruby/build/trunk' I, [2024-05-03T00:50:20.432215 #1029333] INFO -- : make[1]: Nothing to be done for 'enc'. I, [2024-05-03T00:50:20.432221 #1029333] INFO -- : make[1]: Leaving directory '/tmp/ruby/build/trunk' I, [2024-05-03T00:50:20.432787 #1029333] INFO -- : making srcs under enc I, [2024-05-03T00:50:20.463043 #1029333] INFO -- : make[1]: Entering directory '/tmp/ruby/build/trunk' I, [2024-05-03T00:50:20.463071 #1029333] INFO -- : make[1]: Nothing to be done for 'srcs'. I, [2024-05-03T00:50:20.463079 #1029333] INFO -- : make[1]: Leaving directory '/tmp/ruby/build/trunk' I, [2024-05-03T00:50:20.463931 #1029333] INFO -- : generating transdb.h I, [2024-05-03T00:50:20.559140 #1029333] INFO -- : transdb.h unchanged I, [2024-05-03T00:50:20.560601 #1029333] INFO -- : making trans I, [2024-05-03T00:50:20.595542 #1029333] INFO -- : make[1]: Entering directory '/tmp/ruby/build/trunk' I, [2024-05-03T00:50:20.595563 #1029333] INFO -- : make[1]: Nothing to be done for 'trans'. I, [2024-05-03T00:50:20.595569 #1029333] INFO -- : make[1]: Leaving directory '/tmp/ruby/build/trunk' I, [2024-05-03T00:50:20.596246 #1029333] INFO -- : making encs I, [2024-05-03T00:50:20.633011 #1029333] INFO -- : make[1]: Entering directory '/tmp/ruby/build/trunk' I, [2024-05-03T00:50:20.633032 #1029333] INFO -- : make[1]: Nothing to be done for 'encs'. I, [2024-05-03T00:50:20.633038 #1029333] INFO -- : make[1]: Leaving directory '/tmp/ruby/build/trunk' I, [2024-05-03T00:50:20.634763 #1029333] INFO -- : generating makefiles ext/configure-ext.mk I, [2024-05-03T00:50:20.662319 #1029333] INFO -- : ext/configure-ext.mk updated I, [2024-05-03T00:50:20.664748 #1029333] INFO -- : make[1]: Entering directory '/tmp/ruby/build/trunk' I, [2024-05-03T00:50:22.018486 #1029333] INFO -- : make[1]: Leaving directory '/tmp/ruby/build/trunk' I, [2024-05-03T00:50:22.019040 #1029333] INFO -- : generating makefile exts.mk I, [2024-05-03T00:50:22.055828 #1029333] INFO -- : exts.mk unchanged I, [2024-05-03T00:50:22.060153 #1029333] INFO -- : make[1]: Entering directory '/tmp/ruby/build/trunk' I, [2024-05-03T00:50:22.270253 #1029333] INFO -- : make[2]: Entering directory '/tmp/ruby/build/trunk/ext/coverage' I, [2024-05-03T00:50:22.272954 #1029333] INFO -- : make[2]: Leaving directory '/tmp/ruby/build/trunk/ext/coverage' I, [2024-05-03T00:50:22.276755 #1029333] INFO -- : make[2]: Entering directory '/tmp/ruby/build/trunk/ext/date' I, [2024-05-03T00:50:22.279841 #1029333] INFO -- : make[2]: Leaving directory '/tmp/ruby/build/trunk/ext/date' I, [2024-05-03T00:50:22.282033 #1029333] INFO -- : make[2]: Entering directory '/tmp/ruby/build/trunk/ext/digest' I, [2024-05-03T00:50:22.287388 #1029333] INFO -- : make[2]: Leaving directory '/tmp/ruby/build/trunk/ext/digest' I, [2024-05-03T00:50:22.302932 #1029333] INFO -- : make[2]: Entering directory '/tmp/ruby/build/trunk/ext/digest/sha2' I, [2024-05-03T00:50:22.306034 #1029333] INFO -- : make[2]: Leaving directory '/tmp/ruby/build/trunk/ext/digest/sha2' I, [2024-05-03T00:50:22.318820 #1029333] INFO -- : make[2]: Entering directory '/tmp/ruby/build/trunk/ext/fiddle' I, [2024-05-03T00:50:22.325182 #1029333] INFO -- : make[2]: Leaving directory '/tmp/ruby/build/trunk/ext/fiddle' I, [2024-05-03T00:50:22.328123 #1029333] INFO -- : make[2]: Entering directory '/tmp/ruby/build/trunk/ext/io/console' I, [2024-05-03T00:50:22.330664 #1029333] INFO -- : make[2]: Leaving directory '/tmp/ruby/build/trunk/ext/io/console' I, [2024-05-03T00:50:22.338168 #1029333] INFO -- : make[2]: Entering directory '/tmp/ruby/build/trunk/ext/json' I, [2024-05-03T00:50:22.344343 #1029333] INFO -- : make[2]: Leaving directory '/tmp/ruby/build/trunk/ext/json' I, [2024-05-03T00:50:22.353381 #1029333] INFO -- : make[2]: Entering directory '/tmp/ruby/build/trunk/ext/monitor' I, [2024-05-03T00:50:22.355794 #1029333] INFO -- : make[2]: Leaving directory '/tmp/ruby/build/trunk/ext/monitor' I, [2024-05-03T00:50:22.359998 #1029333] INFO -- : make[2]: Entering directory '/tmp/ruby/build/trunk/ext/objspace' I, [2024-05-03T00:50:22.363643 #1029333] INFO -- : make[2]: Leaving directory '/tmp/ruby/build/trunk/ext/objspace' I, [2024-05-03T00:50:22.375531 #1029333] INFO -- : make[2]: Entering directory '/tmp/ruby/build/trunk/ext/openssl' I, [2024-05-03T00:50:22.389777 #1029333] INFO -- : make[2]: Leaving directory '/tmp/ruby/build/trunk/ext/openssl' I, [2024-05-03T00:50:22.392648 #1029333] INFO -- : make[2]: Entering directory '/tmp/ruby/build/trunk/ext/pathname' I, [2024-05-03T00:50:22.395161 #1029333] INFO -- : make[2]: Leaving directory '/tmp/ruby/build/trunk/ext/pathname' I, [2024-05-03T00:50:22.399374 #1029333] INFO -- : make[2]: Entering directory '/tmp/ruby/build/trunk/ext/psych' I, [2024-05-03T00:50:22.414411 #1029333] INFO -- : make[2]: Leaving directory '/tmp/ruby/build/trunk/ext/psych' I, [2024-05-03T00:50:22.417461 #1029333] INFO -- : make[2]: Entering directory '/tmp/ruby/build/trunk/ext/pty' I, [2024-05-03T00:50:22.419899 #1029333] INFO -- : make[2]: Leaving directory '/tmp/ruby/build/trunk/ext/pty' I, [2024-05-03T00:50:22.429389 #1029333] INFO -- : make[2]: Entering directory '/tmp/ruby/build/trunk/ext/ripper' I, [2024-05-03T00:50:22.434354 #1029333] INFO -- : make[2]: Leaving directory '/tmp/ruby/build/trunk/ext/ripper' I, [2024-05-03T00:50:22.435782 #1029333] INFO -- : make[2]: Entering directory '/tmp/ruby/build/trunk/ext/rubyvm' I, [2024-05-03T00:50:22.437778 #1029333] INFO -- : make[2]: Leaving directory '/tmp/ruby/build/trunk/ext/rubyvm' I, [2024-05-03T00:50:22.445654 #1029333] INFO -- : make[2]: Entering directory '/tmp/ruby/build/trunk/ext/socket' I, [2024-05-03T00:50:22.451973 #1029333] INFO -- : make[2]: Leaving directory '/tmp/ruby/build/trunk/ext/socket' I, [2024-05-03T00:50:22.462741 #1029333] INFO -- : make[2]: Entering directory '/tmp/ruby/build/trunk/.bundle/gems/bigdecimal-3.1.7/ext/bigdecimal' I, [2024-05-03T00:50:22.484999 #1029333] INFO -- : make[2]: Leaving directory '/tmp/ruby/build/trunk/.bundle/gems/bigdecimal-3.1.7/ext/bigdecimal' I, [2024-05-03T00:50:22.487061 #1029333] INFO -- : make[2]: Entering directory '/tmp/ruby/build/trunk/.bundle/gems/debug-1.9.2/ext/debug' I, [2024-05-03T00:50:22.509309 #1029333] INFO -- : make[2]: Leaving directory '/tmp/ruby/build/trunk/.bundle/gems/debug-1.9.2/ext/debug' I, [2024-05-03T00:50:22.511170 #1029333] INFO -- : make[2]: Entering directory '/tmp/ruby/build/trunk/.bundle/gems/nkf-0.2.0/ext/nkf' I, [2024-05-03T00:50:22.533581 #1029333] INFO -- : make[2]: Leaving directory '/tmp/ruby/build/trunk/.bundle/gems/nkf-0.2.0/ext/nkf' I, [2024-05-03T00:50:22.535499 #1029333] INFO -- : make[2]: Entering directory '/tmp/ruby/build/trunk/.bundle/gems/racc-1.7.3/ext/racc/cparse' I, [2024-05-03T00:50:22.557189 #1029333] INFO -- : make[2]: Leaving directory '/tmp/ruby/build/trunk/.bundle/gems/racc-1.7.3/ext/racc/cparse' I, [2024-05-03T00:50:22.559408 #1029333] INFO -- : make[2]: Entering directory '/tmp/ruby/build/trunk/.bundle/gems/rbs-3.4.4/ext/rbs_extension' I, [2024-05-03T00:50:22.581043 #1029333] INFO -- : make[2]: Leaving directory '/tmp/ruby/build/trunk/.bundle/gems/rbs-3.4.4/ext/rbs_extension' I, [2024-05-03T00:50:22.583163 #1029333] INFO -- : make[2]: Entering directory '/tmp/ruby/build/trunk/.bundle/gems/syslog-0.1.2/ext/syslog' I, [2024-05-03T00:50:22.605050 #1029333] INFO -- : make[2]: Leaving directory '/tmp/ruby/build/trunk/.bundle/gems/syslog-0.1.2/ext/syslog' I, [2024-05-03T00:50:22.628622 #1029333] INFO -- : make[2]: Entering directory '/tmp/ruby/build/trunk' I, [2024-05-03T00:50:22.693153 #1029333] INFO -- : make[2]: 'ruby' is up to date. I, [2024-05-03T00:50:22.693190 #1029333] INFO -- : make[2]: Leaving directory '/tmp/ruby/build/trunk' I, [2024-05-03T00:50:22.693445 #1029333] INFO -- : make[1]: Leaving directory '/tmp/ruby/build/trunk' I, [2024-05-03T00:50:22.697081 #1029333] INFO -- : make[1]: Entering directory '/tmp/ruby/build/trunk' I, [2024-05-03T00:50:22.697103 #1029333] INFO -- : make[1]: Nothing to be done for 'note'. I, [2024-05-03T00:50:22.697115 #1029333] INFO -- : make[1]: Leaving directory '/tmp/ruby/build/trunk' E, [2024-05-03T00:50:22.756186 #1029333] ERROR -- : $ /tmp/ruby/build/trunk/miniruby -I/tmp/ruby/src/trunk/lib /tmp/ruby/src/trunk/tool/runruby.rb --archdir=/tmp/ruby/build/trunk --extout=.ext -- /tmp/ruby/src/trunk/spec/mspec/bin/mspec-run -B /tmp/ruby/src/trunk/spec/default.mspec --error-output stderr --debug -fy -o /tmp/rubytest.ac8hwi/1-mspec-multi-0 E, [2024-05-03T00:50:22.756402 #1029333] ERROR -- : $ /tmp/ruby/build/trunk/miniruby -I/tmp/ruby/src/trunk/lib /tmp/ruby/src/trunk/tool/runruby.rb --archdir=/tmp/ruby/build/trunk --extout=.ext -- /tmp/ruby/src/trunk/spec/mspec/bin/mspec-run -B /tmp/ruby/src/trunk/spec/default.mspec --error-output stderr --debug -fy -o /tmp/rubytest.ac8hwi/2-mspec-multi-1 E, [2024-05-03T00:50:22.756633 #1029333] ERROR -- : $ /tmp/ruby/build/trunk/miniruby -I/tmp/ruby/src/trunk/lib /tmp/ruby/src/trunk/tool/runruby.rb --archdir=/tmp/ruby/build/trunk --extout=.ext -- /tmp/ruby/src/trunk/spec/mspec/bin/mspec-run -B /tmp/ruby/src/trunk/spec/default.mspec --error-output stderr --debug -fy -o /tmp/rubytest.ac8hwi/3-mspec-multi-2 E, [2024-05-03T00:50:22.756898 #1029333] ERROR -- : $ /tmp/ruby/build/trunk/miniruby -I/tmp/ruby/src/trunk/lib /tmp/ruby/src/trunk/tool/runruby.rb --archdir=/tmp/ruby/build/trunk --extout=.ext -- /tmp/ruby/src/trunk/spec/mspec/bin/mspec-run -B /tmp/ruby/src/trunk/spec/default.mspec --error-output stderr --debug -fy -o /tmp/rubytest.ac8hwi/4-mspec-multi-3 E, [2024-05-03T00:50:22.757024 #1029333] ERROR -- : $ /tmp/ruby/build/trunk/miniruby -I/tmp/ruby/src/trunk/lib /tmp/ruby/src/trunk/tool/runruby.rb --archdir=/tmp/ruby/build/trunk --extout=.ext -- /tmp/ruby/src/trunk/spec/mspec/bin/mspec-run -B /tmp/ruby/src/trunk/spec/default.mspec --error-output stderr --debug -fy -o /tmp/rubytest.ac8hwi/5-mspec-multi-4 E, [2024-05-03T00:50:22.757313 #1029333] ERROR -- : $ /tmp/ruby/build/trunk/miniruby -I/tmp/ruby/src/trunk/lib /tmp/ruby/src/trunk/tool/runruby.rb --archdir=/tmp/ruby/build/trunk --extout=.ext -- /tmp/ruby/src/trunk/spec/mspec/bin/mspec-run -B /tmp/ruby/src/trunk/spec/default.mspec --error-output stderr --debug -fy -o /tmp/rubytest.ac8hwi/6-mspec-multi-5 E, [2024-05-03T00:50:22.757547 #1029333] ERROR -- : $ /tmp/ruby/build/trunk/miniruby -I/tmp/ruby/src/trunk/lib /tmp/ruby/src/trunk/tool/runruby.rb --archdir=/tmp/ruby/build/trunk --extout=.ext -- /tmp/ruby/src/trunk/spec/mspec/bin/mspec-run -B /tmp/ruby/src/trunk/spec/default.mspec --error-output stderr --debug -fy -o /tmp/rubytest.ac8hwi/7-mspec-multi-6 E, [2024-05-03T00:50:22.757768 #1029333] ERROR -- : $ /tmp/ruby/build/trunk/miniruby -I/tmp/ruby/src/trunk/lib /tmp/ruby/src/trunk/tool/runruby.rb --archdir=/tmp/ruby/build/trunk --extout=.ext -- /tmp/ruby/src/trunk/spec/mspec/bin/mspec-run -B /tmp/ruby/src/trunk/spec/default.mspec --error-output stderr --debug -fy -o /tmp/rubytest.ac8hwi/8-mspec-multi-7 E, [2024-05-03T00:50:22.757935 #1029333] ERROR -- : $ /tmp/ruby/build/trunk/miniruby -I/tmp/ruby/src/trunk/lib /tmp/ruby/src/trunk/tool/runruby.rb --archdir=/tmp/ruby/build/trunk --extout=.ext -- /tmp/ruby/src/trunk/spec/mspec/bin/mspec-run -B /tmp/ruby/src/trunk/spec/default.mspec --error-output stderr --debug -fy -o /tmp/rubytest.ac8hwi/9-mspec-multi-8 E, [2024-05-03T00:50:22.758270 #1029333] ERROR -- : $ /tmp/ruby/build/trunk/miniruby -I/tmp/ruby/src/trunk/lib /tmp/ruby/src/trunk/tool/runruby.rb --archdir=/tmp/ruby/build/trunk --extout=.ext -- /tmp/ruby/src/trunk/spec/mspec/bin/mspec-run -B /tmp/ruby/src/trunk/spec/default.mspec --error-output stderr --debug -fy -o /tmp/rubytest.ac8hwi/10-mspec-multi-9 E, [2024-05-03T00:50:22.758443 #1029333] ERROR -- : $ /tmp/ruby/build/trunk/miniruby -I/tmp/ruby/src/trunk/lib /tmp/ruby/src/trunk/tool/runruby.rb --archdir=/tmp/ruby/build/trunk --extout=.ext -- /tmp/ruby/src/trunk/spec/mspec/bin/mspec-run -B /tmp/ruby/src/trunk/spec/default.mspec --error-output stderr --debug -fy -o /tmp/rubytest.ac8hwi/11-mspec-multi-10 E, [2024-05-03T00:50:22.758604 #1029333] ERROR -- : $ /tmp/ruby/build/trunk/miniruby -I/tmp/ruby/src/trunk/lib /tmp/ruby/src/trunk/tool/runruby.rb --archdir=/tmp/ruby/build/trunk --extout=.ext -- /tmp/ruby/src/trunk/spec/mspec/bin/mspec-run -B /tmp/ruby/src/trunk/spec/default.mspec --error-output stderr --debug -fy -o /tmp/rubytest.ac8hwi/12-mspec-multi-11 E, [2024-05-03T00:50:22.758771 #1029333] ERROR -- : $ /tmp/ruby/build/trunk/miniruby -I/tmp/ruby/src/trunk/lib /tmp/ruby/src/trunk/tool/runruby.rb --archdir=/tmp/ruby/build/trunk --extout=.ext -- /tmp/ruby/src/trunk/spec/mspec/bin/mspec-run -B /tmp/ruby/src/trunk/spec/default.mspec --error-output stderr --debug -fy -o /tmp/rubytest.ac8hwi/13-mspec-multi-12 E, [2024-05-03T00:50:22.759003 #1029333] ERROR -- : $ /tmp/ruby/build/trunk/miniruby -I/tmp/ruby/src/trunk/lib /tmp/ruby/src/trunk/tool/runruby.rb --archdir=/tmp/ruby/build/trunk --extout=.ext -- /tmp/ruby/src/trunk/spec/mspec/bin/mspec-run -B /tmp/ruby/src/trunk/spec/default.mspec --error-output stderr --debug -fy -o /tmp/rubytest.ac8hwi/14-mspec-multi-13 E, [2024-05-03T00:50:22.759141 #1029333] ERROR -- : $ /tmp/ruby/build/trunk/miniruby -I/tmp/ruby/src/trunk/lib /tmp/ruby/src/trunk/tool/runruby.rb --archdir=/tmp/ruby/build/trunk --extout=.ext -- /tmp/ruby/src/trunk/spec/mspec/bin/mspec-run -B /tmp/ruby/src/trunk/spec/default.mspec --error-output stderr --debug -fy -o /tmp/rubytest.ac8hwi/15-mspec-multi-14 E, [2024-05-03T00:50:22.759341 #1029333] ERROR -- : $ /tmp/ruby/build/trunk/miniruby -I/tmp/ruby/src/trunk/lib /tmp/ruby/src/trunk/tool/runruby.rb --archdir=/tmp/ruby/build/trunk --extout=.ext -- /tmp/ruby/src/trunk/spec/mspec/bin/mspec-run -B /tmp/ruby/src/trunk/spec/default.mspec --error-output stderr --debug -fy -o /tmp/rubytest.ac8hwi/16-mspec-multi-15 E, [2024-05-03T00:50:22.759536 #1029333] ERROR -- : $ /tmp/ruby/build/trunk/miniruby -I/tmp/ruby/src/trunk/lib /tmp/ruby/src/trunk/tool/runruby.rb --archdir=/tmp/ruby/build/trunk --extout=.ext -- /tmp/ruby/src/trunk/spec/mspec/bin/mspec-run -B /tmp/ruby/src/trunk/spec/default.mspec --error-output stderr --debug -fy -o /tmp/rubytest.ac8hwi/17-mspec-multi-16 E, [2024-05-03T00:50:22.759727 #1029333] ERROR -- : $ /tmp/ruby/build/trunk/miniruby -I/tmp/ruby/src/trunk/lib /tmp/ruby/src/trunk/tool/runruby.rb --archdir=/tmp/ruby/build/trunk --extout=.ext -- /tmp/ruby/src/trunk/spec/mspec/bin/mspec-run -B /tmp/ruby/src/trunk/spec/default.mspec --error-output stderr --debug -fy -o /tmp/rubytest.ac8hwi/18-mspec-multi-17 E, [2024-05-03T00:50:22.762171 #1029333] ERROR -- : $ /tmp/ruby/build/trunk/miniruby -I/tmp/ruby/src/trunk/lib /tmp/ruby/src/trunk/tool/runruby.rb --archdir=/tmp/ruby/build/trunk --extout=.ext -- /tmp/ruby/src/trunk/spec/mspec/bin/mspec-run -B /tmp/ruby/src/trunk/spec/default.mspec --error-output stderr --debug -fy -o /tmp/rubytest.ac8hwi/19-mspec-multi-18 E, [2024-05-03T00:50:22.762636 #1029333] ERROR -- : $ /tmp/ruby/build/trunk/miniruby -I/tmp/ruby/src/trunk/lib /tmp/ruby/src/trunk/tool/runruby.rb --archdir=/tmp/ruby/build/trunk --extout=.ext -- /tmp/ruby/src/trunk/spec/mspec/bin/mspec-run -B /tmp/ruby/src/trunk/spec/default.mspec --error-output stderr --debug -fy -o /tmp/rubytest.ac8hwi/20-mspec-multi-19 I, [2024-05-03T00:50:22.944757 #1029333] INFO -- : ruby 3.4.0dev (2024-05-02T21:32:43Z master b5cefa79dd) [x86_64-linux] I, [2024-05-03T00:50:23.665653 #1029333] INFO -- : 0 ......................................................................... I, [2024-05-03T00:50:23.937655 #1029333] INFO -- : 73 ......................................................................... I, [2024-05-03T00:50:24.131720 #1029333] INFO -- : 146 ......................................................................... I, [2024-05-03T00:50:24.194368 #1029333] INFO -- : 219 ......................................................................... I, [2024-05-03T00:50:24.250287 #1029333] INFO -- : 292 ......................................................................... I, [2024-05-03T00:50:24.299157 #1029333] INFO -- : 365 ......................................................................... I, [2024-05-03T00:50:24.321621 #1029333] INFO -- : 438 ......................................................................... I, [2024-05-03T00:50:24.340914 #1029333] INFO -- : 511 ......................................................................... I, [2024-05-03T00:50:24.361060 #1029333] INFO -- : 584 ......................................................................... I, [2024-05-03T00:50:24.418113 #1029333] INFO -- : 657 ......................................................................... I, [2024-05-03T00:50:24.455108 #1029333] INFO -- : 730 ......................................................................... I, [2024-05-03T00:50:24.482191 #1029333] INFO -- : 803 ......................................................................... I, [2024-05-03T00:50:24.519439 #1029333] INFO -- : 876 ......................................................................... I, [2024-05-03T00:50:24.578624 #1029333] INFO -- : 949 ......................................................................... I, [2024-05-03T00:50:24.673222 #1029333] INFO -- : 1022 ......................................................................... I, [2024-05-03T00:50:24.837506 #1029333] INFO -- : 1095 ......................................................................... I, [2024-05-03T00:50:24.950695 #1029333] INFO -- : 1168 ......................................................................... I, [2024-05-03T00:50:25.017207 #1029333] INFO -- : 1241 ......................................................................... I, [2024-05-03T00:50:25.061659 #1029333] INFO -- : 1314 ......................................................................... I, [2024-05-03T00:50:25.084943 #1029333] INFO -- : 1387 ......................................................................... I, [2024-05-03T00:50:25.209792 #1029333] INFO -- : 1460 ......................................................................... I, [2024-05-03T00:50:25.636492 #1029333] INFO -- : 1533 ......................................................................... I, [2024-05-03T00:50:25.700532 #1029333] INFO -- : 1606 ......................................................................... I, [2024-05-03T00:50:25.792112 #1029333] INFO -- : 1679 ......................................................................... I, [2024-05-03T00:50:25.908076 #1029333] INFO -- : 1752 ......................................................................... I, [2024-05-03T00:50:26.014802 #1029333] INFO -- : 1825 ......................................................................... I, [2024-05-03T00:50:26.132402 #1029333] INFO -- : 1898 ......................................................................... I, [2024-05-03T00:50:26.220467 #1029333] INFO -- : 1971 ......................................................................... I, [2024-05-03T00:50:26.293661 #1029333] INFO -- : 2044 ......................................................................... I, [2024-05-03T00:50:26.347565 #1029333] INFO -- : 2117 ......................................................................... I, [2024-05-03T00:50:26.358265 #1029333] INFO -- : 2190 ......................................................................... I, [2024-05-03T00:50:26.375373 #1029333] INFO -- : 2263 ......................................................................... I, [2024-05-03T00:50:26.389184 #1029333] INFO -- : 2336 ......................................................................... I, [2024-05-03T00:50:26.432051 #1029333] INFO -- : 2409 ......................................................................... I, [2024-05-03T00:50:26.541161 #1029333] INFO -- : 2482 ......................................................................... I, [2024-05-03T00:50:26.565763 #1029333] INFO -- : 2555 ......................................................................... I, [2024-05-03T00:50:26.664349 #1029333] INFO -- : 2628 ......................................................................... I, [2024-05-03T00:50:26.764647 #1029333] INFO -- : 2701 ......................................................................... I, [2024-05-03T00:50:26.801139 #1029333] INFO -- : 2774 ......................................................................... I, [2024-05-03T00:50:26.861969 #1029333] INFO -- : 2847 ......................................................................... I, [2024-05-03T00:50:26.895839 #1029333] INFO -- : 2920 ......................................................................... I, [2024-05-03T00:50:26.920022 #1029333] INFO -- : 2993 ......................................................................... I, [2024-05-03T00:50:26.943477 #1029333] INFO -- : 3066 ......................................................................... I, [2024-05-03T00:50:26.956789 #1029333] INFO -- : 3139 ......................................................................... I, [2024-05-03T00:50:26.965139 #1029333] INFO -- : 3212 ......................................................................... I, [2024-05-03T00:50:26.997788 #1029333] INFO -- : 3285 ......................................................................... I, [2024-05-03T00:50:30.953480 #1029333] INFO -- : 3358 ........................................................................ I, [2024-05-03T00:50:30.953538 #1029333] INFO -- : I, [2024-05-03T00:50:30.953552 #1029333] INFO -- : Finished in 8.196530 seconds I, [2024-05-03T00:50:30.953563 #1029333] INFO -- : I, [2024-05-03T00:50:30.953575 #1029333] INFO -- : 3429 files, 32610 examples, 201249 expectations, 0 failures, 0 errors, 0 tagged I, [2024-05-03T00:50:30.955723 #1029333] INFO -- : $$$[end] "make yes-test-rubyspec MSPECOPT='--error-output stderr --debug -j' TESTS='-j20'" exit with 0.