# Logfile created on 2024-04-30 16:00:20 +0000 by logger.rb/v1.5.0 I, [2024-04-30T16:00:20.271780 #2875310] INFO -- : #, @formatter=nil, @logdev=#, @binmode=false, @mon_data=#, @mon_data_owner_object_id=860>>> I, [2024-04-30T16:00:20.273344 #2875310] INFO -- : $$$[beg] make update-unicode -j4 I, [2024-04-30T16:00:20.826161 #2875310] INFO -- : Downloading Unicode emoji 15.0 files... I, [2024-04-30T16:00:20.827034 #2875310] INFO -- : Downloading Unicode emoji 15.0 files... I, [2024-04-30T16:00:20.828213 #2875310] INFO -- : Downloading Unicode emoji 15.0 files... I, [2024-04-30T16:00:21.443863 #2875310] INFO -- : made symlink emoji/15.0/emoji-sequences.txt to /tmp/ruby/src/trunk/.downloaded-cache/emoji/15.0/emoji-sequences.txt I, [2024-04-30T16:00:21.457294 #2875310] INFO -- : downloading emoji/15.0/emoji-test.txt ... /tmp/ruby/src/trunk/enc/unicode/data/emoji/15.0/emoji-sequences.txt already exists I, [2024-04-30T16:00:21.463785 #2875310] INFO -- : downloading emoji/15.0/emoji-test.txt ... /tmp/ruby/src/trunk/enc/unicode/data/emoji/15.0/emoji-sequences.txt already exists E, [2024-04-30T16:00:22.194626 #2875310] ERROR -- : /tmp/ruby/src/trunk/tool/downloader.rb:302:in `rescue in download': failed to download emoji/15.0/emoji-test.txt (RuntimeError) E, [2024-04-30T16:00:22.194873 #2875310] ERROR -- : OpenURI::HTTPError: 403 Forbidden: https://www.unicode.org/Public/emoji/15.0/emoji-test.txt E, [2024-04-30T16:00:22.195021 #2875310] ERROR -- : from /tmp/ruby/src/trunk/tool/downloader.rb:201:in `download' E, [2024-04-30T16:00:22.195136 #2875310] ERROR -- : from /tmp/ruby/src/trunk/tool/downloader.rb:136:in `download' E, [2024-04-30T16:00:22.195293 #2875310] ERROR -- : from /tmp/ruby/src/trunk/tool/downloader.rb:482:in `block in
' E, [2024-04-30T16:00:22.195747 #2875310] ERROR -- : from /tmp/ruby/src/trunk/tool/downloader.rb:465:in `each' E, [2024-04-30T16:00:22.195980 #2875310] ERROR -- : from /tmp/ruby/src/trunk/tool/downloader.rb:465:in `
' E, [2024-04-30T16:00:22.196107 #2875310] ERROR -- : /usr/lib/ruby/3.1.0/open-uri.rb:364:in `open_http': 403 Forbidden (OpenURI::HTTPError) E, [2024-04-30T16:00:22.196228 #2875310] ERROR -- : from /usr/lib/ruby/3.1.0/open-uri.rb:741:in `buffer_open' E, [2024-04-30T16:00:22.196381 #2875310] ERROR -- : from /usr/lib/ruby/3.1.0/open-uri.rb:212:in `block in open_loop' E, [2024-04-30T16:00:22.196495 #2875310] ERROR -- : from /usr/lib/ruby/3.1.0/open-uri.rb:210:in `catch' E, [2024-04-30T16:00:22.196604 #2875310] ERROR -- : from /usr/lib/ruby/3.1.0/open-uri.rb:210:in `open_loop' E, [2024-04-30T16:00:22.196720 #2875310] ERROR -- : from /usr/lib/ruby/3.1.0/open-uri.rb:151:in `open_uri' E, [2024-04-30T16:00:22.196844 #2875310] ERROR -- : from /usr/lib/ruby/3.1.0/open-uri.rb:721:in `open' E, [2024-04-30T16:00:22.196965 #2875310] ERROR -- : from /usr/lib/ruby/3.1.0/open-uri.rb:729:in `read' E, [2024-04-30T16:00:22.197204 #2875310] ERROR -- : from /tmp/ruby/src/trunk/tool/downloader.rb:247:in `block in download' E, [2024-04-30T16:00:22.197388 #2875310] ERROR -- : from /tmp/ruby/src/trunk/tool/downloader.rb:378:in `with_retry' E, [2024-04-30T16:00:22.197528 #2875310] ERROR -- : from /tmp/ruby/src/trunk/tool/downloader.rb:246:in `download' E, [2024-04-30T16:00:22.197670 #2875310] ERROR -- : from /tmp/ruby/src/trunk/tool/downloader.rb:136:in `download' E, [2024-04-30T16:00:22.197789 #2875310] ERROR -- : from /tmp/ruby/src/trunk/tool/downloader.rb:482:in `block in
' E, [2024-04-30T16:00:22.197899 #2875310] ERROR -- : from /tmp/ruby/src/trunk/tool/downloader.rb:465:in `each' E, [2024-04-30T16:00:22.198004 #2875310] ERROR -- : from /tmp/ruby/src/trunk/tool/downloader.rb:465:in `
' E, [2024-04-30T16:00:22.200153 #2875310] ERROR -- : /tmp/ruby/src/trunk/tool/downloader.rb:302:in `rescue in download': failed to download emoji/15.0/emoji-test.txt (RuntimeError) E, [2024-04-30T16:00:22.200361 #2875310] ERROR -- : OpenURI::HTTPError: 403 Forbidden: https://www.unicode.org/Public/emoji/15.0/emoji-test.txt E, [2024-04-30T16:00:22.200546 #2875310] ERROR -- : from /tmp/ruby/src/trunk/tool/downloader.rb:201:in `download' E, [2024-04-30T16:00:22.200698 #2875310] ERROR -- : from /tmp/ruby/src/trunk/tool/downloader.rb:136:in `download' E, [2024-04-30T16:00:22.200844 #2875310] ERROR -- : from /tmp/ruby/src/trunk/tool/downloader.rb:482:in `block in
' E, [2024-04-30T16:00:22.201174 #2875310] ERROR -- : from /tmp/ruby/src/trunk/tool/downloader.rb:465:in `each' E, [2024-04-30T16:00:22.201614 #2875310] ERROR -- : from /tmp/ruby/src/trunk/tool/downloader.rb:465:in `
' E, [2024-04-30T16:00:22.201892 #2875310] ERROR -- : /usr/lib/ruby/3.1.0/open-uri.rb:364:in `open_http': 403 Forbidden (OpenURI::HTTPError) E, [2024-04-30T16:00:22.202011 #2875310] ERROR -- : from /usr/lib/ruby/3.1.0/open-uri.rb:741:in `buffer_open' E, [2024-04-30T16:00:22.202119 #2875310] ERROR -- : from /usr/lib/ruby/3.1.0/open-uri.rb:212:in `block in open_loop' E, [2024-04-30T16:00:22.202226 #2875310] ERROR -- : from /usr/lib/ruby/3.1.0/open-uri.rb:210:in `catch' E, [2024-04-30T16:00:22.202353 #2875310] ERROR -- : from /usr/lib/ruby/3.1.0/open-uri.rb:210:in `open_loop' E, [2024-04-30T16:00:22.202467 #2875310] ERROR -- : from /usr/lib/ruby/3.1.0/open-uri.rb:151:in `open_uri' E, [2024-04-30T16:00:22.202575 #2875310] ERROR -- : from /usr/lib/ruby/3.1.0/open-uri.rb:721:in `open' E, [2024-04-30T16:00:22.202683 #2875310] ERROR -- : /tmp/ruby/src/trunk/tool/downloader.rb:302:in `rescue in download' from /usr/lib/ruby/3.1.0/open-uri.rb:729:in `read' E, [2024-04-30T16:00:22.202796 #2875310] ERROR -- : : from /tmp/ruby/src/trunk/tool/downloader.rb:247:in `block in download' E, [2024-04-30T16:00:22.202909 #2875310] ERROR -- : failed to download emoji/15.0/emoji-test.txt from /tmp/ruby/src/trunk/tool/downloader.rb:378:in `with_retry' E, [2024-04-30T16:00:22.203025 #2875310] ERROR -- : ( from /tmp/ruby/src/trunk/tool/downloader.rb:246:in `download' E, [2024-04-30T16:00:22.203142 #2875310] ERROR -- : RuntimeError) from /tmp/ruby/src/trunk/tool/downloader.rb:136:in `download' E, [2024-04-30T16:00:22.203270 #2875310] ERROR -- : E, [2024-04-30T16:00:22.203465 #2875310] ERROR -- : OpenURI::HTTPError: 403 Forbidden: https://www.unicode.org/Public/emoji/15.0/emoji-test.txt from /tmp/ruby/src/trunk/tool/downloader.rb:482:in `block in
' E, [2024-04-30T16:00:22.203638 #2875310] ERROR -- : E, [2024-04-30T16:00:22.203761 #2875310] ERROR -- : from /tmp/ruby/src/trunk/tool/downloader.rb:465:in `each' E, [2024-04-30T16:00:22.203874 #2875310] ERROR -- : from /tmp/ruby/src/trunk/tool/downloader.rb:465:in `
' E, [2024-04-30T16:00:22.203984 #2875310] ERROR -- : from /tmp/ruby/src/trunk/tool/downloader.rb:201:in `download' E, [2024-04-30T16:00:22.204092 #2875310] ERROR -- : from /tmp/ruby/src/trunk/tool/downloader.rb:136:in `download' E, [2024-04-30T16:00:22.204199 #2875310] ERROR -- : from /tmp/ruby/src/trunk/tool/downloader.rb:482:in `block in
' E, [2024-04-30T16:00:22.204388 #2875310] ERROR -- : from /tmp/ruby/src/trunk/tool/downloader.rb:465:in `each' E, [2024-04-30T16:00:22.204524 #2875310] ERROR -- : from /tmp/ruby/src/trunk/tool/downloader.rb:465:in `
' E, [2024-04-30T16:00:22.204639 #2875310] ERROR -- : /usr/lib/ruby/3.1.0/open-uri.rb:364:in `open_http': 403 Forbidden (OpenURI::HTTPError) E, [2024-04-30T16:00:22.204756 #2875310] ERROR -- : from /usr/lib/ruby/3.1.0/open-uri.rb:741:in `buffer_open' E, [2024-04-30T16:00:22.204896 #2875310] ERROR -- : from /usr/lib/ruby/3.1.0/open-uri.rb:212:in `block in open_loop' E, [2024-04-30T16:00:22.205016 #2875310] ERROR -- : from /usr/lib/ruby/3.1.0/open-uri.rb:210:in `catch' E, [2024-04-30T16:00:22.205129 #2875310] ERROR -- : from /usr/lib/ruby/3.1.0/open-uri.rb:210:in `open_loop' E, [2024-04-30T16:00:22.205239 #2875310] ERROR -- : from /usr/lib/ruby/3.1.0/open-uri.rb:151:in `open_uri' E, [2024-04-30T16:00:22.205366 #2875310] ERROR -- : from /usr/lib/ruby/3.1.0/open-uri.rb:721:in `open' E, [2024-04-30T16:00:22.205484 #2875310] ERROR -- : from /usr/lib/ruby/3.1.0/open-uri.rb:729:in `read' E, [2024-04-30T16:00:22.205602 #2875310] ERROR -- : from /tmp/ruby/src/trunk/tool/downloader.rb:247:in `block in download' E, [2024-04-30T16:00:22.205719 #2875310] ERROR -- : from /tmp/ruby/src/trunk/tool/downloader.rb:378:in `with_retry' E, [2024-04-30T16:00:22.205837 #2875310] ERROR -- : from /tmp/ruby/src/trunk/tool/downloader.rb:246:in `download' E, [2024-04-30T16:00:22.205947 #2875310] ERROR -- : from /tmp/ruby/src/trunk/tool/downloader.rb:136:in `download' E, [2024-04-30T16:00:22.206058 #2875310] ERROR -- : from /tmp/ruby/src/trunk/tool/downloader.rb:482:in `block in
' E, [2024-04-30T16:00:22.206169 #2875310] ERROR -- : from /tmp/ruby/src/trunk/tool/downloader.rb:465:in `each' E, [2024-04-30T16:00:22.206312 #2875310] ERROR -- : from /tmp/ruby/src/trunk/tool/downloader.rb:465:in `
' E, [2024-04-30T16:00:22.218166 #2875310] ERROR -- : make: *** [uncommon.mk:1787: /tmp/ruby/src/trunk/enc/unicode/data/emoji/15.0/emoji-test.txt] Error 1 E, [2024-04-30T16:00:22.218366 #2875310] ERROR -- : make: *** Waiting for unfinished jobs.... E, [2024-04-30T16:00:22.222958 #2875310] ERROR -- : make: *** [uncommon.mk:1787: /tmp/ruby/src/trunk/enc/unicode/data/emoji/15.0/emoji-sequences.txt] Error 1 E, [2024-04-30T16:00:22.223147 #2875310] ERROR -- : make: *** Deleting file '/tmp/ruby/src/trunk/enc/unicode/data/emoji/15.0/emoji-sequences.txt' E, [2024-04-30T16:00:22.223290 #2875310] ERROR -- : make: *** [uncommon.mk:1787: /tmp/ruby/src/trunk/enc/unicode/data/emoji/15.0/emoji-zwj-sequences.txt] Error 1 I, [2024-04-30T16:00:22.224703 #2875310] INFO -- : downloading emoji/15.0/emoji-test.txt ... I, [2024-04-30T16:00:22.225191 #2875310] INFO -- : $$$[end] "make update-unicode -j4" exit with 512. I, [2024-04-30T16:00:22.225335 #2875310] INFO -- : $$$[beg] make update-download -j4 I, [2024-04-30T16:00:23.388386 #2875310] INFO -- : tool/config.guess already exists I, [2024-04-30T16:00:23.388803 #2875310] INFO -- : tool/config.sub already exists I, [2024-04-30T16:00:23.406929 #2875310] INFO -- : Update minitest to ea9caafc0754b1d6236a490d59e624b53209734a I, [2024-04-30T16:00:23.407791 #2875310] INFO -- : Update power_assert to 84e85124c5014a139af39161d484156cfe87a9ed I, [2024-04-30T16:00:23.409776 #2875310] INFO -- : Update rbs to ba7872795d5de04adb8ff500c0e6afdc81a041dd I, [2024-04-30T16:00:23.410375 #2875310] INFO -- : Update typeprof to b19a6416da3a05d57fadd6ffdadb382b6d236ca5 I, [2024-04-30T16:00:23.415523 #2875310] INFO -- : echo ea9caafc0754b1d6236a490d59e624b53209734a | /bin/sh /tmp/ruby/src/trunk/tool/ifchange /tmp/ruby/src/trunk/.bundle/.timestamp/minitest.revision - I, [2024-04-30T16:00:23.417940 #2875310] INFO -- : echo 84e85124c5014a139af39161d484156cfe87a9ed | /bin/sh /tmp/ruby/src/trunk/tool/ifchange /tmp/ruby/src/trunk/.bundle/.timestamp/power_assert.revision - I, [2024-04-30T16:00:23.418949 #2875310] INFO -- : echo b19a6416da3a05d57fadd6ffdadb382b6d236ca5 | /bin/sh /tmp/ruby/src/trunk/tool/ifchange /tmp/ruby/src/trunk/.bundle/.timestamp/typeprof.revision - I, [2024-04-30T16:00:23.419961 #2875310] INFO -- : echo ba7872795d5de04adb8ff500c0e6afdc81a041dd | /bin/sh /tmp/ruby/src/trunk/tool/ifchange /tmp/ruby/src/trunk/.bundle/.timestamp/rbs.revision - I, [2024-04-30T16:00:23.430734 #2875310] INFO -- : /tmp/ruby/src/trunk/.bundle/.timestamp/power_assert.revision unchanged I, [2024-04-30T16:00:23.430978 #2875310] INFO -- : /tmp/ruby/src/trunk/.bundle/.timestamp/minitest.revision unchanged I, [2024-04-30T16:00:23.431907 #2875310] INFO -- : /tmp/ruby/src/trunk/.bundle/.timestamp/typeprof.revision unchanged I, [2024-04-30T16:00:23.433060 #2875310] INFO -- : /tmp/ruby/src/trunk/.bundle/.timestamp/rbs.revision unchanged I, [2024-04-30T16:00:24.249277 #2875310] INFO -- : Building power_assert@84e85124c5014a139af39161d484156cfe87a9ed to /tmp/ruby/src/trunk/gems/power_assert-2.0.3.gem I, [2024-04-30T16:00:25.205875 #2875310] INFO -- : Successfully built RubyGem I, [2024-04-30T16:00:25.206079 #2875310] INFO -- : Name: power_assert I, [2024-04-30T16:00:25.206197 #2875310] INFO -- : Version: 2.0.4dev I, [2024-04-30T16:00:25.206285 #2875310] INFO -- : File: power_assert-2.0.4dev.gem I, [2024-04-30T16:00:25.881091 #2875310] INFO -- : $$$[end] "make update-download -j4" exit with 0. I, [2024-04-30T16:00:25.881321 #2875310] INFO -- : $$$[beg] make update-rubyspec -j4 I, [2024-04-30T16:00:26.413606 #2875310] INFO -- : make: Nothing to be done for 'update-rubyspec'. I, [2024-04-30T16:00:26.415021 #2875310] INFO -- : $$$[end] "make update-rubyspec -j4" exit with 0. I, [2024-04-30T16:00:26.415200 #2875310] INFO -- : $$$[beg] make update-src -j4 I, [2024-04-30T16:00:27.836944 #2875310] INFO -- : Already up to date. I, [2024-04-30T16:00:27.900639 #2875310] INFO -- : Latest commit hash = d7ba0fec49 I, [2024-04-30T16:00:27.905940 #2875310] INFO -- : $$$[end] "make update-src -j4" exit with 0. I, [2024-04-30T16:00:27.906275 #2875310] INFO -- : $$$[beg] make after-update -j4 I, [2024-04-30T16:00:28.730748 #2875310] INFO -- : /tmp/ruby/src/trunk/revision.h updated I, [2024-04-30T16:00:28.738525 #2875310] INFO -- : generating riscv64-linux-fake.rb I, [2024-04-30T16:00:29.235088 #2875310] INFO -- : riscv64-linux-fake.rb updated I, [2024-04-30T16:00:29.241927 #2875310] INFO -- : generating enc.mk I, [2024-04-30T16:00:30.724927 #2875310] INFO -- : making srcs under enc I, [2024-04-30T16:00:31.035593 #2875310] INFO -- : make[1]: Entering directory '/tmp/ruby/build/trunk' I, [2024-04-30T16:00:31.035799 #2875310] INFO -- : make[1]: Nothing to be done for 'srcs'. I, [2024-04-30T16:00:31.035899 #2875310] INFO -- : make[1]: Leaving directory '/tmp/ruby/build/trunk' I, [2024-04-30T16:00:31.716211 #2875310] INFO -- : Update minitest to ea9caafc0754b1d6236a490d59e624b53209734a I, [2024-04-30T16:00:31.717366 #2875310] INFO -- : Update power_assert to 84e85124c5014a139af39161d484156cfe87a9ed I, [2024-04-30T16:00:31.718334 #2875310] INFO -- : Update rbs to ba7872795d5de04adb8ff500c0e6afdc81a041dd I, [2024-04-30T16:00:31.721535 #2875310] INFO -- : Update typeprof to b19a6416da3a05d57fadd6ffdadb382b6d236ca5 I, [2024-04-30T16:00:31.728049 #2875310] INFO -- : echo 84e85124c5014a139af39161d484156cfe87a9ed | /bin/sh /tmp/ruby/src/trunk/tool/ifchange /tmp/ruby/src/trunk/.bundle/.timestamp/power_assert.revision - I, [2024-04-30T16:00:31.728741 #2875310] INFO -- : echo ba7872795d5de04adb8ff500c0e6afdc81a041dd | /bin/sh /tmp/ruby/src/trunk/tool/ifchange /tmp/ruby/src/trunk/.bundle/.timestamp/rbs.revision - I, [2024-04-30T16:00:31.729434 #2875310] INFO -- : echo ea9caafc0754b1d6236a490d59e624b53209734a | /bin/sh /tmp/ruby/src/trunk/tool/ifchange /tmp/ruby/src/trunk/.bundle/.timestamp/minitest.revision - I, [2024-04-30T16:00:31.738284 #2875310] INFO -- : echo b19a6416da3a05d57fadd6ffdadb382b6d236ca5 | /bin/sh /tmp/ruby/src/trunk/tool/ifchange /tmp/ruby/src/trunk/.bundle/.timestamp/typeprof.revision - I, [2024-04-30T16:00:31.740559 #2875310] INFO -- : /tmp/ruby/src/trunk/.bundle/.timestamp/rbs.revision unchanged I, [2024-04-30T16:00:31.740874 #2875310] INFO -- : /tmp/ruby/src/trunk/.bundle/.timestamp/power_assert.revision unchanged I, [2024-04-30T16:00:31.742529 #2875310] INFO -- : /tmp/ruby/src/trunk/.bundle/.timestamp/minitest.revision unchanged I, [2024-04-30T16:00:31.750008 #2875310] INFO -- : /tmp/ruby/src/trunk/.bundle/.timestamp/typeprof.revision unchanged I, [2024-04-30T16:00:32.566913 #2875310] INFO -- : Building power_assert@84e85124c5014a139af39161d484156cfe87a9ed to /tmp/ruby/src/trunk/gems/power_assert-2.0.3.gem I, [2024-04-30T16:00:33.512575 #2875310] INFO -- : Successfully built RubyGem I, [2024-04-30T16:00:33.512797 #2875310] INFO -- : Name: power_assert I, [2024-04-30T16:00:33.517572 #2875310] INFO -- : Version: 2.0.4dev I, [2024-04-30T16:00:33.517791 #2875310] INFO -- : File: power_assert-2.0.4dev.gem I, [2024-04-30T16:00:33.528148 #2875310] INFO -- : Extracting bundle gem power_assert-2.0.3... I, [2024-04-30T16:00:34.391669 #2875310] INFO -- : Try with hash version of bundled gems instead of gems/power_assert-2.0.3.gem. We don't use this gem with release version of Ruby. I, [2024-04-30T16:00:34.445764 #2875310] INFO -- : Unpacked gems/power_assert-2.0.4dev.gem I, [2024-04-30T16:00:34.461015 #2875310] INFO -- : $$$[end] "make after-update -j4" exit with 0. I, [2024-04-30T16:00:34.461814 #2875310] INFO -- : $$$[beg] make miniruby -j4 I, [2024-04-30T16:00:34.989552 #2875310] INFO -- : BASERUBY = /usr/bin/ruby --disable=gems I, [2024-04-30T16:00:34.990209 #2875310] INFO -- : CC = gcc I, [2024-04-30T16:00:34.990647 #2875310] INFO -- : LD = ld I, [2024-04-30T16:00:34.991073 #2875310] INFO -- : LDSHARED = gcc -shared I, [2024-04-30T16:00:34.991584 #2875310] INFO -- : CFLAGS = -O3 -fno-fast-math -ggdb3 -Wall -Wextra -Wdeprecated-declarations -Wdiv-by-zero -Wduplicated-cond -Wimplicit-function-declaration -Wimplicit-int -Wpointer-arith -Wwrite-strings -Wold-style-definition -Wimplicit-fallthrough=0 -Wmissing-noreturn -Wno-cast-function-type -Wno-constant-logical-operand -Wno-long-long -Wno-missing-field-initializers -Wno-overlength-strings -Wno-packed-bitfield-compat -Wno-parentheses-equality -Wno-self-assign -Wno-tautological-compare -Wno-unused-parameter -Wno-unused-value -Wsuggest-attribute=format -Wsuggest-attribute=noreturn -Wunused-variable -Wmisleading-indentation -Wundef -fPIC I, [2024-04-30T16:00:34.992048 #2875310] INFO -- : XCFLAGS = -U_FORTIFY_SOURCE -D_FORTIFY_SOURCE=2 -fstack-protector-strong -fno-strict-overflow -fvisibility=hidden -fexcess-precision=standard -DRUBY_EXPORT -I. -I.ext/include/riscv64-linux -I/tmp/ruby/src/trunk/include -I/tmp/ruby/src/trunk -I/tmp/ruby/src/trunk/prism -I/tmp/ruby/src/trunk/enc/unicode/15.0.0 I, [2024-04-30T16:00:34.992430 #2875310] INFO -- : CPPFLAGS = I, [2024-04-30T16:00:34.992790 #2875310] INFO -- : DLDFLAGS = -Wl,--compress-debug-sections=zlib -Wl,-soname,libruby.so.3.4 -fstack-protector-strong I, [2024-04-30T16:00:34.993124 #2875310] INFO -- : SOLIBS = -lz -lrt -lrt -lgmp -ldl -lcrypt -lm -lpthread I, [2024-04-30T16:00:34.993431 #2875310] INFO -- : LANG = I, [2024-04-30T16:00:34.993739 #2875310] INFO -- : LC_ALL = I, [2024-04-30T16:00:34.994040 #2875310] INFO -- : LC_CTYPE = I, [2024-04-30T16:00:34.994341 #2875310] INFO -- : MFLAGS = -j4 --jobserver-auth=4,5 I, [2024-04-30T16:00:34.994634 #2875310] INFO -- : RUSTC = rustc I, [2024-04-30T16:00:34.994982 #2875310] INFO -- : YJIT_RUSTC_ARGS = --crate-name=yjit --crate-type=staticlib --edition=2021 -g -C lto=thin -C opt-level=3 -C overflow-checks=on '--out-dir=/tmp/ruby/build/trunk/yjit/target/release/' /tmp/ruby/src/trunk/yjit/src/lib.rs I, [2024-04-30T16:00:35.008115 #2875310] INFO -- : gcc (Debian 13.2.0-4revyos1) 13.2.0 I, [2024-04-30T16:00:35.008308 #2875310] INFO -- : Copyright (C) 2023 Free Software Foundation, Inc. I, [2024-04-30T16:00:35.008393 #2875310] INFO -- : This is free software; see the source for copying conditions. There is NO I, [2024-04-30T16:00:35.008476 #2875310] INFO -- : warranty; not even for MERCHANTABILITY or FITNESS FOR A PARTICULAR PURPOSE. I, [2024-04-30T16:00:35.008617 #2875310] INFO -- : I, [2024-04-30T16:00:35.236932 #2875310] INFO -- : compiling /tmp/ruby/src/trunk/version.c I, [2024-04-30T16:00:36.417227 #2875310] INFO -- : linking miniruby I, [2024-04-30T16:01:16.249017 #2875310] INFO -- : $$$[end] "make miniruby -j4" exit with 0. I, [2024-04-30T16:01:16.249702 #2875310] INFO -- : $$$[beg] make ruby -j4 I, [2024-04-30T16:01:16.770640 #2875310] INFO -- : BASERUBY = /usr/bin/ruby --disable=gems I, [2024-04-30T16:01:16.770974 #2875310] INFO -- : CC = gcc I, [2024-04-30T16:01:16.771164 #2875310] INFO -- : LD = ld I, [2024-04-30T16:01:16.771352 #2875310] INFO -- : LDSHARED = gcc -shared I, [2024-04-30T16:01:16.771682 #2875310] INFO -- : CFLAGS = -O3 -fno-fast-math -ggdb3 -Wall -Wextra -Wdeprecated-declarations -Wdiv-by-zero -Wduplicated-cond -Wimplicit-function-declaration -Wimplicit-int -Wpointer-arith -Wwrite-strings -Wold-style-definition -Wimplicit-fallthrough=0 -Wmissing-noreturn -Wno-cast-function-type -Wno-constant-logical-operand -Wno-long-long -Wno-missing-field-initializers -Wno-overlength-strings -Wno-packed-bitfield-compat -Wno-parentheses-equality -Wno-self-assign -Wno-tautological-compare -Wno-unused-parameter -Wno-unused-value -Wsuggest-attribute=format -Wsuggest-attribute=noreturn -Wunused-variable -Wmisleading-indentation -Wundef -fPIC I, [2024-04-30T16:01:16.771915 #2875310] INFO -- : XCFLAGS = -U_FORTIFY_SOURCE -D_FORTIFY_SOURCE=2 -fstack-protector-strong -fno-strict-overflow -fvisibility=hidden -fexcess-precision=standard -DRUBY_EXPORT -I. -I.ext/include/riscv64-linux -I/tmp/ruby/src/trunk/include -I/tmp/ruby/src/trunk -I/tmp/ruby/src/trunk/prism -I/tmp/ruby/src/trunk/enc/unicode/15.0.0 I, [2024-04-30T16:01:16.772092 #2875310] INFO -- : CPPFLAGS = I, [2024-04-30T16:01:16.772262 #2875310] INFO -- : DLDFLAGS = -Wl,--compress-debug-sections=zlib -Wl,-soname,libruby.so.3.4 -fstack-protector-strong I, [2024-04-30T16:01:16.772448 #2875310] INFO -- : SOLIBS = -lz -lrt -lrt -lgmp -ldl -lcrypt -lm -lpthread I, [2024-04-30T16:01:16.772626 #2875310] INFO -- : LANG = I, [2024-04-30T16:01:16.772796 #2875310] INFO -- : LC_ALL = I, [2024-04-30T16:01:16.772961 #2875310] INFO -- : LC_CTYPE = I, [2024-04-30T16:01:16.773125 #2875310] INFO -- : MFLAGS = -j4 --jobserver-auth=4,5 I, [2024-04-30T16:01:16.773286 #2875310] INFO -- : RUSTC = rustc I, [2024-04-30T16:01:16.773473 #2875310] INFO -- : YJIT_RUSTC_ARGS = --crate-name=yjit --crate-type=staticlib --edition=2021 -g -C lto=thin -C opt-level=3 -C overflow-checks=on '--out-dir=/tmp/ruby/build/trunk/yjit/target/release/' /tmp/ruby/src/trunk/yjit/src/lib.rs I, [2024-04-30T16:01:16.786046 #2875310] INFO -- : gcc (Debian 13.2.0-4revyos1) 13.2.0 I, [2024-04-30T16:01:16.786263 #2875310] INFO -- : Copyright (C) 2023 Free Software Foundation, Inc. I, [2024-04-30T16:01:16.786370 #2875310] INFO -- : This is free software; see the source for copying conditions. There is NO I, [2024-04-30T16:01:16.786473 #2875310] INFO -- : warranty; not even for MERCHANTABILITY or FITNESS FOR A PARTICULAR PURPOSE. I, [2024-04-30T16:01:16.786579 #2875310] INFO -- : I, [2024-04-30T16:01:17.446947 #2875310] INFO -- : builtin_binary.inc updated I, [2024-04-30T16:01:17.458802 #2875310] INFO -- : 63c4b2d66003409833406b3a662615f9f67397fdf425c22dee41f60d762f36d6 builtin_binary.inc I, [2024-04-30T16:01:17.461727 #2875310] INFO -- : compiling /tmp/ruby/src/trunk/builtin.c I, [2024-04-30T16:01:19.059892 #2875310] INFO -- : linking static-library libruby-static.a I, [2024-04-30T16:01:26.306007 #2875310] INFO -- : linking shared-library libruby.so.3.4.0 I, [2024-04-30T16:02:07.046624 #2875310] INFO -- : linking ruby I, [2024-04-30T16:02:07.251171 #2875310] INFO -- : $$$[end] "make ruby -j4" exit with 0. I, [2024-04-30T16:02:07.251840 #2875310] INFO -- : $$$[beg] make all -j4 I, [2024-04-30T16:02:07.770278 #2875310] INFO -- : BASERUBY = /usr/bin/ruby --disable=gems I, [2024-04-30T16:02:07.770522 #2875310] INFO -- : CC = gcc I, [2024-04-30T16:02:07.770708 #2875310] INFO -- : LD = ld I, [2024-04-30T16:02:07.770832 #2875310] INFO -- : LDSHARED = gcc -shared I, [2024-04-30T16:02:07.770994 #2875310] INFO -- : CFLAGS = -O3 -fno-fast-math -ggdb3 -Wall -Wextra -Wdeprecated-declarations -Wdiv-by-zero -Wduplicated-cond -Wimplicit-function-declaration -Wimplicit-int -Wpointer-arith -Wwrite-strings -Wold-style-definition -Wimplicit-fallthrough=0 -Wmissing-noreturn -Wno-cast-function-type -Wno-constant-logical-operand -Wno-long-long -Wno-missing-field-initializers -Wno-overlength-strings -Wno-packed-bitfield-compat -Wno-parentheses-equality -Wno-self-assign -Wno-tautological-compare -Wno-unused-parameter -Wno-unused-value -Wsuggest-attribute=format -Wsuggest-attribute=noreturn -Wunused-variable -Wmisleading-indentation -Wundef -fPIC I, [2024-04-30T16:02:07.771140 #2875310] INFO -- : XCFLAGS = -U_FORTIFY_SOURCE -D_FORTIFY_SOURCE=2 -fstack-protector-strong -fno-strict-overflow -fvisibility=hidden -fexcess-precision=standard -DRUBY_EXPORT -I. -I.ext/include/riscv64-linux -I/tmp/ruby/src/trunk/include -I/tmp/ruby/src/trunk -I/tmp/ruby/src/trunk/prism -I/tmp/ruby/src/trunk/enc/unicode/15.0.0 I, [2024-04-30T16:02:07.771254 #2875310] INFO -- : CPPFLAGS = I, [2024-04-30T16:02:07.771352 #2875310] INFO -- : DLDFLAGS = -Wl,--compress-debug-sections=zlib -Wl,-soname,libruby.so.3.4 -fstack-protector-strong I, [2024-04-30T16:02:07.771550 #2875310] INFO -- : SOLIBS = -lz -lrt -lrt -lgmp -ldl -lcrypt -lm -lpthread I, [2024-04-30T16:02:07.771662 #2875310] INFO -- : LANG = I, [2024-04-30T16:02:07.771758 #2875310] INFO -- : LC_ALL = I, [2024-04-30T16:02:07.771862 #2875310] INFO -- : LC_CTYPE = I, [2024-04-30T16:02:07.771969 #2875310] INFO -- : MFLAGS = -j4 --jobserver-auth=4,5 I, [2024-04-30T16:02:07.772081 #2875310] INFO -- : RUSTC = rustc I, [2024-04-30T16:02:07.772200 #2875310] INFO -- : YJIT_RUSTC_ARGS = --crate-name=yjit --crate-type=staticlib --edition=2021 -g -C lto=thin -C opt-level=3 -C overflow-checks=on '--out-dir=/tmp/ruby/build/trunk/yjit/target/release/' /tmp/ruby/src/trunk/yjit/src/lib.rs I, [2024-04-30T16:02:07.785711 #2875310] INFO -- : gcc (Debian 13.2.0-4revyos1) 13.2.0 I, [2024-04-30T16:02:07.785923 #2875310] INFO -- : Copyright (C) 2023 Free Software Foundation, Inc. I, [2024-04-30T16:02:07.786023 #2875310] INFO -- : This is free software; see the source for copying conditions. There is NO I, [2024-04-30T16:02:07.786120 #2875310] INFO -- : warranty; not even for MERCHANTABILITY or FITNESS FOR A PARTICULAR PURPOSE. I, [2024-04-30T16:02:07.786218 #2875310] INFO -- : I, [2024-04-30T16:02:08.096627 #2875310] INFO -- : generating enc.mk I, [2024-04-30T16:02:08.113814 #2875310] INFO -- : building spec/ruby/optional/capi/ext/array_spec.so I, [2024-04-30T16:02:08.116264 #2875310] INFO -- : building spec/ruby/optional/capi/ext/basic_object_spec.so I, [2024-04-30T16:02:08.118035 #2875310] INFO -- : building spec/ruby/optional/capi/ext/bignum_spec.so I, [2024-04-30T16:02:09.090873 #2875310] INFO -- : building spec/ruby/optional/capi/ext/binding_spec.so I, [2024-04-30T16:02:09.364815 #2875310] INFO -- : building spec/ruby/optional/capi/ext/boolean_spec.so I, [2024-04-30T16:02:09.826129 #2875310] INFO -- : building spec/ruby/optional/capi/ext/class_id_under_autoload_spec.so I, [2024-04-30T16:02:10.173028 #2875310] INFO -- : building spec/ruby/optional/capi/ext/class_spec.so I, [2024-04-30T16:02:10.428965 #2875310] INFO -- : building spec/ruby/optional/capi/ext/class_under_autoload_spec.so I, [2024-04-30T16:02:10.555455 #2875310] INFO -- : building spec/ruby/optional/capi/ext/complex_spec.so I, [2024-04-30T16:02:10.858849 #2875310] INFO -- : building spec/ruby/optional/capi/ext/constants_spec.so I, [2024-04-30T16:02:11.416245 #2875310] INFO -- : building spec/ruby/optional/capi/ext/data_spec.so I, [2024-04-30T16:02:11.633781 #2875310] INFO -- : building spec/ruby/optional/capi/ext/debug_spec.so I, [2024-04-30T16:02:11.927078 #2875310] INFO -- : building spec/ruby/optional/capi/ext/encoding_spec.so I, [2024-04-30T16:02:12.750564 #2875310] INFO -- : building spec/ruby/optional/capi/ext/enumerator_spec.so I, [2024-04-30T16:02:12.882184 #2875310] INFO -- : building spec/ruby/optional/capi/ext/exception_spec.so I, [2024-04-30T16:02:12.988392 #2875310] INFO -- : building spec/ruby/optional/capi/ext/fiber_spec.so I, [2024-04-30T16:02:14.111940 #2875310] INFO -- : building spec/ruby/optional/capi/ext/file_spec.so I, [2024-04-30T16:02:14.260239 #2875310] INFO -- : building spec/ruby/optional/capi/ext/fixnum_spec.so I, [2024-04-30T16:02:14.281796 #2875310] INFO -- : building spec/ruby/optional/capi/ext/float_spec.so I, [2024-04-30T16:02:14.700581 #2875310] INFO -- : building spec/ruby/optional/capi/ext/gc_spec.so I, [2024-04-30T16:02:15.178229 #2875310] INFO -- : building spec/ruby/optional/capi/ext/globals_spec.so I, [2024-04-30T16:02:15.341969 #2875310] INFO -- : building spec/ruby/optional/capi/ext/hash_spec.so I, [2024-04-30T16:02:15.365502 #2875310] INFO -- : building spec/ruby/optional/capi/ext/integer_spec.so I, [2024-04-30T16:02:16.014252 #2875310] INFO -- : building spec/ruby/optional/capi/ext/io_spec.so I, [2024-04-30T16:02:16.492664 #2875310] INFO -- : building spec/ruby/optional/capi/ext/kernel_spec.so I, [2024-04-30T16:02:16.562674 #2875310] INFO -- : building spec/ruby/optional/capi/ext/language_spec.so I, [2024-04-30T16:02:16.884389 #2875310] INFO -- : building spec/ruby/optional/capi/ext/marshal_spec.so I, [2024-04-30T16:02:17.729977 #2875310] INFO -- : building spec/ruby/optional/capi/ext/module_spec.so I, [2024-04-30T16:02:17.985414 #2875310] INFO -- : building spec/ruby/optional/capi/ext/module_under_autoload_spec.so I, [2024-04-30T16:02:18.237872 #2875310] INFO -- : building spec/ruby/optional/capi/ext/mutex_spec.so I, [2024-04-30T16:02:19.056560 #2875310] INFO -- : building spec/ruby/optional/capi/ext/numeric_spec.so I, [2024-04-30T16:02:19.094641 #2875310] INFO -- : building spec/ruby/optional/capi/ext/object_spec.so I, [2024-04-30T16:02:19.378473 #2875310] INFO -- : building spec/ruby/optional/capi/ext/proc_spec.so I, [2024-04-30T16:02:19.425748 #2875310] INFO -- : building spec/ruby/optional/capi/ext/range_spec.so I, [2024-04-30T16:02:20.522805 #2875310] INFO -- : building spec/ruby/optional/capi/ext/rational_spec.so I, [2024-04-30T16:02:20.700045 #2875310] INFO -- : building spec/ruby/optional/capi/ext/rbasic_spec.so I, [2024-04-30T16:02:20.873880 #2875310] INFO -- : building spec/ruby/optional/capi/ext/regexp_spec.so I, [2024-04-30T16:02:21.645956 #2875310] INFO -- : building spec/ruby/optional/capi/ext/st_spec.so I, [2024-04-30T16:02:21.824297 #2875310] INFO -- : building spec/ruby/optional/capi/ext/string_spec.so I, [2024-04-30T16:02:22.108896 #2875310] INFO -- : building spec/ruby/optional/capi/ext/struct_spec.so I, [2024-04-30T16:02:22.159281 #2875310] INFO -- : building spec/ruby/optional/capi/ext/symbol_spec.so I, [2024-04-30T16:02:22.813116 #2875310] INFO -- : building spec/ruby/optional/capi/ext/thread_spec.so I, [2024-04-30T16:02:23.290052 #2875310] INFO -- : building spec/ruby/optional/capi/ext/time_spec.so I, [2024-04-30T16:02:23.730525 #2875310] INFO -- : building spec/ruby/optional/capi/ext/tracepoint_spec.so I, [2024-04-30T16:02:24.287253 #2875310] INFO -- : building spec/ruby/optional/capi/ext/typed_data_spec.so I, [2024-04-30T16:02:24.810743 #2875310] INFO -- : building spec/ruby/optional/capi/ext/util_spec.so I, [2024-04-30T16:02:24.868842 #2875310] INFO -- : making enc I, [2024-04-30T16:02:25.066975 #2875310] INFO -- : make[1]: Entering directory '/tmp/ruby/build/trunk' I, [2024-04-30T16:02:25.067214 #2875310] INFO -- : make[1]: Nothing to be done for 'enc'. I, [2024-04-30T16:02:25.067400 #2875310] INFO -- : make[1]: Leaving directory '/tmp/ruby/build/trunk' I, [2024-04-30T16:02:25.073961 #2875310] INFO -- : making srcs under enc I, [2024-04-30T16:02:25.415949 #2875310] INFO -- : make[1]: Entering directory '/tmp/ruby/build/trunk' I, [2024-04-30T16:02:25.416174 #2875310] INFO -- : make[1]: Nothing to be done for 'srcs'. I, [2024-04-30T16:02:25.416380 #2875310] INFO -- : make[1]: Leaving directory '/tmp/ruby/build/trunk' I, [2024-04-30T16:02:25.419164 #2875310] INFO -- : generating transdb.h I, [2024-04-30T16:02:26.702543 #2875310] INFO -- : transdb.h unchanged I, [2024-04-30T16:02:26.708564 #2875310] INFO -- : generating makefiles ext/configure-ext.mk I, [2024-04-30T16:02:26.709196 #2875310] INFO -- : making trans I, [2024-04-30T16:02:26.899900 #2875310] INFO -- : ext/configure-ext.mk updated I, [2024-04-30T16:02:26.911641 #2875310] INFO -- : make[1]: Entering directory '/tmp/ruby/build/trunk' I, [2024-04-30T16:02:27.060872 #2875310] INFO -- : make[1]: Entering directory '/tmp/ruby/build/trunk' I, [2024-04-30T16:02:27.061089 #2875310] INFO -- : make[1]: Nothing to be done for 'trans'. I, [2024-04-30T16:02:27.061206 #2875310] INFO -- : make[1]: Leaving directory '/tmp/ruby/build/trunk' I, [2024-04-30T16:02:28.640012 #2875310] INFO -- : making encs I, [2024-04-30T16:02:29.061328 #2875310] INFO -- : make[1]: Entering directory '/tmp/ruby/build/trunk' I, [2024-04-30T16:02:29.061586 #2875310] INFO -- : make[1]: Nothing to be done for 'encs'. I, [2024-04-30T16:02:29.066413 #2875310] INFO -- : make[1]: Leaving directory '/tmp/ruby/build/trunk' I, [2024-04-30T16:02:30.420205 #2875310] INFO -- : make[1]: Leaving directory '/tmp/ruby/build/trunk' I, [2024-04-30T16:02:30.422299 #2875310] INFO -- : generating makefile exts.mk I, [2024-04-30T16:02:30.751019 #2875310] INFO -- : exts.mk unchanged I, [2024-04-30T16:02:30.796445 #2875310] INFO -- : make[1]: Entering directory '/tmp/ruby/build/trunk' I, [2024-04-30T16:02:31.308734 #2875310] INFO -- : make[2]: Entering directory '/tmp/ruby/build/trunk/ext/coverage' I, [2024-04-30T16:02:31.312839 #2875310] INFO -- : make[2]: Entering directory '/tmp/ruby/build/trunk/ext/digest' I, [2024-04-30T16:02:31.329737 #2875310] INFO -- : make[2]: Entering directory '/tmp/ruby/build/trunk/ext/date' I, [2024-04-30T16:02:31.330765 #2875310] INFO -- : make[2]: Leaving directory '/tmp/ruby/build/trunk/ext/coverage' I, [2024-04-30T16:02:31.352130 #2875310] INFO -- : make[2]: Leaving directory '/tmp/ruby/build/trunk/ext/date' I, [2024-04-30T16:02:31.355498 #2875310] INFO -- : make[2]: Leaving directory '/tmp/ruby/build/trunk/ext/digest' I, [2024-04-30T16:02:31.379357 #2875310] INFO -- : make[2]: Entering directory '/tmp/ruby/build/trunk/ext/io/console' I, [2024-04-30T16:02:31.386998 #2875310] INFO -- : make[2]: Entering directory '/tmp/ruby/build/trunk/ext/fiddle' I, [2024-04-30T16:02:31.396708 #2875310] INFO -- : make[2]: Entering directory '/tmp/ruby/build/trunk/ext/json' I, [2024-04-30T16:02:31.403536 #2875310] INFO -- : make[2]: Leaving directory '/tmp/ruby/build/trunk/ext/io/console' I, [2024-04-30T16:02:31.420711 #2875310] INFO -- : make[2]: Entering directory '/tmp/ruby/build/trunk/ext/monitor' I, [2024-04-30T16:02:31.439681 #2875310] INFO -- : make[2]: Leaving directory '/tmp/ruby/build/trunk/ext/monitor' I, [2024-04-30T16:02:31.444310 #2875310] INFO -- : make[2]: Entering directory '/tmp/ruby/build/trunk/ext/objspace' I, [2024-04-30T16:02:31.452456 #2875310] INFO -- : make[2]: Leaving directory '/tmp/ruby/build/trunk/ext/fiddle' I, [2024-04-30T16:02:31.460211 #2875310] INFO -- : make[2]: Leaving directory '/tmp/ruby/build/trunk/ext/json' I, [2024-04-30T16:02:31.476462 #2875310] INFO -- : make[2]: Leaving directory '/tmp/ruby/build/trunk/ext/objspace' I, [2024-04-30T16:02:31.478578 #2875310] INFO -- : make[2]: Entering directory '/tmp/ruby/build/trunk/ext/pathname' I, [2024-04-30T16:02:31.497436 #2875310] INFO -- : make[2]: Leaving directory '/tmp/ruby/build/trunk/ext/pathname' I, [2024-04-30T16:02:31.501751 #2875310] INFO -- : make[2]: Entering directory '/tmp/ruby/build/trunk/ext/psych' I, [2024-04-30T16:02:31.504731 #2875310] INFO -- : make[2]: Entering directory '/tmp/ruby/build/trunk/ext/pty' I, [2024-04-30T16:02:31.524071 #2875310] INFO -- : make[2]: Leaving directory '/tmp/ruby/build/trunk/ext/pty' I, [2024-04-30T16:02:31.561260 #2875310] INFO -- : make[2]: Entering directory '/tmp/ruby/build/trunk/ext/openssl' I, [2024-04-30T16:02:31.570485 #2875310] INFO -- : make[2]: Entering directory '/tmp/ruby/build/trunk/ext/rubyvm' I, [2024-04-30T16:02:31.590873 #2875310] INFO -- : make[2]: Entering directory '/tmp/ruby/build/trunk/ext/ripper' I, [2024-04-30T16:02:31.613624 #2875310] INFO -- : make[2]: Leaving directory '/tmp/ruby/build/trunk/ext/rubyvm' I, [2024-04-30T16:02:31.621815 #2875310] INFO -- : make[2]: Leaving directory '/tmp/ruby/build/trunk/ext/psych' I, [2024-04-30T16:02:31.625496 #2875310] INFO -- : make[2]: Leaving directory '/tmp/ruby/build/trunk/ext/ripper' I, [2024-04-30T16:02:31.669286 #2875310] INFO -- : make[2]: Entering directory '/tmp/ruby/build/trunk/.bundle/gems/bigdecimal-3.1.7/ext/bigdecimal' I, [2024-04-30T16:02:31.689784 #2875310] INFO -- : make[2]: Entering directory '/tmp/ruby/build/trunk/ext/socket' I, [2024-04-30T16:02:31.692436 #2875310] INFO -- : make[2]: Entering directory '/tmp/ruby/build/trunk/.bundle/gems/debug-1.9.2/ext/debug' I, [2024-04-30T16:02:31.697938 #2875310] INFO -- : make[2]: Leaving directory '/tmp/ruby/build/trunk/ext/openssl' I, [2024-04-30T16:02:31.712727 #2875310] INFO -- : make[2]: Entering directory '/tmp/ruby/build/trunk/.bundle/gems/nkf-0.2.0/ext/nkf' I, [2024-04-30T16:02:31.752726 #2875310] INFO -- : make[2]: Leaving directory '/tmp/ruby/build/trunk/ext/socket' I, [2024-04-30T16:02:31.766751 #2875310] INFO -- : make[2]: Entering directory '/tmp/ruby/build/trunk/.bundle/gems/racc-1.7.3/ext/racc/cparse' I, [2024-04-30T16:02:31.839170 #2875310] INFO -- : make[2]: Leaving directory '/tmp/ruby/build/trunk/.bundle/gems/bigdecimal-3.1.7/ext/bigdecimal' I, [2024-04-30T16:02:31.857869 #2875310] INFO -- : make[2]: Leaving directory '/tmp/ruby/build/trunk/.bundle/gems/debug-1.9.2/ext/debug' I, [2024-04-30T16:02:31.858304 #2875310] INFO -- : make[2]: Entering directory '/tmp/ruby/build/trunk/.bundle/gems/rbs-3.4.4/ext/rbs_extension' I, [2024-04-30T16:02:31.872898 #2875310] INFO -- : make[2]: Entering directory '/tmp/ruby/build/trunk/.bundle/gems/syslog-0.1.2/ext/syslog' I, [2024-04-30T16:02:31.879082 #2875310] INFO -- : make[2]: Leaving directory '/tmp/ruby/build/trunk/.bundle/gems/nkf-0.2.0/ext/nkf' I, [2024-04-30T16:02:31.941819 #2875310] INFO -- : make[2]: Leaving directory '/tmp/ruby/build/trunk/.bundle/gems/racc-1.7.3/ext/racc/cparse' I, [2024-04-30T16:02:32.002419 #2875310] INFO -- : make[2]: Entering directory '/tmp/ruby/build/trunk/ext/digest/sha2' I, [2024-04-30T16:02:32.028154 #2875310] INFO -- : make[2]: Leaving directory '/tmp/ruby/build/trunk/ext/digest/sha2' I, [2024-04-30T16:02:32.029452 #2875310] INFO -- : make[2]: Leaving directory '/tmp/ruby/build/trunk/.bundle/gems/rbs-3.4.4/ext/rbs_extension' I, [2024-04-30T16:02:32.041792 #2875310] INFO -- : make[2]: Leaving directory '/tmp/ruby/build/trunk/.bundle/gems/syslog-0.1.2/ext/syslog' I, [2024-04-30T16:02:32.254346 #2875310] INFO -- : make[2]: Entering directory '/tmp/ruby/build/trunk' I, [2024-04-30T16:02:32.904960 #2875310] INFO -- : linking ruby I, [2024-04-30T16:02:33.113404 #2875310] INFO -- : make[2]: Leaving directory '/tmp/ruby/build/trunk' I, [2024-04-30T16:02:33.116343 #2875310] INFO -- : make[1]: Leaving directory '/tmp/ruby/build/trunk' I, [2024-04-30T16:02:33.159405 #2875310] INFO -- : make[1]: Entering directory '/tmp/ruby/build/trunk' I, [2024-04-30T16:02:33.159687 #2875310] INFO -- : make[1]: Nothing to be done for 'note'. I, [2024-04-30T16:02:33.159891 #2875310] INFO -- : make[1]: Leaving directory '/tmp/ruby/build/trunk' I, [2024-04-30T16:02:33.163308 #2875310] INFO -- : $$$[end] "make all -j4" exit with 0. I, [2024-04-30T16:02:33.164093 #2875310] INFO -- : $$$[beg] make install -j4 I, [2024-04-30T16:02:33.731838 #2875310] INFO -- : Update minitest to ea9caafc0754b1d6236a490d59e624b53209734a I, [2024-04-30T16:02:33.732607 #2875310] INFO -- : Update power_assert to 84e85124c5014a139af39161d484156cfe87a9ed I, [2024-04-30T16:02:33.735228 #2875310] INFO -- : Update typeprof to b19a6416da3a05d57fadd6ffdadb382b6d236ca5 I, [2024-04-30T16:02:33.735921 #2875310] INFO -- : Update rbs to ba7872795d5de04adb8ff500c0e6afdc81a041dd I, [2024-04-30T16:02:33.743665 #2875310] INFO -- : echo ea9caafc0754b1d6236a490d59e624b53209734a | /bin/sh /tmp/ruby/src/trunk/tool/ifchange /tmp/ruby/src/trunk/.bundle/.timestamp/minitest.revision - I, [2024-04-30T16:02:33.744223 #2875310] INFO -- : echo 84e85124c5014a139af39161d484156cfe87a9ed | /bin/sh /tmp/ruby/src/trunk/tool/ifchange /tmp/ruby/src/trunk/.bundle/.timestamp/power_assert.revision - I, [2024-04-30T16:02:33.749935 #2875310] INFO -- : echo ba7872795d5de04adb8ff500c0e6afdc81a041dd | /bin/sh /tmp/ruby/src/trunk/tool/ifchange /tmp/ruby/src/trunk/.bundle/.timestamp/rbs.revision - I, [2024-04-30T16:02:33.752271 #2875310] INFO -- : echo b19a6416da3a05d57fadd6ffdadb382b6d236ca5 | /bin/sh /tmp/ruby/src/trunk/tool/ifchange /tmp/ruby/src/trunk/.bundle/.timestamp/typeprof.revision - I, [2024-04-30T16:02:33.753971 #2875310] INFO -- : /tmp/ruby/src/trunk/.bundle/.timestamp/minitest.revision unchanged I, [2024-04-30T16:02:33.760033 #2875310] INFO -- : BASERUBY = /usr/bin/ruby --disable=gems I, [2024-04-30T16:02:33.760256 #2875310] INFO -- : CC = gcc I, [2024-04-30T16:02:33.760376 #2875310] INFO -- : LD = ld I, [2024-04-30T16:02:33.760531 #2875310] INFO -- : LDSHARED = gcc -shared I, [2024-04-30T16:02:33.760685 #2875310] INFO -- : CFLAGS = -O3 -fno-fast-math -ggdb3 -Wall -Wextra -Wdeprecated-declarations -Wdiv-by-zero -Wduplicated-cond -Wimplicit-function-declaration -Wimplicit-int -Wpointer-arith -Wwrite-strings -Wold-style-definition -Wimplicit-fallthrough=0 -Wmissing-noreturn -Wno-cast-function-type -Wno-constant-logical-operand -Wno-long-long -Wno-missing-field-initializers -Wno-overlength-strings -Wno-packed-bitfield-compat -Wno-parentheses-equality -Wno-self-assign -Wno-tautological-compare -Wno-unused-parameter -Wno-unused-value -Wsuggest-attribute=format -Wsuggest-attribute=noreturn -Wunused-variable -Wmisleading-indentation -Wundef -fPIC I, [2024-04-30T16:02:33.760815 #2875310] INFO -- : XCFLAGS = -U_FORTIFY_SOURCE -D_FORTIFY_SOURCE=2 -fstack-protector-strong -fno-strict-overflow -fvisibility=hidden -fexcess-precision=standard -DRUBY_EXPORT -I. -I.ext/include/riscv64-linux -I/tmp/ruby/src/trunk/include -I/tmp/ruby/src/trunk -I/tmp/ruby/src/trunk/prism -I/tmp/ruby/src/trunk/enc/unicode/15.0.0 I, [2024-04-30T16:02:33.760942 #2875310] INFO -- : CPPFLAGS = I, [2024-04-30T16:02:33.761080 #2875310] INFO -- : DLDFLAGS = -Wl,--compress-debug-sections=zlib -Wl,-soname,libruby.so.3.4 -fstack-protector-strong I, [2024-04-30T16:02:33.761205 #2875310] INFO -- : SOLIBS = -lz -lrt -lrt -lgmp -ldl -lcrypt -lm -lpthread I, [2024-04-30T16:02:33.761319 #2875310] INFO -- : LANG = I, [2024-04-30T16:02:33.761424 #2875310] INFO -- : LC_ALL = I, [2024-04-30T16:02:33.761536 #2875310] INFO -- : LC_CTYPE = I, [2024-04-30T16:02:33.761649 #2875310] INFO -- : MFLAGS = -j4 --jobserver-auth=4,5 I, [2024-04-30T16:02:33.761793 #2875310] INFO -- : RUSTC = rustc I, [2024-04-30T16:02:33.761940 #2875310] INFO -- : YJIT_RUSTC_ARGS = --crate-name=yjit --crate-type=staticlib --edition=2021 -g -C lto=thin -C opt-level=3 -C overflow-checks=on '--out-dir=/tmp/ruby/build/trunk/yjit/target/release/' /tmp/ruby/src/trunk/yjit/src/lib.rs I, [2024-04-30T16:02:33.762101 #2875310] INFO -- : /tmp/ruby/src/trunk/.bundle/.timestamp/rbs.revision unchanged I, [2024-04-30T16:02:33.763345 #2875310] INFO -- : /tmp/ruby/src/trunk/.bundle/.timestamp/power_assert.revision unchanged I, [2024-04-30T16:02:33.765891 #2875310] INFO -- : /tmp/ruby/src/trunk/.bundle/.timestamp/typeprof.revision unchanged I, [2024-04-30T16:02:34.060210 #2875310] INFO -- : generating enc.mk I, [2024-04-30T16:02:34.065352 #2875310] INFO -- : gcc (Debian 13.2.0-4revyos1) 13.2.0 I, [2024-04-30T16:02:34.065643 #2875310] INFO -- : Copyright (C) 2023 Free Software Foundation, Inc. I, [2024-04-30T16:02:34.065748 #2875310] INFO -- : This is free software; see the source for copying conditions. There is NO I, [2024-04-30T16:02:34.065847 #2875310] INFO -- : warranty; not even for MERCHANTABILITY or FITNESS FOR A PARTICULAR PURPOSE. I, [2024-04-30T16:02:34.066108 #2875310] INFO -- : I, [2024-04-30T16:02:35.599010 #2875310] INFO -- : making srcs under enc I, [2024-04-30T16:02:35.920804 #2875310] INFO -- : make[1]: Entering directory '/tmp/ruby/build/trunk' I, [2024-04-30T16:02:35.921019 #2875310] INFO -- : make[1]: Nothing to be done for 'srcs'. I, [2024-04-30T16:02:35.921139 #2875310] INFO -- : make[1]: Leaving directory '/tmp/ruby/build/trunk' I, [2024-04-30T16:02:35.923899 #2875310] INFO -- : making enc I, [2024-04-30T16:02:36.092266 #2875310] INFO -- : make[1]: Entering directory '/tmp/ruby/build/trunk' I, [2024-04-30T16:02:36.092487 #2875310] INFO -- : make[1]: Nothing to be done for 'enc'. I, [2024-04-30T16:02:36.092623 #2875310] INFO -- : make[1]: Leaving directory '/tmp/ruby/build/trunk' I, [2024-04-30T16:02:36.095541 #2875310] INFO -- : generating transdb.h I, [2024-04-30T16:02:36.456947 #2875310] INFO -- : Building power_assert@84e85124c5014a139af39161d484156cfe87a9ed to /tmp/ruby/src/trunk/gems/power_assert-2.0.3.gem I, [2024-04-30T16:02:37.344386 #2875310] INFO -- : transdb.h unchanged I, [2024-04-30T16:02:37.350108 #2875310] INFO -- : generating makefiles ext/configure-ext.mk I, [2024-04-30T16:02:37.351272 #2875310] INFO -- : making trans I, [2024-04-30T16:02:37.408735 #2875310] INFO -- : Successfully built RubyGem I, [2024-04-30T16:02:37.408939 #2875310] INFO -- : Name: power_assert I, [2024-04-30T16:02:37.409031 #2875310] INFO -- : Version: 2.0.4dev I, [2024-04-30T16:02:37.409118 #2875310] INFO -- : File: power_assert-2.0.4dev.gem I, [2024-04-30T16:02:37.424847 #2875310] INFO -- : Extracting bundle gem power_assert-2.0.3... I, [2024-04-30T16:02:37.550099 #2875310] INFO -- : ext/configure-ext.mk unchanged I, [2024-04-30T16:02:37.562606 #2875310] INFO -- : make[1]: Entering directory '/tmp/ruby/build/trunk' I, [2024-04-30T16:02:37.708077 #2875310] INFO -- : make[1]: Entering directory '/tmp/ruby/build/trunk' I, [2024-04-30T16:02:37.708317 #2875310] INFO -- : make[1]: Nothing to be done for 'trans'. I, [2024-04-30T16:02:37.708452 #2875310] INFO -- : make[1]: Leaving directory '/tmp/ruby/build/trunk' I, [2024-04-30T16:02:38.415467 #2875310] INFO -- : Try with hash version of bundled gems instead of gems/power_assert-2.0.3.gem. We don't use this gem with release version of Ruby. I, [2024-04-30T16:02:38.481561 #2875310] INFO -- : Unpacked gems/power_assert-2.0.4dev.gem I, [2024-04-30T16:02:38.498750 #2875310] INFO -- : making encs I, [2024-04-30T16:02:38.924691 #2875310] INFO -- : make[1]: Entering directory '/tmp/ruby/build/trunk' I, [2024-04-30T16:02:38.924914 #2875310] INFO -- : make[1]: Nothing to be done for 'encs'. I, [2024-04-30T16:02:38.925034 #2875310] INFO -- : make[1]: Leaving directory '/tmp/ruby/build/trunk' I, [2024-04-30T16:02:41.370186 #2875310] INFO -- : make[1]: Leaving directory '/tmp/ruby/build/trunk' I, [2024-04-30T16:02:41.372388 #2875310] INFO -- : generating makefile exts.mk I, [2024-04-30T16:02:41.719777 #2875310] INFO -- : exts.mk unchanged I, [2024-04-30T16:02:41.764593 #2875310] INFO -- : make[1]: Entering directory '/tmp/ruby/build/trunk' I, [2024-04-30T16:02:42.273758 #2875310] INFO -- : make[2]: Entering directory '/tmp/ruby/build/trunk/ext/coverage' I, [2024-04-30T16:02:42.286219 #2875310] INFO -- : make[2]: Entering directory '/tmp/ruby/build/trunk/ext/digest' I, [2024-04-30T16:02:42.294185 #2875310] INFO -- : make[2]: Entering directory '/tmp/ruby/build/trunk/ext/date' I, [2024-04-30T16:02:42.298682 #2875310] INFO -- : make[2]: Leaving directory '/tmp/ruby/build/trunk/ext/coverage' I, [2024-04-30T16:02:42.319822 #2875310] INFO -- : make[2]: Leaving directory '/tmp/ruby/build/trunk/ext/date' I, [2024-04-30T16:02:42.337467 #2875310] INFO -- : make[2]: Leaving directory '/tmp/ruby/build/trunk/ext/digest' I, [2024-04-30T16:02:42.350826 #2875310] INFO -- : make[2]: Entering directory '/tmp/ruby/build/trunk/ext/io/console' I, [2024-04-30T16:02:42.355152 #2875310] INFO -- : make[2]: Entering directory '/tmp/ruby/build/trunk/ext/fiddle' I, [2024-04-30T16:02:42.366362 #2875310] INFO -- : make[2]: Entering directory '/tmp/ruby/build/trunk/ext/json' I, [2024-04-30T16:02:42.371850 #2875310] INFO -- : make[2]: Leaving directory '/tmp/ruby/build/trunk/ext/io/console' I, [2024-04-30T16:02:42.393626 #2875310] INFO -- : make[2]: Entering directory '/tmp/ruby/build/trunk/ext/monitor' I, [2024-04-30T16:02:42.411563 #2875310] INFO -- : make[2]: Leaving directory '/tmp/ruby/build/trunk/ext/monitor' I, [2024-04-30T16:02:42.412867 #2875310] INFO -- : make[2]: Entering directory '/tmp/ruby/build/trunk/ext/objspace' I, [2024-04-30T16:02:42.414085 #2875310] INFO -- : make[2]: Leaving directory '/tmp/ruby/build/trunk/ext/fiddle' I, [2024-04-30T16:02:42.429002 #2875310] INFO -- : make[2]: Leaving directory '/tmp/ruby/build/trunk/ext/json' I, [2024-04-30T16:02:42.440931 #2875310] INFO -- : make[2]: Entering directory '/tmp/ruby/build/trunk/ext/pathname' I, [2024-04-30T16:02:42.452202 #2875310] INFO -- : make[2]: Leaving directory '/tmp/ruby/build/trunk/ext/objspace' I, [2024-04-30T16:02:42.465255 #2875310] INFO -- : make[2]: Leaving directory '/tmp/ruby/build/trunk/ext/pathname' I, [2024-04-30T16:02:42.474387 #2875310] INFO -- : make[2]: Entering directory '/tmp/ruby/build/trunk/ext/psych' I, [2024-04-30T16:02:42.481708 #2875310] INFO -- : make[2]: Entering directory '/tmp/ruby/build/trunk/ext/pty' I, [2024-04-30T16:02:42.500665 #2875310] INFO -- : make[2]: Leaving directory '/tmp/ruby/build/trunk/ext/pty' I, [2024-04-30T16:02:42.530571 #2875310] INFO -- : make[2]: Entering directory '/tmp/ruby/build/trunk/ext/openssl' I, [2024-04-30T16:02:42.538659 #2875310] INFO -- : make[2]: Entering directory '/tmp/ruby/build/trunk/ext/rubyvm' I, [2024-04-30T16:02:42.550858 #2875310] INFO -- : make[2]: Leaving directory '/tmp/ruby/build/trunk/ext/rubyvm' I, [2024-04-30T16:02:42.556830 #2875310] INFO -- : make[2]: Entering directory '/tmp/ruby/build/trunk/ext/ripper' I, [2024-04-30T16:02:42.604793 #2875310] INFO -- : make[2]: Leaving directory '/tmp/ruby/build/trunk/ext/ripper' I, [2024-04-30T16:02:42.611998 #2875310] INFO -- : make[2]: Leaving directory '/tmp/ruby/build/trunk/ext/psych' I, [2024-04-30T16:02:42.640535 #2875310] INFO -- : make[2]: Entering directory '/tmp/ruby/build/trunk/ext/socket' I, [2024-04-30T16:02:42.655954 #2875310] INFO -- : make[2]: Entering directory '/tmp/ruby/build/trunk/.bundle/gems/bigdecimal-3.1.7/ext/bigdecimal' I, [2024-04-30T16:02:42.673430 #2875310] INFO -- : make[2]: Leaving directory '/tmp/ruby/build/trunk/ext/openssl' I, [2024-04-30T16:02:42.678101 #2875310] INFO -- : make[2]: Entering directory '/tmp/ruby/build/trunk/.bundle/gems/debug-1.9.2/ext/debug' I, [2024-04-30T16:02:42.688027 #2875310] INFO -- : make[2]: Entering directory '/tmp/ruby/build/trunk/.bundle/gems/nkf-0.2.0/ext/nkf' I, [2024-04-30T16:02:42.697175 #2875310] INFO -- : make[2]: Leaving directory '/tmp/ruby/build/trunk/ext/socket' I, [2024-04-30T16:02:42.712186 #2875310] INFO -- : make[2]: Entering directory '/tmp/ruby/build/trunk/.bundle/gems/racc-1.7.3/ext/racc/cparse' I, [2024-04-30T16:02:42.826300 #2875310] INFO -- : make[2]: Leaving directory '/tmp/ruby/build/trunk/.bundle/gems/bigdecimal-3.1.7/ext/bigdecimal' I, [2024-04-30T16:02:42.844890 #2875310] INFO -- : make[2]: Leaving directory '/tmp/ruby/build/trunk/.bundle/gems/debug-1.9.2/ext/debug' I, [2024-04-30T16:02:42.845992 #2875310] INFO -- : make[2]: Entering directory '/tmp/ruby/build/trunk/.bundle/gems/rbs-3.4.4/ext/rbs_extension' I, [2024-04-30T16:02:42.859787 #2875310] INFO -- : make[2]: Entering directory '/tmp/ruby/build/trunk/.bundle/gems/syslog-0.1.2/ext/syslog' I, [2024-04-30T16:02:42.866761 #2875310] INFO -- : make[2]: Leaving directory '/tmp/ruby/build/trunk/.bundle/gems/nkf-0.2.0/ext/nkf' I, [2024-04-30T16:02:42.877983 #2875310] INFO -- : make[2]: Leaving directory '/tmp/ruby/build/trunk/.bundle/gems/racc-1.7.3/ext/racc/cparse' I, [2024-04-30T16:02:42.963354 #2875310] INFO -- : make[2]: Entering directory '/tmp/ruby/build/trunk/ext/digest/sha2' I, [2024-04-30T16:02:42.988670 #2875310] INFO -- : make[2]: Leaving directory '/tmp/ruby/build/trunk/ext/digest/sha2' I, [2024-04-30T16:02:43.012069 #2875310] INFO -- : make[2]: Leaving directory '/tmp/ruby/build/trunk/.bundle/gems/rbs-3.4.4/ext/rbs_extension' I, [2024-04-30T16:02:43.024879 #2875310] INFO -- : make[2]: Leaving directory '/tmp/ruby/build/trunk/.bundle/gems/syslog-0.1.2/ext/syslog' I, [2024-04-30T16:02:43.244088 #2875310] INFO -- : make[2]: Entering directory '/tmp/ruby/build/trunk' I, [2024-04-30T16:02:43.883702 #2875310] INFO -- : make[2]: 'ruby' is up to date. I, [2024-04-30T16:02:43.883919 #2875310] INFO -- : make[2]: Leaving directory '/tmp/ruby/build/trunk' I, [2024-04-30T16:02:43.885733 #2875310] INFO -- : make[1]: Leaving directory '/tmp/ruby/build/trunk' I, [2024-04-30T16:02:43.919817 #2875310] INFO -- : make[1]: Entering directory '/tmp/ruby/build/trunk' I, [2024-04-30T16:02:43.920012 #2875310] INFO -- : make[1]: Nothing to be done for 'note'. I, [2024-04-30T16:02:43.920108 #2875310] INFO -- : make[1]: Leaving directory '/tmp/ruby/build/trunk' I, [2024-04-30T16:02:43.921117 #2875310] INFO -- : ./miniruby -I/tmp/ruby/src/trunk/lib -I. -I.ext/common /tmp/ruby/src/trunk/tool/runruby.rb --extout=.ext -- --disable-gems -r./riscv64-linux-fake /tmp/ruby/src/trunk/tool/rbinstall.rb --make="make" --dest-dir="" --extout=".ext" --ext-build-dir="./ext" --mflags="-j4 --jobserver-auth=4,5" --make-flags=" -j4 --jobserver-auth=4,5" --data-mode=0644 --prog-mode=0755 --installed-list .installed.list --mantype="doc" --gnumake --install=all --exclude=doc I, [2024-04-30T16:02:45.200997 #2875310] INFO -- : Installing to I, [2024-04-30T16:02:45.201240 #2875310] INFO -- : installing binary commands: /tmp/ruby/install/trunk/bin I, [2024-04-30T16:02:45.203300 #2875310] INFO -- : installing base libraries: /tmp/ruby/install/trunk/lib I, [2024-04-30T16:02:45.278328 #2875310] INFO -- : installing arch files: /tmp/ruby/install/trunk/lib/ruby/3.4.0+0/riscv64-linux I, [2024-04-30T16:02:45.279008 #2875310] INFO -- : installing pkgconfig data: /tmp/ruby/install/trunk/lib/pkgconfig I, [2024-04-30T16:02:45.279575 #2875310] INFO -- : installing extension objects: /tmp/ruby/install/trunk/lib/ruby/3.4.0+0/riscv64-linux I, [2024-04-30T16:02:45.396966 #2875310] INFO -- : installing extension objects: /tmp/ruby/install/trunk/lib/ruby/site_ruby/3.4.0+0/riscv64-linux I, [2024-04-30T16:02:45.397158 #2875310] INFO -- : installing extension objects: /tmp/ruby/install/trunk/lib/ruby/vendor_ruby/3.4.0+0/riscv64-linux I, [2024-04-30T16:02:45.397641 #2875310] INFO -- : installing extension headers: /tmp/ruby/install/trunk/include/ruby-3.4.0+0/riscv64-linux I, [2024-04-30T16:02:45.399686 #2875310] INFO -- : installing extension scripts: /tmp/ruby/install/trunk/lib/ruby/3.4.0+0 I, [2024-04-30T16:02:45.448359 #2875310] INFO -- : installing extension scripts: /tmp/ruby/install/trunk/lib/ruby/site_ruby/3.4.0+0 I, [2024-04-30T16:02:45.448543 #2875310] INFO -- : installing extension scripts: /tmp/ruby/install/trunk/lib/ruby/vendor_ruby/3.4.0+0 I, [2024-04-30T16:02:45.448635 #2875310] INFO -- : installing extension headers: /tmp/ruby/install/trunk/include/ruby-3.4.0+0/ruby I, [2024-04-30T16:02:45.449472 #2875310] INFO -- : installing command scripts: /tmp/ruby/install/trunk/bin I, [2024-04-30T16:02:45.450316 #2875310] INFO -- : installing library scripts: /tmp/ruby/install/trunk/lib/ruby/3.4.0+0 I, [2024-04-30T16:02:45.970911 #2875310] INFO -- : installing common headers: /tmp/ruby/install/trunk/include/ruby-3.4.0+0 I, [2024-04-30T16:02:46.057977 #2875310] INFO -- : installing manpages: /tmp/ruby/install/trunk/share/man/man1 I, [2024-04-30T16:02:46.060294 #2875310] INFO -- : installing default gems from lib: /tmp/ruby/install/trunk/lib/ruby/gems/3.4.0+0 I, [2024-04-30T16:02:46.363255 #2875310] INFO -- : benchmark 0.3.0 I, [2024-04-30T16:02:46.464211 #2875310] INFO -- : bundler 2.6.0.dev I, [2024-04-30T16:02:46.482485 #2875310] INFO -- : cgi 0.4.1 I, [2024-04-30T16:02:46.489358 #2875310] INFO -- : delegate 0.3.1 I, [2024-04-30T16:02:46.496040 #2875310] INFO -- : did_you_mean 1.6.3 I, [2024-04-30T16:02:46.509865 #2875310] INFO -- : english 0.8.0 I, [2024-04-30T16:02:46.516493 #2875310] INFO -- : erb 4.0.4 I, [2024-04-30T16:02:46.526465 #2875310] INFO -- : error_highlight 0.6.0 I, [2024-04-30T16:02:46.533024 #2875310] INFO -- : fileutils 1.7.2 I, [2024-04-30T16:02:46.539814 #2875310] INFO -- : find 0.2.0 I, [2024-04-30T16:02:46.546567 #2875310] INFO -- : forwardable 1.3.3 I, [2024-04-30T16:02:46.553191 #2875310] INFO -- : ipaddr 1.2.6 I, [2024-04-30T16:02:46.559817 #2875310] INFO -- : irb 1.12.0 I, [2024-04-30T16:02:46.571262 #2875310] INFO -- : logger 1.6.0 I, [2024-04-30T16:02:46.577951 #2875310] INFO -- : net-http 0.4.1 I, [2024-04-30T16:02:46.585005 #2875310] INFO -- : net-protocol 0.2.2 I, [2024-04-30T16:02:46.591996 #2875310] INFO -- : open-uri 0.4.1 I, [2024-04-30T16:02:46.599146 #2875310] INFO -- : open3 0.2.1 I, [2024-04-30T16:02:46.605972 #2875310] INFO -- : optparse 0.5.0 I, [2024-04-30T16:02:46.618585 #2875310] INFO -- : ostruct 0.6.0 I, [2024-04-30T16:02:46.627114 #2875310] INFO -- : pp 0.5.0 I, [2024-04-30T16:02:46.634163 #2875310] INFO -- : prettyprint 0.2.0 I, [2024-04-30T16:02:46.640953 #2875310] INFO -- : prism 0.27.0 I, [2024-04-30T16:02:46.648153 #2875310] INFO -- : pstore 0.1.3 I, [2024-04-30T16:02:46.654729 #2875310] INFO -- : rdoc 6.6.3.1 I, [2024-04-30T16:02:46.668831 #2875310] INFO -- : readline 0.0.4 I, [2024-04-30T16:02:46.675527 #2875310] INFO -- : reline 0.5.4 I, [2024-04-30T16:02:46.683005 #2875310] INFO -- : resolv 0.4.0 I, [2024-04-30T16:02:46.689967 #2875310] INFO -- : ruby2_keywords 0.0.5 I, [2024-04-30T16:02:46.696719 #2875310] INFO -- : securerandom 0.3.1 I, [2024-04-30T16:02:46.703615 #2875310] INFO -- : set 1.1.0 I, [2024-04-30T16:02:46.710405 #2875310] INFO -- : shellwords 0.2.0 I, [2024-04-30T16:02:46.717126 #2875310] INFO -- : singleton 0.2.0 I, [2024-04-30T16:02:46.729227 #2875310] INFO -- : syntax_suggest 2.0.0 I, [2024-04-30T16:02:46.740785 #2875310] INFO -- : tempfile 0.2.1 I, [2024-04-30T16:02:46.747554 #2875310] INFO -- : time 0.3.0 I, [2024-04-30T16:02:46.754575 #2875310] INFO -- : timeout 0.4.1 I, [2024-04-30T16:02:46.761562 #2875310] INFO -- : tmpdir 0.2.0 I, [2024-04-30T16:02:46.768637 #2875310] INFO -- : tsort 0.2.0 I, [2024-04-30T16:02:46.775573 #2875310] INFO -- : un 0.3.0 I, [2024-04-30T16:02:46.782435 #2875310] INFO -- : uri 0.13.0 I, [2024-04-30T16:02:46.790002 #2875310] INFO -- : weakref 0.1.3 I, [2024-04-30T16:02:46.796902 #2875310] INFO -- : yaml 0.3.0 I, [2024-04-30T16:02:46.802322 #2875310] INFO -- : installing default gems from ext: /tmp/ruby/install/trunk/lib/ruby/gems/3.4.0+0 I, [2024-04-30T16:02:46.880435 #2875310] INFO -- : date 3.3.4 I, [2024-04-30T16:02:46.887256 #2875310] INFO -- : digest 3.1.1 I, [2024-04-30T16:02:46.893889 #2875310] INFO -- : etc 1.4.3 I, [2024-04-30T16:02:46.900966 #2875310] INFO -- : fcntl 1.1.0 I, [2024-04-30T16:02:46.907914 #2875310] INFO -- : fiddle 1.1.3 I, [2024-04-30T16:02:46.915185 #2875310] INFO -- : io-console 0.7.2 I, [2024-04-30T16:02:46.922020 #2875310] INFO -- : io-nonblock 0.3.0 I, [2024-04-30T16:02:46.928806 #2875310] INFO -- : io-wait 0.3.1 I, [2024-04-30T16:02:46.935427 #2875310] INFO -- : json 2.7.2 I, [2024-04-30T16:02:46.949502 #2875310] INFO -- : openssl 3.2.0 I, [2024-04-30T16:02:46.956576 #2875310] INFO -- : pathname 0.3.0 I, [2024-04-30T16:02:46.963406 #2875310] INFO -- : psych 5.1.2 I, [2024-04-30T16:02:46.971052 #2875310] INFO -- : stringio 3.1.1 I, [2024-04-30T16:02:46.978318 #2875310] INFO -- : strscan 3.1.1 I, [2024-04-30T16:02:46.985108 #2875310] INFO -- : zlib 3.1.0 I, [2024-04-30T16:02:46.990600 #2875310] INFO -- : installing bundled gems: /tmp/ruby/install/trunk/lib/ruby/gems/3.4.0+0 I, [2024-04-30T16:02:46.995200 #2875310] INFO -- : minitest 5.22.3 I, [2024-04-30T16:02:47.084609 #2875310] INFO -- : rake 13.2.1 I, [2024-04-30T16:02:47.140062 #2875310] INFO -- : test-unit 3.6.2 I, [2024-04-30T16:02:47.212408 #2875310] INFO -- : rexml 3.2.6 I, [2024-04-30T16:02:47.271266 #2875310] INFO -- : rss 0.3.0 I, [2024-04-30T16:02:47.312775 #2875310] INFO -- : net-ftp 0.3.4 I, [2024-04-30T16:02:47.332861 #2875310] INFO -- : net-imap 0.4.10 I, [2024-04-30T16:02:47.385892 #2875310] INFO -- : net-pop 0.1.2 I, [2024-04-30T16:02:47.398710 #2875310] INFO -- : net-smtp 0.5.0 I, [2024-04-30T16:02:47.414401 #2875310] INFO -- : matrix 0.4.2 I, [2024-04-30T16:02:47.454325 #2875310] INFO -- : prime 0.1.2 I, [2024-04-30T16:02:47.517751 #2875310] INFO -- : rbs 3.4.4 I, [2024-04-30T16:02:47.900886 #2875310] INFO -- : typeprof 0.21.11 I, [2024-04-30T16:02:47.934634 #2875310] INFO -- : debug 1.9.2 I, [2024-04-30T16:02:47.980490 #2875310] INFO -- : racc 1.7.3 I, [2024-04-30T16:02:48.020772 #2875310] INFO -- : mutex_m 0.2.0 I, [2024-04-30T16:02:48.036314 #2875310] INFO -- : getoptlong 0.2.1 I, [2024-04-30T16:02:48.056644 #2875310] INFO -- : base64 0.2.0 I, [2024-04-30T16:02:48.074544 #2875310] INFO -- : bigdecimal 3.1.7 I, [2024-04-30T16:02:48.103177 #2875310] INFO -- : observer 0.1.2 I, [2024-04-30T16:02:48.118276 #2875310] INFO -- : abbrev 0.1.2 I, [2024-04-30T16:02:48.133963 #2875310] INFO -- : resolv-replace 0.1.1 I, [2024-04-30T16:02:48.150004 #2875310] INFO -- : rinda 0.2.0 I, [2024-04-30T16:02:48.167118 #2875310] INFO -- : drb 2.2.1 I, [2024-04-30T16:02:48.189283 #2875310] INFO -- : nkf 0.2.0 I, [2024-04-30T16:02:48.227048 #2875310] INFO -- : syslog 0.1.2 I, [2024-04-30T16:02:48.249385 #2875310] INFO -- : csv 3.3.0 I, [2024-04-30T16:02:48.286683 #2875310] INFO -- : installing bundled gem cache: /tmp/ruby/install/trunk/lib/ruby/gems/3.4.0+0/cache I, [2024-04-30T16:02:48.305316 #2875310] INFO -- : skipped bundled gems: I, [2024-04-30T16:02:48.305532 #2875310] INFO -- : power_assert-2.0.4dev.gem not found in bundled_gems I, [2024-04-30T16:02:48.329474 #2875310] INFO -- : $$$[end] "make install -j4" exit with 0. I, [2024-04-30T16:02:48.330188 #2875310] INFO -- : $$$[beg] make yes-btest TESTOPTS='-q -j4' I, [2024-04-30T16:04:04.856415 #2875310] INFO -- : PASS all 1934 tests E, [2024-04-30T16:04:04.879751 #2875310] ERROR -- : I, [2024-04-30T16:04:04.880269 #2875310] INFO -- : $$$[end] "make yes-btest TESTOPTS='-q -j4'" exit with 0. I, [2024-04-30T16:04:04.880918 #2875310] INFO -- : $$$[beg] make yes-test-basic TESTS='-j4' I, [2024-04-30T16:04:05.433549 #2875310] INFO -- : BASERUBY = /usr/bin/ruby --disable=gems I, [2024-04-30T16:04:05.433825 #2875310] INFO -- : CC = gcc I, [2024-04-30T16:04:05.433979 #2875310] INFO -- : LD = ld I, [2024-04-30T16:04:05.434124 #2875310] INFO -- : LDSHARED = gcc -shared I, [2024-04-30T16:04:05.434285 #2875310] INFO -- : CFLAGS = -O3 -fno-fast-math -ggdb3 -Wall -Wextra -Wdeprecated-declarations -Wdiv-by-zero -Wduplicated-cond -Wimplicit-function-declaration -Wimplicit-int -Wpointer-arith -Wwrite-strings -Wold-style-definition -Wimplicit-fallthrough=0 -Wmissing-noreturn -Wno-cast-function-type -Wno-constant-logical-operand -Wno-long-long -Wno-missing-field-initializers -Wno-overlength-strings -Wno-packed-bitfield-compat -Wno-parentheses-equality -Wno-self-assign -Wno-tautological-compare -Wno-unused-parameter -Wno-unused-value -Wsuggest-attribute=format -Wsuggest-attribute=noreturn -Wunused-variable -Wmisleading-indentation -Wundef -fPIC I, [2024-04-30T16:04:05.434442 #2875310] INFO -- : XCFLAGS = -U_FORTIFY_SOURCE -D_FORTIFY_SOURCE=2 -fstack-protector-strong -fno-strict-overflow -fvisibility=hidden -fexcess-precision=standard -DRUBY_EXPORT -I. -I.ext/include/riscv64-linux -I/tmp/ruby/src/trunk/include -I/tmp/ruby/src/trunk -I/tmp/ruby/src/trunk/prism -I/tmp/ruby/src/trunk/enc/unicode/15.0.0 I, [2024-04-30T16:04:05.434586 #2875310] INFO -- : CPPFLAGS = I, [2024-04-30T16:04:05.434730 #2875310] INFO -- : DLDFLAGS = -Wl,--compress-debug-sections=zlib -Wl,-soname,libruby.so.3.4 -fstack-protector-strong I, [2024-04-30T16:04:05.434868 #2875310] INFO -- : SOLIBS = -lz -lrt -lrt -lgmp -ldl -lcrypt -lm -lpthread I, [2024-04-30T16:04:05.435008 #2875310] INFO -- : LANG = I, [2024-04-30T16:04:05.435144 #2875310] INFO -- : LC_ALL = I, [2024-04-30T16:04:05.435275 #2875310] INFO -- : LC_CTYPE = I, [2024-04-30T16:04:05.435454 #2875310] INFO -- : MFLAGS = I, [2024-04-30T16:04:05.435599 #2875310] INFO -- : RUSTC = rustc I, [2024-04-30T16:04:05.435747 #2875310] INFO -- : YJIT_RUSTC_ARGS = --crate-name=yjit --crate-type=staticlib --edition=2021 -g -C lto=thin -C opt-level=3 -C overflow-checks=on '--out-dir=/tmp/ruby/build/trunk/yjit/target/release/' /tmp/ruby/src/trunk/yjit/src/lib.rs I, [2024-04-30T16:04:05.439073 #2875310] INFO -- : gcc (Debian 13.2.0-4revyos1) 13.2.0 I, [2024-04-30T16:04:05.439254 #2875310] INFO -- : Copyright (C) 2023 Free Software Foundation, Inc. I, [2024-04-30T16:04:05.439342 #2875310] INFO -- : This is free software; see the source for copying conditions. There is NO I, [2024-04-30T16:04:05.439498 #2875310] INFO -- : warranty; not even for MERCHANTABILITY or FITNESS FOR A PARTICULAR PURPOSE. I, [2024-04-30T16:04:05.439657 #2875310] INFO -- : I, [2024-04-30T16:04:07.340371 #2875310] INFO -- : Checking leaked global symbols...none I, [2024-04-30T16:04:07.653471 #2875310] INFO -- : /tmp/ruby/src/trunk/basictest/test.rb:assignment ....................................................................................................................................................................................................................................................................................................................................................................................OK 372 I, [2024-04-30T16:04:07.653705 #2875310] INFO -- : /tmp/ruby/src/trunk/basictest/test.rb:condition ..OK 2 I, [2024-04-30T16:04:07.653928 #2875310] INFO -- : /tmp/ruby/src/trunk/basictest/test.rb:if/unless ...OK 3 I, [2024-04-30T16:04:07.654128 #2875310] INFO -- : /tmp/ruby/src/trunk/basictest/test.rb:case .....OK 5 I, [2024-04-30T16:04:07.655775 #2875310] INFO -- : /tmp/ruby/src/trunk/basictest/test.rb:while/until ........OK 8 I, [2024-04-30T16:04:07.656754 #2875310] INFO -- : /tmp/ruby/src/trunk/basictest/test.rb:exception ..........OK 10 I, [2024-04-30T16:04:07.659978 #2875310] INFO -- : /tmp/ruby/src/trunk/basictest/test.rb:array .......................................OK 39 I, [2024-04-30T16:04:07.661967 #2875310] INFO -- : /tmp/ruby/src/trunk/basictest/test.rb:hash ...........................OK 27 I, [2024-04-30T16:04:07.672733 #2875310] INFO -- : /tmp/ruby/src/trunk/basictest/test.rb:iterator ...........................................................................................................OK 107 I, [2024-04-30T16:04:07.689134 #2875310] INFO -- : /tmp/ruby/src/trunk/basictest/test.rb:float ................................................................................OK 80 I, [2024-04-30T16:04:07.700831 #2875310] INFO -- : /tmp/ruby/src/trunk/basictest/test.rb:bignum ...............................OK 31 I, [2024-04-30T16:04:07.713034 #2875310] INFO -- : /tmp/ruby/src/trunk/basictest/test.rb:string & char ..............................................................OK 62 I, [2024-04-30T16:04:07.713564 #2875310] INFO -- : /tmp/ruby/src/trunk/basictest/test.rb:assignment ..........OK 10 I, [2024-04-30T16:04:07.714048 #2875310] INFO -- : /tmp/ruby/src/trunk/basictest/test.rb:call ......OK 6 I, [2024-04-30T16:04:07.714858 #2875310] INFO -- : /tmp/ruby/src/trunk/basictest/test.rb:proc .........OK 9 I, [2024-04-30T16:04:07.817001 #2875310] INFO -- : /tmp/ruby/src/trunk/basictest/test.rb:signal ..OK 2 I, [2024-04-30T16:04:07.831218 #2875310] INFO -- : /tmp/ruby/src/trunk/basictest/test.rb:eval ...........................OK 27 I, [2024-04-30T16:04:08.263179 #2875310] INFO -- : /tmp/ruby/src/trunk/basictest/test.rb:system ........OK 8 I, [2024-04-30T16:04:08.263681 #2875310] INFO -- : /tmp/ruby/src/trunk/basictest/test.rb:const .....OK 5 I, [2024-04-30T16:04:08.264227 #2875310] INFO -- : /tmp/ruby/src/trunk/basictest/test.rb:clone .....OK 5 I, [2024-04-30T16:04:08.265283 #2875310] INFO -- : /tmp/ruby/src/trunk/basictest/test.rb:marshal ....OK 4 I, [2024-04-30T16:04:08.265746 #2875310] INFO -- : /tmp/ruby/src/trunk/basictest/test.rb:pack ....OK 4 I, [2024-04-30T16:04:08.265950 #2875310] INFO -- : /tmp/ruby/src/trunk/basictest/test.rb:math ..OK 2 I, [2024-04-30T16:04:08.266471 #2875310] INFO -- : /tmp/ruby/src/trunk/basictest/test.rb:struct ......OK 6 I, [2024-04-30T16:04:08.267534 #2875310] INFO -- : /tmp/ruby/src/trunk/basictest/test.rb:variable ............OK 12 I, [2024-04-30T16:04:08.267788 #2875310] INFO -- : /tmp/ruby/src/trunk/basictest/test.rb:trace ...OK 3 I, [2024-04-30T16:04:08.271826 #2875310] INFO -- : /tmp/ruby/src/trunk/basictest/test.rb:defined? ............OK 12 I, [2024-04-30T16:04:08.272363 #2875310] INFO -- : /tmp/ruby/src/trunk/basictest/test.rb:alias ......OK 6 I, [2024-04-30T16:04:08.274897 #2875310] INFO -- : /tmp/ruby/src/trunk/basictest/test.rb:path .......................OK 23 I, [2024-04-30T16:04:08.653094 #2875310] INFO -- : /tmp/ruby/src/trunk/basictest/test.rb:gc ....OK 4 I, [2024-04-30T16:04:08.669888 #2875310] INFO -- : I, [2024-04-30T16:04:08.670122 #2875310] INFO -- : test succeeded I, [2024-04-30T16:04:08.675976 #2875310] INFO -- : $$$[end] "make yes-test-basic TESTS='-j4'" exit with 0. I, [2024-04-30T16:04:08.676687 #2875310] INFO -- : $$$[beg] make yes-test-all TESTOPTS='--stderr-on-failure' TESTS='-j4' I, [2024-04-30T16:04:09.531297 #2875310] INFO -- : BASERUBY = /usr/bin/ruby --disable=gems I, [2024-04-30T16:04:09.531631 #2875310] INFO -- : CC = gcc I, [2024-04-30T16:04:09.531784 #2875310] INFO -- : LD = ld I, [2024-04-30T16:04:09.531928 #2875310] INFO -- : LDSHARED = gcc -shared I, [2024-04-30T16:04:09.532083 #2875310] INFO -- : CFLAGS = -O3 -fno-fast-math -ggdb3 -Wall -Wextra -Wdeprecated-declarations -Wdiv-by-zero -Wduplicated-cond -Wimplicit-function-declaration -Wimplicit-int -Wpointer-arith -Wwrite-strings -Wold-style-definition -Wimplicit-fallthrough=0 -Wmissing-noreturn -Wno-cast-function-type -Wno-constant-logical-operand -Wno-long-long -Wno-missing-field-initializers -Wno-overlength-strings -Wno-packed-bitfield-compat -Wno-parentheses-equality -Wno-self-assign -Wno-tautological-compare -Wno-unused-parameter -Wno-unused-value -Wsuggest-attribute=format -Wsuggest-attribute=noreturn -Wunused-variable -Wmisleading-indentation -Wundef -fPIC I, [2024-04-30T16:04:09.532248 #2875310] INFO -- : XCFLAGS = -U_FORTIFY_SOURCE -D_FORTIFY_SOURCE=2 -fstack-protector-strong -fno-strict-overflow -fvisibility=hidden -fexcess-precision=standard -DRUBY_EXPORT -I. -I.ext/include/riscv64-linux -I/tmp/ruby/src/trunk/include -I/tmp/ruby/src/trunk -I/tmp/ruby/src/trunk/prism -I/tmp/ruby/src/trunk/enc/unicode/15.0.0 I, [2024-04-30T16:04:09.532384 #2875310] INFO -- : CPPFLAGS = I, [2024-04-30T16:04:09.532525 #2875310] INFO -- : DLDFLAGS = -Wl,--compress-debug-sections=zlib -Wl,-soname,libruby.so.3.4 -fstack-protector-strong I, [2024-04-30T16:04:09.532668 #2875310] INFO -- : SOLIBS = -lz -lrt -lrt -lgmp -ldl -lcrypt -lm -lpthread I, [2024-04-30T16:04:09.532802 #2875310] INFO -- : LANG = I, [2024-04-30T16:04:09.532939 #2875310] INFO -- : LC_ALL = I, [2024-04-30T16:04:09.533071 #2875310] INFO -- : LC_CTYPE = I, [2024-04-30T16:04:09.533204 #2875310] INFO -- : MFLAGS = I, [2024-04-30T16:04:09.533334 #2875310] INFO -- : RUSTC = rustc I, [2024-04-30T16:04:09.533486 #2875310] INFO -- : YJIT_RUSTC_ARGS = --crate-name=yjit --crate-type=staticlib --edition=2021 -g -C lto=thin -C opt-level=3 -C overflow-checks=on '--out-dir=/tmp/ruby/build/trunk/yjit/target/release/' /tmp/ruby/src/trunk/yjit/src/lib.rs I, [2024-04-30T16:04:09.536838 #2875310] INFO -- : gcc (Debian 13.2.0-4revyos1) 13.2.0 I, [2024-04-30T16:04:09.537048 #2875310] INFO -- : Copyright (C) 2023 Free Software Foundation, Inc. I, [2024-04-30T16:04:09.537157 #2875310] INFO -- : This is free software; see the source for copying conditions. There is NO I, [2024-04-30T16:04:09.537251 #2875310] INFO -- : warranty; not even for MERCHANTABILITY or FITNESS FOR A PARTICULAR PURPOSE. I, [2024-04-30T16:04:09.537347 #2875310] INFO -- : I, [2024-04-30T16:04:09.565980 #2875310] INFO -- : generating enc.mk I, [2024-04-30T16:04:11.058401 #2875310] INFO -- : making enc I, [2024-04-30T16:04:11.229345 #2875310] INFO -- : make[1]: Entering directory '/tmp/ruby/build/trunk' I, [2024-04-30T16:04:11.229619 #2875310] INFO -- : make[1]: Nothing to be done for 'enc'. I, [2024-04-30T16:04:11.229829 #2875310] INFO -- : make[1]: Leaving directory '/tmp/ruby/build/trunk' I, [2024-04-30T16:04:11.232800 #2875310] INFO -- : making srcs under enc I, [2024-04-30T16:04:11.528574 #2875310] INFO -- : make[1]: Entering directory '/tmp/ruby/build/trunk' I, [2024-04-30T16:04:11.528847 #2875310] INFO -- : make[1]: Nothing to be done for 'srcs'. I, [2024-04-30T16:04:11.529070 #2875310] INFO -- : make[1]: Leaving directory '/tmp/ruby/build/trunk' I, [2024-04-30T16:04:11.534274 #2875310] INFO -- : generating transdb.h I, [2024-04-30T16:04:12.897191 #2875310] INFO -- : transdb.h unchanged I, [2024-04-30T16:04:12.903281 #2875310] INFO -- : making trans I, [2024-04-30T16:04:13.244640 #2875310] INFO -- : make[1]: Entering directory '/tmp/ruby/build/trunk' I, [2024-04-30T16:04:13.244919 #2875310] INFO -- : make[1]: Nothing to be done for 'trans'. I, [2024-04-30T16:04:13.245132 #2875310] INFO -- : make[1]: Leaving directory '/tmp/ruby/build/trunk' I, [2024-04-30T16:04:13.248167 #2875310] INFO -- : making encs I, [2024-04-30T16:04:13.637666 #2875310] INFO -- : make[1]: Entering directory '/tmp/ruby/build/trunk' I, [2024-04-30T16:04:13.637939 #2875310] INFO -- : make[1]: Nothing to be done for 'encs'. I, [2024-04-30T16:04:13.638146 #2875310] INFO -- : make[1]: Leaving directory '/tmp/ruby/build/trunk' I, [2024-04-30T16:04:13.650830 #2875310] INFO -- : generating makefiles ext/configure-ext.mk I, [2024-04-30T16:04:13.851568 #2875310] INFO -- : ext/configure-ext.mk updated I, [2024-04-30T16:04:13.866252 #2875310] INFO -- : make[1]: Entering directory '/tmp/ruby/build/trunk' I, [2024-04-30T16:04:26.022301 #2875310] INFO -- : make[1]: Leaving directory '/tmp/ruby/build/trunk' I, [2024-04-30T16:04:26.024089 #2875310] INFO -- : generating makefile exts.mk I, [2024-04-30T16:04:26.356161 #2875310] INFO -- : exts.mk unchanged I, [2024-04-30T16:04:26.394800 #2875310] INFO -- : make[1]: Entering directory '/tmp/ruby/build/trunk' I, [2024-04-30T16:04:28.548382 #2875310] INFO -- : make[2]: Entering directory '/tmp/ruby/build/trunk/ext/coverage' I, [2024-04-30T16:04:28.574179 #2875310] INFO -- : make[2]: Leaving directory '/tmp/ruby/build/trunk/ext/coverage' I, [2024-04-30T16:04:28.621746 #2875310] INFO -- : make[2]: Entering directory '/tmp/ruby/build/trunk/ext/date' I, [2024-04-30T16:04:28.650376 #2875310] INFO -- : make[2]: Leaving directory '/tmp/ruby/build/trunk/ext/date' I, [2024-04-30T16:04:28.684158 #2875310] INFO -- : make[2]: Entering directory '/tmp/ruby/build/trunk/ext/digest' I, [2024-04-30T16:04:28.743760 #2875310] INFO -- : make[2]: Leaving directory '/tmp/ruby/build/trunk/ext/digest' I, [2024-04-30T16:04:28.922570 #2875310] INFO -- : make[2]: Entering directory '/tmp/ruby/build/trunk/ext/digest/sha2' I, [2024-04-30T16:04:28.951106 #2875310] INFO -- : make[2]: Leaving directory '/tmp/ruby/build/trunk/ext/digest/sha2' I, [2024-04-30T16:04:29.077364 #2875310] INFO -- : make[2]: Entering directory '/tmp/ruby/build/trunk/ext/fiddle' I, [2024-04-30T16:04:29.144240 #2875310] INFO -- : make[2]: Leaving directory '/tmp/ruby/build/trunk/ext/fiddle' I, [2024-04-30T16:04:29.176945 #2875310] INFO -- : make[2]: Entering directory '/tmp/ruby/build/trunk/ext/io/console' I, [2024-04-30T16:04:29.196541 #2875310] INFO -- : make[2]: Leaving directory '/tmp/ruby/build/trunk/ext/io/console' I, [2024-04-30T16:04:29.287776 #2875310] INFO -- : make[2]: Entering directory '/tmp/ruby/build/trunk/ext/json' I, [2024-04-30T16:04:29.362250 #2875310] INFO -- : make[2]: Leaving directory '/tmp/ruby/build/trunk/ext/json' I, [2024-04-30T16:04:29.455183 #2875310] INFO -- : make[2]: Entering directory '/tmp/ruby/build/trunk/ext/monitor' I, [2024-04-30T16:04:29.474913 #2875310] INFO -- : make[2]: Leaving directory '/tmp/ruby/build/trunk/ext/monitor' I, [2024-04-30T16:04:29.528945 #2875310] INFO -- : make[2]: Entering directory '/tmp/ruby/build/trunk/ext/objspace' I, [2024-04-30T16:04:29.564100 #2875310] INFO -- : make[2]: Leaving directory '/tmp/ruby/build/trunk/ext/objspace' I, [2024-04-30T16:04:29.685608 #2875310] INFO -- : make[2]: Entering directory '/tmp/ruby/build/trunk/ext/openssl' I, [2024-04-30T16:04:29.819579 #2875310] INFO -- : make[2]: Leaving directory '/tmp/ruby/build/trunk/ext/openssl' I, [2024-04-30T16:04:29.859759 #2875310] INFO -- : make[2]: Entering directory '/tmp/ruby/build/trunk/ext/pathname' I, [2024-04-30T16:04:29.882671 #2875310] INFO -- : make[2]: Leaving directory '/tmp/ruby/build/trunk/ext/pathname' I, [2024-04-30T16:04:29.935864 #2875310] INFO -- : make[2]: Entering directory '/tmp/ruby/build/trunk/ext/psych' I, [2024-04-30T16:04:30.109050 #2875310] INFO -- : make[2]: Leaving directory '/tmp/ruby/build/trunk/ext/psych' I, [2024-04-30T16:04:30.138227 #2875310] INFO -- : make[2]: Entering directory '/tmp/ruby/build/trunk/ext/pty' I, [2024-04-30T16:04:30.159845 #2875310] INFO -- : make[2]: Leaving directory '/tmp/ruby/build/trunk/ext/pty' I, [2024-04-30T16:04:30.260928 #2875310] INFO -- : make[2]: Entering directory '/tmp/ruby/build/trunk/ext/ripper' I, [2024-04-30T16:04:30.317562 #2875310] INFO -- : make[2]: Leaving directory '/tmp/ruby/build/trunk/ext/ripper' I, [2024-04-30T16:04:30.330210 #2875310] INFO -- : make[2]: Entering directory '/tmp/ruby/build/trunk/ext/rubyvm' I, [2024-04-30T16:04:30.348546 #2875310] INFO -- : make[2]: Leaving directory '/tmp/ruby/build/trunk/ext/rubyvm' I, [2024-04-30T16:04:30.430534 #2875310] INFO -- : make[2]: Entering directory '/tmp/ruby/build/trunk/ext/socket' I, [2024-04-30T16:04:30.489621 #2875310] INFO -- : make[2]: Leaving directory '/tmp/ruby/build/trunk/ext/socket' I, [2024-04-30T16:04:30.609450 #2875310] INFO -- : make[2]: Entering directory '/tmp/ruby/build/trunk/.bundle/gems/bigdecimal-3.1.7/ext/bigdecimal' I, [2024-04-30T16:04:30.765833 #2875310] INFO -- : make[2]: Leaving directory '/tmp/ruby/build/trunk/.bundle/gems/bigdecimal-3.1.7/ext/bigdecimal' I, [2024-04-30T16:04:30.784782 #2875310] INFO -- : make[2]: Entering directory '/tmp/ruby/build/trunk/.bundle/gems/debug-1.9.2/ext/debug' I, [2024-04-30T16:04:30.953178 #2875310] INFO -- : make[2]: Leaving directory '/tmp/ruby/build/trunk/.bundle/gems/debug-1.9.2/ext/debug' I, [2024-04-30T16:04:30.970980 #2875310] INFO -- : make[2]: Entering directory '/tmp/ruby/build/trunk/.bundle/gems/nkf-0.2.0/ext/nkf' I, [2024-04-30T16:04:31.124699 #2875310] INFO -- : make[2]: Leaving directory '/tmp/ruby/build/trunk/.bundle/gems/nkf-0.2.0/ext/nkf' I, [2024-04-30T16:04:31.139497 #2875310] INFO -- : make[2]: Entering directory '/tmp/ruby/build/trunk/.bundle/gems/racc-1.7.3/ext/racc/cparse' I, [2024-04-30T16:04:31.293862 #2875310] INFO -- : make[2]: Leaving directory '/tmp/ruby/build/trunk/.bundle/gems/racc-1.7.3/ext/racc/cparse' I, [2024-04-30T16:04:31.315588 #2875310] INFO -- : make[2]: Entering directory '/tmp/ruby/build/trunk/.bundle/gems/rbs-3.4.4/ext/rbs_extension' I, [2024-04-30T16:04:31.471563 #2875310] INFO -- : make[2]: Leaving directory '/tmp/ruby/build/trunk/.bundle/gems/rbs-3.4.4/ext/rbs_extension' I, [2024-04-30T16:04:31.488454 #2875310] INFO -- : make[2]: Entering directory '/tmp/ruby/build/trunk/.bundle/gems/syslog-0.1.2/ext/syslog' I, [2024-04-30T16:04:31.648105 #2875310] INFO -- : make[2]: Leaving directory '/tmp/ruby/build/trunk/.bundle/gems/syslog-0.1.2/ext/syslog' I, [2024-04-30T16:04:31.865495 #2875310] INFO -- : make[2]: Entering directory '/tmp/ruby/build/trunk' I, [2024-04-30T16:04:32.526757 #2875310] INFO -- : make[2]: 'ruby' is up to date. I, [2024-04-30T16:04:32.526976 #2875310] INFO -- : make[2]: Leaving directory '/tmp/ruby/build/trunk' I, [2024-04-30T16:04:32.528839 #2875310] INFO -- : make[1]: Leaving directory '/tmp/ruby/build/trunk' I, [2024-04-30T16:04:32.571677 #2875310] INFO -- : make[1]: Entering directory '/tmp/ruby/build/trunk' I, [2024-04-30T16:04:32.571884 #2875310] INFO -- : make[1]: Nothing to be done for 'note'. I, [2024-04-30T16:04:32.571977 #2875310] INFO -- : make[1]: Leaving directory '/tmp/ruby/build/trunk' I, [2024-04-30T16:04:33.325201 #2875310] INFO -- : Run options: I, [2024-04-30T16:04:33.325391 #2875310] INFO -- : --seed=49660 I, [2024-04-30T16:04:33.325479 #2875310] INFO -- : "--ruby=./miniruby -I/tmp/ruby/src/trunk/lib -I. -I.ext/common /tmp/ruby/src/trunk/tool/runruby.rb --extout=.ext -- --disable-gems" I, [2024-04-30T16:04:33.325573 #2875310] INFO -- : --excludes-dir=/tmp/ruby/src/trunk/test/.excludes I, [2024-04-30T16:04:33.325681 #2875310] INFO -- : --name=!/memory_leak/ I, [2024-04-30T16:04:33.325803 #2875310] INFO -- : --stderr-on-failure I, [2024-04-30T16:04:33.325927 #2875310] INFO -- : -j4 I, [2024-04-30T16:04:33.326057 #2875310] INFO -- : I, [2024-04-30T16:04:33.326186 #2875310] INFO -- : # Running tests: I, [2024-04-30T16:04:33.326393 #2875310] INFO -- : I, [2024-04-30T16:04:34.312269 #2875310] INFO -- : [ 1/884] 2916634=test_string I, [2024-04-30T16:04:34.335703 #2875310] INFO -- : [ 2/884] 2916632=test_rdoc_stats I, [2024-04-30T16:04:34.374985 #2875310] INFO -- : [ 3/884] 2916635=test_pattern_matching I, [2024-04-30T16:04:34.418821 #2875310] INFO -- : [ 4/884] 2916633=test_depth_first I, [2024-04-30T16:04:34.552364 #2875310] INFO -- : [ 5/884] 2916635=test_gem_request_set_lockfile_parser I, [2024-04-30T16:04:34.558248 #2875310] INFO -- : [ 6/884] 2916633=test_raise I, [2024-04-30T16:04:34.580067 #2875310] INFO -- : [ 7/884] 2916633=test_x509attr I, [2024-04-30T16:04:35.130059 #2875310] INFO -- : [ 8/884] 2916634=test_rdoc_store I, [2024-04-30T16:04:35.620950 #2875310] INFO -- : [ 9/884] 2916633=test_custom_command I, [2024-04-30T16:04:35.944937 #2875310] INFO -- : [ 10/884] 2916632=json_addition_test I, [2024-04-30T16:04:36.016994 #2875310] INFO -- : [ 11/884] 2916633=test_gem_dependency_resolution_error I, [2024-04-30T16:04:36.048352 #2875310] INFO -- : [ 12/884] 2916632=test_rdoc_parser I, [2024-04-30T16:04:36.173415 #2875310] INFO -- : [ 13/884] 2916632=test_qsort I, [2024-04-30T16:04:36.209581 #2875310] INFO -- : [ 14/884] 2916632=test_erb_m17n I, [2024-04-30T16:04:36.250187 #2875310] INFO -- : [ 15/884] 2916632=test_ole_methods I, [2024-04-30T16:04:36.255718 #2875310] INFO -- : [ 16/884] 2916632=test_date_conv I, [2024-04-30T16:04:36.334255 #2875310] INFO -- : [ 17/884] 2916632=test_optimization I, [2024-04-30T16:04:37.002469 #2875310] INFO -- : [ 18/884] 2916635=test_zlib I, [2024-04-30T16:04:37.206256 #2875310] INFO -- : [ 19/884] 2916633=test_cgi_tag_helper I, [2024-04-30T16:04:37.445562 #2875310] INFO -- : [ 20/884] 2916633=test_egrep_cpp I, [2024-04-30T16:04:38.402746 #2875310] INFO -- : [ 21/884] 2916633=test_gem_resolver_index_set I, [2024-04-30T16:04:38.647204 #2875310] INFO -- : [ 22/884] 2916633=test_gem_package_old I, [2024-04-30T16:04:38.896990 #2875310] INFO -- : [ 23/884] 2916633=test_gc_compact I, [2024-04-30T16:04:41.144861 #2875310] INFO -- : [ 24/884] 2916634=test_proc I, [2024-04-30T16:04:45.171442 #2875310] INFO -- : [ 25/884] 2916635=test_string I, [2024-04-30T16:04:50.037473 #2875310] INFO -- : [ 26/884] 2916634=test_gem_validator I, [2024-04-30T16:04:51.901574 #2875310] INFO -- : [ 27/884] 2916634=test_fnmatch I, [2024-04-30T16:04:52.518796 #2875310] INFO -- : [ 28/884] 2916634=test_files_test_2 I, [2024-04-30T16:04:57.303762 #2875310] INFO -- : [ 29/884] 2916633=test_rdoc_markup_parser I, [2024-04-30T16:04:59.336851 #2875310] INFO -- : [ 30/884] 2916633=test_require_path_check I, [2024-04-30T16:04:59.472373 #2875310] INFO -- : [ 31/884] 2916633=test_folderitem2_invokeverb I, [2024-04-30T16:04:59.497844 #2875310] INFO -- : [ 32/884] 2916633=test_rdoc_i18n_text I, [2024-04-30T16:04:59.548027 #2875310] INFO -- : [ 33/884] 2916633=test_io_buffer I, [2024-04-30T16:04:59.792050 #2875310] INFO -- : [ 34/884] 2916633=test_key_name_check I, [2024-04-30T16:04:59.848006 #2875310] INFO -- : [ 35/884] 2916633=test_defined I, [2024-04-30T16:05:00.478735 #2875310] INFO -- : [ 36/884] 2916633=test_backtrace I, [2024-04-30T16:05:00.496531 #2875310] INFO -- : [ 37/884] 2916633=test_rdoc_rdoc I, [2024-04-30T16:05:01.452540 #2875310] INFO -- : [ 38/884] 2916633=test_windows_1251 I, [2024-04-30T16:05:01.567239 #2875310] INFO -- : [ 39/884] 2916633=test_time I, [2024-04-30T16:05:02.536761 #2875310] INFO -- : [ 40/884] 2916633=test_buffering I, [2024-04-30T16:05:02.686763 #2875310] INFO -- : [ 41/884] 2916633=test_svcb_https I, [2024-04-30T16:05:02.739865 #2875310] INFO -- : [ 42/884] 2916633=test_gb18030 I, [2024-04-30T16:05:03.085578 #2875310] INFO -- : [ 43/884] 2916633=test_gem_uninstaller I, [2024-04-30T16:05:10.450392 #2875310] INFO -- : [ 44/884] 2916633=test_rdoc_markup_to_rdoc I, [2024-04-30T16:05:10.724096 #2875310] INFO -- : [ 45/884] 2916633=test_rdoc_rd_inline_parser I, [2024-04-30T16:05:11.049266 #2875310] INFO -- : [ 46/884] 2916633=test_default_gems I, [2024-04-30T16:05:11.345009 #2875310] INFO -- : [ 47/884] 2916633=test_null I, [2024-04-30T16:05:11.378525 #2875310] INFO -- : [ 48/884] 2916633=test_win32ole_type I, [2024-04-30T16:05:11.414972 #2875310] INFO -- : [ 49/884] 2916633=test_mul I, [2024-04-30T16:05:11.461286 #2875310] INFO -- : [ 50/884] 2916633=test_rdoc_markup_attributes I, [2024-04-30T16:05:11.516893 #2875310] INFO -- : [ 51/884] 2916633=test_date_parse I, [2024-04-30T16:05:12.362669 #2875310] INFO -- : [ 52/884] 2916633=test_pkey_ec I, [2024-04-30T16:05:13.174259 #2875310] INFO -- : [ 53/884] 2916633=test_trick I, [2024-04-30T16:05:14.230441 #2875310] INFO -- : [ 54/884] 2916635=test_thread I, [2024-04-30T16:05:14.256651 #2875310] INFO -- : [ 55/884] 2916635=test_pipe I, [2024-04-30T16:05:15.492106 #2875310] INFO -- : [ 56/884] 2916635=test_rdoc_markup_paragraph I, [2024-04-30T16:05:16.033322 #2875310] INFO -- : [ 57/884] 2916635=test_enc_raise I, [2024-04-30T16:05:16.206238 #2875310] INFO -- : [ 58/884] 2916635=test_psych I, [2024-04-30T16:05:16.346957 #2875310] INFO -- : [ 59/884] 2916635=!Nothing_to_test I, [2024-04-30T16:05:16.363495 #2875310] INFO -- : [ 60/884] 2916635=test_object_create_start I, [2024-04-30T16:05:16.455301 #2875310] INFO -- : [ 61/884] 2916635=test_at_exit I, [2024-04-30T16:05:16.463132 #2875310] INFO -- : [ 62/884] 2916635=test_command I, [2024-04-30T16:05:18.837168 #2875310] INFO -- : [ 63/884] 2916635=test_gem_ext_cargo_builder_unit I, [2024-04-30T16:05:19.045412 #2875310] INFO -- : [ 64/884] 2916635=test_gem_rdoc I, [2024-04-30T16:05:19.889962 #2875310] INFO -- : [ 65/884] 2916635=test_date I, [2024-04-30T16:05:19.920021 #2875310] INFO -- : [ 66/884] 2916635=test_bug-5832 I, [2024-04-30T16:05:20.258754 #2875310] INFO -- : [ 67/884] 2916635=test_files_ext I, [2024-04-30T16:05:20.307333 #2875310] INFO -- : [ 68/884] 2916634=test_gem_silent_ui I, [2024-04-30T16:05:20.534482 #2875310] INFO -- : [ 69/884] 2916634=test_emitter I, [2024-04-30T16:05:20.544933 #2875310] INFO -- : [ 70/884] 2916635=test_kdf I, [2024-04-30T16:05:20.594024 #2875310] INFO -- : [ 71/884] 2916634=test_gem_doctor I, [2024-04-30T16:05:20.853004 #2875310] INFO -- : [ 72/884] 2916634=test_eval_history I, [2024-04-30T16:05:21.258889 #2875310] INFO -- : [ 73/884] 2916635=dispatcher_test I, [2024-04-30T16:05:21.705363 #2875310] INFO -- : [ 74/884] 2916634=test_kernel I, [2024-04-30T16:05:21.726610 #2875310] INFO -- : [ 75/884] 2916635=test_address_resolve I, [2024-04-30T16:05:21.836056 #2875310] INFO -- : [ 76/884] 2916635=test_rdoc_token_stream I, [2024-04-30T16:05:21.912085 #2875310] INFO -- : [ 77/884] 2916635=test_config I, [2024-04-30T16:05:22.136313 #2875310] INFO -- : [ 78/884] 2916635=test_optarg I, [2024-04-30T16:05:22.910922 #2875310] INFO -- : [ 79/884] 2916635=test_yaml_special_cases I, [2024-04-30T16:05:22.977439 #2875310] INFO -- : [ 80/884] 2916635=test_gem_source_list I, [2024-04-30T16:05:23.304347 #2875310] INFO -- : [ 81/884] 2916635=test_macro I, [2024-04-30T16:05:23.311879 #2875310] INFO -- : [ 82/884] 2916635=test_frozen I, [2024-04-30T16:05:23.369093 #2875310] INFO -- : [ 83/884] 2916635=test_gem_ext_configure_builder I, [2024-04-30T16:05:23.535006 #2875310] INFO -- : [ 84/884] 2916635=test_pp I, [2024-04-30T16:05:23.772260 #2875310] INFO -- : [ 85/884] 2916635=test_verbose I, [2024-04-30T16:05:24.012104 #2875310] INFO -- : [ 86/884] 2916635=test_rdoc_single_class I, [2024-04-30T16:05:24.034213 #2875310] INFO -- : [ 87/884] 2916635=test_nil I, [2024-04-30T16:05:24.070542 #2875310] INFO -- : [ 88/884] 2916635=test_num2int I, [2024-04-30T16:05:24.119317 #2875310] INFO -- : [ 89/884] 2916635=test_zsh_completion I, [2024-04-30T16:05:24.141692 #2875310] INFO -- : [ 90/884] 2916635=test_exception I, [2024-04-30T16:05:24.187064 #2875310] INFO -- : [ 91/884] 2916635=test_iter_break I, [2024-04-30T16:05:24.208724 #2875310] INFO -- : [ 92/884] 2916635=test_hmac I, [2024-04-30T16:05:24.251132 #2875310] INFO -- : [ 93/884] 2916635=test_rdoc_markup_to_tt_only I, [2024-04-30T16:05:24.467884 #2875310] INFO -- : [ 94/884] 2916635=test_rdoc_tom_doc I, [2024-04-30T16:05:24.609509 #2875310] INFO -- : [ 95/884] 2916635=test_assignment I, [2024-04-30T16:05:25.208225 #2875310] INFO -- : [ 96/884] 2916633=test_ifunless I, [2024-04-30T16:05:25.272371 #2875310] INFO -- : [ 97/884] 2916633=test_gem_commands_lock_command I, [2024-04-30T16:05:25.373161 #2875310] INFO -- : [ 98/884] 2916633=test_numeric I, [2024-04-30T16:05:25.843935 #2875310] INFO -- : [ 99/884] 2916632=test_common I, [2024-04-30T16:05:25.892018 #2875310] INFO -- : [100/884] 2916633=test_gem_spec_fetcher I, [2024-04-30T16:05:26.198423 #2875310] INFO -- : [101/884] 2916634=test_gem_command I, [2024-04-30T16:05:26.819230 #2875310] INFO -- : [102/884] 2916634=test_key_actor_vi I, [2024-04-30T16:05:27.187265 #2875310] INFO -- : [103/884] 2916633=test_bug-3571 I, [2024-04-30T16:05:27.245813 #2875310] INFO -- : [104/884] 2916633=test_pack I, [2024-04-30T16:05:27.745153 #2875310] INFO -- : [105/884] 2916634=test_last_thread I, [2024-04-30T16:05:28.197719 #2875310] INFO -- : [106/884] 2916632=test_process I, [2024-04-30T16:05:28.756508 #2875310] INFO -- : [107/884] 2916633=test_gem_source_local I, [2024-04-30T16:05:29.193183 #2875310] INFO -- : [108/884] 2916634=test_gem_security_policy I, [2024-04-30T16:05:30.256485 #2875310] INFO -- : [109/884] 2916633=test_logdevice I, [2024-04-30T16:05:31.262377 #2875310] INFO -- : [110/884] 2916634=test_arity I, [2024-04-30T16:05:31.408174 #2875310] INFO -- : [111/884] 2916634=test_gem_ext_rake_builder I, [2024-04-30T16:05:35.673596 #2875310] INFO -- : [112/884] 2916633=test_gc I, [2024-04-30T16:05:37.179923 #2875310] INFO -- : [113/884] 2916634=test_x509cert I, [2024-04-30T16:05:38.124513 #2875310] INFO -- : [114/884] 2916635=test_err_in_callback I, [2024-04-30T16:05:38.154494 #2875310] INFO -- : [115/884] 2916635=test_gem_resolver_lock_specification I, [2024-04-30T16:05:38.443092 #2875310] INFO -- : [116/884] 2916635=test_rdoc_normal_module I, [2024-04-30T16:05:39.051481 #2875310] INFO -- : [117/884] 2916635=test_c_union_entity I, [2024-04-30T16:05:39.246814 #2875310] INFO -- : [118/884] 2916635=test_rdoc_markdown_test I, [2024-04-30T16:05:39.648754 #2875310] INFO -- : [119/884] 2916634=test_logperiod I, [2024-04-30T16:05:39.706441 #2875310] INFO -- : [120/884] 2916634=test_securerandom I, [2024-04-30T16:05:39.973176 #2875310] INFO -- : [121/884] 2916634=test_switch_hitter I, [2024-04-30T16:05:40.033453 #2875310] INFO -- : [122/884] 2916634=test_flush I, [2024-04-30T16:05:40.077515 #2875310] INFO -- : [123/884] 2916634=test_singleton I, [2024-04-30T16:05:40.407011 #2875310] INFO -- : [124/884] 2916634=test_io_console I, [2024-04-30T16:05:44.418879 #2875310] INFO -- : [125/884] 2916634=test_hash_create I, [2024-04-30T16:05:44.445915 #2875310] INFO -- : [126/884] 2916634=test_stringchar I, [2024-04-30T16:05:45.164756 #2875310] INFO -- : [127/884] 2916634=test_uncorrectable_name_check I, [2024-04-30T16:05:45.243000 #2875310] INFO -- : [128/884] 2916634=newline_test I, [2024-04-30T16:05:46.394144 #2875310] INFO -- : [129/884] 2916634=test_thread_fd_close I, [2024-04-30T16:05:46.418581 #2875310] INFO -- : [130/884] 2916634=test_passing_block I, [2024-04-30T16:05:46.507347 #2875310] INFO -- : [131/884] 2916634=test_rdoc_parser_ruby I, [2024-04-30T16:05:46.710320 #2875310] INFO -- : [132/884] 2916635=test_httpresponse I, [2024-04-30T16:05:47.260129 #2875310] INFO -- : [133/884] 2916635=test_open-uri I, [2024-04-30T16:05:48.978501 #2875310] INFO -- : [134/884] 2916635=test_stream I, [2024-04-30T16:05:49.159742 #2875310] INFO -- : [135/884] 2916635=test_nil2vtempty I, [2024-04-30T16:05:49.179962 #2875310] INFO -- : [136/884] 2916635=test_rdoc_context I, [2024-04-30T16:05:49.623756 #2875310] INFO -- : [137/884] 2916634=test_rdoc_text I, [2024-04-30T16:05:50.008240 #2875310] INFO -- : [138/884] 2916634=test_iso_8859 I, [2024-04-30T16:05:50.192509 #2875310] INFO -- : [139/884] 2916634=test_tcp I, [2024-04-30T16:05:50.464852 #2875310] INFO -- : [140/884] 2916634=test_data I, [2024-04-30T16:05:50.562596 #2875310] INFO -- : [141/884] 2916634=index_write_test I, [2024-04-30T16:05:50.568924 #2875310] INFO -- : [142/884] 2916634=test_date_new I, [2024-04-30T16:05:50.636417 #2875310] INFO -- : [143/884] 2916634=test_require I, [2024-04-30T16:05:50.667534 #2875310] INFO -- : [144/884] 2916634=test_date_time I, [2024-04-30T16:05:50.734324 #2875310] INFO -- : [145/884] 2916634=test_rdoc_markup_to_joined_paragraph I, [2024-04-30T16:05:50.773295 #2875310] INFO -- : [146/884] 2916634=test_gem_safe_yaml I, [2024-04-30T16:05:50.864037 #2875310] INFO -- : [147/884] 2916634=test_syntax I, [2024-04-30T16:05:55.525148 #2875310] INFO -- : [148/884] 2916635=test_enumerator I, [2024-04-30T16:06:26.246802 #2875310] INFO -- : [149/884] 2916633=test_flags I, [2024-04-30T16:06:33.918710 #2875310] INFO -- : [150/884] 2916633=test_inadvertent_creation I, [2024-04-30T16:06:34.655961 #2875310] INFO -- : [151/884] 2916634=test_gem_commands_which_command I, [2024-04-30T16:06:34.816273 #2875310] INFO -- : [152/884] 2916634=test_shift_jis I, [2024-04-30T16:06:34.838394 #2875310] INFO -- : [153/884] 2916634=test_http I, [2024-04-30T16:06:34.926001 #2875310] INFO -- : [154/884] 2916633=test_gem_commands_specification_command I, [2024-04-30T16:06:35.006005 #2875310] INFO -- : [155/884] 2916634=test_gem_resolver_composed_set I, [2024-04-30T16:06:35.100848 #2875310] INFO -- : [156/884] 2916634=test_safe_load I, [2024-04-30T16:06:35.167031 #2875310] INFO -- : [157/884] 2916634=test_gem_resolver I, [2024-04-30T16:06:35.784388 #2875310] INFO -- : [158/884] 2916633=test_gem_commands_dependency_command I, [2024-04-30T16:06:36.337164 #2875310] INFO -- : [159/884] 2916633=test_rdoc_markup_attribute_manager I, [2024-04-30T16:06:36.553585 #2875310] INFO -- : [160/884] 2916633=test_name_error I, [2024-04-30T16:06:37.306617 #2875310] INFO -- : [161/884] 2916634=test_gem_commands_mirror I, [2024-04-30T16:06:37.321991 #2875310] INFO -- : [162/884] 2916634=test_gem_ext_cargo_builder_link_flag_converter I, [2024-04-30T16:06:37.378425 #2875310] INFO -- : [163/884] 2916633=test_sprintf_comb I, [2024-04-30T16:06:37.868718 #2875310] INFO -- : [164/884] 2916634=test_method_cache I, [2024-04-30T16:06:37.925588 #2875310] INFO -- : [165/884] 2916634=test_gem_request I, [2024-04-30T16:06:38.483005 #2875310] INFO -- : [166/884] 2916633=test_scan_args I, [2024-04-30T16:06:38.563293 #2875310] INFO -- : [167/884] 2916633=test_generic I, [2024-04-30T16:06:38.936437 #2875310] INFO -- : [168/884] 2916633=test_win32ole I, [2024-04-30T16:06:39.010203 #2875310] INFO -- : [169/884] 2916633=test_gem_text I, [2024-04-30T16:06:39.382568 #2875310] INFO -- : [170/884] 2916633=test_settracefunc I, [2024-04-30T16:06:41.298402 #2875310] INFO -- : [171/884] 2916634=test_enumerator_kw I, [2024-04-30T16:06:41.585103 #2875310] INFO -- : [172/884] 2916634=test_gem_dependency_installer I, [2024-04-30T16:06:46.898424 #2875310] INFO -- : [173/884] 2916633=test_scalar I, [2024-04-30T16:06:46.980295 #2875310] INFO -- : [174/884] 2916633=test_gem_commands_info_command I, [2024-04-30T16:06:47.191303 #2875310] INFO -- : [175/884] 2916633=test_rdoc_cross_reference I, [2024-04-30T16:06:51.169417 #2875310] INFO -- : [176/884] 2916633=test_store I, [2024-04-30T16:06:52.599025 #2875310] INFO -- : [177/884] 2916633=test_case_options I, [2024-04-30T16:06:52.631680 #2875310] INFO -- : [178/884] 2916633=test_exception I, [2024-04-30T16:06:52.997548 #2875310] INFO -- : [179/884] 2916635=test_rand I, [2024-04-30T16:06:55.080540 #2875310] INFO -- : [180/884] 2916635=test_gem_package_tar_reader_entry I, [2024-04-30T16:06:56.378865 #2875310] INFO -- : [181/884] 2916635=test_gem_name_tuple I, [2024-04-30T16:06:56.476340 #2875310] INFO -- : [182/884] 2916635=test_bug_reporter I, [2024-04-30T16:06:57.353080 #2875310] INFO -- : [183/884] 2916635=test_require_lib I, [2024-04-30T16:06:58.854504 #2875310] INFO -- : [184/884] 2916634=test_gem_install_update_options I, [2024-04-30T16:07:00.369261 #2875310] INFO -- : [185/884] 2916634=parse_test I, [2024-04-30T16:07:09.657622 #2875310] INFO -- : [186/884] 2916633=test_ractor I, [2024-04-30T16:07:09.693978 #2875310] INFO -- : [187/884] 2916633=test_severity I, [2024-04-30T16:07:09.763342 #2875310] INFO -- : [188/884] 2916633=test_gem_stream_ui I, [2024-04-30T16:07:10.508850 #2875310] INFO -- : [189/884] 2916633=test_rdoc_generator_ri I, [2024-04-30T16:07:10.590797 #2875310] INFO -- : [190/884] 2916633=test_extlibs I, [2024-04-30T16:07:21.318854 #2875310] INFO -- : [191/884] 2916634=test_str2big I, [2024-04-30T16:07:21.347863 #2875310] INFO -- : [192/884] 2916634=test_dot_dot I, [2024-04-30T16:07:21.461886 #2875310] INFO -- : [193/884] 2916634=test_c_struct_builder I, [2024-04-30T16:07:22.031764 #2875310] INFO -- : [194/884] 2916634=test_literal I, [2024-04-30T16:07:22.716179 #2875310] INFO -- : [195/884] 2916635=test_thread I, [2024-04-30T16:07:22.819759 #2875310] INFO -- : [196/884] 2916632=test_socket I, [2024-04-30T16:07:23.063922 #2875310] INFO -- : [197/884] 2916635=test_objectspace I, [2024-04-30T16:07:23.978917 #2875310] INFO -- : [198/884] 2916633=test_rdoc_markup_to_table_of_contents I, [2024-04-30T16:07:24.318685 #2875310] INFO -- : [199/884] 2916633=test_parser_events I, [2024-04-30T16:07:25.125135 #2875310] INFO -- : [200/884] 2916633=test_reline I, [2024-04-30T16:07:26.342020 #2875310] INFO -- : [201/884] 2916633=test_case I, [2024-04-30T16:07:26.519498 #2875310] INFO -- : [202/884] 2916633=test_pkey I, [2024-04-30T16:07:26.828032 #2875310] INFO -- : [203/884] 2916633=test_gem_request_connection_pools I, [2024-04-30T16:07:27.188872 #2875310] INFO -- : [204/884] 2916634=test_grapheme_breaks I, [2024-04-30T16:07:27.234920 #2875310] INFO -- : [205/884] 2916635=test_gem_version_option I, [2024-04-30T16:07:27.315089 #2875310] INFO -- : [206/884] 2916634=test_cclass I, [2024-04-30T16:07:27.697074 #2875310] INFO -- : [207/884] 2916635=test_ractor I, [2024-04-30T16:07:27.999170 #2875310] INFO -- : [208/884] 2916635=test_m17n_comb I, [2024-04-30T16:07:28.122203 #2875310] INFO -- : [209/884] 2916633=test_memory_view I, [2024-04-30T16:07:28.201398 #2875310] INFO -- : [210/884] 2916634=test_rdoc_markup_to_markdown I, [2024-04-30T16:07:28.496424 #2875310] INFO -- : [211/884] 2916634=test_json_tree I, [2024-04-30T16:07:28.530003 #2875310] INFO -- : [212/884] 2916634=test_rdoc_generator_pot_po I, [2024-04-30T16:07:28.586713 #2875310] INFO -- : [213/884] 2916634=test_ansi_with_terminfo I, [2024-04-30T16:07:28.600884 #2875310] INFO -- : [214/884] 2916634=test_comparable I, [2024-04-30T16:07:28.708248 #2875310] INFO -- : [215/884] 2916634=test_rdoc_parser_c I, [2024-04-30T16:07:29.188568 #2875310] INFO -- : [216/884] 2916633=test_io_timeout I, [2024-04-30T16:07:29.233592 #2875310] INFO -- : [217/884] 2916633=test_shapes I, [2024-04-30T16:07:29.254791 #2875310] INFO -- : [218/884] 2916633=json_fixtures_test I, [2024-04-30T16:07:29.331584 #2875310] INFO -- : [219/884] 2916633=test_pstore I, [2024-04-30T16:07:29.618612 #2875310] INFO -- : [220/884] 2916633=test_cstr I, [2024-04-30T16:07:30.441180 #2875310] INFO -- : [221/884] 2916634=test_profile_frames I, [2024-04-30T16:07:30.850166 #2875310] INFO -- : [222/884] 2916634=test_class2name I, [2024-04-30T16:07:30.876549 #2875310] INFO -- : [223/884] 2916634=test_gbk I, [2024-04-30T16:07:30.915902 #2875310] INFO -- : [224/884] 2916634=test_enc_str_buf_cat I, [2024-04-30T16:07:30.959822 #2875310] INFO -- : [225/884] 2916634=test_forwardable I, [2024-04-30T16:07:31.183426 #2875310] INFO -- : [226/884] 2916634=test_yaml I, [2024-04-30T16:07:32.022320 #2875310] INFO -- : [227/884] 2916634=test_wait I, [2024-04-30T16:07:32.541044 #2875310] INFO -- : [228/884] 2916634=test_handle I, [2024-04-30T16:07:32.827682 #2875310] INFO -- : [229/884] 2916632=test_big2str I, [2024-04-30T16:07:32.855938 #2875310] INFO -- : [230/884] 2916632=test_euc_tw I, [2024-04-30T16:07:32.922826 #2875310] INFO -- : [231/884] 2916632=test_ractor I, [2024-04-30T16:07:32.950270 #2875310] INFO -- : [232/884] 2916632=test_bmethod I, [2024-04-30T16:07:32.954055 #2875310] INFO -- : [233/884] 2916632=test_gem_commands_sources_command I, [2024-04-30T16:07:33.820209 #2875310] INFO -- : [234/884] 2916633=test_ansi_without_terminfo I, [2024-04-30T16:07:33.894715 #2875310] INFO -- : [235/884] 2916633=test_thread_queue I, [2024-04-30T16:07:34.479588 #2875310] INFO -- : [236/884] 2916634=test_nowrite I, [2024-04-30T16:07:34.749219 #2875310] INFO -- : [237/884] 2916634=test_rdoc_markup_formatter I, [2024-04-30T16:07:34.850528 #2875310] INFO -- : [238/884] 2916634=test_rdoc_any_method I, [2024-04-30T16:07:35.918096 #2875310] INFO -- : [239/884] 2916632=test_modify_expand I, [2024-04-30T16:07:35.990952 #2875310] INFO -- : [240/884] 2916632=test_rdoc_markdown I, [2024-04-30T16:07:37.602137 #2875310] INFO -- : [241/884] 2916632=test_gem_available_set I, [2024-04-30T16:07:37.768879 #2875310] INFO -- : [242/884] 2916634=test_file I, [2024-04-30T16:07:37.782086 #2875310] INFO -- : [243/884] 2916634=regexp_test I, [2024-04-30T16:07:37.920020 #2875310] INFO -- : [244/884] 2916634=test_gem_package_tar_reader I, [2024-04-30T16:07:38.181941 #2875310] INFO -- : [245/884] 2916632=test_rdoc_encoding I, [2024-04-30T16:07:38.203530 #2875310] INFO -- : [246/884] 2916634=test_coverage I, [2024-04-30T16:07:38.345773 #2875310] INFO -- : [247/884] 2916632=test_pathname I, [2024-04-30T16:07:40.053311 #2875310] INFO -- : [248/884] 2916632=test_complexrational I, [2024-04-30T16:07:40.127945 #2875310] INFO -- : [249/884] 2916632=test_init I, [2024-04-30T16:07:42.331920 #2875310] INFO -- : [250/884] 2916633=test_recorder I, [2024-04-30T16:07:42.374665 #2875310] INFO -- : [251/884] 2916633=test_gem_source_vendor I, [2024-04-30T16:07:42.407588 #2875310] INFO -- : [252/884] 2916633=test_gem_commands_owner_command I, [2024-04-30T16:07:42.741291 #2875310] INFO -- : [253/884] 2916634=test_deprecate I, [2024-04-30T16:07:42.863058 #2875310] INFO -- : [254/884] 2916632=test_rdoc_constant I, [2024-04-30T16:07:43.084760 #2875310] INFO -- : [255/884] 2916634=test_bash_completion I, [2024-04-30T16:07:43.150945 #2875310] INFO -- : [256/884] 2916634=test_formatter I, [2024-04-30T16:07:43.212613 #2875310] INFO -- : [257/884] 2916634=test_gem_commands_contents_command I, [2024-04-30T16:07:43.603883 #2875310] INFO -- : [258/884] 2916632=test_gem_ext_cmake_builder I, [2024-04-30T16:07:43.697202 #2875310] INFO -- : [259/884] 2916632=test_require I, [2024-04-30T16:07:43.835542 #2875310] INFO -- : [260/884] 2916634=test_cgi_util I, [2024-04-30T16:07:44.004932 #2875310] INFO -- : [261/884] 2916633=test_marshalable I, [2024-04-30T16:07:44.040853 #2875310] INFO -- : [262/884] 2916633=test_digest I, [2024-04-30T16:07:45.796104 #2875310] INFO -- : [263/884] 2916634=test_ractor I, [2024-04-30T16:07:46.292415 #2875310] INFO -- : [264/884] 2916634=test_find I, [2024-04-30T16:07:46.376010 #2875310] INFO -- : [265/884] 2916634=test_fiddle I, [2024-04-30T16:07:46.833212 #2875310] INFO -- : [266/884] 2916634=test_wss I, [2024-04-30T16:07:46.891294 #2875310] INFO -- : [267/884] 2916634=test_tempfile I, [2024-04-30T16:07:47.335220 #2875310] INFO -- : [268/884] 2916633=parse_comments_test I, [2024-04-30T16:07:47.827046 #2875310] INFO -- : [269/884] 2916635=test_noarg I, [2024-04-30T16:07:47.978598 #2875310] INFO -- : [270/884] 2916633=test_function I, [2024-04-30T16:07:48.063580 #2875310] INFO -- : [271/884] 2916634=test_queue I, [2024-04-30T16:07:48.082852 #2875310] INFO -- : [272/884] 2916634=test_internal_ivar I, [2024-04-30T16:07:48.136381 #2875310] INFO -- : [273/884] 2916634=test_gem_resolver_index_specification I, [2024-04-30T16:07:48.331215 #2875310] INFO -- : [274/884] 2916633=test_duplicate I, [2024-04-30T16:07:48.360706 #2875310] INFO -- : [275/884] 2916633=test_utf32 I, [2024-04-30T16:07:48.402175 #2875310] INFO -- : [276/884] 2916633=test_basicsocket I, [2024-04-30T16:07:48.421738 #2875310] INFO -- : [277/884] 2916634=test_prettyprint I, [2024-04-30T16:07:48.468321 #2875310] INFO -- : [278/884] 2916633=test_tracepoint I, [2024-04-30T16:07:48.588725 #2875310] INFO -- : [279/884] 2916634=test_gem_commands_help_command I, [2024-04-30T16:07:48.694559 #2875310] INFO -- : [280/884] 2916635=test_rdoc_markup I, [2024-04-30T16:07:48.747073 #2875310] INFO -- : [281/884] 2916635=test_yamlstore I, [2024-04-30T16:07:48.854295 #2875310] INFO -- : [282/884] 2916635=test_gem_installer I, [2024-04-30T16:07:49.237875 #2875310] INFO -- : [283/884] 2916634=test_date_strftime I, [2024-04-30T16:07:50.724909 #2875310] INFO -- : [284/884] 2916633=test_rdoc_parser_rd I, [2024-04-30T16:07:50.953429 #2875310] INFO -- : [285/884] 2916633=test_irb I, [2024-04-30T16:07:52.813715 #2875310] INFO -- : [286/884] 2916633=json_string_matching_test I, [2024-04-30T16:07:52.854894 #2875310] INFO -- : [287/884] 2916633=test_load I, [2024-04-30T16:07:52.895941 #2875310] INFO -- : [288/884] 2916632=test_class I, [2024-04-30T16:07:52.952066 #2875310] INFO -- : [289/884] 2916633=test_rdoc_normal_class I, [2024-04-30T16:07:53.337698 #2875310] INFO -- : [290/884] 2916633=test_const I, [2024-04-30T16:07:53.387524 #2875310] INFO -- : [291/884] 2916633=test_asn1 I, [2024-04-30T16:07:53.413786 #2875310] INFO -- : [292/884] 2916634=test_random I, [2024-04-30T16:07:53.461382 #2875310] INFO -- : [293/884] 2916634=test_inlinecache I, [2024-04-30T16:07:53.640744 #2875310] INFO -- : [294/884] 2916633=test_rdoc_markup_verbatim I, [2024-04-30T16:07:53.684712 #2875310] INFO -- : [295/884] 2916633=test_path_to_class I, [2024-04-30T16:07:53.739667 #2875310] INFO -- : [296/884] 2916633=test_gem_resolver_specification I, [2024-04-30T16:07:53.891784 #2875310] INFO -- : [297/884] 2916633=test_gem_dependency I, [2024-04-30T16:07:53.925220 #2875310] INFO -- : [298/884] 2916634=test_frozen_error I, [2024-04-30T16:07:53.958549 #2875310] INFO -- : [299/884] 2916634=test_gem_stub_specification I, [2024-04-30T16:07:54.960680 #2875310] INFO -- : [300/884] 2916633=test_method_cache I, [2024-04-30T16:07:54.995217 #2875310] INFO -- : [301/884] 2916633=test_gem_ext_ext_conf_builder I, [2024-04-30T16:07:55.126109 #2875310] INFO -- : [302/884] 2916634=test_complex I, [2024-04-30T16:07:55.672176 #2875310] INFO -- : [303/884] 2916634=test_gem_commands_search_command I, [2024-04-30T16:07:55.729166 #2875310] INFO -- : [304/884] 2916634=test_scanner_events I, [2024-04-30T16:07:56.072564 #2875310] INFO -- : [305/884] 2916634=test_gem_resolver_installed_specification I, [2024-04-30T16:07:56.260288 #2875310] INFO -- : [306/884] 2916634=test_parse I, [2024-04-30T16:08:00.091737 #2875310] INFO -- : [307/884] 2916634=test_mdns I, [2024-04-30T16:08:00.481832 #2875310] INFO -- : [308/884] 2916634=test_gem_remote_fetcher I, [2024-04-30T16:08:03.780823 #2875310] INFO -- : [309/884] 2916633=test_too_many_dummy_encodings I, [2024-04-30T16:08:04.194874 #2875310] INFO -- : [310/884] 2916633=test_rdoc_include I, [2024-04-30T16:08:04.462051 #2875310] INFO -- : [311/884] 2916633=test_reqarg I, [2024-04-30T16:08:06.975053 #2875310] INFO -- : [312/884] 2916633=test_gem_commands_list_command I, [2024-04-30T16:08:07.235994 #2875310] INFO -- : [313/884] 2916633=test_stack I, [2024-04-30T16:08:10.861195 #2875310] INFO -- : [314/884] 2916634=test_string_processing I, [2024-04-30T16:08:10.980978 #2875310] INFO -- : [315/884] 2916634=test_fileutils I, [2024-04-30T16:08:12.929262 #2875310] INFO -- : [316/884] 2916634=test_ldap I, [2024-04-30T16:08:12.963272 #2875310] INFO -- : [317/884] 2916634=test_emitter I, [2024-04-30T16:08:13.013158 #2875310] INFO -- : [318/884] 2916634=test_resource I, [2024-04-30T16:08:13.134876 #2875310] INFO -- : [319/884] 2916634=test_gem_commands_signin_command I, [2024-04-30T16:08:13.915173 #2875310] INFO -- : [320/884] 2916634=test_gem_version I, [2024-04-30T16:08:14.091708 #2875310] INFO -- : [321/884] 2916633=test_econv I, [2024-04-30T16:08:14.677366 #2875310] INFO -- : [322/884] 2916634=test_cesu8 I, [2024-04-30T16:08:14.708025 #2875310] INFO -- : [323/884] 2916634=test_rdoc_options I, [2024-04-30T16:08:16.701501 #2875310] INFO -- : [324/884] 2916634=test_gem_request_set_lockfile I, [2024-04-30T16:08:18.584317 #2875310] INFO -- : [325/884] 2916632=test_raise_exception I, [2024-04-30T16:08:18.964413 #2875310] INFO -- : [326/884] 2916634=test_protect I, [2024-04-30T16:08:19.004272 #2875310] INFO -- : [327/884] 2916634=test_win32ole_typelib I, [2024-04-30T16:08:19.030256 #2875310] INFO -- : [328/884] 2916634=test_tree_builder I, [2024-04-30T16:08:19.082547 #2875310] INFO -- : [329/884] 2916634=test_gem_resolver_dependency_request I, [2024-04-30T16:08:19.317254 #2875310] INFO -- : [330/884] 2916634=test_hash I, [2024-04-30T16:08:19.476374 #2875310] INFO -- : [331/884] 2916634=test_postponed_job I, [2024-04-30T16:08:21.676550 #2875310] INFO -- : [332/884] 2916633=test_alias_and_anchor I, [2024-04-30T16:08:21.827736 #2875310] INFO -- : [333/884] 2916633=test_external_new I, [2024-04-30T16:08:21.863453 #2875310] INFO -- : [334/884] 2916633=test_ws I, [2024-04-30T16:08:21.882730 #2875310] INFO -- : [335/884] 2916633=test_gem_commands_environment_command I, [2024-04-30T16:08:22.005912 #2875310] INFO -- : [336/884] 2916634=test_m17n I, [2024-04-30T16:08:22.260154 #2875310] INFO -- : [337/884] 2916633=test_workspace I, [2024-04-30T16:08:22.531259 #2875310] INFO -- : [338/884] 2916634=test_weakmap I, [2024-04-30T16:08:23.334601 #2875310] INFO -- : [339/884] 2916635=test_yjit I, [2024-04-30T16:08:23.372007 #2875310] INFO -- : [340/884] 2916633=test_kill_ring I, [2024-04-30T16:08:23.380235 #2875310] INFO -- : [341/884] 2916635=test_ns_spki I, [2024-04-30T16:08:23.399545 #2875310] INFO -- : [342/884] 2916633=test_framework I, [2024-04-30T16:08:23.419170 #2875310] INFO -- : [343/884] 2916633=test_argf I, [2024-04-30T16:08:23.606190 #2875310] INFO -- : [344/884] 2916635=test_line_editor I, [2024-04-30T16:08:23.626877 #2875310] INFO -- : [345/884] 2916632=ripper_test I, [2024-04-30T16:08:24.020849 #2875310] INFO -- : [346/884] 2916635=test_objspace I, [2024-04-30T16:08:28.467966 #2875310] INFO -- : [347/884] 2916632=test_undef I, [2024-04-30T16:08:28.619548 #2875310] INFO -- : [348/884] 2916632=test_string_memory I, [2024-04-30T16:08:28.901511 #2875310] INFO -- : [349/884] 2916632=comments_test I, [2024-04-30T16:08:28.968894 #2875310] INFO -- : [350/884] 2916632=test_sprintf I, [2024-04-30T16:08:31.012457 #2875310] INFO -- : [351/884] 2916632=test_gem_requirement I, [2024-04-30T16:08:32.126214 #2875310] INFO -- : [352/884] 2916632=test_gem_security_trust_dir I, [2024-04-30T16:08:32.495682 #2875310] INFO -- : [353/884] 2916632=test_show_source I, [2024-04-30T16:08:32.539938 #2875310] INFO -- : [354/884] 2916632=test_set I, [2024-04-30T16:08:32.976065 #2875310] INFO -- : [355/884] 2916632=test_lock_native_thread I, [2024-04-30T16:08:34.234536 #2875310] INFO -- : [356/884] 2916632=test_c_struct_entry I, [2024-04-30T16:08:35.751920 #2875310] INFO -- : [357/884] 2916632=test_gem_commands_stale_command I, [2024-04-30T16:08:35.797105 #2875310] INFO -- : [358/884] 2916632=test_remote_fetch_error I, [2024-04-30T16:08:36.014240 #2875310] INFO -- : [359/884] 2916632=test_have_library I, [2024-04-30T16:08:46.273438 #2875310] INFO -- : [360/884] 2916632=test_gem_commands_query_command I, [2024-04-30T16:08:50.408743 #2875310] INFO -- : [361/884] 2916632=test_method I, [2024-04-30T16:08:53.339561 #2875310] INFO -- : [362/884] 2916634=test_rdoc_rubygems_hook I, [2024-04-30T16:08:53.904927 #2875310] INFO -- : [363/884] 2916634=test_pattern_key_name_check I, [2024-04-30T16:08:53.940279 #2875310] INFO -- : [364/884] 2916634=test_to_ruby I, [2024-04-30T16:08:54.064630 #2875310] INFO -- : [365/884] 2916634=test_gem_impossible_dependencies_error I, [2024-04-30T16:08:54.074785 #2875310] INFO -- : [366/884] 2916634=test_array_create I, [2024-04-30T16:08:54.226541 #2875310] INFO -- : [367/884] 2916634=test_pack I, [2024-04-30T16:08:56.025264 #2875310] INFO -- : [368/884] 2916634=test_ftp I, [2024-04-30T16:08:56.061186 #2875310] INFO -- : [369/884] 2916634=test_rdoc_context_section I, [2024-04-30T16:08:56.121158 #2875310] INFO -- : [370/884] 2916634=test_euc_kr I, [2024-04-30T16:08:56.174605 #2875310] INFO -- : [371/884] 2916634=test_type_completor I, [2024-04-30T16:08:56.182554 #2875310] INFO -- : [372/884] 2916634=test_console_attr I, [2024-04-30T16:08:56.207019 #2875310] INFO -- : [373/884] 2916634=test_summary I, [2024-04-30T16:08:56.678985 #2875310] INFO -- : [374/884] 2916634=test_ellipsize I, [2024-04-30T16:08:56.709899 #2875310] INFO -- : [375/884] 2916634=test_date_attr I, [2024-04-30T16:08:56.744348 #2875310] INFO -- : [376/884] 2916634=test_io_wait I, [2024-04-30T16:08:56.871937 #2875310] INFO -- : [377/884] 2916633=test_gem_commands_exec_command I, [2024-04-30T16:08:57.163720 #2875310] INFO -- : [378/884] 2916634=warnings_test I, [2024-04-30T16:08:57.259281 #2875310] INFO -- : [379/884] 2916634=test_kwargs I, [2024-04-30T16:08:57.904603 #2875310] INFO -- : [380/884] 2916634=test_sorted_set I, [2024-04-30T16:08:59.228449 #2875310] INFO -- : [381/884] 2916634=test_win32ole_type_event I, [2024-04-30T16:08:59.298373 #2875310] INFO -- : [382/884] 2916634=test_emoji I, [2024-04-30T16:08:59.448968 #2875310] INFO -- : [383/884] 2916634=test_ubf_async_safe I, [2024-04-30T16:08:59.638191 #2875310] INFO -- : [384/884] 2916634=test_hash I, [2024-04-30T16:09:04.815434 #2875310] INFO -- : [385/884] 2916633=test_io I, [2024-04-30T16:09:05.621748 #2875310] INFO -- : [386/884] 2916633=test_cp949 I, [2024-04-30T16:09:06.071701 #2875310] INFO -- : [387/884] 2916633=test_gem_commands_uninstall_command I, [2024-04-30T16:09:12.172296 #2875310] INFO -- : [388/884] 2916633=test_gem_source_specific_file I, [2024-04-30T16:09:12.758742 #2875310] INFO -- : [389/884] 2916633=test_foreach I, [2024-04-30T16:09:12.794810 #2875310] INFO -- : [390/884] 2916633=test_condition I, [2024-04-30T16:09:12.849759 #2875310] INFO -- : [391/884] 2916633=test_gem_unsatisfiable_dependency_error I, [2024-04-30T16:09:12.961282 #2875310] INFO -- : [392/884] 2916633=test_win32ole_record I, [2024-04-30T16:09:13.012160 #2875310] INFO -- : [393/884] 2916633=test_yaml_tree I, [2024-04-30T16:09:13.329847 #2875310] INFO -- : [394/884] 2916633=test_sleep I, [2024-04-30T16:09:15.575984 #2875310] INFO -- : [395/884] 2916633=test_config I, [2024-04-30T16:09:15.691641 #2875310] INFO -- : [396/884] 2916633=test_libs I, [2024-04-30T16:09:15.779032 #2875310] INFO -- : [397/884] 2916633=test_math I, [2024-04-30T16:09:15.929771 #2875310] INFO -- : [398/884] 2916633=test_gem_commands_fetch_command I, [2024-04-30T16:09:16.959540 #2875310] INFO -- : [399/884] 2916633=test_gc I, [2024-04-30T16:09:17.097851 #2875310] INFO -- : [400/884] 2916633=test_io I, [2024-04-30T16:09:17.944890 #2875310] INFO -- : [401/884] 2916632=test_unicode_escape I, [2024-04-30T16:09:18.590612 #2875310] INFO -- : [402/884] 2916632=test_utf16 I, [2024-04-30T16:09:19.233028 #2875310] INFO -- : [403/884] 2916632=test_autoload I, [2024-04-30T16:09:28.895190 #2875310] INFO -- : [404/884] 2916634=test_rendering I, [2024-04-30T16:09:29.560172 #2875310] INFO -- : [405/884] 2916634=test_sizeof I, [2024-04-30T16:09:39.057075 #2875310] INFO -- : [406/884] 2916632=test_case I, [2024-04-30T16:09:39.274914 #2875310] INFO -- : [407/884] 2916632=test_face I, [2024-04-30T16:09:39.404858 #2875310] INFO -- : [408/884] 2916632=test_system I, [2024-04-30T16:09:48.145976 #2875310] INFO -- : [409/884] 2916632=test_pkcs12 I, [2024-04-30T16:09:52.755518 #2875310] INFO -- : [410/884] 2916632=test_gem_package_tar_header I, [2024-04-30T16:09:53.726489 #2875310] INFO -- : [411/884] 2916632=test_gem_util I, [2024-04-30T16:09:54.555923 #2875310] INFO -- : [412/884] 2916632=test_iseq_load I, [2024-04-30T16:09:54.865658 #2875310] INFO -- : [413/884] 2916634=test_pkey_dh I, [2024-04-30T16:09:55.402477 #2875310] INFO -- : [414/884] 2916634=test_bigzero I, [2024-04-30T16:09:55.457949 #2875310] INFO -- : [415/884] 2916634=test_getopts I, [2024-04-30T16:09:55.522329 #2875310] INFO -- : [416/884] 2916634=test_protocol I, [2024-04-30T16:09:55.924724 #2875310] INFO -- : [417/884] 2916634=test_gem_resolver_activation_request I, [2024-04-30T16:09:56.056127 #2875310] INFO -- : [418/884] 2916634=test_gem_config_file I, [2024-04-30T16:09:57.587928 #2875310] INFO -- : [419/884] 2916634=test_ripper I, [2024-04-30T16:10:00.348221 #2875310] INFO -- : [420/884] 2916634=test_etc I, [2024-04-30T16:10:00.863155 #2875310] INFO -- : [421/884] 2916634=test_yjit_exit_locations I, [2024-04-30T16:10:00.864488 #2875310] INFO -- : [422/884] 2916634=test_optparse I, [2024-04-30T16:10:00.886482 #2875310] INFO -- : [423/884] 2916634=test_array I, [2024-04-30T16:10:00.967684 #2875310] INFO -- : [424/884] 2916634=test_fstring I, [2024-04-30T16:10:01.454381 #2875310] INFO -- : [425/884] 2916633=test_rdoc_markup_to_html_crossref I, [2024-04-30T16:10:01.710961 #2875310] INFO -- : [426/884] 2916632=encoding_test I, [2024-04-30T16:10:01.919573 #2875310] INFO -- : [427/884] 2916634=test_gem_resolver_best_set I, [2024-04-30T16:10:01.979735 #2875310] INFO -- : [428/884] 2916635=test_typeddata I, [2024-04-30T16:10:02.442486 #2875310] INFO -- : [429/884] 2916634=test_rat I, [2024-04-30T16:10:02.468755 #2875310] INFO -- : [430/884] 2916632=test_webauthn_poller I, [2024-04-30T16:10:02.475136 #2875310] INFO -- : [431/884] 2916634=test_rdoc_markup_raw I, [2024-04-30T16:10:02.547325 #2875310] INFO -- : [432/884] 2916634=test_stringscanner I, [2024-04-30T16:10:02.768231 #2875310] INFO -- : [433/884] 2916634=test_files_sample I, [2024-04-30T16:10:02.786913 #2875310] INFO -- : [434/884] 2916634=test_rdoc_alias I, [2024-04-30T16:10:02.861507 #2875310] INFO -- : [435/884] 2916634=test_yield I, [2024-04-30T16:10:02.952673 #2875310] INFO -- : [436/884] 2916632=parser_test I, [2024-04-30T16:10:03.031459 #2875310] INFO -- : [437/884] 2916632=test_convertible I, [2024-04-30T16:10:03.902314 #2875310] INFO -- : [438/884] 2916633=test_gem_resolver_conflict I, [2024-04-30T16:10:04.003011 #2875310] INFO -- : [439/884] 2916633=test_rdoc_task I, [2024-04-30T16:10:04.044493 #2875310] INFO -- : [440/884] 2916633=test_backtrace I, [2024-04-30T16:10:04.622105 #2875310] INFO -- : [441/884] 2916635=test_pack I, [2024-04-30T16:10:04.659590 #2875310] INFO -- : [442/884] 2916635=ruby_parser_test I, [2024-04-30T16:10:04.682673 #2875310] INFO -- : [443/884] 2916635=test_io_buffer I, [2024-04-30T16:10:04.833310 #2875310] INFO -- : [444/884] 2916635=test_rdoc_markup_indented_paragraph I, [2024-04-30T16:10:04.939841 #2875310] INFO -- : [445/884] 2916635=test_rdoc_require I, [2024-04-30T16:10:04.981376 #2875310] INFO -- : [446/884] 2916635=locals_test I, [2024-04-30T16:10:07.364410 #2875310] INFO -- : [447/884] 2916633=test_readpartial I, [2024-04-30T16:10:07.783678 #2875310] INFO -- : [448/884] 2916635=test_clone I, [2024-04-30T16:10:07.987262 #2875310] INFO -- : [449/884] 2916633=test_gem_commands_install_command I, [2024-04-30T16:10:09.205816 #2875310] INFO -- : [450/884] 2916635=test_exception_at_throwing I, [2024-04-30T16:10:09.593800 #2875310] INFO -- : [451/884] 2916635=test_iseq I, [2024-04-30T16:10:14.310535 #2875310] INFO -- : [452/884] 2916635=test_rdoc_markup_heading I, [2024-04-30T16:10:14.463824 #2875310] INFO -- : [453/884] 2916635=test_ocsp I, [2024-04-30T16:10:17.330967 #2875310] INFO -- : [454/884] 2916635=test_class I, [2024-04-30T16:10:17.400876 #2875310] INFO -- : [455/884] 2916635=test_pkey_dsa I, [2024-04-30T16:10:17.988105 #2875310] INFO -- : [456/884] 2916633=test_scheduler I, [2024-04-30T16:10:18.477293 #2875310] INFO -- : [457/884] 2916633=test_gem_commands_build_command I, [2024-04-30T16:10:20.680029 #2875310] INFO -- : [458/884] 2916633=test_interned_str I, [2024-04-30T16:10:20.971418 #2875310] INFO -- : [459/884] 2916633=test_case_comprehensive I, [2024-04-30T16:10:23.860494 #2875310] INFO -- : [460/884] 2916635=test_io_m17n I, [2024-04-30T16:10:29.289397 #2875310] INFO -- : [461/884] 2916634=test_variable_name_check I, [2024-04-30T16:10:29.871958 #2875310] INFO -- : [462/884] 2916634=test_did_you_mean I, [2024-04-30T16:10:30.304765 #2875310] INFO -- : [463/884] 2916634=test_gem_commands_server_command I, [2024-04-30T16:10:30.331416 #2875310] INFO -- : [464/884] 2916634=test_append I, [2024-04-30T16:10:30.363988 #2875310] INFO -- : [465/884] 2916634=test_option I, [2024-04-30T16:10:31.358719 #2875310] INFO -- : [466/884] 2916634=test_cmethod I, [2024-04-30T16:10:31.392567 #2875310] INFO -- : [467/884] 2916634=test_tracer I, [2024-04-30T16:10:31.443698 #2875310] INFO -- : [468/884] 2916634=test_delegate I, [2024-04-30T16:10:31.516427 #2875310] INFO -- : [469/884] 2916634=test_popen_deadlock I, [2024-04-30T16:10:32.841683 #2875310] INFO -- : [470/884] 2916635=test_history I, [2024-04-30T16:10:33.046362 #2875310] INFO -- : [471/884] 2916635=test_mkmf I, [2024-04-30T16:10:33.201282 #2875310] INFO -- : [472/884] 2916635=test_date_marshal I, [2024-04-30T16:10:33.228933 #2875310] INFO -- : [473/884] 2916635=test_recursion I, [2024-04-30T16:10:33.271160 #2875310] INFO -- : [474/884] 2916635=test_exit I, [2024-04-30T16:10:33.890478 #2875310] INFO -- : [475/884] 2916635=test_digest I, [2024-04-30T16:10:34.232463 #2875310] INFO -- : [476/884] 2916635=test_ractor I, [2024-04-30T16:10:34.421451 #2875310] INFO -- : [477/884] 2916635=test_rdoc_servlet I, [2024-04-30T16:10:35.137153 #2875310] INFO -- : [478/884] 2916635=test_gem_security I, [2024-04-30T16:10:36.006483 #2875310] INFO -- : [479/884] 2916634=test_multi_irb_commands I, [2024-04-30T16:10:37.098612 #2875310] INFO -- : [480/884] 2916634=test_fiber I, [2024-04-30T16:10:39.415068 #2875310] INFO -- : [481/884] 2916632=test_open3 I, [2024-04-30T16:10:50.227821 #2875310] INFO -- : [482/884] 2916634=test_closure I, [2024-04-30T16:10:53.656396 #2875310] INFO -- : [483/884] 2916634=test_bundled_ca I, [2024-04-30T16:10:54.754868 #2875310] INFO -- : [484/884] 2916634=test_emoji_breaks I, [2024-04-30T16:10:54.805635 #2875310] INFO -- : [485/884] 2916634=test_gem_bundler_version_finder I, [2024-04-30T16:10:55.066464 #2875310] INFO -- : [486/884] 2916634=test_within_pipe I, [2024-04-30T16:10:55.235062 #2875310] INFO -- : [487/884] 2916634=reflection_test I, [2024-04-30T16:10:55.245641 #2875310] INFO -- : [488/884] 2916634=test_files_lib I, [2024-04-30T16:10:55.345486 #2875310] INFO -- : [489/884] 2916634=test_gem_commands_unpack_command I, [2024-04-30T16:10:58.224604 #2875310] INFO -- : [490/884] 2916632=test_beginendblock I, [2024-04-30T16:10:58.260968 #2875310] INFO -- : [491/884] 2916634=test_help I, [2024-04-30T16:10:58.297371 #2875310] INFO -- : [492/884] 2916634=test_rdoc_markup_to_bs I, [2024-04-30T16:10:58.535057 #2875310] INFO -- : [493/884] 2916634=test_rdoc_markup_pre_process I, [2024-04-30T16:10:59.041243 #2875310] INFO -- : [494/884] 2916634=test_printf I, [2024-04-30T16:10:59.592818 #2875310] INFO -- : [495/884] 2916634=test_to_ary_concat I, [2024-04-30T16:11:00.832097 #2875310] INFO -- : [496/884] 2916632=test_webauthn_listener_response I, [2024-04-30T16:11:00.994942 #2875310] INFO -- : [497/884] 2916632=test_time I, [2024-04-30T16:11:02.388889 #2875310] INFO -- : [498/884] 2916632=test_stream I, [2024-04-30T16:11:02.535220 #2875310] INFO -- : [499/884] 2916632=test_pinned I, [2024-04-30T16:11:02.748925 #2875310] INFO -- : [500/884] 2916632=test_gem_resolver_local_specification I, [2024-04-30T16:11:03.091220 #2875310] INFO -- : [501/884] 2916632=test_httpheader I, [2024-04-30T16:11:03.268436 #2875310] INFO -- : [502/884] 2916632=test_rdoc_ri_driver I, [2024-04-30T16:11:05.496689 #2875310] INFO -- : [503/884] 2916632=test_set_len I, [2024-04-30T16:11:05.523831 #2875310] INFO -- : [504/884] 2916632=test_httpresponses I, [2024-04-30T16:11:05.560141 #2875310] INFO -- : [505/884] 2916632=test_encoding I, [2024-04-30T16:11:05.636117 #2875310] INFO -- : [506/884] 2916632=test_sockopt I, [2024-04-30T16:11:07.157434 #2875310] INFO -- : [507/884] 2916632=test_install I, [2024-04-30T16:11:07.190722 #2875310] INFO -- : [508/884] 2916632=test_rdoc_markup_to_label I, [2024-04-30T16:11:07.431624 #2875310] INFO -- : [509/884] 2916632=test_key_stroke I, [2024-04-30T16:11:07.464966 #2875310] INFO -- : [510/884] 2916632=json_encoding_test I, [2024-04-30T16:11:07.907723 #2875310] INFO -- : [511/884] 2916632=test_color I, [2024-04-30T16:11:07.988670 #2875310] INFO -- : [512/884] 2916632=test_primitive I, [2024-04-30T16:11:08.044975 #2875310] INFO -- : [513/884] 2916632=test_human_typo I, [2024-04-30T16:11:08.086650 #2875310] INFO -- : [514/884] 2916632=test_rbconfig I, [2024-04-30T16:11:08.121601 #2875310] INFO -- : [515/884] 2916632=test_document I, [2024-04-30T16:11:08.163901 #2875310] INFO -- : [516/884] 2916632=test_acceptable I, [2024-04-30T16:11:08.967200 #2875310] INFO -- : [517/884] 2916632=test_euc_jp I, [2024-04-30T16:11:08.999964 #2875310] INFO -- : [518/884] 2916632=test_rdoc_generator_pot_po_entry I, [2024-04-30T16:11:09.187256 #2875310] INFO -- : [519/884] 2916632=test_pair I, [2024-04-30T16:11:09.255711 #2875310] INFO -- : [520/884] 2916634=test_gem_commands_yank_command I, [2024-04-30T16:11:10.213808 #2875310] INFO -- : [521/884] 2916634=test_win32ole_param I, [2024-04-30T16:11:10.236998 #2875310] INFO -- : [522/884] 2916634=test_chilled I, [2024-04-30T16:11:10.281188 #2875310] INFO -- : [523/884] 2916634=test_name_error_extension I, [2024-04-30T16:11:10.312813 #2875310] INFO -- : [524/884] 2916634=test_rdoc_i18n_locale I, [2024-04-30T16:11:10.409213 #2875310] INFO -- : [525/884] 2916634=test_rdoc_method_attr I, [2024-04-30T16:11:11.109465 #2875310] INFO -- : [526/884] 2916634=test_filter I, [2024-04-30T16:11:11.285346 #2875310] INFO -- : [527/884] 2916634=test_gem_gem_runner I, [2024-04-30T16:11:11.694974 #2875310] INFO -- : [528/884] 2916634=test_data I, [2024-04-30T16:11:11.736686 #2875310] INFO -- : [529/884] 2916634=static_literals_test I, [2024-04-30T16:11:11.764300 #2875310] INFO -- : [530/884] 2916634=test_rdoc_generator_pot I, [2024-04-30T16:11:11.798858 #2875310] INFO -- : [531/884] 2916634=test_enumerator I, [2024-04-30T16:11:11.827781 #2875310] INFO -- : [532/884] 2916634=test_rdoc_parser_changelog I, [2024-04-30T16:11:12.218974 #2875310] INFO -- : [533/884] 2916634=parameters_signature_test I, [2024-04-30T16:11:12.289435 #2875310] INFO -- : [534/884] 2916634=test_koi8 I, [2024-04-30T16:11:12.322628 #2875310] INFO -- : [535/884] 2916634=test_unicode I, [2024-04-30T16:11:12.374629 #2875310] INFO -- : [536/884] 2916634=test_ssl_session I, [2024-04-30T16:11:17.172465 #2875310] INFO -- : [537/884] 2916634=test_lexer I, [2024-04-30T16:11:17.260524 #2875310] INFO -- : [538/884] 2916634=test_thread_cv I, [2024-04-30T16:11:18.222464 #2875310] INFO -- : [539/884] 2916634=test_gem_resolver_vendor_specification I, [2024-04-30T16:11:18.790510 #2875310] INFO -- : [540/884] 2916634=test_gem_commands_update_command I, [2024-04-30T16:11:26.426455 #2875310] INFO -- : [541/884] 2916634=test_gem_uri I, [2024-04-30T16:11:26.674145 #2875310] INFO -- : [542/884] 2916634=test_key_event_record I, [2024-04-30T16:11:26.700332 #2875310] INFO -- : [543/884] 2916634=test_notimplement I, [2024-04-30T16:11:26.737852 #2875310] INFO -- : [544/884] 2916634=test_random I, [2024-04-30T16:11:26.794729 #2875310] INFO -- : [545/884] 2916634=test_bug-14834 I, [2024-04-30T16:11:27.350147 #2875310] INFO -- : [546/884] 2916634=test_date_compat I, [2024-04-30T16:11:27.411445 #2875310] INFO -- : [547/884] 2916634=test_rdoc_markup_to_html I, [2024-04-30T16:11:27.964473 #2875310] INFO -- : [548/884] 2916634=test_terminfo I, [2024-04-30T16:11:28.043053 #2875310] INFO -- : [549/884] 2916634=test_compile_prism I, [2024-04-30T16:11:30.346551 #2875310] INFO -- : [550/884] 2916634=test_bn I, [2024-04-30T16:11:30.456063 #2875310] INFO -- : [551/884] 2916634=test_win32ole_param_event I, [2024-04-30T16:11:30.512498 #2875310] INFO -- : [552/884] 2916634=test_path I, [2024-04-30T16:11:30.540056 #2875310] INFO -- : [553/884] 2916634=redundant_return_test I, [2024-04-30T16:11:30.576301 #2875310] INFO -- : [554/884] 2916634=test_case_mapping I, [2024-04-30T16:11:30.694885 #2875310] INFO -- : [555/884] 2916634=test_tree_spell_checker I, [2024-04-30T16:11:31.165585 #2875310] INFO -- : [556/884] 2916634=test_http I, [2024-04-30T16:11:31.461239 #2875310] INFO -- : [557/884] 2916632=test_addrinfo I, [2024-04-30T16:11:31.861602 #2875310] INFO -- : [558/884] 2916632=test_monitor I, [2024-04-30T16:11:32.151875 #2875310] INFO -- : [559/884] 2916632=test_buffered_io I, [2024-04-30T16:11:32.631923 #2875310] INFO -- : [560/884] 2916632=test_configuration I, [2024-04-30T16:11:33.117784 #2875310] INFO -- : [561/884] 2916632=test_rubyvm I, [2024-04-30T16:11:33.148411 #2875310] INFO -- : [562/884] 2916632=test_rdoc_generator_markup I, [2024-04-30T16:11:33.180620 #2875310] INFO -- : [563/884] 2916632=test_whileuntil I, [2024-04-30T16:11:33.217645 #2875310] INFO -- : [564/884] 2916632=test_boolean I, [2024-04-30T16:11:33.295181 #2875310] INFO -- : [565/884] 2916632=test_stringify_symbols I, [2024-04-30T16:11:33.366503 #2875310] INFO -- : [566/884] 2916632=integer_parse_test I, [2024-04-30T16:11:34.294614 #2875310] INFO -- : [567/884] 2916632=test_instrumentation_api I, [2024-04-30T16:11:37.876022 #2875310] INFO -- : [568/884] 2916632=test_ssl I, [2024-04-30T16:11:39.297486 #2875310] INFO -- : [569/884] 2916635=test_gem_ext_cargo_builder I, [2024-04-30T16:11:39.580732 #2875310] INFO -- : [570/884] 2916635=constant_path_node_test I, [2024-04-30T16:11:39.679892 #2875310] INFO -- : [571/884] 2916635=test_gem_request_set I, [2024-04-30T16:11:42.538593 #2875310] INFO -- : [572/884] 2916635=test_module I, [2024-04-30T16:11:47.565269 #2875310] INFO -- : [573/884] 2916634=test_parser I, [2024-04-30T16:11:47.707444 #2875310] INFO -- : [574/884] 2916634=test_method_name_check I, [2024-04-30T16:11:48.014964 #2875310] INFO -- : [575/884] 2916634=test_arith_seq_extract I, [2024-04-30T16:11:49.271872 #2875310] INFO -- : [576/884] 2916634=test_erb I, [2024-04-30T16:11:49.730121 #2875310] INFO -- : [577/884] 2916634=test_x509ext I, [2024-04-30T16:11:49.920175 #2875310] INFO -- : [578/884] 2916634=test_gem_source_installed I, [2024-04-30T16:11:50.122671 #2875310] INFO -- : [579/884] 2916634=test_gem_commands_cert_command I, [2024-04-30T16:11:55.391728 #2875310] INFO -- : [580/884] 2916635=test_completion I, [2024-04-30T16:11:59.807878 #2875310] INFO -- : [581/884] 2916635=test_len I, [2024-04-30T16:11:59.833512 #2875310] INFO -- : [582/884] 2916635=test_yield_block I, [2024-04-30T16:11:59.878134 #2875310] INFO -- : [583/884] 2916635=test_rational2 I, [2024-04-30T16:11:59.987892 #2875310] INFO -- : [584/884] 2916635=test_rational I, [2024-04-30T16:12:00.140629 #2875310] INFO -- : [585/884] 2916635=test_assembler I, [2024-04-30T16:12:00.180385 #2875310] INFO -- : [586/884] 2916635=test_spell_checker I, [2024-04-30T16:12:00.233488 #2875310] INFO -- : [587/884] 2916635=test_propertyputref I, [2024-04-30T16:12:00.257120 #2875310] INFO -- : [588/884] 2916635=attribute_write_test I, [2024-04-30T16:12:00.286425 #2875310] INFO -- : [589/884] 2916635=test_win32ole_method_event I, [2024-04-30T16:12:00.316853 #2875310] INFO -- : [590/884] 2916635=test_nesting_parser I, [2024-04-30T16:12:00.446700 #2875310] INFO -- : [591/884] 2916635=test_gem_dependency_list I, [2024-04-30T16:12:01.028294 #2875310] INFO -- : [592/884] 2916635=test_benchmark I, [2024-04-30T16:12:03.431854 #2875310] INFO -- : [593/884] 2916635=test_gem_commands_outdated_command I, [2024-04-30T16:12:03.821367 #2875310] INFO -- : [594/884] 2916635=test_array I, [2024-04-30T16:12:14.160463 #2875310] INFO -- : [595/884] 2916634=test_helper_method I, [2024-04-30T16:12:14.263494 #2875310] INFO -- : [596/884] 2916634=test_gem_package_tar_writer I, [2024-04-30T16:12:15.375122 #2875310] INFO -- : [597/884] 2916634=test_gem_source I, [2024-04-30T16:12:17.523456 #2875310] INFO -- : [598/884] 2916634=test_scalar_scanner I, [2024-04-30T16:12:17.594059 #2875310] INFO -- : [599/884] 2916634=test_rdoc_parser_simple I, [2024-04-30T16:12:17.676132 #2875310] INFO -- : [600/884] 2916634=test_load I, [2024-04-30T16:12:17.731606 #2875310] INFO -- : [601/884] 2916634=test_yamldbm I, [2024-04-30T16:12:18.199614 #2875310] INFO -- : [602/884] 2916634=test_gem_commands_rebuild_command I, [2024-04-30T16:12:18.716452 #2875310] INFO -- : [603/884] 2916634=test_abi I, [2024-04-30T16:12:19.692167 #2875310] INFO -- : [604/884] 2916634=test_provider I, [2024-04-30T16:12:23.345126 #2875310] INFO -- : [605/884] 2916634=test_evaluation I, [2024-04-30T16:12:23.426305 #2875310] INFO -- : [606/884] 2916634=test_https I, [2024-04-30T16:12:24.581994 #2875310] INFO -- : [607/884] 2916634=test_gem_ext_builder I, [2024-04-30T16:12:26.066515 #2875310] INFO -- : [608/884] 2916632=test_iterator I, [2024-04-30T16:12:26.773396 #2875310] INFO -- : [609/884] 2916632=test_string I, [2024-04-30T16:12:26.800480 #2875310] INFO -- : [610/884] 2916632=test_omap I, [2024-04-30T16:12:26.881466 #2875310] INFO -- : [611/884] 2916632=test_digest_extend I, [2024-04-30T16:12:26.948731 #2875310] INFO -- : [612/884] 2916632=test_shellwords I, [2024-04-30T16:12:26.993234 #2875310] INFO -- : [613/884] 2916632=test_debug I, [2024-04-30T16:12:27.039984 #2875310] INFO -- : [614/884] 2916632=test_memory_view I, [2024-04-30T16:12:27.259303 #2875310] INFO -- : [615/884] 2916632=pattern_test I, [2024-04-30T16:12:27.352473 #2875310] INFO -- : [616/884] 2916632=test_cipher I, [2024-04-30T16:12:27.947048 #2875310] INFO -- : [617/884] 2916632=test_gem_security_signer I, [2024-04-30T16:12:28.768398 #2875310] INFO -- : [618/884] 2916632=test_new I, [2024-04-30T16:12:28.796693 #2875310] INFO -- : [619/884] 2916632=test_storage I, [2024-04-30T16:12:29.070616 #2875310] INFO -- : [620/884] 2916632=test_gem_resolver_git_set I, [2024-04-30T16:12:30.996115 #2875310] INFO -- : [621/884] 2916632=test_float I, [2024-04-30T16:12:33.131201 #2875310] INFO -- : [622/884] 2916634=test_require I, [2024-04-30T16:12:36.135987 #2875310] INFO -- : [623/884] 2916632=test_cgi_cookie I, [2024-04-30T16:12:36.309092 #2875310] INFO -- : [624/884] 2916632=test_dir_m17n I, [2024-04-30T16:12:45.116463 #2875310] INFO -- : [625/884] 2916635=test_gem_resolver_installer_set I, [2024-04-30T16:12:46.695988 #2875310] INFO -- : [626/884] 2916635=test_regex_casefold I, [2024-04-30T16:12:47.180378 #2875310] INFO -- : [627/884] 2916632=test_refinement I, [2024-04-30T16:12:50.507225 #2875310] INFO -- : [628/884] 2916635=test_gem_commands_signout_command I, [2024-04-30T16:12:50.851213 #2875310] INFO -- : [629/884] 2916635=test_gem_source_git I, [2024-04-30T16:12:52.873752 #2875310] INFO -- : [630/884] 2916634=test_fixnum I, [2024-04-30T16:12:52.986035 #2875310] INFO -- : [631/884] 2916634=test_signal I, [2024-04-30T16:12:54.469356 #2875310] INFO -- : [632/884] 2916635=test_x509crl I, [2024-04-30T16:12:56.109276 #2875310] INFO -- : [633/884] 2916635=test_rdoc_rd I, [2024-04-30T16:12:56.163572 #2875310] INFO -- : [634/884] 2916635=test_cgi_session I, [2024-04-30T16:12:56.351147 #2875310] INFO -- : [635/884] 2916635=test_rdoc_top_level I, [2024-04-30T16:12:58.462164 #2875310] INFO -- : [636/884] 2916635=test_metaclass I, [2024-04-30T16:12:58.501190 #2875310] INFO -- : [637/884] 2916635=test_input_method I, [2024-04-30T16:12:58.646586 #2875310] INFO -- : [638/884] 2916634=test_windows_1252 I, [2024-04-30T16:12:58.654973 #2875310] INFO -- : [639/884] 2916634=test_process I, [2024-04-30T16:12:58.752624 #2875310] INFO -- : [640/884] 2916635=test_key_error I, [2024-04-30T16:12:58.876018 #2875310] INFO -- : [641/884] 2916635=test_allocation I, [2024-04-30T16:12:58.923009 #2875310] INFO -- : [642/884] 2916634=test_div I, [2024-04-30T16:12:58.954218 #2875310] INFO -- : [643/884] 2916634=test_win32ole_variant_m I, [2024-04-30T16:12:58.964118 #2875310] INFO -- : [644/884] 2916634=test_engine I, [2024-04-30T16:12:58.993979 #2875310] INFO -- : [645/884] 2916634=test_deprecated I, [2024-04-30T16:12:59.045285 #2875310] INFO -- : [646/884] 2916634=test_color_printer I, [2024-04-30T16:12:59.071099 #2875310] INFO -- : [647/884] 2916634=test_insns_leaf I, [2024-04-30T16:12:59.095771 #2875310] INFO -- : [648/884] 2916634=test_serialize_subclasses I, [2024-04-30T16:12:59.155460 #2875310] INFO -- : [649/884] 2916634=test_set I, [2024-04-30T16:12:59.417424 #2875310] INFO -- : [650/884] 2916634=test_struct I, [2024-04-30T16:13:06.151073 #2875310] INFO -- : [651/884] 2916634=test_gem_path_support I, [2024-04-30T16:13:06.491336 #2875310] INFO -- : [652/884] 2916634=test_files_test_1 I, [2024-04-30T16:13:06.516581 #2875310] INFO -- : [653/884] 2916634=test_rdoc_rd_inline I, [2024-04-30T16:13:06.796429 #2875310] INFO -- : [654/884] 2916634=test_mutex I, [2024-04-30T16:13:08.008872 #2875310] INFO -- : [655/884] 2916634=test_x509req I, [2024-04-30T16:13:09.612716 #2875310] INFO -- : [656/884] 2916634=test_dln I, [2024-04-30T16:13:09.623616 #2875310] INFO -- : [657/884] 2916634=test_gem_source_subpath_problem I, [2024-04-30T16:13:10.269923 #2875310] INFO -- : [658/884] 2916632=json_common_interface_test I, [2024-04-30T16:13:10.349744 #2875310] INFO -- : [659/884] 2916632=test_win32ole_variant_outarg I, [2024-04-30T16:13:10.375913 #2875310] INFO -- : [660/884] 2916632=test_config I, [2024-04-30T16:13:10.562540 #2875310] INFO -- : [661/884] 2916632=test_nomethod_error I, [2024-04-30T16:13:10.583286 #2875310] INFO -- : [662/884] 2916632=json_parser_test I, [2024-04-30T16:13:10.603065 #2875310] INFO -- : [663/884] 2916634=memsize_test I, [2024-04-30T16:13:10.642662 #2875310] INFO -- : [664/884] 2916634=test_cparser I, [2024-04-30T16:13:11.120184 #2875310] INFO -- : [665/884] 2916632=test_pkg_config I, [2024-04-30T16:13:11.144536 #2875310] INFO -- : [666/884] 2916632=fuzzer_test I, [2024-04-30T16:13:11.202568 #2875310] INFO -- : [667/884] 2916632=test_rdoc_markup_include I, [2024-04-30T16:13:11.236595 #2875310] INFO -- : [668/884] 2916632=test_sexp I, [2024-04-30T16:13:11.417533 #2875310] INFO -- : [669/884] 2916632=test_variable I, [2024-04-30T16:13:12.171272 #2875310] INFO -- : [670/884] 2916632=test_struct I, [2024-04-30T16:13:12.200050 #2875310] INFO -- : [671/884] 2916632=magic_comment_test I, [2024-04-30T16:13:12.255293 #2875310] INFO -- : [672/884] 2916632=test_rdoc_markup_to_html_snippet I, [2024-04-30T16:13:12.745005 #2875310] INFO -- : [673/884] 2916632=test_dryrun I, [2024-04-30T16:13:12.945712 #2875310] INFO -- : [674/884] 2916632=test_integer I, [2024-04-30T16:13:13.451059 #2875310] INFO -- : [675/884] 2916632=desugar_compiler_test I, [2024-04-30T16:13:13.494107 #2875310] INFO -- : [676/884] 2916632=test_env I, [2024-04-30T16:13:17.524714 #2875310] INFO -- : [677/884] 2916634=test_rdoc_attr I, [2024-04-30T16:13:17.808254 #2875310] INFO -- : [678/884] 2916634=test_gem_commands_setup_command I, [2024-04-30T16:13:18.736733 #2875310] INFO -- : [679/884] 2916635=test_call I, [2024-04-30T16:13:19.772839 #2875310] INFO -- : [680/884] 2916635=test_https_proxy I, [2024-04-30T16:13:20.018554 #2875310] INFO -- : [681/884] 2916635=test_rubygems I, [2024-04-30T16:13:21.119665 #2875310] INFO -- : [682/884] 2916635=test_super I, [2024-04-30T16:13:21.808914 #2875310] INFO -- : [683/884] 2916634=test_rubyoptions I, [2024-04-30T16:13:26.497404 #2875310] INFO -- : [684/884] 2916635=test_cgi_modruby I, [2024-04-30T16:13:26.560266 #2875310] INFO -- : [685/884] 2916635=test_integer I, [2024-04-30T16:13:34.116854 #2875310] INFO -- : [686/884] 2916632=test_object_references I, [2024-04-30T16:13:34.624963 #2875310] INFO -- : [687/884] 2916632=test_usrmarshal I, [2024-04-30T16:13:36.176743 #2875310] INFO -- : [688/884] 2916632=test_gem_resolver_git_specification I, [2024-04-30T16:13:37.351853 #2875310] INFO -- : [689/884] 2916632=test_stat I, [2024-04-30T16:13:37.460392 #2875310] INFO -- : [690/884] 2916632=test_gem_request_set_lockfile_tokenizer I, [2024-04-30T16:13:38.439481 #2875310] INFO -- : [691/884] 2916632=test_have_func I, [2024-04-30T16:13:42.829652 #2875310] INFO -- : [692/884] 2916633=test_nextafter I, [2024-04-30T16:13:44.836320 #2875310] INFO -- : [693/884] 2916633=test_capacity I, [2024-04-30T16:13:44.928575 #2875310] INFO -- : [694/884] 2916633=test_my_integer I, [2024-04-30T16:13:45.038144 #2875310] INFO -- : [695/884] 2916633=json_ext_parser_test I, [2024-04-30T16:13:45.310343 #2875310] INFO -- : [696/884] 2916633=test_thread I, [2024-04-30T16:13:51.248954 #2875310] INFO -- : [697/884] 2916635=test_debugger_integration I, [2024-04-30T16:13:51.425691 #2875310] INFO -- : [698/884] 2916635=test_rendering I, [2024-04-30T16:13:51.444624 #2875310] INFO -- : [699/884] 2916635=test_ractor I, [2024-04-30T16:13:57.540854 #2875310] INFO -- : [700/884] 2916635=test_ssl I, [2024-04-30T16:14:01.431907 #2875310] INFO -- : [701/884] 2916634=test_rb_str_dup I, [2024-04-30T16:14:01.478527 #2875310] INFO -- : [702/884] 2916634=test_reline_key I, [2024-04-30T16:14:01.533656 #2875310] INFO -- : [703/884] 2916634=test_ancdata I, [2024-04-30T16:14:01.578508 #2875310] INFO -- : [704/884] 2916634=test_singleton_function I, [2024-04-30T16:14:01.626194 #2875310] INFO -- : [705/884] 2916634=test_alias I, [2024-04-30T16:14:01.908036 #2875310] INFO -- : [706/884] 2916635=test_timeout I, [2024-04-30T16:14:03.891534 #2875310] INFO -- : [707/884] 2916634=test_marshal I, [2024-04-30T16:14:04.703311 #2875310] INFO -- : [708/884] 2916635=test_unicode_normalize I, [2024-04-30T16:14:10.672062 #2875310] INFO -- : [709/884] 2916633=test_weakref I, [2024-04-30T16:14:13.270387 #2875310] INFO -- : [710/884] 2916634=test_nonblock I, [2024-04-30T16:14:13.446850 #2875310] INFO -- : [711/884] 2916634=test_parser I, [2024-04-30T16:14:13.709868 #2875310] INFO -- : [712/884] 2916634=test_cgi_core I, [2024-04-30T16:14:13.721633 #2875310] INFO -- : [713/884] 2916633=test_gem_source_lock I, [2024-04-30T16:14:13.845626 #2875310] INFO -- : [714/884] 2916634=test_gem I, [2024-04-30T16:14:14.714479 #2875310] INFO -- : [715/884] 2916633=test_ractor I, [2024-04-30T16:14:14.752792 #2875310] INFO -- : [716/884] 2916633=test_gem_commands_open_command I, [2024-04-30T16:14:16.247126 #2875310] INFO -- : [717/884] 2916633=test_dns I, [2024-04-30T16:14:17.460294 #2875310] INFO -- : [718/884] 2916633=parse_stream_test I, [2024-04-30T16:14:17.564834 #2875310] INFO -- : [719/884] 2916633=test_merge_keys I, [2024-04-30T16:14:17.688985 #2875310] INFO -- : [720/884] 2916633=test_rdoc_extend I, [2024-04-30T16:14:18.011681 #2875310] INFO -- : [721/884] 2916633=test_win32ole_variant I, [2024-04-30T16:14:18.307008 #2875310] INFO -- : [722/884] 2916633=test_ipaddr I, [2024-04-30T16:14:18.607971 #2875310] INFO -- : [723/884] 2916633=test_history I, [2024-04-30T16:14:18.730124 #2875310] INFO -- : [724/884] 2916633=test_mixed_unicode_escapes I, [2024-04-30T16:14:18.738262 #2875310] INFO -- : [725/884] 2916633=test_rdoc_markup_to_ansi I, [2024-04-30T16:14:19.379092 #2875310] INFO -- : [726/884] 2916633=test_gem_resolver_api_specification I, [2024-04-30T16:14:19.971718 #2875310] INFO -- : [727/884] 2916633=ractor_test I, [2024-04-30T16:14:20.909801 #2875310] INFO -- : [728/884] 2916633=test_trace I, [2024-04-30T16:14:21.046504 #2875310] INFO -- : [729/884] 2916633=test_rdoc_generator_json_index I, [2024-04-30T16:14:21.307425 #2875310] INFO -- : [730/884] 2916633=test_time_tz I, [2024-04-30T16:14:22.170561 #2875310] INFO -- : [731/884] 2916633=test_win32ole_event I, [2024-04-30T16:14:22.259044 #2875310] INFO -- : [732/884] 2916633=test_bignum I, [2024-04-30T16:14:23.771578 #2875310] INFO -- : [733/884] 2916633=test_rdoc_class_module I, [2024-04-30T16:14:30.574659 #2875310] INFO -- : [734/884] 2916633=test_gem_ci_detector I, [2024-04-30T16:14:30.591170 #2875310] INFO -- : [735/884] 2916633=test_win32ole_variable I, [2024-04-30T16:14:30.626031 #2875310] INFO -- : [736/884] 2916633=test_arity I, [2024-04-30T16:14:30.680757 #2875310] INFO -- : [737/884] 2916633=test_stringio I, [2024-04-30T16:14:31.360937 #2875310] INFO -- : [738/884] 2916634=test_io_wait_uncommon I, [2024-04-30T16:14:31.412311 #2875310] INFO -- : [739/884] 2916634=test_gem_specification I, [2024-04-30T16:14:31.509374 #2875310] INFO -- : [740/884] 2916633=test_enum I, [2024-04-30T16:14:35.130243 #2875310] INFO -- : [741/884] 2916632=test_threadgroup I, [2024-04-30T16:14:36.171459 #2875310] INFO -- : [742/884] 2916632=test_have_macro I, [2024-04-30T16:14:37.385595 #2875310] INFO -- : [743/884] 2916633=test_resolve_symbol I, [2024-04-30T16:14:37.861959 #2875310] INFO -- : [744/884] 2916633=test_complex2 I, [2024-04-30T16:14:37.967106 #2875310] INFO -- : [745/884] 2916633=test_gem_package I, [2024-04-30T16:14:38.991842 #2875310] INFO -- : [746/884] 2916632=test_function_entry I, [2024-04-30T16:14:39.011617 #2875310] INFO -- : [747/884] 2916632=test_pkcs7 I, [2024-04-30T16:14:40.580931 #2875310] INFO -- : [748/884] 2916632=test_gem_resolver_requirement_list I, [2024-04-30T16:14:40.677969 #2875310] INFO -- : [749/884] 2916632=test_arith_seq_beg_len_step I, [2024-04-30T16:14:41.132455 #2875310] INFO -- : [750/884] 2916632=test_unix I, [2024-04-30T16:14:41.320231 #2875310] INFO -- : [751/884] 2916632=test_lazy_enumerator I, [2024-04-30T16:14:43.053066 #2875310] INFO -- : [752/884] 2916633=test_enc_associate I, [2024-04-30T16:14:44.196667 #2875310] INFO -- : [753/884] 2916632=ruby_api_test I, [2024-04-30T16:14:45.455079 #2875310] INFO -- : [754/884] 2916632=test_find_executable I, [2024-04-30T16:14:45.499785 #2875310] INFO -- : [755/884] 2916632=test_coder I, [2024-04-30T16:14:45.608043 #2875310] INFO -- : [756/884] 2916632=test_symbol I, [2024-04-30T16:14:46.469291 #2875310] INFO -- : [757/884] 2916635=test_gem_commands_pristine_command I, [2024-04-30T16:14:46.982585 #2875310] INFO -- : [758/884] 2916633=test_context I, [2024-04-30T16:14:47.709370 #2875310] INFO -- : [759/884] 2916633=test_nofree I, [2024-04-30T16:14:47.764892 #2875310] INFO -- : [760/884] 2916633=test_numeric I, [2024-04-30T16:14:47.836204 #2875310] INFO -- : [761/884] 2916633=test_member I, [2024-04-30T16:14:47.891086 #2875310] INFO -- : [762/884] 2916633=test_cgi_multipart I, [2024-04-30T16:14:48.328712 #2875310] INFO -- : [763/884] 2916633=test_word I, [2024-04-30T16:14:48.501074 #2875310] INFO -- : [764/884] 2916633=test_gem_commands_cleanup_command I, [2024-04-30T16:14:52.376618 #2875310] INFO -- : [765/884] 2916633=test_ractor_compatibility I, [2024-04-30T16:14:55.177167 #2875310] INFO -- : [766/884] 2916634=test_dir I, [2024-04-30T16:14:55.640028 #2875310] INFO -- : [767/884] 2916633=format_errors_test I, [2024-04-30T16:14:55.665798 #2875310] INFO -- : [768/884] 2916633=test_gem_console_ui I, [2024-04-30T16:14:55.743077 #2875310] INFO -- : [769/884] 2916633=test_date_ractor I, [2024-04-30T16:14:55.947758 #2875310] INFO -- : [770/884] 2916635=test_autoconf I, [2024-04-30T16:14:56.001056 #2875310] INFO -- : [771/884] 2916635=test_eval I, [2024-04-30T16:14:56.043586 #2875310] INFO -- : [772/884] 2916635=test_coderange I, [2024-04-30T16:14:56.122603 #2875310] INFO -- : [773/884] 2916635=location_test I, [2024-04-30T16:14:56.652410 #2875310] INFO -- : [774/884] 2916635=test_symbol I, [2024-04-30T16:14:56.720595 #2875310] INFO -- : [775/884] 2916635=test_mailto I, [2024-04-30T16:14:56.756666 #2875310] INFO -- : [776/884] 2916635=test_rdoc_generator_darkfish I, [2024-04-30T16:14:57.350618 #2875310] INFO -- : [777/884] 2916634=test_rdoc_comment I, [2024-04-30T16:14:57.599353 #2875310] INFO -- : [778/884] 2916634=test_resize I, [2024-04-30T16:14:57.805358 #2875310] INFO -- : [779/884] 2916634=test_error_highlight I, [2024-04-30T16:14:57.834766 #2875310] INFO -- : [780/884] 2916633=test_http_request I, [2024-04-30T16:14:58.028458 #2875310] INFO -- : [781/884] 2916633=json_generic_object_test I, [2024-04-30T16:14:58.043796 #2875310] INFO -- : [782/884] 2916633=test_gem_source_fetch_problem I, [2024-04-30T16:14:58.267824 #2875310] INFO -- : [783/884] 2916633=test_file_exhaustive I, [2024-04-30T16:14:59.307537 #2875310] INFO -- : [784/884] 2916635=test_gem_update_suggestion I, [2024-04-30T16:14:59.898781 #2875310] INFO -- : [785/884] 2916635=test_files_test I, [2024-04-30T16:14:59.933789 #2875310] INFO -- : [786/884] 2916635=test_logger I, [2024-04-30T16:15:00.149439 #2875310] INFO -- : [787/884] 2916635=test_import I, [2024-04-30T16:15:03.275430 #2875310] INFO -- : [788/884] 2916634=test_gem_resolver_lock_set I, [2024-04-30T16:15:03.595646 #2875310] INFO -- : [789/884] 2916634=test_not I, [2024-04-30T16:15:03.647299 #2875310] INFO -- : [790/884] 2916634=test_rdoc_parser_markdown I, [2024-04-30T16:15:03.743219 #2875310] INFO -- : [791/884] 2916634=test_pkey_rsa I, [2024-04-30T16:15:06.426975 #2875310] INFO -- : [792/884] 2916634=test_weakkeymap I, [2024-04-30T16:15:06.909723 #2875310] INFO -- : [793/884] 2916632=test_gem_commands_push_command I, [2024-04-30T16:15:09.609984 #2875310] INFO -- : [794/884] 2916634=test_numhash I, [2024-04-30T16:15:09.614753 #2875310] INFO -- : [795/884] 2916632=test_date_strptime I, [2024-04-30T16:15:09.657361 #2875310] INFO -- : [796/884] 2916634=test_gem_package_task I, [2024-04-30T16:15:09.667985 #2875310] INFO -- : [797/884] 2916634=test_placearg I, [2024-04-30T16:15:10.114946 #2875310] INFO -- : [798/884] 2916634=test_rdoc_markup_hard_break I, [2024-04-30T16:15:10.177770 #2875310] INFO -- : [799/884] 2916634=test_gem_platform I, [2024-04-30T16:15:10.650540 #2875310] INFO -- : [800/884] 2916632=test_delete I, [2024-04-30T16:15:10.706537 #2875310] INFO -- : [801/884] 2916632=test_win32ole_method I, [2024-04-30T16:15:10.746033 #2875310] INFO -- : [802/884] 2916632=test_fd_setsize I, [2024-04-30T16:15:10.756204 #2875310] INFO -- : [803/884] 2916632=test_continuation I, [2024-04-30T16:15:10.811243 #2875310] INFO -- : [804/884] 2916632=test_class_name_check I, [2024-04-30T16:15:11.425738 #2875310] INFO -- : [805/884] 2916632=test_keyword I, [2024-04-30T16:15:11.532229 #2875310] INFO -- : [806/884] 2916634=test_change_word I, [2024-04-30T16:15:11.567080 #2875310] INFO -- : [807/884] 2916634=compiler_test I, [2024-04-30T16:15:11.629982 #2875310] INFO -- : [808/884] 2916634=test_flip I, [2024-04-30T16:15:11.659728 #2875310] INFO -- : [809/884] 2916635=test_timeout I, [2024-04-30T16:15:11.718383 #2875310] INFO -- : [810/884] 2916635=test_ossl I, [2024-04-30T16:15:11.810146 #2875310] INFO -- : [811/884] 2916634=test_normalize I, [2024-04-30T16:15:11.826769 #2875310] INFO -- : [812/884] 2916634=test_date_arith I, [2024-04-30T16:15:11.928649 #2875310] INFO -- : [813/884] 2916634=test_ruby_lex I, [2024-04-30T16:15:13.147338 #2875310] INFO -- : [814/884] 2916634=test_object I, [2024-04-30T16:15:16.000001 #2875310] INFO -- : [815/884] 2916634=test_gem_local_remote_options I, [2024-04-30T16:15:16.119910 #2875310] INFO -- : [816/884] 2916632=test_sleep I, [2024-04-30T16:15:16.821385 #2875310] INFO -- : [817/884] 2916634=test_ractor I, [2024-04-30T16:15:17.243324 #2875310] INFO -- : [818/884] 2916634=test_type I, [2024-04-30T16:15:17.381821 #2875310] INFO -- : [819/884] 2916634=test_pointer I, [2024-04-30T16:15:21.164697 #2875310] INFO -- : [820/884] 2916632=test_func I, [2024-04-30T16:15:23.829888 #2875310] INFO -- : [821/884] 2916634=test_big5 I, [2024-04-30T16:15:23.889674 #2875310] INFO -- : [822/884] 2916634=test_rdoc_rd_block_parser I, [2024-04-30T16:15:24.368023 #2875310] INFO -- : [823/884] 2916634=test_signedness I, [2024-04-30T16:15:29.360720 #2875310] INFO -- : [824/884] 2916633=test_tsort I, [2024-04-30T16:15:29.417474 #2875310] INFO -- : [825/884] 2916633=test_cgi_header I, [2024-04-30T16:15:29.470068 #2875310] INFO -- : [826/884] 2916633=heredoc_dedent_test I, [2024-04-30T16:15:29.546391 #2875310] INFO -- : [827/884] 2916633=test_object I, [2024-04-30T16:15:29.587089 #2875310] INFO -- : [828/884] 2916633=version_test I, [2024-04-30T16:15:29.688404 #2875310] INFO -- : [829/884] 2916633=test_key_actor_emacs I, [2024-04-30T16:15:30.805602 #2875310] INFO -- : [830/884] 2916633=test_gem_gemcutter_utilities I, [2024-04-30T16:15:31.227516 #2875310] INFO -- : [831/884] 2916635=test_basicinstructions I, [2024-04-30T16:15:31.822787 #2875310] INFO -- : [832/884] 2916635=test_gem_command_manager I, [2024-04-30T16:15:32.334841 #2875310] INFO -- : [833/884] 2916633=test_arithmetic_sequence I, [2024-04-30T16:15:32.472013 #2875310] INFO -- : [834/884] 2916633=test_gem_uri_formatter I, [2024-04-30T16:15:32.601551 #2875310] INFO -- : [835/884] 2916633=test_helper I, [2024-04-30T16:15:32.627653 #2875310] INFO -- : [836/884] 2916633=test_erb_command I, [2024-04-30T16:15:32.882173 #2875310] INFO -- : [837/884] 2916633=test_encoding I, [2024-04-30T16:15:33.350984 #2875310] INFO -- : [838/884] 2916635=test_project_sanity I, [2024-04-30T16:15:33.954293 #2875310] INFO -- : [839/884] 2916635=test_range I, [2024-04-30T16:15:34.609279 #2875310] INFO -- : [840/884] 2916633=test_constant I, [2024-04-30T16:15:40.771743 #2875310] INFO -- : [841/884] 2916635=test_pty I, [2024-04-30T16:15:42.055114 #2875310] INFO -- : [842/884] 2916632=test_dup I, [2024-04-30T16:15:43.264925 #2875310] INFO -- : [843/884] 2916634=command_line_test I, [2024-04-30T16:15:43.319090 #2875310] INFO -- : [844/884] 2916634=test_rdoc_ri_paths I, [2024-04-30T16:15:43.381557 #2875310] INFO -- : [845/884] 2916635=test_ts I, [2024-04-30T16:15:43.431788 #2875310] INFO -- : [846/884] 2916632=test_ensured I, [2024-04-30T16:15:43.514045 #2875310] INFO -- : [847/884] 2916634=library_symbols_test I, [2024-04-30T16:15:43.538963 #2875310] INFO -- : [848/884] 2916634=test_locale I, [2024-04-30T16:15:43.737583 #2875310] INFO -- : [849/884] 2916634=test_addr I, [2024-04-30T16:15:43.822628 #2875310] INFO -- : [850/884] 2916634=errors_test I, [2024-04-30T16:15:43.914055 #2875310] INFO -- : [851/884] 2916632=test_gem_commands_check_command I, [2024-04-30T16:15:44.198303 #2875310] INFO -- : [852/884] 2916632=test_regexp I, [2024-04-30T16:15:44.388374 #2875310] INFO -- : [853/884] 2916634=test_vm_dump I, [2024-04-30T16:15:44.417477 #2875310] INFO -- : [854/884] 2916634=test_rdoc_markup_document I, [2024-04-30T16:15:44.599758 #2875310] INFO -- : [855/884] 2916634=test_integer_comb I, [2024-04-30T16:15:48.862179 #2875310] INFO -- : [856/884] 2916635=test_tmpdir I, [2024-04-30T16:15:50.097547 #2875310] INFO -- : [857/884] 2916635=test_data_error I, [2024-04-30T16:15:50.155729 #2875310] INFO -- : [858/884] 2916635=bom_test I, [2024-04-30T16:15:50.257906 #2875310] INFO -- : [859/884] 2916635=test_file I, [2024-04-30T16:15:52.799195 #2875310] INFO -- : [860/884] 2916633=test_force_exit I, [2024-04-30T16:15:52.863077 #2875310] INFO -- : [861/884] 2916633=test_ostruct I, [2024-04-30T16:15:54.113668 #2875310] INFO -- : [862/884] 2916633=unescape_test I, [2024-04-30T16:15:56.891000 #2875310] INFO -- : [863/884] 2916635=test_udp I, [2024-04-30T16:15:56.937423 #2875310] INFO -- : [864/884] 2916635=static_inspect_test I, [2024-04-30T16:15:57.152018 #2875310] INFO -- : [865/884] 2916635=test_rdoc_code_object I, [2024-04-30T16:16:00.191398 #2875310] INFO -- : [866/884] 2916635=test_x509store I, [2024-04-30T16:16:03.284438 #2875310] INFO -- : [867/884] 2916635=test_update I, [2024-04-30T16:16:03.374550 #2875310] INFO -- : [868/884] 2916635=test_fips I, [2024-04-30T16:16:06.181639 #2875310] INFO -- : [869/884] 2916634=test_x509name I, [2024-04-30T16:16:06.346157 #2875310] INFO -- : [870/884] 2916634=test_gem_request_set_gem_dependency_api I, [2024-04-30T16:16:06.407822 #2875310] INFO -- : [871/884] 2916635=test_ast I, [2024-04-30T16:16:10.010946 #2875310] INFO -- : [872/884] 2916634=test_lambda I, [2024-04-30T16:16:10.510506 #2875310] INFO -- : [873/884] 2916633=test_random_formatter I, [2024-04-30T16:16:10.522724 #2875310] INFO -- : [874/884] 2916634=test_helper I, [2024-04-30T16:16:10.525601 #2875310] INFO -- : [875/884] 2916634=test_jaro_winkler I, [2024-04-30T16:16:10.553942 #2875310] INFO -- : [876/884] 2916634=test_webauthn_listener I, [2024-04-30T16:16:10.645548 #2875310] INFO -- : [877/884] 2916633=test_config I, [2024-04-30T16:16:11.061346 #2875310] INFO -- : Leaked file descriptor: WebauthnListenerTest#test_wait_for_otp_code_options_request: 11 : # I, [2024-04-30T16:16:11.130063 #2875310] INFO -- : COMMAND PID USER FD TYPE DEVICE SIZE/OFF NODE NAME I, [2024-04-30T16:16:11.130299 #2875310] INFO -- : ruby 2916634 sipeed 11u IPv4 1525303 0t0 TCP localhost:42005->localhost:54292 (CLOSE_WAIT) I, [2024-04-30T16:16:11.385181 #2875310] INFO -- : Closed file descriptor: WebauthnListenerTest#test_wait_for_otp_code_get_request: 11 I, [2024-04-30T16:16:11.666080 #2875310] INFO -- : [878/884] 2916634=test_gem_resolver_vendor_set I, [2024-04-30T16:16:11.984844 #2875310] INFO -- : [879/884] 2916634=test_enumerable I, [2024-04-30T16:16:12.120145 #2875310] INFO -- : [880/884] 2916634=test_gem_safe_marshal I, [2024-04-30T16:16:14.301546 #2875310] INFO -- : [881/884] 2916633=test_gem_resolver_api_set I, [2024-04-30T16:16:14.903671 #2875310] INFO -- : [882/884] 2916633=test_transcode I, [2024-04-30T16:16:16.479348 #2875310] INFO -- : [883/884] 2916633=test_eval I, [2024-04-30T16:16:18.395955 #2875310] INFO -- : [884/884] 2916633=json_generator_test I, [2024-04-30T16:21:24.944874 #2875310] INFO -- : Finished tests in 1011.674337s, 25.9827 tests/s, 9232.8644 assertions/s. E, [2024-04-30T16:21:24.945938 #2875310] ERROR -- : Children under /tmp/rubytest.uf9gt8: E, [2024-04-30T16:21:24.946505 #2875310] ERROR -- : * drwx------ 4 80 2024-04-30 16:12:17 +0000 gem_rebuild20240430-2916634-hviul3/ E, [2024-04-30T16:21:24.946765 #2875310] ERROR -- : * drwxr-xr-x 2 60 2024-04-30 16:12:18 +0000 new/ E, [2024-04-30T16:21:24.947006 #2875310] ERROR -- : * -rw-r--r-- 1 4096 2024-04-30 16:12:18 +0000 rebuild_test_gem-1.0.0.gem E, [2024-04-30T16:21:24.947260 #2875310] ERROR -- : * drwxr-xr-x 2 60 2024-04-30 16:12:17 +0000 old/ E, [2024-04-30T16:21:24.947553 #2875310] ERROR -- : * -rw-r--r-- 1 4096 2024-04-30 16:12:17 +0000 rebuild_test_gem-1.0.0.gem I, [2024-04-30T16:21:24.954250 #2875310] INFO -- : 26286 tests, 9340652 assertions, 0 failures, 0 errors, 308 skips I, [2024-04-30T16:21:24.954456 #2875310] INFO -- : I, [2024-04-30T16:21:24.954556 #2875310] INFO -- : ruby -v: ruby 3.4.0dev (2024-04-30T15:34:49Z master d7ba0fec49) [riscv64-linux] I, [2024-04-30T16:21:24.964709 #2875310] INFO -- : $$$[end] "make yes-test-all TESTOPTS='--stderr-on-failure' TESTS='-j4'" exit with 0. I, [2024-04-30T16:21:24.965445 #2875310] INFO -- : $$$[beg] make yes-test-rubyspec MSPECOPT='--error-output stderr --debug -j' TESTS='-j4' I, [2024-04-30T16:21:25.821968 #2875310] INFO -- : BASERUBY = /usr/bin/ruby --disable=gems I, [2024-04-30T16:21:25.822178 #2875310] INFO -- : CC = gcc I, [2024-04-30T16:21:25.822378 #2875310] INFO -- : LD = ld I, [2024-04-30T16:21:25.822525 #2875310] INFO -- : LDSHARED = gcc -shared I, [2024-04-30T16:21:25.822659 #2875310] INFO -- : CFLAGS = -O3 -fno-fast-math -ggdb3 -Wall -Wextra -Wdeprecated-declarations -Wdiv-by-zero -Wduplicated-cond -Wimplicit-function-declaration -Wimplicit-int -Wpointer-arith -Wwrite-strings -Wold-style-definition -Wimplicit-fallthrough=0 -Wmissing-noreturn -Wno-cast-function-type -Wno-constant-logical-operand -Wno-long-long -Wno-missing-field-initializers -Wno-overlength-strings -Wno-packed-bitfield-compat -Wno-parentheses-equality -Wno-self-assign -Wno-tautological-compare -Wno-unused-parameter -Wno-unused-value -Wsuggest-attribute=format -Wsuggest-attribute=noreturn -Wunused-variable -Wmisleading-indentation -Wundef -fPIC I, [2024-04-30T16:21:25.822855 #2875310] INFO -- : XCFLAGS = -U_FORTIFY_SOURCE -D_FORTIFY_SOURCE=2 -fstack-protector-strong -fno-strict-overflow -fvisibility=hidden -fexcess-precision=standard -DRUBY_EXPORT -I. -I.ext/include/riscv64-linux -I/tmp/ruby/src/trunk/include -I/tmp/ruby/src/trunk -I/tmp/ruby/src/trunk/prism -I/tmp/ruby/src/trunk/enc/unicode/15.0.0 I, [2024-04-30T16:21:25.823038 #2875310] INFO -- : CPPFLAGS = I, [2024-04-30T16:21:25.823172 #2875310] INFO -- : DLDFLAGS = -Wl,--compress-debug-sections=zlib -Wl,-soname,libruby.so.3.4 -fstack-protector-strong I, [2024-04-30T16:21:25.823410 #2875310] INFO -- : SOLIBS = -lz -lrt -lrt -lgmp -ldl -lcrypt -lm -lpthread I, [2024-04-30T16:21:25.823600 #2875310] INFO -- : LANG = I, [2024-04-30T16:21:25.823783 #2875310] INFO -- : LC_ALL = I, [2024-04-30T16:21:25.823907 #2875310] INFO -- : LC_CTYPE = I, [2024-04-30T16:21:25.824012 #2875310] INFO -- : MFLAGS = I, [2024-04-30T16:21:25.824162 #2875310] INFO -- : RUSTC = rustc I, [2024-04-30T16:21:25.824289 #2875310] INFO -- : YJIT_RUSTC_ARGS = --crate-name=yjit --crate-type=staticlib --edition=2021 -g -C lto=thin -C opt-level=3 -C overflow-checks=on '--out-dir=/tmp/ruby/build/trunk/yjit/target/release/' /tmp/ruby/src/trunk/yjit/src/lib.rs I, [2024-04-30T16:21:25.825834 #2875310] INFO -- : gcc (Debian 13.2.0-4revyos1) 13.2.0 I, [2024-04-30T16:21:25.826073 #2875310] INFO -- : Copyright (C) 2023 Free Software Foundation, Inc. I, [2024-04-30T16:21:25.826200 #2875310] INFO -- : This is free software; see the source for copying conditions. There is NO I, [2024-04-30T16:21:25.826313 #2875310] INFO -- : warranty; not even for MERCHANTABILITY or FITNESS FOR A PARTICULAR PURPOSE. I, [2024-04-30T16:21:25.826427 #2875310] INFO -- : I, [2024-04-30T16:21:25.844959 #2875310] INFO -- : generating enc.mk I, [2024-04-30T16:21:27.298605 #2875310] INFO -- : making enc I, [2024-04-30T16:21:27.471587 #2875310] INFO -- : make[1]: Entering directory '/tmp/ruby/build/trunk' I, [2024-04-30T16:21:27.471789 #2875310] INFO -- : make[1]: Nothing to be done for 'enc'. I, [2024-04-30T16:21:27.471888 #2875310] INFO -- : make[1]: Leaving directory '/tmp/ruby/build/trunk' I, [2024-04-30T16:21:27.474457 #2875310] INFO -- : making srcs under enc I, [2024-04-30T16:21:27.769479 #2875310] INFO -- : make[1]: Entering directory '/tmp/ruby/build/trunk' I, [2024-04-30T16:21:27.769674 #2875310] INFO -- : make[1]: Nothing to be done for 'srcs'. I, [2024-04-30T16:21:27.769774 #2875310] INFO -- : make[1]: Leaving directory '/tmp/ruby/build/trunk' I, [2024-04-30T16:21:27.774691 #2875310] INFO -- : generating transdb.h I, [2024-04-30T16:21:29.070031 #2875310] INFO -- : transdb.h unchanged I, [2024-04-30T16:21:29.075691 #2875310] INFO -- : making trans I, [2024-04-30T16:21:29.424146 #2875310] INFO -- : make[1]: Entering directory '/tmp/ruby/build/trunk' I, [2024-04-30T16:21:29.424419 #2875310] INFO -- : make[1]: Nothing to be done for 'trans'. I, [2024-04-30T16:21:29.424632 #2875310] INFO -- : make[1]: Leaving directory '/tmp/ruby/build/trunk' I, [2024-04-30T16:21:29.427727 #2875310] INFO -- : making encs I, [2024-04-30T16:21:29.818327 #2875310] INFO -- : make[1]: Entering directory '/tmp/ruby/build/trunk' I, [2024-04-30T16:21:29.818526 #2875310] INFO -- : make[1]: Nothing to be done for 'encs'. I, [2024-04-30T16:21:29.818623 #2875310] INFO -- : make[1]: Leaving directory '/tmp/ruby/build/trunk' I, [2024-04-30T16:21:29.831342 #2875310] INFO -- : generating makefiles ext/configure-ext.mk I, [2024-04-30T16:21:30.026910 #2875310] INFO -- : ext/configure-ext.mk updated I, [2024-04-30T16:21:30.041741 #2875310] INFO -- : make[1]: Entering directory '/tmp/ruby/build/trunk' I, [2024-04-30T16:21:42.194856 #2875310] INFO -- : make[1]: Leaving directory '/tmp/ruby/build/trunk' I, [2024-04-30T16:21:42.196947 #2875310] INFO -- : generating makefile exts.mk I, [2024-04-30T16:21:42.543130 #2875310] INFO -- : exts.mk unchanged I, [2024-04-30T16:21:42.582246 #2875310] INFO -- : make[1]: Entering directory '/tmp/ruby/build/trunk' I, [2024-04-30T16:21:44.789658 #2875310] INFO -- : make[2]: Entering directory '/tmp/ruby/build/trunk/ext/coverage' I, [2024-04-30T16:21:44.815790 #2875310] INFO -- : make[2]: Leaving directory '/tmp/ruby/build/trunk/ext/coverage' I, [2024-04-30T16:21:44.864910 #2875310] INFO -- : make[2]: Entering directory '/tmp/ruby/build/trunk/ext/date' I, [2024-04-30T16:21:44.889547 #2875310] INFO -- : make[2]: Leaving directory '/tmp/ruby/build/trunk/ext/date' I, [2024-04-30T16:21:44.914182 #2875310] INFO -- : make[2]: Entering directory '/tmp/ruby/build/trunk/ext/digest' I, [2024-04-30T16:21:44.971244 #2875310] INFO -- : make[2]: Leaving directory '/tmp/ruby/build/trunk/ext/digest' I, [2024-04-30T16:21:45.134323 #2875310] INFO -- : make[2]: Entering directory '/tmp/ruby/build/trunk/ext/digest/sha2' I, [2024-04-30T16:21:45.161193 #2875310] INFO -- : make[2]: Leaving directory '/tmp/ruby/build/trunk/ext/digest/sha2' I, [2024-04-30T16:21:45.295228 #2875310] INFO -- : make[2]: Entering directory '/tmp/ruby/build/trunk/ext/fiddle' I, [2024-04-30T16:21:45.370834 #2875310] INFO -- : make[2]: Leaving directory '/tmp/ruby/build/trunk/ext/fiddle' I, [2024-04-30T16:21:45.398230 #2875310] INFO -- : make[2]: Entering directory '/tmp/ruby/build/trunk/ext/io/console' I, [2024-04-30T16:21:45.419790 #2875310] INFO -- : make[2]: Leaving directory '/tmp/ruby/build/trunk/ext/io/console' I, [2024-04-30T16:21:45.494437 #2875310] INFO -- : make[2]: Entering directory '/tmp/ruby/build/trunk/ext/json' I, [2024-04-30T16:21:45.565727 #2875310] INFO -- : make[2]: Leaving directory '/tmp/ruby/build/trunk/ext/json' I, [2024-04-30T16:21:45.659519 #2875310] INFO -- : make[2]: Entering directory '/tmp/ruby/build/trunk/ext/monitor' I, [2024-04-30T16:21:45.678758 #2875310] INFO -- : make[2]: Leaving directory '/tmp/ruby/build/trunk/ext/monitor' I, [2024-04-30T16:21:45.732666 #2875310] INFO -- : make[2]: Entering directory '/tmp/ruby/build/trunk/ext/objspace' I, [2024-04-30T16:21:45.766891 #2875310] INFO -- : make[2]: Leaving directory '/tmp/ruby/build/trunk/ext/objspace' I, [2024-04-30T16:21:45.886201 #2875310] INFO -- : make[2]: Entering directory '/tmp/ruby/build/trunk/ext/openssl' I, [2024-04-30T16:21:46.014702 #2875310] INFO -- : make[2]: Leaving directory '/tmp/ruby/build/trunk/ext/openssl' I, [2024-04-30T16:21:46.042050 #2875310] INFO -- : make[2]: Entering directory '/tmp/ruby/build/trunk/ext/pathname' I, [2024-04-30T16:21:46.061743 #2875310] INFO -- : make[2]: Leaving directory '/tmp/ruby/build/trunk/ext/pathname' I, [2024-04-30T16:21:46.115012 #2875310] INFO -- : make[2]: Entering directory '/tmp/ruby/build/trunk/ext/psych' I, [2024-04-30T16:21:46.272297 #2875310] INFO -- : make[2]: Leaving directory '/tmp/ruby/build/trunk/ext/psych' I, [2024-04-30T16:21:46.305424 #2875310] INFO -- : make[2]: Entering directory '/tmp/ruby/build/trunk/ext/pty' I, [2024-04-30T16:21:46.324078 #2875310] INFO -- : make[2]: Leaving directory '/tmp/ruby/build/trunk/ext/pty' I, [2024-04-30T16:21:46.419675 #2875310] INFO -- : make[2]: Entering directory '/tmp/ruby/build/trunk/ext/ripper' I, [2024-04-30T16:21:46.474825 #2875310] INFO -- : make[2]: Leaving directory '/tmp/ruby/build/trunk/ext/ripper' I, [2024-04-30T16:21:46.486334 #2875310] INFO -- : make[2]: Entering directory '/tmp/ruby/build/trunk/ext/rubyvm' I, [2024-04-30T16:21:46.501685 #2875310] INFO -- : make[2]: Leaving directory '/tmp/ruby/build/trunk/ext/rubyvm' I, [2024-04-30T16:21:46.589754 #2875310] INFO -- : make[2]: Entering directory '/tmp/ruby/build/trunk/ext/socket' I, [2024-04-30T16:21:46.648062 #2875310] INFO -- : make[2]: Leaving directory '/tmp/ruby/build/trunk/ext/socket' I, [2024-04-30T16:21:46.766206 #2875310] INFO -- : make[2]: Entering directory '/tmp/ruby/build/trunk/.bundle/gems/bigdecimal-3.1.7/ext/bigdecimal' I, [2024-04-30T16:21:46.923588 #2875310] INFO -- : make[2]: Leaving directory '/tmp/ruby/build/trunk/.bundle/gems/bigdecimal-3.1.7/ext/bigdecimal' I, [2024-04-30T16:21:46.941577 #2875310] INFO -- : make[2]: Entering directory '/tmp/ruby/build/trunk/.bundle/gems/debug-1.9.2/ext/debug' I, [2024-04-30T16:21:47.103157 #2875310] INFO -- : make[2]: Leaving directory '/tmp/ruby/build/trunk/.bundle/gems/debug-1.9.2/ext/debug' I, [2024-04-30T16:21:47.120804 #2875310] INFO -- : make[2]: Entering directory '/tmp/ruby/build/trunk/.bundle/gems/nkf-0.2.0/ext/nkf' I, [2024-04-30T16:21:47.283595 #2875310] INFO -- : make[2]: Leaving directory '/tmp/ruby/build/trunk/.bundle/gems/nkf-0.2.0/ext/nkf' I, [2024-04-30T16:21:47.300716 #2875310] INFO -- : make[2]: Entering directory '/tmp/ruby/build/trunk/.bundle/gems/racc-1.7.3/ext/racc/cparse' I, [2024-04-30T16:21:47.460234 #2875310] INFO -- : make[2]: Leaving directory '/tmp/ruby/build/trunk/.bundle/gems/racc-1.7.3/ext/racc/cparse' I, [2024-04-30T16:21:47.492281 #2875310] INFO -- : make[2]: Entering directory '/tmp/ruby/build/trunk/.bundle/gems/rbs-3.4.4/ext/rbs_extension' I, [2024-04-30T16:21:47.650050 #2875310] INFO -- : make[2]: Leaving directory '/tmp/ruby/build/trunk/.bundle/gems/rbs-3.4.4/ext/rbs_extension' I, [2024-04-30T16:21:47.667461 #2875310] INFO -- : make[2]: Entering directory '/tmp/ruby/build/trunk/.bundle/gems/syslog-0.1.2/ext/syslog' I, [2024-04-30T16:21:47.828371 #2875310] INFO -- : make[2]: Leaving directory '/tmp/ruby/build/trunk/.bundle/gems/syslog-0.1.2/ext/syslog' I, [2024-04-30T16:21:48.062991 #2875310] INFO -- : make[2]: Entering directory '/tmp/ruby/build/trunk' I, [2024-04-30T16:21:48.709450 #2875310] INFO -- : make[2]: 'ruby' is up to date. I, [2024-04-30T16:21:48.709828 #2875310] INFO -- : make[2]: Leaving directory '/tmp/ruby/build/trunk' I, [2024-04-30T16:21:48.711980 #2875310] INFO -- : make[1]: Leaving directory '/tmp/ruby/build/trunk' I, [2024-04-30T16:21:48.753895 #2875310] INFO -- : make[1]: Entering directory '/tmp/ruby/build/trunk' I, [2024-04-30T16:21:48.754091 #2875310] INFO -- : make[1]: Nothing to be done for 'note'. I, [2024-04-30T16:21:48.754180 #2875310] INFO -- : make[1]: Leaving directory '/tmp/ruby/build/trunk' E, [2024-04-30T16:21:49.293787 #2875310] ERROR -- : $ /tmp/ruby/build/trunk/miniruby -I/tmp/ruby/src/trunk/lib /tmp/ruby/src/trunk/tool/runruby.rb --archdir=/tmp/ruby/build/trunk --extout=.ext -- /tmp/ruby/src/trunk/spec/mspec/bin/mspec-run -B /tmp/ruby/src/trunk/spec/default.mspec --error-output stderr --debug -fy -o /tmp/rubytest.nn3n39/1-mspec-multi-0 E, [2024-04-30T16:21:49.295337 #2875310] ERROR -- : $ /tmp/ruby/build/trunk/miniruby -I/tmp/ruby/src/trunk/lib /tmp/ruby/src/trunk/tool/runruby.rb --archdir=/tmp/ruby/build/trunk --extout=.ext -- /tmp/ruby/src/trunk/spec/mspec/bin/mspec-run -B /tmp/ruby/src/trunk/spec/default.mspec --error-output stderr --debug -fy -o /tmp/rubytest.nn3n39/2-mspec-multi-1 E, [2024-04-30T16:21:49.296783 #2875310] ERROR -- : $ /tmp/ruby/build/trunk/miniruby -I/tmp/ruby/src/trunk/lib /tmp/ruby/src/trunk/tool/runruby.rb --archdir=/tmp/ruby/build/trunk --extout=.ext -- /tmp/ruby/src/trunk/spec/mspec/bin/mspec-run -B /tmp/ruby/src/trunk/spec/default.mspec --error-output stderr --debug -fy -o /tmp/rubytest.nn3n39/3-mspec-multi-2 E, [2024-04-30T16:21:49.298222 #2875310] ERROR -- : $ /tmp/ruby/build/trunk/miniruby -I/tmp/ruby/src/trunk/lib /tmp/ruby/src/trunk/tool/runruby.rb --archdir=/tmp/ruby/build/trunk --extout=.ext -- /tmp/ruby/src/trunk/spec/mspec/bin/mspec-run -B /tmp/ruby/src/trunk/spec/default.mspec --error-output stderr --debug -fy -o /tmp/rubytest.nn3n39/4-mspec-multi-3 I, [2024-04-30T16:21:50.240376 #2875310] INFO -- : ruby 3.4.0dev (2024-04-30T15:34:49Z master d7ba0fec49) [riscv64-linux] I, [2024-04-30T16:22:21.031297 #2875310] INFO -- : 0 ......................................................................... I, [2024-04-30T16:22:32.307544 #2875310] INFO -- : 73 ......................................................................... I, [2024-04-30T16:22:33.884384 #2875310] INFO -- : 146 ......................................................................... I, [2024-04-30T16:22:35.849817 #2875310] INFO -- : 219 ......................................................................... I, [2024-04-30T16:22:36.535057 #2875310] INFO -- : 292 ......................................................................... I, [2024-04-30T16:22:37.600381 #2875310] INFO -- : 365 ......................................................................... I, [2024-04-30T16:22:38.336728 #2875310] INFO -- : 438 ......................................................................... I, [2024-04-30T16:22:38.719700 #2875310] INFO -- : 511 ......................................................................... I, [2024-04-30T16:22:39.053502 #2875310] INFO -- : 584 ......................................................................... I, [2024-04-30T16:22:42.159155 #2875310] INFO -- : 657 ......................................................................... I, [2024-04-30T16:22:42.655426 #2875310] INFO -- : 730 ......................................................................... I, [2024-04-30T16:22:42.939860 #2875310] INFO -- : 803 ......................................................................... I, [2024-04-30T16:22:44.019654 #2875310] INFO -- : 876 ......................................................................... I, [2024-04-30T16:22:44.656416 #2875310] INFO -- : 949 ......................................................................... I, [2024-04-30T16:22:47.493461 #2875310] INFO -- : 1022 ......................................................................... I, [2024-04-30T16:22:58.827209 #2875310] INFO -- : 1095 ......................................................................... I, [2024-04-30T16:23:04.353979 #2875310] INFO -- : 1168 ......................................................................... I, [2024-04-30T16:23:05.436255 #2875310] INFO -- : 1241 ......................................................................... I, [2024-04-30T16:23:06.358164 #2875310] INFO -- : 1314 ......................................................................... I, [2024-04-30T16:23:06.685910 #2875310] INFO -- : 1387 ......................................................................... I, [2024-04-30T16:23:12.825437 #2875310] INFO -- : 1460 ......................................................................... I, [2024-04-30T16:23:29.654757 #2875310] INFO -- : 1533 ......................................................................... I, [2024-04-30T16:23:31.900058 #2875310] INFO -- : 1606 ......................................................................... I, [2024-04-30T16:23:35.129232 #2875310] INFO -- : 1679 ......................................................................... I, [2024-04-30T16:23:37.576447 #2875310] INFO -- : 1752 ......................................................................... I, [2024-04-30T16:23:39.797533 #2875310] INFO -- : 1825 ......................................................................... I, [2024-04-30T16:23:41.957109 #2875310] INFO -- : 1898 ......................................................................... I, [2024-04-30T16:23:43.486064 #2875310] INFO -- : 1971 ......................................................................... I, [2024-04-30T16:23:45.879704 #2875310] INFO -- : 2044 ......................................................................... I, [2024-04-30T16:23:46.914250 #2875310] INFO -- : 2117 ......................................................................... I, [2024-04-30T16:23:47.329240 #2875310] INFO -- : 2190 ......................................................................... I, [2024-04-30T16:23:47.594882 #2875310] INFO -- : 2263 ......................................................................... I, [2024-04-30T16:23:47.885880 #2875310] INFO -- : 2336 ......................................................................... I, [2024-04-30T16:23:48.420182 #2875310] INFO -- : 2409 ......................................................................... I, [2024-04-30T16:23:49.576073 #2875310] INFO -- : 2482 ......................................................................... I, [2024-04-30T16:23:50.313595 #2875310] INFO -- : 2555 ......................................................................... I, [2024-04-30T16:23:53.399700 #2875310] INFO -- : 2628 ......................................................................... I, [2024-04-30T16:23:55.327249 #2875310] INFO -- : 2701 ......................................................................... I, [2024-04-30T16:23:55.915432 #2875310] INFO -- : 2774 ......................................................................... I, [2024-04-30T16:23:57.216047 #2875310] INFO -- : 2847 ......................................................................... I, [2024-04-30T16:23:58.325100 #2875310] INFO -- : 2920 ......................................................................... I, [2024-04-30T16:23:59.084165 #2875310] INFO -- : 2993 ......................................................................... I, [2024-04-30T16:23:59.585849 #2875310] INFO -- : 3066 ......................................................................... I, [2024-04-30T16:23:59.891560 #2875310] INFO -- : 3139 ......................................................................... I, [2024-04-30T16:24:00.246627 #2875310] INFO -- : 3212 ......................................................................... I, [2024-04-30T16:24:00.757684 #2875310] INFO -- : 3285 ......................................................................... I, [2024-04-30T16:24:07.146328 #2875310] INFO -- : 3358 ........................................................................ I, [2024-04-30T16:24:07.146573 #2875310] INFO -- : I, [2024-04-30T16:24:07.146685 #2875310] INFO -- : Finished in 137.853103 seconds I, [2024-04-30T16:24:07.146787 #2875310] INFO -- : I, [2024-04-30T16:24:07.146893 #2875310] INFO -- : 3429 files, 32607 examples, 135932 expectations, 0 failures, 0 errors, 0 tagged I, [2024-04-30T16:24:07.159904 #2875310] INFO -- : $$$[end] "make yes-test-rubyspec MSPECOPT='--error-output stderr --debug -j' TESTS='-j4'" exit with 0.