# Logfile created on 2024-04-30 01:10:48 +0000 by logger.rb/v1.5.0 I, [2024-04-30T01:10:48.276910 #223805] INFO -- : #, @formatter=nil, @logdev=#, @binmode=false, @mon_data=#, @mon_data_owner_object_id=860>>> I, [2024-04-30T01:10:48.278459 #223805] INFO -- : $$$[beg] make update-unicode -j4 I, [2024-04-30T01:10:48.806319 #223805] INFO -- : Downloading Unicode emoji 15.0 files... I, [2024-04-30T01:10:48.807168 #223805] INFO -- : Downloading Unicode emoji 15.0 files... I, [2024-04-30T01:10:48.807959 #223805] INFO -- : Downloading Unicode emoji 15.0 files... I, [2024-04-30T01:10:49.432063 #223805] INFO -- : made symlink emoji/15.0/emoji-sequences.txt to /tmp/ruby/src/trunk/.downloaded-cache/emoji/15.0/emoji-sequences.txt I, [2024-04-30T01:10:49.432339 #223805] INFO -- : /tmp/ruby/src/trunk/enc/unicode/data/emoji/15.0/emoji-sequences.txt already exists I, [2024-04-30T01:10:49.500425 #223805] INFO -- : downloading emoji/15.0/emoji-test.txt ... downloading emoji/15.0/emoji-test.txt ... /tmp/ruby/src/trunk/enc/unicode/data/emoji/15.0/emoji-sequences.txt already exists E, [2024-04-30T01:10:50.167439 #223805] ERROR -- : /tmp/ruby/src/trunk/tool/downloader.rb:302:in `rescue in download': failed to download emoji/15.0/emoji-test.txt (RuntimeError) E, [2024-04-30T01:10:50.167724 #223805] ERROR -- : OpenURI::HTTPError: 403 Forbidden: https://www.unicode.org/Public/emoji/15.0/emoji-test.txt E, [2024-04-30T01:10:50.167922 #223805] ERROR -- : from /tmp/ruby/src/trunk/tool/downloader.rb:201:in `download' E, [2024-04-30T01:10:50.168065 #223805] ERROR -- : from /tmp/ruby/src/trunk/tool/downloader.rb:136:in `download' E, [2024-04-30T01:10:50.168268 #223805] ERROR -- : from /tmp/ruby/src/trunk/tool/downloader.rb:482:in `block in
' E, [2024-04-30T01:10:50.168414 #223805] ERROR -- : from /tmp/ruby/src/trunk/tool/downloader.rb:465:in `each' E, [2024-04-30T01:10:50.168549 #223805] ERROR -- : from /tmp/ruby/src/trunk/tool/downloader.rb:465:in `
' E, [2024-04-30T01:10:50.168866 #223805] ERROR -- : /usr/lib/ruby/3.1.0/open-uri.rb:364:in `open_http': 403 Forbidden (OpenURI::HTTPError) E, [2024-04-30T01:10:50.169116 #223805] ERROR -- : from /usr/lib/ruby/3.1.0/open-uri.rb:741:in `buffer_open' E, [2024-04-30T01:10:50.169356 #223805] ERROR -- : from /usr/lib/ruby/3.1.0/open-uri.rb:212:in `block in open_loop' E, [2024-04-30T01:10:50.169687 #223805] ERROR -- : from /usr/lib/ruby/3.1.0/open-uri.rb:210:in `catch' E, [2024-04-30T01:10:50.169890 #223805] ERROR -- : from /usr/lib/ruby/3.1.0/open-uri.rb:210:in `open_loop' E, [2024-04-30T01:10:50.170123 #223805] ERROR -- : from /usr/lib/ruby/3.1.0/open-uri.rb:151:in `open_uri' E, [2024-04-30T01:10:50.170344 #223805] ERROR -- : from /usr/lib/ruby/3.1.0/open-uri.rb:721:in `open' E, [2024-04-30T01:10:50.170608 #223805] ERROR -- : from /usr/lib/ruby/3.1.0/open-uri.rb:729:in `read' E, [2024-04-30T01:10:50.170896 #223805] ERROR -- : from /tmp/ruby/src/trunk/tool/downloader.rb:247:in `block in download' E, [2024-04-30T01:10:50.171091 #223805] ERROR -- : from /tmp/ruby/src/trunk/tool/downloader.rb:378:in `with_retry' E, [2024-04-30T01:10:50.171266 #223805] ERROR -- : from /tmp/ruby/src/trunk/tool/downloader.rb:246:in `download' E, [2024-04-30T01:10:50.171500 #223805] ERROR -- : from /tmp/ruby/src/trunk/tool/downloader.rb:136:in `download' E, [2024-04-30T01:10:50.171666 #223805] ERROR -- : from /tmp/ruby/src/trunk/tool/downloader.rb:482:in `block in
' E, [2024-04-30T01:10:50.171846 #223805] ERROR -- : from /tmp/ruby/src/trunk/tool/downloader.rb:465:in `each' E, [2024-04-30T01:10:50.172039 #223805] ERROR -- : from /tmp/ruby/src/trunk/tool/downloader.rb:465:in `
' E, [2024-04-30T01:10:50.173257 #223805] ERROR -- : /tmp/ruby/src/trunk/tool/downloader.rb:302:in `rescue in download': failed to download emoji/15.0/emoji-test.txt (RuntimeError) E, [2024-04-30T01:10:50.173497 #223805] ERROR -- : OpenURI::HTTPError: 403 Forbidden: https://www.unicode.org/Public/emoji/15.0/emoji-test.txt E, [2024-04-30T01:10:50.173604 #223805] ERROR -- : from /tmp/ruby/src/trunk/tool/downloader.rb:201:in `download' E, [2024-04-30T01:10:50.173727 #223805] ERROR -- : from /tmp/ruby/src/trunk/tool/downloader.rb:136:in `download' E, [2024-04-30T01:10:50.173823 #223805] ERROR -- : from /tmp/ruby/src/trunk/tool/downloader.rb:482:in `block in
' E, [2024-04-30T01:10:50.173920 #223805] ERROR -- : from /tmp/ruby/src/trunk/tool/downloader.rb:465:in `each' E, [2024-04-30T01:10:50.174066 #223805] ERROR -- : from /tmp/ruby/src/trunk/tool/downloader.rb:465:in `
' E, [2024-04-30T01:10:50.174386 #223805] ERROR -- : /usr/lib/ruby/3.1.0/open-uri.rb:364:in `open_http': 403 Forbidden (OpenURI::HTTPError) E, [2024-04-30T01:10:50.174536 #223805] ERROR -- : from /usr/lib/ruby/3.1.0/open-uri.rb:741:in `buffer_open' E, [2024-04-30T01:10:50.174636 #223805] ERROR -- : from /usr/lib/ruby/3.1.0/open-uri.rb:212:in `block in open_loop' E, [2024-04-30T01:10:50.174728 #223805] ERROR -- : from /usr/lib/ruby/3.1.0/open-uri.rb:210:in `catch' E, [2024-04-30T01:10:50.174839 #223805] ERROR -- : from /usr/lib/ruby/3.1.0/open-uri.rb:210:in `open_loop' E, [2024-04-30T01:10:50.174939 #223805] ERROR -- : from /usr/lib/ruby/3.1.0/open-uri.rb:151:in `open_uri' E, [2024-04-30T01:10:50.175032 #223805] ERROR -- : from /usr/lib/ruby/3.1.0/open-uri.rb:721:in `open' E, [2024-04-30T01:10:50.175122 #223805] ERROR -- : from /usr/lib/ruby/3.1.0/open-uri.rb:729:in `read' E, [2024-04-30T01:10:50.175213 #223805] ERROR -- : from /tmp/ruby/src/trunk/tool/downloader.rb:247:in `block in download' E, [2024-04-30T01:10:50.175309 #223805] ERROR -- : from /tmp/ruby/src/trunk/tool/downloader.rb:378:in `with_retry' E, [2024-04-30T01:10:50.175399 #223805] ERROR -- : from /tmp/ruby/src/trunk/tool/downloader.rb:246:in `download' E, [2024-04-30T01:10:50.175491 #223805] ERROR -- : from /tmp/ruby/src/trunk/tool/downloader.rb:136:in `download' E, [2024-04-30T01:10:50.175583 #223805] ERROR -- : from /tmp/ruby/src/trunk/tool/downloader.rb:482:in `block in
' E, [2024-04-30T01:10:50.175688 #223805] ERROR -- : from /tmp/ruby/src/trunk/tool/downloader.rb:465:in `each' E, [2024-04-30T01:10:50.175779 #223805] ERROR -- : from /tmp/ruby/src/trunk/tool/downloader.rb:465:in `
' E, [2024-04-30T01:10:50.196280 #223805] ERROR -- : make: *** [uncommon.mk:1787: /tmp/ruby/src/trunk/enc/unicode/data/emoji/15.0/emoji-zwj-sequences.txt] Error 1 E, [2024-04-30T01:10:50.196482 #223805] ERROR -- : make: *** Waiting for unfinished jobs.... E, [2024-04-30T01:10:50.197667 #223805] ERROR -- : make: *** [uncommon.mk:1787: /tmp/ruby/src/trunk/enc/unicode/data/emoji/15.0/emoji-test.txt] Error 1 E, [2024-04-30T01:10:50.283550 #223805] ERROR -- : /tmp/ruby/src/trunk/tool/downloader.rb:302:in `rescue in download': failed to download emoji/15.0/emoji-test.txt (RuntimeError) E, [2024-04-30T01:10:50.283782 #223805] ERROR -- : OpenURI::HTTPError: 403 Forbidden: https://www.unicode.org/Public/emoji/15.0/emoji-test.txt E, [2024-04-30T01:10:50.283948 #223805] ERROR -- : from /tmp/ruby/src/trunk/tool/downloader.rb:201:in `download' E, [2024-04-30T01:10:50.284055 #223805] ERROR -- : from /tmp/ruby/src/trunk/tool/downloader.rb:136:in `download' E, [2024-04-30T01:10:50.284152 #223805] ERROR -- : from /tmp/ruby/src/trunk/tool/downloader.rb:482:in `block in
' E, [2024-04-30T01:10:50.284342 #223805] ERROR -- : from /tmp/ruby/src/trunk/tool/downloader.rb:465:in `each' E, [2024-04-30T01:10:50.284645 #223805] ERROR -- : from /tmp/ruby/src/trunk/tool/downloader.rb:465:in `
' E, [2024-04-30T01:10:50.284864 #223805] ERROR -- : /usr/lib/ruby/3.1.0/open-uri.rb:364:in `open_http': 403 Forbidden (OpenURI::HTTPError) E, [2024-04-30T01:10:50.284970 #223805] ERROR -- : from /usr/lib/ruby/3.1.0/open-uri.rb:741:in `buffer_open' E, [2024-04-30T01:10:50.285088 #223805] ERROR -- : from /usr/lib/ruby/3.1.0/open-uri.rb:212:in `block in open_loop' E, [2024-04-30T01:10:50.285188 #223805] ERROR -- : from /usr/lib/ruby/3.1.0/open-uri.rb:210:in `catch' E, [2024-04-30T01:10:50.285279 #223805] ERROR -- : from /usr/lib/ruby/3.1.0/open-uri.rb:210:in `open_loop' E, [2024-04-30T01:10:50.285369 #223805] ERROR -- : from /usr/lib/ruby/3.1.0/open-uri.rb:151:in `open_uri' E, [2024-04-30T01:10:50.285459 #223805] ERROR -- : from /usr/lib/ruby/3.1.0/open-uri.rb:721:in `open' E, [2024-04-30T01:10:50.285552 #223805] ERROR -- : from /usr/lib/ruby/3.1.0/open-uri.rb:729:in `read' E, [2024-04-30T01:10:50.285644 #223805] ERROR -- : from /tmp/ruby/src/trunk/tool/downloader.rb:247:in `block in download' E, [2024-04-30T01:10:50.285737 #223805] ERROR -- : from /tmp/ruby/src/trunk/tool/downloader.rb:378:in `with_retry' E, [2024-04-30T01:10:50.285829 #223805] ERROR -- : from /tmp/ruby/src/trunk/tool/downloader.rb:246:in `download' E, [2024-04-30T01:10:50.285931 #223805] ERROR -- : from /tmp/ruby/src/trunk/tool/downloader.rb:136:in `download' E, [2024-04-30T01:10:50.286024 #223805] ERROR -- : from /tmp/ruby/src/trunk/tool/downloader.rb:482:in `block in
' E, [2024-04-30T01:10:50.286116 #223805] ERROR -- : from /tmp/ruby/src/trunk/tool/downloader.rb:465:in `each' E, [2024-04-30T01:10:50.286209 #223805] ERROR -- : from /tmp/ruby/src/trunk/tool/downloader.rb:465:in `
' E, [2024-04-30T01:10:50.305338 #223805] ERROR -- : make: *** [uncommon.mk:1787: /tmp/ruby/src/trunk/enc/unicode/data/emoji/15.0/emoji-sequences.txt] Error 1 I, [2024-04-30T01:10:50.305564 #223805] INFO -- : downloading emoji/15.0/emoji-test.txt ... E, [2024-04-30T01:10:50.305821 #223805] ERROR -- : make: *** Deleting file '/tmp/ruby/src/trunk/enc/unicode/data/emoji/15.0/emoji-sequences.txt' I, [2024-04-30T01:10:50.306896 #223805] INFO -- : $$$[end] "make update-unicode -j4" exit with 512. I, [2024-04-30T01:10:50.307104 #223805] INFO -- : $$$[beg] make update-download -j4 I, [2024-04-30T01:10:51.523205 #223805] INFO -- : tool/config.guess already exists I, [2024-04-30T01:10:51.523619 #223805] INFO -- : tool/config.sub already exists I, [2024-04-30T01:10:51.542749 #223805] INFO -- : Update minitest to ea9caafc0754b1d6236a490d59e624b53209734a I, [2024-04-30T01:10:51.543568 #223805] INFO -- : Update power_assert to 84e85124c5014a139af39161d484156cfe87a9ed I, [2024-04-30T01:10:51.545851 #223805] INFO -- : Update rbs to ba7872795d5de04adb8ff500c0e6afdc81a041dd I, [2024-04-30T01:10:51.546641 #223805] INFO -- : Update typeprof to b19a6416da3a05d57fadd6ffdadb382b6d236ca5 I, [2024-04-30T01:10:51.552137 #223805] INFO -- : echo ea9caafc0754b1d6236a490d59e624b53209734a | /bin/sh /tmp/ruby/src/trunk/tool/ifchange /tmp/ruby/src/trunk/.bundle/.timestamp/minitest.revision - I, [2024-04-30T01:10:51.552888 #223805] INFO -- : echo 84e85124c5014a139af39161d484156cfe87a9ed | /bin/sh /tmp/ruby/src/trunk/tool/ifchange /tmp/ruby/src/trunk/.bundle/.timestamp/power_assert.revision - I, [2024-04-30T01:10:51.555820 #223805] INFO -- : echo ba7872795d5de04adb8ff500c0e6afdc81a041dd | /bin/sh /tmp/ruby/src/trunk/tool/ifchange /tmp/ruby/src/trunk/.bundle/.timestamp/rbs.revision - I, [2024-04-30T01:10:51.556537 #223805] INFO -- : echo b19a6416da3a05d57fadd6ffdadb382b6d236ca5 | /bin/sh /tmp/ruby/src/trunk/tool/ifchange /tmp/ruby/src/trunk/.bundle/.timestamp/typeprof.revision - I, [2024-04-30T01:10:51.563720 #223805] INFO -- : /tmp/ruby/src/trunk/.bundle/.timestamp/power_assert.revision unchanged I, [2024-04-30T01:10:51.564288 #223805] INFO -- : /tmp/ruby/src/trunk/.bundle/.timestamp/minitest.revision unchanged I, [2024-04-30T01:10:51.567766 #223805] INFO -- : /tmp/ruby/src/trunk/.bundle/.timestamp/rbs.revision unchanged I, [2024-04-30T01:10:51.569831 #223805] INFO -- : /tmp/ruby/src/trunk/.bundle/.timestamp/typeprof.revision unchanged I, [2024-04-30T01:10:52.374187 #223805] INFO -- : Building power_assert@84e85124c5014a139af39161d484156cfe87a9ed to /tmp/ruby/src/trunk/gems/power_assert-2.0.3.gem I, [2024-04-30T01:10:53.311273 #223805] INFO -- : Successfully built RubyGem I, [2024-04-30T01:10:53.311474 #223805] INFO -- : Name: power_assert I, [2024-04-30T01:10:53.311591 #223805] INFO -- : Version: 2.0.4dev I, [2024-04-30T01:10:53.311676 #223805] INFO -- : File: power_assert-2.0.4dev.gem I, [2024-04-30T01:10:54.010725 #223805] INFO -- : $$$[end] "make update-download -j4" exit with 0. I, [2024-04-30T01:10:54.010957 #223805] INFO -- : $$$[beg] make update-rubyspec -j4 I, [2024-04-30T01:10:54.529065 #223805] INFO -- : make: Nothing to be done for 'update-rubyspec'. I, [2024-04-30T01:10:54.530546 #223805] INFO -- : $$$[end] "make update-rubyspec -j4" exit with 0. I, [2024-04-30T01:10:54.533959 #223805] INFO -- : $$$[beg] make update-src -j4 I, [2024-04-30T01:10:56.006441 #223805] INFO -- : Already up to date. I, [2024-04-30T01:10:56.070673 #223805] INFO -- : Latest commit hash = 528c4501f4 I, [2024-04-30T01:10:56.076642 #223805] INFO -- : $$$[end] "make update-src -j4" exit with 0. I, [2024-04-30T01:10:56.076897 #223805] INFO -- : $$$[beg] make after-update -j4 I, [2024-04-30T01:10:56.742723 #223805] INFO -- : generating /tmp/ruby/src/trunk/ext/ripper/eventids2table.c I, [2024-04-30T01:10:56.782628 #223805] INFO -- : make[1]: Entering directory '/tmp/ruby/src/trunk/ext/ripper' I, [2024-04-30T01:10:56.782839 #223805] INFO -- : make[1]: Nothing to be done for 'src'. I, [2024-04-30T01:10:56.782954 #223805] INFO -- : make[1]: Leaving directory '/tmp/ruby/src/trunk/ext/ripper' I, [2024-04-30T01:10:56.917846 #223805] INFO -- : /tmp/ruby/src/trunk/revision.h updated I, [2024-04-30T01:10:56.927529 #223805] INFO -- : generating riscv64-linux-fake.rb I, [2024-04-30T01:10:57.421636 #223805] INFO -- : riscv64-linux-fake.rb updated I, [2024-04-30T01:10:57.428084 #223805] INFO -- : generating enc.mk I, [2024-04-30T01:10:58.881322 #223805] INFO -- : making srcs under enc I, [2024-04-30T01:10:59.187504 #223805] INFO -- : make[1]: Entering directory '/tmp/ruby/build/trunk' I, [2024-04-30T01:10:59.187713 #223805] INFO -- : make[1]: Nothing to be done for 'srcs'. I, [2024-04-30T01:10:59.187815 #223805] INFO -- : make[1]: Leaving directory '/tmp/ruby/build/trunk' I, [2024-04-30T01:10:59.852372 #223805] INFO -- : Update minitest to ea9caafc0754b1d6236a490d59e624b53209734a I, [2024-04-30T01:10:59.853389 #223805] INFO -- : Update power_assert to 84e85124c5014a139af39161d484156cfe87a9ed I, [2024-04-30T01:10:59.854252 #223805] INFO -- : Update rbs to ba7872795d5de04adb8ff500c0e6afdc81a041dd I, [2024-04-30T01:10:59.857550 #223805] INFO -- : Update typeprof to b19a6416da3a05d57fadd6ffdadb382b6d236ca5 I, [2024-04-30T01:10:59.864456 #223805] INFO -- : echo 84e85124c5014a139af39161d484156cfe87a9ed | /bin/sh /tmp/ruby/src/trunk/tool/ifchange /tmp/ruby/src/trunk/.bundle/.timestamp/power_assert.revision - I, [2024-04-30T01:10:59.865130 #223805] INFO -- : echo ea9caafc0754b1d6236a490d59e624b53209734a | /bin/sh /tmp/ruby/src/trunk/tool/ifchange /tmp/ruby/src/trunk/.bundle/.timestamp/minitest.revision - I, [2024-04-30T01:10:59.865802 #223805] INFO -- : echo ba7872795d5de04adb8ff500c0e6afdc81a041dd | /bin/sh /tmp/ruby/src/trunk/tool/ifchange /tmp/ruby/src/trunk/.bundle/.timestamp/rbs.revision - I, [2024-04-30T01:10:59.874986 #223805] INFO -- : echo b19a6416da3a05d57fadd6ffdadb382b6d236ca5 | /bin/sh /tmp/ruby/src/trunk/tool/ifchange /tmp/ruby/src/trunk/.bundle/.timestamp/typeprof.revision - I, [2024-04-30T01:10:59.876458 #223805] INFO -- : /tmp/ruby/src/trunk/.bundle/.timestamp/power_assert.revision unchanged I, [2024-04-30T01:10:59.877530 #223805] INFO -- : /tmp/ruby/src/trunk/.bundle/.timestamp/minitest.revision unchanged I, [2024-04-30T01:10:59.879227 #223805] INFO -- : /tmp/ruby/src/trunk/.bundle/.timestamp/rbs.revision unchanged I, [2024-04-30T01:10:59.886701 #223805] INFO -- : /tmp/ruby/src/trunk/.bundle/.timestamp/typeprof.revision unchanged I, [2024-04-30T01:11:00.689694 #223805] INFO -- : Building power_assert@84e85124c5014a139af39161d484156cfe87a9ed to /tmp/ruby/src/trunk/gems/power_assert-2.0.3.gem I, [2024-04-30T01:11:01.637405 #223805] INFO -- : Successfully built RubyGem I, [2024-04-30T01:11:01.637607 #223805] INFO -- : Name: power_assert I, [2024-04-30T01:11:01.637700 #223805] INFO -- : Version: 2.0.4dev I, [2024-04-30T01:11:01.637783 #223805] INFO -- : File: power_assert-2.0.4dev.gem I, [2024-04-30T01:11:01.652398 #223805] INFO -- : Extracting bundle gem power_assert-2.0.3... I, [2024-04-30T01:11:02.548879 #223805] INFO -- : Try with hash version of bundled gems instead of gems/power_assert-2.0.3.gem. We don't use this gem with release version of Ruby. I, [2024-04-30T01:11:02.603859 #223805] INFO -- : Unpacked gems/power_assert-2.0.4dev.gem I, [2024-04-30T01:11:02.619267 #223805] INFO -- : $$$[end] "make after-update -j4" exit with 0. I, [2024-04-30T01:11:02.620033 #223805] INFO -- : $$$[beg] make miniruby -j4 I, [2024-04-30T01:11:03.160242 #223805] INFO -- : BASERUBY = /usr/bin/ruby --disable=gems I, [2024-04-30T01:11:03.160581 #223805] INFO -- : CC = gcc I, [2024-04-30T01:11:03.160772 #223805] INFO -- : LD = ld I, [2024-04-30T01:11:03.160967 #223805] INFO -- : LDSHARED = gcc -shared I, [2024-04-30T01:11:03.161178 #223805] INFO -- : CFLAGS = -O3 -fno-fast-math -ggdb3 -Wall -Wextra -Wdeprecated-declarations -Wdiv-by-zero -Wduplicated-cond -Wimplicit-function-declaration -Wimplicit-int -Wpointer-arith -Wwrite-strings -Wold-style-definition -Wimplicit-fallthrough=0 -Wmissing-noreturn -Wno-cast-function-type -Wno-constant-logical-operand -Wno-long-long -Wno-missing-field-initializers -Wno-overlength-strings -Wno-packed-bitfield-compat -Wno-parentheses-equality -Wno-self-assign -Wno-tautological-compare -Wno-unused-parameter -Wno-unused-value -Wsuggest-attribute=format -Wsuggest-attribute=noreturn -Wunused-variable -Wmisleading-indentation -Wundef -fPIC I, [2024-04-30T01:11:03.161384 #223805] INFO -- : XCFLAGS = -U_FORTIFY_SOURCE -D_FORTIFY_SOURCE=2 -fstack-protector-strong -fno-strict-overflow -fvisibility=hidden -fexcess-precision=standard -DRUBY_EXPORT -I. -I.ext/include/riscv64-linux -I/tmp/ruby/src/trunk/include -I/tmp/ruby/src/trunk -I/tmp/ruby/src/trunk/prism -I/tmp/ruby/src/trunk/enc/unicode/15.0.0 I, [2024-04-30T01:11:03.161559 #223805] INFO -- : CPPFLAGS = I, [2024-04-30T01:11:03.161726 #223805] INFO -- : DLDFLAGS = -Wl,--compress-debug-sections=zlib -Wl,-soname,libruby.so.3.4 -fstack-protector-strong I, [2024-04-30T01:11:03.161908 #223805] INFO -- : SOLIBS = -lz -lrt -lrt -lgmp -ldl -lcrypt -lm -lpthread I, [2024-04-30T01:11:03.162100 #223805] INFO -- : LANG = I, [2024-04-30T01:11:03.162278 #223805] INFO -- : LC_ALL = I, [2024-04-30T01:11:03.162449 #223805] INFO -- : LC_CTYPE = I, [2024-04-30T01:11:03.162623 #223805] INFO -- : MFLAGS = -j4 --jobserver-auth=4,5 I, [2024-04-30T01:11:03.162791 #223805] INFO -- : RUSTC = rustc I, [2024-04-30T01:11:03.162983 #223805] INFO -- : YJIT_RUSTC_ARGS = --crate-name=yjit --crate-type=staticlib --edition=2021 -g -C lto=thin -C opt-level=3 -C overflow-checks=on '--out-dir=/tmp/ruby/build/trunk/yjit/target/release/' /tmp/ruby/src/trunk/yjit/src/lib.rs I, [2024-04-30T01:11:03.173687 #223805] INFO -- : gcc (Debian 13.2.0-4revyos1) 13.2.0 I, [2024-04-30T01:11:03.173928 #223805] INFO -- : Copyright (C) 2023 Free Software Foundation, Inc. I, [2024-04-30T01:11:03.174014 #223805] INFO -- : This is free software; see the source for copying conditions. There is NO I, [2024-04-30T01:11:03.174106 #223805] INFO -- : warranty; not even for MERCHANTABILITY or FITNESS FOR A PARTICULAR PURPOSE. I, [2024-04-30T01:11:03.174198 #223805] INFO -- : I, [2024-04-30T01:11:03.401812 #223805] INFO -- : compiling /tmp/ruby/src/trunk/version.c I, [2024-04-30T01:11:04.593978 #223805] INFO -- : linking miniruby I, [2024-04-30T01:11:44.438272 #223805] INFO -- : $$$[end] "make miniruby -j4" exit with 0. I, [2024-04-30T01:11:44.438966 #223805] INFO -- : $$$[beg] make ruby -j4 I, [2024-04-30T01:11:44.972277 #223805] INFO -- : BASERUBY = /usr/bin/ruby --disable=gems I, [2024-04-30T01:11:44.972529 #223805] INFO -- : CC = gcc I, [2024-04-30T01:11:44.972657 #223805] INFO -- : LD = ld I, [2024-04-30T01:11:44.972795 #223805] INFO -- : LDSHARED = gcc -shared I, [2024-04-30T01:11:44.972929 #223805] INFO -- : CFLAGS = -O3 -fno-fast-math -ggdb3 -Wall -Wextra -Wdeprecated-declarations -Wdiv-by-zero -Wduplicated-cond -Wimplicit-function-declaration -Wimplicit-int -Wpointer-arith -Wwrite-strings -Wold-style-definition -Wimplicit-fallthrough=0 -Wmissing-noreturn -Wno-cast-function-type -Wno-constant-logical-operand -Wno-long-long -Wno-missing-field-initializers -Wno-overlength-strings -Wno-packed-bitfield-compat -Wno-parentheses-equality -Wno-self-assign -Wno-tautological-compare -Wno-unused-parameter -Wno-unused-value -Wsuggest-attribute=format -Wsuggest-attribute=noreturn -Wunused-variable -Wmisleading-indentation -Wundef -fPIC I, [2024-04-30T01:11:44.973057 #223805] INFO -- : XCFLAGS = -U_FORTIFY_SOURCE -D_FORTIFY_SOURCE=2 -fstack-protector-strong -fno-strict-overflow -fvisibility=hidden -fexcess-precision=standard -DRUBY_EXPORT -I. -I.ext/include/riscv64-linux -I/tmp/ruby/src/trunk/include -I/tmp/ruby/src/trunk -I/tmp/ruby/src/trunk/prism -I/tmp/ruby/src/trunk/enc/unicode/15.0.0 I, [2024-04-30T01:11:44.973179 #223805] INFO -- : CPPFLAGS = I, [2024-04-30T01:11:44.973282 #223805] INFO -- : DLDFLAGS = -Wl,--compress-debug-sections=zlib -Wl,-soname,libruby.so.3.4 -fstack-protector-strong I, [2024-04-30T01:11:44.973382 #223805] INFO -- : SOLIBS = -lz -lrt -lrt -lgmp -ldl -lcrypt -lm -lpthread I, [2024-04-30T01:11:44.973477 #223805] INFO -- : LANG = I, [2024-04-30T01:11:44.973570 #223805] INFO -- : LC_ALL = I, [2024-04-30T01:11:44.973663 #223805] INFO -- : LC_CTYPE = I, [2024-04-30T01:11:44.973767 #223805] INFO -- : MFLAGS = -j4 --jobserver-auth=4,5 I, [2024-04-30T01:11:44.973869 #223805] INFO -- : RUSTC = rustc I, [2024-04-30T01:11:44.973981 #223805] INFO -- : YJIT_RUSTC_ARGS = --crate-name=yjit --crate-type=staticlib --edition=2021 -g -C lto=thin -C opt-level=3 -C overflow-checks=on '--out-dir=/tmp/ruby/build/trunk/yjit/target/release/' /tmp/ruby/src/trunk/yjit/src/lib.rs I, [2024-04-30T01:11:44.987333 #223805] INFO -- : gcc (Debian 13.2.0-4revyos1) 13.2.0 I, [2024-04-30T01:11:44.987546 #223805] INFO -- : Copyright (C) 2023 Free Software Foundation, Inc. I, [2024-04-30T01:11:44.987651 #223805] INFO -- : This is free software; see the source for copying conditions. There is NO I, [2024-04-30T01:11:44.987751 #223805] INFO -- : warranty; not even for MERCHANTABILITY or FITNESS FOR A PARTICULAR PURPOSE. I, [2024-04-30T01:11:44.987854 #223805] INFO -- : I, [2024-04-30T01:11:45.659340 #223805] INFO -- : builtin_binary.inc updated I, [2024-04-30T01:11:45.670883 #223805] INFO -- : 63c4b2d66003409833406b3a662615f9f67397fdf425c22dee41f60d762f36d6 builtin_binary.inc I, [2024-04-30T01:11:45.673903 #223805] INFO -- : compiling /tmp/ruby/src/trunk/builtin.c I, [2024-04-30T01:11:47.284942 #223805] INFO -- : linking static-library libruby-static.a I, [2024-04-30T01:11:54.468777 #223805] INFO -- : linking shared-library libruby.so.3.4.0 I, [2024-04-30T01:12:35.033414 #223805] INFO -- : linking ruby I, [2024-04-30T01:12:35.245707 #223805] INFO -- : $$$[end] "make ruby -j4" exit with 0. I, [2024-04-30T01:12:35.246369 #223805] INFO -- : $$$[beg] make all -j4 I, [2024-04-30T01:12:35.788645 #223805] INFO -- : BASERUBY = /usr/bin/ruby --disable=gems I, [2024-04-30T01:12:35.789034 #223805] INFO -- : CC = gcc I, [2024-04-30T01:12:35.789247 #223805] INFO -- : LD = ld I, [2024-04-30T01:12:35.789506 #223805] INFO -- : LDSHARED = gcc -shared I, [2024-04-30T01:12:35.789715 #223805] INFO -- : CFLAGS = -O3 -fno-fast-math -ggdb3 -Wall -Wextra -Wdeprecated-declarations -Wdiv-by-zero -Wduplicated-cond -Wimplicit-function-declaration -Wimplicit-int -Wpointer-arith -Wwrite-strings -Wold-style-definition -Wimplicit-fallthrough=0 -Wmissing-noreturn -Wno-cast-function-type -Wno-constant-logical-operand -Wno-long-long -Wno-missing-field-initializers -Wno-overlength-strings -Wno-packed-bitfield-compat -Wno-parentheses-equality -Wno-self-assign -Wno-tautological-compare -Wno-unused-parameter -Wno-unused-value -Wsuggest-attribute=format -Wsuggest-attribute=noreturn -Wunused-variable -Wmisleading-indentation -Wundef -fPIC I, [2024-04-30T01:12:35.789956 #223805] INFO -- : XCFLAGS = -U_FORTIFY_SOURCE -D_FORTIFY_SOURCE=2 -fstack-protector-strong -fno-strict-overflow -fvisibility=hidden -fexcess-precision=standard -DRUBY_EXPORT -I. -I.ext/include/riscv64-linux -I/tmp/ruby/src/trunk/include -I/tmp/ruby/src/trunk -I/tmp/ruby/src/trunk/prism -I/tmp/ruby/src/trunk/enc/unicode/15.0.0 I, [2024-04-30T01:12:35.790157 #223805] INFO -- : CPPFLAGS = I, [2024-04-30T01:12:35.790562 #223805] INFO -- : DLDFLAGS = -Wl,--compress-debug-sections=zlib -Wl,-soname,libruby.so.3.4 -fstack-protector-strong I, [2024-04-30T01:12:35.790696 #223805] INFO -- : SOLIBS = -lz -lrt -lrt -lgmp -ldl -lcrypt -lm -lpthread I, [2024-04-30T01:12:35.790779 #223805] INFO -- : LANG = I, [2024-04-30T01:12:35.790858 #223805] INFO -- : LC_ALL = I, [2024-04-30T01:12:35.790942 #223805] INFO -- : LC_CTYPE = I, [2024-04-30T01:12:35.791027 #223805] INFO -- : MFLAGS = -j4 --jobserver-auth=4,5 I, [2024-04-30T01:12:35.791114 #223805] INFO -- : RUSTC = rustc I, [2024-04-30T01:12:35.791215 #223805] INFO -- : YJIT_RUSTC_ARGS = --crate-name=yjit --crate-type=staticlib --edition=2021 -g -C lto=thin -C opt-level=3 -C overflow-checks=on '--out-dir=/tmp/ruby/build/trunk/yjit/target/release/' /tmp/ruby/src/trunk/yjit/src/lib.rs I, [2024-04-30T01:12:35.802205 #223805] INFO -- : gcc (Debian 13.2.0-4revyos1) 13.2.0 I, [2024-04-30T01:12:35.802388 #223805] INFO -- : Copyright (C) 2023 Free Software Foundation, Inc. I, [2024-04-30T01:12:35.802471 #223805] INFO -- : This is free software; see the source for copying conditions. There is NO I, [2024-04-30T01:12:35.802707 #223805] INFO -- : warranty; not even for MERCHANTABILITY or FITNESS FOR A PARTICULAR PURPOSE. I, [2024-04-30T01:12:35.802840 #223805] INFO -- : I, [2024-04-30T01:12:36.112997 #223805] INFO -- : generating enc.mk I, [2024-04-30T01:12:36.130226 #223805] INFO -- : building spec/ruby/optional/capi/ext/array_spec.so I, [2024-04-30T01:12:36.132633 #223805] INFO -- : building spec/ruby/optional/capi/ext/basic_object_spec.so I, [2024-04-30T01:12:36.136875 #223805] INFO -- : building spec/ruby/optional/capi/ext/bignum_spec.so I, [2024-04-30T01:12:37.079416 #223805] INFO -- : building spec/ruby/optional/capi/ext/binding_spec.so I, [2024-04-30T01:12:37.371840 #223805] INFO -- : building spec/ruby/optional/capi/ext/boolean_spec.so I, [2024-04-30T01:12:37.853897 #223805] INFO -- : building spec/ruby/optional/capi/ext/class_id_under_autoload_spec.so I, [2024-04-30T01:12:38.125519 #223805] INFO -- : building spec/ruby/optional/capi/ext/class_spec.so I, [2024-04-30T01:12:38.418283 #223805] INFO -- : building spec/ruby/optional/capi/ext/class_under_autoload_spec.so I, [2024-04-30T01:12:38.700667 #223805] INFO -- : building spec/ruby/optional/capi/ext/complex_spec.so I, [2024-04-30T01:12:38.904932 #223805] INFO -- : building spec/ruby/optional/capi/ext/constants_spec.so I, [2024-04-30T01:12:39.433285 #223805] INFO -- : building spec/ruby/optional/capi/ext/data_spec.so I, [2024-04-30T01:12:39.813259 #223805] INFO -- : building spec/ruby/optional/capi/ext/debug_spec.so I, [2024-04-30T01:12:39.870662 #223805] INFO -- : building spec/ruby/optional/capi/ext/encoding_spec.so I, [2024-04-30T01:12:40.778443 #223805] INFO -- : building spec/ruby/optional/capi/ext/enumerator_spec.so I, [2024-04-30T01:12:40.925332 #223805] INFO -- : building spec/ruby/optional/capi/ext/exception_spec.so I, [2024-04-30T01:12:41.163791 #223805] INFO -- : building spec/ruby/optional/capi/ext/fiber_spec.so I, [2024-04-30T01:12:42.198692 #223805] INFO -- : building spec/ruby/optional/capi/ext/file_spec.so I, [2024-04-30T01:12:42.333471 #223805] INFO -- : building spec/ruby/optional/capi/ext/fixnum_spec.so I, [2024-04-30T01:12:42.419142 #223805] INFO -- : building spec/ruby/optional/capi/ext/float_spec.so I, [2024-04-30T01:12:42.643194 #223805] INFO -- : building spec/ruby/optional/capi/ext/gc_spec.so I, [2024-04-30T01:12:43.308296 #223805] INFO -- : building spec/ruby/optional/capi/ext/globals_spec.so I, [2024-04-30T01:12:43.371966 #223805] INFO -- : building spec/ruby/optional/capi/ext/hash_spec.so I, [2024-04-30T01:12:43.501340 #223805] INFO -- : building spec/ruby/optional/capi/ext/integer_spec.so I, [2024-04-30T01:12:43.954761 #223805] INFO -- : building spec/ruby/optional/capi/ext/io_spec.so I, [2024-04-30T01:12:44.597971 #223805] INFO -- : building spec/ruby/optional/capi/ext/kernel_spec.so I, [2024-04-30T01:12:44.768942 #223805] INFO -- : building spec/ruby/optional/capi/ext/language_spec.so I, [2024-04-30T01:12:44.789326 #223805] INFO -- : building spec/ruby/optional/capi/ext/marshal_spec.so I, [2024-04-30T01:12:45.805166 #223805] INFO -- : building spec/ruby/optional/capi/ext/module_spec.so I, [2024-04-30T01:12:45.934619 #223805] INFO -- : building spec/ruby/optional/capi/ext/module_under_autoload_spec.so I, [2024-04-30T01:12:46.213336 #223805] INFO -- : building spec/ruby/optional/capi/ext/mutex_spec.so I, [2024-04-30T01:12:47.007868 #223805] INFO -- : building spec/ruby/optional/capi/ext/numeric_spec.so I, [2024-04-30T01:12:47.208915 #223805] INFO -- : building spec/ruby/optional/capi/ext/object_spec.so I, [2024-04-30T01:12:47.352063 #223805] INFO -- : building spec/ruby/optional/capi/ext/proc_spec.so I, [2024-04-30T01:12:47.499597 #223805] INFO -- : building spec/ruby/optional/capi/ext/range_spec.so I, [2024-04-30T01:12:48.634281 #223805] INFO -- : building spec/ruby/optional/capi/ext/rational_spec.so I, [2024-04-30T01:12:48.638659 #223805] INFO -- : building spec/ruby/optional/capi/ext/rbasic_spec.so I, [2024-04-30T01:12:48.874400 #223805] INFO -- : building spec/ruby/optional/capi/ext/regexp_spec.so I, [2024-04-30T01:12:49.806394 #223805] INFO -- : building spec/ruby/optional/capi/ext/st_spec.so I, [2024-04-30T01:12:49.945011 #223805] INFO -- : building spec/ruby/optional/capi/ext/string_spec.so I, [2024-04-30T01:12:49.983174 #223805] INFO -- : building spec/ruby/optional/capi/ext/struct_spec.so I, [2024-04-30T01:12:50.147970 #223805] INFO -- : building spec/ruby/optional/capi/ext/symbol_spec.so I, [2024-04-30T01:12:51.002126 #223805] INFO -- : building spec/ruby/optional/capi/ext/thread_spec.so I, [2024-04-30T01:12:51.114751 #223805] INFO -- : building spec/ruby/optional/capi/ext/time_spec.so I, [2024-04-30T01:12:51.725099 #223805] INFO -- : building spec/ruby/optional/capi/ext/tracepoint_spec.so I, [2024-04-30T01:12:52.480978 #223805] INFO -- : building spec/ruby/optional/capi/ext/typed_data_spec.so I, [2024-04-30T01:12:52.506202 #223805] INFO -- : building spec/ruby/optional/capi/ext/util_spec.so I, [2024-04-30T01:12:52.861637 #223805] INFO -- : making enc I, [2024-04-30T01:12:53.058705 #223805] INFO -- : make[1]: Entering directory '/tmp/ruby/build/trunk' I, [2024-04-30T01:12:53.059047 #223805] INFO -- : make[1]: Nothing to be done for 'enc'. I, [2024-04-30T01:12:53.059368 #223805] INFO -- : make[1]: Leaving directory '/tmp/ruby/build/trunk' I, [2024-04-30T01:12:53.070207 #223805] INFO -- : making srcs under enc I, [2024-04-30T01:12:53.432768 #223805] INFO -- : make[1]: Entering directory '/tmp/ruby/build/trunk' I, [2024-04-30T01:12:53.433186 #223805] INFO -- : make[1]: Nothing to be done for 'srcs'. I, [2024-04-30T01:12:53.433598 #223805] INFO -- : make[1]: Leaving directory '/tmp/ruby/build/trunk' I, [2024-04-30T01:12:53.437472 #223805] INFO -- : generating transdb.h I, [2024-04-30T01:12:54.734850 #223805] INFO -- : transdb.h unchanged I, [2024-04-30T01:12:54.741222 #223805] INFO -- : generating makefiles ext/configure-ext.mk I, [2024-04-30T01:12:54.741808 #223805] INFO -- : making trans I, [2024-04-30T01:12:54.934279 #223805] INFO -- : ext/configure-ext.mk updated I, [2024-04-30T01:12:54.946371 #223805] INFO -- : make[1]: Entering directory '/tmp/ruby/build/trunk' I, [2024-04-30T01:12:55.103826 #223805] INFO -- : make[1]: Entering directory '/tmp/ruby/build/trunk' I, [2024-04-30T01:12:55.104152 #223805] INFO -- : make[1]: Nothing to be done for 'trans'. I, [2024-04-30T01:12:55.104537 #223805] INFO -- : make[1]: Leaving directory '/tmp/ruby/build/trunk' I, [2024-04-30T01:12:57.278028 #223805] INFO -- : making encs I, [2024-04-30T01:12:57.701779 #223805] INFO -- : make[1]: Entering directory '/tmp/ruby/build/trunk' I, [2024-04-30T01:12:57.702149 #223805] INFO -- : make[1]: Nothing to be done for 'encs'. I, [2024-04-30T01:12:57.702500 #223805] INFO -- : make[1]: Leaving directory '/tmp/ruby/build/trunk' I, [2024-04-30T01:12:58.498661 #223805] INFO -- : make[1]: Leaving directory '/tmp/ruby/build/trunk' I, [2024-04-30T01:12:58.500829 #223805] INFO -- : generating makefile exts.mk I, [2024-04-30T01:12:58.837161 #223805] INFO -- : exts.mk unchanged I, [2024-04-30T01:12:58.874775 #223805] INFO -- : make[1]: Entering directory '/tmp/ruby/build/trunk' I, [2024-04-30T01:12:59.387498 #223805] INFO -- : make[2]: Entering directory '/tmp/ruby/build/trunk/ext/digest' I, [2024-04-30T01:12:59.395248 #223805] INFO -- : make[2]: Entering directory '/tmp/ruby/build/trunk/ext/coverage' I, [2024-04-30T01:12:59.400311 #223805] INFO -- : make[2]: Entering directory '/tmp/ruby/build/trunk/ext/date' I, [2024-04-30T01:12:59.418758 #223805] INFO -- : make[2]: Leaving directory '/tmp/ruby/build/trunk/ext/coverage' I, [2024-04-30T01:12:59.432361 #223805] INFO -- : make[2]: Leaving directory '/tmp/ruby/build/trunk/ext/date' I, [2024-04-30T01:12:59.442219 #223805] INFO -- : make[2]: Leaving directory '/tmp/ruby/build/trunk/ext/digest' I, [2024-04-30T01:12:59.459706 #223805] INFO -- : make[2]: Entering directory '/tmp/ruby/build/trunk/ext/io/console' I, [2024-04-30T01:12:59.469039 #223805] INFO -- : make[2]: Entering directory '/tmp/ruby/build/trunk/ext/fiddle' I, [2024-04-30T01:12:59.479871 #223805] INFO -- : make[2]: Leaving directory '/tmp/ruby/build/trunk/ext/io/console' I, [2024-04-30T01:12:59.483573 #223805] INFO -- : make[2]: Entering directory '/tmp/ruby/build/trunk/ext/json' I, [2024-04-30T01:12:59.504570 #223805] INFO -- : make[2]: Entering directory '/tmp/ruby/build/trunk/ext/monitor' I, [2024-04-30T01:12:59.522231 #223805] INFO -- : make[2]: Leaving directory '/tmp/ruby/build/trunk/ext/fiddle' I, [2024-04-30T01:12:59.524014 #223805] INFO -- : make[2]: Leaving directory '/tmp/ruby/build/trunk/ext/monitor' I, [2024-04-30T01:12:59.527531 #223805] INFO -- : make[2]: Entering directory '/tmp/ruby/build/trunk/ext/objspace' I, [2024-04-30T01:12:59.546177 #223805] INFO -- : make[2]: Leaving directory '/tmp/ruby/build/trunk/ext/json' I, [2024-04-30T01:12:59.551681 #223805] INFO -- : make[2]: Entering directory '/tmp/ruby/build/trunk/ext/pathname' I, [2024-04-30T01:12:59.569490 #223805] INFO -- : make[2]: Leaving directory '/tmp/ruby/build/trunk/ext/objspace' I, [2024-04-30T01:12:59.571226 #223805] INFO -- : make[2]: Leaving directory '/tmp/ruby/build/trunk/ext/pathname' I, [2024-04-30T01:12:59.586293 #223805] INFO -- : make[2]: Entering directory '/tmp/ruby/build/trunk/ext/psych' I, [2024-04-30T01:12:59.596851 #223805] INFO -- : make[2]: Entering directory '/tmp/ruby/build/trunk/ext/pty' I, [2024-04-30T01:12:59.616351 #223805] INFO -- : make[2]: Leaving directory '/tmp/ruby/build/trunk/ext/pty' I, [2024-04-30T01:12:59.627870 #223805] INFO -- : make[2]: Entering directory '/tmp/ruby/build/trunk/ext/rubyvm' I, [2024-04-30T01:12:59.636197 #223805] INFO -- : make[2]: Entering directory '/tmp/ruby/build/trunk/ext/openssl' I, [2024-04-30T01:12:59.643444 #223805] INFO -- : make[2]: Leaving directory '/tmp/ruby/build/trunk/ext/rubyvm' I, [2024-04-30T01:12:59.695696 #223805] INFO -- : make[2]: Entering directory '/tmp/ruby/build/trunk/ext/ripper' I, [2024-04-30T01:12:59.723915 #223805] INFO -- : make[2]: Leaving directory '/tmp/ruby/build/trunk/ext/psych' I, [2024-04-30T01:12:59.739483 #223805] INFO -- : make[2]: Entering directory '/tmp/ruby/build/trunk/ext/socket' I, [2024-04-30T01:12:59.747035 #223805] INFO -- : make[2]: Leaving directory '/tmp/ruby/build/trunk/ext/ripper' I, [2024-04-30T01:12:59.768564 #223805] INFO -- : make[2]: Leaving directory '/tmp/ruby/build/trunk/ext/openssl' I, [2024-04-30T01:12:59.783908 #223805] INFO -- : make[2]: Entering directory '/tmp/ruby/build/trunk/.bundle/gems/bigdecimal-3.1.7/ext/bigdecimal' I, [2024-04-30T01:12:59.790656 #223805] INFO -- : make[2]: Entering directory '/tmp/ruby/build/trunk/.bundle/gems/debug-1.9.2/ext/debug' I, [2024-04-30T01:12:59.795194 #223805] INFO -- : make[2]: Entering directory '/tmp/ruby/build/trunk/.bundle/gems/nkf-0.2.0/ext/nkf' I, [2024-04-30T01:12:59.805848 #223805] INFO -- : make[2]: Leaving directory '/tmp/ruby/build/trunk/ext/socket' I, [2024-04-30T01:12:59.820997 #223805] INFO -- : make[2]: Entering directory '/tmp/ruby/build/trunk/.bundle/gems/racc-1.7.3/ext/racc/cparse' I, [2024-04-30T01:12:59.949874 #223805] INFO -- : make[2]: Leaving directory '/tmp/ruby/build/trunk/.bundle/gems/bigdecimal-3.1.7/ext/bigdecimal' I, [2024-04-30T01:12:59.954939 #223805] INFO -- : make[2]: Leaving directory '/tmp/ruby/build/trunk/.bundle/gems/debug-1.9.2/ext/debug' I, [2024-04-30T01:12:59.961774 #223805] INFO -- : make[2]: Leaving directory '/tmp/ruby/build/trunk/.bundle/gems/nkf-0.2.0/ext/nkf' I, [2024-04-30T01:12:59.968815 #223805] INFO -- : make[2]: Entering directory '/tmp/ruby/build/trunk/.bundle/gems/rbs-3.4.4/ext/rbs_extension' I, [2024-04-30T01:12:59.978442 #223805] INFO -- : make[2]: Entering directory '/tmp/ruby/build/trunk/.bundle/gems/syslog-0.1.2/ext/syslog' I, [2024-04-30T01:12:59.991954 #223805] INFO -- : make[2]: Leaving directory '/tmp/ruby/build/trunk/.bundle/gems/racc-1.7.3/ext/racc/cparse' I, [2024-04-30T01:13:00.054530 #223805] INFO -- : make[2]: Entering directory '/tmp/ruby/build/trunk/ext/digest/sha2' I, [2024-04-30T01:13:00.093628 #223805] INFO -- : make[2]: Leaving directory '/tmp/ruby/build/trunk/ext/digest/sha2' I, [2024-04-30T01:13:00.131287 #223805] INFO -- : make[2]: Leaving directory '/tmp/ruby/build/trunk/.bundle/gems/rbs-3.4.4/ext/rbs_extension' I, [2024-04-30T01:13:00.140895 #223805] INFO -- : make[2]: Leaving directory '/tmp/ruby/build/trunk/.bundle/gems/syslog-0.1.2/ext/syslog' I, [2024-04-30T01:13:00.358002 #223805] INFO -- : make[2]: Entering directory '/tmp/ruby/build/trunk' I, [2024-04-30T01:13:01.009625 #223805] INFO -- : linking ruby I, [2024-04-30T01:13:01.212658 #223805] INFO -- : make[2]: Leaving directory '/tmp/ruby/build/trunk' I, [2024-04-30T01:13:01.215513 #223805] INFO -- : make[1]: Leaving directory '/tmp/ruby/build/trunk' I, [2024-04-30T01:13:01.257516 #223805] INFO -- : make[1]: Entering directory '/tmp/ruby/build/trunk' I, [2024-04-30T01:13:01.257796 #223805] INFO -- : make[1]: Nothing to be done for 'note'. I, [2024-04-30T01:13:01.258005 #223805] INFO -- : make[1]: Leaving directory '/tmp/ruby/build/trunk' I, [2024-04-30T01:13:01.261440 #223805] INFO -- : $$$[end] "make all -j4" exit with 0. I, [2024-04-30T01:13:01.262163 #223805] INFO -- : $$$[beg] make install -j4 I, [2024-04-30T01:13:01.832002 #223805] INFO -- : Update minitest to ea9caafc0754b1d6236a490d59e624b53209734a I, [2024-04-30T01:13:01.833188 #223805] INFO -- : Update power_assert to 84e85124c5014a139af39161d484156cfe87a9ed I, [2024-04-30T01:13:01.833442 #223805] INFO -- : Update rbs to ba7872795d5de04adb8ff500c0e6afdc81a041dd I, [2024-04-30T01:13:01.835638 #223805] INFO -- : Update typeprof to b19a6416da3a05d57fadd6ffdadb382b6d236ca5 I, [2024-04-30T01:13:01.843275 #223805] INFO -- : echo ea9caafc0754b1d6236a490d59e624b53209734a | /bin/sh /tmp/ruby/src/trunk/tool/ifchange /tmp/ruby/src/trunk/.bundle/.timestamp/minitest.revision - I, [2024-04-30T01:13:01.848921 #223805] INFO -- : echo 84e85124c5014a139af39161d484156cfe87a9ed | /bin/sh /tmp/ruby/src/trunk/tool/ifchange /tmp/ruby/src/trunk/.bundle/.timestamp/power_assert.revision - I, [2024-04-30T01:13:01.850297 #223805] INFO -- : echo ba7872795d5de04adb8ff500c0e6afdc81a041dd | /bin/sh /tmp/ruby/src/trunk/tool/ifchange /tmp/ruby/src/trunk/.bundle/.timestamp/rbs.revision - I, [2024-04-30T01:13:01.853448 #223805] INFO -- : echo b19a6416da3a05d57fadd6ffdadb382b6d236ca5 | /bin/sh /tmp/ruby/src/trunk/tool/ifchange /tmp/ruby/src/trunk/.bundle/.timestamp/typeprof.revision - I, [2024-04-30T01:13:01.857058 #223805] INFO -- : /tmp/ruby/src/trunk/.bundle/.timestamp/minitest.revision unchanged I, [2024-04-30T01:13:01.859795 #223805] INFO -- : /tmp/ruby/src/trunk/.bundle/.timestamp/power_assert.revision unchanged I, [2024-04-30T01:13:01.862121 #223805] INFO -- : /tmp/ruby/src/trunk/.bundle/.timestamp/rbs.revision unchanged I, [2024-04-30T01:13:01.863906 #223805] INFO -- : BASERUBY = /usr/bin/ruby --disable=gems I, [2024-04-30T01:13:01.864116 #223805] INFO -- : CC = gcc I, [2024-04-30T01:13:01.864287 #223805] INFO -- : LD = ld I, [2024-04-30T01:13:01.864431 #223805] INFO -- : LDSHARED = gcc -shared I, [2024-04-30T01:13:01.864593 #223805] INFO -- : CFLAGS = -O3 -fno-fast-math -ggdb3 -Wall -Wextra -Wdeprecated-declarations -Wdiv-by-zero -Wduplicated-cond -Wimplicit-function-declaration -Wimplicit-int -Wpointer-arith -Wwrite-strings -Wold-style-definition -Wimplicit-fallthrough=0 -Wmissing-noreturn -Wno-cast-function-type -Wno-constant-logical-operand -Wno-long-long -Wno-missing-field-initializers -Wno-overlength-strings -Wno-packed-bitfield-compat -Wno-parentheses-equality -Wno-self-assign -Wno-tautological-compare -Wno-unused-parameter -Wno-unused-value -Wsuggest-attribute=format -Wsuggest-attribute=noreturn -Wunused-variable -Wmisleading-indentation -Wundef -fPIC I, [2024-04-30T01:13:01.864765 #223805] INFO -- : XCFLAGS = -U_FORTIFY_SOURCE -D_FORTIFY_SOURCE=2 -fstack-protector-strong -fno-strict-overflow -fvisibility=hidden -fexcess-precision=standard -DRUBY_EXPORT -I. -I.ext/include/riscv64-linux -I/tmp/ruby/src/trunk/include -I/tmp/ruby/src/trunk -I/tmp/ruby/src/trunk/prism -I/tmp/ruby/src/trunk/enc/unicode/15.0.0 I, [2024-04-30T01:13:01.864915 #223805] INFO -- : CPPFLAGS = I, [2024-04-30T01:13:01.865043 #223805] INFO -- : DLDFLAGS = -Wl,--compress-debug-sections=zlib -Wl,-soname,libruby.so.3.4 -fstack-protector-strong I, [2024-04-30T01:13:01.865158 #223805] INFO -- : SOLIBS = -lz -lrt -lrt -lgmp -ldl -lcrypt -lm -lpthread I, [2024-04-30T01:13:01.865494 #223805] INFO -- : LANG = I, [2024-04-30T01:13:01.865623 #223805] INFO -- : LC_ALL = I, [2024-04-30T01:13:01.865727 #223805] INFO -- : LC_CTYPE = I, [2024-04-30T01:13:01.865832 #223805] INFO -- : MFLAGS = -j4 --jobserver-auth=4,5 I, [2024-04-30T01:13:01.865936 #223805] INFO -- : RUSTC = rustc I, [2024-04-30T01:13:01.866053 #223805] INFO -- : YJIT_RUSTC_ARGS = --crate-name=yjit --crate-type=staticlib --edition=2021 -g -C lto=thin -C opt-level=3 -C overflow-checks=on '--out-dir=/tmp/ruby/build/trunk/yjit/target/release/' /tmp/ruby/src/trunk/yjit/src/lib.rs I, [2024-04-30T01:13:01.869805 #223805] INFO -- : /tmp/ruby/src/trunk/.bundle/.timestamp/typeprof.revision unchanged I, [2024-04-30T01:13:02.165195 #223805] INFO -- : generating enc.mk I, [2024-04-30T01:13:02.166189 #223805] INFO -- : gcc (Debian 13.2.0-4revyos1) 13.2.0 I, [2024-04-30T01:13:02.166379 #223805] INFO -- : Copyright (C) 2023 Free Software Foundation, Inc. I, [2024-04-30T01:13:02.166486 #223805] INFO -- : This is free software; see the source for copying conditions. There is NO I, [2024-04-30T01:13:02.166653 #223805] INFO -- : warranty; not even for MERCHANTABILITY or FITNESS FOR A PARTICULAR PURPOSE. I, [2024-04-30T01:13:02.166774 #223805] INFO -- : I, [2024-04-30T01:13:03.680804 #223805] INFO -- : making srcs under enc I, [2024-04-30T01:13:04.013672 #223805] INFO -- : make[1]: Entering directory '/tmp/ruby/build/trunk' I, [2024-04-30T01:13:04.013898 #223805] INFO -- : make[1]: Nothing to be done for 'srcs'. I, [2024-04-30T01:13:04.014033 #223805] INFO -- : make[1]: Leaving directory '/tmp/ruby/build/trunk' I, [2024-04-30T01:13:04.016971 #223805] INFO -- : making enc I, [2024-04-30T01:13:04.190969 #223805] INFO -- : make[1]: Entering directory '/tmp/ruby/build/trunk' I, [2024-04-30T01:13:04.191184 #223805] INFO -- : make[1]: Nothing to be done for 'enc'. I, [2024-04-30T01:13:04.191321 #223805] INFO -- : make[1]: Leaving directory '/tmp/ruby/build/trunk' I, [2024-04-30T01:13:04.194330 #223805] INFO -- : generating transdb.h I, [2024-04-30T01:13:04.537329 #223805] INFO -- : Building power_assert@84e85124c5014a139af39161d484156cfe87a9ed to /tmp/ruby/src/trunk/gems/power_assert-2.0.3.gem I, [2024-04-30T01:13:05.430790 #223805] INFO -- : transdb.h unchanged I, [2024-04-30T01:13:05.436792 #223805] INFO -- : generating makefiles ext/configure-ext.mk I, [2024-04-30T01:13:05.437563 #223805] INFO -- : making trans I, [2024-04-30T01:13:05.483752 #223805] INFO -- : Successfully built RubyGem I, [2024-04-30T01:13:05.483959 #223805] INFO -- : Name: power_assert I, [2024-04-30T01:13:05.484056 #223805] INFO -- : Version: 2.0.4dev I, [2024-04-30T01:13:05.484148 #223805] INFO -- : File: power_assert-2.0.4dev.gem I, [2024-04-30T01:13:05.500035 #223805] INFO -- : Extracting bundle gem power_assert-2.0.3... I, [2024-04-30T01:13:05.637179 #223805] INFO -- : ext/configure-ext.mk unchanged I, [2024-04-30T01:13:05.649398 #223805] INFO -- : make[1]: Entering directory '/tmp/ruby/build/trunk' I, [2024-04-30T01:13:05.810497 #223805] INFO -- : make[1]: Entering directory '/tmp/ruby/build/trunk' I, [2024-04-30T01:13:05.810752 #223805] INFO -- : make[1]: Nothing to be done for 'trans'. I, [2024-04-30T01:13:05.810895 #223805] INFO -- : make[1]: Leaving directory '/tmp/ruby/build/trunk' I, [2024-04-30T01:13:05.813918 #223805] INFO -- : making encs I, [2024-04-30T01:13:06.240370 #223805] INFO -- : make[1]: Entering directory '/tmp/ruby/build/trunk' I, [2024-04-30T01:13:06.240625 #223805] INFO -- : make[1]: Nothing to be done for 'encs'. I, [2024-04-30T01:13:06.240781 #223805] INFO -- : make[1]: Leaving directory '/tmp/ruby/build/trunk' I, [2024-04-30T01:13:06.465890 #223805] INFO -- : Try with hash version of bundled gems instead of gems/power_assert-2.0.3.gem. We don't use this gem with release version of Ruby. I, [2024-04-30T01:13:06.530467 #223805] INFO -- : Unpacked gems/power_assert-2.0.4dev.gem I, [2024-04-30T01:13:09.406634 #223805] INFO -- : make[1]: Leaving directory '/tmp/ruby/build/trunk' I, [2024-04-30T01:13:09.409111 #223805] INFO -- : generating makefile exts.mk I, [2024-04-30T01:13:09.759147 #223805] INFO -- : exts.mk unchanged I, [2024-04-30T01:13:09.797481 #223805] INFO -- : make[1]: Entering directory '/tmp/ruby/build/trunk' I, [2024-04-30T01:13:10.313002 #223805] INFO -- : make[2]: Entering directory '/tmp/ruby/build/trunk/ext/digest' I, [2024-04-30T01:13:10.313309 #223805] INFO -- : make[2]: Entering directory '/tmp/ruby/build/trunk/ext/coverage' I, [2024-04-30T01:13:10.324559 #223805] INFO -- : make[2]: Entering directory '/tmp/ruby/build/trunk/ext/date' I, [2024-04-30T01:13:10.335406 #223805] INFO -- : make[2]: Leaving directory '/tmp/ruby/build/trunk/ext/coverage' I, [2024-04-30T01:13:10.345669 #223805] INFO -- : make[2]: Leaving directory '/tmp/ruby/build/trunk/ext/digest' I, [2024-04-30T01:13:10.350147 #223805] INFO -- : make[2]: Leaving directory '/tmp/ruby/build/trunk/ext/date' I, [2024-04-30T01:13:10.377161 #223805] INFO -- : make[2]: Entering directory '/tmp/ruby/build/trunk/ext/io/console' I, [2024-04-30T01:13:10.389734 #223805] INFO -- : make[2]: Entering directory '/tmp/ruby/build/trunk/ext/fiddle' I, [2024-04-30T01:13:10.398099 #223805] INFO -- : make[2]: Leaving directory '/tmp/ruby/build/trunk/ext/io/console' I, [2024-04-30T01:13:10.402452 #223805] INFO -- : make[2]: Entering directory '/tmp/ruby/build/trunk/ext/json' I, [2024-04-30T01:13:10.439309 #223805] INFO -- : make[2]: Entering directory '/tmp/ruby/build/trunk/ext/objspace' I, [2024-04-30T01:13:10.440370 #223805] INFO -- : make[2]: Entering directory '/tmp/ruby/build/trunk/ext/monitor' I, [2024-04-30T01:13:10.450796 #223805] INFO -- : make[2]: Leaving directory '/tmp/ruby/build/trunk/ext/json' I, [2024-04-30T01:13:10.461353 #223805] INFO -- : make[2]: Leaving directory '/tmp/ruby/build/trunk/ext/monitor' I, [2024-04-30T01:13:10.462712 #223805] INFO -- : make[2]: Leaving directory '/tmp/ruby/build/trunk/ext/fiddle' I, [2024-04-30T01:13:10.465881 #223805] INFO -- : make[2]: Leaving directory '/tmp/ruby/build/trunk/ext/objspace' I, [2024-04-30T01:13:10.488961 #223805] INFO -- : make[2]: Entering directory '/tmp/ruby/build/trunk/ext/pathname' I, [2024-04-30T01:13:10.492979 #223805] INFO -- : make[2]: Entering directory '/tmp/ruby/build/trunk/ext/pty' I, [2024-04-30T01:13:10.501789 #223805] INFO -- : make[2]: Entering directory '/tmp/ruby/build/trunk/ext/psych' I, [2024-04-30T01:13:10.509121 #223805] INFO -- : make[2]: Leaving directory '/tmp/ruby/build/trunk/ext/pathname' I, [2024-04-30T01:13:10.511364 #223805] INFO -- : make[2]: Leaving directory '/tmp/ruby/build/trunk/ext/pty' I, [2024-04-30T01:13:10.558029 #223805] INFO -- : make[2]: Entering directory '/tmp/ruby/build/trunk/ext/rubyvm' I, [2024-04-30T01:13:10.574613 #223805] INFO -- : make[2]: Leaving directory '/tmp/ruby/build/trunk/ext/rubyvm' I, [2024-04-30T01:13:10.576130 #223805] INFO -- : make[2]: Entering directory '/tmp/ruby/build/trunk/ext/openssl' I, [2024-04-30T01:13:10.613721 #223805] INFO -- : make[2]: Entering directory '/tmp/ruby/build/trunk/ext/ripper' I, [2024-04-30T01:13:10.646448 #223805] INFO -- : make[2]: Leaving directory '/tmp/ruby/build/trunk/ext/psych' I, [2024-04-30T01:13:10.649836 #223805] INFO -- : make[2]: Entering directory '/tmp/ruby/build/trunk/ext/socket' I, [2024-04-30T01:13:10.657703 #223805] INFO -- : make[2]: Leaving directory '/tmp/ruby/build/trunk/ext/ripper' I, [2024-04-30T01:13:10.690065 #223805] INFO -- : make[2]: Leaving directory '/tmp/ruby/build/trunk/ext/openssl' I, [2024-04-30T01:13:10.701254 #223805] INFO -- : make[2]: Entering directory '/tmp/ruby/build/trunk/.bundle/gems/bigdecimal-3.1.7/ext/bigdecimal' I, [2024-04-30T01:13:10.708628 #223805] INFO -- : make[2]: Entering directory '/tmp/ruby/build/trunk/.bundle/gems/debug-1.9.2/ext/debug' I, [2024-04-30T01:13:10.709782 #223805] INFO -- : make[2]: Leaving directory '/tmp/ruby/build/trunk/ext/socket' I, [2024-04-30T01:13:10.723449 #223805] INFO -- : make[2]: Entering directory '/tmp/ruby/build/trunk/.bundle/gems/nkf-0.2.0/ext/nkf' I, [2024-04-30T01:13:10.724593 #223805] INFO -- : make[2]: Entering directory '/tmp/ruby/build/trunk/.bundle/gems/racc-1.7.3/ext/racc/cparse' I, [2024-04-30T01:13:10.867308 #223805] INFO -- : make[2]: Leaving directory '/tmp/ruby/build/trunk/.bundle/gems/bigdecimal-3.1.7/ext/bigdecimal' I, [2024-04-30T01:13:10.868211 #223805] INFO -- : make[2]: Leaving directory '/tmp/ruby/build/trunk/.bundle/gems/debug-1.9.2/ext/debug' I, [2024-04-30T01:13:10.883218 #223805] INFO -- : make[2]: Entering directory '/tmp/ruby/build/trunk/.bundle/gems/syslog-0.1.2/ext/syslog' I, [2024-04-30T01:13:10.886328 #223805] INFO -- : make[2]: Entering directory '/tmp/ruby/build/trunk/.bundle/gems/rbs-3.4.4/ext/rbs_extension' I, [2024-04-30T01:13:10.895974 #223805] INFO -- : make[2]: Leaving directory '/tmp/ruby/build/trunk/.bundle/gems/nkf-0.2.0/ext/nkf' I, [2024-04-30T01:13:10.898437 #223805] INFO -- : make[2]: Leaving directory '/tmp/ruby/build/trunk/.bundle/gems/racc-1.7.3/ext/racc/cparse' I, [2024-04-30T01:13:10.986254 #223805] INFO -- : make[2]: Entering directory '/tmp/ruby/build/trunk/ext/digest/sha2' I, [2024-04-30T01:13:11.021552 #223805] INFO -- : make[2]: Leaving directory '/tmp/ruby/build/trunk/ext/digest/sha2' I, [2024-04-30T01:13:11.048004 #223805] INFO -- : make[2]: Leaving directory '/tmp/ruby/build/trunk/.bundle/gems/rbs-3.4.4/ext/rbs_extension' I, [2024-04-30T01:13:11.056720 #223805] INFO -- : make[2]: Leaving directory '/tmp/ruby/build/trunk/.bundle/gems/syslog-0.1.2/ext/syslog' I, [2024-04-30T01:13:11.286361 #223805] INFO -- : make[2]: Entering directory '/tmp/ruby/build/trunk' I, [2024-04-30T01:13:11.933646 #223805] INFO -- : make[2]: 'ruby' is up to date. I, [2024-04-30T01:13:11.933864 #223805] INFO -- : make[2]: Leaving directory '/tmp/ruby/build/trunk' I, [2024-04-30T01:13:11.936777 #223805] INFO -- : make[1]: Leaving directory '/tmp/ruby/build/trunk' I, [2024-04-30T01:13:11.977882 #223805] INFO -- : make[1]: Entering directory '/tmp/ruby/build/trunk' I, [2024-04-30T01:13:11.978080 #223805] INFO -- : make[1]: Nothing to be done for 'note'. I, [2024-04-30T01:13:11.978177 #223805] INFO -- : make[1]: Leaving directory '/tmp/ruby/build/trunk' I, [2024-04-30T01:13:11.979168 #223805] INFO -- : ./miniruby -I/tmp/ruby/src/trunk/lib -I. -I.ext/common /tmp/ruby/src/trunk/tool/runruby.rb --extout=.ext -- --disable-gems -r./riscv64-linux-fake /tmp/ruby/src/trunk/tool/rbinstall.rb --make="make" --dest-dir="" --extout=".ext" --ext-build-dir="./ext" --mflags="-j4 --jobserver-auth=4,5" --make-flags=" -j4 --jobserver-auth=4,5" --data-mode=0644 --prog-mode=0755 --installed-list .installed.list --mantype="doc" --gnumake --install=all --exclude=doc I, [2024-04-30T01:13:13.266043 #223805] INFO -- : Installing to I, [2024-04-30T01:13:13.266279 #223805] INFO -- : installing binary commands: /tmp/ruby/install/trunk/bin I, [2024-04-30T01:13:13.268342 #223805] INFO -- : installing base libraries: /tmp/ruby/install/trunk/lib I, [2024-04-30T01:13:13.338673 #223805] INFO -- : installing arch files: /tmp/ruby/install/trunk/lib/ruby/3.4.0+0/riscv64-linux I, [2024-04-30T01:13:13.339357 #223805] INFO -- : installing pkgconfig data: /tmp/ruby/install/trunk/lib/pkgconfig I, [2024-04-30T01:13:13.339875 #223805] INFO -- : installing extension objects: /tmp/ruby/install/trunk/lib/ruby/3.4.0+0/riscv64-linux I, [2024-04-30T01:13:13.457831 #223805] INFO -- : installing extension objects: /tmp/ruby/install/trunk/lib/ruby/site_ruby/3.4.0+0/riscv64-linux I, [2024-04-30T01:13:13.458022 #223805] INFO -- : installing extension objects: /tmp/ruby/install/trunk/lib/ruby/vendor_ruby/3.4.0+0/riscv64-linux I, [2024-04-30T01:13:13.458505 #223805] INFO -- : installing extension headers: /tmp/ruby/install/trunk/include/ruby-3.4.0+0/riscv64-linux I, [2024-04-30T01:13:13.460533 #223805] INFO -- : installing extension scripts: /tmp/ruby/install/trunk/lib/ruby/3.4.0+0 I, [2024-04-30T01:13:13.508945 #223805] INFO -- : installing extension scripts: /tmp/ruby/install/trunk/lib/ruby/site_ruby/3.4.0+0 I, [2024-04-30T01:13:13.509129 #223805] INFO -- : installing extension scripts: /tmp/ruby/install/trunk/lib/ruby/vendor_ruby/3.4.0+0 I, [2024-04-30T01:13:13.509219 #223805] INFO -- : installing extension headers: /tmp/ruby/install/trunk/include/ruby-3.4.0+0/ruby I, [2024-04-30T01:13:13.510052 #223805] INFO -- : installing command scripts: /tmp/ruby/install/trunk/bin I, [2024-04-30T01:13:13.510877 #223805] INFO -- : installing library scripts: /tmp/ruby/install/trunk/lib/ruby/3.4.0+0 I, [2024-04-30T01:13:14.032999 #223805] INFO -- : installing common headers: /tmp/ruby/install/trunk/include/ruby-3.4.0+0 I, [2024-04-30T01:13:14.120252 #223805] INFO -- : installing manpages: /tmp/ruby/install/trunk/share/man/man1 I, [2024-04-30T01:13:14.122495 #223805] INFO -- : installing default gems from lib: /tmp/ruby/install/trunk/lib/ruby/gems/3.4.0+0 I, [2024-04-30T01:13:14.428746 #223805] INFO -- : benchmark 0.3.0 I, [2024-04-30T01:13:14.530708 #223805] INFO -- : bundler 2.6.0.dev I, [2024-04-30T01:13:14.548948 #223805] INFO -- : cgi 0.4.1 I, [2024-04-30T01:13:14.555735 #223805] INFO -- : delegate 0.3.1 I, [2024-04-30T01:13:14.562407 #223805] INFO -- : did_you_mean 1.6.3 I, [2024-04-30T01:13:14.576238 #223805] INFO -- : english 0.8.0 I, [2024-04-30T01:13:14.582874 #223805] INFO -- : erb 4.0.4 I, [2024-04-30T01:13:14.592810 #223805] INFO -- : error_highlight 0.6.0 I, [2024-04-30T01:13:14.599373 #223805] INFO -- : fileutils 1.7.2 I, [2024-04-30T01:13:14.606141 #223805] INFO -- : find 0.2.0 I, [2024-04-30T01:13:14.613059 #223805] INFO -- : forwardable 1.3.3 I, [2024-04-30T01:13:14.619594 #223805] INFO -- : ipaddr 1.2.6 I, [2024-04-30T01:13:14.626237 #223805] INFO -- : irb 1.12.0 I, [2024-04-30T01:13:14.637796 #223805] INFO -- : logger 1.6.0 I, [2024-04-30T01:13:14.644471 #223805] INFO -- : net-http 0.4.1 I, [2024-04-30T01:13:14.651481 #223805] INFO -- : net-protocol 0.2.2 I, [2024-04-30T01:13:14.658522 #223805] INFO -- : open-uri 0.4.1 I, [2024-04-30T01:13:14.665689 #223805] INFO -- : open3 0.2.1 I, [2024-04-30T01:13:14.672515 #223805] INFO -- : optparse 0.5.0 I, [2024-04-30T01:13:14.685127 #223805] INFO -- : ostruct 0.6.0 I, [2024-04-30T01:13:14.693746 #223805] INFO -- : pp 0.5.0 I, [2024-04-30T01:13:14.700767 #223805] INFO -- : prettyprint 0.2.0 I, [2024-04-30T01:13:14.707506 #223805] INFO -- : prism 0.27.0 I, [2024-04-30T01:13:14.714585 #223805] INFO -- : pstore 0.1.3 I, [2024-04-30T01:13:14.721220 #223805] INFO -- : rdoc 6.6.3.1 I, [2024-04-30T01:13:14.735300 #223805] INFO -- : readline 0.0.4 I, [2024-04-30T01:13:14.742061 #223805] INFO -- : reline 0.5.4 I, [2024-04-30T01:13:14.749690 #223805] INFO -- : resolv 0.4.0 I, [2024-04-30T01:13:14.756498 #223805] INFO -- : ruby2_keywords 0.0.5 I, [2024-04-30T01:13:14.763268 #223805] INFO -- : securerandom 0.3.1 I, [2024-04-30T01:13:14.770148 #223805] INFO -- : set 1.1.0 I, [2024-04-30T01:13:14.777010 #223805] INFO -- : shellwords 0.2.0 I, [2024-04-30T01:13:14.783747 #223805] INFO -- : singleton 0.2.0 I, [2024-04-30T01:13:14.795789 #223805] INFO -- : syntax_suggest 2.0.0 I, [2024-04-30T01:13:14.807374 #223805] INFO -- : tempfile 0.2.1 I, [2024-04-30T01:13:14.814181 #223805] INFO -- : time 0.3.0 I, [2024-04-30T01:13:14.821243 #223805] INFO -- : timeout 0.4.1 I, [2024-04-30T01:13:14.828094 #223805] INFO -- : tmpdir 0.2.0 I, [2024-04-30T01:13:14.835157 #223805] INFO -- : tsort 0.2.0 I, [2024-04-30T01:13:14.842112 #223805] INFO -- : un 0.3.0 I, [2024-04-30T01:13:14.849113 #223805] INFO -- : uri 0.13.0 I, [2024-04-30T01:13:14.857557 #223805] INFO -- : weakref 0.1.3 I, [2024-04-30T01:13:14.863626 #223805] INFO -- : yaml 0.3.0 I, [2024-04-30T01:13:14.869003 #223805] INFO -- : installing default gems from ext: /tmp/ruby/install/trunk/lib/ruby/gems/3.4.0+0 I, [2024-04-30T01:13:14.946837 #223805] INFO -- : date 3.3.4 I, [2024-04-30T01:13:14.953767 #223805] INFO -- : digest 3.1.1 I, [2024-04-30T01:13:14.960607 #223805] INFO -- : etc 1.4.3 I, [2024-04-30T01:13:14.967675 #223805] INFO -- : fcntl 1.1.0 I, [2024-04-30T01:13:14.974655 #223805] INFO -- : fiddle 1.1.3 I, [2024-04-30T01:13:14.981915 #223805] INFO -- : io-console 0.7.2 I, [2024-04-30T01:13:14.988806 #223805] INFO -- : io-nonblock 0.3.0 I, [2024-04-30T01:13:14.995508 #223805] INFO -- : io-wait 0.3.1 I, [2024-04-30T01:13:15.002143 #223805] INFO -- : json 2.7.2 I, [2024-04-30T01:13:15.016089 #223805] INFO -- : openssl 3.2.0 I, [2024-04-30T01:13:15.023088 #223805] INFO -- : pathname 0.3.0 I, [2024-04-30T01:13:15.030005 #223805] INFO -- : psych 5.1.2 I, [2024-04-30T01:13:15.037733 #223805] INFO -- : stringio 3.1.1 I, [2024-04-30T01:13:15.045064 #223805] INFO -- : strscan 3.1.1 I, [2024-04-30T01:13:15.051814 #223805] INFO -- : zlib 3.1.0 I, [2024-04-30T01:13:15.057385 #223805] INFO -- : installing bundled gems: /tmp/ruby/install/trunk/lib/ruby/gems/3.4.0+0 I, [2024-04-30T01:13:15.062082 #223805] INFO -- : minitest 5.22.3 I, [2024-04-30T01:13:15.152275 #223805] INFO -- : rake 13.2.1 I, [2024-04-30T01:13:15.207820 #223805] INFO -- : test-unit 3.6.2 I, [2024-04-30T01:13:15.280921 #223805] INFO -- : rexml 3.2.6 I, [2024-04-30T01:13:15.340039 #223805] INFO -- : rss 0.3.0 I, [2024-04-30T01:13:15.382000 #223805] INFO -- : net-ftp 0.3.4 I, [2024-04-30T01:13:15.402034 #223805] INFO -- : net-imap 0.4.10 I, [2024-04-30T01:13:15.455087 #223805] INFO -- : net-pop 0.1.2 I, [2024-04-30T01:13:15.468097 #223805] INFO -- : net-smtp 0.5.0 I, [2024-04-30T01:13:15.484072 #223805] INFO -- : matrix 0.4.2 I, [2024-04-30T01:13:15.524209 #223805] INFO -- : prime 0.1.2 I, [2024-04-30T01:13:15.587305 #223805] INFO -- : rbs 3.4.4 I, [2024-04-30T01:13:15.973295 #223805] INFO -- : typeprof 0.21.11 I, [2024-04-30T01:13:16.007225 #223805] INFO -- : debug 1.9.2 I, [2024-04-30T01:13:16.052622 #223805] INFO -- : racc 1.7.3 I, [2024-04-30T01:13:16.093298 #223805] INFO -- : mutex_m 0.2.0 I, [2024-04-30T01:13:16.108984 #223805] INFO -- : getoptlong 0.2.1 I, [2024-04-30T01:13:16.129221 #223805] INFO -- : base64 0.2.0 I, [2024-04-30T01:13:16.147150 #223805] INFO -- : bigdecimal 3.1.7 I, [2024-04-30T01:13:16.175730 #223805] INFO -- : observer 0.1.2 I, [2024-04-30T01:13:16.190990 #223805] INFO -- : abbrev 0.1.2 I, [2024-04-30T01:13:16.206851 #223805] INFO -- : resolv-replace 0.1.1 I, [2024-04-30T01:13:16.222816 #223805] INFO -- : rinda 0.2.0 I, [2024-04-30T01:13:16.239984 #223805] INFO -- : drb 2.2.1 I, [2024-04-30T01:13:16.262206 #223805] INFO -- : nkf 0.2.0 I, [2024-04-30T01:13:16.300122 #223805] INFO -- : syslog 0.1.2 I, [2024-04-30T01:13:16.322695 #223805] INFO -- : csv 3.3.0 I, [2024-04-30T01:13:16.360392 #223805] INFO -- : installing bundled gem cache: /tmp/ruby/install/trunk/lib/ruby/gems/3.4.0+0/cache I, [2024-04-30T01:13:16.378868 #223805] INFO -- : skipped bundled gems: I, [2024-04-30T01:13:16.379095 #223805] INFO -- : power_assert-2.0.4dev.gem not found in bundled_gems I, [2024-04-30T01:13:16.403333 #223805] INFO -- : $$$[end] "make install -j4" exit with 0. I, [2024-04-30T01:13:16.404028 #223805] INFO -- : $$$[beg] make yes-btest TESTOPTS='-q -j4' I, [2024-04-30T01:14:24.620842 #223805] INFO -- : PASS all 1934 tests E, [2024-04-30T01:14:24.646722 #223805] ERROR -- : I, [2024-04-30T01:14:24.647254 #223805] INFO -- : $$$[end] "make yes-btest TESTOPTS='-q -j4'" exit with 0. I, [2024-04-30T01:14:24.647891 #223805] INFO -- : $$$[beg] make yes-test-basic TESTS='-j4' I, [2024-04-30T01:14:25.203089 #223805] INFO -- : BASERUBY = /usr/bin/ruby --disable=gems I, [2024-04-30T01:14:25.203359 #223805] INFO -- : CC = gcc I, [2024-04-30T01:14:25.203521 #223805] INFO -- : LD = ld I, [2024-04-30T01:14:25.203674 #223805] INFO -- : LDSHARED = gcc -shared I, [2024-04-30T01:14:25.203852 #223805] INFO -- : CFLAGS = -O3 -fno-fast-math -ggdb3 -Wall -Wextra -Wdeprecated-declarations -Wdiv-by-zero -Wduplicated-cond -Wimplicit-function-declaration -Wimplicit-int -Wpointer-arith -Wwrite-strings -Wold-style-definition -Wimplicit-fallthrough=0 -Wmissing-noreturn -Wno-cast-function-type -Wno-constant-logical-operand -Wno-long-long -Wno-missing-field-initializers -Wno-overlength-strings -Wno-packed-bitfield-compat -Wno-parentheses-equality -Wno-self-assign -Wno-tautological-compare -Wno-unused-parameter -Wno-unused-value -Wsuggest-attribute=format -Wsuggest-attribute=noreturn -Wunused-variable -Wmisleading-indentation -Wundef -fPIC I, [2024-04-30T01:14:25.204012 #223805] INFO -- : XCFLAGS = -U_FORTIFY_SOURCE -D_FORTIFY_SOURCE=2 -fstack-protector-strong -fno-strict-overflow -fvisibility=hidden -fexcess-precision=standard -DRUBY_EXPORT -I. -I.ext/include/riscv64-linux -I/tmp/ruby/src/trunk/include -I/tmp/ruby/src/trunk -I/tmp/ruby/src/trunk/prism -I/tmp/ruby/src/trunk/enc/unicode/15.0.0 I, [2024-04-30T01:14:25.204152 #223805] INFO -- : CPPFLAGS = I, [2024-04-30T01:14:25.204355 #223805] INFO -- : DLDFLAGS = -Wl,--compress-debug-sections=zlib -Wl,-soname,libruby.so.3.4 -fstack-protector-strong I, [2024-04-30T01:14:25.204502 #223805] INFO -- : SOLIBS = -lz -lrt -lrt -lgmp -ldl -lcrypt -lm -lpthread I, [2024-04-30T01:14:25.204635 #223805] INFO -- : LANG = I, [2024-04-30T01:14:25.204766 #223805] INFO -- : LC_ALL = I, [2024-04-30T01:14:25.204900 #223805] INFO -- : LC_CTYPE = I, [2024-04-30T01:14:25.205034 #223805] INFO -- : MFLAGS = I, [2024-04-30T01:14:25.205171 #223805] INFO -- : RUSTC = rustc I, [2024-04-30T01:14:25.205321 #223805] INFO -- : YJIT_RUSTC_ARGS = --crate-name=yjit --crate-type=staticlib --edition=2021 -g -C lto=thin -C opt-level=3 -C overflow-checks=on '--out-dir=/tmp/ruby/build/trunk/yjit/target/release/' /tmp/ruby/src/trunk/yjit/src/lib.rs I, [2024-04-30T01:14:25.208641 #223805] INFO -- : gcc (Debian 13.2.0-4revyos1) 13.2.0 I, [2024-04-30T01:14:25.208828 #223805] INFO -- : Copyright (C) 2023 Free Software Foundation, Inc. I, [2024-04-30T01:14:25.208917 #223805] INFO -- : This is free software; see the source for copying conditions. There is NO I, [2024-04-30T01:14:25.209001 #223805] INFO -- : warranty; not even for MERCHANTABILITY or FITNESS FOR A PARTICULAR PURPOSE. I, [2024-04-30T01:14:25.209087 #223805] INFO -- : I, [2024-04-30T01:14:27.134438 #223805] INFO -- : Checking leaked global symbols...none I, [2024-04-30T01:14:27.434185 #223805] INFO -- : /tmp/ruby/src/trunk/basictest/test.rb:assignment ....................................................................................................................................................................................................................................................................................................................................................................................OK 372 I, [2024-04-30T01:14:27.434441 #223805] INFO -- : /tmp/ruby/src/trunk/basictest/test.rb:condition ..OK 2 I, [2024-04-30T01:14:27.434545 #223805] INFO -- : /tmp/ruby/src/trunk/basictest/test.rb:if/unless ...OK 3 I, [2024-04-30T01:14:27.434830 #223805] INFO -- : /tmp/ruby/src/trunk/basictest/test.rb:case .....OK 5 I, [2024-04-30T01:14:27.436124 #223805] INFO -- : /tmp/ruby/src/trunk/basictest/test.rb:while/until ........OK 8 I, [2024-04-30T01:14:27.436972 #223805] INFO -- : /tmp/ruby/src/trunk/basictest/test.rb:exception ..........OK 10 I, [2024-04-30T01:14:27.439463 #223805] INFO -- : /tmp/ruby/src/trunk/basictest/test.rb:array .......................................OK 39 I, [2024-04-30T01:14:27.441084 #223805] INFO -- : /tmp/ruby/src/trunk/basictest/test.rb:hash ...........................OK 27 I, [2024-04-30T01:14:27.449650 #223805] INFO -- : /tmp/ruby/src/trunk/basictest/test.rb:iterator ...........................................................................................................OK 107 I, [2024-04-30T01:14:27.466067 #223805] INFO -- : /tmp/ruby/src/trunk/basictest/test.rb:float ................................................................................OK 80 I, [2024-04-30T01:14:27.477364 #223805] INFO -- : /tmp/ruby/src/trunk/basictest/test.rb:bignum ...............................OK 31 I, [2024-04-30T01:14:27.489282 #223805] INFO -- : /tmp/ruby/src/trunk/basictest/test.rb:string & char ..............................................................OK 62 I, [2024-04-30T01:14:27.489787 #223805] INFO -- : /tmp/ruby/src/trunk/basictest/test.rb:assignment ..........OK 10 I, [2024-04-30T01:14:27.490261 #223805] INFO -- : /tmp/ruby/src/trunk/basictest/test.rb:call ......OK 6 I, [2024-04-30T01:14:27.491052 #223805] INFO -- : /tmp/ruby/src/trunk/basictest/test.rb:proc .........OK 9 I, [2024-04-30T01:14:27.593040 #223805] INFO -- : /tmp/ruby/src/trunk/basictest/test.rb:signal ..OK 2 I, [2024-04-30T01:14:27.614744 #223805] INFO -- : /tmp/ruby/src/trunk/basictest/test.rb:eval ...........................OK 27 I, [2024-04-30T01:14:28.048683 #223805] INFO -- : /tmp/ruby/src/trunk/basictest/test.rb:system ........OK 8 I, [2024-04-30T01:14:28.049100 #223805] INFO -- : /tmp/ruby/src/trunk/basictest/test.rb:const .....OK 5 I, [2024-04-30T01:14:28.049624 #223805] INFO -- : /tmp/ruby/src/trunk/basictest/test.rb:clone .....OK 5 I, [2024-04-30T01:14:28.050665 #223805] INFO -- : /tmp/ruby/src/trunk/basictest/test.rb:marshal ....OK 4 I, [2024-04-30T01:14:28.051130 #223805] INFO -- : /tmp/ruby/src/trunk/basictest/test.rb:pack ....OK 4 I, [2024-04-30T01:14:28.051317 #223805] INFO -- : /tmp/ruby/src/trunk/basictest/test.rb:math ..OK 2 I, [2024-04-30T01:14:28.051813 #223805] INFO -- : /tmp/ruby/src/trunk/basictest/test.rb:struct ......OK 6 I, [2024-04-30T01:14:28.052870 #223805] INFO -- : /tmp/ruby/src/trunk/basictest/test.rb:variable ............OK 12 I, [2024-04-30T01:14:28.053113 #223805] INFO -- : /tmp/ruby/src/trunk/basictest/test.rb:trace ...OK 3 I, [2024-04-30T01:14:28.057159 #223805] INFO -- : /tmp/ruby/src/trunk/basictest/test.rb:defined? ............OK 12 I, [2024-04-30T01:14:28.057715 #223805] INFO -- : /tmp/ruby/src/trunk/basictest/test.rb:alias ......OK 6 I, [2024-04-30T01:14:28.060278 #223805] INFO -- : /tmp/ruby/src/trunk/basictest/test.rb:path .......................OK 23 I, [2024-04-30T01:14:28.443012 #223805] INFO -- : /tmp/ruby/src/trunk/basictest/test.rb:gc ....OK 4 I, [2024-04-30T01:14:28.459984 #223805] INFO -- : I, [2024-04-30T01:14:28.460237 #223805] INFO -- : test succeeded I, [2024-04-30T01:14:28.471695 #223805] INFO -- : $$$[end] "make yes-test-basic TESTS='-j4'" exit with 0. I, [2024-04-30T01:14:28.473008 #223805] INFO -- : $$$[beg] make yes-test-all TESTOPTS='--stderr-on-failure' TESTS='-j4' I, [2024-04-30T01:14:29.294970 #223805] INFO -- : BASERUBY = /usr/bin/ruby --disable=gems I, [2024-04-30T01:14:29.295252 #223805] INFO -- : CC = gcc I, [2024-04-30T01:14:29.295414 #223805] INFO -- : LD = ld I, [2024-04-30T01:14:29.295564 #223805] INFO -- : LDSHARED = gcc -shared I, [2024-04-30T01:14:29.295728 #223805] INFO -- : CFLAGS = -O3 -fno-fast-math -ggdb3 -Wall -Wextra -Wdeprecated-declarations -Wdiv-by-zero -Wduplicated-cond -Wimplicit-function-declaration -Wimplicit-int -Wpointer-arith -Wwrite-strings -Wold-style-definition -Wimplicit-fallthrough=0 -Wmissing-noreturn -Wno-cast-function-type -Wno-constant-logical-operand -Wno-long-long -Wno-missing-field-initializers -Wno-overlength-strings -Wno-packed-bitfield-compat -Wno-parentheses-equality -Wno-self-assign -Wno-tautological-compare -Wno-unused-parameter -Wno-unused-value -Wsuggest-attribute=format -Wsuggest-attribute=noreturn -Wunused-variable -Wmisleading-indentation -Wundef -fPIC I, [2024-04-30T01:14:29.295889 #223805] INFO -- : XCFLAGS = -U_FORTIFY_SOURCE -D_FORTIFY_SOURCE=2 -fstack-protector-strong -fno-strict-overflow -fvisibility=hidden -fexcess-precision=standard -DRUBY_EXPORT -I. -I.ext/include/riscv64-linux -I/tmp/ruby/src/trunk/include -I/tmp/ruby/src/trunk -I/tmp/ruby/src/trunk/prism -I/tmp/ruby/src/trunk/enc/unicode/15.0.0 I, [2024-04-30T01:14:29.296033 #223805] INFO -- : CPPFLAGS = I, [2024-04-30T01:14:29.296233 #223805] INFO -- : DLDFLAGS = -Wl,--compress-debug-sections=zlib -Wl,-soname,libruby.so.3.4 -fstack-protector-strong I, [2024-04-30T01:14:29.296404 #223805] INFO -- : SOLIBS = -lz -lrt -lrt -lgmp -ldl -lcrypt -lm -lpthread I, [2024-04-30T01:14:29.296543 #223805] INFO -- : LANG = I, [2024-04-30T01:14:29.296680 #223805] INFO -- : LC_ALL = I, [2024-04-30T01:14:29.296816 #223805] INFO -- : LC_CTYPE = I, [2024-04-30T01:14:29.296952 #223805] INFO -- : MFLAGS = I, [2024-04-30T01:14:29.297090 #223805] INFO -- : RUSTC = rustc I, [2024-04-30T01:14:29.297244 #223805] INFO -- : YJIT_RUSTC_ARGS = --crate-name=yjit --crate-type=staticlib --edition=2021 -g -C lto=thin -C opt-level=3 -C overflow-checks=on '--out-dir=/tmp/ruby/build/trunk/yjit/target/release/' /tmp/ruby/src/trunk/yjit/src/lib.rs I, [2024-04-30T01:14:29.300697 #223805] INFO -- : gcc (Debian 13.2.0-4revyos1) 13.2.0 I, [2024-04-30T01:14:29.301016 #223805] INFO -- : Copyright (C) 2023 Free Software Foundation, Inc. I, [2024-04-30T01:14:29.301243 #223805] INFO -- : This is free software; see the source for copying conditions. There is NO I, [2024-04-30T01:14:29.301471 #223805] INFO -- : warranty; not even for MERCHANTABILITY or FITNESS FOR A PARTICULAR PURPOSE. I, [2024-04-30T01:14:29.301697 #223805] INFO -- : I, [2024-04-30T01:14:29.325794 #223805] INFO -- : generating enc.mk I, [2024-04-30T01:14:30.856304 #223805] INFO -- : making enc I, [2024-04-30T01:14:31.023397 #223805] INFO -- : make[1]: Entering directory '/tmp/ruby/build/trunk' I, [2024-04-30T01:14:31.023606 #223805] INFO -- : make[1]: Nothing to be done for 'enc'. I, [2024-04-30T01:14:31.023713 #223805] INFO -- : make[1]: Leaving directory '/tmp/ruby/build/trunk' I, [2024-04-30T01:14:31.026200 #223805] INFO -- : making srcs under enc I, [2024-04-30T01:14:31.318714 #223805] INFO -- : make[1]: Entering directory '/tmp/ruby/build/trunk' I, [2024-04-30T01:14:31.318920 #223805] INFO -- : make[1]: Nothing to be done for 'srcs'. I, [2024-04-30T01:14:31.319023 #223805] INFO -- : make[1]: Leaving directory '/tmp/ruby/build/trunk' I, [2024-04-30T01:14:31.323789 #223805] INFO -- : generating transdb.h I, [2024-04-30T01:14:32.629552 #223805] INFO -- : transdb.h unchanged I, [2024-04-30T01:14:32.635288 #223805] INFO -- : making trans I, [2024-04-30T01:14:32.974244 #223805] INFO -- : make[1]: Entering directory '/tmp/ruby/build/trunk' I, [2024-04-30T01:14:32.974448 #223805] INFO -- : make[1]: Nothing to be done for 'trans'. I, [2024-04-30T01:14:32.974610 #223805] INFO -- : make[1]: Leaving directory '/tmp/ruby/build/trunk' I, [2024-04-30T01:14:32.977107 #223805] INFO -- : making encs I, [2024-04-30T01:14:33.371448 #223805] INFO -- : make[1]: Entering directory '/tmp/ruby/build/trunk' I, [2024-04-30T01:14:33.371648 #223805] INFO -- : make[1]: Nothing to be done for 'encs'. I, [2024-04-30T01:14:33.371758 #223805] INFO -- : make[1]: Leaving directory '/tmp/ruby/build/trunk' I, [2024-04-30T01:14:33.383931 #223805] INFO -- : generating makefiles ext/configure-ext.mk I, [2024-04-30T01:14:33.593714 #223805] INFO -- : ext/configure-ext.mk updated I, [2024-04-30T01:14:33.607288 #223805] INFO -- : make[1]: Entering directory '/tmp/ruby/build/trunk' I, [2024-04-30T01:14:45.797891 #223805] INFO -- : make[1]: Leaving directory '/tmp/ruby/build/trunk' I, [2024-04-30T01:14:45.799994 #223805] INFO -- : generating makefile exts.mk I, [2024-04-30T01:14:46.128482 #223805] INFO -- : exts.mk unchanged I, [2024-04-30T01:14:46.166916 #223805] INFO -- : make[1]: Entering directory '/tmp/ruby/build/trunk' I, [2024-04-30T01:14:48.386467 #223805] INFO -- : make[2]: Entering directory '/tmp/ruby/build/trunk/ext/coverage' I, [2024-04-30T01:14:48.410347 #223805] INFO -- : make[2]: Leaving directory '/tmp/ruby/build/trunk/ext/coverage' I, [2024-04-30T01:14:48.451233 #223805] INFO -- : make[2]: Entering directory '/tmp/ruby/build/trunk/ext/date' I, [2024-04-30T01:14:48.479462 #223805] INFO -- : make[2]: Leaving directory '/tmp/ruby/build/trunk/ext/date' I, [2024-04-30T01:14:48.503897 #223805] INFO -- : make[2]: Entering directory '/tmp/ruby/build/trunk/ext/digest' I, [2024-04-30T01:14:48.562723 #223805] INFO -- : make[2]: Leaving directory '/tmp/ruby/build/trunk/ext/digest' I, [2024-04-30T01:14:48.727807 #223805] INFO -- : make[2]: Entering directory '/tmp/ruby/build/trunk/ext/digest/sha2' I, [2024-04-30T01:14:48.755422 #223805] INFO -- : make[2]: Leaving directory '/tmp/ruby/build/trunk/ext/digest/sha2' I, [2024-04-30T01:14:48.875726 #223805] INFO -- : make[2]: Entering directory '/tmp/ruby/build/trunk/ext/fiddle' I, [2024-04-30T01:14:48.951025 #223805] INFO -- : make[2]: Leaving directory '/tmp/ruby/build/trunk/ext/fiddle' I, [2024-04-30T01:14:48.978902 #223805] INFO -- : make[2]: Entering directory '/tmp/ruby/build/trunk/ext/io/console' I, [2024-04-30T01:14:49.000207 #223805] INFO -- : make[2]: Leaving directory '/tmp/ruby/build/trunk/ext/io/console' I, [2024-04-30T01:14:49.095590 #223805] INFO -- : make[2]: Entering directory '/tmp/ruby/build/trunk/ext/json' I, [2024-04-30T01:14:49.157232 #223805] INFO -- : make[2]: Leaving directory '/tmp/ruby/build/trunk/ext/json' I, [2024-04-30T01:14:49.259125 #223805] INFO -- : make[2]: Entering directory '/tmp/ruby/build/trunk/ext/monitor' I, [2024-04-30T01:14:49.281116 #223805] INFO -- : make[2]: Leaving directory '/tmp/ruby/build/trunk/ext/monitor' I, [2024-04-30T01:14:49.333691 #223805] INFO -- : make[2]: Entering directory '/tmp/ruby/build/trunk/ext/objspace' I, [2024-04-30T01:14:49.367948 #223805] INFO -- : make[2]: Leaving directory '/tmp/ruby/build/trunk/ext/objspace' I, [2024-04-30T01:14:49.486558 #223805] INFO -- : make[2]: Entering directory '/tmp/ruby/build/trunk/ext/openssl' I, [2024-04-30T01:14:49.622152 #223805] INFO -- : make[2]: Leaving directory '/tmp/ruby/build/trunk/ext/openssl' I, [2024-04-30T01:14:49.649260 #223805] INFO -- : make[2]: Entering directory '/tmp/ruby/build/trunk/ext/pathname' I, [2024-04-30T01:14:49.669502 #223805] INFO -- : make[2]: Leaving directory '/tmp/ruby/build/trunk/ext/pathname' I, [2024-04-30T01:14:49.724455 #223805] INFO -- : make[2]: Entering directory '/tmp/ruby/build/trunk/ext/psych' I, [2024-04-30T01:14:49.897248 #223805] INFO -- : make[2]: Leaving directory '/tmp/ruby/build/trunk/ext/psych' I, [2024-04-30T01:14:49.926100 #223805] INFO -- : make[2]: Entering directory '/tmp/ruby/build/trunk/ext/pty' I, [2024-04-30T01:14:49.947057 #223805] INFO -- : make[2]: Leaving directory '/tmp/ruby/build/trunk/ext/pty' I, [2024-04-30T01:14:50.044209 #223805] INFO -- : make[2]: Entering directory '/tmp/ruby/build/trunk/ext/ripper' I, [2024-04-30T01:14:50.091594 #223805] INFO -- : make[2]: Leaving directory '/tmp/ruby/build/trunk/ext/ripper' I, [2024-04-30T01:14:50.103053 #223805] INFO -- : make[2]: Entering directory '/tmp/ruby/build/trunk/ext/rubyvm' I, [2024-04-30T01:14:50.118354 #223805] INFO -- : make[2]: Leaving directory '/tmp/ruby/build/trunk/ext/rubyvm' I, [2024-04-30T01:14:50.207779 #223805] INFO -- : make[2]: Entering directory '/tmp/ruby/build/trunk/ext/socket' I, [2024-04-30T01:14:50.270071 #223805] INFO -- : make[2]: Leaving directory '/tmp/ruby/build/trunk/ext/socket' I, [2024-04-30T01:14:50.396331 #223805] INFO -- : make[2]: Entering directory '/tmp/ruby/build/trunk/.bundle/gems/bigdecimal-3.1.7/ext/bigdecimal' I, [2024-04-30T01:14:50.554471 #223805] INFO -- : make[2]: Leaving directory '/tmp/ruby/build/trunk/.bundle/gems/bigdecimal-3.1.7/ext/bigdecimal' I, [2024-04-30T01:14:50.572752 #223805] INFO -- : make[2]: Entering directory '/tmp/ruby/build/trunk/.bundle/gems/debug-1.9.2/ext/debug' I, [2024-04-30T01:14:50.731960 #223805] INFO -- : make[2]: Leaving directory '/tmp/ruby/build/trunk/.bundle/gems/debug-1.9.2/ext/debug' I, [2024-04-30T01:14:50.749419 #223805] INFO -- : make[2]: Entering directory '/tmp/ruby/build/trunk/.bundle/gems/nkf-0.2.0/ext/nkf' I, [2024-04-30T01:14:50.909915 #223805] INFO -- : make[2]: Leaving directory '/tmp/ruby/build/trunk/.bundle/gems/nkf-0.2.0/ext/nkf' I, [2024-04-30T01:14:50.927972 #223805] INFO -- : make[2]: Entering directory '/tmp/ruby/build/trunk/.bundle/gems/racc-1.7.3/ext/racc/cparse' I, [2024-04-30T01:14:51.084413 #223805] INFO -- : make[2]: Leaving directory '/tmp/ruby/build/trunk/.bundle/gems/racc-1.7.3/ext/racc/cparse' I, [2024-04-30T01:14:51.106190 #223805] INFO -- : make[2]: Entering directory '/tmp/ruby/build/trunk/.bundle/gems/rbs-3.4.4/ext/rbs_extension' I, [2024-04-30T01:14:51.260276 #223805] INFO -- : make[2]: Leaving directory '/tmp/ruby/build/trunk/.bundle/gems/rbs-3.4.4/ext/rbs_extension' I, [2024-04-30T01:14:51.276878 #223805] INFO -- : make[2]: Entering directory '/tmp/ruby/build/trunk/.bundle/gems/syslog-0.1.2/ext/syslog' I, [2024-04-30T01:14:51.431329 #223805] INFO -- : make[2]: Leaving directory '/tmp/ruby/build/trunk/.bundle/gems/syslog-0.1.2/ext/syslog' I, [2024-04-30T01:14:51.654615 #223805] INFO -- : make[2]: Entering directory '/tmp/ruby/build/trunk' I, [2024-04-30T01:14:52.288879 #223805] INFO -- : make[2]: 'ruby' is up to date. I, [2024-04-30T01:14:52.289098 #223805] INFO -- : make[2]: Leaving directory '/tmp/ruby/build/trunk' I, [2024-04-30T01:14:52.290883 #223805] INFO -- : make[1]: Leaving directory '/tmp/ruby/build/trunk' I, [2024-04-30T01:14:52.324615 #223805] INFO -- : make[1]: Entering directory '/tmp/ruby/build/trunk' I, [2024-04-30T01:14:52.324810 #223805] INFO -- : make[1]: Nothing to be done for 'note'. I, [2024-04-30T01:14:52.324936 #223805] INFO -- : make[1]: Leaving directory '/tmp/ruby/build/trunk' I, [2024-04-30T01:14:53.079724 #223805] INFO -- : Run options: I, [2024-04-30T01:14:53.079931 #223805] INFO -- : --seed=29739 I, [2024-04-30T01:14:53.080038 #223805] INFO -- : "--ruby=./miniruby -I/tmp/ruby/src/trunk/lib -I. -I.ext/common /tmp/ruby/src/trunk/tool/runruby.rb --extout=.ext -- --disable-gems" I, [2024-04-30T01:14:53.080201 #223805] INFO -- : --excludes-dir=/tmp/ruby/src/trunk/test/.excludes I, [2024-04-30T01:14:53.080379 #223805] INFO -- : --name=!/memory_leak/ I, [2024-04-30T01:14:53.080521 #223805] INFO -- : --stderr-on-failure I, [2024-04-30T01:14:53.080657 #223805] INFO -- : -j4 I, [2024-04-30T01:14:53.080784 #223805] INFO -- : I, [2024-04-30T01:14:53.080922 #223805] INFO -- : # Running tests: I, [2024-04-30T01:14:53.081074 #223805] INFO -- : I, [2024-04-30T01:14:54.079191 #223805] INFO -- : [ 1/884] 265124=test_rdoc_parser_ruby I, [2024-04-30T01:14:54.088674 #223805] INFO -- : [ 2/884] 265126=test_open-uri I, [2024-04-30T01:14:54.119425 #223805] INFO -- : [ 3/884] 265123=test_httpresponse I, [2024-04-30T01:14:54.556646 #223805] INFO -- : [ 4/884] 265125=test_rdoc_context I, [2024-04-30T01:14:54.726825 #223805] INFO -- : [ 5/884] 265123=test_nil2vtempty I, [2024-04-30T01:14:54.893018 #223805] INFO -- : [ 6/884] 265123=test_stream I, [2024-04-30T01:14:54.943385 #223805] INFO -- : [ 7/884] 265123=test_tcp I, [2024-04-30T01:14:55.137328 #223805] INFO -- : [ 8/884] 265123=test_iso_8859 I, [2024-04-30T01:14:55.376740 #223805] INFO -- : [ 9/884] 265123=test_rdoc_text I, [2024-04-30T01:14:56.217441 #223805] INFO -- : [ 10/884] 265126=test_syntax I, [2024-04-30T01:14:56.888832 #223805] INFO -- : [ 11/884] 265123=test_gem_safe_yaml I, [2024-04-30T01:14:57.606665 #223805] INFO -- : [ 12/884] 265124=test_date_time I, [2024-04-30T01:14:57.762187 #223805] INFO -- : [ 13/884] 265124=test_rdoc_markup_to_joined_paragraph I, [2024-04-30T01:14:57.827181 #223805] INFO -- : [ 14/884] 265124=test_require I, [2024-04-30T01:14:57.842059 #223805] INFO -- : [ 15/884] 265124=test_data I, [2024-04-30T01:14:57.916603 #223805] INFO -- : [ 16/884] 265124=index_write_test I, [2024-04-30T01:14:58.375260 #223805] INFO -- : [ 17/884] 265124=test_date_new I, [2024-04-30T01:14:58.455873 #223805] INFO -- : [ 18/884] 265124=test_http I, [2024-04-30T01:14:58.576277 #223805] INFO -- : [ 19/884] 265123=test_shift_jis I, [2024-04-30T01:14:58.601272 #223805] INFO -- : [ 20/884] 265123=test_gem_commands_which_command I, [2024-04-30T01:14:58.613419 #223805] INFO -- : [ 21/884] 265124=test_inadvertent_creation I, [2024-04-30T01:14:58.899396 #223805] INFO -- : [ 22/884] 265123=test_flags I, [2024-04-30T01:14:59.537909 #223805] INFO -- : [ 23/884] 265124=test_enumerator I, [2024-04-30T01:15:03.596644 #223805] INFO -- : [ 24/884] 265125=test_gem_commands_specification_command I, [2024-04-30T01:15:04.884307 #223805] INFO -- : [ 25/884] 265125=test_gem_commands_dependency_command I, [2024-04-30T01:15:05.491532 #223805] INFO -- : [ 26/884] 265125=test_gem_resolver I, [2024-04-30T01:15:06.737987 #223805] INFO -- : [ 27/884] 265123=test_gem_resolver_composed_set I, [2024-04-30T01:15:06.835981 #223805] INFO -- : [ 28/884] 265123=test_safe_load I, [2024-04-30T01:15:06.920666 #223805] INFO -- : [ 29/884] 265123=test_rdoc_markup_attribute_manager I, [2024-04-30T01:15:07.156833 #223805] INFO -- : [ 30/884] 265125=test_name_error I, [2024-04-30T01:15:07.175636 #223805] INFO -- : [ 31/884] 265123=test_process I, [2024-04-30T01:15:07.913323 #223805] INFO -- : [ 32/884] 265125=test_last_thread I, [2024-04-30T01:15:09.456822 #223805] INFO -- : [ 33/884] 265125=test_pack I, [2024-04-30T01:15:11.134375 #223805] INFO -- : [ 34/884] 265125=test_gem_source_local I, [2024-04-30T01:15:12.921244 #223805] INFO -- : [ 35/884] 265125=test_gem_security_policy I, [2024-04-30T01:15:15.485130 #223805] INFO -- : [ 36/884] 265125=test_gem_ext_rake_builder I, [2024-04-30T01:15:21.114288 #223805] INFO -- : [ 37/884] 265125=test_arity I, [2024-04-30T01:15:21.300930 #223805] INFO -- : [ 38/884] 265125=test_logdevice I, [2024-04-30T01:15:25.644204 #223805] INFO -- : [ 39/884] 265124=test_gem_resolver_lock_specification I, [2024-04-30T01:15:26.859064 #223805] INFO -- : [ 40/884] 265125=test_err_in_callback I, [2024-04-30T01:15:27.145784 #223805] INFO -- : [ 41/884] 265125=test_x509cert I, [2024-04-30T01:15:27.417359 #223805] INFO -- : [ 42/884] 265124=test_gc I, [2024-04-30T01:15:29.504946 #223805] INFO -- : [ 43/884] 265125=test_securerandom I, [2024-04-30T01:15:29.704300 #223805] INFO -- : [ 44/884] 265125=test_logperiod I, [2024-04-30T01:15:30.015482 #223805] INFO -- : [ 45/884] 265125=test_rdoc_markdown_test I, [2024-04-30T01:15:35.726565 #223805] INFO -- : [ 46/884] 265126=test_rdoc_normal_module I, [2024-04-30T01:15:37.461302 #223805] INFO -- : [ 47/884] 265126=test_c_union_entity I, [2024-04-30T01:15:37.476895 #223805] INFO -- : [ 48/884] 265125=test_io_console I, [2024-04-30T01:15:37.588768 #223805] INFO -- : [ 49/884] 265126=test_flush I, [2024-04-30T01:15:37.627347 #223805] INFO -- : [ 50/884] 265126=test_singleton I, [2024-04-30T01:15:37.718527 #223805] INFO -- : [ 51/884] 265126=test_switch_hitter I, [2024-04-30T01:15:38.129036 #223805] INFO -- : [ 52/884] 265126=newline_test I, [2024-04-30T01:15:38.873174 #223805] INFO -- : [ 53/884] 265126=test_uncorrectable_name_check I, [2024-04-30T01:15:38.993385 #223805] INFO -- : [ 54/884] 265126=test_stringchar I, [2024-04-30T01:15:39.602359 #223805] INFO -- : [ 55/884] 265126=test_hash_create I, [2024-04-30T01:15:39.627756 #223805] INFO -- : [ 56/884] 265126=test_passing_block I, [2024-04-30T01:15:39.663576 #223805] INFO -- : [ 57/884] 265126=test_thread_fd_close I, [2024-04-30T01:15:39.712951 #223805] INFO -- : [ 58/884] 265126=test_severity I, [2024-04-30T01:15:39.779812 #223805] INFO -- : [ 59/884] 265126=test_ractor I, [2024-04-30T01:15:39.914100 #223805] INFO -- : [ 60/884] 265126=parse_test I, [2024-04-30T01:15:41.885205 #223805] INFO -- : [ 61/884] 265125=test_gem_install_update_options I, [2024-04-30T01:15:42.842422 #223805] INFO -- : [ 62/884] 265125=test_require_lib I, [2024-04-30T01:16:00.602020 #223805] INFO -- : [ 63/884] 265126=test_rdoc_generator_ri I, [2024-04-30T01:16:00.666345 #223805] INFO -- : [ 64/884] 265126=test_extlibs I, [2024-04-30T01:16:08.076592 #223805] INFO -- : [ 65/884] 265125=test_gem_stream_ui I, [2024-04-30T01:16:08.777219 #223805] INFO -- : [ 66/884] 265125=test_literal I, [2024-04-30T01:16:13.630596 #223805] INFO -- : [ 67/884] 265125=test_c_struct_builder I, [2024-04-30T01:16:13.758651 #223805] INFO -- : [ 68/884] 265126=test_dot_dot I, [2024-04-30T01:16:13.808761 #223805] INFO -- : [ 69/884] 265126=test_str2big I, [2024-04-30T01:16:13.826047 #223805] INFO -- : [ 70/884] 265126=test_rdoc_markup_to_table_of_contents I, [2024-04-30T01:16:14.007592 #223805] INFO -- : [ 71/884] 265125=test_objectspace I, [2024-04-30T01:16:14.066954 #223805] INFO -- : [ 72/884] 265126=test_socket I, [2024-04-30T01:16:15.950279 #223805] INFO -- : [ 73/884] 265124=test_thread I, [2024-04-30T01:16:16.217593 #223805] INFO -- : [ 74/884] 265124=test_pkey I, [2024-04-30T01:16:16.781719 #223805] INFO -- : [ 75/884] 265124=test_case I, [2024-04-30T01:16:17.245623 #223805] INFO -- : [ 76/884] 265124=test_reline I, [2024-04-30T01:16:18.186451 #223805] INFO -- : [ 77/884] 265125=test_parser_events I, [2024-04-30T01:16:18.576312 #223805] INFO -- : [ 78/884] 265124=test_cclass I, [2024-04-30T01:16:18.799596 #223805] INFO -- : [ 79/884] 265125=test_grapheme_breaks I, [2024-04-30T01:16:18.921939 #223805] INFO -- : [ 80/884] 265125=test_gem_version_option I, [2024-04-30T01:16:19.276380 #223805] INFO -- : [ 81/884] 265125=test_gem_request_connection_pools I, [2024-04-30T01:16:19.581312 #223805] INFO -- : [ 82/884] 265124=test_memory_view I, [2024-04-30T01:16:20.281184 #223805] INFO -- : [ 83/884] 265124=test_m17n_comb I, [2024-04-30T01:16:20.582714 #223805] INFO -- : [ 84/884] 265125=test_ractor I, [2024-04-30T01:16:21.130691 #223805] INFO -- : [ 85/884] 265125=test_ansi_with_terminfo I, [2024-04-30T01:16:21.296828 #223805] INFO -- : [ 86/884] 265125=test_rdoc_generator_pot_po I, [2024-04-30T01:16:21.341384 #223805] INFO -- : [ 87/884] 265125=test_rdoc_markup_to_markdown I, [2024-04-30T01:16:21.625906 #223805] INFO -- : [ 88/884] 265125=test_json_tree I, [2024-04-30T01:16:21.704337 #223805] INFO -- : [ 89/884] 265125=test_gem_commands_mirror I, [2024-04-30T01:16:21.779460 #223805] INFO -- : [ 90/884] 265125=test_gem_ext_cargo_builder_link_flag_converter I, [2024-04-30T01:16:22.166593 #223805] INFO -- : [ 91/884] 265125=test_gem_request I, [2024-04-30T01:16:23.945055 #223805] INFO -- : [ 92/884] 265126=test_method_cache I, [2024-04-30T01:16:24.016102 #223805] INFO -- : [ 93/884] 265126=test_sprintf_comb I, [2024-04-30T01:16:25.156342 #223805] INFO -- : [ 94/884] 265125=test_generic I, [2024-04-30T01:16:25.220877 #223805] INFO -- : [ 95/884] 265126=test_win32ole I, [2024-04-30T01:16:25.252953 #223805] INFO -- : [ 96/884] 265126=test_scan_args I, [2024-04-30T01:16:25.351656 #223805] INFO -- : [ 97/884] 265125=test_enumerator_kw I, [2024-04-30T01:16:25.369393 #223805] INFO -- : [ 98/884] 265125=test_gem_text I, [2024-04-30T01:16:25.422774 #223805] INFO -- : [ 99/884] 265126=test_settracefunc I, [2024-04-30T01:16:25.863632 #223805] INFO -- : [100/884] 265125=test_rdoc_cross_reference I, [2024-04-30T01:16:29.128053 #223805] INFO -- : [101/884] 265125=test_gem_commands_info_command I, [2024-04-30T01:16:29.366622 #223805] INFO -- : [102/884] 265125=test_gem_dependency_installer I, [2024-04-30T01:16:32.372828 #223805] INFO -- : [103/884] 265126=test_scalar I, [2024-04-30T01:16:32.429580 #223805] INFO -- : [104/884] 265126=test_case_options I, [2024-04-30T01:16:32.484571 #223805] INFO -- : [105/884] 265126=test_store I, [2024-04-30T01:16:33.828726 #223805] INFO -- : [106/884] 265126=test_exception I, [2024-04-30T01:16:40.379975 #223805] INFO -- : [107/884] 265124=test_bug_reporter I, [2024-04-30T01:16:41.067698 #223805] INFO -- : [108/884] 265124=test_gem_name_tuple I, [2024-04-30T01:16:41.145565 #223805] INFO -- : [109/884] 265124=test_gem_package_tar_reader_entry I, [2024-04-30T01:16:42.390654 #223805] INFO -- : [110/884] 265124=test_rand I, [2024-04-30T01:16:44.587957 #223805] INFO -- : [111/884] 265124=test_key_name_check I, [2024-04-30T01:16:44.614838 #223805] INFO -- : [112/884] 265124=test_defined I, [2024-04-30T01:16:44.634406 #223805] INFO -- : [113/884] 265125=test_backtrace I, [2024-04-30T01:16:44.644204 #223805] INFO -- : [114/884] 265125=test_io_buffer I, [2024-04-30T01:16:44.933463 #223805] INFO -- : [115/884] 265125=test_rdoc_i18n_text I, [2024-04-30T01:16:44.982344 #223805] INFO -- : [116/884] 265125=test_windows_1251 I, [2024-04-30T01:16:45.087424 #223805] INFO -- : [117/884] 265125=test_time I, [2024-04-30T01:16:45.332819 #223805] INFO -- : [118/884] 265124=test_rdoc_rdoc I, [2024-04-30T01:16:45.848355 #223805] INFO -- : [119/884] 265124=test_gem_uninstaller I, [2024-04-30T01:16:45.898906 #223805] INFO -- : [120/884] 265125=test_gb18030 I, [2024-04-30T01:16:45.925658 #223805] INFO -- : [121/884] 265125=test_buffering I, [2024-04-30T01:16:46.039194 #223805] INFO -- : [122/884] 265125=test_svcb_https I, [2024-04-30T01:16:46.084699 #223805] INFO -- : [123/884] 265125=test_mul I, [2024-04-30T01:16:46.108887 #223805] INFO -- : [124/884] 265126=test_null I, [2024-04-30T01:16:46.110377 #223805] INFO -- : [125/884] 265126=test_win32ole_type I, [2024-04-30T01:16:46.133689 #223805] INFO -- : [126/884] 265126=test_default_gems I, [2024-04-30T01:16:46.190132 #223805] INFO -- : [127/884] 265125=test_rdoc_markup_to_rdoc I, [2024-04-30T01:16:46.540406 #223805] INFO -- : [128/884] 265125=test_rdoc_rd_inline_parser I, [2024-04-30T01:16:46.568655 #223805] INFO -- : [129/884] 265126=test_rdoc_markup_attributes I, [2024-04-30T01:16:46.586242 #223805] INFO -- : [130/884] 265126=test_date_parse I, [2024-04-30T01:16:46.691863 #223805] INFO -- : [131/884] 265125=test_pipe I, [2024-04-30T01:16:47.470224 #223805] INFO -- : [132/884] 265126=test_trick I, [2024-04-30T01:16:47.614249 #223805] INFO -- : [133/884] 265125=test_thread I, [2024-04-30T01:16:47.645421 #223805] INFO -- : [134/884] 265125=test_pkey_ec I, [2024-04-30T01:16:48.534024 #223805] INFO -- : [135/884] 265125=test_pattern_matching I, [2024-04-30T01:16:48.648756 #223805] INFO -- : [136/884] 265125=test_rdoc_stats I, [2024-04-30T01:16:48.824145 #223805] INFO -- : [137/884] 265125=test_string I, [2024-04-30T01:16:48.960321 #223805] INFO -- : [138/884] 265125=test_rdoc_store I, [2024-04-30T01:16:52.468835 #223805] INFO -- : [139/884] 265124=test_raise I, [2024-04-30T01:16:52.491591 #223805] INFO -- : [140/884] 265124=test_x509attr I, [2024-04-30T01:16:52.526913 #223805] INFO -- : [141/884] 265124=test_depth_first I, [2024-04-30T01:16:52.540852 #223805] INFO -- : [142/884] 265124=test_gem_request_set_lockfile_parser I, [2024-04-30T01:16:53.338701 #223805] INFO -- : [143/884] 265124=test_custom_command I, [2024-04-30T01:16:53.664943 #223805] INFO -- : [144/884] 265124=json_addition_test I, [2024-04-30T01:16:53.819850 #223805] INFO -- : [145/884] 265125=test_rdoc_parser I, [2024-04-30T01:16:53.855434 #223805] INFO -- : [146/884] 265124=test_qsort I, [2024-04-30T01:16:53.865746 #223805] INFO -- : [147/884] 265124=test_gem_dependency_resolution_error I, [2024-04-30T01:16:53.910563 #223805] INFO -- : [148/884] 265124=test_egrep_cpp I, [2024-04-30T01:16:54.020784 #223805] INFO -- : [149/884] 265125=test_zlib I, [2024-04-30T01:16:55.068399 #223805] INFO -- : [150/884] 265124=test_cgi_tag_helper I, [2024-04-30T01:16:55.135128 #223805] INFO -- : [151/884] 265124=test_optimization I, [2024-04-30T01:16:56.387288 #223805] INFO -- : [152/884] 265123=test_date_conv I, [2024-04-30T01:16:56.450094 #223805] INFO -- : [153/884] 265123=test_erb_m17n I, [2024-04-30T01:16:56.524212 #223805] INFO -- : [154/884] 265123=test_ole_methods I, [2024-04-30T01:16:56.533202 #223805] INFO -- : [155/884] 265123=test_proc I, [2024-04-30T01:17:01.006172 #223805] INFO -- : [156/884] 265126=test_string I, [2024-04-30T01:17:06.113298 #223805] INFO -- : [157/884] 265123=test_gc_compact I, [2024-04-30T01:17:09.845926 #223805] INFO -- : [158/884] 265125=test_gem_package_old I, [2024-04-30T01:17:10.216143 #223805] INFO -- : [159/884] 265125=test_gem_resolver_index_set I, [2024-04-30T01:17:10.544827 #223805] INFO -- : [160/884] 265125=test_gem_validator I, [2024-04-30T01:17:10.639835 #223805] INFO -- : [161/884] 265125=test_folderitem2_invokeverb I, [2024-04-30T01:17:10.709747 #223805] INFO -- : [162/884] 265125=test_rdoc_markup_parser I, [2024-04-30T01:17:11.334556 #223805] INFO -- : [163/884] 265125=test_require_path_check I, [2024-04-30T01:17:11.818491 #223805] INFO -- : [164/884] 265125=test_files_test_2 I, [2024-04-30T01:17:23.917147 #223805] INFO -- : [165/884] 265123=test_fnmatch I, [2024-04-30T01:17:24.360207 #223805] INFO -- : [166/884] 265123=test_rdoc_token_stream I, [2024-04-30T01:17:24.446611 #223805] INFO -- : [167/884] 265123=test_address_resolve I, [2024-04-30T01:17:24.564467 #223805] INFO -- : [168/884] 265123=test_yaml_special_cases I, [2024-04-30T01:17:24.638893 #223805] INFO -- : [169/884] 265123=test_optarg I, [2024-04-30T01:17:25.517843 #223805] INFO -- : [170/884] 265123=test_gem_source_list I, [2024-04-30T01:17:26.142070 #223805] INFO -- : [171/884] 265123=test_config I, [2024-04-30T01:17:26.536804 #223805] INFO -- : [172/884] 265123=test_nil I, [2024-04-30T01:17:26.583269 #223805] INFO -- : [173/884] 265123=test_num2int I, [2024-04-30T01:17:26.639366 #223805] INFO -- : [174/884] 265123=test_rdoc_single_class I, [2024-04-30T01:17:26.673376 #223805] INFO -- : [175/884] 265123=test_verbose I, [2024-04-30T01:17:26.879134 #223805] INFO -- : [176/884] 265123=test_pp I, [2024-04-30T01:17:27.148791 #223805] INFO -- : [177/884] 265123=test_frozen I, [2024-04-30T01:17:27.199482 #223805] INFO -- : [178/884] 265123=test_gem_ext_configure_builder I, [2024-04-30T01:17:27.350665 #223805] INFO -- : [179/884] 265123=test_macro I, [2024-04-30T01:17:27.383308 #223805] INFO -- : [180/884] 265123=test_iter_break I, [2024-04-30T01:17:27.408245 #223805] INFO -- : [181/884] 265123=test_exception I, [2024-04-30T01:17:27.458299 #223805] INFO -- : [182/884] 265123=test_zsh_completion I, [2024-04-30T01:17:27.508995 #223805] INFO -- : [183/884] 265123=test_rdoc_markup_to_tt_only I, [2024-04-30T01:17:27.835299 #223805] INFO -- : [184/884] 265123=test_hmac I, [2024-04-30T01:17:27.878488 #223805] INFO -- : [185/884] 265123=test_rdoc_tom_doc I, [2024-04-30T01:17:28.026232 #223805] INFO -- : [186/884] 265123=test_numeric I, [2024-04-30T01:17:28.603586 #223805] INFO -- : [187/884] 265123=test_gem_commands_lock_command I, [2024-04-30T01:17:28.791318 #223805] INFO -- : [188/884] 265123=test_assignment I, [2024-04-30T01:17:37.949126 #223805] INFO -- : [189/884] 265125=test_ifunless I, [2024-04-30T01:17:37.986538 #223805] INFO -- : [190/884] 265125=test_key_actor_vi I, [2024-04-30T01:17:38.937463 #223805] INFO -- : [191/884] 265125=test_bug-3571 I, [2024-04-30T01:17:38.995592 #223805] INFO -- : [192/884] 265125=test_gem_command I, [2024-04-30T01:17:39.823599 #223805] INFO -- : [193/884] 265125=test_gem_spec_fetcher I, [2024-04-30T01:17:41.102687 #223805] INFO -- : [194/884] 265125=test_common I, [2024-04-30T01:17:42.738245 #223805] INFO -- : [195/884] 265125=!Nothing_to_test I, [2024-04-30T01:17:42.781391 #223805] INFO -- : [196/884] 265125=test_psych I, [2024-04-30T01:17:43.011170 #223805] INFO -- : [197/884] 265125=test_enc_raise I, [2024-04-30T01:17:43.033018 #223805] INFO -- : [198/884] 265125=test_rdoc_markup_paragraph I, [2024-04-30T01:17:43.059056 #223805] INFO -- : [199/884] 265125=test_object_create_start I, [2024-04-30T01:17:43.164596 #223805] INFO -- : [200/884] 265125=test_gem_rdoc I, [2024-04-30T01:17:44.013721 #223805] INFO -- : [201/884] 265125=test_date I, [2024-04-30T01:17:44.083031 #223805] INFO -- : [202/884] 265125=test_gem_ext_cargo_builder_unit I, [2024-04-30T01:17:44.116595 #223805] INFO -- : [203/884] 265123=test_at_exit I, [2024-04-30T01:17:44.218895 #223805] INFO -- : [204/884] 265123=test_command I, [2024-04-30T01:17:44.239088 #223805] INFO -- : [205/884] 265125=test_bug-5832 I, [2024-04-30T01:17:44.261149 #223805] INFO -- : [206/884] 265125=test_files_ext I, [2024-04-30T01:17:44.267353 #223805] INFO -- : [207/884] 265125=test_emitter I, [2024-04-30T01:17:44.305511 #223805] INFO -- : [208/884] 265125=test_gem_silent_ui I, [2024-04-30T01:17:44.683704 #223805] INFO -- : [209/884] 265125=test_kdf I, [2024-04-30T01:17:45.148405 #223805] INFO -- : [210/884] 265125=test_gem_doctor I, [2024-04-30T01:17:45.582769 #223805] INFO -- : [211/884] 265125=test_kernel I, [2024-04-30T01:17:46.238302 #223805] INFO -- : [212/884] 265124=dispatcher_test I, [2024-04-30T01:17:46.309306 #223805] INFO -- : [213/884] 265124=test_eval_history I, [2024-04-30T01:17:46.423024 #223805] INFO -- : [214/884] 265123=test_rdoc_rubygems_hook I, [2024-04-30T01:17:46.650342 #223805] INFO -- : [215/884] 265124=test_method I, [2024-04-30T01:17:47.481601 #223805] INFO -- : [216/884] 265123=test_gem_commands_query_command I, [2024-04-30T01:17:50.418766 #223805] INFO -- : [217/884] 265125=test_array_create I, [2024-04-30T01:17:50.474133 #223805] INFO -- : [218/884] 265125=test_pack I, [2024-04-30T01:17:51.852313 #223805] INFO -- : [219/884] 265123=test_gem_impossible_dependencies_error I, [2024-04-30T01:17:51.863580 #223805] INFO -- : [220/884] 265123=test_pattern_key_name_check I, [2024-04-30T01:17:51.882333 #223805] INFO -- : [221/884] 265123=test_to_ruby I, [2024-04-30T01:17:52.023536 #223805] INFO -- : [222/884] 265123=test_ftp I, [2024-04-30T01:17:52.058825 #223805] INFO -- : [223/884] 265123=test_rdoc_context_section I, [2024-04-30T01:17:52.116394 #223805] INFO -- : [224/884] 265123=test_euc_kr I, [2024-04-30T01:17:52.154765 #223805] INFO -- : [225/884] 265123=test_summary I, [2024-04-30T01:17:52.337731 #223805] INFO -- : [226/884] 265125=test_console_attr I, [2024-04-30T01:17:52.388068 #223805] INFO -- : [227/884] 265125=test_type_completor I, [2024-04-30T01:17:52.591154 #223805] INFO -- : [228/884] 265125=warnings_test I, [2024-04-30T01:17:52.633484 #223805] INFO -- : [229/884] 265123=test_kwargs I, [2024-04-30T01:17:53.125535 #223805] INFO -- : [230/884] 265123=test_gem_commands_exec_command I, [2024-04-30T01:17:53.236873 #223805] INFO -- : [231/884] 265125=test_io_wait I, [2024-04-30T01:17:53.628900 #223805] INFO -- : [232/884] 265125=test_date_attr I, [2024-04-30T01:17:53.665400 #223805] INFO -- : [233/884] 265125=test_ellipsize I, [2024-04-30T01:17:53.785272 #223805] INFO -- : [234/884] 265125=test_io I, [2024-04-30T01:17:54.678278 #223805] INFO -- : [235/884] 265125=test_ubf_async_safe I, [2024-04-30T01:17:54.802512 #223805] INFO -- : [236/884] 265125=test_hash I, [2024-04-30T01:17:56.700555 #223805] INFO -- : [237/884] 265126=test_win32ole_type_event I, [2024-04-30T01:17:56.768264 #223805] INFO -- : [238/884] 265126=test_emoji I, [2024-04-30T01:17:56.985856 #223805] INFO -- : [239/884] 265126=test_sorted_set I, [2024-04-30T01:17:58.857869 #223805] INFO -- : [240/884] 265126=test_win32ole_record I, [2024-04-30T01:17:58.922677 #223805] INFO -- : [241/884] 265126=test_gem_unsatisfiable_dependency_error I, [2024-04-30T01:18:00.442726 #223805] INFO -- : [242/884] 265123=test_gem_source_specific_file I, [2024-04-30T01:18:00.674841 #223805] INFO -- : [243/884] 265126=test_foreach I, [2024-04-30T01:18:00.706856 #223805] INFO -- : [244/884] 265126=test_condition I, [2024-04-30T01:18:00.751430 #223805] INFO -- : [245/884] 265126=test_gem_commands_uninstall_command I, [2024-04-30T01:18:01.045814 #223805] INFO -- : [246/884] 265123=test_cp949 I, [2024-04-30T01:18:01.088728 #223805] INFO -- : [247/884] 265123=test_external_new I, [2024-04-30T01:18:01.567278 #223805] INFO -- : [248/884] 265123=test_postponed_job I, [2024-04-30T01:18:03.972980 #223805] INFO -- : [249/884] 265123=test_alias_and_anchor I, [2024-04-30T01:18:04.019280 #223805] INFO -- : [250/884] 265123=test_hash I, [2024-04-30T01:18:04.111329 #223805] INFO -- : [251/884] 265123=test_tree_builder I, [2024-04-30T01:18:04.133380 #223805] INFO -- : [252/884] 265123=test_gem_resolver_dependency_request I, [2024-04-30T01:18:04.385411 #223805] INFO -- : [253/884] 265123=test_win32ole_typelib I, [2024-04-30T01:18:04.408058 #223805] INFO -- : [254/884] 265123=test_protect I, [2024-04-30T01:18:05.385984 #223805] INFO -- : [255/884] 265123=test_raise_exception I, [2024-04-30T01:18:07.709809 #223805] INFO -- : [256/884] 265126=test_gem_request_set_lockfile I, [2024-04-30T01:18:09.690565 #223805] INFO -- : [257/884] 265126=test_yjit I, [2024-04-30T01:18:09.905264 #223805] INFO -- : [258/884] 265126=test_workspace I, [2024-04-30T01:18:09.933179 #223805] INFO -- : [259/884] 265123=test_weakmap I, [2024-04-30T01:18:11.577551 #223805] INFO -- : [260/884] 265126=test_m17n I, [2024-04-30T01:18:12.185680 #223805] INFO -- : [261/884] 265126=test_gem_commands_environment_command I, [2024-04-30T01:18:12.510457 #223805] INFO -- : [262/884] 265126=test_ws I, [2024-04-30T01:18:12.752695 #223805] INFO -- : [263/884] 265126=test_argf I, [2024-04-30T01:18:19.231152 #223805] INFO -- : [264/884] 265124=test_ns_spki I, [2024-04-30T01:18:19.539355 #223805] INFO -- : [265/884] 265124=test_framework I, [2024-04-30T01:18:19.571354 #223805] INFO -- : [266/884] 265124=test_kill_ring I, [2024-04-30T01:18:19.614543 #223805] INFO -- : [267/884] 265124=test_undef I, [2024-04-30T01:18:19.650837 #223805] INFO -- : [268/884] 265124=test_line_editor I, [2024-04-30T01:18:19.868266 #223805] INFO -- : [269/884] 265124=ripper_test I, [2024-04-30T01:18:23.641845 #223805] INFO -- : [270/884] 265125=test_objspace I, [2024-04-30T01:18:23.988365 #223805] INFO -- : [271/884] 265124=test_gem_security_trust_dir I, [2024-04-30T01:18:24.303558 #223805] INFO -- : [272/884] 265124=test_sprintf I, [2024-04-30T01:18:26.498503 #223805] INFO -- : [273/884] 265124=test_gem_requirement I, [2024-04-30T01:18:27.503137 #223805] INFO -- : [274/884] 265124=comments_test I, [2024-04-30T01:18:27.803737 #223805] INFO -- : [275/884] 265124=test_string_memory I, [2024-04-30T01:18:28.346458 #223805] INFO -- : [276/884] 265124=test_set I, [2024-04-30T01:18:28.504887 #223805] INFO -- : [277/884] 265124=test_show_source I, [2024-04-30T01:18:28.564568 #223805] INFO -- : [278/884] 265124=test_remote_fetch_error I, [2024-04-30T01:18:29.207738 #223805] INFO -- : [279/884] 265124=test_have_library I, [2024-04-30T01:18:29.810333 #223805] INFO -- : [280/884] 265123=test_gem_commands_stale_command I, [2024-04-30T01:18:30.002788 #223805] INFO -- : [281/884] 265123=test_c_struct_entry I, [2024-04-30T01:18:31.549948 #223805] INFO -- : [282/884] 265123=test_lock_native_thread I, [2024-04-30T01:18:32.816803 #223805] INFO -- : [283/884] 265123=test_fstring I, [2024-04-30T01:18:33.733302 #223805] INFO -- : [284/884] 265123=test_array I, [2024-04-30T01:18:33.765139 #223805] INFO -- : [285/884] 265123=test_optparse I, [2024-04-30T01:18:33.785258 #223805] INFO -- : [286/884] 265123=test_rdoc_markup_raw I, [2024-04-30T01:18:33.864043 #223805] INFO -- : [287/884] 265123=test_webauthn_poller I, [2024-04-30T01:18:34.206262 #223805] INFO -- : [288/884] 265123=test_rat I, [2024-04-30T01:18:34.584975 #223805] INFO -- : [289/884] 265123=test_typeddata I, [2024-04-30T01:18:36.846620 #223805] INFO -- : [290/884] 265123=encoding_test I, [2024-04-30T01:18:37.844371 #223805] INFO -- : [291/884] 265124=test_gem_resolver_best_set I, [2024-04-30T01:18:38.246582 #223805] INFO -- : [292/884] 265123=test_rdoc_markup_to_html_crossref I, [2024-04-30T01:18:38.451908 #223805] INFO -- : [293/884] 265124=test_files_sample I, [2024-04-30T01:18:39.159965 #223805] INFO -- : [294/884] 265124=test_stringscanner I, [2024-04-30T01:18:39.427215 #223805] INFO -- : [295/884] 265124=parser_test I, [2024-04-30T01:18:39.519625 #223805] INFO -- : [296/884] 265124=test_convertible I, [2024-04-30T01:18:40.930253 #223805] INFO -- : [297/884] 265123=test_yield I, [2024-04-30T01:18:45.933901 #223805] INFO -- : [298/884] 265126=test_rdoc_alias I, [2024-04-30T01:18:45.994357 #223805] INFO -- : [299/884] 265126=test_io_buffer I, [2024-04-30T01:18:46.168876 #223805] INFO -- : [300/884] 265126=test_backtrace I, [2024-04-30T01:18:49.249802 #223805] INFO -- : [301/884] 265126=test_pack I, [2024-04-30T01:18:49.296833 #223805] INFO -- : [302/884] 265126=ruby_parser_test I, [2024-04-30T01:18:49.325029 #223805] INFO -- : [303/884] 265126=test_rdoc_task I, [2024-04-30T01:18:49.366450 #223805] INFO -- : [304/884] 265126=test_gem_resolver_conflict I, [2024-04-30T01:18:49.453451 #223805] INFO -- : [305/884] 265126=test_rdoc_markup_indented_paragraph I, [2024-04-30T01:18:49.579273 #223805] INFO -- : [306/884] 265126=locals_test I, [2024-04-30T01:18:52.711804 #223805] INFO -- : [307/884] 265126=test_rdoc_require I, [2024-04-30T01:18:52.734174 #223805] INFO -- : [308/884] 265126=test_clone I, [2024-04-30T01:18:54.325499 #223805] INFO -- : [309/884] 265126=test_gem_commands_install_command I, [2024-04-30T01:19:04.341178 #223805] INFO -- : [310/884] 265126=test_readpartial I, [2024-04-30T01:19:04.782523 #223805] INFO -- : [311/884] 265126=test_yaml_tree I, [2024-04-30T01:19:04.948699 #223805] INFO -- : [312/884] 265126=test_gc I, [2024-04-30T01:19:04.991171 #223805] INFO -- : [313/884] 265126=test_math I, [2024-04-30T01:19:05.198566 #223805] INFO -- : [314/884] 265126=test_gem_commands_fetch_command I, [2024-04-30T01:19:06.270232 #223805] INFO -- : [315/884] 265126=test_libs I, [2024-04-30T01:19:06.600536 #223805] INFO -- : [316/884] 265126=test_config I, [2024-04-30T01:19:08.728596 #223805] INFO -- : [317/884] 265126=test_sleep I, [2024-04-30T01:19:09.359262 #223805] INFO -- : [318/884] 265126=test_autoload I, [2024-04-30T01:19:12.745613 #223805] INFO -- : [319/884] 265123=test_utf16 I, [2024-04-30T01:19:12.899473 #223805] INFO -- : [320/884] 265123=test_unicode_escape I, [2024-04-30T01:19:13.497715 #223805] INFO -- : [321/884] 265123=test_io I, [2024-04-30T01:19:20.682411 #223805] INFO -- : [322/884] 265124=test_face I, [2024-04-30T01:19:20.834326 #223805] INFO -- : [323/884] 265124=test_case I, [2024-04-30T01:19:21.547790 #223805] INFO -- : [324/884] 265124=test_sizeof I, [2024-04-30T01:19:29.519130 #223805] INFO -- : [325/884] 265126=test_rendering I, [2024-04-30T01:19:30.033265 #223805] INFO -- : [326/884] 265126=test_pkcs12 I, [2024-04-30T01:19:34.218882 #223805] INFO -- : [327/884] 265126=test_system I, [2024-04-30T01:19:42.389197 #223805] INFO -- : [328/884] 265126=test_bigzero I, [2024-04-30T01:19:42.480729 #223805] INFO -- : [329/884] 265126=test_pkey_dh I, [2024-04-30T01:19:43.011003 #223805] INFO -- : [330/884] 265126=test_iseq_load I, [2024-04-30T01:19:46.147768 #223805] INFO -- : [331/884] 265124=test_gem_util I, [2024-04-30T01:19:47.622964 #223805] INFO -- : [332/884] 265124=test_gem_package_tar_header I, [2024-04-30T01:19:48.007476 #223805] INFO -- : [333/884] 265124=test_ripper I, [2024-04-30T01:19:50.273088 #223805] INFO -- : [334/884] 265126=test_gem_config_file I, [2024-04-30T01:19:50.795906 #223805] INFO -- : [335/884] 265124=test_gem_resolver_activation_request I, [2024-04-30T01:19:50.914466 #223805] INFO -- : [336/884] 265124=test_protocol I, [2024-04-30T01:19:51.294960 #223805] INFO -- : [337/884] 265124=test_getopts I, [2024-04-30T01:19:51.334655 #223805] INFO -- : [338/884] 265126=test_yjit_exit_locations I, [2024-04-30T01:19:51.339814 #223805] INFO -- : [339/884] 265124=test_etc I, [2024-04-30T01:19:51.372494 #223805] INFO -- : [340/884] 265126=test_file I, [2024-04-30T01:19:51.394726 #223805] INFO -- : [341/884] 265126=test_gem_available_set I, [2024-04-30T01:19:51.967616 #223805] INFO -- : [342/884] 265124=test_rdoc_markdown I, [2024-04-30T01:19:52.088517 #223805] INFO -- : [343/884] 265126=test_modify_expand I, [2024-04-30T01:19:52.120783 #223805] INFO -- : [344/884] 265126=test_rdoc_any_method I, [2024-04-30T01:19:53.583196 #223805] INFO -- : [345/884] 265123=test_complexrational I, [2024-04-30T01:19:53.606078 #223805] INFO -- : [346/884] 265123=test_init I, [2024-04-30T01:19:54.070039 #223805] INFO -- : [347/884] 265124=test_pathname I, [2024-04-30T01:19:55.771563 #223805] INFO -- : [348/884] 265124=test_rdoc_encoding I, [2024-04-30T01:19:55.865201 #223805] INFO -- : [349/884] 265123=test_coverage I, [2024-04-30T01:19:56.023097 #223805] INFO -- : [350/884] 265124=test_gem_package_tar_reader I, [2024-04-30T01:19:56.027078 #223805] INFO -- : [351/884] 265126=regexp_test I, [2024-04-30T01:19:56.235337 #223805] INFO -- : [352/884] 265126=test_gem_commands_owner_command I, [2024-04-30T01:19:56.352122 #223805] INFO -- : [353/884] 265124=test_gem_source_vendor I, [2024-04-30T01:19:56.448748 #223805] INFO -- : [354/884] 265124=test_recorder I, [2024-04-30T01:19:56.463044 #223805] INFO -- : [355/884] 265124=test_formatter I, [2024-04-30T01:19:56.511952 #223805] INFO -- : [356/884] 265124=test_bash_completion I, [2024-04-30T01:19:56.572642 #223805] INFO -- : [357/884] 265124=test_rdoc_constant I, [2024-04-30T01:19:57.447957 #223805] INFO -- : [358/884] 265124=test_deprecate I, [2024-04-30T01:19:57.758534 #223805] INFO -- : [359/884] 265124=test_cgi_util I, [2024-04-30T01:19:58.039627 #223805] INFO -- : [360/884] 265126=test_require I, [2024-04-30T01:19:59.633216 #223805] INFO -- : [361/884] 265124=test_gem_ext_cmake_builder I, [2024-04-30T01:19:59.715943 #223805] INFO -- : [362/884] 265124=test_gem_commands_contents_command I, [2024-04-30T01:20:00.403206 #223805] INFO -- : [363/884] 265124=test_digest I, [2024-04-30T01:20:01.082297 #223805] INFO -- : [364/884] 265123=test_marshalable I, [2024-04-30T01:20:01.128126 #223805] INFO -- : [365/884] 265123=test_find I, [2024-04-30T01:20:01.321859 #223805] INFO -- : [366/884] 265123=test_ractor I, [2024-04-30T01:20:01.737842 #223805] INFO -- : [367/884] 265123=test_wss I, [2024-04-30T01:20:01.873716 #223805] INFO -- : [368/884] 265123=test_fiddle I, [2024-04-30T01:20:02.259307 #223805] INFO -- : [369/884] 265123=test_rdoc_parser_c I, [2024-04-30T01:20:03.576647 #223805] INFO -- : [370/884] 265123=test_comparable I, [2024-04-30T01:20:03.630999 #223805] INFO -- : [371/884] 265123=json_fixtures_test I, [2024-04-30T01:20:03.727527 #223805] INFO -- : [372/884] 265123=test_shapes I, [2024-04-30T01:20:03.748930 #223805] INFO -- : [373/884] 265123=test_io_timeout I, [2024-04-30T01:20:03.789649 #223805] INFO -- : [374/884] 265123=test_profile_frames I, [2024-04-30T01:20:04.145970 #223805] INFO -- : [375/884] 265124=test_cstr I, [2024-04-30T01:20:04.512536 #223805] INFO -- : [376/884] 265123=test_pstore I, [2024-04-30T01:20:04.801447 #223805] INFO -- : [377/884] 265123=test_enc_str_buf_cat I, [2024-04-30T01:20:04.812392 #223805] INFO -- : [378/884] 265123=test_gbk I, [2024-04-30T01:20:04.831311 #223805] INFO -- : [379/884] 265123=test_class2name I, [2024-04-30T01:20:05.012299 #223805] INFO -- : [380/884] 265123=test_handle I, [2024-04-30T01:20:06.456513 #223805] INFO -- : [381/884] 265125=test_wait I, [2024-04-30T01:20:06.948676 #223805] INFO -- : [382/884] 265123=test_yaml I, [2024-04-30T01:20:06.964266 #223805] INFO -- : [383/884] 265125=test_forwardable I, [2024-04-30T01:20:07.187442 #223805] INFO -- : [384/884] 265125=test_big2str I, [2024-04-30T01:20:07.214471 #223805] INFO -- : [385/884] 265125=test_gem_commands_sources_command I, [2024-04-30T01:20:07.800806 #223805] INFO -- : [386/884] 265123=test_ansi_without_terminfo I, [2024-04-30T01:20:07.856369 #223805] INFO -- : [387/884] 265123=test_bmethod I, [2024-04-30T01:20:07.884440 #223805] INFO -- : [388/884] 265126=test_euc_tw I, [2024-04-30T01:20:07.923024 #223805] INFO -- : [389/884] 265123=test_ractor I, [2024-04-30T01:20:07.952028 #223805] INFO -- : [390/884] 265126=test_rdoc_markup_formatter I, [2024-04-30T01:20:07.973809 #223805] INFO -- : [391/884] 265123=test_nowrite I, [2024-04-30T01:20:08.026723 #223805] INFO -- : [392/884] 265126=test_thread_queue I, [2024-04-30T01:20:08.173641 #223805] INFO -- : [393/884] 265123=test_gem_dependency I, [2024-04-30T01:20:08.656566 #223805] INFO -- : [394/884] 265125=test_gem_resolver_specification I, [2024-04-30T01:20:08.838831 #223805] INFO -- : [395/884] 265125=test_path_to_class I, [2024-04-30T01:20:08.865102 #223805] INFO -- : [396/884] 265125=test_rdoc_markup_verbatim I, [2024-04-30T01:20:08.892461 #223805] INFO -- : [397/884] 265125=test_inlinecache I, [2024-04-30T01:20:09.206756 #223805] INFO -- : [398/884] 265123=test_gem_commands_search_command I, [2024-04-30T01:20:09.276092 #223805] INFO -- : [399/884] 265123=test_complex I, [2024-04-30T01:20:09.379382 #223805] INFO -- : [400/884] 265125=test_gem_ext_ext_conf_builder I, [2024-04-30T01:20:09.697273 #223805] INFO -- : [401/884] 265124=test_gem_stub_specification I, [2024-04-30T01:20:09.871175 #223805] INFO -- : [402/884] 265123=test_method_cache I, [2024-04-30T01:20:09.903322 #223805] INFO -- : [403/884] 265123=test_frozen_error I, [2024-04-30T01:20:09.939986 #223805] INFO -- : [404/884] 265123=test_gem_resolver_installed_specification I, [2024-04-30T01:20:10.075214 #223805] INFO -- : [405/884] 265123=test_scanner_events I, [2024-04-30T01:20:10.709883 #223805] INFO -- : [406/884] 265123=test_gem_remote_fetcher I, [2024-04-30T01:20:10.878763 #223805] INFO -- : [407/884] 265124=test_mdns I, [2024-04-30T01:20:10.981615 #223805] INFO -- : [408/884] 265124=test_parse I, [2024-04-30T01:20:14.779823 #223805] INFO -- : [409/884] 265124=test_too_many_dummy_encodings I, [2024-04-30T01:20:14.821996 #223805] INFO -- : [410/884] 265126=test_reqarg I, [2024-04-30T01:20:15.256622 #223805] INFO -- : [411/884] 265124=test_rdoc_include I, [2024-04-30T01:20:15.609510 #223805] INFO -- : [412/884] 265124=test_stack I, [2024-04-30T01:20:17.248111 #223805] INFO -- : [413/884] 265126=test_gem_commands_list_command I, [2024-04-30T01:20:17.284145 #223805] INFO -- : [414/884] 265126=test_resource I, [2024-04-30T01:20:17.355834 #223805] INFO -- : [415/884] 265126=test_gem_commands_signin_command I, [2024-04-30T01:20:18.083484 #223805] INFO -- : [416/884] 265126=test_emitter I, [2024-04-30T01:20:18.123593 #223805] INFO -- : [417/884] 265126=test_ldap I, [2024-04-30T01:20:18.173364 #223805] INFO -- : [418/884] 265126=test_string_processing I, [2024-04-30T01:20:18.352050 #223805] INFO -- : [419/884] 265126=test_fileutils I, [2024-04-30T01:20:18.551385 #223805] INFO -- : [420/884] 265125=test_rdoc_options I, [2024-04-30T01:20:20.273060 #223805] INFO -- : [421/884] 265126=test_cesu8 I, [2024-04-30T01:20:20.299993 #223805] INFO -- : [422/884] 265126=test_econv I, [2024-04-30T01:20:20.382288 #223805] INFO -- : [423/884] 265123=test_gem_version I, [2024-04-30T01:20:20.514403 #223805] INFO -- : [424/884] 265125=parse_comments_test I, [2024-04-30T01:20:20.568326 #223805] INFO -- : [425/884] 265125=test_noarg I, [2024-04-30T01:20:21.096857 #223805] INFO -- : [426/884] 265123=test_tempfile I, [2024-04-30T01:20:21.960151 #223805] INFO -- : [427/884] 265125=test_queue I, [2024-04-30T01:20:22.002155 #223805] INFO -- : [428/884] 265125=test_function I, [2024-04-30T01:20:22.232138 #223805] INFO -- : [429/884] 265123=test_gem_resolver_index_specification I, [2024-04-30T01:20:22.285556 #223805] INFO -- : [430/884] 265124=test_internal_ivar I, [2024-04-30T01:20:22.302074 #223805] INFO -- : [431/884] 265124=test_gem_commands_help_command I, [2024-04-30T01:20:22.365819 #223805] INFO -- : [432/884] 265125=test_rdoc_markup I, [2024-04-30T01:20:22.405103 #223805] INFO -- : [433/884] 265125=test_tracepoint I, [2024-04-30T01:20:22.554019 #223805] INFO -- : [434/884] 265123=test_prettyprint I, [2024-04-30T01:20:22.707159 #223805] INFO -- : [435/884] 265123=test_basicsocket I, [2024-04-30T01:20:22.765772 #223805] INFO -- : [436/884] 265123=test_utf32 I, [2024-04-30T01:20:22.797905 #223805] INFO -- : [437/884] 265123=test_duplicate I, [2024-04-30T01:20:22.850166 #223805] INFO -- : [438/884] 265123=test_gem_installer I, [2024-04-30T01:20:23.065785 #223805] INFO -- : [439/884] 265124=test_yamlstore I, [2024-04-30T01:20:23.146331 #223805] INFO -- : [440/884] 265124=test_rdoc_parser_rd I, [2024-04-30T01:20:23.217071 #223805] INFO -- : [441/884] 265124=test_date_strftime I, [2024-04-30T01:20:24.557609 #223805] INFO -- : [442/884] 265125=test_irb I, [2024-04-30T01:20:26.637364 #223805] INFO -- : [443/884] 265125=test_random I, [2024-04-30T01:20:26.690125 #223805] INFO -- : [444/884] 265125=test_asn1 I, [2024-04-30T01:20:26.857415 #223805] INFO -- : [445/884] 265125=test_const I, [2024-04-30T01:20:26.912035 #223805] INFO -- : [446/884] 265125=test_class I, [2024-04-30T01:20:27.096977 #223805] INFO -- : [447/884] 265124=test_rdoc_normal_class I, [2024-04-30T01:20:27.652613 #223805] INFO -- : [448/884] 265124=test_load I, [2024-04-30T01:20:27.771523 #223805] INFO -- : [449/884] 265124=json_string_matching_test I, [2024-04-30T01:20:27.831621 #223805] INFO -- : [450/884] 265124=test_gem_source_installed I, [2024-04-30T01:20:27.858493 #223805] INFO -- : [451/884] 265124=test_erb I, [2024-04-30T01:20:28.156447 #223805] INFO -- : [452/884] 265126=test_x509ext I, [2024-04-30T01:20:28.187107 #223805] INFO -- : [453/884] 265126=test_yield_block I, [2024-04-30T01:20:28.223397 #223805] INFO -- : [454/884] 265126=test_len I, [2024-04-30T01:20:28.251531 #223805] INFO -- : [455/884] 265124=test_completion I, [2024-04-30T01:20:28.354689 #223805] INFO -- : [456/884] 265126=test_gem_commands_cert_command I, [2024-04-30T01:20:35.668498 #223805] INFO -- : [457/884] 265124=test_rational I, [2024-04-30T01:20:35.833748 #223805] INFO -- : [458/884] 265124=test_rational2 I, [2024-04-30T01:20:35.957090 #223805] INFO -- : [459/884] 265124=test_spell_checker I, [2024-04-30T01:20:36.004084 #223805] INFO -- : [460/884] 265124=attribute_write_test I, [2024-04-30T01:20:36.030303 #223805] INFO -- : [461/884] 265124=test_propertyputref I, [2024-04-30T01:20:36.076263 #223805] INFO -- : [462/884] 265124=test_assembler I, [2024-04-30T01:20:36.124500 #223805] INFO -- : [463/884] 265124=test_benchmark I, [2024-04-30T01:20:38.816028 #223805] INFO -- : [464/884] 265124=test_gem_dependency_list I, [2024-04-30T01:20:39.358581 #223805] INFO -- : [465/884] 265124=test_nesting_parser I, [2024-04-30T01:20:39.478797 #223805] INFO -- : [466/884] 265124=test_win32ole_method_event I, [2024-04-30T01:20:39.509811 #223805] INFO -- : [467/884] 265124=test_scalar_scanner I, [2024-04-30T01:20:39.684318 #223805] INFO -- : [468/884] 265124=test_gem_source I, [2024-04-30T01:20:41.428127 #223805] INFO -- : [469/884] 265124=test_helper_method I, [2024-04-30T01:20:41.527437 #223805] INFO -- : [470/884] 265124=test_gem_package_tar_writer I, [2024-04-30T01:20:42.615184 #223805] INFO -- : [471/884] 265124=test_array I, [2024-04-30T01:20:46.964357 #223805] INFO -- : [472/884] 265126=test_gem_commands_outdated_command I, [2024-04-30T01:20:47.176397 #223805] INFO -- : [473/884] 265126=test_provider I, [2024-04-30T01:20:51.456058 #223805] INFO -- : [474/884] 265126=test_abi I, [2024-04-30T01:20:52.662030 #223805] INFO -- : [475/884] 265126=test_yamldbm I, [2024-04-30T01:20:53.150524 #223805] INFO -- : [476/884] 265126=test_gem_commands_rebuild_command I, [2024-04-30T01:20:53.161615 #223805] INFO -- : [477/884] 265126=test_load I, [2024-04-30T01:20:53.186313 #223805] INFO -- : [478/884] 265126=test_rdoc_parser_simple I, [2024-04-30T01:20:53.312249 #223805] INFO -- : [479/884] 265126=test_gem_ext_builder I, [2024-04-30T01:20:54.219920 #223805] INFO -- : [480/884] 265125=test_https I, [2024-04-30T01:20:55.251326 #223805] INFO -- : [481/884] 265125=test_evaluation I, [2024-04-30T01:20:55.277594 #223805] INFO -- : [482/884] 265125=test_rubyvm I, [2024-04-30T01:20:55.553582 #223805] INFO -- : [483/884] 265125=test_configuration I, [2024-04-30T01:20:56.208102 #223805] INFO -- : [484/884] 265125=test_monitor I, [2024-04-30T01:20:56.500258 #223805] INFO -- : [485/884] 265125=test_buffered_io I, [2024-04-30T01:20:56.534137 #223805] INFO -- : [486/884] 265125=test_whileuntil I, [2024-04-30T01:20:56.624721 #223805] INFO -- : [487/884] 265125=test_rdoc_generator_markup I, [2024-04-30T01:20:56.662512 #223805] INFO -- : [488/884] 265125=test_boolean I, [2024-04-30T01:20:56.722324 #223805] INFO -- : [489/884] 265125=integer_parse_test I, [2024-04-30T01:20:57.203891 #223805] INFO -- : [490/884] 265125=test_instrumentation_api I, [2024-04-30T01:20:58.925622 #223805] INFO -- : [491/884] 265123=test_stringify_symbols I, [2024-04-30T01:20:59.014888 #223805] INFO -- : [492/884] 265123=constant_path_node_test I, [2024-04-30T01:20:59.508278 #223805] INFO -- : [493/884] 265123=test_ssl I, [2024-04-30T01:21:00.683895 #223805] INFO -- : [494/884] 265125=test_gem_ext_cargo_builder I, [2024-04-30T01:21:01.408831 #223805] INFO -- : [495/884] 265125=test_module I, [2024-04-30T01:21:01.919001 #223805] INFO -- : [496/884] 265126=test_gem_request_set I, [2024-04-30T01:21:04.746545 #223805] INFO -- : [497/884] 265126=test_method_name_check I, [2024-04-30T01:21:05.001495 #223805] INFO -- : [498/884] 265126=test_arith_seq_extract I, [2024-04-30T01:21:06.520083 #223805] INFO -- : [499/884] 265126=test_parser I, [2024-04-30T01:21:06.976151 #223805] INFO -- : [500/884] 265126=test_allocation I, [2024-04-30T01:21:16.951244 #223805] INFO -- : [501/884] 265125=test_div I, [2024-04-30T01:21:16.988679 #223805] INFO -- : [502/884] 265125=test_win32ole_variant_m I, [2024-04-30T01:21:16.996260 #223805] INFO -- : [503/884] 265125=test_engine I, [2024-04-30T01:21:17.048672 #223805] INFO -- : [504/884] 265125=test_key_error I, [2024-04-30T01:21:17.075161 #223805] INFO -- : [505/884] 265125=test_serialize_subclasses I, [2024-04-30T01:21:17.112502 #223805] INFO -- : [506/884] 265125=test_insns_leaf I, [2024-04-30T01:21:17.137575 #223805] INFO -- : [507/884] 265125=test_deprecated I, [2024-04-30T01:21:17.177640 #223805] INFO -- : [508/884] 265125=test_color_printer I, [2024-04-30T01:21:17.189837 #223805] INFO -- : [509/884] 265125=test_files_test_1 I, [2024-04-30T01:21:17.241885 #223805] INFO -- : [510/884] 265125=test_gem_path_support I, [2024-04-30T01:21:17.651909 #223805] INFO -- : [511/884] 265125=test_struct I, [2024-04-30T01:21:23.862630 #223805] INFO -- : [512/884] 265125=test_set I, [2024-04-30T01:21:24.211211 #223805] INFO -- : [513/884] 265125=test_mutex I, [2024-04-30T01:21:25.309296 #223805] INFO -- : [514/884] 265125=test_x509req I, [2024-04-30T01:21:26.815922 #223805] INFO -- : [515/884] 265126=test_rdoc_rd_inline I, [2024-04-30T01:21:26.882374 #223805] INFO -- : [516/884] 265126=test_win32ole_variant_outarg I, [2024-04-30T01:21:26.888748 #223805] INFO -- : [517/884] 265126=json_common_interface_test I, [2024-04-30T01:21:27.027144 #223805] INFO -- : [518/884] 265126=test_gem_source_subpath_problem I, [2024-04-30T01:21:27.037661 #223805] INFO -- : [519/884] 265125=test_dln I, [2024-04-30T01:21:27.105066 #223805] INFO -- : [520/884] 265125=memsize_test I, [2024-04-30T01:21:27.191441 #223805] INFO -- : [521/884] 265125=json_parser_test I, [2024-04-30T01:21:27.576747 #223805] INFO -- : [522/884] 265125=test_nomethod_error I, [2024-04-30T01:21:27.610563 #223805] INFO -- : [523/884] 265125=test_config I, [2024-04-30T01:21:27.886217 #223805] INFO -- : [524/884] 265125=test_pkg_config I, [2024-04-30T01:21:28.006202 #223805] INFO -- : [525/884] 265125=test_cparser I, [2024-04-30T01:21:28.036298 #223805] INFO -- : [526/884] 265126=magic_comment_test I, [2024-04-30T01:21:28.123190 #223805] INFO -- : [527/884] 265126=test_rdoc_markup_to_html_snippet I, [2024-04-30T01:21:28.555845 #223805] INFO -- : [528/884] 265126=test_struct I, [2024-04-30T01:21:28.594118 #223805] INFO -- : [529/884] 265126=test_variable I, [2024-04-30T01:21:29.342485 #223805] INFO -- : [530/884] 265126=test_rdoc_markup_include I, [2024-04-30T01:21:29.354783 #223805] INFO -- : [531/884] 265126=test_sexp I, [2024-04-30T01:21:29.527708 #223805] INFO -- : [532/884] 265126=fuzzer_test I, [2024-04-30T01:21:29.614372 #223805] INFO -- : [533/884] 265126=test_digest_extend I, [2024-04-30T01:21:29.716301 #223805] INFO -- : [534/884] 265126=test_omap I, [2024-04-30T01:21:29.743363 #223805] INFO -- : [535/884] 265126=test_iterator I, [2024-04-30T01:21:30.322930 #223805] INFO -- : [536/884] 265126=test_string I, [2024-04-30T01:21:30.353779 #223805] INFO -- : [537/884] 265126=pattern_test I, [2024-04-30T01:21:30.442615 #223805] INFO -- : [538/884] 265126=test_memory_view I, [2024-04-30T01:21:30.539118 #223805] INFO -- : [539/884] 265126=test_debug I, [2024-04-30T01:21:30.571485 #223805] INFO -- : [540/884] 265126=test_shellwords I, [2024-04-30T01:21:30.621522 #223805] INFO -- : [541/884] 265126=test_new I, [2024-04-30T01:21:30.652351 #223805] INFO -- : [542/884] 265126=test_gem_security_signer I, [2024-04-30T01:21:31.703655 #223805] INFO -- : [543/884] 265126=test_cipher I, [2024-04-30T01:21:32.122320 #223805] INFO -- : [544/884] 265126=test_gem_resolver_git_set I, [2024-04-30T01:21:33.168244 #223805] INFO -- : [545/884] 265125=test_storage I, [2024-04-30T01:21:33.223415 #223805] INFO -- : [546/884] 265125=test_cgi_cookie I, [2024-04-30T01:21:33.323805 #223805] INFO -- : [547/884] 265125=test_require I, [2024-04-30T01:21:34.297598 #223805] INFO -- : [548/884] 265126=test_float I, [2024-04-30T01:21:35.255180 #223805] INFO -- : [549/884] 265124=test_gem_source_git I, [2024-04-30T01:21:38.677762 #223805] INFO -- : [550/884] 265124=test_refinement I, [2024-04-30T01:21:38.838601 #223805] INFO -- : [551/884] 265126=test_gem_commands_signout_command I, [2024-04-30T01:21:39.012454 #223805] INFO -- : [552/884] 265126=test_regex_casefold I, [2024-04-30T01:21:43.265135 #223805] INFO -- : [553/884] 265126=test_gem_resolver_installer_set I, [2024-04-30T01:21:44.778818 #223805] INFO -- : [554/884] 265126=test_dir_m17n I, [2024-04-30T01:21:48.309683 #223805] INFO -- : [555/884] 265123=test_metaclass I, [2024-04-30T01:21:48.315112 #223805] INFO -- : [556/884] 265123=test_rdoc_top_level I, [2024-04-30T01:21:50.833438 #223805] INFO -- : [557/884] 265123=test_rdoc_rd I, [2024-04-30T01:21:50.892771 #223805] INFO -- : [558/884] 265123=test_cgi_session I, [2024-04-30T01:21:50.983864 #223805] INFO -- : [559/884] 265123=test_x509crl I, [2024-04-30T01:21:51.987303 #223805] INFO -- : [560/884] 265125=test_fixnum I, [2024-04-30T01:21:52.206796 #223805] INFO -- : [561/884] 265125=test_signal I, [2024-04-30T01:21:52.635709 #223805] INFO -- : [562/884] 265123=test_process I, [2024-04-30T01:21:52.787197 #223805] INFO -- : [563/884] 265123=test_input_method I, [2024-04-30T01:21:53.028044 #223805] INFO -- : [564/884] 265123=test_windows_1252 I, [2024-04-30T01:21:53.056269 #223805] INFO -- : [565/884] 265123=test_date_marshal I, [2024-04-30T01:21:53.082160 #223805] INFO -- : [566/884] 265123=test_mkmf I, [2024-04-30T01:21:53.241175 #223805] INFO -- : [567/884] 265123=test_history I, [2024-04-30T01:21:53.465376 #223805] INFO -- : [568/884] 265123=test_popen_deadlock I, [2024-04-30T01:21:55.560245 #223805] INFO -- : [569/884] 265126=test_delegate I, [2024-04-30T01:21:55.723862 #223805] INFO -- : [570/884] 265126=test_exit I, [2024-04-30T01:21:56.382970 #223805] INFO -- : [571/884] 265126=test_recursion I, [2024-04-30T01:21:56.390641 #223805] INFO -- : [572/884] 265126=test_rdoc_servlet I, [2024-04-30T01:21:56.980020 #223805] INFO -- : [573/884] 265126=test_gem_security I, [2024-04-30T01:21:57.788833 #223805] INFO -- : [574/884] 265125=test_ractor I, [2024-04-30T01:21:57.956981 #223805] INFO -- : [575/884] 265123=test_digest I, [2024-04-30T01:21:58.001665 #223805] INFO -- : [576/884] 265123=test_closure I, [2024-04-30T01:21:58.165657 #223805] INFO -- : [577/884] 265125=test_bundled_ca I, [2024-04-30T01:21:59.745249 #223805] INFO -- : [578/884] 265125=test_open3 I, [2024-04-30T01:22:01.347907 #223805] INFO -- : [579/884] 265123=test_fiber I, [2024-04-30T01:22:04.101642 #223805] INFO -- : [580/884] 265124=test_multi_irb_commands I, [2024-04-30T01:22:04.146875 #223805] INFO -- : [581/884] 265124=reflection_test I, [2024-04-30T01:22:04.180306 #223805] INFO -- : [582/884] 265124=test_within_pipe I, [2024-04-30T01:22:04.367517 #223805] INFO -- : [583/884] 265124=test_gem_bundler_version_finder I, [2024-04-30T01:22:04.634415 #223805] INFO -- : [584/884] 265124=test_emoji_breaks I, [2024-04-30T01:22:04.710942 #223805] INFO -- : [585/884] 265124=test_help I, [2024-04-30T01:22:04.789420 #223805] INFO -- : [586/884] 265124=test_rdoc_markup_to_bs I, [2024-04-30T01:22:05.493455 #223805] INFO -- : [587/884] 265124=test_beginendblock I, [2024-04-30T01:22:08.234658 #223805] INFO -- : [588/884] 265124=test_gem_commands_unpack_command I, [2024-04-30T01:22:10.677805 #223805] INFO -- : [589/884] 265124=test_files_lib I, [2024-04-30T01:22:10.719233 #223805] INFO -- : [590/884] 265124=test_stream I, [2024-04-30T01:22:10.786868 #223805] INFO -- : [591/884] 265124=test_webauthn_listener_response I, [2024-04-30T01:22:10.943473 #223805] INFO -- : [592/884] 265124=test_time I, [2024-04-30T01:22:12.429796 #223805] INFO -- : [593/884] 265124=test_to_ary_concat I, [2024-04-30T01:22:15.708062 #223805] INFO -- : [594/884] 265123=test_rdoc_markup_pre_process I, [2024-04-30T01:22:16.231096 #223805] INFO -- : [595/884] 265123=test_printf I, [2024-04-30T01:22:16.356842 #223805] INFO -- : [596/884] 265123=test_pinned I, [2024-04-30T01:22:16.664580 #223805] INFO -- : [597/884] 265123=test_rdoc_markup_heading I, [2024-04-30T01:22:16.726183 #223805] INFO -- : [598/884] 265123=test_iseq I, [2024-04-30T01:22:20.103227 #223805] INFO -- : [599/884] 265125=test_exception_at_throwing I, [2024-04-30T01:22:20.733305 #223805] INFO -- : [600/884] 265125=test_pkey_dsa I, [2024-04-30T01:22:21.785437 #223805] INFO -- : [601/884] 265123=test_class I, [2024-04-30T01:22:21.978368 #223805] INFO -- : [602/884] 265123=test_ocsp I, [2024-04-30T01:22:24.205527 #223805] INFO -- : [603/884] 265124=test_scheduler I, [2024-04-30T01:22:24.649301 #223805] INFO -- : [604/884] 265124=test_gem_commands_build_command I, [2024-04-30T01:22:24.840650 #223805] INFO -- : [605/884] 265123=test_case_comprehensive I, [2024-04-30T01:22:26.782305 #223805] INFO -- : [606/884] 265124=test_interned_str I, [2024-04-30T01:22:26.830680 #223805] INFO -- : [607/884] 265124=test_gem_commands_server_command I, [2024-04-30T01:22:26.837562 #223805] INFO -- : [608/884] 265124=test_did_you_mean I, [2024-04-30T01:22:27.256478 #223805] INFO -- : [609/884] 265124=test_variable_name_check I, [2024-04-30T01:22:27.905200 #223805] INFO -- : [610/884] 265124=test_io_m17n I, [2024-04-30T01:22:34.487552 #223805] INFO -- : [611/884] 265125=test_tracer I, [2024-04-30T01:22:34.494219 #223805] INFO -- : [612/884] 265125=test_cmethod I, [2024-04-30T01:22:34.801446 #223805] INFO -- : [613/884] 265125=test_option I, [2024-04-30T01:22:35.429878 #223805] INFO -- : [614/884] 265125=test_append I, [2024-04-30T01:22:35.455504 #223805] INFO -- : [615/884] 265125=test_data I, [2024-04-30T01:22:35.483697 #223805] INFO -- : [616/884] 265125=static_literals_test I, [2024-04-30T01:22:35.588222 #223805] INFO -- : [617/884] 265125=test_gem_gem_runner I, [2024-04-30T01:22:35.867312 #223805] INFO -- : [618/884] 265124=test_filter I, [2024-04-30T01:22:35.985002 #223805] INFO -- : [619/884] 265125=test_rdoc_method_attr I, [2024-04-30T01:22:36.041076 #223805] INFO -- : [620/884] 265124=test_unicode I, [2024-04-30T01:22:36.075035 #223805] INFO -- : [621/884] 265124=parameters_signature_test I, [2024-04-30T01:22:36.147172 #223805] INFO -- : [622/884] 265124=test_koi8 I, [2024-04-30T01:22:36.186937 #223805] INFO -- : [623/884] 265124=test_enumerator I, [2024-04-30T01:22:36.214043 #223805] INFO -- : [624/884] 265124=test_rdoc_parser_changelog I, [2024-04-30T01:22:36.847087 #223805] INFO -- : [625/884] 265125=test_rdoc_generator_pot I, [2024-04-30T01:22:36.863986 #223805] INFO -- : [626/884] 265124=test_lexer I, [2024-04-30T01:22:36.887236 #223805] INFO -- : [627/884] 265125=test_thread_cv I, [2024-04-30T01:22:37.197752 #223805] INFO -- : [628/884] 265124=test_ssl_session I, [2024-04-30T01:22:37.628210 #223805] INFO -- : [629/884] 265125=test_random I, [2024-04-30T01:22:37.697191 #223805] INFO -- : [630/884] 265125=test_notimplement I, [2024-04-30T01:22:37.714158 #223805] INFO -- : [631/884] 265125=test_key_event_record I, [2024-04-30T01:22:37.761068 #223805] INFO -- : [632/884] 265125=test_gem_uri I, [2024-04-30T01:22:38.201674 #223805] INFO -- : [633/884] 265125=test_gem_commands_update_command I, [2024-04-30T01:22:41.669635 #223805] INFO -- : [634/884] 265124=test_gem_resolver_vendor_specification I, [2024-04-30T01:22:41.955000 #223805] INFO -- : [635/884] 265124=test_rdoc_markup_to_html I, [2024-04-30T01:22:42.506778 #223805] INFO -- : [636/884] 265124=test_date_compat I, [2024-04-30T01:22:42.645018 #223805] INFO -- : [637/884] 265124=test_bug-14834 I, [2024-04-30T01:22:43.117489 #223805] INFO -- : [638/884] 265124=test_compile_prism I, [2024-04-30T01:22:45.518190 #223805] INFO -- : [639/884] 265124=test_terminfo I, [2024-04-30T01:22:45.586395 #223805] INFO -- : [640/884] 265124=test_case_mapping I, [2024-04-30T01:22:45.709467 #223805] INFO -- : [641/884] 265124=redundant_return_test I, [2024-04-30T01:22:45.761624 #223805] INFO -- : [642/884] 265124=test_path I, [2024-04-30T01:22:45.798961 #223805] INFO -- : [643/884] 265124=test_win32ole_param_event I, [2024-04-30T01:22:45.858806 #223805] INFO -- : [644/884] 265124=test_bn I, [2024-04-30T01:22:46.022679 #223805] INFO -- : [645/884] 265124=test_http I, [2024-04-30T01:22:46.277824 #223805] INFO -- : [646/884] 265125=test_addrinfo I, [2024-04-30T01:22:46.589385 #223805] INFO -- : [647/884] 265125=test_tree_spell_checker I, [2024-04-30T01:22:46.756620 #223805] INFO -- : [648/884] 265125=test_httpresponses I, [2024-04-30T01:22:46.792680 #223805] INFO -- : [649/884] 265125=test_encoding I, [2024-04-30T01:22:46.884786 #223805] INFO -- : [650/884] 265125=test_set_len I, [2024-04-30T01:22:47.020922 #223805] INFO -- : [651/884] 265125=test_rdoc_ri_driver I, [2024-04-30T01:22:49.262435 #223805] INFO -- : [652/884] 265125=test_gem_resolver_local_specification I, [2024-04-30T01:22:49.382323 #223805] INFO -- : [653/884] 265125=test_httpheader I, [2024-04-30T01:22:49.507326 #223805] INFO -- : [654/884] 265125=test_rdoc_markup_to_label I, [2024-04-30T01:22:50.339215 #223805] INFO -- : [655/884] 265125=test_install I, [2024-04-30T01:22:50.392668 #223805] INFO -- : [656/884] 265126=test_sockopt I, [2024-04-30T01:22:50.449706 #223805] INFO -- : [657/884] 265126=test_color I, [2024-04-30T01:22:50.976285 #223805] INFO -- : [658/884] 265126=json_encoding_test I, [2024-04-30T01:22:51.039596 #223805] INFO -- : [659/884] 265126=test_key_stroke I, [2024-04-30T01:22:51.086488 #223805] INFO -- : [660/884] 265126=test_human_typo I, [2024-04-30T01:22:51.126324 #223805] INFO -- : [661/884] 265126=test_primitive I, [2024-04-30T01:22:51.192535 #223805] INFO -- : [662/884] 265126=test_rbconfig I, [2024-04-30T01:22:51.279369 #223805] INFO -- : [663/884] 265126=test_gem_commands_yank_command I, [2024-04-30T01:22:51.300134 #223805] INFO -- : [664/884] 265125=test_win32ole_param I, [2024-04-30T01:22:51.339659 #223805] INFO -- : [665/884] 265125=test_pair I, [2024-04-30T01:22:52.307641 #223805] INFO -- : [666/884] 265126=test_euc_jp I, [2024-04-30T01:22:52.350541 #223805] INFO -- : [667/884] 265126=test_rdoc_generator_pot_po_entry I, [2024-04-30T01:22:52.472064 #223805] INFO -- : [668/884] 265126=test_acceptable I, [2024-04-30T01:22:53.016319 #223805] INFO -- : [669/884] 265126=test_document I, [2024-04-30T01:22:53.043982 #223805] INFO -- : [670/884] 265126=test_rdoc_i18n_locale I, [2024-04-30T01:22:53.105814 #223805] INFO -- : [671/884] 265126=test_name_error_extension I, [2024-04-30T01:22:53.150889 #223805] INFO -- : [672/884] 265126=test_chilled I, [2024-04-30T01:22:53.165956 #223805] INFO -- : [673/884] 265126=test_normalize I, [2024-04-30T01:22:53.204711 #223805] INFO -- : [674/884] 265126=test_ossl I, [2024-04-30T01:23:02.982632 #223805] INFO -- : [675/884] 265124=test_timeout I, [2024-04-30T01:23:02.990286 #223805] INFO -- : [676/884] 265124=compiler_test I, [2024-04-30T01:23:03.274429 #223805] INFO -- : [677/884] 265124=test_flip I, [2024-04-30T01:23:03.359065 #223805] INFO -- : [678/884] 265124=test_change_word I, [2024-04-30T01:23:03.802610 #223805] INFO -- : [679/884] 265124=test_sleep I, [2024-04-30T01:23:08.457647 #223805] INFO -- : [680/884] 265124=test_gem_local_remote_options I, [2024-04-30T01:23:09.020329 #223805] INFO -- : [681/884] 265124=test_ruby_lex I, [2024-04-30T01:23:09.984483 #223805] INFO -- : [682/884] 265124=test_object I, [2024-04-30T01:23:12.506766 #223805] INFO -- : [683/884] 265124=test_date_arith I, [2024-04-30T01:23:12.555774 #223805] INFO -- : [684/884] 265126=test_pointer I, [2024-04-30T01:23:12.648346 #223805] INFO -- : [685/884] 265124=test_big5 I, [2024-04-30T01:23:12.694971 #223805] INFO -- : [686/884] 265124=test_func I, [2024-04-30T01:23:14.793816 #223805] INFO -- : [687/884] 265125=test_type I, [2024-04-30T01:23:15.088999 #223805] INFO -- : [688/884] 265125=test_ractor I, [2024-04-30T01:23:15.523834 #223805] INFO -- : [689/884] 265125=test_tsort I, [2024-04-30T01:23:15.673770 #223805] INFO -- : [690/884] 265125=test_signedness I, [2024-04-30T01:23:17.303958 #223805] INFO -- : [691/884] 265126=test_rdoc_rd_block_parser I, [2024-04-30T01:23:17.487512 #223805] INFO -- : [692/884] 265126=test_object I, [2024-04-30T01:23:17.523167 #223805] INFO -- : [693/884] 265126=heredoc_dedent_test I, [2024-04-30T01:23:17.618033 #223805] INFO -- : [694/884] 265126=test_cgi_header I, [2024-04-30T01:23:17.657257 #223805] INFO -- : [695/884] 265126=version_test I, [2024-04-30T01:23:17.737289 #223805] INFO -- : [696/884] 265126=test_gem_command_manager I, [2024-04-30T01:23:18.931099 #223805] INFO -- : [697/884] 265126=test_gem_gemcutter_utilities I, [2024-04-30T01:23:20.420699 #223805] INFO -- : [698/884] 265126=test_basicinstructions I, [2024-04-30T01:23:20.991205 #223805] INFO -- : [699/884] 265126=test_key_actor_emacs I, [2024-04-30T01:23:21.849954 #223805] INFO -- : [700/884] 265126=test_arithmetic_sequence I, [2024-04-30T01:23:22.112676 #223805] INFO -- : [701/884] 265126=test_gem_update_suggestion I, [2024-04-30T01:23:22.876057 #223805] INFO -- : [702/884] 265126=test_files_test I, [2024-04-30T01:23:23.146363 #223805] INFO -- : [703/884] 265126=test_file_exhaustive I, [2024-04-30T01:23:32.004905 #223805] INFO -- : [704/884] 265124=test_logger I, [2024-04-30T01:23:32.122388 #223805] INFO -- : [705/884] 265124=test_not I, [2024-04-30T01:23:32.180732 #223805] INFO -- : [706/884] 265124=test_gem_resolver_lock_set I, [2024-04-30T01:23:32.525050 #223805] INFO -- : [707/884] 265124=test_import I, [2024-04-30T01:23:35.083116 #223805] INFO -- : [708/884] 265125=test_rdoc_parser_markdown I, [2024-04-30T01:23:35.174770 #223805] INFO -- : [709/884] 265125=test_numhash I, [2024-04-30T01:23:35.206440 #223805] INFO -- : [710/884] 265125=test_weakkeymap I, [2024-04-30T01:23:37.929409 #223805] INFO -- : [711/884] 265125=test_gem_commands_push_command I, [2024-04-30T01:23:40.779967 #223805] INFO -- : [712/884] 265125=test_pkey_rsa I, [2024-04-30T01:23:41.700905 #223805] INFO -- : [713/884] 265124=test_gem_platform I, [2024-04-30T01:23:42.534994 #223805] INFO -- : [714/884] 265124=test_rdoc_markup_hard_break I, [2024-04-30T01:23:42.573045 #223805] INFO -- : [715/884] 265124=test_placearg I, [2024-04-30T01:23:43.000020 #223805] INFO -- : [716/884] 265124=test_date_strptime I, [2024-04-30T01:23:43.305368 #223805] INFO -- : [717/884] 265125=test_gem_package_task I, [2024-04-30T01:23:43.348422 #223805] INFO -- : [718/884] 265125=test_win32ole_method I, [2024-04-30T01:23:43.384260 #223805] INFO -- : [719/884] 265125=test_delete I, [2024-04-30T01:23:43.420238 #223805] INFO -- : [720/884] 265125=test_class_name_check I, [2024-04-30T01:23:43.770562 #223805] INFO -- : [721/884] 265125=test_keyword I, [2024-04-30T01:23:43.931292 #223805] INFO -- : [722/884] 265124=test_continuation I, [2024-04-30T01:23:43.989021 #223805] INFO -- : [723/884] 265124=test_fd_setsize I, [2024-04-30T01:23:44.091647 #223805] INFO -- : [724/884] 265124=test_x509store I, [2024-04-30T01:23:47.083517 #223805] INFO -- : [725/884] 265124=test_rdoc_code_object I, [2024-04-30T01:23:47.324991 #223805] INFO -- : [726/884] 265125=test_x509name I, [2024-04-30T01:23:47.403279 #223805] INFO -- : [727/884] 265125=test_fips I, [2024-04-30T01:23:48.505743 #223805] INFO -- : [728/884] 265126=test_update I, [2024-04-30T01:23:48.536961 #223805] INFO -- : [729/884] 265126=test_jaro_winkler I, [2024-04-30T01:23:48.545362 #223805] INFO -- : [730/884] 265126=test_helper I, [2024-04-30T01:23:48.572918 #223805] INFO -- : [731/884] 265126=test_random_formatter I, [2024-04-30T01:23:48.744828 #223805] INFO -- : [732/884] 265126=test_ast I, [2024-04-30T01:23:49.759517 #223805] INFO -- : [733/884] 265124=test_gem_request_set_gem_dependency_api I, [2024-04-30T01:23:50.110532 #223805] INFO -- : [734/884] 265125=test_lambda I, [2024-04-30T01:23:50.577691 #223805] INFO -- : [735/884] 265125=test_webauthn_listener I, [2024-04-30T01:23:50.793955 #223805] INFO -- : Leaked file descriptor: WebauthnListenerTest#test_wait_for_otp_code_get_follows_options: 11 : # I, [2024-04-30T01:23:50.856898 #223805] INFO -- : COMMAND PID USER FD TYPE DEVICE SIZE/OFF NODE NAME I, [2024-04-30T01:23:50.857119 #223805] INFO -- : ruby 265125 sipeed 11u IPv4 2312548 0t0 TCP localhost:34393->localhost:54166 (CLOSE_WAIT) I, [2024-04-30T01:23:51.044783 #223805] INFO -- : Closed file descriptor: WebauthnListenerTest#test_wait_for_otp_code_options_request: 11 I, [2024-04-30T01:23:51.229190 #223805] INFO -- : [736/884] 265125=test_enumerable I, [2024-04-30T01:23:51.268458 #223805] INFO -- : [737/884] 265125=test_gem_resolver_vendor_set I, [2024-04-30T01:23:51.455918 #223805] INFO -- : [738/884] 265125=test_config I, [2024-04-30T01:23:51.810397 #223805] INFO -- : [739/884] 265124=test_gem_resolver_api_set I, [2024-04-30T01:23:52.389101 #223805] INFO -- : [740/884] 265124=test_gem_safe_marshal I, [2024-04-30T01:23:54.653619 #223805] INFO -- : [741/884] 265125=test_transcode I, [2024-04-30T01:23:56.026988 #223805] INFO -- : [742/884] 265125=json_generator_test I, [2024-04-30T01:23:56.665918 #223805] INFO -- : [743/884] 265125=test_eval I, [2024-04-30T01:23:58.393258 #223805] INFO -- : [744/884] 265125=test_encoding I, [2024-04-30T01:23:58.396489 #223805] INFO -- : [745/884] 265124=test_erb_command I, [2024-04-30T01:23:58.621768 #223805] INFO -- : [746/884] 265124=test_helper I, [2024-04-30T01:23:58.634541 #223805] INFO -- : [747/884] 265124=test_gem_uri_formatter I, [2024-04-30T01:23:58.791635 #223805] INFO -- : [748/884] 265124=command_line_test I, [2024-04-30T01:23:58.812597 #223805] INFO -- : [749/884] 265124=test_constant I, [2024-04-30T01:23:59.840329 #223805] INFO -- : [750/884] 265125=test_pty I, [2024-04-30T01:24:02.286776 #223805] INFO -- : [751/884] 265125=test_dup I, [2024-04-30T01:24:03.530827 #223805] INFO -- : [752/884] 265125=test_project_sanity I, [2024-04-30T01:24:04.229031 #223805] INFO -- : [753/884] 265125=test_range I, [2024-04-30T01:24:10.266140 #223805] INFO -- : [754/884] 265125=test_rdoc_ri_paths I, [2024-04-30T01:24:10.396025 #223805] INFO -- : [755/884] 265125=test_locale I, [2024-04-30T01:24:10.602981 #223805] INFO -- : [756/884] 265125=test_addr I, [2024-04-30T01:24:10.680799 #223805] INFO -- : [757/884] 265125=library_symbols_test I, [2024-04-30T01:24:10.975590 #223805] INFO -- : [758/884] 265125=test_ensured I, [2024-04-30T01:24:11.205224 #223805] INFO -- : [759/884] 265125=test_ts I, [2024-04-30T01:24:14.799842 #223805] INFO -- : [760/884] 265124=test_gem_commands_check_command I, [2024-04-30T01:24:15.085907 #223805] INFO -- : [761/884] 265124=test_regexp I, [2024-04-30T01:24:16.008556 #223805] INFO -- : [762/884] 265125=errors_test I, [2024-04-30T01:24:16.563132 #223805] INFO -- : [763/884] 265125=test_rdoc_markup_document I, [2024-04-30T01:24:17.006607 #223805] INFO -- : [764/884] 265125=test_integer_comb I, [2024-04-30T01:24:38.718403 #223805] INFO -- : [765/884] 265125=test_tmpdir I, [2024-04-30T01:24:39.307246 #223805] INFO -- : [766/884] 265125=test_vm_dump I, [2024-04-30T01:24:39.333943 #223805] INFO -- : [767/884] 265125=test_udp I, [2024-04-30T01:24:39.381796 #223805] INFO -- : [768/884] 265125=test_force_exit I, [2024-04-30T01:24:39.449047 #223805] INFO -- : [769/884] 265125=test_file I, [2024-04-30T01:24:45.946286 #223805] INFO -- : [770/884] 265125=test_ostruct I, [2024-04-30T01:24:47.501983 #223805] INFO -- : [771/884] 265125=unescape_test I, [2024-04-30T01:25:02.987153 #223805] INFO -- : [772/884] 265125=bom_test I, [2024-04-30T01:25:03.578313 #223805] INFO -- : [773/884] 265125=test_data_error I, [2024-04-30T01:25:03.603561 #223805] INFO -- : [774/884] 265125=static_inspect_test I, [2024-04-30T01:25:04.003856 #223805] INFO -- : [775/884] 265125=test_ractor I, [2024-04-30T01:25:06.628609 #223805] INFO -- : [776/884] 265125=test_debugger_integration I, [2024-04-30T01:25:06.662183 #223805] INFO -- : [777/884] 265125=test_rendering I, [2024-04-30T01:25:06.758634 #223805] INFO -- : [778/884] 265125=test_thread I, [2024-04-30T01:25:23.672657 #223805] INFO -- : [779/884] 265125=json_ext_parser_test I, [2024-04-30T01:25:23.708645 #223805] INFO -- : [780/884] 265125=test_my_integer I, [2024-04-30T01:25:24.064391 #223805] INFO -- : [781/884] 265125=test_ssl I, [2024-04-30T01:25:26.156219 #223805] INFO -- : [782/884] 265125=test_singleton_function I, [2024-04-30T01:25:26.334429 #223805] INFO -- : [783/884] 265125=test_ancdata I, [2024-04-30T01:25:26.432539 #223805] INFO -- : [784/884] 265125=test_reline_key I, [2024-04-30T01:25:26.450164 #223805] INFO -- : [785/884] 265125=test_rb_str_dup I, [2024-04-30T01:25:26.498924 #223805] INFO -- : [786/884] 265125=test_weakref I, [2024-04-30T01:25:28.000472 #223805] INFO -- : [787/884] 265125=test_nonblock I, [2024-04-30T01:25:28.097049 #223805] INFO -- : [788/884] 265125=test_unicode_normalize I, [2024-04-30T01:25:51.194775 #223805] INFO -- : [789/884] 265123=test_marshal I, [2024-04-30T01:25:56.442535 #223805] INFO -- : [790/884] 265123=test_timeout I, [2024-04-30T01:25:58.061234 #223805] INFO -- : [791/884] 265125=test_alias I, [2024-04-30T01:25:58.257671 #223805] INFO -- : [792/884] 265123=test_parser I, [2024-04-30T01:25:58.429291 #223805] INFO -- : [793/884] 265123=test_cgi_core I, [2024-04-30T01:25:58.551358 #223805] INFO -- : [794/884] 265123=test_gem_commands_open_command I, [2024-04-30T01:25:59.308557 #223805] INFO -- : [795/884] 265125=test_dns I, [2024-04-30T01:25:59.334383 #223805] INFO -- : [796/884] 265123=test_ractor I, [2024-04-30T01:25:59.420427 #223805] INFO -- : [797/884] 265123=test_gem I, [2024-04-30T01:26:00.216979 #223805] INFO -- : [798/884] 265125=test_gem_source_lock I, [2024-04-30T01:26:00.726155 #223805] INFO -- : [799/884] 265125=parse_stream_test I, [2024-04-30T01:26:00.760342 #223805] INFO -- : [800/884] 265125=desugar_compiler_test I, [2024-04-30T01:26:00.843718 #223805] INFO -- : [801/884] 265125=test_integer I, [2024-04-30T01:26:01.395862 #223805] INFO -- : [802/884] 265125=test_dryrun I, [2024-04-30T01:26:01.561970 #223805] INFO -- : [803/884] 265125=test_rdoc_attr I, [2024-04-30T01:26:01.680136 #223805] INFO -- : [804/884] 265125=test_env I, [2024-04-30T01:26:09.306384 #223805] INFO -- : [805/884] 265123=test_gem_commands_setup_command I, [2024-04-30T01:26:13.175122 #223805] INFO -- : [806/884] 265123=test_rubygems I, [2024-04-30T01:26:14.290053 #223805] INFO -- : [807/884] 265123=test_https_proxy I, [2024-04-30T01:26:14.404119 #223805] INFO -- : [808/884] 265123=test_call I, [2024-04-30T01:26:15.607552 #223805] INFO -- : [809/884] 265123=test_integer I, [2024-04-30T01:26:22.815575 #223805] INFO -- : [810/884] 265125=test_cgi_modruby I, [2024-04-30T01:26:22.903389 #223805] INFO -- : [811/884] 265125=test_rubyoptions I, [2024-04-30T01:26:30.287325 #223805] INFO -- : [812/884] 265124=test_super I, [2024-04-30T01:26:37.272013 #223805] INFO -- : [813/884] 265124=test_gem_resolver_git_specification I, [2024-04-30T01:26:37.325583 #223805] INFO -- : [814/884] 265123=test_usrmarshal I, [2024-04-30T01:26:38.632152 #223805] INFO -- : [815/884] 265124=test_object_references I, [2024-04-30T01:26:38.676260 #223805] INFO -- : [816/884] 265124=test_capacity I, [2024-04-30T01:26:38.724864 #223805] INFO -- : [817/884] 265124=test_nextafter I, [2024-04-30T01:26:38.925110 #223805] INFO -- : [818/884] 265123=test_have_func I, [2024-04-30T01:26:39.474040 #223805] INFO -- : [819/884] 265124=test_stat I, [2024-04-30T01:26:39.554646 #223805] INFO -- : [820/884] 265124=test_gem_request_set_lockfile_tokenizer I, [2024-04-30T01:26:40.038770 #223805] INFO -- : [821/884] 265124=test_function_entry I, [2024-04-30T01:26:40.051857 #223805] INFO -- : [822/884] 265124=test_arith_seq_beg_len_step I, [2024-04-30T01:26:40.690184 #223805] INFO -- : [823/884] 265124=test_gem_resolver_requirement_list I, [2024-04-30T01:26:40.946199 #223805] INFO -- : [824/884] 265124=test_pkcs7 I, [2024-04-30T01:26:42.681888 #223805] INFO -- : [825/884] 265124=test_enc_associate I, [2024-04-30T01:26:48.700288 #223805] INFO -- : [826/884] 265124=test_lazy_enumerator I, [2024-04-30T01:26:53.669413 #223805] INFO -- : [827/884] 265124=test_unix I, [2024-04-30T01:26:54.210723 #223805] INFO -- : [828/884] 265124=test_nofree I, [2024-04-30T01:26:55.038577 #223805] INFO -- : [829/884] 265124=test_gem_commands_pristine_command I, [2024-04-30T01:27:03.186895 #223805] INFO -- : [830/884] 265125=test_context I, [2024-04-30T01:27:04.399325 #223805] INFO -- : [831/884] 265125=test_symbol I, [2024-04-30T01:27:13.077835 #223805] INFO -- : [832/884] 265124=test_coder I, [2024-04-30T01:27:13.233382 #223805] INFO -- : [833/884] 265124=test_find_executable I, [2024-04-30T01:27:13.304725 #223805] INFO -- : [834/884] 265124=ruby_api_test I, [2024-04-30T01:27:15.058886 #223805] INFO -- : [835/884] 265124=test_word I, [2024-04-30T01:27:15.342918 #223805] INFO -- : [836/884] 265124=test_gem_commands_cleanup_command I, [2024-04-30T01:27:23.171512 #223805] INFO -- : [837/884] 265124=test_cgi_multipart I, [2024-04-30T01:27:24.140264 #223805] INFO -- : [838/884] 265124=test_member I, [2024-04-30T01:27:24.174018 #223805] INFO -- : [839/884] 265124=test_numeric I, [2024-04-30T01:27:24.343717 #223805] INFO -- : [840/884] 265124=test_autoconf I, [2024-04-30T01:27:24.376682 #223805] INFO -- : [841/884] 265124=test_eval I, [2024-04-30T01:27:24.531982 #223805] INFO -- : [842/884] 265124=test_dir I, [2024-04-30T01:27:28.637320 #223805] INFO -- : [843/884] 265124=format_errors_test I, [2024-04-30T01:27:28.769530 #223805] INFO -- : [844/884] 265124=test_gem_console_ui I, [2024-04-30T01:27:29.126552 #223805] INFO -- : [845/884] 265124=test_date_ractor I, [2024-04-30T01:27:32.520787 #223805] INFO -- : [846/884] 265124=test_ractor_compatibility I, [2024-04-30T01:27:35.306892 #223805] INFO -- : [847/884] 265124=test_mailto I, [2024-04-30T01:27:35.358819 #223805] INFO -- : [848/884] 265124=test_symbol I, [2024-04-30T01:27:35.436290 #223805] INFO -- : [849/884] 265124=location_test I, [2024-04-30T01:27:35.763214 #223805] INFO -- : [850/884] 265124=test_coderange I, [2024-04-30T01:27:35.884029 #223805] INFO -- : [851/884] 265124=json_generic_object_test I, [2024-04-30T01:27:35.958094 #223805] INFO -- : [852/884] 265124=test_gem_source_fetch_problem I, [2024-04-30T01:27:36.071138 #223805] INFO -- : [853/884] 265124=test_http_request I, [2024-04-30T01:27:36.156835 #223805] INFO -- : [854/884] 265124=test_resize I, [2024-04-30T01:27:36.220515 #223805] INFO -- : [855/884] 265124=test_error_highlight I, [2024-04-30T01:27:37.746893 #223805] INFO -- : [856/884] 265123=test_rdoc_comment I, [2024-04-30T01:27:38.014907 #223805] INFO -- : [857/884] 265123=test_rdoc_generator_darkfish I, [2024-04-30T01:27:40.437037 #223805] INFO -- : [858/884] 265123=test_merge_keys I, [2024-04-30T01:27:40.547082 #223805] INFO -- : [859/884] 265123=test_rdoc_extend I, [2024-04-30T01:27:40.732078 #223805] INFO -- : [860/884] 265123=test_rdoc_markup_to_ansi I, [2024-04-30T01:27:41.015524 #223805] INFO -- : [861/884] 265123=test_history I, [2024-04-30T01:27:41.102529 #223805] INFO -- : [862/884] 265123=test_mixed_unicode_escapes I, [2024-04-30T01:27:41.123033 #223805] INFO -- : [863/884] 265123=test_ipaddr I, [2024-04-30T01:27:41.328314 #223805] INFO -- : [864/884] 265123=test_win32ole_variant I, [2024-04-30T01:27:41.342318 #223805] INFO -- : [865/884] 265123=test_gem_resolver_api_specification I, [2024-04-30T01:27:41.437428 #223805] INFO -- : [866/884] 265124=test_time_tz I, [2024-04-30T01:27:41.697390 #223805] INFO -- : [867/884] 265123=test_win32ole_event I, [2024-04-30T01:27:41.751818 #223805] INFO -- : [868/884] 265123=test_rdoc_generator_json_index I, [2024-04-30T01:27:42.079549 #223805] INFO -- : [869/884] 265123=ractor_test I, [2024-04-30T01:27:42.121704 #223805] INFO -- : [870/884] 265124=test_trace I, [2024-04-30T01:27:42.251836 #223805] INFO -- : [871/884] 265124=test_io_wait_uncommon I, [2024-04-30T01:27:42.309297 #223805] INFO -- : [872/884] 265124=test_arity I, [2024-04-30T01:27:42.408397 #223805] INFO -- : [873/884] 265124=test_stringio I, [2024-04-30T01:27:42.714593 #223805] INFO -- : [874/884] 265123=test_win32ole_variable I, [2024-04-30T01:27:42.739330 #223805] INFO -- : [875/884] 265123=test_gem_ci_detector I, [2024-04-30T01:27:42.788623 #223805] INFO -- : [876/884] 265123=test_bignum I, [2024-04-30T01:27:43.113612 #223805] INFO -- : [877/884] 265124=test_rdoc_class_module I, [2024-04-30T01:27:43.790053 #223805] INFO -- : [878/884] 265123=test_threadgroup I, [2024-04-30T01:27:44.809970 #223805] INFO -- : [879/884] 265123=test_gem_specification I, [2024-04-30T01:27:47.259748 #223805] INFO -- : [880/884] 265125=test_enum I, [2024-04-30T01:27:47.541012 #223805] INFO -- : [881/884] 265124=test_complex2 I, [2024-04-30T01:27:47.703584 #223805] INFO -- : [882/884] 265124=test_resolve_symbol I, [2024-04-30T01:27:48.098875 #223805] INFO -- : [883/884] 265124=test_gem_package I, [2024-04-30T01:27:53.160790 #223805] INFO -- : [884/884] 265125=test_have_macro I, [2024-04-30T01:29:50.927554 #223805] INFO -- : Finished tests in 897.902451s, 29.2593 tests/s, 10402.3761 assertions/s. E, [2024-04-30T01:29:50.928420 #223805] ERROR -- : Children under /tmp/rubytest.39t88o: E, [2024-04-30T01:29:50.929079 #223805] ERROR -- : * drwx------ 4 80 2024-04-30 01:20:52 +0000 gem_rebuild20240430-265126-bdst7/ E, [2024-04-30T01:29:50.929385 #223805] ERROR -- : * drwxr-xr-x 2 60 2024-04-30 01:20:53 +0000 new/ E, [2024-04-30T01:29:50.929664 #223805] ERROR -- : * -rw-r--r-- 1 4096 2024-04-30 01:20:53 +0000 rebuild_test_gem-1.0.0.gem E, [2024-04-30T01:29:50.929944 #223805] ERROR -- : * drwxr-xr-x 2 60 2024-04-30 01:20:52 +0000 old/ E, [2024-04-30T01:29:50.930220 #223805] ERROR -- : * -rw-r--r-- 1 4096 2024-04-30 01:20:52 +0000 rebuild_test_gem-1.0.0.gem I, [2024-04-30T01:29:50.938636 #223805] INFO -- : 26272 tests, 9340319 assertions, 0 failures, 0 errors, 306 skips I, [2024-04-30T01:29:50.938882 #223805] INFO -- : I, [2024-04-30T01:29:50.939022 #223805] INFO -- : ruby -v: ruby 3.4.0dev (2024-04-30T00:00:05Z master 528c4501f4) [riscv64-linux] I, [2024-04-30T01:29:50.949390 #223805] INFO -- : $$$[end] "make yes-test-all TESTOPTS='--stderr-on-failure' TESTS='-j4'" exit with 0. I, [2024-04-30T01:29:50.950132 #223805] INFO -- : $$$[beg] make yes-test-rubyspec MSPECOPT='--error-output stderr --debug -j' TESTS='-j4' I, [2024-04-30T01:29:51.797899 #223805] INFO -- : BASERUBY = /usr/bin/ruby --disable=gems I, [2024-04-30T01:29:51.798183 #223805] INFO -- : CC = gcc I, [2024-04-30T01:29:51.798339 #223805] INFO -- : LD = ld I, [2024-04-30T01:29:51.798491 #223805] INFO -- : LDSHARED = gcc -shared I, [2024-04-30T01:29:51.798650 #223805] INFO -- : CFLAGS = -O3 -fno-fast-math -ggdb3 -Wall -Wextra -Wdeprecated-declarations -Wdiv-by-zero -Wduplicated-cond -Wimplicit-function-declaration -Wimplicit-int -Wpointer-arith -Wwrite-strings -Wold-style-definition -Wimplicit-fallthrough=0 -Wmissing-noreturn -Wno-cast-function-type -Wno-constant-logical-operand -Wno-long-long -Wno-missing-field-initializers -Wno-overlength-strings -Wno-packed-bitfield-compat -Wno-parentheses-equality -Wno-self-assign -Wno-tautological-compare -Wno-unused-parameter -Wno-unused-value -Wsuggest-attribute=format -Wsuggest-attribute=noreturn -Wunused-variable -Wmisleading-indentation -Wundef -fPIC I, [2024-04-30T01:29:51.798857 #223805] INFO -- : XCFLAGS = -U_FORTIFY_SOURCE -D_FORTIFY_SOURCE=2 -fstack-protector-strong -fno-strict-overflow -fvisibility=hidden -fexcess-precision=standard -DRUBY_EXPORT -I. -I.ext/include/riscv64-linux -I/tmp/ruby/src/trunk/include -I/tmp/ruby/src/trunk -I/tmp/ruby/src/trunk/prism -I/tmp/ruby/src/trunk/enc/unicode/15.0.0 I, [2024-04-30T01:29:51.799000 #223805] INFO -- : CPPFLAGS = I, [2024-04-30T01:29:51.799140 #223805] INFO -- : DLDFLAGS = -Wl,--compress-debug-sections=zlib -Wl,-soname,libruby.so.3.4 -fstack-protector-strong I, [2024-04-30T01:29:51.799278 #223805] INFO -- : SOLIBS = -lz -lrt -lrt -lgmp -ldl -lcrypt -lm -lpthread I, [2024-04-30T01:29:51.799413 #223805] INFO -- : LANG = I, [2024-04-30T01:29:51.799553 #223805] INFO -- : LC_ALL = I, [2024-04-30T01:29:51.799688 #223805] INFO -- : LC_CTYPE = I, [2024-04-30T01:29:51.799824 #223805] INFO -- : MFLAGS = I, [2024-04-30T01:29:51.799955 #223805] INFO -- : RUSTC = rustc I, [2024-04-30T01:29:51.800104 #223805] INFO -- : YJIT_RUSTC_ARGS = --crate-name=yjit --crate-type=staticlib --edition=2021 -g -C lto=thin -C opt-level=3 -C overflow-checks=on '--out-dir=/tmp/ruby/build/trunk/yjit/target/release/' /tmp/ruby/src/trunk/yjit/src/lib.rs I, [2024-04-30T01:29:51.803509 #223805] INFO -- : gcc (Debian 13.2.0-4revyos1) 13.2.0 I, [2024-04-30T01:29:51.803694 #223805] INFO -- : Copyright (C) 2023 Free Software Foundation, Inc. I, [2024-04-30T01:29:51.803781 #223805] INFO -- : This is free software; see the source for copying conditions. There is NO I, [2024-04-30T01:29:51.803866 #223805] INFO -- : warranty; not even for MERCHANTABILITY or FITNESS FOR A PARTICULAR PURPOSE. I, [2024-04-30T01:29:51.803953 #223805] INFO -- : I, [2024-04-30T01:29:51.831806 #223805] INFO -- : generating enc.mk I, [2024-04-30T01:29:53.332150 #223805] INFO -- : making enc I, [2024-04-30T01:29:53.503988 #223805] INFO -- : make[1]: Entering directory '/tmp/ruby/build/trunk' I, [2024-04-30T01:29:53.504233 #223805] INFO -- : make[1]: Nothing to be done for 'enc'. I, [2024-04-30T01:29:53.504341 #223805] INFO -- : make[1]: Leaving directory '/tmp/ruby/build/trunk' I, [2024-04-30T01:29:53.506847 #223805] INFO -- : making srcs under enc I, [2024-04-30T01:29:53.801872 #223805] INFO -- : make[1]: Entering directory '/tmp/ruby/build/trunk' I, [2024-04-30T01:29:53.802069 #223805] INFO -- : make[1]: Nothing to be done for 'srcs'. I, [2024-04-30T01:29:53.802164 #223805] INFO -- : make[1]: Leaving directory '/tmp/ruby/build/trunk' I, [2024-04-30T01:29:53.807078 #223805] INFO -- : generating transdb.h I, [2024-04-30T01:29:55.096729 #223805] INFO -- : transdb.h unchanged I, [2024-04-30T01:29:55.102321 #223805] INFO -- : making trans I, [2024-04-30T01:29:55.435852 #223805] INFO -- : make[1]: Entering directory '/tmp/ruby/build/trunk' I, [2024-04-30T01:29:55.436046 #223805] INFO -- : make[1]: Nothing to be done for 'trans'. I, [2024-04-30T01:29:55.436145 #223805] INFO -- : make[1]: Leaving directory '/tmp/ruby/build/trunk' I, [2024-04-30T01:29:55.438697 #223805] INFO -- : making encs I, [2024-04-30T01:29:55.823016 #223805] INFO -- : make[1]: Entering directory '/tmp/ruby/build/trunk' I, [2024-04-30T01:29:55.823218 #223805] INFO -- : make[1]: Nothing to be done for 'encs'. I, [2024-04-30T01:29:55.823316 #223805] INFO -- : make[1]: Leaving directory '/tmp/ruby/build/trunk' I, [2024-04-30T01:29:55.837972 #223805] INFO -- : generating makefiles ext/configure-ext.mk I, [2024-04-30T01:29:56.036920 #223805] INFO -- : ext/configure-ext.mk updated I, [2024-04-30T01:29:56.050898 #223805] INFO -- : make[1]: Entering directory '/tmp/ruby/build/trunk' I, [2024-04-30T01:30:08.277499 #223805] INFO -- : make[1]: Leaving directory '/tmp/ruby/build/trunk' I, [2024-04-30T01:30:08.279639 #223805] INFO -- : generating makefile exts.mk I, [2024-04-30T01:30:08.605204 #223805] INFO -- : exts.mk unchanged I, [2024-04-30T01:30:08.651131 #223805] INFO -- : make[1]: Entering directory '/tmp/ruby/build/trunk' I, [2024-04-30T01:30:10.859756 #223805] INFO -- : make[2]: Entering directory '/tmp/ruby/build/trunk/ext/coverage' I, [2024-04-30T01:30:10.895769 #223805] INFO -- : make[2]: Leaving directory '/tmp/ruby/build/trunk/ext/coverage' I, [2024-04-30T01:30:10.937552 #223805] INFO -- : make[2]: Entering directory '/tmp/ruby/build/trunk/ext/date' I, [2024-04-30T01:30:10.965787 #223805] INFO -- : make[2]: Leaving directory '/tmp/ruby/build/trunk/ext/date' I, [2024-04-30T01:30:10.999276 #223805] INFO -- : make[2]: Entering directory '/tmp/ruby/build/trunk/ext/digest' I, [2024-04-30T01:30:11.063582 #223805] INFO -- : make[2]: Leaving directory '/tmp/ruby/build/trunk/ext/digest' I, [2024-04-30T01:30:11.242766 #223805] INFO -- : make[2]: Entering directory '/tmp/ruby/build/trunk/ext/digest/sha2' I, [2024-04-30T01:30:11.269596 #223805] INFO -- : make[2]: Leaving directory '/tmp/ruby/build/trunk/ext/digest/sha2' I, [2024-04-30T01:30:11.406046 #223805] INFO -- : make[2]: Entering directory '/tmp/ruby/build/trunk/ext/fiddle' I, [2024-04-30T01:30:11.477224 #223805] INFO -- : make[2]: Leaving directory '/tmp/ruby/build/trunk/ext/fiddle' I, [2024-04-30T01:30:11.517457 #223805] INFO -- : make[2]: Entering directory '/tmp/ruby/build/trunk/ext/io/console' I, [2024-04-30T01:30:11.540980 #223805] INFO -- : make[2]: Leaving directory '/tmp/ruby/build/trunk/ext/io/console' I, [2024-04-30T01:30:11.627558 #223805] INFO -- : make[2]: Entering directory '/tmp/ruby/build/trunk/ext/json' I, [2024-04-30T01:30:11.689398 #223805] INFO -- : make[2]: Leaving directory '/tmp/ruby/build/trunk/ext/json' I, [2024-04-30T01:30:11.792546 #223805] INFO -- : make[2]: Entering directory '/tmp/ruby/build/trunk/ext/monitor' I, [2024-04-30T01:30:11.814338 #223805] INFO -- : make[2]: Leaving directory '/tmp/ruby/build/trunk/ext/monitor' I, [2024-04-30T01:30:11.866502 #223805] INFO -- : make[2]: Entering directory '/tmp/ruby/build/trunk/ext/objspace' I, [2024-04-30T01:30:11.901089 #223805] INFO -- : make[2]: Leaving directory '/tmp/ruby/build/trunk/ext/objspace' I, [2024-04-30T01:30:12.021760 #223805] INFO -- : make[2]: Entering directory '/tmp/ruby/build/trunk/ext/openssl' I, [2024-04-30T01:30:12.153466 #223805] INFO -- : make[2]: Leaving directory '/tmp/ruby/build/trunk/ext/openssl' I, [2024-04-30T01:30:12.180478 #223805] INFO -- : make[2]: Entering directory '/tmp/ruby/build/trunk/ext/pathname' I, [2024-04-30T01:30:12.200692 #223805] INFO -- : make[2]: Leaving directory '/tmp/ruby/build/trunk/ext/pathname' I, [2024-04-30T01:30:12.254787 #223805] INFO -- : make[2]: Entering directory '/tmp/ruby/build/trunk/ext/psych' I, [2024-04-30T01:30:12.419017 #223805] INFO -- : make[2]: Leaving directory '/tmp/ruby/build/trunk/ext/psych' I, [2024-04-30T01:30:12.447178 #223805] INFO -- : make[2]: Entering directory '/tmp/ruby/build/trunk/ext/pty' I, [2024-04-30T01:30:12.468550 #223805] INFO -- : make[2]: Leaving directory '/tmp/ruby/build/trunk/ext/pty' I, [2024-04-30T01:30:12.570168 #223805] INFO -- : make[2]: Entering directory '/tmp/ruby/build/trunk/ext/ripper' I, [2024-04-30T01:30:12.624052 #223805] INFO -- : make[2]: Leaving directory '/tmp/ruby/build/trunk/ext/ripper' I, [2024-04-30T01:30:12.635388 #223805] INFO -- : make[2]: Entering directory '/tmp/ruby/build/trunk/ext/rubyvm' I, [2024-04-30T01:30:12.650983 #223805] INFO -- : make[2]: Leaving directory '/tmp/ruby/build/trunk/ext/rubyvm' I, [2024-04-30T01:30:12.732468 #223805] INFO -- : make[2]: Entering directory '/tmp/ruby/build/trunk/ext/socket' I, [2024-04-30T01:30:12.792478 #223805] INFO -- : make[2]: Leaving directory '/tmp/ruby/build/trunk/ext/socket' I, [2024-04-30T01:30:12.904801 #223805] INFO -- : make[2]: Entering directory '/tmp/ruby/build/trunk/.bundle/gems/bigdecimal-3.1.7/ext/bigdecimal' I, [2024-04-30T01:30:13.065199 #223805] INFO -- : make[2]: Leaving directory '/tmp/ruby/build/trunk/.bundle/gems/bigdecimal-3.1.7/ext/bigdecimal' I, [2024-04-30T01:30:13.080199 #223805] INFO -- : make[2]: Entering directory '/tmp/ruby/build/trunk/.bundle/gems/debug-1.9.2/ext/debug' I, [2024-04-30T01:30:13.240525 #223805] INFO -- : make[2]: Leaving directory '/tmp/ruby/build/trunk/.bundle/gems/debug-1.9.2/ext/debug' I, [2024-04-30T01:30:13.271281 #223805] INFO -- : make[2]: Entering directory '/tmp/ruby/build/trunk/.bundle/gems/nkf-0.2.0/ext/nkf' I, [2024-04-30T01:30:13.427931 #223805] INFO -- : make[2]: Leaving directory '/tmp/ruby/build/trunk/.bundle/gems/nkf-0.2.0/ext/nkf' I, [2024-04-30T01:30:13.445345 #223805] INFO -- : make[2]: Entering directory '/tmp/ruby/build/trunk/.bundle/gems/racc-1.7.3/ext/racc/cparse' I, [2024-04-30T01:30:13.606838 #223805] INFO -- : make[2]: Leaving directory '/tmp/ruby/build/trunk/.bundle/gems/racc-1.7.3/ext/racc/cparse' I, [2024-04-30T01:30:13.628808 #223805] INFO -- : make[2]: Entering directory '/tmp/ruby/build/trunk/.bundle/gems/rbs-3.4.4/ext/rbs_extension' I, [2024-04-30T01:30:13.786768 #223805] INFO -- : make[2]: Leaving directory '/tmp/ruby/build/trunk/.bundle/gems/rbs-3.4.4/ext/rbs_extension' I, [2024-04-30T01:30:13.804336 #223805] INFO -- : make[2]: Entering directory '/tmp/ruby/build/trunk/.bundle/gems/syslog-0.1.2/ext/syslog' I, [2024-04-30T01:30:13.963720 #223805] INFO -- : make[2]: Leaving directory '/tmp/ruby/build/trunk/.bundle/gems/syslog-0.1.2/ext/syslog' I, [2024-04-30T01:30:14.180372 #223805] INFO -- : make[2]: Entering directory '/tmp/ruby/build/trunk' I, [2024-04-30T01:30:14.812753 #223805] INFO -- : make[2]: 'ruby' is up to date. I, [2024-04-30T01:30:14.813133 #223805] INFO -- : make[2]: Leaving directory '/tmp/ruby/build/trunk' I, [2024-04-30T01:30:14.815303 #223805] INFO -- : make[1]: Leaving directory '/tmp/ruby/build/trunk' I, [2024-04-30T01:30:14.850508 #223805] INFO -- : make[1]: Entering directory '/tmp/ruby/build/trunk' I, [2024-04-30T01:30:14.850707 #223805] INFO -- : make[1]: Nothing to be done for 'note'. I, [2024-04-30T01:30:14.850808 #223805] INFO -- : make[1]: Leaving directory '/tmp/ruby/build/trunk' E, [2024-04-30T01:30:15.393357 #223805] ERROR -- : $ /tmp/ruby/build/trunk/miniruby -I/tmp/ruby/src/trunk/lib /tmp/ruby/src/trunk/tool/runruby.rb --archdir=/tmp/ruby/build/trunk --extout=.ext -- /tmp/ruby/src/trunk/spec/mspec/bin/mspec-run -B /tmp/ruby/src/trunk/spec/default.mspec --error-output stderr --debug -fy -o /tmp/rubytest.z9p872/1-mspec-multi-0 E, [2024-04-30T01:30:15.394461 #223805] ERROR -- : $ /tmp/ruby/build/trunk/miniruby -I/tmp/ruby/src/trunk/lib /tmp/ruby/src/trunk/tool/runruby.rb --archdir=/tmp/ruby/build/trunk --extout=.ext -- /tmp/ruby/src/trunk/spec/mspec/bin/mspec-run -B /tmp/ruby/src/trunk/spec/default.mspec --error-output stderr --debug -fy -o /tmp/rubytest.z9p872/2-mspec-multi-1 E, [2024-04-30T01:30:15.395504 #223805] ERROR -- : $ /tmp/ruby/build/trunk/miniruby -I/tmp/ruby/src/trunk/lib /tmp/ruby/src/trunk/tool/runruby.rb --archdir=/tmp/ruby/build/trunk --extout=.ext -- /tmp/ruby/src/trunk/spec/mspec/bin/mspec-run -B /tmp/ruby/src/trunk/spec/default.mspec --error-output stderr --debug -fy -o /tmp/rubytest.z9p872/3-mspec-multi-2 E, [2024-04-30T01:30:15.396639 #223805] ERROR -- : $ /tmp/ruby/build/trunk/miniruby -I/tmp/ruby/src/trunk/lib /tmp/ruby/src/trunk/tool/runruby.rb --archdir=/tmp/ruby/build/trunk --extout=.ext -- /tmp/ruby/src/trunk/spec/mspec/bin/mspec-run -B /tmp/ruby/src/trunk/spec/default.mspec --error-output stderr --debug -fy -o /tmp/rubytest.z9p872/4-mspec-multi-3 I, [2024-04-30T01:30:16.362609 #223805] INFO -- : ruby 3.4.0dev (2024-04-30T00:00:05Z master 528c4501f4) [riscv64-linux] I, [2024-04-30T01:30:46.993019 #223805] INFO -- : 0 ......................................................................... I, [2024-04-30T01:30:58.499331 #223805] INFO -- : 73 ......................................................................... I, [2024-04-30T01:30:59.803337 #223805] INFO -- : 146 ......................................................................... I, [2024-04-30T01:31:01.746588 #223805] INFO -- : 219 ......................................................................... I, [2024-04-30T01:31:02.460644 #223805] INFO -- : 292 ......................................................................... I, [2024-04-30T01:31:03.500667 #223805] INFO -- : 365 ......................................................................... I, [2024-04-30T01:31:04.207368 #223805] INFO -- : 438 ......................................................................... I, [2024-04-30T01:31:04.569427 #223805] INFO -- : 511 ......................................................................... I, [2024-04-30T01:31:04.892625 #223805] INFO -- : 584 ......................................................................... I, [2024-04-30T01:31:07.859012 #223805] INFO -- : 657 ......................................................................... I, [2024-04-30T01:31:08.407703 #223805] INFO -- : 730 ......................................................................... I, [2024-04-30T01:31:08.668761 #223805] INFO -- : 803 ......................................................................... I, [2024-04-30T01:31:09.658324 #223805] INFO -- : 876 ......................................................................... I, [2024-04-30T01:31:10.273024 #223805] INFO -- : 949 ......................................................................... I, [2024-04-30T01:31:13.012244 #223805] INFO -- : 1022 ......................................................................... I, [2024-04-30T01:31:24.336970 #223805] INFO -- : 1095 ......................................................................... I, [2024-04-30T01:31:29.614746 #223805] INFO -- : 1168 ......................................................................... I, [2024-04-30T01:31:30.834102 #223805] INFO -- : 1241 ......................................................................... I, [2024-04-30T01:31:31.821122 #223805] INFO -- : 1314 ......................................................................... I, [2024-04-30T01:31:32.172294 #223805] INFO -- : 1387 ......................................................................... I, [2024-04-30T01:31:38.220118 #223805] INFO -- : 1460 ......................................................................... I, [2024-04-30T01:31:55.061277 #223805] INFO -- : 1533 ......................................................................... I, [2024-04-30T01:31:57.010149 #223805] INFO -- : 1606 ......................................................................... I, [2024-04-30T01:32:00.767419 #223805] INFO -- : 1679 ......................................................................... I, [2024-04-30T01:32:02.773186 #223805] INFO -- : 1752 ......................................................................... I, [2024-04-30T01:32:04.816984 #223805] INFO -- : 1825 ......................................................................... I, [2024-04-30T01:32:06.986814 #223805] INFO -- : 1898 ......................................................................... I, [2024-04-30T01:32:08.726588 #223805] INFO -- : 1971 ......................................................................... I, [2024-04-30T01:32:10.657776 #223805] INFO -- : 2044 ......................................................................... I, [2024-04-30T01:32:11.850923 #223805] INFO -- : 2117 ......................................................................... I, [2024-04-30T01:32:12.449646 #223805] INFO -- : 2190 ......................................................................... I, [2024-04-30T01:32:12.716864 #223805] INFO -- : 2263 ......................................................................... I, [2024-04-30T01:32:12.982618 #223805] INFO -- : 2336 ......................................................................... I, [2024-04-30T01:32:13.498801 #223805] INFO -- : 2409 ......................................................................... I, [2024-04-30T01:32:14.693576 #223805] INFO -- : 2482 ......................................................................... I, [2024-04-30T01:32:15.406745 #223805] INFO -- : 2555 ......................................................................... I, [2024-04-30T01:32:18.544482 #223805] INFO -- : 2628 ......................................................................... I, [2024-04-30T01:32:20.351062 #223805] INFO -- : 2701 ......................................................................... I, [2024-04-30T01:32:20.966647 #223805] INFO -- : 2774 ......................................................................... I, [2024-04-30T01:32:22.317943 #223805] INFO -- : 2847 ......................................................................... I, [2024-04-30T01:32:23.478774 #223805] INFO -- : 2920 ......................................................................... I, [2024-04-30T01:32:24.249880 #223805] INFO -- : 2993 ......................................................................... I, [2024-04-30T01:32:24.696875 #223805] INFO -- : 3066 ......................................................................... I, [2024-04-30T01:32:25.066707 #223805] INFO -- : 3139 ......................................................................... I, [2024-04-30T01:32:25.378451 #223805] INFO -- : 3212 ......................................................................... I, [2024-04-30T01:32:25.854794 #223805] INFO -- : 3285 ......................................................................... I, [2024-04-30T01:32:32.308288 #223805] INFO -- : 3358 ........................................................................ I, [2024-04-30T01:32:32.308536 #223805] INFO -- : I, [2024-04-30T01:32:32.308643 #223805] INFO -- : Finished in 136.915204 seconds I, [2024-04-30T01:32:32.308742 #223805] INFO -- : I, [2024-04-30T01:32:32.308844 #223805] INFO -- : 3429 files, 32607 examples, 136705 expectations, 0 failures, 0 errors, 0 tagged I, [2024-04-30T01:32:32.321997 #223805] INFO -- : $$$[end] "make yes-test-rubyspec MSPECOPT='--error-output stderr --debug -j' TESTS='-j4'" exit with 0.