# Logfile created on 2024-04-20 06:43:53 +0000 by logger.rb/v1.5.0 I, [2024-04-20T06:43:53.434026 #586117] INFO -- : #, @formatter=nil, @logdev=#, @binmode=false, @mon_data=#, @mon_data_owner_object_id=860>>> I, [2024-04-20T06:43:53.435610 #586117] INFO -- : $$$[beg] make update-unicode -j4 I, [2024-04-20T06:43:53.997611 #586117] INFO -- : Downloading Unicode emoji 15.0 files... I, [2024-04-20T06:43:53.998610 #586117] INFO -- : Downloading Unicode emoji 15.0 files... I, [2024-04-20T06:43:53.999687 #586117] INFO -- : Downloading Unicode emoji 15.0 files... I, [2024-04-20T06:43:54.622450 #586117] INFO -- : made symlink emoji/15.0/emoji-sequences.txt to /tmp/ruby/src/trunk/.downloaded-cache/emoji/15.0/emoji-sequences.txt I, [2024-04-20T06:43:54.635483 #586117] INFO -- : downloading emoji/15.0/emoji-test.txt ... downloading emoji/15.0/emoji-sequences.txt ... /tmp/ruby/src/trunk/enc/unicode/data/emoji/15.0/emoji-sequences.txt already exists E, [2024-04-20T06:43:55.359950 #586117] ERROR -- : /tmp/ruby/src/trunk/tool/downloader.rb:302:in `rescue in download'/tmp/ruby/src/trunk/tool/downloader.rb:302:in `rescue in download': failed to download emoji/15.0/emoji-test.txt (RuntimeError) E, [2024-04-20T06:43:55.360203 #586117] ERROR -- : OpenURI::HTTPError: 403 Forbidden: https://www.unicode.org/Public/emoji/15.0/emoji-test.txt E, [2024-04-20T06:43:55.360359 #586117] ERROR -- : from /tmp/ruby/src/trunk/tool/downloader.rb:201:in `download' E, [2024-04-20T06:43:55.360826 #586117] ERROR -- : from /tmp/ruby/src/trunk/tool/downloader.rb:136:in `download' E, [2024-04-20T06:43:55.361347 #586117] ERROR -- : from /tmp/ruby/src/trunk/tool/downloader.rb:482:in `block in
' E, [2024-04-20T06:43:55.361508 #586117] ERROR -- : from /tmp/ruby/src/trunk/tool/downloader.rb:465:in `each' E, [2024-04-20T06:43:55.361701 #586117] ERROR -- : from /tmp/ruby/src/trunk/tool/downloader.rb:465:in `
' E, [2024-04-20T06:43:55.362100 #586117] ERROR -- : /usr/lib/ruby/3.1.0/open-uri.rb:364:in `open_http': 403 Forbidden (OpenURI::HTTPError) E, [2024-04-20T06:43:55.362296 #586117] ERROR -- : from /usr/lib/ruby/3.1.0/open-uri.rb:741:in `buffer_open' E, [2024-04-20T06:43:55.362411 #586117] ERROR -- : from /usr/lib/ruby/3.1.0/open-uri.rb:212:in `block in open_loop' E, [2024-04-20T06:43:55.362514 #586117] ERROR -- : from /usr/lib/ruby/3.1.0/open-uri.rb:210:in `catch' E, [2024-04-20T06:43:55.362612 #586117] ERROR -- : from /usr/lib/ruby/3.1.0/open-uri.rb:210:in `open_loop' E, [2024-04-20T06:43:55.362710 #586117] ERROR -- : from /usr/lib/ruby/3.1.0/open-uri.rb:151:in `open_uri' E, [2024-04-20T06:43:55.362811 #586117] ERROR -- : from /usr/lib/ruby/3.1.0/open-uri.rb:721:in `open' E, [2024-04-20T06:43:55.362911 #586117] ERROR -- : from /usr/lib/ruby/3.1.0/open-uri.rb:729:in `read' E, [2024-04-20T06:43:55.363014 #586117] ERROR -- : from /tmp/ruby/src/trunk/tool/downloader.rb:247:in `block in download' E, [2024-04-20T06:43:55.363186 #586117] ERROR -- : from /tmp/ruby/src/trunk/tool/downloader.rb:378:in `with_retry' E, [2024-04-20T06:43:55.363323 #586117] ERROR -- : from /tmp/ruby/src/trunk/tool/downloader.rb:246:in `download' E, [2024-04-20T06:43:55.363432 #586117] ERROR -- : from /tmp/ruby/src/trunk/tool/downloader.rb:136:in `download' E, [2024-04-20T06:43:55.363537 #586117] ERROR -- : from /tmp/ruby/src/trunk/tool/downloader.rb:482:in `block in
' E, [2024-04-20T06:43:55.363644 #586117] ERROR -- : from /tmp/ruby/src/trunk/tool/downloader.rb:465:in `each' E, [2024-04-20T06:43:55.363749 #586117] ERROR -- : from /tmp/ruby/src/trunk/tool/downloader.rb:465:in `
' E, [2024-04-20T06:43:55.363873 #586117] ERROR -- : : failed to download emoji/15.0/emoji-test.txt (RuntimeError) E, [2024-04-20T06:43:55.363985 #586117] ERROR -- : OpenURI::HTTPError: 403 Forbidden: https://www.unicode.org/Public/emoji/15.0/emoji-test.txt E, [2024-04-20T06:43:55.364093 #586117] ERROR -- : from /tmp/ruby/src/trunk/tool/downloader.rb:201:in `download' E, [2024-04-20T06:43:55.364218 #586117] ERROR -- : from /tmp/ruby/src/trunk/tool/downloader.rb:136:in `download' E, [2024-04-20T06:43:55.364326 #586117] ERROR -- : from /tmp/ruby/src/trunk/tool/downloader.rb:482:in `block in
' E, [2024-04-20T06:43:55.364487 #586117] ERROR -- : from /tmp/ruby/src/trunk/tool/downloader.rb:465:in `each' E, [2024-04-20T06:43:55.364684 #586117] ERROR -- : from /tmp/ruby/src/trunk/tool/downloader.rb:465:in `
' E, [2024-04-20T06:43:55.364811 #586117] ERROR -- : /usr/lib/ruby/3.1.0/open-uri.rb:364:in `open_http': 403 Forbidden (OpenURI::HTTPError) E, [2024-04-20T06:43:55.364919 #586117] ERROR -- : from /usr/lib/ruby/3.1.0/open-uri.rb:741:in `buffer_open' E, [2024-04-20T06:43:55.365031 #586117] ERROR -- : from /usr/lib/ruby/3.1.0/open-uri.rb:212:in `block in open_loop' E, [2024-04-20T06:43:55.365141 #586117] ERROR -- : from /usr/lib/ruby/3.1.0/open-uri.rb:210:in `catch' E, [2024-04-20T06:43:55.365267 #586117] ERROR -- : from /usr/lib/ruby/3.1.0/open-uri.rb:210:in `open_loop' E, [2024-04-20T06:43:55.365372 #586117] ERROR -- : from /usr/lib/ruby/3.1.0/open-uri.rb:151:in `open_uri' E, [2024-04-20T06:43:55.365481 #586117] ERROR -- : from /usr/lib/ruby/3.1.0/open-uri.rb:721:in `open' E, [2024-04-20T06:43:55.365587 #586117] ERROR -- : from /usr/lib/ruby/3.1.0/open-uri.rb:729:in `read' E, [2024-04-20T06:43:55.365692 #586117] ERROR -- : from /tmp/ruby/src/trunk/tool/downloader.rb:247:in `block in download' E, [2024-04-20T06:43:55.365801 #586117] ERROR -- : from /tmp/ruby/src/trunk/tool/downloader.rb:378:in `with_retry' E, [2024-04-20T06:43:55.365910 #586117] ERROR -- : from /tmp/ruby/src/trunk/tool/downloader.rb:246:in `download' E, [2024-04-20T06:43:55.366015 #586117] ERROR -- : from /tmp/ruby/src/trunk/tool/downloader.rb:136:in `download' E, [2024-04-20T06:43:55.366132 #586117] ERROR -- : from /tmp/ruby/src/trunk/tool/downloader.rb:482:in `block in
' E, [2024-04-20T06:43:55.366291 #586117] ERROR -- : from /tmp/ruby/src/trunk/tool/downloader.rb:465:in `each' E, [2024-04-20T06:43:55.366451 #586117] ERROR -- : from /tmp/ruby/src/trunk/tool/downloader.rb:465:in `
' E, [2024-04-20T06:43:55.382305 #586117] ERROR -- : make: *** [uncommon.mk:1782: /tmp/ruby/src/trunk/enc/unicode/data/emoji/15.0/emoji-test.txt] Error 1 E, [2024-04-20T06:43:55.382508 #586117] ERROR -- : make: *** Waiting for unfinished jobs.... E, [2024-04-20T06:43:55.384026 #586117] ERROR -- : make: *** [uncommon.mk:1782: /tmp/ruby/src/trunk/enc/unicode/data/emoji/15.0/emoji-sequences.txt] Error 1 E, [2024-04-20T06:43:55.384187 #586117] ERROR -- : make: *** Deleting file '/tmp/ruby/src/trunk/enc/unicode/data/emoji/15.0/emoji-sequences.txt' E, [2024-04-20T06:43:55.847740 #586117] ERROR -- : /tmp/ruby/src/trunk/tool/downloader.rb:302:in `rescue in download': failed to download emoji/15.0/emoji-sequences.txt (RuntimeError) E, [2024-04-20T06:43:55.848844 #586117] ERROR -- : EOFError: end of file reached: https://www.unicode.org/Public/emoji/15.0/emoji-sequences.txt E, [2024-04-20T06:43:55.849705 #586117] ERROR -- : from /tmp/ruby/src/trunk/tool/downloader.rb:201:in `download' E, [2024-04-20T06:43:55.850240 #586117] ERROR -- : from /tmp/ruby/src/trunk/tool/downloader.rb:136:in `download' E, [2024-04-20T06:43:55.850743 #586117] ERROR -- : from /tmp/ruby/src/trunk/tool/downloader.rb:482:in `block in
' E, [2024-04-20T06:43:55.851243 #586117] ERROR -- : from /tmp/ruby/src/trunk/tool/downloader.rb:465:in `each' E, [2024-04-20T06:43:55.851818 #586117] ERROR -- : from /tmp/ruby/src/trunk/tool/downloader.rb:465:in `
' E, [2024-04-20T06:43:55.854281 #586117] ERROR -- : /usr/lib/ruby/3.1.0/net/protocol.rb:227:in `rbuf_fill': end of file reached (EOFError) E, [2024-04-20T06:43:55.855228 #586117] ERROR -- : from /usr/lib/ruby/3.1.0/net/protocol.rb:193:in `readuntil' E, [2024-04-20T06:43:55.855721 #586117] ERROR -- : from /usr/lib/ruby/3.1.0/net/protocol.rb:203:in `readline' E, [2024-04-20T06:43:55.856194 #586117] ERROR -- : from /usr/lib/ruby/3.1.0/net/http/response.rb:42:in `read_status_line' E, [2024-04-20T06:43:55.857003 #586117] ERROR -- : from /usr/lib/ruby/3.1.0/net/http/response.rb:31:in `read_new' E, [2024-04-20T06:43:55.857501 #586117] ERROR -- : from /usr/lib/ruby/3.1.0/net/http.rb:1575:in `block in transport_request' E, [2024-04-20T06:43:55.858165 #586117] ERROR -- : from /usr/lib/ruby/3.1.0/net/http.rb:1566:in `catch' E, [2024-04-20T06:43:55.858284 #586117] ERROR -- : from /usr/lib/ruby/3.1.0/net/http.rb:1566:in `transport_request' E, [2024-04-20T06:43:55.858383 #586117] ERROR -- : from /usr/lib/ruby/3.1.0/net/http.rb:1539:in `request' E, [2024-04-20T06:43:55.858494 #586117] ERROR -- : from /usr/lib/ruby/3.1.0/open-uri.rb:329:in `block in open_http' E, [2024-04-20T06:43:55.858594 #586117] ERROR -- : from /usr/lib/ruby/3.1.0/net/http.rb:966:in `start' E, [2024-04-20T06:43:55.858691 #586117] ERROR -- : from /usr/lib/ruby/3.1.0/open-uri.rb:323:in `open_http' E, [2024-04-20T06:43:55.858786 #586117] ERROR -- : from /usr/lib/ruby/3.1.0/open-uri.rb:741:in `buffer_open' E, [2024-04-20T06:43:55.858882 #586117] ERROR -- : from /usr/lib/ruby/3.1.0/open-uri.rb:212:in `block in open_loop' E, [2024-04-20T06:43:55.858977 #586117] ERROR -- : from /usr/lib/ruby/3.1.0/open-uri.rb:210:in `catch' E, [2024-04-20T06:43:55.859068 #586117] ERROR -- : from /usr/lib/ruby/3.1.0/open-uri.rb:210:in `open_loop' E, [2024-04-20T06:43:55.859162 #586117] ERROR -- : from /usr/lib/ruby/3.1.0/open-uri.rb:151:in `open_uri' E, [2024-04-20T06:43:55.859297 #586117] ERROR -- : from /usr/lib/ruby/3.1.0/open-uri.rb:721:in `open' E, [2024-04-20T06:43:55.859407 #586117] ERROR -- : from /usr/lib/ruby/3.1.0/open-uri.rb:729:in `read' E, [2024-04-20T06:43:55.859506 #586117] ERROR -- : from /tmp/ruby/src/trunk/tool/downloader.rb:247:in `block in download' E, [2024-04-20T06:43:55.859602 #586117] ERROR -- : from /tmp/ruby/src/trunk/tool/downloader.rb:378:in `with_retry' E, [2024-04-20T06:43:55.859701 #586117] ERROR -- : from /tmp/ruby/src/trunk/tool/downloader.rb:246:in `download' E, [2024-04-20T06:43:55.859798 #586117] ERROR -- : from /tmp/ruby/src/trunk/tool/downloader.rb:136:in `download' E, [2024-04-20T06:43:55.859894 #586117] ERROR -- : from /tmp/ruby/src/trunk/tool/downloader.rb:482:in `block in
' E, [2024-04-20T06:43:55.859991 #586117] ERROR -- : from /tmp/ruby/src/trunk/tool/downloader.rb:465:in `each' E, [2024-04-20T06:43:55.860087 #586117] ERROR -- : from /tmp/ruby/src/trunk/tool/downloader.rb:465:in `
' E, [2024-04-20T06:43:55.877876 #586117] ERROR -- : make: *** [uncommon.mk:1782: /tmp/ruby/src/trunk/enc/unicode/data/emoji/15.0/emoji-zwj-sequences.txt] Error 1 I, [2024-04-20T06:43:55.878079 #586117] INFO -- : downloading emoji/15.0/emoji-test.txt ... I, [2024-04-20T06:43:55.879446 #586117] INFO -- : $$$[end] "make update-unicode -j4" exit with 512. I, [2024-04-20T06:43:55.879658 #586117] INFO -- : $$$[beg] make update-download -j4 I, [2024-04-20T06:43:57.051671 #586117] INFO -- : tool/config.guess already exists I, [2024-04-20T06:43:57.052545 #586117] INFO -- : tool/config.sub already exists I, [2024-04-20T06:43:57.071416 #586117] INFO -- : Update minitest to ea9caafc0754b1d6236a490d59e624b53209734a I, [2024-04-20T06:43:57.072152 #586117] INFO -- : Update power_assert to 84e85124c5014a139af39161d484156cfe87a9ed I, [2024-04-20T06:43:57.074121 #586117] INFO -- : Update rbs to ba7872795d5de04adb8ff500c0e6afdc81a041dd I, [2024-04-20T06:43:57.075154 #586117] INFO -- : Update typeprof to b19a6416da3a05d57fadd6ffdadb382b6d236ca5 I, [2024-04-20T06:43:57.079642 #586117] INFO -- : echo ea9caafc0754b1d6236a490d59e624b53209734a | /bin/sh /tmp/ruby/src/trunk/tool/ifchange /tmp/ruby/src/trunk/.bundle/.timestamp/minitest.revision - I, [2024-04-20T06:43:57.080350 #586117] INFO -- : echo 84e85124c5014a139af39161d484156cfe87a9ed | /bin/sh /tmp/ruby/src/trunk/tool/ifchange /tmp/ruby/src/trunk/.bundle/.timestamp/power_assert.revision - I, [2024-04-20T06:43:57.085055 #586117] INFO -- : echo ba7872795d5de04adb8ff500c0e6afdc81a041dd | /bin/sh /tmp/ruby/src/trunk/tool/ifchange /tmp/ruby/src/trunk/.bundle/.timestamp/rbs.revision - I, [2024-04-20T06:43:57.085559 #586117] INFO -- : echo b19a6416da3a05d57fadd6ffdadb382b6d236ca5 | /bin/sh /tmp/ruby/src/trunk/tool/ifchange /tmp/ruby/src/trunk/.bundle/.timestamp/typeprof.revision - I, [2024-04-20T06:43:57.092372 #586117] INFO -- : /tmp/ruby/src/trunk/.bundle/.timestamp/minitest.revision unchanged I, [2024-04-20T06:43:57.093491 #586117] INFO -- : /tmp/ruby/src/trunk/.bundle/.timestamp/power_assert.revision unchanged I, [2024-04-20T06:43:57.097105 #586117] INFO -- : /tmp/ruby/src/trunk/.bundle/.timestamp/rbs.revision unchanged I, [2024-04-20T06:43:57.099979 #586117] INFO -- : /tmp/ruby/src/trunk/.bundle/.timestamp/typeprof.revision unchanged I, [2024-04-20T06:43:57.981064 #586117] INFO -- : Building power_assert@84e85124c5014a139af39161d484156cfe87a9ed to /tmp/ruby/src/trunk/gems/power_assert-2.0.3.gem I, [2024-04-20T06:43:58.961897 #586117] INFO -- : Successfully built RubyGem I, [2024-04-20T06:43:58.962098 #586117] INFO -- : Name: power_assert I, [2024-04-20T06:43:58.962206 #586117] INFO -- : Version: 2.0.4dev I, [2024-04-20T06:43:58.962291 #586117] INFO -- : File: power_assert-2.0.4dev.gem I, [2024-04-20T06:43:59.627806 #586117] INFO -- : $$$[end] "make update-download -j4" exit with 0. I, [2024-04-20T06:43:59.628063 #586117] INFO -- : $$$[beg] make update-rubyspec -j4 I, [2024-04-20T06:44:00.167749 #586117] INFO -- : make: Nothing to be done for 'update-rubyspec'. I, [2024-04-20T06:44:00.169426 #586117] INFO -- : $$$[end] "make update-rubyspec -j4" exit with 0. I, [2024-04-20T06:44:00.169658 #586117] INFO -- : $$$[beg] make update-src -j4 I, [2024-04-20T06:44:01.611570 #586117] INFO -- : Already up to date. I, [2024-04-20T06:44:01.677147 #586117] INFO -- : Latest commit hash = 9f9755664d I, [2024-04-20T06:44:01.683559 #586117] INFO -- : $$$[end] "make update-src -j4" exit with 0. I, [2024-04-20T06:44:01.683813 #586117] INFO -- : $$$[beg] make after-update -j4 I, [2024-04-20T06:44:02.530570 #586117] INFO -- : /tmp/ruby/src/trunk/revision.h updated I, [2024-04-20T06:44:02.538338 #586117] INFO -- : generating riscv64-linux-fake.rb I, [2024-04-20T06:44:03.021935 #586117] INFO -- : riscv64-linux-fake.rb updated I, [2024-04-20T06:44:03.028691 #586117] INFO -- : generating enc.mk I, [2024-04-20T06:44:04.495494 #586117] INFO -- : making srcs under enc I, [2024-04-20T06:44:04.803397 #586117] INFO -- : make[1]: Entering directory '/tmp/ruby/build/trunk' I, [2024-04-20T06:44:04.808564 #586117] INFO -- : make[1]: Nothing to be done for 'srcs'. I, [2024-04-20T06:44:04.808766 #586117] INFO -- : make[1]: Leaving directory '/tmp/ruby/build/trunk' I, [2024-04-20T06:44:05.475627 #586117] INFO -- : Update minitest to ea9caafc0754b1d6236a490d59e624b53209734a I, [2024-04-20T06:44:05.476404 #586117] INFO -- : Update power_assert to 84e85124c5014a139af39161d484156cfe87a9ed I, [2024-04-20T06:44:05.479651 #586117] INFO -- : Update typeprof to b19a6416da3a05d57fadd6ffdadb382b6d236ca5 I, [2024-04-20T06:44:05.487605 #586117] INFO -- : Update rbs to ba7872795d5de04adb8ff500c0e6afdc81a041dd I, [2024-04-20T06:44:05.487814 #586117] INFO -- : echo ea9caafc0754b1d6236a490d59e624b53209734a | /bin/sh /tmp/ruby/src/trunk/tool/ifchange /tmp/ruby/src/trunk/.bundle/.timestamp/minitest.revision - I, [2024-04-20T06:44:05.487990 #586117] INFO -- : echo 84e85124c5014a139af39161d484156cfe87a9ed | /bin/sh /tmp/ruby/src/trunk/tool/ifchange /tmp/ruby/src/trunk/.bundle/.timestamp/power_assert.revision - I, [2024-04-20T06:44:05.493310 #586117] INFO -- : echo ba7872795d5de04adb8ff500c0e6afdc81a041dd | /bin/sh /tmp/ruby/src/trunk/tool/ifchange /tmp/ruby/src/trunk/.bundle/.timestamp/rbs.revision - I, [2024-04-20T06:44:05.496033 #586117] INFO -- : echo b19a6416da3a05d57fadd6ffdadb382b6d236ca5 | /bin/sh /tmp/ruby/src/trunk/tool/ifchange /tmp/ruby/src/trunk/.bundle/.timestamp/typeprof.revision - I, [2024-04-20T06:44:05.498195 #586117] INFO -- : /tmp/ruby/src/trunk/.bundle/.timestamp/minitest.revision unchanged I, [2024-04-20T06:44:05.500615 #586117] INFO -- : /tmp/ruby/src/trunk/.bundle/.timestamp/power_assert.revision unchanged I, [2024-04-20T06:44:05.505172 #586117] INFO -- : /tmp/ruby/src/trunk/.bundle/.timestamp/rbs.revision unchanged I, [2024-04-20T06:44:05.510817 #586117] INFO -- : /tmp/ruby/src/trunk/.bundle/.timestamp/typeprof.revision unchanged I, [2024-04-20T06:44:06.329987 #586117] INFO -- : Building power_assert@84e85124c5014a139af39161d484156cfe87a9ed to /tmp/ruby/src/trunk/gems/power_assert-2.0.3.gem I, [2024-04-20T06:44:07.264305 #586117] INFO -- : Successfully built RubyGem I, [2024-04-20T06:44:07.264634 #586117] INFO -- : Name: power_assert I, [2024-04-20T06:44:07.264757 #586117] INFO -- : Version: 2.0.4dev I, [2024-04-20T06:44:07.264864 #586117] INFO -- : File: power_assert-2.0.4dev.gem I, [2024-04-20T06:44:07.281129 #586117] INFO -- : Extracting bundle gem power_assert-2.0.3... I, [2024-04-20T06:44:08.170267 #586117] INFO -- : Try with hash version of bundled gems instead of gems/power_assert-2.0.3.gem. We don't use this gem with release version of Ruby. I, [2024-04-20T06:44:08.224591 #586117] INFO -- : Unpacked gems/power_assert-2.0.4dev.gem I, [2024-04-20T06:44:08.239714 #586117] INFO -- : $$$[end] "make after-update -j4" exit with 0. I, [2024-04-20T06:44:08.240547 #586117] INFO -- : $$$[beg] make miniruby -j4 I, [2024-04-20T06:44:08.749967 #586117] INFO -- : BASERUBY = /usr/bin/ruby --disable=gems I, [2024-04-20T06:44:08.750297 #586117] INFO -- : CC = gcc I, [2024-04-20T06:44:08.750486 #586117] INFO -- : LD = ld I, [2024-04-20T06:44:08.750685 #586117] INFO -- : LDSHARED = gcc -shared I, [2024-04-20T06:44:08.750906 #586117] INFO -- : CFLAGS = -O3 -fno-fast-math -ggdb3 -Wall -Wextra -Wdeprecated-declarations -Wdiv-by-zero -Wduplicated-cond -Wimplicit-function-declaration -Wimplicit-int -Wpointer-arith -Wwrite-strings -Wold-style-definition -Wimplicit-fallthrough=0 -Wmissing-noreturn -Wno-cast-function-type -Wno-constant-logical-operand -Wno-long-long -Wno-missing-field-initializers -Wno-overlength-strings -Wno-packed-bitfield-compat -Wno-parentheses-equality -Wno-self-assign -Wno-tautological-compare -Wno-unused-parameter -Wno-unused-value -Wsuggest-attribute=format -Wsuggest-attribute=noreturn -Wunused-variable -Wmisleading-indentation -Wundef -fPIC I, [2024-04-20T06:44:08.751115 #586117] INFO -- : XCFLAGS = -U_FORTIFY_SOURCE -D_FORTIFY_SOURCE=2 -fstack-protector-strong -fno-strict-overflow -fvisibility=hidden -fexcess-precision=standard -DRUBY_EXPORT -I. -I.ext/include/riscv64-linux -I/tmp/ruby/src/trunk/include -I/tmp/ruby/src/trunk -I/tmp/ruby/src/trunk/prism -I/tmp/ruby/src/trunk/enc/unicode/15.0.0 I, [2024-04-20T06:44:08.751298 #586117] INFO -- : CPPFLAGS = I, [2024-04-20T06:44:08.751475 #586117] INFO -- : DLDFLAGS = -Wl,--compress-debug-sections=zlib -Wl,-soname,libruby.so.3.4 -fstack-protector-strong I, [2024-04-20T06:44:08.751666 #586117] INFO -- : SOLIBS = -lz -lrt -lrt -lgmp -ldl -lcrypt -lm -lpthread I, [2024-04-20T06:44:08.751916 #586117] INFO -- : LANG = I, [2024-04-20T06:44:08.752107 #586117] INFO -- : LC_ALL = I, [2024-04-20T06:44:08.752280 #586117] INFO -- : LC_CTYPE = I, [2024-04-20T06:44:08.752528 #586117] INFO -- : MFLAGS = -j4 --jobserver-auth=4,5 I, [2024-04-20T06:44:08.752755 #586117] INFO -- : RUSTC = rustc I, [2024-04-20T06:44:08.752971 #586117] INFO -- : YJIT_RUSTC_ARGS = --crate-name=yjit --crate-type=staticlib --edition=2021 -g -C lto=thin -C opt-level=3 -C overflow-checks=on '--out-dir=/tmp/ruby/build/trunk/yjit/target/release/' /tmp/ruby/src/trunk/yjit/src/lib.rs I, [2024-04-20T06:44:08.765663 #586117] INFO -- : gcc (Debian 13.2.0-4revyos1) 13.2.0 I, [2024-04-20T06:44:08.765855 #586117] INFO -- : Copyright (C) 2023 Free Software Foundation, Inc. I, [2024-04-20T06:44:08.765943 #586117] INFO -- : This is free software; see the source for copying conditions. There is NO I, [2024-04-20T06:44:08.766027 #586117] INFO -- : warranty; not even for MERCHANTABILITY or FITNESS FOR A PARTICULAR PURPOSE. I, [2024-04-20T06:44:08.766111 #586117] INFO -- : I, [2024-04-20T06:44:09.004512 #586117] INFO -- : compiling /tmp/ruby/src/trunk/version.c I, [2024-04-20T06:44:10.145809 #586117] INFO -- : linking miniruby I, [2024-04-20T06:44:50.797445 #586117] INFO -- : $$$[end] "make miniruby -j4" exit with 0. I, [2024-04-20T06:44:50.798098 #586117] INFO -- : $$$[beg] make ruby -j4 I, [2024-04-20T06:44:51.314190 #586117] INFO -- : BASERUBY = /usr/bin/ruby --disable=gems I, [2024-04-20T06:44:51.314455 #586117] INFO -- : CC = gcc I, [2024-04-20T06:44:51.314585 #586117] INFO -- : LD = ld I, [2024-04-20T06:44:51.314710 #586117] INFO -- : LDSHARED = gcc -shared I, [2024-04-20T06:44:51.314858 #586117] INFO -- : CFLAGS = -O3 -fno-fast-math -ggdb3 -Wall -Wextra -Wdeprecated-declarations -Wdiv-by-zero -Wduplicated-cond -Wimplicit-function-declaration -Wimplicit-int -Wpointer-arith -Wwrite-strings -Wold-style-definition -Wimplicit-fallthrough=0 -Wmissing-noreturn -Wno-cast-function-type -Wno-constant-logical-operand -Wno-long-long -Wno-missing-field-initializers -Wno-overlength-strings -Wno-packed-bitfield-compat -Wno-parentheses-equality -Wno-self-assign -Wno-tautological-compare -Wno-unused-parameter -Wno-unused-value -Wsuggest-attribute=format -Wsuggest-attribute=noreturn -Wunused-variable -Wmisleading-indentation -Wundef -fPIC I, [2024-04-20T06:44:51.314981 #586117] INFO -- : XCFLAGS = -U_FORTIFY_SOURCE -D_FORTIFY_SOURCE=2 -fstack-protector-strong -fno-strict-overflow -fvisibility=hidden -fexcess-precision=standard -DRUBY_EXPORT -I. -I.ext/include/riscv64-linux -I/tmp/ruby/src/trunk/include -I/tmp/ruby/src/trunk -I/tmp/ruby/src/trunk/prism -I/tmp/ruby/src/trunk/enc/unicode/15.0.0 I, [2024-04-20T06:44:51.315098 #586117] INFO -- : CPPFLAGS = I, [2024-04-20T06:44:51.315208 #586117] INFO -- : DLDFLAGS = -Wl,--compress-debug-sections=zlib -Wl,-soname,libruby.so.3.4 -fstack-protector-strong I, [2024-04-20T06:44:51.315322 #586117] INFO -- : SOLIBS = -lz -lrt -lrt -lgmp -ldl -lcrypt -lm -lpthread I, [2024-04-20T06:44:51.315439 #586117] INFO -- : LANG = I, [2024-04-20T06:44:51.315548 #586117] INFO -- : LC_ALL = I, [2024-04-20T06:44:51.315641 #586117] INFO -- : LC_CTYPE = I, [2024-04-20T06:44:51.315735 #586117] INFO -- : MFLAGS = -j4 --jobserver-auth=4,5 I, [2024-04-20T06:44:51.315828 #586117] INFO -- : RUSTC = rustc I, [2024-04-20T06:44:51.315924 #586117] INFO -- : YJIT_RUSTC_ARGS = --crate-name=yjit --crate-type=staticlib --edition=2021 -g -C lto=thin -C opt-level=3 -C overflow-checks=on '--out-dir=/tmp/ruby/build/trunk/yjit/target/release/' /tmp/ruby/src/trunk/yjit/src/lib.rs I, [2024-04-20T06:44:51.328488 #586117] INFO -- : gcc (Debian 13.2.0-4revyos1) 13.2.0 I, [2024-04-20T06:44:51.328683 #586117] INFO -- : Copyright (C) 2023 Free Software Foundation, Inc. I, [2024-04-20T06:44:51.328772 #586117] INFO -- : This is free software; see the source for copying conditions. There is NO I, [2024-04-20T06:44:51.328858 #586117] INFO -- : warranty; not even for MERCHANTABILITY or FITNESS FOR A PARTICULAR PURPOSE. I, [2024-04-20T06:44:51.328992 #586117] INFO -- : I, [2024-04-20T06:44:51.978228 #586117] INFO -- : builtin_binary.inc updated I, [2024-04-20T06:44:51.991430 #586117] INFO -- : 63c4b2d66003409833406b3a662615f9f67397fdf425c22dee41f60d762f36d6 builtin_binary.inc I, [2024-04-20T06:44:51.995005 #586117] INFO -- : compiling /tmp/ruby/src/trunk/builtin.c I, [2024-04-20T06:44:53.621069 #586117] INFO -- : linking static-library libruby-static.a I, [2024-04-20T06:45:00.799767 #586117] INFO -- : linking shared-library libruby.so.3.4.0 I, [2024-04-20T06:45:41.924175 #586117] INFO -- : linking ruby I, [2024-04-20T06:45:42.135792 #586117] INFO -- : $$$[end] "make ruby -j4" exit with 0. I, [2024-04-20T06:45:42.136458 #586117] INFO -- : $$$[beg] make all -j4 I, [2024-04-20T06:45:42.657423 #586117] INFO -- : BASERUBY = /usr/bin/ruby --disable=gems I, [2024-04-20T06:45:42.657676 #586117] INFO -- : CC = gcc I, [2024-04-20T06:45:42.657804 #586117] INFO -- : LD = ld I, [2024-04-20T06:45:42.657928 #586117] INFO -- : LDSHARED = gcc -shared I, [2024-04-20T06:45:42.658078 #586117] INFO -- : CFLAGS = -O3 -fno-fast-math -ggdb3 -Wall -Wextra -Wdeprecated-declarations -Wdiv-by-zero -Wduplicated-cond -Wimplicit-function-declaration -Wimplicit-int -Wpointer-arith -Wwrite-strings -Wold-style-definition -Wimplicit-fallthrough=0 -Wmissing-noreturn -Wno-cast-function-type -Wno-constant-logical-operand -Wno-long-long -Wno-missing-field-initializers -Wno-overlength-strings -Wno-packed-bitfield-compat -Wno-parentheses-equality -Wno-self-assign -Wno-tautological-compare -Wno-unused-parameter -Wno-unused-value -Wsuggest-attribute=format -Wsuggest-attribute=noreturn -Wunused-variable -Wmisleading-indentation -Wundef -fPIC I, [2024-04-20T06:45:42.658214 #586117] INFO -- : XCFLAGS = -U_FORTIFY_SOURCE -D_FORTIFY_SOURCE=2 -fstack-protector-strong -fno-strict-overflow -fvisibility=hidden -fexcess-precision=standard -DRUBY_EXPORT -I. -I.ext/include/riscv64-linux -I/tmp/ruby/src/trunk/include -I/tmp/ruby/src/trunk -I/tmp/ruby/src/trunk/prism -I/tmp/ruby/src/trunk/enc/unicode/15.0.0 I, [2024-04-20T06:45:42.658327 #586117] INFO -- : CPPFLAGS = I, [2024-04-20T06:45:42.658436 #586117] INFO -- : DLDFLAGS = -Wl,--compress-debug-sections=zlib -Wl,-soname,libruby.so.3.4 -fstack-protector-strong I, [2024-04-20T06:45:42.658551 #586117] INFO -- : SOLIBS = -lz -lrt -lrt -lgmp -ldl -lcrypt -lm -lpthread I, [2024-04-20T06:45:42.658655 #586117] INFO -- : LANG = I, [2024-04-20T06:45:42.658754 #586117] INFO -- : LC_ALL = I, [2024-04-20T06:45:42.658850 #586117] INFO -- : LC_CTYPE = I, [2024-04-20T06:45:42.658949 #586117] INFO -- : MFLAGS = -j4 --jobserver-auth=4,5 I, [2024-04-20T06:45:42.659047 #586117] INFO -- : RUSTC = rustc I, [2024-04-20T06:45:42.659163 #586117] INFO -- : YJIT_RUSTC_ARGS = --crate-name=yjit --crate-type=staticlib --edition=2021 -g -C lto=thin -C opt-level=3 -C overflow-checks=on '--out-dir=/tmp/ruby/build/trunk/yjit/target/release/' /tmp/ruby/src/trunk/yjit/src/lib.rs I, [2024-04-20T06:45:42.671667 #586117] INFO -- : gcc (Debian 13.2.0-4revyos1) 13.2.0 I, [2024-04-20T06:45:42.671849 #586117] INFO -- : Copyright (C) 2023 Free Software Foundation, Inc. I, [2024-04-20T06:45:42.671939 #586117] INFO -- : This is free software; see the source for copying conditions. There is NO I, [2024-04-20T06:45:42.672022 #586117] INFO -- : warranty; not even for MERCHANTABILITY or FITNESS FOR A PARTICULAR PURPOSE. I, [2024-04-20T06:45:42.672107 #586117] INFO -- : I, [2024-04-20T06:45:42.988395 #586117] INFO -- : generating enc.mk I, [2024-04-20T06:45:43.005886 #586117] INFO -- : building spec/ruby/optional/capi/ext/array_spec.so I, [2024-04-20T06:45:43.008252 #586117] INFO -- : building spec/ruby/optional/capi/ext/basic_object_spec.so I, [2024-04-20T06:45:43.012803 #586117] INFO -- : building spec/ruby/optional/capi/ext/bignum_spec.so I, [2024-04-20T06:45:43.952556 #586117] INFO -- : building spec/ruby/optional/capi/ext/binding_spec.so I, [2024-04-20T06:45:44.356552 #586117] INFO -- : building spec/ruby/optional/capi/ext/boolean_spec.so I, [2024-04-20T06:45:44.724062 #586117] INFO -- : building spec/ruby/optional/capi/ext/class_id_under_autoload_spec.so I, [2024-04-20T06:45:44.994108 #586117] INFO -- : building spec/ruby/optional/capi/ext/class_spec.so I, [2024-04-20T06:45:45.427413 #586117] INFO -- : building spec/ruby/optional/capi/ext/class_under_autoload_spec.so I, [2024-04-20T06:45:45.440170 #586117] INFO -- : building spec/ruby/optional/capi/ext/complex_spec.so I, [2024-04-20T06:45:45.743897 #586117] INFO -- : building spec/ruby/optional/capi/ext/constants_spec.so I, [2024-04-20T06:45:46.436704 #586117] INFO -- : building spec/ruby/optional/capi/ext/data_spec.so I, [2024-04-20T06:45:46.554367 #586117] INFO -- : building spec/ruby/optional/capi/ext/debug_spec.so I, [2024-04-20T06:45:46.692163 #586117] INFO -- : building spec/ruby/optional/capi/ext/encoding_spec.so I, [2024-04-20T06:45:47.704182 #586117] INFO -- : building spec/ruby/optional/capi/ext/enumerator_spec.so I, [2024-04-20T06:45:47.783684 #586117] INFO -- : building spec/ruby/optional/capi/ext/exception_spec.so I, [2024-04-20T06:45:47.878357 #586117] INFO -- : building spec/ruby/optional/capi/ext/fiber_spec.so I, [2024-04-20T06:45:49.004700 #586117] INFO -- : building spec/ruby/optional/capi/ext/file_spec.so I, [2024-04-20T06:45:49.103356 #586117] INFO -- : building spec/ruby/optional/capi/ext/fixnum_spec.so I, [2024-04-20T06:45:49.234857 #586117] INFO -- : building spec/ruby/optional/capi/ext/float_spec.so I, [2024-04-20T06:45:49.567402 #586117] INFO -- : building spec/ruby/optional/capi/ext/gc_spec.so I, [2024-04-20T06:45:50.089633 #586117] INFO -- : building spec/ruby/optional/capi/ext/globals_spec.so I, [2024-04-20T06:45:50.145360 #586117] INFO -- : building spec/ruby/optional/capi/ext/hash_spec.so I, [2024-04-20T06:45:50.342523 #586117] INFO -- : building spec/ruby/optional/capi/ext/integer_spec.so I, [2024-04-20T06:45:50.917993 #586117] INFO -- : building spec/ruby/optional/capi/ext/io_spec.so I, [2024-04-20T06:45:51.475047 #586117] INFO -- : building spec/ruby/optional/capi/ext/kernel_spec.so I, [2024-04-20T06:45:51.482948 #586117] INFO -- : building spec/ruby/optional/capi/ext/language_spec.so I, [2024-04-20T06:45:51.560754 #586117] INFO -- : building spec/ruby/optional/capi/ext/marshal_spec.so I, [2024-04-20T06:45:52.578873 #586117] INFO -- : building spec/ruby/optional/capi/ext/module_spec.so I, [2024-04-20T06:45:52.602653 #586117] INFO -- : building spec/ruby/optional/capi/ext/module_under_autoload_spec.so I, [2024-04-20T06:45:53.202367 #586117] INFO -- : building spec/ruby/optional/capi/ext/mutex_spec.so I, [2024-04-20T06:45:53.618461 #586117] INFO -- : building spec/ruby/optional/capi/ext/numeric_spec.so I, [2024-04-20T06:45:54.073532 #586117] INFO -- : building spec/ruby/optional/capi/ext/object_spec.so I, [2024-04-20T06:45:54.240066 #586117] INFO -- : building spec/ruby/optional/capi/ext/proc_spec.so I, [2024-04-20T06:45:54.390447 #586117] INFO -- : building spec/ruby/optional/capi/ext/range_spec.so I, [2024-04-20T06:45:55.211060 #586117] INFO -- : building spec/ruby/optional/capi/ext/rational_spec.so I, [2024-04-20T06:45:55.591516 #586117] INFO -- : building spec/ruby/optional/capi/ext/rbasic_spec.so I, [2024-04-20T06:45:55.773524 #586117] INFO -- : building spec/ruby/optional/capi/ext/regexp_spec.so I, [2024-04-20T06:45:56.345193 #586117] INFO -- : building spec/ruby/optional/capi/ext/st_spec.so I, [2024-04-20T06:45:56.864579 #586117] INFO -- : building spec/ruby/optional/capi/ext/string_spec.so I, [2024-04-20T06:45:57.019549 #586117] INFO -- : building spec/ruby/optional/capi/ext/struct_spec.so I, [2024-04-20T06:45:57.053627 #586117] INFO -- : building spec/ruby/optional/capi/ext/symbol_spec.so I, [2024-04-20T06:45:57.525952 #586117] INFO -- : building spec/ruby/optional/capi/ext/thread_spec.so I, [2024-04-20T06:45:58.158395 #586117] INFO -- : building spec/ruby/optional/capi/ext/time_spec.so I, [2024-04-20T06:45:58.626068 #586117] INFO -- : building spec/ruby/optional/capi/ext/tracepoint_spec.so I, [2024-04-20T06:45:59.000451 #586117] INFO -- : building spec/ruby/optional/capi/ext/typed_data_spec.so I, [2024-04-20T06:45:59.559167 #586117] INFO -- : building spec/ruby/optional/capi/ext/util_spec.so I, [2024-04-20T06:45:59.744330 #586117] INFO -- : making enc I, [2024-04-20T06:45:59.950590 #586117] INFO -- : make[1]: Entering directory '/tmp/ruby/build/trunk' I, [2024-04-20T06:45:59.950827 #586117] INFO -- : make[1]: Nothing to be done for 'enc'. I, [2024-04-20T06:45:59.950992 #586117] INFO -- : make[1]: Leaving directory '/tmp/ruby/build/trunk' I, [2024-04-20T06:45:59.954380 #586117] INFO -- : making srcs under enc I, [2024-04-20T06:46:00.290720 #586117] INFO -- : make[1]: Entering directory '/tmp/ruby/build/trunk' I, [2024-04-20T06:46:00.290948 #586117] INFO -- : make[1]: Nothing to be done for 'srcs'. I, [2024-04-20T06:46:00.291097 #586117] INFO -- : make[1]: Leaving directory '/tmp/ruby/build/trunk' I, [2024-04-20T06:46:00.298112 #586117] INFO -- : generating transdb.h I, [2024-04-20T06:46:01.598339 #586117] INFO -- : transdb.h unchanged I, [2024-04-20T06:46:01.604535 #586117] INFO -- : generating makefiles ext/configure-ext.mk I, [2024-04-20T06:46:01.605488 #586117] INFO -- : making trans I, [2024-04-20T06:46:01.795524 #586117] INFO -- : ext/configure-ext.mk updated I, [2024-04-20T06:46:01.806806 #586117] INFO -- : make[1]: Entering directory '/tmp/ruby/build/trunk' I, [2024-04-20T06:46:01.965004 #586117] INFO -- : make[1]: Entering directory '/tmp/ruby/build/trunk' I, [2024-04-20T06:46:01.965302 #586117] INFO -- : make[1]: Nothing to be done for 'trans'. I, [2024-04-20T06:46:01.965573 #586117] INFO -- : make[1]: Leaving directory '/tmp/ruby/build/trunk' I, [2024-04-20T06:46:02.746877 #586117] INFO -- : making encs I, [2024-04-20T06:46:03.178690 #586117] INFO -- : make[1]: Entering directory '/tmp/ruby/build/trunk' I, [2024-04-20T06:46:03.179033 #586117] INFO -- : make[1]: Nothing to be done for 'encs'. I, [2024-04-20T06:46:03.179375 #586117] INFO -- : make[1]: Leaving directory '/tmp/ruby/build/trunk' I, [2024-04-20T06:46:05.269499 #586117] INFO -- : make[1]: Leaving directory '/tmp/ruby/build/trunk' I, [2024-04-20T06:46:05.271711 #586117] INFO -- : generating makefile exts.mk I, [2024-04-20T06:46:05.597494 #586117] INFO -- : exts.mk unchanged I, [2024-04-20T06:46:05.642843 #586117] INFO -- : make[1]: Entering directory '/tmp/ruby/build/trunk' I, [2024-04-20T06:46:06.152859 #586117] INFO -- : make[2]: Entering directory '/tmp/ruby/build/trunk/ext/coverage' I, [2024-04-20T06:46:06.159924 #586117] INFO -- : make[2]: Entering directory '/tmp/ruby/build/trunk/ext/digest' I, [2024-04-20T06:46:06.166744 #586117] INFO -- : make[2]: Entering directory '/tmp/ruby/build/trunk/ext/date' I, [2024-04-20T06:46:06.175102 #586117] INFO -- : make[2]: Leaving directory '/tmp/ruby/build/trunk/ext/coverage' I, [2024-04-20T06:46:06.190831 #586117] INFO -- : make[2]: Leaving directory '/tmp/ruby/build/trunk/ext/date' I, [2024-04-20T06:46:06.208749 #586117] INFO -- : make[2]: Leaving directory '/tmp/ruby/build/trunk/ext/digest' I, [2024-04-20T06:46:06.225078 #586117] INFO -- : make[2]: Entering directory '/tmp/ruby/build/trunk/ext/io/console' I, [2024-04-20T06:46:06.235053 #586117] INFO -- : make[2]: Entering directory '/tmp/ruby/build/trunk/ext/fiddle' I, [2024-04-20T06:46:06.243196 #586117] INFO -- : make[2]: Entering directory '/tmp/ruby/build/trunk/ext/json' I, [2024-04-20T06:46:06.247611 #586117] INFO -- : make[2]: Leaving directory '/tmp/ruby/build/trunk/ext/io/console' I, [2024-04-20T06:46:06.273462 #586117] INFO -- : make[2]: Entering directory '/tmp/ruby/build/trunk/ext/monitor' I, [2024-04-20T06:46:06.286794 #586117] INFO -- : make[2]: Leaving directory '/tmp/ruby/build/trunk/ext/json' I, [2024-04-20T06:46:06.289537 #586117] INFO -- : make[2]: Entering directory '/tmp/ruby/build/trunk/ext/objspace' I, [2024-04-20T06:46:06.296474 #586117] INFO -- : make[2]: Leaving directory '/tmp/ruby/build/trunk/ext/monitor' I, [2024-04-20T06:46:06.305361 #586117] INFO -- : make[2]: Leaving directory '/tmp/ruby/build/trunk/ext/fiddle' I, [2024-04-20T06:46:06.316569 #586117] INFO -- : make[2]: Leaving directory '/tmp/ruby/build/trunk/ext/objspace' I, [2024-04-20T06:46:06.324999 #586117] INFO -- : make[2]: Entering directory '/tmp/ruby/build/trunk/ext/pathname' I, [2024-04-20T06:46:06.343999 #586117] INFO -- : make[2]: Leaving directory '/tmp/ruby/build/trunk/ext/pathname' I, [2024-04-20T06:46:06.344816 #586117] INFO -- : make[2]: Entering directory '/tmp/ruby/build/trunk/ext/psych' I, [2024-04-20T06:46:06.346339 #586117] INFO -- : make[2]: Entering directory '/tmp/ruby/build/trunk/ext/pty' I, [2024-04-20T06:46:06.364879 #586117] INFO -- : make[2]: Leaving directory '/tmp/ruby/build/trunk/ext/pty' I, [2024-04-20T06:46:06.401058 #586117] INFO -- : make[2]: Entering directory '/tmp/ruby/build/trunk/ext/openssl' I, [2024-04-20T06:46:06.418982 #586117] INFO -- : make[2]: Entering directory '/tmp/ruby/build/trunk/ext/rubyvm' I, [2024-04-20T06:46:06.422281 #586117] INFO -- : make[2]: Entering directory '/tmp/ruby/build/trunk/ext/ripper' I, [2024-04-20T06:46:06.446894 #586117] INFO -- : make[2]: Leaving directory '/tmp/ruby/build/trunk/ext/rubyvm' I, [2024-04-20T06:46:06.453418 #586117] INFO -- : make[2]: Leaving directory '/tmp/ruby/build/trunk/ext/ripper' I, [2024-04-20T06:46:06.479672 #586117] INFO -- : make[2]: Leaving directory '/tmp/ruby/build/trunk/ext/psych' I, [2024-04-20T06:46:06.520127 #586117] INFO -- : make[2]: Entering directory '/tmp/ruby/build/trunk/ext/socket' I, [2024-04-20T06:46:06.524558 #586117] INFO -- : make[2]: Entering directory '/tmp/ruby/build/trunk/.bundle/gems/bigdecimal-3.1.7/ext/bigdecimal' I, [2024-04-20T06:46:06.526104 #586117] INFO -- : make[2]: Entering directory '/tmp/ruby/build/trunk/.bundle/gems/debug-1.9.2/ext/debug' I, [2024-04-20T06:46:06.549544 #586117] INFO -- : make[2]: Leaving directory '/tmp/ruby/build/trunk/ext/openssl' I, [2024-04-20T06:46:06.564072 #586117] INFO -- : make[2]: Entering directory '/tmp/ruby/build/trunk/.bundle/gems/nkf-0.2.0/ext/nkf' I, [2024-04-20T06:46:06.583121 #586117] INFO -- : make[2]: Leaving directory '/tmp/ruby/build/trunk/ext/socket' I, [2024-04-20T06:46:06.599881 #586117] INFO -- : make[2]: Entering directory '/tmp/ruby/build/trunk/.bundle/gems/racc-1.7.3/ext/racc/cparse' I, [2024-04-20T06:46:06.678942 #586117] INFO -- : make[2]: Leaving directory '/tmp/ruby/build/trunk/.bundle/gems/bigdecimal-3.1.7/ext/bigdecimal' I, [2024-04-20T06:46:06.689959 #586117] INFO -- : make[2]: Leaving directory '/tmp/ruby/build/trunk/.bundle/gems/debug-1.9.2/ext/debug' I, [2024-04-20T06:46:06.702158 #586117] INFO -- : make[2]: Entering directory '/tmp/ruby/build/trunk/.bundle/gems/rbs-3.4.4/ext/rbs_extension' I, [2024-04-20T06:46:06.705066 #586117] INFO -- : make[2]: Entering directory '/tmp/ruby/build/trunk/.bundle/gems/syslog-0.1.2/ext/syslog' I, [2024-04-20T06:46:06.724798 #586117] INFO -- : make[2]: Leaving directory '/tmp/ruby/build/trunk/.bundle/gems/nkf-0.2.0/ext/nkf' I, [2024-04-20T06:46:06.764385 #586117] INFO -- : make[2]: Leaving directory '/tmp/ruby/build/trunk/.bundle/gems/racc-1.7.3/ext/racc/cparse' I, [2024-04-20T06:46:06.824478 #586117] INFO -- : make[2]: Entering directory '/tmp/ruby/build/trunk/ext/digest/sha2' I, [2024-04-20T06:46:06.861718 #586117] INFO -- : make[2]: Leaving directory '/tmp/ruby/build/trunk/ext/digest/sha2' I, [2024-04-20T06:46:06.868758 #586117] INFO -- : make[2]: Leaving directory '/tmp/ruby/build/trunk/.bundle/gems/syslog-0.1.2/ext/syslog' I, [2024-04-20T06:46:06.871828 #586117] INFO -- : make[2]: Leaving directory '/tmp/ruby/build/trunk/.bundle/gems/rbs-3.4.4/ext/rbs_extension' I, [2024-04-20T06:46:07.097274 #586117] INFO -- : make[2]: Entering directory '/tmp/ruby/build/trunk' I, [2024-04-20T06:46:07.740968 #586117] INFO -- : linking ruby I, [2024-04-20T06:46:07.939205 #586117] INFO -- : make[2]: Leaving directory '/tmp/ruby/build/trunk' I, [2024-04-20T06:46:07.941513 #586117] INFO -- : make[1]: Leaving directory '/tmp/ruby/build/trunk' I, [2024-04-20T06:46:07.975672 #586117] INFO -- : make[1]: Entering directory '/tmp/ruby/build/trunk' I, [2024-04-20T06:46:07.975925 #586117] INFO -- : make[1]: Nothing to be done for 'note'. I, [2024-04-20T06:46:07.976025 #586117] INFO -- : make[1]: Leaving directory '/tmp/ruby/build/trunk' I, [2024-04-20T06:46:07.978919 #586117] INFO -- : $$$[end] "make all -j4" exit with 0. I, [2024-04-20T06:46:07.979635 #586117] INFO -- : $$$[beg] make install -j4 I, [2024-04-20T06:46:08.543666 #586117] INFO -- : Update minitest to ea9caafc0754b1d6236a490d59e624b53209734a I, [2024-04-20T06:46:08.544619 #586117] INFO -- : Update power_assert to 84e85124c5014a139af39161d484156cfe87a9ed I, [2024-04-20T06:46:08.545316 #586117] INFO -- : Update rbs to ba7872795d5de04adb8ff500c0e6afdc81a041dd I, [2024-04-20T06:46:08.548047 #586117] INFO -- : Update typeprof to b19a6416da3a05d57fadd6ffdadb382b6d236ca5 I, [2024-04-20T06:46:08.555959 #586117] INFO -- : echo ea9caafc0754b1d6236a490d59e624b53209734a | /bin/sh /tmp/ruby/src/trunk/tool/ifchange /tmp/ruby/src/trunk/.bundle/.timestamp/minitest.revision - I, [2024-04-20T06:46:08.556557 #586117] INFO -- : echo 84e85124c5014a139af39161d484156cfe87a9ed | /bin/sh /tmp/ruby/src/trunk/tool/ifchange /tmp/ruby/src/trunk/.bundle/.timestamp/power_assert.revision - I, [2024-04-20T06:46:08.557147 #586117] INFO -- : echo ba7872795d5de04adb8ff500c0e6afdc81a041dd | /bin/sh /tmp/ruby/src/trunk/tool/ifchange /tmp/ruby/src/trunk/.bundle/.timestamp/rbs.revision - I, [2024-04-20T06:46:08.565474 #586117] INFO -- : echo b19a6416da3a05d57fadd6ffdadb382b6d236ca5 | /bin/sh /tmp/ruby/src/trunk/tool/ifchange /tmp/ruby/src/trunk/.bundle/.timestamp/typeprof.revision - I, [2024-04-20T06:46:08.568271 #586117] INFO -- : /tmp/ruby/src/trunk/.bundle/.timestamp/power_assert.revision unchanged I, [2024-04-20T06:46:08.569632 #586117] INFO -- : /tmp/ruby/src/trunk/.bundle/.timestamp/minitest.revision unchanged I, [2024-04-20T06:46:08.573886 #586117] INFO -- : /tmp/ruby/src/trunk/.bundle/.timestamp/rbs.revision unchanged I, [2024-04-20T06:46:08.576097 #586117] INFO -- : BASERUBY = /usr/bin/ruby --disable=gems I, [2024-04-20T06:46:08.576533 #586117] INFO -- : CC = gcc I, [2024-04-20T06:46:08.576885 #586117] INFO -- : LD = ld I, [2024-04-20T06:46:08.577227 #586117] INFO -- : LDSHARED = gcc -shared I, [2024-04-20T06:46:08.577583 #586117] INFO -- : CFLAGS = -O3 -fno-fast-math -ggdb3 -Wall -Wextra -Wdeprecated-declarations -Wdiv-by-zero -Wduplicated-cond -Wimplicit-function-declaration -Wimplicit-int -Wpointer-arith -Wwrite-strings -Wold-style-definition -Wimplicit-fallthrough=0 -Wmissing-noreturn -Wno-cast-function-type -Wno-constant-logical-operand -Wno-long-long -Wno-missing-field-initializers -Wno-overlength-strings -Wno-packed-bitfield-compat -Wno-parentheses-equality -Wno-self-assign -Wno-tautological-compare -Wno-unused-parameter -Wno-unused-value -Wsuggest-attribute=format -Wsuggest-attribute=noreturn -Wunused-variable -Wmisleading-indentation -Wundef -fPIC I, [2024-04-20T06:46:08.577938 #586117] INFO -- : XCFLAGS = -U_FORTIFY_SOURCE -D_FORTIFY_SOURCE=2 -fstack-protector-strong -fno-strict-overflow -fvisibility=hidden -fexcess-precision=standard -DRUBY_EXPORT -I. -I.ext/include/riscv64-linux -I/tmp/ruby/src/trunk/include -I/tmp/ruby/src/trunk -I/tmp/ruby/src/trunk/prism -I/tmp/ruby/src/trunk/enc/unicode/15.0.0 I, [2024-04-20T06:46:08.578252 #586117] INFO -- : CPPFLAGS = I, [2024-04-20T06:46:08.578549 #586117] INFO -- : DLDFLAGS = -Wl,--compress-debug-sections=zlib -Wl,-soname,libruby.so.3.4 -fstack-protector-strong I, [2024-04-20T06:46:08.578869 #586117] INFO -- : SOLIBS = -lz -lrt -lrt -lgmp -ldl -lcrypt -lm -lpthread I, [2024-04-20T06:46:08.579179 #586117] INFO -- : LANG = I, [2024-04-20T06:46:08.579497 #586117] INFO -- : LC_ALL = I, [2024-04-20T06:46:08.579773 #586117] INFO -- : LC_CTYPE = I, [2024-04-20T06:46:08.580021 #586117] INFO -- : MFLAGS = -j4 --jobserver-auth=4,5 I, [2024-04-20T06:46:08.580296 #586117] INFO -- : RUSTC = rustc I, [2024-04-20T06:46:08.580731 #586117] INFO -- : YJIT_RUSTC_ARGS = --crate-name=yjit --crate-type=staticlib --edition=2021 -g -C lto=thin -C opt-level=3 -C overflow-checks=on '--out-dir=/tmp/ruby/build/trunk/yjit/target/release/' /tmp/ruby/src/trunk/yjit/src/lib.rs I, [2024-04-20T06:46:08.581076 #586117] INFO -- : /tmp/ruby/src/trunk/.bundle/.timestamp/typeprof.revision unchanged I, [2024-04-20T06:46:08.872849 #586117] INFO -- : generating enc.mk I, [2024-04-20T06:46:08.873859 #586117] INFO -- : gcc (Debian 13.2.0-4revyos1) 13.2.0 I, [2024-04-20T06:46:08.874051 #586117] INFO -- : Copyright (C) 2023 Free Software Foundation, Inc. I, [2024-04-20T06:46:08.874156 #586117] INFO -- : This is free software; see the source for copying conditions. There is NO I, [2024-04-20T06:46:08.874265 #586117] INFO -- : warranty; not even for MERCHANTABILITY or FITNESS FOR A PARTICULAR PURPOSE. I, [2024-04-20T06:46:08.874395 #586117] INFO -- : I, [2024-04-20T06:46:10.373230 #586117] INFO -- : making srcs under enc I, [2024-04-20T06:46:10.689795 #586117] INFO -- : make[1]: Entering directory '/tmp/ruby/build/trunk' I, [2024-04-20T06:46:10.690035 #586117] INFO -- : make[1]: Nothing to be done for 'srcs'. I, [2024-04-20T06:46:10.690170 #586117] INFO -- : make[1]: Leaving directory '/tmp/ruby/build/trunk' I, [2024-04-20T06:46:10.692921 #586117] INFO -- : making enc I, [2024-04-20T06:46:10.868276 #586117] INFO -- : make[1]: Entering directory '/tmp/ruby/build/trunk' I, [2024-04-20T06:46:10.868539 #586117] INFO -- : make[1]: Nothing to be done for 'enc'. I, [2024-04-20T06:46:10.868695 #586117] INFO -- : make[1]: Leaving directory '/tmp/ruby/build/trunk' I, [2024-04-20T06:46:10.871618 #586117] INFO -- : generating transdb.h I, [2024-04-20T06:46:11.286324 #586117] INFO -- : Building power_assert@84e85124c5014a139af39161d484156cfe87a9ed to /tmp/ruby/src/trunk/gems/power_assert-2.0.3.gem I, [2024-04-20T06:46:12.114161 #586117] INFO -- : transdb.h unchanged I, [2024-04-20T06:46:12.119882 #586117] INFO -- : generating makefiles ext/configure-ext.mk I, [2024-04-20T06:46:12.120667 #586117] INFO -- : making trans I, [2024-04-20T06:46:12.237671 #586117] INFO -- : Successfully built RubyGem I, [2024-04-20T06:46:12.237879 #586117] INFO -- : Name: power_assert I, [2024-04-20T06:46:12.237978 #586117] INFO -- : Version: 2.0.4dev I, [2024-04-20T06:46:12.238069 #586117] INFO -- : File: power_assert-2.0.4dev.gem I, [2024-04-20T06:46:12.253963 #586117] INFO -- : Extracting bundle gem power_assert-2.0.3... I, [2024-04-20T06:46:12.318450 #586117] INFO -- : ext/configure-ext.mk unchanged I, [2024-04-20T06:46:12.330520 #586117] INFO -- : make[1]: Entering directory '/tmp/ruby/build/trunk' I, [2024-04-20T06:46:12.485840 #586117] INFO -- : make[1]: Entering directory '/tmp/ruby/build/trunk' I, [2024-04-20T06:46:12.486063 #586117] INFO -- : make[1]: Nothing to be done for 'trans'. I, [2024-04-20T06:46:12.486185 #586117] INFO -- : make[1]: Leaving directory '/tmp/ruby/build/trunk' I, [2024-04-20T06:46:13.236166 #586117] INFO -- : Try with hash version of bundled gems instead of gems/power_assert-2.0.3.gem. We don't use this gem with release version of Ruby. I, [2024-04-20T06:46:13.303510 #586117] INFO -- : Unpacked gems/power_assert-2.0.4dev.gem I, [2024-04-20T06:46:13.320107 #586117] INFO -- : making encs I, [2024-04-20T06:46:13.741686 #586117] INFO -- : make[1]: Entering directory '/tmp/ruby/build/trunk' I, [2024-04-20T06:46:13.741926 #586117] INFO -- : make[1]: Nothing to be done for 'encs'. I, [2024-04-20T06:46:13.742071 #586117] INFO -- : make[1]: Leaving directory '/tmp/ruby/build/trunk' I, [2024-04-20T06:46:16.075029 #586117] INFO -- : make[1]: Leaving directory '/tmp/ruby/build/trunk' I, [2024-04-20T06:46:16.077252 #586117] INFO -- : generating makefile exts.mk I, [2024-04-20T06:46:16.411179 #586117] INFO -- : exts.mk unchanged I, [2024-04-20T06:46:16.449773 #586117] INFO -- : make[1]: Entering directory '/tmp/ruby/build/trunk' I, [2024-04-20T06:46:16.959402 #586117] INFO -- : make[2]: Entering directory '/tmp/ruby/build/trunk/ext/digest' I, [2024-04-20T06:46:16.966024 #586117] INFO -- : make[2]: Entering directory '/tmp/ruby/build/trunk/ext/coverage' I, [2024-04-20T06:46:16.973971 #586117] INFO -- : make[2]: Entering directory '/tmp/ruby/build/trunk/ext/date' I, [2024-04-20T06:46:16.989019 #586117] INFO -- : make[2]: Leaving directory '/tmp/ruby/build/trunk/ext/coverage' I, [2024-04-20T06:46:17.005222 #586117] INFO -- : make[2]: Leaving directory '/tmp/ruby/build/trunk/ext/date' I, [2024-04-20T06:46:17.018378 #586117] INFO -- : make[2]: Leaving directory '/tmp/ruby/build/trunk/ext/digest' I, [2024-04-20T06:46:17.032740 #586117] INFO -- : make[2]: Entering directory '/tmp/ruby/build/trunk/ext/io/console' I, [2024-04-20T06:46:17.046189 #586117] INFO -- : make[2]: Entering directory '/tmp/ruby/build/trunk/ext/fiddle' I, [2024-04-20T06:46:17.052037 #586117] INFO -- : make[2]: Leaving directory '/tmp/ruby/build/trunk/ext/io/console' I, [2024-04-20T06:46:17.060310 #586117] INFO -- : make[2]: Entering directory '/tmp/ruby/build/trunk/ext/json' I, [2024-04-20T06:46:17.073698 #586117] INFO -- : make[2]: Entering directory '/tmp/ruby/build/trunk/ext/monitor' I, [2024-04-20T06:46:17.094246 #586117] INFO -- : make[2]: Leaving directory '/tmp/ruby/build/trunk/ext/fiddle' I, [2024-04-20T06:46:17.099179 #586117] INFO -- : make[2]: Entering directory '/tmp/ruby/build/trunk/ext/objspace' I, [2024-04-20T06:46:17.114150 #586117] INFO -- : make[2]: Leaving directory '/tmp/ruby/build/trunk/ext/json' I, [2024-04-20T06:46:17.118465 #586117] INFO -- : make[2]: Leaving directory '/tmp/ruby/build/trunk/ext/monitor' I, [2024-04-20T06:46:17.125899 #586117] INFO -- : make[2]: Leaving directory '/tmp/ruby/build/trunk/ext/objspace' I, [2024-04-20T06:46:17.142369 #586117] INFO -- : make[2]: Entering directory '/tmp/ruby/build/trunk/ext/pathname' I, [2024-04-20T06:46:17.153737 #586117] INFO -- : make[2]: Entering directory '/tmp/ruby/build/trunk/ext/pty' I, [2024-04-20T06:46:17.158671 #586117] INFO -- : make[2]: Entering directory '/tmp/ruby/build/trunk/ext/psych' I, [2024-04-20T06:46:17.168564 #586117] INFO -- : make[2]: Leaving directory '/tmp/ruby/build/trunk/ext/pathname' I, [2024-04-20T06:46:17.172867 #586117] INFO -- : make[2]: Leaving directory '/tmp/ruby/build/trunk/ext/pty' I, [2024-04-20T06:46:17.211196 #586117] INFO -- : make[2]: Entering directory '/tmp/ruby/build/trunk/ext/openssl' I, [2024-04-20T06:46:17.227918 #586117] INFO -- : make[2]: Entering directory '/tmp/ruby/build/trunk/ext/ripper' I, [2024-04-20T06:46:17.243693 #586117] INFO -- : make[2]: Entering directory '/tmp/ruby/build/trunk/ext/rubyvm' I, [2024-04-20T06:46:17.269528 #586117] INFO -- : make[2]: Leaving directory '/tmp/ruby/build/trunk/ext/ripper' I, [2024-04-20T06:46:17.270040 #586117] INFO -- : make[2]: Leaving directory '/tmp/ruby/build/trunk/ext/rubyvm' I, [2024-04-20T06:46:17.283012 #586117] INFO -- : make[2]: Leaving directory '/tmp/ruby/build/trunk/ext/psych' I, [2024-04-20T06:46:17.326277 #586117] INFO -- : make[2]: Entering directory '/tmp/ruby/build/trunk/.bundle/gems/bigdecimal-3.1.7/ext/bigdecimal' I, [2024-04-20T06:46:17.341293 #586117] INFO -- : make[2]: Entering directory '/tmp/ruby/build/trunk/.bundle/gems/debug-1.9.2/ext/debug' I, [2024-04-20T06:46:17.345433 #586117] INFO -- : make[2]: Entering directory '/tmp/ruby/build/trunk/ext/socket' I, [2024-04-20T06:46:17.350920 #586117] INFO -- : make[2]: Leaving directory '/tmp/ruby/build/trunk/ext/openssl' I, [2024-04-20T06:46:17.363801 #586117] INFO -- : make[2]: Entering directory '/tmp/ruby/build/trunk/.bundle/gems/nkf-0.2.0/ext/nkf' I, [2024-04-20T06:46:17.403640 #586117] INFO -- : make[2]: Leaving directory '/tmp/ruby/build/trunk/ext/socket' I, [2024-04-20T06:46:17.417777 #586117] INFO -- : make[2]: Entering directory '/tmp/ruby/build/trunk/.bundle/gems/racc-1.7.3/ext/racc/cparse' I, [2024-04-20T06:46:17.488981 #586117] INFO -- : make[2]: Leaving directory '/tmp/ruby/build/trunk/.bundle/gems/bigdecimal-3.1.7/ext/bigdecimal' I, [2024-04-20T06:46:17.502894 #586117] INFO -- : make[2]: Leaving directory '/tmp/ruby/build/trunk/.bundle/gems/debug-1.9.2/ext/debug' I, [2024-04-20T06:46:17.508202 #586117] INFO -- : make[2]: Entering directory '/tmp/ruby/build/trunk/.bundle/gems/rbs-3.4.4/ext/rbs_extension' I, [2024-04-20T06:46:17.518135 #586117] INFO -- : make[2]: Entering directory '/tmp/ruby/build/trunk/.bundle/gems/syslog-0.1.2/ext/syslog' I, [2024-04-20T06:46:17.529360 #586117] INFO -- : make[2]: Leaving directory '/tmp/ruby/build/trunk/.bundle/gems/nkf-0.2.0/ext/nkf' I, [2024-04-20T06:46:17.588178 #586117] INFO -- : make[2]: Leaving directory '/tmp/ruby/build/trunk/.bundle/gems/racc-1.7.3/ext/racc/cparse' I, [2024-04-20T06:46:17.647770 #586117] INFO -- : make[2]: Entering directory '/tmp/ruby/build/trunk/ext/digest/sha2' I, [2024-04-20T06:46:17.672814 #586117] INFO -- : make[2]: Leaving directory '/tmp/ruby/build/trunk/ext/digest/sha2' I, [2024-04-20T06:46:17.673043 #586117] INFO -- : make[2]: Leaving directory '/tmp/ruby/build/trunk/.bundle/gems/rbs-3.4.4/ext/rbs_extension' I, [2024-04-20T06:46:17.676208 #586117] INFO -- : make[2]: Leaving directory '/tmp/ruby/build/trunk/.bundle/gems/syslog-0.1.2/ext/syslog' I, [2024-04-20T06:46:17.902435 #586117] INFO -- : make[2]: Entering directory '/tmp/ruby/build/trunk' I, [2024-04-20T06:46:18.542871 #586117] INFO -- : make[2]: 'ruby' is up to date. I, [2024-04-20T06:46:18.543093 #586117] INFO -- : make[2]: Leaving directory '/tmp/ruby/build/trunk' I, [2024-04-20T06:46:18.544966 #586117] INFO -- : make[1]: Leaving directory '/tmp/ruby/build/trunk' I, [2024-04-20T06:46:18.586726 #586117] INFO -- : make[1]: Entering directory '/tmp/ruby/build/trunk' I, [2024-04-20T06:46:18.586920 #586117] INFO -- : make[1]: Nothing to be done for 'note'. I, [2024-04-20T06:46:18.587017 #586117] INFO -- : make[1]: Leaving directory '/tmp/ruby/build/trunk' I, [2024-04-20T06:46:18.587962 #586117] INFO -- : ./miniruby -I/tmp/ruby/src/trunk/lib -I. -I.ext/common /tmp/ruby/src/trunk/tool/runruby.rb --extout=.ext -- --disable-gems -r./riscv64-linux-fake /tmp/ruby/src/trunk/tool/rbinstall.rb --make="make" --dest-dir="" --extout=".ext" --ext-build-dir="./ext" --mflags="-j4 --jobserver-auth=4,5" --make-flags=" -j4 --jobserver-auth=4,5" --data-mode=0644 --prog-mode=0755 --installed-list .installed.list --mantype="doc" --gnumake --install=all --exclude=doc I, [2024-04-20T06:46:19.835063 #586117] INFO -- : Installing to I, [2024-04-20T06:46:19.835281 #586117] INFO -- : installing binary commands: /tmp/ruby/install/trunk/bin I, [2024-04-20T06:46:19.837396 #586117] INFO -- : installing base libraries: /tmp/ruby/install/trunk/lib I, [2024-04-20T06:46:19.908745 #586117] INFO -- : installing arch files: /tmp/ruby/install/trunk/lib/ruby/3.4.0+0/riscv64-linux I, [2024-04-20T06:46:19.909470 #586117] INFO -- : installing pkgconfig data: /tmp/ruby/install/trunk/lib/pkgconfig I, [2024-04-20T06:46:19.909984 #586117] INFO -- : installing extension objects: /tmp/ruby/install/trunk/lib/ruby/3.4.0+0/riscv64-linux I, [2024-04-20T06:46:20.031848 #586117] INFO -- : installing extension objects: /tmp/ruby/install/trunk/lib/ruby/site_ruby/3.4.0+0/riscv64-linux I, [2024-04-20T06:46:20.032077 #586117] INFO -- : installing extension objects: /tmp/ruby/install/trunk/lib/ruby/vendor_ruby/3.4.0+0/riscv64-linux I, [2024-04-20T06:46:20.032628 #586117] INFO -- : installing extension headers: /tmp/ruby/install/trunk/include/ruby-3.4.0+0/riscv64-linux I, [2024-04-20T06:46:20.034656 #586117] INFO -- : installing extension scripts: /tmp/ruby/install/trunk/lib/ruby/3.4.0+0 I, [2024-04-20T06:46:20.085179 #586117] INFO -- : installing extension scripts: /tmp/ruby/install/trunk/lib/ruby/site_ruby/3.4.0+0 I, [2024-04-20T06:46:20.085377 #586117] INFO -- : installing extension scripts: /tmp/ruby/install/trunk/lib/ruby/vendor_ruby/3.4.0+0 I, [2024-04-20T06:46:20.085467 #586117] INFO -- : installing extension headers: /tmp/ruby/install/trunk/include/ruby-3.4.0+0/ruby I, [2024-04-20T06:46:20.086288 #586117] INFO -- : installing command scripts: /tmp/ruby/install/trunk/bin I, [2024-04-20T06:46:20.087161 #586117] INFO -- : installing library scripts: /tmp/ruby/install/trunk/lib/ruby/3.4.0+0 I, [2024-04-20T06:46:20.612350 #586117] INFO -- : installing common headers: /tmp/ruby/install/trunk/include/ruby-3.4.0+0 I, [2024-04-20T06:46:20.695054 #586117] INFO -- : installing manpages: /tmp/ruby/install/trunk/share/man/man1 I, [2024-04-20T06:46:20.697341 #586117] INFO -- : installing default gems from lib: /tmp/ruby/install/trunk/lib/ruby/gems/3.4.0+0 I, [2024-04-20T06:46:20.992644 #586117] INFO -- : benchmark 0.3.0 I, [2024-04-20T06:46:21.092909 #586117] INFO -- : bundler 2.6.0.dev I, [2024-04-20T06:46:21.118648 #586117] INFO -- : cgi 0.4.1 I, [2024-04-20T06:46:21.125569 #586117] INFO -- : delegate 0.3.1 I, [2024-04-20T06:46:21.132151 #586117] INFO -- : did_you_mean 1.6.3 I, [2024-04-20T06:46:21.138986 #586117] INFO -- : english 0.8.0 I, [2024-04-20T06:46:21.145610 #586117] INFO -- : erb 4.0.4 I, [2024-04-20T06:46:21.155536 #586117] INFO -- : error_highlight 0.6.0 I, [2024-04-20T06:46:21.162024 #586117] INFO -- : fileutils 1.7.2 I, [2024-04-20T06:46:21.168526 #586117] INFO -- : find 0.2.0 I, [2024-04-20T06:46:21.175906 #586117] INFO -- : forwardable 1.3.3 I, [2024-04-20T06:46:21.182602 #586117] INFO -- : ipaddr 1.2.6 I, [2024-04-20T06:46:21.189113 #586117] INFO -- : irb 1.12.0 I, [2024-04-20T06:46:21.199635 #586117] INFO -- : logger 1.6.0 I, [2024-04-20T06:46:21.206314 #586117] INFO -- : net-http 0.4.1 I, [2024-04-20T06:46:21.220328 #586117] INFO -- : net-protocol 0.2.2 I, [2024-04-20T06:46:21.227350 #586117] INFO -- : open-uri 0.4.1 I, [2024-04-20T06:46:21.234345 #586117] INFO -- : open3 0.2.1 I, [2024-04-20T06:46:21.241093 #586117] INFO -- : optparse 0.5.0 I, [2024-04-20T06:46:21.248220 #586117] INFO -- : ostruct 0.6.0 I, [2024-04-20T06:46:21.254853 #586117] INFO -- : pp 0.5.0 I, [2024-04-20T06:46:21.261773 #586117] INFO -- : prettyprint 0.2.0 I, [2024-04-20T06:46:21.268523 #586117] INFO -- : prism 0.26.0 I, [2024-04-20T06:46:21.276318 #586117] INFO -- : pstore 0.1.3 I, [2024-04-20T06:46:21.282839 #586117] INFO -- : rdoc 6.6.3.1 I, [2024-04-20T06:46:21.297033 #586117] INFO -- : readline 0.0.4 I, [2024-04-20T06:46:21.303579 #586117] INFO -- : reline 0.5.2 I, [2024-04-20T06:46:21.310718 #586117] INFO -- : resolv 0.4.0 I, [2024-04-20T06:46:21.322833 #586117] INFO -- : ruby2_keywords 0.0.5 I, [2024-04-20T06:46:21.330661 #586117] INFO -- : securerandom 0.3.1 I, [2024-04-20T06:46:21.337486 #586117] INFO -- : set 1.1.0 I, [2024-04-20T06:46:21.344183 #586117] INFO -- : shellwords 0.2.0 I, [2024-04-20T06:46:21.350930 #586117] INFO -- : singleton 0.2.0 I, [2024-04-20T06:46:21.357465 #586117] INFO -- : syntax_suggest 2.0.0 I, [2024-04-20T06:46:21.367542 #586117] INFO -- : tempfile 0.2.1 I, [2024-04-20T06:46:21.374314 #586117] INFO -- : time 0.3.0 I, [2024-04-20T06:46:21.382950 #586117] INFO -- : timeout 0.4.1 I, [2024-04-20T06:46:21.388813 #586117] INFO -- : tmpdir 0.2.0 I, [2024-04-20T06:46:21.396079 #586117] INFO -- : tsort 0.2.0 I, [2024-04-20T06:46:21.402838 #586117] INFO -- : un 0.3.0 I, [2024-04-20T06:46:21.409626 #586117] INFO -- : uri 0.13.0 I, [2024-04-20T06:46:21.416634 #586117] INFO -- : weakref 0.1.3 I, [2024-04-20T06:46:21.423365 #586117] INFO -- : yaml 0.3.0 I, [2024-04-20T06:46:21.428769 #586117] INFO -- : installing default gems from ext: /tmp/ruby/install/trunk/lib/ruby/gems/3.4.0+0 I, [2024-04-20T06:46:21.503204 #586117] INFO -- : date 3.3.4 I, [2024-04-20T06:46:21.511157 #586117] INFO -- : digest 3.1.1 I, [2024-04-20T06:46:21.517779 #586117] INFO -- : etc 1.4.3 I, [2024-04-20T06:46:21.524883 #586117] INFO -- : fcntl 1.1.0 I, [2024-04-20T06:46:21.531720 #586117] INFO -- : fiddle 1.1.3 I, [2024-04-20T06:46:21.543062 #586117] INFO -- : io-console 0.7.2 I, [2024-04-20T06:46:21.552400 #586117] INFO -- : io-nonblock 0.3.0 I, [2024-04-20T06:46:21.559123 #586117] INFO -- : io-wait 0.3.1 I, [2024-04-20T06:46:21.565673 #586117] INFO -- : json 2.7.2 I, [2024-04-20T06:46:21.573018 #586117] INFO -- : openssl 3.2.0 I, [2024-04-20T06:46:21.579916 #586117] INFO -- : pathname 0.3.0 I, [2024-04-20T06:46:21.586889 #586117] INFO -- : psych 5.1.2 I, [2024-04-20T06:46:21.594619 #586117] INFO -- : stringio 3.1.1 I, [2024-04-20T06:46:21.602348 #586117] INFO -- : strscan 3.1.1 I, [2024-04-20T06:46:21.609142 #586117] INFO -- : zlib 3.1.0 I, [2024-04-20T06:46:21.614632 #586117] INFO -- : installing bundled gems: /tmp/ruby/install/trunk/lib/ruby/gems/3.4.0+0 I, [2024-04-20T06:46:21.619168 #586117] INFO -- : minitest 5.22.3 I, [2024-04-20T06:46:21.706445 #586117] INFO -- : rake 13.2.1 I, [2024-04-20T06:46:21.761422 #586117] INFO -- : test-unit 3.6.2 I, [2024-04-20T06:46:21.831994 #586117] INFO -- : rexml 3.2.6 I, [2024-04-20T06:46:21.893393 #586117] INFO -- : rss 0.3.0 I, [2024-04-20T06:46:21.935065 #586117] INFO -- : net-ftp 0.3.4 I, [2024-04-20T06:46:21.961915 #586117] INFO -- : net-imap 0.4.10 I, [2024-04-20T06:46:22.007283 #586117] INFO -- : net-pop 0.1.2 I, [2024-04-20T06:46:22.020161 #586117] INFO -- : net-smtp 0.5.0 I, [2024-04-20T06:46:22.036991 #586117] INFO -- : matrix 0.4.2 I, [2024-04-20T06:46:22.083031 #586117] INFO -- : prime 0.1.2 I, [2024-04-20T06:46:22.142307 #586117] INFO -- : rbs 3.4.4 I, [2024-04-20T06:46:22.522913 #586117] INFO -- : typeprof 0.21.11 I, [2024-04-20T06:46:22.556696 #586117] INFO -- : debug 1.9.2 I, [2024-04-20T06:46:22.601861 #586117] INFO -- : racc 1.7.3 I, [2024-04-20T06:46:22.642770 #586117] INFO -- : mutex_m 0.2.0 I, [2024-04-20T06:46:22.658197 #586117] INFO -- : getoptlong 0.2.1 I, [2024-04-20T06:46:22.678384 #586117] INFO -- : base64 0.2.0 I, [2024-04-20T06:46:22.695549 #586117] INFO -- : bigdecimal 3.1.7 I, [2024-04-20T06:46:22.723924 #586117] INFO -- : observer 0.1.2 I, [2024-04-20T06:46:22.740338 #586117] INFO -- : abbrev 0.1.2 I, [2024-04-20T06:46:22.754544 #586117] INFO -- : resolv-replace 0.1.1 I, [2024-04-20T06:46:22.770947 #586117] INFO -- : rinda 0.2.0 I, [2024-04-20T06:46:22.787793 #586117] INFO -- : drb 2.2.1 I, [2024-04-20T06:46:22.813942 #586117] INFO -- : nkf 0.2.0 I, [2024-04-20T06:46:22.846972 #586117] INFO -- : syslog 0.1.2 I, [2024-04-20T06:46:22.871143 #586117] INFO -- : csv 3.3.0 I, [2024-04-20T06:46:22.907434 #586117] INFO -- : installing bundled gem cache: /tmp/ruby/install/trunk/lib/ruby/gems/3.4.0+0/cache I, [2024-04-20T06:46:22.926317 #586117] INFO -- : skipped bundled gems: I, [2024-04-20T06:46:22.926551 #586117] INFO -- : power_assert-2.0.4dev.gem not found in bundled_gems I, [2024-04-20T06:46:22.950436 #586117] INFO -- : $$$[end] "make install -j4" exit with 0. I, [2024-04-20T06:46:22.951124 #586117] INFO -- : $$$[beg] make yes-btest TESTOPTS='-q -j4' I, [2024-04-20T06:47:29.354930 #586117] INFO -- : PASS all 1926 tests E, [2024-04-20T06:47:29.377460 #586117] ERROR -- : I, [2024-04-20T06:47:29.377927 #586117] INFO -- : $$$[end] "make yes-btest TESTOPTS='-q -j4'" exit with 0. I, [2024-04-20T06:47:29.378452 #586117] INFO -- : $$$[beg] make yes-test-basic TESTS='-j4' I, [2024-04-20T06:47:29.922667 #586117] INFO -- : BASERUBY = /usr/bin/ruby --disable=gems I, [2024-04-20T06:47:29.922877 #586117] INFO -- : CC = gcc I, [2024-04-20T06:47:29.922978 #586117] INFO -- : LD = ld I, [2024-04-20T06:47:29.923075 #586117] INFO -- : LDSHARED = gcc -shared I, [2024-04-20T06:47:29.923202 #586117] INFO -- : CFLAGS = -O3 -fno-fast-math -ggdb3 -Wall -Wextra -Wdeprecated-declarations -Wdiv-by-zero -Wduplicated-cond -Wimplicit-function-declaration -Wimplicit-int -Wpointer-arith -Wwrite-strings -Wold-style-definition -Wimplicit-fallthrough=0 -Wmissing-noreturn -Wno-cast-function-type -Wno-constant-logical-operand -Wno-long-long -Wno-missing-field-initializers -Wno-overlength-strings -Wno-packed-bitfield-compat -Wno-parentheses-equality -Wno-self-assign -Wno-tautological-compare -Wno-unused-parameter -Wno-unused-value -Wsuggest-attribute=format -Wsuggest-attribute=noreturn -Wunused-variable -Wmisleading-indentation -Wundef -fPIC I, [2024-04-20T06:47:29.923316 #586117] INFO -- : XCFLAGS = -U_FORTIFY_SOURCE -D_FORTIFY_SOURCE=2 -fstack-protector-strong -fno-strict-overflow -fvisibility=hidden -fexcess-precision=standard -DRUBY_EXPORT -I. -I.ext/include/riscv64-linux -I/tmp/ruby/src/trunk/include -I/tmp/ruby/src/trunk -I/tmp/ruby/src/trunk/prism -I/tmp/ruby/src/trunk/enc/unicode/15.0.0 I, [2024-04-20T06:47:29.923436 #586117] INFO -- : CPPFLAGS = I, [2024-04-20T06:47:29.923574 #586117] INFO -- : DLDFLAGS = -Wl,--compress-debug-sections=zlib -Wl,-soname,libruby.so.3.4 -fstack-protector-strong I, [2024-04-20T06:47:29.923687 #586117] INFO -- : SOLIBS = -lz -lrt -lrt -lgmp -ldl -lcrypt -lm -lpthread I, [2024-04-20T06:47:29.923783 #586117] INFO -- : LANG = I, [2024-04-20T06:47:29.923874 #586117] INFO -- : LC_ALL = I, [2024-04-20T06:47:29.923973 #586117] INFO -- : LC_CTYPE = I, [2024-04-20T06:47:29.924067 #586117] INFO -- : MFLAGS = I, [2024-04-20T06:47:29.924151 #586117] INFO -- : RUSTC = rustc I, [2024-04-20T06:47:29.924268 #586117] INFO -- : YJIT_RUSTC_ARGS = --crate-name=yjit --crate-type=staticlib --edition=2021 -g -C lto=thin -C opt-level=3 -C overflow-checks=on '--out-dir=/tmp/ruby/build/trunk/yjit/target/release/' /tmp/ruby/src/trunk/yjit/src/lib.rs I, [2024-04-20T06:47:29.926356 #586117] INFO -- : gcc (Debian 13.2.0-4revyos1) 13.2.0 I, [2024-04-20T06:47:29.926566 #586117] INFO -- : Copyright (C) 2023 Free Software Foundation, Inc. I, [2024-04-20T06:47:29.926723 #586117] INFO -- : This is free software; see the source for copying conditions. There is NO I, [2024-04-20T06:47:29.926835 #586117] INFO -- : warranty; not even for MERCHANTABILITY or FITNESS FOR A PARTICULAR PURPOSE. I, [2024-04-20T06:47:29.926946 #586117] INFO -- : I, [2024-04-20T06:47:31.867507 #586117] INFO -- : Checking leaked global symbols...none I, [2024-04-20T06:47:32.163055 #586117] INFO -- : /tmp/ruby/src/trunk/basictest/test.rb:assignment ....................................................................................................................................................................................................................................................................................................................................................................................OK 372 I, [2024-04-20T06:47:32.163273 #586117] INFO -- : /tmp/ruby/src/trunk/basictest/test.rb:condition ..OK 2 I, [2024-04-20T06:47:32.163376 #586117] INFO -- : /tmp/ruby/src/trunk/basictest/test.rb:if/unless ...OK 3 I, [2024-04-20T06:47:32.163709 #586117] INFO -- : /tmp/ruby/src/trunk/basictest/test.rb:case .....OK 5 I, [2024-04-20T06:47:32.165119 #586117] INFO -- : /tmp/ruby/src/trunk/basictest/test.rb:while/until ........OK 8 I, [2024-04-20T06:47:32.165922 #586117] INFO -- : /tmp/ruby/src/trunk/basictest/test.rb:exception ..........OK 10 I, [2024-04-20T06:47:32.168480 #586117] INFO -- : /tmp/ruby/src/trunk/basictest/test.rb:array .......................................OK 39 I, [2024-04-20T06:47:32.170154 #586117] INFO -- : /tmp/ruby/src/trunk/basictest/test.rb:hash ...........................OK 27 I, [2024-04-20T06:47:32.178812 #586117] INFO -- : /tmp/ruby/src/trunk/basictest/test.rb:iterator ...........................................................................................................OK 107 I, [2024-04-20T06:47:32.183471 #586117] INFO -- : /tmp/ruby/src/trunk/basictest/test.rb:float ................................................................................OK 80 I, [2024-04-20T06:47:32.199565 #586117] INFO -- : /tmp/ruby/src/trunk/basictest/test.rb:bignum ...............................OK 31 I, [2024-04-20T06:47:32.213229 #586117] INFO -- : /tmp/ruby/src/trunk/basictest/test.rb:string & char ..............................................................OK 62 I, [2024-04-20T06:47:32.213765 #586117] INFO -- : /tmp/ruby/src/trunk/basictest/test.rb:assignment ..........OK 10 I, [2024-04-20T06:47:32.214250 #586117] INFO -- : /tmp/ruby/src/trunk/basictest/test.rb:call ......OK 6 I, [2024-04-20T06:47:32.215042 #586117] INFO -- : /tmp/ruby/src/trunk/basictest/test.rb:proc .........OK 9 I, [2024-04-20T06:47:32.317393 #586117] INFO -- : /tmp/ruby/src/trunk/basictest/test.rb:signal ..OK 2 I, [2024-04-20T06:47:32.338381 #586117] INFO -- : /tmp/ruby/src/trunk/basictest/test.rb:eval ...........................OK 27 I, [2024-04-20T06:47:32.758722 #586117] INFO -- : /tmp/ruby/src/trunk/basictest/test.rb:system ........OK 8 I, [2024-04-20T06:47:32.759145 #586117] INFO -- : /tmp/ruby/src/trunk/basictest/test.rb:const .....OK 5 I, [2024-04-20T06:47:32.759678 #586117] INFO -- : /tmp/ruby/src/trunk/basictest/test.rb:clone .....OK 5 I, [2024-04-20T06:47:32.760814 #586117] INFO -- : /tmp/ruby/src/trunk/basictest/test.rb:marshal ....OK 4 I, [2024-04-20T06:47:32.761322 #586117] INFO -- : /tmp/ruby/src/trunk/basictest/test.rb:pack ....OK 4 I, [2024-04-20T06:47:32.761501 #586117] INFO -- : /tmp/ruby/src/trunk/basictest/test.rb:math ..OK 2 I, [2024-04-20T06:47:32.762023 #586117] INFO -- : /tmp/ruby/src/trunk/basictest/test.rb:struct ......OK 6 I, [2024-04-20T06:47:32.762995 #586117] INFO -- : /tmp/ruby/src/trunk/basictest/test.rb:variable ............OK 12 I, [2024-04-20T06:47:32.763244 #586117] INFO -- : /tmp/ruby/src/trunk/basictest/test.rb:trace ...OK 3 I, [2024-04-20T06:47:32.763979 #586117] INFO -- : /tmp/ruby/src/trunk/basictest/test.rb:defined? ............OK 12 I, [2024-04-20T06:47:32.764564 #586117] INFO -- : /tmp/ruby/src/trunk/basictest/test.rb:alias ......OK 6 I, [2024-04-20T06:47:32.768850 #586117] INFO -- : /tmp/ruby/src/trunk/basictest/test.rb:path .......................OK 23 I, [2024-04-20T06:47:33.157221 #586117] INFO -- : /tmp/ruby/src/trunk/basictest/test.rb:gc ....OK 4 I, [2024-04-20T06:47:33.173615 #586117] INFO -- : I, [2024-04-20T06:47:33.173861 #586117] INFO -- : test succeeded I, [2024-04-20T06:47:33.179375 #586117] INFO -- : $$$[end] "make yes-test-basic TESTS='-j4'" exit with 0. I, [2024-04-20T06:47:33.180064 #586117] INFO -- : $$$[beg] make yes-test-all TESTOPTS='--stderr-on-failure' TESTS='-j4' I, [2024-04-20T06:47:34.036007 #586117] INFO -- : BASERUBY = /usr/bin/ruby --disable=gems I, [2024-04-20T06:47:34.036283 #586117] INFO -- : CC = gcc I, [2024-04-20T06:47:34.036626 #586117] INFO -- : LD = ld I, [2024-04-20T06:47:34.036845 #586117] INFO -- : LDSHARED = gcc -shared I, [2024-04-20T06:47:34.037045 #586117] INFO -- : CFLAGS = -O3 -fno-fast-math -ggdb3 -Wall -Wextra -Wdeprecated-declarations -Wdiv-by-zero -Wduplicated-cond -Wimplicit-function-declaration -Wimplicit-int -Wpointer-arith -Wwrite-strings -Wold-style-definition -Wimplicit-fallthrough=0 -Wmissing-noreturn -Wno-cast-function-type -Wno-constant-logical-operand -Wno-long-long -Wno-missing-field-initializers -Wno-overlength-strings -Wno-packed-bitfield-compat -Wno-parentheses-equality -Wno-self-assign -Wno-tautological-compare -Wno-unused-parameter -Wno-unused-value -Wsuggest-attribute=format -Wsuggest-attribute=noreturn -Wunused-variable -Wmisleading-indentation -Wundef -fPIC I, [2024-04-20T06:47:34.037272 #586117] INFO -- : XCFLAGS = -U_FORTIFY_SOURCE -D_FORTIFY_SOURCE=2 -fstack-protector-strong -fno-strict-overflow -fvisibility=hidden -fexcess-precision=standard -DRUBY_EXPORT -I. -I.ext/include/riscv64-linux -I/tmp/ruby/src/trunk/include -I/tmp/ruby/src/trunk -I/tmp/ruby/src/trunk/prism -I/tmp/ruby/src/trunk/enc/unicode/15.0.0 I, [2024-04-20T06:47:34.037449 #586117] INFO -- : CPPFLAGS = I, [2024-04-20T06:47:34.037623 #586117] INFO -- : DLDFLAGS = -Wl,--compress-debug-sections=zlib -Wl,-soname,libruby.so.3.4 -fstack-protector-strong I, [2024-04-20T06:47:34.037822 #586117] INFO -- : SOLIBS = -lz -lrt -lrt -lgmp -ldl -lcrypt -lm -lpthread I, [2024-04-20T06:47:34.037982 #586117] INFO -- : LANG = I, [2024-04-20T06:47:34.038172 #586117] INFO -- : LC_ALL = I, [2024-04-20T06:47:34.038347 #586117] INFO -- : LC_CTYPE = I, [2024-04-20T06:47:34.038510 #586117] INFO -- : MFLAGS = I, [2024-04-20T06:47:34.038674 #586117] INFO -- : RUSTC = rustc I, [2024-04-20T06:47:34.038866 #586117] INFO -- : YJIT_RUSTC_ARGS = --crate-name=yjit --crate-type=staticlib --edition=2021 -g -C lto=thin -C opt-level=3 -C overflow-checks=on '--out-dir=/tmp/ruby/build/trunk/yjit/target/release/' /tmp/ruby/src/trunk/yjit/src/lib.rs I, [2024-04-20T06:47:34.042882 #586117] INFO -- : gcc (Debian 13.2.0-4revyos1) 13.2.0 I, [2024-04-20T06:47:34.043098 #586117] INFO -- : Copyright (C) 2023 Free Software Foundation, Inc. I, [2024-04-20T06:47:34.043206 #586117] INFO -- : This is free software; see the source for copying conditions. There is NO I, [2024-04-20T06:47:34.043305 #586117] INFO -- : warranty; not even for MERCHANTABILITY or FITNESS FOR A PARTICULAR PURPOSE. I, [2024-04-20T06:47:34.043410 #586117] INFO -- : I, [2024-04-20T06:47:34.071757 #586117] INFO -- : generating enc.mk I, [2024-04-20T06:47:35.556035 #586117] INFO -- : making enc I, [2024-04-20T06:47:35.733400 #586117] INFO -- : make[1]: Entering directory '/tmp/ruby/build/trunk' I, [2024-04-20T06:47:35.733605 #586117] INFO -- : make[1]: Nothing to be done for 'enc'. I, [2024-04-20T06:47:35.733710 #586117] INFO -- : make[1]: Leaving directory '/tmp/ruby/build/trunk' I, [2024-04-20T06:47:35.736192 #586117] INFO -- : making srcs under enc I, [2024-04-20T06:47:36.036285 #586117] INFO -- : make[1]: Entering directory '/tmp/ruby/build/trunk' I, [2024-04-20T06:47:36.036529 #586117] INFO -- : make[1]: Nothing to be done for 'srcs'. I, [2024-04-20T06:47:36.036638 #586117] INFO -- : make[1]: Leaving directory '/tmp/ruby/build/trunk' I, [2024-04-20T06:47:36.041519 #586117] INFO -- : generating transdb.h I, [2024-04-20T06:47:37.262630 #586117] INFO -- : transdb.h unchanged I, [2024-04-20T06:47:37.268246 #586117] INFO -- : making trans I, [2024-04-20T06:47:37.601664 #586117] INFO -- : make[1]: Entering directory '/tmp/ruby/build/trunk' I, [2024-04-20T06:47:37.601861 #586117] INFO -- : make[1]: Nothing to be done for 'trans'. I, [2024-04-20T06:47:37.601956 #586117] INFO -- : make[1]: Leaving directory '/tmp/ruby/build/trunk' I, [2024-04-20T06:47:37.604519 #586117] INFO -- : making encs I, [2024-04-20T06:47:37.992996 #586117] INFO -- : make[1]: Entering directory '/tmp/ruby/build/trunk' I, [2024-04-20T06:47:37.993192 #586117] INFO -- : make[1]: Nothing to be done for 'encs'. I, [2024-04-20T06:47:37.993287 #586117] INFO -- : make[1]: Leaving directory '/tmp/ruby/build/trunk' I, [2024-04-20T06:47:38.008366 #586117] INFO -- : generating makefiles ext/configure-ext.mk I, [2024-04-20T06:47:38.205147 #586117] INFO -- : ext/configure-ext.mk updated I, [2024-04-20T06:47:38.219508 #586117] INFO -- : make[1]: Entering directory '/tmp/ruby/build/trunk' I, [2024-04-20T06:47:50.225740 #586117] INFO -- : make[1]: Leaving directory '/tmp/ruby/build/trunk' I, [2024-04-20T06:47:50.227923 #586117] INFO -- : generating makefile exts.mk I, [2024-04-20T06:47:50.559750 #586117] INFO -- : exts.mk unchanged I, [2024-04-20T06:47:50.597090 #586117] INFO -- : make[1]: Entering directory '/tmp/ruby/build/trunk' I, [2024-04-20T06:47:52.793885 #586117] INFO -- : make[2]: Entering directory '/tmp/ruby/build/trunk/ext/coverage' I, [2024-04-20T06:47:52.818303 #586117] INFO -- : make[2]: Leaving directory '/tmp/ruby/build/trunk/ext/coverage' I, [2024-04-20T06:47:52.860750 #586117] INFO -- : make[2]: Entering directory '/tmp/ruby/build/trunk/ext/date' I, [2024-04-20T06:47:52.890270 #586117] INFO -- : make[2]: Leaving directory '/tmp/ruby/build/trunk/ext/date' I, [2024-04-20T06:47:52.915415 #586117] INFO -- : make[2]: Entering directory '/tmp/ruby/build/trunk/ext/digest' I, [2024-04-20T06:47:52.972519 #586117] INFO -- : make[2]: Leaving directory '/tmp/ruby/build/trunk/ext/digest' I, [2024-04-20T06:47:53.144189 #586117] INFO -- : make[2]: Entering directory '/tmp/ruby/build/trunk/ext/digest/sha2' I, [2024-04-20T06:47:53.171525 #586117] INFO -- : make[2]: Leaving directory '/tmp/ruby/build/trunk/ext/digest/sha2' I, [2024-04-20T06:47:53.305883 #586117] INFO -- : make[2]: Entering directory '/tmp/ruby/build/trunk/ext/fiddle' I, [2024-04-20T06:47:53.372057 #586117] INFO -- : make[2]: Leaving directory '/tmp/ruby/build/trunk/ext/fiddle' I, [2024-04-20T06:47:53.404826 #586117] INFO -- : make[2]: Entering directory '/tmp/ruby/build/trunk/ext/io/console' I, [2024-04-20T06:47:53.425550 #586117] INFO -- : make[2]: Leaving directory '/tmp/ruby/build/trunk/ext/io/console' I, [2024-04-20T06:47:53.511454 #586117] INFO -- : make[2]: Entering directory '/tmp/ruby/build/trunk/ext/json' I, [2024-04-20T06:47:53.576234 #586117] INFO -- : make[2]: Leaving directory '/tmp/ruby/build/trunk/ext/json' I, [2024-04-20T06:47:53.669847 #586117] INFO -- : make[2]: Entering directory '/tmp/ruby/build/trunk/ext/monitor' I, [2024-04-20T06:47:53.689546 #586117] INFO -- : make[2]: Leaving directory '/tmp/ruby/build/trunk/ext/monitor' I, [2024-04-20T06:47:53.742648 #586117] INFO -- : make[2]: Entering directory '/tmp/ruby/build/trunk/ext/objspace' I, [2024-04-20T06:47:53.778265 #586117] INFO -- : make[2]: Leaving directory '/tmp/ruby/build/trunk/ext/objspace' I, [2024-04-20T06:47:53.905138 #586117] INFO -- : make[2]: Entering directory '/tmp/ruby/build/trunk/ext/openssl' I, [2024-04-20T06:47:54.045109 #586117] INFO -- : make[2]: Leaving directory '/tmp/ruby/build/trunk/ext/openssl' I, [2024-04-20T06:47:54.084783 #586117] INFO -- : make[2]: Entering directory '/tmp/ruby/build/trunk/ext/pathname' I, [2024-04-20T06:47:54.106643 #586117] INFO -- : make[2]: Leaving directory '/tmp/ruby/build/trunk/ext/pathname' I, [2024-04-20T06:47:54.159240 #586117] INFO -- : make[2]: Entering directory '/tmp/ruby/build/trunk/ext/psych' I, [2024-04-20T06:47:54.317670 #586117] INFO -- : make[2]: Leaving directory '/tmp/ruby/build/trunk/ext/psych' I, [2024-04-20T06:47:54.351052 #586117] INFO -- : make[2]: Entering directory '/tmp/ruby/build/trunk/ext/pty' I, [2024-04-20T06:47:54.369520 #586117] INFO -- : make[2]: Leaving directory '/tmp/ruby/build/trunk/ext/pty' I, [2024-04-20T06:47:54.463770 #586117] INFO -- : make[2]: Entering directory '/tmp/ruby/build/trunk/ext/ripper' I, [2024-04-20T06:47:54.511686 #586117] INFO -- : make[2]: Leaving directory '/tmp/ruby/build/trunk/ext/ripper' I, [2024-04-20T06:47:54.525819 #586117] INFO -- : make[2]: Entering directory '/tmp/ruby/build/trunk/ext/rubyvm' I, [2024-04-20T06:47:54.549379 #586117] INFO -- : make[2]: Leaving directory '/tmp/ruby/build/trunk/ext/rubyvm' I, [2024-04-20T06:47:54.639709 #586117] INFO -- : make[2]: Entering directory '/tmp/ruby/build/trunk/ext/socket' I, [2024-04-20T06:47:54.700403 #586117] INFO -- : make[2]: Leaving directory '/tmp/ruby/build/trunk/ext/socket' I, [2024-04-20T06:47:54.821024 #586117] INFO -- : make[2]: Entering directory '/tmp/ruby/build/trunk/.bundle/gems/bigdecimal-3.1.7/ext/bigdecimal' I, [2024-04-20T06:47:54.971052 #586117] INFO -- : make[2]: Leaving directory '/tmp/ruby/build/trunk/.bundle/gems/bigdecimal-3.1.7/ext/bigdecimal' I, [2024-04-20T06:47:54.989324 #586117] INFO -- : make[2]: Entering directory '/tmp/ruby/build/trunk/.bundle/gems/debug-1.9.2/ext/debug' I, [2024-04-20T06:47:55.142778 #586117] INFO -- : make[2]: Leaving directory '/tmp/ruby/build/trunk/.bundle/gems/debug-1.9.2/ext/debug' I, [2024-04-20T06:47:55.160152 #586117] INFO -- : make[2]: Entering directory '/tmp/ruby/build/trunk/.bundle/gems/nkf-0.2.0/ext/nkf' I, [2024-04-20T06:47:55.318597 #586117] INFO -- : make[2]: Leaving directory '/tmp/ruby/build/trunk/.bundle/gems/nkf-0.2.0/ext/nkf' I, [2024-04-20T06:47:55.341441 #586117] INFO -- : make[2]: Entering directory '/tmp/ruby/build/trunk/.bundle/gems/racc-1.7.3/ext/racc/cparse' I, [2024-04-20T06:47:55.496465 #586117] INFO -- : make[2]: Leaving directory '/tmp/ruby/build/trunk/.bundle/gems/racc-1.7.3/ext/racc/cparse' I, [2024-04-20T06:47:55.518298 #586117] INFO -- : make[2]: Entering directory '/tmp/ruby/build/trunk/.bundle/gems/rbs-3.4.4/ext/rbs_extension' I, [2024-04-20T06:47:55.671902 #586117] INFO -- : make[2]: Leaving directory '/tmp/ruby/build/trunk/.bundle/gems/rbs-3.4.4/ext/rbs_extension' I, [2024-04-20T06:47:55.689663 #586117] INFO -- : make[2]: Entering directory '/tmp/ruby/build/trunk/.bundle/gems/syslog-0.1.2/ext/syslog' I, [2024-04-20T06:47:55.846734 #586117] INFO -- : make[2]: Leaving directory '/tmp/ruby/build/trunk/.bundle/gems/syslog-0.1.2/ext/syslog' I, [2024-04-20T06:47:56.062674 #586117] INFO -- : make[2]: Entering directory '/tmp/ruby/build/trunk' I, [2024-04-20T06:47:56.710518 #586117] INFO -- : make[2]: 'ruby' is up to date. I, [2024-04-20T06:47:56.710738 #586117] INFO -- : make[2]: Leaving directory '/tmp/ruby/build/trunk' I, [2024-04-20T06:47:56.712576 #586117] INFO -- : make[1]: Leaving directory '/tmp/ruby/build/trunk' I, [2024-04-20T06:47:56.748031 #586117] INFO -- : make[1]: Entering directory '/tmp/ruby/build/trunk' I, [2024-04-20T06:47:56.748225 #586117] INFO -- : make[1]: Nothing to be done for 'note'. I, [2024-04-20T06:47:56.748314 #586117] INFO -- : make[1]: Leaving directory '/tmp/ruby/build/trunk' I, [2024-04-20T06:47:57.482549 #586117] INFO -- : Run options: I, [2024-04-20T06:47:57.482762 #586117] INFO -- : --seed=13051 I, [2024-04-20T06:47:57.482863 #586117] INFO -- : "--ruby=./miniruby -I/tmp/ruby/src/trunk/lib -I. -I.ext/common /tmp/ruby/src/trunk/tool/runruby.rb --extout=.ext -- --disable-gems" I, [2024-04-20T06:47:57.483050 #586117] INFO -- : --excludes-dir=/tmp/ruby/src/trunk/test/.excludes I, [2024-04-20T06:47:57.483233 #586117] INFO -- : --name=!/memory_leak/ I, [2024-04-20T06:47:57.483380 #586117] INFO -- : --stderr-on-failure I, [2024-04-20T06:47:57.483690 #586117] INFO -- : -j4 I, [2024-04-20T06:47:57.483891 #586117] INFO -- : I, [2024-04-20T06:47:57.484037 #586117] INFO -- : # Running tests: I, [2024-04-20T06:47:57.484185 #586117] INFO -- : I, [2024-04-20T06:47:58.461851 #586117] INFO -- : [ 1/881] 627426=version_test I, [2024-04-20T06:47:58.465395 #586117] INFO -- : [ 2/881] 627427=test_cgi_header I, [2024-04-20T06:47:58.510947 #586117] INFO -- : [ 3/881] 627424=heredoc_dedent_test I, [2024-04-20T06:47:58.552933 #586117] INFO -- : [ 4/881] 627425=test_object I, [2024-04-20T06:47:58.617696 #586117] INFO -- : [ 5/881] 627427=test_arithmetic_sequence I, [2024-04-20T06:47:58.684343 #586117] INFO -- : [ 6/881] 627427=test_key_actor_emacs I, [2024-04-20T06:47:59.050003 #586117] INFO -- : [ 7/881] 627425=test_gem_command_manager I, [2024-04-20T06:47:59.099213 #586117] INFO -- : [ 8/881] 627424=test_basicinstructions I, [2024-04-20T06:47:59.141041 #586117] INFO -- : [ 9/881] 627426=test_gem_gemcutter_utilities I, [2024-04-20T06:47:59.590257 #586117] INFO -- : [ 10/881] 627424=test_gem_local_remote_options I, [2024-04-20T06:47:59.947104 #586117] INFO -- : [ 11/881] 627427=test_date_arith I, [2024-04-20T06:48:00.049874 #586117] INFO -- : [ 12/881] 627427=test_object I, [2024-04-20T06:48:01.371341 #586117] INFO -- : [ 13/881] 627425=test_ruby_lex I, [2024-04-20T06:48:01.434151 #586117] INFO -- : [ 14/881] 627424=test_sleep I, [2024-04-20T06:48:02.109333 #586117] INFO -- : [ 15/881] 627426=test_flip I, [2024-04-20T06:48:02.314402 #586117] INFO -- : [ 16/881] 627427=compiler_test I, [2024-04-20T06:48:02.406382 #586117] INFO -- : [ 17/881] 627426=test_change_word I, [2024-04-20T06:48:02.825359 #586117] INFO -- : [ 18/881] 627426=test_ossl I, [2024-04-20T06:48:02.862025 #586117] INFO -- : [ 19/881] 627427=test_normalize I, [2024-04-20T06:48:02.931080 #586117] INFO -- : [ 20/881] 627427=test_timeout I, [2024-04-20T06:48:03.030437 #586117] INFO -- : [ 21/881] 627427=test_rdoc_rd_block_parser I, [2024-04-20T06:48:03.069828 #586117] INFO -- : [ 22/881] 627425=test_tsort I, [2024-04-20T06:48:03.205803 #586117] INFO -- : [ 23/881] 627425=test_signedness I, [2024-04-20T06:48:04.181550 #586117] INFO -- : [ 24/881] 627427=test_type I, [2024-04-20T06:48:04.694716 #586117] INFO -- : [ 25/881] 627427=test_ractor I, [2024-04-20T06:48:04.777280 #586117] INFO -- : [ 26/881] 627427=test_func I, [2024-04-20T06:48:06.455357 #586117] INFO -- : [ 27/881] 627424=test_big5 I, [2024-04-20T06:48:06.606928 #586117] INFO -- : [ 28/881] 627424=test_pointer I, [2024-04-20T06:48:08.772215 #586117] INFO -- : [ 29/881] 627424=test_rdoc_markup_hard_break I, [2024-04-20T06:48:09.067891 #586117] INFO -- : [ 30/881] 627427=test_gem_package_task I, [2024-04-20T06:48:09.128377 #586117] INFO -- : [ 31/881] 627424=test_date_strptime I, [2024-04-20T06:48:10.298427 #586117] INFO -- : [ 32/881] 627424=test_placearg I, [2024-04-20T06:48:10.516263 #586117] INFO -- : [ 33/881] 627427=test_gem_platform I, [2024-04-20T06:48:11.163524 #586117] INFO -- : [ 34/881] 627427=test_pkey_rsa I, [2024-04-20T06:48:11.276915 #586117] INFO -- : [ 35/881] 627424=test_numhash I, [2024-04-20T06:48:11.347646 #586117] INFO -- : [ 36/881] 627424=test_gem_commands_push_command I, [2024-04-20T06:48:14.004931 #586117] INFO -- : [ 37/881] 627427=test_weakkeymap I, [2024-04-20T06:48:14.091539 #586117] INFO -- : [ 38/881] 627424=test_continuation I, [2024-04-20T06:48:14.099948 #586117] INFO -- : [ 39/881] 627424=test_fd_setsize I, [2024-04-20T06:48:14.165282 #586117] INFO -- : [ 40/881] 627424=test_keyword I, [2024-04-20T06:48:15.188175 #586117] INFO -- : [ 41/881] 627427=test_class_name_check I, [2024-04-20T06:48:15.304539 #586117] INFO -- : [ 42/881] 627427=test_delete I, [2024-04-20T06:48:15.357441 #586117] INFO -- : [ 43/881] 627427=test_win32ole_method I, [2024-04-20T06:48:15.421924 #586117] INFO -- : [ 44/881] 627427=test_logger I, [2024-04-20T06:48:15.885757 #586117] INFO -- : [ 45/881] 627427=test_files_test I, [2024-04-20T06:48:16.328243 #586117] INFO -- : [ 46/881] 627427=test_gem_update_suggestion I, [2024-04-20T06:48:16.929670 #586117] INFO -- : [ 47/881] 627427=test_file_exhaustive I, [2024-04-20T06:48:18.311762 #586117] INFO -- : [ 48/881] 627424=test_rdoc_parser_markdown I, [2024-04-20T06:48:18.797323 #586117] INFO -- : [ 49/881] 627424=test_import I, [2024-04-20T06:48:21.867834 #586117] INFO -- : [ 50/881] 627426=test_gem_resolver_lock_set I, [2024-04-20T06:48:22.060806 #586117] INFO -- : [ 51/881] 627424=test_not I, [2024-04-20T06:48:22.110464 #586117] INFO -- : [ 52/881] 627424=test_gem_safe_marshal I, [2024-04-20T06:48:22.201513 #586117] INFO -- : [ 53/881] 627426=test_gem_resolver_api_set I, [2024-04-20T06:48:22.659212 #586117] INFO -- : [ 54/881] 627426=test_gem_resolver_vendor_set I, [2024-04-20T06:48:22.790675 #586117] INFO -- : [ 55/881] 627426=test_config I, [2024-04-20T06:48:24.371100 #586117] INFO -- : [ 56/881] 627425=test_enumerable I, [2024-04-20T06:48:24.424843 #586117] INFO -- : [ 57/881] 627425=test_eval I, [2024-04-20T06:48:26.131488 #586117] INFO -- : [ 58/881] 627425=json_generator_test I, [2024-04-20T06:48:26.297516 #586117] INFO -- : [ 59/881] 627426=test_transcode I, [2024-04-20T06:48:26.359579 #586117] INFO -- : [ 60/881] 627424=test_fips I, [2024-04-20T06:48:26.948808 #586117] INFO -- : [ 61/881] 627425=test_x509name I, [2024-04-20T06:48:27.017752 #586117] INFO -- : [ 62/881] 627425=test_update I, [2024-04-20T06:48:27.247599 #586117] INFO -- : [ 63/881] 627425=test_rdoc_code_object I, [2024-04-20T06:48:27.780073 #586117] INFO -- : [ 64/881] 627426=test_x509store I, [2024-04-20T06:48:29.158825 #586117] INFO -- : [ 65/881] 627424=test_webauthn_listener I, [2024-04-20T06:48:29.419577 #586117] INFO -- : Leaked file descriptor: WebauthnListenerTest#test_wait_for_otp_code_get_follows_options: 9 : # I, [2024-04-20T06:48:29.476105 #586117] INFO -- : COMMAND PID USER FD TYPE DEVICE SIZE/OFF NODE NAME I, [2024-04-20T06:48:29.476354 #586117] INFO -- : ruby 627424 sipeed 9u IPv4 318808 0t0 TCP localhost:37459->localhost:56274 (CLOSE_WAIT) I, [2024-04-20T06:48:29.577855 #586117] INFO -- : Closed file descriptor: WebauthnListenerTest#test_wait_for_otp_code_options_request: 9 I, [2024-04-20T06:48:29.659522 #586117] INFO -- : [ 66/881] 627424=test_lambda I, [2024-04-20T06:48:30.152890 #586117] INFO -- : [ 67/881] 627424=test_gem_request_set_gem_dependency_api I, [2024-04-20T06:48:30.692573 #586117] INFO -- : [ 68/881] 627427=test_ast I, [2024-04-20T06:48:30.777460 #586117] INFO -- : [ 69/881] 627426=test_jaro_winkler I, [2024-04-20T06:48:30.804633 #586117] INFO -- : [ 70/881] 627426=test_random_formatter I, [2024-04-20T06:48:30.896011 #586117] INFO -- : [ 71/881] 627425=test_helper I, [2024-04-20T06:48:30.930596 #586117] INFO -- : [ 72/881] 627426=test_vm_dump I, [2024-04-20T06:48:30.943853 #586117] INFO -- : [ 73/881] 627426=test_tmpdir I, [2024-04-20T06:48:31.337110 #586117] INFO -- : [ 74/881] 627425=test_integer_comb I, [2024-04-20T06:48:31.470773 #586117] INFO -- : [ 75/881] 627426=test_rdoc_markup_document I, [2024-04-20T06:48:32.028520 #586117] INFO -- : [ 76/881] 627424=test_regexp I, [2024-04-20T06:48:32.621278 #586117] INFO -- : [ 77/881] 627426=test_gem_commands_check_command I, [2024-04-20T06:48:32.827340 #586117] INFO -- : [ 78/881] 627426=errors_test I, [2024-04-20T06:48:33.376538 #586117] INFO -- : [ 79/881] 627426=static_inspect_test I, [2024-04-20T06:48:33.409217 #586117] INFO -- : [ 80/881] 627426=test_ostruct I, [2024-04-20T06:48:34.391991 #586117] INFO -- : [ 81/881] 627426=unescape_test I, [2024-04-20T06:48:48.228846 #586117] INFO -- : [ 82/881] 627426=test_file I, [2024-04-20T06:48:51.032565 #586117] INFO -- : [ 83/881] 627425=test_force_exit I, [2024-04-20T06:48:51.044753 #586117] INFO -- : [ 84/881] 627425=test_data_error I, [2024-04-20T06:48:51.532325 #586117] INFO -- : [ 85/881] 627425=bom_test I, [2024-04-20T06:48:51.595447 #586117] INFO -- : [ 86/881] 627425=test_udp I, [2024-04-20T06:48:51.626171 #586117] INFO -- : [ 87/881] 627425=test_dup I, [2024-04-20T06:48:52.831282 #586117] INFO -- : [ 88/881] 627425=test_pty I, [2024-04-20T06:48:54.699808 #586117] INFO -- : [ 89/881] 627426=test_constant I, [2024-04-20T06:48:55.137881 #586117] INFO -- : [ 90/881] 627425=command_line_test I, [2024-04-20T06:48:55.238974 #586117] INFO -- : [ 91/881] 627425=test_range I, [2024-04-20T06:49:01.966524 #586117] INFO -- : [ 92/881] 627425=test_project_sanity I, [2024-04-20T06:49:02.637200 #586117] INFO -- : [ 93/881] 627425=test_gem_uri_formatter I, [2024-04-20T06:49:02.786846 #586117] INFO -- : [ 94/881] 627425=test_encoding I, [2024-04-20T06:49:04.400044 #586117] INFO -- : [ 95/881] 627425=test_helper I, [2024-04-20T06:49:04.515300 #586117] INFO -- : [ 96/881] 627425=test_erb_command I, [2024-04-20T06:49:04.874595 #586117] INFO -- : [ 97/881] 627425=test_ts I, [2024-04-20T06:49:10.036812 #586117] INFO -- : [ 98/881] 627425=library_symbols_test I, [2024-04-20T06:49:10.150272 #586117] INFO -- : [ 99/881] 627425=test_addr I, [2024-04-20T06:49:10.366210 #586117] INFO -- : [100/881] 627425=test_locale I, [2024-04-20T06:49:10.525310 #586117] INFO -- : [101/881] 627425=test_ensured I, [2024-04-20T06:49:10.936600 #586117] INFO -- : [102/881] 627425=test_rdoc_ri_paths I, [2024-04-20T06:49:11.143348 #586117] INFO -- : [103/881] 627425=test_cgi_core I, [2024-04-20T06:49:11.262807 #586117] INFO -- : [104/881] 627425=test_parser I, [2024-04-20T06:49:11.439549 #586117] INFO -- : [105/881] 627425=parse_stream_test I, [2024-04-20T06:49:11.493926 #586117] INFO -- : [106/881] 627425=test_gem I, [2024-04-20T06:49:15.100764 #586117] INFO -- : [107/881] 627426=test_gem_source_lock I, [2024-04-20T06:49:15.445223 #586117] INFO -- : [108/881] 627426=test_ractor I, [2024-04-20T06:49:15.537815 #586117] INFO -- : [109/881] 627426=test_dns I, [2024-04-20T06:49:16.501461 #586117] INFO -- : [110/881] 627426=test_gem_commands_open_command I, [2024-04-20T06:49:17.221367 #586117] INFO -- : [111/881] 627426=test_ssl I, [2024-04-20T06:49:20.268783 #586117] INFO -- : [112/881] 627425=test_rendering I, [2024-04-20T06:49:20.340631 #586117] INFO -- : [113/881] 627425=test_debugger_integration I, [2024-04-20T06:49:20.374031 #586117] INFO -- : [114/881] 627425=test_my_integer I, [2024-04-20T06:49:20.407453 #586117] INFO -- : [115/881] 627426=json_ext_parser_test I, [2024-04-20T06:49:20.421912 #586117] INFO -- : [116/881] 627425=test_thread I, [2024-04-20T06:49:20.513346 #586117] INFO -- : [117/881] 627426=test_ractor I, [2024-04-20T06:49:23.637316 #586117] INFO -- : [118/881] 627426=test_timeout I, [2024-04-20T06:49:25.626217 #586117] INFO -- : [119/881] 627426=test_alias I, [2024-04-20T06:49:26.867422 #586117] INFO -- : [120/881] 627426=test_nonblock I, [2024-04-20T06:49:27.096840 #586117] INFO -- : [121/881] 627426=test_weakref I, [2024-04-20T06:49:27.958700 #586117] INFO -- : [122/881] 627426=test_marshal I, [2024-04-20T06:49:32.016568 #586117] INFO -- : [123/881] 627426=test_unicode_normalize I, [2024-04-20T06:49:36.421751 #586117] INFO -- : [124/881] 627424=test_reline_key I, [2024-04-20T06:49:36.749843 #586117] INFO -- : [125/881] 627425=test_rb_str_dup I, [2024-04-20T06:49:36.783003 #586117] INFO -- : [126/881] 627425=test_ancdata I, [2024-04-20T06:49:36.803076 #586117] INFO -- : [127/881] 627424=test_singleton_function I, [2024-04-20T06:49:36.819508 #586117] INFO -- : [128/881] 627425=test_rubyoptions I, [2024-04-20T06:49:36.865515 #586117] INFO -- : [129/881] 627424=test_super I, [2024-04-20T06:49:40.504841 #586117] INFO -- : [130/881] 627424=test_integer I, [2024-04-20T06:49:57.526076 #586117] INFO -- : [131/881] 627426=test_cgi_modruby I, [2024-04-20T06:49:57.913558 #586117] INFO -- : [132/881] 627426=test_rubygems I, [2024-04-20T06:49:58.777063 #586117] INFO -- : [133/881] 627426=test_call I, [2024-04-20T06:49:59.820197 #586117] INFO -- : [134/881] 627426=test_https_proxy I, [2024-04-20T06:49:59.940904 #586117] INFO -- : [135/881] 627426=test_have_func I, [2024-04-20T06:50:00.890051 #586117] INFO -- : [136/881] 627424=test_gem_request_set_lockfile_tokenizer I, [2024-04-20T06:50:01.379897 #586117] INFO -- : [137/881] 627424=test_stat I, [2024-04-20T06:50:01.399914 #586117] INFO -- : [138/881] 627424=test_capacity I, [2024-04-20T06:50:01.473539 #586117] INFO -- : [139/881] 627424=test_nextafter I, [2024-04-20T06:50:02.201008 #586117] INFO -- : [140/881] 627424=test_usrmarshal I, [2024-04-20T06:50:03.872138 #586117] INFO -- : [141/881] 627424=test_object_references I, [2024-04-20T06:50:03.958288 #586117] INFO -- : [142/881] 627424=test_gem_resolver_git_specification I, [2024-04-20T06:50:05.609170 #586117] INFO -- : [143/881] 627424=test_env I, [2024-04-20T06:50:08.295559 #586117] INFO -- : [144/881] 627425=test_rdoc_attr I, [2024-04-20T06:50:08.396988 #586117] INFO -- : [145/881] 627425=test_dryrun I, [2024-04-20T06:50:08.952575 #586117] INFO -- : [146/881] 627425=test_integer I, [2024-04-20T06:50:09.597974 #586117] INFO -- : [147/881] 627425=desugar_compiler_test I, [2024-04-20T06:50:09.702577 #586117] INFO -- : [148/881] 627425=test_gem_commands_setup_command I, [2024-04-20T06:50:17.280408 #586117] INFO -- : [149/881] 627425=test_gem_console_ui I, [2024-04-20T06:50:17.341231 #586117] INFO -- : [150/881] 627425=test_date_ractor I, [2024-04-20T06:50:20.673331 #586117] INFO -- : [151/881] 627425=format_errors_test I, [2024-04-20T06:50:20.746114 #586117] INFO -- : [152/881] 627425=test_dir I, [2024-04-20T06:50:24.293979 #586117] INFO -- : [153/881] 627425=test_eval I, [2024-04-20T06:50:24.317789 #586117] INFO -- : [154/881] 627425=test_autoconf I, [2024-04-20T06:50:24.397199 #586117] INFO -- : [155/881] 627425=test_ractor_compatibility I, [2024-04-20T06:50:30.039546 #586117] INFO -- : [156/881] 627425=test_member I, [2024-04-20T06:50:30.059743 #586117] INFO -- : [157/881] 627425=test_numeric I, [2024-04-20T06:50:30.243674 #586117] INFO -- : [158/881] 627425=test_cgi_multipart I, [2024-04-20T06:50:30.929891 #586117] INFO -- : [159/881] 627425=test_gem_commands_cleanup_command I, [2024-04-20T06:50:38.114280 #586117] INFO -- : [160/881] 627425=test_word I, [2024-04-20T06:50:38.173219 #586117] INFO -- : [161/881] 627425=test_rdoc_comment I, [2024-04-20T06:50:38.864331 #586117] INFO -- : [162/881] 627425=test_error_highlight I, [2024-04-20T06:50:44.257584 #586117] INFO -- : [163/881] 627424=test_resize I, [2024-04-20T06:50:44.287463 #586117] INFO -- : [164/881] 627424=test_rdoc_generator_darkfish I, [2024-04-20T06:50:45.777802 #586117] INFO -- : [165/881] 627425=test_http_request I, [2024-04-20T06:50:46.247511 #586117] INFO -- : [166/881] 627425=json_generic_object_test I, [2024-04-20T06:50:46.361921 #586117] INFO -- : [167/881] 627425=test_gem_source_fetch_problem I, [2024-04-20T06:50:46.584484 #586117] INFO -- : [168/881] 627425=location_test I, [2024-04-20T06:50:47.288557 #586117] INFO -- : [169/881] 627425=test_symbol I, [2024-04-20T06:50:47.359176 #586117] INFO -- : [170/881] 627425=test_coderange I, [2024-04-20T06:50:47.404393 #586117] INFO -- : [171/881] 627425=test_mailto I, [2024-04-20T06:50:47.466985 #586117] INFO -- : [172/881] 627425=test_pkcs7 I, [2024-04-20T06:50:48.854172 #586117] INFO -- : [173/881] 627424=test_arith_seq_beg_len_step I, [2024-04-20T06:50:49.697859 #586117] INFO -- : [174/881] 627424=test_gem_resolver_requirement_list I, [2024-04-20T06:50:49.714074 #586117] INFO -- : [175/881] 627424=test_function_entry I, [2024-04-20T06:50:49.733784 #586117] INFO -- : [176/881] 627424=test_find_executable I, [2024-04-20T06:50:49.979137 #586117] INFO -- : [177/881] 627425=ruby_api_test I, [2024-04-20T06:50:50.185652 #586117] INFO -- : [178/881] 627424=test_context I, [2024-04-20T06:50:51.625919 #586117] INFO -- : [179/881] 627425=test_gem_commands_pristine_command I, [2024-04-20T06:50:51.926699 #586117] INFO -- : [180/881] 627424=test_nofree I, [2024-04-20T06:50:51.953952 #586117] INFO -- : [181/881] 627424=test_coder I, [2024-04-20T06:50:52.124780 #586117] INFO -- : [182/881] 627424=test_symbol I, [2024-04-20T06:50:56.604973 #586117] INFO -- : [183/881] 627426=test_unix I, [2024-04-20T06:50:56.851655 #586117] INFO -- : [184/881] 627426=test_lazy_enumerator I, [2024-04-20T06:50:59.801090 #586117] INFO -- : [185/881] 627426=test_enc_associate I, [2024-04-20T06:51:01.650800 #586117] INFO -- : [186/881] 627425=test_rdoc_class_module I, [2024-04-20T06:51:03.510853 #586117] INFO -- : [187/881] 627426=test_bignum I, [2024-04-20T06:51:04.209606 #586117] INFO -- : [188/881] 627426=test_gem_ci_detector I, [2024-04-20T06:51:04.254987 #586117] INFO -- : [189/881] 627426=test_stringio I, [2024-04-20T06:51:04.971339 #586117] INFO -- : [190/881] 627426=test_arity I, [2024-04-20T06:51:04.983008 #586117] INFO -- : [191/881] 627426=test_io_wait_uncommon I, [2024-04-20T06:51:05.060728 #586117] INFO -- : [192/881] 627426=test_win32ole_variable I, [2024-04-20T06:51:05.063686 #586117] INFO -- : [193/881] 627426=test_trace I, [2024-04-20T06:51:05.147426 #586117] INFO -- : [194/881] 627426=ractor_test I, [2024-04-20T06:51:05.553732 #586117] INFO -- : [195/881] 627425=test_win32ole_event I, [2024-04-20T06:51:05.607787 #586117] INFO -- : [196/881] 627425=test_time_tz I, [2024-04-20T06:51:05.682993 #586117] INFO -- : [197/881] 627426=test_rdoc_generator_json_index I, [2024-04-20T06:51:06.043628 #586117] INFO -- : [198/881] 627425=test_gem_package I, [2024-04-20T06:51:06.184379 #586117] INFO -- : [199/881] 627426=test_resolve_symbol I, [2024-04-20T06:51:06.371862 #586117] INFO -- : [200/881] 627424=test_complex2 I, [2024-04-20T06:51:06.483220 #586117] INFO -- : [201/881] 627424=test_have_macro I, [2024-04-20T06:51:06.697370 #586117] INFO -- : [202/881] 627426=test_enum I, [2024-04-20T06:51:10.259024 #586117] INFO -- : [203/881] 627424=test_gem_specification I, [2024-04-20T06:51:10.921167 #586117] INFO -- : [204/881] 627425=test_threadgroup I, [2024-04-20T06:51:11.969348 #586117] INFO -- : [205/881] 627425=test_rdoc_extend I, [2024-04-20T06:51:12.138522 #586117] INFO -- : [206/881] 627425=test_merge_keys I, [2024-04-20T06:51:12.171961 #586117] INFO -- : [207/881] 627426=test_gem_resolver_api_specification I, [2024-04-20T06:51:12.217328 #586117] INFO -- : [208/881] 627425=test_win32ole_variant I, [2024-04-20T06:51:12.335575 #586117] INFO -- : [209/881] 627425=test_mixed_unicode_escapes I, [2024-04-20T06:51:12.431549 #586117] INFO -- : [210/881] 627425=test_history I, [2024-04-20T06:51:12.459213 #586117] INFO -- : [211/881] 627426=test_rdoc_markup_to_ansi I, [2024-04-20T06:51:12.541446 #586117] INFO -- : [212/881] 627425=test_ipaddr I, [2024-04-20T06:51:12.691553 #586117] INFO -- : [213/881] 627426=test_array I, [2024-04-20T06:51:12.790430 #586117] INFO -- : [214/881] 627425=test_gem_package_tar_writer I, [2024-04-20T06:51:13.694606 #586117] INFO -- : [215/881] 627425=test_gem_commands_outdated_command I, [2024-04-20T06:51:14.003346 #586117] INFO -- : [216/881] 627425=test_scalar_scanner I, [2024-04-20T06:51:14.103833 #586117] INFO -- : [217/881] 627425=test_gem_source I, [2024-04-20T06:51:16.110085 #586117] INFO -- : [218/881] 627425=test_nesting_parser I, [2024-04-20T06:51:16.203348 #586117] INFO -- : [219/881] 627425=test_win32ole_method_event I, [2024-04-20T06:51:16.259035 #586117] INFO -- : [220/881] 627425=test_benchmark I, [2024-04-20T06:51:18.526573 #586117] INFO -- : [221/881] 627425=test_gem_dependency_list I, [2024-04-20T06:51:19.054102 #586117] INFO -- : [222/881] 627425=test_evaluation I, [2024-04-20T06:51:19.124286 #586117] INFO -- : [223/881] 627425=test_gem_ext_builder I, [2024-04-20T06:51:27.453239 #586117] INFO -- : [224/881] 627425=test_https I, [2024-04-20T06:51:28.274556 #586117] INFO -- : [225/881] 627424=test_load I, [2024-04-20T06:51:28.282622 #586117] INFO -- : [226/881] 627424=test_gem_commands_rebuild_command I, [2024-04-20T06:51:28.592960 #586117] INFO -- : [227/881] 627425=test_yamldbm I, [2024-04-20T06:51:28.612704 #586117] INFO -- : [228/881] 627424=test_rdoc_parser_simple I, [2024-04-20T06:51:28.630540 #586117] INFO -- : [229/881] 627425=test_provider I, [2024-04-20T06:51:28.702313 #586117] INFO -- : [230/881] 627424=test_abi I, [2024-04-20T06:51:30.035790 #586117] INFO -- : [231/881] 627424=test_gem_commands_cert_command I, [2024-04-20T06:51:32.364244 #586117] INFO -- : [232/881] 627425=test_completion I, [2024-04-20T06:51:37.241471 #586117] INFO -- : [233/881] 627425=test_yield_block I, [2024-04-20T06:51:37.266299 #586117] INFO -- : [234/881] 627425=test_len I, [2024-04-20T06:51:37.314584 #586117] INFO -- : [235/881] 627425=test_gem_source_installed I, [2024-04-20T06:51:37.363665 #586117] INFO -- : [236/881] 627425=test_x509ext I, [2024-04-20T06:51:37.415908 #586117] INFO -- : [237/881] 627425=test_erb I, [2024-04-20T06:51:37.805730 #586117] INFO -- : [238/881] 627425=test_propertyputref I, [2024-04-20T06:51:37.813156 #586117] INFO -- : [239/881] 627425=attribute_write_test I, [2024-04-20T06:51:37.882184 #586117] INFO -- : [240/881] 627425=test_spell_checker I, [2024-04-20T06:51:37.901519 #586117] INFO -- : [241/881] 627425=test_assembler I, [2024-04-20T06:51:37.944596 #586117] INFO -- : [242/881] 627425=test_rational2 I, [2024-04-20T06:51:38.022506 #586117] INFO -- : [243/881] 627425=test_rational I, [2024-04-20T06:51:38.211562 #586117] INFO -- : [244/881] 627425=test_gem_request_set I, [2024-04-20T06:51:40.856611 #586117] INFO -- : [245/881] 627425=test_module I, [2024-04-20T06:51:47.046001 #586117] INFO -- : [246/881] 627424=test_gem_ext_cargo_builder I, [2024-04-20T06:51:47.155328 #586117] INFO -- : [247/881] 627424=test_ssl I, [2024-04-20T06:51:56.237190 #586117] INFO -- : [248/881] 627425=constant_path_node_test I, [2024-04-20T06:51:56.285560 #586117] INFO -- : [249/881] 627425=test_parser I, [2024-04-20T06:51:56.833706 #586117] INFO -- : [250/881] 627425=test_arith_seq_extract I, [2024-04-20T06:51:57.731774 #586117] INFO -- : [251/881] 627425=test_method_name_check I, [2024-04-20T06:51:57.973977 #586117] INFO -- : [252/881] 627425=test_rdoc_generator_markup I, [2024-04-20T06:51:58.035281 #586117] INFO -- : [253/881] 627425=test_whileuntil I, [2024-04-20T06:51:58.066244 #586117] INFO -- : [254/881] 627425=test_buffered_io I, [2024-04-20T06:51:58.096854 #586117] INFO -- : [255/881] 627425=test_monitor I, [2024-04-20T06:51:58.400523 #586117] INFO -- : [256/881] 627425=test_rubyvm I, [2024-04-20T06:51:58.436377 #586117] INFO -- : [257/881] 627425=test_configuration I, [2024-04-20T06:51:59.147963 #586117] INFO -- : [258/881] 627425=test_stringify_symbols I, [2024-04-20T06:51:59.214332 #586117] INFO -- : [259/881] 627425=test_instrumentation_api I, [2024-04-20T06:52:00.889016 #586117] INFO -- : [260/881] 627426=integer_parse_test I, [2024-04-20T06:52:00.913313 #586117] INFO -- : [261/881] 627426=test_boolean I, [2024-04-20T06:52:00.975708 #586117] INFO -- : [262/881] 627426=test_config I, [2024-04-20T06:52:01.279727 #586117] INFO -- : [263/881] 627426=test_nomethod_error I, [2024-04-20T06:52:01.301670 #586117] INFO -- : [264/881] 627426=json_parser_test I, [2024-04-20T06:52:01.594262 #586117] INFO -- : [265/881] 627426=memsize_test I, [2024-04-20T06:52:01.627172 #586117] INFO -- : [266/881] 627426=json_common_interface_test I, [2024-04-20T06:52:01.689401 #586117] INFO -- : [267/881] 627426=test_dln I, [2024-04-20T06:52:01.929414 #586117] INFO -- : [268/881] 627426=test_gem_source_subpath_problem I, [2024-04-20T06:52:02.495333 #586117] INFO -- : [269/881] 627426=test_win32ole_variant_outarg I, [2024-04-20T06:52:02.501897 #586117] INFO -- : [270/881] 627426=test_variable I, [2024-04-20T06:52:03.099694 #586117] INFO -- : [271/881] 627425=fuzzer_test I, [2024-04-20T06:52:03.161290 #586117] INFO -- : [272/881] 627425=test_sexp I, [2024-04-20T06:52:03.261697 #586117] INFO -- : [273/881] 627426=test_rdoc_markup_include I, [2024-04-20T06:52:03.298299 #586117] INFO -- : [274/881] 627425=test_rdoc_markup_to_html_snippet I, [2024-04-20T06:52:03.326657 #586117] INFO -- : [275/881] 627426=magic_comment_test I, [2024-04-20T06:52:03.367003 #586117] INFO -- : [276/881] 627426=test_struct I, [2024-04-20T06:52:03.406905 #586117] INFO -- : [277/881] 627426=test_cparser I, [2024-04-20T06:52:03.913982 #586117] INFO -- : [278/881] 627425=test_pkg_config I, [2024-04-20T06:52:03.940648 #586117] INFO -- : [279/881] 627425=test_color_printer I, [2024-04-20T06:52:03.974692 #586117] INFO -- : [280/881] 627425=test_deprecated I, [2024-04-20T06:52:03.994214 #586117] INFO -- : [281/881] 627425=test_insns_leaf I, [2024-04-20T06:52:04.014622 #586117] INFO -- : [282/881] 627425=test_serialize_subclasses I, [2024-04-20T06:52:04.037344 #586117] INFO -- : [283/881] 627425=test_key_error I, [2024-04-20T06:52:04.053857 #586117] INFO -- : [284/881] 627425=test_engine I, [2024-04-20T06:52:04.098364 #586117] INFO -- : [285/881] 627425=test_win32ole_variant_m I, [2024-04-20T06:52:04.114675 #586117] INFO -- : [286/881] 627425=test_div I, [2024-04-20T06:52:04.196137 #586117] INFO -- : [287/881] 627425=test_allocation I, [2024-04-20T06:52:09.917790 #586117] INFO -- : [288/881] 627426=test_rdoc_rd_inline I, [2024-04-20T06:52:10.048334 #586117] INFO -- : [289/881] 627426=test_x509req I, [2024-04-20T06:52:11.877613 #586117] INFO -- : [290/881] 627426=test_mutex I, [2024-04-20T06:52:13.281258 #586117] INFO -- : [291/881] 627426=test_struct I, [2024-04-20T06:52:19.096300 #586117] INFO -- : [292/881] 627426=test_gem_path_support I, [2024-04-20T06:52:19.399321 #586117] INFO -- : [293/881] 627426=test_set I, [2024-04-20T06:52:19.801045 #586117] INFO -- : [294/881] 627426=test_files_test_1 I, [2024-04-20T06:52:22.214772 #586117] INFO -- : [295/881] 627425=test_gem_resolver_installer_set I, [2024-04-20T06:52:23.932769 #586117] INFO -- : [296/881] 627425=test_dir_m17n I, [2024-04-20T06:52:33.267518 #586117] INFO -- : [297/881] 627425=test_gem_source_git I, [2024-04-20T06:52:36.648030 #586117] INFO -- : [298/881] 627425=test_regex_casefold I, [2024-04-20T06:52:36.777864 #586117] INFO -- : [299/881] 627424=test_gem_commands_signout_command I, [2024-04-20T06:52:36.833886 #586117] INFO -- : [300/881] 627424=test_refinement I, [2024-04-20T06:52:40.436640 #586117] INFO -- : [301/881] 627425=test_require I, [2024-04-20T06:52:41.083949 #586117] INFO -- : [302/881] 627426=test_cgi_cookie I, [2024-04-20T06:52:41.116672 #586117] INFO -- : [303/881] 627426=test_float I, [2024-04-20T06:52:46.327394 #586117] INFO -- : [304/881] 627426=test_windows_1252 I, [2024-04-20T06:52:46.412360 #586117] INFO -- : [305/881] 627426=test_input_method I, [2024-04-20T06:52:47.379480 #586117] INFO -- : [306/881] 627426=test_process I, [2024-04-20T06:52:47.715578 #586117] INFO -- : [307/881] 627426=test_x509crl I, [2024-04-20T06:52:49.362593 #586117] INFO -- : [308/881] 627426=test_signal I, [2024-04-20T06:52:54.857716 #586117] INFO -- : [309/881] 627426=test_fixnum I, [2024-04-20T06:52:55.130198 #586117] INFO -- : [310/881] 627426=test_rdoc_top_level I, [2024-04-20T06:52:57.522421 #586117] INFO -- : [311/881] 627426=test_metaclass I, [2024-04-20T06:52:57.570229 #586117] INFO -- : [312/881] 627426=test_cgi_session I, [2024-04-20T06:52:57.794385 #586117] INFO -- : [313/881] 627426=test_rdoc_rd I, [2024-04-20T06:52:57.832617 #586117] INFO -- : [314/881] 627426=test_shellwords I, [2024-04-20T06:52:57.900984 #586117] INFO -- : [315/881] 627426=test_memory_view I, [2024-04-20T06:52:58.032821 #586117] INFO -- : [316/881] 627426=pattern_test I, [2024-04-20T06:52:58.163148 #586117] INFO -- : [317/881] 627426=test_debug I, [2024-04-20T06:52:58.198532 #586117] INFO -- : [318/881] 627426=test_omap I, [2024-04-20T06:52:58.243437 #586117] INFO -- : [319/881] 627426=test_string I, [2024-04-20T06:52:58.289534 #586117] INFO -- : [320/881] 627426=test_iterator I, [2024-04-20T06:52:58.848994 #586117] INFO -- : [321/881] 627426=test_digest_extend I, [2024-04-20T06:52:58.941261 #586117] INFO -- : [322/881] 627426=test_storage I, [2024-04-20T06:52:58.979605 #586117] INFO -- : [323/881] 627426=test_gem_resolver_git_set I, [2024-04-20T06:52:59.965063 #586117] INFO -- : [324/881] 627424=test_gem_security_signer I, [2024-04-20T06:53:00.105044 #586117] INFO -- : [325/881] 627425=test_cipher I, [2024-04-20T06:53:00.586720 #586117] INFO -- : [326/881] 627425=test_new I, [2024-04-20T06:53:00.624670 #586117] INFO -- : [327/881] 627425=test_beginendblock I, [2024-04-20T06:53:01.006001 #586117] INFO -- : [328/881] 627424=test_files_lib I, [2024-04-20T06:53:01.218325 #586117] INFO -- : [329/881] 627426=test_gem_commands_unpack_command I, [2024-04-20T06:53:02.950120 #586117] INFO -- : [330/881] 627425=test_rdoc_markup_to_bs I, [2024-04-20T06:53:03.306213 #586117] INFO -- : [331/881] 627425=test_help I, [2024-04-20T06:53:03.363641 #586117] INFO -- : [332/881] 627425=test_within_pipe I, [2024-04-20T06:53:03.492975 #586117] INFO -- : [333/881] 627425=test_emoji_breaks I, [2024-04-20T06:53:03.494360 #586117] INFO -- : [334/881] 627425=test_gem_bundler_version_finder I, [2024-04-20T06:53:03.558250 #586117] INFO -- : [335/881] 627426=reflection_test I, [2024-04-20T06:53:03.621644 #586117] INFO -- : [336/881] 627426=test_pinned I, [2024-04-20T06:53:03.806659 #586117] INFO -- : [337/881] 627425=test_printf I, [2024-04-20T06:53:03.889655 #586117] INFO -- : [338/881] 627425=test_rdoc_markup_pre_process I, [2024-04-20T06:53:03.996757 #586117] INFO -- : [339/881] 627426=test_stream I, [2024-04-20T06:53:04.055464 #586117] INFO -- : [340/881] 627426=test_to_ary_concat I, [2024-04-20T06:53:04.443009 #586117] INFO -- : [341/881] 627425=test_webauthn_listener_response I, [2024-04-20T06:53:04.635803 #586117] INFO -- : [342/881] 627425=test_time I, [2024-04-20T06:53:05.869976 #586117] INFO -- : [343/881] 627425=test_recursion I, [2024-04-20T06:53:06.308196 #586117] INFO -- : [344/881] 627425=test_exit I, [2024-04-20T06:53:06.666620 #586117] INFO -- : [345/881] 627425=test_popen_deadlock I, [2024-04-20T06:53:10.992939 #586117] INFO -- : [346/881] 627425=test_delegate I, [2024-04-20T06:53:11.081226 #586117] INFO -- : [347/881] 627425=test_mkmf I, [2024-04-20T06:53:11.246632 #586117] INFO -- : [348/881] 627425=test_date_marshal I, [2024-04-20T06:53:11.262578 #586117] INFO -- : [349/881] 627425=test_history I, [2024-04-20T06:53:11.414243 #586117] INFO -- : [350/881] 627425=test_open3 I, [2024-04-20T06:53:17.070393 #586117] INFO -- : [351/881] 627426=test_multi_irb_commands I, [2024-04-20T06:53:17.108902 #586117] INFO -- : [352/881] 627426=test_fiber I, [2024-04-20T06:53:30.743088 #586117] INFO -- : [353/881] 627424=test_bundled_ca I, [2024-04-20T06:53:30.746728 #586117] INFO -- : [354/881] 627425=test_closure I, [2024-04-20T06:53:31.658088 #586117] INFO -- : [355/881] 627426=test_digest I, [2024-04-20T06:53:31.702095 #586117] INFO -- : [356/881] 627426=test_gem_security I, [2024-04-20T06:53:31.997028 #586117] INFO -- : [357/881] 627424=test_rdoc_servlet I, [2024-04-20T06:53:33.157411 #586117] INFO -- : [358/881] 627424=test_ractor I, [2024-04-20T06:53:33.590245 #586117] INFO -- : [359/881] 627424=test_case_comprehensive I, [2024-04-20T06:53:33.620566 #586117] INFO -- : [360/881] 627425=test_interned_str I, [2024-04-20T06:53:33.712604 #586117] INFO -- : [361/881] 627425=test_gem_commands_build_command I, [2024-04-20T06:53:35.720072 #586117] INFO -- : [362/881] 627425=test_option I, [2024-04-20T06:53:36.641382 #586117] INFO -- : [363/881] 627425=test_append I, [2024-04-20T06:53:36.668119 #586117] INFO -- : [364/881] 627425=test_tracer I, [2024-04-20T06:53:36.685207 #586117] INFO -- : [365/881] 627425=test_cmethod I, [2024-04-20T06:53:36.724053 #586117] INFO -- : [366/881] 627425=test_did_you_mean I, [2024-04-20T06:53:37.566523 #586117] INFO -- : [367/881] 627425=test_io_m17n I, [2024-04-20T06:53:45.783488 #586117] INFO -- : [368/881] 627425=test_variable_name_check I, [2024-04-20T06:53:46.081104 #586117] INFO -- : [369/881] 627425=test_gem_commands_server_command I, [2024-04-20T06:53:46.479273 #586117] INFO -- : [370/881] 627425=test_exception_at_throwing I, [2024-04-20T06:53:46.529351 #586117] INFO -- : [371/881] 627425=test_iseq I, [2024-04-20T06:53:50.714175 #586117] INFO -- : [372/881] 627425=test_rdoc_markup_heading I, [2024-04-20T06:53:50.759170 #586117] INFO -- : [373/881] 627425=test_scheduler I, [2024-04-20T06:53:51.120667 #586117] INFO -- : [374/881] 627425=test_ocsp I, [2024-04-20T06:53:54.214309 #586117] INFO -- : [375/881] 627425=test_class I, [2024-04-20T06:53:54.369807 #586117] INFO -- : [376/881] 627425=test_pkey_dsa I, [2024-04-20T06:54:03.917698 #586117] INFO -- : [377/881] 627425=test_terminfo I, [2024-04-20T06:54:03.985383 #586117] INFO -- : [378/881] 627425=test_compile_prism I, [2024-04-20T06:54:06.460070 #586117] INFO -- : [379/881] 627425=test_bug-14834 I, [2024-04-20T06:54:06.774353 #586117] INFO -- : [380/881] 627425=test_rdoc_markup_to_html I, [2024-04-20T06:54:07.386328 #586117] INFO -- : [381/881] 627425=test_date_compat I, [2024-04-20T06:54:07.435038 #586117] INFO -- : [382/881] 627425=test_tree_spell_checker I, [2024-04-20T06:54:07.581513 #586117] INFO -- : [383/881] 627425=test_addrinfo I, [2024-04-20T06:54:07.831514 #586117] INFO -- : [384/881] 627425=test_http I, [2024-04-20T06:54:14.175565 #586117] INFO -- : [385/881] 627427=test_win32ole_param_event I, [2024-04-20T06:54:14.295740 #586117] INFO -- : [386/881] 627427=test_bn I, [2024-04-20T06:54:14.372193 #586117] INFO -- : [387/881] 627427=test_case_mapping I, [2024-04-20T06:54:14.432481 #586117] INFO -- : [388/881] 627427=test_path I, [2024-04-20T06:54:14.643807 #586117] INFO -- : [389/881] 627427=test_rdoc_generator_pot I, [2024-04-20T06:54:14.668370 #586117] INFO -- : [390/881] 627427=test_unicode I, [2024-04-20T06:54:14.707435 #586117] INFO -- : [391/881] 627427=test_rdoc_parser_changelog I, [2024-04-20T06:54:15.263724 #586117] INFO -- : [392/881] 627427=test_enumerator I, [2024-04-20T06:54:15.291369 #586117] INFO -- : [393/881] 627427=test_koi8 I, [2024-04-20T06:54:15.323254 #586117] INFO -- : [394/881] 627427=parameters_signature_test I, [2024-04-20T06:54:15.453611 #586117] INFO -- : [395/881] 627427=test_rdoc_method_attr I, [2024-04-20T06:54:16.150968 #586117] INFO -- : [396/881] 627427=static_literals_test I, [2024-04-20T06:54:16.175609 #586117] INFO -- : [397/881] 627427=test_data I, [2024-04-20T06:54:16.220961 #586117] INFO -- : [398/881] 627427=test_filter I, [2024-04-20T06:54:16.416813 #586117] INFO -- : [399/881] 627427=test_gem_gem_runner I, [2024-04-20T06:54:16.691828 #586117] INFO -- : [400/881] 627427=test_gem_resolver_vendor_specification I, [2024-04-20T06:54:17.277500 #586117] INFO -- : [401/881] 627427=test_gem_commands_update_command I, [2024-04-20T06:54:22.353343 #586117] INFO -- : [402/881] 627425=test_notimplement I, [2024-04-20T06:54:22.382281 #586117] INFO -- : [403/881] 627425=test_random I, [2024-04-20T06:54:22.483546 #586117] INFO -- : [404/881] 627425=test_gem_uri I, [2024-04-20T06:54:22.700980 #586117] INFO -- : [405/881] 627425=test_key_event_record I, [2024-04-20T06:54:22.777939 #586117] INFO -- : [406/881] 627425=test_ssl_session I, [2024-04-20T06:54:24.699091 #586117] INFO -- : [407/881] 627427=test_thread_cv I, [2024-04-20T06:54:25.457977 #586117] INFO -- : [408/881] 627427=test_lexer I, [2024-04-20T06:54:25.534738 #586117] INFO -- : [409/881] 627427=test_rbconfig I, [2024-04-20T06:54:25.576288 #586117] INFO -- : [410/881] 627427=test_primitive I, [2024-04-20T06:54:25.637769 #586117] INFO -- : [411/881] 627427=test_human_typo I, [2024-04-20T06:54:25.665115 #586117] INFO -- : [412/881] 627427=test_rdoc_i18n_locale I, [2024-04-20T06:54:25.727070 #586117] INFO -- : [413/881] 627427=test_chilled I, [2024-04-20T06:54:25.778374 #586117] INFO -- : [414/881] 627427=test_name_error_extension I, [2024-04-20T06:54:25.869017 #586117] INFO -- : [415/881] 627427=test_acceptable I, [2024-04-20T06:54:26.680364 #586117] INFO -- : [416/881] 627427=test_rdoc_generator_pot_po_entry I, [2024-04-20T06:54:26.762953 #586117] INFO -- : [417/881] 627427=test_euc_jp I, [2024-04-20T06:54:26.813748 #586117] INFO -- : [418/881] 627427=test_document I, [2024-04-20T06:54:27.036589 #586117] INFO -- : [419/881] 627427=test_pair I, [2024-04-20T06:54:27.669420 #586117] INFO -- : [420/881] 627425=test_gem_commands_yank_command I, [2024-04-20T06:54:28.619199 #586117] INFO -- : [421/881] 627425=test_win32ole_param I, [2024-04-20T06:54:28.648612 #586117] INFO -- : [422/881] 627425=test_sockopt I, [2024-04-20T06:54:28.699045 #586117] INFO -- : [423/881] 627425=test_rdoc_markup_to_label I, [2024-04-20T06:54:29.152624 #586117] INFO -- : [424/881] 627425=test_install I, [2024-04-20T06:54:30.381933 #586117] INFO -- : [425/881] 627425=test_rdoc_ri_driver I, [2024-04-20T06:54:32.443500 #586117] INFO -- : [426/881] 627425=test_gem_resolver_local_specification I, [2024-04-20T06:54:32.613093 #586117] INFO -- : [427/881] 627425=test_httpheader I, [2024-04-20T06:54:32.684472 #586117] INFO -- : [428/881] 627425=test_set_len I, [2024-04-20T06:54:32.729497 #586117] INFO -- : [429/881] 627425=test_encoding I, [2024-04-20T06:54:32.815652 #586117] INFO -- : [430/881] 627425=test_httpresponses I, [2024-04-20T06:54:32.856888 #586117] INFO -- : [431/881] 627425=test_key_stroke I, [2024-04-20T06:54:32.890210 #586117] INFO -- : [432/881] 627425=json_encoding_test I, [2024-04-20T06:54:32.940892 #586117] INFO -- : [433/881] 627425=test_color I, [2024-04-20T06:54:33.334650 #586117] INFO -- : [434/881] 627425=test_date_attr I, [2024-04-20T06:54:33.367420 #586117] INFO -- : [435/881] 627425=test_ellipsize I, [2024-04-20T06:54:33.450866 #586117] INFO -- : [436/881] 627425=test_kwargs I, [2024-04-20T06:54:33.485455 #586117] INFO -- : [437/881] 627425=warnings_test I, [2024-04-20T06:54:33.582481 #586117] INFO -- : [438/881] 627425=test_io_wait I, [2024-04-20T06:54:34.135795 #586117] INFO -- : [439/881] 627425=test_gem_commands_exec_command I, [2024-04-20T06:54:40.301711 #586117] INFO -- : [440/881] 627425=test_type_completor I, [2024-04-20T06:54:40.344752 #586117] INFO -- : [441/881] 627425=test_summary I, [2024-04-20T06:54:40.671598 #586117] INFO -- : [442/881] 627425=test_console_attr I, [2024-04-20T06:54:40.803779 #586117] INFO -- : [443/881] 627425=test_gem_commands_uninstall_command I, [2024-04-20T06:54:46.405195 #586117] INFO -- : [444/881] 627425=test_condition I, [2024-04-20T06:54:46.431307 #586117] INFO -- : [445/881] 627425=test_foreach I, [2024-04-20T06:54:46.496698 #586117] INFO -- : [446/881] 627425=test_gem_source_specific_file I, [2024-04-20T06:54:47.084953 #586117] INFO -- : [447/881] 627425=test_cp949 I, [2024-04-20T06:54:47.128711 #586117] INFO -- : [448/881] 627425=test_win32ole_record I, [2024-04-20T06:54:47.190618 #586117] INFO -- : [449/881] 627425=test_gem_unsatisfiable_dependency_error I, [2024-04-20T06:54:47.408486 #586117] INFO -- : [450/881] 627425=test_hash I, [2024-04-20T06:54:50.498856 #586117] INFO -- : [451/881] 627427=test_ubf_async_safe I, [2024-04-20T06:54:51.100684 #586117] INFO -- : [452/881] 627427=test_sorted_set I, [2024-04-20T06:54:52.218176 #586117] INFO -- : [453/881] 627427=test_emoji I, [2024-04-20T06:54:52.455254 #586117] INFO -- : [454/881] 627427=test_win32ole_type_event I, [2024-04-20T06:54:52.483087 #586117] INFO -- : [455/881] 627427=test_io I, [2024-04-20T06:54:53.274609 #586117] INFO -- : [456/881] 627427=test_to_ruby I, [2024-04-20T06:54:53.358584 #586117] INFO -- : [457/881] 627427=test_pattern_key_name_check I, [2024-04-20T06:54:53.405311 #586117] INFO -- : [458/881] 627427=test_pack I, [2024-04-20T06:54:55.148524 #586117] INFO -- : [459/881] 627427=test_array_create I, [2024-04-20T06:54:55.182728 #586117] INFO -- : [460/881] 627427=test_gem_impossible_dependencies_error I, [2024-04-20T06:54:55.279436 #586117] INFO -- : [461/881] 627427=test_gem_commands_query_command I, [2024-04-20T06:54:58.931227 #586117] INFO -- : [462/881] 627427=test_method I, [2024-04-20T06:55:14.537959 #586117] INFO -- : [463/881] 627425=test_rdoc_rubygems_hook I, [2024-04-20T06:55:14.945935 #586117] INFO -- : [464/881] 627425=test_euc_kr I, [2024-04-20T06:55:14.984303 #586117] INFO -- : [465/881] 627425=test_rdoc_context_section I, [2024-04-20T06:55:15.042133 #586117] INFO -- : [466/881] 627425=test_ftp I, [2024-04-20T06:55:15.069938 #586117] INFO -- : [467/881] 627425=comments_test I, [2024-04-20T06:55:15.161799 #586117] INFO -- : [468/881] 627425=test_gem_requirement I, [2024-04-20T06:55:16.548692 #586117] INFO -- : [469/881] 627425=test_sprintf I, [2024-04-20T06:55:18.543954 #586117] INFO -- : [470/881] 627425=test_string_memory I, [2024-04-20T06:55:18.648137 #586117] INFO -- : [471/881] 627426=test_gem_security_trust_dir I, [2024-04-20T06:55:19.142058 #586117] INFO -- : [472/881] 627426=test_undef I, [2024-04-20T06:55:19.166566 #586117] INFO -- : [473/881] 627426=test_objspace I, [2024-04-20T06:55:19.394312 #586117] INFO -- : [474/881] 627425=ripper_test I, [2024-04-20T06:55:22.911294 #586117] INFO -- : [475/881] 627425=test_line_editor I, [2024-04-20T06:55:23.052721 #586117] INFO -- : [476/881] 627425=test_have_library I, [2024-04-20T06:55:30.288533 #586117] INFO -- : [477/881] 627427=test_remote_fetch_error I, [2024-04-20T06:55:30.618225 #586117] INFO -- : [478/881] 627427=test_c_struct_entry I, [2024-04-20T06:55:31.239956 #586117] INFO -- : [479/881] 627425=test_lock_native_thread I, [2024-04-20T06:55:32.371903 #586117] INFO -- : [480/881] 627427=test_gem_commands_stale_command I, [2024-04-20T06:55:32.399194 #586117] INFO -- : [481/881] 627427=test_set I, [2024-04-20T06:55:32.662980 #586117] INFO -- : [482/881] 627427=test_show_source I, [2024-04-20T06:55:32.687855 #586117] INFO -- : [483/881] 627425=test_protect I, [2024-04-20T06:55:32.730445 #586117] INFO -- : [484/881] 627425=test_win32ole_typelib I, [2024-04-20T06:55:32.848160 #586117] INFO -- : [485/881] 627425=test_gem_request_set_lockfile I, [2024-04-20T06:55:32.973838 #586117] INFO -- : [486/881] 627427=test_raise_exception I, [2024-04-20T06:55:35.180111 #586117] INFO -- : [487/881] 627425=test_alias_and_anchor I, [2024-04-20T06:55:35.646088 #586117] INFO -- : [488/881] 627425=test_postponed_job I, [2024-04-20T06:55:37.890162 #586117] INFO -- : [489/881] 627425=test_external_new I, [2024-04-20T06:55:37.948948 #586117] INFO -- : [490/881] 627425=test_gem_resolver_dependency_request I, [2024-04-20T06:55:38.017692 #586117] INFO -- : [491/881] 627427=test_tree_builder I, [2024-04-20T06:55:38.094822 #586117] INFO -- : [492/881] 627427=test_hash I, [2024-04-20T06:55:38.184000 #586117] INFO -- : [493/881] 627425=test_kill_ring I, [2024-04-20T06:55:38.223145 #586117] INFO -- : [494/881] 627427=test_framework I, [2024-04-20T06:55:38.366097 #586117] INFO -- : [495/881] 627425=test_ns_spki I, [2024-04-20T06:55:38.418141 #586117] INFO -- : [496/881] 627427=test_argf I, [2024-04-20T06:55:38.491897 #586117] INFO -- : [497/881] 627425=test_gem_commands_environment_command I, [2024-04-20T06:55:38.985763 #586117] INFO -- : [498/881] 627425=test_m17n I, [2024-04-20T06:55:39.388311 #586117] INFO -- : [499/881] 627425=test_ws I, [2024-04-20T06:55:39.459569 #586117] INFO -- : [500/881] 627425=test_yjit I, [2024-04-20T06:55:39.488902 #586117] INFO -- : [501/881] 627425=test_weakmap I, [2024-04-20T06:56:11.957525 #586117] INFO -- : [502/881] 627427=test_workspace I, [2024-04-20T06:56:11.988885 #586117] INFO -- : [503/881] 627427=test_rdoc_markup_indented_paragraph I, [2024-04-20T06:56:12.029130 #586117] INFO -- : [504/881] 627427=test_rdoc_task I, [2024-04-20T06:56:12.083569 #586117] INFO -- : [505/881] 627427=test_gem_resolver_conflict I, [2024-04-20T06:56:12.196538 #586117] INFO -- : [506/881] 627427=ruby_parser_test I, [2024-04-20T06:56:12.476995 #586117] INFO -- : [507/881] 627427=test_pack I, [2024-04-20T06:56:12.626905 #586117] INFO -- : [508/881] 627427=test_backtrace I, [2024-04-20T06:56:15.761984 #586117] INFO -- : [509/881] 627427=test_io_buffer I, [2024-04-20T06:56:16.150931 #586117] INFO -- : [510/881] 627427=test_readpartial I, [2024-04-20T06:56:16.358889 #586117] INFO -- : [511/881] 627425=test_clone I, [2024-04-20T06:56:16.684458 #586117] INFO -- : [512/881] 627427=test_gem_commands_install_command I, [2024-04-20T06:56:17.846221 #586117] INFO -- : [513/881] 627425=test_rdoc_require I, [2024-04-20T06:56:17.945161 #586117] INFO -- : [514/881] 627425=locals_test I, [2024-04-20T06:56:21.528024 #586117] INFO -- : [515/881] 627425=test_gem_resolver_best_set I, [2024-04-20T06:56:22.107045 #586117] INFO -- : [516/881] 627425=encoding_test I, [2024-04-20T06:56:22.714470 #586117] INFO -- : [517/881] 627425=test_typeddata I, [2024-04-20T06:56:25.306748 #586117] INFO -- : [518/881] 627425=test_rdoc_markup_to_html_crossref I, [2024-04-20T06:56:25.370777 #586117] INFO -- : [519/881] 627427=test_webauthn_poller I, [2024-04-20T06:56:25.735376 #586117] INFO -- : [520/881] 627427=test_rdoc_markup_raw I, [2024-04-20T06:56:25.788407 #586117] INFO -- : [521/881] 627427=test_rat I, [2024-04-20T06:56:25.820128 #586117] INFO -- : [522/881] 627427=test_optparse I, [2024-04-20T06:56:25.832127 #586117] INFO -- : [523/881] 627427=test_array I, [2024-04-20T06:56:25.916603 #586117] INFO -- : [524/881] 627427=test_fstring I, [2024-04-20T06:56:26.837805 #586117] INFO -- : [525/881] 627427=test_yield I, [2024-04-20T06:56:27.636490 #586117] INFO -- : [526/881] 627425=test_rdoc_alias I, [2024-04-20T06:56:27.962053 #586117] INFO -- : [527/881] 627425=test_convertible I, [2024-04-20T06:56:54.456694 #586117] INFO -- : [528/881] 627424=parser_test I, [2024-04-20T06:56:54.463337 #586117] INFO -- : [529/881] 627424=test_files_sample I, [2024-04-20T06:56:54.545356 #586117] INFO -- : [530/881] 627424=test_stringscanner I, [2024-04-20T06:56:54.817807 #586117] INFO -- : [531/881] 627424=test_gem_util I, [2024-04-20T06:56:54.889725 #586117] INFO -- : [532/881] 627427=test_iseq_load I, [2024-04-20T06:56:56.293083 #586117] INFO -- : [533/881] 627424=test_gem_package_tar_header I, [2024-04-20T06:56:56.860522 #586117] INFO -- : [534/881] 627424=test_pkey_dh I, [2024-04-20T06:56:57.377055 #586117] INFO -- : [535/881] 627424=test_bigzero I, [2024-04-20T06:56:57.899951 #586117] INFO -- : [536/881] 627424=test_pkcs12 I, [2024-04-20T06:57:01.813512 #586117] INFO -- : [537/881] 627427=test_system I, [2024-04-20T06:57:02.062596 #586117] INFO -- : [538/881] 627424=test_etc I, [2024-04-20T06:57:02.594497 #586117] INFO -- : [539/881] 627424=test_yjit_exit_locations I, [2024-04-20T06:57:02.662501 #586117] INFO -- : [540/881] 627424=test_gem_resolver_activation_request I, [2024-04-20T06:57:02.759260 #586117] INFO -- : [541/881] 627424=test_getopts I, [2024-04-20T06:57:02.820800 #586117] INFO -- : [542/881] 627424=test_protocol I, [2024-04-20T06:57:03.180147 #586117] INFO -- : [543/881] 627424=test_ripper I, [2024-04-20T06:57:05.757606 #586117] INFO -- : [544/881] 627424=test_gem_config_file I, [2024-04-20T06:57:05.988700 #586117] INFO -- : [545/881] 627425=test_config I, [2024-04-20T06:57:06.360756 #586117] INFO -- : [546/881] 627425=test_sleep I, [2024-04-20T06:57:07.226965 #586117] INFO -- : [547/881] 627424=test_math I, [2024-04-20T06:57:07.370244 #586117] INFO -- : [548/881] 627424=test_gem_commands_fetch_command I, [2024-04-20T06:57:08.383038 #586117] INFO -- : [549/881] 627424=test_gc I, [2024-04-20T06:57:08.411946 #586117] INFO -- : [550/881] 627424=test_libs I, [2024-04-20T06:57:08.438727 #586117] INFO -- : [551/881] 627425=test_yaml_tree I, [2024-04-20T06:57:08.469812 #586117] INFO -- : [552/881] 627424=test_rendering I, [2024-04-20T06:57:08.505810 #586117] INFO -- : [553/881] 627424=test_face I, [2024-04-20T06:57:08.634628 #586117] INFO -- : [554/881] 627424=test_sizeof I, [2024-04-20T06:57:08.778772 #586117] INFO -- : [555/881] 627425=test_case I, [2024-04-20T06:57:08.820937 #586117] INFO -- : [556/881] 627425=test_unicode_escape I, [2024-04-20T06:57:09.573780 #586117] INFO -- : [557/881] 627425=test_io I, [2024-04-20T06:57:09.621065 #586117] INFO -- : [558/881] 627427=test_utf16 I, [2024-04-20T06:57:10.290882 #586117] INFO -- : [559/881] 627427=test_autoload I, [2024-04-20T06:57:30.181429 #586117] INFO -- : [560/881] 627427=test_marshalable I, [2024-04-20T06:57:30.307199 #586117] INFO -- : [561/881] 627427=test_digest I, [2024-04-20T06:57:33.460339 #586117] INFO -- : [562/881] 627424=test_gem_ext_cmake_builder I, [2024-04-20T06:57:33.544371 #586117] INFO -- : [563/881] 627424=test_gem_commands_contents_command I, [2024-04-20T06:57:34.099593 #586117] INFO -- : [564/881] 627427=test_cgi_util I, [2024-04-20T06:57:34.490844 #586117] INFO -- : [565/881] 627424=test_require I, [2024-04-20T06:57:36.207497 #586117] INFO -- : [566/881] 627427=test_fiddle I, [2024-04-20T06:57:36.644105 #586117] INFO -- : [567/881] 627427=test_wss I, [2024-04-20T06:57:36.828307 #586117] INFO -- : [568/881] 627427=test_ractor I, [2024-04-20T06:57:37.277295 #586117] INFO -- : [569/881] 627427=test_find I, [2024-04-20T06:57:37.412497 #586117] INFO -- : [570/881] 627427=test_coverage I, [2024-04-20T06:57:42.302016 #586117] INFO -- : [571/881] 627427=test_rdoc_encoding I, [2024-04-20T06:57:42.540466 #586117] INFO -- : [572/881] 627427=regexp_test I, [2024-04-20T06:57:42.638151 #586117] INFO -- : [573/881] 627427=test_gem_package_tar_reader I, [2024-04-20T06:57:43.178476 #586117] INFO -- : [574/881] 627427=test_init I, [2024-04-20T06:57:44.689872 #586117] INFO -- : [575/881] 627424=test_complexrational I, [2024-04-20T06:57:44.802972 #586117] INFO -- : [576/881] 627424=test_pathname I, [2024-04-20T06:57:45.446672 #586117] INFO -- : [577/881] 627427=test_rdoc_markdown I, [2024-04-20T06:57:46.925143 #586117] INFO -- : [578/881] 627424=test_gem_available_set I, [2024-04-20T06:57:47.368137 #586117] INFO -- : [579/881] 627427=test_rdoc_any_method I, [2024-04-20T06:57:47.786796 #586117] INFO -- : [580/881] 627424=test_modify_expand I, [2024-04-20T06:57:47.842305 #586117] INFO -- : [581/881] 627424=test_file I, [2024-04-20T06:57:47.884393 #586117] INFO -- : [582/881] 627424=test_deprecate I, [2024-04-20T06:57:48.290612 #586117] INFO -- : [583/881] 627424=test_rdoc_constant I, [2024-04-20T06:57:49.229850 #586117] INFO -- : [584/881] 627424=test_bash_completion I, [2024-04-20T06:57:49.265806 #586117] INFO -- : [585/881] 627424=test_formatter I, [2024-04-20T06:57:49.351799 #586117] INFO -- : [586/881] 627424=test_gem_source_vendor I, [2024-04-20T06:57:49.442050 #586117] INFO -- : [587/881] 627424=test_gem_commands_owner_command I, [2024-04-20T06:57:50.508355 #586117] INFO -- : [588/881] 627427=test_recorder I, [2024-04-20T06:57:50.537179 #586117] INFO -- : [589/881] 627427=test_big2str I, [2024-04-20T06:57:50.613595 #586117] INFO -- : [590/881] 627427=test_yaml I, [2024-04-20T06:57:51.433878 #586117] INFO -- : [591/881] 627427=test_forwardable I, [2024-04-20T06:57:51.638788 #586117] INFO -- : [592/881] 627427=test_wait I, [2024-04-20T06:57:51.805480 #586117] INFO -- : [593/881] 627424=test_handle I, [2024-04-20T06:57:52.090831 #586117] INFO -- : [594/881] 627427=test_nowrite I, [2024-04-20T06:57:52.332538 #586117] INFO -- : [595/881] 627427=test_thread_queue I, [2024-04-20T06:57:54.177264 #586117] INFO -- : [596/881] 627424=test_rdoc_markup_formatter I, [2024-04-20T06:57:54.241679 #586117] INFO -- : [597/881] 627424=test_bmethod I, [2024-04-20T06:57:54.308092 #586117] INFO -- : [598/881] 627424=test_ractor I, [2024-04-20T06:57:54.329433 #586117] INFO -- : [599/881] 627424=test_euc_tw I, [2024-04-20T06:57:54.376408 #586117] INFO -- : [600/881] 627424=test_ansi_without_terminfo I, [2024-04-20T06:57:54.445056 #586117] INFO -- : [601/881] 627424=test_gem_commands_sources_command I, [2024-04-20T06:57:55.973777 #586117] INFO -- : [602/881] 627424=test_io_timeout I, [2024-04-20T06:57:56.015822 #586117] INFO -- : [603/881] 627424=test_shapes I, [2024-04-20T06:57:56.072271 #586117] INFO -- : [604/881] 627424=json_fixtures_test I, [2024-04-20T06:57:56.111023 #586117] INFO -- : [605/881] 627424=test_comparable I, [2024-04-20T06:57:56.168609 #586117] INFO -- : [606/881] 627424=test_rdoc_parser_c I, [2024-04-20T06:57:57.392964 #586117] INFO -- : [607/881] 627425=test_gbk I, [2024-04-20T06:57:57.426318 #586117] INFO -- : [608/881] 627425=test_class2name I, [2024-04-20T06:57:57.479008 #586117] INFO -- : [609/881] 627425=test_enc_str_buf_cat I, [2024-04-20T06:57:57.515449 #586117] INFO -- : [610/881] 627425=test_pstore I, [2024-04-20T06:57:57.647299 #586117] INFO -- : [611/881] 627424=test_cstr I, [2024-04-20T06:57:57.849476 #586117] INFO -- : [612/881] 627425=test_profile_frames I, [2024-04-20T06:57:58.784647 #586117] INFO -- : [613/881] 627425=test_gem_commands_list_command I, [2024-04-20T06:57:58.828725 #586117] INFO -- : [614/881] 627425=test_stack I, [2024-04-20T06:57:59.740582 #586117] INFO -- : [615/881] 627427=test_rdoc_include I, [2024-04-20T06:57:59.969338 #586117] INFO -- : [616/881] 627427=test_reqarg I, [2024-04-20T06:58:02.188261 #586117] INFO -- : [617/881] 627427=test_too_many_dummy_encodings I, [2024-04-20T06:58:02.640007 #586117] INFO -- : [618/881] 627427=test_gem_version I, [2024-04-20T06:58:02.832913 #586117] INFO -- : [619/881] 627424=test_rdoc_options I, [2024-04-20T06:58:03.326416 #586117] INFO -- : [620/881] 627427=test_econv I, [2024-04-20T06:58:04.654177 #586117] INFO -- : [621/881] 627424=test_cesu8 I, [2024-04-20T06:58:04.786215 #586117] INFO -- : [622/881] 627424=test_fileutils I, [2024-04-20T06:58:06.200884 #586117] INFO -- : [623/881] 627426=test_string_processing I, [2024-04-20T06:58:06.251368 #586117] INFO -- : [624/881] 627426=test_emitter I, [2024-04-20T06:58:06.300549 #586117] INFO -- : [625/881] 627426=test_gem_commands_signin_command I, [2024-04-20T06:58:06.315384 #586117] INFO -- : [626/881] 627425=test_resource I, [2024-04-20T06:58:06.376804 #586117] INFO -- : [627/881] 627425=test_ldap I, [2024-04-20T06:58:06.409078 #586117] INFO -- : [628/881] 627425=test_gem_ext_ext_conf_builder I, [2024-04-20T06:58:06.690199 #586117] INFO -- : [629/881] 627424=test_frozen_error I, [2024-04-20T06:58:06.890849 #586117] INFO -- : [630/881] 627424=test_gem_stub_specification I, [2024-04-20T06:58:07.043097 #586117] INFO -- : [631/881] 627426=test_method_cache I, [2024-04-20T06:58:07.113945 #586117] INFO -- : [632/881] 627426=test_gem_commands_search_command I, [2024-04-20T06:58:07.202683 #586117] INFO -- : [633/881] 627426=test_complex I, [2024-04-20T06:58:07.773963 #586117] INFO -- : [634/881] 627426=test_inlinecache I, [2024-04-20T06:58:08.187893 #586117] INFO -- : [635/881] 627426=test_rdoc_markup_verbatim I, [2024-04-20T06:58:08.246061 #586117] INFO -- : [636/881] 627426=test_gem_resolver_specification I, [2024-04-20T06:58:08.358315 #586117] INFO -- : [637/881] 627424=test_gem_dependency I, [2024-04-20T06:58:08.370909 #586117] INFO -- : [638/881] 627426=test_path_to_class I, [2024-04-20T06:58:08.427995 #586117] INFO -- : [639/881] 627426=test_mdns I, [2024-04-20T06:58:08.449675 #586117] INFO -- : [640/881] 627426=test_parse I, [2024-04-20T06:58:10.135112 #586117] INFO -- : [641/881] 627424=test_gem_remote_fetcher I, [2024-04-20T06:58:10.970665 #586117] INFO -- : [642/881] 627427=test_scanner_events I, [2024-04-20T06:58:11.176773 #586117] INFO -- : [643/881] 627427=test_gem_resolver_installed_specification I, [2024-04-20T06:58:11.354011 #586117] INFO -- : [644/881] 627427=test_date_strftime I, [2024-04-20T06:58:12.402889 #586117] INFO -- : [645/881] 627426=test_rdoc_parser_rd I, [2024-04-20T06:58:12.500910 #586117] INFO -- : [646/881] 627426=test_yamlstore I, [2024-04-20T06:58:12.686193 #586117] INFO -- : [647/881] 627426=test_gem_installer I, [2024-04-20T06:58:15.111534 #586117] INFO -- : [648/881] 627425=test_rdoc_normal_class I, [2024-04-20T06:58:15.143714 #586117] INFO -- : [649/881] 627427=test_class I, [2024-04-20T06:58:15.587717 #586117] INFO -- : [650/881] 627425=test_const I, [2024-04-20T06:58:15.611170 #586117] INFO -- : [651/881] 627425=json_string_matching_test I, [2024-04-20T06:58:15.625760 #586117] INFO -- : [652/881] 627425=test_load I, [2024-04-20T06:58:15.707728 #586117] INFO -- : [653/881] 627425=test_random I, [2024-04-20T06:58:15.733608 #586117] INFO -- : [654/881] 627425=test_asn1 I, [2024-04-20T06:58:16.002669 #586117] INFO -- : [655/881] 627425=test_irb I, [2024-04-20T06:58:17.761631 #586117] INFO -- : [656/881] 627425=test_function I, [2024-04-20T06:58:18.154997 #586117] INFO -- : [657/881] 627425=test_queue I, [2024-04-20T06:58:18.197404 #586117] INFO -- : [658/881] 627425=test_tempfile I, [2024-04-20T06:58:19.455326 #586117] INFO -- : [659/881] 627425=test_noarg I, [2024-04-20T06:58:20.348103 #586117] INFO -- : [660/881] 627425=parse_comments_test I, [2024-04-20T06:58:20.394475 #586117] INFO -- : [661/881] 627425=test_utf32 I, [2024-04-20T06:58:20.463568 #586117] INFO -- : [662/881] 627425=test_basicsocket I, [2024-04-20T06:58:20.547959 #586117] INFO -- : [663/881] 627425=test_duplicate I, [2024-04-20T06:58:20.578065 #586117] INFO -- : [664/881] 627425=test_rdoc_markup I, [2024-04-20T06:58:20.625078 #586117] INFO -- : [665/881] 627425=test_gem_commands_help_command I, [2024-04-20T06:58:21.175871 #586117] INFO -- : [666/881] 627425=test_prettyprint I, [2024-04-20T06:58:21.375702 #586117] INFO -- : [667/881] 627425=test_tracepoint I, [2024-04-20T06:58:21.725893 #586117] INFO -- : [668/881] 627424=test_internal_ivar I, [2024-04-20T06:58:21.759333 #586117] INFO -- : [669/881] 627424=test_gem_resolver_index_specification I, [2024-04-20T06:58:22.149892 #586117] INFO -- : [670/881] 627424=test_gem_commands_specification_command I, [2024-04-20T06:58:23.240662 #586117] INFO -- : [671/881] 627424=test_flags I, [2024-04-20T06:58:23.708165 #586117] INFO -- : [672/881] 627425=test_inadvertent_creation I, [2024-04-20T06:58:24.617684 #586117] INFO -- : [673/881] 627425=test_enumerator I, [2024-04-20T06:58:31.274150 #586117] INFO -- : [674/881] 627424=test_http I, [2024-04-20T06:58:31.318690 #586117] INFO -- : [675/881] 627424=test_gem_commands_which_command I, [2024-04-20T06:58:31.647597 #586117] INFO -- : [676/881] 627424=test_shift_jis I, [2024-04-20T06:58:31.679436 #586117] INFO -- : [677/881] 627424=test_name_error I, [2024-04-20T06:58:32.438535 #586117] INFO -- : [678/881] 627424=test_rdoc_markup_attribute_manager I, [2024-04-20T06:58:32.726913 #586117] INFO -- : [679/881] 627424=test_gem_resolver I, [2024-04-20T06:58:35.391190 #586117] INFO -- : [680/881] 627424=test_safe_load I, [2024-04-20T06:58:35.515110 #586117] INFO -- : [681/881] 627424=test_gem_resolver_composed_set I, [2024-04-20T06:58:35.739927 #586117] INFO -- : [682/881] 627424=test_gem_commands_dependency_command I, [2024-04-20T06:58:36.490194 #586117] INFO -- : [683/881] 627424=test_nil2vtempty I, [2024-04-20T06:58:36.517416 #586117] INFO -- : [684/881] 627424=test_stream I, [2024-04-20T06:58:36.648176 #586117] INFO -- : [685/881] 627424=test_rdoc_context I, [2024-04-20T06:58:40.223195 #586117] INFO -- : [686/881] 627427=test_httpresponse I, [2024-04-20T06:58:40.740484 #586117] INFO -- : [687/881] 627427=test_open-uri I, [2024-04-20T06:58:42.462188 #586117] INFO -- : [688/881] 627427=test_rdoc_parser_ruby I, [2024-04-20T06:58:43.034093 #586117] INFO -- : [689/881] 627424=test_require I, [2024-04-20T06:58:43.044611 #586117] INFO -- : [690/881] 627424=test_rdoc_markup_to_joined_paragraph I, [2024-04-20T06:58:43.069517 #586117] INFO -- : [691/881] 627424=test_date_time I, [2024-04-20T06:58:43.197594 #586117] INFO -- : [692/881] 627424=index_write_test I, [2024-04-20T06:58:43.220264 #586117] INFO -- : [693/881] 627424=test_date_new I, [2024-04-20T06:58:43.286147 #586117] INFO -- : [694/881] 627424=test_data I, [2024-04-20T06:58:43.371510 #586117] INFO -- : [695/881] 627424=test_syntax I, [2024-04-20T06:58:47.369058 #586117] INFO -- : [696/881] 627427=test_gem_safe_yaml I, [2024-04-20T06:58:47.454199 #586117] INFO -- : [697/881] 627427=test_rdoc_text I, [2024-04-20T06:58:47.723165 #586117] INFO -- : [698/881] 627427=test_tcp I, [2024-04-20T06:58:48.127436 #586117] INFO -- : [699/881] 627427=test_iso_8859 I, [2024-04-20T06:58:48.368765 #586117] INFO -- : [700/881] 627427=test_switch_hitter I, [2024-04-20T06:58:48.483407 #586117] INFO -- : [701/881] 627427=test_singleton I, [2024-04-20T06:58:48.558627 #586117] INFO -- : [702/881] 627427=test_flush I, [2024-04-20T06:58:48.618723 #586117] INFO -- : [703/881] 627427=test_io_console I, [2024-04-20T06:58:49.731923 #586117] INFO -- : [704/881] 627426=test_logperiod I, [2024-04-20T06:58:49.962782 #586117] INFO -- : [705/881] 627426=test_c_union_entity I, [2024-04-20T06:58:50.436874 #586117] INFO -- : [706/881] 627426=test_rdoc_normal_module I, [2024-04-20T06:58:50.774236 #586117] INFO -- : [707/881] 627426=test_rdoc_markdown_test I, [2024-04-20T06:58:52.956111 #586117] INFO -- : [708/881] 627427=test_securerandom I, [2024-04-20T06:58:53.283256 #586117] INFO -- : [709/881] 627427=test_thread_fd_close I, [2024-04-20T06:58:53.315700 #586117] INFO -- : [710/881] 627427=test_passing_block I, [2024-04-20T06:58:53.361729 #586117] INFO -- : [711/881] 627427=test_stringchar I, [2024-04-20T06:58:54.004462 #586117] INFO -- : [712/881] 627427=test_hash_create I, [2024-04-20T06:58:54.055215 #586117] INFO -- : [713/881] 627427=newline_test I, [2024-04-20T06:58:54.514980 #586117] INFO -- : [714/881] 627427=test_uncorrectable_name_check I, [2024-04-20T06:58:54.563620 #586117] INFO -- : [715/881] 627427=test_gem_security_policy I, [2024-04-20T06:58:57.484938 #586117] INFO -- : [716/881] 627427=test_gem_source_local I, [2024-04-20T06:58:59.270551 #586117] INFO -- : [717/881] 627427=test_pack I, [2024-04-20T06:58:59.814336 #586117] INFO -- : [718/881] 627426=test_last_thread I, [2024-04-20T06:59:00.778512 #586117] INFO -- : [719/881] 627426=test_process I, [2024-04-20T06:59:00.998204 #586117] INFO -- : [720/881] 627427=test_x509cert I, [2024-04-20T06:59:04.098621 #586117] INFO -- : [721/881] 627427=test_gc I, [2024-04-20T06:59:31.713993 #586117] INFO -- : [722/881] 627424=test_gem_resolver_lock_specification I, [2024-04-20T06:59:32.202562 #586117] INFO -- : [723/881] 627424=test_err_in_callback I, [2024-04-20T06:59:32.251228 #586117] INFO -- : [724/881] 627424=test_logdevice I, [2024-04-20T06:59:38.113095 #586117] INFO -- : [725/881] 627424=test_arity I, [2024-04-20T06:59:39.083564 #586117] INFO -- : [726/881] 627424=test_gem_ext_rake_builder I, [2024-04-20T06:59:44.211202 #586117] INFO -- : [727/881] 627424=test_gem_version_option I, [2024-04-20T06:59:44.789357 #586117] INFO -- : [728/881] 627424=test_grapheme_breaks I, [2024-04-20T06:59:45.033195 #586117] INFO -- : [729/881] 627424=test_gem_request_connection_pools I, [2024-04-20T06:59:46.561034 #586117] INFO -- : [730/881] 627424=test_cclass I, [2024-04-20T06:59:47.046053 #586117] INFO -- : [731/881] 627424=test_parser_events I, [2024-04-20T06:59:48.221500 #586117] INFO -- : [732/881] 627424=test_reline I, [2024-04-20T06:59:48.851681 #586117] INFO -- : [733/881] 627424=test_case I, [2024-04-20T06:59:48.878721 #586117] INFO -- : [734/881] 627424=test_pkey I, [2024-04-20T06:59:49.335167 #586117] INFO -- : [735/881] 627424=test_json_tree I, [2024-04-20T06:59:49.426823 #586117] INFO -- : [736/881] 627424=test_rdoc_markup_to_markdown I, [2024-04-20T06:59:49.727354 #586117] INFO -- : [737/881] 627424=test_ansi_with_terminfo I, [2024-04-20T06:59:49.754582 #586117] INFO -- : [738/881] 627424=test_rdoc_generator_pot_po I, [2024-04-20T06:59:49.961018 #586117] INFO -- : [739/881] 627424=test_ractor I, [2024-04-20T06:59:50.525942 #586117] INFO -- : [740/881] 627424=test_m17n_comb I, [2024-04-20T07:00:04.322554 #586117] INFO -- : [741/881] 627427=test_memory_view I, [2024-04-20T07:00:05.944288 #586117] INFO -- : [742/881] 627427=test_extlibs I, [2024-04-20T07:00:14.091107 #586117] INFO -- : [743/881] 627424=test_rdoc_generator_ri I, [2024-04-20T07:00:14.167838 #586117] INFO -- : [744/881] 627424=test_gem_stream_ui I, [2024-04-20T07:00:15.452075 #586117] INFO -- : [745/881] 627424=test_gem_install_update_options I, [2024-04-20T07:00:17.304463 #586117] INFO -- : [746/881] 627424=parse_test I, [2024-04-20T07:00:20.387867 #586117] INFO -- : [747/881] 627427=test_require_lib I, [2024-04-20T07:00:29.107416 #586117] INFO -- : [748/881] 627425=test_ractor I, [2024-04-20T07:00:29.130801 #586117] INFO -- : [749/881] 627425=test_severity I, [2024-04-20T07:00:29.174643 #586117] INFO -- : [750/881] 627425=test_objectspace I, [2024-04-20T07:00:33.407041 #586117] INFO -- : [751/881] 627425=test_thread I, [2024-04-20T07:00:33.667874 #586117] INFO -- : [752/881] 627425=test_socket I, [2024-04-20T07:00:39.226814 #586117] INFO -- : [753/881] 627424=test_rdoc_markup_to_table_of_contents I, [2024-04-20T07:00:39.391756 #586117] INFO -- : [754/881] 627424=test_dot_dot I, [2024-04-20T07:00:39.465893 #586117] INFO -- : [755/881] 627424=test_c_struct_builder I, [2024-04-20T07:00:40.464860 #586117] INFO -- : [756/881] 627424=test_str2big I, [2024-04-20T07:00:40.516575 #586117] INFO -- : [757/881] 627424=test_literal I, [2024-04-20T07:00:43.851024 #586117] INFO -- : [758/881] 627425=test_store I, [2024-04-20T07:00:45.093251 #586117] INFO -- : [759/881] 627424=test_case_options I, [2024-04-20T07:00:45.147640 #586117] INFO -- : [760/881] 627425=test_gem_commands_info_command I, [2024-04-20T07:00:45.173295 #586117] INFO -- : [761/881] 627424=test_scalar I, [2024-04-20T07:00:45.213508 #586117] INFO -- : [762/881] 627424=test_gem_dependency_installer I, [2024-04-20T07:00:45.384557 #586117] INFO -- : [763/881] 627425=test_rdoc_cross_reference I, [2024-04-20T07:00:46.499882 #586117] INFO -- : [764/881] 627427=test_gem_package_tar_reader_entry I, [2024-04-20T07:00:48.467686 #586117] INFO -- : [765/881] 627427=test_gem_name_tuple I, [2024-04-20T07:00:48.582361 #586117] INFO -- : [766/881] 627427=test_rand I, [2024-04-20T07:00:49.047787 #586117] INFO -- : [767/881] 627425=test_bug_reporter I, [2024-04-20T07:00:49.737521 #586117] INFO -- : [768/881] 627425=test_exception I, [2024-04-20T07:00:51.775758 #586117] INFO -- : [769/881] 627427=test_sprintf_comb I, [2024-04-20T07:00:52.914307 #586117] INFO -- : [770/881] 627427=test_method_cache I, [2024-04-20T07:00:52.989392 #586117] INFO -- : [771/881] 627427=test_gem_request I, [2024-04-20T07:00:54.569976 #586117] INFO -- : [772/881] 627426=test_gem_commands_mirror I, [2024-04-20T07:00:54.633983 #586117] INFO -- : [773/881] 627426=test_gem_ext_cargo_builder_link_flag_converter I, [2024-04-20T07:00:55.204640 #586117] INFO -- : [774/881] 627426=test_settracefunc I, [2024-04-20T07:00:56.026905 #586117] INFO -- : [775/881] 627427=test_gem_text I, [2024-04-20T07:00:56.560970 #586117] INFO -- : [776/881] 627427=test_enumerator_kw I, [2024-04-20T07:00:56.614605 #586117] INFO -- : [777/881] 627427=test_scan_args I, [2024-04-20T07:00:56.689533 #586117] INFO -- : [778/881] 627427=test_win32ole I, [2024-04-20T07:00:56.738709 #586117] INFO -- : [779/881] 627427=test_generic I, [2024-04-20T07:00:56.923168 #586117] INFO -- : [780/881] 627427=test_rdoc_markup_attributes I, [2024-04-20T07:00:57.164273 #586117] INFO -- : [781/881] 627427=test_default_gems I, [2024-04-20T07:00:57.382169 #586117] INFO -- : [782/881] 627427=test_rdoc_rd_inline_parser I, [2024-04-20T07:00:57.615057 #586117] INFO -- : [783/881] 627427=test_rdoc_markup_to_rdoc I, [2024-04-20T07:00:57.870706 #586117] INFO -- : [784/881] 627427=test_mul I, [2024-04-20T07:00:57.924362 #586117] INFO -- : [785/881] 627427=test_win32ole_type I, [2024-04-20T07:00:57.953068 #586117] INFO -- : [786/881] 627427=test_null I, [2024-04-20T07:00:57.980571 #586117] INFO -- : [787/881] 627427=test_pkey_ec I, [2024-04-20T07:00:58.946818 #586117] INFO -- : [788/881] 627427=test_thread I, [2024-04-20T07:00:58.968071 #586117] INFO -- : [789/881] 627427=test_trick I, [2024-04-20T07:01:02.975809 #586117] INFO -- : [790/881] 627426=test_pipe I, [2024-04-20T07:01:03.298923 #586117] INFO -- : [791/881] 627424=test_date_parse I, [2024-04-20T07:01:03.999558 #586117] INFO -- : [792/881] 627426=test_rdoc_i18n_text I, [2024-04-20T07:01:04.064497 #586117] INFO -- : [793/881] 627426=test_io_buffer I, [2024-04-20T07:01:04.171191 #586117] INFO -- : [794/881] 627424=test_backtrace I, [2024-04-20T07:01:04.257883 #586117] INFO -- : [795/881] 627424=test_defined I, [2024-04-20T07:01:04.563336 #586117] INFO -- : [796/881] 627426=test_key_name_check I, [2024-04-20T07:01:04.611816 #586117] INFO -- : [797/881] 627426=test_gb18030 I, [2024-04-20T07:01:04.659709 #586117] INFO -- : [798/881] 627426=test_svcb_https I, [2024-04-20T07:01:04.731969 #586117] INFO -- : [799/881] 627426=test_buffering I, [2024-04-20T07:01:04.950220 #586117] INFO -- : [800/881] 627426=test_gem_uninstaller I, [2024-04-20T07:01:05.087864 #586117] INFO -- : [801/881] 627424=test_rdoc_rdoc I, [2024-04-20T07:01:05.700398 #586117] INFO -- : [802/881] 627424=test_time I, [2024-04-20T07:01:06.586917 #586117] INFO -- : [803/881] 627424=test_windows_1251 I, [2024-04-20T07:01:06.685596 #586117] INFO -- : [804/881] 627424=test_gem_package_old I, [2024-04-20T07:01:07.195700 #586117] INFO -- : [805/881] 627424=test_gem_resolver_index_set I, [2024-04-20T07:01:07.558132 #586117] INFO -- : [806/881] 627424=test_gc_compact I, [2024-04-20T07:01:09.829114 #586117] INFO -- : [807/881] 627425=test_string I, [2024-04-20T07:01:12.767244 #586117] INFO -- : [808/881] 627426=test_proc I, [2024-04-20T07:01:13.336346 #586117] INFO -- : [809/881] 627427=test_date_conv I, [2024-04-20T07:01:13.487122 #586117] INFO -- : [810/881] 627427=test_optimization I, [2024-04-20T07:01:21.814758 #586117] INFO -- : [811/881] 627426=test_erb_m17n I, [2024-04-20T07:01:21.889698 #586117] INFO -- : [812/881] 627426=test_ole_methods I, [2024-04-20T07:01:22.446018 #586117] INFO -- : [813/881] 627426=test_egrep_cpp I, [2024-04-20T07:01:22.951869 #586117] INFO -- : [814/881] 627426=test_cgi_tag_helper I, [2024-04-20T07:01:23.057734 #586117] INFO -- : [815/881] 627426=test_zlib I, [2024-04-20T07:01:30.022390 #586117] INFO -- : [816/881] 627424=test_files_test_2 I, [2024-04-20T07:01:30.104987 #586117] INFO -- : [817/881] 627424=test_fnmatch I, [2024-04-20T07:01:30.876034 #586117] INFO -- : [818/881] 627424=test_require_path_check I, [2024-04-20T07:01:31.287031 #586117] INFO -- : [819/881] 627424=test_rdoc_markup_parser I, [2024-04-20T07:01:31.792269 #586117] INFO -- : [820/881] 627424=test_folderitem2_invokeverb I, [2024-04-20T07:01:31.911386 #586117] INFO -- : [821/881] 627424=test_gem_validator I, [2024-04-20T07:01:32.077487 #586117] INFO -- : [822/881] 627424=test_x509attr I, [2024-04-20T07:01:32.107245 #586117] INFO -- : [823/881] 627424=test_raise I, [2024-04-20T07:01:32.224879 #586117] INFO -- : [824/881] 627424=test_gem_request_set_lockfile_parser I, [2024-04-20T07:01:33.477273 #586117] INFO -- : [825/881] 627424=test_depth_first I, [2024-04-20T07:01:33.679428 #586117] INFO -- : [826/881] 627424=test_rdoc_store I, [2024-04-20T07:01:39.439202 #586117] INFO -- : [827/881] 627424=test_string I, [2024-04-20T07:01:39.625123 #586117] INFO -- : [828/881] 627424=test_rdoc_stats I, [2024-04-20T07:01:39.987303 #586117] INFO -- : [829/881] 627424=test_pattern_matching I, [2024-04-20T07:01:40.255515 #586117] INFO -- : [830/881] 627424=test_gem_dependency_resolution_error I, [2024-04-20T07:01:40.308237 #586117] INFO -- : [831/881] 627424=test_qsort I, [2024-04-20T07:01:40.379028 #586117] INFO -- : [832/881] 627424=test_rdoc_parser I, [2024-04-20T07:01:40.649742 #586117] INFO -- : [833/881] 627424=json_addition_test I, [2024-04-20T07:01:40.757523 #586117] INFO -- : [834/881] 627424=test_rdoc_tom_doc I, [2024-04-20T07:01:40.946774 #586117] INFO -- : [835/881] 627424=test_hmac I, [2024-04-20T07:01:41.023429 #586117] INFO -- : [836/881] 627424=test_rdoc_markup_to_tt_only I, [2024-04-20T07:01:41.372579 #586117] INFO -- : [837/881] 627424=test_gem_spec_fetcher I, [2024-04-20T07:01:43.182416 #586117] INFO -- : [838/881] 627424=test_common I, [2024-04-20T07:01:44.992088 #586117] INFO -- : [839/881] 627424=test_bug-3571 I, [2024-04-20T07:01:45.084763 #586117] INFO -- : [840/881] 627424=test_key_actor_vi I, [2024-04-20T07:01:45.969582 #586117] INFO -- : [841/881] 627424=test_gem_command I, [2024-04-20T07:01:47.461286 #586117] INFO -- : [842/881] 627424=test_gem_commands_lock_command I, [2024-04-20T07:01:47.685277 #586117] INFO -- : [843/881] 627424=test_ifunless I, [2024-04-20T07:01:47.809873 #586117] INFO -- : [844/881] 627424=test_assignment I, [2024-04-20T07:01:56.206655 #586117] INFO -- : [845/881] 627426=test_numeric I, [2024-04-20T07:01:56.742665 #586117] INFO -- : [846/881] 627426=test_config I, [2024-04-20T07:01:56.914108 #586117] INFO -- : [847/881] 627426=test_gem_source_list I, [2024-04-20T07:01:57.324901 #586117] INFO -- : [848/881] 627426=test_optarg I, [2024-04-20T07:01:58.248996 #586117] INFO -- : [849/881] 627426=test_yaml_special_cases I, [2024-04-20T07:01:58.329147 #586117] INFO -- : [850/881] 627426=test_address_resolve I, [2024-04-20T07:01:58.440818 #586117] INFO -- : [851/881] 627426=test_rdoc_token_stream I, [2024-04-20T07:01:58.492356 #586117] INFO -- : [852/881] 627426=test_iter_break I, [2024-04-20T07:01:58.524950 #586117] INFO -- : [853/881] 627426=test_zsh_completion I, [2024-04-20T07:01:58.563463 #586117] INFO -- : [854/881] 627426=test_exception I, [2024-04-20T07:01:58.631942 #586117] INFO -- : [855/881] 627426=test_gem_ext_configure_builder I, [2024-04-20T07:01:58.861355 #586117] INFO -- : [856/881] 627426=test_frozen I, [2024-04-20T07:01:58.925471 #586117] INFO -- : [857/881] 627426=test_pp I, [2024-04-20T07:01:59.251682 #586117] INFO -- : [858/881] 627426=test_macro I, [2024-04-20T07:01:59.549195 #586117] INFO -- : [859/881] 627426=test_rdoc_single_class I, [2024-04-20T07:01:59.584096 #586117] INFO -- : [860/881] 627426=test_nil I, [2024-04-20T07:01:59.636544 #586117] INFO -- : [861/881] 627426=test_num2int I, [2024-04-20T07:01:59.715417 #586117] INFO -- : [862/881] 627426=test_verbose I, [2024-04-20T07:01:59.948456 #586117] INFO -- : [863/881] 627426=test_gem_silent_ui I, [2024-04-20T07:02:00.239470 #586117] INFO -- : [864/881] 627426=test_emitter I, [2024-04-20T07:02:00.264174 #586117] INFO -- : [865/881] 627426=test_files_ext I, [2024-04-20T07:02:00.299248 #586117] INFO -- : [866/881] 627426=test_bug-5832 I, [2024-04-20T07:02:00.365032 #586117] INFO -- : [867/881] 627426=test_eval_history I, [2024-04-20T07:02:00.539669 #586117] INFO -- : [868/881] 627426=dispatcher_test I, [2024-04-20T07:02:00.873057 #586117] INFO -- : [869/881] 627426=test_kernel I, [2024-04-20T07:02:03.058584 #586117] INFO -- : [870/881] 627424=test_gem_doctor I, [2024-04-20T07:02:03.474285 #586117] INFO -- : [871/881] 627424=test_kdf I, [2024-04-20T07:02:04.036354 #586117] INFO -- : [872/881] 627424=test_rdoc_markup_paragraph I, [2024-04-20T07:02:04.049499 #586117] INFO -- : [873/881] 627424=!Nothing_to_test I, [2024-04-20T07:02:04.103212 #586117] INFO -- : [874/881] 627424=test_enc_raise I, [2024-04-20T07:02:04.174788 #586117] INFO -- : [875/881] 627424=test_psych I, [2024-04-20T07:02:04.335126 #586117] INFO -- : [876/881] 627424=test_gem_ext_cargo_builder_unit I, [2024-04-20T07:02:04.706292 #586117] INFO -- : [877/881] 627424=test_date I, [2024-04-20T07:02:04.870314 #586117] INFO -- : [878/881] 627424=test_gem_rdoc I, [2024-04-20T07:02:05.197277 #586117] INFO -- : [879/881] 627426=test_command I, [2024-04-20T07:02:05.906921 #586117] INFO -- : [880/881] 627424=test_at_exit I, [2024-04-20T07:02:06.187306 #586117] INFO -- : [881/881] 627424=test_object_create_start I, [2024-04-20T07:03:20.733704 #586117] INFO -- : Finished tests in 923.312332s, 28.4357 tests/s, 10110.3621 assertions/s. E, [2024-04-20T07:03:20.734503 #586117] ERROR -- : Children under /tmp/rubytest.20240420-627421-sjp32i: E, [2024-04-20T07:03:20.735006 #586117] ERROR -- : drwx------ 2 40 2024-04-20 07:01:55 +0000 d20240420-627426-iti5dp E, [2024-04-20T07:03:20.735186 #586117] ERROR -- : drwx------ 4 80 2024-04-20 06:51:28 +0000 gem_rebuild20240420-627424-keh2re I, [2024-04-20T07:03:20.739439 #586117] INFO -- : 26255 tests, 9335022 assertions, 0 failures, 0 errors, 290 skips I, [2024-04-20T07:03:20.739714 #586117] INFO -- : I, [2024-04-20T07:03:20.739867 #586117] INFO -- : ruby -v: ruby 3.4.0dev (2024-04-20T02:34:52Z master 9f9755664d) [riscv64-linux] I, [2024-04-20T07:03:20.751881 #586117] INFO -- : $$$[end] "make yes-test-all TESTOPTS='--stderr-on-failure' TESTS='-j4'" exit with 0. I, [2024-04-20T07:03:20.752835 #586117] INFO -- : $$$[beg] make yes-test-rubyspec MSPECOPT='--error-output stderr --debug -j' TESTS='-j4' I, [2024-04-20T07:03:21.575118 #586117] INFO -- : BASERUBY = /usr/bin/ruby --disable=gems I, [2024-04-20T07:03:21.575334 #586117] INFO -- : CC = gcc I, [2024-04-20T07:03:21.575552 #586117] INFO -- : LD = ld I, [2024-04-20T07:03:21.575678 #586117] INFO -- : LDSHARED = gcc -shared I, [2024-04-20T07:03:21.575853 #586117] INFO -- : CFLAGS = -O3 -fno-fast-math -ggdb3 -Wall -Wextra -Wdeprecated-declarations -Wdiv-by-zero -Wduplicated-cond -Wimplicit-function-declaration -Wimplicit-int -Wpointer-arith -Wwrite-strings -Wold-style-definition -Wimplicit-fallthrough=0 -Wmissing-noreturn -Wno-cast-function-type -Wno-constant-logical-operand -Wno-long-long -Wno-missing-field-initializers -Wno-overlength-strings -Wno-packed-bitfield-compat -Wno-parentheses-equality -Wno-self-assign -Wno-tautological-compare -Wno-unused-parameter -Wno-unused-value -Wsuggest-attribute=format -Wsuggest-attribute=noreturn -Wunused-variable -Wmisleading-indentation -Wundef -fPIC I, [2024-04-20T07:03:21.576016 #586117] INFO -- : XCFLAGS = -U_FORTIFY_SOURCE -D_FORTIFY_SOURCE=2 -fstack-protector-strong -fno-strict-overflow -fvisibility=hidden -fexcess-precision=standard -DRUBY_EXPORT -I. -I.ext/include/riscv64-linux -I/tmp/ruby/src/trunk/include -I/tmp/ruby/src/trunk -I/tmp/ruby/src/trunk/prism -I/tmp/ruby/src/trunk/enc/unicode/15.0.0 I, [2024-04-20T07:03:21.576132 #586117] INFO -- : CPPFLAGS = I, [2024-04-20T07:03:21.576240 #586117] INFO -- : DLDFLAGS = -Wl,--compress-debug-sections=zlib -Wl,-soname,libruby.so.3.4 -fstack-protector-strong I, [2024-04-20T07:03:21.576403 #586117] INFO -- : SOLIBS = -lz -lrt -lrt -lgmp -ldl -lcrypt -lm -lpthread I, [2024-04-20T07:03:21.576650 #586117] INFO -- : LANG = I, [2024-04-20T07:03:21.576837 #586117] INFO -- : LC_ALL = I, [2024-04-20T07:03:21.576969 #586117] INFO -- : LC_CTYPE = I, [2024-04-20T07:03:21.577090 #586117] INFO -- : MFLAGS = I, [2024-04-20T07:03:21.577290 #586117] INFO -- : RUSTC = rustc I, [2024-04-20T07:03:21.577436 #586117] INFO -- : YJIT_RUSTC_ARGS = --crate-name=yjit --crate-type=staticlib --edition=2021 -g -C lto=thin -C opt-level=3 -C overflow-checks=on '--out-dir=/tmp/ruby/build/trunk/yjit/target/release/' /tmp/ruby/src/trunk/yjit/src/lib.rs I, [2024-04-20T07:03:21.580051 #586117] INFO -- : gcc (Debian 13.2.0-4revyos1) 13.2.0 I, [2024-04-20T07:03:21.580244 #586117] INFO -- : Copyright (C) 2023 Free Software Foundation, Inc. I, [2024-04-20T07:03:21.580348 #586117] INFO -- : This is free software; see the source for copying conditions. There is NO I, [2024-04-20T07:03:21.580523 #586117] INFO -- : warranty; not even for MERCHANTABILITY or FITNESS FOR A PARTICULAR PURPOSE. I, [2024-04-20T07:03:21.580642 #586117] INFO -- : I, [2024-04-20T07:03:21.598202 #586117] INFO -- : generating enc.mk I, [2024-04-20T07:03:23.087296 #586117] INFO -- : making enc I, [2024-04-20T07:03:23.260816 #586117] INFO -- : make[1]: Entering directory '/tmp/ruby/build/trunk' I, [2024-04-20T07:03:23.261019 #586117] INFO -- : make[1]: Nothing to be done for 'enc'. I, [2024-04-20T07:03:23.261123 #586117] INFO -- : make[1]: Leaving directory '/tmp/ruby/build/trunk' I, [2024-04-20T07:03:23.263609 #586117] INFO -- : making srcs under enc I, [2024-04-20T07:03:23.567866 #586117] INFO -- : make[1]: Entering directory '/tmp/ruby/build/trunk' I, [2024-04-20T07:03:23.568060 #586117] INFO -- : make[1]: Nothing to be done for 'srcs'. I, [2024-04-20T07:03:23.568157 #586117] INFO -- : make[1]: Leaving directory '/tmp/ruby/build/trunk' I, [2024-04-20T07:03:23.572838 #586117] INFO -- : generating transdb.h I, [2024-04-20T07:03:24.935177 #586117] INFO -- : transdb.h unchanged I, [2024-04-20T07:03:24.940852 #586117] INFO -- : making trans I, [2024-04-20T07:03:25.286406 #586117] INFO -- : make[1]: Entering directory '/tmp/ruby/build/trunk' I, [2024-04-20T07:03:25.286678 #586117] INFO -- : make[1]: Nothing to be done for 'trans'. I, [2024-04-20T07:03:25.286885 #586117] INFO -- : make[1]: Leaving directory '/tmp/ruby/build/trunk' I, [2024-04-20T07:03:25.290033 #586117] INFO -- : making encs I, [2024-04-20T07:03:25.672196 #586117] INFO -- : make[1]: Entering directory '/tmp/ruby/build/trunk' I, [2024-04-20T07:03:25.672514 #586117] INFO -- : make[1]: Nothing to be done for 'encs'. I, [2024-04-20T07:03:25.672730 #586117] INFO -- : make[1]: Leaving directory '/tmp/ruby/build/trunk' I, [2024-04-20T07:03:25.691620 #586117] INFO -- : generating makefiles ext/configure-ext.mk I, [2024-04-20T07:03:25.887032 #586117] INFO -- : ext/configure-ext.mk updated I, [2024-04-20T07:03:25.901414 #586117] INFO -- : make[1]: Entering directory '/tmp/ruby/build/trunk' I, [2024-04-20T07:03:37.850062 #586117] INFO -- : make[1]: Leaving directory '/tmp/ruby/build/trunk' I, [2024-04-20T07:03:37.852177 #586117] INFO -- : generating makefile exts.mk I, [2024-04-20T07:03:38.177494 #586117] INFO -- : exts.mk unchanged I, [2024-04-20T07:03:38.214863 #586117] INFO -- : make[1]: Entering directory '/tmp/ruby/build/trunk' I, [2024-04-20T07:03:40.395903 #586117] INFO -- : make[2]: Entering directory '/tmp/ruby/build/trunk/ext/coverage' I, [2024-04-20T07:03:40.421210 #586117] INFO -- : make[2]: Leaving directory '/tmp/ruby/build/trunk/ext/coverage' I, [2024-04-20T07:03:40.470129 #586117] INFO -- : make[2]: Entering directory '/tmp/ruby/build/trunk/ext/date' I, [2024-04-20T07:03:40.506745 #586117] INFO -- : make[2]: Leaving directory '/tmp/ruby/build/trunk/ext/date' I, [2024-04-20T07:03:40.539865 #586117] INFO -- : make[2]: Entering directory '/tmp/ruby/build/trunk/ext/digest' I, [2024-04-20T07:03:40.595956 #586117] INFO -- : make[2]: Leaving directory '/tmp/ruby/build/trunk/ext/digest' I, [2024-04-20T07:03:40.774970 #586117] INFO -- : make[2]: Entering directory '/tmp/ruby/build/trunk/ext/digest/sha2' I, [2024-04-20T07:03:40.798197 #586117] INFO -- : make[2]: Leaving directory '/tmp/ruby/build/trunk/ext/digest/sha2' I, [2024-04-20T07:03:40.935645 #586117] INFO -- : make[2]: Entering directory '/tmp/ruby/build/trunk/ext/fiddle' I, [2024-04-20T07:03:41.001619 #586117] INFO -- : make[2]: Leaving directory '/tmp/ruby/build/trunk/ext/fiddle' I, [2024-04-20T07:03:41.031717 #586117] INFO -- : make[2]: Entering directory '/tmp/ruby/build/trunk/ext/io/console' I, [2024-04-20T07:03:41.053923 #586117] INFO -- : make[2]: Leaving directory '/tmp/ruby/build/trunk/ext/io/console' I, [2024-04-20T07:03:41.137040 #586117] INFO -- : make[2]: Entering directory '/tmp/ruby/build/trunk/ext/json' I, [2024-04-20T07:03:41.211236 #586117] INFO -- : make[2]: Leaving directory '/tmp/ruby/build/trunk/ext/json' I, [2024-04-20T07:03:41.305447 #586117] INFO -- : make[2]: Entering directory '/tmp/ruby/build/trunk/ext/monitor' I, [2024-04-20T07:03:41.326829 #586117] INFO -- : make[2]: Leaving directory '/tmp/ruby/build/trunk/ext/monitor' I, [2024-04-20T07:03:41.369139 #586117] INFO -- : make[2]: Entering directory '/tmp/ruby/build/trunk/ext/objspace' I, [2024-04-20T07:03:41.413360 #586117] INFO -- : make[2]: Leaving directory '/tmp/ruby/build/trunk/ext/objspace' I, [2024-04-20T07:03:41.539419 #586117] INFO -- : make[2]: Entering directory '/tmp/ruby/build/trunk/ext/openssl' I, [2024-04-20T07:03:41.678871 #586117] INFO -- : make[2]: Leaving directory '/tmp/ruby/build/trunk/ext/openssl' I, [2024-04-20T07:03:41.710339 #586117] INFO -- : make[2]: Entering directory '/tmp/ruby/build/trunk/ext/pathname' I, [2024-04-20T07:03:41.728919 #586117] INFO -- : make[2]: Leaving directory '/tmp/ruby/build/trunk/ext/pathname' I, [2024-04-20T07:03:41.772962 #586117] INFO -- : make[2]: Entering directory '/tmp/ruby/build/trunk/ext/psych' I, [2024-04-20T07:03:41.936732 #586117] INFO -- : make[2]: Leaving directory '/tmp/ruby/build/trunk/ext/psych' I, [2024-04-20T07:03:41.969697 #586117] INFO -- : make[2]: Entering directory '/tmp/ruby/build/trunk/ext/pty' I, [2024-04-20T07:03:42.000243 #586117] INFO -- : make[2]: Leaving directory '/tmp/ruby/build/trunk/ext/pty' I, [2024-04-20T07:03:42.096703 #586117] INFO -- : make[2]: Entering directory '/tmp/ruby/build/trunk/ext/ripper' I, [2024-04-20T07:03:42.146833 #586117] INFO -- : make[2]: Leaving directory '/tmp/ruby/build/trunk/ext/ripper' I, [2024-04-20T07:03:42.159719 #586117] INFO -- : make[2]: Entering directory '/tmp/ruby/build/trunk/ext/rubyvm' I, [2024-04-20T07:03:42.177426 #586117] INFO -- : make[2]: Leaving directory '/tmp/ruby/build/trunk/ext/rubyvm' I, [2024-04-20T07:03:42.266449 #586117] INFO -- : make[2]: Entering directory '/tmp/ruby/build/trunk/ext/socket' I, [2024-04-20T07:03:42.324936 #586117] INFO -- : make[2]: Leaving directory '/tmp/ruby/build/trunk/ext/socket' I, [2024-04-20T07:03:42.436018 #586117] INFO -- : make[2]: Entering directory '/tmp/ruby/build/trunk/.bundle/gems/bigdecimal-3.1.7/ext/bigdecimal' I, [2024-04-20T07:03:42.588550 #586117] INFO -- : make[2]: Leaving directory '/tmp/ruby/build/trunk/.bundle/gems/bigdecimal-3.1.7/ext/bigdecimal' I, [2024-04-20T07:03:42.607203 #586117] INFO -- : make[2]: Entering directory '/tmp/ruby/build/trunk/.bundle/gems/debug-1.9.2/ext/debug' I, [2024-04-20T07:03:42.762387 #586117] INFO -- : make[2]: Leaving directory '/tmp/ruby/build/trunk/.bundle/gems/debug-1.9.2/ext/debug' I, [2024-04-20T07:03:42.789218 #586117] INFO -- : make[2]: Entering directory '/tmp/ruby/build/trunk/.bundle/gems/nkf-0.2.0/ext/nkf' I, [2024-04-20T07:03:42.952923 #586117] INFO -- : make[2]: Leaving directory '/tmp/ruby/build/trunk/.bundle/gems/nkf-0.2.0/ext/nkf' I, [2024-04-20T07:03:42.984191 #586117] INFO -- : make[2]: Entering directory '/tmp/ruby/build/trunk/.bundle/gems/racc-1.7.3/ext/racc/cparse' I, [2024-04-20T07:03:43.134717 #586117] INFO -- : make[2]: Leaving directory '/tmp/ruby/build/trunk/.bundle/gems/racc-1.7.3/ext/racc/cparse' I, [2024-04-20T07:03:43.161204 #586117] INFO -- : make[2]: Entering directory '/tmp/ruby/build/trunk/.bundle/gems/rbs-3.4.4/ext/rbs_extension' I, [2024-04-20T07:03:43.318488 #586117] INFO -- : make[2]: Leaving directory '/tmp/ruby/build/trunk/.bundle/gems/rbs-3.4.4/ext/rbs_extension' I, [2024-04-20T07:03:43.336477 #586117] INFO -- : make[2]: Entering directory '/tmp/ruby/build/trunk/.bundle/gems/syslog-0.1.2/ext/syslog' I, [2024-04-20T07:03:43.490586 #586117] INFO -- : make[2]: Leaving directory '/tmp/ruby/build/trunk/.bundle/gems/syslog-0.1.2/ext/syslog' I, [2024-04-20T07:03:43.715153 #586117] INFO -- : make[2]: Entering directory '/tmp/ruby/build/trunk' I, [2024-04-20T07:03:44.361314 #586117] INFO -- : make[2]: 'ruby' is up to date. I, [2024-04-20T07:03:44.361534 #586117] INFO -- : make[2]: Leaving directory '/tmp/ruby/build/trunk' I, [2024-04-20T07:03:44.363350 #586117] INFO -- : make[1]: Leaving directory '/tmp/ruby/build/trunk' I, [2024-04-20T07:03:44.396124 #586117] INFO -- : make[1]: Entering directory '/tmp/ruby/build/trunk' I, [2024-04-20T07:03:44.396352 #586117] INFO -- : make[1]: Nothing to be done for 'note'. I, [2024-04-20T07:03:44.396515 #586117] INFO -- : make[1]: Leaving directory '/tmp/ruby/build/trunk' E, [2024-04-20T07:03:45.030278 #586117] ERROR -- : $ /tmp/ruby/build/trunk/miniruby -I/tmp/ruby/src/trunk/lib /tmp/ruby/src/trunk/tool/runruby.rb --archdir=/tmp/ruby/build/trunk --extout=.ext -- /tmp/ruby/src/trunk/spec/mspec/bin/mspec-run -B /tmp/ruby/src/trunk/spec/default.mspec --error-output stderr --debug -fy -o /tmp/rubytest.20240420-671439-wml44/1-mspec-multi-0 E, [2024-04-20T07:03:45.031784 #586117] ERROR -- : $ /tmp/ruby/build/trunk/miniruby -I/tmp/ruby/src/trunk/lib /tmp/ruby/src/trunk/tool/runruby.rb --archdir=/tmp/ruby/build/trunk --extout=.ext -- /tmp/ruby/src/trunk/spec/mspec/bin/mspec-run -B /tmp/ruby/src/trunk/spec/default.mspec --error-output stderr --debug -fy -o /tmp/rubytest.20240420-671439-wml44/2-mspec-multi-1 E, [2024-04-20T07:03:45.033235 #586117] ERROR -- : $ /tmp/ruby/build/trunk/miniruby -I/tmp/ruby/src/trunk/lib /tmp/ruby/src/trunk/tool/runruby.rb --archdir=/tmp/ruby/build/trunk --extout=.ext -- /tmp/ruby/src/trunk/spec/mspec/bin/mspec-run -B /tmp/ruby/src/trunk/spec/default.mspec --error-output stderr --debug -fy -o /tmp/rubytest.20240420-671439-wml44/3-mspec-multi-2 E, [2024-04-20T07:03:45.034855 #586117] ERROR -- : $ /tmp/ruby/build/trunk/miniruby -I/tmp/ruby/src/trunk/lib /tmp/ruby/src/trunk/tool/runruby.rb --archdir=/tmp/ruby/build/trunk --extout=.ext -- /tmp/ruby/src/trunk/spec/mspec/bin/mspec-run -B /tmp/ruby/src/trunk/spec/default.mspec --error-output stderr --debug -fy -o /tmp/rubytest.20240420-671439-wml44/4-mspec-multi-3 I, [2024-04-20T07:03:46.038941 #586117] INFO -- : ruby 3.4.0dev (2024-04-20T02:34:52Z master 9f9755664d) [riscv64-linux] I, [2024-04-20T07:04:16.249667 #586117] INFO -- : 0 ......................................................................... I, [2024-04-20T07:04:27.448290 #586117] INFO -- : 73 ......................................................................... I, [2024-04-20T07:04:28.766608 #586117] INFO -- : 146 ......................................................................... I, [2024-04-20T07:04:30.841333 #586117] INFO -- : 219 ......................................................................... I, [2024-04-20T07:04:31.563333 #586117] INFO -- : 292 ......................................................................... I, [2024-04-20T07:04:32.605741 #586117] INFO -- : 365 ......................................................................... I, [2024-04-20T07:04:33.305513 #586117] INFO -- : 438 ......................................................................... I, [2024-04-20T07:04:33.678790 #586117] INFO -- : 511 ......................................................................... I, [2024-04-20T07:04:34.012727 #586117] INFO -- : 584 ......................................................................... I, [2024-04-20T07:04:36.949444 #586117] INFO -- : 657 ......................................................................... I, [2024-04-20T07:04:37.507557 #586117] INFO -- : 730 ......................................................................... I, [2024-04-20T07:04:37.782635 #586117] INFO -- : 803 ......................................................................... I, [2024-04-20T07:04:38.776581 #586117] INFO -- : 876 ......................................................................... I, [2024-04-20T07:04:39.405793 #586117] INFO -- : 949 ......................................................................... I, [2024-04-20T07:04:42.180533 #586117] INFO -- : 1022 ......................................................................... I, [2024-04-20T07:04:53.442524 #586117] INFO -- : 1095 ......................................................................... I, [2024-04-20T07:04:58.986829 #586117] INFO -- : 1168 ......................................................................... I, [2024-04-20T07:04:59.975579 #586117] INFO -- : 1241 ......................................................................... I, [2024-04-20T07:05:00.914147 #586117] INFO -- : 1314 ......................................................................... I, [2024-04-20T07:05:01.221465 #586117] INFO -- : 1387 ......................................................................... I, [2024-04-20T07:05:07.271580 #586117] INFO -- : 1460 ......................................................................... I, [2024-04-20T07:05:24.076988 #586117] INFO -- : 1533 ......................................................................... I, [2024-04-20T07:05:26.436732 #586117] INFO -- : 1606 ......................................................................... I, [2024-04-20T07:05:29.398282 #586117] INFO -- : 1679 ......................................................................... I, [2024-04-20T07:05:31.771431 #586117] INFO -- : 1752 ......................................................................... I, [2024-04-20T07:05:33.855983 #586117] INFO -- : 1825 ......................................................................... I, [2024-04-20T07:05:35.947985 #586117] INFO -- : 1898 ......................................................................... I, [2024-04-20T07:05:37.684555 #586117] INFO -- : 1971 ......................................................................... I, [2024-04-20T07:05:39.614248 #586117] INFO -- : 2044 ......................................................................... I, [2024-04-20T07:05:40.791977 #586117] INFO -- : 2117 ......................................................................... I, [2024-04-20T07:05:41.347594 #586117] INFO -- : 2190 ......................................................................... I, [2024-04-20T07:05:41.610345 #586117] INFO -- : 2263 ......................................................................... I, [2024-04-20T07:05:41.876238 #586117] INFO -- : 2336 ......................................................................... I, [2024-04-20T07:05:42.443426 #586117] INFO -- : 2409 ......................................................................... I, [2024-04-20T07:05:43.531905 #586117] INFO -- : 2482 ......................................................................... I, [2024-04-20T07:05:44.233887 #586117] INFO -- : 2555 ......................................................................... I, [2024-04-20T07:05:47.419960 #586117] INFO -- : 2628 ......................................................................... I, [2024-04-20T07:05:49.222093 #586117] INFO -- : 2701 ......................................................................... I, [2024-04-20T07:05:49.888892 #586117] INFO -- : 2774 ......................................................................... I, [2024-04-20T07:05:51.240407 #586117] INFO -- : 2847 ......................................................................... I, [2024-04-20T07:05:52.385738 #586117] INFO -- : 2920 ......................................................................... I, [2024-04-20T07:05:53.092759 #586117] INFO -- : 2993 ......................................................................... I, [2024-04-20T07:05:53.485821 #586117] INFO -- : 3066 ......................................................................... I, [2024-04-20T07:05:53.736343 #586117] INFO -- : 3139 ......................................................................... I, [2024-04-20T07:05:53.982562 #586117] INFO -- : 3212 ......................................................................... I, [2024-04-20T07:05:54.377306 #586117] INFO -- : 3285 ......................................................................... I, [2024-04-20T07:06:00.709997 #586117] INFO -- : 3358 ........................................................................ I, [2024-04-20T07:06:00.710250 #586117] INFO -- : I, [2024-04-20T07:06:00.710358 #586117] INFO -- : Finished in 135.678190 seconds I, [2024-04-20T07:06:00.710459 #586117] INFO -- : I, [2024-04-20T07:06:00.710591 #586117] INFO -- : 3429 files, 32607 examples, 133292 expectations, 0 failures, 0 errors, 0 tagged I, [2024-04-20T07:06:00.723375 #586117] INFO -- : $$$[end] "make yes-test-rubyspec MSPECOPT='--error-output stderr --debug -j' TESTS='-j4'" exit with 0.