# Logfile created on 2024-04-20 05:38:35 +0000 by logger.rb/v1.5.0 I, [2024-04-20T05:38:35.958667 #295148] INFO -- : #, @formatter=nil, @logdev=#, @binmode=false, @mon_data=#, @mon_data_owner_object_id=860>>> I, [2024-04-20T05:38:35.960559 #295148] INFO -- : $$$[beg] make update-unicode -j4 I, [2024-04-20T05:38:36.498122 #295148] INFO -- : Downloading Unicode emoji 15.0 files... I, [2024-04-20T05:38:36.498962 #295148] INFO -- : Downloading Unicode emoji 15.0 files... I, [2024-04-20T05:38:36.499787 #295148] INFO -- : Downloading Unicode emoji 15.0 files... I, [2024-04-20T05:38:37.124305 #295148] INFO -- : made symlink emoji/15.0/emoji-sequences.txt to /tmp/ruby/src/trunk/.downloaded-cache/emoji/15.0/emoji-sequences.txt I, [2024-04-20T05:38:37.132386 #295148] INFO -- : downloading emoji/15.0/emoji-test.txt ... /tmp/ruby/src/trunk/enc/unicode/data/emoji/15.0/emoji-sequences.txt already exists I, [2024-04-20T05:38:37.148520 #295148] INFO -- : downloading emoji/15.0/emoji-test.txt ... /tmp/ruby/src/trunk/enc/unicode/data/emoji/15.0/emoji-sequences.txt already exists E, [2024-04-20T05:38:37.855379 #295148] ERROR -- : /tmp/ruby/src/trunk/tool/downloader.rb:302:in `rescue in download': failed to download emoji/15.0/emoji-test.txt (RuntimeError) E, [2024-04-20T05:38:37.855903 #295148] ERROR -- : OpenURI::HTTPError: 403 Forbidden: https://www.unicode.org/Public/emoji/15.0/emoji-test.txt E, [2024-04-20T05:38:37.856285 #295148] ERROR -- : from /tmp/ruby/src/trunk/tool/downloader.rb:201:in `download' E, [2024-04-20T05:38:37.857068 #295148] ERROR -- : from /tmp/ruby/src/trunk/tool/downloader.rb:136:in `download' E, [2024-04-20T05:38:37.857687 #295148] ERROR -- : from /tmp/ruby/src/trunk/tool/downloader.rb:482:in `block in
' E, [2024-04-20T05:38:37.857908 #295148] ERROR -- : from /tmp/ruby/src/trunk/tool/downloader.rb:465:in `each' E, [2024-04-20T05:38:37.858104 #295148] ERROR -- : from /tmp/ruby/src/trunk/tool/downloader.rb:465:in `
' E, [2024-04-20T05:38:37.858290 #295148] ERROR -- : /usr/lib/ruby/3.1.0/open-uri.rb:364:in `open_http': 403 Forbidden (OpenURI::HTTPError) E, [2024-04-20T05:38:37.858483 #295148] ERROR -- : from /usr/lib/ruby/3.1.0/open-uri.rb:741:in `buffer_open' E, [2024-04-20T05:38:37.858706 #295148] ERROR -- : from /usr/lib/ruby/3.1.0/open-uri.rb:212:in `block in open_loop' E, [2024-04-20T05:38:37.858911 #295148] ERROR -- : from /usr/lib/ruby/3.1.0/open-uri.rb:210:in `catch' E, [2024-04-20T05:38:37.859252 #295148] ERROR -- : from /usr/lib/ruby/3.1.0/open-uri.rb:210:in `open_loop' E, [2024-04-20T05:38:37.859382 #295148] ERROR -- : from /usr/lib/ruby/3.1.0/open-uri.rb:151:in `open_uri' E, [2024-04-20T05:38:37.859500 #295148] ERROR -- : from /usr/lib/ruby/3.1.0/open-uri.rb:721:in `open' E, [2024-04-20T05:38:37.859617 #295148] ERROR -- : from /usr/lib/ruby/3.1.0/open-uri.rb:729:in `read' E, [2024-04-20T05:38:37.860002 #295148] ERROR -- : from /tmp/ruby/src/trunk/tool/downloader.rb:247:in `block in download' E, [2024-04-20T05:38:37.860240 #295148] ERROR -- : from /tmp/ruby/src/trunk/tool/downloader.rb:378:in `with_retry' E, [2024-04-20T05:38:37.860346 #295148] ERROR -- : from /tmp/ruby/src/trunk/tool/downloader.rb:246:in `download' E, [2024-04-20T05:38:37.860553 #295148] ERROR -- : from /tmp/ruby/src/trunk/tool/downloader.rb:136:in `download' E, [2024-04-20T05:38:37.860677 #295148] ERROR -- : from /tmp/ruby/src/trunk/tool/downloader.rb:482:in `block in
' E, [2024-04-20T05:38:37.860786 #295148] ERROR -- : from /tmp/ruby/src/trunk/tool/downloader.rb:465:in `each' E, [2024-04-20T05:38:37.860890 #295148] ERROR -- : from /tmp/ruby/src/trunk/tool/downloader.rb:465:in `
' E, [2024-04-20T05:38:37.861020 #295148] ERROR -- : /tmp/ruby/src/trunk/tool/downloader.rb:302:in `rescue in download': failed to download emoji/15.0/emoji-test.txt (RuntimeError) E, [2024-04-20T05:38:37.861136 #295148] ERROR -- : OpenURI::HTTPError: 403 Forbidden: https://www.unicode.org/Public/emoji/15.0/emoji-test.txt E, [2024-04-20T05:38:37.861241 #295148] ERROR -- : from /tmp/ruby/src/trunk/tool/downloader.rb:201:in `download' E, [2024-04-20T05:38:37.861361 #295148] ERROR -- : from /tmp/ruby/src/trunk/tool/downloader.rb:136:in `download' E, [2024-04-20T05:38:37.861470 #295148] ERROR -- : from /tmp/ruby/src/trunk/tool/downloader.rb:482:in `block in
' E, [2024-04-20T05:38:37.861580 #295148] ERROR -- : from /tmp/ruby/src/trunk/tool/downloader.rb:465:in `each' E, [2024-04-20T05:38:37.861685 #295148] ERROR -- : from /tmp/ruby/src/trunk/tool/downloader.rb:465:in `
' E, [2024-04-20T05:38:37.861788 #295148] ERROR -- : /usr/lib/ruby/3.1.0/open-uri.rb:364:in `open_http': 403 Forbidden (OpenURI::HTTPError) E, [2024-04-20T05:38:37.861892 #295148] ERROR -- : from /usr/lib/ruby/3.1.0/open-uri.rb:741:in `buffer_open' E, [2024-04-20T05:38:37.861994 #295148] ERROR -- : from /usr/lib/ruby/3.1.0/open-uri.rb:212:in `block in open_loop' E, [2024-04-20T05:38:37.862097 #295148] ERROR -- : from /usr/lib/ruby/3.1.0/open-uri.rb:210:in `catch' E, [2024-04-20T05:38:37.862216 #295148] ERROR -- : from /usr/lib/ruby/3.1.0/open-uri.rb:210:in `open_loop' E, [2024-04-20T05:38:37.862324 #295148] ERROR -- : from /usr/lib/ruby/3.1.0/open-uri.rb:151:in `open_uri' E, [2024-04-20T05:38:37.862425 #295148] ERROR -- : from /usr/lib/ruby/3.1.0/open-uri.rb:721:in `open' E, [2024-04-20T05:38:37.862527 #295148] ERROR -- : from /usr/lib/ruby/3.1.0/open-uri.rb:729:in `read' E, [2024-04-20T05:38:37.862629 #295148] ERROR -- : from /tmp/ruby/src/trunk/tool/downloader.rb:247:in `block in download' E, [2024-04-20T05:38:37.862734 #295148] ERROR -- : from /tmp/ruby/src/trunk/tool/downloader.rb:378:in `with_retry' E, [2024-04-20T05:38:37.862837 #295148] ERROR -- : from /tmp/ruby/src/trunk/tool/downloader.rb:246:in `download' E, [2024-04-20T05:38:37.862952 #295148] ERROR -- : from /tmp/ruby/src/trunk/tool/downloader.rb:136:in `download' E, [2024-04-20T05:38:37.863066 #295148] ERROR -- : from /tmp/ruby/src/trunk/tool/downloader.rb:482:in `block in
' E, [2024-04-20T05:38:37.863196 #295148] ERROR -- : from /tmp/ruby/src/trunk/tool/downloader.rb:465:in `each' E, [2024-04-20T05:38:37.863304 #295148] ERROR -- : from /tmp/ruby/src/trunk/tool/downloader.rb:465:in `
' E, [2024-04-20T05:38:37.880481 #295148] ERROR -- : make: *** [uncommon.mk:1782: /tmp/ruby/src/trunk/enc/unicode/data/emoji/15.0/emoji-sequences.txt] Error 1 E, [2024-04-20T05:38:37.880677 #295148] ERROR -- : make: *** Deleting file '/tmp/ruby/src/trunk/enc/unicode/data/emoji/15.0/emoji-sequences.txt' E, [2024-04-20T05:38:37.880765 #295148] ERROR -- : make: *** Waiting for unfinished jobs.... E, [2024-04-20T05:38:37.881843 #295148] ERROR -- : make: *** [uncommon.mk:1782: /tmp/ruby/src/trunk/enc/unicode/data/emoji/15.0/emoji-test.txt] Error 1 E, [2024-04-20T05:38:37.892913 #295148] ERROR -- : /tmp/ruby/src/trunk/tool/downloader.rb:302:in `rescue in download': failed to download emoji/15.0/emoji-test.txt (RuntimeError) E, [2024-04-20T05:38:37.893256 #295148] ERROR -- : OpenURI::HTTPError: 403 Forbidden: https://www.unicode.org/Public/emoji/15.0/emoji-test.txt E, [2024-04-20T05:38:37.893455 #295148] ERROR -- : from /tmp/ruby/src/trunk/tool/downloader.rb:201:in `download' E, [2024-04-20T05:38:37.893640 #295148] ERROR -- : from /tmp/ruby/src/trunk/tool/downloader.rb:136:in `download' E, [2024-04-20T05:38:37.893822 #295148] ERROR -- : from /tmp/ruby/src/trunk/tool/downloader.rb:482:in `block in
' E, [2024-04-20T05:38:37.894004 #295148] ERROR -- : from /tmp/ruby/src/trunk/tool/downloader.rb:465:in `each' E, [2024-04-20T05:38:37.894187 #295148] ERROR -- : from /tmp/ruby/src/trunk/tool/downloader.rb:465:in `
' E, [2024-04-20T05:38:37.894372 #295148] ERROR -- : /usr/lib/ruby/3.1.0/open-uri.rb:364:in `open_http': 403 Forbidden (OpenURI::HTTPError) E, [2024-04-20T05:38:37.894829 #295148] ERROR -- : from /usr/lib/ruby/3.1.0/open-uri.rb:741:in `buffer_open' E, [2024-04-20T05:38:37.895324 #295148] ERROR -- : from /usr/lib/ruby/3.1.0/open-uri.rb:212:in `block in open_loop' E, [2024-04-20T05:38:37.895537 #295148] ERROR -- : from /usr/lib/ruby/3.1.0/open-uri.rb:210:in `catch' E, [2024-04-20T05:38:37.895712 #295148] ERROR -- : from /usr/lib/ruby/3.1.0/open-uri.rb:210:in `open_loop' E, [2024-04-20T05:38:37.895883 #295148] ERROR -- : from /usr/lib/ruby/3.1.0/open-uri.rb:151:in `open_uri' E, [2024-04-20T05:38:37.896053 #295148] ERROR -- : from /usr/lib/ruby/3.1.0/open-uri.rb:721:in `open' E, [2024-04-20T05:38:37.896220 #295148] ERROR -- : from /usr/lib/ruby/3.1.0/open-uri.rb:729:in `read' E, [2024-04-20T05:38:37.896393 #295148] ERROR -- : from /tmp/ruby/src/trunk/tool/downloader.rb:247:in `block in download' E, [2024-04-20T05:38:37.896751 #295148] ERROR -- : from /tmp/ruby/src/trunk/tool/downloader.rb:378:in `with_retry' E, [2024-04-20T05:38:37.896956 #295148] ERROR -- : from /tmp/ruby/src/trunk/tool/downloader.rb:246:in `download' E, [2024-04-20T05:38:37.897131 #295148] ERROR -- : from /tmp/ruby/src/trunk/tool/downloader.rb:136:in `download' E, [2024-04-20T05:38:37.897307 #295148] ERROR -- : from /tmp/ruby/src/trunk/tool/downloader.rb:482:in `block in
' E, [2024-04-20T05:38:37.897487 #295148] ERROR -- : from /tmp/ruby/src/trunk/tool/downloader.rb:465:in `each' E, [2024-04-20T05:38:37.897662 #295148] ERROR -- : from /tmp/ruby/src/trunk/tool/downloader.rb:465:in `
' E, [2024-04-20T05:38:37.923924 #295148] ERROR -- : make: *** [uncommon.mk:1782: /tmp/ruby/src/trunk/enc/unicode/data/emoji/15.0/emoji-zwj-sequences.txt] Error 1 I, [2024-04-20T05:38:37.924110 #295148] INFO -- : downloading emoji/15.0/emoji-test.txt ... I, [2024-04-20T05:38:37.925529 #295148] INFO -- : $$$[end] "make update-unicode -j4" exit with 512. I, [2024-04-20T05:38:37.925744 #295148] INFO -- : $$$[beg] make update-download -j4 I, [2024-04-20T05:38:39.084555 #295148] INFO -- : tool/config.guess already exists I, [2024-04-20T05:38:39.085344 #295148] INFO -- : tool/config.sub already exists I, [2024-04-20T05:38:39.103647 #295148] INFO -- : Update minitest to ea9caafc0754b1d6236a490d59e624b53209734a I, [2024-04-20T05:38:39.104493 #295148] INFO -- : Update power_assert to 84e85124c5014a139af39161d484156cfe87a9ed I, [2024-04-20T05:38:39.106475 #295148] INFO -- : Update rbs to ba7872795d5de04adb8ff500c0e6afdc81a041dd I, [2024-04-20T05:38:39.107049 #295148] INFO -- : Update typeprof to b19a6416da3a05d57fadd6ffdadb382b6d236ca5 I, [2024-04-20T05:38:39.112031 #295148] INFO -- : echo ea9caafc0754b1d6236a490d59e624b53209734a | /bin/sh /tmp/ruby/src/trunk/tool/ifchange /tmp/ruby/src/trunk/.bundle/.timestamp/minitest.revision - I, [2024-04-20T05:38:39.113371 #295148] INFO -- : echo 84e85124c5014a139af39161d484156cfe87a9ed | /bin/sh /tmp/ruby/src/trunk/tool/ifchange /tmp/ruby/src/trunk/.bundle/.timestamp/power_assert.revision - I, [2024-04-20T05:38:39.117085 #295148] INFO -- : echo ba7872795d5de04adb8ff500c0e6afdc81a041dd | /bin/sh /tmp/ruby/src/trunk/tool/ifchange /tmp/ruby/src/trunk/.bundle/.timestamp/rbs.revision - I, [2024-04-20T05:38:39.117912 #295148] INFO -- : echo b19a6416da3a05d57fadd6ffdadb382b6d236ca5 | /bin/sh /tmp/ruby/src/trunk/tool/ifchange /tmp/ruby/src/trunk/.bundle/.timestamp/typeprof.revision - I, [2024-04-20T05:38:39.125267 #295148] INFO -- : /tmp/ruby/src/trunk/.bundle/.timestamp/minitest.revision unchanged I, [2024-04-20T05:38:39.128539 #295148] INFO -- : /tmp/ruby/src/trunk/.bundle/.timestamp/power_assert.revision unchanged I, [2024-04-20T05:38:39.129151 #295148] INFO -- : /tmp/ruby/src/trunk/.bundle/.timestamp/rbs.revision unchanged I, [2024-04-20T05:38:39.130133 #295148] INFO -- : /tmp/ruby/src/trunk/.bundle/.timestamp/typeprof.revision unchanged I, [2024-04-20T05:38:39.945569 #295148] INFO -- : Building power_assert@84e85124c5014a139af39161d484156cfe87a9ed to /tmp/ruby/src/trunk/gems/power_assert-2.0.3.gem I, [2024-04-20T05:38:40.930582 #295148] INFO -- : Successfully built RubyGem I, [2024-04-20T05:38:40.930786 #295148] INFO -- : Name: power_assert I, [2024-04-20T05:38:40.930899 #295148] INFO -- : Version: 2.0.4dev I, [2024-04-20T05:38:40.930984 #295148] INFO -- : File: power_assert-2.0.4dev.gem I, [2024-04-20T05:38:41.588880 #295148] INFO -- : $$$[end] "make update-download -j4" exit with 0. I, [2024-04-20T05:38:41.589119 #295148] INFO -- : $$$[beg] make update-rubyspec -j4 I, [2024-04-20T05:38:42.121808 #295148] INFO -- : make: Nothing to be done for 'update-rubyspec'. I, [2024-04-20T05:38:42.123632 #295148] INFO -- : $$$[end] "make update-rubyspec -j4" exit with 0. I, [2024-04-20T05:38:42.123843 #295148] INFO -- : $$$[beg] make update-src -j4 I, [2024-04-20T05:38:43.552296 #295148] INFO -- : Already up to date. I, [2024-04-20T05:38:43.617067 #295148] INFO -- : Latest commit hash = 9f9755664d I, [2024-04-20T05:38:43.623564 #295148] INFO -- : $$$[end] "make update-src -j4" exit with 0. I, [2024-04-20T05:38:43.623823 #295148] INFO -- : $$$[beg] make after-update -j4 I, [2024-04-20T05:38:44.479053 #295148] INFO -- : /tmp/ruby/src/trunk/revision.h updated I, [2024-04-20T05:38:44.489585 #295148] INFO -- : generating riscv64-linux-fake.rb I, [2024-04-20T05:38:44.991592 #295148] INFO -- : riscv64-linux-fake.rb updated I, [2024-04-20T05:38:44.997948 #295148] INFO -- : generating enc.mk I, [2024-04-20T05:38:46.454158 #295148] INFO -- : making srcs under enc I, [2024-04-20T05:38:46.749093 #295148] INFO -- : make[1]: Entering directory '/tmp/ruby/build/trunk' I, [2024-04-20T05:38:46.749302 #295148] INFO -- : make[1]: Nothing to be done for 'srcs'. I, [2024-04-20T05:38:46.749404 #295148] INFO -- : make[1]: Leaving directory '/tmp/ruby/build/trunk' I, [2024-04-20T05:38:47.443768 #295148] INFO -- : Update minitest to ea9caafc0754b1d6236a490d59e624b53209734a I, [2024-04-20T05:38:47.444799 #295148] INFO -- : Update power_assert to 84e85124c5014a139af39161d484156cfe87a9ed I, [2024-04-20T05:38:47.445611 #295148] INFO -- : Update rbs to ba7872795d5de04adb8ff500c0e6afdc81a041dd I, [2024-04-20T05:38:47.448867 #295148] INFO -- : Update typeprof to b19a6416da3a05d57fadd6ffdadb382b6d236ca5 I, [2024-04-20T05:38:47.455686 #295148] INFO -- : echo 84e85124c5014a139af39161d484156cfe87a9ed | /bin/sh /tmp/ruby/src/trunk/tool/ifchange /tmp/ruby/src/trunk/.bundle/.timestamp/power_assert.revision - I, [2024-04-20T05:38:47.456235 #295148] INFO -- : echo ea9caafc0754b1d6236a490d59e624b53209734a | /bin/sh /tmp/ruby/src/trunk/tool/ifchange /tmp/ruby/src/trunk/.bundle/.timestamp/minitest.revision - I, [2024-04-20T05:38:47.456850 #295148] INFO -- : echo ba7872795d5de04adb8ff500c0e6afdc81a041dd | /bin/sh /tmp/ruby/src/trunk/tool/ifchange /tmp/ruby/src/trunk/.bundle/.timestamp/rbs.revision - I, [2024-04-20T05:38:47.465549 #295148] INFO -- : echo b19a6416da3a05d57fadd6ffdadb382b6d236ca5 | /bin/sh /tmp/ruby/src/trunk/tool/ifchange /tmp/ruby/src/trunk/.bundle/.timestamp/typeprof.revision - I, [2024-04-20T05:38:47.466728 #295148] INFO -- : /tmp/ruby/src/trunk/.bundle/.timestamp/minitest.revision unchanged I, [2024-04-20T05:38:47.467419 #295148] INFO -- : /tmp/ruby/src/trunk/.bundle/.timestamp/power_assert.revision unchanged I, [2024-04-20T05:38:47.469933 #295148] INFO -- : /tmp/ruby/src/trunk/.bundle/.timestamp/rbs.revision unchanged I, [2024-04-20T05:38:47.477010 #295148] INFO -- : /tmp/ruby/src/trunk/.bundle/.timestamp/typeprof.revision unchanged I, [2024-04-20T05:38:48.289229 #295148] INFO -- : Building power_assert@84e85124c5014a139af39161d484156cfe87a9ed to /tmp/ruby/src/trunk/gems/power_assert-2.0.3.gem I, [2024-04-20T05:38:49.291786 #295148] INFO -- : Successfully built RubyGem I, [2024-04-20T05:38:49.291990 #295148] INFO -- : Name: power_assert I, [2024-04-20T05:38:49.292081 #295148] INFO -- : Version: 2.0.4dev I, [2024-04-20T05:38:49.296980 #295148] INFO -- : File: power_assert-2.0.4dev.gem I, [2024-04-20T05:38:49.307923 #295148] INFO -- : Extracting bundle gem power_assert-2.0.3... I, [2024-04-20T05:38:50.168703 #295148] INFO -- : Try with hash version of bundled gems instead of gems/power_assert-2.0.3.gem. We don't use this gem with release version of Ruby. I, [2024-04-20T05:38:50.223211 #295148] INFO -- : Unpacked gems/power_assert-2.0.4dev.gem I, [2024-04-20T05:38:50.238160 #295148] INFO -- : $$$[end] "make after-update -j4" exit with 0. I, [2024-04-20T05:38:50.238928 #295148] INFO -- : $$$[beg] make miniruby -j4 I, [2024-04-20T05:38:50.761760 #295148] INFO -- : BASERUBY = /usr/bin/ruby --disable=gems I, [2024-04-20T05:38:50.762011 #295148] INFO -- : CC = gcc I, [2024-04-20T05:38:50.762132 #295148] INFO -- : LD = ld I, [2024-04-20T05:38:50.762268 #295148] INFO -- : LDSHARED = gcc -shared I, [2024-04-20T05:38:50.762384 #295148] INFO -- : CFLAGS = -O3 -fno-fast-math -ggdb3 -Wall -Wextra -Wdeprecated-declarations -Wdiv-by-zero -Wduplicated-cond -Wimplicit-function-declaration -Wimplicit-int -Wpointer-arith -Wwrite-strings -Wold-style-definition -Wimplicit-fallthrough=0 -Wmissing-noreturn -Wno-cast-function-type -Wno-constant-logical-operand -Wno-long-long -Wno-missing-field-initializers -Wno-overlength-strings -Wno-packed-bitfield-compat -Wno-parentheses-equality -Wno-self-assign -Wno-tautological-compare -Wno-unused-parameter -Wno-unused-value -Wsuggest-attribute=format -Wsuggest-attribute=noreturn -Wunused-variable -Wmisleading-indentation -Wundef -fPIC I, [2024-04-20T05:38:50.762501 #295148] INFO -- : XCFLAGS = -U_FORTIFY_SOURCE -D_FORTIFY_SOURCE=2 -fstack-protector-strong -fno-strict-overflow -fvisibility=hidden -fexcess-precision=standard -DRUBY_EXPORT -I. -I.ext/include/riscv64-linux -I/tmp/ruby/src/trunk/include -I/tmp/ruby/src/trunk -I/tmp/ruby/src/trunk/prism -I/tmp/ruby/src/trunk/enc/unicode/15.0.0 I, [2024-04-20T05:38:50.762633 #295148] INFO -- : CPPFLAGS = I, [2024-04-20T05:38:50.762751 #295148] INFO -- : DLDFLAGS = -Wl,--compress-debug-sections=zlib -Wl,-soname,libruby.so.3.4 -fstack-protector-strong I, [2024-04-20T05:38:50.762857 #295148] INFO -- : SOLIBS = -lz -lrt -lrt -lgmp -ldl -lcrypt -lm -lpthread I, [2024-04-20T05:38:50.762955 #295148] INFO -- : LANG = I, [2024-04-20T05:38:50.763050 #295148] INFO -- : LC_ALL = I, [2024-04-20T05:38:50.763149 #295148] INFO -- : LC_CTYPE = I, [2024-04-20T05:38:50.763254 #295148] INFO -- : MFLAGS = -j4 --jobserver-auth=4,5 I, [2024-04-20T05:38:50.763360 #295148] INFO -- : RUSTC = rustc I, [2024-04-20T05:38:50.763469 #295148] INFO -- : YJIT_RUSTC_ARGS = --crate-name=yjit --crate-type=staticlib --edition=2021 -g -C lto=thin -C opt-level=3 -C overflow-checks=on '--out-dir=/tmp/ruby/build/trunk/yjit/target/release/' /tmp/ruby/src/trunk/yjit/src/lib.rs I, [2024-04-20T05:38:50.776874 #295148] INFO -- : gcc (Debian 13.2.0-4revyos1) 13.2.0 I, [2024-04-20T05:38:50.777061 #295148] INFO -- : Copyright (C) 2023 Free Software Foundation, Inc. I, [2024-04-20T05:38:50.777149 #295148] INFO -- : This is free software; see the source for copying conditions. There is NO I, [2024-04-20T05:38:50.777235 #295148] INFO -- : warranty; not even for MERCHANTABILITY or FITNESS FOR A PARTICULAR PURPOSE. I, [2024-04-20T05:38:50.777318 #295148] INFO -- : I, [2024-04-20T05:38:51.004220 #295148] INFO -- : compiling /tmp/ruby/src/trunk/version.c I, [2024-04-20T05:38:52.182066 #295148] INFO -- : linking miniruby I, [2024-04-20T05:39:33.353421 #295148] INFO -- : $$$[end] "make miniruby -j4" exit with 0. I, [2024-04-20T05:39:33.354062 #295148] INFO -- : $$$[beg] make ruby -j4 I, [2024-04-20T05:39:33.872411 #295148] INFO -- : BASERUBY = /usr/bin/ruby --disable=gems I, [2024-04-20T05:39:33.872800 #295148] INFO -- : CC = gcc I, [2024-04-20T05:39:33.873002 #295148] INFO -- : LD = ld I, [2024-04-20T05:39:33.873215 #295148] INFO -- : LDSHARED = gcc -shared I, [2024-04-20T05:39:33.873432 #295148] INFO -- : CFLAGS = -O3 -fno-fast-math -ggdb3 -Wall -Wextra -Wdeprecated-declarations -Wdiv-by-zero -Wduplicated-cond -Wimplicit-function-declaration -Wimplicit-int -Wpointer-arith -Wwrite-strings -Wold-style-definition -Wimplicit-fallthrough=0 -Wmissing-noreturn -Wno-cast-function-type -Wno-constant-logical-operand -Wno-long-long -Wno-missing-field-initializers -Wno-overlength-strings -Wno-packed-bitfield-compat -Wno-parentheses-equality -Wno-self-assign -Wno-tautological-compare -Wno-unused-parameter -Wno-unused-value -Wsuggest-attribute=format -Wsuggest-attribute=noreturn -Wunused-variable -Wmisleading-indentation -Wundef -fPIC I, [2024-04-20T05:39:33.873640 #295148] INFO -- : XCFLAGS = -U_FORTIFY_SOURCE -D_FORTIFY_SOURCE=2 -fstack-protector-strong -fno-strict-overflow -fvisibility=hidden -fexcess-precision=standard -DRUBY_EXPORT -I. -I.ext/include/riscv64-linux -I/tmp/ruby/src/trunk/include -I/tmp/ruby/src/trunk -I/tmp/ruby/src/trunk/prism -I/tmp/ruby/src/trunk/enc/unicode/15.0.0 I, [2024-04-20T05:39:33.873815 #295148] INFO -- : CPPFLAGS = I, [2024-04-20T05:39:33.873989 #295148] INFO -- : DLDFLAGS = -Wl,--compress-debug-sections=zlib -Wl,-soname,libruby.so.3.4 -fstack-protector-strong I, [2024-04-20T05:39:33.874180 #295148] INFO -- : SOLIBS = -lz -lrt -lrt -lgmp -ldl -lcrypt -lm -lpthread I, [2024-04-20T05:39:33.874371 #295148] INFO -- : LANG = I, [2024-04-20T05:39:33.874545 #295148] INFO -- : LC_ALL = I, [2024-04-20T05:39:33.874715 #295148] INFO -- : LC_CTYPE = I, [2024-04-20T05:39:33.874881 #295148] INFO -- : MFLAGS = -j4 --jobserver-auth=4,5 I, [2024-04-20T05:39:33.875045 #295148] INFO -- : RUSTC = rustc I, [2024-04-20T05:39:33.875238 #295148] INFO -- : YJIT_RUSTC_ARGS = --crate-name=yjit --crate-type=staticlib --edition=2021 -g -C lto=thin -C opt-level=3 -C overflow-checks=on '--out-dir=/tmp/ruby/build/trunk/yjit/target/release/' /tmp/ruby/src/trunk/yjit/src/lib.rs I, [2024-04-20T05:39:33.887691 #295148] INFO -- : gcc (Debian 13.2.0-4revyos1) 13.2.0 I, [2024-04-20T05:39:33.887906 #295148] INFO -- : Copyright (C) 2023 Free Software Foundation, Inc. I, [2024-04-20T05:39:33.888017 #295148] INFO -- : This is free software; see the source for copying conditions. There is NO I, [2024-04-20T05:39:33.888124 #295148] INFO -- : warranty; not even for MERCHANTABILITY or FITNESS FOR A PARTICULAR PURPOSE. I, [2024-04-20T05:39:33.888229 #295148] INFO -- : I, [2024-04-20T05:39:34.534811 #295148] INFO -- : builtin_binary.inc updated I, [2024-04-20T05:39:34.546577 #295148] INFO -- : 63c4b2d66003409833406b3a662615f9f67397fdf425c22dee41f60d762f36d6 builtin_binary.inc I, [2024-04-20T05:39:34.549563 #295148] INFO -- : compiling /tmp/ruby/src/trunk/builtin.c I, [2024-04-20T05:39:36.161137 #295148] INFO -- : linking static-library libruby-static.a I, [2024-04-20T05:39:43.293001 #295148] INFO -- : linking shared-library libruby.so.3.4.0 I, [2024-04-20T05:40:24.802508 #295148] INFO -- : linking ruby I, [2024-04-20T05:40:25.007452 #295148] INFO -- : $$$[end] "make ruby -j4" exit with 0. I, [2024-04-20T05:40:25.008061 #295148] INFO -- : $$$[beg] make all -j4 I, [2024-04-20T05:40:25.547379 #295148] INFO -- : BASERUBY = /usr/bin/ruby --disable=gems I, [2024-04-20T05:40:25.547715 #295148] INFO -- : CC = gcc I, [2024-04-20T05:40:25.547912 #295148] INFO -- : LD = ld I, [2024-04-20T05:40:25.548109 #295148] INFO -- : LDSHARED = gcc -shared I, [2024-04-20T05:40:25.548327 #295148] INFO -- : CFLAGS = -O3 -fno-fast-math -ggdb3 -Wall -Wextra -Wdeprecated-declarations -Wdiv-by-zero -Wduplicated-cond -Wimplicit-function-declaration -Wimplicit-int -Wpointer-arith -Wwrite-strings -Wold-style-definition -Wimplicit-fallthrough=0 -Wmissing-noreturn -Wno-cast-function-type -Wno-constant-logical-operand -Wno-long-long -Wno-missing-field-initializers -Wno-overlength-strings -Wno-packed-bitfield-compat -Wno-parentheses-equality -Wno-self-assign -Wno-tautological-compare -Wno-unused-parameter -Wno-unused-value -Wsuggest-attribute=format -Wsuggest-attribute=noreturn -Wunused-variable -Wmisleading-indentation -Wundef -fPIC I, [2024-04-20T05:40:25.548805 #295148] INFO -- : XCFLAGS = -U_FORTIFY_SOURCE -D_FORTIFY_SOURCE=2 -fstack-protector-strong -fno-strict-overflow -fvisibility=hidden -fexcess-precision=standard -DRUBY_EXPORT -I. -I.ext/include/riscv64-linux -I/tmp/ruby/src/trunk/include -I/tmp/ruby/src/trunk -I/tmp/ruby/src/trunk/prism -I/tmp/ruby/src/trunk/enc/unicode/15.0.0 I, [2024-04-20T05:40:25.549040 #295148] INFO -- : CPPFLAGS = I, [2024-04-20T05:40:25.549222 #295148] INFO -- : DLDFLAGS = -Wl,--compress-debug-sections=zlib -Wl,-soname,libruby.so.3.4 -fstack-protector-strong I, [2024-04-20T05:40:25.549407 #295148] INFO -- : SOLIBS = -lz -lrt -lrt -lgmp -ldl -lcrypt -lm -lpthread I, [2024-04-20T05:40:25.549586 #295148] INFO -- : LANG = I, [2024-04-20T05:40:25.549756 #295148] INFO -- : LC_ALL = I, [2024-04-20T05:40:25.549919 #295148] INFO -- : LC_CTYPE = I, [2024-04-20T05:40:25.550081 #295148] INFO -- : MFLAGS = -j4 --jobserver-auth=4,5 I, [2024-04-20T05:40:25.550242 #295148] INFO -- : RUSTC = rustc I, [2024-04-20T05:40:25.550434 #295148] INFO -- : YJIT_RUSTC_ARGS = --crate-name=yjit --crate-type=staticlib --edition=2021 -g -C lto=thin -C opt-level=3 -C overflow-checks=on '--out-dir=/tmp/ruby/build/trunk/yjit/target/release/' /tmp/ruby/src/trunk/yjit/src/lib.rs I, [2024-04-20T05:40:25.561350 #295148] INFO -- : gcc (Debian 13.2.0-4revyos1) 13.2.0 I, [2024-04-20T05:40:25.561539 #295148] INFO -- : Copyright (C) 2023 Free Software Foundation, Inc. I, [2024-04-20T05:40:25.561627 #295148] INFO -- : This is free software; see the source for copying conditions. There is NO I, [2024-04-20T05:40:25.561714 #295148] INFO -- : warranty; not even for MERCHANTABILITY or FITNESS FOR A PARTICULAR PURPOSE. I, [2024-04-20T05:40:25.561800 #295148] INFO -- : I, [2024-04-20T05:40:25.870086 #295148] INFO -- : generating enc.mk I, [2024-04-20T05:40:25.886930 #295148] INFO -- : building spec/ruby/optional/capi/ext/array_spec.so I, [2024-04-20T05:40:25.889360 #295148] INFO -- : building spec/ruby/optional/capi/ext/basic_object_spec.so I, [2024-04-20T05:40:25.894170 #295148] INFO -- : building spec/ruby/optional/capi/ext/bignum_spec.so I, [2024-04-20T05:40:26.868448 #295148] INFO -- : building spec/ruby/optional/capi/ext/binding_spec.so I, [2024-04-20T05:40:27.151594 #295148] INFO -- : building spec/ruby/optional/capi/ext/boolean_spec.so I, [2024-04-20T05:40:27.553851 #295148] INFO -- : building spec/ruby/optional/capi/ext/class_id_under_autoload_spec.so I, [2024-04-20T05:40:27.945649 #295148] INFO -- : building spec/ruby/optional/capi/ext/class_spec.so I, [2024-04-20T05:40:28.206662 #295148] INFO -- : building spec/ruby/optional/capi/ext/class_under_autoload_spec.so I, [2024-04-20T05:40:28.312055 #295148] INFO -- : building spec/ruby/optional/capi/ext/complex_spec.so I, [2024-04-20T05:40:28.596830 #295148] INFO -- : building spec/ruby/optional/capi/ext/constants_spec.so I, [2024-04-20T05:40:29.176145 #295148] INFO -- : building spec/ruby/optional/capi/ext/data_spec.so I, [2024-04-20T05:40:29.387465 #295148] INFO -- : building spec/ruby/optional/capi/ext/debug_spec.so I, [2024-04-20T05:40:29.722943 #295148] INFO -- : building spec/ruby/optional/capi/ext/encoding_spec.so I, [2024-04-20T05:40:30.531864 #295148] INFO -- : building spec/ruby/optional/capi/ext/enumerator_spec.so I, [2024-04-20T05:40:30.578199 #295148] INFO -- : building spec/ruby/optional/capi/ext/exception_spec.so I, [2024-04-20T05:40:30.736627 #295148] INFO -- : building spec/ruby/optional/capi/ext/fiber_spec.so I, [2024-04-20T05:40:31.798910 #295148] INFO -- : building spec/ruby/optional/capi/ext/file_spec.so I, [2024-04-20T05:40:31.967120 #295148] INFO -- : building spec/ruby/optional/capi/ext/fixnum_spec.so I, [2024-04-20T05:40:32.042907 #295148] INFO -- : building spec/ruby/optional/capi/ext/float_spec.so I, [2024-04-20T05:40:32.599749 #295148] INFO -- : building spec/ruby/optional/capi/ext/gc_spec.so I, [2024-04-20T05:40:32.886046 #295148] INFO -- : building spec/ruby/optional/capi/ext/globals_spec.so I, [2024-04-20T05:40:33.010174 #295148] INFO -- : building spec/ruby/optional/capi/ext/hash_spec.so I, [2024-04-20T05:40:33.138945 #295148] INFO -- : building spec/ruby/optional/capi/ext/integer_spec.so I, [2024-04-20T05:40:33.971028 #295148] INFO -- : building spec/ruby/optional/capi/ext/io_spec.so I, [2024-04-20T05:40:34.256395 #295148] INFO -- : building spec/ruby/optional/capi/ext/kernel_spec.so I, [2024-04-20T05:40:34.282736 #295148] INFO -- : building spec/ruby/optional/capi/ext/language_spec.so I, [2024-04-20T05:40:34.410776 #295148] INFO -- : building spec/ruby/optional/capi/ext/marshal_spec.so I, [2024-04-20T05:40:35.398428 #295148] INFO -- : building spec/ruby/optional/capi/ext/module_spec.so I, [2024-04-20T05:40:35.444097 #295148] INFO -- : building spec/ruby/optional/capi/ext/module_under_autoload_spec.so I, [2024-04-20T05:40:36.251718 #295148] INFO -- : building spec/ruby/optional/capi/ext/mutex_spec.so I, [2024-04-20T05:40:36.484343 #295148] INFO -- : building spec/ruby/optional/capi/ext/numeric_spec.so I, [2024-04-20T05:40:36.821305 #295148] INFO -- : building spec/ruby/optional/capi/ext/object_spec.so I, [2024-04-20T05:40:37.030204 #295148] INFO -- : building spec/ruby/optional/capi/ext/proc_spec.so I, [2024-04-20T05:40:37.460296 #295148] INFO -- : building spec/ruby/optional/capi/ext/range_spec.so I, [2024-04-20T05:40:38.083712 #295148] INFO -- : building spec/ruby/optional/capi/ext/rational_spec.so I, [2024-04-20T05:40:38.642097 #295148] INFO -- : building spec/ruby/optional/capi/ext/rbasic_spec.so I, [2024-04-20T05:40:38.671581 #295148] INFO -- : building spec/ruby/optional/capi/ext/regexp_spec.so I, [2024-04-20T05:40:39.207044 #295148] INFO -- : building spec/ruby/optional/capi/ext/st_spec.so I, [2024-04-20T05:40:39.577869 #295148] INFO -- : building spec/ruby/optional/capi/ext/string_spec.so I, [2024-04-20T05:40:39.976998 #295148] INFO -- : building spec/ruby/optional/capi/ext/struct_spec.so I, [2024-04-20T05:40:39.997753 #295148] INFO -- : building spec/ruby/optional/capi/ext/symbol_spec.so I, [2024-04-20T05:40:40.375132 #295148] INFO -- : building spec/ruby/optional/capi/ext/thread_spec.so I, [2024-04-20T05:40:41.171872 #295148] INFO -- : building spec/ruby/optional/capi/ext/time_spec.so I, [2024-04-20T05:40:41.549374 #295148] INFO -- : building spec/ruby/optional/capi/ext/tracepoint_spec.so I, [2024-04-20T05:40:41.830247 #295148] INFO -- : building spec/ruby/optional/capi/ext/typed_data_spec.so I, [2024-04-20T05:40:42.631987 #295148] INFO -- : building spec/ruby/optional/capi/ext/util_spec.so I, [2024-04-20T05:40:42.655248 #295148] INFO -- : making enc I, [2024-04-20T05:40:42.859295 #295148] INFO -- : make[1]: Entering directory '/tmp/ruby/build/trunk' I, [2024-04-20T05:40:42.859570 #295148] INFO -- : make[1]: Nothing to be done for 'enc'. I, [2024-04-20T05:40:42.859750 #295148] INFO -- : make[1]: Leaving directory '/tmp/ruby/build/trunk' I, [2024-04-20T05:40:42.866387 #295148] INFO -- : making srcs under enc I, [2024-04-20T05:40:43.218285 #295148] INFO -- : make[1]: Entering directory '/tmp/ruby/build/trunk' I, [2024-04-20T05:40:43.218525 #295148] INFO -- : make[1]: Nothing to be done for 'srcs'. I, [2024-04-20T05:40:43.218671 #295148] INFO -- : make[1]: Leaving directory '/tmp/ruby/build/trunk' I, [2024-04-20T05:40:43.221802 #295148] INFO -- : generating transdb.h I, [2024-04-20T05:40:44.446165 #295148] INFO -- : transdb.h unchanged I, [2024-04-20T05:40:44.452118 #295148] INFO -- : generating makefiles ext/configure-ext.mk I, [2024-04-20T05:40:44.452851 #295148] INFO -- : making trans I, [2024-04-20T05:40:44.642376 #295148] INFO -- : ext/configure-ext.mk updated I, [2024-04-20T05:40:44.653860 #295148] INFO -- : make[1]: Entering directory '/tmp/ruby/build/trunk' I, [2024-04-20T05:40:44.802233 #295148] INFO -- : make[1]: Entering directory '/tmp/ruby/build/trunk' I, [2024-04-20T05:40:44.802455 #295148] INFO -- : make[1]: Nothing to be done for 'trans'. I, [2024-04-20T05:40:44.802582 #295148] INFO -- : make[1]: Leaving directory '/tmp/ruby/build/trunk' I, [2024-04-20T05:40:44.805424 #295148] INFO -- : making encs I, [2024-04-20T05:40:45.221373 #295148] INFO -- : make[1]: Entering directory '/tmp/ruby/build/trunk' I, [2024-04-20T05:40:45.221605 #295148] INFO -- : make[1]: Nothing to be done for 'encs'. I, [2024-04-20T05:40:45.221753 #295148] INFO -- : make[1]: Leaving directory '/tmp/ruby/build/trunk' I, [2024-04-20T05:40:48.140086 #295148] INFO -- : make[1]: Leaving directory '/tmp/ruby/build/trunk' I, [2024-04-20T05:40:48.142247 #295148] INFO -- : generating makefile exts.mk I, [2024-04-20T05:40:48.480810 #295148] INFO -- : exts.mk unchanged I, [2024-04-20T05:40:48.519284 #295148] INFO -- : make[1]: Entering directory '/tmp/ruby/build/trunk' I, [2024-04-20T05:40:49.028165 #295148] INFO -- : make[2]: Entering directory '/tmp/ruby/build/trunk/ext/digest' I, [2024-04-20T05:40:49.034025 #295148] INFO -- : make[2]: Entering directory '/tmp/ruby/build/trunk/ext/coverage' I, [2024-04-20T05:40:49.042328 #295148] INFO -- : make[2]: Entering directory '/tmp/ruby/build/trunk/ext/date' I, [2024-04-20T05:40:49.056774 #295148] INFO -- : make[2]: Leaving directory '/tmp/ruby/build/trunk/ext/coverage' I, [2024-04-20T05:40:49.073313 #295148] INFO -- : make[2]: Leaving directory '/tmp/ruby/build/trunk/ext/date' I, [2024-04-20T05:40:49.085690 #295148] INFO -- : make[2]: Leaving directory '/tmp/ruby/build/trunk/ext/digest' I, [2024-04-20T05:40:49.100938 #295148] INFO -- : make[2]: Entering directory '/tmp/ruby/build/trunk/ext/io/console' I, [2024-04-20T05:40:49.115726 #295148] INFO -- : make[2]: Entering directory '/tmp/ruby/build/trunk/ext/fiddle' I, [2024-04-20T05:40:49.120197 #295148] INFO -- : make[2]: Leaving directory '/tmp/ruby/build/trunk/ext/io/console' I, [2024-04-20T05:40:49.126294 #295148] INFO -- : make[2]: Entering directory '/tmp/ruby/build/trunk/ext/json' I, [2024-04-20T05:40:49.152988 #295148] INFO -- : make[2]: Entering directory '/tmp/ruby/build/trunk/ext/monitor' I, [2024-04-20T05:40:49.160229 #295148] INFO -- : make[2]: Entering directory '/tmp/ruby/build/trunk/ext/objspace' I, [2024-04-20T05:40:49.167621 #295148] INFO -- : make[2]: Leaving directory '/tmp/ruby/build/trunk/ext/monitor' I, [2024-04-20T05:40:49.172027 #295148] INFO -- : make[2]: Leaving directory '/tmp/ruby/build/trunk/ext/json' I, [2024-04-20T05:40:49.188020 #295148] INFO -- : make[2]: Leaving directory '/tmp/ruby/build/trunk/ext/fiddle' I, [2024-04-20T05:40:49.191560 #295148] INFO -- : make[2]: Leaving directory '/tmp/ruby/build/trunk/ext/objspace' I, [2024-04-20T05:40:49.200316 #295148] INFO -- : make[2]: Entering directory '/tmp/ruby/build/trunk/ext/pathname' I, [2024-04-20T05:40:49.219440 #295148] INFO -- : make[2]: Leaving directory '/tmp/ruby/build/trunk/ext/pathname' I, [2024-04-20T05:40:49.219690 #295148] INFO -- : make[2]: Entering directory '/tmp/ruby/build/trunk/ext/pty' I, [2024-04-20T05:40:49.228201 #295148] INFO -- : make[2]: Entering directory '/tmp/ruby/build/trunk/ext/psych' I, [2024-04-20T05:40:49.238231 #295148] INFO -- : make[2]: Leaving directory '/tmp/ruby/build/trunk/ext/pty' I, [2024-04-20T05:40:49.282298 #295148] INFO -- : make[2]: Entering directory '/tmp/ruby/build/trunk/ext/openssl' I, [2024-04-20T05:40:49.292244 #295148] INFO -- : make[2]: Entering directory '/tmp/ruby/build/trunk/ext/ripper' I, [2024-04-20T05:40:49.303861 #295148] INFO -- : make[2]: Entering directory '/tmp/ruby/build/trunk/ext/rubyvm' I, [2024-04-20T05:40:49.331548 #295148] INFO -- : make[2]: Leaving directory '/tmp/ruby/build/trunk/ext/rubyvm' I, [2024-04-20T05:40:49.337875 #295148] INFO -- : make[2]: Leaving directory '/tmp/ruby/build/trunk/ext/ripper' I, [2024-04-20T05:40:49.355995 #295148] INFO -- : make[2]: Leaving directory '/tmp/ruby/build/trunk/ext/psych' I, [2024-04-20T05:40:49.399167 #295148] INFO -- : make[2]: Entering directory '/tmp/ruby/build/trunk/.bundle/gems/bigdecimal-3.1.7/ext/bigdecimal' I, [2024-04-20T05:40:49.408475 #295148] INFO -- : make[2]: Entering directory '/tmp/ruby/build/trunk/ext/socket' I, [2024-04-20T05:40:49.408711 #295148] INFO -- : make[2]: Leaving directory '/tmp/ruby/build/trunk/ext/openssl' I, [2024-04-20T05:40:49.409543 #295148] INFO -- : make[2]: Entering directory '/tmp/ruby/build/trunk/.bundle/gems/debug-1.9.2/ext/debug' I, [2024-04-20T05:40:49.428504 #295148] INFO -- : make[2]: Entering directory '/tmp/ruby/build/trunk/.bundle/gems/nkf-0.2.0/ext/nkf' I, [2024-04-20T05:40:49.462423 #295148] INFO -- : make[2]: Leaving directory '/tmp/ruby/build/trunk/ext/socket' I, [2024-04-20T05:40:49.476826 #295148] INFO -- : make[2]: Entering directory '/tmp/ruby/build/trunk/.bundle/gems/racc-1.7.3/ext/racc/cparse' I, [2024-04-20T05:40:49.559926 #295148] INFO -- : make[2]: Leaving directory '/tmp/ruby/build/trunk/.bundle/gems/bigdecimal-3.1.7/ext/bigdecimal' I, [2024-04-20T05:40:49.568781 #295148] INFO -- : make[2]: Leaving directory '/tmp/ruby/build/trunk/.bundle/gems/debug-1.9.2/ext/debug' I, [2024-04-20T05:40:49.582903 #295148] INFO -- : make[2]: Entering directory '/tmp/ruby/build/trunk/.bundle/gems/rbs-3.4.4/ext/rbs_extension' I, [2024-04-20T05:40:49.583841 #295148] INFO -- : make[2]: Entering directory '/tmp/ruby/build/trunk/.bundle/gems/syslog-0.1.2/ext/syslog' I, [2024-04-20T05:40:49.597114 #295148] INFO -- : make[2]: Leaving directory '/tmp/ruby/build/trunk/.bundle/gems/nkf-0.2.0/ext/nkf' I, [2024-04-20T05:40:49.644802 #295148] INFO -- : make[2]: Leaving directory '/tmp/ruby/build/trunk/.bundle/gems/racc-1.7.3/ext/racc/cparse' I, [2024-04-20T05:40:49.706073 #295148] INFO -- : make[2]: Entering directory '/tmp/ruby/build/trunk/ext/digest/sha2' I, [2024-04-20T05:40:49.731089 #295148] INFO -- : make[2]: Leaving directory '/tmp/ruby/build/trunk/ext/digest/sha2' I, [2024-04-20T05:40:49.743102 #295148] INFO -- : make[2]: Leaving directory '/tmp/ruby/build/trunk/.bundle/gems/rbs-3.4.4/ext/rbs_extension' I, [2024-04-20T05:40:49.743354 #295148] INFO -- : make[2]: Leaving directory '/tmp/ruby/build/trunk/.bundle/gems/syslog-0.1.2/ext/syslog' I, [2024-04-20T05:40:49.969952 #295148] INFO -- : make[2]: Entering directory '/tmp/ruby/build/trunk' I, [2024-04-20T05:40:50.603528 #295148] INFO -- : linking ruby I, [2024-04-20T05:40:50.805356 #295148] INFO -- : make[2]: Leaving directory '/tmp/ruby/build/trunk' I, [2024-04-20T05:40:50.807296 #295148] INFO -- : make[1]: Leaving directory '/tmp/ruby/build/trunk' I, [2024-04-20T05:40:50.841828 #295148] INFO -- : make[1]: Entering directory '/tmp/ruby/build/trunk' I, [2024-04-20T05:40:50.842109 #295148] INFO -- : make[1]: Nothing to be done for 'note'. I, [2024-04-20T05:40:50.842316 #295148] INFO -- : make[1]: Leaving directory '/tmp/ruby/build/trunk' I, [2024-04-20T05:40:50.845671 #295148] INFO -- : $$$[end] "make all -j4" exit with 0. I, [2024-04-20T05:40:50.846419 #295148] INFO -- : $$$[beg] make install -j4 I, [2024-04-20T05:40:51.449658 #295148] INFO -- : Update minitest to ea9caafc0754b1d6236a490d59e624b53209734a I, [2024-04-20T05:40:51.450366 #295148] INFO -- : Update power_assert to 84e85124c5014a139af39161d484156cfe87a9ed I, [2024-04-20T05:40:51.451504 #295148] INFO -- : Update rbs to ba7872795d5de04adb8ff500c0e6afdc81a041dd I, [2024-04-20T05:40:51.459468 #295148] INFO -- : Update typeprof to b19a6416da3a05d57fadd6ffdadb382b6d236ca5 I, [2024-04-20T05:40:51.464100 #295148] INFO -- : echo ea9caafc0754b1d6236a490d59e624b53209734a | /bin/sh /tmp/ruby/src/trunk/tool/ifchange /tmp/ruby/src/trunk/.bundle/.timestamp/minitest.revision - I, [2024-04-20T05:40:51.464807 #295148] INFO -- : echo 84e85124c5014a139af39161d484156cfe87a9ed | /bin/sh /tmp/ruby/src/trunk/tool/ifchange /tmp/ruby/src/trunk/.bundle/.timestamp/power_assert.revision - I, [2024-04-20T05:40:51.465593 #295148] INFO -- : echo ba7872795d5de04adb8ff500c0e6afdc81a041dd | /bin/sh /tmp/ruby/src/trunk/tool/ifchange /tmp/ruby/src/trunk/.bundle/.timestamp/rbs.revision - I, [2024-04-20T05:40:51.474355 #295148] INFO -- : echo b19a6416da3a05d57fadd6ffdadb382b6d236ca5 | /bin/sh /tmp/ruby/src/trunk/tool/ifchange /tmp/ruby/src/trunk/.bundle/.timestamp/typeprof.revision - I, [2024-04-20T05:40:51.476340 #295148] INFO -- : /tmp/ruby/src/trunk/.bundle/.timestamp/minitest.revision unchanged I, [2024-04-20T05:40:51.476971 #295148] INFO -- : /tmp/ruby/src/trunk/.bundle/.timestamp/power_assert.revision unchanged I, [2024-04-20T05:40:51.480296 #295148] INFO -- : /tmp/ruby/src/trunk/.bundle/.timestamp/rbs.revision unchanged I, [2024-04-20T05:40:51.484387 #295148] INFO -- : /tmp/ruby/src/trunk/.bundle/.timestamp/typeprof.revision unchanged I, [2024-04-20T05:40:51.484930 #295148] INFO -- : BASERUBY = /usr/bin/ruby --disable=gems I, [2024-04-20T05:40:51.485255 #295148] INFO -- : CC = gcc I, [2024-04-20T05:40:51.485516 #295148] INFO -- : LD = ld I, [2024-04-20T05:40:51.485750 #295148] INFO -- : LDSHARED = gcc -shared I, [2024-04-20T05:40:51.485991 #295148] INFO -- : CFLAGS = -O3 -fno-fast-math -ggdb3 -Wall -Wextra -Wdeprecated-declarations -Wdiv-by-zero -Wduplicated-cond -Wimplicit-function-declaration -Wimplicit-int -Wpointer-arith -Wwrite-strings -Wold-style-definition -Wimplicit-fallthrough=0 -Wmissing-noreturn -Wno-cast-function-type -Wno-constant-logical-operand -Wno-long-long -Wno-missing-field-initializers -Wno-overlength-strings -Wno-packed-bitfield-compat -Wno-parentheses-equality -Wno-self-assign -Wno-tautological-compare -Wno-unused-parameter -Wno-unused-value -Wsuggest-attribute=format -Wsuggest-attribute=noreturn -Wunused-variable -Wmisleading-indentation -Wundef -fPIC I, [2024-04-20T05:40:51.486271 #295148] INFO -- : XCFLAGS = -U_FORTIFY_SOURCE -D_FORTIFY_SOURCE=2 -fstack-protector-strong -fno-strict-overflow -fvisibility=hidden -fexcess-precision=standard -DRUBY_EXPORT -I. -I.ext/include/riscv64-linux -I/tmp/ruby/src/trunk/include -I/tmp/ruby/src/trunk -I/tmp/ruby/src/trunk/prism -I/tmp/ruby/src/trunk/enc/unicode/15.0.0 I, [2024-04-20T05:40:51.486533 #295148] INFO -- : CPPFLAGS = I, [2024-04-20T05:40:51.486785 #295148] INFO -- : DLDFLAGS = -Wl,--compress-debug-sections=zlib -Wl,-soname,libruby.so.3.4 -fstack-protector-strong I, [2024-04-20T05:40:51.487031 #295148] INFO -- : SOLIBS = -lz -lrt -lrt -lgmp -ldl -lcrypt -lm -lpthread I, [2024-04-20T05:40:51.487246 #295148] INFO -- : LANG = I, [2024-04-20T05:40:51.487455 #295148] INFO -- : LC_ALL = I, [2024-04-20T05:40:51.487645 #295148] INFO -- : LC_CTYPE = I, [2024-04-20T05:40:51.487864 #295148] INFO -- : MFLAGS = -j4 --jobserver-auth=4,5 I, [2024-04-20T05:40:51.488085 #295148] INFO -- : RUSTC = rustc I, [2024-04-20T05:40:51.488358 #295148] INFO -- : YJIT_RUSTC_ARGS = --crate-name=yjit --crate-type=staticlib --edition=2021 -g -C lto=thin -C opt-level=3 -C overflow-checks=on '--out-dir=/tmp/ruby/build/trunk/yjit/target/release/' /tmp/ruby/src/trunk/yjit/src/lib.rs I, [2024-04-20T05:40:51.788859 #295148] INFO -- : generating enc.mk I, [2024-04-20T05:40:51.789828 #295148] INFO -- : gcc (Debian 13.2.0-4revyos1) 13.2.0 I, [2024-04-20T05:40:51.790015 #295148] INFO -- : Copyright (C) 2023 Free Software Foundation, Inc. I, [2024-04-20T05:40:51.790119 #295148] INFO -- : This is free software; see the source for copying conditions. There is NO I, [2024-04-20T05:40:51.790222 #295148] INFO -- : warranty; not even for MERCHANTABILITY or FITNESS FOR A PARTICULAR PURPOSE. I, [2024-04-20T05:40:51.790338 #295148] INFO -- : I, [2024-04-20T05:40:53.302931 #295148] INFO -- : making srcs under enc I, [2024-04-20T05:40:53.631078 #295148] INFO -- : make[1]: Entering directory '/tmp/ruby/build/trunk' I, [2024-04-20T05:40:53.631303 #295148] INFO -- : make[1]: Nothing to be done for 'srcs'. I, [2024-04-20T05:40:53.631504 #295148] INFO -- : make[1]: Leaving directory '/tmp/ruby/build/trunk' I, [2024-04-20T05:40:53.634389 #295148] INFO -- : making enc I, [2024-04-20T05:40:53.806589 #295148] INFO -- : make[1]: Entering directory '/tmp/ruby/build/trunk' I, [2024-04-20T05:40:53.806808 #295148] INFO -- : make[1]: Nothing to be done for 'enc'. I, [2024-04-20T05:40:53.806925 #295148] INFO -- : make[1]: Leaving directory '/tmp/ruby/build/trunk' I, [2024-04-20T05:40:53.810001 #295148] INFO -- : generating transdb.h I, [2024-04-20T05:40:54.138853 #295148] INFO -- : Building power_assert@84e85124c5014a139af39161d484156cfe87a9ed to /tmp/ruby/src/trunk/gems/power_assert-2.0.3.gem I, [2024-04-20T05:40:55.090778 #295148] INFO -- : Successfully built RubyGem I, [2024-04-20T05:40:55.091003 #295148] INFO -- : Name: power_assert I, [2024-04-20T05:40:55.091097 #295148] INFO -- : Version: 2.0.4dev I, [2024-04-20T05:40:55.091184 #295148] INFO -- : File: power_assert-2.0.4dev.gem I, [2024-04-20T05:40:55.106202 #295148] INFO -- : Extracting bundle gem power_assert-2.0.3... I, [2024-04-20T05:40:55.246143 #295148] INFO -- : transdb.h unchanged I, [2024-04-20T05:40:55.251821 #295148] INFO -- : generating makefiles ext/configure-ext.mk I, [2024-04-20T05:40:55.252618 #295148] INFO -- : making trans I, [2024-04-20T05:40:55.452589 #295148] INFO -- : ext/configure-ext.mk unchanged I, [2024-04-20T05:40:55.464303 #295148] INFO -- : make[1]: Entering directory '/tmp/ruby/build/trunk' I, [2024-04-20T05:40:55.610810 #295148] INFO -- : make[1]: Entering directory '/tmp/ruby/build/trunk' I, [2024-04-20T05:40:55.611044 #295148] INFO -- : make[1]: Nothing to be done for 'trans'. I, [2024-04-20T05:40:55.611162 #295148] INFO -- : make[1]: Leaving directory '/tmp/ruby/build/trunk' I, [2024-04-20T05:40:55.614108 #295148] INFO -- : making encs I, [2024-04-20T05:40:56.042177 #295148] INFO -- : make[1]: Entering directory '/tmp/ruby/build/trunk' I, [2024-04-20T05:40:56.042427 #295148] INFO -- : make[1]: Nothing to be done for 'encs'. I, [2024-04-20T05:40:56.042599 #295148] INFO -- : make[1]: Leaving directory '/tmp/ruby/build/trunk' I, [2024-04-20T05:40:56.074276 #295148] INFO -- : Try with hash version of bundled gems instead of gems/power_assert-2.0.3.gem. We don't use this gem with release version of Ruby. I, [2024-04-20T05:40:56.141935 #295148] INFO -- : Unpacked gems/power_assert-2.0.4dev.gem I, [2024-04-20T05:40:59.159962 #295148] INFO -- : make[1]: Leaving directory '/tmp/ruby/build/trunk' I, [2024-04-20T05:40:59.162178 #295148] INFO -- : generating makefile exts.mk I, [2024-04-20T05:40:59.501206 #295148] INFO -- : exts.mk unchanged I, [2024-04-20T05:40:59.539644 #295148] INFO -- : make[1]: Entering directory '/tmp/ruby/build/trunk' I, [2024-04-20T05:41:00.056576 #295148] INFO -- : make[2]: Entering directory '/tmp/ruby/build/trunk/ext/coverage' I, [2024-04-20T05:41:00.056828 #295148] INFO -- : make[2]: Entering directory '/tmp/ruby/build/trunk/ext/digest' I, [2024-04-20T05:41:00.068820 #295148] INFO -- : make[2]: Entering directory '/tmp/ruby/build/trunk/ext/date' I, [2024-04-20T05:41:00.078307 #295148] INFO -- : make[2]: Leaving directory '/tmp/ruby/build/trunk/ext/coverage' I, [2024-04-20T05:41:00.094588 #295148] INFO -- : make[2]: Leaving directory '/tmp/ruby/build/trunk/ext/date' I, [2024-04-20T05:41:00.101742 #295148] INFO -- : make[2]: Leaving directory '/tmp/ruby/build/trunk/ext/digest' I, [2024-04-20T05:41:00.122005 #295148] INFO -- : make[2]: Entering directory '/tmp/ruby/build/trunk/ext/io/console' I, [2024-04-20T05:41:00.139712 #295148] INFO -- : make[2]: Entering directory '/tmp/ruby/build/trunk/ext/fiddle' I, [2024-04-20T05:41:00.142746 #295148] INFO -- : make[2]: Leaving directory '/tmp/ruby/build/trunk/ext/io/console' I, [2024-04-20T05:41:00.142967 #295148] INFO -- : make[2]: Entering directory '/tmp/ruby/build/trunk/ext/json' I, [2024-04-20T05:41:00.160261 #295148] INFO -- : make[2]: Entering directory '/tmp/ruby/build/trunk/ext/monitor' I, [2024-04-20T05:41:00.178286 #295148] INFO -- : make[2]: Leaving directory '/tmp/ruby/build/trunk/ext/monitor' I, [2024-04-20T05:41:00.186212 #295148] INFO -- : make[2]: Leaving directory '/tmp/ruby/build/trunk/ext/fiddle' I, [2024-04-20T05:41:00.198325 #295148] INFO -- : make[2]: Entering directory '/tmp/ruby/build/trunk/ext/objspace' I, [2024-04-20T05:41:00.200589 #295148] INFO -- : make[2]: Leaving directory '/tmp/ruby/build/trunk/ext/json' I, [2024-04-20T05:41:00.214038 #295148] INFO -- : make[2]: Entering directory '/tmp/ruby/build/trunk/ext/pathname' I, [2024-04-20T05:41:00.229903 #295148] INFO -- : make[2]: Leaving directory '/tmp/ruby/build/trunk/ext/objspace' I, [2024-04-20T05:41:00.232226 #295148] INFO -- : make[2]: Leaving directory '/tmp/ruby/build/trunk/ext/pathname' I, [2024-04-20T05:41:00.239064 #295148] INFO -- : make[2]: Entering directory '/tmp/ruby/build/trunk/ext/psych' I, [2024-04-20T05:41:00.260072 #295148] INFO -- : make[2]: Entering directory '/tmp/ruby/build/trunk/ext/pty' I, [2024-04-20T05:41:00.290637 #295148] INFO -- : make[2]: Leaving directory '/tmp/ruby/build/trunk/ext/pty' I, [2024-04-20T05:41:00.308111 #295148] INFO -- : make[2]: Entering directory '/tmp/ruby/build/trunk/ext/openssl' I, [2024-04-20T05:41:00.319948 #295148] INFO -- : make[2]: Entering directory '/tmp/ruby/build/trunk/ext/rubyvm' I, [2024-04-20T05:41:00.335592 #295148] INFO -- : make[2]: Leaving directory '/tmp/ruby/build/trunk/ext/rubyvm' I, [2024-04-20T05:41:00.355305 #295148] INFO -- : make[2]: Leaving directory '/tmp/ruby/build/trunk/ext/psych' I, [2024-04-20T05:41:00.376034 #295148] INFO -- : make[2]: Entering directory '/tmp/ruby/build/trunk/ext/ripper' I, [2024-04-20T05:41:00.410161 #295148] INFO -- : make[2]: Entering directory '/tmp/ruby/build/trunk/ext/socket' I, [2024-04-20T05:41:00.426700 #295148] INFO -- : make[2]: Leaving directory '/tmp/ruby/build/trunk/ext/ripper' I, [2024-04-20T05:41:00.429147 #295148] INFO -- : make[2]: Leaving directory '/tmp/ruby/build/trunk/ext/openssl' I, [2024-04-20T05:41:00.442912 #295148] INFO -- : make[2]: Entering directory '/tmp/ruby/build/trunk/.bundle/gems/bigdecimal-3.1.7/ext/bigdecimal' I, [2024-04-20T05:41:00.444577 #295148] INFO -- : make[2]: Entering directory '/tmp/ruby/build/trunk/.bundle/gems/debug-1.9.2/ext/debug' I, [2024-04-20T05:41:00.457033 #295148] INFO -- : make[2]: Entering directory '/tmp/ruby/build/trunk/.bundle/gems/nkf-0.2.0/ext/nkf' I, [2024-04-20T05:41:00.484350 #295148] INFO -- : make[2]: Leaving directory '/tmp/ruby/build/trunk/ext/socket' I, [2024-04-20T05:41:00.499523 #295148] INFO -- : make[2]: Entering directory '/tmp/ruby/build/trunk/.bundle/gems/racc-1.7.3/ext/racc/cparse' I, [2024-04-20T05:41:00.600948 #295148] INFO -- : make[2]: Leaving directory '/tmp/ruby/build/trunk/.bundle/gems/debug-1.9.2/ext/debug' I, [2024-04-20T05:41:00.603191 #295148] INFO -- : make[2]: Leaving directory '/tmp/ruby/build/trunk/.bundle/gems/bigdecimal-3.1.7/ext/bigdecimal' I, [2024-04-20T05:41:00.617844 #295148] INFO -- : make[2]: Leaving directory '/tmp/ruby/build/trunk/.bundle/gems/nkf-0.2.0/ext/nkf' I, [2024-04-20T05:41:00.618085 #295148] INFO -- : make[2]: Entering directory '/tmp/ruby/build/trunk/.bundle/gems/syslog-0.1.2/ext/syslog' I, [2024-04-20T05:41:00.619987 #295148] INFO -- : make[2]: Entering directory '/tmp/ruby/build/trunk/.bundle/gems/rbs-3.4.4/ext/rbs_extension' I, [2024-04-20T05:41:00.671184 #295148] INFO -- : make[2]: Leaving directory '/tmp/ruby/build/trunk/.bundle/gems/racc-1.7.3/ext/racc/cparse' I, [2024-04-20T05:41:00.734061 #295148] INFO -- : make[2]: Entering directory '/tmp/ruby/build/trunk/ext/digest/sha2' I, [2024-04-20T05:41:00.759802 #295148] INFO -- : make[2]: Leaving directory '/tmp/ruby/build/trunk/ext/digest/sha2' I, [2024-04-20T05:41:00.774270 #295148] INFO -- : make[2]: Leaving directory '/tmp/ruby/build/trunk/.bundle/gems/syslog-0.1.2/ext/syslog' I, [2024-04-20T05:41:00.779681 #295148] INFO -- : make[2]: Leaving directory '/tmp/ruby/build/trunk/.bundle/gems/rbs-3.4.4/ext/rbs_extension' I, [2024-04-20T05:41:00.993491 #295148] INFO -- : make[2]: Entering directory '/tmp/ruby/build/trunk' I, [2024-04-20T05:41:01.632343 #295148] INFO -- : make[2]: 'ruby' is up to date. I, [2024-04-20T05:41:01.632864 #295148] INFO -- : make[2]: Leaving directory '/tmp/ruby/build/trunk' I, [2024-04-20T05:41:01.635012 #295148] INFO -- : make[1]: Leaving directory '/tmp/ruby/build/trunk' I, [2024-04-20T05:41:01.677588 #295148] INFO -- : make[1]: Entering directory '/tmp/ruby/build/trunk' I, [2024-04-20T05:41:01.677785 #295148] INFO -- : make[1]: Nothing to be done for 'note'. I, [2024-04-20T05:41:01.677884 #295148] INFO -- : make[1]: Leaving directory '/tmp/ruby/build/trunk' I, [2024-04-20T05:41:01.678851 #295148] INFO -- : ./miniruby -I/tmp/ruby/src/trunk/lib -I. -I.ext/common /tmp/ruby/src/trunk/tool/runruby.rb --extout=.ext -- --disable-gems -r./riscv64-linux-fake /tmp/ruby/src/trunk/tool/rbinstall.rb --make="make" --dest-dir="" --extout=".ext" --ext-build-dir="./ext" --mflags="-j4 --jobserver-auth=4,5" --make-flags=" -j4 --jobserver-auth=4,5" --data-mode=0644 --prog-mode=0755 --installed-list .installed.list --mantype="doc" --gnumake --install=all --exclude=doc I, [2024-04-20T05:41:02.937570 #295148] INFO -- : Installing to I, [2024-04-20T05:41:02.937783 #295148] INFO -- : installing binary commands: /tmp/ruby/install/trunk/bin I, [2024-04-20T05:41:02.939851 #295148] INFO -- : installing base libraries: /tmp/ruby/install/trunk/lib I, [2024-04-20T05:41:03.010132 #295148] INFO -- : installing arch files: /tmp/ruby/install/trunk/lib/ruby/3.4.0+0/riscv64-linux I, [2024-04-20T05:41:03.010825 #295148] INFO -- : installing pkgconfig data: /tmp/ruby/install/trunk/lib/pkgconfig I, [2024-04-20T05:41:03.011333 #295148] INFO -- : installing extension objects: /tmp/ruby/install/trunk/lib/ruby/3.4.0+0/riscv64-linux I, [2024-04-20T05:41:03.131203 #295148] INFO -- : installing extension objects: /tmp/ruby/install/trunk/lib/ruby/site_ruby/3.4.0+0/riscv64-linux I, [2024-04-20T05:41:03.131395 #295148] INFO -- : installing extension objects: /tmp/ruby/install/trunk/lib/ruby/vendor_ruby/3.4.0+0/riscv64-linux I, [2024-04-20T05:41:03.131873 #295148] INFO -- : installing extension headers: /tmp/ruby/install/trunk/include/ruby-3.4.0+0/riscv64-linux I, [2024-04-20T05:41:03.133964 #295148] INFO -- : installing extension scripts: /tmp/ruby/install/trunk/lib/ruby/3.4.0+0 I, [2024-04-20T05:41:03.184409 #295148] INFO -- : installing extension scripts: /tmp/ruby/install/trunk/lib/ruby/site_ruby/3.4.0+0 I, [2024-04-20T05:41:03.184645 #295148] INFO -- : installing extension scripts: /tmp/ruby/install/trunk/lib/ruby/vendor_ruby/3.4.0+0 I, [2024-04-20T05:41:03.184737 #295148] INFO -- : installing extension headers: /tmp/ruby/install/trunk/include/ruby-3.4.0+0/ruby I, [2024-04-20T05:41:03.185568 #295148] INFO -- : installing command scripts: /tmp/ruby/install/trunk/bin I, [2024-04-20T05:41:03.186370 #295148] INFO -- : installing library scripts: /tmp/ruby/install/trunk/lib/ruby/3.4.0+0 I, [2024-04-20T05:41:03.707625 #295148] INFO -- : installing common headers: /tmp/ruby/install/trunk/include/ruby-3.4.0+0 I, [2024-04-20T05:41:03.789646 #295148] INFO -- : installing manpages: /tmp/ruby/install/trunk/share/man/man1 I, [2024-04-20T05:41:03.791833 #295148] INFO -- : installing default gems from lib: /tmp/ruby/install/trunk/lib/ruby/gems/3.4.0+0 I, [2024-04-20T05:41:04.091886 #295148] INFO -- : benchmark 0.3.0 I, [2024-04-20T05:41:04.193188 #295148] INFO -- : bundler 2.6.0.dev I, [2024-04-20T05:41:04.211867 #295148] INFO -- : cgi 0.4.1 I, [2024-04-20T05:41:04.218681 #295148] INFO -- : delegate 0.3.1 I, [2024-04-20T05:41:04.225174 #295148] INFO -- : did_you_mean 1.6.3 I, [2024-04-20T05:41:04.231998 #295148] INFO -- : english 0.8.0 I, [2024-04-20T05:41:04.238670 #295148] INFO -- : erb 4.0.4 I, [2024-04-20T05:41:04.249886 #295148] INFO -- : error_highlight 0.6.0 I, [2024-04-20T05:41:04.256269 #295148] INFO -- : fileutils 1.7.2 I, [2024-04-20T05:41:04.262780 #295148] INFO -- : find 0.2.0 I, [2024-04-20T05:41:04.269404 #295148] INFO -- : forwardable 1.3.3 I, [2024-04-20T05:41:04.275873 #295148] INFO -- : ipaddr 1.2.6 I, [2024-04-20T05:41:04.282431 #295148] INFO -- : irb 1.12.0 I, [2024-04-20T05:41:04.300059 #295148] INFO -- : logger 1.6.0 I, [2024-04-20T05:41:04.306635 #295148] INFO -- : net-http 0.4.1 I, [2024-04-20T05:41:04.313700 #295148] INFO -- : net-protocol 0.2.2 I, [2024-04-20T05:41:04.320652 #295148] INFO -- : open-uri 0.4.1 I, [2024-04-20T05:41:04.327717 #295148] INFO -- : open3 0.2.1 I, [2024-04-20T05:41:04.334341 #295148] INFO -- : optparse 0.5.0 I, [2024-04-20T05:41:04.341283 #295148] INFO -- : ostruct 0.6.0 I, [2024-04-20T05:41:04.347736 #295148] INFO -- : pp 0.5.0 I, [2024-04-20T05:41:04.355510 #295148] INFO -- : prettyprint 0.2.0 I, [2024-04-20T05:41:04.362257 #295148] INFO -- : prism 0.26.0 I, [2024-04-20T05:41:04.369365 #295148] INFO -- : pstore 0.1.3 I, [2024-04-20T05:41:04.375798 #295148] INFO -- : rdoc 6.6.3.1 I, [2024-04-20T05:41:04.396410 #295148] INFO -- : readline 0.0.4 I, [2024-04-20T05:41:04.403043 #295148] INFO -- : reline 0.5.2 I, [2024-04-20T05:41:04.410118 #295148] INFO -- : resolv 0.4.0 I, [2024-04-20T05:41:04.416906 #295148] INFO -- : ruby2_keywords 0.0.5 I, [2024-04-20T05:41:04.423587 #295148] INFO -- : securerandom 0.3.1 I, [2024-04-20T05:41:04.430415 #295148] INFO -- : set 1.1.0 I, [2024-04-20T05:41:04.437189 #295148] INFO -- : shellwords 0.2.0 I, [2024-04-20T05:41:04.443897 #295148] INFO -- : singleton 0.2.0 I, [2024-04-20T05:41:04.450460 #295148] INFO -- : syntax_suggest 2.0.0 I, [2024-04-20T05:41:04.461144 #295148] INFO -- : tempfile 0.2.1 I, [2024-04-20T05:41:04.467804 #295148] INFO -- : time 0.3.0 I, [2024-04-20T05:41:04.474768 #295148] INFO -- : timeout 0.4.1 I, [2024-04-20T05:41:04.481550 #295148] INFO -- : tmpdir 0.2.0 I, [2024-04-20T05:41:04.488465 #295148] INFO -- : tsort 0.2.0 I, [2024-04-20T05:41:04.495180 #295148] INFO -- : un 0.3.0 I, [2024-04-20T05:41:04.508121 #295148] INFO -- : uri 0.13.0 I, [2024-04-20T05:41:04.515249 #295148] INFO -- : weakref 0.1.3 I, [2024-04-20T05:41:04.521995 #295148] INFO -- : yaml 0.3.0 I, [2024-04-20T05:41:04.527231 #295148] INFO -- : installing default gems from ext: /tmp/ruby/install/trunk/lib/ruby/gems/3.4.0+0 I, [2024-04-20T05:41:04.598851 #295148] INFO -- : date 3.3.4 I, [2024-04-20T05:41:04.604730 #295148] INFO -- : digest 3.1.1 I, [2024-04-20T05:41:04.616367 #295148] INFO -- : etc 1.4.3 I, [2024-04-20T05:41:04.625328 #295148] INFO -- : fcntl 1.1.0 I, [2024-04-20T05:41:04.632141 #295148] INFO -- : fiddle 1.1.3 I, [2024-04-20T05:41:04.639037 #295148] INFO -- : io-console 0.7.2 I, [2024-04-20T05:41:04.646017 #295148] INFO -- : io-nonblock 0.3.0 I, [2024-04-20T05:41:04.652707 #295148] INFO -- : io-wait 0.3.1 I, [2024-04-20T05:41:04.659191 #295148] INFO -- : json 2.7.2 I, [2024-04-20T05:41:04.666642 #295148] INFO -- : openssl 3.2.0 I, [2024-04-20T05:41:04.673632 #295148] INFO -- : pathname 0.3.0 I, [2024-04-20T05:41:04.681696 #295148] INFO -- : psych 5.1.2 I, [2024-04-20T05:41:04.689362 #295148] INFO -- : stringio 3.1.1 I, [2024-04-20T05:41:04.696528 #295148] INFO -- : strscan 3.1.1 I, [2024-04-20T05:41:04.703201 #295148] INFO -- : zlib 3.1.0 I, [2024-04-20T05:41:04.713398 #295148] INFO -- : installing bundled gems: /tmp/ruby/install/trunk/lib/ruby/gems/3.4.0+0 I, [2024-04-20T05:41:04.718007 #295148] INFO -- : minitest 5.22.3 I, [2024-04-20T05:41:04.799922 #295148] INFO -- : rake 13.2.1 I, [2024-04-20T05:41:04.867031 #295148] INFO -- : test-unit 3.6.2 I, [2024-04-20T05:41:04.927071 #295148] INFO -- : rexml 3.2.6 I, [2024-04-20T05:41:04.992512 #295148] INFO -- : rss 0.3.0 I, [2024-04-20T05:41:05.034074 #295148] INFO -- : net-ftp 0.3.4 I, [2024-04-20T05:41:05.053817 #295148] INFO -- : net-imap 0.4.10 I, [2024-04-20T05:41:05.099680 #295148] INFO -- : net-pop 0.1.2 I, [2024-04-20T05:41:05.112475 #295148] INFO -- : net-smtp 0.5.0 I, [2024-04-20T05:41:05.133114 #295148] INFO -- : matrix 0.4.2 I, [2024-04-20T05:41:05.174460 #295148] INFO -- : prime 0.1.2 I, [2024-04-20T05:41:05.236534 #295148] INFO -- : rbs 3.4.4 I, [2024-04-20T05:41:05.617988 #295148] INFO -- : typeprof 0.21.11 I, [2024-04-20T05:41:05.651452 #295148] INFO -- : debug 1.9.2 I, [2024-04-20T05:41:05.692928 #295148] INFO -- : racc 1.7.3 I, [2024-04-20T05:41:05.735988 #295148] INFO -- : mutex_m 0.2.0 I, [2024-04-20T05:41:05.751303 #295148] INFO -- : getoptlong 0.2.1 I, [2024-04-20T05:41:05.771271 #295148] INFO -- : base64 0.2.0 I, [2024-04-20T05:41:05.785957 #295148] INFO -- : bigdecimal 3.1.7 I, [2024-04-20T05:41:05.814492 #295148] INFO -- : observer 0.1.2 I, [2024-04-20T05:41:05.829462 #295148] INFO -- : abbrev 0.1.2 I, [2024-04-20T05:41:05.843396 #295148] INFO -- : resolv-replace 0.1.1 I, [2024-04-20T05:41:05.863669 #295148] INFO -- : rinda 0.2.0 I, [2024-04-20T05:41:05.880402 #295148] INFO -- : drb 2.2.1 I, [2024-04-20T05:41:05.904054 #295148] INFO -- : nkf 0.2.0 I, [2024-04-20T05:41:05.938154 #295148] INFO -- : syslog 0.1.2 I, [2024-04-20T05:41:05.960630 #295148] INFO -- : csv 3.3.0 I, [2024-04-20T05:41:06.000149 #295148] INFO -- : installing bundled gem cache: /tmp/ruby/install/trunk/lib/ruby/gems/3.4.0+0/cache I, [2024-04-20T05:41:06.019300 #295148] INFO -- : skipped bundled gems: I, [2024-04-20T05:41:06.019505 #295148] INFO -- : power_assert-2.0.4dev.gem not found in bundled_gems I, [2024-04-20T05:41:06.043690 #295148] INFO -- : $$$[end] "make install -j4" exit with 0. I, [2024-04-20T05:41:06.044637 #295148] INFO -- : $$$[beg] make yes-btest TESTOPTS='-q -j4' I, [2024-04-20T05:42:16.172486 #295148] INFO -- : PASS all 1926 tests E, [2024-04-20T05:42:16.196745 #295148] ERROR -- : I, [2024-04-20T05:42:16.197264 #295148] INFO -- : $$$[end] "make yes-btest TESTOPTS='-q -j4'" exit with 0. I, [2024-04-20T05:42:16.197886 #295148] INFO -- : $$$[beg] make yes-test-basic TESTS='-j4' I, [2024-04-20T05:42:16.732131 #295148] INFO -- : BASERUBY = /usr/bin/ruby --disable=gems I, [2024-04-20T05:42:16.732339 #295148] INFO -- : CC = gcc I, [2024-04-20T05:42:16.732525 #295148] INFO -- : LD = ld I, [2024-04-20T05:42:16.732647 #295148] INFO -- : LDSHARED = gcc -shared I, [2024-04-20T05:42:16.732791 #295148] INFO -- : CFLAGS = -O3 -fno-fast-math -ggdb3 -Wall -Wextra -Wdeprecated-declarations -Wdiv-by-zero -Wduplicated-cond -Wimplicit-function-declaration -Wimplicit-int -Wpointer-arith -Wwrite-strings -Wold-style-definition -Wimplicit-fallthrough=0 -Wmissing-noreturn -Wno-cast-function-type -Wno-constant-logical-operand -Wno-long-long -Wno-missing-field-initializers -Wno-overlength-strings -Wno-packed-bitfield-compat -Wno-parentheses-equality -Wno-self-assign -Wno-tautological-compare -Wno-unused-parameter -Wno-unused-value -Wsuggest-attribute=format -Wsuggest-attribute=noreturn -Wunused-variable -Wmisleading-indentation -Wundef -fPIC I, [2024-04-20T05:42:16.732916 #295148] INFO -- : XCFLAGS = -U_FORTIFY_SOURCE -D_FORTIFY_SOURCE=2 -fstack-protector-strong -fno-strict-overflow -fvisibility=hidden -fexcess-precision=standard -DRUBY_EXPORT -I. -I.ext/include/riscv64-linux -I/tmp/ruby/src/trunk/include -I/tmp/ruby/src/trunk -I/tmp/ruby/src/trunk/prism -I/tmp/ruby/src/trunk/enc/unicode/15.0.0 I, [2024-04-20T05:42:16.733064 #295148] INFO -- : CPPFLAGS = I, [2024-04-20T05:42:16.733190 #295148] INFO -- : DLDFLAGS = -Wl,--compress-debug-sections=zlib -Wl,-soname,libruby.so.3.4 -fstack-protector-strong I, [2024-04-20T05:42:16.733298 #295148] INFO -- : SOLIBS = -lz -lrt -lrt -lgmp -ldl -lcrypt -lm -lpthread I, [2024-04-20T05:42:16.733390 #295148] INFO -- : LANG = I, [2024-04-20T05:42:16.733489 #295148] INFO -- : LC_ALL = I, [2024-04-20T05:42:16.733589 #295148] INFO -- : LC_CTYPE = I, [2024-04-20T05:42:16.733678 #295148] INFO -- : MFLAGS = I, [2024-04-20T05:42:16.733762 #295148] INFO -- : RUSTC = rustc I, [2024-04-20T05:42:16.733848 #295148] INFO -- : YJIT_RUSTC_ARGS = --crate-name=yjit --crate-type=staticlib --edition=2021 -g -C lto=thin -C opt-level=3 -C overflow-checks=on '--out-dir=/tmp/ruby/build/trunk/yjit/target/release/' /tmp/ruby/src/trunk/yjit/src/lib.rs I, [2024-04-20T05:42:16.735471 #295148] INFO -- : gcc (Debian 13.2.0-4revyos1) 13.2.0 I, [2024-04-20T05:42:16.735668 #295148] INFO -- : Copyright (C) 2023 Free Software Foundation, Inc. I, [2024-04-20T05:42:16.735766 #295148] INFO -- : This is free software; see the source for copying conditions. There is NO I, [2024-04-20T05:42:16.735988 #295148] INFO -- : warranty; not even for MERCHANTABILITY or FITNESS FOR A PARTICULAR PURPOSE. I, [2024-04-20T05:42:16.736118 #295148] INFO -- : I, [2024-04-20T05:42:18.653077 #295148] INFO -- : Checking leaked global symbols...none I, [2024-04-20T05:42:18.956046 #295148] INFO -- : /tmp/ruby/src/trunk/basictest/test.rb:assignment ....................................................................................................................................................................................................................................................................................................................................................................................OK 372 I, [2024-04-20T05:42:18.956321 #295148] INFO -- : /tmp/ruby/src/trunk/basictest/test.rb:condition ..OK 2 I, [2024-04-20T05:42:18.956506 #295148] INFO -- : /tmp/ruby/src/trunk/basictest/test.rb:if/unless ...OK 3 I, [2024-04-20T05:42:18.956761 #295148] INFO -- : /tmp/ruby/src/trunk/basictest/test.rb:case .....OK 5 I, [2024-04-20T05:42:18.958088 #295148] INFO -- : /tmp/ruby/src/trunk/basictest/test.rb:while/until ........OK 8 I, [2024-04-20T05:42:18.958888 #295148] INFO -- : /tmp/ruby/src/trunk/basictest/test.rb:exception ..........OK 10 I, [2024-04-20T05:42:18.961480 #295148] INFO -- : /tmp/ruby/src/trunk/basictest/test.rb:array .......................................OK 39 I, [2024-04-20T05:42:18.963102 #295148] INFO -- : /tmp/ruby/src/trunk/basictest/test.rb:hash ...........................OK 27 I, [2024-04-20T05:42:18.971750 #295148] INFO -- : /tmp/ruby/src/trunk/basictest/test.rb:iterator ...........................................................................................................OK 107 I, [2024-04-20T05:42:18.976508 #295148] INFO -- : /tmp/ruby/src/trunk/basictest/test.rb:float ................................................................................OK 80 I, [2024-04-20T05:42:18.992476 #295148] INFO -- : /tmp/ruby/src/trunk/basictest/test.rb:bignum ...............................OK 31 I, [2024-04-20T05:42:19.006236 #295148] INFO -- : /tmp/ruby/src/trunk/basictest/test.rb:string & char ..............................................................OK 62 I, [2024-04-20T05:42:19.006757 #295148] INFO -- : /tmp/ruby/src/trunk/basictest/test.rb:assignment ..........OK 10 I, [2024-04-20T05:42:19.007230 #295148] INFO -- : /tmp/ruby/src/trunk/basictest/test.rb:call ......OK 6 I, [2024-04-20T05:42:19.008017 #295148] INFO -- : /tmp/ruby/src/trunk/basictest/test.rb:proc .........OK 9 I, [2024-04-20T05:42:19.108551 #295148] INFO -- : /tmp/ruby/src/trunk/basictest/test.rb:signal ..OK 2 I, [2024-04-20T05:42:19.112807 #295148] INFO -- : /tmp/ruby/src/trunk/basictest/test.rb:eval ...........................OK 27 I, [2024-04-20T05:42:19.537098 #295148] INFO -- : /tmp/ruby/src/trunk/basictest/test.rb:system ........OK 8 I, [2024-04-20T05:42:19.537513 #295148] INFO -- : /tmp/ruby/src/trunk/basictest/test.rb:const .....OK 5 I, [2024-04-20T05:42:19.538039 #295148] INFO -- : /tmp/ruby/src/trunk/basictest/test.rb:clone .....OK 5 I, [2024-04-20T05:42:19.539102 #295148] INFO -- : /tmp/ruby/src/trunk/basictest/test.rb:marshal ....OK 4 I, [2024-04-20T05:42:19.539672 #295148] INFO -- : /tmp/ruby/src/trunk/basictest/test.rb:pack ....OK 4 I, [2024-04-20T05:42:19.539901 #295148] INFO -- : /tmp/ruby/src/trunk/basictest/test.rb:math ..OK 2 I, [2024-04-20T05:42:19.540608 #295148] INFO -- : /tmp/ruby/src/trunk/basictest/test.rb:struct ......OK 6 I, [2024-04-20T05:42:19.541809 #295148] INFO -- : /tmp/ruby/src/trunk/basictest/test.rb:variable ............OK 12 I, [2024-04-20T05:42:19.542090 #295148] INFO -- : /tmp/ruby/src/trunk/basictest/test.rb:trace ...OK 3 I, [2024-04-20T05:42:19.542979 #295148] INFO -- : /tmp/ruby/src/trunk/basictest/test.rb:defined? ............OK 12 I, [2024-04-20T05:42:19.543604 #295148] INFO -- : /tmp/ruby/src/trunk/basictest/test.rb:alias ......OK 6 I, [2024-04-20T05:42:19.548027 #295148] INFO -- : /tmp/ruby/src/trunk/basictest/test.rb:path .......................OK 23 I, [2024-04-20T05:42:19.943861 #295148] INFO -- : /tmp/ruby/src/trunk/basictest/test.rb:gc ....OK 4 I, [2024-04-20T05:42:19.959972 #295148] INFO -- : I, [2024-04-20T05:42:19.960179 #295148] INFO -- : test succeeded I, [2024-04-20T05:42:19.971085 #295148] INFO -- : $$$[end] "make yes-test-basic TESTS='-j4'" exit with 0. I, [2024-04-20T05:42:19.972375 #295148] INFO -- : $$$[beg] make yes-test-all TESTOPTS='--stderr-on-failure' TESTS='-j4' I, [2024-04-20T05:42:20.799914 #295148] INFO -- : BASERUBY = /usr/bin/ruby --disable=gems I, [2024-04-20T05:42:20.800126 #295148] INFO -- : CC = gcc I, [2024-04-20T05:42:20.800242 #295148] INFO -- : LD = ld I, [2024-04-20T05:42:20.800408 #295148] INFO -- : LDSHARED = gcc -shared I, [2024-04-20T05:42:20.800637 #295148] INFO -- : CFLAGS = -O3 -fno-fast-math -ggdb3 -Wall -Wextra -Wdeprecated-declarations -Wdiv-by-zero -Wduplicated-cond -Wimplicit-function-declaration -Wimplicit-int -Wpointer-arith -Wwrite-strings -Wold-style-definition -Wimplicit-fallthrough=0 -Wmissing-noreturn -Wno-cast-function-type -Wno-constant-logical-operand -Wno-long-long -Wno-missing-field-initializers -Wno-overlength-strings -Wno-packed-bitfield-compat -Wno-parentheses-equality -Wno-self-assign -Wno-tautological-compare -Wno-unused-parameter -Wno-unused-value -Wsuggest-attribute=format -Wsuggest-attribute=noreturn -Wunused-variable -Wmisleading-indentation -Wundef -fPIC I, [2024-04-20T05:42:20.800768 #295148] INFO -- : XCFLAGS = -U_FORTIFY_SOURCE -D_FORTIFY_SOURCE=2 -fstack-protector-strong -fno-strict-overflow -fvisibility=hidden -fexcess-precision=standard -DRUBY_EXPORT -I. -I.ext/include/riscv64-linux -I/tmp/ruby/src/trunk/include -I/tmp/ruby/src/trunk -I/tmp/ruby/src/trunk/prism -I/tmp/ruby/src/trunk/enc/unicode/15.0.0 I, [2024-04-20T05:42:20.800870 #295148] INFO -- : CPPFLAGS = I, [2024-04-20T05:42:20.800972 #295148] INFO -- : DLDFLAGS = -Wl,--compress-debug-sections=zlib -Wl,-soname,libruby.so.3.4 -fstack-protector-strong I, [2024-04-20T05:42:20.801114 #295148] INFO -- : SOLIBS = -lz -lrt -lrt -lgmp -ldl -lcrypt -lm -lpthread I, [2024-04-20T05:42:20.801243 #295148] INFO -- : LANG = I, [2024-04-20T05:42:20.801350 #295148] INFO -- : LC_ALL = I, [2024-04-20T05:42:20.801441 #295148] INFO -- : LC_CTYPE = I, [2024-04-20T05:42:20.801535 #295148] INFO -- : MFLAGS = I, [2024-04-20T05:42:20.801630 #295148] INFO -- : RUSTC = rustc I, [2024-04-20T05:42:20.801717 #295148] INFO -- : YJIT_RUSTC_ARGS = --crate-name=yjit --crate-type=staticlib --edition=2021 -g -C lto=thin -C opt-level=3 -C overflow-checks=on '--out-dir=/tmp/ruby/build/trunk/yjit/target/release/' /tmp/ruby/src/trunk/yjit/src/lib.rs I, [2024-04-20T05:42:20.803534 #295148] INFO -- : gcc (Debian 13.2.0-4revyos1) 13.2.0 I, [2024-04-20T05:42:20.803705 #295148] INFO -- : Copyright (C) 2023 Free Software Foundation, Inc. I, [2024-04-20T05:42:20.803797 #295148] INFO -- : This is free software; see the source for copying conditions. There is NO I, [2024-04-20T05:42:20.803982 #295148] INFO -- : warranty; not even for MERCHANTABILITY or FITNESS FOR A PARTICULAR PURPOSE. I, [2024-04-20T05:42:20.804124 #295148] INFO -- : I, [2024-04-20T05:42:20.822436 #295148] INFO -- : generating enc.mk I, [2024-04-20T05:42:22.301175 #295148] INFO -- : making enc I, [2024-04-20T05:42:22.474890 #295148] INFO -- : make[1]: Entering directory '/tmp/ruby/build/trunk' I, [2024-04-20T05:42:22.475167 #295148] INFO -- : make[1]: Nothing to be done for 'enc'. I, [2024-04-20T05:42:22.475375 #295148] INFO -- : make[1]: Leaving directory '/tmp/ruby/build/trunk' I, [2024-04-20T05:42:22.478369 #295148] INFO -- : making srcs under enc I, [2024-04-20T05:42:22.782236 #295148] INFO -- : make[1]: Entering directory '/tmp/ruby/build/trunk' I, [2024-04-20T05:42:22.782433 #295148] INFO -- : make[1]: Nothing to be done for 'srcs'. I, [2024-04-20T05:42:22.782548 #295148] INFO -- : make[1]: Leaving directory '/tmp/ruby/build/trunk' I, [2024-04-20T05:42:22.787269 #295148] INFO -- : generating transdb.h I, [2024-04-20T05:42:24.068187 #295148] INFO -- : transdb.h unchanged I, [2024-04-20T05:42:24.073823 #295148] INFO -- : making trans I, [2024-04-20T05:42:24.423616 #295148] INFO -- : make[1]: Entering directory '/tmp/ruby/build/trunk' I, [2024-04-20T05:42:24.423892 #295148] INFO -- : make[1]: Nothing to be done for 'trans'. I, [2024-04-20T05:42:24.424098 #295148] INFO -- : make[1]: Leaving directory '/tmp/ruby/build/trunk' I, [2024-04-20T05:42:24.427138 #295148] INFO -- : making encs I, [2024-04-20T05:42:24.812187 #295148] INFO -- : make[1]: Entering directory '/tmp/ruby/build/trunk' I, [2024-04-20T05:42:24.812384 #295148] INFO -- : make[1]: Nothing to be done for 'encs'. I, [2024-04-20T05:42:24.812605 #295148] INFO -- : make[1]: Leaving directory '/tmp/ruby/build/trunk' I, [2024-04-20T05:42:24.825054 #295148] INFO -- : generating makefiles ext/configure-ext.mk I, [2024-04-20T05:42:25.019614 #295148] INFO -- : ext/configure-ext.mk updated I, [2024-04-20T05:42:25.034238 #295148] INFO -- : make[1]: Entering directory '/tmp/ruby/build/trunk' I, [2024-04-20T05:42:36.978105 #295148] INFO -- : make[1]: Leaving directory '/tmp/ruby/build/trunk' I, [2024-04-20T05:42:36.980294 #295148] INFO -- : generating makefile exts.mk I, [2024-04-20T05:42:37.305722 #295148] INFO -- : exts.mk unchanged I, [2024-04-20T05:42:37.350363 #295148] INFO -- : make[1]: Entering directory '/tmp/ruby/build/trunk' I, [2024-04-20T05:42:39.528156 #295148] INFO -- : make[2]: Entering directory '/tmp/ruby/build/trunk/ext/coverage' I, [2024-04-20T05:42:39.553011 #295148] INFO -- : make[2]: Leaving directory '/tmp/ruby/build/trunk/ext/coverage' I, [2024-04-20T05:42:39.603135 #295148] INFO -- : make[2]: Entering directory '/tmp/ruby/build/trunk/ext/date' I, [2024-04-20T05:42:39.631441 #295148] INFO -- : make[2]: Leaving directory '/tmp/ruby/build/trunk/ext/date' I, [2024-04-20T05:42:39.655800 #295148] INFO -- : make[2]: Entering directory '/tmp/ruby/build/trunk/ext/digest' I, [2024-04-20T05:42:39.711393 #295148] INFO -- : make[2]: Leaving directory '/tmp/ruby/build/trunk/ext/digest' I, [2024-04-20T05:42:39.883631 #295148] INFO -- : make[2]: Entering directory '/tmp/ruby/build/trunk/ext/digest/sha2' I, [2024-04-20T05:42:39.909973 #295148] INFO -- : make[2]: Leaving directory '/tmp/ruby/build/trunk/ext/digest/sha2' I, [2024-04-20T05:42:40.047121 #295148] INFO -- : make[2]: Entering directory '/tmp/ruby/build/trunk/ext/fiddle' I, [2024-04-20T05:42:40.114092 #295148] INFO -- : make[2]: Leaving directory '/tmp/ruby/build/trunk/ext/fiddle' I, [2024-04-20T05:42:40.147078 #295148] INFO -- : make[2]: Entering directory '/tmp/ruby/build/trunk/ext/io/console' I, [2024-04-20T05:42:40.167615 #295148] INFO -- : make[2]: Leaving directory '/tmp/ruby/build/trunk/ext/io/console' I, [2024-04-20T05:42:40.254967 #295148] INFO -- : make[2]: Entering directory '/tmp/ruby/build/trunk/ext/json' I, [2024-04-20T05:42:40.320050 #295148] INFO -- : make[2]: Leaving directory '/tmp/ruby/build/trunk/ext/json' I, [2024-04-20T05:42:40.414175 #295148] INFO -- : make[2]: Entering directory '/tmp/ruby/build/trunk/ext/monitor' I, [2024-04-20T05:42:40.434300 #295148] INFO -- : make[2]: Leaving directory '/tmp/ruby/build/trunk/ext/monitor' I, [2024-04-20T05:42:40.486999 #295148] INFO -- : make[2]: Entering directory '/tmp/ruby/build/trunk/ext/objspace' I, [2024-04-20T05:42:40.522681 #295148] INFO -- : make[2]: Leaving directory '/tmp/ruby/build/trunk/ext/objspace' I, [2024-04-20T05:42:40.643426 #295148] INFO -- : make[2]: Entering directory '/tmp/ruby/build/trunk/ext/openssl' I, [2024-04-20T05:42:40.774098 #295148] INFO -- : make[2]: Leaving directory '/tmp/ruby/build/trunk/ext/openssl' I, [2024-04-20T05:42:40.805896 #295148] INFO -- : make[2]: Entering directory '/tmp/ruby/build/trunk/ext/pathname' I, [2024-04-20T05:42:40.828300 #295148] INFO -- : make[2]: Leaving directory '/tmp/ruby/build/trunk/ext/pathname' I, [2024-04-20T05:42:40.881976 #295148] INFO -- : make[2]: Entering directory '/tmp/ruby/build/trunk/ext/psych' I, [2024-04-20T05:42:41.047046 #295148] INFO -- : make[2]: Leaving directory '/tmp/ruby/build/trunk/ext/psych' I, [2024-04-20T05:42:41.075570 #295148] INFO -- : make[2]: Entering directory '/tmp/ruby/build/trunk/ext/pty' I, [2024-04-20T05:42:41.096215 #295148] INFO -- : make[2]: Leaving directory '/tmp/ruby/build/trunk/ext/pty' I, [2024-04-20T05:42:41.196538 #295148] INFO -- : make[2]: Entering directory '/tmp/ruby/build/trunk/ext/ripper' I, [2024-04-20T05:42:41.242137 #295148] INFO -- : make[2]: Leaving directory '/tmp/ruby/build/trunk/ext/ripper' I, [2024-04-20T05:42:41.254199 #295148] INFO -- : make[2]: Entering directory '/tmp/ruby/build/trunk/ext/rubyvm' I, [2024-04-20T05:42:41.271688 #295148] INFO -- : make[2]: Leaving directory '/tmp/ruby/build/trunk/ext/rubyvm' I, [2024-04-20T05:42:41.351715 #295148] INFO -- : make[2]: Entering directory '/tmp/ruby/build/trunk/ext/socket' I, [2024-04-20T05:42:41.410564 #295148] INFO -- : make[2]: Leaving directory '/tmp/ruby/build/trunk/ext/socket' I, [2024-04-20T05:42:41.532020 #295148] INFO -- : make[2]: Entering directory '/tmp/ruby/build/trunk/.bundle/gems/bigdecimal-3.1.7/ext/bigdecimal' I, [2024-04-20T05:42:41.687495 #295148] INFO -- : make[2]: Leaving directory '/tmp/ruby/build/trunk/.bundle/gems/bigdecimal-3.1.7/ext/bigdecimal' I, [2024-04-20T05:42:41.705787 #295148] INFO -- : make[2]: Entering directory '/tmp/ruby/build/trunk/.bundle/gems/debug-1.9.2/ext/debug' I, [2024-04-20T05:42:41.861647 #295148] INFO -- : make[2]: Leaving directory '/tmp/ruby/build/trunk/.bundle/gems/debug-1.9.2/ext/debug' I, [2024-04-20T05:42:41.878853 #295148] INFO -- : make[2]: Entering directory '/tmp/ruby/build/trunk/.bundle/gems/nkf-0.2.0/ext/nkf' I, [2024-04-20T05:42:42.038862 #295148] INFO -- : make[2]: Leaving directory '/tmp/ruby/build/trunk/.bundle/gems/nkf-0.2.0/ext/nkf' I, [2024-04-20T05:42:42.057271 #295148] INFO -- : make[2]: Entering directory '/tmp/ruby/build/trunk/.bundle/gems/racc-1.7.3/ext/racc/cparse' I, [2024-04-20T05:42:42.214219 #295148] INFO -- : make[2]: Leaving directory '/tmp/ruby/build/trunk/.bundle/gems/racc-1.7.3/ext/racc/cparse' I, [2024-04-20T05:42:42.240190 #295148] INFO -- : make[2]: Entering directory '/tmp/ruby/build/trunk/.bundle/gems/rbs-3.4.4/ext/rbs_extension' I, [2024-04-20T05:42:42.397924 #295148] INFO -- : make[2]: Leaving directory '/tmp/ruby/build/trunk/.bundle/gems/rbs-3.4.4/ext/rbs_extension' I, [2024-04-20T05:42:42.415545 #295148] INFO -- : make[2]: Entering directory '/tmp/ruby/build/trunk/.bundle/gems/syslog-0.1.2/ext/syslog' I, [2024-04-20T05:42:42.573100 #295148] INFO -- : make[2]: Leaving directory '/tmp/ruby/build/trunk/.bundle/gems/syslog-0.1.2/ext/syslog' I, [2024-04-20T05:42:42.792681 #295148] INFO -- : make[2]: Entering directory '/tmp/ruby/build/trunk' I, [2024-04-20T05:42:43.444002 #295148] INFO -- : make[2]: 'ruby' is up to date. I, [2024-04-20T05:42:43.444221 #295148] INFO -- : make[2]: Leaving directory '/tmp/ruby/build/trunk' I, [2024-04-20T05:42:43.446166 #295148] INFO -- : make[1]: Leaving directory '/tmp/ruby/build/trunk' I, [2024-04-20T05:42:43.488059 #295148] INFO -- : make[1]: Entering directory '/tmp/ruby/build/trunk' I, [2024-04-20T05:42:43.488259 #295148] INFO -- : make[1]: Nothing to be done for 'note'. I, [2024-04-20T05:42:43.488360 #295148] INFO -- : make[1]: Leaving directory '/tmp/ruby/build/trunk' I, [2024-04-20T05:42:44.226585 #295148] INFO -- : Run options: I, [2024-04-20T05:42:44.226791 #295148] INFO -- : --seed=64241 I, [2024-04-20T05:42:44.226890 #295148] INFO -- : "--ruby=./miniruby -I/tmp/ruby/src/trunk/lib -I. -I.ext/common /tmp/ruby/src/trunk/tool/runruby.rb --extout=.ext -- --disable-gems" I, [2024-04-20T05:42:44.226984 #295148] INFO -- : --excludes-dir=/tmp/ruby/src/trunk/test/.excludes I, [2024-04-20T05:42:44.227077 #295148] INFO -- : --name=!/memory_leak/ I, [2024-04-20T05:42:44.227162 #295148] INFO -- : --stderr-on-failure I, [2024-04-20T05:42:44.227249 #295148] INFO -- : -j4 I, [2024-04-20T05:42:44.227365 #295148] INFO -- : I, [2024-04-20T05:42:44.227454 #295148] INFO -- : # Running tests: I, [2024-04-20T05:42:44.227539 #295148] INFO -- : I, [2024-04-20T05:42:45.207136 #295148] INFO -- : [ 1/881] 336470=test_cgi_multipart I, [2024-04-20T05:42:45.215303 #295148] INFO -- : [ 2/881] 336472=test_gem_commands_cleanup_command I, [2024-04-20T05:42:45.235707 #295148] INFO -- : [ 3/881] 336473=test_word I, [2024-04-20T05:42:45.259684 #295148] INFO -- : [ 4/881] 336473=test_numeric I, [2024-04-20T05:42:45.278529 #295148] INFO -- : [ 5/881] 336471=test_member I, [2024-04-20T05:42:45.409649 #295148] INFO -- : [ 6/881] 336471=test_ractor_compatibility I, [2024-04-20T05:42:45.589234 #295148] INFO -- : [ 7/881] 336473=test_gem_console_ui I, [2024-04-20T05:42:45.815418 #295148] INFO -- : [ 8/881] 336470=test_date_ractor I, [2024-04-20T05:42:47.187065 #295148] INFO -- : [ 9/881] 336473=test_dir I, [2024-04-20T05:42:47.473320 #295148] INFO -- : [ 10/881] 336470=format_errors_test I, [2024-04-20T05:42:48.102504 #295148] INFO -- : [ 11/881] 336470=test_autoconf I, [2024-04-20T05:42:48.123890 #295148] INFO -- : [ 12/881] 336470=test_eval I, [2024-04-20T05:42:48.157161 #295148] INFO -- : [ 13/881] 336471=test_mailto I, [2024-04-20T05:42:48.181122 #295148] INFO -- : [ 14/881] 336470=test_coderange I, [2024-04-20T05:42:48.254230 #295148] INFO -- : [ 15/881] 336470=location_test I, [2024-04-20T05:42:48.348991 #295148] INFO -- : [ 16/881] 336471=test_symbol I, [2024-04-20T05:42:48.561469 #295148] INFO -- : [ 17/881] 336470=test_http_request I, [2024-04-20T05:42:48.656628 #295148] INFO -- : [ 18/881] 336471=json_generic_object_test I, [2024-04-20T05:42:48.742214 #295148] INFO -- : [ 19/881] 336473=test_gem_source_fetch_problem I, [2024-04-20T05:42:48.767695 #295148] INFO -- : [ 20/881] 336471=test_rdoc_generator_darkfish I, [2024-04-20T05:42:48.820902 #295148] INFO -- : [ 21/881] 336473=test_rdoc_comment I, [2024-04-20T05:42:49.138547 #295148] INFO -- : [ 22/881] 336470=test_error_highlight I, [2024-04-20T05:42:50.178724 #295148] INFO -- : [ 23/881] 336473=test_resize I, [2024-04-20T05:42:50.189700 #295148] INFO -- : [ 24/881] 336473=test_function_entry I, [2024-04-20T05:42:50.211000 #295148] INFO -- : [ 25/881] 336473=test_gem_resolver_requirement_list I, [2024-04-20T05:42:50.229490 #295148] INFO -- : [ 26/881] 336473=test_arith_seq_beg_len_step I, [2024-04-20T05:42:50.428995 #295148] INFO -- : [ 27/881] 336472=test_pkcs7 I, [2024-04-20T05:42:50.658574 #295148] INFO -- : [ 28/881] 336473=test_enc_associate I, [2024-04-20T05:42:52.040021 #295148] INFO -- : [ 29/881] 336472=test_lazy_enumerator I, [2024-04-20T05:42:52.643120 #295148] INFO -- : [ 30/881] 336471=test_unix I, [2024-04-20T05:42:52.741384 #295148] INFO -- : [ 31/881] 336470=test_coder I, [2024-04-20T05:42:52.931659 #295148] INFO -- : [ 32/881] 336471=test_symbol I, [2024-04-20T05:42:53.015951 #295148] INFO -- : [ 33/881] 336470=test_gem_commands_pristine_command I, [2024-04-20T05:42:54.623543 #295148] INFO -- : [ 34/881] 336473=test_context I, [2024-04-20T05:42:54.813170 #295148] INFO -- : [ 35/881] 336472=test_nofree I, [2024-04-20T05:42:55.047150 #295148] INFO -- : [ 36/881] 336472=ruby_api_test I, [2024-04-20T05:42:56.064557 #295148] INFO -- : [ 37/881] 336473=test_find_executable I, [2024-04-20T05:42:56.372240 #295148] INFO -- : [ 38/881] 336473=test_rdoc_generator_json_index I, [2024-04-20T05:42:56.543845 #295148] INFO -- : [ 39/881] 336473=test_time_tz I, [2024-04-20T05:42:56.616284 #295148] INFO -- : [ 40/881] 336472=test_win32ole_event I, [2024-04-20T05:42:56.639302 #295148] INFO -- : [ 41/881] 336472=test_trace I, [2024-04-20T05:42:56.665853 #295148] INFO -- : [ 42/881] 336472=ractor_test I, [2024-04-20T05:42:57.036278 #295148] INFO -- : [ 43/881] 336473=test_win32ole_variable I, [2024-04-20T05:42:57.104941 #295148] INFO -- : [ 44/881] 336473=test_stringio I, [2024-04-20T05:42:57.217621 #295148] INFO -- : [ 45/881] 336472=test_arity I, [2024-04-20T05:42:57.267986 #295148] INFO -- : [ 46/881] 336472=test_io_wait_uncommon I, [2024-04-20T05:42:57.465222 #295148] INFO -- : [ 47/881] 336472=test_rdoc_class_module I, [2024-04-20T05:42:57.807239 #295148] INFO -- : [ 48/881] 336473=test_bignum I, [2024-04-20T05:42:58.552867 #295148] INFO -- : [ 49/881] 336473=test_gem_ci_detector I, [2024-04-20T05:42:58.625486 #295148] INFO -- : [ 50/881] 336473=test_threadgroup I, [2024-04-20T05:42:59.676196 #295148] INFO -- : [ 51/881] 336473=test_enum I, [2024-04-20T05:43:02.935161 #295148] INFO -- : [ 52/881] 336472=test_gem_specification I, [2024-04-20T05:43:03.003014 #295148] INFO -- : [ 53/881] 336471=test_have_macro I, [2024-04-20T05:43:04.170051 #295148] INFO -- : [ 54/881] 336470=test_gem_package I, [2024-04-20T05:43:04.724227 #295148] INFO -- : [ 55/881] 336473=test_complex2 I, [2024-04-20T05:43:04.770553 #295148] INFO -- : [ 56/881] 336473=test_resolve_symbol I, [2024-04-20T05:43:05.240114 #295148] INFO -- : [ 57/881] 336473=test_merge_keys I, [2024-04-20T05:43:05.288132 #295148] INFO -- : [ 58/881] 336473=test_rdoc_extend I, [2024-04-20T05:43:05.533214 #295148] INFO -- : [ 59/881] 336473=test_ipaddr I, [2024-04-20T05:43:05.707569 #295148] INFO -- : [ 60/881] 336473=test_mixed_unicode_escapes I, [2024-04-20T05:43:05.731071 #295148] INFO -- : [ 61/881] 336473=test_history I, [2024-04-20T05:43:05.862719 #295148] INFO -- : [ 62/881] 336473=test_rdoc_markup_to_ansi I, [2024-04-20T05:43:06.095182 #295148] INFO -- : [ 63/881] 336473=test_win32ole_variant I, [2024-04-20T05:43:06.139798 #295148] INFO -- : [ 64/881] 336473=test_gem_resolver_api_specification I, [2024-04-20T05:43:06.537225 #295148] INFO -- : [ 65/881] 336473=test_parser I, [2024-04-20T05:43:06.735012 #295148] INFO -- : [ 66/881] 336473=test_cgi_core I, [2024-04-20T05:43:06.833484 #295148] INFO -- : [ 67/881] 336473=test_ractor I, [2024-04-20T05:43:06.886279 #295148] INFO -- : [ 68/881] 336473=test_dns I, [2024-04-20T05:43:07.137738 #295148] INFO -- : [ 69/881] 336471=test_gem_commands_open_command I, [2024-04-20T05:43:07.749179 #295148] INFO -- : [ 70/881] 336473=test_gem_source_lock I, [2024-04-20T05:43:08.080301 #295148] INFO -- : [ 71/881] 336473=test_gem I, [2024-04-20T05:43:08.522382 #295148] INFO -- : [ 72/881] 336470=parse_stream_test I, [2024-04-20T05:43:08.548074 #295148] INFO -- : [ 73/881] 336470=test_ractor I, [2024-04-20T05:43:09.353284 #295148] INFO -- : [ 74/881] 336471=test_my_integer I, [2024-04-20T05:43:09.378944 #295148] INFO -- : [ 75/881] 336471=test_thread I, [2024-04-20T05:43:11.166739 #295148] INFO -- : [ 76/881] 336470=json_ext_parser_test I, [2024-04-20T05:43:11.315040 #295148] INFO -- : [ 77/881] 336470=test_rendering I, [2024-04-20T05:43:11.668958 #295148] INFO -- : [ 78/881] 336470=test_debugger_integration I, [2024-04-20T05:43:11.816545 #295148] INFO -- : [ 79/881] 336470=test_ssl I, [2024-04-20T05:43:14.531062 #295148] INFO -- : [ 80/881] 336470=test_singleton_function I, [2024-04-20T05:43:14.534498 #295148] INFO -- : [ 81/881] 336470=test_ancdata I, [2024-04-20T05:43:14.563782 #295148] INFO -- : [ 82/881] 336470=test_rb_str_dup I, [2024-04-20T05:43:14.615004 #295148] INFO -- : [ 83/881] 336470=test_reline_key I, [2024-04-20T05:43:14.653308 #295148] INFO -- : [ 84/881] 336470=test_marshal I, [2024-04-20T05:43:15.897445 #295148] INFO -- : [ 85/881] 336473=test_unicode_normalize I, [2024-04-20T05:43:17.707821 #295148] INFO -- : [ 86/881] 336470=test_weakref I, [2024-04-20T05:43:18.726096 #295148] INFO -- : [ 87/881] 336470=test_nonblock I, [2024-04-20T05:43:18.812964 #295148] INFO -- : [ 88/881] 336470=test_alias I, [2024-04-20T05:43:19.867976 #295148] INFO -- : [ 89/881] 336470=test_timeout I, [2024-04-20T05:43:20.058009 #295148] INFO -- : [ 90/881] 336472=test_call I, [2024-04-20T05:43:21.278735 #295148] INFO -- : [ 91/881] 336472=test_https_proxy I, [2024-04-20T05:43:21.632758 #295148] INFO -- : [ 92/881] 336472=test_rubygems I, [2024-04-20T05:43:21.683140 #295148] INFO -- : [ 93/881] 336470=test_cgi_modruby I, [2024-04-20T05:43:21.832868 #295148] INFO -- : [ 94/881] 336470=test_integer I, [2024-04-20T05:43:22.761333 #295148] INFO -- : [ 95/881] 336472=test_super I, [2024-04-20T05:43:25.346410 #295148] INFO -- : [ 96/881] 336471=test_rubyoptions I, [2024-04-20T05:43:26.325781 #295148] INFO -- : [ 97/881] 336472=test_gem_resolver_git_specification I, [2024-04-20T05:43:27.787331 #295148] INFO -- : [ 98/881] 336472=test_object_references I, [2024-04-20T05:43:28.345627 #295148] INFO -- : [ 99/881] 336472=test_usrmarshal I, [2024-04-20T05:43:29.418716 #295148] INFO -- : [100/881] 336472=test_nextafter I, [2024-04-20T05:43:30.495388 #295148] INFO -- : [101/881] 336472=test_capacity I, [2024-04-20T05:43:30.611655 #295148] INFO -- : [102/881] 336472=test_gem_request_set_lockfile_tokenizer I, [2024-04-20T05:43:30.998813 #295148] INFO -- : [103/881] 336472=test_stat I, [2024-04-20T05:43:31.039518 #295148] INFO -- : [104/881] 336472=test_have_func I, [2024-04-20T05:43:45.840202 #295148] INFO -- : [105/881] 336470=test_integer I, [2024-04-20T05:43:46.052769 #295148] INFO -- : [106/881] 336470=desugar_compiler_test I, [2024-04-20T05:43:46.146155 #295148] INFO -- : [107/881] 336470=test_dryrun I, [2024-04-20T05:43:46.605125 #295148] INFO -- : [108/881] 336470=test_rdoc_attr I, [2024-04-20T05:43:48.538474 #295148] INFO -- : [109/881] 336470=test_env I, [2024-04-20T05:43:52.819077 #295148] INFO -- : [110/881] 336473=test_gem_commands_setup_command I, [2024-04-20T05:44:00.087181 #295148] INFO -- : [111/881] 336473=test_enumerable I, [2024-04-20T05:44:00.551307 #295148] INFO -- : [112/881] 336473=test_config I, [2024-04-20T05:44:06.901246 #295148] INFO -- : [113/881] 336473=test_gem_resolver_vendor_set I, [2024-04-20T05:44:07.244019 #295148] INFO -- : [114/881] 336473=test_gem_resolver_api_set I, [2024-04-20T05:44:08.232362 #295148] INFO -- : [115/881] 336473=test_gem_safe_marshal I, [2024-04-20T05:44:09.973778 #295148] INFO -- : [116/881] 336471=test_transcode I, [2024-04-20T05:44:13.035265 #295148] INFO -- : [117/881] 336471=json_generator_test I, [2024-04-20T05:44:13.998631 #295148] INFO -- : [118/881] 336471=test_eval I, [2024-04-20T05:44:17.022176 #295148] INFO -- : [119/881] 336471=test_x509store I, [2024-04-20T05:44:18.074756 #295148] INFO -- : [120/881] 336473=test_rdoc_code_object I, [2024-04-20T05:44:20.953634 #295148] INFO -- : [121/881] 336471=test_update I, [2024-04-20T05:44:21.012032 #295148] INFO -- : [122/881] 336471=test_fips I, [2024-04-20T05:44:22.893056 #295148] INFO -- : [123/881] 336473=test_x509name I, [2024-04-20T05:44:23.015077 #295148] INFO -- : [124/881] 336473=test_random_formatter I, [2024-04-20T05:44:23.236816 #295148] INFO -- : [125/881] 336473=test_helper I, [2024-04-20T05:44:24.159822 #295148] INFO -- : [126/881] 336473=test_jaro_winkler I, [2024-04-20T05:44:24.220316 #295148] INFO -- : [127/881] 336473=test_lambda I, [2024-04-20T05:44:25.177997 #295148] INFO -- : [128/881] 336473=test_ast I, [2024-04-20T05:44:25.405372 #295148] INFO -- : [129/881] 336471=test_gem_request_set_gem_dependency_api I, [2024-04-20T05:44:26.596064 #295148] INFO -- : [130/881] 336470=test_webauthn_listener I, [2024-04-20T05:44:26.802471 #295148] INFO -- : Leaked file descriptor: WebauthnListenerTest#test_wait_for_otp_code_options_request: 9 : # I, [2024-04-20T05:44:26.886118 #295148] INFO -- : COMMAND PID USER FD TYPE DEVICE SIZE/OFF NODE NAME I, [2024-04-20T05:44:26.886496 #295148] INFO -- : ruby 336470 sipeed 9u IPv4 182249 0t0 TCP localhost:33099->localhost:34264 (CLOSE_WAIT) I, [2024-04-20T05:44:26.943975 #295148] INFO -- : [131/881] 336471=errors_test I, [2024-04-20T05:44:27.134763 #295148] INFO -- : [132/881] 336470=test_regexp I, [2024-04-20T05:44:28.175860 #295148] INFO -- : [133/881] 336471=test_gem_commands_check_command I, [2024-04-20T05:44:28.416298 #295148] INFO -- : [134/881] 336471=test_tmpdir I, [2024-04-20T05:44:28.926020 #295148] INFO -- : [135/881] 336472=test_rdoc_markup_document I, [2024-04-20T05:44:28.949741 #295148] INFO -- : [136/881] 336471=test_integer_comb I, [2024-04-20T05:44:28.999256 #295148] INFO -- : [137/881] 336472=test_vm_dump I, [2024-04-20T05:44:29.021430 #295148] INFO -- : [138/881] 336472=test_udp I, [2024-04-20T05:44:29.625958 #295148] INFO -- : [139/881] 336472=test_data_error I, [2024-04-20T05:44:29.664888 #295148] INFO -- : [140/881] 336472=bom_test I, [2024-04-20T05:44:29.770208 #295148] INFO -- : [141/881] 336472=test_force_exit I, [2024-04-20T05:44:30.545090 #295148] INFO -- : [142/881] 336472=test_file I, [2024-04-20T05:44:37.092021 #295148] INFO -- : [143/881] 336472=test_ostruct I, [2024-04-20T05:44:37.952530 #295148] INFO -- : Closed file descriptor: TestRegexp#test_inspect_under_gc_compact_stress: 9 I, [2024-04-20T05:44:38.516207 #295148] INFO -- : [144/881] 336472=unescape_test I, [2024-04-20T05:44:49.374187 #295148] INFO -- : [145/881] 336471=static_inspect_test I, [2024-04-20T05:44:49.513611 #295148] INFO -- : [146/881] 336471=test_erb_command I, [2024-04-20T05:44:49.616141 #295148] INFO -- : [147/881] 336471=test_helper I, [2024-04-20T05:44:49.651259 #295148] INFO -- : [148/881] 336471=test_encoding I, [2024-04-20T05:44:51.183140 #295148] INFO -- : [149/881] 336471=test_gem_uri_formatter I, [2024-04-20T05:44:51.683077 #295148] INFO -- : [150/881] 336471=test_project_sanity I, [2024-04-20T05:44:52.491592 #295148] INFO -- : [151/881] 336471=test_range I, [2024-04-20T05:44:52.665858 #295148] INFO -- : [152/881] 336472=test_pty I, [2024-04-20T05:44:55.118234 #295148] INFO -- : [153/881] 336472=test_dup I, [2024-04-20T05:44:56.464462 #295148] INFO -- : [154/881] 336472=test_constant I, [2024-04-20T05:44:59.442944 #295148] INFO -- : [155/881] 336471=command_line_test I, [2024-04-20T05:44:59.509338 #295148] INFO -- : [156/881] 336471=test_rdoc_ri_paths I, [2024-04-20T05:44:59.698249 #295148] INFO -- : [157/881] 336471=test_ensured I, [2024-04-20T05:45:00.181609 #295148] INFO -- : [158/881] 336471=library_symbols_test I, [2024-04-20T05:45:00.312611 #295148] INFO -- : [159/881] 336471=test_addr I, [2024-04-20T05:45:01.261032 #295148] INFO -- : [160/881] 336471=test_locale I, [2024-04-20T05:45:01.496524 #295148] INFO -- : [161/881] 336471=test_ts I, [2024-04-20T05:45:06.695954 #295148] INFO -- : [162/881] 336471=test_object I, [2024-04-20T05:45:06.733865 #295148] INFO -- : [163/881] 336471=test_cgi_header I, [2024-04-20T05:45:06.814115 #295148] INFO -- : [164/881] 336471=heredoc_dedent_test I, [2024-04-20T05:45:06.892954 #295148] INFO -- : [165/881] 336471=version_test I, [2024-04-20T05:45:07.002727 #295148] INFO -- : [166/881] 336471=test_gem_gemcutter_utilities I, [2024-04-20T05:45:08.289768 #295148] INFO -- : [167/881] 336471=test_basicinstructions I, [2024-04-20T05:45:08.804465 #295148] INFO -- : [168/881] 336471=test_gem_command_manager I, [2024-04-20T05:45:09.876764 #295148] INFO -- : [169/881] 336471=test_key_actor_emacs I, [2024-04-20T05:45:10.819112 #295148] INFO -- : [170/881] 336471=test_arithmetic_sequence I, [2024-04-20T05:45:10.935859 #295148] INFO -- : [171/881] 336471=test_timeout I, [2024-04-20T05:45:10.952598 #295148] INFO -- : [172/881] 336471=test_normalize I, [2024-04-20T05:45:11.322583 #295148] INFO -- : [173/881] 336471=test_ossl I, [2024-04-20T05:45:14.842282 #295148] INFO -- : [174/881] 336472=test_change_word I, [2024-04-20T05:45:14.887048 #295148] INFO -- : [175/881] 336472=compiler_test I, [2024-04-20T05:45:14.915866 #295148] INFO -- : [176/881] 336472=test_flip I, [2024-04-20T05:45:16.131070 #295148] INFO -- : [177/881] 336472=test_sleep I, [2024-04-20T05:45:20.220017 #295148] INFO -- : [178/881] 336472=test_date_arith I, [2024-04-20T05:45:20.339242 #295148] INFO -- : [179/881] 336472=test_object I, [2024-04-20T05:45:23.370597 #295148] INFO -- : [180/881] 336472=test_ruby_lex I, [2024-04-20T05:45:24.578538 #295148] INFO -- : [181/881] 336472=test_gem_local_remote_options I, [2024-04-20T05:45:24.979303 #295148] INFO -- : [182/881] 336472=test_big5 I, [2024-04-20T05:45:25.055795 #295148] INFO -- : [183/881] 336472=test_func I, [2024-04-20T05:45:30.315700 #295148] INFO -- : [184/881] 336471=test_pointer I, [2024-04-20T05:45:34.045634 #295148] INFO -- : [185/881] 336471=test_ractor I, [2024-04-20T05:45:34.153103 #295148] INFO -- : [186/881] 336472=test_type I, [2024-04-20T05:45:34.296924 #295148] INFO -- : [187/881] 336472=test_signedness I, [2024-04-20T05:45:34.348885 #295148] INFO -- : [188/881] 336471=test_tsort I, [2024-04-20T05:45:34.513680 #295148] INFO -- : [189/881] 336471=test_rdoc_rd_block_parser I, [2024-04-20T05:45:35.527883 #295148] INFO -- : [190/881] 336471=test_weakkeymap I, [2024-04-20T05:45:36.132799 #295148] INFO -- : [191/881] 336471=test_gem_commands_push_command I, [2024-04-20T05:45:38.331132 #295148] INFO -- : [192/881] 336471=test_numhash I, [2024-04-20T05:45:38.352109 #295148] INFO -- : [193/881] 336471=test_pkey_rsa I, [2024-04-20T05:45:38.853257 #295148] INFO -- : [194/881] 336470=test_gem_platform I, [2024-04-20T05:45:39.519188 #295148] INFO -- : [195/881] 336470=test_date_strptime I, [2024-04-20T05:45:40.404271 #295148] INFO -- : [196/881] 336470=test_gem_package_task I, [2024-04-20T05:45:40.487265 #295148] INFO -- : [197/881] 336470=test_placearg I, [2024-04-20T05:45:40.908670 #295148] INFO -- : [198/881] 336471=test_rdoc_markup_hard_break I, [2024-04-20T05:45:40.953262 #295148] INFO -- : [199/881] 336471=test_win32ole_method I, [2024-04-20T05:45:40.978983 #295148] INFO -- : [200/881] 336471=test_delete I, [2024-04-20T05:45:41.198152 #295148] INFO -- : [201/881] 336471=test_keyword I, [2024-04-20T05:45:41.279956 #295148] INFO -- : [202/881] 336470=test_class_name_check I, [2024-04-20T05:45:41.492731 #295148] INFO -- : [203/881] 336470=test_fd_setsize I, [2024-04-20T05:45:41.530244 #295148] INFO -- : [204/881] 336470=test_continuation I, [2024-04-20T05:45:41.726937 #295148] INFO -- : [205/881] 336470=test_file_exhaustive I, [2024-04-20T05:45:44.863025 #295148] INFO -- : [206/881] 336471=test_files_test I, [2024-04-20T05:45:45.587887 #295148] INFO -- : [207/881] 336471=test_gem_update_suggestion I, [2024-04-20T05:45:46.063809 #295148] INFO -- : [208/881] 336471=test_logger I, [2024-04-20T05:45:46.232226 #295148] INFO -- : [209/881] 336471=test_gem_resolver_lock_set I, [2024-04-20T05:45:46.421376 #295148] INFO -- : [210/881] 336471=test_not I, [2024-04-20T05:45:46.571924 #295148] INFO -- : [211/881] 336471=test_import I, [2024-04-20T05:45:51.599994 #295148] INFO -- : [212/881] 336471=test_rdoc_parser_markdown I, [2024-04-20T05:45:51.653419 #295148] INFO -- : [213/881] 336471=test_date_compat I, [2024-04-20T05:45:51.666956 #295148] INFO -- : [214/881] 336472=test_rdoc_markup_to_html I, [2024-04-20T05:45:51.677986 #295148] INFO -- : [215/881] 336471=test_bug-14834 I, [2024-04-20T05:45:52.190242 #295148] INFO -- : [216/881] 336471=test_terminfo I, [2024-04-20T05:45:52.197349 #295148] INFO -- : [217/881] 336471=test_compile_prism I, [2024-04-20T05:45:52.231516 #295148] INFO -- : [218/881] 336472=test_path I, [2024-04-20T05:45:52.307412 #295148] INFO -- : [219/881] 336472=test_case_mapping I, [2024-04-20T05:45:52.381770 #295148] INFO -- : [220/881] 336472=test_bn I, [2024-04-20T05:45:52.509356 #295148] INFO -- : [221/881] 336472=test_win32ole_param_event I, [2024-04-20T05:45:52.520616 #295148] INFO -- : [222/881] 336472=test_http I, [2024-04-20T05:45:54.951493 #295148] INFO -- : [223/881] 336471=test_addrinfo I, [2024-04-20T05:45:55.183514 #295148] INFO -- : [224/881] 336471=test_tree_spell_checker I, [2024-04-20T05:45:55.389540 #295148] INFO -- : [225/881] 336471=test_filter I, [2024-04-20T05:45:55.625107 #295148] INFO -- : [226/881] 336471=test_gem_gem_runner I, [2024-04-20T05:45:55.916907 #295148] INFO -- : [227/881] 336471=test_data I, [2024-04-20T05:45:55.953074 #295148] INFO -- : [228/881] 336471=static_literals_test I, [2024-04-20T05:45:56.015890 #295148] INFO -- : [229/881] 336471=test_rdoc_method_attr I, [2024-04-20T05:45:56.915112 #295148] INFO -- : [230/881] 336471=test_enumerator I, [2024-04-20T05:45:56.954565 #295148] INFO -- : [231/881] 336471=test_rdoc_parser_changelog I, [2024-04-20T05:45:57.286011 #295148] INFO -- : [232/881] 336471=parameters_signature_test I, [2024-04-20T05:45:57.369096 #295148] INFO -- : [233/881] 336471=test_koi8 I, [2024-04-20T05:45:57.413715 #295148] INFO -- : [234/881] 336471=test_unicode I, [2024-04-20T05:45:57.444126 #295148] INFO -- : [235/881] 336471=test_rdoc_generator_pot I, [2024-04-20T05:45:57.462997 #295148] INFO -- : [236/881] 336471=test_ssl_session I, [2024-04-20T05:45:57.877841 #295148] INFO -- : [237/881] 336470=test_thread_cv I, [2024-04-20T05:45:58.646301 #295148] INFO -- : [238/881] 336470=test_lexer I, [2024-04-20T05:45:58.800765 #295148] INFO -- : [239/881] 336470=test_gem_uri I, [2024-04-20T05:45:59.055532 #295148] INFO -- : [240/881] 336470=test_key_event_record I, [2024-04-20T05:45:59.072970 #295148] INFO -- : [241/881] 336470=test_notimplement I, [2024-04-20T05:45:59.115376 #295148] INFO -- : [242/881] 336470=test_random I, [2024-04-20T05:45:59.173755 #295148] INFO -- : [243/881] 336470=test_gem_resolver_vendor_specification I, [2024-04-20T05:45:59.403913 #295148] INFO -- : [244/881] 336470=test_gem_commands_update_command I, [2024-04-20T05:46:02.321058 #295148] INFO -- : [245/881] 336471=test_human_typo I, [2024-04-20T05:46:02.370754 #295148] INFO -- : [246/881] 336471=test_primitive I, [2024-04-20T05:46:02.445442 #295148] INFO -- : [247/881] 336471=test_rbconfig I, [2024-04-20T05:46:02.625253 #295148] INFO -- : [248/881] 336471=test_pair I, [2024-04-20T05:46:06.949257 #295148] INFO -- : [249/881] 336470=test_gem_commands_yank_command I, [2024-04-20T05:46:07.806457 #295148] INFO -- : [250/881] 336470=test_win32ole_param I, [2024-04-20T05:46:07.822186 #295148] INFO -- : [251/881] 336470=test_document I, [2024-04-20T05:46:07.855600 #295148] INFO -- : [252/881] 336470=test_acceptable I, [2024-04-20T05:46:08.223788 #295148] INFO -- : [253/881] 336470=test_euc_jp I, [2024-04-20T05:46:08.244947 #295148] INFO -- : [254/881] 336470=test_rdoc_generator_pot_po_entry I, [2024-04-20T05:46:08.291744 #295148] INFO -- : [255/881] 336470=test_chilled I, [2024-04-20T05:46:08.312942 #295148] INFO -- : [256/881] 336470=test_name_error_extension I, [2024-04-20T05:46:08.347744 #295148] INFO -- : [257/881] 336470=test_rdoc_i18n_locale I, [2024-04-20T05:46:08.404149 #295148] INFO -- : [258/881] 336470=test_set_len I, [2024-04-20T05:46:08.436404 #295148] INFO -- : [259/881] 336470=test_encoding I, [2024-04-20T05:46:08.501833 #295148] INFO -- : [260/881] 336470=test_httpresponses I, [2024-04-20T05:46:08.571254 #295148] INFO -- : [261/881] 336470=test_gem_resolver_local_specification I, [2024-04-20T05:46:08.680953 #295148] INFO -- : [262/881] 336470=test_httpheader I, [2024-04-20T05:46:08.856536 #295148] INFO -- : [263/881] 336470=test_rdoc_ri_driver I, [2024-04-20T05:46:09.151258 #295148] INFO -- : [264/881] 336472=test_install I, [2024-04-20T05:46:10.733553 #295148] INFO -- : [265/881] 336472=test_rdoc_markup_to_label I, [2024-04-20T05:46:10.931465 #295148] INFO -- : [266/881] 336470=test_sockopt I, [2024-04-20T05:46:10.988329 #295148] INFO -- : [267/881] 336470=json_encoding_test I, [2024-04-20T05:46:11.011787 #295148] INFO -- : [268/881] 336470=test_color I, [2024-04-20T05:46:11.175841 #295148] INFO -- : [269/881] 336472=test_key_stroke I, [2024-04-20T05:46:11.236357 #295148] INFO -- : [270/881] 336472=reflection_test I, [2024-04-20T05:46:11.277118 #295148] INFO -- : [271/881] 336472=test_emoji_breaks I, [2024-04-20T05:46:11.338287 #295148] INFO -- : [272/881] 336472=test_gem_bundler_version_finder I, [2024-04-20T05:46:11.484515 #295148] INFO -- : [273/881] 336470=test_within_pipe I, [2024-04-20T05:46:11.575220 #295148] INFO -- : [274/881] 336472=test_rdoc_markup_to_bs I, [2024-04-20T05:46:11.613901 #295148] INFO -- : [275/881] 336470=test_help I, [2024-04-20T05:46:11.648714 #295148] INFO -- : [276/881] 336470=test_files_lib I, [2024-04-20T05:46:12.025306 #295148] INFO -- : [277/881] 336472=test_gem_commands_unpack_command I, [2024-04-20T05:46:14.179334 #295148] INFO -- : [278/881] 336472=test_beginendblock I, [2024-04-20T05:46:16.736403 #295148] INFO -- : [279/881] 336472=test_to_ary_concat I, [2024-04-20T05:46:22.955951 #295148] INFO -- : [280/881] 336472=test_time I, [2024-04-20T05:46:24.118643 #295148] INFO -- : [281/881] 336472=test_webauthn_listener_response I, [2024-04-20T05:46:24.248509 #295148] INFO -- : [282/881] 336472=test_stream I, [2024-04-20T05:46:24.337282 #295148] INFO -- : [283/881] 336472=test_rdoc_markup_pre_process I, [2024-04-20T05:46:24.876588 #295148] INFO -- : [284/881] 336472=test_printf I, [2024-04-20T05:46:24.947385 #295148] INFO -- : [285/881] 336471=test_pinned I, [2024-04-20T05:46:25.031046 #295148] INFO -- : [286/881] 336472=test_history I, [2024-04-20T05:46:25.123949 #295148] INFO -- : [287/881] 336472=test_mkmf I, [2024-04-20T05:46:25.257465 #295148] INFO -- : [288/881] 336471=test_date_marshal I, [2024-04-20T05:46:25.285823 #295148] INFO -- : [289/881] 336472=test_delegate I, [2024-04-20T05:46:25.327729 #295148] INFO -- : [290/881] 336471=test_popen_deadlock I, [2024-04-20T05:46:25.721230 #295148] INFO -- : [291/881] 336472=test_exit I, [2024-04-20T05:46:26.004119 #295148] INFO -- : [292/881] 336472=test_recursion I, [2024-04-20T05:46:26.123633 #295148] INFO -- : [293/881] 336472=test_ractor I, [2024-04-20T05:46:26.532183 #295148] INFO -- : [294/881] 336472=test_gem_security I, [2024-04-20T05:46:29.262509 #295148] INFO -- : [295/881] 336471=test_rdoc_servlet I, [2024-04-20T05:46:30.038023 #295148] INFO -- : [296/881] 336471=test_digest I, [2024-04-20T05:46:30.123597 #295148] INFO -- : [297/881] 336471=test_closure I, [2024-04-20T05:46:33.027706 #295148] INFO -- : [298/881] 336471=test_bundled_ca I, [2024-04-20T05:46:34.097447 #295148] INFO -- : [299/881] 336471=test_multi_irb_commands I, [2024-04-20T05:46:34.142696 #295148] INFO -- : [300/881] 336471=test_fiber I, [2024-04-20T05:46:36.072209 #295148] INFO -- : [301/881] 336470=test_open3 I, [2024-04-20T05:46:47.136674 #295148] INFO -- : [302/881] 336471=test_gem_commands_build_command I, [2024-04-20T05:46:49.701390 #295148] INFO -- : [303/881] 336471=test_interned_str I, [2024-04-20T05:46:49.992067 #295148] INFO -- : [304/881] 336471=test_case_comprehensive I, [2024-04-20T05:46:54.782870 #295148] INFO -- : [305/881] 336470=test_gem_commands_server_command I, [2024-04-20T05:46:54.875670 #295148] INFO -- : [306/881] 336470=test_io_m17n I, [2024-04-20T05:47:02.615562 #295148] INFO -- : [307/881] 336470=test_variable_name_check I, [2024-04-20T05:47:02.856396 #295148] INFO -- : [308/881] 336470=test_did_you_mean I, [2024-04-20T05:47:03.191981 #295148] INFO -- : [309/881] 336470=test_cmethod I, [2024-04-20T05:47:03.432051 #295148] INFO -- : [310/881] 336470=test_tracer I, [2024-04-20T05:47:03.451134 #295148] INFO -- : [311/881] 336470=test_append I, [2024-04-20T05:47:03.468754 #295148] INFO -- : [312/881] 336470=test_option I, [2024-04-20T05:47:04.337384 #295148] INFO -- : [313/881] 336470=test_rdoc_markup_heading I, [2024-04-20T05:47:04.577186 #295148] INFO -- : [314/881] 336470=test_exception_at_throwing I, [2024-04-20T05:47:04.793583 #295148] INFO -- : [315/881] 336470=test_iseq I, [2024-04-20T05:47:08.818793 #295148] INFO -- : [316/881] 336470=test_pkey_dsa I, [2024-04-20T05:47:22.367541 #295148] INFO -- : [317/881] 336470=test_ocsp I, [2024-04-20T05:47:24.970311 #295148] INFO -- : [318/881] 336470=test_class I, [2024-04-20T05:47:25.014900 #295148] INFO -- : [319/881] 336470=test_scheduler I, [2024-04-20T05:47:25.359337 #295148] INFO -- : [320/881] 336470=test_win32ole_variant_outarg I, [2024-04-20T05:47:25.399308 #295148] INFO -- : [321/881] 336470=test_gem_source_subpath_problem I, [2024-04-20T05:47:26.139536 #295148] INFO -- : [322/881] 336470=test_dln I, [2024-04-20T05:47:26.164355 #295148] INFO -- : [323/881] 336470=json_common_interface_test I, [2024-04-20T05:47:26.278478 #295148] INFO -- : [324/881] 336470=json_parser_test I, [2024-04-20T05:47:26.521197 #295148] INFO -- : [325/881] 336470=test_nomethod_error I, [2024-04-20T05:47:26.542596 #295148] INFO -- : [326/881] 336470=memsize_test I, [2024-04-20T05:47:26.588937 #295148] INFO -- : [327/881] 336470=test_config I, [2024-04-20T05:47:26.792119 #295148] INFO -- : [328/881] 336470=test_pkg_config I, [2024-04-20T05:47:27.012286 #295148] INFO -- : [329/881] 336470=test_cparser I, [2024-04-20T05:47:30.835984 #295148] INFO -- : [330/881] 336470=test_struct I, [2024-04-20T05:47:30.881876 #295148] INFO -- : [331/881] 336470=test_rdoc_markup_to_html_snippet I, [2024-04-20T05:47:31.249645 #295148] INFO -- : [332/881] 336470=magic_comment_test I, [2024-04-20T05:47:31.288310 #295148] INFO -- : [333/881] 336470=fuzzer_test I, [2024-04-20T05:47:31.346099 #295148] INFO -- : [334/881] 336470=test_rdoc_markup_include I, [2024-04-20T05:47:31.389742 #295148] INFO -- : [335/881] 336470=test_sexp I, [2024-04-20T05:47:31.977763 #295148] INFO -- : [336/881] 336470=test_variable I, [2024-04-20T05:47:32.115232 #295148] INFO -- : [337/881] 336470=test_win32ole_variant_m I, [2024-04-20T05:47:32.133593 #295148] INFO -- : [338/881] 336470=test_engine I, [2024-04-20T05:47:32.179265 #295148] INFO -- : [339/881] 336470=test_allocation I, [2024-04-20T05:47:49.180811 #295148] INFO -- : [340/881] 336470=test_div I, [2024-04-20T05:47:49.201740 #295148] INFO -- : [341/881] 336470=test_key_error I, [2024-04-20T05:47:49.225308 #295148] INFO -- : [342/881] 336470=test_insns_leaf I, [2024-04-20T05:47:49.250560 #295148] INFO -- : [343/881] 336470=test_serialize_subclasses I, [2024-04-20T05:47:49.274966 #295148] INFO -- : [344/881] 336470=test_deprecated I, [2024-04-20T05:47:49.306475 #295148] INFO -- : [345/881] 336470=test_color_printer I, [2024-04-20T05:47:49.314978 #295148] INFO -- : [346/881] 336470=test_files_test_1 I, [2024-04-20T05:47:49.366017 #295148] INFO -- : [347/881] 336470=test_set I, [2024-04-20T05:47:49.507089 #295148] INFO -- : [348/881] 336470=test_struct I, [2024-04-20T05:47:55.036251 #295148] INFO -- : [349/881] 336470=test_gem_path_support I, [2024-04-20T05:47:55.384805 #295148] INFO -- : [350/881] 336470=test_x509req I, [2024-04-20T05:47:56.933798 #295148] INFO -- : [351/881] 336470=test_mutex I, [2024-04-20T05:47:58.101066 #295148] INFO -- : [352/881] 336470=test_rdoc_rd_inline I, [2024-04-20T05:47:58.187254 #295148] INFO -- : [353/881] 336470=test_float I, [2024-04-20T05:48:02.043162 #295148] INFO -- : [354/881] 336470=test_require I, [2024-04-20T05:48:04.437821 #295148] INFO -- : [355/881] 336472=test_cgi_cookie I, [2024-04-20T05:48:04.707402 #295148] INFO -- : [356/881] 336472=test_regex_casefold I, [2024-04-20T05:48:08.668378 #295148] INFO -- : [357/881] 336472=test_refinement I, [2024-04-20T05:48:21.078768 #295148] INFO -- : [358/881] 336470=test_gem_commands_signout_command I, [2024-04-20T05:48:21.245584 #295148] INFO -- : [359/881] 336470=test_gem_source_git I, [2024-04-20T05:48:24.903076 #295148] INFO -- : [360/881] 336470=test_dir_m17n I, [2024-04-20T05:48:31.606106 #295148] INFO -- : [361/881] 336472=test_gem_resolver_installer_set I, [2024-04-20T05:48:32.969512 #295148] INFO -- : [362/881] 336472=test_cgi_session I, [2024-04-20T05:48:33.085977 #295148] INFO -- : [363/881] 336472=test_rdoc_rd I, [2024-04-20T05:48:33.178248 #295148] INFO -- : [364/881] 336472=test_rdoc_top_level I, [2024-04-20T05:48:34.519020 #295148] INFO -- : [365/881] 336470=test_metaclass I, [2024-04-20T05:48:34.577143 #295148] INFO -- : [366/881] 336470=test_signal I, [2024-04-20T05:48:35.118097 #295148] INFO -- : [367/881] 336472=test_fixnum I, [2024-04-20T05:48:35.213319 #295148] INFO -- : [368/881] 336472=test_x509crl I, [2024-04-20T05:48:36.652033 #295148] INFO -- : [369/881] 336472=test_process I, [2024-04-20T05:48:36.860511 #295148] INFO -- : [370/881] 336472=test_windows_1252 I, [2024-04-20T05:48:36.874065 #295148] INFO -- : [371/881] 336472=test_input_method I, [2024-04-20T05:48:37.215514 #295148] INFO -- : [372/881] 336472=test_digest_extend I, [2024-04-20T05:48:37.294664 #295148] INFO -- : [373/881] 336472=test_string I, [2024-04-20T05:48:37.346027 #295148] INFO -- : [374/881] 336472=test_iterator I, [2024-04-20T05:48:37.831363 #295148] INFO -- : [375/881] 336472=test_omap I, [2024-04-20T05:48:37.904958 #295148] INFO -- : [376/881] 336472=test_debug I, [2024-04-20T05:48:37.938027 #295148] INFO -- : [377/881] 336472=pattern_test I, [2024-04-20T05:48:38.023119 #295148] INFO -- : [378/881] 336472=test_memory_view I, [2024-04-20T05:48:38.168920 #295148] INFO -- : [379/881] 336472=test_shellwords I, [2024-04-20T05:48:38.222309 #295148] INFO -- : [380/881] 336472=test_new I, [2024-04-20T05:48:38.270766 #295148] INFO -- : [381/881] 336472=test_cipher I, [2024-04-20T05:48:38.734728 #295148] INFO -- : [382/881] 336472=test_gem_security_signer I, [2024-04-20T05:48:39.727298 #295148] INFO -- : [383/881] 336472=test_gem_resolver_git_set I, [2024-04-20T05:48:39.753182 #295148] INFO -- : [384/881] 336470=test_storage I, [2024-04-20T05:48:39.813289 #295148] INFO -- : [385/881] 336470=test_gem_dependency_list I, [2024-04-20T05:48:40.542388 #295148] INFO -- : [386/881] 336470=test_benchmark I, [2024-04-20T05:48:41.692321 #295148] INFO -- : [387/881] 336472=test_win32ole_method_event I, [2024-04-20T05:48:41.717326 #295148] INFO -- : [388/881] 336472=test_nesting_parser I, [2024-04-20T05:48:41.901969 #295148] INFO -- : [389/881] 336472=test_gem_source I, [2024-04-20T05:48:42.905996 #295148] INFO -- : [390/881] 336470=test_scalar_scanner I, [2024-04-20T05:48:42.979496 #295148] INFO -- : [391/881] 336470=test_gem_commands_outdated_command I, [2024-04-20T05:48:43.382592 #295148] INFO -- : [392/881] 336470=test_array I, [2024-04-20T05:48:43.823475 #295148] INFO -- : [393/881] 336472=test_gem_package_tar_writer I, [2024-04-20T05:48:44.673926 #295148] INFO -- : [394/881] 336472=test_abi I, [2024-04-20T05:48:46.432969 #295148] INFO -- : [395/881] 336472=test_provider I, [2024-04-20T05:48:49.530344 #295148] INFO -- : [396/881] 336472=test_rdoc_parser_simple I, [2024-04-20T05:48:49.576558 #295148] INFO -- : [397/881] 336472=test_load I, [2024-04-20T05:48:49.660254 #295148] INFO -- : [398/881] 336472=test_gem_commands_rebuild_command I, [2024-04-20T05:48:50.059658 #295148] INFO -- : [399/881] 336472=test_yamldbm I, [2024-04-20T05:48:50.062215 #295148] INFO -- : [400/881] 336472=test_https I, [2024-04-20T05:48:51.154182 #295148] INFO -- : [401/881] 336472=test_gem_ext_builder I, [2024-04-20T05:48:59.076798 #295148] INFO -- : [402/881] 336472=test_evaluation I, [2024-04-20T05:48:59.098950 #295148] INFO -- : [403/881] 336472=test_x509ext I, [2024-04-20T05:48:59.119431 #295148] INFO -- : [404/881] 336472=test_erb I, [2024-04-20T05:48:59.554601 #295148] INFO -- : [405/881] 336472=test_gem_source_installed I, [2024-04-20T05:48:59.577157 #295148] INFO -- : [406/881] 336472=test_len I, [2024-04-20T05:48:59.603333 #295148] INFO -- : [407/881] 336472=test_yield_block I, [2024-04-20T05:48:59.706177 #295148] INFO -- : [408/881] 336472=test_gem_commands_cert_command I, [2024-04-20T05:49:13.283361 #295148] INFO -- : [409/881] 336472=test_completion I, [2024-04-20T05:49:18.160635 #295148] INFO -- : [410/881] 336472=test_rational I, [2024-04-20T05:49:18.302648 #295148] INFO -- : [411/881] 336472=test_rational2 I, [2024-04-20T05:49:18.373204 #295148] INFO -- : [412/881] 336472=test_assembler I, [2024-04-20T05:49:18.384839 #295148] INFO -- : [413/881] 336472=test_spell_checker I, [2024-04-20T05:49:18.460364 #295148] INFO -- : [414/881] 336472=attribute_write_test I, [2024-04-20T05:49:18.483126 #295148] INFO -- : [415/881] 336472=test_propertyputref I, [2024-04-20T05:49:18.525314 #295148] INFO -- : [416/881] 336472=constant_path_node_test I, [2024-04-20T05:49:18.533731 #295148] INFO -- : [417/881] 336472=test_gem_ext_cargo_builder I, [2024-04-20T05:49:19.006453 #295148] INFO -- : [418/881] 336472=test_ssl I, [2024-04-20T05:49:23.574555 #295148] INFO -- : [419/881] 336470=test_module I, [2024-04-20T05:49:38.633410 #295148] INFO -- : [420/881] 336470=test_gem_request_set I, [2024-04-20T05:49:41.517160 #295148] INFO -- : [421/881] 336470=test_arith_seq_extract I, [2024-04-20T05:49:42.472606 #295148] INFO -- : [422/881] 336470=test_method_name_check I, [2024-04-20T05:49:42.650262 #295148] INFO -- : [423/881] 336470=test_parser I, [2024-04-20T05:49:42.920580 #295148] INFO -- : [424/881] 336470=test_configuration I, [2024-04-20T05:49:43.571160 #295148] INFO -- : [425/881] 336470=test_rubyvm I, [2024-04-20T05:49:43.597287 #295148] INFO -- : [426/881] 336470=test_buffered_io I, [2024-04-20T05:49:43.629204 #295148] INFO -- : [427/881] 336470=test_monitor I, [2024-04-20T05:49:43.868845 #295148] INFO -- : [428/881] 336470=test_whileuntil I, [2024-04-20T05:49:43.901535 #295148] INFO -- : [429/881] 336470=test_rdoc_generator_markup I, [2024-04-20T05:49:43.970684 #295148] INFO -- : [430/881] 336470=test_boolean I, [2024-04-20T05:49:44.022887 #295148] INFO -- : [431/881] 336470=test_stringify_symbols I, [2024-04-20T05:49:44.096329 #295148] INFO -- : [432/881] 336470=integer_parse_test I, [2024-04-20T05:49:44.148331 #295148] INFO -- : [433/881] 336470=test_instrumentation_api I, [2024-04-20T05:49:48.115157 #295148] INFO -- : [434/881] 336470=test_too_many_dummy_encodings I, [2024-04-20T05:49:48.502246 #295148] INFO -- : [435/881] 336470=test_stack I, [2024-04-20T05:49:48.620268 #295148] INFO -- : [436/881] 336473=test_gem_commands_list_command I, [2024-04-20T05:49:48.845330 #295148] INFO -- : [437/881] 336473=test_reqarg I, [2024-04-20T05:49:51.354113 #295148] INFO -- : [438/881] 336473=test_rdoc_include I, [2024-04-20T05:49:51.588656 #295148] INFO -- : [439/881] 336473=test_ldap I, [2024-04-20T05:49:51.631312 #295148] INFO -- : [440/881] 336473=test_emitter I, [2024-04-20T05:49:51.681715 #295148] INFO -- : [441/881] 336473=test_resource I, [2024-04-20T05:49:51.834778 #295148] INFO -- : [442/881] 336473=test_gem_commands_signin_command I, [2024-04-20T05:49:52.582518 #295148] INFO -- : [443/881] 336473=test_fileutils I, [2024-04-20T05:49:53.371190 #295148] INFO -- : [444/881] 336471=test_string_processing I, [2024-04-20T05:49:53.428854 #295148] INFO -- : [445/881] 336471=test_econv I, [2024-04-20T05:49:54.278176 #295148] INFO -- : [446/881] 336473=test_cesu8 I, [2024-04-20T05:49:54.345256 #295148] INFO -- : [447/881] 336473=test_rdoc_options I, [2024-04-20T05:49:56.062430 #295148] INFO -- : [448/881] 336473=test_gem_version I, [2024-04-20T05:49:56.629532 #295148] INFO -- : [449/881] 336470=test_path_to_class I, [2024-04-20T05:49:56.791249 #295148] INFO -- : [450/881] 336470=test_gem_resolver_specification I, [2024-04-20T05:49:56.830174 #295148] INFO -- : [451/881] 336473=test_gem_dependency I, [2024-04-20T05:49:56.977430 #295148] INFO -- : [452/881] 336470=test_inlinecache I, [2024-04-20T05:49:57.381354 #295148] INFO -- : [453/881] 336470=test_rdoc_markup_verbatim I, [2024-04-20T05:49:57.414562 #295148] INFO -- : [454/881] 336470=test_complex I, [2024-04-20T05:49:57.944590 #295148] INFO -- : [455/881] 336470=test_gem_commands_search_command I, [2024-04-20T05:49:57.997335 #295148] INFO -- : [456/881] 336470=test_gem_stub_specification I, [2024-04-20T05:49:58.042777 #295148] INFO -- : [457/881] 336473=test_method_cache I, [2024-04-20T05:49:58.047223 #295148] INFO -- : [458/881] 336473=test_frozen_error I, [2024-04-20T05:49:58.111849 #295148] INFO -- : [459/881] 336473=test_gem_ext_ext_conf_builder I, [2024-04-20T05:49:59.150889 #295148] INFO -- : [460/881] 336470=test_gem_resolver_installed_specification I, [2024-04-20T05:49:59.301206 #295148] INFO -- : [461/881] 336470=test_scanner_events I, [2024-04-20T05:49:59.774126 #295148] INFO -- : [462/881] 336470=test_gem_remote_fetcher I, [2024-04-20T05:50:00.411116 #295148] INFO -- : [463/881] 336471=test_parse I, [2024-04-20T05:50:04.256305 #295148] INFO -- : [464/881] 336471=test_mdns I, [2024-04-20T05:50:04.269898 #295148] INFO -- : [465/881] 336471=test_gem_installer I, [2024-04-20T05:50:06.208784 #295148] INFO -- : [466/881] 336472=test_yamlstore I, [2024-04-20T05:50:06.439081 #295148] INFO -- : [467/881] 336472=test_rdoc_parser_rd I, [2024-04-20T05:50:06.507725 #295148] INFO -- : [468/881] 336472=test_date_strftime I, [2024-04-20T05:50:06.527754 #295148] INFO -- : [469/881] 336473=test_irb I, [2024-04-20T05:50:08.281284 #295148] INFO -- : [470/881] 336473=test_asn1 I, [2024-04-20T05:50:08.410342 #295148] INFO -- : [471/881] 336473=test_random I, [2024-04-20T05:50:08.434642 #295148] INFO -- : [472/881] 336473=json_string_matching_test I, [2024-04-20T05:50:08.513611 #295148] INFO -- : [473/881] 336473=test_load I, [2024-04-20T05:50:08.609015 #295148] INFO -- : [474/881] 336473=test_class I, [2024-04-20T05:50:09.614799 #295148] INFO -- : [475/881] 336470=test_rdoc_normal_class I, [2024-04-20T05:50:10.061880 #295148] INFO -- : [476/881] 336470=test_const I, [2024-04-20T05:50:10.093795 #295148] INFO -- : [477/881] 336470=parse_comments_test I, [2024-04-20T05:50:10.123584 #295148] INFO -- : [478/881] 336470=test_noarg I, [2024-04-20T05:50:10.730574 #295148] INFO -- : [479/881] 336472=test_tempfile I, [2024-04-20T05:50:11.014210 #295148] INFO -- : [480/881] 336470=test_function I, [2024-04-20T05:50:11.365657 #295148] INFO -- : [481/881] 336470=test_queue I, [2024-04-20T05:50:11.425874 #295148] INFO -- : [482/881] 336470=test_gem_resolver_index_specification I, [2024-04-20T05:50:11.710304 #295148] INFO -- : [483/881] 336470=test_internal_ivar I, [2024-04-20T05:50:11.747606 #295148] INFO -- : [484/881] 336470=test_tracepoint I, [2024-04-20T05:50:12.219692 #295148] INFO -- : [485/881] 336472=test_prettyprint I, [2024-04-20T05:50:12.404557 #295148] INFO -- : [486/881] 336472=test_rdoc_markup I, [2024-04-20T05:50:12.503507 #295148] INFO -- : [487/881] 336472=test_gem_commands_help_command I, [2024-04-20T05:50:13.110693 #295148] INFO -- : [488/881] 336472=test_duplicate I, [2024-04-20T05:50:13.176561 #295148] INFO -- : [489/881] 336472=test_utf32 I, [2024-04-20T05:50:13.204627 #295148] INFO -- : [490/881] 336472=test_basicsocket I, [2024-04-20T05:50:13.290966 #295148] INFO -- : [491/881] 336472=test_require I, [2024-04-20T05:50:14.080182 #295148] INFO -- : [492/881] 336470=test_cgi_util I, [2024-04-20T05:50:15.791105 #295148] INFO -- : [493/881] 336470=test_gem_commands_contents_command I, [2024-04-20T05:50:16.457010 #295148] INFO -- : [494/881] 336470=test_gem_ext_cmake_builder I, [2024-04-20T05:50:16.622423 #295148] INFO -- : [495/881] 336470=test_digest I, [2024-04-20T05:50:20.008906 #295148] INFO -- : [496/881] 336470=test_marshalable I, [2024-04-20T05:50:20.062109 #295148] INFO -- : [497/881] 336470=test_find I, [2024-04-20T05:50:20.262981 #295148] INFO -- : [498/881] 336470=test_ractor I, [2024-04-20T05:50:20.714051 #295148] INFO -- : [499/881] 336470=test_wss I, [2024-04-20T05:50:20.874996 #295148] INFO -- : [500/881] 336470=test_fiddle I, [2024-04-20T05:50:21.337658 #295148] INFO -- : [501/881] 336470=test_file I, [2024-04-20T05:50:21.372114 #295148] INFO -- : [502/881] 336470=test_rdoc_any_method I, [2024-04-20T05:50:22.983384 #295148] INFO -- : [503/881] 336472=test_modify_expand I, [2024-04-20T05:50:23.066997 #295148] INFO -- : [504/881] 336472=test_rdoc_markdown I, [2024-04-20T05:50:24.251970 #295148] INFO -- : [505/881] 336470=test_gem_available_set I, [2024-04-20T05:50:24.947824 #295148] INFO -- : [506/881] 336472=test_pathname I, [2024-04-20T05:50:24.985679 #295148] INFO -- : [507/881] 336470=test_init I, [2024-04-20T05:50:26.639938 #295148] INFO -- : [508/881] 336472=test_complexrational I, [2024-04-20T05:50:26.655891 #295148] INFO -- : [509/881] 336472=regexp_test I, [2024-04-20T05:50:26.790520 #295148] INFO -- : [510/881] 336472=test_gem_package_tar_reader I, [2024-04-20T05:50:27.158791 #295148] INFO -- : [511/881] 336470=test_coverage I, [2024-04-20T05:50:27.217873 #295148] INFO -- : [512/881] 336472=test_rdoc_encoding I, [2024-04-20T05:50:27.481750 #295148] INFO -- : [513/881] 336472=test_recorder I, [2024-04-20T05:50:27.536846 #295148] INFO -- : [514/881] 336472=test_gem_source_vendor I, [2024-04-20T05:50:27.635313 #295148] INFO -- : [515/881] 336472=test_gem_commands_owner_command I, [2024-04-20T05:50:29.639543 #295148] INFO -- : [516/881] 336472=test_formatter I, [2024-04-20T05:50:29.676079 #295148] INFO -- : [517/881] 336472=test_bash_completion I, [2024-04-20T05:50:29.770513 #295148] INFO -- : [518/881] 336472=test_deprecate I, [2024-04-20T05:50:30.160089 #295148] INFO -- : [519/881] 336472=test_rdoc_constant I, [2024-04-20T05:50:30.825888 #295148] INFO -- : [520/881] 336472=test_wait I, [2024-04-20T05:50:31.471523 #295148] INFO -- : [521/881] 336472=test_handle I, [2024-04-20T05:50:32.004391 #295148] INFO -- : [522/881] 336470=test_forwardable I, [2024-04-20T05:50:32.146718 #295148] INFO -- : [523/881] 336470=test_yaml I, [2024-04-20T05:50:32.973099 #295148] INFO -- : [524/881] 336470=test_big2str I, [2024-04-20T05:50:33.080103 #295148] INFO -- : [525/881] 336470=test_ansi_without_terminfo I, [2024-04-20T05:50:33.112956 #295148] INFO -- : [526/881] 336470=test_gem_commands_sources_command I, [2024-04-20T05:50:33.814832 #295148] INFO -- : [527/881] 336472=test_euc_tw I, [2024-04-20T05:50:33.824111 #295148] INFO -- : [528/881] 336472=test_ractor I, [2024-04-20T05:50:33.896463 #295148] INFO -- : [529/881] 336472=test_bmethod I, [2024-04-20T05:50:33.954910 #295148] INFO -- : [530/881] 336472=test_rdoc_markup_formatter I, [2024-04-20T05:50:34.027570 #295148] INFO -- : [531/881] 336472=test_thread_queue I, [2024-04-20T05:50:34.512890 #295148] INFO -- : [532/881] 336470=test_nowrite I, [2024-04-20T05:50:34.749669 #295148] INFO -- : [533/881] 336470=test_rdoc_parser_c I, [2024-04-20T05:50:36.271792 #295148] INFO -- : [534/881] 336470=test_comparable I, [2024-04-20T05:50:36.318565 #295148] INFO -- : [535/881] 336470=test_shapes I, [2024-04-20T05:50:36.342560 #295148] INFO -- : [536/881] 336470=json_fixtures_test I, [2024-04-20T05:50:36.437823 #295148] INFO -- : [537/881] 336470=test_io_timeout I, [2024-04-20T05:50:36.482832 #295148] INFO -- : [538/881] 336470=test_profile_frames I, [2024-04-20T05:50:37.053857 #295148] INFO -- : [539/881] 336473=test_pstore I, [2024-04-20T05:50:37.195214 #295148] INFO -- : [540/881] 336470=test_cstr I, [2024-04-20T05:50:37.431768 #295148] INFO -- : [541/881] 336473=test_enc_str_buf_cat I, [2024-04-20T05:50:37.469277 #295148] INFO -- : [542/881] 336473=test_class2name I, [2024-04-20T05:50:37.532664 #295148] INFO -- : [543/881] 336473=test_gbk I, [2024-04-20T05:50:37.568104 #295148] INFO -- : [544/881] 336473=ruby_parser_test I, [2024-04-20T05:50:37.656203 #295148] INFO -- : [545/881] 336473=test_backtrace I, [2024-04-20T05:50:41.082221 #295148] INFO -- : [546/881] 336473=test_pack I, [2024-04-20T05:50:41.455265 #295148] INFO -- : [547/881] 336473=test_io_buffer I, [2024-04-20T05:50:41.665163 #295148] INFO -- : [548/881] 336473=test_gem_resolver_conflict I, [2024-04-20T05:50:41.753552 #295148] INFO -- : [549/881] 336473=test_rdoc_task I, [2024-04-20T05:50:41.782047 #295148] INFO -- : [550/881] 336473=test_rdoc_markup_indented_paragraph I, [2024-04-20T05:50:41.847535 #295148] INFO -- : [551/881] 336473=locals_test I, [2024-04-20T05:50:41.866557 #295148] INFO -- : [552/881] 336472=test_rdoc_require I, [2024-04-20T05:50:41.964233 #295148] INFO -- : [553/881] 336472=test_clone I, [2024-04-20T05:50:42.607178 #295148] INFO -- : [554/881] 336470=test_gem_commands_install_command I, [2024-04-20T05:50:42.766510 #295148] INFO -- : [555/881] 336471=test_readpartial I, [2024-04-20T05:50:43.227394 #295148] INFO -- : [556/881] 336471=test_fstring I, [2024-04-20T05:50:43.317936 #295148] INFO -- : [557/881] 336472=test_optparse I, [2024-04-20T05:50:43.721138 #295148] INFO -- : [558/881] 336472=test_array I, [2024-04-20T05:50:43.786757 #295148] INFO -- : [559/881] 336472=test_rat I, [2024-04-20T05:50:43.841550 #295148] INFO -- : [560/881] 336472=test_rdoc_markup_raw I, [2024-04-20T05:50:43.867378 #295148] INFO -- : [561/881] 336472=test_webauthn_poller I, [2024-04-20T05:50:44.439111 #295148] INFO -- : [562/881] 336471=test_rdoc_markup_to_html_crossref I, [2024-04-20T05:50:44.516455 #295148] INFO -- : [563/881] 336473=test_gem_resolver_best_set I, [2024-04-20T05:50:44.553950 #295148] INFO -- : [564/881] 336472=encoding_test I, [2024-04-20T05:50:45.080574 #295148] INFO -- : [565/881] 336473=test_typeddata I, [2024-04-20T05:50:45.323983 #295148] INFO -- : [566/881] 336472=test_stringscanner I, [2024-04-20T05:50:45.716510 #295148] INFO -- : [567/881] 336472=test_files_sample I, [2024-04-20T05:50:46.381543 #295148] INFO -- : [568/881] 336472=test_convertible I, [2024-04-20T05:50:46.874882 #295148] INFO -- : [569/881] 336471=parser_test I, [2024-04-20T05:50:46.970297 #295148] INFO -- : [570/881] 336471=test_rdoc_alias I, [2024-04-20T05:50:46.992208 #295148] INFO -- : [571/881] 336471=test_yield I, [2024-04-20T05:50:47.579950 #295148] INFO -- : [572/881] 336473=test_system I, [2024-04-20T05:50:53.264701 #295148] INFO -- : [573/881] 336470=test_pkcs12 I, [2024-04-20T05:50:54.911154 #295148] INFO -- : [574/881] 336473=test_pkey_dh I, [2024-04-20T05:50:55.395064 #295148] INFO -- : [575/881] 336473=test_bigzero I, [2024-04-20T05:50:55.513416 #295148] INFO -- : [576/881] 336473=test_gem_package_tar_header I, [2024-04-20T05:50:55.908567 #295148] INFO -- : [577/881] 336473=test_gem_util I, [2024-04-20T05:50:57.145769 #295148] INFO -- : [578/881] 336470=test_iseq_load I, [2024-04-20T05:50:57.238447 #295148] INFO -- : [579/881] 336473=test_gem_config_file I, [2024-04-20T05:50:58.648989 #295148] INFO -- : [580/881] 336473=test_ripper I, [2024-04-20T05:51:01.353573 #295148] INFO -- : [581/881] 336473=test_getopts I, [2024-04-20T05:51:01.431909 #295148] INFO -- : [582/881] 336473=test_protocol I, [2024-04-20T05:51:01.831499 #295148] INFO -- : [583/881] 336473=test_gem_resolver_activation_request I, [2024-04-20T05:51:01.918655 #295148] INFO -- : [584/881] 336473=test_yjit_exit_locations I, [2024-04-20T05:51:02.006583 #295148] INFO -- : [585/881] 336473=test_etc I, [2024-04-20T05:51:02.596200 #295148] INFO -- : [586/881] 336473=test_yaml_tree I, [2024-04-20T05:51:02.791718 #295148] INFO -- : [587/881] 336473=test_libs I, [2024-04-20T05:51:02.890380 #295148] INFO -- : [588/881] 336473=test_math I, [2024-04-20T05:51:03.129112 #295148] INFO -- : [589/881] 336473=test_gem_commands_fetch_command I, [2024-04-20T05:51:04.094296 #295148] INFO -- : [590/881] 336470=test_gc I, [2024-04-20T05:51:04.153247 #295148] INFO -- : [591/881] 336470=test_sleep I, [2024-04-20T05:51:04.158561 #295148] INFO -- : [592/881] 336473=test_config I, [2024-04-20T05:51:04.608398 #295148] INFO -- : [593/881] 336473=test_utf16 I, [2024-04-20T05:51:06.163749 #295148] INFO -- : [594/881] 336473=test_autoload I, [2024-04-20T05:51:06.764560 #295148] INFO -- : [595/881] 336470=test_io I, [2024-04-20T05:51:13.294683 #295148] INFO -- : [596/881] 336471=test_unicode_escape I, [2024-04-20T05:51:13.939613 #295148] INFO -- : [597/881] 336471=test_sizeof I, [2024-04-20T05:51:23.553543 #295148] INFO -- : [598/881] 336472=test_case I, [2024-04-20T05:51:23.716072 #295148] INFO -- : [599/881] 336472=test_face I, [2024-04-20T05:51:23.910239 #295148] INFO -- : [600/881] 336472=test_rendering I, [2024-04-20T05:51:23.918556 #295148] INFO -- : [601/881] 336472=test_console_attr I, [2024-04-20T05:51:23.945563 #295148] INFO -- : [602/881] 336472=test_summary I, [2024-04-20T05:51:24.169823 #295148] INFO -- : [603/881] 336473=test_type_completor I, [2024-04-20T05:51:24.265878 #295148] INFO -- : [604/881] 336473=test_io_wait I, [2024-04-20T05:51:24.499429 #295148] INFO -- : [605/881] 336472=test_gem_commands_exec_command I, [2024-04-20T05:51:24.703836 #295148] INFO -- : [606/881] 336473=warnings_test I, [2024-04-20T05:51:24.853261 #295148] INFO -- : [607/881] 336473=test_kwargs I, [2024-04-20T05:51:24.904353 #295148] INFO -- : [608/881] 336473=test_ellipsize I, [2024-04-20T05:51:25.036307 #295148] INFO -- : [609/881] 336473=test_date_attr I, [2024-04-20T05:51:25.274549 #295148] INFO -- : [610/881] 336473=test_io I, [2024-04-20T05:51:26.164730 #295148] INFO -- : [611/881] 336473=test_sorted_set I, [2024-04-20T05:51:27.954051 #295148] INFO -- : [612/881] 336473=test_emoji I, [2024-04-20T05:51:28.224397 #295148] INFO -- : [613/881] 336473=test_win32ole_type_event I, [2024-04-20T05:51:28.239132 #295148] INFO -- : [614/881] 336473=test_hash I, [2024-04-20T05:51:32.514358 #295148] INFO -- : [615/881] 336472=test_ubf_async_safe I, [2024-04-20T05:51:32.589184 #295148] INFO -- : [616/881] 336472=test_gem_unsatisfiable_dependency_error I, [2024-04-20T05:51:32.729957 #295148] INFO -- : [617/881] 336472=test_win32ole_record I, [2024-04-20T05:51:32.756705 #295148] INFO -- : [618/881] 336472=test_cp949 I, [2024-04-20T05:51:32.819902 #295148] INFO -- : [619/881] 336472=test_gem_commands_uninstall_command I, [2024-04-20T05:51:36.709454 #295148] INFO -- : [620/881] 336471=test_condition I, [2024-04-20T05:51:36.753418 #295148] INFO -- : [621/881] 336471=test_gem_source_specific_file I, [2024-04-20T05:51:37.380405 #295148] INFO -- : [622/881] 336471=test_foreach I, [2024-04-20T05:51:37.421805 #295148] INFO -- : [623/881] 336471=test_rdoc_rubygems_hook I, [2024-04-20T05:51:37.927911 #295148] INFO -- : [624/881] 336471=test_gem_commands_query_command I, [2024-04-20T05:51:39.174048 #295148] INFO -- : [625/881] 336472=test_method I, [2024-04-20T05:51:41.879125 #295148] INFO -- : [626/881] 336471=test_gem_impossible_dependencies_error I, [2024-04-20T05:51:41.931381 #295148] INFO -- : [627/881] 336471=test_pack I, [2024-04-20T05:51:43.624327 #295148] INFO -- : [628/881] 336471=test_array_create I, [2024-04-20T05:51:43.707038 #295148] INFO -- : [629/881] 336471=test_pattern_key_name_check I, [2024-04-20T05:51:43.758682 #295148] INFO -- : [630/881] 336471=test_to_ruby I, [2024-04-20T05:51:43.890641 #295148] INFO -- : [631/881] 336471=test_ftp I, [2024-04-20T05:51:43.961565 #295148] INFO -- : [632/881] 336471=test_euc_kr I, [2024-04-20T05:51:44.003034 #295148] INFO -- : [633/881] 336471=test_rdoc_context_section I, [2024-04-20T05:51:44.285708 #295148] INFO -- : [634/881] 336471=ripper_test I, [2024-04-20T05:51:48.881598 #295148] INFO -- : [635/881] 336470=test_objspace I, [2024-04-20T05:51:48.934781 #295148] INFO -- : [636/881] 336471=test_line_editor I, [2024-04-20T05:51:48.971861 #295148] INFO -- : [637/881] 336471=test_undef I, [2024-04-20T05:51:49.013656 #295148] INFO -- : [638/881] 336471=test_gem_security_trust_dir I, [2024-04-20T05:51:49.605459 #295148] INFO -- : [639/881] 336471=test_string_memory I, [2024-04-20T05:51:50.114716 #295148] INFO -- : [640/881] 336471=comments_test I, [2024-04-20T05:51:50.182479 #295148] INFO -- : [641/881] 336471=test_gem_requirement I, [2024-04-20T05:51:51.385432 #295148] INFO -- : [642/881] 336471=test_sprintf I, [2024-04-20T05:51:53.403670 #295148] INFO -- : [643/881] 336471=test_show_source I, [2024-04-20T05:51:53.426507 #295148] INFO -- : [644/881] 336471=test_set I, [2024-04-20T05:51:53.642740 #295148] INFO -- : [645/881] 336471=test_c_struct_entry I, [2024-04-20T05:51:55.218499 #295148] INFO -- : [646/881] 336473=test_lock_native_thread I, [2024-04-20T05:51:56.093335 #295148] INFO -- : [647/881] 336471=test_gem_commands_stale_command I, [2024-04-20T05:51:56.150275 #295148] INFO -- : [648/881] 336471=test_remote_fetch_error I, [2024-04-20T05:51:56.800654 #295148] INFO -- : [649/881] 336471=test_have_library I, [2024-04-20T05:51:56.872999 #295148] INFO -- : [650/881] 336473=test_gem_resolver_dependency_request I, [2024-04-20T05:51:57.147145 #295148] INFO -- : [651/881] 336473=test_tree_builder I, [2024-04-20T05:51:57.460007 #295148] INFO -- : [652/881] 336473=test_hash I, [2024-04-20T05:51:58.085801 #295148] INFO -- : [653/881] 336473=test_postponed_job I, [2024-04-20T05:52:00.633882 #295148] INFO -- : [654/881] 336473=test_alias_and_anchor I, [2024-04-20T05:52:00.689552 #295148] INFO -- : [655/881] 336473=test_external_new I, [2024-04-20T05:52:00.789814 #295148] INFO -- : [656/881] 336473=test_gem_request_set_lockfile I, [2024-04-20T05:52:04.581815 #295148] INFO -- : [657/881] 336473=test_raise_exception I, [2024-04-20T05:52:04.796275 #295148] INFO -- : [658/881] 336471=test_protect I, [2024-04-20T05:52:04.845161 #295148] INFO -- : [659/881] 336471=test_win32ole_typelib I, [2024-04-20T05:52:05.364786 #295148] INFO -- : [660/881] 336471=test_workspace I, [2024-04-20T05:52:06.128206 #295148] INFO -- : [661/881] 336471=test_weakmap I, [2024-04-20T05:52:09.131193 #295148] INFO -- : [662/881] 336473=test_yjit I, [2024-04-20T05:52:09.174733 #295148] INFO -- : [663/881] 336473=test_ws I, [2024-04-20T05:52:09.286426 #295148] INFO -- : [664/881] 336473=test_gem_commands_environment_command I, [2024-04-20T05:52:09.901547 #295148] INFO -- : [665/881] 336473=test_m17n I, [2024-04-20T05:52:11.081228 #295148] INFO -- : [666/881] 336473=test_argf I, [2024-04-20T05:52:19.191402 #295148] INFO -- : [667/881] 336472=test_kill_ring I, [2024-04-20T05:52:19.233189 #295148] INFO -- : [668/881] 336472=test_framework I, [2024-04-20T05:52:19.399547 #295148] INFO -- : [669/881] 336472=test_ns_spki I, [2024-04-20T05:52:19.450709 #295148] INFO -- : [670/881] 336472=test_hmac I, [2024-04-20T05:52:19.518256 #295148] INFO -- : [671/881] 336472=test_rdoc_markup_to_tt_only I, [2024-04-20T05:52:19.833117 #295148] INFO -- : [672/881] 336472=test_rdoc_tom_doc I, [2024-04-20T05:52:20.018846 #295148] INFO -- : [673/881] 336472=test_numeric I, [2024-04-20T05:52:20.601112 #295148] INFO -- : [674/881] 336472=test_ifunless I, [2024-04-20T05:52:20.704273 #295148] INFO -- : [675/881] 336472=test_assignment I, [2024-04-20T05:52:36.621720 #295148] INFO -- : [676/881] 336472=test_gem_commands_lock_command I, [2024-04-20T05:52:36.853480 #295148] INFO -- : [677/881] 336472=test_gem_command I, [2024-04-20T05:52:37.897554 #295148] INFO -- : [678/881] 336472=test_key_actor_vi I, [2024-04-20T05:52:38.946549 #295148] INFO -- : [679/881] 336472=test_bug-3571 I, [2024-04-20T05:52:38.982751 #295148] INFO -- : [680/881] 336472=test_common I, [2024-04-20T05:52:39.523316 #295148] INFO -- : [681/881] 336471=test_gem_spec_fetcher I, [2024-04-20T05:52:40.633737 #295148] INFO -- : [682/881] 336472=test_rdoc_token_stream I, [2024-04-20T05:52:40.698085 #295148] INFO -- : [683/881] 336472=test_address_resolve I, [2024-04-20T05:52:40.797686 #295148] INFO -- : [684/881] 336472=test_config I, [2024-04-20T05:52:40.823281 #295148] INFO -- : [685/881] 336471=test_gem_source_list I, [2024-04-20T05:52:40.995180 #295148] INFO -- : [686/881] 336472=test_yaml_special_cases I, [2024-04-20T05:52:41.207652 #295148] INFO -- : [687/881] 336472=test_optarg I, [2024-04-20T05:52:41.370192 #295148] INFO -- : [688/881] 336471=test_verbose I, [2024-04-20T05:52:41.581728 #295148] INFO -- : [689/881] 336471=test_num2int I, [2024-04-20T05:52:41.643469 #295148] INFO -- : [690/881] 336471=test_nil I, [2024-04-20T05:52:41.666796 #295148] INFO -- : [691/881] 336471=test_rdoc_single_class I, [2024-04-20T05:52:41.694829 #295148] INFO -- : [692/881] 336471=test_macro I, [2024-04-20T05:52:41.704107 #295148] INFO -- : [693/881] 336471=test_gem_ext_configure_builder I, [2024-04-20T05:52:41.798015 #295148] INFO -- : [694/881] 336472=test_frozen I, [2024-04-20T05:52:41.807075 #295148] INFO -- : [695/881] 336472=test_pp I, [2024-04-20T05:52:41.963027 #295148] INFO -- : [696/881] 336471=test_zsh_completion I, [2024-04-20T05:52:42.003200 #295148] INFO -- : [697/881] 336471=test_exception I, [2024-04-20T05:52:42.103179 #295148] INFO -- : [698/881] 336471=test_iter_break I, [2024-04-20T05:52:42.140267 #295148] INFO -- : [699/881] 336471=test_bug-5832 I, [2024-04-20T05:52:42.143661 #295148] INFO -- : [700/881] 336471=test_files_ext I, [2024-04-20T05:52:42.160317 #295148] INFO -- : [701/881] 336471=test_emitter I, [2024-04-20T05:52:42.187518 #295148] INFO -- : [702/881] 336472=test_gem_silent_ui I, [2024-04-20T05:52:42.233287 #295148] INFO -- : [703/881] 336471=test_kdf I, [2024-04-20T05:52:42.637263 #295148] INFO -- : [704/881] 336472=test_gem_doctor I, [2024-04-20T05:52:42.770187 #295148] INFO -- : [705/881] 336471=test_kernel I, [2024-04-20T05:52:43.007002 #295148] INFO -- : [706/881] 336472=test_eval_history I, [2024-04-20T05:52:43.179455 #295148] INFO -- : [707/881] 336472=dispatcher_test I, [2024-04-20T05:52:43.219453 #295148] INFO -- : [708/881] 336472=test_enc_raise I, [2024-04-20T05:52:43.298508 #295148] INFO -- : [709/881] 336472=test_psych I, [2024-04-20T05:52:43.332076 #295148] INFO -- : [710/881] 336473=!Nothing_to_test I, [2024-04-20T05:52:43.337922 #295148] INFO -- : [711/881] 336473=test_rdoc_markup_paragraph I, [2024-04-20T05:52:43.417407 #295148] INFO -- : [712/881] 336473=test_object_create_start I, [2024-04-20T05:52:43.425060 #295148] INFO -- : [713/881] 336473=test_command I, [2024-04-20T05:52:43.464128 #295148] INFO -- : [714/881] 336472=test_at_exit I, [2024-04-20T05:52:43.582926 #295148] INFO -- : [715/881] 336472=test_gem_ext_cargo_builder_unit I, [2024-04-20T05:52:43.864847 #295148] INFO -- : [716/881] 336472=test_date I, [2024-04-20T05:52:43.927856 #295148] INFO -- : [717/881] 336472=test_gem_rdoc I, [2024-04-20T05:52:45.024784 #295148] INFO -- : [718/881] 336472=test_win32ole_type I, [2024-04-20T05:52:45.059179 #295148] INFO -- : [719/881] 336472=test_null I, [2024-04-20T05:52:45.090543 #295148] INFO -- : [720/881] 336472=test_mul I, [2024-04-20T05:52:45.164279 #295148] INFO -- : [721/881] 336472=test_rdoc_rd_inline_parser I, [2024-04-20T05:52:45.300373 #295148] INFO -- : [722/881] 336472=test_rdoc_markup_to_rdoc I, [2024-04-20T05:52:45.501512 #295148] INFO -- : [723/881] 336473=test_default_gems I, [2024-04-20T05:52:45.617985 #295148] INFO -- : [724/881] 336472=test_rdoc_markup_attributes I, [2024-04-20T05:52:45.722689 #295148] INFO -- : [725/881] 336472=test_date_parse I, [2024-04-20T05:52:46.007635 #295148] INFO -- : [726/881] 336473=test_trick I, [2024-04-20T05:52:46.535144 #295148] INFO -- : [727/881] 336472=test_thread I, [2024-04-20T05:52:46.559080 #295148] INFO -- : [728/881] 336472=test_pipe I, [2024-04-20T05:52:47.495840 #295148] INFO -- : [729/881] 336472=test_pkey_ec I, [2024-04-20T05:52:47.801862 #295148] INFO -- : [730/881] 336471=test_io_buffer I, [2024-04-20T05:52:48.205094 #295148] INFO -- : [731/881] 336471=test_defined I, [2024-04-20T05:52:48.429404 #295148] INFO -- : [732/881] 336472=test_backtrace I, [2024-04-20T05:52:48.461932 #295148] INFO -- : [733/881] 336472=test_key_name_check I, [2024-04-20T05:52:48.503423 #295148] INFO -- : [734/881] 336472=test_rdoc_i18n_text I, [2024-04-20T05:52:48.543042 #295148] INFO -- : [735/881] 336472=test_windows_1251 I, [2024-04-20T05:52:48.755007 #295148] INFO -- : [736/881] 336472=test_time I, [2024-04-20T05:52:48.816589 #295148] INFO -- : [737/881] 336471=test_rdoc_rdoc I, [2024-04-20T05:52:49.307960 #295148] INFO -- : [738/881] 336471=test_gem_uninstaller I, [2024-04-20T05:52:49.712894 #295148] INFO -- : [739/881] 336472=test_svcb_https I, [2024-04-20T05:52:49.772737 #295148] INFO -- : [740/881] 336472=test_buffering I, [2024-04-20T05:52:49.808271 #295148] INFO -- : [741/881] 336472=test_gb18030 I, [2024-04-20T05:52:49.907618 #295148] INFO -- : [742/881] 336472=test_cgi_tag_helper I, [2024-04-20T05:52:50.027415 #295148] INFO -- : [743/881] 336472=test_zlib I, [2024-04-20T05:52:58.017059 #295148] INFO -- : [744/881] 336471=test_egrep_cpp I, [2024-04-20T05:52:58.469948 #295148] INFO -- : [745/881] 336471=test_erb_m17n I, [2024-04-20T05:52:58.539119 #295148] INFO -- : [746/881] 336471=test_ole_methods I, [2024-04-20T05:52:58.568799 #295148] INFO -- : [747/881] 336471=test_date_conv I, [2024-04-20T05:52:58.714561 #295148] INFO -- : [748/881] 336471=test_optimization I, [2024-04-20T05:52:59.734672 #295148] INFO -- : [749/881] 336473=test_gc_compact I, [2024-04-20T05:53:19.128906 #295148] INFO -- : [750/881] 336472=test_proc I, [2024-04-20T05:53:22.781664 #295148] INFO -- : [751/881] 336473=test_string I, [2024-04-20T05:53:28.361747 #295148] INFO -- : [752/881] 336472=test_gem_resolver_index_set I, [2024-04-20T05:53:28.750130 #295148] INFO -- : [753/881] 336472=test_gem_package_old I, [2024-04-20T05:53:29.227178 #295148] INFO -- : [754/881] 336472=test_gem_validator I, [2024-04-20T05:53:29.819848 #295148] INFO -- : [755/881] 336472=test_require_path_check I, [2024-04-20T05:53:30.463165 #295148] INFO -- : [756/881] 336472=test_rdoc_markup_parser I, [2024-04-20T05:53:30.859567 #295148] INFO -- : [757/881] 336472=test_folderitem2_invokeverb I, [2024-04-20T05:53:30.909206 #295148] INFO -- : [758/881] 336472=test_fnmatch I, [2024-04-20T05:53:31.361856 #295148] INFO -- : [759/881] 336472=test_files_test_2 I, [2024-04-20T05:53:31.416589 #295148] INFO -- : [760/881] 336472=test_rdoc_stats I, [2024-04-20T05:53:31.756602 #295148] INFO -- : [761/881] 336472=test_pattern_matching I, [2024-04-20T05:53:31.909707 #295148] INFO -- : [762/881] 336472=test_string I, [2024-04-20T05:53:32.183242 #295148] INFO -- : [763/881] 336472=test_rdoc_store I, [2024-04-20T05:53:38.782464 #295148] INFO -- : [764/881] 336472=test_gem_request_set_lockfile_parser I, [2024-04-20T05:53:39.882738 #295148] INFO -- : [765/881] 336472=test_depth_first I, [2024-04-20T05:53:39.901339 #295148] INFO -- : [766/881] 336472=test_raise I, [2024-04-20T05:53:39.929045 #295148] INFO -- : [767/881] 336472=test_x509attr I, [2024-04-20T05:53:40.058992 #295148] INFO -- : [768/881] 336472=json_addition_test I, [2024-04-20T05:53:40.108740 #295148] INFO -- : [769/881] 336472=test_gem_dependency_resolution_error I, [2024-04-20T05:53:40.210428 #295148] INFO -- : [770/881] 336472=test_rdoc_parser I, [2024-04-20T05:53:40.356942 #295148] INFO -- : [771/881] 336472=test_qsort I, [2024-04-20T05:53:40.362269 #295148] INFO -- : [772/881] 336472=test_case I, [2024-04-20T05:53:40.465371 #295148] INFO -- : [773/881] 336472=test_pkey I, [2024-04-20T05:53:40.992863 #295148] INFO -- : [774/881] 336472=test_parser_events I, [2024-04-20T05:53:41.598412 #295148] INFO -- : [775/881] 336472=test_reline I, [2024-04-20T05:53:42.866731 #295148] INFO -- : [776/881] 336472=test_cclass I, [2024-04-20T05:53:43.357579 #295148] INFO -- : [777/881] 336472=test_gem_request_connection_pools I, [2024-04-20T05:53:44.858061 #295148] INFO -- : [778/881] 336472=test_grapheme_breaks I, [2024-04-20T05:53:45.110251 #295148] INFO -- : [779/881] 336472=test_gem_version_option I, [2024-04-20T05:53:45.885664 #295148] INFO -- : [780/881] 336472=test_memory_view I, [2024-04-20T05:53:47.585631 #295148] INFO -- : [781/881] 336472=test_m17n_comb I, [2024-04-20T05:53:51.857844 #295148] INFO -- : [782/881] 336471=test_ractor I, [2024-04-20T05:53:52.149236 #295148] INFO -- : [783/881] 336471=test_rdoc_generator_pot_po I, [2024-04-20T05:53:52.185817 #295148] INFO -- : [784/881] 336471=test_ansi_with_terminfo I, [2024-04-20T05:53:52.230187 #295148] INFO -- : [785/881] 336471=test_rdoc_markup_to_markdown I, [2024-04-20T05:53:52.791797 #295148] INFO -- : [786/881] 336471=test_json_tree I, [2024-04-20T05:53:52.903674 #295148] INFO -- : [787/881] 336471=test_ractor I, [2024-04-20T05:53:52.930656 #295148] INFO -- : [788/881] 336471=test_severity I, [2024-04-20T05:53:53.026539 #295148] INFO -- : [789/881] 336471=test_require_lib I, [2024-04-20T05:54:07.327975 #295148] INFO -- : [790/881] 336470=test_gem_install_update_options I, [2024-04-20T05:54:08.584958 #295148] INFO -- : [791/881] 336470=parse_test I, [2024-04-20T05:54:13.305195 #295148] INFO -- : [792/881] 336472=test_gem_stream_ui I, [2024-04-20T05:54:14.615824 #295148] INFO -- : [793/881] 336472=test_rdoc_generator_ri I, [2024-04-20T05:54:14.711317 #295148] INFO -- : [794/881] 336472=test_extlibs I, [2024-04-20T05:54:19.456578 #295148] INFO -- : [795/881] 336471=test_literal I, [2024-04-20T05:54:24.984701 #295148] INFO -- : [796/881] 336471=test_str2big I, [2024-04-20T05:54:25.023263 #295148] INFO -- : [797/881] 336471=test_dot_dot I, [2024-04-20T05:54:25.182299 #295148] INFO -- : [798/881] 336471=test_c_struct_builder I, [2024-04-20T05:54:26.134593 #295148] INFO -- : [799/881] 336471=test_rdoc_markup_to_table_of_contents I, [2024-04-20T05:54:26.401164 #295148] INFO -- : [800/881] 336471=test_thread I, [2024-04-20T05:54:26.646341 #295148] INFO -- : [801/881] 336471=test_socket I, [2024-04-20T05:54:28.939373 #295148] INFO -- : [802/881] 336472=test_objectspace I, [2024-04-20T05:54:29.180078 #295148] INFO -- : Leaked thread: TestSocket#test_accept_loop_multi_port: # I, [2024-04-20T05:54:29.184052 #295148] INFO -- : Finished thread: TestSocket#test_udp_recvmsg_truncation: # I, [2024-04-20T05:54:31.352652 #295148] INFO -- : [803/881] 336470=test_rdoc_cross_reference I, [2024-04-20T05:54:33.528497 #295148] INFO -- : [804/881] 336472=test_gem_dependency_installer I, [2024-04-20T05:54:35.347556 #295148] INFO -- : [805/881] 336470=test_scalar I, [2024-04-20T05:54:35.458404 #295148] INFO -- : [806/881] 336470=test_gem_commands_info_command I, [2024-04-20T05:54:35.552362 #295148] INFO -- : [807/881] 336470=test_case_options I, [2024-04-20T05:54:35.602526 #295148] INFO -- : [808/881] 336470=test_store I, [2024-04-20T05:54:37.151220 #295148] INFO -- : [809/881] 336470=test_exception I, [2024-04-20T05:54:37.378222 #295148] INFO -- : [810/881] 336471=test_bug_reporter I, [2024-04-20T05:54:38.061123 #295148] INFO -- : [811/881] 336471=test_rand I, [2024-04-20T05:54:40.742880 #295148] INFO -- : [812/881] 336471=test_gem_package_tar_reader_entry I, [2024-04-20T05:54:42.619962 #295148] INFO -- : [813/881] 336471=test_gem_name_tuple I, [2024-04-20T05:54:42.817677 #295148] INFO -- : [814/881] 336471=test_gem_commands_mirror I, [2024-04-20T05:54:42.855840 #295148] INFO -- : [815/881] 336471=test_gem_ext_cargo_builder_link_flag_converter I, [2024-04-20T05:54:43.522527 #295148] INFO -- : [816/881] 336471=test_method_cache I, [2024-04-20T05:54:43.759890 #295148] INFO -- : [817/881] 336471=test_gem_request I, [2024-04-20T05:54:47.154273 #295148] INFO -- : [818/881] 336471=test_sprintf_comb I, [2024-04-20T05:54:48.577409 #295148] INFO -- : [819/881] 336471=test_generic I, [2024-04-20T05:54:48.834585 #295148] INFO -- : [820/881] 336471=test_win32ole I, [2024-04-20T05:54:48.900125 #295148] INFO -- : [821/881] 336471=test_scan_args I, [2024-04-20T05:54:48.982238 #295148] INFO -- : [822/881] 336471=test_enumerator_kw I, [2024-04-20T05:54:49.099354 #295148] INFO -- : [823/881] 336471=test_settracefunc I, [2024-04-20T05:54:52.121185 #295148] INFO -- : [824/881] 336472=test_gem_text I, [2024-04-20T05:54:53.010429 #295148] INFO -- : [825/881] 336472=test_gem_commands_which_command I, [2024-04-20T05:54:53.458774 #295148] INFO -- : [826/881] 336472=test_shift_jis I, [2024-04-20T05:54:53.496908 #295148] INFO -- : [827/881] 336472=test_http I, [2024-04-20T05:54:53.608169 #295148] INFO -- : [828/881] 336472=test_enumerator I, [2024-04-20T05:54:57.364661 #295148] INFO -- : [829/881] 336470=test_flags I, [2024-04-20T05:54:57.631772 #295148] INFO -- : [830/881] 336471=test_inadvertent_creation I, [2024-04-20T05:54:58.741370 #295148] INFO -- : [831/881] 336471=test_gem_commands_specification_command I, [2024-04-20T05:55:00.228190 #295148] INFO -- : [832/881] 336471=test_gem_commands_dependency_command I, [2024-04-20T05:55:01.013878 #295148] INFO -- : [833/881] 336471=test_gem_resolver_composed_set I, [2024-04-20T05:55:01.161873 #295148] INFO -- : [834/881] 336471=test_safe_load I, [2024-04-20T05:55:01.306817 #295148] INFO -- : [835/881] 336471=test_gem_resolver I, [2024-04-20T05:55:04.075136 #295148] INFO -- : [836/881] 336471=test_name_error I, [2024-04-20T05:55:04.875128 #295148] INFO -- : [837/881] 336470=test_rdoc_markup_attribute_manager I, [2024-04-20T05:55:04.944065 #295148] INFO -- : [838/881] 336471=test_open-uri I, [2024-04-20T05:55:05.134954 #295148] INFO -- : [839/881] 336470=test_httpresponse I, [2024-04-20T05:55:05.318641 #295148] INFO -- : [840/881] 336470=test_rdoc_parser_ruby I, [2024-04-20T05:55:06.835969 #295148] INFO -- : [841/881] 336471=test_rdoc_context I, [2024-04-20T05:55:09.693284 #295148] INFO -- : [842/881] 336470=test_stream I, [2024-04-20T05:55:09.736901 #295148] INFO -- : [843/881] 336470=test_nil2vtempty I, [2024-04-20T05:55:09.782361 #295148] INFO -- : [844/881] 336470=test_iso_8859 I, [2024-04-20T05:55:09.999463 #295148] INFO -- : [845/881] 336470=test_tcp I, [2024-04-20T05:55:10.430645 #295148] INFO -- : [846/881] 336470=test_rdoc_text I, [2024-04-20T05:55:10.805190 #295148] INFO -- : [847/881] 336470=test_gem_safe_yaml I, [2024-04-20T05:55:10.898053 #295148] INFO -- : [848/881] 336470=test_syntax I, [2024-04-20T05:55:14.781920 #295148] INFO -- : [849/881] 336471=index_write_test I, [2024-04-20T05:55:14.827060 #295148] INFO -- : [850/881] 336471=test_date_new I, [2024-04-20T05:55:14.902833 #295148] INFO -- : [851/881] 336471=test_data I, [2024-04-20T05:55:14.942577 #295148] INFO -- : [852/881] 336471=test_require I, [2024-04-20T05:55:14.970431 #295148] INFO -- : [853/881] 336471=test_rdoc_markup_to_joined_paragraph I, [2024-04-20T05:55:15.007980 #295148] INFO -- : [854/881] 336471=test_date_time I, [2024-04-20T05:55:15.115814 #295148] INFO -- : [855/881] 336471=test_securerandom I, [2024-04-20T05:55:15.525687 #295148] INFO -- : [856/881] 336471=test_rdoc_markdown_test I, [2024-04-20T05:55:25.009871 #295148] INFO -- : [857/881] 336471=test_rdoc_normal_module I, [2024-04-20T05:55:25.522909 #295148] INFO -- : [858/881] 336471=test_c_union_entity I, [2024-04-20T05:55:25.946662 #295148] INFO -- : [859/881] 336471=test_logperiod I, [2024-04-20T05:55:25.991350 #295148] INFO -- : [860/881] 336471=test_flush I, [2024-04-20T05:55:26.024330 #295148] INFO -- : [861/881] 336471=test_singleton I, [2024-04-20T05:55:26.516755 #295148] INFO -- : [862/881] 336471=test_io_console I, [2024-04-20T05:55:30.702519 #295148] INFO -- : [863/881] 336471=test_switch_hitter I, [2024-04-20T05:55:30.802077 #295148] INFO -- : [864/881] 336471=test_uncorrectable_name_check I, [2024-04-20T05:55:30.844517 #295148] INFO -- : [865/881] 336471=newline_test I, [2024-04-20T05:55:31.382334 #295148] INFO -- : [866/881] 336471=test_hash_create I, [2024-04-20T05:55:31.462329 #295148] INFO -- : [867/881] 336471=test_stringchar I, [2024-04-20T05:55:32.250995 #295148] INFO -- : [868/881] 336471=test_passing_block I, [2024-04-20T05:55:32.300926 #295148] INFO -- : [869/881] 336471=test_thread_fd_close I, [2024-04-20T05:55:33.834411 #295148] INFO -- : [870/881] 336471=test_last_thread I, [2024-04-20T05:55:39.870683 #295148] INFO -- : [871/881] 336471=test_process I, [2024-04-20T05:56:02.863662 #295148] INFO -- : [872/881] 336470=test_pack I, [2024-04-20T05:56:04.734125 #295148] INFO -- : [873/881] 336470=test_gem_security_policy I, [2024-04-20T05:56:07.680563 #295148] INFO -- : [874/881] 336470=test_gem_source_local I, [2024-04-20T05:56:09.490876 #295148] INFO -- : [875/881] 336470=test_arity I, [2024-04-20T05:56:09.968583 #295148] INFO -- : [876/881] 336470=test_gem_ext_rake_builder I, [2024-04-20T05:56:10.511027 #295148] INFO -- : [877/881] 336473=test_logdevice I, [2024-04-20T05:56:15.844587 #295148] INFO -- : [878/881] 336470=test_err_in_callback I, [2024-04-20T05:56:15.870664 #295148] INFO -- : [879/881] 336470=test_gem_resolver_lock_specification I, [2024-04-20T05:56:16.255003 #295148] INFO -- : [880/881] 336470=test_gc I, [2024-04-20T05:56:17.040409 #295148] INFO -- : [881/881] 336473=test_x509cert I, [2024-04-20T05:57:24.485770 #295148] INFO -- : Finished tests in 880.319242s, 29.8040 tests/s, 10604.7006 assertions/s. E, [2024-04-20T05:57:24.486756 #295148] ERROR -- : Children under /tmp/rubytest.20240420-336467-ljz7u7: E, [2024-04-20T05:57:24.487124 #295148] ERROR -- : drwx------ 2 40 2024-04-20 05:53:18 +0000 d20240420-336472-kmno2w E, [2024-04-20T05:57:24.487283 #295148] ERROR -- : drwx------ 4 80 2024-04-20 05:48:49 +0000 gem_rebuild20240420-336472-1wjehb I, [2024-04-20T05:57:24.490649 #295148] INFO -- : 26237 tests, 9335522 assertions, 0 failures, 0 errors, 292 skips I, [2024-04-20T05:57:24.490858 #295148] INFO -- : I, [2024-04-20T05:57:24.490983 #295148] INFO -- : ruby -v: ruby 3.4.0dev (2024-04-20T02:34:52Z master 9f9755664d) [riscv64-linux] I, [2024-04-20T05:57:24.501328 #295148] INFO -- : $$$[end] "make yes-test-all TESTOPTS='--stderr-on-failure' TESTS='-j4'" exit with 0. I, [2024-04-20T05:57:24.502189 #295148] INFO -- : $$$[beg] make yes-test-rubyspec MSPECOPT='--error-output stderr --debug -j' TESTS='-j4' I, [2024-04-20T05:57:25.341652 #295148] INFO -- : BASERUBY = /usr/bin/ruby --disable=gems I, [2024-04-20T05:57:25.341866 #295148] INFO -- : CC = gcc I, [2024-04-20T05:57:25.341983 #295148] INFO -- : LD = ld I, [2024-04-20T05:57:25.342095 #295148] INFO -- : LDSHARED = gcc -shared I, [2024-04-20T05:57:25.342191 #295148] INFO -- : CFLAGS = -O3 -fno-fast-math -ggdb3 -Wall -Wextra -Wdeprecated-declarations -Wdiv-by-zero -Wduplicated-cond -Wimplicit-function-declaration -Wimplicit-int -Wpointer-arith -Wwrite-strings -Wold-style-definition -Wimplicit-fallthrough=0 -Wmissing-noreturn -Wno-cast-function-type -Wno-constant-logical-operand -Wno-long-long -Wno-missing-field-initializers -Wno-overlength-strings -Wno-packed-bitfield-compat -Wno-parentheses-equality -Wno-self-assign -Wno-tautological-compare -Wno-unused-parameter -Wno-unused-value -Wsuggest-attribute=format -Wsuggest-attribute=noreturn -Wunused-variable -Wmisleading-indentation -Wundef -fPIC I, [2024-04-20T05:57:25.342292 #295148] INFO -- : XCFLAGS = -U_FORTIFY_SOURCE -D_FORTIFY_SOURCE=2 -fstack-protector-strong -fno-strict-overflow -fvisibility=hidden -fexcess-precision=standard -DRUBY_EXPORT -I. -I.ext/include/riscv64-linux -I/tmp/ruby/src/trunk/include -I/tmp/ruby/src/trunk -I/tmp/ruby/src/trunk/prism -I/tmp/ruby/src/trunk/enc/unicode/15.0.0 I, [2024-04-20T05:57:25.342438 #295148] INFO -- : CPPFLAGS = I, [2024-04-20T05:57:25.342533 #295148] INFO -- : DLDFLAGS = -Wl,--compress-debug-sections=zlib -Wl,-soname,libruby.so.3.4 -fstack-protector-strong I, [2024-04-20T05:57:25.342630 #295148] INFO -- : SOLIBS = -lz -lrt -lrt -lgmp -ldl -lcrypt -lm -lpthread I, [2024-04-20T05:57:25.342716 #295148] INFO -- : LANG = I, [2024-04-20T05:57:25.342806 #295148] INFO -- : LC_ALL = I, [2024-04-20T05:57:25.342896 #295148] INFO -- : LC_CTYPE = I, [2024-04-20T05:57:25.342983 #295148] INFO -- : MFLAGS = I, [2024-04-20T05:57:25.343069 #295148] INFO -- : RUSTC = rustc I, [2024-04-20T05:57:25.343160 #295148] INFO -- : YJIT_RUSTC_ARGS = --crate-name=yjit --crate-type=staticlib --edition=2021 -g -C lto=thin -C opt-level=3 -C overflow-checks=on '--out-dir=/tmp/ruby/build/trunk/yjit/target/release/' /tmp/ruby/src/trunk/yjit/src/lib.rs I, [2024-04-20T05:57:25.346950 #295148] INFO -- : gcc (Debian 13.2.0-4revyos1) 13.2.0 I, [2024-04-20T05:57:25.347180 #295148] INFO -- : Copyright (C) 2023 Free Software Foundation, Inc. I, [2024-04-20T05:57:25.347295 #295148] INFO -- : This is free software; see the source for copying conditions. There is NO I, [2024-04-20T05:57:25.347429 #295148] INFO -- : warranty; not even for MERCHANTABILITY or FITNESS FOR A PARTICULAR PURPOSE. I, [2024-04-20T05:57:25.347546 #295148] INFO -- : I, [2024-04-20T05:57:25.365640 #295148] INFO -- : generating enc.mk I, [2024-04-20T05:57:26.824740 #295148] INFO -- : making enc I, [2024-04-20T05:57:27.000501 #295148] INFO -- : make[1]: Entering directory '/tmp/ruby/build/trunk' I, [2024-04-20T05:57:27.000709 #295148] INFO -- : make[1]: Nothing to be done for 'enc'. I, [2024-04-20T05:57:27.000808 #295148] INFO -- : make[1]: Leaving directory '/tmp/ruby/build/trunk' I, [2024-04-20T05:57:27.003455 #295148] INFO -- : making srcs under enc I, [2024-04-20T05:57:27.300737 #295148] INFO -- : make[1]: Entering directory '/tmp/ruby/build/trunk' I, [2024-04-20T05:57:27.300940 #295148] INFO -- : make[1]: Nothing to be done for 'srcs'. I, [2024-04-20T05:57:27.301044 #295148] INFO -- : make[1]: Leaving directory '/tmp/ruby/build/trunk' I, [2024-04-20T05:57:27.305708 #295148] INFO -- : generating transdb.h I, [2024-04-20T05:57:28.639107 #295148] INFO -- : transdb.h unchanged I, [2024-04-20T05:57:28.645173 #295148] INFO -- : making trans I, [2024-04-20T05:57:28.985187 #295148] INFO -- : make[1]: Entering directory '/tmp/ruby/build/trunk' I, [2024-04-20T05:57:28.985468 #295148] INFO -- : make[1]: Nothing to be done for 'trans'. I, [2024-04-20T05:57:28.985682 #295148] INFO -- : make[1]: Leaving directory '/tmp/ruby/build/trunk' I, [2024-04-20T05:57:28.988668 #295148] INFO -- : making encs I, [2024-04-20T05:57:29.378144 #295148] INFO -- : make[1]: Entering directory '/tmp/ruby/build/trunk' I, [2024-04-20T05:57:29.378423 #295148] INFO -- : make[1]: Nothing to be done for 'encs'. I, [2024-04-20T05:57:29.378643 #295148] INFO -- : make[1]: Leaving directory '/tmp/ruby/build/trunk' I, [2024-04-20T05:57:29.391542 #295148] INFO -- : generating makefiles ext/configure-ext.mk I, [2024-04-20T05:57:29.598645 #295148] INFO -- : ext/configure-ext.mk updated I, [2024-04-20T05:57:29.612659 #295148] INFO -- : make[1]: Entering directory '/tmp/ruby/build/trunk' I, [2024-04-20T05:57:41.576446 #295148] INFO -- : make[1]: Leaving directory '/tmp/ruby/build/trunk' I, [2024-04-20T05:57:41.578606 #295148] INFO -- : generating makefile exts.mk I, [2024-04-20T05:57:41.907502 #295148] INFO -- : exts.mk unchanged I, [2024-04-20T05:57:41.944398 #295148] INFO -- : make[1]: Entering directory '/tmp/ruby/build/trunk' I, [2024-04-20T05:57:44.134390 #295148] INFO -- : make[2]: Entering directory '/tmp/ruby/build/trunk/ext/coverage' I, [2024-04-20T05:57:44.158920 #295148] INFO -- : make[2]: Leaving directory '/tmp/ruby/build/trunk/ext/coverage' I, [2024-04-20T05:57:44.200514 #295148] INFO -- : make[2]: Entering directory '/tmp/ruby/build/trunk/ext/date' I, [2024-04-20T05:57:44.228941 #295148] INFO -- : make[2]: Leaving directory '/tmp/ruby/build/trunk/ext/date' I, [2024-04-20T05:57:44.254245 #295148] INFO -- : make[2]: Entering directory '/tmp/ruby/build/trunk/ext/digest' I, [2024-04-20T05:57:44.304172 #295148] INFO -- : make[2]: Leaving directory '/tmp/ruby/build/trunk/ext/digest' I, [2024-04-20T05:57:44.473581 #295148] INFO -- : make[2]: Entering directory '/tmp/ruby/build/trunk/ext/digest/sha2' I, [2024-04-20T05:57:44.509831 #295148] INFO -- : make[2]: Leaving directory '/tmp/ruby/build/trunk/ext/digest/sha2' I, [2024-04-20T05:57:44.645090 #295148] INFO -- : make[2]: Entering directory '/tmp/ruby/build/trunk/ext/fiddle' I, [2024-04-20T05:57:44.720852 #295148] INFO -- : make[2]: Leaving directory '/tmp/ruby/build/trunk/ext/fiddle' I, [2024-04-20T05:57:44.753134 #295148] INFO -- : make[2]: Entering directory '/tmp/ruby/build/trunk/ext/io/console' I, [2024-04-20T05:57:44.776200 #295148] INFO -- : make[2]: Leaving directory '/tmp/ruby/build/trunk/ext/io/console' I, [2024-04-20T05:57:44.864626 #295148] INFO -- : make[2]: Entering directory '/tmp/ruby/build/trunk/ext/json' I, [2024-04-20T05:57:44.938711 #295148] INFO -- : make[2]: Leaving directory '/tmp/ruby/build/trunk/ext/json' I, [2024-04-20T05:57:45.033006 #295148] INFO -- : make[2]: Entering directory '/tmp/ruby/build/trunk/ext/monitor' I, [2024-04-20T05:57:45.053223 #295148] INFO -- : make[2]: Leaving directory '/tmp/ruby/build/trunk/ext/monitor' I, [2024-04-20T05:57:45.098651 #295148] INFO -- : make[2]: Entering directory '/tmp/ruby/build/trunk/ext/objspace' I, [2024-04-20T05:57:45.142500 #295148] INFO -- : make[2]: Leaving directory '/tmp/ruby/build/trunk/ext/objspace' I, [2024-04-20T05:57:45.264509 #295148] INFO -- : make[2]: Entering directory '/tmp/ruby/build/trunk/ext/openssl' I, [2024-04-20T05:57:45.400295 #295148] INFO -- : make[2]: Leaving directory '/tmp/ruby/build/trunk/ext/openssl' I, [2024-04-20T05:57:45.431973 #295148] INFO -- : make[2]: Entering directory '/tmp/ruby/build/trunk/ext/pathname' I, [2024-04-20T05:57:45.462689 #295148] INFO -- : make[2]: Leaving directory '/tmp/ruby/build/trunk/ext/pathname' I, [2024-04-20T05:57:45.502852 #295148] INFO -- : make[2]: Entering directory '/tmp/ruby/build/trunk/ext/psych' I, [2024-04-20T05:57:45.677351 #295148] INFO -- : make[2]: Leaving directory '/tmp/ruby/build/trunk/ext/psych' I, [2024-04-20T05:57:45.710822 #295148] INFO -- : make[2]: Entering directory '/tmp/ruby/build/trunk/ext/pty' I, [2024-04-20T05:57:45.732897 #295148] INFO -- : make[2]: Leaving directory '/tmp/ruby/build/trunk/ext/pty' I, [2024-04-20T05:57:45.848602 #295148] INFO -- : make[2]: Entering directory '/tmp/ruby/build/trunk/ext/ripper' I, [2024-04-20T05:57:45.895493 #295148] INFO -- : make[2]: Leaving directory '/tmp/ruby/build/trunk/ext/ripper' I, [2024-04-20T05:57:45.906747 #295148] INFO -- : make[2]: Entering directory '/tmp/ruby/build/trunk/ext/rubyvm' I, [2024-04-20T05:57:45.922203 #295148] INFO -- : make[2]: Leaving directory '/tmp/ruby/build/trunk/ext/rubyvm' I, [2024-04-20T05:57:46.010279 #295148] INFO -- : make[2]: Entering directory '/tmp/ruby/build/trunk/ext/socket' I, [2024-04-20T05:57:46.066412 #295148] INFO -- : make[2]: Leaving directory '/tmp/ruby/build/trunk/ext/socket' I, [2024-04-20T05:57:46.185255 #295148] INFO -- : make[2]: Entering directory '/tmp/ruby/build/trunk/.bundle/gems/bigdecimal-3.1.7/ext/bigdecimal' I, [2024-04-20T05:57:46.340780 #295148] INFO -- : make[2]: Leaving directory '/tmp/ruby/build/trunk/.bundle/gems/bigdecimal-3.1.7/ext/bigdecimal' I, [2024-04-20T05:57:46.358212 #295148] INFO -- : make[2]: Entering directory '/tmp/ruby/build/trunk/.bundle/gems/debug-1.9.2/ext/debug' I, [2024-04-20T05:57:46.510680 #295148] INFO -- : make[2]: Leaving directory '/tmp/ruby/build/trunk/.bundle/gems/debug-1.9.2/ext/debug' I, [2024-04-20T05:57:46.529236 #295148] INFO -- : make[2]: Entering directory '/tmp/ruby/build/trunk/.bundle/gems/nkf-0.2.0/ext/nkf' I, [2024-04-20T05:57:46.687074 #295148] INFO -- : make[2]: Leaving directory '/tmp/ruby/build/trunk/.bundle/gems/nkf-0.2.0/ext/nkf' I, [2024-04-20T05:57:46.708302 #295148] INFO -- : make[2]: Entering directory '/tmp/ruby/build/trunk/.bundle/gems/racc-1.7.3/ext/racc/cparse' I, [2024-04-20T05:57:46.861850 #295148] INFO -- : make[2]: Leaving directory '/tmp/ruby/build/trunk/.bundle/gems/racc-1.7.3/ext/racc/cparse' I, [2024-04-20T05:57:46.884093 #295148] INFO -- : make[2]: Entering directory '/tmp/ruby/build/trunk/.bundle/gems/rbs-3.4.4/ext/rbs_extension' I, [2024-04-20T05:57:47.035549 #295148] INFO -- : make[2]: Leaving directory '/tmp/ruby/build/trunk/.bundle/gems/rbs-3.4.4/ext/rbs_extension' I, [2024-04-20T05:57:47.050392 #295148] INFO -- : make[2]: Entering directory '/tmp/ruby/build/trunk/.bundle/gems/syslog-0.1.2/ext/syslog' I, [2024-04-20T05:57:47.203036 #295148] INFO -- : make[2]: Leaving directory '/tmp/ruby/build/trunk/.bundle/gems/syslog-0.1.2/ext/syslog' I, [2024-04-20T05:57:47.426567 #295148] INFO -- : make[2]: Entering directory '/tmp/ruby/build/trunk' I, [2024-04-20T05:57:48.065554 #295148] INFO -- : make[2]: 'ruby' is up to date. I, [2024-04-20T05:57:48.065959 #295148] INFO -- : make[2]: Leaving directory '/tmp/ruby/build/trunk' I, [2024-04-20T05:57:48.068101 #295148] INFO -- : make[1]: Leaving directory '/tmp/ruby/build/trunk' I, [2024-04-20T05:57:48.100858 #295148] INFO -- : make[1]: Entering directory '/tmp/ruby/build/trunk' I, [2024-04-20T05:57:48.101060 #295148] INFO -- : make[1]: Nothing to be done for 'note'. I, [2024-04-20T05:57:48.101163 #295148] INFO -- : make[1]: Leaving directory '/tmp/ruby/build/trunk' E, [2024-04-20T05:57:48.691288 #295148] ERROR -- : $ /tmp/ruby/build/trunk/miniruby -I/tmp/ruby/src/trunk/lib /tmp/ruby/src/trunk/tool/runruby.rb --archdir=/tmp/ruby/build/trunk --extout=.ext -- /tmp/ruby/src/trunk/spec/mspec/bin/mspec-run -B /tmp/ruby/src/trunk/spec/default.mspec --error-output stderr --debug -fy -o /tmp/rubytest.20240420-381073-jw3buu/1-mspec-multi-0 E, [2024-04-20T05:57:48.692375 #295148] ERROR -- : $ /tmp/ruby/build/trunk/miniruby -I/tmp/ruby/src/trunk/lib /tmp/ruby/src/trunk/tool/runruby.rb --archdir=/tmp/ruby/build/trunk --extout=.ext -- /tmp/ruby/src/trunk/spec/mspec/bin/mspec-run -B /tmp/ruby/src/trunk/spec/default.mspec --error-output stderr --debug -fy -o /tmp/rubytest.20240420-381073-jw3buu/2-mspec-multi-1 E, [2024-04-20T05:57:48.693498 #295148] ERROR -- : $ /tmp/ruby/build/trunk/miniruby -I/tmp/ruby/src/trunk/lib /tmp/ruby/src/trunk/tool/runruby.rb --archdir=/tmp/ruby/build/trunk --extout=.ext -- /tmp/ruby/src/trunk/spec/mspec/bin/mspec-run -B /tmp/ruby/src/trunk/spec/default.mspec --error-output stderr --debug -fy -o /tmp/rubytest.20240420-381073-jw3buu/3-mspec-multi-2 E, [2024-04-20T05:57:48.694599 #295148] ERROR -- : $ /tmp/ruby/build/trunk/miniruby -I/tmp/ruby/src/trunk/lib /tmp/ruby/src/trunk/tool/runruby.rb --archdir=/tmp/ruby/build/trunk --extout=.ext -- /tmp/ruby/src/trunk/spec/mspec/bin/mspec-run -B /tmp/ruby/src/trunk/spec/default.mspec --error-output stderr --debug -fy -o /tmp/rubytest.20240420-381073-jw3buu/4-mspec-multi-3 I, [2024-04-20T05:57:49.663770 #295148] INFO -- : ruby 3.4.0dev (2024-04-20T02:34:52Z master 9f9755664d) [riscv64-linux] I, [2024-04-20T05:58:19.839734 #295148] INFO -- : 0 ......................................................................... I, [2024-04-20T05:58:31.336142 #295148] INFO -- : 73 ......................................................................... I, [2024-04-20T05:58:32.410604 #295148] INFO -- : 146 ......................................................................... I, [2024-04-20T05:58:34.158847 #295148] INFO -- : 219 ......................................................................... I, [2024-04-20T05:58:34.848374 #295148] INFO -- : 292 ......................................................................... I, [2024-04-20T05:58:35.933563 #295148] INFO -- : 365 ......................................................................... I, [2024-04-20T05:58:36.680171 #295148] INFO -- : 438 ......................................................................... I, [2024-04-20T05:58:37.007439 #295148] INFO -- : 511 ......................................................................... I, [2024-04-20T05:58:37.336817 #295148] INFO -- : 584 ......................................................................... I, [2024-04-20T05:58:40.231781 #295148] INFO -- : 657 ......................................................................... I, [2024-04-20T05:58:40.791025 #295148] INFO -- : 730 ......................................................................... I, [2024-04-20T05:58:41.080606 #295148] INFO -- : 803 ......................................................................... I, [2024-04-20T05:58:42.136151 #295148] INFO -- : 876 ......................................................................... I, [2024-04-20T05:58:42.754845 #295148] INFO -- : 949 ......................................................................... I, [2024-04-20T05:58:45.452345 #295148] INFO -- : 1022 ......................................................................... I, [2024-04-20T05:58:56.822094 #295148] INFO -- : 1095 ......................................................................... I, [2024-04-20T05:59:02.041492 #295148] INFO -- : 1168 ......................................................................... I, [2024-04-20T05:59:03.102391 #295148] INFO -- : 1241 ......................................................................... I, [2024-04-20T05:59:04.115715 #295148] INFO -- : 1314 ......................................................................... I, [2024-04-20T05:59:04.474048 #295148] INFO -- : 1387 ......................................................................... I, [2024-04-20T05:59:10.560558 #295148] INFO -- : 1460 ......................................................................... I, [2024-04-20T05:59:26.976226 #295148] INFO -- : 1533 ......................................................................... I, [2024-04-20T05:59:28.972060 #295148] INFO -- : 1606 ......................................................................... I, [2024-04-20T05:59:32.438700 #295148] INFO -- : 1679 ......................................................................... I, [2024-04-20T05:59:34.751939 #295148] INFO -- : 1752 ......................................................................... I, [2024-04-20T05:59:36.786549 #295148] INFO -- : 1825 ......................................................................... I, [2024-04-20T05:59:38.830266 #295148] INFO -- : 1898 ......................................................................... I, [2024-04-20T05:59:40.479088 #295148] INFO -- : 1971 ......................................................................... I, [2024-04-20T05:59:42.526729 #295148] INFO -- : 2044 ......................................................................... I, [2024-04-20T05:59:43.738099 #295148] INFO -- : 2117 ......................................................................... I, [2024-04-20T05:59:44.271659 #295148] INFO -- : 2190 ......................................................................... I, [2024-04-20T05:59:44.555407 #295148] INFO -- : 2263 ......................................................................... I, [2024-04-20T05:59:44.831300 #295148] INFO -- : 2336 ......................................................................... I, [2024-04-20T05:59:45.334848 #295148] INFO -- : 2409 ......................................................................... I, [2024-04-20T05:59:46.570369 #295148] INFO -- : 2482 ......................................................................... I, [2024-04-20T05:59:47.265800 #295148] INFO -- : 2555 ......................................................................... I, [2024-04-20T05:59:50.347451 #295148] INFO -- : 2628 ......................................................................... I, [2024-04-20T05:59:52.117604 #295148] INFO -- : 2701 ......................................................................... I, [2024-04-20T05:59:52.744056 #295148] INFO -- : 2774 ......................................................................... I, [2024-04-20T05:59:54.111694 #295148] INFO -- : 2847 ......................................................................... I, [2024-04-20T05:59:55.273441 #295148] INFO -- : 2920 ......................................................................... I, [2024-04-20T05:59:56.061032 #295148] INFO -- : 2993 ......................................................................... I, [2024-04-20T05:59:56.540073 #295148] INFO -- : 3066 ......................................................................... I, [2024-04-20T05:59:56.849818 #295148] INFO -- : 3139 ......................................................................... I, [2024-04-20T05:59:57.213686 #295148] INFO -- : 3212 ......................................................................... I, [2024-04-20T05:59:57.632943 #295148] INFO -- : 3285 ......................................................................... I, [2024-04-20T06:00:03.887709 #295148] INFO -- : 3358 ........................................................................ I, [2024-04-20T06:00:03.887963 #295148] INFO -- : I, [2024-04-20T06:00:03.888070 #295148] INFO -- : Finished in 135.194680 seconds I, [2024-04-20T06:00:03.888198 #295148] INFO -- : I, [2024-04-20T06:00:03.888322 #295148] INFO -- : 3429 files, 32607 examples, 135653 expectations, 0 failures, 0 errors, 0 tagged I, [2024-04-20T06:00:03.901502 #295148] INFO -- : $$$[end] "make yes-test-rubyspec MSPECOPT='--error-output stderr --debug -j' TESTS='-j4'" exit with 0.