# Logfile created on 2024-04-19 20:41:13 +0000 by logger.rb/v1.5.0 I, [2024-04-19T20:41:13.310586 #4016665] INFO -- : #, @formatter=nil, @logdev=#, @binmode=false, @mon_data=#, @mon_data_owner_object_id=860>>> I, [2024-04-19T20:41:13.312168 #4016665] INFO -- : $$$[beg] make update-unicode -j4 I, [2024-04-19T20:41:13.837829 #4016665] INFO -- : Downloading Unicode emoji 15.0 files... I, [2024-04-19T20:41:13.839330 #4016665] INFO -- : Downloading Unicode emoji 15.0 files... I, [2024-04-19T20:41:13.839563 #4016665] INFO -- : Downloading Unicode emoji 15.0 files... I, [2024-04-19T20:41:14.467884 #4016665] INFO -- : made symlink emoji/15.0/emoji-sequences.txt to /tmp/ruby/src/trunk/.downloaded-cache/emoji/15.0/emoji-sequences.txt I, [2024-04-19T20:41:14.469753 #4016665] INFO -- : downloading emoji/15.0/emoji-test.txt ... /tmp/ruby/src/trunk/enc/unicode/data/emoji/15.0/emoji-sequences.txt already exists I, [2024-04-19T20:41:14.490052 #4016665] INFO -- : downloading emoji/15.0/emoji-test.txt ... /tmp/ruby/src/trunk/enc/unicode/data/emoji/15.0/emoji-sequences.txt already exists E, [2024-04-19T20:41:15.209685 #4016665] ERROR -- : /tmp/ruby/src/trunk/tool/downloader.rb:302:in `rescue in download': failed to download emoji/15.0/emoji-test.txt (RuntimeError) E, [2024-04-19T20:41:15.209938 #4016665] ERROR -- : OpenURI::HTTPError: 403 Forbidden: https://www.unicode.org/Public/emoji/15.0/emoji-test.txt E, [2024-04-19T20:41:15.210084 #4016665] ERROR -- : from /tmp/ruby/src/trunk/tool/downloader.rb:201:in `download' E, [2024-04-19T20:41:15.210195 #4016665] ERROR -- : from /tmp/ruby/src/trunk/tool/downloader.rb:136:in `download' E, [2024-04-19T20:41:15.210297 #4016665] ERROR -- : from /tmp/ruby/src/trunk/tool/downloader.rb:482:in `block in
' E, [2024-04-19T20:41:15.210464 #4016665] ERROR -- : from /tmp/ruby/src/trunk/tool/downloader.rb:465:in `each' E, [2024-04-19T20:41:15.210897 #4016665] ERROR -- : from /tmp/ruby/src/trunk/tool/downloader.rb:465:in `
' E, [2024-04-19T20:41:15.211053 #4016665] ERROR -- : /usr/lib/ruby/3.1.0/open-uri.rb:364:in `open_http': 403 Forbidden (OpenURI::HTTPError) E, [2024-04-19T20:41:15.211164 #4016665] ERROR -- : from /usr/lib/ruby/3.1.0/open-uri.rb:741:in `buffer_open' E, [2024-04-19T20:41:15.211294 #4016665] ERROR -- : from /usr/lib/ruby/3.1.0/open-uri.rb:212:in `block in open_loop' E, [2024-04-19T20:41:15.211409 #4016665] ERROR -- : from /usr/lib/ruby/3.1.0/open-uri.rb:210:in `catch' E, [2024-04-19T20:41:15.211518 #4016665] ERROR -- : from /usr/lib/ruby/3.1.0/open-uri.rb:210:in `open_loop' E, [2024-04-19T20:41:15.211630 #4016665] ERROR -- : from /usr/lib/ruby/3.1.0/open-uri.rb:151:in `open_uri' E, [2024-04-19T20:41:15.211835 #4016665] ERROR -- : from /usr/lib/ruby/3.1.0/open-uri.rb:721:in `open' E, [2024-04-19T20:41:15.212159 #4016665] ERROR -- : from /usr/lib/ruby/3.1.0/open-uri.rb:729:in `read' E, [2024-04-19T20:41:15.212369 #4016665] ERROR -- : from /tmp/ruby/src/trunk/tool/downloader.rb:247:in `block in download' E, [2024-04-19T20:41:15.212492 #4016665] ERROR -- : from /tmp/ruby/src/trunk/tool/downloader.rb:378:in `with_retry' E, [2024-04-19T20:41:15.212593 #4016665] ERROR -- : from /tmp/ruby/src/trunk/tool/downloader.rb:246:in `download' E, [2024-04-19T20:41:15.212707 #4016665] ERROR -- : from /tmp/ruby/src/trunk/tool/downloader.rb:136:in `download' E, [2024-04-19T20:41:15.212807 #4016665] ERROR -- : from /tmp/ruby/src/trunk/tool/downloader.rb:482:in `block in
' E, [2024-04-19T20:41:15.212909 #4016665] ERROR -- : from /tmp/ruby/src/trunk/tool/downloader.rb:465:in `each' E, [2024-04-19T20:41:15.213011 #4016665] ERROR -- : from /tmp/ruby/src/trunk/tool/downloader.rb:465:in `
' E, [2024-04-19T20:41:15.213134 #4016665] ERROR -- : /tmp/ruby/src/trunk/tool/downloader.rb:302:in `rescue in download': failed to download emoji/15.0/emoji-test.txt (RuntimeError) E, [2024-04-19T20:41:15.213247 #4016665] ERROR -- : OpenURI::HTTPError: 403 Forbidden: https://www.unicode.org/Public/emoji/15.0/emoji-test.txt E, [2024-04-19T20:41:15.213353 #4016665] ERROR -- : from /tmp/ruby/src/trunk/tool/downloader.rb:201:in `download' E, [2024-04-19T20:41:15.213470 #4016665] ERROR -- : from /tmp/ruby/src/trunk/tool/downloader.rb:136:in `download' E, [2024-04-19T20:41:15.213578 #4016665] ERROR -- : from /tmp/ruby/src/trunk/tool/downloader.rb:482:in `block in
' E, [2024-04-19T20:41:15.213684 #4016665] ERROR -- : from /tmp/ruby/src/trunk/tool/downloader.rb:465:in `each' E, [2024-04-19T20:41:15.213788 #4016665] ERROR -- : from /tmp/ruby/src/trunk/tool/downloader.rb:465:in `
' E, [2024-04-19T20:41:15.213890 #4016665] ERROR -- : /usr/lib/ruby/3.1.0/open-uri.rb:364:in `open_http': 403 Forbidden (OpenURI::HTTPError) E, [2024-04-19T20:41:15.213991 #4016665] ERROR -- : from /usr/lib/ruby/3.1.0/open-uri.rb:741:in `buffer_open' E, [2024-04-19T20:41:15.214092 #4016665] ERROR -- : from /usr/lib/ruby/3.1.0/open-uri.rb:212:in `block in open_loop' E, [2024-04-19T20:41:15.214194 #4016665] ERROR -- : from /usr/lib/ruby/3.1.0/open-uri.rb:210:in `catch' E, [2024-04-19T20:41:15.214313 #4016665] ERROR -- : from /usr/lib/ruby/3.1.0/open-uri.rb:210:in `open_loop' E, [2024-04-19T20:41:15.214423 #4016665] ERROR -- : from /usr/lib/ruby/3.1.0/open-uri.rb:151:in `open_uri' E, [2024-04-19T20:41:15.214629 #4016665] ERROR -- : from /usr/lib/ruby/3.1.0/open-uri.rb:721:in `open' E, [2024-04-19T20:41:15.214775 #4016665] ERROR -- : from /usr/lib/ruby/3.1.0/open-uri.rb:729:in `read' E, [2024-04-19T20:41:15.214887 #4016665] ERROR -- : from /tmp/ruby/src/trunk/tool/downloader.rb:247:in `block in download' E, [2024-04-19T20:41:15.214994 #4016665] ERROR -- : from /tmp/ruby/src/trunk/tool/downloader.rb:378:in `with_retry' E, [2024-04-19T20:41:15.215106 #4016665] ERROR -- : from /tmp/ruby/src/trunk/tool/downloader.rb:246:in `download' E, [2024-04-19T20:41:15.215212 #4016665] ERROR -- : from /tmp/ruby/src/trunk/tool/downloader.rb:136:in `download' E, [2024-04-19T20:41:15.215311 #4016665] ERROR -- : from /tmp/ruby/src/trunk/tool/downloader.rb:482:in `block in
' E, [2024-04-19T20:41:15.215440 #4016665] ERROR -- : from /tmp/ruby/src/trunk/tool/downloader.rb:465:in `each' E, [2024-04-19T20:41:15.215557 #4016665] ERROR -- : from /tmp/ruby/src/trunk/tool/downloader.rb:465:in `
' E, [2024-04-19T20:41:15.230571 #4016665] ERROR -- : /tmp/ruby/src/trunk/tool/downloader.rb:302:in `rescue in download': failed to download emoji/15.0/emoji-test.txt (RuntimeError) E, [2024-04-19T20:41:15.230775 #4016665] ERROR -- : OpenURI::HTTPError: 403 Forbidden: https://www.unicode.org/Public/emoji/15.0/emoji-test.txt E, [2024-04-19T20:41:15.230895 #4016665] ERROR -- : from /tmp/ruby/src/trunk/tool/downloader.rb:201:in `download' E, [2024-04-19T20:41:15.231020 #4016665] ERROR -- : from /tmp/ruby/src/trunk/tool/downloader.rb:136:in `download' E, [2024-04-19T20:41:15.231162 #4016665] ERROR -- : from /tmp/ruby/src/trunk/tool/downloader.rb:482:in `block in
' E, [2024-04-19T20:41:15.231568 #4016665] ERROR -- : from /tmp/ruby/src/trunk/tool/downloader.rb:465:in `each' E, [2024-04-19T20:41:15.231756 #4016665] ERROR -- : from /tmp/ruby/src/trunk/tool/downloader.rb:465:in `
' E, [2024-04-19T20:41:15.231868 #4016665] ERROR -- : /usr/lib/ruby/3.1.0/open-uri.rb:364:in `open_http': 403 Forbidden (OpenURI::HTTPError) E, [2024-04-19T20:41:15.231986 #4016665] ERROR -- : from /usr/lib/ruby/3.1.0/open-uri.rb:741:in `buffer_open' E, [2024-04-19T20:41:15.232105 #4016665] ERROR -- : from /usr/lib/ruby/3.1.0/open-uri.rb:212:in `block in open_loop' E, [2024-04-19T20:41:15.232211 #4016665] ERROR -- : from /usr/lib/ruby/3.1.0/open-uri.rb:210:in `catch' E, [2024-04-19T20:41:15.232313 #4016665] ERROR -- : from /usr/lib/ruby/3.1.0/open-uri.rb:210:in `open_loop' E, [2024-04-19T20:41:15.232408 #4016665] ERROR -- : from /usr/lib/ruby/3.1.0/open-uri.rb:151:in `open_uri' E, [2024-04-19T20:41:15.232539 #4016665] ERROR -- : from /usr/lib/ruby/3.1.0/open-uri.rb:721:in `open' E, [2024-04-19T20:41:15.232674 #4016665] ERROR -- : from /usr/lib/ruby/3.1.0/open-uri.rb:729:in `read' E, [2024-04-19T20:41:15.232785 #4016665] ERROR -- : from /tmp/ruby/src/trunk/tool/downloader.rb:247:in `block in download' E, [2024-04-19T20:41:15.232885 #4016665] ERROR -- : from /tmp/ruby/src/trunk/tool/downloader.rb:378:in `with_retry' E, [2024-04-19T20:41:15.232971 #4016665] ERROR -- : from /tmp/ruby/src/trunk/tool/downloader.rb:246:in `download' E, [2024-04-19T20:41:15.233057 #4016665] ERROR -- : from /tmp/ruby/src/trunk/tool/downloader.rb:136:in `download' E, [2024-04-19T20:41:15.233146 #4016665] ERROR -- : from /tmp/ruby/src/trunk/tool/downloader.rb:482:in `block in
' E, [2024-04-19T20:41:15.233248 #4016665] ERROR -- : from /tmp/ruby/src/trunk/tool/downloader.rb:465:in `each' E, [2024-04-19T20:41:15.233365 #4016665] ERROR -- : from /tmp/ruby/src/trunk/tool/downloader.rb:465:in `
' E, [2024-04-19T20:41:15.234101 #4016665] ERROR -- : make: *** [uncommon.mk:1782: /tmp/ruby/src/trunk/enc/unicode/data/emoji/15.0/emoji-zwj-sequences.txt] Error 1 E, [2024-04-19T20:41:15.234281 #4016665] ERROR -- : make: *** Waiting for unfinished jobs.... E, [2024-04-19T20:41:15.234366 #4016665] ERROR -- : make: *** [uncommon.mk:1782: /tmp/ruby/src/trunk/enc/unicode/data/emoji/15.0/emoji-test.txt] Error 1 E, [2024-04-19T20:41:15.250722 #4016665] ERROR -- : make: *** [uncommon.mk:1782: /tmp/ruby/src/trunk/enc/unicode/data/emoji/15.0/emoji-sequences.txt] Error 1 E, [2024-04-19T20:41:15.250916 #4016665] ERROR -- : make: *** Deleting file '/tmp/ruby/src/trunk/enc/unicode/data/emoji/15.0/emoji-sequences.txt' I, [2024-04-19T20:41:15.251032 #4016665] INFO -- : downloading emoji/15.0/emoji-test.txt ... I, [2024-04-19T20:41:15.252329 #4016665] INFO -- : $$$[end] "make update-unicode -j4" exit with 512. I, [2024-04-19T20:41:15.252525 #4016665] INFO -- : $$$[beg] make update-download -j4 I, [2024-04-19T20:41:16.409663 #4016665] INFO -- : tool/config.guess already exists I, [2024-04-19T20:41:16.410058 #4016665] INFO -- : tool/config.sub already exists I, [2024-04-19T20:41:16.428617 #4016665] INFO -- : Update minitest to ea9caafc0754b1d6236a490d59e624b53209734a I, [2024-04-19T20:41:16.429581 #4016665] INFO -- : Update power_assert to 84e85124c5014a139af39161d484156cfe87a9ed I, [2024-04-19T20:41:16.432562 #4016665] INFO -- : Update rbs to ba7872795d5de04adb8ff500c0e6afdc81a041dd I, [2024-04-19T20:41:16.433964 #4016665] INFO -- : Update typeprof to b19a6416da3a05d57fadd6ffdadb382b6d236ca5 I, [2024-04-19T20:41:16.437490 #4016665] INFO -- : echo ea9caafc0754b1d6236a490d59e624b53209734a | /bin/sh /tmp/ruby/src/trunk/tool/ifchange /tmp/ruby/src/trunk/.bundle/.timestamp/minitest.revision - I, [2024-04-19T20:41:16.438236 #4016665] INFO -- : echo 84e85124c5014a139af39161d484156cfe87a9ed | /bin/sh /tmp/ruby/src/trunk/tool/ifchange /tmp/ruby/src/trunk/.bundle/.timestamp/power_assert.revision - I, [2024-04-19T20:41:16.442809 #4016665] INFO -- : echo ba7872795d5de04adb8ff500c0e6afdc81a041dd | /bin/sh /tmp/ruby/src/trunk/tool/ifchange /tmp/ruby/src/trunk/.bundle/.timestamp/rbs.revision - I, [2024-04-19T20:41:16.444439 #4016665] INFO -- : echo b19a6416da3a05d57fadd6ffdadb382b6d236ca5 | /bin/sh /tmp/ruby/src/trunk/tool/ifchange /tmp/ruby/src/trunk/.bundle/.timestamp/typeprof.revision - I, [2024-04-19T20:41:16.450375 #4016665] INFO -- : /tmp/ruby/src/trunk/.bundle/.timestamp/minitest.revision unchanged I, [2024-04-19T20:41:16.450706 #4016665] INFO -- : /tmp/ruby/src/trunk/.bundle/.timestamp/power_assert.revision unchanged I, [2024-04-19T20:41:16.455656 #4016665] INFO -- : /tmp/ruby/src/trunk/.bundle/.timestamp/rbs.revision unchanged I, [2024-04-19T20:41:16.460043 #4016665] INFO -- : /tmp/ruby/src/trunk/.bundle/.timestamp/typeprof.revision unchanged I, [2024-04-19T20:41:17.274526 #4016665] INFO -- : Building power_assert@84e85124c5014a139af39161d484156cfe87a9ed to /tmp/ruby/src/trunk/gems/power_assert-2.0.3.gem I, [2024-04-19T20:41:18.209223 #4016665] INFO -- : Successfully built RubyGem I, [2024-04-19T20:41:18.209422 #4016665] INFO -- : Name: power_assert I, [2024-04-19T20:41:18.209538 #4016665] INFO -- : Version: 2.0.4dev I, [2024-04-19T20:41:18.209630 #4016665] INFO -- : File: power_assert-2.0.4dev.gem I, [2024-04-19T20:41:18.922981 #4016665] INFO -- : $$$[end] "make update-download -j4" exit with 0. I, [2024-04-19T20:41:18.923229 #4016665] INFO -- : $$$[beg] make update-rubyspec -j4 I, [2024-04-19T20:41:19.457613 #4016665] INFO -- : make: Nothing to be done for 'update-rubyspec'. I, [2024-04-19T20:41:19.459300 #4016665] INFO -- : $$$[end] "make update-rubyspec -j4" exit with 0. I, [2024-04-19T20:41:19.459503 #4016665] INFO -- : $$$[beg] make update-src -j4 I, [2024-04-19T20:41:20.916062 #4016665] INFO -- : Already up to date. I, [2024-04-19T20:41:20.987081 #4016665] INFO -- : Latest commit hash = 23be6599a2 I, [2024-04-19T20:41:20.993698 #4016665] INFO -- : $$$[end] "make update-src -j4" exit with 0. I, [2024-04-19T20:41:20.993944 #4016665] INFO -- : $$$[beg] make after-update -j4 I, [2024-04-19T20:41:21.824289 #4016665] INFO -- : /tmp/ruby/src/trunk/revision.h updated I, [2024-04-19T20:41:21.833888 #4016665] INFO -- : generating riscv64-linux-fake.rb I, [2024-04-19T20:41:22.313247 #4016665] INFO -- : riscv64-linux-fake.rb updated I, [2024-04-19T20:41:22.319574 #4016665] INFO -- : generating enc.mk I, [2024-04-19T20:41:23.779188 #4016665] INFO -- : making srcs under enc I, [2024-04-19T20:41:24.077981 #4016665] INFO -- : make[1]: Entering directory '/tmp/ruby/build/trunk' I, [2024-04-19T20:41:24.078203 #4016665] INFO -- : make[1]: Nothing to be done for 'srcs'. I, [2024-04-19T20:41:24.082985 #4016665] INFO -- : make[1]: Leaving directory '/tmp/ruby/build/trunk' I, [2024-04-19T20:41:24.762857 #4016665] INFO -- : Update minitest to ea9caafc0754b1d6236a490d59e624b53209734a I, [2024-04-19T20:41:24.763752 #4016665] INFO -- : Update power_assert to 84e85124c5014a139af39161d484156cfe87a9ed I, [2024-04-19T20:41:24.766868 #4016665] INFO -- : Update typeprof to b19a6416da3a05d57fadd6ffdadb382b6d236ca5 I, [2024-04-19T20:41:24.767617 #4016665] INFO -- : Update rbs to ba7872795d5de04adb8ff500c0e6afdc81a041dd I, [2024-04-19T20:41:24.773746 #4016665] INFO -- : echo ea9caafc0754b1d6236a490d59e624b53209734a | /bin/sh /tmp/ruby/src/trunk/tool/ifchange /tmp/ruby/src/trunk/.bundle/.timestamp/minitest.revision - I, [2024-04-19T20:41:24.774428 #4016665] INFO -- : echo 84e85124c5014a139af39161d484156cfe87a9ed | /bin/sh /tmp/ruby/src/trunk/tool/ifchange /tmp/ruby/src/trunk/.bundle/.timestamp/power_assert.revision - I, [2024-04-19T20:41:24.780827 #4016665] INFO -- : echo ba7872795d5de04adb8ff500c0e6afdc81a041dd | /bin/sh /tmp/ruby/src/trunk/tool/ifchange /tmp/ruby/src/trunk/.bundle/.timestamp/rbs.revision - I, [2024-04-19T20:41:24.782891 #4016665] INFO -- : echo b19a6416da3a05d57fadd6ffdadb382b6d236ca5 | /bin/sh /tmp/ruby/src/trunk/tool/ifchange /tmp/ruby/src/trunk/.bundle/.timestamp/typeprof.revision - I, [2024-04-19T20:41:24.786743 #4016665] INFO -- : /tmp/ruby/src/trunk/.bundle/.timestamp/power_assert.revision unchanged I, [2024-04-19T20:41:24.788161 #4016665] INFO -- : /tmp/ruby/src/trunk/.bundle/.timestamp/minitest.revision unchanged I, [2024-04-19T20:41:24.793862 #4016665] INFO -- : /tmp/ruby/src/trunk/.bundle/.timestamp/typeprof.revision unchanged I, [2024-04-19T20:41:24.795180 #4016665] INFO -- : /tmp/ruby/src/trunk/.bundle/.timestamp/rbs.revision unchanged I, [2024-04-19T20:41:25.604230 #4016665] INFO -- : Building power_assert@84e85124c5014a139af39161d484156cfe87a9ed to /tmp/ruby/src/trunk/gems/power_assert-2.0.3.gem I, [2024-04-19T20:41:26.537172 #4016665] INFO -- : Successfully built RubyGem I, [2024-04-19T20:41:26.537378 #4016665] INFO -- : Name: power_assert I, [2024-04-19T20:41:26.537472 #4016665] INFO -- : Version: 2.0.4dev I, [2024-04-19T20:41:26.542250 #4016665] INFO -- : File: power_assert-2.0.4dev.gem I, [2024-04-19T20:41:26.552736 #4016665] INFO -- : Extracting bundle gem power_assert-2.0.3... I, [2024-04-19T20:41:27.408736 #4016665] INFO -- : Try with hash version of bundled gems instead of gems/power_assert-2.0.3.gem. We don't use this gem with release version of Ruby. I, [2024-04-19T20:41:27.463446 #4016665] INFO -- : Unpacked gems/power_assert-2.0.4dev.gem I, [2024-04-19T20:41:27.478726 #4016665] INFO -- : $$$[end] "make after-update -j4" exit with 0. I, [2024-04-19T20:41:27.479516 #4016665] INFO -- : $$$[beg] make miniruby -j4 I, [2024-04-19T20:41:27.992133 #4016665] INFO -- : BASERUBY = /usr/bin/ruby --disable=gems I, [2024-04-19T20:41:27.992375 #4016665] INFO -- : CC = gcc I, [2024-04-19T20:41:27.992499 #4016665] INFO -- : LD = ld I, [2024-04-19T20:41:27.992619 #4016665] INFO -- : LDSHARED = gcc -shared I, [2024-04-19T20:41:27.992745 #4016665] INFO -- : CFLAGS = -O3 -fno-fast-math -ggdb3 -Wall -Wextra -Wdeprecated-declarations -Wdiv-by-zero -Wduplicated-cond -Wimplicit-function-declaration -Wimplicit-int -Wpointer-arith -Wwrite-strings -Wold-style-definition -Wimplicit-fallthrough=0 -Wmissing-noreturn -Wno-cast-function-type -Wno-constant-logical-operand -Wno-long-long -Wno-missing-field-initializers -Wno-overlength-strings -Wno-packed-bitfield-compat -Wno-parentheses-equality -Wno-self-assign -Wno-tautological-compare -Wno-unused-parameter -Wno-unused-value -Wsuggest-attribute=format -Wsuggest-attribute=noreturn -Wunused-variable -Wmisleading-indentation -Wundef -fPIC I, [2024-04-19T20:41:27.992875 #4016665] INFO -- : XCFLAGS = -U_FORTIFY_SOURCE -D_FORTIFY_SOURCE=2 -fstack-protector-strong -fno-strict-overflow -fvisibility=hidden -fexcess-precision=standard -DRUBY_EXPORT -I. -I.ext/include/riscv64-linux -I/tmp/ruby/src/trunk/include -I/tmp/ruby/src/trunk -I/tmp/ruby/src/trunk/prism -I/tmp/ruby/src/trunk/enc/unicode/15.0.0 I, [2024-04-19T20:41:27.992993 #4016665] INFO -- : CPPFLAGS = I, [2024-04-19T20:41:27.993100 #4016665] INFO -- : DLDFLAGS = -Wl,--compress-debug-sections=zlib -Wl,-soname,libruby.so.3.4 -fstack-protector-strong I, [2024-04-19T20:41:27.993203 #4016665] INFO -- : SOLIBS = -lz -lrt -lrt -lgmp -ldl -lcrypt -lm -lpthread I, [2024-04-19T20:41:27.993298 #4016665] INFO -- : LANG = I, [2024-04-19T20:41:27.993390 #4016665] INFO -- : LC_ALL = I, [2024-04-19T20:41:27.993486 #4016665] INFO -- : LC_CTYPE = I, [2024-04-19T20:41:27.993584 #4016665] INFO -- : MFLAGS = -j4 --jobserver-auth=4,5 I, [2024-04-19T20:41:27.993685 #4016665] INFO -- : RUSTC = rustc I, [2024-04-19T20:41:27.993791 #4016665] INFO -- : YJIT_RUSTC_ARGS = --crate-name=yjit --crate-type=staticlib --edition=2021 -g -C lto=thin -C opt-level=3 -C overflow-checks=on '--out-dir=/tmp/ruby/build/trunk/yjit/target/release/' /tmp/ruby/src/trunk/yjit/src/lib.rs I, [2024-04-19T20:41:28.007082 #4016665] INFO -- : gcc (Debian 13.2.0-4revyos1) 13.2.0 I, [2024-04-19T20:41:28.007296 #4016665] INFO -- : Copyright (C) 2023 Free Software Foundation, Inc. I, [2024-04-19T20:41:28.007401 #4016665] INFO -- : This is free software; see the source for copying conditions. There is NO I, [2024-04-19T20:41:28.007505 #4016665] INFO -- : warranty; not even for MERCHANTABILITY or FITNESS FOR A PARTICULAR PURPOSE. I, [2024-04-19T20:41:28.007666 #4016665] INFO -- : I, [2024-04-19T20:41:28.231760 #4016665] INFO -- : compiling /tmp/ruby/src/trunk/version.c I, [2024-04-19T20:41:29.531698 #4016665] INFO -- : linking miniruby I, [2024-04-19T20:42:10.298238 #4016665] INFO -- : $$$[end] "make miniruby -j4" exit with 0. I, [2024-04-19T20:42:10.298987 #4016665] INFO -- : $$$[beg] make ruby -j4 I, [2024-04-19T20:42:10.834712 #4016665] INFO -- : BASERUBY = /usr/bin/ruby --disable=gems I, [2024-04-19T20:42:10.834962 #4016665] INFO -- : CC = gcc I, [2024-04-19T20:42:10.835088 #4016665] INFO -- : LD = ld I, [2024-04-19T20:42:10.835246 #4016665] INFO -- : LDSHARED = gcc -shared I, [2024-04-19T20:42:10.835373 #4016665] INFO -- : CFLAGS = -O3 -fno-fast-math -ggdb3 -Wall -Wextra -Wdeprecated-declarations -Wdiv-by-zero -Wduplicated-cond -Wimplicit-function-declaration -Wimplicit-int -Wpointer-arith -Wwrite-strings -Wold-style-definition -Wimplicit-fallthrough=0 -Wmissing-noreturn -Wno-cast-function-type -Wno-constant-logical-operand -Wno-long-long -Wno-missing-field-initializers -Wno-overlength-strings -Wno-packed-bitfield-compat -Wno-parentheses-equality -Wno-self-assign -Wno-tautological-compare -Wno-unused-parameter -Wno-unused-value -Wsuggest-attribute=format -Wsuggest-attribute=noreturn -Wunused-variable -Wmisleading-indentation -Wundef -fPIC I, [2024-04-19T20:42:10.835495 #4016665] INFO -- : XCFLAGS = -U_FORTIFY_SOURCE -D_FORTIFY_SOURCE=2 -fstack-protector-strong -fno-strict-overflow -fvisibility=hidden -fexcess-precision=standard -DRUBY_EXPORT -I. -I.ext/include/riscv64-linux -I/tmp/ruby/src/trunk/include -I/tmp/ruby/src/trunk -I/tmp/ruby/src/trunk/prism -I/tmp/ruby/src/trunk/enc/unicode/15.0.0 I, [2024-04-19T20:42:10.835623 #4016665] INFO -- : CPPFLAGS = I, [2024-04-19T20:42:10.835742 #4016665] INFO -- : DLDFLAGS = -Wl,--compress-debug-sections=zlib -Wl,-soname,libruby.so.3.4 -fstack-protector-strong I, [2024-04-19T20:42:10.835846 #4016665] INFO -- : SOLIBS = -lz -lrt -lrt -lgmp -ldl -lcrypt -lm -lpthread I, [2024-04-19T20:42:10.835943 #4016665] INFO -- : LANG = I, [2024-04-19T20:42:10.836037 #4016665] INFO -- : LC_ALL = I, [2024-04-19T20:42:10.836128 #4016665] INFO -- : LC_CTYPE = I, [2024-04-19T20:42:10.836227 #4016665] INFO -- : MFLAGS = -j4 --jobserver-auth=4,5 I, [2024-04-19T20:42:10.836336 #4016665] INFO -- : RUSTC = rustc I, [2024-04-19T20:42:10.836447 #4016665] INFO -- : YJIT_RUSTC_ARGS = --crate-name=yjit --crate-type=staticlib --edition=2021 -g -C lto=thin -C opt-level=3 -C overflow-checks=on '--out-dir=/tmp/ruby/build/trunk/yjit/target/release/' /tmp/ruby/src/trunk/yjit/src/lib.rs I, [2024-04-19T20:42:10.849766 #4016665] INFO -- : gcc (Debian 13.2.0-4revyos1) 13.2.0 I, [2024-04-19T20:42:10.849978 #4016665] INFO -- : Copyright (C) 2023 Free Software Foundation, Inc. I, [2024-04-19T20:42:10.850083 #4016665] INFO -- : This is free software; see the source for copying conditions. There is NO I, [2024-04-19T20:42:10.850187 #4016665] INFO -- : warranty; not even for MERCHANTABILITY or FITNESS FOR A PARTICULAR PURPOSE. I, [2024-04-19T20:42:10.850290 #4016665] INFO -- : I, [2024-04-19T20:42:11.479947 #4016665] INFO -- : builtin_binary.inc updated I, [2024-04-19T20:42:11.492811 #4016665] INFO -- : 63c4b2d66003409833406b3a662615f9f67397fdf425c22dee41f60d762f36d6 builtin_binary.inc I, [2024-04-19T20:42:11.499098 #4016665] INFO -- : compiling /tmp/ruby/src/trunk/builtin.c I, [2024-04-19T20:42:13.102651 #4016665] INFO -- : linking static-library libruby-static.a I, [2024-04-19T20:42:20.307807 #4016665] INFO -- : linking shared-library libruby.so.3.4.0 I, [2024-04-19T20:43:01.367333 #4016665] INFO -- : linking ruby I, [2024-04-19T20:43:01.566721 #4016665] INFO -- : $$$[end] "make ruby -j4" exit with 0. I, [2024-04-19T20:43:01.567377 #4016665] INFO -- : $$$[beg] make all -j4 I, [2024-04-19T20:43:02.082648 #4016665] INFO -- : BASERUBY = /usr/bin/ruby --disable=gems I, [2024-04-19T20:43:02.082894 #4016665] INFO -- : CC = gcc I, [2024-04-19T20:43:02.083086 #4016665] INFO -- : LD = ld I, [2024-04-19T20:43:02.083250 #4016665] INFO -- : LDSHARED = gcc -shared I, [2024-04-19T20:43:02.083383 #4016665] INFO -- : CFLAGS = -O3 -fno-fast-math -ggdb3 -Wall -Wextra -Wdeprecated-declarations -Wdiv-by-zero -Wduplicated-cond -Wimplicit-function-declaration -Wimplicit-int -Wpointer-arith -Wwrite-strings -Wold-style-definition -Wimplicit-fallthrough=0 -Wmissing-noreturn -Wno-cast-function-type -Wno-constant-logical-operand -Wno-long-long -Wno-missing-field-initializers -Wno-overlength-strings -Wno-packed-bitfield-compat -Wno-parentheses-equality -Wno-self-assign -Wno-tautological-compare -Wno-unused-parameter -Wno-unused-value -Wsuggest-attribute=format -Wsuggest-attribute=noreturn -Wunused-variable -Wmisleading-indentation -Wundef -fPIC I, [2024-04-19T20:43:02.083518 #4016665] INFO -- : XCFLAGS = -U_FORTIFY_SOURCE -D_FORTIFY_SOURCE=2 -fstack-protector-strong -fno-strict-overflow -fvisibility=hidden -fexcess-precision=standard -DRUBY_EXPORT -I. -I.ext/include/riscv64-linux -I/tmp/ruby/src/trunk/include -I/tmp/ruby/src/trunk -I/tmp/ruby/src/trunk/prism -I/tmp/ruby/src/trunk/enc/unicode/15.0.0 I, [2024-04-19T20:43:02.083649 #4016665] INFO -- : CPPFLAGS = I, [2024-04-19T20:43:02.083762 #4016665] INFO -- : DLDFLAGS = -Wl,--compress-debug-sections=zlib -Wl,-soname,libruby.so.3.4 -fstack-protector-strong I, [2024-04-19T20:43:02.083863 #4016665] INFO -- : SOLIBS = -lz -lrt -lrt -lgmp -ldl -lcrypt -lm -lpthread I, [2024-04-19T20:43:02.083957 #4016665] INFO -- : LANG = I, [2024-04-19T20:43:02.084052 #4016665] INFO -- : LC_ALL = I, [2024-04-19T20:43:02.084155 #4016665] INFO -- : LC_CTYPE = I, [2024-04-19T20:43:02.084257 #4016665] INFO -- : MFLAGS = -j4 --jobserver-auth=4,5 I, [2024-04-19T20:43:02.084363 #4016665] INFO -- : RUSTC = rustc I, [2024-04-19T20:43:02.084489 #4016665] INFO -- : YJIT_RUSTC_ARGS = --crate-name=yjit --crate-type=staticlib --edition=2021 -g -C lto=thin -C opt-level=3 -C overflow-checks=on '--out-dir=/tmp/ruby/build/trunk/yjit/target/release/' /tmp/ruby/src/trunk/yjit/src/lib.rs I, [2024-04-19T20:43:02.098208 #4016665] INFO -- : gcc (Debian 13.2.0-4revyos1) 13.2.0 I, [2024-04-19T20:43:02.098419 #4016665] INFO -- : Copyright (C) 2023 Free Software Foundation, Inc. I, [2024-04-19T20:43:02.098586 #4016665] INFO -- : This is free software; see the source for copying conditions. There is NO I, [2024-04-19T20:43:02.098726 #4016665] INFO -- : warranty; not even for MERCHANTABILITY or FITNESS FOR A PARTICULAR PURPOSE. I, [2024-04-19T20:43:02.098845 #4016665] INFO -- : I, [2024-04-19T20:43:02.402892 #4016665] INFO -- : generating encdb.h I, [2024-04-19T20:43:02.414120 #4016665] INFO -- : generating enc.mk I, [2024-04-19T20:43:02.430811 #4016665] INFO -- : building spec/ruby/optional/capi/ext/array_spec.so I, [2024-04-19T20:43:02.434302 #4016665] INFO -- : building spec/ruby/optional/capi/ext/basic_object_spec.so I, [2024-04-19T20:43:02.666394 #4016665] INFO -- : encdb.h unchanged I, [2024-04-19T20:43:02.672445 #4016665] INFO -- : building spec/ruby/optional/capi/ext/bignum_spec.so I, [2024-04-19T20:43:03.378218 #4016665] INFO -- : building spec/ruby/optional/capi/ext/binding_spec.so I, [2024-04-19T20:43:03.935471 #4016665] INFO -- : building spec/ruby/optional/capi/ext/boolean_spec.so I, [2024-04-19T20:43:04.115906 #4016665] INFO -- : building spec/ruby/optional/capi/ext/class_id_under_autoload_spec.so I, [2024-04-19T20:43:04.418072 #4016665] INFO -- : building spec/ruby/optional/capi/ext/class_spec.so I, [2024-04-19T20:43:04.970698 #4016665] INFO -- : building spec/ruby/optional/capi/ext/class_under_autoload_spec.so I, [2024-04-19T20:43:04.983364 #4016665] INFO -- : building spec/ruby/optional/capi/ext/complex_spec.so I, [2024-04-19T20:43:05.135968 #4016665] INFO -- : building spec/ruby/optional/capi/ext/constants_spec.so I, [2024-04-19T20:43:06.015322 #4016665] INFO -- : building spec/ruby/optional/capi/ext/data_spec.so I, [2024-04-19T20:43:06.074884 #4016665] INFO -- : building spec/ruby/optional/capi/ext/debug_spec.so I, [2024-04-19T20:43:06.139713 #4016665] INFO -- : building spec/ruby/optional/capi/ext/encoding_spec.so I, [2024-04-19T20:43:07.042724 #4016665] INFO -- : building spec/ruby/optional/capi/ext/enumerator_spec.so I, [2024-04-19T20:43:07.376205 #4016665] INFO -- : building spec/ruby/optional/capi/ext/exception_spec.so I, [2024-04-19T20:43:07.410688 #4016665] INFO -- : building spec/ruby/optional/capi/ext/fiber_spec.so I, [2024-04-19T20:43:08.580452 #4016665] INFO -- : building spec/ruby/optional/capi/ext/file_spec.so I, [2024-04-19T20:43:08.627506 #4016665] INFO -- : building spec/ruby/optional/capi/ext/fixnum_spec.so I, [2024-04-19T20:43:08.655870 #4016665] INFO -- : building spec/ruby/optional/capi/ext/float_spec.so I, [2024-04-19T20:43:08.855547 #4016665] INFO -- : building spec/ruby/optional/capi/ext/gc_spec.so I, [2024-04-19T20:43:09.660834 #4016665] INFO -- : building spec/ruby/optional/capi/ext/globals_spec.so I, [2024-04-19T20:43:09.688928 #4016665] INFO -- : building spec/ruby/optional/capi/ext/hash_spec.so I, [2024-04-19T20:43:09.728415 #4016665] INFO -- : building spec/ruby/optional/capi/ext/integer_spec.so I, [2024-04-19T20:43:10.134325 #4016665] INFO -- : building spec/ruby/optional/capi/ext/io_spec.so I, [2024-04-19T20:43:10.823785 #4016665] INFO -- : building spec/ruby/optional/capi/ext/kernel_spec.so I, [2024-04-19T20:43:11.051460 #4016665] INFO -- : building spec/ruby/optional/capi/ext/language_spec.so I, [2024-04-19T20:43:11.139820 #4016665] INFO -- : building spec/ruby/optional/capi/ext/marshal_spec.so I, [2024-04-19T20:43:12.219850 #4016665] INFO -- : building spec/ruby/optional/capi/ext/module_spec.so I, [2024-04-19T20:43:12.241747 #4016665] INFO -- : building spec/ruby/optional/capi/ext/module_under_autoload_spec.so I, [2024-04-19T20:43:12.351307 #4016665] INFO -- : building spec/ruby/optional/capi/ext/mutex_spec.so I, [2024-04-19T20:43:13.287417 #4016665] INFO -- : building spec/ruby/optional/capi/ext/numeric_spec.so I, [2024-04-19T20:43:13.458619 #4016665] INFO -- : building spec/ruby/optional/capi/ext/object_spec.so I, [2024-04-19T20:43:13.464698 #4016665] INFO -- : building spec/ruby/optional/capi/ext/proc_spec.so I, [2024-04-19T20:43:13.844912 #4016665] INFO -- : building spec/ruby/optional/capi/ext/range_spec.so I, [2024-04-19T20:43:14.852039 #4016665] INFO -- : building spec/ruby/optional/capi/ext/rational_spec.so I, [2024-04-19T20:43:14.979935 #4016665] INFO -- : building spec/ruby/optional/capi/ext/rbasic_spec.so I, [2024-04-19T20:43:15.008160 #4016665] INFO -- : building spec/ruby/optional/capi/ext/regexp_spec.so I, [2024-04-19T20:43:15.945726 #4016665] INFO -- : building spec/ruby/optional/capi/ext/st_spec.so I, [2024-04-19T20:43:16.269973 #4016665] INFO -- : building spec/ruby/optional/capi/ext/string_spec.so I, [2024-04-19T20:43:16.297101 #4016665] INFO -- : building spec/ruby/optional/capi/ext/struct_spec.so I, [2024-04-19T20:43:16.300058 #4016665] INFO -- : building spec/ruby/optional/capi/ext/symbol_spec.so I, [2024-04-19T20:43:17.107436 #4016665] INFO -- : building spec/ruby/optional/capi/ext/thread_spec.so I, [2024-04-19T20:43:17.408446 #4016665] INFO -- : building spec/ruby/optional/capi/ext/time_spec.so I, [2024-04-19T20:43:17.890443 #4016665] INFO -- : building spec/ruby/optional/capi/ext/tracepoint_spec.so I, [2024-04-19T20:43:18.596701 #4016665] INFO -- : building spec/ruby/optional/capi/ext/typed_data_spec.so I, [2024-04-19T20:43:18.797674 #4016665] INFO -- : building spec/ruby/optional/capi/ext/util_spec.so I, [2024-04-19T20:43:19.068943 #4016665] INFO -- : making enc I, [2024-04-19T20:43:19.272574 #4016665] INFO -- : make[1]: Entering directory '/tmp/ruby/build/trunk' I, [2024-04-19T20:43:19.272811 #4016665] INFO -- : make[1]: Nothing to be done for 'enc'. I, [2024-04-19T20:43:19.272956 #4016665] INFO -- : make[1]: Leaving directory '/tmp/ruby/build/trunk' I, [2024-04-19T20:43:19.276492 #4016665] INFO -- : making srcs under enc I, [2024-04-19T20:43:19.622325 #4016665] INFO -- : make[1]: Entering directory '/tmp/ruby/build/trunk' I, [2024-04-19T20:43:19.622691 #4016665] INFO -- : make[1]: Nothing to be done for 'srcs'. I, [2024-04-19T20:43:19.622913 #4016665] INFO -- : make[1]: Leaving directory '/tmp/ruby/build/trunk' I, [2024-04-19T20:43:19.632421 #4016665] INFO -- : generating transdb.h I, [2024-04-19T20:43:20.977405 #4016665] INFO -- : transdb.h unchanged I, [2024-04-19T20:43:20.983560 #4016665] INFO -- : generating makefiles ext/configure-ext.mk I, [2024-04-19T20:43:20.984145 #4016665] INFO -- : making trans I, [2024-04-19T20:43:21.173989 #4016665] INFO -- : ext/configure-ext.mk updated I, [2024-04-19T20:43:21.185630 #4016665] INFO -- : make[1]: Entering directory '/tmp/ruby/build/trunk' I, [2024-04-19T20:43:21.331974 #4016665] INFO -- : make[1]: Entering directory '/tmp/ruby/build/trunk' I, [2024-04-19T20:43:21.332187 #4016665] INFO -- : make[1]: Nothing to be done for 'trans'. I, [2024-04-19T20:43:21.332309 #4016665] INFO -- : make[1]: Leaving directory '/tmp/ruby/build/trunk' I, [2024-04-19T20:43:21.561838 #4016665] INFO -- : making encs I, [2024-04-19T20:43:21.981696 #4016665] INFO -- : make[1]: Entering directory '/tmp/ruby/build/trunk' I, [2024-04-19T20:43:21.981932 #4016665] INFO -- : make[1]: Nothing to be done for 'encs'. I, [2024-04-19T20:43:21.982044 #4016665] INFO -- : make[1]: Leaving directory '/tmp/ruby/build/trunk' I, [2024-04-19T20:43:24.610705 #4016665] INFO -- : make[1]: Leaving directory '/tmp/ruby/build/trunk' I, [2024-04-19T20:43:24.612821 #4016665] INFO -- : generating makefile exts.mk I, [2024-04-19T20:43:24.938798 #4016665] INFO -- : exts.mk unchanged I, [2024-04-19T20:43:24.976348 #4016665] INFO -- : make[1]: Entering directory '/tmp/ruby/build/trunk' I, [2024-04-19T20:43:25.486148 #4016665] INFO -- : make[2]: Entering directory '/tmp/ruby/build/trunk/ext/coverage' I, [2024-04-19T20:43:25.497889 #4016665] INFO -- : make[2]: Entering directory '/tmp/ruby/build/trunk/ext/digest' I, [2024-04-19T20:43:25.501922 #4016665] INFO -- : make[2]: Entering directory '/tmp/ruby/build/trunk/ext/date' I, [2024-04-19T20:43:25.509828 #4016665] INFO -- : make[2]: Leaving directory '/tmp/ruby/build/trunk/ext/coverage' I, [2024-04-19T20:43:25.526878 #4016665] INFO -- : make[2]: Leaving directory '/tmp/ruby/build/trunk/ext/date' I, [2024-04-19T20:43:25.535578 #4016665] INFO -- : make[2]: Leaving directory '/tmp/ruby/build/trunk/ext/digest' I, [2024-04-19T20:43:25.554197 #4016665] INFO -- : make[2]: Entering directory '/tmp/ruby/build/trunk/ext/io/console' I, [2024-04-19T20:43:25.569602 #4016665] INFO -- : make[2]: Entering directory '/tmp/ruby/build/trunk/ext/fiddle' I, [2024-04-19T20:43:25.573605 #4016665] INFO -- : make[2]: Leaving directory '/tmp/ruby/build/trunk/ext/io/console' I, [2024-04-19T20:43:25.577692 #4016665] INFO -- : make[2]: Entering directory '/tmp/ruby/build/trunk/ext/json' I, [2024-04-19T20:43:25.612765 #4016665] INFO -- : make[2]: Entering directory '/tmp/ruby/build/trunk/ext/monitor' I, [2024-04-19T20:43:25.617372 #4016665] INFO -- : make[2]: Leaving directory '/tmp/ruby/build/trunk/ext/fiddle' I, [2024-04-19T20:43:25.619110 #4016665] INFO -- : make[2]: Entering directory '/tmp/ruby/build/trunk/ext/objspace' I, [2024-04-19T20:43:25.632546 #4016665] INFO -- : make[2]: Leaving directory '/tmp/ruby/build/trunk/ext/monitor' I, [2024-04-19T20:43:25.636026 #4016665] INFO -- : make[2]: Leaving directory '/tmp/ruby/build/trunk/ext/json' I, [2024-04-19T20:43:25.658843 #4016665] INFO -- : make[2]: Entering directory '/tmp/ruby/build/trunk/ext/pathname' I, [2024-04-19T20:43:25.663686 #4016665] INFO -- : make[2]: Leaving directory '/tmp/ruby/build/trunk/ext/objspace' I, [2024-04-19T20:43:25.674808 #4016665] INFO -- : make[2]: Leaving directory '/tmp/ruby/build/trunk/ext/pathname' I, [2024-04-19T20:43:25.675740 #4016665] INFO -- : make[2]: Entering directory '/tmp/ruby/build/trunk/ext/psych' I, [2024-04-19T20:43:25.692449 #4016665] INFO -- : make[2]: Entering directory '/tmp/ruby/build/trunk/ext/pty' I, [2024-04-19T20:43:25.736241 #4016665] INFO -- : make[2]: Leaving directory '/tmp/ruby/build/trunk/ext/pty' I, [2024-04-19T20:43:25.745542 #4016665] INFO -- : make[2]: Entering directory '/tmp/ruby/build/trunk/ext/openssl' I, [2024-04-19T20:43:25.757574 #4016665] INFO -- : make[2]: Entering directory '/tmp/ruby/build/trunk/ext/rubyvm' I, [2024-04-19T20:43:25.779639 #4016665] INFO -- : make[2]: Leaving directory '/tmp/ruby/build/trunk/ext/psych' I, [2024-04-19T20:43:25.780672 #4016665] INFO -- : make[2]: Leaving directory '/tmp/ruby/build/trunk/ext/rubyvm' I, [2024-04-19T20:43:25.787555 #4016665] INFO -- : make[2]: Entering directory '/tmp/ruby/build/trunk/ext/ripper' I, [2024-04-19T20:43:25.829468 #4016665] INFO -- : make[2]: Leaving directory '/tmp/ruby/build/trunk/ext/ripper' I, [2024-04-19T20:43:25.852838 #4016665] INFO -- : make[2]: Entering directory '/tmp/ruby/build/trunk/ext/socket' I, [2024-04-19T20:43:25.863637 #4016665] INFO -- : make[2]: Entering directory '/tmp/ruby/build/trunk/.bundle/gems/bigdecimal-3.1.7/ext/bigdecimal' I, [2024-04-19T20:43:25.869773 #4016665] INFO -- : make[2]: Leaving directory '/tmp/ruby/build/trunk/ext/openssl' I, [2024-04-19T20:43:25.884287 #4016665] INFO -- : make[2]: Entering directory '/tmp/ruby/build/trunk/.bundle/gems/nkf-0.2.0/ext/nkf' I, [2024-04-19T20:43:25.884588 #4016665] INFO -- : make[2]: Entering directory '/tmp/ruby/build/trunk/.bundle/gems/debug-1.9.2/ext/debug' I, [2024-04-19T20:43:25.930315 #4016665] INFO -- : make[2]: Leaving directory '/tmp/ruby/build/trunk/ext/socket' I, [2024-04-19T20:43:25.946826 #4016665] INFO -- : make[2]: Entering directory '/tmp/ruby/build/trunk/.bundle/gems/racc-1.7.3/ext/racc/cparse' I, [2024-04-19T20:43:26.014228 #4016665] INFO -- : make[2]: Leaving directory '/tmp/ruby/build/trunk/.bundle/gems/bigdecimal-3.1.7/ext/bigdecimal' I, [2024-04-19T20:43:26.032517 #4016665] INFO -- : make[2]: Entering directory '/tmp/ruby/build/trunk/.bundle/gems/rbs-3.4.4/ext/rbs_extension' I, [2024-04-19T20:43:26.039334 #4016665] INFO -- : make[2]: Leaving directory '/tmp/ruby/build/trunk/.bundle/gems/debug-1.9.2/ext/debug' I, [2024-04-19T20:43:26.046675 #4016665] INFO -- : make[2]: Leaving directory '/tmp/ruby/build/trunk/.bundle/gems/nkf-0.2.0/ext/nkf' I, [2024-04-19T20:43:26.054742 #4016665] INFO -- : make[2]: Entering directory '/tmp/ruby/build/trunk/.bundle/gems/syslog-0.1.2/ext/syslog' I, [2024-04-19T20:43:26.112019 #4016665] INFO -- : make[2]: Leaving directory '/tmp/ruby/build/trunk/.bundle/gems/racc-1.7.3/ext/racc/cparse' I, [2024-04-19T20:43:26.173264 #4016665] INFO -- : make[2]: Entering directory '/tmp/ruby/build/trunk/ext/digest/sha2' I, [2024-04-19T20:43:26.196609 #4016665] INFO -- : make[2]: Leaving directory '/tmp/ruby/build/trunk/.bundle/gems/rbs-3.4.4/ext/rbs_extension' I, [2024-04-19T20:43:26.199159 #4016665] INFO -- : make[2]: Leaving directory '/tmp/ruby/build/trunk/ext/digest/sha2' I, [2024-04-19T20:43:26.216695 #4016665] INFO -- : make[2]: Leaving directory '/tmp/ruby/build/trunk/.bundle/gems/syslog-0.1.2/ext/syslog' I, [2024-04-19T20:43:26.432276 #4016665] INFO -- : make[2]: Entering directory '/tmp/ruby/build/trunk' I, [2024-04-19T20:43:27.086449 #4016665] INFO -- : linking ruby I, [2024-04-19T20:43:27.294036 #4016665] INFO -- : make[2]: Leaving directory '/tmp/ruby/build/trunk' I, [2024-04-19T20:43:27.295965 #4016665] INFO -- : make[1]: Leaving directory '/tmp/ruby/build/trunk' I, [2024-04-19T20:43:27.330746 #4016665] INFO -- : make[1]: Entering directory '/tmp/ruby/build/trunk' I, [2024-04-19T20:43:27.330960 #4016665] INFO -- : make[1]: Nothing to be done for 'note'. I, [2024-04-19T20:43:27.331062 #4016665] INFO -- : make[1]: Leaving directory '/tmp/ruby/build/trunk' I, [2024-04-19T20:43:27.333979 #4016665] INFO -- : $$$[end] "make all -j4" exit with 0. I, [2024-04-19T20:43:27.334800 #4016665] INFO -- : $$$[beg] make install -j4 I, [2024-04-19T20:43:27.917647 #4016665] INFO -- : Update minitest to ea9caafc0754b1d6236a490d59e624b53209734a I, [2024-04-19T20:43:27.918409 #4016665] INFO -- : Update power_assert to 84e85124c5014a139af39161d484156cfe87a9ed I, [2024-04-19T20:43:27.919196 #4016665] INFO -- : Update rbs to ba7872795d5de04adb8ff500c0e6afdc81a041dd I, [2024-04-19T20:43:27.921959 #4016665] INFO -- : Update typeprof to b19a6416da3a05d57fadd6ffdadb382b6d236ca5 I, [2024-04-19T20:43:27.930037 #4016665] INFO -- : echo ea9caafc0754b1d6236a490d59e624b53209734a | /bin/sh /tmp/ruby/src/trunk/tool/ifchange /tmp/ruby/src/trunk/.bundle/.timestamp/minitest.revision - I, [2024-04-19T20:43:27.930639 #4016665] INFO -- : echo 84e85124c5014a139af39161d484156cfe87a9ed | /bin/sh /tmp/ruby/src/trunk/tool/ifchange /tmp/ruby/src/trunk/.bundle/.timestamp/power_assert.revision - I, [2024-04-19T20:43:27.931227 #4016665] INFO -- : echo ba7872795d5de04adb8ff500c0e6afdc81a041dd | /bin/sh /tmp/ruby/src/trunk/tool/ifchange /tmp/ruby/src/trunk/.bundle/.timestamp/rbs.revision - I, [2024-04-19T20:43:27.938582 #4016665] INFO -- : echo b19a6416da3a05d57fadd6ffdadb382b6d236ca5 | /bin/sh /tmp/ruby/src/trunk/tool/ifchange /tmp/ruby/src/trunk/.bundle/.timestamp/typeprof.revision - I, [2024-04-19T20:43:27.940545 #4016665] INFO -- : /tmp/ruby/src/trunk/.bundle/.timestamp/minitest.revision unchanged I, [2024-04-19T20:43:27.944142 #4016665] INFO -- : /tmp/ruby/src/trunk/.bundle/.timestamp/rbs.revision unchanged I, [2024-04-19T20:43:27.947034 #4016665] INFO -- : /tmp/ruby/src/trunk/.bundle/.timestamp/power_assert.revision unchanged I, [2024-04-19T20:43:27.949084 #4016665] INFO -- : BASERUBY = /usr/bin/ruby --disable=gems I, [2024-04-19T20:43:27.949299 #4016665] INFO -- : CC = gcc I, [2024-04-19T20:43:27.949428 #4016665] INFO -- : LD = ld I, [2024-04-19T20:43:27.949577 #4016665] INFO -- : LDSHARED = gcc -shared I, [2024-04-19T20:43:27.949741 #4016665] INFO -- : CFLAGS = -O3 -fno-fast-math -ggdb3 -Wall -Wextra -Wdeprecated-declarations -Wdiv-by-zero -Wduplicated-cond -Wimplicit-function-declaration -Wimplicit-int -Wpointer-arith -Wwrite-strings -Wold-style-definition -Wimplicit-fallthrough=0 -Wmissing-noreturn -Wno-cast-function-type -Wno-constant-logical-operand -Wno-long-long -Wno-missing-field-initializers -Wno-overlength-strings -Wno-packed-bitfield-compat -Wno-parentheses-equality -Wno-self-assign -Wno-tautological-compare -Wno-unused-parameter -Wno-unused-value -Wsuggest-attribute=format -Wsuggest-attribute=noreturn -Wunused-variable -Wmisleading-indentation -Wundef -fPIC I, [2024-04-19T20:43:27.949944 #4016665] INFO -- : XCFLAGS = -U_FORTIFY_SOURCE -D_FORTIFY_SOURCE=2 -fstack-protector-strong -fno-strict-overflow -fvisibility=hidden -fexcess-precision=standard -DRUBY_EXPORT -I. -I.ext/include/riscv64-linux -I/tmp/ruby/src/trunk/include -I/tmp/ruby/src/trunk -I/tmp/ruby/src/trunk/prism -I/tmp/ruby/src/trunk/enc/unicode/15.0.0 I, [2024-04-19T20:43:27.950140 #4016665] INFO -- : CPPFLAGS = I, [2024-04-19T20:43:27.950295 #4016665] INFO -- : DLDFLAGS = -Wl,--compress-debug-sections=zlib -Wl,-soname,libruby.so.3.4 -fstack-protector-strong I, [2024-04-19T20:43:27.950460 #4016665] INFO -- : SOLIBS = -lz -lrt -lrt -lgmp -ldl -lcrypt -lm -lpthread I, [2024-04-19T20:43:27.950756 #4016665] INFO -- : LANG = I, [2024-04-19T20:43:27.950909 #4016665] INFO -- : LC_ALL = I, [2024-04-19T20:43:27.951059 #4016665] INFO -- : LC_CTYPE = I, [2024-04-19T20:43:27.951198 #4016665] INFO -- : MFLAGS = -j4 --jobserver-auth=4,5 I, [2024-04-19T20:43:27.951322 #4016665] INFO -- : RUSTC = rustc I, [2024-04-19T20:43:27.951468 #4016665] INFO -- : YJIT_RUSTC_ARGS = --crate-name=yjit --crate-type=staticlib --edition=2021 -g -C lto=thin -C opt-level=3 -C overflow-checks=on '--out-dir=/tmp/ruby/build/trunk/yjit/target/release/' /tmp/ruby/src/trunk/yjit/src/lib.rs I, [2024-04-19T20:43:27.951636 #4016665] INFO -- : /tmp/ruby/src/trunk/.bundle/.timestamp/typeprof.revision unchanged I, [2024-04-19T20:43:28.239702 #4016665] INFO -- : generating encdb.h I, [2024-04-19T20:43:28.240766 #4016665] INFO -- : gcc (Debian 13.2.0-4revyos1) 13.2.0 I, [2024-04-19T20:43:28.240954 #4016665] INFO -- : Copyright (C) 2023 Free Software Foundation, Inc. I, [2024-04-19T20:43:28.241065 #4016665] INFO -- : This is free software; see the source for copying conditions. There is NO I, [2024-04-19T20:43:28.241233 #4016665] INFO -- : warranty; not even for MERCHANTABILITY or FITNESS FOR A PARTICULAR PURPOSE. I, [2024-04-19T20:43:28.241346 #4016665] INFO -- : I, [2024-04-19T20:43:28.245604 #4016665] INFO -- : generating enc.mk I, [2024-04-19T20:43:28.504343 #4016665] INFO -- : encdb.h unchanged I, [2024-04-19T20:43:29.339708 #4016665] INFO -- : Building power_assert@84e85124c5014a139af39161d484156cfe87a9ed to /tmp/ruby/src/trunk/gems/power_assert-2.0.3.gem I, [2024-04-19T20:43:29.800490 #4016665] INFO -- : making srcs under enc I, [2024-04-19T20:43:29.801201 #4016665] INFO -- : making enc I, [2024-04-19T20:43:29.961282 #4016665] INFO -- : make[1]: Entering directory '/tmp/ruby/build/trunk' I, [2024-04-19T20:43:29.961501 #4016665] INFO -- : make[1]: Nothing to be done for 'enc'. I, [2024-04-19T20:43:29.961613 #4016665] INFO -- : make[1]: Leaving directory '/tmp/ruby/build/trunk' I, [2024-04-19T20:43:30.106332 #4016665] INFO -- : make[1]: Entering directory '/tmp/ruby/build/trunk' I, [2024-04-19T20:43:30.106666 #4016665] INFO -- : make[1]: Nothing to be done for 'srcs'. I, [2024-04-19T20:43:30.106936 #4016665] INFO -- : make[1]: Leaving directory '/tmp/ruby/build/trunk' I, [2024-04-19T20:43:30.110124 #4016665] INFO -- : generating transdb.h I, [2024-04-19T20:43:30.294434 #4016665] INFO -- : Successfully built RubyGem I, [2024-04-19T20:43:30.294703 #4016665] INFO -- : Name: power_assert I, [2024-04-19T20:43:30.294792 #4016665] INFO -- : Version: 2.0.4dev I, [2024-04-19T20:43:30.294874 #4016665] INFO -- : File: power_assert-2.0.4dev.gem I, [2024-04-19T20:43:30.309684 #4016665] INFO -- : Extracting bundle gem power_assert-2.0.3... I, [2024-04-19T20:43:31.166130 #4016665] INFO -- : Try with hash version of bundled gems instead of gems/power_assert-2.0.3.gem. We don't use this gem with release version of Ruby. I, [2024-04-19T20:43:31.220154 #4016665] INFO -- : Unpacked gems/power_assert-2.0.4dev.gem I, [2024-04-19T20:43:31.310015 #4016665] INFO -- : transdb.h unchanged I, [2024-04-19T20:43:31.315893 #4016665] INFO -- : generating makefiles ext/configure-ext.mk I, [2024-04-19T20:43:31.316983 #4016665] INFO -- : making trans I, [2024-04-19T20:43:31.505228 #4016665] INFO -- : ext/configure-ext.mk unchanged I, [2024-04-19T20:43:31.516863 #4016665] INFO -- : make[1]: Entering directory '/tmp/ruby/build/trunk' I, [2024-04-19T20:43:31.677094 #4016665] INFO -- : make[1]: Entering directory '/tmp/ruby/build/trunk' I, [2024-04-19T20:43:31.677315 #4016665] INFO -- : make[1]: Nothing to be done for 'trans'. I, [2024-04-19T20:43:31.677441 #4016665] INFO -- : make[1]: Leaving directory '/tmp/ruby/build/trunk' I, [2024-04-19T20:43:33.581910 #4016665] INFO -- : making encs I, [2024-04-19T20:43:33.995259 #4016665] INFO -- : make[1]: Entering directory '/tmp/ruby/build/trunk' I, [2024-04-19T20:43:33.995526 #4016665] INFO -- : make[1]: Nothing to be done for 'encs'. I, [2024-04-19T20:43:33.995689 #4016665] INFO -- : make[1]: Leaving directory '/tmp/ruby/build/trunk' I, [2024-04-19T20:43:35.025728 #4016665] INFO -- : make[1]: Leaving directory '/tmp/ruby/build/trunk' I, [2024-04-19T20:43:35.027511 #4016665] INFO -- : generating makefile exts.mk I, [2024-04-19T20:43:35.354834 #4016665] INFO -- : exts.mk unchanged I, [2024-04-19T20:43:35.392305 #4016665] INFO -- : make[1]: Entering directory '/tmp/ruby/build/trunk' I, [2024-04-19T20:43:35.904406 #4016665] INFO -- : make[2]: Entering directory '/tmp/ruby/build/trunk/ext/coverage' I, [2024-04-19T20:43:35.908837 #4016665] INFO -- : make[2]: Entering directory '/tmp/ruby/build/trunk/ext/digest' I, [2024-04-19T20:43:35.920336 #4016665] INFO -- : make[2]: Entering directory '/tmp/ruby/build/trunk/ext/date' I, [2024-04-19T20:43:35.926624 #4016665] INFO -- : make[2]: Leaving directory '/tmp/ruby/build/trunk/ext/coverage' I, [2024-04-19T20:43:35.945925 #4016665] INFO -- : make[2]: Leaving directory '/tmp/ruby/build/trunk/ext/date' I, [2024-04-19T20:43:35.963842 #4016665] INFO -- : make[2]: Leaving directory '/tmp/ruby/build/trunk/ext/digest' I, [2024-04-19T20:43:35.974304 #4016665] INFO -- : make[2]: Entering directory '/tmp/ruby/build/trunk/ext/io/console' I, [2024-04-19T20:43:35.984522 #4016665] INFO -- : make[2]: Entering directory '/tmp/ruby/build/trunk/ext/fiddle' I, [2024-04-19T20:43:35.994605 #4016665] INFO -- : make[2]: Leaving directory '/tmp/ruby/build/trunk/ext/io/console' I, [2024-04-19T20:43:35.994846 #4016665] INFO -- : make[2]: Entering directory '/tmp/ruby/build/trunk/ext/json' I, [2024-04-19T20:43:36.019210 #4016665] INFO -- : make[2]: Entering directory '/tmp/ruby/build/trunk/ext/monitor' I, [2024-04-19T20:43:36.038141 #4016665] INFO -- : make[2]: Leaving directory '/tmp/ruby/build/trunk/ext/monitor' I, [2024-04-19T20:43:36.043406 #4016665] INFO -- : make[2]: Leaving directory '/tmp/ruby/build/trunk/ext/fiddle' I, [2024-04-19T20:43:36.047539 #4016665] INFO -- : make[2]: Entering directory '/tmp/ruby/build/trunk/ext/objspace' I, [2024-04-19T20:43:36.061308 #4016665] INFO -- : make[2]: Leaving directory '/tmp/ruby/build/trunk/ext/json' I, [2024-04-19T20:43:36.069986 #4016665] INFO -- : make[2]: Entering directory '/tmp/ruby/build/trunk/ext/pathname' I, [2024-04-19T20:43:36.077772 #4016665] INFO -- : make[2]: Leaving directory '/tmp/ruby/build/trunk/ext/objspace' I, [2024-04-19T20:43:36.088013 #4016665] INFO -- : make[2]: Leaving directory '/tmp/ruby/build/trunk/ext/pathname' I, [2024-04-19T20:43:36.102242 #4016665] INFO -- : make[2]: Entering directory '/tmp/ruby/build/trunk/ext/psych' I, [2024-04-19T20:43:36.110668 #4016665] INFO -- : make[2]: Entering directory '/tmp/ruby/build/trunk/ext/pty' I, [2024-04-19T20:43:36.124329 #4016665] INFO -- : make[2]: Leaving directory '/tmp/ruby/build/trunk/ext/pty' I, [2024-04-19T20:43:36.152325 #4016665] INFO -- : make[2]: Entering directory '/tmp/ruby/build/trunk/ext/openssl' I, [2024-04-19T20:43:36.161575 #4016665] INFO -- : make[2]: Entering directory '/tmp/ruby/build/trunk/ext/rubyvm' I, [2024-04-19T20:43:36.177971 #4016665] INFO -- : make[2]: Leaving directory '/tmp/ruby/build/trunk/ext/rubyvm' I, [2024-04-19T20:43:36.195311 #4016665] INFO -- : make[2]: Entering directory '/tmp/ruby/build/trunk/ext/ripper' I, [2024-04-19T20:43:36.211324 #4016665] INFO -- : make[2]: Leaving directory '/tmp/ruby/build/trunk/ext/psych' I, [2024-04-19T20:43:36.231668 #4016665] INFO -- : make[2]: Leaving directory '/tmp/ruby/build/trunk/ext/ripper' I, [2024-04-19T20:43:36.264003 #4016665] INFO -- : make[2]: Entering directory '/tmp/ruby/build/trunk/ext/socket' I, [2024-04-19T20:43:36.274427 #4016665] INFO -- : make[2]: Entering directory '/tmp/ruby/build/trunk/.bundle/gems/bigdecimal-3.1.7/ext/bigdecimal' I, [2024-04-19T20:43:36.284479 #4016665] INFO -- : make[2]: Entering directory '/tmp/ruby/build/trunk/.bundle/gems/debug-1.9.2/ext/debug' I, [2024-04-19T20:43:36.316581 #4016665] INFO -- : make[2]: Leaving directory '/tmp/ruby/build/trunk/ext/openssl' I, [2024-04-19T20:43:36.320190 #4016665] INFO -- : make[2]: Leaving directory '/tmp/ruby/build/trunk/ext/socket' I, [2024-04-19T20:43:36.332264 #4016665] INFO -- : make[2]: Entering directory '/tmp/ruby/build/trunk/.bundle/gems/nkf-0.2.0/ext/nkf' I, [2024-04-19T20:43:36.335170 #4016665] INFO -- : make[2]: Entering directory '/tmp/ruby/build/trunk/.bundle/gems/racc-1.7.3/ext/racc/cparse' I, [2024-04-19T20:43:36.432830 #4016665] INFO -- : make[2]: Leaving directory '/tmp/ruby/build/trunk/.bundle/gems/bigdecimal-3.1.7/ext/bigdecimal' I, [2024-04-19T20:43:36.445950 #4016665] INFO -- : make[2]: Leaving directory '/tmp/ruby/build/trunk/.bundle/gems/debug-1.9.2/ext/debug' I, [2024-04-19T20:43:36.451945 #4016665] INFO -- : make[2]: Entering directory '/tmp/ruby/build/trunk/.bundle/gems/rbs-3.4.4/ext/rbs_extension' I, [2024-04-19T20:43:36.460840 #4016665] INFO -- : make[2]: Entering directory '/tmp/ruby/build/trunk/.bundle/gems/syslog-0.1.2/ext/syslog' I, [2024-04-19T20:43:36.494086 #4016665] INFO -- : make[2]: Leaving directory '/tmp/ruby/build/trunk/.bundle/gems/nkf-0.2.0/ext/nkf' I, [2024-04-19T20:43:36.499058 #4016665] INFO -- : make[2]: Leaving directory '/tmp/ruby/build/trunk/.bundle/gems/racc-1.7.3/ext/racc/cparse' I, [2024-04-19T20:43:36.590673 #4016665] INFO -- : make[2]: Entering directory '/tmp/ruby/build/trunk/ext/digest/sha2' I, [2024-04-19T20:43:36.613696 #4016665] INFO -- : make[2]: Leaving directory '/tmp/ruby/build/trunk/.bundle/gems/rbs-3.4.4/ext/rbs_extension' I, [2024-04-19T20:43:36.615747 #4016665] INFO -- : make[2]: Leaving directory '/tmp/ruby/build/trunk/ext/digest/sha2' I, [2024-04-19T20:43:36.622634 #4016665] INFO -- : make[2]: Leaving directory '/tmp/ruby/build/trunk/.bundle/gems/syslog-0.1.2/ext/syslog' I, [2024-04-19T20:43:36.852912 #4016665] INFO -- : make[2]: Entering directory '/tmp/ruby/build/trunk' I, [2024-04-19T20:43:37.497999 #4016665] INFO -- : make[2]: 'ruby' is up to date. I, [2024-04-19T20:43:37.498218 #4016665] INFO -- : make[2]: Leaving directory '/tmp/ruby/build/trunk' I, [2024-04-19T20:43:37.500058 #4016665] INFO -- : make[1]: Leaving directory '/tmp/ruby/build/trunk' I, [2024-04-19T20:43:37.534402 #4016665] INFO -- : make[1]: Entering directory '/tmp/ruby/build/trunk' I, [2024-04-19T20:43:37.534719 #4016665] INFO -- : make[1]: Nothing to be done for 'note'. I, [2024-04-19T20:43:37.534921 #4016665] INFO -- : make[1]: Leaving directory '/tmp/ruby/build/trunk' I, [2024-04-19T20:43:37.536365 #4016665] INFO -- : ./miniruby -I/tmp/ruby/src/trunk/lib -I. -I.ext/common /tmp/ruby/src/trunk/tool/runruby.rb --extout=.ext -- --disable-gems -r./riscv64-linux-fake /tmp/ruby/src/trunk/tool/rbinstall.rb --make="make" --dest-dir="" --extout=".ext" --ext-build-dir="./ext" --mflags="-j4 --jobserver-auth=4,5" --make-flags=" -j4 --jobserver-auth=4,5" --data-mode=0644 --prog-mode=0755 --installed-list .installed.list --mantype="doc" --gnumake --install=all --exclude=doc I, [2024-04-19T20:43:38.879012 #4016665] INFO -- : Installing to I, [2024-04-19T20:43:38.879238 #4016665] INFO -- : installing binary commands: /tmp/ruby/install/trunk/bin I, [2024-04-19T20:43:38.881352 #4016665] INFO -- : installing base libraries: /tmp/ruby/install/trunk/lib I, [2024-04-19T20:43:38.954776 #4016665] INFO -- : installing arch files: /tmp/ruby/install/trunk/lib/ruby/3.4.0+0/riscv64-linux I, [2024-04-19T20:43:38.955504 #4016665] INFO -- : installing pkgconfig data: /tmp/ruby/install/trunk/lib/pkgconfig I, [2024-04-19T20:43:38.956028 #4016665] INFO -- : installing extension objects: /tmp/ruby/install/trunk/lib/ruby/3.4.0+0/riscv64-linux I, [2024-04-19T20:43:39.079653 #4016665] INFO -- : installing extension objects: /tmp/ruby/install/trunk/lib/ruby/site_ruby/3.4.0+0/riscv64-linux I, [2024-04-19T20:43:39.079857 #4016665] INFO -- : installing extension objects: /tmp/ruby/install/trunk/lib/ruby/vendor_ruby/3.4.0+0/riscv64-linux I, [2024-04-19T20:43:39.080319 #4016665] INFO -- : installing extension headers: /tmp/ruby/install/trunk/include/ruby-3.4.0+0/riscv64-linux I, [2024-04-19T20:43:39.082362 #4016665] INFO -- : installing extension scripts: /tmp/ruby/install/trunk/lib/ruby/3.4.0+0 I, [2024-04-19T20:43:39.135192 #4016665] INFO -- : installing extension scripts: /tmp/ruby/install/trunk/lib/ruby/site_ruby/3.4.0+0 I, [2024-04-19T20:43:39.135387 #4016665] INFO -- : installing extension scripts: /tmp/ruby/install/trunk/lib/ruby/vendor_ruby/3.4.0+0 I, [2024-04-19T20:43:39.135484 #4016665] INFO -- : installing extension headers: /tmp/ruby/install/trunk/include/ruby-3.4.0+0/ruby I, [2024-04-19T20:43:39.136329 #4016665] INFO -- : installing command scripts: /tmp/ruby/install/trunk/bin I, [2024-04-19T20:43:39.137200 #4016665] INFO -- : installing library scripts: /tmp/ruby/install/trunk/lib/ruby/3.4.0+0 I, [2024-04-19T20:43:39.680075 #4016665] INFO -- : installing common headers: /tmp/ruby/install/trunk/include/ruby-3.4.0+0 I, [2024-04-19T20:43:39.765440 #4016665] INFO -- : installing manpages: /tmp/ruby/install/trunk/share/man/man1 I, [2024-04-19T20:43:39.767753 #4016665] INFO -- : installing default gems from lib: /tmp/ruby/install/trunk/lib/ruby/gems/3.4.0+0 I, [2024-04-19T20:43:40.091886 #4016665] INFO -- : benchmark 0.3.0 I, [2024-04-19T20:43:40.200003 #4016665] INFO -- : bundler 2.6.0.dev I, [2024-04-19T20:43:40.219028 #4016665] INFO -- : cgi 0.4.1 I, [2024-04-19T20:43:40.226082 #4016665] INFO -- : delegate 0.3.1 I, [2024-04-19T20:43:40.233041 #4016665] INFO -- : did_you_mean 1.6.3 I, [2024-04-19T20:43:40.240263 #4016665] INFO -- : english 0.8.0 I, [2024-04-19T20:43:40.247059 #4016665] INFO -- : erb 4.0.4 I, [2024-04-19T20:43:40.258780 #4016665] INFO -- : error_highlight 0.6.0 I, [2024-04-19T20:43:40.265506 #4016665] INFO -- : fileutils 1.7.2 I, [2024-04-19T20:43:40.272386 #4016665] INFO -- : find 0.2.0 I, [2024-04-19T20:43:40.279293 #4016665] INFO -- : forwardable 1.3.3 I, [2024-04-19T20:43:40.286006 #4016665] INFO -- : ipaddr 1.2.6 I, [2024-04-19T20:43:40.292739 #4016665] INFO -- : irb 1.12.0 I, [2024-04-19T20:43:40.311322 #4016665] INFO -- : logger 1.6.0 I, [2024-04-19T20:43:40.318223 #4016665] INFO -- : net-http 0.4.1 I, [2024-04-19T20:43:40.325603 #4016665] INFO -- : net-protocol 0.2.2 I, [2024-04-19T20:43:40.332943 #4016665] INFO -- : open-uri 0.4.1 I, [2024-04-19T20:43:40.340394 #4016665] INFO -- : open3 0.2.1 I, [2024-04-19T20:43:40.347461 #4016665] INFO -- : optparse 0.5.0 I, [2024-04-19T20:43:40.354708 #4016665] INFO -- : ostruct 0.6.0 I, [2024-04-19T20:43:40.361486 #4016665] INFO -- : pp 0.5.0 I, [2024-04-19T20:43:40.369652 #4016665] INFO -- : prettyprint 0.2.0 I, [2024-04-19T20:43:40.376673 #4016665] INFO -- : prism 0.26.0 I, [2024-04-19T20:43:40.384147 #4016665] INFO -- : pstore 0.1.3 I, [2024-04-19T20:43:40.391049 #4016665] INFO -- : rdoc 6.6.3.1 I, [2024-04-19T20:43:40.412576 #4016665] INFO -- : readline 0.0.4 I, [2024-04-19T20:43:40.419573 #4016665] INFO -- : reline 0.5.2 I, [2024-04-19T20:43:40.427071 #4016665] INFO -- : resolv 0.4.0 I, [2024-04-19T20:43:40.434098 #4016665] INFO -- : ruby2_keywords 0.0.5 I, [2024-04-19T20:43:40.441183 #4016665] INFO -- : securerandom 0.3.1 I, [2024-04-19T20:43:40.448312 #4016665] INFO -- : set 1.1.0 I, [2024-04-19T20:43:40.455474 #4016665] INFO -- : shellwords 0.2.0 I, [2024-04-19T20:43:40.462595 #4016665] INFO -- : singleton 0.2.0 I, [2024-04-19T20:43:40.469436 #4016665] INFO -- : syntax_suggest 2.0.0 I, [2024-04-19T20:43:40.480630 #4016665] INFO -- : tempfile 0.2.1 I, [2024-04-19T20:43:40.487660 #4016665] INFO -- : time 0.3.0 I, [2024-04-19T20:43:40.495049 #4016665] INFO -- : timeout 0.4.1 I, [2024-04-19T20:43:40.502180 #4016665] INFO -- : tmpdir 0.2.0 I, [2024-04-19T20:43:40.509446 #4016665] INFO -- : tsort 0.2.0 I, [2024-04-19T20:43:40.516667 #4016665] INFO -- : un 0.3.0 I, [2024-04-19T20:43:40.530162 #4016665] INFO -- : uri 0.13.0 I, [2024-04-19T20:43:40.537640 #4016665] INFO -- : weakref 0.1.3 I, [2024-04-19T20:43:40.544746 #4016665] INFO -- : yaml 0.3.0 I, [2024-04-19T20:43:40.550325 #4016665] INFO -- : installing default gems from ext: /tmp/ruby/install/trunk/lib/ruby/gems/3.4.0+0 I, [2024-04-19T20:43:40.624327 #4016665] INFO -- : date 3.3.4 I, [2024-04-19T20:43:40.631313 #4016665] INFO -- : digest 3.1.1 I, [2024-04-19T20:43:40.643409 #4016665] INFO -- : etc 1.4.3 I, [2024-04-19T20:43:40.652941 #4016665] INFO -- : fcntl 1.1.0 I, [2024-04-19T20:43:40.660048 #4016665] INFO -- : fiddle 1.1.3 I, [2024-04-19T20:43:40.667211 #4016665] INFO -- : io-console 0.7.2 I, [2024-04-19T20:43:40.674253 #4016665] INFO -- : io-nonblock 0.3.0 I, [2024-04-19T20:43:40.681315 #4016665] INFO -- : io-wait 0.3.1 I, [2024-04-19T20:43:40.688199 #4016665] INFO -- : json 2.7.2 I, [2024-04-19T20:43:40.696084 #4016665] INFO -- : openssl 3.2.0 I, [2024-04-19T20:43:40.703439 #4016665] INFO -- : pathname 0.3.0 I, [2024-04-19T20:43:40.711834 #4016665] INFO -- : psych 5.1.2 I, [2024-04-19T20:43:40.719968 #4016665] INFO -- : stringio 3.1.1 I, [2024-04-19T20:43:40.727456 #4016665] INFO -- : strscan 3.1.1 I, [2024-04-19T20:43:40.734571 #4016665] INFO -- : zlib 3.1.0 I, [2024-04-19T20:43:40.745045 #4016665] INFO -- : installing bundled gems: /tmp/ruby/install/trunk/lib/ruby/gems/3.4.0+0 I, [2024-04-19T20:43:40.749893 #4016665] INFO -- : minitest 5.22.3 I, [2024-04-19T20:43:40.838793 #4016665] INFO -- : rake 13.2.1 I, [2024-04-19T20:43:40.908662 #4016665] INFO -- : test-unit 3.6.2 I, [2024-04-19T20:43:40.971283 #4016665] INFO -- : rexml 3.2.6 I, [2024-04-19T20:43:41.039153 #4016665] INFO -- : rss 0.3.0 I, [2024-04-19T20:43:41.082121 #4016665] INFO -- : net-ftp 0.3.4 I, [2024-04-19T20:43:41.103840 #4016665] INFO -- : net-imap 0.4.10 I, [2024-04-19T20:43:41.151806 #4016665] INFO -- : net-pop 0.1.2 I, [2024-04-19T20:43:41.165221 #4016665] INFO -- : net-smtp 0.5.0 I, [2024-04-19T20:43:41.186787 #4016665] INFO -- : matrix 0.4.2 I, [2024-04-19T20:43:41.230748 #4016665] INFO -- : prime 0.1.2 I, [2024-04-19T20:43:41.295974 #4016665] INFO -- : rbs 3.4.4 I, [2024-04-19T20:43:41.691478 #4016665] INFO -- : typeprof 0.21.11 I, [2024-04-19T20:43:41.726955 #4016665] INFO -- : debug 1.9.2 I, [2024-04-19T20:43:41.769249 #4016665] INFO -- : racc 1.7.3 I, [2024-04-19T20:43:41.814255 #4016665] INFO -- : mutex_m 0.2.0 I, [2024-04-19T20:43:41.830859 #4016665] INFO -- : getoptlong 0.2.1 I, [2024-04-19T20:43:41.851841 #4016665] INFO -- : base64 0.2.0 I, [2024-04-19T20:43:41.867009 #4016665] INFO -- : bigdecimal 3.1.7 I, [2024-04-19T20:43:41.897014 #4016665] INFO -- : observer 0.1.2 I, [2024-04-19T20:43:41.912729 #4016665] INFO -- : abbrev 0.1.2 I, [2024-04-19T20:43:41.927401 #4016665] INFO -- : resolv-replace 0.1.1 I, [2024-04-19T20:43:41.948620 #4016665] INFO -- : rinda 0.2.0 I, [2024-04-19T20:43:41.966194 #4016665] INFO -- : drb 2.2.1 I, [2024-04-19T20:43:41.990941 #4016665] INFO -- : nkf 0.2.0 I, [2024-04-19T20:43:42.026102 #4016665] INFO -- : syslog 0.1.2 I, [2024-04-19T20:43:42.049646 #4016665] INFO -- : csv 3.3.0 I, [2024-04-19T20:43:42.090874 #4016665] INFO -- : installing bundled gem cache: /tmp/ruby/install/trunk/lib/ruby/gems/3.4.0+0/cache I, [2024-04-19T20:43:42.110065 #4016665] INFO -- : skipped bundled gems: I, [2024-04-19T20:43:42.110286 #4016665] INFO -- : power_assert-2.0.4dev.gem not found in bundled_gems I, [2024-04-19T20:43:42.134701 #4016665] INFO -- : $$$[end] "make install -j4" exit with 0. I, [2024-04-19T20:43:42.135436 #4016665] INFO -- : $$$[beg] make yes-btest TESTOPTS='-q -j4' I, [2024-04-19T20:44:48.537353 #4016665] INFO -- : PASS all 1926 tests E, [2024-04-19T20:44:48.557984 #4016665] ERROR -- : I, [2024-04-19T20:44:48.558429 #4016665] INFO -- : $$$[end] "make yes-btest TESTOPTS='-q -j4'" exit with 0. I, [2024-04-19T20:44:48.559012 #4016665] INFO -- : $$$[beg] make yes-test-basic TESTS='-j4' I, [2024-04-19T20:44:49.114118 #4016665] INFO -- : BASERUBY = /usr/bin/ruby --disable=gems I, [2024-04-19T20:44:49.114328 #4016665] INFO -- : CC = gcc I, [2024-04-19T20:44:49.114430 #4016665] INFO -- : LD = ld I, [2024-04-19T20:44:49.114602 #4016665] INFO -- : LDSHARED = gcc -shared I, [2024-04-19T20:44:49.114762 #4016665] INFO -- : CFLAGS = -O3 -fno-fast-math -ggdb3 -Wall -Wextra -Wdeprecated-declarations -Wdiv-by-zero -Wduplicated-cond -Wimplicit-function-declaration -Wimplicit-int -Wpointer-arith -Wwrite-strings -Wold-style-definition -Wimplicit-fallthrough=0 -Wmissing-noreturn -Wno-cast-function-type -Wno-constant-logical-operand -Wno-long-long -Wno-missing-field-initializers -Wno-overlength-strings -Wno-packed-bitfield-compat -Wno-parentheses-equality -Wno-self-assign -Wno-tautological-compare -Wno-unused-parameter -Wno-unused-value -Wsuggest-attribute=format -Wsuggest-attribute=noreturn -Wunused-variable -Wmisleading-indentation -Wundef -fPIC I, [2024-04-19T20:44:49.114886 #4016665] INFO -- : XCFLAGS = -U_FORTIFY_SOURCE -D_FORTIFY_SOURCE=2 -fstack-protector-strong -fno-strict-overflow -fvisibility=hidden -fexcess-precision=standard -DRUBY_EXPORT -I. -I.ext/include/riscv64-linux -I/tmp/ruby/src/trunk/include -I/tmp/ruby/src/trunk -I/tmp/ruby/src/trunk/prism -I/tmp/ruby/src/trunk/enc/unicode/15.0.0 I, [2024-04-19T20:44:49.115010 #4016665] INFO -- : CPPFLAGS = I, [2024-04-19T20:44:49.115119 #4016665] INFO -- : DLDFLAGS = -Wl,--compress-debug-sections=zlib -Wl,-soname,libruby.so.3.4 -fstack-protector-strong I, [2024-04-19T20:44:49.115220 #4016665] INFO -- : SOLIBS = -lz -lrt -lrt -lgmp -ldl -lcrypt -lm -lpthread I, [2024-04-19T20:44:49.115315 #4016665] INFO -- : LANG = I, [2024-04-19T20:44:49.115409 #4016665] INFO -- : LC_ALL = I, [2024-04-19T20:44:49.115509 #4016665] INFO -- : LC_CTYPE = I, [2024-04-19T20:44:49.115598 #4016665] INFO -- : MFLAGS = I, [2024-04-19T20:44:49.115680 #4016665] INFO -- : RUSTC = rustc I, [2024-04-19T20:44:49.115766 #4016665] INFO -- : YJIT_RUSTC_ARGS = --crate-name=yjit --crate-type=staticlib --edition=2021 -g -C lto=thin -C opt-level=3 -C overflow-checks=on '--out-dir=/tmp/ruby/build/trunk/yjit/target/release/' /tmp/ruby/src/trunk/yjit/src/lib.rs I, [2024-04-19T20:44:49.117392 #4016665] INFO -- : gcc (Debian 13.2.0-4revyos1) 13.2.0 I, [2024-04-19T20:44:49.117580 #4016665] INFO -- : Copyright (C) 2023 Free Software Foundation, Inc. I, [2024-04-19T20:44:49.117727 #4016665] INFO -- : This is free software; see the source for copying conditions. There is NO I, [2024-04-19T20:44:49.117824 #4016665] INFO -- : warranty; not even for MERCHANTABILITY or FITNESS FOR A PARTICULAR PURPOSE. I, [2024-04-19T20:44:49.117922 #4016665] INFO -- : I, [2024-04-19T20:44:51.057302 #4016665] INFO -- : Checking leaked global symbols...none I, [2024-04-19T20:44:51.368896 #4016665] INFO -- : /tmp/ruby/src/trunk/basictest/test.rb:assignment ....................................................................................................................................................................................................................................................................................................................................................................................OK 372 I, [2024-04-19T20:44:51.369516 #4016665] INFO -- : /tmp/ruby/src/trunk/basictest/test.rb:condition ..OK 2 I, [2024-04-19T20:44:51.370033 #4016665] INFO -- : /tmp/ruby/src/trunk/basictest/test.rb:if/unless ...OK 3 I, [2024-04-19T20:44:51.370783 #4016665] INFO -- : /tmp/ruby/src/trunk/basictest/test.rb:case .....OK 5 I, [2024-04-19T20:44:51.372664 #4016665] INFO -- : /tmp/ruby/src/trunk/basictest/test.rb:while/until ........OK 8 I, [2024-04-19T20:44:51.374142 #4016665] INFO -- : /tmp/ruby/src/trunk/basictest/test.rb:exception ..........OK 10 I, [2024-04-19T20:44:51.378395 #4016665] INFO -- : /tmp/ruby/src/trunk/basictest/test.rb:array .......................................OK 39 I, [2024-04-19T20:44:51.380366 #4016665] INFO -- : /tmp/ruby/src/trunk/basictest/test.rb:hash ...........................OK 27 I, [2024-04-19T20:44:51.390694 #4016665] INFO -- : /tmp/ruby/src/trunk/basictest/test.rb:iterator ...........................................................................................................OK 107 I, [2024-04-19T20:44:51.396475 #4016665] INFO -- : /tmp/ruby/src/trunk/basictest/test.rb:float ................................................................................OK 80 I, [2024-04-19T20:44:51.412956 #4016665] INFO -- : /tmp/ruby/src/trunk/basictest/test.rb:bignum ...............................OK 31 I, [2024-04-19T20:44:51.426732 #4016665] INFO -- : /tmp/ruby/src/trunk/basictest/test.rb:string & char ..............................................................OK 62 I, [2024-04-19T20:44:51.427262 #4016665] INFO -- : /tmp/ruby/src/trunk/basictest/test.rb:assignment ..........OK 10 I, [2024-04-19T20:44:51.427735 #4016665] INFO -- : /tmp/ruby/src/trunk/basictest/test.rb:call ......OK 6 I, [2024-04-19T20:44:51.428519 #4016665] INFO -- : /tmp/ruby/src/trunk/basictest/test.rb:proc .........OK 9 I, [2024-04-19T20:44:51.530705 #4016665] INFO -- : /tmp/ruby/src/trunk/basictest/test.rb:signal ..OK 2 I, [2024-04-19T20:44:51.551365 #4016665] INFO -- : /tmp/ruby/src/trunk/basictest/test.rb:eval ...........................OK 27 I, [2024-04-19T20:44:51.978331 #4016665] INFO -- : /tmp/ruby/src/trunk/basictest/test.rb:system ........OK 8 I, [2024-04-19T20:44:51.978819 #4016665] INFO -- : /tmp/ruby/src/trunk/basictest/test.rb:const .....OK 5 I, [2024-04-19T20:44:51.979348 #4016665] INFO -- : /tmp/ruby/src/trunk/basictest/test.rb:clone .....OK 5 I, [2024-04-19T20:44:51.980354 #4016665] INFO -- : /tmp/ruby/src/trunk/basictest/test.rb:marshal ....OK 4 I, [2024-04-19T20:44:51.980809 #4016665] INFO -- : /tmp/ruby/src/trunk/basictest/test.rb:pack ....OK 4 I, [2024-04-19T20:44:51.981004 #4016665] INFO -- : /tmp/ruby/src/trunk/basictest/test.rb:math ..OK 2 I, [2024-04-19T20:44:51.981536 #4016665] INFO -- : /tmp/ruby/src/trunk/basictest/test.rb:struct ......OK 6 I, [2024-04-19T20:44:51.982803 #4016665] INFO -- : /tmp/ruby/src/trunk/basictest/test.rb:variable ............OK 12 I, [2024-04-19T20:44:51.983097 #4016665] INFO -- : /tmp/ruby/src/trunk/basictest/test.rb:trace ...OK 3 I, [2024-04-19T20:44:51.983992 #4016665] INFO -- : /tmp/ruby/src/trunk/basictest/test.rb:defined? ............OK 12 I, [2024-04-19T20:44:51.984626 #4016665] INFO -- : /tmp/ruby/src/trunk/basictest/test.rb:alias ......OK 6 I, [2024-04-19T20:44:51.989091 #4016665] INFO -- : /tmp/ruby/src/trunk/basictest/test.rb:path .......................OK 23 I, [2024-04-19T20:44:52.372058 #4016665] INFO -- : /tmp/ruby/src/trunk/basictest/test.rb:gc ....OK 4 I, [2024-04-19T20:44:52.388820 #4016665] INFO -- : I, [2024-04-19T20:44:52.389026 #4016665] INFO -- : test succeeded I, [2024-04-19T20:44:52.395185 #4016665] INFO -- : $$$[end] "make yes-test-basic TESTS='-j4'" exit with 0. I, [2024-04-19T20:44:52.395879 #4016665] INFO -- : $$$[beg] make yes-test-all TESTOPTS='--stderr-on-failure' TESTS='-j4' I, [2024-04-19T20:44:53.254879 #4016665] INFO -- : BASERUBY = /usr/bin/ruby --disable=gems I, [2024-04-19T20:44:53.255086 #4016665] INFO -- : CC = gcc I, [2024-04-19T20:44:53.255198 #4016665] INFO -- : LD = ld I, [2024-04-19T20:44:53.255308 #4016665] INFO -- : LDSHARED = gcc -shared I, [2024-04-19T20:44:53.255402 #4016665] INFO -- : CFLAGS = -O3 -fno-fast-math -ggdb3 -Wall -Wextra -Wdeprecated-declarations -Wdiv-by-zero -Wduplicated-cond -Wimplicit-function-declaration -Wimplicit-int -Wpointer-arith -Wwrite-strings -Wold-style-definition -Wimplicit-fallthrough=0 -Wmissing-noreturn -Wno-cast-function-type -Wno-constant-logical-operand -Wno-long-long -Wno-missing-field-initializers -Wno-overlength-strings -Wno-packed-bitfield-compat -Wno-parentheses-equality -Wno-self-assign -Wno-tautological-compare -Wno-unused-parameter -Wno-unused-value -Wsuggest-attribute=format -Wsuggest-attribute=noreturn -Wunused-variable -Wmisleading-indentation -Wundef -fPIC I, [2024-04-19T20:44:53.255498 #4016665] INFO -- : XCFLAGS = -U_FORTIFY_SOURCE -D_FORTIFY_SOURCE=2 -fstack-protector-strong -fno-strict-overflow -fvisibility=hidden -fexcess-precision=standard -DRUBY_EXPORT -I. -I.ext/include/riscv64-linux -I/tmp/ruby/src/trunk/include -I/tmp/ruby/src/trunk -I/tmp/ruby/src/trunk/prism -I/tmp/ruby/src/trunk/enc/unicode/15.0.0 I, [2024-04-19T20:44:53.255592 #4016665] INFO -- : CPPFLAGS = I, [2024-04-19T20:44:53.255678 #4016665] INFO -- : DLDFLAGS = -Wl,--compress-debug-sections=zlib -Wl,-soname,libruby.so.3.4 -fstack-protector-strong I, [2024-04-19T20:44:53.255766 #4016665] INFO -- : SOLIBS = -lz -lrt -lrt -lgmp -ldl -lcrypt -lm -lpthread I, [2024-04-19T20:44:53.255846 #4016665] INFO -- : LANG = I, [2024-04-19T20:44:53.255931 #4016665] INFO -- : LC_ALL = I, [2024-04-19T20:44:53.256014 #4016665] INFO -- : LC_CTYPE = I, [2024-04-19T20:44:53.256097 #4016665] INFO -- : MFLAGS = I, [2024-04-19T20:44:53.256180 #4016665] INFO -- : RUSTC = rustc I, [2024-04-19T20:44:53.256266 #4016665] INFO -- : YJIT_RUSTC_ARGS = --crate-name=yjit --crate-type=staticlib --edition=2021 -g -C lto=thin -C opt-level=3 -C overflow-checks=on '--out-dir=/tmp/ruby/build/trunk/yjit/target/release/' /tmp/ruby/src/trunk/yjit/src/lib.rs I, [2024-04-19T20:44:53.259858 #4016665] INFO -- : gcc (Debian 13.2.0-4revyos1) 13.2.0 I, [2024-04-19T20:44:53.260077 #4016665] INFO -- : Copyright (C) 2023 Free Software Foundation, Inc. I, [2024-04-19T20:44:53.260184 #4016665] INFO -- : This is free software; see the source for copying conditions. There is NO I, [2024-04-19T20:44:53.260290 #4016665] INFO -- : warranty; not even for MERCHANTABILITY or FITNESS FOR A PARTICULAR PURPOSE. I, [2024-04-19T20:44:53.260409 #4016665] INFO -- : I, [2024-04-19T20:44:53.278201 #4016665] INFO -- : generating enc.mk I, [2024-04-19T20:44:54.795093 #4016665] INFO -- : generating encdb.h I, [2024-04-19T20:44:55.030210 #4016665] INFO -- : encdb.h unchanged I, [2024-04-19T20:44:55.035860 #4016665] INFO -- : making enc I, [2024-04-19T20:44:55.200694 #4016665] INFO -- : make[1]: Entering directory '/tmp/ruby/build/trunk' I, [2024-04-19T20:44:55.200969 #4016665] INFO -- : make[1]: Nothing to be done for 'enc'. I, [2024-04-19T20:44:55.201186 #4016665] INFO -- : make[1]: Leaving directory '/tmp/ruby/build/trunk' I, [2024-04-19T20:44:55.204118 #4016665] INFO -- : making srcs under enc I, [2024-04-19T20:44:55.495837 #4016665] INFO -- : make[1]: Entering directory '/tmp/ruby/build/trunk' I, [2024-04-19T20:44:55.496113 #4016665] INFO -- : make[1]: Nothing to be done for 'srcs'. I, [2024-04-19T20:44:55.496331 #4016665] INFO -- : make[1]: Leaving directory '/tmp/ruby/build/trunk' I, [2024-04-19T20:44:55.501572 #4016665] INFO -- : generating transdb.h I, [2024-04-19T20:44:56.723894 #4016665] INFO -- : transdb.h unchanged I, [2024-04-19T20:44:56.729960 #4016665] INFO -- : making trans I, [2024-04-19T20:44:57.059076 #4016665] INFO -- : make[1]: Entering directory '/tmp/ruby/build/trunk' I, [2024-04-19T20:44:57.059288 #4016665] INFO -- : make[1]: Nothing to be done for 'trans'. I, [2024-04-19T20:44:57.059386 #4016665] INFO -- : make[1]: Leaving directory '/tmp/ruby/build/trunk' I, [2024-04-19T20:44:57.061945 #4016665] INFO -- : making encs I, [2024-04-19T20:44:57.444395 #4016665] INFO -- : make[1]: Entering directory '/tmp/ruby/build/trunk' I, [2024-04-19T20:44:57.444592 #4016665] INFO -- : make[1]: Nothing to be done for 'encs'. I, [2024-04-19T20:44:57.444690 #4016665] INFO -- : make[1]: Leaving directory '/tmp/ruby/build/trunk' I, [2024-04-19T20:44:57.457238 #4016665] INFO -- : generating makefiles ext/configure-ext.mk I, [2024-04-19T20:44:57.653520 #4016665] INFO -- : ext/configure-ext.mk updated I, [2024-04-19T20:44:57.666865 #4016665] INFO -- : make[1]: Entering directory '/tmp/ruby/build/trunk' I, [2024-04-19T20:45:09.521176 #4016665] INFO -- : make[1]: Leaving directory '/tmp/ruby/build/trunk' I, [2024-04-19T20:45:09.523393 #4016665] INFO -- : generating makefile exts.mk I, [2024-04-19T20:45:09.847513 #4016665] INFO -- : exts.mk unchanged I, [2024-04-19T20:45:09.885144 #4016665] INFO -- : make[1]: Entering directory '/tmp/ruby/build/trunk' I, [2024-04-19T20:45:12.071884 #4016665] INFO -- : make[2]: Entering directory '/tmp/ruby/build/trunk/ext/coverage' I, [2024-04-19T20:45:12.097587 #4016665] INFO -- : make[2]: Leaving directory '/tmp/ruby/build/trunk/ext/coverage' I, [2024-04-19T20:45:12.146312 #4016665] INFO -- : make[2]: Entering directory '/tmp/ruby/build/trunk/ext/date' I, [2024-04-19T20:45:12.170582 #4016665] INFO -- : make[2]: Leaving directory '/tmp/ruby/build/trunk/ext/date' I, [2024-04-19T20:45:12.194615 #4016665] INFO -- : make[2]: Entering directory '/tmp/ruby/build/trunk/ext/digest' I, [2024-04-19T20:45:12.252348 #4016665] INFO -- : make[2]: Leaving directory '/tmp/ruby/build/trunk/ext/digest' I, [2024-04-19T20:45:12.432796 #4016665] INFO -- : make[2]: Entering directory '/tmp/ruby/build/trunk/ext/digest/sha2' I, [2024-04-19T20:45:12.459235 #4016665] INFO -- : make[2]: Leaving directory '/tmp/ruby/build/trunk/ext/digest/sha2' I, [2024-04-19T20:45:12.598729 #4016665] INFO -- : make[2]: Entering directory '/tmp/ruby/build/trunk/ext/fiddle' I, [2024-04-19T20:45:12.674375 #4016665] INFO -- : make[2]: Leaving directory '/tmp/ruby/build/trunk/ext/fiddle' I, [2024-04-19T20:45:12.701921 #4016665] INFO -- : make[2]: Entering directory '/tmp/ruby/build/trunk/ext/io/console' I, [2024-04-19T20:45:12.724038 #4016665] INFO -- : make[2]: Leaving directory '/tmp/ruby/build/trunk/ext/io/console' I, [2024-04-19T20:45:12.800978 #4016665] INFO -- : make[2]: Entering directory '/tmp/ruby/build/trunk/ext/json' I, [2024-04-19T20:45:12.869747 #4016665] INFO -- : make[2]: Leaving directory '/tmp/ruby/build/trunk/ext/json' I, [2024-04-19T20:45:12.963608 #4016665] INFO -- : make[2]: Entering directory '/tmp/ruby/build/trunk/ext/monitor' I, [2024-04-19T20:45:12.983731 #4016665] INFO -- : make[2]: Leaving directory '/tmp/ruby/build/trunk/ext/monitor' I, [2024-04-19T20:45:13.028021 #4016665] INFO -- : make[2]: Entering directory '/tmp/ruby/build/trunk/ext/objspace' I, [2024-04-19T20:45:13.071064 #4016665] INFO -- : make[2]: Leaving directory '/tmp/ruby/build/trunk/ext/objspace' I, [2024-04-19T20:45:13.195909 #4016665] INFO -- : make[2]: Entering directory '/tmp/ruby/build/trunk/ext/openssl' I, [2024-04-19T20:45:13.332906 #4016665] INFO -- : make[2]: Leaving directory '/tmp/ruby/build/trunk/ext/openssl' I, [2024-04-19T20:45:13.359992 #4016665] INFO -- : make[2]: Entering directory '/tmp/ruby/build/trunk/ext/pathname' I, [2024-04-19T20:45:13.380365 #4016665] INFO -- : make[2]: Leaving directory '/tmp/ruby/build/trunk/ext/pathname' I, [2024-04-19T20:45:13.434247 #4016665] INFO -- : make[2]: Entering directory '/tmp/ruby/build/trunk/ext/psych' I, [2024-04-19T20:45:13.599443 #4016665] INFO -- : make[2]: Leaving directory '/tmp/ruby/build/trunk/ext/psych' I, [2024-04-19T20:45:13.631814 #4016665] INFO -- : make[2]: Entering directory '/tmp/ruby/build/trunk/ext/pty' I, [2024-04-19T20:45:13.654131 #4016665] INFO -- : make[2]: Leaving directory '/tmp/ruby/build/trunk/ext/pty' I, [2024-04-19T20:45:13.757255 #4016665] INFO -- : make[2]: Entering directory '/tmp/ruby/build/trunk/ext/ripper' I, [2024-04-19T20:45:13.804468 #4016665] INFO -- : make[2]: Leaving directory '/tmp/ruby/build/trunk/ext/ripper' I, [2024-04-19T20:45:13.816227 #4016665] INFO -- : make[2]: Entering directory '/tmp/ruby/build/trunk/ext/rubyvm' I, [2024-04-19T20:45:13.833850 #4016665] INFO -- : make[2]: Leaving directory '/tmp/ruby/build/trunk/ext/rubyvm' I, [2024-04-19T20:45:13.914236 #4016665] INFO -- : make[2]: Entering directory '/tmp/ruby/build/trunk/ext/socket' I, [2024-04-19T20:45:13.973830 #4016665] INFO -- : make[2]: Leaving directory '/tmp/ruby/build/trunk/ext/socket' I, [2024-04-19T20:45:14.083775 #4016665] INFO -- : make[2]: Entering directory '/tmp/ruby/build/trunk/.bundle/gems/bigdecimal-3.1.7/ext/bigdecimal' I, [2024-04-19T20:45:14.238937 #4016665] INFO -- : make[2]: Leaving directory '/tmp/ruby/build/trunk/.bundle/gems/bigdecimal-3.1.7/ext/bigdecimal' I, [2024-04-19T20:45:14.257039 #4016665] INFO -- : make[2]: Entering directory '/tmp/ruby/build/trunk/.bundle/gems/debug-1.9.2/ext/debug' I, [2024-04-19T20:45:14.408666 #4016665] INFO -- : make[2]: Leaving directory '/tmp/ruby/build/trunk/.bundle/gems/debug-1.9.2/ext/debug' I, [2024-04-19T20:45:14.430339 #4016665] INFO -- : make[2]: Entering directory '/tmp/ruby/build/trunk/.bundle/gems/nkf-0.2.0/ext/nkf' I, [2024-04-19T20:45:14.583032 #4016665] INFO -- : make[2]: Leaving directory '/tmp/ruby/build/trunk/.bundle/gems/nkf-0.2.0/ext/nkf' I, [2024-04-19T20:45:14.604978 #4016665] INFO -- : make[2]: Entering directory '/tmp/ruby/build/trunk/.bundle/gems/racc-1.7.3/ext/racc/cparse' I, [2024-04-19T20:45:14.762599 #4016665] INFO -- : make[2]: Leaving directory '/tmp/ruby/build/trunk/.bundle/gems/racc-1.7.3/ext/racc/cparse' I, [2024-04-19T20:45:14.790320 #4016665] INFO -- : make[2]: Entering directory '/tmp/ruby/build/trunk/.bundle/gems/rbs-3.4.4/ext/rbs_extension' I, [2024-04-19T20:45:14.945369 #4016665] INFO -- : make[2]: Leaving directory '/tmp/ruby/build/trunk/.bundle/gems/rbs-3.4.4/ext/rbs_extension' I, [2024-04-19T20:45:14.962040 #4016665] INFO -- : make[2]: Entering directory '/tmp/ruby/build/trunk/.bundle/gems/syslog-0.1.2/ext/syslog' I, [2024-04-19T20:45:15.115931 #4016665] INFO -- : make[2]: Leaving directory '/tmp/ruby/build/trunk/.bundle/gems/syslog-0.1.2/ext/syslog' I, [2024-04-19T20:45:15.337371 #4016665] INFO -- : make[2]: Entering directory '/tmp/ruby/build/trunk' I, [2024-04-19T20:45:15.982917 #4016665] INFO -- : make[2]: 'ruby' is up to date. I, [2024-04-19T20:45:15.983320 #4016665] INFO -- : make[2]: Leaving directory '/tmp/ruby/build/trunk' I, [2024-04-19T20:45:15.985427 #4016665] INFO -- : make[1]: Leaving directory '/tmp/ruby/build/trunk' I, [2024-04-19T20:45:16.019940 #4016665] INFO -- : make[1]: Entering directory '/tmp/ruby/build/trunk' I, [2024-04-19T20:45:16.020141 #4016665] INFO -- : make[1]: Nothing to be done for 'note'. I, [2024-04-19T20:45:16.020241 #4016665] INFO -- : make[1]: Leaving directory '/tmp/ruby/build/trunk' I, [2024-04-19T20:45:16.763379 #4016665] INFO -- : Run options: I, [2024-04-19T20:45:16.763584 #4016665] INFO -- : --seed=39672 I, [2024-04-19T20:45:16.763687 #4016665] INFO -- : "--ruby=./miniruby -I/tmp/ruby/src/trunk/lib -I. -I.ext/common /tmp/ruby/src/trunk/tool/runruby.rb --extout=.ext -- --disable-gems" I, [2024-04-19T20:45:16.763831 #4016665] INFO -- : --excludes-dir=/tmp/ruby/src/trunk/test/.excludes I, [2024-04-19T20:45:16.763944 #4016665] INFO -- : --name=!/memory_leak/ I, [2024-04-19T20:45:16.764030 #4016665] INFO -- : --stderr-on-failure I, [2024-04-19T20:45:16.764117 #4016665] INFO -- : -j4 I, [2024-04-19T20:45:16.764203 #4016665] INFO -- : I, [2024-04-19T20:45:16.764288 #4016665] INFO -- : # Running tests: I, [2024-04-19T20:45:16.764370 #4016665] INFO -- : I, [2024-04-19T20:45:17.724701 #4016665] INFO -- : [ 1/881] 4057987=test_require I, [2024-04-19T20:45:17.737696 #4016665] INFO -- : [ 2/881] 4057986=test_cgi_cookie I, [2024-04-19T20:45:17.749883 #4016665] INFO -- : [ 3/881] 4057988=test_float I, [2024-04-19T20:45:17.771451 #4016665] INFO -- : [ 4/881] 4057985=test_gem_source_git I, [2024-04-19T20:45:17.852992 #4016665] INFO -- : [ 5/881] 4057986=test_regex_casefold I, [2024-04-19T20:45:20.615389 #4016665] INFO -- : [ 6/881] 4057988=test_refinement I, [2024-04-19T20:45:21.302778 #4016665] INFO -- : [ 7/881] 4057986=test_gem_commands_signout_command I, [2024-04-19T20:45:23.114643 #4016665] INFO -- : [ 8/881] 4057986=test_gem_resolver_installer_set I, [2024-04-19T20:45:23.317274 #4016665] INFO -- : [ 9/881] 4057985=test_dir_m17n I, [2024-04-19T20:45:24.701144 #4016665] INFO -- : [ 10/881] 4057986=test_rdoc_top_level I, [2024-04-19T20:45:28.333385 #4016665] INFO -- : [ 11/881] 4057986=test_metaclass I, [2024-04-19T20:45:28.408676 #4016665] INFO -- : [ 12/881] 4057986=test_cgi_session I, [2024-04-19T20:45:28.506127 #4016665] INFO -- : [ 13/881] 4057986=test_rdoc_rd I, [2024-04-19T20:45:28.809594 #4016665] INFO -- : [ 14/881] 4057986=test_x509crl I, [2024-04-19T20:45:30.349971 #4016665] INFO -- : [ 15/881] 4057986=test_signal I, [2024-04-19T20:45:32.973393 #4016665] INFO -- : [ 16/881] 4057985=test_fixnum I, [2024-04-19T20:45:33.105122 #4016665] INFO -- : [ 17/881] 4057985=test_process I, [2024-04-19T20:45:33.230220 #4016665] INFO -- : [ 18/881] 4057985=test_windows_1252 I, [2024-04-19T20:45:33.641660 #4016665] INFO -- : [ 19/881] 4057985=test_input_method I, [2024-04-19T20:45:35.471048 #4016665] INFO -- : [ 20/881] 4057985=test_digest_extend I, [2024-04-19T20:45:35.659807 #4016665] INFO -- : [ 21/881] 4057985=test_omap I, [2024-04-19T20:45:35.677785 #4016665] INFO -- : [ 22/881] 4057986=test_string I, [2024-04-19T20:45:35.716196 #4016665] INFO -- : [ 23/881] 4057986=test_iterator I, [2024-04-19T20:45:36.151033 #4016665] INFO -- : [ 24/881] 4057985=pattern_test I, [2024-04-19T20:45:36.247762 #4016665] INFO -- : [ 25/881] 4057986=test_memory_view I, [2024-04-19T20:45:36.360264 #4016665] INFO -- : [ 26/881] 4057986=test_debug I, [2024-04-19T20:45:36.371414 #4016665] INFO -- : [ 27/881] 4057986=test_shellwords I, [2024-04-19T20:45:36.401135 #4016665] INFO -- : [ 28/881] 4057986=test_new I, [2024-04-19T20:45:36.447213 #4016665] INFO -- : [ 29/881] 4057985=test_gem_security_signer I, [2024-04-19T20:45:36.495072 #4016665] INFO -- : [ 30/881] 4057986=test_cipher I, [2024-04-19T20:45:36.909503 #4016665] INFO -- : [ 31/881] 4057987=test_gem_resolver_git_set I, [2024-04-19T20:45:36.956612 #4016665] INFO -- : [ 32/881] 4057986=test_storage I, [2024-04-19T20:45:37.076330 #4016665] INFO -- : [ 33/881] 4057986=test_win32ole_variant_outarg I, [2024-04-19T20:45:37.097573 #4016665] INFO -- : [ 34/881] 4057986=json_common_interface_test I, [2024-04-19T20:45:37.279976 #4016665] INFO -- : [ 35/881] 4057986=test_gem_source_subpath_problem I, [2024-04-19T20:45:37.311202 #4016665] INFO -- : [ 36/881] 4057985=test_dln I, [2024-04-19T20:45:37.460884 #4016665] INFO -- : [ 37/881] 4057985=json_parser_test I, [2024-04-19T20:45:37.747371 #4016665] INFO -- : [ 38/881] 4057985=test_nomethod_error I, [2024-04-19T20:45:37.770970 #4016665] INFO -- : [ 39/881] 4057985=memsize_test I, [2024-04-19T20:45:37.832369 #4016665] INFO -- : [ 40/881] 4057985=test_config I, [2024-04-19T20:45:38.121355 #4016665] INFO -- : [ 41/881] 4057985=test_pkg_config I, [2024-04-19T20:45:38.166735 #4016665] INFO -- : [ 42/881] 4057985=test_cparser I, [2024-04-19T20:45:38.217243 #4016665] INFO -- : [ 43/881] 4057986=test_rdoc_markup_to_html_snippet I, [2024-04-19T20:45:38.796424 #4016665] INFO -- : [ 44/881] 4057986=magic_comment_test I, [2024-04-19T20:45:39.521299 #4016665] INFO -- : [ 45/881] 4057986=test_struct I, [2024-04-19T20:45:39.582374 #4016665] INFO -- : [ 46/881] 4057986=test_variable I, [2024-04-19T20:45:40.444710 #4016665] INFO -- : [ 47/881] 4057986=fuzzer_test I, [2024-04-19T20:45:40.537845 #4016665] INFO -- : [ 48/881] 4057986=test_rdoc_markup_include I, [2024-04-19T20:45:40.566756 #4016665] INFO -- : [ 49/881] 4057986=test_sexp I, [2024-04-19T20:45:40.607299 #4016665] INFO -- : [ 50/881] 4057985=test_win32ole_variant_m I, [2024-04-19T20:45:40.620083 #4016665] INFO -- : [ 51/881] 4057985=test_engine I, [2024-04-19T20:45:40.628082 #4016665] INFO -- : [ 52/881] 4057985=test_allocation I, [2024-04-19T20:45:40.755690 #4016665] INFO -- : [ 53/881] 4057986=test_div I, [2024-04-19T20:45:40.777653 #4016665] INFO -- : [ 54/881] 4057986=test_key_error I, [2024-04-19T20:45:40.816095 #4016665] INFO -- : [ 55/881] 4057986=test_insns_leaf I, [2024-04-19T20:45:40.839421 #4016665] INFO -- : [ 56/881] 4057986=test_serialize_subclasses I, [2024-04-19T20:45:40.857866 #4016665] INFO -- : [ 57/881] 4057986=test_deprecated I, [2024-04-19T20:45:40.872052 #4016665] INFO -- : [ 58/881] 4057986=test_color_printer I, [2024-04-19T20:45:41.053998 #4016665] INFO -- : [ 59/881] 4057987=test_files_test_1 I, [2024-04-19T20:45:41.388114 #4016665] INFO -- : [ 60/881] 4057986=test_struct I, [2024-04-19T20:45:44.045253 #4016665] INFO -- : [ 61/881] 4057988=test_gem_path_support I, [2024-04-19T20:45:45.415456 #4016665] INFO -- : [ 62/881] 4057988=test_set I, [2024-04-19T20:45:45.719029 #4016665] INFO -- : [ 63/881] 4057988=test_x509req I, [2024-04-19T20:45:47.524165 #4016665] INFO -- : [ 64/881] 4057988=test_mutex I, [2024-04-19T20:45:47.623033 #4016665] INFO -- : [ 65/881] 4057986=test_rdoc_rd_inline I, [2024-04-19T20:45:47.656395 #4016665] INFO -- : [ 66/881] 4057986=constant_path_node_test I, [2024-04-19T20:45:47.675668 #4016665] INFO -- : [ 67/881] 4057986=test_gem_ext_cargo_builder I, [2024-04-19T20:45:48.182892 #4016665] INFO -- : [ 68/881] 4057986=test_ssl I, [2024-04-19T20:45:48.831381 #4016665] INFO -- : [ 69/881] 4057988=test_module I, [2024-04-19T20:45:58.506290 #4016665] INFO -- : [ 70/881] 4057985=test_gem_request_set I, [2024-04-19T20:45:59.935786 #4016665] INFO -- : [ 71/881] 4057988=test_arith_seq_extract I, [2024-04-19T20:46:01.008685 #4016665] INFO -- : [ 72/881] 4057985=test_method_name_check I, [2024-04-19T20:46:01.104912 #4016665] INFO -- : [ 73/881] 4057988=test_parser I, [2024-04-19T20:46:01.134825 #4016665] INFO -- : [ 74/881] 4057985=test_rubyvm I, [2024-04-19T20:46:01.168889 #4016665] INFO -- : [ 75/881] 4057985=test_configuration I, [2024-04-19T20:46:01.615011 #4016665] INFO -- : [ 76/881] 4057988=test_buffered_io I, [2024-04-19T20:46:01.803736 #4016665] INFO -- : [ 77/881] 4057985=test_monitor I, [2024-04-19T20:46:01.949721 #4016665] INFO -- : [ 78/881] 4057988=test_whileuntil I, [2024-04-19T20:46:01.997104 #4016665] INFO -- : [ 79/881] 4057988=test_rdoc_generator_markup I, [2024-04-19T20:46:02.066998 #4016665] INFO -- : [ 80/881] 4057985=test_boolean I, [2024-04-19T20:46:02.115973 #4016665] INFO -- : [ 81/881] 4057985=test_stringify_symbols I, [2024-04-19T20:46:02.173154 #4016665] INFO -- : [ 82/881] 4057985=integer_parse_test I, [2024-04-19T20:46:02.347290 #4016665] INFO -- : [ 83/881] 4057985=test_instrumentation_api I, [2024-04-19T20:46:02.369752 #4016665] INFO -- : [ 84/881] 4057987=test_benchmark I, [2024-04-19T20:46:03.036394 #4016665] INFO -- : [ 85/881] 4057988=test_gem_dependency_list I, [2024-04-19T20:46:03.719871 #4016665] INFO -- : [ 86/881] 4057988=test_nesting_parser I, [2024-04-19T20:46:03.851064 #4016665] INFO -- : [ 87/881] 4057987=test_win32ole_method_event I, [2024-04-19T20:46:03.980854 #4016665] INFO -- : [ 88/881] 4057987=test_scalar_scanner I, [2024-04-19T20:46:04.148510 #4016665] INFO -- : [ 89/881] 4057987=test_gem_source I, [2024-04-19T20:46:04.239595 #4016665] INFO -- : [ 90/881] 4057988=test_array I, [2024-04-19T20:46:05.848253 #4016665] INFO -- : [ 91/881] 4057987=test_gem_package_tar_writer I, [2024-04-19T20:46:06.111754 #4016665] INFO -- : [ 92/881] 4057985=test_gem_commands_outdated_command I, [2024-04-19T20:46:06.414442 #4016665] INFO -- : [ 93/881] 4057987=test_provider I, [2024-04-19T20:46:06.793369 #4016665] INFO -- : [ 94/881] 4057985=test_abi I, [2024-04-19T20:46:07.619082 #4016665] INFO -- : [ 95/881] 4057985=test_load I, [2024-04-19T20:46:07.894302 #4016665] INFO -- : [ 96/881] 4057985=test_gem_commands_rebuild_command I, [2024-04-19T20:46:07.944924 #4016665] INFO -- : [ 97/881] 4057985=test_yamldbm I, [2024-04-19T20:46:08.103891 #4016665] INFO -- : [ 98/881] 4057985=test_rdoc_parser_simple I, [2024-04-19T20:46:08.554011 #4016665] INFO -- : [ 99/881] 4057985=test_gem_ext_builder I, [2024-04-19T20:46:09.865852 #4016665] INFO -- : [100/881] 4057987=test_https I, [2024-04-19T20:46:11.469713 #4016665] INFO -- : [101/881] 4057987=test_evaluation I, [2024-04-19T20:46:11.507198 #4016665] INFO -- : [102/881] 4057987=test_gem_source_installed I, [2024-04-19T20:46:11.569681 #4016665] INFO -- : [103/881] 4057987=test_x509ext I, [2024-04-19T20:46:11.642056 #4016665] INFO -- : [104/881] 4057987=test_erb I, [2024-04-19T20:46:12.055914 #4016665] INFO -- : [105/881] 4057987=test_yield_block I, [2024-04-19T20:46:12.073876 #4016665] INFO -- : [106/881] 4057987=test_len I, [2024-04-19T20:46:12.136751 #4016665] INFO -- : [107/881] 4057987=test_gem_commands_cert_command I, [2024-04-19T20:46:16.259262 #4016665] INFO -- : [108/881] 4057985=test_completion I, [2024-04-19T20:46:20.553897 #4016665] INFO -- : [109/881] 4057985=test_rational I, [2024-04-19T20:46:20.708201 #4016665] INFO -- : [110/881] 4057985=test_rational2 I, [2024-04-19T20:46:20.732458 #4016665] INFO -- : [111/881] 4057985=test_spell_checker I, [2024-04-19T20:46:20.765482 #4016665] INFO -- : [112/881] 4057985=attribute_write_test I, [2024-04-19T20:46:20.804985 #4016665] INFO -- : [113/881] 4057985=test_propertyputref I, [2024-04-19T20:46:20.821036 #4016665] INFO -- : [114/881] 4057985=test_assembler I, [2024-04-19T20:46:20.843755 #4016665] INFO -- : [115/881] 4057985=test_human_typo I, [2024-04-19T20:46:20.904995 #4016665] INFO -- : [116/881] 4057985=test_primitive I, [2024-04-19T20:46:20.962362 #4016665] INFO -- : [117/881] 4057985=test_rbconfig I, [2024-04-19T20:46:20.980680 #4016665] INFO -- : [118/881] 4057985=test_pair I, [2024-04-19T20:46:27.158065 #4016665] INFO -- : [119/881] 4057987=test_gem_commands_yank_command I, [2024-04-19T20:46:28.212150 #4016665] INFO -- : [120/881] 4057987=test_win32ole_param I, [2024-04-19T20:46:28.261567 #4016665] INFO -- : [121/881] 4057987=test_acceptable I, [2024-04-19T20:46:29.089410 #4016665] INFO -- : [122/881] 4057987=test_euc_jp I, [2024-04-19T20:46:29.379160 #4016665] INFO -- : [123/881] 4057987=test_rdoc_generator_pot_po_entry I, [2024-04-19T20:46:30.051683 #4016665] INFO -- : [124/881] 4057987=test_document I, [2024-04-19T20:46:30.123562 #4016665] INFO -- : [125/881] 4057987=test_rdoc_i18n_locale I, [2024-04-19T20:46:30.172143 #4016665] INFO -- : [126/881] 4057987=test_chilled I, [2024-04-19T20:46:30.241181 #4016665] INFO -- : [127/881] 4057987=test_name_error_extension I, [2024-04-19T20:46:30.267223 #4016665] INFO -- : [128/881] 4057987=test_set_len I, [2024-04-19T20:46:30.324392 #4016665] INFO -- : [129/881] 4057987=test_encoding I, [2024-04-19T20:46:30.417633 #4016665] INFO -- : [130/881] 4057987=test_httpresponses I, [2024-04-19T20:46:30.488275 #4016665] INFO -- : [131/881] 4057987=test_rdoc_ri_driver I, [2024-04-19T20:46:31.168982 #4016665] INFO -- : [132/881] 4057988=test_gem_resolver_local_specification I, [2024-04-19T20:46:31.579671 #4016665] INFO -- : [133/881] 4057988=test_httpheader I, [2024-04-19T20:46:31.733066 #4016665] INFO -- : [134/881] 4057988=test_rdoc_markup_to_label I, [2024-04-19T20:46:31.988027 #4016665] INFO -- : [135/881] 4057988=test_install I, [2024-04-19T20:46:32.679395 #4016665] INFO -- : [136/881] 4057987=test_sockopt I, [2024-04-19T20:46:32.685849 #4016665] INFO -- : [137/881] 4057987=json_encoding_test I, [2024-04-19T20:46:32.916338 #4016665] INFO -- : [138/881] 4057987=test_color I, [2024-04-19T20:46:33.543797 #4016665] INFO -- : [139/881] 4057988=test_key_stroke I, [2024-04-19T20:46:33.565704 #4016665] INFO -- : [140/881] 4057988=test_rdoc_markup_to_html I, [2024-04-19T20:46:33.602395 #4016665] INFO -- : [141/881] 4057987=test_date_compat I, [2024-04-19T20:46:33.620161 #4016665] INFO -- : [142/881] 4057987=test_bug-14834 I, [2024-04-19T20:46:34.231458 #4016665] INFO -- : [143/881] 4057988=test_terminfo I, [2024-04-19T20:46:34.233401 #4016665] INFO -- : [144/881] 4057988=test_compile_prism I, [2024-04-19T20:46:34.266299 #4016665] INFO -- : [145/881] 4057987=test_case_mapping I, [2024-04-19T20:46:34.335565 #4016665] INFO -- : [146/881] 4057987=test_path I, [2024-04-19T20:46:34.403560 #4016665] INFO -- : [147/881] 4057987=test_win32ole_param_event I, [2024-04-19T20:46:34.444503 #4016665] INFO -- : [148/881] 4057987=test_bn I, [2024-04-19T20:46:34.590188 #4016665] INFO -- : [149/881] 4057987=test_http I, [2024-04-19T20:46:35.374529 #4016665] INFO -- : [150/881] 4057986=test_addrinfo I, [2024-04-19T20:46:35.740506 #4016665] INFO -- : [151/881] 4057986=test_tree_spell_checker I, [2024-04-19T20:46:36.074674 #4016665] INFO -- : [152/881] 4057986=test_data I, [2024-04-19T20:46:36.101314 #4016665] INFO -- : [153/881] 4057986=static_literals_test I, [2024-04-19T20:46:36.147347 #4016665] INFO -- : [154/881] 4057986=test_filter I, [2024-04-19T20:46:36.505682 #4016665] INFO -- : [155/881] 4057986=test_gem_gem_runner I, [2024-04-19T20:46:36.705452 #4016665] INFO -- : [156/881] 4057988=test_rdoc_method_attr I, [2024-04-19T20:46:36.803572 #4016665] INFO -- : [157/881] 4057986=test_unicode I, [2024-04-19T20:46:36.861521 #4016665] INFO -- : [158/881] 4057986=test_enumerator I, [2024-04-19T20:46:36.881672 #4016665] INFO -- : [159/881] 4057986=test_rdoc_parser_changelog I, [2024-04-19T20:46:37.261194 #4016665] INFO -- : [160/881] 4057986=parameters_signature_test I, [2024-04-19T20:46:37.307028 #4016665] INFO -- : [161/881] 4057986=test_koi8 I, [2024-04-19T20:46:37.366956 #4016665] INFO -- : [162/881] 4057986=test_rdoc_generator_pot I, [2024-04-19T20:46:37.370915 #4016665] INFO -- : [163/881] 4057986=test_ssl_session I, [2024-04-19T20:46:37.707764 #4016665] INFO -- : [164/881] 4057988=test_thread_cv I, [2024-04-19T20:46:38.412479 #4016665] INFO -- : [165/881] 4057988=test_lexer I, [2024-04-19T20:46:38.537278 #4016665] INFO -- : [166/881] 4057988=test_notimplement I, [2024-04-19T20:46:38.565377 #4016665] INFO -- : [167/881] 4057988=test_random I, [2024-04-19T20:46:38.595018 #4016665] INFO -- : [168/881] 4057988=test_gem_uri I, [2024-04-19T20:46:38.778578 #4016665] INFO -- : [169/881] 4057988=test_key_event_record I, [2024-04-19T20:46:38.815247 #4016665] INFO -- : [170/881] 4057988=test_gem_resolver_vendor_specification I, [2024-04-19T20:46:39.074100 #4016665] INFO -- : [171/881] 4057988=test_gem_commands_update_command I, [2024-04-19T20:46:42.020624 #4016665] INFO -- : [172/881] 4057986=test_gem_commands_build_command I, [2024-04-19T20:46:43.865219 #4016665] INFO -- : [173/881] 4057986=test_case_comprehensive I, [2024-04-19T20:46:44.030280 #4016665] INFO -- : [174/881] 4057985=test_interned_str I, [2024-04-19T20:46:44.034941 #4016665] INFO -- : [175/881] 4057985=test_gem_commands_server_command I, [2024-04-19T20:46:44.110762 #4016665] INFO -- : [176/881] 4057985=test_did_you_mean I, [2024-04-19T20:46:44.925134 #4016665] INFO -- : [177/881] 4057985=test_io_m17n I, [2024-04-19T20:46:46.789219 #4016665] INFO -- : [178/881] 4057988=test_variable_name_check I, [2024-04-19T20:46:47.070258 #4016665] INFO -- : [179/881] 4057988=test_tracer I, [2024-04-19T20:46:47.087212 #4016665] INFO -- : [180/881] 4057988=test_cmethod I, [2024-04-19T20:46:47.345148 #4016665] INFO -- : [181/881] 4057988=test_option I, [2024-04-19T20:46:47.987636 #4016665] INFO -- : [182/881] 4057988=test_append I, [2024-04-19T20:46:48.008565 #4016665] INFO -- : [183/881] 4057988=test_rdoc_markup_heading I, [2024-04-19T20:46:48.151342 #4016665] INFO -- : [184/881] 4057988=test_exception_at_throwing I, [2024-04-19T20:46:48.500151 #4016665] INFO -- : [185/881] 4057988=test_iseq I, [2024-04-19T20:46:51.406004 #4016665] INFO -- : [186/881] 4057987=test_pkey_dsa I, [2024-04-19T20:46:52.684255 #4016665] INFO -- : [187/881] 4057988=test_ocsp I, [2024-04-19T20:46:53.129938 #4016665] INFO -- : [188/881] 4057985=test_class I, [2024-04-19T20:46:53.158065 #4016665] INFO -- : [189/881] 4057985=test_scheduler I, [2024-04-19T20:46:53.495823 #4016665] INFO -- : [190/881] 4057985=reflection_test I, [2024-04-19T20:46:53.520129 #4016665] INFO -- : [191/881] 4057985=test_within_pipe I, [2024-04-19T20:46:53.659654 #4016665] INFO -- : [192/881] 4057985=test_emoji_breaks I, [2024-04-19T20:46:53.685254 #4016665] INFO -- : [193/881] 4057985=test_gem_bundler_version_finder I, [2024-04-19T20:46:53.897959 #4016665] INFO -- : [194/881] 4057985=test_rdoc_markup_to_bs I, [2024-04-19T20:46:54.122397 #4016665] INFO -- : [195/881] 4057985=test_help I, [2024-04-19T20:46:54.183762 #4016665] INFO -- : [196/881] 4057985=test_beginendblock I, [2024-04-19T20:46:55.884705 #4016665] INFO -- : [197/881] 4057988=test_files_lib I, [2024-04-19T20:46:56.359131 #4016665] INFO -- : [198/881] 4057985=test_gem_commands_unpack_command I, [2024-04-19T20:46:58.269887 #4016665] INFO -- : [199/881] 4057985=test_stream I, [2024-04-19T20:46:58.342676 #4016665] INFO -- : [200/881] 4057985=test_to_ary_concat I, [2024-04-19T20:47:03.541609 #4016665] INFO -- : [201/881] 4057985=test_webauthn_listener_response I, [2024-04-19T20:47:03.671359 #4016665] INFO -- : [202/881] 4057985=test_time I, [2024-04-19T20:47:04.763280 #4016665] INFO -- : [203/881] 4057985=test_rdoc_markup_pre_process I, [2024-04-19T20:47:05.168215 #4016665] INFO -- : [204/881] 4057985=test_printf I, [2024-04-19T20:47:05.318380 #4016665] INFO -- : [205/881] 4057985=test_pinned I, [2024-04-19T20:47:05.435143 #4016665] INFO -- : [206/881] 4057985=test_mkmf I, [2024-04-19T20:47:05.567242 #4016665] INFO -- : [207/881] 4057985=test_date_marshal I, [2024-04-19T20:47:05.635645 #4016665] INFO -- : [208/881] 4057985=test_history I, [2024-04-19T20:47:05.830445 #4016665] INFO -- : [209/881] 4057985=test_popen_deadlock I, [2024-04-19T20:47:06.970115 #4016665] INFO -- : [210/881] 4057987=test_delegate I, [2024-04-19T20:47:07.271318 #4016665] INFO -- : [211/881] 4057987=test_exit I, [2024-04-19T20:47:07.587240 #4016665] INFO -- : [212/881] 4057987=test_recursion I, [2024-04-19T20:47:07.679393 #4016665] INFO -- : [213/881] 4057987=test_gem_security I, [2024-04-19T20:47:10.082674 #4016665] INFO -- : [214/881] 4057985=test_rdoc_servlet I, [2024-04-19T20:47:11.017741 #4016665] INFO -- : [215/881] 4057985=test_ractor I, [2024-04-19T20:47:11.039988 #4016665] INFO -- : [216/881] 4057985=test_digest I, [2024-04-19T20:47:11.166548 #4016665] INFO -- : [217/881] 4057985=test_closure I, [2024-04-19T20:47:13.430860 #4016665] INFO -- : [218/881] 4057985=test_bundled_ca I, [2024-04-19T20:47:15.905899 #4016665] INFO -- : [219/881] 4057985=test_open3 I, [2024-04-19T20:47:21.363359 #4016665] INFO -- : [220/881] 4057988=test_multi_irb_commands I, [2024-04-19T20:47:21.367101 #4016665] INFO -- : [221/881] 4057988=test_fiber I, [2024-04-19T20:47:33.934058 #4016665] INFO -- : [222/881] 4057985=test_regexp I, [2024-04-19T20:47:34.810775 #4016665] INFO -- : [223/881] 4057988=test_gem_commands_check_command I, [2024-04-19T20:47:35.330802 #4016665] INFO -- : [224/881] 4057988=errors_test I, [2024-04-19T20:47:36.856950 #4016665] INFO -- : [225/881] 4057988=test_tmpdir I, [2024-04-19T20:47:36.908325 #4016665] INFO -- : [226/881] 4057988=test_rdoc_markup_document I, [2024-04-19T20:47:37.024675 #4016665] INFO -- : [227/881] 4057988=test_integer_comb I, [2024-04-19T20:47:57.870532 #4016665] INFO -- : [228/881] 4057988=test_vm_dump I, [2024-04-19T20:47:57.894860 #4016665] INFO -- : [229/881] 4057988=test_udp I, [2024-04-19T20:47:57.948847 #4016665] INFO -- : [230/881] 4057988=test_force_exit I, [2024-04-19T20:47:58.006597 #4016665] INFO -- : [231/881] 4057988=test_file I, [2024-04-19T20:48:05.060042 #4016665] INFO -- : [232/881] 4057988=test_ostruct I, [2024-04-19T20:48:06.068153 #4016665] INFO -- : [233/881] 4057988=unescape_test I, [2024-04-19T20:48:21.119979 #4016665] INFO -- : [234/881] 4057988=test_data_error I, [2024-04-19T20:48:21.168241 #4016665] INFO -- : [235/881] 4057988=bom_test I, [2024-04-19T20:48:21.216518 #4016665] INFO -- : [236/881] 4057988=static_inspect_test I, [2024-04-19T20:48:21.374005 #4016665] INFO -- : [237/881] 4057988=test_encoding I, [2024-04-19T20:48:22.891616 #4016665] INFO -- : [238/881] 4057988=test_erb_command I, [2024-04-19T20:48:23.033948 #4016665] INFO -- : [239/881] 4057988=test_helper I, [2024-04-19T20:48:23.140174 #4016665] INFO -- : [240/881] 4057988=test_gem_uri_formatter I, [2024-04-19T20:48:23.239707 #4016665] INFO -- : [241/881] 4057988=test_pty I, [2024-04-19T20:48:25.602127 #4016665] INFO -- : [242/881] 4057988=test_dup I, [2024-04-19T20:48:27.418497 #4016665] INFO -- : [243/881] 4057988=test_constant I, [2024-04-19T20:48:30.539119 #4016665] INFO -- : [244/881] 4057987=command_line_test I, [2024-04-19T20:48:31.733412 #4016665] INFO -- : [245/881] 4057987=test_project_sanity I, [2024-04-19T20:48:31.915796 #4016665] INFO -- : [246/881] 4057987=test_range I, [2024-04-19T20:48:39.037291 #4016665] INFO -- : [247/881] 4057987=test_rdoc_ri_paths I, [2024-04-19T20:48:39.228658 #4016665] INFO -- : [248/881] 4057987=library_symbols_test I, [2024-04-19T20:48:39.273435 #4016665] INFO -- : [249/881] 4057987=test_addr I, [2024-04-19T20:48:39.367903 #4016665] INFO -- : [250/881] 4057987=test_locale I, [2024-04-19T20:48:40.172473 #4016665] INFO -- : [251/881] 4057987=test_ensured I, [2024-04-19T20:48:40.393505 #4016665] INFO -- : [252/881] 4057987=test_ts I, [2024-04-19T20:48:45.175894 #4016665] INFO -- : [253/881] 4057987=test_enumerable I, [2024-04-19T20:48:45.235887 #4016665] INFO -- : [254/881] 4057987=test_gem_resolver_vendor_set I, [2024-04-19T20:48:45.330392 #4016665] INFO -- : [255/881] 4057988=test_config I, [2024-04-19T20:48:45.419115 #4016665] INFO -- : [256/881] 4057987=test_gem_resolver_api_set I, [2024-04-19T20:48:45.894409 #4016665] INFO -- : [257/881] 4057987=test_gem_safe_marshal I, [2024-04-19T20:48:48.293371 #4016665] INFO -- : [258/881] 4057985=test_transcode I, [2024-04-19T20:48:48.615732 #4016665] INFO -- : [259/881] 4057988=json_generator_test I, [2024-04-19T20:48:49.203110 #4016665] INFO -- : [260/881] 4057988=test_eval I, [2024-04-19T20:48:49.828534 #4016665] INFO -- : [261/881] 4057985=test_x509store I, [2024-04-19T20:48:50.747909 #4016665] INFO -- : [262/881] 4057987=test_rdoc_code_object I, [2024-04-19T20:48:50.976517 #4016665] INFO -- : [263/881] 4057988=test_fips I, [2024-04-19T20:48:52.741539 #4016665] INFO -- : [264/881] 4057985=test_x509name I, [2024-04-19T20:48:52.811103 #4016665] INFO -- : [265/881] 4057985=test_update I, [2024-04-19T20:48:52.860292 #4016665] INFO -- : [266/881] 4057985=test_jaro_winkler I, [2024-04-19T20:48:52.882840 #4016665] INFO -- : [267/881] 4057985=test_random_formatter I, [2024-04-19T20:48:52.984420 #4016665] INFO -- : [268/881] 4057985=test_helper I, [2024-04-19T20:48:53.015841 #4016665] INFO -- : [269/881] 4057985=test_lambda I, [2024-04-19T20:48:53.407894 #4016665] INFO -- : [270/881] 4057987=test_ast I, [2024-04-19T20:48:53.502507 #4016665] INFO -- : [271/881] 4057985=test_gem_request_set_gem_dependency_api I, [2024-04-19T20:48:53.689849 #4016665] INFO -- : [272/881] 4057988=test_webauthn_listener I, [2024-04-19T20:48:54.063373 #4016665] INFO -- : Leaked file descriptor: WebauthnListenerTest#test_wait_for_otp_code_get_follows_options: 11 : # I, [2024-04-19T20:48:54.125994 #4016665] INFO -- : COMMAND PID USER FD TYPE DEVICE SIZE/OFF NODE NAME I, [2024-04-19T20:48:54.126281 #4016665] INFO -- : ruby 4057988 sipeed 11u IPv4 2070542 0t0 TCP localhost:32991->localhost:56062 (CLOSE_WAIT) I, [2024-04-19T20:48:54.258303 #4016665] INFO -- : [273/881] 4057988=test_numhash I, [2024-04-19T20:48:54.280986 #4016665] INFO -- : [274/881] 4057988=test_weakkeymap I, [2024-04-19T20:48:55.183174 #4016665] INFO -- : [275/881] 4057985=test_gem_commands_push_command I, [2024-04-19T20:48:55.912351 #4016665] INFO -- : [276/881] 4057988=test_pkey_rsa I, [2024-04-19T20:48:57.478122 #4016665] INFO -- : [277/881] 4057985=test_gem_platform I, [2024-04-19T20:48:58.131168 #4016665] INFO -- : [278/881] 4057985=test_rdoc_markup_hard_break I, [2024-04-19T20:48:58.162040 #4016665] INFO -- : [279/881] 4057985=test_date_strptime I, [2024-04-19T20:48:58.636476 #4016665] INFO -- : [280/881] 4057988=test_gem_package_task I, [2024-04-19T20:48:58.681491 #4016665] INFO -- : [281/881] 4057988=test_placearg I, [2024-04-19T20:48:59.020903 #4016665] INFO -- : [282/881] 4057985=test_win32ole_method I, [2024-04-19T20:48:59.062118 #4016665] INFO -- : [283/881] 4057985=test_delete I, [2024-04-19T20:48:59.165537 #4016665] INFO -- : [284/881] 4057985=test_keyword I, [2024-04-19T20:48:59.463916 #4016665] INFO -- : [285/881] 4057988=test_class_name_check I, [2024-04-19T20:48:59.699675 #4016665] INFO -- : [286/881] 4057988=test_continuation I, [2024-04-19T20:48:59.706373 #4016665] INFO -- : [287/881] 4057988=test_fd_setsize I, [2024-04-19T20:48:59.713011 #4016665] INFO -- : [288/881] 4057988=test_files_test I, [2024-04-19T20:48:59.733084 #4016665] INFO -- : [289/881] 4057988=test_gem_update_suggestion I, [2024-04-19T20:49:00.187808 #4016665] INFO -- : [290/881] 4057988=test_file_exhaustive I, [2024-04-19T20:49:02.904365 #4016665] INFO -- : [291/881] 4057985=test_logger I, [2024-04-19T20:49:03.011558 #4016665] INFO -- : [292/881] 4057985=test_gem_resolver_lock_set I, [2024-04-19T20:49:03.182774 #4016665] INFO -- : [293/881] 4057985=test_not I, [2024-04-19T20:49:03.214958 #4016665] INFO -- : [294/881] 4057985=test_import I, [2024-04-19T20:49:08.275231 #4016665] INFO -- : [295/881] 4057985=test_rdoc_parser_markdown I, [2024-04-19T20:49:08.328320 #4016665] INFO -- : [296/881] 4057985=test_object I, [2024-04-19T20:49:08.356995 #4016665] INFO -- : [297/881] 4057985=test_cgi_header I, [2024-04-19T20:49:08.439052 #4016665] INFO -- : [298/881] 4057985=heredoc_dedent_test I, [2024-04-19T20:49:08.489140 #4016665] INFO -- : [299/881] 4057985=version_test I, [2024-04-19T20:49:08.560946 #4016665] INFO -- : [300/881] 4057985=test_gem_command_manager I, [2024-04-19T20:49:09.644483 #4016665] INFO -- : [301/881] 4057985=test_gem_gemcutter_utilities I, [2024-04-19T20:49:10.996299 #4016665] INFO -- : [302/881] 4057985=test_basicinstructions I, [2024-04-19T20:49:11.466130 #4016665] INFO -- : [303/881] 4057985=test_key_actor_emacs I, [2024-04-19T20:49:12.366375 #4016665] INFO -- : [304/881] 4057985=test_arithmetic_sequence I, [2024-04-19T20:49:12.435450 #4016665] INFO -- : [305/881] 4057985=test_normalize I, [2024-04-19T20:49:12.741414 #4016665] INFO -- : [306/881] 4057985=test_ossl I, [2024-04-19T20:49:18.985173 #4016665] INFO -- : [307/881] 4057988=test_timeout I, [2024-04-19T20:49:19.016848 #4016665] INFO -- : [308/881] 4057988=compiler_test I, [2024-04-19T20:49:19.045335 #4016665] INFO -- : [309/881] 4057988=test_flip I, [2024-04-19T20:49:19.264409 #4016665] INFO -- : [310/881] 4057988=test_change_word I, [2024-04-19T20:49:19.311663 #4016665] INFO -- : [311/881] 4057988=test_sleep I, [2024-04-19T20:49:24.325672 #4016665] INFO -- : [312/881] 4057988=test_gem_local_remote_options I, [2024-04-19T20:49:24.723769 #4016665] INFO -- : [313/881] 4057988=test_date_arith I, [2024-04-19T20:49:24.857770 #4016665] INFO -- : [314/881] 4057988=test_object I, [2024-04-19T20:49:27.535165 #4016665] INFO -- : [315/881] 4057988=test_ruby_lex I, [2024-04-19T20:49:28.631797 #4016665] INFO -- : [316/881] 4057988=test_big5 I, [2024-04-19T20:49:28.650064 #4016665] INFO -- : [317/881] 4057988=test_func I, [2024-04-19T20:49:31.090955 #4016665] INFO -- : [318/881] 4057985=test_pointer I, [2024-04-19T20:49:34.447089 #4016665] INFO -- : [319/881] 4057985=test_type I, [2024-04-19T20:49:34.495020 #4016665] INFO -- : [320/881] 4057985=test_ractor I, [2024-04-19T20:49:34.953065 #4016665] INFO -- : [321/881] 4057985=test_tsort I, [2024-04-19T20:49:35.003281 #4016665] INFO -- : [322/881] 4057985=test_signedness I, [2024-04-19T20:49:38.815293 #4016665] INFO -- : [323/881] 4057988=test_rdoc_rd_block_parser I, [2024-04-19T20:49:39.053718 #4016665] INFO -- : [324/881] 4057988=test_time_tz I, [2024-04-19T20:49:39.532577 #4016665] INFO -- : [325/881] 4057988=test_win32ole_event I, [2024-04-19T20:49:39.569893 #4016665] INFO -- : [326/881] 4057988=test_rdoc_generator_json_index I, [2024-04-19T20:49:39.704571 #4016665] INFO -- : [327/881] 4057988=test_trace I, [2024-04-19T20:49:40.231773 #4016665] INFO -- : [328/881] 4057988=ractor_test I, [2024-04-19T20:49:40.314265 #4016665] INFO -- : [329/881] 4057988=test_stringio I, [2024-04-19T20:49:40.967589 #4016665] INFO -- : [330/881] 4057988=test_arity I, [2024-04-19T20:49:40.993818 #4016665] INFO -- : [331/881] 4057988=test_io_wait_uncommon I, [2024-04-19T20:49:41.045162 #4016665] INFO -- : [332/881] 4057988=test_win32ole_variable I, [2024-04-19T20:49:41.200056 #4016665] INFO -- : [333/881] 4057988=test_rdoc_class_module I, [2024-04-19T20:49:45.265736 #4016665] INFO -- : [334/881] 4057988=test_bignum I, [2024-04-19T20:49:46.031107 #4016665] INFO -- : [335/881] 4057988=test_gem_ci_detector I, [2024-04-19T20:49:46.051532 #4016665] INFO -- : [336/881] 4057988=test_threadgroup I, [2024-04-19T20:49:47.162667 #4016665] INFO -- : [337/881] 4057988=test_enum I, [2024-04-19T20:49:52.640991 #4016665] INFO -- : [338/881] 4057988=test_gem_specification I, [2024-04-19T20:49:53.160193 #4016665] INFO -- : [339/881] 4057985=test_gem_package I, [2024-04-19T20:49:56.793813 #4016665] INFO -- : [340/881] 4057986=test_complex2 I, [2024-04-19T20:49:56.874152 #4016665] INFO -- : [341/881] 4057986=test_resolve_symbol I, [2024-04-19T20:49:57.304825 #4016665] INFO -- : [342/881] 4057986=test_have_macro I, [2024-04-19T20:49:57.926130 #4016665] INFO -- : [343/881] 4057985=test_merge_keys I, [2024-04-19T20:49:58.024236 #4016665] INFO -- : [344/881] 4057985=test_rdoc_extend I, [2024-04-19T20:49:58.253795 #4016665] INFO -- : [345/881] 4057985=test_mixed_unicode_escapes I, [2024-04-19T20:49:58.303732 #4016665] INFO -- : [346/881] 4057985=test_history I, [2024-04-19T20:49:58.391530 #4016665] INFO -- : [347/881] 4057985=test_rdoc_markup_to_ansi I, [2024-04-19T20:49:58.761605 #4016665] INFO -- : [348/881] 4057985=test_ipaddr I, [2024-04-19T20:49:58.922598 #4016665] INFO -- : [349/881] 4057985=test_win32ole_variant I, [2024-04-19T20:49:59.009612 #4016665] INFO -- : [350/881] 4057985=test_gem_resolver_api_specification I, [2024-04-19T20:49:59.438696 #4016665] INFO -- : [351/881] 4057985=test_cgi_multipart I, [2024-04-19T20:49:59.935265 #4016665] INFO -- : [352/881] 4057985=test_gem_commands_cleanup_command I, [2024-04-19T20:50:01.117816 #4016665] INFO -- : [353/881] 4057986=test_word I, [2024-04-19T20:50:01.134327 #4016665] INFO -- : [354/881] 4057986=test_member I, [2024-04-19T20:50:01.171293 #4016665] INFO -- : [355/881] 4057986=test_numeric I, [2024-04-19T20:50:01.208258 #4016665] INFO -- : [356/881] 4057986=test_gem_console_ui I, [2024-04-19T20:50:01.244439 #4016665] INFO -- : [357/881] 4057986=test_date_ractor I, [2024-04-19T20:50:02.940480 #4016665] INFO -- : [358/881] 4057986=test_dir I, [2024-04-19T20:50:03.942546 #4016665] INFO -- : [359/881] 4057985=format_errors_test I, [2024-04-19T20:50:03.952661 #4016665] INFO -- : [360/881] 4057985=test_autoconf I, [2024-04-19T20:50:04.006416 #4016665] INFO -- : [361/881] 4057985=test_eval I, [2024-04-19T20:50:04.168532 #4016665] INFO -- : [362/881] 4057985=test_ractor_compatibility I, [2024-04-19T20:50:04.735010 #4016665] INFO -- : [363/881] 4057986=test_mailto I, [2024-04-19T20:50:04.908685 #4016665] INFO -- : [364/881] 4057986=location_test I, [2024-04-19T20:50:05.237463 #4016665] INFO -- : [365/881] 4057986=test_symbol I, [2024-04-19T20:50:05.291605 #4016665] INFO -- : [366/881] 4057986=test_coderange I, [2024-04-19T20:50:05.409790 #4016665] INFO -- : [367/881] 4057986=test_http_request I, [2024-04-19T20:50:05.584833 #4016665] INFO -- : [368/881] 4057986=json_generic_object_test I, [2024-04-19T20:50:05.683513 #4016665] INFO -- : [369/881] 4057986=test_gem_source_fetch_problem I, [2024-04-19T20:50:05.753081 #4016665] INFO -- : [370/881] 4057986=test_rdoc_comment I, [2024-04-19T20:50:05.977070 #4016665] INFO -- : [371/881] 4057986=test_error_highlight I, [2024-04-19T20:50:06.888712 #4016665] INFO -- : [372/881] 4057985=test_resize I, [2024-04-19T20:50:06.931408 #4016665] INFO -- : [373/881] 4057985=test_rdoc_generator_darkfish I, [2024-04-19T20:50:09.145289 #4016665] INFO -- : [374/881] 4057985=test_function_entry I, [2024-04-19T20:50:09.151749 #4016665] INFO -- : [375/881] 4057985=test_arith_seq_beg_len_step I, [2024-04-19T20:50:09.196080 #4016665] INFO -- : [376/881] 4057988=test_gem_resolver_requirement_list I, [2024-04-19T20:50:09.223856 #4016665] INFO -- : [377/881] 4057988=test_pkcs7 I, [2024-04-19T20:50:09.590358 #4016665] INFO -- : [378/881] 4057985=test_enc_associate I, [2024-04-19T20:50:10.105751 #4016665] INFO -- : [379/881] 4057986=test_lazy_enumerator I, [2024-04-19T20:50:10.887813 #4016665] INFO -- : [380/881] 4057988=test_unix I, [2024-04-19T20:50:11.049999 #4016665] INFO -- : [381/881] 4057988=test_gem_commands_pristine_command I, [2024-04-19T20:50:12.840653 #4016665] INFO -- : [382/881] 4057986=test_context I, [2024-04-19T20:50:13.283444 #4016665] INFO -- : [383/881] 4057985=test_nofree I, [2024-04-19T20:50:13.292211 #4016665] INFO -- : [384/881] 4057985=test_coder I, [2024-04-19T20:50:13.414192 #4016665] INFO -- : [385/881] 4057985=test_symbol I, [2024-04-19T20:50:13.951639 #4016665] INFO -- : [386/881] 4057986=test_find_executable I, [2024-04-19T20:50:13.972859 #4016665] INFO -- : [387/881] 4057986=ruby_api_test I, [2024-04-19T20:50:15.337126 #4016665] INFO -- : [388/881] 4057986=test_rubygems I, [2024-04-19T20:50:16.462223 #4016665] INFO -- : [389/881] 4057986=test_call I, [2024-04-19T20:50:17.529717 #4016665] INFO -- : [390/881] 4057986=test_https_proxy I, [2024-04-19T20:50:17.564551 #4016665] INFO -- : [391/881] 4057986=test_integer I, [2024-04-19T20:50:20.484700 #4016665] INFO -- : [392/881] 4057988=test_cgi_modruby I, [2024-04-19T20:50:21.163164 #4016665] INFO -- : [393/881] 4057988=test_rubyoptions I, [2024-04-19T20:50:31.235622 #4016665] INFO -- : [394/881] 4057985=test_super I, [2024-04-19T20:50:36.034603 #4016665] INFO -- : [395/881] 4057985=test_gem_resolver_git_specification I, [2024-04-19T20:50:37.755659 #4016665] INFO -- : [396/881] 4057985=test_usrmarshal I, [2024-04-19T20:50:38.654315 #4016665] INFO -- : [397/881] 4057986=test_object_references I, [2024-04-19T20:50:38.708140 #4016665] INFO -- : [398/881] 4057986=test_capacity I, [2024-04-19T20:50:38.796406 #4016665] INFO -- : [399/881] 4057986=test_nextafter I, [2024-04-19T20:50:39.280943 #4016665] INFO -- : [400/881] 4057985=test_have_func I, [2024-04-19T20:50:39.634065 #4016665] INFO -- : [401/881] 4057986=test_gem_request_set_lockfile_tokenizer I, [2024-04-19T20:50:40.032339 #4016665] INFO -- : [402/881] 4057986=test_stat I, [2024-04-19T20:50:40.059794 #4016665] INFO -- : [403/881] 4057986=test_integer I, [2024-04-19T20:50:40.518176 #4016665] INFO -- : [404/881] 4057986=desugar_compiler_test I, [2024-04-19T20:50:40.560502 #4016665] INFO -- : [405/881] 4057986=test_dryrun I, [2024-04-19T20:50:40.778714 #4016665] INFO -- : [406/881] 4057986=test_rdoc_attr I, [2024-04-19T20:50:40.830108 #4016665] INFO -- : [407/881] 4057986=test_env I, [2024-04-19T20:50:58.667224 #4016665] INFO -- : [408/881] 4057988=test_gem_commands_setup_command I, [2024-04-19T20:51:06.421863 #4016665] INFO -- : [409/881] 4057988=test_parser I, [2024-04-19T20:51:06.679033 #4016665] INFO -- : [410/881] 4057988=test_cgi_core I, [2024-04-19T20:51:06.935114 #4016665] INFO -- : [411/881] 4057988=test_ractor I, [2024-04-19T20:51:06.985875 #4016665] INFO -- : [412/881] 4057988=test_dns I, [2024-04-19T20:51:08.974069 #4016665] INFO -- : [413/881] 4057988=test_gem_commands_open_command I, [2024-04-19T20:51:10.059802 #4016665] INFO -- : [414/881] 4057988=test_gem I, [2024-04-19T20:51:16.000092 #4016665] INFO -- : [415/881] 4057986=test_gem_source_lock I, [2024-04-19T20:51:16.895155 #4016665] INFO -- : [416/881] 4057986=parse_stream_test I, [2024-04-19T20:51:17.019193 #4016665] INFO -- : [417/881] 4057986=test_ractor I, [2024-04-19T20:51:22.462337 #4016665] INFO -- : [418/881] 4057986=test_rendering I, [2024-04-19T20:51:22.717819 #4016665] INFO -- : [419/881] 4057986=test_debugger_integration I, [2024-04-19T20:51:22.732545 #4016665] INFO -- : [420/881] 4057986=test_my_integer I, [2024-04-19T20:51:22.780575 #4016665] INFO -- : [421/881] 4057986=test_thread I, [2024-04-19T20:51:27.376145 #4016665] INFO -- : [422/881] 4057988=json_ext_parser_test I, [2024-04-19T20:51:28.052933 #4016665] INFO -- : [423/881] 4057988=test_ssl I, [2024-04-19T20:51:31.286153 #4016665] INFO -- : [424/881] 4057988=test_singleton_function I, [2024-04-19T20:51:31.310237 #4016665] INFO -- : [425/881] 4057988=test_ancdata I, [2024-04-19T20:51:31.356926 #4016665] INFO -- : [426/881] 4057988=test_reline_key I, [2024-04-19T20:51:31.402415 #4016665] INFO -- : [427/881] 4057988=test_rb_str_dup I, [2024-04-19T20:51:31.454180 #4016665] INFO -- : [428/881] 4057988=test_weakref I, [2024-04-19T20:51:32.700591 #4016665] INFO -- : [429/881] 4057988=test_nonblock I, [2024-04-19T20:51:32.839481 #4016665] INFO -- : [430/881] 4057988=test_marshal I, [2024-04-19T20:51:35.873488 #4016665] INFO -- : [431/881] 4057985=test_unicode_normalize I, [2024-04-19T20:51:37.017572 #4016665] INFO -- : [432/881] 4057988=test_timeout I, [2024-04-19T20:51:38.913988 #4016665] INFO -- : [433/881] 4057988=test_alias I, [2024-04-19T20:51:39.957411 #4016665] INFO -- : [434/881] 4057986=test_rdoc_cross_reference I, [2024-04-19T20:51:40.157951 #4016665] INFO -- : [435/881] 4057988=test_gem_commands_info_command I, [2024-04-19T20:51:40.311100 #4016665] INFO -- : [436/881] 4057988=test_gem_dependency_installer I, [2024-04-19T20:51:43.387445 #4016665] INFO -- : [437/881] 4057986=test_scalar I, [2024-04-19T20:51:43.419076 #4016665] INFO -- : [438/881] 4057986=test_case_options I, [2024-04-19T20:51:43.457004 #4016665] INFO -- : [439/881] 4057986=test_store I, [2024-04-19T20:51:44.763187 #4016665] INFO -- : [440/881] 4057986=test_exception I, [2024-04-19T20:51:55.634021 #4016665] INFO -- : [441/881] 4057988=test_bug_reporter I, [2024-04-19T20:51:56.224124 #4016665] INFO -- : [442/881] 4057988=test_gem_package_tar_reader_entry I, [2024-04-19T20:51:57.987166 #4016665] INFO -- : [443/881] 4057988=test_gem_name_tuple I, [2024-04-19T20:51:58.144008 #4016665] INFO -- : [444/881] 4057988=test_rand I, [2024-04-19T20:51:59.331884 #4016665] INFO -- : [445/881] 4057986=test_gem_commands_mirror I, [2024-04-19T20:51:59.407477 #4016665] INFO -- : [446/881] 4057986=test_gem_ext_cargo_builder_link_flag_converter I, [2024-04-19T20:51:59.774236 #4016665] INFO -- : [447/881] 4057986=test_method_cache I, [2024-04-19T20:51:59.846543 #4016665] INFO -- : [448/881] 4057986=test_gem_request I, [2024-04-19T20:52:00.169277 #4016665] INFO -- : [449/881] 4057988=test_sprintf_comb I, [2024-04-19T20:52:01.228630 #4016665] INFO -- : [450/881] 4057988=test_win32ole I, [2024-04-19T20:52:01.283552 #4016665] INFO -- : [451/881] 4057988=test_generic I, [2024-04-19T20:52:01.483660 #4016665] INFO -- : [452/881] 4057988=test_scan_args I, [2024-04-19T20:52:01.548417 #4016665] INFO -- : [453/881] 4057988=test_enumerator_kw I, [2024-04-19T20:52:01.572203 #4016665] INFO -- : [454/881] 4057988=test_settracefunc I, [2024-04-19T20:52:02.353567 #4016665] INFO -- : [455/881] 4057986=test_gem_text I, [2024-04-19T20:52:02.827338 #4016665] INFO -- : [456/881] 4057986=test_case I, [2024-04-19T20:52:02.883200 #4016665] INFO -- : [457/881] 4057986=test_pkey I, [2024-04-19T20:52:03.215009 #4016665] INFO -- : [458/881] 4057985=test_parser_events I, [2024-04-19T20:52:03.254857 #4016665] INFO -- : [459/881] 4057986=test_reline I, [2024-04-19T20:52:03.844651 #4016665] INFO -- : [460/881] 4057985=test_cclass I, [2024-04-19T20:52:04.197838 #4016665] INFO -- : [461/881] 4057985=test_grapheme_breaks I, [2024-04-19T20:52:04.366131 #4016665] INFO -- : [462/881] 4057985=test_gem_version_option I, [2024-04-19T20:52:04.438689 #4016665] INFO -- : [463/881] 4057986=test_gem_request_connection_pools I, [2024-04-19T20:52:04.961111 #4016665] INFO -- : [464/881] 4057985=test_memory_view I, [2024-04-19T20:52:05.816545 #4016665] INFO -- : [465/881] 4057986=test_m17n_comb I, [2024-04-19T20:52:06.908935 #4016665] INFO -- : [466/881] 4057985=test_ractor I, [2024-04-19T20:52:07.009063 #4016665] INFO -- : [467/881] 4057985=test_ansi_with_terminfo I, [2024-04-19T20:52:07.034092 #4016665] INFO -- : [468/881] 4057985=test_rdoc_generator_pot_po I, [2024-04-19T20:52:07.082694 #4016665] INFO -- : [469/881] 4057985=test_rdoc_markup_to_markdown I, [2024-04-19T20:52:07.325513 #4016665] INFO -- : [470/881] 4057985=test_json_tree I, [2024-04-19T20:52:07.365381 #4016665] INFO -- : [471/881] 4057985=test_ractor I, [2024-04-19T20:52:07.490873 #4016665] INFO -- : [472/881] 4057985=test_severity I, [2024-04-19T20:52:07.513079 #4016665] INFO -- : [473/881] 4057985=test_gem_install_update_options I, [2024-04-19T20:52:08.516827 #4016665] INFO -- : [474/881] 4057985=parse_test I, [2024-04-19T20:52:08.697482 #4016665] INFO -- : [475/881] 4057988=test_require_lib I, [2024-04-19T20:52:27.812539 #4016665] INFO -- : [476/881] 4057985=test_rdoc_generator_ri I, [2024-04-19T20:52:27.902745 #4016665] INFO -- : [477/881] 4057985=test_extlibs I, [2024-04-19T20:52:28.611999 #4016665] INFO -- : [478/881] 4057986=test_gem_stream_ui I, [2024-04-19T20:52:29.288558 #4016665] INFO -- : [479/881] 4057986=test_literal I, [2024-04-19T20:52:32.794962 #4016665] INFO -- : [480/881] 4057988=test_dot_dot I, [2024-04-19T20:52:32.907742 #4016665] INFO -- : [481/881] 4057988=test_c_struct_builder I, [2024-04-19T20:52:33.670091 #4016665] INFO -- : [482/881] 4057988=test_str2big I, [2024-04-19T20:52:33.715695 #4016665] INFO -- : [483/881] 4057988=test_rdoc_markup_to_table_of_contents I, [2024-04-19T20:52:33.911093 #4016665] INFO -- : [484/881] 4057988=test_objectspace I, [2024-04-19T20:52:34.375909 #4016665] INFO -- : [485/881] 4057986=test_thread I, [2024-04-19T20:52:34.547428 #4016665] INFO -- : [486/881] 4057986=test_socket I, [2024-04-19T20:52:37.797380 #4016665] INFO -- : [487/881] 4057988=test_securerandom I, [2024-04-19T20:52:38.012684 #4016665] INFO -- : [488/881] 4057988=test_logperiod I, [2024-04-19T20:52:38.089103 #4016665] INFO -- : [489/881] 4057988=test_rdoc_markdown_test I, [2024-04-19T20:52:40.687908 #4016665] INFO -- : [490/881] 4057985=test_rdoc_normal_module I, [2024-04-19T20:52:41.256787 #4016665] INFO -- : [491/881] 4057985=test_c_union_entity I, [2024-04-19T20:52:41.797386 #4016665] INFO -- : [492/881] 4057985=test_singleton I, [2024-04-19T20:52:41.864608 #4016665] INFO -- : [493/881] 4057985=test_flush I, [2024-04-19T20:52:42.336975 #4016665] INFO -- : [494/881] 4057985=test_io_console I, [2024-04-19T20:52:43.495115 #4016665] INFO -- : [495/881] 4057986=test_switch_hitter I, [2024-04-19T20:52:43.608974 #4016665] INFO -- : [496/881] 4057986=newline_test I, [2024-04-19T20:52:44.086890 #4016665] INFO -- : [497/881] 4057986=test_uncorrectable_name_check I, [2024-04-19T20:52:44.142763 #4016665] INFO -- : [498/881] 4057986=test_stringchar I, [2024-04-19T20:52:44.720196 #4016665] INFO -- : [499/881] 4057986=test_hash_create I, [2024-04-19T20:52:44.721487 #4016665] INFO -- : [500/881] 4057986=test_passing_block I, [2024-04-19T20:52:44.779582 #4016665] INFO -- : [501/881] 4057986=test_thread_fd_close I, [2024-04-19T20:52:44.788724 #4016665] INFO -- : [502/881] 4057986=test_last_thread I, [2024-04-19T20:52:45.935465 #4016665] INFO -- : [503/881] 4057988=test_process I, [2024-04-19T20:52:46.115311 #4016665] INFO -- : [504/881] 4057985=test_pack I, [2024-04-19T20:52:46.426184 #4016665] INFO -- : [505/881] 4057986=test_gem_security_policy I, [2024-04-19T20:52:47.534781 #4016665] INFO -- : [506/881] 4057985=test_gem_source_local I, [2024-04-19T20:52:48.443900 #4016665] INFO -- : [507/881] 4057986=test_arity I, [2024-04-19T20:52:48.481664 #4016665] INFO -- : [508/881] 4057986=test_gem_ext_rake_builder I, [2024-04-19T20:52:49.353223 #4016665] INFO -- : [509/881] 4057985=test_logdevice I, [2024-04-19T20:52:54.239579 #4016665] INFO -- : [510/881] 4057986=test_gem_resolver_lock_specification I, [2024-04-19T20:52:54.533591 #4016665] INFO -- : [511/881] 4057986=test_err_in_callback I, [2024-04-19T20:52:54.620691 #4016665] INFO -- : [512/881] 4057986=test_x509cert I, [2024-04-19T20:52:55.035534 #4016665] INFO -- : [513/881] 4057985=test_gc I, [2024-04-19T20:52:57.172319 #4016665] INFO -- : [514/881] 4057986=test_http I, [2024-04-19T20:52:57.242925 #4016665] INFO -- : [515/881] 4057986=test_gem_commands_which_command I, [2024-04-19T20:52:57.434586 #4016665] INFO -- : [516/881] 4057986=test_shift_jis I, [2024-04-19T20:52:57.468264 #4016665] INFO -- : [517/881] 4057986=test_flags I, [2024-04-19T20:53:04.992536 #4016665] INFO -- : [518/881] 4057986=test_inadvertent_creation I, [2024-04-19T20:53:05.865433 #4016665] INFO -- : [519/881] 4057986=test_enumerator I, [2024-04-19T20:53:51.195773 #4016665] INFO -- : [520/881] 4057985=test_gem_commands_specification_command I, [2024-04-19T20:53:52.118594 #4016665] INFO -- : [521/881] 4057985=test_gem_commands_dependency_command I, [2024-04-19T20:53:52.874543 #4016665] INFO -- : [522/881] 4057985=test_gem_resolver I, [2024-04-19T20:53:54.923280 #4016665] INFO -- : [523/881] 4057985=test_gem_resolver_composed_set I, [2024-04-19T20:53:55.072372 #4016665] INFO -- : [524/881] 4057985=test_safe_load I, [2024-04-19T20:53:55.831978 #4016665] INFO -- : [525/881] 4057985=test_name_error I, [2024-04-19T20:53:55.878767 #4016665] INFO -- : [526/881] 4057985=test_rdoc_markup_attribute_manager I, [2024-04-19T20:53:56.464096 #4016665] INFO -- : [527/881] 4057985=test_open-uri I, [2024-04-19T20:53:57.969238 #4016665] INFO -- : [528/881] 4057985=test_httpresponse I, [2024-04-19T20:53:58.230552 #4016665] INFO -- : [529/881] 4057985=test_rdoc_parser_ruby I, [2024-04-19T20:54:05.403811 #4016665] INFO -- : [530/881] 4057985=test_rdoc_context I, [2024-04-19T20:54:11.491206 #4016665] INFO -- : [531/881] 4057985=test_nil2vtempty I, [2024-04-19T20:54:11.533049 #4016665] INFO -- : [532/881] 4057985=test_stream I, [2024-04-19T20:54:11.698238 #4016665] INFO -- : [533/881] 4057985=test_tcp I, [2024-04-19T20:54:11.932000 #4016665] INFO -- : [534/881] 4057985=test_iso_8859 I, [2024-04-19T20:54:12.365320 #4016665] INFO -- : [535/881] 4057985=test_rdoc_text I, [2024-04-19T20:54:12.819063 #4016665] INFO -- : [536/881] 4057985=test_syntax I, [2024-04-19T20:54:30.257283 #4016665] INFO -- : [537/881] 4057986=test_gem_safe_yaml I, [2024-04-19T20:54:30.293077 #4016665] INFO -- : [538/881] 4057986=test_require I, [2024-04-19T20:54:30.313440 #4016665] INFO -- : [539/881] 4057986=test_rdoc_markup_to_joined_paragraph I, [2024-04-19T20:54:30.342788 #4016665] INFO -- : [540/881] 4057986=test_date_time I, [2024-04-19T20:54:30.458759 #4016665] INFO -- : [541/881] 4057986=index_write_test I, [2024-04-19T20:54:30.496696 #4016665] INFO -- : [542/881] 4057986=test_date_new I, [2024-04-19T20:54:30.575073 #4016665] INFO -- : [543/881] 4057986=test_data I, [2024-04-19T20:54:30.636803 #4016665] INFO -- : [544/881] 4057986=test_bug-5832 I, [2024-04-19T20:54:31.279311 #4016665] INFO -- : [545/881] 4057986=test_files_ext I, [2024-04-19T20:54:31.303394 #4016665] INFO -- : [546/881] 4057986=test_emitter I, [2024-04-19T20:54:31.375681 #4016665] INFO -- : [547/881] 4057986=test_gem_silent_ui I, [2024-04-19T20:54:31.616075 #4016665] INFO -- : [548/881] 4057986=test_kdf I, [2024-04-19T20:54:32.187431 #4016665] INFO -- : [549/881] 4057986=test_gem_doctor I, [2024-04-19T20:54:32.664010 #4016665] INFO -- : [550/881] 4057986=test_kernel I, [2024-04-19T20:54:36.577022 #4016665] INFO -- : [551/881] 4057986=test_eval_history I, [2024-04-19T20:54:36.664206 #4016665] INFO -- : [552/881] 4057986=dispatcher_test I, [2024-04-19T20:54:36.714442 #4016665] INFO -- : [553/881] 4057986=!Nothing_to_test I, [2024-04-19T20:54:36.739719 #4016665] INFO -- : [554/881] 4057986=test_enc_raise I, [2024-04-19T20:54:36.780402 #4016665] INFO -- : [555/881] 4057986=test_psych I, [2024-04-19T20:54:36.910299 #4016665] INFO -- : [556/881] 4057986=test_rdoc_markup_paragraph I, [2024-04-19T20:54:36.941394 #4016665] INFO -- : [557/881] 4057986=test_object_create_start I, [2024-04-19T20:54:36.985304 #4016665] INFO -- : [558/881] 4057986=test_gem_ext_cargo_builder_unit I, [2024-04-19T20:54:37.118111 #4016665] INFO -- : [559/881] 4057986=test_date I, [2024-04-19T20:54:37.232282 #4016665] INFO -- : [560/881] 4057986=test_gem_rdoc I, [2024-04-19T20:54:38.010345 #4016665] INFO -- : [561/881] 4057986=test_command I, [2024-04-19T20:54:39.816218 #4016665] INFO -- : [562/881] 4057986=test_at_exit I, [2024-04-19T20:54:39.959831 #4016665] INFO -- : [563/881] 4057986=test_hmac I, [2024-04-19T20:54:40.008668 #4016665] INFO -- : [564/881] 4057986=test_rdoc_markup_to_tt_only I, [2024-04-19T20:54:40.388634 #4016665] INFO -- : [565/881] 4057986=test_rdoc_tom_doc I, [2024-04-19T20:54:40.525041 #4016665] INFO -- : [566/881] 4057986=test_numeric I, [2024-04-19T20:54:40.697034 #4016665] INFO -- : [567/881] 4057988=test_gem_commands_lock_command I, [2024-04-19T20:54:40.829733 #4016665] INFO -- : [568/881] 4057988=test_ifunless I, [2024-04-19T20:54:40.917921 #4016665] INFO -- : [569/881] 4057988=test_assignment I, [2024-04-19T20:54:41.065301 #4016665] INFO -- : [570/881] 4057986=test_key_actor_vi I, [2024-04-19T20:54:41.881799 #4016665] INFO -- : [571/881] 4057986=test_bug-3571 I, [2024-04-19T20:54:41.939497 #4016665] INFO -- : [572/881] 4057986=test_gem_command I, [2024-04-19T20:54:42.729895 #4016665] INFO -- : [573/881] 4057986=test_gem_spec_fetcher I, [2024-04-19T20:54:43.877065 #4016665] INFO -- : [574/881] 4057986=test_common I, [2024-04-19T20:54:45.569896 #4016665] INFO -- : [575/881] 4057986=test_rdoc_token_stream I, [2024-04-19T20:54:45.636041 #4016665] INFO -- : [576/881] 4057986=test_address_resolve I, [2024-04-19T20:54:45.699988 #4016665] INFO -- : [577/881] 4057986=test_config I, [2024-04-19T20:54:45.957697 #4016665] INFO -- : [578/881] 4057986=test_gem_source_list I, [2024-04-19T20:54:46.405259 #4016665] INFO -- : [579/881] 4057986=test_yaml_special_cases I, [2024-04-19T20:54:46.483988 #4016665] INFO -- : [580/881] 4057986=test_optarg I, [2024-04-19T20:54:46.824682 #4016665] INFO -- : [581/881] 4057987=test_nil I, [2024-04-19T20:54:46.851935 #4016665] INFO -- : [582/881] 4057987=test_num2int I, [2024-04-19T20:54:46.962645 #4016665] INFO -- : [583/881] 4057987=test_rdoc_single_class I, [2024-04-19T20:54:46.999563 #4016665] INFO -- : [584/881] 4057987=test_verbose I, [2024-04-19T20:54:47.313082 #4016665] INFO -- : [585/881] 4057987=test_gem_ext_configure_builder I, [2024-04-19T20:54:47.436166 #4016665] INFO -- : [586/881] 4057987=test_frozen I, [2024-04-19T20:54:47.479055 #4016665] INFO -- : [587/881] 4057987=test_pp I, [2024-04-19T20:54:47.517838 #4016665] INFO -- : [588/881] 4057986=test_macro I, [2024-04-19T20:54:47.527202 #4016665] INFO -- : [589/881] 4057986=test_iter_break I, [2024-04-19T20:54:47.549651 #4016665] INFO -- : [590/881] 4057986=test_zsh_completion I, [2024-04-19T20:54:47.578537 #4016665] INFO -- : [591/881] 4057986=test_exception I, [2024-04-19T20:54:47.643030 #4016665] INFO -- : [592/881] 4057986=test_egrep_cpp I, [2024-04-19T20:54:47.946464 #4016665] INFO -- : [593/881] 4057987=test_cgi_tag_helper I, [2024-04-19T20:54:48.033752 #4016665] INFO -- : [594/881] 4057987=test_zlib I, [2024-04-19T20:54:48.616265 #4016665] INFO -- : [595/881] 4057986=test_date_conv I, [2024-04-19T20:54:49.104687 #4016665] INFO -- : [596/881] 4057986=test_optimization I, [2024-04-19T20:54:56.534352 #4016665] INFO -- : [597/881] 4057988=test_erb_m17n I, [2024-04-19T20:54:56.591332 #4016665] INFO -- : [598/881] 4057988=test_ole_methods I, [2024-04-19T20:54:56.993822 #4016665] INFO -- : [599/881] 4057988=test_gc_compact I, [2024-04-19T20:55:06.026148 #4016665] INFO -- : [600/881] 4057985=test_proc I, [2024-04-19T20:55:06.355705 #4016665] INFO -- : [601/881] 4057987=test_string I, [2024-04-19T20:55:14.942243 #4016665] INFO -- : [602/881] 4057985=test_gem_package_old I, [2024-04-19T20:55:15.638157 #4016665] INFO -- : [603/881] 4057985=test_gem_resolver_index_set I, [2024-04-19T20:55:15.936121 #4016665] INFO -- : [604/881] 4057985=test_gem_validator I, [2024-04-19T20:55:16.048918 #4016665] INFO -- : [605/881] 4057985=test_require_path_check I, [2024-04-19T20:55:17.023388 #4016665] INFO -- : [606/881] 4057988=test_rdoc_markup_parser I, [2024-04-19T20:55:17.028946 #4016665] INFO -- : [607/881] 4057985=test_folderitem2_invokeverb I, [2024-04-19T20:55:17.049749 #4016665] INFO -- : [608/881] 4057985=test_files_test_2 I, [2024-04-19T20:55:17.416477 #4016665] INFO -- : [609/881] 4057988=test_fnmatch I, [2024-04-19T20:55:17.788856 #4016665] INFO -- : [610/881] 4057988=test_rdoc_stats I, [2024-04-19T20:55:18.088110 #4016665] INFO -- : [611/881] 4057988=test_pattern_matching I, [2024-04-19T20:55:18.207860 #4016665] INFO -- : [612/881] 4057988=test_string I, [2024-04-19T20:55:18.519154 #4016665] INFO -- : [613/881] 4057988=test_rdoc_store I, [2024-04-19T20:55:24.171088 #4016665] INFO -- : [614/881] 4057988=test_raise I, [2024-04-19T20:55:24.220593 #4016665] INFO -- : [615/881] 4057988=test_x509attr I, [2024-04-19T20:55:24.321400 #4016665] INFO -- : [616/881] 4057988=test_gem_request_set_lockfile_parser I, [2024-04-19T20:55:25.290510 #4016665] INFO -- : [617/881] 4057988=test_depth_first I, [2024-04-19T20:55:25.397327 #4016665] INFO -- : [618/881] 4057988=json_addition_test I, [2024-04-19T20:55:25.490245 #4016665] INFO -- : [619/881] 4057988=test_gem_dependency_resolution_error I, [2024-04-19T20:55:25.532184 #4016665] INFO -- : [620/881] 4057988=test_rdoc_parser I, [2024-04-19T20:55:25.681365 #4016665] INFO -- : [621/881] 4057988=test_qsort I, [2024-04-19T20:55:25.719304 #4016665] INFO -- : [622/881] 4057988=test_mul I, [2024-04-19T20:55:25.802786 #4016665] INFO -- : [623/881] 4057988=test_win32ole_type I, [2024-04-19T20:55:25.830378 #4016665] INFO -- : [624/881] 4057988=test_null I, [2024-04-19T20:55:26.151643 #4016665] INFO -- : [625/881] 4057988=test_default_gems I, [2024-04-19T20:55:26.296052 #4016665] INFO -- : [626/881] 4057988=test_rdoc_rd_inline_parser I, [2024-04-19T20:55:26.516142 #4016665] INFO -- : [627/881] 4057988=test_rdoc_markup_to_rdoc I, [2024-04-19T20:55:26.787803 #4016665] INFO -- : [628/881] 4057988=test_rdoc_markup_attributes I, [2024-04-19T20:55:26.863286 #4016665] INFO -- : [629/881] 4057988=test_date_parse I, [2024-04-19T20:55:27.747976 #4016665] INFO -- : [630/881] 4057988=test_trick I, [2024-04-19T20:55:40.797421 #4016665] INFO -- : [631/881] 4057986=test_thread I, [2024-04-19T20:55:40.801214 #4016665] INFO -- : [632/881] 4057986=test_pipe I, [2024-04-19T20:55:41.536381 #4016665] INFO -- : [633/881] 4057988=test_pkey_ec I, [2024-04-19T20:55:41.852240 #4016665] INFO -- : [634/881] 4057986=test_io_buffer I, [2024-04-19T20:55:42.233650 #4016665] INFO -- : [635/881] 4057986=test_defined I, [2024-04-19T20:55:42.304280 #4016665] INFO -- : [636/881] 4057988=test_backtrace I, [2024-04-19T20:55:42.369626 #4016665] INFO -- : [637/881] 4057988=test_key_name_check I, [2024-04-19T20:55:42.403870 #4016665] INFO -- : [638/881] 4057988=test_rdoc_i18n_text I, [2024-04-19T20:55:42.444726 #4016665] INFO -- : [639/881] 4057988=test_windows_1251 I, [2024-04-19T20:55:42.538159 #4016665] INFO -- : [640/881] 4057988=test_time I, [2024-04-19T20:55:42.924059 #4016665] INFO -- : [641/881] 4057986=test_rdoc_rdoc I, [2024-04-19T20:55:43.389295 #4016665] INFO -- : [642/881] 4057988=test_gem_uninstaller I, [2024-04-19T20:55:43.412812 #4016665] INFO -- : [643/881] 4057986=test_gb18030 I, [2024-04-19T20:55:43.457748 #4016665] INFO -- : [644/881] 4057986=test_svcb_https I, [2024-04-19T20:55:43.515835 #4016665] INFO -- : [645/881] 4057986=test_buffering I, [2024-04-19T20:55:43.625826 #4016665] INFO -- : [646/881] 4057986=test_pkcs12 I, [2024-04-19T20:55:44.888309 #4016665] INFO -- : [647/881] 4057985=test_system I, [2024-04-19T20:55:48.197795 #4016665] INFO -- : [648/881] 4057986=test_pkey_dh I, [2024-04-19T20:55:48.696845 #4016665] INFO -- : [649/881] 4057986=test_bigzero I, [2024-04-19T20:55:48.772206 #4016665] INFO -- : [650/881] 4057986=test_gem_util I, [2024-04-19T20:55:50.123888 #4016665] INFO -- : [651/881] 4057986=test_iseq_load I, [2024-04-19T20:55:51.134585 #4016665] INFO -- : [652/881] 4057988=test_gem_package_tar_header I, [2024-04-19T20:55:51.683028 #4016665] INFO -- : [653/881] 4057988=test_ripper I, [2024-04-19T20:55:52.971265 #4016665] INFO -- : [654/881] 4057985=test_gem_config_file I, [2024-04-19T20:55:54.468342 #4016665] INFO -- : [655/881] 4057988=test_gem_resolver_activation_request I, [2024-04-19T20:55:54.513241 #4016665] INFO -- : [656/881] 4057985=test_getopts I, [2024-04-19T20:55:54.562160 #4016665] INFO -- : [657/881] 4057985=test_protocol I, [2024-04-19T20:55:54.619530 #4016665] INFO -- : [658/881] 4057988=test_yjit_exit_locations I, [2024-04-19T20:55:54.699082 #4016665] INFO -- : [659/881] 4057988=test_etc I, [2024-04-19T20:55:54.978052 #4016665] INFO -- : [660/881] 4057985=test_yaml_tree I, [2024-04-19T20:55:55.204322 #4016665] INFO -- : [661/881] 4057985=test_math I, [2024-04-19T20:55:55.293166 #4016665] INFO -- : [662/881] 4057985=test_gem_commands_fetch_command I, [2024-04-19T20:55:55.351321 #4016665] INFO -- : [663/881] 4057988=test_gc I, [2024-04-19T20:55:55.385208 #4016665] INFO -- : [664/881] 4057988=test_libs I, [2024-04-19T20:55:55.473607 #4016665] INFO -- : [665/881] 4057988=test_config I, [2024-04-19T20:55:55.983356 #4016665] INFO -- : [666/881] 4057988=test_sleep I, [2024-04-19T20:55:56.584736 #4016665] INFO -- : [667/881] 4057985=test_utf16 I, [2024-04-19T20:55:57.164845 #4016665] INFO -- : [668/881] 4057985=test_autoload I, [2024-04-19T20:55:57.485140 #4016665] INFO -- : [669/881] 4057986=test_unicode_escape I, [2024-04-19T20:55:58.058574 #4016665] INFO -- : [670/881] 4057988=test_io I, [2024-04-19T20:55:58.102160 #4016665] INFO -- : [671/881] 4057986=test_face I, [2024-04-19T20:55:58.282594 #4016665] INFO -- : [672/881] 4057986=test_sizeof I, [2024-04-19T20:56:17.342027 #4016665] INFO -- : [673/881] 4057985=test_case I, [2024-04-19T20:56:17.514574 #4016665] INFO -- : [674/881] 4057985=test_rendering I, [2024-04-19T20:56:17.543183 #4016665] INFO -- : [675/881] 4057985=ruby_parser_test I, [2024-04-19T20:56:17.602365 #4016665] INFO -- : [676/881] 4057985=test_backtrace I, [2024-04-19T20:56:21.186544 #4016665] INFO -- : [677/881] 4057985=test_pack I, [2024-04-19T20:56:21.235957 #4016665] INFO -- : [678/881] 4057985=test_io_buffer I, [2024-04-19T20:56:21.413618 #4016665] INFO -- : [679/881] 4057985=test_rdoc_task I, [2024-04-19T20:56:21.498810 #4016665] INFO -- : [680/881] 4057985=test_gem_resolver_conflict I, [2024-04-19T20:56:21.618385 #4016665] INFO -- : [681/881] 4057985=test_rdoc_markup_indented_paragraph I, [2024-04-19T20:56:21.769449 #4016665] INFO -- : [682/881] 4057985=locals_test I, [2024-04-19T20:56:24.949172 #4016665] INFO -- : [683/881] 4057985=test_rdoc_require I, [2024-04-19T20:56:24.996472 #4016665] INFO -- : [684/881] 4057985=test_clone I, [2024-04-19T20:56:25.873109 #4016665] INFO -- : [685/881] 4057986=test_gem_commands_install_command I, [2024-04-19T20:56:26.446163 #4016665] INFO -- : [686/881] 4057985=test_readpartial I, [2024-04-19T20:56:27.035638 #4016665] INFO -- : [687/881] 4057985=test_fstring I, [2024-04-19T20:56:27.948729 #4016665] INFO -- : [688/881] 4057985=test_optparse I, [2024-04-19T20:56:27.987047 #4016665] INFO -- : [689/881] 4057985=test_array I, [2024-04-19T20:56:28.061601 #4016665] INFO -- : [690/881] 4057985=test_rdoc_markup_raw I, [2024-04-19T20:56:28.147413 #4016665] INFO -- : [691/881] 4057985=test_webauthn_poller I, [2024-04-19T20:56:28.600894 #4016665] INFO -- : [692/881] 4057985=test_rat I, [2024-04-19T20:56:28.723056 #4016665] INFO -- : [693/881] 4057985=test_gem_resolver_best_set I, [2024-04-19T20:56:29.245843 #4016665] INFO -- : [694/881] 4057985=encoding_test I, [2024-04-19T20:56:30.089103 #4016665] INFO -- : [695/881] 4057985=test_typeddata I, [2024-04-19T20:56:32.856183 #4016665] INFO -- : [696/881] 4057985=test_rdoc_markup_to_html_crossref I, [2024-04-19T20:56:35.630988 #4016665] INFO -- : [697/881] 4057985=test_files_sample I, [2024-04-19T20:56:35.729945 #4016665] INFO -- : [698/881] 4057985=test_stringscanner I, [2024-04-19T20:56:36.042936 #4016665] INFO -- : [699/881] 4057985=test_convertible I, [2024-04-19T20:56:36.130230 #4016665] INFO -- : [700/881] 4057987=parser_test I, [2024-04-19T20:56:36.184721 #4016665] INFO -- : [701/881] 4057987=test_yield I, [2024-04-19T20:56:37.161601 #4016665] INFO -- : [702/881] 4057986=test_rdoc_alias I, [2024-04-19T20:56:37.190672 #4016665] INFO -- : [703/881] 4057986=test_undef I, [2024-04-19T20:56:37.457926 #4016665] INFO -- : [704/881] 4057986=ripper_test I, [2024-04-19T20:56:41.688526 #4016665] INFO -- : [705/881] 4057986=test_objspace I, [2024-04-19T20:56:46.115731 #4016665] INFO -- : [706/881] 4057988=test_line_editor I, [2024-04-19T20:56:46.218617 #4016665] INFO -- : [707/881] 4057988=test_gem_security_trust_dir I, [2024-04-19T20:56:46.656262 #4016665] INFO -- : [708/881] 4057988=comments_test I, [2024-04-19T20:56:46.764081 #4016665] INFO -- : [709/881] 4057988=test_gem_requirement I, [2024-04-19T20:56:48.334981 #4016665] INFO -- : [710/881] 4057988=test_sprintf I, [2024-04-19T20:56:50.659854 #4016665] INFO -- : [711/881] 4057988=test_string_memory I, [2024-04-19T20:56:51.156960 #4016665] INFO -- : [712/881] 4057988=test_set I, [2024-04-19T20:56:51.268113 #4016665] INFO -- : [713/881] 4057988=test_show_source I, [2024-04-19T20:56:51.333087 #4016665] INFO -- : [714/881] 4057988=test_remote_fetch_error I, [2024-04-19T20:56:52.397891 #4016665] INFO -- : [715/881] 4057988=test_have_library I, [2024-04-19T20:56:59.673122 #4016665] INFO -- : [716/881] 4057988=test_lock_native_thread I, [2024-04-19T20:57:01.206965 #4016665] INFO -- : [717/881] 4057988=test_c_struct_entry I, [2024-04-19T20:57:03.850705 #4016665] INFO -- : [718/881] 4057988=test_gem_commands_stale_command I, [2024-04-19T20:57:04.340078 #4016665] INFO -- : [719/881] 4057988=test_postponed_job I, [2024-04-19T20:57:05.923742 #4016665] INFO -- : [720/881] 4057987=test_alias_and_anchor I, [2024-04-19T20:57:05.967328 #4016665] INFO -- : [721/881] 4057987=test_external_new I, [2024-04-19T20:57:06.026305 #4016665] INFO -- : [722/881] 4057987=test_gem_resolver_dependency_request I, [2024-04-19T20:57:06.240952 #4016665] INFO -- : [723/881] 4057987=test_tree_builder I, [2024-04-19T20:57:06.291516 #4016665] INFO -- : [724/881] 4057987=test_hash I, [2024-04-19T20:57:06.412392 #4016665] INFO -- : [725/881] 4057987=test_protect I, [2024-04-19T20:57:06.455049 #4016665] INFO -- : [726/881] 4057987=test_win32ole_typelib I, [2024-04-19T20:57:06.581308 #4016665] INFO -- : [727/881] 4057987=test_gem_request_set_lockfile I, [2024-04-19T20:57:06.752875 #4016665] INFO -- : [728/881] 4057988=test_raise_exception I, [2024-04-19T20:57:09.005635 #4016665] INFO -- : [729/881] 4057987=test_yjit I, [2024-04-19T20:57:09.035860 #4016665] INFO -- : [730/881] 4057987=test_workspace I, [2024-04-19T20:57:10.094627 #4016665] INFO -- : [731/881] 4057987=test_weakmap I, [2024-04-19T20:57:12.158563 #4016665] INFO -- : [732/881] 4057988=test_gem_commands_environment_command I, [2024-04-19T20:57:12.769877 #4016665] INFO -- : [733/881] 4057988=test_m17n I, [2024-04-19T20:57:13.302789 #4016665] INFO -- : [734/881] 4057988=test_ws I, [2024-04-19T20:57:14.007816 #4016665] INFO -- : [735/881] 4057988=test_argf I, [2024-04-19T20:57:16.238864 #4016665] INFO -- : [736/881] 4057985=test_kill_ring I, [2024-04-19T20:57:16.269096 #4016665] INFO -- : [737/881] 4057985=test_framework I, [2024-04-19T20:57:16.455276 #4016665] INFO -- : [738/881] 4057985=test_ns_spki I, [2024-04-19T20:57:16.509996 #4016665] INFO -- : [739/881] 4057985=test_summary I, [2024-04-19T20:57:16.970544 #4016665] INFO -- : [740/881] 4057985=test_console_attr I, [2024-04-19T20:57:17.022879 #4016665] INFO -- : [741/881] 4057985=test_type_completor I, [2024-04-19T20:57:17.123011 #4016665] INFO -- : [742/881] 4057985=warnings_test I, [2024-04-19T20:57:17.277146 #4016665] INFO -- : [743/881] 4057985=test_kwargs I, [2024-04-19T20:57:17.332888 #4016665] INFO -- : [744/881] 4057985=test_io_wait I, [2024-04-19T20:57:17.732455 #4016665] INFO -- : [745/881] 4057985=test_gem_commands_exec_command I, [2024-04-19T20:57:26.326198 #4016665] INFO -- : [746/881] 4057985=test_date_attr I, [2024-04-19T20:57:26.376717 #4016665] INFO -- : [747/881] 4057985=test_ellipsize I, [2024-04-19T20:57:26.475326 #4016665] INFO -- : [748/881] 4057985=test_io I, [2024-04-19T20:57:27.318305 #4016665] INFO -- : [749/881] 4057985=test_hash I, [2024-04-19T20:57:39.641874 #4016665] INFO -- : [750/881] 4057987=test_ubf_async_safe I, [2024-04-19T20:57:39.985008 #4016665] INFO -- : [751/881] 4057987=test_sorted_set I, [2024-04-19T20:57:41.542110 #4016665] INFO -- : [752/881] 4057987=test_emoji I, [2024-04-19T20:57:41.823657 #4016665] INFO -- : [753/881] 4057987=test_win32ole_type_event I, [2024-04-19T20:57:41.843491 #4016665] INFO -- : [754/881] 4057987=test_win32ole_record I, [2024-04-19T20:57:41.899927 #4016665] INFO -- : [755/881] 4057987=test_gem_unsatisfiable_dependency_error I, [2024-04-19T20:57:42.131394 #4016665] INFO -- : [756/881] 4057987=test_gem_commands_uninstall_command I, [2024-04-19T20:57:46.067465 #4016665] INFO -- : [757/881] 4057988=test_condition I, [2024-04-19T20:57:46.139957 #4016665] INFO -- : [758/881] 4057988=test_gem_source_specific_file I, [2024-04-19T20:57:46.825208 #4016665] INFO -- : [759/881] 4057988=test_foreach I, [2024-04-19T20:57:46.837676 #4016665] INFO -- : [760/881] 4057988=test_cp949 I, [2024-04-19T20:57:46.884860 #4016665] INFO -- : [761/881] 4057988=test_rdoc_rubygems_hook I, [2024-04-19T20:57:47.629165 #4016665] INFO -- : [762/881] 4057988=test_gem_commands_query_command I, [2024-04-19T20:57:48.347834 #4016665] INFO -- : [763/881] 4057987=test_method I, [2024-04-19T20:57:52.037881 #4016665] INFO -- : [764/881] 4057988=test_pack I, [2024-04-19T20:57:54.177777 #4016665] INFO -- : [765/881] 4057988=test_array_create I, [2024-04-19T20:57:54.261258 #4016665] INFO -- : [766/881] 4057988=test_gem_impossible_dependencies_error I, [2024-04-19T20:57:54.293888 #4016665] INFO -- : [767/881] 4057988=test_pattern_key_name_check I, [2024-04-19T20:57:54.338929 #4016665] INFO -- : [768/881] 4057988=test_to_ruby I, [2024-04-19T20:57:54.488588 #4016665] INFO -- : [769/881] 4057988=test_ftp I, [2024-04-19T20:57:54.538103 #4016665] INFO -- : [770/881] 4057988=test_euc_kr I, [2024-04-19T20:57:54.580961 #4016665] INFO -- : [771/881] 4057988=test_rdoc_context_section I, [2024-04-19T20:57:54.866106 #4016665] INFO -- : [772/881] 4057988=test_gem_installer I, [2024-04-19T20:57:56.818211 #4016665] INFO -- : [773/881] 4057985=test_yamlstore I, [2024-04-19T20:57:56.921190 #4016665] INFO -- : [774/881] 4057985=test_rdoc_parser_rd I, [2024-04-19T20:57:57.103613 #4016665] INFO -- : [775/881] 4057985=test_date_strftime I, [2024-04-19T20:58:01.392740 #4016665] INFO -- : [776/881] 4057985=test_irb I, [2024-04-19T20:58:04.236257 #4016665] INFO -- : [777/881] 4057985=test_random I, [2024-04-19T20:58:04.275868 #4016665] INFO -- : [778/881] 4057985=test_asn1 I, [2024-04-19T20:58:04.523530 #4016665] INFO -- : [779/881] 4057985=test_class I, [2024-04-19T20:58:22.352333 #4016665] INFO -- : [780/881] 4057987=test_rdoc_normal_class I, [2024-04-19T20:58:22.685227 #4016665] INFO -- : [781/881] 4057987=test_const I, [2024-04-19T20:58:22.726193 #4016665] INFO -- : [782/881] 4057987=json_string_matching_test I, [2024-04-19T20:58:22.760553 #4016665] INFO -- : [783/881] 4057987=test_load I, [2024-04-19T20:58:22.850756 #4016665] INFO -- : [784/881] 4057987=parse_comments_test I, [2024-04-19T20:58:22.889146 #4016665] INFO -- : [785/881] 4057987=test_noarg I, [2024-04-19T20:58:23.883674 #4016665] INFO -- : [786/881] 4057987=test_tempfile I, [2024-04-19T20:58:25.369791 #4016665] INFO -- : [787/881] 4057987=test_function I, [2024-04-19T20:58:25.805739 #4016665] INFO -- : [788/881] 4057987=test_queue I, [2024-04-19T20:58:25.883165 #4016665] INFO -- : [789/881] 4057987=test_gem_resolver_index_specification I, [2024-04-19T20:58:26.172335 #4016665] INFO -- : [790/881] 4057987=test_internal_ivar I, [2024-04-19T20:58:26.222088 #4016665] INFO -- : [791/881] 4057985=test_rdoc_markup I, [2024-04-19T20:58:26.309173 #4016665] INFO -- : [792/881] 4057987=test_gem_commands_help_command I, [2024-04-19T20:58:26.532240 #4016665] INFO -- : [793/881] 4057985=test_tracepoint I, [2024-04-19T20:58:26.857475 #4016665] INFO -- : [794/881] 4057987=test_prettyprint I, [2024-04-19T20:58:27.027651 #4016665] INFO -- : [795/881] 4057987=test_utf32 I, [2024-04-19T20:58:27.081743 #4016665] INFO -- : [796/881] 4057987=test_basicsocket I, [2024-04-19T20:58:27.170856 #4016665] INFO -- : [797/881] 4057987=test_duplicate I, [2024-04-19T20:58:27.640018 #4016665] INFO -- : [798/881] 4057987=test_too_many_dummy_encodings I, [2024-04-19T20:58:28.107035 #4016665] INFO -- : [799/881] 4057987=test_stack I, [2024-04-19T20:58:29.013744 #4016665] INFO -- : [800/881] 4057985=test_gem_commands_list_command I, [2024-04-19T20:58:29.091321 #4016665] INFO -- : [801/881] 4057985=test_reqarg I, [2024-04-19T20:58:31.484544 #4016665] INFO -- : [802/881] 4057985=test_rdoc_include I, [2024-04-19T20:58:31.693292 #4016665] INFO -- : [803/881] 4057985=test_emitter I, [2024-04-19T20:58:31.758943 #4016665] INFO -- : [804/881] 4057985=test_resource I, [2024-04-19T20:58:31.939732 #4016665] INFO -- : [805/881] 4057985=test_gem_commands_signin_command I, [2024-04-19T20:58:32.850303 #4016665] INFO -- : [806/881] 4057985=test_ldap I, [2024-04-19T20:58:32.921534 #4016665] INFO -- : [807/881] 4057985=test_fileutils I, [2024-04-19T20:58:34.078697 #4016665] INFO -- : [808/881] 4057988=test_string_processing I, [2024-04-19T20:58:34.097281 #4016665] INFO -- : [809/881] 4057988=test_rdoc_options I, [2024-04-19T20:58:34.916384 #4016665] INFO -- : [810/881] 4057985=test_econv I, [2024-04-19T20:58:35.724848 #4016665] INFO -- : [811/881] 4057987=test_cesu8 I, [2024-04-19T20:58:35.772478 #4016665] INFO -- : [812/881] 4057987=test_gem_version I, [2024-04-19T20:58:36.214086 #4016665] INFO -- : [813/881] 4057988=test_gem_resolver_specification I, [2024-04-19T20:58:36.463518 #4016665] INFO -- : [814/881] 4057988=test_gem_dependency I, [2024-04-19T20:58:36.779848 #4016665] INFO -- : [815/881] 4057987=test_path_to_class I, [2024-04-19T20:58:36.795607 #4016665] INFO -- : [816/881] 4057987=test_inlinecache I, [2024-04-19T20:58:37.257248 #4016665] INFO -- : [817/881] 4057987=test_rdoc_markup_verbatim I, [2024-04-19T20:58:37.309122 #4016665] INFO -- : [818/881] 4057987=test_gem_commands_search_command I, [2024-04-19T20:58:37.353484 #4016665] INFO -- : [819/881] 4057987=test_complex I, [2024-04-19T20:58:37.904246 #4016665] INFO -- : [820/881] 4057987=test_gem_ext_ext_conf_builder I, [2024-04-19T20:58:38.181948 #4016665] INFO -- : [821/881] 4057988=test_gem_stub_specification I, [2024-04-19T20:58:39.585447 #4016665] INFO -- : [822/881] 4057988=test_method_cache I, [2024-04-19T20:58:39.633627 #4016665] INFO -- : [823/881] 4057988=test_frozen_error I, [2024-04-19T20:58:39.687345 #4016665] INFO -- : [824/881] 4057988=test_gem_resolver_installed_specification I, [2024-04-19T20:58:39.935334 #4016665] INFO -- : [825/881] 4057988=test_scanner_events I, [2024-04-19T20:58:40.428538 #4016665] INFO -- : [826/881] 4057988=test_gem_remote_fetcher I, [2024-04-19T20:58:42.949824 #4016665] INFO -- : [827/881] 4057985=test_mdns I, [2024-04-19T20:58:43.099329 #4016665] INFO -- : [828/881] 4057985=test_parse I, [2024-04-19T20:58:47.088094 #4016665] INFO -- : [829/881] 4057985=test_wait I, [2024-04-19T20:58:47.671899 #4016665] INFO -- : [830/881] 4057987=test_handle I, [2024-04-19T20:58:47.761733 #4016665] INFO -- : [831/881] 4057985=test_yaml I, [2024-04-19T20:58:48.424735 #4016665] INFO -- : [832/881] 4057985=test_forwardable I, [2024-04-19T20:58:48.588623 #4016665] INFO -- : [833/881] 4057985=test_big2str I, [2024-04-19T20:58:48.667019 #4016665] INFO -- : [834/881] 4057985=test_ansi_without_terminfo I, [2024-04-19T20:58:48.717840 #4016665] INFO -- : [835/881] 4057985=test_gem_commands_sources_command I, [2024-04-19T20:58:50.287151 #4016665] INFO -- : [836/881] 4057985=test_bmethod I, [2024-04-19T20:58:50.314625 #4016665] INFO -- : [837/881] 4057987=test_euc_tw I, [2024-04-19T20:58:50.397234 #4016665] INFO -- : [838/881] 4057987=test_ractor I, [2024-04-19T20:58:50.411660 #4016665] INFO -- : [839/881] 4057985=test_rdoc_markup_formatter I, [2024-04-19T20:58:50.420296 #4016665] INFO -- : [840/881] 4057987=test_nowrite I, [2024-04-19T20:58:50.513138 #4016665] INFO -- : [841/881] 4057985=test_thread_queue I, [2024-04-19T20:58:50.610342 #4016665] INFO -- : [842/881] 4057987=test_rdoc_parser_c I, [2024-04-19T20:58:52.315364 #4016665] INFO -- : [843/881] 4057988=test_comparable I, [2024-04-19T20:58:52.342840 #4016665] INFO -- : [844/881] 4057987=test_shapes I, [2024-04-19T20:58:52.366298 #4016665] INFO -- : [845/881] 4057987=json_fixtures_test I, [2024-04-19T20:58:52.386386 #4016665] INFO -- : [846/881] 4057987=test_io_timeout I, [2024-04-19T20:58:52.424163 #4016665] INFO -- : [847/881] 4057988=test_profile_frames I, [2024-04-19T20:58:52.434501 #4016665] INFO -- : [848/881] 4057987=test_pstore I, [2024-04-19T20:58:52.749163 #4016665] INFO -- : [849/881] 4057987=test_cstr I, [2024-04-19T20:58:53.163823 #4016665] INFO -- : [850/881] 4057988=test_enc_str_buf_cat I, [2024-04-19T20:58:53.193280 #4016665] INFO -- : [851/881] 4057988=test_gbk I, [2024-04-19T20:58:53.262404 #4016665] INFO -- : [852/881] 4057988=test_class2name I, [2024-04-19T20:58:53.287319 #4016665] INFO -- : [853/881] 4057988=test_cgi_util I, [2024-04-19T20:58:55.862141 #4016665] INFO -- : [854/881] 4057988=test_require I, [2024-04-19T20:58:58.555403 #4016665] INFO -- : [855/881] 4057987=test_gem_ext_cmake_builder I, [2024-04-19T20:58:58.626036 #4016665] INFO -- : [856/881] 4057987=test_gem_commands_contents_command I, [2024-04-19T20:58:59.281262 #4016665] INFO -- : [857/881] 4057987=test_digest I, [2024-04-19T20:58:59.324894 #4016665] INFO -- : [858/881] 4057985=test_marshalable I, [2024-04-19T20:58:59.817989 #4016665] INFO -- : [859/881] 4057985=test_find I, [2024-04-19T20:59:00.054969 #4016665] INFO -- : [860/881] 4057985=test_ractor I, [2024-04-19T20:59:00.656759 #4016665] INFO -- : [861/881] 4057985=test_wss I, [2024-04-19T20:59:00.670365 #4016665] INFO -- : [862/881] 4057985=test_fiddle I, [2024-04-19T20:59:01.956016 #4016665] INFO -- : [863/881] 4057985=test_file I, [2024-04-19T20:59:02.011928 #4016665] INFO -- : [864/881] 4057985=test_rdoc_markdown I, [2024-04-19T20:59:02.987276 #4016665] INFO -- : [865/881] 4057987=test_gem_available_set I, [2024-04-19T20:59:03.943631 #4016665] INFO -- : [866/881] 4057987=test_rdoc_any_method I, [2024-04-19T20:59:04.037142 #4016665] INFO -- : [867/881] 4057985=test_modify_expand I, [2024-04-19T20:59:04.097617 #4016665] INFO -- : [868/881] 4057985=test_init I, [2024-04-19T20:59:05.632698 #4016665] INFO -- : [869/881] 4057988=test_complexrational I, [2024-04-19T20:59:05.703740 #4016665] INFO -- : [870/881] 4057988=test_pathname I, [2024-04-19T20:59:06.147457 #4016665] INFO -- : [871/881] 4057985=test_coverage I, [2024-04-19T20:59:07.214727 #4016665] INFO -- : [872/881] 4057987=test_rdoc_encoding I, [2024-04-19T20:59:07.280620 #4016665] INFO -- : [873/881] 4057988=regexp_test I, [2024-04-19T20:59:07.425827 #4016665] INFO -- : [874/881] 4057988=test_gem_package_tar_reader I, [2024-04-19T20:59:07.567970 #4016665] INFO -- : [875/881] 4057987=test_gem_source_vendor I, [2024-04-19T20:59:07.687463 #4016665] INFO -- : [876/881] 4057987=test_gem_commands_owner_command I, [2024-04-19T20:59:07.886671 #4016665] INFO -- : [877/881] 4057988=test_recorder I, [2024-04-19T20:59:07.912806 #4016665] INFO -- : [878/881] 4057988=test_formatter I, [2024-04-19T20:59:07.921589 #4016665] INFO -- : [879/881] 4057988=test_bash_completion I, [2024-04-19T20:59:07.972580 #4016665] INFO -- : [880/881] 4057988=test_deprecate I, [2024-04-19T20:59:08.425382 #4016665] INFO -- : [881/881] 4057988=test_rdoc_constant I, [2024-04-19T20:59:16.973678 #4016665] INFO -- : Finished tests in 840.270748s, 31.2852 tests/s, 11110.3035 assertions/s. E, [2024-04-19T20:59:16.974695 #4016665] ERROR -- : Children under /tmp/rubytest.20240419-4057982-y5g8n9: E, [2024-04-19T20:59:16.975052 #4016665] ERROR -- : drwx------ 2 40 2024-04-19 20:55:06 +0000 d20240419-4057987-7rxymr E, [2024-04-19T20:59:16.975204 #4016665] ERROR -- : drwx------ 4 80 2024-04-19 20:46:07 +0000 gem_rebuild20240419-4057985-js788p I, [2024-04-19T20:59:16.978686 #4016665] INFO -- : 26288 tests, 9335663 assertions, 0 failures, 0 errors, 290 skips I, [2024-04-19T20:59:16.978890 #4016665] INFO -- : I, [2024-04-19T20:59:16.978984 #4016665] INFO -- : ruby -v: ruby 3.4.0dev (2024-04-19T19:25:32Z master 23be6599a2) [riscv64-linux] I, [2024-04-19T20:59:16.988999 #4016665] INFO -- : $$$[end] "make yes-test-all TESTOPTS='--stderr-on-failure' TESTS='-j4'" exit with 0. I, [2024-04-19T20:59:16.989844 #4016665] INFO -- : $$$[beg] make yes-test-rubyspec MSPECOPT='--error-output stderr --debug -j' TESTS='-j4' I, [2024-04-19T20:59:17.830122 #4016665] INFO -- : BASERUBY = /usr/bin/ruby --disable=gems I, [2024-04-19T20:59:17.830331 #4016665] INFO -- : CC = gcc I, [2024-04-19T20:59:17.830449 #4016665] INFO -- : LD = ld I, [2024-04-19T20:59:17.830649 #4016665] INFO -- : LDSHARED = gcc -shared I, [2024-04-19T20:59:17.830788 #4016665] INFO -- : CFLAGS = -O3 -fno-fast-math -ggdb3 -Wall -Wextra -Wdeprecated-declarations -Wdiv-by-zero -Wduplicated-cond -Wimplicit-function-declaration -Wimplicit-int -Wpointer-arith -Wwrite-strings -Wold-style-definition -Wimplicit-fallthrough=0 -Wmissing-noreturn -Wno-cast-function-type -Wno-constant-logical-operand -Wno-long-long -Wno-missing-field-initializers -Wno-overlength-strings -Wno-packed-bitfield-compat -Wno-parentheses-equality -Wno-self-assign -Wno-tautological-compare -Wno-unused-parameter -Wno-unused-value -Wsuggest-attribute=format -Wsuggest-attribute=noreturn -Wunused-variable -Wmisleading-indentation -Wundef -fPIC I, [2024-04-19T20:59:17.830907 #4016665] INFO -- : XCFLAGS = -U_FORTIFY_SOURCE -D_FORTIFY_SOURCE=2 -fstack-protector-strong -fno-strict-overflow -fvisibility=hidden -fexcess-precision=standard -DRUBY_EXPORT -I. -I.ext/include/riscv64-linux -I/tmp/ruby/src/trunk/include -I/tmp/ruby/src/trunk -I/tmp/ruby/src/trunk/prism -I/tmp/ruby/src/trunk/enc/unicode/15.0.0 I, [2024-04-19T20:59:17.831017 #4016665] INFO -- : CPPFLAGS = I, [2024-04-19T20:59:17.831160 #4016665] INFO -- : DLDFLAGS = -Wl,--compress-debug-sections=zlib -Wl,-soname,libruby.so.3.4 -fstack-protector-strong I, [2024-04-19T20:59:17.831281 #4016665] INFO -- : SOLIBS = -lz -lrt -lrt -lgmp -ldl -lcrypt -lm -lpthread I, [2024-04-19T20:59:17.831382 #4016665] INFO -- : LANG = I, [2024-04-19T20:59:17.831474 #4016665] INFO -- : LC_ALL = I, [2024-04-19T20:59:17.831576 #4016665] INFO -- : LC_CTYPE = I, [2024-04-19T20:59:17.831672 #4016665] INFO -- : MFLAGS = I, [2024-04-19T20:59:17.831755 #4016665] INFO -- : RUSTC = rustc I, [2024-04-19T20:59:17.831842 #4016665] INFO -- : YJIT_RUSTC_ARGS = --crate-name=yjit --crate-type=staticlib --edition=2021 -g -C lto=thin -C opt-level=3 -C overflow-checks=on '--out-dir=/tmp/ruby/build/trunk/yjit/target/release/' /tmp/ruby/src/trunk/yjit/src/lib.rs I, [2024-04-19T20:59:17.833519 #4016665] INFO -- : gcc (Debian 13.2.0-4revyos1) 13.2.0 I, [2024-04-19T20:59:17.833680 #4016665] INFO -- : Copyright (C) 2023 Free Software Foundation, Inc. I, [2024-04-19T20:59:17.833770 #4016665] INFO -- : This is free software; see the source for copying conditions. There is NO I, [2024-04-19T20:59:17.833861 #4016665] INFO -- : warranty; not even for MERCHANTABILITY or FITNESS FOR A PARTICULAR PURPOSE. I, [2024-04-19T20:59:17.834011 #4016665] INFO -- : I, [2024-04-19T20:59:17.849565 #4016665] INFO -- : generating enc.mk I, [2024-04-19T20:59:19.320899 #4016665] INFO -- : generating encdb.h I, [2024-04-19T20:59:19.550766 #4016665] INFO -- : encdb.h unchanged I, [2024-04-19T20:59:19.556354 #4016665] INFO -- : making enc I, [2024-04-19T20:59:19.726810 #4016665] INFO -- : make[1]: Entering directory '/tmp/ruby/build/trunk' I, [2024-04-19T20:59:19.727009 #4016665] INFO -- : make[1]: Nothing to be done for 'enc'. I, [2024-04-19T20:59:19.727109 #4016665] INFO -- : make[1]: Leaving directory '/tmp/ruby/build/trunk' I, [2024-04-19T20:59:19.729591 #4016665] INFO -- : making srcs under enc I, [2024-04-19T20:59:20.025717 #4016665] INFO -- : make[1]: Entering directory '/tmp/ruby/build/trunk' I, [2024-04-19T20:59:20.025917 #4016665] INFO -- : make[1]: Nothing to be done for 'srcs'. I, [2024-04-19T20:59:20.026017 #4016665] INFO -- : make[1]: Leaving directory '/tmp/ruby/build/trunk' I, [2024-04-19T20:59:20.030742 #4016665] INFO -- : generating transdb.h I, [2024-04-19T20:59:21.285757 #4016665] INFO -- : transdb.h unchanged I, [2024-04-19T20:59:21.291363 #4016665] INFO -- : making trans I, [2024-04-19T20:59:21.633800 #4016665] INFO -- : make[1]: Entering directory '/tmp/ruby/build/trunk' I, [2024-04-19T20:59:21.633992 #4016665] INFO -- : make[1]: Nothing to be done for 'trans'. I, [2024-04-19T20:59:21.634080 #4016665] INFO -- : make[1]: Leaving directory '/tmp/ruby/build/trunk' I, [2024-04-19T20:59:21.636692 #4016665] INFO -- : making encs I, [2024-04-19T20:59:22.027542 #4016665] INFO -- : make[1]: Entering directory '/tmp/ruby/build/trunk' I, [2024-04-19T20:59:22.027837 #4016665] INFO -- : make[1]: Nothing to be done for 'encs'. I, [2024-04-19T20:59:22.032517 #4016665] INFO -- : make[1]: Leaving directory '/tmp/ruby/build/trunk' I, [2024-04-19T20:59:22.041141 #4016665] INFO -- : generating makefiles ext/configure-ext.mk I, [2024-04-19T20:59:22.246739 #4016665] INFO -- : ext/configure-ext.mk updated I, [2024-04-19T20:59:22.259986 #4016665] INFO -- : make[1]: Entering directory '/tmp/ruby/build/trunk' I, [2024-04-19T20:59:34.118938 #4016665] INFO -- : make[1]: Leaving directory '/tmp/ruby/build/trunk' I, [2024-04-19T20:59:34.121070 #4016665] INFO -- : generating makefile exts.mk I, [2024-04-19T20:59:34.448210 #4016665] INFO -- : exts.mk unchanged I, [2024-04-19T20:59:34.493824 #4016665] INFO -- : make[1]: Entering directory '/tmp/ruby/build/trunk' I, [2024-04-19T20:59:36.692837 #4016665] INFO -- : make[2]: Entering directory '/tmp/ruby/build/trunk/ext/coverage' I, [2024-04-19T20:59:36.718325 #4016665] INFO -- : make[2]: Leaving directory '/tmp/ruby/build/trunk/ext/coverage' I, [2024-04-19T20:59:36.767444 #4016665] INFO -- : make[2]: Entering directory '/tmp/ruby/build/trunk/ext/date' I, [2024-04-19T20:59:36.796399 #4016665] INFO -- : make[2]: Leaving directory '/tmp/ruby/build/trunk/ext/date' I, [2024-04-19T20:59:36.821093 #4016665] INFO -- : make[2]: Entering directory '/tmp/ruby/build/trunk/ext/digest' I, [2024-04-19T20:59:36.877877 #4016665] INFO -- : make[2]: Leaving directory '/tmp/ruby/build/trunk/ext/digest' I, [2024-04-19T20:59:37.045605 #4016665] INFO -- : make[2]: Entering directory '/tmp/ruby/build/trunk/ext/digest/sha2' I, [2024-04-19T20:59:37.072292 #4016665] INFO -- : make[2]: Leaving directory '/tmp/ruby/build/trunk/ext/digest/sha2' I, [2024-04-19T20:59:37.212045 #4016665] INFO -- : make[2]: Entering directory '/tmp/ruby/build/trunk/ext/fiddle' I, [2024-04-19T20:59:37.279833 #4016665] INFO -- : make[2]: Leaving directory '/tmp/ruby/build/trunk/ext/fiddle' I, [2024-04-19T20:59:37.320487 #4016665] INFO -- : make[2]: Entering directory '/tmp/ruby/build/trunk/ext/io/console' I, [2024-04-19T20:59:37.341822 #4016665] INFO -- : make[2]: Leaving directory '/tmp/ruby/build/trunk/ext/io/console' I, [2024-04-19T20:59:37.427220 #4016665] INFO -- : make[2]: Entering directory '/tmp/ruby/build/trunk/ext/json' I, [2024-04-19T20:59:37.497313 #4016665] INFO -- : make[2]: Leaving directory '/tmp/ruby/build/trunk/ext/json' I, [2024-04-19T20:59:37.591875 #4016665] INFO -- : make[2]: Entering directory '/tmp/ruby/build/trunk/ext/monitor' I, [2024-04-19T20:59:37.610590 #4016665] INFO -- : make[2]: Leaving directory '/tmp/ruby/build/trunk/ext/monitor' I, [2024-04-19T20:59:37.653756 #4016665] INFO -- : make[2]: Entering directory '/tmp/ruby/build/trunk/ext/objspace' I, [2024-04-19T20:59:37.684526 #4016665] INFO -- : make[2]: Leaving directory '/tmp/ruby/build/trunk/ext/objspace' I, [2024-04-19T20:59:37.808265 #4016665] INFO -- : make[2]: Entering directory '/tmp/ruby/build/trunk/ext/openssl' I, [2024-04-19T20:59:37.938388 #4016665] INFO -- : make[2]: Leaving directory '/tmp/ruby/build/trunk/ext/openssl' I, [2024-04-19T20:59:37.970260 #4016665] INFO -- : make[2]: Entering directory '/tmp/ruby/build/trunk/ext/pathname' I, [2024-04-19T20:59:38.001280 #4016665] INFO -- : make[2]: Leaving directory '/tmp/ruby/build/trunk/ext/pathname' I, [2024-04-19T20:59:38.047045 #4016665] INFO -- : make[2]: Entering directory '/tmp/ruby/build/trunk/ext/psych' I, [2024-04-19T20:59:38.208541 #4016665] INFO -- : make[2]: Leaving directory '/tmp/ruby/build/trunk/ext/psych' I, [2024-04-19T20:59:38.240448 #4016665] INFO -- : make[2]: Entering directory '/tmp/ruby/build/trunk/ext/pty' I, [2024-04-19T20:59:38.261049 #4016665] INFO -- : make[2]: Leaving directory '/tmp/ruby/build/trunk/ext/pty' I, [2024-04-19T20:59:38.367280 #4016665] INFO -- : make[2]: Entering directory '/tmp/ruby/build/trunk/ext/ripper' I, [2024-04-19T20:59:38.416897 #4016665] INFO -- : make[2]: Leaving directory '/tmp/ruby/build/trunk/ext/ripper' I, [2024-04-19T20:59:38.429735 #4016665] INFO -- : make[2]: Entering directory '/tmp/ruby/build/trunk/ext/rubyvm' I, [2024-04-19T20:59:38.444960 #4016665] INFO -- : make[2]: Leaving directory '/tmp/ruby/build/trunk/ext/rubyvm' I, [2024-04-19T20:59:38.533944 #4016665] INFO -- : make[2]: Entering directory '/tmp/ruby/build/trunk/ext/socket' I, [2024-04-19T20:59:38.594089 #4016665] INFO -- : make[2]: Leaving directory '/tmp/ruby/build/trunk/ext/socket' I, [2024-04-19T20:59:38.708716 #4016665] INFO -- : make[2]: Entering directory '/tmp/ruby/build/trunk/.bundle/gems/bigdecimal-3.1.7/ext/bigdecimal' I, [2024-04-19T20:59:38.864038 #4016665] INFO -- : make[2]: Leaving directory '/tmp/ruby/build/trunk/.bundle/gems/bigdecimal-3.1.7/ext/bigdecimal' I, [2024-04-19T20:59:38.892714 #4016665] INFO -- : make[2]: Entering directory '/tmp/ruby/build/trunk/.bundle/gems/debug-1.9.2/ext/debug' I, [2024-04-19T20:59:39.043984 #4016665] INFO -- : make[2]: Leaving directory '/tmp/ruby/build/trunk/.bundle/gems/debug-1.9.2/ext/debug' I, [2024-04-19T20:59:39.070286 #4016665] INFO -- : make[2]: Entering directory '/tmp/ruby/build/trunk/.bundle/gems/nkf-0.2.0/ext/nkf' I, [2024-04-19T20:59:39.226432 #4016665] INFO -- : make[2]: Leaving directory '/tmp/ruby/build/trunk/.bundle/gems/nkf-0.2.0/ext/nkf' I, [2024-04-19T20:59:39.243761 #4016665] INFO -- : make[2]: Entering directory '/tmp/ruby/build/trunk/.bundle/gems/racc-1.7.3/ext/racc/cparse' I, [2024-04-19T20:59:39.397148 #4016665] INFO -- : make[2]: Leaving directory '/tmp/ruby/build/trunk/.bundle/gems/racc-1.7.3/ext/racc/cparse' I, [2024-04-19T20:59:39.419256 #4016665] INFO -- : make[2]: Entering directory '/tmp/ruby/build/trunk/.bundle/gems/rbs-3.4.4/ext/rbs_extension' I, [2024-04-19T20:59:39.573761 #4016665] INFO -- : make[2]: Leaving directory '/tmp/ruby/build/trunk/.bundle/gems/rbs-3.4.4/ext/rbs_extension' I, [2024-04-19T20:59:39.592070 #4016665] INFO -- : make[2]: Entering directory '/tmp/ruby/build/trunk/.bundle/gems/syslog-0.1.2/ext/syslog' I, [2024-04-19T20:59:39.744957 #4016665] INFO -- : make[2]: Leaving directory '/tmp/ruby/build/trunk/.bundle/gems/syslog-0.1.2/ext/syslog' I, [2024-04-19T20:59:39.964237 #4016665] INFO -- : make[2]: Entering directory '/tmp/ruby/build/trunk' I, [2024-04-19T20:59:40.626653 #4016665] INFO -- : make[2]: 'ruby' is up to date. I, [2024-04-19T20:59:40.626875 #4016665] INFO -- : make[2]: Leaving directory '/tmp/ruby/build/trunk' I, [2024-04-19T20:59:40.629353 #4016665] INFO -- : make[1]: Leaving directory '/tmp/ruby/build/trunk' I, [2024-04-19T20:59:40.663404 #4016665] INFO -- : make[1]: Entering directory '/tmp/ruby/build/trunk' I, [2024-04-19T20:59:40.663679 #4016665] INFO -- : make[1]: Nothing to be done for 'note'. I, [2024-04-19T20:59:40.663877 #4016665] INFO -- : make[1]: Leaving directory '/tmp/ruby/build/trunk' E, [2024-04-19T20:59:41.272326 #4016665] ERROR -- : $ /tmp/ruby/build/trunk/miniruby -I/tmp/ruby/src/trunk/lib /tmp/ruby/src/trunk/tool/runruby.rb --archdir=/tmp/ruby/build/trunk --extout=.ext -- /tmp/ruby/src/trunk/spec/mspec/bin/mspec-run -B /tmp/ruby/src/trunk/spec/default.mspec --error-output stderr --debug -fy -o /tmp/rubytest.20240419-4093748-2etavb/1-mspec-multi-0 E, [2024-04-19T20:59:41.273402 #4016665] ERROR -- : $ /tmp/ruby/build/trunk/miniruby -I/tmp/ruby/src/trunk/lib /tmp/ruby/src/trunk/tool/runruby.rb --archdir=/tmp/ruby/build/trunk --extout=.ext -- /tmp/ruby/src/trunk/spec/mspec/bin/mspec-run -B /tmp/ruby/src/trunk/spec/default.mspec --error-output stderr --debug -fy -o /tmp/rubytest.20240419-4093748-2etavb/2-mspec-multi-1 E, [2024-04-19T20:59:41.274449 #4016665] ERROR -- : $ /tmp/ruby/build/trunk/miniruby -I/tmp/ruby/src/trunk/lib /tmp/ruby/src/trunk/tool/runruby.rb --archdir=/tmp/ruby/build/trunk --extout=.ext -- /tmp/ruby/src/trunk/spec/mspec/bin/mspec-run -B /tmp/ruby/src/trunk/spec/default.mspec --error-output stderr --debug -fy -o /tmp/rubytest.20240419-4093748-2etavb/3-mspec-multi-2 E, [2024-04-19T20:59:41.275641 #4016665] ERROR -- : $ /tmp/ruby/build/trunk/miniruby -I/tmp/ruby/src/trunk/lib /tmp/ruby/src/trunk/tool/runruby.rb --archdir=/tmp/ruby/build/trunk --extout=.ext -- /tmp/ruby/src/trunk/spec/mspec/bin/mspec-run -B /tmp/ruby/src/trunk/spec/default.mspec --error-output stderr --debug -fy -o /tmp/rubytest.20240419-4093748-2etavb/4-mspec-multi-3 I, [2024-04-19T20:59:42.243140 #4016665] INFO -- : ruby 3.4.0dev (2024-04-19T19:25:32Z master 23be6599a2) [riscv64-linux] I, [2024-04-19T21:00:13.064793 #4016665] INFO -- : 0 ......................................................................... I, [2024-04-19T21:00:23.452324 #4016665] INFO -- : 73 ......................................................................... I, [2024-04-19T21:00:24.853062 #4016665] INFO -- : 146 ......................................................................... I, [2024-04-19T21:00:26.780112 #4016665] INFO -- : 219 ......................................................................... I, [2024-04-19T21:00:27.476290 #4016665] INFO -- : 292 ......................................................................... I, [2024-04-19T21:00:28.559238 #4016665] INFO -- : 365 ......................................................................... I, [2024-04-19T21:00:29.258912 #4016665] INFO -- : 438 ......................................................................... I, [2024-04-19T21:00:29.598419 #4016665] INFO -- : 511 ......................................................................... I, [2024-04-19T21:00:29.946824 #4016665] INFO -- : 584 ......................................................................... I, [2024-04-19T21:00:32.875195 #4016665] INFO -- : 657 ......................................................................... I, [2024-04-19T21:00:33.402107 #4016665] INFO -- : 730 ......................................................................... I, [2024-04-19T21:00:33.682832 #4016665] INFO -- : 803 ......................................................................... I, [2024-04-19T21:00:34.762382 #4016665] INFO -- : 876 ......................................................................... I, [2024-04-19T21:00:35.374037 #4016665] INFO -- : 949 ......................................................................... I, [2024-04-19T21:00:38.127127 #4016665] INFO -- : 1022 ......................................................................... I, [2024-04-19T21:00:49.191279 #4016665] INFO -- : 1095 ......................................................................... I, [2024-04-19T21:00:54.838973 #4016665] INFO -- : 1168 ......................................................................... I, [2024-04-19T21:00:55.773455 #4016665] INFO -- : 1241 ......................................................................... I, [2024-04-19T21:00:56.669454 #4016665] INFO -- : 1314 ......................................................................... I, [2024-04-19T21:00:56.984663 #4016665] INFO -- : 1387 ......................................................................... I, [2024-04-19T21:01:03.075528 #4016665] INFO -- : 1460 ......................................................................... I, [2024-04-19T21:01:19.702013 #4016665] INFO -- : 1533 ......................................................................... I, [2024-04-19T21:01:21.879106 #4016665] INFO -- : 1606 ......................................................................... I, [2024-04-19T21:01:24.877297 #4016665] INFO -- : 1679 ......................................................................... I, [2024-04-19T21:01:27.283875 #4016665] INFO -- : 1752 ......................................................................... I, [2024-04-19T21:01:29.378293 #4016665] INFO -- : 1825 ......................................................................... I, [2024-04-19T21:01:31.455205 #4016665] INFO -- : 1898 ......................................................................... I, [2024-04-19T21:01:32.817097 #4016665] INFO -- : 1971 ......................................................................... I, [2024-04-19T21:01:35.199927 #4016665] INFO -- : 2044 ......................................................................... I, [2024-04-19T21:01:36.217797 #4016665] INFO -- : 2117 ......................................................................... I, [2024-04-19T21:01:36.683019 #4016665] INFO -- : 2190 ......................................................................... I, [2024-04-19T21:01:36.942434 #4016665] INFO -- : 2263 ......................................................................... I, [2024-04-19T21:01:37.209522 #4016665] INFO -- : 2336 ......................................................................... I, [2024-04-19T21:01:37.764001 #4016665] INFO -- : 2409 ......................................................................... I, [2024-04-19T21:01:38.921817 #4016665] INFO -- : 2482 ......................................................................... I, [2024-04-19T21:01:39.672264 #4016665] INFO -- : 2555 ......................................................................... I, [2024-04-19T21:01:42.612861 #4016665] INFO -- : 2628 ......................................................................... I, [2024-04-19T21:01:44.341671 #4016665] INFO -- : 2701 ......................................................................... I, [2024-04-19T21:01:45.027953 #4016665] INFO -- : 2774 ......................................................................... I, [2024-04-19T21:01:46.364895 #4016665] INFO -- : 2847 ......................................................................... I, [2024-04-19T21:01:47.518143 #4016665] INFO -- : 2920 ......................................................................... I, [2024-04-19T21:01:48.278365 #4016665] INFO -- : 2993 ......................................................................... I, [2024-04-19T21:01:48.710637 #4016665] INFO -- : 3066 ......................................................................... I, [2024-04-19T21:01:49.012266 #4016665] INFO -- : 3139 ......................................................................... I, [2024-04-19T21:01:49.242351 #4016665] INFO -- : 3212 ......................................................................... I, [2024-04-19T21:01:49.645617 #4016665] INFO -- : 3285 ......................................................................... I, [2024-04-19T21:01:55.804841 #4016665] INFO -- : 3358 ........................................................................ I, [2024-04-19T21:01:55.805434 #4016665] INFO -- : I, [2024-04-19T21:01:55.805549 #4016665] INFO -- : Finished in 134.531203 seconds I, [2024-04-19T21:01:55.805642 #4016665] INFO -- : I, [2024-04-19T21:01:55.805750 #4016665] INFO -- : 3429 files, 32607 examples, 133861 expectations, 0 failures, 0 errors, 0 tagged I, [2024-04-19T21:01:55.819108 #4016665] INFO -- : $$$[end] "make yes-test-rubyspec MSPECOPT='--error-output stderr --debug -j' TESTS='-j4'" exit with 0.