# Logfile created on 2024-04-19 09:36:33 +0000 by logger.rb/v1.5.0 I, [2024-04-19T09:36:33.765291 #1232052] INFO -- : #, @formatter=nil, @logdev=#, @binmode=false, @mon_data=#, @mon_data_owner_object_id=860>>> I, [2024-04-19T09:36:33.767354 #1232052] INFO -- : $$$[beg] make update-unicode -j4 I, [2024-04-19T09:36:34.304287 #1232052] INFO -- : Downloading Unicode emoji 15.0 files... I, [2024-04-19T09:36:34.305511 #1232052] INFO -- : Downloading Unicode emoji 15.0 files... I, [2024-04-19T09:36:34.305749 #1232052] INFO -- : Downloading Unicode emoji 15.0 files... I, [2024-04-19T09:36:34.922216 #1232052] INFO -- : made symlink emoji/15.0/emoji-sequences.txt to /tmp/ruby/src/trunk/.downloaded-cache/emoji/15.0/emoji-sequences.txt I, [2024-04-19T09:36:34.933337 #1232052] INFO -- : downloading emoji/15.0/emoji-test.txt ... /tmp/ruby/src/trunk/enc/unicode/data/emoji/15.0/emoji-sequences.txt already exists I, [2024-04-19T09:36:34.936197 #1232052] INFO -- : downloading emoji/15.0/emoji-test.txt ... /tmp/ruby/src/trunk/enc/unicode/data/emoji/15.0/emoji-sequences.txt already exists E, [2024-04-19T09:36:35.669892 #1232052] ERROR -- : /tmp/ruby/src/trunk/tool/downloader.rb:302:in `rescue in download'/tmp/ruby/src/trunk/tool/downloader.rb:302:in `rescue in download': : failed to download emoji/15.0/emoji-test.txtfailed to download emoji/15.0/emoji-test.txt ( (RuntimeErrorRuntimeError)) E, [2024-04-19T09:36:35.670161 #1232052] ERROR -- : E, [2024-04-19T09:36:35.670332 #1232052] ERROR -- : OpenURI::HTTPError: 403 Forbidden: https://www.unicode.org/Public/emoji/15.0/emoji-test.txtOpenURI::HTTPError: 403 Forbidden: https://www.unicode.org/Public/emoji/15.0/emoji-test.txt E, [2024-04-19T09:36:35.670526 #1232052] ERROR -- : E, [2024-04-19T09:36:35.670855 #1232052] ERROR -- : from /tmp/ruby/src/trunk/tool/downloader.rb:201:in `download' E, [2024-04-19T09:36:35.671285 #1232052] ERROR -- : from /tmp/ruby/src/trunk/tool/downloader.rb:201:in `download' E, [2024-04-19T09:36:35.671556 #1232052] ERROR -- : from /tmp/ruby/src/trunk/tool/downloader.rb:136:in `download' E, [2024-04-19T09:36:35.671684 #1232052] ERROR -- : from /tmp/ruby/src/trunk/tool/downloader.rb:136:in `download' E, [2024-04-19T09:36:35.671791 #1232052] ERROR -- : from /tmp/ruby/src/trunk/tool/downloader.rb:482:in `block in
' E, [2024-04-19T09:36:35.671936 #1232052] ERROR -- : from /tmp/ruby/src/trunk/tool/downloader.rb:482:in `block in
' E, [2024-04-19T09:36:35.672059 #1232052] ERROR -- : from /tmp/ruby/src/trunk/tool/downloader.rb:465:in `each' E, [2024-04-19T09:36:35.672164 #1232052] ERROR -- : from /tmp/ruby/src/trunk/tool/downloader.rb:465:in `each' E, [2024-04-19T09:36:35.672266 #1232052] ERROR -- : from /tmp/ruby/src/trunk/tool/downloader.rb:465:in `
' E, [2024-04-19T09:36:35.672369 #1232052] ERROR -- : from /tmp/ruby/src/trunk/tool/downloader.rb:465:in `
' E, [2024-04-19T09:36:35.672540 #1232052] ERROR -- : /usr/lib/ruby/3.1.0/open-uri.rb:364:in `open_http'/usr/lib/ruby/3.1.0/open-uri.rb:364:in `open_http': : 403 Forbidden403 Forbidden ( (OpenURI::HTTPErrorOpenURI::HTTPError)) E, [2024-04-19T09:36:35.672667 #1232052] ERROR -- : E, [2024-04-19T09:36:35.672777 #1232052] ERROR -- : from /usr/lib/ruby/3.1.0/open-uri.rb:741:in `buffer_open' E, [2024-04-19T09:36:35.672892 #1232052] ERROR -- : from /usr/lib/ruby/3.1.0/open-uri.rb:741:in `buffer_open' E, [2024-04-19T09:36:35.672995 #1232052] ERROR -- : from /usr/lib/ruby/3.1.0/open-uri.rb:212:in `block in open_loop' E, [2024-04-19T09:36:35.673225 #1232052] ERROR -- : from /usr/lib/ruby/3.1.0/open-uri.rb:212:in `block in open_loop' E, [2024-04-19T09:36:35.673410 #1232052] ERROR -- : from /usr/lib/ruby/3.1.0/open-uri.rb:210:in `catch' E, [2024-04-19T09:36:35.673523 #1232052] ERROR -- : from /usr/lib/ruby/3.1.0/open-uri.rb:210:in `catch' E, [2024-04-19T09:36:35.673680 #1232052] ERROR -- : from /usr/lib/ruby/3.1.0/open-uri.rb:210:in `open_loop' E, [2024-04-19T09:36:35.673801 #1232052] ERROR -- : from /usr/lib/ruby/3.1.0/open-uri.rb:210:in `open_loop' E, [2024-04-19T09:36:35.673907 #1232052] ERROR -- : from /usr/lib/ruby/3.1.0/open-uri.rb:151:in `open_uri' E, [2024-04-19T09:36:35.674005 #1232052] ERROR -- : from /usr/lib/ruby/3.1.0/open-uri.rb:151:in `open_uri' E, [2024-04-19T09:36:35.674177 #1232052] ERROR -- : from /usr/lib/ruby/3.1.0/open-uri.rb:721:in `open' E, [2024-04-19T09:36:35.674292 #1232052] ERROR -- : from /usr/lib/ruby/3.1.0/open-uri.rb:721:in `open' E, [2024-04-19T09:36:35.674397 #1232052] ERROR -- : from /usr/lib/ruby/3.1.0/open-uri.rb:729:in `read' E, [2024-04-19T09:36:35.674628 #1232052] ERROR -- : from /usr/lib/ruby/3.1.0/open-uri.rb:729:in `read' E, [2024-04-19T09:36:35.674830 #1232052] ERROR -- : from /tmp/ruby/src/trunk/tool/downloader.rb:247:in `block in download' E, [2024-04-19T09:36:35.674975 #1232052] ERROR -- : from /tmp/ruby/src/trunk/tool/downloader.rb:247:in `block in download' E, [2024-04-19T09:36:35.675166 #1232052] ERROR -- : from /tmp/ruby/src/trunk/tool/downloader.rb:378:in `with_retry' E, [2024-04-19T09:36:35.675283 #1232052] ERROR -- : from /tmp/ruby/src/trunk/tool/downloader.rb:378:in `with_retry' E, [2024-04-19T09:36:35.675411 #1232052] ERROR -- : from /tmp/ruby/src/trunk/tool/downloader.rb:246:in `download' E, [2024-04-19T09:36:35.675584 #1232052] ERROR -- : from /tmp/ruby/src/trunk/tool/downloader.rb:246:in `download' E, [2024-04-19T09:36:35.675710 #1232052] ERROR -- : from /tmp/ruby/src/trunk/tool/downloader.rb:136:in `download' E, [2024-04-19T09:36:35.675829 #1232052] ERROR -- : from /tmp/ruby/src/trunk/tool/downloader.rb:136:in `download' E, [2024-04-19T09:36:35.675943 #1232052] ERROR -- : from /tmp/ruby/src/trunk/tool/downloader.rb:482:in `block in
' E, [2024-04-19T09:36:35.676080 #1232052] ERROR -- : from /tmp/ruby/src/trunk/tool/downloader.rb:482:in `block in
' E, [2024-04-19T09:36:35.676248 #1232052] ERROR -- : from /tmp/ruby/src/trunk/tool/downloader.rb:465:in `each' E, [2024-04-19T09:36:35.676396 #1232052] ERROR -- : from /tmp/ruby/src/trunk/tool/downloader.rb:465:in `each' E, [2024-04-19T09:36:35.676557 #1232052] ERROR -- : from /tmp/ruby/src/trunk/tool/downloader.rb:465:in `
' E, [2024-04-19T09:36:35.676708 #1232052] ERROR -- : from /tmp/ruby/src/trunk/tool/downloader.rb:465:in `
' E, [2024-04-19T09:36:35.679287 #1232052] ERROR -- : /tmp/ruby/src/trunk/tool/downloader.rb:302:in `rescue in download': failed to download emoji/15.0/emoji-test.txt (RuntimeError) E, [2024-04-19T09:36:35.679500 #1232052] ERROR -- : OpenURI::HTTPError: 403 Forbidden: https://www.unicode.org/Public/emoji/15.0/emoji-test.txt E, [2024-04-19T09:36:35.679612 #1232052] ERROR -- : from /tmp/ruby/src/trunk/tool/downloader.rb:201:in `download' E, [2024-04-19T09:36:35.679716 #1232052] ERROR -- : from /tmp/ruby/src/trunk/tool/downloader.rb:136:in `download' E, [2024-04-19T09:36:35.679822 #1232052] ERROR -- : from /tmp/ruby/src/trunk/tool/downloader.rb:482:in `block in
' E, [2024-04-19T09:36:35.680014 #1232052] ERROR -- : from /tmp/ruby/src/trunk/tool/downloader.rb:465:in `each' E, [2024-04-19T09:36:35.680384 #1232052] ERROR -- : from /tmp/ruby/src/trunk/tool/downloader.rb:465:in `
' E, [2024-04-19T09:36:35.680591 #1232052] ERROR -- : /usr/lib/ruby/3.1.0/open-uri.rb:364:in `open_http': 403 Forbidden (OpenURI::HTTPError) E, [2024-04-19T09:36:35.680712 #1232052] ERROR -- : from /usr/lib/ruby/3.1.0/open-uri.rb:741:in `buffer_open' E, [2024-04-19T09:36:35.680820 #1232052] ERROR -- : from /usr/lib/ruby/3.1.0/open-uri.rb:212:in `block in open_loop' E, [2024-04-19T09:36:35.680922 #1232052] ERROR -- : from /usr/lib/ruby/3.1.0/open-uri.rb:210:in `catch' E, [2024-04-19T09:36:35.681026 #1232052] ERROR -- : from /usr/lib/ruby/3.1.0/open-uri.rb:210:in `open_loop' E, [2024-04-19T09:36:35.681131 #1232052] ERROR -- : from /usr/lib/ruby/3.1.0/open-uri.rb:151:in `open_uri' E, [2024-04-19T09:36:35.681236 #1232052] ERROR -- : from /usr/lib/ruby/3.1.0/open-uri.rb:721:in `open' E, [2024-04-19T09:36:35.681372 #1232052] ERROR -- : from /usr/lib/ruby/3.1.0/open-uri.rb:729:in `read' E, [2024-04-19T09:36:35.681693 #1232052] ERROR -- : from /tmp/ruby/src/trunk/tool/downloader.rb:247:in `block in download' E, [2024-04-19T09:36:35.681834 #1232052] ERROR -- : from /tmp/ruby/src/trunk/tool/downloader.rb:378:in `with_retry' E, [2024-04-19T09:36:35.681937 #1232052] ERROR -- : from /tmp/ruby/src/trunk/tool/downloader.rb:246:in `download' E, [2024-04-19T09:36:35.682041 #1232052] ERROR -- : from /tmp/ruby/src/trunk/tool/downloader.rb:136:in `download' E, [2024-04-19T09:36:35.682154 #1232052] ERROR -- : from /tmp/ruby/src/trunk/tool/downloader.rb:482:in `block in
' E, [2024-04-19T09:36:35.682278 #1232052] ERROR -- : from /tmp/ruby/src/trunk/tool/downloader.rb:465:in `each' E, [2024-04-19T09:36:35.682402 #1232052] ERROR -- : from /tmp/ruby/src/trunk/tool/downloader.rb:465:in `
' E, [2024-04-19T09:36:35.693222 #1232052] ERROR -- : make: *** [uncommon.mk:1778: /tmp/ruby/src/trunk/enc/unicode/data/emoji/15.0/emoji-test.txt] Error 1 E, [2024-04-19T09:36:35.693415 #1232052] ERROR -- : make: *** Waiting for unfinished jobs.... E, [2024-04-19T09:36:35.693497 #1232052] ERROR -- : make: *** [uncommon.mk:1778: /tmp/ruby/src/trunk/enc/unicode/data/emoji/15.0/emoji-sequences.txt] Error 1 E, [2024-04-19T09:36:35.693576 #1232052] ERROR -- : make: *** Deleting file '/tmp/ruby/src/trunk/enc/unicode/data/emoji/15.0/emoji-sequences.txt' E, [2024-04-19T09:36:35.700696 #1232052] ERROR -- : make: *** [uncommon.mk:1778: /tmp/ruby/src/trunk/enc/unicode/data/emoji/15.0/emoji-zwj-sequences.txt] Error 1 I, [2024-04-19T09:36:35.700897 #1232052] INFO -- : downloading emoji/15.0/emoji-test.txt ... I, [2024-04-19T09:36:35.702243 #1232052] INFO -- : $$$[end] "make update-unicode -j4" exit with 512. I, [2024-04-19T09:36:35.702451 #1232052] INFO -- : $$$[beg] make update-download -j4 I, [2024-04-19T09:36:36.849670 #1232052] INFO -- : tool/config.guess already exists I, [2024-04-19T09:36:36.850037 #1232052] INFO -- : tool/config.sub already exists I, [2024-04-19T09:36:36.869189 #1232052] INFO -- : Update minitest to ea9caafc0754b1d6236a490d59e624b53209734a I, [2024-04-19T09:36:36.869899 #1232052] INFO -- : Update power_assert to 84e85124c5014a139af39161d484156cfe87a9ed I, [2024-04-19T09:36:36.872617 #1232052] INFO -- : Update rbs to ba7872795d5de04adb8ff500c0e6afdc81a041dd I, [2024-04-19T09:36:36.872980 #1232052] INFO -- : Update typeprof to b19a6416da3a05d57fadd6ffdadb382b6d236ca5 I, [2024-04-19T09:36:36.877872 #1232052] INFO -- : echo ea9caafc0754b1d6236a490d59e624b53209734a | /bin/sh /tmp/ruby/src/trunk/tool/ifchange /tmp/ruby/src/trunk/.bundle/.timestamp/minitest.revision - I, [2024-04-19T09:36:36.879569 #1232052] INFO -- : echo 84e85124c5014a139af39161d484156cfe87a9ed | /bin/sh /tmp/ruby/src/trunk/tool/ifchange /tmp/ruby/src/trunk/.bundle/.timestamp/power_assert.revision - I, [2024-04-19T09:36:36.881721 #1232052] INFO -- : echo b19a6416da3a05d57fadd6ffdadb382b6d236ca5 | /bin/sh /tmp/ruby/src/trunk/tool/ifchange /tmp/ruby/src/trunk/.bundle/.timestamp/typeprof.revision - I, [2024-04-19T09:36:36.883592 #1232052] INFO -- : echo ba7872795d5de04adb8ff500c0e6afdc81a041dd | /bin/sh /tmp/ruby/src/trunk/tool/ifchange /tmp/ruby/src/trunk/.bundle/.timestamp/rbs.revision - I, [2024-04-19T09:36:36.890679 #1232052] INFO -- : /tmp/ruby/src/trunk/.bundle/.timestamp/minitest.revision unchanged I, [2024-04-19T09:36:36.892985 #1232052] INFO -- : /tmp/ruby/src/trunk/.bundle/.timestamp/power_assert.revision unchanged I, [2024-04-19T09:36:36.893607 #1232052] INFO -- : /tmp/ruby/src/trunk/.bundle/.timestamp/typeprof.revision unchanged I, [2024-04-19T09:36:36.895083 #1232052] INFO -- : /tmp/ruby/src/trunk/.bundle/.timestamp/rbs.revision unchanged I, [2024-04-19T09:36:37.693640 #1232052] INFO -- : Building power_assert@84e85124c5014a139af39161d484156cfe87a9ed to /tmp/ruby/src/trunk/gems/power_assert-2.0.3.gem I, [2024-04-19T09:36:38.621915 #1232052] INFO -- : Successfully built RubyGem I, [2024-04-19T09:36:38.622119 #1232052] INFO -- : Name: power_assert I, [2024-04-19T09:36:38.622228 #1232052] INFO -- : Version: 2.0.4dev I, [2024-04-19T09:36:38.622313 #1232052] INFO -- : File: power_assert-2.0.4dev.gem I, [2024-04-19T09:36:39.286935 #1232052] INFO -- : $$$[end] "make update-download -j4" exit with 0. I, [2024-04-19T09:36:39.287161 #1232052] INFO -- : $$$[beg] make update-rubyspec -j4 I, [2024-04-19T09:36:39.839682 #1232052] INFO -- : make: Nothing to be done for 'update-rubyspec'. I, [2024-04-19T09:36:39.841465 #1232052] INFO -- : $$$[end] "make update-rubyspec -j4" exit with 0. I, [2024-04-19T09:36:39.841674 #1232052] INFO -- : $$$[beg] make update-src -j4 E, [2024-04-19T09:36:41.583962 #1232052] ERROR -- : From https://github.com/ruby/ruby E, [2024-04-19T09:36:41.584172 #1232052] ERROR -- : 74cd61f..7951b34 master -> origin/master I, [2024-04-19T09:36:41.701511 #1232052] INFO -- : Updating 74cd61f..7951b34 I, [2024-04-19T09:36:41.701722 #1232052] INFO -- : Fast-forward I, [2024-04-19T09:36:41.717602 #1232052] INFO -- : configure.ac | 24 ++++++++++++++++-------- I, [2024-04-19T09:36:41.717823 #1232052] INFO -- : 1 file changed, 16 insertions(+), 8 deletions(-) I, [2024-04-19T09:36:41.784757 #1232052] INFO -- : Latest commit hash = 7951b349ab I, [2024-04-19T09:36:41.790923 #1232052] INFO -- : $$$[end] "make update-src -j4" exit with 0. I, [2024-04-19T09:36:41.791189 #1232052] INFO -- : $$$[beg] make after-update -j4 I, [2024-04-19T09:36:42.343084 #1232052] INFO -- : cd -P /tmp/ruby/src/trunk && exec autoconf -o configure I, [2024-04-19T09:36:56.797918 #1232052] INFO -- : running CONFIG_SHELL=/bin/bash /bin/bash /tmp/ruby/src/trunk/configure --prefix=/tmp/ruby/install/trunk --disable-install-doc --enable-shared --no-create --no-recursion I, [2024-04-19T09:36:56.798175 #1232052] INFO -- : checking for ruby... /usr/bin/ruby --disable=gems I, [2024-04-19T09:36:56.798312 #1232052] INFO -- : tool/config.guess already exists I, [2024-04-19T09:36:56.798432 #1232052] INFO -- : tool/config.sub already exists I, [2024-04-19T09:36:56.798661 #1232052] INFO -- : checking build system type... riscv64-unknown-linux-gnu I, [2024-04-19T09:36:56.798889 #1232052] INFO -- : checking host system type... riscv64-unknown-linux-gnu I, [2024-04-19T09:36:56.799068 #1232052] INFO -- : checking target system type... riscv64-unknown-linux-gnu I, [2024-04-19T09:36:56.799201 #1232052] INFO -- : checking for gcc... gcc I, [2024-04-19T09:36:56.799317 #1232052] INFO -- : checking for ld... ld I, [2024-04-19T09:36:56.799435 #1232052] INFO -- : checking for gcc-ar... gcc-ar I, [2024-04-19T09:36:56.799537 #1232052] INFO -- : checking for g++... no I, [2024-04-19T09:36:56.799637 #1232052] INFO -- : checking for gcc-nm... gcc-nm I, [2024-04-19T09:36:56.799741 #1232052] INFO -- : checking for gcc-ranlib... gcc-ranlib I, [2024-04-19T09:36:56.799862 #1232052] INFO -- : checking whether the C compiler works... yes I, [2024-04-19T09:36:56.799978 #1232052] INFO -- : checking for C compiler default output file name... a.out I, [2024-04-19T09:36:56.800159 #1232052] INFO -- : checking for suffix of executables... I, [2024-04-19T09:36:56.800291 #1232052] INFO -- : checking whether we are cross compiling... no I, [2024-04-19T09:36:56.800412 #1232052] INFO -- : checking for suffix of object files... o I, [2024-04-19T09:36:56.800548 #1232052] INFO -- : checking whether the compiler supports GNU C... yes I, [2024-04-19T09:36:56.800669 #1232052] INFO -- : checking whether gcc accepts -g... yes I, [2024-04-19T09:36:56.806903 #1232052] INFO -- : checking for gcc option to enable C11 features... none needed I, [2024-04-19T09:36:56.807184 #1232052] INFO -- : checking for g++... no I, [2024-04-19T09:36:56.807328 #1232052] INFO -- : checking for c++... c++ I, [2024-04-19T09:36:56.807480 #1232052] INFO -- : checking whether the compiler supports GNU C++... yes I, [2024-04-19T09:36:56.807620 #1232052] INFO -- : checking whether c++ accepts -g... yes I, [2024-04-19T09:36:56.807766 #1232052] INFO -- : checking for c++ option to enable C++11 features... none needed I, [2024-04-19T09:36:56.807896 #1232052] INFO -- : checking how to run the C preprocessor... gcc -E I, [2024-04-19T09:36:56.808001 #1232052] INFO -- : checking for gas... no I, [2024-04-19T09:36:56.808108 #1232052] INFO -- : checking for as... as I, [2024-04-19T09:36:56.808222 #1232052] INFO -- : checking for gobjcopy... no I, [2024-04-19T09:36:56.808347 #1232052] INFO -- : checking for objcopy... objcopy I, [2024-04-19T09:36:56.808477 #1232052] INFO -- : checking for gobjdump... no I, [2024-04-19T09:36:56.808607 #1232052] INFO -- : checking for objdump... objdump I, [2024-04-19T09:36:56.808724 #1232052] INFO -- : checking for gstrip... no I, [2024-04-19T09:36:56.808841 #1232052] INFO -- : checking for strip... strip I, [2024-04-19T09:36:56.808957 #1232052] INFO -- : checking for stdio.h... yes I, [2024-04-19T09:36:56.809067 #1232052] INFO -- : checking for stdlib.h... yes I, [2024-04-19T09:36:56.809174 #1232052] INFO -- : checking for string.h... yes I, [2024-04-19T09:36:56.809279 #1232052] INFO -- : checking for inttypes.h... yes I, [2024-04-19T09:36:56.809394 #1232052] INFO -- : checking for stdint.h... yes I, [2024-04-19T09:36:56.809514 #1232052] INFO -- : checking for strings.h... yes I, [2024-04-19T09:36:56.809644 #1232052] INFO -- : checking for sys/stat.h... yes I, [2024-04-19T09:36:56.809758 #1232052] INFO -- : checking for sys/types.h... yes I, [2024-04-19T09:36:56.809865 #1232052] INFO -- : checking for unistd.h... yes I, [2024-04-19T09:36:56.809969 #1232052] INFO -- : checking for wchar.h... yes I, [2024-04-19T09:36:56.810072 #1232052] INFO -- : checking for minix/config.h... no I, [2024-04-19T09:36:56.810183 #1232052] INFO -- : checking for vfork.h... no I, [2024-04-19T09:36:56.810304 #1232052] INFO -- : checking whether it is safe to define __EXTENSIONS__... yes I, [2024-04-19T09:36:56.810417 #1232052] INFO -- : checking whether _XOPEN_SOURCE should be defined... no I, [2024-04-19T09:36:56.810624 #1232052] INFO -- : checking whether the linker is GNU ld... yes I, [2024-04-19T09:36:56.810768 #1232052] INFO -- : checking whether gcc -E accepts -o... yes I, [2024-04-19T09:36:56.810900 #1232052] INFO -- : checking for gcc-ar flags... rcD I, [2024-04-19T09:36:56.811033 #1232052] INFO -- : checking whether ln -s works... yes I, [2024-04-19T09:36:56.811156 #1232052] INFO -- : checking whether make sets $(MAKE)... yes I, [2024-04-19T09:36:56.811269 #1232052] INFO -- : checking for a BSD-compatible install... /usr/bin/install -c I, [2024-04-19T09:36:56.811375 #1232052] INFO -- : checking for a race-free mkdir -p... /usr/bin/mkdir -p I, [2024-04-19T09:36:56.811483 #1232052] INFO -- : checking for dtrace... no I, [2024-04-19T09:36:56.811612 #1232052] INFO -- : checking for dot... dot I, [2024-04-19T09:36:56.811729 #1232052] INFO -- : checking for doxygen... no I, [2024-04-19T09:36:56.811836 #1232052] INFO -- : checking for pkg-config... no I, [2024-04-19T09:36:56.811939 #1232052] INFO -- : checking whether it is Android... no I, [2024-04-19T09:36:56.812113 #1232052] INFO -- : checking for cd using physical directory... cd -P I, [2024-04-19T09:36:56.812241 #1232052] INFO -- : checking whether CFLAGS is valid... yes I, [2024-04-19T09:36:56.812368 #1232052] INFO -- : checking whether LDFLAGS is valid... yes I, [2024-04-19T09:36:56.812485 #1232052] INFO -- : checking whether ELF binaries are produced... yes I, [2024-04-19T09:36:56.812593 #1232052] INFO -- : checking whether -Wl,-rpath,. is accepted as LDFLAGS... yes I, [2024-04-19T09:36:56.812704 #1232052] INFO -- : checking whether -fdeclspec is accepted as LDFLAGS... no I, [2024-04-19T09:36:56.812817 #1232052] INFO -- : checking whether -fdeclspec is accepted as CXXFLAGS... yes I, [2024-04-19T09:36:56.812929 #1232052] INFO -- : checking whether -Wextra-tokens is accepted as CFLAGS... no I, [2024-04-19T09:36:56.813045 #1232052] INFO -- : checking whether -Wdeprecated-declarations is accepted as CFLAGS... yes I, [2024-04-19T09:36:56.813175 #1232052] INFO -- : checking whether -Wdivision-by-zero is accepted as CFLAGS... no I, [2024-04-19T09:36:56.813312 #1232052] INFO -- : checking whether -Wdiv-by-zero is accepted as CFLAGS... yes I, [2024-04-19T09:36:56.813446 #1232052] INFO -- : checking whether -Wduplicated-cond is accepted as CFLAGS... yes I, [2024-04-19T09:36:56.813560 #1232052] INFO -- : checking whether -Wimplicit-function-declaration is accepted as CFLAGS... yes I, [2024-04-19T09:36:56.813673 #1232052] INFO -- : checking whether -Wimplicit-int is accepted as CFLAGS... yes I, [2024-04-19T09:36:56.813789 #1232052] INFO -- : checking whether -Wpointer-arith is accepted as CFLAGS... yes I, [2024-04-19T09:36:56.813897 #1232052] INFO -- : checking whether -Wshorten-64-to-32 is accepted as CFLAGS... no I, [2024-04-19T09:36:56.814015 #1232052] INFO -- : checking whether -Wwrite-strings is accepted as CFLAGS... yes I, [2024-04-19T09:36:56.814153 #1232052] INFO -- : checking whether -Wold-style-definition is accepted as CFLAGS... yes I, [2024-04-19T09:36:56.814272 #1232052] INFO -- : checking whether -Wimplicit-fallthrough=0 is accepted as CFLAGS... yes I, [2024-04-19T09:36:56.814408 #1232052] INFO -- : checking whether -Wmissing-noreturn is accepted as CFLAGS... yes I, [2024-04-19T09:36:56.814606 #1232052] INFO -- : checking whether -Wno-cast-function-type is accepted as CFLAGS... yes I, [2024-04-19T09:36:56.814793 #1232052] INFO -- : checking whether -Wno-constant-logical-operand is accepted as CFLAGS... yes I, [2024-04-19T09:36:56.814988 #1232052] INFO -- : checking whether -Wno-long-long is accepted as CFLAGS... yes I, [2024-04-19T09:36:56.815150 #1232052] INFO -- : checking whether -Wno-missing-field-initializers is accepted as CFLAGS... yes I, [2024-04-19T09:36:56.815305 #1232052] INFO -- : checking whether -Wno-overlength-strings is accepted as CFLAGS... yes I, [2024-04-19T09:36:56.815446 #1232052] INFO -- : checking whether -Wno-packed-bitfield-compat is accepted as CFLAGS... yes I, [2024-04-19T09:37:14.213948 #1232052] INFO -- : checking whether -Wno-parentheses-equality is accepted as CFLAGS... yes I, [2024-04-19T09:37:14.214414 #1232052] INFO -- : checking whether -Wno-self-assign is accepted as CFLAGS... yes I, [2024-04-19T09:37:14.214798 #1232052] INFO -- : checking whether -Wno-tautological-compare is accepted as CFLAGS... yes I, [2024-04-19T09:37:14.215038 #1232052] INFO -- : checking whether -Wno-unused-parameter is accepted as CFLAGS... yes I, [2024-04-19T09:37:14.215288 #1232052] INFO -- : checking whether -Wno-unused-value is accepted as CFLAGS... yes I, [2024-04-19T09:37:14.215549 #1232052] INFO -- : checking whether -Wsuggest-attribute=format is accepted as CFLAGS... yes I, [2024-04-19T09:37:14.215799 #1232052] INFO -- : checking whether -Wsuggest-attribute=noreturn is accepted as CFLAGS... yes I, [2024-04-19T09:37:14.216124 #1232052] INFO -- : checking whether -Wunused-variable is accepted as CFLAGS... yes I, [2024-04-19T09:37:14.216442 #1232052] INFO -- : checking whether -diag-disable=175,188,1684,2259,2312 is accepted as CFLAGS... no I, [2024-04-19T09:37:14.216828 #1232052] INFO -- : checking whether -Wmisleading-indentation is accepted as CFLAGS... yes I, [2024-04-19T09:37:14.217112 #1232052] INFO -- : checking whether -Wundef is accepted as CFLAGS... yes I, [2024-04-19T09:37:14.217337 #1232052] INFO -- : checking whether -Wall -Wextra is accepted as CFLAGS... yes I, [2024-04-19T09:37:14.217556 #1232052] INFO -- : checking whether -Qunused-arguments is accepted as CFLAGS... no I, [2024-04-19T09:37:14.217790 #1232052] INFO -- : checking whether -O3 -D_FORTIFY_SOURCE=2 is accepted as CFLAGS... yes I, [2024-04-19T09:37:14.218002 #1232052] INFO -- : checking whether -fstack-protector-strong is accepted as CFLAGS... yes I, [2024-04-19T09:37:14.218196 #1232052] INFO -- : checking whether -fstack-protector-strong is accepted as LDFLAGS... yes I, [2024-04-19T09:37:14.218382 #1232052] INFO -- : checking for -fstack-protector... -fstack-protector-strong I, [2024-04-19T09:37:14.218682 #1232052] INFO -- : checking whether -Wl,--compress-debug-sections=zlib is accepted as LDFLAGS... yes I, [2024-04-19T09:37:14.218921 #1232052] INFO -- : checking whether -fno-strict-overflow is accepted as CFLAGS... yes I, [2024-04-19T09:37:14.219139 #1232052] INFO -- : checking whether -ggdb3 is accepted as CFLAGS... yes I, [2024-04-19T09:37:14.219361 #1232052] INFO -- : checking whether -fvisibility=hidden is accepted as CFLAGS... yes I, [2024-04-19T09:37:14.219564 #1232052] INFO -- : checking whether -fno-fast-math is accepted as CFLAGS... yes I, [2024-04-19T09:37:14.219752 #1232052] INFO -- : checking whether -fexcess-precision=standard is accepted as CFLAGS... yes I, [2024-04-19T09:37:14.219953 #1232052] INFO -- : checking whether -fp-model precise is accepted as CFLAGS... no I, [2024-04-19T09:37:14.220162 #1232052] INFO -- : checking whether compiler has statement and declarations in expressions... yes I, [2024-04-19T09:37:14.220373 #1232052] INFO -- : checking for pthread.h... yes I, [2024-04-19T09:37:14.220571 #1232052] INFO -- : checking for pthread_create in -lthr... no I, [2024-04-19T09:37:14.220777 #1232052] INFO -- : checking for pthread_create in -lpthread... yes I, [2024-04-19T09:37:14.220987 #1232052] INFO -- : checking for pthread_np.h... no I, [2024-04-19T09:37:14.221225 #1232052] INFO -- : checking thread model... pthread I, [2024-04-19T09:37:14.221440 #1232052] INFO -- : checking whether CXXFLAGS is valid... yes I, [2024-04-19T09:37:14.221653 #1232052] INFO -- : checking for crypt in -lcrypt... yes I, [2024-04-19T09:37:14.221857 #1232052] INFO -- : checking for dlopen in -ldl... yes I, [2024-04-19T09:37:14.222043 #1232052] INFO -- : checking for shutdown in -lsocket... no I, [2024-04-19T09:37:14.222228 #1232052] INFO -- : checking for dirent.h that defines DIR... yes I, [2024-04-19T09:37:14.222422 #1232052] INFO -- : checking for library containing opendir... none required I, [2024-04-19T09:37:14.222794 #1232052] INFO -- : checking for _Bool... yes I, [2024-04-19T09:37:14.223018 #1232052] INFO -- : checking for stdbool.h that conforms to C99... yes I, [2024-04-19T09:37:14.223229 #1232052] INFO -- : checking for sys/wait.h that is POSIX.1 compatible... yes I, [2024-04-19T09:37:14.223457 #1232052] INFO -- : checking for afunix.h... no I, [2024-04-19T09:37:14.223676 #1232052] INFO -- : checking for atomic.h... no I, [2024-04-19T09:37:14.223883 #1232052] INFO -- : checking for copyfile.h... no I, [2024-04-19T09:37:14.224086 #1232052] INFO -- : checking for direct.h... no I, [2024-04-19T09:37:14.224282 #1232052] INFO -- : checking for grp.h... yes I, [2024-04-19T09:37:14.224499 #1232052] INFO -- : checking for fcntl.h... yes I, [2024-04-19T09:37:14.224701 #1232052] INFO -- : checking for float.h... yes I, [2024-04-19T09:37:14.224912 #1232052] INFO -- : checking for ieeefp.h... no I, [2024-04-19T09:37:14.225147 #1232052] INFO -- : checking for intrinsics.h... no I, [2024-04-19T09:37:14.225398 #1232052] INFO -- : checking for langinfo.h... yes I, [2024-04-19T09:37:14.225640 #1232052] INFO -- : checking for limits.h... yes I, [2024-04-19T09:37:14.226080 #1232052] INFO -- : checking for locale.h... yes I, [2024-04-19T09:37:14.226394 #1232052] INFO -- : checking for malloc.h... yes I, [2024-04-19T09:37:14.226746 #1232052] INFO -- : checking for malloc/malloc.h... no I, [2024-04-19T09:37:14.226975 #1232052] INFO -- : checking for malloc_np.h... no I, [2024-04-19T09:37:14.227165 #1232052] INFO -- : checking for net/socket.h... no I, [2024-04-19T09:37:14.227347 #1232052] INFO -- : checking for process.h... no I, [2024-04-19T09:37:14.227525 #1232052] INFO -- : checking for pwd.h... yes I, [2024-04-19T09:37:14.227721 #1232052] INFO -- : checking for sanitizer/asan_interface.h... yes I, [2024-04-19T09:37:14.227962 #1232052] INFO -- : checking for sanitizer/msan_interface.h... no I, [2024-04-19T09:37:14.228163 #1232052] INFO -- : checking for setjmpex.h... no I, [2024-04-19T09:37:14.228357 #1232052] INFO -- : checking for stdalign.h... yes I, [2024-04-19T09:37:14.228541 #1232052] INFO -- : checking for sys/attr.h... no I, [2024-04-19T09:37:14.228736 #1232052] INFO -- : checking for sys/eventfd.h... yes I, [2024-04-19T09:37:14.228938 #1232052] INFO -- : checking for sys/fcntl.h... yes I, [2024-04-19T09:37:14.229142 #1232052] INFO -- : checking for sys/file.h... yes I, [2024-04-19T09:37:14.230711 #1232052] INFO -- : checking for sys/id.h... no I, [2024-04-19T09:37:14.232324 #1232052] INFO -- : checking for sys/ioctl.h... yes I, [2024-04-19T09:37:14.232803 #1232052] INFO -- : checking for sys/mkdev.h... no I, [2024-04-19T09:37:14.233073 #1232052] INFO -- : checking for sys/param.h... yes I, [2024-04-19T09:37:14.233305 #1232052] INFO -- : checking for sys/prctl.h... yes I, [2024-04-19T09:37:14.233553 #1232052] INFO -- : checking for sys/random.h... yes I, [2024-04-19T09:37:14.233687 #1232052] INFO -- : checking for sys/resource.h... yes I, [2024-04-19T09:37:14.233795 #1232052] INFO -- : checking for sys/select.h... yes I, [2024-04-19T09:37:14.233916 #1232052] INFO -- : checking for sys/sendfile.h... yes I, [2024-04-19T09:37:14.234017 #1232052] INFO -- : checking for sys/socket.h... yes I, [2024-04-19T09:37:14.234135 #1232052] INFO -- : checking for sys/syscall.h... yes I, [2024-04-19T09:37:14.234297 #1232052] INFO -- : checking for sys/sysmacros.h... yes I, [2024-04-19T09:37:14.234460 #1232052] INFO -- : checking for sys/time.h... yes I, [2024-04-19T09:37:14.234659 #1232052] INFO -- : checking for sys/times.h... yes I, [2024-04-19T09:37:14.234778 #1232052] INFO -- : checking for sys/uio.h... yes I, [2024-04-19T09:37:14.234886 #1232052] INFO -- : checking for sys/utime.h... no I, [2024-04-19T09:37:14.234995 #1232052] INFO -- : checking for syscall.h... yes I, [2024-04-19T09:37:14.235102 #1232052] INFO -- : checking for time.h... yes I, [2024-04-19T09:37:14.235207 #1232052] INFO -- : checking for ucontext.h... yes I, [2024-04-19T09:37:14.235310 #1232052] INFO -- : checking for utime.h... yes I, [2024-04-19T09:37:14.235412 #1232052] INFO -- : checking for sys/epoll.h... yes I, [2024-04-19T09:37:14.235517 #1232052] INFO -- : checking for sys/event.h... no I, [2024-04-19T09:37:14.235625 #1232052] INFO -- : checking for gmp.h... yes I, [2024-04-19T09:37:14.235732 #1232052] INFO -- : checking for library containing __gmpz_init... -lgmp I, [2024-04-19T09:37:14.235856 #1232052] INFO -- : checking for special C compiler options needed for large files... no I, [2024-04-19T09:37:14.235963 #1232052] INFO -- : checking for _FILE_OFFSET_BITS value needed for large files... no I, [2024-04-19T09:37:14.236058 #1232052] INFO -- : checking whether byte ordering is bigendian... no I, [2024-04-19T09:37:14.236198 #1232052] INFO -- : checking for an ANSI C-conforming const... yes I, [2024-04-19T09:37:14.236332 #1232052] INFO -- : checking whether char is unsigned... yes I, [2024-04-19T09:37:39.490079 #1232052] INFO -- : checking for inline... inline I, [2024-04-19T09:37:39.490549 #1232052] INFO -- : checking for working volatile... yes I, [2024-04-19T09:37:39.490851 #1232052] INFO -- : checking for typeof syntax and keyword spelling... typeof I, [2024-04-19T09:37:39.491179 #1232052] INFO -- : checking for C/C++ restrict keyword... __restrict__ I, [2024-04-19T09:37:39.491412 #1232052] INFO -- : checking for long long... yes I, [2024-04-19T09:37:39.491673 #1232052] INFO -- : checking for off_t... yes I, [2024-04-19T09:37:39.491896 #1232052] INFO -- : checking char bit... 8 I, [2024-04-19T09:37:39.492128 #1232052] INFO -- : checking size of int... 4 I, [2024-04-19T09:37:39.492334 #1232052] INFO -- : checking size of short... 2 I, [2024-04-19T09:37:39.492550 #1232052] INFO -- : checking size of long... 8 I, [2024-04-19T09:37:39.492786 #1232052] INFO -- : checking size of long long... 8 I, [2024-04-19T09:37:39.492998 #1232052] INFO -- : checking size of __int64... 0 I, [2024-04-19T09:37:39.493279 #1232052] INFO -- : checking size of __int128... 16 I, [2024-04-19T09:37:39.493622 #1232052] INFO -- : checking size of off_t... 8 I, [2024-04-19T09:37:39.493922 #1232052] INFO -- : checking size of void*... 8 I, [2024-04-19T09:37:39.494181 #1232052] INFO -- : checking size of float... 4 I, [2024-04-19T09:37:39.494411 #1232052] INFO -- : checking size of double... 8 I, [2024-04-19T09:37:39.494780 #1232052] INFO -- : checking size of time_t... 8 I, [2024-04-19T09:37:39.495028 #1232052] INFO -- : checking size of clock_t... 8 I, [2024-04-19T09:37:39.495245 #1232052] INFO -- : checking word size... 8 I, [2024-04-19T09:37:39.495446 #1232052] INFO -- : checking packed struct attribute... x __attribute__((packed)) I, [2024-04-19T09:37:39.495649 #1232052] INFO -- : checking whether -Wno-address-of-packed-member is accepted as CFLAGS... yes I, [2024-04-19T09:37:39.495890 #1232052] INFO -- : checking for printf prefix for long long... ll I, [2024-04-19T09:37:39.496083 #1232052] INFO -- : checking for pid_t... yes I, [2024-04-19T09:37:39.496263 #1232052] INFO -- : checking for convertible type of pid_t... INT I, [2024-04-19T09:37:39.496444 #1232052] INFO -- : checking for uid_t... yes I, [2024-04-19T09:37:39.496650 #1232052] INFO -- : checking for convertible type of uid_t... UINT I, [2024-04-19T09:37:39.496861 #1232052] INFO -- : checking for gid_t... yes I, [2024-04-19T09:37:39.497062 #1232052] INFO -- : checking for convertible type of gid_t... UINT I, [2024-04-19T09:37:39.497257 #1232052] INFO -- : checking for time_t... yes I, [2024-04-19T09:37:39.497449 #1232052] INFO -- : checking for convertible type of time_t... LONG I, [2024-04-19T09:37:39.497675 #1232052] INFO -- : checking for dev_t... yes I, [2024-04-19T09:37:39.497898 #1232052] INFO -- : checking for convertible type of dev_t... ULONG I, [2024-04-19T09:37:39.498104 #1232052] INFO -- : checking for mode_t... yes I, [2024-04-19T09:37:39.498304 #1232052] INFO -- : checking for convertible type of mode_t... UINT I, [2024-04-19T09:37:39.498587 #1232052] INFO -- : checking for rlim_t... yes I, [2024-04-19T09:37:39.498845 #1232052] INFO -- : checking for convertible type of rlim_t... ULONG I, [2024-04-19T09:37:39.499055 #1232052] INFO -- : checking for convertible type of off_t... LONG I, [2024-04-19T09:37:39.499252 #1232052] INFO -- : checking for clockid_t... yes I, [2024-04-19T09:37:39.499465 #1232052] INFO -- : checking for convertible type of clockid_t... INT I, [2024-04-19T09:37:39.499710 #1232052] INFO -- : checking for variable length macro... yes I, [2024-04-19T09:37:39.499925 #1232052] INFO -- : checking if _Alignof() works... yes I, [2024-04-19T09:37:39.500124 #1232052] INFO -- : checking for CONSTFUNC function attribute... __attribute__ ((__const__)) x I, [2024-04-19T09:37:39.500351 #1232052] INFO -- : checking for PUREFUNC function attribute... __attribute__ ((__pure__)) x I, [2024-04-19T09:37:39.500576 #1232052] INFO -- : checking for NORETURN function attribute... __attribute__ ((__noreturn__)) x I, [2024-04-19T09:37:39.500792 #1232052] INFO -- : checking for DEPRECATED function attribute... __attribute__ ((__deprecated__)) x I, [2024-04-19T09:37:39.500991 #1232052] INFO -- : checking for DEPRECATED_BY function attribute... __attribute__ ((__deprecated__("by "#n))) x I, [2024-04-19T09:37:39.501307 #1232052] INFO -- : checking for NOINLINE function attribute... __attribute__ ((__noinline__)) x I, [2024-04-19T09:37:39.501566 #1232052] INFO -- : checking for ALWAYS_INLINE function attribute... __attribute__ ((__always_inline__)) x I, [2024-04-19T09:37:39.501774 #1232052] INFO -- : checking for NO_SANITIZE function attribute... __attribute__ ((__no_sanitize__(san))) x I, [2024-04-19T09:37:39.501976 #1232052] INFO -- : checking for NO_SANITIZE_ADDRESS function attribute... __attribute__ ((__no_sanitize_address__)) x I, [2024-04-19T09:37:39.502202 #1232052] INFO -- : checking for NO_ADDRESS_SAFETY_ANALYSIS function attribute... __attribute__ ((__no_address_safety_analysis__)) x I, [2024-04-19T09:37:39.502406 #1232052] INFO -- : checking for WARN_UNUSED_RESULT function attribute... __attribute__ ((__warn_unused_result__)) x I, [2024-04-19T09:37:39.502797 #1232052] INFO -- : checking for MAYBE_UNUSED function attribute... __attribute__ ((__unused__)) x I, [2024-04-19T09:37:39.503057 #1232052] INFO -- : checking for ERRORFUNC function attribute... __attribute__ ((__error__ mesg)) x I, [2024-04-19T09:37:39.503322 #1232052] INFO -- : checking for WARNINGFUNC function attribute... __attribute__ ((__warning__ mesg)) x I, [2024-04-19T09:37:39.503633 #1232052] INFO -- : checking for WEAK function attribute... __attribute__ ((__weak__)) x I, [2024-04-19T09:37:39.503922 #1232052] INFO -- : checking for __attribute__((__depreacted__(msg))) in C++... yes I, [2024-04-19T09:37:39.504178 #1232052] INFO -- : checking for std::nullptr_t... yes I, [2024-04-19T09:37:39.504396 #1232052] INFO -- : checking for FUNC_STDCALL function attribute... x I, [2024-04-19T09:37:39.504603 #1232052] INFO -- : checking for FUNC_CDECL function attribute... x I, [2024-04-19T09:37:39.504796 #1232052] INFO -- : checking for FUNC_FASTCALL function attribute... x I, [2024-04-19T09:37:39.506287 #1232052] INFO -- : checking for FUNC_UNOPTIMIZED function attribute... __attribute__ ((__optimize__("O0"))) x I, [2024-04-19T09:37:39.506649 #1232052] INFO -- : checking for FUNC_MINIMIZED function attribute... __attribute__ ((__optimize__("-Os","-fomit-frame-pointer"))) x I, [2024-04-19T09:37:39.506924 #1232052] INFO -- : checking for function alias... alias I, [2024-04-19T09:37:39.507125 #1232052] INFO -- : checking for __atomic builtins... yes I, [2024-04-19T09:37:39.507327 #1232052] INFO -- : checking for __sync builtins... yes I, [2024-04-19T09:37:39.507532 #1232052] INFO -- : checking for __builtin_unreachable... yes I, [2024-04-19T09:37:39.507760 #1232052] INFO -- : checking for __assume... no I, [2024-04-19T09:37:39.507961 #1232052] INFO -- : checking for exported function attribute... __attribute__ ((__visibility__("default"))) I, [2024-04-19T09:37:39.508174 #1232052] INFO -- : checking for RUBY_FUNC_NONNULL function attribute... __attribute__ ((__nonnull__(n))) x I, [2024-04-19T09:37:39.508383 #1232052] INFO -- : checking for function name string predefined identifier... __func__ I, [2024-04-19T09:37:39.508575 #1232052] INFO -- : checking if enum over int is allowed... yes I, [2024-04-19T09:37:39.508765 #1232052] INFO -- : checking for gcc options needed to detect all undeclared functions... none needed I, [2024-04-19T09:37:39.508959 #1232052] INFO -- : checking whether sys_nerr is declared... no I, [2024-04-19T09:37:39.509154 #1232052] INFO -- : checking whether getenv is declared... yes I, [2024-04-19T09:37:39.509343 #1232052] INFO -- : checking for size_t... yes I, [2024-04-19T09:37:39.509608 #1232052] INFO -- : checking size of size_t... 8 I, [2024-04-19T09:37:39.509825 #1232052] INFO -- : checking size of ptrdiff_t... 8 I, [2024-04-19T09:37:39.509934 #1232052] INFO -- : checking size of dev_t... 8 I, [2024-04-19T09:37:39.510031 #1232052] INFO -- : checking for printf prefix for size_t... z I, [2024-04-19T09:37:39.510121 #1232052] INFO -- : checking for printf prefix for ptrdiff_t... t I, [2024-04-19T09:38:14.911395 #1232052] INFO -- : checking for struct stat.st_blksize... yes I, [2024-04-19T09:38:14.911920 #1232052] INFO -- : checking for struct stat.st_blocks... yes I, [2024-04-19T09:38:14.912182 #1232052] INFO -- : checking for struct stat.st_rdev... yes I, [2024-04-19T09:38:14.912517 #1232052] INFO -- : checking size of struct stat.st_size... SIZEOF_OFF_T I, [2024-04-19T09:38:14.912891 #1232052] INFO -- : checking size of struct stat.st_blocks... SIZEOF_OFF_T I, [2024-04-19T09:38:14.913247 #1232052] INFO -- : checking size of struct stat.st_ino... SIZEOF_LONG I, [2024-04-19T09:38:14.913511 #1232052] INFO -- : checking size of struct stat.st_dev... SIZEOF_DEV_T I, [2024-04-19T09:38:14.913904 #1232052] INFO -- : checking size of struct stat.st_rdev... SIZEOF_DEV_T I, [2024-04-19T09:38:14.914222 #1232052] INFO -- : checking for struct stat.st_atim... yes I, [2024-04-19T09:38:14.914559 #1232052] INFO -- : checking for struct stat.st_atimespec... no I, [2024-04-19T09:38:14.914868 #1232052] INFO -- : checking for struct stat.st_atimensec... no I, [2024-04-19T09:38:14.915114 #1232052] INFO -- : checking for struct stat.st_mtim... yes I, [2024-04-19T09:38:14.915335 #1232052] INFO -- : checking for struct stat.st_mtimespec... no I, [2024-04-19T09:38:14.915563 #1232052] INFO -- : checking for struct stat.st_mtimensec... no I, [2024-04-19T09:38:14.915855 #1232052] INFO -- : checking for struct stat.st_ctim... yes I, [2024-04-19T09:38:14.916087 #1232052] INFO -- : checking for struct stat.st_ctimespec... no I, [2024-04-19T09:38:14.916303 #1232052] INFO -- : checking for struct stat.st_ctimensec... no I, [2024-04-19T09:38:14.916512 #1232052] INFO -- : checking for struct stat.st_birthtimespec... no I, [2024-04-19T09:38:14.916721 #1232052] INFO -- : checking for struct statx.stx_btime... yes I, [2024-04-19T09:38:14.916920 #1232052] INFO -- : checking for struct timeval... yes I, [2024-04-19T09:38:14.917103 #1232052] INFO -- : checking size of struct timeval.tv_sec... SIZEOF_TIME_T I, [2024-04-19T09:38:14.917284 #1232052] INFO -- : checking for struct timespec... yes I, [2024-04-19T09:38:14.917467 #1232052] INFO -- : checking for struct timezone... yes I, [2024-04-19T09:38:14.917722 #1232052] INFO -- : checking for fd_mask... yes I, [2024-04-19T09:38:14.917953 #1232052] INFO -- : checking for int8_t... yes I, [2024-04-19T09:38:14.918150 #1232052] INFO -- : checking size of int8_t... 1 I, [2024-04-19T09:38:14.918343 #1232052] INFO -- : checking for uint8_t... yes I, [2024-04-19T09:38:14.918606 #1232052] INFO -- : checking size of uint8_t... 1 I, [2024-04-19T09:38:14.918853 #1232052] INFO -- : checking for int16_t... yes I, [2024-04-19T09:38:14.919072 #1232052] INFO -- : checking size of int16_t... 2 I, [2024-04-19T09:38:14.919280 #1232052] INFO -- : checking for uint16_t... yes I, [2024-04-19T09:38:14.919473 #1232052] INFO -- : checking size of uint16_t... 2 I, [2024-04-19T09:38:14.919683 #1232052] INFO -- : checking for int32_t... yes I, [2024-04-19T09:38:14.919943 #1232052] INFO -- : checking size of int32_t... 4 I, [2024-04-19T09:38:14.920160 #1232052] INFO -- : checking for uint32_t... yes I, [2024-04-19T09:38:14.920364 #1232052] INFO -- : checking size of uint32_t... 4 I, [2024-04-19T09:38:14.920573 #1232052] INFO -- : checking for int64_t... yes I, [2024-04-19T09:38:14.920770 #1232052] INFO -- : checking size of int64_t... 8 I, [2024-04-19T09:38:14.920962 #1232052] INFO -- : checking for uint64_t... yes I, [2024-04-19T09:38:14.921152 #1232052] INFO -- : checking size of uint64_t... 8 I, [2024-04-19T09:38:14.921359 #1232052] INFO -- : checking for int128_t... __int128 I, [2024-04-19T09:38:14.921778 #1232052] INFO -- : checking for uint128_t... unsigned __int128 I, [2024-04-19T09:38:14.922021 #1232052] INFO -- : checking for intptr_t... yes I, [2024-04-19T09:38:14.922371 #1232052] INFO -- : checking size of intptr_t... 8 I, [2024-04-19T09:38:14.922746 #1232052] INFO -- : checking for uintptr_t... yes I, [2024-04-19T09:38:14.922965 #1232052] INFO -- : checking size of uintptr_t... 8 I, [2024-04-19T09:38:14.923273 #1232052] INFO -- : checking for printf prefix for intptr_t... NONE I, [2024-04-19T09:38:14.923644 #1232052] INFO -- : checking for ssize_t... yes I, [2024-04-19T09:38:14.923979 #1232052] INFO -- : checking size of ssize_t... 8 I, [2024-04-19T09:38:14.924212 #1232052] INFO -- : checking for printf prefix for int64_t... NONE I, [2024-04-19T09:38:14.924460 #1232052] INFO -- : checking for stack end address... __libc_stack_end I, [2024-04-19T09:38:14.924776 #1232052] INFO -- : checking for grep that handles long lines and -e... /usr/bin/grep I, [2024-04-19T09:38:14.925076 #1232052] INFO -- : checking for egrep... /usr/bin/grep -E I, [2024-04-19T09:38:14.925426 #1232052] INFO -- : checking type of array argument to getgroups... gid_t I, [2024-04-19T09:38:14.925669 #1232052] INFO -- : checking for working alloca.h... yes I, [2024-04-19T09:38:14.925876 #1232052] INFO -- : checking for alloca... yes I, [2024-04-19T09:38:14.926059 #1232052] INFO -- : checking for dynamic size alloca... ok I, [2024-04-19T09:38:14.926236 #1232052] INFO -- : checking for working memcmp... yes I, [2024-04-19T09:38:14.926424 #1232052] INFO -- : checking for dup... yes I, [2024-04-19T09:38:14.926759 #1232052] INFO -- : checking for dup2... yes I, [2024-04-19T09:38:14.926984 #1232052] INFO -- : checking for acosh... yes I, [2024-04-19T09:38:14.927172 #1232052] INFO -- : checking for cbrt... yes I, [2024-04-19T09:38:14.927359 #1232052] INFO -- : checking for crypt... yes I, [2024-04-19T09:38:14.927608 #1232052] INFO -- : checking for erf... yes I, [2024-04-19T09:38:14.927823 #1232052] INFO -- : checking for explicit_bzero... yes I, [2024-04-19T09:38:14.928022 #1232052] INFO -- : checking for ffs... yes I, [2024-04-19T09:38:14.928222 #1232052] INFO -- : checking for flock... yes I, [2024-04-19T09:38:14.928428 #1232052] INFO -- : checking for hypot... yes I, [2024-04-19T09:38:14.928637 #1232052] INFO -- : checking for lgamma_r... yes I, [2024-04-19T09:38:14.928841 #1232052] INFO -- : checking for memmove... yes I, [2024-04-19T09:38:14.929034 #1232052] INFO -- : checking for nan... yes I, [2024-04-19T09:38:14.929248 #1232052] INFO -- : checking for nextafter... yes I, [2024-04-19T09:38:14.929450 #1232052] INFO -- : checking for setproctitle... no I, [2024-04-19T09:38:14.929689 #1232052] INFO -- : checking for strchr... yes I, [2024-04-19T09:38:14.929885 #1232052] INFO -- : checking for strerror... yes I, [2024-04-19T09:38:14.930084 #1232052] INFO -- : checking for strlcat... no I, [2024-04-19T09:38:14.930278 #1232052] INFO -- : checking for strlcpy... no I, [2024-04-19T09:38:14.930530 #1232052] INFO -- : checking for strstr... yes I, [2024-04-19T09:38:14.930796 #1232052] INFO -- : checking for tgamma... yes I, [2024-04-19T09:38:14.931021 #1232052] INFO -- : checking for sys/pstat.h... no I, [2024-04-19T09:38:14.931221 #1232052] INFO -- : checking for fork... yes I, [2024-04-19T09:38:14.931412 #1232052] INFO -- : checking for vfork... yes I, [2024-04-19T09:38:14.931606 #1232052] INFO -- : checking for working fork... yes I, [2024-04-19T09:38:14.931952 #1232052] INFO -- : checking for __syscall... no I, [2024-04-19T09:38:14.932084 #1232052] INFO -- : checking for _longjmp... yes I, [2024-04-19T09:38:14.932202 #1232052] INFO -- : checking for arc4random_buf... yes I, [2024-04-19T09:38:14.932300 #1232052] INFO -- : checking for atan2l... yes I, [2024-04-19T09:38:14.932406 #1232052] INFO -- : checking for atan2f... yes I, [2024-04-19T09:38:14.932562 #1232052] INFO -- : checking for chmod... yes I, [2024-04-19T09:38:14.932712 #1232052] INFO -- : checking for chown... yes I, [2024-04-19T09:38:14.932817 #1232052] INFO -- : checking for chroot... yes I, [2024-04-19T09:38:14.932916 #1232052] INFO -- : checking for chsize... no I, [2024-04-19T09:38:14.933047 #1232052] INFO -- : checking for clock_gettime... yes I, [2024-04-19T09:38:14.933172 #1232052] INFO -- : checking for copy_file_range... yes I, [2024-04-19T09:38:14.933291 #1232052] INFO -- : checking for cosh... yes I, [2024-04-19T09:38:14.933405 #1232052] INFO -- : checking for crypt_r... yes I, [2024-04-19T09:38:14.933569 #1232052] INFO -- : checking for dirfd... yes I, [2024-04-19T09:38:14.933685 #1232052] INFO -- : checking for dl_iterate_phdr... yes I, [2024-04-19T09:38:14.933787 #1232052] INFO -- : checking for dlopen... yes I, [2024-04-19T09:38:14.933893 #1232052] INFO -- : checking for dladdr... yes I, [2024-04-19T09:38:14.933990 #1232052] INFO -- : checking for dup3... yes I, [2024-04-19T09:38:14.934087 #1232052] INFO -- : checking for eaccess... yes I, [2024-04-19T09:38:14.934229 #1232052] INFO -- : checking for endgrent... yes I, [2024-04-19T09:38:14.934341 #1232052] INFO -- : checking for eventfd... yes I, [2024-04-19T09:38:14.934439 #1232052] INFO -- : checking for execl... yes I, [2024-04-19T09:38:14.934688 #1232052] INFO -- : checking for execle... yes I, [2024-04-19T09:38:14.934832 #1232052] INFO -- : checking for execv... yes I, [2024-04-19T09:38:14.934931 #1232052] INFO -- : checking for execve... yes I, [2024-04-19T09:38:14.935022 #1232052] INFO -- : checking for explicit_memset... no I, [2024-04-19T09:38:14.935112 #1232052] INFO -- : checking for fcopyfile... no I, [2024-04-19T09:38:14.935194 #1232052] INFO -- : checking for fchdir... yes I, [2024-04-19T09:38:14.935274 #1232052] INFO -- : checking for fchmod... yes I, [2024-04-19T09:38:14.935402 #1232052] INFO -- : checking for fchown... yes I, [2024-04-19T09:38:14.935520 #1232052] INFO -- : checking for fcntl... yes I, [2024-04-19T09:38:14.935621 #1232052] INFO -- : checking for fdatasync... yes I, [2024-04-19T09:38:14.935712 #1232052] INFO -- : checking for fdopendir... yes I, [2024-04-19T09:38:14.935800 #1232052] INFO -- : checking for fgetattrlist... no I, [2024-04-19T09:38:14.935888 #1232052] INFO -- : checking for fmod... yes I, [2024-04-19T09:38:14.935981 #1232052] INFO -- : checking for fstatat... yes I, [2024-04-19T09:38:14.936077 #1232052] INFO -- : checking for fsync... yes I, [2024-04-19T09:38:14.936169 #1232052] INFO -- : checking for ftruncate... yes I, [2024-04-19T09:38:14.936263 #1232052] INFO -- : checking for ftruncate64... yes I, [2024-04-19T09:38:14.936391 #1232052] INFO -- : checking for getattrlist... no I, [2024-04-19T09:38:14.936497 #1232052] INFO -- : checking for getcwd... yes I, [2024-04-19T09:38:14.936594 #1232052] INFO -- : checking for getegid... yes I, [2024-04-19T09:38:49.945713 #1232052] INFO -- : checking for getentropy... yes I, [2024-04-19T09:38:49.946138 #1232052] INFO -- : checking for geteuid... yes I, [2024-04-19T09:38:49.946368 #1232052] INFO -- : checking for getgid... yes I, [2024-04-19T09:38:49.946679 #1232052] INFO -- : checking for getgidx... no I, [2024-04-19T09:38:49.946919 #1232052] INFO -- : checking for getgrnam... yes I, [2024-04-19T09:38:49.947139 #1232052] INFO -- : checking for getgrnam_r... yes I, [2024-04-19T09:38:49.947360 #1232052] INFO -- : checking for getgroups... yes I, [2024-04-19T09:38:49.947682 #1232052] INFO -- : checking for getlogin... yes I, [2024-04-19T09:38:49.947904 #1232052] INFO -- : checking for getlogin_r... yes I, [2024-04-19T09:38:49.948193 #1232052] INFO -- : checking for getpgid... yes I, [2024-04-19T09:38:49.948506 #1232052] INFO -- : checking for getpgrp... yes I, [2024-04-19T09:38:49.948794 #1232052] INFO -- : checking for getppid... yes I, [2024-04-19T09:38:49.949022 #1232052] INFO -- : checking for getpriority... yes I, [2024-04-19T09:38:49.949263 #1232052] INFO -- : checking for getpwnam... yes I, [2024-04-19T09:38:49.949482 #1232052] INFO -- : checking for getpwnam_r... yes I, [2024-04-19T09:38:49.949706 #1232052] INFO -- : checking for getpwuid... yes I, [2024-04-19T09:38:49.949914 #1232052] INFO -- : checking for getpwuid_r... yes I, [2024-04-19T09:38:49.950181 #1232052] INFO -- : checking for getrandom... yes I, [2024-04-19T09:38:49.950400 #1232052] INFO -- : checking for getresgid... yes I, [2024-04-19T09:38:49.950803 #1232052] INFO -- : checking for getresuid... yes I, [2024-04-19T09:38:49.951027 #1232052] INFO -- : checking for getrlimit... yes I, [2024-04-19T09:38:49.951239 #1232052] INFO -- : checking for getsid... yes I, [2024-04-19T09:38:49.951552 #1232052] INFO -- : checking for gettimeofday... yes I, [2024-04-19T09:38:49.951766 #1232052] INFO -- : checking for getuid... yes I, [2024-04-19T09:38:49.951969 #1232052] INFO -- : checking for getuidx... no I, [2024-04-19T09:38:49.952161 #1232052] INFO -- : checking for gmtime_r... yes I, [2024-04-19T09:38:49.952369 #1232052] INFO -- : checking for initgroups... yes I, [2024-04-19T09:38:49.952642 #1232052] INFO -- : checking for ioctl... yes I, [2024-04-19T09:38:49.952845 #1232052] INFO -- : checking for isfinite... no I, [2024-04-19T09:38:49.953049 #1232052] INFO -- : checking for issetugid... no I, [2024-04-19T09:38:49.953254 #1232052] INFO -- : checking for kill... yes I, [2024-04-19T09:38:49.953463 #1232052] INFO -- : checking for killpg... yes I, [2024-04-19T09:38:49.953670 #1232052] INFO -- : checking for lchmod... yes I, [2024-04-19T09:38:49.953868 #1232052] INFO -- : checking for lchown... yes I, [2024-04-19T09:38:49.954083 #1232052] INFO -- : checking for link... yes I, [2024-04-19T09:38:49.954289 #1232052] INFO -- : checking for llabs... yes I, [2024-04-19T09:38:49.954610 #1232052] INFO -- : checking for lockf... yes I, [2024-04-19T09:38:49.954892 #1232052] INFO -- : checking for log2... yes I, [2024-04-19T09:38:49.955121 #1232052] INFO -- : checking for lstat... yes I, [2024-04-19T09:38:49.955330 #1232052] INFO -- : checking for lutimes... yes I, [2024-04-19T09:38:49.955539 #1232052] INFO -- : checking for malloc_usable_size... yes I, [2024-04-19T09:38:49.955727 #1232052] INFO -- : checking for malloc_size... no I, [2024-04-19T09:38:49.955924 #1232052] INFO -- : checking for malloc_trim... yes I, [2024-04-19T09:38:49.956153 #1232052] INFO -- : checking for mblen... yes I, [2024-04-19T09:38:49.956367 #1232052] INFO -- : checking for memalign... yes I, [2024-04-19T09:38:49.956569 #1232052] INFO -- : checking for memset_s... no I, [2024-04-19T09:38:49.956807 #1232052] INFO -- : checking for writev... yes I, [2024-04-19T09:38:49.957031 #1232052] INFO -- : checking for memrchr... yes I, [2024-04-19T09:38:49.957251 #1232052] INFO -- : checking for memmem... yes I, [2024-04-19T09:38:49.957461 #1232052] INFO -- : checking for mkfifo... yes I, [2024-04-19T09:38:49.957683 #1232052] INFO -- : checking for mknod... yes I, [2024-04-19T09:38:49.957917 #1232052] INFO -- : checking for mktime... yes I, [2024-04-19T09:38:49.958120 #1232052] INFO -- : checking for mmap... yes I, [2024-04-19T09:38:49.958399 #1232052] INFO -- : checking for mremap... yes I, [2024-04-19T09:38:49.958947 #1232052] INFO -- : checking for openat... yes I, [2024-04-19T09:38:49.959266 #1232052] INFO -- : checking for pclose... yes I, [2024-04-19T09:38:49.959580 #1232052] INFO -- : checking for pipe... yes I, [2024-04-19T09:38:49.959808 #1232052] INFO -- : checking for pipe2... yes I, [2024-04-19T09:38:49.959993 #1232052] INFO -- : checking for poll... yes I, [2024-04-19T09:38:49.960174 #1232052] INFO -- : checking for popen... yes I, [2024-04-19T09:38:49.960354 #1232052] INFO -- : checking for posix_fadvise... yes I, [2024-04-19T09:38:49.960554 #1232052] INFO -- : checking for posix_madvise... yes I, [2024-04-19T09:38:49.960765 #1232052] INFO -- : checking for posix_memalign... yes I, [2024-04-19T09:38:49.960961 #1232052] INFO -- : checking for ppoll... yes I, [2024-04-19T09:38:49.961151 #1232052] INFO -- : checking for pread... yes I, [2024-04-19T09:38:49.961342 #1232052] INFO -- : checking for pwrite... yes I, [2024-04-19T09:38:49.963599 #1232052] INFO -- : checking for qsort_r... yes I, [2024-04-19T09:38:49.963809 #1232052] INFO -- : checking for qsort_s... no I, [2024-04-19T09:38:49.963998 #1232052] INFO -- : checking for readlink... yes I, [2024-04-19T09:38:49.964181 #1232052] INFO -- : checking for realpath... yes I, [2024-04-19T09:38:49.964362 #1232052] INFO -- : checking for round... yes I, [2024-04-19T09:38:49.964551 #1232052] INFO -- : checking for sched_getaffinity... yes I, [2024-04-19T09:38:49.964735 #1232052] INFO -- : checking for seekdir... yes I, [2024-04-19T09:38:49.965071 #1232052] INFO -- : checking for select_large_fdset... no I, [2024-04-19T09:38:49.965311 #1232052] INFO -- : checking for sendfile... yes I, [2024-04-19T09:38:49.965515 #1232052] INFO -- : checking for setegid... yes I, [2024-04-19T09:38:49.965716 #1232052] INFO -- : checking for setenv... yes I, [2024-04-19T09:38:49.965912 #1232052] INFO -- : checking for seteuid... yes I, [2024-04-19T09:38:49.966118 #1232052] INFO -- : checking for setgid... yes I, [2024-04-19T09:38:49.966238 #1232052] INFO -- : checking for setgroups... yes I, [2024-04-19T09:38:49.966338 #1232052] INFO -- : checking for setpgid... yes I, [2024-04-19T09:38:49.966464 #1232052] INFO -- : checking for setpgrp... yes I, [2024-04-19T09:38:49.966676 #1232052] INFO -- : checking for setregid... yes I, [2024-04-19T09:38:49.966828 #1232052] INFO -- : checking for setresgid... yes I, [2024-04-19T09:38:49.966984 #1232052] INFO -- : checking for setresuid... yes I, [2024-04-19T09:38:49.967090 #1232052] INFO -- : checking for setreuid... yes I, [2024-04-19T09:38:49.967187 #1232052] INFO -- : checking for setrgid... no I, [2024-04-19T09:38:49.967286 #1232052] INFO -- : checking for setrlimit... yes I, [2024-04-19T09:38:49.967387 #1232052] INFO -- : checking for setruid... no I, [2024-04-19T09:38:49.967496 #1232052] INFO -- : checking for setsid... yes I, [2024-04-19T09:38:49.967645 #1232052] INFO -- : checking for setuid... yes I, [2024-04-19T09:38:49.967780 #1232052] INFO -- : checking for shutdown... yes I, [2024-04-19T09:38:49.967900 #1232052] INFO -- : checking for sigaction... yes I, [2024-04-19T09:38:49.968009 #1232052] INFO -- : checking for sigaltstack... yes I, [2024-04-19T09:38:49.968119 #1232052] INFO -- : checking for sigprocmask... yes I, [2024-04-19T09:38:49.968220 #1232052] INFO -- : checking for sinh... yes I, [2024-04-19T09:38:49.968321 #1232052] INFO -- : checking for snprintf... yes I, [2024-04-19T09:38:49.968431 #1232052] INFO -- : checking for spawnv... no I, [2024-04-19T09:38:49.968528 #1232052] INFO -- : checking for symlink... yes I, [2024-04-19T09:38:49.968615 #1232052] INFO -- : checking for syscall... yes I, [2024-04-19T09:38:49.968767 #1232052] INFO -- : checking for sysconf... yes I, [2024-04-19T09:38:49.968882 #1232052] INFO -- : checking for system... yes I, [2024-04-19T09:38:49.968973 #1232052] INFO -- : checking for tanh... yes I, [2024-04-19T09:38:49.969094 #1232052] INFO -- : checking for telldir... yes I, [2024-04-19T09:38:49.969239 #1232052] INFO -- : checking for timegm... yes I, [2024-04-19T09:38:49.969380 #1232052] INFO -- : checking for times... yes I, [2024-04-19T09:38:49.969506 #1232052] INFO -- : checking for truncate... yes I, [2024-04-19T09:38:49.969609 #1232052] INFO -- : checking for truncate64... yes I, [2024-04-19T09:38:49.969707 #1232052] INFO -- : checking for tzset... yes I, [2024-04-19T09:38:49.969789 #1232052] INFO -- : checking for umask... yes I, [2024-04-19T09:38:49.969901 #1232052] INFO -- : checking for unsetenv... yes I, [2024-04-19T09:38:49.969989 #1232052] INFO -- : checking for utimensat... yes I, [2024-04-19T09:38:49.970077 #1232052] INFO -- : checking for utimes... yes I, [2024-04-19T09:38:49.970178 #1232052] INFO -- : checking for wait4... yes I, [2024-04-19T09:38:49.970271 #1232052] INFO -- : checking for waitpid... yes I, [2024-04-19T09:38:49.970358 #1232052] INFO -- : checking for __cospi... no I, [2024-04-19T09:38:49.970443 #1232052] INFO -- : checking for __sinpi... no I, [2024-04-19T09:38:49.970611 #1232052] INFO -- : checking for statx... yes I, [2024-04-19T09:38:49.970736 #1232052] INFO -- : checking if getcwd allocates buffer if NULL is given... yes I, [2024-04-19T09:38:49.970833 #1232052] INFO -- : checking for crypt.h... yes I, [2024-04-19T09:38:49.970961 #1232052] INFO -- : checking for struct crypt_data.initialized... yes I, [2024-04-19T09:38:49.971068 #1232052] INFO -- : checking for __builtin_alloca_with_align... yes I, [2024-04-19T09:38:49.971173 #1232052] INFO -- : checking for __builtin_assume_aligned... yes I, [2024-04-19T09:38:49.971321 #1232052] INFO -- : checking for __builtin_bswap16... yes I, [2024-04-19T09:38:49.971429 #1232052] INFO -- : checking for __builtin_bswap32... yes I, [2024-04-19T09:38:49.971529 #1232052] INFO -- : checking for __builtin_bswap64... yes I, [2024-04-19T09:38:49.971627 #1232052] INFO -- : checking for __builtin_popcount... yes I, [2024-04-19T09:38:49.971718 #1232052] INFO -- : checking for __builtin_popcountll... yes I, [2024-04-19T09:38:49.971803 #1232052] INFO -- : checking for __builtin_clz... yes I, [2024-04-19T09:38:49.971887 #1232052] INFO -- : checking for __builtin_clzl... yes I, [2024-04-19T09:38:49.972004 #1232052] INFO -- : checking for __builtin_clzll... yes I, [2024-04-19T09:38:49.972095 #1232052] INFO -- : checking for __builtin_ctz... yes I, [2024-04-19T09:38:49.972180 #1232052] INFO -- : checking for __builtin_ctzll... yes I, [2024-04-19T09:38:49.972265 #1232052] INFO -- : checking for __builtin_add_overflow... yes I, [2024-04-19T09:38:49.972346 #1232052] INFO -- : checking for __builtin_sub_overflow... yes I, [2024-04-19T09:38:49.972432 #1232052] INFO -- : checking for __builtin_mul_overflow... yes E, [2024-04-19T09:39:07.636066 #1232052] ERROR -- : In file included from conftest.c:4: E, [2024-04-19T09:39:07.636294 #1232052] ERROR -- : /tmp/ruby/src/trunk/version.h:25:39: error: invalid suffix "RUBY_RELEASE_MONTH" on integer constant E, [2024-04-19T09:39:07.636411 #1232052] ERROR -- : 25 | #define ONLY_ONE_DIGIT(x) TOKEN_PASTE(10,x) < 1000 E, [2024-04-19T09:39:07.636512 #1232052] ERROR -- : | ^~ E, [2024-04-19T09:39:07.636613 #1232052] ERROR -- : /tmp/ruby/src/trunk/version.h:23:26: note: in definition of macro 'TOKEN_PASTE' E, [2024-04-19T09:39:07.636727 #1232052] ERROR -- : 23 | #define TOKEN_PASTE(x,y) x##y E, [2024-04-19T09:39:07.636819 #1232052] ERROR -- : | ^ E, [2024-04-19T09:39:07.636904 #1232052] ERROR -- : /tmp/ruby/src/trunk/version.h:29:5: note: in expansion of macro 'ONLY_ONE_DIGIT' E, [2024-04-19T09:39:07.636991 #1232052] ERROR -- : 29 | #if ONLY_ONE_DIGIT(RUBY_RELEASE_MONTH) E, [2024-04-19T09:39:07.637075 #1232052] ERROR -- : | ^~~~~~~~~~~~~~ E, [2024-04-19T09:39:07.637172 #1232052] ERROR -- : /tmp/ruby/src/trunk/version.h:25:39: error: invalid suffix "RUBY_RELEASE_DAY" on integer constant E, [2024-04-19T09:39:07.637268 #1232052] ERROR -- : 25 | #define ONLY_ONE_DIGIT(x) TOKEN_PASTE(10,x) < 1000 E, [2024-04-19T09:39:07.637352 #1232052] ERROR -- : | ^~ E, [2024-04-19T09:39:07.637444 #1232052] ERROR -- : /tmp/ruby/src/trunk/version.h:23:26: note: in definition of macro 'TOKEN_PASTE' E, [2024-04-19T09:39:07.637530 #1232052] ERROR -- : 23 | #define TOKEN_PASTE(x,y) x##y E, [2024-04-19T09:39:07.637617 #1232052] ERROR -- : | ^ E, [2024-04-19T09:39:07.637698 #1232052] ERROR -- : /tmp/ruby/src/trunk/version.h:34:5: note: in expansion of macro 'ONLY_ONE_DIGIT' E, [2024-04-19T09:39:07.637781 #1232052] ERROR -- : 34 | #if ONLY_ONE_DIGIT(RUBY_RELEASE_DAY) E, [2024-04-19T09:39:07.637863 #1232052] ERROR -- : | ^~~~~~~~~~~~~~ I, [2024-04-19T09:39:08.971645 #1232052] INFO -- : checking for __builtin_mul_overflow_p... yes I, [2024-04-19T09:39:08.971889 #1232052] INFO -- : checking for __builtin_constant_p... yes I, [2024-04-19T09:39:08.972032 #1232052] INFO -- : checking for __builtin_choose_expr... yes I, [2024-04-19T09:39:08.972190 #1232052] INFO -- : checking for __builtin_choose_expr_constant_p... yes I, [2024-04-19T09:39:08.972311 #1232052] INFO -- : checking for __builtin_types_compatible_p... yes I, [2024-04-19T09:39:08.972421 #1232052] INFO -- : checking for __builtin_trap... yes I, [2024-04-19T09:39:08.972533 #1232052] INFO -- : checking for __builtin_expect... yes I, [2024-04-19T09:39:08.972657 #1232052] INFO -- : checking for __builtin_mul_overflow with long long arguments... yes I, [2024-04-19T09:39:08.972776 #1232052] INFO -- : checking whether qsort_r is GNU version... yes I, [2024-04-19T09:39:08.972986 #1232052] INFO -- : checking whether qsort_r is BSD version... no I, [2024-04-19T09:39:08.973138 #1232052] INFO -- : checking whether atan2 handles Inf as C99... yes I, [2024-04-19T09:39:08.973282 #1232052] INFO -- : checking for clock_getres... yes I, [2024-04-19T09:39:08.973513 #1232052] INFO -- : checking for timer_create in -lrt... yes I, [2024-04-19T09:39:08.973700 #1232052] INFO -- : checking for timer_settime in -lrt... yes I, [2024-04-19T09:39:08.973851 #1232052] INFO -- : checking for unsetenv returns a value... yes I, [2024-04-19T09:39:08.973996 #1232052] INFO -- : checking whether struct tm is in sys/time.h or time.h... time.h I, [2024-04-19T09:39:08.974158 #1232052] INFO -- : checking for struct tm.tm_zone... yes I, [2024-04-19T09:39:08.974304 #1232052] INFO -- : checking for struct tm.tm_gmtoff... yes I, [2024-04-19T09:39:08.974440 #1232052] INFO -- : checking for external int daylight... yes I, [2024-04-19T09:39:08.974750 #1232052] INFO -- : checking for negative time_t for gmtime(3)... yes I, [2024-04-19T09:39:08.974930 #1232052] INFO -- : checking for localtime(3) overflow correctly... yes I, [2024-04-19T09:39:08.975078 #1232052] INFO -- : checking for sig_t... yes I, [2024-04-19T09:39:08.975254 #1232052] INFO -- : checking whether right shift preserve sign bit... yes I, [2024-04-19T09:39:08.975399 #1232052] INFO -- : checking whether _SC_CLK_TCK is supported... yes I, [2024-04-19T09:39:08.975554 #1232052] INFO -- : checking stack growing direction on riscv64... -1 I, [2024-04-19T09:39:08.975717 #1232052] INFO -- : checking native coroutine implementation for riscv64-linux... riscv64 I, [2024-04-19T09:39:08.975854 #1232052] INFO -- : checking whether pthread_t is scalar type... yes I, [2024-04-19T09:39:08.975976 #1232052] INFO -- : checking for sched_yield... yes I, [2024-04-19T09:39:08.976120 #1232052] INFO -- : checking for pthread_attr_setinheritsched... yes I, [2024-04-19T09:39:08.976241 #1232052] INFO -- : checking for pthread_attr_get_np... no I, [2024-04-19T09:39:08.976351 #1232052] INFO -- : checking for pthread_attr_getstack... yes I, [2024-04-19T09:39:08.976498 #1232052] INFO -- : checking for pthread_attr_getguardsize... yes I, [2024-04-19T09:39:08.976621 #1232052] INFO -- : checking for pthread_get_stackaddr_np... no I, [2024-04-19T09:39:08.976737 #1232052] INFO -- : checking for pthread_get_stacksize_np... no I, [2024-04-19T09:39:08.976863 #1232052] INFO -- : checking for thr_stksegment... no I, [2024-04-19T09:39:08.976977 #1232052] INFO -- : checking for pthread_stackseg_np... no I, [2024-04-19T09:39:08.977098 #1232052] INFO -- : checking for pthread_getthrds_np... no I, [2024-04-19T09:39:08.977214 #1232052] INFO -- : checking for pthread_condattr_setclock... yes I, [2024-04-19T09:39:08.977335 #1232052] INFO -- : checking for pthread_setname_np... yes I, [2024-04-19T09:39:08.977453 #1232052] INFO -- : checking for pthread_set_name_np... no I, [2024-04-19T09:39:08.977569 #1232052] INFO -- : checking for pthread_sigmask... yes I, [2024-04-19T09:39:08.977727 #1232052] INFO -- : checking for pthread_getattr_np... yes I, [2024-04-19T09:39:08.977845 #1232052] INFO -- : checking arguments of pthread_setname_np... (pthread_self(), name) I, [2024-04-19T09:39:08.977951 #1232052] INFO -- : checking for thread-local storage sepcifier... _Thread_local I, [2024-04-19T09:39:08.978061 #1232052] INFO -- : checking if mcontext_t is a pointer... no I, [2024-04-19T09:39:08.978180 #1232052] INFO -- : checking for getcontext... yes I, [2024-04-19T09:39:08.978292 #1232052] INFO -- : checking for setcontext... yes I, [2024-04-19T09:39:08.978396 #1232052] INFO -- : checking if fork works with pthread... yes I, [2024-04-19T09:39:08.978555 #1232052] INFO -- : checking for sys/user.h... yes I, [2024-04-19T09:39:08.978692 #1232052] INFO -- : checking whether PAGE_SIZE is compile-time const... no I, [2024-04-19T09:39:08.978842 #1232052] INFO -- : checking ioctl request type... unsigned long I, [2024-04-19T09:39:08.979050 #1232052] INFO -- : checking for elf.h... yes I, [2024-04-19T09:39:08.979179 #1232052] INFO -- : checking for elf_abi.h... no I, [2024-04-19T09:39:08.979313 #1232052] INFO -- : checking for uncompress in -lz... yes I, [2024-04-19T09:39:08.979437 #1232052] INFO -- : checking for mach-o/loader.h... no I, [2024-04-19T09:39:08.979555 #1232052] INFO -- : checking whether OS depend dynamic link works... yes I, [2024-04-19T09:39:08.979670 #1232052] INFO -- : checking for backtrace... yes I, [2024-04-19T09:39:08.979791 #1232052] INFO -- : checking for broken backtrace... no I, [2024-04-19T09:39:08.979928 #1232052] INFO -- : checking for valgrind/memcheck.h... yes I, [2024-04-19T09:39:08.980046 #1232052] INFO -- : checking for strip flags... -S -x I, [2024-04-19T09:39:08.980243 #1232052] INFO -- : checking whether -Wl,--no-as-needed is accepted as LDFLAGS... yes I, [2024-04-19T09:39:08.980449 #1232052] INFO -- : checking whether -Wl,--no-undefined is accepted as LDFLAGS... yes I, [2024-04-19T09:39:08.980610 #1232052] INFO -- : checking whether wrapper for LD_LIBRARY_PATH is needed... no I, [2024-04-19T09:39:08.980757 #1232052] INFO -- : checking whether dtrace USDT is available... no I, [2024-04-19T09:39:08.980898 #1232052] INFO -- : checking for __builtin_setjmp... yes with cast () I, [2024-04-19T09:39:08.981056 #1232052] INFO -- : checking for _setjmpex as a macro or function... no I, [2024-04-19T09:39:08.981200 #1232052] INFO -- : checking for _setjmp as a macro or function... yes I, [2024-04-19T09:39:08.981326 #1232052] INFO -- : checking for sigsetjmp as a macro or function... no I, [2024-04-19T09:39:08.981518 #1232052] INFO -- : checking for setjmp type... __builtin_setjmp I, [2024-04-19T09:39:08.981767 #1232052] INFO -- : checking if Ruby is build with shared GC support... no I, [2024-04-19T09:39:08.981950 #1232052] INFO -- : checking for rustc... rustc I, [2024-04-19T09:39:08.982114 #1232052] INFO -- : checking whether rustc works for YJIT... no I, [2024-04-19T09:39:08.982305 #1232052] INFO -- : checking for prefix of external symbols... NONE I, [2024-04-19T09:39:08.982532 #1232052] INFO -- : checking for default symbols in empty shared library... I, [2024-04-19T09:39:08.982781 #1232052] INFO -- : checking if make is GNU make... yes I, [2024-04-19T09:39:08.982983 #1232052] INFO -- : .ext/include/riscv64-linux/ruby/config.h unchanged I, [2024-04-19T09:39:08.983133 #1232052] INFO -- : configure: ruby library version = 3.4.0+0 I, [2024-04-19T09:39:08.983273 #1232052] INFO -- : configure: creating ./config.status I, [2024-04-19T09:39:08.983456 #1232052] INFO -- : --- I, [2024-04-19T09:39:08.983617 #1232052] INFO -- : Configuration summary for ruby version 3.4.0 I, [2024-04-19T09:39:08.983763 #1232052] INFO -- : I, [2024-04-19T09:39:08.983922 #1232052] INFO -- : * Installation prefix: /tmp/ruby/install/trunk I, [2024-04-19T09:39:08.984048 #1232052] INFO -- : * exec prefix: ${prefix} I, [2024-04-19T09:39:08.984169 #1232052] INFO -- : * arch: riscv64-linux I, [2024-04-19T09:39:08.984300 #1232052] INFO -- : * site arch: ${arch} I, [2024-04-19T09:39:08.984440 #1232052] INFO -- : * RUBY_BASE_NAME: ruby I, [2024-04-19T09:39:08.984574 #1232052] INFO -- : * enable shared: yes I, [2024-04-19T09:39:08.984702 #1232052] INFO -- : * ruby lib prefix: ${libdir}/${RUBY_BASE_NAME} I, [2024-04-19T09:39:08.984887 #1232052] INFO -- : * site libraries path: ${rubylibprefix}/${sitearch} I, [2024-04-19T09:39:08.985051 #1232052] INFO -- : * vendor path: ${rubylibprefix}/vendor_ruby I, [2024-04-19T09:39:08.985195 #1232052] INFO -- : * target OS: linux I, [2024-04-19T09:39:08.985327 #1232052] INFO -- : * compiler: gcc I, [2024-04-19T09:39:08.985474 #1232052] INFO -- : * with thread: pthread I, [2024-04-19T09:39:08.985604 #1232052] INFO -- : * with coroutine: riscv64 I, [2024-04-19T09:39:08.985729 #1232052] INFO -- : * with shared GC: no I, [2024-04-19T09:39:08.985872 #1232052] INFO -- : * enable shared libs: yes I, [2024-04-19T09:39:09.466237 #1232052] INFO -- : * dynamic library ext: so I, [2024-04-19T09:39:09.466707 #1232052] INFO -- : * CFLAGS: ${optflags} ${debugflags} ${warnflags} I, [2024-04-19T09:39:09.467021 #1232052] INFO -- : * LDFLAGS: -L. -fstack-protector-strong -rdynamic \ I, [2024-04-19T09:39:09.467248 #1232052] INFO -- : -Wl,-export-dynamic -Wl,--no-as-needed I, [2024-04-19T09:39:09.467544 #1232052] INFO -- : * DLDFLAGS: -Wl,--compress-debug-sections=zlib I, [2024-04-19T09:39:09.467795 #1232052] INFO -- : * optflags: -O3 -fno-fast-math I, [2024-04-19T09:39:09.468005 #1232052] INFO -- : * debugflags: -ggdb3 I, [2024-04-19T09:39:09.468213 #1232052] INFO -- : * warnflags: -Wall -Wextra -Wdeprecated-declarations \ I, [2024-04-19T09:39:09.468449 #1232052] INFO -- : -Wdiv-by-zero -Wduplicated-cond \ I, [2024-04-19T09:39:09.468653 #1232052] INFO -- : -Wimplicit-function-declaration -Wimplicit-int \ I, [2024-04-19T09:39:09.468918 #1232052] INFO -- : -Wpointer-arith -Wwrite-strings \ I, [2024-04-19T09:39:09.469155 #1232052] INFO -- : -Wold-style-definition -Wimplicit-fallthrough=0 \ I, [2024-04-19T09:39:09.469384 #1232052] INFO -- : -Wmissing-noreturn -Wno-cast-function-type \ I, [2024-04-19T09:39:09.469614 #1232052] INFO -- : -Wno-constant-logical-operand -Wno-long-long \ I, [2024-04-19T09:39:09.469820 #1232052] INFO -- : -Wno-missing-field-initializers \ I, [2024-04-19T09:39:09.470053 #1232052] INFO -- : -Wno-overlength-strings \ I, [2024-04-19T09:39:09.470337 #1232052] INFO -- : -Wno-packed-bitfield-compat \ I, [2024-04-19T09:39:09.470715 #1232052] INFO -- : -Wno-parentheses-equality -Wno-self-assign \ I, [2024-04-19T09:39:09.471001 #1232052] INFO -- : -Wno-tautological-compare -Wno-unused-parameter \ I, [2024-04-19T09:39:09.471322 #1232052] INFO -- : -Wno-unused-value -Wsuggest-attribute=format \ I, [2024-04-19T09:39:09.471554 #1232052] INFO -- : -Wsuggest-attribute=noreturn -Wunused-variable \ I, [2024-04-19T09:39:09.471725 #1232052] INFO -- : -Wmisleading-indentation -Wundef I, [2024-04-19T09:39:09.471861 #1232052] INFO -- : * strip command: strip -S -x I, [2024-04-19T09:39:09.471987 #1232052] INFO -- : * install doc: no I, [2024-04-19T09:39:09.472132 #1232052] INFO -- : * YJIT support: no I, [2024-04-19T09:39:09.472299 #1232052] INFO -- : * RJIT support: no I, [2024-04-19T09:39:09.472450 #1232052] INFO -- : * man page type: doc I, [2024-04-19T09:39:09.472619 #1232052] INFO -- : * BASERUBY -v: ruby 3.1.2p20 (2022-04-12 revision 4491bb740a) \ I, [2024-04-19T09:39:09.472770 #1232052] INFO -- : [riscv64-linux-gnu] I, [2024-04-19T09:39:09.472944 #1232052] INFO -- : I, [2024-04-19T09:39:09.473102 #1232052] INFO -- : --- I, [2024-04-19T09:39:09.475604 #1232052] INFO -- : MAKE=make /bin/sh ./config.status Makefile I, [2024-04-19T09:39:09.476553 #1232052] INFO -- : MAKE=make /bin/sh ./config.status GNUmakefile I, [2024-04-19T09:39:09.561556 #1232052] INFO -- : config.status: creating Makefile I, [2024-04-19T09:39:09.563002 #1232052] INFO -- : config.status: creating GNUmakefile I, [2024-04-19T09:39:09.596364 #1232052] INFO -- : GNUmakefile unchanged I, [2024-04-19T09:39:10.538549 #1232052] INFO -- : generating /tmp/ruby/src/trunk/ext/rbconfig/sizeof/sizes.c I, [2024-04-19T09:39:10.569610 #1232052] INFO -- : make[1]: Entering directory '/tmp/ruby/src/trunk/ext/rbconfig/sizeof' I, [2024-04-19T09:39:10.690696 #1232052] INFO -- : /tmp/ruby/src/trunk/revision.h updated I, [2024-04-19T09:39:10.697819 #1232052] INFO -- : generating riscv64-linux-fake.rb I, [2024-04-19T09:39:10.727972 #1232052] INFO -- : sizes.c updated I, [2024-04-19T09:39:10.732033 #1232052] INFO -- : make[1]: Leaving directory '/tmp/ruby/src/trunk/ext/rbconfig/sizeof' I, [2024-04-19T09:39:11.163137 #1232052] INFO -- : riscv64-linux-fake.rb updated I, [2024-04-19T09:39:12.725776 #1232052] INFO -- : /bin/sh /tmp/ruby/src/trunk/tool/ifchange "--timestamp=.rbconfig.time" rbconfig.rb rbconfig.tmp I, [2024-04-19T09:39:12.733078 #1232052] INFO -- : rbconfig.rb unchanged I, [2024-04-19T09:39:12.738264 #1232052] INFO -- : generating enc.mk I, [2024-04-19T09:39:14.299401 #1232052] INFO -- : making srcs under enc I, [2024-04-19T09:39:14.604796 #1232052] INFO -- : make[1]: Entering directory '/tmp/ruby/build/trunk' I, [2024-04-19T09:39:14.605070 #1232052] INFO -- : make[1]: Nothing to be done for 'srcs'. I, [2024-04-19T09:39:14.605303 #1232052] INFO -- : make[1]: Leaving directory '/tmp/ruby/build/trunk' I, [2024-04-19T09:39:15.262515 #1232052] INFO -- : Update minitest to ea9caafc0754b1d6236a490d59e624b53209734a I, [2024-04-19T09:39:15.263476 #1232052] INFO -- : Update power_assert to 84e85124c5014a139af39161d484156cfe87a9ed I, [2024-04-19T09:39:15.266554 #1232052] INFO -- : Update typeprof to b19a6416da3a05d57fadd6ffdadb382b6d236ca5 I, [2024-04-19T09:39:15.267478 #1232052] INFO -- : Update rbs to ba7872795d5de04adb8ff500c0e6afdc81a041dd I, [2024-04-19T09:39:15.273808 #1232052] INFO -- : echo ea9caafc0754b1d6236a490d59e624b53209734a | /bin/sh /tmp/ruby/src/trunk/tool/ifchange /tmp/ruby/src/trunk/.bundle/.timestamp/minitest.revision - I, [2024-04-19T09:39:15.274839 #1232052] INFO -- : echo 84e85124c5014a139af39161d484156cfe87a9ed | /bin/sh /tmp/ruby/src/trunk/tool/ifchange /tmp/ruby/src/trunk/.bundle/.timestamp/power_assert.revision - I, [2024-04-19T09:39:15.280062 #1232052] INFO -- : echo ba7872795d5de04adb8ff500c0e6afdc81a041dd | /bin/sh /tmp/ruby/src/trunk/tool/ifchange /tmp/ruby/src/trunk/.bundle/.timestamp/rbs.revision - I, [2024-04-19T09:39:15.283587 #1232052] INFO -- : echo b19a6416da3a05d57fadd6ffdadb382b6d236ca5 | /bin/sh /tmp/ruby/src/trunk/tool/ifchange /tmp/ruby/src/trunk/.bundle/.timestamp/typeprof.revision - I, [2024-04-19T09:39:15.285356 #1232052] INFO -- : /tmp/ruby/src/trunk/.bundle/.timestamp/minitest.revision unchanged I, [2024-04-19T09:39:15.287414 #1232052] INFO -- : /tmp/ruby/src/trunk/.bundle/.timestamp/power_assert.revision unchanged I, [2024-04-19T09:39:15.292627 #1232052] INFO -- : /tmp/ruby/src/trunk/.bundle/.timestamp/rbs.revision unchanged I, [2024-04-19T09:39:15.296201 #1232052] INFO -- : /tmp/ruby/src/trunk/.bundle/.timestamp/typeprof.revision unchanged I, [2024-04-19T09:39:16.102282 #1232052] INFO -- : Building power_assert@84e85124c5014a139af39161d484156cfe87a9ed to /tmp/ruby/src/trunk/gems/power_assert-2.0.3.gem I, [2024-04-19T09:39:17.072472 #1232052] INFO -- : Successfully built RubyGem I, [2024-04-19T09:39:17.072682 #1232052] INFO -- : Name: power_assert I, [2024-04-19T09:39:17.072783 #1232052] INFO -- : Version: 2.0.4dev I, [2024-04-19T09:39:17.072881 #1232052] INFO -- : File: power_assert-2.0.4dev.gem I, [2024-04-19T09:39:17.088373 #1232052] INFO -- : Extracting bundle gem power_assert-2.0.3... I, [2024-04-19T09:39:17.971450 #1232052] INFO -- : Try with hash version of bundled gems instead of gems/power_assert-2.0.3.gem. We don't use this gem with release version of Ruby. I, [2024-04-19T09:39:18.027411 #1232052] INFO -- : Unpacked gems/power_assert-2.0.4dev.gem I, [2024-04-19T09:39:18.043229 #1232052] INFO -- : $$$[end] "make after-update -j4" exit with 0. I, [2024-04-19T09:39:18.044174 #1232052] INFO -- : $$$[beg] make miniruby -j4 I, [2024-04-19T09:39:18.571221 #1232052] INFO -- : BASERUBY = /usr/bin/ruby --disable=gems I, [2024-04-19T09:39:18.571461 #1232052] INFO -- : CC = gcc I, [2024-04-19T09:39:18.571581 #1232052] INFO -- : LD = ld I, [2024-04-19T09:39:18.571713 #1232052] INFO -- : LDSHARED = gcc -shared I, [2024-04-19T09:39:18.571828 #1232052] INFO -- : CFLAGS = -O3 -fno-fast-math -ggdb3 -Wall -Wextra -Wdeprecated-declarations -Wdiv-by-zero -Wduplicated-cond -Wimplicit-function-declaration -Wimplicit-int -Wpointer-arith -Wwrite-strings -Wold-style-definition -Wimplicit-fallthrough=0 -Wmissing-noreturn -Wno-cast-function-type -Wno-constant-logical-operand -Wno-long-long -Wno-missing-field-initializers -Wno-overlength-strings -Wno-packed-bitfield-compat -Wno-parentheses-equality -Wno-self-assign -Wno-tautological-compare -Wno-unused-parameter -Wno-unused-value -Wsuggest-attribute=format -Wsuggest-attribute=noreturn -Wunused-variable -Wmisleading-indentation -Wundef -fPIC I, [2024-04-19T09:39:18.571999 #1232052] INFO -- : XCFLAGS = -U_FORTIFY_SOURCE -D_FORTIFY_SOURCE=2 -fstack-protector-strong -fno-strict-overflow -fvisibility=hidden -fexcess-precision=standard -DRUBY_EXPORT -I. -I.ext/include/riscv64-linux -I/tmp/ruby/src/trunk/include -I/tmp/ruby/src/trunk -I/tmp/ruby/src/trunk/prism -I/tmp/ruby/src/trunk/enc/unicode/15.0.0 I, [2024-04-19T09:39:18.572112 #1232052] INFO -- : CPPFLAGS = I, [2024-04-19T09:39:18.572229 #1232052] INFO -- : DLDFLAGS = -Wl,--compress-debug-sections=zlib -Wl,-soname,libruby.so.3.4 -fstack-protector-strong I, [2024-04-19T09:39:18.572339 #1232052] INFO -- : SOLIBS = -lz -lrt -lrt -lgmp -ldl -lcrypt -lm -lpthread I, [2024-04-19T09:39:18.572444 #1232052] INFO -- : LANG = I, [2024-04-19T09:39:18.572552 #1232052] INFO -- : LC_ALL = I, [2024-04-19T09:39:18.572655 #1232052] INFO -- : LC_CTYPE = I, [2024-04-19T09:39:18.575164 #1232052] INFO -- : MFLAGS = -j4 --jobserver-auth=4,5 I, [2024-04-19T09:39:18.575319 #1232052] INFO -- : RUSTC = rustc I, [2024-04-19T09:39:18.575423 #1232052] INFO -- : YJIT_RUSTC_ARGS = --crate-name=yjit --crate-type=staticlib --edition=2021 -g -C lto=thin -C opt-level=3 -C overflow-checks=on '--out-dir=/tmp/ruby/build/trunk/yjit/target/release/' /tmp/ruby/src/trunk/yjit/src/lib.rs I, [2024-04-19T09:39:18.590203 #1232052] INFO -- : gcc (Debian 13.2.0-4revyos1) 13.2.0 I, [2024-04-19T09:39:18.590417 #1232052] INFO -- : Copyright (C) 2023 Free Software Foundation, Inc. I, [2024-04-19T09:39:18.590574 #1232052] INFO -- : This is free software; see the source for copying conditions. There is NO I, [2024-04-19T09:39:18.590688 #1232052] INFO -- : warranty; not even for MERCHANTABILITY or FITNESS FOR A PARTICULAR PURPOSE. I, [2024-04-19T09:39:18.590804 #1232052] INFO -- : I, [2024-04-19T09:39:18.818465 #1232052] INFO -- : compiling /tmp/ruby/src/trunk/version.c I, [2024-04-19T09:39:19.957637 #1232052] INFO -- : linking miniruby I, [2024-04-19T09:39:59.952640 #1232052] INFO -- : $$$[end] "make miniruby -j4" exit with 0. I, [2024-04-19T09:39:59.953291 #1232052] INFO -- : $$$[beg] make ruby -j4 I, [2024-04-19T09:40:00.463653 #1232052] INFO -- : BASERUBY = /usr/bin/ruby --disable=gems I, [2024-04-19T09:40:00.463907 #1232052] INFO -- : CC = gcc I, [2024-04-19T09:40:00.464036 #1232052] INFO -- : LD = ld I, [2024-04-19T09:40:00.464167 #1232052] INFO -- : LDSHARED = gcc -shared I, [2024-04-19T09:40:00.464312 #1232052] INFO -- : CFLAGS = -O3 -fno-fast-math -ggdb3 -Wall -Wextra -Wdeprecated-declarations -Wdiv-by-zero -Wduplicated-cond -Wimplicit-function-declaration -Wimplicit-int -Wpointer-arith -Wwrite-strings -Wold-style-definition -Wimplicit-fallthrough=0 -Wmissing-noreturn -Wno-cast-function-type -Wno-constant-logical-operand -Wno-long-long -Wno-missing-field-initializers -Wno-overlength-strings -Wno-packed-bitfield-compat -Wno-parentheses-equality -Wno-self-assign -Wno-tautological-compare -Wno-unused-parameter -Wno-unused-value -Wsuggest-attribute=format -Wsuggest-attribute=noreturn -Wunused-variable -Wmisleading-indentation -Wundef -fPIC I, [2024-04-19T09:40:00.464441 #1232052] INFO -- : XCFLAGS = -U_FORTIFY_SOURCE -D_FORTIFY_SOURCE=2 -fstack-protector-strong -fno-strict-overflow -fvisibility=hidden -fexcess-precision=standard -DRUBY_EXPORT -I. -I.ext/include/riscv64-linux -I/tmp/ruby/src/trunk/include -I/tmp/ruby/src/trunk -I/tmp/ruby/src/trunk/prism -I/tmp/ruby/src/trunk/enc/unicode/15.0.0 I, [2024-04-19T09:40:00.464653 #1232052] INFO -- : CPPFLAGS = I, [2024-04-19T09:40:00.464777 #1232052] INFO -- : DLDFLAGS = -Wl,--compress-debug-sections=zlib -Wl,-soname,libruby.so.3.4 -fstack-protector-strong I, [2024-04-19T09:40:00.464887 #1232052] INFO -- : SOLIBS = -lz -lrt -lrt -lgmp -ldl -lcrypt -lm -lpthread I, [2024-04-19T09:40:00.464982 #1232052] INFO -- : LANG = I, [2024-04-19T09:40:00.465078 #1232052] INFO -- : LC_ALL = I, [2024-04-19T09:40:00.465181 #1232052] INFO -- : LC_CTYPE = I, [2024-04-19T09:40:00.465286 #1232052] INFO -- : MFLAGS = -j4 --jobserver-auth=4,5 I, [2024-04-19T09:40:00.465394 #1232052] INFO -- : RUSTC = rustc I, [2024-04-19T09:40:00.465502 #1232052] INFO -- : YJIT_RUSTC_ARGS = --crate-name=yjit --crate-type=staticlib --edition=2021 -g -C lto=thin -C opt-level=3 -C overflow-checks=on '--out-dir=/tmp/ruby/build/trunk/yjit/target/release/' /tmp/ruby/src/trunk/yjit/src/lib.rs I, [2024-04-19T09:40:00.479096 #1232052] INFO -- : gcc (Debian 13.2.0-4revyos1) 13.2.0 I, [2024-04-19T09:40:00.479284 #1232052] INFO -- : Copyright (C) 2023 Free Software Foundation, Inc. I, [2024-04-19T09:40:00.479369 #1232052] INFO -- : This is free software; see the source for copying conditions. There is NO I, [2024-04-19T09:40:00.479456 #1232052] INFO -- : warranty; not even for MERCHANTABILITY or FITNESS FOR A PARTICULAR PURPOSE. I, [2024-04-19T09:40:00.479544 #1232052] INFO -- : I, [2024-04-19T09:40:00.546710 #1232052] INFO -- : creating verconf.h I, [2024-04-19T09:40:00.914396 #1232052] INFO -- : verconf.h updated I, [2024-04-19T09:40:00.920938 #1232052] INFO -- : compiling /tmp/ruby/src/trunk/loadpath.c I, [2024-04-19T09:40:01.125421 #1232052] INFO -- : builtin_binary.inc updated I, [2024-04-19T09:40:01.137759 #1232052] INFO -- : 63c4b2d66003409833406b3a662615f9f67397fdf425c22dee41f60d762f36d6 builtin_binary.inc I, [2024-04-19T09:40:01.141068 #1232052] INFO -- : compiling /tmp/ruby/src/trunk/builtin.c I, [2024-04-19T09:40:02.773182 #1232052] INFO -- : linking static-library libruby-static.a I, [2024-04-19T09:40:10.067557 #1232052] INFO -- : linking shared-library libruby.so.3.4.0 I, [2024-04-19T09:40:50.769466 #1232052] INFO -- : linking ruby I, [2024-04-19T09:40:50.973861 #1232052] INFO -- : $$$[end] "make ruby -j4" exit with 0. I, [2024-04-19T09:40:50.974519 #1232052] INFO -- : $$$[beg] make all -j4 I, [2024-04-19T09:40:51.494632 #1232052] INFO -- : BASERUBY = /usr/bin/ruby --disable=gems I, [2024-04-19T09:40:51.494901 #1232052] INFO -- : CC = gcc I, [2024-04-19T09:40:51.495029 #1232052] INFO -- : LD = ld I, [2024-04-19T09:40:51.495149 #1232052] INFO -- : LDSHARED = gcc -shared I, [2024-04-19T09:40:51.495267 #1232052] INFO -- : CFLAGS = -O3 -fno-fast-math -ggdb3 -Wall -Wextra -Wdeprecated-declarations -Wdiv-by-zero -Wduplicated-cond -Wimplicit-function-declaration -Wimplicit-int -Wpointer-arith -Wwrite-strings -Wold-style-definition -Wimplicit-fallthrough=0 -Wmissing-noreturn -Wno-cast-function-type -Wno-constant-logical-operand -Wno-long-long -Wno-missing-field-initializers -Wno-overlength-strings -Wno-packed-bitfield-compat -Wno-parentheses-equality -Wno-self-assign -Wno-tautological-compare -Wno-unused-parameter -Wno-unused-value -Wsuggest-attribute=format -Wsuggest-attribute=noreturn -Wunused-variable -Wmisleading-indentation -Wundef -fPIC I, [2024-04-19T09:40:51.495385 #1232052] INFO -- : XCFLAGS = -U_FORTIFY_SOURCE -D_FORTIFY_SOURCE=2 -fstack-protector-strong -fno-strict-overflow -fvisibility=hidden -fexcess-precision=standard -DRUBY_EXPORT -I. -I.ext/include/riscv64-linux -I/tmp/ruby/src/trunk/include -I/tmp/ruby/src/trunk -I/tmp/ruby/src/trunk/prism -I/tmp/ruby/src/trunk/enc/unicode/15.0.0 I, [2024-04-19T09:40:51.495491 #1232052] INFO -- : CPPFLAGS = I, [2024-04-19T09:40:51.495604 #1232052] INFO -- : DLDFLAGS = -Wl,--compress-debug-sections=zlib -Wl,-soname,libruby.so.3.4 -fstack-protector-strong I, [2024-04-19T09:40:51.495743 #1232052] INFO -- : SOLIBS = -lz -lrt -lrt -lgmp -ldl -lcrypt -lm -lpthread I, [2024-04-19T09:40:51.495919 #1232052] INFO -- : LANG = I, [2024-04-19T09:40:51.496036 #1232052] INFO -- : LC_ALL = I, [2024-04-19T09:40:51.496132 #1232052] INFO -- : LC_CTYPE = I, [2024-04-19T09:40:51.496252 #1232052] INFO -- : MFLAGS = -j4 --jobserver-auth=4,5 I, [2024-04-19T09:40:51.496355 #1232052] INFO -- : RUSTC = rustc I, [2024-04-19T09:40:51.496462 #1232052] INFO -- : YJIT_RUSTC_ARGS = --crate-name=yjit --crate-type=staticlib --edition=2021 -g -C lto=thin -C opt-level=3 -C overflow-checks=on '--out-dir=/tmp/ruby/build/trunk/yjit/target/release/' /tmp/ruby/src/trunk/yjit/src/lib.rs I, [2024-04-19T09:40:51.508423 #1232052] INFO -- : gcc (Debian 13.2.0-4revyos1) 13.2.0 I, [2024-04-19T09:40:51.508612 #1232052] INFO -- : Copyright (C) 2023 Free Software Foundation, Inc. I, [2024-04-19T09:40:51.508700 #1232052] INFO -- : This is free software; see the source for copying conditions. There is NO I, [2024-04-19T09:40:51.508784 #1232052] INFO -- : warranty; not even for MERCHANTABILITY or FITNESS FOR A PARTICULAR PURPOSE. I, [2024-04-19T09:40:51.508869 #1232052] INFO -- : I, [2024-04-19T09:40:51.816852 #1232052] INFO -- : generating encdb.h I, [2024-04-19T09:40:51.828339 #1232052] INFO -- : generating enc.mk I, [2024-04-19T09:40:51.845558 #1232052] INFO -- : building spec/ruby/optional/capi/ext/array_spec.so I, [2024-04-19T09:40:51.849156 #1232052] INFO -- : building spec/ruby/optional/capi/ext/basic_object_spec.so I, [2024-04-19T09:40:52.070073 #1232052] INFO -- : encdb.h unchanged I, [2024-04-19T09:40:52.076370 #1232052] INFO -- : building spec/ruby/optional/capi/ext/bignum_spec.so I, [2024-04-19T09:40:52.809020 #1232052] INFO -- : building spec/ruby/optional/capi/ext/binding_spec.so I, [2024-04-19T09:40:53.403032 #1232052] INFO -- : building spec/ruby/optional/capi/ext/boolean_spec.so I, [2024-04-19T09:40:53.532779 #1232052] INFO -- : building spec/ruby/optional/capi/ext/class_id_under_autoload_spec.so I, [2024-04-19T09:40:53.848999 #1232052] INFO -- : building spec/ruby/optional/capi/ext/class_spec.so I, [2024-04-19T09:40:54.300919 #1232052] INFO -- : building spec/ruby/optional/capi/ext/class_under_autoload_spec.so I, [2024-04-19T09:40:54.474663 #1232052] INFO -- : building spec/ruby/optional/capi/ext/complex_spec.so I, [2024-04-19T09:40:54.561549 #1232052] INFO -- : building spec/ruby/optional/capi/ext/constants_spec.so I, [2024-04-19T09:40:55.304589 #1232052] INFO -- : building spec/ruby/optional/capi/ext/data_spec.so I, [2024-04-19T09:40:55.557125 #1232052] INFO -- : building spec/ruby/optional/capi/ext/debug_spec.so I, [2024-04-19T09:40:55.593620 #1232052] INFO -- : building spec/ruby/optional/capi/ext/encoding_spec.so I, [2024-04-19T09:40:56.488039 #1232052] INFO -- : building spec/ruby/optional/capi/ext/enumerator_spec.so I, [2024-04-19T09:40:56.670145 #1232052] INFO -- : building spec/ruby/optional/capi/ext/exception_spec.so I, [2024-04-19T09:40:56.885588 #1232052] INFO -- : building spec/ruby/optional/capi/ext/fiber_spec.so I, [2024-04-19T09:40:57.931490 #1232052] INFO -- : building spec/ruby/optional/capi/ext/file_spec.so I, [2024-04-19T09:40:58.039097 #1232052] INFO -- : building spec/ruby/optional/capi/ext/fixnum_spec.so I, [2024-04-19T09:40:58.121980 #1232052] INFO -- : building spec/ruby/optional/capi/ext/float_spec.so I, [2024-04-19T09:40:58.419820 #1232052] INFO -- : building spec/ruby/optional/capi/ext/gc_spec.so I, [2024-04-19T09:40:59.025979 #1232052] INFO -- : building spec/ruby/optional/capi/ext/globals_spec.so I, [2024-04-19T09:40:59.078115 #1232052] INFO -- : building spec/ruby/optional/capi/ext/hash_spec.so I, [2024-04-19T09:40:59.199464 #1232052] INFO -- : building spec/ruby/optional/capi/ext/integer_spec.so I, [2024-04-19T09:40:59.774005 #1232052] INFO -- : building spec/ruby/optional/capi/ext/io_spec.so I, [2024-04-19T09:41:00.346806 #1232052] INFO -- : building spec/ruby/optional/capi/ext/kernel_spec.so I, [2024-04-19T09:41:00.412109 #1232052] INFO -- : building spec/ruby/optional/capi/ext/language_spec.so I, [2024-04-19T09:41:00.489641 #1232052] INFO -- : building spec/ruby/optional/capi/ext/marshal_spec.so I, [2024-04-19T09:41:01.507447 #1232052] INFO -- : building spec/ruby/optional/capi/ext/module_spec.so I, [2024-04-19T09:41:01.526963 #1232052] INFO -- : building spec/ruby/optional/capi/ext/module_under_autoload_spec.so I, [2024-04-19T09:41:02.064974 #1232052] INFO -- : building spec/ruby/optional/capi/ext/mutex_spec.so I, [2024-04-19T09:41:02.552128 #1232052] INFO -- : building spec/ruby/optional/capi/ext/numeric_spec.so I, [2024-04-19T09:41:02.959790 #1232052] INFO -- : building spec/ruby/optional/capi/ext/object_spec.so I, [2024-04-19T09:41:03.174835 #1232052] INFO -- : building spec/ruby/optional/capi/ext/proc_spec.so I, [2024-04-19T09:41:03.286314 #1232052] INFO -- : building spec/ruby/optional/capi/ext/range_spec.so I, [2024-04-19T09:41:04.140942 #1232052] INFO -- : building spec/ruby/optional/capi/ext/rational_spec.so I, [2024-04-19T09:41:04.414768 #1232052] INFO -- : building spec/ruby/optional/capi/ext/rbasic_spec.so I, [2024-04-19T09:41:04.698547 #1232052] INFO -- : building spec/ruby/optional/capi/ext/regexp_spec.so I, [2024-04-19T09:41:05.274076 #1232052] INFO -- : building spec/ruby/optional/capi/ext/st_spec.so I, [2024-04-19T09:41:05.786206 #1232052] INFO -- : building spec/ruby/optional/capi/ext/string_spec.so I, [2024-04-19T09:41:05.828967 #1232052] INFO -- : building spec/ruby/optional/capi/ext/struct_spec.so I, [2024-04-19T09:41:05.996192 #1232052] INFO -- : building spec/ruby/optional/capi/ext/symbol_spec.so I, [2024-04-19T09:41:06.455127 #1232052] INFO -- : building spec/ruby/optional/capi/ext/thread_spec.so I, [2024-04-19T09:41:07.024249 #1232052] INFO -- : building spec/ruby/optional/capi/ext/time_spec.so I, [2024-04-19T09:41:07.545540 #1232052] INFO -- : building spec/ruby/optional/capi/ext/tracepoint_spec.so I, [2024-04-19T09:41:07.934384 #1232052] INFO -- : building spec/ruby/optional/capi/ext/typed_data_spec.so I, [2024-04-19T09:41:08.469199 #1232052] INFO -- : building spec/ruby/optional/capi/ext/util_spec.so I, [2024-04-19T09:41:08.651358 #1232052] INFO -- : making enc I, [2024-04-19T09:41:08.836748 #1232052] INFO -- : make[1]: Entering directory '/tmp/ruby/build/trunk' I, [2024-04-19T09:41:08.839375 #1232052] INFO -- : linking encoding encdb.so I, [2024-04-19T09:41:09.121190 #1232052] INFO -- : linking encoding big5.so I, [2024-04-19T09:41:09.399368 #1232052] INFO -- : linking encoding cesu_8.so I, [2024-04-19T09:41:09.410959 #1232052] INFO -- : making srcs under enc I, [2024-04-19T09:41:09.421228 #1232052] INFO -- : linking encoding cp949.so I, [2024-04-19T09:41:09.674432 #1232052] INFO -- : linking encoding emacs_mule.so I, [2024-04-19T09:41:09.678979 #1232052] INFO -- : linking encoding euc_jp.so I, [2024-04-19T09:41:09.754392 #1232052] INFO -- : make[1]: Entering directory '/tmp/ruby/build/trunk' I, [2024-04-19T09:41:09.754731 #1232052] INFO -- : make[1]: Nothing to be done for 'srcs'. I, [2024-04-19T09:41:09.754971 #1232052] INFO -- : make[1]: Leaving directory '/tmp/ruby/build/trunk' I, [2024-04-19T09:41:09.758278 #1232052] INFO -- : generating transdb.h I, [2024-04-19T09:41:09.941089 #1232052] INFO -- : linking encoding euc_kr.so I, [2024-04-19T09:41:09.942811 #1232052] INFO -- : linking encoding euc_tw.so I, [2024-04-19T09:41:10.090029 #1232052] INFO -- : linking encoding gb2312.so I, [2024-04-19T09:41:10.208956 #1232052] INFO -- : linking encoding gb18030.so I, [2024-04-19T09:41:10.213176 #1232052] INFO -- : linking encoding gbk.so I, [2024-04-19T09:41:10.364922 #1232052] INFO -- : linking encoding iso_8859_1.so I, [2024-04-19T09:41:10.477824 #1232052] INFO -- : linking encoding iso_8859_2.so I, [2024-04-19T09:41:10.479568 #1232052] INFO -- : linking encoding iso_8859_3.so I, [2024-04-19T09:41:10.633336 #1232052] INFO -- : linking encoding iso_8859_4.so I, [2024-04-19T09:41:10.739744 #1232052] INFO -- : linking encoding iso_8859_5.so I, [2024-04-19T09:41:10.747800 #1232052] INFO -- : linking encoding iso_8859_6.so I, [2024-04-19T09:41:10.900939 #1232052] INFO -- : linking encoding iso_8859_7.so I, [2024-04-19T09:41:10.999964 #1232052] INFO -- : linking encoding iso_8859_8.so I, [2024-04-19T09:41:11.008140 #1232052] INFO -- : linking encoding iso_8859_9.so I, [2024-04-19T09:41:11.174881 #1232052] INFO -- : linking encoding iso_8859_10.so I, [2024-04-19T09:41:11.254029 #1232052] INFO -- : linking encoding iso_8859_11.so I, [2024-04-19T09:41:11.274971 #1232052] INFO -- : linking encoding iso_8859_13.so I, [2024-04-19T09:41:11.279963 #1232052] INFO -- : transdb.h unchanged I, [2024-04-19T09:41:11.286827 #1232052] INFO -- : generating makefiles ext/configure-ext.mk I, [2024-04-19T09:41:11.446839 #1232052] INFO -- : linking encoding iso_8859_14.so I, [2024-04-19T09:41:11.514861 #1232052] INFO -- : linking encoding iso_8859_15.so I, [2024-04-19T09:41:11.534329 #1232052] INFO -- : ext/configure-ext.mk updated I, [2024-04-19T09:41:11.540302 #1232052] INFO -- : linking encoding iso_8859_16.so I, [2024-04-19T09:41:11.542701 #1232052] INFO -- : making trans I, [2024-04-19T09:41:11.709936 #1232052] INFO -- : make[1]: Entering directory '/tmp/ruby/build/trunk' I, [2024-04-19T09:41:11.719921 #1232052] INFO -- : linking transcoder transdb.so I, [2024-04-19T09:41:11.721760 #1232052] INFO -- : linking encoding koi8_r.so I, [2024-04-19T09:41:11.777686 #1232052] INFO -- : linking encoding koi8_u.so I, [2024-04-19T09:41:11.810836 #1232052] INFO -- : linking encoding shift_jis.so I, [2024-04-19T09:41:11.996166 #1232052] INFO -- : linking transcoder big5.so I, [2024-04-19T09:41:12.009036 #1232052] INFO -- : linking encoding utf_16be.so I, [2024-04-19T09:41:12.052684 #1232052] INFO -- : linking transcoder cesu_8.so I, [2024-04-19T09:41:12.093082 #1232052] INFO -- : linking transcoder chinese.so I, [2024-04-19T09:41:12.292719 #1232052] INFO -- : linking encoding utf_16le.so I, [2024-04-19T09:41:12.319596 #1232052] INFO -- : linking transcoder ebcdic.so I, [2024-04-19T09:41:12.385203 #1232052] INFO -- : linking transcoder emoji.so I, [2024-04-19T09:41:12.398064 #1232052] INFO -- : linking transcoder emoji_iso2022_kddi.so I, [2024-04-19T09:41:12.569259 #1232052] INFO -- : linking encoding utf_32be.so I, [2024-04-19T09:41:12.584938 #1232052] INFO -- : linking transcoder emoji_sjis_docomo.so I, [2024-04-19T09:41:12.671368 #1232052] INFO -- : linking transcoder emoji_sjis_kddi.so I, [2024-04-19T09:41:12.701384 #1232052] INFO -- : linking transcoder emoji_sjis_softbank.so I, [2024-04-19T09:41:12.849158 #1232052] INFO -- : linking encoding utf_32le.so I, [2024-04-19T09:41:12.871302 #1232052] INFO -- : linking transcoder escape.so I, [2024-04-19T09:41:12.984007 #1232052] INFO -- : linking transcoder gb18030.so I, [2024-04-19T09:41:13.000147 #1232052] INFO -- : linking transcoder gbk.so I, [2024-04-19T09:41:13.137739 #1232052] INFO -- : linking encoding windows_31j.so I, [2024-04-19T09:41:13.142094 #1232052] INFO -- : linking transcoder iso2022.so I, [2024-04-19T09:41:13.294724 #1232052] INFO -- : linking transcoder japanese.so I, [2024-04-19T09:41:13.301674 #1232052] INFO -- : linking transcoder japanese_euc.so I, [2024-04-19T09:41:13.417738 #1232052] INFO -- : linking encoding windows_1250.so I, [2024-04-19T09:41:13.418240 #1232052] INFO -- : linking transcoder japanese_sjis.so I, [2024-04-19T09:41:13.573341 #1232052] INFO -- : linking transcoder korean.so I, [2024-04-19T09:41:13.677188 #1232052] INFO -- : linking encoding windows_1251.so I, [2024-04-19T09:41:13.758516 #1232052] INFO -- : linking transcoder single_byte.so I, [2024-04-19T09:41:13.759423 #1232052] INFO -- : linking encoding windows_1252.so I, [2024-04-19T09:41:13.945330 #1232052] INFO -- : linking encoding windows_1253.so I, [2024-04-19T09:41:14.031858 #1232052] INFO -- : linking encoding windows_1254.so I, [2024-04-19T09:41:14.064894 #1232052] INFO -- : linking transcoder utf8_mac.so I, [2024-04-19T09:41:14.065353 #1232052] INFO -- : linking encoding windows_1257.so I, [2024-04-19T09:41:14.228849 #1232052] INFO -- : linking transcoder utf_16_32.so I, [2024-04-19T09:41:14.342664 #1232052] INFO -- : make[1]: Leaving directory '/tmp/ruby/build/trunk' I, [2024-04-19T09:41:14.352016 #1232052] INFO -- : make[1]: Entering directory '/tmp/ruby/build/trunk' I, [2024-04-19T09:41:14.588506 #1232052] INFO -- : make[1]: Leaving directory '/tmp/ruby/build/trunk' I, [2024-04-19T09:41:14.591928 #1232052] INFO -- : making encs I, [2024-04-19T09:41:15.014731 #1232052] INFO -- : make[1]: Entering directory '/tmp/ruby/build/trunk' I, [2024-04-19T09:41:15.014994 #1232052] INFO -- : make[1]: Nothing to be done for 'encs'. I, [2024-04-19T09:41:15.015140 #1232052] INFO -- : make[1]: Leaving directory '/tmp/ruby/build/trunk' I, [2024-04-19T09:41:17.880523 #1232052] INFO -- : make[1]: Leaving directory '/tmp/ruby/build/trunk' I, [2024-04-19T09:41:17.882779 #1232052] INFO -- : generating makefile exts.mk I, [2024-04-19T09:41:18.209595 #1232052] INFO -- : exts.mk unchanged I, [2024-04-19T09:41:18.247157 #1232052] INFO -- : make[1]: Entering directory '/tmp/ruby/build/trunk' I, [2024-04-19T09:41:18.758345 #1232052] INFO -- : make[2]: Entering directory '/tmp/ruby/build/trunk/ext/digest' I, [2024-04-19T09:41:18.761712 #1232052] INFO -- : make[2]: Entering directory '/tmp/ruby/build/trunk/ext/coverage' I, [2024-04-19T09:41:18.772791 #1232052] INFO -- : make[2]: Entering directory '/tmp/ruby/build/trunk/ext/date' I, [2024-04-19T09:41:18.785625 #1232052] INFO -- : make[2]: Leaving directory '/tmp/ruby/build/trunk/ext/coverage' I, [2024-04-19T09:41:18.804576 #1232052] INFO -- : make[2]: Leaving directory '/tmp/ruby/build/trunk/ext/date' I, [2024-04-19T09:41:18.805890 #1232052] INFO -- : make[2]: Leaving directory '/tmp/ruby/build/trunk/ext/digest' I, [2024-04-19T09:41:18.833226 #1232052] INFO -- : make[2]: Entering directory '/tmp/ruby/build/trunk/ext/io/console' I, [2024-04-19T09:41:18.841448 #1232052] INFO -- : make[2]: Entering directory '/tmp/ruby/build/trunk/ext/fiddle' I, [2024-04-19T09:41:18.847341 #1232052] INFO -- : make[2]: Entering directory '/tmp/ruby/build/trunk/ext/json' I, [2024-04-19T09:41:18.853005 #1232052] INFO -- : make[2]: Leaving directory '/tmp/ruby/build/trunk/ext/io/console' I, [2024-04-19T09:41:18.867899 #1232052] INFO -- : make[2]: Entering directory '/tmp/ruby/build/trunk/ext/monitor' I, [2024-04-19T09:41:18.885918 #1232052] INFO -- : make[2]: Leaving directory '/tmp/ruby/build/trunk/ext/monitor' I, [2024-04-19T09:41:18.889451 #1232052] INFO -- : make[2]: Leaving directory '/tmp/ruby/build/trunk/ext/json' I, [2024-04-19T09:41:18.900147 #1232052] INFO -- : make[2]: Leaving directory '/tmp/ruby/build/trunk/ext/fiddle' I, [2024-04-19T09:41:18.913244 #1232052] INFO -- : make[2]: Entering directory '/tmp/ruby/build/trunk/ext/objspace' I, [2024-04-19T09:41:18.916656 #1232052] INFO -- : make[2]: Entering directory '/tmp/ruby/build/trunk/ext/pathname' I, [2024-04-19T09:41:18.940786 #1232052] INFO -- : make[2]: Entering directory '/tmp/ruby/build/trunk/ext/psych' I, [2024-04-19T09:41:18.942998 #1232052] INFO -- : make[2]: Leaving directory '/tmp/ruby/build/trunk/ext/objspace' I, [2024-04-19T09:41:18.951942 #1232052] INFO -- : make[2]: Leaving directory '/tmp/ruby/build/trunk/ext/pathname' I, [2024-04-19T09:41:18.980612 #1232052] INFO -- : make[2]: Entering directory '/tmp/ruby/build/trunk/ext/rbconfig/sizeof' I, [2024-04-19T09:41:18.984149 #1232052] INFO -- : make[2]: Entering directory '/tmp/ruby/build/trunk/ext/pty' I, [2024-04-19T09:41:18.989986 #1232052] INFO -- : compiling /tmp/ruby/src/trunk/ext/rbconfig/sizeof/sizes.c I, [2024-04-19T09:41:19.006828 #1232052] INFO -- : make[2]: Leaving directory '/tmp/ruby/build/trunk/ext/pty' I, [2024-04-19T09:41:19.012610 #1232052] INFO -- : make[2]: Entering directory '/tmp/ruby/build/trunk/ext/openssl' I, [2024-04-19T09:41:19.063025 #1232052] INFO -- : make[2]: Entering directory '/tmp/ruby/build/trunk/ext/ripper' I, [2024-04-19T09:41:19.071931 #1232052] INFO -- : make[2]: Leaving directory '/tmp/ruby/build/trunk/ext/psych' I, [2024-04-19T09:41:19.093554 #1232052] INFO -- : make[2]: Entering directory '/tmp/ruby/build/trunk/ext/rubyvm' I, [2024-04-19T09:41:19.102330 #1232052] INFO -- : make[2]: Leaving directory '/tmp/ruby/build/trunk/ext/ripper' I, [2024-04-19T09:41:19.113556 #1232052] INFO -- : make[2]: Leaving directory '/tmp/ruby/build/trunk/ext/rubyvm' I, [2024-04-19T09:41:19.143694 #1232052] INFO -- : make[2]: Leaving directory '/tmp/ruby/build/trunk/ext/openssl' I, [2024-04-19T09:41:19.185601 #1232052] INFO -- : make[2]: Entering directory '/tmp/ruby/build/trunk/ext/socket' I, [2024-04-19T09:41:19.187446 #1232052] INFO -- : make[2]: Entering directory '/tmp/ruby/build/trunk/.bundle/gems/bigdecimal-3.1.7/ext/bigdecimal' I, [2024-04-19T09:41:19.189913 #1232052] INFO -- : make[2]: Entering directory '/tmp/ruby/build/trunk/.bundle/gems/debug-1.9.2/ext/debug' I, [2024-04-19T09:41:19.246894 #1232052] INFO -- : make[2]: Leaving directory '/tmp/ruby/build/trunk/ext/socket' I, [2024-04-19T09:41:19.261748 #1232052] INFO -- : make[2]: Entering directory '/tmp/ruby/build/trunk/.bundle/gems/nkf-0.2.0/ext/nkf' I, [2024-04-19T09:41:19.351176 #1232052] INFO -- : make[2]: Leaving directory '/tmp/ruby/build/trunk/.bundle/gems/bigdecimal-3.1.7/ext/bigdecimal' I, [2024-04-19T09:41:19.356433 #1232052] INFO -- : make[2]: Leaving directory '/tmp/ruby/build/trunk/.bundle/gems/debug-1.9.2/ext/debug' I, [2024-04-19T09:41:19.369397 #1232052] INFO -- : make[2]: Entering directory '/tmp/ruby/build/trunk/.bundle/gems/racc-1.7.3/ext/racc/cparse' I, [2024-04-19T09:41:19.375710 #1232052] INFO -- : make[2]: Entering directory '/tmp/ruby/build/trunk/.bundle/gems/rbs-3.4.4/ext/rbs_extension' I, [2024-04-19T09:41:19.430714 #1232052] INFO -- : make[2]: Leaving directory '/tmp/ruby/build/trunk/.bundle/gems/nkf-0.2.0/ext/nkf' I, [2024-04-19T09:41:19.446098 #1232052] INFO -- : make[2]: Entering directory '/tmp/ruby/build/trunk/.bundle/gems/syslog-0.1.2/ext/syslog' I, [2024-04-19T09:41:19.542335 #1232052] INFO -- : make[2]: Leaving directory '/tmp/ruby/build/trunk/.bundle/gems/racc-1.7.3/ext/racc/cparse' I, [2024-04-19T09:41:19.550440 #1232052] INFO -- : make[2]: Leaving directory '/tmp/ruby/build/trunk/.bundle/gems/rbs-3.4.4/ext/rbs_extension' I, [2024-04-19T09:41:19.624323 #1232052] INFO -- : make[2]: Leaving directory '/tmp/ruby/build/trunk/.bundle/gems/syslog-0.1.2/ext/syslog' I, [2024-04-19T09:41:19.636968 #1232052] INFO -- : make[2]: Entering directory '/tmp/ruby/build/trunk/ext/digest/sha2' I, [2024-04-19T09:41:19.661179 #1232052] INFO -- : make[2]: Leaving directory '/tmp/ruby/build/trunk/ext/digest/sha2' I, [2024-04-19T09:41:19.939510 #1232052] INFO -- : linking shared-object rbconfig/sizeof.so I, [2024-04-19T09:41:20.221708 #1232052] INFO -- : make[2]: Leaving directory '/tmp/ruby/build/trunk/ext/rbconfig/sizeof' I, [2024-04-19T09:41:20.440853 #1232052] INFO -- : make[2]: Entering directory '/tmp/ruby/build/trunk' I, [2024-04-19T09:41:21.106281 #1232052] INFO -- : linking ruby I, [2024-04-19T09:41:21.313717 #1232052] INFO -- : make[2]: Leaving directory '/tmp/ruby/build/trunk' I, [2024-04-19T09:41:21.316341 #1232052] INFO -- : make[1]: Leaving directory '/tmp/ruby/build/trunk' I, [2024-04-19T09:41:21.349106 #1232052] INFO -- : make[1]: Entering directory '/tmp/ruby/build/trunk' I, [2024-04-19T09:41:21.349303 #1232052] INFO -- : make[1]: Nothing to be done for 'note'. I, [2024-04-19T09:41:21.349390 #1232052] INFO -- : make[1]: Leaving directory '/tmp/ruby/build/trunk' I, [2024-04-19T09:41:21.352351 #1232052] INFO -- : $$$[end] "make all -j4" exit with 0. I, [2024-04-19T09:41:21.352962 #1232052] INFO -- : $$$[beg] make install -j4 I, [2024-04-19T09:41:21.930044 #1232052] INFO -- : Update minitest to ea9caafc0754b1d6236a490d59e624b53209734a I, [2024-04-19T09:41:21.931006 #1232052] INFO -- : Update power_assert to 84e85124c5014a139af39161d484156cfe87a9ed I, [2024-04-19T09:41:21.932507 #1232052] INFO -- : Update rbs to ba7872795d5de04adb8ff500c0e6afdc81a041dd I, [2024-04-19T09:41:21.938528 #1232052] INFO -- : echo ea9caafc0754b1d6236a490d59e624b53209734a | /bin/sh /tmp/ruby/src/trunk/tool/ifchange /tmp/ruby/src/trunk/.bundle/.timestamp/minitest.revision - I, [2024-04-19T09:41:21.940387 #1232052] INFO -- : echo 84e85124c5014a139af39161d484156cfe87a9ed | /bin/sh /tmp/ruby/src/trunk/tool/ifchange /tmp/ruby/src/trunk/.bundle/.timestamp/power_assert.revision - I, [2024-04-19T09:41:21.941420 #1232052] INFO -- : echo ba7872795d5de04adb8ff500c0e6afdc81a041dd | /bin/sh /tmp/ruby/src/trunk/tool/ifchange /tmp/ruby/src/trunk/.bundle/.timestamp/rbs.revision - I, [2024-04-19T09:41:21.949449 #1232052] INFO -- : /tmp/ruby/src/trunk/.bundle/.timestamp/minitest.revision unchanged I, [2024-04-19T09:41:21.952797 #1232052] INFO -- : /tmp/ruby/src/trunk/.bundle/.timestamp/power_assert.revision unchanged I, [2024-04-19T09:41:21.953970 #1232052] INFO -- : /tmp/ruby/src/trunk/.bundle/.timestamp/rbs.revision unchanged I, [2024-04-19T09:41:21.955933 #1232052] INFO -- : Update typeprof to b19a6416da3a05d57fadd6ffdadb382b6d236ca5 I, [2024-04-19T09:41:21.977134 #1232052] INFO -- : BASERUBY = /usr/bin/ruby --disable=gems I, [2024-04-19T09:41:21.977363 #1232052] INFO -- : CC = gcc I, [2024-04-19T09:41:21.977491 #1232052] INFO -- : LD = ld I, [2024-04-19T09:41:21.977612 #1232052] INFO -- : LDSHARED = gcc -shared I, [2024-04-19T09:41:21.977736 #1232052] INFO -- : CFLAGS = -O3 -fno-fast-math -ggdb3 -Wall -Wextra -Wdeprecated-declarations -Wdiv-by-zero -Wduplicated-cond -Wimplicit-function-declaration -Wimplicit-int -Wpointer-arith -Wwrite-strings -Wold-style-definition -Wimplicit-fallthrough=0 -Wmissing-noreturn -Wno-cast-function-type -Wno-constant-logical-operand -Wno-long-long -Wno-missing-field-initializers -Wno-overlength-strings -Wno-packed-bitfield-compat -Wno-parentheses-equality -Wno-self-assign -Wno-tautological-compare -Wno-unused-parameter -Wno-unused-value -Wsuggest-attribute=format -Wsuggest-attribute=noreturn -Wunused-variable -Wmisleading-indentation -Wundef -fPIC I, [2024-04-19T09:41:21.977887 #1232052] INFO -- : XCFLAGS = -U_FORTIFY_SOURCE -D_FORTIFY_SOURCE=2 -fstack-protector-strong -fno-strict-overflow -fvisibility=hidden -fexcess-precision=standard -DRUBY_EXPORT -I. -I.ext/include/riscv64-linux -I/tmp/ruby/src/trunk/include -I/tmp/ruby/src/trunk -I/tmp/ruby/src/trunk/prism -I/tmp/ruby/src/trunk/enc/unicode/15.0.0 I, [2024-04-19T09:41:21.978019 #1232052] INFO -- : CPPFLAGS = I, [2024-04-19T09:41:21.978139 #1232052] INFO -- : DLDFLAGS = -Wl,--compress-debug-sections=zlib -Wl,-soname,libruby.so.3.4 -fstack-protector-strong I, [2024-04-19T09:41:21.978256 #1232052] INFO -- : SOLIBS = -lz -lrt -lrt -lgmp -ldl -lcrypt -lm -lpthread I, [2024-04-19T09:41:21.978372 #1232052] INFO -- : LANG = I, [2024-04-19T09:41:21.978587 #1232052] INFO -- : LC_ALL = I, [2024-04-19T09:41:21.978797 #1232052] INFO -- : LC_CTYPE = I, [2024-04-19T09:41:21.978943 #1232052] INFO -- : MFLAGS = -j4 --jobserver-auth=4,5 I, [2024-04-19T09:41:21.979081 #1232052] INFO -- : RUSTC = rustc I, [2024-04-19T09:41:21.979252 #1232052] INFO -- : YJIT_RUSTC_ARGS = --crate-name=yjit --crate-type=staticlib --edition=2021 -g -C lto=thin -C opt-level=3 -C overflow-checks=on '--out-dir=/tmp/ruby/build/trunk/yjit/target/release/' /tmp/ruby/src/trunk/yjit/src/lib.rs I, [2024-04-19T09:41:22.281812 #1232052] INFO -- : echo b19a6416da3a05d57fadd6ffdadb382b6d236ca5 | /bin/sh /tmp/ruby/src/trunk/tool/ifchange /tmp/ruby/src/trunk/.bundle/.timestamp/typeprof.revision - I, [2024-04-19T09:41:22.284532 #1232052] INFO -- : generating encdb.h I, [2024-04-19T09:41:22.286007 #1232052] INFO -- : gcc (Debian 13.2.0-4revyos1) 13.2.0 I, [2024-04-19T09:41:22.286230 #1232052] INFO -- : Copyright (C) 2023 Free Software Foundation, Inc. I, [2024-04-19T09:41:22.286355 #1232052] INFO -- : This is free software; see the source for copying conditions. There is NO I, [2024-04-19T09:41:22.286587 #1232052] INFO -- : warranty; not even for MERCHANTABILITY or FITNESS FOR A PARTICULAR PURPOSE. I, [2024-04-19T09:41:22.286787 #1232052] INFO -- : I, [2024-04-19T09:41:22.292031 #1232052] INFO -- : /tmp/ruby/src/trunk/.bundle/.timestamp/typeprof.revision unchanged I, [2024-04-19T09:41:22.293086 #1232052] INFO -- : generating enc.mk I, [2024-04-19T09:41:22.523073 #1232052] INFO -- : encdb.h unchanged I, [2024-04-19T09:41:23.362045 #1232052] INFO -- : Building power_assert@84e85124c5014a139af39161d484156cfe87a9ed to /tmp/ruby/src/trunk/gems/power_assert-2.0.3.gem I, [2024-04-19T09:41:23.881106 #1232052] INFO -- : making srcs under enc I, [2024-04-19T09:41:23.882196 #1232052] INFO -- : making enc I, [2024-04-19T09:41:24.041311 #1232052] INFO -- : make[1]: Entering directory '/tmp/ruby/build/trunk' I, [2024-04-19T09:41:24.041537 #1232052] INFO -- : make[1]: Nothing to be done for 'enc'. I, [2024-04-19T09:41:24.041660 #1232052] INFO -- : make[1]: Leaving directory '/tmp/ruby/build/trunk' I, [2024-04-19T09:41:24.176549 #1232052] INFO -- : make[1]: Entering directory '/tmp/ruby/build/trunk' I, [2024-04-19T09:41:24.176828 #1232052] INFO -- : make[1]: Nothing to be done for 'srcs'. I, [2024-04-19T09:41:24.177089 #1232052] INFO -- : make[1]: Leaving directory '/tmp/ruby/build/trunk' I, [2024-04-19T09:41:24.180429 #1232052] INFO -- : generating transdb.h I, [2024-04-19T09:41:24.320427 #1232052] INFO -- : Successfully built RubyGem I, [2024-04-19T09:41:24.320638 #1232052] INFO -- : Name: power_assert I, [2024-04-19T09:41:24.320735 #1232052] INFO -- : Version: 2.0.4dev I, [2024-04-19T09:41:24.320822 #1232052] INFO -- : File: power_assert-2.0.4dev.gem I, [2024-04-19T09:41:24.335668 #1232052] INFO -- : Extracting bundle gem power_assert-2.0.3... I, [2024-04-19T09:41:25.258051 #1232052] INFO -- : Try with hash version of bundled gems instead of gems/power_assert-2.0.3.gem. We don't use this gem with release version of Ruby. I, [2024-04-19T09:41:25.316567 #1232052] INFO -- : Unpacked gems/power_assert-2.0.4dev.gem I, [2024-04-19T09:41:25.414127 #1232052] INFO -- : transdb.h unchanged I, [2024-04-19T09:41:25.420074 #1232052] INFO -- : generating makefiles ext/configure-ext.mk I, [2024-04-19T09:41:25.421134 #1232052] INFO -- : making trans I, [2024-04-19T09:41:25.607619 #1232052] INFO -- : ext/configure-ext.mk unchanged I, [2024-04-19T09:41:25.619169 #1232052] INFO -- : make[1]: Entering directory '/tmp/ruby/build/trunk' I, [2024-04-19T09:41:25.785556 #1232052] INFO -- : make[1]: Entering directory '/tmp/ruby/build/trunk' I, [2024-04-19T09:41:25.785777 #1232052] INFO -- : make[1]: Nothing to be done for 'trans'. I, [2024-04-19T09:41:25.785906 #1232052] INFO -- : make[1]: Leaving directory '/tmp/ruby/build/trunk' I, [2024-04-19T09:41:27.355338 #1232052] INFO -- : making encs I, [2024-04-19T09:41:27.774286 #1232052] INFO -- : make[1]: Entering directory '/tmp/ruby/build/trunk' I, [2024-04-19T09:41:27.774583 #1232052] INFO -- : make[1]: Nothing to be done for 'encs'. I, [2024-04-19T09:41:27.774785 #1232052] INFO -- : make[1]: Leaving directory '/tmp/ruby/build/trunk' I, [2024-04-19T09:41:29.058446 #1232052] INFO -- : make[1]: Leaving directory '/tmp/ruby/build/trunk' I, [2024-04-19T09:41:29.060673 #1232052] INFO -- : generating makefile exts.mk I, [2024-04-19T09:41:29.385467 #1232052] INFO -- : exts.mk unchanged I, [2024-04-19T09:41:29.422372 #1232052] INFO -- : make[1]: Entering directory '/tmp/ruby/build/trunk' I, [2024-04-19T09:41:29.932989 #1232052] INFO -- : make[2]: Entering directory '/tmp/ruby/build/trunk/ext/coverage' I, [2024-04-19T09:41:29.934807 #1232052] INFO -- : make[2]: Entering directory '/tmp/ruby/build/trunk/ext/digest' I, [2024-04-19T09:41:29.951799 #1232052] INFO -- : make[2]: Entering directory '/tmp/ruby/build/trunk/ext/date' I, [2024-04-19T09:41:29.956114 #1232052] INFO -- : make[2]: Leaving directory '/tmp/ruby/build/trunk/ext/coverage' I, [2024-04-19T09:41:29.976687 #1232052] INFO -- : make[2]: Leaving directory '/tmp/ruby/build/trunk/ext/date' I, [2024-04-19T09:41:29.986776 #1232052] INFO -- : make[2]: Leaving directory '/tmp/ruby/build/trunk/ext/digest' I, [2024-04-19T09:41:30.003601 #1232052] INFO -- : make[2]: Entering directory '/tmp/ruby/build/trunk/ext/io/console' I, [2024-04-19T09:41:30.017504 #1232052] INFO -- : make[2]: Entering directory '/tmp/ruby/build/trunk/ext/fiddle' I, [2024-04-19T09:41:30.023136 #1232052] INFO -- : make[2]: Leaving directory '/tmp/ruby/build/trunk/ext/io/console' I, [2024-04-19T09:41:30.027619 #1232052] INFO -- : make[2]: Entering directory '/tmp/ruby/build/trunk/ext/json' I, [2024-04-19T09:41:30.054712 #1232052] INFO -- : make[2]: Entering directory '/tmp/ruby/build/trunk/ext/monitor' I, [2024-04-19T09:41:30.064878 #1232052] INFO -- : make[2]: Leaving directory '/tmp/ruby/build/trunk/ext/fiddle' I, [2024-04-19T09:41:30.073804 #1232052] INFO -- : make[2]: Leaving directory '/tmp/ruby/build/trunk/ext/json' I, [2024-04-19T09:41:30.081472 #1232052] INFO -- : make[2]: Leaving directory '/tmp/ruby/build/trunk/ext/monitor' I, [2024-04-19T09:41:30.087906 #1232052] INFO -- : make[2]: Entering directory '/tmp/ruby/build/trunk/ext/objspace' I, [2024-04-19T09:41:30.100749 #1232052] INFO -- : make[2]: Entering directory '/tmp/ruby/build/trunk/ext/pathname' I, [2024-04-19T09:41:30.117415 #1232052] INFO -- : make[2]: Leaving directory '/tmp/ruby/build/trunk/ext/objspace' I, [2024-04-19T09:41:30.122776 #1232052] INFO -- : make[2]: Entering directory '/tmp/ruby/build/trunk/ext/psych' I, [2024-04-19T09:41:30.128318 #1232052] INFO -- : make[2]: Leaving directory '/tmp/ruby/build/trunk/ext/pathname' I, [2024-04-19T09:41:30.146515 #1232052] INFO -- : make[2]: Entering directory '/tmp/ruby/build/trunk/ext/pty' I, [2024-04-19T09:41:30.165036 #1232052] INFO -- : make[2]: Leaving directory '/tmp/ruby/build/trunk/ext/pty' I, [2024-04-19T09:41:30.181127 #1232052] INFO -- : make[2]: Entering directory '/tmp/ruby/build/trunk/ext/openssl' I, [2024-04-19T09:41:30.221096 #1232052] INFO -- : make[2]: Leaving directory '/tmp/ruby/build/trunk/ext/psych' I, [2024-04-19T09:41:30.232255 #1232052] INFO -- : make[2]: Entering directory '/tmp/ruby/build/trunk/ext/rubyvm' I, [2024-04-19T09:41:30.246544 #1232052] INFO -- : make[2]: Leaving directory '/tmp/ruby/build/trunk/ext/rubyvm' I, [2024-04-19T09:41:30.249289 #1232052] INFO -- : make[2]: Entering directory '/tmp/ruby/build/trunk/ext/ripper' I, [2024-04-19T09:41:30.294043 #1232052] INFO -- : make[2]: Leaving directory '/tmp/ruby/build/trunk/ext/ripper' I, [2024-04-19T09:41:30.300653 #1232052] INFO -- : make[2]: Entering directory '/tmp/ruby/build/trunk/ext/socket' I, [2024-04-19T09:41:30.316308 #1232052] INFO -- : make[2]: Leaving directory '/tmp/ruby/build/trunk/ext/openssl' I, [2024-04-19T09:41:30.325313 #1232052] INFO -- : make[2]: Entering directory '/tmp/ruby/build/trunk/.bundle/gems/bigdecimal-3.1.7/ext/bigdecimal' I, [2024-04-19T09:41:30.331774 #1232052] INFO -- : make[2]: Entering directory '/tmp/ruby/build/trunk/.bundle/gems/debug-1.9.2/ext/debug' I, [2024-04-19T09:41:30.346087 #1232052] INFO -- : make[2]: Entering directory '/tmp/ruby/build/trunk/.bundle/gems/nkf-0.2.0/ext/nkf' I, [2024-04-19T09:41:30.353815 #1232052] INFO -- : make[2]: Leaving directory '/tmp/ruby/build/trunk/ext/socket' I, [2024-04-19T09:41:30.380419 #1232052] INFO -- : make[2]: Entering directory '/tmp/ruby/build/trunk/.bundle/gems/racc-1.7.3/ext/racc/cparse' I, [2024-04-19T09:41:30.491791 #1232052] INFO -- : make[2]: Leaving directory '/tmp/ruby/build/trunk/.bundle/gems/bigdecimal-3.1.7/ext/bigdecimal' I, [2024-04-19T09:41:30.494772 #1232052] INFO -- : make[2]: Leaving directory '/tmp/ruby/build/trunk/.bundle/gems/debug-1.9.2/ext/debug' I, [2024-04-19T09:41:30.507631 #1232052] INFO -- : make[2]: Leaving directory '/tmp/ruby/build/trunk/.bundle/gems/nkf-0.2.0/ext/nkf' I, [2024-04-19T09:41:30.510081 #1232052] INFO -- : make[2]: Entering directory '/tmp/ruby/build/trunk/.bundle/gems/syslog-0.1.2/ext/syslog' I, [2024-04-19T09:41:30.513758 #1232052] INFO -- : make[2]: Entering directory '/tmp/ruby/build/trunk/.bundle/gems/rbs-3.4.4/ext/rbs_extension' I, [2024-04-19T09:41:30.541187 #1232052] INFO -- : make[2]: Leaving directory '/tmp/ruby/build/trunk/.bundle/gems/racc-1.7.3/ext/racc/cparse' I, [2024-04-19T09:41:30.600952 #1232052] INFO -- : make[2]: Entering directory '/tmp/ruby/build/trunk/ext/digest/sha2' I, [2024-04-19T09:41:30.625211 #1232052] INFO -- : make[2]: Leaving directory '/tmp/ruby/build/trunk/ext/digest/sha2' I, [2024-04-19T09:41:30.668081 #1232052] INFO -- : make[2]: Leaving directory '/tmp/ruby/build/trunk/.bundle/gems/rbs-3.4.4/ext/rbs_extension' I, [2024-04-19T09:41:30.671727 #1232052] INFO -- : make[2]: Leaving directory '/tmp/ruby/build/trunk/.bundle/gems/syslog-0.1.2/ext/syslog' I, [2024-04-19T09:41:30.895426 #1232052] INFO -- : make[2]: Entering directory '/tmp/ruby/build/trunk' I, [2024-04-19T09:41:31.556170 #1232052] INFO -- : make[2]: 'ruby' is up to date. I, [2024-04-19T09:41:31.556387 #1232052] INFO -- : make[2]: Leaving directory '/tmp/ruby/build/trunk' I, [2024-04-19T09:41:31.558622 #1232052] INFO -- : make[1]: Leaving directory '/tmp/ruby/build/trunk' I, [2024-04-19T09:41:31.591970 #1232052] INFO -- : make[1]: Entering directory '/tmp/ruby/build/trunk' I, [2024-04-19T09:41:31.592172 #1232052] INFO -- : make[1]: Nothing to be done for 'note'. I, [2024-04-19T09:41:31.592274 #1232052] INFO -- : make[1]: Leaving directory '/tmp/ruby/build/trunk' I, [2024-04-19T09:41:31.593340 #1232052] INFO -- : ./miniruby -I/tmp/ruby/src/trunk/lib -I. -I.ext/common /tmp/ruby/src/trunk/tool/runruby.rb --extout=.ext -- --disable-gems -r./riscv64-linux-fake /tmp/ruby/src/trunk/tool/rbinstall.rb --make="make" --dest-dir="" --extout=".ext" --ext-build-dir="./ext" --mflags="-j4 --jobserver-auth=4,5" --make-flags=" -j4 --jobserver-auth=4,5" --data-mode=0644 --prog-mode=0755 --installed-list .installed.list --mantype="doc" --gnumake --install=all --exclude=doc I, [2024-04-19T09:41:32.846200 #1232052] INFO -- : Installing to I, [2024-04-19T09:41:32.846424 #1232052] INFO -- : installing binary commands: /tmp/ruby/install/trunk/bin I, [2024-04-19T09:41:32.848474 #1232052] INFO -- : installing base libraries: /tmp/ruby/install/trunk/lib I, [2024-04-19T09:41:32.890286 #1232052] INFO -- : installing arch files: /tmp/ruby/install/trunk/lib/ruby/3.4.0+0/riscv64-linux I, [2024-04-19T09:41:32.891059 #1232052] INFO -- : installing pkgconfig data: /tmp/ruby/install/trunk/lib/pkgconfig I, [2024-04-19T09:41:32.891599 #1232052] INFO -- : installing extension objects: /tmp/ruby/install/trunk/lib/ruby/3.4.0+0/riscv64-linux I, [2024-04-19T09:41:33.016922 #1232052] INFO -- : installing extension objects: /tmp/ruby/install/trunk/lib/ruby/site_ruby/3.4.0+0/riscv64-linux I, [2024-04-19T09:41:33.017119 #1232052] INFO -- : installing extension objects: /tmp/ruby/install/trunk/lib/ruby/vendor_ruby/3.4.0+0/riscv64-linux I, [2024-04-19T09:41:33.017618 #1232052] INFO -- : installing extension headers: /tmp/ruby/install/trunk/include/ruby-3.4.0+0/riscv64-linux I, [2024-04-19T09:41:33.019699 #1232052] INFO -- : installing extension scripts: /tmp/ruby/install/trunk/lib/ruby/3.4.0+0 I, [2024-04-19T09:41:33.070116 #1232052] INFO -- : installing extension scripts: /tmp/ruby/install/trunk/lib/ruby/site_ruby/3.4.0+0 I, [2024-04-19T09:41:33.070300 #1232052] INFO -- : installing extension scripts: /tmp/ruby/install/trunk/lib/ruby/vendor_ruby/3.4.0+0 I, [2024-04-19T09:41:33.070393 #1232052] INFO -- : installing extension headers: /tmp/ruby/install/trunk/include/ruby-3.4.0+0/ruby I, [2024-04-19T09:41:33.071270 #1232052] INFO -- : installing command scripts: /tmp/ruby/install/trunk/bin I, [2024-04-19T09:41:33.072095 #1232052] INFO -- : installing library scripts: /tmp/ruby/install/trunk/lib/ruby/3.4.0+0 I, [2024-04-19T09:41:33.595190 #1232052] INFO -- : installing common headers: /tmp/ruby/install/trunk/include/ruby-3.4.0+0 I, [2024-04-19T09:41:33.677541 #1232052] INFO -- : installing manpages: /tmp/ruby/install/trunk/share/man/man1 I, [2024-04-19T09:41:33.679865 #1232052] INFO -- : installing default gems from lib: /tmp/ruby/install/trunk/lib/ruby/gems/3.4.0+0 I, [2024-04-19T09:41:33.983752 #1232052] INFO -- : benchmark 0.3.0 I, [2024-04-19T09:41:34.083205 #1232052] INFO -- : bundler 2.6.0.dev I, [2024-04-19T09:41:34.101391 #1232052] INFO -- : cgi 0.4.1 I, [2024-04-19T09:41:34.108196 #1232052] INFO -- : delegate 0.3.1 I, [2024-04-19T09:41:34.114827 #1232052] INFO -- : did_you_mean 1.6.3 I, [2024-04-19T09:41:34.121651 #1232052] INFO -- : english 0.8.0 I, [2024-04-19T09:41:34.128218 #1232052] INFO -- : erb 4.0.4 I, [2024-04-19T09:41:34.139621 #1232052] INFO -- : error_highlight 0.6.0 I, [2024-04-19T09:41:34.146046 #1232052] INFO -- : fileutils 1.7.2 I, [2024-04-19T09:41:34.152662 #1232052] INFO -- : find 0.2.0 I, [2024-04-19T09:41:34.159253 #1232052] INFO -- : forwardable 1.3.3 I, [2024-04-19T09:41:34.165787 #1232052] INFO -- : ipaddr 1.2.6 I, [2024-04-19T09:41:34.177998 #1232052] INFO -- : irb 1.12.0 I, [2024-04-19T09:41:34.190121 #1232052] INFO -- : logger 1.6.0 I, [2024-04-19T09:41:34.196667 #1232052] INFO -- : net-http 0.4.1 I, [2024-04-19T09:41:34.203765 #1232052] INFO -- : net-protocol 0.2.2 I, [2024-04-19T09:41:34.210660 #1232052] INFO -- : open-uri 0.4.1 I, [2024-04-19T09:41:34.217744 #1232052] INFO -- : open3 0.2.1 I, [2024-04-19T09:41:34.224515 #1232052] INFO -- : optparse 0.5.0 I, [2024-04-19T09:41:34.231963 #1232052] INFO -- : ostruct 0.6.0 I, [2024-04-19T09:41:34.239219 #1232052] INFO -- : pp 0.5.0 I, [2024-04-19T09:41:34.246255 #1232052] INFO -- : prettyprint 0.2.0 I, [2024-04-19T09:41:34.252952 #1232052] INFO -- : prism 0.26.0 I, [2024-04-19T09:41:34.260032 #1232052] INFO -- : pstore 0.1.3 I, [2024-04-19T09:41:34.266570 #1232052] INFO -- : rdoc 6.6.3.1 I, [2024-04-19T09:41:34.287043 #1232052] INFO -- : readline 0.0.4 I, [2024-04-19T09:41:34.293645 #1232052] INFO -- : reline 0.5.2 I, [2024-04-19T09:41:34.300791 #1232052] INFO -- : resolv 0.4.0 I, [2024-04-19T09:41:34.307544 #1232052] INFO -- : ruby2_keywords 0.0.5 I, [2024-04-19T09:41:34.314246 #1232052] INFO -- : securerandom 0.3.1 I, [2024-04-19T09:41:34.321050 #1232052] INFO -- : set 1.1.0 I, [2024-04-19T09:41:34.327891 #1232052] INFO -- : shellwords 0.2.0 I, [2024-04-19T09:41:34.334725 #1232052] INFO -- : singleton 0.2.0 I, [2024-04-19T09:41:34.341178 #1232052] INFO -- : syntax_suggest 2.0.0 I, [2024-04-19T09:41:34.351915 #1232052] INFO -- : tempfile 0.2.1 I, [2024-04-19T09:41:34.358565 #1232052] INFO -- : time 0.3.0 I, [2024-04-19T09:41:34.365581 #1232052] INFO -- : timeout 0.4.1 I, [2024-04-19T09:41:34.372306 #1232052] INFO -- : tmpdir 0.2.0 I, [2024-04-19T09:41:34.379330 #1232052] INFO -- : tsort 0.2.0 I, [2024-04-19T09:41:34.390842 #1232052] INFO -- : un 0.3.0 I, [2024-04-19T09:41:34.399261 #1232052] INFO -- : uri 0.13.0 I, [2024-04-19T09:41:34.406216 #1232052] INFO -- : weakref 0.1.3 I, [2024-04-19T09:41:34.413018 #1232052] INFO -- : yaml 0.3.0 I, [2024-04-19T09:41:34.418290 #1232052] INFO -- : installing default gems from ext: /tmp/ruby/install/trunk/lib/ruby/gems/3.4.0+0 I, [2024-04-19T09:41:34.488711 #1232052] INFO -- : date 3.3.4 I, [2024-04-19T09:41:34.495445 #1232052] INFO -- : digest 3.1.1 I, [2024-04-19T09:41:34.508779 #1232052] INFO -- : etc 1.4.3 I, [2024-04-19T09:41:34.515866 #1232052] INFO -- : fcntl 1.1.0 I, [2024-04-19T09:41:34.522704 #1232052] INFO -- : fiddle 1.1.3 I, [2024-04-19T09:41:34.529545 #1232052] INFO -- : io-console 0.7.2 I, [2024-04-19T09:41:34.536294 #1232052] INFO -- : io-nonblock 0.3.0 I, [2024-04-19T09:41:34.543091 #1232052] INFO -- : io-wait 0.3.1 I, [2024-04-19T09:41:34.549575 #1232052] INFO -- : json 2.7.2 I, [2024-04-19T09:41:34.557026 #1232052] INFO -- : openssl 3.2.0 I, [2024-04-19T09:41:34.565304 #1232052] INFO -- : pathname 0.3.0 I, [2024-04-19T09:41:34.572244 #1232052] INFO -- : psych 5.1.2 I, [2024-04-19T09:41:34.579875 #1232052] INFO -- : stringio 3.1.1 I, [2024-04-19T09:41:34.587024 #1232052] INFO -- : strscan 3.1.1 I, [2024-04-19T09:41:34.598928 #1232052] INFO -- : zlib 3.1.0 I, [2024-04-19T09:41:34.604371 #1232052] INFO -- : installing bundled gems: /tmp/ruby/install/trunk/lib/ruby/gems/3.4.0+0 I, [2024-04-19T09:41:34.608898 #1232052] INFO -- : minitest 5.22.3 I, [2024-04-19T09:41:34.691477 #1232052] INFO -- : rake 13.2.1 I, [2024-04-19T09:41:34.758943 #1232052] INFO -- : test-unit 3.6.2 I, [2024-04-19T09:41:34.819387 #1232052] INFO -- : rexml 3.2.6 I, [2024-04-19T09:41:34.885549 #1232052] INFO -- : rss 0.3.0 I, [2024-04-19T09:41:34.927017 #1232052] INFO -- : net-ftp 0.3.4 I, [2024-04-19T09:41:34.947086 #1232052] INFO -- : net-imap 0.4.10 I, [2024-04-19T09:41:34.993116 #1232052] INFO -- : net-pop 0.1.2 I, [2024-04-19T09:41:35.005897 #1232052] INFO -- : net-smtp 0.5.0 I, [2024-04-19T09:41:35.028890 #1232052] INFO -- : matrix 0.4.2 I, [2024-04-19T09:41:35.068400 #1232052] INFO -- : prime 0.1.2 I, [2024-04-19T09:41:35.129881 #1232052] INFO -- : rbs 3.4.4 I, [2024-04-19T09:41:35.513692 #1232052] INFO -- : typeprof 0.21.11 I, [2024-04-19T09:41:35.548352 #1232052] INFO -- : debug 1.9.2 I, [2024-04-19T09:41:35.588916 #1232052] INFO -- : racc 1.7.3 I, [2024-04-19T09:41:35.632545 #1232052] INFO -- : mutex_m 0.2.0 I, [2024-04-19T09:41:35.648051 #1232052] INFO -- : getoptlong 0.2.1 I, [2024-04-19T09:41:35.669322 #1232052] INFO -- : base64 0.2.0 I, [2024-04-19T09:41:35.683317 #1232052] INFO -- : bigdecimal 3.1.7 I, [2024-04-19T09:41:35.711738 #1232052] INFO -- : observer 0.1.2 I, [2024-04-19T09:41:35.730569 #1232052] INFO -- : abbrev 0.1.2 I, [2024-04-19T09:41:35.744934 #1232052] INFO -- : resolv-replace 0.1.1 I, [2024-04-19T09:41:35.760685 #1232052] INFO -- : rinda 0.2.0 I, [2024-04-19T09:41:35.779419 #1232052] INFO -- : drb 2.2.1 I, [2024-04-19T09:41:35.801852 #1232052] INFO -- : nkf 0.2.0 I, [2024-04-19T09:41:35.835468 #1232052] INFO -- : syslog 0.1.2 I, [2024-04-19T09:41:35.862210 #1232052] INFO -- : csv 3.3.0 I, [2024-04-19T09:41:35.897738 #1232052] INFO -- : installing bundled gem cache: /tmp/ruby/install/trunk/lib/ruby/gems/3.4.0+0/cache I, [2024-04-19T09:41:35.917914 #1232052] INFO -- : skipped bundled gems: I, [2024-04-19T09:41:35.918136 #1232052] INFO -- : power_assert-2.0.4dev.gem not found in bundled_gems I, [2024-04-19T09:41:35.941760 #1232052] INFO -- : $$$[end] "make install -j4" exit with 0. I, [2024-04-19T09:41:35.942389 #1232052] INFO -- : $$$[beg] make yes-btest TESTOPTS='-q -j4' I, [2024-04-19T09:42:50.051781 #1232052] INFO -- : PASS all 1926 tests E, [2024-04-19T09:42:50.073205 #1232052] ERROR -- : I, [2024-04-19T09:42:50.073745 #1232052] INFO -- : $$$[end] "make yes-btest TESTOPTS='-q -j4'" exit with 0. I, [2024-04-19T09:42:50.074277 #1232052] INFO -- : $$$[beg] make yes-test-basic TESTS='-j4' I, [2024-04-19T09:42:50.630403 #1232052] INFO -- : BASERUBY = /usr/bin/ruby --disable=gems I, [2024-04-19T09:42:50.630720 #1232052] INFO -- : CC = gcc I, [2024-04-19T09:42:50.630876 #1232052] INFO -- : LD = ld I, [2024-04-19T09:42:50.631025 #1232052] INFO -- : LDSHARED = gcc -shared I, [2024-04-19T09:42:50.631179 #1232052] INFO -- : CFLAGS = -O3 -fno-fast-math -ggdb3 -Wall -Wextra -Wdeprecated-declarations -Wdiv-by-zero -Wduplicated-cond -Wimplicit-function-declaration -Wimplicit-int -Wpointer-arith -Wwrite-strings -Wold-style-definition -Wimplicit-fallthrough=0 -Wmissing-noreturn -Wno-cast-function-type -Wno-constant-logical-operand -Wno-long-long -Wno-missing-field-initializers -Wno-overlength-strings -Wno-packed-bitfield-compat -Wno-parentheses-equality -Wno-self-assign -Wno-tautological-compare -Wno-unused-parameter -Wno-unused-value -Wsuggest-attribute=format -Wsuggest-attribute=noreturn -Wunused-variable -Wmisleading-indentation -Wundef -fPIC I, [2024-04-19T09:42:50.631334 #1232052] INFO -- : XCFLAGS = -U_FORTIFY_SOURCE -D_FORTIFY_SOURCE=2 -fstack-protector-strong -fno-strict-overflow -fvisibility=hidden -fexcess-precision=standard -DRUBY_EXPORT -I. -I.ext/include/riscv64-linux -I/tmp/ruby/src/trunk/include -I/tmp/ruby/src/trunk -I/tmp/ruby/src/trunk/prism -I/tmp/ruby/src/trunk/enc/unicode/15.0.0 I, [2024-04-19T09:42:50.631480 #1232052] INFO -- : CPPFLAGS = I, [2024-04-19T09:42:50.631628 #1232052] INFO -- : DLDFLAGS = -Wl,--compress-debug-sections=zlib -Wl,-soname,libruby.so.3.4 -fstack-protector-strong I, [2024-04-19T09:42:50.631770 #1232052] INFO -- : SOLIBS = -lz -lrt -lrt -lgmp -ldl -lcrypt -lm -lpthread I, [2024-04-19T09:42:50.631906 #1232052] INFO -- : LANG = I, [2024-04-19T09:42:50.632042 #1232052] INFO -- : LC_ALL = I, [2024-04-19T09:42:50.632183 #1232052] INFO -- : LC_CTYPE = I, [2024-04-19T09:42:50.632315 #1232052] INFO -- : MFLAGS = I, [2024-04-19T09:42:50.632441 #1232052] INFO -- : RUSTC = rustc I, [2024-04-19T09:42:50.632602 #1232052] INFO -- : YJIT_RUSTC_ARGS = --crate-name=yjit --crate-type=staticlib --edition=2021 -g -C lto=thin -C opt-level=3 -C overflow-checks=on '--out-dir=/tmp/ruby/build/trunk/yjit/target/release/' /tmp/ruby/src/trunk/yjit/src/lib.rs I, [2024-04-19T09:42:50.635974 #1232052] INFO -- : gcc (Debian 13.2.0-4revyos1) 13.2.0 I, [2024-04-19T09:42:50.636166 #1232052] INFO -- : Copyright (C) 2023 Free Software Foundation, Inc. I, [2024-04-19T09:42:50.636254 #1232052] INFO -- : This is free software; see the source for copying conditions. There is NO I, [2024-04-19T09:42:50.636342 #1232052] INFO -- : warranty; not even for MERCHANTABILITY or FITNESS FOR A PARTICULAR PURPOSE. I, [2024-04-19T09:42:50.636495 #1232052] INFO -- : I, [2024-04-19T09:42:52.591587 #1232052] INFO -- : Checking leaked global symbols...none I, [2024-04-19T09:42:52.893831 #1232052] INFO -- : /tmp/ruby/src/trunk/basictest/test.rb:assignment ....................................................................................................................................................................................................................................................................................................................................................................................OK 372 I, [2024-04-19T09:42:52.894054 #1232052] INFO -- : /tmp/ruby/src/trunk/basictest/test.rb:condition ..OK 2 I, [2024-04-19T09:42:52.894158 #1232052] INFO -- : /tmp/ruby/src/trunk/basictest/test.rb:if/unless ...OK 3 I, [2024-04-19T09:42:52.894454 #1232052] INFO -- : /tmp/ruby/src/trunk/basictest/test.rb:case .....OK 5 I, [2024-04-19T09:42:52.895792 #1232052] INFO -- : /tmp/ruby/src/trunk/basictest/test.rb:while/until ........OK 8 I, [2024-04-19T09:42:52.896576 #1232052] INFO -- : /tmp/ruby/src/trunk/basictest/test.rb:exception ..........OK 10 I, [2024-04-19T09:42:52.899158 #1232052] INFO -- : /tmp/ruby/src/trunk/basictest/test.rb:array .......................................OK 39 I, [2024-04-19T09:42:52.900736 #1232052] INFO -- : /tmp/ruby/src/trunk/basictest/test.rb:hash ...........................OK 27 I, [2024-04-19T09:42:52.909239 #1232052] INFO -- : /tmp/ruby/src/trunk/basictest/test.rb:iterator ...........................................................................................................OK 107 I, [2024-04-19T09:42:52.913893 #1232052] INFO -- : /tmp/ruby/src/trunk/basictest/test.rb:float ................................................................................OK 80 I, [2024-04-19T09:42:52.929839 #1232052] INFO -- : /tmp/ruby/src/trunk/basictest/test.rb:bignum ...............................OK 31 I, [2024-04-19T09:42:52.943446 #1232052] INFO -- : /tmp/ruby/src/trunk/basictest/test.rb:string & char ..............................................................OK 62 I, [2024-04-19T09:42:52.943965 #1232052] INFO -- : /tmp/ruby/src/trunk/basictest/test.rb:assignment ..........OK 10 I, [2024-04-19T09:42:52.944425 #1232052] INFO -- : /tmp/ruby/src/trunk/basictest/test.rb:call ......OK 6 I, [2024-04-19T09:42:52.945202 #1232052] INFO -- : /tmp/ruby/src/trunk/basictest/test.rb:proc .........OK 9 I, [2024-04-19T09:42:53.045744 #1232052] INFO -- : /tmp/ruby/src/trunk/basictest/test.rb:signal ..OK 2 I, [2024-04-19T09:42:53.069983 #1232052] INFO -- : /tmp/ruby/src/trunk/basictest/test.rb:eval ...........................OK 27 I, [2024-04-19T09:42:53.495733 #1232052] INFO -- : /tmp/ruby/src/trunk/basictest/test.rb:system ........OK 8 I, [2024-04-19T09:42:53.496149 #1232052] INFO -- : /tmp/ruby/src/trunk/basictest/test.rb:const .....OK 5 I, [2024-04-19T09:42:53.496660 #1232052] INFO -- : /tmp/ruby/src/trunk/basictest/test.rb:clone .....OK 5 I, [2024-04-19T09:42:53.497665 #1232052] INFO -- : /tmp/ruby/src/trunk/basictest/test.rb:marshal ....OK 4 I, [2024-04-19T09:42:53.498116 #1232052] INFO -- : /tmp/ruby/src/trunk/basictest/test.rb:pack ....OK 4 I, [2024-04-19T09:42:53.498302 #1232052] INFO -- : /tmp/ruby/src/trunk/basictest/test.rb:math ..OK 2 I, [2024-04-19T09:42:53.498874 #1232052] INFO -- : /tmp/ruby/src/trunk/basictest/test.rb:struct ......OK 6 I, [2024-04-19T09:42:53.499840 #1232052] INFO -- : /tmp/ruby/src/trunk/basictest/test.rb:variable ............OK 12 I, [2024-04-19T09:42:53.500065 #1232052] INFO -- : /tmp/ruby/src/trunk/basictest/test.rb:trace ...OK 3 I, [2024-04-19T09:42:53.500788 #1232052] INFO -- : /tmp/ruby/src/trunk/basictest/test.rb:defined? ............OK 12 I, [2024-04-19T09:42:53.501627 #1232052] INFO -- : /tmp/ruby/src/trunk/basictest/test.rb:alias ......OK 6 I, [2024-04-19T09:42:53.509658 #1232052] INFO -- : /tmp/ruby/src/trunk/basictest/test.rb:path .......................OK 23 I, [2024-04-19T09:42:53.906517 #1232052] INFO -- : /tmp/ruby/src/trunk/basictest/test.rb:gc ....OK 4 I, [2024-04-19T09:42:53.922869 #1232052] INFO -- : I, [2024-04-19T09:42:53.923093 #1232052] INFO -- : test succeeded I, [2024-04-19T09:42:53.928577 #1232052] INFO -- : $$$[end] "make yes-test-basic TESTS='-j4'" exit with 0. I, [2024-04-19T09:42:53.929282 #1232052] INFO -- : $$$[beg] make yes-test-all TESTOPTS='--stderr-on-failure' TESTS='-j4' I, [2024-04-19T09:42:54.774230 #1232052] INFO -- : BASERUBY = /usr/bin/ruby --disable=gems I, [2024-04-19T09:42:54.774438 #1232052] INFO -- : CC = gcc I, [2024-04-19T09:42:54.774607 #1232052] INFO -- : LD = ld I, [2024-04-19T09:42:54.774725 #1232052] INFO -- : LDSHARED = gcc -shared I, [2024-04-19T09:42:54.774854 #1232052] INFO -- : CFLAGS = -O3 -fno-fast-math -ggdb3 -Wall -Wextra -Wdeprecated-declarations -Wdiv-by-zero -Wduplicated-cond -Wimplicit-function-declaration -Wimplicit-int -Wpointer-arith -Wwrite-strings -Wold-style-definition -Wimplicit-fallthrough=0 -Wmissing-noreturn -Wno-cast-function-type -Wno-constant-logical-operand -Wno-long-long -Wno-missing-field-initializers -Wno-overlength-strings -Wno-packed-bitfield-compat -Wno-parentheses-equality -Wno-self-assign -Wno-tautological-compare -Wno-unused-parameter -Wno-unused-value -Wsuggest-attribute=format -Wsuggest-attribute=noreturn -Wunused-variable -Wmisleading-indentation -Wundef -fPIC I, [2024-04-19T09:42:54.774976 #1232052] INFO -- : XCFLAGS = -U_FORTIFY_SOURCE -D_FORTIFY_SOURCE=2 -fstack-protector-strong -fno-strict-overflow -fvisibility=hidden -fexcess-precision=standard -DRUBY_EXPORT -I. -I.ext/include/riscv64-linux -I/tmp/ruby/src/trunk/include -I/tmp/ruby/src/trunk -I/tmp/ruby/src/trunk/prism -I/tmp/ruby/src/trunk/enc/unicode/15.0.0 I, [2024-04-19T09:42:54.775100 #1232052] INFO -- : CPPFLAGS = I, [2024-04-19T09:42:54.775222 #1232052] INFO -- : DLDFLAGS = -Wl,--compress-debug-sections=zlib -Wl,-soname,libruby.so.3.4 -fstack-protector-strong I, [2024-04-19T09:42:54.775330 #1232052] INFO -- : SOLIBS = -lz -lrt -lrt -lgmp -ldl -lcrypt -lm -lpthread I, [2024-04-19T09:42:54.775427 #1232052] INFO -- : LANG = I, [2024-04-19T09:42:54.775518 #1232052] INFO -- : LC_ALL = I, [2024-04-19T09:42:54.775618 #1232052] INFO -- : LC_CTYPE = I, [2024-04-19T09:42:54.775712 #1232052] INFO -- : MFLAGS = I, [2024-04-19T09:42:54.775800 #1232052] INFO -- : RUSTC = rustc I, [2024-04-19T09:42:54.775887 #1232052] INFO -- : YJIT_RUSTC_ARGS = --crate-name=yjit --crate-type=staticlib --edition=2021 -g -C lto=thin -C opt-level=3 -C overflow-checks=on '--out-dir=/tmp/ruby/build/trunk/yjit/target/release/' /tmp/ruby/src/trunk/yjit/src/lib.rs I, [2024-04-19T09:42:54.777555 #1232052] INFO -- : gcc (Debian 13.2.0-4revyos1) 13.2.0 I, [2024-04-19T09:42:54.777717 #1232052] INFO -- : Copyright (C) 2023 Free Software Foundation, Inc. I, [2024-04-19T09:42:54.777808 #1232052] INFO -- : This is free software; see the source for copying conditions. There is NO I, [2024-04-19T09:42:54.777896 #1232052] INFO -- : warranty; not even for MERCHANTABILITY or FITNESS FOR A PARTICULAR PURPOSE. I, [2024-04-19T09:42:54.777986 #1232052] INFO -- : I, [2024-04-19T09:42:54.795069 #1232052] INFO -- : generating enc.mk I, [2024-04-19T09:42:56.239825 #1232052] INFO -- : generating encdb.h I, [2024-04-19T09:42:56.470405 #1232052] INFO -- : encdb.h unchanged I, [2024-04-19T09:42:56.475968 #1232052] INFO -- : making enc I, [2024-04-19T09:42:56.643065 #1232052] INFO -- : make[1]: Entering directory '/tmp/ruby/build/trunk' I, [2024-04-19T09:42:56.643342 #1232052] INFO -- : make[1]: Nothing to be done for 'enc'. I, [2024-04-19T09:42:56.643558 #1232052] INFO -- : make[1]: Leaving directory '/tmp/ruby/build/trunk' I, [2024-04-19T09:42:56.646524 #1232052] INFO -- : making srcs under enc I, [2024-04-19T09:42:56.934339 #1232052] INFO -- : make[1]: Entering directory '/tmp/ruby/build/trunk' I, [2024-04-19T09:42:56.934651 #1232052] INFO -- : make[1]: Nothing to be done for 'srcs'. I, [2024-04-19T09:42:56.934882 #1232052] INFO -- : make[1]: Leaving directory '/tmp/ruby/build/trunk' I, [2024-04-19T09:42:56.940069 #1232052] INFO -- : generating transdb.h I, [2024-04-19T09:42:58.228839 #1232052] INFO -- : transdb.h unchanged I, [2024-04-19T09:42:58.234532 #1232052] INFO -- : making trans I, [2024-04-19T09:42:58.581962 #1232052] INFO -- : make[1]: Entering directory '/tmp/ruby/build/trunk' I, [2024-04-19T09:42:58.582156 #1232052] INFO -- : make[1]: Nothing to be done for 'trans'. I, [2024-04-19T09:42:58.582253 #1232052] INFO -- : make[1]: Leaving directory '/tmp/ruby/build/trunk' I, [2024-04-19T09:42:58.584869 #1232052] INFO -- : making encs I, [2024-04-19T09:42:58.965889 #1232052] INFO -- : make[1]: Entering directory '/tmp/ruby/build/trunk' I, [2024-04-19T09:42:58.966087 #1232052] INFO -- : make[1]: Nothing to be done for 'encs'. I, [2024-04-19T09:42:58.966180 #1232052] INFO -- : make[1]: Leaving directory '/tmp/ruby/build/trunk' I, [2024-04-19T09:42:58.980876 #1232052] INFO -- : generating makefiles ext/configure-ext.mk I, [2024-04-19T09:42:59.179143 #1232052] INFO -- : ext/configure-ext.mk updated I, [2024-04-19T09:42:59.192340 #1232052] INFO -- : make[1]: Entering directory '/tmp/ruby/build/trunk' I, [2024-04-19T09:43:11.057820 #1232052] INFO -- : make[1]: Leaving directory '/tmp/ruby/build/trunk' I, [2024-04-19T09:43:11.059986 #1232052] INFO -- : generating makefile exts.mk I, [2024-04-19T09:43:11.384409 #1232052] INFO -- : exts.mk unchanged I, [2024-04-19T09:43:11.421746 #1232052] INFO -- : make[1]: Entering directory '/tmp/ruby/build/trunk' I, [2024-04-19T09:43:13.633447 #1232052] INFO -- : make[2]: Entering directory '/tmp/ruby/build/trunk/ext/coverage' I, [2024-04-19T09:43:13.658821 #1232052] INFO -- : make[2]: Leaving directory '/tmp/ruby/build/trunk/ext/coverage' I, [2024-04-19T09:43:13.708401 #1232052] INFO -- : make[2]: Entering directory '/tmp/ruby/build/trunk/ext/date' I, [2024-04-19T09:43:13.745010 #1232052] INFO -- : make[2]: Leaving directory '/tmp/ruby/build/trunk/ext/date' I, [2024-04-19T09:43:13.769551 #1232052] INFO -- : make[2]: Entering directory '/tmp/ruby/build/trunk/ext/digest' I, [2024-04-19T09:43:13.828033 #1232052] INFO -- : make[2]: Leaving directory '/tmp/ruby/build/trunk/ext/digest' I, [2024-04-19T09:43:14.000791 #1232052] INFO -- : make[2]: Entering directory '/tmp/ruby/build/trunk/ext/digest/sha2' I, [2024-04-19T09:43:14.024154 #1232052] INFO -- : make[2]: Leaving directory '/tmp/ruby/build/trunk/ext/digest/sha2' I, [2024-04-19T09:43:14.159786 #1232052] INFO -- : make[2]: Entering directory '/tmp/ruby/build/trunk/ext/fiddle' I, [2024-04-19T09:43:14.224101 #1232052] INFO -- : make[2]: Leaving directory '/tmp/ruby/build/trunk/ext/fiddle' I, [2024-04-19T09:43:14.263631 #1232052] INFO -- : make[2]: Entering directory '/tmp/ruby/build/trunk/ext/io/console' I, [2024-04-19T09:43:14.286851 #1232052] INFO -- : make[2]: Leaving directory '/tmp/ruby/build/trunk/ext/io/console' I, [2024-04-19T09:43:14.373431 #1232052] INFO -- : make[2]: Entering directory '/tmp/ruby/build/trunk/ext/json' I, [2024-04-19T09:43:14.438142 #1232052] INFO -- : make[2]: Leaving directory '/tmp/ruby/build/trunk/ext/json' I, [2024-04-19T09:43:14.530932 #1232052] INFO -- : make[2]: Entering directory '/tmp/ruby/build/trunk/ext/monitor' I, [2024-04-19T09:43:14.550869 #1232052] INFO -- : make[2]: Leaving directory '/tmp/ruby/build/trunk/ext/monitor' I, [2024-04-19T09:43:14.603511 #1232052] INFO -- : make[2]: Entering directory '/tmp/ruby/build/trunk/ext/objspace' I, [2024-04-19T09:43:14.638109 #1232052] INFO -- : make[2]: Leaving directory '/tmp/ruby/build/trunk/ext/objspace' I, [2024-04-19T09:43:14.758744 #1232052] INFO -- : make[2]: Entering directory '/tmp/ruby/build/trunk/ext/openssl' I, [2024-04-19T09:43:14.890446 #1232052] INFO -- : make[2]: Leaving directory '/tmp/ruby/build/trunk/ext/openssl' I, [2024-04-19T09:43:14.917138 #1232052] INFO -- : make[2]: Entering directory '/tmp/ruby/build/trunk/ext/pathname' I, [2024-04-19T09:43:14.938005 #1232052] INFO -- : make[2]: Leaving directory '/tmp/ruby/build/trunk/ext/pathname' I, [2024-04-19T09:43:14.982290 #1232052] INFO -- : make[2]: Entering directory '/tmp/ruby/build/trunk/ext/psych' I, [2024-04-19T09:43:15.146170 #1232052] INFO -- : make[2]: Leaving directory '/tmp/ruby/build/trunk/ext/psych' I, [2024-04-19T09:43:15.178655 #1232052] INFO -- : make[2]: Entering directory '/tmp/ruby/build/trunk/ext/pty' I, [2024-04-19T09:43:15.198445 #1232052] INFO -- : make[2]: Leaving directory '/tmp/ruby/build/trunk/ext/pty' I, [2024-04-19T09:43:15.311754 #1232052] INFO -- : make[2]: Entering directory '/tmp/ruby/build/trunk/ext/ripper' I, [2024-04-19T09:43:15.358694 #1232052] INFO -- : make[2]: Leaving directory '/tmp/ruby/build/trunk/ext/ripper' I, [2024-04-19T09:43:15.370085 #1232052] INFO -- : make[2]: Entering directory '/tmp/ruby/build/trunk/ext/rubyvm' I, [2024-04-19T09:43:15.385478 #1232052] INFO -- : make[2]: Leaving directory '/tmp/ruby/build/trunk/ext/rubyvm' I, [2024-04-19T09:43:15.468799 #1232052] INFO -- : make[2]: Entering directory '/tmp/ruby/build/trunk/ext/socket' I, [2024-04-19T09:43:15.526718 #1232052] INFO -- : make[2]: Leaving directory '/tmp/ruby/build/trunk/ext/socket' I, [2024-04-19T09:43:15.640510 #1232052] INFO -- : make[2]: Entering directory '/tmp/ruby/build/trunk/.bundle/gems/bigdecimal-3.1.7/ext/bigdecimal' I, [2024-04-19T09:43:15.802308 #1232052] INFO -- : make[2]: Leaving directory '/tmp/ruby/build/trunk/.bundle/gems/bigdecimal-3.1.7/ext/bigdecimal' I, [2024-04-19T09:43:15.820153 #1232052] INFO -- : make[2]: Entering directory '/tmp/ruby/build/trunk/.bundle/gems/debug-1.9.2/ext/debug' I, [2024-04-19T09:43:15.986422 #1232052] INFO -- : make[2]: Leaving directory '/tmp/ruby/build/trunk/.bundle/gems/debug-1.9.2/ext/debug' I, [2024-04-19T09:43:16.004252 #1232052] INFO -- : make[2]: Entering directory '/tmp/ruby/build/trunk/.bundle/gems/nkf-0.2.0/ext/nkf' I, [2024-04-19T09:43:16.154569 #1232052] INFO -- : make[2]: Leaving directory '/tmp/ruby/build/trunk/.bundle/gems/nkf-0.2.0/ext/nkf' I, [2024-04-19T09:43:16.172135 #1232052] INFO -- : make[2]: Entering directory '/tmp/ruby/build/trunk/.bundle/gems/racc-1.7.3/ext/racc/cparse' I, [2024-04-19T09:43:16.331503 #1232052] INFO -- : make[2]: Leaving directory '/tmp/ruby/build/trunk/.bundle/gems/racc-1.7.3/ext/racc/cparse' I, [2024-04-19T09:43:16.353477 #1232052] INFO -- : make[2]: Entering directory '/tmp/ruby/build/trunk/.bundle/gems/rbs-3.4.4/ext/rbs_extension' I, [2024-04-19T09:43:16.506950 #1232052] INFO -- : make[2]: Leaving directory '/tmp/ruby/build/trunk/.bundle/gems/rbs-3.4.4/ext/rbs_extension' I, [2024-04-19T09:43:16.524495 #1232052] INFO -- : make[2]: Entering directory '/tmp/ruby/build/trunk/.bundle/gems/syslog-0.1.2/ext/syslog' I, [2024-04-19T09:43:16.676219 #1232052] INFO -- : make[2]: Leaving directory '/tmp/ruby/build/trunk/.bundle/gems/syslog-0.1.2/ext/syslog' I, [2024-04-19T09:43:16.895673 #1232052] INFO -- : make[2]: Entering directory '/tmp/ruby/build/trunk' I, [2024-04-19T09:43:17.538774 #1232052] INFO -- : make[2]: 'ruby' is up to date. I, [2024-04-19T09:43:17.538992 #1232052] INFO -- : make[2]: Leaving directory '/tmp/ruby/build/trunk' I, [2024-04-19T09:43:17.540715 #1232052] INFO -- : make[1]: Leaving directory '/tmp/ruby/build/trunk' I, [2024-04-19T09:43:17.574205 #1232052] INFO -- : make[1]: Entering directory '/tmp/ruby/build/trunk' I, [2024-04-19T09:43:17.574403 #1232052] INFO -- : make[1]: Nothing to be done for 'note'. I, [2024-04-19T09:43:17.574536 #1232052] INFO -- : make[1]: Leaving directory '/tmp/ruby/build/trunk' I, [2024-04-19T09:43:18.316875 #1232052] INFO -- : Run options: I, [2024-04-19T09:43:18.317085 #1232052] INFO -- : --seed=53202 I, [2024-04-19T09:43:18.317186 #1232052] INFO -- : "--ruby=./miniruby -I/tmp/ruby/src/trunk/lib -I. -I.ext/common /tmp/ruby/src/trunk/tool/runruby.rb --extout=.ext -- --disable-gems" I, [2024-04-19T09:43:18.317299 #1232052] INFO -- : --excludes-dir=/tmp/ruby/src/trunk/test/.excludes I, [2024-04-19T09:43:18.317390 #1232052] INFO -- : --name=!/memory_leak/ I, [2024-04-19T09:43:18.317479 #1232052] INFO -- : --stderr-on-failure I, [2024-04-19T09:43:18.317565 #1232052] INFO -- : -j4 I, [2024-04-19T09:43:18.317701 #1232052] INFO -- : I, [2024-04-19T09:43:18.317794 #1232052] INFO -- : # Running tests: I, [2024-04-19T09:43:18.319646 #1232052] INFO -- : I, [2024-04-19T09:43:19.295090 #1232052] INFO -- : [ 1/880] 1280717=test_digest I, [2024-04-19T09:43:19.305522 #1232052] INFO -- : [ 2/880] 1280718=test_marshalable I, [2024-04-19T09:43:19.328065 #1232052] INFO -- : [ 3/880] 1280719=test_require I, [2024-04-19T09:43:19.341405 #1232052] INFO -- : [ 4/880] 1280716=test_cgi_util I, [2024-04-19T09:43:19.481129 #1232052] INFO -- : [ 5/880] 1280718=test_gem_commands_contents_command I, [2024-04-19T09:43:21.095612 #1232052] INFO -- : [ 6/880] 1280716=test_gem_ext_cmake_builder I, [2024-04-19T09:43:21.731357 #1232052] INFO -- : [ 7/880] 1280718=test_wss I, [2024-04-19T09:43:21.818319 #1232052] INFO -- : [ 8/880] 1280718=test_fiddle I, [2024-04-19T09:43:21.954303 #1232052] INFO -- : [ 9/880] 1280718=test_find I, [2024-04-19T09:43:22.106711 #1232052] INFO -- : [ 10/880] 1280718=test_ractor I, [2024-04-19T09:43:22.546976 #1232052] INFO -- : [ 11/880] 1280718=test_pathname I, [2024-04-19T09:43:22.632190 #1232052] INFO -- : [ 12/880] 1280717=test_init I, [2024-04-19T09:43:22.796948 #1232052] INFO -- : [ 13/880] 1280716=test_complexrational I, [2024-04-19T09:43:22.845137 #1232052] INFO -- : [ 14/880] 1280716=test_gem_package_tar_reader I, [2024-04-19T09:43:22.995254 #1232052] INFO -- : [ 15/880] 1280716=regexp_test I, [2024-04-19T09:43:23.769692 #1232052] INFO -- : [ 16/880] 1280716=test_coverage I, [2024-04-19T09:43:24.016076 #1232052] INFO -- : [ 17/880] 1280718=test_rdoc_encoding I, [2024-04-19T09:43:25.181122 #1232052] INFO -- : [ 18/880] 1280718=test_file I, [2024-04-19T09:43:25.202718 #1232052] INFO -- : [ 19/880] 1280718=test_modify_expand I, [2024-04-19T09:43:25.323166 #1232052] INFO -- : [ 20/880] 1280718=test_rdoc_any_method I, [2024-04-19T09:43:25.432281 #1232052] INFO -- : [ 21/880] 1280717=test_gem_available_set I, [2024-04-19T09:43:27.814054 #1232052] INFO -- : [ 22/880] 1280717=test_rdoc_markdown I, [2024-04-19T09:43:28.342646 #1232052] INFO -- : [ 23/880] 1280718=test_formatter I, [2024-04-19T09:43:28.363532 #1232052] INFO -- : [ 24/880] 1280718=test_bash_completion I, [2024-04-19T09:43:28.388560 #1232052] INFO -- : [ 25/880] 1280718=test_rdoc_constant I, [2024-04-19T09:43:28.467567 #1232052] INFO -- : [ 26/880] 1280716=test_deprecate I, [2024-04-19T09:43:28.750350 #1232052] INFO -- : [ 27/880] 1280716=test_recorder I, [2024-04-19T09:43:28.850190 #1232052] INFO -- : [ 28/880] 1280716=test_gem_commands_owner_command I, [2024-04-19T09:43:29.046348 #1232052] INFO -- : [ 29/880] 1280718=test_gem_source_vendor I, [2024-04-19T09:43:29.104169 #1232052] INFO -- : [ 30/880] 1280718=test_big2str I, [2024-04-19T09:43:29.151173 #1232052] INFO -- : [ 31/880] 1280718=test_handle I, [2024-04-19T09:43:30.003495 #1232052] INFO -- : [ 32/880] 1280718=test_wait I, [2024-04-19T09:43:30.170630 #1232052] INFO -- : [ 33/880] 1280719=test_forwardable I, [2024-04-19T09:43:30.329976 #1232052] INFO -- : [ 34/880] 1280719=test_yaml I, [2024-04-19T09:43:30.438205 #1232052] INFO -- : [ 35/880] 1280717=test_rdoc_markup_formatter I, [2024-04-19T09:43:30.454134 #1232052] INFO -- : [ 36/880] 1280718=test_thread_queue I, [2024-04-19T09:43:30.493232 #1232052] INFO -- : [ 37/880] 1280716=test_nowrite I, [2024-04-19T09:43:30.497651 #1232052] INFO -- : [ 38/880] 1280717=test_ansi_without_terminfo I, [2024-04-19T09:43:30.569110 #1232052] INFO -- : [ 39/880] 1280717=test_gem_commands_sources_command I, [2024-04-19T09:43:30.699509 #1232052] INFO -- : [ 40/880] 1280716=test_euc_tw I, [2024-04-19T09:43:30.769072 #1232052] INFO -- : [ 41/880] 1280716=test_ractor I, [2024-04-19T09:43:30.793846 #1232052] INFO -- : [ 42/880] 1280716=test_bmethod I, [2024-04-19T09:43:30.813861 #1232052] INFO -- : [ 43/880] 1280716=json_fixtures_test I, [2024-04-19T09:43:30.859193 #1232052] INFO -- : [ 44/880] 1280716=test_shapes I, [2024-04-19T09:43:30.892219 #1232052] INFO -- : [ 45/880] 1280716=test_io_timeout I, [2024-04-19T09:43:30.922437 #1232052] INFO -- : [ 46/880] 1280716=test_rdoc_parser_c I, [2024-04-19T09:43:31.004757 #1232052] INFO -- : [ 47/880] 1280719=test_comparable I, [2024-04-19T09:43:31.049637 #1232052] INFO -- : [ 48/880] 1280719=test_enc_str_buf_cat I, [2024-04-19T09:43:31.082017 #1232052] INFO -- : [ 49/880] 1280719=test_class2name I, [2024-04-19T09:43:31.101258 #1232052] INFO -- : [ 50/880] 1280719=test_gbk I, [2024-04-19T09:43:31.152500 #1232052] INFO -- : [ 51/880] 1280719=test_profile_frames I, [2024-04-19T09:43:31.648573 #1232052] INFO -- : [ 52/880] 1280717=test_cstr I, [2024-04-19T09:43:31.817195 #1232052] INFO -- : [ 53/880] 1280719=test_pstore I, [2024-04-19T09:43:32.089951 #1232052] INFO -- : [ 54/880] 1280719=test_stack I, [2024-04-19T09:43:33.248313 #1232052] INFO -- : [ 55/880] 1280716=test_gem_commands_list_command I, [2024-04-19T09:43:33.355891 #1232052] INFO -- : [ 56/880] 1280716=test_reqarg I, [2024-04-19T09:43:33.738042 #1232052] INFO -- : [ 57/880] 1280717=test_rdoc_include I, [2024-04-19T09:43:34.116705 #1232052] INFO -- : [ 58/880] 1280717=test_too_many_dummy_encodings I, [2024-04-19T09:43:34.536157 #1232052] INFO -- : [ 59/880] 1280717=test_cesu8 I, [2024-04-19T09:43:34.577309 #1232052] INFO -- : [ 60/880] 1280717=test_econv I, [2024-04-19T09:43:35.933361 #1232052] INFO -- : [ 61/880] 1280716=test_rdoc_options I, [2024-04-19T09:43:37.656403 #1232052] INFO -- : [ 62/880] 1280716=test_gem_version I, [2024-04-19T09:43:37.737071 #1232052] INFO -- : [ 63/880] 1280718=test_ldap I, [2024-04-19T09:43:37.780451 #1232052] INFO -- : [ 64/880] 1280718=test_resource I, [2024-04-19T09:43:37.905758 #1232052] INFO -- : [ 65/880] 1280718=test_gem_commands_signin_command I, [2024-04-19T09:43:38.184284 #1232052] INFO -- : [ 66/880] 1280716=test_emitter I, [2024-04-19T09:43:38.200824 #1232052] INFO -- : [ 67/880] 1280716=test_fileutils I, [2024-04-19T09:43:38.604023 #1232052] INFO -- : [ 68/880] 1280719=test_string_processing I, [2024-04-19T09:43:38.613327 #1232052] INFO -- : [ 69/880] 1280718=test_complex I, [2024-04-19T09:43:39.064307 #1232052] INFO -- : [ 70/880] 1280719=test_gem_commands_search_command I, [2024-04-19T09:43:39.112173 #1232052] INFO -- : [ 71/880] 1280719=test_gem_stub_specification I, [2024-04-19T09:43:39.218582 #1232052] INFO -- : [ 72/880] 1280718=test_method_cache I, [2024-04-19T09:43:39.220894 #1232052] INFO -- : [ 73/880] 1280718=test_frozen_error I, [2024-04-19T09:43:39.274645 #1232052] INFO -- : [ 74/880] 1280718=test_gem_ext_ext_conf_builder I, [2024-04-19T09:43:40.188911 #1232052] INFO -- : [ 75/880] 1280716=test_path_to_class I, [2024-04-19T09:43:40.214254 #1232052] INFO -- : [ 76/880] 1280716=test_gem_dependency I, [2024-04-19T09:43:40.291378 #1232052] INFO -- : [ 77/880] 1280719=test_gem_resolver_specification I, [2024-04-19T09:43:40.403057 #1232052] INFO -- : [ 78/880] 1280719=test_rdoc_markup_verbatim I, [2024-04-19T09:43:41.139629 #1232052] INFO -- : [ 79/880] 1280716=test_inlinecache I, [2024-04-19T09:43:41.449909 #1232052] INFO -- : [ 80/880] 1280719=test_gem_remote_fetcher I, [2024-04-19T09:43:41.639490 #1232052] INFO -- : [ 81/880] 1280716=test_parse I, [2024-04-19T09:43:41.888346 #1232052] INFO -- : [ 82/880] 1280717=test_mdns I, [2024-04-19T09:43:41.979142 #1232052] INFO -- : [ 83/880] 1280717=test_gem_resolver_installed_specification I, [2024-04-19T09:43:42.126863 #1232052] INFO -- : [ 84/880] 1280717=test_scanner_events I, [2024-04-19T09:43:42.331213 #1232052] INFO -- : [ 85/880] 1280717=test_rdoc_parser_rd I, [2024-04-19T09:43:42.527742 #1232052] INFO -- : [ 86/880] 1280717=test_date_strftime I, [2024-04-19T09:43:45.741799 #1232052] INFO -- : [ 87/880] 1280716=test_gem_installer I, [2024-04-19T09:43:46.405681 #1232052] INFO -- : [ 88/880] 1280717=test_yamlstore I, [2024-04-19T09:43:46.506733 #1232052] INFO -- : [ 89/880] 1280717=test_asn1 I, [2024-04-19T09:43:46.700247 #1232052] INFO -- : [ 90/880] 1280717=test_random I, [2024-04-19T09:43:46.725363 #1232052] INFO -- : [ 91/880] 1280717=test_load I, [2024-04-19T09:43:46.775167 #1232052] INFO -- : [ 92/880] 1280717=json_string_matching_test I, [2024-04-19T09:43:46.874913 #1232052] INFO -- : [ 93/880] 1280717=test_const I, [2024-04-19T09:43:46.919734 #1232052] INFO -- : [ 94/880] 1280717=test_class I, [2024-04-19T09:43:47.692555 #1232052] INFO -- : [ 95/880] 1280718=test_rdoc_normal_class I, [2024-04-19T09:43:48.333365 #1232052] INFO -- : [ 96/880] 1280718=test_irb I, [2024-04-19T09:43:50.531201 #1232052] INFO -- : [ 97/880] 1280718=test_queue I, [2024-04-19T09:43:50.585977 #1232052] INFO -- : [ 98/880] 1280718=test_function I, [2024-04-19T09:43:51.168723 #1232052] INFO -- : [ 99/880] 1280718=parse_comments_test I, [2024-04-19T09:43:51.446088 #1232052] INFO -- : [100/880] 1280719=test_noarg I, [2024-04-19T09:43:51.471785 #1232052] INFO -- : [101/880] 1280718=test_tempfile I, [2024-04-19T09:43:52.608260 #1232052] INFO -- : [102/880] 1280718=test_tracepoint I, [2024-04-19T09:43:52.677104 #1232052] INFO -- : [103/880] 1280719=test_prettyprint I, [2024-04-19T09:43:52.816938 #1232052] INFO -- : [104/880] 1280719=test_rdoc_markup I, [2024-04-19T09:43:52.883092 #1232052] INFO -- : [105/880] 1280719=test_gem_commands_help_command I, [2024-04-19T09:43:53.385497 #1232052] INFO -- : [106/880] 1280719=test_duplicate I, [2024-04-19T09:43:53.433294 #1232052] INFO -- : [107/880] 1280719=test_basicsocket I, [2024-04-19T09:43:53.489834 #1232052] INFO -- : [108/880] 1280719=test_utf32 I, [2024-04-19T09:43:53.598379 #1232052] INFO -- : [109/880] 1280719=test_gem_resolver_index_specification I, [2024-04-19T09:43:53.810187 #1232052] INFO -- : [110/880] 1280719=test_internal_ivar I, [2024-04-19T09:43:54.047656 #1232052] INFO -- : [111/880] 1280719=test_gem_commands_exec_command I, [2024-04-19T09:43:54.704850 #1232052] INFO -- : [112/880] 1280718=test_io_wait I, [2024-04-19T09:43:55.091336 #1232052] INFO -- : [113/880] 1280718=warnings_test I, [2024-04-19T09:43:55.160717 #1232052] INFO -- : [114/880] 1280718=test_kwargs I, [2024-04-19T09:43:55.185794 #1232052] INFO -- : [115/880] 1280718=test_ellipsize I, [2024-04-19T09:43:55.305275 #1232052] INFO -- : [116/880] 1280718=test_date_attr I, [2024-04-19T09:43:55.313458 #1232052] INFO -- : [117/880] 1280718=test_console_attr I, [2024-04-19T09:43:55.352192 #1232052] INFO -- : [118/880] 1280718=test_summary I, [2024-04-19T09:43:56.119220 #1232052] INFO -- : [119/880] 1280718=test_type_completor I, [2024-04-19T09:43:56.154036 #1232052] INFO -- : [120/880] 1280718=test_gem_unsatisfiable_dependency_error I, [2024-04-19T09:43:56.249558 #1232052] INFO -- : [121/880] 1280718=test_win32ole_record I, [2024-04-19T09:43:56.272843 #1232052] INFO -- : [122/880] 1280718=test_cp949 I, [2024-04-19T09:43:56.302261 #1232052] INFO -- : [123/880] 1280718=test_condition I, [2024-04-19T09:43:56.431661 #1232052] INFO -- : [124/880] 1280718=test_gem_source_specific_file I, [2024-04-19T09:43:56.944507 #1232052] INFO -- : [125/880] 1280718=test_foreach I, [2024-04-19T09:43:56.971127 #1232052] INFO -- : [126/880] 1280718=test_gem_commands_uninstall_command I, [2024-04-19T09:44:00.140308 #1232052] INFO -- : [127/880] 1280719=test_io I, [2024-04-19T09:44:00.886104 #1232052] INFO -- : [128/880] 1280719=test_emoji I, [2024-04-19T09:44:01.060145 #1232052] INFO -- : [129/880] 1280719=test_win32ole_type_event I, [2024-04-19T09:44:01.082543 #1232052] INFO -- : [130/880] 1280719=test_sorted_set I, [2024-04-19T09:44:02.531092 #1232052] INFO -- : [131/880] 1280718=test_hash I, [2024-04-19T09:44:02.685236 #1232052] INFO -- : [132/880] 1280719=test_ubf_async_safe I, [2024-04-19T09:44:02.724643 #1232052] INFO -- : [133/880] 1280719=test_gem_impossible_dependencies_error I, [2024-04-19T09:44:02.784498 #1232052] INFO -- : [134/880] 1280719=test_pack I, [2024-04-19T09:44:04.586003 #1232052] INFO -- : [135/880] 1280719=test_array_create I, [2024-04-19T09:44:04.622458 #1232052] INFO -- : [136/880] 1280719=test_pattern_key_name_check I, [2024-04-19T09:44:04.679648 #1232052] INFO -- : [137/880] 1280719=test_to_ruby I, [2024-04-19T09:44:04.772011 #1232052] INFO -- : [138/880] 1280719=test_rdoc_rubygems_hook I, [2024-04-19T09:44:05.643398 #1232052] INFO -- : [139/880] 1280719=test_method I, [2024-04-19T09:44:11.911185 #1232052] INFO -- : [140/880] 1280717=test_gem_commands_query_command I, [2024-04-19T09:44:15.740546 #1232052] INFO -- : [141/880] 1280717=test_euc_kr I, [2024-04-19T09:44:15.774041 #1232052] INFO -- : [142/880] 1280717=test_rdoc_context_section I, [2024-04-19T09:44:15.936906 #1232052] INFO -- : [143/880] 1280717=test_ftp I, [2024-04-19T09:44:15.995268 #1232052] INFO -- : [144/880] 1280717=test_gem_security_trust_dir I, [2024-04-19T09:44:16.353193 #1232052] INFO -- : [145/880] 1280717=test_string_memory I, [2024-04-19T09:44:16.610671 #1232052] INFO -- : [146/880] 1280717=test_gem_requirement I, [2024-04-19T09:44:17.595016 #1232052] INFO -- : [147/880] 1280717=test_sprintf I, [2024-04-19T09:44:19.218761 #1232052] INFO -- : [148/880] 1280716=comments_test I, [2024-04-19T09:44:19.473113 #1232052] INFO -- : [149/880] 1280716=ripper_test I, [2024-04-19T09:44:19.539359 #1232052] INFO -- : [150/880] 1280717=test_objspace I, [2024-04-19T09:44:24.033336 #1232052] INFO -- : [151/880] 1280716=test_line_editor I, [2024-04-19T09:44:24.067041 #1232052] INFO -- : [152/880] 1280716=test_undef I, [2024-04-19T09:44:24.139147 #1232052] INFO -- : [153/880] 1280716=test_gem_commands_stale_command I, [2024-04-19T09:44:24.275320 #1232052] INFO -- : [154/880] 1280716=test_c_struct_entry I, [2024-04-19T09:44:25.591857 #1232052] INFO -- : [155/880] 1280716=test_lock_native_thread I, [2024-04-19T09:44:26.808325 #1232052] INFO -- : [156/880] 1280716=test_remote_fetch_error I, [2024-04-19T09:44:26.878698 #1232052] INFO -- : [157/880] 1280716=test_have_library I, [2024-04-19T09:44:27.595565 #1232052] INFO -- : [158/880] 1280718=test_show_source I, [2024-04-19T09:44:27.624854 #1232052] INFO -- : [159/880] 1280718=test_set I, [2024-04-19T09:44:27.661425 #1232052] INFO -- : [160/880] 1280718=test_hash I, [2024-04-19T09:44:27.766680 #1232052] INFO -- : [161/880] 1280718=test_gem_resolver_dependency_request I, [2024-04-19T09:44:27.992001 #1232052] INFO -- : [162/880] 1280718=test_tree_builder I, [2024-04-19T09:44:28.042678 #1232052] INFO -- : [163/880] 1280718=test_external_new I, [2024-04-19T09:44:28.495977 #1232052] INFO -- : [164/880] 1280718=test_postponed_job I, [2024-04-19T09:44:29.666438 #1232052] INFO -- : [165/880] 1280719=test_alias_and_anchor I, [2024-04-19T09:44:29.877876 #1232052] INFO -- : [166/880] 1280719=test_raise_exception I, [2024-04-19T09:44:30.906190 #1232052] INFO -- : [167/880] 1280718=test_gem_request_set_lockfile I, [2024-04-19T09:44:33.166934 #1232052] INFO -- : [168/880] 1280718=test_win32ole_typelib I, [2024-04-19T09:44:33.192288 #1232052] INFO -- : [169/880] 1280718=test_protect I, [2024-04-19T09:44:33.806666 #1232052] INFO -- : [170/880] 1280718=test_argf I, [2024-04-19T09:44:34.841056 #1232052] INFO -- : [171/880] 1280719=test_framework I, [2024-04-19T09:44:35.123454 #1232052] INFO -- : [172/880] 1280719=test_ns_spki I, [2024-04-19T09:44:35.312287 #1232052] INFO -- : [173/880] 1280719=test_kill_ring I, [2024-04-19T09:44:35.491011 #1232052] INFO -- : [174/880] 1280719=test_workspace I, [2024-04-19T09:44:36.084165 #1232052] INFO -- : [175/880] 1280716=test_weakmap I, [2024-04-19T09:44:36.811618 #1232052] INFO -- : [176/880] 1280719=test_yjit I, [2024-04-19T09:44:36.833304 #1232052] INFO -- : [177/880] 1280719=test_ws I, [2024-04-19T09:44:36.860444 #1232052] INFO -- : [178/880] 1280719=test_m17n I, [2024-04-19T09:44:37.488439 #1232052] INFO -- : [179/880] 1280719=test_gem_commands_environment_command I, [2024-04-19T09:44:37.855224 #1232052] INFO -- : [180/880] 1280719=test_rdoc_markup_indented_paragraph I, [2024-04-19T09:44:37.885152 #1232052] INFO -- : [181/880] 1280719=test_io_buffer I, [2024-04-19T09:44:38.692360 #1232052] INFO -- : [182/880] 1280719=ruby_parser_test I, [2024-04-19T09:44:38.770936 #1232052] INFO -- : [183/880] 1280719=test_backtrace I, [2024-04-19T09:44:41.813828 #1232052] INFO -- : [184/880] 1280719=test_pack I, [2024-04-19T09:44:41.860048 #1232052] INFO -- : [185/880] 1280719=test_gem_resolver_conflict I, [2024-04-19T09:44:41.963976 #1232052] INFO -- : [186/880] 1280719=test_rdoc_task I, [2024-04-19T09:44:41.983180 #1232052] INFO -- : [187/880] 1280719=test_clone I, [2024-04-19T09:44:43.490123 #1232052] INFO -- : [188/880] 1280719=test_gem_commands_install_command I, [2024-04-19T09:44:53.499868 #1232052] INFO -- : [189/880] 1280719=test_readpartial I, [2024-04-19T09:44:54.124496 #1232052] INFO -- : [190/880] 1280719=locals_test I, [2024-04-19T09:44:55.495355 #1232052] INFO -- : [191/880] 1280716=test_rdoc_require I, [2024-04-19T09:44:55.607938 #1232052] INFO -- : [192/880] 1280716=test_rat I, [2024-04-19T09:44:55.659098 #1232052] INFO -- : [193/880] 1280716=test_rdoc_markup_raw I, [2024-04-19T09:44:55.682017 #1232052] INFO -- : [194/880] 1280716=test_webauthn_poller I, [2024-04-19T09:44:56.079959 #1232052] INFO -- : [195/880] 1280716=test_rdoc_markup_to_html_crossref I, [2024-04-19T09:44:57.610556 #1232052] INFO -- : [196/880] 1280719=test_typeddata I, [2024-04-19T09:44:58.507918 #1232052] INFO -- : [197/880] 1280716=test_gem_resolver_best_set I, [2024-04-19T09:44:59.034671 #1232052] INFO -- : [198/880] 1280716=encoding_test I, [2024-04-19T09:44:59.713213 #1232052] INFO -- : [199/880] 1280716=test_fstring I, [2024-04-19T09:45:00.228711 #1232052] INFO -- : [200/880] 1280719=test_array I, [2024-04-19T09:45:00.272265 #1232052] INFO -- : [201/880] 1280719=test_optparse I, [2024-04-19T09:45:00.628691 #1232052] INFO -- : [202/880] 1280719=test_convertible I, [2024-04-19T09:45:00.673224 #1232052] INFO -- : [203/880] 1280716=parser_test I, [2024-04-19T09:45:00.762531 #1232052] INFO -- : [204/880] 1280716=test_rdoc_alias I, [2024-04-19T09:45:00.788184 #1232052] INFO -- : [205/880] 1280716=test_yield I, [2024-04-19T09:45:05.550086 #1232052] INFO -- : [206/880] 1280718=test_stringscanner I, [2024-04-19T09:45:06.446716 #1232052] INFO -- : [207/880] 1280718=test_files_sample I, [2024-04-19T09:45:06.467519 #1232052] INFO -- : [208/880] 1280718=test_bigzero I, [2024-04-19T09:45:06.549967 #1232052] INFO -- : [209/880] 1280718=test_pkey_dh I, [2024-04-19T09:45:07.114671 #1232052] INFO -- : [210/880] 1280718=test_gem_package_tar_header I, [2024-04-19T09:45:07.416416 #1232052] INFO -- : [211/880] 1280718=test_iseq_load I, [2024-04-19T09:45:15.064753 #1232052] INFO -- : [212/880] 1280718=test_gem_util I, [2024-04-19T09:45:15.822718 #1232052] INFO -- : [213/880] 1280718=test_system I, [2024-04-19T09:45:24.209332 #1232052] INFO -- : [214/880] 1280718=test_pkcs12 I, [2024-04-19T09:45:27.828167 #1232052] INFO -- : [215/880] 1280717=test_yjit_exit_locations I, [2024-04-19T09:45:27.860271 #1232052] INFO -- : [216/880] 1280717=test_etc I, [2024-04-19T09:45:28.277721 #1232052] INFO -- : [217/880] 1280716=test_gem_config_file I, [2024-04-19T09:45:28.309218 #1232052] INFO -- : [218/880] 1280718=test_ripper I, [2024-04-19T09:45:28.367125 #1232052] INFO -- : [219/880] 1280717=test_protocol I, [2024-04-19T09:45:28.736574 #1232052] INFO -- : [220/880] 1280717=test_getopts I, [2024-04-19T09:45:28.752698 #1232052] INFO -- : [221/880] 1280717=test_gem_resolver_activation_request I, [2024-04-19T09:45:28.841779 #1232052] INFO -- : [222/880] 1280717=test_libs I, [2024-04-19T09:45:29.047898 #1232052] INFO -- : [223/880] 1280717=test_gc I, [2024-04-19T09:45:29.054631 #1232052] INFO -- : [224/880] 1280717=test_math I, [2024-04-19T09:45:29.177224 #1232052] INFO -- : [225/880] 1280717=test_gem_commands_fetch_command I, [2024-04-19T09:45:29.398703 #1232052] INFO -- : [226/880] 1280716=test_sleep I, [2024-04-19T09:45:30.384851 #1232052] INFO -- : [227/880] 1280717=test_config I, [2024-04-19T09:45:30.459916 #1232052] INFO -- : [228/880] 1280717=test_yaml_tree I, [2024-04-19T09:45:30.637171 #1232052] INFO -- : [229/880] 1280717=test_case I, [2024-04-19T09:45:30.734552 #1232052] INFO -- : [230/880] 1280717=test_sizeof I, [2024-04-19T09:45:30.806436 #1232052] INFO -- : [231/880] 1280718=test_face I, [2024-04-19T09:45:30.917080 #1232052] INFO -- : [232/880] 1280718=test_rendering I, [2024-04-19T09:45:30.974079 #1232052] INFO -- : [233/880] 1280718=test_autoload I, [2024-04-19T09:45:31.523330 #1232052] INFO -- : [234/880] 1280716=test_utf16 I, [2024-04-19T09:45:31.786221 #1232052] INFO -- : [235/880] 1280716=test_io I, [2024-04-19T09:45:40.672001 #1232052] INFO -- : [236/880] 1280719=test_unicode_escape I, [2024-04-19T09:45:40.707487 #1232052] INFO -- : [237/880] 1280719=test_rdoc_markup_attributes I, [2024-04-19T09:45:40.762612 #1232052] INFO -- : [238/880] 1280719=test_win32ole_type I, [2024-04-19T09:45:40.793705 #1232052] INFO -- : [239/880] 1280719=test_null I, [2024-04-19T09:45:40.830292 #1232052] INFO -- : [240/880] 1280719=test_mul I, [2024-04-19T09:45:40.905877 #1232052] INFO -- : [241/880] 1280719=test_rdoc_rd_inline_parser I, [2024-04-19T09:45:41.291045 #1232052] INFO -- : [242/880] 1280719=test_rdoc_markup_to_rdoc I, [2024-04-19T09:45:41.854287 #1232052] INFO -- : [243/880] 1280719=test_default_gems I, [2024-04-19T09:45:42.045443 #1232052] INFO -- : [244/880] 1280719=test_pipe I, [2024-04-19T09:45:43.039265 #1232052] INFO -- : [245/880] 1280719=test_trick I, [2024-04-19T09:45:50.666316 #1232052] INFO -- : [246/880] 1280718=test_thread I, [2024-04-19T09:45:50.739300 #1232052] INFO -- : [247/880] 1280718=test_pkey_ec I, [2024-04-19T09:45:51.490627 #1232052] INFO -- : [248/880] 1280718=test_date_parse I, [2024-04-19T09:45:52.383296 #1232052] INFO -- : [249/880] 1280718=test_defined I, [2024-04-19T09:45:52.987492 #1232052] INFO -- : [250/880] 1280718=test_backtrace I, [2024-04-19T09:45:53.050813 #1232052] INFO -- : [251/880] 1280718=test_key_name_check I, [2024-04-19T09:45:53.188123 #1232052] INFO -- : [252/880] 1280718=test_io_buffer I, [2024-04-19T09:45:53.467452 #1232052] INFO -- : [253/880] 1280718=test_rdoc_i18n_text I, [2024-04-19T09:45:53.494987 #1232052] INFO -- : [254/880] 1280718=test_gem_uninstaller I, [2024-04-19T09:45:54.371483 #1232052] INFO -- : [255/880] 1280717=test_svcb_https I, [2024-04-19T09:45:54.409341 #1232052] INFO -- : [256/880] 1280717=test_buffering I, [2024-04-19T09:45:54.418703 #1232052] INFO -- : [257/880] 1280717=test_gb18030 I, [2024-04-19T09:45:54.458879 #1232052] INFO -- : [258/880] 1280717=test_windows_1251 I, [2024-04-19T09:45:54.546606 #1232052] INFO -- : [259/880] 1280717=test_time I, [2024-04-19T09:45:55.370109 #1232052] INFO -- : [260/880] 1280717=test_rdoc_rdoc I, [2024-04-19T09:45:55.767098 #1232052] INFO -- : [261/880] 1280717=test_proc I, [2024-04-19T09:45:55.877271 #1232052] INFO -- : [262/880] 1280719=test_string I, [2024-04-19T09:46:02.438280 #1232052] INFO -- : [263/880] 1280718=test_gc_compact I, [2024-04-19T09:46:04.557651 #1232052] INFO -- : [264/880] 1280717=test_gem_resolver_index_set I, [2024-04-19T09:46:04.835666 #1232052] INFO -- : [265/880] 1280717=test_gem_package_old I, [2024-04-19T09:46:05.107024 #1232052] INFO -- : [266/880] 1280717=test_cgi_tag_helper I, [2024-04-19T09:46:05.301949 #1232052] INFO -- : [267/880] 1280717=test_zlib I, [2024-04-19T09:46:10.292935 #1232052] INFO -- : [268/880] 1280716=test_egrep_cpp I, [2024-04-19T09:46:10.890966 #1232052] INFO -- : [269/880] 1280716=test_erb_m17n I, [2024-04-19T09:46:10.966590 #1232052] INFO -- : [270/880] 1280716=test_ole_methods I, [2024-04-19T09:46:11.028803 #1232052] INFO -- : [271/880] 1280716=test_optimization I, [2024-04-19T09:46:20.460130 #1232052] INFO -- : [272/880] 1280718=test_date_conv I, [2024-04-19T09:46:20.518740 #1232052] INFO -- : [273/880] 1280718=test_folderitem2_invokeverb I, [2024-04-19T09:46:20.871500 #1232052] INFO -- : [274/880] 1280718=test_require_path_check I, [2024-04-19T09:46:21.051108 #1232052] INFO -- : [275/880] 1280718=test_rdoc_markup_parser I, [2024-04-19T09:46:21.452655 #1232052] INFO -- : [276/880] 1280718=test_fnmatch I, [2024-04-19T09:46:21.838325 #1232052] INFO -- : [277/880] 1280718=test_files_test_2 I, [2024-04-19T09:46:21.940983 #1232052] INFO -- : [278/880] 1280718=test_gem_validator I, [2024-04-19T09:46:21.997408 #1232052] INFO -- : [279/880] 1280718=test_rdoc_store I, [2024-04-19T09:46:22.312754 #1232052] INFO -- : [280/880] 1280717=test_gem_request_set_lockfile_parser I, [2024-04-19T09:46:23.179120 #1232052] INFO -- : [281/880] 1280717=test_depth_first I, [2024-04-19T09:46:23.193825 #1232052] INFO -- : [282/880] 1280717=test_raise I, [2024-04-19T09:46:23.215453 #1232052] INFO -- : [283/880] 1280717=test_x509attr I, [2024-04-19T09:46:23.333607 #1232052] INFO -- : [284/880] 1280717=test_pattern_matching I, [2024-04-19T09:46:23.474413 #1232052] INFO -- : [285/880] 1280717=test_rdoc_stats I, [2024-04-19T09:46:23.687357 #1232052] INFO -- : [286/880] 1280717=test_string I, [2024-04-19T09:46:23.832504 #1232052] INFO -- : [287/880] 1280717=test_rdoc_parser I, [2024-04-19T09:46:23.960358 #1232052] INFO -- : [288/880] 1280717=test_qsort I, [2024-04-19T09:46:23.968655 #1232052] INFO -- : [289/880] 1280717=test_gem_dependency_resolution_error I, [2024-04-19T09:46:24.062226 #1232052] INFO -- : [290/880] 1280717=json_addition_test I, [2024-04-19T09:46:24.214545 #1232052] INFO -- : [291/880] 1280717=test_rdoc_tom_doc I, [2024-04-19T09:46:24.340866 #1232052] INFO -- : [292/880] 1280717=test_rdoc_markup_to_tt_only I, [2024-04-19T09:46:24.576846 #1232052] INFO -- : [293/880] 1280717=test_hmac I, [2024-04-19T09:46:24.606680 #1232052] INFO -- : [294/880] 1280717=test_gem_command I, [2024-04-19T09:46:25.468856 #1232052] INFO -- : [295/880] 1280717=test_key_actor_vi I, [2024-04-19T09:46:26.378939 #1232052] INFO -- : [296/880] 1280717=test_bug-3571 I, [2024-04-19T09:46:26.467795 #1232052] INFO -- : [297/880] 1280717=test_common I, [2024-04-19T09:46:28.032556 #1232052] INFO -- : [298/880] 1280718=test_gem_spec_fetcher I, [2024-04-19T09:46:28.276617 #1232052] INFO -- : [299/880] 1280717=test_numeric I, [2024-04-19T09:46:28.869664 #1232052] INFO -- : [300/880] 1280717=test_ifunless I, [2024-04-19T09:46:28.906976 #1232052] INFO -- : [301/880] 1280717=test_assignment I, [2024-04-19T09:46:29.248823 #1232052] INFO -- : [302/880] 1280718=test_gem_commands_lock_command I, [2024-04-19T09:46:29.396659 #1232052] INFO -- : [303/880] 1280718=test_gem_source_list I, [2024-04-19T09:46:29.821769 #1232052] INFO -- : [304/880] 1280718=test_yaml_special_cases I, [2024-04-19T09:46:29.883707 #1232052] INFO -- : [305/880] 1280718=test_optarg I, [2024-04-19T09:46:30.358251 #1232052] INFO -- : [306/880] 1280718=test_config I, [2024-04-19T09:46:30.519405 #1232052] INFO -- : [307/880] 1280718=test_rdoc_token_stream I, [2024-04-19T09:46:30.559463 #1232052] INFO -- : [308/880] 1280718=test_address_resolve I, [2024-04-19T09:46:30.658072 #1232052] INFO -- : [309/880] 1280718=test_exception I, [2024-04-19T09:46:30.707782 #1232052] INFO -- : [310/880] 1280718=test_zsh_completion I, [2024-04-19T09:46:30.729421 #1232052] INFO -- : [311/880] 1280718=test_iter_break I, [2024-04-19T09:46:30.741641 #1232052] INFO -- : [312/880] 1280718=test_verbose I, [2024-04-19T09:46:30.973918 #1232052] INFO -- : [313/880] 1280718=test_num2int I, [2024-04-19T09:46:31.032128 #1232052] INFO -- : [314/880] 1280718=test_nil I, [2024-04-19T09:46:31.051036 #1232052] INFO -- : [315/880] 1280718=test_rdoc_single_class I, [2024-04-19T09:46:31.075969 #1232052] INFO -- : [316/880] 1280718=test_macro I, [2024-04-19T09:46:31.119922 #1232052] INFO -- : [317/880] 1280718=test_pp I, [2024-04-19T09:46:31.399958 #1232052] INFO -- : [318/880] 1280718=test_gem_ext_configure_builder I, [2024-04-19T09:46:31.587156 #1232052] INFO -- : [319/880] 1280718=test_frozen I, [2024-04-19T09:46:31.611098 #1232052] INFO -- : [320/880] 1280718=test_emitter I, [2024-04-19T09:46:31.674047 #1232052] INFO -- : [321/880] 1280718=test_gem_silent_ui I, [2024-04-19T09:46:31.956187 #1232052] INFO -- : [322/880] 1280718=test_bug-5832 I, [2024-04-19T09:46:31.964912 #1232052] INFO -- : [323/880] 1280718=test_files_ext I, [2024-04-19T09:46:31.983477 #1232052] INFO -- : [324/880] 1280718=test_kernel I, [2024-04-19T09:46:36.412803 #1232052] INFO -- : [325/880] 1280718=dispatcher_test I, [2024-04-19T09:46:36.531753 #1232052] INFO -- : [326/880] 1280718=test_eval_history I, [2024-04-19T09:46:36.609257 #1232052] INFO -- : [327/880] 1280718=test_kdf I, [2024-04-19T09:46:37.160847 #1232052] INFO -- : [328/880] 1280718=test_gem_doctor I, [2024-04-19T09:46:37.545618 #1232052] INFO -- : [329/880] 1280718=test_psych I, [2024-04-19T09:46:37.708272 #1232052] INFO -- : [330/880] 1280718=test_enc_raise I, [2024-04-19T09:46:37.715352 #1232052] INFO -- : [331/880] 1280718=!Nothing_to_test I, [2024-04-19T09:46:37.746651 #1232052] INFO -- : [332/880] 1280718=test_rdoc_markup_paragraph I, [2024-04-19T09:46:37.822614 #1232052] INFO -- : [333/880] 1280718=test_command I, [2024-04-19T09:46:39.493862 #1232052] INFO -- : [334/880] 1280718=test_at_exit I, [2024-04-19T09:46:39.519374 #1232052] INFO -- : [335/880] 1280718=test_date I, [2024-04-19T09:46:39.625471 #1232052] INFO -- : [336/880] 1280718=test_gem_rdoc I, [2024-04-19T09:46:40.453267 #1232052] INFO -- : [337/880] 1280718=test_gem_ext_cargo_builder_unit I, [2024-04-19T09:46:40.586885 #1232052] INFO -- : [338/880] 1280718=test_object_create_start I, [2024-04-19T09:46:40.650236 #1232052] INFO -- : [339/880] 1280718=test_gem_commands_specification_command I, [2024-04-19T09:46:41.507097 #1232052] INFO -- : [340/880] 1280718=test_shift_jis I, [2024-04-19T09:46:41.592477 #1232052] INFO -- : [341/880] 1280718=test_gem_commands_which_command I, [2024-04-19T09:46:41.792021 #1232052] INFO -- : [342/880] 1280718=test_http I, [2024-04-19T09:46:41.871441 #1232052] INFO -- : [343/880] 1280718=test_enumerator I, [2024-04-19T09:46:43.856434 #1232052] INFO -- : [344/880] 1280717=test_inadvertent_creation I, [2024-04-19T09:46:44.905947 #1232052] INFO -- : [345/880] 1280717=test_flags I, [2024-04-19T09:46:53.040483 #1232052] INFO -- : [346/880] 1280717=test_name_error I, [2024-04-19T09:46:53.826447 #1232052] INFO -- : [347/880] 1280717=test_rdoc_markup_attribute_manager I, [2024-04-19T09:46:54.120069 #1232052] INFO -- : [348/880] 1280717=test_gem_commands_dependency_command I, [2024-04-19T09:46:54.729407 #1232052] INFO -- : [349/880] 1280717=test_gem_resolver_composed_set I, [2024-04-19T09:46:54.827103 #1232052] INFO -- : [350/880] 1280717=test_safe_load I, [2024-04-19T09:46:54.942061 #1232052] INFO -- : [351/880] 1280717=test_gem_resolver I, [2024-04-19T09:46:57.090034 #1232052] INFO -- : [352/880] 1280717=test_rdoc_context I, [2024-04-19T09:47:03.899005 #1232052] INFO -- : [353/880] 1280716=test_stream I, [2024-04-19T09:47:03.909052 #1232052] INFO -- : [354/880] 1280717=test_nil2vtempty I, [2024-04-19T09:47:03.944628 #1232052] INFO -- : [355/880] 1280717=test_open-uri I, [2024-04-19T09:47:04.400097 #1232052] INFO -- : [356/880] 1280716=test_httpresponse I, [2024-04-19T09:47:04.737129 #1232052] INFO -- : [357/880] 1280716=test_rdoc_parser_ruby I, [2024-04-19T09:47:05.895734 #1232052] INFO -- : [358/880] 1280717=test_gem_safe_yaml I, [2024-04-19T09:47:05.964574 #1232052] INFO -- : [359/880] 1280717=test_syntax I, [2024-04-19T09:47:08.493261 #1232052] INFO -- : [360/880] 1280716=index_write_test I, [2024-04-19T09:47:08.534653 #1232052] INFO -- : [361/880] 1280716=test_date_new I, [2024-04-19T09:47:08.619281 #1232052] INFO -- : [362/880] 1280716=test_data I, [2024-04-19T09:47:08.690456 #1232052] INFO -- : [363/880] 1280716=test_rdoc_markup_to_joined_paragraph I, [2024-04-19T09:47:08.724055 #1232052] INFO -- : [364/880] 1280716=test_date_time I, [2024-04-19T09:47:08.836615 #1232052] INFO -- : [365/880] 1280716=test_require I, [2024-04-19T09:47:08.873830 #1232052] INFO -- : [366/880] 1280716=test_iso_8859 I, [2024-04-19T09:47:09.164731 #1232052] INFO -- : [367/880] 1280716=test_tcp I, [2024-04-19T09:47:09.685992 #1232052] INFO -- : [368/880] 1280716=test_rdoc_text I, [2024-04-19T09:47:10.017144 #1232052] INFO -- : [369/880] 1280716=test_io_console I, [2024-04-19T09:47:14.554150 #1232052] INFO -- : [370/880] 1280716=test_flush I, [2024-04-19T09:47:14.586801 #1232052] INFO -- : [371/880] 1280716=test_singleton I, [2024-04-19T09:47:14.705866 #1232052] INFO -- : [372/880] 1280716=test_switch_hitter I, [2024-04-19T09:47:14.853244 #1232052] INFO -- : [373/880] 1280716=test_securerandom I, [2024-04-19T09:47:15.284556 #1232052] INFO -- : [374/880] 1280716=test_rdoc_markdown_test I, [2024-04-19T09:47:18.352543 #1232052] INFO -- : [375/880] 1280719=test_rdoc_normal_module I, [2024-04-19T09:47:18.647650 #1232052] INFO -- : [376/880] 1280719=test_c_union_entity I, [2024-04-19T09:47:19.041840 #1232052] INFO -- : [377/880] 1280719=test_logperiod I, [2024-04-19T09:47:19.067061 #1232052] INFO -- : [378/880] 1280719=test_passing_block I, [2024-04-19T09:47:19.085341 #1232052] INFO -- : [379/880] 1280719=test_thread_fd_close I, [2024-04-19T09:47:19.127247 #1232052] INFO -- : [380/880] 1280719=test_uncorrectable_name_check I, [2024-04-19T09:47:19.162415 #1232052] INFO -- : [381/880] 1280719=newline_test I, [2024-04-19T09:47:19.619372 #1232052] INFO -- : [382/880] 1280719=test_hash_create I, [2024-04-19T09:47:19.655819 #1232052] INFO -- : [383/880] 1280719=test_stringchar I, [2024-04-19T09:47:20.585358 #1232052] INFO -- : [384/880] 1280719=test_gem_security_policy I, [2024-04-19T09:47:22.982665 #1232052] INFO -- : [385/880] 1280719=test_gem_source_local I, [2024-04-19T09:47:24.580664 #1232052] INFO -- : [386/880] 1280716=test_process I, [2024-04-19T09:47:24.603416 #1232052] INFO -- : [387/880] 1280719=test_last_thread I, [2024-04-19T09:47:26.112020 #1232052] INFO -- : [388/880] 1280719=test_pack I, [2024-04-19T09:47:27.815542 #1232052] INFO -- : [389/880] 1280719=test_err_in_callback I, [2024-04-19T09:47:27.914955 #1232052] INFO -- : [390/880] 1280719=test_gem_resolver_lock_specification I, [2024-04-19T09:47:28.283276 #1232052] INFO -- : [391/880] 1280719=test_gc I, [2024-04-19T09:47:48.793750 #1232052] INFO -- : [392/880] 1280718=test_x509cert I, [2024-04-19T09:47:50.942619 #1232052] INFO -- : [393/880] 1280717=test_gem_ext_rake_builder I, [2024-04-19T09:47:51.188807 #1232052] INFO -- : [394/880] 1280718=test_arity I, [2024-04-19T09:47:51.357269 #1232052] INFO -- : [395/880] 1280718=test_logdevice I, [2024-04-19T09:47:56.446553 #1232052] INFO -- : [396/880] 1280718=test_cclass I, [2024-04-19T09:47:56.799613 #1232052] INFO -- : [397/880] 1280717=test_gem_request_connection_pools I, [2024-04-19T09:47:56.973739 #1232052] INFO -- : [398/880] 1280718=test_grapheme_breaks I, [2024-04-19T09:47:57.196018 #1232052] INFO -- : [399/880] 1280718=test_gem_version_option I, [2024-04-19T09:47:57.730523 #1232052] INFO -- : [400/880] 1280718=test_pkey I, [2024-04-19T09:47:57.971696 #1232052] INFO -- : [401/880] 1280718=test_case I, [2024-04-19T09:47:57.990605 #1232052] INFO -- : [402/880] 1280718=test_reline I, [2024-04-19T09:47:58.214557 #1232052] INFO -- : [403/880] 1280717=test_parser_events I, [2024-04-19T09:47:58.849665 #1232052] INFO -- : [404/880] 1280717=test_rdoc_generator_pot_po I, [2024-04-19T09:47:58.862893 #1232052] INFO -- : [405/880] 1280717=test_ansi_with_terminfo I, [2024-04-19T09:47:58.896680 #1232052] INFO -- : [406/880] 1280717=test_rdoc_markup_to_markdown I, [2024-04-19T09:47:59.139955 #1232052] INFO -- : [407/880] 1280718=test_json_tree I, [2024-04-19T09:47:59.167700 #1232052] INFO -- : [408/880] 1280717=test_memory_view I, [2024-04-19T09:47:59.338792 #1232052] INFO -- : [409/880] 1280718=test_m17n_comb I, [2024-04-19T09:48:00.480894 #1232052] INFO -- : [410/880] 1280717=test_ractor I, [2024-04-19T09:48:00.622657 #1232052] INFO -- : [411/880] 1280717=test_gem_stream_ui I, [2024-04-19T09:48:01.363409 #1232052] INFO -- : [412/880] 1280717=test_rdoc_generator_ri I, [2024-04-19T09:48:01.483422 #1232052] INFO -- : [413/880] 1280717=test_extlibs I, [2024-04-19T09:48:14.073319 #1232052] INFO -- : [414/880] 1280717=test_severity I, [2024-04-19T09:48:14.148316 #1232052] INFO -- : [415/880] 1280717=test_ractor I, [2024-04-19T09:48:14.153593 #1232052] INFO -- : [416/880] 1280717=test_require_lib I, [2024-04-19T09:48:18.038699 #1232052] INFO -- : [417/880] 1280718=parse_test I, [2024-04-19T09:48:20.969575 #1232052] INFO -- : [418/880] 1280719=test_gem_install_update_options I, [2024-04-19T09:48:21.833549 #1232052] INFO -- : [419/880] 1280719=test_rdoc_markup_to_table_of_contents I, [2024-04-19T09:48:22.153661 #1232052] INFO -- : [420/880] 1280719=test_socket I, [2024-04-19T09:48:31.668881 #1232052] INFO -- : [421/880] 1280719=test_thread I, [2024-04-19T09:48:32.005786 #1232052] INFO -- : [422/880] 1280719=test_objectspace I, [2024-04-19T09:48:36.110359 #1232052] INFO -- : [423/880] 1280719=test_literal I, [2024-04-19T09:48:39.457099 #1232052] INFO -- : [424/880] 1280717=test_str2big I, [2024-04-19T09:48:39.566220 #1232052] INFO -- : [425/880] 1280717=test_c_struct_builder I, [2024-04-19T09:48:39.665339 #1232052] INFO -- : [426/880] 1280718=test_dot_dot I, [2024-04-19T09:48:39.670412 #1232052] INFO -- : [427/880] 1280718=test_case_options I, [2024-04-19T09:48:39.800876 #1232052] INFO -- : [428/880] 1280718=test_store I, [2024-04-19T09:48:40.262661 #1232052] INFO -- : [429/880] 1280717=test_rdoc_cross_reference I, [2024-04-19T09:48:40.910962 #1232052] INFO -- : [430/880] 1280719=test_gem_dependency_installer I, [2024-04-19T09:48:41.149182 #1232052] INFO -- : [431/880] 1280718=test_scalar I, [2024-04-19T09:48:41.234358 #1232052] INFO -- : [432/880] 1280718=test_gem_commands_info_command I, [2024-04-19T09:48:41.384728 #1232052] INFO -- : [433/880] 1280718=test_bug_reporter I, [2024-04-19T09:48:42.050034 #1232052] INFO -- : [434/880] 1280718=test_rand I, [2024-04-19T09:48:43.718756 #1232052] INFO -- : [435/880] 1280717=test_gem_name_tuple I, [2024-04-19T09:48:43.832148 #1232052] INFO -- : [436/880] 1280717=test_gem_package_tar_reader_entry I, [2024-04-19T09:48:44.371671 #1232052] INFO -- : [437/880] 1280718=test_exception I, [2024-04-19T09:48:45.338075 #1232052] INFO -- : [438/880] 1280717=test_gem_request I, [2024-04-19T09:48:48.175335 #1232052] INFO -- : [439/880] 1280717=test_method_cache I, [2024-04-19T09:48:48.239537 #1232052] INFO -- : [440/880] 1280717=test_sprintf_comb I, [2024-04-19T09:48:49.412447 #1232052] INFO -- : [441/880] 1280717=test_gem_commands_mirror I, [2024-04-19T09:48:49.493365 #1232052] INFO -- : [442/880] 1280717=test_gem_ext_cargo_builder_link_flag_converter I, [2024-04-19T09:48:50.024321 #1232052] INFO -- : [443/880] 1280717=test_enumerator_kw I, [2024-04-19T09:48:50.156401 #1232052] INFO -- : [444/880] 1280717=test_settracefunc I, [2024-04-19T09:48:57.377718 #1232052] INFO -- : [445/880] 1280717=test_gem_text I, [2024-04-19T09:48:57.476931 #1232052] INFO -- : [446/880] 1280719=test_win32ole I, [2024-04-19T09:48:57.596321 #1232052] INFO -- : [447/880] 1280719=test_generic I, [2024-04-19T09:48:57.744301 #1232052] INFO -- : [448/880] 1280719=test_scan_args I, [2024-04-19T09:48:57.842404 #1232052] INFO -- : [449/880] 1280719=test_cgi_core I, [2024-04-19T09:48:57.953337 #1232052] INFO -- : [450/880] 1280719=test_parser I, [2024-04-19T09:48:57.996720 #1232052] INFO -- : [451/880] 1280717=parse_stream_test I, [2024-04-19T09:48:58.484520 #1232052] INFO -- : [452/880] 1280719=test_dns I, [2024-04-19T09:48:58.733510 #1232052] INFO -- : [453/880] 1280717=test_gem_commands_open_command I, [2024-04-19T09:48:59.056561 #1232052] INFO -- : [454/880] 1280719=test_ractor I, [2024-04-19T09:48:59.113818 #1232052] INFO -- : [455/880] 1280719=test_gem_source_lock I, [2024-04-19T09:48:59.450092 #1232052] INFO -- : [456/880] 1280717=test_gem I, [2024-04-19T09:48:59.652392 #1232052] INFO -- : [457/880] 1280719=test_ssl I, [2024-04-19T09:49:02.171406 #1232052] INFO -- : [458/880] 1280719=test_ractor I, [2024-04-19T09:49:02.384709 #1232052] INFO -- : [459/880] 1280718=test_thread I, [2024-04-19T09:49:04.967287 #1232052] INFO -- : [460/880] 1280719=json_ext_parser_test I, [2024-04-19T09:49:04.984190 #1232052] INFO -- : [461/880] 1280719=test_my_integer I, [2024-04-19T09:49:05.027419 #1232052] INFO -- : [462/880] 1280719=test_rendering I, [2024-04-19T09:49:05.087151 #1232052] INFO -- : [463/880] 1280719=test_debugger_integration I, [2024-04-19T09:49:05.174991 #1232052] INFO -- : [464/880] 1280719=test_unicode_normalize I, [2024-04-19T09:49:08.855245 #1232052] INFO -- : [465/880] 1280717=test_marshal I, [2024-04-19T09:49:13.096798 #1232052] INFO -- : [466/880] 1280717=test_weakref I, [2024-04-19T09:49:14.265159 #1232052] INFO -- : [467/880] 1280717=test_nonblock I, [2024-04-19T09:49:14.357752 #1232052] INFO -- : [468/880] 1280717=test_alias I, [2024-04-19T09:49:14.813975 #1232052] INFO -- : [469/880] 1280716=test_timeout I, [2024-04-19T09:49:15.466221 #1232052] INFO -- : [470/880] 1280717=test_singleton_function I, [2024-04-19T09:49:15.484845 #1232052] INFO -- : [471/880] 1280717=test_ancdata I, [2024-04-19T09:49:15.517449 #1232052] INFO -- : [472/880] 1280717=test_rb_str_dup I, [2024-04-19T09:49:15.540133 #1232052] INFO -- : [473/880] 1280717=test_reline_key I, [2024-04-19T09:49:15.568996 #1232052] INFO -- : [474/880] 1280717=test_cgi_modruby I, [2024-04-19T09:49:15.619051 #1232052] INFO -- : [475/880] 1280717=test_integer I, [2024-04-19T09:49:16.803295 #1232052] INFO -- : [476/880] 1280716=test_super I, [2024-04-19T09:49:18.670555 #1232052] INFO -- : [477/880] 1280718=test_rubyoptions I, [2024-04-19T09:49:21.295063 #1232052] INFO -- : [478/880] 1280716=test_https_proxy I, [2024-04-19T09:49:21.390001 #1232052] INFO -- : [479/880] 1280716=test_call I, [2024-04-19T09:49:22.563342 #1232052] INFO -- : [480/880] 1280716=test_rubygems I, [2024-04-19T09:49:23.823205 #1232052] INFO -- : [481/880] 1280716=test_nextafter I, [2024-04-19T09:49:24.868090 #1232052] INFO -- : [482/880] 1280716=test_capacity I, [2024-04-19T09:49:24.955035 #1232052] INFO -- : [483/880] 1280716=test_gem_request_set_lockfile_tokenizer I, [2024-04-19T09:49:25.338912 #1232052] INFO -- : [484/880] 1280716=test_stat I, [2024-04-19T09:49:25.401897 #1232052] INFO -- : [485/880] 1280716=test_have_func I, [2024-04-19T09:49:38.129535 #1232052] INFO -- : [486/880] 1280719=test_gem_resolver_git_specification I, [2024-04-19T09:49:41.223336 #1232052] INFO -- : [487/880] 1280719=test_object_references I, [2024-04-19T09:49:41.327345 #1232052] INFO -- : [488/880] 1280719=test_usrmarshal I, [2024-04-19T09:49:44.482614 #1232052] INFO -- : [489/880] 1280717=test_rdoc_attr I, [2024-04-19T09:49:44.510157 #1232052] INFO -- : [490/880] 1280719=test_env I, [2024-04-19T09:49:44.640071 #1232052] INFO -- : [491/880] 1280717=desugar_compiler_test I, [2024-04-19T09:49:45.523062 #1232052] INFO -- : [492/880] 1280717=test_integer I, [2024-04-19T09:49:45.633089 #1232052] INFO -- : [493/880] 1280717=test_dryrun I, [2024-04-19T09:49:46.363004 #1232052] INFO -- : [494/880] 1280717=test_gem_commands_setup_command I, [2024-04-19T09:49:54.172136 #1232052] INFO -- : [495/880] 1280717=test_ractor_compatibility I, [2024-04-19T09:50:00.213852 #1232052] INFO -- : [496/880] 1280717=test_autoconf I, [2024-04-19T09:50:00.268897 #1232052] INFO -- : [497/880] 1280717=test_eval I, [2024-04-19T09:50:00.327801 #1232052] INFO -- : [498/880] 1280717=test_gem_console_ui I, [2024-04-19T09:50:00.550271 #1232052] INFO -- : [499/880] 1280717=test_date_ractor I, [2024-04-19T09:50:03.951516 #1232052] INFO -- : [500/880] 1280717=test_dir I, [2024-04-19T09:50:03.993093 #1232052] INFO -- : [501/880] 1280718=format_errors_test I, [2024-04-19T09:50:04.072908 #1232052] INFO -- : [502/880] 1280718=test_gem_commands_cleanup_command I, [2024-04-19T09:50:08.304776 #1232052] INFO -- : [503/880] 1280717=test_word I, [2024-04-19T09:50:08.305553 #1232052] INFO -- : [504/880] 1280717=test_cgi_multipart I, [2024-04-19T09:50:09.238298 #1232052] INFO -- : [505/880] 1280717=test_numeric I, [2024-04-19T09:50:09.298563 #1232052] INFO -- : [506/880] 1280717=test_member I, [2024-04-19T09:50:09.343288 #1232052] INFO -- : [507/880] 1280717=json_generic_object_test I, [2024-04-19T09:50:09.466575 #1232052] INFO -- : [508/880] 1280717=test_gem_source_fetch_problem I, [2024-04-19T09:50:09.680676 #1232052] INFO -- : [509/880] 1280717=test_http_request I, [2024-04-19T09:50:09.985316 #1232052] INFO -- : [510/880] 1280717=test_rdoc_generator_darkfish I, [2024-04-19T09:50:11.318629 #1232052] INFO -- : [511/880] 1280718=test_error_highlight I, [2024-04-19T09:50:14.009535 #1232052] INFO -- : [512/880] 1280717=test_resize I, [2024-04-19T09:50:14.109341 #1232052] INFO -- : [513/880] 1280717=test_rdoc_comment I, [2024-04-19T09:50:14.494515 #1232052] INFO -- : [514/880] 1280717=test_mailto I, [2024-04-19T09:50:14.573495 #1232052] INFO -- : [515/880] 1280717=test_coderange I, [2024-04-19T09:50:14.635023 #1232052] INFO -- : [516/880] 1280717=test_symbol I, [2024-04-19T09:50:14.798212 #1232052] INFO -- : [517/880] 1280717=location_test I, [2024-04-19T09:50:15.433624 #1232052] INFO -- : [518/880] 1280717=test_gem_resolver_requirement_list I, [2024-04-19T09:50:15.537304 #1232052] INFO -- : [519/880] 1280717=test_arith_seq_beg_len_step I, [2024-04-19T09:50:16.404597 #1232052] INFO -- : [520/880] 1280717=test_pkcs7 I, [2024-04-19T09:50:17.333418 #1232052] INFO -- : [521/880] 1280718=test_function_entry I, [2024-04-19T09:50:17.380781 #1232052] INFO -- : [522/880] 1280718=test_symbol I, [2024-04-19T09:50:18.184828 #1232052] INFO -- : [523/880] 1280717=test_coder I, [2024-04-19T09:50:18.266427 #1232052] INFO -- : [524/880] 1280717=test_nofree I, [2024-04-19T09:50:18.356734 #1232052] INFO -- : [525/880] 1280717=test_gem_commands_pristine_command I, [2024-04-19T09:50:21.188068 #1232052] INFO -- : [526/880] 1280719=test_context I, [2024-04-19T09:50:22.035217 #1232052] INFO -- : [527/880] 1280719=ruby_api_test I, [2024-04-19T09:50:22.942011 #1232052] INFO -- : [528/880] 1280719=test_find_executable I, [2024-04-19T09:50:22.968164 #1232052] INFO -- : [529/880] 1280716=test_enc_associate I, [2024-04-19T09:50:23.169153 #1232052] INFO -- : [530/880] 1280719=test_lazy_enumerator I, [2024-04-19T09:50:26.384199 #1232052] INFO -- : [531/880] 1280719=test_unix I, [2024-04-19T09:50:26.649963 #1232052] INFO -- : [532/880] 1280719=test_win32ole_variable I, [2024-04-19T09:50:26.687331 #1232052] INFO -- : [533/880] 1280719=test_io_wait_uncommon I, [2024-04-19T09:50:26.735283 #1232052] INFO -- : [534/880] 1280719=test_stringio I, [2024-04-19T09:50:27.217373 #1232052] INFO -- : [535/880] 1280716=test_arity I, [2024-04-19T09:50:27.249448 #1232052] INFO -- : [536/880] 1280716=test_gem_ci_detector I, [2024-04-19T09:50:27.292151 #1232052] INFO -- : [537/880] 1280716=test_rdoc_class_module I, [2024-04-19T09:50:27.432405 #1232052] INFO -- : [538/880] 1280719=test_bignum I, [2024-04-19T09:50:28.364197 #1232052] INFO -- : [539/880] 1280719=test_rdoc_generator_json_index I, [2024-04-19T09:50:28.394692 #1232052] INFO -- : [540/880] 1280717=test_time_tz I, [2024-04-19T09:50:28.521615 #1232052] INFO -- : [541/880] 1280719=test_win32ole_event I, [2024-04-19T09:50:28.527854 #1232052] INFO -- : [542/880] 1280719=test_trace I, [2024-04-19T09:50:28.654971 #1232052] INFO -- : [543/880] 1280719=ractor_test I, [2024-04-19T09:50:28.946755 #1232052] INFO -- : [544/880] 1280717=test_have_macro I, [2024-04-19T09:50:29.214947 #1232052] INFO -- : [545/880] 1280719=test_gem_package I, [2024-04-19T09:50:32.057530 #1232052] INFO -- : [546/880] 1280717=test_complex2 I, [2024-04-19T09:50:32.061272 #1232052] INFO -- : [547/880] 1280717=test_resolve_symbol I, [2024-04-19T09:50:32.443094 #1232052] INFO -- : [548/880] 1280716=test_threadgroup I, [2024-04-19T09:50:32.583383 #1232052] INFO -- : [549/880] 1280717=test_enum I, [2024-04-19T09:50:33.317349 #1232052] INFO -- : [550/880] 1280716=test_gem_specification I, [2024-04-19T09:50:34.760829 #1232052] INFO -- : [551/880] 1280719=test_rdoc_extend I, [2024-04-19T09:50:34.879779 #1232052] INFO -- : [552/880] 1280719=test_merge_keys I, [2024-04-19T09:50:34.938238 #1232052] INFO -- : [553/880] 1280719=test_gem_resolver_api_specification I, [2024-04-19T09:50:35.325264 #1232052] INFO -- : [554/880] 1280719=test_ipaddr I, [2024-04-19T09:50:35.500674 #1232052] INFO -- : [555/880] 1280719=test_rdoc_markup_to_ansi I, [2024-04-19T09:50:35.821525 #1232052] INFO -- : [556/880] 1280719=test_mixed_unicode_escapes I, [2024-04-19T09:50:35.910569 #1232052] INFO -- : [557/880] 1280719=test_history I, [2024-04-19T09:50:36.025013 #1232052] INFO -- : [558/880] 1280719=test_win32ole_variant I, [2024-04-19T09:50:36.060607 #1232052] INFO -- : [559/880] 1280719=version_test I, [2024-04-19T09:50:36.100063 #1232052] INFO -- : [560/880] 1280719=test_object I, [2024-04-19T09:50:36.147934 #1232052] INFO -- : [561/880] 1280719=heredoc_dedent_test I, [2024-04-19T09:50:36.227693 #1232052] INFO -- : [562/880] 1280719=test_cgi_header I, [2024-04-19T09:50:36.301174 #1232052] INFO -- : [563/880] 1280719=test_arithmetic_sequence I, [2024-04-19T09:50:36.441730 #1232052] INFO -- : [564/880] 1280719=test_gem_gemcutter_utilities I, [2024-04-19T09:50:37.052297 #1232052] INFO -- : [565/880] 1280718=test_basicinstructions I, [2024-04-19T09:50:37.576997 #1232052] INFO -- : [566/880] 1280718=test_gem_command_manager I, [2024-04-19T09:50:37.967355 #1232052] INFO -- : [567/880] 1280719=test_key_actor_emacs I, [2024-04-19T09:50:38.530815 #1232052] INFO -- : [568/880] 1280718=test_sleep I, [2024-04-19T09:50:38.563445 #1232052] INFO -- : [569/880] 1280719=test_object I, [2024-04-19T09:50:38.725272 #1232052] INFO -- : [570/880] 1280717=test_ruby_lex I, [2024-04-19T09:50:39.628305 #1232052] INFO -- : [571/880] 1280717=test_date_arith I, [2024-04-19T09:50:39.695932 #1232052] INFO -- : [572/880] 1280717=test_gem_local_remote_options I, [2024-04-19T09:50:40.267727 #1232052] INFO -- : [573/880] 1280717=test_timeout I, [2024-04-19T09:50:40.282933 #1232052] INFO -- : [574/880] 1280717=test_normalize I, [2024-04-19T09:50:40.382008 #1232052] INFO -- : [575/880] 1280717=test_ossl I, [2024-04-19T09:50:40.916859 #1232052] INFO -- : [576/880] 1280719=test_change_word I, [2024-04-19T09:50:40.994957 #1232052] INFO -- : [577/880] 1280719=compiler_test I, [2024-04-19T09:50:41.037809 #1232052] INFO -- : [578/880] 1280719=test_flip I, [2024-04-19T09:50:41.295600 #1232052] INFO -- : [579/880] 1280719=test_signedness I, [2024-04-19T09:50:43.573250 #1232052] INFO -- : [580/880] 1280718=test_tsort I, [2024-04-19T09:50:43.854742 #1232052] INFO -- : [581/880] 1280718=test_rdoc_rd_block_parser I, [2024-04-19T09:50:44.042989 #1232052] INFO -- : [582/880] 1280718=test_big5 I, [2024-04-19T09:50:44.054350 #1232052] INFO -- : [583/880] 1280718=test_func I, [2024-04-19T09:50:53.285225 #1232052] INFO -- : [584/880] 1280716=test_pointer I, [2024-04-19T09:50:57.189878 #1232052] INFO -- : [585/880] 1280718=test_ractor I, [2024-04-19T09:50:57.223013 #1232052] INFO -- : [586/880] 1280716=test_type I, [2024-04-19T09:50:57.318457 #1232052] INFO -- : [587/880] 1280716=test_gem_platform I, [2024-04-19T09:50:57.686962 #1232052] INFO -- : [588/880] 1280718=test_placearg I, [2024-04-19T09:50:58.213960 #1232052] INFO -- : [589/880] 1280718=test_date_strptime I, [2024-04-19T09:50:58.361928 #1232052] INFO -- : [590/880] 1280716=test_gem_package_task I, [2024-04-19T09:50:58.383102 #1232052] INFO -- : [591/880] 1280716=test_rdoc_markup_hard_break I, [2024-04-19T09:50:58.540557 #1232052] INFO -- : [592/880] 1280716=test_weakkeymap I, [2024-04-19T09:50:59.095484 #1232052] INFO -- : [593/880] 1280717=test_gem_commands_push_command I, [2024-04-19T09:50:59.282354 #1232052] INFO -- : [594/880] 1280718=test_numhash I, [2024-04-19T09:50:59.301516 #1232052] INFO -- : [595/880] 1280718=test_pkey_rsa I, [2024-04-19T09:50:59.794619 #1232052] INFO -- : [596/880] 1280716=test_keyword I, [2024-04-19T09:51:01.570293 #1232052] INFO -- : [597/880] 1280719=test_class_name_check I, [2024-04-19T09:51:01.637735 #1232052] INFO -- : [598/880] 1280717=test_fd_setsize I, [2024-04-19T09:51:01.644656 #1232052] INFO -- : [599/880] 1280717=test_continuation I, [2024-04-19T09:51:01.711893 #1232052] INFO -- : [600/880] 1280717=test_win32ole_method I, [2024-04-19T09:51:01.740386 #1232052] INFO -- : [601/880] 1280717=test_delete I, [2024-04-19T09:51:01.792436 #1232052] INFO -- : [602/880] 1280717=test_logger I, [2024-04-19T09:51:01.895499 #1232052] INFO -- : [603/880] 1280717=test_file_exhaustive I, [2024-04-19T09:51:01.978764 #1232052] INFO -- : [604/880] 1280718=test_files_test I, [2024-04-19T09:51:02.047122 #1232052] INFO -- : [605/880] 1280718=test_gem_update_suggestion I, [2024-04-19T09:51:02.087752 #1232052] INFO -- : [606/880] 1280719=test_rdoc_parser_markdown I, [2024-04-19T09:51:02.221957 #1232052] INFO -- : [607/880] 1280719=test_not I, [2024-04-19T09:51:02.246799 #1232052] INFO -- : [608/880] 1280719=test_gem_resolver_lock_set I, [2024-04-19T09:51:02.466426 #1232052] INFO -- : [609/880] 1280719=test_import I, [2024-04-19T09:51:02.781994 #1232052] INFO -- : [610/880] 1280718=test_gem_resolver_api_set I, [2024-04-19T09:51:03.399071 #1232052] INFO -- : [611/880] 1280718=test_gem_safe_marshal I, [2024-04-19T09:51:03.743309 #1232052] INFO -- : [612/880] 1280716=test_enumerable I, [2024-04-19T09:51:03.795012 #1232052] INFO -- : [613/880] 1280716=test_config I, [2024-04-19T09:51:07.482092 #1232052] INFO -- : [614/880] 1280716=test_gem_resolver_vendor_set I, [2024-04-19T09:51:07.708347 #1232052] INFO -- : [615/880] 1280716=json_generator_test I, [2024-04-19T09:51:08.411458 #1232052] INFO -- : [616/880] 1280716=test_eval I, [2024-04-19T09:51:09.871234 #1232052] INFO -- : [617/880] 1280718=test_transcode I, [2024-04-19T09:51:10.330609 #1232052] INFO -- : [618/880] 1280716=test_update I, [2024-04-19T09:51:10.415609 #1232052] INFO -- : [619/880] 1280716=test_x509name I, [2024-04-19T09:51:10.637224 #1232052] INFO -- : [620/880] 1280716=test_fips I, [2024-04-19T09:51:11.343593 #1232052] INFO -- : [621/880] 1280718=test_x509store I, [2024-04-19T09:51:13.766266 #1232052] INFO -- : [622/880] 1280716=test_rdoc_code_object I, [2024-04-19T09:51:14.301259 #1232052] INFO -- : [623/880] 1280718=test_webauthn_listener I, [2024-04-19T09:51:14.426620 #1232052] INFO -- : Leaked file descriptor: WebauthnListenerTest#test_wait_for_otp_code_get_follows_options: 9 : # I, [2024-04-19T09:51:14.483538 #1232052] INFO -- : COMMAND PID USER FD TYPE DEVICE SIZE/OFF NODE NAME I, [2024-04-19T09:51:14.483798 #1232052] INFO -- : ruby 1280718 sipeed 9u IPv4 677899 0t0 TCP localhost:39359->localhost:34542 (CLOSE_WAIT) I, [2024-04-19T09:51:14.625842 #1232052] INFO -- : [624/880] 1280719=test_helper I, [2024-04-19T09:51:14.629920 #1232052] INFO -- : [625/880] 1280719=test_random_formatter I, [2024-04-19T09:51:14.860434 #1232052] INFO -- : [626/880] 1280719=test_jaro_winkler I, [2024-04-19T09:51:14.912655 #1232052] INFO -- : [627/880] 1280719=test_lambda I, [2024-04-19T09:51:15.057037 #1232052] INFO -- : [628/880] 1280718=test_ast I, [2024-04-19T09:51:15.467827 #1232052] INFO -- : [629/880] 1280719=test_gem_request_set_gem_dependency_api I, [2024-04-19T09:51:16.533095 #1232052] INFO -- : Closed file descriptor: TestAst#test_all_tokens:test/set/test_set.rb: 9 I, [2024-04-19T09:51:16.794113 #1232052] INFO -- : [630/880] 1280716=test_tmpdir I, [2024-04-19T09:51:17.378666 #1232052] INFO -- : [631/880] 1280716=test_rdoc_markup_document I, [2024-04-19T09:51:17.450006 #1232052] INFO -- : [632/880] 1280716=test_integer_comb I, [2024-04-19T09:51:18.027645 #1232052] INFO -- : [633/880] 1280719=test_vm_dump I, [2024-04-19T09:51:18.052798 #1232052] INFO -- : [634/880] 1280719=errors_test I, [2024-04-19T09:51:18.886463 #1232052] INFO -- : [635/880] 1280719=test_regexp I, [2024-04-19T09:51:25.234272 #1232052] INFO -- : [636/880] 1280717=test_gem_commands_check_command I, [2024-04-19T09:51:25.388790 #1232052] INFO -- : [637/880] 1280717=static_inspect_test I, [2024-04-19T09:51:25.461017 #1232052] INFO -- : [638/880] 1280717=test_udp I, [2024-04-19T09:51:25.512541 #1232052] INFO -- : [639/880] 1280717=bom_test I, [2024-04-19T09:51:25.655126 #1232052] INFO -- : [640/880] 1280717=test_data_error I, [2024-04-19T09:51:26.077460 #1232052] INFO -- : [641/880] 1280717=test_force_exit I, [2024-04-19T09:51:26.128684 #1232052] INFO -- : [642/880] 1280717=test_file I, [2024-04-19T09:51:32.713646 #1232052] INFO -- : [643/880] 1280717=test_ostruct I, [2024-04-19T09:51:33.954006 #1232052] INFO -- : [644/880] 1280717=unescape_test I, [2024-04-19T09:51:38.914030 #1232052] INFO -- : [645/880] 1280716=test_project_sanity I, [2024-04-19T09:51:39.831006 #1232052] INFO -- : [646/880] 1280716=test_range I, [2024-04-19T09:51:46.456474 #1232052] INFO -- : [647/880] 1280716=command_line_test I, [2024-04-19T09:51:46.746605 #1232052] INFO -- : [648/880] 1280716=test_pty I, [2024-04-19T09:51:48.972210 #1232052] INFO -- : [649/880] 1280716=test_dup I, [2024-04-19T09:51:50.583813 #1232052] INFO -- : [650/880] 1280716=test_constant I, [2024-04-19T09:51:50.714511 #1232052] INFO -- : [651/880] 1280717=test_erb_command I, [2024-04-19T09:51:50.825733 #1232052] INFO -- : [652/880] 1280717=test_helper I, [2024-04-19T09:51:50.853334 #1232052] INFO -- : [653/880] 1280717=test_encoding I, [2024-04-19T09:51:52.569222 #1232052] INFO -- : [654/880] 1280717=test_gem_uri_formatter I, [2024-04-19T09:51:53.175531 #1232052] INFO -- : [655/880] 1280717=test_ensured I, [2024-04-19T09:51:53.283499 #1232052] INFO -- : [656/880] 1280717=test_addr I, [2024-04-19T09:51:53.388379 #1232052] INFO -- : [657/880] 1280717=test_locale I, [2024-04-19T09:51:53.624449 #1232052] INFO -- : [658/880] 1280717=library_symbols_test I, [2024-04-19T09:51:53.697355 #1232052] INFO -- : [659/880] 1280717=test_ts I, [2024-04-19T09:51:59.468702 #1232052] INFO -- : [660/880] 1280717=test_rdoc_ri_paths I, [2024-04-19T09:51:59.691330 #1232052] INFO -- : [661/880] 1280717=test_rdoc_markup_to_bs I, [2024-04-19T09:52:00.065031 #1232052] INFO -- : [662/880] 1280717=test_help I, [2024-04-19T09:52:00.474653 #1232052] INFO -- : [663/880] 1280717=test_gem_commands_unpack_command I, [2024-04-19T09:52:03.128124 #1232052] INFO -- : [664/880] 1280717=test_files_lib I, [2024-04-19T09:52:08.563548 #1232052] INFO -- : [665/880] 1280716=test_beginendblock I, [2024-04-19T09:52:11.035333 #1232052] INFO -- : [666/880] 1280716=reflection_test I, [2024-04-19T09:52:11.093779 #1232052] INFO -- : [667/880] 1280716=test_gem_bundler_version_finder I, [2024-04-19T09:52:11.530659 #1232052] INFO -- : [668/880] 1280716=test_emoji_breaks I, [2024-04-19T09:52:11.556687 #1232052] INFO -- : [669/880] 1280716=test_within_pipe I, [2024-04-19T09:52:11.844076 #1232052] INFO -- : [670/880] 1280716=test_pinned I, [2024-04-19T09:52:12.019223 #1232052] INFO -- : [671/880] 1280716=test_time I, [2024-04-19T09:52:13.313634 #1232052] INFO -- : [672/880] 1280716=test_webauthn_listener_response I, [2024-04-19T09:52:13.652720 #1232052] INFO -- : [673/880] 1280716=test_to_ary_concat I, [2024-04-19T09:52:22.656581 #1232052] INFO -- : [674/880] 1280716=test_stream I, [2024-04-19T09:52:22.707272 #1232052] INFO -- : [675/880] 1280716=test_rdoc_markup_pre_process I, [2024-04-19T09:52:23.200845 #1232052] INFO -- : [676/880] 1280716=test_printf I, [2024-04-19T09:52:23.358596 #1232052] INFO -- : [677/880] 1280716=test_exit I, [2024-04-19T09:52:24.007504 #1232052] INFO -- : [678/880] 1280716=test_recursion I, [2024-04-19T09:52:24.018514 #1232052] INFO -- : [679/880] 1280716=test_history I, [2024-04-19T09:52:24.535171 #1232052] INFO -- : [680/880] 1280716=test_date_marshal I, [2024-04-19T09:52:24.562528 #1232052] INFO -- : [681/880] 1280716=test_mkmf I, [2024-04-19T09:52:24.849915 #1232052] INFO -- : [682/880] 1280716=test_delegate I, [2024-04-19T09:52:25.055642 #1232052] INFO -- : [683/880] 1280716=test_popen_deadlock I, [2024-04-19T09:52:29.803160 #1232052] INFO -- : [684/880] 1280716=test_closure I, [2024-04-19T09:52:32.905013 #1232052] INFO -- : [685/880] 1280716=test_bundled_ca I, [2024-04-19T09:52:32.954245 #1232052] INFO -- : [686/880] 1280717=test_fiber I, [2024-04-19T09:52:34.947273 #1232052] INFO -- : [687/880] 1280716=test_open3 I, [2024-04-19T09:52:48.656362 #1232052] INFO -- : [688/880] 1280717=test_ractor I, [2024-04-19T09:52:49.371584 #1232052] INFO -- : [689/880] 1280717=test_gem_security I, [2024-04-19T09:52:55.475930 #1232052] INFO -- : [690/880] 1280716=test_rdoc_servlet I, [2024-04-19T09:52:56.403314 #1232052] INFO -- : [691/880] 1280716=test_digest I, [2024-04-19T09:52:56.448831 #1232052] INFO -- : [692/880] 1280716=test_interned_str I, [2024-04-19T09:52:56.550048 #1232052] INFO -- : [693/880] 1280716=test_case_comprehensive I, [2024-04-19T09:53:58.431148 #1232052] INFO -- : [694/880] 1280717=test_gem_commands_build_command I, [2024-04-19T09:54:00.826160 #1232052] INFO -- : [695/880] 1280717=test_cmethod I, [2024-04-19T09:54:00.862204 #1232052] INFO -- : [696/880] 1280717=test_tracer I, [2024-04-19T09:54:00.869416 #1232052] INFO -- : [697/880] 1280717=test_append I, [2024-04-19T09:54:01.014467 #1232052] INFO -- : [698/880] 1280717=test_option I, [2024-04-19T09:54:01.948452 #1232052] INFO -- : [699/880] 1280717=test_gem_commands_server_command I, [2024-04-19T09:54:02.033855 #1232052] INFO -- : [700/880] 1280717=test_variable_name_check I, [2024-04-19T09:54:02.547563 #1232052] INFO -- : [701/880] 1280717=test_io_m17n I, [2024-04-19T09:54:02.592505 #1232052] INFO -- : [702/880] 1280719=test_did_you_mean I, [2024-04-19T09:54:03.018271 #1232052] INFO -- : [703/880] 1280719=test_rdoc_markup_heading I, [2024-04-19T09:54:03.371791 #1232052] INFO -- : [704/880] 1280719=test_iseq I, [2024-04-19T09:54:07.462207 #1232052] INFO -- : [705/880] 1280719=test_exception_at_throwing I, [2024-04-19T09:54:07.872595 #1232052] INFO -- : [706/880] 1280719=test_scheduler I, [2024-04-19T09:54:08.229896 #1232052] INFO -- : [707/880] 1280719=test_pkey_dsa I, [2024-04-19T09:54:11.040481 #1232052] INFO -- : [708/880] 1280717=test_class I, [2024-04-19T09:54:11.097211 #1232052] INFO -- : [709/880] 1280717=test_ocsp I, [2024-04-19T09:54:14.027447 #1232052] INFO -- : [710/880] 1280717=test_compile_prism I, [2024-04-19T09:54:16.504550 #1232052] INFO -- : [711/880] 1280717=test_terminfo I, [2024-04-19T09:54:16.524285 #1232052] INFO -- : [712/880] 1280717=test_date_compat I, [2024-04-19T09:54:16.576449 #1232052] INFO -- : [713/880] 1280717=test_rdoc_markup_to_html I, [2024-04-19T09:54:17.340939 #1232052] INFO -- : [714/880] 1280717=test_bug-14834 I, [2024-04-19T09:54:17.754080 #1232052] INFO -- : [715/880] 1280717=test_http I, [2024-04-19T09:54:19.044300 #1232052] INFO -- : [716/880] 1280719=test_addrinfo I, [2024-04-19T09:54:19.620153 #1232052] INFO -- : [717/880] 1280719=test_tree_spell_checker I, [2024-04-19T09:54:19.988125 #1232052] INFO -- : [718/880] 1280719=test_path I, [2024-04-19T09:54:20.045349 #1232052] INFO -- : [719/880] 1280719=test_case_mapping I, [2024-04-19T09:54:20.163460 #1232052] INFO -- : [720/880] 1280719=test_bn I, [2024-04-19T09:54:20.248757 #1232052] INFO -- : [721/880] 1280719=test_win32ole_param_event I, [2024-04-19T09:54:20.285392 #1232052] INFO -- : [722/880] 1280719=parameters_signature_test I, [2024-04-19T09:54:20.356250 #1232052] INFO -- : [723/880] 1280719=test_koi8 I, [2024-04-19T09:54:20.405145 #1232052] INFO -- : [724/880] 1280719=test_enumerator I, [2024-04-19T09:54:20.450022 #1232052] INFO -- : [725/880] 1280719=test_rdoc_parser_changelog I, [2024-04-19T09:54:21.129109 #1232052] INFO -- : [726/880] 1280719=test_unicode I, [2024-04-19T09:54:21.218386 #1232052] INFO -- : [727/880] 1280719=test_rdoc_generator_pot I, [2024-04-19T09:54:21.254805 #1232052] INFO -- : [728/880] 1280719=test_gem_gem_runner I, [2024-04-19T09:54:21.629858 #1232052] INFO -- : [729/880] 1280719=test_filter I, [2024-04-19T09:54:21.832956 #1232052] INFO -- : [730/880] 1280719=test_data I, [2024-04-19T09:54:21.880249 #1232052] INFO -- : [731/880] 1280719=static_literals_test I, [2024-04-19T09:54:21.931799 #1232052] INFO -- : [732/880] 1280719=test_rdoc_method_attr I, [2024-04-19T09:54:22.702162 #1232052] INFO -- : [733/880] 1280719=test_key_event_record I, [2024-04-19T09:54:22.765864 #1232052] INFO -- : [734/880] 1280719=test_gem_uri I, [2024-04-19T09:54:23.029181 #1232052] INFO -- : [735/880] 1280719=test_random I, [2024-04-19T09:54:23.143322 #1232052] INFO -- : [736/880] 1280719=test_notimplement I, [2024-04-19T09:54:23.346353 #1232052] INFO -- : [737/880] 1280719=test_gem_commands_update_command I, [2024-04-19T09:54:31.292557 #1232052] INFO -- : [738/880] 1280719=test_gem_resolver_vendor_specification I, [2024-04-19T09:54:31.730926 #1232052] INFO -- : [739/880] 1280719=test_thread_cv I, [2024-04-19T09:54:32.507529 #1232052] INFO -- : [740/880] 1280719=test_lexer I, [2024-04-19T09:54:32.577431 #1232052] INFO -- : [741/880] 1280719=test_ssl_session I, [2024-04-19T09:54:33.203262 #1232052] INFO -- : [742/880] 1280717=test_rbconfig I, [2024-04-19T09:54:33.240769 #1232052] INFO -- : [743/880] 1280717=test_human_typo I, [2024-04-19T09:54:33.275820 #1232052] INFO -- : [744/880] 1280717=test_primitive I, [2024-04-19T09:54:33.367552 #1232052] INFO -- : [745/880] 1280717=test_name_error_extension I, [2024-04-19T09:54:33.413520 #1232052] INFO -- : [746/880] 1280717=test_chilled I, [2024-04-19T09:54:33.471724 #1232052] INFO -- : [747/880] 1280717=test_rdoc_i18n_locale I, [2024-04-19T09:54:33.517660 #1232052] INFO -- : [748/880] 1280717=test_gem_commands_yank_command I, [2024-04-19T09:54:34.542133 #1232052] INFO -- : [749/880] 1280717=test_win32ole_param I, [2024-04-19T09:54:34.607340 #1232052] INFO -- : [750/880] 1280717=test_pair I, [2024-04-19T09:54:37.425054 #1232052] INFO -- : [751/880] 1280719=test_document I, [2024-04-19T09:54:37.470083 #1232052] INFO -- : [752/880] 1280719=test_euc_jp I, [2024-04-19T09:54:37.510950 #1232052] INFO -- : [753/880] 1280719=test_rdoc_generator_pot_po_entry I, [2024-04-19T09:54:37.594286 #1232052] INFO -- : [754/880] 1280719=test_acceptable I, [2024-04-19T09:54:38.004865 #1232052] INFO -- : [755/880] 1280719=test_install I, [2024-04-19T09:54:39.511762 #1232052] INFO -- : [756/880] 1280719=test_rdoc_markup_to_label I, [2024-04-19T09:54:39.816629 #1232052] INFO -- : [757/880] 1280719=test_sockopt I, [2024-04-19T09:54:40.192046 #1232052] INFO -- : [758/880] 1280719=test_encoding I, [2024-04-19T09:54:40.310643 #1232052] INFO -- : [759/880] 1280719=test_httpresponses I, [2024-04-19T09:54:40.362577 #1232052] INFO -- : [760/880] 1280719=test_set_len I, [2024-04-19T09:54:40.454001 #1232052] INFO -- : [761/880] 1280719=test_gem_resolver_local_specification I, [2024-04-19T09:54:40.587097 #1232052] INFO -- : [762/880] 1280719=test_httpheader I, [2024-04-19T09:54:40.741752 #1232052] INFO -- : [763/880] 1280719=test_rdoc_ri_driver I, [2024-04-19T09:54:42.897111 #1232052] INFO -- : [764/880] 1280719=test_color I, [2024-04-19T09:54:43.330084 #1232052] INFO -- : [765/880] 1280719=json_encoding_test I, [2024-04-19T09:54:43.455339 #1232052] INFO -- : [766/880] 1280719=test_key_stroke I, [2024-04-19T09:54:43.577729 #1232052] INFO -- : [767/880] 1280719=test_gem_source I, [2024-04-19T09:54:45.499297 #1232052] INFO -- : [768/880] 1280719=test_scalar_scanner I, [2024-04-19T09:54:45.736590 #1232052] INFO -- : [769/880] 1280719=test_gem_commands_outdated_command I, [2024-04-19T09:54:46.036894 #1232052] INFO -- : [770/880] 1280719=test_gem_package_tar_writer I, [2024-04-19T09:54:47.352313 #1232052] INFO -- : [771/880] 1280719=test_array I, [2024-04-19T09:54:56.805584 #1232052] INFO -- : [772/880] 1280717=test_gem_dependency_list I, [2024-04-19T09:54:57.550248 #1232052] INFO -- : [773/880] 1280717=test_benchmark I, [2024-04-19T09:55:00.374319 #1232052] INFO -- : [774/880] 1280717=test_win32ole_method_event I, [2024-04-19T09:55:00.395786 #1232052] INFO -- : [775/880] 1280717=test_nesting_parser I, [2024-04-19T09:55:00.512972 #1232052] INFO -- : [776/880] 1280717=test_https I, [2024-04-19T09:55:01.708912 #1232052] INFO -- : [777/880] 1280717=test_gem_ext_builder I, [2024-04-19T09:55:09.932398 #1232052] INFO -- : [778/880] 1280717=test_evaluation I, [2024-04-19T09:55:10.021249 #1232052] INFO -- : [779/880] 1280717=test_abi I, [2024-04-19T09:55:11.239951 #1232052] INFO -- : [780/880] 1280717=test_provider I, [2024-04-19T09:55:14.953622 #1232052] INFO -- : [781/880] 1280717=test_rdoc_parser_simple I, [2024-04-19T09:55:15.252084 #1232052] INFO -- : [782/880] 1280717=test_gem_commands_rebuild_command I, [2024-04-19T09:55:15.590417 #1232052] INFO -- : [783/880] 1280717=test_yamldbm I, [2024-04-19T09:55:15.598101 #1232052] INFO -- : [784/880] 1280717=test_load I, [2024-04-19T09:55:15.625526 #1232052] INFO -- : [785/880] 1280717=test_len I, [2024-04-19T09:55:15.655392 #1232052] INFO -- : [786/880] 1280717=test_yield_block I, [2024-04-19T09:55:15.691418 #1232052] INFO -- : [787/880] 1280717=test_completion I, [2024-04-19T09:55:20.892176 #1232052] INFO -- : [788/880] 1280717=test_gem_commands_cert_command I, [2024-04-19T09:55:39.112685 #1232052] INFO -- : [789/880] 1280717=test_x509ext I, [2024-04-19T09:55:39.148351 #1232052] INFO -- : [790/880] 1280717=test_erb I, [2024-04-19T09:55:39.622723 #1232052] INFO -- : [791/880] 1280717=test_gem_source_installed I, [2024-04-19T09:55:39.640855 #1232052] INFO -- : [792/880] 1280717=test_assembler I, [2024-04-19T09:55:39.721769 #1232052] INFO -- : [793/880] 1280717=test_spell_checker I, [2024-04-19T09:55:39.753744 #1232052] INFO -- : [794/880] 1280717=attribute_write_test I, [2024-04-19T09:55:39.797069 #1232052] INFO -- : [795/880] 1280717=test_propertyputref I, [2024-04-19T09:55:39.854342 #1232052] INFO -- : [796/880] 1280717=test_rational I, [2024-04-19T09:55:40.030248 #1232052] INFO -- : [797/880] 1280717=test_rational2 I, [2024-04-19T09:55:40.175101 #1232052] INFO -- : [798/880] 1280717=test_module I, [2024-04-19T09:55:57.582132 #1232052] INFO -- : [799/880] 1280717=test_gem_request_set I, [2024-04-19T09:56:00.723870 #1232052] INFO -- : [800/880] 1280717=constant_path_node_test I, [2024-04-19T09:56:00.838766 #1232052] INFO -- : [801/880] 1280717=test_gem_ext_cargo_builder I, [2024-04-19T09:56:01.217769 #1232052] INFO -- : [802/880] 1280717=test_ssl I, [2024-04-19T09:56:01.620972 #1232052] INFO -- : [803/880] 1280719=test_arith_seq_extract I, [2024-04-19T09:56:02.906068 #1232052] INFO -- : [804/880] 1280719=test_method_name_check I, [2024-04-19T09:56:03.159456 #1232052] INFO -- : [805/880] 1280719=test_parser I, [2024-04-19T09:56:03.296208 #1232052] INFO -- : [806/880] 1280719=test_whileuntil I, [2024-04-19T09:56:03.316147 #1232052] INFO -- : [807/880] 1280719=test_rdoc_generator_markup I, [2024-04-19T09:56:03.381826 #1232052] INFO -- : [808/880] 1280719=test_configuration I, [2024-04-19T09:56:04.135849 #1232052] INFO -- : [809/880] 1280719=test_rubyvm I, [2024-04-19T09:56:04.182221 #1232052] INFO -- : [810/880] 1280719=test_buffered_io I, [2024-04-19T09:56:04.226372 #1232052] INFO -- : [811/880] 1280719=test_monitor I, [2024-04-19T09:56:04.351536 #1232052] INFO -- : [812/880] 1280716=integer_parse_test I, [2024-04-19T09:56:04.460411 #1232052] INFO -- : [813/880] 1280716=test_instrumentation_api I, [2024-04-19T09:56:04.770419 #1232052] INFO -- : [814/880] 1280719=test_stringify_symbols I, [2024-04-19T09:56:04.839090 #1232052] INFO -- : [815/880] 1280719=test_boolean I, [2024-04-19T09:56:04.887781 #1232052] INFO -- : [816/880] 1280719=memsize_test I, [2024-04-19T09:56:04.913319 #1232052] INFO -- : [817/880] 1280719=json_parser_test I, [2024-04-19T09:56:05.159154 #1232052] INFO -- : [818/880] 1280719=test_nomethod_error I, [2024-04-19T09:56:05.247688 #1232052] INFO -- : [819/880] 1280719=test_config I, [2024-04-19T09:56:05.720974 #1232052] INFO -- : [820/880] 1280719=test_win32ole_variant_outarg I, [2024-04-19T09:56:05.741940 #1232052] INFO -- : [821/880] 1280719=test_gem_source_subpath_problem I, [2024-04-19T09:56:06.501943 #1232052] INFO -- : [822/880] 1280719=test_dln I, [2024-04-19T09:56:06.548551 #1232052] INFO -- : [823/880] 1280719=json_common_interface_test I, [2024-04-19T09:56:06.652971 #1232052] INFO -- : [824/880] 1280719=test_struct I, [2024-04-19T09:56:06.713462 #1232052] INFO -- : [825/880] 1280719=test_rdoc_markup_to_html_snippet I, [2024-04-19T09:56:07.173450 #1232052] INFO -- : [826/880] 1280719=magic_comment_test I, [2024-04-19T09:56:07.232658 #1232052] INFO -- : [827/880] 1280719=test_rdoc_markup_include I, [2024-04-19T09:56:07.286079 #1232052] INFO -- : [828/880] 1280719=test_sexp I, [2024-04-19T09:56:07.434395 #1232052] INFO -- : [829/880] 1280719=fuzzer_test I, [2024-04-19T09:56:07.530269 #1232052] INFO -- : [830/880] 1280719=test_variable I, [2024-04-19T09:56:08.195422 #1232052] INFO -- : [831/880] 1280719=test_pkg_config I, [2024-04-19T09:56:08.275916 #1232052] INFO -- : [832/880] 1280719=test_cparser I, [2024-04-19T09:56:08.488030 #1232052] INFO -- : [833/880] 1280716=test_serialize_subclasses I, [2024-04-19T09:56:08.536324 #1232052] INFO -- : [834/880] 1280716=test_insns_leaf I, [2024-04-19T09:56:08.548375 #1232052] INFO -- : [835/880] 1280716=test_deprecated I, [2024-04-19T09:56:08.627214 #1232052] INFO -- : [836/880] 1280716=test_color_printer I, [2024-04-19T09:56:08.651482 #1232052] INFO -- : [837/880] 1280716=test_win32ole_variant_m I, [2024-04-19T09:56:08.685887 #1232052] INFO -- : [838/880] 1280716=test_engine I, [2024-04-19T09:56:08.727331 #1232052] INFO -- : [839/880] 1280716=test_allocation I, [2024-04-19T09:56:18.412101 #1232052] INFO -- : [840/880] 1280719=test_div I, [2024-04-19T09:56:18.419359 #1232052] INFO -- : [841/880] 1280719=test_key_error I, [2024-04-19T09:56:18.651176 #1232052] INFO -- : [842/880] 1280719=test_x509req I, [2024-04-19T09:56:20.393861 #1232052] INFO -- : [843/880] 1280719=test_mutex I, [2024-04-19T09:56:21.587176 #1232052] INFO -- : [844/880] 1280719=test_rdoc_rd_inline I, [2024-04-19T09:56:21.761991 #1232052] INFO -- : [845/880] 1280719=test_files_test_1 I, [2024-04-19T09:56:27.156265 #1232052] INFO -- : [846/880] 1280716=test_set I, [2024-04-19T09:56:27.517479 #1232052] INFO -- : [847/880] 1280716=test_gem_path_support I, [2024-04-19T09:56:27.778066 #1232052] INFO -- : [848/880] 1280716=test_struct I, [2024-04-19T09:56:33.413870 #1232052] INFO -- : [849/880] 1280716=test_refinement I, [2024-04-19T09:56:44.087724 #1232052] INFO -- : [850/880] 1280719=test_gem_commands_signout_command I, [2024-04-19T09:56:44.342864 #1232052] INFO -- : [851/880] 1280719=test_regex_casefold I, [2024-04-19T09:56:47.104650 #1232052] INFO -- : [852/880] 1280718=test_gem_source_git I, [2024-04-19T09:56:47.977270 #1232052] INFO -- : [853/880] 1280719=test_dir_m17n I, [2024-04-19T09:56:50.380879 #1232052] INFO -- : [854/880] 1280717=test_gem_resolver_installer_set I, [2024-04-19T09:56:50.897643 #1232052] INFO -- : [855/880] 1280718=test_float I, [2024-04-19T09:56:52.176865 #1232052] INFO -- : [856/880] 1280717=test_cgi_cookie I, [2024-04-19T09:56:52.259868 #1232052] INFO -- : [857/880] 1280717=test_require I, [2024-04-19T09:56:56.443696 #1232052] INFO -- : [858/880] 1280718=test_process I, [2024-04-19T09:56:56.499102 #1232052] INFO -- : [859/880] 1280718=test_windows_1252 I, [2024-04-19T09:56:56.552305 #1232052] INFO -- : [860/880] 1280718=test_input_method I, [2024-04-19T09:56:56.733074 #1232052] INFO -- : [861/880] 1280716=test_cgi_session I, [2024-04-19T09:56:56.803672 #1232052] INFO -- : [862/880] 1280718=test_rdoc_rd I, [2024-04-19T09:56:56.839287 #1232052] INFO -- : [863/880] 1280718=test_metaclass I, [2024-04-19T09:56:56.875898 #1232052] INFO -- : [864/880] 1280716=test_rdoc_top_level I, [2024-04-19T09:56:57.135261 #1232052] INFO -- : [865/880] 1280718=test_signal I, [2024-04-19T09:56:58.404960 #1232052] INFO -- : [866/880] 1280719=test_fixnum I, [2024-04-19T09:56:58.566534 #1232052] INFO -- : [867/880] 1280719=test_x509crl I, [2024-04-19T09:56:59.307794 #1232052] INFO -- : [868/880] 1280716=test_debug I, [2024-04-19T09:56:59.346884 #1232052] INFO -- : [869/880] 1280716=pattern_test I, [2024-04-19T09:56:59.401940 #1232052] INFO -- : [870/880] 1280716=test_memory_view I, [2024-04-19T09:56:59.580526 #1232052] INFO -- : [871/880] 1280716=test_shellwords I, [2024-04-19T09:56:59.619712 #1232052] INFO -- : [872/880] 1280716=test_digest_extend I, [2024-04-19T09:56:59.703925 #1232052] INFO -- : [873/880] 1280716=test_string I, [2024-04-19T09:56:59.742956 #1232052] INFO -- : [874/880] 1280716=test_iterator I, [2024-04-19T09:57:00.284001 #1232052] INFO -- : [875/880] 1280716=test_omap I, [2024-04-19T09:57:00.360255 #1232052] INFO -- : [876/880] 1280716=test_gem_resolver_git_set I, [2024-04-19T09:57:00.472606 #1232052] INFO -- : [877/880] 1280719=test_storage I, [2024-04-19T09:57:00.542734 #1232052] INFO -- : [878/880] 1280719=test_new I, [2024-04-19T09:57:00.601325 #1232052] INFO -- : [879/880] 1280719=test_cipher I, [2024-04-19T09:57:01.045099 #1232052] INFO -- : [880/880] 1280719=test_gem_security_signer I, [2024-04-19T09:57:12.215535 #1232052] INFO -- : Finished tests in 833.957900s, 31.4776 tests/s, 11188.6679 assertions/s. I, [2024-04-19T09:57:12.223233 #1232052] INFO -- : 26251 tests, 9330878 assertions, 0 failures, 0 errors, 284 skips I, [2024-04-19T09:57:12.223466 #1232052] INFO -- : I, [2024-04-19T09:57:12.223595 #1232052] INFO -- : ruby -v: ruby 3.4.0dev (2024-04-19T07:33:16Z master 7951b349ab) [riscv64-linux] I, [2024-04-19T09:57:12.236774 #1232052] INFO -- : $$$[end] "make yes-test-all TESTOPTS='--stderr-on-failure' TESTS='-j4'" exit with 0. I, [2024-04-19T09:57:12.237585 #1232052] INFO -- : $$$[beg] make yes-test-rubyspec MSPECOPT='--error-output stderr --debug -j' TESTS='-j4' I, [2024-04-19T09:57:13.091986 #1232052] INFO -- : BASERUBY = /usr/bin/ruby --disable=gems I, [2024-04-19T09:57:13.092202 #1232052] INFO -- : CC = gcc I, [2024-04-19T09:57:13.092309 #1232052] INFO -- : LD = ld I, [2024-04-19T09:57:13.092421 #1232052] INFO -- : LDSHARED = gcc -shared I, [2024-04-19T09:57:13.092536 #1232052] INFO -- : CFLAGS = -O3 -fno-fast-math -ggdb3 -Wall -Wextra -Wdeprecated-declarations -Wdiv-by-zero -Wduplicated-cond -Wimplicit-function-declaration -Wimplicit-int -Wpointer-arith -Wwrite-strings -Wold-style-definition -Wimplicit-fallthrough=0 -Wmissing-noreturn -Wno-cast-function-type -Wno-constant-logical-operand -Wno-long-long -Wno-missing-field-initializers -Wno-overlength-strings -Wno-packed-bitfield-compat -Wno-parentheses-equality -Wno-self-assign -Wno-tautological-compare -Wno-unused-parameter -Wno-unused-value -Wsuggest-attribute=format -Wsuggest-attribute=noreturn -Wunused-variable -Wmisleading-indentation -Wundef -fPIC I, [2024-04-19T09:57:13.092647 #1232052] INFO -- : XCFLAGS = -U_FORTIFY_SOURCE -D_FORTIFY_SOURCE=2 -fstack-protector-strong -fno-strict-overflow -fvisibility=hidden -fexcess-precision=standard -DRUBY_EXPORT -I. -I.ext/include/riscv64-linux -I/tmp/ruby/src/trunk/include -I/tmp/ruby/src/trunk -I/tmp/ruby/src/trunk/prism -I/tmp/ruby/src/trunk/enc/unicode/15.0.0 I, [2024-04-19T09:57:13.092760 #1232052] INFO -- : CPPFLAGS = I, [2024-04-19T09:57:13.092913 #1232052] INFO -- : DLDFLAGS = -Wl,--compress-debug-sections=zlib -Wl,-soname,libruby.so.3.4 -fstack-protector-strong I, [2024-04-19T09:57:13.093038 #1232052] INFO -- : SOLIBS = -lz -lrt -lrt -lgmp -ldl -lcrypt -lm -lpthread I, [2024-04-19T09:57:13.093143 #1232052] INFO -- : LANG = I, [2024-04-19T09:57:13.093239 #1232052] INFO -- : LC_ALL = I, [2024-04-19T09:57:13.093344 #1232052] INFO -- : LC_CTYPE = I, [2024-04-19T09:57:13.093446 #1232052] INFO -- : MFLAGS = I, [2024-04-19T09:57:13.093537 #1232052] INFO -- : RUSTC = rustc I, [2024-04-19T09:57:13.093625 #1232052] INFO -- : YJIT_RUSTC_ARGS = --crate-name=yjit --crate-type=staticlib --edition=2021 -g -C lto=thin -C opt-level=3 -C overflow-checks=on '--out-dir=/tmp/ruby/build/trunk/yjit/target/release/' /tmp/ruby/src/trunk/yjit/src/lib.rs I, [2024-04-19T09:57:13.095509 #1232052] INFO -- : gcc (Debian 13.2.0-4revyos1) 13.2.0 I, [2024-04-19T09:57:13.095769 #1232052] INFO -- : Copyright (C) 2023 Free Software Foundation, Inc. I, [2024-04-19T09:57:13.095884 #1232052] INFO -- : This is free software; see the source for copying conditions. There is NO I, [2024-04-19T09:57:13.096043 #1232052] INFO -- : warranty; not even for MERCHANTABILITY or FITNESS FOR A PARTICULAR PURPOSE. I, [2024-04-19T09:57:13.096174 #1232052] INFO -- : I, [2024-04-19T09:57:13.113430 #1232052] INFO -- : generating enc.mk I, [2024-04-19T09:57:14.603810 #1232052] INFO -- : generating encdb.h I, [2024-04-19T09:57:14.839207 #1232052] INFO -- : encdb.h unchanged I, [2024-04-19T09:57:14.845278 #1232052] INFO -- : making enc I, [2024-04-19T09:57:15.017422 #1232052] INFO -- : make[1]: Entering directory '/tmp/ruby/build/trunk' I, [2024-04-19T09:57:15.017626 #1232052] INFO -- : make[1]: Nothing to be done for 'enc'. I, [2024-04-19T09:57:15.017731 #1232052] INFO -- : make[1]: Leaving directory '/tmp/ruby/build/trunk' I, [2024-04-19T09:57:15.020211 #1232052] INFO -- : making srcs under enc I, [2024-04-19T09:57:15.318658 #1232052] INFO -- : make[1]: Entering directory '/tmp/ruby/build/trunk' I, [2024-04-19T09:57:15.318939 #1232052] INFO -- : make[1]: Nothing to be done for 'srcs'. I, [2024-04-19T09:57:15.319161 #1232052] INFO -- : make[1]: Leaving directory '/tmp/ruby/build/trunk' I, [2024-04-19T09:57:15.324275 #1232052] INFO -- : generating transdb.h I, [2024-04-19T09:57:16.551509 #1232052] INFO -- : transdb.h unchanged I, [2024-04-19T09:57:16.557600 #1232052] INFO -- : making trans I, [2024-04-19T09:57:16.896850 #1232052] INFO -- : make[1]: Entering directory '/tmp/ruby/build/trunk' I, [2024-04-19T09:57:16.897045 #1232052] INFO -- : make[1]: Nothing to be done for 'trans'. I, [2024-04-19T09:57:16.897135 #1232052] INFO -- : make[1]: Leaving directory '/tmp/ruby/build/trunk' I, [2024-04-19T09:57:16.899796 #1232052] INFO -- : making encs I, [2024-04-19T09:57:17.297530 #1232052] INFO -- : make[1]: Entering directory '/tmp/ruby/build/trunk' I, [2024-04-19T09:57:17.302653 #1232052] INFO -- : make[1]: Nothing to be done for 'encs'. I, [2024-04-19T09:57:17.302882 #1232052] INFO -- : make[1]: Leaving directory '/tmp/ruby/build/trunk' I, [2024-04-19T09:57:17.310275 #1232052] INFO -- : generating makefiles ext/configure-ext.mk I, [2024-04-19T09:57:17.509812 #1232052] INFO -- : ext/configure-ext.mk updated I, [2024-04-19T09:57:17.523828 #1232052] INFO -- : make[1]: Entering directory '/tmp/ruby/build/trunk' I, [2024-04-19T09:57:29.373699 #1232052] INFO -- : make[1]: Leaving directory '/tmp/ruby/build/trunk' I, [2024-04-19T09:57:29.375740 #1232052] INFO -- : generating makefile exts.mk I, [2024-04-19T09:57:29.703322 #1232052] INFO -- : exts.mk unchanged I, [2024-04-19T09:57:29.740452 #1232052] INFO -- : make[1]: Entering directory '/tmp/ruby/build/trunk' I, [2024-04-19T09:57:31.960525 #1232052] INFO -- : make[2]: Entering directory '/tmp/ruby/build/trunk/ext/coverage' I, [2024-04-19T09:57:31.985291 #1232052] INFO -- : make[2]: Leaving directory '/tmp/ruby/build/trunk/ext/coverage' I, [2024-04-19T09:57:32.027239 #1232052] INFO -- : make[2]: Entering directory '/tmp/ruby/build/trunk/ext/date' I, [2024-04-19T09:57:32.056610 #1232052] INFO -- : make[2]: Leaving directory '/tmp/ruby/build/trunk/ext/date' I, [2024-04-19T09:57:32.082004 #1232052] INFO -- : make[2]: Entering directory '/tmp/ruby/build/trunk/ext/digest' I, [2024-04-19T09:57:32.139264 #1232052] INFO -- : make[2]: Leaving directory '/tmp/ruby/build/trunk/ext/digest' I, [2024-04-19T09:57:32.310290 #1232052] INFO -- : make[2]: Entering directory '/tmp/ruby/build/trunk/ext/digest/sha2' I, [2024-04-19T09:57:32.346870 #1232052] INFO -- : make[2]: Leaving directory '/tmp/ruby/build/trunk/ext/digest/sha2' I, [2024-04-19T09:57:32.489759 #1232052] INFO -- : make[2]: Entering directory '/tmp/ruby/build/trunk/ext/fiddle' I, [2024-04-19T09:57:32.552462 #1232052] INFO -- : make[2]: Leaving directory '/tmp/ruby/build/trunk/ext/fiddle' I, [2024-04-19T09:57:32.592786 #1232052] INFO -- : make[2]: Entering directory '/tmp/ruby/build/trunk/ext/io/console' I, [2024-04-19T09:57:32.612278 #1232052] INFO -- : make[2]: Leaving directory '/tmp/ruby/build/trunk/ext/io/console' I, [2024-04-19T09:57:32.695327 #1232052] INFO -- : make[2]: Entering directory '/tmp/ruby/build/trunk/ext/json' I, [2024-04-19T09:57:32.774608 #1232052] INFO -- : make[2]: Leaving directory '/tmp/ruby/build/trunk/ext/json' I, [2024-04-19T09:57:32.872489 #1232052] INFO -- : make[2]: Entering directory '/tmp/ruby/build/trunk/ext/monitor' I, [2024-04-19T09:57:32.892830 #1232052] INFO -- : make[2]: Leaving directory '/tmp/ruby/build/trunk/ext/monitor' I, [2024-04-19T09:57:32.945867 #1232052] INFO -- : make[2]: Entering directory '/tmp/ruby/build/trunk/ext/objspace' I, [2024-04-19T09:57:32.981372 #1232052] INFO -- : make[2]: Leaving directory '/tmp/ruby/build/trunk/ext/objspace' I, [2024-04-19T09:57:33.106735 #1232052] INFO -- : make[2]: Entering directory '/tmp/ruby/build/trunk/ext/openssl' I, [2024-04-19T09:57:33.246242 #1232052] INFO -- : make[2]: Leaving directory '/tmp/ruby/build/trunk/ext/openssl' I, [2024-04-19T09:57:33.277245 #1232052] INFO -- : make[2]: Entering directory '/tmp/ruby/build/trunk/ext/pathname' I, [2024-04-19T09:57:33.297448 #1232052] INFO -- : make[2]: Leaving directory '/tmp/ruby/build/trunk/ext/pathname' I, [2024-04-19T09:57:33.351582 #1232052] INFO -- : make[2]: Entering directory '/tmp/ruby/build/trunk/ext/psych' I, [2024-04-19T09:57:33.514355 #1232052] INFO -- : make[2]: Leaving directory '/tmp/ruby/build/trunk/ext/psych' I, [2024-04-19T09:57:33.546714 #1232052] INFO -- : make[2]: Entering directory '/tmp/ruby/build/trunk/ext/pty' I, [2024-04-19T09:57:33.577505 #1232052] INFO -- : make[2]: Leaving directory '/tmp/ruby/build/trunk/ext/pty' I, [2024-04-19T09:57:33.679124 #1232052] INFO -- : make[2]: Entering directory '/tmp/ruby/build/trunk/ext/ripper' I, [2024-04-19T09:57:33.734564 #1232052] INFO -- : make[2]: Leaving directory '/tmp/ruby/build/trunk/ext/ripper' I, [2024-04-19T09:57:33.745966 #1232052] INFO -- : make[2]: Entering directory '/tmp/ruby/build/trunk/ext/rubyvm' I, [2024-04-19T09:57:33.761372 #1232052] INFO -- : make[2]: Leaving directory '/tmp/ruby/build/trunk/ext/rubyvm' I, [2024-04-19T09:57:33.841409 #1232052] INFO -- : make[2]: Entering directory '/tmp/ruby/build/trunk/ext/socket' I, [2024-04-19T09:57:33.897036 #1232052] INFO -- : make[2]: Leaving directory '/tmp/ruby/build/trunk/ext/socket' I, [2024-04-19T09:57:34.016716 #1232052] INFO -- : make[2]: Entering directory '/tmp/ruby/build/trunk/.bundle/gems/bigdecimal-3.1.7/ext/bigdecimal' I, [2024-04-19T09:57:34.175728 #1232052] INFO -- : make[2]: Leaving directory '/tmp/ruby/build/trunk/.bundle/gems/bigdecimal-3.1.7/ext/bigdecimal' I, [2024-04-19T09:57:34.193402 #1232052] INFO -- : make[2]: Entering directory '/tmp/ruby/build/trunk/.bundle/gems/debug-1.9.2/ext/debug' I, [2024-04-19T09:57:34.346561 #1232052] INFO -- : make[2]: Leaving directory '/tmp/ruby/build/trunk/.bundle/gems/debug-1.9.2/ext/debug' I, [2024-04-19T09:57:34.364366 #1232052] INFO -- : make[2]: Entering directory '/tmp/ruby/build/trunk/.bundle/gems/nkf-0.2.0/ext/nkf' I, [2024-04-19T09:57:34.526415 #1232052] INFO -- : make[2]: Leaving directory '/tmp/ruby/build/trunk/.bundle/gems/nkf-0.2.0/ext/nkf' I, [2024-04-19T09:57:34.544448 #1232052] INFO -- : make[2]: Entering directory '/tmp/ruby/build/trunk/.bundle/gems/racc-1.7.3/ext/racc/cparse' I, [2024-04-19T09:57:34.705611 #1232052] INFO -- : make[2]: Leaving directory '/tmp/ruby/build/trunk/.bundle/gems/racc-1.7.3/ext/racc/cparse' I, [2024-04-19T09:57:34.727794 #1232052] INFO -- : make[2]: Entering directory '/tmp/ruby/build/trunk/.bundle/gems/rbs-3.4.4/ext/rbs_extension' I, [2024-04-19T09:57:34.881691 #1232052] INFO -- : make[2]: Leaving directory '/tmp/ruby/build/trunk/.bundle/gems/rbs-3.4.4/ext/rbs_extension' I, [2024-04-19T09:57:34.898675 #1232052] INFO -- : make[2]: Entering directory '/tmp/ruby/build/trunk/.bundle/gems/syslog-0.1.2/ext/syslog' I, [2024-04-19T09:57:35.049532 #1232052] INFO -- : make[2]: Leaving directory '/tmp/ruby/build/trunk/.bundle/gems/syslog-0.1.2/ext/syslog' I, [2024-04-19T09:57:35.270909 #1232052] INFO -- : make[2]: Entering directory '/tmp/ruby/build/trunk' I, [2024-04-19T09:57:35.926658 #1232052] INFO -- : make[2]: 'ruby' is up to date. I, [2024-04-19T09:57:35.926880 #1232052] INFO -- : make[2]: Leaving directory '/tmp/ruby/build/trunk' I, [2024-04-19T09:57:35.928687 #1232052] INFO -- : make[1]: Leaving directory '/tmp/ruby/build/trunk' I, [2024-04-19T09:57:35.962271 #1232052] INFO -- : make[1]: Entering directory '/tmp/ruby/build/trunk' I, [2024-04-19T09:57:35.962508 #1232052] INFO -- : make[1]: Nothing to be done for 'note'. I, [2024-04-19T09:57:35.962615 #1232052] INFO -- : make[1]: Leaving directory '/tmp/ruby/build/trunk' E, [2024-04-19T09:57:36.555834 #1232052] ERROR -- : $ /tmp/ruby/build/trunk/miniruby -I/tmp/ruby/src/trunk/lib /tmp/ruby/src/trunk/tool/runruby.rb --archdir=/tmp/ruby/build/trunk --extout=.ext -- /tmp/ruby/src/trunk/spec/mspec/bin/mspec-run -B /tmp/ruby/src/trunk/spec/default.mspec --error-output stderr --debug -fy -o /tmp/rubyspec_temp.20240419-1324987-26re86/1-mspec-multi-0 E, [2024-04-19T09:57:36.556912 #1232052] ERROR -- : $ /tmp/ruby/build/trunk/miniruby -I/tmp/ruby/src/trunk/lib /tmp/ruby/src/trunk/tool/runruby.rb --archdir=/tmp/ruby/build/trunk --extout=.ext -- /tmp/ruby/src/trunk/spec/mspec/bin/mspec-run -B /tmp/ruby/src/trunk/spec/default.mspec --error-output stderr --debug -fy -o /tmp/rubyspec_temp.20240419-1324987-26re86/2-mspec-multi-1 E, [2024-04-19T09:57:36.557922 #1232052] ERROR -- : $ /tmp/ruby/build/trunk/miniruby -I/tmp/ruby/src/trunk/lib /tmp/ruby/src/trunk/tool/runruby.rb --archdir=/tmp/ruby/build/trunk --extout=.ext -- /tmp/ruby/src/trunk/spec/mspec/bin/mspec-run -B /tmp/ruby/src/trunk/spec/default.mspec --error-output stderr --debug -fy -o /tmp/rubyspec_temp.20240419-1324987-26re86/3-mspec-multi-2 E, [2024-04-19T09:57:36.559040 #1232052] ERROR -- : $ /tmp/ruby/build/trunk/miniruby -I/tmp/ruby/src/trunk/lib /tmp/ruby/src/trunk/tool/runruby.rb --archdir=/tmp/ruby/build/trunk --extout=.ext -- /tmp/ruby/src/trunk/spec/mspec/bin/mspec-run -B /tmp/ruby/src/trunk/spec/default.mspec --error-output stderr --debug -fy -o /tmp/rubyspec_temp.20240419-1324987-26re86/4-mspec-multi-3 I, [2024-04-19T09:57:37.516461 #1232052] INFO -- : ruby 3.4.0dev (2024-04-19T07:33:16Z master 7951b349ab) [riscv64-linux] I, [2024-04-19T09:58:08.544274 #1232052] INFO -- : 0 ......................................................................... I, [2024-04-19T09:58:19.096257 #1232052] INFO -- : 73 ......................................................................... I, [2024-04-19T09:58:20.309817 #1232052] INFO -- : 146 ......................................................................... I, [2024-04-19T09:58:22.003612 #1232052] INFO -- : 219 ......................................................................... I, [2024-04-19T09:58:22.722661 #1232052] INFO -- : 292 ......................................................................... I, [2024-04-19T09:58:23.833393 #1232052] INFO -- : 365 ......................................................................... I, [2024-04-19T09:58:24.537802 #1232052] INFO -- : 438 ......................................................................... I, [2024-04-19T09:58:24.855616 #1232052] INFO -- : 511 ......................................................................... I, [2024-04-19T09:58:25.172963 #1232052] INFO -- : 584 ......................................................................... I, [2024-04-19T09:58:28.112902 #1232052] INFO -- : 657 ......................................................................... I, [2024-04-19T09:58:28.582008 #1232052] INFO -- : 730 ......................................................................... I, [2024-04-19T09:58:28.844612 #1232052] INFO -- : 803 ......................................................................... I, [2024-04-19T09:58:29.804220 #1232052] INFO -- : 876 ......................................................................... I, [2024-04-19T09:58:30.411355 #1232052] INFO -- : 949 ......................................................................... I, [2024-04-19T09:58:33.147107 #1232052] INFO -- : 1022 ......................................................................... I, [2024-04-19T09:58:44.235123 #1232052] INFO -- : 1095 ......................................................................... I, [2024-04-19T09:58:49.857230 #1232052] INFO -- : 1168 ......................................................................... I, [2024-04-19T09:58:50.789347 #1232052] INFO -- : 1241 ......................................................................... I, [2024-04-19T09:58:51.682580 #1232052] INFO -- : 1314 ......................................................................... I, [2024-04-19T09:58:52.007298 #1232052] INFO -- : 1387 ......................................................................... I, [2024-04-19T09:58:58.005935 #1232052] INFO -- : 1460 ......................................................................... I, [2024-04-19T09:59:14.667507 #1232052] INFO -- : 1533 ......................................................................... I, [2024-04-19T09:59:16.956621 #1232052] INFO -- : 1606 ......................................................................... I, [2024-04-19T09:59:20.097939 #1232052] INFO -- : 1679 ......................................................................... I, [2024-04-19T09:59:22.305478 #1232052] INFO -- : 1752 ......................................................................... I, [2024-04-19T09:59:24.248888 #1232052] INFO -- : 1825 ......................................................................... I, [2024-04-19T09:59:26.303346 #1232052] INFO -- : 1898 ......................................................................... I, [2024-04-19T09:59:27.986755 #1232052] INFO -- : 1971 ......................................................................... I, [2024-04-19T09:59:29.978597 #1232052] INFO -- : 2044 ......................................................................... I, [2024-04-19T09:59:31.163055 #1232052] INFO -- : 2117 ......................................................................... I, [2024-04-19T09:59:31.708780 #1232052] INFO -- : 2190 ......................................................................... I, [2024-04-19T09:59:31.968506 #1232052] INFO -- : 2263 ......................................................................... I, [2024-04-19T09:59:32.230314 #1232052] INFO -- : 2336 ......................................................................... I, [2024-04-19T09:59:32.779048 #1232052] INFO -- : 2409 ......................................................................... I, [2024-04-19T09:59:33.899337 #1232052] INFO -- : 2482 ......................................................................... I, [2024-04-19T09:59:34.663257 #1232052] INFO -- : 2555 ......................................................................... I, [2024-04-19T09:59:37.664240 #1232052] INFO -- : 2628 ......................................................................... I, [2024-04-19T09:59:39.507288 #1232052] INFO -- : 2701 ......................................................................... I, [2024-04-19T09:59:40.142903 #1232052] INFO -- : 2774 ......................................................................... I, [2024-04-19T09:59:41.463097 #1232052] INFO -- : 2847 ......................................................................... I, [2024-04-19T09:59:42.557542 #1232052] INFO -- : 2920 ......................................................................... I, [2024-04-19T09:59:43.269730 #1232052] INFO -- : 2993 ......................................................................... I, [2024-04-19T09:59:43.702300 #1232052] INFO -- : 3066 ......................................................................... I, [2024-04-19T09:59:43.946674 #1232052] INFO -- : 3139 ......................................................................... I, [2024-04-19T09:59:44.268858 #1232052] INFO -- : 3212 ......................................................................... I, [2024-04-19T09:59:44.721322 #1232052] INFO -- : 3285 ......................................................................... I, [2024-04-19T09:59:50.941558 #1232052] INFO -- : 3358 ........................................................................ I, [2024-04-19T09:59:50.942118 #1232052] INFO -- : I, [2024-04-19T09:59:50.942237 #1232052] INFO -- : Finished in 134.384236 seconds I, [2024-04-19T09:59:50.942332 #1232052] INFO -- : I, [2024-04-19T09:59:50.942433 #1232052] INFO -- : 3429 files, 32607 examples, 136010 expectations, 0 failures, 0 errors, 0 tagged I, [2024-04-19T09:59:50.956324 #1232052] INFO -- : $$$[end] "make yes-test-rubyspec MSPECOPT='--error-output stderr --debug -j' TESTS='-j4'" exit with 0.