# Logfile created on 2024-05-26 10:11:31 +0000 by logger.rb/v1.5.3 I, [2024-05-26T10:11:31.150235 #134367] INFO -- : #, @formatter=nil, @logdev=#, @binmode=false, @mon_data=#, @mon_data_owner_object_id=860>>> I, [2024-05-26T10:11:31.150525 #134367] INFO -- : $$$[beg] make update-unicode -j3 I, [2024-05-26T10:11:31.239744 #134367] INFO -- : Downloading Unicode emoji 15.0 files... I, [2024-05-26T10:11:31.240046 #134367] INFO -- : Downloading Unicode emoji 15.0 files... I, [2024-05-26T10:11:31.240185 #134367] INFO -- : Downloading Unicode emoji 15.0 files... I, [2024-05-26T10:11:31.317489 #134367] INFO -- : made symlink emoji/15.0/emoji-sequences.txt to /home/opc/ruby/src/master/.downloaded-cache/emoji/15.0/emoji-sequences.txt I, [2024-05-26T10:11:31.318109 #134367] INFO -- : downloading emoji/15.0/emoji-test.txt ... /home/opc/ruby/src/master/enc/unicode/data/emoji/15.0/emoji-sequences.txt already exists I, [2024-05-26T10:11:31.323838 #134367] INFO -- : downloading emoji/15.0/emoji-test.txt ... /home/opc/ruby/src/master/enc/unicode/data/emoji/15.0/emoji-sequences.txt already exists E, [2024-05-26T10:11:31.797775 #134367] ERROR -- : /home/opc/ruby/src/master/tool/downloader.rb:302:in `rescue in download': failed to download emoji/15.0/emoji-test.txt (RuntimeError) E, [2024-05-26T10:11:31.797841 #134367] ERROR -- : OpenURI::HTTPError: 403 Forbidden: https://www.unicode.org/Public/emoji/15.0/emoji-test.txt E, [2024-05-26T10:11:31.797851 #134367] ERROR -- : from /home/opc/ruby/src/master/tool/downloader.rb:201:in `download' E, [2024-05-26T10:11:31.797861 #134367] ERROR -- : from /home/opc/ruby/src/master/tool/downloader.rb:136:in `download' E, [2024-05-26T10:11:31.797870 #134367] ERROR -- : from /home/opc/ruby/src/master/tool/downloader.rb:482:in `block in
' E, [2024-05-26T10:11:31.797878 #134367] ERROR -- : from /home/opc/ruby/src/master/tool/downloader.rb:465:in `each' E, [2024-05-26T10:11:31.797886 #134367] ERROR -- : from /home/opc/ruby/src/master/tool/downloader.rb:465:in `
' E, [2024-05-26T10:11:31.797894 #134367] ERROR -- : /usr/local/lib/ruby/3.2.0/open-uri.rb:369:in `open_http': 403 Forbidden (OpenURI::HTTPError) E, [2024-05-26T10:11:31.797902 #134367] ERROR -- : from /usr/local/lib/ruby/3.2.0/open-uri.rb:760:in `buffer_open' E, [2024-05-26T10:11:31.797910 #134367] ERROR -- : from /usr/local/lib/ruby/3.2.0/open-uri.rb:214:in `block in open_loop' E, [2024-05-26T10:11:31.797919 #134367] ERROR -- : from /usr/local/lib/ruby/3.2.0/open-uri.rb:212:in `catch' E, [2024-05-26T10:11:31.797927 #134367] ERROR -- : from /usr/local/lib/ruby/3.2.0/open-uri.rb:212:in `open_loop' E, [2024-05-26T10:11:31.797935 #134367] ERROR -- : from /usr/local/lib/ruby/3.2.0/open-uri.rb:153:in `open_uri' E, [2024-05-26T10:11:31.797943 #134367] ERROR -- : from /usr/local/lib/ruby/3.2.0/open-uri.rb:740:in `open' E, [2024-05-26T10:11:31.797954 #134367] ERROR -- : from /usr/local/lib/ruby/3.2.0/open-uri.rb:748:in `read' E, [2024-05-26T10:11:31.797963 #134367] ERROR -- : from /home/opc/ruby/src/master/tool/downloader.rb:247:in `block in download' E, [2024-05-26T10:11:31.797971 #134367] ERROR -- : from /home/opc/ruby/src/master/tool/downloader.rb:378:in `with_retry' E, [2024-05-26T10:11:31.797979 #134367] ERROR -- : from /home/opc/ruby/src/master/tool/downloader.rb:246:in `download' E, [2024-05-26T10:11:31.797987 #134367] ERROR -- : from /home/opc/ruby/src/master/tool/downloader.rb:136:in `download' E, [2024-05-26T10:11:31.797995 #134367] ERROR -- : from /home/opc/ruby/src/master/tool/downloader.rb:482:in `block in
' E, [2024-05-26T10:11:31.798004 #134367] ERROR -- : from /home/opc/ruby/src/master/tool/downloader.rb:465:in `each' E, [2024-05-26T10:11:31.798012 #134367] ERROR -- : from /home/opc/ruby/src/master/tool/downloader.rb:465:in `
' E, [2024-05-26T10:11:31.800742 #134367] ERROR -- : make: *** [uncommon.mk:1756: /home/opc/ruby/src/master/enc/unicode/data/emoji/15.0/emoji-sequences.txt] Error 1 E, [2024-05-26T10:11:31.800773 #134367] ERROR -- : make: *** Deleting file '/home/opc/ruby/src/master/enc/unicode/data/emoji/15.0/emoji-sequences.txt' E, [2024-05-26T10:11:31.800802 #134367] ERROR -- : make: *** Waiting for unfinished jobs.... E, [2024-05-26T10:11:31.809272 #134367] ERROR -- : /home/opc/ruby/src/master/tool/downloader.rb:302:in `rescue in download': failed to download emoji/15.0/emoji-test.txt (RuntimeError) E, [2024-05-26T10:11:31.809312 #134367] ERROR -- : OpenURI::HTTPError: 403 Forbidden: https://www.unicode.org/Public/emoji/15.0/emoji-test.txt E, [2024-05-26T10:11:31.809324 #134367] ERROR -- : from /home/opc/ruby/src/master/tool/downloader.rb:201:in `download' E, [2024-05-26T10:11:31.809334 #134367] ERROR -- : from /home/opc/ruby/src/master/tool/downloader.rb:136:in `download' E, [2024-05-26T10:11:31.809342 #134367] ERROR -- : from /home/opc/ruby/src/master/tool/downloader.rb:482:in `block in
' E, [2024-05-26T10:11:31.809351 #134367] ERROR -- : from /home/opc/ruby/src/master/tool/downloader.rb:465:in `each' E, [2024-05-26T10:11:31.809359 #134367] ERROR -- : from /home/opc/ruby/src/master/tool/downloader.rb:465:in `
' E, [2024-05-26T10:11:31.809367 #134367] ERROR -- : /usr/local/lib/ruby/3.2.0/open-uri.rb:369:in `open_http': 403 Forbidden (OpenURI::HTTPError) E, [2024-05-26T10:11:31.809375 #134367] ERROR -- : from /usr/local/lib/ruby/3.2.0/open-uri.rb:760:in `buffer_open' E, [2024-05-26T10:11:31.809383 #134367] ERROR -- : from /usr/local/lib/ruby/3.2.0/open-uri.rb:214:in `block in open_loop' E, [2024-05-26T10:11:31.809391 #134367] ERROR -- : from /usr/local/lib/ruby/3.2.0/open-uri.rb:212:in `catch' E, [2024-05-26T10:11:31.809400 #134367] ERROR -- : from /usr/local/lib/ruby/3.2.0/open-uri.rb:212:in `open_loop' E, [2024-05-26T10:11:31.809408 #134367] ERROR -- : from /usr/local/lib/ruby/3.2.0/open-uri.rb:153:in `open_uri' E, [2024-05-26T10:11:31.809416 #134367] ERROR -- : from /usr/local/lib/ruby/3.2.0/open-uri.rb:740:in `open' E, [2024-05-26T10:11:31.809424 #134367] ERROR -- : from /usr/local/lib/ruby/3.2.0/open-uri.rb:748:in `read' E, [2024-05-26T10:11:31.809433 #134367] ERROR -- : from /home/opc/ruby/src/master/tool/downloader.rb:247:in `block in download' E, [2024-05-26T10:11:31.809441 #134367] ERROR -- : from /home/opc/ruby/src/master/tool/downloader.rb:378:in `with_retry' E, [2024-05-26T10:11:31.809449 #134367] ERROR -- : from /home/opc/ruby/src/master/tool/downloader.rb:246:in `download' E, [2024-05-26T10:11:31.809457 #134367] ERROR -- : from /home/opc/ruby/src/master/tool/downloader.rb:136:in `download' E, [2024-05-26T10:11:31.809466 #134367] ERROR -- : from /home/opc/ruby/src/master/tool/downloader.rb:482:in `block in
' E, [2024-05-26T10:11:31.809474 #134367] ERROR -- : from /home/opc/ruby/src/master/tool/downloader.rb:465:in `each' E, [2024-05-26T10:11:31.809482 #134367] ERROR -- : from /home/opc/ruby/src/master/tool/downloader.rb:465:in `
' E, [2024-05-26T10:11:31.812254 #134367] ERROR -- : make: *** [uncommon.mk:1756: /home/opc/ruby/src/master/enc/unicode/data/emoji/15.0/emoji-test.txt] Error 1 E, [2024-05-26T10:11:31.845116 #134367] ERROR -- : /home/opc/ruby/src/master/tool/downloader.rb:302:in `rescue in download': failed to download emoji/15.0/emoji-test.txt (RuntimeError) E, [2024-05-26T10:11:31.845196 #134367] ERROR -- : OpenURI::HTTPError: 403 Forbidden: https://www.unicode.org/Public/emoji/15.0/emoji-test.txt E, [2024-05-26T10:11:31.845206 #134367] ERROR -- : from /home/opc/ruby/src/master/tool/downloader.rb:201:in `download' E, [2024-05-26T10:11:31.845216 #134367] ERROR -- : from /home/opc/ruby/src/master/tool/downloader.rb:136:in `download' E, [2024-05-26T10:11:31.845225 #134367] ERROR -- : from /home/opc/ruby/src/master/tool/downloader.rb:482:in `block in
' E, [2024-05-26T10:11:31.845233 #134367] ERROR -- : from /home/opc/ruby/src/master/tool/downloader.rb:465:in `each' E, [2024-05-26T10:11:31.845241 #134367] ERROR -- : from /home/opc/ruby/src/master/tool/downloader.rb:465:in `
' E, [2024-05-26T10:11:31.845249 #134367] ERROR -- : /usr/local/lib/ruby/3.2.0/open-uri.rb:369:in `open_http': 403 Forbidden (OpenURI::HTTPError) E, [2024-05-26T10:11:31.845257 #134367] ERROR -- : from /usr/local/lib/ruby/3.2.0/open-uri.rb:760:in `buffer_open' E, [2024-05-26T10:11:31.845265 #134367] ERROR -- : from /usr/local/lib/ruby/3.2.0/open-uri.rb:214:in `block in open_loop' E, [2024-05-26T10:11:31.845273 #134367] ERROR -- : from /usr/local/lib/ruby/3.2.0/open-uri.rb:212:in `catch' E, [2024-05-26T10:11:31.845281 #134367] ERROR -- : from /usr/local/lib/ruby/3.2.0/open-uri.rb:212:in `open_loop' E, [2024-05-26T10:11:31.845289 #134367] ERROR -- : from /usr/local/lib/ruby/3.2.0/open-uri.rb:153:in `open_uri' E, [2024-05-26T10:11:31.845297 #134367] ERROR -- : from /usr/local/lib/ruby/3.2.0/open-uri.rb:740:in `open' E, [2024-05-26T10:11:31.845306 #134367] ERROR -- : from /usr/local/lib/ruby/3.2.0/open-uri.rb:748:in `read' E, [2024-05-26T10:11:31.845314 #134367] ERROR -- : from /home/opc/ruby/src/master/tool/downloader.rb:247:in `block in download' E, [2024-05-26T10:11:31.845322 #134367] ERROR -- : from /home/opc/ruby/src/master/tool/downloader.rb:378:in `with_retry' E, [2024-05-26T10:11:31.845330 #134367] ERROR -- : from /home/opc/ruby/src/master/tool/downloader.rb:246:in `download' E, [2024-05-26T10:11:31.845338 #134367] ERROR -- : from /home/opc/ruby/src/master/tool/downloader.rb:136:in `download' E, [2024-05-26T10:11:31.845346 #134367] ERROR -- : from /home/opc/ruby/src/master/tool/downloader.rb:482:in `block in
' E, [2024-05-26T10:11:31.845354 #134367] ERROR -- : from /home/opc/ruby/src/master/tool/downloader.rb:465:in `each' E, [2024-05-26T10:11:31.845362 #134367] ERROR -- : from /home/opc/ruby/src/master/tool/downloader.rb:465:in `
' E, [2024-05-26T10:11:31.848090 #134367] ERROR -- : make: *** [uncommon.mk:1756: /home/opc/ruby/src/master/enc/unicode/data/emoji/15.0/emoji-zwj-sequences.txt] Error 1 I, [2024-05-26T10:11:31.848149 #134367] INFO -- : downloading emoji/15.0/emoji-test.txt ... I, [2024-05-26T10:11:31.848298 #134367] INFO -- : $$$[end] "make update-unicode -j3" exit with 512. I, [2024-05-26T10:11:31.848345 #134367] INFO -- : $$$[beg] make update-download -j3 I, [2024-05-26T10:11:32.012958 #134367] INFO -- : tool/config.guess already exists I, [2024-05-26T10:11:32.013028 #134367] INFO -- : tool/config.sub already exists I, [2024-05-26T10:11:32.015785 #134367] INFO -- : Update power_assert to 84e85124c5014a139af39161d484156cfe87a9ed I, [2024-05-26T10:11:32.015921 #134367] INFO -- : Update rbs to ba7872795d5de04adb8ff500c0e6afdc81a041dd I, [2024-05-26T10:11:32.016174 #134367] INFO -- : Update typeprof to b19a6416da3a05d57fadd6ffdadb382b6d236ca5 I, [2024-05-26T10:11:32.019254 #134367] INFO -- : echo b19a6416da3a05d57fadd6ffdadb382b6d236ca5 | /bin/sh /home/opc/ruby/src/master/tool/ifchange /home/opc/ruby/src/master/.bundle/.timestamp/typeprof.revision - I, [2024-05-26T10:11:32.019428 #134367] INFO -- : echo ba7872795d5de04adb8ff500c0e6afdc81a041dd | /bin/sh /home/opc/ruby/src/master/tool/ifchange /home/opc/ruby/src/master/.bundle/.timestamp/rbs.revision - I, [2024-05-26T10:11:32.019596 #134367] INFO -- : echo 84e85124c5014a139af39161d484156cfe87a9ed | /bin/sh /home/opc/ruby/src/master/tool/ifchange /home/opc/ruby/src/master/.bundle/.timestamp/power_assert.revision - I, [2024-05-26T10:11:32.024513 #134367] INFO -- : /home/opc/ruby/src/master/.bundle/.timestamp/typeprof.revision unchanged I, [2024-05-26T10:11:32.024836 #134367] INFO -- : /home/opc/ruby/src/master/.bundle/.timestamp/power_assert.revision unchanged I, [2024-05-26T10:11:32.025494 #134367] INFO -- : /home/opc/ruby/src/master/.bundle/.timestamp/rbs.revision unchanged I, [2024-05-26T10:11:32.114458 #134367] INFO -- : Building power_assert@84e85124c5014a139af39161d484156cfe87a9ed to /home/opc/ruby/src/master/gems/power_assert-2.0.3.gem I, [2024-05-26T10:11:32.224338 #134367] INFO -- : Successfully built RubyGem I, [2024-05-26T10:11:32.224392 #134367] INFO -- : Name: power_assert I, [2024-05-26T10:11:32.224402 #134367] INFO -- : Version: 2.0.4dev I, [2024-05-26T10:11:32.224411 #134367] INFO -- : File: power_assert-2.0.4dev.gem I, [2024-05-26T10:11:32.305628 #134367] INFO -- : $$$[end] "make update-download -j3" exit with 0. I, [2024-05-26T10:11:32.305699 #134367] INFO -- : $$$[beg] make update-rubyspec -j3 I, [2024-05-26T10:11:32.394754 #134367] INFO -- : make: Nothing to be done for 'update-rubyspec'. I, [2024-05-26T10:11:32.394887 #134367] INFO -- : $$$[end] "make update-rubyspec -j3" exit with 0. I, [2024-05-26T10:11:32.394913 #134367] INFO -- : $$$[beg] make update-src -j3 E, [2024-05-26T10:11:33.727263 #134367] ERROR -- : From https://github.com/ruby/ruby E, [2024-05-26T10:11:33.727325 #134367] ERROR -- : 508f331..0f9e50b master -> origin/master I, [2024-05-26T10:11:33.755900 #134367] INFO -- : Updating 508f331..0f9e50b I, [2024-05-26T10:11:33.755966 #134367] INFO -- : Fast-forward I, [2024-05-26T10:11:33.758252 #134367] INFO -- : template/Makefile.in | 5 ++--- I, [2024-05-26T10:11:33.758276 #134367] INFO -- : 1 file changed, 2 insertions(+), 3 deletions(-) I, [2024-05-26T10:11:33.772693 #134367] INFO -- : Latest commit hash = 0f9e50b8c5 I, [2024-05-26T10:11:33.773309 #134367] INFO -- : $$$[end] "make update-src -j3" exit with 0. I, [2024-05-26T10:11:33.773345 #134367] INFO -- : $$$[beg] make after-update -j3 I, [2024-05-26T10:11:33.863741 #134367] INFO -- : MAKE=make /bin/sh ./config.status Makefile I, [2024-05-26T10:11:33.903228 #134367] INFO -- : config.status: creating Makefile I, [2024-05-26T10:11:34.068891 #134367] INFO -- : generating /home/opc/ruby/src/master/ext/ripper/eventids2table.c I, [2024-05-26T10:11:34.075684 #134367] INFO -- : make[1]: Entering directory '/home/opc/ruby/src/master/ext/ripper' I, [2024-05-26T10:11:34.075727 #134367] INFO -- : make[1]: Nothing to be done for 'src'. I, [2024-05-26T10:11:34.075738 #134367] INFO -- : make[1]: Leaving directory '/home/opc/ruby/src/master/ext/ripper' I, [2024-05-26T10:11:34.102605 #134367] INFO -- : /home/opc/ruby/src/master/revision.h updated I, [2024-05-26T10:11:34.103765 #134367] INFO -- : generating aarch64-linux-fake.rb I, [2024-05-26T10:11:34.161692 #134367] INFO -- : aarch64-linux-fake.rb updated I, [2024-05-26T10:11:34.162856 #134367] INFO -- : generating enc.mk I, [2024-05-26T10:11:34.393818 #134367] INFO -- : making srcs under enc I, [2024-05-26T10:11:34.435468 #134367] INFO -- : make[1]: Entering directory '/home/opc/ruby/build/master' I, [2024-05-26T10:11:34.435546 #134367] INFO -- : make[1]: Nothing to be done for 'srcs'. I, [2024-05-26T10:11:34.435566 #134367] INFO -- : make[1]: Leaving directory '/home/opc/ruby/build/master' I, [2024-05-26T10:11:34.515200 #134367] INFO -- : Update power_assert to 84e85124c5014a139af39161d484156cfe87a9ed I, [2024-05-26T10:11:34.515525 #134367] INFO -- : Update rbs to ba7872795d5de04adb8ff500c0e6afdc81a041dd I, [2024-05-26T10:11:34.516238 #134367] INFO -- : Update typeprof to b19a6416da3a05d57fadd6ffdadb382b6d236ca5 I, [2024-05-26T10:11:34.519122 #134367] INFO -- : echo 84e85124c5014a139af39161d484156cfe87a9ed | /bin/sh /home/opc/ruby/src/master/tool/ifchange /home/opc/ruby/src/master/.bundle/.timestamp/power_assert.revision - I, [2024-05-26T10:11:34.519260 #134367] INFO -- : echo ba7872795d5de04adb8ff500c0e6afdc81a041dd | /bin/sh /home/opc/ruby/src/master/tool/ifchange /home/opc/ruby/src/master/.bundle/.timestamp/rbs.revision - I, [2024-05-26T10:11:34.519456 #134367] INFO -- : echo b19a6416da3a05d57fadd6ffdadb382b6d236ca5 | /bin/sh /home/opc/ruby/src/master/tool/ifchange /home/opc/ruby/src/master/.bundle/.timestamp/typeprof.revision - I, [2024-05-26T10:11:34.525288 #134367] INFO -- : /home/opc/ruby/src/master/.bundle/.timestamp/rbs.revision unchanged I, [2024-05-26T10:11:34.526422 #134367] INFO -- : /home/opc/ruby/src/master/.bundle/.timestamp/typeprof.revision unchanged I, [2024-05-26T10:11:34.526463 #134367] INFO -- : /home/opc/ruby/src/master/.bundle/.timestamp/power_assert.revision unchanged I, [2024-05-26T10:11:34.618053 #134367] INFO -- : Building power_assert@84e85124c5014a139af39161d484156cfe87a9ed to /home/opc/ruby/src/master/gems/power_assert-2.0.3.gem I, [2024-05-26T10:11:34.728095 #134367] INFO -- : Successfully built RubyGem I, [2024-05-26T10:11:34.728152 #134367] INFO -- : Name: power_assert I, [2024-05-26T10:11:34.728163 #134367] INFO -- : Version: 2.0.4dev I, [2024-05-26T10:11:34.728172 #134367] INFO -- : File: power_assert-2.0.4dev.gem I, [2024-05-26T10:11:34.730460 #134367] INFO -- : Extracting bundle gem power_assert-2.0.3... I, [2024-05-26T10:11:34.825937 #134367] INFO -- : Try with hash version of bundled gems instead of gems/power_assert-2.0.3.gem. We don't use this gem with release version of Ruby. I, [2024-05-26T10:11:34.835854 #134367] INFO -- : Unpacked gems/power_assert-2.0.4dev.gem I, [2024-05-26T10:11:34.837790 #134367] INFO -- : $$$[end] "make after-update -j3" exit with 0. I, [2024-05-26T10:11:34.837935 #134367] INFO -- : $$$[beg] make miniruby -j3 I, [2024-05-26T10:11:34.925247 #134367] INFO -- : BASERUBY = /usr/local/bin/ruby --disable=gems I, [2024-05-26T10:11:34.925311 #134367] INFO -- : CC = gcc I, [2024-05-26T10:11:34.925322 #134367] INFO -- : LD = ld I, [2024-05-26T10:11:34.925331 #134367] INFO -- : LDSHARED = gcc -shared I, [2024-05-26T10:11:34.925342 #134367] INFO -- : CFLAGS = -O3 -fno-fast-math -ggdb3 -Wall -Wextra -Wdeprecated-declarations -Wdiv-by-zero -Wduplicated-cond -Wimplicit-function-declaration -Wimplicit-int -Wpointer-arith -Wwrite-strings -Wold-style-definition -Wimplicit-fallthrough=0 -Wmissing-noreturn -Wno-cast-function-type -Wno-constant-logical-operand -Wno-long-long -Wno-missing-field-initializers -Wno-overlength-strings -Wno-packed-bitfield-compat -Wno-parentheses-equality -Wno-self-assign -Wno-tautological-compare -Wno-unused-parameter -Wno-unused-value -Wsuggest-attribute=format -Wsuggest-attribute=noreturn -Wunused-variable -Wmisleading-indentation -Wundef I, [2024-05-26T10:11:34.925351 #134367] INFO -- : XCFLAGS = -U_FORTIFY_SOURCE -D_FORTIFY_SOURCE=2 -fstack-protector-strong -msign-return-address=all -fno-strict-overflow -fvisibility=hidden -fexcess-precision=standard -DRUBY_EXPORT -fPIE -I. -I.ext/include/aarch64-linux -I/home/opc/ruby/src/master/include -I/home/opc/ruby/src/master -I/home/opc/ruby/src/master/prism -I/home/opc/ruby/src/master/enc/unicode/15.0.0 I, [2024-05-26T10:11:34.925360 #134367] INFO -- : CPPFLAGS = I, [2024-05-26T10:11:34.925368 #134367] INFO -- : DLDFLAGS = -Wl,--compress-debug-sections=zlib -fstack-protector-strong -pie I, [2024-05-26T10:11:34.925377 #134367] INFO -- : SOLIBS = -lz -lrt -lrt -ldl -lcrypt -lm -lpthread I, [2024-05-26T10:11:34.925385 #134367] INFO -- : LANG = en_US.UTF-8 I, [2024-05-26T10:11:34.925393 #134367] INFO -- : LC_ALL = I, [2024-05-26T10:11:34.925401 #134367] INFO -- : LC_CTYPE = I, [2024-05-26T10:11:34.925409 #134367] INFO -- : MFLAGS = -j3 --jobserver-auth=4,5 I, [2024-05-26T10:11:34.925417 #134367] INFO -- : RUSTC = rustc I, [2024-05-26T10:11:34.925428 #134367] INFO -- : YJIT_RUSTC_ARGS = --crate-name=yjit --crate-type=staticlib --edition=2021 -g -C lto=thin -C opt-level=3 -C overflow-checks=on '--out-dir=/home/opc/ruby/build/master/yjit/target/release/' /home/opc/ruby/src/master/yjit/src/lib.rs I, [2024-05-26T10:11:34.926114 #134367] INFO -- : gcc (GCC) 8.5.0 20210514 (Red Hat 8.5.0-10.1.0.1) I, [2024-05-26T10:11:34.926147 #134367] INFO -- : Copyright (C) 2018 Free Software Foundation, Inc. I, [2024-05-26T10:11:34.926158 #134367] INFO -- : This is free software; see the source for copying conditions. There is NO I, [2024-05-26T10:11:34.926167 #134367] INFO -- : warranty; not even for MERCHANTABILITY or FITNESS FOR A PARTICULAR PURPOSE. I, [2024-05-26T10:11:34.926176 #134367] INFO -- : I, [2024-05-26T10:11:34.951072 #134367] INFO -- : compiling /home/opc/ruby/src/master/version.c I, [2024-05-26T10:11:35.092915 #134367] INFO -- : linking miniruby I, [2024-05-26T10:11:35.978768 #134367] INFO -- : $$$[end] "make miniruby -j3" exit with 0. I, [2024-05-26T10:11:35.978956 #134367] INFO -- : $$$[beg] make ruby -j3 I, [2024-05-26T10:11:36.066841 #134367] INFO -- : BASERUBY = /usr/local/bin/ruby --disable=gems I, [2024-05-26T10:11:36.066908 #134367] INFO -- : CC = gcc I, [2024-05-26T10:11:36.066920 #134367] INFO -- : LD = ld I, [2024-05-26T10:11:36.066932 #134367] INFO -- : LDSHARED = gcc -shared I, [2024-05-26T10:11:36.066941 #134367] INFO -- : CFLAGS = -O3 -fno-fast-math -ggdb3 -Wall -Wextra -Wdeprecated-declarations -Wdiv-by-zero -Wduplicated-cond -Wimplicit-function-declaration -Wimplicit-int -Wpointer-arith -Wwrite-strings -Wold-style-definition -Wimplicit-fallthrough=0 -Wmissing-noreturn -Wno-cast-function-type -Wno-constant-logical-operand -Wno-long-long -Wno-missing-field-initializers -Wno-overlength-strings -Wno-packed-bitfield-compat -Wno-parentheses-equality -Wno-self-assign -Wno-tautological-compare -Wno-unused-parameter -Wno-unused-value -Wsuggest-attribute=format -Wsuggest-attribute=noreturn -Wunused-variable -Wmisleading-indentation -Wundef I, [2024-05-26T10:11:36.066951 #134367] INFO -- : XCFLAGS = -U_FORTIFY_SOURCE -D_FORTIFY_SOURCE=2 -fstack-protector-strong -msign-return-address=all -fno-strict-overflow -fvisibility=hidden -fexcess-precision=standard -DRUBY_EXPORT -fPIE -I. -I.ext/include/aarch64-linux -I/home/opc/ruby/src/master/include -I/home/opc/ruby/src/master -I/home/opc/ruby/src/master/prism -I/home/opc/ruby/src/master/enc/unicode/15.0.0 I, [2024-05-26T10:11:36.066960 #134367] INFO -- : CPPFLAGS = I, [2024-05-26T10:11:36.066968 #134367] INFO -- : DLDFLAGS = -Wl,--compress-debug-sections=zlib -fstack-protector-strong -pie I, [2024-05-26T10:11:36.066977 #134367] INFO -- : SOLIBS = -lz -lrt -lrt -ldl -lcrypt -lm -lpthread I, [2024-05-26T10:11:36.066985 #134367] INFO -- : LANG = en_US.UTF-8 I, [2024-05-26T10:11:36.066993 #134367] INFO -- : LC_ALL = I, [2024-05-26T10:11:36.067001 #134367] INFO -- : LC_CTYPE = I, [2024-05-26T10:11:36.067009 #134367] INFO -- : MFLAGS = -j3 --jobserver-auth=4,5 I, [2024-05-26T10:11:36.067017 #134367] INFO -- : RUSTC = rustc I, [2024-05-26T10:11:36.067026 #134367] INFO -- : YJIT_RUSTC_ARGS = --crate-name=yjit --crate-type=staticlib --edition=2021 -g -C lto=thin -C opt-level=3 -C overflow-checks=on '--out-dir=/home/opc/ruby/build/master/yjit/target/release/' /home/opc/ruby/src/master/yjit/src/lib.rs I, [2024-05-26T10:11:36.067827 #134367] INFO -- : gcc (GCC) 8.5.0 20210514 (Red Hat 8.5.0-10.1.0.1) I, [2024-05-26T10:11:36.067862 #134367] INFO -- : Copyright (C) 2018 Free Software Foundation, Inc. I, [2024-05-26T10:11:36.067873 #134367] INFO -- : This is free software; see the source for copying conditions. There is NO I, [2024-05-26T10:11:36.067882 #134367] INFO -- : warranty; not even for MERCHANTABILITY or FITNESS FOR A PARTICULAR PURPOSE. I, [2024-05-26T10:11:36.067891 #134367] INFO -- : I, [2024-05-26T10:11:36.250349 #134367] INFO -- : builtin_binary.inc updated I, [2024-05-26T10:11:36.253690 #134367] INFO -- : c86294a81d0df6836359a6b5498b71b1ddba3062aa6ec87c7b2896368a948a19 builtin_binary.inc I, [2024-05-26T10:11:36.254582 #134367] INFO -- : compiling /home/opc/ruby/src/master/builtin.c I, [2024-05-26T10:11:36.586585 #134367] INFO -- : linking static-library libruby-static.a I, [2024-05-26T10:11:39.519825 #134367] INFO -- : linking ruby I, [2024-05-26T10:11:40.431130 #134367] INFO -- : $$$[end] "make ruby -j3" exit with 0. I, [2024-05-26T10:11:40.431297 #134367] INFO -- : $$$[beg] make all -j3 I, [2024-05-26T10:11:40.521364 #134367] INFO -- : BASERUBY = /usr/local/bin/ruby --disable=gems I, [2024-05-26T10:11:40.521435 #134367] INFO -- : CC = gcc I, [2024-05-26T10:11:40.521446 #134367] INFO -- : LD = ld I, [2024-05-26T10:11:40.521455 #134367] INFO -- : LDSHARED = gcc -shared I, [2024-05-26T10:11:40.521466 #134367] INFO -- : CFLAGS = -O3 -fno-fast-math -ggdb3 -Wall -Wextra -Wdeprecated-declarations -Wdiv-by-zero -Wduplicated-cond -Wimplicit-function-declaration -Wimplicit-int -Wpointer-arith -Wwrite-strings -Wold-style-definition -Wimplicit-fallthrough=0 -Wmissing-noreturn -Wno-cast-function-type -Wno-constant-logical-operand -Wno-long-long -Wno-missing-field-initializers -Wno-overlength-strings -Wno-packed-bitfield-compat -Wno-parentheses-equality -Wno-self-assign -Wno-tautological-compare -Wno-unused-parameter -Wno-unused-value -Wsuggest-attribute=format -Wsuggest-attribute=noreturn -Wunused-variable -Wmisleading-indentation -Wundef I, [2024-05-26T10:11:40.521475 #134367] INFO -- : XCFLAGS = -U_FORTIFY_SOURCE -D_FORTIFY_SOURCE=2 -fstack-protector-strong -msign-return-address=all -fno-strict-overflow -fvisibility=hidden -fexcess-precision=standard -DRUBY_EXPORT -fPIE -I. -I.ext/include/aarch64-linux -I/home/opc/ruby/src/master/include -I/home/opc/ruby/src/master -I/home/opc/ruby/src/master/prism -I/home/opc/ruby/src/master/enc/unicode/15.0.0 I, [2024-05-26T10:11:40.521484 #134367] INFO -- : CPPFLAGS = I, [2024-05-26T10:11:40.521492 #134367] INFO -- : DLDFLAGS = -Wl,--compress-debug-sections=zlib -fstack-protector-strong -pie I, [2024-05-26T10:11:40.521501 #134367] INFO -- : SOLIBS = -lz -lrt -lrt -ldl -lcrypt -lm -lpthread I, [2024-05-26T10:11:40.521509 #134367] INFO -- : LANG = en_US.UTF-8 I, [2024-05-26T10:11:40.521517 #134367] INFO -- : LC_ALL = I, [2024-05-26T10:11:40.521525 #134367] INFO -- : LC_CTYPE = I, [2024-05-26T10:11:40.521533 #134367] INFO -- : MFLAGS = -j3 --jobserver-auth=4,5 I, [2024-05-26T10:11:40.521541 #134367] INFO -- : RUSTC = rustc I, [2024-05-26T10:11:40.521549 #134367] INFO -- : YJIT_RUSTC_ARGS = --crate-name=yjit --crate-type=staticlib --edition=2021 -g -C lto=thin -C opt-level=3 -C overflow-checks=on '--out-dir=/home/opc/ruby/build/master/yjit/target/release/' /home/opc/ruby/src/master/yjit/src/lib.rs I, [2024-05-26T10:11:40.522312 #134367] INFO -- : gcc (GCC) 8.5.0 20210514 (Red Hat 8.5.0-10.1.0.1) I, [2024-05-26T10:11:40.522351 #134367] INFO -- : Copyright (C) 2018 Free Software Foundation, Inc. I, [2024-05-26T10:11:40.522361 #134367] INFO -- : This is free software; see the source for copying conditions. There is NO I, [2024-05-26T10:11:40.522370 #134367] INFO -- : warranty; not even for MERCHANTABILITY or FITNESS FOR A PARTICULAR PURPOSE. I, [2024-05-26T10:11:40.522379 #134367] INFO -- : I, [2024-05-26T10:11:40.555042 #134367] INFO -- : generating encdb.h I, [2024-05-26T10:11:40.556335 #134367] INFO -- : generating enc.mk I, [2024-05-26T10:11:40.594724 #134367] INFO -- : encdb.h unchanged I, [2024-05-26T10:11:40.794925 #134367] INFO -- : making srcs under enc I, [2024-05-26T10:11:40.795123 #134367] INFO -- : making enc I, [2024-05-26T10:11:40.822347 #134367] INFO -- : make[1]: Entering directory '/home/opc/ruby/build/master' I, [2024-05-26T10:11:40.822424 #134367] INFO -- : make[1]: Nothing to be done for 'enc'. I, [2024-05-26T10:11:40.822434 #134367] INFO -- : make[1]: Leaving directory '/home/opc/ruby/build/master' I, [2024-05-26T10:11:40.837000 #134367] INFO -- : make[1]: Entering directory '/home/opc/ruby/build/master' I, [2024-05-26T10:11:40.837063 #134367] INFO -- : make[1]: Nothing to be done for 'srcs'. I, [2024-05-26T10:11:40.837074 #134367] INFO -- : make[1]: Leaving directory '/home/opc/ruby/build/master' I, [2024-05-26T10:11:40.837902 #134367] INFO -- : generating transdb.h I, [2024-05-26T10:11:40.982252 #134367] INFO -- : transdb.h unchanged I, [2024-05-26T10:11:40.983600 #134367] INFO -- : generating makefiles ext/configure-ext.mk I, [2024-05-26T10:11:40.983717 #134367] INFO -- : making trans I, [2024-05-26T10:11:41.023806 #134367] INFO -- : ext/configure-ext.mk updated I, [2024-05-26T10:11:41.026854 #134367] INFO -- : make[1]: Entering directory '/home/opc/ruby/build/master' I, [2024-05-26T10:11:41.033217 #134367] INFO -- : make[1]: Entering directory '/home/opc/ruby/build/master' I, [2024-05-26T10:11:41.033268 #134367] INFO -- : make[1]: Nothing to be done for 'trans'. I, [2024-05-26T10:11:41.033279 #134367] INFO -- : make[1]: Leaving directory '/home/opc/ruby/build/master' I, [2024-05-26T10:11:41.750182 #134367] INFO -- : making encs I, [2024-05-26T10:11:41.797906 #134367] INFO -- : make[1]: Leaving directory '/home/opc/ruby/build/master' I, [2024-05-26T10:11:41.798577 #134367] INFO -- : generating makefile exts.mk I, [2024-05-26T10:11:41.803038 #134367] INFO -- : make[1]: Entering directory '/home/opc/ruby/build/master' I, [2024-05-26T10:11:41.803070 #134367] INFO -- : make[1]: Nothing to be done for 'encs'. I, [2024-05-26T10:11:41.803081 #134367] INFO -- : make[1]: Leaving directory '/home/opc/ruby/build/master' I, [2024-05-26T10:11:41.857621 #134367] INFO -- : exts.mk unchanged I, [2024-05-26T10:11:41.862458 #134367] INFO -- : make[1]: Entering directory '/home/opc/ruby/build/master' I, [2024-05-26T10:11:41.967157 #134367] INFO -- : make[2]: Entering directory '/home/opc/ruby/build/master/ext/coverage' I, [2024-05-26T10:11:41.970122 #134367] INFO -- : make[2]: Entering directory '/home/opc/ruby/build/master/ext/digest' I, [2024-05-26T10:11:41.970866 #134367] INFO -- : make[2]: Entering directory '/home/opc/ruby/build/master/ext/date' I, [2024-05-26T10:11:41.971857 #134367] INFO -- : make[2]: Leaving directory '/home/opc/ruby/build/master/ext/coverage' I, [2024-05-26T10:11:41.976172 #134367] INFO -- : make[2]: Leaving directory '/home/opc/ruby/build/master/ext/date' I, [2024-05-26T10:11:41.979319 #134367] INFO -- : make[2]: Leaving directory '/home/opc/ruby/build/master/ext/digest' I, [2024-05-26T10:11:41.983732 #134367] INFO -- : make[2]: Entering directory '/home/opc/ruby/build/master/ext/io/console' I, [2024-05-26T10:11:41.986673 #134367] INFO -- : make[2]: Entering directory '/home/opc/ruby/build/master/ext/fiddle' I, [2024-05-26T10:11:41.989190 #134367] INFO -- : make[2]: Leaving directory '/home/opc/ruby/build/master/ext/io/console' I, [2024-05-26T10:11:41.991246 #134367] INFO -- : make[2]: Entering directory '/home/opc/ruby/build/master/ext/json' I, [2024-05-26T10:11:41.993857 #134367] INFO -- : make[2]: Entering directory '/home/opc/ruby/build/master/ext/monitor' I, [2024-05-26T10:11:41.997992 #134367] INFO -- : make[2]: Leaving directory '/home/opc/ruby/build/master/ext/monitor' I, [2024-05-26T10:11:42.000524 #134367] INFO -- : make[2]: Leaving directory '/home/opc/ruby/build/master/ext/fiddle' I, [2024-05-26T10:11:42.000661 #134367] INFO -- : make[2]: Leaving directory '/home/opc/ruby/build/master/ext/json' I, [2024-05-26T10:11:42.003850 #134367] INFO -- : make[2]: Entering directory '/home/opc/ruby/build/master/ext/objspace' I, [2024-05-26T10:11:42.004601 #134367] INFO -- : make[2]: Entering directory '/home/opc/ruby/build/master/ext/pathname' I, [2024-05-26T10:11:42.009974 #134367] INFO -- : make[2]: Leaving directory '/home/opc/ruby/build/master/ext/objspace' I, [2024-05-26T10:11:42.012406 #134367] INFO -- : make[2]: Leaving directory '/home/opc/ruby/build/master/ext/pathname' I, [2024-05-26T10:11:42.016183 #134367] INFO -- : make[2]: Entering directory '/home/opc/ruby/build/master/ext/psych' I, [2024-05-26T10:11:42.016617 #134367] INFO -- : make[2]: Entering directory '/home/opc/ruby/build/master/ext/pty' I, [2024-05-26T10:11:42.021454 #134367] INFO -- : make[2]: Entering directory '/home/opc/ruby/build/master/ext/openssl' I, [2024-05-26T10:11:42.023689 #134367] INFO -- : make[2]: Leaving directory '/home/opc/ruby/build/master/ext/pty' I, [2024-05-26T10:11:42.035547 #134367] INFO -- : make[2]: Leaving directory '/home/opc/ruby/build/master/ext/psych' I, [2024-05-26T10:11:42.037560 #134367] INFO -- : make[2]: Entering directory '/home/opc/ruby/build/master/ext/rubyvm' I, [2024-05-26T10:11:42.038778 #134367] INFO -- : make[2]: Entering directory '/home/opc/ruby/build/master/ext/ripper' I, [2024-05-26T10:11:42.043089 #134367] INFO -- : make[2]: Leaving directory '/home/opc/ruby/build/master/ext/openssl' I, [2024-05-26T10:11:42.044612 #134367] INFO -- : make[2]: Leaving directory '/home/opc/ruby/build/master/ext/rubyvm' I, [2024-05-26T10:11:42.046440 #134367] INFO -- : make[2]: Leaving directory '/home/opc/ruby/build/master/ext/ripper' I, [2024-05-26T10:11:42.052864 #134367] INFO -- : make[2]: Entering directory '/home/opc/ruby/build/master/.bundle/gems/bigdecimal-3.1.7/ext/bigdecimal' I, [2024-05-26T10:11:42.055347 #134367] INFO -- : make[2]: Entering directory '/home/opc/ruby/build/master/ext/socket' I, [2024-05-26T10:11:42.055982 #134367] INFO -- : make[2]: Entering directory '/home/opc/ruby/build/master/.bundle/gems/bigdecimal-3.1.8/ext/bigdecimal' I, [2024-05-26T10:11:42.066325 #134367] INFO -- : make[2]: Leaving directory '/home/opc/ruby/build/master/ext/socket' I, [2024-05-26T10:11:42.068693 #134367] INFO -- : make[2]: Entering directory '/home/opc/ruby/build/master/.bundle/gems/debug-1.9.2/ext/debug' I, [2024-05-26T10:11:42.083880 #134367] INFO -- : make[2]: Leaving directory '/home/opc/ruby/build/master/.bundle/gems/bigdecimal-3.1.7/ext/bigdecimal' I, [2024-05-26T10:11:42.088246 #134367] INFO -- : make[2]: Leaving directory '/home/opc/ruby/build/master/.bundle/gems/bigdecimal-3.1.8/ext/bigdecimal' I, [2024-05-26T10:11:42.088536 #134367] INFO -- : make[2]: Entering directory '/home/opc/ruby/build/master/.bundle/gems/nkf-0.2.0/ext/nkf' I, [2024-05-26T10:11:42.091441 #134367] INFO -- : make[2]: Entering directory '/home/opc/ruby/build/master/.bundle/gems/racc-1.7.3/ext/racc/cparse' I, [2024-05-26T10:11:42.100406 #134367] INFO -- : make[2]: Leaving directory '/home/opc/ruby/build/master/.bundle/gems/debug-1.9.2/ext/debug' I, [2024-05-26T10:11:42.103890 #134367] INFO -- : make[2]: Entering directory '/home/opc/ruby/build/master/.bundle/gems/racc-1.8.0/ext/racc/cparse' I, [2024-05-26T10:11:42.119471 #134367] INFO -- : make[2]: Leaving directory '/home/opc/ruby/build/master/.bundle/gems/nkf-0.2.0/ext/nkf' I, [2024-05-26T10:11:42.122598 #134367] INFO -- : make[2]: Leaving directory '/home/opc/ruby/build/master/.bundle/gems/racc-1.7.3/ext/racc/cparse' I, [2024-05-26T10:11:42.124824 #134367] INFO -- : make[2]: Entering directory '/home/opc/ruby/build/master/.bundle/gems/syslog-0.1.2/ext/syslog' I, [2024-05-26T10:11:42.125199 #134367] INFO -- : make[2]: Entering directory '/home/opc/ruby/build/master/.bundle/gems/rbs-3.4.4/ext/rbs_extension' I, [2024-05-26T10:11:42.135855 #134367] INFO -- : make[2]: Leaving directory '/home/opc/ruby/build/master/.bundle/gems/racc-1.8.0/ext/racc/cparse' I, [2024-05-26T10:11:42.155637 #134367] INFO -- : make[2]: Leaving directory '/home/opc/ruby/build/master/.bundle/gems/syslog-0.1.2/ext/syslog' I, [2024-05-26T10:11:42.157737 #134367] INFO -- : make[2]: Leaving directory '/home/opc/ruby/build/master/.bundle/gems/rbs-3.4.4/ext/rbs_extension' I, [2024-05-26T10:11:42.158305 #134367] INFO -- : make[2]: Entering directory '/home/opc/ruby/build/master/ext/digest/sha2' I, [2024-05-26T10:11:42.164938 #134367] INFO -- : make[2]: Leaving directory '/home/opc/ruby/build/master/ext/digest/sha2' I, [2024-05-26T10:11:42.202688 #134367] INFO -- : make[2]: Entering directory '/home/opc/ruby/build/master' I, [2024-05-26T10:11:42.284998 #134367] INFO -- : make[2]: 'ruby' is up to date. I, [2024-05-26T10:11:42.285075 #134367] INFO -- : make[2]: Leaving directory '/home/opc/ruby/build/master' I, [2024-05-26T10:11:42.285237 #134367] INFO -- : make[1]: Leaving directory '/home/opc/ruby/build/master' I, [2024-05-26T10:11:42.289984 #134367] INFO -- : make[1]: Entering directory '/home/opc/ruby/build/master' I, [2024-05-26T10:11:42.290029 #134367] INFO -- : make[1]: Nothing to be done for 'note'. I, [2024-05-26T10:11:42.290041 #134367] INFO -- : make[1]: Leaving directory '/home/opc/ruby/build/master' I, [2024-05-26T10:11:42.290407 #134367] INFO -- : $$$[end] "make all -j3" exit with 0. I, [2024-05-26T10:11:42.290558 #134367] INFO -- : $$$[beg] make install -j3 I, [2024-05-26T10:11:42.384670 #134367] INFO -- : Update power_assert to 84e85124c5014a139af39161d484156cfe87a9ed I, [2024-05-26T10:11:42.385099 #134367] INFO -- : Update rbs to ba7872795d5de04adb8ff500c0e6afdc81a041dd I, [2024-05-26T10:11:42.387947 #134367] INFO -- : echo 84e85124c5014a139af39161d484156cfe87a9ed | /bin/sh /home/opc/ruby/src/master/tool/ifchange /home/opc/ruby/src/master/.bundle/.timestamp/power_assert.revision - I, [2024-05-26T10:11:42.388156 #134367] INFO -- : echo ba7872795d5de04adb8ff500c0e6afdc81a041dd | /bin/sh /home/opc/ruby/src/master/tool/ifchange /home/opc/ruby/src/master/.bundle/.timestamp/rbs.revision - I, [2024-05-26T10:11:42.393854 #134367] INFO -- : /home/opc/ruby/src/master/.bundle/.timestamp/rbs.revision unchanged I, [2024-05-26T10:11:42.394464 #134367] INFO -- : /home/opc/ruby/src/master/.bundle/.timestamp/power_assert.revision unchanged I, [2024-05-26T10:11:42.396811 #134367] INFO -- : Update typeprof to b19a6416da3a05d57fadd6ffdadb382b6d236ca5 I, [2024-05-26T10:11:42.402255 #134367] INFO -- : BASERUBY = /usr/local/bin/ruby --disable=gems I, [2024-05-26T10:11:42.402299 #134367] INFO -- : CC = gcc I, [2024-05-26T10:11:42.402310 #134367] INFO -- : LD = ld I, [2024-05-26T10:11:42.402319 #134367] INFO -- : LDSHARED = gcc -shared I, [2024-05-26T10:11:42.402330 #134367] INFO -- : CFLAGS = -O3 -fno-fast-math -ggdb3 -Wall -Wextra -Wdeprecated-declarations -Wdiv-by-zero -Wduplicated-cond -Wimplicit-function-declaration -Wimplicit-int -Wpointer-arith -Wwrite-strings -Wold-style-definition -Wimplicit-fallthrough=0 -Wmissing-noreturn -Wno-cast-function-type -Wno-constant-logical-operand -Wno-long-long -Wno-missing-field-initializers -Wno-overlength-strings -Wno-packed-bitfield-compat -Wno-parentheses-equality -Wno-self-assign -Wno-tautological-compare -Wno-unused-parameter -Wno-unused-value -Wsuggest-attribute=format -Wsuggest-attribute=noreturn -Wunused-variable -Wmisleading-indentation -Wundef I, [2024-05-26T10:11:42.402340 #134367] INFO -- : XCFLAGS = -U_FORTIFY_SOURCE -D_FORTIFY_SOURCE=2 -fstack-protector-strong -msign-return-address=all -fno-strict-overflow -fvisibility=hidden -fexcess-precision=standard -DRUBY_EXPORT -fPIE -I. -I.ext/include/aarch64-linux -I/home/opc/ruby/src/master/include -I/home/opc/ruby/src/master -I/home/opc/ruby/src/master/prism -I/home/opc/ruby/src/master/enc/unicode/15.0.0 I, [2024-05-26T10:11:42.402349 #134367] INFO -- : CPPFLAGS = I, [2024-05-26T10:11:42.402357 #134367] INFO -- : DLDFLAGS = -Wl,--compress-debug-sections=zlib -fstack-protector-strong -pie I, [2024-05-26T10:11:42.402366 #134367] INFO -- : SOLIBS = -lz -lrt -lrt -ldl -lcrypt -lm -lpthread I, [2024-05-26T10:11:42.402374 #134367] INFO -- : LANG = en_US.UTF-8 I, [2024-05-26T10:11:42.402382 #134367] INFO -- : LC_ALL = I, [2024-05-26T10:11:42.402390 #134367] INFO -- : LC_CTYPE = I, [2024-05-26T10:11:42.402398 #134367] INFO -- : MFLAGS = -j3 --jobserver-auth=4,5 I, [2024-05-26T10:11:42.402406 #134367] INFO -- : RUSTC = rustc I, [2024-05-26T10:11:42.402414 #134367] INFO -- : YJIT_RUSTC_ARGS = --crate-name=yjit --crate-type=staticlib --edition=2021 -g -C lto=thin -C opt-level=3 -C overflow-checks=on '--out-dir=/home/opc/ruby/build/master/yjit/target/release/' /home/opc/ruby/src/master/yjit/src/lib.rs I, [2024-05-26T10:11:42.433620 #134367] INFO -- : echo b19a6416da3a05d57fadd6ffdadb382b6d236ca5 | /bin/sh /home/opc/ruby/src/master/tool/ifchange /home/opc/ruby/src/master/.bundle/.timestamp/typeprof.revision - I, [2024-05-26T10:11:42.434383 #134367] INFO -- : gcc (GCC) 8.5.0 20210514 (Red Hat 8.5.0-10.1.0.1) I, [2024-05-26T10:11:42.434415 #134367] INFO -- : Copyright (C) 2018 Free Software Foundation, Inc. I, [2024-05-26T10:11:42.434425 #134367] INFO -- : This is free software; see the source for copying conditions. There is NO I, [2024-05-26T10:11:42.434435 #134367] INFO -- : warranty; not even for MERCHANTABILITY or FITNESS FOR A PARTICULAR PURPOSE. I, [2024-05-26T10:11:42.434444 #134367] INFO -- : I, [2024-05-26T10:11:42.435204 #134367] INFO -- : generating encdb.h I, [2024-05-26T10:11:42.439099 #134367] INFO -- : generating enc.mk I, [2024-05-26T10:11:42.440783 #134367] INFO -- : /home/opc/ruby/src/master/.bundle/.timestamp/typeprof.revision unchanged I, [2024-05-26T10:11:42.480398 #134367] INFO -- : encdb.h unchanged I, [2024-05-26T10:11:42.575013 #134367] INFO -- : Building power_assert@84e85124c5014a139af39161d484156cfe87a9ed to /home/opc/ruby/src/master/gems/power_assert-2.0.3.gem I, [2024-05-26T10:11:42.678467 #134367] INFO -- : making srcs under enc I, [2024-05-26T10:11:42.678621 #134367] INFO -- : making enc I, [2024-05-26T10:11:42.696610 #134367] INFO -- : Successfully built RubyGem I, [2024-05-26T10:11:42.696663 #134367] INFO -- : Name: power_assert I, [2024-05-26T10:11:42.696674 #134367] INFO -- : Version: 2.0.4dev I, [2024-05-26T10:11:42.696683 #134367] INFO -- : File: power_assert-2.0.4dev.gem I, [2024-05-26T10:11:42.700536 #134367] INFO -- : Extracting bundle gem power_assert-2.0.3... I, [2024-05-26T10:11:42.706065 #134367] INFO -- : make[1]: Entering directory '/home/opc/ruby/build/master' I, [2024-05-26T10:11:42.706136 #134367] INFO -- : make[1]: Nothing to be done for 'enc'. I, [2024-05-26T10:11:42.706169 #134367] INFO -- : make[1]: Leaving directory '/home/opc/ruby/build/master' I, [2024-05-26T10:11:42.720924 #134367] INFO -- : make[1]: Entering directory '/home/opc/ruby/build/master' I, [2024-05-26T10:11:42.720968 #134367] INFO -- : make[1]: Nothing to be done for 'srcs'. I, [2024-05-26T10:11:42.720979 #134367] INFO -- : make[1]: Leaving directory '/home/opc/ruby/build/master' I, [2024-05-26T10:11:42.721733 #134367] INFO -- : generating transdb.h I, [2024-05-26T10:11:42.800292 #134367] INFO -- : Try with hash version of bundled gems instead of gems/power_assert-2.0.3.gem. We don't use this gem with release version of Ruby. I, [2024-05-26T10:11:42.811607 #134367] INFO -- : Unpacked gems/power_assert-2.0.4dev.gem I, [2024-05-26T10:11:42.863764 #134367] INFO -- : transdb.h unchanged I, [2024-05-26T10:11:42.865110 #134367] INFO -- : generating makefiles ext/configure-ext.mk I, [2024-05-26T10:11:42.865266 #134367] INFO -- : making trans I, [2024-05-26T10:11:42.904179 #134367] INFO -- : ext/configure-ext.mk unchanged I, [2024-05-26T10:11:42.907103 #134367] INFO -- : make[1]: Entering directory '/home/opc/ruby/build/master' I, [2024-05-26T10:11:42.914879 #134367] INFO -- : make[1]: Entering directory '/home/opc/ruby/build/master' I, [2024-05-26T10:11:42.914940 #134367] INFO -- : make[1]: Nothing to be done for 'trans'. I, [2024-05-26T10:11:42.914976 #134367] INFO -- : make[1]: Leaving directory '/home/opc/ruby/build/master' I, [2024-05-26T10:11:42.971023 #134367] INFO -- : making encs I, [2024-05-26T10:11:43.025398 #134367] INFO -- : make[1]: Entering directory '/home/opc/ruby/build/master' I, [2024-05-26T10:11:43.025486 #134367] INFO -- : make[1]: Nothing to be done for 'encs'. I, [2024-05-26T10:11:43.025521 #134367] INFO -- : make[1]: Leaving directory '/home/opc/ruby/build/master' I, [2024-05-26T10:11:43.690046 #134367] INFO -- : make[1]: Leaving directory '/home/opc/ruby/build/master' I, [2024-05-26T10:11:43.690925 #134367] INFO -- : generating makefile exts.mk I, [2024-05-26T10:11:43.750094 #134367] INFO -- : exts.mk unchanged I, [2024-05-26T10:11:43.754906 #134367] INFO -- : make[1]: Entering directory '/home/opc/ruby/build/master' I, [2024-05-26T10:11:43.857991 #134367] INFO -- : make[2]: Entering directory '/home/opc/ruby/build/master/ext/coverage' I, [2024-05-26T10:11:43.860230 #134367] INFO -- : make[2]: Entering directory '/home/opc/ruby/build/master/ext/digest' I, [2024-05-26T10:11:43.861560 #134367] INFO -- : make[2]: Entering directory '/home/opc/ruby/build/master/ext/date' I, [2024-05-26T10:11:43.864124 #134367] INFO -- : make[2]: Leaving directory '/home/opc/ruby/build/master/ext/coverage' I, [2024-05-26T10:11:43.866893 #134367] INFO -- : make[2]: Leaving directory '/home/opc/ruby/build/master/ext/date' I, [2024-05-26T10:11:43.870930 #134367] INFO -- : make[2]: Leaving directory '/home/opc/ruby/build/master/ext/digest' I, [2024-05-26T10:11:43.877848 #134367] INFO -- : make[2]: Entering directory '/home/opc/ruby/build/master/ext/fiddle' I, [2024-05-26T10:11:43.878594 #134367] INFO -- : make[2]: Entering directory '/home/opc/ruby/build/master/ext/io/console' I, [2024-05-26T10:11:43.883036 #134367] INFO -- : make[2]: Leaving directory '/home/opc/ruby/build/master/ext/io/console' I, [2024-05-26T10:11:43.886443 #134367] INFO -- : make[2]: Entering directory '/home/opc/ruby/build/master/ext/json' I, [2024-05-26T10:11:43.889587 #134367] INFO -- : make[2]: Leaving directory '/home/opc/ruby/build/master/ext/fiddle' I, [2024-05-26T10:11:43.890176 #134367] INFO -- : make[2]: Entering directory '/home/opc/ruby/build/master/ext/monitor' I, [2024-05-26T10:11:43.894383 #134367] INFO -- : make[2]: Leaving directory '/home/opc/ruby/build/master/ext/monitor' I, [2024-05-26T10:11:43.895529 #134367] INFO -- : make[2]: Entering directory '/home/opc/ruby/build/master/ext/objspace' I, [2024-05-26T10:11:43.896073 #134367] INFO -- : make[2]: Leaving directory '/home/opc/ruby/build/master/ext/json' I, [2024-05-26T10:11:43.900096 #134367] INFO -- : make[2]: Entering directory '/home/opc/ruby/build/master/ext/pathname' I, [2024-05-26T10:11:43.901359 #134367] INFO -- : make[2]: Leaving directory '/home/opc/ruby/build/master/ext/objspace' I, [2024-05-26T10:11:43.904551 #134367] INFO -- : make[2]: Leaving directory '/home/opc/ruby/build/master/ext/pathname' I, [2024-05-26T10:11:43.907501 #134367] INFO -- : make[2]: Entering directory '/home/opc/ruby/build/master/ext/psych' I, [2024-05-26T10:11:43.908808 #134367] INFO -- : make[2]: Entering directory '/home/opc/ruby/build/master/ext/pty' I, [2024-05-26T10:11:43.913532 #134367] INFO -- : make[2]: Entering directory '/home/opc/ruby/build/master/ext/openssl' I, [2024-05-26T10:11:43.916139 #134367] INFO -- : make[2]: Leaving directory '/home/opc/ruby/build/master/ext/pty' I, [2024-05-26T10:11:43.925495 #134367] INFO -- : make[2]: Leaving directory '/home/opc/ruby/build/master/ext/psych' I, [2024-05-26T10:11:43.928394 #134367] INFO -- : make[2]: Entering directory '/home/opc/ruby/build/master/ext/rubyvm' I, [2024-05-26T10:11:43.930863 #134367] INFO -- : make[2]: Entering directory '/home/opc/ruby/build/master/ext/ripper' I, [2024-05-26T10:11:43.931917 #134367] INFO -- : make[2]: Leaving directory '/home/opc/ruby/build/master/ext/rubyvm' I, [2024-05-26T10:11:43.938219 #134367] INFO -- : make[2]: Leaving directory '/home/opc/ruby/build/master/ext/ripper' I, [2024-05-26T10:11:43.939554 #134367] INFO -- : make[2]: Leaving directory '/home/opc/ruby/build/master/ext/openssl' I, [2024-05-26T10:11:43.944823 #134367] INFO -- : make[2]: Entering directory '/home/opc/ruby/build/master/ext/socket' I, [2024-05-26T10:11:43.946411 #134367] INFO -- : make[2]: Entering directory '/home/opc/ruby/build/master/.bundle/gems/bigdecimal-3.1.7/ext/bigdecimal' I, [2024-05-26T10:11:43.950373 #134367] INFO -- : make[2]: Entering directory '/home/opc/ruby/build/master/.bundle/gems/bigdecimal-3.1.8/ext/bigdecimal' I, [2024-05-26T10:11:43.956578 #134367] INFO -- : make[2]: Leaving directory '/home/opc/ruby/build/master/ext/socket' I, [2024-05-26T10:11:43.959036 #134367] INFO -- : make[2]: Entering directory '/home/opc/ruby/build/master/.bundle/gems/debug-1.9.2/ext/debug' I, [2024-05-26T10:11:43.977555 #134367] INFO -- : make[2]: Leaving directory '/home/opc/ruby/build/master/.bundle/gems/bigdecimal-3.1.7/ext/bigdecimal' I, [2024-05-26T10:11:43.980417 #134367] INFO -- : make[2]: Entering directory '/home/opc/ruby/build/master/.bundle/gems/nkf-0.2.0/ext/nkf' I, [2024-05-26T10:11:43.981460 #134367] INFO -- : make[2]: Leaving directory '/home/opc/ruby/build/master/.bundle/gems/bigdecimal-3.1.8/ext/bigdecimal' I, [2024-05-26T10:11:43.984560 #134367] INFO -- : make[2]: Entering directory '/home/opc/ruby/build/master/.bundle/gems/racc-1.7.3/ext/racc/cparse' I, [2024-05-26T10:11:43.990613 #134367] INFO -- : make[2]: Leaving directory '/home/opc/ruby/build/master/.bundle/gems/debug-1.9.2/ext/debug' I, [2024-05-26T10:11:43.992902 #134367] INFO -- : make[2]: Entering directory '/home/opc/ruby/build/master/.bundle/gems/racc-1.8.0/ext/racc/cparse' I, [2024-05-26T10:11:44.011819 #134367] INFO -- : make[2]: Leaving directory '/home/opc/ruby/build/master/.bundle/gems/nkf-0.2.0/ext/nkf' I, [2024-05-26T10:11:44.014786 #134367] INFO -- : make[2]: Entering directory '/home/opc/ruby/build/master/.bundle/gems/rbs-3.4.4/ext/rbs_extension' I, [2024-05-26T10:11:44.020741 #134367] INFO -- : make[2]: Leaving directory '/home/opc/ruby/build/master/.bundle/gems/racc-1.7.3/ext/racc/cparse' I, [2024-05-26T10:11:44.023639 #134367] INFO -- : make[2]: Entering directory '/home/opc/ruby/build/master/.bundle/gems/syslog-0.1.2/ext/syslog' I, [2024-05-26T10:11:44.024556 #134367] INFO -- : make[2]: Leaving directory '/home/opc/ruby/build/master/.bundle/gems/racc-1.8.0/ext/racc/cparse' I, [2024-05-26T10:11:44.046149 #134367] INFO -- : make[2]: Leaving directory '/home/opc/ruby/build/master/.bundle/gems/rbs-3.4.4/ext/rbs_extension' I, [2024-05-26T10:11:44.050485 #134367] INFO -- : make[2]: Entering directory '/home/opc/ruby/build/master/ext/digest/sha2' I, [2024-05-26T10:11:44.053476 #134367] INFO -- : make[2]: Leaving directory '/home/opc/ruby/build/master/.bundle/gems/syslog-0.1.2/ext/syslog' I, [2024-05-26T10:11:44.055467 #134367] INFO -- : make[2]: Leaving directory '/home/opc/ruby/build/master/ext/digest/sha2' I, [2024-05-26T10:11:44.094812 #134367] INFO -- : make[2]: Entering directory '/home/opc/ruby/build/master' I, [2024-05-26T10:11:44.178184 #134367] INFO -- : make[2]: 'ruby' is up to date. I, [2024-05-26T10:11:44.178262 #134367] INFO -- : make[2]: Leaving directory '/home/opc/ruby/build/master' I, [2024-05-26T10:11:44.178396 #134367] INFO -- : make[1]: Leaving directory '/home/opc/ruby/build/master' I, [2024-05-26T10:11:44.182771 #134367] INFO -- : make[1]: Entering directory '/home/opc/ruby/build/master' I, [2024-05-26T10:11:44.182805 #134367] INFO -- : make[1]: Nothing to be done for 'note'. I, [2024-05-26T10:11:44.182815 #134367] INFO -- : make[1]: Leaving directory '/home/opc/ruby/build/master' I, [2024-05-26T10:11:44.182992 #134367] INFO -- : ./miniruby -I/home/opc/ruby/src/master/lib -I. -I.ext/common /home/opc/ruby/src/master/tool/runruby.rb --extout=.ext -- --disable-gems -r./aarch64-linux-fake /home/opc/ruby/src/master/tool/rbinstall.rb --make="make" --dest-dir="" --extout=".ext" --ext-build-dir="./ext" --mflags="-j3 --jobserver-auth=4,5" --make-flags=" -j3 --jobserver-auth=4,5" --data-mode=0644 --prog-mode=0755 --installed-list .installed.list --mantype="doc" --gnumake --install=all --exclude=doc I, [2024-05-26T10:11:44.337751 #134367] INFO -- : Installing to I, [2024-05-26T10:11:44.337818 #134367] INFO -- : installing binary commands: /home/opc/ruby/install/master/bin I, [2024-05-26T10:11:44.452586 #134367] INFO -- : installing base libraries: /home/opc/ruby/install/master/lib I, [2024-05-26T10:11:44.453015 #134367] INFO -- : installing arch files: /home/opc/ruby/install/master/lib/ruby/3.4.0+0/aarch64-linux I, [2024-05-26T10:11:44.453116 #134367] INFO -- : installing pkgconfig data: /home/opc/ruby/install/master/lib/pkgconfig I, [2024-05-26T10:11:44.453236 #134367] INFO -- : installing extension objects: /home/opc/ruby/install/master/lib/ruby/3.4.0+0/aarch64-linux I, [2024-05-26T10:11:44.466074 #134367] INFO -- : installing extension objects: /home/opc/ruby/install/master/lib/ruby/site_ruby/3.4.0+0/aarch64-linux I, [2024-05-26T10:11:44.466118 #134367] INFO -- : installing extension objects: /home/opc/ruby/install/master/lib/ruby/vendor_ruby/3.4.0+0/aarch64-linux I, [2024-05-26T10:11:44.466204 #134367] INFO -- : installing extension headers: /home/opc/ruby/install/master/include/ruby-3.4.0+0/aarch64-linux I, [2024-05-26T10:11:44.466508 #134367] INFO -- : installing extension scripts: /home/opc/ruby/install/master/lib/ruby/3.4.0+0 I, [2024-05-26T10:11:44.474454 #134367] INFO -- : installing extension scripts: /home/opc/ruby/install/master/lib/ruby/site_ruby/3.4.0+0 I, [2024-05-26T10:11:44.474488 #134367] INFO -- : installing extension scripts: /home/opc/ruby/install/master/lib/ruby/vendor_ruby/3.4.0+0 I, [2024-05-26T10:11:44.474508 #134367] INFO -- : installing extension headers: /home/opc/ruby/install/master/include/ruby-3.4.0+0/ruby I, [2024-05-26T10:11:44.474593 #134367] INFO -- : installing command scripts: /home/opc/ruby/install/master/bin I, [2024-05-26T10:11:44.474718 #134367] INFO -- : installing library scripts: /home/opc/ruby/install/master/lib/ruby/3.4.0+0 I, [2024-05-26T10:11:44.556949 #134367] INFO -- : installing common headers: /home/opc/ruby/install/master/include/ruby-3.4.0+0 I, [2024-05-26T10:11:44.568665 #134367] INFO -- : installing manpages: /home/opc/ruby/install/master/share/man/man1 I, [2024-05-26T10:11:44.568945 #134367] INFO -- : installing default gems from lib: /home/opc/ruby/install/master/lib/ruby/gems/3.4.0+0 I, [2024-05-26T10:11:44.615924 #134367] INFO -- : benchmark 0.3.0 I, [2024-05-26T10:11:44.620249 #134367] INFO -- : bundler 2.6.0.dev I, [2024-05-26T10:11:44.625221 #134367] INFO -- : cgi 0.4.1 I, [2024-05-26T10:11:44.626398 #134367] INFO -- : delegate 0.3.1 I, [2024-05-26T10:11:44.627539 #134367] INFO -- : did_you_mean 1.6.3 I, [2024-05-26T10:11:44.628707 #134367] INFO -- : english 0.8.0 I, [2024-05-26T10:11:44.631002 #134367] INFO -- : erb 4.0.4 I, [2024-05-26T10:11:44.634360 #134367] INFO -- : error_highlight 0.6.0 I, [2024-05-26T10:11:44.635479 #134367] INFO -- : fileutils 1.7.2 I, [2024-05-26T10:11:44.636688 #134367] INFO -- : find 0.2.0 I, [2024-05-26T10:11:44.637873 #134367] INFO -- : forwardable 1.3.3 I, [2024-05-26T10:11:44.638973 #134367] INFO -- : ipaddr 1.2.6 I, [2024-05-26T10:11:44.640067 #134367] INFO -- : irb 1.13.1 I, [2024-05-26T10:11:44.642800 #134367] INFO -- : logger 1.6.0 I, [2024-05-26T10:11:44.643888 #134367] INFO -- : net-http 0.4.1 I, [2024-05-26T10:11:44.645051 #134367] INFO -- : net-protocol 0.2.2 I, [2024-05-26T10:11:44.646258 #134367] INFO -- : open-uri 0.4.1 I, [2024-05-26T10:11:44.647398 #134367] INFO -- : open3 0.2.1 I, [2024-05-26T10:11:44.648510 #134367] INFO -- : optparse 0.5.0 I, [2024-05-26T10:11:44.649714 #134367] INFO -- : ostruct 0.6.0 I, [2024-05-26T10:11:44.650769 #134367] INFO -- : pp 0.5.0 I, [2024-05-26T10:11:44.651936 #134367] INFO -- : prettyprint 0.2.0 I, [2024-05-26T10:11:44.653055 #134367] INFO -- : prism 0.29.0 I, [2024-05-26T10:11:44.654292 #134367] INFO -- : pstore 0.1.3 I, [2024-05-26T10:11:44.655388 #134367] INFO -- : rdoc 6.7.0 I, [2024-05-26T10:11:44.659800 #134367] INFO -- : readline 0.0.4 I, [2024-05-26T10:11:44.660925 #134367] INFO -- : reline 0.5.7 I, [2024-05-26T10:11:44.662133 #134367] INFO -- : resolv 0.4.0 I, [2024-05-26T10:11:44.663240 #134367] INFO -- : ruby2_keywords 0.0.5 I, [2024-05-26T10:11:44.666070 #134367] INFO -- : securerandom 0.3.1 I, [2024-05-26T10:11:44.667175 #134367] INFO -- : set 1.1.0 I, [2024-05-26T10:11:44.668283 #134367] INFO -- : shellwords 0.2.0 I, [2024-05-26T10:11:44.669453 #134367] INFO -- : singleton 0.2.0 I, [2024-05-26T10:11:44.670530 #134367] INFO -- : syntax_suggest 2.0.0 I, [2024-05-26T10:11:44.673342 #134367] INFO -- : tempfile 0.2.1 I, [2024-05-26T10:11:44.674450 #134367] INFO -- : time 0.3.0 I, [2024-05-26T10:11:44.675582 #134367] INFO -- : timeout 0.4.1 I, [2024-05-26T10:11:44.676715 #134367] INFO -- : tmpdir 0.2.0 I, [2024-05-26T10:11:44.677917 #134367] INFO -- : tsort 0.2.0 I, [2024-05-26T10:11:44.679047 #134367] INFO -- : un 0.3.0 I, [2024-05-26T10:11:44.680425 #134367] INFO -- : uri 0.13.0 I, [2024-05-26T10:11:44.681673 #134367] INFO -- : weakref 0.1.3 I, [2024-05-26T10:11:44.682797 #134367] INFO -- : yaml 0.3.0 I, [2024-05-26T10:11:44.683699 #134367] INFO -- : installing default gems from ext: /home/opc/ruby/install/master/lib/ruby/gems/3.4.0+0 I, [2024-05-26T10:11:44.693303 #134367] INFO -- : date 3.3.4 I, [2024-05-26T10:11:44.696445 #134367] INFO -- : digest 3.1.1 I, [2024-05-26T10:11:44.697684 #134367] INFO -- : etc 1.4.3 I, [2024-05-26T10:11:44.698870 #134367] INFO -- : fcntl 1.1.0 I, [2024-05-26T10:11:44.699982 #134367] INFO -- : fiddle 1.1.3 I, [2024-05-26T10:11:44.701236 #134367] INFO -- : io-console 0.7.2 I, [2024-05-26T10:11:44.702408 #134367] INFO -- : io-nonblock 0.3.0 I, [2024-05-26T10:11:44.703532 #134367] INFO -- : io-wait 0.3.1 I, [2024-05-26T10:11:44.704732 #134367] INFO -- : json 2.7.2 I, [2024-05-26T10:11:44.706042 #134367] INFO -- : openssl 3.2.0 I, [2024-05-26T10:11:44.707223 #134367] INFO -- : pathname 0.3.0 I, [2024-05-26T10:11:44.708802 #134367] INFO -- : psych 5.1.2 I, [2024-05-26T10:11:44.710127 #134367] INFO -- : stringio 3.1.1 I, [2024-05-26T10:11:44.711292 #134367] INFO -- : strscan 3.1.1 I, [2024-05-26T10:11:44.712420 #134367] INFO -- : zlib 3.1.0 I, [2024-05-26T10:11:44.713444 #134367] INFO -- : installing bundled gems: /home/opc/ruby/install/master/lib/ruby/gems/3.4.0+0 I, [2024-05-26T10:11:44.714420 #134367] INFO -- : minitest 5.23.1 I, [2024-05-26T10:11:44.732225 #134367] INFO -- : rake 13.2.1 I, [2024-05-26T10:11:44.746517 #134367] INFO -- : test-unit 3.6.2 I, [2024-05-26T10:11:44.760260 #134367] INFO -- : rexml 3.2.8 I, [2024-05-26T10:11:44.776294 #134367] INFO -- : rss 0.3.0 I, [2024-05-26T10:11:44.785882 #134367] INFO -- : net-ftp 0.3.4 I, [2024-05-26T10:11:44.790396 #134367] INFO -- : net-imap 0.4.11 I, [2024-05-26T10:11:44.805218 #134367] INFO -- : net-pop 0.1.2 I, [2024-05-26T10:11:44.807810 #134367] INFO -- : net-smtp 0.5.0 I, [2024-05-26T10:11:44.811236 #134367] INFO -- : matrix 0.4.2 I, [2024-05-26T10:11:44.819516 #134367] INFO -- : prime 0.1.2 I, [2024-05-26T10:11:44.828300 #134367] INFO -- : rbs 3.4.4 I, [2024-05-26T10:11:44.928914 #134367] INFO -- : typeprof 0.21.11 I, [2024-05-26T10:11:44.937815 #134367] INFO -- : debug 1.9.2 I, [2024-05-26T10:11:44.947801 #134367] INFO -- : racc 1.8.0 I, [2024-05-26T10:11:44.959058 #134367] INFO -- : mutex_m 0.2.0 I, [2024-05-26T10:11:44.962136 #134367] INFO -- : getoptlong 0.2.1 I, [2024-05-26T10:11:44.967117 #134367] INFO -- : base64 0.2.0 I, [2024-05-26T10:11:44.969685 #134367] INFO -- : bigdecimal 3.1.8 I, [2024-05-26T10:11:44.976109 #134367] INFO -- : observer 0.1.2 I, [2024-05-26T10:11:44.979546 #134367] INFO -- : abbrev 0.1.2 I, [2024-05-26T10:11:44.982663 #134367] INFO -- : resolv-replace 0.1.1 I, [2024-05-26T10:11:44.987087 #134367] INFO -- : rinda 0.2.0 I, [2024-05-26T10:11:44.990823 #134367] INFO -- : drb 2.2.1 I, [2024-05-26T10:11:44.996047 #134367] INFO -- : nkf 0.2.0 I, [2024-05-26T10:11:45.002950 #134367] INFO -- : syslog 0.1.2 I, [2024-05-26T10:11:45.007830 #134367] INFO -- : csv 3.3.0 I, [2024-05-26T10:11:45.017003 #134367] INFO -- : installing bundled gem cache: /home/opc/ruby/install/master/lib/ruby/gems/3.4.0+0/cache I, [2024-05-26T10:11:45.019026 #134367] INFO -- : skipped bundled gems: I, [2024-05-26T10:11:45.019058 #134367] INFO -- : power_assert-2.0.4dev.gem not found in bundled_gems I, [2024-05-26T10:11:45.021870 #134367] INFO -- : $$$[end] "make install -j3" exit with 0. I, [2024-05-26T10:11:45.022027 #134367] INFO -- : $$$[beg] make yes-btest TESTOPTS='-q -j3' I, [2024-05-26T10:12:06.947037 #134367] INFO -- : PASS all 1936 tests E, [2024-05-26T10:12:06.948782 #134367] ERROR -- : I, [2024-05-26T10:12:06.948895 #134367] INFO -- : $$$[end] "make yes-btest TESTOPTS='-q -j3'" exit with 0. I, [2024-05-26T10:12:06.949042 #134367] INFO -- : $$$[beg] make yes-test-basic TESTS='-j3' I, [2024-05-26T10:12:07.041036 #134367] INFO -- : BASERUBY = /usr/local/bin/ruby --disable=gems I, [2024-05-26T10:12:07.041116 #134367] INFO -- : CC = gcc I, [2024-05-26T10:12:07.041164 #134367] INFO -- : LD = ld I, [2024-05-26T10:12:07.041174 #134367] INFO -- : LDSHARED = gcc -shared I, [2024-05-26T10:12:07.041185 #134367] INFO -- : CFLAGS = -O3 -fno-fast-math -ggdb3 -Wall -Wextra -Wdeprecated-declarations -Wdiv-by-zero -Wduplicated-cond -Wimplicit-function-declaration -Wimplicit-int -Wpointer-arith -Wwrite-strings -Wold-style-definition -Wimplicit-fallthrough=0 -Wmissing-noreturn -Wno-cast-function-type -Wno-constant-logical-operand -Wno-long-long -Wno-missing-field-initializers -Wno-overlength-strings -Wno-packed-bitfield-compat -Wno-parentheses-equality -Wno-self-assign -Wno-tautological-compare -Wno-unused-parameter -Wno-unused-value -Wsuggest-attribute=format -Wsuggest-attribute=noreturn -Wunused-variable -Wmisleading-indentation -Wundef I, [2024-05-26T10:12:07.041209 #134367] INFO -- : XCFLAGS = -U_FORTIFY_SOURCE -D_FORTIFY_SOURCE=2 -fstack-protector-strong -msign-return-address=all -fno-strict-overflow -fvisibility=hidden -fexcess-precision=standard -DRUBY_EXPORT -fPIE -I. -I.ext/include/aarch64-linux -I/home/opc/ruby/src/master/include -I/home/opc/ruby/src/master -I/home/opc/ruby/src/master/prism -I/home/opc/ruby/src/master/enc/unicode/15.0.0 I, [2024-05-26T10:12:07.041218 #134367] INFO -- : CPPFLAGS = I, [2024-05-26T10:12:07.041226 #134367] INFO -- : DLDFLAGS = -Wl,--compress-debug-sections=zlib -fstack-protector-strong -pie I, [2024-05-26T10:12:07.041235 #134367] INFO -- : SOLIBS = -lz -lrt -lrt -ldl -lcrypt -lm -lpthread I, [2024-05-26T10:12:07.041243 #134367] INFO -- : LANG = en_US.UTF-8 I, [2024-05-26T10:12:07.041251 #134367] INFO -- : LC_ALL = I, [2024-05-26T10:12:07.041258 #134367] INFO -- : LC_CTYPE = I, [2024-05-26T10:12:07.041266 #134367] INFO -- : MFLAGS = I, [2024-05-26T10:12:07.041274 #134367] INFO -- : RUSTC = rustc I, [2024-05-26T10:12:07.041282 #134367] INFO -- : YJIT_RUSTC_ARGS = --crate-name=yjit --crate-type=staticlib --edition=2021 -g -C lto=thin -C opt-level=3 -C overflow-checks=on '--out-dir=/home/opc/ruby/build/master/yjit/target/release/' /home/opc/ruby/src/master/yjit/src/lib.rs I, [2024-05-26T10:12:07.042024 #134367] INFO -- : gcc (GCC) 8.5.0 20210514 (Red Hat 8.5.0-10.1.0.1) I, [2024-05-26T10:12:07.042062 #134367] INFO -- : Copyright (C) 2018 Free Software Foundation, Inc. I, [2024-05-26T10:12:07.042073 #134367] INFO -- : This is free software; see the source for copying conditions. There is NO I, [2024-05-26T10:12:07.042083 #134367] INFO -- : warranty; not even for MERCHANTABILITY or FITNESS FOR A PARTICULAR PURPOSE. I, [2024-05-26T10:12:07.042091 #134367] INFO -- : I, [2024-05-26T10:12:07.202181 #134367] INFO -- : Checking leaked global symbols...none I, [2024-05-26T10:12:07.254771 #134367] INFO -- : /home/opc/ruby/src/master/basictest/test.rb:assignment ....................................................................................................................................................................................................................................................................................................................................................................................OK 372 I, [2024-05-26T10:12:07.254847 #134367] INFO -- : /home/opc/ruby/src/master/basictest/test.rb:condition ..OK 2 I, [2024-05-26T10:12:07.254861 #134367] INFO -- : /home/opc/ruby/src/master/basictest/test.rb:if/unless ...OK 3 I, [2024-05-26T10:12:07.254916 #134367] INFO -- : /home/opc/ruby/src/master/basictest/test.rb:case .....OK 5 I, [2024-05-26T10:12:07.255543 #134367] INFO -- : /home/opc/ruby/src/master/basictest/test.rb:while/until ........OK 8 I, [2024-05-26T10:12:07.255670 #134367] INFO -- : /home/opc/ruby/src/master/basictest/test.rb:exception ..........OK 10 I, [2024-05-26T10:12:07.256324 #134367] INFO -- : /home/opc/ruby/src/master/basictest/test.rb:array .......................................OK 39 I, [2024-05-26T10:12:07.256625 #134367] INFO -- : /home/opc/ruby/src/master/basictest/test.rb:hash ...........................OK 27 I, [2024-05-26T10:12:07.258299 #134367] INFO -- : /home/opc/ruby/src/master/basictest/test.rb:iterator ...........................................................................................................OK 107 I, [2024-05-26T10:12:07.259064 #134367] INFO -- : /home/opc/ruby/src/master/basictest/test.rb:float ................................................................................OK 80 I, [2024-05-26T10:12:07.262558 #134367] INFO -- : /home/opc/ruby/src/master/basictest/test.rb:bignum ...............................OK 31 I, [2024-05-26T10:12:07.264140 #134367] INFO -- : /home/opc/ruby/src/master/basictest/test.rb:string & char ..............................................................OK 62 I, [2024-05-26T10:12:07.264216 #134367] INFO -- : /home/opc/ruby/src/master/basictest/test.rb:assignment ..........OK 10 I, [2024-05-26T10:12:07.264268 #134367] INFO -- : /home/opc/ruby/src/master/basictest/test.rb:call ......OK 6 I, [2024-05-26T10:12:07.264384 #134367] INFO -- : /home/opc/ruby/src/master/basictest/test.rb:proc .........OK 9 I, [2024-05-26T10:12:07.364604 #134367] INFO -- : /home/opc/ruby/src/master/basictest/test.rb:signal ..OK 2 I, [2024-05-26T10:12:07.365953 #134367] INFO -- : /home/opc/ruby/src/master/basictest/test.rb:eval ...........................OK 27 I, [2024-05-26T10:12:07.507946 #134367] INFO -- : /home/opc/ruby/src/master/basictest/test.rb:system ........OK 8 I, [2024-05-26T10:12:07.508017 #134367] INFO -- : /home/opc/ruby/src/master/basictest/test.rb:const .....OK 5 I, [2024-05-26T10:12:07.508113 #134367] INFO -- : /home/opc/ruby/src/master/basictest/test.rb:clone .....OK 5 I, [2024-05-26T10:12:07.508317 #134367] INFO -- : /home/opc/ruby/src/master/basictest/test.rb:marshal ....OK 4 I, [2024-05-26T10:12:07.508395 #134367] INFO -- : /home/opc/ruby/src/master/basictest/test.rb:pack ....OK 4 I, [2024-05-26T10:12:07.508427 #134367] INFO -- : /home/opc/ruby/src/master/basictest/test.rb:math ..OK 2 I, [2024-05-26T10:12:07.508542 #134367] INFO -- : /home/opc/ruby/src/master/basictest/test.rb:struct ......OK 6 I, [2024-05-26T10:12:07.508714 #134367] INFO -- : /home/opc/ruby/src/master/basictest/test.rb:variable ............OK 12 I, [2024-05-26T10:12:07.508757 #134367] INFO -- : /home/opc/ruby/src/master/basictest/test.rb:trace ...OK 3 I, [2024-05-26T10:12:07.508895 #134367] INFO -- : /home/opc/ruby/src/master/basictest/test.rb:defined? ............OK 12 I, [2024-05-26T10:12:07.508986 #134367] INFO -- : /home/opc/ruby/src/master/basictest/test.rb:alias ......OK 6 I, [2024-05-26T10:12:07.509618 #134367] INFO -- : /home/opc/ruby/src/master/basictest/test.rb:path .......................OK 23 I, [2024-05-26T10:12:07.577041 #134367] INFO -- : /home/opc/ruby/src/master/basictest/test.rb:gc ....OK 4 I, [2024-05-26T10:12:07.579051 #134367] INFO -- : I, [2024-05-26T10:12:07.579091 #134367] INFO -- : test succeeded I, [2024-05-26T10:12:07.579638 #134367] INFO -- : $$$[end] "make yes-test-basic TESTS='-j3'" exit with 0. I, [2024-05-26T10:12:07.579777 #134367] INFO -- : $$$[beg] make yes-test-all TESTOPTS='--stderr-on-failure' TESTS='-j3' I, [2024-05-26T10:12:07.705349 #134367] INFO -- : BASERUBY = /usr/local/bin/ruby --disable=gems I, [2024-05-26T10:12:07.705429 #134367] INFO -- : CC = gcc I, [2024-05-26T10:12:07.705443 #134367] INFO -- : LD = ld I, [2024-05-26T10:12:07.705452 #134367] INFO -- : LDSHARED = gcc -shared I, [2024-05-26T10:12:07.705465 #134367] INFO -- : CFLAGS = -O3 -fno-fast-math -ggdb3 -Wall -Wextra -Wdeprecated-declarations -Wdiv-by-zero -Wduplicated-cond -Wimplicit-function-declaration -Wimplicit-int -Wpointer-arith -Wwrite-strings -Wold-style-definition -Wimplicit-fallthrough=0 -Wmissing-noreturn -Wno-cast-function-type -Wno-constant-logical-operand -Wno-long-long -Wno-missing-field-initializers -Wno-overlength-strings -Wno-packed-bitfield-compat -Wno-parentheses-equality -Wno-self-assign -Wno-tautological-compare -Wno-unused-parameter -Wno-unused-value -Wsuggest-attribute=format -Wsuggest-attribute=noreturn -Wunused-variable -Wmisleading-indentation -Wundef I, [2024-05-26T10:12:07.705475 #134367] INFO -- : XCFLAGS = -U_FORTIFY_SOURCE -D_FORTIFY_SOURCE=2 -fstack-protector-strong -msign-return-address=all -fno-strict-overflow -fvisibility=hidden -fexcess-precision=standard -DRUBY_EXPORT -fPIE -I. -I.ext/include/aarch64-linux -I/home/opc/ruby/src/master/include -I/home/opc/ruby/src/master -I/home/opc/ruby/src/master/prism -I/home/opc/ruby/src/master/enc/unicode/15.0.0 I, [2024-05-26T10:12:07.705483 #134367] INFO -- : CPPFLAGS = I, [2024-05-26T10:12:07.705491 #134367] INFO -- : DLDFLAGS = -Wl,--compress-debug-sections=zlib -fstack-protector-strong -pie I, [2024-05-26T10:12:07.705501 #134367] INFO -- : SOLIBS = -lz -lrt -lrt -ldl -lcrypt -lm -lpthread I, [2024-05-26T10:12:07.705509 #134367] INFO -- : LANG = en_US.UTF-8 I, [2024-05-26T10:12:07.705517 #134367] INFO -- : LC_ALL = I, [2024-05-26T10:12:07.705526 #134367] INFO -- : LC_CTYPE = I, [2024-05-26T10:12:07.705534 #134367] INFO -- : MFLAGS = I, [2024-05-26T10:12:07.705542 #134367] INFO -- : RUSTC = rustc I, [2024-05-26T10:12:07.705550 #134367] INFO -- : YJIT_RUSTC_ARGS = --crate-name=yjit --crate-type=staticlib --edition=2021 -g -C lto=thin -C opt-level=3 -C overflow-checks=on '--out-dir=/home/opc/ruby/build/master/yjit/target/release/' /home/opc/ruby/src/master/yjit/src/lib.rs I, [2024-05-26T10:12:07.706276 #134367] INFO -- : gcc (GCC) 8.5.0 20210514 (Red Hat 8.5.0-10.1.0.1) I, [2024-05-26T10:12:07.706292 #134367] INFO -- : Copyright (C) 2018 Free Software Foundation, Inc. I, [2024-05-26T10:12:07.706301 #134367] INFO -- : This is free software; see the source for copying conditions. There is NO I, [2024-05-26T10:12:07.706310 #134367] INFO -- : warranty; not even for MERCHANTABILITY or FITNESS FOR A PARTICULAR PURPOSE. I, [2024-05-26T10:12:07.706318 #134367] INFO -- : I, [2024-05-26T10:12:07.708378 #134367] INFO -- : generating enc.mk I, [2024-05-26T10:12:07.945427 #134367] INFO -- : generating encdb.h I, [2024-05-26T10:12:07.982515 #134367] INFO -- : encdb.h unchanged I, [2024-05-26T10:12:07.983751 #134367] INFO -- : making enc I, [2024-05-26T10:12:08.011569 #134367] INFO -- : make[1]: Entering directory '/home/opc/ruby/build/master' I, [2024-05-26T10:12:08.011618 #134367] INFO -- : make[1]: Nothing to be done for 'enc'. I, [2024-05-26T10:12:08.011639 #134367] INFO -- : make[1]: Leaving directory '/home/opc/ruby/build/master' I, [2024-05-26T10:12:08.012351 #134367] INFO -- : making srcs under enc I, [2024-05-26T10:12:08.054439 #134367] INFO -- : make[1]: Entering directory '/home/opc/ruby/build/master' I, [2024-05-26T10:12:08.054503 #134367] INFO -- : make[1]: Nothing to be done for 'srcs'. I, [2024-05-26T10:12:08.054513 #134367] INFO -- : make[1]: Leaving directory '/home/opc/ruby/build/master' I, [2024-05-26T10:12:08.055626 #134367] INFO -- : generating transdb.h I, [2024-05-26T10:12:08.200676 #134367] INFO -- : transdb.h unchanged I, [2024-05-26T10:12:08.202032 #134367] INFO -- : making trans I, [2024-05-26T10:12:08.251329 #134367] INFO -- : make[1]: Entering directory '/home/opc/ruby/build/master' I, [2024-05-26T10:12:08.251397 #134367] INFO -- : make[1]: Nothing to be done for 'trans'. I, [2024-05-26T10:12:08.251408 #134367] INFO -- : make[1]: Leaving directory '/home/opc/ruby/build/master' I, [2024-05-26T10:12:08.252139 #134367] INFO -- : making encs I, [2024-05-26T10:12:08.305079 #134367] INFO -- : make[1]: Entering directory '/home/opc/ruby/build/master' I, [2024-05-26T10:12:08.305155 #134367] INFO -- : make[1]: Nothing to be done for 'encs'. I, [2024-05-26T10:12:08.305166 #134367] INFO -- : make[1]: Leaving directory '/home/opc/ruby/build/master' I, [2024-05-26T10:12:08.307138 #134367] INFO -- : generating makefiles ext/configure-ext.mk I, [2024-05-26T10:12:08.348249 #134367] INFO -- : ext/configure-ext.mk updated I, [2024-05-26T10:12:08.351334 #134367] INFO -- : make[1]: Entering directory '/home/opc/ruby/build/master' I, [2024-05-26T10:12:10.504680 #134367] INFO -- : make[1]: Leaving directory '/home/opc/ruby/build/master' I, [2024-05-26T10:12:10.505465 #134367] INFO -- : generating makefile exts.mk I, [2024-05-26T10:12:10.563705 #134367] INFO -- : exts.mk unchanged I, [2024-05-26T10:12:10.568598 #134367] INFO -- : make[1]: Entering directory '/home/opc/ruby/build/master' I, [2024-05-26T10:12:10.870559 #134367] INFO -- : make[2]: Entering directory '/home/opc/ruby/build/master/ext/coverage' I, [2024-05-26T10:12:10.875244 #134367] INFO -- : make[2]: Leaving directory '/home/opc/ruby/build/master/ext/coverage' I, [2024-05-26T10:12:10.880872 #134367] INFO -- : make[2]: Entering directory '/home/opc/ruby/build/master/ext/date' I, [2024-05-26T10:12:10.886080 #134367] INFO -- : make[2]: Leaving directory '/home/opc/ruby/build/master/ext/date' I, [2024-05-26T10:12:10.889463 #134367] INFO -- : make[2]: Entering directory '/home/opc/ruby/build/master/ext/digest' I, [2024-05-26T10:12:10.898367 #134367] INFO -- : make[2]: Leaving directory '/home/opc/ruby/build/master/ext/digest' I, [2024-05-26T10:12:10.920634 #134367] INFO -- : make[2]: Entering directory '/home/opc/ruby/build/master/ext/digest/sha2' I, [2024-05-26T10:12:10.925530 #134367] INFO -- : make[2]: Leaving directory '/home/opc/ruby/build/master/ext/digest/sha2' I, [2024-05-26T10:12:10.943293 #134367] INFO -- : make[2]: Entering directory '/home/opc/ruby/build/master/ext/fiddle' I, [2024-05-26T10:12:10.953462 #134367] INFO -- : make[2]: Leaving directory '/home/opc/ruby/build/master/ext/fiddle' I, [2024-05-26T10:12:10.957726 #134367] INFO -- : make[2]: Entering directory '/home/opc/ruby/build/master/ext/io/console' I, [2024-05-26T10:12:10.961890 #134367] INFO -- : make[2]: Leaving directory '/home/opc/ruby/build/master/ext/io/console' I, [2024-05-26T10:12:10.972595 #134367] INFO -- : make[2]: Entering directory '/home/opc/ruby/build/master/ext/json' I, [2024-05-26T10:12:10.982175 #134367] INFO -- : make[2]: Leaving directory '/home/opc/ruby/build/master/ext/json' I, [2024-05-26T10:12:10.995071 #134367] INFO -- : make[2]: Entering directory '/home/opc/ruby/build/master/ext/monitor' I, [2024-05-26T10:12:10.999273 #134367] INFO -- : make[2]: Leaving directory '/home/opc/ruby/build/master/ext/monitor' I, [2024-05-26T10:12:11.005324 #134367] INFO -- : make[2]: Entering directory '/home/opc/ruby/build/master/ext/objspace' I, [2024-05-26T10:12:11.011099 #134367] INFO -- : make[2]: Leaving directory '/home/opc/ruby/build/master/ext/objspace' I, [2024-05-26T10:12:11.030650 #134367] INFO -- : make[2]: Entering directory '/home/opc/ruby/build/master/ext/openssl' I, [2024-05-26T10:12:11.052397 #134367] INFO -- : make[2]: Leaving directory '/home/opc/ruby/build/master/ext/openssl' I, [2024-05-26T10:12:11.056598 #134367] INFO -- : make[2]: Entering directory '/home/opc/ruby/build/master/ext/pathname' I, [2024-05-26T10:12:11.060778 #134367] INFO -- : make[2]: Leaving directory '/home/opc/ruby/build/master/ext/pathname' I, [2024-05-26T10:12:11.067182 #134367] INFO -- : make[2]: Entering directory '/home/opc/ruby/build/master/ext/psych' I, [2024-05-26T10:12:11.088661 #134367] INFO -- : make[2]: Leaving directory '/home/opc/ruby/build/master/ext/psych' I, [2024-05-26T10:12:11.093196 #134367] INFO -- : make[2]: Entering directory '/home/opc/ruby/build/master/ext/pty' I, [2024-05-26T10:12:11.097679 #134367] INFO -- : make[2]: Leaving directory '/home/opc/ruby/build/master/ext/pty' I, [2024-05-26T10:12:11.111017 #134367] INFO -- : make[2]: Entering directory '/home/opc/ruby/build/master/ext/ripper' I, [2024-05-26T10:12:11.119034 #134367] INFO -- : make[2]: Leaving directory '/home/opc/ruby/build/master/ext/ripper' I, [2024-05-26T10:12:11.120893 #134367] INFO -- : make[2]: Entering directory '/home/opc/ruby/build/master/ext/rubyvm' I, [2024-05-26T10:12:11.124377 #134367] INFO -- : make[2]: Leaving directory '/home/opc/ruby/build/master/ext/rubyvm' I, [2024-05-26T10:12:11.136402 #134367] INFO -- : make[2]: Entering directory '/home/opc/ruby/build/master/ext/socket' I, [2024-05-26T10:12:11.147214 #134367] INFO -- : make[2]: Leaving directory '/home/opc/ruby/build/master/ext/socket' I, [2024-05-26T10:12:11.162724 #134367] INFO -- : make[2]: Entering directory '/home/opc/ruby/build/master/.bundle/gems/bigdecimal-3.1.7/ext/bigdecimal' I, [2024-05-26T10:12:11.194177 #134367] INFO -- : make[2]: Leaving directory '/home/opc/ruby/build/master/.bundle/gems/bigdecimal-3.1.7/ext/bigdecimal' I, [2024-05-26T10:12:11.196811 #134367] INFO -- : make[2]: Entering directory '/home/opc/ruby/build/master/.bundle/gems/bigdecimal-3.1.8/ext/bigdecimal' I, [2024-05-26T10:12:11.227858 #134367] INFO -- : make[2]: Leaving directory '/home/opc/ruby/build/master/.bundle/gems/bigdecimal-3.1.8/ext/bigdecimal' I, [2024-05-26T10:12:11.230499 #134367] INFO -- : make[2]: Entering directory '/home/opc/ruby/build/master/.bundle/gems/debug-1.9.2/ext/debug' I, [2024-05-26T10:12:11.261797 #134367] INFO -- : make[2]: Leaving directory '/home/opc/ruby/build/master/.bundle/gems/debug-1.9.2/ext/debug' I, [2024-05-26T10:12:11.264298 #134367] INFO -- : make[2]: Entering directory '/home/opc/ruby/build/master/.bundle/gems/nkf-0.2.0/ext/nkf' I, [2024-05-26T10:12:11.295608 #134367] INFO -- : make[2]: Leaving directory '/home/opc/ruby/build/master/.bundle/gems/nkf-0.2.0/ext/nkf' I, [2024-05-26T10:12:11.298225 #134367] INFO -- : make[2]: Entering directory '/home/opc/ruby/build/master/.bundle/gems/racc-1.7.3/ext/racc/cparse' I, [2024-05-26T10:12:11.329147 #134367] INFO -- : make[2]: Leaving directory '/home/opc/ruby/build/master/.bundle/gems/racc-1.7.3/ext/racc/cparse' I, [2024-05-26T10:12:11.331613 #134367] INFO -- : make[2]: Entering directory '/home/opc/ruby/build/master/.bundle/gems/racc-1.8.0/ext/racc/cparse' I, [2024-05-26T10:12:11.362824 #134367] INFO -- : make[2]: Leaving directory '/home/opc/ruby/build/master/.bundle/gems/racc-1.8.0/ext/racc/cparse' I, [2024-05-26T10:12:11.365884 #134367] INFO -- : make[2]: Entering directory '/home/opc/ruby/build/master/.bundle/gems/rbs-3.4.4/ext/rbs_extension' I, [2024-05-26T10:12:11.396890 #134367] INFO -- : make[2]: Leaving directory '/home/opc/ruby/build/master/.bundle/gems/rbs-3.4.4/ext/rbs_extension' I, [2024-05-26T10:12:11.399632 #134367] INFO -- : make[2]: Entering directory '/home/opc/ruby/build/master/.bundle/gems/syslog-0.1.2/ext/syslog' I, [2024-05-26T10:12:11.430123 #134367] INFO -- : make[2]: Leaving directory '/home/opc/ruby/build/master/.bundle/gems/syslog-0.1.2/ext/syslog' I, [2024-05-26T10:12:11.468288 #134367] INFO -- : make[2]: Entering directory '/home/opc/ruby/build/master' I, [2024-05-26T10:12:11.553452 #134367] INFO -- : make[2]: 'ruby' is up to date. I, [2024-05-26T10:12:11.553527 #134367] INFO -- : make[2]: Leaving directory '/home/opc/ruby/build/master' I, [2024-05-26T10:12:11.553666 #134367] INFO -- : make[1]: Leaving directory '/home/opc/ruby/build/master' I, [2024-05-26T10:12:11.558165 #134367] INFO -- : make[1]: Entering directory '/home/opc/ruby/build/master' I, [2024-05-26T10:12:11.558222 #134367] INFO -- : make[1]: Nothing to be done for 'note'. I, [2024-05-26T10:12:11.558234 #134367] INFO -- : make[1]: Leaving directory '/home/opc/ruby/build/master' I, [2024-05-26T10:12:11.672795 #134367] INFO -- : Run options: I, [2024-05-26T10:12:11.672874 #134367] INFO -- : --seed=64547 I, [2024-05-26T10:12:11.672884 #134367] INFO -- : "--ruby=./miniruby -I/home/opc/ruby/src/master/lib -I. -I.ext/common /home/opc/ruby/src/master/tool/runruby.rb --extout=.ext -- --disable-gems" I, [2024-05-26T10:12:11.672893 #134367] INFO -- : --excludes-dir=/home/opc/ruby/src/master/test/.excludes I, [2024-05-26T10:12:11.672902 #134367] INFO -- : --name=!/memory_leak/ I, [2024-05-26T10:12:11.672910 #134367] INFO -- : --stderr-on-failure I, [2024-05-26T10:12:11.672918 #134367] INFO -- : -j3 I, [2024-05-26T10:12:11.672926 #134367] INFO -- : I, [2024-05-26T10:12:11.672934 #134367] INFO -- : # Running tests: I, [2024-05-26T10:12:11.672942 #134367] INFO -- : I, [2024-05-26T10:12:11.806818 #134367] INFO -- : [ 1/883] 175409=test_case_mapping I, [2024-05-26T10:12:11.814348 #134367] INFO -- : [ 2/883] 175410=test_rational I, [2024-05-26T10:12:11.815519 #134367] INFO -- : [ 3/883] 175409=test_gem_ext_cargo_builder_unit I, [2024-05-26T10:12:11.824865 #134367] INFO -- : [ 4/883] 175411=test_webauthn_listener I, [2024-05-26T10:12:11.851120 #134367] INFO -- : [ 5/883] 175410=test_ractor I, [2024-05-26T10:12:11.976620 #134367] INFO -- : [ 6/883] 175410=test_gem_resolver_api_specification I, [2024-05-26T10:12:11.997513 #134367] INFO -- : [ 7/883] 175409=test_rdoc_rubygems_hook I, [2024-05-26T10:12:12.068773 #134367] INFO -- : [ 8/883] 175411=test_date_parse I, [2024-05-26T10:12:12.093562 #134367] INFO -- : Closed file descriptor: TestDateParse#test__parse: 9 I, [2024-05-26T10:12:12.124584 #134367] INFO -- : [ 9/883] 175410=test_mdns I, [2024-05-26T10:12:12.130279 #134367] INFO -- : [ 10/883] 175410=test_open3 I, [2024-05-26T10:12:12.194402 #134367] INFO -- : [ 11/883] 175411=test_key_event_record I, [2024-05-26T10:12:12.242908 #134367] INFO -- : [ 12/883] 175411=test_svcb_https I, [2024-05-26T10:12:12.255259 #134367] INFO -- : [ 13/883] 175409=test_pkey_ec I, [2024-05-26T10:12:12.271967 #134367] INFO -- : [ 14/883] 175411=test_buffering I, [2024-05-26T10:12:12.276801 #134367] INFO -- : [ 15/883] 175411=test_arity I, [2024-05-26T10:12:12.295062 #134367] INFO -- : [ 16/883] 175409=test_thread I, [2024-05-26T10:12:12.301745 #134367] INFO -- : [ 17/883] 175409=test_unicode_escape I, [2024-05-26T10:12:12.310015 #134367] INFO -- : [ 18/883] 175411=test_switch_hitter I, [2024-05-26T10:12:12.371413 #134367] INFO -- : [ 19/883] 175411=test_default_gems I, [2024-05-26T10:12:12.380591 #134367] INFO -- : [ 20/883] 175409=test_yamldbm I, [2024-05-26T10:12:12.394172 #134367] INFO -- : [ 21/883] 175411=test_gem_spec_fetcher I, [2024-05-26T10:12:12.412673 #134367] INFO -- : [ 22/883] 175409=test_gem_commands_dependency_command I, [2024-05-26T10:12:12.507381 #134367] INFO -- : [ 23/883] 175409=test_backtrace I, [2024-05-26T10:12:12.512119 #134367] INFO -- : [ 24/883] 175409=test_gbk I, [2024-05-26T10:12:12.518526 #134367] INFO -- : [ 25/883] 175409=static_literals_test I, [2024-05-26T10:12:12.621561 #134367] INFO -- : [ 26/883] 175409=test_tree_spell_checker I, [2024-05-26T10:12:12.640451 #134367] INFO -- : [ 27/883] 175411=test_rdoc_method_attr I, [2024-05-26T10:12:12.711505 #134367] INFO -- : [ 28/883] 175409=test_enumerable I, [2024-05-26T10:12:12.734358 #134367] INFO -- : [ 29/883] 175409=test_set I, [2024-05-26T10:12:12.769292 #134367] INFO -- : [ 30/883] 175409=test_grapheme_breaks I, [2024-05-26T10:12:12.786733 #134367] INFO -- : [ 31/883] 175409=test_hash_create I, [2024-05-26T10:12:12.797653 #134367] INFO -- : [ 32/883] 175409=test_gem_resolver_lock_specification I, [2024-05-26T10:12:12.846902 #134367] INFO -- : [ 33/883] 175409=test_boolean I, [2024-05-26T10:12:12.856777 #134367] INFO -- : [ 34/883] 175409=test_queue I, [2024-05-26T10:12:12.869100 #134367] INFO -- : [ 35/883] 175409=test_gc_compact I, [2024-05-26T10:12:13.011349 #134367] INFO -- : [ 36/883] 175411=test_rdoc_i18n_locale I, [2024-05-26T10:12:13.020553 #134367] INFO -- : [ 37/883] 175411=test_dryrun I, [2024-05-26T10:12:13.039527 #134367] INFO -- : [ 38/883] 175411=test_ole_methods I, [2024-05-26T10:12:13.060326 #134367] INFO -- : [ 39/883] 175411=test_cgi_util I, [2024-05-26T10:12:13.244774 #134367] INFO -- : [ 40/883] 175411=test_gem_uri_formatter I, [2024-05-26T10:12:13.277798 #134367] INFO -- : [ 41/883] 175411=test_prettyprint I, [2024-05-26T10:12:13.292739 #134367] INFO -- : [ 42/883] 175411=test_enc_raise I, [2024-05-26T10:12:13.297588 #134367] INFO -- : [ 43/883] 175411=test_clone I, [2024-05-26T10:12:13.487034 #134367] INFO -- : [ 44/883] 175411=test_optimization I, [2024-05-26T10:12:14.953838 #134367] INFO -- : [ 45/883] 175410=test_force_exit I, [2024-05-26T10:12:15.011809 #134367] INFO -- : [ 46/883] 175410=test_data_error I, [2024-05-26T10:12:15.089939 #134367] INFO -- : [ 47/883] 175410=test_rdoc_stats I, [2024-05-26T10:12:15.322218 #134367] INFO -- : [ 48/883] 175410=test_files_sample I, [2024-05-26T10:12:15.407959 #134367] INFO -- : [ 49/883] 175410=test_rubyoptions I, [2024-05-26T10:12:15.431401 #134367] INFO -- : [ 50/883] 175409=test_shift_jis I, [2024-05-26T10:12:15.478053 #134367] INFO -- : [ 51/883] 175409=test_rdoc_store I, [2024-05-26T10:12:16.155101 #134367] INFO -- : [ 52/883] 175409=test_yield I, [2024-05-26T10:12:18.856663 #134367] INFO -- : [ 53/883] 175409=test_remote_fetch_error I, [2024-05-26T10:12:18.917611 #134367] INFO -- : [ 54/883] 175409=test_show_source I, [2024-05-26T10:12:18.979527 #134367] INFO -- : [ 55/883] 175409=regexp_test I, [2024-05-26T10:12:19.023769 #134367] INFO -- : [ 56/883] 175409=test_undef I, [2024-05-26T10:12:19.032699 #134367] INFO -- : [ 57/883] 175409=test_rdoc_generator_darkfish I, [2024-05-26T10:12:19.373435 #134367] INFO -- : [ 58/883] 175409=test_random I, [2024-05-26T10:12:19.379381 #134367] INFO -- : [ 59/883] 175409=test_gem_resolver_lock_set I, [2024-05-26T10:12:19.407126 #134367] INFO -- : [ 60/883] 175409=test_asn1 I, [2024-05-26T10:12:19.436422 #134367] INFO -- : [ 61/883] 175409=test_gem_command I, [2024-05-26T10:12:19.547177 #134367] INFO -- : [ 62/883] 175409=test_assignment I, [2024-05-26T10:12:20.457729 #134367] INFO -- : [ 63/883] 175411=test_gem_update_suggestion I, [2024-05-26T10:12:20.529395 #134367] INFO -- : .Leaked file descriptor: TestRubyOptions#test_script_from_stdin: 10 # I, [2024-05-26T10:12:20.548257 #134367] INFO -- : COMMAND PID USER FD TYPE DEVICE SIZE/OFF NODE NAME I, [2024-05-26T10:12:20.548322 #134367] INFO -- : ruby 175410 opc 10r REG 252,0 6940392 13705429 /var/lib/sss/mc/group I, [2024-05-26T10:12:20.577456 #134367] INFO -- : [ 64/883] 175411=test_gem_commands_open_command I, [2024-05-26T10:12:20.667881 #134367] INFO -- : [ 65/883] 175411=test_verbose I, [2024-05-26T10:12:20.692376 #134367] INFO -- : [ 66/883] 175411=test_normalize I, [2024-05-26T10:12:20.696640 #134367] INFO -- : [ 67/883] 175411=test_emoji_breaks I, [2024-05-26T10:12:20.703118 #134367] INFO -- : [ 68/883] 175411=test_key_actor_emacs I, [2024-05-26T10:12:20.790030 #134367] INFO -- : [ 69/883] 175409=test_gem_security I, [2024-05-26T10:12:20.849600 #134367] INFO -- : [ 70/883] 175411=test_erb I, [2024-05-26T10:12:21.043102 #134367] INFO -- : [ 71/883] 175411=test_date_ractor I, [2024-05-26T10:12:21.128537 #134367] INFO -- : [ 72/883] 175411=test_basicinstructions I, [2024-05-26T10:12:21.190614 #134367] INFO -- : [ 73/883] 175411=test_utf32 I, [2024-05-26T10:12:21.207289 #134367] INFO -- : [ 74/883] 175411=test_gem_resolver_git_specification I, [2024-05-26T10:12:21.528066 #134367] INFO -- : [ 75/883] 175411=test_rdoc_tom_doc I, [2024-05-26T10:12:21.560145 #134367] INFO -- : [ 76/883] 175411=test_gem_commands_pristine_command I, [2024-05-26T10:12:21.674168 #134367] INFO -- : [ 77/883] 175410=test_optarg I, [2024-05-26T10:12:21.810181 #134367] INFO -- : [ 78/883] 175410=test_variable I, [2024-05-26T10:12:21.897838 #134367] INFO -- : [ 79/883] 175410=test_hash I, [2024-05-26T10:12:21.911507 #134367] INFO -- : [ 80/883] 175410=test_gem_resolver_requirement_list I, [2024-05-26T10:12:21.928867 #134367] INFO -- : [ 81/883] 175410=test_arith_seq_beg_len_step I, [2024-05-26T10:12:22.087318 #134367] INFO -- : [ 82/883] 175410=test_raise_exception I, [2024-05-26T10:12:22.540127 #134367] INFO -- : [ 83/883] 175410=test_exception I, [2024-05-26T10:12:22.558768 #134367] INFO -- : [ 84/883] 175410=test_noarg I, [2024-05-26T10:12:22.674383 #134367] INFO -- : [ 85/883] 175410=test_gem_impossible_dependencies_error I, [2024-05-26T10:12:22.705176 #134367] INFO -- : [ 86/883] 175410=test_pp I, [2024-05-26T10:12:22.726119 #134367] INFO -- : .Leaked file descriptor: PPTestModule::PPFileStatTest#test_nothing_raised: 7 # I, [2024-05-26T10:12:22.751993 #134367] INFO -- : COMMAND PID USER FD TYPE DEVICE SIZE/OFF NODE NAME I, [2024-05-26T10:12:22.752061 #134367] INFO -- : ruby 175410 opc 7r REG 252,0 9253600 13705411 /var/lib/sss/mc/passwd I, [2024-05-26T10:12:22.789709 #134367] INFO -- : [ 87/883] 175410=test_rdoc_extend I, [2024-05-26T10:12:22.804940 #134367] INFO -- : [ 88/883] 175410=test_cesu8 I, [2024-05-26T10:12:22.815065 #134367] INFO -- : [ 89/883] 175410=test_shapes I, [2024-05-26T10:12:22.827542 #134367] INFO -- : [ 90/883] 175410=test_did_you_mean I, [2024-05-26T10:12:22.889184 #134367] INFO -- : [ 91/883] 175410=test_merge_keys I, [2024-05-26T10:12:22.897359 #134367] INFO -- : [ 92/883] 175410=test_storage I, [2024-05-26T10:12:22.908673 #134367] INFO -- : [ 93/883] 175410=test_method_name_check I, [2024-05-26T10:12:22.925624 #134367] INFO -- : [ 94/883] 175410=test_err_in_callback I, [2024-05-26T10:12:22.937297 #134367] INFO -- : [ 95/883] 175410=test_gem_commands_install_command I, [2024-05-26T10:12:22.967099 #134367] INFO -- : [ 96/883] 175411=test_string I, [2024-05-26T10:12:22.973911 #134367] INFO -- : [ 97/883] 175411=test_iterator I, [2024-05-26T10:12:23.067404 #134367] INFO -- : [ 98/883] 175411=pattern_test I, [2024-05-26T10:12:23.158599 #134367] INFO -- : [ 99/883] 175411=test_gem_rdoc I, [2024-05-26T10:12:23.321608 #134367] INFO -- : [100/883] 175411=test_dot_dot I, [2024-05-26T10:12:23.339212 #134367] INFO -- : [101/883] 175411=test_kernel I, [2024-05-26T10:12:23.934520 #134367] INFO -- : [102/883] 175411=test_rendering I, [2024-05-26T10:12:23.942036 #134367] INFO -- : [103/883] 175411=!Nothing_to_test I, [2024-05-26T10:12:23.943299 #134367] INFO -- : [104/883] 175411=test_fd_setsize I, [2024-05-26T10:12:23.958934 #134367] INFO -- : [105/883] 175411=test_process I, [2024-05-26T10:12:23.986190 #134367] INFO -- : [106/883] 175411=test_forwardable I, [2024-05-26T10:12:24.017841 #134367] INFO -- : [107/883] 175411=test_complex I, [2024-05-26T10:12:24.106108 #134367] INFO -- : [108/883] 175411=test_threadgroup I, [2024-05-26T10:12:24.617921 #134367] INFO -- : [109/883] 175410=test_array_create I, [2024-05-26T10:12:24.643338 #134367] INFO -- : [110/883] 175410=test_memory_view I, [2024-05-26T10:12:24.765429 #134367] INFO -- : [111/883] 175410=test_dir_m17n I, [2024-05-26T10:12:25.143356 #134367] INFO -- : [112/883] 175411=test_enc_associate I, [2024-05-26T10:12:25.713953 #134367] INFO -- : [113/883] 175411=test_enumerator I, [2024-05-26T10:12:25.944806 #134367] INFO -- : [114/883] 175410=test_case I, [2024-05-26T10:12:26.026430 #134367] INFO -- : [115/883] 175410=test_open-uri I, [2024-05-26T10:12:26.307985 #134367] INFO -- : [116/883] 175410=test_array I, [2024-05-26T10:12:26.319332 #134367] INFO -- : [117/883] 175410=test_gem_command_manager I, [2024-05-26T10:12:26.502266 #134367] INFO -- : [118/883] 175410=test_rdoc_context I, [2024-05-26T10:12:27.264648 #134367] INFO -- : [119/883] 175410=test_safe_load I, [2024-05-26T10:12:27.289998 #134367] INFO -- : [120/883] 175410=test_libs I, [2024-05-26T10:12:27.393461 #134367] INFO -- : [121/883] 175410=ripper_test I, [2024-05-26T10:12:28.026863 #134367] INFO -- : [122/883] 175410=test_iso_8859 I, [2024-05-26T10:12:28.048760 #134367] INFO -- : [123/883] 175410=test_gc I, [2024-05-26T10:12:28.057357 #134367] INFO -- : [124/883] 175410=comments_test I, [2024-05-26T10:12:28.062012 #134367] INFO -- : [125/883] 175410=test_qsort I, [2024-05-26T10:12:28.071903 #134367] INFO -- : [126/883] 175410=test_math I, [2024-05-26T10:12:28.085390 #134367] INFO -- : [127/883] 175410=test_const I, [2024-05-26T10:12:28.093846 #134367] INFO -- : [128/883] 175410=test_rdoc_parser_rd I, [2024-05-26T10:12:28.122523 #134367] INFO -- : [129/883] 175410=index_write_test I, [2024-05-26T10:12:28.266743 #134367] INFO -- : [130/883] 175410=test_class I, [2024-05-26T10:12:31.028704 #134367] INFO -- : [131/883] 175410=test_exit I, [2024-05-26T10:12:31.039351 #134367] INFO -- : [132/883] 175410=test_yaml_special_cases I, [2024-05-26T10:12:31.043600 #134367] INFO -- : [133/883] 175410=test_recorder I, [2024-05-26T10:12:31.061996 #134367] INFO -- : [134/883] 175410=json_addition_test I, [2024-05-26T10:12:31.071051 #134367] INFO -- : [135/883] 175410=test_gem_source_list I, [2024-05-26T10:12:31.136895 #134367] INFO -- : [136/883] 175410=test_name_error I, [2024-05-26T10:12:31.236138 #134367] INFO -- : [137/883] 175410=test_gem_commands_sources_command I, [2024-05-26T10:12:31.440721 #134367] INFO -- : [138/883] 175410=test_sprintf I, [2024-05-26T10:12:31.496280 #134367] INFO -- : [139/883] 175409=test_coderange I, [2024-05-26T10:12:31.526466 #134367] INFO -- : [140/883] 175409=test_weakmap I, [2024-05-26T10:12:31.645324 #134367] INFO -- : [141/883] 175410=test_inadvertent_creation I, [2024-05-26T10:12:31.743893 #134367] INFO -- : [142/883] 175410=test_ansi_with_terminfo I, [2024-05-26T10:12:31.745681 #134367] INFO -- : [143/883] 175410=test_framework I, [2024-05-26T10:12:31.783340 #134367] INFO -- : [144/883] 175410=test_pinned I, [2024-05-26T10:12:31.826646 #134367] INFO -- : [145/883] 175410=test_pack I, [2024-05-26T10:12:31.867468 #134367] INFO -- : [146/883] 175410=test_cgi_tag_helper I, [2024-05-26T10:12:31.881188 #134367] INFO -- : [147/883] 175410=test_rdoc_generator_json_index I, [2024-05-26T10:12:31.914171 #134367] INFO -- : [148/883] 175410=test_date_time I, [2024-05-26T10:12:31.923081 #134367] INFO -- : [149/883] 175410=test_nil2vtempty I, [2024-05-26T10:12:31.934449 #134367] INFO -- : [150/883] 175410=test_gem_dependency_resolution_error I, [2024-05-26T10:12:31.943768 #134367] INFO -- : [151/883] 175410=test_sleep I, [2024-05-26T10:12:33.989779 #134367] INFO -- : [152/883] 175410=test_mixed_unicode_escapes I, [2024-05-26T10:12:34.013210 #134367] INFO -- : [153/883] 175410=test_fileutils I, [2024-05-26T10:12:34.526022 #134367] INFO -- : [154/883] 175410=test_cp949 I, [2024-05-26T10:12:34.530784 #134367] INFO -- : [155/883] 175410=test_jaro_winkler I, [2024-05-26T10:12:34.535055 #134367] INFO -- : [156/883] 175410=test_condition I, [2024-05-26T10:12:34.544048 #134367] INFO -- : [157/883] 175410=test_gem_resolver_vendor_set I, [2024-05-26T10:12:34.637739 #134367] INFO -- : [158/883] 175410=test_sorted_set I, [2024-05-26T10:12:34.785065 #134367] INFO -- : [159/883] 175410=test_emoji I, [2024-05-26T10:12:34.817113 #134367] INFO -- : [160/883] 175410=test_windows_1252 I, [2024-05-26T10:12:35.011250 #134367] INFO -- : [161/883] 175410=test_stack I, [2024-05-26T10:12:35.650743 #134367] INFO -- : [162/883] 175409=test_stringchar I, [2024-05-26T10:12:35.664854 #134367] INFO -- : [163/883] 175409=warnings_test I, [2024-05-26T10:12:35.683744 #134367] INFO -- : [164/883] 175409=test_face I, [2024-05-26T10:12:35.698411 #134367] INFO -- : [165/883] 175409=test_date_attr I, [2024-05-26T10:12:35.911306 #134367] INFO -- : [166/883] 175409=test_sizeof I, [2024-05-26T10:12:35.925850 #134367] INFO -- : [167/883] 175410=test_gem_request_set_lockfile_parser I, [2024-05-26T10:12:36.071179 #134367] INFO -- : [168/883] 175410=test_gem_install_update_options I, [2024-05-26T10:12:36.202407 #134367] INFO -- : [169/883] 175410=test_econv I, [2024-05-26T10:12:37.129075 #134367] INFO -- : [170/883] 175410=test_gem_specification I, [2024-05-26T10:12:38.307608 #134367] INFO -- : [171/883] 175409=test_numhash I, [2024-05-26T10:12:38.313333 #134367] INFO -- : [172/883] 175409=test_system I, [2024-05-26T10:12:38.889844 #134367] INFO -- : [173/883] 175411=test_flush I, [2024-05-26T10:12:38.906107 #134367] INFO -- : [174/883] 175411=test_pkey_rsa I, [2024-05-26T10:12:39.173586 #134367] INFO -- : [175/883] 175411=test_win32ole_variable I, [2024-05-26T10:12:39.179156 #134367] INFO -- : [176/883] 175411=test_parse I, [2024-05-26T10:12:39.218305 #134367] INFO -- : [177/883] 175409=test_rdoc_cross_reference I, [2024-05-26T10:12:39.545501 #134367] INFO -- : [178/883] 175410=test_rdoc_class_module I, [2024-05-26T10:12:39.593939 #134367] INFO -- : [179/883] 175409=test_method_cache I, [2024-05-26T10:12:39.596599 #134367] INFO -- : [180/883] 175409=test_yaml I, [2024-05-26T10:12:39.660704 #134367] INFO -- : [181/883] 175411=test_x509name I, [2024-05-26T10:12:39.675449 #134367] INFO -- : [182/883] 175411=test_argf I, [2024-05-26T10:12:39.702260 #134367] INFO -- : [183/883] 175409=test_m17n I, [2024-05-26T10:12:39.768708 #134367] INFO -- : [184/883] 175409=test_method I, [2024-05-26T10:12:40.067735 #134367] INFO -- : [185/883] 175410=test_gem_dependency I, [2024-05-26T10:12:40.226091 #134367] INFO -- : [186/883] 175410=test_yjit I, [2024-05-26T10:12:40.252045 #134367] INFO -- : [187/883] 175410=test_gem_uninstaller I, [2024-05-26T10:12:41.612719 #134367] INFO -- : [188/883] 175410=test_cclass I, [2024-05-26T10:12:41.671462 #134367] INFO -- : [189/883] 175410=test_filter I, [2024-05-26T10:12:41.699149 #134367] INFO -- : [190/883] 175410=test_parser_events I, [2024-05-26T10:12:41.807825 #134367] INFO -- : [191/883] 175410=test_gem_remote_fetcher I, [2024-05-26T10:12:43.357728 #134367] INFO -- : [192/883] 175411=test_json_tree I, [2024-05-26T10:12:43.390910 #134367] INFO -- : [193/883] 175411=test_koi8 I, [2024-05-26T10:12:43.466449 #134367] INFO -- : [194/883] 175411=test_pkcs12 I, [2024-05-26T10:12:43.583202 #134367] INFO -- : [195/883] 175410=test_gem_package_tar_writer I, [2024-05-26T10:12:43.720141 #134367] INFO -- : [196/883] 175410=test_str2big I, [2024-05-26T10:12:43.728536 #134367] INFO -- : [197/883] 175410=test_severity I, [2024-05-26T10:12:43.741067 #134367] INFO -- : [198/883] 175410=test_ractor I, [2024-05-26T10:12:43.741671 #134367] INFO -- : [199/883] 175410=test_case I, [2024-05-26T10:12:43.744860 #134367] INFO -- : [200/883] 175410=test_utf16 I, [2024-05-26T10:12:43.774222 #134367] INFO -- : [201/883] 175410=test_http I, [2024-05-26T10:12:44.088928 #134367] INFO -- : [202/883] 175411=attribute_write_test I, [2024-05-26T10:12:44.096640 #134367] INFO -- : [203/883] 175411=test_set I, [2024-05-26T10:12:44.105398 #134367] INFO -- : [204/883] 175411=test_rdoc_markup_to_rdoc I, [2024-05-26T10:12:44.167009 #134367] INFO -- : [205/883] 175411=locals_test I, [2024-05-26T10:12:44.575817 #134367] INFO -- : [206/883] 175411=test_gem_commands_push_command I, [2024-05-26T10:12:44.979424 #134367] INFO -- : [207/883] 175409=test_sprintf_comb I, [2024-05-26T10:12:45.142378 #134367] INFO -- : [208/883] 175409=test_too_many_dummy_encodings I, [2024-05-26T10:12:45.179387 #134367] INFO -- : [209/883] 175411=test_method_cache I, [2024-05-26T10:12:45.197750 #134367] INFO -- : [210/883] 175411=test_gem_gemcutter_utilities I, [2024-05-26T10:12:45.222762 #134367] INFO -- : [211/883] 175409=test_gem_source_local I, [2024-05-26T10:12:45.441650 #134367] INFO -- : [212/883] 175409=desugar_compiler_test I, [2024-05-26T10:12:45.462199 #134367] INFO -- : [213/883] 175409=test_internal_ivar I, [2024-05-26T10:12:45.472715 #134367] INFO -- : [214/883] 175409=test_win32ole I, [2024-05-26T10:12:45.485745 #134367] INFO -- : [215/883] 175409=test_rendering I, [2024-05-26T10:12:45.500698 #134367] INFO -- : [216/883] 175409=test_tracepoint I, [2024-05-26T10:12:45.677917 #134367] INFO -- : [217/883] 175411=test_settracefunc I, [2024-05-26T10:12:45.762543 #134367] INFO -- : [218/883] 175409=test_gem_text I, [2024-05-26T10:12:45.854318 #134367] INFO -- : [219/883] 175409=test_backtrace I, [2024-05-26T10:12:46.447560 #134367] INFO -- : [220/883] 175411=test_rdoc_task I, [2024-05-26T10:12:46.490057 #134367] INFO -- : [221/883] 175411=test_gem_dependency_installer I, [2024-05-26T10:12:47.097996 #134367] INFO -- : [222/883] 175409=test_pty I, [2024-05-26T10:12:47.574522 #134367] INFO -- : [223/883] 175409=parser_test I, [2024-05-26T10:12:47.580855 #134367] INFO -- : [224/883] 175409=test_hash I, [2024-05-26T10:12:48.794681 #134367] INFO -- : [225/883] 175411=test_http I, [2024-05-26T10:12:48.812625 #134367] INFO -- : [226/883] 175411=test_gem_commands_specification_command I, [2024-05-26T10:12:48.944200 #134367] INFO -- : [227/883] 175411=test_scan_args I, [2024-05-26T10:12:48.956955 #134367] INFO -- : [228/883] 175411=encoding_test I, [2024-05-26T10:12:49.064842 #134367] INFO -- : [229/883] 175411=test_gem_package_old I, [2024-05-26T10:12:49.120538 #134367] INFO -- : [230/883] 175411=test_gem_commands_which_command I, [2024-05-26T10:12:49.154240 #134367] INFO -- : [231/883] 175411=test_gem_request I, [2024-05-26T10:12:49.369999 #134367] INFO -- : [232/883] 175411=test_big5 I, [2024-05-26T10:12:49.377057 #134367] INFO -- : [233/883] 175411=test_date I, [2024-05-26T10:12:49.423600 #134367] INFO -- : [234/883] 175411=test_gem_commands_update_command I, [2024-05-26T10:12:50.821861 #134367] INFO -- : [235/883] 175411=test_protect I, [2024-05-26T10:12:50.827142 #134367] INFO -- : [236/883] 175411=test_tree_builder I, [2024-05-26T10:12:50.834259 #134367] INFO -- : [237/883] 175411=test_store I, [2024-05-26T10:12:51.121352 #134367] INFO -- : [238/883] 175411=test_rdoc_markup_pre_process I, [2024-05-26T10:12:51.212067 #134367] INFO -- : [239/883] 175411=test_coverage I, [2024-05-26T10:12:51.369617 #134367] INFO -- : [240/883] 175409=test_tempfile I, [2024-05-26T10:12:51.565926 #134367] INFO -- : [241/883] 175409=test_http_request I, [2024-05-26T10:12:51.620977 #134367] INFO -- : [242/883] 175409=test_pathname I, [2024-05-26T10:12:51.809752 #134367] INFO -- : [243/883] 175411=test_fnmatch I, [2024-05-26T10:12:51.834360 #134367] INFO -- : [244/883] 175409=test_timeout I, [2024-05-26T10:12:51.839686 #134367] INFO -- : [245/883] 175409=test_erb_m17n I, [2024-05-26T10:12:51.844645 #134367] INFO -- : [246/883] 175409=test_rdoc_generator_pot_po_entry I, [2024-05-26T10:12:51.859556 #134367] INFO -- : [247/883] 175409=test_frozen I, [2024-05-26T10:12:51.862476 #134367] INFO -- : [248/883] 175409=test_serialize_subclasses I, [2024-05-26T10:12:51.867258 #134367] INFO -- : [249/883] 175409=test_gem_resolver_index_specification I, [2024-05-26T10:12:51.874500 #134367] INFO -- : [250/883] 175411=test_egrep_cpp I, [2024-05-26T10:12:51.922170 #134367] INFO -- : [251/883] 175409=test_rdoc_markup_verbatim I, [2024-05-26T10:12:51.937898 #134367] INFO -- : [252/883] 175409=test_webauthn_poller I, [2024-05-26T10:12:51.996015 #134367] INFO -- : [253/883] 175411=test_date_conv I, [2024-05-26T10:12:52.038869 #134367] INFO -- : [254/883] 175411=test_string_memory I, [2024-05-26T10:12:52.086050 #134367] INFO -- : [255/883] 175409=test_help I, [2024-05-26T10:12:52.111903 #134367] INFO -- : [256/883] 175409=test_files_lib I, [2024-05-26T10:12:52.116362 #134367] INFO -- : [257/883] 175411=test_marshalable I, [2024-05-26T10:12:52.123990 #134367] INFO -- : [258/883] 175411=test_line_editor I, [2024-05-26T10:12:52.130270 #134367] INFO -- : [259/883] 175411=reflection_test I, [2024-05-26T10:12:52.134174 #134367] INFO -- : [260/883] 175411=test_enumerator_kw I, [2024-05-26T10:12:52.149679 #134367] INFO -- : [261/883] 175411=test_error_highlight I, [2024-05-26T10:12:52.704230 #134367] INFO -- : [262/883] 175411=test_rdoc_any_method I, [2024-05-26T10:12:52.716915 #134367] INFO -- : [263/883] 175410=test_function_entry I, [2024-05-26T10:12:52.725787 #134367] INFO -- : [264/883] 175410=test_string I, [2024-05-26T10:12:52.744403 #134367] INFO -- : [265/883] 175410=json_common_interface_test I, [2024-05-26T10:12:52.754563 #134367] INFO -- : [266/883] 175410=version_test I, [2024-05-26T10:12:52.759844 #134367] INFO -- : [267/883] 175410=test_raise I, [2024-05-26T10:12:52.764081 #134367] INFO -- : [268/883] 175410=test_complexrational I, [2024-05-26T10:12:52.773293 #134367] INFO -- : [269/883] 175410=test_import I, [2024-05-26T10:12:53.078576 #134367] INFO -- : [270/883] 175411=test_human_typo I, [2024-05-26T10:12:53.093032 #134367] INFO -- : [271/883] 175411=test_wait I, [2024-05-26T10:12:53.149037 #134367] INFO -- : [272/883] 175411=test_nil I, [2024-05-26T10:12:53.152165 #134367] INFO -- : [273/883] 175411=test_psych I, [2024-05-26T10:12:53.195932 #134367] INFO -- : [274/883] 175411=test_cstr I, [2024-05-26T10:12:54.446285 #134367] INFO -- : [275/883] 175411=test_command I, [2024-05-26T10:12:54.672161 #134367] INFO -- : [276/883] 175410=test_euc_tw I, [2024-05-26T10:12:54.680671 #134367] INFO -- : [277/883] 175410=test_gem_resolver_dependency_request I, [2024-05-26T10:12:54.700125 #134367] INFO -- : [278/883] 175411=test_yaml_tree I, [2024-05-26T10:12:54.708148 #134367] INFO -- : [279/883] 175410=test_gem_commands_yank_command I, [2024-05-26T10:12:54.725321 #134367] INFO -- : [280/883] 175411=test_pkey_dsa I, [2024-05-26T10:12:54.852617 #134367] INFO -- : [281/883] 175409=test_logger I, [2024-05-26T10:12:54.870901 #134367] INFO -- : [282/883] 175409=test_big2str I, [2024-05-26T10:12:54.880428 #134367] INFO -- : [283/883] 175409=test_gem_resolver_specification I, [2024-05-26T10:12:54.901448 #134367] INFO -- : [284/883] 175409=test_comparable I, [2024-05-26T10:12:54.913332 #134367] INFO -- : [285/883] 175409=json_string_matching_test I, [2024-05-26T10:12:54.922546 #134367] INFO -- : [286/883] 175409=test_gem_config_file I, [2024-05-26T10:12:55.117632 #134367] INFO -- : [287/883] 175409=test_rdoc_markdown_test I, [2024-05-26T10:12:55.230737 #134367] INFO -- : [288/883] 175410=test_io_timeout I, [2024-05-26T10:12:55.242907 #134367] INFO -- : [289/883] 175410=test_rdoc_normal_module I, [2024-05-26T10:12:55.279949 #134367] INFO -- : [290/883] 175410=test_type_completor I, [2024-05-26T10:12:55.290828 #134367] INFO -- : [291/883] 175410=test_rdoc_rdoc I, [2024-05-26T10:12:55.349417 #134367] INFO -- : [292/883] 175410=test_yjit_exit_locations I, [2024-05-26T10:12:55.361217 #134367] INFO -- : [293/883] 175410=test_io_buffer I, [2024-05-26T10:12:55.423827 #134367] INFO -- : [294/883] 175410=test_thread_queue I, [2024-05-26T10:12:56.193013 #134367] INFO -- : [295/883] 175409=test_defined I, [2024-05-26T10:12:56.266159 #134367] INFO -- : [296/883] 175409=test_passing_block I, [2024-05-26T10:12:56.276636 #134367] INFO -- : [297/883] 175409=test_nowrite I, [2024-05-26T10:12:56.336751 #134367] INFO -- : [298/883] 175409=test_kdf I, [2024-05-26T10:12:56.359527 #134367] INFO -- : [299/883] 175409=test_ldap I, [2024-05-26T10:12:56.364862 #134367] INFO -- : [300/883] 175409=test_enumerator I, [2024-05-26T10:12:56.370096 #134367] INFO -- : [301/883] 175409=test_path_to_class I, [2024-05-26T10:12:56.375496 #134367] INFO -- : [302/883] 175409=test_frozen_error I, [2024-05-26T10:12:56.384653 #134367] INFO -- : [303/883] 175409=test_gem_version I, [2024-05-26T10:12:56.480466 #134367] INFO -- : [304/883] 175409=test_spell_checker I, [2024-05-26T10:12:56.492317 #134367] INFO -- : [305/883] 175409=test_gem_ext_ext_conf_builder I, [2024-05-26T10:12:57.504693 #134367] INFO -- : [306/883] 175409=test_reqarg I, [2024-05-26T10:12:57.742324 #134367] INFO -- : [307/883] 175411=test_gem_uri I, [2024-05-26T10:12:57.773769 #134367] INFO -- : [308/883] 175411=test_resource I, [2024-05-26T10:12:57.807868 #134367] INFO -- : [309/883] 175411=test_gem_package_tar_reader_entry I, [2024-05-26T10:12:57.830426 #134367] INFO -- : [310/883] 175409=test_c_struct_builder I, [2024-05-26T10:12:58.014165 #134367] INFO -- : [311/883] 175411=test_bug-5832 I, [2024-05-26T10:12:58.019568 #134367] INFO -- : [312/883] 175411=test_yield_block I, [2024-05-26T10:12:58.027351 #134367] INFO -- : [313/883] 175411=test_ubf_async_safe I, [2024-05-26T10:12:58.037738 #134367] INFO -- : [314/883] 175411=test_pstore I, [2024-05-26T10:12:58.089013 #134367] INFO -- : [315/883] 175409=test_date_compat I, [2024-05-26T10:12:58.094725 #134367] INFO -- : [316/883] 175409=test_win32ole_record I, [2024-05-26T10:12:58.108029 #134367] INFO -- : [317/883] 175409=test_rdoc_include I, [2024-05-26T10:12:58.136356 #134367] INFO -- : [318/883] 175409=test_gem_version_option I, [2024-05-26T10:12:58.217294 #134367] INFO -- : [319/883] 175409=test_gem_commands_unpack_command I, [2024-05-26T10:12:58.242238 #134367] INFO -- : [320/883] 175411=test_gem_ext_cargo_builder I, [2024-05-26T10:12:58.262835 #134367] INFO -- : [321/883] 175411=test_proc I, [2024-05-26T10:12:58.524052 #134367] INFO -- : [322/883] 175409=test_console_attr I, [2024-05-26T10:12:58.536876 #134367] INFO -- : [323/883] 175409=test_zlib I, [2024-05-26T10:12:59.133043 #134367] INFO -- : [324/883] 175411=test_rdoc_options I, [2024-05-26T10:12:59.494481 #134367] INFO -- : [325/883] 175411=test_flags I, [2024-05-26T10:12:59.964258 #134367] INFO -- : [326/883] 175411=test_yamlstore I, [2024-05-26T10:12:59.990556 #134367] INFO -- : [327/883] 175411=test_bug-3571 I, [2024-05-26T10:13:00.000995 #134367] INFO -- : [328/883] 175411=test_numeric I, [2024-05-26T10:13:00.066145 #134367] INFO -- : [329/883] 175411=test_rat I, [2024-05-26T10:13:00.079786 #134367] INFO -- : [330/883] 175411=test_gem_request_connection_pools I, [2024-05-26T10:13:00.520837 #134367] INFO -- : [331/883] 175410=test_init I, [2024-05-26T10:13:00.709473 #134367] INFO -- : [332/883] 175410=test_capacity I, [2024-05-26T10:13:00.826328 #134367] INFO -- : [333/883] 175410=test_gem_commands_owner_command I, [2024-05-26T10:13:01.138093 #134367] INFO -- : [334/883] 175411=test_nextafter I, [2024-05-26T10:13:01.216443 #134367] INFO -- : [335/883] 175411=test_file I, [2024-05-26T10:13:01.220822 #134367] INFO -- : [336/883] 175411=test_time I, [2024-05-26T10:13:01.352924 #134367] INFO -- : [337/883] 175411=test_encoding I, [2024-05-26T10:13:01.365099 #134367] INFO -- : [338/883] 175410=test_hmac I, [2024-05-26T10:13:01.422965 #134367] INFO -- : [339/883] 175410=test_constant I, [2024-05-26T10:13:01.540713 #134367] INFO -- : [340/883] 175411=test_find I, [2024-05-26T10:13:01.560016 #134367] INFO -- : [341/883] 175411=test_rdoc_generator_markup I, [2024-05-26T10:13:01.568550 #134367] INFO -- : [342/883] 175411=test_pipe I, [2024-05-26T10:13:01.689307 #134367] INFO -- : [343/883] 175411=test_macro I, [2024-05-26T10:13:01.716968 #134367] INFO -- : [344/883] 175411=test_string I, [2024-05-26T10:13:03.450732 #134367] INFO -- : [345/883] 175410=test_gem_resolver_activation_request I, [2024-05-26T10:13:03.473366 #134367] INFO -- : [346/883] 175410=test_function I, [2024-05-26T10:13:03.700724 #134367] INFO -- : [347/883] 175410=test_gem_commands_server_command I, [2024-05-26T10:13:03.710055 #134367] INFO -- : [348/883] 175410=test_gem_name_tuple I, [2024-05-26T10:13:03.730668 #134367] INFO -- : [349/883] 175410=test_rdoc_markup_to_table_of_contents I, [2024-05-26T10:13:03.828030 #134367] INFO -- : [350/883] 175410=test_integer I, [2024-05-26T10:13:03.833473 #134367] INFO -- : [351/883] 175410=test_win32ole_method_event I, [2024-05-26T10:13:03.839661 #134367] INFO -- : [352/883] 175410=test_tcp I, [2024-05-26T10:13:03.883587 #134367] INFO -- : [353/883] 175410=parse_comments_test I, [2024-05-26T10:13:03.937496 #134367] INFO -- : [354/883] 175410=test_gem_requirement I, [2024-05-26T10:13:04.080669 #134367] INFO -- : [355/883] 175410=test_len I, [2024-05-26T10:13:04.089847 #134367] INFO -- : [356/883] 175410=test_gem_doctor I, [2024-05-26T10:13:04.141555 #134367] INFO -- : [357/883] 175410=json_fixtures_test I, [2024-05-26T10:13:04.211525 #134367] INFO -- : [358/883] 175410=parse_test I, [2024-05-26T10:13:05.241283 #134367] INFO -- : [359/883] 175409=test_rdoc_parser_c I, [2024-05-26T10:13:05.577467 #134367] INFO -- : [360/883] 175409=test_kwargs I, [2024-05-26T10:13:05.585532 #134367] INFO -- : [361/883] 175409=test_pack I, [2024-05-26T10:13:05.811122 #134367] INFO -- : [362/883] 175409=test_io_wait I, [2024-05-26T10:13:06.159206 #134367] INFO -- : [363/883] 175409=test_securerandom I, [2024-05-26T10:13:06.196802 #134367] INFO -- : [364/883] 175409=test_tsort I, [2024-05-26T10:13:06.205165 #134367] INFO -- : [365/883] 175409=test_typeddata I, [2024-05-26T10:13:06.456663 #134367] INFO -- : [366/883] 175409=test_gem_commands_fetch_command I, [2024-05-26T10:13:06.661302 #134367] INFO -- : [367/883] 175409=test_rdoc_parser_changelog I, [2024-05-26T10:13:06.799262 #134367] INFO -- : [368/883] 175409=parameters_signature_test I, [2024-05-26T10:13:06.801569 #134367] INFO -- : [369/883] 175409=test_gem_commands_outdated_command I, [2024-05-26T10:13:06.868352 #134367] INFO -- : [370/883] 175409=test_gem_dependency_list I, [2024-05-26T10:13:07.063123 #134367] INFO -- : [371/883] 175409=test_rand I, [2024-05-26T10:13:07.140960 #134367] INFO -- : [372/883] 175410=test_string_processing I, [2024-05-26T10:13:07.155254 #134367] INFO -- : [373/883] 175410=test_random_formatter I, [2024-05-26T10:13:07.176330 #134367] INFO -- : [374/883] 175410=redundant_return_test I, [2024-05-26T10:13:07.176602 #134367] INFO -- : [375/883] 175410=test_rdoc_markup_attributes I, [2024-05-26T10:13:07.199993 #134367] INFO -- : [376/883] 175410=test_process I, [2024-05-26T10:13:07.347380 #134367] INFO -- : [377/883] 175409=test_rdoc_code_object I, [2024-05-26T10:13:07.667160 #134367] INFO -- : [378/883] 175409=test_gem_source_specific_file I, [2024-05-26T10:13:07.740876 #134367] INFO -- : [379/883] 175409=test_euc_kr I, [2024-05-26T10:13:07.742822 #134367] INFO -- : [380/883] 175409=test_provider I, [2024-05-26T10:13:07.751279 #134367] INFO -- : [381/883] 175409=test_bmethod I, [2024-05-26T10:13:07.760997 #134367] INFO -- : [382/883] 175409=test_rdoc_encoding I, [2024-05-26T10:13:07.798421 #134367] INFO -- : [383/883] 175409=test_win32ole_variant_outarg I, [2024-05-26T10:13:07.838398 #134367] INFO -- : [384/883] 175409=test_gem_request_set_lockfile I, [2024-05-26T10:13:08.276873 #134367] INFO -- : [385/883] 175409=test_rdoc_markdown I, [2024-05-26T10:13:08.502207 #134367] INFO -- : [386/883] 175409=test_key_actor_vi I, [2024-05-26T10:13:08.637279 #134367] INFO -- : [387/883] 175409=test_postponed_job I, [2024-05-26T10:13:08.949452 #134367] INFO -- : [388/883] 175409=test_rdoc_constant I, [2024-05-26T10:13:09.039286 #134367] INFO -- : [389/883] 175409=test_deprecate I, [2024-05-26T10:13:09.117892 #134367] INFO -- : [390/883] 175409=test_httpresponses I, [2024-05-26T10:13:09.129256 #134367] INFO -- : [391/883] 175409=test_rdoc_markup_to_html_snippet I, [2024-05-26T10:13:09.220294 #134367] INFO -- : [392/883] 175409=test_common I, [2024-05-26T10:13:09.392763 #134367] INFO -- : [393/883] 175409=test_generic I, [2024-05-26T10:13:09.417536 #134367] INFO -- : [394/883] 175409=test_objspace I, [2024-05-26T10:13:23.969554 #134367] INFO -- : [395/883] 175411=test_require I, [2024-05-26T10:13:23.979345 #134367] INFO -- : [396/883] 175411=test_stringify_symbols I, [2024-05-26T10:13:23.986308 #134367] INFO -- : [397/883] 175411=library_symbols_test I, [2024-05-26T10:13:23.999475 #134367] INFO -- : [398/883] 175411=test_rdoc_text I, [2024-05-26T10:13:24.053703 #134367] INFO -- : [399/883] 175411=test_rdoc_markup_indented_paragraph I, [2024-05-26T10:13:24.062773 #134367] INFO -- : [400/883] 175411=test_iseq_load I, [2024-05-26T10:13:25.175562 #134367] INFO -- : [401/883] 175411=test_rdoc_markup_parser I, [2024-05-26T10:13:25.241441 #134367] INFO -- : [402/883] 175411=test_ns_spki I, [2024-05-26T10:13:25.250774 #134367] INFO -- : [403/883] 175411=test_stream I, [2024-05-26T10:13:25.296246 #134367] INFO -- : [404/883] 175411=test_have_library I, [2024-05-26T10:13:25.420302 #134367] INFO -- : [405/883] 175410=test_optparse I, [2024-05-26T10:13:25.426865 #134367] INFO -- : [406/883] 175410=test_io_buffer I, [2024-05-26T10:13:25.541045 #134367] INFO -- : [407/883] 175410=test_rdoc_context_section I, [2024-05-26T10:13:25.599788 #134367] INFO -- : [408/883] 175410=test_deprecated I, [2024-05-26T10:13:25.602828 #134367] INFO -- : [409/883] 175410=test_files_test_2 I, [2024-05-26T10:13:25.608177 #134367] INFO -- : [410/883] 175410=test_div I, [2024-05-26T10:13:25.622340 #134367] INFO -- : [411/883] 175410=test_rdoc_markup_to_html_crossref I, [2024-05-26T10:13:25.912993 #134367] INFO -- : [412/883] 175410=test_exception I, [2024-05-26T10:13:26.213943 #134367] INFO -- : [413/883] 175411=test_bash_completion I, [2024-05-26T10:13:26.220165 #134367] INFO -- : [414/883] 175411=test_basicsocket I, [2024-05-26T10:13:26.235397 #134367] INFO -- : [415/883] 175411=test_zsh_completion I, [2024-05-26T10:13:26.240014 #134367] INFO -- : [416/883] 175411=test_scalar I, [2024-05-26T10:13:26.241896 #134367] INFO -- : [417/883] 175411=test_syntax I, [2024-05-26T10:13:29.551543 #134367] INFO -- : [418/883] 175410=test_class_name_check I, [2024-05-26T10:13:29.587585 #134367] INFO -- : [419/883] 175410=test_pack I, [2024-05-26T10:13:29.824215 #134367] INFO -- : [420/883] 175410=test_gem_commands_environment_command I, [2024-05-26T10:13:29.885117 #134367] INFO -- : [421/883] 175410=test_pkcs7 I, [2024-05-26T10:13:30.051265 #134367] INFO -- : [422/883] 175410=test_rdoc_markup_to_tt_only I, [2024-05-26T10:13:30.099818 #134367] INFO -- : [423/883] 175410=json_parser_test I, [2024-05-26T10:13:30.236478 #134367] INFO -- : [424/883] 175410=test_date_strftime I, [2024-05-26T10:13:30.550954 #134367] INFO -- : [425/883] 175410=test_ws I, [2024-05-26T10:13:30.558146 #134367] INFO -- : [426/883] 175410=test_gem_commands_stale_command I, [2024-05-26T10:13:30.570161 #134367] INFO -- : [427/883] 175410=ruby_parser_test I, [2024-05-26T10:13:30.578266 #134367] INFO -- : [428/883] 175410=test_gem_commands_cert_command I, [2024-05-26T10:13:32.153514 #134367] INFO -- : [429/883] 175410=test_rdoc_require I, [2024-05-26T10:13:32.300694 #134367] INFO -- : [430/883] 175410=test_gem_ext_rake_builder I, [2024-05-26T10:13:32.815447 #134367] INFO -- : [431/883] 175410=test_word I, [2024-05-26T10:13:32.822448 #134367] INFO -- : [432/883] 175410=test_singleton I, [2024-05-26T10:13:32.885789 #134367] INFO -- : [433/883] 175410=test_fstring I, [2024-05-26T10:13:32.950530 #134367] INFO -- : [434/883] 175410=test_numeric I, [2024-05-26T10:13:33.128474 #134367] INFO -- : [435/883] 175410=test_instrumentation_api I, [2024-05-26T10:13:33.895616 #134367] INFO -- : [436/883] 175411=test_weakref I, [2024-05-26T10:13:34.101234 #134367] INFO -- : [437/883] 175411=test_rdoc_alias I, [2024-05-26T10:13:34.306406 #134367] INFO -- : [438/883] 175411=test_timeout I, [2024-05-26T10:13:35.042236 #134367] INFO -- : [439/883] 175411=test_rdoc_markup_raw I, [2024-05-26T10:13:35.049464 #134367] INFO -- : [440/883] 175411=test_rdoc_markup_to_bs I, [2024-05-26T10:13:35.096435 #134367] INFO -- : [441/883] 175411=test_key_name_check I, [2024-05-26T10:13:35.104685 #134367] INFO -- : [442/883] 175411=test_data I, [2024-05-26T10:13:35.113258 #134367] INFO -- : [443/883] 175411=test_memory_view I, [2024-05-26T10:13:35.182037 #134367] INFO -- : [444/883] 175411=test_ractor I, [2024-05-26T10:13:35.186648 #134367] INFO -- : [445/883] 175411=test_null I, [2024-05-26T10:13:35.199645 #134367] INFO -- : [446/883] 175411=test_m17n_comb I, [2024-05-26T10:13:35.916795 #134367] INFO -- : [447/883] 175410=test_multi_irb_commands I, [2024-05-26T10:13:35.928697 #134367] INFO -- : [448/883] 175410=test_pkey_dh I, [2024-05-26T10:13:37.278457 #134367] INFO -- : [449/883] 175410=test_pkey I, [2024-05-26T10:13:37.283820 #134367] INFO -- : [450/883] 175410=test_external_new I, [2024-05-26T10:13:37.288879 #134367] INFO -- : [451/883] 175410=test_win32ole_typelib I, [2024-05-26T10:13:37.299246 #134367] INFO -- : [452/883] 175410=test_gem_platform I, [2024-05-26T10:13:37.417105 #134367] INFO -- : [453/883] 175410=test_gem_commands_query_command I, [2024-05-26T10:13:38.071959 #134367] INFO -- : [454/883] 175410=test_bigzero I, [2024-05-26T10:13:38.078972 #134367] INFO -- : [455/883] 175411=test_gem_unsatisfiable_dependency_error I, [2024-05-26T10:13:38.085348 #134367] INFO -- : [456/883] 175410=test_literal I, [2024-05-26T10:13:38.106619 #134367] INFO -- : [457/883] 175411=test_complex2 I, [2024-05-26T10:13:38.115205 #134367] INFO -- : [458/883] 175411=test_config I, [2024-05-26T10:13:38.170294 #134367] INFO -- : [459/883] 175411=test_gem_security_signer I, [2024-05-26T10:13:38.267458 #134367] INFO -- : [460/883] 175411=test_gem_util I, [2024-05-26T10:13:38.527633 #134367] INFO -- : [461/883] 175411=test_thread I, [2024-05-26T10:13:38.644187 #134367] INFO -- : [462/883] 175411=test_input_method I, [2024-05-26T10:13:38.651563 #134367] INFO -- : [463/883] 175410=test_rdoc_i18n_text I, [2024-05-26T10:13:38.662322 #134367] INFO -- : [464/883] 175410=test_io I, [2024-05-26T10:13:38.689441 #134367] INFO -- : [465/883] 175411=test_date_marshal I, [2024-05-26T10:13:38.848966 #134367] INFO -- : [466/883] 175411=test_have_func I, [2024-05-26T10:13:38.866779 #134367] INFO -- : [467/883] 175410=test_configuration I, [2024-05-26T10:13:38.965498 #134367] INFO -- : [468/883] 175410=test_gem_resolver_local_specification I, [2024-05-26T10:13:38.997163 #134367] INFO -- : [469/883] 175410=test_gem_commands_list_command I, [2024-05-26T10:13:39.006813 #134367] INFO -- : [470/883] 175410=test_date_new I, [2024-05-26T10:13:39.011848 #134367] INFO -- : [471/883] 175410=test_formatter I, [2024-05-26T10:13:39.019789 #134367] INFO -- : [472/883] 175410=test_udp I, [2024-05-26T10:13:39.034872 #134367] INFO -- : [473/883] 175410=test_context I, [2024-05-26T10:13:39.141100 #134367] INFO -- : [474/883] 175410=test_gem_commands_contents_command I, [2024-05-26T10:13:39.251971 #134367] INFO -- : [475/883] 175410=test_coder I, [2024-05-26T10:13:39.274612 #134367] INFO -- : [476/883] 175410=test_rdoc_servlet I, [2024-05-26T10:13:39.377658 #134367] INFO -- : [477/883] 175410=test_gem_commands_search_command I, [2024-05-26T10:13:39.395199 #134367] INFO -- : [478/883] 175410=test_symbol I, [2024-05-26T10:13:39.957417 #134367] INFO -- : [479/883] 175411=test_unix I, [2024-05-26T10:13:40.105064 #134367] INFO -- : [480/883] 175411=test_integer I, [2024-05-26T10:13:42.639432 #134367] INFO -- : [481/883] 175411=test_num2int I, [2024-05-26T10:13:42.647449 #134367] INFO -- : [482/883] 175411=test_rbconfig I, [2024-05-26T10:13:42.652877 #134367] INFO -- : [483/883] 175411=test_recursion I, [2024-05-26T10:13:42.672686 #134367] INFO -- : [484/883] 175411=test_require I, [2024-05-26T10:13:42.770802 #134367] INFO -- : [485/883] 175409=test_enum I, [2024-05-26T10:13:43.712098 #134367] INFO -- : [486/883] 175409=test_rdoc_markup_include I, [2024-05-26T10:13:43.713502 #134367] INFO -- : [487/883] 175409=test_iter_break I, [2024-05-26T10:13:43.728223 #134367] INFO -- : [488/883] 175409=test_extlibs I, [2024-05-26T10:13:43.941099 #134367] INFO -- : [489/883] 175411=test_gem_commands_signin_command I, [2024-05-26T10:13:44.111030 #134367] INFO -- : [490/883] 175411=test_range I, [2024-05-26T10:13:44.247022 #134367] INFO -- : [491/883] 175410=test_rdoc_attr I, [2024-05-26T10:13:44.253348 #134367] INFO -- : [492/883] 175410=test_address_resolve I, [2024-05-26T10:13:44.287424 #134367] INFO -- : [493/883] 175410=test_trick I, [2024-05-26T10:13:44.874490 #134367] INFO -- : [494/883] 175411=test_ractor I, [2024-05-26T10:13:44.920764 #134367] INFO -- : [495/883] 175411=test_stream I, [2024-05-26T10:13:44.923221 #134367] INFO -- : [496/883] 175411=test_ts I, [2024-05-26T10:13:45.225741 #134367] INFO -- : [497/883] 175411=test_locale I, [2024-05-26T10:13:45.253447 #134367] INFO -- : [498/883] 175411=test_gem I, [2024-05-26T10:13:45.282975 #134367] INFO -- : [499/883] 175409=test_registry I, [2024-05-26T10:13:45.298015 #134367] INFO -- : [500/883] 175409=test_ractor I, [2024-05-26T10:13:45.305811 #134367] INFO -- : [501/883] 175409=json_generator_test I, [2024-05-26T10:13:45.393587 #134367] INFO -- : [502/883] 175409=test_ansi_without_terminfo I, [2024-05-26T10:13:45.412711 #134367] INFO -- : [503/883] 175409=test_rdoc_markup_to_label I, [2024-05-26T10:13:45.477695 #134367] INFO -- : [504/883] 175409=test_parser I, [2024-05-26T10:13:45.505394 #134367] INFO -- : [505/883] 175409=test_cgi_core I, [2024-05-26T10:13:45.523763 #134367] INFO -- : [506/883] 175409=test_gem_resolver_best_set I, [2024-05-26T10:13:45.599889 #134367] INFO -- : [507/883] 175409=newline_test I, [2024-05-26T10:13:45.664878 #134367] INFO -- : [508/883] 175409=test_bignum I, [2024-05-26T10:13:46.725632 #134367] INFO -- : [509/883] 175410=test_enc_str_buf_cat I, [2024-05-26T10:13:46.727008 #134367] INFO -- : [510/883] 175410=test_marshal I, [2024-05-26T10:13:46.848745 #134367] INFO -- : Leaked file descriptor: TestGem#test_self_clear_paths: 10 # I, [2024-05-26T10:13:46.848816 #134367] INFO -- : Leaked file descriptor: TestGem#test_self_clear_paths: 11 # I, [2024-05-26T10:13:46.880541 #134367] INFO -- : COMMAND PID USER FD TYPE DEVICE SIZE/OFF NODE NAME I, [2024-05-26T10:13:46.880612 #134367] INFO -- : ruby 175411 opc 10r REG 252,0 9253600 13705411 /var/lib/sss/mc/passwd I, [2024-05-26T10:13:46.880623 #134367] INFO -- : ruby 175411 opc 11u unix 0x0000000000000000 0t0 3149900505 type=STREAM I, [2024-05-26T10:13:47.641599 #134367] INFO -- : [511/883] 175411=ractor_test I, [2024-05-26T10:13:47.697331 #134367] INFO -- : [512/883] 175411=test_ancdata I, [2024-05-26T10:13:47.729529 #134367] INFO -- : [513/883] 175411=test_nesting_parser I, [2024-05-26T10:13:47.743823 #134367] INFO -- : [514/883] 175411=test_rdoc_markup_hard_break I, [2024-05-26T10:13:47.839274 #134367] INFO -- : [515/883] 175411=test_ractor I, [2024-05-26T10:13:47.952758 #134367] INFO -- : [516/883] 175410=test_gem_resolver_conflict I, [2024-05-26T10:13:47.965411 #134367] INFO -- : [517/883] 175410=test_scheduler I, [2024-05-26T10:13:48.092801 #134367] INFO -- : [518/883] 175411=test_gem_commands_help_command I, [2024-05-26T10:13:48.132695 #134367] INFO -- : [519/883] 175410=test_ssl I, [2024-05-26T10:13:48.176935 #134367] INFO -- : [520/883] 175411=test_bug-14834 I, [2024-05-26T10:13:48.228342 #134367] INFO -- : [521/883] 175411=test_data I, [2024-05-26T10:13:48.240601 #134367] INFO -- : [522/883] 175411=test_thread I, [2024-05-26T10:13:48.260919 #134367] INFO -- : [523/883] 175410=test_inlinecache I, [2024-05-26T10:13:48.333558 #134367] INFO -- : [524/883] 175410=test_socket I, [2024-05-26T10:13:49.274637 #134367] INFO -- : [525/883] 175410=test_terminfo I, [2024-05-26T10:13:49.292725 #134367] INFO -- : [526/883] 175410=test_time_tz I, [2024-05-26T10:13:49.372410 #134367] INFO -- : [527/883] 175409=test_to_ruby I, [2024-05-26T10:13:49.386111 #134367] INFO -- : [528/883] 175409=test_addrinfo I, [2024-05-26T10:13:49.394286 #134367] INFO -- : [529/883] 175410=test_windows_1251 I, [2024-05-26T10:13:49.397749 #134367] INFO -- : [530/883] 175410=test_to_ary_concat I, [2024-05-26T10:13:49.452970 #134367] INFO -- : Leaked file descriptor: TestSocketAddrinfo#test_addrinfo_timeout: 10 # I, [2024-05-26T10:13:49.481945 #134367] INFO -- : COMMAND PID USER FD TYPE DEVICE SIZE/OFF NODE NAME I, [2024-05-26T10:13:49.482017 #134367] INFO -- : ruby 175409 opc 10u unix 0x0000000000000000 0t0 3149900760 type=STREAM I, [2024-05-26T10:13:49.538648 #134367] INFO -- : [531/883] 175409=test_history I, [2024-05-26T10:13:49.555673 #134367] INFO -- : [532/883] 175409=test_gem_ext_builder I, [2024-05-26T10:13:50.655701 #134367] INFO -- : [533/883] 175409=test_reline I, [2024-05-26T10:13:50.934720 #134367] INFO -- : [534/883] 175409=test_call I, [2024-05-26T10:13:51.094738 #134367] INFO -- : [535/883] 175409=test_ellipsize I, [2024-05-26T10:13:51.119548 #134367] INFO -- : [536/883] 175409=test_gem_commands_build_command I, [2024-05-26T10:13:51.409410 #134367] INFO -- : [537/883] 175409=test_symbol I, [2024-05-26T10:13:51.467102 #134367] INFO -- : [538/883] 175409=test_project_sanity I, [2024-05-26T10:13:51.475437 #134367] INFO -- : [539/883] 175409=test_delegate I, [2024-05-26T10:13:51.489305 #134367] INFO -- : [540/883] 175409=test_chilled I, [2024-05-26T10:13:51.506449 #134367] INFO -- : [541/883] 175409=location_test I, [2024-05-26T10:13:51.546427 #134367] INFO -- : [542/883] 175409=test_euc_jp I, [2024-05-26T10:13:51.559759 #134367] INFO -- : [543/883] 175409=test_key_stroke I, [2024-05-26T10:13:51.565256 #134367] INFO -- : [544/883] 175409=test_rdoc_markup I, [2024-05-26T10:13:51.623442 #134367] INFO -- : [545/883] 175409=test_ensured I, [2024-05-26T10:13:51.633306 #134367] INFO -- : [546/883] 175409=test_time I, [2024-05-26T10:13:51.842075 #134367] INFO -- : [547/883] 175409=test_popen_deadlock I, [2024-05-26T10:13:52.302482 #134367] INFO -- : [548/883] 175409=test_alias_and_anchor I, [2024-05-26T10:13:52.318359 #134367] INFO -- : [549/883] 175409=test_gem_resolver_index_set I, [2024-05-26T10:13:52.365351 #134367] INFO -- : [550/883] 175409=ruby_api_test I, [2024-05-26T10:13:52.517897 #134367] INFO -- : [551/883] 175409=test_webauthn_listener_response I, [2024-05-26T10:13:53.029678 #134367] INFO -- : [552/883] 175409=test_sleep I, [2024-05-26T10:13:53.047983 #134367] INFO -- : [553/883] 175410=test_pattern_matching I, [2024-05-26T10:13:53.064748 #134367] INFO -- : [554/883] 175410=constant_path_node_test I, [2024-05-26T10:13:53.071701 #134367] INFO -- : [555/883] 175410=test_set_len I, [2024-05-26T10:13:53.077719 #134367] INFO -- : [556/883] 175410=test_interned_str I, [2024-05-26T10:13:53.081243 #134367] INFO -- : [557/883] 175410=test_folderitem2_invokeverb I, [2024-05-26T10:13:53.092782 #134367] INFO -- : [558/883] 175410=test_gem_bundler_version_finder I, [2024-05-26T10:13:53.130191 #134367] INFO -- : [559/883] 175410=test_gem_request_set I, [2024-05-26T10:13:53.671375 #134367] INFO -- : [560/883] 175410=test_gc I, [2024-05-26T10:13:57.036056 #134367] INFO -- : [561/883] 175411=test_trace I, [2024-05-26T10:13:57.071268 #134367] INFO -- : [562/883] 175411=test_keyword I, [2024-05-26T10:13:57.543751 #134367] INFO -- : [563/883] 175409=test_win32ole_type_event I, [2024-05-26T10:13:57.546515 #134367] INFO -- : [564/883] 175409=test_arity I, [2024-05-26T10:13:57.553759 #134367] INFO -- : [565/883] 175409=test_gem_path_support I, [2024-05-26T10:13:57.566029 #134367] INFO -- : [566/883] 175411=test_rb_str_dup I, [2024-05-26T10:13:57.570379 #134367] INFO -- : [567/883] 175411=test_lambda I, [2024-05-26T10:13:57.619437 #134367] INFO -- : [568/883] 175409=test_scalar_scanner I, [2024-05-26T10:13:57.639825 #134367] INFO -- : [569/883] 175409=test_emitter I, [2024-05-26T10:13:57.640658 #134367] INFO -- : [570/883] 175411=test_x509ext I, [2024-05-26T10:13:57.646581 #134367] INFO -- : [571/883] 175409=bom_test I, [2024-05-26T10:13:57.654960 #134367] INFO -- : [572/883] 175411=test_helper_method I, [2024-05-26T10:13:57.664751 #134367] INFO -- : [573/883] 175409=test_summary I, [2024-05-26T10:13:57.671457 #134367] INFO -- : [574/883] 175411=test_file I, [2024-05-26T10:13:57.799708 #134367] INFO -- : [575/883] 175409=test_config I, [2024-05-26T10:13:58.115398 #134367] INFO -- : [576/883] 175409=test_append I, [2024-05-26T10:13:58.135576 #134367] INFO -- : [577/883] 175409=test_gem_resolver_installer_set I, [2024-05-26T10:13:58.385720 #134367] INFO -- : [578/883] 175409=test_rdoc_markup_to_html I, [2024-05-26T10:13:58.467940 #134367] INFO -- : [579/883] 175409=test_foreach I, [2024-05-26T10:13:58.474719 #134367] INFO -- : [580/883] 175409=test_duplicate I, [2024-05-26T10:13:58.486027 #134367] INFO -- : [581/883] 175409=test_gem_resolver_api_set I, [2024-05-26T10:13:58.547933 #134367] INFO -- : [582/883] 175409=test_helper I, [2024-05-26T10:13:58.553867 #134367] INFO -- : [583/883] 175409=test_member I, [2024-05-26T10:13:58.563268 #134367] INFO -- : [584/883] 175409=test_object I, [2024-05-26T10:13:58.573202 #134367] INFO -- : [585/883] 175409=test_addr I, [2024-05-26T10:13:58.586659 #134367] INFO -- : [586/883] 175409=test_mailto I, [2024-05-26T10:13:58.594933 #134367] INFO -- : [587/883] 175409=test_kill_ring I, [2024-05-26T10:13:58.600621 #134367] INFO -- : [588/883] 175409=test_case_options I, [2024-05-26T10:13:58.610462 #134367] INFO -- : [589/883] 175409=test_cgi_header I, [2024-05-26T10:13:58.619203 #134367] INFO -- : [590/883] 175409=test_eval I, [2024-05-26T10:13:58.861001 #134367] INFO -- : [591/883] 175409=test_monitor I, [2024-05-26T10:13:59.092278 #134367] INFO -- : [592/883] 175409=test_beginendblock I, [2024-05-26T10:13:59.481727 #134367] INFO -- : [593/883] 175409=test_pointer I, [2024-05-26T10:14:00.805089 #134367] INFO -- : [594/883] 175409=test_rdoc_normal_class I, [2024-05-26T10:14:00.845637 #134367] INFO -- : [595/883] 175409=test_within_pipe I, [2024-05-26T10:14:00.861812 #134367] INFO -- : [596/883] 175409=test_whileuntil I, [2024-05-26T10:14:00.880948 #134367] INFO -- : [597/883] 175409=test_regexp I, [2024-05-26T10:14:02.933260 #134367] INFO -- : [598/883] 175410=test_nofree I, [2024-05-26T10:14:02.939684 #134367] INFO -- : [599/883] 175410=test_buffered_io I, [2024-05-26T10:14:02.960764 #134367] INFO -- : [600/883] 175410=test_ossl I, [2024-05-26T10:14:04.026706 #134367] INFO -- : [601/883] 175411=test_bug_reporter I, [2024-05-26T10:14:04.075008 #134367] INFO -- : [602/883] 175411=test_gem_installer I, [2024-05-26T10:14:09.222519 #134367] INFO -- : [603/883] 175411=test_gem_source_subpath_problem I, [2024-05-26T10:14:09.315708 #134367] INFO -- : [604/883] 175411=test_object_references I, [2024-05-26T10:14:09.325515 #134367] INFO -- : [605/883] 175411=test_ruby_lex I, [2024-05-26T10:14:09.499926 #134367] INFO -- : [606/883] 175411=test_arith_seq_extract I, [2024-05-26T10:14:09.606815 #134367] INFO -- : [607/883] 175411=compiler_test I, [2024-05-26T10:14:09.620887 #134367] INFO -- : [608/883] 175411=test_object I, [2024-05-26T10:14:09.930217 #134367] INFO -- : [609/883] 175411=test_dln I, [2024-05-26T10:14:09.944885 #134367] INFO -- : [610/883] 175411=test_gem_resolver I, [2024-05-26T10:14:10.243941 #134367] INFO -- : [611/883] 175411=test_gem_source_vendor I, [2024-05-26T10:14:10.256906 #134367] INFO -- : [612/883] 175411=test_super I, [2024-05-26T10:14:10.605664 #134367] INFO -- : [613/883] 175410=test_color_printer I, [2024-05-26T10:14:10.644386 #134367] INFO -- : [614/883] 175410=unescape_test I, [2024-05-26T10:14:11.792689 #134367] INFO -- : [615/883] 175411=test_gem_commands_exec_command I, [2024-05-26T10:14:11.986892 #134367] INFO -- : [616/883] 175410=errors_test I, [2024-05-26T10:14:12.102366 #134367] INFO -- : [617/883] 175410=test_convertible I, [2024-05-26T10:14:13.127146 #134367] INFO -- : [618/883] 175411=test_modify_expand I, [2024-05-26T10:14:13.156409 #134367] INFO -- : [619/883] 175411=test_gem_available_set I, [2024-05-26T10:14:13.247656 #134367] INFO -- : [620/883] 175411=test_pkg_config I, [2024-05-26T10:14:13.249614 #134367] INFO -- : [621/883] 175411=test_vm_dump I, [2024-05-26T10:14:13.255952 #134367] INFO -- : [622/883] 175411=json_encoding_test I, [2024-05-26T10:14:13.321572 #134367] INFO -- : [623/883] 175411=test_func I, [2024-05-26T10:14:15.783313 #134367] INFO -- : [624/883] 175410=test_config I, [2024-05-26T10:14:15.827524 #134367] INFO -- : [625/883] 175410=test_gem_console_ui I, [2024-05-26T10:14:15.981115 #134367] INFO -- : [626/883] 175410=test_allocation I, [2024-05-26T10:14:17.829223 #134367] INFO -- : [627/883] 175411=test_ifunless I, [2024-05-26T10:14:17.835583 #134367] INFO -- : [628/883] 175411=test_insns_leaf I, [2024-05-26T10:14:17.862158 #134367] INFO -- : [629/883] 175411=test_httpresponse I, [2024-05-26T10:14:17.908951 #134367] INFO -- : [630/883] 175411=test_rdoc_parser_ruby I, [2024-05-26T10:14:18.441643 #134367] INFO -- : [631/883] 175410=test_readpartial I, [2024-05-26T10:14:18.613549 #134367] INFO -- : [632/883] 175411=test_x509req I, [2024-05-26T10:14:18.629992 #134367] INFO -- : [633/883] 175411=test_profile_frames I, [2024-05-26T10:14:18.801152 #134367] INFO -- : [634/883] 175411=test_pattern_key_name_check I, [2024-05-26T10:14:18.808772 #134367] INFO -- : [635/883] 175411=test_class2name I, [2024-05-26T10:14:18.851993 #134367] INFO -- : [636/883] 175411=test_gem_commands_cleanup_command I, [2024-05-26T10:14:18.917885 #134367] INFO -- : [637/883] 175410=test_debug I, [2024-05-26T10:14:18.937741 #134367] INFO -- : [638/883] 175410=test_refinement I, [2024-05-26T10:14:19.592677 #134367] INFO -- : [639/883] 175411=test_transcode I, [2024-05-26T10:14:19.778909 #134367] INFO -- : [640/883] 175411=test_x509crl I, [2024-05-26T10:14:19.892410 #134367] INFO -- : [641/883] 175411=test_dns I, [2024-05-26T10:14:20.337361 #134367] INFO -- : [642/883] 175411=test_c_union_entity I, [2024-05-26T10:14:20.499952 #134367] INFO -- : [643/883] 175411=test_notimplement I, [2024-05-26T10:14:20.510868 #134367] INFO -- : [644/883] 175411=test_cgi_session I, [2024-05-26T10:14:20.541929 #134367] INFO -- : [645/883] 175411=test_io_console I, [2024-05-26T10:14:23.022269 #134367] INFO -- : [646/883] 175410=test_flip I, [2024-05-26T10:14:23.049585 #134367] INFO -- : [647/883] 175410=test_rdoc_markup_heading I, [2024-05-26T10:14:23.051709 #134367] INFO -- : [648/883] 175410=test_helper I, [2024-05-26T10:14:23.076522 #134367] INFO -- : [649/883] 175410=test_compile_prism I, [2024-05-26T10:14:23.200181 #134367] INFO -- : [650/883] 175411=test_gem_commands_uninstall_command I, [2024-05-26T10:14:23.495421 #134367] INFO -- : [651/883] 175410=test_rdoc_markup_formatter I, [2024-05-26T10:14:23.506808 #134367] INFO -- : [652/883] 175410=test_win32ole_event I, [2024-05-26T10:14:23.513269 #134367] INFO -- : [653/883] 175410=test_thread_fd_close I, [2024-05-26T10:14:23.534954 #134367] INFO -- : [654/883] 175410=test_last_thread I, [2024-05-26T10:14:24.161517 #134367] INFO -- : [655/883] 175411=test_digest_extend I, [2024-05-26T10:14:24.193110 #134367] INFO -- : [656/883] 175411=test_gem_ext_cmake_builder I, [2024-05-26T10:14:24.200165 #134367] INFO -- : [657/883] 175411=test_emitter I, [2024-05-26T10:14:24.207903 #134367] INFO -- : [658/883] 175411=test_alias I, [2024-05-26T10:14:24.458551 #134367] INFO -- : [659/883] 175411=test_fips I, [2024-05-26T10:14:24.588478 #134367] INFO -- : [660/883] 175410=test_getopts I, [2024-05-26T10:14:24.590947 #134367] INFO -- : [661/883] 175410=test_cmethod I, [2024-05-26T10:14:24.604519 #134367] INFO -- : [662/883] 175410=test_float I, [2024-05-26T10:14:24.631693 #134367] INFO -- : [663/883] 175411=test_gem_stub_specification I, [2024-05-26T10:14:24.786755 #134367] INFO -- : [664/883] 175411=test_rdoc_top_level I, [2024-05-26T10:14:25.073789 #134367] INFO -- : [665/883] 175411=test_io_m17n I, [2024-05-26T10:14:26.366722 #134367] INFO -- : [666/883] 175411=test_color I, [2024-05-26T10:14:26.508143 #134367] INFO -- : [667/883] 175411=test_gem_commands_lock_command I, [2024-05-26T10:14:26.535365 #134367] INFO -- : [668/883] 175411=test_reline_key I, [2024-05-26T10:14:26.543956 #134367] INFO -- : [669/883] 175411=test_propertyputref I, [2024-05-26T10:14:26.553839 #134367] INFO -- : [670/883] 175411=test_gb18030 I, [2024-05-26T10:14:26.566206 #134367] INFO -- : [671/883] 175411=test_gem_stream_ui I, [2024-05-26T10:14:26.678140 #134367] INFO -- : [672/883] 175411=test_rdoc_generator_ri I, [2024-05-26T10:14:26.707085 #134367] INFO -- : [673/883] 175411=test_unicode_normalize I, [2024-05-26T10:14:26.832100 #134367] INFO -- : [674/883] 175410=test_omap I, [2024-05-26T10:14:26.943211 #134367] INFO -- : [675/883] 175410=test_date_strptime I, [2024-05-26T10:14:26.966395 #134367] INFO -- : [676/883] 175410=test_scanner_events I, [2024-05-26T10:14:27.019306 #134367] INFO -- : [677/883] 175410=test_ocsp I, [2024-05-26T10:14:27.119437 #134367] INFO -- : [678/883] 175410=test_ipaddr I, [2024-05-26T10:14:27.153245 #134367] INFO -- : [679/883] 175410=test_rdoc_generator_pot_po I, [2024-05-26T10:14:27.163166 #134367] INFO -- : [680/883] 175410=test_shellwords I, [2024-05-26T10:14:27.174374 #134367] INFO -- : [681/883] 175410=test_mul I, [2024-05-26T10:14:27.186669 #134367] INFO -- : [682/883] 175410=json_ext_parser_test I, [2024-05-26T10:14:27.208802 #134367] INFO -- : [683/883] 175410=test_gem_ext_configure_builder I, [2024-05-26T10:14:27.232017 #134367] INFO -- : [684/883] 175410=test_rdoc_parser_simple I, [2024-05-26T10:14:27.282954 #134367] INFO -- : [685/883] 175410=test_nonblock I, [2024-05-26T10:14:27.298876 #134367] INFO -- : [686/883] 175410=test_workspace I, [2024-05-26T10:14:27.430452 #134367] INFO -- : [687/883] 175410=test_x509attr I, [2024-05-26T10:14:27.442720 #134367] INFO -- : [688/883] 175410=test_printf I, [2024-05-26T10:14:27.453247 #134367] INFO -- : [689/883] 175410=magic_comment_test I, [2024-05-26T10:14:27.461220 #134367] INFO -- : [690/883] 175409=test_win32ole_variant I, [2024-05-26T10:14:27.466401 #134367] INFO -- : [691/883] 175409=test_cgi_modruby I, [2024-05-26T10:14:27.471814 #134367] INFO -- : [692/883] 175410=test_https_proxy I, [2024-05-26T10:14:27.479889 #134367] INFO -- : [693/883] 175409=test_rdoc_parser I, [2024-05-26T10:14:27.491548 #134367] INFO -- : [694/883] 175410=test_win32ole_param_event I, [2024-05-26T10:14:27.493488 #134367] INFO -- : [695/883] 175410=test_stat I, [2024-05-26T10:14:27.502181 #134367] INFO -- : [696/883] 175409=test_gem_commands_rebuild_command I, [2024-05-26T10:14:27.510990 #134367] INFO -- : [697/883] 175410=test_nomethod_error I, [2024-05-26T10:14:27.530929 #134367] INFO -- : [698/883] 175410=test_etc I, [2024-05-26T10:14:27.566662 #134367] INFO -- : [699/883] 175409=test_closure I, [2024-05-26T10:14:27.684813 #134367] INFO -- : [700/883] 175410=test_rubygems I, [2024-05-26T10:14:27.837831 #134367] INFO -- : [701/883] 175410=test_resolve_symbol I, [2024-05-26T10:14:27.862135 #134367] INFO -- : [702/883] 175410=test_files_test_1 I, [2024-05-26T10:14:27.865932 #134367] INFO -- : [703/883] 175410=test_dir I, [2024-05-26T10:14:28.232669 #134367] INFO -- : [704/883] 175410=test_rdoc_rd_inline I, [2024-05-26T10:14:28.243908 #134367] INFO -- : [705/883] 175410=test_path I, [2024-05-26T10:14:28.257328 #134367] INFO -- : [706/883] 175410=test_digest I, [2024-05-26T10:14:28.267184 #134367] INFO -- : [707/883] 175410=test_uncorrectable_name_check I, [2024-05-26T10:14:28.304202 #134367] INFO -- : [708/883] 175410=test_io I, [2024-05-26T10:14:30.109685 #134367] INFO -- : [709/883] 175409=test_win32ole_variant_m I, [2024-05-26T10:14:30.111137 #134367] INFO -- : [710/883] 175409=test_pair I, [2024-05-26T10:14:30.467401 #134367] INFO -- : [711/883] 175411=test_gem_commands_signout_command I, [2024-05-26T10:14:30.488151 #134367] INFO -- : [712/883] 175411=test_gem_package_tar_reader I, [2024-05-26T10:14:30.571682 #134367] INFO -- : [713/883] 175411=test_env I, [2024-05-26T10:14:33.028842 #134367] INFO -- : [714/883] 175411=command_line_test I, [2024-05-26T10:14:33.032379 #134367] INFO -- : [715/883] 175411=test_singleton_function I, [2024-05-26T10:14:33.040539 #134367] INFO -- : [716/883] 175411=test_document I, [2024-05-26T10:14:33.048669 #134367] INFO -- : [717/883] 175411=test_eval I, [2024-05-26T10:14:33.059766 #134367] INFO -- : [718/883] 175411=test_gem_safe_yaml I, [2024-05-26T10:14:33.072211 #134367] INFO -- : [719/883] 175411=test_gem_commands_setup_command I, [2024-05-26T10:14:34.030648 #134367] INFO -- : [720/883] 175411=test_history I, [2024-05-26T10:14:34.105941 #134367] INFO -- : [721/883] 175411=test_iseq I, [2024-05-26T10:14:34.563526 #134367] INFO -- : [722/883] 175411=test_parser I, [2024-05-26T10:14:34.589567 #134367] INFO -- : [723/883] 175411=test_rdoc_ri_paths I, [2024-05-26T10:14:34.636434 #134367] INFO -- : [724/883] 175411=test_primitive I, [2024-05-26T10:14:34.665442 #134367] INFO -- : [725/883] 175411=test_lazy_enumerator I, [2024-05-26T10:14:35.096836 #134367] INFO -- : [726/883] 175411=test_cgi_multipart I, [2024-05-26T10:14:35.244702 #134367] INFO -- : [727/883] 175411=test_gem_request_set_lockfile_tokenizer I, [2024-05-26T10:14:35.312567 #134367] INFO -- : [728/883] 175411=test_find_executable I, [2024-05-26T10:14:35.322259 #134367] INFO -- : [729/883] 175411=test_ractor_compatibility I, [2024-05-26T10:14:35.530262 #134367] INFO -- : [730/883] 175409=test_arithmetic_sequence I, [2024-05-26T10:14:35.547611 #134367] INFO -- : [731/883] 175409=integer_parse_test I, [2024-05-26T10:14:35.551472 #134367] INFO -- : [732/883] 175409=test_autoconf I, [2024-05-26T10:14:35.562966 #134367] INFO -- : [733/883] 175409=test_sockopt I, [2024-05-26T10:14:35.568870 #134367] INFO -- : [734/883] 175409=test_ftp I, [2024-05-26T10:14:35.608871 #134367] INFO -- : [735/883] 175409=test_install I, [2024-05-26T10:14:35.679595 #134367] INFO -- : [736/883] 175411=test_encoding I, [2024-05-26T10:14:35.702191 #134367] INFO -- : [737/883] 175411=test_rdoc_comment I, [2024-05-26T10:14:35.747238 #134367] INFO -- : [738/883] 175411=test_gem_source_fetch_problem I, [2024-05-26T10:14:35.757239 #134367] INFO -- : [739/883] 175409=test_autoload I, [2024-05-26T10:14:35.793451 #134367] INFO -- : [740/883] 175411=test_array I, [2024-05-26T10:14:40.407282 #134367] INFO -- : [741/883] 175409=test_gem_package I, [2024-05-26T10:14:41.212442 #134367] INFO -- : [742/883] 175410=test_benchmark I, [2024-05-26T10:14:41.245714 #134367] INFO -- : [743/883] 175409=test_at_exit I, [2024-05-26T10:14:41.255390 #134367] INFO -- : [744/883] 175409=test_class I, [2024-05-26T10:14:41.349014 #134367] INFO -- : [745/883] 175409=test_have_macro I, [2024-05-26T10:14:41.565720 #134367] INFO -- : [746/883] 175409=test_gem_source I, [2024-05-26T10:14:41.870484 #134367] INFO -- : [747/883] 175409=test_mkmf I, [2024-05-26T10:14:41.895104 #134367] INFO -- : [748/883] 175409=test_ripper I, [2024-05-26T10:14:42.327625 #134367] INFO -- : [749/883] 175409=test_gem_source_git I, [2024-05-26T10:14:42.976161 #134367] INFO -- : [750/883] 175410=test_lexer I, [2024-05-26T10:14:42.990752 #134367] INFO -- : [751/883] 175410=test_win32ole_method I, [2024-05-26T10:14:43.017481 #134367] INFO -- : [752/883] 175410=test_regex_casefold I, [2024-05-26T10:14:43.204838 #134367] INFO -- : [753/883] 175409=test_random I, [2024-05-26T10:14:43.220847 #134367] INFO -- : [754/883] 175409=test_files_ext I, [2024-05-26T10:14:43.226572 #134367] INFO -- : [755/883] 175409=test_stringio I, [2024-05-26T10:14:43.335927 #134367] INFO -- : [756/883] 175409=test_assembler I, [2024-05-26T10:14:43.337179 #134367] INFO -- : [757/883] 175409=test_thread_cv I, [2024-05-26T10:14:43.423247 #134367] INFO -- : [758/883] 175410=test_unicode I, [2024-05-26T10:14:43.437836 #134367] INFO -- : [759/883] 175410=test_eval_history I, [2024-05-26T10:14:43.448818 #134367] INFO -- : [760/883] 175410=dispatcher_test I, [2024-05-26T10:14:43.474546 #134367] INFO -- : [761/883] 175410=test_acceptable I, [2024-05-26T10:14:43.533898 #134367] INFO -- : [762/883] 175410=test_rdoc_single_class I, [2024-05-26T10:14:43.568319 #134367] INFO -- : [763/883] 175410=test_dup I, [2024-05-26T10:14:43.704118 #134367] INFO -- : [764/883] 175410=test_gem_local_remote_options I, [2024-05-26T10:14:43.762848 #134367] INFO -- : [765/883] 175410=test_gem_ext_cargo_builder_link_flag_converter I, [2024-05-26T10:14:43.824984 #134367] INFO -- : [766/883] 175410=heredoc_dedent_test I, [2024-05-26T10:14:43.839953 #134367] INFO -- : [767/883] 175410=test_type I, [2024-05-26T10:14:43.848024 #134367] INFO -- : [768/883] 175410=test_rdoc_token_stream I, [2024-05-26T10:14:43.876279 #134367] INFO -- : [769/883] 175410=test_mutex I, [2024-05-26T10:14:43.994493 #134367] INFO -- : [770/883] 175409=test_struct I, [2024-05-26T10:14:44.503995 #134367] INFO -- : [771/883] 175409=test_tmpdir I, [2024-05-26T10:14:44.578180 #134367] INFO -- : [772/883] 175409=test_stringscanner I, [2024-05-26T10:14:44.620670 #134367] INFO -- : [773/883] 175409=test_ractor I, [2024-05-26T10:14:44.704418 #134367] INFO -- : [774/883] 175409=test_gem_resolver_installed_specification I, [2024-05-26T10:14:44.774116 #134367] INFO -- : [775/883] 175409=test_exception_at_throwing I, [2024-05-26T10:14:44.781267 #134367] INFO -- : [776/883] 175409=test_date_arith I, [2024-05-26T10:14:44.794416 #134367] INFO -- : [777/883] 175409=test_gem_resolver_vendor_specification I, [2024-05-26T10:14:44.825790 #134367] INFO -- : [778/883] 175409=test_fiddle I, [2024-05-26T10:14:45.023702 #134367] INFO -- : [779/883] 175410=json_generic_object_test I, [2024-05-26T10:14:45.046761 #134367] INFO -- : [780/883] 175409=test_rdoc_ri_driver I, [2024-05-26T10:14:45.087795 #134367] INFO -- : [781/883] 175410=test_ractor I, [2024-05-26T10:14:45.152698 #134367] INFO -- : [782/883] 175410=test_sexp I, [2024-05-26T10:14:45.186169 #134367] INFO -- : [783/883] 175410=test_httpheader I, [2024-05-26T10:14:45.209384 #134367] INFO -- : [784/883] 175410=test_gem_safe_marshal I, [2024-05-26T10:14:45.478531 #134367] INFO -- : [785/883] 175409=test_digest I, [2024-05-26T10:14:45.963481 #134367] INFO -- : [786/883] 175410=test_signedness I, [2024-05-26T10:14:46.287386 #134367] INFO -- : [787/883] 175409=test_gem_commands_check_command I, [2024-05-26T10:14:46.385928 #134367] INFO -- : [788/883] 175409=test_gem_resolver_git_set I, [2024-05-26T10:14:46.983841 #134367] INFO -- : [789/883] 175409=test_https I, [2024-05-26T10:14:47.152109 #134367] INFO -- : [790/883] 175409=test_gem_commands_info_command I, [2024-05-26T10:14:47.163206 #134367] INFO -- : [791/883] 175409=test_object_create_start I, [2024-05-26T10:14:47.172677 #134367] INFO -- : [792/883] 175409=test_rdoc_markup_to_ansi I, [2024-05-26T10:14:47.267805 #134367] INFO -- : [793/883] 175409=test_evaluation I, [2024-05-26T10:14:47.274045 #134367] INFO -- : [794/883] 175409=test_protocol I, [2024-05-26T10:14:47.797018 #134367] INFO -- : [795/883] 175409=test_weakkeymap I, [2024-05-26T10:14:47.802729 #134367] INFO -- : [796/883] 175410=test_files_test I, [2024-05-26T10:14:47.817946 #134367] INFO -- : [797/883] 175410=test_name_error_extension I, [2024-05-26T10:14:47.842087 #134367] INFO -- : [798/883] 175410=test_gem_request_set_gem_dependency_api I, [2024-05-26T10:14:48.081744 #134367] INFO -- : [799/883] 175409=test_require_path_check I, [2024-05-26T10:14:48.140322 #134367] INFO -- : [800/883] 175410=test_bn I, [2024-05-26T10:14:48.144709 #134367] INFO -- : [801/883] 175409=test_variable_name_check I, [2024-05-26T10:14:48.160700 #134367] INFO -- : [802/883] 175410=test_irb I, [2024-05-26T10:14:48.189218 #134367] INFO -- : [803/883] 175409=test_rdoc_markup_paragraph I, [2024-05-26T10:14:48.194386 #134367] INFO -- : [804/883] 175409=test_x509cert I, [2024-05-26T10:14:48.302114 #134367] INFO -- : [805/883] 175409=test_ast I, [2024-05-26T10:14:48.476427 #134367] INFO -- : [806/883] 175410=test_logdevice I, [2024-05-26T10:14:49.524041 #134367] INFO -- : [807/883] 175410=test_ssl_session I, [2024-05-26T10:14:50.377843 #134367] INFO -- : [808/883] 175410=test_gem_package_tar_header I, [2024-05-26T10:14:50.453293 #134367] INFO -- : [809/883] 175410=test_placearg I, [2024-05-26T10:14:50.516841 #134367] INFO -- : [810/883] 175410=test_rational2 I, [2024-05-26T10:14:50.538406 #134367] INFO -- : [811/883] 175410=test_logperiod I, [2024-05-26T10:14:50.546336 #134367] INFO -- : [812/883] 175410=test_case_comprehensive I, [2024-05-26T10:14:53.894346 #134367] INFO -- : [813/883] 175411=parse_stream_test I, [2024-05-26T10:14:53.909616 #134367] INFO -- : [814/883] 175411=test_handle I, [2024-05-26T10:14:55.338717 #134367] INFO -- : [815/883] 175411=test_delete I, [2024-05-26T10:14:55.348054 #134367] INFO -- : [816/883] 175411=test_rdoc_markup_document I, [2024-05-26T10:14:55.372744 #134367] INFO -- : [817/883] 175411=test_gem_security_policy I, [2024-05-26T10:14:55.826697 #134367] INFO -- : [818/883] 175411=test_file_exhaustive I, [2024-05-26T10:15:09.714698 #134367] INFO -- : [819/883] 175411=test_completion I, [2024-05-26T10:15:10.410603 #134367] INFO -- : [820/883] 175411=test_gem_ci_detector I, [2024-05-26T10:15:10.425864 #134367] INFO -- : [821/883] 175411=test_continuation I, [2024-05-26T10:15:10.436958 #134367] INFO -- : [822/883] 175411=test_signal I, [2024-05-26T10:15:12.475277 #134367] INFO -- : [823/883] 175410=test_gem_silent_ui I, [2024-05-26T10:15:12.491546 #134367] INFO -- : [824/883] 175411=test_fixnum I, [2024-05-26T10:15:12.508925 #134367] INFO -- : [825/883] 175411=test_io_wait_uncommon I, [2024-05-26T10:15:12.528637 #134367] INFO -- : [826/883] 175411=test_rdoc_rd I, [2024-05-26T10:15:12.531948 #134367] INFO -- : [827/883] 175410=test_rdoc_markup_to_markdown I, [2024-05-26T10:15:12.540905 #134367] INFO -- : [828/883] 175411=test_rdoc_markup_to_joined_paragraph I, [2024-05-26T10:15:12.549075 #134367] INFO -- : [829/883] 175411=test_rdoc_generator_pot I, [2024-05-26T10:15:12.552413 #134367] INFO -- : [830/883] 175411=test_rdoc_rd_block_parser I, [2024-05-26T10:15:12.584874 #134367] INFO -- : [831/883] 175410=test_x509store I, [2024-05-26T10:15:12.610114 #134367] INFO -- : [832/883] 175411=test_metaclass I, [2024-05-26T10:15:12.663308 #134367] INFO -- : [833/883] 175411=test_require_lib I, [2024-05-26T10:15:13.115311 #134367] INFO -- : [834/883] 175410=test_gem_gem_runner I, [2024-05-26T10:15:13.177083 #134367] INFO -- : [835/883] 175410=test_debugger_integration I, [2024-05-26T10:15:13.199661 #134367] INFO -- : [836/883] 175410=test_my_integer I, [2024-05-26T10:15:13.214363 #134367] INFO -- : [837/883] 175410=test_gem_resolver_composed_set I, [2024-05-26T10:15:13.238325 #134367] INFO -- : [838/883] 175410=test_objectspace I, [2024-05-26T10:15:14.224999 #134367] INFO -- : [839/883] 175410=test_require I, [2024-05-26T10:15:15.774355 #134367] INFO -- : [840/883] 175411=test_option I, [2024-05-26T10:15:15.785002 #134367] INFO -- : [841/883] 175411=test_rdoc_markup_attribute_manager I, [2024-05-26T10:15:15.818903 #134367] INFO -- : [842/883] 175411=test_wss I, [2024-05-26T10:15:15.827577 #134367] INFO -- : [843/883] 175411=test_tracer I, [2024-05-26T10:15:15.834858 #134367] INFO -- : [844/883] 175411=test_not I, [2024-05-26T10:15:15.844755 #134367] INFO -- : [845/883] 175411=test_cgi_cookie I, [2024-05-26T10:15:15.862418 #134367] INFO -- : [846/883] 175411=test_gem_source_lock I, [2024-05-26T10:15:15.919213 #134367] INFO -- : [847/883] 175411=test_new I, [2024-05-26T10:15:15.930090 #134367] INFO -- : [848/883] 175411=test_cipher I, [2024-05-26T10:15:15.958661 #134367] INFO -- : [849/883] 175411=test_update I, [2024-05-26T10:15:15.966803 #134367] INFO -- : [850/883] 175411=test_rdoc_rd_inline_parser I, [2024-05-26T10:15:15.987258 #134367] INFO -- : [851/883] 175411=test_win32ole_type I, [2024-05-26T10:15:15.993102 #134367] INFO -- : [852/883] 175411=test_load I, [2024-05-26T10:15:15.995780 #134367] INFO -- : [853/883] 175411=test_rdoc_parser_markdown I, [2024-05-26T10:15:16.040824 #134367] INFO -- : [854/883] 175411=test_custom_command I, [2024-05-26T10:15:16.042941 #134367] INFO -- : [855/883] 175411=static_inspect_test I, [2024-05-26T10:15:16.069010 #134367] INFO -- : [856/883] 175411=test_struct I, [2024-05-26T10:15:16.104754 #134367] INFO -- : [857/883] 175411=test_c_struct_entry I, [2024-05-26T10:15:16.802126 #134367] INFO -- : [858/883] 175410=fuzzer_test I, [2024-05-26T10:15:16.816667 #134367] INFO -- : [859/883] 175410=test_rubyvm I, [2024-05-26T10:15:16.828369 #134367] INFO -- : [860/883] 175410=test_cparser I, [2024-05-26T10:15:17.388738 #134367] INFO -- : [861/883] 175411=test_ostruct I, [2024-05-26T10:15:17.531652 #134367] INFO -- : [862/883] 175411=test_config I, [2024-05-26T10:15:17.628632 #134367] INFO -- : [863/883] 175411=test_change_word I, [2024-05-26T10:15:17.635761 #134367] INFO -- : [864/883] 175411=test_depth_first I, [2024-05-26T10:15:17.658675 #134367] INFO -- : [865/883] 175411=test_usrmarshal I, [2024-05-26T10:15:17.890138 #134367] INFO -- : [866/883] 175411=test_gem_validator I, [2024-05-26T10:15:17.928315 #134367] INFO -- : [867/883] 175411=test_gem_source_installed I, [2024-05-26T10:15:17.943869 #134367] INFO -- : [868/883] 175411=test_gem_security_trust_dir I, [2024-05-26T10:15:18.014311 #134367] INFO -- : [869/883] 175411=test_module I, [2024-05-26T10:15:20.000917 #134367] INFO -- : [870/883] 175410=test_erb_command I, [2024-05-26T10:15:20.117374 #134367] INFO -- : [871/883] 175410=test_ssl I, [2024-05-26T10:15:22.099146 #134367] INFO -- : [872/883] 175411=test_abi I, [2024-05-26T10:15:22.210284 #134367] INFO -- : [873/883] 175411=test_bundled_ca I, [2024-05-26T10:15:23.965470 #134367] INFO -- : [874/883] 175411=test_integer_comb I, [2024-05-26T10:15:26.542914 #134367] INFO -- : [875/883] 175411=test_load I, [2024-05-26T10:15:26.569972 #134367] INFO -- : [876/883] 175411=test_resize I, [2024-05-26T10:15:26.575727 #134367] INFO -- : [877/883] 175411=test_gem_package_task I, [2024-05-26T10:15:26.594760 #134367] INFO -- : [878/883] 175411=test_lock_native_thread I, [2024-05-26T10:15:26.844237 #134367] INFO -- : [879/883] 175411=test_engine I, [2024-05-26T10:15:27.319434 #134367] INFO -- : [880/883] 175411=test_fiber I, [2024-05-26T10:15:30.616702 #134367] INFO -- : [881/883] 175410=test_gem_commands_mirror I, [2024-05-26T10:15:30.625818 #134367] INFO -- : [882/883] 175410=test_win32ole_param I, [2024-05-26T10:15:30.667853 #134367] INFO -- : [883/883] 175410=test_key_error I, [2024-05-26T10:15:33.507400 #134367] INFO -- : Finished tests in 201.848021s, 130.3060 tests/s, 46337.3728 assertions/s. I, [2024-05-26T10:15:33.511894 #134367] INFO -- : 26302 tests, 9353107 assertions, 0 failures, 0 errors, 320 skips I, [2024-05-26T10:15:33.511920 #134367] INFO -- : I, [2024-05-26T10:15:33.511931 #134367] INFO -- : ruby -v: ruby 3.4.0dev (2024-05-26T10:11:23Z master 0f9e50b8c5) [aarch64-linux] I, [2024-05-26T10:15:33.512763 #134367] INFO -- : $$$[end] "make yes-test-all TESTOPTS='--stderr-on-failure' TESTS='-j3'" exit with 0. I, [2024-05-26T10:15:33.512939 #134367] INFO -- : $$$[beg] make yes-test-rubyspec MSPECOPT='--error-output stderr --debug -j' TESTS='-j3' I, [2024-05-26T10:15:33.639795 #134367] INFO -- : BASERUBY = /usr/local/bin/ruby --disable=gems I, [2024-05-26T10:15:33.639868 #134367] INFO -- : CC = gcc I, [2024-05-26T10:15:33.639879 #134367] INFO -- : LD = ld I, [2024-05-26T10:15:33.639887 #134367] INFO -- : LDSHARED = gcc -shared I, [2024-05-26T10:15:33.639899 #134367] INFO -- : CFLAGS = -O3 -fno-fast-math -ggdb3 -Wall -Wextra -Wdeprecated-declarations -Wdiv-by-zero -Wduplicated-cond -Wimplicit-function-declaration -Wimplicit-int -Wpointer-arith -Wwrite-strings -Wold-style-definition -Wimplicit-fallthrough=0 -Wmissing-noreturn -Wno-cast-function-type -Wno-constant-logical-operand -Wno-long-long -Wno-missing-field-initializers -Wno-overlength-strings -Wno-packed-bitfield-compat -Wno-parentheses-equality -Wno-self-assign -Wno-tautological-compare -Wno-unused-parameter -Wno-unused-value -Wsuggest-attribute=format -Wsuggest-attribute=noreturn -Wunused-variable -Wmisleading-indentation -Wundef I, [2024-05-26T10:15:33.639909 #134367] INFO -- : XCFLAGS = -U_FORTIFY_SOURCE -D_FORTIFY_SOURCE=2 -fstack-protector-strong -msign-return-address=all -fno-strict-overflow -fvisibility=hidden -fexcess-precision=standard -DRUBY_EXPORT -fPIE -I. -I.ext/include/aarch64-linux -I/home/opc/ruby/src/master/include -I/home/opc/ruby/src/master -I/home/opc/ruby/src/master/prism -I/home/opc/ruby/src/master/enc/unicode/15.0.0 I, [2024-05-26T10:15:33.639918 #134367] INFO -- : CPPFLAGS = I, [2024-05-26T10:15:33.639927 #134367] INFO -- : DLDFLAGS = -Wl,--compress-debug-sections=zlib -fstack-protector-strong -pie I, [2024-05-26T10:15:33.639936 #134367] INFO -- : SOLIBS = -lz -lrt -lrt -ldl -lcrypt -lm -lpthread I, [2024-05-26T10:15:33.639944 #134367] INFO -- : LANG = en_US.UTF-8 I, [2024-05-26T10:15:33.639952 #134367] INFO -- : LC_ALL = I, [2024-05-26T10:15:33.639960 #134367] INFO -- : LC_CTYPE = I, [2024-05-26T10:15:33.639968 #134367] INFO -- : MFLAGS = I, [2024-05-26T10:15:33.639976 #134367] INFO -- : RUSTC = rustc I, [2024-05-26T10:15:33.639984 #134367] INFO -- : YJIT_RUSTC_ARGS = --crate-name=yjit --crate-type=staticlib --edition=2021 -g -C lto=thin -C opt-level=3 -C overflow-checks=on '--out-dir=/home/opc/ruby/build/master/yjit/target/release/' /home/opc/ruby/src/master/yjit/src/lib.rs I, [2024-05-26T10:15:33.640669 #134367] INFO -- : gcc (GCC) 8.5.0 20210514 (Red Hat 8.5.0-10.1.0.1) I, [2024-05-26T10:15:33.640688 #134367] INFO -- : Copyright (C) 2018 Free Software Foundation, Inc. I, [2024-05-26T10:15:33.640698 #134367] INFO -- : This is free software; see the source for copying conditions. There is NO I, [2024-05-26T10:15:33.640706 #134367] INFO -- : warranty; not even for MERCHANTABILITY or FITNESS FOR A PARTICULAR PURPOSE. I, [2024-05-26T10:15:33.640715 #134367] INFO -- : I, [2024-05-26T10:15:33.642688 #134367] INFO -- : generating enc.mk I, [2024-05-26T10:15:33.873633 #134367] INFO -- : generating encdb.h I, [2024-05-26T10:15:33.910619 #134367] INFO -- : encdb.h unchanged I, [2024-05-26T10:15:33.911903 #134367] INFO -- : making enc I, [2024-05-26T10:15:33.939110 #134367] INFO -- : make[1]: Entering directory '/home/opc/ruby/build/master' I, [2024-05-26T10:15:33.939151 #134367] INFO -- : make[1]: Nothing to be done for 'enc'. I, [2024-05-26T10:15:33.939162 #134367] INFO -- : make[1]: Leaving directory '/home/opc/ruby/build/master' I, [2024-05-26T10:15:33.939937 #134367] INFO -- : making srcs under enc I, [2024-05-26T10:15:33.982265 #134367] INFO -- : make[1]: Entering directory '/home/opc/ruby/build/master' I, [2024-05-26T10:15:33.982322 #134367] INFO -- : make[1]: Nothing to be done for 'srcs'. I, [2024-05-26T10:15:33.982333 #134367] INFO -- : make[1]: Leaving directory '/home/opc/ruby/build/master' I, [2024-05-26T10:15:33.983419 #134367] INFO -- : generating transdb.h I, [2024-05-26T10:15:34.127996 #134367] INFO -- : transdb.h unchanged I, [2024-05-26T10:15:34.129326 #134367] INFO -- : making trans I, [2024-05-26T10:15:34.178170 #134367] INFO -- : make[1]: Entering directory '/home/opc/ruby/build/master' I, [2024-05-26T10:15:34.178209 #134367] INFO -- : make[1]: Nothing to be done for 'trans'. I, [2024-05-26T10:15:34.178219 #134367] INFO -- : make[1]: Leaving directory '/home/opc/ruby/build/master' I, [2024-05-26T10:15:34.178987 #134367] INFO -- : making encs I, [2024-05-26T10:15:34.231364 #134367] INFO -- : make[1]: Entering directory '/home/opc/ruby/build/master' I, [2024-05-26T10:15:34.231425 #134367] INFO -- : make[1]: Nothing to be done for 'encs'. I, [2024-05-26T10:15:34.231434 #134367] INFO -- : make[1]: Leaving directory '/home/opc/ruby/build/master' I, [2024-05-26T10:15:34.233480 #134367] INFO -- : generating makefiles ext/configure-ext.mk I, [2024-05-26T10:15:34.273676 #134367] INFO -- : ext/configure-ext.mk updated I, [2024-05-26T10:15:34.276785 #134367] INFO -- : make[1]: Entering directory '/home/opc/ruby/build/master' I, [2024-05-26T10:15:36.418474 #134367] INFO -- : make[1]: Leaving directory '/home/opc/ruby/build/master' I, [2024-05-26T10:15:36.419184 #134367] INFO -- : generating makefile exts.mk I, [2024-05-26T10:15:36.477438 #134367] INFO -- : exts.mk unchanged I, [2024-05-26T10:15:36.482594 #134367] INFO -- : make[1]: Entering directory '/home/opc/ruby/build/master' I, [2024-05-26T10:15:36.777808 #134367] INFO -- : make[2]: Entering directory '/home/opc/ruby/build/master/ext/coverage' I, [2024-05-26T10:15:36.782408 #134367] INFO -- : make[2]: Leaving directory '/home/opc/ruby/build/master/ext/coverage' I, [2024-05-26T10:15:36.788308 #134367] INFO -- : make[2]: Entering directory '/home/opc/ruby/build/master/ext/date' I, [2024-05-26T10:15:36.793517 #134367] INFO -- : make[2]: Leaving directory '/home/opc/ruby/build/master/ext/date' I, [2024-05-26T10:15:36.796774 #134367] INFO -- : make[2]: Entering directory '/home/opc/ruby/build/master/ext/digest' I, [2024-05-26T10:15:36.805475 #134367] INFO -- : make[2]: Leaving directory '/home/opc/ruby/build/master/ext/digest' I, [2024-05-26T10:15:36.827699 #134367] INFO -- : make[2]: Entering directory '/home/opc/ruby/build/master/ext/digest/sha2' I, [2024-05-26T10:15:36.832585 #134367] INFO -- : make[2]: Leaving directory '/home/opc/ruby/build/master/ext/digest/sha2' I, [2024-05-26T10:15:36.850502 #134367] INFO -- : make[2]: Entering directory '/home/opc/ruby/build/master/ext/fiddle' I, [2024-05-26T10:15:36.860666 #134367] INFO -- : make[2]: Leaving directory '/home/opc/ruby/build/master/ext/fiddle' I, [2024-05-26T10:15:36.864965 #134367] INFO -- : make[2]: Entering directory '/home/opc/ruby/build/master/ext/io/console' I, [2024-05-26T10:15:36.869260 #134367] INFO -- : make[2]: Leaving directory '/home/opc/ruby/build/master/ext/io/console' I, [2024-05-26T10:15:36.880444 #134367] INFO -- : make[2]: Entering directory '/home/opc/ruby/build/master/ext/json' I, [2024-05-26T10:15:36.889884 #134367] INFO -- : make[2]: Leaving directory '/home/opc/ruby/build/master/ext/json' I, [2024-05-26T10:15:36.903098 #134367] INFO -- : make[2]: Entering directory '/home/opc/ruby/build/master/ext/monitor' I, [2024-05-26T10:15:36.907252 #134367] INFO -- : make[2]: Leaving directory '/home/opc/ruby/build/master/ext/monitor' I, [2024-05-26T10:15:36.913247 #134367] INFO -- : make[2]: Entering directory '/home/opc/ruby/build/master/ext/objspace' I, [2024-05-26T10:15:36.919175 #134367] INFO -- : make[2]: Leaving directory '/home/opc/ruby/build/master/ext/objspace' I, [2024-05-26T10:15:36.937974 #134367] INFO -- : make[2]: Entering directory '/home/opc/ruby/build/master/ext/openssl' I, [2024-05-26T10:15:36.960384 #134367] INFO -- : make[2]: Leaving directory '/home/opc/ruby/build/master/ext/openssl' I, [2024-05-26T10:15:36.964496 #134367] INFO -- : make[2]: Entering directory '/home/opc/ruby/build/master/ext/pathname' I, [2024-05-26T10:15:36.968809 #134367] INFO -- : make[2]: Leaving directory '/home/opc/ruby/build/master/ext/pathname' I, [2024-05-26T10:15:36.974972 #134367] INFO -- : make[2]: Entering directory '/home/opc/ruby/build/master/ext/psych' I, [2024-05-26T10:15:36.996279 #134367] INFO -- : make[2]: Leaving directory '/home/opc/ruby/build/master/ext/psych' I, [2024-05-26T10:15:37.000773 #134367] INFO -- : make[2]: Entering directory '/home/opc/ruby/build/master/ext/pty' I, [2024-05-26T10:15:37.004984 #134367] INFO -- : make[2]: Leaving directory '/home/opc/ruby/build/master/ext/pty' I, [2024-05-26T10:15:37.018264 #134367] INFO -- : make[2]: Entering directory '/home/opc/ruby/build/master/ext/ripper' I, [2024-05-26T10:15:37.026464 #134367] INFO -- : make[2]: Leaving directory '/home/opc/ruby/build/master/ext/ripper' I, [2024-05-26T10:15:37.028483 #134367] INFO -- : make[2]: Entering directory '/home/opc/ruby/build/master/ext/rubyvm' I, [2024-05-26T10:15:37.031996 #134367] INFO -- : make[2]: Leaving directory '/home/opc/ruby/build/master/ext/rubyvm' I, [2024-05-26T10:15:37.043976 #134367] INFO -- : make[2]: Entering directory '/home/opc/ruby/build/master/ext/socket' I, [2024-05-26T10:15:37.054737 #134367] INFO -- : make[2]: Leaving directory '/home/opc/ruby/build/master/ext/socket' I, [2024-05-26T10:15:37.070268 #134367] INFO -- : make[2]: Entering directory '/home/opc/ruby/build/master/.bundle/gems/bigdecimal-3.1.7/ext/bigdecimal' I, [2024-05-26T10:15:37.100778 #134367] INFO -- : make[2]: Leaving directory '/home/opc/ruby/build/master/.bundle/gems/bigdecimal-3.1.7/ext/bigdecimal' I, [2024-05-26T10:15:37.103484 #134367] INFO -- : make[2]: Entering directory '/home/opc/ruby/build/master/.bundle/gems/bigdecimal-3.1.8/ext/bigdecimal' I, [2024-05-26T10:15:37.133725 #134367] INFO -- : make[2]: Leaving directory '/home/opc/ruby/build/master/.bundle/gems/bigdecimal-3.1.8/ext/bigdecimal' I, [2024-05-26T10:15:37.136266 #134367] INFO -- : make[2]: Entering directory '/home/opc/ruby/build/master/.bundle/gems/debug-1.9.2/ext/debug' I, [2024-05-26T10:15:37.166369 #134367] INFO -- : make[2]: Leaving directory '/home/opc/ruby/build/master/.bundle/gems/debug-1.9.2/ext/debug' I, [2024-05-26T10:15:37.168860 #134367] INFO -- : make[2]: Entering directory '/home/opc/ruby/build/master/.bundle/gems/nkf-0.2.0/ext/nkf' I, [2024-05-26T10:15:37.198895 #134367] INFO -- : make[2]: Leaving directory '/home/opc/ruby/build/master/.bundle/gems/nkf-0.2.0/ext/nkf' I, [2024-05-26T10:15:37.201547 #134367] INFO -- : make[2]: Entering directory '/home/opc/ruby/build/master/.bundle/gems/racc-1.7.3/ext/racc/cparse' I, [2024-05-26T10:15:37.232311 #134367] INFO -- : make[2]: Leaving directory '/home/opc/ruby/build/master/.bundle/gems/racc-1.7.3/ext/racc/cparse' I, [2024-05-26T10:15:37.234884 #134367] INFO -- : make[2]: Entering directory '/home/opc/ruby/build/master/.bundle/gems/racc-1.8.0/ext/racc/cparse' I, [2024-05-26T10:15:37.265353 #134367] INFO -- : make[2]: Leaving directory '/home/opc/ruby/build/master/.bundle/gems/racc-1.8.0/ext/racc/cparse' I, [2024-05-26T10:15:37.268335 #134367] INFO -- : make[2]: Entering directory '/home/opc/ruby/build/master/.bundle/gems/rbs-3.4.4/ext/rbs_extension' I, [2024-05-26T10:15:37.299105 #134367] INFO -- : make[2]: Leaving directory '/home/opc/ruby/build/master/.bundle/gems/rbs-3.4.4/ext/rbs_extension' I, [2024-05-26T10:15:37.301701 #134367] INFO -- : make[2]: Entering directory '/home/opc/ruby/build/master/.bundle/gems/syslog-0.1.2/ext/syslog' I, [2024-05-26T10:15:37.332082 #134367] INFO -- : make[2]: Leaving directory '/home/opc/ruby/build/master/.bundle/gems/syslog-0.1.2/ext/syslog' I, [2024-05-26T10:15:37.370495 #134367] INFO -- : make[2]: Entering directory '/home/opc/ruby/build/master' I, [2024-05-26T10:15:37.452382 #134367] INFO -- : make[2]: 'ruby' is up to date. I, [2024-05-26T10:15:37.452452 #134367] INFO -- : make[2]: Leaving directory '/home/opc/ruby/build/master' I, [2024-05-26T10:15:37.452588 #134367] INFO -- : make[1]: Leaving directory '/home/opc/ruby/build/master' I, [2024-05-26T10:15:37.457047 #134367] INFO -- : make[1]: Entering directory '/home/opc/ruby/build/master' I, [2024-05-26T10:15:37.457076 #134367] INFO -- : make[1]: Nothing to be done for 'note'. I, [2024-05-26T10:15:37.457086 #134367] INFO -- : make[1]: Leaving directory '/home/opc/ruby/build/master' E, [2024-05-26T10:15:37.533596 #134367] ERROR -- : $ /home/opc/ruby/build/master/miniruby -I/home/opc/ruby/src/master/lib /home/opc/ruby/src/master/tool/runruby.rb --archdir=/home/opc/ruby/build/master --extout=.ext -- /home/opc/ruby/src/master/spec/mspec/bin/mspec-run -B /home/opc/ruby/src/master/spec/default.mspec --error-output stderr --debug -fy -o /tmp/rubytest.zbr70d/1-mspec-multi-0 E, [2024-05-26T10:15:37.533975 #134367] ERROR -- : $ /home/opc/ruby/build/master/miniruby -I/home/opc/ruby/src/master/lib /home/opc/ruby/src/master/tool/runruby.rb --archdir=/home/opc/ruby/build/master --extout=.ext -- /home/opc/ruby/src/master/spec/mspec/bin/mspec-run -B /home/opc/ruby/src/master/spec/default.mspec --error-output stderr --debug -fy -o /tmp/rubytest.zbr70d/2-mspec-multi-1 E, [2024-05-26T10:15:37.534232 #134367] ERROR -- : $ /home/opc/ruby/build/master/miniruby -I/home/opc/ruby/src/master/lib /home/opc/ruby/src/master/tool/runruby.rb --archdir=/home/opc/ruby/build/master --extout=.ext -- /home/opc/ruby/src/master/spec/mspec/bin/mspec-run -B /home/opc/ruby/src/master/spec/default.mspec --error-output stderr --debug -fy -o /tmp/rubytest.zbr70d/3-mspec-multi-2 I, [2024-05-26T10:15:37.669720 #134367] INFO -- : ruby 3.4.0dev (2024-05-26T10:11:23Z master 0f9e50b8c5) [aarch64-linux] I, [2024-05-26T10:15:43.147006 #134367] INFO -- : 0 ......................................................................... I, [2024-05-26T10:15:45.470785 #134367] INFO -- : 73 ......................................................................... I, [2024-05-26T10:15:45.648269 #134367] INFO -- : 146 ......................................................................... I, [2024-05-26T10:15:45.944274 #134367] INFO -- : 219 ......................................................................... I, [2024-05-26T10:15:46.107598 #134367] INFO -- : 292 ......................................................................... I, [2024-05-26T10:15:46.343951 #134367] INFO -- : 365 ......................................................................... I, [2024-05-26T10:15:46.464931 #134367] INFO -- : 438 ......................................................................... I, [2024-05-26T10:15:46.524566 #134367] INFO -- : 511 ......................................................................... I, [2024-05-26T10:15:46.586445 #134367] INFO -- : 584 ......................................................................... I, [2024-05-26T10:15:47.197205 #134367] INFO -- : 657 ......................................................................... I, [2024-05-26T10:15:47.308876 #134367] INFO -- : 730 ......................................................................... I, [2024-05-26T10:15:47.361018 #134367] INFO -- : 803 ......................................................................... I, [2024-05-26T10:15:47.553712 #134367] INFO -- : 876 ......................................................................... I, [2024-05-26T10:15:47.662555 #134367] INFO -- : 949 ......................................................................... I, [2024-05-26T10:15:48.321668 #134367] INFO -- : 1022 ......................................................................... I, [2024-05-26T10:15:50.660838 #134367] INFO -- : 1095 ......................................................................... I, [2024-05-26T10:15:51.501483 #134367] INFO -- : 1168 ......................................................................... I, [2024-05-26T10:15:51.658832 #134367] INFO -- : 1241 ......................................................................... I, [2024-05-26T10:15:51.877450 #134367] INFO -- : 1314 ......................................................................... I, [2024-05-26T10:15:51.970004 #134367] INFO -- : 1387 ......................................................................... I, [2024-05-26T10:15:53.990997 #134367] INFO -- : 1460 ......................................................................... I, [2024-05-26T10:15:57.325302 #134367] INFO -- : 1533 ......................................................................... I, [2024-05-26T10:15:57.482753 #134367] INFO -- : 1606 ......................................................................... I, [2024-05-26T10:15:58.303043 #134367] INFO -- : 1679 ......................................................................... I, [2024-05-26T10:15:58.620619 #134367] INFO -- : 1752 ......................................................................... I, [2024-05-26T10:15:58.885339 #134367] INFO -- : 1825 ......................................................................... I, [2024-05-26T10:15:59.214708 #134367] INFO -- : 1898 ......................................................................... I, [2024-05-26T10:15:59.616936 #134367] INFO -- : 1971 ......................................................................... I, [2024-05-26T10:16:00.144731 #134367] INFO -- : 2044 ......................................................................... I, [2024-05-26T10:16:00.232779 #134367] INFO -- : 2117 ......................................................................... I, [2024-05-26T10:16:00.295532 #134367] INFO -- : 2190 ......................................................................... I, [2024-05-26T10:16:00.346092 #134367] INFO -- : 2263 ......................................................................... I, [2024-05-26T10:16:00.394565 #134367] INFO -- : 2336 ......................................................................... I, [2024-05-26T10:16:00.486400 #134367] INFO -- : 2409 ......................................................................... I, [2024-05-26T10:16:00.759078 #134367] INFO -- : 2482 ......................................................................... I, [2024-05-26T10:16:00.901653 #134367] INFO -- : 2555 ......................................................................... I, [2024-05-26T10:16:02.191668 #134367] INFO -- : 2628 ......................................................................... I, [2024-05-26T10:16:02.358412 #134367] INFO -- : 2701 ......................................................................... I, [2024-05-26T10:16:02.499220 #134367] INFO -- : 2774 ......................................................................... I, [2024-05-26T10:16:02.811471 #134367] INFO -- : 2847 ......................................................................... I, [2024-05-26T10:16:03.086287 #134367] INFO -- : 2920 ......................................................................... I, [2024-05-26T10:16:03.213511 #134367] INFO -- : 2993 ......................................................................... I, [2024-05-26T10:16:03.286610 #134367] INFO -- : 3066 ......................................................................... I, [2024-05-26T10:16:03.329264 #134367] INFO -- : 3139 ......................................................................... I, [2024-05-26T10:16:03.399266 #134367] INFO -- : 3212 ......................................................................... I, [2024-05-26T10:16:03.472167 #134367] INFO -- : 3285 ......................................................................... I, [2024-05-26T10:16:07.293072 #134367] INFO -- : 3358 ......................................................................... I, [2024-05-26T10:16:07.314594 #134367] INFO -- : I, [2024-05-26T10:16:07.314654 #134367] INFO -- : I, [2024-05-26T10:16:07.314665 #134367] INFO -- : Finished in 29.781022 seconds I, [2024-05-26T10:16:07.314675 #134367] INFO -- : I, [2024-05-26T10:16:07.314684 #134367] INFO -- : 3430 files, 32648 examples, 183168 expectations, 0 failures, 0 errors, 0 tagged I, [2024-05-26T10:16:07.315940 #134367] INFO -- : $$$[end] "make yes-test-rubyspec MSPECOPT='--error-output stderr --debug -j' TESTS='-j3'" exit with 0.