# Logfile created on 2024-05-26 09:21:38 +0000 by logger.rb/v1.5.3 I, [2024-05-26T09:21:38.531517 #2127198] INFO -- : #, @formatter=nil, @logdev=#, @binmode=false, @mon_data=#, @mon_data_owner_object_id=860>>> I, [2024-05-26T09:21:38.531822 #2127198] INFO -- : $$$[beg] make update-unicode -j3 I, [2024-05-26T09:21:38.623390 #2127198] INFO -- : Downloading Unicode emoji 15.0 files... I, [2024-05-26T09:21:38.623520 #2127198] INFO -- : Downloading Unicode emoji 15.0 files... I, [2024-05-26T09:21:38.623895 #2127198] INFO -- : Downloading Unicode emoji 15.0 files... I, [2024-05-26T09:21:38.701433 #2127198] INFO -- : made symlink emoji/15.0/emoji-sequences.txt to /home/opc/ruby/src/master/.downloaded-cache/emoji/15.0/emoji-sequences.txt I, [2024-05-26T09:21:38.701655 #2127198] INFO -- : downloading emoji/15.0/emoji-test.txt ... /home/opc/ruby/src/master/enc/unicode/data/emoji/15.0/emoji-sequences.txt already exists I, [2024-05-26T09:21:38.709911 #2127198] INFO -- : downloading emoji/15.0/emoji-test.txt ... /home/opc/ruby/src/master/enc/unicode/data/emoji/15.0/emoji-sequences.txt already exists E, [2024-05-26T09:21:39.151601 #2127198] ERROR -- : /home/opc/ruby/src/master/tool/downloader.rb:302:in `rescue in download': failed to download emoji/15.0/emoji-test.txt (RuntimeError) E, [2024-05-26T09:21:39.151673 #2127198] ERROR -- : OpenURI::HTTPError: 403 Forbidden: https://www.unicode.org/Public/emoji/15.0/emoji-test.txt E, [2024-05-26T09:21:39.151684 #2127198] ERROR -- : from /home/opc/ruby/src/master/tool/downloader.rb:201:in `download' E, [2024-05-26T09:21:39.151694 #2127198] ERROR -- : from /home/opc/ruby/src/master/tool/downloader.rb:136:in `download' E, [2024-05-26T09:21:39.151703 #2127198] ERROR -- : from /home/opc/ruby/src/master/tool/downloader.rb:482:in `block in
' E, [2024-05-26T09:21:39.151712 #2127198] ERROR -- : from /home/opc/ruby/src/master/tool/downloader.rb:465:in `each' E, [2024-05-26T09:21:39.151721 #2127198] ERROR -- : from /home/opc/ruby/src/master/tool/downloader.rb:465:in `
' E, [2024-05-26T09:21:39.151729 #2127198] ERROR -- : /usr/local/lib/ruby/3.2.0/open-uri.rb:369:in `open_http': 403 Forbidden (OpenURI::HTTPError) E, [2024-05-26T09:21:39.151738 #2127198] ERROR -- : from /usr/local/lib/ruby/3.2.0/open-uri.rb:760:in `buffer_open' E, [2024-05-26T09:21:39.151746 #2127198] ERROR -- : from /usr/local/lib/ruby/3.2.0/open-uri.rb:214:in `block in open_loop' E, [2024-05-26T09:21:39.151755 #2127198] ERROR -- : from /usr/local/lib/ruby/3.2.0/open-uri.rb:212:in `catch' E, [2024-05-26T09:21:39.151764 #2127198] ERROR -- : from /usr/local/lib/ruby/3.2.0/open-uri.rb:212:in `open_loop' E, [2024-05-26T09:21:39.151772 #2127198] ERROR -- : from /usr/local/lib/ruby/3.2.0/open-uri.rb:153:in `open_uri' E, [2024-05-26T09:21:39.151780 #2127198] ERROR -- : from /usr/local/lib/ruby/3.2.0/open-uri.rb:740:in `open' E, [2024-05-26T09:21:39.151793 #2127198] ERROR -- : from /usr/local/lib/ruby/3.2.0/open-uri.rb:748:in `read' E, [2024-05-26T09:21:39.151801 #2127198] ERROR -- : from /home/opc/ruby/src/master/tool/downloader.rb:247:in `block in download' E, [2024-05-26T09:21:39.151810 #2127198] ERROR -- : from /home/opc/ruby/src/master/tool/downloader.rb:378:in `with_retry' E, [2024-05-26T09:21:39.151819 #2127198] ERROR -- : from /home/opc/ruby/src/master/tool/downloader.rb:246:in `download' E, [2024-05-26T09:21:39.151827 #2127198] ERROR -- : from /home/opc/ruby/src/master/tool/downloader.rb:136:in `download' E, [2024-05-26T09:21:39.151836 #2127198] ERROR -- : from /home/opc/ruby/src/master/tool/downloader.rb:482:in `block in
' E, [2024-05-26T09:21:39.151845 #2127198] ERROR -- : from /home/opc/ruby/src/master/tool/downloader.rb:465:in `each' E, [2024-05-26T09:21:39.151853 #2127198] ERROR -- : from /home/opc/ruby/src/master/tool/downloader.rb:465:in `
' E, [2024-05-26T09:21:39.153804 #2127198] ERROR -- : /home/opc/ruby/src/master/tool/downloader.rb:302:in `rescue in download': failed to download emoji/15.0/emoji-test.txt (RuntimeError) E, [2024-05-26T09:21:39.153846 #2127198] ERROR -- : OpenURI::HTTPError: 403 Forbidden: https://www.unicode.org/Public/emoji/15.0/emoji-test.txt E, [2024-05-26T09:21:39.153858 #2127198] ERROR -- : from /home/opc/ruby/src/master/tool/downloader.rb:201:in `download' E, [2024-05-26T09:21:39.153867 #2127198] ERROR -- : from /home/opc/ruby/src/master/tool/downloader.rb:136:in `download' E, [2024-05-26T09:21:39.153877 #2127198] ERROR -- : from /home/opc/ruby/src/master/tool/downloader.rb:482:in `block in
' E, [2024-05-26T09:21:39.153886 #2127198] ERROR -- : from /home/opc/ruby/src/master/tool/downloader.rb:465:in `each' E, [2024-05-26T09:21:39.153895 #2127198] ERROR -- : from /home/opc/ruby/src/master/tool/downloader.rb:465:in `
' E, [2024-05-26T09:21:39.153904 #2127198] ERROR -- : /usr/local/lib/ruby/3.2.0/open-uri.rb:369:in `open_http': 403 Forbidden (OpenURI::HTTPError) E, [2024-05-26T09:21:39.153912 #2127198] ERROR -- : from /usr/local/lib/ruby/3.2.0/open-uri.rb:760:in `buffer_open' E, [2024-05-26T09:21:39.153921 #2127198] ERROR -- : from /usr/local/lib/ruby/3.2.0/open-uri.rb:214:in `block in open_loop' E, [2024-05-26T09:21:39.153930 #2127198] ERROR -- : from /usr/local/lib/ruby/3.2.0/open-uri.rb:212:in `catch' E, [2024-05-26T09:21:39.153938 #2127198] ERROR -- : from /usr/local/lib/ruby/3.2.0/open-uri.rb:212:in `open_loop' E, [2024-05-26T09:21:39.153947 #2127198] ERROR -- : from /usr/local/lib/ruby/3.2.0/open-uri.rb:153:in `open_uri' E, [2024-05-26T09:21:39.153955 #2127198] ERROR -- : from /usr/local/lib/ruby/3.2.0/open-uri.rb:740:in `open' E, [2024-05-26T09:21:39.153964 #2127198] ERROR -- : from /usr/local/lib/ruby/3.2.0/open-uri.rb:748:in `read' E, [2024-05-26T09:21:39.153972 #2127198] ERROR -- : from /home/opc/ruby/src/master/tool/downloader.rb:247:in `block in download' E, [2024-05-26T09:21:39.153980 #2127198] ERROR -- : from /home/opc/ruby/src/master/tool/downloader.rb:378:in `with_retry' E, [2024-05-26T09:21:39.153989 #2127198] ERROR -- : from /home/opc/ruby/src/master/tool/downloader.rb:246:in `download' E, [2024-05-26T09:21:39.153998 #2127198] ERROR -- : from /home/opc/ruby/src/master/tool/downloader.rb:136:in `download' E, [2024-05-26T09:21:39.154006 #2127198] ERROR -- : from /home/opc/ruby/src/master/tool/downloader.rb:482:in `block in
' E, [2024-05-26T09:21:39.154015 #2127198] ERROR -- : from /home/opc/ruby/src/master/tool/downloader.rb:465:in `each' E, [2024-05-26T09:21:39.154024 #2127198] ERROR -- : from /home/opc/ruby/src/master/tool/downloader.rb:465:in `
' E, [2024-05-26T09:21:39.154680 #2127198] ERROR -- : make: *** [uncommon.mk:1756: /home/opc/ruby/src/master/enc/unicode/data/emoji/15.0/emoji-test.txt] Error 1 E, [2024-05-26T09:21:39.154710 #2127198] ERROR -- : make: *** Waiting for unfinished jobs.... E, [2024-05-26T09:21:39.156686 #2127198] ERROR -- : make: *** [uncommon.mk:1756: /home/opc/ruby/src/master/enc/unicode/data/emoji/15.0/emoji-sequences.txt] Error 1 E, [2024-05-26T09:21:39.156720 #2127198] ERROR -- : make: *** Deleting file '/home/opc/ruby/src/master/enc/unicode/data/emoji/15.0/emoji-sequences.txt' E, [2024-05-26T09:21:39.163290 #2127198] ERROR -- : /home/opc/ruby/src/master/tool/downloader.rb:302:in `rescue in download': failed to download emoji/15.0/emoji-test.txt (RuntimeError) E, [2024-05-26T09:21:39.163327 #2127198] ERROR -- : OpenURI::HTTPError: 403 Forbidden: https://www.unicode.org/Public/emoji/15.0/emoji-test.txt E, [2024-05-26T09:21:39.163338 #2127198] ERROR -- : from /home/opc/ruby/src/master/tool/downloader.rb:201:in `download' E, [2024-05-26T09:21:39.163348 #2127198] ERROR -- : from /home/opc/ruby/src/master/tool/downloader.rb:136:in `download' E, [2024-05-26T09:21:39.163357 #2127198] ERROR -- : from /home/opc/ruby/src/master/tool/downloader.rb:482:in `block in
' E, [2024-05-26T09:21:39.163365 #2127198] ERROR -- : from /home/opc/ruby/src/master/tool/downloader.rb:465:in `each' E, [2024-05-26T09:21:39.163374 #2127198] ERROR -- : from /home/opc/ruby/src/master/tool/downloader.rb:465:in `
' E, [2024-05-26T09:21:39.163382 #2127198] ERROR -- : /usr/local/lib/ruby/3.2.0/open-uri.rb:369:in `open_http': 403 Forbidden (OpenURI::HTTPError) E, [2024-05-26T09:21:39.163391 #2127198] ERROR -- : from /usr/local/lib/ruby/3.2.0/open-uri.rb:760:in `buffer_open' E, [2024-05-26T09:21:39.163400 #2127198] ERROR -- : from /usr/local/lib/ruby/3.2.0/open-uri.rb:214:in `block in open_loop' E, [2024-05-26T09:21:39.163409 #2127198] ERROR -- : from /usr/local/lib/ruby/3.2.0/open-uri.rb:212:in `catch' E, [2024-05-26T09:21:39.163417 #2127198] ERROR -- : from /usr/local/lib/ruby/3.2.0/open-uri.rb:212:in `open_loop' E, [2024-05-26T09:21:39.163426 #2127198] ERROR -- : from /usr/local/lib/ruby/3.2.0/open-uri.rb:153:in `open_uri' E, [2024-05-26T09:21:39.163435 #2127198] ERROR -- : from /usr/local/lib/ruby/3.2.0/open-uri.rb:740:in `open' E, [2024-05-26T09:21:39.163443 #2127198] ERROR -- : from /usr/local/lib/ruby/3.2.0/open-uri.rb:748:in `read' E, [2024-05-26T09:21:39.163452 #2127198] ERROR -- : from /home/opc/ruby/src/master/tool/downloader.rb:247:in `block in download' E, [2024-05-26T09:21:39.163461 #2127198] ERROR -- : from /home/opc/ruby/src/master/tool/downloader.rb:378:in `with_retry' E, [2024-05-26T09:21:39.163470 #2127198] ERROR -- : from /home/opc/ruby/src/master/tool/downloader.rb:246:in `download' E, [2024-05-26T09:21:39.163478 #2127198] ERROR -- : from /home/opc/ruby/src/master/tool/downloader.rb:136:in `download' E, [2024-05-26T09:21:39.163487 #2127198] ERROR -- : from /home/opc/ruby/src/master/tool/downloader.rb:482:in `block in
' E, [2024-05-26T09:21:39.163496 #2127198] ERROR -- : from /home/opc/ruby/src/master/tool/downloader.rb:465:in `each' E, [2024-05-26T09:21:39.163504 #2127198] ERROR -- : from /home/opc/ruby/src/master/tool/downloader.rb:465:in `
' E, [2024-05-26T09:21:39.166351 #2127198] ERROR -- : make: *** [uncommon.mk:1756: /home/opc/ruby/src/master/enc/unicode/data/emoji/15.0/emoji-zwj-sequences.txt] Error 1 I, [2024-05-26T09:21:39.166418 #2127198] INFO -- : downloading emoji/15.0/emoji-test.txt ... I, [2024-05-26T09:21:39.166529 #2127198] INFO -- : $$$[end] "make update-unicode -j3" exit with 512. I, [2024-05-26T09:21:39.166554 #2127198] INFO -- : $$$[beg] make update-download -j3 I, [2024-05-26T09:21:39.328669 #2127198] INFO -- : tool/config.guess already exists I, [2024-05-26T09:21:39.328757 #2127198] INFO -- : tool/config.sub already exists I, [2024-05-26T09:21:39.331544 #2127198] INFO -- : Update power_assert to 84e85124c5014a139af39161d484156cfe87a9ed I, [2024-05-26T09:21:39.331665 #2127198] INFO -- : Update rbs to ba7872795d5de04adb8ff500c0e6afdc81a041dd I, [2024-05-26T09:21:39.331932 #2127198] INFO -- : Update typeprof to b19a6416da3a05d57fadd6ffdadb382b6d236ca5 I, [2024-05-26T09:21:39.334895 #2127198] INFO -- : echo ba7872795d5de04adb8ff500c0e6afdc81a041dd | /bin/sh /home/opc/ruby/src/master/tool/ifchange /home/opc/ruby/src/master/.bundle/.timestamp/rbs.revision - I, [2024-05-26T09:21:39.335142 #2127198] INFO -- : echo 84e85124c5014a139af39161d484156cfe87a9ed | /bin/sh /home/opc/ruby/src/master/tool/ifchange /home/opc/ruby/src/master/.bundle/.timestamp/power_assert.revision - I, [2024-05-26T09:21:39.335248 #2127198] INFO -- : echo b19a6416da3a05d57fadd6ffdadb382b6d236ca5 | /bin/sh /home/opc/ruby/src/master/tool/ifchange /home/opc/ruby/src/master/.bundle/.timestamp/typeprof.revision - I, [2024-05-26T09:21:39.340672 #2127198] INFO -- : /home/opc/ruby/src/master/.bundle/.timestamp/power_assert.revision unchanged I, [2024-05-26T09:21:39.341556 #2127198] INFO -- : /home/opc/ruby/src/master/.bundle/.timestamp/typeprof.revision unchanged I, [2024-05-26T09:21:39.341824 #2127198] INFO -- : /home/opc/ruby/src/master/.bundle/.timestamp/rbs.revision unchanged I, [2024-05-26T09:21:39.430919 #2127198] INFO -- : Building power_assert@84e85124c5014a139af39161d484156cfe87a9ed to /home/opc/ruby/src/master/gems/power_assert-2.0.3.gem I, [2024-05-26T09:21:39.543199 #2127198] INFO -- : Successfully built RubyGem I, [2024-05-26T09:21:39.543266 #2127198] INFO -- : Name: power_assert I, [2024-05-26T09:21:39.543277 #2127198] INFO -- : Version: 2.0.4dev I, [2024-05-26T09:21:39.543287 #2127198] INFO -- : File: power_assert-2.0.4dev.gem I, [2024-05-26T09:21:39.623222 #2127198] INFO -- : $$$[end] "make update-download -j3" exit with 0. I, [2024-05-26T09:21:39.623291 #2127198] INFO -- : $$$[beg] make update-rubyspec -j3 I, [2024-05-26T09:21:39.711858 #2127198] INFO -- : make: Nothing to be done for 'update-rubyspec'. I, [2024-05-26T09:21:39.711995 #2127198] INFO -- : $$$[end] "make update-rubyspec -j3" exit with 0. I, [2024-05-26T09:21:39.712045 #2127198] INFO -- : $$$[beg] make update-src -j3 I, [2024-05-26T09:21:40.674955 #2127198] INFO -- : Already up to date. I, [2024-05-26T09:21:40.689584 #2127198] INFO -- : Latest commit hash = 508f331048 I, [2024-05-26T09:21:40.690213 #2127198] INFO -- : $$$[end] "make update-src -j3" exit with 0. I, [2024-05-26T09:21:40.690252 #2127198] INFO -- : $$$[beg] make after-update -j3 I, [2024-05-26T09:21:40.809364 #2127198] INFO -- : generating /home/opc/ruby/src/master/ext/ripper/eventids2table.c I, [2024-05-26T09:21:40.816391 #2127198] INFO -- : make[1]: Entering directory '/home/opc/ruby/src/master/ext/ripper' I, [2024-05-26T09:21:40.816449 #2127198] INFO -- : make[1]: Nothing to be done for 'src'. I, [2024-05-26T09:21:40.816460 #2127198] INFO -- : make[1]: Leaving directory '/home/opc/ruby/src/master/ext/ripper' I, [2024-05-26T09:21:40.843817 #2127198] INFO -- : /home/opc/ruby/src/master/revision.h updated I, [2024-05-26T09:21:40.845008 #2127198] INFO -- : generating aarch64-linux-fake.rb I, [2024-05-26T09:21:40.901480 #2127198] INFO -- : aarch64-linux-fake.rb updated I, [2024-05-26T09:21:40.903195 #2127198] INFO -- : generating enc.mk I, [2024-05-26T09:21:41.135894 #2127198] INFO -- : making srcs under enc I, [2024-05-26T09:21:41.177580 #2127198] INFO -- : make[1]: Entering directory '/home/opc/ruby/build/master' I, [2024-05-26T09:21:41.177645 #2127198] INFO -- : make[1]: Nothing to be done for 'srcs'. I, [2024-05-26T09:21:41.177657 #2127198] INFO -- : make[1]: Leaving directory '/home/opc/ruby/build/master' I, [2024-05-26T09:21:41.257498 #2127198] INFO -- : Update power_assert to 84e85124c5014a139af39161d484156cfe87a9ed I, [2024-05-26T09:21:41.257560 #2127198] INFO -- : Update rbs to ba7872795d5de04adb8ff500c0e6afdc81a041dd I, [2024-05-26T09:21:41.258456 #2127198] INFO -- : Update typeprof to b19a6416da3a05d57fadd6ffdadb382b6d236ca5 I, [2024-05-26T09:21:41.261423 #2127198] INFO -- : echo 84e85124c5014a139af39161d484156cfe87a9ed | /bin/sh /home/opc/ruby/src/master/tool/ifchange /home/opc/ruby/src/master/.bundle/.timestamp/power_assert.revision - I, [2024-05-26T09:21:41.261806 #2127198] INFO -- : echo ba7872795d5de04adb8ff500c0e6afdc81a041dd | /bin/sh /home/opc/ruby/src/master/tool/ifchange /home/opc/ruby/src/master/.bundle/.timestamp/rbs.revision - I, [2024-05-26T09:21:41.261955 #2127198] INFO -- : echo b19a6416da3a05d57fadd6ffdadb382b6d236ca5 | /bin/sh /home/opc/ruby/src/master/tool/ifchange /home/opc/ruby/src/master/.bundle/.timestamp/typeprof.revision - I, [2024-05-26T09:21:41.268552 #2127198] INFO -- : /home/opc/ruby/src/master/.bundle/.timestamp/power_assert.revision unchanged I, [2024-05-26T09:21:41.268612 #2127198] INFO -- : /home/opc/ruby/src/master/.bundle/.timestamp/rbs.revision unchanged I, [2024-05-26T09:21:41.269080 #2127198] INFO -- : /home/opc/ruby/src/master/.bundle/.timestamp/typeprof.revision unchanged I, [2024-05-26T09:21:41.357614 #2127198] INFO -- : Building power_assert@84e85124c5014a139af39161d484156cfe87a9ed to /home/opc/ruby/src/master/gems/power_assert-2.0.3.gem I, [2024-05-26T09:21:41.470815 #2127198] INFO -- : Successfully built RubyGem I, [2024-05-26T09:21:41.470874 #2127198] INFO -- : Name: power_assert I, [2024-05-26T09:21:41.470885 #2127198] INFO -- : Version: 2.0.4dev I, [2024-05-26T09:21:41.470894 #2127198] INFO -- : File: power_assert-2.0.4dev.gem I, [2024-05-26T09:21:41.472956 #2127198] INFO -- : Extracting bundle gem power_assert-2.0.3... I, [2024-05-26T09:21:41.576308 #2127198] INFO -- : Try with hash version of bundled gems instead of gems/power_assert-2.0.3.gem. We don't use this gem with release version of Ruby. I, [2024-05-26T09:21:41.587291 #2127198] INFO -- : Unpacked gems/power_assert-2.0.4dev.gem I, [2024-05-26T09:21:41.589179 #2127198] INFO -- : $$$[end] "make after-update -j3" exit with 0. I, [2024-05-26T09:21:41.589399 #2127198] INFO -- : $$$[beg] make miniruby -j3 I, [2024-05-26T09:21:41.677599 #2127198] INFO -- : BASERUBY = /usr/local/bin/ruby --disable=gems I, [2024-05-26T09:21:41.677667 #2127198] INFO -- : CC = gcc I, [2024-05-26T09:21:41.677678 #2127198] INFO -- : LD = ld I, [2024-05-26T09:21:41.677687 #2127198] INFO -- : LDSHARED = gcc -shared I, [2024-05-26T09:21:41.677698 #2127198] INFO -- : CFLAGS = -O3 -fno-fast-math -ggdb3 -Wall -Wextra -Wdeprecated-declarations -Wdiv-by-zero -Wduplicated-cond -Wimplicit-function-declaration -Wimplicit-int -Wpointer-arith -Wwrite-strings -Wold-style-definition -Wimplicit-fallthrough=0 -Wmissing-noreturn -Wno-cast-function-type -Wno-constant-logical-operand -Wno-long-long -Wno-missing-field-initializers -Wno-overlength-strings -Wno-packed-bitfield-compat -Wno-parentheses-equality -Wno-self-assign -Wno-tautological-compare -Wno-unused-parameter -Wno-unused-value -Wsuggest-attribute=format -Wsuggest-attribute=noreturn -Wunused-variable -Wmisleading-indentation -Wundef I, [2024-05-26T09:21:41.677709 #2127198] INFO -- : XCFLAGS = -U_FORTIFY_SOURCE -D_FORTIFY_SOURCE=2 -fstack-protector-strong -msign-return-address=all -fno-strict-overflow -fvisibility=hidden -fexcess-precision=standard -DRUBY_EXPORT -fPIE -I. -I.ext/include/aarch64-linux -I/home/opc/ruby/src/master/include -I/home/opc/ruby/src/master -I/home/opc/ruby/src/master/prism -I/home/opc/ruby/src/master/enc/unicode/15.0.0 I, [2024-05-26T09:21:41.677718 #2127198] INFO -- : CPPFLAGS = I, [2024-05-26T09:21:41.677726 #2127198] INFO -- : DLDFLAGS = -Wl,--compress-debug-sections=zlib -fstack-protector-strong -pie I, [2024-05-26T09:21:41.677736 #2127198] INFO -- : SOLIBS = -lz -lrt -lrt -ldl -lcrypt -lm -lpthread I, [2024-05-26T09:21:41.677744 #2127198] INFO -- : LANG = en_US.UTF-8 I, [2024-05-26T09:21:41.677753 #2127198] INFO -- : LC_ALL = I, [2024-05-26T09:21:41.677761 #2127198] INFO -- : LC_CTYPE = I, [2024-05-26T09:21:41.677770 #2127198] INFO -- : MFLAGS = -j3 --jobserver-auth=4,5 I, [2024-05-26T09:21:41.677778 #2127198] INFO -- : RUSTC = rustc I, [2024-05-26T09:21:41.677840 #2127198] INFO -- : YJIT_RUSTC_ARGS = --crate-name=yjit --crate-type=staticlib --edition=2021 -g -C lto=thin -C opt-level=3 -C overflow-checks=on '--out-dir=/home/opc/ruby/build/master/yjit/target/release/' /home/opc/ruby/src/master/yjit/src/lib.rs I, [2024-05-26T09:21:41.678541 #2127198] INFO -- : gcc (GCC) 8.5.0 20210514 (Red Hat 8.5.0-10.1.0.1) I, [2024-05-26T09:21:41.678576 #2127198] INFO -- : Copyright (C) 2018 Free Software Foundation, Inc. I, [2024-05-26T09:21:41.678589 #2127198] INFO -- : This is free software; see the source for copying conditions. There is NO I, [2024-05-26T09:21:41.678600 #2127198] INFO -- : warranty; not even for MERCHANTABILITY or FITNESS FOR A PARTICULAR PURPOSE. I, [2024-05-26T09:21:41.678609 #2127198] INFO -- : I, [2024-05-26T09:21:41.704087 #2127198] INFO -- : compiling /home/opc/ruby/src/master/version.c I, [2024-05-26T09:21:41.848907 #2127198] INFO -- : linking miniruby I, [2024-05-26T09:21:42.740356 #2127198] INFO -- : $$$[end] "make miniruby -j3" exit with 0. I, [2024-05-26T09:21:42.740596 #2127198] INFO -- : $$$[beg] make ruby -j3 I, [2024-05-26T09:21:42.830376 #2127198] INFO -- : BASERUBY = /usr/local/bin/ruby --disable=gems I, [2024-05-26T09:21:42.830442 #2127198] INFO -- : CC = gcc I, [2024-05-26T09:21:42.830455 #2127198] INFO -- : LD = ld I, [2024-05-26T09:21:42.830464 #2127198] INFO -- : LDSHARED = gcc -shared I, [2024-05-26T09:21:42.830476 #2127198] INFO -- : CFLAGS = -O3 -fno-fast-math -ggdb3 -Wall -Wextra -Wdeprecated-declarations -Wdiv-by-zero -Wduplicated-cond -Wimplicit-function-declaration -Wimplicit-int -Wpointer-arith -Wwrite-strings -Wold-style-definition -Wimplicit-fallthrough=0 -Wmissing-noreturn -Wno-cast-function-type -Wno-constant-logical-operand -Wno-long-long -Wno-missing-field-initializers -Wno-overlength-strings -Wno-packed-bitfield-compat -Wno-parentheses-equality -Wno-self-assign -Wno-tautological-compare -Wno-unused-parameter -Wno-unused-value -Wsuggest-attribute=format -Wsuggest-attribute=noreturn -Wunused-variable -Wmisleading-indentation -Wundef I, [2024-05-26T09:21:42.830486 #2127198] INFO -- : XCFLAGS = -U_FORTIFY_SOURCE -D_FORTIFY_SOURCE=2 -fstack-protector-strong -msign-return-address=all -fno-strict-overflow -fvisibility=hidden -fexcess-precision=standard -DRUBY_EXPORT -fPIE -I. -I.ext/include/aarch64-linux -I/home/opc/ruby/src/master/include -I/home/opc/ruby/src/master -I/home/opc/ruby/src/master/prism -I/home/opc/ruby/src/master/enc/unicode/15.0.0 I, [2024-05-26T09:21:42.830495 #2127198] INFO -- : CPPFLAGS = I, [2024-05-26T09:21:42.830503 #2127198] INFO -- : DLDFLAGS = -Wl,--compress-debug-sections=zlib -fstack-protector-strong -pie I, [2024-05-26T09:21:42.830512 #2127198] INFO -- : SOLIBS = -lz -lrt -lrt -ldl -lcrypt -lm -lpthread I, [2024-05-26T09:21:42.830521 #2127198] INFO -- : LANG = en_US.UTF-8 I, [2024-05-26T09:21:42.830529 #2127198] INFO -- : LC_ALL = I, [2024-05-26T09:21:42.830537 #2127198] INFO -- : LC_CTYPE = I, [2024-05-26T09:21:42.830546 #2127198] INFO -- : MFLAGS = -j3 --jobserver-auth=4,5 I, [2024-05-26T09:21:42.830554 #2127198] INFO -- : RUSTC = rustc I, [2024-05-26T09:21:42.830563 #2127198] INFO -- : YJIT_RUSTC_ARGS = --crate-name=yjit --crate-type=staticlib --edition=2021 -g -C lto=thin -C opt-level=3 -C overflow-checks=on '--out-dir=/home/opc/ruby/build/master/yjit/target/release/' /home/opc/ruby/src/master/yjit/src/lib.rs I, [2024-05-26T09:21:42.831264 #2127198] INFO -- : gcc (GCC) 8.5.0 20210514 (Red Hat 8.5.0-10.1.0.1) I, [2024-05-26T09:21:42.831285 #2127198] INFO -- : Copyright (C) 2018 Free Software Foundation, Inc. I, [2024-05-26T09:21:42.831295 #2127198] INFO -- : This is free software; see the source for copying conditions. There is NO I, [2024-05-26T09:21:42.831304 #2127198] INFO -- : warranty; not even for MERCHANTABILITY or FITNESS FOR A PARTICULAR PURPOSE. I, [2024-05-26T09:21:42.831312 #2127198] INFO -- : I, [2024-05-26T09:21:43.016646 #2127198] INFO -- : builtin_binary.inc updated I, [2024-05-26T09:21:43.021535 #2127198] INFO -- : c86294a81d0df6836359a6b5498b71b1ddba3062aa6ec87c7b2896368a948a19 builtin_binary.inc I, [2024-05-26T09:21:43.022489 #2127198] INFO -- : compiling /home/opc/ruby/src/master/builtin.c I, [2024-05-26T09:21:43.351607 #2127198] INFO -- : linking static-library libruby-static.a I, [2024-05-26T09:21:45.938813 #2127198] INFO -- : linking ruby I, [2024-05-26T09:21:46.859192 #2127198] INFO -- : $$$[end] "make ruby -j3" exit with 0. I, [2024-05-26T09:21:46.859379 #2127198] INFO -- : $$$[beg] make all -j3 I, [2024-05-26T09:21:46.949649 #2127198] INFO -- : BASERUBY = /usr/local/bin/ruby --disable=gems I, [2024-05-26T09:21:46.949722 #2127198] INFO -- : CC = gcc I, [2024-05-26T09:21:46.949734 #2127198] INFO -- : LD = ld I, [2024-05-26T09:21:46.949745 #2127198] INFO -- : LDSHARED = gcc -shared I, [2024-05-26T09:21:46.949755 #2127198] INFO -- : CFLAGS = -O3 -fno-fast-math -ggdb3 -Wall -Wextra -Wdeprecated-declarations -Wdiv-by-zero -Wduplicated-cond -Wimplicit-function-declaration -Wimplicit-int -Wpointer-arith -Wwrite-strings -Wold-style-definition -Wimplicit-fallthrough=0 -Wmissing-noreturn -Wno-cast-function-type -Wno-constant-logical-operand -Wno-long-long -Wno-missing-field-initializers -Wno-overlength-strings -Wno-packed-bitfield-compat -Wno-parentheses-equality -Wno-self-assign -Wno-tautological-compare -Wno-unused-parameter -Wno-unused-value -Wsuggest-attribute=format -Wsuggest-attribute=noreturn -Wunused-variable -Wmisleading-indentation -Wundef I, [2024-05-26T09:21:46.949765 #2127198] INFO -- : XCFLAGS = -U_FORTIFY_SOURCE -D_FORTIFY_SOURCE=2 -fstack-protector-strong -msign-return-address=all -fno-strict-overflow -fvisibility=hidden -fexcess-precision=standard -DRUBY_EXPORT -fPIE -I. -I.ext/include/aarch64-linux -I/home/opc/ruby/src/master/include -I/home/opc/ruby/src/master -I/home/opc/ruby/src/master/prism -I/home/opc/ruby/src/master/enc/unicode/15.0.0 I, [2024-05-26T09:21:46.949774 #2127198] INFO -- : CPPFLAGS = I, [2024-05-26T09:21:46.949782 #2127198] INFO -- : DLDFLAGS = -Wl,--compress-debug-sections=zlib -fstack-protector-strong -pie I, [2024-05-26T09:21:46.949792 #2127198] INFO -- : SOLIBS = -lz -lrt -lrt -ldl -lcrypt -lm -lpthread I, [2024-05-26T09:21:46.949800 #2127198] INFO -- : LANG = en_US.UTF-8 I, [2024-05-26T09:21:46.949808 #2127198] INFO -- : LC_ALL = I, [2024-05-26T09:21:46.949817 #2127198] INFO -- : LC_CTYPE = I, [2024-05-26T09:21:46.949825 #2127198] INFO -- : MFLAGS = -j3 --jobserver-auth=4,5 I, [2024-05-26T09:21:46.949833 #2127198] INFO -- : RUSTC = rustc I, [2024-05-26T09:21:46.949842 #2127198] INFO -- : YJIT_RUSTC_ARGS = --crate-name=yjit --crate-type=staticlib --edition=2021 -g -C lto=thin -C opt-level=3 -C overflow-checks=on '--out-dir=/home/opc/ruby/build/master/yjit/target/release/' /home/opc/ruby/src/master/yjit/src/lib.rs I, [2024-05-26T09:21:46.950598 #2127198] INFO -- : gcc (GCC) 8.5.0 20210514 (Red Hat 8.5.0-10.1.0.1) I, [2024-05-26T09:21:46.950633 #2127198] INFO -- : Copyright (C) 2018 Free Software Foundation, Inc. I, [2024-05-26T09:21:46.950644 #2127198] INFO -- : This is free software; see the source for copying conditions. There is NO I, [2024-05-26T09:21:46.950654 #2127198] INFO -- : warranty; not even for MERCHANTABILITY or FITNESS FOR A PARTICULAR PURPOSE. I, [2024-05-26T09:21:46.950663 #2127198] INFO -- : I, [2024-05-26T09:21:46.984376 #2127198] INFO -- : generating encdb.h I, [2024-05-26T09:21:46.985904 #2127198] INFO -- : generating enc.mk I, [2024-05-26T09:21:47.023091 #2127198] INFO -- : encdb.h unchanged I, [2024-05-26T09:21:47.229010 #2127198] INFO -- : making srcs under enc I, [2024-05-26T09:21:47.229077 #2127198] INFO -- : making enc I, [2024-05-26T09:21:47.257091 #2127198] INFO -- : make[1]: Entering directory '/home/opc/ruby/build/master' I, [2024-05-26T09:21:47.257182 #2127198] INFO -- : make[1]: Nothing to be done for 'enc'. I, [2024-05-26T09:21:47.257203 #2127198] INFO -- : make[1]: Leaving directory '/home/opc/ruby/build/master' I, [2024-05-26T09:21:47.271163 #2127198] INFO -- : make[1]: Entering directory '/home/opc/ruby/build/master' I, [2024-05-26T09:21:47.271230 #2127198] INFO -- : make[1]: Nothing to be done for 'srcs'. I, [2024-05-26T09:21:47.271241 #2127198] INFO -- : make[1]: Leaving directory '/home/opc/ruby/build/master' I, [2024-05-26T09:21:47.272037 #2127198] INFO -- : generating transdb.h I, [2024-05-26T09:21:47.417291 #2127198] INFO -- : transdb.h unchanged I, [2024-05-26T09:21:47.418667 #2127198] INFO -- : generating makefiles ext/configure-ext.mk I, [2024-05-26T09:21:47.418785 #2127198] INFO -- : making trans I, [2024-05-26T09:21:47.459267 #2127198] INFO -- : ext/configure-ext.mk updated I, [2024-05-26T09:21:47.462252 #2127198] INFO -- : make[1]: Entering directory '/home/opc/ruby/build/master' I, [2024-05-26T09:21:47.468536 #2127198] INFO -- : make[1]: Entering directory '/home/opc/ruby/build/master' I, [2024-05-26T09:21:47.468585 #2127198] INFO -- : make[1]: Nothing to be done for 'trans'. I, [2024-05-26T09:21:47.468596 #2127198] INFO -- : make[1]: Leaving directory '/home/opc/ruby/build/master' I, [2024-05-26T09:21:47.787246 #2127198] INFO -- : making encs I, [2024-05-26T09:21:47.841292 #2127198] INFO -- : make[1]: Entering directory '/home/opc/ruby/build/master' I, [2024-05-26T09:21:47.841378 #2127198] INFO -- : make[1]: Nothing to be done for 'encs'. I, [2024-05-26T09:21:47.841413 #2127198] INFO -- : make[1]: Leaving directory '/home/opc/ruby/build/master' I, [2024-05-26T09:21:48.242743 #2127198] INFO -- : make[1]: Leaving directory '/home/opc/ruby/build/master' I, [2024-05-26T09:21:48.243460 #2127198] INFO -- : generating makefile exts.mk I, [2024-05-26T09:21:48.302029 #2127198] INFO -- : exts.mk unchanged I, [2024-05-26T09:21:48.306961 #2127198] INFO -- : make[1]: Entering directory '/home/opc/ruby/build/master' I, [2024-05-26T09:21:48.409602 #2127198] INFO -- : make[2]: Entering directory '/home/opc/ruby/build/master/ext/coverage' I, [2024-05-26T09:21:48.412120 #2127198] INFO -- : make[2]: Entering directory '/home/opc/ruby/build/master/ext/digest' I, [2024-05-26T09:21:48.414353 #2127198] INFO -- : make[2]: Entering directory '/home/opc/ruby/build/master/ext/date' I, [2024-05-26T09:21:48.417579 #2127198] INFO -- : make[2]: Leaving directory '/home/opc/ruby/build/master/ext/coverage' I, [2024-05-26T09:21:48.420418 #2127198] INFO -- : make[2]: Leaving directory '/home/opc/ruby/build/master/ext/digest' I, [2024-05-26T09:21:48.420907 #2127198] INFO -- : make[2]: Leaving directory '/home/opc/ruby/build/master/ext/date' I, [2024-05-26T09:21:48.427960 #2127198] INFO -- : make[2]: Entering directory '/home/opc/ruby/build/master/ext/fiddle' I, [2024-05-26T09:21:48.430026 #2127198] INFO -- : make[2]: Entering directory '/home/opc/ruby/build/master/ext/io/console' I, [2024-05-26T09:21:48.436724 #2127198] INFO -- : make[2]: Entering directory '/home/opc/ruby/build/master/ext/json' I, [2024-05-26T09:21:48.437158 #2127198] INFO -- : make[2]: Leaving directory '/home/opc/ruby/build/master/ext/io/console' I, [2024-05-26T09:21:48.438090 #2127198] INFO -- : make[2]: Leaving directory '/home/opc/ruby/build/master/ext/fiddle' I, [2024-05-26T09:21:48.441289 #2127198] INFO -- : make[2]: Entering directory '/home/opc/ruby/build/master/ext/monitor' I, [2024-05-26T09:21:48.443947 #2127198] INFO -- : make[2]: Entering directory '/home/opc/ruby/build/master/ext/objspace' I, [2024-05-26T09:21:48.445732 #2127198] INFO -- : make[2]: Leaving directory '/home/opc/ruby/build/master/ext/monitor' I, [2024-05-26T09:21:48.446177 #2127198] INFO -- : make[2]: Leaving directory '/home/opc/ruby/build/master/ext/json' I, [2024-05-26T09:21:48.449921 #2127198] INFO -- : make[2]: Leaving directory '/home/opc/ruby/build/master/ext/objspace' I, [2024-05-26T09:21:48.450646 #2127198] INFO -- : make[2]: Entering directory '/home/opc/ruby/build/master/ext/pathname' I, [2024-05-26T09:21:48.454604 #2127198] INFO -- : make[2]: Leaving directory '/home/opc/ruby/build/master/ext/pathname' I, [2024-05-26T09:21:48.456367 #2127198] INFO -- : make[2]: Entering directory '/home/opc/ruby/build/master/ext/psych' I, [2024-05-26T09:21:48.458911 #2127198] INFO -- : make[2]: Entering directory '/home/opc/ruby/build/master/ext/pty' I, [2024-05-26T09:21:48.464022 #2127198] INFO -- : make[2]: Leaving directory '/home/opc/ruby/build/master/ext/pty' I, [2024-05-26T09:21:48.465999 #2127198] INFO -- : make[2]: Entering directory '/home/opc/ruby/build/master/ext/openssl' I, [2024-05-26T09:21:48.476560 #2127198] INFO -- : make[2]: Leaving directory '/home/opc/ruby/build/master/ext/psych' I, [2024-05-26T09:21:48.477587 #2127198] INFO -- : make[2]: Entering directory '/home/opc/ruby/build/master/ext/ripper' I, [2024-05-26T09:21:48.478439 #2127198] INFO -- : make[2]: Entering directory '/home/opc/ruby/build/master/ext/rubyvm' I, [2024-05-26T09:21:48.481754 #2127198] INFO -- : make[2]: Leaving directory '/home/opc/ruby/build/master/ext/rubyvm' I, [2024-05-26T09:21:48.484915 #2127198] INFO -- : make[2]: Leaving directory '/home/opc/ruby/build/master/ext/ripper' I, [2024-05-26T09:21:48.488335 #2127198] INFO -- : make[2]: Leaving directory '/home/opc/ruby/build/master/ext/openssl' I, [2024-05-26T09:21:48.494457 #2127198] INFO -- : make[2]: Entering directory '/home/opc/ruby/build/master/ext/socket' I, [2024-05-26T09:21:48.495179 #2127198] INFO -- : make[2]: Entering directory '/home/opc/ruby/build/master/.bundle/gems/bigdecimal-3.1.7/ext/bigdecimal' I, [2024-05-26T09:21:48.496133 #2127198] INFO -- : make[2]: Entering directory '/home/opc/ruby/build/master/.bundle/gems/bigdecimal-3.1.8/ext/bigdecimal' I, [2024-05-26T09:21:48.505697 #2127198] INFO -- : make[2]: Leaving directory '/home/opc/ruby/build/master/ext/socket' I, [2024-05-26T09:21:48.508189 #2127198] INFO -- : make[2]: Entering directory '/home/opc/ruby/build/master/.bundle/gems/debug-1.9.2/ext/debug' I, [2024-05-26T09:21:48.526864 #2127198] INFO -- : make[2]: Leaving directory '/home/opc/ruby/build/master/.bundle/gems/bigdecimal-3.1.8/ext/bigdecimal' I, [2024-05-26T09:21:48.526940 #2127198] INFO -- : make[2]: Leaving directory '/home/opc/ruby/build/master/.bundle/gems/bigdecimal-3.1.7/ext/bigdecimal' I, [2024-05-26T09:21:48.529408 #2127198] INFO -- : make[2]: Entering directory '/home/opc/ruby/build/master/.bundle/gems/nkf-0.2.0/ext/nkf' I, [2024-05-26T09:21:48.529462 #2127198] INFO -- : make[2]: Entering directory '/home/opc/ruby/build/master/.bundle/gems/racc-1.7.3/ext/racc/cparse' I, [2024-05-26T09:21:48.542888 #2127198] INFO -- : make[2]: Leaving directory '/home/opc/ruby/build/master/.bundle/gems/debug-1.9.2/ext/debug' I, [2024-05-26T09:21:48.549508 #2127198] INFO -- : make[2]: Entering directory '/home/opc/ruby/build/master/.bundle/gems/racc-1.8.0/ext/racc/cparse' I, [2024-05-26T09:21:48.560790 #2127198] INFO -- : make[2]: Leaving directory '/home/opc/ruby/build/master/.bundle/gems/nkf-0.2.0/ext/nkf' I, [2024-05-26T09:21:48.561206 #2127198] INFO -- : make[2]: Leaving directory '/home/opc/ruby/build/master/.bundle/gems/racc-1.7.3/ext/racc/cparse' I, [2024-05-26T09:21:48.563657 #2127198] INFO -- : make[2]: Entering directory '/home/opc/ruby/build/master/.bundle/gems/rbs-3.4.4/ext/rbs_extension' I, [2024-05-26T09:21:48.573654 #2127198] INFO -- : make[2]: Entering directory '/home/opc/ruby/build/master/.bundle/gems/syslog-0.1.2/ext/syslog' I, [2024-05-26T09:21:48.581708 #2127198] INFO -- : make[2]: Leaving directory '/home/opc/ruby/build/master/.bundle/gems/racc-1.8.0/ext/racc/cparse' I, [2024-05-26T09:21:48.594386 #2127198] INFO -- : make[2]: Leaving directory '/home/opc/ruby/build/master/.bundle/gems/rbs-3.4.4/ext/rbs_extension' I, [2024-05-26T09:21:48.603396 #2127198] INFO -- : make[2]: Entering directory '/home/opc/ruby/build/master/ext/digest/sha2' I, [2024-05-26T09:21:48.604630 #2127198] INFO -- : make[2]: Leaving directory '/home/opc/ruby/build/master/.bundle/gems/syslog-0.1.2/ext/syslog' I, [2024-05-26T09:21:48.609915 #2127198] INFO -- : make[2]: Leaving directory '/home/opc/ruby/build/master/ext/digest/sha2' I, [2024-05-26T09:21:48.647650 #2127198] INFO -- : make[2]: Entering directory '/home/opc/ruby/build/master' I, [2024-05-26T09:21:48.730820 #2127198] INFO -- : make[2]: 'ruby' is up to date. I, [2024-05-26T09:21:48.730891 #2127198] INFO -- : make[2]: Leaving directory '/home/opc/ruby/build/master' I, [2024-05-26T09:21:48.731022 #2127198] INFO -- : make[1]: Leaving directory '/home/opc/ruby/build/master' I, [2024-05-26T09:21:48.735478 #2127198] INFO -- : make[1]: Entering directory '/home/opc/ruby/build/master' I, [2024-05-26T09:21:48.735538 #2127198] INFO -- : make[1]: Nothing to be done for 'note'. I, [2024-05-26T09:21:48.735553 #2127198] INFO -- : make[1]: Leaving directory '/home/opc/ruby/build/master' I, [2024-05-26T09:21:48.735806 #2127198] INFO -- : $$$[end] "make all -j3" exit with 0. I, [2024-05-26T09:21:48.735948 #2127198] INFO -- : $$$[beg] make install -j3 I, [2024-05-26T09:21:48.831160 #2127198] INFO -- : Update power_assert to 84e85124c5014a139af39161d484156cfe87a9ed I, [2024-05-26T09:21:48.831440 #2127198] INFO -- : Update rbs to ba7872795d5de04adb8ff500c0e6afdc81a041dd I, [2024-05-26T09:21:48.832456 #2127198] INFO -- : Update typeprof to b19a6416da3a05d57fadd6ffdadb382b6d236ca5 I, [2024-05-26T09:21:48.835160 #2127198] INFO -- : echo 84e85124c5014a139af39161d484156cfe87a9ed | /bin/sh /home/opc/ruby/src/master/tool/ifchange /home/opc/ruby/src/master/.bundle/.timestamp/power_assert.revision - I, [2024-05-26T09:21:48.835279 #2127198] INFO -- : echo b19a6416da3a05d57fadd6ffdadb382b6d236ca5 | /bin/sh /home/opc/ruby/src/master/tool/ifchange /home/opc/ruby/src/master/.bundle/.timestamp/typeprof.revision - I, [2024-05-26T09:21:48.835517 #2127198] INFO -- : echo ba7872795d5de04adb8ff500c0e6afdc81a041dd | /bin/sh /home/opc/ruby/src/master/tool/ifchange /home/opc/ruby/src/master/.bundle/.timestamp/rbs.revision - I, [2024-05-26T09:21:48.840868 #2127198] INFO -- : /home/opc/ruby/src/master/.bundle/.timestamp/typeprof.revision unchanged I, [2024-05-26T09:21:48.842325 #2127198] INFO -- : /home/opc/ruby/src/master/.bundle/.timestamp/rbs.revision unchanged I, [2024-05-26T09:21:48.842760 #2127198] INFO -- : /home/opc/ruby/src/master/.bundle/.timestamp/power_assert.revision unchanged I, [2024-05-26T09:21:48.844705 #2127198] INFO -- : BASERUBY = /usr/local/bin/ruby --disable=gems I, [2024-05-26T09:21:48.844743 #2127198] INFO -- : CC = gcc I, [2024-05-26T09:21:48.844754 #2127198] INFO -- : LD = ld I, [2024-05-26T09:21:48.844763 #2127198] INFO -- : LDSHARED = gcc -shared I, [2024-05-26T09:21:48.844775 #2127198] INFO -- : CFLAGS = -O3 -fno-fast-math -ggdb3 -Wall -Wextra -Wdeprecated-declarations -Wdiv-by-zero -Wduplicated-cond -Wimplicit-function-declaration -Wimplicit-int -Wpointer-arith -Wwrite-strings -Wold-style-definition -Wimplicit-fallthrough=0 -Wmissing-noreturn -Wno-cast-function-type -Wno-constant-logical-operand -Wno-long-long -Wno-missing-field-initializers -Wno-overlength-strings -Wno-packed-bitfield-compat -Wno-parentheses-equality -Wno-self-assign -Wno-tautological-compare -Wno-unused-parameter -Wno-unused-value -Wsuggest-attribute=format -Wsuggest-attribute=noreturn -Wunused-variable -Wmisleading-indentation -Wundef I, [2024-05-26T09:21:48.844786 #2127198] INFO -- : XCFLAGS = -U_FORTIFY_SOURCE -D_FORTIFY_SOURCE=2 -fstack-protector-strong -msign-return-address=all -fno-strict-overflow -fvisibility=hidden -fexcess-precision=standard -DRUBY_EXPORT -fPIE -I. -I.ext/include/aarch64-linux -I/home/opc/ruby/src/master/include -I/home/opc/ruby/src/master -I/home/opc/ruby/src/master/prism -I/home/opc/ruby/src/master/enc/unicode/15.0.0 I, [2024-05-26T09:21:48.844795 #2127198] INFO -- : CPPFLAGS = I, [2024-05-26T09:21:48.844825 #2127198] INFO -- : DLDFLAGS = -Wl,--compress-debug-sections=zlib -fstack-protector-strong -pie I, [2024-05-26T09:21:48.844836 #2127198] INFO -- : SOLIBS = -lz -lrt -lrt -ldl -lcrypt -lm -lpthread I, [2024-05-26T09:21:48.844844 #2127198] INFO -- : LANG = en_US.UTF-8 I, [2024-05-26T09:21:48.844853 #2127198] INFO -- : LC_ALL = I, [2024-05-26T09:21:48.844861 #2127198] INFO -- : LC_CTYPE = I, [2024-05-26T09:21:48.844869 #2127198] INFO -- : MFLAGS = -j3 --jobserver-auth=4,5 I, [2024-05-26T09:21:48.844877 #2127198] INFO -- : RUSTC = rustc I, [2024-05-26T09:21:48.844885 #2127198] INFO -- : YJIT_RUSTC_ARGS = --crate-name=yjit --crate-type=staticlib --edition=2021 -g -C lto=thin -C opt-level=3 -C overflow-checks=on '--out-dir=/home/opc/ruby/build/master/yjit/target/release/' /home/opc/ruby/src/master/yjit/src/lib.rs I, [2024-05-26T09:21:48.876190 #2127198] INFO -- : generating encdb.h I, [2024-05-26T09:21:48.876381 #2127198] INFO -- : gcc (GCC) 8.5.0 20210514 (Red Hat 8.5.0-10.1.0.1) I, [2024-05-26T09:21:48.876413 #2127198] INFO -- : Copyright (C) 2018 Free Software Foundation, Inc. I, [2024-05-26T09:21:48.876423 #2127198] INFO -- : This is free software; see the source for copying conditions. There is NO I, [2024-05-26T09:21:48.876434 #2127198] INFO -- : warranty; not even for MERCHANTABILITY or FITNESS FOR A PARTICULAR PURPOSE. I, [2024-05-26T09:21:48.876443 #2127198] INFO -- : I, [2024-05-26T09:21:48.877044 #2127198] INFO -- : generating enc.mk I, [2024-05-26T09:21:48.913381 #2127198] INFO -- : encdb.h unchanged I, [2024-05-26T09:21:49.004820 #2127198] INFO -- : Building power_assert@84e85124c5014a139af39161d484156cfe87a9ed to /home/opc/ruby/src/master/gems/power_assert-2.0.3.gem I, [2024-05-26T09:21:49.113915 #2127198] INFO -- : making srcs under enc I, [2024-05-26T09:21:49.114028 #2127198] INFO -- : making enc I, [2024-05-26T09:21:49.121936 #2127198] INFO -- : Successfully built RubyGem I, [2024-05-26T09:21:49.121981 #2127198] INFO -- : Name: power_assert I, [2024-05-26T09:21:49.121992 #2127198] INFO -- : Version: 2.0.4dev I, [2024-05-26T09:21:49.122001 #2127198] INFO -- : File: power_assert-2.0.4dev.gem I, [2024-05-26T09:21:49.124312 #2127198] INFO -- : Extracting bundle gem power_assert-2.0.3... I, [2024-05-26T09:21:49.142479 #2127198] INFO -- : make[1]: Entering directory '/home/opc/ruby/build/master' I, [2024-05-26T09:21:49.142533 #2127198] INFO -- : make[1]: Nothing to be done for 'enc'. I, [2024-05-26T09:21:49.142544 #2127198] INFO -- : make[1]: Leaving directory '/home/opc/ruby/build/master' I, [2024-05-26T09:21:49.159296 #2127198] INFO -- : make[1]: Entering directory '/home/opc/ruby/build/master' I, [2024-05-26T09:21:49.159349 #2127198] INFO -- : make[1]: Nothing to be done for 'srcs'. I, [2024-05-26T09:21:49.159361 #2127198] INFO -- : make[1]: Leaving directory '/home/opc/ruby/build/master' I, [2024-05-26T09:21:49.160188 #2127198] INFO -- : generating transdb.h I, [2024-05-26T09:21:49.225042 #2127198] INFO -- : Try with hash version of bundled gems instead of gems/power_assert-2.0.3.gem. We don't use this gem with release version of Ruby. I, [2024-05-26T09:21:49.235479 #2127198] INFO -- : Unpacked gems/power_assert-2.0.4dev.gem I, [2024-05-26T09:21:49.303195 #2127198] INFO -- : transdb.h unchanged I, [2024-05-26T09:21:49.304546 #2127198] INFO -- : generating makefiles ext/configure-ext.mk I, [2024-05-26T09:21:49.304780 #2127198] INFO -- : making trans I, [2024-05-26T09:21:49.344105 #2127198] INFO -- : ext/configure-ext.mk unchanged I, [2024-05-26T09:21:49.347209 #2127198] INFO -- : make[1]: Entering directory '/home/opc/ruby/build/master' I, [2024-05-26T09:21:49.353063 #2127198] INFO -- : make[1]: Entering directory '/home/opc/ruby/build/master' I, [2024-05-26T09:21:49.353105 #2127198] INFO -- : make[1]: Nothing to be done for 'trans'. I, [2024-05-26T09:21:49.353158 #2127198] INFO -- : make[1]: Leaving directory '/home/opc/ruby/build/master' I, [2024-05-26T09:21:49.474753 #2127198] INFO -- : making encs I, [2024-05-26T09:21:49.533287 #2127198] INFO -- : make[1]: Entering directory '/home/opc/ruby/build/master' I, [2024-05-26T09:21:49.533388 #2127198] INFO -- : make[1]: Nothing to be done for 'encs'. I, [2024-05-26T09:21:49.533426 #2127198] INFO -- : make[1]: Leaving directory '/home/opc/ruby/build/master' I, [2024-05-26T09:21:50.120192 #2127198] INFO -- : make[1]: Leaving directory '/home/opc/ruby/build/master' I, [2024-05-26T09:21:50.120953 #2127198] INFO -- : generating makefile exts.mk I, [2024-05-26T09:21:50.179765 #2127198] INFO -- : exts.mk unchanged I, [2024-05-26T09:21:50.184845 #2127198] INFO -- : make[1]: Entering directory '/home/opc/ruby/build/master' I, [2024-05-26T09:21:50.289814 #2127198] INFO -- : make[2]: Entering directory '/home/opc/ruby/build/master/ext/coverage' I, [2024-05-26T09:21:50.291782 #2127198] INFO -- : make[2]: Entering directory '/home/opc/ruby/build/master/ext/digest' I, [2024-05-26T09:21:50.292791 #2127198] INFO -- : make[2]: Entering directory '/home/opc/ruby/build/master/ext/date' I, [2024-05-26T09:21:50.294242 #2127198] INFO -- : make[2]: Leaving directory '/home/opc/ruby/build/master/ext/coverage' I, [2024-05-26T09:21:50.298083 #2127198] INFO -- : make[2]: Leaving directory '/home/opc/ruby/build/master/ext/date' I, [2024-05-26T09:21:50.300412 #2127198] INFO -- : make[2]: Leaving directory '/home/opc/ruby/build/master/ext/digest' I, [2024-05-26T09:21:50.306491 #2127198] INFO -- : make[2]: Entering directory '/home/opc/ruby/build/master/ext/io/console' I, [2024-05-26T09:21:50.308099 #2127198] INFO -- : make[2]: Entering directory '/home/opc/ruby/build/master/ext/fiddle' I, [2024-05-26T09:21:50.310946 #2127198] INFO -- : make[2]: Leaving directory '/home/opc/ruby/build/master/ext/io/console' I, [2024-05-26T09:21:50.315961 #2127198] INFO -- : make[2]: Leaving directory '/home/opc/ruby/build/master/ext/fiddle' I, [2024-05-26T09:21:50.316001 #2127198] INFO -- : make[2]: Entering directory '/home/opc/ruby/build/master/ext/json' I, [2024-05-26T09:21:50.319431 #2127198] INFO -- : make[2]: Entering directory '/home/opc/ruby/build/master/ext/monitor' I, [2024-05-26T09:21:50.324878 #2127198] INFO -- : make[2]: Leaving directory '/home/opc/ruby/build/master/ext/json' I, [2024-05-26T09:21:50.325551 #2127198] INFO -- : make[2]: Entering directory '/home/opc/ruby/build/master/ext/objspace' I, [2024-05-26T09:21:50.325719 #2127198] INFO -- : make[2]: Leaving directory '/home/opc/ruby/build/master/ext/monitor' I, [2024-05-26T09:21:50.330593 #2127198] INFO -- : make[2]: Entering directory '/home/opc/ruby/build/master/ext/pathname' I, [2024-05-26T09:21:50.331346 #2127198] INFO -- : make[2]: Leaving directory '/home/opc/ruby/build/master/ext/objspace' I, [2024-05-26T09:21:50.334840 #2127198] INFO -- : make[2]: Leaving directory '/home/opc/ruby/build/master/ext/pathname' I, [2024-05-26T09:21:50.337980 #2127198] INFO -- : make[2]: Entering directory '/home/opc/ruby/build/master/ext/psych' I, [2024-05-26T09:21:50.339041 #2127198] INFO -- : make[2]: Entering directory '/home/opc/ruby/build/master/ext/pty' I, [2024-05-26T09:21:50.344015 #2127198] INFO -- : make[2]: Entering directory '/home/opc/ruby/build/master/ext/openssl' I, [2024-05-26T09:21:50.346519 #2127198] INFO -- : make[2]: Leaving directory '/home/opc/ruby/build/master/ext/pty' I, [2024-05-26T09:21:50.353471 #2127198] INFO -- : make[2]: Leaving directory '/home/opc/ruby/build/master/ext/psych' I, [2024-05-26T09:21:50.360360 #2127198] INFO -- : make[2]: Entering directory '/home/opc/ruby/build/master/ext/rubyvm' I, [2024-05-26T09:21:50.361588 #2127198] INFO -- : make[2]: Entering directory '/home/opc/ruby/build/master/ext/ripper' I, [2024-05-26T09:21:50.365519 #2127198] INFO -- : make[2]: Leaving directory '/home/opc/ruby/build/master/ext/rubyvm' I, [2024-05-26T09:21:50.369063 #2127198] INFO -- : make[2]: Leaving directory '/home/opc/ruby/build/master/ext/ripper' I, [2024-05-26T09:21:50.370958 #2127198] INFO -- : make[2]: Leaving directory '/home/opc/ruby/build/master/ext/openssl' I, [2024-05-26T09:21:50.377544 #2127198] INFO -- : make[2]: Entering directory '/home/opc/ruby/build/master/.bundle/gems/bigdecimal-3.1.7/ext/bigdecimal' I, [2024-05-26T09:21:50.380575 #2127198] INFO -- : make[2]: Entering directory '/home/opc/ruby/build/master/.bundle/gems/bigdecimal-3.1.8/ext/bigdecimal' I, [2024-05-26T09:21:50.382039 #2127198] INFO -- : make[2]: Entering directory '/home/opc/ruby/build/master/ext/socket' I, [2024-05-26T09:21:50.393203 #2127198] INFO -- : make[2]: Leaving directory '/home/opc/ruby/build/master/ext/socket' I, [2024-05-26T09:21:50.395828 #2127198] INFO -- : make[2]: Entering directory '/home/opc/ruby/build/master/.bundle/gems/debug-1.9.2/ext/debug' I, [2024-05-26T09:21:50.410761 #2127198] INFO -- : make[2]: Leaving directory '/home/opc/ruby/build/master/.bundle/gems/bigdecimal-3.1.7/ext/bigdecimal' I, [2024-05-26T09:21:50.412069 #2127198] INFO -- : make[2]: Leaving directory '/home/opc/ruby/build/master/.bundle/gems/bigdecimal-3.1.8/ext/bigdecimal' I, [2024-05-26T09:21:50.413958 #2127198] INFO -- : make[2]: Entering directory '/home/opc/ruby/build/master/.bundle/gems/nkf-0.2.0/ext/nkf' I, [2024-05-26T09:21:50.415342 #2127198] INFO -- : make[2]: Entering directory '/home/opc/ruby/build/master/.bundle/gems/racc-1.7.3/ext/racc/cparse' I, [2024-05-26T09:21:50.426386 #2127198] INFO -- : make[2]: Leaving directory '/home/opc/ruby/build/master/.bundle/gems/debug-1.9.2/ext/debug' I, [2024-05-26T09:21:50.431001 #2127198] INFO -- : make[2]: Entering directory '/home/opc/ruby/build/master/.bundle/gems/racc-1.8.0/ext/racc/cparse' I, [2024-05-26T09:21:50.446410 #2127198] INFO -- : make[2]: Leaving directory '/home/opc/ruby/build/master/.bundle/gems/nkf-0.2.0/ext/nkf' I, [2024-05-26T09:21:50.446912 #2127198] INFO -- : make[2]: Leaving directory '/home/opc/ruby/build/master/.bundle/gems/racc-1.7.3/ext/racc/cparse' I, [2024-05-26T09:21:50.449550 #2127198] INFO -- : make[2]: Entering directory '/home/opc/ruby/build/master/.bundle/gems/rbs-3.4.4/ext/rbs_extension' I, [2024-05-26T09:21:50.449614 #2127198] INFO -- : make[2]: Entering directory '/home/opc/ruby/build/master/.bundle/gems/syslog-0.1.2/ext/syslog' I, [2024-05-26T09:21:50.463939 #2127198] INFO -- : make[2]: Leaving directory '/home/opc/ruby/build/master/.bundle/gems/racc-1.8.0/ext/racc/cparse' I, [2024-05-26T09:21:50.480951 #2127198] INFO -- : make[2]: Leaving directory '/home/opc/ruby/build/master/.bundle/gems/syslog-0.1.2/ext/syslog' I, [2024-05-26T09:21:50.481021 #2127198] INFO -- : make[2]: Leaving directory '/home/opc/ruby/build/master/.bundle/gems/rbs-3.4.4/ext/rbs_extension' I, [2024-05-26T09:21:50.485599 #2127198] INFO -- : make[2]: Entering directory '/home/opc/ruby/build/master/ext/digest/sha2' I, [2024-05-26T09:21:50.490015 #2127198] INFO -- : make[2]: Leaving directory '/home/opc/ruby/build/master/ext/digest/sha2' I, [2024-05-26T09:21:50.528326 #2127198] INFO -- : make[2]: Entering directory '/home/opc/ruby/build/master' I, [2024-05-26T09:21:50.612223 #2127198] INFO -- : make[2]: 'ruby' is up to date. I, [2024-05-26T09:21:50.612300 #2127198] INFO -- : make[2]: Leaving directory '/home/opc/ruby/build/master' I, [2024-05-26T09:21:50.612402 #2127198] INFO -- : make[1]: Leaving directory '/home/opc/ruby/build/master' I, [2024-05-26T09:21:50.616863 #2127198] INFO -- : make[1]: Entering directory '/home/opc/ruby/build/master' I, [2024-05-26T09:21:50.616896 #2127198] INFO -- : make[1]: Nothing to be done for 'note'. I, [2024-05-26T09:21:50.616907 #2127198] INFO -- : make[1]: Leaving directory '/home/opc/ruby/build/master' I, [2024-05-26T09:21:50.617072 #2127198] INFO -- : ./miniruby -I/home/opc/ruby/src/master/lib -I. -I.ext/common /home/opc/ruby/src/master/tool/runruby.rb --extout=.ext -- --disable-gems -r./aarch64-linux-fake /home/opc/ruby/src/master/tool/rbinstall.rb --make="make" --dest-dir="" --extout=".ext" --ext-build-dir="./ext" --mflags="-j3 --jobserver-auth=4,5" --make-flags=" -j3 --jobserver-auth=4,5" --data-mode=0644 --prog-mode=0755 --installed-list .installed.list --mantype="doc" --gnumake --install=all --exclude=doc I, [2024-05-26T09:21:50.774160 #2127198] INFO -- : Installing to I, [2024-05-26T09:21:50.774232 #2127198] INFO -- : installing binary commands: /home/opc/ruby/install/master/bin I, [2024-05-26T09:21:50.787187 #2127198] INFO -- : installing base libraries: /home/opc/ruby/install/master/lib I, [2024-05-26T09:21:50.787670 #2127198] INFO -- : installing arch files: /home/opc/ruby/install/master/lib/ruby/3.4.0+0/aarch64-linux I, [2024-05-26T09:21:50.787780 #2127198] INFO -- : installing pkgconfig data: /home/opc/ruby/install/master/lib/pkgconfig I, [2024-05-26T09:21:50.787854 #2127198] INFO -- : installing extension objects: /home/opc/ruby/install/master/lib/ruby/3.4.0+0/aarch64-linux I, [2024-05-26T09:21:50.800962 #2127198] INFO -- : installing extension objects: /home/opc/ruby/install/master/lib/ruby/site_ruby/3.4.0+0/aarch64-linux I, [2024-05-26T09:21:50.801000 #2127198] INFO -- : installing extension objects: /home/opc/ruby/install/master/lib/ruby/vendor_ruby/3.4.0+0/aarch64-linux I, [2024-05-26T09:21:50.801117 #2127198] INFO -- : installing extension headers: /home/opc/ruby/install/master/include/ruby-3.4.0+0/aarch64-linux I, [2024-05-26T09:21:50.801442 #2127198] INFO -- : installing extension scripts: /home/opc/ruby/install/master/lib/ruby/3.4.0+0 I, [2024-05-26T09:21:50.809557 #2127198] INFO -- : installing extension scripts: /home/opc/ruby/install/master/lib/ruby/site_ruby/3.4.0+0 I, [2024-05-26T09:21:50.809576 #2127198] INFO -- : installing extension scripts: /home/opc/ruby/install/master/lib/ruby/vendor_ruby/3.4.0+0 I, [2024-05-26T09:21:50.809588 #2127198] INFO -- : installing extension headers: /home/opc/ruby/install/master/include/ruby-3.4.0+0/ruby I, [2024-05-26T09:21:50.809720 #2127198] INFO -- : installing command scripts: /home/opc/ruby/install/master/bin I, [2024-05-26T09:21:50.809863 #2127198] INFO -- : installing library scripts: /home/opc/ruby/install/master/lib/ruby/3.4.0+0 I, [2024-05-26T09:21:50.893762 #2127198] INFO -- : installing common headers: /home/opc/ruby/install/master/include/ruby-3.4.0+0 I, [2024-05-26T09:21:50.905752 #2127198] INFO -- : installing manpages: /home/opc/ruby/install/master/share/man/man1 I, [2024-05-26T09:21:50.906071 #2127198] INFO -- : installing default gems from lib: /home/opc/ruby/install/master/lib/ruby/gems/3.4.0+0 I, [2024-05-26T09:21:50.953162 #2127198] INFO -- : benchmark 0.3.0 I, [2024-05-26T09:21:50.957320 #2127198] INFO -- : bundler 2.6.0.dev I, [2024-05-26T09:21:50.962038 #2127198] INFO -- : cgi 0.4.1 I, [2024-05-26T09:21:50.963168 #2127198] INFO -- : delegate 0.3.1 I, [2024-05-26T09:21:50.964281 #2127198] INFO -- : did_you_mean 1.6.3 I, [2024-05-26T09:21:50.965465 #2127198] INFO -- : english 0.8.0 I, [2024-05-26T09:21:50.967585 #2127198] INFO -- : erb 4.0.4 I, [2024-05-26T09:21:50.970387 #2127198] INFO -- : error_highlight 0.6.0 I, [2024-05-26T09:21:50.971462 #2127198] INFO -- : fileutils 1.7.2 I, [2024-05-26T09:21:50.972591 #2127198] INFO -- : find 0.2.0 I, [2024-05-26T09:21:50.973776 #2127198] INFO -- : forwardable 1.3.3 I, [2024-05-26T09:21:50.974884 #2127198] INFO -- : ipaddr 1.2.6 I, [2024-05-26T09:21:50.975951 #2127198] INFO -- : irb 1.13.1 I, [2024-05-26T09:21:50.978758 #2127198] INFO -- : logger 1.6.0 I, [2024-05-26T09:21:50.979860 #2127198] INFO -- : net-http 0.4.1 I, [2024-05-26T09:21:50.981089 #2127198] INFO -- : net-protocol 0.2.2 I, [2024-05-26T09:21:50.982294 #2127198] INFO -- : open-uri 0.4.1 I, [2024-05-26T09:21:50.983409 #2127198] INFO -- : open3 0.2.1 I, [2024-05-26T09:21:50.984541 #2127198] INFO -- : optparse 0.5.0 I, [2024-05-26T09:21:50.985691 #2127198] INFO -- : ostruct 0.6.0 I, [2024-05-26T09:21:50.986769 #2127198] INFO -- : pp 0.5.0 I, [2024-05-26T09:21:50.987957 #2127198] INFO -- : prettyprint 0.2.0 I, [2024-05-26T09:21:50.989621 #2127198] INFO -- : prism 0.29.0 I, [2024-05-26T09:21:50.990803 #2127198] INFO -- : pstore 0.1.3 I, [2024-05-26T09:21:50.991897 #2127198] INFO -- : rdoc 6.7.0 I, [2024-05-26T09:21:50.995699 #2127198] INFO -- : readline 0.0.4 I, [2024-05-26T09:21:50.996888 #2127198] INFO -- : reline 0.5.7 I, [2024-05-26T09:21:50.998122 #2127198] INFO -- : resolv 0.4.0 I, [2024-05-26T09:21:50.999263 #2127198] INFO -- : ruby2_keywords 0.0.5 I, [2024-05-26T09:21:51.002051 #2127198] INFO -- : securerandom 0.3.1 I, [2024-05-26T09:21:51.003136 #2127198] INFO -- : set 1.1.0 I, [2024-05-26T09:21:51.004220 #2127198] INFO -- : shellwords 0.2.0 I, [2024-05-26T09:21:51.005365 #2127198] INFO -- : singleton 0.2.0 I, [2024-05-26T09:21:51.006485 #2127198] INFO -- : syntax_suggest 2.0.0 I, [2024-05-26T09:21:51.008955 #2127198] INFO -- : tempfile 0.2.1 I, [2024-05-26T09:21:51.010145 #2127198] INFO -- : time 0.3.0 I, [2024-05-26T09:21:51.011285 #2127198] INFO -- : timeout 0.4.1 I, [2024-05-26T09:21:51.012408 #2127198] INFO -- : tmpdir 0.2.0 I, [2024-05-26T09:21:51.013626 #2127198] INFO -- : tsort 0.2.0 I, [2024-05-26T09:21:51.014794 #2127198] INFO -- : un 0.3.0 I, [2024-05-26T09:21:51.016155 #2127198] INFO -- : uri 0.13.0 I, [2024-05-26T09:21:51.017427 #2127198] INFO -- : weakref 0.1.3 I, [2024-05-26T09:21:51.018571 #2127198] INFO -- : yaml 0.3.0 I, [2024-05-26T09:21:51.019495 #2127198] INFO -- : installing default gems from ext: /home/opc/ruby/install/master/lib/ruby/gems/3.4.0+0 I, [2024-05-26T09:21:51.029226 #2127198] INFO -- : date 3.3.4 I, [2024-05-26T09:21:51.032213 #2127198] INFO -- : digest 3.1.1 I, [2024-05-26T09:21:51.033392 #2127198] INFO -- : etc 1.4.3 I, [2024-05-26T09:21:51.034574 #2127198] INFO -- : fcntl 1.1.0 I, [2024-05-26T09:21:51.035672 #2127198] INFO -- : fiddle 1.1.3 I, [2024-05-26T09:21:51.036860 #2127198] INFO -- : io-console 0.7.2 I, [2024-05-26T09:21:51.038001 #2127198] INFO -- : io-nonblock 0.3.0 I, [2024-05-26T09:21:51.039089 #2127198] INFO -- : io-wait 0.3.1 I, [2024-05-26T09:21:51.040128 #2127198] INFO -- : json 2.7.2 I, [2024-05-26T09:21:51.041499 #2127198] INFO -- : openssl 3.2.0 I, [2024-05-26T09:21:51.042632 #2127198] INFO -- : pathname 0.3.0 I, [2024-05-26T09:21:51.044168 #2127198] INFO -- : psych 5.1.2 I, [2024-05-26T09:21:51.045491 #2127198] INFO -- : stringio 3.1.1 I, [2024-05-26T09:21:51.046647 #2127198] INFO -- : strscan 3.1.1 I, [2024-05-26T09:21:51.047740 #2127198] INFO -- : zlib 3.1.0 I, [2024-05-26T09:21:51.048695 #2127198] INFO -- : installing bundled gems: /home/opc/ruby/install/master/lib/ruby/gems/3.4.0+0 I, [2024-05-26T09:21:51.049753 #2127198] INFO -- : minitest 5.23.1 I, [2024-05-26T09:21:51.067902 #2127198] INFO -- : rake 13.2.1 I, [2024-05-26T09:21:51.086386 #2127198] INFO -- : test-unit 3.6.2 I, [2024-05-26T09:21:51.100769 #2127198] INFO -- : rexml 3.2.8 I, [2024-05-26T09:21:51.121348 #2127198] INFO -- : rss 0.3.0 I, [2024-05-26T09:21:51.131572 #2127198] INFO -- : net-ftp 0.3.4 I, [2024-05-26T09:21:51.135699 #2127198] INFO -- : net-imap 0.4.11 I, [2024-05-26T09:21:51.150093 #2127198] INFO -- : net-pop 0.1.2 I, [2024-05-26T09:21:51.152836 #2127198] INFO -- : net-smtp 0.5.0 I, [2024-05-26T09:21:51.156297 #2127198] INFO -- : matrix 0.4.2 I, [2024-05-26T09:21:51.164656 #2127198] INFO -- : prime 0.1.2 I, [2024-05-26T09:21:51.173533 #2127198] INFO -- : rbs 3.4.4 I, [2024-05-26T09:21:51.279782 #2127198] INFO -- : typeprof 0.21.11 I, [2024-05-26T09:21:51.294426 #2127198] INFO -- : debug 1.9.2 I, [2024-05-26T09:21:51.306450 #2127198] INFO -- : racc 1.8.0 I, [2024-05-26T09:21:51.319131 #2127198] INFO -- : mutex_m 0.2.0 I, [2024-05-26T09:21:51.322156 #2127198] INFO -- : getoptlong 0.2.1 I, [2024-05-26T09:21:51.327135 #2127198] INFO -- : base64 0.2.0 I, [2024-05-26T09:21:51.329707 #2127198] INFO -- : bigdecimal 3.1.8 I, [2024-05-26T09:21:51.336360 #2127198] INFO -- : observer 0.1.2 I, [2024-05-26T09:21:51.339591 #2127198] INFO -- : abbrev 0.1.2 I, [2024-05-26T09:21:51.342617 #2127198] INFO -- : resolv-replace 0.1.1 I, [2024-05-26T09:21:51.347057 #2127198] INFO -- : rinda 0.2.0 I, [2024-05-26T09:21:51.350744 #2127198] INFO -- : drb 2.2.1 I, [2024-05-26T09:21:51.355917 #2127198] INFO -- : nkf 0.2.0 I, [2024-05-26T09:21:51.362817 #2127198] INFO -- : syslog 0.1.2 I, [2024-05-26T09:21:51.367867 #2127198] INFO -- : csv 3.3.0 I, [2024-05-26T09:21:51.379250 #2127198] INFO -- : installing bundled gem cache: /home/opc/ruby/install/master/lib/ruby/gems/3.4.0+0/cache I, [2024-05-26T09:21:51.381272 #2127198] INFO -- : skipped bundled gems: I, [2024-05-26T09:21:51.381299 #2127198] INFO -- : power_assert-2.0.4dev.gem not found in bundled_gems I, [2024-05-26T09:21:51.384292 #2127198] INFO -- : $$$[end] "make install -j3" exit with 0. I, [2024-05-26T09:21:51.384425 #2127198] INFO -- : $$$[beg] make yes-btest TESTOPTS='-q -j3' I, [2024-05-26T09:22:13.464185 #2127198] INFO -- : PASS all 1936 tests E, [2024-05-26T09:22:13.466235 #2127198] ERROR -- : I, [2024-05-26T09:22:13.466373 #2127198] INFO -- : $$$[end] "make yes-btest TESTOPTS='-q -j3'" exit with 0. I, [2024-05-26T09:22:13.466507 #2127198] INFO -- : $$$[beg] make yes-test-basic TESTS='-j3' I, [2024-05-26T09:22:13.560406 #2127198] INFO -- : BASERUBY = /usr/local/bin/ruby --disable=gems I, [2024-05-26T09:22:13.560474 #2127198] INFO -- : CC = gcc I, [2024-05-26T09:22:13.560496 #2127198] INFO -- : LD = ld I, [2024-05-26T09:22:13.560510 #2127198] INFO -- : LDSHARED = gcc -shared I, [2024-05-26T09:22:13.560523 #2127198] INFO -- : CFLAGS = -O3 -fno-fast-math -ggdb3 -Wall -Wextra -Wdeprecated-declarations -Wdiv-by-zero -Wduplicated-cond -Wimplicit-function-declaration -Wimplicit-int -Wpointer-arith -Wwrite-strings -Wold-style-definition -Wimplicit-fallthrough=0 -Wmissing-noreturn -Wno-cast-function-type -Wno-constant-logical-operand -Wno-long-long -Wno-missing-field-initializers -Wno-overlength-strings -Wno-packed-bitfield-compat -Wno-parentheses-equality -Wno-self-assign -Wno-tautological-compare -Wno-unused-parameter -Wno-unused-value -Wsuggest-attribute=format -Wsuggest-attribute=noreturn -Wunused-variable -Wmisleading-indentation -Wundef I, [2024-05-26T09:22:13.560534 #2127198] INFO -- : XCFLAGS = -U_FORTIFY_SOURCE -D_FORTIFY_SOURCE=2 -fstack-protector-strong -msign-return-address=all -fno-strict-overflow -fvisibility=hidden -fexcess-precision=standard -DRUBY_EXPORT -fPIE -I. -I.ext/include/aarch64-linux -I/home/opc/ruby/src/master/include -I/home/opc/ruby/src/master -I/home/opc/ruby/src/master/prism -I/home/opc/ruby/src/master/enc/unicode/15.0.0 I, [2024-05-26T09:22:13.560555 #2127198] INFO -- : CPPFLAGS = I, [2024-05-26T09:22:13.561948 #2127198] INFO -- : DLDFLAGS = -Wl,--compress-debug-sections=zlib -fstack-protector-strong -pie I, [2024-05-26T09:22:13.561990 #2127198] INFO -- : SOLIBS = -lz -lrt -lrt -ldl -lcrypt -lm -lpthread I, [2024-05-26T09:22:13.561999 #2127198] INFO -- : LANG = en_US.UTF-8 I, [2024-05-26T09:22:13.562008 #2127198] INFO -- : LC_ALL = I, [2024-05-26T09:22:13.562016 #2127198] INFO -- : LC_CTYPE = I, [2024-05-26T09:22:13.562024 #2127198] INFO -- : MFLAGS = I, [2024-05-26T09:22:13.562032 #2127198] INFO -- : RUSTC = rustc I, [2024-05-26T09:22:13.562041 #2127198] INFO -- : YJIT_RUSTC_ARGS = --crate-name=yjit --crate-type=staticlib --edition=2021 -g -C lto=thin -C opt-level=3 -C overflow-checks=on '--out-dir=/home/opc/ruby/build/master/yjit/target/release/' /home/opc/ruby/src/master/yjit/src/lib.rs I, [2024-05-26T09:22:13.562812 #2127198] INFO -- : gcc (GCC) 8.5.0 20210514 (Red Hat 8.5.0-10.1.0.1) I, [2024-05-26T09:22:13.562846 #2127198] INFO -- : Copyright (C) 2018 Free Software Foundation, Inc. I, [2024-05-26T09:22:13.562857 #2127198] INFO -- : This is free software; see the source for copying conditions. There is NO I, [2024-05-26T09:22:13.562866 #2127198] INFO -- : warranty; not even for MERCHANTABILITY or FITNESS FOR A PARTICULAR PURPOSE. I, [2024-05-26T09:22:13.562875 #2127198] INFO -- : I, [2024-05-26T09:22:13.722189 #2127198] INFO -- : Checking leaked global symbols...none I, [2024-05-26T09:22:13.775766 #2127198] INFO -- : /home/opc/ruby/src/master/basictest/test.rb:assignment ....................................................................................................................................................................................................................................................................................................................................................................................OK 372 I, [2024-05-26T09:22:13.775841 #2127198] INFO -- : /home/opc/ruby/src/master/basictest/test.rb:condition ..OK 2 I, [2024-05-26T09:22:13.775856 #2127198] INFO -- : /home/opc/ruby/src/master/basictest/test.rb:if/unless ...OK 3 I, [2024-05-26T09:22:13.775908 #2127198] INFO -- : /home/opc/ruby/src/master/basictest/test.rb:case .....OK 5 I, [2024-05-26T09:22:13.776535 #2127198] INFO -- : /home/opc/ruby/src/master/basictest/test.rb:while/until ........OK 8 I, [2024-05-26T09:22:13.776650 #2127198] INFO -- : /home/opc/ruby/src/master/basictest/test.rb:exception ..........OK 10 I, [2024-05-26T09:22:13.777308 #2127198] INFO -- : /home/opc/ruby/src/master/basictest/test.rb:array .......................................OK 39 I, [2024-05-26T09:22:13.777579 #2127198] INFO -- : /home/opc/ruby/src/master/basictest/test.rb:hash ...........................OK 27 I, [2024-05-26T09:22:13.779201 #2127198] INFO -- : /home/opc/ruby/src/master/basictest/test.rb:iterator ...........................................................................................................OK 107 I, [2024-05-26T09:22:13.779933 #2127198] INFO -- : /home/opc/ruby/src/master/basictest/test.rb:float ................................................................................OK 80 I, [2024-05-26T09:22:13.783619 #2127198] INFO -- : /home/opc/ruby/src/master/basictest/test.rb:bignum ...............................OK 31 I, [2024-05-26T09:22:13.785281 #2127198] INFO -- : /home/opc/ruby/src/master/basictest/test.rb:string & char ..............................................................OK 62 I, [2024-05-26T09:22:13.785351 #2127198] INFO -- : /home/opc/ruby/src/master/basictest/test.rb:assignment ..........OK 10 I, [2024-05-26T09:22:13.785424 #2127198] INFO -- : /home/opc/ruby/src/master/basictest/test.rb:call ......OK 6 I, [2024-05-26T09:22:13.785552 #2127198] INFO -- : /home/opc/ruby/src/master/basictest/test.rb:proc .........OK 9 I, [2024-05-26T09:22:13.886206 #2127198] INFO -- : /home/opc/ruby/src/master/basictest/test.rb:signal ..OK 2 I, [2024-05-26T09:22:13.887568 #2127198] INFO -- : /home/opc/ruby/src/master/basictest/test.rb:eval ...........................OK 27 I, [2024-05-26T09:22:14.028016 #2127198] INFO -- : /home/opc/ruby/src/master/basictest/test.rb:system ........OK 8 I, [2024-05-26T09:22:14.028087 #2127198] INFO -- : /home/opc/ruby/src/master/basictest/test.rb:const .....OK 5 I, [2024-05-26T09:22:14.028186 #2127198] INFO -- : /home/opc/ruby/src/master/basictest/test.rb:clone .....OK 5 I, [2024-05-26T09:22:14.028373 #2127198] INFO -- : /home/opc/ruby/src/master/basictest/test.rb:marshal ....OK 4 I, [2024-05-26T09:22:14.028450 #2127198] INFO -- : /home/opc/ruby/src/master/basictest/test.rb:pack ....OK 4 I, [2024-05-26T09:22:14.028481 #2127198] INFO -- : /home/opc/ruby/src/master/basictest/test.rb:math ..OK 2 I, [2024-05-26T09:22:14.028597 #2127198] INFO -- : /home/opc/ruby/src/master/basictest/test.rb:struct ......OK 6 I, [2024-05-26T09:22:14.028765 #2127198] INFO -- : /home/opc/ruby/src/master/basictest/test.rb:variable ............OK 12 I, [2024-05-26T09:22:14.028806 #2127198] INFO -- : /home/opc/ruby/src/master/basictest/test.rb:trace ...OK 3 I, [2024-05-26T09:22:14.028938 #2127198] INFO -- : /home/opc/ruby/src/master/basictest/test.rb:defined? ............OK 12 I, [2024-05-26T09:22:14.029029 #2127198] INFO -- : /home/opc/ruby/src/master/basictest/test.rb:alias ......OK 6 I, [2024-05-26T09:22:14.029665 #2127198] INFO -- : /home/opc/ruby/src/master/basictest/test.rb:path .......................OK 23 I, [2024-05-26T09:22:14.097073 #2127198] INFO -- : /home/opc/ruby/src/master/basictest/test.rb:gc ....OK 4 I, [2024-05-26T09:22:14.099027 #2127198] INFO -- : I, [2024-05-26T09:22:14.099053 #2127198] INFO -- : test succeeded I, [2024-05-26T09:22:14.099615 #2127198] INFO -- : $$$[end] "make yes-test-basic TESTS='-j3'" exit with 0. I, [2024-05-26T09:22:14.099815 #2127198] INFO -- : $$$[beg] make yes-test-all TESTOPTS='--stderr-on-failure' TESTS='-j3' I, [2024-05-26T09:22:14.225489 #2127198] INFO -- : BASERUBY = /usr/local/bin/ruby --disable=gems I, [2024-05-26T09:22:14.225566 #2127198] INFO -- : CC = gcc I, [2024-05-26T09:22:14.225579 #2127198] INFO -- : LD = ld I, [2024-05-26T09:22:14.225588 #2127198] INFO -- : LDSHARED = gcc -shared I, [2024-05-26T09:22:14.225601 #2127198] INFO -- : CFLAGS = -O3 -fno-fast-math -ggdb3 -Wall -Wextra -Wdeprecated-declarations -Wdiv-by-zero -Wduplicated-cond -Wimplicit-function-declaration -Wimplicit-int -Wpointer-arith -Wwrite-strings -Wold-style-definition -Wimplicit-fallthrough=0 -Wmissing-noreturn -Wno-cast-function-type -Wno-constant-logical-operand -Wno-long-long -Wno-missing-field-initializers -Wno-overlength-strings -Wno-packed-bitfield-compat -Wno-parentheses-equality -Wno-self-assign -Wno-tautological-compare -Wno-unused-parameter -Wno-unused-value -Wsuggest-attribute=format -Wsuggest-attribute=noreturn -Wunused-variable -Wmisleading-indentation -Wundef I, [2024-05-26T09:22:14.225612 #2127198] INFO -- : XCFLAGS = -U_FORTIFY_SOURCE -D_FORTIFY_SOURCE=2 -fstack-protector-strong -msign-return-address=all -fno-strict-overflow -fvisibility=hidden -fexcess-precision=standard -DRUBY_EXPORT -fPIE -I. -I.ext/include/aarch64-linux -I/home/opc/ruby/src/master/include -I/home/opc/ruby/src/master -I/home/opc/ruby/src/master/prism -I/home/opc/ruby/src/master/enc/unicode/15.0.0 I, [2024-05-26T09:22:14.225622 #2127198] INFO -- : CPPFLAGS = I, [2024-05-26T09:22:14.225630 #2127198] INFO -- : DLDFLAGS = -Wl,--compress-debug-sections=zlib -fstack-protector-strong -pie I, [2024-05-26T09:22:14.225640 #2127198] INFO -- : SOLIBS = -lz -lrt -lrt -ldl -lcrypt -lm -lpthread I, [2024-05-26T09:22:14.225649 #2127198] INFO -- : LANG = en_US.UTF-8 I, [2024-05-26T09:22:14.225658 #2127198] INFO -- : LC_ALL = I, [2024-05-26T09:22:14.225667 #2127198] INFO -- : LC_CTYPE = I, [2024-05-26T09:22:14.225676 #2127198] INFO -- : MFLAGS = I, [2024-05-26T09:22:14.225684 #2127198] INFO -- : RUSTC = rustc I, [2024-05-26T09:22:14.225692 #2127198] INFO -- : YJIT_RUSTC_ARGS = --crate-name=yjit --crate-type=staticlib --edition=2021 -g -C lto=thin -C opt-level=3 -C overflow-checks=on '--out-dir=/home/opc/ruby/build/master/yjit/target/release/' /home/opc/ruby/src/master/yjit/src/lib.rs I, [2024-05-26T09:22:14.226738 #2127198] INFO -- : gcc (GCC) 8.5.0 20210514 (Red Hat 8.5.0-10.1.0.1) I, [2024-05-26T09:22:14.226755 #2127198] INFO -- : Copyright (C) 2018 Free Software Foundation, Inc. I, [2024-05-26T09:22:14.226766 #2127198] INFO -- : This is free software; see the source for copying conditions. There is NO I, [2024-05-26T09:22:14.226775 #2127198] INFO -- : warranty; not even for MERCHANTABILITY or FITNESS FOR A PARTICULAR PURPOSE. I, [2024-05-26T09:22:14.226784 #2127198] INFO -- : I, [2024-05-26T09:22:14.228821 #2127198] INFO -- : generating enc.mk I, [2024-05-26T09:22:14.461576 #2127198] INFO -- : generating encdb.h I, [2024-05-26T09:22:14.499570 #2127198] INFO -- : encdb.h unchanged I, [2024-05-26T09:22:14.500839 #2127198] INFO -- : making enc I, [2024-05-26T09:22:14.528516 #2127198] INFO -- : make[1]: Entering directory '/home/opc/ruby/build/master' I, [2024-05-26T09:22:14.528583 #2127198] INFO -- : make[1]: Nothing to be done for 'enc'. I, [2024-05-26T09:22:14.528604 #2127198] INFO -- : make[1]: Leaving directory '/home/opc/ruby/build/master' I, [2024-05-26T09:22:14.529391 #2127198] INFO -- : making srcs under enc I, [2024-05-26T09:22:14.571691 #2127198] INFO -- : make[1]: Entering directory '/home/opc/ruby/build/master' I, [2024-05-26T09:22:14.571759 #2127198] INFO -- : make[1]: Nothing to be done for 'srcs'. I, [2024-05-26T09:22:14.571771 #2127198] INFO -- : make[1]: Leaving directory '/home/opc/ruby/build/master' I, [2024-05-26T09:22:14.572916 #2127198] INFO -- : generating transdb.h I, [2024-05-26T09:22:14.718653 #2127198] INFO -- : transdb.h unchanged I, [2024-05-26T09:22:14.720014 #2127198] INFO -- : making trans I, [2024-05-26T09:22:14.769152 #2127198] INFO -- : make[1]: Entering directory '/home/opc/ruby/build/master' I, [2024-05-26T09:22:14.769240 #2127198] INFO -- : make[1]: Nothing to be done for 'trans'. I, [2024-05-26T09:22:14.769260 #2127198] INFO -- : make[1]: Leaving directory '/home/opc/ruby/build/master' I, [2024-05-26T09:22:14.770222 #2127198] INFO -- : making encs I, [2024-05-26T09:22:14.824030 #2127198] INFO -- : make[1]: Entering directory '/home/opc/ruby/build/master' I, [2024-05-26T09:22:14.824107 #2127198] INFO -- : make[1]: Nothing to be done for 'encs'. I, [2024-05-26T09:22:14.824117 #2127198] INFO -- : make[1]: Leaving directory '/home/opc/ruby/build/master' I, [2024-05-26T09:22:14.826445 #2127198] INFO -- : generating makefiles ext/configure-ext.mk I, [2024-05-26T09:22:14.866227 #2127198] INFO -- : ext/configure-ext.mk updated I, [2024-05-26T09:22:14.869719 #2127198] INFO -- : make[1]: Entering directory '/home/opc/ruby/build/master' I, [2024-05-26T09:22:17.001795 #2127198] INFO -- : make[1]: Leaving directory '/home/opc/ruby/build/master' I, [2024-05-26T09:22:17.002479 #2127198] INFO -- : generating makefile exts.mk I, [2024-05-26T09:22:17.063110 #2127198] INFO -- : exts.mk unchanged I, [2024-05-26T09:22:17.067335 #2127198] INFO -- : make[1]: Entering directory '/home/opc/ruby/build/master' I, [2024-05-26T09:22:17.364093 #2127198] INFO -- : make[2]: Entering directory '/home/opc/ruby/build/master/ext/coverage' I, [2024-05-26T09:22:17.368762 #2127198] INFO -- : make[2]: Leaving directory '/home/opc/ruby/build/master/ext/coverage' I, [2024-05-26T09:22:17.374429 #2127198] INFO -- : make[2]: Entering directory '/home/opc/ruby/build/master/ext/date' I, [2024-05-26T09:22:17.379583 #2127198] INFO -- : make[2]: Leaving directory '/home/opc/ruby/build/master/ext/date' I, [2024-05-26T09:22:17.382881 #2127198] INFO -- : make[2]: Entering directory '/home/opc/ruby/build/master/ext/digest' I, [2024-05-26T09:22:17.391540 #2127198] INFO -- : make[2]: Leaving directory '/home/opc/ruby/build/master/ext/digest' I, [2024-05-26T09:22:17.413987 #2127198] INFO -- : make[2]: Entering directory '/home/opc/ruby/build/master/ext/digest/sha2' I, [2024-05-26T09:22:17.418851 #2127198] INFO -- : make[2]: Leaving directory '/home/opc/ruby/build/master/ext/digest/sha2' I, [2024-05-26T09:22:17.437417 #2127198] INFO -- : make[2]: Entering directory '/home/opc/ruby/build/master/ext/fiddle' I, [2024-05-26T09:22:17.447766 #2127198] INFO -- : make[2]: Leaving directory '/home/opc/ruby/build/master/ext/fiddle' I, [2024-05-26T09:22:17.452059 #2127198] INFO -- : make[2]: Entering directory '/home/opc/ruby/build/master/ext/io/console' I, [2024-05-26T09:22:17.456520 #2127198] INFO -- : make[2]: Leaving directory '/home/opc/ruby/build/master/ext/io/console' I, [2024-05-26T09:22:17.467254 #2127198] INFO -- : make[2]: Entering directory '/home/opc/ruby/build/master/ext/json' I, [2024-05-26T09:22:17.476615 #2127198] INFO -- : make[2]: Leaving directory '/home/opc/ruby/build/master/ext/json' I, [2024-05-26T09:22:17.489569 #2127198] INFO -- : make[2]: Entering directory '/home/opc/ruby/build/master/ext/monitor' I, [2024-05-26T09:22:17.493589 #2127198] INFO -- : make[2]: Leaving directory '/home/opc/ruby/build/master/ext/monitor' I, [2024-05-26T09:22:17.499640 #2127198] INFO -- : make[2]: Entering directory '/home/opc/ruby/build/master/ext/objspace' I, [2024-05-26T09:22:17.505597 #2127198] INFO -- : make[2]: Leaving directory '/home/opc/ruby/build/master/ext/objspace' I, [2024-05-26T09:22:17.524700 #2127198] INFO -- : make[2]: Entering directory '/home/opc/ruby/build/master/ext/openssl' I, [2024-05-26T09:22:17.546556 #2127198] INFO -- : make[2]: Leaving directory '/home/opc/ruby/build/master/ext/openssl' I, [2024-05-26T09:22:17.550903 #2127198] INFO -- : make[2]: Entering directory '/home/opc/ruby/build/master/ext/pathname' I, [2024-05-26T09:22:17.555184 #2127198] INFO -- : make[2]: Leaving directory '/home/opc/ruby/build/master/ext/pathname' I, [2024-05-26T09:22:17.561553 #2127198] INFO -- : make[2]: Entering directory '/home/opc/ruby/build/master/ext/psych' I, [2024-05-26T09:22:17.583262 #2127198] INFO -- : make[2]: Leaving directory '/home/opc/ruby/build/master/ext/psych' I, [2024-05-26T09:22:17.587857 #2127198] INFO -- : make[2]: Entering directory '/home/opc/ruby/build/master/ext/pty' I, [2024-05-26T09:22:17.592081 #2127198] INFO -- : make[2]: Leaving directory '/home/opc/ruby/build/master/ext/pty' I, [2024-05-26T09:22:17.605774 #2127198] INFO -- : make[2]: Entering directory '/home/opc/ruby/build/master/ext/ripper' I, [2024-05-26T09:22:17.614021 #2127198] INFO -- : make[2]: Leaving directory '/home/opc/ruby/build/master/ext/ripper' I, [2024-05-26T09:22:17.616008 #2127198] INFO -- : make[2]: Entering directory '/home/opc/ruby/build/master/ext/rubyvm' I, [2024-05-26T09:22:17.619597 #2127198] INFO -- : make[2]: Leaving directory '/home/opc/ruby/build/master/ext/rubyvm' I, [2024-05-26T09:22:17.631831 #2127198] INFO -- : make[2]: Entering directory '/home/opc/ruby/build/master/ext/socket' I, [2024-05-26T09:22:17.642681 #2127198] INFO -- : make[2]: Leaving directory '/home/opc/ruby/build/master/ext/socket' I, [2024-05-26T09:22:17.658383 #2127198] INFO -- : make[2]: Entering directory '/home/opc/ruby/build/master/.bundle/gems/bigdecimal-3.1.7/ext/bigdecimal' I, [2024-05-26T09:22:17.689760 #2127198] INFO -- : make[2]: Leaving directory '/home/opc/ruby/build/master/.bundle/gems/bigdecimal-3.1.7/ext/bigdecimal' I, [2024-05-26T09:22:17.692464 #2127198] INFO -- : make[2]: Entering directory '/home/opc/ruby/build/master/.bundle/gems/bigdecimal-3.1.8/ext/bigdecimal' I, [2024-05-26T09:22:17.723730 #2127198] INFO -- : make[2]: Leaving directory '/home/opc/ruby/build/master/.bundle/gems/bigdecimal-3.1.8/ext/bigdecimal' I, [2024-05-26T09:22:17.726633 #2127198] INFO -- : make[2]: Entering directory '/home/opc/ruby/build/master/.bundle/gems/debug-1.9.2/ext/debug' I, [2024-05-26T09:22:17.757767 #2127198] INFO -- : make[2]: Leaving directory '/home/opc/ruby/build/master/.bundle/gems/debug-1.9.2/ext/debug' I, [2024-05-26T09:22:17.760368 #2127198] INFO -- : make[2]: Entering directory '/home/opc/ruby/build/master/.bundle/gems/nkf-0.2.0/ext/nkf' I, [2024-05-26T09:22:17.791108 #2127198] INFO -- : make[2]: Leaving directory '/home/opc/ruby/build/master/.bundle/gems/nkf-0.2.0/ext/nkf' I, [2024-05-26T09:22:17.793786 #2127198] INFO -- : make[2]: Entering directory '/home/opc/ruby/build/master/.bundle/gems/racc-1.7.3/ext/racc/cparse' I, [2024-05-26T09:22:17.824241 #2127198] INFO -- : make[2]: Leaving directory '/home/opc/ruby/build/master/.bundle/gems/racc-1.7.3/ext/racc/cparse' I, [2024-05-26T09:22:17.826780 #2127198] INFO -- : make[2]: Entering directory '/home/opc/ruby/build/master/.bundle/gems/racc-1.8.0/ext/racc/cparse' I, [2024-05-26T09:22:17.857447 #2127198] INFO -- : make[2]: Leaving directory '/home/opc/ruby/build/master/.bundle/gems/racc-1.8.0/ext/racc/cparse' I, [2024-05-26T09:22:17.860462 #2127198] INFO -- : make[2]: Entering directory '/home/opc/ruby/build/master/.bundle/gems/rbs-3.4.4/ext/rbs_extension' I, [2024-05-26T09:22:17.891267 #2127198] INFO -- : make[2]: Leaving directory '/home/opc/ruby/build/master/.bundle/gems/rbs-3.4.4/ext/rbs_extension' I, [2024-05-26T09:22:17.893925 #2127198] INFO -- : make[2]: Entering directory '/home/opc/ruby/build/master/.bundle/gems/syslog-0.1.2/ext/syslog' I, [2024-05-26T09:22:17.924115 #2127198] INFO -- : make[2]: Leaving directory '/home/opc/ruby/build/master/.bundle/gems/syslog-0.1.2/ext/syslog' I, [2024-05-26T09:22:17.962896 #2127198] INFO -- : make[2]: Entering directory '/home/opc/ruby/build/master' I, [2024-05-26T09:22:18.047383 #2127198] INFO -- : make[2]: 'ruby' is up to date. I, [2024-05-26T09:22:18.047475 #2127198] INFO -- : make[2]: Leaving directory '/home/opc/ruby/build/master' I, [2024-05-26T09:22:18.047580 #2127198] INFO -- : make[1]: Leaving directory '/home/opc/ruby/build/master' I, [2024-05-26T09:22:18.052130 #2127198] INFO -- : make[1]: Entering directory '/home/opc/ruby/build/master' I, [2024-05-26T09:22:18.052199 #2127198] INFO -- : make[1]: Nothing to be done for 'note'. I, [2024-05-26T09:22:18.052211 #2127198] INFO -- : make[1]: Leaving directory '/home/opc/ruby/build/master' I, [2024-05-26T09:22:18.165349 #2127198] INFO -- : Run options: I, [2024-05-26T09:22:18.165424 #2127198] INFO -- : --seed=48379 I, [2024-05-26T09:22:18.165435 #2127198] INFO -- : "--ruby=./miniruby -I/home/opc/ruby/src/master/lib -I. -I.ext/common /home/opc/ruby/src/master/tool/runruby.rb --extout=.ext -- --disable-gems" I, [2024-05-26T09:22:18.165445 #2127198] INFO -- : --excludes-dir=/home/opc/ruby/src/master/test/.excludes I, [2024-05-26T09:22:18.165454 #2127198] INFO -- : --name=!/memory_leak/ I, [2024-05-26T09:22:18.165463 #2127198] INFO -- : --stderr-on-failure I, [2024-05-26T09:22:18.165472 #2127198] INFO -- : -j3 I, [2024-05-26T09:22:18.165480 #2127198] INFO -- : I, [2024-05-26T09:22:18.165489 #2127198] INFO -- : # Running tests: I, [2024-05-26T09:22:18.165498 #2127198] INFO -- : I, [2024-05-26T09:22:18.298164 #2127198] INFO -- : [ 1/883] 2168168=test_io I, [2024-05-26T09:22:18.299573 #2127198] INFO -- : [ 2/883] 2168167=test_uncorrectable_name_check I, [2024-05-26T09:22:18.307170 #2127198] INFO -- : [ 3/883] 2168166=test_rdoc_rd_inline I, [2024-05-26T09:22:18.348624 #2127198] INFO -- : [ 4/883] 2168167=test_digest I, [2024-05-26T09:22:18.357260 #2127198] INFO -- : [ 5/883] 2168167=test_path I, [2024-05-26T09:22:18.423533 #2127198] INFO -- : [ 6/883] 2168167=test_rubygems I, [2024-05-26T09:22:18.431500 #2127198] INFO -- : [ 7/883] 2168166=test_resolve_symbol I, [2024-05-26T09:22:18.502513 #2127198] INFO -- : [ 8/883] 2168166=test_closure I, [2024-05-26T09:22:18.686428 #2127198] INFO -- : [ 9/883] 2168167=test_files_test_1 I, [2024-05-26T09:22:20.230124 #2127198] INFO -- : [ 10/883] 2168166=test_dir I, [2024-05-26T09:22:20.342087 #2127198] INFO -- : Leaked file descriptor: TestDir#test_home: 7 # I, [2024-05-26T09:22:20.342283 #2127198] INFO -- : Leaked file descriptor: TestDir#test_home: 8 # I, [2024-05-26T09:22:20.374332 #2127198] INFO -- : COMMAND PID USER FD TYPE DEVICE SIZE/OFF NODE NAME I, [2024-05-26T09:22:20.374402 #2127198] INFO -- : ruby 2168166 opc 7r REG 252,0 9253600 13705411 /var/lib/sss/mc/passwd I, [2024-05-26T09:22:20.374414 #2127198] INFO -- : ruby 2168166 opc 8u unix 0x0000000000000000 0t0 3149390697 type=STREAM I, [2024-05-26T09:22:20.543293 #2127198] INFO -- : [ 11/883] 2168166=test_stat I, [2024-05-26T09:22:20.562557 #2127198] INFO -- : [ 12/883] 2168166=test_etc I, [2024-05-26T09:22:20.563910 #2127198] INFO -- : .Leaked file descriptor: TestEtc#test_getgrgid: 9 # I, [2024-05-26T09:22:20.588608 #2127198] INFO -- : COMMAND PID USER FD TYPE DEVICE SIZE/OFF NODE NAME I, [2024-05-26T09:22:20.588676 #2127198] INFO -- : ruby 2168166 opc 9r REG 252,0 6940392 13705429 /var/lib/sss/mc/group I, [2024-05-26T09:22:20.700452 #2127198] INFO -- : [ 13/883] 2168166=test_gem_commands_rebuild_command I, [2024-05-26T09:22:20.934880 #2127198] INFO -- : [ 14/883] 2168166=test_nomethod_error I, [2024-05-26T09:22:20.936589 #2127198] INFO -- : [ 15/883] 2168166=test_rdoc_parser I, [2024-05-26T09:22:20.992722 #2127198] INFO -- : [ 16/883] 2168166=test_https_proxy I, [2024-05-26T09:22:21.050648 #2127198] INFO -- : [ 17/883] 2168166=test_win32ole_param_event I, [2024-05-26T09:22:21.056714 #2127198] INFO -- : [ 18/883] 2168166=test_cgi_modruby I, [2024-05-26T09:22:21.070583 #2127198] INFO -- : [ 19/883] 2168167=magic_comment_test I, [2024-05-26T09:22:21.079304 #2127198] INFO -- : [ 20/883] 2168166=test_win32ole_variant I, [2024-05-26T09:22:21.098220 #2127198] INFO -- : [ 21/883] 2168166=test_workspace I, [2024-05-26T09:22:21.147113 #2127198] INFO -- : [ 22/883] 2168167=test_printf I, [2024-05-26T09:22:21.158038 #2127198] INFO -- : [ 23/883] 2168167=test_x509attr I, [2024-05-26T09:22:21.182521 #2127198] INFO -- : [ 24/883] 2168167=test_rdoc_parser_simple I, [2024-05-26T09:22:21.303582 #2127198] INFO -- : [ 25/883] 2168166=test_nonblock I, [2024-05-26T09:22:21.326802 #2127198] INFO -- : [ 26/883] 2168166=test_gem_ext_configure_builder I, [2024-05-26T09:22:21.334526 #2127198] INFO -- : [ 27/883] 2168167=json_ext_parser_test I, [2024-05-26T09:22:21.355412 #2127198] INFO -- : [ 28/883] 2168167=test_shellwords I, [2024-05-26T09:22:21.363053 #2127198] INFO -- : [ 29/883] 2168167=test_mul I, [2024-05-26T09:22:21.366962 #2127198] INFO -- : [ 30/883] 2168167=test_rdoc_generator_pot_po I, [2024-05-26T09:22:21.379096 #2127198] INFO -- : [ 31/883] 2168167=test_omap I, [2024-05-26T09:22:21.407928 #2127198] INFO -- : [ 32/883] 2168166=test_date_strptime I, [2024-05-26T09:22:21.415277 #2127198] INFO -- : [ 33/883] 2168167=test_ipaddr I, [2024-05-26T09:22:21.445768 #2127198] INFO -- : [ 34/883] 2168167=test_scanner_events I, [2024-05-26T09:22:21.485393 #2127198] INFO -- : [ 35/883] 2168167=test_ocsp I, [2024-05-26T09:22:21.509756 #2127198] INFO -- : [ 36/883] 2168166=test_rdoc_generator_ri I, [2024-05-26T09:22:21.511154 #2127198] INFO -- : [ 37/883] 2168166=test_gem_stream_ui I, [2024-05-26T09:22:21.566035 #2127198] INFO -- : [ 38/883] 2168167=test_unicode_normalize I, [2024-05-26T09:22:21.618853 #2127198] INFO -- : [ 39/883] 2168166=test_reline_key I, [2024-05-26T09:22:21.631609 #2127198] INFO -- : [ 40/883] 2168166=test_gem_commands_lock_command I, [2024-05-26T09:22:21.651793 #2127198] INFO -- : [ 41/883] 2168166=test_gb18030 I, [2024-05-26T09:22:21.658022 #2127198] INFO -- : [ 42/883] 2168166=test_propertyputref I, [2024-05-26T09:22:21.664537 #2127198] INFO -- : [ 43/883] 2168166=test_color I, [2024-05-26T09:22:21.754892 #2127198] INFO -- : [ 44/883] 2168166=test_float I, [2024-05-26T09:22:23.155300 #2127198] INFO -- : [ 45/883] 2168166=test_gem_stub_specification I, [2024-05-26T09:22:23.299268 #2127198] INFO -- : [ 46/883] 2168166=test_cmethod I, [2024-05-26T09:22:23.320327 #2127198] INFO -- : [ 47/883] 2168166=test_io_m17n I, [2024-05-26T09:22:24.344219 #2127198] INFO -- : [ 48/883] 2168168=test_rdoc_top_level I, [2024-05-26T09:22:24.568568 #2127198] INFO -- : [ 49/883] 2168166=test_unicode I, [2024-05-26T09:22:24.592153 #2127198] INFO -- : [ 50/883] 2168166=test_eval_history I, [2024-05-26T09:22:24.608788 #2127198] INFO -- : [ 51/883] 2168166=dispatcher_test I, [2024-05-26T09:22:24.685481 #2127198] INFO -- : [ 52/883] 2168166=test_random I, [2024-05-26T09:22:24.702314 #2127198] INFO -- : [ 53/883] 2168166=test_thread_cv I, [2024-05-26T09:22:24.747316 #2127198] INFO -- : [ 54/883] 2168168=test_assembler I, [2024-05-26T09:22:24.757537 #2127198] INFO -- : [ 55/883] 2168168=test_stringio I, [2024-05-26T09:22:24.922359 #2127198] INFO -- : [ 56/883] 2168168=test_files_ext I, [2024-05-26T09:22:24.929971 #2127198] INFO -- : [ 57/883] 2168168=test_ripper I, [2024-05-26T09:22:25.116480 #2127198] INFO -- : [ 58/883] 2168167=test_win32ole_method I, [2024-05-26T09:22:25.133159 #2127198] INFO -- : [ 59/883] 2168167=test_lexer I, [2024-05-26T09:22:25.171895 #2127198] INFO -- : [ 60/883] 2168167=test_regex_casefold I, [2024-05-26T09:22:25.233865 #2127198] INFO -- : [ 61/883] 2168168=test_gem_source_git I, [2024-05-26T09:22:25.340027 #2127198] INFO -- : [ 62/883] 2168166=test_class I, [2024-05-26T09:22:25.359037 #2127198] INFO -- : [ 63/883] 2168166=test_have_macro I, [2024-05-26T09:22:25.606165 #2127198] INFO -- : [ 64/883] 2168167=test_mkmf I, [2024-05-26T09:22:25.632967 #2127198] INFO -- : [ 65/883] 2168167=test_gem_source I, [2024-05-26T09:22:25.812135 #2127198] INFO -- : [ 66/883] 2168166=test_at_exit I, [2024-05-26T09:22:25.825188 #2127198] INFO -- : [ 67/883] 2168166=test_benchmark I, [2024-05-26T09:22:25.979017 #2127198] INFO -- : [ 68/883] 2168167=test_array I, [2024-05-26T09:22:26.476538 #2127198] INFO -- : [ 69/883] 2168168=test_gem_package I, [2024-05-26T09:22:27.156064 #2127198] INFO -- : [ 70/883] 2168166=test_autoload I, [2024-05-26T09:22:27.161641 #2127198] INFO -- : [ 71/883] 2168168=test_rdoc_comment I, [2024-05-26T09:22:27.220600 #2127198] INFO -- : [ 72/883] 2168168=test_encoding I, [2024-05-26T09:22:27.413913 #2127198] INFO -- : [ 73/883] 2168168=test_install I, [2024-05-26T09:22:27.420844 #2127198] INFO -- : [ 74/883] 2168168=test_gem_source_fetch_problem I, [2024-05-26T09:22:27.442853 #2127198] INFO -- : [ 75/883] 2168168=test_ftp I, [2024-05-26T09:22:27.451634 #2127198] INFO -- : [ 76/883] 2168168=test_sockopt I, [2024-05-26T09:22:27.459309 #2127198] INFO -- : [ 77/883] 2168168=test_find_executable I, [2024-05-26T09:22:27.467653 #2127198] INFO -- : [ 78/883] 2168168=test_autoconf I, [2024-05-26T09:22:27.489350 #2127198] INFO -- : [ 79/883] 2168168=integer_parse_test I, [2024-05-26T09:22:27.625908 #2127198] INFO -- : [ 80/883] 2168168=test_ractor_compatibility I, [2024-05-26T09:22:27.912750 #2127198] INFO -- : [ 81/883] 2168168=test_arithmetic_sequence I, [2024-05-26T09:22:27.937687 #2127198] INFO -- : [ 82/883] 2168168=test_gem_request_set_lockfile_tokenizer I, [2024-05-26T09:22:28.004522 #2127198] INFO -- : [ 83/883] 2168168=test_cgi_multipart I, [2024-05-26T09:22:28.092156 #2127198] INFO -- : [ 84/883] 2168168=test_lazy_enumerator I, [2024-05-26T09:22:28.543516 #2127198] INFO -- : [ 85/883] 2168168=test_rdoc_ri_paths I, [2024-05-26T09:22:28.581595 #2127198] INFO -- : [ 86/883] 2168168=test_parser I, [2024-05-26T09:22:28.600699 #2127198] INFO -- : [ 87/883] 2168168=test_primitive I, [2024-05-26T09:22:28.628173 #2127198] INFO -- : [ 88/883] 2168168=test_iseq I, [2024-05-26T09:22:29.183142 #2127198] INFO -- : [ 89/883] 2168168=test_singleton_function I, [2024-05-26T09:22:29.230811 #2127198] INFO -- : [ 90/883] 2168168=test_gem_commands_setup_command I, [2024-05-26T09:22:30.168451 #2127198] INFO -- : [ 91/883] 2168168=test_history I, [2024-05-26T09:22:30.203844 #2127198] INFO -- : [ 92/883] 2168168=test_eval I, [2024-05-26T09:22:30.208319 #2127198] INFO -- : [ 93/883] 2168168=test_document I, [2024-05-26T09:22:30.219503 #2127198] INFO -- : [ 94/883] 2168168=test_gem_safe_yaml I, [2024-05-26T09:22:30.234669 #2127198] INFO -- : [ 95/883] 2168168=test_gem_package_tar_reader I, [2024-05-26T09:22:30.285116 #2127198] INFO -- : [ 96/883] 2168168=test_gem_commands_signout_command I, [2024-05-26T09:22:30.292785 #2127198] INFO -- : [ 97/883] 2168168=test_env I, [2024-05-26T09:22:31.737344 #2127198] INFO -- : [ 98/883] 2168166=test_pair I, [2024-05-26T09:22:32.731946 #2127198] INFO -- : [ 99/883] 2168168=test_win32ole_variant_m I, [2024-05-26T09:22:32.737886 #2127198] INFO -- : [100/883] 2168168=command_line_test I, [2024-05-26T09:22:32.745429 #2127198] INFO -- : [101/883] 2168168=test_continuation I, [2024-05-26T09:22:32.756249 #2127198] INFO -- : [102/883] 2168168=test_fixnum I, [2024-05-26T09:22:32.770790 #2127198] INFO -- : [103/883] 2168168=test_gem_silent_ui I, [2024-05-26T09:22:32.817937 #2127198] INFO -- : [104/883] 2168168=test_signal I, [2024-05-26T09:22:34.780724 #2127198] INFO -- : [105/883] 2168168=test_gem_ci_detector I, [2024-05-26T09:22:34.799338 #2127198] INFO -- : [106/883] 2168168=test_io_wait_uncommon I, [2024-05-26T09:22:34.813298 #2127198] INFO -- : [107/883] 2168168=test_gem_security_policy I, [2024-05-26T09:22:35.178906 #2127198] INFO -- : [108/883] 2168168=test_delete I, [2024-05-26T09:22:35.182964 #2127198] INFO -- : [109/883] 2168168=test_rdoc_markup_document I, [2024-05-26T09:22:35.197391 #2127198] INFO -- : [110/883] 2168168=parse_stream_test I, [2024-05-26T09:22:35.226673 #2127198] INFO -- : [111/883] 2168168=test_handle I, [2024-05-26T09:22:35.615604 #2127198] INFO -- : [112/883] 2168168=test_completion I, [2024-05-26T09:22:36.243149 #2127198] INFO -- : [113/883] 2168168=test_file_exhaustive I, [2024-05-26T09:22:36.267623 #2127198] INFO -- : [114/883] 2168167=test_placearg I, [2024-05-26T09:22:36.405997 #2127198] INFO -- : [115/883] 2168167=test_case_comprehensive I, [2024-05-26T09:22:36.955201 #2127198] INFO -- : [116/883] 2168166=test_logperiod I, [2024-05-26T09:22:36.966300 #2127198] INFO -- : [117/883] 2168166=test_rational2 I, [2024-05-26T09:22:36.976061 #2127198] INFO -- : [118/883] 2168166=test_gem_package_tar_header I, [2024-05-26T09:22:37.183279 #2127198] INFO -- : [119/883] 2168166=test_ssl_session I, [2024-05-26T09:22:37.964314 #2127198] INFO -- : [120/883] 2168166=test_ast I, [2024-05-26T09:22:40.797196 #2127198] INFO -- : Leaked file descriptor: TestFileExhaustive#test_expand_path_home_dir_string: 10 # I, [2024-05-26T09:22:40.797390 #2127198] INFO -- : Leaked file descriptor: TestFileExhaustive#test_expand_path_home_dir_string: 11 # I, [2024-05-26T09:22:40.829695 #2127198] INFO -- : COMMAND PID USER FD TYPE DEVICE SIZE/OFF NODE NAME I, [2024-05-26T09:22:40.829770 #2127198] INFO -- : ruby 2168168 opc 10r REG 252,0 9253600 13705411 /var/lib/sss/mc/passwd I, [2024-05-26T09:22:40.829781 #2127198] INFO -- : ruby 2168168 opc 11u unix 0x0000000000000000 0t0 3149398299 type=STREAM I, [2024-05-26T09:22:40.860891 #2127198] INFO -- : Multiple autoclose IO objects for a file descriptor in: TestFileExhaustive#test_expand_path_home_dir_string: #>(autoclose) #(autoclose) I, [2024-05-26T09:22:43.261764 #2127198] INFO -- : [121/883] 2168168=test_logdevice I, [2024-05-26T09:22:44.104744 #2127198] INFO -- : [122/883] 2168168=test_variable_name_check I, [2024-05-26T09:22:44.195464 #2127198] INFO -- : [123/883] 2168168=test_bn I, [2024-05-26T09:22:44.210796 #2127198] INFO -- : [124/883] 2168168=test_require_path_check I, [2024-05-26T09:22:44.278013 #2127198] INFO -- : [125/883] 2168168=test_rdoc_markup_paragraph I, [2024-05-26T09:22:44.296145 #2127198] INFO -- : [126/883] 2168168=test_x509cert I, [2024-05-26T09:22:44.397825 #2127198] INFO -- : [127/883] 2168168=test_irb I, [2024-05-26T09:22:44.622008 #2127198] INFO -- : [128/883] 2168168=test_name_error_extension I, [2024-05-26T09:22:44.636721 #2127198] INFO -- : [129/883] 2168168=test_gem_request_set_gem_dependency_api I, [2024-05-26T09:22:44.898259 #2127198] INFO -- : [130/883] 2168168=test_object_create_start I, [2024-05-26T09:22:44.900364 #2127198] INFO -- : [131/883] 2168168=test_gem_commands_info_command I, [2024-05-26T09:22:44.943103 #2127198] INFO -- : [132/883] 2168168=test_https I, [2024-05-26T09:22:45.184749 #2127198] INFO -- : [133/883] 2168168=test_protocol I, [2024-05-26T09:22:45.520332 #2127198] INFO -- : [134/883] 2168168=test_evaluation I, [2024-05-26T09:22:45.525267 #2127198] INFO -- : [135/883] 2168168=test_files_test I, [2024-05-26T09:22:45.532669 #2127198] INFO -- : [136/883] 2168168=test_weakkeymap I, [2024-05-26T09:22:45.851289 #2127198] INFO -- : [137/883] 2168168=test_rdoc_markup_to_ansi I, [2024-05-26T09:22:45.895453 #2127198] INFO -- : [138/883] 2168168=test_digest I, [2024-05-26T09:22:46.663570 #2127198] INFO -- : [139/883] 2168168=test_signedness I, [2024-05-26T09:22:48.718913 #2127198] INFO -- : [140/883] 2168168=test_gem_resolver_git_set I, [2024-05-26T09:22:49.243605 #2127198] INFO -- : [141/883] 2168168=test_gem_commands_check_command I, [2024-05-26T09:22:49.285591 #2127198] INFO -- : [142/883] 2168168=test_ractor I, [2024-05-26T09:22:49.332719 #2127198] INFO -- : [143/883] 2168168=test_httpheader I, [2024-05-26T09:22:49.349543 #2127198] INFO -- : [144/883] 2168168=test_sexp I, [2024-05-26T09:22:49.371923 #2127198] INFO -- : [145/883] 2168168=test_rdoc_ri_driver I, [2024-05-26T09:22:49.792458 #2127198] INFO -- : [146/883] 2168168=test_gem_safe_marshal I, [2024-05-26T09:22:50.483716 #2127198] INFO -- : [147/883] 2168168=test_gem_resolver_vendor_specification I, [2024-05-26T09:22:50.520850 #2127198] INFO -- : [148/883] 2168168=test_date_arith I, [2024-05-26T09:22:50.526764 #2127198] INFO -- : [149/883] 2168168=json_generic_object_test I, [2024-05-26T09:22:50.613263 #2127198] INFO -- : [150/883] 2168168=test_fiddle I, [2024-05-26T09:22:50.687819 #2127198] INFO -- : [151/883] 2168168=test_stringscanner I, [2024-05-26T09:22:50.713739 #2127198] INFO -- : [152/883] 2168168=test_gem_resolver_installed_specification I, [2024-05-26T09:22:50.792047 #2127198] INFO -- : [153/883] 2168168=test_exception_at_throwing I, [2024-05-26T09:22:50.807614 #2127198] INFO -- : [154/883] 2168168=test_ractor I, [2024-05-26T09:22:50.881802 #2127198] INFO -- : [155/883] 2168168=test_struct I, [2024-05-26T09:22:51.432989 #2127198] INFO -- : [156/883] 2168168=test_tmpdir I, [2024-05-26T09:22:51.503981 #2127198] INFO -- : [157/883] 2168168=test_type I, [2024-05-26T09:22:51.510944 #2127198] INFO -- : [158/883] 2168168=heredoc_dedent_test I, [2024-05-26T09:22:51.524761 #2127198] INFO -- : [159/883] 2168168=test_mutex I, [2024-05-26T09:22:52.658947 #2127198] INFO -- : [160/883] 2168168=test_rdoc_token_stream I, [2024-05-26T09:22:52.664662 #2127198] INFO -- : [161/883] 2168168=test_gem_local_remote_options I, [2024-05-26T09:22:52.730410 #2127198] INFO -- : [162/883] 2168168=test_gem_ext_cargo_builder_link_flag_converter I, [2024-05-26T09:22:52.830081 #2127198] INFO -- : [163/883] 2168168=test_acceptable I, [2024-05-26T09:22:52.943154 #2127198] INFO -- : [164/883] 2168168=test_dup I, [2024-05-26T09:22:53.108374 #2127198] INFO -- : [165/883] 2168168=test_rdoc_single_class I, [2024-05-26T09:22:53.116772 #2127198] INFO -- : [166/883] 2168168=test_fiber I, [2024-05-26T09:22:56.282738 #2127198] INFO -- : [167/883] 2168167=test_gem_commands_mirror I, [2024-05-26T09:22:56.283517 #2127198] INFO -- : [168/883] 2168167=test_engine I, [2024-05-26T09:22:56.770349 #2127198] INFO -- : [169/883] 2168167=test_win32ole_param I, [2024-05-26T09:22:56.777079 #2127198] INFO -- : [170/883] 2168167=test_key_error I, [2024-05-26T09:22:56.791004 #2127198] INFO -- : [171/883] 2168167=test_resize I, [2024-05-26T09:22:56.860708 #2127198] INFO -- : [172/883] 2168167=test_lock_native_thread I, [2024-05-26T09:22:57.083182 #2127198] INFO -- : [173/883] 2168167=test_gem_package_task I, [2024-05-26T09:22:57.162757 #2127198] INFO -- : [174/883] 2168167=test_ssl I, [2024-05-26T09:22:59.240928 #2127198] INFO -- : [175/883] 2168168=test_integer_comb I, [2024-05-26T09:23:01.501300 #2127198] INFO -- : [176/883] 2168168=test_bundled_ca I, [2024-05-26T09:23:04.139742 #2127198] INFO -- : [177/883] 2168168=test_load I, [2024-05-26T09:23:04.177833 #2127198] INFO -- : [178/883] 2168168=test_abi I, [2024-05-26T09:23:04.314181 #2127198] INFO -- : [179/883] 2168168=test_gem_validator I, [2024-05-26T09:23:04.334495 #2127198] INFO -- : [180/883] 2168168=test_gem_source_installed I, [2024-05-26T09:23:04.339456 #2127198] INFO -- : [181/883] 2168168=test_usrmarshal I, [2024-05-26T09:23:04.548863 #2127198] INFO -- : [182/883] 2168168=test_erb_command I, [2024-05-26T09:23:04.585724 #2127198] INFO -- : [183/883] 2168168=test_module I, [2024-05-26T09:23:07.255255 #2127198] INFO -- : [184/883] 2168168=test_gem_security_trust_dir I, [2024-05-26T09:23:07.333436 #2127198] INFO -- : [185/883] 2168168=test_change_word I, [2024-05-26T09:23:07.339606 #2127198] INFO -- : [186/883] 2168168=test_depth_first I, [2024-05-26T09:23:07.351275 #2127198] INFO -- : [187/883] 2168168=test_ostruct I, [2024-05-26T09:23:07.483885 #2127198] INFO -- : [188/883] 2168168=test_config I, [2024-05-26T09:23:07.541817 #2127198] INFO -- : [189/883] 2168168=test_c_struct_entry I, [2024-05-26T09:23:07.586428 #2127198] INFO -- : [190/883] 2168167=test_struct I, [2024-05-26T09:23:07.637316 #2127198] INFO -- : [191/883] 2168167=static_inspect_test I, [2024-05-26T09:23:07.660813 #2127198] INFO -- : [192/883] 2168167=test_cparser I, [2024-05-26T09:23:08.084031 #2127198] INFO -- : [193/883] 2168168=test_rubyvm I, [2024-05-26T09:23:08.092855 #2127198] INFO -- : [194/883] 2168168=fuzzer_test I, [2024-05-26T09:23:08.099634 #2127198] INFO -- : [195/883] 2168168=test_custom_command I, [2024-05-26T09:23:08.111054 #2127198] INFO -- : [196/883] 2168168=test_rdoc_parser_markdown I, [2024-05-26T09:23:08.117948 #2127198] INFO -- : [197/883] 2168168=test_load I, [2024-05-26T09:23:08.126803 #2127198] INFO -- : [198/883] 2168168=test_rdoc_rd_inline_parser I, [2024-05-26T09:23:08.145639 #2127198] INFO -- : [199/883] 2168168=test_win32ole_type I, [2024-05-26T09:23:08.149367 #2127198] INFO -- : [200/883] 2168168=test_new I, [2024-05-26T09:23:08.160123 #2127198] INFO -- : [201/883] 2168168=test_update I, [2024-05-26T09:23:08.169981 #2127198] INFO -- : [202/883] 2168168=test_cipher I, [2024-05-26T09:23:08.194848 #2127198] INFO -- : [203/883] 2168168=test_gem_source_lock I, [2024-05-26T09:23:08.257538 #2127198] INFO -- : [204/883] 2168168=test_rdoc_markup_attribute_manager I, [2024-05-26T09:23:08.288049 #2127198] INFO -- : [205/883] 2168168=test_wss I, [2024-05-26T09:23:08.328150 #2127198] INFO -- : [206/883] 2168168=test_option I, [2024-05-26T09:23:08.412478 #2127198] INFO -- : [207/883] 2168168=test_not I, [2024-05-26T09:23:08.419926 #2127198] INFO -- : [208/883] 2168168=test_cgi_cookie I, [2024-05-26T09:23:08.424877 #2127198] INFO -- : [209/883] 2168168=test_tracer I, [2024-05-26T09:23:08.426319 #2127198] INFO -- : [210/883] 2168168=test_my_integer I, [2024-05-26T09:23:08.437739 #2127198] INFO -- : [211/883] 2168168=test_gem_resolver_composed_set I, [2024-05-26T09:23:08.460836 #2127198] INFO -- : [212/883] 2168168=test_debugger_integration I, [2024-05-26T09:23:08.482905 #2127198] INFO -- : [213/883] 2168168=test_objectspace I, [2024-05-26T09:23:09.400677 #2127198] INFO -- : [214/883] 2168168=test_require I, [2024-05-26T09:23:09.657826 #2127198] INFO -- : [215/883] 2168167=test_metaclass I, [2024-05-26T09:23:09.676306 #2127198] INFO -- : [216/883] 2168167=test_gem_gem_runner I, [2024-05-26T09:23:09.719448 #2127198] INFO -- : [217/883] 2168167=test_require_lib I, [2024-05-26T09:23:12.082152 #2127198] INFO -- : [218/883] 2168168=test_rdoc_generator_pot I, [2024-05-26T09:23:12.086776 #2127198] INFO -- : [219/883] 2168168=test_rdoc_markup_to_joined_paragraph I, [2024-05-26T09:23:12.094361 #2127198] INFO -- : [220/883] 2168168=test_rdoc_markup_to_markdown I, [2024-05-26T09:23:12.140137 #2127198] INFO -- : [221/883] 2168168=test_rdoc_rd I, [2024-05-26T09:23:12.156160 #2127198] INFO -- : [222/883] 2168168=test_x509store I, [2024-05-26T09:23:12.684168 #2127198] INFO -- : [223/883] 2168168=test_rdoc_rd_block_parser I, [2024-05-26T09:23:12.717004 #2127198] INFO -- : [224/883] 2168168=test_ssl I, [2024-05-26T09:23:12.777405 #2127198] INFO -- : [225/883] 2168167=test_gem_commands_help_command I, [2024-05-26T09:23:12.843012 #2127198] INFO -- : [226/883] 2168168=test_scheduler I, [2024-05-26T09:23:12.988969 #2127198] INFO -- : [227/883] 2168167=test_ractor I, [2024-05-26T09:23:13.017346 #2127198] INFO -- : [228/883] 2168168=test_gem_resolver_conflict I, [2024-05-26T09:23:13.050014 #2127198] INFO -- : [229/883] 2168168=test_nesting_parser I, [2024-05-26T09:23:13.089842 #2127198] INFO -- : [230/883] 2168168=test_ancdata I, [2024-05-26T09:23:13.123882 #2127198] INFO -- : [231/883] 2168168=ractor_test I, [2024-05-26T09:23:13.172192 #2127198] INFO -- : [232/883] 2168168=test_marshal I, [2024-05-26T09:23:13.269793 #2127198] INFO -- : [233/883] 2168167=test_rdoc_markup_hard_break I, [2024-05-26T09:23:13.287234 #2127198] INFO -- : [234/883] 2168167=test_bignum I, [2024-05-26T09:23:14.120584 #2127198] INFO -- : [235/883] 2168168=newline_test I, [2024-05-26T09:23:14.182959 #2127198] INFO -- : [236/883] 2168168=test_enc_str_buf_cat I, [2024-05-26T09:23:14.185732 #2127198] INFO -- : [237/883] 2168168=test_cgi_core I, [2024-05-26T09:23:14.205622 #2127198] INFO -- : [238/883] 2168168=test_gem_resolver_best_set I, [2024-05-26T09:23:14.276007 #2127198] INFO -- : [239/883] 2168168=test_rdoc_markup_to_label I, [2024-05-26T09:23:14.308770 #2127198] INFO -- : [240/883] 2168168=test_parser I, [2024-05-26T09:23:14.328718 #2127198] INFO -- : [241/883] 2168168=test_ractor I, [2024-05-26T09:23:14.354950 #2127198] INFO -- : [242/883] 2168168=test_ansi_without_terminfo I, [2024-05-26T09:23:14.364950 #2127198] INFO -- : [243/883] 2168168=json_generator_test I, [2024-05-26T09:23:14.474515 #2127198] INFO -- : [244/883] 2168168=test_gem I, [2024-05-26T09:23:16.765271 #2127198] INFO -- : [245/883] 2168168=test_registry I, [2024-05-26T09:23:16.785113 #2127198] INFO -- : [246/883] 2168168=test_ts I, [2024-05-26T09:23:16.885391 #2127198] INFO -- : [247/883] 2168167=test_locale I, [2024-05-26T09:23:17.060028 #2127198] INFO -- : [248/883] 2168168=test_rdoc_attr I, [2024-05-26T09:23:17.068163 #2127198] INFO -- : [249/883] 2168167=test_ractor I, [2024-05-26T09:23:17.086439 #2127198] INFO -- : [250/883] 2168168=test_trick I, [2024-05-26T09:23:17.138231 #2127198] INFO -- : [251/883] 2168167=test_stream I, [2024-05-26T09:23:17.148685 #2127198] INFO -- : [252/883] 2168167=test_address_resolve I, [2024-05-26T09:23:17.162124 #2127198] INFO -- : [253/883] 2168167=test_enum I, [2024-05-26T09:23:18.197762 #2127198] INFO -- : [254/883] 2168167=test_rdoc_markup_include I, [2024-05-26T09:23:18.203729 #2127198] INFO -- : [255/883] 2168167=test_require I, [2024-05-26T09:23:19.497827 #2127198] INFO -- : [256/883] 2168168=test_recursion I, [2024-05-26T09:23:19.500153 #2127198] INFO -- : [257/883] 2168168=test_gem_commands_signin_command I, [2024-05-26T09:23:19.539862 #2127198] INFO -- : [258/883] 2168167=test_range I, [2024-05-26T09:23:19.677562 #2127198] INFO -- : [259/883] 2168168=test_iter_break I, [2024-05-26T09:23:19.733762 #2127198] INFO -- : [260/883] 2168168=test_extlibs I, [2024-05-26T09:23:20.226950 #2127198] INFO -- : [261/883] 2168167=test_num2int I, [2024-05-26T09:23:20.242635 #2127198] INFO -- : [262/883] 2168167=test_rbconfig I, [2024-05-26T09:23:20.255271 #2127198] INFO -- : [263/883] 2168167=test_integer I, [2024-05-26T09:23:20.347306 #2127198] INFO -- : [264/883] 2168166=test_unix I, [2024-05-26T09:23:20.390470 #2127198] INFO -- : [265/883] 2168166=test_formatter I, [2024-05-26T09:23:20.409684 #2127198] INFO -- : [266/883] 2168166=test_rdoc_servlet I, [2024-05-26T09:23:20.558761 #2127198] INFO -- : [267/883] 2168166=test_coder I, [2024-05-26T09:23:20.600158 #2127198] INFO -- : [268/883] 2168166=test_symbol I, [2024-05-26T09:23:21.263750 #2127198] INFO -- : [269/883] 2168168=test_gem_commands_search_command I, [2024-05-26T09:23:21.276700 #2127198] INFO -- : [270/883] 2168168=test_context I, [2024-05-26T09:23:21.360893 #2127198] INFO -- : [271/883] 2168168=test_udp I, [2024-05-26T09:23:21.382476 #2127198] INFO -- : [272/883] 2168168=test_gem_commands_contents_command I, [2024-05-26T09:23:21.500405 #2127198] INFO -- : [273/883] 2168168=test_gem_commands_list_command I, [2024-05-26T09:23:21.510259 #2127198] INFO -- : [274/883] 2168168=test_date_new I, [2024-05-26T09:23:21.565267 #2127198] INFO -- : [275/883] 2168168=test_configuration I, [2024-05-26T09:23:21.629661 #2127198] INFO -- : [276/883] 2168168=test_gem_resolver_local_specification I, [2024-05-26T09:23:22.737524 #2127198] INFO -- : [277/883] 2168168=test_have_func I, [2024-05-26T09:23:22.811970 #2127198] INFO -- : [278/883] 2168167=test_date_marshal I, [2024-05-26T09:23:22.859109 #2127198] INFO -- : [279/883] 2168167=test_gem_request_set I, [2024-05-26T09:23:22.931891 #2127198] INFO -- : [280/883] 2168168=test_gem_bundler_version_finder I, [2024-05-26T09:23:22.974873 #2127198] INFO -- : [281/883] 2168168=test_gc I, [2024-05-26T09:23:23.377713 #2127198] INFO -- : [282/883] 2168167=test_pattern_matching I, [2024-05-26T09:23:23.423680 #2127198] INFO -- : [283/883] 2168167=test_folderitem2_invokeverb I, [2024-05-26T09:23:23.431284 #2127198] INFO -- : [284/883] 2168167=test_interned_str I, [2024-05-26T09:23:23.441148 #2127198] INFO -- : [285/883] 2168167=test_set_len I, [2024-05-26T09:23:23.450029 #2127198] INFO -- : [286/883] 2168167=constant_path_node_test I, [2024-05-26T09:23:23.461608 #2127198] INFO -- : [287/883] 2168167=test_webauthn_listener_response I, [2024-05-26T09:23:24.086367 #2127198] INFO -- : [288/883] 2168167=test_sleep I, [2024-05-26T09:23:24.343657 #2127198] INFO -- : [289/883] 2168166=test_gem_resolver_index_set I, [2024-05-26T09:23:24.384681 #2127198] INFO -- : [290/883] 2168166=ruby_api_test I, [2024-05-26T09:23:24.569524 #2127198] INFO -- : [291/883] 2168166=test_popen_deadlock I, [2024-05-26T09:23:25.065084 #2127198] INFO -- : [292/883] 2168166=test_time I, [2024-05-26T09:23:25.209345 #2127198] INFO -- : [293/883] 2168166=test_alias_and_anchor I, [2024-05-26T09:23:25.228273 #2127198] INFO -- : [294/883] 2168166=test_key_stroke I, [2024-05-26T09:23:25.236006 #2127198] INFO -- : [295/883] 2168166=test_rdoc_markup I, [2024-05-26T09:23:25.244720 #2127198] INFO -- : [296/883] 2168166=test_euc_jp I, [2024-05-26T09:23:25.298202 #2127198] INFO -- : [297/883] 2168166=test_ensured I, [2024-05-26T09:23:25.306200 #2127198] INFO -- : [298/883] 2168166=test_delegate I, [2024-05-26T09:23:25.354437 #2127198] INFO -- : [299/883] 2168166=test_chilled I, [2024-05-26T09:23:25.369071 #2127198] INFO -- : [300/883] 2168166=location_test I, [2024-05-26T09:23:25.406427 #2127198] INFO -- : [301/883] 2168166=test_symbol I, [2024-05-26T09:23:25.459806 #2127198] INFO -- : [302/883] 2168166=test_project_sanity I, [2024-05-26T09:23:25.477875 #2127198] INFO -- : [303/883] 2168166=test_gem_commands_build_command I, [2024-05-26T09:23:25.780261 #2127198] INFO -- : [304/883] 2168166=test_ellipsize I, [2024-05-26T09:23:25.812849 #2127198] INFO -- : [305/883] 2168166=test_call I, [2024-05-26T09:23:25.929635 #2127198] INFO -- : [306/883] 2168166=test_reline I, [2024-05-26T09:23:26.184819 #2127198] INFO -- : [307/883] 2168166=test_history I, [2024-05-26T09:23:26.525669 #2127198] INFO -- : [308/883] 2168166=test_to_ary_concat I, [2024-05-26T09:23:28.500130 #2127198] INFO -- : [309/883] 2168167=test_gem_ext_builder I, [2024-05-26T09:23:28.654108 #2127198] INFO -- : [310/883] 2168166=test_windows_1251 I, [2024-05-26T09:23:28.665784 #2127198] INFO -- : [311/883] 2168166=test_to_ruby I, [2024-05-26T09:23:28.680708 #2127198] INFO -- : [312/883] 2168166=test_addrinfo I, [2024-05-26T09:23:28.726050 #2127198] INFO -- : [313/883] 2168166=test_time_tz I, [2024-05-26T09:23:28.791157 #2127198] INFO -- : [314/883] 2168166=test_thread I, [2024-05-26T09:23:29.592776 #2127198] INFO -- : [315/883] 2168167=test_terminfo I, [2024-05-26T09:23:29.604764 #2127198] INFO -- : [316/883] 2168167=test_socket I, [2024-05-26T09:23:30.560099 #2127198] INFO -- : [317/883] 2168167=test_inlinecache I, [2024-05-26T09:23:30.653730 #2127198] INFO -- : [318/883] 2168167=test_bug-14834 I, [2024-05-26T09:23:30.661714 #2127198] INFO -- : [319/883] 2168167=test_data I, [2024-05-26T09:23:30.668951 #2127198] INFO -- : [320/883] 2168167=test_object_references I, [2024-05-26T09:23:30.735755 #2127198] INFO -- : [321/883] 2168167=test_gem_source_subpath_problem I, [2024-05-26T09:23:30.882462 #2127198] INFO -- : [322/883] 2168167=compiler_test I, [2024-05-26T09:23:30.939492 #2127198] INFO -- : [323/883] 2168167=test_arith_seq_extract I, [2024-05-26T09:23:31.147145 #2127198] INFO -- : [324/883] 2168167=test_ruby_lex I, [2024-05-26T09:23:31.246456 #2127198] INFO -- : [325/883] 2168167=test_ossl I, [2024-05-26T09:23:31.828069 #2127198] INFO -- : [326/883] 2168168=test_buffered_io I, [2024-05-26T09:23:31.866282 #2127198] INFO -- : [327/883] 2168168=test_gem_installer I, [2024-05-26T09:23:36.671204 #2127198] INFO -- : [328/883] 2168168=test_bug_reporter I, [2024-05-26T09:23:36.870135 #2127198] INFO -- : [329/883] 2168168=test_within_pipe I, [2024-05-26T09:23:36.899778 #2127198] INFO -- : [330/883] 2168168=test_rdoc_normal_class I, [2024-05-26T09:23:36.988550 #2127198] INFO -- : [331/883] 2168168=test_pointer I, [2024-05-26T09:23:37.676626 #2127198] INFO -- : [332/883] 2168166=test_nofree I, [2024-05-26T09:23:37.699871 #2127198] INFO -- : [333/883] 2168166=test_regexp I, [2024-05-26T09:23:38.393528 #2127198] INFO -- : [334/883] 2168168=test_whileuntil I, [2024-05-26T09:23:38.408942 #2127198] INFO -- : [335/883] 2168168=test_monitor I, [2024-05-26T09:23:38.676993 #2127198] INFO -- : [336/883] 2168168=test_beginendblock I, [2024-05-26T09:23:38.952458 #2127198] INFO -- : [337/883] 2168167=test_eval I, [2024-05-26T09:23:39.002929 #2127198] INFO -- : [338/883] 2168168=test_case_options I, [2024-05-26T09:23:39.009028 #2127198] INFO -- : [339/883] 2168168=test_cgi_header I, [2024-05-26T09:23:39.027339 #2127198] INFO -- : [340/883] 2168168=test_object I, [2024-05-26T09:23:39.035542 #2127198] INFO -- : [341/883] 2168168=test_member I, [2024-05-26T09:23:39.044346 #2127198] INFO -- : [342/883] 2168168=test_kill_ring I, [2024-05-26T09:23:39.053714 #2127198] INFO -- : [343/883] 2168168=test_mailto I, [2024-05-26T09:23:39.066335 #2127198] INFO -- : [344/883] 2168168=test_addr I, [2024-05-26T09:23:39.080534 #2127198] INFO -- : [345/883] 2168168=test_gem_resolver_api_set I, [2024-05-26T09:23:39.196911 #2127198] INFO -- : [346/883] 2168168=test_duplicate I, [2024-05-26T09:23:39.197506 #2127198] INFO -- : [347/883] 2168167=test_helper I, [2024-05-26T09:23:39.212171 #2127198] INFO -- : [348/883] 2168167=test_gem_resolver_installer_set I, [2024-05-26T09:23:39.219905 #2127198] INFO -- : [349/883] 2168168=test_append I, [2024-05-26T09:23:39.223680 #2127198] INFO -- : [350/883] 2168168=test_foreach I, [2024-05-26T09:23:39.237938 #2127198] INFO -- : [351/883] 2168168=test_rdoc_markup_to_html I, [2024-05-26T09:23:39.325732 #2127198] INFO -- : [352/883] 2168168=test_summary I, [2024-05-26T09:23:39.387557 #2127198] INFO -- : [353/883] 2168168=test_helper_method I, [2024-05-26T09:23:39.415044 #2127198] INFO -- : [354/883] 2168168=test_config I, [2024-05-26T09:23:39.512055 #2127198] INFO -- : [355/883] 2168167=test_file I, [2024-05-26T09:23:39.795978 #2127198] INFO -- : [356/883] 2168168=bom_test I, [2024-05-26T09:23:39.803346 #2127198] INFO -- : [357/883] 2168168=test_x509ext I, [2024-05-26T09:23:39.810792 #2127198] INFO -- : [358/883] 2168168=test_emitter I, [2024-05-26T09:23:39.816626 #2127198] INFO -- : [359/883] 2168168=test_rb_str_dup I, [2024-05-26T09:23:39.827536 #2127198] INFO -- : [360/883] 2168168=test_lambda I, [2024-05-26T09:23:39.884615 #2127198] INFO -- : [361/883] 2168168=test_scalar_scanner I, [2024-05-26T09:23:39.892592 #2127198] INFO -- : [362/883] 2168168=test_win32ole_type_event I, [2024-05-26T09:23:39.936579 #2127198] INFO -- : [363/883] 2168168=test_keyword I, [2024-05-26T09:23:40.520698 #2127198] INFO -- : [364/883] 2168168=test_gem_path_support I, [2024-05-26T09:23:40.557449 #2127198] INFO -- : [365/883] 2168168=test_arity I, [2024-05-26T09:23:40.565453 #2127198] INFO -- : [366/883] 2168168=test_trace I, [2024-05-26T09:23:40.648236 #2127198] INFO -- : [367/883] 2168168=test_alias I, [2024-05-26T09:23:40.929895 #2127198] INFO -- : [368/883] 2168168=test_fips I, [2024-05-26T09:23:41.030568 #2127198] INFO -- : [369/883] 2168168=test_emitter I, [2024-05-26T09:23:41.047202 #2127198] INFO -- : [370/883] 2168168=test_getopts I, [2024-05-26T09:23:41.072146 #2127198] INFO -- : [371/883] 2168168=test_thread_fd_close I, [2024-05-26T09:23:42.141884 #2127198] INFO -- : [372/883] 2168168=test_last_thread I, [2024-05-26T09:23:42.151665 #2127198] INFO -- : [373/883] 2168168=test_digest_extend I, [2024-05-26T09:23:42.185524 #2127198] INFO -- : [374/883] 2168168=test_gem_ext_cmake_builder I, [2024-05-26T09:23:42.191983 #2127198] INFO -- : [375/883] 2168168=test_rdoc_markup_formatter I, [2024-05-26T09:23:42.210527 #2127198] INFO -- : [376/883] 2168168=test_gem_commands_uninstall_command I, [2024-05-26T09:23:43.045533 #2127198] INFO -- : [377/883] 2168168=test_win32ole_event I, [2024-05-26T09:23:43.045983 #2127198] INFO -- : [378/883] 2168168=test_helper I, [2024-05-26T09:23:43.060944 #2127198] INFO -- : [379/883] 2168168=test_compile_prism I, [2024-05-26T09:23:43.363217 #2127198] INFO -- : [380/883] 2168168=test_io_console I, [2024-05-26T09:23:45.722413 #2127198] INFO -- : [381/883] 2168167=test_flip I, [2024-05-26T09:23:45.744621 #2127198] INFO -- : [382/883] 2168167=test_rdoc_markup_heading I, [2024-05-26T09:23:45.770403 #2127198] INFO -- : [383/883] 2168167=test_x509crl I, [2024-05-26T09:23:45.868313 #2127198] INFO -- : [384/883] 2168167=test_cgi_session I, [2024-05-26T09:23:45.882582 #2127198] INFO -- : [385/883] 2168167=test_notimplement I, [2024-05-26T09:23:45.955369 #2127198] INFO -- : [386/883] 2168167=test_c_union_entity I, [2024-05-26T09:23:46.014772 #2127198] INFO -- : [387/883] 2168168=test_dns I, [2024-05-26T09:23:46.113956 #2127198] INFO -- : [388/883] 2168167=test_gem_commands_cleanup_command I, [2024-05-26T09:23:46.464639 #2127198] INFO -- : [389/883] 2168168=test_class2name I, [2024-05-26T09:23:46.483383 #2127198] INFO -- : [390/883] 2168168=test_transcode I, [2024-05-26T09:23:46.655902 #2127198] INFO -- : [391/883] 2168167=test_refinement I, [2024-05-26T09:23:46.696213 #2127198] INFO -- : [392/883] 2168168=test_debug I, [2024-05-26T09:23:46.705406 #2127198] INFO -- : [393/883] 2168168=test_profile_frames I, [2024-05-26T09:23:46.879109 #2127198] INFO -- : [394/883] 2168168=test_pattern_key_name_check I, [2024-05-26T09:23:46.889055 #2127198] INFO -- : [395/883] 2168168=test_x509req I, [2024-05-26T09:23:46.928070 #2127198] INFO -- : [396/883] 2168168=test_rdoc_parser_ruby I, [2024-05-26T09:23:47.971253 #2127198] INFO -- : [397/883] 2168168=test_httpresponse I, [2024-05-26T09:23:47.999142 #2127198] INFO -- : [398/883] 2168168=test_readpartial I, [2024-05-26T09:23:48.407384 #2127198] INFO -- : [399/883] 2168168=test_insns_leaf I, [2024-05-26T09:23:48.412981 #2127198] INFO -- : [400/883] 2168168=test_ifunless I, [2024-05-26T09:23:48.562087 #2127198] INFO -- : [401/883] 2168168=test_allocation I, [2024-05-26T09:23:50.528695 #2127198] INFO -- : [402/883] 2168167=test_gem_console_ui I, [2024-05-26T09:23:50.549169 #2127198] INFO -- : [403/883] 2168167=test_config I, [2024-05-26T09:23:50.588803 #2127198] INFO -- : [404/883] 2168167=test_func I, [2024-05-26T09:23:50.931826 #2127198] INFO -- : [405/883] 2168168=test_vm_dump I, [2024-05-26T09:23:50.939860 #2127198] INFO -- : [406/883] 2168168=json_encoding_test I, [2024-05-26T09:23:50.958901 #2127198] INFO -- : [407/883] 2168168=errors_test I, [2024-05-26T09:23:52.653576 #2127198] INFO -- : [408/883] 2168168=test_convertible I, [2024-05-26T09:23:54.895754 #2127198] INFO -- : [409/883] 2168168=test_pkg_config I, [2024-05-26T09:23:54.919704 #2127198] INFO -- : [410/883] 2168168=test_gem_available_set I, [2024-05-26T09:23:55.018461 #2127198] INFO -- : [411/883] 2168168=test_modify_expand I, [2024-05-26T09:23:55.030021 #2127198] INFO -- : [412/883] 2168168=test_color_printer I, [2024-05-26T09:23:55.038707 #2127198] INFO -- : [413/883] 2168168=test_super I, [2024-05-26T09:23:56.707979 #2127198] INFO -- : [414/883] 2168168=unescape_test I, [2024-05-26T09:23:57.273501 #2127198] INFO -- : [415/883] 2168167=test_gem_commands_exec_command I, [2024-05-26T09:23:58.026294 #2127198] INFO -- : [416/883] 2168168=test_dln I, [2024-05-26T09:23:58.047601 #2127198] INFO -- : [417/883] 2168168=test_object I, [2024-05-26T09:23:58.405011 #2127198] INFO -- : [418/883] 2168168=test_gem_source_vendor I, [2024-05-26T09:23:58.437303 #2127198] INFO -- : [419/883] 2168168=test_gem_resolver I, [2024-05-26T09:23:58.737055 #2127198] INFO -- : [420/883] 2168168=test_passing_block I, [2024-05-26T09:23:58.742240 #2127198] INFO -- : [421/883] 2168168=test_defined I, [2024-05-26T09:23:58.755584 #2127198] INFO -- : [422/883] 2168167=test_nowrite I, [2024-05-26T09:23:58.819088 #2127198] INFO -- : [423/883] 2168167=test_thread_queue I, [2024-05-26T09:23:58.840460 #2127198] INFO -- : [424/883] 2168168=test_kdf I, [2024-05-26T09:23:58.911732 #2127198] INFO -- : [425/883] 2168168=test_ldap I, [2024-05-26T09:23:58.920617 #2127198] INFO -- : [426/883] 2168168=test_io_buffer I, [2024-05-26T09:23:58.988226 #2127198] INFO -- : [427/883] 2168168=test_type_completor I, [2024-05-26T09:23:59.009809 #2127198] INFO -- : [428/883] 2168168=test_rdoc_normal_module I, [2024-05-26T09:23:59.045820 #2127198] INFO -- : [429/883] 2168168=test_io_timeout I, [2024-05-26T09:23:59.138364 #2127198] INFO -- : [430/883] 2168168=test_rdoc_markdown_test I, [2024-05-26T09:23:59.859685 #2127198] INFO -- : [431/883] 2168166=test_yjit_exit_locations I, [2024-05-26T09:23:59.868552 #2127198] INFO -- : [432/883] 2168166=test_rdoc_rdoc I, [2024-05-26T09:23:59.960987 #2127198] INFO -- : [433/883] 2168166=test_comparable I, [2024-05-26T09:24:00.013211 #2127198] INFO -- : [434/883] 2168166=test_gem_config_file I, [2024-05-26T09:24:00.129778 #2127198] INFO -- : [435/883] 2168168=json_string_matching_test I, [2024-05-26T09:24:00.140426 #2127198] INFO -- : [436/883] 2168168=test_logger I, [2024-05-26T09:24:00.166359 #2127198] INFO -- : [437/883] 2168168=test_pkey_dsa I, [2024-05-26T09:24:00.203944 #2127198] INFO -- : [438/883] 2168166=test_gem_resolver_specification I, [2024-05-26T09:24:00.218034 #2127198] INFO -- : [439/883] 2168166=test_big2str I, [2024-05-26T09:24:00.224214 #2127198] INFO -- : [440/883] 2168166=test_euc_tw I, [2024-05-26T09:24:00.236218 #2127198] INFO -- : [441/883] 2168166=test_command I, [2024-05-26T09:24:00.559322 #2127198] INFO -- : [442/883] 2168166=test_gem_resolver_dependency_request I, [2024-05-26T09:24:00.848828 #2127198] INFO -- : [443/883] 2168166=test_cstr I, [2024-05-26T09:24:01.840544 #2127198] INFO -- : [444/883] 2168166=test_yaml_tree I, [2024-05-26T09:24:01.874231 #2127198] INFO -- : [445/883] 2168166=test_gem_commands_yank_command I, [2024-05-26T09:24:02.157172 #2127198] INFO -- : [446/883] 2168168=test_nil I, [2024-05-26T09:24:02.225394 #2127198] INFO -- : [447/883] 2168168=test_psych I, [2024-05-26T09:24:02.249192 #2127198] INFO -- : [448/883] 2168168=test_human_typo I, [2024-05-26T09:24:02.313039 #2127198] INFO -- : [449/883] 2168168=test_import I, [2024-05-26T09:24:02.417956 #2127198] INFO -- : [450/883] 2168166=test_wait I, [2024-05-26T09:24:02.441394 #2127198] INFO -- : [451/883] 2168166=version_test I, [2024-05-26T09:24:02.443185 #2127198] INFO -- : [452/883] 2168166=test_raise I, [2024-05-26T09:24:02.449864 #2127198] INFO -- : [453/883] 2168166=test_complexrational I, [2024-05-26T09:24:02.452480 #2127198] INFO -- : [454/883] 2168166=test_function_entry I, [2024-05-26T09:24:02.466182 #2127198] INFO -- : [455/883] 2168166=test_error_highlight I, [2024-05-26T09:24:02.954488 #2127198] INFO -- : [456/883] 2168166=test_rdoc_any_method I, [2024-05-26T09:24:03.323071 #2127198] INFO -- : [457/883] 2168166=json_common_interface_test I, [2024-05-26T09:24:03.326124 #2127198] INFO -- : [458/883] 2168166=test_string I, [2024-05-26T09:24:03.356852 #2127198] INFO -- : [459/883] 2168166=reflection_test I, [2024-05-26T09:24:03.364936 #2127198] INFO -- : [460/883] 2168166=test_line_editor I, [2024-05-26T09:24:03.370971 #2127198] INFO -- : [461/883] 2168166=test_marshalable I, [2024-05-26T09:24:03.376350 #2127198] INFO -- : [462/883] 2168166=test_enumerator_kw I, [2024-05-26T09:24:03.380242 #2127198] INFO -- : [463/883] 2168166=test_help I, [2024-05-26T09:24:03.435510 #2127198] INFO -- : [464/883] 2168166=test_string_memory I, [2024-05-26T09:24:03.545515 #2127198] INFO -- : [465/883] 2168166=test_files_lib I, [2024-05-26T09:24:05.034239 #2127198] INFO -- : [466/883] 2168167=test_egrep_cpp I, [2024-05-26T09:24:05.040955 #2127198] INFO -- : [467/883] 2168168=test_frozen I, [2024-05-26T09:24:05.047514 #2127198] INFO -- : [468/883] 2168168=test_gem_resolver_index_specification I, [2024-05-26T09:24:05.105789 #2127198] INFO -- : [469/883] 2168168=test_serialize_subclasses I, [2024-05-26T09:24:05.109210 #2127198] INFO -- : [470/883] 2168168=test_date_conv I, [2024-05-26T09:24:05.113799 #2127198] INFO -- : [471/883] 2168167=test_rdoc_markup_verbatim I, [2024-05-26T09:24:05.119791 #2127198] INFO -- : [472/883] 2168168=test_webauthn_poller I, [2024-05-26T09:24:05.129297 #2127198] INFO -- : [473/883] 2168167=test_timeout I, [2024-05-26T09:24:05.138330 #2127198] INFO -- : [474/883] 2168167=test_rdoc_generator_pot_po_entry I, [2024-05-26T09:24:05.155616 #2127198] INFO -- : [475/883] 2168167=test_erb_m17n I, [2024-05-26T09:24:05.173316 #2127198] INFO -- : [476/883] 2168167=test_coverage I, [2024-05-26T09:24:05.290831 #2127198] INFO -- : [477/883] 2168168=test_http_request I, [2024-05-26T09:24:05.301380 #2127198] INFO -- : [478/883] 2168168=test_tempfile I, [2024-05-26T09:24:05.525732 #2127198] INFO -- : [479/883] 2168168=test_rdoc_markup_pre_process I, [2024-05-26T09:24:05.712600 #2127198] INFO -- : [480/883] 2168168=test_store I, [2024-05-26T09:24:05.981800 #2127198] INFO -- : [481/883] 2168167=test_fnmatch I, [2024-05-26T09:24:06.017432 #2127198] INFO -- : [482/883] 2168168=test_pathname I, [2024-05-26T09:24:06.038105 #2127198] INFO -- : [483/883] 2168167=test_gem_commands_update_command I, [2024-05-26T09:24:06.319428 #2127198] INFO -- : [484/883] 2168168=test_date I, [2024-05-26T09:24:06.326116 #2127198] INFO -- : [485/883] 2168168=test_big5 I, [2024-05-26T09:24:06.332217 #2127198] INFO -- : [486/883] 2168168=test_protect I, [2024-05-26T09:24:06.345060 #2127198] INFO -- : [487/883] 2168168=test_tree_builder I, [2024-05-26T09:24:06.348044 #2127198] INFO -- : [488/883] 2168168=test_gem_requirement I, [2024-05-26T09:24:06.367914 #2127198] INFO -- : [489/883] 2168166=test_integer I, [2024-05-26T09:24:06.434803 #2127198] INFO -- : [490/883] 2168166=test_gem_name_tuple I, [2024-05-26T09:24:06.459264 #2127198] INFO -- : [491/883] 2168166=test_rdoc_markup_to_table_of_contents I, [2024-05-26T09:24:06.499675 #2127198] INFO -- : [492/883] 2168168=parse_comments_test I, [2024-05-26T09:24:06.507247 #2127198] INFO -- : [493/883] 2168166=test_tcp I, [2024-05-26T09:24:06.512096 #2127198] INFO -- : [494/883] 2168168=test_win32ole_method_event I, [2024-05-26T09:24:06.518450 #2127198] INFO -- : [495/883] 2168168=test_gem_commands_server_command I, [2024-05-26T09:24:06.522153 #2127198] INFO -- : [496/883] 2168168=test_function I, [2024-05-26T09:24:06.647380 #2127198] INFO -- : [497/883] 2168166=test_gem_resolver_activation_request I, [2024-05-26T09:24:06.663084 #2127198] INFO -- : [498/883] 2168166=test_pipe I, [2024-05-26T09:24:06.780051 #2127198] INFO -- : [499/883] 2168166=test_string I, [2024-05-26T09:24:06.788856 #2127198] INFO -- : [500/883] 2168168=test_macro I, [2024-05-26T09:24:06.795315 #2127198] INFO -- : [501/883] 2168168=test_find I, [2024-05-26T09:24:06.824275 #2127198] INFO -- : [502/883] 2168168=test_constant I, [2024-05-26T09:24:07.656423 #2127198] INFO -- : [503/883] 2168167=test_rdoc_generator_markup I, [2024-05-26T09:24:07.683026 #2127198] INFO -- : [504/883] 2168167=test_encoding I, [2024-05-26T09:24:07.878941 #2127198] INFO -- : [505/883] 2168167=test_hmac I, [2024-05-26T09:24:07.900287 #2127198] INFO -- : [506/883] 2168167=test_gem_commands_owner_command I, [2024-05-26T09:24:08.553439 #2127198] INFO -- : [507/883] 2168167=test_nextafter I, [2024-05-26T09:24:08.641319 #2127198] INFO -- : [508/883] 2168167=test_capacity I, [2024-05-26T09:24:08.647146 #2127198] INFO -- : [509/883] 2168167=test_file I, [2024-05-26T09:24:08.662725 #2127198] INFO -- : [510/883] 2168168=test_time I, [2024-05-26T09:24:08.667049 #2127198] INFO -- : [511/883] 2168167=test_numeric I, [2024-05-26T09:24:08.763803 #2127198] INFO -- : [512/883] 2168167=test_bug-3571 I, [2024-05-26T09:24:08.772670 #2127198] INFO -- : [513/883] 2168167=test_yamlstore I, [2024-05-26T09:24:08.790530 #2127198] INFO -- : [514/883] 2168167=test_flags I, [2024-05-26T09:24:08.813540 #2127198] INFO -- : [515/883] 2168168=test_gem_request_connection_pools I, [2024-05-26T09:24:09.357767 #2127198] INFO -- : [516/883] 2168167=test_init I, [2024-05-26T09:24:09.677737 #2127198] INFO -- : [517/883] 2168167=test_rat I, [2024-05-26T09:24:09.706386 #2127198] INFO -- : [518/883] 2168167=test_rdoc_options I, [2024-05-26T09:24:09.859542 #2127198] INFO -- : [519/883] 2168168=test_zlib I, [2024-05-26T09:24:09.980138 #2127198] INFO -- : [520/883] 2168167=test_gem_commands_unpack_command I, [2024-05-26T09:24:10.283324 #2127198] INFO -- : [521/883] 2168167=test_console_attr I, [2024-05-26T09:24:10.408743 #2127198] INFO -- : [522/883] 2168167=test_proc I, [2024-05-26T09:24:11.317712 #2127198] INFO -- : [523/883] 2168167=test_gem_ext_cargo_builder I, [2024-05-26T09:24:11.330143 #2127198] INFO -- : [524/883] 2168167=test_date_compat I, [2024-05-26T09:24:11.342527 #2127198] INFO -- : [525/883] 2168167=test_gem_version_option I, [2024-05-26T09:24:11.391553 #2127198] INFO -- : [526/883] 2168167=test_win32ole_record I, [2024-05-26T09:24:11.418881 #2127198] INFO -- : [527/883] 2168167=test_rdoc_include I, [2024-05-26T09:24:11.454503 #2127198] INFO -- : [528/883] 2168167=test_pstore I, [2024-05-26T09:24:11.705315 #2127198] INFO -- : [529/883] 2168167=test_ubf_async_safe I, [2024-05-26T09:24:11.786384 #2127198] INFO -- : [530/883] 2168167=test_c_struct_builder I, [2024-05-26T09:24:12.144028 #2127198] INFO -- : [531/883] 2168167=test_yield_block I, [2024-05-26T09:24:12.151652 #2127198] INFO -- : [532/883] 2168167=test_bug-5832 I, [2024-05-26T09:24:12.171349 #2127198] INFO -- : [533/883] 2168167=test_gem_uri I, [2024-05-26T09:24:12.219773 #2127198] INFO -- : [534/883] 2168167=test_resource I, [2024-05-26T09:24:12.250565 #2127198] INFO -- : [535/883] 2168167=test_gem_package_tar_reader_entry I, [2024-05-26T09:24:12.620963 #2127198] INFO -- : [536/883] 2168167=test_spell_checker I, [2024-05-26T09:24:12.635498 #2127198] INFO -- : [537/883] 2168167=test_gem_version I, [2024-05-26T09:24:12.852810 #2127198] INFO -- : [538/883] 2168167=test_gem_ext_ext_conf_builder I, [2024-05-26T09:24:13.865827 #2127198] INFO -- : [539/883] 2168167=test_frozen_error I, [2024-05-26T09:24:13.877047 #2127198] INFO -- : [540/883] 2168167=test_reqarg I, [2024-05-26T09:24:14.199388 #2127198] INFO -- : [541/883] 2168167=test_enumerator I, [2024-05-26T09:24:14.206891 #2127198] INFO -- : [542/883] 2168167=test_path_to_class I, [2024-05-26T09:24:14.215265 #2127198] INFO -- : [543/883] 2168167=test_ns_spki I, [2024-05-26T09:24:14.550120 #2127198] INFO -- : [544/883] 2168167=test_have_library I, [2024-05-26T09:24:15.196656 #2127198] INFO -- : [545/883] 2168167=test_stream I, [2024-05-26T09:24:15.208742 #2127198] INFO -- : [546/883] 2168167=test_iseq_load I, [2024-05-26T09:24:16.412038 #2127198] INFO -- : [547/883] 2168167=test_rdoc_markup_parser I, [2024-05-26T09:24:16.478833 #2127198] INFO -- : [548/883] 2168167=test_rdoc_markup_indented_paragraph I, [2024-05-26T09:24:16.489554 #2127198] INFO -- : [549/883] 2168167=library_symbols_test I, [2024-05-26T09:24:16.498853 #2127198] INFO -- : [550/883] 2168167=test_rdoc_text I, [2024-05-26T09:24:16.578854 #2127198] INFO -- : [551/883] 2168167=test_objspace I, [2024-05-26T09:24:20.122796 #2127198] INFO -- : [552/883] 2168168=test_stringify_symbols I, [2024-05-26T09:24:20.129423 #2127198] INFO -- : [553/883] 2168168=test_require I, [2024-05-26T09:24:20.139912 #2127198] INFO -- : [554/883] 2168168=test_rdoc_markup_to_html_snippet I, [2024-05-26T09:24:20.225613 #2127198] INFO -- : [555/883] 2168168=test_common I, [2024-05-26T09:24:20.416025 #2127198] INFO -- : [556/883] 2168168=test_generic I, [2024-05-26T09:24:20.459393 #2127198] INFO -- : [557/883] 2168168=test_rdoc_constant I, [2024-05-26T09:24:20.557431 #2127198] INFO -- : [558/883] 2168168=test_deprecate I, [2024-05-26T09:24:20.603659 #2127198] INFO -- : [559/883] 2168168=test_httpresponses I, [2024-05-26T09:24:20.615955 #2127198] INFO -- : [560/883] 2168168=test_rdoc_markdown I, [2024-05-26T09:24:21.093542 #2127198] INFO -- : [561/883] 2168168=test_gem_request_set_lockfile I, [2024-05-26T09:24:21.410526 #2127198] INFO -- : [562/883] 2168168=test_postponed_job I, [2024-05-26T09:24:21.690171 #2127198] INFO -- : [563/883] 2168168=test_key_actor_vi I, [2024-05-26T09:24:21.801113 #2127198] INFO -- : [564/883] 2168168=test_win32ole_variant_outarg I, [2024-05-26T09:24:21.812948 #2127198] INFO -- : [565/883] 2168168=test_rdoc_encoding I, [2024-05-26T09:24:21.873659 #2127198] INFO -- : [566/883] 2168168=test_provider I, [2024-05-26T09:24:21.881292 #2127198] INFO -- : [567/883] 2168168=test_euc_kr I, [2024-05-26T09:24:21.898938 #2127198] INFO -- : [568/883] 2168168=test_gem_source_specific_file I, [2024-05-26T09:24:21.998256 #2127198] INFO -- : [569/883] 2168168=test_bmethod I, [2024-05-26T09:24:22.086216 #2127198] INFO -- : [570/883] 2168168=test_process I, [2024-05-26T09:24:32.410076 #2127198] INFO -- : [571/883] 2168166=test_rdoc_code_object I, [2024-05-26T09:24:32.746621 #2127198] INFO -- : [572/883] 2168166=test_rdoc_markup_attributes I, [2024-05-26T09:24:32.753466 #2127198] INFO -- : [573/883] 2168166=test_string_processing I, [2024-05-26T09:24:32.763274 #2127198] INFO -- : [574/883] 2168166=test_random_formatter I, [2024-05-26T09:24:32.787059 #2127198] INFO -- : [575/883] 2168166=test_rand I, [2024-05-26T09:24:33.185762 #2127198] INFO -- : [576/883] 2168166=redundant_return_test I, [2024-05-26T09:24:33.201718 #2127198] INFO -- : [577/883] 2168166=test_rdoc_parser_changelog I, [2024-05-26T09:24:33.284680 #2127198] INFO -- : [578/883] 2168166=parameters_signature_test I, [2024-05-26T09:24:33.304361 #2127198] INFO -- : [579/883] 2168166=test_gem_dependency_list I, [2024-05-26T09:24:33.408223 #2127198] INFO -- : [580/883] 2168166=test_gem_commands_outdated_command I, [2024-05-26T09:24:33.445588 #2127198] INFO -- : [581/883] 2168166=test_securerandom I, [2024-05-26T09:24:33.492570 #2127198] INFO -- : [582/883] 2168166=test_typeddata I, [2024-05-26T09:24:33.726042 #2127198] INFO -- : [583/883] 2168166=test_gem_commands_fetch_command I, [2024-05-26T09:24:33.889090 #2127198] INFO -- : [584/883] 2168166=test_tsort I, [2024-05-26T09:24:33.944376 #2127198] INFO -- : [585/883] 2168166=parse_test I, [2024-05-26T09:24:36.689665 #2127198] INFO -- : [586/883] 2168166=test_io_wait I, [2024-05-26T09:24:37.041854 #2127198] INFO -- : [587/883] 2168166=test_pack I, [2024-05-26T09:24:37.253955 #2127198] INFO -- : [588/883] 2168166=test_kwargs I, [2024-05-26T09:24:37.269092 #2127198] INFO -- : [589/883] 2168166=test_rdoc_parser_c I, [2024-05-26T09:24:37.631691 #2127198] INFO -- : [590/883] 2168166=test_len I, [2024-05-26T09:24:37.639336 #2127198] INFO -- : [591/883] 2168166=json_fixtures_test I, [2024-05-26T09:24:37.651365 #2127198] INFO -- : [592/883] 2168166=test_gem_doctor I, [2024-05-26T09:24:37.706323 #2127198] INFO -- : [593/883] 2168166=test_rdoc_i18n_text I, [2024-05-26T09:24:37.718385 #2127198] INFO -- : [594/883] 2168166=test_io I, [2024-05-26T09:24:37.924443 #2127198] INFO -- : [595/883] 2168166=test_input_method I, [2024-05-26T09:24:38.079680 #2127198] INFO -- : [596/883] 2168166=test_gem_util I, [2024-05-26T09:24:38.210901 #2127198] INFO -- : [597/883] 2168166=test_config I, [2024-05-26T09:24:38.308164 #2127198] INFO -- : [598/883] 2168166=test_complex2 I, [2024-05-26T09:24:38.331146 #2127198] INFO -- : [599/883] 2168166=test_gem_security_signer I, [2024-05-26T09:24:38.429378 #2127198] INFO -- : [600/883] 2168166=test_thread I, [2024-05-26T09:24:38.662971 #2127198] INFO -- : [601/883] 2168166=test_literal I, [2024-05-26T09:24:39.253822 #2127198] INFO -- : [602/883] 2168166=test_gem_unsatisfiable_dependency_error I, [2024-05-26T09:24:39.281231 #2127198] INFO -- : [603/883] 2168166=test_gem_platform I, [2024-05-26T09:24:39.399486 #2127198] INFO -- : [604/883] 2168166=test_gem_commands_query_command I, [2024-05-26T09:24:40.048768 #2127198] INFO -- : [605/883] 2168166=test_bigzero I, [2024-05-26T09:24:40.058506 #2127198] INFO -- : [606/883] 2168166=test_external_new I, [2024-05-26T09:24:40.072322 #2127198] INFO -- : [607/883] 2168166=test_pkey I, [2024-05-26T09:24:40.083120 #2127198] INFO -- : [608/883] 2168166=test_win32ole_typelib I, [2024-05-26T09:24:40.128222 #2127198] INFO -- : [609/883] 2168166=test_m17n_comb I, [2024-05-26T09:24:40.463641 #2127198] INFO -- : [610/883] 2168168=test_pkey_dh I, [2024-05-26T09:24:41.864957 #2127198] INFO -- : [611/883] 2168168=test_multi_irb_commands I, [2024-05-26T09:24:41.880832 #2127198] INFO -- : [612/883] 2168168=test_memory_view I, [2024-05-26T09:24:41.904711 #2127198] INFO -- : [613/883] 2168168=test_data I, [2024-05-26T09:24:41.916992 #2127198] INFO -- : [614/883] 2168168=test_null I, [2024-05-26T09:24:41.936762 #2127198] INFO -- : [615/883] 2168168=test_ractor I, [2024-05-26T09:24:41.998645 #2127198] INFO -- : [616/883] 2168168=test_rdoc_alias I, [2024-05-26T09:24:42.007183 #2127198] INFO -- : [617/883] 2168168=test_instrumentation_api I, [2024-05-26T09:24:42.341213 #2127198] INFO -- : [618/883] 2168166=test_weakref I, [2024-05-26T09:24:42.650278 #2127198] INFO -- : [619/883] 2168166=test_key_name_check I, [2024-05-26T09:24:42.659517 #2127198] INFO -- : [620/883] 2168166=test_rdoc_markup_to_bs I, [2024-05-26T09:24:42.701600 #2127198] INFO -- : [621/883] 2168166=test_rdoc_markup_raw I, [2024-05-26T09:24:42.719561 #2127198] INFO -- : [622/883] 2168166=test_timeout I, [2024-05-26T09:24:43.627003 #2127198] INFO -- : [623/883] 2168166=test_word I, [2024-05-26T09:24:43.642020 #2127198] INFO -- : [624/883] 2168166=test_rdoc_require I, [2024-05-26T09:24:43.785920 #2127198] INFO -- : [625/883] 2168166=test_gem_ext_rake_builder I, [2024-05-26T09:24:44.328891 #2127198] INFO -- : [626/883] 2168166=test_numeric I, [2024-05-26T09:24:44.340925 #2127198] INFO -- : [627/883] 2168166=test_fstring I, [2024-05-26T09:24:44.454712 #2127198] INFO -- : [628/883] 2168166=test_singleton I, [2024-05-26T09:24:44.471808 #2127198] INFO -- : [629/883] 2168166=test_gem_commands_cert_command I, [2024-05-26T09:24:44.987676 #2127198] INFO -- : [630/883] 2168168=test_date_strftime I, [2024-05-26T09:24:45.456670 #2127198] INFO -- : [631/883] 2168168=json_parser_test I, [2024-05-26T09:24:45.509374 #2127198] INFO -- : [632/883] 2168168=test_ws I, [2024-05-26T09:24:45.520786 #2127198] INFO -- : [633/883] 2168168=test_rdoc_markup_to_tt_only I, [2024-05-26T09:24:45.561735 #2127198] INFO -- : [634/883] 2168168=ruby_parser_test I, [2024-05-26T09:24:45.580346 #2127198] INFO -- : [635/883] 2168168=test_gem_commands_stale_command I, [2024-05-26T09:24:45.594885 #2127198] INFO -- : [636/883] 2168168=test_pack I, [2024-05-26T09:24:45.812741 #2127198] INFO -- : [637/883] 2168168=test_pkcs7 I, [2024-05-26T09:24:45.991354 #2127198] INFO -- : [638/883] 2168168=test_gem_commands_environment_command I, [2024-05-26T09:24:46.059545 #2127198] INFO -- : [639/883] 2168168=test_basicsocket I, [2024-05-26T09:24:46.071479 #2127198] INFO -- : [640/883] 2168168=test_zsh_completion I, [2024-05-26T09:24:46.097211 #2127198] INFO -- : [641/883] 2168168=test_syntax I, [2024-05-26T09:24:46.384639 #2127198] INFO -- : [642/883] 2168166=test_scalar I, [2024-05-26T09:24:46.396904 #2127198] INFO -- : [643/883] 2168166=test_class_name_check I, [2024-05-26T09:24:46.426889 #2127198] INFO -- : [644/883] 2168166=test_div I, [2024-05-26T09:24:46.428930 #2127198] INFO -- : [645/883] 2168166=test_files_test_2 I, [2024-05-26T09:24:46.448961 #2127198] INFO -- : [646/883] 2168166=test_rdoc_markup_to_html_crossref I, [2024-05-26T09:24:46.711600 #2127198] INFO -- : [647/883] 2168166=test_bash_completion I, [2024-05-26T09:24:46.776754 #2127198] INFO -- : [648/883] 2168166=test_exception I, [2024-05-26T09:24:50.914127 #2127198] INFO -- : [649/883] 2168166=test_optparse I, [2024-05-26T09:24:50.975059 #2127198] INFO -- : [650/883] 2168166=test_deprecated I, [2024-05-26T09:24:50.984072 #2127198] INFO -- : [651/883] 2168166=test_rdoc_context_section I, [2024-05-26T09:24:50.996649 #2127198] INFO -- : [652/883] 2168166=test_io_buffer I, [2024-05-26T09:24:51.116927 #2127198] INFO -- : [653/883] 2168166=test_show_source I, [2024-05-26T09:24:51.129209 #2127198] INFO -- : [654/883] 2168166=test_remote_fetch_error I, [2024-05-26T09:24:51.148378 #2127198] INFO -- : [655/883] 2168166=test_yield I, [2024-05-26T09:24:53.918851 #2127198] INFO -- : [656/883] 2168166=regexp_test I, [2024-05-26T09:24:53.947190 #2127198] INFO -- : [657/883] 2168166=test_rdoc_store I, [2024-05-26T09:24:54.540795 #2127198] INFO -- : [658/883] 2168166=test_shift_jis I, [2024-05-26T09:24:54.549470 #2127198] INFO -- : [659/883] 2168166=test_force_exit I, [2024-05-26T09:24:54.553221 #2127198] INFO -- : [660/883] 2168166=test_optimization I, [2024-05-26T09:24:55.811362 #2127198] INFO -- : [661/883] 2168168=test_rubyoptions I, [2024-05-26T09:25:01.215303 #2127198] INFO -- : [662/883] 2168166=test_data_error I, [2024-05-26T09:25:01.217242 #2127198] INFO -- : [663/883] 2168166=test_files_sample I, [2024-05-26T09:25:01.225430 #2127198] INFO -- : [664/883] 2168166=test_rdoc_stats I, [2024-05-26T09:25:01.257088 #2127198] INFO -- : [665/883] 2168166=test_enc_raise I, [2024-05-26T09:25:01.263306 #2127198] INFO -- : [666/883] 2168166=test_clone I, [2024-05-26T09:25:01.448457 #2127198] INFO -- : [667/883] 2168166=test_cgi_util I, [2024-05-26T09:25:01.728241 #2127198] INFO -- : [668/883] 2168166=test_ole_methods I, [2024-05-26T09:25:01.738263 #2127198] INFO -- : [669/883] 2168166=test_prettyprint I, [2024-05-26T09:25:01.776465 #2127198] INFO -- : [670/883] 2168166=test_gem_uri_formatter I, [2024-05-26T09:25:01.801596 #2127198] INFO -- : [671/883] 2168166=test_dryrun I, [2024-05-26T09:25:01.827681 #2127198] INFO -- : [672/883] 2168166=test_rdoc_i18n_locale I, [2024-05-26T09:25:01.977656 #2127198] INFO -- : [673/883] 2168166=test_gc_compact I, [2024-05-26T09:25:02.310023 #2127198] INFO -- : [674/883] 2168168=test_boolean I, [2024-05-26T09:25:02.326350 #2127198] INFO -- : [675/883] 2168168=test_gem_resolver_lock_specification I, [2024-05-26T09:25:02.373552 #2127198] INFO -- : [676/883] 2168168=test_queue I, [2024-05-26T09:25:02.379640 #2127198] INFO -- : [677/883] 2168168=test_hash_create I, [2024-05-26T09:25:02.400554 #2127198] INFO -- : [678/883] 2168168=test_grapheme_breaks I, [2024-05-26T09:25:02.420043 #2127198] INFO -- : [679/883] 2168168=static_literals_test I, [2024-05-26T09:25:02.437767 #2127198] INFO -- : [680/883] 2168168=test_tree_spell_checker I, [2024-05-26T09:25:02.507124 #2127198] INFO -- : [681/883] 2168168=test_set I, [2024-05-26T09:25:02.554045 #2127198] INFO -- : [682/883] 2168168=test_rdoc_method_attr I, [2024-05-26T09:25:02.670504 #2127198] INFO -- : [683/883] 2168168=test_enumerable I, [2024-05-26T09:25:02.675545 #2127198] INFO -- : [684/883] 2168168=test_gem_commands_dependency_command I, [2024-05-26T09:25:02.781811 #2127198] INFO -- : [685/883] 2168168=test_gbk I, [2024-05-26T09:25:02.792825 #2127198] INFO -- : [686/883] 2168168=test_backtrace I, [2024-05-26T09:25:02.848619 #2127198] INFO -- : [687/883] 2168168=test_default_gems I, [2024-05-26T09:25:02.862503 #2127198] INFO -- : [688/883] 2168168=test_switch_hitter I, [2024-05-26T09:25:02.884294 #2127198] INFO -- : [689/883] 2168168=test_unicode_escape I, [2024-05-26T09:25:02.970150 #2127198] INFO -- : [690/883] 2168168=test_gem_spec_fetcher I, [2024-05-26T09:25:03.172642 #2127198] INFO -- : [691/883] 2168168=test_yamldbm I, [2024-05-26T09:25:03.182538 #2127198] INFO -- : [692/883] 2168168=test_buffering I, [2024-05-26T09:25:03.194763 #2127198] INFO -- : [693/883] 2168168=test_pkey_ec I, [2024-05-26T09:25:03.219953 #2127198] INFO -- : [694/883] 2168168=test_svcb_https I, [2024-05-26T09:25:03.226748 #2127198] INFO -- : [695/883] 2168168=test_thread I, [2024-05-26T09:25:03.241797 #2127198] INFO -- : [696/883] 2168168=test_arity I, [2024-05-26T09:25:03.263543 #2127198] INFO -- : [697/883] 2168168=test_date_parse I, [2024-05-26T09:25:03.501551 #2127198] INFO -- : [698/883] 2168168=test_open3 I, [2024-05-26T09:25:05.447384 #2127198] INFO -- : [699/883] 2168166=test_mdns I, [2024-05-26T09:25:05.449572 #2127198] INFO -- : [700/883] 2168166=test_key_event_record I, [2024-05-26T09:25:05.464818 #2127198] INFO -- : [701/883] 2168166=test_webauthn_listener I, [2024-05-26T09:25:05.497941 #2127198] INFO -- : Leaked file descriptor: WebauthnListenerTest#test_wait_for_otp_code_get_follows_options: 14 : # I, [2024-05-26T09:25:05.544341 #2127198] INFO -- : COMMAND PID USER FD TYPE DEVICE SIZE/OFF NODE NAME I, [2024-05-26T09:25:05.544417 #2127198] INFO -- : ruby 2168166 opc 14u IPv4 3149415238 0t0 TCP localhost:37077->localhost:38526 (CLOSE_WAIT) I, [2024-05-26T09:25:05.611214 #2127198] INFO -- : .Closed file descriptor: WebauthnListenerTest#test_wait_for_otp_code_options_request: 14 I, [2024-05-26T09:25:05.714998 #2127198] INFO -- : [702/883] 2168166=test_rdoc_rubygems_hook I, [2024-05-26T09:25:05.873340 #2127198] INFO -- : [703/883] 2168166=test_gem_resolver_api_specification I, [2024-05-26T09:25:05.921385 #2127198] INFO -- : [704/883] 2168166=test_ractor I, [2024-05-26T09:25:05.934229 #2127198] INFO -- : [705/883] 2168166=test_gem_ext_cargo_builder_unit I, [2024-05-26T09:25:05.969792 #2127198] INFO -- : [706/883] 2168166=test_case_mapping I, [2024-05-26T09:25:05.986979 #2127198] INFO -- : [707/883] 2168166=test_rational I, [2024-05-26T09:25:06.015947 #2127198] INFO -- : [708/883] 2168166=test_complex I, [2024-05-26T09:25:06.123642 #2127198] INFO -- : [709/883] 2168166=test_threadgroup I, [2024-05-26T09:25:06.194417 #2127198] INFO -- : [710/883] 2168168=test_dir_m17n I, [2024-05-26T09:25:07.137563 #2127198] INFO -- : [711/883] 2168166=test_memory_view I, [2024-05-26T09:25:07.331929 #2127198] INFO -- : [712/883] 2168168=test_array_create I, [2024-05-26T09:25:07.349954 #2127198] INFO -- : [713/883] 2168168=test_process I, [2024-05-26T09:25:07.402635 #2127198] INFO -- : [714/883] 2168168=test_forwardable I, [2024-05-26T09:25:07.476752 #2127198] INFO -- : [715/883] 2168168=test_fd_setsize I, [2024-05-26T09:25:07.478431 #2127198] INFO -- : [716/883] 2168168=!Nothing_to_test I, [2024-05-26T09:25:07.499529 #2127198] INFO -- : [717/883] 2168168=test_gem_rdoc I, [2024-05-26T09:25:07.621867 #2127198] INFO -- : [718/883] 2168166=test_dot_dot I, [2024-05-26T09:25:07.628823 #2127198] INFO -- : [719/883] 2168166=pattern_test I, [2024-05-26T09:25:07.645891 #2127198] INFO -- : [720/883] 2168166=test_kernel I, [2024-05-26T09:25:07.653857 #2127198] INFO -- : [721/883] 2168168=test_rendering I, [2024-05-26T09:25:07.679765 #2127198] INFO -- : [722/883] 2168168=test_gem_commands_install_command I, [2024-05-26T09:25:08.266325 #2127198] INFO -- : [723/883] 2168166=test_iterator I, [2024-05-26T09:25:08.365055 #2127198] INFO -- : [724/883] 2168166=test_string I, [2024-05-26T09:25:08.375532 #2127198] INFO -- : [725/883] 2168166=test_merge_keys I, [2024-05-26T09:25:08.385769 #2127198] INFO -- : [726/883] 2168166=test_err_in_callback I, [2024-05-26T09:25:08.386761 #2127198] INFO -- : [727/883] 2168166=test_method_name_check I, [2024-05-26T09:25:08.449027 #2127198] INFO -- : [728/883] 2168166=test_storage I, [2024-05-26T09:25:08.467666 #2127198] INFO -- : [729/883] 2168166=test_rdoc_extend I, [2024-05-26T09:25:08.483107 #2127198] INFO -- : [730/883] 2168166=test_cesu8 I, [2024-05-26T09:25:08.487318 #2127198] INFO -- : [731/883] 2168166=test_shapes I, [2024-05-26T09:25:08.497857 #2127198] INFO -- : [732/883] 2168166=test_did_you_mean I, [2024-05-26T09:25:08.561949 #2127198] INFO -- : [733/883] 2168166=test_exception I, [2024-05-26T09:25:08.583796 #2127198] INFO -- : [734/883] 2168166=test_raise_exception I, [2024-05-26T09:25:09.182585 #2127198] INFO -- : [735/883] 2168166=test_arith_seq_beg_len_step I, [2024-05-26T09:25:09.233250 #2127198] INFO -- : [736/883] 2168166=test_noarg I, [2024-05-26T09:25:09.372841 #2127198] INFO -- : [737/883] 2168166=test_gem_resolver_requirement_list I, [2024-05-26T09:25:09.386272 #2127198] INFO -- : [738/883] 2168166=test_pp I, [2024-05-26T09:25:09.447627 #2127198] INFO -- : [739/883] 2168166=test_gem_impossible_dependencies_error I, [2024-05-26T09:25:09.456635 #2127198] INFO -- : [740/883] 2168166=test_optarg I, [2024-05-26T09:25:09.562980 #2127198] INFO -- : [741/883] 2168166=test_gem_commands_pristine_command I, [2024-05-26T09:25:09.666657 #2127198] INFO -- : [742/883] 2168168=test_rdoc_tom_doc I, [2024-05-26T09:25:09.694926 #2127198] INFO -- : [743/883] 2168168=test_hash I, [2024-05-26T09:25:09.714762 #2127198] INFO -- : [744/883] 2168168=test_variable I, [2024-05-26T09:25:09.834087 #2127198] INFO -- : [745/883] 2168168=test_date_ractor I, [2024-05-26T09:25:10.040741 #2127198] INFO -- : [746/883] 2168168=test_erb I, [2024-05-26T09:25:10.103097 #2127198] INFO -- : [747/883] 2168168=test_gem_security I, [2024-05-26T09:25:10.966545 #2127198] INFO -- : [748/883] 2168166=test_key_actor_emacs I, [2024-05-26T09:25:11.157873 #2127198] INFO -- : [749/883] 2168166=test_utf32 I, [2024-05-26T09:25:11.181111 #2127198] INFO -- : [750/883] 2168166=test_gem_resolver_git_specification I, [2024-05-26T09:25:11.567158 #2127198] INFO -- : [751/883] 2168166=test_basicinstructions I, [2024-05-26T09:25:11.635322 #2127198] INFO -- : [752/883] 2168166=test_assignment I, [2024-05-26T09:25:13.040525 #2127198] INFO -- : [753/883] 2168166=test_gem_update_suggestion I, [2024-05-26T09:25:13.125365 #2127198] INFO -- : [754/883] 2168166=test_normalize I, [2024-05-26T09:25:13.133016 #2127198] INFO -- : [755/883] 2168166=test_emoji_breaks I, [2024-05-26T09:25:13.144769 #2127198] INFO -- : [756/883] 2168166=test_verbose I, [2024-05-26T09:25:13.277343 #2127198] INFO -- : [757/883] 2168166=test_gem_commands_open_command I, [2024-05-26T09:25:13.319594 #2127198] INFO -- : [758/883] 2168166=test_asn1 I, [2024-05-26T09:25:13.340137 #2127198] INFO -- : [759/883] 2168166=test_gem_command I, [2024-05-26T09:25:13.481581 #2127198] INFO -- : [760/883] 2168166=test_rdoc_generator_darkfish I, [2024-05-26T09:25:13.792816 #2127198] INFO -- : [761/883] 2168166=test_gem_resolver_lock_set I, [2024-05-26T09:25:13.828528 #2127198] INFO -- : [762/883] 2168166=test_random I, [2024-05-26T09:25:13.834102 #2127198] INFO -- : [763/883] 2168166=test_undef I, [2024-05-26T09:25:13.853024 #2127198] INFO -- : [764/883] 2168166=test_rdoc_class_module I, [2024-05-26T09:25:14.348570 #2127198] INFO -- : [765/883] 2168166=test_rdoc_cross_reference I, [2024-05-26T09:25:14.508646 #2127198] INFO -- : [766/883] 2168167=test_parse I, [2024-05-26T09:25:14.746446 #2127198] INFO -- : [767/883] 2168166=test_method_cache I, [2024-05-26T09:25:14.751615 #2127198] INFO -- : [768/883] 2168166=test_win32ole_variable I, [2024-05-26T09:25:14.760476 #2127198] INFO -- : [769/883] 2168166=test_numhash I, [2024-05-26T09:25:14.770367 #2127198] INFO -- : [770/883] 2168166=test_system I, [2024-05-26T09:25:15.042361 #2127198] INFO -- : [771/883] 2168167=test_pkey_rsa I, [2024-05-26T09:25:15.248578 #2127198] INFO -- : [772/883] 2168167=test_flush I, [2024-05-26T09:25:15.276861 #2127198] INFO -- : [773/883] 2168167=test_gem_specification I, [2024-05-26T09:25:15.650390 #2127198] INFO -- : [774/883] 2168166=test_gem_install_update_options I, [2024-05-26T09:25:15.814570 #2127198] INFO -- : [775/883] 2168166=test_econv I, [2024-05-26T09:25:16.694258 #2127198] INFO -- : [776/883] 2168166=warnings_test I, [2024-05-26T09:25:16.724687 #2127198] INFO -- : [777/883] 2168166=test_stringchar I, [2024-05-26T09:25:16.982549 #2127198] INFO -- : [778/883] 2168166=test_sizeof I, [2024-05-26T09:25:18.059016 #2127198] INFO -- : [779/883] 2168167=test_date_attr I, [2024-05-26T09:25:18.072959 #2127198] INFO -- : [780/883] 2168167=test_gem_request_set_lockfile_parser I, [2024-05-26T09:25:18.218684 #2127198] INFO -- : [781/883] 2168167=test_face I, [2024-05-26T09:25:18.870215 #2127198] INFO -- : [782/883] 2168167=test_stack I, [2024-05-26T09:25:19.076329 #2127198] INFO -- : [783/883] 2168166=test_windows_1252 I, [2024-05-26T09:25:19.148630 #2127198] INFO -- : [784/883] 2168166=test_sorted_set I, [2024-05-26T09:25:19.294173 #2127198] INFO -- : [785/883] 2168166=test_emoji I, [2024-05-26T09:25:19.325866 #2127198] INFO -- : [786/883] 2168166=test_mixed_unicode_escapes I, [2024-05-26T09:25:19.339110 #2127198] INFO -- : [787/883] 2168166=test_sleep I, [2024-05-26T09:25:19.379257 #2127198] INFO -- : [788/883] 2168167=test_fileutils I, [2024-05-26T09:25:19.473736 #2127198] INFO -- : Leaked file descriptor: TestFileUtils#test_chown_error: 10 # I, [2024-05-26T09:25:19.476081 #2127198] INFO -- : Leaked file descriptor: TestFileUtils#test_chown_error: 11 # I, [2024-05-26T09:25:19.498657 #2127198] INFO -- : COMMAND PID USER FD TYPE DEVICE SIZE/OFF NODE NAME I, [2024-05-26T09:25:19.498729 #2127198] INFO -- : ruby 2168167 opc 10r REG 252,0 9253600 13705411 /var/lib/sss/mc/passwd I, [2024-05-26T09:25:19.498741 #2127198] INFO -- : ruby 2168167 opc 11r REG 252,0 6940392 13705429 /var/lib/sss/mc/group I, [2024-05-26T09:25:19.920257 #2127198] INFO -- : [789/883] 2168167=test_gem_dependency_resolution_error I, [2024-05-26T09:25:19.931777 #2127198] INFO -- : [790/883] 2168167=test_gem_resolver_vendor_set I, [2024-05-26T09:25:19.954736 #2127198] INFO -- : [791/883] 2168167=test_condition I, [2024-05-26T09:25:19.962423 #2127198] INFO -- : [792/883] 2168167=test_cp949 I, [2024-05-26T09:25:19.969652 #2127198] INFO -- : [793/883] 2168167=test_jaro_winkler I, [2024-05-26T09:25:19.974596 #2127198] INFO -- : [794/883] 2168167=test_nil2vtempty I, [2024-05-26T09:25:19.981654 #2127198] INFO -- : [795/883] 2168167=test_date_time I, [2024-05-26T09:25:20.070347 #2127198] INFO -- : [796/883] 2168167=test_rdoc_generator_json_index I, [2024-05-26T09:25:20.165692 #2127198] INFO -- : [797/883] 2168167=test_pinned I, [2024-05-26T09:25:20.306573 #2127198] INFO -- : [798/883] 2168167=test_pack I, [2024-05-26T09:25:20.319475 #2127198] INFO -- : [799/883] 2168167=test_cgi_tag_helper I, [2024-05-26T09:25:20.331710 #2127198] INFO -- : [800/883] 2168167=test_inadvertent_creation I, [2024-05-26T09:25:20.422206 #2127198] INFO -- : [801/883] 2168167=test_ansi_with_terminfo I, [2024-05-26T09:25:20.429804 #2127198] INFO -- : [802/883] 2168167=test_weakmap I, [2024-05-26T09:25:21.384910 #2127198] INFO -- : [803/883] 2168166=test_coderange I, [2024-05-26T09:25:21.387327 #2127198] INFO -- : [804/883] 2168166=test_framework I, [2024-05-26T09:25:21.403254 #2127198] INFO -- : [805/883] 2168166=test_gem_commands_sources_command I, [2024-05-26T09:25:21.610488 #2127198] INFO -- : [806/883] 2168166=test_name_error I, [2024-05-26T09:25:21.704757 #2127198] INFO -- : [807/883] 2168166=json_addition_test I, [2024-05-26T09:25:21.723390 #2127198] INFO -- : [808/883] 2168166=test_gem_source_list I, [2024-05-26T09:25:21.787458 #2127198] INFO -- : [809/883] 2168166=test_recorder I, [2024-05-26T09:25:21.797595 #2127198] INFO -- : [810/883] 2168166=test_yaml_special_cases I, [2024-05-26T09:25:21.806957 #2127198] INFO -- : [811/883] 2168166=index_write_test I, [2024-05-26T09:25:21.816571 #2127198] INFO -- : [812/883] 2168166=test_rdoc_parser_rd I, [2024-05-26T09:25:21.830501 #2127198] INFO -- : [813/883] 2168166=test_const I, [2024-05-26T09:25:21.839772 #2127198] INFO -- : [814/883] 2168166=test_exit I, [2024-05-26T09:25:21.920944 #2127198] INFO -- : [815/883] 2168166=test_class I, [2024-05-26T09:25:24.604916 #2127198] INFO -- : [816/883] 2168166=test_sprintf I, [2024-05-26T09:25:24.814913 #2127198] INFO -- : [817/883] 2168166=test_safe_load I, [2024-05-26T09:25:24.831131 #2127198] INFO -- : [818/883] 2168166=test_qsort I, [2024-05-26T09:25:24.840452 #2127198] INFO -- : [819/883] 2168166=comments_test I, [2024-05-26T09:25:24.843404 #2127198] INFO -- : [820/883] 2168166=test_gc I, [2024-05-26T09:25:24.854602 #2127198] INFO -- : [821/883] 2168166=test_math I, [2024-05-26T09:25:24.872405 #2127198] INFO -- : [822/883] 2168166=test_iso_8859 I, [2024-05-26T09:25:24.926678 #2127198] INFO -- : [823/883] 2168166=ripper_test I, [2024-05-26T09:25:25.602167 #2127198] INFO -- : [824/883] 2168166=test_libs I, [2024-05-26T09:25:25.616713 #2127198] INFO -- : [825/883] 2168166=test_array I, [2024-05-26T09:25:25.638160 #2127198] INFO -- : [826/883] 2168166=test_rdoc_context I, [2024-05-26T09:25:26.399350 #2127198] INFO -- : [827/883] 2168166=test_gem_command_manager I, [2024-05-26T09:25:26.574584 #2127198] INFO -- : [828/883] 2168166=test_enumerator I, [2024-05-26T09:25:27.248850 #2127198] INFO -- : [829/883] 2168168=test_enc_associate I, [2024-05-26T09:25:27.697617 #2127198] INFO -- : [830/883] 2168168=test_open-uri I, [2024-05-26T09:25:28.068699 #2127198] INFO -- : [831/883] 2168168=test_case I, [2024-05-26T09:25:28.097912 #2127198] INFO -- : [832/883] 2168168=test_gem_package_old I, [2024-05-26T09:25:28.170983 #2127198] INFO -- : [833/883] 2168168=test_gem_request I, [2024-05-26T09:25:28.417732 #2127198] INFO -- : [834/883] 2168168=test_gem_commands_which_command I, [2024-05-26T09:25:28.463801 #2127198] INFO -- : [835/883] 2168168=test_scan_args I, [2024-05-26T09:25:28.487525 #2127198] INFO -- : [836/883] 2168168=test_gem_commands_specification_command I, [2024-05-26T09:25:28.726393 #2127198] INFO -- : [837/883] 2168168=encoding_test I, [2024-05-26T09:25:28.821770 #2127198] INFO -- : [838/883] 2168168=test_hash I, [2024-05-26T09:25:33.136460 #2127198] INFO -- : [839/883] 2168167=parser_test I, [2024-05-26T09:25:33.146742 #2127198] INFO -- : [840/883] 2168167=test_http I, [2024-05-26T09:25:33.174861 #2127198] INFO -- : [841/883] 2168167=test_gem_dependency_installer I, [2024-05-26T09:25:33.271098 #2127198] INFO -- : [842/883] 2168168=test_pty I, [2024-05-26T09:25:33.752263 #2127198] INFO -- : [843/883] 2168168=test_backtrace I, [2024-05-26T09:25:35.160890 #2127198] INFO -- : [844/883] 2168168=test_tracepoint I, [2024-05-26T09:25:35.450687 #2127198] INFO -- : [845/883] 2168168=test_gem_text I, [2024-05-26T09:25:35.539553 #2127198] INFO -- : [846/883] 2168168=test_settracefunc I, [2024-05-26T09:25:35.820679 #2127198] INFO -- : [847/883] 2168167=test_rdoc_task I, [2024-05-26T09:25:35.929053 #2127198] INFO -- : [848/883] 2168167=test_gem_gemcutter_utilities I, [2024-05-26T09:25:36.389477 #2127198] INFO -- : [849/883] 2168167=test_rendering I, [2024-05-26T09:25:36.391557 #2127198] INFO -- : [850/883] 2168167=test_win32ole I, [2024-05-26T09:25:36.396437 #2127198] INFO -- : [851/883] 2168167=test_internal_ivar I, [2024-05-26T09:25:36.436078 #2127198] INFO -- : [852/883] 2168167=test_gem_source_local I, [2024-05-26T09:25:36.678497 #2127198] INFO -- : [853/883] 2168167=desugar_compiler_test I, [2024-05-26T09:25:36.700518 #2127198] INFO -- : [854/883] 2168167=test_sprintf_comb I, [2024-05-26T09:25:36.715356 #2127198] INFO -- : [855/883] 2168168=test_too_many_dummy_encodings I, [2024-05-26T09:25:36.788957 #2127198] INFO -- : [856/883] 2168168=test_method_cache I, [2024-05-26T09:25:36.802900 #2127198] INFO -- : [857/883] 2168168=locals_test I, [2024-05-26T09:25:36.842088 #2127198] INFO -- : [858/883] 2168167=test_gem_commands_push_command I, [2024-05-26T09:25:37.274095 #2127198] INFO -- : [859/883] 2168168=test_rdoc_markup_to_rdoc I, [2024-05-26T09:25:37.320757 #2127198] INFO -- : [860/883] 2168168=test_set I, [2024-05-26T09:25:37.336758 #2127198] INFO -- : [861/883] 2168168=test_http I, [2024-05-26T09:25:37.572525 #2127198] INFO -- : [862/883] 2168167=test_utf16 I, [2024-05-26T09:25:37.594400 #2127198] INFO -- : [863/883] 2168167=attribute_write_test I, [2024-05-26T09:25:37.611171 #2127198] INFO -- : [864/883] 2168167=test_gem_package_tar_writer I, [2024-05-26T09:25:37.812673 #2127198] INFO -- : [865/883] 2168167=test_str2big I, [2024-05-26T09:25:37.816677 #2127198] INFO -- : [866/883] 2168167=test_severity I, [2024-05-26T09:25:37.828857 #2127198] INFO -- : [867/883] 2168167=test_case I, [2024-05-26T09:25:37.829273 #2127198] INFO -- : [868/883] 2168167=test_ractor I, [2024-05-26T09:25:37.861413 #2127198] INFO -- : [869/883] 2168167=test_gem_remote_fetcher I, [2024-05-26T09:25:39.845763 #2127198] INFO -- : [870/883] 2168167=test_koi8 I, [2024-05-26T09:25:39.857928 #2127198] INFO -- : [871/883] 2168167=test_json_tree I, [2024-05-26T09:25:39.955634 #2127198] INFO -- : [872/883] 2168167=test_pkcs12 I, [2024-05-26T09:25:40.565936 #2127198] INFO -- : [873/883] 2168167=test_filter I, [2024-05-26T09:25:40.603600 #2127198] INFO -- : [874/883] 2168167=test_parser_events I, [2024-05-26T09:25:40.679177 #2127198] INFO -- : [875/883] 2168167=test_m17n I, [2024-05-26T09:25:40.742467 #2127198] INFO -- : [876/883] 2168167=test_method I, [2024-05-26T09:25:46.263875 #2127198] INFO -- : [877/883] 2168168=test_cclass I, [2024-05-26T09:25:46.364693 #2127198] INFO -- : [878/883] 2168168=test_gem_uninstaller I, [2024-05-26T09:25:47.834974 #2127198] INFO -- : [879/883] 2168168=test_yjit I, [2024-05-26T09:25:47.861658 #2127198] INFO -- : [880/883] 2168168=test_gem_dependency I, [2024-05-26T09:25:48.036314 #2127198] INFO -- : [881/883] 2168168=test_x509name I, [2024-05-26T09:25:48.056645 #2127198] INFO -- : [882/883] 2168168=test_yaml I, [2024-05-26T09:25:48.253211 #2127198] INFO -- : [883/883] 2168168=test_argf I, [2024-05-26T09:25:59.127679 #2127198] INFO -- : Finished tests in 220.975515s, 119.0539 tests/s, 42323.4041 assertions/s. I, [2024-05-26T09:25:59.132591 #2127198] INFO -- : 26308 tests, 9352436 assertions, 0 failures, 0 errors, 320 skips I, [2024-05-26T09:25:59.132641 #2127198] INFO -- : I, [2024-05-26T09:25:59.132654 #2127198] INFO -- : ruby -v: ruby 3.4.0dev (2024-05-26T08:28:25Z master 508f331048) [aarch64-linux] I, [2024-05-26T09:25:59.133562 #2127198] INFO -- : $$$[end] "make yes-test-all TESTOPTS='--stderr-on-failure' TESTS='-j3'" exit with 0. I, [2024-05-26T09:25:59.133707 #2127198] INFO -- : $$$[beg] make yes-test-rubyspec MSPECOPT='--error-output stderr --debug -j' TESTS='-j3' I, [2024-05-26T09:25:59.259022 #2127198] INFO -- : BASERUBY = /usr/local/bin/ruby --disable=gems I, [2024-05-26T09:25:59.259100 #2127198] INFO -- : CC = gcc I, [2024-05-26T09:25:59.259112 #2127198] INFO -- : LD = ld I, [2024-05-26T09:25:59.259124 #2127198] INFO -- : LDSHARED = gcc -shared I, [2024-05-26T09:25:59.259134 #2127198] INFO -- : CFLAGS = -O3 -fno-fast-math -ggdb3 -Wall -Wextra -Wdeprecated-declarations -Wdiv-by-zero -Wduplicated-cond -Wimplicit-function-declaration -Wimplicit-int -Wpointer-arith -Wwrite-strings -Wold-style-definition -Wimplicit-fallthrough=0 -Wmissing-noreturn -Wno-cast-function-type -Wno-constant-logical-operand -Wno-long-long -Wno-missing-field-initializers -Wno-overlength-strings -Wno-packed-bitfield-compat -Wno-parentheses-equality -Wno-self-assign -Wno-tautological-compare -Wno-unused-parameter -Wno-unused-value -Wsuggest-attribute=format -Wsuggest-attribute=noreturn -Wunused-variable -Wmisleading-indentation -Wundef I, [2024-05-26T09:25:59.259144 #2127198] INFO -- : XCFLAGS = -U_FORTIFY_SOURCE -D_FORTIFY_SOURCE=2 -fstack-protector-strong -msign-return-address=all -fno-strict-overflow -fvisibility=hidden -fexcess-precision=standard -DRUBY_EXPORT -fPIE -I. -I.ext/include/aarch64-linux -I/home/opc/ruby/src/master/include -I/home/opc/ruby/src/master -I/home/opc/ruby/src/master/prism -I/home/opc/ruby/src/master/enc/unicode/15.0.0 I, [2024-05-26T09:25:59.259154 #2127198] INFO -- : CPPFLAGS = I, [2024-05-26T09:25:59.259163 #2127198] INFO -- : DLDFLAGS = -Wl,--compress-debug-sections=zlib -fstack-protector-strong -pie I, [2024-05-26T09:25:59.259173 #2127198] INFO -- : SOLIBS = -lz -lrt -lrt -ldl -lcrypt -lm -lpthread I, [2024-05-26T09:25:59.259181 #2127198] INFO -- : LANG = en_US.UTF-8 I, [2024-05-26T09:25:59.259190 #2127198] INFO -- : LC_ALL = I, [2024-05-26T09:25:59.259199 #2127198] INFO -- : LC_CTYPE = I, [2024-05-26T09:25:59.259207 #2127198] INFO -- : MFLAGS = I, [2024-05-26T09:25:59.259216 #2127198] INFO -- : RUSTC = rustc I, [2024-05-26T09:25:59.259224 #2127198] INFO -- : YJIT_RUSTC_ARGS = --crate-name=yjit --crate-type=staticlib --edition=2021 -g -C lto=thin -C opt-level=3 -C overflow-checks=on '--out-dir=/home/opc/ruby/build/master/yjit/target/release/' /home/opc/ruby/src/master/yjit/src/lib.rs I, [2024-05-26T09:25:59.259853 #2127198] INFO -- : gcc (GCC) 8.5.0 20210514 (Red Hat 8.5.0-10.1.0.1) I, [2024-05-26T09:25:59.259869 #2127198] INFO -- : Copyright (C) 2018 Free Software Foundation, Inc. I, [2024-05-26T09:25:59.259879 #2127198] INFO -- : This is free software; see the source for copying conditions. There is NO I, [2024-05-26T09:25:59.259888 #2127198] INFO -- : warranty; not even for MERCHANTABILITY or FITNESS FOR A PARTICULAR PURPOSE. I, [2024-05-26T09:25:59.259897 #2127198] INFO -- : I, [2024-05-26T09:25:59.261917 #2127198] INFO -- : generating enc.mk I, [2024-05-26T09:25:59.493430 #2127198] INFO -- : generating encdb.h I, [2024-05-26T09:25:59.530484 #2127198] INFO -- : encdb.h unchanged I, [2024-05-26T09:25:59.531659 #2127198] INFO -- : making enc I, [2024-05-26T09:25:59.559512 #2127198] INFO -- : make[1]: Entering directory '/home/opc/ruby/build/master' I, [2024-05-26T09:25:59.559561 #2127198] INFO -- : make[1]: Nothing to be done for 'enc'. I, [2024-05-26T09:25:59.559582 #2127198] INFO -- : make[1]: Leaving directory '/home/opc/ruby/build/master' I, [2024-05-26T09:25:59.560235 #2127198] INFO -- : making srcs under enc I, [2024-05-26T09:25:59.602693 #2127198] INFO -- : make[1]: Entering directory '/home/opc/ruby/build/master' I, [2024-05-26T09:25:59.602733 #2127198] INFO -- : make[1]: Nothing to be done for 'srcs'. I, [2024-05-26T09:25:59.602744 #2127198] INFO -- : make[1]: Leaving directory '/home/opc/ruby/build/master' I, [2024-05-26T09:25:59.603761 #2127198] INFO -- : generating transdb.h I, [2024-05-26T09:25:59.750124 #2127198] INFO -- : transdb.h unchanged I, [2024-05-26T09:25:59.751479 #2127198] INFO -- : making trans I, [2024-05-26T09:25:59.800626 #2127198] INFO -- : make[1]: Entering directory '/home/opc/ruby/build/master' I, [2024-05-26T09:25:59.800680 #2127198] INFO -- : make[1]: Nothing to be done for 'trans'. I, [2024-05-26T09:25:59.800693 #2127198] INFO -- : make[1]: Leaving directory '/home/opc/ruby/build/master' I, [2024-05-26T09:25:59.801648 #2127198] INFO -- : making encs I, [2024-05-26T09:25:59.855504 #2127198] INFO -- : make[1]: Entering directory '/home/opc/ruby/build/master' I, [2024-05-26T09:25:59.855785 #2127198] INFO -- : make[1]: Nothing to be done for 'encs'. I, [2024-05-26T09:25:59.855800 #2127198] INFO -- : make[1]: Leaving directory '/home/opc/ruby/build/master' I, [2024-05-26T09:25:59.857558 #2127198] INFO -- : generating makefiles ext/configure-ext.mk I, [2024-05-26T09:25:59.896931 #2127198] INFO -- : ext/configure-ext.mk updated I, [2024-05-26T09:25:59.900313 #2127198] INFO -- : make[1]: Entering directory '/home/opc/ruby/build/master' I, [2024-05-26T09:26:02.038212 #2127198] INFO -- : make[1]: Leaving directory '/home/opc/ruby/build/master' I, [2024-05-26T09:26:02.038855 #2127198] INFO -- : generating makefile exts.mk I, [2024-05-26T09:26:02.099062 #2127198] INFO -- : exts.mk unchanged I, [2024-05-26T09:26:02.104145 #2127198] INFO -- : make[1]: Entering directory '/home/opc/ruby/build/master' I, [2024-05-26T09:26:02.405884 #2127198] INFO -- : make[2]: Entering directory '/home/opc/ruby/build/master/ext/coverage' I, [2024-05-26T09:26:02.410572 #2127198] INFO -- : make[2]: Leaving directory '/home/opc/ruby/build/master/ext/coverage' I, [2024-05-26T09:26:02.416167 #2127198] INFO -- : make[2]: Entering directory '/home/opc/ruby/build/master/ext/date' I, [2024-05-26T09:26:02.421271 #2127198] INFO -- : make[2]: Leaving directory '/home/opc/ruby/build/master/ext/date' I, [2024-05-26T09:26:02.424476 #2127198] INFO -- : make[2]: Entering directory '/home/opc/ruby/build/master/ext/digest' I, [2024-05-26T09:26:02.432899 #2127198] INFO -- : make[2]: Leaving directory '/home/opc/ruby/build/master/ext/digest' I, [2024-05-26T09:26:02.455263 #2127198] INFO -- : make[2]: Entering directory '/home/opc/ruby/build/master/ext/digest/sha2' I, [2024-05-26T09:26:02.460199 #2127198] INFO -- : make[2]: Leaving directory '/home/opc/ruby/build/master/ext/digest/sha2' I, [2024-05-26T09:26:02.478358 #2127198] INFO -- : make[2]: Entering directory '/home/opc/ruby/build/master/ext/fiddle' I, [2024-05-26T09:26:02.488461 #2127198] INFO -- : make[2]: Leaving directory '/home/opc/ruby/build/master/ext/fiddle' I, [2024-05-26T09:26:02.492868 #2127198] INFO -- : make[2]: Entering directory '/home/opc/ruby/build/master/ext/io/console' I, [2024-05-26T09:26:02.497002 #2127198] INFO -- : make[2]: Leaving directory '/home/opc/ruby/build/master/ext/io/console' I, [2024-05-26T09:26:02.507611 #2127198] INFO -- : make[2]: Entering directory '/home/opc/ruby/build/master/ext/json' I, [2024-05-26T09:26:02.517845 #2127198] INFO -- : make[2]: Leaving directory '/home/opc/ruby/build/master/ext/json' I, [2024-05-26T09:26:02.530733 #2127198] INFO -- : make[2]: Entering directory '/home/opc/ruby/build/master/ext/monitor' I, [2024-05-26T09:26:02.534842 #2127198] INFO -- : make[2]: Leaving directory '/home/opc/ruby/build/master/ext/monitor' I, [2024-05-26T09:26:02.540799 #2127198] INFO -- : make[2]: Entering directory '/home/opc/ruby/build/master/ext/objspace' I, [2024-05-26T09:26:02.546609 #2127198] INFO -- : make[2]: Leaving directory '/home/opc/ruby/build/master/ext/objspace' I, [2024-05-26T09:26:02.565651 #2127198] INFO -- : make[2]: Entering directory '/home/opc/ruby/build/master/ext/openssl' I, [2024-05-26T09:26:02.587322 #2127198] INFO -- : make[2]: Leaving directory '/home/opc/ruby/build/master/ext/openssl' I, [2024-05-26T09:26:02.591514 #2127198] INFO -- : make[2]: Entering directory '/home/opc/ruby/build/master/ext/pathname' I, [2024-05-26T09:26:02.595604 #2127198] INFO -- : make[2]: Leaving directory '/home/opc/ruby/build/master/ext/pathname' I, [2024-05-26T09:26:02.601885 #2127198] INFO -- : make[2]: Entering directory '/home/opc/ruby/build/master/ext/psych' I, [2024-05-26T09:26:02.623379 #2127198] INFO -- : make[2]: Leaving directory '/home/opc/ruby/build/master/ext/psych' I, [2024-05-26T09:26:02.627782 #2127198] INFO -- : make[2]: Entering directory '/home/opc/ruby/build/master/ext/pty' I, [2024-05-26T09:26:02.631854 #2127198] INFO -- : make[2]: Leaving directory '/home/opc/ruby/build/master/ext/pty' I, [2024-05-26T09:26:02.645350 #2127198] INFO -- : make[2]: Entering directory '/home/opc/ruby/build/master/ext/ripper' I, [2024-05-26T09:26:02.653293 #2127198] INFO -- : make[2]: Leaving directory '/home/opc/ruby/build/master/ext/ripper' I, [2024-05-26T09:26:02.655380 #2127198] INFO -- : make[2]: Entering directory '/home/opc/ruby/build/master/ext/rubyvm' I, [2024-05-26T09:26:02.658700 #2127198] INFO -- : make[2]: Leaving directory '/home/opc/ruby/build/master/ext/rubyvm' I, [2024-05-26T09:26:02.670913 #2127198] INFO -- : make[2]: Entering directory '/home/opc/ruby/build/master/ext/socket' I, [2024-05-26T09:26:02.681620 #2127198] INFO -- : make[2]: Leaving directory '/home/opc/ruby/build/master/ext/socket' I, [2024-05-26T09:26:02.697095 #2127198] INFO -- : make[2]: Entering directory '/home/opc/ruby/build/master/.bundle/gems/bigdecimal-3.1.7/ext/bigdecimal' I, [2024-05-26T09:26:02.727352 #2127198] INFO -- : make[2]: Leaving directory '/home/opc/ruby/build/master/.bundle/gems/bigdecimal-3.1.7/ext/bigdecimal' I, [2024-05-26T09:26:02.729946 #2127198] INFO -- : make[2]: Entering directory '/home/opc/ruby/build/master/.bundle/gems/bigdecimal-3.1.8/ext/bigdecimal' I, [2024-05-26T09:26:02.759973 #2127198] INFO -- : make[2]: Leaving directory '/home/opc/ruby/build/master/.bundle/gems/bigdecimal-3.1.8/ext/bigdecimal' I, [2024-05-26T09:26:02.762678 #2127198] INFO -- : make[2]: Entering directory '/home/opc/ruby/build/master/.bundle/gems/debug-1.9.2/ext/debug' I, [2024-05-26T09:26:02.792880 #2127198] INFO -- : make[2]: Leaving directory '/home/opc/ruby/build/master/.bundle/gems/debug-1.9.2/ext/debug' I, [2024-05-26T09:26:02.795415 #2127198] INFO -- : make[2]: Entering directory '/home/opc/ruby/build/master/.bundle/gems/nkf-0.2.0/ext/nkf' I, [2024-05-26T09:26:02.825283 #2127198] INFO -- : make[2]: Leaving directory '/home/opc/ruby/build/master/.bundle/gems/nkf-0.2.0/ext/nkf' I, [2024-05-26T09:26:02.827823 #2127198] INFO -- : make[2]: Entering directory '/home/opc/ruby/build/master/.bundle/gems/racc-1.7.3/ext/racc/cparse' I, [2024-05-26T09:26:02.857909 #2127198] INFO -- : make[2]: Leaving directory '/home/opc/ruby/build/master/.bundle/gems/racc-1.7.3/ext/racc/cparse' I, [2024-05-26T09:26:02.860471 #2127198] INFO -- : make[2]: Entering directory '/home/opc/ruby/build/master/.bundle/gems/racc-1.8.0/ext/racc/cparse' I, [2024-05-26T09:26:02.891177 #2127198] INFO -- : make[2]: Leaving directory '/home/opc/ruby/build/master/.bundle/gems/racc-1.8.0/ext/racc/cparse' I, [2024-05-26T09:26:02.894157 #2127198] INFO -- : make[2]: Entering directory '/home/opc/ruby/build/master/.bundle/gems/rbs-3.4.4/ext/rbs_extension' I, [2024-05-26T09:26:02.924694 #2127198] INFO -- : make[2]: Leaving directory '/home/opc/ruby/build/master/.bundle/gems/rbs-3.4.4/ext/rbs_extension' I, [2024-05-26T09:26:02.927183 #2127198] INFO -- : make[2]: Entering directory '/home/opc/ruby/build/master/.bundle/gems/syslog-0.1.2/ext/syslog' I, [2024-05-26T09:26:02.957439 #2127198] INFO -- : make[2]: Leaving directory '/home/opc/ruby/build/master/.bundle/gems/syslog-0.1.2/ext/syslog' I, [2024-05-26T09:26:02.995829 #2127198] INFO -- : make[2]: Entering directory '/home/opc/ruby/build/master' I, [2024-05-26T09:26:03.079308 #2127198] INFO -- : make[2]: 'ruby' is up to date. I, [2024-05-26T09:26:03.079385 #2127198] INFO -- : make[2]: Leaving directory '/home/opc/ruby/build/master' I, [2024-05-26T09:26:03.079493 #2127198] INFO -- : make[1]: Leaving directory '/home/opc/ruby/build/master' I, [2024-05-26T09:26:03.083849 #2127198] INFO -- : make[1]: Entering directory '/home/opc/ruby/build/master' I, [2024-05-26T09:26:03.083882 #2127198] INFO -- : make[1]: Nothing to be done for 'note'. I, [2024-05-26T09:26:03.083893 #2127198] INFO -- : make[1]: Leaving directory '/home/opc/ruby/build/master' E, [2024-05-26T09:26:03.159937 #2127198] ERROR -- : $ /home/opc/ruby/build/master/miniruby -I/home/opc/ruby/src/master/lib /home/opc/ruby/src/master/tool/runruby.rb --archdir=/home/opc/ruby/build/master --extout=.ext -- /home/opc/ruby/src/master/spec/mspec/bin/mspec-run -B /home/opc/ruby/src/master/spec/default.mspec --error-output stderr --debug -fy -o /tmp/rubytest.x81vr9/1-mspec-multi-0 E, [2024-05-26T09:26:03.160246 #2127198] ERROR -- : $ /home/opc/ruby/build/master/miniruby -I/home/opc/ruby/src/master/lib /home/opc/ruby/src/master/tool/runruby.rb --archdir=/home/opc/ruby/build/master --extout=.ext -- /home/opc/ruby/src/master/spec/mspec/bin/mspec-run -B /home/opc/ruby/src/master/spec/default.mspec --error-output stderr --debug -fy -o /tmp/rubytest.x81vr9/2-mspec-multi-1 E, [2024-05-26T09:26:03.160562 #2127198] ERROR -- : $ /home/opc/ruby/build/master/miniruby -I/home/opc/ruby/src/master/lib /home/opc/ruby/src/master/tool/runruby.rb --archdir=/home/opc/ruby/build/master --extout=.ext -- /home/opc/ruby/src/master/spec/mspec/bin/mspec-run -B /home/opc/ruby/src/master/spec/default.mspec --error-output stderr --debug -fy -o /tmp/rubytest.x81vr9/3-mspec-multi-2 I, [2024-05-26T09:26:03.290430 #2127198] INFO -- : ruby 3.4.0dev (2024-05-26T08:28:25Z master 508f331048) [aarch64-linux] I, [2024-05-26T09:26:08.689280 #2127198] INFO -- : 0 ......................................................................... I, [2024-05-26T09:26:11.043109 #2127198] INFO -- : 73 ......................................................................... I, [2024-05-26T09:26:11.226577 #2127198] INFO -- : 146 ......................................................................... I, [2024-05-26T09:26:11.584558 #2127198] INFO -- : 219 ......................................................................... I, [2024-05-26T09:26:11.750621 #2127198] INFO -- : 292 ......................................................................... I, [2024-05-26T09:26:11.983800 #2127198] INFO -- : 365 ......................................................................... I, [2024-05-26T09:26:12.103436 #2127198] INFO -- : 438 ......................................................................... I, [2024-05-26T09:26:12.161394 #2127198] INFO -- : 511 ......................................................................... I, [2024-05-26T09:26:12.220480 #2127198] INFO -- : 584 ......................................................................... I, [2024-05-26T09:26:12.830093 #2127198] INFO -- : 657 ......................................................................... I, [2024-05-26T09:26:12.943719 #2127198] INFO -- : 730 ......................................................................... I, [2024-05-26T09:26:12.994030 #2127198] INFO -- : 803 ......................................................................... I, [2024-05-26T09:26:13.197079 #2127198] INFO -- : 876 ......................................................................... I, [2024-05-26T09:26:13.301648 #2127198] INFO -- : 949 ......................................................................... I, [2024-05-26T09:26:13.914920 #2127198] INFO -- : 1022 ......................................................................... I, [2024-05-26T09:26:16.208585 #2127198] INFO -- : 1095 ......................................................................... I, [2024-05-26T09:26:17.070294 #2127198] INFO -- : 1168 ......................................................................... I, [2024-05-26T09:26:17.212807 #2127198] INFO -- : 1241 ......................................................................... I, [2024-05-26T09:26:17.444167 #2127198] INFO -- : 1314 ......................................................................... I, [2024-05-26T09:26:17.539950 #2127198] INFO -- : 1387 ......................................................................... I, [2024-05-26T09:26:19.501950 #2127198] INFO -- : 1460 ......................................................................... I, [2024-05-26T09:26:22.847058 #2127198] INFO -- : 1533 ......................................................................... I, [2024-05-26T09:26:23.010084 #2127198] INFO -- : 1606 ......................................................................... I, [2024-05-26T09:26:23.800343 #2127198] INFO -- : 1679 ......................................................................... I, [2024-05-26T09:26:24.051109 #2127198] INFO -- : 1752 ......................................................................... I, [2024-05-26T09:26:24.305283 #2127198] INFO -- : 1825 ......................................................................... I, [2024-05-26T09:26:24.641696 #2127198] INFO -- : 1898 ......................................................................... I, [2024-05-26T09:26:25.043245 #2127198] INFO -- : 1971 ......................................................................... I, [2024-05-26T09:26:25.552044 #2127198] INFO -- : 2044 ......................................................................... I, [2024-05-26T09:26:25.662074 #2127198] INFO -- : 2117 ......................................................................... I, [2024-05-26T09:26:25.722813 #2127198] INFO -- : 2190 ......................................................................... I, [2024-05-26T09:26:25.773052 #2127198] INFO -- : 2263 ......................................................................... I, [2024-05-26T09:26:25.821603 #2127198] INFO -- : 2336 ......................................................................... I, [2024-05-26T09:26:25.913479 #2127198] INFO -- : 2409 ......................................................................... I, [2024-05-26T09:26:26.181545 #2127198] INFO -- : 2482 ......................................................................... I, [2024-05-26T09:26:26.321363 #2127198] INFO -- : 2555 ......................................................................... I, [2024-05-26T09:26:27.619565 #2127198] INFO -- : 2628 ......................................................................... I, [2024-05-26T09:26:27.775854 #2127198] INFO -- : 2701 ......................................................................... I, [2024-05-26T09:26:27.936910 #2127198] INFO -- : 2774 ......................................................................... I, [2024-05-26T09:26:28.261474 #2127198] INFO -- : 2847 ......................................................................... I, [2024-05-26T09:26:28.518481 #2127198] INFO -- : 2920 ......................................................................... I, [2024-05-26T09:26:28.619871 #2127198] INFO -- : 2993 ......................................................................... I, [2024-05-26T09:26:28.700971 #2127198] INFO -- : 3066 ......................................................................... I, [2024-05-26T09:26:28.753864 #2127198] INFO -- : 3139 ......................................................................... I, [2024-05-26T09:26:28.815861 #2127198] INFO -- : 3212 ......................................................................... I, [2024-05-26T09:26:28.889926 #2127198] INFO -- : 3285 ......................................................................... I, [2024-05-26T09:26:32.706019 #2127198] INFO -- : 3358 ......................................................................... I, [2024-05-26T09:26:32.728404 #2127198] INFO -- : I, [2024-05-26T09:26:32.728464 #2127198] INFO -- : I, [2024-05-26T09:26:32.728475 #2127198] INFO -- : Finished in 29.568425 seconds I, [2024-05-26T09:26:32.728485 #2127198] INFO -- : I, [2024-05-26T09:26:32.728519 #2127198] INFO -- : 3430 files, 32648 examples, 184356 expectations, 0 failures, 0 errors, 0 tagged I, [2024-05-26T09:26:32.729938 #2127198] INFO -- : $$$[end] "make yes-test-rubyspec MSPECOPT='--error-output stderr --debug -j' TESTS='-j3'" exit with 0.