# Logfile created on 2024-05-26 00:53:32 +0000 by logger.rb/v1.5.3 I, [2024-05-26T00:53:32.335740 #463473] INFO -- : #, @formatter=nil, @logdev=#, @binmode=false, @mon_data=#, @mon_data_owner_object_id=860>>> I, [2024-05-26T00:53:32.336035 #463473] INFO -- : $$$[beg] make update-unicode -j3 I, [2024-05-26T00:53:32.424019 #463473] INFO -- : Downloading Unicode emoji 15.0 files... I, [2024-05-26T00:53:32.424085 #463473] INFO -- : Downloading Unicode emoji 15.0 files... I, [2024-05-26T00:53:32.424562 #463473] INFO -- : Downloading Unicode emoji 15.0 files... I, [2024-05-26T00:53:32.500849 #463473] INFO -- : made symlink emoji/15.0/emoji-sequences.txt to /home/opc/ruby/src/master/.downloaded-cache/emoji/15.0/emoji-sequences.txt I, [2024-05-26T00:53:32.501023 #463473] INFO -- : downloading emoji/15.0/emoji-test.txt ... /home/opc/ruby/src/master/enc/unicode/data/emoji/15.0/emoji-sequences.txt already exists I, [2024-05-26T00:53:32.504811 #463473] INFO -- : downloading emoji/15.0/emoji-test.txt ... /home/opc/ruby/src/master/enc/unicode/data/emoji/15.0/emoji-sequences.txt already exists E, [2024-05-26T00:53:32.962220 #463473] ERROR -- : /home/opc/ruby/src/master/tool/downloader.rb:302:in `rescue in download': failed to download emoji/15.0/emoji-test.txt (RuntimeError) E, [2024-05-26T00:53:32.962289 #463473] ERROR -- : OpenURI::HTTPError: 403 Forbidden: https://www.unicode.org/Public/emoji/15.0/emoji-test.txt E, [2024-05-26T00:53:32.962300 #463473] ERROR -- : from /home/opc/ruby/src/master/tool/downloader.rb:201:in `download' E, [2024-05-26T00:53:32.962310 #463473] ERROR -- : from /home/opc/ruby/src/master/tool/downloader.rb:136:in `download' E, [2024-05-26T00:53:32.962319 #463473] ERROR -- : from /home/opc/ruby/src/master/tool/downloader.rb:482:in `block in
' E, [2024-05-26T00:53:32.962327 #463473] ERROR -- : from /home/opc/ruby/src/master/tool/downloader.rb:465:in `each' E, [2024-05-26T00:53:32.962335 #463473] ERROR -- : from /home/opc/ruby/src/master/tool/downloader.rb:465:in `
' E, [2024-05-26T00:53:32.962343 #463473] ERROR -- : /usr/local/lib/ruby/3.2.0/open-uri.rb:369:in `open_http': 403 Forbidden (OpenURI::HTTPError) E, [2024-05-26T00:53:32.962352 #463473] ERROR -- : from /usr/local/lib/ruby/3.2.0/open-uri.rb:760:in `buffer_open' E, [2024-05-26T00:53:32.962360 #463473] ERROR -- : from /usr/local/lib/ruby/3.2.0/open-uri.rb:214:in `block in open_loop' E, [2024-05-26T00:53:32.962368 #463473] ERROR -- : from /usr/local/lib/ruby/3.2.0/open-uri.rb:212:in `catch' E, [2024-05-26T00:53:32.962376 #463473] ERROR -- : from /usr/local/lib/ruby/3.2.0/open-uri.rb:212:in `open_loop' E, [2024-05-26T00:53:32.962384 #463473] ERROR -- : from /usr/local/lib/ruby/3.2.0/open-uri.rb:153:in `open_uri' E, [2024-05-26T00:53:32.962392 #463473] ERROR -- : from /usr/local/lib/ruby/3.2.0/open-uri.rb:740:in `open' E, [2024-05-26T00:53:32.962404 #463473] ERROR -- : from /usr/local/lib/ruby/3.2.0/open-uri.rb:748:in `read' E, [2024-05-26T00:53:32.962412 #463473] ERROR -- : from /home/opc/ruby/src/master/tool/downloader.rb:247:in `block in download' E, [2024-05-26T00:53:32.962421 #463473] ERROR -- : from /home/opc/ruby/src/master/tool/downloader.rb:378:in `with_retry' E, [2024-05-26T00:53:32.962429 #463473] ERROR -- : from /home/opc/ruby/src/master/tool/downloader.rb:246:in `download' E, [2024-05-26T00:53:32.962437 #463473] ERROR -- : from /home/opc/ruby/src/master/tool/downloader.rb:136:in `download' E, [2024-05-26T00:53:32.962445 #463473] ERROR -- : from /home/opc/ruby/src/master/tool/downloader.rb:482:in `block in
' E, [2024-05-26T00:53:32.962454 #463473] ERROR -- : from /home/opc/ruby/src/master/tool/downloader.rb:465:in `each' E, [2024-05-26T00:53:32.962461 #463473] ERROR -- : from /home/opc/ruby/src/master/tool/downloader.rb:465:in `
' E, [2024-05-26T00:53:32.965134 #463473] ERROR -- : make: *** [uncommon.mk:1756: /home/opc/ruby/src/master/enc/unicode/data/emoji/15.0/emoji-test.txt] Error 1 E, [2024-05-26T00:53:32.965180 #463473] ERROR -- : make: *** Waiting for unfinished jobs.... E, [2024-05-26T00:53:32.976712 #463473] ERROR -- : /home/opc/ruby/src/master/tool/downloader.rb:302:in `rescue in download': failed to download emoji/15.0/emoji-test.txt (RuntimeError) E, [2024-05-26T00:53:32.976738 #463473] ERROR -- : OpenURI::HTTPError: 403 Forbidden: https://www.unicode.org/Public/emoji/15.0/emoji-test.txt E, [2024-05-26T00:53:32.976748 #463473] ERROR -- : from /home/opc/ruby/src/master/tool/downloader.rb:201:in `download' E, [2024-05-26T00:53:32.976756 #463473] ERROR -- : from /home/opc/ruby/src/master/tool/downloader.rb:136:in `download' E, [2024-05-26T00:53:32.976764 #463473] ERROR -- : from /home/opc/ruby/src/master/tool/downloader.rb:482:in `block in
' E, [2024-05-26T00:53:32.976772 #463473] ERROR -- : from /home/opc/ruby/src/master/tool/downloader.rb:465:in `each' E, [2024-05-26T00:53:32.976780 #463473] ERROR -- : from /home/opc/ruby/src/master/tool/downloader.rb:465:in `
' E, [2024-05-26T00:53:32.976788 #463473] ERROR -- : /usr/local/lib/ruby/3.2.0/open-uri.rb:369:in `open_http': 403 Forbidden (OpenURI::HTTPError) E, [2024-05-26T00:53:32.976796 #463473] ERROR -- : from /usr/local/lib/ruby/3.2.0/open-uri.rb:760:in `buffer_open' E, [2024-05-26T00:53:32.976804 #463473] ERROR -- : from /usr/local/lib/ruby/3.2.0/open-uri.rb:214:in `block in open_loop' E, [2024-05-26T00:53:32.976812 #463473] ERROR -- : from /usr/local/lib/ruby/3.2.0/open-uri.rb:212:in `catch' E, [2024-05-26T00:53:32.976820 #463473] ERROR -- : from /usr/local/lib/ruby/3.2.0/open-uri.rb:212:in `open_loop' E, [2024-05-26T00:53:32.976828 #463473] ERROR -- : from /usr/local/lib/ruby/3.2.0/open-uri.rb:153:in `open_uri' E, [2024-05-26T00:53:32.976836 #463473] ERROR -- : from /usr/local/lib/ruby/3.2.0/open-uri.rb:740:in `open' E, [2024-05-26T00:53:32.976844 #463473] ERROR -- : from /usr/local/lib/ruby/3.2.0/open-uri.rb:748:in `read' E, [2024-05-26T00:53:32.976852 #463473] ERROR -- : from /home/opc/ruby/src/master/tool/downloader.rb:247:in `block in download' E, [2024-05-26T00:53:32.976860 #463473] ERROR -- : from /home/opc/ruby/src/master/tool/downloader.rb:378:in `with_retry' E, [2024-05-26T00:53:32.976868 #463473] ERROR -- : from /home/opc/ruby/src/master/tool/downloader.rb:246:in `download' E, [2024-05-26T00:53:32.976876 #463473] ERROR -- : from /home/opc/ruby/src/master/tool/downloader.rb:136:in `download' E, [2024-05-26T00:53:32.976884 #463473] ERROR -- : from /home/opc/ruby/src/master/tool/downloader.rb:482:in `block in
' E, [2024-05-26T00:53:32.976892 #463473] ERROR -- : from /home/opc/ruby/src/master/tool/downloader.rb:465:in `each' E, [2024-05-26T00:53:32.976900 #463473] ERROR -- : from /home/opc/ruby/src/master/tool/downloader.rb:465:in `
' E, [2024-05-26T00:53:32.979744 #463473] ERROR -- : make: *** [uncommon.mk:1756: /home/opc/ruby/src/master/enc/unicode/data/emoji/15.0/emoji-sequences.txt] Error 1 E, [2024-05-26T00:53:32.979791 #463473] ERROR -- : make: *** Deleting file '/home/opc/ruby/src/master/enc/unicode/data/emoji/15.0/emoji-sequences.txt' E, [2024-05-26T00:53:33.032324 #463473] ERROR -- : /home/opc/ruby/src/master/tool/downloader.rb:302:in `rescue in download': failed to download emoji/15.0/emoji-test.txt (RuntimeError) E, [2024-05-26T00:53:33.032385 #463473] ERROR -- : OpenURI::HTTPError: 403 Forbidden: https://www.unicode.org/Public/emoji/15.0/emoji-test.txt E, [2024-05-26T00:53:33.032395 #463473] ERROR -- : from /home/opc/ruby/src/master/tool/downloader.rb:201:in `download' E, [2024-05-26T00:53:33.032404 #463473] ERROR -- : from /home/opc/ruby/src/master/tool/downloader.rb:136:in `download' E, [2024-05-26T00:53:33.032413 #463473] ERROR -- : from /home/opc/ruby/src/master/tool/downloader.rb:482:in `block in
' E, [2024-05-26T00:53:33.032421 #463473] ERROR -- : from /home/opc/ruby/src/master/tool/downloader.rb:465:in `each' E, [2024-05-26T00:53:33.032429 #463473] ERROR -- : from /home/opc/ruby/src/master/tool/downloader.rb:465:in `
' E, [2024-05-26T00:53:33.032436 #463473] ERROR -- : /usr/local/lib/ruby/3.2.0/open-uri.rb:369:in `open_http': 403 Forbidden (OpenURI::HTTPError) E, [2024-05-26T00:53:33.032444 #463473] ERROR -- : from /usr/local/lib/ruby/3.2.0/open-uri.rb:760:in `buffer_open' E, [2024-05-26T00:53:33.032452 #463473] ERROR -- : from /usr/local/lib/ruby/3.2.0/open-uri.rb:214:in `block in open_loop' E, [2024-05-26T00:53:33.032461 #463473] ERROR -- : from /usr/local/lib/ruby/3.2.0/open-uri.rb:212:in `catch' E, [2024-05-26T00:53:33.032469 #463473] ERROR -- : from /usr/local/lib/ruby/3.2.0/open-uri.rb:212:in `open_loop' E, [2024-05-26T00:53:33.032476 #463473] ERROR -- : from /usr/local/lib/ruby/3.2.0/open-uri.rb:153:in `open_uri' E, [2024-05-26T00:53:33.032484 #463473] ERROR -- : from /usr/local/lib/ruby/3.2.0/open-uri.rb:740:in `open' E, [2024-05-26T00:53:33.032520 #463473] ERROR -- : from /usr/local/lib/ruby/3.2.0/open-uri.rb:748:in `read' E, [2024-05-26T00:53:33.032529 #463473] ERROR -- : from /home/opc/ruby/src/master/tool/downloader.rb:247:in `block in download' E, [2024-05-26T00:53:33.032538 #463473] ERROR -- : from /home/opc/ruby/src/master/tool/downloader.rb:378:in `with_retry' E, [2024-05-26T00:53:33.032546 #463473] ERROR -- : from /home/opc/ruby/src/master/tool/downloader.rb:246:in `download' E, [2024-05-26T00:53:33.032555 #463473] ERROR -- : from /home/opc/ruby/src/master/tool/downloader.rb:136:in `download' E, [2024-05-26T00:53:33.032563 #463473] ERROR -- : from /home/opc/ruby/src/master/tool/downloader.rb:482:in `block in
' E, [2024-05-26T00:53:33.032571 #463473] ERROR -- : from /home/opc/ruby/src/master/tool/downloader.rb:465:in `each' E, [2024-05-26T00:53:33.032579 #463473] ERROR -- : from /home/opc/ruby/src/master/tool/downloader.rb:465:in `
' E, [2024-05-26T00:53:33.035367 #463473] ERROR -- : make: *** [uncommon.mk:1756: /home/opc/ruby/src/master/enc/unicode/data/emoji/15.0/emoji-zwj-sequences.txt] Error 1 I, [2024-05-26T00:53:33.035476 #463473] INFO -- : downloading emoji/15.0/emoji-test.txt ... I, [2024-05-26T00:53:33.035599 #463473] INFO -- : $$$[end] "make update-unicode -j3" exit with 512. I, [2024-05-26T00:53:33.035632 #463473] INFO -- : $$$[beg] make update-download -j3 I, [2024-05-26T00:53:33.200968 #463473] INFO -- : tool/config.guess already exists I, [2024-05-26T00:53:33.201033 #463473] INFO -- : tool/config.sub already exists I, [2024-05-26T00:53:33.203845 #463473] INFO -- : Update power_assert to 84e85124c5014a139af39161d484156cfe87a9ed I, [2024-05-26T00:53:33.203968 #463473] INFO -- : Update rbs to ba7872795d5de04adb8ff500c0e6afdc81a041dd I, [2024-05-26T00:53:33.204232 #463473] INFO -- : Update typeprof to b19a6416da3a05d57fadd6ffdadb382b6d236ca5 I, [2024-05-26T00:53:33.207166 #463473] INFO -- : echo 84e85124c5014a139af39161d484156cfe87a9ed | /bin/sh /home/opc/ruby/src/master/tool/ifchange /home/opc/ruby/src/master/.bundle/.timestamp/power_assert.revision - I, [2024-05-26T00:53:33.207345 #463473] INFO -- : echo ba7872795d5de04adb8ff500c0e6afdc81a041dd | /bin/sh /home/opc/ruby/src/master/tool/ifchange /home/opc/ruby/src/master/.bundle/.timestamp/rbs.revision - I, [2024-05-26T00:53:33.207552 #463473] INFO -- : echo b19a6416da3a05d57fadd6ffdadb382b6d236ca5 | /bin/sh /home/opc/ruby/src/master/tool/ifchange /home/opc/ruby/src/master/.bundle/.timestamp/typeprof.revision - I, [2024-05-26T00:53:33.213652 #463473] INFO -- : /home/opc/ruby/src/master/.bundle/.timestamp/rbs.revision unchanged I, [2024-05-26T00:53:33.213926 #463473] INFO -- : /home/opc/ruby/src/master/.bundle/.timestamp/power_assert.revision unchanged I, [2024-05-26T00:53:33.214120 #463473] INFO -- : /home/opc/ruby/src/master/.bundle/.timestamp/typeprof.revision unchanged I, [2024-05-26T00:53:33.304596 #463473] INFO -- : Building power_assert@84e85124c5014a139af39161d484156cfe87a9ed to /home/opc/ruby/src/master/gems/power_assert-2.0.3.gem I, [2024-05-26T00:53:33.415419 #463473] INFO -- : Successfully built RubyGem I, [2024-05-26T00:53:33.415480 #463473] INFO -- : Name: power_assert I, [2024-05-26T00:53:33.415491 #463473] INFO -- : Version: 2.0.4dev I, [2024-05-26T00:53:33.415500 #463473] INFO -- : File: power_assert-2.0.4dev.gem I, [2024-05-26T00:53:33.499247 #463473] INFO -- : $$$[end] "make update-download -j3" exit with 0. I, [2024-05-26T00:53:33.499315 #463473] INFO -- : $$$[beg] make update-rubyspec -j3 I, [2024-05-26T00:53:33.590108 #463473] INFO -- : make: Nothing to be done for 'update-rubyspec'. I, [2024-05-26T00:53:33.590237 #463473] INFO -- : $$$[end] "make update-rubyspec -j3" exit with 0. I, [2024-05-26T00:53:33.590262 #463473] INFO -- : $$$[beg] make update-src -j3 I, [2024-05-26T00:53:34.555894 #463473] INFO -- : Already up to date. I, [2024-05-26T00:53:34.570662 #463473] INFO -- : Latest commit hash = d2c4363e0c I, [2024-05-26T00:53:34.571260 #463473] INFO -- : $$$[end] "make update-src -j3" exit with 0. I, [2024-05-26T00:53:34.571304 #463473] INFO -- : $$$[beg] make after-update -j3 I, [2024-05-26T00:53:34.675302 #463473] INFO -- : generating /home/opc/ruby/src/master/ext/ripper/eventids2table.c I, [2024-05-26T00:53:34.681858 #463473] INFO -- : make[1]: Entering directory '/home/opc/ruby/src/master/ext/ripper' I, [2024-05-26T00:53:34.681905 #463473] INFO -- : make[1]: Nothing to be done for 'src'. I, [2024-05-26T00:53:34.681919 #463473] INFO -- : make[1]: Leaving directory '/home/opc/ruby/src/master/ext/ripper' I, [2024-05-26T00:53:34.709422 #463473] INFO -- : /home/opc/ruby/src/master/revision.h updated I, [2024-05-26T00:53:34.710580 #463473] INFO -- : generating aarch64-linux-fake.rb I, [2024-05-26T00:53:34.767560 #463473] INFO -- : aarch64-linux-fake.rb updated I, [2024-05-26T00:53:34.769039 #463473] INFO -- : generating enc.mk I, [2024-05-26T00:53:35.005175 #463473] INFO -- : making srcs under enc I, [2024-05-26T00:53:35.047145 #463473] INFO -- : make[1]: Entering directory '/home/opc/ruby/build/master' I, [2024-05-26T00:53:35.047203 #463473] INFO -- : make[1]: Nothing to be done for 'srcs'. I, [2024-05-26T00:53:35.047214 #463473] INFO -- : make[1]: Leaving directory '/home/opc/ruby/build/master' I, [2024-05-26T00:53:35.129676 #463473] INFO -- : Update power_assert to 84e85124c5014a139af39161d484156cfe87a9ed I, [2024-05-26T00:53:35.129742 #463473] INFO -- : Update rbs to ba7872795d5de04adb8ff500c0e6afdc81a041dd I, [2024-05-26T00:53:35.130772 #463473] INFO -- : Update typeprof to b19a6416da3a05d57fadd6ffdadb382b6d236ca5 I, [2024-05-26T00:53:35.133514 #463473] INFO -- : echo 84e85124c5014a139af39161d484156cfe87a9ed | /bin/sh /home/opc/ruby/src/master/tool/ifchange /home/opc/ruby/src/master/.bundle/.timestamp/power_assert.revision - I, [2024-05-26T00:53:35.133715 #463473] INFO -- : echo ba7872795d5de04adb8ff500c0e6afdc81a041dd | /bin/sh /home/opc/ruby/src/master/tool/ifchange /home/opc/ruby/src/master/.bundle/.timestamp/rbs.revision - I, [2024-05-26T00:53:35.134044 #463473] INFO -- : echo b19a6416da3a05d57fadd6ffdadb382b6d236ca5 | /bin/sh /home/opc/ruby/src/master/tool/ifchange /home/opc/ruby/src/master/.bundle/.timestamp/typeprof.revision - I, [2024-05-26T00:53:35.139582 #463473] INFO -- : /home/opc/ruby/src/master/.bundle/.timestamp/rbs.revision unchanged I, [2024-05-26T00:53:35.139633 #463473] INFO -- : /home/opc/ruby/src/master/.bundle/.timestamp/power_assert.revision unchanged I, [2024-05-26T00:53:35.141265 #463473] INFO -- : /home/opc/ruby/src/master/.bundle/.timestamp/typeprof.revision unchanged I, [2024-05-26T00:53:35.229366 #463473] INFO -- : Building power_assert@84e85124c5014a139af39161d484156cfe87a9ed to /home/opc/ruby/src/master/gems/power_assert-2.0.3.gem I, [2024-05-26T00:53:35.339501 #463473] INFO -- : Successfully built RubyGem I, [2024-05-26T00:53:35.339557 #463473] INFO -- : Name: power_assert I, [2024-05-26T00:53:35.339568 #463473] INFO -- : Version: 2.0.4dev I, [2024-05-26T00:53:35.339577 #463473] INFO -- : File: power_assert-2.0.4dev.gem I, [2024-05-26T00:53:35.341849 #463473] INFO -- : Extracting bundle gem power_assert-2.0.3... I, [2024-05-26T00:53:35.437800 #463473] INFO -- : Try with hash version of bundled gems instead of gems/power_assert-2.0.3.gem. We don't use this gem with release version of Ruby. I, [2024-05-26T00:53:35.447691 #463473] INFO -- : Unpacked gems/power_assert-2.0.4dev.gem I, [2024-05-26T00:53:35.449680 #463473] INFO -- : $$$[end] "make after-update -j3" exit with 0. I, [2024-05-26T00:53:35.449825 #463473] INFO -- : $$$[beg] make miniruby -j3 I, [2024-05-26T00:53:35.539700 #463473] INFO -- : BASERUBY = /usr/local/bin/ruby --disable=gems I, [2024-05-26T00:53:35.539764 #463473] INFO -- : CC = gcc I, [2024-05-26T00:53:35.539774 #463473] INFO -- : LD = ld I, [2024-05-26T00:53:35.539799 #463473] INFO -- : LDSHARED = gcc -shared I, [2024-05-26T00:53:35.539812 #463473] INFO -- : CFLAGS = -O3 -fno-fast-math -ggdb3 -Wall -Wextra -Wdeprecated-declarations -Wdiv-by-zero -Wduplicated-cond -Wimplicit-function-declaration -Wimplicit-int -Wpointer-arith -Wwrite-strings -Wold-style-definition -Wimplicit-fallthrough=0 -Wmissing-noreturn -Wno-cast-function-type -Wno-constant-logical-operand -Wno-long-long -Wno-missing-field-initializers -Wno-overlength-strings -Wno-packed-bitfield-compat -Wno-parentheses-equality -Wno-self-assign -Wno-tautological-compare -Wno-unused-parameter -Wno-unused-value -Wsuggest-attribute=format -Wsuggest-attribute=noreturn -Wunused-variable -Wmisleading-indentation -Wundef I, [2024-05-26T00:53:35.539822 #463473] INFO -- : XCFLAGS = -U_FORTIFY_SOURCE -D_FORTIFY_SOURCE=2 -fstack-protector-strong -msign-return-address=all -fno-strict-overflow -fvisibility=hidden -fexcess-precision=standard -DRUBY_EXPORT -fPIE -I. -I.ext/include/aarch64-linux -I/home/opc/ruby/src/master/include -I/home/opc/ruby/src/master -I/home/opc/ruby/src/master/prism -I/home/opc/ruby/src/master/enc/unicode/15.0.0 I, [2024-05-26T00:53:35.539832 #463473] INFO -- : CPPFLAGS = I, [2024-05-26T00:53:35.539840 #463473] INFO -- : DLDFLAGS = -Wl,--compress-debug-sections=zlib -fstack-protector-strong -pie I, [2024-05-26T00:53:35.539848 #463473] INFO -- : SOLIBS = -lz -lrt -lrt -ldl -lcrypt -lm -lpthread I, [2024-05-26T00:53:35.539857 #463473] INFO -- : LANG = en_US.UTF-8 I, [2024-05-26T00:53:35.539865 #463473] INFO -- : LC_ALL = I, [2024-05-26T00:53:35.539873 #463473] INFO -- : LC_CTYPE = I, [2024-05-26T00:53:35.539881 #463473] INFO -- : MFLAGS = -j3 --jobserver-auth=4,5 I, [2024-05-26T00:53:35.539889 #463473] INFO -- : RUSTC = rustc I, [2024-05-26T00:53:35.539897 #463473] INFO -- : YJIT_RUSTC_ARGS = --crate-name=yjit --crate-type=staticlib --edition=2021 -g -C lto=thin -C opt-level=3 -C overflow-checks=on '--out-dir=/home/opc/ruby/build/master/yjit/target/release/' /home/opc/ruby/src/master/yjit/src/lib.rs I, [2024-05-26T00:53:35.540658 #463473] INFO -- : gcc (GCC) 8.5.0 20210514 (Red Hat 8.5.0-10.1.0.1) I, [2024-05-26T00:53:35.540697 #463473] INFO -- : Copyright (C) 2018 Free Software Foundation, Inc. I, [2024-05-26T00:53:35.540708 #463473] INFO -- : This is free software; see the source for copying conditions. There is NO I, [2024-05-26T00:53:35.540721 #463473] INFO -- : warranty; not even for MERCHANTABILITY or FITNESS FOR A PARTICULAR PURPOSE. I, [2024-05-26T00:53:35.540730 #463473] INFO -- : I, [2024-05-26T00:53:35.566145 #463473] INFO -- : compiling /home/opc/ruby/src/master/version.c I, [2024-05-26T00:53:35.714278 #463473] INFO -- : linking miniruby I, [2024-05-26T00:53:36.613641 #463473] INFO -- : $$$[end] "make miniruby -j3" exit with 0. I, [2024-05-26T00:53:36.613832 #463473] INFO -- : $$$[beg] make ruby -j3 I, [2024-05-26T00:53:36.703175 #463473] INFO -- : BASERUBY = /usr/local/bin/ruby --disable=gems I, [2024-05-26T00:53:36.703239 #463473] INFO -- : CC = gcc I, [2024-05-26T00:53:36.703249 #463473] INFO -- : LD = ld I, [2024-05-26T00:53:36.703260 #463473] INFO -- : LDSHARED = gcc -shared I, [2024-05-26T00:53:36.703269 #463473] INFO -- : CFLAGS = -O3 -fno-fast-math -ggdb3 -Wall -Wextra -Wdeprecated-declarations -Wdiv-by-zero -Wduplicated-cond -Wimplicit-function-declaration -Wimplicit-int -Wpointer-arith -Wwrite-strings -Wold-style-definition -Wimplicit-fallthrough=0 -Wmissing-noreturn -Wno-cast-function-type -Wno-constant-logical-operand -Wno-long-long -Wno-missing-field-initializers -Wno-overlength-strings -Wno-packed-bitfield-compat -Wno-parentheses-equality -Wno-self-assign -Wno-tautological-compare -Wno-unused-parameter -Wno-unused-value -Wsuggest-attribute=format -Wsuggest-attribute=noreturn -Wunused-variable -Wmisleading-indentation -Wundef I, [2024-05-26T00:53:36.703279 #463473] INFO -- : XCFLAGS = -U_FORTIFY_SOURCE -D_FORTIFY_SOURCE=2 -fstack-protector-strong -msign-return-address=all -fno-strict-overflow -fvisibility=hidden -fexcess-precision=standard -DRUBY_EXPORT -fPIE -I. -I.ext/include/aarch64-linux -I/home/opc/ruby/src/master/include -I/home/opc/ruby/src/master -I/home/opc/ruby/src/master/prism -I/home/opc/ruby/src/master/enc/unicode/15.0.0 I, [2024-05-26T00:53:36.703288 #463473] INFO -- : CPPFLAGS = I, [2024-05-26T00:53:36.703296 #463473] INFO -- : DLDFLAGS = -Wl,--compress-debug-sections=zlib -fstack-protector-strong -pie I, [2024-05-26T00:53:36.703304 #463473] INFO -- : SOLIBS = -lz -lrt -lrt -ldl -lcrypt -lm -lpthread I, [2024-05-26T00:53:36.703312 #463473] INFO -- : LANG = en_US.UTF-8 I, [2024-05-26T00:53:36.703320 #463473] INFO -- : LC_ALL = I, [2024-05-26T00:53:36.703328 #463473] INFO -- : LC_CTYPE = I, [2024-05-26T00:53:36.703336 #463473] INFO -- : MFLAGS = -j3 --jobserver-auth=4,5 I, [2024-05-26T00:53:36.703344 #463473] INFO -- : RUSTC = rustc I, [2024-05-26T00:53:36.703352 #463473] INFO -- : YJIT_RUSTC_ARGS = --crate-name=yjit --crate-type=staticlib --edition=2021 -g -C lto=thin -C opt-level=3 -C overflow-checks=on '--out-dir=/home/opc/ruby/build/master/yjit/target/release/' /home/opc/ruby/src/master/yjit/src/lib.rs I, [2024-05-26T00:53:36.704078 #463473] INFO -- : gcc (GCC) 8.5.0 20210514 (Red Hat 8.5.0-10.1.0.1) I, [2024-05-26T00:53:36.704111 #463473] INFO -- : Copyright (C) 2018 Free Software Foundation, Inc. I, [2024-05-26T00:53:36.704121 #463473] INFO -- : This is free software; see the source for copying conditions. There is NO I, [2024-05-26T00:53:36.704131 #463473] INFO -- : warranty; not even for MERCHANTABILITY or FITNESS FOR A PARTICULAR PURPOSE. I, [2024-05-26T00:53:36.704139 #463473] INFO -- : I, [2024-05-26T00:53:36.885786 #463473] INFO -- : builtin_binary.inc updated I, [2024-05-26T00:53:36.889047 #463473] INFO -- : c86294a81d0df6836359a6b5498b71b1ddba3062aa6ec87c7b2896368a948a19 builtin_binary.inc I, [2024-05-26T00:53:36.890113 #463473] INFO -- : compiling /home/opc/ruby/src/master/builtin.c I, [2024-05-26T00:53:37.219549 #463473] INFO -- : linking static-library libruby-static.a I, [2024-05-26T00:53:40.000918 #463473] INFO -- : linking ruby I, [2024-05-26T00:53:40.935584 #463473] INFO -- : $$$[end] "make ruby -j3" exit with 0. I, [2024-05-26T00:53:40.935751 #463473] INFO -- : $$$[beg] make all -j3 I, [2024-05-26T00:53:41.024578 #463473] INFO -- : BASERUBY = /usr/local/bin/ruby --disable=gems I, [2024-05-26T00:53:41.024645 #463473] INFO -- : CC = gcc I, [2024-05-26T00:53:41.024656 #463473] INFO -- : LD = ld I, [2024-05-26T00:53:41.024664 #463473] INFO -- : LDSHARED = gcc -shared I, [2024-05-26T00:53:41.024673 #463473] INFO -- : CFLAGS = -O3 -fno-fast-math -ggdb3 -Wall -Wextra -Wdeprecated-declarations -Wdiv-by-zero -Wduplicated-cond -Wimplicit-function-declaration -Wimplicit-int -Wpointer-arith -Wwrite-strings -Wold-style-definition -Wimplicit-fallthrough=0 -Wmissing-noreturn -Wno-cast-function-type -Wno-constant-logical-operand -Wno-long-long -Wno-missing-field-initializers -Wno-overlength-strings -Wno-packed-bitfield-compat -Wno-parentheses-equality -Wno-self-assign -Wno-tautological-compare -Wno-unused-parameter -Wno-unused-value -Wsuggest-attribute=format -Wsuggest-attribute=noreturn -Wunused-variable -Wmisleading-indentation -Wundef I, [2024-05-26T00:53:41.024684 #463473] INFO -- : XCFLAGS = -U_FORTIFY_SOURCE -D_FORTIFY_SOURCE=2 -fstack-protector-strong -msign-return-address=all -fno-strict-overflow -fvisibility=hidden -fexcess-precision=standard -DRUBY_EXPORT -fPIE -I. -I.ext/include/aarch64-linux -I/home/opc/ruby/src/master/include -I/home/opc/ruby/src/master -I/home/opc/ruby/src/master/prism -I/home/opc/ruby/src/master/enc/unicode/15.0.0 I, [2024-05-26T00:53:41.024693 #463473] INFO -- : CPPFLAGS = I, [2024-05-26T00:53:41.024701 #463473] INFO -- : DLDFLAGS = -Wl,--compress-debug-sections=zlib -fstack-protector-strong -pie I, [2024-05-26T00:53:41.024710 #463473] INFO -- : SOLIBS = -lz -lrt -lrt -ldl -lcrypt -lm -lpthread I, [2024-05-26T00:53:41.024718 #463473] INFO -- : LANG = en_US.UTF-8 I, [2024-05-26T00:53:41.024726 #463473] INFO -- : LC_ALL = I, [2024-05-26T00:53:41.024734 #463473] INFO -- : LC_CTYPE = I, [2024-05-26T00:53:41.024742 #463473] INFO -- : MFLAGS = -j3 --jobserver-auth=4,5 I, [2024-05-26T00:53:41.024749 #463473] INFO -- : RUSTC = rustc I, [2024-05-26T00:53:41.024757 #463473] INFO -- : YJIT_RUSTC_ARGS = --crate-name=yjit --crate-type=staticlib --edition=2021 -g -C lto=thin -C opt-level=3 -C overflow-checks=on '--out-dir=/home/opc/ruby/build/master/yjit/target/release/' /home/opc/ruby/src/master/yjit/src/lib.rs I, [2024-05-26T00:53:41.025498 #463473] INFO -- : gcc (GCC) 8.5.0 20210514 (Red Hat 8.5.0-10.1.0.1) I, [2024-05-26T00:53:41.025532 #463473] INFO -- : Copyright (C) 2018 Free Software Foundation, Inc. I, [2024-05-26T00:53:41.025543 #463473] INFO -- : This is free software; see the source for copying conditions. There is NO I, [2024-05-26T00:53:41.025552 #463473] INFO -- : warranty; not even for MERCHANTABILITY or FITNESS FOR A PARTICULAR PURPOSE. I, [2024-05-26T00:53:41.025561 #463473] INFO -- : I, [2024-05-26T00:53:41.058803 #463473] INFO -- : generating encdb.h I, [2024-05-26T00:53:41.060248 #463473] INFO -- : generating enc.mk I, [2024-05-26T00:53:41.097402 #463473] INFO -- : encdb.h unchanged I, [2024-05-26T00:53:41.297125 #463473] INFO -- : making srcs under enc I, [2024-05-26T00:53:41.297288 #463473] INFO -- : making enc I, [2024-05-26T00:53:41.324957 #463473] INFO -- : make[1]: Entering directory '/home/opc/ruby/build/master' I, [2024-05-26T00:53:41.325018 #463473] INFO -- : make[1]: Nothing to be done for 'enc'. I, [2024-05-26T00:53:41.325029 #463473] INFO -- : make[1]: Leaving directory '/home/opc/ruby/build/master' I, [2024-05-26T00:53:41.340805 #463473] INFO -- : make[1]: Entering directory '/home/opc/ruby/build/master' I, [2024-05-26T00:53:41.340845 #463473] INFO -- : make[1]: Nothing to be done for 'srcs'. I, [2024-05-26T00:53:41.340855 #463473] INFO -- : make[1]: Leaving directory '/home/opc/ruby/build/master' I, [2024-05-26T00:53:41.341586 #463473] INFO -- : generating transdb.h I, [2024-05-26T00:53:41.490123 #463473] INFO -- : transdb.h unchanged I, [2024-05-26T00:53:41.491480 #463473] INFO -- : generating makefiles ext/configure-ext.mk I, [2024-05-26T00:53:41.491652 #463473] INFO -- : making trans I, [2024-05-26T00:53:41.532038 #463473] INFO -- : ext/configure-ext.mk updated I, [2024-05-26T00:53:41.535003 #463473] INFO -- : make[1]: Entering directory '/home/opc/ruby/build/master' I, [2024-05-26T00:53:41.541286 #463473] INFO -- : make[1]: Entering directory '/home/opc/ruby/build/master' I, [2024-05-26T00:53:41.541334 #463473] INFO -- : make[1]: Nothing to be done for 'trans'. I, [2024-05-26T00:53:41.541347 #463473] INFO -- : make[1]: Leaving directory '/home/opc/ruby/build/master' I, [2024-05-26T00:53:42.151693 #463473] INFO -- : making encs I, [2024-05-26T00:53:42.204200 #463473] INFO -- : make[1]: Entering directory '/home/opc/ruby/build/master' I, [2024-05-26T00:53:42.204278 #463473] INFO -- : make[1]: Nothing to be done for 'encs'. I, [2024-05-26T00:53:42.204313 #463473] INFO -- : make[1]: Leaving directory '/home/opc/ruby/build/master' I, [2024-05-26T00:53:42.322343 #463473] INFO -- : make[1]: Leaving directory '/home/opc/ruby/build/master' I, [2024-05-26T00:53:42.323126 #463473] INFO -- : generating makefile exts.mk I, [2024-05-26T00:53:42.383202 #463473] INFO -- : exts.mk unchanged I, [2024-05-26T00:53:42.388071 #463473] INFO -- : make[1]: Entering directory '/home/opc/ruby/build/master' I, [2024-05-26T00:53:42.490622 #463473] INFO -- : make[2]: Entering directory '/home/opc/ruby/build/master/ext/coverage' I, [2024-05-26T00:53:42.492980 #463473] INFO -- : make[2]: Entering directory '/home/opc/ruby/build/master/ext/digest' I, [2024-05-26T00:53:42.493142 #463473] INFO -- : make[2]: Entering directory '/home/opc/ruby/build/master/ext/date' I, [2024-05-26T00:53:42.495275 #463473] INFO -- : make[2]: Leaving directory '/home/opc/ruby/build/master/ext/coverage' I, [2024-05-26T00:53:42.498467 #463473] INFO -- : make[2]: Leaving directory '/home/opc/ruby/build/master/ext/date' I, [2024-05-26T00:53:42.499234 #463473] INFO -- : make[2]: Leaving directory '/home/opc/ruby/build/master/ext/digest' I, [2024-05-26T00:53:42.507604 #463473] INFO -- : make[2]: Entering directory '/home/opc/ruby/build/master/ext/io/console' I, [2024-05-26T00:53:42.511472 #463473] INFO -- : make[2]: Leaving directory '/home/opc/ruby/build/master/ext/io/console' I, [2024-05-26T00:53:42.512806 #463473] INFO -- : make[2]: Entering directory '/home/opc/ruby/build/master/ext/fiddle' I, [2024-05-26T00:53:42.513782 #463473] INFO -- : make[2]: Entering directory '/home/opc/ruby/build/master/ext/json' I, [2024-05-26T00:53:42.516706 #463473] INFO -- : make[2]: Entering directory '/home/opc/ruby/build/master/ext/monitor' I, [2024-05-26T00:53:42.521097 #463473] INFO -- : make[2]: Leaving directory '/home/opc/ruby/build/master/ext/monitor' I, [2024-05-26T00:53:42.522680 #463473] INFO -- : make[2]: Leaving directory '/home/opc/ruby/build/master/ext/fiddle' I, [2024-05-26T00:53:42.523577 #463473] INFO -- : make[2]: Leaving directory '/home/opc/ruby/build/master/ext/json' I, [2024-05-26T00:53:42.527829 #463473] INFO -- : make[2]: Entering directory '/home/opc/ruby/build/master/ext/pathname' I, [2024-05-26T00:53:42.528570 #463473] INFO -- : make[2]: Entering directory '/home/opc/ruby/build/master/ext/objspace' I, [2024-05-26T00:53:42.534815 #463473] INFO -- : make[2]: Leaving directory '/home/opc/ruby/build/master/ext/objspace' I, [2024-05-26T00:53:42.535075 #463473] INFO -- : make[2]: Leaving directory '/home/opc/ruby/build/master/ext/pathname' I, [2024-05-26T00:53:42.539617 #463473] INFO -- : make[2]: Entering directory '/home/opc/ruby/build/master/ext/pty' I, [2024-05-26T00:53:42.541000 #463473] INFO -- : make[2]: Entering directory '/home/opc/ruby/build/master/ext/psych' I, [2024-05-26T00:53:42.544056 #463473] INFO -- : make[2]: Entering directory '/home/opc/ruby/build/master/ext/openssl' I, [2024-05-26T00:53:42.546141 #463473] INFO -- : make[2]: Leaving directory '/home/opc/ruby/build/master/ext/pty' I, [2024-05-26T00:53:42.559941 #463473] INFO -- : make[2]: Entering directory '/home/opc/ruby/build/master/ext/ripper' I, [2024-05-26T00:53:42.562488 #463473] INFO -- : make[2]: Leaving directory '/home/opc/ruby/build/master/ext/psych' I, [2024-05-26T00:53:42.565570 #463473] INFO -- : make[2]: Leaving directory '/home/opc/ruby/build/master/ext/openssl' I, [2024-05-26T00:53:42.566261 #463473] INFO -- : make[2]: Entering directory '/home/opc/ruby/build/master/ext/rubyvm' I, [2024-05-26T00:53:42.567290 #463473] INFO -- : make[2]: Leaving directory '/home/opc/ruby/build/master/ext/ripper' I, [2024-05-26T00:53:42.570353 #463473] INFO -- : make[2]: Leaving directory '/home/opc/ruby/build/master/ext/rubyvm' I, [2024-05-26T00:53:42.577426 #463473] INFO -- : make[2]: Entering directory '/home/opc/ruby/build/master/ext/socket' I, [2024-05-26T00:53:42.577525 #463473] INFO -- : make[2]: Entering directory '/home/opc/ruby/build/master/.bundle/gems/bigdecimal-3.1.7/ext/bigdecimal' I, [2024-05-26T00:53:42.578479 #463473] INFO -- : make[2]: Entering directory '/home/opc/ruby/build/master/.bundle/gems/bigdecimal-3.1.8/ext/bigdecimal' I, [2024-05-26T00:53:42.588331 #463473] INFO -- : make[2]: Leaving directory '/home/opc/ruby/build/master/ext/socket' I, [2024-05-26T00:53:42.590884 #463473] INFO -- : make[2]: Entering directory '/home/opc/ruby/build/master/.bundle/gems/debug-1.9.2/ext/debug' I, [2024-05-26T00:53:42.609413 #463473] INFO -- : make[2]: Leaving directory '/home/opc/ruby/build/master/.bundle/gems/bigdecimal-3.1.8/ext/bigdecimal' I, [2024-05-26T00:53:42.610462 #463473] INFO -- : make[2]: Leaving directory '/home/opc/ruby/build/master/.bundle/gems/bigdecimal-3.1.7/ext/bigdecimal' I, [2024-05-26T00:53:42.611797 #463473] INFO -- : make[2]: Entering directory '/home/opc/ruby/build/master/.bundle/gems/nkf-0.2.0/ext/nkf' I, [2024-05-26T00:53:42.614073 #463473] INFO -- : make[2]: Entering directory '/home/opc/ruby/build/master/.bundle/gems/racc-1.7.3/ext/racc/cparse' I, [2024-05-26T00:53:42.622425 #463473] INFO -- : make[2]: Leaving directory '/home/opc/ruby/build/master/.bundle/gems/debug-1.9.2/ext/debug' I, [2024-05-26T00:53:42.625987 #463473] INFO -- : make[2]: Entering directory '/home/opc/ruby/build/master/.bundle/gems/racc-1.8.0/ext/racc/cparse' I, [2024-05-26T00:53:42.642544 #463473] INFO -- : make[2]: Leaving directory '/home/opc/ruby/build/master/.bundle/gems/nkf-0.2.0/ext/nkf' I, [2024-05-26T00:53:42.645566 #463473] INFO -- : make[2]: Entering directory '/home/opc/ruby/build/master/.bundle/gems/rbs-3.4.4/ext/rbs_extension' I, [2024-05-26T00:53:42.647061 #463473] INFO -- : make[2]: Leaving directory '/home/opc/ruby/build/master/.bundle/gems/racc-1.7.3/ext/racc/cparse' I, [2024-05-26T00:53:42.654599 #463473] INFO -- : make[2]: Entering directory '/home/opc/ruby/build/master/.bundle/gems/syslog-0.1.2/ext/syslog' I, [2024-05-26T00:53:42.657898 #463473] INFO -- : make[2]: Leaving directory '/home/opc/ruby/build/master/.bundle/gems/racc-1.8.0/ext/racc/cparse' I, [2024-05-26T00:53:42.676979 #463473] INFO -- : make[2]: Leaving directory '/home/opc/ruby/build/master/.bundle/gems/rbs-3.4.4/ext/rbs_extension' I, [2024-05-26T00:53:42.681493 #463473] INFO -- : make[2]: Entering directory '/home/opc/ruby/build/master/ext/digest/sha2' I, [2024-05-26T00:53:42.686433 #463473] INFO -- : make[2]: Leaving directory '/home/opc/ruby/build/master/.bundle/gems/syslog-0.1.2/ext/syslog' I, [2024-05-26T00:53:42.687592 #463473] INFO -- : make[2]: Leaving directory '/home/opc/ruby/build/master/ext/digest/sha2' I, [2024-05-26T00:53:42.728757 #463473] INFO -- : make[2]: Entering directory '/home/opc/ruby/build/master' I, [2024-05-26T00:53:42.812624 #463473] INFO -- : make[2]: 'ruby' is up to date. I, [2024-05-26T00:53:42.812703 #463473] INFO -- : make[2]: Leaving directory '/home/opc/ruby/build/master' I, [2024-05-26T00:53:42.812850 #463473] INFO -- : make[1]: Leaving directory '/home/opc/ruby/build/master' I, [2024-05-26T00:53:42.817271 #463473] INFO -- : make[1]: Entering directory '/home/opc/ruby/build/master' I, [2024-05-26T00:53:42.817320 #463473] INFO -- : make[1]: Nothing to be done for 'note'. I, [2024-05-26T00:53:42.817330 #463473] INFO -- : make[1]: Leaving directory '/home/opc/ruby/build/master' I, [2024-05-26T00:53:42.817739 #463473] INFO -- : $$$[end] "make all -j3" exit with 0. I, [2024-05-26T00:53:42.817888 #463473] INFO -- : $$$[beg] make install -j3 I, [2024-05-26T00:53:42.911723 #463473] INFO -- : Update power_assert to 84e85124c5014a139af39161d484156cfe87a9ed I, [2024-05-26T00:53:42.911946 #463473] INFO -- : Update rbs to ba7872795d5de04adb8ff500c0e6afdc81a041dd I, [2024-05-26T00:53:42.912915 #463473] INFO -- : Update typeprof to b19a6416da3a05d57fadd6ffdadb382b6d236ca5 I, [2024-05-26T00:53:42.915832 #463473] INFO -- : echo 84e85124c5014a139af39161d484156cfe87a9ed | /bin/sh /home/opc/ruby/src/master/tool/ifchange /home/opc/ruby/src/master/.bundle/.timestamp/power_assert.revision - I, [2024-05-26T00:53:42.916018 #463473] INFO -- : echo b19a6416da3a05d57fadd6ffdadb382b6d236ca5 | /bin/sh /home/opc/ruby/src/master/tool/ifchange /home/opc/ruby/src/master/.bundle/.timestamp/typeprof.revision - I, [2024-05-26T00:53:42.916903 #463473] INFO -- : echo ba7872795d5de04adb8ff500c0e6afdc81a041dd | /bin/sh /home/opc/ruby/src/master/tool/ifchange /home/opc/ruby/src/master/.bundle/.timestamp/rbs.revision - I, [2024-05-26T00:53:42.922451 #463473] INFO -- : /home/opc/ruby/src/master/.bundle/.timestamp/power_assert.revision unchanged I, [2024-05-26T00:53:42.922622 #463473] INFO -- : /home/opc/ruby/src/master/.bundle/.timestamp/typeprof.revision unchanged I, [2024-05-26T00:53:42.923014 #463473] INFO -- : /home/opc/ruby/src/master/.bundle/.timestamp/rbs.revision unchanged I, [2024-05-26T00:53:42.926165 #463473] INFO -- : BASERUBY = /usr/local/bin/ruby --disable=gems I, [2024-05-26T00:53:42.926215 #463473] INFO -- : CC = gcc I, [2024-05-26T00:53:42.926226 #463473] INFO -- : LD = ld I, [2024-05-26T00:53:42.926237 #463473] INFO -- : LDSHARED = gcc -shared I, [2024-05-26T00:53:42.926246 #463473] INFO -- : CFLAGS = -O3 -fno-fast-math -ggdb3 -Wall -Wextra -Wdeprecated-declarations -Wdiv-by-zero -Wduplicated-cond -Wimplicit-function-declaration -Wimplicit-int -Wpointer-arith -Wwrite-strings -Wold-style-definition -Wimplicit-fallthrough=0 -Wmissing-noreturn -Wno-cast-function-type -Wno-constant-logical-operand -Wno-long-long -Wno-missing-field-initializers -Wno-overlength-strings -Wno-packed-bitfield-compat -Wno-parentheses-equality -Wno-self-assign -Wno-tautological-compare -Wno-unused-parameter -Wno-unused-value -Wsuggest-attribute=format -Wsuggest-attribute=noreturn -Wunused-variable -Wmisleading-indentation -Wundef I, [2024-05-26T00:53:42.926255 #463473] INFO -- : XCFLAGS = -U_FORTIFY_SOURCE -D_FORTIFY_SOURCE=2 -fstack-protector-strong -msign-return-address=all -fno-strict-overflow -fvisibility=hidden -fexcess-precision=standard -DRUBY_EXPORT -fPIE -I. -I.ext/include/aarch64-linux -I/home/opc/ruby/src/master/include -I/home/opc/ruby/src/master -I/home/opc/ruby/src/master/prism -I/home/opc/ruby/src/master/enc/unicode/15.0.0 I, [2024-05-26T00:53:42.926264 #463473] INFO -- : CPPFLAGS = I, [2024-05-26T00:53:42.926272 #463473] INFO -- : DLDFLAGS = -Wl,--compress-debug-sections=zlib -fstack-protector-strong -pie I, [2024-05-26T00:53:42.926281 #463473] INFO -- : SOLIBS = -lz -lrt -lrt -ldl -lcrypt -lm -lpthread I, [2024-05-26T00:53:42.926289 #463473] INFO -- : LANG = en_US.UTF-8 I, [2024-05-26T00:53:42.926297 #463473] INFO -- : LC_ALL = I, [2024-05-26T00:53:42.926304 #463473] INFO -- : LC_CTYPE = I, [2024-05-26T00:53:42.926312 #463473] INFO -- : MFLAGS = -j3 --jobserver-auth=4,5 I, [2024-05-26T00:53:42.926320 #463473] INFO -- : RUSTC = rustc I, [2024-05-26T00:53:42.926328 #463473] INFO -- : YJIT_RUSTC_ARGS = --crate-name=yjit --crate-type=staticlib --edition=2021 -g -C lto=thin -C opt-level=3 -C overflow-checks=on '--out-dir=/home/opc/ruby/build/master/yjit/target/release/' /home/opc/ruby/src/master/yjit/src/lib.rs I, [2024-05-26T00:53:42.957815 #463473] INFO -- : generating encdb.h I, [2024-05-26T00:53:42.957976 #463473] INFO -- : gcc (GCC) 8.5.0 20210514 (Red Hat 8.5.0-10.1.0.1) I, [2024-05-26T00:53:42.958004 #463473] INFO -- : Copyright (C) 2018 Free Software Foundation, Inc. I, [2024-05-26T00:53:42.958014 #463473] INFO -- : This is free software; see the source for copying conditions. There is NO I, [2024-05-26T00:53:42.958023 #463473] INFO -- : warranty; not even for MERCHANTABILITY or FITNESS FOR A PARTICULAR PURPOSE. I, [2024-05-26T00:53:42.958035 #463473] INFO -- : I, [2024-05-26T00:53:42.958671 #463473] INFO -- : generating enc.mk I, [2024-05-26T00:53:42.995414 #463473] INFO -- : encdb.h unchanged I, [2024-05-26T00:53:43.087073 #463473] INFO -- : Building power_assert@84e85124c5014a139af39161d484156cfe87a9ed to /home/opc/ruby/src/master/gems/power_assert-2.0.3.gem I, [2024-05-26T00:53:43.195513 #463473] INFO -- : making srcs under enc I, [2024-05-26T00:53:43.195853 #463473] INFO -- : making enc I, [2024-05-26T00:53:43.206137 #463473] INFO -- : Successfully built RubyGem I, [2024-05-26T00:53:43.206185 #463473] INFO -- : Name: power_assert I, [2024-05-26T00:53:43.206197 #463473] INFO -- : Version: 2.0.4dev I, [2024-05-26T00:53:43.206205 #463473] INFO -- : File: power_assert-2.0.4dev.gem I, [2024-05-26T00:53:43.208463 #463473] INFO -- : Extracting bundle gem power_assert-2.0.3... I, [2024-05-26T00:53:43.223383 #463473] INFO -- : make[1]: Entering directory '/home/opc/ruby/build/master' I, [2024-05-26T00:53:43.223446 #463473] INFO -- : make[1]: Nothing to be done for 'enc'. I, [2024-05-26T00:53:43.223478 #463473] INFO -- : make[1]: Leaving directory '/home/opc/ruby/build/master' I, [2024-05-26T00:53:43.238144 #463473] INFO -- : make[1]: Entering directory '/home/opc/ruby/build/master' I, [2024-05-26T00:53:43.238190 #463473] INFO -- : make[1]: Nothing to be done for 'srcs'. I, [2024-05-26T00:53:43.238200 #463473] INFO -- : make[1]: Leaving directory '/home/opc/ruby/build/master' I, [2024-05-26T00:53:43.238952 #463473] INFO -- : generating transdb.h I, [2024-05-26T00:53:43.308174 #463473] INFO -- : Try with hash version of bundled gems instead of gems/power_assert-2.0.3.gem. We don't use this gem with release version of Ruby. I, [2024-05-26T00:53:43.318929 #463473] INFO -- : Unpacked gems/power_assert-2.0.4dev.gem I, [2024-05-26T00:53:43.382858 #463473] INFO -- : transdb.h unchanged I, [2024-05-26T00:53:43.384219 #463473] INFO -- : generating makefiles ext/configure-ext.mk I, [2024-05-26T00:53:43.384404 #463473] INFO -- : making trans I, [2024-05-26T00:53:43.425790 #463473] INFO -- : ext/configure-ext.mk unchanged I, [2024-05-26T00:53:43.428748 #463473] INFO -- : make[1]: Entering directory '/home/opc/ruby/build/master' I, [2024-05-26T00:53:43.432865 #463473] INFO -- : make[1]: Entering directory '/home/opc/ruby/build/master' I, [2024-05-26T00:53:43.432926 #463473] INFO -- : make[1]: Nothing to be done for 'trans'. I, [2024-05-26T00:53:43.432938 #463473] INFO -- : make[1]: Leaving directory '/home/opc/ruby/build/master' I, [2024-05-26T00:53:43.616125 #463473] INFO -- : making encs I, [2024-05-26T00:53:43.675904 #463473] INFO -- : make[1]: Entering directory '/home/opc/ruby/build/master' I, [2024-05-26T00:53:43.675994 #463473] INFO -- : make[1]: Nothing to be done for 'encs'. I, [2024-05-26T00:53:43.676027 #463473] INFO -- : make[1]: Leaving directory '/home/opc/ruby/build/master' I, [2024-05-26T00:53:44.191748 #463473] INFO -- : make[1]: Leaving directory '/home/opc/ruby/build/master' I, [2024-05-26T00:53:44.192379 #463473] INFO -- : generating makefile exts.mk I, [2024-05-26T00:53:44.252203 #463473] INFO -- : exts.mk unchanged I, [2024-05-26T00:53:44.257273 #463473] INFO -- : make[1]: Entering directory '/home/opc/ruby/build/master' I, [2024-05-26T00:53:44.361745 #463473] INFO -- : make[2]: Entering directory '/home/opc/ruby/build/master/ext/coverage' I, [2024-05-26T00:53:44.364507 #463473] INFO -- : make[2]: Entering directory '/home/opc/ruby/build/master/ext/digest' I, [2024-05-26T00:53:44.366415 #463473] INFO -- : make[2]: Leaving directory '/home/opc/ruby/build/master/ext/coverage' I, [2024-05-26T00:53:44.366449 #463473] INFO -- : make[2]: Entering directory '/home/opc/ruby/build/master/ext/date' I, [2024-05-26T00:53:44.371605 #463473] INFO -- : make[2]: Leaving directory '/home/opc/ruby/build/master/ext/date' I, [2024-05-26T00:53:44.373873 #463473] INFO -- : make[2]: Leaving directory '/home/opc/ruby/build/master/ext/digest' I, [2024-05-26T00:53:44.378855 #463473] INFO -- : make[2]: Entering directory '/home/opc/ruby/build/master/ext/io/console' I, [2024-05-26T00:53:44.381089 #463473] INFO -- : make[2]: Entering directory '/home/opc/ruby/build/master/ext/fiddle' I, [2024-05-26T00:53:44.384431 #463473] INFO -- : make[2]: Leaving directory '/home/opc/ruby/build/master/ext/io/console' I, [2024-05-26T00:53:44.386529 #463473] INFO -- : make[2]: Entering directory '/home/opc/ruby/build/master/ext/json' I, [2024-05-26T00:53:44.390321 #463473] INFO -- : make[2]: Leaving directory '/home/opc/ruby/build/master/ext/fiddle' I, [2024-05-26T00:53:44.390771 #463473] INFO -- : make[2]: Entering directory '/home/opc/ruby/build/master/ext/monitor' I, [2024-05-26T00:53:44.394879 #463473] INFO -- : make[2]: Leaving directory '/home/opc/ruby/build/master/ext/monitor' I, [2024-05-26T00:53:44.396482 #463473] INFO -- : make[2]: Entering directory '/home/opc/ruby/build/master/ext/objspace' I, [2024-05-26T00:53:44.397144 #463473] INFO -- : make[2]: Leaving directory '/home/opc/ruby/build/master/ext/json' I, [2024-05-26T00:53:44.401324 #463473] INFO -- : make[2]: Entering directory '/home/opc/ruby/build/master/ext/pathname' I, [2024-05-26T00:53:44.406000 #463473] INFO -- : make[2]: Leaving directory '/home/opc/ruby/build/master/ext/objspace' I, [2024-05-26T00:53:44.407141 #463473] INFO -- : make[2]: Leaving directory '/home/opc/ruby/build/master/ext/pathname' I, [2024-05-26T00:53:44.411400 #463473] INFO -- : make[2]: Entering directory '/home/opc/ruby/build/master/ext/pty' I, [2024-05-26T00:53:44.412414 #463473] INFO -- : make[2]: Entering directory '/home/opc/ruby/build/master/ext/psych' I, [2024-05-26T00:53:44.414403 #463473] INFO -- : make[2]: Entering directory '/home/opc/ruby/build/master/ext/openssl' I, [2024-05-26T00:53:44.419922 #463473] INFO -- : make[2]: Leaving directory '/home/opc/ruby/build/master/ext/pty' I, [2024-05-26T00:53:44.431897 #463473] INFO -- : make[2]: Leaving directory '/home/opc/ruby/build/master/ext/psych' I, [2024-05-26T00:53:44.433869 #463473] INFO -- : make[2]: Entering directory '/home/opc/ruby/build/master/ext/rubyvm' I, [2024-05-26T00:53:44.435825 #463473] INFO -- : make[2]: Entering directory '/home/opc/ruby/build/master/ext/ripper' I, [2024-05-26T00:53:44.436475 #463473] INFO -- : make[2]: Leaving directory '/home/opc/ruby/build/master/ext/openssl' I, [2024-05-26T00:53:44.439571 #463473] INFO -- : make[2]: Leaving directory '/home/opc/ruby/build/master/ext/rubyvm' I, [2024-05-26T00:53:44.444130 #463473] INFO -- : make[2]: Leaving directory '/home/opc/ruby/build/master/ext/ripper' I, [2024-05-26T00:53:44.448424 #463473] INFO -- : make[2]: Entering directory '/home/opc/ruby/build/master/ext/socket' I, [2024-05-26T00:53:44.451354 #463473] INFO -- : make[2]: Entering directory '/home/opc/ruby/build/master/.bundle/gems/bigdecimal-3.1.7/ext/bigdecimal' I, [2024-05-26T00:53:44.451592 #463473] INFO -- : make[2]: Entering directory '/home/opc/ruby/build/master/.bundle/gems/bigdecimal-3.1.8/ext/bigdecimal' I, [2024-05-26T00:53:44.461014 #463473] INFO -- : make[2]: Leaving directory '/home/opc/ruby/build/master/ext/socket' I, [2024-05-26T00:53:44.465256 #463473] INFO -- : make[2]: Entering directory '/home/opc/ruby/build/master/.bundle/gems/debug-1.9.2/ext/debug' I, [2024-05-26T00:53:44.482616 #463473] INFO -- : make[2]: Leaving directory '/home/opc/ruby/build/master/.bundle/gems/bigdecimal-3.1.7/ext/bigdecimal' I, [2024-05-26T00:53:44.482875 #463473] INFO -- : make[2]: Leaving directory '/home/opc/ruby/build/master/.bundle/gems/bigdecimal-3.1.8/ext/bigdecimal' I, [2024-05-26T00:53:44.485212 #463473] INFO -- : make[2]: Entering directory '/home/opc/ruby/build/master/.bundle/gems/nkf-0.2.0/ext/nkf' I, [2024-05-26T00:53:44.485395 #463473] INFO -- : make[2]: Entering directory '/home/opc/ruby/build/master/.bundle/gems/racc-1.7.3/ext/racc/cparse' I, [2024-05-26T00:53:44.498924 #463473] INFO -- : make[2]: Leaving directory '/home/opc/ruby/build/master/.bundle/gems/debug-1.9.2/ext/debug' I, [2024-05-26T00:53:44.503390 #463473] INFO -- : make[2]: Entering directory '/home/opc/ruby/build/master/.bundle/gems/racc-1.8.0/ext/racc/cparse' I, [2024-05-26T00:53:44.516854 #463473] INFO -- : make[2]: Leaving directory '/home/opc/ruby/build/master/.bundle/gems/nkf-0.2.0/ext/nkf' I, [2024-05-26T00:53:44.519790 #463473] INFO -- : make[2]: Entering directory '/home/opc/ruby/build/master/.bundle/gems/rbs-3.4.4/ext/rbs_extension' I, [2024-05-26T00:53:44.522316 #463473] INFO -- : make[2]: Leaving directory '/home/opc/ruby/build/master/.bundle/gems/racc-1.7.3/ext/racc/cparse' I, [2024-05-26T00:53:44.528604 #463473] INFO -- : make[2]: Entering directory '/home/opc/ruby/build/master/.bundle/gems/syslog-0.1.2/ext/syslog' I, [2024-05-26T00:53:44.535762 #463473] INFO -- : make[2]: Leaving directory '/home/opc/ruby/build/master/.bundle/gems/racc-1.8.0/ext/racc/cparse' I, [2024-05-26T00:53:44.551422 #463473] INFO -- : make[2]: Leaving directory '/home/opc/ruby/build/master/.bundle/gems/rbs-3.4.4/ext/rbs_extension' I, [2024-05-26T00:53:44.556958 #463473] INFO -- : make[2]: Entering directory '/home/opc/ruby/build/master/ext/digest/sha2' I, [2024-05-26T00:53:44.560928 #463473] INFO -- : make[2]: Leaving directory '/home/opc/ruby/build/master/.bundle/gems/syslog-0.1.2/ext/syslog' I, [2024-05-26T00:53:44.562103 #463473] INFO -- : make[2]: Leaving directory '/home/opc/ruby/build/master/ext/digest/sha2' I, [2024-05-26T00:53:44.600961 #463473] INFO -- : make[2]: Entering directory '/home/opc/ruby/build/master' I, [2024-05-26T00:53:44.684915 #463473] INFO -- : make[2]: 'ruby' is up to date. I, [2024-05-26T00:53:44.684987 #463473] INFO -- : make[2]: Leaving directory '/home/opc/ruby/build/master' I, [2024-05-26T00:53:44.685112 #463473] INFO -- : make[1]: Leaving directory '/home/opc/ruby/build/master' I, [2024-05-26T00:53:44.689488 #463473] INFO -- : make[1]: Entering directory '/home/opc/ruby/build/master' I, [2024-05-26T00:53:44.689519 #463473] INFO -- : make[1]: Nothing to be done for 'note'. I, [2024-05-26T00:53:44.689530 #463473] INFO -- : make[1]: Leaving directory '/home/opc/ruby/build/master' I, [2024-05-26T00:53:44.689706 #463473] INFO -- : ./miniruby -I/home/opc/ruby/src/master/lib -I. -I.ext/common /home/opc/ruby/src/master/tool/runruby.rb --extout=.ext -- --disable-gems -r./aarch64-linux-fake /home/opc/ruby/src/master/tool/rbinstall.rb --make="make" --dest-dir="" --extout=".ext" --ext-build-dir="./ext" --mflags="-j3 --jobserver-auth=4,5" --make-flags=" -j3 --jobserver-auth=4,5" --data-mode=0644 --prog-mode=0755 --installed-list .installed.list --mantype="doc" --gnumake --install=all --exclude=doc I, [2024-05-26T00:53:44.848752 #463473] INFO -- : Installing to I, [2024-05-26T00:53:44.848820 #463473] INFO -- : installing binary commands: /home/opc/ruby/install/master/bin I, [2024-05-26T00:53:44.860448 #463473] INFO -- : installing base libraries: /home/opc/ruby/install/master/lib I, [2024-05-26T00:53:44.860967 #463473] INFO -- : installing arch files: /home/opc/ruby/install/master/lib/ruby/3.4.0+0/aarch64-linux I, [2024-05-26T00:53:44.861089 #463473] INFO -- : installing pkgconfig data: /home/opc/ruby/install/master/lib/pkgconfig I, [2024-05-26T00:53:44.861213 #463473] INFO -- : installing extension objects: /home/opc/ruby/install/master/lib/ruby/3.4.0+0/aarch64-linux I, [2024-05-26T00:53:44.873940 #463473] INFO -- : installing extension objects: /home/opc/ruby/install/master/lib/ruby/site_ruby/3.4.0+0/aarch64-linux I, [2024-05-26T00:53:44.873980 #463473] INFO -- : installing extension objects: /home/opc/ruby/install/master/lib/ruby/vendor_ruby/3.4.0+0/aarch64-linux I, [2024-05-26T00:53:44.874064 #463473] INFO -- : installing extension headers: /home/opc/ruby/install/master/include/ruby-3.4.0+0/aarch64-linux I, [2024-05-26T00:53:44.874363 #463473] INFO -- : installing extension scripts: /home/opc/ruby/install/master/lib/ruby/3.4.0+0 I, [2024-05-26T00:53:44.882261 #463473] INFO -- : installing extension scripts: /home/opc/ruby/install/master/lib/ruby/site_ruby/3.4.0+0 I, [2024-05-26T00:53:44.882282 #463473] INFO -- : installing extension scripts: /home/opc/ruby/install/master/lib/ruby/vendor_ruby/3.4.0+0 I, [2024-05-26T00:53:44.882293 #463473] INFO -- : installing extension headers: /home/opc/ruby/install/master/include/ruby-3.4.0+0/ruby I, [2024-05-26T00:53:44.882408 #463473] INFO -- : installing command scripts: /home/opc/ruby/install/master/bin I, [2024-05-26T00:53:44.882543 #463473] INFO -- : installing library scripts: /home/opc/ruby/install/master/lib/ruby/3.4.0+0 I, [2024-05-26T00:53:44.966326 #463473] INFO -- : installing common headers: /home/opc/ruby/install/master/include/ruby-3.4.0+0 I, [2024-05-26T00:53:44.978292 #463473] INFO -- : installing manpages: /home/opc/ruby/install/master/share/man/man1 I, [2024-05-26T00:53:44.978577 #463473] INFO -- : installing default gems from lib: /home/opc/ruby/install/master/lib/ruby/gems/3.4.0+0 I, [2024-05-26T00:53:45.025828 #463473] INFO -- : benchmark 0.3.0 I, [2024-05-26T00:53:45.030053 #463473] INFO -- : bundler 2.6.0.dev I, [2024-05-26T00:53:45.034942 #463473] INFO -- : cgi 0.4.1 I, [2024-05-26T00:53:45.036124 #463473] INFO -- : delegate 0.3.1 I, [2024-05-26T00:53:45.037331 #463473] INFO -- : did_you_mean 1.6.3 I, [2024-05-26T00:53:45.038483 #463473] INFO -- : english 0.8.0 I, [2024-05-26T00:53:45.040881 #463473] INFO -- : erb 4.0.4 I, [2024-05-26T00:53:45.043775 #463473] INFO -- : error_highlight 0.6.0 I, [2024-05-26T00:53:45.044924 #463473] INFO -- : fileutils 1.7.2 I, [2024-05-26T00:53:45.046111 #463473] INFO -- : find 0.2.0 I, [2024-05-26T00:53:45.047245 #463473] INFO -- : forwardable 1.3.3 I, [2024-05-26T00:53:45.048385 #463473] INFO -- : ipaddr 1.2.6 I, [2024-05-26T00:53:45.049624 #463473] INFO -- : irb 1.13.1 I, [2024-05-26T00:53:45.052432 #463473] INFO -- : logger 1.6.0 I, [2024-05-26T00:53:45.053662 #463473] INFO -- : net-http 0.4.1 I, [2024-05-26T00:53:45.054918 #463473] INFO -- : net-protocol 0.2.2 I, [2024-05-26T00:53:45.056151 #463473] INFO -- : open-uri 0.4.1 I, [2024-05-26T00:53:45.057436 #463473] INFO -- : open3 0.2.1 I, [2024-05-26T00:53:45.058608 #463473] INFO -- : optparse 0.5.0 I, [2024-05-26T00:53:45.059782 #463473] INFO -- : ostruct 0.6.0 I, [2024-05-26T00:53:45.060904 #463473] INFO -- : pp 0.5.0 I, [2024-05-26T00:53:45.062140 #463473] INFO -- : prettyprint 0.2.0 I, [2024-05-26T00:53:45.063269 #463473] INFO -- : prism 0.29.0 I, [2024-05-26T00:53:45.064506 #463473] INFO -- : pstore 0.1.3 I, [2024-05-26T00:53:45.065728 #463473] INFO -- : rdoc 6.7.0 I, [2024-05-26T00:53:45.069782 #463473] INFO -- : readline 0.0.4 I, [2024-05-26T00:53:45.070908 #463473] INFO -- : reline 0.5.7 I, [2024-05-26T00:53:45.072112 #463473] INFO -- : resolv 0.4.0 I, [2024-05-26T00:53:45.073314 #463473] INFO -- : ruby2_keywords 0.0.5 I, [2024-05-26T00:53:45.076225 #463473] INFO -- : securerandom 0.3.1 I, [2024-05-26T00:53:45.077398 #463473] INFO -- : set 1.1.0 I, [2024-05-26T00:53:45.078534 #463473] INFO -- : shellwords 0.2.0 I, [2024-05-26T00:53:45.079641 #463473] INFO -- : singleton 0.2.0 I, [2024-05-26T00:53:45.080760 #463473] INFO -- : syntax_suggest 2.0.0 I, [2024-05-26T00:53:45.083364 #463473] INFO -- : tempfile 0.2.1 I, [2024-05-26T00:53:45.084474 #463473] INFO -- : time 0.3.0 I, [2024-05-26T00:53:45.085683 #463473] INFO -- : timeout 0.4.1 I, [2024-05-26T00:53:45.086811 #463473] INFO -- : tmpdir 0.2.0 I, [2024-05-26T00:53:45.087957 #463473] INFO -- : tsort 0.2.0 I, [2024-05-26T00:53:45.089109 #463473] INFO -- : un 0.3.0 I, [2024-05-26T00:53:45.090507 #463473] INFO -- : uri 0.13.0 I, [2024-05-26T00:53:45.091677 #463473] INFO -- : weakref 0.1.3 I, [2024-05-26T00:53:45.092810 #463473] INFO -- : yaml 0.3.0 I, [2024-05-26T00:53:45.093748 #463473] INFO -- : installing default gems from ext: /home/opc/ruby/install/master/lib/ruby/gems/3.4.0+0 I, [2024-05-26T00:53:45.103404 #463473] INFO -- : date 3.3.4 I, [2024-05-26T00:53:45.106601 #463473] INFO -- : digest 3.1.1 I, [2024-05-26T00:53:45.107757 #463473] INFO -- : etc 1.4.3 I, [2024-05-26T00:53:45.109023 #463473] INFO -- : fcntl 1.1.0 I, [2024-05-26T00:53:45.110219 #463473] INFO -- : fiddle 1.1.3 I, [2024-05-26T00:53:45.111369 #463473] INFO -- : io-console 0.7.2 I, [2024-05-26T00:53:45.112573 #463473] INFO -- : io-nonblock 0.3.0 I, [2024-05-26T00:53:45.113744 #463473] INFO -- : io-wait 0.3.1 I, [2024-05-26T00:53:45.114825 #463473] INFO -- : json 2.7.2 I, [2024-05-26T00:53:45.116043 #463473] INFO -- : openssl 3.2.0 I, [2024-05-26T00:53:45.117400 #463473] INFO -- : pathname 0.3.0 I, [2024-05-26T00:53:45.119028 #463473] INFO -- : psych 5.1.2 I, [2024-05-26T00:53:45.120302 #463473] INFO -- : stringio 3.1.1 I, [2024-05-26T00:53:45.121534 #463473] INFO -- : strscan 3.1.1 I, [2024-05-26T00:53:45.122741 #463473] INFO -- : zlib 3.1.0 I, [2024-05-26T00:53:45.123640 #463473] INFO -- : installing bundled gems: /home/opc/ruby/install/master/lib/ruby/gems/3.4.0+0 I, [2024-05-26T00:53:45.124655 #463473] INFO -- : minitest 5.23.1 I, [2024-05-26T00:53:45.142895 #463473] INFO -- : rake 13.2.1 I, [2024-05-26T00:53:45.157136 #463473] INFO -- : test-unit 3.6.2 I, [2024-05-26T00:53:45.171148 #463473] INFO -- : rexml 3.2.8 I, [2024-05-26T00:53:45.187926 #463473] INFO -- : rss 0.3.0 I, [2024-05-26T00:53:45.197832 #463473] INFO -- : net-ftp 0.3.4 I, [2024-05-26T00:53:45.201824 #463473] INFO -- : net-imap 0.4.11 I, [2024-05-26T00:53:45.212694 #463473] INFO -- : net-pop 0.1.2 I, [2024-05-26T00:53:45.215352 #463473] INFO -- : net-smtp 0.5.0 I, [2024-05-26T00:53:45.218870 #463473] INFO -- : matrix 0.4.2 I, [2024-05-26T00:53:45.226953 #463473] INFO -- : prime 0.1.2 I, [2024-05-26T00:53:45.235674 #463473] INFO -- : rbs 3.4.4 I, [2024-05-26T00:53:45.340680 #463473] INFO -- : typeprof 0.21.11 I, [2024-05-26T00:53:45.349069 #463473] INFO -- : debug 1.9.2 I, [2024-05-26T00:53:45.359181 #463473] INFO -- : racc 1.8.0 I, [2024-05-26T00:53:45.370376 #463473] INFO -- : mutex_m 0.2.0 I, [2024-05-26T00:53:45.373383 #463473] INFO -- : getoptlong 0.2.1 I, [2024-05-26T00:53:45.378223 #463473] INFO -- : base64 0.2.0 I, [2024-05-26T00:53:45.380749 #463473] INFO -- : bigdecimal 3.1.8 I, [2024-05-26T00:53:45.387012 #463473] INFO -- : observer 0.1.2 I, [2024-05-26T00:53:45.390096 #463473] INFO -- : abbrev 0.1.2 I, [2024-05-26T00:53:45.393034 #463473] INFO -- : resolv-replace 0.1.1 I, [2024-05-26T00:53:45.397489 #463473] INFO -- : rinda 0.2.0 I, [2024-05-26T00:53:45.401074 #463473] INFO -- : drb 2.2.1 I, [2024-05-26T00:53:45.406056 #463473] INFO -- : nkf 0.2.0 I, [2024-05-26T00:53:45.412709 #463473] INFO -- : syslog 0.1.2 I, [2024-05-26T00:53:45.417538 #463473] INFO -- : csv 3.3.0 I, [2024-05-26T00:53:45.432238 #463473] INFO -- : installing bundled gem cache: /home/opc/ruby/install/master/lib/ruby/gems/3.4.0+0/cache I, [2024-05-26T00:53:45.434283 #463473] INFO -- : skipped bundled gems: I, [2024-05-26T00:53:45.434308 #463473] INFO -- : power_assert-2.0.4dev.gem not found in bundled_gems I, [2024-05-26T00:53:45.437288 #463473] INFO -- : $$$[end] "make install -j3" exit with 0. I, [2024-05-26T00:53:45.437431 #463473] INFO -- : $$$[beg] make yes-btest TESTOPTS='-q -j3' I, [2024-05-26T00:54:08.105145 #463473] INFO -- : PASS all 1936 tests E, [2024-05-26T00:54:08.107285 #463473] ERROR -- : I, [2024-05-26T00:54:08.107405 #463473] INFO -- : $$$[end] "make yes-btest TESTOPTS='-q -j3'" exit with 0. I, [2024-05-26T00:54:08.107538 #463473] INFO -- : $$$[beg] make yes-test-basic TESTS='-j3' I, [2024-05-26T00:54:08.198919 #463473] INFO -- : BASERUBY = /usr/local/bin/ruby --disable=gems I, [2024-05-26T00:54:08.198986 #463473] INFO -- : CC = gcc I, [2024-05-26T00:54:08.198996 #463473] INFO -- : LD = ld I, [2024-05-26T00:54:08.199005 #463473] INFO -- : LDSHARED = gcc -shared I, [2024-05-26T00:54:08.199015 #463473] INFO -- : CFLAGS = -O3 -fno-fast-math -ggdb3 -Wall -Wextra -Wdeprecated-declarations -Wdiv-by-zero -Wduplicated-cond -Wimplicit-function-declaration -Wimplicit-int -Wpointer-arith -Wwrite-strings -Wold-style-definition -Wimplicit-fallthrough=0 -Wmissing-noreturn -Wno-cast-function-type -Wno-constant-logical-operand -Wno-long-long -Wno-missing-field-initializers -Wno-overlength-strings -Wno-packed-bitfield-compat -Wno-parentheses-equality -Wno-self-assign -Wno-tautological-compare -Wno-unused-parameter -Wno-unused-value -Wsuggest-attribute=format -Wsuggest-attribute=noreturn -Wunused-variable -Wmisleading-indentation -Wundef I, [2024-05-26T00:54:08.199025 #463473] INFO -- : XCFLAGS = -U_FORTIFY_SOURCE -D_FORTIFY_SOURCE=2 -fstack-protector-strong -msign-return-address=all -fno-strict-overflow -fvisibility=hidden -fexcess-precision=standard -DRUBY_EXPORT -fPIE -I. -I.ext/include/aarch64-linux -I/home/opc/ruby/src/master/include -I/home/opc/ruby/src/master -I/home/opc/ruby/src/master/prism -I/home/opc/ruby/src/master/enc/unicode/15.0.0 I, [2024-05-26T00:54:08.199033 #463473] INFO -- : CPPFLAGS = I, [2024-05-26T00:54:08.199041 #463473] INFO -- : DLDFLAGS = -Wl,--compress-debug-sections=zlib -fstack-protector-strong -pie I, [2024-05-26T00:54:08.199063 #463473] INFO -- : SOLIBS = -lz -lrt -lrt -ldl -lcrypt -lm -lpthread I, [2024-05-26T00:54:08.199072 #463473] INFO -- : LANG = en_US.UTF-8 I, [2024-05-26T00:54:08.199080 #463473] INFO -- : LC_ALL = I, [2024-05-26T00:54:08.199088 #463473] INFO -- : LC_CTYPE = I, [2024-05-26T00:54:08.199096 #463473] INFO -- : MFLAGS = I, [2024-05-26T00:54:08.199104 #463473] INFO -- : RUSTC = rustc I, [2024-05-26T00:54:08.199112 #463473] INFO -- : YJIT_RUSTC_ARGS = --crate-name=yjit --crate-type=staticlib --edition=2021 -g -C lto=thin -C opt-level=3 -C overflow-checks=on '--out-dir=/home/opc/ruby/build/master/yjit/target/release/' /home/opc/ruby/src/master/yjit/src/lib.rs I, [2024-05-26T00:54:08.199820 #463473] INFO -- : gcc (GCC) 8.5.0 20210514 (Red Hat 8.5.0-10.1.0.1) I, [2024-05-26T00:54:08.199853 #463473] INFO -- : Copyright (C) 2018 Free Software Foundation, Inc. I, [2024-05-26T00:54:08.199863 #463473] INFO -- : This is free software; see the source for copying conditions. There is NO I, [2024-05-26T00:54:08.199872 #463473] INFO -- : warranty; not even for MERCHANTABILITY or FITNESS FOR A PARTICULAR PURPOSE. I, [2024-05-26T00:54:08.199881 #463473] INFO -- : I, [2024-05-26T00:54:08.355905 #463473] INFO -- : Checking leaked global symbols...none I, [2024-05-26T00:54:08.407510 #463473] INFO -- : /home/opc/ruby/src/master/basictest/test.rb:assignment ....................................................................................................................................................................................................................................................................................................................................................................................OK 372 I, [2024-05-26T00:54:08.407583 #463473] INFO -- : /home/opc/ruby/src/master/basictest/test.rb:condition ..OK 2 I, [2024-05-26T00:54:08.407608 #463473] INFO -- : /home/opc/ruby/src/master/basictest/test.rb:if/unless ...OK 3 I, [2024-05-26T00:54:08.407653 #463473] INFO -- : /home/opc/ruby/src/master/basictest/test.rb:case .....OK 5 I, [2024-05-26T00:54:08.408247 #463473] INFO -- : /home/opc/ruby/src/master/basictest/test.rb:while/until ........OK 8 I, [2024-05-26T00:54:08.408369 #463473] INFO -- : /home/opc/ruby/src/master/basictest/test.rb:exception ..........OK 10 I, [2024-05-26T00:54:08.409009 #463473] INFO -- : /home/opc/ruby/src/master/basictest/test.rb:array .......................................OK 39 I, [2024-05-26T00:54:08.409285 #463473] INFO -- : /home/opc/ruby/src/master/basictest/test.rb:hash ...........................OK 27 I, [2024-05-26T00:54:08.411081 #463473] INFO -- : /home/opc/ruby/src/master/basictest/test.rb:iterator ...........................................................................................................OK 107 I, [2024-05-26T00:54:08.411803 #463473] INFO -- : /home/opc/ruby/src/master/basictest/test.rb:float ................................................................................OK 80 I, [2024-05-26T00:54:08.415387 #463473] INFO -- : /home/opc/ruby/src/master/basictest/test.rb:bignum ...............................OK 31 I, [2024-05-26T00:54:08.416954 #463473] INFO -- : /home/opc/ruby/src/master/basictest/test.rb:string & char ..............................................................OK 62 I, [2024-05-26T00:54:08.417037 #463473] INFO -- : /home/opc/ruby/src/master/basictest/test.rb:assignment ..........OK 10 I, [2024-05-26T00:54:08.417108 #463473] INFO -- : /home/opc/ruby/src/master/basictest/test.rb:call ......OK 6 I, [2024-05-26T00:54:08.417253 #463473] INFO -- : /home/opc/ruby/src/master/basictest/test.rb:proc .........OK 9 I, [2024-05-26T00:54:08.517561 #463473] INFO -- : /home/opc/ruby/src/master/basictest/test.rb:signal ..OK 2 I, [2024-05-26T00:54:08.519198 #463473] INFO -- : /home/opc/ruby/src/master/basictest/test.rb:eval ...........................OK 27 I, [2024-05-26T00:54:08.656962 #463473] INFO -- : /home/opc/ruby/src/master/basictest/test.rb:system ........OK 8 I, [2024-05-26T00:54:08.657028 #463473] INFO -- : /home/opc/ruby/src/master/basictest/test.rb:const .....OK 5 I, [2024-05-26T00:54:08.657131 #463473] INFO -- : /home/opc/ruby/src/master/basictest/test.rb:clone .....OK 5 I, [2024-05-26T00:54:08.657373 #463473] INFO -- : /home/opc/ruby/src/master/basictest/test.rb:marshal ....OK 4 I, [2024-05-26T00:54:08.657487 #463473] INFO -- : /home/opc/ruby/src/master/basictest/test.rb:pack ....OK 4 I, [2024-05-26T00:54:08.657519 #463473] INFO -- : /home/opc/ruby/src/master/basictest/test.rb:math ..OK 2 I, [2024-05-26T00:54:08.657613 #463473] INFO -- : /home/opc/ruby/src/master/basictest/test.rb:struct ......OK 6 I, [2024-05-26T00:54:08.657810 #463473] INFO -- : /home/opc/ruby/src/master/basictest/test.rb:variable ............OK 12 I, [2024-05-26T00:54:08.657854 #463473] INFO -- : /home/opc/ruby/src/master/basictest/test.rb:trace ...OK 3 I, [2024-05-26T00:54:08.657991 #463473] INFO -- : /home/opc/ruby/src/master/basictest/test.rb:defined? ............OK 12 I, [2024-05-26T00:54:08.658083 #463473] INFO -- : /home/opc/ruby/src/master/basictest/test.rb:alias ......OK 6 I, [2024-05-26T00:54:08.658667 #463473] INFO -- : /home/opc/ruby/src/master/basictest/test.rb:path .......................OK 23 I, [2024-05-26T00:54:08.728797 #463473] INFO -- : /home/opc/ruby/src/master/basictest/test.rb:gc ....OK 4 I, [2024-05-26T00:54:08.730669 #463473] INFO -- : I, [2024-05-26T00:54:08.730693 #463473] INFO -- : test succeeded I, [2024-05-26T00:54:08.731220 #463473] INFO -- : $$$[end] "make yes-test-basic TESTS='-j3'" exit with 0. I, [2024-05-26T00:54:08.731372 #463473] INFO -- : $$$[beg] make yes-test-all TESTOPTS='--stderr-on-failure' TESTS='-j3' I, [2024-05-26T00:54:08.856171 #463473] INFO -- : BASERUBY = /usr/local/bin/ruby --disable=gems I, [2024-05-26T00:54:08.856247 #463473] INFO -- : CC = gcc I, [2024-05-26T00:54:08.856258 #463473] INFO -- : LD = ld I, [2024-05-26T00:54:08.856267 #463473] INFO -- : LDSHARED = gcc -shared I, [2024-05-26T00:54:08.856278 #463473] INFO -- : CFLAGS = -O3 -fno-fast-math -ggdb3 -Wall -Wextra -Wdeprecated-declarations -Wdiv-by-zero -Wduplicated-cond -Wimplicit-function-declaration -Wimplicit-int -Wpointer-arith -Wwrite-strings -Wold-style-definition -Wimplicit-fallthrough=0 -Wmissing-noreturn -Wno-cast-function-type -Wno-constant-logical-operand -Wno-long-long -Wno-missing-field-initializers -Wno-overlength-strings -Wno-packed-bitfield-compat -Wno-parentheses-equality -Wno-self-assign -Wno-tautological-compare -Wno-unused-parameter -Wno-unused-value -Wsuggest-attribute=format -Wsuggest-attribute=noreturn -Wunused-variable -Wmisleading-indentation -Wundef I, [2024-05-26T00:54:08.856287 #463473] INFO -- : XCFLAGS = -U_FORTIFY_SOURCE -D_FORTIFY_SOURCE=2 -fstack-protector-strong -msign-return-address=all -fno-strict-overflow -fvisibility=hidden -fexcess-precision=standard -DRUBY_EXPORT -fPIE -I. -I.ext/include/aarch64-linux -I/home/opc/ruby/src/master/include -I/home/opc/ruby/src/master -I/home/opc/ruby/src/master/prism -I/home/opc/ruby/src/master/enc/unicode/15.0.0 I, [2024-05-26T00:54:08.856296 #463473] INFO -- : CPPFLAGS = I, [2024-05-26T00:54:08.856304 #463473] INFO -- : DLDFLAGS = -Wl,--compress-debug-sections=zlib -fstack-protector-strong -pie I, [2024-05-26T00:54:08.856313 #463473] INFO -- : SOLIBS = -lz -lrt -lrt -ldl -lcrypt -lm -lpthread I, [2024-05-26T00:54:08.856321 #463473] INFO -- : LANG = en_US.UTF-8 I, [2024-05-26T00:54:08.856329 #463473] INFO -- : LC_ALL = I, [2024-05-26T00:54:08.856336 #463473] INFO -- : LC_CTYPE = I, [2024-05-26T00:54:08.856344 #463473] INFO -- : MFLAGS = I, [2024-05-26T00:54:08.856352 #463473] INFO -- : RUSTC = rustc I, [2024-05-26T00:54:08.856360 #463473] INFO -- : YJIT_RUSTC_ARGS = --crate-name=yjit --crate-type=staticlib --edition=2021 -g -C lto=thin -C opt-level=3 -C overflow-checks=on '--out-dir=/home/opc/ruby/build/master/yjit/target/release/' /home/opc/ruby/src/master/yjit/src/lib.rs I, [2024-05-26T00:54:08.857089 #463473] INFO -- : gcc (GCC) 8.5.0 20210514 (Red Hat 8.5.0-10.1.0.1) I, [2024-05-26T00:54:08.857111 #463473] INFO -- : Copyright (C) 2018 Free Software Foundation, Inc. I, [2024-05-26T00:54:08.857120 #463473] INFO -- : This is free software; see the source for copying conditions. There is NO I, [2024-05-26T00:54:08.857129 #463473] INFO -- : warranty; not even for MERCHANTABILITY or FITNESS FOR A PARTICULAR PURPOSE. I, [2024-05-26T00:54:08.857137 #463473] INFO -- : I, [2024-05-26T00:54:08.859295 #463473] INFO -- : generating enc.mk I, [2024-05-26T00:54:09.087757 #463473] INFO -- : generating encdb.h I, [2024-05-26T00:54:09.124530 #463473] INFO -- : encdb.h unchanged I, [2024-05-26T00:54:09.125730 #463473] INFO -- : making enc I, [2024-05-26T00:54:09.153097 #463473] INFO -- : make[1]: Entering directory '/home/opc/ruby/build/master' I, [2024-05-26T00:54:09.153171 #463473] INFO -- : make[1]: Nothing to be done for 'enc'. I, [2024-05-26T00:54:09.153184 #463473] INFO -- : make[1]: Leaving directory '/home/opc/ruby/build/master' I, [2024-05-26T00:54:09.153882 #463473] INFO -- : making srcs under enc I, [2024-05-26T00:54:09.195942 #463473] INFO -- : make[1]: Entering directory '/home/opc/ruby/build/master' I, [2024-05-26T00:54:09.196018 #463473] INFO -- : make[1]: Nothing to be done for 'srcs'. I, [2024-05-26T00:54:09.196029 #463473] INFO -- : make[1]: Leaving directory '/home/opc/ruby/build/master' I, [2024-05-26T00:54:09.197142 #463473] INFO -- : generating transdb.h I, [2024-05-26T00:54:09.341543 #463473] INFO -- : transdb.h unchanged I, [2024-05-26T00:54:09.342869 #463473] INFO -- : making trans I, [2024-05-26T00:54:09.391760 #463473] INFO -- : make[1]: Entering directory '/home/opc/ruby/build/master' I, [2024-05-26T00:54:09.391821 #463473] INFO -- : make[1]: Nothing to be done for 'trans'. I, [2024-05-26T00:54:09.391832 #463473] INFO -- : make[1]: Leaving directory '/home/opc/ruby/build/master' I, [2024-05-26T00:54:09.392557 #463473] INFO -- : making encs I, [2024-05-26T00:54:09.445702 #463473] INFO -- : make[1]: Entering directory '/home/opc/ruby/build/master' I, [2024-05-26T00:54:09.445752 #463473] INFO -- : make[1]: Nothing to be done for 'encs'. I, [2024-05-26T00:54:09.445762 #463473] INFO -- : make[1]: Leaving directory '/home/opc/ruby/build/master' I, [2024-05-26T00:54:09.447794 #463473] INFO -- : generating makefiles ext/configure-ext.mk I, [2024-05-26T00:54:09.488527 #463473] INFO -- : ext/configure-ext.mk updated I, [2024-05-26T00:54:09.491886 #463473] INFO -- : make[1]: Entering directory '/home/opc/ruby/build/master' I, [2024-05-26T00:54:11.635886 #463473] INFO -- : make[1]: Leaving directory '/home/opc/ruby/build/master' I, [2024-05-26T00:54:11.636659 #463473] INFO -- : generating makefile exts.mk I, [2024-05-26T00:54:11.696151 #463473] INFO -- : exts.mk unchanged I, [2024-05-26T00:54:11.701043 #463473] INFO -- : make[1]: Entering directory '/home/opc/ruby/build/master' I, [2024-05-26T00:54:11.999916 #463473] INFO -- : make[2]: Entering directory '/home/opc/ruby/build/master/ext/coverage' I, [2024-05-26T00:54:12.004725 #463473] INFO -- : make[2]: Leaving directory '/home/opc/ruby/build/master/ext/coverage' I, [2024-05-26T00:54:12.010394 #463473] INFO -- : make[2]: Entering directory '/home/opc/ruby/build/master/ext/date' I, [2024-05-26T00:54:12.015644 #463473] INFO -- : make[2]: Leaving directory '/home/opc/ruby/build/master/ext/date' I, [2024-05-26T00:54:12.018902 #463473] INFO -- : make[2]: Entering directory '/home/opc/ruby/build/master/ext/digest' I, [2024-05-26T00:54:12.027718 #463473] INFO -- : make[2]: Leaving directory '/home/opc/ruby/build/master/ext/digest' I, [2024-05-26T00:54:12.049982 #463473] INFO -- : make[2]: Entering directory '/home/opc/ruby/build/master/ext/digest/sha2' I, [2024-05-26T00:54:12.054827 #463473] INFO -- : make[2]: Leaving directory '/home/opc/ruby/build/master/ext/digest/sha2' I, [2024-05-26T00:54:12.072869 #463473] INFO -- : make[2]: Entering directory '/home/opc/ruby/build/master/ext/fiddle' I, [2024-05-26T00:54:12.083048 #463473] INFO -- : make[2]: Leaving directory '/home/opc/ruby/build/master/ext/fiddle' I, [2024-05-26T00:54:12.087439 #463473] INFO -- : make[2]: Entering directory '/home/opc/ruby/build/master/ext/io/console' I, [2024-05-26T00:54:12.091655 #463473] INFO -- : make[2]: Leaving directory '/home/opc/ruby/build/master/ext/io/console' I, [2024-05-26T00:54:12.102478 #463473] INFO -- : make[2]: Entering directory '/home/opc/ruby/build/master/ext/json' I, [2024-05-26T00:54:12.111948 #463473] INFO -- : make[2]: Leaving directory '/home/opc/ruby/build/master/ext/json' I, [2024-05-26T00:54:12.125027 #463473] INFO -- : make[2]: Entering directory '/home/opc/ruby/build/master/ext/monitor' I, [2024-05-26T00:54:12.129123 #463473] INFO -- : make[2]: Leaving directory '/home/opc/ruby/build/master/ext/monitor' I, [2024-05-26T00:54:12.135545 #463473] INFO -- : make[2]: Entering directory '/home/opc/ruby/build/master/ext/objspace' I, [2024-05-26T00:54:12.141414 #463473] INFO -- : make[2]: Leaving directory '/home/opc/ruby/build/master/ext/objspace' I, [2024-05-26T00:54:12.160938 #463473] INFO -- : make[2]: Entering directory '/home/opc/ruby/build/master/ext/openssl' I, [2024-05-26T00:54:12.182772 #463473] INFO -- : make[2]: Leaving directory '/home/opc/ruby/build/master/ext/openssl' I, [2024-05-26T00:54:12.187015 #463473] INFO -- : make[2]: Entering directory '/home/opc/ruby/build/master/ext/pathname' I, [2024-05-26T00:54:12.191105 #463473] INFO -- : make[2]: Leaving directory '/home/opc/ruby/build/master/ext/pathname' I, [2024-05-26T00:54:12.197419 #463473] INFO -- : make[2]: Entering directory '/home/opc/ruby/build/master/ext/psych' I, [2024-05-26T00:54:12.219061 #463473] INFO -- : make[2]: Leaving directory '/home/opc/ruby/build/master/ext/psych' I, [2024-05-26T00:54:12.223435 #463473] INFO -- : make[2]: Entering directory '/home/opc/ruby/build/master/ext/pty' I, [2024-05-26T00:54:12.227585 #463473] INFO -- : make[2]: Leaving directory '/home/opc/ruby/build/master/ext/pty' I, [2024-05-26T00:54:12.241261 #463473] INFO -- : make[2]: Entering directory '/home/opc/ruby/build/master/ext/ripper' I, [2024-05-26T00:54:12.248829 #463473] INFO -- : make[2]: Leaving directory '/home/opc/ruby/build/master/ext/ripper' I, [2024-05-26T00:54:12.250760 #463473] INFO -- : make[2]: Entering directory '/home/opc/ruby/build/master/ext/rubyvm' I, [2024-05-26T00:54:12.254224 #463473] INFO -- : make[2]: Leaving directory '/home/opc/ruby/build/master/ext/rubyvm' I, [2024-05-26T00:54:12.266582 #463473] INFO -- : make[2]: Entering directory '/home/opc/ruby/build/master/ext/socket' I, [2024-05-26T00:54:12.277146 #463473] INFO -- : make[2]: Leaving directory '/home/opc/ruby/build/master/ext/socket' I, [2024-05-26T00:54:12.293084 #463473] INFO -- : make[2]: Entering directory '/home/opc/ruby/build/master/.bundle/gems/bigdecimal-3.1.7/ext/bigdecimal' I, [2024-05-26T00:54:12.323486 #463473] INFO -- : make[2]: Leaving directory '/home/opc/ruby/build/master/.bundle/gems/bigdecimal-3.1.7/ext/bigdecimal' I, [2024-05-26T00:54:12.326209 #463473] INFO -- : make[2]: Entering directory '/home/opc/ruby/build/master/.bundle/gems/bigdecimal-3.1.8/ext/bigdecimal' I, [2024-05-26T00:54:12.356167 #463473] INFO -- : make[2]: Leaving directory '/home/opc/ruby/build/master/.bundle/gems/bigdecimal-3.1.8/ext/bigdecimal' I, [2024-05-26T00:54:12.358808 #463473] INFO -- : make[2]: Entering directory '/home/opc/ruby/build/master/.bundle/gems/debug-1.9.2/ext/debug' I, [2024-05-26T00:54:12.388877 #463473] INFO -- : make[2]: Leaving directory '/home/opc/ruby/build/master/.bundle/gems/debug-1.9.2/ext/debug' I, [2024-05-26T00:54:12.391438 #463473] INFO -- : make[2]: Entering directory '/home/opc/ruby/build/master/.bundle/gems/nkf-0.2.0/ext/nkf' I, [2024-05-26T00:54:12.421356 #463473] INFO -- : make[2]: Leaving directory '/home/opc/ruby/build/master/.bundle/gems/nkf-0.2.0/ext/nkf' I, [2024-05-26T00:54:12.423816 #463473] INFO -- : make[2]: Entering directory '/home/opc/ruby/build/master/.bundle/gems/racc-1.7.3/ext/racc/cparse' I, [2024-05-26T00:54:12.453909 #463473] INFO -- : make[2]: Leaving directory '/home/opc/ruby/build/master/.bundle/gems/racc-1.7.3/ext/racc/cparse' I, [2024-05-26T00:54:12.456452 #463473] INFO -- : make[2]: Entering directory '/home/opc/ruby/build/master/.bundle/gems/racc-1.8.0/ext/racc/cparse' I, [2024-05-26T00:54:12.486974 #463473] INFO -- : make[2]: Leaving directory '/home/opc/ruby/build/master/.bundle/gems/racc-1.8.0/ext/racc/cparse' I, [2024-05-26T00:54:12.489994 #463473] INFO -- : make[2]: Entering directory '/home/opc/ruby/build/master/.bundle/gems/rbs-3.4.4/ext/rbs_extension' I, [2024-05-26T00:54:12.520388 #463473] INFO -- : make[2]: Leaving directory '/home/opc/ruby/build/master/.bundle/gems/rbs-3.4.4/ext/rbs_extension' I, [2024-05-26T00:54:12.522971 #463473] INFO -- : make[2]: Entering directory '/home/opc/ruby/build/master/.bundle/gems/syslog-0.1.2/ext/syslog' I, [2024-05-26T00:54:12.553407 #463473] INFO -- : make[2]: Leaving directory '/home/opc/ruby/build/master/.bundle/gems/syslog-0.1.2/ext/syslog' I, [2024-05-26T00:54:12.591914 #463473] INFO -- : make[2]: Entering directory '/home/opc/ruby/build/master' I, [2024-05-26T00:54:12.674646 #463473] INFO -- : make[2]: 'ruby' is up to date. I, [2024-05-26T00:54:12.674717 #463473] INFO -- : make[2]: Leaving directory '/home/opc/ruby/build/master' I, [2024-05-26T00:54:12.674843 #463473] INFO -- : make[1]: Leaving directory '/home/opc/ruby/build/master' I, [2024-05-26T00:54:12.679398 #463473] INFO -- : make[1]: Entering directory '/home/opc/ruby/build/master' I, [2024-05-26T00:54:12.679448 #463473] INFO -- : make[1]: Nothing to be done for 'note'. I, [2024-05-26T00:54:12.679462 #463473] INFO -- : make[1]: Leaving directory '/home/opc/ruby/build/master' I, [2024-05-26T00:54:12.792864 #463473] INFO -- : Run options: I, [2024-05-26T00:54:12.792935 #463473] INFO -- : --seed=47900 I, [2024-05-26T00:54:12.792946 #463473] INFO -- : "--ruby=./miniruby -I/home/opc/ruby/src/master/lib -I. -I.ext/common /home/opc/ruby/src/master/tool/runruby.rb --extout=.ext -- --disable-gems" I, [2024-05-26T00:54:12.792955 #463473] INFO -- : --excludes-dir=/home/opc/ruby/src/master/test/.excludes I, [2024-05-26T00:54:12.792964 #463473] INFO -- : --name=!/memory_leak/ I, [2024-05-26T00:54:12.792972 #463473] INFO -- : --stderr-on-failure I, [2024-05-26T00:54:12.792980 #463473] INFO -- : -j3 I, [2024-05-26T00:54:12.792988 #463473] INFO -- : I, [2024-05-26T00:54:12.792997 #463473] INFO -- : # Running tests: I, [2024-05-26T00:54:12.793004 #463473] INFO -- : I, [2024-05-26T00:54:12.925791 #463473] INFO -- : [ 1/883] 504442=test_clone I, [2024-05-26T00:54:12.930682 #463473] INFO -- : [ 2/883] 504441=test_enc_raise I, [2024-05-26T00:54:12.935024 #463473] INFO -- : [ 3/883] 504443=test_gem_uri_formatter I, [2024-05-26T00:54:12.943887 #463473] INFO -- : [ 4/883] 504441=test_prettyprint I, [2024-05-26T00:54:12.955486 #463473] INFO -- : [ 5/883] 504441=test_ole_methods I, [2024-05-26T00:54:12.980995 #463473] INFO -- : [ 6/883] 504441=test_cgi_util I, [2024-05-26T00:54:13.104203 #463473] INFO -- : [ 7/883] 504442=test_gc_compact I, [2024-05-26T00:54:13.136649 #463473] INFO -- : [ 8/883] 504443=test_rdoc_i18n_locale I, [2024-05-26T00:54:13.192734 #463473] INFO -- : [ 9/883] 504441=test_dryrun I, [2024-05-26T00:54:13.220105 #463473] INFO -- : [ 10/883] 504441=test_queue I, [2024-05-26T00:54:13.278100 #463473] INFO -- : [ 11/883] 504441=test_gem_resolver_lock_specification I, [2024-05-26T00:54:13.310892 #463473] INFO -- : [ 12/883] 504443=test_boolean I, [2024-05-26T00:54:13.322799 #463473] INFO -- : [ 13/883] 504443=regexp_test I, [2024-05-26T00:54:13.406730 #463473] INFO -- : [ 14/883] 504443=test_yield I, [2024-05-26T00:54:13.478154 #463473] INFO -- : [ 15/883] 504441=test_remote_fetch_error I, [2024-05-26T00:54:13.556246 #463473] INFO -- : [ 16/883] 504441=test_show_source I, [2024-05-26T00:54:13.618189 #463473] INFO -- : [ 17/883] 504441=test_shift_jis I, [2024-05-26T00:54:13.618993 #463473] INFO -- : [ 18/883] 504441=test_rdoc_store I, [2024-05-26T00:54:14.484528 #463473] INFO -- : [ 19/883] 504441=test_files_sample I, [2024-05-26T00:54:14.494823 #463473] INFO -- : [ 20/883] 504441=test_rdoc_stats I, [2024-05-26T00:54:14.586731 #463473] INFO -- : [ 21/883] 504441=test_data_error I, [2024-05-26T00:54:14.791644 #463473] INFO -- : [ 22/883] 504441=test_rubyoptions I, [2024-05-26T00:54:15.153734 #463473] INFO -- : [ 23/883] 504442=test_optimization I, [2024-05-26T00:54:16.100590 #463473] INFO -- : [ 24/883] 504443=test_force_exit I, [2024-05-26T00:54:16.104463 #463473] INFO -- : [ 25/883] 504443=test_arity I, [2024-05-26T00:54:16.111836 #463473] INFO -- : [ 26/883] 504443=test_thread I, [2024-05-26T00:54:16.136537 #463473] INFO -- : [ 27/883] 504443=test_pkey_ec I, [2024-05-26T00:54:16.168746 #463473] INFO -- : [ 28/883] 504443=test_svcb_https I, [2024-05-26T00:54:16.179895 #463473] INFO -- : [ 29/883] 504443=test_buffering I, [2024-05-26T00:54:16.190441 #463473] INFO -- : [ 30/883] 504443=test_key_event_record I, [2024-05-26T00:54:16.191141 #463473] INFO -- : [ 31/883] 504443=test_mdns I, [2024-05-26T00:54:16.253920 #463473] INFO -- : [ 32/883] 504443=test_open3 I, [2024-05-26T00:54:18.806917 #463473] INFO -- : [ 33/883] 504443=test_date_parse I, [2024-05-26T00:54:18.933946 #463473] INFO -- : [ 34/883] 504443=test_ractor I, [2024-05-26T00:54:18.962612 #463473] INFO -- : [ 35/883] 504443=test_rdoc_rubygems_hook I, [2024-05-26T00:54:19.074354 #463473] INFO -- : [ 36/883] 504443=test_gem_resolver_api_specification I, [2024-05-26T00:54:19.152782 #463473] INFO -- : [ 37/883] 504443=test_webauthn_listener I, [2024-05-26T00:54:19.210486 #463473] INFO -- : Leaked file descriptor: WebauthnListenerTest#test_wait_for_otp_code_options_request: 9 : # I, [2024-05-26T00:54:19.241695 #463473] INFO -- : COMMAND PID USER FD TYPE DEVICE SIZE/OFF NODE NAME I, [2024-05-26T00:54:19.241834 #463473] INFO -- : ruby 504443 opc 9u IPv4 3144312601 0t0 TCP localhost:42009->localhost:52946 (CLOSE_WAIT) I, [2024-05-26T00:54:19.270350 #463473] INFO -- : .Closed file descriptor: WebauthnListenerTest#test_wait_for_otp_code_no_params_response: 9 I, [2024-05-26T00:54:19.282911 #463473] INFO -- : [ 38/883] 504443=test_rational I, [2024-05-26T00:54:19.296914 #463473] INFO -- : [ 39/883] 504443=test_case_mapping I, [2024-05-26T00:54:19.321365 #463473] INFO -- : [ 40/883] 504443=test_gem_ext_cargo_builder_unit I, [2024-05-26T00:54:19.347521 #463473] INFO -- : [ 41/883] 504443=test_grapheme_breaks I, [2024-05-26T00:54:19.364111 #463473] INFO -- : [ 42/883] 504443=test_hash_create I, [2024-05-26T00:54:19.372112 #463473] INFO -- : [ 43/883] 504443=test_enumerable I, [2024-05-26T00:54:19.393529 #463473] INFO -- : [ 44/883] 504443=test_rdoc_method_attr I, [2024-05-26T00:54:19.503693 #463473] INFO -- : [ 45/883] 504443=test_set I, [2024-05-26T00:54:19.530629 #463473] INFO -- : [ 46/883] 504443=test_tree_spell_checker I, [2024-05-26T00:54:19.554060 #463473] INFO -- : [ 47/883] 504443=static_literals_test I, [2024-05-26T00:54:19.557830 #463473] INFO -- : [ 48/883] 504443=test_backtrace I, [2024-05-26T00:54:19.565107 #463473] INFO -- : [ 49/883] 504443=test_gbk I, [2024-05-26T00:54:19.583028 #463473] INFO -- : [ 50/883] 504443=test_gem_commands_dependency_command I, [2024-05-26T00:54:19.666996 #463473] INFO -- : [ 51/883] 504443=test_yamldbm I, [2024-05-26T00:54:19.679404 #463473] INFO -- : [ 52/883] 504443=test_gem_spec_fetcher I, [2024-05-26T00:54:19.850950 #463473] INFO -- : [ 53/883] 504443=test_unicode_escape I, [2024-05-26T00:54:19.933634 #463473] INFO -- : [ 54/883] 504443=test_default_gems I, [2024-05-26T00:54:19.995871 #463473] INFO -- : [ 55/883] 504443=test_switch_hitter I, [2024-05-26T00:54:20.010436 #463473] INFO -- : [ 56/883] 504443=test_rendering I, [2024-05-26T00:54:20.052139 #463473] INFO -- : [ 57/883] 504443=test_kernel I, [2024-05-26T00:54:20.087570 #463473] INFO -- : .Leaked file descriptor: TestRubyOptions#test_script_from_stdin: 10 # I, [2024-05-26T00:54:20.112637 #463473] INFO -- : COMMAND PID USER FD TYPE DEVICE SIZE/OFF NODE NAME I, [2024-05-26T00:54:20.112702 #463473] INFO -- : ruby 504441 opc 10r REG 252,0 6940392 13705429 /var/lib/sss/mc/group I, [2024-05-26T00:54:20.599519 #463473] INFO -- : [ 58/883] 504443=pattern_test I, [2024-05-26T00:54:20.612660 #463473] INFO -- : [ 59/883] 504443=test_dot_dot I, [2024-05-26T00:54:20.621243 #463473] INFO -- : [ 60/883] 504443=test_gem_rdoc I, [2024-05-26T00:54:20.758187 #463473] INFO -- : [ 61/883] 504443=test_string I, [2024-05-26T00:54:20.769274 #463473] INFO -- : [ 62/883] 504443=test_iterator I, [2024-05-26T00:54:20.846483 #463473] INFO -- : [ 63/883] 504443=test_gem_commands_install_command I, [2024-05-26T00:54:21.240443 #463473] INFO -- : [ 64/883] 504441=test_storage I, [2024-05-26T00:54:21.247390 #463473] INFO -- : [ 65/883] 504441=test_err_in_callback I, [2024-05-26T00:54:21.250107 #463473] INFO -- : [ 66/883] 504441=test_method_name_check I, [2024-05-26T00:54:21.303881 #463473] INFO -- : [ 67/883] 504441=test_merge_keys I, [2024-05-26T00:54:21.312919 #463473] INFO -- : [ 68/883] 504441=test_did_you_mean I, [2024-05-26T00:54:21.422566 #463473] INFO -- : [ 69/883] 504441=test_shapes I, [2024-05-26T00:54:21.427183 #463473] INFO -- : [ 70/883] 504441=test_cesu8 I, [2024-05-26T00:54:21.438218 #463473] INFO -- : [ 71/883] 504441=test_rdoc_extend I, [2024-05-26T00:54:21.453831 #463473] INFO -- : [ 72/883] 504441=test_array_create I, [2024-05-26T00:54:21.458073 #463473] INFO -- : [ 73/883] 504441=test_memory_view I, [2024-05-26T00:54:21.607287 #463473] INFO -- : [ 74/883] 504441=test_dir_m17n I, [2024-05-26T00:54:22.112109 #463473] INFO -- : [ 75/883] 504442=test_threadgroup I, [2024-05-26T00:54:22.557013 #463473] INFO -- : [ 76/883] 504443=test_complex I, [2024-05-26T00:54:22.633633 #463473] INFO -- : [ 77/883] 504443=test_fd_setsize I, [2024-05-26T00:54:22.644780 #463473] INFO -- : [ 78/883] 504443=test_forwardable I, [2024-05-26T00:54:22.657770 #463473] INFO -- : [ 79/883] 504443=test_process I, [2024-05-26T00:54:22.688121 #463473] INFO -- : [ 80/883] 504443=!Nothing_to_test I, [2024-05-26T00:54:22.693724 #463473] INFO -- : [ 81/883] 504443=test_gem_commands_open_command I, [2024-05-26T00:54:22.763616 #463473] INFO -- : [ 82/883] 504441=test_verbose I, [2024-05-26T00:54:22.773882 #463473] INFO -- : [ 83/883] 504443=test_emoji_breaks I, [2024-05-26T00:54:22.778092 #463473] INFO -- : [ 84/883] 504443=test_normalize I, [2024-05-26T00:54:22.780481 #463473] INFO -- : [ 85/883] 504443=test_gem_update_suggestion I, [2024-05-26T00:54:22.780594 #463473] INFO -- : [ 86/883] 504443=test_assignment I, [2024-05-26T00:54:22.789223 #463473] INFO -- : [ 87/883] 504441=test_gem_command I, [2024-05-26T00:54:22.898412 #463473] INFO -- : [ 88/883] 504441=test_asn1 I, [2024-05-26T00:54:22.902830 #463473] INFO -- : [ 89/883] 504441=test_undef I, [2024-05-26T00:54:22.904456 #463473] INFO -- : [ 90/883] 504441=test_random I, [2024-05-26T00:54:22.920306 #463473] INFO -- : [ 91/883] 504441=test_gem_resolver_lock_set I, [2024-05-26T00:54:22.940805 #463473] INFO -- : [ 92/883] 504441=test_rdoc_generator_darkfish I, [2024-05-26T00:54:23.145120 #463473] INFO -- : [ 93/883] 504442=test_gem_impossible_dependencies_error I, [2024-05-26T00:54:23.267985 #463473] INFO -- : [ 94/883] 504441=test_pp I, [2024-05-26T00:54:23.275088 #463473] INFO -- : [ 95/883] 504442=test_gem_resolver_requirement_list I, [2024-05-26T00:54:23.284667 #463473] INFO -- : [ 96/883] 504442=test_noarg I, [2024-05-26T00:54:23.295413 #463473] INFO -- : .Leaked file descriptor: PPTestModule::PPFileStatTest#test_nothing_raised: 7 # I, [2024-05-26T00:54:23.317438 #463473] INFO -- : COMMAND PID USER FD TYPE DEVICE SIZE/OFF NODE NAME I, [2024-05-26T00:54:23.317501 #463473] INFO -- : ruby 504441 opc 7r REG 252,0 9253600 13705411 /var/lib/sss/mc/passwd I, [2024-05-26T00:54:23.345666 #463473] INFO -- : [ 97/883] 504441=test_exception I, [2024-05-26T00:54:23.356272 #463473] INFO -- : [ 98/883] 504441=test_arith_seq_beg_len_step I, [2024-05-26T00:54:23.413420 #463473] INFO -- : [ 99/883] 504441=test_raise_exception I, [2024-05-26T00:54:23.495184 #463473] INFO -- : [100/883] 504442=test_variable I, [2024-05-26T00:54:23.603303 #463473] INFO -- : [101/883] 504442=test_hash I, [2024-05-26T00:54:23.645484 #463473] INFO -- : [102/883] 504442=test_rdoc_tom_doc I, [2024-05-26T00:54:23.761274 #463473] INFO -- : [103/883] 504442=test_optarg I, [2024-05-26T00:54:23.864044 #463473] INFO -- : [104/883] 504442=test_gem_commands_pristine_command I, [2024-05-26T00:54:23.997750 #463473] INFO -- : [105/883] 504441=test_basicinstructions I, [2024-05-26T00:54:24.069273 #463473] INFO -- : [106/883] 504441=test_gem_resolver_git_specification I, [2024-05-26T00:54:24.084922 #463473] INFO -- : [107/883] 504443=test_utf32 I, [2024-05-26T00:54:24.092454 #463473] INFO -- : [108/883] 504443=test_gem_security I, [2024-05-26T00:54:24.403211 #463473] INFO -- : [109/883] 504441=test_key_actor_emacs I, [2024-05-26T00:54:24.706684 #463473] INFO -- : [110/883] 504441=test_date_ractor I, [2024-05-26T00:54:24.768657 #463473] INFO -- : [111/883] 504441=test_erb I, [2024-05-26T00:54:24.815775 #463473] INFO -- : [112/883] 504441=test_econv I, [2024-05-26T00:54:25.285318 #463473] INFO -- : [113/883] 504442=test_gem_install_update_options I, [2024-05-26T00:54:25.472119 #463473] INFO -- : [114/883] 504442=test_face I, [2024-05-26T00:54:25.503323 #463473] INFO -- : [115/883] 504442=test_gem_request_set_lockfile_parser I, [2024-05-26T00:54:25.657789 #463473] INFO -- : [116/883] 504442=test_sizeof I, [2024-05-26T00:54:25.700580 #463473] INFO -- : [117/883] 504441=test_date_attr I, [2024-05-26T00:54:25.709473 #463473] INFO -- : [118/883] 504441=test_stringchar I, [2024-05-26T00:54:25.834579 #463473] INFO -- : [119/883] 504441=warnings_test I, [2024-05-26T00:54:25.861321 #463473] INFO -- : [120/883] 504441=test_emoji I, [2024-05-26T00:54:25.952168 #463473] INFO -- : [121/883] 504441=test_sorted_set I, [2024-05-26T00:54:26.269556 #463473] INFO -- : [122/883] 504441=test_stack I, [2024-05-26T00:54:27.198290 #463473] INFO -- : [123/883] 504441=test_windows_1252 I, [2024-05-26T00:54:27.202220 #463473] INFO -- : [124/883] 504441=test_jaro_winkler I, [2024-05-26T00:54:27.211295 #463473] INFO -- : [125/883] 504441=test_cp949 I, [2024-05-26T00:54:27.219958 #463473] INFO -- : [126/883] 504441=test_gem_resolver_vendor_set I, [2024-05-26T00:54:27.240743 #463473] INFO -- : [127/883] 504441=test_condition I, [2024-05-26T00:54:27.249922 #463473] INFO -- : [128/883] 504441=test_gem_dependency_resolution_error I, [2024-05-26T00:54:27.270547 #463473] INFO -- : [129/883] 504441=test_fileutils I, [2024-05-26T00:54:27.782285 #463473] INFO -- : [130/883] 504441=test_sleep I, [2024-05-26T00:54:28.100211 #463473] INFO -- : [131/883] 504442=test_mixed_unicode_escapes I, [2024-05-26T00:54:28.105098 #463473] INFO -- : [132/883] 504442=test_win32ole_variable I, [2024-05-26T00:54:28.108059 #463473] INFO -- : [133/883] 504442=test_method_cache I, [2024-05-26T00:54:28.120584 #463473] INFO -- : [134/883] 504442=test_parse I, [2024-05-26T00:54:28.615410 #463473] INFO -- : [135/883] 504442=test_rdoc_cross_reference I, [2024-05-26T00:54:29.008972 #463473] INFO -- : [136/883] 504442=test_rdoc_class_module I, [2024-05-26T00:54:29.507926 #463473] INFO -- : [137/883] 504442=test_flush I, [2024-05-26T00:54:29.523271 #463473] INFO -- : [138/883] 504442=test_pkey_rsa I, [2024-05-26T00:54:29.813767 #463473] INFO -- : [139/883] 504442=test_system I, [2024-05-26T00:54:29.831065 #463473] INFO -- : [140/883] 504441=test_numhash I, [2024-05-26T00:54:29.854679 #463473] INFO -- : [141/883] 504441=test_gem_specification I, [2024-05-26T00:54:30.727120 #463473] INFO -- : [142/883] 504442=test_sprintf I, [2024-05-26T00:54:30.958322 #463473] INFO -- : [143/883] 504442=test_exit I, [2024-05-26T00:54:31.009066 #463473] INFO -- : [144/883] 504442=test_class I, [2024-05-26T00:54:31.365526 #463473] INFO -- : [145/883] 504443=test_rdoc_parser_rd I, [2024-05-26T00:54:31.398596 #463473] INFO -- : [146/883] 504443=index_write_test I, [2024-05-26T00:54:31.403170 #463473] INFO -- : [147/883] 504443=test_const I, [2024-05-26T00:54:31.409763 #463473] INFO -- : [148/883] 504443=test_recorder I, [2024-05-26T00:54:31.418458 #463473] INFO -- : [149/883] 504443=test_yaml_special_cases I, [2024-05-26T00:54:31.429952 #463473] INFO -- : [150/883] 504443=test_gem_commands_sources_command I, [2024-05-26T00:54:31.660938 #463473] INFO -- : [151/883] 504443=test_gem_source_list I, [2024-05-26T00:54:31.727368 #463473] INFO -- : [152/883] 504443=json_addition_test I, [2024-05-26T00:54:31.746016 #463473] INFO -- : [153/883] 504443=test_name_error I, [2024-05-26T00:54:31.856223 #463473] INFO -- : [154/883] 504443=ripper_test I, [2024-05-26T00:54:32.036888 #463473] INFO -- : [155/883] 504441=test_iso_8859 I, [2024-05-26T00:54:32.059282 #463473] INFO -- : [156/883] 504441=test_libs I, [2024-05-26T00:54:32.096394 #463473] INFO -- : [157/883] 504441=test_math I, [2024-05-26T00:54:32.125888 #463473] INFO -- : [158/883] 504441=test_gc I, [2024-05-26T00:54:32.127680 #463473] INFO -- : [159/883] 504441=test_qsort I, [2024-05-26T00:54:32.136943 #463473] INFO -- : [160/883] 504441=comments_test I, [2024-05-26T00:54:32.145224 #463473] INFO -- : [161/883] 504441=test_safe_load I, [2024-05-26T00:54:32.159962 #463473] INFO -- : [162/883] 504441=test_gem_command_manager I, [2024-05-26T00:54:32.370627 #463473] INFO -- : [163/883] 504441=test_rdoc_context I, [2024-05-26T00:54:32.456768 #463473] INFO -- : [164/883] 504443=test_array I, [2024-05-26T00:54:32.464812 #463473] INFO -- : [165/883] 504443=test_case I, [2024-05-26T00:54:32.482468 #463473] INFO -- : [166/883] 504443=test_open-uri I, [2024-05-26T00:54:32.938057 #463473] INFO -- : [167/883] 504443=test_enc_associate I, [2024-05-26T00:54:33.106345 #463473] INFO -- : [168/883] 504441=test_enumerator I, [2024-05-26T00:54:33.439276 #463473] INFO -- : [169/883] 504443=test_date_time I, [2024-05-26T00:54:33.447937 #463473] INFO -- : [170/883] 504443=test_nil2vtempty I, [2024-05-26T00:54:33.458057 #463473] INFO -- : [171/883] 504443=test_rdoc_generator_json_index I, [2024-05-26T00:54:33.498314 #463473] INFO -- : [172/883] 504443=test_cgi_tag_helper I, [2024-05-26T00:54:33.543433 #463473] INFO -- : [173/883] 504443=test_pack I, [2024-05-26T00:54:33.546519 #463473] INFO -- : [174/883] 504443=test_pinned I, [2024-05-26T00:54:33.615560 #463473] INFO -- : [175/883] 504443=test_framework I, [2024-05-26T00:54:33.628372 #463473] INFO -- : [176/883] 504442=test_weakmap I, [2024-05-26T00:54:33.635119 #463473] INFO -- : [177/883] 504443=test_coderange I, [2024-05-26T00:54:33.639475 #463473] INFO -- : [178/883] 504443=test_ansi_with_terminfo I, [2024-05-26T00:54:33.642038 #463473] INFO -- : [179/883] 504443=test_inadvertent_creation I, [2024-05-26T00:54:33.746765 #463473] INFO -- : [180/883] 504443=test_rdoc_task I, [2024-05-26T00:54:33.747231 #463473] INFO -- : [181/883] 504443=test_settracefunc I, [2024-05-26T00:54:34.632053 #463473] INFO -- : [182/883] 504443=test_gem_text I, [2024-05-26T00:54:34.817565 #463473] INFO -- : [183/883] 504443=test_tracepoint I, [2024-05-26T00:54:35.110996 #463473] INFO -- : [184/883] 504443=test_backtrace I, [2024-05-26T00:54:36.389369 #463473] INFO -- : [185/883] 504443=test_gem_source_local I, [2024-05-26T00:54:36.637923 #463473] INFO -- : [186/883] 504443=desugar_compiler_test I, [2024-05-26T00:54:36.642887 #463473] INFO -- : [187/883] 504443=test_internal_ivar I, [2024-05-26T00:54:36.650174 #463473] INFO -- : [188/883] 504443=test_win32ole I, [2024-05-26T00:54:36.663622 #463473] INFO -- : [189/883] 504443=test_rendering I, [2024-05-26T00:54:36.684156 #463473] INFO -- : [190/883] 504443=test_gem_gemcutter_utilities I, [2024-05-26T00:54:37.163610 #463473] INFO -- : [191/883] 504443=test_method_cache I, [2024-05-26T00:54:37.180637 #463473] INFO -- : [192/883] 504443=test_too_many_dummy_encodings I, [2024-05-26T00:54:37.223708 #463473] INFO -- : [193/883] 504442=test_sprintf_comb I, [2024-05-26T00:54:37.229339 #463473] INFO -- : [194/883] 504443=test_gem_commands_push_command I, [2024-05-26T00:54:37.384466 #463473] INFO -- : [195/883] 504442=locals_test I, [2024-05-26T00:54:37.878476 #463473] INFO -- : [196/883] 504442=test_gem_commands_which_command I, [2024-05-26T00:54:37.914498 #463473] INFO -- : [197/883] 504442=test_gem_request I, [2024-05-26T00:54:37.950087 #463473] INFO -- : [198/883] 504443=test_gem_package_old I, [2024-05-26T00:54:38.021859 #463473] INFO -- : [199/883] 504443=encoding_test I, [2024-05-26T00:54:38.152618 #463473] INFO -- : [200/883] 504443=test_scan_args I, [2024-05-26T00:54:38.160649 #463473] INFO -- : [201/883] 504442=test_gem_commands_specification_command I, [2024-05-26T00:54:38.175039 #463473] INFO -- : [202/883] 504443=test_http I, [2024-05-26T00:54:38.184149 #463473] INFO -- : [203/883] 504443=parser_test I, [2024-05-26T00:54:38.197382 #463473] INFO -- : [204/883] 504443=test_hash I, [2024-05-26T00:54:38.299014 #463473] INFO -- : [205/883] 504442=test_pty I, [2024-05-26T00:54:38.822756 #463473] INFO -- : [206/883] 504442=test_gem_dependency_installer I, [2024-05-26T00:54:41.381072 #463473] INFO -- : [207/883] 504442=test_pkcs12 I, [2024-05-26T00:54:42.010893 #463473] INFO -- : [208/883] 504442=test_json_tree I, [2024-05-26T00:54:42.016681 #463473] INFO -- : [209/883] 504442=test_koi8 I, [2024-05-26T00:54:42.071423 #463473] INFO -- : [210/883] 504442=test_gem_remote_fetcher I, [2024-05-26T00:54:42.193346 #463473] INFO -- : [211/883] 504443=test_parser_events I, [2024-05-26T00:54:42.303022 #463473] INFO -- : [212/883] 504443=test_filter I, [2024-05-26T00:54:42.327155 #463473] INFO -- : [213/883] 504443=test_gem_dependency I, [2024-05-26T00:54:42.487388 #463473] INFO -- : [214/883] 504443=test_yjit I, [2024-05-26T00:54:42.523545 #463473] INFO -- : [215/883] 504443=test_gem_uninstaller I, [2024-05-26T00:54:43.858647 #463473] INFO -- : [216/883] 504443=test_cclass I, [2024-05-26T00:54:43.980307 #463473] INFO -- : [217/883] 504443=test_method I, [2024-05-26T00:54:44.041678 #463473] INFO -- : [218/883] 504442=test_m17n I, [2024-05-26T00:54:44.131683 #463473] INFO -- : [219/883] 504442=test_argf I, [2024-05-26T00:54:47.981865 #463473] INFO -- : [220/883] 504442=test_yaml I, [2024-05-26T00:54:48.104631 #463473] INFO -- : [221/883] 504442=test_x509name I, [2024-05-26T00:54:48.115565 #463473] INFO -- : [222/883] 504442=test_rdoc_markup_to_rdoc I, [2024-05-26T00:54:48.173791 #463473] INFO -- : [223/883] 504442=attribute_write_test I, [2024-05-26T00:54:48.186400 #463473] INFO -- : [224/883] 504442=test_utf16 I, [2024-05-26T00:54:48.259357 #463473] INFO -- : [225/883] 504442=test_http I, [2024-05-26T00:54:49.217339 #463473] INFO -- : [226/883] 504441=test_set I, [2024-05-26T00:54:49.228919 #463473] INFO -- : [227/883] 504441=test_ractor I, [2024-05-26T00:54:49.229530 #463473] INFO -- : [228/883] 504441=test_case I, [2024-05-26T00:54:49.236973 #463473] INFO -- : [229/883] 504441=test_severity I, [2024-05-26T00:54:49.242796 #463473] INFO -- : [230/883] 504441=test_str2big I, [2024-05-26T00:54:49.257958 #463473] INFO -- : [231/883] 504441=test_gem_package_tar_writer I, [2024-05-26T00:54:49.383727 #463473] INFO -- : [232/883] 504441=test_big2str I, [2024-05-26T00:54:49.390951 #463473] INFO -- : [233/883] 504441=test_gem_resolver_specification I, [2024-05-26T00:54:49.418274 #463473] INFO -- : [234/883] 504441=test_logger I, [2024-05-26T00:54:49.440689 #463473] INFO -- : [235/883] 504441=test_pkey_dsa I, [2024-05-26T00:54:51.620436 #463473] INFO -- : [236/883] 504443=test_gem_commands_yank_command I, [2024-05-26T00:54:52.064578 #463473] INFO -- : [237/883] 504443=test_yaml_tree I, [2024-05-26T00:54:52.120902 #463473] INFO -- : [238/883] 504443=test_cstr I, [2024-05-26T00:54:52.623145 #463473] INFO -- : [239/883] 504441=test_gem_resolver_dependency_request I, [2024-05-26T00:54:52.657086 #463473] INFO -- : [240/883] 504441=test_command I, [2024-05-26T00:54:52.845726 #463473] INFO -- : [241/883] 504441=test_euc_tw I, [2024-05-26T00:54:52.851368 #463473] INFO -- : [242/883] 504441=test_psych I, [2024-05-26T00:54:52.890800 #463473] INFO -- : [243/883] 504441=test_nil I, [2024-05-26T00:54:52.929717 #463473] INFO -- : [244/883] 504441=test_wait I, [2024-05-26T00:54:53.001766 #463473] INFO -- : [245/883] 504441=test_import I, [2024-05-26T00:54:53.561960 #463473] INFO -- : [246/883] 504443=test_human_typo I, [2024-05-26T00:54:53.566806 #463473] INFO -- : [247/883] 504443=test_ldap I, [2024-05-26T00:54:53.571456 #463473] INFO -- : [248/883] 504443=test_kdf I, [2024-05-26T00:54:53.644793 #463473] INFO -- : [249/883] 504443=test_thread_queue I, [2024-05-26T00:54:54.370393 #463473] INFO -- : [250/883] 504441=test_nowrite I, [2024-05-26T00:54:54.390138 #463473] INFO -- : [251/883] 504441=test_passing_block I, [2024-05-26T00:54:54.398353 #463473] INFO -- : [252/883] 504441=test_defined I, [2024-05-26T00:54:54.471530 #463473] INFO -- : [253/883] 504441=test_io_buffer I, [2024-05-26T00:54:54.512973 #463473] INFO -- : [254/883] 504441=test_rdoc_rdoc I, [2024-05-26T00:54:54.582841 #463473] INFO -- : [255/883] 504441=test_yjit_exit_locations I, [2024-05-26T00:54:54.598169 #463473] INFO -- : [256/883] 504441=test_rdoc_markdown_test I, [2024-05-26T00:54:55.504688 #463473] INFO -- : [257/883] 504441=test_type_completor I, [2024-05-26T00:54:55.516669 #463473] INFO -- : [258/883] 504441=test_rdoc_normal_module I, [2024-05-26T00:54:55.550426 #463473] INFO -- : [259/883] 504441=test_io_timeout I, [2024-05-26T00:54:55.557965 #463473] INFO -- : [260/883] 504441=json_string_matching_test I, [2024-05-26T00:54:55.570369 #463473] INFO -- : [261/883] 504441=test_gem_config_file I, [2024-05-26T00:54:55.734533 #463473] INFO -- : [262/883] 504441=test_comparable I, [2024-05-26T00:54:55.746349 #463473] INFO -- : [263/883] 504441=test_webauthn_poller I, [2024-05-26T00:54:55.888631 #463473] INFO -- : [264/883] 504441=test_rdoc_markup_verbatim I, [2024-05-26T00:54:55.894457 #463473] INFO -- : [265/883] 504441=test_date_conv I, [2024-05-26T00:54:55.901836 #463473] INFO -- : [266/883] 504441=test_serialize_subclasses I, [2024-05-26T00:54:55.911600 #463473] INFO -- : [267/883] 504441=test_gem_resolver_index_specification I, [2024-05-26T00:54:55.960769 #463473] INFO -- : [268/883] 504441=test_frozen I, [2024-05-26T00:54:56.008253 #463473] INFO -- : [269/883] 504441=test_egrep_cpp I, [2024-05-26T00:54:56.051931 #463473] INFO -- : [270/883] 504441=test_erb_m17n I, [2024-05-26T00:54:56.058993 #463473] INFO -- : [271/883] 504441=test_rdoc_generator_pot_po_entry I, [2024-05-26T00:54:56.070021 #463473] INFO -- : [272/883] 504441=test_timeout I, [2024-05-26T00:54:56.084765 #463473] INFO -- : [273/883] 504441=test_pathname I, [2024-05-26T00:54:56.278485 #463473] INFO -- : [274/883] 504441=test_fnmatch I, [2024-05-26T00:54:56.324655 #463473] INFO -- : [275/883] 504441=test_store I, [2024-05-26T00:54:56.577172 #463473] INFO -- : [276/883] 504441=test_rdoc_markup_pre_process I, [2024-05-26T00:54:56.669293 #463473] INFO -- : [277/883] 504441=test_tempfile I, [2024-05-26T00:54:56.755299 #463473] INFO -- : [278/883] 504442=test_http_request I, [2024-05-26T00:54:56.760037 #463473] INFO -- : [279/883] 504442=test_coverage I, [2024-05-26T00:54:56.883360 #463473] INFO -- : [280/883] 504441=test_tree_builder I, [2024-05-26T00:54:56.894487 #463473] INFO -- : [281/883] 504441=test_protect I, [2024-05-26T00:54:56.899164 #463473] INFO -- : [282/883] 504441=test_big5 I, [2024-05-26T00:54:56.904566 #463473] INFO -- : [283/883] 504441=test_date I, [2024-05-26T00:54:56.908436 #463473] INFO -- : [284/883] 504441=test_gem_commands_update_command I, [2024-05-26T00:54:57.373465 #463473] INFO -- : [285/883] 504442=test_complexrational I, [2024-05-26T00:54:57.387886 #463473] INFO -- : [286/883] 504442=test_raise I, [2024-05-26T00:54:57.388133 #463473] INFO -- : [287/883] 504442=version_test I, [2024-05-26T00:54:57.391444 #463473] INFO -- : [288/883] 504442=test_string I, [2024-05-26T00:54:57.409006 #463473] INFO -- : [289/883] 504442=json_common_interface_test I, [2024-05-26T00:54:57.438211 #463473] INFO -- : [290/883] 504442=test_rdoc_any_method I, [2024-05-26T00:54:57.860258 #463473] INFO -- : [291/883] 504442=test_error_highlight I, [2024-05-26T00:54:58.409442 #463473] INFO -- : [292/883] 504441=test_function_entry I, [2024-05-26T00:54:58.410020 #463473] INFO -- : [293/883] 504441=test_enumerator_kw I, [2024-05-26T00:54:58.414039 #463473] INFO -- : [294/883] 504442=test_line_editor I, [2024-05-26T00:54:58.420171 #463473] INFO -- : [295/883] 504441=test_marshalable I, [2024-05-26T00:54:58.420412 #463473] INFO -- : [296/883] 504441=reflection_test I, [2024-05-26T00:54:58.428570 #463473] INFO -- : [297/883] 504442=test_files_lib I, [2024-05-26T00:54:58.475207 #463473] INFO -- : [298/883] 504441=test_string_memory I, [2024-05-26T00:54:58.559292 #463473] INFO -- : [299/883] 504441=test_help I, [2024-05-26T00:54:58.563577 #463473] INFO -- : [300/883] 504441=test_rdoc_generator_markup I, [2024-05-26T00:54:58.604725 #463473] INFO -- : [301/883] 504441=test_constant I, [2024-05-26T00:55:00.002015 #463473] INFO -- : [302/883] 504443=test_find I, [2024-05-26T00:55:00.023088 #463473] INFO -- : [303/883] 504443=test_hmac I, [2024-05-26T00:55:00.032393 #463473] INFO -- : [304/883] 504443=test_encoding I, [2024-05-26T00:55:00.213010 #463473] INFO -- : [305/883] 504443=test_time I, [2024-05-26T00:55:00.323769 #463473] INFO -- : [306/883] 504443=test_file I, [2024-05-26T00:55:00.330090 #463473] INFO -- : [307/883] 504443=test_capacity I, [2024-05-26T00:55:00.343605 #463473] INFO -- : [308/883] 504443=test_nextafter I, [2024-05-26T00:55:00.438189 #463473] INFO -- : [309/883] 504443=test_gem_commands_owner_command I, [2024-05-26T00:55:00.458978 #463473] INFO -- : [310/883] 504441=test_rat I, [2024-05-26T00:55:00.471538 #463473] INFO -- : [311/883] 504441=test_init I, [2024-05-26T00:55:00.768998 #463473] INFO -- : [312/883] 504441=test_gem_request_connection_pools I, [2024-05-26T00:55:01.251169 #463473] INFO -- : [313/883] 504443=test_flags I, [2024-05-26T00:55:01.358731 #463473] INFO -- : [314/883] 504442=test_numeric I, [2024-05-26T00:55:01.425904 #463473] INFO -- : [315/883] 504442=test_yamlstore I, [2024-05-26T00:55:01.441090 #463473] INFO -- : [316/883] 504442=test_bug-3571 I, [2024-05-26T00:55:01.465629 #463473] INFO -- : [317/883] 504442=test_gem_requirement I, [2024-05-26T00:55:01.605118 #463473] INFO -- : [318/883] 504442=test_win32ole_method_event I, [2024-05-26T00:55:01.610235 #463473] INFO -- : [319/883] 504442=test_tcp I, [2024-05-26T00:55:01.630227 #463473] INFO -- : [320/883] 504443=parse_comments_test I, [2024-05-26T00:55:01.637213 #463473] INFO -- : [321/883] 504443=test_rdoc_markup_to_table_of_contents I, [2024-05-26T00:55:01.673440 #463473] INFO -- : [322/883] 504442=test_gem_name_tuple I, [2024-05-26T00:55:01.681258 #463473] INFO -- : [323/883] 504443=test_integer I, [2024-05-26T00:55:01.699526 #463473] INFO -- : [324/883] 504442=test_gem_resolver_activation_request I, [2024-05-26T00:55:01.715761 #463473] INFO -- : [325/883] 504442=test_function I, [2024-05-26T00:55:01.744085 #463473] INFO -- : [326/883] 504443=test_gem_commands_server_command I, [2024-05-26T00:55:01.767464 #463473] INFO -- : [327/883] 504443=test_string I, [2024-05-26T00:55:01.811816 #463473] INFO -- : [328/883] 504441=test_macro I, [2024-05-26T00:55:01.817875 #463473] INFO -- : [329/883] 504441=test_pipe I, [2024-05-26T00:55:01.927144 #463473] INFO -- : [330/883] 504441=test_bug-5832 I, [2024-05-26T00:55:01.935856 #463473] INFO -- : [331/883] 504441=test_yield_block I, [2024-05-26T00:55:01.940291 #463473] INFO -- : [332/883] 504442=test_c_struct_builder I, [2024-05-26T00:55:01.951106 #463473] INFO -- : [333/883] 504441=test_gem_package_tar_reader_entry I, [2024-05-26T00:55:02.144186 #463473] INFO -- : [334/883] 504442=test_resource I, [2024-05-26T00:55:02.160194 #463473] INFO -- : [335/883] 504442=test_gem_uri I, [2024-05-26T00:55:02.194127 #463473] INFO -- : [336/883] 504442=test_reqarg I, [2024-05-26T00:55:02.201240 #463473] INFO -- : [337/883] 504441=test_frozen_error I, [2024-05-26T00:55:02.212230 #463473] INFO -- : [338/883] 504441=test_gem_ext_ext_conf_builder I, [2024-05-26T00:55:02.517247 #463473] INFO -- : [339/883] 504442=test_gem_version I, [2024-05-26T00:55:02.623667 #463473] INFO -- : [340/883] 504442=test_spell_checker I, [2024-05-26T00:55:02.628342 #463473] INFO -- : [341/883] 504442=test_path_to_class I, [2024-05-26T00:55:02.638490 #463473] INFO -- : [342/883] 504442=test_enumerator I, [2024-05-26T00:55:02.756727 #463473] INFO -- : [343/883] 504442=test_zlib I, [2024-05-26T00:55:03.331740 #463473] INFO -- : [344/883] 504441=test_rdoc_options I, [2024-05-26T00:55:03.645585 #463473] INFO -- : [345/883] 504441=test_gem_ext_cargo_builder I, [2024-05-26T00:55:03.647406 #463473] INFO -- : [346/883] 504441=test_console_attr I, [2024-05-26T00:55:03.670882 #463473] INFO -- : [347/883] 504441=test_proc I, [2024-05-26T00:55:04.588855 #463473] INFO -- : [348/883] 504441=test_gem_commands_unpack_command I, [2024-05-26T00:55:04.946857 #463473] INFO -- : [349/883] 504441=test_rdoc_include I, [2024-05-26T00:55:04.977058 #463473] INFO -- : [350/883] 504441=test_win32ole_record I, [2024-05-26T00:55:04.993323 #463473] INFO -- : [351/883] 504441=test_gem_version_option I, [2024-05-26T00:55:05.074392 #463473] INFO -- : [352/883] 504441=test_date_compat I, [2024-05-26T00:55:05.084806 #463473] INFO -- : [353/883] 504441=test_ubf_async_safe I, [2024-05-26T00:55:05.098605 #463473] INFO -- : [354/883] 504441=test_pstore I, [2024-05-26T00:55:05.323874 #463473] INFO -- : [355/883] 504441=test_generic I, [2024-05-26T00:55:05.392520 #463473] INFO -- : [356/883] 504441=test_common I, [2024-05-26T00:55:05.554183 #463473] INFO -- : [357/883] 504441=test_rdoc_markup_to_html_snippet I, [2024-05-26T00:55:05.676165 #463473] INFO -- : [358/883] 504441=test_httpresponses I, [2024-05-26T00:55:05.701754 #463473] INFO -- : [359/883] 504441=test_deprecate I, [2024-05-26T00:55:05.768956 #463473] INFO -- : [360/883] 504441=test_rdoc_constant I, [2024-05-26T00:55:05.871263 #463473] INFO -- : [361/883] 504441=test_key_actor_vi I, [2024-05-26T00:55:06.008070 #463473] INFO -- : [362/883] 504441=test_postponed_job I, [2024-05-26T00:55:06.309820 #463473] INFO -- : [363/883] 504441=test_gem_request_set_lockfile I, [2024-05-26T00:55:06.756569 #463473] INFO -- : [364/883] 504441=test_rdoc_markdown I, [2024-05-26T00:55:07.025456 #463473] INFO -- : [365/883] 504441=test_rdoc_encoding I, [2024-05-26T00:55:07.062722 #463473] INFO -- : [366/883] 504441=test_win32ole_variant_outarg I, [2024-05-26T00:55:07.071331 #463473] INFO -- : [367/883] 504441=test_stream I, [2024-05-26T00:55:07.128691 #463473] INFO -- : [368/883] 504441=test_have_library I, [2024-05-26T00:55:07.944978 #463473] INFO -- : [369/883] 504441=test_ns_spki I, [2024-05-26T00:55:07.953005 #463473] INFO -- : [370/883] 504441=test_rdoc_markup_indented_paragraph I, [2024-05-26T00:55:07.966258 #463473] INFO -- : [371/883] 504441=test_rdoc_markup_parser I, [2024-05-26T00:55:08.051020 #463473] INFO -- : [372/883] 504441=test_iseq_load I, [2024-05-26T00:55:08.666262 #463473] INFO -- : [373/883] 504442=test_rdoc_text I, [2024-05-26T00:55:08.704945 #463473] INFO -- : [374/883] 504442=library_symbols_test I, [2024-05-26T00:55:08.706612 #463473] INFO -- : [375/883] 504442=test_require I, [2024-05-26T00:55:08.717127 #463473] INFO -- : [376/883] 504442=test_stringify_symbols I, [2024-05-26T00:55:08.862778 #463473] INFO -- : [377/883] 504442=test_objspace I, [2024-05-26T00:55:09.211648 #463473] INFO -- : [378/883] 504441=test_gem_commands_outdated_command I, [2024-05-26T00:55:09.268588 #463473] INFO -- : [379/883] 504441=test_gem_dependency_list I, [2024-05-26T00:55:09.349738 #463473] INFO -- : [380/883] 504441=parameters_signature_test I, [2024-05-26T00:55:09.365591 #463473] INFO -- : [381/883] 504441=test_rdoc_parser_changelog I, [2024-05-26T00:55:09.440970 #463473] INFO -- : [382/883] 504441=test_tsort I, [2024-05-26T00:55:09.454154 #463473] INFO -- : [383/883] 504441=test_gem_commands_fetch_command I, [2024-05-26T00:55:09.633219 #463473] INFO -- : [384/883] 504441=test_typeddata I, [2024-05-26T00:55:09.876376 #463473] INFO -- : [385/883] 504441=test_securerandom I, [2024-05-26T00:55:09.903318 #463473] INFO -- : [386/883] 504441=test_kwargs I, [2024-05-26T00:55:09.917563 #463473] INFO -- : [387/883] 504441=test_rdoc_parser_c I, [2024-05-26T00:55:10.223724 #463473] INFO -- : [388/883] 504441=test_pack I, [2024-05-26T00:55:10.552166 #463473] INFO -- : [389/883] 504441=test_io_wait I, [2024-05-26T00:55:10.871363 #463473] INFO -- : [390/883] 504441=parse_test I, [2024-05-26T00:55:14.163774 #463473] INFO -- : [391/883] 504441=test_gem_doctor I, [2024-05-26T00:55:14.218585 #463473] INFO -- : [392/883] 504441=json_fixtures_test I, [2024-05-26T00:55:14.229045 #463473] INFO -- : [393/883] 504441=test_len I, [2024-05-26T00:55:14.239317 #463473] INFO -- : [394/883] 504441=test_bmethod I, [2024-05-26T00:55:14.267960 #463473] INFO -- : [395/883] 504441=test_gem_source_specific_file I, [2024-05-26T00:55:14.343527 #463473] INFO -- : [396/883] 504441=test_provider I, [2024-05-26T00:55:14.352446 #463473] INFO -- : [397/883] 504441=test_euc_kr I, [2024-05-26T00:55:14.369370 #463473] INFO -- : [398/883] 504441=test_rdoc_code_object I, [2024-05-26T00:55:14.747603 #463473] INFO -- : [399/883] 504441=test_process I, [2024-05-26T00:55:28.159652 #463473] INFO -- : [400/883] 504443=test_rdoc_markup_attributes I, [2024-05-26T00:55:28.166599 #463473] INFO -- : [401/883] 504443=redundant_return_test I, [2024-05-26T00:55:28.213852 #463473] INFO -- : [402/883] 504443=test_rand I, [2024-05-26T00:55:28.515474 #463473] INFO -- : [403/883] 504443=test_random_formatter I, [2024-05-26T00:55:28.537218 #463473] INFO -- : [404/883] 504443=test_string_processing I, [2024-05-26T00:55:28.545050 #463473] INFO -- : [405/883] 504443=test_bigzero I, [2024-05-26T00:55:28.568893 #463473] INFO -- : [406/883] 504443=test_gem_commands_query_command I, [2024-05-26T00:55:29.213758 #463473] INFO -- : [407/883] 504443=test_gem_platform I, [2024-05-26T00:55:29.320261 #463473] INFO -- : [408/883] 504443=test_win32ole_typelib I, [2024-05-26T00:55:29.329276 #463473] INFO -- : [409/883] 504443=test_pkey I, [2024-05-26T00:55:29.338080 #463473] INFO -- : [410/883] 504443=test_external_new I, [2024-05-26T00:55:29.346271 #463473] INFO -- : [411/883] 504443=test_multi_irb_commands I, [2024-05-26T00:55:29.354790 #463473] INFO -- : [412/883] 504443=test_pkey_dh I, [2024-05-26T00:55:30.694340 #463473] INFO -- : [413/883] 504443=test_m17n_comb I, [2024-05-26T00:55:32.794927 #463473] INFO -- : [414/883] 504441=test_null I, [2024-05-26T00:55:32.806562 #463473] INFO -- : [415/883] 504441=test_ractor I, [2024-05-26T00:55:32.866916 #463473] INFO -- : [416/883] 504441=test_data I, [2024-05-26T00:55:32.879283 #463473] INFO -- : [417/883] 504441=test_memory_view I, [2024-05-26T00:55:32.949427 #463473] INFO -- : [418/883] 504441=test_io I, [2024-05-26T00:55:33.130668 #463473] INFO -- : [419/883] 504441=test_rdoc_i18n_text I, [2024-05-26T00:55:33.140364 #463473] INFO -- : [420/883] 504441=test_input_method I, [2024-05-26T00:55:33.324766 #463473] INFO -- : [421/883] 504441=test_thread I, [2024-05-26T00:55:33.448790 #463473] INFO -- : [422/883] 504441=test_gem_security_signer I, [2024-05-26T00:55:33.553937 #463473] INFO -- : [423/883] 504441=test_config I, [2024-05-26T00:55:33.613562 #463473] INFO -- : [424/883] 504441=test_complex2 I, [2024-05-26T00:55:33.624209 #463473] INFO -- : [425/883] 504441=test_gem_util I, [2024-05-26T00:55:33.697733 #463473] INFO -- : [426/883] 504443=test_gem_unsatisfiable_dependency_error I, [2024-05-26T00:55:33.708633 #463473] INFO -- : [427/883] 504443=test_literal I, [2024-05-26T00:55:33.785285 #463473] INFO -- : [428/883] 504441=test_gem_commands_environment_command I, [2024-05-26T00:55:33.841882 #463473] INFO -- : [429/883] 504441=test_pkcs7 I, [2024-05-26T00:55:34.015022 #463473] INFO -- : [430/883] 504441=test_pack I, [2024-05-26T00:55:34.234444 #463473] INFO -- : [431/883] 504441=test_class_name_check I, [2024-05-26T00:55:34.263314 #463473] INFO -- : [432/883] 504443=test_syntax I, [2024-05-26T00:55:34.349965 #463473] INFO -- : [433/883] 504441=test_scalar I, [2024-05-26T00:55:34.361934 #463473] INFO -- : [434/883] 504441=test_zsh_completion I, [2024-05-26T00:55:34.368475 #463473] INFO -- : [435/883] 504441=test_basicsocket I, [2024-05-26T00:55:34.378767 #463473] INFO -- : [436/883] 504441=test_bash_completion I, [2024-05-26T00:55:34.401054 #463473] INFO -- : [437/883] 504441=test_exception I, [2024-05-26T00:55:35.516275 #463473] INFO -- : [438/883] 504442=test_rdoc_markup_to_html_crossref I, [2024-05-26T00:55:35.792926 #463473] INFO -- : [439/883] 504442=test_files_test_2 I, [2024-05-26T00:55:35.801449 #463473] INFO -- : [440/883] 504442=test_div I, [2024-05-26T00:55:35.812759 #463473] INFO -- : [441/883] 504442=test_rdoc_context_section I, [2024-05-26T00:55:35.821077 #463473] INFO -- : [442/883] 504442=test_io_buffer I, [2024-05-26T00:55:35.936890 #463473] INFO -- : [443/883] 504442=test_deprecated I, [2024-05-26T00:55:35.937555 #463473] INFO -- : [444/883] 504442=test_optparse I, [2024-05-26T00:55:36.141823 #463473] INFO -- : [445/883] 504442=test_timeout I, [2024-05-26T00:55:36.864772 #463473] INFO -- : [446/883] 504442=test_key_name_check I, [2024-05-26T00:55:36.876868 #463473] INFO -- : [447/883] 504442=test_rdoc_markup_to_bs I, [2024-05-26T00:55:36.923167 #463473] INFO -- : [448/883] 504442=test_rdoc_markup_raw I, [2024-05-26T00:55:37.000801 #463473] INFO -- : [449/883] 504442=test_weakref I, [2024-05-26T00:55:37.963276 #463473] INFO -- : [450/883] 504442=test_instrumentation_api I, [2024-05-26T00:55:37.977776 #463473] INFO -- : [451/883] 504441=test_rdoc_alias I, [2024-05-26T00:55:37.987619 #463473] INFO -- : [452/883] 504441=test_singleton I, [2024-05-26T00:55:38.046244 #463473] INFO -- : [453/883] 504441=test_fstring I, [2024-05-26T00:55:38.114701 #463473] INFO -- : [454/883] 504441=test_numeric I, [2024-05-26T00:55:38.245822 #463473] INFO -- : [455/883] 504441=test_gem_ext_rake_builder I, [2024-05-26T00:55:38.757405 #463473] INFO -- : [456/883] 504441=test_rdoc_require I, [2024-05-26T00:55:38.762684 #463473] INFO -- : [457/883] 504441=test_word I, [2024-05-26T00:55:38.785838 #463473] INFO -- : [458/883] 504441=test_gem_commands_cert_command I, [2024-05-26T00:55:39.879320 #463473] INFO -- : [459/883] 504441=test_gem_commands_stale_command I, [2024-05-26T00:55:39.891444 #463473] INFO -- : [460/883] 504441=ruby_parser_test I, [2024-05-26T00:55:39.896063 #463473] INFO -- : [461/883] 504441=test_rdoc_markup_to_tt_only I, [2024-05-26T00:55:39.947735 #463473] INFO -- : [462/883] 504441=test_ws I, [2024-05-26T00:55:40.060622 #463473] INFO -- : [463/883] 504441=test_date_strftime I, [2024-05-26T00:55:40.223080 #463473] INFO -- : [464/883] 504442=json_parser_test I, [2024-05-26T00:55:40.330044 #463473] INFO -- : [465/883] 504442=test_gem_resolver_best_set I, [2024-05-26T00:55:40.357950 #463473] INFO -- : [466/883] 504441=test_cgi_core I, [2024-05-26T00:55:40.383732 #463473] INFO -- : [467/883] 504441=test_parser I, [2024-05-26T00:55:40.396362 #463473] INFO -- : [468/883] 504441=test_rdoc_markup_to_label I, [2024-05-26T00:55:40.406502 #463473] INFO -- : [469/883] 504442=json_generator_test I, [2024-05-26T00:55:40.483327 #463473] INFO -- : [470/883] 504441=test_ansi_without_terminfo I, [2024-05-26T00:55:40.492220 #463473] INFO -- : [471/883] 504441=test_ractor I, [2024-05-26T00:55:40.506985 #463473] INFO -- : [472/883] 504441=test_registry I, [2024-05-26T00:55:40.510080 #463473] INFO -- : [473/883] 504442=test_gem I, [2024-05-26T00:55:40.520932 #463473] INFO -- : [474/883] 504441=test_gem_commands_help_command I, [2024-05-26T00:55:40.577373 #463473] INFO -- : [475/883] 504441=test_scheduler I, [2024-05-26T00:55:40.743435 #463473] INFO -- : [476/883] 504441=test_ssl I, [2024-05-26T00:55:40.931279 #463473] INFO -- : [477/883] 504441=test_gem_resolver_conflict I, [2024-05-26T00:55:41.040960 #463473] INFO -- : [478/883] 504441=test_ractor I, [2024-05-26T00:55:41.287540 #463473] INFO -- : [479/883] 504441=test_rdoc_markup_hard_break I, [2024-05-26T00:55:41.301493 #463473] INFO -- : [480/883] 504441=test_marshal I, [2024-05-26T00:55:42.060972 #463473] INFO -- : Leaked file descriptor: TestGem#test_self_clear_paths: 10 # I, [2024-05-26T00:55:42.096159 #463473] INFO -- : COMMAND PID USER FD TYPE DEVICE SIZE/OFF NODE NAME I, [2024-05-26T00:55:42.096224 #463473] INFO -- : ruby 504442 opc 10r REG 252,0 9253600 13705411 /var/lib/sss/mc/passwd I, [2024-05-26T00:55:42.267900 #463473] INFO -- : [481/883] 504443=test_ancdata I, [2024-05-26T00:55:42.323242 #463473] INFO -- : [482/883] 504443=ractor_test I, [2024-05-26T00:55:42.387145 #463473] INFO -- : [483/883] 504443=test_nesting_parser I, [2024-05-26T00:55:42.396816 #463473] INFO -- : [484/883] 504443=test_enc_str_buf_cat I, [2024-05-26T00:55:42.404983 #463473] INFO -- : [485/883] 504443=test_bignum I, [2024-05-26T00:55:42.500916 #463473] INFO -- : [486/883] 504441=newline_test I, [2024-05-26T00:55:42.567315 #463473] INFO -- : [487/883] 504441=test_unix I, [2024-05-26T00:55:42.629396 #463473] INFO -- : [488/883] 504441=test_integer I, [2024-05-26T00:55:42.811748 #463473] INFO -- : [489/883] 504442=test_gem_commands_contents_command I, [2024-05-26T00:55:42.959484 #463473] INFO -- : [490/883] 504442=test_context I, [2024-05-26T00:55:43.060665 #463473] INFO -- : [491/883] 504442=test_udp I, [2024-05-26T00:55:43.074084 #463473] INFO -- : [492/883] 504442=test_symbol I, [2024-05-26T00:55:45.161948 #463473] INFO -- : [493/883] 504441=test_gem_commands_search_command I, [2024-05-26T00:55:45.177134 #463473] INFO -- : [494/883] 504441=test_rdoc_servlet I, [2024-05-26T00:55:45.270296 #463473] INFO -- : [495/883] 504441=test_coder I, [2024-05-26T00:55:45.285791 #463473] INFO -- : [496/883] 504441=test_formatter I, [2024-05-26T00:55:45.306288 #463473] INFO -- : [497/883] 504441=test_gem_resolver_local_specification I, [2024-05-26T00:55:45.333696 #463473] INFO -- : [498/883] 504441=test_configuration I, [2024-05-26T00:55:45.421322 #463473] INFO -- : [499/883] 504441=test_date_new I, [2024-05-26T00:55:45.448263 #463473] INFO -- : [500/883] 504441=test_gem_commands_list_command I, [2024-05-26T00:55:45.454441 #463473] INFO -- : [501/883] 504441=test_date_marshal I, [2024-05-26T00:55:45.629612 #463473] INFO -- : [502/883] 504441=test_have_func I, [2024-05-26T00:55:46.014728 #463473] INFO -- : [503/883] 504443=test_locale I, [2024-05-26T00:55:46.041304 #463473] INFO -- : [504/883] 504443=test_ts I, [2024-05-26T00:55:46.313712 #463473] INFO -- : [505/883] 504443=test_address_resolve I, [2024-05-26T00:55:46.328389 #463473] INFO -- : [506/883] 504443=test_stream I, [2024-05-26T00:55:46.341500 #463473] INFO -- : [507/883] 504443=test_trick I, [2024-05-26T00:55:46.663708 #463473] INFO -- : [508/883] 504442=test_ractor I, [2024-05-26T00:55:46.672621 #463473] INFO -- : [509/883] 504441=test_rdoc_attr I, [2024-05-26T00:55:46.710819 #463473] INFO -- : [510/883] 504441=test_extlibs I, [2024-05-26T00:55:46.715981 #463473] INFO -- : [511/883] 504442=test_iter_break I, [2024-05-26T00:55:46.730384 #463473] INFO -- : [512/883] 504442=test_range I, [2024-05-26T00:55:47.563567 #463473] INFO -- : [513/883] 504442=test_gem_commands_signin_command I, [2024-05-26T00:55:47.723814 #463473] INFO -- : [514/883] 504442=test_recursion I, [2024-05-26T00:55:47.745729 #463473] INFO -- : [515/883] 504442=test_require I, [2024-05-26T00:55:48.269607 #463473] INFO -- : [516/883] 504441=test_rdoc_markup_include I, [2024-05-26T00:55:48.284886 #463473] INFO -- : [517/883] 504441=test_enum I, [2024-05-26T00:55:48.764694 #463473] INFO -- : [518/883] 504443=test_rbconfig I, [2024-05-26T00:55:48.805336 #463473] INFO -- : [519/883] 504443=test_num2int I, [2024-05-26T00:55:48.820905 #463473] INFO -- : [520/883] 504443=test_alias_and_anchor I, [2024-05-26T00:55:48.841832 #463473] INFO -- : [521/883] 504443=test_time I, [2024-05-26T00:55:49.002092 #463473] INFO -- : [522/883] 504443=test_popen_deadlock I, [2024-05-26T00:55:49.058671 #463473] INFO -- : [523/883] 504442=test_ensured I, [2024-05-26T00:55:49.080644 #463473] INFO -- : [524/883] 504442=test_euc_jp I, [2024-05-26T00:55:49.088272 #463473] INFO -- : [525/883] 504442=test_rdoc_markup I, [2024-05-26T00:55:49.097378 #463473] INFO -- : [526/883] 504442=test_key_stroke I, [2024-05-26T00:55:49.112258 #463473] INFO -- : [527/883] 504442=location_test I, [2024-05-26T00:55:49.171997 #463473] INFO -- : [528/883] 504442=test_chilled I, [2024-05-26T00:55:49.184676 #463473] INFO -- : [529/883] 504442=test_delegate I, [2024-05-26T00:55:49.228778 #463473] INFO -- : [530/883] 504442=test_project_sanity I, [2024-05-26T00:55:49.293326 #463473] INFO -- : [531/883] 504442=test_symbol I, [2024-05-26T00:55:49.349976 #463473] INFO -- : [532/883] 504442=test_gc I, [2024-05-26T00:55:49.398656 #463473] INFO -- : [533/883] 504441=test_gem_bundler_version_finder I, [2024-05-26T00:55:49.445652 #463473] INFO -- : [534/883] 504441=test_gem_request_set I, [2024-05-26T00:55:49.664459 #463473] INFO -- : [535/883] 504443=test_set_len I, [2024-05-26T00:55:49.672691 #463473] INFO -- : [536/883] 504443=constant_path_node_test I, [2024-05-26T00:55:49.680768 #463473] INFO -- : [537/883] 504443=test_interned_str I, [2024-05-26T00:55:49.685681 #463473] INFO -- : [538/883] 504443=test_folderitem2_invokeverb I, [2024-05-26T00:55:49.707363 #463473] INFO -- : [539/883] 504443=test_pattern_matching I, [2024-05-26T00:55:49.756461 #463473] INFO -- : [540/883] 504443=test_sleep I, [2024-05-26T00:55:49.972558 #463473] INFO -- : [541/883] 504441=test_webauthn_listener_response I, [2024-05-26T00:55:49.994118 #463473] INFO -- : [542/883] 504441=ruby_api_test I, [2024-05-26T00:55:50.179456 #463473] INFO -- : [543/883] 504441=test_gem_resolver_index_set I, [2024-05-26T00:55:50.217316 #463473] INFO -- : [544/883] 504441=test_addrinfo I, [2024-05-26T00:55:50.246859 #463473] INFO -- : [545/883] 504441=test_to_ruby I, [2024-05-26T00:55:50.291407 #463473] INFO -- : [546/883] 504441=test_time_tz I, [2024-05-26T00:55:50.338526 #463473] INFO -- : [547/883] 504441=test_inlinecache I, [2024-05-26T00:55:50.399561 #463473] INFO -- : [548/883] 504441=test_socket I, [2024-05-26T00:55:51.308076 #463473] INFO -- : [549/883] 504441=test_terminfo I, [2024-05-26T00:55:51.325280 #463473] INFO -- : [550/883] 504441=test_thread I, [2024-05-26T00:55:54.739444 #463473] INFO -- : [551/883] 504443=test_data I, [2024-05-26T00:55:54.804697 #463473] INFO -- : [552/883] 504443=test_bug-14834 I, [2024-05-26T00:55:54.812651 #463473] INFO -- : [553/883] 504443=test_ellipsize I, [2024-05-26T00:55:54.842416 #463473] INFO -- : [554/883] 504443=test_call I, [2024-05-26T00:55:55.044068 #463473] INFO -- : [555/883] 504443=test_gem_commands_build_command I, [2024-05-26T00:55:55.357395 #463473] INFO -- : [556/883] 504443=test_reline I, [2024-05-26T00:55:55.619976 #463473] INFO -- : [557/883] 504443=test_gem_ext_builder I, [2024-05-26T00:55:56.746604 #463473] INFO -- : [558/883] 504443=test_to_ary_concat I, [2024-05-26T00:55:57.968180 #463473] INFO -- : [559/883] 504442=test_history I, [2024-05-26T00:55:57.980391 #463473] INFO -- : [560/883] 504442=test_windows_1251 I, [2024-05-26T00:55:57.988889 #463473] INFO -- : [561/883] 504442=test_cgi_header I, [2024-05-26T00:55:57.996327 #463473] INFO -- : [562/883] 504442=test_case_options I, [2024-05-26T00:55:58.006526 #463473] INFO -- : [563/883] 504442=test_addr I, [2024-05-26T00:55:58.017600 #463473] INFO -- : [564/883] 504442=test_mailto I, [2024-05-26T00:55:58.031683 #463473] INFO -- : [565/883] 504442=test_kill_ring I, [2024-05-26T00:55:58.041494 #463473] INFO -- : [566/883] 504442=test_member I, [2024-05-26T00:55:58.047849 #463473] INFO -- : [567/883] 504442=test_object I, [2024-05-26T00:55:58.049506 #463473] INFO -- : [568/883] 504442=test_helper I, [2024-05-26T00:55:58.055892 #463473] INFO -- : [569/883] 504442=test_duplicate I, [2024-05-26T00:55:58.068087 #463473] INFO -- : [570/883] 504442=test_gem_resolver_api_set I, [2024-05-26T00:55:58.143678 #463473] INFO -- : [571/883] 504442=test_ruby_lex I, [2024-05-26T00:55:58.308912 #463473] INFO -- : [572/883] 504442=test_arith_seq_extract I, [2024-05-26T00:55:58.415001 #463473] INFO -- : [573/883] 504442=compiler_test I, [2024-05-26T00:55:58.455101 #463473] INFO -- : [574/883] 504442=test_gem_source_subpath_problem I, [2024-05-26T00:55:58.542048 #463473] INFO -- : [575/883] 504442=test_object_references I, [2024-05-26T00:55:58.574657 #463473] INFO -- : [576/883] 504442=test_gem_installer I, [2024-05-26T00:56:00.217662 #463473] INFO -- : [577/883] 504441=test_bug_reporter I, [2024-05-26T00:56:00.224937 #463473] INFO -- : [578/883] 504443=test_buffered_io I, [2024-05-26T00:56:00.294323 #463473] INFO -- : [579/883] 504443=test_ossl I, [2024-05-26T00:56:00.403865 #463473] INFO -- : [580/883] 504441=test_nofree I, [2024-05-26T00:56:00.410527 #463473] INFO -- : [581/883] 504441=test_whileuntil I, [2024-05-26T00:56:00.427852 #463473] INFO -- : [582/883] 504441=test_regexp I, [2024-05-26T00:56:03.651229 #463473] INFO -- : [583/883] 504442=test_pointer I, [2024-05-26T00:56:05.099950 #463473] INFO -- : [584/883] 504442=test_rdoc_normal_class I, [2024-05-26T00:56:05.219806 #463473] INFO -- : [585/883] 504442=test_within_pipe I, [2024-05-26T00:56:05.252402 #463473] INFO -- : [586/883] 504442=test_eval I, [2024-05-26T00:56:05.529144 #463473] INFO -- : [587/883] 504442=test_beginendblock I, [2024-05-26T00:56:05.861104 #463473] INFO -- : [588/883] 504442=test_monitor I, [2024-05-26T00:56:06.111938 #463473] INFO -- : [589/883] 504442=test_scalar_scanner I, [2024-05-26T00:56:06.136481 #463473] INFO -- : [590/883] 504442=test_lambda I, [2024-05-26T00:56:06.202778 #463473] INFO -- : [591/883] 504442=test_rb_str_dup I, [2024-05-26T00:56:06.211417 #463473] INFO -- : [592/883] 504442=test_arity I, [2024-05-26T00:56:06.221986 #463473] INFO -- : [593/883] 504442=test_gem_path_support I, [2024-05-26T00:56:06.301285 #463473] INFO -- : [594/883] 504442=test_keyword I, [2024-05-26T00:56:06.815800 #463473] INFO -- : [595/883] 504442=test_win32ole_type_event I, [2024-05-26T00:56:06.860254 #463473] INFO -- : [596/883] 504442=test_trace I, [2024-05-26T00:56:06.876526 #463473] INFO -- : [597/883] 504442=test_rdoc_markup_to_html I, [2024-05-26T00:56:06.985250 #463473] INFO -- : [598/883] 504442=test_foreach I, [2024-05-26T00:56:06.992799 #463473] INFO -- : [599/883] 504442=test_append I, [2024-05-26T00:56:07.004195 #463473] INFO -- : [600/883] 504442=test_gem_resolver_installer_set I, [2024-05-26T00:56:07.276365 #463473] INFO -- : [601/883] 504442=bom_test I, [2024-05-26T00:56:07.308251 #463473] INFO -- : [602/883] 504442=test_file I, [2024-05-26T00:56:07.801619 #463473] INFO -- : [603/883] 504443=test_config I, [2024-05-26T00:56:08.116721 #463473] INFO -- : [604/883] 504443=test_summary I, [2024-05-26T00:56:08.172845 #463473] INFO -- : [605/883] 504443=test_helper_method I, [2024-05-26T00:56:08.181299 #463473] INFO -- : [606/883] 504443=test_x509ext I, [2024-05-26T00:56:08.194307 #463473] INFO -- : [607/883] 504443=test_emitter I, [2024-05-26T00:56:08.200783 #463473] INFO -- : [608/883] 504443=test_rdoc_markup_heading I, [2024-05-26T00:56:08.207604 #463473] INFO -- : [609/883] 504443=test_flip I, [2024-05-26T00:56:08.352342 #463473] INFO -- : [610/883] 504443=test_io_console I, [2024-05-26T00:56:08.355309 #463473] INFO -- : Leaked file descriptor: TestIO_Console#test_raw_minchar: 11 # I, [2024-05-26T00:56:08.380458 #463473] INFO -- : COMMAND PID USER FD TYPE DEVICE SIZE/OFF NODE NAME I, [2024-05-26T00:56:08.380549 #463473] INFO -- : ruby 504443 opc 11u unix 0x0000000000000000 0t0 3144328933 type=STREAM I, [2024-05-26T00:56:10.967692 #463473] INFO -- : [611/883] 504443=test_dns I, [2024-05-26T00:56:11.468364 #463473] INFO -- : [612/883] 504443=test_c_union_entity I, [2024-05-26T00:56:11.574422 #463473] INFO -- : [613/883] 504443=test_cgi_session I, [2024-05-26T00:56:11.587488 #463473] INFO -- : [614/883] 504443=test_notimplement I, [2024-05-26T00:56:11.602087 #463473] INFO -- : [615/883] 504443=test_x509crl I, [2024-05-26T00:56:11.693846 #463473] INFO -- : [616/883] 504443=test_debug I, [2024-05-26T00:56:11.802535 #463473] INFO -- : [617/883] 504443=test_refinement I, [2024-05-26T00:56:13.529204 #463473] INFO -- : [618/883] 504442=test_transcode I, [2024-05-26T00:56:13.707894 #463473] INFO -- : [619/883] 504442=test_class2name I, [2024-05-26T00:56:13.755706 #463473] INFO -- : [620/883] 504442=test_gem_commands_cleanup_command I, [2024-05-26T00:56:14.357377 #463473] INFO -- : [621/883] 504442=test_pattern_key_name_check I, [2024-05-26T00:56:14.368237 #463473] INFO -- : [622/883] 504442=test_profile_frames I, [2024-05-26T00:56:14.541941 #463473] INFO -- : [623/883] 504442=test_getopts I, [2024-05-26T00:56:14.551967 #463473] INFO -- : [624/883] 504442=test_emitter I, [2024-05-26T00:56:14.676871 #463473] INFO -- : [625/883] 504442=test_fips I, [2024-05-26T00:56:14.851040 #463473] INFO -- : [626/883] 504442=test_alias I, [2024-05-26T00:56:15.020534 #463473] INFO -- : [627/883] 504442=test_gem_ext_cmake_builder I, [2024-05-26T00:56:15.037020 #463473] INFO -- : [628/883] 504442=test_digest_extend I, [2024-05-26T00:56:15.323103 #463473] INFO -- : [629/883] 504442=test_last_thread I, [2024-05-26T00:56:15.328805 #463473] INFO -- : [630/883] 504443=test_thread_fd_close I, [2024-05-26T00:56:15.340329 #463473] INFO -- : [631/883] 504443=test_win32ole_event I, [2024-05-26T00:56:15.413703 #463473] INFO -- : [632/883] 504443=test_gem_commands_uninstall_command I, [2024-05-26T00:56:16.117208 #463473] INFO -- : [633/883] 504442=test_rdoc_markup_formatter I, [2024-05-26T00:56:16.134438 #463473] INFO -- : [634/883] 504442=test_compile_prism I, [2024-05-26T00:56:16.187002 #463473] INFO -- : [635/883] 504443=test_helper I, [2024-05-26T00:56:16.193006 #463473] INFO -- : [636/883] 504443=json_encoding_test I, [2024-05-26T00:56:16.206268 #463473] INFO -- : [637/883] 504443=test_vm_dump I, [2024-05-26T00:56:16.209223 #463473] INFO -- : [638/883] 504443=test_func I, [2024-05-26T00:56:16.530471 #463473] INFO -- : [639/883] 504442=test_config I, [2024-05-26T00:56:16.562579 #463473] INFO -- : [640/883] 504442=test_modify_expand I, [2024-05-26T00:56:16.573875 #463473] INFO -- : [641/883] 504442=test_pkg_config I, [2024-05-26T00:56:16.611755 #463473] INFO -- : [642/883] 504442=test_gem_available_set I, [2024-05-26T00:56:18.560009 #463473] INFO -- : [643/883] 504442=test_convertible I, [2024-05-26T00:56:20.395424 #463473] INFO -- : [644/883] 504442=errors_test I, [2024-05-26T00:56:20.491085 #463473] INFO -- : [645/883] 504442=test_gem_commands_exec_command I, [2024-05-26T00:56:21.165041 #463473] INFO -- : [646/883] 504443=unescape_test I, [2024-05-26T00:56:21.936686 #463473] INFO -- : [647/883] 504442=test_color_printer I, [2024-05-26T00:56:21.953128 #463473] INFO -- : [648/883] 504442=test_super I, [2024-05-26T00:56:22.424400 #463473] INFO -- : [649/883] 504443=test_gem_resolver I, [2024-05-26T00:56:22.740615 #463473] INFO -- : [650/883] 504443=test_gem_source_vendor I, [2024-05-26T00:56:22.758456 #463473] INFO -- : [651/883] 504443=test_object I, [2024-05-26T00:56:23.080908 #463473] INFO -- : [652/883] 504443=test_dln I, [2024-05-26T00:56:23.089879 #463473] INFO -- : [653/883] 504443=test_x509req I, [2024-05-26T00:56:23.312181 #463473] INFO -- : [654/883] 504443=test_readpartial I, [2024-05-26T00:56:23.525596 #463473] INFO -- : [655/883] 504443=test_httpresponse I, [2024-05-26T00:56:23.589329 #463473] INFO -- : [656/883] 504443=test_rdoc_parser_ruby I, [2024-05-26T00:56:23.597931 #463473] INFO -- : [657/883] 504442=test_insns_leaf I, [2024-05-26T00:56:23.609872 #463473] INFO -- : [658/883] 504442=test_gem_console_ui I, [2024-05-26T00:56:23.616237 #463473] INFO -- : [659/883] 504442=test_ifunless I, [2024-05-26T00:56:23.630202 #463473] INFO -- : [660/883] 504442=test_allocation I, [2024-05-26T00:56:24.373737 #463473] INFO -- : [661/883] 504443=test_nomethod_error I, [2024-05-26T00:56:24.418326 #463473] INFO -- : [662/883] 504443=test_gem_commands_rebuild_command I, [2024-05-26T00:56:24.470800 #463473] INFO -- : [663/883] 504443=test_etc I, [2024-05-26T00:56:24.481231 #463473] INFO -- : Leaked file descriptor: TestEtc#test_getlogin: 10 # I, [2024-05-26T00:56:24.510724 #463473] INFO -- : COMMAND PID USER FD TYPE DEVICE SIZE/OFF NODE NAME I, [2024-05-26T00:56:24.510796 #463473] INFO -- : ruby 504443 opc 10r REG 252,0 9253600 13705411 /var/lib/sss/mc/passwd I, [2024-05-26T00:56:24.667485 #463473] INFO -- : [664/883] 504443=test_stat I, [2024-05-26T00:56:24.672794 #463473] INFO -- : [665/883] 504443=test_win32ole_param_event I, [2024-05-26T00:56:24.679893 #463473] INFO -- : [666/883] 504443=test_https_proxy I, [2024-05-26T00:56:24.690116 #463473] INFO -- : [667/883] 504443=test_rdoc_parser I, [2024-05-26T00:56:24.710680 #463473] INFO -- : [668/883] 504443=test_win32ole_variant I, [2024-05-26T00:56:24.717955 #463473] INFO -- : [669/883] 504443=magic_comment_test I, [2024-05-26T00:56:24.725026 #463473] INFO -- : [670/883] 504443=test_cgi_modruby I, [2024-05-26T00:56:24.725517 #463473] INFO -- : [671/883] 504443=test_x509attr I, [2024-05-26T00:56:24.742034 #463473] INFO -- : [672/883] 504443=test_printf I, [2024-05-26T00:56:24.786209 #463473] INFO -- : [673/883] 504443=test_workspace I, [2024-05-26T00:56:24.885504 #463473] INFO -- : [674/883] 504443=test_uncorrectable_name_check I, [2024-05-26T00:56:24.900639 #463473] INFO -- : [675/883] 504443=test_io I, [2024-05-26T00:56:26.139159 #463473] INFO -- : [676/883] 504442=test_path I, [2024-05-26T00:56:26.151727 #463473] INFO -- : [677/883] 504442=test_digest I, [2024-05-26T00:56:26.155394 #463473] INFO -- : [678/883] 504442=test_rdoc_rd_inline I, [2024-05-26T00:56:26.193605 #463473] INFO -- : [679/883] 504442=test_dir I, [2024-05-26T00:56:26.415206 #463473] INFO -- : Leaked file descriptor: TestDir#test_home: 11 # I, [2024-05-26T00:56:26.449518 #463473] INFO -- : COMMAND PID USER FD TYPE DEVICE SIZE/OFF NODE NAME I, [2024-05-26T00:56:26.449589 #463473] INFO -- : ruby 504442 opc 11u unix 0x0000000000000000 0t0 3144330427 type=STREAM I, [2024-05-26T00:56:26.614579 #463473] INFO -- : [680/883] 504442=test_files_test_1 I, [2024-05-26T00:56:26.682809 #463473] INFO -- : [681/883] 504442=test_closure I, [2024-05-26T00:56:29.100399 #463473] INFO -- : [682/883] 504441=test_resolve_symbol I, [2024-05-26T00:56:29.154747 #463473] INFO -- : [683/883] 504441=test_rubygems I, [2024-05-26T00:56:29.318133 #463473] INFO -- : [684/883] 504441=test_unicode_normalize I, [2024-05-26T00:56:29.330237 #463473] INFO -- : [685/883] 504442=test_gem_stream_ui I, [2024-05-26T00:56:29.432040 #463473] INFO -- : [686/883] 504442=test_rdoc_generator_ri I, [2024-05-26T00:56:29.438342 #463473] INFO -- : [687/883] 504442=test_propertyputref I, [2024-05-26T00:56:29.449102 #463473] INFO -- : [688/883] 504442=test_gb18030 I, [2024-05-26T00:56:29.464469 #463473] INFO -- : [689/883] 504442=test_gem_commands_lock_command I, [2024-05-26T00:56:29.498939 #463473] INFO -- : [690/883] 504442=test_reline_key I, [2024-05-26T00:56:29.518515 #463473] INFO -- : [691/883] 504442=test_color I, [2024-05-26T00:56:29.616536 #463473] INFO -- : [692/883] 504442=test_rdoc_top_level I, [2024-05-26T00:56:29.904995 #463473] INFO -- : [693/883] 504442=test_io_m17n I, [2024-05-26T00:56:31.199091 #463473] INFO -- : [694/883] 504442=test_cmethod I, [2024-05-26T00:56:31.215034 #463473] INFO -- : [695/883] 504442=test_gem_stub_specification I, [2024-05-26T00:56:31.380116 #463473] INFO -- : [696/883] 504442=test_float I, [2024-05-26T00:56:32.895697 #463473] INFO -- : [697/883] 504441=test_nonblock I, [2024-05-26T00:56:32.930416 #463473] INFO -- : [698/883] 504441=test_rdoc_parser_simple I, [2024-05-26T00:56:32.968114 #463473] INFO -- : [699/883] 504441=json_ext_parser_test I, [2024-05-26T00:56:32.996118 #463473] INFO -- : [700/883] 504441=test_gem_ext_configure_builder I, [2024-05-26T00:56:33.025952 #463473] INFO -- : [701/883] 504441=test_rdoc_generator_pot_po I, [2024-05-26T00:56:33.036247 #463473] INFO -- : [702/883] 504441=test_mul I, [2024-05-26T00:56:33.066861 #463473] INFO -- : [703/883] 504441=test_shellwords I, [2024-05-26T00:56:33.081709 #463473] INFO -- : [704/883] 504441=test_ocsp I, [2024-05-26T00:56:33.181271 #463473] INFO -- : [705/883] 504441=test_scanner_events I, [2024-05-26T00:56:33.220509 #463473] INFO -- : [706/883] 504441=test_ipaddr I, [2024-05-26T00:56:33.345285 #463473] INFO -- : [707/883] 504441=test_date_strptime I, [2024-05-26T00:56:33.447806 #463473] INFO -- : [708/883] 504442=test_omap I, [2024-05-26T00:56:33.450862 #463473] INFO -- : [709/883] 504442=test_mkmf I, [2024-05-26T00:56:33.461556 #463473] INFO -- : [710/883] 504441=test_gem_source I, [2024-05-26T00:56:33.492217 #463473] INFO -- : [711/883] 504442=test_have_macro I, [2024-05-26T00:56:33.784883 #463473] INFO -- : [712/883] 504442=test_class I, [2024-05-26T00:56:33.803693 #463473] INFO -- : [713/883] 504442=test_benchmark I, [2024-05-26T00:56:33.812982 #463473] INFO -- : [714/883] 504441=test_at_exit I, [2024-05-26T00:56:33.873576 #463473] INFO -- : [715/883] 504441=test_gem_package I, [2024-05-26T00:56:34.623279 #463473] INFO -- : [716/883] 504441=test_array I, [2024-05-26T00:56:35.509624 #463473] INFO -- : [717/883] 504442=test_autoload I, [2024-05-26T00:56:36.516050 #463473] INFO -- : [718/883] 504443=dispatcher_test I, [2024-05-26T00:56:36.526276 #463473] INFO -- : [719/883] 504443=test_eval_history I, [2024-05-26T00:56:36.536269 #463473] INFO -- : [720/883] 504443=test_unicode I, [2024-05-26T00:56:36.655953 #463473] INFO -- : [721/883] 504443=test_files_ext I, [2024-05-26T00:56:36.659125 #463473] INFO -- : [722/883] 504443=test_assembler I, [2024-05-26T00:56:36.735599 #463473] INFO -- : [723/883] 504443=test_stringio I, [2024-05-26T00:56:36.824965 #463473] INFO -- : [724/883] 504443=test_thread_cv I, [2024-05-26T00:56:37.477207 #463473] INFO -- : [725/883] 504443=test_random I, [2024-05-26T00:56:37.661049 #463473] INFO -- : [726/883] 504443=test_gem_source_git I, [2024-05-26T00:56:38.622200 #463473] INFO -- : [727/883] 504443=test_regex_casefold I, [2024-05-26T00:56:39.025634 #463473] INFO -- : [728/883] 504443=test_lexer I, [2024-05-26T00:56:39.041329 #463473] INFO -- : [729/883] 504443=test_win32ole_method I, [2024-05-26T00:56:39.115617 #463473] INFO -- : [730/883] 504443=test_ripper I, [2024-05-26T00:56:39.382765 #463473] INFO -- : [731/883] 504443=test_primitive I, [2024-05-26T00:56:39.396547 #463473] INFO -- : [732/883] 504443=test_parser I, [2024-05-26T00:56:39.417406 #463473] INFO -- : [733/883] 504443=test_rdoc_ri_paths I, [2024-05-26T00:56:39.459426 #463473] INFO -- : [734/883] 504443=test_iseq I, [2024-05-26T00:56:39.953895 #463473] INFO -- : [735/883] 504443=test_gem_safe_yaml I, [2024-05-26T00:56:39.963043 #463473] INFO -- : [736/883] 504443=test_eval I, [2024-05-26T00:56:39.968673 #463473] INFO -- : [737/883] 504443=test_document I, [2024-05-26T00:56:39.979400 #463473] INFO -- : [738/883] 504443=test_history I, [2024-05-26T00:56:40.080616 #463473] INFO -- : [739/883] 504443=test_gem_commands_setup_command I, [2024-05-26T00:56:40.279393 #463473] INFO -- : [740/883] 504442=test_singleton_function I, [2024-05-26T00:56:40.291270 #463473] INFO -- : [741/883] 504442=command_line_test I, [2024-05-26T00:56:40.331957 #463473] INFO -- : [742/883] 504442=test_pair I, [2024-05-26T00:56:40.850532 #463473] INFO -- : [743/883] 504443=test_win32ole_variant_m I, [2024-05-26T00:56:40.854270 #463473] INFO -- : [744/883] 504443=test_env I, [2024-05-26T00:56:43.386560 #463473] INFO -- : [745/883] 504443=test_gem_commands_signout_command I, [2024-05-26T00:56:43.416927 #463473] INFO -- : [746/883] 504443=test_gem_package_tar_reader I, [2024-05-26T00:56:43.496543 #463473] INFO -- : [747/883] 504443=test_gem_source_fetch_problem I, [2024-05-26T00:56:43.533699 #463473] INFO -- : [748/883] 504443=test_encoding I, [2024-05-26T00:56:43.549943 #463473] INFO -- : [749/883] 504443=test_install I, [2024-05-26T00:56:43.742098 #463473] INFO -- : [750/883] 504443=test_rdoc_comment I, [2024-05-26T00:56:43.783856 #463473] INFO -- : [751/883] 504443=test_sockopt I, [2024-05-26T00:56:43.792101 #463473] INFO -- : [752/883] 504443=test_ftp I, [2024-05-26T00:56:43.797840 #463473] INFO -- : [753/883] 504443=test_arithmetic_sequence I, [2024-05-26T00:56:43.871119 #463473] INFO -- : [754/883] 504443=test_ractor_compatibility I, [2024-05-26T00:56:44.174553 #463473] INFO -- : [755/883] 504443=integer_parse_test I, [2024-05-26T00:56:44.181796 #463473] INFO -- : [756/883] 504443=test_autoconf I, [2024-05-26T00:56:44.189089 #463473] INFO -- : [757/883] 504443=test_find_executable I, [2024-05-26T00:56:44.189614 #463473] INFO -- : [758/883] 504443=test_cgi_multipart I, [2024-05-26T00:56:44.279998 #463473] INFO -- : [759/883] 504443=test_lazy_enumerator I, [2024-05-26T00:56:44.729262 #463473] INFO -- : [760/883] 504443=test_gem_request_set_lockfile_tokenizer I, [2024-05-26T00:56:44.795201 #463473] INFO -- : [761/883] 504443=test_logdevice I, [2024-05-26T00:56:45.630448 #463473] INFO -- : [762/883] 504443=test_ast I, [2024-05-26T00:56:45.801075 #463473] INFO -- : [763/883] 504442=test_irb I, [2024-05-26T00:56:46.164034 #463473] INFO -- : [764/883] 504442=test_x509cert I, [2024-05-26T00:56:46.258319 #463473] INFO -- : [765/883] 504442=test_rdoc_markup_paragraph I, [2024-05-26T00:56:46.284936 #463473] INFO -- : [766/883] 504442=test_require_path_check I, [2024-05-26T00:56:46.465924 #463473] INFO -- : [767/883] 504442=test_bn I, [2024-05-26T00:56:46.494779 #463473] INFO -- : [768/883] 504442=test_variable_name_check I, [2024-05-26T00:56:46.630909 #463473] INFO -- : [769/883] 504442=test_gem_request_set_gem_dependency_api I, [2024-05-26T00:56:46.921656 #463473] INFO -- : [770/883] 504442=test_name_error_extension I, [2024-05-26T00:56:46.938430 #463473] INFO -- : [771/883] 504442=test_rdoc_markup_to_ansi I, [2024-05-26T00:56:46.984270 #463473] INFO -- : [772/883] 504442=test_files_test I, [2024-05-26T00:56:47.017882 #463473] INFO -- : [773/883] 504442=test_weakkeymap I, [2024-05-26T00:56:47.502082 #463473] INFO -- : [774/883] 504442=test_protocol I, [2024-05-26T00:56:47.814664 #463473] INFO -- : [775/883] 504442=test_evaluation I, [2024-05-26T00:56:47.834478 #463473] INFO -- : [776/883] 504442=test_https I, [2024-05-26T00:56:47.973842 #463473] INFO -- : [777/883] 504442=test_gem_commands_info_command I, [2024-05-26T00:56:47.988147 #463473] INFO -- : [778/883] 504442=test_object_create_start I, [2024-05-26T00:56:47.995412 #463473] INFO -- : [779/883] 504442=test_io_wait_uncommon I, [2024-05-26T00:56:48.079968 #463473] INFO -- : [780/883] 504442=test_gem_ci_detector I, [2024-05-26T00:56:48.097276 #463473] INFO -- : [781/883] 504442=test_signal I, [2024-05-26T00:56:50.099510 #463473] INFO -- : [782/883] 504442=test_gem_silent_ui I, [2024-05-26T00:56:50.143324 #463473] INFO -- : [783/883] 504442=test_fixnum I, [2024-05-26T00:56:50.156400 #463473] INFO -- : [784/883] 504442=test_continuation I, [2024-05-26T00:56:50.169771 #463473] INFO -- : [785/883] 504442=test_file_exhaustive I, [2024-05-26T00:56:51.535338 #463473] INFO -- : [786/883] 504441=test_completion I, [2024-05-26T00:56:52.267545 #463473] INFO -- : [787/883] 504441=test_handle I, [2024-05-26T00:56:53.708648 #463473] INFO -- : [788/883] 504441=parse_stream_test I, [2024-05-26T00:56:53.729722 #463473] INFO -- : [789/883] 504441=test_rdoc_markup_document I, [2024-05-26T00:56:53.740037 #463473] INFO -- : [790/883] 504441=test_delete I, [2024-05-26T00:56:53.760741 #463473] INFO -- : [791/883] 504441=test_gem_security_policy I, [2024-05-26T00:56:54.144196 #463473] INFO -- : [792/883] 504441=test_rational2 I, [2024-05-26T00:56:54.162346 #463473] INFO -- : [793/883] 504441=test_case_comprehensive I, [2024-05-26T00:57:01.170338 #463473] INFO -- : [794/883] 504442=test_logperiod I, [2024-05-26T00:57:01.191944 #463473] INFO -- : [795/883] 504442=test_placearg I, [2024-05-26T00:57:01.286974 #463473] INFO -- : [796/883] 504442=test_ssl_session I, [2024-05-26T00:57:02.140565 #463473] INFO -- : [797/883] 504442=test_gem_package_tar_header I, [2024-05-26T00:57:02.246848 #463473] INFO -- : [798/883] 504442=test_tmpdir I, [2024-05-26T00:57:02.380736 #463473] INFO -- : [799/883] 504442=test_struct I, [2024-05-26T00:57:02.940079 #463473] INFO -- : [800/883] 504442=test_rdoc_token_stream I, [2024-05-26T00:57:03.087223 #463473] INFO -- : [801/883] 504442=test_mutex I, [2024-05-26T00:57:04.080744 #463473] INFO -- : [802/883] 504442=heredoc_dedent_test I, [2024-05-26T00:57:04.101976 #463473] INFO -- : [803/883] 504442=test_type I, [2024-05-26T00:57:04.112230 #463473] INFO -- : [804/883] 504442=test_gem_ext_cargo_builder_link_flag_converter I, [2024-05-26T00:57:04.190789 #463473] INFO -- : [805/883] 504442=test_gem_local_remote_options I, [2024-05-26T00:57:04.239873 #463473] INFO -- : [806/883] 504442=test_rdoc_single_class I, [2024-05-26T00:57:04.261900 #463473] INFO -- : [807/883] 504442=test_dup I, [2024-05-26T00:57:04.420891 #463473] INFO -- : [808/883] 504442=test_acceptable I, [2024-05-26T00:57:04.482159 #463473] INFO -- : [809/883] 504442=test_gem_commands_check_command I, [2024-05-26T00:57:04.521046 #463473] INFO -- : [810/883] 504442=test_gem_resolver_git_set I, [2024-05-26T00:57:05.195934 #463473] INFO -- : [811/883] 504442=test_signedness I, [2024-05-26T00:57:07.084322 #463473] INFO -- : [812/883] 504442=test_digest I, [2024-05-26T00:57:07.885924 #463473] INFO -- : [813/883] 504442=test_gem_safe_marshal I, [2024-05-26T00:57:08.651796 #463473] INFO -- : [814/883] 504442=test_rdoc_ri_driver I, [2024-05-26T00:57:09.083983 #463473] INFO -- : [815/883] 504442=test_sexp I, [2024-05-26T00:57:09.117232 #463473] INFO -- : [816/883] 504442=test_httpheader I, [2024-05-26T00:57:09.132153 #463473] INFO -- : [817/883] 504442=test_ractor I, [2024-05-26T00:57:09.266236 #463473] INFO -- : [818/883] 504442=test_fiddle I, [2024-05-26T00:57:09.463465 #463473] INFO -- : [819/883] 504442=json_generic_object_test I, [2024-05-26T00:57:09.474550 #463473] INFO -- : [820/883] 504442=test_date_arith I, [2024-05-26T00:57:09.489848 #463473] INFO -- : [821/883] 504442=test_gem_resolver_vendor_specification I, [2024-05-26T00:57:09.536243 #463473] INFO -- : [822/883] 504442=test_ractor I, [2024-05-26T00:57:09.616576 #463473] INFO -- : [823/883] 504442=test_exception_at_throwing I, [2024-05-26T00:57:09.687402 #463473] INFO -- : [824/883] 504442=test_gem_resolver_installed_specification I, [2024-05-26T00:57:09.713995 #463473] INFO -- : [825/883] 504442=test_stringscanner I, [2024-05-26T00:57:09.749615 #463473] INFO -- : [826/883] 504442=test_depth_first I, [2024-05-26T00:57:09.762235 #463473] INFO -- : [827/883] 504442=test_change_word I, [2024-05-26T00:57:09.768582 #463473] INFO -- : [828/883] 504442=test_config I, [2024-05-26T00:57:09.933142 #463473] INFO -- : [829/883] 504442=test_ostruct I, [2024-05-26T00:57:10.071882 #463473] INFO -- : [830/883] 504442=test_rubyvm I, [2024-05-26T00:57:10.080657 #463473] INFO -- : [831/883] 504442=fuzzer_test I, [2024-05-26T00:57:10.126288 #463473] INFO -- : [832/883] 504442=test_cparser I, [2024-05-26T00:57:12.591903 #463473] INFO -- : [833/883] 504442=test_struct I, [2024-05-26T00:57:12.592650 #463473] INFO -- : [834/883] 504442=static_inspect_test I, [2024-05-26T00:57:12.607403 #463473] INFO -- : [835/883] 504442=test_c_struct_entry I, [2024-05-26T00:57:13.621229 #463473] INFO -- : [836/883] 504442=test_rdoc_parser_markdown I, [2024-05-26T00:57:13.643185 #463473] INFO -- : [837/883] 504442=test_custom_command I, [2024-05-26T00:57:13.650919 #463473] INFO -- : [838/883] 504442=test_key_error I, [2024-05-26T00:57:13.656434 #463473] INFO -- : [839/883] 504442=test_win32ole_param I, [2024-05-26T00:57:13.749941 #463473] INFO -- : [840/883] 504442=test_engine I, [2024-05-26T00:57:14.166677 #463473] INFO -- : [841/883] 504442=test_gem_commands_mirror I, [2024-05-26T00:57:14.226230 #463473] INFO -- : [842/883] 504442=test_fiber I, [2024-05-26T00:57:14.278750 #463473] INFO -- : [843/883] 504441=test_gem_package_task I, [2024-05-26T00:57:14.279469 #463473] INFO -- : [844/883] 504441=test_lock_native_thread I, [2024-05-26T00:57:14.591455 #463473] INFO -- : [845/883] 504441=test_resize I, [2024-05-26T00:57:14.649930 #463473] INFO -- : [846/883] 504441=test_abi I, [2024-05-26T00:57:14.757391 #463473] INFO -- : [847/883] 504441=test_load I, [2024-05-26T00:57:14.770920 #463473] INFO -- : [848/883] 504441=test_integer_comb I, [2024-05-26T00:57:17.458604 #463473] INFO -- : [849/883] 504441=test_bundled_ca I, [2024-05-26T00:57:18.933449 #463473] INFO -- : [850/883] 504441=test_ssl I, [2024-05-26T00:57:20.358570 #463473] INFO -- : [851/883] 504442=test_gem_security_trust_dir I, [2024-05-26T00:57:20.434661 #463473] INFO -- : [852/883] 504442=test_module I, [2024-05-26T00:57:23.547832 #463473] INFO -- : [853/883] 504442=test_erb_command I, [2024-05-26T00:57:23.595243 #463473] INFO -- : [854/883] 504442=test_usrmarshal I, [2024-05-26T00:57:23.775597 #463473] INFO -- : [855/883] 504442=test_gem_source_installed I, [2024-05-26T00:57:23.807093 #463473] INFO -- : [856/883] 504442=test_gem_validator I, [2024-05-26T00:57:23.827772 #463473] INFO -- : [857/883] 504442=test_tracer I, [2024-05-26T00:57:23.838019 #463473] INFO -- : [858/883] 504442=test_cgi_cookie I, [2024-05-26T00:57:23.845382 #463473] INFO -- : [859/883] 504442=test_not I, [2024-05-26T00:57:23.853451 #463473] INFO -- : [860/883] 504442=test_option I, [2024-05-26T00:57:23.981843 #463473] INFO -- : [861/883] 504442=test_wss I, [2024-05-26T00:57:23.992623 #463473] INFO -- : [862/883] 504442=test_rdoc_markup_attribute_manager I, [2024-05-26T00:57:24.052187 #463473] INFO -- : [863/883] 504442=test_require I, [2024-05-26T00:57:26.676079 #463473] INFO -- : [864/883] 504442=test_objectspace I, [2024-05-26T00:57:27.703591 #463473] INFO -- : [865/883] 504442=test_debugger_integration I, [2024-05-26T00:57:27.708258 #463473] INFO -- : [866/883] 504442=test_gem_resolver_composed_set I, [2024-05-26T00:57:27.736312 #463473] INFO -- : [867/883] 504442=test_my_integer I, [2024-05-26T00:57:27.739273 #463473] INFO -- : [868/883] 504442=test_require_lib I, [2024-05-26T00:57:29.724156 #463473] INFO -- : [869/883] 504441=test_gem_gem_runner I, [2024-05-26T00:57:29.772763 #463473] INFO -- : [870/883] 504441=test_metaclass I, [2024-05-26T00:57:29.785495 #463473] INFO -- : [871/883] 504441=test_rdoc_rd_block_parser I, [2024-05-26T00:57:29.829664 #463473] INFO -- : [872/883] 504441=test_x509store I, [2024-05-26T00:57:30.338594 #463473] INFO -- : [873/883] 504441=test_rdoc_rd I, [2024-05-26T00:57:30.342007 #463473] INFO -- : [874/883] 504441=test_rdoc_markup_to_joined_paragraph I, [2024-05-26T00:57:30.364814 #463473] INFO -- : [875/883] 504441=test_rdoc_markup_to_markdown I, [2024-05-26T00:57:30.404760 #463473] INFO -- : [876/883] 504441=test_rdoc_generator_pot I, [2024-05-26T00:57:30.406918 #463473] INFO -- : [877/883] 504441=test_load I, [2024-05-26T00:57:30.410932 #463473] INFO -- : [878/883] 504441=test_win32ole_type I, [2024-05-26T00:57:30.426395 #463473] INFO -- : [879/883] 504441=test_rdoc_rd_inline_parser I, [2024-05-26T00:57:30.478577 #463473] INFO -- : [880/883] 504441=test_cipher I, [2024-05-26T00:57:30.581891 #463473] INFO -- : [881/883] 504441=test_update I, [2024-05-26T00:57:30.587807 #463473] INFO -- : [882/883] 504441=test_new I, [2024-05-26T00:57:30.602324 #463473] INFO -- : [883/883] 504441=test_gem_source_lock I, [2024-05-26T00:57:31.818903 #463473] INFO -- : Finished tests in 199.038731s, 132.1301 tests/s, 47002.5757 assertions/s. I, [2024-05-26T00:57:31.823657 #463473] INFO -- : 26299 tests, 9355333 assertions, 0 failures, 0 errors, 320 skips I, [2024-05-26T00:57:31.823688 #463473] INFO -- : I, [2024-05-26T00:57:31.823699 #463473] INFO -- : ruby -v: ruby 3.4.0dev (2024-05-25T17:47:07Z master d2c4363e0c) [aarch64-linux] I, [2024-05-26T00:57:31.824528 #463473] INFO -- : $$$[end] "make yes-test-all TESTOPTS='--stderr-on-failure' TESTS='-j3'" exit with 0. I, [2024-05-26T00:57:31.824712 #463473] INFO -- : $$$[beg] make yes-test-rubyspec MSPECOPT='--error-output stderr --debug -j' TESTS='-j3' I, [2024-05-26T00:57:31.950536 #463473] INFO -- : BASERUBY = /usr/local/bin/ruby --disable=gems I, [2024-05-26T00:57:31.950608 #463473] INFO -- : CC = gcc I, [2024-05-26T00:57:31.950619 #463473] INFO -- : LD = ld I, [2024-05-26T00:57:31.950628 #463473] INFO -- : LDSHARED = gcc -shared I, [2024-05-26T00:57:31.950640 #463473] INFO -- : CFLAGS = -O3 -fno-fast-math -ggdb3 -Wall -Wextra -Wdeprecated-declarations -Wdiv-by-zero -Wduplicated-cond -Wimplicit-function-declaration -Wimplicit-int -Wpointer-arith -Wwrite-strings -Wold-style-definition -Wimplicit-fallthrough=0 -Wmissing-noreturn -Wno-cast-function-type -Wno-constant-logical-operand -Wno-long-long -Wno-missing-field-initializers -Wno-overlength-strings -Wno-packed-bitfield-compat -Wno-parentheses-equality -Wno-self-assign -Wno-tautological-compare -Wno-unused-parameter -Wno-unused-value -Wsuggest-attribute=format -Wsuggest-attribute=noreturn -Wunused-variable -Wmisleading-indentation -Wundef I, [2024-05-26T00:57:31.950649 #463473] INFO -- : XCFLAGS = -U_FORTIFY_SOURCE -D_FORTIFY_SOURCE=2 -fstack-protector-strong -msign-return-address=all -fno-strict-overflow -fvisibility=hidden -fexcess-precision=standard -DRUBY_EXPORT -fPIE -I. -I.ext/include/aarch64-linux -I/home/opc/ruby/src/master/include -I/home/opc/ruby/src/master -I/home/opc/ruby/src/master/prism -I/home/opc/ruby/src/master/enc/unicode/15.0.0 I, [2024-05-26T00:57:31.950658 #463473] INFO -- : CPPFLAGS = I, [2024-05-26T00:57:31.950666 #463473] INFO -- : DLDFLAGS = -Wl,--compress-debug-sections=zlib -fstack-protector-strong -pie I, [2024-05-26T00:57:31.950676 #463473] INFO -- : SOLIBS = -lz -lrt -lrt -ldl -lcrypt -lm -lpthread I, [2024-05-26T00:57:31.950684 #463473] INFO -- : LANG = en_US.UTF-8 I, [2024-05-26T00:57:31.950693 #463473] INFO -- : LC_ALL = I, [2024-05-26T00:57:31.950701 #463473] INFO -- : LC_CTYPE = I, [2024-05-26T00:57:31.950709 #463473] INFO -- : MFLAGS = I, [2024-05-26T00:57:31.950718 #463473] INFO -- : RUSTC = rustc I, [2024-05-26T00:57:31.950726 #463473] INFO -- : YJIT_RUSTC_ARGS = --crate-name=yjit --crate-type=staticlib --edition=2021 -g -C lto=thin -C opt-level=3 -C overflow-checks=on '--out-dir=/home/opc/ruby/build/master/yjit/target/release/' /home/opc/ruby/src/master/yjit/src/lib.rs I, [2024-05-26T00:57:31.951440 #463473] INFO -- : gcc (GCC) 8.5.0 20210514 (Red Hat 8.5.0-10.1.0.1) I, [2024-05-26T00:57:31.951455 #463473] INFO -- : Copyright (C) 2018 Free Software Foundation, Inc. I, [2024-05-26T00:57:31.951464 #463473] INFO -- : This is free software; see the source for copying conditions. There is NO I, [2024-05-26T00:57:31.951472 #463473] INFO -- : warranty; not even for MERCHANTABILITY or FITNESS FOR A PARTICULAR PURPOSE. I, [2024-05-26T00:57:31.951481 #463473] INFO -- : I, [2024-05-26T00:57:31.953501 #463473] INFO -- : generating enc.mk I, [2024-05-26T00:57:32.186564 #463473] INFO -- : generating encdb.h I, [2024-05-26T00:57:32.223478 #463473] INFO -- : encdb.h unchanged I, [2024-05-26T00:57:32.224769 #463473] INFO -- : making enc I, [2024-05-26T00:57:32.252209 #463473] INFO -- : make[1]: Entering directory '/home/opc/ruby/build/master' I, [2024-05-26T00:57:32.252269 #463473] INFO -- : make[1]: Nothing to be done for 'enc'. I, [2024-05-26T00:57:32.252282 #463473] INFO -- : make[1]: Leaving directory '/home/opc/ruby/build/master' I, [2024-05-26T00:57:32.253001 #463473] INFO -- : making srcs under enc I, [2024-05-26T00:57:32.295214 #463473] INFO -- : make[1]: Entering directory '/home/opc/ruby/build/master' I, [2024-05-26T00:57:32.295274 #463473] INFO -- : make[1]: Nothing to be done for 'srcs'. I, [2024-05-26T00:57:32.295284 #463473] INFO -- : make[1]: Leaving directory '/home/opc/ruby/build/master' I, [2024-05-26T00:57:32.296422 #463473] INFO -- : generating transdb.h I, [2024-05-26T00:57:32.441978 #463473] INFO -- : transdb.h unchanged I, [2024-05-26T00:57:32.443415 #463473] INFO -- : making trans I, [2024-05-26T00:57:32.491717 #463473] INFO -- : make[1]: Entering directory '/home/opc/ruby/build/master' I, [2024-05-26T00:57:32.491770 #463473] INFO -- : make[1]: Nothing to be done for 'trans'. I, [2024-05-26T00:57:32.491781 #463473] INFO -- : make[1]: Leaving directory '/home/opc/ruby/build/master' I, [2024-05-26T00:57:32.492619 #463473] INFO -- : making encs I, [2024-05-26T00:57:32.544981 #463473] INFO -- : make[1]: Entering directory '/home/opc/ruby/build/master' I, [2024-05-26T00:57:32.545055 #463473] INFO -- : make[1]: Nothing to be done for 'encs'. I, [2024-05-26T00:57:32.545065 #463473] INFO -- : make[1]: Leaving directory '/home/opc/ruby/build/master' I, [2024-05-26T00:57:32.547285 #463473] INFO -- : generating makefiles ext/configure-ext.mk I, [2024-05-26T00:57:32.588999 #463473] INFO -- : ext/configure-ext.mk updated I, [2024-05-26T00:57:32.592531 #463473] INFO -- : make[1]: Entering directory '/home/opc/ruby/build/master' I, [2024-05-26T00:57:34.739232 #463473] INFO -- : make[1]: Leaving directory '/home/opc/ruby/build/master' I, [2024-05-26T00:57:34.739963 #463473] INFO -- : generating makefile exts.mk I, [2024-05-26T00:57:34.800506 #463473] INFO -- : exts.mk unchanged I, [2024-05-26T00:57:34.805500 #463473] INFO -- : make[1]: Entering directory '/home/opc/ruby/build/master' I, [2024-05-26T00:57:35.107283 #463473] INFO -- : make[2]: Entering directory '/home/opc/ruby/build/master/ext/coverage' I, [2024-05-26T00:57:35.111967 #463473] INFO -- : make[2]: Leaving directory '/home/opc/ruby/build/master/ext/coverage' I, [2024-05-26T00:57:35.117619 #463473] INFO -- : make[2]: Entering directory '/home/opc/ruby/build/master/ext/date' I, [2024-05-26T00:57:35.123548 #463473] INFO -- : make[2]: Leaving directory '/home/opc/ruby/build/master/ext/date' I, [2024-05-26T00:57:35.126937 #463473] INFO -- : make[2]: Entering directory '/home/opc/ruby/build/master/ext/digest' I, [2024-05-26T00:57:35.135662 #463473] INFO -- : make[2]: Leaving directory '/home/opc/ruby/build/master/ext/digest' I, [2024-05-26T00:57:35.157936 #463473] INFO -- : make[2]: Entering directory '/home/opc/ruby/build/master/ext/digest/sha2' I, [2024-05-26T00:57:35.162779 #463473] INFO -- : make[2]: Leaving directory '/home/opc/ruby/build/master/ext/digest/sha2' I, [2024-05-26T00:57:35.181275 #463473] INFO -- : make[2]: Entering directory '/home/opc/ruby/build/master/ext/fiddle' I, [2024-05-26T00:57:35.191312 #463473] INFO -- : make[2]: Leaving directory '/home/opc/ruby/build/master/ext/fiddle' I, [2024-05-26T00:57:35.195616 #463473] INFO -- : make[2]: Entering directory '/home/opc/ruby/build/master/ext/io/console' I, [2024-05-26T00:57:35.199898 #463473] INFO -- : make[2]: Leaving directory '/home/opc/ruby/build/master/ext/io/console' I, [2024-05-26T00:57:35.210772 #463473] INFO -- : make[2]: Entering directory '/home/opc/ruby/build/master/ext/json' I, [2024-05-26T00:57:35.220184 #463473] INFO -- : make[2]: Leaving directory '/home/opc/ruby/build/master/ext/json' I, [2024-05-26T00:57:35.233324 #463473] INFO -- : make[2]: Entering directory '/home/opc/ruby/build/master/ext/monitor' I, [2024-05-26T00:57:35.237413 #463473] INFO -- : make[2]: Leaving directory '/home/opc/ruby/build/master/ext/monitor' I, [2024-05-26T00:57:35.243597 #463473] INFO -- : make[2]: Entering directory '/home/opc/ruby/build/master/ext/objspace' I, [2024-05-26T00:57:35.249537 #463473] INFO -- : make[2]: Leaving directory '/home/opc/ruby/build/master/ext/objspace' I, [2024-05-26T00:57:35.268478 #463473] INFO -- : make[2]: Entering directory '/home/opc/ruby/build/master/ext/openssl' I, [2024-05-26T00:57:35.290150 #463473] INFO -- : make[2]: Leaving directory '/home/opc/ruby/build/master/ext/openssl' I, [2024-05-26T00:57:35.294436 #463473] INFO -- : make[2]: Entering directory '/home/opc/ruby/build/master/ext/pathname' I, [2024-05-26T00:57:35.298774 #463473] INFO -- : make[2]: Leaving directory '/home/opc/ruby/build/master/ext/pathname' I, [2024-05-26T00:57:35.305995 #463473] INFO -- : make[2]: Entering directory '/home/opc/ruby/build/master/ext/psych' I, [2024-05-26T00:57:35.333717 #463473] INFO -- : make[2]: Leaving directory '/home/opc/ruby/build/master/ext/psych' I, [2024-05-26T00:57:35.338251 #463473] INFO -- : make[2]: Entering directory '/home/opc/ruby/build/master/ext/pty' I, [2024-05-26T00:57:35.342802 #463473] INFO -- : make[2]: Leaving directory '/home/opc/ruby/build/master/ext/pty' I, [2024-05-26T00:57:35.356954 #463473] INFO -- : make[2]: Entering directory '/home/opc/ruby/build/master/ext/ripper' I, [2024-05-26T00:57:35.367029 #463473] INFO -- : make[2]: Leaving directory '/home/opc/ruby/build/master/ext/ripper' I, [2024-05-26T00:57:35.368973 #463473] INFO -- : make[2]: Entering directory '/home/opc/ruby/build/master/ext/rubyvm' I, [2024-05-26T00:57:35.372674 #463473] INFO -- : make[2]: Leaving directory '/home/opc/ruby/build/master/ext/rubyvm' I, [2024-05-26T00:57:35.384798 #463473] INFO -- : make[2]: Entering directory '/home/opc/ruby/build/master/ext/socket' I, [2024-05-26T00:57:35.396040 #463473] INFO -- : make[2]: Leaving directory '/home/opc/ruby/build/master/ext/socket' I, [2024-05-26T00:57:35.411212 #463473] INFO -- : make[2]: Entering directory '/home/opc/ruby/build/master/.bundle/gems/bigdecimal-3.1.7/ext/bigdecimal' I, [2024-05-26T00:57:35.441610 #463473] INFO -- : make[2]: Leaving directory '/home/opc/ruby/build/master/.bundle/gems/bigdecimal-3.1.7/ext/bigdecimal' I, [2024-05-26T00:57:35.444191 #463473] INFO -- : make[2]: Entering directory '/home/opc/ruby/build/master/.bundle/gems/bigdecimal-3.1.8/ext/bigdecimal' I, [2024-05-26T00:57:35.474397 #463473] INFO -- : make[2]: Leaving directory '/home/opc/ruby/build/master/.bundle/gems/bigdecimal-3.1.8/ext/bigdecimal' I, [2024-05-26T00:57:35.476948 #463473] INFO -- : make[2]: Entering directory '/home/opc/ruby/build/master/.bundle/gems/debug-1.9.2/ext/debug' I, [2024-05-26T00:57:35.507291 #463473] INFO -- : make[2]: Leaving directory '/home/opc/ruby/build/master/.bundle/gems/debug-1.9.2/ext/debug' I, [2024-05-26T00:57:35.509793 #463473] INFO -- : make[2]: Entering directory '/home/opc/ruby/build/master/.bundle/gems/nkf-0.2.0/ext/nkf' I, [2024-05-26T00:57:35.539851 #463473] INFO -- : make[2]: Leaving directory '/home/opc/ruby/build/master/.bundle/gems/nkf-0.2.0/ext/nkf' I, [2024-05-26T00:57:35.542352 #463473] INFO -- : make[2]: Entering directory '/home/opc/ruby/build/master/.bundle/gems/racc-1.7.3/ext/racc/cparse' I, [2024-05-26T00:57:35.573383 #463473] INFO -- : make[2]: Leaving directory '/home/opc/ruby/build/master/.bundle/gems/racc-1.7.3/ext/racc/cparse' I, [2024-05-26T00:57:35.575834 #463473] INFO -- : make[2]: Entering directory '/home/opc/ruby/build/master/.bundle/gems/racc-1.8.0/ext/racc/cparse' I, [2024-05-26T00:57:35.606659 #463473] INFO -- : make[2]: Leaving directory '/home/opc/ruby/build/master/.bundle/gems/racc-1.8.0/ext/racc/cparse' I, [2024-05-26T00:57:35.609703 #463473] INFO -- : make[2]: Entering directory '/home/opc/ruby/build/master/.bundle/gems/rbs-3.4.4/ext/rbs_extension' I, [2024-05-26T00:57:35.640441 #463473] INFO -- : make[2]: Leaving directory '/home/opc/ruby/build/master/.bundle/gems/rbs-3.4.4/ext/rbs_extension' I, [2024-05-26T00:57:35.642997 #463473] INFO -- : make[2]: Entering directory '/home/opc/ruby/build/master/.bundle/gems/syslog-0.1.2/ext/syslog' I, [2024-05-26T00:57:35.673563 #463473] INFO -- : make[2]: Leaving directory '/home/opc/ruby/build/master/.bundle/gems/syslog-0.1.2/ext/syslog' I, [2024-05-26T00:57:35.712261 #463473] INFO -- : make[2]: Entering directory '/home/opc/ruby/build/master' I, [2024-05-26T00:57:35.796257 #463473] INFO -- : make[2]: 'ruby' is up to date. I, [2024-05-26T00:57:35.796334 #463473] INFO -- : make[2]: Leaving directory '/home/opc/ruby/build/master' I, [2024-05-26T00:57:35.796462 #463473] INFO -- : make[1]: Leaving directory '/home/opc/ruby/build/master' I, [2024-05-26T00:57:35.800918 #463473] INFO -- : make[1]: Entering directory '/home/opc/ruby/build/master' I, [2024-05-26T00:57:35.800956 #463473] INFO -- : make[1]: Nothing to be done for 'note'. I, [2024-05-26T00:57:35.800966 #463473] INFO -- : make[1]: Leaving directory '/home/opc/ruby/build/master' E, [2024-05-26T00:57:35.877916 #463473] ERROR -- : $ /home/opc/ruby/build/master/miniruby -I/home/opc/ruby/src/master/lib /home/opc/ruby/src/master/tool/runruby.rb --archdir=/home/opc/ruby/build/master --extout=.ext -- /home/opc/ruby/src/master/spec/mspec/bin/mspec-run -B /home/opc/ruby/src/master/spec/default.mspec --error-output stderr --debug -fy -o /tmp/rubytest.eqt1c8/1-mspec-multi-0 E, [2024-05-26T00:57:35.878291 #463473] ERROR -- : $ /home/opc/ruby/build/master/miniruby -I/home/opc/ruby/src/master/lib /home/opc/ruby/src/master/tool/runruby.rb --archdir=/home/opc/ruby/build/master --extout=.ext -- /home/opc/ruby/src/master/spec/mspec/bin/mspec-run -B /home/opc/ruby/src/master/spec/default.mspec --error-output stderr --debug -fy -o /tmp/rubytest.eqt1c8/2-mspec-multi-1 E, [2024-05-26T00:57:35.878616 #463473] ERROR -- : $ /home/opc/ruby/build/master/miniruby -I/home/opc/ruby/src/master/lib /home/opc/ruby/src/master/tool/runruby.rb --archdir=/home/opc/ruby/build/master --extout=.ext -- /home/opc/ruby/src/master/spec/mspec/bin/mspec-run -B /home/opc/ruby/src/master/spec/default.mspec --error-output stderr --debug -fy -o /tmp/rubytest.eqt1c8/3-mspec-multi-2 I, [2024-05-26T00:57:36.010315 #463473] INFO -- : ruby 3.4.0dev (2024-05-25T17:47:07Z master d2c4363e0c) [aarch64-linux] I, [2024-05-26T00:57:41.521610 #463473] INFO -- : 0 ......................................................................... I, [2024-05-26T00:57:43.834236 #463473] INFO -- : 73 ......................................................................... I, [2024-05-26T00:57:44.030601 #463473] INFO -- : 146 ......................................................................... I, [2024-05-26T00:57:44.322194 #463473] INFO -- : 219 ......................................................................... I, [2024-05-26T00:57:44.476279 #463473] INFO -- : 292 ......................................................................... I, [2024-05-26T00:57:44.710285 #463473] INFO -- : 365 ......................................................................... I, [2024-05-26T00:57:44.835758 #463473] INFO -- : 438 ......................................................................... I, [2024-05-26T00:57:44.894864 #463473] INFO -- : 511 ......................................................................... I, [2024-05-26T00:57:44.956008 #463473] INFO -- : 584 ......................................................................... I, [2024-05-26T00:57:45.568775 #463473] INFO -- : 657 ......................................................................... I, [2024-05-26T00:57:45.684700 #463473] INFO -- : 730 ......................................................................... I, [2024-05-26T00:57:45.731296 #463473] INFO -- : 803 ......................................................................... I, [2024-05-26T00:57:45.931492 #463473] INFO -- : 876 ......................................................................... I, [2024-05-26T00:57:46.033019 #463473] INFO -- : 949 ......................................................................... I, [2024-05-26T00:57:46.644730 #463473] INFO -- : 1022 ......................................................................... I, [2024-05-26T00:57:48.953401 #463473] INFO -- : 1095 ......................................................................... I, [2024-05-26T00:57:49.793961 #463473] INFO -- : 1168 ......................................................................... I, [2024-05-26T00:57:49.956391 #463473] INFO -- : 1241 ......................................................................... I, [2024-05-26T00:57:50.193333 #463473] INFO -- : 1314 ......................................................................... I, [2024-05-26T00:57:50.290902 #463473] INFO -- : 1387 ......................................................................... I, [2024-05-26T00:57:52.286730 #463473] INFO -- : 1460 ......................................................................... I, [2024-05-26T00:57:55.840229 #463473] INFO -- : 1533 ......................................................................... I, [2024-05-26T00:57:55.989584 #463473] INFO -- : 1606 ......................................................................... I, [2024-05-26T00:57:56.792260 #463473] INFO -- : 1679 ......................................................................... I, [2024-05-26T00:57:57.016099 #463473] INFO -- : 1752 ......................................................................... I, [2024-05-26T00:57:57.268157 #463473] INFO -- : 1825 ......................................................................... I, [2024-05-26T00:57:57.604830 #463473] INFO -- : 1898 ......................................................................... I, [2024-05-26T00:57:57.990958 #463473] INFO -- : 1971 ......................................................................... I, [2024-05-26T00:57:58.504943 #463473] INFO -- : 2044 ......................................................................... I, [2024-05-26T00:57:58.606911 #463473] INFO -- : 2117 ......................................................................... I, [2024-05-26T00:57:58.666753 #463473] INFO -- : 2190 ......................................................................... I, [2024-05-26T00:57:58.717874 #463473] INFO -- : 2263 ......................................................................... I, [2024-05-26T00:57:58.766694 #463473] INFO -- : 2336 ......................................................................... I, [2024-05-26T00:57:58.852906 #463473] INFO -- : 2409 ......................................................................... I, [2024-05-26T00:57:59.132762 #463473] INFO -- : 2482 ......................................................................... I, [2024-05-26T00:57:59.275875 #463473] INFO -- : 2555 ......................................................................... I, [2024-05-26T00:58:00.568115 #463473] INFO -- : 2628 ......................................................................... I, [2024-05-26T00:58:00.720092 #463473] INFO -- : 2701 ......................................................................... I, [2024-05-26T00:58:00.859684 #463473] INFO -- : 2774 ......................................................................... I, [2024-05-26T00:58:01.165638 #463473] INFO -- : 2847 ......................................................................... I, [2024-05-26T00:58:01.437577 #463473] INFO -- : 2920 ......................................................................... I, [2024-05-26T00:58:01.550830 #463473] INFO -- : 2993 ......................................................................... I, [2024-05-26T00:58:01.614951 #463473] INFO -- : 3066 ......................................................................... I, [2024-05-26T00:58:01.660099 #463473] INFO -- : 3139 ......................................................................... I, [2024-05-26T00:58:01.721233 #463473] INFO -- : 3212 ......................................................................... I, [2024-05-26T00:58:01.786039 #463473] INFO -- : 3285 ......................................................................... I, [2024-05-26T00:58:05.617651 #463473] INFO -- : 3358 ......................................................................... I, [2024-05-26T00:58:05.640375 #463473] INFO -- : I, [2024-05-26T00:58:05.640435 #463473] INFO -- : I, [2024-05-26T00:58:05.640447 #463473] INFO -- : Finished in 29.762501 seconds I, [2024-05-26T00:58:05.640456 #463473] INFO -- : I, [2024-05-26T00:58:05.640464 #463473] INFO -- : 3430 files, 32648 examples, 190798 expectations, 0 failures, 0 errors, 0 tagged I, [2024-05-26T00:58:05.641888 #463473] INFO -- : $$$[end] "make yes-test-rubyspec MSPECOPT='--error-output stderr --debug -j' TESTS='-j3'" exit with 0.