# Logfile created on 2024-05-25 11:03:13 +0000 by logger.rb/v1.5.3 I, [2024-05-25T11:03:13.635256 #1946972] INFO -- : #, @formatter=nil, @logdev=#, @binmode=false, @mon_data=#, @mon_data_owner_object_id=860>>> I, [2024-05-25T11:03:13.635554 #1946972] INFO -- : $$$[beg] make update-unicode -j3 I, [2024-05-25T11:03:13.725173 #1946972] INFO -- : Downloading Unicode emoji 15.0 files... I, [2024-05-25T11:03:13.725399 #1946972] INFO -- : Downloading Unicode emoji 15.0 files... I, [2024-05-25T11:03:13.725631 #1946972] INFO -- : Downloading Unicode emoji 15.0 files... I, [2024-05-25T11:03:13.802101 #1946972] INFO -- : made symlink emoji/15.0/emoji-sequences.txt to /home/opc/ruby/src/master/.downloaded-cache/emoji/15.0/emoji-sequences.txt I, [2024-05-25T11:03:13.807012 #1946972] INFO -- : downloading emoji/15.0/emoji-sequences.txt ... downloading emoji/15.0/emoji-test.txt ... /home/opc/ruby/src/master/enc/unicode/data/emoji/15.0/emoji-sequences.txt already exists E, [2024-05-25T11:03:14.256235 #1946972] ERROR -- : /home/opc/ruby/src/master/tool/downloader.rb:302:in `rescue in download': failed to download emoji/15.0/emoji-test.txt (RuntimeError) E, [2024-05-25T11:03:14.256305 #1946972] ERROR -- : OpenURI::HTTPError: 403 Forbidden: https://www.unicode.org/Public/emoji/15.0/emoji-test.txt E, [2024-05-25T11:03:14.256317 #1946972] ERROR -- : from /home/opc/ruby/src/master/tool/downloader.rb:201:in `download' E, [2024-05-25T11:03:14.256327 #1946972] ERROR -- : from /home/opc/ruby/src/master/tool/downloader.rb:136:in `download' E, [2024-05-25T11:03:14.256336 #1946972] ERROR -- : from /home/opc/ruby/src/master/tool/downloader.rb:482:in `block in
' E, [2024-05-25T11:03:14.256345 #1946972] ERROR -- : from /home/opc/ruby/src/master/tool/downloader.rb:465:in `each' E, [2024-05-25T11:03:14.256354 #1946972] ERROR -- : from /home/opc/ruby/src/master/tool/downloader.rb:465:in `
' E, [2024-05-25T11:03:14.256363 #1946972] ERROR -- : /usr/local/lib/ruby/3.2.0/open-uri.rb:369:in `open_http': 403 Forbidden (OpenURI::HTTPError) E, [2024-05-25T11:03:14.256372 #1946972] ERROR -- : from /usr/local/lib/ruby/3.2.0/open-uri.rb:760:in `buffer_open' E, [2024-05-25T11:03:14.256380 #1946972] ERROR -- : from /usr/local/lib/ruby/3.2.0/open-uri.rb:214:in `block in open_loop' E, [2024-05-25T11:03:14.256389 #1946972] ERROR -- : from /usr/local/lib/ruby/3.2.0/open-uri.rb:212:in `catch' E, [2024-05-25T11:03:14.256398 #1946972] ERROR -- : from /usr/local/lib/ruby/3.2.0/open-uri.rb:212:in `open_loop' E, [2024-05-25T11:03:14.256406 #1946972] ERROR -- : from /usr/local/lib/ruby/3.2.0/open-uri.rb:153:in `open_uri' E, [2024-05-25T11:03:14.256415 #1946972] ERROR -- : from /usr/local/lib/ruby/3.2.0/open-uri.rb:740:in `open' E, [2024-05-25T11:03:14.256424 #1946972] ERROR -- : from /usr/local/lib/ruby/3.2.0/open-uri.rb:748:in `read' E, [2024-05-25T11:03:14.256436 #1946972] ERROR -- : from /home/opc/ruby/src/master/tool/downloader.rb:247:in `block in download' E, [2024-05-25T11:03:14.256445 #1946972] ERROR -- : from /home/opc/ruby/src/master/tool/downloader.rb:378:in `with_retry' E, [2024-05-25T11:03:14.256453 #1946972] ERROR -- : from /home/opc/ruby/src/master/tool/downloader.rb:246:in `download' E, [2024-05-25T11:03:14.256462 #1946972] ERROR -- : from /home/opc/ruby/src/master/tool/downloader.rb:136:in `download' E, [2024-05-25T11:03:14.256471 #1946972] ERROR -- : from /home/opc/ruby/src/master/tool/downloader.rb:482:in `block in
' E, [2024-05-25T11:03:14.256479 #1946972] ERROR -- : from /home/opc/ruby/src/master/tool/downloader.rb:465:in `each' E, [2024-05-25T11:03:14.256514 #1946972] ERROR -- : from /home/opc/ruby/src/master/tool/downloader.rb:465:in `
' E, [2024-05-25T11:03:14.259290 #1946972] ERROR -- : make: *** [uncommon.mk:1756: /home/opc/ruby/src/master/enc/unicode/data/emoji/15.0/emoji-test.txt] Error 1 E, [2024-05-25T11:03:14.259332 #1946972] ERROR -- : make: *** Waiting for unfinished jobs.... E, [2024-05-25T11:03:14.353645 #1946972] ERROR -- : /home/opc/ruby/src/master/tool/downloader.rb:302:in `rescue in download': failed to download emoji/15.0/emoji-test.txt (RuntimeError) E, [2024-05-25T11:03:14.353707 #1946972] ERROR -- : OpenURI::HTTPError: 403 Forbidden: https://www.unicode.org/Public/emoji/15.0/emoji-test.txt E, [2024-05-25T11:03:14.353720 #1946972] ERROR -- : from /home/opc/ruby/src/master/tool/downloader.rb:201:in `download' E, [2024-05-25T11:03:14.353731 #1946972] ERROR -- : from /home/opc/ruby/src/master/tool/downloader.rb:136:in `download' E, [2024-05-25T11:03:14.353740 #1946972] ERROR -- : from /home/opc/ruby/src/master/tool/downloader.rb:482:in `block in
' E, [2024-05-25T11:03:14.353749 #1946972] ERROR -- : from /home/opc/ruby/src/master/tool/downloader.rb:465:in `each' E, [2024-05-25T11:03:14.353758 #1946972] ERROR -- : from /home/opc/ruby/src/master/tool/downloader.rb:465:in `
' E, [2024-05-25T11:03:14.353766 #1946972] ERROR -- : /usr/local/lib/ruby/3.2.0/open-uri.rb:369:in `open_http': 403 Forbidden (OpenURI::HTTPError) E, [2024-05-25T11:03:14.353774 #1946972] ERROR -- : from /usr/local/lib/ruby/3.2.0/open-uri.rb:760:in `buffer_open' E, [2024-05-25T11:03:14.353783 #1946972] ERROR -- : from /usr/local/lib/ruby/3.2.0/open-uri.rb:214:in `block in open_loop' E, [2024-05-25T11:03:14.353792 #1946972] ERROR -- : from /usr/local/lib/ruby/3.2.0/open-uri.rb:212:in `catch' E, [2024-05-25T11:03:14.353800 #1946972] ERROR -- : from /usr/local/lib/ruby/3.2.0/open-uri.rb:212:in `open_loop' E, [2024-05-25T11:03:14.353808 #1946972] ERROR -- : from /usr/local/lib/ruby/3.2.0/open-uri.rb:153:in `open_uri' E, [2024-05-25T11:03:14.353817 #1946972] ERROR -- : from /usr/local/lib/ruby/3.2.0/open-uri.rb:740:in `open' E, [2024-05-25T11:03:14.353825 #1946972] ERROR -- : from /usr/local/lib/ruby/3.2.0/open-uri.rb:748:in `read' E, [2024-05-25T11:03:14.353834 #1946972] ERROR -- : from /home/opc/ruby/src/master/tool/downloader.rb:247:in `block in download' E, [2024-05-25T11:03:14.353843 #1946972] ERROR -- : from /home/opc/ruby/src/master/tool/downloader.rb:378:in `with_retry' E, [2024-05-25T11:03:14.353851 #1946972] ERROR -- : from /home/opc/ruby/src/master/tool/downloader.rb:246:in `download' E, [2024-05-25T11:03:14.353860 #1946972] ERROR -- : from /home/opc/ruby/src/master/tool/downloader.rb:136:in `download' E, [2024-05-25T11:03:14.353869 #1946972] ERROR -- : from /home/opc/ruby/src/master/tool/downloader.rb:482:in `block in
' E, [2024-05-25T11:03:14.353877 #1946972] ERROR -- : from /home/opc/ruby/src/master/tool/downloader.rb:465:in `each' E, [2024-05-25T11:03:14.353886 #1946972] ERROR -- : from /home/opc/ruby/src/master/tool/downloader.rb:465:in `
' E, [2024-05-25T11:03:14.356555 #1946972] ERROR -- : make: *** [uncommon.mk:1756: /home/opc/ruby/src/master/enc/unicode/data/emoji/15.0/emoji-zwj-sequences.txt] Error 1 E, [2024-05-25T11:03:14.778065 #1946972] ERROR -- : /home/opc/ruby/src/master/tool/downloader.rb:302:in `rescue in download': failed to download emoji/15.0/emoji-sequences.txt (RuntimeError) E, [2024-05-25T11:03:14.778130 #1946972] ERROR -- : EOFError: end of file reached: https://www.unicode.org/Public/emoji/15.0/emoji-sequences.txt E, [2024-05-25T11:03:14.778141 #1946972] ERROR -- : from /home/opc/ruby/src/master/tool/downloader.rb:201:in `download' E, [2024-05-25T11:03:14.778168 #1946972] ERROR -- : from /home/opc/ruby/src/master/tool/downloader.rb:136:in `download' E, [2024-05-25T11:03:14.778179 #1946972] ERROR -- : from /home/opc/ruby/src/master/tool/downloader.rb:482:in `block in
' E, [2024-05-25T11:03:14.778189 #1946972] ERROR -- : from /home/opc/ruby/src/master/tool/downloader.rb:465:in `each' E, [2024-05-25T11:03:14.778197 #1946972] ERROR -- : from /home/opc/ruby/src/master/tool/downloader.rb:465:in `
' E, [2024-05-25T11:03:14.778206 #1946972] ERROR -- : /usr/local/lib/ruby/3.2.0/net/protocol.rb:237:in `rbuf_fill': end of file reached (EOFError) E, [2024-05-25T11:03:14.778215 #1946972] ERROR -- : from /usr/local/lib/ruby/3.2.0/net/protocol.rb:199:in `readuntil' E, [2024-05-25T11:03:14.778223 #1946972] ERROR -- : from /usr/local/lib/ruby/3.2.0/net/protocol.rb:209:in `readline' E, [2024-05-25T11:03:14.778232 #1946972] ERROR -- : from /usr/local/lib/ruby/3.2.0/net/http/response.rb:158:in `read_status_line' E, [2024-05-25T11:03:14.778241 #1946972] ERROR -- : from /usr/local/lib/ruby/3.2.0/net/http/response.rb:147:in `read_new' E, [2024-05-25T11:03:14.778250 #1946972] ERROR -- : from /usr/local/lib/ruby/3.2.0/net/http.rb:1862:in `block in transport_request' E, [2024-05-25T11:03:14.778259 #1946972] ERROR -- : from /usr/local/lib/ruby/3.2.0/net/http.rb:1853:in `catch' E, [2024-05-25T11:03:14.778267 #1946972] ERROR -- : from /usr/local/lib/ruby/3.2.0/net/http.rb:1853:in `transport_request' E, [2024-05-25T11:03:14.778275 #1946972] ERROR -- : from /usr/local/lib/ruby/3.2.0/net/http.rb:1826:in `request' E, [2024-05-25T11:03:14.778284 #1946972] ERROR -- : from /usr/local/lib/ruby/3.2.0/open-uri.rb:333:in `block in open_http' E, [2024-05-25T11:03:14.778293 #1946972] ERROR -- : from /usr/local/lib/ruby/3.2.0/net/http.rb:1238:in `start' E, [2024-05-25T11:03:14.778301 #1946972] ERROR -- : from /usr/local/lib/ruby/3.2.0/open-uri.rb:327:in `open_http' E, [2024-05-25T11:03:14.778310 #1946972] ERROR -- : from /usr/local/lib/ruby/3.2.0/open-uri.rb:760:in `buffer_open' E, [2024-05-25T11:03:14.778319 #1946972] ERROR -- : from /usr/local/lib/ruby/3.2.0/open-uri.rb:214:in `block in open_loop' E, [2024-05-25T11:03:14.778327 #1946972] ERROR -- : from /usr/local/lib/ruby/3.2.0/open-uri.rb:212:in `catch' E, [2024-05-25T11:03:14.778336 #1946972] ERROR -- : from /usr/local/lib/ruby/3.2.0/open-uri.rb:212:in `open_loop' E, [2024-05-25T11:03:14.778344 #1946972] ERROR -- : from /usr/local/lib/ruby/3.2.0/open-uri.rb:153:in `open_uri' E, [2024-05-25T11:03:14.778353 #1946972] ERROR -- : from /usr/local/lib/ruby/3.2.0/open-uri.rb:740:in `open' E, [2024-05-25T11:03:14.778361 #1946972] ERROR -- : from /usr/local/lib/ruby/3.2.0/open-uri.rb:748:in `read' E, [2024-05-25T11:03:14.778370 #1946972] ERROR -- : from /home/opc/ruby/src/master/tool/downloader.rb:247:in `block in download' E, [2024-05-25T11:03:14.778378 #1946972] ERROR -- : from /home/opc/ruby/src/master/tool/downloader.rb:378:in `with_retry' E, [2024-05-25T11:03:14.778387 #1946972] ERROR -- : from /home/opc/ruby/src/master/tool/downloader.rb:246:in `download' E, [2024-05-25T11:03:14.778395 #1946972] ERROR -- : from /home/opc/ruby/src/master/tool/downloader.rb:136:in `download' E, [2024-05-25T11:03:14.778404 #1946972] ERROR -- : from /home/opc/ruby/src/master/tool/downloader.rb:482:in `block in
' E, [2024-05-25T11:03:14.778413 #1946972] ERROR -- : from /home/opc/ruby/src/master/tool/downloader.rb:465:in `each' E, [2024-05-25T11:03:14.778421 #1946972] ERROR -- : from /home/opc/ruby/src/master/tool/downloader.rb:465:in `
' E, [2024-05-25T11:03:14.781208 #1946972] ERROR -- : make: *** [uncommon.mk:1756: /home/opc/ruby/src/master/enc/unicode/data/emoji/15.0/emoji-sequences.txt] Error 1 E, [2024-05-25T11:03:14.781261 #1946972] ERROR -- : make: *** Deleting file '/home/opc/ruby/src/master/enc/unicode/data/emoji/15.0/emoji-sequences.txt' I, [2024-05-25T11:03:14.781293 #1946972] INFO -- : downloading emoji/15.0/emoji-test.txt ... I, [2024-05-25T11:03:14.781473 #1946972] INFO -- : $$$[end] "make update-unicode -j3" exit with 512. I, [2024-05-25T11:03:14.781516 #1946972] INFO -- : $$$[beg] make update-download -j3 I, [2024-05-25T11:03:14.945883 #1946972] INFO -- : tool/config.guess already exists I, [2024-05-25T11:03:14.945955 #1946972] INFO -- : tool/config.sub already exists I, [2024-05-25T11:03:14.948921 #1946972] INFO -- : Update power_assert to 84e85124c5014a139af39161d484156cfe87a9ed I, [2024-05-25T11:03:14.949178 #1946972] INFO -- : Update rbs to ba7872795d5de04adb8ff500c0e6afdc81a041dd I, [2024-05-25T11:03:14.949381 #1946972] INFO -- : Update typeprof to b19a6416da3a05d57fadd6ffdadb382b6d236ca5 I, [2024-05-25T11:03:14.952261 #1946972] INFO -- : echo ba7872795d5de04adb8ff500c0e6afdc81a041dd | /bin/sh /home/opc/ruby/src/master/tool/ifchange /home/opc/ruby/src/master/.bundle/.timestamp/rbs.revision - I, [2024-05-25T11:03:14.952469 #1946972] INFO -- : echo 84e85124c5014a139af39161d484156cfe87a9ed | /bin/sh /home/opc/ruby/src/master/tool/ifchange /home/opc/ruby/src/master/.bundle/.timestamp/power_assert.revision - I, [2024-05-25T11:03:14.952660 #1946972] INFO -- : echo b19a6416da3a05d57fadd6ffdadb382b6d236ca5 | /bin/sh /home/opc/ruby/src/master/tool/ifchange /home/opc/ruby/src/master/.bundle/.timestamp/typeprof.revision - I, [2024-05-25T11:03:14.959816 #1946972] INFO -- : /home/opc/ruby/src/master/.bundle/.timestamp/typeprof.revision unchanged I, [2024-05-25T11:03:14.960320 #1946972] INFO -- : /home/opc/ruby/src/master/.bundle/.timestamp/rbs.revision unchanged I, [2024-05-25T11:03:14.962619 #1946972] INFO -- : /home/opc/ruby/src/master/.bundle/.timestamp/power_assert.revision unchanged I, [2024-05-25T11:03:15.059457 #1946972] INFO -- : Building power_assert@84e85124c5014a139af39161d484156cfe87a9ed to /home/opc/ruby/src/master/gems/power_assert-2.0.3.gem I, [2024-05-25T11:03:15.169613 #1946972] INFO -- : Successfully built RubyGem I, [2024-05-25T11:03:15.169671 #1946972] INFO -- : Name: power_assert I, [2024-05-25T11:03:15.169683 #1946972] INFO -- : Version: 2.0.4dev I, [2024-05-25T11:03:15.169692 #1946972] INFO -- : File: power_assert-2.0.4dev.gem I, [2024-05-25T11:03:15.249229 #1946972] INFO -- : $$$[end] "make update-download -j3" exit with 0. I, [2024-05-25T11:03:15.249298 #1946972] INFO -- : $$$[beg] make update-rubyspec -j3 I, [2024-05-25T11:03:15.337593 #1946972] INFO -- : make: Nothing to be done for 'update-rubyspec'. I, [2024-05-25T11:03:15.337769 #1946972] INFO -- : $$$[end] "make update-rubyspec -j3" exit with 0. I, [2024-05-25T11:03:15.337797 #1946972] INFO -- : $$$[beg] make update-src -j3 I, [2024-05-25T11:03:16.308502 #1946972] INFO -- : Already up to date. I, [2024-05-25T11:03:16.323764 #1946972] INFO -- : Latest commit hash = 4d0c5486a2 I, [2024-05-25T11:03:16.324414 #1946972] INFO -- : $$$[end] "make update-src -j3" exit with 0. I, [2024-05-25T11:03:16.324461 #1946972] INFO -- : $$$[beg] make after-update -j3 I, [2024-05-25T11:03:16.429261 #1946972] INFO -- : generating /home/opc/ruby/src/master/ext/ripper/eventids2table.c I, [2024-05-25T11:03:16.435775 #1946972] INFO -- : make[1]: Entering directory '/home/opc/ruby/src/master/ext/ripper' I, [2024-05-25T11:03:16.435838 #1946972] INFO -- : make[1]: Nothing to be done for 'src'. I, [2024-05-25T11:03:16.435850 #1946972] INFO -- : make[1]: Leaving directory '/home/opc/ruby/src/master/ext/ripper' I, [2024-05-25T11:03:16.465162 #1946972] INFO -- : /home/opc/ruby/src/master/revision.h updated I, [2024-05-25T11:03:16.466463 #1946972] INFO -- : generating aarch64-linux-fake.rb I, [2024-05-25T11:03:16.523963 #1946972] INFO -- : aarch64-linux-fake.rb updated I, [2024-05-25T11:03:16.525714 #1946972] INFO -- : generating enc.mk I, [2024-05-25T11:03:16.763645 #1946972] INFO -- : making srcs under enc I, [2024-05-25T11:03:16.805686 #1946972] INFO -- : make[1]: Entering directory '/home/opc/ruby/build/master' I, [2024-05-25T11:03:16.805762 #1946972] INFO -- : make[1]: Nothing to be done for 'srcs'. I, [2024-05-25T11:03:16.805774 #1946972] INFO -- : make[1]: Leaving directory '/home/opc/ruby/build/master' I, [2024-05-25T11:03:16.887560 #1946972] INFO -- : Update power_assert to 84e85124c5014a139af39161d484156cfe87a9ed I, [2024-05-25T11:03:16.887702 #1946972] INFO -- : Update rbs to ba7872795d5de04adb8ff500c0e6afdc81a041dd I, [2024-05-25T11:03:16.888648 #1946972] INFO -- : Update typeprof to b19a6416da3a05d57fadd6ffdadb382b6d236ca5 I, [2024-05-25T11:03:16.891407 #1946972] INFO -- : echo 84e85124c5014a139af39161d484156cfe87a9ed | /bin/sh /home/opc/ruby/src/master/tool/ifchange /home/opc/ruby/src/master/.bundle/.timestamp/power_assert.revision - I, [2024-05-25T11:03:16.891509 #1946972] INFO -- : echo ba7872795d5de04adb8ff500c0e6afdc81a041dd | /bin/sh /home/opc/ruby/src/master/tool/ifchange /home/opc/ruby/src/master/.bundle/.timestamp/rbs.revision - I, [2024-05-25T11:03:16.891764 #1946972] INFO -- : echo b19a6416da3a05d57fadd6ffdadb382b6d236ca5 | /bin/sh /home/opc/ruby/src/master/tool/ifchange /home/opc/ruby/src/master/.bundle/.timestamp/typeprof.revision - I, [2024-05-25T11:03:16.896653 #1946972] INFO -- : /home/opc/ruby/src/master/.bundle/.timestamp/power_assert.revision unchanged I, [2024-05-25T11:03:16.897115 #1946972] INFO -- : /home/opc/ruby/src/master/.bundle/.timestamp/typeprof.revision unchanged I, [2024-05-25T11:03:16.897152 #1946972] INFO -- : /home/opc/ruby/src/master/.bundle/.timestamp/rbs.revision unchanged I, [2024-05-25T11:03:17.030434 #1946972] INFO -- : Building power_assert@84e85124c5014a139af39161d484156cfe87a9ed to /home/opc/ruby/src/master/gems/power_assert-2.0.3.gem I, [2024-05-25T11:03:17.142190 #1946972] INFO -- : Successfully built RubyGem I, [2024-05-25T11:03:17.142253 #1946972] INFO -- : Name: power_assert I, [2024-05-25T11:03:17.142264 #1946972] INFO -- : Version: 2.0.4dev I, [2024-05-25T11:03:17.142273 #1946972] INFO -- : File: power_assert-2.0.4dev.gem I, [2024-05-25T11:03:17.144400 #1946972] INFO -- : Extracting bundle gem power_assert-2.0.3... I, [2024-05-25T11:03:17.240349 #1946972] INFO -- : Try with hash version of bundled gems instead of gems/power_assert-2.0.3.gem. We don't use this gem with release version of Ruby. I, [2024-05-25T11:03:17.250464 #1946972] INFO -- : Unpacked gems/power_assert-2.0.4dev.gem I, [2024-05-25T11:03:17.252185 #1946972] INFO -- : $$$[end] "make after-update -j3" exit with 0. I, [2024-05-25T11:03:17.252328 #1946972] INFO -- : $$$[beg] make miniruby -j3 I, [2024-05-25T11:03:17.340999 #1946972] INFO -- : BASERUBY = /usr/local/bin/ruby --disable=gems I, [2024-05-25T11:03:17.341065 #1946972] INFO -- : CC = gcc I, [2024-05-25T11:03:17.341077 #1946972] INFO -- : LD = ld I, [2024-05-25T11:03:17.341087 #1946972] INFO -- : LDSHARED = gcc -shared I, [2024-05-25T11:03:17.341098 #1946972] INFO -- : CFLAGS = -O3 -fno-fast-math -ggdb3 -Wall -Wextra -Wdeprecated-declarations -Wdiv-by-zero -Wduplicated-cond -Wimplicit-function-declaration -Wimplicit-int -Wpointer-arith -Wwrite-strings -Wold-style-definition -Wimplicit-fallthrough=0 -Wmissing-noreturn -Wno-cast-function-type -Wno-constant-logical-operand -Wno-long-long -Wno-missing-field-initializers -Wno-overlength-strings -Wno-packed-bitfield-compat -Wno-parentheses-equality -Wno-self-assign -Wno-tautological-compare -Wno-unused-parameter -Wno-unused-value -Wsuggest-attribute=format -Wsuggest-attribute=noreturn -Wunused-variable -Wmisleading-indentation -Wundef I, [2024-05-25T11:03:17.341108 #1946972] INFO -- : XCFLAGS = -U_FORTIFY_SOURCE -D_FORTIFY_SOURCE=2 -fstack-protector-strong -msign-return-address=all -fno-strict-overflow -fvisibility=hidden -fexcess-precision=standard -DRUBY_EXPORT -fPIE -I. -I.ext/include/aarch64-linux -I/home/opc/ruby/src/master/include -I/home/opc/ruby/src/master -I/home/opc/ruby/src/master/prism -I/home/opc/ruby/src/master/enc/unicode/15.0.0 I, [2024-05-25T11:03:17.341143 #1946972] INFO -- : CPPFLAGS = I, [2024-05-25T11:03:17.341153 #1946972] INFO -- : DLDFLAGS = -Wl,--compress-debug-sections=zlib -fstack-protector-strong -pie I, [2024-05-25T11:03:17.341163 #1946972] INFO -- : SOLIBS = -lz -lrt -lrt -ldl -lcrypt -lm -lpthread I, [2024-05-25T11:03:17.341171 #1946972] INFO -- : LANG = en_US.UTF-8 I, [2024-05-25T11:03:17.341180 #1946972] INFO -- : LC_ALL = I, [2024-05-25T11:03:17.341188 #1946972] INFO -- : LC_CTYPE = I, [2024-05-25T11:03:17.341236 #1946972] INFO -- : MFLAGS = -j3 --jobserver-auth=4,5 I, [2024-05-25T11:03:17.341245 #1946972] INFO -- : RUSTC = rustc I, [2024-05-25T11:03:17.341254 #1946972] INFO -- : YJIT_RUSTC_ARGS = --crate-name=yjit --crate-type=staticlib --edition=2021 -g -C lto=thin -C opt-level=3 -C overflow-checks=on '--out-dir=/home/opc/ruby/build/master/yjit/target/release/' /home/opc/ruby/src/master/yjit/src/lib.rs I, [2024-05-25T11:03:17.341978 #1946972] INFO -- : gcc (GCC) 8.5.0 20210514 (Red Hat 8.5.0-10.1.0.1) I, [2024-05-25T11:03:17.342015 #1946972] INFO -- : Copyright (C) 2018 Free Software Foundation, Inc. I, [2024-05-25T11:03:17.342026 #1946972] INFO -- : This is free software; see the source for copying conditions. There is NO I, [2024-05-25T11:03:17.342036 #1946972] INFO -- : warranty; not even for MERCHANTABILITY or FITNESS FOR A PARTICULAR PURPOSE. I, [2024-05-25T11:03:17.342044 #1946972] INFO -- : I, [2024-05-25T11:03:17.366834 #1946972] INFO -- : compiling /home/opc/ruby/src/master/version.c I, [2024-05-25T11:03:17.509664 #1946972] INFO -- : linking miniruby I, [2024-05-25T11:03:18.396352 #1946972] INFO -- : $$$[end] "make miniruby -j3" exit with 0. I, [2024-05-25T11:03:18.396547 #1946972] INFO -- : $$$[beg] make ruby -j3 I, [2024-05-25T11:03:18.484258 #1946972] INFO -- : BASERUBY = /usr/local/bin/ruby --disable=gems I, [2024-05-25T11:03:18.484330 #1946972] INFO -- : CC = gcc I, [2024-05-25T11:03:18.484343 #1946972] INFO -- : LD = ld I, [2024-05-25T11:03:18.484354 #1946972] INFO -- : LDSHARED = gcc -shared I, [2024-05-25T11:03:18.484365 #1946972] INFO -- : CFLAGS = -O3 -fno-fast-math -ggdb3 -Wall -Wextra -Wdeprecated-declarations -Wdiv-by-zero -Wduplicated-cond -Wimplicit-function-declaration -Wimplicit-int -Wpointer-arith -Wwrite-strings -Wold-style-definition -Wimplicit-fallthrough=0 -Wmissing-noreturn -Wno-cast-function-type -Wno-constant-logical-operand -Wno-long-long -Wno-missing-field-initializers -Wno-overlength-strings -Wno-packed-bitfield-compat -Wno-parentheses-equality -Wno-self-assign -Wno-tautological-compare -Wno-unused-parameter -Wno-unused-value -Wsuggest-attribute=format -Wsuggest-attribute=noreturn -Wunused-variable -Wmisleading-indentation -Wundef I, [2024-05-25T11:03:18.484376 #1946972] INFO -- : XCFLAGS = -U_FORTIFY_SOURCE -D_FORTIFY_SOURCE=2 -fstack-protector-strong -msign-return-address=all -fno-strict-overflow -fvisibility=hidden -fexcess-precision=standard -DRUBY_EXPORT -fPIE -I. -I.ext/include/aarch64-linux -I/home/opc/ruby/src/master/include -I/home/opc/ruby/src/master -I/home/opc/ruby/src/master/prism -I/home/opc/ruby/src/master/enc/unicode/15.0.0 I, [2024-05-25T11:03:18.484385 #1946972] INFO -- : CPPFLAGS = I, [2024-05-25T11:03:18.484393 #1946972] INFO -- : DLDFLAGS = -Wl,--compress-debug-sections=zlib -fstack-protector-strong -pie I, [2024-05-25T11:03:18.484403 #1946972] INFO -- : SOLIBS = -lz -lrt -lrt -ldl -lcrypt -lm -lpthread I, [2024-05-25T11:03:18.484411 #1946972] INFO -- : LANG = en_US.UTF-8 I, [2024-05-25T11:03:18.484419 #1946972] INFO -- : LC_ALL = I, [2024-05-25T11:03:18.484428 #1946972] INFO -- : LC_CTYPE = I, [2024-05-25T11:03:18.484436 #1946972] INFO -- : MFLAGS = -j3 --jobserver-auth=4,5 I, [2024-05-25T11:03:18.484445 #1946972] INFO -- : RUSTC = rustc I, [2024-05-25T11:03:18.484454 #1946972] INFO -- : YJIT_RUSTC_ARGS = --crate-name=yjit --crate-type=staticlib --edition=2021 -g -C lto=thin -C opt-level=3 -C overflow-checks=on '--out-dir=/home/opc/ruby/build/master/yjit/target/release/' /home/opc/ruby/src/master/yjit/src/lib.rs I, [2024-05-25T11:03:18.485101 #1946972] INFO -- : gcc (GCC) 8.5.0 20210514 (Red Hat 8.5.0-10.1.0.1) I, [2024-05-25T11:03:18.485124 #1946972] INFO -- : Copyright (C) 2018 Free Software Foundation, Inc. I, [2024-05-25T11:03:18.485135 #1946972] INFO -- : This is free software; see the source for copying conditions. There is NO I, [2024-05-25T11:03:18.485144 #1946972] INFO -- : warranty; not even for MERCHANTABILITY or FITNESS FOR A PARTICULAR PURPOSE. I, [2024-05-25T11:03:18.485152 #1946972] INFO -- : I, [2024-05-25T11:03:18.667427 #1946972] INFO -- : builtin_binary.inc updated I, [2024-05-25T11:03:18.670552 #1946972] INFO -- : c86294a81d0df6836359a6b5498b71b1ddba3062aa6ec87c7b2896368a948a19 builtin_binary.inc I, [2024-05-25T11:03:18.671533 #1946972] INFO -- : compiling /home/opc/ruby/src/master/builtin.c I, [2024-05-25T11:03:19.005939 #1946972] INFO -- : linking static-library libruby-static.a I, [2024-05-25T11:03:21.876258 #1946972] INFO -- : linking ruby I, [2024-05-25T11:03:22.780250 #1946972] INFO -- : $$$[end] "make ruby -j3" exit with 0. I, [2024-05-25T11:03:22.780416 #1946972] INFO -- : $$$[beg] make all -j3 I, [2024-05-25T11:03:22.869136 #1946972] INFO -- : BASERUBY = /usr/local/bin/ruby --disable=gems I, [2024-05-25T11:03:22.869231 #1946972] INFO -- : CC = gcc I, [2024-05-25T11:03:22.869245 #1946972] INFO -- : LD = ld I, [2024-05-25T11:03:22.869256 #1946972] INFO -- : LDSHARED = gcc -shared I, [2024-05-25T11:03:22.869267 #1946972] INFO -- : CFLAGS = -O3 -fno-fast-math -ggdb3 -Wall -Wextra -Wdeprecated-declarations -Wdiv-by-zero -Wduplicated-cond -Wimplicit-function-declaration -Wimplicit-int -Wpointer-arith -Wwrite-strings -Wold-style-definition -Wimplicit-fallthrough=0 -Wmissing-noreturn -Wno-cast-function-type -Wno-constant-logical-operand -Wno-long-long -Wno-missing-field-initializers -Wno-overlength-strings -Wno-packed-bitfield-compat -Wno-parentheses-equality -Wno-self-assign -Wno-tautological-compare -Wno-unused-parameter -Wno-unused-value -Wsuggest-attribute=format -Wsuggest-attribute=noreturn -Wunused-variable -Wmisleading-indentation -Wundef I, [2024-05-25T11:03:22.869277 #1946972] INFO -- : XCFLAGS = -U_FORTIFY_SOURCE -D_FORTIFY_SOURCE=2 -fstack-protector-strong -msign-return-address=all -fno-strict-overflow -fvisibility=hidden -fexcess-precision=standard -DRUBY_EXPORT -fPIE -I. -I.ext/include/aarch64-linux -I/home/opc/ruby/src/master/include -I/home/opc/ruby/src/master -I/home/opc/ruby/src/master/prism -I/home/opc/ruby/src/master/enc/unicode/15.0.0 I, [2024-05-25T11:03:22.869286 #1946972] INFO -- : CPPFLAGS = I, [2024-05-25T11:03:22.869295 #1946972] INFO -- : DLDFLAGS = -Wl,--compress-debug-sections=zlib -fstack-protector-strong -pie I, [2024-05-25T11:03:22.869304 #1946972] INFO -- : SOLIBS = -lz -lrt -lrt -ldl -lcrypt -lm -lpthread I, [2024-05-25T11:03:22.869312 #1946972] INFO -- : LANG = en_US.UTF-8 I, [2024-05-25T11:03:22.869321 #1946972] INFO -- : LC_ALL = I, [2024-05-25T11:03:22.869329 #1946972] INFO -- : LC_CTYPE = I, [2024-05-25T11:03:22.869338 #1946972] INFO -- : MFLAGS = -j3 --jobserver-auth=4,5 I, [2024-05-25T11:03:22.869346 #1946972] INFO -- : RUSTC = rustc I, [2024-05-25T11:03:22.869355 #1946972] INFO -- : YJIT_RUSTC_ARGS = --crate-name=yjit --crate-type=staticlib --edition=2021 -g -C lto=thin -C opt-level=3 -C overflow-checks=on '--out-dir=/home/opc/ruby/build/master/yjit/target/release/' /home/opc/ruby/src/master/yjit/src/lib.rs I, [2024-05-25T11:03:22.870056 #1946972] INFO -- : gcc (GCC) 8.5.0 20210514 (Red Hat 8.5.0-10.1.0.1) I, [2024-05-25T11:03:22.870091 #1946972] INFO -- : Copyright (C) 2018 Free Software Foundation, Inc. I, [2024-05-25T11:03:22.870103 #1946972] INFO -- : This is free software; see the source for copying conditions. There is NO I, [2024-05-25T11:03:22.870113 #1946972] INFO -- : warranty; not even for MERCHANTABILITY or FITNESS FOR A PARTICULAR PURPOSE. I, [2024-05-25T11:03:22.870126 #1946972] INFO -- : I, [2024-05-25T11:03:22.903014 #1946972] INFO -- : generating encdb.h I, [2024-05-25T11:03:22.904434 #1946972] INFO -- : generating enc.mk I, [2024-05-25T11:03:22.941482 #1946972] INFO -- : encdb.h unchanged I, [2024-05-25T11:03:23.136800 #1946972] INFO -- : making srcs under enc I, [2024-05-25T11:03:23.136956 #1946972] INFO -- : making enc I, [2024-05-25T11:03:23.164147 #1946972] INFO -- : make[1]: Entering directory '/home/opc/ruby/build/master' I, [2024-05-25T11:03:23.164212 #1946972] INFO -- : make[1]: Nothing to be done for 'enc'. I, [2024-05-25T11:03:23.164224 #1946972] INFO -- : make[1]: Leaving directory '/home/opc/ruby/build/master' I, [2024-05-25T11:03:23.178847 #1946972] INFO -- : make[1]: Entering directory '/home/opc/ruby/build/master' I, [2024-05-25T11:03:23.178893 #1946972] INFO -- : make[1]: Nothing to be done for 'srcs'. I, [2024-05-25T11:03:23.178904 #1946972] INFO -- : make[1]: Leaving directory '/home/opc/ruby/build/master' I, [2024-05-25T11:03:23.179631 #1946972] INFO -- : generating transdb.h I, [2024-05-25T11:03:23.324092 #1946972] INFO -- : transdb.h unchanged I, [2024-05-25T11:03:23.325390 #1946972] INFO -- : generating makefiles ext/configure-ext.mk I, [2024-05-25T11:03:23.325591 #1946972] INFO -- : making trans I, [2024-05-25T11:03:23.365536 #1946972] INFO -- : ext/configure-ext.mk updated I, [2024-05-25T11:03:23.368742 #1946972] INFO -- : make[1]: Entering directory '/home/opc/ruby/build/master' I, [2024-05-25T11:03:23.373759 #1946972] INFO -- : make[1]: Entering directory '/home/opc/ruby/build/master' I, [2024-05-25T11:03:23.373808 #1946972] INFO -- : make[1]: Nothing to be done for 'trans'. I, [2024-05-25T11:03:23.373822 #1946972] INFO -- : make[1]: Leaving directory '/home/opc/ruby/build/master' I, [2024-05-25T11:03:24.095458 #1946972] INFO -- : making encs I, [2024-05-25T11:03:24.122673 #1946972] INFO -- : make[1]: Leaving directory '/home/opc/ruby/build/master' I, [2024-05-25T11:03:24.123307 #1946972] INFO -- : generating makefile exts.mk I, [2024-05-25T11:03:24.148103 #1946972] INFO -- : make[1]: Entering directory '/home/opc/ruby/build/master' I, [2024-05-25T11:03:24.148162 #1946972] INFO -- : make[1]: Nothing to be done for 'encs'. I, [2024-05-25T11:03:24.148176 #1946972] INFO -- : make[1]: Leaving directory '/home/opc/ruby/build/master' I, [2024-05-25T11:03:24.182095 #1946972] INFO -- : exts.mk unchanged I, [2024-05-25T11:03:24.186992 #1946972] INFO -- : make[1]: Entering directory '/home/opc/ruby/build/master' I, [2024-05-25T11:03:24.288816 #1946972] INFO -- : make[2]: Entering directory '/home/opc/ruby/build/master/ext/coverage' I, [2024-05-25T11:03:24.291086 #1946972] INFO -- : make[2]: Entering directory '/home/opc/ruby/build/master/ext/digest' I, [2024-05-25T11:03:24.292259 #1946972] INFO -- : make[2]: Entering directory '/home/opc/ruby/build/master/ext/date' I, [2024-05-25T11:03:24.293465 #1946972] INFO -- : make[2]: Leaving directory '/home/opc/ruby/build/master/ext/coverage' I, [2024-05-25T11:03:24.297753 #1946972] INFO -- : make[2]: Leaving directory '/home/opc/ruby/build/master/ext/date' I, [2024-05-25T11:03:24.300029 #1946972] INFO -- : make[2]: Leaving directory '/home/opc/ruby/build/master/ext/digest' I, [2024-05-25T11:03:24.305160 #1946972] INFO -- : make[2]: Entering directory '/home/opc/ruby/build/master/ext/io/console' I, [2024-05-25T11:03:24.307033 #1946972] INFO -- : make[2]: Entering directory '/home/opc/ruby/build/master/ext/fiddle' I, [2024-05-25T11:03:24.309552 #1946972] INFO -- : make[2]: Leaving directory '/home/opc/ruby/build/master/ext/io/console' I, [2024-05-25T11:03:24.311776 #1946972] INFO -- : make[2]: Entering directory '/home/opc/ruby/build/master/ext/json' I, [2024-05-25T11:03:24.314648 #1946972] INFO -- : make[2]: Leaving directory '/home/opc/ruby/build/master/ext/fiddle' I, [2024-05-25T11:03:24.316798 #1946972] INFO -- : make[2]: Entering directory '/home/opc/ruby/build/master/ext/monitor' I, [2024-05-25T11:03:24.320661 #1946972] INFO -- : make[2]: Entering directory '/home/opc/ruby/build/master/ext/objspace' I, [2024-05-25T11:03:24.320866 #1946972] INFO -- : make[2]: Leaving directory '/home/opc/ruby/build/master/ext/monitor' I, [2024-05-25T11:03:24.321267 #1946972] INFO -- : make[2]: Leaving directory '/home/opc/ruby/build/master/ext/json' I, [2024-05-25T11:03:24.325433 #1946972] INFO -- : make[2]: Entering directory '/home/opc/ruby/build/master/ext/pathname' I, [2024-05-25T11:03:24.326323 #1946972] INFO -- : make[2]: Leaving directory '/home/opc/ruby/build/master/ext/objspace' I, [2024-05-25T11:03:24.329527 #1946972] INFO -- : make[2]: Leaving directory '/home/opc/ruby/build/master/ext/pathname' I, [2024-05-25T11:03:24.332638 #1946972] INFO -- : make[2]: Entering directory '/home/opc/ruby/build/master/ext/psych' I, [2024-05-25T11:03:24.333882 #1946972] INFO -- : make[2]: Entering directory '/home/opc/ruby/build/master/ext/pty' I, [2024-05-25T11:03:24.339073 #1946972] INFO -- : make[2]: Leaving directory '/home/opc/ruby/build/master/ext/pty' I, [2024-05-25T11:03:24.340109 #1946972] INFO -- : make[2]: Entering directory '/home/opc/ruby/build/master/ext/openssl' I, [2024-05-25T11:03:24.353696 #1946972] INFO -- : make[2]: Leaving directory '/home/opc/ruby/build/master/ext/psych' I, [2024-05-25T11:03:24.354457 #1946972] INFO -- : make[2]: Entering directory '/home/opc/ruby/build/master/ext/ripper' I, [2024-05-25T11:03:24.355704 #1946972] INFO -- : make[2]: Entering directory '/home/opc/ruby/build/master/ext/rubyvm' I, [2024-05-25T11:03:24.360445 #1946972] INFO -- : make[2]: Leaving directory '/home/opc/ruby/build/master/ext/openssl' I, [2024-05-25T11:03:24.361481 #1946972] INFO -- : make[2]: Leaving directory '/home/opc/ruby/build/master/ext/rubyvm' I, [2024-05-25T11:03:24.362349 #1946972] INFO -- : make[2]: Leaving directory '/home/opc/ruby/build/master/ext/ripper' I, [2024-05-25T11:03:24.369093 #1946972] INFO -- : make[2]: Entering directory '/home/opc/ruby/build/master/.bundle/gems/bigdecimal-3.1.7/ext/bigdecimal' I, [2024-05-25T11:03:24.372697 #1946972] INFO -- : make[2]: Entering directory '/home/opc/ruby/build/master/ext/socket' I, [2024-05-25T11:03:24.373262 #1946972] INFO -- : make[2]: Entering directory '/home/opc/ruby/build/master/.bundle/gems/bigdecimal-3.1.8/ext/bigdecimal' I, [2024-05-25T11:03:24.383385 #1946972] INFO -- : make[2]: Leaving directory '/home/opc/ruby/build/master/ext/socket' I, [2024-05-25T11:03:24.385967 #1946972] INFO -- : make[2]: Entering directory '/home/opc/ruby/build/master/.bundle/gems/debug-1.9.2/ext/debug' I, [2024-05-25T11:03:24.400354 #1946972] INFO -- : make[2]: Leaving directory '/home/opc/ruby/build/master/.bundle/gems/bigdecimal-3.1.7/ext/bigdecimal' I, [2024-05-25T11:03:24.403076 #1946972] INFO -- : make[2]: Entering directory '/home/opc/ruby/build/master/.bundle/gems/nkf-0.2.0/ext/nkf' I, [2024-05-25T11:03:24.406262 #1946972] INFO -- : make[2]: Leaving directory '/home/opc/ruby/build/master/.bundle/gems/bigdecimal-3.1.8/ext/bigdecimal' I, [2024-05-25T11:03:24.408679 #1946972] INFO -- : make[2]: Entering directory '/home/opc/ruby/build/master/.bundle/gems/racc-1.7.3/ext/racc/cparse' I, [2024-05-25T11:03:24.418331 #1946972] INFO -- : make[2]: Leaving directory '/home/opc/ruby/build/master/.bundle/gems/debug-1.9.2/ext/debug' I, [2024-05-25T11:03:24.420891 #1946972] INFO -- : make[2]: Entering directory '/home/opc/ruby/build/master/.bundle/gems/racc-1.8.0/ext/racc/cparse' I, [2024-05-25T11:03:24.435951 #1946972] INFO -- : make[2]: Leaving directory '/home/opc/ruby/build/master/.bundle/gems/nkf-0.2.0/ext/nkf' I, [2024-05-25T11:03:24.439023 #1946972] INFO -- : make[2]: Entering directory '/home/opc/ruby/build/master/.bundle/gems/rbs-3.4.4/ext/rbs_extension' I, [2024-05-25T11:03:24.446718 #1946972] INFO -- : make[2]: Leaving directory '/home/opc/ruby/build/master/.bundle/gems/racc-1.7.3/ext/racc/cparse' I, [2024-05-25T11:03:24.452933 #1946972] INFO -- : make[2]: Leaving directory '/home/opc/ruby/build/master/.bundle/gems/racc-1.8.0/ext/racc/cparse' I, [2024-05-25T11:03:24.453664 #1946972] INFO -- : make[2]: Entering directory '/home/opc/ruby/build/master/.bundle/gems/syslog-0.1.2/ext/syslog' I, [2024-05-25T11:03:24.470475 #1946972] INFO -- : make[2]: Leaving directory '/home/opc/ruby/build/master/.bundle/gems/rbs-3.4.4/ext/rbs_extension' I, [2024-05-25T11:03:24.474858 #1946972] INFO -- : make[2]: Entering directory '/home/opc/ruby/build/master/ext/digest/sha2' I, [2024-05-25T11:03:24.479905 #1946972] INFO -- : make[2]: Leaving directory '/home/opc/ruby/build/master/ext/digest/sha2' I, [2024-05-25T11:03:24.485051 #1946972] INFO -- : make[2]: Leaving directory '/home/opc/ruby/build/master/.bundle/gems/syslog-0.1.2/ext/syslog' I, [2024-05-25T11:03:24.522948 #1946972] INFO -- : make[2]: Entering directory '/home/opc/ruby/build/master' I, [2024-05-25T11:03:24.605699 #1946972] INFO -- : make[2]: 'ruby' is up to date. I, [2024-05-25T11:03:24.605775 #1946972] INFO -- : make[2]: Leaving directory '/home/opc/ruby/build/master' I, [2024-05-25T11:03:24.605895 #1946972] INFO -- : make[1]: Leaving directory '/home/opc/ruby/build/master' I, [2024-05-25T11:03:24.610385 #1946972] INFO -- : make[1]: Entering directory '/home/opc/ruby/build/master' I, [2024-05-25T11:03:24.610426 #1946972] INFO -- : make[1]: Nothing to be done for 'note'. I, [2024-05-25T11:03:24.610438 #1946972] INFO -- : make[1]: Leaving directory '/home/opc/ruby/build/master' I, [2024-05-25T11:03:24.610707 #1946972] INFO -- : $$$[end] "make all -j3" exit with 0. I, [2024-05-25T11:03:24.610848 #1946972] INFO -- : $$$[beg] make install -j3 I, [2024-05-25T11:03:24.704989 #1946972] INFO -- : Update power_assert to 84e85124c5014a139af39161d484156cfe87a9ed I, [2024-05-25T11:03:24.705056 #1946972] INFO -- : Update rbs to ba7872795d5de04adb8ff500c0e6afdc81a041dd I, [2024-05-25T11:03:24.706257 #1946972] INFO -- : Update typeprof to b19a6416da3a05d57fadd6ffdadb382b6d236ca5 I, [2024-05-25T11:03:24.709323 #1946972] INFO -- : echo 84e85124c5014a139af39161d484156cfe87a9ed | /bin/sh /home/opc/ruby/src/master/tool/ifchange /home/opc/ruby/src/master/.bundle/.timestamp/power_assert.revision - I, [2024-05-25T11:03:24.709589 #1946972] INFO -- : echo ba7872795d5de04adb8ff500c0e6afdc81a041dd | /bin/sh /home/opc/ruby/src/master/tool/ifchange /home/opc/ruby/src/master/.bundle/.timestamp/rbs.revision - I, [2024-05-25T11:03:24.709757 #1946972] INFO -- : echo b19a6416da3a05d57fadd6ffdadb382b6d236ca5 | /bin/sh /home/opc/ruby/src/master/tool/ifchange /home/opc/ruby/src/master/.bundle/.timestamp/typeprof.revision - I, [2024-05-25T11:03:24.715833 #1946972] INFO -- : /home/opc/ruby/src/master/.bundle/.timestamp/typeprof.revision unchanged I, [2024-05-25T11:03:24.716907 #1946972] INFO -- : /home/opc/ruby/src/master/.bundle/.timestamp/rbs.revision unchanged I, [2024-05-25T11:03:24.717375 #1946972] INFO -- : /home/opc/ruby/src/master/.bundle/.timestamp/power_assert.revision unchanged I, [2024-05-25T11:03:24.724009 #1946972] INFO -- : BASERUBY = /usr/local/bin/ruby --disable=gems I, [2024-05-25T11:03:24.724065 #1946972] INFO -- : CC = gcc I, [2024-05-25T11:03:24.724078 #1946972] INFO -- : LD = ld I, [2024-05-25T11:03:24.724087 #1946972] INFO -- : LDSHARED = gcc -shared I, [2024-05-25T11:03:24.724099 #1946972] INFO -- : CFLAGS = -O3 -fno-fast-math -ggdb3 -Wall -Wextra -Wdeprecated-declarations -Wdiv-by-zero -Wduplicated-cond -Wimplicit-function-declaration -Wimplicit-int -Wpointer-arith -Wwrite-strings -Wold-style-definition -Wimplicit-fallthrough=0 -Wmissing-noreturn -Wno-cast-function-type -Wno-constant-logical-operand -Wno-long-long -Wno-missing-field-initializers -Wno-overlength-strings -Wno-packed-bitfield-compat -Wno-parentheses-equality -Wno-self-assign -Wno-tautological-compare -Wno-unused-parameter -Wno-unused-value -Wsuggest-attribute=format -Wsuggest-attribute=noreturn -Wunused-variable -Wmisleading-indentation -Wundef I, [2024-05-25T11:03:24.724110 #1946972] INFO -- : XCFLAGS = -U_FORTIFY_SOURCE -D_FORTIFY_SOURCE=2 -fstack-protector-strong -msign-return-address=all -fno-strict-overflow -fvisibility=hidden -fexcess-precision=standard -DRUBY_EXPORT -fPIE -I. -I.ext/include/aarch64-linux -I/home/opc/ruby/src/master/include -I/home/opc/ruby/src/master -I/home/opc/ruby/src/master/prism -I/home/opc/ruby/src/master/enc/unicode/15.0.0 I, [2024-05-25T11:03:24.724122 #1946972] INFO -- : CPPFLAGS = I, [2024-05-25T11:03:24.724130 #1946972] INFO -- : DLDFLAGS = -Wl,--compress-debug-sections=zlib -fstack-protector-strong -pie I, [2024-05-25T11:03:24.724140 #1946972] INFO -- : SOLIBS = -lz -lrt -lrt -ldl -lcrypt -lm -lpthread I, [2024-05-25T11:03:24.724148 #1946972] INFO -- : LANG = en_US.UTF-8 I, [2024-05-25T11:03:24.724157 #1946972] INFO -- : LC_ALL = I, [2024-05-25T11:03:24.724165 #1946972] INFO -- : LC_CTYPE = I, [2024-05-25T11:03:24.724173 #1946972] INFO -- : MFLAGS = -j3 --jobserver-auth=4,5 I, [2024-05-25T11:03:24.724182 #1946972] INFO -- : RUSTC = rustc I, [2024-05-25T11:03:24.724190 #1946972] INFO -- : YJIT_RUSTC_ARGS = --crate-name=yjit --crate-type=staticlib --edition=2021 -g -C lto=thin -C opt-level=3 -C overflow-checks=on '--out-dir=/home/opc/ruby/build/master/yjit/target/release/' /home/opc/ruby/src/master/yjit/src/lib.rs I, [2024-05-25T11:03:24.751482 #1946972] INFO -- : generating encdb.h I, [2024-05-25T11:03:24.751647 #1946972] INFO -- : gcc (GCC) 8.5.0 20210514 (Red Hat 8.5.0-10.1.0.1) I, [2024-05-25T11:03:24.751677 #1946972] INFO -- : Copyright (C) 2018 Free Software Foundation, Inc. I, [2024-05-25T11:03:24.751688 #1946972] INFO -- : This is free software; see the source for copying conditions. There is NO I, [2024-05-25T11:03:24.751698 #1946972] INFO -- : warranty; not even for MERCHANTABILITY or FITNESS FOR A PARTICULAR PURPOSE. I, [2024-05-25T11:03:24.751707 #1946972] INFO -- : I, [2024-05-25T11:03:24.752421 #1946972] INFO -- : generating enc.mk I, [2024-05-25T11:03:24.788950 #1946972] INFO -- : encdb.h unchanged I, [2024-05-25T11:03:24.881625 #1946972] INFO -- : Building power_assert@84e85124c5014a139af39161d484156cfe87a9ed to /home/opc/ruby/src/master/gems/power_assert-2.0.3.gem I, [2024-05-25T11:03:24.991035 #1946972] INFO -- : making srcs under enc I, [2024-05-25T11:03:24.991100 #1946972] INFO -- : making enc I, [2024-05-25T11:03:25.003479 #1946972] INFO -- : Successfully built RubyGem I, [2024-05-25T11:03:25.003536 #1946972] INFO -- : Name: power_assert I, [2024-05-25T11:03:25.003547 #1946972] INFO -- : Version: 2.0.4dev I, [2024-05-25T11:03:25.003556 #1946972] INFO -- : File: power_assert-2.0.4dev.gem I, [2024-05-25T11:03:25.007640 #1946972] INFO -- : Extracting bundle gem power_assert-2.0.3... I, [2024-05-25T11:03:25.018783 #1946972] INFO -- : make[1]: Entering directory '/home/opc/ruby/build/master' I, [2024-05-25T11:03:25.018857 #1946972] INFO -- : make[1]: Nothing to be done for 'enc'. I, [2024-05-25T11:03:25.018870 #1946972] INFO -- : make[1]: Leaving directory '/home/opc/ruby/build/master' I, [2024-05-25T11:03:25.033218 #1946972] INFO -- : make[1]: Entering directory '/home/opc/ruby/build/master' I, [2024-05-25T11:03:25.033282 #1946972] INFO -- : make[1]: Nothing to be done for 'srcs'. I, [2024-05-25T11:03:25.033293 #1946972] INFO -- : make[1]: Leaving directory '/home/opc/ruby/build/master' I, [2024-05-25T11:03:25.034046 #1946972] INFO -- : generating transdb.h I, [2024-05-25T11:03:25.107227 #1946972] INFO -- : Try with hash version of bundled gems instead of gems/power_assert-2.0.3.gem. We don't use this gem with release version of Ruby. I, [2024-05-25T11:03:25.118206 #1946972] INFO -- : Unpacked gems/power_assert-2.0.4dev.gem I, [2024-05-25T11:03:25.176855 #1946972] INFO -- : transdb.h unchanged I, [2024-05-25T11:03:25.178213 #1946972] INFO -- : generating makefiles ext/configure-ext.mk I, [2024-05-25T11:03:25.178469 #1946972] INFO -- : making trans I, [2024-05-25T11:03:25.217959 #1946972] INFO -- : ext/configure-ext.mk unchanged I, [2024-05-25T11:03:25.220996 #1946972] INFO -- : make[1]: Entering directory '/home/opc/ruby/build/master' I, [2024-05-25T11:03:25.227080 #1946972] INFO -- : make[1]: Entering directory '/home/opc/ruby/build/master' I, [2024-05-25T11:03:25.227123 #1946972] INFO -- : make[1]: Nothing to be done for 'trans'. I, [2024-05-25T11:03:25.227138 #1946972] INFO -- : make[1]: Leaving directory '/home/opc/ruby/build/master' I, [2024-05-25T11:03:25.449828 #1946972] INFO -- : making encs I, [2024-05-25T11:03:25.506868 #1946972] INFO -- : make[1]: Entering directory '/home/opc/ruby/build/master' I, [2024-05-25T11:03:25.506998 #1946972] INFO -- : make[1]: Nothing to be done for 'encs'. I, [2024-05-25T11:03:25.507047 #1946972] INFO -- : make[1]: Leaving directory '/home/opc/ruby/build/master' I, [2024-05-25T11:03:25.998678 #1946972] INFO -- : make[1]: Leaving directory '/home/opc/ruby/build/master' I, [2024-05-25T11:03:25.999375 #1946972] INFO -- : generating makefile exts.mk I, [2024-05-25T11:03:26.058135 #1946972] INFO -- : exts.mk unchanged I, [2024-05-25T11:03:26.063048 #1946972] INFO -- : make[1]: Entering directory '/home/opc/ruby/build/master' I, [2024-05-25T11:03:26.168741 #1946972] INFO -- : make[2]: Entering directory '/home/opc/ruby/build/master/ext/coverage' I, [2024-05-25T11:03:26.170995 #1946972] INFO -- : make[2]: Entering directory '/home/opc/ruby/build/master/ext/digest' I, [2024-05-25T11:03:26.172746 #1946972] INFO -- : make[2]: Entering directory '/home/opc/ruby/build/master/ext/date' I, [2024-05-25T11:03:26.174397 #1946972] INFO -- : make[2]: Leaving directory '/home/opc/ruby/build/master/ext/coverage' I, [2024-05-25T11:03:26.178093 #1946972] INFO -- : make[2]: Leaving directory '/home/opc/ruby/build/master/ext/date' I, [2024-05-25T11:03:26.184960 #1946972] INFO -- : make[2]: Leaving directory '/home/opc/ruby/build/master/ext/digest' I, [2024-05-25T11:03:26.186637 #1946972] INFO -- : make[2]: Entering directory '/home/opc/ruby/build/master/ext/io/console' I, [2024-05-25T11:03:26.189072 #1946972] INFO -- : make[2]: Entering directory '/home/opc/ruby/build/master/ext/fiddle' I, [2024-05-25T11:03:26.192928 #1946972] INFO -- : make[2]: Leaving directory '/home/opc/ruby/build/master/ext/io/console' I, [2024-05-25T11:03:26.195106 #1946972] INFO -- : make[2]: Entering directory '/home/opc/ruby/build/master/ext/json' I, [2024-05-25T11:03:26.197286 #1946972] INFO -- : make[2]: Leaving directory '/home/opc/ruby/build/master/ext/fiddle' I, [2024-05-25T11:03:26.200136 #1946972] INFO -- : make[2]: Entering directory '/home/opc/ruby/build/master/ext/monitor' I, [2024-05-25T11:03:26.203219 #1946972] INFO -- : make[2]: Entering directory '/home/opc/ruby/build/master/ext/objspace' I, [2024-05-25T11:03:26.204536 #1946972] INFO -- : make[2]: Leaving directory '/home/opc/ruby/build/master/ext/json' I, [2024-05-25T11:03:26.207702 #1946972] INFO -- : make[2]: Leaving directory '/home/opc/ruby/build/master/ext/monitor' I, [2024-05-25T11:03:26.209248 #1946972] INFO -- : make[2]: Leaving directory '/home/opc/ruby/build/master/ext/objspace' I, [2024-05-25T11:03:26.211993 #1946972] INFO -- : make[2]: Entering directory '/home/opc/ruby/build/master/ext/pathname' I, [2024-05-25T11:03:26.215356 #1946972] INFO -- : make[2]: Entering directory '/home/opc/ruby/build/master/ext/psych' I, [2024-05-25T11:03:26.220268 #1946972] INFO -- : make[2]: Leaving directory '/home/opc/ruby/build/master/ext/pathname' I, [2024-05-25T11:03:26.223979 #1946972] INFO -- : make[2]: Entering directory '/home/opc/ruby/build/master/ext/openssl' I, [2024-05-25T11:03:26.225838 #1946972] INFO -- : make[2]: Entering directory '/home/opc/ruby/build/master/ext/pty' I, [2024-05-25T11:03:26.231639 #1946972] INFO -- : make[2]: Leaving directory '/home/opc/ruby/build/master/ext/pty' I, [2024-05-25T11:03:26.235933 #1946972] INFO -- : make[2]: Leaving directory '/home/opc/ruby/build/master/ext/psych' I, [2024-05-25T11:03:26.239478 #1946972] INFO -- : make[2]: Entering directory '/home/opc/ruby/build/master/ext/rubyvm' I, [2024-05-25T11:03:26.243871 #1946972] INFO -- : make[2]: Leaving directory '/home/opc/ruby/build/master/ext/rubyvm' I, [2024-05-25T11:03:26.244051 #1946972] INFO -- : make[2]: Entering directory '/home/opc/ruby/build/master/ext/ripper' I, [2024-05-25T11:03:26.244999 #1946972] INFO -- : make[2]: Leaving directory '/home/opc/ruby/build/master/ext/openssl' I, [2024-05-25T11:03:26.250879 #1946972] INFO -- : make[2]: Leaving directory '/home/opc/ruby/build/master/ext/ripper' I, [2024-05-25T11:03:26.256643 #1946972] INFO -- : make[2]: Entering directory '/home/opc/ruby/build/master/ext/socket' I, [2024-05-25T11:03:26.256793 #1946972] INFO -- : make[2]: Entering directory '/home/opc/ruby/build/master/.bundle/gems/bigdecimal-3.1.7/ext/bigdecimal' I, [2024-05-25T11:03:26.257750 #1946972] INFO -- : make[2]: Entering directory '/home/opc/ruby/build/master/.bundle/gems/bigdecimal-3.1.8/ext/bigdecimal' I, [2024-05-25T11:03:26.268310 #1946972] INFO -- : make[2]: Leaving directory '/home/opc/ruby/build/master/ext/socket' I, [2024-05-25T11:03:26.273145 #1946972] INFO -- : make[2]: Entering directory '/home/opc/ruby/build/master/.bundle/gems/debug-1.9.2/ext/debug' I, [2024-05-25T11:03:26.288217 #1946972] INFO -- : make[2]: Leaving directory '/home/opc/ruby/build/master/.bundle/gems/bigdecimal-3.1.7/ext/bigdecimal' I, [2024-05-25T11:03:26.290702 #1946972] INFO -- : make[2]: Leaving directory '/home/opc/ruby/build/master/.bundle/gems/bigdecimal-3.1.8/ext/bigdecimal' I, [2024-05-25T11:03:26.290912 #1946972] INFO -- : make[2]: Entering directory '/home/opc/ruby/build/master/.bundle/gems/nkf-0.2.0/ext/nkf' I, [2024-05-25T11:03:26.293146 #1946972] INFO -- : make[2]: Entering directory '/home/opc/ruby/build/master/.bundle/gems/racc-1.7.3/ext/racc/cparse' I, [2024-05-25T11:03:26.306698 #1946972] INFO -- : make[2]: Leaving directory '/home/opc/ruby/build/master/.bundle/gems/debug-1.9.2/ext/debug' I, [2024-05-25T11:03:26.309313 #1946972] INFO -- : make[2]: Entering directory '/home/opc/ruby/build/master/.bundle/gems/racc-1.8.0/ext/racc/cparse' I, [2024-05-25T11:03:26.321741 #1946972] INFO -- : make[2]: Leaving directory '/home/opc/ruby/build/master/.bundle/gems/nkf-0.2.0/ext/nkf' I, [2024-05-25T11:03:26.324699 #1946972] INFO -- : make[2]: Entering directory '/home/opc/ruby/build/master/.bundle/gems/rbs-3.4.4/ext/rbs_extension' I, [2024-05-25T11:03:26.325390 #1946972] INFO -- : make[2]: Leaving directory '/home/opc/ruby/build/master/.bundle/gems/racc-1.7.3/ext/racc/cparse' I, [2024-05-25T11:03:26.332188 #1946972] INFO -- : make[2]: Entering directory '/home/opc/ruby/build/master/.bundle/gems/syslog-0.1.2/ext/syslog' I, [2024-05-25T11:03:26.341266 #1946972] INFO -- : make[2]: Leaving directory '/home/opc/ruby/build/master/.bundle/gems/racc-1.8.0/ext/racc/cparse' I, [2024-05-25T11:03:26.355078 #1946972] INFO -- : make[2]: Leaving directory '/home/opc/ruby/build/master/.bundle/gems/rbs-3.4.4/ext/rbs_extension' I, [2024-05-25T11:03:26.362790 #1946972] INFO -- : make[2]: Entering directory '/home/opc/ruby/build/master/ext/digest/sha2' I, [2024-05-25T11:03:26.365076 #1946972] INFO -- : make[2]: Leaving directory '/home/opc/ruby/build/master/.bundle/gems/syslog-0.1.2/ext/syslog' I, [2024-05-25T11:03:26.368157 #1946972] INFO -- : make[2]: Leaving directory '/home/opc/ruby/build/master/ext/digest/sha2' I, [2024-05-25T11:03:26.406957 #1946972] INFO -- : make[2]: Entering directory '/home/opc/ruby/build/master' I, [2024-05-25T11:03:26.490560 #1946972] INFO -- : make[2]: 'ruby' is up to date. I, [2024-05-25T11:03:26.490634 #1946972] INFO -- : make[2]: Leaving directory '/home/opc/ruby/build/master' I, [2024-05-25T11:03:26.490783 #1946972] INFO -- : make[1]: Leaving directory '/home/opc/ruby/build/master' I, [2024-05-25T11:03:26.495925 #1946972] INFO -- : make[1]: Entering directory '/home/opc/ruby/build/master' I, [2024-05-25T11:03:26.495976 #1946972] INFO -- : make[1]: Nothing to be done for 'note'. I, [2024-05-25T11:03:26.495990 #1946972] INFO -- : make[1]: Leaving directory '/home/opc/ruby/build/master' I, [2024-05-25T11:03:26.496205 #1946972] INFO -- : ./miniruby -I/home/opc/ruby/src/master/lib -I. -I.ext/common /home/opc/ruby/src/master/tool/runruby.rb --extout=.ext -- --disable-gems -r./aarch64-linux-fake /home/opc/ruby/src/master/tool/rbinstall.rb --make="make" --dest-dir="" --extout=".ext" --ext-build-dir="./ext" --mflags="-j3 --jobserver-auth=4,5" --make-flags=" -j3 --jobserver-auth=4,5" --data-mode=0644 --prog-mode=0755 --installed-list .installed.list --mantype="doc" --gnumake --install=all --exclude=doc I, [2024-05-25T11:03:26.648540 #1946972] INFO -- : Installing to I, [2024-05-25T11:03:26.648605 #1946972] INFO -- : installing binary commands: /home/opc/ruby/install/master/bin I, [2024-05-25T11:03:26.660468 #1946972] INFO -- : installing base libraries: /home/opc/ruby/install/master/lib I, [2024-05-25T11:03:26.661005 #1946972] INFO -- : installing arch files: /home/opc/ruby/install/master/lib/ruby/3.4.0+0/aarch64-linux I, [2024-05-25T11:03:26.661129 #1946972] INFO -- : installing pkgconfig data: /home/opc/ruby/install/master/lib/pkgconfig I, [2024-05-25T11:03:26.661207 #1946972] INFO -- : installing extension objects: /home/opc/ruby/install/master/lib/ruby/3.4.0+0/aarch64-linux I, [2024-05-25T11:03:26.674025 #1946972] INFO -- : installing extension objects: /home/opc/ruby/install/master/lib/ruby/site_ruby/3.4.0+0/aarch64-linux I, [2024-05-25T11:03:26.674065 #1946972] INFO -- : installing extension objects: /home/opc/ruby/install/master/lib/ruby/vendor_ruby/3.4.0+0/aarch64-linux I, [2024-05-25T11:03:26.674166 #1946972] INFO -- : installing extension headers: /home/opc/ruby/install/master/include/ruby-3.4.0+0/aarch64-linux I, [2024-05-25T11:03:26.674446 #1946972] INFO -- : installing extension scripts: /home/opc/ruby/install/master/lib/ruby/3.4.0+0 I, [2024-05-25T11:03:26.682296 #1946972] INFO -- : installing extension scripts: /home/opc/ruby/install/master/lib/ruby/site_ruby/3.4.0+0 I, [2024-05-25T11:03:26.682328 #1946972] INFO -- : installing extension scripts: /home/opc/ruby/install/master/lib/ruby/vendor_ruby/3.4.0+0 I, [2024-05-25T11:03:26.682339 #1946972] INFO -- : installing extension headers: /home/opc/ruby/install/master/include/ruby-3.4.0+0/ruby I, [2024-05-25T11:03:26.682483 #1946972] INFO -- : installing command scripts: /home/opc/ruby/install/master/bin I, [2024-05-25T11:03:26.682600 #1946972] INFO -- : installing library scripts: /home/opc/ruby/install/master/lib/ruby/3.4.0+0 I, [2024-05-25T11:03:26.764442 #1946972] INFO -- : installing common headers: /home/opc/ruby/install/master/include/ruby-3.4.0+0 I, [2024-05-25T11:03:26.776172 #1946972] INFO -- : installing manpages: /home/opc/ruby/install/master/share/man/man1 I, [2024-05-25T11:03:26.776451 #1946972] INFO -- : installing default gems from lib: /home/opc/ruby/install/master/lib/ruby/gems/3.4.0+0 I, [2024-05-25T11:03:26.821657 #1946972] INFO -- : benchmark 0.3.0 I, [2024-05-25T11:03:26.825739 #1946972] INFO -- : bundler 2.6.0.dev I, [2024-05-25T11:03:26.830451 #1946972] INFO -- : cgi 0.4.1 I, [2024-05-25T11:03:26.831587 #1946972] INFO -- : delegate 0.3.1 I, [2024-05-25T11:03:26.832714 #1946972] INFO -- : did_you_mean 1.6.3 I, [2024-05-25T11:03:26.833909 #1946972] INFO -- : english 0.8.0 I, [2024-05-25T11:03:26.836046 #1946972] INFO -- : erb 4.0.4 I, [2024-05-25T11:03:26.838947 #1946972] INFO -- : error_highlight 0.6.0 I, [2024-05-25T11:03:26.840012 #1946972] INFO -- : fileutils 1.7.2 I, [2024-05-25T11:03:26.841181 #1946972] INFO -- : find 0.2.0 I, [2024-05-25T11:03:26.842316 #1946972] INFO -- : forwardable 1.3.3 I, [2024-05-25T11:03:26.843390 #1946972] INFO -- : ipaddr 1.2.6 I, [2024-05-25T11:03:26.844477 #1946972] INFO -- : irb 1.13.1 I, [2024-05-25T11:03:26.847061 #1946972] INFO -- : logger 1.6.0 I, [2024-05-25T11:03:26.848153 #1946972] INFO -- : net-http 0.4.1 I, [2024-05-25T11:03:26.849381 #1946972] INFO -- : net-protocol 0.2.2 I, [2024-05-25T11:03:26.850575 #1946972] INFO -- : open-uri 0.4.1 I, [2024-05-25T11:03:26.851768 #1946972] INFO -- : open3 0.2.1 I, [2024-05-25T11:03:26.852949 #1946972] INFO -- : optparse 0.5.0 I, [2024-05-25T11:03:26.854115 #1946972] INFO -- : ostruct 0.6.0 I, [2024-05-25T11:03:26.855148 #1946972] INFO -- : pp 0.5.0 I, [2024-05-25T11:03:26.856275 #1946972] INFO -- : prettyprint 0.2.0 I, [2024-05-25T11:03:26.857433 #1946972] INFO -- : prism 0.29.0 I, [2024-05-25T11:03:26.858630 #1946972] INFO -- : pstore 0.1.3 I, [2024-05-25T11:03:26.859705 #1946972] INFO -- : rdoc 6.7.0 I, [2024-05-25T11:03:26.863495 #1946972] INFO -- : readline 0.0.4 I, [2024-05-25T11:03:26.864650 #1946972] INFO -- : reline 0.5.7 I, [2024-05-25T11:03:26.865885 #1946972] INFO -- : resolv 0.4.0 I, [2024-05-25T11:03:26.866997 #1946972] INFO -- : ruby2_keywords 0.0.5 I, [2024-05-25T11:03:26.869481 #1946972] INFO -- : securerandom 0.3.1 I, [2024-05-25T11:03:26.870902 #1946972] INFO -- : set 1.1.0 I, [2024-05-25T11:03:26.871994 #1946972] INFO -- : shellwords 0.2.0 I, [2024-05-25T11:03:26.873130 #1946972] INFO -- : singleton 0.2.0 I, [2024-05-25T11:03:26.874272 #1946972] INFO -- : syntax_suggest 2.0.0 I, [2024-05-25T11:03:26.876667 #1946972] INFO -- : tempfile 0.2.1 I, [2024-05-25T11:03:26.877818 #1946972] INFO -- : time 0.3.0 I, [2024-05-25T11:03:26.878977 #1946972] INFO -- : timeout 0.4.1 I, [2024-05-25T11:03:26.880087 #1946972] INFO -- : tmpdir 0.2.0 I, [2024-05-25T11:03:26.881275 #1946972] INFO -- : tsort 0.2.0 I, [2024-05-25T11:03:26.882365 #1946972] INFO -- : un 0.3.0 I, [2024-05-25T11:03:26.883685 #1946972] INFO -- : uri 0.13.0 I, [2024-05-25T11:03:26.884842 #1946972] INFO -- : weakref 0.1.3 I, [2024-05-25T11:03:26.885979 #1946972] INFO -- : yaml 0.3.0 I, [2024-05-25T11:03:26.886856 #1946972] INFO -- : installing default gems from ext: /home/opc/ruby/install/master/lib/ruby/gems/3.4.0+0 I, [2024-05-25T11:03:26.896314 #1946972] INFO -- : date 3.3.4 I, [2024-05-25T11:03:26.899311 #1946972] INFO -- : digest 3.1.1 I, [2024-05-25T11:03:26.900417 #1946972] INFO -- : etc 1.4.3 I, [2024-05-25T11:03:26.901642 #1946972] INFO -- : fcntl 1.1.0 I, [2024-05-25T11:03:26.902762 #1946972] INFO -- : fiddle 1.1.3 I, [2024-05-25T11:03:26.903877 #1946972] INFO -- : io-console 0.7.2 I, [2024-05-25T11:03:26.905003 #1946972] INFO -- : io-nonblock 0.3.0 I, [2024-05-25T11:03:26.906160 #1946972] INFO -- : io-wait 0.3.1 I, [2024-05-25T11:03:26.907222 #1946972] INFO -- : json 2.7.2 I, [2024-05-25T11:03:26.908425 #1946972] INFO -- : openssl 3.2.0 I, [2024-05-25T11:03:26.909634 #1946972] INFO -- : pathname 0.3.0 I, [2024-05-25T11:03:26.911198 #1946972] INFO -- : psych 5.1.2 I, [2024-05-25T11:03:26.912463 #1946972] INFO -- : stringio 3.1.1 I, [2024-05-25T11:03:26.913667 #1946972] INFO -- : strscan 3.1.1 I, [2024-05-25T11:03:26.914840 #1946972] INFO -- : zlib 3.1.0 I, [2024-05-25T11:03:26.915779 #1946972] INFO -- : installing bundled gems: /home/opc/ruby/install/master/lib/ruby/gems/3.4.0+0 I, [2024-05-25T11:03:26.916822 #1946972] INFO -- : minitest 5.23.1 I, [2024-05-25T11:03:26.934918 #1946972] INFO -- : rake 13.2.1 I, [2024-05-25T11:03:26.948971 #1946972] INFO -- : test-unit 3.6.2 I, [2024-05-25T11:03:26.962981 #1946972] INFO -- : rexml 3.2.8 I, [2024-05-25T11:03:26.979158 #1946972] INFO -- : rss 0.3.0 I, [2024-05-25T11:03:26.988901 #1946972] INFO -- : net-ftp 0.3.4 I, [2024-05-25T11:03:26.993696 #1946972] INFO -- : net-imap 0.4.11 I, [2024-05-25T11:03:27.009093 #1946972] INFO -- : net-pop 0.1.2 I, [2024-05-25T11:03:27.011753 #1946972] INFO -- : net-smtp 0.5.0 I, [2024-05-25T11:03:27.015275 #1946972] INFO -- : matrix 0.4.2 I, [2024-05-25T11:03:27.023702 #1946972] INFO -- : prime 0.1.2 I, [2024-05-25T11:03:27.032783 #1946972] INFO -- : rbs 3.4.4 I, [2024-05-25T11:03:27.137285 #1946972] INFO -- : typeprof 0.21.11 I, [2024-05-25T11:03:27.146192 #1946972] INFO -- : debug 1.9.2 I, [2024-05-25T11:03:27.156316 #1946972] INFO -- : racc 1.8.0 I, [2024-05-25T11:03:27.167604 #1946972] INFO -- : mutex_m 0.2.0 I, [2024-05-25T11:03:27.170741 #1946972] INFO -- : getoptlong 0.2.1 I, [2024-05-25T11:03:27.175714 #1946972] INFO -- : base64 0.2.0 I, [2024-05-25T11:03:27.178267 #1946972] INFO -- : bigdecimal 3.1.8 I, [2024-05-25T11:03:27.184636 #1946972] INFO -- : observer 0.1.2 I, [2024-05-25T11:03:27.187708 #1946972] INFO -- : abbrev 0.1.2 I, [2024-05-25T11:03:27.190785 #1946972] INFO -- : resolv-replace 0.1.1 I, [2024-05-25T11:03:27.195344 #1946972] INFO -- : rinda 0.2.0 I, [2024-05-25T11:03:27.199144 #1946972] INFO -- : drb 2.2.1 I, [2024-05-25T11:03:27.204370 #1946972] INFO -- : nkf 0.2.0 I, [2024-05-25T11:03:27.211527 #1946972] INFO -- : syslog 0.1.2 I, [2024-05-25T11:03:27.216716 #1946972] INFO -- : csv 3.3.0 I, [2024-05-25T11:03:27.226085 #1946972] INFO -- : installing bundled gem cache: /home/opc/ruby/install/master/lib/ruby/gems/3.4.0+0/cache I, [2024-05-25T11:03:27.228069 #1946972] INFO -- : skipped bundled gems: I, [2024-05-25T11:03:27.228086 #1946972] INFO -- : power_assert-2.0.4dev.gem not found in bundled_gems I, [2024-05-25T11:03:27.231193 #1946972] INFO -- : $$$[end] "make install -j3" exit with 0. I, [2024-05-25T11:03:27.231337 #1946972] INFO -- : $$$[beg] make yes-btest TESTOPTS='-q -j3' I, [2024-05-25T11:03:49.721331 #1946972] INFO -- : PASS all 1936 tests E, [2024-05-25T11:03:49.722991 #1946972] ERROR -- : I, [2024-05-25T11:03:49.723103 #1946972] INFO -- : $$$[end] "make yes-btest TESTOPTS='-q -j3'" exit with 0. I, [2024-05-25T11:03:49.723259 #1946972] INFO -- : $$$[beg] make yes-test-basic TESTS='-j3' I, [2024-05-25T11:03:49.815314 #1946972] INFO -- : BASERUBY = /usr/local/bin/ruby --disable=gems I, [2024-05-25T11:03:49.816795 #1946972] INFO -- : CC = gcc I, [2024-05-25T11:03:49.816812 #1946972] INFO -- : LD = ld I, [2024-05-25T11:03:49.816821 #1946972] INFO -- : LDSHARED = gcc -shared I, [2024-05-25T11:03:49.816835 #1946972] INFO -- : CFLAGS = -O3 -fno-fast-math -ggdb3 -Wall -Wextra -Wdeprecated-declarations -Wdiv-by-zero -Wduplicated-cond -Wimplicit-function-declaration -Wimplicit-int -Wpointer-arith -Wwrite-strings -Wold-style-definition -Wimplicit-fallthrough=0 -Wmissing-noreturn -Wno-cast-function-type -Wno-constant-logical-operand -Wno-long-long -Wno-missing-field-initializers -Wno-overlength-strings -Wno-packed-bitfield-compat -Wno-parentheses-equality -Wno-self-assign -Wno-tautological-compare -Wno-unused-parameter -Wno-unused-value -Wsuggest-attribute=format -Wsuggest-attribute=noreturn -Wunused-variable -Wmisleading-indentation -Wundef I, [2024-05-25T11:03:49.816845 #1946972] INFO -- : XCFLAGS = -U_FORTIFY_SOURCE -D_FORTIFY_SOURCE=2 -fstack-protector-strong -msign-return-address=all -fno-strict-overflow -fvisibility=hidden -fexcess-precision=standard -DRUBY_EXPORT -fPIE -I. -I.ext/include/aarch64-linux -I/home/opc/ruby/src/master/include -I/home/opc/ruby/src/master -I/home/opc/ruby/src/master/prism -I/home/opc/ruby/src/master/enc/unicode/15.0.0 I, [2024-05-25T11:03:49.816854 #1946972] INFO -- : CPPFLAGS = I, [2024-05-25T11:03:49.816862 #1946972] INFO -- : DLDFLAGS = -Wl,--compress-debug-sections=zlib -fstack-protector-strong -pie I, [2024-05-25T11:03:49.816871 #1946972] INFO -- : SOLIBS = -lz -lrt -lrt -ldl -lcrypt -lm -lpthread I, [2024-05-25T11:03:49.816879 #1946972] INFO -- : LANG = en_US.UTF-8 I, [2024-05-25T11:03:49.816887 #1946972] INFO -- : LC_ALL = I, [2024-05-25T11:03:49.816895 #1946972] INFO -- : LC_CTYPE = I, [2024-05-25T11:03:49.816904 #1946972] INFO -- : MFLAGS = I, [2024-05-25T11:03:49.816912 #1946972] INFO -- : RUSTC = rustc I, [2024-05-25T11:03:49.816920 #1946972] INFO -- : YJIT_RUSTC_ARGS = --crate-name=yjit --crate-type=staticlib --edition=2021 -g -C lto=thin -C opt-level=3 -C overflow-checks=on '--out-dir=/home/opc/ruby/build/master/yjit/target/release/' /home/opc/ruby/src/master/yjit/src/lib.rs I, [2024-05-25T11:03:49.817772 #1946972] INFO -- : gcc (GCC) 8.5.0 20210514 (Red Hat 8.5.0-10.1.0.1) I, [2024-05-25T11:03:49.817811 #1946972] INFO -- : Copyright (C) 2018 Free Software Foundation, Inc. I, [2024-05-25T11:03:49.817822 #1946972] INFO -- : This is free software; see the source for copying conditions. There is NO I, [2024-05-25T11:03:49.817832 #1946972] INFO -- : warranty; not even for MERCHANTABILITY or FITNESS FOR A PARTICULAR PURPOSE. I, [2024-05-25T11:03:49.817841 #1946972] INFO -- : I, [2024-05-25T11:03:49.974077 #1946972] INFO -- : Checking leaked global symbols...none I, [2024-05-25T11:03:50.026929 #1946972] INFO -- : /home/opc/ruby/src/master/basictest/test.rb:assignment ....................................................................................................................................................................................................................................................................................................................................................................................OK 372 I, [2024-05-25T11:03:50.027006 #1946972] INFO -- : /home/opc/ruby/src/master/basictest/test.rb:condition ..OK 2 I, [2024-05-25T11:03:50.027031 #1946972] INFO -- : /home/opc/ruby/src/master/basictest/test.rb:if/unless ...OK 3 I, [2024-05-25T11:03:50.027077 #1946972] INFO -- : /home/opc/ruby/src/master/basictest/test.rb:case .....OK 5 I, [2024-05-25T11:03:50.027699 #1946972] INFO -- : /home/opc/ruby/src/master/basictest/test.rb:while/until ........OK 8 I, [2024-05-25T11:03:50.027817 #1946972] INFO -- : /home/opc/ruby/src/master/basictest/test.rb:exception ..........OK 10 I, [2024-05-25T11:03:50.028449 #1946972] INFO -- : /home/opc/ruby/src/master/basictest/test.rb:array .......................................OK 39 I, [2024-05-25T11:03:50.028732 #1946972] INFO -- : /home/opc/ruby/src/master/basictest/test.rb:hash ...........................OK 27 I, [2024-05-25T11:03:50.030364 #1946972] INFO -- : /home/opc/ruby/src/master/basictest/test.rb:iterator ...........................................................................................................OK 107 I, [2024-05-25T11:03:50.031100 #1946972] INFO -- : /home/opc/ruby/src/master/basictest/test.rb:float ................................................................................OK 80 I, [2024-05-25T11:03:50.034823 #1946972] INFO -- : /home/opc/ruby/src/master/basictest/test.rb:bignum ...............................OK 31 I, [2024-05-25T11:03:50.036393 #1946972] INFO -- : /home/opc/ruby/src/master/basictest/test.rb:string & char ..............................................................OK 62 I, [2024-05-25T11:03:50.036470 #1946972] INFO -- : /home/opc/ruby/src/master/basictest/test.rb:assignment ..........OK 10 I, [2024-05-25T11:03:50.036553 #1946972] INFO -- : /home/opc/ruby/src/master/basictest/test.rb:call ......OK 6 I, [2024-05-25T11:03:50.036684 #1946972] INFO -- : /home/opc/ruby/src/master/basictest/test.rb:proc .........OK 9 I, [2024-05-25T11:03:50.136932 #1946972] INFO -- : /home/opc/ruby/src/master/basictest/test.rb:signal ..OK 2 I, [2024-05-25T11:03:50.138456 #1946972] INFO -- : /home/opc/ruby/src/master/basictest/test.rb:eval ...........................OK 27 I, [2024-05-25T11:03:50.278561 #1946972] INFO -- : /home/opc/ruby/src/master/basictest/test.rb:system ........OK 8 I, [2024-05-25T11:03:50.278634 #1946972] INFO -- : /home/opc/ruby/src/master/basictest/test.rb:const .....OK 5 I, [2024-05-25T11:03:50.278727 #1946972] INFO -- : /home/opc/ruby/src/master/basictest/test.rb:clone .....OK 5 I, [2024-05-25T11:03:50.278916 #1946972] INFO -- : /home/opc/ruby/src/master/basictest/test.rb:marshal ....OK 4 I, [2024-05-25T11:03:50.278990 #1946972] INFO -- : /home/opc/ruby/src/master/basictest/test.rb:pack ....OK 4 I, [2024-05-25T11:03:50.279023 #1946972] INFO -- : /home/opc/ruby/src/master/basictest/test.rb:math ..OK 2 I, [2024-05-25T11:03:50.279113 #1946972] INFO -- : /home/opc/ruby/src/master/basictest/test.rb:struct ......OK 6 I, [2024-05-25T11:03:50.279281 #1946972] INFO -- : /home/opc/ruby/src/master/basictest/test.rb:variable ............OK 12 I, [2024-05-25T11:03:50.279323 #1946972] INFO -- : /home/opc/ruby/src/master/basictest/test.rb:trace ...OK 3 I, [2024-05-25T11:03:50.279451 #1946972] INFO -- : /home/opc/ruby/src/master/basictest/test.rb:defined? ............OK 12 I, [2024-05-25T11:03:50.279539 #1946972] INFO -- : /home/opc/ruby/src/master/basictest/test.rb:alias ......OK 6 I, [2024-05-25T11:03:50.280116 #1946972] INFO -- : /home/opc/ruby/src/master/basictest/test.rb:path .......................OK 23 I, [2024-05-25T11:03:50.346810 #1946972] INFO -- : /home/opc/ruby/src/master/basictest/test.rb:gc ....OK 4 I, [2024-05-25T11:03:50.348781 #1946972] INFO -- : I, [2024-05-25T11:03:50.348817 #1946972] INFO -- : test succeeded I, [2024-05-25T11:03:50.349368 #1946972] INFO -- : $$$[end] "make yes-test-basic TESTS='-j3'" exit with 0. I, [2024-05-25T11:03:50.349856 #1946972] INFO -- : $$$[beg] make yes-test-all TESTOPTS='--stderr-on-failure' TESTS='-j3' I, [2024-05-25T11:03:50.473905 #1946972] INFO -- : BASERUBY = /usr/local/bin/ruby --disable=gems I, [2024-05-25T11:03:50.473982 #1946972] INFO -- : CC = gcc I, [2024-05-25T11:03:50.473995 #1946972] INFO -- : LD = ld I, [2024-05-25T11:03:50.474005 #1946972] INFO -- : LDSHARED = gcc -shared I, [2024-05-25T11:03:50.474018 #1946972] INFO -- : CFLAGS = -O3 -fno-fast-math -ggdb3 -Wall -Wextra -Wdeprecated-declarations -Wdiv-by-zero -Wduplicated-cond -Wimplicit-function-declaration -Wimplicit-int -Wpointer-arith -Wwrite-strings -Wold-style-definition -Wimplicit-fallthrough=0 -Wmissing-noreturn -Wno-cast-function-type -Wno-constant-logical-operand -Wno-long-long -Wno-missing-field-initializers -Wno-overlength-strings -Wno-packed-bitfield-compat -Wno-parentheses-equality -Wno-self-assign -Wno-tautological-compare -Wno-unused-parameter -Wno-unused-value -Wsuggest-attribute=format -Wsuggest-attribute=noreturn -Wunused-variable -Wmisleading-indentation -Wundef I, [2024-05-25T11:03:50.474030 #1946972] INFO -- : XCFLAGS = -U_FORTIFY_SOURCE -D_FORTIFY_SOURCE=2 -fstack-protector-strong -msign-return-address=all -fno-strict-overflow -fvisibility=hidden -fexcess-precision=standard -DRUBY_EXPORT -fPIE -I. -I.ext/include/aarch64-linux -I/home/opc/ruby/src/master/include -I/home/opc/ruby/src/master -I/home/opc/ruby/src/master/prism -I/home/opc/ruby/src/master/enc/unicode/15.0.0 I, [2024-05-25T11:03:50.474039 #1946972] INFO -- : CPPFLAGS = I, [2024-05-25T11:03:50.474048 #1946972] INFO -- : DLDFLAGS = -Wl,--compress-debug-sections=zlib -fstack-protector-strong -pie I, [2024-05-25T11:03:50.474058 #1946972] INFO -- : SOLIBS = -lz -lrt -lrt -ldl -lcrypt -lm -lpthread I, [2024-05-25T11:03:50.474067 #1946972] INFO -- : LANG = en_US.UTF-8 I, [2024-05-25T11:03:50.474075 #1946972] INFO -- : LC_ALL = I, [2024-05-25T11:03:50.474084 #1946972] INFO -- : LC_CTYPE = I, [2024-05-25T11:03:50.474092 #1946972] INFO -- : MFLAGS = I, [2024-05-25T11:03:50.474101 #1946972] INFO -- : RUSTC = rustc I, [2024-05-25T11:03:50.474109 #1946972] INFO -- : YJIT_RUSTC_ARGS = --crate-name=yjit --crate-type=staticlib --edition=2021 -g -C lto=thin -C opt-level=3 -C overflow-checks=on '--out-dir=/home/opc/ruby/build/master/yjit/target/release/' /home/opc/ruby/src/master/yjit/src/lib.rs I, [2024-05-25T11:03:50.474768 #1946972] INFO -- : gcc (GCC) 8.5.0 20210514 (Red Hat 8.5.0-10.1.0.1) I, [2024-05-25T11:03:50.474786 #1946972] INFO -- : Copyright (C) 2018 Free Software Foundation, Inc. I, [2024-05-25T11:03:50.474796 #1946972] INFO -- : This is free software; see the source for copying conditions. There is NO I, [2024-05-25T11:03:50.474805 #1946972] INFO -- : warranty; not even for MERCHANTABILITY or FITNESS FOR A PARTICULAR PURPOSE. I, [2024-05-25T11:03:50.474814 #1946972] INFO -- : I, [2024-05-25T11:03:50.476863 #1946972] INFO -- : generating enc.mk I, [2024-05-25T11:03:50.706701 #1946972] INFO -- : generating encdb.h I, [2024-05-25T11:03:50.743941 #1946972] INFO -- : encdb.h unchanged I, [2024-05-25T11:03:50.745180 #1946972] INFO -- : making enc I, [2024-05-25T11:03:50.772343 #1946972] INFO -- : make[1]: Entering directory '/home/opc/ruby/build/master' I, [2024-05-25T11:03:50.772427 #1946972] INFO -- : make[1]: Nothing to be done for 'enc'. I, [2024-05-25T11:03:50.772445 #1946972] INFO -- : make[1]: Leaving directory '/home/opc/ruby/build/master' I, [2024-05-25T11:03:50.773582 #1946972] INFO -- : making srcs under enc I, [2024-05-25T11:03:50.815262 #1946972] INFO -- : make[1]: Entering directory '/home/opc/ruby/build/master' I, [2024-05-25T11:03:50.815341 #1946972] INFO -- : make[1]: Nothing to be done for 'srcs'. I, [2024-05-25T11:03:50.815365 #1946972] INFO -- : make[1]: Leaving directory '/home/opc/ruby/build/master' I, [2024-05-25T11:03:50.816457 #1946972] INFO -- : generating transdb.h I, [2024-05-25T11:03:50.960524 #1946972] INFO -- : transdb.h unchanged I, [2024-05-25T11:03:50.961855 #1946972] INFO -- : making trans I, [2024-05-25T11:03:51.010152 #1946972] INFO -- : make[1]: Entering directory '/home/opc/ruby/build/master' I, [2024-05-25T11:03:51.010224 #1946972] INFO -- : make[1]: Nothing to be done for 'trans'. I, [2024-05-25T11:03:51.010237 #1946972] INFO -- : make[1]: Leaving directory '/home/opc/ruby/build/master' I, [2024-05-25T11:03:51.011027 #1946972] INFO -- : making encs I, [2024-05-25T11:03:51.064220 #1946972] INFO -- : make[1]: Entering directory '/home/opc/ruby/build/master' I, [2024-05-25T11:03:51.064293 #1946972] INFO -- : make[1]: Nothing to be done for 'encs'. I, [2024-05-25T11:03:51.064306 #1946972] INFO -- : make[1]: Leaving directory '/home/opc/ruby/build/master' I, [2024-05-25T11:03:51.066409 #1946972] INFO -- : generating makefiles ext/configure-ext.mk I, [2024-05-25T11:03:51.106977 #1946972] INFO -- : ext/configure-ext.mk updated I, [2024-05-25T11:03:51.110622 #1946972] INFO -- : make[1]: Entering directory '/home/opc/ruby/build/master' I, [2024-05-25T11:03:53.222617 #1946972] INFO -- : make[1]: Leaving directory '/home/opc/ruby/build/master' I, [2024-05-25T11:03:53.223318 #1946972] INFO -- : generating makefile exts.mk I, [2024-05-25T11:03:53.281993 #1946972] INFO -- : exts.mk unchanged I, [2024-05-25T11:03:53.287128 #1946972] INFO -- : make[1]: Entering directory '/home/opc/ruby/build/master' I, [2024-05-25T11:03:53.589345 #1946972] INFO -- : make[2]: Entering directory '/home/opc/ruby/build/master/ext/coverage' I, [2024-05-25T11:03:53.594340 #1946972] INFO -- : make[2]: Leaving directory '/home/opc/ruby/build/master/ext/coverage' I, [2024-05-25T11:03:53.599957 #1946972] INFO -- : make[2]: Entering directory '/home/opc/ruby/build/master/ext/date' I, [2024-05-25T11:03:53.605267 #1946972] INFO -- : make[2]: Leaving directory '/home/opc/ruby/build/master/ext/date' I, [2024-05-25T11:03:53.608963 #1946972] INFO -- : make[2]: Entering directory '/home/opc/ruby/build/master/ext/digest' I, [2024-05-25T11:03:53.617887 #1946972] INFO -- : make[2]: Leaving directory '/home/opc/ruby/build/master/ext/digest' I, [2024-05-25T11:03:53.640441 #1946972] INFO -- : make[2]: Entering directory '/home/opc/ruby/build/master/ext/digest/sha2' I, [2024-05-25T11:03:53.645533 #1946972] INFO -- : make[2]: Leaving directory '/home/opc/ruby/build/master/ext/digest/sha2' I, [2024-05-25T11:03:53.663783 #1946972] INFO -- : make[2]: Entering directory '/home/opc/ruby/build/master/ext/fiddle' I, [2024-05-25T11:03:53.673844 #1946972] INFO -- : make[2]: Leaving directory '/home/opc/ruby/build/master/ext/fiddle' I, [2024-05-25T11:03:53.678086 #1946972] INFO -- : make[2]: Entering directory '/home/opc/ruby/build/master/ext/io/console' I, [2024-05-25T11:03:53.682371 #1946972] INFO -- : make[2]: Leaving directory '/home/opc/ruby/build/master/ext/io/console' I, [2024-05-25T11:03:53.693057 #1946972] INFO -- : make[2]: Entering directory '/home/opc/ruby/build/master/ext/json' I, [2024-05-25T11:03:53.702428 #1946972] INFO -- : make[2]: Leaving directory '/home/opc/ruby/build/master/ext/json' I, [2024-05-25T11:03:53.715247 #1946972] INFO -- : make[2]: Entering directory '/home/opc/ruby/build/master/ext/monitor' I, [2024-05-25T11:03:53.719375 #1946972] INFO -- : make[2]: Leaving directory '/home/opc/ruby/build/master/ext/monitor' I, [2024-05-25T11:03:53.725438 #1946972] INFO -- : make[2]: Entering directory '/home/opc/ruby/build/master/ext/objspace' I, [2024-05-25T11:03:53.731321 #1946972] INFO -- : make[2]: Leaving directory '/home/opc/ruby/build/master/ext/objspace' I, [2024-05-25T11:03:53.750130 #1946972] INFO -- : make[2]: Entering directory '/home/opc/ruby/build/master/ext/openssl' I, [2024-05-25T11:03:53.771622 #1946972] INFO -- : make[2]: Leaving directory '/home/opc/ruby/build/master/ext/openssl' I, [2024-05-25T11:03:53.775868 #1946972] INFO -- : make[2]: Entering directory '/home/opc/ruby/build/master/ext/pathname' I, [2024-05-25T11:03:53.780028 #1946972] INFO -- : make[2]: Leaving directory '/home/opc/ruby/build/master/ext/pathname' I, [2024-05-25T11:03:53.786517 #1946972] INFO -- : make[2]: Entering directory '/home/opc/ruby/build/master/ext/psych' I, [2024-05-25T11:03:53.807689 #1946972] INFO -- : make[2]: Leaving directory '/home/opc/ruby/build/master/ext/psych' I, [2024-05-25T11:03:53.812220 #1946972] INFO -- : make[2]: Entering directory '/home/opc/ruby/build/master/ext/pty' I, [2024-05-25T11:03:53.816517 #1946972] INFO -- : make[2]: Leaving directory '/home/opc/ruby/build/master/ext/pty' I, [2024-05-25T11:03:53.829878 #1946972] INFO -- : make[2]: Entering directory '/home/opc/ruby/build/master/ext/ripper' I, [2024-05-25T11:03:53.837704 #1946972] INFO -- : make[2]: Leaving directory '/home/opc/ruby/build/master/ext/ripper' I, [2024-05-25T11:03:53.839707 #1946972] INFO -- : make[2]: Entering directory '/home/opc/ruby/build/master/ext/rubyvm' I, [2024-05-25T11:03:53.843185 #1946972] INFO -- : make[2]: Leaving directory '/home/opc/ruby/build/master/ext/rubyvm' I, [2024-05-25T11:03:53.855318 #1946972] INFO -- : make[2]: Entering directory '/home/opc/ruby/build/master/ext/socket' I, [2024-05-25T11:03:53.865821 #1946972] INFO -- : make[2]: Leaving directory '/home/opc/ruby/build/master/ext/socket' I, [2024-05-25T11:03:53.881213 #1946972] INFO -- : make[2]: Entering directory '/home/opc/ruby/build/master/.bundle/gems/bigdecimal-3.1.7/ext/bigdecimal' I, [2024-05-25T11:03:53.912685 #1946972] INFO -- : make[2]: Leaving directory '/home/opc/ruby/build/master/.bundle/gems/bigdecimal-3.1.7/ext/bigdecimal' I, [2024-05-25T11:03:53.915288 #1946972] INFO -- : make[2]: Entering directory '/home/opc/ruby/build/master/.bundle/gems/bigdecimal-3.1.8/ext/bigdecimal' I, [2024-05-25T11:03:53.945313 #1946972] INFO -- : make[2]: Leaving directory '/home/opc/ruby/build/master/.bundle/gems/bigdecimal-3.1.8/ext/bigdecimal' I, [2024-05-25T11:03:53.948044 #1946972] INFO -- : make[2]: Entering directory '/home/opc/ruby/build/master/.bundle/gems/debug-1.9.2/ext/debug' I, [2024-05-25T11:03:53.978078 #1946972] INFO -- : make[2]: Leaving directory '/home/opc/ruby/build/master/.bundle/gems/debug-1.9.2/ext/debug' I, [2024-05-25T11:03:53.980655 #1946972] INFO -- : make[2]: Entering directory '/home/opc/ruby/build/master/.bundle/gems/nkf-0.2.0/ext/nkf' I, [2024-05-25T11:03:54.010767 #1946972] INFO -- : make[2]: Leaving directory '/home/opc/ruby/build/master/.bundle/gems/nkf-0.2.0/ext/nkf' I, [2024-05-25T11:03:54.013351 #1946972] INFO -- : make[2]: Entering directory '/home/opc/ruby/build/master/.bundle/gems/racc-1.7.3/ext/racc/cparse' I, [2024-05-25T11:03:54.043765 #1946972] INFO -- : make[2]: Leaving directory '/home/opc/ruby/build/master/.bundle/gems/racc-1.7.3/ext/racc/cparse' I, [2024-05-25T11:03:54.046304 #1946972] INFO -- : make[2]: Entering directory '/home/opc/ruby/build/master/.bundle/gems/racc-1.8.0/ext/racc/cparse' I, [2024-05-25T11:03:54.076174 #1946972] INFO -- : make[2]: Leaving directory '/home/opc/ruby/build/master/.bundle/gems/racc-1.8.0/ext/racc/cparse' I, [2024-05-25T11:03:54.079217 #1946972] INFO -- : make[2]: Entering directory '/home/opc/ruby/build/master/.bundle/gems/rbs-3.4.4/ext/rbs_extension' I, [2024-05-25T11:03:54.109093 #1946972] INFO -- : make[2]: Leaving directory '/home/opc/ruby/build/master/.bundle/gems/rbs-3.4.4/ext/rbs_extension' I, [2024-05-25T11:03:54.111674 #1946972] INFO -- : make[2]: Entering directory '/home/opc/ruby/build/master/.bundle/gems/syslog-0.1.2/ext/syslog' I, [2024-05-25T11:03:54.141944 #1946972] INFO -- : make[2]: Leaving directory '/home/opc/ruby/build/master/.bundle/gems/syslog-0.1.2/ext/syslog' I, [2024-05-25T11:03:54.180056 #1946972] INFO -- : make[2]: Entering directory '/home/opc/ruby/build/master' I, [2024-05-25T11:03:54.262904 #1946972] INFO -- : make[2]: 'ruby' is up to date. I, [2024-05-25T11:03:54.262981 #1946972] INFO -- : make[2]: Leaving directory '/home/opc/ruby/build/master' I, [2024-05-25T11:03:54.263105 #1946972] INFO -- : make[1]: Leaving directory '/home/opc/ruby/build/master' I, [2024-05-25T11:03:54.267601 #1946972] INFO -- : make[1]: Entering directory '/home/opc/ruby/build/master' I, [2024-05-25T11:03:54.267659 #1946972] INFO -- : make[1]: Nothing to be done for 'note'. I, [2024-05-25T11:03:54.267671 #1946972] INFO -- : make[1]: Leaving directory '/home/opc/ruby/build/master' I, [2024-05-25T11:03:54.379495 #1946972] INFO -- : Run options: I, [2024-05-25T11:03:54.379573 #1946972] INFO -- : --seed=43558 I, [2024-05-25T11:03:54.379585 #1946972] INFO -- : "--ruby=./miniruby -I/home/opc/ruby/src/master/lib -I. -I.ext/common /home/opc/ruby/src/master/tool/runruby.rb --extout=.ext -- --disable-gems" I, [2024-05-25T11:03:54.379596 #1946972] INFO -- : --excludes-dir=/home/opc/ruby/src/master/test/.excludes I, [2024-05-25T11:03:54.379605 #1946972] INFO -- : --name=!/memory_leak/ I, [2024-05-25T11:03:54.379613 #1946972] INFO -- : --stderr-on-failure I, [2024-05-25T11:03:54.379623 #1946972] INFO -- : -j3 I, [2024-05-25T11:03:54.379631 #1946972] INFO -- : I, [2024-05-25T11:03:54.379640 #1946972] INFO -- : # Running tests: I, [2024-05-25T11:03:54.379649 #1946972] INFO -- : I, [2024-05-25T11:03:54.509938 #1946972] INFO -- : [ 1/883] 1987940=test_set I, [2024-05-25T11:03:54.514562 #1946972] INFO -- : [ 2/883] 1987939=attribute_write_test I, [2024-05-25T11:03:54.541557 #1946972] INFO -- : [ 3/883] 1987941=test_http I, [2024-05-25T11:03:54.554675 #1946972] INFO -- : [ 4/883] 1987940=test_utf16 I, [2024-05-25T11:03:54.568143 #1946972] INFO -- : [ 5/883] 1987940=test_case I, [2024-05-25T11:03:54.578668 #1946972] INFO -- : [ 6/883] 1987940=test_ractor I, [2024-05-25T11:03:54.583700 #1946972] INFO -- : [ 7/883] 1987940=test_severity I, [2024-05-25T11:03:54.585994 #1946972] INFO -- : [ 8/883] 1987939=test_str2big I, [2024-05-25T11:03:54.589530 #1946972] INFO -- : [ 9/883] 1987940=test_gem_package_tar_writer I, [2024-05-25T11:03:54.661278 #1946972] INFO -- : [ 10/883] 1987939=test_rdoc_markup_to_rdoc I, [2024-05-25T11:03:54.776855 #1946972] INFO -- : [ 11/883] 1987939=test_cclass I, [2024-05-25T11:03:54.883008 #1946972] INFO -- : [ 12/883] 1987940=test_gem_uninstaller I, [2024-05-25T11:03:54.892123 #1946972] INFO -- : [ 13/883] 1987939=test_yjit I, [2024-05-25T11:03:54.900560 #1946972] INFO -- : [ 14/883] 1987939=test_gem_dependency I, [2024-05-25T11:03:55.272865 #1946972] INFO -- : [ 15/883] 1987939=test_method I, [2024-05-25T11:03:56.204624 #1946972] INFO -- : [ 16/883] 1987940=test_m17n I, [2024-05-25T11:03:56.261824 #1946972] INFO -- : [ 17/883] 1987940=test_argf I, [2024-05-25T11:03:58.453826 #1946972] INFO -- : [ 18/883] 1987939=test_x509name I, [2024-05-25T11:03:58.500878 #1946972] INFO -- : [ 19/883] 1987939=test_yaml I, [2024-05-25T11:03:58.580172 #1946972] INFO -- : [ 20/883] 1987939=test_pkcs12 I, [2024-05-25T11:03:59.240718 #1946972] INFO -- : [ 21/883] 1987939=test_koi8 I, [2024-05-25T11:03:59.249506 #1946972] INFO -- : [ 22/883] 1987939=test_json_tree I, [2024-05-25T11:03:59.288149 #1946972] INFO -- : [ 23/883] 1987939=test_gem_remote_fetcher I, [2024-05-25T11:03:59.864894 #1946972] INFO -- : [ 24/883] 1987940=test_parser_events I, [2024-05-25T11:03:59.923082 #1946972] INFO -- : [ 25/883] 1987940=test_filter I, [2024-05-25T11:03:59.966059 #1946972] INFO -- : [ 26/883] 1987940=test_http I, [2024-05-25T11:03:59.982823 #1946972] INFO -- : [ 27/883] 1987940=test_hash I, [2024-05-25T11:04:01.067661 #1946972] INFO -- : [ 28/883] 1987939=parser_test I, [2024-05-25T11:04:01.076857 #1946972] INFO -- : [ 29/883] 1987939=test_pty I, [2024-05-25T11:04:01.079504 #1946972] INFO -- : Leaked file descriptor: TestPTY#test_open_with_block: 8 # I, [2024-05-25T11:04:01.079564 #1946972] INFO -- : Leaked file descriptor: TestPTY#test_open_with_block: 9 # I, [2024-05-25T11:04:01.109098 #1946972] INFO -- : COMMAND PID USER FD TYPE DEVICE SIZE/OFF NODE NAME I, [2024-05-25T11:04:01.109170 #1946972] INFO -- : ruby 1987939 opc 8r REG 252,0 6940392 13705429 /var/lib/sss/mc/group I, [2024-05-25T11:04:01.109182 #1946972] INFO -- : ruby 1987939 opc 9u unix 0x0000000000000000 0t0 3136053677 type=STREAM I, [2024-05-25T11:04:01.618599 #1946972] INFO -- : [ 30/883] 1987939=test_gem_dependency_installer I, [2024-05-25T11:04:03.056572 #1946972] INFO -- : [ 31/883] 1987940=test_gem_request I, [2024-05-25T11:04:03.094386 #1946972] INFO -- : [ 32/883] 1987941=test_gem_commands_which_command I, [2024-05-25T11:04:03.281970 #1946972] INFO -- : [ 33/883] 1987940=test_gem_package_old I, [2024-05-25T11:04:03.286717 #1946972] INFO -- : [ 34/883] 1987941=encoding_test I, [2024-05-25T11:04:03.340165 #1946972] INFO -- : [ 35/883] 1987940=test_scan_args I, [2024-05-25T11:04:03.368040 #1946972] INFO -- : [ 36/883] 1987940=test_gem_commands_specification_command I, [2024-05-25T11:04:03.431272 #1946972] INFO -- : [ 37/883] 1987941=test_method_cache I, [2024-05-25T11:04:03.443193 #1946972] INFO -- : [ 38/883] 1987941=test_too_many_dummy_encodings I, [2024-05-25T11:04:03.493764 #1946972] INFO -- : [ 39/883] 1987941=test_sprintf_comb I, [2024-05-25T11:04:03.511294 #1946972] INFO -- : [ 40/883] 1987940=test_gem_commands_push_command I, [2024-05-25T11:04:03.664148 #1946972] INFO -- : [ 41/883] 1987941=locals_test I, [2024-05-25T11:04:03.853445 #1946972] INFO -- : [ 42/883] 1987939=test_rdoc_task I, [2024-05-25T11:04:03.859524 #1946972] INFO -- : [ 43/883] 1987939=test_backtrace I, [2024-05-25T11:04:04.083414 #1946972] INFO -- : [ 44/883] 1987941=test_gem_text I, [2024-05-25T11:04:04.140209 #1946972] INFO -- : [ 45/883] 1987940=test_settracefunc I, [2024-05-25T11:04:04.164091 #1946972] INFO -- : [ 46/883] 1987941=test_tracepoint I, [2024-05-25T11:04:04.423972 #1946972] INFO -- : [ 47/883] 1987941=test_rendering I, [2024-05-25T11:04:04.458384 #1946972] INFO -- : [ 48/883] 1987941=test_win32ole I, [2024-05-25T11:04:04.465099 #1946972] INFO -- : [ 49/883] 1987941=test_internal_ivar I, [2024-05-25T11:04:04.496856 #1946972] INFO -- : [ 50/883] 1987941=test_gem_source_local I, [2024-05-25T11:04:04.730990 #1946972] INFO -- : [ 51/883] 1987941=desugar_compiler_test I, [2024-05-25T11:04:04.795413 #1946972] INFO -- : [ 52/883] 1987941=test_gem_gemcutter_utilities I, [2024-05-25T11:04:04.938612 #1946972] INFO -- : [ 53/883] 1987940=test_cgi_tag_helper I, [2024-05-25T11:04:04.960884 #1946972] INFO -- : [ 54/883] 1987940=test_pack I, [2024-05-25T11:04:04.976579 #1946972] INFO -- : [ 55/883] 1987940=test_pinned I, [2024-05-25T11:04:04.998861 #1946972] INFO -- : [ 56/883] 1987940=test_framework I, [2024-05-25T11:04:05.018313 #1946972] INFO -- : [ 57/883] 1987940=test_ansi_with_terminfo I, [2024-05-25T11:04:05.085295 #1946972] INFO -- : [ 58/883] 1987940=test_inadvertent_creation I, [2024-05-25T11:04:05.139342 #1946972] INFO -- : [ 59/883] 1987939=test_weakmap I, [2024-05-25T11:04:05.179159 #1946972] INFO -- : [ 60/883] 1987940=test_coderange I, [2024-05-25T11:04:05.183966 #1946972] INFO -- : [ 61/883] 1987940=test_nil2vtempty I, [2024-05-25T11:04:05.187789 #1946972] INFO -- : [ 62/883] 1987940=test_date_time I, [2024-05-25T11:04:05.199600 #1946972] INFO -- : [ 63/883] 1987941=test_rdoc_generator_json_index I, [2024-05-25T11:04:05.212710 #1946972] INFO -- : [ 64/883] 1987940=test_rdoc_context I, [2024-05-25T11:04:05.408690 #1946972] INFO -- : [ 65/883] 1987941=test_gem_command_manager I, [2024-05-25T11:04:05.616723 #1946972] INFO -- : [ 66/883] 1987941=test_array I, [2024-05-25T11:04:05.625427 #1946972] INFO -- : [ 67/883] 1987941=test_open-uri I, [2024-05-25T11:04:05.926293 #1946972] INFO -- : [ 68/883] 1987941=test_case I, [2024-05-25T11:04:05.945635 #1946972] INFO -- : [ 69/883] 1987941=test_enumerator I, [2024-05-25T11:04:06.186367 #1946972] INFO -- : [ 70/883] 1987940=test_enc_associate I, [2024-05-25T11:04:06.625811 #1946972] INFO -- : [ 71/883] 1987940=test_sprintf I, [2024-05-25T11:04:06.838837 #1946972] INFO -- : [ 72/883] 1987940=test_gem_commands_sources_command I, [2024-05-25T11:04:07.040996 #1946972] INFO -- : [ 73/883] 1987940=test_name_error I, [2024-05-25T11:04:07.135136 #1946972] INFO -- : [ 74/883] 1987940=json_addition_test I, [2024-05-25T11:04:07.149176 #1946972] INFO -- : [ 75/883] 1987940=test_gem_source_list I, [2024-05-25T11:04:07.203669 #1946972] INFO -- : [ 76/883] 1987940=test_recorder I, [2024-05-25T11:04:07.215393 #1946972] INFO -- : [ 77/883] 1987940=test_yaml_special_cases I, [2024-05-25T11:04:07.292610 #1946972] INFO -- : [ 78/883] 1987940=test_exit I, [2024-05-25T11:04:07.426940 #1946972] INFO -- : [ 79/883] 1987940=test_class I, [2024-05-25T11:04:09.122132 #1946972] INFO -- : [ 80/883] 1987939=index_write_test I, [2024-05-25T11:04:09.147034 #1946972] INFO -- : [ 81/883] 1987939=test_rdoc_parser_rd I, [2024-05-25T11:04:09.174599 #1946972] INFO -- : [ 82/883] 1987939=test_const I, [2024-05-25T11:04:09.183537 #1946972] INFO -- : [ 83/883] 1987939=test_math I, [2024-05-25T11:04:09.199907 #1946972] INFO -- : [ 84/883] 1987939=comments_test I, [2024-05-25T11:04:09.204260 #1946972] INFO -- : [ 85/883] 1987939=test_qsort I, [2024-05-25T11:04:09.207535 #1946972] INFO -- : [ 86/883] 1987939=test_gc I, [2024-05-25T11:04:09.216056 #1946972] INFO -- : [ 87/883] 1987939=test_iso_8859 I, [2024-05-25T11:04:09.274655 #1946972] INFO -- : [ 88/883] 1987939=ripper_test I, [2024-05-25T11:04:09.896054 #1946972] INFO -- : [ 89/883] 1987939=test_libs I, [2024-05-25T11:04:09.906866 #1946972] INFO -- : [ 90/883] 1987939=test_safe_load I, [2024-05-25T11:04:09.912930 #1946972] INFO -- : [ 91/883] 1987939=test_pkey_rsa I, [2024-05-25T11:04:10.094711 #1946972] INFO -- : [ 92/883] 1987940=test_flush I, [2024-05-25T11:04:10.096283 #1946972] INFO -- : [ 93/883] 1987940=test_system I, [2024-05-25T11:04:10.204935 #1946972] INFO -- : [ 94/883] 1987939=test_numhash I, [2024-05-25T11:04:10.262924 #1946972] INFO -- : [ 95/883] 1987939=test_gem_specification I, [2024-05-25T11:04:11.024718 #1946972] INFO -- : [ 96/883] 1987940=test_method_cache I, [2024-05-25T11:04:11.027411 #1946972] INFO -- : [ 97/883] 1987940=test_rdoc_class_module I, [2024-05-25T11:04:11.605877 #1946972] INFO -- : [ 98/883] 1987940=test_rdoc_cross_reference I, [2024-05-25T11:04:12.047097 #1946972] INFO -- : [ 99/883] 1987940=test_parse I, [2024-05-25T11:04:12.495870 #1946972] INFO -- : [100/883] 1987940=test_win32ole_variable I, [2024-05-25T11:04:12.499026 #1946972] INFO -- : [101/883] 1987940=test_stack I, [2024-05-25T11:04:12.676702 #1946972] INFO -- : [102/883] 1987939=test_windows_1252 I, [2024-05-25T11:04:12.685588 #1946972] INFO -- : [103/883] 1987939=test_emoji I, [2024-05-25T11:04:12.780197 #1946972] INFO -- : [104/883] 1987939=test_sorted_set I, [2024-05-25T11:04:12.926241 #1946972] INFO -- : [105/883] 1987939=test_gem_resolver_vendor_set I, [2024-05-25T11:04:12.945568 #1946972] INFO -- : [106/883] 1987939=test_condition I, [2024-05-25T11:04:12.954258 #1946972] INFO -- : [107/883] 1987939=test_jaro_winkler I, [2024-05-25T11:04:12.958340 #1946972] INFO -- : [108/883] 1987939=test_cp949 I, [2024-05-25T11:04:12.979214 #1946972] INFO -- : [109/883] 1987939=test_fileutils I, [2024-05-25T11:04:13.373844 #1946972] INFO -- : [110/883] 1987940=test_mixed_unicode_escapes I, [2024-05-25T11:04:13.386332 #1946972] INFO -- : [111/883] 1987940=test_sleep I, [2024-05-25T11:04:13.507434 #1946972] INFO -- : .Leaked file descriptor: TestFileUtils#test_chown_error: 11 # I, [2024-05-25T11:04:13.532931 #1946972] INFO -- : COMMAND PID USER FD TYPE DEVICE SIZE/OFF NODE NAME I, [2024-05-25T11:04:13.533000 #1946972] INFO -- : ruby 1987939 opc 11r REG 252,0 9253600 13705411 /var/lib/sss/mc/passwd I, [2024-05-25T11:04:13.674602 #1946972] INFO -- : [112/883] 1987939=test_gem_dependency_resolution_error I, [2024-05-25T11:04:13.688851 #1946972] INFO -- : [113/883] 1987939=test_econv I, [2024-05-25T11:04:14.542705 #1946972] INFO -- : [114/883] 1987939=test_gem_install_update_options I, [2024-05-25T11:04:14.675552 #1946972] INFO -- : [115/883] 1987939=test_gem_request_set_lockfile_parser I, [2024-05-25T11:04:15.426917 #1946972] INFO -- : [116/883] 1987939=test_sizeof I, [2024-05-25T11:04:15.431739 #1946972] INFO -- : [117/883] 1987940=test_date_attr I, [2024-05-25T11:04:15.438368 #1946972] INFO -- : [118/883] 1987940=test_face I, [2024-05-25T11:04:15.539013 #1946972] INFO -- : [119/883] 1987940=warnings_test I, [2024-05-25T11:04:15.638795 #1946972] INFO -- : [120/883] 1987940=test_stringchar I, [2024-05-25T11:04:15.649605 #1946972] INFO -- : [121/883] 1987940=test_hash I, [2024-05-25T11:04:15.740986 #1946972] INFO -- : [122/883] 1987940=test_variable I, [2024-05-25T11:04:15.762848 #1946972] INFO -- : [123/883] 1987940=test_optarg I, [2024-05-25T11:04:15.925844 #1946972] INFO -- : [124/883] 1987940=test_gem_commands_pristine_command I, [2024-05-25T11:04:17.320748 #1946972] INFO -- : [125/883] 1987939=test_rdoc_tom_doc I, [2024-05-25T11:04:17.345389 #1946972] INFO -- : [126/883] 1987939=test_gem_resolver_git_specification I, [2024-05-25T11:04:17.369648 #1946972] INFO -- : [127/883] 1987940=test_utf32 I, [2024-05-25T11:04:17.390523 #1946972] INFO -- : [128/883] 1987940=test_basicinstructions I, [2024-05-25T11:04:17.663099 #1946972] INFO -- : [129/883] 1987940=test_date_ractor I, [2024-05-25T11:04:17.669994 #1946972] INFO -- : [130/883] 1987940=test_erb I, [2024-05-25T11:04:17.721741 #1946972] INFO -- : [131/883] 1987940=test_gem_security I, [2024-05-25T11:04:17.732626 #1946972] INFO -- : [132/883] 1987939=test_key_actor_emacs I, [2024-05-25T11:04:17.916189 #1946972] INFO -- : [133/883] 1987939=test_pp I, [2024-05-25T11:04:17.954915 #1946972] INFO -- : [134/883] 1987939=test_gem_impossible_dependencies_error I, [2024-05-25T11:04:17.963227 #1946972] INFO -- : [135/883] 1987939=test_noarg I, [2024-05-25T11:04:18.091486 #1946972] INFO -- : [136/883] 1987939=test_exception I, [2024-05-25T11:04:18.229951 #1946972] INFO -- : [137/883] 1987939=test_raise_exception I, [2024-05-25T11:04:18.771834 #1946972] INFO -- : [138/883] 1987939=test_arith_seq_beg_len_step I, [2024-05-25T11:04:18.779519 #1946972] INFO -- : [139/883] 1987939=test_gem_resolver_requirement_list I, [2024-05-25T11:04:18.790032 #1946972] INFO -- : [140/883] 1987939=test_gem_command I, [2024-05-25T11:04:18.933134 #1946972] INFO -- : [141/883] 1987939=test_asn1 I, [2024-05-25T11:04:18.948345 #1946972] INFO -- : [142/883] 1987939=test_gem_resolver_lock_set I, [2024-05-25T11:04:18.967347 #1946972] INFO -- : [143/883] 1987939=test_random I, [2024-05-25T11:04:18.984459 #1946972] INFO -- : [144/883] 1987939=test_rdoc_generator_darkfish I, [2024-05-25T11:04:19.225075 #1946972] INFO -- : [145/883] 1987941=test_undef I, [2024-05-25T11:04:19.229433 #1946972] INFO -- : [146/883] 1987941=test_emoji_breaks I, [2024-05-25T11:04:19.231378 #1946972] INFO -- : [147/883] 1987941=test_normalize I, [2024-05-25T11:04:19.237551 #1946972] INFO -- : [148/883] 1987941=test_verbose I, [2024-05-25T11:04:19.265157 #1946972] INFO -- : [149/883] 1987941=test_gem_commands_open_command I, [2024-05-25T11:04:19.331394 #1946972] INFO -- : [150/883] 1987939=test_gem_update_suggestion I, [2024-05-25T11:04:19.372830 #1946972] INFO -- : [151/883] 1987941=test_assignment I, [2024-05-25T11:04:19.417833 #1946972] INFO -- : [152/883] 1987939=test_forwardable I, [2024-05-25T11:04:19.443643 #1946972] INFO -- : [153/883] 1987939=test_process I, [2024-05-25T11:04:19.462466 #1946972] INFO -- : [154/883] 1987939=test_fd_setsize I, [2024-05-25T11:04:19.463776 #1946972] INFO -- : [155/883] 1987939=!Nothing_to_test I, [2024-05-25T11:04:19.492546 #1946972] INFO -- : [156/883] 1987939=test_dir_m17n I, [2024-05-25T11:04:20.592469 #1946972] INFO -- : [157/883] 1987941=test_memory_view I, [2024-05-25T11:04:20.660961 #1946972] INFO -- : [158/883] 1987939=test_array_create I, [2024-05-25T11:04:20.664791 #1946972] INFO -- : [159/883] 1987939=test_threadgroup I, [2024-05-25T11:04:20.782661 #1946972] INFO -- : [160/883] 1987941=test_complex I, [2024-05-25T11:04:20.851368 #1946972] INFO -- : [161/883] 1987941=test_err_in_callback I, [2024-05-25T11:04:20.861189 #1946972] INFO -- : [162/883] 1987941=test_method_name_check I, [2024-05-25T11:04:20.905279 #1946972] INFO -- : [163/883] 1987941=test_storage I, [2024-05-25T11:04:20.912647 #1946972] INFO -- : [164/883] 1987941=test_merge_keys I, [2024-05-25T11:04:20.919267 #1946972] INFO -- : [165/883] 1987941=test_did_you_mean I, [2024-05-25T11:04:21.021134 #1946972] INFO -- : [166/883] 1987941=test_shapes I, [2024-05-25T11:04:21.026676 #1946972] INFO -- : [167/883] 1987941=test_cesu8 I, [2024-05-25T11:04:21.044989 #1946972] INFO -- : [168/883] 1987941=test_rdoc_extend I, [2024-05-25T11:04:21.095179 #1946972] INFO -- : [169/883] 1987941=test_rendering I, [2024-05-25T11:04:21.140297 #1946972] INFO -- : [170/883] 1987941=test_kernel I, [2024-05-25T11:04:21.665368 #1946972] INFO -- : [171/883] 1987941=test_dot_dot I, [2024-05-25T11:04:21.671296 #1946972] INFO -- : [172/883] 1987941=test_gem_rdoc I, [2024-05-25T11:04:21.680658 #1946972] INFO -- : [173/883] 1987939=pattern_test I, [2024-05-25T11:04:21.708826 #1946972] INFO -- : [174/883] 1987939=test_iterator I, [2024-05-25T11:04:21.807158 #1946972] INFO -- : [175/883] 1987941=test_string I, [2024-05-25T11:04:21.819348 #1946972] INFO -- : [176/883] 1987941=test_gem_commands_install_command I, [2024-05-25T11:04:21.824387 #1946972] INFO -- : [177/883] 1987939=test_gbk I, [2024-05-25T11:04:21.830362 #1946972] INFO -- : [178/883] 1987939=test_backtrace I, [2024-05-25T11:04:21.836347 #1946972] INFO -- : [179/883] 1987939=test_gem_commands_dependency_command I, [2024-05-25T11:04:21.946391 #1946972] INFO -- : [180/883] 1987939=test_gem_spec_fetcher I, [2024-05-25T11:04:22.139590 #1946972] INFO -- : [181/883] 1987939=test_yamldbm I, [2024-05-25T11:04:22.139786 #1946972] INFO -- : [182/883] 1987939=test_default_gems I, [2024-05-25T11:04:22.203935 #1946972] INFO -- : [183/883] 1987939=test_switch_hitter I, [2024-05-25T11:04:22.226538 #1946972] INFO -- : [184/883] 1987939=test_unicode_escape I, [2024-05-25T11:04:22.301077 #1946972] INFO -- : [185/883] 1987939=test_hash_create I, [2024-05-25T11:04:22.306754 #1946972] INFO -- : [186/883] 1987939=test_grapheme_breaks I, [2024-05-25T11:04:22.352819 #1946972] INFO -- : [187/883] 1987939=test_set I, [2024-05-25T11:04:22.377973 #1946972] INFO -- : [188/883] 1987939=test_enumerable I, [2024-05-25T11:04:22.397343 #1946972] INFO -- : [189/883] 1987939=test_rdoc_method_attr I, [2024-05-25T11:04:22.500688 #1946972] INFO -- : [190/883] 1987939=test_tree_spell_checker I, [2024-05-25T11:04:22.576320 #1946972] INFO -- : [191/883] 1987939=static_literals_test I, [2024-05-25T11:04:22.595961 #1946972] INFO -- : [192/883] 1987939=test_rdoc_rubygems_hook I, [2024-05-25T11:04:22.688620 #1946972] INFO -- : [193/883] 1987939=test_gem_resolver_api_specification I, [2024-05-25T11:04:22.734438 #1946972] INFO -- : [194/883] 1987939=test_ractor I, [2024-05-25T11:04:22.761300 #1946972] INFO -- : [195/883] 1987939=test_webauthn_listener I, [2024-05-25T11:04:22.795023 #1946972] INFO -- : Leaked file descriptor: WebauthnListenerTest#test_wait_for_otp_code_options_request: 14 : # I, [2024-05-25T11:04:22.826951 #1946972] INFO -- : COMMAND PID USER FD TYPE DEVICE SIZE/OFF NODE NAME I, [2024-05-25T11:04:22.827015 #1946972] INFO -- : ruby 1987939 opc 14u IPv4 3136057131 0t0 TCP localhost:45817->localhost:52394 (CLOSE_WAIT) I, [2024-05-25T11:04:22.920695 #1946972] INFO -- : [196/883] 1987939=test_gem_ext_cargo_builder_unit I, [2024-05-25T11:04:22.950730 #1946972] INFO -- : [197/883] 1987939=test_rational I, [2024-05-25T11:04:22.978671 #1946972] INFO -- : [198/883] 1987939=test_case_mapping I, [2024-05-25T11:04:22.986092 #1946972] INFO -- : Closed file descriptor: TestCaseMappingPreliminary#test_shift_jis_downcase_ascii: 14 I, [2024-05-25T11:04:22.996143 #1946972] INFO -- : [199/883] 1987939=test_thread I, [2024-05-25T11:04:23.006553 #1946972] INFO -- : [200/883] 1987939=test_arity I, [2024-05-25T11:04:23.011454 #1946972] INFO -- : [201/883] 1987939=test_buffering I, [2024-05-25T11:04:23.027459 #1946972] INFO -- : [202/883] 1987939=test_pkey_ec I, [2024-05-25T11:04:23.055711 #1946972] INFO -- : [203/883] 1987939=test_svcb_https I, [2024-05-25T11:04:23.062847 #1946972] INFO -- : [204/883] 1987939=test_key_event_record I, [2024-05-25T11:04:23.085866 #1946972] INFO -- : [205/883] 1987939=test_open3 I, [2024-05-25T11:04:23.735296 #1946972] INFO -- : [206/883] 1987941=test_mdns I, [2024-05-25T11:04:23.742577 #1946972] INFO -- : [207/883] 1987941=test_date_parse I, [2024-05-25T11:04:23.915400 #1946972] INFO -- : [208/883] 1987941=test_rdoc_store I, [2024-05-25T11:04:24.553531 #1946972] INFO -- : [209/883] 1987941=test_shift_jis I, [2024-05-25T11:04:24.623388 #1946972] INFO -- : [210/883] 1987941=test_rubyoptions I, [2024-05-25T11:04:25.778632 #1946972] INFO -- : [211/883] 1987939=test_files_sample I, [2024-05-25T11:04:25.792694 #1946972] INFO -- : [212/883] 1987939=test_rdoc_stats I, [2024-05-25T11:04:25.923498 #1946972] INFO -- : [213/883] 1987939=test_data_error I, [2024-05-25T11:04:25.972929 #1946972] INFO -- : [214/883] 1987939=test_force_exit I, [2024-05-25T11:04:25.991854 #1946972] INFO -- : [215/883] 1987939=test_optimization I, [2024-05-25T11:04:27.105187 #1946972] INFO -- : [216/883] 1987940=regexp_test I, [2024-05-25T11:04:27.174131 #1946972] INFO -- : [217/883] 1987940=test_show_source I, [2024-05-25T11:04:27.184771 #1946972] INFO -- : [218/883] 1987940=test_remote_fetch_error I, [2024-05-25T11:04:27.205972 #1946972] INFO -- : [219/883] 1987940=test_yield I, [2024-05-25T11:04:30.202053 #1946972] INFO -- : [220/883] 1987940=test_dryrun I, [2024-05-25T11:04:30.240780 #1946972] INFO -- : [221/883] 1987940=test_rdoc_i18n_locale I, [2024-05-25T11:04:30.339050 #1946972] INFO -- : [222/883] 1987940=test_gc_compact I, [2024-05-25T11:04:31.138675 #1946972] INFO -- : [223/883] 1987941=test_queue I, [2024-05-25T11:04:31.147838 #1946972] INFO -- : [224/883] 1987941=test_boolean I, [2024-05-25T11:04:31.157122 #1946972] INFO -- : [225/883] 1987941=test_gem_resolver_lock_specification I, [2024-05-25T11:04:31.236942 #1946972] INFO -- : [226/883] 1987941=test_clone I, [2024-05-25T11:04:31.372100 #1946972] INFO -- : [227/883] 1987941=test_enc_raise I, [2024-05-25T11:04:31.380290 #1946972] INFO -- : [228/883] 1987941=test_prettyprint I, [2024-05-25T11:04:31.404371 #1946972] INFO -- : [229/883] 1987941=test_gem_uri_formatter I, [2024-05-25T11:04:31.433267 #1946972] INFO -- : [230/883] 1987941=test_cgi_util I, [2024-05-25T11:04:31.664376 #1946972] INFO -- : [231/883] 1987941=test_ole_methods I, [2024-05-25T11:04:31.679238 #1946972] INFO -- : [232/883] 1987941=test_gem_commands_cert_command I, [2024-05-25T11:04:32.575860 #1946972] INFO -- : [233/883] 1987939=ruby_parser_test I, [2024-05-25T11:04:32.580743 #1946972] INFO -- : [234/883] 1987939=test_gem_commands_stale_command I, [2024-05-25T11:04:32.596369 #1946972] INFO -- : [235/883] 1987939=test_ws I, [2024-05-25T11:04:32.603249 #1946972] INFO -- : [236/883] 1987939=test_date_strftime I, [2024-05-25T11:04:33.016774 #1946972] INFO -- : [237/883] 1987940=json_parser_test I, [2024-05-25T11:04:33.048128 #1946972] INFO -- : [238/883] 1987940=test_rdoc_markup_to_tt_only I, [2024-05-25T11:04:33.073898 #1946972] INFO -- : [239/883] 1987940=test_rdoc_markup_to_bs I, [2024-05-25T11:04:33.084646 #1946972] INFO -- : [240/883] 1987939=test_key_name_check I, [2024-05-25T11:04:33.085062 #1946972] INFO -- : [241/883] 1987939=test_rdoc_markup_raw I, [2024-05-25T11:04:33.093648 #1946972] INFO -- : [242/883] 1987939=test_timeout I, [2024-05-25T11:04:33.125492 #1946972] INFO -- : [243/883] 1987940=test_rdoc_alias I, [2024-05-25T11:04:33.149013 #1946972] INFO -- : [244/883] 1987940=test_weakref I, [2024-05-25T11:04:33.204990 #1946972] INFO -- : [245/883] 1987941=test_instrumentation_api I, [2024-05-25T11:04:33.371943 #1946972] INFO -- : [246/883] 1987940=test_numeric I, [2024-05-25T11:04:33.406831 #1946972] INFO -- : [247/883] 1987940=test_fstring I, [2024-05-25T11:04:33.480770 #1946972] INFO -- : [248/883] 1987940=test_singleton I, [2024-05-25T11:04:33.486241 #1946972] INFO -- : [249/883] 1987940=test_word I, [2024-05-25T11:04:33.607733 #1946972] INFO -- : [250/883] 1987940=test_gem_ext_rake_builder I, [2024-05-25T11:04:33.940699 #1946972] INFO -- : [251/883] 1987939=test_rdoc_require I, [2024-05-25T11:04:33.948471 #1946972] INFO -- : [252/883] 1987939=test_bash_completion I, [2024-05-25T11:04:33.968650 #1946972] INFO -- : [253/883] 1987939=test_exception I, [2024-05-25T11:04:34.121029 #1946972] INFO -- : [254/883] 1987940=test_rdoc_markup_to_html_crossref I, [2024-05-25T11:04:34.393622 #1946972] INFO -- : [255/883] 1987940=test_div I, [2024-05-25T11:04:34.431532 #1946972] INFO -- : [256/883] 1987940=test_files_test_2 I, [2024-05-25T11:04:36.157755 #1946972] INFO -- : [257/883] 1987941=test_deprecated I, [2024-05-25T11:04:36.168234 #1946972] INFO -- : [258/883] 1987941=test_rdoc_context_section I, [2024-05-25T11:04:36.178789 #1946972] INFO -- : [259/883] 1987941=test_io_buffer I, [2024-05-25T11:04:36.281504 #1946972] INFO -- : [260/883] 1987941=test_optparse I, [2024-05-25T11:04:36.302459 #1946972] INFO -- : [261/883] 1987941=test_pkcs7 I, [2024-05-25T11:04:36.471632 #1946972] INFO -- : [262/883] 1987941=test_gem_commands_environment_command I, [2024-05-25T11:04:36.517377 #1946972] INFO -- : [263/883] 1987941=test_pack I, [2024-05-25T11:04:36.761139 #1946972] INFO -- : [264/883] 1987941=test_class_name_check I, [2024-05-25T11:04:36.796571 #1946972] INFO -- : [265/883] 1987941=test_syntax I, [2024-05-25T11:04:36.971301 #1946972] INFO -- : [266/883] 1987939=test_scalar I, [2024-05-25T11:04:36.976703 #1946972] INFO -- : [267/883] 1987939=test_zsh_completion I, [2024-05-25T11:04:36.982521 #1946972] INFO -- : [268/883] 1987939=test_basicsocket I, [2024-05-25T11:04:37.002497 #1946972] INFO -- : [269/883] 1987939=test_thread I, [2024-05-25T11:04:37.224258 #1946972] INFO -- : [270/883] 1987939=test_gem_util I, [2024-05-25T11:04:37.381823 #1946972] INFO -- : [271/883] 1987939=test_gem_security_signer I, [2024-05-25T11:04:37.388684 #1946972] INFO -- : [272/883] 1987940=test_config I, [2024-05-25T11:04:37.470374 #1946972] INFO -- : [273/883] 1987940=test_complex2 I, [2024-05-25T11:04:37.481988 #1946972] INFO -- : [274/883] 1987939=test_literal I, [2024-05-25T11:04:37.482316 #1946972] INFO -- : [275/883] 1987940=test_gem_unsatisfiable_dependency_error I, [2024-05-25T11:04:37.570073 #1946972] INFO -- : [276/883] 1987940=test_io I, [2024-05-25T11:04:37.736174 #1946972] INFO -- : [277/883] 1987940=test_rdoc_i18n_text I, [2024-05-25T11:04:37.764606 #1946972] INFO -- : [278/883] 1987940=test_input_method I, [2024-05-25T11:04:37.812421 #1946972] INFO -- : [279/883] 1987940=test_pkey_dh I, [2024-05-25T11:04:38.009474 #1946972] INFO -- : [280/883] 1987939=test_multi_irb_commands I, [2024-05-25T11:04:38.048427 #1946972] INFO -- : [281/883] 1987939=test_m17n_comb I, [2024-05-25T11:04:39.160384 #1946972] INFO -- : [282/883] 1987940=test_null I, [2024-05-25T11:04:39.178250 #1946972] INFO -- : [283/883] 1987940=test_ractor I, [2024-05-25T11:04:39.229006 #1946972] INFO -- : [284/883] 1987940=test_memory_view I, [2024-05-25T11:04:39.248251 #1946972] INFO -- : [285/883] 1987940=test_data I, [2024-05-25T11:04:39.252639 #1946972] INFO -- : [286/883] 1987940=test_bigzero I, [2024-05-25T11:04:39.272449 #1946972] INFO -- : [287/883] 1987940=test_gem_commands_query_command I, [2024-05-25T11:04:39.923589 #1946972] INFO -- : [288/883] 1987940=test_gem_platform I, [2024-05-25T11:04:40.033822 #1946972] INFO -- : [289/883] 1987940=test_win32ole_typelib I, [2024-05-25T11:04:40.043661 #1946972] INFO -- : [290/883] 1987940=test_external_new I, [2024-05-25T11:04:40.051765 #1946972] INFO -- : [291/883] 1987940=test_pkey I, [2024-05-25T11:04:40.063233 #1946972] INFO -- : [292/883] 1987940=test_rdoc_markup_attributes I, [2024-05-25T11:04:40.067888 #1946972] INFO -- : [293/883] 1987940=redundant_return_test I, [2024-05-25T11:04:40.079615 #1946972] INFO -- : [294/883] 1987940=test_random_formatter I, [2024-05-25T11:04:40.099700 #1946972] INFO -- : [295/883] 1987940=test_string_processing I, [2024-05-25T11:04:40.130241 #1946972] INFO -- : [296/883] 1987940=test_rand I, [2024-05-25T11:04:40.438380 #1946972] INFO -- : [297/883] 1987940=test_bmethod I, [2024-05-25T11:04:40.440467 #1946972] INFO -- : [298/883] 1987940=test_provider I, [2024-05-25T11:04:40.445716 #1946972] INFO -- : [299/883] 1987940=test_euc_kr I, [2024-05-25T11:04:40.460646 #1946972] INFO -- : [300/883] 1987940=test_gem_source_specific_file I, [2024-05-25T11:04:40.565400 #1946972] INFO -- : [301/883] 1987940=test_rdoc_code_object I, [2024-05-25T11:04:40.912972 #1946972] INFO -- : [302/883] 1987939=test_process I, [2024-05-25T11:04:40.947961 #1946972] INFO -- : [303/883] 1987940=test_io_wait I, [2024-05-25T11:04:41.294014 #1946972] INFO -- : [304/883] 1987940=test_pack I, [2024-05-25T11:04:41.523403 #1946972] INFO -- : [305/883] 1987940=test_kwargs I, [2024-05-25T11:04:41.540611 #1946972] INFO -- : [306/883] 1987940=test_rdoc_parser_c I, [2024-05-25T11:04:41.836552 #1946972] INFO -- : [307/883] 1987940=parse_test I, [2024-05-25T11:04:43.436806 #1946972] INFO -- : [308/883] 1987941=json_fixtures_test I, [2024-05-25T11:04:43.450778 #1946972] INFO -- : [309/883] 1987941=test_gem_doctor I, [2024-05-25T11:04:43.503802 #1946972] INFO -- : [310/883] 1987941=test_len I, [2024-05-25T11:04:43.504814 #1946972] INFO -- : [311/883] 1987941=test_gem_dependency_list I, [2024-05-25T11:04:43.588707 #1946972] INFO -- : [312/883] 1987941=test_gem_commands_outdated_command I, [2024-05-25T11:04:43.644800 #1946972] INFO -- : [313/883] 1987941=parameters_signature_test I, [2024-05-25T11:04:43.652771 #1946972] INFO -- : [314/883] 1987941=test_rdoc_parser_changelog I, [2024-05-25T11:04:43.726524 #1946972] INFO -- : [315/883] 1987941=test_gem_commands_fetch_command I, [2024-05-25T11:04:43.917900 #1946972] INFO -- : [316/883] 1987941=test_typeddata I, [2024-05-25T11:04:44.170251 #1946972] INFO -- : [317/883] 1987941=test_tsort I, [2024-05-25T11:04:44.177783 #1946972] INFO -- : [318/883] 1987941=test_securerandom I, [2024-05-25T11:04:44.205975 #1946972] INFO -- : [319/883] 1987941=test_rdoc_text I, [2024-05-25T11:04:44.283906 #1946972] INFO -- : [320/883] 1987941=library_symbols_test I, [2024-05-25T11:04:44.293971 #1946972] INFO -- : [321/883] 1987941=test_stringify_symbols I, [2024-05-25T11:04:44.298713 #1946972] INFO -- : [322/883] 1987941=test_require I, [2024-05-25T11:04:44.316892 #1946972] INFO -- : [323/883] 1987941=test_objspace I, [2024-05-25T11:04:45.139138 #1946972] INFO -- : [324/883] 1987940=test_have_library I, [2024-05-25T11:04:45.999973 #1946972] INFO -- : [325/883] 1987940=test_stream I, [2024-05-25T11:04:46.008412 #1946972] INFO -- : [326/883] 1987940=test_ns_spki I, [2024-05-25T11:04:46.026377 #1946972] INFO -- : [327/883] 1987940=test_rdoc_markup_parser I, [2024-05-25T11:04:46.724031 #1946972] INFO -- : [328/883] 1987940=test_iseq_load I, [2024-05-25T11:04:47.237629 #1946972] INFO -- : [329/883] 1987940=test_rdoc_markup_indented_paragraph I, [2024-05-25T11:04:47.284919 #1946972] INFO -- : [330/883] 1987940=test_postponed_job I, [2024-05-25T11:04:47.585753 #1946972] INFO -- : [331/883] 1987940=test_key_actor_vi I, [2024-05-25T11:04:47.693106 #1946972] INFO -- : [332/883] 1987940=test_rdoc_markdown I, [2024-05-25T11:04:47.974245 #1946972] INFO -- : [333/883] 1987940=test_gem_request_set_lockfile I, [2024-05-25T11:04:48.415969 #1946972] INFO -- : [334/883] 1987940=test_win32ole_variant_outarg I, [2024-05-25T11:04:48.428651 #1946972] INFO -- : [335/883] 1987940=test_rdoc_encoding I, [2024-05-25T11:04:48.479833 #1946972] INFO -- : [336/883] 1987940=test_generic I, [2024-05-25T11:04:48.518557 #1946972] INFO -- : [337/883] 1987940=test_common I, [2024-05-25T11:04:48.695195 #1946972] INFO -- : [338/883] 1987940=test_rdoc_markup_to_html_snippet I, [2024-05-25T11:04:48.790731 #1946972] INFO -- : [339/883] 1987940=test_httpresponses I, [2024-05-25T11:04:48.802208 #1946972] INFO -- : [340/883] 1987940=test_deprecate I, [2024-05-25T11:04:48.858833 #1946972] INFO -- : [341/883] 1987940=test_rdoc_constant I, [2024-05-25T11:04:48.955888 #1946972] INFO -- : [342/883] 1987940=test_gem_version_option I, [2024-05-25T11:04:49.015403 #1946972] INFO -- : [343/883] 1987940=test_rdoc_include I, [2024-05-25T11:04:49.043861 #1946972] INFO -- : [344/883] 1987940=test_win32ole_record I, [2024-05-25T11:04:49.050507 #1946972] INFO -- : [345/883] 1987940=test_date_compat I, [2024-05-25T11:04:49.068731 #1946972] INFO -- : [346/883] 1987940=test_pstore I, [2024-05-25T11:04:49.298081 #1946972] INFO -- : [347/883] 1987940=test_ubf_async_safe I, [2024-05-25T11:04:49.312235 #1946972] INFO -- : [348/883] 1987940=test_rdoc_options I, [2024-05-25T11:04:49.900699 #1946972] INFO -- : [349/883] 1987940=test_zlib I, [2024-05-25T11:04:57.503633 #1946972] INFO -- : [350/883] 1987940=test_console_attr I, [2024-05-25T11:04:57.524773 #1946972] INFO -- : [351/883] 1987940=test_proc I, [2024-05-25T11:04:58.495157 #1946972] INFO -- : [352/883] 1987940=test_gem_ext_cargo_builder I, [2024-05-25T11:04:58.497474 #1946972] INFO -- : [353/883] 1987940=test_gem_commands_unpack_command I, [2024-05-25T11:04:58.857699 #1946972] INFO -- : [354/883] 1987940=test_reqarg I, [2024-05-25T11:04:59.241938 #1946972] INFO -- : [355/883] 1987940=test_gem_ext_ext_conf_builder I, [2024-05-25T11:05:00.484191 #1946972] INFO -- : [356/883] 1987940=test_spell_checker I, [2024-05-25T11:05:00.498546 #1946972] INFO -- : [357/883] 1987940=test_gem_version I, [2024-05-25T11:05:00.615288 #1946972] INFO -- : [358/883] 1987940=test_frozen_error I, [2024-05-25T11:05:00.621852 #1946972] INFO -- : [359/883] 1987940=test_path_to_class I, [2024-05-25T11:05:00.627808 #1946972] INFO -- : [360/883] 1987940=test_enumerator I, [2024-05-25T11:05:00.633669 #1946972] INFO -- : [361/883] 1987940=test_yield_block I, [2024-05-25T11:05:00.639016 #1946972] INFO -- : [362/883] 1987940=test_bug-5832 I, [2024-05-25T11:05:00.685040 #1946972] INFO -- : [363/883] 1987940=test_c_struct_builder I, [2024-05-25T11:05:00.917883 #1946972] INFO -- : [364/883] 1987940=test_gem_package_tar_reader_entry I, [2024-05-25T11:05:00.932356 #1946972] INFO -- : [365/883] 1987939=test_resource I, [2024-05-25T11:05:00.948699 #1946972] INFO -- : [366/883] 1987939=test_gem_uri I, [2024-05-25T11:05:01.027504 #1946972] INFO -- : [367/883] 1987939=test_gem_commands_server_command I, [2024-05-25T11:05:01.071635 #1946972] INFO -- : [368/883] 1987939=test_function I, [2024-05-25T11:05:01.207788 #1946972] INFO -- : [369/883] 1987940=test_gem_resolver_activation_request I, [2024-05-25T11:05:01.282725 #1946972] INFO -- : [370/883] 1987940=test_string I, [2024-05-25T11:05:01.330441 #1946972] INFO -- : [371/883] 1987939=test_macro I, [2024-05-25T11:05:01.337025 #1946972] INFO -- : [372/883] 1987939=test_pipe I, [2024-05-25T11:05:01.496743 #1946972] INFO -- : [373/883] 1987939=test_gem_requirement I, [2024-05-25T11:05:01.661603 #1946972] INFO -- : [374/883] 1987939=parse_comments_test I, [2024-05-25T11:05:01.674250 #1946972] INFO -- : [375/883] 1987939=test_tcp I, [2024-05-25T11:05:01.778041 #1946972] INFO -- : [376/883] 1987939=test_win32ole_method_event I, [2024-05-25T11:05:01.887114 #1946972] INFO -- : [377/883] 1987939=test_integer I, [2024-05-25T11:05:01.900980 #1946972] INFO -- : [378/883] 1987939=test_rdoc_markup_to_table_of_contents I, [2024-05-25T11:05:01.924704 #1946972] INFO -- : [379/883] 1987939=test_gem_name_tuple I, [2024-05-25T11:05:01.953375 #1946972] INFO -- : [380/883] 1987939=test_time I, [2024-05-25T11:05:02.058052 #1946972] INFO -- : [381/883] 1987939=test_file I, [2024-05-25T11:05:02.112530 #1946972] INFO -- : [382/883] 1987939=test_nextafter I, [2024-05-25T11:05:02.171594 #1946972] INFO -- : [383/883] 1987939=test_gem_commands_owner_command I, [2024-05-25T11:05:02.854533 #1946972] INFO -- : [384/883] 1987939=test_capacity I, [2024-05-25T11:05:02.872662 #1946972] INFO -- : [385/883] 1987939=test_init I, [2024-05-25T11:05:03.180667 #1946972] INFO -- : [386/883] 1987939=test_gem_request_connection_pools I, [2024-05-25T11:05:04.224602 #1946972] INFO -- : [387/883] 1987939=test_rat I, [2024-05-25T11:05:04.241166 #1946972] INFO -- : [388/883] 1987939=test_numeric I, [2024-05-25T11:05:04.314403 #1946972] INFO -- : [389/883] 1987939=test_bug-3571 I, [2024-05-25T11:05:04.324466 #1946972] INFO -- : [390/883] 1987939=test_yamlstore I, [2024-05-25T11:05:04.526242 #1946972] INFO -- : [391/883] 1987939=test_flags I, [2024-05-25T11:05:04.911745 #1946972] INFO -- : [392/883] 1987939=test_rdoc_generator_markup I, [2024-05-25T11:05:04.922493 #1946972] INFO -- : [393/883] 1987939=test_find I, [2024-05-25T11:05:05.222524 #1946972] INFO -- : [394/883] 1987939=test_constant I, [2024-05-25T11:05:06.816350 #1946972] INFO -- : [395/883] 1987939=test_hmac I, [2024-05-25T11:05:06.823898 #1946972] INFO -- : [396/883] 1987939=test_encoding I, [2024-05-25T11:05:07.005340 #1946972] INFO -- : [397/883] 1987939=test_enumerator_kw I, [2024-05-25T11:05:07.015400 #1946972] INFO -- : [398/883] 1987939=reflection_test I, [2024-05-25T11:05:07.021588 #1946972] INFO -- : [399/883] 1987939=test_marshalable I, [2024-05-25T11:05:07.030889 #1946972] INFO -- : [400/883] 1987939=test_line_editor I, [2024-05-25T11:05:07.035661 #1946972] INFO -- : [401/883] 1987939=test_files_lib I, [2024-05-25T11:05:07.043065 #1946972] INFO -- : [402/883] 1987939=test_help I, [2024-05-25T11:05:07.106085 #1946972] INFO -- : [403/883] 1987939=test_string_memory I, [2024-05-25T11:05:07.227772 #1946972] INFO -- : [404/883] 1987939=test_complexrational I, [2024-05-25T11:05:07.229754 #1946972] INFO -- : [405/883] 1987939=test_raise I, [2024-05-25T11:05:07.235245 #1946972] INFO -- : [406/883] 1987939=version_test I, [2024-05-25T11:05:07.249561 #1946972] INFO -- : [407/883] 1987939=json_common_interface_test I, [2024-05-25T11:05:07.262122 #1946972] INFO -- : [408/883] 1987939=test_string I, [2024-05-25T11:05:07.284946 #1946972] INFO -- : [409/883] 1987939=test_function_entry I, [2024-05-25T11:05:07.300403 #1946972] INFO -- : [410/883] 1987939=test_rdoc_any_method I, [2024-05-25T11:05:07.688585 #1946972] INFO -- : [411/883] 1987939=test_error_highlight I, [2024-05-25T11:05:08.249387 #1946972] INFO -- : [412/883] 1987939=test_fnmatch I, [2024-05-25T11:05:08.306381 #1946972] INFO -- : [413/883] 1987939=test_pathname I, [2024-05-25T11:05:08.527540 #1946972] INFO -- : [414/883] 1987939=test_http_request I, [2024-05-25T11:05:08.539448 #1946972] INFO -- : [415/883] 1987939=test_tempfile I, [2024-05-25T11:05:08.784185 #1946972] INFO -- : [416/883] 1987939=test_coverage I, [2024-05-25T11:05:09.393612 #1946972] INFO -- : [417/883] 1987939=test_rdoc_markup_pre_process I, [2024-05-25T11:05:09.506423 #1946972] INFO -- : [418/883] 1987939=test_store I, [2024-05-25T11:05:09.843051 #1946972] INFO -- : [419/883] 1987939=test_tree_builder I, [2024-05-25T11:05:09.848687 #1946972] INFO -- : [420/883] 1987939=test_protect I, [2024-05-25T11:05:09.899034 #1946972] INFO -- : [421/883] 1987939=test_gem_commands_update_command I, [2024-05-25T11:05:11.490292 #1946972] INFO -- : [422/883] 1987939=test_date I, [2024-05-25T11:05:11.494700 #1946972] INFO -- : [423/883] 1987939=test_big5 I, [2024-05-25T11:05:11.506451 #1946972] INFO -- : [424/883] 1987939=test_date_conv I, [2024-05-25T11:05:11.521951 #1946972] INFO -- : [425/883] 1987939=test_webauthn_poller I, [2024-05-25T11:05:11.682623 #1946972] INFO -- : [426/883] 1987939=test_rdoc_markup_verbatim I, [2024-05-25T11:05:11.746515 #1946972] INFO -- : [427/883] 1987939=test_egrep_cpp I, [2024-05-25T11:05:11.808642 #1946972] INFO -- : [428/883] 1987939=test_gem_resolver_index_specification I, [2024-05-25T11:05:11.862775 #1946972] INFO -- : [429/883] 1987939=test_serialize_subclasses I, [2024-05-25T11:05:11.870098 #1946972] INFO -- : [430/883] 1987939=test_frozen I, [2024-05-25T11:05:11.878822 #1946972] INFO -- : [431/883] 1987939=test_rdoc_generator_pot_po_entry I, [2024-05-25T11:05:11.890882 #1946972] INFO -- : [432/883] 1987939=test_erb_m17n I, [2024-05-25T11:05:11.900727 #1946972] INFO -- : [433/883] 1987939=test_timeout I, [2024-05-25T11:05:11.903553 #1946972] INFO -- : [434/883] 1987939=test_yjit_exit_locations I, [2024-05-25T11:05:11.913741 #1946972] INFO -- : [435/883] 1987939=test_rdoc_rdoc I, [2024-05-25T11:05:11.984330 #1946972] INFO -- : [436/883] 1987939=test_io_timeout I, [2024-05-25T11:05:11.990011 #1946972] INFO -- : [437/883] 1987939=test_type_completor I, [2024-05-25T11:05:12.003937 #1946972] INFO -- : [438/883] 1987939=test_rdoc_normal_module I, [2024-05-25T11:05:12.240046 #1946972] INFO -- : [439/883] 1987939=test_rdoc_markdown_test I, [2024-05-25T11:05:12.843474 #1946972] INFO -- : [440/883] 1987941=test_gem_config_file I, [2024-05-25T11:05:13.023939 #1946972] INFO -- : [441/883] 1987941=json_string_matching_test I, [2024-05-25T11:05:13.032686 #1946972] INFO -- : [442/883] 1987941=test_comparable I, [2024-05-25T11:05:13.038680 #1946972] INFO -- : [443/883] 1987941=test_ldap I, [2024-05-25T11:05:13.046568 #1946972] INFO -- : [444/883] 1987941=test_kdf I, [2024-05-25T11:05:13.114088 #1946972] INFO -- : [445/883] 1987941=test_nowrite I, [2024-05-25T11:05:13.153865 #1946972] INFO -- : [446/883] 1987941=test_passing_block I, [2024-05-25T11:05:13.167892 #1946972] INFO -- : [447/883] 1987941=test_defined I, [2024-05-25T11:05:13.236110 #1946972] INFO -- : [448/883] 1987941=test_thread_queue I, [2024-05-25T11:05:13.331894 #1946972] INFO -- : [449/883] 1987939=test_io_buffer I, [2024-05-25T11:05:13.397257 #1946972] INFO -- : [450/883] 1987939=test_psych I, [2024-05-25T11:05:13.422378 #1946972] INFO -- : [451/883] 1987939=test_nil I, [2024-05-25T11:05:13.428665 #1946972] INFO -- : [452/883] 1987939=test_wait I, [2024-05-25T11:05:13.484239 #1946972] INFO -- : [453/883] 1987939=test_human_typo I, [2024-05-25T11:05:13.546112 #1946972] INFO -- : [454/883] 1987939=test_import I, [2024-05-25T11:05:15.996700 #1946972] INFO -- : [455/883] 1987939=test_gem_resolver_specification I, [2024-05-25T11:05:16.016830 #1946972] INFO -- : [456/883] 1987939=test_big2str I, [2024-05-25T11:05:16.026631 #1946972] INFO -- : [457/883] 1987939=test_pkey_dsa I, [2024-05-25T11:05:20.095944 #1946972] INFO -- : [458/883] 1987941=test_logger I, [2024-05-25T11:05:20.124241 #1946972] INFO -- : [459/883] 1987941=test_gem_commands_yank_command I, [2024-05-25T11:05:20.646597 #1946972] INFO -- : [460/883] 1987941=test_yaml_tree I, [2024-05-25T11:05:20.675474 #1946972] INFO -- : [461/883] 1987941=test_gem_resolver_dependency_request I, [2024-05-25T11:05:20.703155 #1946972] INFO -- : [462/883] 1987941=test_euc_tw I, [2024-05-25T11:05:20.720392 #1946972] INFO -- : [463/883] 1987941=test_command I, [2024-05-25T11:05:20.969148 #1946972] INFO -- : [464/883] 1987941=test_cstr I, [2024-05-25T11:05:21.997896 #1946972] INFO -- : [465/883] 1987939=test_insns_leaf I, [2024-05-25T11:05:22.008150 #1946972] INFO -- : [466/883] 1987939=test_ifunless I, [2024-05-25T11:05:22.030450 #1946972] INFO -- : [467/883] 1987939=test_allocation I, [2024-05-25T11:05:22.323051 #1946972] INFO -- : [468/883] 1987941=test_gem_console_ui I, [2024-05-25T11:05:22.328160 #1946972] INFO -- : [469/883] 1987941=test_x509req I, [2024-05-25T11:05:22.418249 #1946972] INFO -- : [470/883] 1987941=test_readpartial I, [2024-05-25T11:05:22.782730 #1946972] INFO -- : [471/883] 1987941=test_rdoc_parser_ruby I, [2024-05-25T11:05:23.461658 #1946972] INFO -- : [472/883] 1987941=test_httpresponse I, [2024-05-25T11:05:23.494631 #1946972] INFO -- : [473/883] 1987941=test_gem_commands_exec_command I, [2024-05-25T11:05:24.543378 #1946972] INFO -- : [474/883] 1987939=unescape_test I, [2024-05-25T11:05:24.864265 #1946972] INFO -- : [475/883] 1987941=test_color_printer I, [2024-05-25T11:05:24.872955 #1946972] INFO -- : [476/883] 1987941=test_super I, [2024-05-25T11:05:25.853276 #1946972] INFO -- : [477/883] 1987939=test_gem_source_vendor I, [2024-05-25T11:05:25.872197 #1946972] INFO -- : [478/883] 1987939=test_gem_resolver I, [2024-05-25T11:05:26.105867 #1946972] INFO -- : [479/883] 1987941=test_dln I, [2024-05-25T11:05:26.110663 #1946972] INFO -- : [480/883] 1987941=test_object I, [2024-05-25T11:05:26.187782 #1946972] INFO -- : [481/883] 1987939=test_config I, [2024-05-25T11:05:26.238960 #1946972] INFO -- : [482/883] 1987939=test_func I, [2024-05-25T11:05:26.441422 #1946972] INFO -- : [483/883] 1987941=json_encoding_test I, [2024-05-25T11:05:26.443405 #1946972] INFO -- : [484/883] 1987941=test_vm_dump I, [2024-05-25T11:05:26.467329 #1946972] INFO -- : [485/883] 1987941=test_pkg_config I, [2024-05-25T11:05:26.527116 #1946972] INFO -- : [486/883] 1987941=test_gem_available_set I, [2024-05-25T11:05:26.611275 #1946972] INFO -- : [487/883] 1987941=test_modify_expand I, [2024-05-25T11:05:27.393182 #1946972] INFO -- : [488/883] 1987941=test_convertible I, [2024-05-25T11:05:27.574927 #1946972] INFO -- : [489/883] 1987940=errors_test I, [2024-05-25T11:05:27.666789 #1946972] INFO -- : [490/883] 1987940=test_win32ole_event I, [2024-05-25T11:05:27.677111 #1946972] INFO -- : [491/883] 1987940=test_rdoc_markup_formatter I, [2024-05-25T11:05:27.715191 #1946972] INFO -- : [492/883] 1987940=test_gem_commands_uninstall_command I, [2024-05-25T11:05:28.544741 #1946972] INFO -- : [493/883] 1987940=test_compile_prism I, [2024-05-25T11:05:28.853159 #1946972] INFO -- : [494/883] 1987940=test_helper I, [2024-05-25T11:05:28.866524 #1946972] INFO -- : [495/883] 1987940=test_getopts I, [2024-05-25T11:05:28.958776 #1946972] INFO -- : [496/883] 1987940=test_fips I, [2024-05-25T11:05:29.154727 #1946972] INFO -- : [497/883] 1987940=test_alias I, [2024-05-25T11:05:29.299840 #1946972] INFO -- : [498/883] 1987940=test_emitter I, [2024-05-25T11:05:29.329334 #1946972] INFO -- : [499/883] 1987940=test_gem_ext_cmake_builder I, [2024-05-25T11:05:29.344896 #1946972] INFO -- : [500/883] 1987940=test_digest_extend I, [2024-05-25T11:05:30.294811 #1946972] INFO -- : [501/883] 1987940=test_last_thread I, [2024-05-25T11:05:30.301932 #1946972] INFO -- : [502/883] 1987941=test_thread_fd_close I, [2024-05-25T11:05:30.321079 #1946972] INFO -- : [503/883] 1987941=test_transcode I, [2024-05-25T11:05:30.417559 #1946972] INFO -- : [504/883] 1987940=test_refinement I, [2024-05-25T11:05:30.516319 #1946972] INFO -- : [505/883] 1987941=test_debug I, [2024-05-25T11:05:30.557128 #1946972] INFO -- : [506/883] 1987941=test_gem_commands_cleanup_command I, [2024-05-25T11:05:30.715822 #1946972] INFO -- : [507/883] 1987939=test_class2name I, [2024-05-25T11:05:30.730608 #1946972] INFO -- : [508/883] 1987939=test_pattern_key_name_check I, [2024-05-25T11:05:30.738959 #1946972] INFO -- : [509/883] 1987939=test_profile_frames I, [2024-05-25T11:05:30.917720 #1946972] INFO -- : [510/883] 1987939=test_rdoc_markup_heading I, [2024-05-25T11:05:30.927221 #1946972] INFO -- : [511/883] 1987939=test_flip I, [2024-05-25T11:05:30.964206 #1946972] INFO -- : [512/883] 1987939=test_io_console I, [2024-05-25T11:05:31.126468 #1946972] INFO -- : [513/883] 1987941=test_cgi_session I, [2024-05-25T11:05:31.138718 #1946972] INFO -- : [514/883] 1987941=test_notimplement I, [2024-05-25T11:05:31.156516 #1946972] INFO -- : [515/883] 1987941=test_c_union_entity I, [2024-05-25T11:05:31.264381 #1946972] INFO -- : [516/883] 1987941=test_dns I, [2024-05-25T11:05:31.732765 #1946972] INFO -- : [517/883] 1987941=test_x509crl I, [2024-05-25T11:05:31.893417 #1946972] INFO -- : [518/883] 1987941=test_config I, [2024-05-25T11:05:32.214859 #1946972] INFO -- : [519/883] 1987941=test_file I, [2024-05-25T11:05:33.615805 #1946972] INFO -- : [520/883] 1987939=test_summary I, [2024-05-25T11:05:33.673293 #1946972] INFO -- : [521/883] 1987939=test_helper_method I, [2024-05-25T11:05:33.689001 #1946972] INFO -- : [522/883] 1987939=bom_test I, [2024-05-25T11:05:33.697940 #1946972] INFO -- : [523/883] 1987939=test_x509ext I, [2024-05-25T11:05:33.705914 #1946972] INFO -- : [524/883] 1987939=test_emitter I, [2024-05-25T11:05:33.712511 #1946972] INFO -- : [525/883] 1987939=test_foreach I, [2024-05-25T11:05:33.775960 #1946972] INFO -- : [526/883] 1987939=test_rdoc_markup_to_html I, [2024-05-25T11:05:33.866705 #1946972] INFO -- : [527/883] 1987939=test_gem_resolver_installer_set I, [2024-05-25T11:05:34.043431 #1946972] INFO -- : [528/883] 1987940=test_append I, [2024-05-25T11:05:34.057506 #1946972] INFO -- : [529/883] 1987940=test_gem_path_support I, [2024-05-25T11:05:34.091432 #1946972] INFO -- : [530/883] 1987940=test_arity I, [2024-05-25T11:05:34.096246 #1946972] INFO -- : [531/883] 1987940=test_win32ole_type_event I, [2024-05-25T11:05:34.096631 #1946972] INFO -- : [532/883] 1987940=test_keyword I, [2024-05-25T11:05:34.114787 #1946972] INFO -- : [533/883] 1987939=test_trace I, [2024-05-25T11:05:34.124815 #1946972] INFO -- : [534/883] 1987939=test_scalar_scanner I, [2024-05-25T11:05:34.135242 #1946972] INFO -- : [535/883] 1987939=test_lambda I, [2024-05-25T11:05:34.201927 #1946972] INFO -- : [536/883] 1987939=test_rb_str_dup I, [2024-05-25T11:05:34.207753 #1946972] INFO -- : [537/883] 1987939=test_nofree I, [2024-05-25T11:05:34.227671 #1946972] INFO -- : [538/883] 1987939=test_regexp I, [2024-05-25T11:05:34.631783 #1946972] INFO -- : [539/883] 1987940=test_whileuntil I, [2024-05-25T11:05:34.642429 #1946972] INFO -- : [540/883] 1987940=test_within_pipe I, [2024-05-25T11:05:34.667988 #1946972] INFO -- : [541/883] 1987940=test_rdoc_normal_class I, [2024-05-25T11:05:34.805093 #1946972] INFO -- : [542/883] 1987940=test_pointer I, [2024-05-25T11:05:36.182982 #1946972] INFO -- : [543/883] 1987940=test_beginendblock I, [2024-05-25T11:05:36.492702 #1946972] INFO -- : [544/883] 1987940=test_monitor I, [2024-05-25T11:05:36.755900 #1946972] INFO -- : [545/883] 1987940=test_eval I, [2024-05-25T11:05:37.000013 #1946972] INFO -- : [546/883] 1987940=compiler_test I, [2024-05-25T11:05:37.053882 #1946972] INFO -- : [547/883] 1987940=test_arith_seq_extract I, [2024-05-25T11:05:37.164925 #1946972] INFO -- : [548/883] 1987940=test_ruby_lex I, [2024-05-25T11:05:37.274485 #1946972] INFO -- : [549/883] 1987940=test_object_references I, [2024-05-25T11:05:37.313691 #1946972] INFO -- : [550/883] 1987940=test_gem_source_subpath_problem I, [2024-05-25T11:05:37.419530 #1946972] INFO -- : [551/883] 1987940=test_gem_installer I, [2024-05-25T11:05:38.442432 #1946972] INFO -- : [552/883] 1987941=test_bug_reporter I, [2024-05-25T11:05:38.640778 #1946972] INFO -- : [553/883] 1987941=test_ossl I, [2024-05-25T11:05:42.417614 #1946972] INFO -- : [554/883] 1987940=test_buffered_io I, [2024-05-25T11:05:42.418365 #1946972] INFO -- : [555/883] 1987940=test_helper I, [2024-05-25T11:05:42.430201 #1946972] INFO -- : [556/883] 1987940=test_gem_resolver_api_set I, [2024-05-25T11:05:42.510510 #1946972] INFO -- : [557/883] 1987940=test_duplicate I, [2024-05-25T11:05:42.520897 #1946972] INFO -- : [558/883] 1987940=test_cgi_header I, [2024-05-25T11:05:42.527759 #1946972] INFO -- : [559/883] 1987940=test_case_options I, [2024-05-25T11:05:42.537396 #1946972] INFO -- : [560/883] 1987940=test_kill_ring I, [2024-05-25T11:05:42.546547 #1946972] INFO -- : [561/883] 1987940=test_mailto I, [2024-05-25T11:05:42.556636 #1946972] INFO -- : [562/883] 1987940=test_addr I, [2024-05-25T11:05:42.565794 #1946972] INFO -- : [563/883] 1987940=test_object I, [2024-05-25T11:05:42.571727 #1946972] INFO -- : [564/883] 1987940=test_member I, [2024-05-25T11:05:42.582747 #1946972] INFO -- : [565/883] 1987940=test_gem_ext_builder I, [2024-05-25T11:05:43.656997 #1946972] INFO -- : [566/883] 1987940=test_history I, [2024-05-25T11:05:46.384594 #1946972] INFO -- : [567/883] 1987940=test_to_ary_concat I, [2024-05-25T11:05:46.390505 #1946972] INFO -- : [568/883] 1987941=test_windows_1251 I, [2024-05-25T11:05:46.422374 #1946972] INFO -- : [569/883] 1987941=test_gem_commands_build_command I, [2024-05-25T11:05:46.723986 #1946972] INFO -- : [570/883] 1987941=test_ellipsize I, [2024-05-25T11:05:46.746355 #1946972] INFO -- : [571/883] 1987941=test_call I, [2024-05-25T11:05:46.919439 #1946972] INFO -- : [572/883] 1987941=test_reline I, [2024-05-25T11:05:47.180381 #1946972] INFO -- : [573/883] 1987941=test_terminfo I, [2024-05-25T11:05:47.190221 #1946972] INFO -- : [574/883] 1987941=test_socket I, [2024-05-25T11:05:47.508724 #1946972] INFO -- : [575/883] 1987940=test_inlinecache I, [2024-05-25T11:05:47.577102 #1946972] INFO -- : [576/883] 1987940=test_thread I, [2024-05-25T11:05:48.207270 #1946972] INFO -- : [577/883] 1987941=test_data I, [2024-05-25T11:05:48.274971 #1946972] INFO -- : [578/883] 1987941=test_bug-14834 I, [2024-05-25T11:05:48.285431 #1946972] INFO -- : [579/883] 1987941=test_addrinfo I, [2024-05-25T11:05:48.353580 #1946972] INFO -- : Leaked file descriptor: TestSocketAddrinfo#test_addrinfo_timeout: 10 # I, [2024-05-25T11:05:48.388357 #1946972] INFO -- : COMMAND PID USER FD TYPE DEVICE SIZE/OFF NODE NAME I, [2024-05-25T11:05:48.388393 #1946972] INFO -- : ruby 1987941 opc 10u unix 0x0000000000000000 0t0 3136071951 type=STREAM I, [2024-05-25T11:05:48.444192 #1946972] INFO -- : [580/883] 1987941=test_to_ruby I, [2024-05-25T11:05:48.457229 #1946972] INFO -- : [581/883] 1987941=test_time_tz I, [2024-05-25T11:05:48.577787 #1946972] INFO -- : [582/883] 1987941=test_sleep I, [2024-05-25T11:05:53.536566 #1946972] INFO -- : [583/883] 1987941=test_webauthn_listener_response I, [2024-05-25T11:05:53.558186 #1946972] INFO -- : [584/883] 1987941=ruby_api_test I, [2024-05-25T11:05:53.741544 #1946972] INFO -- : [585/883] 1987941=test_gem_resolver_index_set I, [2024-05-25T11:05:53.863174 #1946972] INFO -- : [586/883] 1987941=test_gc I, [2024-05-25T11:05:56.461632 #1946972] INFO -- : [587/883] 1987940=test_gem_request_set I, [2024-05-25T11:05:57.069884 #1946972] INFO -- : [588/883] 1987940=test_gem_bundler_version_finder I, [2024-05-25T11:05:57.104026 #1946972] INFO -- : [589/883] 1987940=test_folderitem2_invokeverb I, [2024-05-25T11:05:57.163615 #1946972] INFO -- : [590/883] 1987940=test_interned_str I, [2024-05-25T11:05:57.171118 #1946972] INFO -- : [591/883] 1987940=test_set_len I, [2024-05-25T11:05:57.178411 #1946972] INFO -- : [592/883] 1987940=constant_path_node_test I, [2024-05-25T11:05:57.204248 #1946972] INFO -- : [593/883] 1987940=test_pattern_matching I, [2024-05-25T11:05:57.228829 #1946972] INFO -- : [594/883] 1987940=location_test I, [2024-05-25T11:05:57.290748 #1946972] INFO -- : [595/883] 1987940=test_chilled I, [2024-05-25T11:05:57.302444 #1946972] INFO -- : [596/883] 1987940=test_delegate I, [2024-05-25T11:05:57.380805 #1946972] INFO -- : [597/883] 1987940=test_project_sanity I, [2024-05-25T11:05:57.388745 #1946972] INFO -- : [598/883] 1987940=test_symbol I, [2024-05-25T11:05:57.396988 #1946972] INFO -- : [599/883] 1987940=test_alias_and_anchor I, [2024-05-25T11:05:57.467765 #1946972] INFO -- : [600/883] 1987940=test_popen_deadlock I, [2024-05-25T11:05:58.000138 #1946972] INFO -- : [601/883] 1987940=test_time I, [2024-05-25T11:05:58.199889 #1946972] INFO -- : [602/883] 1987940=test_ensured I, [2024-05-25T11:05:58.208646 #1946972] INFO -- : [603/883] 1987940=test_rdoc_markup I, [2024-05-25T11:05:58.221866 #1946972] INFO -- : [604/883] 1987940=test_key_stroke I, [2024-05-25T11:05:58.227456 #1946972] INFO -- : [605/883] 1987940=test_euc_jp I, [2024-05-25T11:05:58.251190 #1946972] INFO -- : [606/883] 1987940=test_range I, [2024-05-25T11:05:59.080326 #1946972] INFO -- : [607/883] 1987940=test_gem_commands_signin_command I, [2024-05-25T11:05:59.220756 #1946972] INFO -- : [608/883] 1987940=test_extlibs I, [2024-05-25T11:06:00.841671 #1946972] INFO -- : [609/883] 1987940=test_iter_break I, [2024-05-25T11:06:00.848546 #1946972] INFO -- : [610/883] 1987940=test_rdoc_markup_include I, [2024-05-25T11:06:00.867813 #1946972] INFO -- : [611/883] 1987940=test_enum I, [2024-05-25T11:06:02.018278 #1946972] INFO -- : [612/883] 1987940=test_require I, [2024-05-25T11:06:02.422502 #1946972] INFO -- : [613/883] 1987939=test_recursion I, [2024-05-25T11:06:02.439824 #1946972] INFO -- : [614/883] 1987939=test_rbconfig I, [2024-05-25T11:06:02.450932 #1946972] INFO -- : [615/883] 1987939=test_num2int I, [2024-05-25T11:06:02.464699 #1946972] INFO -- : [616/883] 1987939=test_locale I, [2024-05-25T11:06:02.485321 #1946972] INFO -- : [617/883] 1987939=test_ts I, [2024-05-25T11:06:02.709483 #1946972] INFO -- : [618/883] 1987941=test_stream I, [2024-05-25T11:06:02.719867 #1946972] INFO -- : [619/883] 1987941=test_ractor I, [2024-05-25T11:06:02.767443 #1946972] INFO -- : [620/883] 1987939=test_trick I, [2024-05-25T11:06:02.779207 #1946972] INFO -- : [621/883] 1987941=test_address_resolve I, [2024-05-25T11:06:02.807735 #1946972] INFO -- : [622/883] 1987941=test_rdoc_attr I, [2024-05-25T11:06:02.821386 #1946972] INFO -- : [623/883] 1987941=test_date_new I, [2024-05-25T11:06:02.846788 #1946972] INFO -- : [624/883] 1987941=test_gem_commands_list_command I, [2024-05-25T11:06:02.862731 #1946972] INFO -- : [625/883] 1987941=test_gem_resolver_local_specification I, [2024-05-25T11:06:02.890304 #1946972] INFO -- : [626/883] 1987941=test_configuration I, [2024-05-25T11:06:02.985030 #1946972] INFO -- : [627/883] 1987941=test_have_func I, [2024-05-25T11:06:03.287692 #1946972] INFO -- : [628/883] 1987940=test_date_marshal I, [2024-05-25T11:06:03.299736 #1946972] INFO -- : [629/883] 1987940=test_integer I, [2024-05-25T11:06:04.173903 #1946972] INFO -- : [630/883] 1987941=test_unix I, [2024-05-25T11:06:04.226632 #1946972] INFO -- : [631/883] 1987941=test_symbol I, [2024-05-25T11:06:05.319359 #1946972] INFO -- : [632/883] 1987939=test_gem_commands_search_command I, [2024-05-25T11:06:05.331567 #1946972] INFO -- : [633/883] 1987939=test_rdoc_servlet I, [2024-05-25T11:06:05.423056 #1946972] INFO -- : [634/883] 1987939=test_coder I, [2024-05-25T11:06:05.442618 #1946972] INFO -- : [635/883] 1987939=test_gem_commands_contents_command I, [2024-05-25T11:06:05.564299 #1946972] INFO -- : [636/883] 1987939=test_context I, [2024-05-25T11:06:05.653854 #1946972] INFO -- : [637/883] 1987939=test_udp I, [2024-05-25T11:06:05.671879 #1946972] INFO -- : [638/883] 1987939=test_formatter I, [2024-05-25T11:06:05.680878 #1946972] INFO -- : [639/883] 1987939=test_rdoc_markup_hard_break I, [2024-05-25T11:06:05.692291 #1946972] INFO -- : [640/883] 1987939=test_nesting_parser I, [2024-05-25T11:06:05.709068 #1946972] INFO -- : [641/883] 1987939=test_ancdata I, [2024-05-25T11:06:05.768672 #1946972] INFO -- : [642/883] 1987939=ractor_test I, [2024-05-25T11:06:05.793324 #1946972] INFO -- : [643/883] 1987939=test_marshal I, [2024-05-25T11:06:05.842319 #1946972] INFO -- : [644/883] 1987940=test_enc_str_buf_cat I, [2024-05-25T11:06:05.857954 #1946972] INFO -- : [645/883] 1987940=test_bignum I, [2024-05-25T11:06:07.157689 #1946972] INFO -- : [646/883] 1987939=newline_test I, [2024-05-25T11:06:07.268137 #1946972] INFO -- : [647/883] 1987939=test_ssl I, [2024-05-25T11:06:07.363347 #1946972] INFO -- : [648/883] 1987939=test_gem_commands_help_command I, [2024-05-25T11:06:07.444401 #1946972] INFO -- : [649/883] 1987939=test_scheduler I, [2024-05-25T11:06:07.608590 #1946972] INFO -- : [650/883] 1987939=test_gem_resolver_conflict I, [2024-05-25T11:06:07.713430 #1946972] INFO -- : [651/883] 1987939=test_ractor I, [2024-05-25T11:06:07.985347 #1946972] INFO -- : [652/883] 1987939=test_ansi_without_terminfo I, [2024-05-25T11:06:08.004762 #1946972] INFO -- : [653/883] 1987939=json_generator_test I, [2024-05-25T11:06:08.122523 #1946972] INFO -- : [654/883] 1987939=test_ractor I, [2024-05-25T11:06:08.125086 #1946972] INFO -- : [655/883] 1987939=test_registry I, [2024-05-25T11:06:08.143982 #1946972] INFO -- : [656/883] 1987939=test_gem I, [2024-05-25T11:06:09.421873 #1946972] INFO -- : [657/883] 1987941=test_gem_resolver_best_set I, [2024-05-25T11:06:09.468204 #1946972] INFO -- : [658/883] 1987940=test_cgi_core I, [2024-05-25T11:06:09.482811 #1946972] INFO -- : [659/883] 1987940=test_parser I, [2024-05-25T11:06:09.484684 #1946972] INFO -- : [660/883] 1987941=test_rdoc_markup_to_label I, [2024-05-25T11:06:09.496583 #1946972] INFO -- : [661/883] 1987940=test_update I, [2024-05-25T11:06:09.499616 #1946972] INFO -- : [662/883] 1987940=test_cipher I, [2024-05-25T11:06:09.523076 #1946972] INFO -- : [663/883] 1987941=test_new I, [2024-05-25T11:06:09.530713 #1946972] INFO -- : [664/883] 1987940=test_gem_source_lock I, [2024-05-25T11:06:09.533270 #1946972] INFO -- : [665/883] 1987941=test_load I, [2024-05-25T11:06:09.533759 #1946972] INFO -- : [666/883] 1987941=test_win32ole_type I, [2024-05-25T11:06:09.541380 #1946972] INFO -- : [667/883] 1987941=test_rdoc_rd_inline_parser I, [2024-05-25T11:06:09.564082 #1946972] INFO -- : [668/883] 1987941=test_gem_gem_runner I, [2024-05-25T11:06:09.588789 #1946972] INFO -- : [669/883] 1987940=test_require_lib I, [2024-05-25T11:06:09.620999 #1946972] INFO -- : [670/883] 1987941=test_metaclass I, [2024-05-25T11:06:09.647881 #1946972] INFO -- : [671/883] 1987941=test_x509store I, [2024-05-25T11:06:10.174903 #1946972] INFO -- : [672/883] 1987941=test_rdoc_rd_block_parser I, [2024-05-25T11:06:10.219615 #1946972] INFO -- : [673/883] 1987941=test_rdoc_generator_pot I, [2024-05-25T11:06:10.227244 #1946972] INFO -- : [674/883] 1987941=test_rdoc_markup_to_markdown I, [2024-05-25T11:06:10.265401 #1946972] INFO -- : [675/883] 1987941=test_rdoc_markup_to_joined_paragraph I, [2024-05-25T11:06:10.272481 #1946972] INFO -- : [676/883] 1987941=test_rdoc_rd I, [2024-05-25T11:06:10.279183 #1946972] INFO -- : [677/883] 1987941=test_cgi_cookie I, [2024-05-25T11:06:10.288788 #1946972] INFO -- : [678/883] 1987941=test_not I, [2024-05-25T11:06:10.299467 #1946972] INFO -- : [679/883] 1987941=test_tracer I, [2024-05-25T11:06:10.306073 #1946972] INFO -- : [680/883] 1987941=test_wss I, [2024-05-25T11:06:10.309095 #1946972] INFO -- : [681/883] 1987941=test_rdoc_markup_attribute_manager I, [2024-05-25T11:06:10.357547 #1946972] INFO -- : [682/883] 1987941=test_option I, [2024-05-25T11:06:10.449369 #1946972] INFO -- : [683/883] 1987939=test_require I, [2024-05-25T11:06:10.475533 #1946972] INFO -- : [684/883] 1987941=test_objectspace I, [2024-05-25T11:06:11.413806 #1946972] INFO -- : [685/883] 1987941=test_gem_resolver_composed_set I, [2024-05-25T11:06:11.433753 #1946972] INFO -- : [686/883] 1987941=test_my_integer I, [2024-05-25T11:06:11.435420 #1946972] INFO -- : [687/883] 1987941=test_debugger_integration I, [2024-05-25T11:06:11.476905 #1946972] INFO -- : [688/883] 1987941=test_load I, [2024-05-25T11:06:11.481731 #1946972] INFO -- : Leaked file descriptor: TestOptionParserLoad#test_load_nothing: 11 # I, [2024-05-25T11:06:11.512043 #1946972] INFO -- : COMMAND PID USER FD TYPE DEVICE SIZE/OFF NODE NAME I, [2024-05-25T11:06:11.512115 #1946972] INFO -- : ruby 1987941 opc 11r REG 252,0 9253600 13705411 /var/lib/sss/mc/passwd I, [2024-05-25T11:06:11.610304 #1946972] INFO -- : [689/883] 1987941=test_bundled_ca I, [2024-05-25T11:06:12.500429 #1946972] INFO -- : [690/883] 1987940=test_integer_comb I, [2024-05-25T11:06:13.036871 #1946972] INFO -- : [691/883] 1987939=test_abi I, [2024-05-25T11:06:13.244202 #1946972] INFO -- : [692/883] 1987939=test_ssl I, [2024-05-25T11:06:13.503604 #1946972] INFO -- : [693/883] 1987941=test_erb_command I, [2024-05-25T11:06:13.557700 #1946972] INFO -- : [694/883] 1987941=test_module I, [2024-05-25T11:06:15.002621 #1946972] INFO -- : [695/883] 1987940=test_gem_security_trust_dir I, [2024-05-25T11:06:15.047413 #1946972] INFO -- : [696/883] 1987940=test_gem_source_installed I, [2024-05-25T11:06:15.067580 #1946972] INFO -- : [697/883] 1987940=test_gem_validator I, [2024-05-25T11:06:15.161578 #1946972] INFO -- : [698/883] 1987940=test_usrmarshal I, [2024-05-25T11:06:15.289105 #1946972] INFO -- : [699/883] 1987940=test_key_error I, [2024-05-25T11:06:15.294593 #1946972] INFO -- : [700/883] 1987940=test_win32ole_param I, [2024-05-25T11:06:15.299601 #1946972] INFO -- : [701/883] 1987940=test_gem_commands_mirror I, [2024-05-25T11:06:15.313434 #1946972] INFO -- : [702/883] 1987940=test_fiber I, [2024-05-25T11:06:16.404560 #1946972] INFO -- : [703/883] 1987941=test_engine I, [2024-05-25T11:06:16.796285 #1946972] INFO -- : [704/883] 1987941=test_lock_native_thread I, [2024-05-25T11:06:17.050455 #1946972] INFO -- : [705/883] 1987941=test_gem_package_task I, [2024-05-25T11:06:17.062931 #1946972] INFO -- : [706/883] 1987941=test_resize I, [2024-05-25T11:06:17.116268 #1946972] INFO -- : [707/883] 1987941=test_cparser I, [2024-05-25T11:06:18.990111 #1946972] INFO -- : [708/883] 1987941=test_rubyvm I, [2024-05-25T11:06:19.000513 #1946972] INFO -- : [709/883] 1987941=fuzzer_test I, [2024-05-25T11:06:19.011583 #1946972] INFO -- : [710/883] 1987941=test_c_struct_entry I, [2024-05-25T11:06:19.770119 #1946972] INFO -- : [711/883] 1987941=static_inspect_test I, [2024-05-25T11:06:19.779838 #1946972] INFO -- : [712/883] 1987941=test_struct I, [2024-05-25T11:06:19.786394 #1946972] INFO -- : [713/883] 1987941=test_custom_command I, [2024-05-25T11:06:19.791569 #1946972] INFO -- : [714/883] 1987941=test_rdoc_parser_markdown I, [2024-05-25T11:06:19.809012 #1946972] INFO -- : [715/883] 1987941=test_depth_first I, [2024-05-25T11:06:19.814819 #1946972] INFO -- : [716/883] 1987941=test_change_word I, [2024-05-25T11:06:19.821328 #1946972] INFO -- : [717/883] 1987941=test_config I, [2024-05-25T11:06:19.880874 #1946972] INFO -- : [718/883] 1987941=test_ostruct I, [2024-05-25T11:06:20.003818 #1946972] INFO -- : [719/883] 1987941=json_generic_object_test I, [2024-05-25T11:06:20.030418 #1946972] INFO -- : [720/883] 1987941=test_fiddle I, [2024-05-25T11:06:20.221858 #1946972] INFO -- : [721/883] 1987941=test_gem_resolver_vendor_specification I, [2024-05-25T11:06:20.256042 #1946972] INFO -- : [722/883] 1987941=test_date_arith I, [2024-05-25T11:06:20.308942 #1946972] INFO -- : [723/883] 1987941=test_exception_at_throwing I, [2024-05-25T11:06:20.318482 #1946972] INFO -- : [724/883] 1987941=test_gem_resolver_installed_specification I, [2024-05-25T11:06:20.348353 #1946972] INFO -- : [725/883] 1987941=test_ractor I, [2024-05-25T11:06:20.431054 #1946972] INFO -- : [726/883] 1987941=test_stringscanner I, [2024-05-25T11:06:20.479188 #1946972] INFO -- : [727/883] 1987941=test_gem_resolver_git_set I, [2024-05-25T11:06:21.217951 #1946972] INFO -- : [728/883] 1987941=test_gem_commands_check_command I, [2024-05-25T11:06:21.302013 #1946972] INFO -- : [729/883] 1987941=test_signedness I, [2024-05-25T11:06:21.484162 #1946972] INFO -- : [730/883] 1987940=test_digest I, [2024-05-25T11:06:22.286693 #1946972] INFO -- : [731/883] 1987940=test_gem_safe_marshal I, [2024-05-25T11:06:23.009750 #1946972] INFO -- : [732/883] 1987940=test_httpheader I, [2024-05-25T11:06:23.015934 #1946972] INFO -- : [733/883] 1987941=test_sexp I, [2024-05-25T11:06:23.024921 #1946972] INFO -- : [734/883] 1987940=test_ractor I, [2024-05-25T11:06:23.052767 #1946972] INFO -- : [735/883] 1987941=test_rdoc_ri_driver I, [2024-05-25T11:06:23.101976 #1946972] INFO -- : [736/883] 1987940=test_gem_ext_cargo_builder_link_flag_converter I, [2024-05-25T11:06:23.169564 #1946972] INFO -- : [737/883] 1987940=test_gem_local_remote_options I, [2024-05-25T11:06:23.239072 #1946972] INFO -- : [738/883] 1987940=test_dup I, [2024-05-25T11:06:23.411856 #1946972] INFO -- : [739/883] 1987940=test_rdoc_single_class I, [2024-05-25T11:06:23.423593 #1946972] INFO -- : [740/883] 1987940=test_acceptable I, [2024-05-25T11:06:23.451964 #1946972] INFO -- : [741/883] 1987941=test_tmpdir I, [2024-05-25T11:06:23.494972 #1946972] INFO -- : [742/883] 1987940=test_struct I, [2024-05-25T11:06:23.592828 #1946972] INFO -- : [743/883] 1987941=test_mutex I, [2024-05-25T11:06:23.666499 #1946972] INFO -- : [744/883] 1987939=test_rdoc_token_stream I, [2024-05-25T11:06:23.678996 #1946972] INFO -- : [745/883] 1987939=test_type I, [2024-05-25T11:06:23.688685 #1946972] INFO -- : [746/883] 1987939=heredoc_dedent_test I, [2024-05-25T11:06:23.749667 #1946972] INFO -- : [747/883] 1987939=test_case_comprehensive I, [2024-05-25T11:06:24.014835 #1946972] INFO -- : [748/883] 1987940=test_logperiod I, [2024-05-25T11:06:24.035092 #1946972] INFO -- : [749/883] 1987940=test_rational2 I, [2024-05-25T11:06:24.044618 #1946972] INFO -- : [750/883] 1987940=test_placearg I, [2024-05-25T11:06:24.103965 #1946972] INFO -- : [751/883] 1987940=test_gem_package_tar_header I, [2024-05-25T11:06:24.156745 #1946972] INFO -- : [752/883] 1987940=test_ssl_session I, [2024-05-25T11:06:24.667127 #1946972] INFO -- : [753/883] 1987941=test_io_wait_uncommon I, [2024-05-25T11:06:24.685536 #1946972] INFO -- : [754/883] 1987941=test_fixnum I, [2024-05-25T11:06:24.702068 #1946972] INFO -- : [755/883] 1987941=test_gem_silent_ui I, [2024-05-25T11:06:24.756659 #1946972] INFO -- : [756/883] 1987941=test_signal I, [2024-05-25T11:06:25.028340 #1946972] INFO -- : [757/883] 1987940=test_continuation I, [2024-05-25T11:06:25.039626 #1946972] INFO -- : [758/883] 1987940=test_gem_ci_detector I, [2024-05-25T11:06:25.052706 #1946972] INFO -- : [759/883] 1987940=test_completion I, [2024-05-25T11:06:25.822604 #1946972] INFO -- : [760/883] 1987940=test_file_exhaustive I, [2024-05-25T11:06:26.776360 #1946972] INFO -- : [761/883] 1987941=test_gem_security_policy I, [2024-05-25T11:06:27.106351 #1946972] INFO -- : Leaked file descriptor: TestFileExhaustive#test_expand_path_error_for_nonexistent_username: 10 # I, [2024-05-25T11:06:27.106424 #1946972] INFO -- : Leaked file descriptor: TestFileExhaustive#test_expand_path_error_for_nonexistent_username: 11 # I, [2024-05-25T11:06:27.138953 #1946972] INFO -- : COMMAND PID USER FD TYPE DEVICE SIZE/OFF NODE NAME I, [2024-05-25T11:06:27.139018 #1946972] INFO -- : ruby 1987940 opc 10r REG 252,0 9253600 13705411 /var/lib/sss/mc/passwd I, [2024-05-25T11:06:27.139030 #1946972] INFO -- : ruby 1987940 opc 11u unix 0x0000000000000000 0t0 3136076163 type=STREAM I, [2024-05-25T11:06:27.178672 #1946972] INFO -- : [762/883] 1987941=test_delete I, [2024-05-25T11:06:27.194386 #1946972] INFO -- : [763/883] 1987941=test_rdoc_markup_document I, [2024-05-25T11:06:27.254914 #1946972] INFO -- : [764/883] 1987941=test_handle I, [2024-05-25T11:06:28.187841 #1946972] INFO -- : [765/883] 1987941=parse_stream_test I, [2024-05-25T11:06:28.204421 #1946972] INFO -- : [766/883] 1987941=test_gem_request_set_gem_dependency_api I, [2024-05-25T11:06:28.453962 #1946972] INFO -- : [767/883] 1987941=test_name_error_extension I, [2024-05-25T11:06:28.465252 #1946972] INFO -- : [768/883] 1987941=test_weakkeymap I, [2024-05-25T11:06:29.046549 #1946972] INFO -- : [769/883] 1987941=test_files_test I, [2024-05-25T11:06:29.133805 #1946972] INFO -- : [770/883] 1987941=test_protocol I, [2024-05-25T11:06:29.443741 #1946972] INFO -- : [771/883] 1987941=test_evaluation I, [2024-05-25T11:06:29.453260 #1946972] INFO -- : [772/883] 1987941=test_rdoc_markup_to_ansi I, [2024-05-25T11:06:29.495275 #1946972] INFO -- : [773/883] 1987941=test_object_create_start I, [2024-05-25T11:06:29.512761 #1946972] INFO -- : [774/883] 1987941=test_gem_commands_info_command I, [2024-05-25T11:06:29.533577 #1946972] INFO -- : [775/883] 1987941=test_https I, [2024-05-25T11:06:29.699953 #1946972] INFO -- : [776/883] 1987941=test_logdevice I, [2024-05-25T11:06:30.698496 #1946972] INFO -- : [777/883] 1987941=test_ast I, [2024-05-25T11:06:36.641521 #1946972] INFO -- : [778/883] 1987940=test_x509cert I, [2024-05-25T11:06:36.722304 #1946972] INFO -- : [779/883] 1987940=test_rdoc_markup_paragraph I, [2024-05-25T11:06:36.741293 #1946972] INFO -- : [780/883] 1987940=test_irb I, [2024-05-25T11:06:37.013111 #1946972] INFO -- : [781/883] 1987940=test_variable_name_check I, [2024-05-25T11:06:37.140736 #1946972] INFO -- : [782/883] 1987940=test_bn I, [2024-05-25T11:06:37.194891 #1946972] INFO -- : [783/883] 1987940=test_require_path_check I, [2024-05-25T11:06:37.325606 #1946972] INFO -- : [784/883] 1987940=test_autoconf I, [2024-05-25T11:06:37.332468 #1946972] INFO -- : [785/883] 1987940=integer_parse_test I, [2024-05-25T11:06:37.346093 #1946972] INFO -- : [786/883] 1987940=test_arithmetic_sequence I, [2024-05-25T11:06:37.366469 #1946972] INFO -- : [787/883] 1987940=test_ractor_compatibility I, [2024-05-25T11:06:37.720290 #1946972] INFO -- : [788/883] 1987940=test_find_executable I, [2024-05-25T11:06:37.732462 #1946972] INFO -- : [789/883] 1987940=test_gem_request_set_lockfile_tokenizer I, [2024-05-25T11:06:37.791559 #1946972] INFO -- : [790/883] 1987940=test_cgi_multipart I, [2024-05-25T11:06:37.918052 #1946972] INFO -- : [791/883] 1987940=test_lazy_enumerator I, [2024-05-25T11:06:38.374506 #1946972] INFO -- : [792/883] 1987940=test_gem_source_fetch_problem I, [2024-05-25T11:06:38.390771 #1946972] INFO -- : [793/883] 1987940=test_rdoc_comment I, [2024-05-25T11:06:38.440017 #1946972] INFO -- : [794/883] 1987940=test_encoding I, [2024-05-25T11:06:38.665644 #1946972] INFO -- : [795/883] 1987940=test_install I, [2024-05-25T11:06:38.699228 #1946972] INFO -- : [796/883] 1987940=test_ftp I, [2024-05-25T11:06:38.706499 #1946972] INFO -- : [797/883] 1987940=test_sockopt I, [2024-05-25T11:06:38.712781 #1946972] INFO -- : [798/883] 1987940=test_history I, [2024-05-25T11:06:38.748563 #1946972] INFO -- : [799/883] 1987940=test_gem_commands_setup_command I, [2024-05-25T11:06:39.670998 #1946972] INFO -- : [800/883] 1987940=test_gem_safe_yaml I, [2024-05-25T11:06:39.681988 #1946972] INFO -- : [801/883] 1987940=test_eval I, [2024-05-25T11:06:39.693797 #1946972] INFO -- : [802/883] 1987940=test_document I, [2024-05-25T11:06:39.696633 #1946972] INFO -- : [803/883] 1987940=test_singleton_function I, [2024-05-25T11:06:39.705379 #1946972] INFO -- : [804/883] 1987940=command_line_test I, [2024-05-25T11:06:39.708481 #1946972] INFO -- : [805/883] 1987940=test_env I, [2024-05-25T11:06:42.278259 #1946972] INFO -- : [806/883] 1987940=test_gem_package_tar_reader I, [2024-05-25T11:06:42.399868 #1946972] INFO -- : [807/883] 1987940=test_gem_commands_signout_command I, [2024-05-25T11:06:42.417513 #1946972] INFO -- : [808/883] 1987940=test_pair I, [2024-05-25T11:06:43.714182 #1946972] INFO -- : [809/883] 1987939=test_win32ole_variant_m I, [2024-05-25T11:06:43.714965 #1946972] INFO -- : [810/883] 1987939=test_primitive I, [2024-05-25T11:06:43.744635 #1946972] INFO -- : [811/883] 1987939=test_rdoc_ri_paths I, [2024-05-25T11:06:43.781402 #1946972] INFO -- : [812/883] 1987939=test_parser I, [2024-05-25T11:06:43.804817 #1946972] INFO -- : [813/883] 1987939=test_iseq I, [2024-05-25T11:06:44.384736 #1946972] INFO -- : [814/883] 1987939=test_thread_cv I, [2024-05-25T11:06:45.004976 #1946972] INFO -- : [815/883] 1987939=test_assembler I, [2024-05-25T11:06:45.006552 #1946972] INFO -- : [816/883] 1987939=test_stringio I, [2024-05-25T11:06:45.126489 #1946972] INFO -- : [817/883] 1987939=test_files_ext I, [2024-05-25T11:06:45.135034 #1946972] INFO -- : [818/883] 1987939=test_random I, [2024-05-25T11:06:45.175019 #1946972] INFO -- : [819/883] 1987939=test_regex_casefold I, [2024-05-25T11:06:45.587072 #1946972] INFO -- : [820/883] 1987939=test_win32ole_method I, [2024-05-25T11:06:45.594195 #1946972] INFO -- : [821/883] 1987939=test_lexer I, [2024-05-25T11:06:45.620268 #1946972] INFO -- : [822/883] 1987939=test_gem_source_git I, [2024-05-25T11:06:46.621631 #1946972] INFO -- : [823/883] 1987939=test_ripper I, [2024-05-25T11:06:46.933371 #1946972] INFO -- : [824/883] 1987939=dispatcher_test I, [2024-05-25T11:06:46.948067 #1946972] INFO -- : [825/883] 1987939=test_eval_history I, [2024-05-25T11:06:46.960037 #1946972] INFO -- : [826/883] 1987939=test_unicode I, [2024-05-25T11:06:46.987954 #1946972] INFO -- : [827/883] 1987939=test_gem_package I, [2024-05-25T11:06:47.765992 #1946972] INFO -- : [828/883] 1987939=test_array I, [2024-05-25T11:06:47.904094 #1946972] INFO -- : [829/883] 1987940=test_autoload I, [2024-05-25T11:06:52.276446 #1946972] INFO -- : [830/883] 1987940=test_mkmf I, [2024-05-25T11:06:52.328365 #1946972] INFO -- : [831/883] 1987940=test_gem_source I, [2024-05-25T11:06:52.735470 #1946972] INFO -- : [832/883] 1987940=test_have_macro I, [2024-05-25T11:06:52.957504 #1946972] INFO -- : [833/883] 1987940=test_class I, [2024-05-25T11:06:52.959785 #1946972] INFO -- : [834/883] 1987940=test_at_exit I, [2024-05-25T11:06:52.984657 #1946972] INFO -- : [835/883] 1987940=test_benchmark I, [2024-05-25T11:06:54.712932 #1946972] INFO -- : [836/883] 1987940=test_mul I, [2024-05-25T11:06:54.724301 #1946972] INFO -- : [837/883] 1987940=test_shellwords I, [2024-05-25T11:06:54.731049 #1946972] INFO -- : [838/883] 1987940=test_rdoc_generator_pot_po I, [2024-05-25T11:06:54.740730 #1946972] INFO -- : [839/883] 1987940=test_ipaddr I, [2024-05-25T11:06:54.761759 #1946972] INFO -- : [840/883] 1987940=test_ocsp I, [2024-05-25T11:06:54.866430 #1946972] INFO -- : [841/883] 1987940=test_scanner_events I, [2024-05-25T11:06:54.950080 #1946972] INFO -- : [842/883] 1987940=test_date_strptime I, [2024-05-25T11:06:55.028729 #1946972] INFO -- : [843/883] 1987940=test_omap I, [2024-05-25T11:06:55.029807 #1946972] INFO -- : [844/883] 1987940=test_nonblock I, [2024-05-25T11:06:55.059960 #1946972] INFO -- : [845/883] 1987940=test_rdoc_parser_simple I, [2024-05-25T11:06:55.078135 #1946972] INFO -- : [846/883] 1987940=test_gem_ext_configure_builder I, [2024-05-25T11:06:55.134959 #1946972] INFO -- : [847/883] 1987940=json_ext_parser_test I, [2024-05-25T11:06:55.135243 #1946972] INFO -- : [848/883] 1987940=test_color I, [2024-05-25T11:06:55.242915 #1946972] INFO -- : [849/883] 1987940=test_io_m17n I, [2024-05-25T11:06:56.571034 #1946972] INFO -- : [850/883] 1987940=test_rdoc_top_level I, [2024-05-25T11:06:56.860011 #1946972] INFO -- : [851/883] 1987940=test_gem_stub_specification I, [2024-05-25T11:06:57.036530 #1946972] INFO -- : [852/883] 1987940=test_float I, [2024-05-25T11:06:59.113013 #1946972] INFO -- : [853/883] 1987940=test_cmethod I, [2024-05-25T11:06:59.134837 #1946972] INFO -- : [854/883] 1987940=test_unicode_normalize I, [2024-05-25T11:07:02.340736 #1946972] INFO -- : [855/883] 1987939=test_rdoc_generator_ri I, [2024-05-25T11:07:02.356752 #1946972] INFO -- : [856/883] 1987939=test_gem_stream_ui I, [2024-05-25T11:07:02.465605 #1946972] INFO -- : [857/883] 1987939=test_gb18030 I, [2024-05-25T11:07:02.477712 #1946972] INFO -- : [858/883] 1987939=test_propertyputref I, [2024-05-25T11:07:02.484978 #1946972] INFO -- : [859/883] 1987939=test_reline_key I, [2024-05-25T11:07:02.499992 #1946972] INFO -- : [860/883] 1987939=test_gem_commands_lock_command I, [2024-05-25T11:07:02.527994 #1946972] INFO -- : [861/883] 1987939=test_digest I, [2024-05-25T11:07:02.540039 #1946972] INFO -- : [862/883] 1987939=test_path I, [2024-05-25T11:07:02.548745 #1946972] INFO -- : [863/883] 1987939=test_rdoc_rd_inline I, [2024-05-25T11:07:02.553358 #1946972] INFO -- : [864/883] 1987939=test_dir I, [2024-05-25T11:07:02.915951 #1946972] INFO -- : [865/883] 1987939=test_files_test_1 I, [2024-05-25T11:07:02.945679 #1946972] INFO -- : [866/883] 1987939=test_resolve_symbol I, [2024-05-25T11:07:02.996027 #1946972] INFO -- : [867/883] 1987939=test_rubygems I, [2024-05-25T11:07:03.141885 #1946972] INFO -- : [868/883] 1987939=test_closure I, [2024-05-25T11:07:03.350189 #1946972] INFO -- : [869/883] 1987940=test_io I, [2024-05-25T11:07:06.076626 #1946972] INFO -- : [870/883] 1987939=test_uncorrectable_name_check I, [2024-05-25T11:07:06.084090 #1946972] INFO -- : [871/883] 1987939=test_cgi_modruby I, [2024-05-25T11:07:06.095790 #1946972] INFO -- : [872/883] 1987939=test_win32ole_variant I, [2024-05-25T11:07:06.099512 #1946972] INFO -- : [873/883] 1987939=magic_comment_test I, [2024-05-25T11:07:06.121858 #1946972] INFO -- : [874/883] 1987939=test_printf I, [2024-05-25T11:07:06.137861 #1946972] INFO -- : [875/883] 1987939=test_x509attr I, [2024-05-25T11:07:06.188767 #1946972] INFO -- : [876/883] 1987939=test_workspace I, [2024-05-25T11:07:06.270726 #1946972] INFO -- : [877/883] 1987939=test_etc I, [2024-05-25T11:07:06.366998 #1946972] INFO -- : [878/883] 1987939=test_nomethod_error I, [2024-05-25T11:07:06.378076 #1946972] INFO -- : [879/883] 1987939=test_gem_commands_rebuild_command I, [2024-05-25T11:07:06.483519 #1946972] INFO -- : [880/883] 1987939=test_stat I, [2024-05-25T11:07:06.489288 #1946972] INFO -- : [881/883] 1987939=test_win32ole_param_event I, [2024-05-25T11:07:06.492303 #1946972] INFO -- : [882/883] 1987939=test_rdoc_parser I, [2024-05-25T11:07:06.522564 #1946972] INFO -- : [883/883] 1987939=test_https_proxy I, [2024-05-25T11:07:17.627498 #1946972] INFO -- : Finished tests in 203.260935s, 129.4395 tests/s, 46011.6157 assertions/s. I, [2024-05-25T11:07:17.632213 #1946972] INFO -- : 26310 tests, 9352364 assertions, 0 failures, 0 errors, 320 skips I, [2024-05-25T11:07:17.632238 #1946972] INFO -- : I, [2024-05-25T11:07:17.632251 #1946972] INFO -- : ruby -v: ruby 3.4.0dev (2024-05-24T21:04:21Z master 4d0c5486a2) [aarch64-linux] I, [2024-05-25T11:07:17.633097 #1946972] INFO -- : $$$[end] "make yes-test-all TESTOPTS='--stderr-on-failure' TESTS='-j3'" exit with 0. I, [2024-05-25T11:07:17.633290 #1946972] INFO -- : $$$[beg] make yes-test-rubyspec MSPECOPT='--error-output stderr --debug -j' TESTS='-j3' I, [2024-05-25T11:07:17.759846 #1946972] INFO -- : BASERUBY = /usr/local/bin/ruby --disable=gems I, [2024-05-25T11:07:17.759925 #1946972] INFO -- : CC = gcc I, [2024-05-25T11:07:17.759937 #1946972] INFO -- : LD = ld I, [2024-05-25T11:07:17.759949 #1946972] INFO -- : LDSHARED = gcc -shared I, [2024-05-25T11:07:17.759959 #1946972] INFO -- : CFLAGS = -O3 -fno-fast-math -ggdb3 -Wall -Wextra -Wdeprecated-declarations -Wdiv-by-zero -Wduplicated-cond -Wimplicit-function-declaration -Wimplicit-int -Wpointer-arith -Wwrite-strings -Wold-style-definition -Wimplicit-fallthrough=0 -Wmissing-noreturn -Wno-cast-function-type -Wno-constant-logical-operand -Wno-long-long -Wno-missing-field-initializers -Wno-overlength-strings -Wno-packed-bitfield-compat -Wno-parentheses-equality -Wno-self-assign -Wno-tautological-compare -Wno-unused-parameter -Wno-unused-value -Wsuggest-attribute=format -Wsuggest-attribute=noreturn -Wunused-variable -Wmisleading-indentation -Wundef I, [2024-05-25T11:07:17.759971 #1946972] INFO -- : XCFLAGS = -U_FORTIFY_SOURCE -D_FORTIFY_SOURCE=2 -fstack-protector-strong -msign-return-address=all -fno-strict-overflow -fvisibility=hidden -fexcess-precision=standard -DRUBY_EXPORT -fPIE -I. -I.ext/include/aarch64-linux -I/home/opc/ruby/src/master/include -I/home/opc/ruby/src/master -I/home/opc/ruby/src/master/prism -I/home/opc/ruby/src/master/enc/unicode/15.0.0 I, [2024-05-25T11:07:17.759980 #1946972] INFO -- : CPPFLAGS = I, [2024-05-25T11:07:17.759989 #1946972] INFO -- : DLDFLAGS = -Wl,--compress-debug-sections=zlib -fstack-protector-strong -pie I, [2024-05-25T11:07:17.759999 #1946972] INFO -- : SOLIBS = -lz -lrt -lrt -ldl -lcrypt -lm -lpthread I, [2024-05-25T11:07:17.760007 #1946972] INFO -- : LANG = en_US.UTF-8 I, [2024-05-25T11:07:17.760016 #1946972] INFO -- : LC_ALL = I, [2024-05-25T11:07:17.760024 #1946972] INFO -- : LC_CTYPE = I, [2024-05-25T11:07:17.760033 #1946972] INFO -- : MFLAGS = I, [2024-05-25T11:07:17.760041 #1946972] INFO -- : RUSTC = rustc I, [2024-05-25T11:07:17.760050 #1946972] INFO -- : YJIT_RUSTC_ARGS = --crate-name=yjit --crate-type=staticlib --edition=2021 -g -C lto=thin -C opt-level=3 -C overflow-checks=on '--out-dir=/home/opc/ruby/build/master/yjit/target/release/' /home/opc/ruby/src/master/yjit/src/lib.rs I, [2024-05-25T11:07:17.760756 #1946972] INFO -- : gcc (GCC) 8.5.0 20210514 (Red Hat 8.5.0-10.1.0.1) I, [2024-05-25T11:07:17.760778 #1946972] INFO -- : Copyright (C) 2018 Free Software Foundation, Inc. I, [2024-05-25T11:07:17.760790 #1946972] INFO -- : This is free software; see the source for copying conditions. There is NO I, [2024-05-25T11:07:17.760800 #1946972] INFO -- : warranty; not even for MERCHANTABILITY or FITNESS FOR A PARTICULAR PURPOSE. I, [2024-05-25T11:07:17.760809 #1946972] INFO -- : I, [2024-05-25T11:07:17.762826 #1946972] INFO -- : generating enc.mk I, [2024-05-25T11:07:17.999371 #1946972] INFO -- : generating encdb.h I, [2024-05-25T11:07:18.036183 #1946972] INFO -- : encdb.h unchanged I, [2024-05-25T11:07:18.037425 #1946972] INFO -- : making enc I, [2024-05-25T11:07:18.065848 #1946972] INFO -- : make[1]: Entering directory '/home/opc/ruby/build/master' I, [2024-05-25T11:07:18.065903 #1946972] INFO -- : make[1]: Nothing to be done for 'enc'. I, [2024-05-25T11:07:18.065915 #1946972] INFO -- : make[1]: Leaving directory '/home/opc/ruby/build/master' I, [2024-05-25T11:07:18.066583 #1946972] INFO -- : making srcs under enc I, [2024-05-25T11:07:18.108725 #1946972] INFO -- : make[1]: Entering directory '/home/opc/ruby/build/master' I, [2024-05-25T11:07:18.108791 #1946972] INFO -- : make[1]: Nothing to be done for 'srcs'. I, [2024-05-25T11:07:18.108803 #1946972] INFO -- : make[1]: Leaving directory '/home/opc/ruby/build/master' I, [2024-05-25T11:07:18.109884 #1946972] INFO -- : generating transdb.h I, [2024-05-25T11:07:18.255988 #1946972] INFO -- : transdb.h unchanged I, [2024-05-25T11:07:18.257327 #1946972] INFO -- : making trans I, [2024-05-25T11:07:18.306648 #1946972] INFO -- : make[1]: Entering directory '/home/opc/ruby/build/master' I, [2024-05-25T11:07:18.306912 #1946972] INFO -- : make[1]: Nothing to be done for 'trans'. I, [2024-05-25T11:07:18.306928 #1946972] INFO -- : make[1]: Leaving directory '/home/opc/ruby/build/master' I, [2024-05-25T11:07:18.307474 #1946972] INFO -- : making encs I, [2024-05-25T11:07:18.360297 #1946972] INFO -- : make[1]: Entering directory '/home/opc/ruby/build/master' I, [2024-05-25T11:07:18.360378 #1946972] INFO -- : make[1]: Nothing to be done for 'encs'. I, [2024-05-25T11:07:18.360391 #1946972] INFO -- : make[1]: Leaving directory '/home/opc/ruby/build/master' I, [2024-05-25T11:07:18.362456 #1946972] INFO -- : generating makefiles ext/configure-ext.mk I, [2024-05-25T11:07:18.403127 #1946972] INFO -- : ext/configure-ext.mk updated I, [2024-05-25T11:07:18.406173 #1946972] INFO -- : make[1]: Entering directory '/home/opc/ruby/build/master' I, [2024-05-25T11:07:20.547491 #1946972] INFO -- : make[1]: Leaving directory '/home/opc/ruby/build/master' I, [2024-05-25T11:07:20.548251 #1946972] INFO -- : generating makefile exts.mk I, [2024-05-25T11:07:20.607166 #1946972] INFO -- : exts.mk unchanged I, [2024-05-25T11:07:20.611998 #1946972] INFO -- : make[1]: Entering directory '/home/opc/ruby/build/master' I, [2024-05-25T11:07:20.906996 #1946972] INFO -- : make[2]: Entering directory '/home/opc/ruby/build/master/ext/coverage' I, [2024-05-25T11:07:20.911611 #1946972] INFO -- : make[2]: Leaving directory '/home/opc/ruby/build/master/ext/coverage' I, [2024-05-25T11:07:20.917424 #1946972] INFO -- : make[2]: Entering directory '/home/opc/ruby/build/master/ext/date' I, [2024-05-25T11:07:20.922720 #1946972] INFO -- : make[2]: Leaving directory '/home/opc/ruby/build/master/ext/date' I, [2024-05-25T11:07:20.926051 #1946972] INFO -- : make[2]: Entering directory '/home/opc/ruby/build/master/ext/digest' I, [2024-05-25T11:07:20.935399 #1946972] INFO -- : make[2]: Leaving directory '/home/opc/ruby/build/master/ext/digest' I, [2024-05-25T11:07:20.957771 #1946972] INFO -- : make[2]: Entering directory '/home/opc/ruby/build/master/ext/digest/sha2' I, [2024-05-25T11:07:20.962764 #1946972] INFO -- : make[2]: Leaving directory '/home/opc/ruby/build/master/ext/digest/sha2' I, [2024-05-25T11:07:20.980841 #1946972] INFO -- : make[2]: Entering directory '/home/opc/ruby/build/master/ext/fiddle' I, [2024-05-25T11:07:20.991081 #1946972] INFO -- : make[2]: Leaving directory '/home/opc/ruby/build/master/ext/fiddle' I, [2024-05-25T11:07:20.995255 #1946972] INFO -- : make[2]: Entering directory '/home/opc/ruby/build/master/ext/io/console' I, [2024-05-25T11:07:20.999622 #1946972] INFO -- : make[2]: Leaving directory '/home/opc/ruby/build/master/ext/io/console' I, [2024-05-25T11:07:21.010516 #1946972] INFO -- : make[2]: Entering directory '/home/opc/ruby/build/master/ext/json' I, [2024-05-25T11:07:21.019812 #1946972] INFO -- : make[2]: Leaving directory '/home/opc/ruby/build/master/ext/json' I, [2024-05-25T11:07:21.032820 #1946972] INFO -- : make[2]: Entering directory '/home/opc/ruby/build/master/ext/monitor' I, [2024-05-25T11:07:21.036958 #1946972] INFO -- : make[2]: Leaving directory '/home/opc/ruby/build/master/ext/monitor' I, [2024-05-25T11:07:21.042932 #1946972] INFO -- : make[2]: Entering directory '/home/opc/ruby/build/master/ext/objspace' I, [2024-05-25T11:07:21.049055 #1946972] INFO -- : make[2]: Leaving directory '/home/opc/ruby/build/master/ext/objspace' I, [2024-05-25T11:07:21.068201 #1946972] INFO -- : make[2]: Entering directory '/home/opc/ruby/build/master/ext/openssl' I, [2024-05-25T11:07:21.089850 #1946972] INFO -- : make[2]: Leaving directory '/home/opc/ruby/build/master/ext/openssl' I, [2024-05-25T11:07:21.094224 #1946972] INFO -- : make[2]: Entering directory '/home/opc/ruby/build/master/ext/pathname' I, [2024-05-25T11:07:21.098323 #1946972] INFO -- : make[2]: Leaving directory '/home/opc/ruby/build/master/ext/pathname' I, [2024-05-25T11:07:21.104664 #1946972] INFO -- : make[2]: Entering directory '/home/opc/ruby/build/master/ext/psych' I, [2024-05-25T11:07:21.126306 #1946972] INFO -- : make[2]: Leaving directory '/home/opc/ruby/build/master/ext/psych' I, [2024-05-25T11:07:21.130792 #1946972] INFO -- : make[2]: Entering directory '/home/opc/ruby/build/master/ext/pty' I, [2024-05-25T11:07:21.134927 #1946972] INFO -- : make[2]: Leaving directory '/home/opc/ruby/build/master/ext/pty' I, [2024-05-25T11:07:21.148504 #1946972] INFO -- : make[2]: Entering directory '/home/opc/ruby/build/master/ext/ripper' I, [2024-05-25T11:07:21.156132 #1946972] INFO -- : make[2]: Leaving directory '/home/opc/ruby/build/master/ext/ripper' I, [2024-05-25T11:07:21.158131 #1946972] INFO -- : make[2]: Entering directory '/home/opc/ruby/build/master/ext/rubyvm' I, [2024-05-25T11:07:21.161503 #1946972] INFO -- : make[2]: Leaving directory '/home/opc/ruby/build/master/ext/rubyvm' I, [2024-05-25T11:07:21.173399 #1946972] INFO -- : make[2]: Entering directory '/home/opc/ruby/build/master/ext/socket' I, [2024-05-25T11:07:21.184117 #1946972] INFO -- : make[2]: Leaving directory '/home/opc/ruby/build/master/ext/socket' I, [2024-05-25T11:07:21.199263 #1946972] INFO -- : make[2]: Entering directory '/home/opc/ruby/build/master/.bundle/gems/bigdecimal-3.1.7/ext/bigdecimal' I, [2024-05-25T11:07:21.230175 #1946972] INFO -- : make[2]: Leaving directory '/home/opc/ruby/build/master/.bundle/gems/bigdecimal-3.1.7/ext/bigdecimal' I, [2024-05-25T11:07:21.232807 #1946972] INFO -- : make[2]: Entering directory '/home/opc/ruby/build/master/.bundle/gems/bigdecimal-3.1.8/ext/bigdecimal' I, [2024-05-25T11:07:21.263396 #1946972] INFO -- : make[2]: Leaving directory '/home/opc/ruby/build/master/.bundle/gems/bigdecimal-3.1.8/ext/bigdecimal' I, [2024-05-25T11:07:21.266023 #1946972] INFO -- : make[2]: Entering directory '/home/opc/ruby/build/master/.bundle/gems/debug-1.9.2/ext/debug' I, [2024-05-25T11:07:21.296343 #1946972] INFO -- : make[2]: Leaving directory '/home/opc/ruby/build/master/.bundle/gems/debug-1.9.2/ext/debug' I, [2024-05-25T11:07:21.298893 #1946972] INFO -- : make[2]: Entering directory '/home/opc/ruby/build/master/.bundle/gems/nkf-0.2.0/ext/nkf' I, [2024-05-25T11:07:21.330429 #1946972] INFO -- : make[2]: Leaving directory '/home/opc/ruby/build/master/.bundle/gems/nkf-0.2.0/ext/nkf' I, [2024-05-25T11:07:21.332926 #1946972] INFO -- : make[2]: Entering directory '/home/opc/ruby/build/master/.bundle/gems/racc-1.7.3/ext/racc/cparse' I, [2024-05-25T11:07:21.363400 #1946972] INFO -- : make[2]: Leaving directory '/home/opc/ruby/build/master/.bundle/gems/racc-1.7.3/ext/racc/cparse' I, [2024-05-25T11:07:21.365894 #1946972] INFO -- : make[2]: Entering directory '/home/opc/ruby/build/master/.bundle/gems/racc-1.8.0/ext/racc/cparse' I, [2024-05-25T11:07:21.396247 #1946972] INFO -- : make[2]: Leaving directory '/home/opc/ruby/build/master/.bundle/gems/racc-1.8.0/ext/racc/cparse' I, [2024-05-25T11:07:21.399271 #1946972] INFO -- : make[2]: Entering directory '/home/opc/ruby/build/master/.bundle/gems/rbs-3.4.4/ext/rbs_extension' I, [2024-05-25T11:07:21.429817 #1946972] INFO -- : make[2]: Leaving directory '/home/opc/ruby/build/master/.bundle/gems/rbs-3.4.4/ext/rbs_extension' I, [2024-05-25T11:07:21.432242 #1946972] INFO -- : make[2]: Entering directory '/home/opc/ruby/build/master/.bundle/gems/syslog-0.1.2/ext/syslog' I, [2024-05-25T11:07:21.462835 #1946972] INFO -- : make[2]: Leaving directory '/home/opc/ruby/build/master/.bundle/gems/syslog-0.1.2/ext/syslog' I, [2024-05-25T11:07:21.501693 #1946972] INFO -- : make[2]: Entering directory '/home/opc/ruby/build/master' I, [2024-05-25T11:07:21.586241 #1946972] INFO -- : make[2]: 'ruby' is up to date. I, [2024-05-25T11:07:21.586318 #1946972] INFO -- : make[2]: Leaving directory '/home/opc/ruby/build/master' I, [2024-05-25T11:07:21.586453 #1946972] INFO -- : make[1]: Leaving directory '/home/opc/ruby/build/master' I, [2024-05-25T11:07:21.590876 #1946972] INFO -- : make[1]: Entering directory '/home/opc/ruby/build/master' I, [2024-05-25T11:07:21.590914 #1946972] INFO -- : make[1]: Nothing to be done for 'note'. I, [2024-05-25T11:07:21.590927 #1946972] INFO -- : make[1]: Leaving directory '/home/opc/ruby/build/master' E, [2024-05-25T11:07:21.665550 #1946972] ERROR -- : $ /home/opc/ruby/build/master/miniruby -I/home/opc/ruby/src/master/lib /home/opc/ruby/src/master/tool/runruby.rb --archdir=/home/opc/ruby/build/master --extout=.ext -- /home/opc/ruby/src/master/spec/mspec/bin/mspec-run -B /home/opc/ruby/src/master/spec/default.mspec --error-output stderr --debug -fy -o /tmp/rubytest.rrcbto/1-mspec-multi-0 E, [2024-05-25T11:07:21.665891 #1946972] ERROR -- : $ /home/opc/ruby/build/master/miniruby -I/home/opc/ruby/src/master/lib /home/opc/ruby/src/master/tool/runruby.rb --archdir=/home/opc/ruby/build/master --extout=.ext -- /home/opc/ruby/src/master/spec/mspec/bin/mspec-run -B /home/opc/ruby/src/master/spec/default.mspec --error-output stderr --debug -fy -o /tmp/rubytest.rrcbto/2-mspec-multi-1 E, [2024-05-25T11:07:21.666188 #1946972] ERROR -- : $ /home/opc/ruby/build/master/miniruby -I/home/opc/ruby/src/master/lib /home/opc/ruby/src/master/tool/runruby.rb --archdir=/home/opc/ruby/build/master --extout=.ext -- /home/opc/ruby/src/master/spec/mspec/bin/mspec-run -B /home/opc/ruby/src/master/spec/default.mspec --error-output stderr --debug -fy -o /tmp/rubytest.rrcbto/3-mspec-multi-2 I, [2024-05-25T11:07:21.799033 #1946972] INFO -- : ruby 3.4.0dev (2024-05-24T21:04:21Z master 4d0c5486a2) [aarch64-linux] I, [2024-05-25T11:07:27.227555 #1946972] INFO -- : 0 ......................................................................... I, [2024-05-25T11:07:29.624282 #1946972] INFO -- : 73 ......................................................................... I, [2024-05-25T11:07:29.772383 #1946972] INFO -- : 146 ......................................................................... I, [2024-05-25T11:07:30.069320 #1946972] INFO -- : 219 ......................................................................... I, [2024-05-25T11:07:30.246972 #1946972] INFO -- : 292 ......................................................................... I, [2024-05-25T11:07:30.481065 #1946972] INFO -- : 365 ......................................................................... I, [2024-05-25T11:07:30.593483 #1946972] INFO -- : 438 ......................................................................... I, [2024-05-25T11:07:30.652547 #1946972] INFO -- : 511 ......................................................................... I, [2024-05-25T11:07:30.714451 #1946972] INFO -- : 584 ......................................................................... I, [2024-05-25T11:07:31.311447 #1946972] INFO -- : 657 ......................................................................... I, [2024-05-25T11:07:31.430246 #1946972] INFO -- : 730 ......................................................................... I, [2024-05-25T11:07:31.479586 #1946972] INFO -- : 803 ......................................................................... I, [2024-05-25T11:07:31.672363 #1946972] INFO -- : 876 ......................................................................... I, [2024-05-25T11:07:31.778514 #1946972] INFO -- : 949 ......................................................................... I, [2024-05-25T11:07:32.373342 #1946972] INFO -- : 1022 ......................................................................... I, [2024-05-25T11:07:34.699980 #1946972] INFO -- : 1095 ......................................................................... I, [2024-05-25T11:07:35.506186 #1946972] INFO -- : 1168 ......................................................................... I, [2024-05-25T11:07:35.671257 #1946972] INFO -- : 1241 ......................................................................... I, [2024-05-25T11:07:35.891378 #1946972] INFO -- : 1314 ......................................................................... I, [2024-05-25T11:07:35.982361 #1946972] INFO -- : 1387 ......................................................................... I, [2024-05-25T11:07:37.962659 #1946972] INFO -- : 1460 ......................................................................... I, [2024-05-25T11:07:41.431245 #1946972] INFO -- : 1533 ......................................................................... I, [2024-05-25T11:07:41.573993 #1946972] INFO -- : 1606 ......................................................................... I, [2024-05-25T11:07:42.386948 #1946972] INFO -- : 1679 ......................................................................... I, [2024-05-25T11:07:42.667094 #1946972] INFO -- : 1752 ......................................................................... I, [2024-05-25T11:07:42.931575 #1946972] INFO -- : 1825 ......................................................................... I, [2024-05-25T11:07:43.256065 #1946972] INFO -- : 1898 ......................................................................... I, [2024-05-25T11:07:43.647213 #1946972] INFO -- : 1971 ......................................................................... I, [2024-05-25T11:07:44.158862 #1946972] INFO -- : 2044 ......................................................................... I, [2024-05-25T11:07:44.265101 #1946972] INFO -- : 2117 ......................................................................... I, [2024-05-25T11:07:44.325286 #1946972] INFO -- : 2190 ......................................................................... I, [2024-05-25T11:07:44.375583 #1946972] INFO -- : 2263 ......................................................................... I, [2024-05-25T11:07:44.424876 #1946972] INFO -- : 2336 ......................................................................... I, [2024-05-25T11:07:44.517464 #1946972] INFO -- : 2409 ......................................................................... I, [2024-05-25T11:07:44.788994 #1946972] INFO -- : 2482 ......................................................................... I, [2024-05-25T11:07:44.921191 #1946972] INFO -- : 2555 ......................................................................... I, [2024-05-25T11:07:46.102526 #1946972] INFO -- : 2628 ......................................................................... I, [2024-05-25T11:07:46.301105 #1946972] INFO -- : 2701 ......................................................................... I, [2024-05-25T11:07:46.449815 #1946972] INFO -- : 2774 ......................................................................... I, [2024-05-25T11:07:46.780852 #1946972] INFO -- : 2847 ......................................................................... I, [2024-05-25T11:07:47.037690 #1946972] INFO -- : 2920 ......................................................................... I, [2024-05-25T11:07:47.152689 #1946972] INFO -- : 2993 ......................................................................... I, [2024-05-25T11:07:47.213738 #1946972] INFO -- : 3066 ......................................................................... I, [2024-05-25T11:07:47.255220 #1946972] INFO -- : 3139 ......................................................................... I, [2024-05-25T11:07:47.320245 #1946972] INFO -- : 3212 ......................................................................... I, [2024-05-25T11:07:47.389403 #1946972] INFO -- : 3285 ......................................................................... I, [2024-05-25T11:07:51.217457 #1946972] INFO -- : 3358 ......................................................................... I, [2024-05-25T11:07:51.238917 #1946972] INFO -- : I, [2024-05-25T11:07:51.238980 #1946972] INFO -- : I, [2024-05-25T11:07:51.238994 #1946972] INFO -- : Finished in 29.573340 seconds I, [2024-05-25T11:07:51.239004 #1946972] INFO -- : I, [2024-05-25T11:07:51.239013 #1946972] INFO -- : 3430 files, 32648 examples, 190935 expectations, 0 failures, 0 errors, 0 tagged I, [2024-05-25T11:07:51.240245 #1946972] INFO -- : $$$[end] "make yes-test-rubyspec MSPECOPT='--error-output stderr --debug -j' TESTS='-j3'" exit with 0.