# Logfile created on 2024-05-24 17:23:35 +0000 by logger.rb/v1.5.3 I, [2024-05-24T17:23:35.097757 #1735236] INFO -- : #, @formatter=nil, @logdev=#, @binmode=false, @mon_data=#, @mon_data_owner_object_id=860>>> I, [2024-05-24T17:23:35.098054 #1735236] INFO -- : $$$[beg] make update-unicode -j3 I, [2024-05-24T17:23:35.187053 #1735236] INFO -- : Downloading Unicode emoji 15.0 files... I, [2024-05-24T17:23:35.187120 #1735236] INFO -- : Downloading Unicode emoji 15.0 files... I, [2024-05-24T17:23:35.187573 #1735236] INFO -- : Downloading Unicode emoji 15.0 files... I, [2024-05-24T17:23:35.264162 #1735236] INFO -- : made symlink emoji/15.0/emoji-sequences.txt to /home/opc/ruby/src/master/.downloaded-cache/emoji/15.0/emoji-sequences.txt I, [2024-05-24T17:23:35.265587 #1735236] INFO -- : downloading emoji/15.0/emoji-test.txt ... /home/opc/ruby/src/master/enc/unicode/data/emoji/15.0/emoji-sequences.txt already exists I, [2024-05-24T17:23:35.272482 #1735236] INFO -- : downloading emoji/15.0/emoji-test.txt ... /home/opc/ruby/src/master/enc/unicode/data/emoji/15.0/emoji-sequences.txt already exists E, [2024-05-24T17:23:35.803118 #1735236] ERROR -- : /home/opc/ruby/src/master/tool/downloader.rb:302:in `rescue in download': failed to download emoji/15.0/emoji-test.txt (RuntimeError) E, [2024-05-24T17:23:35.803183 #1735236] ERROR -- : OpenURI::HTTPError: 403 Forbidden: https://www.unicode.org/Public/emoji/15.0/emoji-test.txt E, [2024-05-24T17:23:35.803194 #1735236] ERROR -- : from /home/opc/ruby/src/master/tool/downloader.rb:201:in `download' E, [2024-05-24T17:23:35.803204 #1735236] ERROR -- : from /home/opc/ruby/src/master/tool/downloader.rb:136:in `download' E, [2024-05-24T17:23:35.803213 #1735236] ERROR -- : from /home/opc/ruby/src/master/tool/downloader.rb:482:in `block in
' E, [2024-05-24T17:23:35.803222 #1735236] ERROR -- : from /home/opc/ruby/src/master/tool/downloader.rb:465:in `each' E, [2024-05-24T17:23:35.803230 #1735236] ERROR -- : from /home/opc/ruby/src/master/tool/downloader.rb:465:in `
' E, [2024-05-24T17:23:35.803238 #1735236] ERROR -- : /usr/local/lib/ruby/3.2.0/open-uri.rb:369:in `open_http': 403 Forbidden (OpenURI::HTTPError) E, [2024-05-24T17:23:35.803246 #1735236] ERROR -- : from /usr/local/lib/ruby/3.2.0/open-uri.rb:760:in `buffer_open' E, [2024-05-24T17:23:35.803254 #1735236] ERROR -- : from /usr/local/lib/ruby/3.2.0/open-uri.rb:214:in `block in open_loop' E, [2024-05-24T17:23:35.803263 #1735236] ERROR -- : from /usr/local/lib/ruby/3.2.0/open-uri.rb:212:in `catch' E, [2024-05-24T17:23:35.803271 #1735236] ERROR -- : from /usr/local/lib/ruby/3.2.0/open-uri.rb:212:in `open_loop' E, [2024-05-24T17:23:35.803278 #1735236] ERROR -- : from /usr/local/lib/ruby/3.2.0/open-uri.rb:153:in `open_uri' E, [2024-05-24T17:23:35.803286 #1735236] ERROR -- : from /usr/local/lib/ruby/3.2.0/open-uri.rb:740:in `open' E, [2024-05-24T17:23:35.803298 #1735236] ERROR -- : from /usr/local/lib/ruby/3.2.0/open-uri.rb:748:in `read' E, [2024-05-24T17:23:35.803306 #1735236] ERROR -- : from /home/opc/ruby/src/master/tool/downloader.rb:247:in `block in download' E, [2024-05-24T17:23:35.803314 #1735236] ERROR -- : from /home/opc/ruby/src/master/tool/downloader.rb:378:in `with_retry' E, [2024-05-24T17:23:35.803322 #1735236] ERROR -- : from /home/opc/ruby/src/master/tool/downloader.rb:246:in `download' E, [2024-05-24T17:23:35.803347 #1735236] ERROR -- : from /home/opc/ruby/src/master/tool/downloader.rb:136:in `download' E, [2024-05-24T17:23:35.803360 #1735236] ERROR -- : from /home/opc/ruby/src/master/tool/downloader.rb:482:in `block in
' E, [2024-05-24T17:23:35.803368 #1735236] ERROR -- : from /home/opc/ruby/src/master/tool/downloader.rb:465:in `each' E, [2024-05-24T17:23:35.803376 #1735236] ERROR -- : from /home/opc/ruby/src/master/tool/downloader.rb:465:in `
' E, [2024-05-24T17:23:35.806220 #1735236] ERROR -- : make: *** [uncommon.mk:1756: /home/opc/ruby/src/master/enc/unicode/data/emoji/15.0/emoji-test.txt] Error 1 E, [2024-05-24T17:23:35.806250 #1735236] ERROR -- : make: *** Waiting for unfinished jobs.... E, [2024-05-24T17:23:35.809276 #1735236] ERROR -- : /home/opc/ruby/src/master/tool/downloader.rb:302:in `rescue in download': failed to download emoji/15.0/emoji-test.txt (RuntimeError) E, [2024-05-24T17:23:35.809312 #1735236] ERROR -- : OpenURI::HTTPError: 403 Forbidden: https://www.unicode.org/Public/emoji/15.0/emoji-test.txt E, [2024-05-24T17:23:35.809322 #1735236] ERROR -- : from /home/opc/ruby/src/master/tool/downloader.rb:201:in `download' E, [2024-05-24T17:23:35.809331 #1735236] ERROR -- : from /home/opc/ruby/src/master/tool/downloader.rb:136:in `download' E, [2024-05-24T17:23:35.809340 #1735236] ERROR -- : from /home/opc/ruby/src/master/tool/downloader.rb:482:in `block in
' E, [2024-05-24T17:23:35.809348 #1735236] ERROR -- : from /home/opc/ruby/src/master/tool/downloader.rb:465:in `each' E, [2024-05-24T17:23:35.809357 #1735236] ERROR -- : from /home/opc/ruby/src/master/tool/downloader.rb:465:in `
' E, [2024-05-24T17:23:35.809365 #1735236] ERROR -- : /usr/local/lib/ruby/3.2.0/open-uri.rb:369:in `open_http': 403 Forbidden (OpenURI::HTTPError) E, [2024-05-24T17:23:35.809373 #1735236] ERROR -- : from /usr/local/lib/ruby/3.2.0/open-uri.rb:760:in `buffer_open' E, [2024-05-24T17:23:35.809381 #1735236] ERROR -- : from /usr/local/lib/ruby/3.2.0/open-uri.rb:214:in `block in open_loop' E, [2024-05-24T17:23:35.809389 #1735236] ERROR -- : from /usr/local/lib/ruby/3.2.0/open-uri.rb:212:in `catch' E, [2024-05-24T17:23:35.809397 #1735236] ERROR -- : from /usr/local/lib/ruby/3.2.0/open-uri.rb:212:in `open_loop' E, [2024-05-24T17:23:35.809405 #1735236] ERROR -- : from /usr/local/lib/ruby/3.2.0/open-uri.rb:153:in `open_uri' E, [2024-05-24T17:23:35.809413 #1735236] ERROR -- : from /usr/local/lib/ruby/3.2.0/open-uri.rb:740:in `open' E, [2024-05-24T17:23:35.809421 #1735236] ERROR -- : from /usr/local/lib/ruby/3.2.0/open-uri.rb:748:in `read' E, [2024-05-24T17:23:35.809429 #1735236] ERROR -- : from /home/opc/ruby/src/master/tool/downloader.rb:247:in `block in download' E, [2024-05-24T17:23:35.809437 #1735236] ERROR -- : from /home/opc/ruby/src/master/tool/downloader.rb:378:in `with_retry' E, [2024-05-24T17:23:35.809445 #1735236] ERROR -- : from /home/opc/ruby/src/master/tool/downloader.rb:246:in `download' E, [2024-05-24T17:23:35.809453 #1735236] ERROR -- : from /home/opc/ruby/src/master/tool/downloader.rb:136:in `download' E, [2024-05-24T17:23:35.809461 #1735236] ERROR -- : from /home/opc/ruby/src/master/tool/downloader.rb:482:in `block in
' E, [2024-05-24T17:23:35.809469 #1735236] ERROR -- : from /home/opc/ruby/src/master/tool/downloader.rb:465:in `each' E, [2024-05-24T17:23:35.809477 #1735236] ERROR -- : from /home/opc/ruby/src/master/tool/downloader.rb:465:in `
' E, [2024-05-24T17:23:35.812228 #1735236] ERROR -- : make: *** [uncommon.mk:1756: /home/opc/ruby/src/master/enc/unicode/data/emoji/15.0/emoji-sequences.txt] Error 1 E, [2024-05-24T17:23:35.812253 #1735236] ERROR -- : make: *** Deleting file '/home/opc/ruby/src/master/enc/unicode/data/emoji/15.0/emoji-sequences.txt' E, [2024-05-24T17:23:35.814056 #1735236] ERROR -- : /home/opc/ruby/src/master/tool/downloader.rb:302:in `rescue in download': failed to download emoji/15.0/emoji-test.txt (RuntimeError) E, [2024-05-24T17:23:35.814100 #1735236] ERROR -- : OpenURI::HTTPError: 403 Forbidden: https://www.unicode.org/Public/emoji/15.0/emoji-test.txt E, [2024-05-24T17:23:35.814111 #1735236] ERROR -- : from /home/opc/ruby/src/master/tool/downloader.rb:201:in `download' E, [2024-05-24T17:23:35.814121 #1735236] ERROR -- : from /home/opc/ruby/src/master/tool/downloader.rb:136:in `download' E, [2024-05-24T17:23:35.814129 #1735236] ERROR -- : from /home/opc/ruby/src/master/tool/downloader.rb:482:in `block in
' E, [2024-05-24T17:23:35.814137 #1735236] ERROR -- : from /home/opc/ruby/src/master/tool/downloader.rb:465:in `each' E, [2024-05-24T17:23:35.814146 #1735236] ERROR -- : from /home/opc/ruby/src/master/tool/downloader.rb:465:in `
' E, [2024-05-24T17:23:35.814154 #1735236] ERROR -- : /usr/local/lib/ruby/3.2.0/open-uri.rb:369:in `open_http': 403 Forbidden (OpenURI::HTTPError) E, [2024-05-24T17:23:35.814162 #1735236] ERROR -- : from /usr/local/lib/ruby/3.2.0/open-uri.rb:760:in `buffer_open' E, [2024-05-24T17:23:35.814170 #1735236] ERROR -- : from /usr/local/lib/ruby/3.2.0/open-uri.rb:214:in `block in open_loop' E, [2024-05-24T17:23:35.814178 #1735236] ERROR -- : from /usr/local/lib/ruby/3.2.0/open-uri.rb:212:in `catch' E, [2024-05-24T17:23:35.814187 #1735236] ERROR -- : from /usr/local/lib/ruby/3.2.0/open-uri.rb:212:in `open_loop' E, [2024-05-24T17:23:35.814195 #1735236] ERROR -- : from /usr/local/lib/ruby/3.2.0/open-uri.rb:153:in `open_uri' E, [2024-05-24T17:23:35.814203 #1735236] ERROR -- : from /usr/local/lib/ruby/3.2.0/open-uri.rb:740:in `open' E, [2024-05-24T17:23:35.814211 #1735236] ERROR -- : from /usr/local/lib/ruby/3.2.0/open-uri.rb:748:in `read' E, [2024-05-24T17:23:35.814219 #1735236] ERROR -- : from /home/opc/ruby/src/master/tool/downloader.rb:247:in `block in download' E, [2024-05-24T17:23:35.814227 #1735236] ERROR -- : from /home/opc/ruby/src/master/tool/downloader.rb:378:in `with_retry' E, [2024-05-24T17:23:35.814235 #1735236] ERROR -- : from /home/opc/ruby/src/master/tool/downloader.rb:246:in `download' E, [2024-05-24T17:23:35.814243 #1735236] ERROR -- : from /home/opc/ruby/src/master/tool/downloader.rb:136:in `download' E, [2024-05-24T17:23:35.814251 #1735236] ERROR -- : from /home/opc/ruby/src/master/tool/downloader.rb:482:in `block in
' E, [2024-05-24T17:23:35.814259 #1735236] ERROR -- : from /home/opc/ruby/src/master/tool/downloader.rb:465:in `each' E, [2024-05-24T17:23:35.814267 #1735236] ERROR -- : from /home/opc/ruby/src/master/tool/downloader.rb:465:in `
' E, [2024-05-24T17:23:35.817020 #1735236] ERROR -- : make: *** [uncommon.mk:1756: /home/opc/ruby/src/master/enc/unicode/data/emoji/15.0/emoji-zwj-sequences.txt] Error 1 I, [2024-05-24T17:23:35.817095 #1735236] INFO -- : downloading emoji/15.0/emoji-test.txt ... I, [2024-05-24T17:23:35.817252 #1735236] INFO -- : $$$[end] "make update-unicode -j3" exit with 512. I, [2024-05-24T17:23:35.817284 #1735236] INFO -- : $$$[beg] make update-download -j3 I, [2024-05-24T17:23:35.979423 #1735236] INFO -- : tool/config.guess already exists I, [2024-05-24T17:23:35.979512 #1735236] INFO -- : tool/config.sub already exists I, [2024-05-24T17:23:35.982249 #1735236] INFO -- : Update power_assert to 84e85124c5014a139af39161d484156cfe87a9ed I, [2024-05-24T17:23:35.982445 #1735236] INFO -- : Update rbs to ba7872795d5de04adb8ff500c0e6afdc81a041dd I, [2024-05-24T17:23:35.982622 #1735236] INFO -- : Update typeprof to b19a6416da3a05d57fadd6ffdadb382b6d236ca5 I, [2024-05-24T17:23:35.985649 #1735236] INFO -- : echo 84e85124c5014a139af39161d484156cfe87a9ed | /bin/sh /home/opc/ruby/src/master/tool/ifchange /home/opc/ruby/src/master/.bundle/.timestamp/power_assert.revision - I, [2024-05-24T17:23:35.985940 #1735236] INFO -- : echo ba7872795d5de04adb8ff500c0e6afdc81a041dd | /bin/sh /home/opc/ruby/src/master/tool/ifchange /home/opc/ruby/src/master/.bundle/.timestamp/rbs.revision - I, [2024-05-24T17:23:35.986060 #1735236] INFO -- : echo b19a6416da3a05d57fadd6ffdadb382b6d236ca5 | /bin/sh /home/opc/ruby/src/master/tool/ifchange /home/opc/ruby/src/master/.bundle/.timestamp/typeprof.revision - I, [2024-05-24T17:23:35.991451 #1735236] INFO -- : /home/opc/ruby/src/master/.bundle/.timestamp/rbs.revision unchanged I, [2024-05-24T17:23:35.991506 #1735236] INFO -- : /home/opc/ruby/src/master/.bundle/.timestamp/power_assert.revision unchanged I, [2024-05-24T17:23:35.992466 #1735236] INFO -- : /home/opc/ruby/src/master/.bundle/.timestamp/typeprof.revision unchanged I, [2024-05-24T17:23:36.080252 #1735236] INFO -- : Building power_assert@84e85124c5014a139af39161d484156cfe87a9ed to /home/opc/ruby/src/master/gems/power_assert-2.0.3.gem I, [2024-05-24T17:23:36.189170 #1735236] INFO -- : Successfully built RubyGem I, [2024-05-24T17:23:36.189239 #1735236] INFO -- : Name: power_assert I, [2024-05-24T17:23:36.189260 #1735236] INFO -- : Version: 2.0.4dev I, [2024-05-24T17:23:36.189276 #1735236] INFO -- : File: power_assert-2.0.4dev.gem I, [2024-05-24T17:23:36.268386 #1735236] INFO -- : $$$[end] "make update-download -j3" exit with 0. I, [2024-05-24T17:23:36.268458 #1735236] INFO -- : $$$[beg] make update-rubyspec -j3 I, [2024-05-24T17:23:36.359296 #1735236] INFO -- : make: Nothing to be done for 'update-rubyspec'. I, [2024-05-24T17:23:36.359459 #1735236] INFO -- : $$$[end] "make update-rubyspec -j3" exit with 0. I, [2024-05-24T17:23:36.359506 #1735236] INFO -- : $$$[beg] make update-src -j3 E, [2024-05-24T17:23:37.725748 #1735236] ERROR -- : From https://github.com/ruby/ruby E, [2024-05-24T17:23:37.725816 #1735236] ERROR -- : 47b723f..f8b7503 master -> origin/master I, [2024-05-24T17:23:37.763240 #1735236] INFO -- : Updating 47b723f..f8b7503 I, [2024-05-24T17:23:37.763310 #1735236] INFO -- : Fast-forward I, [2024-05-24T17:23:37.775788 #1735236] INFO -- : lib/prism.rb | 2 - I, [2024-05-24T17:23:37.775840 #1735236] INFO -- : lib/prism/debug.rb | 249 -------------------- I, [2024-05-24T17:23:37.775851 #1735236] INFO -- : lib/prism/ffi.rb | 2 +- I, [2024-05-24T17:23:37.775860 #1735236] INFO -- : lib/prism/prism.gemspec | 1 - I, [2024-05-24T17:23:37.775868 #1735236] INFO -- : prism/extension.c | 479 +++++++++----------------------------- I, [2024-05-24T17:23:37.775877 #1735236] INFO -- : prism/node.h | 21 -- I, [2024-05-24T17:23:37.775886 #1735236] INFO -- : prism/prism.c | 362 ---------------------------- I, [2024-05-24T17:23:37.775894 #1735236] INFO -- : prism/prism.h | 11 - I, [2024-05-24T17:23:37.775902 #1735236] INFO -- : prism/static_literals.c | 2 +- I, [2024-05-24T17:23:37.775910 #1735236] INFO -- : prism/static_literals.h | 2 +- I, [2024-05-24T17:23:37.775918 #1735236] INFO -- : prism/templates/src/node.c.erb | 64 ----- I, [2024-05-24T17:23:37.775926 #1735236] INFO -- : prism/util/pm_char.h | 3 +- I, [2024-05-24T17:23:37.775934 #1735236] INFO -- : prism/util/pm_constant_pool.c | 8 - I, [2024-05-24T17:23:37.775967 #1735236] INFO -- : prism/util/pm_constant_pool.h | 8 - I, [2024-05-24T17:23:37.775980 #1735236] INFO -- : prism/util/pm_integer.c | 10 +- I, [2024-05-24T17:23:37.775989 #1735236] INFO -- : prism/util/pm_integer.h | 10 +- I, [2024-05-24T17:23:37.775998 #1735236] INFO -- : prism/util/pm_string.c | 12 - I, [2024-05-24T17:23:37.776006 #1735236] INFO -- : prism/util/pm_string.h | 8 - I, [2024-05-24T17:23:37.776014 #1735236] INFO -- : test/prism/comments_test.rb | 2 +- I, [2024-05-24T17:23:37.776022 #1735236] INFO -- : test/prism/format_errors_test.rb | 58 ----- I, [2024-05-24T17:23:37.776032 #1735236] INFO -- : test/prism/integer_parse_test.rb | 6 +- I, [2024-05-24T17:23:37.776041 #1735236] INFO -- : test/prism/locals_test.rb | 185 ++++++++++++++- I, [2024-05-24T17:23:37.776049 #1735236] INFO -- : test/prism/memsize_test.rb | 17 -- I, [2024-05-24T17:23:37.776057 #1735236] INFO -- : test/prism/newline_test.rb | 2 +- I, [2024-05-24T17:23:37.776065 #1735236] INFO -- : test/prism/parse_test.rb | 2 +- I, [2024-05-24T17:23:37.776073 #1735236] INFO -- : test/prism/regexp_test.rb | 120 +++++----- I, [2024-05-24T17:23:37.776081 #1735236] INFO -- : test/prism/static_inspect_test.rb | 5 +- I, [2024-05-24T17:23:37.776089 #1735236] INFO -- : 27 files changed, 361 insertions(+), 1290 deletions(-) I, [2024-05-24T17:23:37.776097 #1735236] INFO -- : delete mode 100644 lib/prism/debug.rb I, [2024-05-24T17:23:37.776105 #1735236] INFO -- : delete mode 100644 test/prism/format_errors_test.rb I, [2024-05-24T17:23:37.776113 #1735236] INFO -- : delete mode 100644 test/prism/memsize_test.rb I, [2024-05-24T17:23:37.790675 #1735236] INFO -- : Latest commit hash = f8b750370e I, [2024-05-24T17:23:37.791318 #1735236] INFO -- : $$$[end] "make update-src -j3" exit with 0. I, [2024-05-24T17:23:37.791347 #1735236] INFO -- : $$$[beg] make after-update -j3 I, [2024-05-24T17:23:37.900846 #1735236] INFO -- : generating /home/opc/ruby/src/master/ext/ripper/eventids2table.c I, [2024-05-24T17:23:37.906716 #1735236] INFO -- : make[1]: Entering directory '/home/opc/ruby/src/master/ext/ripper' I, [2024-05-24T17:23:37.906779 #1735236] INFO -- : make[1]: Nothing to be done for 'src'. I, [2024-05-24T17:23:37.906806 #1735236] INFO -- : make[1]: Leaving directory '/home/opc/ruby/src/master/ext/ripper' I, [2024-05-24T17:23:37.933380 #1735236] INFO -- : /home/opc/ruby/src/master/revision.h updated I, [2024-05-24T17:23:37.934528 #1735236] INFO -- : generating aarch64-linux-fake.rb I, [2024-05-24T17:23:37.994534 #1735236] INFO -- : aarch64-linux-fake.rb updated I, [2024-05-24T17:23:37.996084 #1735236] INFO -- : generating enc.mk I, [2024-05-24T17:23:38.230131 #1735236] INFO -- : making srcs under enc I, [2024-05-24T17:23:38.272019 #1735236] INFO -- : make[1]: Entering directory '/home/opc/ruby/build/master' I, [2024-05-24T17:23:38.272103 #1735236] INFO -- : make[1]: Nothing to be done for 'srcs'. I, [2024-05-24T17:23:38.272123 #1735236] INFO -- : make[1]: Leaving directory '/home/opc/ruby/build/master' I, [2024-05-24T17:23:38.353238 #1735236] INFO -- : Update power_assert to 84e85124c5014a139af39161d484156cfe87a9ed I, [2024-05-24T17:23:38.353353 #1735236] INFO -- : Update rbs to ba7872795d5de04adb8ff500c0e6afdc81a041dd I, [2024-05-24T17:23:38.354165 #1735236] INFO -- : Update typeprof to b19a6416da3a05d57fadd6ffdadb382b6d236ca5 I, [2024-05-24T17:23:38.357109 #1735236] INFO -- : echo 84e85124c5014a139af39161d484156cfe87a9ed | /bin/sh /home/opc/ruby/src/master/tool/ifchange /home/opc/ruby/src/master/.bundle/.timestamp/power_assert.revision - I, [2024-05-24T17:23:38.357338 #1735236] INFO -- : echo ba7872795d5de04adb8ff500c0e6afdc81a041dd | /bin/sh /home/opc/ruby/src/master/tool/ifchange /home/opc/ruby/src/master/.bundle/.timestamp/rbs.revision - I, [2024-05-24T17:23:38.357687 #1735236] INFO -- : echo b19a6416da3a05d57fadd6ffdadb382b6d236ca5 | /bin/sh /home/opc/ruby/src/master/tool/ifchange /home/opc/ruby/src/master/.bundle/.timestamp/typeprof.revision - I, [2024-05-24T17:23:38.363120 #1735236] INFO -- : /home/opc/ruby/src/master/.bundle/.timestamp/rbs.revision unchanged I, [2024-05-24T17:23:38.363346 #1735236] INFO -- : /home/opc/ruby/src/master/.bundle/.timestamp/typeprof.revision unchanged I, [2024-05-24T17:23:38.363581 #1735236] INFO -- : /home/opc/ruby/src/master/.bundle/.timestamp/power_assert.revision unchanged I, [2024-05-24T17:23:38.470006 #1735236] INFO -- : Building power_assert@84e85124c5014a139af39161d484156cfe87a9ed to /home/opc/ruby/src/master/gems/power_assert-2.0.3.gem I, [2024-05-24T17:23:38.582629 #1735236] INFO -- : Successfully built RubyGem I, [2024-05-24T17:23:38.582683 #1735236] INFO -- : Name: power_assert I, [2024-05-24T17:23:38.582693 #1735236] INFO -- : Version: 2.0.4dev I, [2024-05-24T17:23:38.582702 #1735236] INFO -- : File: power_assert-2.0.4dev.gem I, [2024-05-24T17:23:38.584995 #1735236] INFO -- : Extracting bundle gem power_assert-2.0.3... I, [2024-05-24T17:23:38.682155 #1735236] INFO -- : Try with hash version of bundled gems instead of gems/power_assert-2.0.3.gem. We don't use this gem with release version of Ruby. I, [2024-05-24T17:23:38.692596 #1735236] INFO -- : Unpacked gems/power_assert-2.0.4dev.gem I, [2024-05-24T17:23:38.694543 #1735236] INFO -- : $$$[end] "make after-update -j3" exit with 0. I, [2024-05-24T17:23:38.694700 #1735236] INFO -- : $$$[beg] make miniruby -j3 I, [2024-05-24T17:23:38.783628 #1735236] INFO -- : BASERUBY = /usr/local/bin/ruby --disable=gems I, [2024-05-24T17:23:38.783747 #1735236] INFO -- : CC = gcc I, [2024-05-24T17:23:38.783788 #1735236] INFO -- : LD = ld I, [2024-05-24T17:23:38.783801 #1735236] INFO -- : LDSHARED = gcc -shared I, [2024-05-24T17:23:38.783811 #1735236] INFO -- : CFLAGS = -O3 -fno-fast-math -ggdb3 -Wall -Wextra -Wdeprecated-declarations -Wdiv-by-zero -Wduplicated-cond -Wimplicit-function-declaration -Wimplicit-int -Wpointer-arith -Wwrite-strings -Wold-style-definition -Wimplicit-fallthrough=0 -Wmissing-noreturn -Wno-cast-function-type -Wno-constant-logical-operand -Wno-long-long -Wno-missing-field-initializers -Wno-overlength-strings -Wno-packed-bitfield-compat -Wno-parentheses-equality -Wno-self-assign -Wno-tautological-compare -Wno-unused-parameter -Wno-unused-value -Wsuggest-attribute=format -Wsuggest-attribute=noreturn -Wunused-variable -Wmisleading-indentation -Wundef I, [2024-05-24T17:23:38.783820 #1735236] INFO -- : XCFLAGS = -U_FORTIFY_SOURCE -D_FORTIFY_SOURCE=2 -fstack-protector-strong -msign-return-address=all -fno-strict-overflow -fvisibility=hidden -fexcess-precision=standard -DRUBY_EXPORT -fPIE -I. -I.ext/include/aarch64-linux -I/home/opc/ruby/src/master/include -I/home/opc/ruby/src/master -I/home/opc/ruby/src/master/prism -I/home/opc/ruby/src/master/enc/unicode/15.0.0 I, [2024-05-24T17:23:38.783829 #1735236] INFO -- : CPPFLAGS = I, [2024-05-24T17:23:38.783839 #1735236] INFO -- : DLDFLAGS = -Wl,--compress-debug-sections=zlib -fstack-protector-strong -pie I, [2024-05-24T17:23:38.783848 #1735236] INFO -- : SOLIBS = -lz -lrt -lrt -ldl -lcrypt -lm -lpthread I, [2024-05-24T17:23:38.783856 #1735236] INFO -- : LANG = en_US.UTF-8 I, [2024-05-24T17:23:38.783864 #1735236] INFO -- : LC_ALL = I, [2024-05-24T17:23:38.783872 #1735236] INFO -- : LC_CTYPE = I, [2024-05-24T17:23:38.783880 #1735236] INFO -- : MFLAGS = -j3 --jobserver-auth=4,5 I, [2024-05-24T17:23:38.783888 #1735236] INFO -- : RUSTC = rustc I, [2024-05-24T17:23:38.783895 #1735236] INFO -- : YJIT_RUSTC_ARGS = --crate-name=yjit --crate-type=staticlib --edition=2021 -g -C lto=thin -C opt-level=3 -C overflow-checks=on '--out-dir=/home/opc/ruby/build/master/yjit/target/release/' /home/opc/ruby/src/master/yjit/src/lib.rs I, [2024-05-24T17:23:38.784626 #1735236] INFO -- : gcc (GCC) 8.5.0 20210514 (Red Hat 8.5.0-10.1.0.1) I, [2024-05-24T17:23:38.784659 #1735236] INFO -- : Copyright (C) 2018 Free Software Foundation, Inc. I, [2024-05-24T17:23:38.784670 #1735236] INFO -- : This is free software; see the source for copying conditions. There is NO I, [2024-05-24T17:23:38.784680 #1735236] INFO -- : warranty; not even for MERCHANTABILITY or FITNESS FOR A PARTICULAR PURPOSE. I, [2024-05-24T17:23:38.784688 #1735236] INFO -- : I, [2024-05-24T17:23:38.794780 #1735236] INFO -- : compiling /home/opc/ruby/src/master/miniinit.c I, [2024-05-24T17:23:38.795826 #1735236] INFO -- : compiling /home/opc/ruby/src/master/ast.c I, [2024-05-24T17:23:38.803497 #1735236] INFO -- : compiling /home/opc/ruby/src/master/compile.c I, [2024-05-24T17:23:39.039262 #1735236] INFO -- : compiling /home/opc/ruby/src/master/cont.c I, [2024-05-24T17:23:39.348360 #1735236] INFO -- : compiling /home/opc/ruby/src/master/eval.c I, [2024-05-24T17:23:40.400631 #1735236] INFO -- : compiling /home/opc/ruby/src/master/gc.c I, [2024-05-24T17:23:40.483207 #1735236] INFO -- : compiling /home/opc/ruby/src/master/hash.c I, [2024-05-24T17:23:43.185899 #1735236] INFO -- : compiling /home/opc/ruby/src/master/iseq.c I, [2024-05-24T17:23:44.319082 #1735236] INFO -- : compiling /home/opc/ruby/src/master/load.c I, [2024-05-24T17:23:45.025443 #1735236] INFO -- : compiling /home/opc/ruby/src/master/rjit.c I, [2024-05-24T17:23:45.068895 #1735236] INFO -- : compiling /home/opc/ruby/src/master/rjit_c.c I, [2024-05-24T17:23:45.417228 #1735236] INFO -- : compiling /home/opc/ruby/src/master/proc.c I, [2024-05-24T17:23:46.396438 #1735236] INFO -- : compiling /home/opc/ruby/src/master/ruby.c I, [2024-05-24T17:23:46.795087 #1735236] INFO -- : compiling /home/opc/ruby/src/master/thread.c I, [2024-05-24T17:23:47.489644 #1735236] INFO -- : compiling /home/opc/ruby/src/master/version.c I, [2024-05-24T17:23:47.629019 #1735236] INFO -- : compiling /home/opc/ruby/src/master/vm.c E, [2024-05-24T17:23:48.732942 #1735236] ERROR -- : /home/opc/ruby/src/master/thread.c: In function ‘rb_nogvl’: E, [2024-05-24T17:23:48.733077 #1735236] ERROR -- : /home/opc/ruby/src/master/thread.c:1529:14: warning: variable ‘vm’ might be clobbered by ‘longjmp’ or ‘vfork’ [-Wclobbered] E, [2024-05-24T17:23:48.733093 #1735236] ERROR -- : rb_vm_t *vm = rb_ec_vm_ptr(ec); E, [2024-05-24T17:23:48.733103 #1735236] ERROR -- : ^~ E, [2024-05-24T17:23:49.208943 #1735236] ERROR -- : /home/opc/ruby/src/master/thread.c: At top level: E, [2024-05-24T17:23:49.209025 #1735236] ERROR -- : cc1: warning: unrecognized command line option ‘-Wno-self-assign’ E, [2024-05-24T17:23:49.209056 #1735236] ERROR -- : cc1: warning: unrecognized command line option ‘-Wno-parentheses-equality’ E, [2024-05-24T17:23:49.209089 #1735236] ERROR -- : cc1: warning: unrecognized command line option ‘-Wno-constant-logical-operand’ I, [2024-05-24T17:23:49.478798 #1735236] INFO -- : compiling /home/opc/ruby/src/master/vm_backtrace.c I, [2024-05-24T17:23:50.342044 #1735236] INFO -- : compiling /home/opc/ruby/src/master/vm_dump.c I, [2024-05-24T17:23:50.753276 #1735236] INFO -- : compiling /home/opc/ruby/src/master/vm_trace.c I, [2024-05-24T17:23:52.030204 #1735236] INFO -- : compiling prism/api_node.c I, [2024-05-24T17:23:53.976806 #1735236] INFO -- : compiling /home/opc/ruby/src/master/prism/api_pack.c I, [2024-05-24T17:23:54.210240 #1735236] INFO -- : compiling prism/diagnostic.c I, [2024-05-24T17:23:54.335784 #1735236] INFO -- : compiling /home/opc/ruby/src/master/prism/extension.c I, [2024-05-24T17:23:54.793423 #1735236] INFO -- : compiling prism/node.c I, [2024-05-24T17:23:55.288711 #1735236] INFO -- : compiling /home/opc/ruby/src/master/prism/options.c I, [2024-05-24T17:23:55.379513 #1735236] INFO -- : compiling prism/prettyprint.c I, [2024-05-24T17:23:56.623869 #1735236] INFO -- : compiling /home/opc/ruby/src/master/prism/regexp.c I, [2024-05-24T17:23:56.772431 #1735236] INFO -- : compiling prism/serialize.c I, [2024-05-24T17:23:57.425924 #1735236] INFO -- : compiling /home/opc/ruby/src/master/prism/static_literals.c I, [2024-05-24T17:23:57.489549 #1735236] INFO -- : compiling prism/token_type.c I, [2024-05-24T17:23:57.591268 #1735236] INFO -- : compiling /home/opc/ruby/src/master/prism/util/pm_buffer.c I, [2024-05-24T17:23:57.730099 #1735236] INFO -- : compiling /home/opc/ruby/src/master/prism/util/pm_char.c I, [2024-05-24T17:23:57.801485 #1735236] INFO -- : compiling /home/opc/ruby/src/master/prism/util/pm_constant_pool.c I, [2024-05-24T17:23:57.838366 #1735236] INFO -- : compiling /home/opc/ruby/src/master/prism/util/pm_integer.c I, [2024-05-24T17:23:57.951557 #1735236] INFO -- : compiling /home/opc/ruby/src/master/prism/util/pm_memchr.c I, [2024-05-24T17:23:57.996482 #1735236] INFO -- : compiling /home/opc/ruby/src/master/prism/util/pm_string.c I, [2024-05-24T17:23:58.073546 #1735236] INFO -- : compiling /home/opc/ruby/src/master/prism/util/pm_string_list.c I, [2024-05-24T17:23:58.125279 #1735236] INFO -- : compiling /home/opc/ruby/src/master/prism/util/pm_strpbrk.c I, [2024-05-24T17:23:58.208173 #1735236] INFO -- : compiling /home/opc/ruby/src/master/prism/prism.c I, [2024-05-24T17:23:58.219799 #1735236] INFO -- : compiling /home/opc/ruby/src/master/prism_init.c I, [2024-05-24T17:24:05.566059 #1735236] INFO -- : linking miniruby I, [2024-05-24T17:24:06.457258 #1735236] INFO -- : $$$[end] "make miniruby -j3" exit with 0. I, [2024-05-24T17:24:06.457440 #1735236] INFO -- : $$$[beg] make ruby -j3 I, [2024-05-24T17:24:06.546427 #1735236] INFO -- : BASERUBY = /usr/local/bin/ruby --disable=gems I, [2024-05-24T17:24:06.546497 #1735236] INFO -- : CC = gcc I, [2024-05-24T17:24:06.546508 #1735236] INFO -- : LD = ld I, [2024-05-24T17:24:06.546517 #1735236] INFO -- : LDSHARED = gcc -shared I, [2024-05-24T17:24:06.546528 #1735236] INFO -- : CFLAGS = -O3 -fno-fast-math -ggdb3 -Wall -Wextra -Wdeprecated-declarations -Wdiv-by-zero -Wduplicated-cond -Wimplicit-function-declaration -Wimplicit-int -Wpointer-arith -Wwrite-strings -Wold-style-definition -Wimplicit-fallthrough=0 -Wmissing-noreturn -Wno-cast-function-type -Wno-constant-logical-operand -Wno-long-long -Wno-missing-field-initializers -Wno-overlength-strings -Wno-packed-bitfield-compat -Wno-parentheses-equality -Wno-self-assign -Wno-tautological-compare -Wno-unused-parameter -Wno-unused-value -Wsuggest-attribute=format -Wsuggest-attribute=noreturn -Wunused-variable -Wmisleading-indentation -Wundef I, [2024-05-24T17:24:06.546538 #1735236] INFO -- : XCFLAGS = -U_FORTIFY_SOURCE -D_FORTIFY_SOURCE=2 -fstack-protector-strong -msign-return-address=all -fno-strict-overflow -fvisibility=hidden -fexcess-precision=standard -DRUBY_EXPORT -fPIE -I. -I.ext/include/aarch64-linux -I/home/opc/ruby/src/master/include -I/home/opc/ruby/src/master -I/home/opc/ruby/src/master/prism -I/home/opc/ruby/src/master/enc/unicode/15.0.0 I, [2024-05-24T17:24:06.546546 #1735236] INFO -- : CPPFLAGS = I, [2024-05-24T17:24:06.546555 #1735236] INFO -- : DLDFLAGS = -Wl,--compress-debug-sections=zlib -fstack-protector-strong -pie I, [2024-05-24T17:24:06.546564 #1735236] INFO -- : SOLIBS = -lz -lrt -lrt -ldl -lcrypt -lm -lpthread I, [2024-05-24T17:24:06.546572 #1735236] INFO -- : LANG = en_US.UTF-8 I, [2024-05-24T17:24:06.546580 #1735236] INFO -- : LC_ALL = I, [2024-05-24T17:24:06.546588 #1735236] INFO -- : LC_CTYPE = I, [2024-05-24T17:24:06.546596 #1735236] INFO -- : MFLAGS = -j3 --jobserver-auth=4,5 I, [2024-05-24T17:24:06.546604 #1735236] INFO -- : RUSTC = rustc I, [2024-05-24T17:24:06.546612 #1735236] INFO -- : YJIT_RUSTC_ARGS = --crate-name=yjit --crate-type=staticlib --edition=2021 -g -C lto=thin -C opt-level=3 -C overflow-checks=on '--out-dir=/home/opc/ruby/build/master/yjit/target/release/' /home/opc/ruby/src/master/yjit/src/lib.rs I, [2024-05-24T17:24:06.547356 #1735236] INFO -- : gcc (GCC) 8.5.0 20210514 (Red Hat 8.5.0-10.1.0.1) I, [2024-05-24T17:24:06.547392 #1735236] INFO -- : Copyright (C) 2018 Free Software Foundation, Inc. I, [2024-05-24T17:24:06.547402 #1735236] INFO -- : This is free software; see the source for copying conditions. There is NO I, [2024-05-24T17:24:06.547412 #1735236] INFO -- : warranty; not even for MERCHANTABILITY or FITNESS FOR A PARTICULAR PURPOSE. I, [2024-05-24T17:24:06.547421 #1735236] INFO -- : I, [2024-05-24T17:24:06.727551 #1735236] INFO -- : builtin_binary.inc updated I, [2024-05-24T17:24:06.732331 #1735236] INFO -- : c86294a81d0df6836359a6b5498b71b1ddba3062aa6ec87c7b2896368a948a19 builtin_binary.inc I, [2024-05-24T17:24:06.733450 #1735236] INFO -- : compiling /home/opc/ruby/src/master/builtin.c I, [2024-05-24T17:24:07.056624 #1735236] INFO -- : linking static-library libruby-static.a I, [2024-05-24T17:24:09.258277 #1735236] INFO -- : linking ruby I, [2024-05-24T17:24:10.151508 #1735236] INFO -- : $$$[end] "make ruby -j3" exit with 0. I, [2024-05-24T17:24:10.151679 #1735236] INFO -- : $$$[beg] make all -j3 I, [2024-05-24T17:24:10.239278 #1735236] INFO -- : BASERUBY = /usr/local/bin/ruby --disable=gems I, [2024-05-24T17:24:10.239340 #1735236] INFO -- : CC = gcc I, [2024-05-24T17:24:10.239351 #1735236] INFO -- : LD = ld I, [2024-05-24T17:24:10.239362 #1735236] INFO -- : LDSHARED = gcc -shared I, [2024-05-24T17:24:10.239371 #1735236] INFO -- : CFLAGS = -O3 -fno-fast-math -ggdb3 -Wall -Wextra -Wdeprecated-declarations -Wdiv-by-zero -Wduplicated-cond -Wimplicit-function-declaration -Wimplicit-int -Wpointer-arith -Wwrite-strings -Wold-style-definition -Wimplicit-fallthrough=0 -Wmissing-noreturn -Wno-cast-function-type -Wno-constant-logical-operand -Wno-long-long -Wno-missing-field-initializers -Wno-overlength-strings -Wno-packed-bitfield-compat -Wno-parentheses-equality -Wno-self-assign -Wno-tautological-compare -Wno-unused-parameter -Wno-unused-value -Wsuggest-attribute=format -Wsuggest-attribute=noreturn -Wunused-variable -Wmisleading-indentation -Wundef I, [2024-05-24T17:24:10.239380 #1735236] INFO -- : XCFLAGS = -U_FORTIFY_SOURCE -D_FORTIFY_SOURCE=2 -fstack-protector-strong -msign-return-address=all -fno-strict-overflow -fvisibility=hidden -fexcess-precision=standard -DRUBY_EXPORT -fPIE -I. -I.ext/include/aarch64-linux -I/home/opc/ruby/src/master/include -I/home/opc/ruby/src/master -I/home/opc/ruby/src/master/prism -I/home/opc/ruby/src/master/enc/unicode/15.0.0 I, [2024-05-24T17:24:10.239389 #1735236] INFO -- : CPPFLAGS = I, [2024-05-24T17:24:10.239397 #1735236] INFO -- : DLDFLAGS = -Wl,--compress-debug-sections=zlib -fstack-protector-strong -pie I, [2024-05-24T17:24:10.239405 #1735236] INFO -- : SOLIBS = -lz -lrt -lrt -ldl -lcrypt -lm -lpthread I, [2024-05-24T17:24:10.239413 #1735236] INFO -- : LANG = en_US.UTF-8 I, [2024-05-24T17:24:10.239421 #1735236] INFO -- : LC_ALL = I, [2024-05-24T17:24:10.239429 #1735236] INFO -- : LC_CTYPE = I, [2024-05-24T17:24:10.239437 #1735236] INFO -- : MFLAGS = -j3 --jobserver-auth=4,5 I, [2024-05-24T17:24:10.239445 #1735236] INFO -- : RUSTC = rustc I, [2024-05-24T17:24:10.239453 #1735236] INFO -- : YJIT_RUSTC_ARGS = --crate-name=yjit --crate-type=staticlib --edition=2021 -g -C lto=thin -C opt-level=3 -C overflow-checks=on '--out-dir=/home/opc/ruby/build/master/yjit/target/release/' /home/opc/ruby/src/master/yjit/src/lib.rs I, [2024-05-24T17:24:10.240177 #1735236] INFO -- : gcc (GCC) 8.5.0 20210514 (Red Hat 8.5.0-10.1.0.1) I, [2024-05-24T17:24:10.240210 #1735236] INFO -- : Copyright (C) 2018 Free Software Foundation, Inc. I, [2024-05-24T17:24:10.240220 #1735236] INFO -- : This is free software; see the source for copying conditions. There is NO I, [2024-05-24T17:24:10.240229 #1735236] INFO -- : warranty; not even for MERCHANTABILITY or FITNESS FOR A PARTICULAR PURPOSE. I, [2024-05-24T17:24:10.240238 #1735236] INFO -- : I, [2024-05-24T17:24:10.272866 #1735236] INFO -- : generating encdb.h I, [2024-05-24T17:24:10.274189 #1735236] INFO -- : generating enc.mk I, [2024-05-24T17:24:10.310472 #1735236] INFO -- : encdb.h unchanged I, [2024-05-24T17:24:10.504598 #1735236] INFO -- : making srcs under enc I, [2024-05-24T17:24:10.504664 #1735236] INFO -- : making enc I, [2024-05-24T17:24:10.531971 #1735236] INFO -- : make[1]: Entering directory '/home/opc/ruby/build/master' I, [2024-05-24T17:24:10.532056 #1735236] INFO -- : make[1]: Nothing to be done for 'enc'. I, [2024-05-24T17:24:10.532078 #1735236] INFO -- : make[1]: Leaving directory '/home/opc/ruby/build/master' I, [2024-05-24T17:24:10.546875 #1735236] INFO -- : make[1]: Entering directory '/home/opc/ruby/build/master' I, [2024-05-24T17:24:10.546937 #1735236] INFO -- : make[1]: Nothing to be done for 'srcs'. I, [2024-05-24T17:24:10.546957 #1735236] INFO -- : make[1]: Leaving directory '/home/opc/ruby/build/master' I, [2024-05-24T17:24:10.548014 #1735236] INFO -- : generating transdb.h I, [2024-05-24T17:24:10.693522 #1735236] INFO -- : transdb.h unchanged I, [2024-05-24T17:24:10.694875 #1735236] INFO -- : generating makefiles ext/configure-ext.mk I, [2024-05-24T17:24:10.695071 #1735236] INFO -- : making trans I, [2024-05-24T17:24:10.736690 #1735236] INFO -- : ext/configure-ext.mk updated I, [2024-05-24T17:24:10.740112 #1735236] INFO -- : make[1]: Entering directory '/home/opc/ruby/build/master' I, [2024-05-24T17:24:10.743671 #1735236] INFO -- : make[1]: Entering directory '/home/opc/ruby/build/master' I, [2024-05-24T17:24:10.743740 #1735236] INFO -- : make[1]: Nothing to be done for 'trans'. I, [2024-05-24T17:24:10.743778 #1735236] INFO -- : make[1]: Leaving directory '/home/opc/ruby/build/master' I, [2024-05-24T17:24:10.744554 #1735236] INFO -- : making encs I, [2024-05-24T17:24:10.797292 #1735236] INFO -- : make[1]: Entering directory '/home/opc/ruby/build/master' I, [2024-05-24T17:24:10.797380 #1735236] INFO -- : make[1]: Nothing to be done for 'encs'. I, [2024-05-24T17:24:10.797417 #1735236] INFO -- : make[1]: Leaving directory '/home/opc/ruby/build/master' I, [2024-05-24T17:24:11.553732 #1735236] INFO -- : make[1]: Leaving directory '/home/opc/ruby/build/master' I, [2024-05-24T17:24:11.554481 #1735236] INFO -- : generating makefile exts.mk I, [2024-05-24T17:24:11.614816 #1735236] INFO -- : exts.mk unchanged I, [2024-05-24T17:24:11.619764 #1735236] INFO -- : make[1]: Entering directory '/home/opc/ruby/build/master' I, [2024-05-24T17:24:11.726654 #1735236] INFO -- : make[2]: Entering directory '/home/opc/ruby/build/master/ext/coverage' I, [2024-05-24T17:24:11.728411 #1735236] INFO -- : make[2]: Entering directory '/home/opc/ruby/build/master/ext/digest' I, [2024-05-24T17:24:11.730419 #1735236] INFO -- : make[2]: Entering directory '/home/opc/ruby/build/master/ext/date' I, [2024-05-24T17:24:11.731438 #1735236] INFO -- : make[2]: Leaving directory '/home/opc/ruby/build/master/ext/coverage' I, [2024-05-24T17:24:11.736067 #1735236] INFO -- : make[2]: Leaving directory '/home/opc/ruby/build/master/ext/date' I, [2024-05-24T17:24:11.741057 #1735236] INFO -- : make[2]: Leaving directory '/home/opc/ruby/build/master/ext/digest' I, [2024-05-24T17:24:11.745347 #1735236] INFO -- : make[2]: Entering directory '/home/opc/ruby/build/master/ext/io/console' I, [2024-05-24T17:24:11.747822 #1735236] INFO -- : make[2]: Entering directory '/home/opc/ruby/build/master/ext/fiddle' I, [2024-05-24T17:24:11.751755 #1735236] INFO -- : make[2]: Leaving directory '/home/opc/ruby/build/master/ext/io/console' I, [2024-05-24T17:24:11.753845 #1735236] INFO -- : make[2]: Entering directory '/home/opc/ruby/build/master/ext/json' I, [2024-05-24T17:24:11.758200 #1735236] INFO -- : make[2]: Leaving directory '/home/opc/ruby/build/master/ext/fiddle' I, [2024-05-24T17:24:11.759090 #1735236] INFO -- : make[2]: Entering directory '/home/opc/ruby/build/master/ext/monitor' I, [2024-05-24T17:24:11.762861 #1735236] INFO -- : make[2]: Leaving directory '/home/opc/ruby/build/master/ext/json' I, [2024-05-24T17:24:11.765580 #1735236] INFO -- : make[2]: Entering directory '/home/opc/ruby/build/master/ext/objspace' I, [2024-05-24T17:24:11.766694 #1735236] INFO -- : make[2]: Leaving directory '/home/opc/ruby/build/master/ext/monitor' I, [2024-05-24T17:24:11.770744 #1735236] INFO -- : make[2]: Entering directory '/home/opc/ruby/build/master/ext/pathname' I, [2024-05-24T17:24:11.771653 #1735236] INFO -- : make[2]: Leaving directory '/home/opc/ruby/build/master/ext/objspace' I, [2024-05-24T17:24:11.774898 #1735236] INFO -- : make[2]: Leaving directory '/home/opc/ruby/build/master/ext/pathname' I, [2024-05-24T17:24:11.777926 #1735236] INFO -- : make[2]: Entering directory '/home/opc/ruby/build/master/ext/psych' I, [2024-05-24T17:24:11.779014 #1735236] INFO -- : make[2]: Entering directory '/home/opc/ruby/build/master/ext/pty' I, [2024-05-24T17:24:11.783813 #1735236] INFO -- : make[2]: Entering directory '/home/opc/ruby/build/master/ext/openssl' I, [2024-05-24T17:24:11.785729 #1735236] INFO -- : make[2]: Leaving directory '/home/opc/ruby/build/master/ext/pty' I, [2024-05-24T17:24:11.793835 #1735236] INFO -- : make[2]: Leaving directory '/home/opc/ruby/build/master/ext/psych' I, [2024-05-24T17:24:11.795582 #1735236] INFO -- : make[2]: Entering directory '/home/opc/ruby/build/master/ext/rubyvm' I, [2024-05-24T17:24:11.799156 #1735236] INFO -- : make[2]: Leaving directory '/home/opc/ruby/build/master/ext/rubyvm' I, [2024-05-24T17:24:11.801684 #1735236] INFO -- : make[2]: Entering directory '/home/opc/ruby/build/master/ext/ripper' I, [2024-05-24T17:24:11.809618 #1735236] INFO -- : make[2]: Leaving directory '/home/opc/ruby/build/master/ext/openssl' I, [2024-05-24T17:24:11.810005 #1735236] INFO -- : make[2]: Leaving directory '/home/opc/ruby/build/master/ext/ripper' I, [2024-05-24T17:24:11.811351 #1735236] INFO -- : make[2]: Entering directory '/home/opc/ruby/build/master/ext/socket' I, [2024-05-24T17:24:11.816834 #1735236] INFO -- : make[2]: Entering directory '/home/opc/ruby/build/master/.bundle/gems/bigdecimal-3.1.7/ext/bigdecimal' I, [2024-05-24T17:24:11.820800 #1735236] INFO -- : make[2]: Entering directory '/home/opc/ruby/build/master/.bundle/gems/bigdecimal-3.1.8/ext/bigdecimal' I, [2024-05-24T17:24:11.822797 #1735236] INFO -- : make[2]: Leaving directory '/home/opc/ruby/build/master/ext/socket' I, [2024-05-24T17:24:11.826412 #1735236] INFO -- : make[2]: Entering directory '/home/opc/ruby/build/master/.bundle/gems/debug-1.9.2/ext/debug' I, [2024-05-24T17:24:11.849488 #1735236] INFO -- : make[2]: Leaving directory '/home/opc/ruby/build/master/.bundle/gems/bigdecimal-3.1.7/ext/bigdecimal' I, [2024-05-24T17:24:11.852757 #1735236] INFO -- : make[2]: Entering directory '/home/opc/ruby/build/master/.bundle/gems/nkf-0.2.0/ext/nkf' I, [2024-05-24T17:24:11.853355 #1735236] INFO -- : make[2]: Leaving directory '/home/opc/ruby/build/master/.bundle/gems/bigdecimal-3.1.8/ext/bigdecimal' I, [2024-05-24T17:24:11.855696 #1735236] INFO -- : make[2]: Entering directory '/home/opc/ruby/build/master/.bundle/gems/racc-1.7.3/ext/racc/cparse' I, [2024-05-24T17:24:11.862121 #1735236] INFO -- : make[2]: Leaving directory '/home/opc/ruby/build/master/.bundle/gems/debug-1.9.2/ext/debug' I, [2024-05-24T17:24:11.864741 #1735236] INFO -- : make[2]: Entering directory '/home/opc/ruby/build/master/.bundle/gems/racc-1.8.0/ext/racc/cparse' I, [2024-05-24T17:24:11.884773 #1735236] INFO -- : make[2]: Leaving directory '/home/opc/ruby/build/master/.bundle/gems/nkf-0.2.0/ext/nkf' I, [2024-05-24T17:24:11.887497 #1735236] INFO -- : make[2]: Leaving directory '/home/opc/ruby/build/master/.bundle/gems/racc-1.7.3/ext/racc/cparse' I, [2024-05-24T17:24:11.888649 #1735236] INFO -- : make[2]: Entering directory '/home/opc/ruby/build/master/.bundle/gems/rbs-3.4.4/ext/rbs_extension' I, [2024-05-24T17:24:11.889915 #1735236] INFO -- : make[2]: Entering directory '/home/opc/ruby/build/master/.bundle/gems/syslog-0.1.2/ext/syslog' I, [2024-05-24T17:24:11.898260 #1735236] INFO -- : make[2]: Leaving directory '/home/opc/ruby/build/master/.bundle/gems/racc-1.8.0/ext/racc/cparse' I, [2024-05-24T17:24:11.920194 #1735236] INFO -- : make[2]: Leaving directory '/home/opc/ruby/build/master/.bundle/gems/rbs-3.4.4/ext/rbs_extension' I, [2024-05-24T17:24:11.920456 #1735236] INFO -- : make[2]: Leaving directory '/home/opc/ruby/build/master/.bundle/gems/syslog-0.1.2/ext/syslog' I, [2024-05-24T17:24:11.924641 #1735236] INFO -- : make[2]: Entering directory '/home/opc/ruby/build/master/ext/digest/sha2' I, [2024-05-24T17:24:11.929009 #1735236] INFO -- : make[2]: Leaving directory '/home/opc/ruby/build/master/ext/digest/sha2' I, [2024-05-24T17:24:11.967056 #1735236] INFO -- : make[2]: Entering directory '/home/opc/ruby/build/master' I, [2024-05-24T17:24:12.050358 #1735236] INFO -- : make[2]: 'ruby' is up to date. I, [2024-05-24T17:24:12.050439 #1735236] INFO -- : make[2]: Leaving directory '/home/opc/ruby/build/master' I, [2024-05-24T17:24:12.050698 #1735236] INFO -- : make[1]: Leaving directory '/home/opc/ruby/build/master' I, [2024-05-24T17:24:12.055101 #1735236] INFO -- : make[1]: Entering directory '/home/opc/ruby/build/master' I, [2024-05-24T17:24:12.055144 #1735236] INFO -- : make[1]: Nothing to be done for 'note'. I, [2024-05-24T17:24:12.055158 #1735236] INFO -- : make[1]: Leaving directory '/home/opc/ruby/build/master' I, [2024-05-24T17:24:12.055543 #1735236] INFO -- : $$$[end] "make all -j3" exit with 0. I, [2024-05-24T17:24:12.055681 #1735236] INFO -- : $$$[beg] make install -j3 I, [2024-05-24T17:24:12.151119 #1735236] INFO -- : Update power_assert to 84e85124c5014a139af39161d484156cfe87a9ed I, [2024-05-24T17:24:12.151264 #1735236] INFO -- : Update rbs to ba7872795d5de04adb8ff500c0e6afdc81a041dd I, [2024-05-24T17:24:12.152360 #1735236] INFO -- : Update typeprof to b19a6416da3a05d57fadd6ffdadb382b6d236ca5 I, [2024-05-24T17:24:12.155570 #1735236] INFO -- : echo ba7872795d5de04adb8ff500c0e6afdc81a041dd | /bin/sh /home/opc/ruby/src/master/tool/ifchange /home/opc/ruby/src/master/.bundle/.timestamp/rbs.revision - I, [2024-05-24T17:24:12.155679 #1735236] INFO -- : echo 84e85124c5014a139af39161d484156cfe87a9ed | /bin/sh /home/opc/ruby/src/master/tool/ifchange /home/opc/ruby/src/master/.bundle/.timestamp/power_assert.revision - I, [2024-05-24T17:24:12.155970 #1735236] INFO -- : echo b19a6416da3a05d57fadd6ffdadb382b6d236ca5 | /bin/sh /home/opc/ruby/src/master/tool/ifchange /home/opc/ruby/src/master/.bundle/.timestamp/typeprof.revision - I, [2024-05-24T17:24:12.161333 #1735236] INFO -- : /home/opc/ruby/src/master/.bundle/.timestamp/power_assert.revision unchanged I, [2024-05-24T17:24:12.162393 #1735236] INFO -- : /home/opc/ruby/src/master/.bundle/.timestamp/rbs.revision unchanged I, [2024-05-24T17:24:12.162810 #1735236] INFO -- : /home/opc/ruby/src/master/.bundle/.timestamp/typeprof.revision unchanged I, [2024-05-24T17:24:12.164850 #1735236] INFO -- : BASERUBY = /usr/local/bin/ruby --disable=gems I, [2024-05-24T17:24:12.164908 #1735236] INFO -- : CC = gcc I, [2024-05-24T17:24:12.164938 #1735236] INFO -- : LD = ld I, [2024-05-24T17:24:12.164965 #1735236] INFO -- : LDSHARED = gcc -shared I, [2024-05-24T17:24:12.165001 #1735236] INFO -- : CFLAGS = -O3 -fno-fast-math -ggdb3 -Wall -Wextra -Wdeprecated-declarations -Wdiv-by-zero -Wduplicated-cond -Wimplicit-function-declaration -Wimplicit-int -Wpointer-arith -Wwrite-strings -Wold-style-definition -Wimplicit-fallthrough=0 -Wmissing-noreturn -Wno-cast-function-type -Wno-constant-logical-operand -Wno-long-long -Wno-missing-field-initializers -Wno-overlength-strings -Wno-packed-bitfield-compat -Wno-parentheses-equality -Wno-self-assign -Wno-tautological-compare -Wno-unused-parameter -Wno-unused-value -Wsuggest-attribute=format -Wsuggest-attribute=noreturn -Wunused-variable -Wmisleading-indentation -Wundef I, [2024-05-24T17:24:12.165032 #1735236] INFO -- : XCFLAGS = -U_FORTIFY_SOURCE -D_FORTIFY_SOURCE=2 -fstack-protector-strong -msign-return-address=all -fno-strict-overflow -fvisibility=hidden -fexcess-precision=standard -DRUBY_EXPORT -fPIE -I. -I.ext/include/aarch64-linux -I/home/opc/ruby/src/master/include -I/home/opc/ruby/src/master -I/home/opc/ruby/src/master/prism -I/home/opc/ruby/src/master/enc/unicode/15.0.0 I, [2024-05-24T17:24:12.165057 #1735236] INFO -- : CPPFLAGS = I, [2024-05-24T17:24:12.165083 #1735236] INFO -- : DLDFLAGS = -Wl,--compress-debug-sections=zlib -fstack-protector-strong -pie I, [2024-05-24T17:24:12.165109 #1735236] INFO -- : SOLIBS = -lz -lrt -lrt -ldl -lcrypt -lm -lpthread I, [2024-05-24T17:24:12.165194 #1735236] INFO -- : LANG = en_US.UTF-8 I, [2024-05-24T17:24:12.165222 #1735236] INFO -- : LC_ALL = I, [2024-05-24T17:24:12.165250 #1735236] INFO -- : LC_CTYPE = I, [2024-05-24T17:24:12.165275 #1735236] INFO -- : MFLAGS = -j3 --jobserver-auth=4,5 I, [2024-05-24T17:24:12.165301 #1735236] INFO -- : RUSTC = rustc I, [2024-05-24T17:24:12.165330 #1735236] INFO -- : YJIT_RUSTC_ARGS = --crate-name=yjit --crate-type=staticlib --edition=2021 -g -C lto=thin -C opt-level=3 -C overflow-checks=on '--out-dir=/home/opc/ruby/build/master/yjit/target/release/' /home/opc/ruby/src/master/yjit/src/lib.rs I, [2024-05-24T17:24:12.196239 #1735236] INFO -- : generating encdb.h I, [2024-05-24T17:24:12.196317 #1735236] INFO -- : gcc (GCC) 8.5.0 20210514 (Red Hat 8.5.0-10.1.0.1) I, [2024-05-24T17:24:12.196331 #1735236] INFO -- : Copyright (C) 2018 Free Software Foundation, Inc. I, [2024-05-24T17:24:12.196340 #1735236] INFO -- : This is free software; see the source for copying conditions. There is NO I, [2024-05-24T17:24:12.196350 #1735236] INFO -- : warranty; not even for MERCHANTABILITY or FITNESS FOR A PARTICULAR PURPOSE. I, [2024-05-24T17:24:12.196358 #1735236] INFO -- : I, [2024-05-24T17:24:12.196957 #1735236] INFO -- : generating enc.mk I, [2024-05-24T17:24:12.239813 #1735236] INFO -- : encdb.h unchanged I, [2024-05-24T17:24:12.333213 #1735236] INFO -- : Building power_assert@84e85124c5014a139af39161d484156cfe87a9ed to /home/opc/ruby/src/master/gems/power_assert-2.0.3.gem I, [2024-05-24T17:24:12.441358 #1735236] INFO -- : making srcs under enc I, [2024-05-24T17:24:12.441563 #1735236] INFO -- : making enc I, [2024-05-24T17:24:12.450549 #1735236] INFO -- : Successfully built RubyGem I, [2024-05-24T17:24:12.450599 #1735236] INFO -- : Name: power_assert I, [2024-05-24T17:24:12.450610 #1735236] INFO -- : Version: 2.0.4dev I, [2024-05-24T17:24:12.450619 #1735236] INFO -- : File: power_assert-2.0.4dev.gem I, [2024-05-24T17:24:12.452891 #1735236] INFO -- : Extracting bundle gem power_assert-2.0.3... I, [2024-05-24T17:24:12.470614 #1735236] INFO -- : make[1]: Entering directory '/home/opc/ruby/build/master' I, [2024-05-24T17:24:12.470669 #1735236] INFO -- : make[1]: Nothing to be done for 'enc'. I, [2024-05-24T17:24:12.470681 #1735236] INFO -- : make[1]: Leaving directory '/home/opc/ruby/build/master' I, [2024-05-24T17:24:12.484267 #1735236] INFO -- : make[1]: Entering directory '/home/opc/ruby/build/master' I, [2024-05-24T17:24:12.484324 #1735236] INFO -- : make[1]: Nothing to be done for 'srcs'. I, [2024-05-24T17:24:12.484337 #1735236] INFO -- : make[1]: Leaving directory '/home/opc/ruby/build/master' I, [2024-05-24T17:24:12.485173 #1735236] INFO -- : generating transdb.h I, [2024-05-24T17:24:12.551431 #1735236] INFO -- : Try with hash version of bundled gems instead of gems/power_assert-2.0.3.gem. We don't use this gem with release version of Ruby. I, [2024-05-24T17:24:12.561795 #1735236] INFO -- : Unpacked gems/power_assert-2.0.4dev.gem I, [2024-05-24T17:24:12.639890 #1735236] INFO -- : transdb.h unchanged I, [2024-05-24T17:24:12.641323 #1735236] INFO -- : generating makefiles ext/configure-ext.mk I, [2024-05-24T17:24:12.641412 #1735236] INFO -- : making trans I, [2024-05-24T17:24:12.680457 #1735236] INFO -- : ext/configure-ext.mk unchanged I, [2024-05-24T17:24:12.683703 #1735236] INFO -- : make[1]: Entering directory '/home/opc/ruby/build/master' I, [2024-05-24T17:24:12.690413 #1735236] INFO -- : make[1]: Entering directory '/home/opc/ruby/build/master' I, [2024-05-24T17:24:12.690461 #1735236] INFO -- : make[1]: Nothing to be done for 'trans'. I, [2024-05-24T17:24:12.690474 #1735236] INFO -- : make[1]: Leaving directory '/home/opc/ruby/build/master' I, [2024-05-24T17:24:13.397191 #1735236] INFO -- : making encs I, [2024-05-24T17:24:13.443587 #1735236] INFO -- : make[1]: Leaving directory '/home/opc/ruby/build/master' I, [2024-05-24T17:24:13.444297 #1735236] INFO -- : generating makefile exts.mk I, [2024-05-24T17:24:13.449477 #1735236] INFO -- : make[1]: Entering directory '/home/opc/ruby/build/master' I, [2024-05-24T17:24:13.449533 #1735236] INFO -- : make[1]: Nothing to be done for 'encs'. I, [2024-05-24T17:24:13.449544 #1735236] INFO -- : make[1]: Leaving directory '/home/opc/ruby/build/master' I, [2024-05-24T17:24:13.503193 #1735236] INFO -- : exts.mk unchanged I, [2024-05-24T17:24:13.508110 #1735236] INFO -- : make[1]: Entering directory '/home/opc/ruby/build/master' I, [2024-05-24T17:24:13.610590 #1735236] INFO -- : make[2]: Entering directory '/home/opc/ruby/build/master/ext/coverage' I, [2024-05-24T17:24:13.612401 #1735236] INFO -- : make[2]: Entering directory '/home/opc/ruby/build/master/ext/digest' I, [2024-05-24T17:24:13.613789 #1735236] INFO -- : make[2]: Entering directory '/home/opc/ruby/build/master/ext/date' I, [2024-05-24T17:24:13.615324 #1735236] INFO -- : make[2]: Leaving directory '/home/opc/ruby/build/master/ext/coverage' I, [2024-05-24T17:24:13.619095 #1735236] INFO -- : make[2]: Leaving directory '/home/opc/ruby/build/master/ext/date' I, [2024-05-24T17:24:13.621884 #1735236] INFO -- : make[2]: Leaving directory '/home/opc/ruby/build/master/ext/digest' I, [2024-05-24T17:24:13.626171 #1735236] INFO -- : make[2]: Entering directory '/home/opc/ruby/build/master/ext/io/console' I, [2024-05-24T17:24:13.629272 #1735236] INFO -- : make[2]: Entering directory '/home/opc/ruby/build/master/ext/fiddle' I, [2024-05-24T17:24:13.630369 #1735236] INFO -- : make[2]: Leaving directory '/home/opc/ruby/build/master/ext/io/console' I, [2024-05-24T17:24:13.633455 #1735236] INFO -- : make[2]: Entering directory '/home/opc/ruby/build/master/ext/json' I, [2024-05-24T17:24:13.639406 #1735236] INFO -- : make[2]: Entering directory '/home/opc/ruby/build/master/ext/monitor' I, [2024-05-24T17:24:13.640221 #1735236] INFO -- : make[2]: Leaving directory '/home/opc/ruby/build/master/ext/fiddle' I, [2024-05-24T17:24:13.643266 #1735236] INFO -- : make[2]: Leaving directory '/home/opc/ruby/build/master/ext/json' I, [2024-05-24T17:24:13.643929 #1735236] INFO -- : make[2]: Leaving directory '/home/opc/ruby/build/master/ext/monitor' I, [2024-05-24T17:24:13.646403 #1735236] INFO -- : make[2]: Entering directory '/home/opc/ruby/build/master/ext/objspace' I, [2024-05-24T17:24:13.648034 #1735236] INFO -- : make[2]: Entering directory '/home/opc/ruby/build/master/ext/pathname' I, [2024-05-24T17:24:13.652213 #1735236] INFO -- : make[2]: Leaving directory '/home/opc/ruby/build/master/ext/pathname' I, [2024-05-24T17:24:13.652251 #1735236] INFO -- : make[2]: Leaving directory '/home/opc/ruby/build/master/ext/objspace' I, [2024-05-24T17:24:13.656738 #1735236] INFO -- : make[2]: Entering directory '/home/opc/ruby/build/master/ext/pty' I, [2024-05-24T17:24:13.658487 #1735236] INFO -- : make[2]: Entering directory '/home/opc/ruby/build/master/ext/psych' I, [2024-05-24T17:24:13.661088 #1735236] INFO -- : make[2]: Leaving directory '/home/opc/ruby/build/master/ext/pty' I, [2024-05-24T17:24:13.662487 #1735236] INFO -- : make[2]: Entering directory '/home/opc/ruby/build/master/ext/openssl' I, [2024-05-24T17:24:13.674795 #1735236] INFO -- : make[2]: Entering directory '/home/opc/ruby/build/master/ext/ripper' I, [2024-05-24T17:24:13.679203 #1735236] INFO -- : make[2]: Leaving directory '/home/opc/ruby/build/master/ext/psych' I, [2024-05-24T17:24:13.681452 #1735236] INFO -- : make[2]: Entering directory '/home/opc/ruby/build/master/ext/rubyvm' I, [2024-05-24T17:24:13.682989 #1735236] INFO -- : make[2]: Leaving directory '/home/opc/ruby/build/master/ext/ripper' I, [2024-05-24T17:24:13.685072 #1735236] INFO -- : make[2]: Leaving directory '/home/opc/ruby/build/master/ext/openssl' I, [2024-05-24T17:24:13.685128 #1735236] INFO -- : make[2]: Leaving directory '/home/opc/ruby/build/master/ext/rubyvm' I, [2024-05-24T17:24:13.692257 #1735236] INFO -- : make[2]: Entering directory '/home/opc/ruby/build/master/.bundle/gems/bigdecimal-3.1.7/ext/bigdecimal' I, [2024-05-24T17:24:13.695023 #1735236] INFO -- : make[2]: Entering directory '/home/opc/ruby/build/master/ext/socket' I, [2024-05-24T17:24:13.695969 #1735236] INFO -- : make[2]: Entering directory '/home/opc/ruby/build/master/.bundle/gems/bigdecimal-3.1.8/ext/bigdecimal' I, [2024-05-24T17:24:13.706065 #1735236] INFO -- : make[2]: Leaving directory '/home/opc/ruby/build/master/ext/socket' I, [2024-05-24T17:24:13.708460 #1735236] INFO -- : make[2]: Entering directory '/home/opc/ruby/build/master/.bundle/gems/debug-1.9.2/ext/debug' I, [2024-05-24T17:24:13.726405 #1735236] INFO -- : make[2]: Leaving directory '/home/opc/ruby/build/master/.bundle/gems/bigdecimal-3.1.7/ext/bigdecimal' I, [2024-05-24T17:24:13.728658 #1735236] INFO -- : make[2]: Leaving directory '/home/opc/ruby/build/master/.bundle/gems/bigdecimal-3.1.8/ext/bigdecimal' I, [2024-05-24T17:24:13.729497 #1735236] INFO -- : make[2]: Entering directory '/home/opc/ruby/build/master/.bundle/gems/nkf-0.2.0/ext/nkf' I, [2024-05-24T17:24:13.731090 #1735236] INFO -- : make[2]: Entering directory '/home/opc/ruby/build/master/.bundle/gems/racc-1.7.3/ext/racc/cparse' I, [2024-05-24T17:24:13.739420 #1735236] INFO -- : make[2]: Leaving directory '/home/opc/ruby/build/master/.bundle/gems/debug-1.9.2/ext/debug' I, [2024-05-24T17:24:13.742013 #1735236] INFO -- : make[2]: Entering directory '/home/opc/ruby/build/master/.bundle/gems/racc-1.8.0/ext/racc/cparse' I, [2024-05-24T17:24:13.761381 #1735236] INFO -- : make[2]: Leaving directory '/home/opc/ruby/build/master/.bundle/gems/nkf-0.2.0/ext/nkf' I, [2024-05-24T17:24:13.762455 #1735236] INFO -- : make[2]: Leaving directory '/home/opc/ruby/build/master/.bundle/gems/racc-1.7.3/ext/racc/cparse' I, [2024-05-24T17:24:13.764353 #1735236] INFO -- : make[2]: Entering directory '/home/opc/ruby/build/master/.bundle/gems/rbs-3.4.4/ext/rbs_extension' I, [2024-05-24T17:24:13.765251 #1735236] INFO -- : make[2]: Entering directory '/home/opc/ruby/build/master/.bundle/gems/syslog-0.1.2/ext/syslog' I, [2024-05-24T17:24:13.774454 #1735236] INFO -- : make[2]: Leaving directory '/home/opc/ruby/build/master/.bundle/gems/racc-1.8.0/ext/racc/cparse' I, [2024-05-24T17:24:13.795527 #1735236] INFO -- : make[2]: Leaving directory '/home/opc/ruby/build/master/.bundle/gems/rbs-3.4.4/ext/rbs_extension' I, [2024-05-24T17:24:13.797377 #1735236] INFO -- : make[2]: Leaving directory '/home/opc/ruby/build/master/.bundle/gems/syslog-0.1.2/ext/syslog' I, [2024-05-24T17:24:13.799164 #1735236] INFO -- : make[2]: Entering directory '/home/opc/ruby/build/master/ext/digest/sha2' I, [2024-05-24T17:24:13.804059 #1735236] INFO -- : make[2]: Leaving directory '/home/opc/ruby/build/master/ext/digest/sha2' I, [2024-05-24T17:24:13.841940 #1735236] INFO -- : make[2]: Entering directory '/home/opc/ruby/build/master' I, [2024-05-24T17:24:13.925815 #1735236] INFO -- : make[2]: 'ruby' is up to date. I, [2024-05-24T17:24:13.925892 #1735236] INFO -- : make[2]: Leaving directory '/home/opc/ruby/build/master' I, [2024-05-24T17:24:13.926043 #1735236] INFO -- : make[1]: Leaving directory '/home/opc/ruby/build/master' I, [2024-05-24T17:24:13.930641 #1735236] INFO -- : make[1]: Entering directory '/home/opc/ruby/build/master' I, [2024-05-24T17:24:13.930682 #1735236] INFO -- : make[1]: Nothing to be done for 'note'. I, [2024-05-24T17:24:13.930692 #1735236] INFO -- : make[1]: Leaving directory '/home/opc/ruby/build/master' I, [2024-05-24T17:24:13.930874 #1735236] INFO -- : ./miniruby -I/home/opc/ruby/src/master/lib -I. -I.ext/common /home/opc/ruby/src/master/tool/runruby.rb --extout=.ext -- --disable-gems -r./aarch64-linux-fake /home/opc/ruby/src/master/tool/rbinstall.rb --make="make" --dest-dir="" --extout=".ext" --ext-build-dir="./ext" --mflags="-j3 --jobserver-auth=4,5" --make-flags=" -j3 --jobserver-auth=4,5" --data-mode=0644 --prog-mode=0755 --installed-list .installed.list --mantype="doc" --gnumake --install=all --exclude=doc I, [2024-05-24T17:24:14.082518 #1735236] INFO -- : Installing to I, [2024-05-24T17:24:14.082584 #1735236] INFO -- : installing binary commands: /home/opc/ruby/install/master/bin I, [2024-05-24T17:24:14.199316 #1735236] INFO -- : installing base libraries: /home/opc/ruby/install/master/lib I, [2024-05-24T17:24:14.199688 #1735236] INFO -- : installing arch files: /home/opc/ruby/install/master/lib/ruby/3.4.0+0/aarch64-linux I, [2024-05-24T17:24:14.199833 #1735236] INFO -- : installing pkgconfig data: /home/opc/ruby/install/master/lib/pkgconfig I, [2024-05-24T17:24:14.199890 #1735236] INFO -- : installing extension objects: /home/opc/ruby/install/master/lib/ruby/3.4.0+0/aarch64-linux I, [2024-05-24T17:24:14.212609 #1735236] INFO -- : installing extension objects: /home/opc/ruby/install/master/lib/ruby/site_ruby/3.4.0+0/aarch64-linux I, [2024-05-24T17:24:14.212665 #1735236] INFO -- : installing extension objects: /home/opc/ruby/install/master/lib/ruby/vendor_ruby/3.4.0+0/aarch64-linux I, [2024-05-24T17:24:14.212742 #1735236] INFO -- : installing extension headers: /home/opc/ruby/install/master/include/ruby-3.4.0+0/aarch64-linux I, [2024-05-24T17:24:14.213018 #1735236] INFO -- : installing extension scripts: /home/opc/ruby/install/master/lib/ruby/3.4.0+0 I, [2024-05-24T17:24:14.220816 #1735236] INFO -- : installing extension scripts: /home/opc/ruby/install/master/lib/ruby/site_ruby/3.4.0+0 I, [2024-05-24T17:24:14.220847 #1735236] INFO -- : installing extension scripts: /home/opc/ruby/install/master/lib/ruby/vendor_ruby/3.4.0+0 I, [2024-05-24T17:24:14.220858 #1735236] INFO -- : installing extension headers: /home/opc/ruby/install/master/include/ruby-3.4.0+0/ruby I, [2024-05-24T17:24:14.220984 #1735236] INFO -- : installing command scripts: /home/opc/ruby/install/master/bin I, [2024-05-24T17:24:14.221129 #1735236] INFO -- : installing library scripts: /home/opc/ruby/install/master/lib/ruby/3.4.0+0 I, [2024-05-24T17:24:14.304372 #1735236] INFO -- : installing common headers: /home/opc/ruby/install/master/include/ruby-3.4.0+0 I, [2024-05-24T17:24:14.315978 #1735236] INFO -- : installing manpages: /home/opc/ruby/install/master/share/man/man1 I, [2024-05-24T17:24:14.316253 #1735236] INFO -- : installing default gems from lib: /home/opc/ruby/install/master/lib/ruby/gems/3.4.0+0 I, [2024-05-24T17:24:14.359488 #1735236] INFO -- : benchmark 0.3.0 I, [2024-05-24T17:24:14.364566 #1735236] INFO -- : bundler 2.6.0.dev I, [2024-05-24T17:24:14.369547 #1735236] INFO -- : cgi 0.4.1 I, [2024-05-24T17:24:14.370700 #1735236] INFO -- : delegate 0.3.1 I, [2024-05-24T17:24:14.371778 #1735236] INFO -- : did_you_mean 1.6.3 I, [2024-05-24T17:24:14.372933 #1735236] INFO -- : english 0.8.0 I, [2024-05-24T17:24:14.374080 #1735236] INFO -- : erb 4.0.4 I, [2024-05-24T17:24:14.376587 #1735236] INFO -- : error_highlight 0.6.0 I, [2024-05-24T17:24:14.377751 #1735236] INFO -- : fileutils 1.7.2 I, [2024-05-24T17:24:14.379877 #1735236] INFO -- : find 0.2.0 I, [2024-05-24T17:24:14.381233 #1735236] INFO -- : forwardable 1.3.3 I, [2024-05-24T17:24:14.382300 #1735236] INFO -- : ipaddr 1.2.6 I, [2024-05-24T17:24:14.383366 #1735236] INFO -- : irb 1.13.1 I, [2024-05-24T17:24:14.385897 #1735236] INFO -- : logger 1.6.0 I, [2024-05-24T17:24:14.386984 #1735236] INFO -- : net-http 0.4.1 I, [2024-05-24T17:24:14.388102 #1735236] INFO -- : net-protocol 0.2.2 I, [2024-05-24T17:24:14.389277 #1735236] INFO -- : open-uri 0.4.1 I, [2024-05-24T17:24:14.390434 #1735236] INFO -- : open3 0.2.1 I, [2024-05-24T17:24:14.391518 #1735236] INFO -- : optparse 0.5.0 I, [2024-05-24T17:24:14.392637 #1735236] INFO -- : ostruct 0.6.0 I, [2024-05-24T17:24:14.393746 #1735236] INFO -- : pp 0.5.0 I, [2024-05-24T17:24:14.394860 #1735236] INFO -- : prettyprint 0.2.0 I, [2024-05-24T17:24:14.395931 #1735236] INFO -- : prism 0.29.0 I, [2024-05-24T17:24:14.397118 #1735236] INFO -- : pstore 0.1.3 I, [2024-05-24T17:24:14.398252 #1735236] INFO -- : rdoc 6.7.0 I, [2024-05-24T17:24:14.401960 #1735236] INFO -- : readline 0.0.4 I, [2024-05-24T17:24:14.403087 #1735236] INFO -- : reline 0.5.7 I, [2024-05-24T17:24:14.404243 #1735236] INFO -- : resolv 0.4.0 I, [2024-05-24T17:24:14.405442 #1735236] INFO -- : ruby2_keywords 0.0.5 I, [2024-05-24T17:24:14.406551 #1735236] INFO -- : securerandom 0.3.1 I, [2024-05-24T17:24:14.407622 #1735236] INFO -- : set 1.1.0 I, [2024-05-24T17:24:14.408753 #1735236] INFO -- : shellwords 0.2.0 I, [2024-05-24T17:24:14.411405 #1735236] INFO -- : singleton 0.2.0 I, [2024-05-24T17:24:14.412888 #1735236] INFO -- : syntax_suggest 2.0.0 I, [2024-05-24T17:24:14.415332 #1735236] INFO -- : tempfile 0.2.1 I, [2024-05-24T17:24:14.416428 #1735236] INFO -- : time 0.3.0 I, [2024-05-24T17:24:14.417652 #1735236] INFO -- : timeout 0.4.1 I, [2024-05-24T17:24:14.418744 #1735236] INFO -- : tmpdir 0.2.0 I, [2024-05-24T17:24:14.419876 #1735236] INFO -- : tsort 0.2.0 I, [2024-05-24T17:24:14.420997 #1735236] INFO -- : un 0.3.0 I, [2024-05-24T17:24:14.422169 #1735236] INFO -- : uri 0.13.0 I, [2024-05-24T17:24:14.423306 #1735236] INFO -- : weakref 0.1.3 I, [2024-05-24T17:24:14.424403 #1735236] INFO -- : yaml 0.3.0 I, [2024-05-24T17:24:14.425534 #1735236] INFO -- : installing default gems from ext: /home/opc/ruby/install/master/lib/ruby/gems/3.4.0+0 I, [2024-05-24T17:24:14.434912 #1735236] INFO -- : date 3.3.4 I, [2024-05-24T17:24:14.436085 #1735236] INFO -- : digest 3.1.1 I, [2024-05-24T17:24:14.437285 #1735236] INFO -- : etc 1.4.3 I, [2024-05-24T17:24:14.438442 #1735236] INFO -- : fcntl 1.1.0 I, [2024-05-24T17:24:14.441455 #1735236] INFO -- : fiddle 1.1.3 I, [2024-05-24T17:24:14.442582 #1735236] INFO -- : io-console 0.7.2 I, [2024-05-24T17:24:14.443663 #1735236] INFO -- : io-nonblock 0.3.0 I, [2024-05-24T17:24:14.444846 #1735236] INFO -- : io-wait 0.3.1 I, [2024-05-24T17:24:14.445960 #1735236] INFO -- : json 2.7.2 I, [2024-05-24T17:24:14.447141 #1735236] INFO -- : openssl 3.2.0 I, [2024-05-24T17:24:14.448280 #1735236] INFO -- : pathname 0.3.0 I, [2024-05-24T17:24:14.449466 #1735236] INFO -- : psych 5.1.2 I, [2024-05-24T17:24:14.450737 #1735236] INFO -- : stringio 3.1.1 I, [2024-05-24T17:24:14.452267 #1735236] INFO -- : strscan 3.1.1 I, [2024-05-24T17:24:14.453432 #1735236] INFO -- : zlib 3.1.0 I, [2024-05-24T17:24:14.454342 #1735236] INFO -- : installing bundled gems: /home/opc/ruby/install/master/lib/ruby/gems/3.4.0+0 I, [2024-05-24T17:24:14.455302 #1735236] INFO -- : minitest 5.23.1 I, [2024-05-24T17:24:14.476180 #1735236] INFO -- : rake 13.2.1 I, [2024-05-24T17:24:14.491391 #1735236] INFO -- : test-unit 3.6.2 I, [2024-05-24T17:24:14.506932 #1735236] INFO -- : rexml 3.2.8 I, [2024-05-24T17:24:14.523702 #1735236] INFO -- : rss 0.3.0 I, [2024-05-24T17:24:14.533281 #1735236] INFO -- : net-ftp 0.3.4 I, [2024-05-24T17:24:14.537377 #1735236] INFO -- : net-imap 0.4.11 I, [2024-05-24T17:24:14.550263 #1735236] INFO -- : net-pop 0.1.2 I, [2024-05-24T17:24:14.552853 #1735236] INFO -- : net-smtp 0.5.0 I, [2024-05-24T17:24:14.556230 #1735236] INFO -- : matrix 0.4.2 I, [2024-05-24T17:24:14.564542 #1735236] INFO -- : prime 0.1.2 I, [2024-05-24T17:24:14.573067 #1735236] INFO -- : rbs 3.4.4 I, [2024-05-24T17:24:14.672669 #1735236] INFO -- : typeprof 0.21.11 I, [2024-05-24T17:24:14.686795 #1735236] INFO -- : debug 1.9.2 I, [2024-05-24T17:24:14.698347 #1735236] INFO -- : racc 1.8.0 I, [2024-05-24T17:24:14.711347 #1735236] INFO -- : mutex_m 0.2.0 I, [2024-05-24T17:24:14.713002 #1735236] INFO -- : getoptlong 0.2.1 I, [2024-05-24T17:24:14.717764 #1735236] INFO -- : base64 0.2.0 I, [2024-05-24T17:24:14.720304 #1735236] INFO -- : bigdecimal 3.1.8 I, [2024-05-24T17:24:14.727995 #1735236] INFO -- : observer 0.1.2 I, [2024-05-24T17:24:14.731424 #1735236] INFO -- : abbrev 0.1.2 I, [2024-05-24T17:24:14.734420 #1735236] INFO -- : resolv-replace 0.1.1 I, [2024-05-24T17:24:14.737593 #1735236] INFO -- : rinda 0.2.0 I, [2024-05-24T17:24:14.741395 #1735236] INFO -- : drb 2.2.1 I, [2024-05-24T17:24:14.745952 #1735236] INFO -- : nkf 0.2.0 I, [2024-05-24T17:24:14.752481 #1735236] INFO -- : syslog 0.1.2 I, [2024-05-24T17:24:14.758436 #1735236] INFO -- : csv 3.3.0 I, [2024-05-24T17:24:14.769352 #1735236] INFO -- : installing bundled gem cache: /home/opc/ruby/install/master/lib/ruby/gems/3.4.0+0/cache I, [2024-05-24T17:24:14.771581 #1735236] INFO -- : skipped bundled gems: I, [2024-05-24T17:24:14.771601 #1735236] INFO -- : power_assert-2.0.4dev.gem not found in bundled_gems I, [2024-05-24T17:24:14.774518 #1735236] INFO -- : $$$[end] "make install -j3" exit with 0. I, [2024-05-24T17:24:14.774717 #1735236] INFO -- : $$$[beg] make yes-btest TESTOPTS='-q -j3' I, [2024-05-24T17:24:36.598066 #1735236] INFO -- : PASS all 1936 tests E, [2024-05-24T17:24:36.600031 #1735236] ERROR -- : I, [2024-05-24T17:24:36.600572 #1735236] INFO -- : $$$[end] "make yes-btest TESTOPTS='-q -j3'" exit with 0. I, [2024-05-24T17:24:36.600717 #1735236] INFO -- : $$$[beg] make yes-test-basic TESTS='-j3' I, [2024-05-24T17:24:36.692646 #1735236] INFO -- : BASERUBY = /usr/local/bin/ruby --disable=gems I, [2024-05-24T17:24:36.692716 #1735236] INFO -- : CC = gcc I, [2024-05-24T17:24:36.692728 #1735236] INFO -- : LD = ld I, [2024-05-24T17:24:36.692737 #1735236] INFO -- : LDSHARED = gcc -shared I, [2024-05-24T17:24:36.692749 #1735236] INFO -- : CFLAGS = -O3 -fno-fast-math -ggdb3 -Wall -Wextra -Wdeprecated-declarations -Wdiv-by-zero -Wduplicated-cond -Wimplicit-function-declaration -Wimplicit-int -Wpointer-arith -Wwrite-strings -Wold-style-definition -Wimplicit-fallthrough=0 -Wmissing-noreturn -Wno-cast-function-type -Wno-constant-logical-operand -Wno-long-long -Wno-missing-field-initializers -Wno-overlength-strings -Wno-packed-bitfield-compat -Wno-parentheses-equality -Wno-self-assign -Wno-tautological-compare -Wno-unused-parameter -Wno-unused-value -Wsuggest-attribute=format -Wsuggest-attribute=noreturn -Wunused-variable -Wmisleading-indentation -Wundef I, [2024-05-24T17:24:36.692759 #1735236] INFO -- : XCFLAGS = -U_FORTIFY_SOURCE -D_FORTIFY_SOURCE=2 -fstack-protector-strong -msign-return-address=all -fno-strict-overflow -fvisibility=hidden -fexcess-precision=standard -DRUBY_EXPORT -fPIE -I. -I.ext/include/aarch64-linux -I/home/opc/ruby/src/master/include -I/home/opc/ruby/src/master -I/home/opc/ruby/src/master/prism -I/home/opc/ruby/src/master/enc/unicode/15.0.0 I, [2024-05-24T17:24:36.692769 #1735236] INFO -- : CPPFLAGS = I, [2024-05-24T17:24:36.692778 #1735236] INFO -- : DLDFLAGS = -Wl,--compress-debug-sections=zlib -fstack-protector-strong -pie I, [2024-05-24T17:24:36.692787 #1735236] INFO -- : SOLIBS = -lz -lrt -lrt -ldl -lcrypt -lm -lpthread I, [2024-05-24T17:24:36.692796 #1735236] INFO -- : LANG = en_US.UTF-8 I, [2024-05-24T17:24:36.692804 #1735236] INFO -- : LC_ALL = I, [2024-05-24T17:24:36.692812 #1735236] INFO -- : LC_CTYPE = I, [2024-05-24T17:24:36.692820 #1735236] INFO -- : MFLAGS = I, [2024-05-24T17:24:36.692828 #1735236] INFO -- : RUSTC = rustc I, [2024-05-24T17:24:36.692837 #1735236] INFO -- : YJIT_RUSTC_ARGS = --crate-name=yjit --crate-type=staticlib --edition=2021 -g -C lto=thin -C opt-level=3 -C overflow-checks=on '--out-dir=/home/opc/ruby/build/master/yjit/target/release/' /home/opc/ruby/src/master/yjit/src/lib.rs I, [2024-05-24T17:24:36.693486 #1735236] INFO -- : gcc (GCC) 8.5.0 20210514 (Red Hat 8.5.0-10.1.0.1) I, [2024-05-24T17:24:36.693507 #1735236] INFO -- : Copyright (C) 2018 Free Software Foundation, Inc. I, [2024-05-24T17:24:36.693516 #1735236] INFO -- : This is free software; see the source for copying conditions. There is NO I, [2024-05-24T17:24:36.693525 #1735236] INFO -- : warranty; not even for MERCHANTABILITY or FITNESS FOR A PARTICULAR PURPOSE. I, [2024-05-24T17:24:36.693533 #1735236] INFO -- : I, [2024-05-24T17:24:36.850014 #1735236] INFO -- : Checking leaked global symbols...none I, [2024-05-24T17:24:36.901617 #1735236] INFO -- : /home/opc/ruby/src/master/basictest/test.rb:assignment ....................................................................................................................................................................................................................................................................................................................................................................................OK 372 I, [2024-05-24T17:24:36.901692 #1735236] INFO -- : /home/opc/ruby/src/master/basictest/test.rb:condition ..OK 2 I, [2024-05-24T17:24:36.901706 #1735236] INFO -- : /home/opc/ruby/src/master/basictest/test.rb:if/unless ...OK 3 I, [2024-05-24T17:24:36.901754 #1735236] INFO -- : /home/opc/ruby/src/master/basictest/test.rb:case .....OK 5 I, [2024-05-24T17:24:36.902290 #1735236] INFO -- : /home/opc/ruby/src/master/basictest/test.rb:while/until ........OK 8 I, [2024-05-24T17:24:36.902409 #1735236] INFO -- : /home/opc/ruby/src/master/basictest/test.rb:exception ..........OK 10 I, [2024-05-24T17:24:36.903027 #1735236] INFO -- : /home/opc/ruby/src/master/basictest/test.rb:array .......................................OK 39 I, [2024-05-24T17:24:36.903285 #1735236] INFO -- : /home/opc/ruby/src/master/basictest/test.rb:hash ...........................OK 27 I, [2024-05-24T17:24:36.904863 #1735236] INFO -- : /home/opc/ruby/src/master/basictest/test.rb:iterator ...........................................................................................................OK 107 I, [2024-05-24T17:24:36.905610 #1735236] INFO -- : /home/opc/ruby/src/master/basictest/test.rb:float ................................................................................OK 80 I, [2024-05-24T17:24:36.909245 #1735236] INFO -- : /home/opc/ruby/src/master/basictest/test.rb:bignum ...............................OK 31 I, [2024-05-24T17:24:36.910814 #1735236] INFO -- : /home/opc/ruby/src/master/basictest/test.rb:string & char ..............................................................OK 62 I, [2024-05-24T17:24:36.910889 #1735236] INFO -- : /home/opc/ruby/src/master/basictest/test.rb:assignment ..........OK 10 I, [2024-05-24T17:24:36.910965 #1735236] INFO -- : /home/opc/ruby/src/master/basictest/test.rb:call ......OK 6 I, [2024-05-24T17:24:36.911071 #1735236] INFO -- : /home/opc/ruby/src/master/basictest/test.rb:proc .........OK 9 I, [2024-05-24T17:24:37.011432 #1735236] INFO -- : /home/opc/ruby/src/master/basictest/test.rb:signal ..OK 2 I, [2024-05-24T17:24:37.012715 #1735236] INFO -- : /home/opc/ruby/src/master/basictest/test.rb:eval ...........................OK 27 I, [2024-05-24T17:24:37.142222 #1735236] INFO -- : /home/opc/ruby/src/master/basictest/test.rb:system ........OK 8 I, [2024-05-24T17:24:37.142290 #1735236] INFO -- : /home/opc/ruby/src/master/basictest/test.rb:const .....OK 5 I, [2024-05-24T17:24:37.142371 #1735236] INFO -- : /home/opc/ruby/src/master/basictest/test.rb:clone .....OK 5 I, [2024-05-24T17:24:37.142560 #1735236] INFO -- : /home/opc/ruby/src/master/basictest/test.rb:marshal ....OK 4 I, [2024-05-24T17:24:37.142637 #1735236] INFO -- : /home/opc/ruby/src/master/basictest/test.rb:pack ....OK 4 I, [2024-05-24T17:24:37.142668 #1735236] INFO -- : /home/opc/ruby/src/master/basictest/test.rb:math ..OK 2 I, [2024-05-24T17:24:37.142757 #1735236] INFO -- : /home/opc/ruby/src/master/basictest/test.rb:struct ......OK 6 I, [2024-05-24T17:24:37.142925 #1735236] INFO -- : /home/opc/ruby/src/master/basictest/test.rb:variable ............OK 12 I, [2024-05-24T17:24:37.142968 #1735236] INFO -- : /home/opc/ruby/src/master/basictest/test.rb:trace ...OK 3 I, [2024-05-24T17:24:37.143096 #1735236] INFO -- : /home/opc/ruby/src/master/basictest/test.rb:defined? ............OK 12 I, [2024-05-24T17:24:37.143185 #1735236] INFO -- : /home/opc/ruby/src/master/basictest/test.rb:alias ......OK 6 I, [2024-05-24T17:24:37.143754 #1735236] INFO -- : /home/opc/ruby/src/master/basictest/test.rb:path .......................OK 23 I, [2024-05-24T17:24:37.210163 #1735236] INFO -- : /home/opc/ruby/src/master/basictest/test.rb:gc ....OK 4 I, [2024-05-24T17:24:37.212135 #1735236] INFO -- : I, [2024-05-24T17:24:37.212168 #1735236] INFO -- : test succeeded I, [2024-05-24T17:24:37.212759 #1735236] INFO -- : $$$[end] "make yes-test-basic TESTS='-j3'" exit with 0. I, [2024-05-24T17:24:37.212926 #1735236] INFO -- : $$$[beg] make yes-test-all TESTOPTS='--stderr-on-failure' TESTS='-j3' I, [2024-05-24T17:24:37.336752 #1735236] INFO -- : BASERUBY = /usr/local/bin/ruby --disable=gems I, [2024-05-24T17:24:37.336827 #1735236] INFO -- : CC = gcc I, [2024-05-24T17:24:37.336840 #1735236] INFO -- : LD = ld I, [2024-05-24T17:24:37.336851 #1735236] INFO -- : LDSHARED = gcc -shared I, [2024-05-24T17:24:37.336861 #1735236] INFO -- : CFLAGS = -O3 -fno-fast-math -ggdb3 -Wall -Wextra -Wdeprecated-declarations -Wdiv-by-zero -Wduplicated-cond -Wimplicit-function-declaration -Wimplicit-int -Wpointer-arith -Wwrite-strings -Wold-style-definition -Wimplicit-fallthrough=0 -Wmissing-noreturn -Wno-cast-function-type -Wno-constant-logical-operand -Wno-long-long -Wno-missing-field-initializers -Wno-overlength-strings -Wno-packed-bitfield-compat -Wno-parentheses-equality -Wno-self-assign -Wno-tautological-compare -Wno-unused-parameter -Wno-unused-value -Wsuggest-attribute=format -Wsuggest-attribute=noreturn -Wunused-variable -Wmisleading-indentation -Wundef I, [2024-05-24T17:24:37.336872 #1735236] INFO -- : XCFLAGS = -U_FORTIFY_SOURCE -D_FORTIFY_SOURCE=2 -fstack-protector-strong -msign-return-address=all -fno-strict-overflow -fvisibility=hidden -fexcess-precision=standard -DRUBY_EXPORT -fPIE -I. -I.ext/include/aarch64-linux -I/home/opc/ruby/src/master/include -I/home/opc/ruby/src/master -I/home/opc/ruby/src/master/prism -I/home/opc/ruby/src/master/enc/unicode/15.0.0 I, [2024-05-24T17:24:37.336881 #1735236] INFO -- : CPPFLAGS = I, [2024-05-24T17:24:37.336889 #1735236] INFO -- : DLDFLAGS = -Wl,--compress-debug-sections=zlib -fstack-protector-strong -pie I, [2024-05-24T17:24:37.336898 #1735236] INFO -- : SOLIBS = -lz -lrt -lrt -ldl -lcrypt -lm -lpthread I, [2024-05-24T17:24:37.336907 #1735236] INFO -- : LANG = en_US.UTF-8 I, [2024-05-24T17:24:37.336915 #1735236] INFO -- : LC_ALL = I, [2024-05-24T17:24:37.336924 #1735236] INFO -- : LC_CTYPE = I, [2024-05-24T17:24:37.336933 #1735236] INFO -- : MFLAGS = I, [2024-05-24T17:24:37.336941 #1735236] INFO -- : RUSTC = rustc I, [2024-05-24T17:24:37.336949 #1735236] INFO -- : YJIT_RUSTC_ARGS = --crate-name=yjit --crate-type=staticlib --edition=2021 -g -C lto=thin -C opt-level=3 -C overflow-checks=on '--out-dir=/home/opc/ruby/build/master/yjit/target/release/' /home/opc/ruby/src/master/yjit/src/lib.rs I, [2024-05-24T17:24:37.337761 #1735236] INFO -- : gcc (GCC) 8.5.0 20210514 (Red Hat 8.5.0-10.1.0.1) I, [2024-05-24T17:24:37.337798 #1735236] INFO -- : Copyright (C) 2018 Free Software Foundation, Inc. I, [2024-05-24T17:24:37.337810 #1735236] INFO -- : This is free software; see the source for copying conditions. There is NO I, [2024-05-24T17:24:37.337819 #1735236] INFO -- : warranty; not even for MERCHANTABILITY or FITNESS FOR A PARTICULAR PURPOSE. I, [2024-05-24T17:24:37.337828 #1735236] INFO -- : I, [2024-05-24T17:24:37.339703 #1735236] INFO -- : generating enc.mk I, [2024-05-24T17:24:37.576438 #1735236] INFO -- : generating encdb.h I, [2024-05-24T17:24:37.613522 #1735236] INFO -- : encdb.h unchanged I, [2024-05-24T17:24:37.614884 #1735236] INFO -- : making enc I, [2024-05-24T17:24:37.642109 #1735236] INFO -- : make[1]: Entering directory '/home/opc/ruby/build/master' I, [2024-05-24T17:24:37.642158 #1735236] INFO -- : make[1]: Nothing to be done for 'enc'. I, [2024-05-24T17:24:37.642168 #1735236] INFO -- : make[1]: Leaving directory '/home/opc/ruby/build/master' I, [2024-05-24T17:24:37.643040 #1735236] INFO -- : making srcs under enc I, [2024-05-24T17:24:37.684898 #1735236] INFO -- : make[1]: Entering directory '/home/opc/ruby/build/master' I, [2024-05-24T17:24:37.684968 #1735236] INFO -- : make[1]: Nothing to be done for 'srcs'. I, [2024-05-24T17:24:37.684978 #1735236] INFO -- : make[1]: Leaving directory '/home/opc/ruby/build/master' I, [2024-05-24T17:24:37.686176 #1735236] INFO -- : generating transdb.h I, [2024-05-24T17:24:37.829652 #1735236] INFO -- : transdb.h unchanged I, [2024-05-24T17:24:37.831062 #1735236] INFO -- : making trans I, [2024-05-24T17:24:37.879408 #1735236] INFO -- : make[1]: Entering directory '/home/opc/ruby/build/master' I, [2024-05-24T17:24:37.879485 #1735236] INFO -- : make[1]: Nothing to be done for 'trans'. I, [2024-05-24T17:24:37.879495 #1735236] INFO -- : make[1]: Leaving directory '/home/opc/ruby/build/master' I, [2024-05-24T17:24:37.880354 #1735236] INFO -- : making encs I, [2024-05-24T17:24:37.932682 #1735236] INFO -- : make[1]: Entering directory '/home/opc/ruby/build/master' I, [2024-05-24T17:24:37.932738 #1735236] INFO -- : make[1]: Nothing to be done for 'encs'. I, [2024-05-24T17:24:37.932751 #1735236] INFO -- : make[1]: Leaving directory '/home/opc/ruby/build/master' I, [2024-05-24T17:24:37.934811 #1735236] INFO -- : generating makefiles ext/configure-ext.mk I, [2024-05-24T17:24:37.975980 #1735236] INFO -- : ext/configure-ext.mk updated I, [2024-05-24T17:24:37.979461 #1735236] INFO -- : make[1]: Entering directory '/home/opc/ruby/build/master' I, [2024-05-24T17:24:40.107671 #1735236] INFO -- : make[1]: Leaving directory '/home/opc/ruby/build/master' I, [2024-05-24T17:24:40.108325 #1735236] INFO -- : generating makefile exts.mk I, [2024-05-24T17:24:40.168518 #1735236] INFO -- : exts.mk unchanged I, [2024-05-24T17:24:40.173328 #1735236] INFO -- : make[1]: Entering directory '/home/opc/ruby/build/master' I, [2024-05-24T17:24:40.473512 #1735236] INFO -- : make[2]: Entering directory '/home/opc/ruby/build/master/ext/coverage' I, [2024-05-24T17:24:40.478089 #1735236] INFO -- : make[2]: Leaving directory '/home/opc/ruby/build/master/ext/coverage' I, [2024-05-24T17:24:40.483674 #1735236] INFO -- : make[2]: Entering directory '/home/opc/ruby/build/master/ext/date' I, [2024-05-24T17:24:40.488995 #1735236] INFO -- : make[2]: Leaving directory '/home/opc/ruby/build/master/ext/date' I, [2024-05-24T17:24:40.492259 #1735236] INFO -- : make[2]: Entering directory '/home/opc/ruby/build/master/ext/digest' I, [2024-05-24T17:24:40.501046 #1735236] INFO -- : make[2]: Leaving directory '/home/opc/ruby/build/master/ext/digest' I, [2024-05-24T17:24:40.523087 #1735236] INFO -- : make[2]: Entering directory '/home/opc/ruby/build/master/ext/digest/sha2' I, [2024-05-24T17:24:40.528025 #1735236] INFO -- : make[2]: Leaving directory '/home/opc/ruby/build/master/ext/digest/sha2' I, [2024-05-24T17:24:40.546057 #1735236] INFO -- : make[2]: Entering directory '/home/opc/ruby/build/master/ext/fiddle' I, [2024-05-24T17:24:40.556040 #1735236] INFO -- : make[2]: Leaving directory '/home/opc/ruby/build/master/ext/fiddle' I, [2024-05-24T17:24:40.560249 #1735236] INFO -- : make[2]: Entering directory '/home/opc/ruby/build/master/ext/io/console' I, [2024-05-24T17:24:40.564430 #1735236] INFO -- : make[2]: Leaving directory '/home/opc/ruby/build/master/ext/io/console' I, [2024-05-24T17:24:40.575301 #1735236] INFO -- : make[2]: Entering directory '/home/opc/ruby/build/master/ext/json' I, [2024-05-24T17:24:40.584690 #1735236] INFO -- : make[2]: Leaving directory '/home/opc/ruby/build/master/ext/json' I, [2024-05-24T17:24:40.597693 #1735236] INFO -- : make[2]: Entering directory '/home/opc/ruby/build/master/ext/monitor' I, [2024-05-24T17:24:40.602351 #1735236] INFO -- : make[2]: Leaving directory '/home/opc/ruby/build/master/ext/monitor' I, [2024-05-24T17:24:40.608314 #1735236] INFO -- : make[2]: Entering directory '/home/opc/ruby/build/master/ext/objspace' I, [2024-05-24T17:24:40.614234 #1735236] INFO -- : make[2]: Leaving directory '/home/opc/ruby/build/master/ext/objspace' I, [2024-05-24T17:24:40.633123 #1735236] INFO -- : make[2]: Entering directory '/home/opc/ruby/build/master/ext/openssl' I, [2024-05-24T17:24:40.654753 #1735236] INFO -- : make[2]: Leaving directory '/home/opc/ruby/build/master/ext/openssl' I, [2024-05-24T17:24:40.659012 #1735236] INFO -- : make[2]: Entering directory '/home/opc/ruby/build/master/ext/pathname' I, [2024-05-24T17:24:40.663137 #1735236] INFO -- : make[2]: Leaving directory '/home/opc/ruby/build/master/ext/pathname' I, [2024-05-24T17:24:40.669458 #1735236] INFO -- : make[2]: Entering directory '/home/opc/ruby/build/master/ext/psych' I, [2024-05-24T17:24:40.691150 #1735236] INFO -- : make[2]: Leaving directory '/home/opc/ruby/build/master/ext/psych' I, [2024-05-24T17:24:40.695642 #1735236] INFO -- : make[2]: Entering directory '/home/opc/ruby/build/master/ext/pty' I, [2024-05-24T17:24:40.699815 #1735236] INFO -- : make[2]: Leaving directory '/home/opc/ruby/build/master/ext/pty' I, [2024-05-24T17:24:40.713169 #1735236] INFO -- : make[2]: Entering directory '/home/opc/ruby/build/master/ext/ripper' I, [2024-05-24T17:24:40.721076 #1735236] INFO -- : make[2]: Leaving directory '/home/opc/ruby/build/master/ext/ripper' I, [2024-05-24T17:24:40.723060 #1735236] INFO -- : make[2]: Entering directory '/home/opc/ruby/build/master/ext/rubyvm' I, [2024-05-24T17:24:40.726502 #1735236] INFO -- : make[2]: Leaving directory '/home/opc/ruby/build/master/ext/rubyvm' I, [2024-05-24T17:24:40.738489 #1735236] INFO -- : make[2]: Entering directory '/home/opc/ruby/build/master/ext/socket' I, [2024-05-24T17:24:40.749128 #1735236] INFO -- : make[2]: Leaving directory '/home/opc/ruby/build/master/ext/socket' I, [2024-05-24T17:24:40.764521 #1735236] INFO -- : make[2]: Entering directory '/home/opc/ruby/build/master/.bundle/gems/bigdecimal-3.1.7/ext/bigdecimal' I, [2024-05-24T17:24:40.795174 #1735236] INFO -- : make[2]: Leaving directory '/home/opc/ruby/build/master/.bundle/gems/bigdecimal-3.1.7/ext/bigdecimal' I, [2024-05-24T17:24:40.797870 #1735236] INFO -- : make[2]: Entering directory '/home/opc/ruby/build/master/.bundle/gems/bigdecimal-3.1.8/ext/bigdecimal' I, [2024-05-24T17:24:40.827819 #1735236] INFO -- : make[2]: Leaving directory '/home/opc/ruby/build/master/.bundle/gems/bigdecimal-3.1.8/ext/bigdecimal' I, [2024-05-24T17:24:40.830461 #1735236] INFO -- : make[2]: Entering directory '/home/opc/ruby/build/master/.bundle/gems/debug-1.9.2/ext/debug' I, [2024-05-24T17:24:40.861319 #1735236] INFO -- : make[2]: Leaving directory '/home/opc/ruby/build/master/.bundle/gems/debug-1.9.2/ext/debug' I, [2024-05-24T17:24:40.863877 #1735236] INFO -- : make[2]: Entering directory '/home/opc/ruby/build/master/.bundle/gems/nkf-0.2.0/ext/nkf' I, [2024-05-24T17:24:40.894545 #1735236] INFO -- : make[2]: Leaving directory '/home/opc/ruby/build/master/.bundle/gems/nkf-0.2.0/ext/nkf' I, [2024-05-24T17:24:40.897237 #1735236] INFO -- : make[2]: Entering directory '/home/opc/ruby/build/master/.bundle/gems/racc-1.7.3/ext/racc/cparse' I, [2024-05-24T17:24:40.927580 #1735236] INFO -- : make[2]: Leaving directory '/home/opc/ruby/build/master/.bundle/gems/racc-1.7.3/ext/racc/cparse' I, [2024-05-24T17:24:40.930160 #1735236] INFO -- : make[2]: Entering directory '/home/opc/ruby/build/master/.bundle/gems/racc-1.8.0/ext/racc/cparse' I, [2024-05-24T17:24:40.960999 #1735236] INFO -- : make[2]: Leaving directory '/home/opc/ruby/build/master/.bundle/gems/racc-1.8.0/ext/racc/cparse' I, [2024-05-24T17:24:40.963960 #1735236] INFO -- : make[2]: Entering directory '/home/opc/ruby/build/master/.bundle/gems/rbs-3.4.4/ext/rbs_extension' I, [2024-05-24T17:24:40.994349 #1735236] INFO -- : make[2]: Leaving directory '/home/opc/ruby/build/master/.bundle/gems/rbs-3.4.4/ext/rbs_extension' I, [2024-05-24T17:24:40.996925 #1735236] INFO -- : make[2]: Entering directory '/home/opc/ruby/build/master/.bundle/gems/syslog-0.1.2/ext/syslog' I, [2024-05-24T17:24:41.027647 #1735236] INFO -- : make[2]: Leaving directory '/home/opc/ruby/build/master/.bundle/gems/syslog-0.1.2/ext/syslog' I, [2024-05-24T17:24:41.065750 #1735236] INFO -- : make[2]: Entering directory '/home/opc/ruby/build/master' I, [2024-05-24T17:24:41.148196 #1735236] INFO -- : make[2]: 'ruby' is up to date. I, [2024-05-24T17:24:41.148274 #1735236] INFO -- : make[2]: Leaving directory '/home/opc/ruby/build/master' I, [2024-05-24T17:24:41.148416 #1735236] INFO -- : make[1]: Leaving directory '/home/opc/ruby/build/master' I, [2024-05-24T17:24:41.152823 #1735236] INFO -- : make[1]: Entering directory '/home/opc/ruby/build/master' I, [2024-05-24T17:24:41.152860 #1735236] INFO -- : make[1]: Nothing to be done for 'note'. I, [2024-05-24T17:24:41.152871 #1735236] INFO -- : make[1]: Leaving directory '/home/opc/ruby/build/master' I, [2024-05-24T17:24:41.265334 #1735236] INFO -- : Run options: I, [2024-05-24T17:24:41.265410 #1735236] INFO -- : --seed=10877 I, [2024-05-24T17:24:41.265421 #1735236] INFO -- : "--ruby=./miniruby -I/home/opc/ruby/src/master/lib -I. -I.ext/common /home/opc/ruby/src/master/tool/runruby.rb --extout=.ext -- --disable-gems" I, [2024-05-24T17:24:41.265430 #1735236] INFO -- : --excludes-dir=/home/opc/ruby/src/master/test/.excludes I, [2024-05-24T17:24:41.265438 #1735236] INFO -- : --name=!/memory_leak/ I, [2024-05-24T17:24:41.265446 #1735236] INFO -- : --stderr-on-failure I, [2024-05-24T17:24:41.265455 #1735236] INFO -- : -j3 I, [2024-05-24T17:24:41.265463 #1735236] INFO -- : I, [2024-05-24T17:24:41.265472 #1735236] INFO -- : # Running tests: I, [2024-05-24T17:24:41.265480 #1735236] INFO -- : I, [2024-05-24T17:24:41.394613 #1735236] INFO -- : [ 1/883] 1776385=test_egrep_cpp I, [2024-05-24T17:24:41.398094 #1735236] INFO -- : [ 2/883] 1776386=test_frozen I, [2024-05-24T17:24:41.399889 #1735236] INFO -- : [ 3/883] 1776386=test_serialize_subclasses I, [2024-05-24T17:24:41.421097 #1735236] INFO -- : [ 4/883] 1776387=test_gem_resolver_index_specification I, [2024-05-24T17:24:41.435313 #1735236] INFO -- : [ 5/883] 1776386=test_date_conv I, [2024-05-24T17:24:41.473732 #1735236] INFO -- : [ 6/883] 1776386=test_rdoc_markup_verbatim I, [2024-05-24T17:24:41.546203 #1735236] INFO -- : [ 7/883] 1776385=test_webauthn_poller I, [2024-05-24T17:24:41.561835 #1735236] INFO -- : [ 8/883] 1776386=test_timeout I, [2024-05-24T17:24:41.572524 #1735236] INFO -- : [ 9/883] 1776386=test_rdoc_generator_pot_po_entry I, [2024-05-24T17:24:41.580785 #1735236] INFO -- : [ 10/883] 1776386=test_erb_m17n I, [2024-05-24T17:24:41.601602 #1735236] INFO -- : [ 11/883] 1776386=test_coverage I, [2024-05-24T17:24:41.670714 #1735236] INFO -- : [ 12/883] 1776387=test_tempfile I, [2024-05-24T17:24:41.835104 #1735236] INFO -- : [ 13/883] 1776387=test_http_request I, [2024-05-24T17:24:41.862006 #1735236] INFO -- : [ 14/883] 1776385=test_store I, [2024-05-24T17:24:41.889880 #1735236] INFO -- : [ 15/883] 1776387=test_rdoc_markup_pre_process I, [2024-05-24T17:24:42.078813 #1735236] INFO -- : [ 16/883] 1776387=test_pathname I, [2024-05-24T17:24:42.202681 #1735236] INFO -- : [ 17/883] 1776385=test_fnmatch I, [2024-05-24T17:24:42.282829 #1735236] INFO -- : [ 18/883] 1776385=test_date I, [2024-05-24T17:24:42.287704 #1735236] INFO -- : [ 19/883] 1776385=test_big5 I, [2024-05-24T17:24:42.295034 #1735236] INFO -- : [ 20/883] 1776385=test_gem_commands_update_command I, [2024-05-24T17:24:42.328050 #1735236] INFO -- : [ 21/883] 1776387=test_protect I, [2024-05-24T17:24:42.338667 #1735236] INFO -- : [ 22/883] 1776387=test_tree_builder I, [2024-05-24T17:24:42.346458 #1735236] INFO -- : [ 23/883] 1776387=version_test I, [2024-05-24T17:24:42.376009 #1735236] INFO -- : [ 24/883] 1776386=test_raise I, [2024-05-24T17:24:42.383016 #1735236] INFO -- : [ 25/883] 1776386=test_complexrational I, [2024-05-24T17:24:42.386036 #1735236] INFO -- : [ 26/883] 1776386=test_function_entry I, [2024-05-24T17:24:42.410890 #1735236] INFO -- : [ 27/883] 1776386=test_error_highlight I, [2024-05-24T17:24:42.427603 #1735236] INFO -- : [ 28/883] 1776387=test_rdoc_any_method I, [2024-05-24T17:24:42.792865 #1735236] INFO -- : [ 29/883] 1776386=json_common_interface_test I, [2024-05-24T17:24:42.811510 #1735236] INFO -- : [ 30/883] 1776386=test_string I, [2024-05-24T17:24:42.825990 #1735236] INFO -- : [ 31/883] 1776386=test_marshalable I, [2024-05-24T17:24:42.831071 #1735236] INFO -- : [ 32/883] 1776386=test_line_editor I, [2024-05-24T17:24:42.857172 #1735236] INFO -- : [ 33/883] 1776387=reflection_test I, [2024-05-24T17:24:42.861966 #1735236] INFO -- : [ 34/883] 1776387=test_enumerator_kw I, [2024-05-24T17:24:42.877632 #1735236] INFO -- : [ 35/883] 1776387=test_help I, [2024-05-24T17:24:42.895180 #1735236] INFO -- : [ 36/883] 1776387=test_string_memory I, [2024-05-24T17:24:42.898730 #1735236] INFO -- : [ 37/883] 1776386=test_files_lib I, [2024-05-24T17:24:42.950747 #1735236] INFO -- : [ 38/883] 1776387=test_pkey_dsa I, [2024-05-24T17:24:44.090793 #1735236] INFO -- : [ 39/883] 1776385=test_logger I, [2024-05-24T17:24:44.109870 #1735236] INFO -- : [ 40/883] 1776385=test_gem_resolver_specification I, [2024-05-24T17:24:44.134724 #1735236] INFO -- : [ 41/883] 1776385=test_big2str I, [2024-05-24T17:24:44.140793 #1735236] INFO -- : [ 42/883] 1776385=test_command I, [2024-05-24T17:24:44.461691 #1735236] INFO -- : [ 43/883] 1776385=test_euc_tw I, [2024-05-24T17:24:44.470232 #1735236] INFO -- : [ 44/883] 1776385=test_gem_resolver_dependency_request I, [2024-05-24T17:24:44.611744 #1735236] INFO -- : [ 45/883] 1776385=test_cstr I, [2024-05-24T17:24:45.069160 #1735236] INFO -- : [ 46/883] 1776385=test_yaml_tree I, [2024-05-24T17:24:45.097538 #1735236] INFO -- : [ 47/883] 1776385=test_gem_commands_yank_command I, [2024-05-24T17:24:45.598491 #1735236] INFO -- : [ 48/883] 1776385=test_nil I, [2024-05-24T17:24:45.604069 #1735236] INFO -- : [ 49/883] 1776386=test_psych I, [2024-05-24T17:24:45.612623 #1735236] INFO -- : [ 50/883] 1776385=test_import I, [2024-05-24T17:24:45.634036 #1735236] INFO -- : [ 51/883] 1776386=test_human_typo I, [2024-05-24T17:24:45.647234 #1735236] INFO -- : [ 52/883] 1776386=test_wait I, [2024-05-24T17:24:45.703455 #1735236] INFO -- : [ 53/883] 1776386=test_passing_block I, [2024-05-24T17:24:45.718079 #1735236] INFO -- : [ 54/883] 1776386=test_defined I, [2024-05-24T17:24:45.769992 #1735236] INFO -- : [ 55/883] 1776386=test_nowrite I, [2024-05-24T17:24:45.808197 #1735236] INFO -- : [ 56/883] 1776386=test_thread_queue I, [2024-05-24T17:24:45.914482 #1735236] INFO -- : [ 57/883] 1776387=test_kdf I, [2024-05-24T17:24:45.972519 #1735236] INFO -- : [ 58/883] 1776387=test_ldap I, [2024-05-24T17:24:45.983339 #1735236] INFO -- : [ 59/883] 1776387=test_io_buffer I, [2024-05-24T17:24:46.013420 #1735236] INFO -- : [ 60/883] 1776387=test_io_timeout I, [2024-05-24T17:24:46.015898 #1735236] INFO -- : [ 61/883] 1776387=test_type_completor I, [2024-05-24T17:24:46.020679 #1735236] INFO -- : [ 62/883] 1776387=test_rdoc_normal_module I, [2024-05-24T17:24:46.061373 #1735236] INFO -- : [ 63/883] 1776387=test_rdoc_markdown_test I, [2024-05-24T17:24:46.423788 #1735236] INFO -- : [ 64/883] 1776385=test_yjit_exit_locations I, [2024-05-24T17:24:46.436540 #1735236] INFO -- : [ 65/883] 1776385=test_rdoc_rdoc I, [2024-05-24T17:24:46.524806 #1735236] INFO -- : [ 66/883] 1776385=test_comparable I, [2024-05-24T17:24:46.536585 #1735236] INFO -- : [ 67/883] 1776385=test_gem_config_file I, [2024-05-24T17:24:46.705013 #1735236] INFO -- : [ 68/883] 1776385=json_string_matching_test I, [2024-05-24T17:24:46.727924 #1735236] INFO -- : [ 69/883] 1776385=test_c_struct_builder I, [2024-05-24T17:24:46.824617 #1735236] INFO -- : [ 70/883] 1776385=test_yield_block I, [2024-05-24T17:24:46.828111 #1735236] INFO -- : [ 71/883] 1776385=test_bug-5832 I, [2024-05-24T17:24:46.834742 #1735236] INFO -- : [ 72/883] 1776385=test_gem_uri I, [2024-05-24T17:24:46.874754 #1735236] INFO -- : [ 73/883] 1776385=test_resource I, [2024-05-24T17:24:46.891575 #1735236] INFO -- : [ 74/883] 1776385=test_gem_package_tar_reader_entry I, [2024-05-24T17:24:47.054432 #1735236] INFO -- : [ 75/883] 1776387=test_gem_version I, [2024-05-24T17:24:47.066868 #1735236] INFO -- : [ 76/883] 1776385=test_spell_checker I, [2024-05-24T17:24:47.073551 #1735236] INFO -- : [ 77/883] 1776385=test_gem_ext_ext_conf_builder I, [2024-05-24T17:24:47.146762 #1735236] INFO -- : [ 78/883] 1776387=test_frozen_error I, [2024-05-24T17:24:47.152723 #1735236] INFO -- : [ 79/883] 1776387=test_reqarg I, [2024-05-24T17:24:47.517360 #1735236] INFO -- : [ 80/883] 1776387=test_enumerator I, [2024-05-24T17:24:47.521449 #1735236] INFO -- : [ 81/883] 1776387=test_path_to_class I, [2024-05-24T17:24:47.532427 #1735236] INFO -- : [ 82/883] 1776387=test_rdoc_options I, [2024-05-24T17:24:47.781877 #1735236] INFO -- : [ 83/883] 1776387=test_zlib I, [2024-05-24T17:24:48.130732 #1735236] INFO -- : [ 84/883] 1776385=test_gem_commands_unpack_command I, [2024-05-24T17:24:48.440227 #1735236] INFO -- : [ 85/883] 1776385=test_console_attr I, [2024-05-24T17:24:48.456021 #1735236] INFO -- : [ 86/883] 1776385=test_proc I, [2024-05-24T17:24:49.333092 #1735236] INFO -- : [ 87/883] 1776385=test_gem_ext_cargo_builder I, [2024-05-24T17:24:49.336863 #1735236] INFO -- : [ 88/883] 1776385=test_date_compat I, [2024-05-24T17:24:49.344692 #1735236] INFO -- : [ 89/883] 1776385=test_gem_version_option I, [2024-05-24T17:24:49.396539 #1735236] INFO -- : [ 90/883] 1776385=test_win32ole_record I, [2024-05-24T17:24:49.419346 #1735236] INFO -- : [ 91/883] 1776385=test_rdoc_include I, [2024-05-24T17:24:49.626387 #1735236] INFO -- : [ 92/883] 1776385=test_pstore I, [2024-05-24T17:24:49.651217 #1735236] INFO -- : [ 93/883] 1776385=test_ubf_async_safe I, [2024-05-24T17:24:49.668238 #1735236] INFO -- : [ 94/883] 1776385=test_find I, [2024-05-24T17:24:49.756650 #1735236] INFO -- : [ 95/883] 1776385=test_constant I, [2024-05-24T17:24:51.272806 #1735236] INFO -- : [ 96/883] 1776386=test_rdoc_generator_markup I, [2024-05-24T17:24:51.292710 #1735236] INFO -- : [ 97/883] 1776386=test_encoding I, [2024-05-24T17:24:51.520309 #1735236] INFO -- : [ 98/883] 1776386=test_hmac I, [2024-05-24T17:24:51.546602 #1735236] INFO -- : [ 99/883] 1776386=test_gem_commands_owner_command I, [2024-05-24T17:24:51.550384 #1735236] INFO -- : [100/883] 1776385=test_nextafter I, [2024-05-24T17:24:51.620697 #1735236] INFO -- : [101/883] 1776387=test_capacity I, [2024-05-24T17:24:51.631411 #1735236] INFO -- : [102/883] 1776385=test_file I, [2024-05-24T17:24:51.647395 #1735236] INFO -- : [103/883] 1776387=test_time I, [2024-05-24T17:24:51.652752 #1735236] INFO -- : [104/883] 1776385=test_numeric I, [2024-05-24T17:24:51.730606 #1735236] INFO -- : [105/883] 1776385=test_bug-3571 I, [2024-05-24T17:24:51.736610 #1735236] INFO -- : [106/883] 1776385=test_yamlstore I, [2024-05-24T17:24:51.747964 #1735236] INFO -- : [107/883] 1776385=test_flags I, [2024-05-24T17:24:51.772751 #1735236] INFO -- : [108/883] 1776387=test_gem_request_connection_pools I, [2024-05-24T17:24:52.298817 #1735236] INFO -- : [109/883] 1776385=test_init I, [2024-05-24T17:24:52.303049 #1735236] INFO -- : [110/883] 1776386=test_rat I, [2024-05-24T17:24:52.308296 #1735236] INFO -- : [111/883] 1776386=test_gem_requirement I, [2024-05-24T17:24:52.456896 #1735236] INFO -- : [112/883] 1776386=test_integer I, [2024-05-24T17:24:52.512059 #1735236] INFO -- : [113/883] 1776386=test_gem_name_tuple I, [2024-05-24T17:24:52.528897 #1735236] INFO -- : [114/883] 1776386=test_rdoc_markup_to_table_of_contents I, [2024-05-24T17:24:52.573771 #1735236] INFO -- : [115/883] 1776386=parse_comments_test I, [2024-05-24T17:24:52.585397 #1735236] INFO -- : [116/883] 1776385=test_win32ole_method_event I, [2024-05-24T17:24:52.647407 #1735236] INFO -- : [117/883] 1776385=test_tcp I, [2024-05-24T17:24:52.653733 #1735236] INFO -- : [118/883] 1776386=test_gem_commands_server_command I, [2024-05-24T17:24:52.660161 #1735236] INFO -- : [119/883] 1776386=test_gem_resolver_activation_request I, [2024-05-24T17:24:52.668162 #1735236] INFO -- : [120/883] 1776386=test_function I, [2024-05-24T17:24:52.677313 #1735236] INFO -- : [121/883] 1776385=test_pipe I, [2024-05-24T17:24:52.818532 #1735236] INFO -- : [122/883] 1776385=test_string I, [2024-05-24T17:24:52.832428 #1735236] INFO -- : [123/883] 1776387=test_macro I, [2024-05-24T17:24:52.885028 #1735236] INFO -- : [124/883] 1776387=test_rdoc_parser_changelog I, [2024-05-24T17:24:52.899458 #1735236] INFO -- : [125/883] 1776386=parameters_signature_test I, [2024-05-24T17:24:52.916769 #1735236] INFO -- : [126/883] 1776386=test_gem_dependency_list I, [2024-05-24T17:24:52.956710 #1735236] INFO -- : [127/883] 1776387=test_gem_commands_outdated_command I, [2024-05-24T17:24:53.008420 #1735236] INFO -- : [128/883] 1776386=test_securerandom I, [2024-05-24T17:24:53.026426 #1735236] INFO -- : [129/883] 1776387=test_typeddata I, [2024-05-24T17:24:53.092591 #1735236] INFO -- : [130/883] 1776386=test_gem_commands_fetch_command I, [2024-05-24T17:24:53.254964 #1735236] INFO -- : [131/883] 1776386=test_tsort I, [2024-05-24T17:24:53.274924 #1735236] INFO -- : [132/883] 1776386=parse_test I, [2024-05-24T17:24:53.289027 #1735236] INFO -- : [133/883] 1776387=test_pack I, [2024-05-24T17:24:53.528636 #1735236] INFO -- : [134/883] 1776387=test_io_wait I, [2024-05-24T17:24:53.878099 #1735236] INFO -- : [135/883] 1776387=test_kwargs I, [2024-05-24T17:24:53.891358 #1735236] INFO -- : [136/883] 1776387=test_rdoc_parser_c I, [2024-05-24T17:24:54.136214 #1735236] INFO -- : [137/883] 1776387=test_len I, [2024-05-24T17:24:54.143857 #1735236] INFO -- : [138/883] 1776387=json_fixtures_test I, [2024-05-24T17:24:54.161687 #1735236] INFO -- : [139/883] 1776387=test_gem_doctor I, [2024-05-24T17:24:54.219485 #1735236] INFO -- : [140/883] 1776387=test_gem_source_specific_file I, [2024-05-24T17:24:54.329034 #1735236] INFO -- : [141/883] 1776387=test_provider I, [2024-05-24T17:24:54.331062 #1735236] INFO -- : [142/883] 1776387=test_euc_kr I, [2024-05-24T17:24:54.339039 #1735236] INFO -- : [143/883] 1776387=test_bmethod I, [2024-05-24T17:24:54.346813 #1735236] INFO -- : [144/883] 1776387=test_process I, [2024-05-24T17:24:55.928948 #1735236] INFO -- : Leaked file descriptor: TestProcess#test_uid_from_name: 7 # I, [2024-05-24T17:24:55.929192 #1735236] INFO -- : Leaked file descriptor: TestProcess#test_uid_from_name: 8 # I, [2024-05-24T17:24:55.955525 #1735236] INFO -- : [145/883] 1776386=test_rdoc_code_objectCOMMAND PID USER FD TYPE DEVICE SIZE/OFF NODE NAME I, [2024-05-24T17:24:55.955599 #1735236] INFO -- : ruby 1776387 opc 7r REG 252,0 9253600 13705411 /var/lib/sss/mc/passwd I, [2024-05-24T17:24:55.955609 #1735236] INFO -- : ruby 1776387 opc 8u unix 0x0000000000000000 0t0 3125504520 type=STREAM I, [2024-05-24T17:24:55.982069 #1735236] INFO -- : I, [2024-05-24T17:24:56.315749 #1735236] INFO -- : [146/883] 1776386=test_rdoc_markup_attributes I, [2024-05-24T17:24:56.325968 #1735236] INFO -- : [147/883] 1776386=test_string_processing I, [2024-05-24T17:24:56.326354 #1735236] INFO -- : [148/883] 1776386=test_random_formatter I, [2024-05-24T17:24:56.341973 #1735236] INFO -- : [149/883] 1776386=test_rand I, [2024-05-24T17:24:56.614515 #1735236] INFO -- : [150/883] 1776386=redundant_return_test I, [2024-05-24T17:24:56.624635 #1735236] INFO -- : [151/883] 1776386=test_rdoc_markup_to_html_snippet I, [2024-05-24T17:24:56.718250 #1735236] INFO -- : [152/883] 1776386=test_common I, [2024-05-24T17:24:56.907095 #1735236] INFO -- : [153/883] 1776386=test_generic I, [2024-05-24T17:24:56.937646 #1735236] INFO -- : [154/883] 1776386=test_rdoc_constant I, [2024-05-24T17:24:57.025487 #1735236] INFO -- : [155/883] 1776386=test_deprecate I, [2024-05-24T17:24:57.095282 #1735236] INFO -- : [156/883] 1776386=test_httpresponses I, [2024-05-24T17:24:57.105917 #1735236] INFO -- : [157/883] 1776386=test_rdoc_markdown I, [2024-05-24T17:24:57.354503 #1735236] INFO -- : [158/883] 1776386=test_gem_request_set_lockfile I, [2024-05-24T17:24:57.826450 #1735236] INFO -- : [159/883] 1776386=test_postponed_job I, [2024-05-24T17:24:58.120135 #1735236] INFO -- : [160/883] 1776386=test_key_actor_vi I, [2024-05-24T17:24:58.224625 #1735236] INFO -- : [161/883] 1776386=test_rdoc_encoding I, [2024-05-24T17:24:58.290782 #1735236] INFO -- : [162/883] 1776386=test_win32ole_variant_outarg I, [2024-05-24T17:24:58.319676 #1735236] INFO -- : [163/883] 1776386=test_ns_spki I, [2024-05-24T17:24:58.432924 #1735236] INFO -- : [164/883] 1776386=test_have_library I, [2024-05-24T17:24:59.451682 #1735236] INFO -- : [165/883] 1776386=test_stream I, [2024-05-24T17:24:59.460402 #1735236] INFO -- : [166/883] 1776386=test_iseq_load I, [2024-05-24T17:25:00.686942 #1735236] INFO -- : [167/883] 1776386=test_rdoc_markup_parser I, [2024-05-24T17:25:00.753482 #1735236] INFO -- : [168/883] 1776386=test_rdoc_markup_indented_paragraph I, [2024-05-24T17:25:00.760996 #1735236] INFO -- : [169/883] 1776386=library_symbols_test I, [2024-05-24T17:25:00.771651 #1735236] INFO -- : [170/883] 1776386=test_rdoc_text I, [2024-05-24T17:25:00.837658 #1735236] INFO -- : [171/883] 1776386=test_objspace I, [2024-05-24T17:25:03.074787 #1735236] INFO -- : Leaked file descriptor: TestProcess#test_gid_from_name: 9 # I, [2024-05-24T17:25:03.105198 #1735236] INFO -- : COMMAND PID USER FD TYPE DEVICE SIZE/OFF NODE NAME I, [2024-05-24T17:25:03.105271 #1735236] INFO -- : ruby 1776387 opc 9r REG 252,0 6940392 13705429 /var/lib/sss/mc/group I, [2024-05-24T17:25:07.315989 #1735236] INFO -- : [172/883] 1776385=test_require I, [2024-05-24T17:25:07.325752 #1735236] INFO -- : [173/883] 1776385=test_stringify_symbols I, [2024-05-24T17:25:07.341864 #1735236] INFO -- : [174/883] 1776385=test_pack I, [2024-05-24T17:25:07.580637 #1735236] INFO -- : [175/883] 1776385=test_gem_commands_environment_command I, [2024-05-24T17:25:07.660555 #1735236] INFO -- : [176/883] 1776385=test_pkcs7 I, [2024-05-24T17:25:07.821924 #1735236] INFO -- : [177/883] 1776385=test_basicsocket I, [2024-05-24T17:25:07.832931 #1735236] INFO -- : [178/883] 1776385=test_zsh_completion I, [2024-05-24T17:25:07.854864 #1735236] INFO -- : [179/883] 1776385=test_syntax I, [2024-05-24T17:25:12.914368 #1735236] INFO -- : [180/883] 1776387=test_scalar I, [2024-05-24T17:25:12.929980 #1735236] INFO -- : [181/883] 1776387=test_class_name_check I, [2024-05-24T17:25:13.075550 #1735236] INFO -- : [182/883] 1776387=test_files_test_2 I, [2024-05-24T17:25:14.190948 #1735236] INFO -- : [183/883] 1776385=test_div I, [2024-05-24T17:25:14.206385 #1735236] INFO -- : [184/883] 1776385=test_rdoc_markup_to_html_crossref I, [2024-05-24T17:25:14.498823 #1735236] INFO -- : [185/883] 1776385=test_bash_completion I, [2024-05-24T17:25:14.562153 #1735236] INFO -- : [186/883] 1776385=test_exception I, [2024-05-24T17:25:15.780710 #1735236] INFO -- : [187/883] 1776387=test_optparse I, [2024-05-24T17:25:15.785791 #1735236] INFO -- : [188/883] 1776387=test_deprecated I, [2024-05-24T17:25:15.795608 #1735236] INFO -- : [189/883] 1776387=test_rdoc_context_section I, [2024-05-24T17:25:15.804726 #1735236] INFO -- : [190/883] 1776387=test_io_buffer I, [2024-05-24T17:25:15.931836 #1735236] INFO -- : [191/883] 1776387=test_rdoc_alias I, [2024-05-24T17:25:16.436651 #1735236] INFO -- : [192/883] 1776387=test_instrumentation_api I, [2024-05-24T17:25:16.971667 #1735236] INFO -- : [193/883] 1776385=test_weakref I, [2024-05-24T17:25:17.104779 #1735236] INFO -- : [194/883] 1776385=test_rdoc_markup_to_bs I, [2024-05-24T17:25:17.143919 #1735236] INFO -- : [195/883] 1776385=test_key_name_check I, [2024-05-24T17:25:17.149038 #1735236] INFO -- : [196/883] 1776385=test_rdoc_markup_raw I, [2024-05-24T17:25:17.158280 #1735236] INFO -- : [197/883] 1776385=test_timeout I, [2024-05-24T17:25:17.970886 #1735236] INFO -- : [198/883] 1776385=test_word I, [2024-05-24T17:25:17.987281 #1735236] INFO -- : [199/883] 1776385=test_rdoc_require I, [2024-05-24T17:25:18.120735 #1735236] INFO -- : [200/883] 1776385=test_gem_ext_rake_builder I, [2024-05-24T17:25:18.615115 #1735236] INFO -- : [201/883] 1776385=test_fstring I, [2024-05-24T17:25:18.725013 #1735236] INFO -- : [202/883] 1776385=test_numeric I, [2024-05-24T17:25:18.734708 #1735236] INFO -- : [203/883] 1776385=test_singleton I, [2024-05-24T17:25:18.749412 #1735236] INFO -- : [204/883] 1776385=test_gem_commands_cert_command I, [2024-05-24T17:25:18.994066 #1735236] INFO -- : [205/883] 1776387=test_date_strftime I, [2024-05-24T17:25:19.367014 #1735236] INFO -- : [206/883] 1776387=json_parser_test I, [2024-05-24T17:25:19.422893 #1735236] INFO -- : [207/883] 1776387=test_ws I, [2024-05-24T17:25:19.430397 #1735236] INFO -- : [208/883] 1776387=test_rdoc_markup_to_tt_only I, [2024-05-24T17:25:19.473761 #1735236] INFO -- : [209/883] 1776387=ruby_parser_test I, [2024-05-24T17:25:19.487551 #1735236] INFO -- : [210/883] 1776387=test_gem_commands_stale_command I, [2024-05-24T17:25:19.499524 #1735236] INFO -- : [211/883] 1776387=test_gem_platform I, [2024-05-24T17:25:19.614359 #1735236] INFO -- : [212/883] 1776387=test_gem_commands_query_command I, [2024-05-24T17:25:20.223359 #1735236] INFO -- : [213/883] 1776387=test_bigzero I, [2024-05-24T17:25:20.232762 #1735236] INFO -- : [214/883] 1776387=test_external_new I, [2024-05-24T17:25:20.244573 #1735236] INFO -- : [215/883] 1776387=test_pkey I, [2024-05-24T17:25:20.253330 #1735236] INFO -- : [216/883] 1776387=test_win32ole_typelib I, [2024-05-24T17:25:20.278458 #1735236] INFO -- : [217/883] 1776387=test_m17n_comb I, [2024-05-24T17:25:20.327103 #1735236] INFO -- : [218/883] 1776385=test_pkey_dh I, [2024-05-24T17:25:21.655331 #1735236] INFO -- : [219/883] 1776385=test_multi_irb_commands I, [2024-05-24T17:25:21.659518 #1735236] INFO -- : [220/883] 1776385=test_memory_view I, [2024-05-24T17:25:21.684201 #1735236] INFO -- : [221/883] 1776385=test_data I, [2024-05-24T17:25:21.688057 #1735236] INFO -- : [222/883] 1776385=test_null I, [2024-05-24T17:25:21.710629 #1735236] INFO -- : [223/883] 1776385=test_ractor I, [2024-05-24T17:25:21.754469 #1735236] INFO -- : [224/883] 1776385=test_rdoc_i18n_text I, [2024-05-24T17:25:21.779132 #1735236] INFO -- : [225/883] 1776385=test_io I, [2024-05-24T17:25:21.982963 #1735236] INFO -- : [226/883] 1776385=test_input_method I, [2024-05-24T17:25:22.048420 #1735236] INFO -- : [227/883] 1776385=test_gem_util I, [2024-05-24T17:25:22.212011 #1735236] INFO -- : [228/883] 1776385=test_config I, [2024-05-24T17:25:22.263234 #1735236] INFO -- : [229/883] 1776385=test_complex2 I, [2024-05-24T17:25:22.273820 #1735236] INFO -- : [230/883] 1776385=test_gem_security_signer I, [2024-05-24T17:25:22.371188 #1735236] INFO -- : [231/883] 1776385=test_thread I, [2024-05-24T17:25:22.578285 #1735236] INFO -- : [232/883] 1776387=test_literal I, [2024-05-24T17:25:22.594061 #1735236] INFO -- : [233/883] 1776385=test_gem_unsatisfiable_dependency_error I, [2024-05-24T17:25:22.621310 #1735236] INFO -- : [234/883] 1776385=test_pkey_ec I, [2024-05-24T17:25:22.636247 #1735236] INFO -- : [235/883] 1776385=test_svcb_https I, [2024-05-24T17:25:22.646008 #1735236] INFO -- : [236/883] 1776385=test_buffering I, [2024-05-24T17:25:22.651008 #1735236] INFO -- : [237/883] 1776385=test_thread I, [2024-05-24T17:25:22.657954 #1735236] INFO -- : [238/883] 1776385=test_arity I, [2024-05-24T17:25:22.661666 #1735236] INFO -- : [239/883] 1776385=test_date_parse I, [2024-05-24T17:25:22.791460 #1735236] INFO -- : [240/883] 1776385=test_mdns I, [2024-05-24T17:25:22.801037 #1735236] INFO -- : [241/883] 1776385=test_open3 I, [2024-05-24T17:25:22.952941 #1735236] INFO -- : [242/883] 1776387=test_key_event_record I, [2024-05-24T17:25:22.976584 #1735236] INFO -- : [243/883] 1776387=test_webauthn_listener I, [2024-05-24T17:25:23.022643 #1735236] INFO -- : Leaked file descriptor: WebauthnListenerTest#test_wait_for_otp_code_get_follows_options: 12 : # I, [2024-05-24T17:25:23.057516 #1735236] INFO -- : COMMAND PID USER FD TYPE DEVICE SIZE/OFF NODE NAME I, [2024-05-24T17:25:23.057584 #1735236] INFO -- : ruby 1776387 opc 12u IPv4 3125509581 0t0 TCP localhost:42233->localhost:45404 (CLOSE_WAIT) I, [2024-05-24T17:25:23.104417 #1735236] INFO -- : [244/883] 1776387=test_rdoc_rubygems_hook I, [2024-05-24T17:25:23.182050 #1735236] INFO -- : Closed file descriptor: TestRDocRubygemsHook#test_generate_all: 12 I, [2024-05-24T17:25:23.209740 #1735236] INFO -- : [245/883] 1776387=test_gem_resolver_api_specification I, [2024-05-24T17:25:23.257213 #1735236] INFO -- : [246/883] 1776387=test_ractor I, [2024-05-24T17:25:23.271497 #1735236] INFO -- : [247/883] 1776387=test_gem_ext_cargo_builder_unit I, [2024-05-24T17:25:23.306210 #1735236] INFO -- : [248/883] 1776387=test_case_mapping I, [2024-05-24T17:25:23.321880 #1735236] INFO -- : [249/883] 1776387=test_rational I, [2024-05-24T17:25:23.340905 #1735236] INFO -- : [250/883] 1776387=test_grapheme_breaks I, [2024-05-24T17:25:23.358074 #1735236] INFO -- : [251/883] 1776387=test_hash_create I, [2024-05-24T17:25:23.364320 #1735236] INFO -- : [252/883] 1776387=static_literals_test I, [2024-05-24T17:25:23.379677 #1735236] INFO -- : [253/883] 1776387=test_tree_spell_checker I, [2024-05-24T17:25:23.412988 #1735236] INFO -- : [254/883] 1776387=test_set I, [2024-05-24T17:25:23.436927 #1735236] INFO -- : [255/883] 1776387=test_rdoc_method_attr I, [2024-05-24T17:25:23.547830 #1735236] INFO -- : [256/883] 1776387=test_enumerable I, [2024-05-24T17:25:23.567563 #1735236] INFO -- : [257/883] 1776387=test_gem_commands_dependency_command I, [2024-05-24T17:25:23.654943 #1735236] INFO -- : [258/883] 1776387=test_gbk I, [2024-05-24T17:25:23.661724 #1735236] INFO -- : [259/883] 1776387=test_backtrace I, [2024-05-24T17:25:23.666994 #1735236] INFO -- : [260/883] 1776387=test_default_gems I, [2024-05-24T17:25:23.724763 #1735236] INFO -- : [261/883] 1776387=test_switch_hitter I, [2024-05-24T17:25:23.744832 #1735236] INFO -- : [262/883] 1776387=test_unicode_escape I, [2024-05-24T17:25:23.989779 #1735236] INFO -- : [263/883] 1776387=test_gem_spec_fetcher I, [2024-05-24T17:25:24.199030 #1735236] INFO -- : [264/883] 1776387=test_yamldbm I, [2024-05-24T17:25:24.220129 #1735236] INFO -- : [265/883] 1776387=test_enc_raise I, [2024-05-24T17:25:24.256913 #1735236] INFO -- : [266/883] 1776387=test_clone I, [2024-05-24T17:25:24.481719 #1735236] INFO -- : [267/883] 1776387=test_cgi_util I, [2024-05-24T17:25:24.587895 #1735236] INFO -- : [268/883] 1776386=test_ole_methods I, [2024-05-24T17:25:24.596284 #1735236] INFO -- : [269/883] 1776386=test_prettyprint I, [2024-05-24T17:25:24.613418 #1735236] INFO -- : [270/883] 1776386=test_gem_uri_formatter I, [2024-05-24T17:25:24.654834 #1735236] INFO -- : [271/883] 1776386=test_dryrun I, [2024-05-24T17:25:24.672280 #1735236] INFO -- : [272/883] 1776387=test_rdoc_i18n_locale I, [2024-05-24T17:25:24.680407 #1735236] INFO -- : [273/883] 1776387=test_gc_compact I, [2024-05-24T17:25:24.702439 #1735236] INFO -- : [274/883] 1776386=test_boolean I, [2024-05-24T17:25:24.716458 #1735236] INFO -- : [275/883] 1776386=test_gem_resolver_lock_specification I, [2024-05-24T17:25:24.763360 #1735236] INFO -- : [276/883] 1776386=test_queue I, [2024-05-24T17:25:24.774833 #1735236] INFO -- : [277/883] 1776386=test_remote_fetch_error I, [2024-05-24T17:25:24.788626 #1735236] INFO -- : [278/883] 1776386=test_show_source I, [2024-05-24T17:25:24.880230 #1735236] INFO -- : [279/883] 1776386=test_yield I, [2024-05-24T17:25:25.541752 #1735236] INFO -- : [280/883] 1776385=regexp_test I, [2024-05-24T17:25:25.582121 #1735236] INFO -- : [281/883] 1776385=test_rdoc_store I, [2024-05-24T17:25:26.276631 #1735236] INFO -- : [282/883] 1776385=test_shift_jis I, [2024-05-24T17:25:26.348336 #1735236] INFO -- : [283/883] 1776385=test_optimization I, [2024-05-24T17:25:27.549065 #1735236] INFO -- : [284/883] 1776387=test_force_exit I, [2024-05-24T17:25:27.589696 #1735236] INFO -- : [285/883] 1776387=test_rubyoptions I, [2024-05-24T17:25:27.660630 #1735236] INFO -- : [286/883] 1776386=test_data_error I, [2024-05-24T17:25:27.729502 #1735236] INFO -- : [287/883] 1776386=test_files_sample I, [2024-05-24T17:25:27.737883 #1735236] INFO -- : [288/883] 1776386=test_rdoc_stats I, [2024-05-24T17:25:27.776762 #1735236] INFO -- : [289/883] 1776386=test_assignment I, [2024-05-24T17:25:29.071388 #1735236] INFO -- : [290/883] 1776386=test_gem_update_suggestion I, [2024-05-24T17:25:29.151192 #1735236] INFO -- : [291/883] 1776386=test_normalize I, [2024-05-24T17:25:29.158594 #1735236] INFO -- : [292/883] 1776386=test_emoji_breaks I, [2024-05-24T17:25:29.205443 #1735236] INFO -- : [293/883] 1776386=test_gem_commands_open_command I, [2024-05-24T17:25:29.264718 #1735236] INFO -- : [294/883] 1776386=test_verbose I, [2024-05-24T17:25:29.298941 #1735236] INFO -- : [295/883] 1776386=test_asn1 I, [2024-05-24T17:25:29.320803 #1735236] INFO -- : [296/883] 1776386=test_gem_command I, [2024-05-24T17:25:29.453979 #1735236] INFO -- : [297/883] 1776386=test_rdoc_generator_darkfish I, [2024-05-24T17:25:29.819194 #1735236] INFO -- : [298/883] 1776386=test_gem_resolver_lock_set I, [2024-05-24T17:25:29.837283 #1735236] INFO -- : [299/883] 1776386=test_random I, [2024-05-24T17:25:29.841126 #1735236] INFO -- : [300/883] 1776386=test_undef I, [2024-05-24T17:25:29.847426 #1735236] INFO -- : [301/883] 1776386=test_exception I, [2024-05-24T17:25:29.904085 #1735236] INFO -- : [302/883] 1776386=test_raise_exception I, [2024-05-24T17:25:30.503204 #1735236] INFO -- : [303/883] 1776386=test_arith_seq_beg_len_step I, [2024-05-24T17:25:30.518140 #1735236] INFO -- : [304/883] 1776386=test_noarg I, [2024-05-24T17:25:30.759232 #1735236] INFO -- : [305/883] 1776386=test_gem_resolver_requirement_list I, [2024-05-24T17:25:30.771121 #1735236] INFO -- : [306/883] 1776386=test_pp I, [2024-05-24T17:25:30.809388 #1735236] INFO -- : .Leaked file descriptor: PPTestModule::PPFileStatTest#test_nothing_raised: 10 # I, [2024-05-24T17:25:30.846957 #1735236] INFO -- : COMMAND PID USER FD TYPE DEVICE SIZE/OFF NODE NAME I, [2024-05-24T17:25:30.847029 #1735236] INFO -- : ruby 1776386 opc 10r REG 252,0 9253600 13705411 /var/lib/sss/mc/passwd I, [2024-05-24T17:25:30.897279 #1735236] INFO -- : [307/883] 1776386=test_gem_impossible_dependencies_error I, [2024-05-24T17:25:30.903941 #1735236] INFO -- : [308/883] 1776386=test_optarg I, [2024-05-24T17:25:30.989624 #1735236] INFO -- : [309/883] 1776386=test_gem_commands_pristine_command I, [2024-05-24T17:25:32.398488 #1735236] INFO -- : [310/883] 1776386=test_rdoc_tom_doc I, [2024-05-24T17:25:32.426090 #1735236] INFO -- : [311/883] 1776386=test_hash I, [2024-05-24T17:25:32.441819 #1735236] INFO -- : [312/883] 1776386=test_variable I, [2024-05-24T17:25:32.561193 #1735236] INFO -- : [313/883] 1776386=test_date_ractor I, [2024-05-24T17:25:32.766235 #1735236] INFO -- : [314/883] 1776386=test_erb I, [2024-05-24T17:25:32.824194 #1735236] INFO -- : [315/883] 1776386=test_gem_security I, [2024-05-24T17:25:32.956698 #1735236] INFO -- : [316/883] 1776385=test_key_actor_emacs I, [2024-05-24T17:25:33.078948 #1735236] INFO -- : [317/883] 1776385=test_utf32 I, [2024-05-24T17:25:33.084426 #1735236] INFO -- : [318/883] 1776385=test_gem_resolver_git_specification I, [2024-05-24T17:25:33.417730 #1735236] INFO -- : [319/883] 1776385=test_basicinstructions I, [2024-05-24T17:25:33.502692 #1735236] INFO -- : [320/883] 1776385=test_gem_rdoc I, [2024-05-24T17:25:33.627168 #1735236] INFO -- : [321/883] 1776385=test_dot_dot I, [2024-05-24T17:25:33.638636 #1735236] INFO -- : [322/883] 1776385=pattern_test I, [2024-05-24T17:25:33.659423 #1735236] INFO -- : [323/883] 1776385=test_kernel I, [2024-05-24T17:25:33.959409 #1735236] INFO -- : [324/883] 1776387=test_rendering I, [2024-05-24T17:25:33.986305 #1735236] INFO -- : [325/883] 1776387=test_gem_commands_install_command I, [2024-05-24T17:25:34.272071 #1735236] INFO -- : [326/883] 1776385=test_string I, [2024-05-24T17:25:34.282529 #1735236] INFO -- : [327/883] 1776385=test_iterator I, [2024-05-24T17:25:34.361208 #1735236] INFO -- : [328/883] 1776385=test_merge_keys I, [2024-05-24T17:25:34.363206 #1735236] INFO -- : [329/883] 1776385=test_err_in_callback I, [2024-05-24T17:25:34.386165 #1735236] INFO -- : [330/883] 1776385=test_method_name_check I, [2024-05-24T17:25:34.422195 #1735236] INFO -- : [331/883] 1776385=test_storage I, [2024-05-24T17:25:34.454771 #1735236] INFO -- : [332/883] 1776385=test_rdoc_extend I, [2024-05-24T17:25:34.468330 #1735236] INFO -- : [333/883] 1776385=test_cesu8 I, [2024-05-24T17:25:34.481715 #1735236] INFO -- : [334/883] 1776385=test_shapes I, [2024-05-24T17:25:34.488947 #1735236] INFO -- : [335/883] 1776385=test_did_you_mean I, [2024-05-24T17:25:34.613001 #1735236] INFO -- : [336/883] 1776385=test_complex I, [2024-05-24T17:25:34.711064 #1735236] INFO -- : [337/883] 1776385=test_threadgroup I, [2024-05-24T17:25:35.717101 #1735236] INFO -- : [338/883] 1776387=test_dir_m17n I, [2024-05-24T17:25:35.764167 #1735236] INFO -- : [339/883] 1776385=test_memory_view I, [2024-05-24T17:25:36.028242 #1735236] INFO -- : [340/883] 1776385=test_array_create I, [2024-05-24T17:25:36.035696 #1735236] INFO -- : [341/883] 1776385=test_process I, [2024-05-24T17:25:36.070093 #1735236] INFO -- : [342/883] 1776385=test_forwardable I, [2024-05-24T17:25:36.079461 #1735236] INFO -- : [343/883] 1776385=test_fd_setsize I, [2024-05-24T17:25:36.080843 #1735236] INFO -- : [344/883] 1776385=!Nothing_to_test I, [2024-05-24T17:25:36.089028 #1735236] INFO -- : [345/883] 1776385=test_recorder I, [2024-05-24T17:25:36.098855 #1735236] INFO -- : [346/883] 1776385=test_yaml_special_cases I, [2024-05-24T17:25:36.114546 #1735236] INFO -- : [347/883] 1776385=test_gem_commands_sources_command I, [2024-05-24T17:25:36.315883 #1735236] INFO -- : [348/883] 1776385=test_name_error I, [2024-05-24T17:25:36.400648 #1735236] INFO -- : [349/883] 1776385=test_gem_source_list I, [2024-05-24T17:25:36.468164 #1735236] INFO -- : [350/883] 1776385=json_addition_test I, [2024-05-24T17:25:36.473416 #1735236] INFO -- : [351/883] 1776385=index_write_test I, [2024-05-24T17:25:36.476713 #1735236] INFO -- : [352/883] 1776385=test_rdoc_parser_rd I, [2024-05-24T17:25:36.504688 #1735236] INFO -- : [353/883] 1776385=test_const I, [2024-05-24T17:25:36.581361 #1735236] INFO -- : [354/883] 1776385=test_exit I, [2024-05-24T17:25:36.593014 #1735236] INFO -- : [355/883] 1776385=test_class I, [2024-05-24T17:25:36.750308 #1735236] INFO -- : [356/883] 1776387=test_sprintf I, [2024-05-24T17:25:36.937430 #1735236] INFO -- : [357/883] 1776387=test_safe_load I, [2024-05-24T17:25:36.940640 #1735236] INFO -- : [358/883] 1776387=test_gc I, [2024-05-24T17:25:36.946830 #1735236] INFO -- : [359/883] 1776387=comments_test I, [2024-05-24T17:25:36.952835 #1735236] INFO -- : [360/883] 1776387=test_qsort I, [2024-05-24T17:25:36.964341 #1735236] INFO -- : [361/883] 1776387=test_math I, [2024-05-24T17:25:36.978462 #1735236] INFO -- : [362/883] 1776387=test_iso_8859 I, [2024-05-24T17:25:37.066040 #1735236] INFO -- : [363/883] 1776387=ripper_test I, [2024-05-24T17:25:37.659337 #1735236] INFO -- : [364/883] 1776387=test_libs I, [2024-05-24T17:25:37.670455 #1735236] INFO -- : [365/883] 1776387=test_array I, [2024-05-24T17:25:37.690921 #1735236] INFO -- : [366/883] 1776387=test_rdoc_context I, [2024-05-24T17:25:38.383017 #1735236] INFO -- : [367/883] 1776387=test_gem_command_manager I, [2024-05-24T17:25:38.891993 #1735236] INFO -- : [368/883] 1776387=test_enumerator I, [2024-05-24T17:25:38.956243 #1735236] INFO -- : [369/883] 1776385=test_enc_associate I, [2024-05-24T17:25:39.445848 #1735236] INFO -- : [370/883] 1776385=test_open-uri I, [2024-05-24T17:25:39.777554 #1735236] INFO -- : [371/883] 1776385=test_case I, [2024-05-24T17:25:39.781107 #1735236] INFO -- : [372/883] 1776385=test_nil2vtempty I, [2024-05-24T17:25:39.789842 #1735236] INFO -- : [373/883] 1776385=test_date_time I, [2024-05-24T17:25:39.803052 #1735236] INFO -- : [374/883] 1776385=test_rdoc_generator_json_index I, [2024-05-24T17:25:39.867400 #1735236] INFO -- : [375/883] 1776385=test_pinned I, [2024-05-24T17:25:39.948354 #1735236] INFO -- : [376/883] 1776385=test_pack I, [2024-05-24T17:25:39.966055 #1735236] INFO -- : [377/883] 1776385=test_cgi_tag_helper I, [2024-05-24T17:25:39.976151 #1735236] INFO -- : [378/883] 1776385=test_inadvertent_creation I, [2024-05-24T17:25:40.080243 #1735236] INFO -- : [379/883] 1776385=test_ansi_with_terminfo I, [2024-05-24T17:25:40.160763 #1735236] INFO -- : [380/883] 1776385=test_weakmap I, [2024-05-24T17:25:47.430163 #1735236] INFO -- : [381/883] 1776385=test_coderange I, [2024-05-24T17:25:47.432263 #1735236] INFO -- : [382/883] 1776385=test_framework I, [2024-05-24T17:25:47.448061 #1735236] INFO -- : [383/883] 1776385=test_gem_install_update_options I, [2024-05-24T17:25:47.576412 #1735236] INFO -- : [384/883] 1776385=test_econv I, [2024-05-24T17:25:47.734302 #1735236] INFO -- : [385/883] 1776386=warnings_test I, [2024-05-24T17:25:47.816031 #1735236] INFO -- : [386/883] 1776386=test_stringchar I, [2024-05-24T17:25:48.452169 #1735236] INFO -- : [387/883] 1776386=test_sizeof I, [2024-05-24T17:25:48.462235 #1735236] INFO -- : [388/883] 1776385=test_date_attr I, [2024-05-24T17:25:48.474808 #1735236] INFO -- : [389/883] 1776385=test_gem_request_set_lockfile_parser I, [2024-05-24T17:25:48.646687 #1735236] INFO -- : [390/883] 1776385=test_face I, [2024-05-24T17:25:48.752159 #1735236] INFO -- : [391/883] 1776385=test_stack I, [2024-05-24T17:25:49.812014 #1735236] INFO -- : [392/883] 1776385=test_windows_1252 I, [2024-05-24T17:25:49.885803 #1735236] INFO -- : [393/883] 1776385=test_sorted_set I, [2024-05-24T17:25:50.025839 #1735236] INFO -- : [394/883] 1776385=test_emoji I, [2024-05-24T17:25:50.136555 #1735236] INFO -- : [395/883] 1776385=test_sleep I, [2024-05-24T17:25:50.142232 #1735236] INFO -- : [396/883] 1776386=test_mixed_unicode_escapes I, [2024-05-24T17:25:50.162725 #1735236] INFO -- : [397/883] 1776386=test_fileutils I, [2024-05-24T17:25:50.624439 #1735236] INFO -- : [398/883] 1776386=test_gem_dependency_resolution_error I, [2024-05-24T17:25:50.633337 #1735236] INFO -- : [399/883] 1776386=test_gem_resolver_vendor_set I, [2024-05-24T17:25:50.653920 #1735236] INFO -- : [400/883] 1776386=test_condition I, [2024-05-24T17:25:50.658893 #1735236] INFO -- : [401/883] 1776386=test_cp949 I, [2024-05-24T17:25:50.663272 #1735236] INFO -- : [402/883] 1776386=test_jaro_winkler I, [2024-05-24T17:25:50.676124 #1735236] INFO -- : [403/883] 1776386=test_rdoc_cross_reference I, [2024-05-24T17:25:51.050531 #1735236] INFO -- : [404/883] 1776386=test_parse I, [2024-05-24T17:25:51.509898 #1735236] INFO -- : [405/883] 1776386=test_rdoc_class_module I, [2024-05-24T17:25:51.978928 #1735236] INFO -- : [406/883] 1776386=test_method_cache I, [2024-05-24T17:25:51.983644 #1735236] INFO -- : [407/883] 1776386=test_win32ole_variable I, [2024-05-24T17:25:51.990273 #1735236] INFO -- : [408/883] 1776386=test_numhash I, [2024-05-24T17:25:52.002698 #1735236] INFO -- : [409/883] 1776386=test_system I, [2024-05-24T17:25:52.111420 #1735236] INFO -- : [410/883] 1776385=test_pkey_rsa I, [2024-05-24T17:25:52.383406 #1735236] INFO -- : [411/883] 1776385=test_flush I, [2024-05-24T17:25:52.456534 #1735236] INFO -- : [412/883] 1776385=test_gem_specification I, [2024-05-24T17:25:52.866910 #1735236] INFO -- : [413/883] 1776386=test_gem_remote_fetcher I, [2024-05-24T17:25:54.864078 #1735236] INFO -- : [414/883] 1776386=test_json_tree I, [2024-05-24T17:25:54.878225 #1735236] INFO -- : [415/883] 1776386=test_koi8 I, [2024-05-24T17:25:54.884692 #1735236] INFO -- : [416/883] 1776386=test_pkcs12 I, [2024-05-24T17:25:55.064870 #1735236] INFO -- : [417/883] 1776385=test_filter I, [2024-05-24T17:25:55.099165 #1735236] INFO -- : [418/883] 1776385=test_parser_events I, [2024-05-24T17:25:55.181945 #1735236] INFO -- : [419/883] 1776385=test_m17n I, [2024-05-24T17:25:55.292073 #1735236] INFO -- : [420/883] 1776385=test_method I, [2024-05-24T17:25:55.621268 #1735236] INFO -- : [421/883] 1776386=test_yjit I, [2024-05-24T17:25:55.629008 #1735236] INFO -- : [422/883] 1776386=test_cclass I, [2024-05-24T17:25:55.699850 #1735236] INFO -- : [423/883] 1776386=test_gem_uninstaller I, [2024-05-24T17:25:57.129492 #1735236] INFO -- : [424/883] 1776386=test_gem_dependency I, [2024-05-24T17:25:57.302183 #1735236] INFO -- : [425/883] 1776386=test_x509name I, [2024-05-24T17:25:57.320532 #1735236] INFO -- : [426/883] 1776386=test_yaml I, [2024-05-24T17:25:57.521034 #1735236] INFO -- : [427/883] 1776386=test_argf I, [2024-05-24T17:25:58.215304 #1735236] INFO -- : [428/883] 1776387=test_rdoc_markup_to_rdoc I, [2024-05-24T17:25:58.271122 #1735236] INFO -- : [429/883] 1776387=test_set I, [2024-05-24T17:25:58.281869 #1735236] INFO -- : [430/883] 1776387=test_utf16 I, [2024-05-24T17:25:58.289325 #1735236] INFO -- : [431/883] 1776387=test_http I, [2024-05-24T17:26:01.141809 #1735236] INFO -- : [432/883] 1776386=attribute_write_test I, [2024-05-24T17:26:01.156062 #1735236] INFO -- : [433/883] 1776386=test_gem_package_tar_writer I, [2024-05-24T17:26:01.339808 #1735236] INFO -- : [434/883] 1776386=test_str2big I, [2024-05-24T17:26:01.348849 #1735236] INFO -- : [435/883] 1776386=test_severity I, [2024-05-24T17:26:01.362173 #1735236] INFO -- : [436/883] 1776386=test_ractor I, [2024-05-24T17:26:01.362714 #1735236] INFO -- : [437/883] 1776386=test_case I, [2024-05-24T17:26:01.371250 #1735236] INFO -- : [438/883] 1776386=test_backtrace I, [2024-05-24T17:26:02.696659 #1735236] INFO -- : [439/883] 1776386=test_tracepoint I, [2024-05-24T17:26:02.948683 #1735236] INFO -- : [440/883] 1776386=test_settracefunc I, [2024-05-24T17:26:03.045940 #1735236] INFO -- : [441/883] 1776385=test_gem_text I, [2024-05-24T17:26:03.185820 #1735236] INFO -- : [442/883] 1776385=test_rdoc_task I, [2024-05-24T17:26:03.201956 #1735236] INFO -- : [443/883] 1776385=test_gem_gemcutter_utilities I, [2024-05-24T17:26:03.634420 #1735236] INFO -- : [444/883] 1776385=test_rendering I, [2024-05-24T17:26:03.663697 #1735236] INFO -- : [445/883] 1776385=test_gem_source_local I, [2024-05-24T17:26:03.843297 #1735236] INFO -- : [446/883] 1776386=desugar_compiler_test I, [2024-05-24T17:26:03.859016 #1735236] INFO -- : [447/883] 1776386=test_win32ole I, [2024-05-24T17:26:03.862356 #1735236] INFO -- : [448/883] 1776386=test_internal_ivar I, [2024-05-24T17:26:03.866964 #1735236] INFO -- : [449/883] 1776385=test_sprintf_comb I, [2024-05-24T17:26:03.877645 #1735236] INFO -- : [450/883] 1776386=test_too_many_dummy_encodings I, [2024-05-24T17:26:03.924278 #1735236] INFO -- : [451/883] 1776386=test_method_cache I, [2024-05-24T17:26:03.930160 #1735236] INFO -- : [452/883] 1776386=locals_test I, [2024-05-24T17:26:04.025444 #1735236] INFO -- : [453/883] 1776385=test_gem_commands_push_command I, [2024-05-24T17:26:04.396959 #1735236] INFO -- : [454/883] 1776386=test_gem_package_old I, [2024-05-24T17:26:04.451185 #1735236] INFO -- : [455/883] 1776386=test_gem_request I, [2024-05-24T17:26:04.579046 #1735236] INFO -- : [456/883] 1776385=test_gem_commands_which_command I, [2024-05-24T17:26:04.611503 #1735236] INFO -- : [457/883] 1776385=test_scan_args I, [2024-05-24T17:26:04.622497 #1735236] INFO -- : [458/883] 1776385=test_gem_commands_specification_command I, [2024-05-24T17:26:04.688563 #1735236] INFO -- : [459/883] 1776386=encoding_test I, [2024-05-24T17:26:04.755501 #1735236] INFO -- : [460/883] 1776385=test_hash I, [2024-05-24T17:26:04.772270 #1735236] INFO -- : [461/883] 1776386=parser_test I, [2024-05-24T17:26:04.776749 #1735236] INFO -- : [462/883] 1776386=test_http I, [2024-05-24T17:26:04.783755 #1735236] INFO -- : [463/883] 1776386=test_gem_dependency_installer I, [2024-05-24T17:26:06.957379 #1735236] INFO -- : [464/883] 1776387=test_pty I, [2024-05-24T17:26:07.034743 #1735236] INFO -- : [465/883] 1776386=test_rdoc_generator_ri I, [2024-05-24T17:26:07.045456 #1735236] INFO -- : [466/883] 1776386=test_gem_stream_ui I, [2024-05-24T17:26:07.193996 #1735236] INFO -- : [467/883] 1776386=test_unicode_normalize I, [2024-05-24T17:26:07.426537 #1735236] INFO -- : [468/883] 1776387=test_reline_key I, [2024-05-24T17:26:07.438680 #1735236] INFO -- : [469/883] 1776387=test_gem_commands_lock_command I, [2024-05-24T17:26:07.466166 #1735236] INFO -- : [470/883] 1776387=test_gb18030 I, [2024-05-24T17:26:07.475848 #1735236] INFO -- : [471/883] 1776387=test_propertyputref I, [2024-05-24T17:26:07.525638 #1735236] INFO -- : [472/883] 1776387=test_color I, [2024-05-24T17:26:07.713474 #1735236] INFO -- : [473/883] 1776387=test_float I, [2024-05-24T17:26:08.703577 #1735236] INFO -- : [474/883] 1776385=test_gem_stub_specification I, [2024-05-24T17:26:08.844604 #1735236] INFO -- : [475/883] 1776385=test_cmethod I, [2024-05-24T17:26:08.866580 #1735236] INFO -- : [476/883] 1776385=test_io_m17n I, [2024-05-24T17:26:09.545593 #1735236] INFO -- : [477/883] 1776387=test_rdoc_top_level I, [2024-05-24T17:26:09.832389 #1735236] INFO -- : [478/883] 1776387=test_rdoc_parser_simple I, [2024-05-24T17:26:09.854968 #1735236] INFO -- : [479/883] 1776387=test_nonblock I, [2024-05-24T17:26:09.889476 #1735236] INFO -- : [480/883] 1776387=json_ext_parser_test I, [2024-05-24T17:26:09.908713 #1735236] INFO -- : [481/883] 1776387=test_gem_ext_configure_builder I, [2024-05-24T17:26:09.940656 #1735236] INFO -- : [482/883] 1776387=test_shellwords I, [2024-05-24T17:26:09.945074 #1735236] INFO -- : [483/883] 1776387=test_mul I, [2024-05-24T17:26:09.961736 #1735236] INFO -- : [484/883] 1776387=test_rdoc_generator_pot_po I, [2024-05-24T17:26:09.968762 #1735236] INFO -- : [485/883] 1776387=test_omap I, [2024-05-24T17:26:10.005590 #1735236] INFO -- : [486/883] 1776387=test_date_strptime I, [2024-05-24T17:26:10.096625 #1735236] INFO -- : [487/883] 1776387=test_ipaddr I, [2024-05-24T17:26:10.120721 #1735236] INFO -- : [488/883] 1776387=test_scanner_events I, [2024-05-24T17:26:10.165209 #1735236] INFO -- : [489/883] 1776387=test_ocsp I, [2024-05-24T17:26:10.186800 #1735236] INFO -- : [490/883] 1776385=test_stat I, [2024-05-24T17:26:10.193003 #1735236] INFO -- : [491/883] 1776385=test_etc I, [2024-05-24T17:26:10.208909 #1735236] INFO -- : Leaked file descriptor: TestEtc#test_getpwnam: 11 # I, [2024-05-24T17:26:10.242858 #1735236] INFO -- : COMMAND PID USER FD TYPE DEVICE SIZE/OFF NODE NAME I, [2024-05-24T17:26:10.242928 #1735236] INFO -- : ruby 1776385 opc 11r REG 252,0 9253600 13705411 /var/lib/sss/mc/passwd I, [2024-05-24T17:26:10.293264 #1735236] INFO -- : [492/883] 1776387=test_gem_commands_rebuild_command I, [2024-05-24T17:26:10.312686 #1735236] INFO -- : [493/883] 1776387=test_nomethod_error I, [2024-05-24T17:26:10.322284 #1735236] INFO -- : [494/883] 1776387=test_rdoc_parser I, [2024-05-24T17:26:10.350239 #1735236] INFO -- : [495/883] 1776387=test_https_proxy I, [2024-05-24T17:26:10.363942 #1735236] INFO -- : [496/883] 1776387=test_win32ole_param_event I, [2024-05-24T17:26:10.366710 #1735236] INFO -- : [497/883] 1776387=test_cgi_modruby I, [2024-05-24T17:26:10.375269 #1735236] INFO -- : [498/883] 1776387=magic_comment_test I, [2024-05-24T17:26:10.382409 #1735236] INFO -- : [499/883] 1776385=test_win32ole_variant I, [2024-05-24T17:26:10.387942 #1735236] INFO -- : [500/883] 1776387=test_workspace I, [2024-05-24T17:26:10.391155 #1735236] INFO -- : [501/883] 1776385=test_x509attr I, [2024-05-24T17:26:10.403213 #1735236] INFO -- : [502/883] 1776385=test_printf I, [2024-05-24T17:26:10.445508 #1735236] INFO -- : [503/883] 1776385=test_io I, [2024-05-24T17:26:10.526756 #1735236] INFO -- : [504/883] 1776387=test_uncorrectable_name_check I, [2024-05-24T17:26:10.530782 #1735236] INFO -- : [505/883] 1776387=test_rdoc_rd_inline I, [2024-05-24T17:26:10.541425 #1735236] INFO -- : [506/883] 1776387=test_digest I, [2024-05-24T17:26:10.548083 #1735236] INFO -- : [507/883] 1776387=test_path I, [2024-05-24T17:26:10.560676 #1735236] INFO -- : [508/883] 1776387=test_rubygems I, [2024-05-24T17:26:10.718805 #1735236] INFO -- : [509/883] 1776387=test_resolve_symbol I, [2024-05-24T17:26:10.880143 #1735236] INFO -- : [510/883] 1776387=test_closure I, [2024-05-24T17:26:10.945795 #1735236] INFO -- : [511/883] 1776386=test_files_test_1 I, [2024-05-24T17:26:10.963188 #1735236] INFO -- : [512/883] 1776386=test_dir I, [2024-05-24T17:26:11.324911 #1735236] INFO -- : [513/883] 1776386=test_rdoc_ri_paths I, [2024-05-24T17:26:11.375056 #1735236] INFO -- : [514/883] 1776386=test_parser I, [2024-05-24T17:26:11.396821 #1735236] INFO -- : [515/883] 1776386=test_primitive I, [2024-05-24T17:26:11.410405 #1735236] INFO -- : [516/883] 1776386=test_iseq I, [2024-05-24T17:26:11.901604 #1735236] INFO -- : [517/883] 1776386=test_singleton_function I, [2024-05-24T17:26:11.908791 #1735236] INFO -- : [518/883] 1776386=test_gem_commands_setup_command I, [2024-05-24T17:26:12.715524 #1735236] INFO -- : [519/883] 1776386=test_history I, [2024-05-24T17:26:12.764512 #1735236] INFO -- : [520/883] 1776386=test_eval I, [2024-05-24T17:26:12.773325 #1735236] INFO -- : [521/883] 1776386=test_document I, [2024-05-24T17:26:12.784462 #1735236] INFO -- : [522/883] 1776386=test_gem_safe_yaml I, [2024-05-24T17:26:12.796510 #1735236] INFO -- : [523/883] 1776386=test_gem_commands_signout_command I, [2024-05-24T17:26:12.819665 #1735236] INFO -- : [524/883] 1776386=test_gem_package_tar_reader I, [2024-05-24T17:26:12.877264 #1735236] INFO -- : [525/883] 1776386=test_env I, [2024-05-24T17:26:13.197654 #1735236] INFO -- : [526/883] 1776387=test_pair I, [2024-05-24T17:26:15.295376 #1735236] INFO -- : [527/883] 1776386=test_win32ole_variant_m I, [2024-05-24T17:26:15.304073 #1735236] INFO -- : [528/883] 1776386=command_line_test I, [2024-05-24T17:26:15.309946 #1735236] INFO -- : [529/883] 1776386=test_rdoc_comment I, [2024-05-24T17:26:15.360058 #1735236] INFO -- : [530/883] 1776386=test_encoding I, [2024-05-24T17:26:15.426288 #1735236] INFO -- : [531/883] 1776386=test_install I, [2024-05-24T17:26:15.560810 #1735236] INFO -- : [532/883] 1776386=test_gem_source_fetch_problem I, [2024-05-24T17:26:15.574218 #1735236] INFO -- : [533/883] 1776386=test_ftp I, [2024-05-24T17:26:15.588129 #1735236] INFO -- : [534/883] 1776386=test_sockopt I, [2024-05-24T17:26:15.598288 #1735236] INFO -- : [535/883] 1776386=test_find_executable I, [2024-05-24T17:26:15.610380 #1735236] INFO -- : [536/883] 1776386=integer_parse_test I, [2024-05-24T17:26:15.623381 #1735236] INFO -- : [537/883] 1776386=test_autoconf I, [2024-05-24T17:26:15.672663 #1735236] INFO -- : [538/883] 1776386=test_ractor_compatibility I, [2024-05-24T17:26:15.999437 #1735236] INFO -- : [539/883] 1776386=test_arithmetic_sequence I, [2024-05-24T17:26:16.020734 #1735236] INFO -- : [540/883] 1776386=test_cgi_multipart I, [2024-05-24T17:26:16.149923 #1735236] INFO -- : [541/883] 1776386=test_lazy_enumerator I, [2024-05-24T17:26:16.608645 #1735236] INFO -- : [542/883] 1776386=test_gem_request_set_lockfile_tokenizer I, [2024-05-24T17:26:16.733290 #1735236] INFO -- : [543/883] 1776386=test_class I, [2024-05-24T17:26:16.754479 #1735236] INFO -- : [544/883] 1776386=test_have_macro I, [2024-05-24T17:26:17.031333 #1735236] INFO -- : [545/883] 1776386=test_mkmf I, [2024-05-24T17:26:17.076843 #1735236] INFO -- : [546/883] 1776386=test_gem_source I, [2024-05-24T17:26:17.382019 #1735236] INFO -- : [547/883] 1776386=test_benchmark I, [2024-05-24T17:26:18.524424 #1735236] INFO -- : [548/883] 1776387=test_at_exit I, [2024-05-24T17:26:18.550119 #1735236] INFO -- : [549/883] 1776387=test_array I, [2024-05-24T17:26:19.186632 #1735236] INFO -- : [550/883] 1776386=test_gem_package I, [2024-05-24T17:26:19.971590 #1735236] INFO -- : [551/883] 1776386=test_autoload I, [2024-05-24T17:26:21.383669 #1735236] INFO -- : [552/883] 1776385=test_unicode I, [2024-05-24T17:26:21.398655 #1735236] INFO -- : [553/883] 1776385=test_eval_history I, [2024-05-24T17:26:21.421549 #1735236] INFO -- : [554/883] 1776385=dispatcher_test I, [2024-05-24T17:26:21.430428 #1735236] INFO -- : [555/883] 1776385=test_random I, [2024-05-24T17:26:21.441423 #1735236] INFO -- : [556/883] 1776385=test_assembler I, [2024-05-24T17:26:21.453959 #1735236] INFO -- : [557/883] 1776385=test_stringio I, [2024-05-24T17:26:21.558097 #1735236] INFO -- : [558/883] 1776385=test_thread_cv I, [2024-05-24T17:26:22.351450 #1735236] INFO -- : [559/883] 1776385=test_files_ext I, [2024-05-24T17:26:22.448645 #1735236] INFO -- : [560/883] 1776385=test_ripper I, [2024-05-24T17:26:22.667504 #1735236] INFO -- : [561/883] 1776385=test_win32ole_method I, [2024-05-24T17:26:22.675863 #1735236] INFO -- : [562/883] 1776385=test_lexer I, [2024-05-24T17:26:22.770119 #1735236] INFO -- : [563/883] 1776385=test_regex_casefold I, [2024-05-24T17:26:23.171590 #1735236] INFO -- : [564/883] 1776385=test_gem_source_git I, [2024-05-24T17:26:24.244833 #1735236] INFO -- : [565/883] 1776385=test_struct I, [2024-05-24T17:26:24.491520 #1735236] INFO -- : [566/883] 1776386=test_tmpdir I, [2024-05-24T17:26:24.588445 #1735236] INFO -- : [567/883] 1776386=test_type I, [2024-05-24T17:26:24.599508 #1735236] INFO -- : [568/883] 1776386=heredoc_dedent_test I, [2024-05-24T17:26:24.614333 #1735236] INFO -- : [569/883] 1776386=test_rdoc_token_stream I, [2024-05-24T17:26:24.643963 #1735236] INFO -- : [570/883] 1776386=test_mutex I, [2024-05-24T17:26:24.787197 #1735236] INFO -- : [571/883] 1776385=test_gem_local_remote_options I, [2024-05-24T17:26:24.833733 #1735236] INFO -- : [572/883] 1776385=test_gem_ext_cargo_builder_link_flag_converter I, [2024-05-24T17:26:24.899257 #1735236] INFO -- : [573/883] 1776385=test_acceptable I, [2024-05-24T17:26:24.958617 #1735236] INFO -- : [574/883] 1776385=test_dup I, [2024-05-24T17:26:25.108807 #1735236] INFO -- : [575/883] 1776385=test_rdoc_single_class I, [2024-05-24T17:26:25.117335 #1735236] INFO -- : [576/883] 1776385=test_digest I, [2024-05-24T17:26:25.767339 #1735236] INFO -- : [577/883] 1776386=test_signedness I, [2024-05-24T17:26:25.931363 #1735236] INFO -- : [578/883] 1776385=test_gem_resolver_git_set I, [2024-05-24T17:26:26.456174 #1735236] INFO -- : [579/883] 1776385=test_gem_commands_check_command I, [2024-05-24T17:26:26.535395 #1735236] INFO -- : [580/883] 1776385=test_ractor I, [2024-05-24T17:26:26.546070 #1735236] INFO -- : [581/883] 1776385=test_sexp I, [2024-05-24T17:26:26.572669 #1735236] INFO -- : [582/883] 1776385=test_httpheader I, [2024-05-24T17:26:26.595563 #1735236] INFO -- : [583/883] 1776385=test_rdoc_ri_driver I, [2024-05-24T17:26:27.003756 #1735236] INFO -- : [584/883] 1776385=test_gem_safe_marshal I, [2024-05-24T17:26:27.592692 #1735236] INFO -- : [585/883] 1776386=test_gem_resolver_vendor_specification I, [2024-05-24T17:26:27.626412 #1735236] INFO -- : [586/883] 1776386=test_date_arith I, [2024-05-24T17:26:27.642727 #1735236] INFO -- : [587/883] 1776386=json_generic_object_test I, [2024-05-24T17:26:27.653505 #1735236] INFO -- : [588/883] 1776386=test_fiddle I, [2024-05-24T17:26:27.734139 #1735236] INFO -- : [589/883] 1776385=test_stringscanner I, [2024-05-24T17:26:27.774438 #1735236] INFO -- : [590/883] 1776385=test_gem_resolver_installed_specification I, [2024-05-24T17:26:27.822442 #1735236] INFO -- : [591/883] 1776385=test_exception_at_throwing I, [2024-05-24T17:26:27.868064 #1735236] INFO -- : [592/883] 1776385=test_ractor I, [2024-05-24T17:26:27.948732 #1735236] INFO -- : [593/883] 1776385=test_ast I, [2024-05-24T17:26:28.001239 #1735236] INFO -- : [594/883] 1776386=test_logdevice I, [2024-05-24T17:26:28.333955 #1735236] INFO -- : [595/883] 1776387=test_bn I, [2024-05-24T17:26:28.361116 #1735236] INFO -- : [596/883] 1776387=test_variable_name_check I, [2024-05-24T17:26:28.429609 #1735236] INFO -- : [597/883] 1776387=test_require_path_check I, [2024-05-24T17:26:28.467613 #1735236] INFO -- : [598/883] 1776387=test_rdoc_markup_paragraph I, [2024-05-24T17:26:28.488585 #1735236] INFO -- : [599/883] 1776387=test_x509cert I, [2024-05-24T17:26:28.572175 #1735236] INFO -- : [600/883] 1776387=test_irb I, [2024-05-24T17:26:28.827479 #1735236] INFO -- : [601/883] 1776387=test_name_error_extension I, [2024-05-24T17:26:28.842039 #1735236] INFO -- : [602/883] 1776387=test_gem_request_set_gem_dependency_api I, [2024-05-24T17:26:28.945524 #1735236] INFO -- : [603/883] 1776386=test_object_create_start I, [2024-05-24T17:26:28.945634 #1735236] INFO -- : [604/883] 1776386=test_https I, [2024-05-24T17:26:29.100004 #1735236] INFO -- : [605/883] 1776387=test_gem_commands_info_command I, [2024-05-24T17:26:29.128975 #1735236] INFO -- : [606/883] 1776387=test_protocol I, [2024-05-24T17:26:29.146734 #1735236] INFO -- : [607/883] 1776386=test_evaluation I, [2024-05-24T17:26:29.154033 #1735236] INFO -- : [608/883] 1776386=test_weakkeymap I, [2024-05-24T17:26:29.432936 #1735236] INFO -- : [609/883] 1776387=test_files_test I, [2024-05-24T17:26:29.444117 #1735236] INFO -- : [610/883] 1776387=test_rdoc_markup_to_ansi I, [2024-05-24T17:26:29.493117 #1735236] INFO -- : [611/883] 1776387=test_continuation I, [2024-05-24T17:26:29.504407 #1735236] INFO -- : [612/883] 1776387=test_gem_silent_ui I, [2024-05-24T17:26:29.555678 #1735236] INFO -- : [613/883] 1776387=test_signal I, [2024-05-24T17:26:29.695050 #1735236] INFO -- : [614/883] 1776386=test_fixnum I, [2024-05-24T17:26:29.716352 #1735236] INFO -- : [615/883] 1776386=test_gem_ci_detector I, [2024-05-24T17:26:29.737359 #1735236] INFO -- : [616/883] 1776386=test_io_wait_uncommon I, [2024-05-24T17:26:29.748335 #1735236] INFO -- : [617/883] 1776386=test_rdoc_markup_document I, [2024-05-24T17:26:29.795361 #1735236] INFO -- : [618/883] 1776386=test_delete I, [2024-05-24T17:26:29.807100 #1735236] INFO -- : [619/883] 1776386=test_gem_security_policy I, [2024-05-24T17:26:30.167910 #1735236] INFO -- : [620/883] 1776386=parse_stream_test I, [2024-05-24T17:26:30.191401 #1735236] INFO -- : [621/883] 1776386=test_handle I, [2024-05-24T17:26:31.437301 #1735236] INFO -- : [622/883] 1776386=test_completion I, [2024-05-24T17:26:31.640757 #1735236] INFO -- : [623/883] 1776387=test_file_exhaustive I, [2024-05-24T17:26:32.180123 #1735236] INFO -- : [624/883] 1776386=test_placearg I, [2024-05-24T17:26:32.247536 #1735236] INFO -- : [625/883] 1776386=test_case_comprehensive I, [2024-05-24T17:26:40.990950 #1735236] INFO -- : [626/883] 1776387=test_logperiod I, [2024-05-24T17:26:41.004837 #1735236] INFO -- : [627/883] 1776387=test_rational2 I, [2024-05-24T17:26:41.018955 #1735236] INFO -- : [628/883] 1776387=test_gem_package_tar_header I, [2024-05-24T17:26:41.206771 #1735236] INFO -- : [629/883] 1776387=test_ssl_session I, [2024-05-24T17:26:41.944671 #1735236] INFO -- : [630/883] 1776387=test_rdoc_markup_attribute_manager I, [2024-05-24T17:26:41.968764 #1735236] INFO -- : [631/883] 1776387=test_wss I, [2024-05-24T17:26:41.981897 #1735236] INFO -- : [632/883] 1776387=test_option I, [2024-05-24T17:26:42.096679 #1735236] INFO -- : [633/883] 1776387=test_not I, [2024-05-24T17:26:42.103882 #1735236] INFO -- : [634/883] 1776387=test_cgi_cookie I, [2024-05-24T17:26:42.160142 #1735236] INFO -- : [635/883] 1776387=test_tracer I, [2024-05-24T17:26:42.164757 #1735236] INFO -- : [636/883] 1776387=test_my_integer I, [2024-05-24T17:26:42.174318 #1735236] INFO -- : [637/883] 1776387=test_gem_resolver_composed_set I, [2024-05-24T17:26:42.198942 #1735236] INFO -- : [638/883] 1776387=test_debugger_integration I, [2024-05-24T17:26:42.208443 #1735236] INFO -- : [639/883] 1776387=test_objectspace I, [2024-05-24T17:26:43.144885 #1735236] INFO -- : [640/883] 1776387=test_require I, [2024-05-24T17:26:45.717717 #1735236] INFO -- : [641/883] 1776387=test_metaclass I, [2024-05-24T17:26:45.728747 #1735236] INFO -- : [642/883] 1776387=test_gem_gem_runner I, [2024-05-24T17:26:45.840262 #1735236] INFO -- : [643/883] 1776387=test_require_lib I, [2024-05-24T17:26:48.850749 #1735236] INFO -- : [644/883] 1776387=test_rdoc_markup_to_markdown I, [2024-05-24T17:26:48.888910 #1735236] INFO -- : [645/883] 1776387=test_rdoc_markup_to_joined_paragraph I, [2024-05-24T17:26:48.895149 #1735236] INFO -- : [646/883] 1776387=test_rdoc_generator_pot I, [2024-05-24T17:26:48.900819 #1735236] INFO -- : [647/883] 1776387=test_rdoc_rd I, [2024-05-24T17:26:48.986068 #1735236] INFO -- : [648/883] 1776387=test_x509store I, [2024-05-24T17:26:49.459261 #1735236] INFO -- : [649/883] 1776387=test_rdoc_rd_block_parser I, [2024-05-24T17:26:49.484173 #1735236] INFO -- : [650/883] 1776387=test_load I, [2024-05-24T17:26:49.492641 #1735236] INFO -- : [651/883] 1776387=test_rdoc_rd_inline_parser I, [2024-05-24T17:26:49.511515 #1735236] INFO -- : [652/883] 1776387=test_win32ole_type I, [2024-05-24T17:26:49.520101 #1735236] INFO -- : [653/883] 1776387=test_new I, [2024-05-24T17:26:49.526209 #1735236] INFO -- : [654/883] 1776387=test_update I, [2024-05-24T17:26:49.529548 #1735236] INFO -- : [655/883] 1776387=test_cipher I, [2024-05-24T17:26:49.575316 #1735236] INFO -- : [656/883] 1776387=test_gem_source_lock I, [2024-05-24T17:26:49.630017 #1735236] INFO -- : [657/883] 1776387=test_change_word I, [2024-05-24T17:26:49.646216 #1735236] INFO -- : [658/883] 1776387=test_depth_first I, [2024-05-24T17:26:49.656750 #1735236] INFO -- : [659/883] 1776387=test_ostruct I, [2024-05-24T17:26:49.801571 #1735236] INFO -- : [660/883] 1776387=test_config I, [2024-05-24T17:26:49.880627 #1735236] INFO -- : [661/883] 1776387=test_c_struct_entry I, [2024-05-24T17:26:50.616885 #1735236] INFO -- : [662/883] 1776387=static_inspect_test I, [2024-05-24T17:26:50.619474 #1735236] INFO -- : [663/883] 1776387=test_struct I, [2024-05-24T17:26:50.639481 #1735236] INFO -- : [664/883] 1776387=test_cparser I, [2024-05-24T17:26:52.294869 #1735236] INFO -- : [665/883] 1776386=test_rubyvm I, [2024-05-24T17:26:52.304749 #1735236] INFO -- : [666/883] 1776386=fuzzer_test I, [2024-05-24T17:26:52.320711 #1735236] INFO -- : [667/883] 1776386=test_custom_command I, [2024-05-24T17:26:52.336842 #1735236] INFO -- : [668/883] 1776386=test_rdoc_parser_markdown I, [2024-05-24T17:26:52.362837 #1735236] INFO -- : [669/883] 1776386=test_fiber I, [2024-05-24T17:26:52.525860 #1735236] INFO -- : [670/883] 1776387=test_gem_commands_mirror I, [2024-05-24T17:26:52.548183 #1735236] INFO -- : [671/883] 1776387=test_engine I, [2024-05-24T17:26:53.062748 #1735236] INFO -- : [672/883] 1776387=test_win32ole_param I, [2024-05-24T17:26:53.067259 #1735236] INFO -- : [673/883] 1776387=test_key_error I, [2024-05-24T17:26:53.077118 #1735236] INFO -- : [674/883] 1776387=test_resize I, [2024-05-24T17:26:53.193322 #1735236] INFO -- : [675/883] 1776387=test_lock_native_thread I, [2024-05-24T17:26:53.339008 #1735236] INFO -- : [676/883] 1776387=test_gem_package_task I, [2024-05-24T17:26:53.409797 #1735236] INFO -- : [677/883] 1776387=test_ssl I, [2024-05-24T17:26:58.682935 #1735236] INFO -- : [678/883] 1776386=test_bundled_ca I, [2024-05-24T17:27:00.091628 #1735236] INFO -- : [679/883] 1776386=test_integer_comb I, [2024-05-24T17:27:02.633387 #1735236] INFO -- : [680/883] 1776386=test_load I, [2024-05-24T17:27:02.682107 #1735236] INFO -- : [681/883] 1776386=test_abi I, [2024-05-24T17:27:02.819944 #1735236] INFO -- : [682/883] 1776386=test_gem_validator I, [2024-05-24T17:27:02.865969 #1735236] INFO -- : [683/883] 1776386=test_gem_source_installed I, [2024-05-24T17:27:02.874652 #1735236] INFO -- : [684/883] 1776386=test_usrmarshal I, [2024-05-24T17:27:03.083268 #1735236] INFO -- : [685/883] 1776386=test_module I, [2024-05-24T17:27:03.808753 #1735236] INFO -- : [686/883] 1776387=test_erb_command I, [2024-05-24T17:27:03.871765 #1735236] INFO -- : [687/883] 1776387=test_gem_security_trust_dir I, [2024-05-24T17:27:03.925456 #1735236] INFO -- : [688/883] 1776387=test_unix I, [2024-05-24T17:27:04.042545 #1735236] INFO -- : [689/883] 1776387=test_integer I, [2024-05-24T17:27:06.573192 #1735236] INFO -- : [690/883] 1776387=test_formatter I, [2024-05-24T17:27:06.587520 #1735236] INFO -- : [691/883] 1776387=test_rdoc_servlet I, [2024-05-24T17:27:06.678227 #1735236] INFO -- : [692/883] 1776387=test_coder I, [2024-05-24T17:27:06.733805 #1735236] INFO -- : [693/883] 1776387=test_symbol I, [2024-05-24T17:27:08.277126 #1735236] INFO -- : [694/883] 1776386=test_gem_commands_search_command I, [2024-05-24T17:27:08.288785 #1735236] INFO -- : [695/883] 1776386=test_context I, [2024-05-24T17:27:08.421358 #1735236] INFO -- : [696/883] 1776386=test_udp I, [2024-05-24T17:27:08.507260 #1735236] INFO -- : [697/883] 1776386=test_gem_commands_contents_command I, [2024-05-24T17:27:08.636216 #1735236] INFO -- : [698/883] 1776386=test_gem_commands_list_command I, [2024-05-24T17:27:08.646887 #1735236] INFO -- : [699/883] 1776386=test_date_new I, [2024-05-24T17:27:08.656717 #1735236] INFO -- : [700/883] 1776386=test_configuration I, [2024-05-24T17:27:08.754109 #1735236] INFO -- : [701/883] 1776386=test_gem_resolver_local_specification I, [2024-05-24T17:27:08.788795 #1735236] INFO -- : [702/883] 1776386=test_have_func I, [2024-05-24T17:27:10.079995 #1735236] INFO -- : [703/883] 1776386=test_date_marshal I, [2024-05-24T17:27:10.101830 #1735236] INFO -- : [704/883] 1776386=test_ts I, [2024-05-24T17:27:10.381897 #1735236] INFO -- : [705/883] 1776386=test_locale I, [2024-05-24T17:27:10.427973 #1735236] INFO -- : [706/883] 1776386=test_rdoc_attr I, [2024-05-24T17:27:10.454930 #1735236] INFO -- : [707/883] 1776386=test_trick I, [2024-05-24T17:27:12.380312 #1735236] INFO -- : [708/883] 1776387=test_ractor I, [2024-05-24T17:27:12.446890 #1735236] INFO -- : [709/883] 1776387=test_stream I, [2024-05-24T17:27:12.453091 #1735236] INFO -- : [710/883] 1776387=test_address_resolve I, [2024-05-24T17:27:12.466581 #1735236] INFO -- : [711/883] 1776387=test_enum I, [2024-05-24T17:27:13.013677 #1735236] INFO -- : [712/883] 1776386=test_rdoc_markup_include I, [2024-05-24T17:27:13.036144 #1735236] INFO -- : [713/883] 1776386=test_recursion I, [2024-05-24T17:27:13.116609 #1735236] INFO -- : [714/883] 1776386=test_require I, [2024-05-24T17:27:13.489422 #1735236] INFO -- : [715/883] 1776387=test_gem_commands_signin_command I, [2024-05-24T17:27:13.629759 #1735236] INFO -- : [716/883] 1776387=test_range I, [2024-05-24T17:27:14.059092 #1735236] INFO -- : [717/883] 1776385=test_iter_break I, [2024-05-24T17:27:14.072735 #1735236] INFO -- : [718/883] 1776385=test_extlibs I, [2024-05-24T17:27:14.396743 #1735236] INFO -- : [719/883] 1776387=test_num2int I, [2024-05-24T17:27:14.403137 #1735236] INFO -- : [720/883] 1776387=test_rbconfig I, [2024-05-24T17:27:14.407729 #1735236] INFO -- : [721/883] 1776387=test_cgi_core I, [2024-05-24T17:27:14.411842 #1735236] INFO -- : [722/883] 1776386=test_gem_resolver_best_set I, [2024-05-24T17:27:14.428858 #1735236] INFO -- : [723/883] 1776387=test_rdoc_markup_to_label I, [2024-05-24T17:27:14.466675 #1735236] INFO -- : [724/883] 1776387=test_parser I, [2024-05-24T17:27:14.483158 #1735236] INFO -- : [725/883] 1776386=test_ractor I, [2024-05-24T17:27:14.494980 #1735236] INFO -- : [726/883] 1776387=test_ansi_without_terminfo I, [2024-05-24T17:27:14.508015 #1735236] INFO -- : [727/883] 1776387=json_generator_test I, [2024-05-24T17:27:14.532819 #1735236] INFO -- : [728/883] 1776386=test_gem I, [2024-05-24T17:27:14.609433 #1735236] INFO -- : [729/883] 1776387=test_registry I, [2024-05-24T17:27:14.616156 #1735236] INFO -- : [730/883] 1776387=test_ssl I, [2024-05-24T17:27:14.781556 #1735236] INFO -- : [731/883] 1776387=test_gem_commands_help_command I, [2024-05-24T17:27:14.833873 #1735236] INFO -- : [732/883] 1776387=test_scheduler I, [2024-05-24T17:27:14.992442 #1735236] INFO -- : [733/883] 1776387=test_ractor I, [2024-05-24T17:27:15.364453 #1735236] INFO -- : [734/883] 1776387=test_gem_resolver_conflict I, [2024-05-24T17:27:15.379763 #1735236] INFO -- : [735/883] 1776387=test_nesting_parser I, [2024-05-24T17:27:15.413665 #1735236] INFO -- : [736/883] 1776387=test_marshal I, [2024-05-24T17:27:15.577311 #1735236] INFO -- : [737/883] 1776385=test_ancdata I, [2024-05-24T17:27:15.635619 #1735236] INFO -- : [738/883] 1776385=ractor_test I, [2024-05-24T17:27:15.657369 #1735236] INFO -- : [739/883] 1776385=test_rdoc_markup_hard_break I, [2024-05-24T17:27:15.662547 #1735236] INFO -- : [740/883] 1776385=test_bignum I, [2024-05-24T17:27:16.649689 #1735236] INFO -- : [741/883] 1776387=newline_test I, [2024-05-24T17:27:16.711511 #1735236] INFO -- : [742/883] 1776387=test_enc_str_buf_cat I, [2024-05-24T17:27:16.723961 #1735236] INFO -- : [743/883] 1776386=test_to_ruby I, [2024-05-24T17:27:16.726093 #1735236] INFO -- : [744/883] 1776387=test_addrinfo I, [2024-05-24T17:27:16.740619 #1735236] INFO -- : [745/883] 1776386=test_time_tz I, [2024-05-24T17:27:16.787410 #1735236] INFO -- : [746/883] 1776387=test_thread I, [2024-05-24T17:27:16.903859 #1735236] INFO -- : [747/883] 1776386=test_socket I, [2024-05-24T17:27:17.766238 #1735236] INFO -- : [748/883] 1776386=test_terminfo I, [2024-05-24T17:27:17.823072 #1735236] INFO -- : [749/883] 1776386=test_inlinecache I, [2024-05-24T17:27:17.898895 #1735236] INFO -- : [750/883] 1776386=test_bug-14834 I, [2024-05-24T17:27:17.908443 #1735236] INFO -- : [751/883] 1776386=test_data I, [2024-05-24T17:27:17.929717 #1735236] INFO -- : [752/883] 1776386=test_gem_commands_build_command I, [2024-05-24T17:27:18.228420 #1735236] INFO -- : [753/883] 1776386=test_ellipsize I, [2024-05-24T17:27:18.265196 #1735236] INFO -- : [754/883] 1776386=test_call I, [2024-05-24T17:27:18.452861 #1735236] INFO -- : [755/883] 1776386=test_reline I, [2024-05-24T17:27:18.709008 #1735236] INFO -- : [756/883] 1776386=test_history I, [2024-05-24T17:27:19.159086 #1735236] INFO -- : [757/883] 1776386=test_to_ary_concat I, [2024-05-24T17:27:19.474777 #1735236] INFO -- : [758/883] 1776385=test_gem_ext_builder I, [2024-05-24T17:27:20.322244 #1735236] INFO -- : [759/883] 1776385=test_windows_1251 I, [2024-05-24T17:27:20.382763 #1735236] INFO -- : [760/883] 1776385=test_popen_deadlock I, [2024-05-24T17:27:20.873592 #1735236] INFO -- : [761/883] 1776385=test_time I, [2024-05-24T17:27:21.026885 #1735236] INFO -- : [762/883] 1776385=test_alias_and_anchor I, [2024-05-24T17:27:21.048890 #1735236] INFO -- : [763/883] 1776385=test_key_stroke I, [2024-05-24T17:27:21.134458 #1735236] INFO -- : [764/883] 1776385=test_rdoc_markup I, [2024-05-24T17:27:21.142955 #1735236] INFO -- : [765/883] 1776385=test_euc_jp I, [2024-05-24T17:27:21.198518 #1735236] INFO -- : [766/883] 1776385=test_ensured I, [2024-05-24T17:27:21.207976 #1735236] INFO -- : [767/883] 1776385=test_delegate I, [2024-05-24T17:27:21.223296 #1735236] INFO -- : [768/883] 1776385=test_chilled I, [2024-05-24T17:27:21.236772 #1735236] INFO -- : [769/883] 1776385=location_test I, [2024-05-24T17:27:21.276523 #1735236] INFO -- : [770/883] 1776385=test_symbol I, [2024-05-24T17:27:21.335072 #1735236] INFO -- : [771/883] 1776385=test_project_sanity I, [2024-05-24T17:27:21.350049 #1735236] INFO -- : [772/883] 1776385=test_gem_request_set I, [2024-05-24T17:27:21.950049 #1735236] INFO -- : [773/883] 1776385=test_gem_bundler_version_finder I, [2024-05-24T17:27:22.050021 #1735236] INFO -- : [774/883] 1776385=test_gc I, [2024-05-24T17:27:24.584702 #1735236] INFO -- : [775/883] 1776386=test_pattern_matching I, [2024-05-24T17:27:24.603898 #1735236] INFO -- : [776/883] 1776386=test_folderitem2_invokeverb I, [2024-05-24T17:27:24.612096 #1735236] INFO -- : [777/883] 1776386=test_set_len I, [2024-05-24T17:27:24.622254 #1735236] INFO -- : [778/883] 1776386=constant_path_node_test I, [2024-05-24T17:27:24.630100 #1735236] INFO -- : [779/883] 1776386=test_interned_str I, [2024-05-24T17:27:24.641774 #1735236] INFO -- : [780/883] 1776386=test_webauthn_listener_response I, [2024-05-24T17:27:24.693916 #1735236] INFO -- : [781/883] 1776386=test_sleep I, [2024-05-24T17:27:25.605209 #1735236] INFO -- : [782/883] 1776387=test_gem_resolver_index_set I, [2024-05-24T17:27:25.643805 #1735236] INFO -- : [783/883] 1776387=ruby_api_test I, [2024-05-24T17:27:25.816332 #1735236] INFO -- : [784/883] 1776387=test_rb_str_dup I, [2024-05-24T17:27:25.830775 #1735236] INFO -- : [785/883] 1776387=test_lambda I, [2024-05-24T17:27:25.892838 #1735236] INFO -- : [786/883] 1776387=test_scalar_scanner I, [2024-05-24T17:27:25.904167 #1735236] INFO -- : [787/883] 1776387=test_win32ole_type_event I, [2024-05-24T17:27:25.945128 #1735236] INFO -- : [788/883] 1776387=test_keyword I, [2024-05-24T17:27:26.450717 #1735236] INFO -- : [789/883] 1776387=test_gem_path_support I, [2024-05-24T17:27:26.484073 #1735236] INFO -- : [790/883] 1776387=test_arity I, [2024-05-24T17:27:26.513749 #1735236] INFO -- : [791/883] 1776387=test_trace I, [2024-05-24T17:27:26.539641 #1735236] INFO -- : [792/883] 1776387=test_gem_resolver_installer_set I, [2024-05-24T17:27:26.762634 #1735236] INFO -- : [793/883] 1776387=test_append I, [2024-05-24T17:27:26.768556 #1735236] INFO -- : [794/883] 1776387=test_foreach I, [2024-05-24T17:27:26.778802 #1735236] INFO -- : [795/883] 1776387=test_rdoc_markup_to_html I, [2024-05-24T17:27:26.866695 #1735236] INFO -- : [796/883] 1776387=test_summary I, [2024-05-24T17:27:26.927822 #1735236] INFO -- : [797/883] 1776387=test_helper_method I, [2024-05-24T17:27:27.015600 #1735236] INFO -- : [798/883] 1776387=test_config I, [2024-05-24T17:27:27.323096 #1735236] INFO -- : [799/883] 1776387=test_file I, [2024-05-24T17:27:29.674275 #1735236] INFO -- : [800/883] 1776386=bom_test I, [2024-05-24T17:27:29.686900 #1735236] INFO -- : [801/883] 1776386=test_x509ext I, [2024-05-24T17:27:29.699051 #1735236] INFO -- : [802/883] 1776386=test_emitter I, [2024-05-24T17:27:29.707757 #1735236] INFO -- : [803/883] 1776386=test_case_options I, [2024-05-24T17:27:29.719393 #1735236] INFO -- : [804/883] 1776386=test_cgi_header I, [2024-05-24T17:27:29.736274 #1735236] INFO -- : [805/883] 1776386=test_object I, [2024-05-24T17:27:29.745791 #1735236] INFO -- : [806/883] 1776386=test_member I, [2024-05-24T17:27:29.758190 #1735236] INFO -- : [807/883] 1776386=test_kill_ring I, [2024-05-24T17:27:29.770531 #1735236] INFO -- : [808/883] 1776386=test_addr I, [2024-05-24T17:27:29.783864 #1735236] INFO -- : [809/883] 1776386=test_mailto I, [2024-05-24T17:27:29.798471 #1735236] INFO -- : [810/883] 1776386=test_gem_resolver_api_set I, [2024-05-24T17:27:29.872150 #1735236] INFO -- : [811/883] 1776386=test_duplicate I, [2024-05-24T17:27:29.873129 #1735236] INFO -- : [812/883] 1776386=test_helper I, [2024-05-24T17:27:29.882442 #1735236] INFO -- : [813/883] 1776386=test_object_references I, [2024-05-24T17:27:29.941708 #1735236] INFO -- : [814/883] 1776386=test_gem_source_subpath_problem I, [2024-05-24T17:27:30.117196 #1735236] INFO -- : [815/883] 1776386=compiler_test I, [2024-05-24T17:27:30.119374 #1735236] INFO -- : [816/883] 1776386=test_arith_seq_extract I, [2024-05-24T17:27:30.128071 #1735236] INFO -- : [817/883] 1776386=test_ruby_lex I, [2024-05-24T17:27:30.283967 #1735236] INFO -- : [818/883] 1776386=test_ossl I, [2024-05-24T17:27:33.067881 #1735236] INFO -- : [819/883] 1776385=test_buffered_io I, [2024-05-24T17:27:33.096327 #1735236] INFO -- : [820/883] 1776385=test_gem_installer I, [2024-05-24T17:27:33.552098 #1735236] INFO -- : [821/883] 1776387=test_bug_reporter I, [2024-05-24T17:27:33.751874 #1735236] INFO -- : [822/883] 1776387=test_rdoc_normal_class I, [2024-05-24T17:27:33.807466 #1735236] INFO -- : [823/883] 1776387=test_within_pipe I, [2024-05-24T17:27:33.890683 #1735236] INFO -- : [824/883] 1776387=test_pointer I, [2024-05-24T17:27:35.569327 #1735236] INFO -- : [825/883] 1776387=test_nofree I, [2024-05-24T17:27:35.591034 #1735236] INFO -- : [826/883] 1776387=test_regexp I, [2024-05-24T17:27:37.433836 #1735236] INFO -- : [827/883] 1776386=test_whileuntil I, [2024-05-24T17:27:37.442496 #1735236] INFO -- : [828/883] 1776386=test_monitor I, [2024-05-24T17:27:37.680707 #1735236] INFO -- : [829/883] 1776386=test_beginendblock I, [2024-05-24T17:27:37.825189 #1735236] INFO -- : [830/883] 1776385=test_eval I, [2024-05-24T17:27:38.082546 #1735236] INFO -- : [831/883] 1776386=test_func I, [2024-05-24T17:27:38.100635 #1735236] INFO -- : [832/883] 1776385=test_config I, [2024-05-24T17:27:38.117510 #1735236] INFO -- : [833/883] 1776385=test_vm_dump I, [2024-05-24T17:27:38.127544 #1735236] INFO -- : [834/883] 1776385=json_encoding_test I, [2024-05-24T17:27:38.150043 #1735236] INFO -- : [835/883] 1776385=errors_test I, [2024-05-24T17:27:38.238842 #1735236] INFO -- : [836/883] 1776385=test_convertible I, [2024-05-24T17:27:42.157411 #1735236] INFO -- : [837/883] 1776385=test_pkg_config I, [2024-05-24T17:27:42.171736 #1735236] INFO -- : [838/883] 1776385=test_gem_available_set I, [2024-05-24T17:27:42.270648 #1735236] INFO -- : [839/883] 1776385=test_modify_expand I, [2024-05-24T17:27:42.281415 #1735236] INFO -- : [840/883] 1776385=test_color_printer I, [2024-05-24T17:27:42.363806 #1735236] INFO -- : [841/883] 1776385=test_super I, [2024-05-24T17:27:44.541844 #1735236] INFO -- : [842/883] 1776385=unescape_test I, [2024-05-24T17:27:45.688368 #1735236] INFO -- : [843/883] 1776386=test_gem_commands_exec_command I, [2024-05-24T17:27:45.918580 #1735236] INFO -- : [844/883] 1776385=test_object I, [2024-05-24T17:27:46.263965 #1735236] INFO -- : [845/883] 1776385=test_dln I, [2024-05-24T17:27:46.265924 #1735236] INFO -- : [846/883] 1776385=test_gem_source_vendor I, [2024-05-24T17:27:46.297062 #1735236] INFO -- : [847/883] 1776385=test_gem_resolver I, [2024-05-24T17:27:46.594004 #1735236] INFO -- : [848/883] 1776385=test_x509req I, [2024-05-24T17:27:46.651626 #1735236] INFO -- : [849/883] 1776385=test_httpresponse I, [2024-05-24T17:27:46.672093 #1735236] INFO -- : [850/883] 1776385=test_rdoc_parser_ruby I, [2024-05-24T17:27:47.234061 #1735236] INFO -- : [851/883] 1776386=test_readpartial I, [2024-05-24T17:27:47.652390 #1735236] INFO -- : [852/883] 1776386=test_insns_leaf I, [2024-05-24T17:27:47.657924 #1735236] INFO -- : [853/883] 1776386=test_ifunless I, [2024-05-24T17:27:47.675815 #1735236] INFO -- : [854/883] 1776386=test_allocation I, [2024-05-24T17:27:48.418420 #1735236] INFO -- : [855/883] 1776385=test_gem_console_ui I, [2024-05-24T17:27:48.428927 #1735236] INFO -- : [856/883] 1776385=test_io_console I, [2024-05-24T17:27:50.120135 #1735236] INFO -- : [857/883] 1776386=test_flip I, [2024-05-24T17:27:50.148365 #1735236] INFO -- : [858/883] 1776386=test_rdoc_markup_heading I, [2024-05-24T17:27:50.167891 #1735236] INFO -- : [859/883] 1776386=test_x509crl I, [2024-05-24T17:27:50.271063 #1735236] INFO -- : [860/883] 1776386=test_cgi_session I, [2024-05-24T17:27:50.383631 #1735236] INFO -- : [861/883] 1776386=test_notimplement I, [2024-05-24T17:27:50.392585 #1735236] INFO -- : [862/883] 1776386=test_c_union_entity I, [2024-05-24T17:27:50.673442 #1735236] INFO -- : [863/883] 1776386=test_dns I, [2024-05-24T17:27:51.026864 #1735236] INFO -- : [864/883] 1776385=test_gem_commands_cleanup_command I, [2024-05-24T17:27:51.133647 #1735236] INFO -- : [865/883] 1776386=test_class2name I, [2024-05-24T17:27:51.155778 #1735236] INFO -- : [866/883] 1776386=test_transcode I, [2024-05-24T17:27:51.332971 #1735236] INFO -- : [867/883] 1776386=test_refinement I, [2024-05-24T17:27:51.684402 #1735236] INFO -- : [868/883] 1776385=test_debug I, [2024-05-24T17:27:51.696721 #1735236] INFO -- : [869/883] 1776385=test_profile_frames I, [2024-05-24T17:27:51.872544 #1735236] INFO -- : [870/883] 1776385=test_pattern_key_name_check I, [2024-05-24T17:27:51.884102 #1735236] INFO -- : [871/883] 1776385=test_alias I, [2024-05-24T17:27:52.037275 #1735236] INFO -- : [872/883] 1776385=test_fips I, [2024-05-24T17:27:52.308735 #1735236] INFO -- : [873/883] 1776385=test_emitter I, [2024-05-24T17:27:52.317987 #1735236] INFO -- : [874/883] 1776385=test_getopts I, [2024-05-24T17:27:52.321738 #1735236] INFO -- : [875/883] 1776385=test_thread_fd_close I, [2024-05-24T17:27:52.404988 #1735236] INFO -- : [876/883] 1776385=test_last_thread I, [2024-05-24T17:27:53.432777 #1735236] INFO -- : [877/883] 1776385=test_digest_extend I, [2024-05-24T17:27:53.469929 #1735236] INFO -- : [878/883] 1776385=test_gem_ext_cmake_builder I, [2024-05-24T17:27:53.498743 #1735236] INFO -- : [879/883] 1776385=test_gem_commands_uninstall_command I, [2024-05-24T17:27:54.426631 #1735236] INFO -- : [880/883] 1776385=test_rdoc_markup_formatter I, [2024-05-24T17:27:54.439495 #1735236] INFO -- : [881/883] 1776385=test_win32ole_event I, [2024-05-24T17:27:54.439777 #1735236] INFO -- : [882/883] 1776385=test_helper I, [2024-05-24T17:27:54.458969 #1735236] INFO -- : [883/883] 1776385=test_compile_prism I, [2024-05-24T17:28:05.915902 #1735236] INFO -- : I, [2024-05-24T17:28:05.916070 #1735236] INFO -- : Retrying... E, [2024-05-24T17:28:05.915994 #1735236] ERROR -- : Failed tests: E, [2024-05-24T17:28:05.916118 #1735236] ERROR -- : TestRubyLiteral#test_float: Test::Unit::ProxyError: SyntaxError#path changed E, [2024-05-24T17:28:05.916134 #1735236] ERROR -- : I, [2024-05-24T17:28:06.397493 #1735236] INFO -- : Finished tests in 205.145554s, 128.2212 tests/s, 45537.5893 assertions/s. I, [2024-05-24T17:28:06.403198 #1735236] INFO -- : 26304 tests, 9341834 assertions, 0 failures, 0 errors, 320 skips I, [2024-05-24T17:28:06.403229 #1735236] INFO -- : I, [2024-05-24T17:28:06.403240 #1735236] INFO -- : ruby -v: ruby 3.4.0dev (2024-05-24T17:19:38Z master f8b750370e) [aarch64-linux] I, [2024-05-24T17:28:06.404357 #1735236] INFO -- : $$$[end] "make yes-test-all TESTOPTS='--stderr-on-failure' TESTS='-j3'" exit with 0. I, [2024-05-24T17:28:06.404540 #1735236] INFO -- : $$$[beg] make yes-test-rubyspec MSPECOPT='--error-output stderr --debug -j' TESTS='-j3' I, [2024-05-24T17:28:06.532151 #1735236] INFO -- : BASERUBY = /usr/local/bin/ruby --disable=gems I, [2024-05-24T17:28:06.532227 #1735236] INFO -- : CC = gcc I, [2024-05-24T17:28:06.532238 #1735236] INFO -- : LD = ld I, [2024-05-24T17:28:06.532247 #1735236] INFO -- : LDSHARED = gcc -shared I, [2024-05-24T17:28:06.532259 #1735236] INFO -- : CFLAGS = -O3 -fno-fast-math -ggdb3 -Wall -Wextra -Wdeprecated-declarations -Wdiv-by-zero -Wduplicated-cond -Wimplicit-function-declaration -Wimplicit-int -Wpointer-arith -Wwrite-strings -Wold-style-definition -Wimplicit-fallthrough=0 -Wmissing-noreturn -Wno-cast-function-type -Wno-constant-logical-operand -Wno-long-long -Wno-missing-field-initializers -Wno-overlength-strings -Wno-packed-bitfield-compat -Wno-parentheses-equality -Wno-self-assign -Wno-tautological-compare -Wno-unused-parameter -Wno-unused-value -Wsuggest-attribute=format -Wsuggest-attribute=noreturn -Wunused-variable -Wmisleading-indentation -Wundef I, [2024-05-24T17:28:06.532269 #1735236] INFO -- : XCFLAGS = -U_FORTIFY_SOURCE -D_FORTIFY_SOURCE=2 -fstack-protector-strong -msign-return-address=all -fno-strict-overflow -fvisibility=hidden -fexcess-precision=standard -DRUBY_EXPORT -fPIE -I. -I.ext/include/aarch64-linux -I/home/opc/ruby/src/master/include -I/home/opc/ruby/src/master -I/home/opc/ruby/src/master/prism -I/home/opc/ruby/src/master/enc/unicode/15.0.0 I, [2024-05-24T17:28:06.532278 #1735236] INFO -- : CPPFLAGS = I, [2024-05-24T17:28:06.532286 #1735236] INFO -- : DLDFLAGS = -Wl,--compress-debug-sections=zlib -fstack-protector-strong -pie I, [2024-05-24T17:28:06.532295 #1735236] INFO -- : SOLIBS = -lz -lrt -lrt -ldl -lcrypt -lm -lpthread I, [2024-05-24T17:28:06.532303 #1735236] INFO -- : LANG = en_US.UTF-8 I, [2024-05-24T17:28:06.532312 #1735236] INFO -- : LC_ALL = I, [2024-05-24T17:28:06.532557 #1735236] INFO -- : LC_CTYPE = I, [2024-05-24T17:28:06.532572 #1735236] INFO -- : MFLAGS = I, [2024-05-24T17:28:06.532580 #1735236] INFO -- : RUSTC = rustc I, [2024-05-24T17:28:06.532589 #1735236] INFO -- : YJIT_RUSTC_ARGS = --crate-name=yjit --crate-type=staticlib --edition=2021 -g -C lto=thin -C opt-level=3 -C overflow-checks=on '--out-dir=/home/opc/ruby/build/master/yjit/target/release/' /home/opc/ruby/src/master/yjit/src/lib.rs I, [2024-05-24T17:28:06.533031 #1735236] INFO -- : gcc (GCC) 8.5.0 20210514 (Red Hat 8.5.0-10.1.0.1) I, [2024-05-24T17:28:06.533049 #1735236] INFO -- : Copyright (C) 2018 Free Software Foundation, Inc. I, [2024-05-24T17:28:06.533057 #1735236] INFO -- : This is free software; see the source for copying conditions. There is NO I, [2024-05-24T17:28:06.533066 #1735236] INFO -- : warranty; not even for MERCHANTABILITY or FITNESS FOR A PARTICULAR PURPOSE. I, [2024-05-24T17:28:06.533074 #1735236] INFO -- : I, [2024-05-24T17:28:06.535055 #1735236] INFO -- : generating enc.mk I, [2024-05-24T17:28:06.768906 #1735236] INFO -- : generating encdb.h I, [2024-05-24T17:28:06.805962 #1735236] INFO -- : encdb.h unchanged I, [2024-05-24T17:28:06.807137 #1735236] INFO -- : making enc I, [2024-05-24T17:28:06.834884 #1735236] INFO -- : make[1]: Entering directory '/home/opc/ruby/build/master' I, [2024-05-24T17:28:06.834933 #1735236] INFO -- : make[1]: Nothing to be done for 'enc'. I, [2024-05-24T17:28:06.834944 #1735236] INFO -- : make[1]: Leaving directory '/home/opc/ruby/build/master' I, [2024-05-24T17:28:06.835627 #1735236] INFO -- : making srcs under enc I, [2024-05-24T17:28:06.877720 #1735236] INFO -- : make[1]: Entering directory '/home/opc/ruby/build/master' I, [2024-05-24T17:28:06.877781 #1735236] INFO -- : make[1]: Nothing to be done for 'srcs'. I, [2024-05-24T17:28:06.877793 #1735236] INFO -- : make[1]: Leaving directory '/home/opc/ruby/build/master' I, [2024-05-24T17:28:06.878855 #1735236] INFO -- : generating transdb.h I, [2024-05-24T17:28:07.025510 #1735236] INFO -- : transdb.h unchanged I, [2024-05-24T17:28:07.026989 #1735236] INFO -- : making trans I, [2024-05-24T17:28:07.075751 #1735236] INFO -- : make[1]: Entering directory '/home/opc/ruby/build/master' I, [2024-05-24T17:28:07.075818 #1735236] INFO -- : make[1]: Nothing to be done for 'trans'. I, [2024-05-24T17:28:07.075830 #1735236] INFO -- : make[1]: Leaving directory '/home/opc/ruby/build/master' I, [2024-05-24T17:28:07.076579 #1735236] INFO -- : making encs I, [2024-05-24T17:28:07.129577 #1735236] INFO -- : make[1]: Entering directory '/home/opc/ruby/build/master' I, [2024-05-24T17:28:07.129641 #1735236] INFO -- : make[1]: Nothing to be done for 'encs'. I, [2024-05-24T17:28:07.129651 #1735236] INFO -- : make[1]: Leaving directory '/home/opc/ruby/build/master' I, [2024-05-24T17:28:07.131677 #1735236] INFO -- : generating makefiles ext/configure-ext.mk I, [2024-05-24T17:28:07.172346 #1735236] INFO -- : ext/configure-ext.mk updated I, [2024-05-24T17:28:07.175789 #1735236] INFO -- : make[1]: Entering directory '/home/opc/ruby/build/master' I, [2024-05-24T17:28:09.307292 #1735236] INFO -- : make[1]: Leaving directory '/home/opc/ruby/build/master' I, [2024-05-24T17:28:09.308017 #1735236] INFO -- : generating makefile exts.mk I, [2024-05-24T17:28:09.368387 #1735236] INFO -- : exts.mk unchanged I, [2024-05-24T17:28:09.373434 #1735236] INFO -- : make[1]: Entering directory '/home/opc/ruby/build/master' I, [2024-05-24T17:28:09.669299 #1735236] INFO -- : make[2]: Entering directory '/home/opc/ruby/build/master/ext/coverage' I, [2024-05-24T17:28:09.673950 #1735236] INFO -- : make[2]: Leaving directory '/home/opc/ruby/build/master/ext/coverage' I, [2024-05-24T17:28:09.679564 #1735236] INFO -- : make[2]: Entering directory '/home/opc/ruby/build/master/ext/date' I, [2024-05-24T17:28:09.684946 #1735236] INFO -- : make[2]: Leaving directory '/home/opc/ruby/build/master/ext/date' I, [2024-05-24T17:28:09.688263 #1735236] INFO -- : make[2]: Entering directory '/home/opc/ruby/build/master/ext/digest' I, [2024-05-24T17:28:09.697045 #1735236] INFO -- : make[2]: Leaving directory '/home/opc/ruby/build/master/ext/digest' I, [2024-05-24T17:28:09.719932 #1735236] INFO -- : make[2]: Entering directory '/home/opc/ruby/build/master/ext/digest/sha2' I, [2024-05-24T17:28:09.724752 #1735236] INFO -- : make[2]: Leaving directory '/home/opc/ruby/build/master/ext/digest/sha2' I, [2024-05-24T17:28:09.742927 #1735236] INFO -- : make[2]: Entering directory '/home/opc/ruby/build/master/ext/fiddle' I, [2024-05-24T17:28:09.753073 #1735236] INFO -- : make[2]: Leaving directory '/home/opc/ruby/build/master/ext/fiddle' I, [2024-05-24T17:28:09.757590 #1735236] INFO -- : make[2]: Entering directory '/home/opc/ruby/build/master/ext/io/console' I, [2024-05-24T17:28:09.762300 #1735236] INFO -- : make[2]: Leaving directory '/home/opc/ruby/build/master/ext/io/console' I, [2024-05-24T17:28:09.772902 #1735236] INFO -- : make[2]: Entering directory '/home/opc/ruby/build/master/ext/json' I, [2024-05-24T17:28:09.782384 #1735236] INFO -- : make[2]: Leaving directory '/home/opc/ruby/build/master/ext/json' I, [2024-05-24T17:28:09.795992 #1735236] INFO -- : make[2]: Entering directory '/home/opc/ruby/build/master/ext/monitor' I, [2024-05-24T17:28:09.800118 #1735236] INFO -- : make[2]: Leaving directory '/home/opc/ruby/build/master/ext/monitor' I, [2024-05-24T17:28:09.806090 #1735236] INFO -- : make[2]: Entering directory '/home/opc/ruby/build/master/ext/objspace' I, [2024-05-24T17:28:09.812102 #1735236] INFO -- : make[2]: Leaving directory '/home/opc/ruby/build/master/ext/objspace' I, [2024-05-24T17:28:09.831075 #1735236] INFO -- : make[2]: Entering directory '/home/opc/ruby/build/master/ext/openssl' I, [2024-05-24T17:28:09.852784 #1735236] INFO -- : make[2]: Leaving directory '/home/opc/ruby/build/master/ext/openssl' I, [2024-05-24T17:28:09.856995 #1735236] INFO -- : make[2]: Entering directory '/home/opc/ruby/build/master/ext/pathname' I, [2024-05-24T17:28:09.861811 #1735236] INFO -- : make[2]: Leaving directory '/home/opc/ruby/build/master/ext/pathname' I, [2024-05-24T17:28:09.868131 #1735236] INFO -- : make[2]: Entering directory '/home/opc/ruby/build/master/ext/psych' I, [2024-05-24T17:28:09.889544 #1735236] INFO -- : make[2]: Leaving directory '/home/opc/ruby/build/master/ext/psych' I, [2024-05-24T17:28:09.893859 #1735236] INFO -- : make[2]: Entering directory '/home/opc/ruby/build/master/ext/pty' I, [2024-05-24T17:28:09.897986 #1735236] INFO -- : make[2]: Leaving directory '/home/opc/ruby/build/master/ext/pty' I, [2024-05-24T17:28:09.911211 #1735236] INFO -- : make[2]: Entering directory '/home/opc/ruby/build/master/ext/ripper' I, [2024-05-24T17:28:09.918952 #1735236] INFO -- : make[2]: Leaving directory '/home/opc/ruby/build/master/ext/ripper' I, [2024-05-24T17:28:09.920913 #1735236] INFO -- : make[2]: Entering directory '/home/opc/ruby/build/master/ext/rubyvm' I, [2024-05-24T17:28:09.924459 #1735236] INFO -- : make[2]: Leaving directory '/home/opc/ruby/build/master/ext/rubyvm' I, [2024-05-24T17:28:09.936608 #1735236] INFO -- : make[2]: Entering directory '/home/opc/ruby/build/master/ext/socket' I, [2024-05-24T17:28:09.947236 #1735236] INFO -- : make[2]: Leaving directory '/home/opc/ruby/build/master/ext/socket' I, [2024-05-24T17:28:09.962455 #1735236] INFO -- : make[2]: Entering directory '/home/opc/ruby/build/master/.bundle/gems/bigdecimal-3.1.7/ext/bigdecimal' I, [2024-05-24T17:28:09.993392 #1735236] INFO -- : make[2]: Leaving directory '/home/opc/ruby/build/master/.bundle/gems/bigdecimal-3.1.7/ext/bigdecimal' I, [2024-05-24T17:28:09.995978 #1735236] INFO -- : make[2]: Entering directory '/home/opc/ruby/build/master/.bundle/gems/bigdecimal-3.1.8/ext/bigdecimal' I, [2024-05-24T17:28:10.026981 #1735236] INFO -- : make[2]: Leaving directory '/home/opc/ruby/build/master/.bundle/gems/bigdecimal-3.1.8/ext/bigdecimal' I, [2024-05-24T17:28:10.029617 #1735236] INFO -- : make[2]: Entering directory '/home/opc/ruby/build/master/.bundle/gems/debug-1.9.2/ext/debug' I, [2024-05-24T17:28:10.060159 #1735236] INFO -- : make[2]: Leaving directory '/home/opc/ruby/build/master/.bundle/gems/debug-1.9.2/ext/debug' I, [2024-05-24T17:28:10.062719 #1735236] INFO -- : make[2]: Entering directory '/home/opc/ruby/build/master/.bundle/gems/nkf-0.2.0/ext/nkf' I, [2024-05-24T17:28:10.093396 #1735236] INFO -- : make[2]: Leaving directory '/home/opc/ruby/build/master/.bundle/gems/nkf-0.2.0/ext/nkf' I, [2024-05-24T17:28:10.095869 #1735236] INFO -- : make[2]: Entering directory '/home/opc/ruby/build/master/.bundle/gems/racc-1.7.3/ext/racc/cparse' I, [2024-05-24T17:28:10.126888 #1735236] INFO -- : make[2]: Leaving directory '/home/opc/ruby/build/master/.bundle/gems/racc-1.7.3/ext/racc/cparse' I, [2024-05-24T17:28:10.129464 #1735236] INFO -- : make[2]: Entering directory '/home/opc/ruby/build/master/.bundle/gems/racc-1.8.0/ext/racc/cparse' I, [2024-05-24T17:28:10.160733 #1735236] INFO -- : make[2]: Leaving directory '/home/opc/ruby/build/master/.bundle/gems/racc-1.8.0/ext/racc/cparse' I, [2024-05-24T17:28:10.163680 #1735236] INFO -- : make[2]: Entering directory '/home/opc/ruby/build/master/.bundle/gems/rbs-3.4.4/ext/rbs_extension' I, [2024-05-24T17:28:10.194322 #1735236] INFO -- : make[2]: Leaving directory '/home/opc/ruby/build/master/.bundle/gems/rbs-3.4.4/ext/rbs_extension' I, [2024-05-24T17:28:10.196922 #1735236] INFO -- : make[2]: Entering directory '/home/opc/ruby/build/master/.bundle/gems/syslog-0.1.2/ext/syslog' I, [2024-05-24T17:28:10.227458 #1735236] INFO -- : make[2]: Leaving directory '/home/opc/ruby/build/master/.bundle/gems/syslog-0.1.2/ext/syslog' I, [2024-05-24T17:28:10.266320 #1735236] INFO -- : make[2]: Entering directory '/home/opc/ruby/build/master' I, [2024-05-24T17:28:10.350335 #1735236] INFO -- : make[2]: 'ruby' is up to date. I, [2024-05-24T17:28:10.350437 #1735236] INFO -- : make[2]: Leaving directory '/home/opc/ruby/build/master' I, [2024-05-24T17:28:10.350531 #1735236] INFO -- : make[1]: Leaving directory '/home/opc/ruby/build/master' I, [2024-05-24T17:28:10.355073 #1735236] INFO -- : make[1]: Entering directory '/home/opc/ruby/build/master' I, [2024-05-24T17:28:10.355128 #1735236] INFO -- : make[1]: Nothing to be done for 'note'. I, [2024-05-24T17:28:10.355150 #1735236] INFO -- : make[1]: Leaving directory '/home/opc/ruby/build/master' E, [2024-05-24T17:28:10.433032 #1735236] ERROR -- : $ /home/opc/ruby/build/master/miniruby -I/home/opc/ruby/src/master/lib /home/opc/ruby/src/master/tool/runruby.rb --archdir=/home/opc/ruby/build/master --extout=.ext -- /home/opc/ruby/src/master/spec/mspec/bin/mspec-run -B /home/opc/ruby/src/master/spec/default.mspec --error-output stderr --debug -fy -o /tmp/rubytest.lxinyl/1-mspec-multi-0 E, [2024-05-24T17:28:10.433417 #1735236] ERROR -- : $ /home/opc/ruby/build/master/miniruby -I/home/opc/ruby/src/master/lib /home/opc/ruby/src/master/tool/runruby.rb --archdir=/home/opc/ruby/build/master --extout=.ext -- /home/opc/ruby/src/master/spec/mspec/bin/mspec-run -B /home/opc/ruby/src/master/spec/default.mspec --error-output stderr --debug -fy -o /tmp/rubytest.lxinyl/2-mspec-multi-1 E, [2024-05-24T17:28:10.433784 #1735236] ERROR -- : $ /home/opc/ruby/build/master/miniruby -I/home/opc/ruby/src/master/lib /home/opc/ruby/src/master/tool/runruby.rb --archdir=/home/opc/ruby/build/master --extout=.ext -- /home/opc/ruby/src/master/spec/mspec/bin/mspec-run -B /home/opc/ruby/src/master/spec/default.mspec --error-output stderr --debug -fy -o /tmp/rubytest.lxinyl/3-mspec-multi-2 I, [2024-05-24T17:28:10.561485 #1735236] INFO -- : ruby 3.4.0dev (2024-05-24T17:19:38Z master f8b750370e) [aarch64-linux] I, [2024-05-24T17:28:15.922467 #1735236] INFO -- : 0 ......................................................................... I, [2024-05-24T17:28:18.328406 #1735236] INFO -- : 73 ......................................................................... I, [2024-05-24T17:28:18.497649 #1735236] INFO -- : 146 ......................................................................... I, [2024-05-24T17:28:18.781250 #1735236] INFO -- : 219 ......................................................................... I, [2024-05-24T17:28:18.940112 #1735236] INFO -- : 292 ......................................................................... I, [2024-05-24T17:28:19.175473 #1735236] INFO -- : 365 ......................................................................... I, [2024-05-24T17:28:19.296213 #1735236] INFO -- : 438 ......................................................................... I, [2024-05-24T17:28:19.355197 #1735236] INFO -- : 511 ......................................................................... I, [2024-05-24T17:28:19.416146 #1735236] INFO -- : 584 ......................................................................... I, [2024-05-24T17:28:20.032414 #1735236] INFO -- : 657 ......................................................................... I, [2024-05-24T17:28:20.118779 #1735236] INFO -- : 730 ......................................................................... I, [2024-05-24T17:28:20.170245 #1735236] INFO -- : 803 ......................................................................... I, [2024-05-24T17:28:20.360000 #1735236] INFO -- : 876 ......................................................................... I, [2024-05-24T17:28:20.470665 #1735236] INFO -- : 949 ......................................................................... I, [2024-05-24T17:28:21.062779 #1735236] INFO -- : 1022 ......................................................................... I, [2024-05-24T17:28:23.380189 #1735236] INFO -- : 1095 ......................................................................... I, [2024-05-24T17:28:24.218124 #1735236] INFO -- : 1168 ......................................................................... I, [2024-05-24T17:28:24.367902 #1735236] INFO -- : 1241 ......................................................................... I, [2024-05-24T17:28:24.590327 #1735236] INFO -- : 1314 ......................................................................... I, [2024-05-24T17:28:24.684529 #1735236] INFO -- : 1387 ......................................................................... I, [2024-05-24T17:28:26.708674 #1735236] INFO -- : 1460 ......................................................................... I, [2024-05-24T17:28:30.243010 #1735236] INFO -- : 1533 ......................................................................... I, [2024-05-24T17:28:30.381122 #1735236] INFO -- : 1606 ......................................................................... I, [2024-05-24T17:28:31.158279 #1735236] INFO -- : 1679 ......................................................................... I, [2024-05-24T17:28:31.388683 #1735236] INFO -- : 1752 ......................................................................... I, [2024-05-24T17:28:31.650205 #1735236] INFO -- : 1825 ......................................................................... I, [2024-05-24T17:28:31.969798 #1735236] INFO -- : 1898 ......................................................................... I, [2024-05-24T17:28:32.394706 #1735236] INFO -- : 1971 ......................................................................... I, [2024-05-24T17:28:32.911595 #1735236] INFO -- : 2044 ......................................................................... I, [2024-05-24T17:28:33.012652 #1735236] INFO -- : 2117 ......................................................................... I, [2024-05-24T17:28:33.076198 #1735236] INFO -- : 2190 ......................................................................... I, [2024-05-24T17:28:33.129261 #1735236] INFO -- : 2263 ......................................................................... I, [2024-05-24T17:28:33.177819 #1735236] INFO -- : 2336 ......................................................................... I, [2024-05-24T17:28:33.275535 #1735236] INFO -- : 2409 ......................................................................... I, [2024-05-24T17:28:33.524964 #1735236] INFO -- : 2482 ......................................................................... I, [2024-05-24T17:28:33.651125 #1735236] INFO -- : 2555 ......................................................................... I, [2024-05-24T17:28:34.881803 #1735236] INFO -- : 2628 ......................................................................... I, [2024-05-24T17:28:35.029914 #1735236] INFO -- : 2701 ......................................................................... I, [2024-05-24T17:28:35.161750 #1735236] INFO -- : 2774 ......................................................................... I, [2024-05-24T17:28:35.501834 #1735236] INFO -- : 2847 ......................................................................... I, [2024-05-24T17:28:35.759194 #1735236] INFO -- : 2920 ......................................................................... I, [2024-05-24T17:28:35.894236 #1735236] INFO -- : 2993 ......................................................................... I, [2024-05-24T17:28:35.956662 #1735236] INFO -- : 3066 ......................................................................... I, [2024-05-24T17:28:36.004552 #1735236] INFO -- : 3139 ......................................................................... I, [2024-05-24T17:28:36.071399 #1735236] INFO -- : 3212 ......................................................................... I, [2024-05-24T17:28:36.141122 #1735236] INFO -- : 3285 ......................................................................... I, [2024-05-24T17:28:39.960273 #1735236] INFO -- : 3358 ......................................................................... I, [2024-05-24T17:28:39.984461 #1735236] INFO -- : I, [2024-05-24T17:28:39.984594 #1735236] INFO -- : I, [2024-05-24T17:28:39.984606 #1735236] INFO -- : Finished in 29.551495 seconds I, [2024-05-24T17:28:39.984616 #1735236] INFO -- : I, [2024-05-24T17:28:39.984625 #1735236] INFO -- : 3430 files, 32648 examples, 191971 expectations, 0 failures, 0 errors, 0 tagged I, [2024-05-24T17:28:39.985809 #1735236] INFO -- : $$$[end] "make yes-test-rubyspec MSPECOPT='--error-output stderr --debug -j' TESTS='-j3'" exit with 0.