# Logfile created on 2024-05-24 13:22:08 +0000 by logger.rb/v1.5.3 I, [2024-05-24T13:22:08.773732 #3877846] INFO -- : #, @formatter=nil, @logdev=#, @binmode=false, @mon_data=#, @mon_data_owner_object_id=860>>> I, [2024-05-24T13:22:08.774045 #3877846] INFO -- : $$$[beg] make update-unicode -j3 I, [2024-05-24T13:22:08.863612 #3877846] INFO -- : Downloading Unicode emoji 15.0 files... I, [2024-05-24T13:22:08.863818 #3877846] INFO -- : Downloading Unicode emoji 15.0 files... I, [2024-05-24T13:22:08.864115 #3877846] INFO -- : Downloading Unicode emoji 15.0 files... I, [2024-05-24T13:22:08.944380 #3877846] INFO -- : made symlink emoji/15.0/emoji-sequences.txt to /home/opc/ruby/src/master/.downloaded-cache/emoji/15.0/emoji-sequences.txt I, [2024-05-24T13:22:08.944483 #3877846] INFO -- : /home/opc/ruby/src/master/enc/unicode/data/emoji/15.0/emoji-sequences.txt already exists I, [2024-05-24T13:22:08.981657 #3877846] INFO -- : downloading emoji/15.0/emoji-test.txt ... downloading emoji/15.0/emoji-test.txt ... /home/opc/ruby/src/master/enc/unicode/data/emoji/15.0/emoji-sequences.txt already exists E, [2024-05-24T13:22:09.415451 #3877846] ERROR -- : /home/opc/ruby/src/master/tool/downloader.rb:302:in `rescue in download': failed to download emoji/15.0/emoji-test.txt (RuntimeError) E, [2024-05-24T13:22:09.415509 #3877846] ERROR -- : OpenURI::HTTPError: 403 Forbidden: https://www.unicode.org/Public/emoji/15.0/emoji-test.txt E, [2024-05-24T13:22:09.415520 #3877846] ERROR -- : from /home/opc/ruby/src/master/tool/downloader.rb:201:in `download' E, [2024-05-24T13:22:09.415530 #3877846] ERROR -- : from /home/opc/ruby/src/master/tool/downloader.rb:136:in `download' E, [2024-05-24T13:22:09.415539 #3877846] ERROR -- : from /home/opc/ruby/src/master/tool/downloader.rb:482:in `block in
' E, [2024-05-24T13:22:09.415548 #3877846] ERROR -- : from /home/opc/ruby/src/master/tool/downloader.rb:465:in `each' E, [2024-05-24T13:22:09.415556 #3877846] ERROR -- : from /home/opc/ruby/src/master/tool/downloader.rb:465:in `
' E, [2024-05-24T13:22:09.415565 #3877846] ERROR -- : /usr/local/lib/ruby/3.2.0/open-uri.rb:369:in `open_http': 403 Forbidden (OpenURI::HTTPError) E, [2024-05-24T13:22:09.415574 #3877846] ERROR -- : from /usr/local/lib/ruby/3.2.0/open-uri.rb:760:in `buffer_open' E, [2024-05-24T13:22:09.415582 #3877846] ERROR -- : from /usr/local/lib/ruby/3.2.0/open-uri.rb:214:in `block in open_loop' E, [2024-05-24T13:22:09.415591 #3877846] ERROR -- : from /usr/local/lib/ruby/3.2.0/open-uri.rb:212:in `catch' E, [2024-05-24T13:22:09.415599 #3877846] ERROR -- : from /usr/local/lib/ruby/3.2.0/open-uri.rb:212:in `open_loop' E, [2024-05-24T13:22:09.415608 #3877846] ERROR -- : from /usr/local/lib/ruby/3.2.0/open-uri.rb:153:in `open_uri' E, [2024-05-24T13:22:09.415616 #3877846] ERROR -- : from /usr/local/lib/ruby/3.2.0/open-uri.rb:740:in `open' E, [2024-05-24T13:22:09.415628 #3877846] ERROR -- : from /usr/local/lib/ruby/3.2.0/open-uri.rb:748:in `read' E, [2024-05-24T13:22:09.415637 #3877846] ERROR -- : from /home/opc/ruby/src/master/tool/downloader.rb:247:in `block in download' E, [2024-05-24T13:22:09.415645 #3877846] ERROR -- : from /home/opc/ruby/src/master/tool/downloader.rb:378:in `with_retry' E, [2024-05-24T13:22:09.415654 #3877846] ERROR -- : from /home/opc/ruby/src/master/tool/downloader.rb:246:in `download' E, [2024-05-24T13:22:09.415662 #3877846] ERROR -- : from /home/opc/ruby/src/master/tool/downloader.rb:136:in `download' E, [2024-05-24T13:22:09.415671 #3877846] ERROR -- : from /home/opc/ruby/src/master/tool/downloader.rb:482:in `block in
' E, [2024-05-24T13:22:09.415679 #3877846] ERROR -- : from /home/opc/ruby/src/master/tool/downloader.rb:465:in `each' E, [2024-05-24T13:22:09.415688 #3877846] ERROR -- : from /home/opc/ruby/src/master/tool/downloader.rb:465:in `
' E, [2024-05-24T13:22:09.417327 #3877846] ERROR -- : /home/opc/ruby/src/master/tool/downloader.rb:302:in `rescue in download': failed to download emoji/15.0/emoji-test.txt (RuntimeError) E, [2024-05-24T13:22:09.417366 #3877846] ERROR -- : OpenURI::HTTPError: 403 Forbidden: https://www.unicode.org/Public/emoji/15.0/emoji-test.txt E, [2024-05-24T13:22:09.417377 #3877846] ERROR -- : from /home/opc/ruby/src/master/tool/downloader.rb:201:in `download' E, [2024-05-24T13:22:09.417388 #3877846] ERROR -- : from /home/opc/ruby/src/master/tool/downloader.rb:136:in `download' E, [2024-05-24T13:22:09.417397 #3877846] ERROR -- : from /home/opc/ruby/src/master/tool/downloader.rb:482:in `block in
' E, [2024-05-24T13:22:09.417406 #3877846] ERROR -- : from /home/opc/ruby/src/master/tool/downloader.rb:465:in `each' E, [2024-05-24T13:22:09.417414 #3877846] ERROR -- : from /home/opc/ruby/src/master/tool/downloader.rb:465:in `
' E, [2024-05-24T13:22:09.417423 #3877846] ERROR -- : /usr/local/lib/ruby/3.2.0/open-uri.rb:369:in `open_http': 403 Forbidden (OpenURI::HTTPError) E, [2024-05-24T13:22:09.417431 #3877846] ERROR -- : from /usr/local/lib/ruby/3.2.0/open-uri.rb:760:in `buffer_open' E, [2024-05-24T13:22:09.417440 #3877846] ERROR -- : from /usr/local/lib/ruby/3.2.0/open-uri.rb:214:in `block in open_loop' E, [2024-05-24T13:22:09.417448 #3877846] ERROR -- : from /usr/local/lib/ruby/3.2.0/open-uri.rb:212:in `catch' E, [2024-05-24T13:22:09.417457 #3877846] ERROR -- : from /usr/local/lib/ruby/3.2.0/open-uri.rb:212:in `open_loop' E, [2024-05-24T13:22:09.417465 #3877846] ERROR -- : from /usr/local/lib/ruby/3.2.0/open-uri.rb:153:in `open_uri' E, [2024-05-24T13:22:09.417474 #3877846] ERROR -- : from /usr/local/lib/ruby/3.2.0/open-uri.rb:740:in `open' E, [2024-05-24T13:22:09.417482 #3877846] ERROR -- : from /usr/local/lib/ruby/3.2.0/open-uri.rb:748:in `read' E, [2024-05-24T13:22:09.417490 #3877846] ERROR -- : from /home/opc/ruby/src/master/tool/downloader.rb:247:in `block in download' E, [2024-05-24T13:22:09.417499 #3877846] ERROR -- : from /home/opc/ruby/src/master/tool/downloader.rb:378:in `with_retry' E, [2024-05-24T13:22:09.417508 #3877846] ERROR -- : from /home/opc/ruby/src/master/tool/downloader.rb:246:in `download' E, [2024-05-24T13:22:09.417516 #3877846] ERROR -- : from /home/opc/ruby/src/master/tool/downloader.rb:136:in `download' E, [2024-05-24T13:22:09.417525 #3877846] ERROR -- : from /home/opc/ruby/src/master/tool/downloader.rb:482:in `block in
' E, [2024-05-24T13:22:09.417533 #3877846] ERROR -- : from /home/opc/ruby/src/master/tool/downloader.rb:465:in `each' E, [2024-05-24T13:22:09.417542 #3877846] ERROR -- : from /home/opc/ruby/src/master/tool/downloader.rb:465:in `
' E, [2024-05-24T13:22:09.418936 #3877846] ERROR -- : make: *** [uncommon.mk:1756: /home/opc/ruby/src/master/enc/unicode/data/emoji/15.0/emoji-sequences.txt] Error 1 E, [2024-05-24T13:22:09.418964 #3877846] ERROR -- : make: *** Deleting file '/home/opc/ruby/src/master/enc/unicode/data/emoji/15.0/emoji-sequences.txt' E, [2024-05-24T13:22:09.418979 #3877846] ERROR -- : make: *** Waiting for unfinished jobs.... E, [2024-05-24T13:22:09.420156 #3877846] ERROR -- : make: *** [uncommon.mk:1756: /home/opc/ruby/src/master/enc/unicode/data/emoji/15.0/emoji-zwj-sequences.txt] Error 1 E, [2024-05-24T13:22:09.449223 #3877846] ERROR -- : /home/opc/ruby/src/master/tool/downloader.rb:302:in `rescue in download': failed to download emoji/15.0/emoji-test.txt (RuntimeError) E, [2024-05-24T13:22:09.449262 #3877846] ERROR -- : OpenURI::HTTPError: 403 Forbidden: https://www.unicode.org/Public/emoji/15.0/emoji-test.txt E, [2024-05-24T13:22:09.449273 #3877846] ERROR -- : from /home/opc/ruby/src/master/tool/downloader.rb:201:in `download' E, [2024-05-24T13:22:09.449282 #3877846] ERROR -- : from /home/opc/ruby/src/master/tool/downloader.rb:136:in `download' E, [2024-05-24T13:22:09.449291 #3877846] ERROR -- : from /home/opc/ruby/src/master/tool/downloader.rb:482:in `block in
' E, [2024-05-24T13:22:09.449299 #3877846] ERROR -- : from /home/opc/ruby/src/master/tool/downloader.rb:465:in `each' E, [2024-05-24T13:22:09.449308 #3877846] ERROR -- : from /home/opc/ruby/src/master/tool/downloader.rb:465:in `
' E, [2024-05-24T13:22:09.449316 #3877846] ERROR -- : /usr/local/lib/ruby/3.2.0/open-uri.rb:369:in `open_http': 403 Forbidden (OpenURI::HTTPError) E, [2024-05-24T13:22:09.449325 #3877846] ERROR -- : from /usr/local/lib/ruby/3.2.0/open-uri.rb:760:in `buffer_open' E, [2024-05-24T13:22:09.449333 #3877846] ERROR -- : from /usr/local/lib/ruby/3.2.0/open-uri.rb:214:in `block in open_loop' E, [2024-05-24T13:22:09.449342 #3877846] ERROR -- : from /usr/local/lib/ruby/3.2.0/open-uri.rb:212:in `catch' E, [2024-05-24T13:22:09.449350 #3877846] ERROR -- : from /usr/local/lib/ruby/3.2.0/open-uri.rb:212:in `open_loop' E, [2024-05-24T13:22:09.449359 #3877846] ERROR -- : from /usr/local/lib/ruby/3.2.0/open-uri.rb:153:in `open_uri' E, [2024-05-24T13:22:09.449367 #3877846] ERROR -- : from /usr/local/lib/ruby/3.2.0/open-uri.rb:740:in `open' E, [2024-05-24T13:22:09.449376 #3877846] ERROR -- : from /usr/local/lib/ruby/3.2.0/open-uri.rb:748:in `read' E, [2024-05-24T13:22:09.449384 #3877846] ERROR -- : from /home/opc/ruby/src/master/tool/downloader.rb:247:in `block in download' E, [2024-05-24T13:22:09.449393 #3877846] ERROR -- : from /home/opc/ruby/src/master/tool/downloader.rb:378:in `with_retry' E, [2024-05-24T13:22:09.449402 #3877846] ERROR -- : from /home/opc/ruby/src/master/tool/downloader.rb:246:in `download' E, [2024-05-24T13:22:09.449410 #3877846] ERROR -- : from /home/opc/ruby/src/master/tool/downloader.rb:136:in `download' E, [2024-05-24T13:22:09.449418 #3877846] ERROR -- : from /home/opc/ruby/src/master/tool/downloader.rb:482:in `block in
' E, [2024-05-24T13:22:09.449427 #3877846] ERROR -- : from /home/opc/ruby/src/master/tool/downloader.rb:465:in `each' E, [2024-05-24T13:22:09.449435 #3877846] ERROR -- : from /home/opc/ruby/src/master/tool/downloader.rb:465:in `
' E, [2024-05-24T13:22:09.452166 #3877846] ERROR -- : make: *** [uncommon.mk:1756: /home/opc/ruby/src/master/enc/unicode/data/emoji/15.0/emoji-test.txt] Error 1 I, [2024-05-24T13:22:09.452215 #3877846] INFO -- : downloading emoji/15.0/emoji-test.txt ... I, [2024-05-24T13:22:09.452390 #3877846] INFO -- : $$$[end] "make update-unicode -j3" exit with 512. I, [2024-05-24T13:22:09.452433 #3877846] INFO -- : $$$[beg] make update-download -j3 I, [2024-05-24T13:22:09.615915 #3877846] INFO -- : tool/config.guess already exists I, [2024-05-24T13:22:09.616006 #3877846] INFO -- : tool/config.sub already exists I, [2024-05-24T13:22:09.618988 #3877846] INFO -- : Update power_assert to 84e85124c5014a139af39161d484156cfe87a9ed I, [2024-05-24T13:22:09.619129 #3877846] INFO -- : Update rbs to ba7872795d5de04adb8ff500c0e6afdc81a041dd I, [2024-05-24T13:22:09.619568 #3877846] INFO -- : Update typeprof to b19a6416da3a05d57fadd6ffdadb382b6d236ca5 I, [2024-05-24T13:22:09.622465 #3877846] INFO -- : echo ba7872795d5de04adb8ff500c0e6afdc81a041dd | /bin/sh /home/opc/ruby/src/master/tool/ifchange /home/opc/ruby/src/master/.bundle/.timestamp/rbs.revision - I, [2024-05-24T13:22:09.622650 #3877846] INFO -- : echo 84e85124c5014a139af39161d484156cfe87a9ed | /bin/sh /home/opc/ruby/src/master/tool/ifchange /home/opc/ruby/src/master/.bundle/.timestamp/power_assert.revision - I, [2024-05-24T13:22:09.622872 #3877846] INFO -- : echo b19a6416da3a05d57fadd6ffdadb382b6d236ca5 | /bin/sh /home/opc/ruby/src/master/tool/ifchange /home/opc/ruby/src/master/.bundle/.timestamp/typeprof.revision - I, [2024-05-24T13:22:09.627888 #3877846] INFO -- : /home/opc/ruby/src/master/.bundle/.timestamp/rbs.revision unchanged I, [2024-05-24T13:22:09.627941 #3877846] INFO -- : /home/opc/ruby/src/master/.bundle/.timestamp/power_assert.revision unchanged I, [2024-05-24T13:22:09.628279 #3877846] INFO -- : /home/opc/ruby/src/master/.bundle/.timestamp/typeprof.revision unchanged I, [2024-05-24T13:22:09.719120 #3877846] INFO -- : Building power_assert@84e85124c5014a139af39161d484156cfe87a9ed to /home/opc/ruby/src/master/gems/power_assert-2.0.3.gem I, [2024-05-24T13:22:09.833117 #3877846] INFO -- : Successfully built RubyGem I, [2024-05-24T13:22:09.833180 #3877846] INFO -- : Name: power_assert I, [2024-05-24T13:22:09.833192 #3877846] INFO -- : Version: 2.0.4dev I, [2024-05-24T13:22:09.833201 #3877846] INFO -- : File: power_assert-2.0.4dev.gem I, [2024-05-24T13:22:09.913090 #3877846] INFO -- : $$$[end] "make update-download -j3" exit with 0. I, [2024-05-24T13:22:09.913162 #3877846] INFO -- : $$$[beg] make update-rubyspec -j3 I, [2024-05-24T13:22:10.001910 #3877846] INFO -- : make: Nothing to be done for 'update-rubyspec'. I, [2024-05-24T13:22:10.002050 #3877846] INFO -- : $$$[end] "make update-rubyspec -j3" exit with 0. I, [2024-05-24T13:22:10.002075 #3877846] INFO -- : $$$[beg] make update-src -j3 I, [2024-05-24T13:22:11.092838 #3877846] INFO -- : Already up to date. I, [2024-05-24T13:22:11.107959 #3877846] INFO -- : Latest commit hash = e49d68bf27 I, [2024-05-24T13:22:11.108602 #3877846] INFO -- : $$$[end] "make update-src -j3" exit with 0. I, [2024-05-24T13:22:11.108648 #3877846] INFO -- : $$$[beg] make after-update -j3 I, [2024-05-24T13:22:11.215382 #3877846] INFO -- : generating /home/opc/ruby/src/master/ext/ripper/eventids1.h I, [2024-05-24T13:22:11.221038 #3877846] INFO -- : make[1]: Entering directory '/home/opc/ruby/src/master/ext/ripper' I, [2024-05-24T13:22:11.221086 #3877846] INFO -- : make[1]: Nothing to be done for 'src'. I, [2024-05-24T13:22:11.221098 #3877846] INFO -- : make[1]: Leaving directory '/home/opc/ruby/src/master/ext/ripper' I, [2024-05-24T13:22:11.221840 #3877846] INFO -- : generating /home/opc/ruby/src/master/ext/ripper/eventids1.c I, [2024-05-24T13:22:11.226832 #3877846] INFO -- : make[1]: Entering directory '/home/opc/ruby/src/master/ext/ripper' I, [2024-05-24T13:22:11.226868 #3877846] INFO -- : make[1]: Nothing to be done for 'src'. I, [2024-05-24T13:22:11.226911 #3877846] INFO -- : make[1]: Leaving directory '/home/opc/ruby/src/master/ext/ripper' I, [2024-05-24T13:22:11.227658 #3877846] INFO -- : generating /home/opc/ruby/src/master/ext/ripper/eventids2table.c I, [2024-05-24T13:22:11.234477 #3877846] INFO -- : make[1]: Entering directory '/home/opc/ruby/src/master/ext/ripper' I, [2024-05-24T13:22:11.234555 #3877846] INFO -- : make[1]: Nothing to be done for 'src'. I, [2024-05-24T13:22:11.234577 #3877846] INFO -- : make[1]: Leaving directory '/home/opc/ruby/src/master/ext/ripper' I, [2024-05-24T13:22:11.247125 #3877846] INFO -- : /home/opc/ruby/src/master/revision.h updated I, [2024-05-24T13:22:11.248222 #3877846] INFO -- : generating aarch64-linux-fake.rb I, [2024-05-24T13:22:11.304923 #3877846] INFO -- : aarch64-linux-fake.rb updated I, [2024-05-24T13:22:11.306226 #3877846] INFO -- : generating enc.mk I, [2024-05-24T13:22:11.536912 #3877846] INFO -- : making srcs under enc I, [2024-05-24T13:22:11.578716 #3877846] INFO -- : make[1]: Entering directory '/home/opc/ruby/build/master' I, [2024-05-24T13:22:11.578830 #3877846] INFO -- : make[1]: Nothing to be done for 'srcs'. I, [2024-05-24T13:22:11.578863 #3877846] INFO -- : make[1]: Leaving directory '/home/opc/ruby/build/master' I, [2024-05-24T13:22:11.660039 #3877846] INFO -- : Update power_assert to 84e85124c5014a139af39161d484156cfe87a9ed I, [2024-05-24T13:22:11.660228 #3877846] INFO -- : Update rbs to ba7872795d5de04adb8ff500c0e6afdc81a041dd I, [2024-05-24T13:22:11.660592 #3877846] INFO -- : Update typeprof to b19a6416da3a05d57fadd6ffdadb382b6d236ca5 I, [2024-05-24T13:22:11.664059 #3877846] INFO -- : echo 84e85124c5014a139af39161d484156cfe87a9ed | /bin/sh /home/opc/ruby/src/master/tool/ifchange /home/opc/ruby/src/master/.bundle/.timestamp/power_assert.revision - I, [2024-05-24T13:22:11.664201 #3877846] INFO -- : echo ba7872795d5de04adb8ff500c0e6afdc81a041dd | /bin/sh /home/opc/ruby/src/master/tool/ifchange /home/opc/ruby/src/master/.bundle/.timestamp/rbs.revision - I, [2024-05-24T13:22:11.664314 #3877846] INFO -- : echo b19a6416da3a05d57fadd6ffdadb382b6d236ca5 | /bin/sh /home/opc/ruby/src/master/tool/ifchange /home/opc/ruby/src/master/.bundle/.timestamp/typeprof.revision - I, [2024-05-24T13:22:11.670442 #3877846] INFO -- : /home/opc/ruby/src/master/.bundle/.timestamp/power_assert.revision unchanged I, [2024-05-24T13:22:11.672048 #3877846] INFO -- : /home/opc/ruby/src/master/.bundle/.timestamp/typeprof.revision unchanged I, [2024-05-24T13:22:11.672613 #3877846] INFO -- : /home/opc/ruby/src/master/.bundle/.timestamp/rbs.revision unchanged I, [2024-05-24T13:22:11.763864 #3877846] INFO -- : Building power_assert@84e85124c5014a139af39161d484156cfe87a9ed to /home/opc/ruby/src/master/gems/power_assert-2.0.3.gem I, [2024-05-24T13:22:11.873454 #3877846] INFO -- : Successfully built RubyGem I, [2024-05-24T13:22:11.873510 #3877846] INFO -- : Name: power_assert I, [2024-05-24T13:22:11.873521 #3877846] INFO -- : Version: 2.0.4dev I, [2024-05-24T13:22:11.873530 #3877846] INFO -- : File: power_assert-2.0.4dev.gem I, [2024-05-24T13:22:11.875727 #3877846] INFO -- : Extracting bundle gem power_assert-2.0.3... I, [2024-05-24T13:22:11.971574 #3877846] INFO -- : Try with hash version of bundled gems instead of gems/power_assert-2.0.3.gem. We don't use this gem with release version of Ruby. I, [2024-05-24T13:22:11.981733 #3877846] INFO -- : Unpacked gems/power_assert-2.0.4dev.gem I, [2024-05-24T13:22:11.983477 #3877846] INFO -- : $$$[end] "make after-update -j3" exit with 0. I, [2024-05-24T13:22:11.983611 #3877846] INFO -- : $$$[beg] make miniruby -j3 I, [2024-05-24T13:22:12.071621 #3877846] INFO -- : BASERUBY = /usr/local/bin/ruby --disable=gems I, [2024-05-24T13:22:12.071688 #3877846] INFO -- : CC = gcc I, [2024-05-24T13:22:12.071703 #3877846] INFO -- : LD = ld I, [2024-05-24T13:22:12.071713 #3877846] INFO -- : LDSHARED = gcc -shared I, [2024-05-24T13:22:12.071723 #3877846] INFO -- : CFLAGS = -O3 -fno-fast-math -ggdb3 -Wall -Wextra -Wdeprecated-declarations -Wdiv-by-zero -Wduplicated-cond -Wimplicit-function-declaration -Wimplicit-int -Wpointer-arith -Wwrite-strings -Wold-style-definition -Wimplicit-fallthrough=0 -Wmissing-noreturn -Wno-cast-function-type -Wno-constant-logical-operand -Wno-long-long -Wno-missing-field-initializers -Wno-overlength-strings -Wno-packed-bitfield-compat -Wno-parentheses-equality -Wno-self-assign -Wno-tautological-compare -Wno-unused-parameter -Wno-unused-value -Wsuggest-attribute=format -Wsuggest-attribute=noreturn -Wunused-variable -Wmisleading-indentation -Wundef I, [2024-05-24T13:22:12.071732 #3877846] INFO -- : XCFLAGS = -U_FORTIFY_SOURCE -D_FORTIFY_SOURCE=2 -fstack-protector-strong -msign-return-address=all -fno-strict-overflow -fvisibility=hidden -fexcess-precision=standard -DRUBY_EXPORT -fPIE -I. -I.ext/include/aarch64-linux -I/home/opc/ruby/src/master/include -I/home/opc/ruby/src/master -I/home/opc/ruby/src/master/prism -I/home/opc/ruby/src/master/enc/unicode/15.0.0 I, [2024-05-24T13:22:12.071741 #3877846] INFO -- : CPPFLAGS = I, [2024-05-24T13:22:12.071771 #3877846] INFO -- : DLDFLAGS = -Wl,--compress-debug-sections=zlib -fstack-protector-strong -pie I, [2024-05-24T13:22:12.071783 #3877846] INFO -- : SOLIBS = -lz -lrt -lrt -ldl -lcrypt -lm -lpthread I, [2024-05-24T13:22:12.071792 #3877846] INFO -- : LANG = en_US.UTF-8 I, [2024-05-24T13:22:12.071800 #3877846] INFO -- : LC_ALL = I, [2024-05-24T13:22:12.071808 #3877846] INFO -- : LC_CTYPE = I, [2024-05-24T13:22:12.071816 #3877846] INFO -- : MFLAGS = -j3 --jobserver-auth=4,5 I, [2024-05-24T13:22:12.071824 #3877846] INFO -- : RUSTC = rustc I, [2024-05-24T13:22:12.071832 #3877846] INFO -- : YJIT_RUSTC_ARGS = --crate-name=yjit --crate-type=staticlib --edition=2021 -g -C lto=thin -C opt-level=3 -C overflow-checks=on '--out-dir=/home/opc/ruby/build/master/yjit/target/release/' /home/opc/ruby/src/master/yjit/src/lib.rs I, [2024-05-24T13:22:12.072844 #3877846] INFO -- : gcc (GCC) 8.5.0 20210514 (Red Hat 8.5.0-10.1.0.1) I, [2024-05-24T13:22:12.072884 #3877846] INFO -- : Copyright (C) 2018 Free Software Foundation, Inc. I, [2024-05-24T13:22:12.072895 #3877846] INFO -- : This is free software; see the source for copying conditions. There is NO I, [2024-05-24T13:22:12.072905 #3877846] INFO -- : warranty; not even for MERCHANTABILITY or FITNESS FOR A PARTICULAR PURPOSE. I, [2024-05-24T13:22:12.072914 #3877846] INFO -- : I, [2024-05-24T13:22:12.097762 #3877846] INFO -- : compiling /home/opc/ruby/src/master/version.c I, [2024-05-24T13:22:12.239609 #3877846] INFO -- : linking miniruby I, [2024-05-24T13:22:13.125841 #3877846] INFO -- : $$$[end] "make miniruby -j3" exit with 0. I, [2024-05-24T13:22:13.126011 #3877846] INFO -- : $$$[beg] make ruby -j3 I, [2024-05-24T13:22:13.214801 #3877846] INFO -- : BASERUBY = /usr/local/bin/ruby --disable=gems I, [2024-05-24T13:22:13.214859 #3877846] INFO -- : CC = gcc I, [2024-05-24T13:22:13.214871 #3877846] INFO -- : LD = ld I, [2024-05-24T13:22:13.214880 #3877846] INFO -- : LDSHARED = gcc -shared I, [2024-05-24T13:22:13.214892 #3877846] INFO -- : CFLAGS = -O3 -fno-fast-math -ggdb3 -Wall -Wextra -Wdeprecated-declarations -Wdiv-by-zero -Wduplicated-cond -Wimplicit-function-declaration -Wimplicit-int -Wpointer-arith -Wwrite-strings -Wold-style-definition -Wimplicit-fallthrough=0 -Wmissing-noreturn -Wno-cast-function-type -Wno-constant-logical-operand -Wno-long-long -Wno-missing-field-initializers -Wno-overlength-strings -Wno-packed-bitfield-compat -Wno-parentheses-equality -Wno-self-assign -Wno-tautological-compare -Wno-unused-parameter -Wno-unused-value -Wsuggest-attribute=format -Wsuggest-attribute=noreturn -Wunused-variable -Wmisleading-indentation -Wundef I, [2024-05-24T13:22:13.214902 #3877846] INFO -- : XCFLAGS = -U_FORTIFY_SOURCE -D_FORTIFY_SOURCE=2 -fstack-protector-strong -msign-return-address=all -fno-strict-overflow -fvisibility=hidden -fexcess-precision=standard -DRUBY_EXPORT -fPIE -I. -I.ext/include/aarch64-linux -I/home/opc/ruby/src/master/include -I/home/opc/ruby/src/master -I/home/opc/ruby/src/master/prism -I/home/opc/ruby/src/master/enc/unicode/15.0.0 I, [2024-05-24T13:22:13.214911 #3877846] INFO -- : CPPFLAGS = I, [2024-05-24T13:22:13.214919 #3877846] INFO -- : DLDFLAGS = -Wl,--compress-debug-sections=zlib -fstack-protector-strong -pie I, [2024-05-24T13:22:13.214928 #3877846] INFO -- : SOLIBS = -lz -lrt -lrt -ldl -lcrypt -lm -lpthread I, [2024-05-24T13:22:13.214937 #3877846] INFO -- : LANG = en_US.UTF-8 I, [2024-05-24T13:22:13.214945 #3877846] INFO -- : LC_ALL = I, [2024-05-24T13:22:13.214953 #3877846] INFO -- : LC_CTYPE = I, [2024-05-24T13:22:13.214961 #3877846] INFO -- : MFLAGS = -j3 --jobserver-auth=4,5 I, [2024-05-24T13:22:13.214970 #3877846] INFO -- : RUSTC = rustc I, [2024-05-24T13:22:13.214978 #3877846] INFO -- : YJIT_RUSTC_ARGS = --crate-name=yjit --crate-type=staticlib --edition=2021 -g -C lto=thin -C opt-level=3 -C overflow-checks=on '--out-dir=/home/opc/ruby/build/master/yjit/target/release/' /home/opc/ruby/src/master/yjit/src/lib.rs I, [2024-05-24T13:22:13.215747 #3877846] INFO -- : gcc (GCC) 8.5.0 20210514 (Red Hat 8.5.0-10.1.0.1) I, [2024-05-24T13:22:13.215779 #3877846] INFO -- : Copyright (C) 2018 Free Software Foundation, Inc. I, [2024-05-24T13:22:13.215793 #3877846] INFO -- : This is free software; see the source for copying conditions. There is NO I, [2024-05-24T13:22:13.215803 #3877846] INFO -- : warranty; not even for MERCHANTABILITY or FITNESS FOR A PARTICULAR PURPOSE. I, [2024-05-24T13:22:13.215812 #3877846] INFO -- : I, [2024-05-24T13:22:13.397175 #3877846] INFO -- : builtin_binary.inc updated I, [2024-05-24T13:22:13.401140 #3877846] INFO -- : c86294a81d0df6836359a6b5498b71b1ddba3062aa6ec87c7b2896368a948a19 builtin_binary.inc I, [2024-05-24T13:22:13.402096 #3877846] INFO -- : compiling /home/opc/ruby/src/master/builtin.c I, [2024-05-24T13:22:13.726030 #3877846] INFO -- : linking static-library libruby-static.a I, [2024-05-24T13:22:16.575013 #3877846] INFO -- : linking ruby I, [2024-05-24T13:22:17.491478 #3877846] INFO -- : $$$[end] "make ruby -j3" exit with 0. I, [2024-05-24T13:22:17.491658 #3877846] INFO -- : $$$[beg] make all -j3 I, [2024-05-24T13:22:17.580277 #3877846] INFO -- : BASERUBY = /usr/local/bin/ruby --disable=gems I, [2024-05-24T13:22:17.580338 #3877846] INFO -- : CC = gcc I, [2024-05-24T13:22:17.580350 #3877846] INFO -- : LD = ld I, [2024-05-24T13:22:17.580359 #3877846] INFO -- : LDSHARED = gcc -shared I, [2024-05-24T13:22:17.580370 #3877846] INFO -- : CFLAGS = -O3 -fno-fast-math -ggdb3 -Wall -Wextra -Wdeprecated-declarations -Wdiv-by-zero -Wduplicated-cond -Wimplicit-function-declaration -Wimplicit-int -Wpointer-arith -Wwrite-strings -Wold-style-definition -Wimplicit-fallthrough=0 -Wmissing-noreturn -Wno-cast-function-type -Wno-constant-logical-operand -Wno-long-long -Wno-missing-field-initializers -Wno-overlength-strings -Wno-packed-bitfield-compat -Wno-parentheses-equality -Wno-self-assign -Wno-tautological-compare -Wno-unused-parameter -Wno-unused-value -Wsuggest-attribute=format -Wsuggest-attribute=noreturn -Wunused-variable -Wmisleading-indentation -Wundef I, [2024-05-24T13:22:17.580380 #3877846] INFO -- : XCFLAGS = -U_FORTIFY_SOURCE -D_FORTIFY_SOURCE=2 -fstack-protector-strong -msign-return-address=all -fno-strict-overflow -fvisibility=hidden -fexcess-precision=standard -DRUBY_EXPORT -fPIE -I. -I.ext/include/aarch64-linux -I/home/opc/ruby/src/master/include -I/home/opc/ruby/src/master -I/home/opc/ruby/src/master/prism -I/home/opc/ruby/src/master/enc/unicode/15.0.0 I, [2024-05-24T13:22:17.580389 #3877846] INFO -- : CPPFLAGS = I, [2024-05-24T13:22:17.580397 #3877846] INFO -- : DLDFLAGS = -Wl,--compress-debug-sections=zlib -fstack-protector-strong -pie I, [2024-05-24T13:22:17.580407 #3877846] INFO -- : SOLIBS = -lz -lrt -lrt -ldl -lcrypt -lm -lpthread I, [2024-05-24T13:22:17.580415 #3877846] INFO -- : LANG = en_US.UTF-8 I, [2024-05-24T13:22:17.580423 #3877846] INFO -- : LC_ALL = I, [2024-05-24T13:22:17.580431 #3877846] INFO -- : LC_CTYPE = I, [2024-05-24T13:22:17.580440 #3877846] INFO -- : MFLAGS = -j3 --jobserver-auth=4,5 I, [2024-05-24T13:22:17.580448 #3877846] INFO -- : RUSTC = rustc I, [2024-05-24T13:22:17.580457 #3877846] INFO -- : YJIT_RUSTC_ARGS = --crate-name=yjit --crate-type=staticlib --edition=2021 -g -C lto=thin -C opt-level=3 -C overflow-checks=on '--out-dir=/home/opc/ruby/build/master/yjit/target/release/' /home/opc/ruby/src/master/yjit/src/lib.rs I, [2024-05-24T13:22:17.581262 #3877846] INFO -- : gcc (GCC) 8.5.0 20210514 (Red Hat 8.5.0-10.1.0.1) I, [2024-05-24T13:22:17.581302 #3877846] INFO -- : Copyright (C) 2018 Free Software Foundation, Inc. I, [2024-05-24T13:22:17.581315 #3877846] INFO -- : This is free software; see the source for copying conditions. There is NO I, [2024-05-24T13:22:17.581325 #3877846] INFO -- : warranty; not even for MERCHANTABILITY or FITNESS FOR A PARTICULAR PURPOSE. I, [2024-05-24T13:22:17.581334 #3877846] INFO -- : I, [2024-05-24T13:22:17.614183 #3877846] INFO -- : generating encdb.h I, [2024-05-24T13:22:17.615533 #3877846] INFO -- : generating enc.mk I, [2024-05-24T13:22:17.651975 #3877846] INFO -- : encdb.h unchanged I, [2024-05-24T13:22:17.853583 #3877846] INFO -- : making srcs under enc I, [2024-05-24T13:22:17.853650 #3877846] INFO -- : making enc I, [2024-05-24T13:22:17.880953 #3877846] INFO -- : make[1]: Entering directory '/home/opc/ruby/build/master' I, [2024-05-24T13:22:17.881055 #3877846] INFO -- : make[1]: Nothing to be done for 'enc'. I, [2024-05-24T13:22:17.881067 #3877846] INFO -- : make[1]: Leaving directory '/home/opc/ruby/build/master' I, [2024-05-24T13:22:17.895717 #3877846] INFO -- : make[1]: Entering directory '/home/opc/ruby/build/master' I, [2024-05-24T13:22:17.895783 #3877846] INFO -- : make[1]: Nothing to be done for 'srcs'. I, [2024-05-24T13:22:17.895804 #3877846] INFO -- : make[1]: Leaving directory '/home/opc/ruby/build/master' I, [2024-05-24T13:22:17.896796 #3877846] INFO -- : generating transdb.h I, [2024-05-24T13:22:18.043563 #3877846] INFO -- : transdb.h unchanged I, [2024-05-24T13:22:18.044883 #3877846] INFO -- : generating makefiles ext/configure-ext.mk I, [2024-05-24T13:22:18.045142 #3877846] INFO -- : making trans I, [2024-05-24T13:22:18.085679 #3877846] INFO -- : ext/configure-ext.mk updated I, [2024-05-24T13:22:18.088898 #3877846] INFO -- : make[1]: Entering directory '/home/opc/ruby/build/master' I, [2024-05-24T13:22:18.093500 #3877846] INFO -- : make[1]: Entering directory '/home/opc/ruby/build/master' I, [2024-05-24T13:22:18.093547 #3877846] INFO -- : make[1]: Nothing to be done for 'trans'. I, [2024-05-24T13:22:18.093560 #3877846] INFO -- : make[1]: Leaving directory '/home/opc/ruby/build/master' I, [2024-05-24T13:22:18.214779 #3877846] INFO -- : making encs I, [2024-05-24T13:22:18.267119 #3877846] INFO -- : make[1]: Entering directory '/home/opc/ruby/build/master' I, [2024-05-24T13:22:18.267190 #3877846] INFO -- : make[1]: Nothing to be done for 'encs'. I, [2024-05-24T13:22:18.267201 #3877846] INFO -- : make[1]: Leaving directory '/home/opc/ruby/build/master' I, [2024-05-24T13:22:18.877508 #3877846] INFO -- : make[1]: Leaving directory '/home/opc/ruby/build/master' I, [2024-05-24T13:22:18.878322 #3877846] INFO -- : generating makefile exts.mk I, [2024-05-24T13:22:18.937594 #3877846] INFO -- : exts.mk unchanged I, [2024-05-24T13:22:18.942519 #3877846] INFO -- : make[1]: Entering directory '/home/opc/ruby/build/master' I, [2024-05-24T13:22:19.046249 #3877846] INFO -- : make[2]: Entering directory '/home/opc/ruby/build/master/ext/coverage' I, [2024-05-24T13:22:19.048183 #3877846] INFO -- : make[2]: Entering directory '/home/opc/ruby/build/master/ext/digest' I, [2024-05-24T13:22:19.049850 #3877846] INFO -- : make[2]: Entering directory '/home/opc/ruby/build/master/ext/date' I, [2024-05-24T13:22:19.051119 #3877846] INFO -- : make[2]: Leaving directory '/home/opc/ruby/build/master/ext/coverage' I, [2024-05-24T13:22:19.057375 #3877846] INFO -- : make[2]: Leaving directory '/home/opc/ruby/build/master/ext/date' I, [2024-05-24T13:22:19.059876 #3877846] INFO -- : make[2]: Leaving directory '/home/opc/ruby/build/master/ext/digest' I, [2024-05-24T13:22:19.064479 #3877846] INFO -- : make[2]: Entering directory '/home/opc/ruby/build/master/ext/io/console' I, [2024-05-24T13:22:19.067173 #3877846] INFO -- : make[2]: Entering directory '/home/opc/ruby/build/master/ext/fiddle' I, [2024-05-24T13:22:19.069517 #3877846] INFO -- : make[2]: Leaving directory '/home/opc/ruby/build/master/ext/io/console' I, [2024-05-24T13:22:19.071586 #3877846] INFO -- : make[2]: Entering directory '/home/opc/ruby/build/master/ext/json' I, [2024-05-24T13:22:19.076296 #3877846] INFO -- : make[2]: Entering directory '/home/opc/ruby/build/master/ext/monitor' I, [2024-05-24T13:22:19.077540 #3877846] INFO -- : make[2]: Leaving directory '/home/opc/ruby/build/master/ext/fiddle' I, [2024-05-24T13:22:19.080298 #3877846] INFO -- : make[2]: Leaving directory '/home/opc/ruby/build/master/ext/monitor' I, [2024-05-24T13:22:19.081313 #3877846] INFO -- : make[2]: Leaving directory '/home/opc/ruby/build/master/ext/json' I, [2024-05-24T13:22:19.083974 #3877846] INFO -- : make[2]: Entering directory '/home/opc/ruby/build/master/ext/objspace' I, [2024-05-24T13:22:19.086656 #3877846] INFO -- : make[2]: Entering directory '/home/opc/ruby/build/master/ext/pathname' I, [2024-05-24T13:22:19.089843 #3877846] INFO -- : make[2]: Leaving directory '/home/opc/ruby/build/master/ext/objspace' I, [2024-05-24T13:22:19.091860 #3877846] INFO -- : make[2]: Leaving directory '/home/opc/ruby/build/master/ext/pathname' I, [2024-05-24T13:22:19.096148 #3877846] INFO -- : make[2]: Entering directory '/home/opc/ruby/build/master/ext/psych' I, [2024-05-24T13:22:19.096198 #3877846] INFO -- : make[2]: Entering directory '/home/opc/ruby/build/master/ext/pty' I, [2024-05-24T13:22:19.099600 #3877846] INFO -- : make[2]: Entering directory '/home/opc/ruby/build/master/ext/openssl' I, [2024-05-24T13:22:19.100506 #3877846] INFO -- : make[2]: Leaving directory '/home/opc/ruby/build/master/ext/pty' I, [2024-05-24T13:22:19.115778 #3877846] INFO -- : make[2]: Entering directory '/home/opc/ruby/build/master/ext/ripper' I, [2024-05-24T13:22:19.116040 #3877846] INFO -- : make[2]: Leaving directory '/home/opc/ruby/build/master/ext/psych' I, [2024-05-24T13:22:19.118379 #3877846] INFO -- : make[2]: Entering directory '/home/opc/ruby/build/master/ext/rubyvm' I, [2024-05-24T13:22:19.122300 #3877846] INFO -- : make[2]: Leaving directory '/home/opc/ruby/build/master/ext/rubyvm' I, [2024-05-24T13:22:19.122478 #3877846] INFO -- : make[2]: Leaving directory '/home/opc/ruby/build/master/ext/openssl' I, [2024-05-24T13:22:19.125199 #3877846] INFO -- : make[2]: Leaving directory '/home/opc/ruby/build/master/ext/ripper' I, [2024-05-24T13:22:19.132163 #3877846] INFO -- : make[2]: Entering directory '/home/opc/ruby/build/master/.bundle/gems/bigdecimal-3.1.7/ext/bigdecimal' I, [2024-05-24T13:22:19.133934 #3877846] INFO -- : make[2]: Entering directory '/home/opc/ruby/build/master/.bundle/gems/bigdecimal-3.1.8/ext/bigdecimal' I, [2024-05-24T13:22:19.134775 #3877846] INFO -- : make[2]: Entering directory '/home/opc/ruby/build/master/ext/socket' I, [2024-05-24T13:22:19.145898 #3877846] INFO -- : make[2]: Leaving directory '/home/opc/ruby/build/master/ext/socket' I, [2024-05-24T13:22:19.148550 #3877846] INFO -- : make[2]: Entering directory '/home/opc/ruby/build/master/.bundle/gems/debug-1.9.2/ext/debug' I, [2024-05-24T13:22:19.164658 #3877846] INFO -- : make[2]: Leaving directory '/home/opc/ruby/build/master/.bundle/gems/bigdecimal-3.1.7/ext/bigdecimal' I, [2024-05-24T13:22:19.165738 #3877846] INFO -- : make[2]: Leaving directory '/home/opc/ruby/build/master/.bundle/gems/bigdecimal-3.1.8/ext/bigdecimal' I, [2024-05-24T13:22:19.167307 #3877846] INFO -- : make[2]: Entering directory '/home/opc/ruby/build/master/.bundle/gems/nkf-0.2.0/ext/nkf' I, [2024-05-24T13:22:19.168165 #3877846] INFO -- : make[2]: Entering directory '/home/opc/ruby/build/master/.bundle/gems/racc-1.7.3/ext/racc/cparse' I, [2024-05-24T13:22:19.180268 #3877846] INFO -- : make[2]: Leaving directory '/home/opc/ruby/build/master/.bundle/gems/debug-1.9.2/ext/debug' I, [2024-05-24T13:22:19.184855 #3877846] INFO -- : make[2]: Entering directory '/home/opc/ruby/build/master/.bundle/gems/racc-1.8.0/ext/racc/cparse' I, [2024-05-24T13:22:19.198406 #3877846] INFO -- : make[2]: Leaving directory '/home/opc/ruby/build/master/.bundle/gems/racc-1.7.3/ext/racc/cparse' I, [2024-05-24T13:22:19.201492 #3877846] INFO -- : make[2]: Entering directory '/home/opc/ruby/build/master/.bundle/gems/rbs-3.4.4/ext/rbs_extension' I, [2024-05-24T13:22:19.202028 #3877846] INFO -- : make[2]: Leaving directory '/home/opc/ruby/build/master/.bundle/gems/nkf-0.2.0/ext/nkf' I, [2024-05-24T13:22:19.209948 #3877846] INFO -- : make[2]: Entering directory '/home/opc/ruby/build/master/.bundle/gems/syslog-0.1.2/ext/syslog' I, [2024-05-24T13:22:19.216945 #3877846] INFO -- : make[2]: Leaving directory '/home/opc/ruby/build/master/.bundle/gems/racc-1.8.0/ext/racc/cparse' I, [2024-05-24T13:22:19.232613 #3877846] INFO -- : make[2]: Leaving directory '/home/opc/ruby/build/master/.bundle/gems/rbs-3.4.4/ext/rbs_extension' I, [2024-05-24T13:22:19.240243 #3877846] INFO -- : make[2]: Entering directory '/home/opc/ruby/build/master/ext/digest/sha2' I, [2024-05-24T13:22:19.243418 #3877846] INFO -- : make[2]: Leaving directory '/home/opc/ruby/build/master/.bundle/gems/syslog-0.1.2/ext/syslog' I, [2024-05-24T13:22:19.246378 #3877846] INFO -- : make[2]: Leaving directory '/home/opc/ruby/build/master/ext/digest/sha2' I, [2024-05-24T13:22:19.284411 #3877846] INFO -- : make[2]: Entering directory '/home/opc/ruby/build/master' I, [2024-05-24T13:22:19.368024 #3877846] INFO -- : make[2]: 'ruby' is up to date. I, [2024-05-24T13:22:19.368113 #3877846] INFO -- : make[2]: Leaving directory '/home/opc/ruby/build/master' I, [2024-05-24T13:22:19.368238 #3877846] INFO -- : make[1]: Leaving directory '/home/opc/ruby/build/master' I, [2024-05-24T13:22:19.372665 #3877846] INFO -- : make[1]: Entering directory '/home/opc/ruby/build/master' I, [2024-05-24T13:22:19.372695 #3877846] INFO -- : make[1]: Nothing to be done for 'note'. I, [2024-05-24T13:22:19.372706 #3877846] INFO -- : make[1]: Leaving directory '/home/opc/ruby/build/master' I, [2024-05-24T13:22:19.373033 #3877846] INFO -- : $$$[end] "make all -j3" exit with 0. I, [2024-05-24T13:22:19.373334 #3877846] INFO -- : $$$[beg] make install -j3 I, [2024-05-24T13:22:19.467651 #3877846] INFO -- : Update power_assert to 84e85124c5014a139af39161d484156cfe87a9ed I, [2024-05-24T13:22:19.467770 #3877846] INFO -- : Update rbs to ba7872795d5de04adb8ff500c0e6afdc81a041dd I, [2024-05-24T13:22:19.468560 #3877846] INFO -- : Update typeprof to b19a6416da3a05d57fadd6ffdadb382b6d236ca5 I, [2024-05-24T13:22:19.472254 #3877846] INFO -- : echo b19a6416da3a05d57fadd6ffdadb382b6d236ca5 | /bin/sh /home/opc/ruby/src/master/tool/ifchange /home/opc/ruby/src/master/.bundle/.timestamp/typeprof.revision - I, [2024-05-24T13:22:19.472655 #3877846] INFO -- : echo 84e85124c5014a139af39161d484156cfe87a9ed | /bin/sh /home/opc/ruby/src/master/tool/ifchange /home/opc/ruby/src/master/.bundle/.timestamp/power_assert.revision - I, [2024-05-24T13:22:19.472869 #3877846] INFO -- : echo ba7872795d5de04adb8ff500c0e6afdc81a041dd | /bin/sh /home/opc/ruby/src/master/tool/ifchange /home/opc/ruby/src/master/.bundle/.timestamp/rbs.revision - I, [2024-05-24T13:22:19.478600 #3877846] INFO -- : /home/opc/ruby/src/master/.bundle/.timestamp/typeprof.revision unchanged I, [2024-05-24T13:22:19.478884 #3877846] INFO -- : /home/opc/ruby/src/master/.bundle/.timestamp/rbs.revision unchanged I, [2024-05-24T13:22:19.479227 #3877846] INFO -- : /home/opc/ruby/src/master/.bundle/.timestamp/power_assert.revision unchanged I, [2024-05-24T13:22:19.482307 #3877846] INFO -- : BASERUBY = /usr/local/bin/ruby --disable=gems I, [2024-05-24T13:22:19.482350 #3877846] INFO -- : CC = gcc I, [2024-05-24T13:22:19.482360 #3877846] INFO -- : LD = ld I, [2024-05-24T13:22:19.482370 #3877846] INFO -- : LDSHARED = gcc -shared I, [2024-05-24T13:22:19.482382 #3877846] INFO -- : CFLAGS = -O3 -fno-fast-math -ggdb3 -Wall -Wextra -Wdeprecated-declarations -Wdiv-by-zero -Wduplicated-cond -Wimplicit-function-declaration -Wimplicit-int -Wpointer-arith -Wwrite-strings -Wold-style-definition -Wimplicit-fallthrough=0 -Wmissing-noreturn -Wno-cast-function-type -Wno-constant-logical-operand -Wno-long-long -Wno-missing-field-initializers -Wno-overlength-strings -Wno-packed-bitfield-compat -Wno-parentheses-equality -Wno-self-assign -Wno-tautological-compare -Wno-unused-parameter -Wno-unused-value -Wsuggest-attribute=format -Wsuggest-attribute=noreturn -Wunused-variable -Wmisleading-indentation -Wundef I, [2024-05-24T13:22:19.482392 #3877846] INFO -- : XCFLAGS = -U_FORTIFY_SOURCE -D_FORTIFY_SOURCE=2 -fstack-protector-strong -msign-return-address=all -fno-strict-overflow -fvisibility=hidden -fexcess-precision=standard -DRUBY_EXPORT -fPIE -I. -I.ext/include/aarch64-linux -I/home/opc/ruby/src/master/include -I/home/opc/ruby/src/master -I/home/opc/ruby/src/master/prism -I/home/opc/ruby/src/master/enc/unicode/15.0.0 I, [2024-05-24T13:22:19.482401 #3877846] INFO -- : CPPFLAGS = I, [2024-05-24T13:22:19.482410 #3877846] INFO -- : DLDFLAGS = -Wl,--compress-debug-sections=zlib -fstack-protector-strong -pie I, [2024-05-24T13:22:19.482421 #3877846] INFO -- : SOLIBS = -lz -lrt -lrt -ldl -lcrypt -lm -lpthread I, [2024-05-24T13:22:19.482430 #3877846] INFO -- : LANG = en_US.UTF-8 I, [2024-05-24T13:22:19.482439 #3877846] INFO -- : LC_ALL = I, [2024-05-24T13:22:19.482447 #3877846] INFO -- : LC_CTYPE = I, [2024-05-24T13:22:19.482455 #3877846] INFO -- : MFLAGS = -j3 --jobserver-auth=4,5 I, [2024-05-24T13:22:19.482463 #3877846] INFO -- : RUSTC = rustc I, [2024-05-24T13:22:19.482472 #3877846] INFO -- : YJIT_RUSTC_ARGS = --crate-name=yjit --crate-type=staticlib --edition=2021 -g -C lto=thin -C opt-level=3 -C overflow-checks=on '--out-dir=/home/opc/ruby/build/master/yjit/target/release/' /home/opc/ruby/src/master/yjit/src/lib.rs I, [2024-05-24T13:22:19.514027 #3877846] INFO -- : generating encdb.h I, [2024-05-24T13:22:19.514088 #3877846] INFO -- : gcc (GCC) 8.5.0 20210514 (Red Hat 8.5.0-10.1.0.1) I, [2024-05-24T13:22:19.514099 #3877846] INFO -- : Copyright (C) 2018 Free Software Foundation, Inc. I, [2024-05-24T13:22:19.514109 #3877846] INFO -- : This is free software; see the source for copying conditions. There is NO I, [2024-05-24T13:22:19.514118 #3877846] INFO -- : warranty; not even for MERCHANTABILITY or FITNESS FOR A PARTICULAR PURPOSE. I, [2024-05-24T13:22:19.514127 #3877846] INFO -- : I, [2024-05-24T13:22:19.514926 #3877846] INFO -- : generating enc.mk I, [2024-05-24T13:22:19.551318 #3877846] INFO -- : encdb.h unchanged I, [2024-05-24T13:22:19.642629 #3877846] INFO -- : Building power_assert@84e85124c5014a139af39161d484156cfe87a9ed to /home/opc/ruby/src/master/gems/power_assert-2.0.3.gem I, [2024-05-24T13:22:19.753726 #3877846] INFO -- : making srcs under enc I, [2024-05-24T13:22:19.754171 #3877846] INFO -- : making enc I, [2024-05-24T13:22:19.762815 #3877846] INFO -- : Successfully built RubyGem I, [2024-05-24T13:22:19.762862 #3877846] INFO -- : Name: power_assert I, [2024-05-24T13:22:19.762873 #3877846] INFO -- : Version: 2.0.4dev I, [2024-05-24T13:22:19.762882 #3877846] INFO -- : File: power_assert-2.0.4dev.gem I, [2024-05-24T13:22:19.765349 #3877846] INFO -- : Extracting bundle gem power_assert-2.0.3... I, [2024-05-24T13:22:19.782014 #3877846] INFO -- : make[1]: Entering directory '/home/opc/ruby/build/master' I, [2024-05-24T13:22:19.782093 #3877846] INFO -- : make[1]: Nothing to be done for 'enc'. I, [2024-05-24T13:22:19.782126 #3877846] INFO -- : make[1]: Leaving directory '/home/opc/ruby/build/master' I, [2024-05-24T13:22:19.796264 #3877846] INFO -- : make[1]: Entering directory '/home/opc/ruby/build/master' I, [2024-05-24T13:22:19.796316 #3877846] INFO -- : make[1]: Nothing to be done for 'srcs'. I, [2024-05-24T13:22:19.796327 #3877846] INFO -- : make[1]: Leaving directory '/home/opc/ruby/build/master' I, [2024-05-24T13:22:19.797987 #3877846] INFO -- : generating transdb.h I, [2024-05-24T13:22:19.862842 #3877846] INFO -- : Try with hash version of bundled gems instead of gems/power_assert-2.0.3.gem. We don't use this gem with release version of Ruby. I, [2024-05-24T13:22:19.872988 #3877846] INFO -- : Unpacked gems/power_assert-2.0.4dev.gem I, [2024-05-24T13:22:19.942310 #3877846] INFO -- : transdb.h unchanged I, [2024-05-24T13:22:19.943623 #3877846] INFO -- : generating makefiles ext/configure-ext.mk I, [2024-05-24T13:22:19.943878 #3877846] INFO -- : making trans I, [2024-05-24T13:22:19.983440 #3877846] INFO -- : ext/configure-ext.mk unchanged I, [2024-05-24T13:22:19.986623 #3877846] INFO -- : make[1]: Entering directory '/home/opc/ruby/build/master' I, [2024-05-24T13:22:19.992377 #3877846] INFO -- : make[1]: Entering directory '/home/opc/ruby/build/master' I, [2024-05-24T13:22:19.992432 #3877846] INFO -- : make[1]: Nothing to be done for 'trans'. I, [2024-05-24T13:22:19.992445 #3877846] INFO -- : make[1]: Leaving directory '/home/opc/ruby/build/master' I, [2024-05-24T13:22:19.993250 #3877846] INFO -- : making encs I, [2024-05-24T13:22:20.045691 #3877846] INFO -- : make[1]: Entering directory '/home/opc/ruby/build/master' I, [2024-05-24T13:22:20.045766 #3877846] INFO -- : make[1]: Nothing to be done for 'encs'. I, [2024-05-24T13:22:20.045777 #3877846] INFO -- : make[1]: Leaving directory '/home/opc/ruby/build/master' I, [2024-05-24T13:22:20.764922 #3877846] INFO -- : make[1]: Leaving directory '/home/opc/ruby/build/master' I, [2024-05-24T13:22:20.765976 #3877846] INFO -- : generating makefile exts.mk I, [2024-05-24T13:22:20.825051 #3877846] INFO -- : exts.mk unchanged I, [2024-05-24T13:22:20.829967 #3877846] INFO -- : make[1]: Entering directory '/home/opc/ruby/build/master' I, [2024-05-24T13:22:20.937689 #3877846] INFO -- : make[2]: Entering directory '/home/opc/ruby/build/master/ext/digest' I, [2024-05-24T13:22:20.938870 #3877846] INFO -- : make[2]: Entering directory '/home/opc/ruby/build/master/ext/coverage' I, [2024-05-24T13:22:20.940119 #3877846] INFO -- : make[2]: Entering directory '/home/opc/ruby/build/master/ext/date' I, [2024-05-24T13:22:20.943370 #3877846] INFO -- : make[2]: Leaving directory '/home/opc/ruby/build/master/ext/coverage' I, [2024-05-24T13:22:20.945476 #3877846] INFO -- : make[2]: Leaving directory '/home/opc/ruby/build/master/ext/date' I, [2024-05-24T13:22:20.947284 #3877846] INFO -- : make[2]: Leaving directory '/home/opc/ruby/build/master/ext/digest' I, [2024-05-24T13:22:20.954188 #3877846] INFO -- : make[2]: Entering directory '/home/opc/ruby/build/master/ext/io/console' I, [2024-05-24T13:22:20.954874 #3877846] INFO -- : make[2]: Entering directory '/home/opc/ruby/build/master/ext/fiddle' I, [2024-05-24T13:22:20.958552 #3877846] INFO -- : make[2]: Leaving directory '/home/opc/ruby/build/master/ext/io/console' I, [2024-05-24T13:22:20.960605 #3877846] INFO -- : make[2]: Entering directory '/home/opc/ruby/build/master/ext/json' I, [2024-05-24T13:22:20.963457 #3877846] INFO -- : make[2]: Leaving directory '/home/opc/ruby/build/master/ext/fiddle' I, [2024-05-24T13:22:20.965021 #3877846] INFO -- : make[2]: Entering directory '/home/opc/ruby/build/master/ext/monitor' I, [2024-05-24T13:22:20.968781 #3877846] INFO -- : make[2]: Leaving directory '/home/opc/ruby/build/master/ext/monitor' I, [2024-05-24T13:22:20.969605 #3877846] INFO -- : make[2]: Entering directory '/home/opc/ruby/build/master/ext/objspace' I, [2024-05-24T13:22:20.971018 #3877846] INFO -- : make[2]: Leaving directory '/home/opc/ruby/build/master/ext/json' I, [2024-05-24T13:22:20.975176 #3877846] INFO -- : make[2]: Entering directory '/home/opc/ruby/build/master/ext/pathname' I, [2024-05-24T13:22:20.976546 #3877846] INFO -- : make[2]: Leaving directory '/home/opc/ruby/build/master/ext/objspace' I, [2024-05-24T13:22:20.979164 #3877846] INFO -- : make[2]: Leaving directory '/home/opc/ruby/build/master/ext/pathname' I, [2024-05-24T13:22:20.983052 #3877846] INFO -- : make[2]: Entering directory '/home/opc/ruby/build/master/ext/psych' I, [2024-05-24T13:22:20.983525 #3877846] INFO -- : make[2]: Entering directory '/home/opc/ruby/build/master/ext/pty' I, [2024-05-24T13:22:20.988860 #3877846] INFO -- : make[2]: Leaving directory '/home/opc/ruby/build/master/ext/pty' I, [2024-05-24T13:22:20.989035 #3877846] INFO -- : make[2]: Entering directory '/home/opc/ruby/build/master/ext/openssl' I, [2024-05-24T13:22:21.002101 #3877846] INFO -- : make[2]: Leaving directory '/home/opc/ruby/build/master/ext/psych' I, [2024-05-24T13:22:21.004023 #3877846] INFO -- : make[2]: Entering directory '/home/opc/ruby/build/master/ext/rubyvm' I, [2024-05-24T13:22:21.004576 #3877846] INFO -- : make[2]: Entering directory '/home/opc/ruby/build/master/ext/ripper' I, [2024-05-24T13:22:21.008845 #3877846] INFO -- : make[2]: Leaving directory '/home/opc/ruby/build/master/ext/rubyvm' I, [2024-05-24T13:22:21.010617 #3877846] INFO -- : make[2]: Leaving directory '/home/opc/ruby/build/master/ext/openssl' I, [2024-05-24T13:22:21.012373 #3877846] INFO -- : make[2]: Leaving directory '/home/opc/ruby/build/master/ext/ripper' I, [2024-05-24T13:22:21.019289 #3877846] INFO -- : make[2]: Entering directory '/home/opc/ruby/build/master/.bundle/gems/bigdecimal-3.1.7/ext/bigdecimal' I, [2024-05-24T13:22:21.021342 #3877846] INFO -- : make[2]: Entering directory '/home/opc/ruby/build/master/ext/socket' I, [2024-05-24T13:22:21.022058 #3877846] INFO -- : make[2]: Entering directory '/home/opc/ruby/build/master/.bundle/gems/bigdecimal-3.1.8/ext/bigdecimal' I, [2024-05-24T13:22:21.032132 #3877846] INFO -- : make[2]: Leaving directory '/home/opc/ruby/build/master/ext/socket' I, [2024-05-24T13:22:21.034678 #3877846] INFO -- : make[2]: Entering directory '/home/opc/ruby/build/master/.bundle/gems/debug-1.9.2/ext/debug' I, [2024-05-24T13:22:21.052150 #3877846] INFO -- : make[2]: Leaving directory '/home/opc/ruby/build/master/.bundle/gems/bigdecimal-3.1.7/ext/bigdecimal' I, [2024-05-24T13:22:21.052587 #3877846] INFO -- : make[2]: Leaving directory '/home/opc/ruby/build/master/.bundle/gems/bigdecimal-3.1.8/ext/bigdecimal' I, [2024-05-24T13:22:21.055105 #3877846] INFO -- : make[2]: Entering directory '/home/opc/ruby/build/master/.bundle/gems/nkf-0.2.0/ext/nkf' I, [2024-05-24T13:22:21.058132 #3877846] INFO -- : make[2]: Entering directory '/home/opc/ruby/build/master/.bundle/gems/racc-1.7.3/ext/racc/cparse' I, [2024-05-24T13:22:21.065803 #3877846] INFO -- : make[2]: Leaving directory '/home/opc/ruby/build/master/.bundle/gems/debug-1.9.2/ext/debug' I, [2024-05-24T13:22:21.068566 #3877846] INFO -- : make[2]: Entering directory '/home/opc/ruby/build/master/.bundle/gems/racc-1.8.0/ext/racc/cparse' I, [2024-05-24T13:22:21.085823 #3877846] INFO -- : make[2]: Leaving directory '/home/opc/ruby/build/master/.bundle/gems/nkf-0.2.0/ext/nkf' I, [2024-05-24T13:22:21.088797 #3877846] INFO -- : make[2]: Entering directory '/home/opc/ruby/build/master/.bundle/gems/rbs-3.4.4/ext/rbs_extension' I, [2024-05-24T13:22:21.092161 #3877846] INFO -- : make[2]: Leaving directory '/home/opc/ruby/build/master/.bundle/gems/racc-1.7.3/ext/racc/cparse' I, [2024-05-24T13:22:21.095008 #3877846] INFO -- : make[2]: Entering directory '/home/opc/ruby/build/master/.bundle/gems/syslog-0.1.2/ext/syslog' I, [2024-05-24T13:22:21.099992 #3877846] INFO -- : make[2]: Leaving directory '/home/opc/ruby/build/master/.bundle/gems/racc-1.8.0/ext/racc/cparse' I, [2024-05-24T13:22:21.119876 #3877846] INFO -- : make[2]: Leaving directory '/home/opc/ruby/build/master/.bundle/gems/rbs-3.4.4/ext/rbs_extension' I, [2024-05-24T13:22:21.124340 #3877846] INFO -- : make[2]: Entering directory '/home/opc/ruby/build/master/ext/digest/sha2' I, [2024-05-24T13:22:21.126330 #3877846] INFO -- : make[2]: Leaving directory '/home/opc/ruby/build/master/.bundle/gems/syslog-0.1.2/ext/syslog' I, [2024-05-24T13:22:21.129478 #3877846] INFO -- : make[2]: Leaving directory '/home/opc/ruby/build/master/ext/digest/sha2' I, [2024-05-24T13:22:21.169237 #3877846] INFO -- : make[2]: Entering directory '/home/opc/ruby/build/master' I, [2024-05-24T13:22:21.251902 #3877846] INFO -- : make[2]: 'ruby' is up to date. I, [2024-05-24T13:22:21.251988 #3877846] INFO -- : make[2]: Leaving directory '/home/opc/ruby/build/master' I, [2024-05-24T13:22:21.252138 #3877846] INFO -- : make[1]: Leaving directory '/home/opc/ruby/build/master' I, [2024-05-24T13:22:21.256733 #3877846] INFO -- : make[1]: Entering directory '/home/opc/ruby/build/master' I, [2024-05-24T13:22:21.256771 #3877846] INFO -- : make[1]: Nothing to be done for 'note'. I, [2024-05-24T13:22:21.256782 #3877846] INFO -- : make[1]: Leaving directory '/home/opc/ruby/build/master' I, [2024-05-24T13:22:21.256935 #3877846] INFO -- : ./miniruby -I/home/opc/ruby/src/master/lib -I. -I.ext/common /home/opc/ruby/src/master/tool/runruby.rb --extout=.ext -- --disable-gems -r./aarch64-linux-fake /home/opc/ruby/src/master/tool/rbinstall.rb --make="make" --dest-dir="" --extout=".ext" --ext-build-dir="./ext" --mflags="-j3 --jobserver-auth=4,5" --make-flags=" -j3 --jobserver-auth=4,5" --data-mode=0644 --prog-mode=0755 --installed-list .installed.list --mantype="doc" --gnumake --install=all --exclude=doc I, [2024-05-24T13:22:21.408993 #3877846] INFO -- : Installing to I, [2024-05-24T13:22:21.409070 #3877846] INFO -- : installing binary commands: /home/opc/ruby/install/master/bin I, [2024-05-24T13:22:21.421183 #3877846] INFO -- : installing base libraries: /home/opc/ruby/install/master/lib I, [2024-05-24T13:22:21.421690 #3877846] INFO -- : installing arch files: /home/opc/ruby/install/master/lib/ruby/3.4.0+0/aarch64-linux I, [2024-05-24T13:22:21.421829 #3877846] INFO -- : installing pkgconfig data: /home/opc/ruby/install/master/lib/pkgconfig I, [2024-05-24T13:22:21.421888 #3877846] INFO -- : installing extension objects: /home/opc/ruby/install/master/lib/ruby/3.4.0+0/aarch64-linux I, [2024-05-24T13:22:21.434612 #3877846] INFO -- : installing extension objects: /home/opc/ruby/install/master/lib/ruby/site_ruby/3.4.0+0/aarch64-linux I, [2024-05-24T13:22:21.434663 #3877846] INFO -- : installing extension objects: /home/opc/ruby/install/master/lib/ruby/vendor_ruby/3.4.0+0/aarch64-linux I, [2024-05-24T13:22:21.434747 #3877846] INFO -- : installing extension headers: /home/opc/ruby/install/master/include/ruby-3.4.0+0/aarch64-linux I, [2024-05-24T13:22:21.435025 #3877846] INFO -- : installing extension scripts: /home/opc/ruby/install/master/lib/ruby/3.4.0+0 I, [2024-05-24T13:22:21.442731 #3877846] INFO -- : installing extension scripts: /home/opc/ruby/install/master/lib/ruby/site_ruby/3.4.0+0 I, [2024-05-24T13:22:21.442757 #3877846] INFO -- : installing extension scripts: /home/opc/ruby/install/master/lib/ruby/vendor_ruby/3.4.0+0 I, [2024-05-24T13:22:21.442770 #3877846] INFO -- : installing extension headers: /home/opc/ruby/install/master/include/ruby-3.4.0+0/ruby I, [2024-05-24T13:22:21.442880 #3877846] INFO -- : installing command scripts: /home/opc/ruby/install/master/bin I, [2024-05-24T13:22:21.443048 #3877846] INFO -- : installing library scripts: /home/opc/ruby/install/master/lib/ruby/3.4.0+0 I, [2024-05-24T13:22:21.525408 #3877846] INFO -- : installing common headers: /home/opc/ruby/install/master/include/ruby-3.4.0+0 I, [2024-05-24T13:22:21.537388 #3877846] INFO -- : installing manpages: /home/opc/ruby/install/master/share/man/man1 I, [2024-05-24T13:22:21.537708 #3877846] INFO -- : installing default gems from lib: /home/opc/ruby/install/master/lib/ruby/gems/3.4.0+0 I, [2024-05-24T13:22:21.582633 #3877846] INFO -- : benchmark 0.3.0 I, [2024-05-24T13:22:21.586637 #3877846] INFO -- : bundler 2.6.0.dev I, [2024-05-24T13:22:21.591220 #3877846] INFO -- : cgi 0.4.1 I, [2024-05-24T13:22:21.592340 #3877846] INFO -- : delegate 0.3.1 I, [2024-05-24T13:22:21.593502 #3877846] INFO -- : did_you_mean 1.6.3 I, [2024-05-24T13:22:21.594596 #3877846] INFO -- : english 0.8.0 I, [2024-05-24T13:22:21.596923 #3877846] INFO -- : erb 4.0.4 I, [2024-05-24T13:22:21.599650 #3877846] INFO -- : error_highlight 0.6.0 I, [2024-05-24T13:22:21.600794 #3877846] INFO -- : fileutils 1.7.2 I, [2024-05-24T13:22:21.601978 #3877846] INFO -- : find 0.2.0 I, [2024-05-24T13:22:21.603049 #3877846] INFO -- : forwardable 1.3.3 I, [2024-05-24T13:22:21.604117 #3877846] INFO -- : ipaddr 1.2.6 I, [2024-05-24T13:22:21.605269 #3877846] INFO -- : irb 1.13.1 I, [2024-05-24T13:22:21.607913 #3877846] INFO -- : logger 1.6.0 I, [2024-05-24T13:22:21.609042 #3877846] INFO -- : net-http 0.4.1 I, [2024-05-24T13:22:21.610211 #3877846] INFO -- : net-protocol 0.2.2 I, [2024-05-24T13:22:21.611330 #3877846] INFO -- : open-uri 0.4.1 I, [2024-05-24T13:22:21.612463 #3877846] INFO -- : open3 0.2.1 I, [2024-05-24T13:22:21.613640 #3877846] INFO -- : optparse 0.5.0 I, [2024-05-24T13:22:21.614831 #3877846] INFO -- : ostruct 0.6.0 I, [2024-05-24T13:22:21.615929 #3877846] INFO -- : pp 0.5.0 I, [2024-05-24T13:22:21.617183 #3877846] INFO -- : prettyprint 0.2.0 I, [2024-05-24T13:22:21.618294 #3877846] INFO -- : prism 0.29.0 I, [2024-05-24T13:22:21.619534 #3877846] INFO -- : pstore 0.1.3 I, [2024-05-24T13:22:21.620716 #3877846] INFO -- : rdoc 6.7.0 I, [2024-05-24T13:22:21.624550 #3877846] INFO -- : readline 0.0.4 I, [2024-05-24T13:22:21.625728 #3877846] INFO -- : reline 0.5.7 I, [2024-05-24T13:22:21.626899 #3877846] INFO -- : resolv 0.4.0 I, [2024-05-24T13:22:21.629466 #3877846] INFO -- : ruby2_keywords 0.0.5 I, [2024-05-24T13:22:21.630844 #3877846] INFO -- : securerandom 0.3.1 I, [2024-05-24T13:22:21.631911 #3877846] INFO -- : set 1.1.0 I, [2024-05-24T13:22:21.633097 #3877846] INFO -- : shellwords 0.2.0 I, [2024-05-24T13:22:21.634217 #3877846] INFO -- : singleton 0.2.0 I, [2024-05-24T13:22:21.635332 #3877846] INFO -- : syntax_suggest 2.0.0 I, [2024-05-24T13:22:21.637791 #3877846] INFO -- : tempfile 0.2.1 I, [2024-05-24T13:22:21.638887 #3877846] INFO -- : time 0.3.0 I, [2024-05-24T13:22:21.639999 #3877846] INFO -- : timeout 0.4.1 I, [2024-05-24T13:22:21.641144 #3877846] INFO -- : tmpdir 0.2.0 I, [2024-05-24T13:22:21.642268 #3877846] INFO -- : tsort 0.2.0 I, [2024-05-24T13:22:21.643523 #3877846] INFO -- : un 0.3.0 I, [2024-05-24T13:22:21.644633 #3877846] INFO -- : uri 0.13.0 I, [2024-05-24T13:22:21.645820 #3877846] INFO -- : weakref 0.1.3 I, [2024-05-24T13:22:21.646896 #3877846] INFO -- : yaml 0.3.0 I, [2024-05-24T13:22:21.647788 #3877846] INFO -- : installing default gems from ext: /home/opc/ruby/install/master/lib/ruby/gems/3.4.0+0 I, [2024-05-24T13:22:21.658534 #3877846] INFO -- : date 3.3.4 I, [2024-05-24T13:22:21.660184 #3877846] INFO -- : digest 3.1.1 I, [2024-05-24T13:22:21.661371 #3877846] INFO -- : etc 1.4.3 I, [2024-05-24T13:22:21.662501 #3877846] INFO -- : fcntl 1.1.0 I, [2024-05-24T13:22:21.663594 #3877846] INFO -- : fiddle 1.1.3 I, [2024-05-24T13:22:21.664733 #3877846] INFO -- : io-console 0.7.2 I, [2024-05-24T13:22:21.665890 #3877846] INFO -- : io-nonblock 0.3.0 I, [2024-05-24T13:22:21.666978 #3877846] INFO -- : io-wait 0.3.1 I, [2024-05-24T13:22:21.668035 #3877846] INFO -- : json 2.7.2 I, [2024-05-24T13:22:21.669335 #3877846] INFO -- : openssl 3.2.0 I, [2024-05-24T13:22:21.670510 #3877846] INFO -- : pathname 0.3.0 I, [2024-05-24T13:22:21.671999 #3877846] INFO -- : psych 5.1.2 I, [2024-05-24T13:22:21.673283 #3877846] INFO -- : stringio 3.1.1 I, [2024-05-24T13:22:21.674414 #3877846] INFO -- : strscan 3.1.1 I, [2024-05-24T13:22:21.675469 #3877846] INFO -- : zlib 3.1.0 I, [2024-05-24T13:22:21.676370 #3877846] INFO -- : installing bundled gems: /home/opc/ruby/install/master/lib/ruby/gems/3.4.0+0 I, [2024-05-24T13:22:21.677391 #3877846] INFO -- : minitest 5.23.1 I, [2024-05-24T13:22:21.695347 #3877846] INFO -- : rake 13.2.1 I, [2024-05-24T13:22:21.709546 #3877846] INFO -- : test-unit 3.6.2 I, [2024-05-24T13:22:21.723772 #3877846] INFO -- : rexml 3.2.8 I, [2024-05-24T13:22:21.740756 #3877846] INFO -- : rss 0.3.0 I, [2024-05-24T13:22:21.750818 #3877846] INFO -- : net-ftp 0.3.4 I, [2024-05-24T13:22:21.754547 #3877846] INFO -- : net-imap 0.4.11 I, [2024-05-24T13:22:21.772462 #3877846] INFO -- : net-pop 0.1.2 I, [2024-05-24T13:22:21.775114 #3877846] INFO -- : net-smtp 0.5.0 I, [2024-05-24T13:22:21.778579 #3877846] INFO -- : matrix 0.4.2 I, [2024-05-24T13:22:21.786753 #3877846] INFO -- : prime 0.1.2 I, [2024-05-24T13:22:21.795318 #3877846] INFO -- : rbs 3.4.4 I, [2024-05-24T13:22:21.898169 #3877846] INFO -- : typeprof 0.21.11 I, [2024-05-24T13:22:21.906708 #3877846] INFO -- : debug 1.9.2 I, [2024-05-24T13:22:21.916376 #3877846] INFO -- : racc 1.8.0 I, [2024-05-24T13:22:21.927492 #3877846] INFO -- : mutex_m 0.2.0 I, [2024-05-24T13:22:21.930538 #3877846] INFO -- : getoptlong 0.2.1 I, [2024-05-24T13:22:21.935449 #3877846] INFO -- : base64 0.2.0 I, [2024-05-24T13:22:21.937964 #3877846] INFO -- : bigdecimal 3.1.8 I, [2024-05-24T13:22:21.944162 #3877846] INFO -- : observer 0.1.2 I, [2024-05-24T13:22:21.947229 #3877846] INFO -- : abbrev 0.1.2 I, [2024-05-24T13:22:21.950261 #3877846] INFO -- : resolv-replace 0.1.1 I, [2024-05-24T13:22:21.954361 #3877846] INFO -- : rinda 0.2.0 I, [2024-05-24T13:22:21.957890 #3877846] INFO -- : drb 2.2.1 I, [2024-05-24T13:22:21.962781 #3877846] INFO -- : nkf 0.2.0 I, [2024-05-24T13:22:21.969488 #3877846] INFO -- : syslog 0.1.2 I, [2024-05-24T13:22:21.974079 #3877846] INFO -- : csv 3.3.0 I, [2024-05-24T13:22:21.982653 #3877846] INFO -- : installing bundled gem cache: /home/opc/ruby/install/master/lib/ruby/gems/3.4.0+0/cache I, [2024-05-24T13:22:21.984602 #3877846] INFO -- : skipped bundled gems: I, [2024-05-24T13:22:21.984620 #3877846] INFO -- : power_assert-2.0.4dev.gem not found in bundled_gems I, [2024-05-24T13:22:21.987465 #3877846] INFO -- : $$$[end] "make install -j3" exit with 0. I, [2024-05-24T13:22:21.987599 #3877846] INFO -- : $$$[beg] make yes-btest TESTOPTS='-q -j3' I, [2024-05-24T13:22:43.591462 #3877846] INFO -- : PASS all 1936 tests E, [2024-05-24T13:22:43.593599 #3877846] ERROR -- : I, [2024-05-24T13:22:43.593744 #3877846] INFO -- : $$$[end] "make yes-btest TESTOPTS='-q -j3'" exit with 0. I, [2024-05-24T13:22:43.593881 #3877846] INFO -- : $$$[beg] make yes-test-basic TESTS='-j3' I, [2024-05-24T13:22:43.685133 #3877846] INFO -- : BASERUBY = /usr/local/bin/ruby --disable=gems I, [2024-05-24T13:22:43.686635 #3877846] INFO -- : CC = gcc I, [2024-05-24T13:22:43.686686 #3877846] INFO -- : LD = ld I, [2024-05-24T13:22:43.686700 #3877846] INFO -- : LDSHARED = gcc -shared I, [2024-05-24T13:22:43.686714 #3877846] INFO -- : CFLAGS = -O3 -fno-fast-math -ggdb3 -Wall -Wextra -Wdeprecated-declarations -Wdiv-by-zero -Wduplicated-cond -Wimplicit-function-declaration -Wimplicit-int -Wpointer-arith -Wwrite-strings -Wold-style-definition -Wimplicit-fallthrough=0 -Wmissing-noreturn -Wno-cast-function-type -Wno-constant-logical-operand -Wno-long-long -Wno-missing-field-initializers -Wno-overlength-strings -Wno-packed-bitfield-compat -Wno-parentheses-equality -Wno-self-assign -Wno-tautological-compare -Wno-unused-parameter -Wno-unused-value -Wsuggest-attribute=format -Wsuggest-attribute=noreturn -Wunused-variable -Wmisleading-indentation -Wundef I, [2024-05-24T13:22:43.686724 #3877846] INFO -- : XCFLAGS = -U_FORTIFY_SOURCE -D_FORTIFY_SOURCE=2 -fstack-protector-strong -msign-return-address=all -fno-strict-overflow -fvisibility=hidden -fexcess-precision=standard -DRUBY_EXPORT -fPIE -I. -I.ext/include/aarch64-linux -I/home/opc/ruby/src/master/include -I/home/opc/ruby/src/master -I/home/opc/ruby/src/master/prism -I/home/opc/ruby/src/master/enc/unicode/15.0.0 I, [2024-05-24T13:22:43.686733 #3877846] INFO -- : CPPFLAGS = I, [2024-05-24T13:22:43.686741 #3877846] INFO -- : DLDFLAGS = -Wl,--compress-debug-sections=zlib -fstack-protector-strong -pie I, [2024-05-24T13:22:43.686749 #3877846] INFO -- : SOLIBS = -lz -lrt -lrt -ldl -lcrypt -lm -lpthread I, [2024-05-24T13:22:43.686757 #3877846] INFO -- : LANG = en_US.UTF-8 I, [2024-05-24T13:22:43.686765 #3877846] INFO -- : LC_ALL = I, [2024-05-24T13:22:43.686773 #3877846] INFO -- : LC_CTYPE = I, [2024-05-24T13:22:43.686781 #3877846] INFO -- : MFLAGS = I, [2024-05-24T13:22:43.686789 #3877846] INFO -- : RUSTC = rustc I, [2024-05-24T13:22:43.686797 #3877846] INFO -- : YJIT_RUSTC_ARGS = --crate-name=yjit --crate-type=staticlib --edition=2021 -g -C lto=thin -C opt-level=3 -C overflow-checks=on '--out-dir=/home/opc/ruby/build/master/yjit/target/release/' /home/opc/ruby/src/master/yjit/src/lib.rs I, [2024-05-24T13:22:43.686806 #3877846] INFO -- : gcc (GCC) 8.5.0 20210514 (Red Hat 8.5.0-10.1.0.1) I, [2024-05-24T13:22:43.686814 #3877846] INFO -- : Copyright (C) 2018 Free Software Foundation, Inc. I, [2024-05-24T13:22:43.686822 #3877846] INFO -- : This is free software; see the source for copying conditions. There is NO I, [2024-05-24T13:22:43.686830 #3877846] INFO -- : warranty; not even for MERCHANTABILITY or FITNESS FOR A PARTICULAR PURPOSE. I, [2024-05-24T13:22:43.686838 #3877846] INFO -- : I, [2024-05-24T13:22:43.843197 #3877846] INFO -- : Checking leaked global symbols...none I, [2024-05-24T13:22:43.896044 #3877846] INFO -- : /home/opc/ruby/src/master/basictest/test.rb:assignment ....................................................................................................................................................................................................................................................................................................................................................................................OK 372 I, [2024-05-24T13:22:43.896119 #3877846] INFO -- : /home/opc/ruby/src/master/basictest/test.rb:condition ..OK 2 I, [2024-05-24T13:22:43.896145 #3877846] INFO -- : /home/opc/ruby/src/master/basictest/test.rb:if/unless ...OK 3 I, [2024-05-24T13:22:43.896193 #3877846] INFO -- : /home/opc/ruby/src/master/basictest/test.rb:case .....OK 5 I, [2024-05-24T13:22:43.896822 #3877846] INFO -- : /home/opc/ruby/src/master/basictest/test.rb:while/until ........OK 8 I, [2024-05-24T13:22:43.896947 #3877846] INFO -- : /home/opc/ruby/src/master/basictest/test.rb:exception ..........OK 10 I, [2024-05-24T13:22:43.897642 #3877846] INFO -- : /home/opc/ruby/src/master/basictest/test.rb:array .......................................OK 39 I, [2024-05-24T13:22:43.897916 #3877846] INFO -- : /home/opc/ruby/src/master/basictest/test.rb:hash ...........................OK 27 I, [2024-05-24T13:22:43.899611 #3877846] INFO -- : /home/opc/ruby/src/master/basictest/test.rb:iterator ...........................................................................................................OK 107 I, [2024-05-24T13:22:43.900395 #3877846] INFO -- : /home/opc/ruby/src/master/basictest/test.rb:float ................................................................................OK 80 I, [2024-05-24T13:22:43.903998 #3877846] INFO -- : /home/opc/ruby/src/master/basictest/test.rb:bignum ...............................OK 31 I, [2024-05-24T13:22:43.905695 #3877846] INFO -- : /home/opc/ruby/src/master/basictest/test.rb:string & char ..............................................................OK 62 I, [2024-05-24T13:22:43.905777 #3877846] INFO -- : /home/opc/ruby/src/master/basictest/test.rb:assignment ..........OK 10 I, [2024-05-24T13:22:43.905852 #3877846] INFO -- : /home/opc/ruby/src/master/basictest/test.rb:call ......OK 6 I, [2024-05-24T13:22:43.905995 #3877846] INFO -- : /home/opc/ruby/src/master/basictest/test.rb:proc .........OK 9 I, [2024-05-24T13:22:44.006321 #3877846] INFO -- : /home/opc/ruby/src/master/basictest/test.rb:signal ..OK 2 I, [2024-05-24T13:22:44.007886 #3877846] INFO -- : /home/opc/ruby/src/master/basictest/test.rb:eval ...........................OK 27 I, [2024-05-24T13:22:44.139503 #3877846] INFO -- : /home/opc/ruby/src/master/basictest/test.rb:system ........OK 8 I, [2024-05-24T13:22:44.139580 #3877846] INFO -- : /home/opc/ruby/src/master/basictest/test.rb:const .....OK 5 I, [2024-05-24T13:22:44.139706 #3877846] INFO -- : /home/opc/ruby/src/master/basictest/test.rb:clone .....OK 5 I, [2024-05-24T13:22:44.139879 #3877846] INFO -- : /home/opc/ruby/src/master/basictest/test.rb:marshal ....OK 4 I, [2024-05-24T13:22:44.139956 #3877846] INFO -- : /home/opc/ruby/src/master/basictest/test.rb:pack ....OK 4 I, [2024-05-24T13:22:44.139987 #3877846] INFO -- : /home/opc/ruby/src/master/basictest/test.rb:math ..OK 2 I, [2024-05-24T13:22:44.140075 #3877846] INFO -- : /home/opc/ruby/src/master/basictest/test.rb:struct ......OK 6 I, [2024-05-24T13:22:44.140246 #3877846] INFO -- : /home/opc/ruby/src/master/basictest/test.rb:variable ............OK 12 I, [2024-05-24T13:22:44.140289 #3877846] INFO -- : /home/opc/ruby/src/master/basictest/test.rb:trace ...OK 3 I, [2024-05-24T13:22:44.140429 #3877846] INFO -- : /home/opc/ruby/src/master/basictest/test.rb:defined? ............OK 12 I, [2024-05-24T13:22:44.140539 #3877846] INFO -- : /home/opc/ruby/src/master/basictest/test.rb:alias ......OK 6 I, [2024-05-24T13:22:44.141173 #3877846] INFO -- : /home/opc/ruby/src/master/basictest/test.rb:path .......................OK 23 I, [2024-05-24T13:22:44.208879 #3877846] INFO -- : /home/opc/ruby/src/master/basictest/test.rb:gc ....OK 4 I, [2024-05-24T13:22:44.210720 #3877846] INFO -- : I, [2024-05-24T13:22:44.210749 #3877846] INFO -- : test succeeded I, [2024-05-24T13:22:44.211307 #3877846] INFO -- : $$$[end] "make yes-test-basic TESTS='-j3'" exit with 0. I, [2024-05-24T13:22:44.211519 #3877846] INFO -- : $$$[beg] make yes-test-all TESTOPTS='--stderr-on-failure' TESTS='-j3' I, [2024-05-24T13:22:44.341435 #3877846] INFO -- : BASERUBY = /usr/local/bin/ruby --disable=gems I, [2024-05-24T13:22:44.341510 #3877846] INFO -- : CC = gcc I, [2024-05-24T13:22:44.341522 #3877846] INFO -- : LD = ld I, [2024-05-24T13:22:44.341533 #3877846] INFO -- : LDSHARED = gcc -shared I, [2024-05-24T13:22:44.341544 #3877846] INFO -- : CFLAGS = -O3 -fno-fast-math -ggdb3 -Wall -Wextra -Wdeprecated-declarations -Wdiv-by-zero -Wduplicated-cond -Wimplicit-function-declaration -Wimplicit-int -Wpointer-arith -Wwrite-strings -Wold-style-definition -Wimplicit-fallthrough=0 -Wmissing-noreturn -Wno-cast-function-type -Wno-constant-logical-operand -Wno-long-long -Wno-missing-field-initializers -Wno-overlength-strings -Wno-packed-bitfield-compat -Wno-parentheses-equality -Wno-self-assign -Wno-tautological-compare -Wno-unused-parameter -Wno-unused-value -Wsuggest-attribute=format -Wsuggest-attribute=noreturn -Wunused-variable -Wmisleading-indentation -Wundef I, [2024-05-24T13:22:44.341556 #3877846] INFO -- : XCFLAGS = -U_FORTIFY_SOURCE -D_FORTIFY_SOURCE=2 -fstack-protector-strong -msign-return-address=all -fno-strict-overflow -fvisibility=hidden -fexcess-precision=standard -DRUBY_EXPORT -fPIE -I. -I.ext/include/aarch64-linux -I/home/opc/ruby/src/master/include -I/home/opc/ruby/src/master -I/home/opc/ruby/src/master/prism -I/home/opc/ruby/src/master/enc/unicode/15.0.0 I, [2024-05-24T13:22:44.341566 #3877846] INFO -- : CPPFLAGS = I, [2024-05-24T13:22:44.341575 #3877846] INFO -- : DLDFLAGS = -Wl,--compress-debug-sections=zlib -fstack-protector-strong -pie I, [2024-05-24T13:22:44.341584 #3877846] INFO -- : SOLIBS = -lz -lrt -lrt -ldl -lcrypt -lm -lpthread I, [2024-05-24T13:22:44.341593 #3877846] INFO -- : LANG = en_US.UTF-8 I, [2024-05-24T13:22:44.341602 #3877846] INFO -- : LC_ALL = I, [2024-05-24T13:22:44.341610 #3877846] INFO -- : LC_CTYPE = I, [2024-05-24T13:22:44.341619 #3877846] INFO -- : MFLAGS = I, [2024-05-24T13:22:44.341627 #3877846] INFO -- : RUSTC = rustc I, [2024-05-24T13:22:44.341636 #3877846] INFO -- : YJIT_RUSTC_ARGS = --crate-name=yjit --crate-type=staticlib --edition=2021 -g -C lto=thin -C opt-level=3 -C overflow-checks=on '--out-dir=/home/opc/ruby/build/master/yjit/target/release/' /home/opc/ruby/src/master/yjit/src/lib.rs I, [2024-05-24T13:22:44.342324 #3877846] INFO -- : gcc (GCC) 8.5.0 20210514 (Red Hat 8.5.0-10.1.0.1) I, [2024-05-24T13:22:44.342340 #3877846] INFO -- : Copyright (C) 2018 Free Software Foundation, Inc. I, [2024-05-24T13:22:44.342350 #3877846] INFO -- : This is free software; see the source for copying conditions. There is NO I, [2024-05-24T13:22:44.342359 #3877846] INFO -- : warranty; not even for MERCHANTABILITY or FITNESS FOR A PARTICULAR PURPOSE. I, [2024-05-24T13:22:44.342368 #3877846] INFO -- : I, [2024-05-24T13:22:44.344399 #3877846] INFO -- : generating enc.mk I, [2024-05-24T13:22:44.573254 #3877846] INFO -- : generating encdb.h I, [2024-05-24T13:22:44.610535 #3877846] INFO -- : encdb.h unchanged I, [2024-05-24T13:22:44.611766 #3877846] INFO -- : making enc I, [2024-05-24T13:22:44.639249 #3877846] INFO -- : make[1]: Entering directory '/home/opc/ruby/build/master' I, [2024-05-24T13:22:44.639309 #3877846] INFO -- : make[1]: Nothing to be done for 'enc'. I, [2024-05-24T13:22:44.639321 #3877846] INFO -- : make[1]: Leaving directory '/home/opc/ruby/build/master' I, [2024-05-24T13:22:44.640067 #3877846] INFO -- : making srcs under enc I, [2024-05-24T13:22:44.681779 #3877846] INFO -- : make[1]: Entering directory '/home/opc/ruby/build/master' I, [2024-05-24T13:22:44.681847 #3877846] INFO -- : make[1]: Nothing to be done for 'srcs'. I, [2024-05-24T13:22:44.681860 #3877846] INFO -- : make[1]: Leaving directory '/home/opc/ruby/build/master' I, [2024-05-24T13:22:44.682939 #3877846] INFO -- : generating transdb.h I, [2024-05-24T13:22:44.825745 #3877846] INFO -- : transdb.h unchanged I, [2024-05-24T13:22:44.827053 #3877846] INFO -- : making trans I, [2024-05-24T13:22:44.875629 #3877846] INFO -- : make[1]: Entering directory '/home/opc/ruby/build/master' I, [2024-05-24T13:22:44.875710 #3877846] INFO -- : make[1]: Nothing to be done for 'trans'. I, [2024-05-24T13:22:44.875728 #3877846] INFO -- : make[1]: Leaving directory '/home/opc/ruby/build/master' I, [2024-05-24T13:22:44.876438 #3877846] INFO -- : making encs I, [2024-05-24T13:22:44.929566 #3877846] INFO -- : make[1]: Entering directory '/home/opc/ruby/build/master' I, [2024-05-24T13:22:44.929630 #3877846] INFO -- : make[1]: Nothing to be done for 'encs'. I, [2024-05-24T13:22:44.929641 #3877846] INFO -- : make[1]: Leaving directory '/home/opc/ruby/build/master' I, [2024-05-24T13:22:44.931705 #3877846] INFO -- : generating makefiles ext/configure-ext.mk I, [2024-05-24T13:22:44.973038 #3877846] INFO -- : ext/configure-ext.mk updated I, [2024-05-24T13:22:44.976657 #3877846] INFO -- : make[1]: Entering directory '/home/opc/ruby/build/master' I, [2024-05-24T13:22:47.127952 #3877846] INFO -- : make[1]: Leaving directory '/home/opc/ruby/build/master' I, [2024-05-24T13:22:47.128653 #3877846] INFO -- : generating makefile exts.mk I, [2024-05-24T13:22:47.188855 #3877846] INFO -- : exts.mk unchanged I, [2024-05-24T13:22:47.193759 #3877846] INFO -- : make[1]: Entering directory '/home/opc/ruby/build/master' I, [2024-05-24T13:22:47.493880 #3877846] INFO -- : make[2]: Entering directory '/home/opc/ruby/build/master/ext/coverage' I, [2024-05-24T13:22:47.498519 #3877846] INFO -- : make[2]: Leaving directory '/home/opc/ruby/build/master/ext/coverage' I, [2024-05-24T13:22:47.504173 #3877846] INFO -- : make[2]: Entering directory '/home/opc/ruby/build/master/ext/date' I, [2024-05-24T13:22:47.509426 #3877846] INFO -- : make[2]: Leaving directory '/home/opc/ruby/build/master/ext/date' I, [2024-05-24T13:22:47.512701 #3877846] INFO -- : make[2]: Entering directory '/home/opc/ruby/build/master/ext/digest' I, [2024-05-24T13:22:47.521271 #3877846] INFO -- : make[2]: Leaving directory '/home/opc/ruby/build/master/ext/digest' I, [2024-05-24T13:22:47.543591 #3877846] INFO -- : make[2]: Entering directory '/home/opc/ruby/build/master/ext/digest/sha2' I, [2024-05-24T13:22:47.548552 #3877846] INFO -- : make[2]: Leaving directory '/home/opc/ruby/build/master/ext/digest/sha2' I, [2024-05-24T13:22:47.566620 #3877846] INFO -- : make[2]: Entering directory '/home/opc/ruby/build/master/ext/fiddle' I, [2024-05-24T13:22:47.576590 #3877846] INFO -- : make[2]: Leaving directory '/home/opc/ruby/build/master/ext/fiddle' I, [2024-05-24T13:22:47.580904 #3877846] INFO -- : make[2]: Entering directory '/home/opc/ruby/build/master/ext/io/console' I, [2024-05-24T13:22:47.585143 #3877846] INFO -- : make[2]: Leaving directory '/home/opc/ruby/build/master/ext/io/console' I, [2024-05-24T13:22:47.595735 #3877846] INFO -- : make[2]: Entering directory '/home/opc/ruby/build/master/ext/json' I, [2024-05-24T13:22:47.605101 #3877846] INFO -- : make[2]: Leaving directory '/home/opc/ruby/build/master/ext/json' I, [2024-05-24T13:22:47.618016 #3877846] INFO -- : make[2]: Entering directory '/home/opc/ruby/build/master/ext/monitor' I, [2024-05-24T13:22:47.622027 #3877846] INFO -- : make[2]: Leaving directory '/home/opc/ruby/build/master/ext/monitor' I, [2024-05-24T13:22:47.628096 #3877846] INFO -- : make[2]: Entering directory '/home/opc/ruby/build/master/ext/objspace' I, [2024-05-24T13:22:47.633895 #3877846] INFO -- : make[2]: Leaving directory '/home/opc/ruby/build/master/ext/objspace' I, [2024-05-24T13:22:47.653196 #3877846] INFO -- : make[2]: Entering directory '/home/opc/ruby/build/master/ext/openssl' I, [2024-05-24T13:22:47.674881 #3877846] INFO -- : make[2]: Leaving directory '/home/opc/ruby/build/master/ext/openssl' I, [2024-05-24T13:22:47.679198 #3877846] INFO -- : make[2]: Entering directory '/home/opc/ruby/build/master/ext/pathname' I, [2024-05-24T13:22:47.683586 #3877846] INFO -- : make[2]: Leaving directory '/home/opc/ruby/build/master/ext/pathname' I, [2024-05-24T13:22:47.689879 #3877846] INFO -- : make[2]: Entering directory '/home/opc/ruby/build/master/ext/psych' I, [2024-05-24T13:22:47.711228 #3877846] INFO -- : make[2]: Leaving directory '/home/opc/ruby/build/master/ext/psych' I, [2024-05-24T13:22:47.716109 #3877846] INFO -- : make[2]: Entering directory '/home/opc/ruby/build/master/ext/pty' I, [2024-05-24T13:22:47.720332 #3877846] INFO -- : make[2]: Leaving directory '/home/opc/ruby/build/master/ext/pty' I, [2024-05-24T13:22:47.733616 #3877846] INFO -- : make[2]: Entering directory '/home/opc/ruby/build/master/ext/ripper' I, [2024-05-24T13:22:47.741299 #3877846] INFO -- : make[2]: Leaving directory '/home/opc/ruby/build/master/ext/ripper' I, [2024-05-24T13:22:47.743189 #3877846] INFO -- : make[2]: Entering directory '/home/opc/ruby/build/master/ext/rubyvm' I, [2024-05-24T13:22:47.746775 #3877846] INFO -- : make[2]: Leaving directory '/home/opc/ruby/build/master/ext/rubyvm' I, [2024-05-24T13:22:47.758951 #3877846] INFO -- : make[2]: Entering directory '/home/opc/ruby/build/master/ext/socket' I, [2024-05-24T13:22:47.769596 #3877846] INFO -- : make[2]: Leaving directory '/home/opc/ruby/build/master/ext/socket' I, [2024-05-24T13:22:47.785261 #3877846] INFO -- : make[2]: Entering directory '/home/opc/ruby/build/master/.bundle/gems/bigdecimal-3.1.7/ext/bigdecimal' I, [2024-05-24T13:22:47.816394 #3877846] INFO -- : make[2]: Leaving directory '/home/opc/ruby/build/master/.bundle/gems/bigdecimal-3.1.7/ext/bigdecimal' I, [2024-05-24T13:22:47.819056 #3877846] INFO -- : make[2]: Entering directory '/home/opc/ruby/build/master/.bundle/gems/bigdecimal-3.1.8/ext/bigdecimal' I, [2024-05-24T13:22:47.850366 #3877846] INFO -- : make[2]: Leaving directory '/home/opc/ruby/build/master/.bundle/gems/bigdecimal-3.1.8/ext/bigdecimal' I, [2024-05-24T13:22:47.853052 #3877846] INFO -- : make[2]: Entering directory '/home/opc/ruby/build/master/.bundle/gems/debug-1.9.2/ext/debug' I, [2024-05-24T13:22:47.885649 #3877846] INFO -- : make[2]: Leaving directory '/home/opc/ruby/build/master/.bundle/gems/debug-1.9.2/ext/debug' I, [2024-05-24T13:22:47.888157 #3877846] INFO -- : make[2]: Entering directory '/home/opc/ruby/build/master/.bundle/gems/nkf-0.2.0/ext/nkf' I, [2024-05-24T13:22:47.918292 #3877846] INFO -- : make[2]: Leaving directory '/home/opc/ruby/build/master/.bundle/gems/nkf-0.2.0/ext/nkf' I, [2024-05-24T13:22:47.920840 #3877846] INFO -- : make[2]: Entering directory '/home/opc/ruby/build/master/.bundle/gems/racc-1.7.3/ext/racc/cparse' I, [2024-05-24T13:22:47.950654 #3877846] INFO -- : make[2]: Leaving directory '/home/opc/ruby/build/master/.bundle/gems/racc-1.7.3/ext/racc/cparse' I, [2024-05-24T13:22:47.953375 #3877846] INFO -- : make[2]: Entering directory '/home/opc/ruby/build/master/.bundle/gems/racc-1.8.0/ext/racc/cparse' I, [2024-05-24T13:22:47.983976 #3877846] INFO -- : make[2]: Leaving directory '/home/opc/ruby/build/master/.bundle/gems/racc-1.8.0/ext/racc/cparse' I, [2024-05-24T13:22:47.987013 #3877846] INFO -- : make[2]: Entering directory '/home/opc/ruby/build/master/.bundle/gems/rbs-3.4.4/ext/rbs_extension' I, [2024-05-24T13:22:48.017600 #3877846] INFO -- : make[2]: Leaving directory '/home/opc/ruby/build/master/.bundle/gems/rbs-3.4.4/ext/rbs_extension' I, [2024-05-24T13:22:48.020103 #3877846] INFO -- : make[2]: Entering directory '/home/opc/ruby/build/master/.bundle/gems/syslog-0.1.2/ext/syslog' I, [2024-05-24T13:22:48.050758 #3877846] INFO -- : make[2]: Leaving directory '/home/opc/ruby/build/master/.bundle/gems/syslog-0.1.2/ext/syslog' I, [2024-05-24T13:22:48.089425 #3877846] INFO -- : make[2]: Entering directory '/home/opc/ruby/build/master' I, [2024-05-24T13:22:48.172863 #3877846] INFO -- : make[2]: 'ruby' is up to date. I, [2024-05-24T13:22:48.172939 #3877846] INFO -- : make[2]: Leaving directory '/home/opc/ruby/build/master' I, [2024-05-24T13:22:48.173054 #3877846] INFO -- : make[1]: Leaving directory '/home/opc/ruby/build/master' I, [2024-05-24T13:22:48.177709 #3877846] INFO -- : make[1]: Entering directory '/home/opc/ruby/build/master' I, [2024-05-24T13:22:48.177739 #3877846] INFO -- : make[1]: Nothing to be done for 'note'. I, [2024-05-24T13:22:48.177750 #3877846] INFO -- : make[1]: Leaving directory '/home/opc/ruby/build/master' I, [2024-05-24T13:22:48.291235 #3877846] INFO -- : Run options: I, [2024-05-24T13:22:48.291312 #3877846] INFO -- : --seed=9859 I, [2024-05-24T13:22:48.291323 #3877846] INFO -- : "--ruby=./miniruby -I/home/opc/ruby/src/master/lib -I. -I.ext/common /home/opc/ruby/src/master/tool/runruby.rb --extout=.ext -- --disable-gems" I, [2024-05-24T13:22:48.291333 #3877846] INFO -- : --excludes-dir=/home/opc/ruby/src/master/test/.excludes I, [2024-05-24T13:22:48.291342 #3877846] INFO -- : --name=!/memory_leak/ I, [2024-05-24T13:22:48.291351 #3877846] INFO -- : --stderr-on-failure I, [2024-05-24T13:22:48.291360 #3877846] INFO -- : -j3 I, [2024-05-24T13:22:48.291368 #3877846] INFO -- : I, [2024-05-24T13:22:48.291377 #3877846] INFO -- : # Running tests: I, [2024-05-24T13:22:48.291385 #3877846] INFO -- : I, [2024-05-24T13:22:48.420203 #3877846] INFO -- : [ 1/885] 3918718=test_win32ole_type I, [2024-05-24T13:22:48.423126 #3877846] INFO -- : [ 2/885] 3918720=test_rdoc_rd_inline_parser I, [2024-05-24T13:22:48.425083 #3877846] INFO -- : [ 3/885] 3918718=test_load I, [2024-05-24T13:22:48.426340 #3877846] INFO -- : [ 4/885] 3918719=test_gem_source_lock I, [2024-05-24T13:22:48.432279 #3877846] INFO -- : [ 5/885] 3918718=test_new I, [2024-05-24T13:22:48.483423 #3877846] INFO -- : [ 6/885] 3918718=test_cipher I, [2024-05-24T13:22:48.501203 #3877846] INFO -- : [ 7/885] 3918718=test_update I, [2024-05-24T13:22:48.522338 #3877846] INFO -- : [ 8/885] 3918718=test_debugger_integration I, [2024-05-24T13:22:48.550503 #3877846] INFO -- : [ 9/885] 3918718=test_gem_resolver_composed_set I, [2024-05-24T13:22:48.575197 #3877846] INFO -- : [ 10/885] 3918720=test_my_integer I, [2024-05-24T13:22:48.590443 #3877846] INFO -- : [ 11/885] 3918720=test_require I, [2024-05-24T13:22:48.669837 #3877846] INFO -- : [ 12/885] 3918718=test_objectspace I, [2024-05-24T13:22:48.711468 #3877846] INFO -- : [ 13/885] 3918719=test_option I, [2024-05-24T13:22:48.800842 #3877846] INFO -- : [ 14/885] 3918719=test_wss I, [2024-05-24T13:22:48.933554 #3877846] INFO -- : [ 15/885] 3918719=test_rdoc_markup_attribute_manager I, [2024-05-24T13:22:48.967627 #3877846] INFO -- : [ 16/885] 3918719=test_tracer I, [2024-05-24T13:22:49.075730 #3877846] INFO -- : [ 17/885] 3918719=test_cgi_cookie I, [2024-05-24T13:22:49.086043 #3877846] INFO -- : [ 18/885] 3918719=test_not I, [2024-05-24T13:22:49.105908 #3877846] INFO -- : [ 19/885] 3918719=test_rdoc_rd I, [2024-05-24T13:22:49.123953 #3877846] INFO -- : [ 20/885] 3918719=test_rdoc_markup_to_markdown I, [2024-05-24T13:22:49.162134 #3877846] INFO -- : [ 21/885] 3918719=test_rdoc_markup_to_joined_paragraph I, [2024-05-24T13:22:49.179364 #3877846] INFO -- : [ 22/885] 3918719=test_rdoc_generator_pot I, [2024-05-24T13:22:49.203045 #3877846] INFO -- : [ 23/885] 3918719=test_rdoc_rd_block_parser I, [2024-05-24T13:22:49.262407 #3877846] INFO -- : [ 24/885] 3918719=test_x509store I, [2024-05-24T13:22:49.578839 #3877846] INFO -- : [ 25/885] 3918718=test_metaclass I, [2024-05-24T13:22:49.619575 #3877846] INFO -- : [ 26/885] 3918718=test_require_lib I, [2024-05-24T13:22:49.757104 #3877846] INFO -- : [ 27/885] 3918719=test_gem_gem_runner I, [2024-05-24T13:22:49.808546 #3877846] INFO -- : [ 28/885] 3918719=test_resize I, [2024-05-24T13:22:49.813867 #3877846] INFO -- : [ 29/885] 3918719=test_gem_package_task I, [2024-05-24T13:22:49.822925 #3877846] INFO -- : [ 30/885] 3918719=test_lock_native_thread I, [2024-05-24T13:22:50.077985 #3877846] INFO -- : [ 31/885] 3918719=test_engine I, [2024-05-24T13:22:50.566282 #3877846] INFO -- : [ 32/885] 3918719=test_gem_commands_mirror I, [2024-05-24T13:22:50.566354 #3877846] INFO -- : [ 33/885] 3918719=test_fiber I, [2024-05-24T13:22:51.085451 #3877846] INFO -- : [ 34/885] 3918720=test_key_error I, [2024-05-24T13:22:51.089111 #3877846] INFO -- : [ 35/885] 3918720=test_win32ole_param I, [2024-05-24T13:22:51.132926 #3877846] INFO -- : [ 36/885] 3918720=test_usrmarshal I, [2024-05-24T13:22:51.298872 #3877846] INFO -- : [ 37/885] 3918720=test_gem_source_installed I, [2024-05-24T13:22:51.507778 #3877846] INFO -- : [ 38/885] 3918720=test_gem_validator I, [2024-05-24T13:22:51.532777 #3877846] INFO -- : [ 39/885] 3918720=test_gem_security_trust_dir I, [2024-05-24T13:22:51.599663 #3877846] INFO -- : [ 40/885] 3918720=test_module I, [2024-05-24T13:22:52.506280 #3877846] INFO -- : [ 41/885] 3918718=test_erb_command I, [2024-05-24T13:22:52.553441 #3877846] INFO -- : [ 42/885] 3918718=test_ssl I, [2024-05-24T13:22:53.219192 #3877846] INFO -- : [ 43/885] 3918720=test_abi I, [2024-05-24T13:22:53.321693 #3877846] INFO -- : [ 44/885] 3918720=test_load I, [2024-05-24T13:22:53.325047 #3877846] INFO -- : Leaked file descriptor: TestOptionParserLoad#test_load_xdg_config_home: 7 # I, [2024-05-24T13:22:53.353534 #3877846] INFO -- : COMMAND PID USER FD TYPE DEVICE SIZE/OFF NODE NAME I, [2024-05-24T13:22:53.353600 #3877846] INFO -- : ruby 3918720 opc 7r REG 252,0 9253600 13705411 /var/lib/sss/mc/passwd I, [2024-05-24T13:22:53.380442 #3877846] INFO -- : [ 45/885] 3918720=test_bundled_ca I, [2024-05-24T13:22:54.689130 #3877846] INFO -- : [ 46/885] 3918720=test_integer_comb I, [2024-05-24T13:22:56.660723 #3877846] INFO -- : [ 47/885] 3918719=test_ostruct I, [2024-05-24T13:22:56.804032 #3877846] INFO -- : [ 48/885] 3918719=test_config I, [2024-05-24T13:22:56.830536 #3877846] INFO -- : [ 49/885] 3918719=test_change_word I, [2024-05-24T13:22:56.837315 #3877846] INFO -- : [ 50/885] 3918719=test_depth_first I, [2024-05-24T13:22:56.848872 #3877846] INFO -- : [ 51/885] 3918719=test_rdoc_parser_markdown I, [2024-05-24T13:22:56.855062 #3877846] INFO -- : [ 52/885] 3918719=test_custom_command I, [2024-05-24T13:22:56.890149 #3877846] INFO -- : [ 53/885] 3918719=static_inspect_test I, [2024-05-24T13:22:56.911819 #3877846] INFO -- : [ 54/885] 3918720=test_struct I, [2024-05-24T13:22:56.933064 #3877846] INFO -- : [ 55/885] 3918720=test_c_struct_entry I, [2024-05-24T13:22:56.939873 #3877846] INFO -- : [ 56/885] 3918719=test_rubyvm I, [2024-05-24T13:22:56.948851 #3877846] INFO -- : [ 57/885] 3918719=fuzzer_test I, [2024-05-24T13:22:56.971661 #3877846] INFO -- : [ 58/885] 3918719=test_cparser I, [2024-05-24T13:22:57.103893 #3877846] INFO -- : [ 59/885] 3918720=test_rdoc_ri_driver I, [2024-05-24T13:22:57.516872 #3877846] INFO -- : [ 60/885] 3918720=test_sexp I, [2024-05-24T13:22:57.548005 #3877846] INFO -- : [ 61/885] 3918720=test_httpheader I, [2024-05-24T13:22:57.611200 #3877846] INFO -- : [ 62/885] 3918720=test_ractor I, [2024-05-24T13:22:57.651574 #3877846] INFO -- : [ 63/885] 3918719=test_gem_safe_marshal I, [2024-05-24T13:22:57.664713 #3877846] INFO -- : [ 64/885] 3918720=test_digest I, [2024-05-24T13:22:58.320809 #3877846] INFO -- : [ 65/885] 3918719=test_gem_resolver_git_set I, [2024-05-24T13:22:58.437364 #3877846] INFO -- : [ 66/885] 3918720=test_gem_commands_check_command I, [2024-05-24T13:22:58.520692 #3877846] INFO -- : [ 67/885] 3918720=test_signedness I, [2024-05-24T13:22:58.996208 #3877846] INFO -- : [ 68/885] 3918719=test_stringscanner I, [2024-05-24T13:22:59.045208 #3877846] INFO -- : [ 69/885] 3918719=test_ractor I, [2024-05-24T13:22:59.139186 #3877846] INFO -- : [ 70/885] 3918719=test_exception_at_throwing I, [2024-05-24T13:22:59.174945 #3877846] INFO -- : [ 71/885] 3918719=test_gem_resolver_installed_specification I, [2024-05-24T13:22:59.192631 #3877846] INFO -- : [ 72/885] 3918719=test_gem_resolver_vendor_specification I, [2024-05-24T13:22:59.237025 #3877846] INFO -- : [ 73/885] 3918719=test_date_arith I, [2024-05-24T13:22:59.293351 #3877846] INFO -- : [ 74/885] 3918719=test_fiddle I, [2024-05-24T13:22:59.347636 #3877846] INFO -- : [ 75/885] 3918719=json_generic_object_test I, [2024-05-24T13:22:59.355880 #3877846] INFO -- : [ 76/885] 3918719=heredoc_dedent_test I, [2024-05-24T13:22:59.362465 #3877846] INFO -- : [ 77/885] 3918719=test_type I, [2024-05-24T13:22:59.371359 #3877846] INFO -- : [ 78/885] 3918719=test_rdoc_token_stream I, [2024-05-24T13:22:59.408175 #3877846] INFO -- : [ 79/885] 3918719=test_mutex I, [2024-05-24T13:23:00.409898 #3877846] INFO -- : [ 80/885] 3918720=test_struct I, [2024-05-24T13:23:00.507980 #3877846] INFO -- : [ 81/885] 3918719=test_tmpdir I, [2024-05-24T13:23:00.585453 #3877846] INFO -- : [ 82/885] 3918719=test_acceptable I, [2024-05-24T13:23:00.714832 #3877846] INFO -- : [ 83/885] 3918719=test_dup I, [2024-05-24T13:23:00.864821 #3877846] INFO -- : [ 84/885] 3918719=test_rdoc_single_class I, [2024-05-24T13:23:00.880647 #3877846] INFO -- : [ 85/885] 3918719=test_gem_local_remote_options I, [2024-05-24T13:23:00.920283 #3877846] INFO -- : [ 86/885] 3918719=test_gem_ext_cargo_builder_link_flag_converter I, [2024-05-24T13:23:00.926970 #3877846] INFO -- : [ 87/885] 3918720=test_handle I, [2024-05-24T13:23:00.978390 #3877846] INFO -- : [ 88/885] 3918719=parse_stream_test I, [2024-05-24T13:23:00.994617 #3877846] INFO -- : [ 89/885] 3918719=test_delete I, [2024-05-24T13:23:01.003214 #3877846] INFO -- : [ 90/885] 3918719=test_rdoc_markup_document I, [2024-05-24T13:23:01.011353 #3877846] INFO -- : [ 91/885] 3918719=test_gem_security_policy I, [2024-05-24T13:23:01.223739 #3877846] INFO -- : [ 92/885] 3918720=test_file_exhaustive I, [2024-05-24T13:23:01.385439 #3877846] INFO -- : [ 93/885] 3918719=test_completion I, [2024-05-24T13:23:01.807698 #3877846] INFO -- : Leaked file descriptor: TestFileExhaustive#test_expand_path_home_dir_string: 10 # I, [2024-05-24T13:23:01.838001 #3877846] INFO -- : COMMAND PID USER FD TYPE DEVICE SIZE/OFF NODE NAME I, [2024-05-24T13:23:01.838074 #3877846] INFO -- : ruby 3918720 opc 10u unix 0x0000000000000000 0t0 3123153801 type=STREAM I, [2024-05-24T13:23:01.975141 #3877846] INFO -- : [ 94/885] 3918719=test_gem_ci_detector I, [2024-05-24T13:23:01.991820 #3877846] INFO -- : [ 95/885] 3918719=test_gem_silent_ui I, [2024-05-24T13:23:02.029775 #3877846] INFO -- : [ 96/885] 3918719=test_signal I, [2024-05-24T13:23:03.001072 #3877846] INFO -- : [ 97/885] 3918718=test_fixnum I, [2024-05-24T13:23:03.016782 #3877846] INFO -- : [ 98/885] 3918718=test_continuation I, [2024-05-24T13:23:03.020913 #3877846] INFO -- : [ 99/885] 3918718=test_io_wait_uncommon I, [2024-05-24T13:23:03.090698 #3877846] INFO -- : [100/885] 3918718=test_ssl_session I, [2024-05-24T13:23:03.889105 #3877846] INFO -- : [101/885] 3918718=test_gem_package_tar_header I, [2024-05-24T13:23:03.936745 #3877846] INFO -- : [102/885] 3918718=test_placearg I, [2024-05-24T13:23:03.980575 #3877846] INFO -- : [103/885] 3918719=test_rational2 I, [2024-05-24T13:23:03.982873 #3877846] INFO -- : [104/885] 3918719=test_case_comprehensive I, [2024-05-24T13:23:04.056277 #3877846] INFO -- : [105/885] 3918718=test_logperiod I, [2024-05-24T13:23:04.123947 #3877846] INFO -- : [106/885] 3918718=test_require_path_check I, [2024-05-24T13:23:04.144638 #3877846] INFO -- : [107/885] 3918718=test_bn I, [2024-05-24T13:23:04.161049 #3877846] INFO -- : [108/885] 3918718=test_variable_name_check I, [2024-05-24T13:23:04.277885 #3877846] INFO -- : [109/885] 3918718=test_irb I, [2024-05-24T13:23:04.504824 #3877846] INFO -- : [110/885] 3918718=test_x509cert I, [2024-05-24T13:23:04.696743 #3877846] INFO -- : [111/885] 3918718=test_rdoc_markup_paragraph I, [2024-05-24T13:23:04.773603 #3877846] INFO -- : [112/885] 3918718=test_ast I, [2024-05-24T13:23:07.315131 #3877846] INFO -- : [113/885] 3918720=test_logdevice I, [2024-05-24T13:23:08.284640 #3877846] INFO -- : [114/885] 3918720=test_https I, [2024-05-24T13:23:08.435368 #3877846] INFO -- : [115/885] 3918720=test_gem_commands_info_command I, [2024-05-24T13:23:08.454159 #3877846] INFO -- : [116/885] 3918720=test_object_create_start I, [2024-05-24T13:23:08.464276 #3877846] INFO -- : [117/885] 3918720=test_rdoc_markup_to_ansi I, [2024-05-24T13:23:08.512676 #3877846] INFO -- : [118/885] 3918720=test_weakkeymap I, [2024-05-24T13:23:08.851763 #3877846] INFO -- : [119/885] 3918720=test_files_test I, [2024-05-24T13:23:08.856395 #3877846] INFO -- : [120/885] 3918720=test_protocol I, [2024-05-24T13:23:09.168769 #3877846] INFO -- : [121/885] 3918720=test_evaluation I, [2024-05-24T13:23:09.171253 #3877846] INFO -- : [122/885] 3918720=test_name_error_extension I, [2024-05-24T13:23:09.193306 #3877846] INFO -- : [123/885] 3918720=test_gem_request_set_gem_dependency_api I, [2024-05-24T13:23:09.457329 #3877846] INFO -- : [124/885] 3918720=test_sockopt I, [2024-05-24T13:23:09.469376 #3877846] INFO -- : [125/885] 3918720=test_ftp I, [2024-05-24T13:23:09.480765 #3877846] INFO -- : [126/885] 3918720=test_encoding I, [2024-05-24T13:23:09.487722 #3877846] INFO -- : [127/885] 3918720=test_install I, [2024-05-24T13:23:09.687212 #3877846] INFO -- : [128/885] 3918720=test_rdoc_comment I, [2024-05-24T13:23:09.730905 #3877846] INFO -- : [129/885] 3918720=test_gem_source_fetch_problem I, [2024-05-24T13:23:09.740116 #3877846] INFO -- : [130/885] 3918720=test_lazy_enumerator I, [2024-05-24T13:23:10.207494 #3877846] INFO -- : [131/885] 3918720=test_cgi_multipart I, [2024-05-24T13:23:10.313906 #3877846] INFO -- : [132/885] 3918720=test_gem_request_set_lockfile_tokenizer I, [2024-05-24T13:23:10.367425 #3877846] INFO -- : [133/885] 3918720=test_find_executable I, [2024-05-24T13:23:10.373881 #3877846] INFO -- : [134/885] 3918720=test_arithmetic_sequence I, [2024-05-24T13:23:10.386223 #3877846] INFO -- : [135/885] 3918720=test_ractor_compatibility I, [2024-05-24T13:23:10.759358 #3877846] INFO -- : [136/885] 3918720=integer_parse_test I, [2024-05-24T13:23:10.836619 #3877846] INFO -- : [137/885] 3918720=test_autoconf I, [2024-05-24T13:23:10.842237 #3877846] INFO -- : [138/885] 3918720=test_iseq I, [2024-05-24T13:23:11.447740 #3877846] INFO -- : [139/885] 3918720=test_parser I, [2024-05-24T13:23:11.462831 #3877846] INFO -- : [140/885] 3918720=test_rdoc_ri_paths I, [2024-05-24T13:23:11.505180 #3877846] INFO -- : [141/885] 3918720=test_primitive I, [2024-05-24T13:23:11.522104 #3877846] INFO -- : [142/885] 3918720=test_pair I, [2024-05-24T13:23:16.744083 #3877846] INFO -- : [143/885] 3918720=test_win32ole_variant_m I, [2024-05-24T13:23:16.746677 #3877846] INFO -- : [144/885] 3918720=test_env I, [2024-05-24T13:23:19.312794 #3877846] INFO -- : [145/885] 3918720=test_gem_commands_signout_command I, [2024-05-24T13:23:19.330679 #3877846] INFO -- : [146/885] 3918720=test_gem_package_tar_reader I, [2024-05-24T13:23:19.370440 #3877846] INFO -- : [147/885] 3918720=command_line_test I, [2024-05-24T13:23:19.377248 #3877846] INFO -- : [148/885] 3918720=test_singleton_function I, [2024-05-24T13:23:19.384637 #3877846] INFO -- : [149/885] 3918720=test_gem_safe_yaml I, [2024-05-24T13:23:19.392234 #3877846] INFO -- : [150/885] 3918720=test_eval I, [2024-05-24T13:23:19.396857 #3877846] INFO -- : [151/885] 3918720=test_document I, [2024-05-24T13:23:19.402310 #3877846] INFO -- : [152/885] 3918720=test_history I, [2024-05-24T13:23:19.562439 #3877846] INFO -- : [153/885] 3918720=test_gem_commands_setup_command I, [2024-05-24T13:23:20.445697 #3877846] INFO -- : [154/885] 3918720=test_unicode I, [2024-05-24T13:23:20.461194 #3877846] INFO -- : [155/885] 3918720=dispatcher_test I, [2024-05-24T13:23:20.472056 #3877846] INFO -- : [156/885] 3918720=test_eval_history I, [2024-05-24T13:23:20.488179 #3877846] INFO -- : [157/885] 3918720=test_ripper I, [2024-05-24T13:23:20.820758 #3877846] INFO -- : [158/885] 3918720=test_gem_source_git I, [2024-05-24T13:23:21.792839 #3877846] INFO -- : [159/885] 3918720=test_regex_casefold I, [2024-05-24T13:23:22.239689 #3877846] INFO -- : [160/885] 3918720=test_win32ole_method I, [2024-05-24T13:23:22.249911 #3877846] INFO -- : [161/885] 3918720=test_lexer I, [2024-05-24T13:23:22.263169 #3877846] INFO -- : [162/885] 3918720=test_random I, [2024-05-24T13:23:22.269649 #3877846] INFO -- : [163/885] 3918720=test_files_ext I, [2024-05-24T13:23:22.272285 #3877846] INFO -- : [164/885] 3918720=test_assembler I, [2024-05-24T13:23:22.286038 #3877846] INFO -- : [165/885] 3918720=test_stringio I, [2024-05-24T13:23:22.380506 #3877846] INFO -- : [166/885] 3918720=test_thread_cv I, [2024-05-24T13:23:23.024186 #3877846] INFO -- : [167/885] 3918720=test_benchmark I, [2024-05-24T13:23:23.608869 #3877846] INFO -- : [168/885] 3918719=test_at_exit I, [2024-05-24T13:23:23.625363 #3877846] INFO -- : [169/885] 3918719=test_class I, [2024-05-24T13:23:23.632010 #3877846] INFO -- : [170/885] 3918719=test_gem_source I, [2024-05-24T13:23:23.939885 #3877846] INFO -- : [171/885] 3918719=test_mkmf I, [2024-05-24T13:23:23.986132 #3877846] INFO -- : [172/885] 3918719=test_have_macro I, [2024-05-24T13:23:24.434778 #3877846] INFO -- : [173/885] 3918719=test_autoload I, [2024-05-24T13:23:24.462409 #3877846] INFO -- : [174/885] 3918720=test_array I, [2024-05-24T13:23:28.696634 #3877846] INFO -- : [175/885] 3918719=test_gem_package I, [2024-05-24T13:23:29.451574 #3877846] INFO -- : [176/885] 3918719=json_ext_parser_test I, [2024-05-24T13:23:29.468661 #3877846] INFO -- : [177/885] 3918719=test_gem_ext_configure_builder I, [2024-05-24T13:23:29.502656 #3877846] INFO -- : [178/885] 3918719=test_rdoc_parser_simple I, [2024-05-24T13:23:29.522001 #3877846] INFO -- : [179/885] 3918719=test_nonblock I, [2024-05-24T13:23:29.550052 #3877846] INFO -- : [180/885] 3918719=test_date_strptime I, [2024-05-24T13:23:29.681715 #3877846] INFO -- : [181/885] 3918719=test_omap I, [2024-05-24T13:23:29.699436 #3877846] INFO -- : [182/885] 3918719=test_ocsp I, [2024-05-24T13:23:29.790568 #3877846] INFO -- : [183/885] 3918719=test_scanner_events I, [2024-05-24T13:23:29.832543 #3877846] INFO -- : [184/885] 3918719=test_ipaddr I, [2024-05-24T13:23:29.855191 #3877846] INFO -- : [185/885] 3918719=test_rdoc_generator_pot_po I, [2024-05-24T13:23:29.863397 #3877846] INFO -- : [186/885] 3918719=test_mul I, [2024-05-24T13:23:29.872758 #3877846] INFO -- : [187/885] 3918719=test_shellwords I, [2024-05-24T13:23:29.886764 #3877846] INFO -- : [188/885] 3918719=test_gem_commands_lock_command I, [2024-05-24T13:23:29.906993 #3877846] INFO -- : [189/885] 3918719=test_reline_key I, [2024-05-24T13:23:29.917856 #3877846] INFO -- : [190/885] 3918719=test_propertyputref I, [2024-05-24T13:23:29.926935 #3877846] INFO -- : [191/885] 3918719=test_gb18030 I, [2024-05-24T13:23:29.927965 #3877846] INFO -- : [192/885] 3918719=test_gem_stream_ui I, [2024-05-24T13:23:30.037827 #3877846] INFO -- : [193/885] 3918719=test_rdoc_generator_ri I, [2024-05-24T13:23:30.050697 #3877846] INFO -- : [194/885] 3918719=test_unicode_normalize I, [2024-05-24T13:23:32.367684 #3877846] INFO -- : [195/885] 3918720=test_cmethod I, [2024-05-24T13:23:32.371985 #3877846] INFO -- : [196/885] 3918720=test_gem_stub_specification I, [2024-05-24T13:23:32.521603 #3877846] INFO -- : [197/885] 3918720=test_float I, [2024-05-24T13:23:33.797503 #3877846] INFO -- : [198/885] 3918719=test_io_m17n I, [2024-05-24T13:23:34.169197 #3877846] INFO -- : [199/885] 3918720=test_rdoc_top_level I, [2024-05-24T13:23:34.477707 #3877846] INFO -- : [200/885] 3918720=test_color I, [2024-05-24T13:23:34.537420 #3877846] INFO -- : [201/885] 3918720=test_uncorrectable_name_check I, [2024-05-24T13:23:34.568113 #3877846] INFO -- : [202/885] 3918720=test_io I, [2024-05-24T13:23:35.147069 #3877846] INFO -- : [203/885] 3918719=test_closure I, [2024-05-24T13:23:37.867781 #3877846] INFO -- : [204/885] 3918719=test_resolve_symbol I, [2024-05-24T13:23:37.916735 #3877846] INFO -- : [205/885] 3918719=test_rubygems I, [2024-05-24T13:23:38.039479 #3877846] INFO -- : [206/885] 3918719=test_dir I, [2024-05-24T13:23:38.172660 #3877846] INFO -- : Leaked file descriptor: TestDir#test_home: 9 # I, [2024-05-24T13:23:38.172734 #3877846] INFO -- : Leaked file descriptor: TestDir#test_home: 10 # I, [2024-05-24T13:23:38.199684 #3877846] INFO -- : COMMAND PID USER FD TYPE DEVICE SIZE/OFF NODE NAME I, [2024-05-24T13:23:38.199759 #3877846] INFO -- : ruby 3918719 opc 9r REG 252,0 9253600 13705411 /var/lib/sss/mc/passwd I, [2024-05-24T13:23:38.199771 #3877846] INFO -- : ruby 3918719 opc 10u unix 0x0000000000000000 0t0 3123155756 type=STREAM I, [2024-05-24T13:23:38.480630 #3877846] INFO -- : [207/885] 3918719=test_files_test_1 I, [2024-05-24T13:23:40.952614 #3877846] INFO -- : [208/885] 3918719=test_rdoc_rd_inline I, [2024-05-24T13:23:40.964343 #3877846] INFO -- : [209/885] 3918719=test_path I, [2024-05-24T13:23:40.973648 #3877846] INFO -- : [210/885] 3918719=test_digest I, [2024-05-24T13:23:41.021396 #3877846] INFO -- : [211/885] 3918719=test_https_proxy I, [2024-05-24T13:23:41.030830 #3877846] INFO -- : [212/885] 3918719=test_rdoc_parser I, [2024-05-24T13:23:41.055186 #3877846] INFO -- : [213/885] 3918719=test_win32ole_param_event I, [2024-05-24T13:23:41.062403 #3877846] INFO -- : [214/885] 3918719=test_stat I, [2024-05-24T13:23:41.069496 #3877846] INFO -- : [215/885] 3918719=test_nomethod_error I, [2024-05-24T13:23:41.135266 #3877846] INFO -- : [216/885] 3918719=test_gem_commands_rebuild_command I, [2024-05-24T13:23:41.146907 #3877846] INFO -- : [217/885] 3918719=test_etc I, [2024-05-24T13:23:41.151599 #3877846] INFO -- : Leaked file descriptor: TestEtc#test_getgrgid: 11 # I, [2024-05-24T13:23:41.185130 #3877846] INFO -- : COMMAND PID USER FD TYPE DEVICE SIZE/OFF NODE NAME I, [2024-05-24T13:23:41.185203 #3877846] INFO -- : ruby 3918719 opc 11r REG 252,0 6940392 13705429 /var/lib/sss/mc/group I, [2024-05-24T13:23:41.332015 #3877846] INFO -- : [218/885] 3918719=test_workspace I, [2024-05-24T13:23:41.460718 #3877846] INFO -- : [219/885] 3918719=test_x509attr I, [2024-05-24T13:23:41.461569 #3877846] INFO -- : [220/885] 3918719=test_printf I, [2024-05-24T13:23:41.488817 #3877846] INFO -- : [221/885] 3918719=test_win32ole_variant I, [2024-05-24T13:23:41.497170 #3877846] INFO -- : [222/885] 3918719=magic_comment_test I, [2024-05-24T13:23:41.506049 #3877846] INFO -- : [223/885] 3918719=test_cgi_modruby I, [2024-05-24T13:23:41.508888 #3877846] INFO -- : [224/885] 3918719=test_httpresponse I, [2024-05-24T13:23:41.570035 #3877846] INFO -- : [225/885] 3918719=test_rdoc_parser_ruby I, [2024-05-24T13:23:42.808600 #3877846] INFO -- : [226/885] 3918719=test_readpartial I, [2024-05-24T13:23:43.222037 #3877846] INFO -- : [227/885] 3918719=test_x509req I, [2024-05-24T13:23:43.250893 #3877846] INFO -- : [228/885] 3918719=test_gem_console_ui I, [2024-05-24T13:23:43.297901 #3877846] INFO -- : [229/885] 3918719=test_allocation I, [2024-05-24T13:23:43.548699 #3877846] INFO -- : [230/885] 3918720=test_ifunless I, [2024-05-24T13:23:43.553343 #3877846] INFO -- : [231/885] 3918720=test_insns_leaf I, [2024-05-24T13:23:43.562130 #3877846] INFO -- : [232/885] 3918720=test_convertible I, [2024-05-24T13:23:45.748905 #3877846] INFO -- : [233/885] 3918719=errors_test I, [2024-05-24T13:23:45.915132 #3877846] INFO -- : [234/885] 3918719=test_modify_expand I, [2024-05-24T13:23:45.916271 #3877846] INFO -- : [235/885] 3918719=test_pkg_config I, [2024-05-24T13:23:45.944348 #3877846] INFO -- : [236/885] 3918719=test_gem_available_set I, [2024-05-24T13:23:46.041773 #3877846] INFO -- : [237/885] 3918719=json_encoding_test I, [2024-05-24T13:23:46.044898 #3877846] INFO -- : [238/885] 3918719=test_vm_dump I, [2024-05-24T13:23:46.048767 #3877846] INFO -- : [239/885] 3918719=test_func I, [2024-05-24T13:23:47.183868 #3877846] INFO -- : [240/885] 3918720=test_config I, [2024-05-24T13:23:47.218310 #3877846] INFO -- : [241/885] 3918720=test_object I, [2024-05-24T13:23:47.536399 #3877846] INFO -- : [242/885] 3918718=test_dln I, [2024-05-24T13:23:47.538181 #3877846] INFO -- : [243/885] 3918718=test_gem_resolver I, [2024-05-24T13:23:47.556753 #3877846] INFO -- : [244/885] 3918720=test_gem_source_vendor I, [2024-05-24T13:23:47.571085 #3877846] INFO -- : [245/885] 3918720=test_color_printer I, [2024-05-24T13:23:47.582083 #3877846] INFO -- : [246/885] 3918720=test_super I, [2024-05-24T13:23:47.906000 #3877846] INFO -- : [247/885] 3918718=test_gem_commands_exec_command I, [2024-05-24T13:23:48.815173 #3877846] INFO -- : [248/885] 3918720=unescape_test I, [2024-05-24T13:23:49.179918 #3877846] INFO -- : [249/885] 3918718=test_last_thread I, [2024-05-24T13:23:50.091676 #3877846] INFO -- : [250/885] 3918720=test_thread_fd_close I, [2024-05-24T13:23:50.123971 #3877846] INFO -- : [251/885] 3918720=test_gem_ext_cmake_builder I, [2024-05-24T13:23:50.135904 #3877846] INFO -- : [252/885] 3918720=test_digest_extend I, [2024-05-24T13:23:50.161696 #3877846] INFO -- : [253/885] 3918720=test_emitter I, [2024-05-24T13:23:50.216085 #3877846] INFO -- : [254/885] 3918720=test_fips I, [2024-05-24T13:23:50.223417 #3877846] INFO -- : [255/885] 3918718=test_alias I, [2024-05-24T13:23:50.369237 #3877846] INFO -- : [256/885] 3918718=test_getopts I, [2024-05-24T13:23:50.433340 #3877846] INFO -- : [257/885] 3918718=test_helper I, [2024-05-24T13:23:50.444872 #3877846] INFO -- : [258/885] 3918718=test_compile_prism I, [2024-05-24T13:23:50.447760 #3877846] INFO -- : [259/885] 3918720=test_gem_commands_uninstall_command I, [2024-05-24T13:23:50.752637 #3877846] INFO -- : [260/885] 3918718=test_rdoc_markup_formatter I, [2024-05-24T13:23:50.766923 #3877846] INFO -- : [261/885] 3918718=test_win32ole_event I, [2024-05-24T13:23:50.776680 #3877846] INFO -- : [262/885] 3918718=test_x509crl I, [2024-05-24T13:23:50.881692 #3877846] INFO -- : [263/885] 3918718=test_dns I, [2024-05-24T13:23:51.250981 #3877846] INFO -- : [264/885] 3918720=test_notimplement I, [2024-05-24T13:23:51.263323 #3877846] INFO -- : [265/885] 3918720=test_cgi_session I, [2024-05-24T13:23:51.312608 #3877846] INFO -- : [266/885] 3918720=test_c_union_entity I, [2024-05-24T13:23:51.381792 #3877846] INFO -- : [267/885] 3918718=test_flip I, [2024-05-24T13:23:51.407713 #3877846] INFO -- : [268/885] 3918720=test_io_console I, [2024-05-24T13:23:51.417806 #3877846] INFO -- : [269/885] 3918718=test_rdoc_markup_heading I, [2024-05-24T13:23:51.490264 #3877846] INFO -- : [270/885] 3918718=test_profile_frames I, [2024-05-24T13:23:51.610411 #3877846] INFO -- : [271/885] 3918718=test_pattern_key_name_check I, [2024-05-24T13:23:51.620479 #3877846] INFO -- : [272/885] 3918718=test_class2name I, [2024-05-24T13:23:51.658533 #3877846] INFO -- : [273/885] 3918718=test_gem_commands_cleanup_command I, [2024-05-24T13:23:52.227628 #3877846] INFO -- : [274/885] 3918718=test_debug I, [2024-05-24T13:23:52.249241 #3877846] INFO -- : [275/885] 3918718=test_transcode I, [2024-05-24T13:23:52.556521 #3877846] INFO -- : [276/885] 3918718=test_refinement I, [2024-05-24T13:23:53.553809 #3877846] INFO -- : [277/885] 3918719=test_append I, [2024-05-24T13:23:53.566770 #3877846] INFO -- : [278/885] 3918719=test_gem_resolver_installer_set I, [2024-05-24T13:23:53.800254 #3877846] INFO -- : [279/885] 3918719=test_rdoc_markup_to_html I, [2024-05-24T13:23:53.884000 #3877846] INFO -- : [280/885] 3918719=test_foreach I, [2024-05-24T13:23:53.892807 #3877846] INFO -- : [281/885] 3918719=test_x509ext I, [2024-05-24T13:23:53.901914 #3877846] INFO -- : [282/885] 3918719=test_emitter I, [2024-05-24T13:23:53.911807 #3877846] INFO -- : [283/885] 3918719=bom_test I, [2024-05-24T13:23:53.930051 #3877846] INFO -- : [284/885] 3918719=test_config I, [2024-05-24T13:23:54.051902 #3877846] INFO -- : [285/885] 3918720=test_file I, [2024-05-24T13:23:54.321005 #3877846] INFO -- : [286/885] 3918719=test_summary I, [2024-05-24T13:23:54.382822 #3877846] INFO -- : [287/885] 3918719=test_helper_method I, [2024-05-24T13:23:54.397823 #3877846] INFO -- : [288/885] 3918719=test_lambda I, [2024-05-24T13:23:54.457947 #3877846] INFO -- : [289/885] 3918719=test_rb_str_dup I, [2024-05-24T13:23:54.468259 #3877846] INFO -- : [290/885] 3918719=test_scalar_scanner I, [2024-05-24T13:23:54.495374 #3877846] INFO -- : [291/885] 3918719=test_trace I, [2024-05-24T13:23:54.542288 #3877846] INFO -- : [292/885] 3918719=test_keyword I, [2024-05-24T13:23:55.058806 #3877846] INFO -- : [293/885] 3918719=test_win32ole_type_event I, [2024-05-24T13:23:55.065578 #3877846] INFO -- : [294/885] 3918719=test_arity I, [2024-05-24T13:23:55.077407 #3877846] INFO -- : [295/885] 3918719=test_gem_path_support I, [2024-05-24T13:23:55.111765 #3877846] INFO -- : [296/885] 3918719=test_buffered_io I, [2024-05-24T13:23:55.193533 #3877846] INFO -- : [297/885] 3918719=test_ossl I, [2024-05-24T13:23:56.021587 #3877846] INFO -- : [298/885] 3918718=test_gem_installer I, [2024-05-24T13:24:00.300378 #3877846] INFO -- : [299/885] 3918720=test_bug_reporter I, [2024-05-24T13:24:00.466367 #3877846] INFO -- : [300/885] 3918720=test_gem_source_subpath_problem I, [2024-05-24T13:24:00.546451 #3877846] INFO -- : [301/885] 3918720=test_object_references I, [2024-05-24T13:24:00.559570 #3877846] INFO -- : [302/885] 3918720=test_ruby_lex I, [2024-05-24T13:24:00.659874 #3877846] INFO -- : [303/885] 3918718=compiler_test I, [2024-05-24T13:24:00.677505 #3877846] INFO -- : [304/885] 3918718=test_arith_seq_extract I, [2024-05-24T13:24:00.693428 #3877846] INFO -- : [305/885] 3918720=test_eval I, [2024-05-24T13:24:00.837762 #3877846] INFO -- : [306/885] 3918718=test_beginendblock I, [2024-05-24T13:24:00.947393 #3877846] INFO -- : [307/885] 3918720=test_monitor I, [2024-05-24T13:24:01.176800 #3877846] INFO -- : [308/885] 3918718=test_pointer I, [2024-05-24T13:24:01.221436 #3877846] INFO -- : [309/885] 3918720=test_rdoc_normal_class I, [2024-05-24T13:24:01.309902 #3877846] INFO -- : [310/885] 3918720=test_within_pipe I, [2024-05-24T13:24:01.364776 #3877846] INFO -- : [311/885] 3918720=test_nofree I, [2024-05-24T13:24:01.388231 #3877846] INFO -- : [312/885] 3918720=test_regexp I, [2024-05-24T13:24:02.377480 #3877846] INFO -- : [313/885] 3918719=test_whileuntil I, [2024-05-24T13:24:02.382523 #3877846] INFO -- : [314/885] 3918719=test_member I, [2024-05-24T13:24:02.385749 #3877846] INFO -- : [315/885] 3918718=test_object I, [2024-05-24T13:24:02.395193 #3877846] INFO -- : [316/885] 3918719=test_addr I, [2024-05-24T13:24:02.401767 #3877846] INFO -- : [317/885] 3918718=test_mailto I, [2024-05-24T13:24:02.416729 #3877846] INFO -- : [318/885] 3918719=test_kill_ring I, [2024-05-24T13:24:02.419862 #3877846] INFO -- : [319/885] 3918718=test_case_options I, [2024-05-24T13:24:02.427760 #3877846] INFO -- : [320/885] 3918719=format_errors_test I, [2024-05-24T13:24:02.429707 #3877846] INFO -- : [321/885] 3918719=test_cgi_header I, [2024-05-24T13:24:02.437839 #3877846] INFO -- : [322/885] 3918718=test_duplicate I, [2024-05-24T13:24:02.441387 #3877846] INFO -- : [323/885] 3918719=test_gem_resolver_api_set I, [2024-05-24T13:24:02.453271 #3877846] INFO -- : [324/885] 3918718=test_helper I, [2024-05-24T13:24:02.454804 #3877846] INFO -- : [325/885] 3918718=test_reline I, [2024-05-24T13:24:02.544463 #3877846] INFO -- : [326/885] 3918719=test_ellipsize I, [2024-05-24T13:24:02.573103 #3877846] INFO -- : [327/885] 3918719=test_call I, [2024-05-24T13:24:02.746993 #3877846] INFO -- : [328/885] 3918718=test_gem_commands_build_command I, [2024-05-24T13:24:02.766125 #3877846] INFO -- : [329/885] 3918719=test_windows_1251 I, [2024-05-24T13:24:02.788845 #3877846] INFO -- : [330/885] 3918719=test_to_ary_concat I, [2024-05-24T13:24:03.076583 #3877846] INFO -- : [331/885] 3918718=test_history I, [2024-05-24T13:24:03.175768 #3877846] INFO -- : [332/885] 3918718=test_gem_ext_builder I, [2024-05-24T13:24:04.157019 #3877846] INFO -- : [333/885] 3918718=test_time_tz I, [2024-05-24T13:24:04.212741 #3877846] INFO -- : [334/885] 3918718=test_to_ruby I, [2024-05-24T13:24:04.235852 #3877846] INFO -- : [335/885] 3918718=test_addrinfo I, [2024-05-24T13:24:04.244376 #3877846] INFO -- : Leaked file descriptor: TestSocketAddrinfo#test_addrinfo_timeout: 8 # I, [2024-05-24T13:24:04.280835 #3877846] INFO -- : COMMAND PID USER FD TYPE DEVICE SIZE/OFF NODE NAME I, [2024-05-24T13:24:04.280918 #3877846] INFO -- : ruby 3918718 opc 8u unix 0x0000000000000000 0t0 3123163962 type=STREAM I, [2024-05-24T13:24:04.412661 #3877846] INFO -- : [336/885] 3918718=test_bug-14834 I, [2024-05-24T13:24:04.418483 #3877846] INFO -- : [337/885] 3918718=test_data I, [2024-05-24T13:24:04.454708 #3877846] INFO -- : [338/885] 3918718=test_thread I, [2024-05-24T13:24:07.551078 #3877846] INFO -- : [339/885] 3918719=test_inlinecache I, [2024-05-24T13:24:07.600579 #3877846] INFO -- : [340/885] 3918719=test_socket I, [2024-05-24T13:24:08.541905 #3877846] INFO -- : [341/885] 3918719=test_terminfo I, [2024-05-24T13:24:08.570378 #3877846] INFO -- : [342/885] 3918719=test_pattern_matching I, [2024-05-24T13:24:08.601721 #3877846] INFO -- : [343/885] 3918719=test_set_len I, [2024-05-24T13:24:08.609882 #3877846] INFO -- : [344/885] 3918719=constant_path_node_test I, [2024-05-24T13:24:08.619081 #3877846] INFO -- : [345/885] 3918719=test_interned_str I, [2024-05-24T13:24:08.624373 #3877846] INFO -- : [346/885] 3918719=test_folderitem2_invokeverb I, [2024-05-24T13:24:08.635685 #3877846] INFO -- : [347/885] 3918719=test_gem_bundler_version_finder I, [2024-05-24T13:24:08.762153 #3877846] INFO -- : [348/885] 3918719=test_gem_request_set I, [2024-05-24T13:24:09.469104 #3877846] INFO -- : [349/885] 3918719=test_gc I, [2024-05-24T13:24:13.175946 #3877846] INFO -- : [350/885] 3918718=test_gem_resolver_index_set I, [2024-05-24T13:24:13.214516 #3877846] INFO -- : [351/885] 3918718=ruby_api_test I, [2024-05-24T13:24:13.771274 #3877846] INFO -- : [352/885] 3918718=test_sleep I, [2024-05-24T13:24:18.363081 #3877846] INFO -- : [353/885] 3918718=test_webauthn_listener_response I, [2024-05-24T13:24:18.382925 #3877846] INFO -- : [354/885] 3918718=test_euc_jp I, [2024-05-24T13:24:18.392300 #3877846] INFO -- : [355/885] 3918718=test_rdoc_markup I, [2024-05-24T13:24:18.407604 #3877846] INFO -- : [356/885] 3918718=test_key_stroke I, [2024-05-24T13:24:18.465313 #3877846] INFO -- : [357/885] 3918718=test_ensured I, [2024-05-24T13:24:18.477285 #3877846] INFO -- : [358/885] 3918718=test_time I, [2024-05-24T13:24:18.660511 #3877846] INFO -- : [359/885] 3918718=test_popen_deadlock I, [2024-05-24T13:24:19.227810 #3877846] INFO -- : [360/885] 3918718=test_alias_and_anchor I, [2024-05-24T13:24:19.238596 #3877846] INFO -- : [361/885] 3918718=test_project_sanity I, [2024-05-24T13:24:19.294008 #3877846] INFO -- : [362/885] 3918718=test_symbol I, [2024-05-24T13:24:19.299951 #3877846] INFO -- : [363/885] 3918718=test_chilled I, [2024-05-24T13:24:19.306699 #3877846] INFO -- : [364/885] 3918718=test_delegate I, [2024-05-24T13:24:19.331555 #3877846] INFO -- : [365/885] 3918718=location_test I, [2024-05-24T13:24:19.389325 #3877846] INFO -- : [366/885] 3918718=test_rdoc_attr I, [2024-05-24T13:24:19.406437 #3877846] INFO -- : [367/885] 3918718=test_address_resolve I, [2024-05-24T13:24:19.422851 #3877846] INFO -- : [368/885] 3918718=test_stream I, [2024-05-24T13:24:19.438753 #3877846] INFO -- : [369/885] 3918718=test_trick I, [2024-05-24T13:24:20.231542 #3877846] INFO -- : [370/885] 3918719=test_ractor I, [2024-05-24T13:24:20.301397 #3877846] INFO -- : [371/885] 3918719=test_ts I, [2024-05-24T13:24:20.583802 #3877846] INFO -- : [372/885] 3918719=test_locale I, [2024-05-24T13:24:20.608684 #3877846] INFO -- : [373/885] 3918719=test_num2int I, [2024-05-24T13:24:20.620641 #3877846] INFO -- : [374/885] 3918719=test_rbconfig I, [2024-05-24T13:24:20.626124 #3877846] INFO -- : [375/885] 3918719=test_recursion I, [2024-05-24T13:24:20.663978 #3877846] INFO -- : [376/885] 3918719=test_require I, [2024-05-24T13:24:21.865633 #3877846] INFO -- : [377/885] 3918718=test_rdoc_markup_include I, [2024-05-24T13:24:21.880135 #3877846] INFO -- : [378/885] 3918718=test_enum I, [2024-05-24T13:24:21.930885 #3877846] INFO -- : [379/885] 3918719=test_extlibs I, [2024-05-24T13:24:22.763335 #3877846] INFO -- : [380/885] 3918718=test_iter_break I, [2024-05-24T13:24:22.778223 #3877846] INFO -- : [381/885] 3918718=test_range I, [2024-05-24T13:24:23.481731 #3877846] INFO -- : [382/885] 3918720=test_gem_commands_signin_command I, [2024-05-24T13:24:23.544593 #3877846] INFO -- : [383/885] 3918719=test_formatter I, [2024-05-24T13:24:23.573165 #3877846] INFO -- : [384/885] 3918718=test_gem_commands_contents_command I, [2024-05-24T13:24:23.621516 #3877846] INFO -- : [385/885] 3918720=test_context I, [2024-05-24T13:24:23.633052 #3877846] INFO -- : [386/885] 3918719=test_udp I, [2024-05-24T13:24:23.644697 #3877846] INFO -- : [387/885] 3918719=test_symbol I, [2024-05-24T13:24:23.702638 #3877846] INFO -- : [388/885] 3918718=test_gem_commands_search_command I, [2024-05-24T13:24:23.710698 #3877846] INFO -- : [389/885] 3918718=test_rdoc_servlet I, [2024-05-24T13:24:23.731835 #3877846] INFO -- : [390/885] 3918720=test_coder I, [2024-05-24T13:24:23.741343 #3877846] INFO -- : [391/885] 3918720=test_unix I, [2024-05-24T13:24:23.780861 #3877846] INFO -- : [392/885] 3918720=test_integer I, [2024-05-24T13:24:23.872860 #3877846] INFO -- : [393/885] 3918718=test_have_func I, [2024-05-24T13:24:25.222440 #3877846] INFO -- : [394/885] 3918718=test_date_marshal I, [2024-05-24T13:24:25.245013 #3877846] INFO -- : [395/885] 3918718=test_gem_resolver_local_specification I, [2024-05-24T13:24:25.343442 #3877846] INFO -- : [396/885] 3918718=test_configuration I, [2024-05-24T13:24:25.356121 #3877846] INFO -- : [397/885] 3918718=test_date_new I, [2024-05-24T13:24:25.370791 #3877846] INFO -- : [398/885] 3918718=test_gem_commands_list_command I, [2024-05-24T13:24:25.464858 #3877846] INFO -- : [399/885] 3918718=test_ractor I, [2024-05-24T13:24:25.730063 #3877846] INFO -- : [400/885] 3918718=test_gem_resolver_conflict I, [2024-05-24T13:24:25.785440 #3877846] INFO -- : [401/885] 3918718=test_gem_commands_help_command I, [2024-05-24T13:24:25.823350 #3877846] INFO -- : [402/885] 3918718=test_scheduler I, [2024-05-24T13:24:26.030440 #3877846] INFO -- : [403/885] 3918718=test_ssl I, [2024-05-24T13:24:26.127675 #3877846] INFO -- : [404/885] 3918718=test_bignum I, [2024-05-24T13:24:26.382040 #3877846] INFO -- : [405/885] 3918720=newline_test I, [2024-05-24T13:24:26.443921 #3877846] INFO -- : [406/885] 3918720=test_enc_str_buf_cat I, [2024-05-24T13:24:26.456657 #3877846] INFO -- : [407/885] 3918720=test_marshal I, [2024-05-24T13:24:27.481515 #3877846] INFO -- : [408/885] 3918720=test_ancdata I, [2024-05-24T13:24:27.551393 #3877846] INFO -- : [409/885] 3918720=ractor_test I, [2024-05-24T13:24:27.561117 #3877846] INFO -- : [410/885] 3918720=test_nesting_parser I, [2024-05-24T13:24:27.581766 #3877846] INFO -- : [411/885] 3918720=test_rdoc_markup_hard_break I, [2024-05-24T13:24:27.591890 #3877846] INFO -- : [412/885] 3918720=test_rdoc_markup_to_label I, [2024-05-24T13:24:27.638944 #3877846] INFO -- : [413/885] 3918720=test_parser I, [2024-05-24T13:24:27.657878 #3877846] INFO -- : [414/885] 3918720=test_cgi_core I, [2024-05-24T13:24:27.678938 #3877846] INFO -- : [415/885] 3918720=test_gem_resolver_best_set I, [2024-05-24T13:24:27.744416 #3877846] INFO -- : [416/885] 3918720=test_registry I, [2024-05-24T13:24:27.761505 #3877846] INFO -- : [417/885] 3918720=test_gem I, [2024-05-24T13:24:29.767904 #3877846] INFO -- : [418/885] 3918718=test_ractor I, [2024-05-24T13:24:29.786597 #3877846] INFO -- : [419/885] 3918718=json_generator_test I, [2024-05-24T13:24:29.898260 #3877846] INFO -- : [420/885] 3918718=test_ansi_without_terminfo I, [2024-05-24T13:24:29.948527 #3877846] INFO -- : [421/885] 3918718=test_gem_ext_rake_builder I, [2024-05-24T13:24:30.013960 #3877846] INFO -- : [422/885] 3918720=test_rdoc_require I, [2024-05-24T13:24:30.019114 #3877846] INFO -- : [423/885] 3918720=test_word I, [2024-05-24T13:24:30.027283 #3877846] INFO -- : [424/885] 3918720=test_singleton I, [2024-05-24T13:24:30.034890 #3877846] INFO -- : [425/885] 3918720=test_fstring I, [2024-05-24T13:24:30.146402 #3877846] INFO -- : [426/885] 3918720=test_numeric I, [2024-05-24T13:24:30.216714 #3877846] INFO -- : [427/885] 3918720=test_weakref I, [2024-05-24T13:24:30.428709 #3877846] INFO -- : [428/885] 3918720=test_instrumentation_api I, [2024-05-24T13:24:30.583645 #3877846] INFO -- : [429/885] 3918718=test_rdoc_alias I, [2024-05-24T13:24:30.602208 #3877846] INFO -- : [430/885] 3918718=test_timeout I, [2024-05-24T13:24:30.956928 #3877846] INFO -- : [431/885] 3918719=test_rdoc_markup_to_bs I, [2024-05-24T13:24:30.995548 #3877846] INFO -- : [432/885] 3918719=test_key_name_check I, [2024-05-24T13:24:31.005704 #3877846] INFO -- : [433/885] 3918719=test_rdoc_markup_raw I, [2024-05-24T13:24:31.014862 #3877846] INFO -- : [434/885] 3918719=test_rdoc_markup_to_tt_only I, [2024-05-24T13:24:31.047486 #3877846] INFO -- : [435/885] 3918719=test_ws I, [2024-05-24T13:24:31.058203 #3877846] INFO -- : [436/885] 3918719=test_date_strftime I, [2024-05-24T13:24:31.507202 #3877846] INFO -- : [437/885] 3918719=json_parser_test I, [2024-05-24T13:24:31.523064 #3877846] INFO -- : [438/885] 3918718=test_gem_commands_stale_command I, [2024-05-24T13:24:31.547728 #3877846] INFO -- : [439/885] 3918719=ruby_parser_test I, [2024-05-24T13:24:31.575444 #3877846] INFO -- : [440/885] 3918719=test_gem_commands_cert_command I, [2024-05-24T13:24:31.581260 #3877846] INFO -- : [441/885] 3918718=test_zsh_completion I, [2024-05-24T13:24:31.589760 #3877846] INFO -- : [442/885] 3918718=test_basicsocket I, [2024-05-24T13:24:31.615900 #3877846] INFO -- : [443/885] 3918718=test_class_name_check I, [2024-05-24T13:24:31.648266 #3877846] INFO -- : [444/885] 3918718=test_scalar I, [2024-05-24T13:24:31.672160 #3877846] INFO -- : [445/885] 3918718=test_syntax I, [2024-05-24T13:24:33.144233 #3877846] INFO -- : [446/885] 3918719=test_pack I, [2024-05-24T13:24:33.376051 #3877846] INFO -- : [447/885] 3918719=test_gem_commands_environment_command I, [2024-05-24T13:24:33.388698 #3877846] INFO -- : [448/885] 3918720=test_pkcs7 I, [2024-05-24T13:24:33.435033 #3877846] INFO -- : [449/885] 3918719=test_optparse I, [2024-05-24T13:24:33.443057 #3877846] INFO -- : [450/885] 3918719=test_rdoc_context_section I, [2024-05-24T13:24:33.524179 #3877846] INFO -- : [451/885] 3918719=test_io_buffer I, [2024-05-24T13:24:33.564083 #3877846] INFO -- : [452/885] 3918720=test_deprecated I, [2024-05-24T13:24:33.577910 #3877846] INFO -- : [453/885] 3918720=test_rdoc_markup_to_html_crossref I, [2024-05-24T13:24:33.658712 #3877846] INFO -- : [454/885] 3918719=test_files_test_2 I, [2024-05-24T13:24:33.663225 #3877846] INFO -- : [455/885] 3918719=test_div I, [2024-05-24T13:24:33.674235 #3877846] INFO -- : [456/885] 3918719=test_bash_completion I, [2024-05-24T13:24:33.683695 #3877846] INFO -- : [457/885] 3918719=test_exception I, [2024-05-24T13:24:33.852224 #3877846] INFO -- : [458/885] 3918720=test_input_method I, [2024-05-24T13:24:33.880030 #3877846] INFO -- : [459/885] 3918720=test_rdoc_i18n_text I, [2024-05-24T13:24:33.898648 #3877846] INFO -- : [460/885] 3918720=test_io I, [2024-05-24T13:24:34.094592 #3877846] INFO -- : [461/885] 3918720=test_gem_unsatisfiable_dependency_error I, [2024-05-24T13:24:34.113676 #3877846] INFO -- : [462/885] 3918720=test_literal I, [2024-05-24T13:24:34.684612 #3877846] INFO -- : [463/885] 3918720=test_gem_security_signer I, [2024-05-24T13:24:34.778821 #3877846] INFO -- : [464/885] 3918720=test_config I, [2024-05-24T13:24:34.833587 #3877846] INFO -- : [465/885] 3918720=test_complex2 I, [2024-05-24T13:24:34.914015 #3877846] INFO -- : [466/885] 3918720=test_gem_util I, [2024-05-24T13:24:35.022349 #3877846] INFO -- : [467/885] 3918720=test_thread I, [2024-05-24T13:24:35.235202 #3877846] INFO -- : [468/885] 3918720=test_pkey I, [2024-05-24T13:24:35.243546 #3877846] INFO -- : [469/885] 3918720=test_external_new I, [2024-05-24T13:24:35.249870 #3877846] INFO -- : [470/885] 3918720=test_win32ole_typelib I, [2024-05-24T13:24:35.268342 #3877846] INFO -- : [471/885] 3918720=test_gem_commands_query_command I, [2024-05-24T13:24:35.918223 #3877846] INFO -- : [472/885] 3918720=test_gem_platform I, [2024-05-24T13:24:36.018732 #3877846] INFO -- : [473/885] 3918720=test_bigzero I, [2024-05-24T13:24:36.028792 #3877846] INFO -- : [474/885] 3918720=test_data I, [2024-05-24T13:24:36.042762 #3877846] INFO -- : [475/885] 3918720=test_memory_view I, [2024-05-24T13:24:36.063213 #3877846] INFO -- : [476/885] 3918720=test_null I, [2024-05-24T13:24:36.124325 #3877846] INFO -- : [477/885] 3918720=test_ractor I, [2024-05-24T13:24:36.160268 #3877846] INFO -- : [478/885] 3918720=test_m17n_comb I, [2024-05-24T13:24:38.476524 #3877846] INFO -- : [479/885] 3918720=test_multi_irb_commands I, [2024-05-24T13:24:38.485226 #3877846] INFO -- : [480/885] 3918720=test_pkey_dh I, [2024-05-24T13:24:39.312218 #3877846] INFO -- : [481/885] 3918718=test_process I, [2024-05-24T13:24:39.840319 #3877846] INFO -- : [482/885] 3918720=test_rdoc_code_object I, [2024-05-24T13:24:40.179163 #3877846] INFO -- : [483/885] 3918720=test_bmethod I, [2024-05-24T13:24:40.193782 #3877846] INFO -- : [484/885] 3918720=test_gem_source_specific_file I, [2024-05-24T13:24:40.266811 #3877846] INFO -- : [485/885] 3918720=test_provider I, [2024-05-24T13:24:40.271423 #3877846] INFO -- : [486/885] 3918720=test_euc_kr I, [2024-05-24T13:24:40.281117 #3877846] INFO -- : [487/885] 3918720=test_rand I, [2024-05-24T13:24:40.668710 #3877846] INFO -- : [488/885] 3918720=test_random_formatter I, [2024-05-24T13:24:40.689501 #3877846] INFO -- : [489/885] 3918720=test_string_processing I, [2024-05-24T13:24:40.696277 #3877846] INFO -- : [490/885] 3918720=redundant_return_test I, [2024-05-24T13:24:40.706878 #3877846] INFO -- : [491/885] 3918720=test_rdoc_markup_attributes I, [2024-05-24T13:24:40.717423 #3877846] INFO -- : [492/885] 3918720=test_securerandom I, [2024-05-24T13:24:40.726048 #3877846] INFO -- : [493/885] 3918720=test_tsort I, [2024-05-24T13:24:40.745484 #3877846] INFO -- : [494/885] 3918720=test_gem_commands_fetch_command I, [2024-05-24T13:24:40.912265 #3877846] INFO -- : [495/885] 3918720=test_typeddata I, [2024-05-24T13:24:41.136951 #3877846] INFO -- : [496/885] 3918720=parameters_signature_test I, [2024-05-24T13:24:41.162502 #3877846] INFO -- : [497/885] 3918720=test_rdoc_parser_changelog I, [2024-05-24T13:24:41.266291 #3877846] INFO -- : [498/885] 3918720=test_gem_commands_outdated_command I, [2024-05-24T13:24:41.307358 #3877846] INFO -- : [499/885] 3918720=test_gem_dependency_list I, [2024-05-24T13:24:41.384694 #3877846] INFO -- : [500/885] 3918720=test_len I, [2024-05-24T13:24:41.392194 #3877846] INFO -- : [501/885] 3918720=test_gem_doctor I, [2024-05-24T13:24:41.447955 #3877846] INFO -- : [502/885] 3918720=json_fixtures_test I, [2024-05-24T13:24:41.476827 #3877846] INFO -- : [503/885] 3918720=parse_test I, [2024-05-24T13:24:42.474518 #3877846] INFO -- : [504/885] 3918719=test_kwargs I, [2024-05-24T13:24:42.483974 #3877846] INFO -- : [505/885] 3918719=test_rdoc_parser_c I, [2024-05-24T13:24:43.164074 #3877846] INFO -- : [506/885] 3918719=test_pack I, [2024-05-24T13:24:43.389078 #3877846] INFO -- : [507/885] 3918719=test_io_wait I, [2024-05-24T13:24:43.725139 #3877846] INFO -- : [508/885] 3918719=test_rdoc_markup_indented_paragraph I, [2024-05-24T13:24:43.739072 #3877846] INFO -- : [509/885] 3918719=test_rdoc_markup_parser I, [2024-05-24T13:24:43.882564 #3877846] INFO -- : [510/885] 3918719=test_iseq_load I, [2024-05-24T13:24:44.156900 #3877846] INFO -- : [511/885] 3918720=test_ns_spki I, [2024-05-24T13:24:44.164833 #3877846] INFO -- : [512/885] 3918720=test_stream I, [2024-05-24T13:24:44.365988 #3877846] INFO -- : [513/885] 3918720=test_have_library I, [2024-05-24T13:24:44.995804 #3877846] INFO -- : [514/885] 3918720=test_objspace I, [2024-05-24T13:24:45.001914 #3877846] INFO -- : [515/885] 3918719=test_require I, [2024-05-24T13:24:45.012907 #3877846] INFO -- : [516/885] 3918719=test_stringify_symbols I, [2024-05-24T13:24:45.026587 #3877846] INFO -- : [517/885] 3918719=library_symbols_test I, [2024-05-24T13:24:45.036696 #3877846] INFO -- : [518/885] 3918719=test_rdoc_text I, [2024-05-24T13:24:45.078454 #3877846] INFO -- : [519/885] 3918719=test_deprecate I, [2024-05-24T13:24:45.132877 #3877846] INFO -- : [520/885] 3918719=test_rdoc_constant I, [2024-05-24T13:24:45.218779 #3877846] INFO -- : [521/885] 3918719=test_httpresponses I, [2024-05-24T13:24:45.243515 #3877846] INFO -- : [522/885] 3918719=test_common I, [2024-05-24T13:24:45.415713 #3877846] INFO -- : [523/885] 3918719=test_rdoc_markup_to_html_snippet I, [2024-05-24T13:24:45.488645 #3877846] INFO -- : [524/885] 3918719=test_generic I, [2024-05-24T13:24:45.513781 #3877846] INFO -- : [525/885] 3918719=test_rdoc_encoding I, [2024-05-24T13:24:45.606378 #3877846] INFO -- : [526/885] 3918719=test_win32ole_variant_outarg I, [2024-05-24T13:24:45.622644 #3877846] INFO -- : [527/885] 3918719=test_gem_request_set_lockfile I, [2024-05-24T13:24:46.074578 #3877846] INFO -- : [528/885] 3918719=test_rdoc_markdown I, [2024-05-24T13:24:46.346297 #3877846] INFO -- : [529/885] 3918719=test_key_actor_vi I, [2024-05-24T13:24:46.463096 #3877846] INFO -- : [530/885] 3918719=test_postponed_job I, [2024-05-24T13:24:46.754696 #3877846] INFO -- : [531/885] 3918719=test_gem_commands_unpack_command I, [2024-05-24T13:24:47.074344 #3877846] INFO -- : [532/885] 3918719=test_gem_ext_cargo_builder I, [2024-05-24T13:24:47.091708 #3877846] INFO -- : [533/885] 3918719=test_console_attr I, [2024-05-24T13:24:47.115921 #3877846] INFO -- : [534/885] 3918719=test_proc I, [2024-05-24T13:24:48.004724 #3877846] INFO -- : [535/885] 3918719=test_zlib I, [2024-05-24T13:24:49.301680 #3877846] INFO -- : Leaked file descriptor: TestProcess#test_seteuid_name: 11 # I, [2024-05-24T13:24:49.332044 #3877846] INFO -- : COMMAND PID USER FD TYPE DEVICE SIZE/OFF NODE NAME I, [2024-05-24T13:24:49.332115 #3877846] INFO -- : ruby 3918718 opc 11r REG 252,0 9253600 13705411 /var/lib/sss/mc/passwd I, [2024-05-24T13:24:57.238737 #3877846] INFO -- : [536/885] 3918718=test_rdoc_options I, [2024-05-24T13:24:57.517657 #3877846] INFO -- : [537/885] 3918718=test_ubf_async_safe I, [2024-05-24T13:24:57.531915 #3877846] INFO -- : [538/885] 3918718=test_pstore I, [2024-05-24T13:24:57.741299 #3877846] INFO -- : [539/885] 3918718=test_date_compat I, [2024-05-24T13:24:57.757573 #3877846] INFO -- : [540/885] 3918718=test_rdoc_include I, [2024-05-24T13:24:57.780552 #3877846] INFO -- : [541/885] 3918718=test_win32ole_record I, [2024-05-24T13:24:57.793728 #3877846] INFO -- : [542/885] 3918718=test_gem_version_option I, [2024-05-24T13:24:57.854612 #3877846] INFO -- : [543/885] 3918718=test_gem_uri I, [2024-05-24T13:24:57.891637 #3877846] INFO -- : [544/885] 3918718=test_gem_package_tar_reader_entry I, [2024-05-24T13:24:58.235088 #3877846] INFO -- : [545/885] 3918718=test_resource I, [2024-05-24T13:24:58.291353 #3877846] INFO -- : [546/885] 3918718=test_c_struct_builder I, [2024-05-24T13:24:58.524302 #3877846] INFO -- : [547/885] 3918718=test_bug-5832 I, [2024-05-24T13:24:58.531223 #3877846] INFO -- : [548/885] 3918718=test_yield_block I, [2024-05-24T13:24:58.537611 #3877846] INFO -- : [549/885] 3918718=test_enumerator I, [2024-05-24T13:24:58.543511 #3877846] INFO -- : [550/885] 3918718=test_path_to_class I, [2024-05-24T13:24:58.550300 #3877846] INFO -- : [551/885] 3918718=test_frozen_error I, [2024-05-24T13:24:58.725455 #3877846] INFO -- : [552/885] 3918718=test_gem_ext_ext_conf_builder I, [2024-05-24T13:24:59.737387 #3877846] INFO -- : [553/885] 3918718=test_gem_version I, [2024-05-24T13:24:59.910878 #3877846] INFO -- : [554/885] 3918718=test_spell_checker I, [2024-05-24T13:24:59.928740 #3877846] INFO -- : [555/885] 3918718=test_reqarg I, [2024-05-24T13:25:00.225838 #3877846] INFO -- : [556/885] 3918718=test_rdoc_markup_to_table_of_contents I, [2024-05-24T13:25:00.266774 #3877846] INFO -- : [557/885] 3918718=test_gem_name_tuple I, [2024-05-24T13:25:00.287563 #3877846] INFO -- : [558/885] 3918718=test_integer I, [2024-05-24T13:25:00.344165 #3877846] INFO -- : [559/885] 3918718=test_win32ole_method_event I, [2024-05-24T13:25:00.353892 #3877846] INFO -- : [560/885] 3918718=test_tcp I, [2024-05-24T13:25:00.445985 #3877846] INFO -- : [561/885] 3918718=parse_comments_test I, [2024-05-24T13:25:00.465746 #3877846] INFO -- : [562/885] 3918718=test_gem_requirement I, [2024-05-24T13:25:00.612710 #3877846] INFO -- : [563/885] 3918718=test_string I, [2024-05-24T13:25:02.551379 #3877846] INFO -- : [564/885] 3918719=test_macro I, [2024-05-24T13:25:02.562928 #3877846] INFO -- : [565/885] 3918719=test_pipe I, [2024-05-24T13:25:02.692368 #3877846] INFO -- : [566/885] 3918719=test_gem_resolver_activation_request I, [2024-05-24T13:25:02.715367 #3877846] INFO -- : [567/885] 3918719=test_function I, [2024-05-24T13:25:02.998182 #3877846] INFO -- : [568/885] 3918719=test_gem_commands_server_command I, [2024-05-24T13:25:03.007370 #3877846] INFO -- : [569/885] 3918719=test_hmac I, [2024-05-24T13:25:03.074570 #3877846] INFO -- : [570/885] 3918719=test_encoding I, [2024-05-24T13:25:03.466491 #3877846] INFO -- : [571/885] 3918719=test_constant I, [2024-05-24T13:25:05.167156 #3877846] INFO -- : [572/885] 3918719=test_find I, [2024-05-24T13:25:05.200643 #3877846] INFO -- : [573/885] 3918719=test_rdoc_generator_markup I, [2024-05-24T13:25:05.400746 #3877846] INFO -- : [574/885] 3918719=test_flags I, [2024-05-24T13:25:05.795444 #3877846] INFO -- : [575/885] 3918719=test_numeric I, [2024-05-24T13:25:05.871723 #3877846] INFO -- : [576/885] 3918719=test_bug-3571 I, [2024-05-24T13:25:05.884936 #3877846] INFO -- : [577/885] 3918719=test_yamlstore I, [2024-05-24T13:25:05.903089 #3877846] INFO -- : [578/885] 3918719=test_rat I, [2024-05-24T13:25:05.935768 #3877846] INFO -- : [579/885] 3918719=test_init I, [2024-05-24T13:25:06.281678 #3877846] INFO -- : [580/885] 3918719=test_gem_request_connection_pools I, [2024-05-24T13:25:07.330734 #3877846] INFO -- : [581/885] 3918719=test_capacity I, [2024-05-24T13:25:07.351186 #3877846] INFO -- : [582/885] 3918719=test_nextafter I, [2024-05-24T13:25:07.515109 #3877846] INFO -- : [583/885] 3918719=test_gem_commands_owner_command I, [2024-05-24T13:25:08.175551 #3877846] INFO -- : [584/885] 3918719=test_time I, [2024-05-24T13:25:08.294791 #3877846] INFO -- : [585/885] 3918719=test_file I, [2024-05-24T13:25:08.318612 #3877846] INFO -- : [586/885] 3918719=test_rdoc_any_method I, [2024-05-24T13:25:08.808726 #3877846] INFO -- : [587/885] 3918719=test_error_highlight I, [2024-05-24T13:25:09.515599 #3877846] INFO -- : [588/885] 3918719=test_function_entry I, [2024-05-24T13:25:09.531985 #3877846] INFO -- : [589/885] 3918719=test_string I, [2024-05-24T13:25:09.555432 #3877846] INFO -- : [590/885] 3918719=json_common_interface_test I, [2024-05-24T13:25:09.575402 #3877846] INFO -- : [591/885] 3918719=version_test I, [2024-05-24T13:25:09.587594 #3877846] INFO -- : [592/885] 3918719=test_complexrational I, [2024-05-24T13:25:09.590583 #3877846] INFO -- : [593/885] 3918719=test_raise I, [2024-05-24T13:25:09.759090 #3877846] INFO -- : [594/885] 3918719=test_string_memory I, [2024-05-24T13:25:10.066603 #3877846] INFO -- : [595/885] 3918719=test_help I, [2024-05-24T13:25:10.068632 #3877846] INFO -- : [596/885] 3918719=test_files_lib I, [2024-05-24T13:25:10.079254 #3877846] INFO -- : [597/885] 3918719=test_marshalable I, [2024-05-24T13:25:10.090137 #3877846] INFO -- : [598/885] 3918719=test_line_editor I, [2024-05-24T13:25:10.106437 #3877846] INFO -- : [599/885] 3918719=reflection_test I, [2024-05-24T13:25:10.115636 #3877846] INFO -- : [600/885] 3918719=test_enumerator_kw I, [2024-05-24T13:25:10.128303 #3877846] INFO -- : [601/885] 3918719=test_timeout I, [2024-05-24T13:25:10.143099 #3877846] INFO -- : [602/885] 3918719=test_erb_m17n I, [2024-05-24T13:25:10.154898 #3877846] INFO -- : [603/885] 3918719=test_rdoc_generator_pot_po_entry I, [2024-05-24T13:25:10.171340 #3877846] INFO -- : [604/885] 3918719=test_serialize_subclasses I, [2024-05-24T13:25:10.189929 #3877846] INFO -- : [605/885] 3918719=test_gem_resolver_index_specification I, [2024-05-24T13:25:10.243478 #3877846] INFO -- : [606/885] 3918719=test_frozen I, [2024-05-24T13:25:10.296943 #3877846] INFO -- : [607/885] 3918719=test_egrep_cpp I, [2024-05-24T13:25:10.471717 #3877846] INFO -- : [608/885] 3918719=test_webauthn_poller I, [2024-05-24T13:25:10.523747 #3877846] INFO -- : [609/885] 3918719=test_rdoc_markup_verbatim I, [2024-05-24T13:25:10.533953 #3877846] INFO -- : [610/885] 3918719=test_date_conv I, [2024-05-24T13:25:10.545775 #3877846] INFO -- : [611/885] 3918719=test_protect I, [2024-05-24T13:25:10.555891 #3877846] INFO -- : [612/885] 3918719=test_date I, [2024-05-24T13:25:10.567805 #3877846] INFO -- : [613/885] 3918719=test_big5 I, [2024-05-24T13:25:10.617115 #3877846] INFO -- : [614/885] 3918719=test_gem_commands_update_command I, [2024-05-24T13:25:12.283964 #3877846] INFO -- : [615/885] 3918719=test_tree_builder I, [2024-05-24T13:25:12.299091 #3877846] INFO -- : [616/885] 3918719=test_store I, [2024-05-24T13:25:12.616192 #3877846] INFO -- : [617/885] 3918719=test_rdoc_markup_pre_process I, [2024-05-24T13:25:12.917251 #3877846] INFO -- : [618/885] 3918719=test_tempfile I, [2024-05-24T13:25:13.257963 #3877846] INFO -- : [619/885] 3918719=test_http_request I, [2024-05-24T13:25:13.278729 #3877846] INFO -- : [620/885] 3918719=test_coverage I, [2024-05-24T13:25:13.935139 #3877846] INFO -- : [621/885] 3918719=test_pathname I, [2024-05-24T13:25:14.286807 #3877846] INFO -- : [622/885] 3918719=test_fnmatch I, [2024-05-24T13:25:14.338475 #3877846] INFO -- : [623/885] 3918719=test_io_buffer I, [2024-05-24T13:25:14.448726 #3877846] INFO -- : [624/885] 3918719=test_thread_queue I, [2024-05-24T13:25:21.350366 #3877846] INFO -- : [625/885] 3918719=test_nowrite I, [2024-05-24T13:25:21.395711 #3877846] INFO -- : [626/885] 3918719=test_passing_block I, [2024-05-24T13:25:21.419695 #3877846] INFO -- : [627/885] 3918719=test_defined I, [2024-05-24T13:25:21.504883 #3877846] INFO -- : [628/885] 3918719=test_ldap I, [2024-05-24T13:25:21.516466 #3877846] INFO -- : [629/885] 3918719=test_kdf I, [2024-05-24T13:25:21.592542 #3877846] INFO -- : [630/885] 3918719=test_comparable I, [2024-05-24T13:25:21.601704 #3877846] INFO -- : [631/885] 3918719=json_string_matching_test I, [2024-05-24T13:25:21.617180 #3877846] INFO -- : [632/885] 3918719=test_gem_config_file I, [2024-05-24T13:25:21.821040 #3877846] INFO -- : [633/885] 3918719=test_io_timeout I, [2024-05-24T13:25:21.841025 #3877846] INFO -- : [634/885] 3918719=test_rdoc_normal_module I, [2024-05-24T13:25:21.875251 #3877846] INFO -- : [635/885] 3918719=test_type_completor I, [2024-05-24T13:25:21.921573 #3877846] INFO -- : [636/885] 3918719=test_rdoc_markdown_test I, [2024-05-24T13:25:23.155953 #3877846] INFO -- : [637/885] 3918719=test_rdoc_rdoc I, [2024-05-24T13:25:23.233256 #3877846] INFO -- : [638/885] 3918719=test_yjit_exit_locations I, [2024-05-24T13:25:23.243955 #3877846] INFO -- : [639/885] 3918719=test_cstr I, [2024-05-24T13:25:25.700029 #3877846] INFO -- : [640/885] 3918720=test_gem_resolver_dependency_request I, [2024-05-24T13:25:25.737786 #3877846] INFO -- : [641/885] 3918720=test_command I, [2024-05-24T13:25:25.963811 #3877846] INFO -- : [642/885] 3918720=test_euc_tw I, [2024-05-24T13:25:25.988587 #3877846] INFO -- : [643/885] 3918720=test_gem_commands_yank_command I, [2024-05-24T13:25:26.501824 #3877846] INFO -- : [644/885] 3918720=test_yaml_tree I, [2024-05-24T13:25:26.540750 #3877846] INFO -- : [645/885] 3918720=test_pkey_dsa I, [2024-05-24T13:25:26.783750 #3877846] INFO -- : [646/885] 3918719=test_logger I, [2024-05-24T13:25:26.811880 #3877846] INFO -- : [647/885] 3918719=test_big2str I, [2024-05-24T13:25:26.836411 #3877846] INFO -- : [648/885] 3918719=test_gem_resolver_specification I, [2024-05-24T13:25:26.857721 #3877846] INFO -- : [649/885] 3918719=test_wait I, [2024-05-24T13:25:26.928306 #3877846] INFO -- : [650/885] 3918719=test_import I, [2024-05-24T13:25:30.514999 #3877846] INFO -- : [651/885] 3918718=test_human_typo I, [2024-05-24T13:25:30.523147 #3877846] INFO -- : [652/885] 3918718=test_psych I, [2024-05-24T13:25:30.553662 #3877846] INFO -- : [653/885] 3918718=test_nil I, [2024-05-24T13:25:30.562051 #3877846] INFO -- : [654/885] 3918718=test_rdoc_markup_to_rdoc I, [2024-05-24T13:25:30.615039 #3877846] INFO -- : [655/885] 3918718=test_str2big I, [2024-05-24T13:25:30.629334 #3877846] INFO -- : [656/885] 3918718=test_gem_package_tar_writer I, [2024-05-24T13:25:30.799600 #3877846] INFO -- : [657/885] 3918718=test_ractor I, [2024-05-24T13:25:30.800053 #3877846] INFO -- : [658/885] 3918718=test_case I, [2024-05-24T13:25:30.805658 #3877846] INFO -- : [659/885] 3918718=test_severity I, [2024-05-24T13:25:30.812252 #3877846] INFO -- : [660/885] 3918718=attribute_write_test I, [2024-05-24T13:25:30.819018 #3877846] INFO -- : [661/885] 3918718=test_utf16 I, [2024-05-24T13:25:30.841620 #3877846] INFO -- : [662/885] 3918718=test_http I, [2024-05-24T13:25:31.345502 #3877846] INFO -- : [663/885] 3918720=test_set I, [2024-05-24T13:25:31.364595 #3877846] INFO -- : [664/885] 3918720=test_parser_events I, [2024-05-24T13:25:31.434982 #3877846] INFO -- : [665/885] 3918720=test_filter I, [2024-05-24T13:25:31.476510 #3877846] INFO -- : [666/885] 3918720=test_json_tree I, [2024-05-24T13:25:31.480937 #3877846] INFO -- : [667/885] 3918720=test_koi8 I, [2024-05-24T13:25:31.516731 #3877846] INFO -- : [668/885] 3918720=test_gem_remote_fetcher I, [2024-05-24T13:25:31.836152 #3877846] INFO -- : [669/885] 3918719=test_pkcs12 I, [2024-05-24T13:25:32.542816 #3877846] INFO -- : [670/885] 3918719=test_yaml I, [2024-05-24T13:25:32.631462 #3877846] INFO -- : [671/885] 3918719=test_x509name I, [2024-05-24T13:25:32.636702 #3877846] INFO -- : [672/885] 3918719=test_argf I, [2024-05-24T13:25:33.627899 #3877846] INFO -- : [673/885] 3918720=test_method I, [2024-05-24T13:25:36.142906 #3877846] INFO -- : [674/885] 3918719=test_m17n I, [2024-05-24T13:25:36.301032 #3877846] INFO -- : [675/885] 3918719=test_gem_dependency I, [2024-05-24T13:25:36.451252 #3877846] INFO -- : [676/885] 3918719=test_yjit I, [2024-05-24T13:25:36.463992 #3877846] INFO -- : [677/885] 3918719=test_cclass I, [2024-05-24T13:25:36.537272 #3877846] INFO -- : [678/885] 3918719=test_gem_uninstaller I, [2024-05-24T13:25:37.850399 #3877846] INFO -- : [679/885] 3918719=test_scan_args I, [2024-05-24T13:25:37.873614 #3877846] INFO -- : [680/885] 3918719=test_gem_commands_specification_command I, [2024-05-24T13:25:38.011997 #3877846] INFO -- : [681/885] 3918719=encoding_test I, [2024-05-24T13:25:38.082069 #3877846] INFO -- : [682/885] 3918719=test_gem_package_old I, [2024-05-24T13:25:38.152347 #3877846] INFO -- : [683/885] 3918719=test_gem_commands_which_command I, [2024-05-24T13:25:38.191107 #3877846] INFO -- : [684/885] 3918719=test_gem_request I, [2024-05-24T13:25:38.445640 #3877846] INFO -- : [685/885] 3918719=test_gem_dependency_installer I, [2024-05-24T13:25:39.622371 #3877846] INFO -- : [686/885] 3918718=test_pty I, [2024-05-24T13:25:40.115356 #3877846] INFO -- : [687/885] 3918718=parser_test I, [2024-05-24T13:25:40.134758 #3877846] INFO -- : [688/885] 3918718=test_hash I, [2024-05-24T13:25:41.220712 #3877846] INFO -- : [689/885] 3918719=test_http I, [2024-05-24T13:25:41.244816 #3877846] INFO -- : [690/885] 3918719=test_gem_gemcutter_utilities I, [2024-05-24T13:25:41.714599 #3877846] INFO -- : [691/885] 3918719=test_gem_source_local I, [2024-05-24T13:25:41.995386 #3877846] INFO -- : [692/885] 3918719=desugar_compiler_test I, [2024-05-24T13:25:42.006102 #3877846] INFO -- : [693/885] 3918719=test_win32ole I, [2024-05-24T13:25:42.016542 #3877846] INFO -- : [694/885] 3918719=test_internal_ivar I, [2024-05-24T13:25:42.026007 #3877846] INFO -- : [695/885] 3918719=test_rendering I, [2024-05-24T13:25:42.054012 #3877846] INFO -- : [696/885] 3918719=test_settracefunc I, [2024-05-24T13:25:43.283715 #3877846] INFO -- : [697/885] 3918719=test_gem_text I, [2024-05-24T13:25:43.344959 #3877846] INFO -- : [698/885] 3918719=test_tracepoint I, [2024-05-24T13:25:43.619150 #3877846] INFO -- : [699/885] 3918720=test_backtrace I, [2024-05-24T13:25:43.690925 #3877846] INFO -- : [700/885] 3918719=test_rdoc_task I, [2024-05-24T13:25:43.720148 #3877846] INFO -- : [701/885] 3918719=locals_test I, [2024-05-24T13:25:43.924187 #3877846] INFO -- : [702/885] 3918718=test_gem_commands_push_command I, [2024-05-24T13:25:44.200087 #3877846] INFO -- : [703/885] 3918719=test_sprintf_comb I, [2024-05-24T13:25:44.356154 #3877846] INFO -- : [704/885] 3918719=test_method_cache I, [2024-05-24T13:25:44.373769 #3877846] INFO -- : [705/885] 3918719=test_too_many_dummy_encodings I, [2024-05-24T13:25:44.436249 #3877846] INFO -- : [706/885] 3918719=test_rdoc_generator_json_index I, [2024-05-24T13:25:44.481102 #3877846] INFO -- : [707/885] 3918719=test_date_time I, [2024-05-24T13:25:44.487539 #3877846] INFO -- : [708/885] 3918718=test_nil2vtempty I, [2024-05-24T13:25:44.490224 #3877846] INFO -- : [709/885] 3918719=test_weakmap I, [2024-05-24T13:25:44.496508 #3877846] INFO -- : [710/885] 3918718=test_coderange I, [2024-05-24T13:25:44.498645 #3877846] INFO -- : [711/885] 3918718=test_ansi_with_terminfo I, [2024-05-24T13:25:44.506465 #3877846] INFO -- : [712/885] 3918718=test_inadvertent_creation I, [2024-05-24T13:25:44.592022 #3877846] INFO -- : [713/885] 3918718=test_framework I, [2024-05-24T13:25:44.646870 #3877846] INFO -- : [714/885] 3918718=test_pinned I, [2024-05-24T13:25:44.711063 #3877846] INFO -- : [715/885] 3918718=test_cgi_tag_helper I, [2024-05-24T13:25:44.765722 #3877846] INFO -- : [716/885] 3918718=test_pack I, [2024-05-24T13:25:44.775889 #3877846] INFO -- : [717/885] 3918718=test_safe_load I, [2024-05-24T13:25:44.784632 #3877846] INFO -- : [718/885] 3918718=test_iso_8859 I, [2024-05-24T13:25:44.832567 #3877846] INFO -- : [719/885] 3918718=ripper_test I, [2024-05-24T13:25:44.889062 #3877846] INFO -- : [720/885] 3918720=test_libs I, [2024-05-24T13:25:44.896174 #3877846] INFO -- : [721/885] 3918720=test_math I, [2024-05-24T13:25:44.917948 #3877846] INFO -- : [722/885] 3918720=test_gc I, [2024-05-24T13:25:44.919739 #3877846] INFO -- : [723/885] 3918720=comments_test I, [2024-05-24T13:25:44.930939 #3877846] INFO -- : [724/885] 3918720=test_qsort I, [2024-05-24T13:25:44.942113 #3877846] INFO -- : [725/885] 3918720=test_exit I, [2024-05-24T13:25:45.048791 #3877846] INFO -- : [726/885] 3918720=test_class I, [2024-05-24T13:25:45.357532 #3877846] INFO -- : [727/885] 3918718=index_write_test I, [2024-05-24T13:25:45.379547 #3877846] INFO -- : [728/885] 3918718=test_rdoc_parser_rd I, [2024-05-24T13:25:45.396892 #3877846] INFO -- : [729/885] 3918718=test_const I, [2024-05-24T13:25:45.404051 #3877846] INFO -- : [730/885] 3918718=test_recorder I, [2024-05-24T13:25:45.415484 #3877846] INFO -- : [731/885] 3918718=test_yaml_special_cases I, [2024-05-24T13:25:45.435615 #3877846] INFO -- : [732/885] 3918718=test_gem_commands_sources_command I, [2024-05-24T13:25:45.641479 #3877846] INFO -- : [733/885] 3918718=test_name_error I, [2024-05-24T13:25:45.738727 #3877846] INFO -- : [734/885] 3918718=json_addition_test I, [2024-05-24T13:25:45.751079 #3877846] INFO -- : [735/885] 3918718=test_gem_source_list I, [2024-05-24T13:25:45.911072 #3877846] INFO -- : [736/885] 3918718=test_sprintf I, [2024-05-24T13:25:46.101957 #3877846] INFO -- : [737/885] 3918718=test_enc_associate I, [2024-05-24T13:25:46.529794 #3877846] INFO -- : [738/885] 3918718=test_enumerator I, [2024-05-24T13:25:47.531887 #3877846] INFO -- : [739/885] 3918720=test_case I, [2024-05-24T13:25:47.566517 #3877846] INFO -- : [740/885] 3918720=test_open-uri I, [2024-05-24T13:25:47.909149 #3877846] INFO -- : [741/885] 3918720=test_array I, [2024-05-24T13:25:47.925490 #3877846] INFO -- : [742/885] 3918720=test_gem_command_manager I, [2024-05-24T13:25:48.158550 #3877846] INFO -- : [743/885] 3918720=test_rdoc_context I, [2024-05-24T13:25:48.947785 #3877846] INFO -- : [744/885] 3918720=test_win32ole_variable I, [2024-05-24T13:25:48.950578 #3877846] INFO -- : [745/885] 3918720=test_method_cache I, [2024-05-24T13:25:48.964736 #3877846] INFO -- : [746/885] 3918720=test_rdoc_cross_reference I, [2024-05-24T13:25:49.423289 #3877846] INFO -- : [747/885] 3918720=test_parse I, [2024-05-24T13:25:49.915218 #3877846] INFO -- : [748/885] 3918720=test_rdoc_class_module I, [2024-05-24T13:25:50.545811 #3877846] INFO -- : [749/885] 3918720=test_gem_specification I, [2024-05-24T13:25:53.041483 #3877846] INFO -- : [750/885] 3918720=test_system I, [2024-05-24T13:25:53.917883 #3877846] INFO -- : [751/885] 3918720=test_numhash I, [2024-05-24T13:25:53.930159 #3877846] INFO -- : [752/885] 3918720=test_flush I, [2024-05-24T13:25:54.006405 #3877846] INFO -- : [753/885] 3918720=test_pkey_rsa I, [2024-05-24T13:25:54.278093 #3877846] INFO -- : [754/885] 3918720=test_stringchar I, [2024-05-24T13:25:54.292024 #3877846] INFO -- : [755/885] 3918720=warnings_test I, [2024-05-24T13:25:54.312543 #3877846] INFO -- : [756/885] 3918720=test_face I, [2024-05-24T13:25:54.341648 #3877846] INFO -- : [757/885] 3918720=test_gem_request_set_lockfile_parser I, [2024-05-24T13:25:55.269903 #3877846] INFO -- : [758/885] 3918720=test_sizeof I, [2024-05-24T13:25:56.792065 #3877846] INFO -- : [759/885] 3918720=test_date_attr I, [2024-05-24T13:25:56.817460 #3877846] INFO -- : [760/885] 3918720=test_gem_install_update_options I, [2024-05-24T13:25:56.942760 #3877846] INFO -- : [761/885] 3918720=test_econv I, [2024-05-24T13:25:57.842662 #3877846] INFO -- : [762/885] 3918720=test_gem_dependency_resolution_error I, [2024-05-24T13:25:57.872072 #3877846] INFO -- : [763/885] 3918720=test_fileutils I, [2024-05-24T13:26:00.443942 #3877846] INFO -- : [764/885] 3918720=test_sleep I, [2024-05-24T13:26:00.491550 #3877846] INFO -- : [765/885] 3918720=test_mixed_unicode_escapes I, [2024-05-24T13:26:00.497706 #3877846] INFO -- : [766/885] 3918720=test_jaro_winkler I, [2024-05-24T13:26:00.503733 #3877846] INFO -- : [767/885] 3918720=test_cp949 I, [2024-05-24T13:26:00.516817 #3877846] INFO -- : [768/885] 3918720=test_gem_resolver_vendor_set I, [2024-05-24T13:26:00.536449 #3877846] INFO -- : [769/885] 3918720=test_condition I, [2024-05-24T13:26:00.547055 #3877846] INFO -- : [770/885] 3918720=test_emoji I, [2024-05-24T13:26:00.649848 #3877846] INFO -- : [771/885] 3918720=test_sorted_set I, [2024-05-24T13:26:00.808161 #3877846] INFO -- : [772/885] 3918720=test_windows_1252 I, [2024-05-24T13:26:01.535599 #3877846] INFO -- : [773/885] 3918720=test_stack I, [2024-05-24T13:26:02.031164 #3877846] INFO -- : [774/885] 3918720=memsize_test I, [2024-05-24T13:26:02.041042 #3877846] INFO -- : [775/885] 3918720=test_gem_resolver_requirement_list I, [2024-05-24T13:26:02.053559 #3877846] INFO -- : [776/885] 3918720=test_noarg I, [2024-05-24T13:26:02.241787 #3877846] INFO -- : [777/885] 3918720=test_exception I, [2024-05-24T13:26:02.371536 #3877846] INFO -- : [778/885] 3918720=test_raise_exception I, [2024-05-24T13:26:02.899456 #3877846] INFO -- : [779/885] 3918720=test_arith_seq_beg_len_step I, [2024-05-24T13:26:02.979572 #3877846] INFO -- : [780/885] 3918720=test_gem_impossible_dependencies_error I, [2024-05-24T13:26:02.981556 #3877846] INFO -- : [781/885] 3918719=test_pp I, [2024-05-24T13:26:02.996011 #3877846] INFO -- : [782/885] 3918720=test_gem_security I, [2024-05-24T13:26:03.109130 #3877846] INFO -- : [783/885] 3918719=test_key_actor_emacs I, [2024-05-24T13:26:03.429660 #3877846] INFO -- : [784/885] 3918719=test_date_ractor I, [2024-05-24T13:26:03.453538 #3877846] INFO -- : [785/885] 3918719=test_erb I, [2024-05-24T13:26:03.528691 #3877846] INFO -- : [786/885] 3918719=test_basicinstructions I, [2024-05-24T13:26:03.625546 #3877846] INFO -- : [787/885] 3918719=test_gem_resolver_git_specification I, [2024-05-24T13:26:03.914707 #3877846] INFO -- : [788/885] 3918719=test_utf32 I, [2024-05-24T13:26:04.044023 #3877846] INFO -- : [789/885] 3918719=test_rdoc_tom_doc I, [2024-05-24T13:26:04.072480 #3877846] INFO -- : [790/885] 3918719=test_optarg I, [2024-05-24T13:26:04.171794 #3877846] INFO -- : [791/885] 3918719=test_gem_commands_pristine_command I, [2024-05-24T13:26:05.668619 #3877846] INFO -- : [792/885] 3918719=test_variable I, [2024-05-24T13:26:05.757546 #3877846] INFO -- : [793/885] 3918719=test_hash I, [2024-05-24T13:26:05.792073 #3877846] INFO -- : [794/885] 3918719=test_gem_update_suggestion I, [2024-05-24T13:26:05.897288 #3877846] INFO -- : [795/885] 3918719=test_assignment I, [2024-05-24T13:26:07.429019 #3877846] INFO -- : [796/885] 3918719=test_gem_commands_open_command I, [2024-05-24T13:26:07.462480 #3877846] INFO -- : [797/885] 3918719=test_verbose I, [2024-05-24T13:26:07.495473 #3877846] INFO -- : [798/885] 3918719=test_emoji_breaks I, [2024-05-24T13:26:07.497917 #3877846] INFO -- : [799/885] 3918719=test_normalize I, [2024-05-24T13:26:07.509316 #3877846] INFO -- : [800/885] 3918719=test_undef I, [2024-05-24T13:26:07.526262 #3877846] INFO -- : [801/885] 3918719=test_gem_resolver_lock_set I, [2024-05-24T13:26:07.554595 #3877846] INFO -- : [802/885] 3918719=test_random I, [2024-05-24T13:26:07.596958 #3877846] INFO -- : [803/885] 3918719=test_rdoc_generator_darkfish I, [2024-05-24T13:26:07.957931 #3877846] INFO -- : [804/885] 3918719=test_asn1 I, [2024-05-24T13:26:07.990898 #3877846] INFO -- : [805/885] 3918719=test_gem_command I, [2024-05-24T13:26:09.104371 #3877846] INFO -- : [806/885] 3918719=test_threadgroup I, [2024-05-24T13:26:09.123538 #3877846] INFO -- : [807/885] 3918719=test_complex I, [2024-05-24T13:26:09.203479 #3877846] INFO -- : [808/885] 3918719=test_array_create I, [2024-05-24T13:26:09.231784 #3877846] INFO -- : [809/885] 3918719=test_dir_m17n I, [2024-05-24T13:26:10.547761 #3877846] INFO -- : [810/885] 3918719=test_memory_view I, [2024-05-24T13:26:10.573953 #3877846] INFO -- : [811/885] 3918720=!Nothing_to_test I, [2024-05-24T13:26:10.575560 #3877846] INFO -- : [812/885] 3918720=test_fd_setsize I, [2024-05-24T13:26:10.585885 #3877846] INFO -- : [813/885] 3918720=test_forwardable I, [2024-05-24T13:26:10.639032 #3877846] INFO -- : [814/885] 3918720=test_process I, [2024-05-24T13:26:10.659525 #3877846] INFO -- : [815/885] 3918720=test_gem_commands_install_command I, [2024-05-24T13:26:11.417601 #3877846] INFO -- : [816/885] 3918719=test_string I, [2024-05-24T13:26:11.430491 #3877846] INFO -- : [817/885] 3918719=test_iterator I, [2024-05-24T13:26:11.510415 #3877846] INFO -- : [818/885] 3918719=pattern_test I, [2024-05-24T13:26:11.534497 #3877846] INFO -- : [819/885] 3918719=test_dot_dot I, [2024-05-24T13:26:11.561484 #3877846] INFO -- : [820/885] 3918719=test_gem_rdoc I, [2024-05-24T13:26:11.722700 #3877846] INFO -- : [821/885] 3918719=test_rendering I, [2024-05-24T13:26:11.726560 #3877846] INFO -- : [822/885] 3918719=test_kernel I, [2024-05-24T13:26:12.396477 #3877846] INFO -- : [823/885] 3918719=test_cesu8 I, [2024-05-24T13:26:12.404695 #3877846] INFO -- : [824/885] 3918719=test_rdoc_extend I, [2024-05-24T13:26:12.436332 #3877846] INFO -- : [825/885] 3918719=test_did_you_mean I, [2024-05-24T13:26:12.509178 #3877846] INFO -- : [826/885] 3918719=test_shapes I, [2024-05-24T13:26:12.523429 #3877846] INFO -- : [827/885] 3918719=test_merge_keys I, [2024-05-24T13:26:12.548262 #3877846] INFO -- : [828/885] 3918719=test_storage I, [2024-05-24T13:26:12.560135 #3877846] INFO -- : [829/885] 3918719=test_method_name_check I, [2024-05-24T13:26:12.602466 #3877846] INFO -- : [830/885] 3918720=test_err_in_callback I, [2024-05-24T13:26:12.604480 #3877846] INFO -- : [831/885] 3918720=test_tree_spell_checker I, [2024-05-24T13:26:12.629404 #3877846] INFO -- : [832/885] 3918719=static_literals_test I, [2024-05-24T13:26:12.649632 #3877846] INFO -- : [833/885] 3918720=test_enumerable I, [2024-05-24T13:26:12.654933 #3877846] INFO -- : [834/885] 3918720=test_rdoc_method_attr I, [2024-05-24T13:26:12.665489 #3877846] INFO -- : [835/885] 3918719=test_set I, [2024-05-24T13:26:12.718108 #3877846] INFO -- : [836/885] 3918719=test_grapheme_breaks I, [2024-05-24T13:26:12.739337 #3877846] INFO -- : [837/885] 3918719=test_hash_create I, [2024-05-24T13:26:12.746592 #3877846] INFO -- : [838/885] 3918719=test_unicode_escape I, [2024-05-24T13:26:12.823530 #3877846] INFO -- : [839/885] 3918720=test_default_gems I, [2024-05-24T13:26:12.827540 #3877846] INFO -- : [840/885] 3918720=test_switch_hitter I, [2024-05-24T13:26:12.834506 #3877846] INFO -- : [841/885] 3918719=test_yamldbm I, [2024-05-24T13:26:12.841196 #3877846] INFO -- : [842/885] 3918719=test_gem_spec_fetcher I, [2024-05-24T13:26:12.861772 #3877846] INFO -- : [843/885] 3918720=test_gem_commands_dependency_command I, [2024-05-24T13:26:12.959998 #3877846] INFO -- : [844/885] 3918720=test_backtrace I, [2024-05-24T13:26:12.964732 #3877846] INFO -- : [845/885] 3918720=test_gbk I, [2024-05-24T13:26:12.973576 #3877846] INFO -- : [846/885] 3918720=test_mdns I, [2024-05-24T13:26:12.979031 #3877846] INFO -- : [847/885] 3918720=test_open3 I, [2024-05-24T13:26:13.051089 #3877846] INFO -- : [848/885] 3918719=test_date_parse I, [2024-05-24T13:26:13.161770 #3877846] INFO -- : [849/885] 3918719=test_key_event_record I, [2024-05-24T13:26:13.175891 #3877846] INFO -- : [850/885] 3918719=test_pkey_ec I, [2024-05-24T13:26:13.203656 #3877846] INFO -- : [851/885] 3918719=test_svcb_https I, [2024-05-24T13:26:13.219933 #3877846] INFO -- : [852/885] 3918719=test_buffering I, [2024-05-24T13:26:13.243269 #3877846] INFO -- : [853/885] 3918719=test_arity I, [2024-05-24T13:26:13.248820 #3877846] INFO -- : [854/885] 3918719=test_thread I, [2024-05-24T13:26:13.249271 #3877846] INFO -- : [855/885] 3918719=test_rational I, [2024-05-24T13:26:13.312215 #3877846] INFO -- : [856/885] 3918719=test_case_mapping I, [2024-05-24T13:26:13.320347 #3877846] INFO -- : [857/885] 3918719=test_gem_ext_cargo_builder_unit I, [2024-05-24T13:26:13.396774 #3877846] INFO -- : [858/885] 3918719=test_webauthn_listener I, [2024-05-24T13:26:13.623919 #3877846] INFO -- : [859/885] 3918719=test_ractor I, [2024-05-24T13:26:13.646278 #3877846] INFO -- : [860/885] 3918719=test_gem_resolver_api_specification I, [2024-05-24T13:26:13.701315 #3877846] INFO -- : [861/885] 3918719=test_rdoc_rubygems_hook I, [2024-05-24T13:26:13.776044 #3877846] INFO -- : [862/885] 3918719=test_yield I, [2024-05-24T13:26:15.867621 #3877846] INFO -- : [863/885] 3918720=test_remote_fetch_error I, [2024-05-24T13:26:15.889727 #3877846] INFO -- : [864/885] 3918720=test_show_source I, [2024-05-24T13:26:15.898857 #3877846] INFO -- : [865/885] 3918720=regexp_test I, [2024-05-24T13:26:16.024895 #3877846] INFO -- : [866/885] 3918720=test_optimization I, [2024-05-24T13:26:16.381957 #3877846] INFO -- : [867/885] 3918718=test_force_exit I, [2024-05-24T13:26:16.438248 #3877846] INFO -- : [868/885] 3918718=test_files_sample I, [2024-05-24T13:26:16.624866 #3877846] INFO -- : [869/885] 3918718=test_rdoc_stats I, [2024-05-24T13:26:16.659391 #3877846] INFO -- : [870/885] 3918718=test_data_error I, [2024-05-24T13:26:16.772038 #3877846] INFO -- : [871/885] 3918718=test_rubyoptions I, [2024-05-24T13:26:17.189029 #3877846] INFO -- : [872/885] 3918719=test_shift_jis I, [2024-05-24T13:26:17.226005 #3877846] INFO -- : [873/885] 3918719=test_rdoc_store I, [2024-05-24T13:26:17.906957 #3877846] INFO -- : [874/885] 3918719=test_ole_methods I, [2024-05-24T13:26:17.932297 #3877846] INFO -- : [875/885] 3918719=test_cgi_util I, [2024-05-24T13:26:18.163076 #3877846] INFO -- : [876/885] 3918719=test_gem_uri_formatter I, [2024-05-24T13:26:18.189854 #3877846] INFO -- : [877/885] 3918719=test_prettyprint I, [2024-05-24T13:26:18.258528 #3877846] INFO -- : [878/885] 3918719=test_enc_raise I, [2024-05-24T13:26:18.270206 #3877846] INFO -- : [879/885] 3918719=test_clone I, [2024-05-24T13:26:18.442546 #3877846] INFO -- : [880/885] 3918719=test_gem_resolver_lock_specification I, [2024-05-24T13:26:18.503875 #3877846] INFO -- : [881/885] 3918719=test_boolean I, [2024-05-24T13:26:18.521552 #3877846] INFO -- : [882/885] 3918719=test_queue I, [2024-05-24T13:26:18.534752 #3877846] INFO -- : [883/885] 3918719=test_rdoc_i18n_locale I, [2024-05-24T13:26:18.611525 #3877846] INFO -- : [884/885] 3918719=test_gc_compact I, [2024-05-24T13:26:22.570772 #3877846] INFO -- : [885/885] 3918720=test_dryrun I, [2024-05-24T13:26:23.183757 #3877846] INFO -- : Finished tests in 214.906126s, 122.3744 tests/s, 43514.9300 assertions/s. I, [2024-05-24T13:26:23.188641 #3877846] INFO -- : 26299 tests, 9351625 assertions, 0 failures, 0 errors, 322 skips I, [2024-05-24T13:26:23.188677 #3877846] INFO -- : I, [2024-05-24T13:26:23.188689 #3877846] INFO -- : ruby -v: ruby 3.4.0dev (2024-05-24T08:00:15Z master e49d68bf27) [aarch64-linux] I, [2024-05-24T13:26:23.189604 #3877846] INFO -- : $$$[end] "make yes-test-all TESTOPTS='--stderr-on-failure' TESTS='-j3'" exit with 0. I, [2024-05-24T13:26:23.189772 #3877846] INFO -- : $$$[beg] make yes-test-rubyspec MSPECOPT='--error-output stderr --debug -j' TESTS='-j3' I, [2024-05-24T13:26:23.315620 #3877846] INFO -- : BASERUBY = /usr/local/bin/ruby --disable=gems I, [2024-05-24T13:26:23.315695 #3877846] INFO -- : CC = gcc I, [2024-05-24T13:26:23.315707 #3877846] INFO -- : LD = ld I, [2024-05-24T13:26:23.315717 #3877846] INFO -- : LDSHARED = gcc -shared I, [2024-05-24T13:26:23.315729 #3877846] INFO -- : CFLAGS = -O3 -fno-fast-math -ggdb3 -Wall -Wextra -Wdeprecated-declarations -Wdiv-by-zero -Wduplicated-cond -Wimplicit-function-declaration -Wimplicit-int -Wpointer-arith -Wwrite-strings -Wold-style-definition -Wimplicit-fallthrough=0 -Wmissing-noreturn -Wno-cast-function-type -Wno-constant-logical-operand -Wno-long-long -Wno-missing-field-initializers -Wno-overlength-strings -Wno-packed-bitfield-compat -Wno-parentheses-equality -Wno-self-assign -Wno-tautological-compare -Wno-unused-parameter -Wno-unused-value -Wsuggest-attribute=format -Wsuggest-attribute=noreturn -Wunused-variable -Wmisleading-indentation -Wundef I, [2024-05-24T13:26:23.315739 #3877846] INFO -- : XCFLAGS = -U_FORTIFY_SOURCE -D_FORTIFY_SOURCE=2 -fstack-protector-strong -msign-return-address=all -fno-strict-overflow -fvisibility=hidden -fexcess-precision=standard -DRUBY_EXPORT -fPIE -I. -I.ext/include/aarch64-linux -I/home/opc/ruby/src/master/include -I/home/opc/ruby/src/master -I/home/opc/ruby/src/master/prism -I/home/opc/ruby/src/master/enc/unicode/15.0.0 I, [2024-05-24T13:26:23.315749 #3877846] INFO -- : CPPFLAGS = I, [2024-05-24T13:26:23.315758 #3877846] INFO -- : DLDFLAGS = -Wl,--compress-debug-sections=zlib -fstack-protector-strong -pie I, [2024-05-24T13:26:23.315767 #3877846] INFO -- : SOLIBS = -lz -lrt -lrt -ldl -lcrypt -lm -lpthread I, [2024-05-24T13:26:23.315776 #3877846] INFO -- : LANG = en_US.UTF-8 I, [2024-05-24T13:26:23.315784 #3877846] INFO -- : LC_ALL = I, [2024-05-24T13:26:23.315793 #3877846] INFO -- : LC_CTYPE = I, [2024-05-24T13:26:23.315801 #3877846] INFO -- : MFLAGS = I, [2024-05-24T13:26:23.315809 #3877846] INFO -- : RUSTC = rustc I, [2024-05-24T13:26:23.315818 #3877846] INFO -- : YJIT_RUSTC_ARGS = --crate-name=yjit --crate-type=staticlib --edition=2021 -g -C lto=thin -C opt-level=3 -C overflow-checks=on '--out-dir=/home/opc/ruby/build/master/yjit/target/release/' /home/opc/ruby/src/master/yjit/src/lib.rs I, [2024-05-24T13:26:23.316529 #3877846] INFO -- : gcc (GCC) 8.5.0 20210514 (Red Hat 8.5.0-10.1.0.1) I, [2024-05-24T13:26:23.316550 #3877846] INFO -- : Copyright (C) 2018 Free Software Foundation, Inc. I, [2024-05-24T13:26:23.316561 #3877846] INFO -- : This is free software; see the source for copying conditions. There is NO I, [2024-05-24T13:26:23.316570 #3877846] INFO -- : warranty; not even for MERCHANTABILITY or FITNESS FOR A PARTICULAR PURPOSE. I, [2024-05-24T13:26:23.316579 #3877846] INFO -- : I, [2024-05-24T13:26:23.318659 #3877846] INFO -- : generating enc.mk I, [2024-05-24T13:26:23.552514 #3877846] INFO -- : generating encdb.h I, [2024-05-24T13:26:23.590546 #3877846] INFO -- : encdb.h unchanged I, [2024-05-24T13:26:23.591752 #3877846] INFO -- : making enc I, [2024-05-24T13:26:23.619428 #3877846] INFO -- : make[1]: Entering directory '/home/opc/ruby/build/master' I, [2024-05-24T13:26:23.619467 #3877846] INFO -- : make[1]: Nothing to be done for 'enc'. I, [2024-05-24T13:26:23.619478 #3877846] INFO -- : make[1]: Leaving directory '/home/opc/ruby/build/master' I, [2024-05-24T13:26:23.620179 #3877846] INFO -- : making srcs under enc I, [2024-05-24T13:26:23.663397 #3877846] INFO -- : make[1]: Entering directory '/home/opc/ruby/build/master' I, [2024-05-24T13:26:23.663456 #3877846] INFO -- : make[1]: Nothing to be done for 'srcs'. I, [2024-05-24T13:26:23.663468 #3877846] INFO -- : make[1]: Leaving directory '/home/opc/ruby/build/master' I, [2024-05-24T13:26:23.664594 #3877846] INFO -- : generating transdb.h I, [2024-05-24T13:26:23.810599 #3877846] INFO -- : transdb.h unchanged I, [2024-05-24T13:26:23.811991 #3877846] INFO -- : making trans I, [2024-05-24T13:26:23.862144 #3877846] INFO -- : make[1]: Entering directory '/home/opc/ruby/build/master' I, [2024-05-24T13:26:23.862201 #3877846] INFO -- : make[1]: Nothing to be done for 'trans'. I, [2024-05-24T13:26:23.862212 #3877846] INFO -- : make[1]: Leaving directory '/home/opc/ruby/build/master' I, [2024-05-24T13:26:23.862968 #3877846] INFO -- : making encs I, [2024-05-24T13:26:23.916295 #3877846] INFO -- : make[1]: Entering directory '/home/opc/ruby/build/master' I, [2024-05-24T13:26:23.916373 #3877846] INFO -- : make[1]: Nothing to be done for 'encs'. I, [2024-05-24T13:26:23.916385 #3877846] INFO -- : make[1]: Leaving directory '/home/opc/ruby/build/master' I, [2024-05-24T13:26:23.918421 #3877846] INFO -- : generating makefiles ext/configure-ext.mk I, [2024-05-24T13:26:23.959890 #3877846] INFO -- : ext/configure-ext.mk updated I, [2024-05-24T13:26:23.963442 #3877846] INFO -- : make[1]: Entering directory '/home/opc/ruby/build/master' I, [2024-05-24T13:26:26.102953 #3877846] INFO -- : make[1]: Leaving directory '/home/opc/ruby/build/master' I, [2024-05-24T13:26:26.103710 #3877846] INFO -- : generating makefile exts.mk I, [2024-05-24T13:26:26.164552 #3877846] INFO -- : exts.mk unchanged I, [2024-05-24T13:26:26.169683 #3877846] INFO -- : make[1]: Entering directory '/home/opc/ruby/build/master' I, [2024-05-24T13:26:26.468523 #3877846] INFO -- : make[2]: Entering directory '/home/opc/ruby/build/master/ext/coverage' I, [2024-05-24T13:26:26.473146 #3877846] INFO -- : make[2]: Leaving directory '/home/opc/ruby/build/master/ext/coverage' I, [2024-05-24T13:26:26.478796 #3877846] INFO -- : make[2]: Entering directory '/home/opc/ruby/build/master/ext/date' I, [2024-05-24T13:26:26.484037 #3877846] INFO -- : make[2]: Leaving directory '/home/opc/ruby/build/master/ext/date' I, [2024-05-24T13:26:26.487327 #3877846] INFO -- : make[2]: Entering directory '/home/opc/ruby/build/master/ext/digest' I, [2024-05-24T13:26:26.496235 #3877846] INFO -- : make[2]: Leaving directory '/home/opc/ruby/build/master/ext/digest' I, [2024-05-24T13:26:26.518478 #3877846] INFO -- : make[2]: Entering directory '/home/opc/ruby/build/master/ext/digest/sha2' I, [2024-05-24T13:26:26.523394 #3877846] INFO -- : make[2]: Leaving directory '/home/opc/ruby/build/master/ext/digest/sha2' I, [2024-05-24T13:26:26.541329 #3877846] INFO -- : make[2]: Entering directory '/home/opc/ruby/build/master/ext/fiddle' I, [2024-05-24T13:26:26.551556 #3877846] INFO -- : make[2]: Leaving directory '/home/opc/ruby/build/master/ext/fiddle' I, [2024-05-24T13:26:26.555806 #3877846] INFO -- : make[2]: Entering directory '/home/opc/ruby/build/master/ext/io/console' I, [2024-05-24T13:26:26.560021 #3877846] INFO -- : make[2]: Leaving directory '/home/opc/ruby/build/master/ext/io/console' I, [2024-05-24T13:26:26.570485 #3877846] INFO -- : make[2]: Entering directory '/home/opc/ruby/build/master/ext/json' I, [2024-05-24T13:26:26.579870 #3877846] INFO -- : make[2]: Leaving directory '/home/opc/ruby/build/master/ext/json' I, [2024-05-24T13:26:26.592656 #3877846] INFO -- : make[2]: Entering directory '/home/opc/ruby/build/master/ext/monitor' I, [2024-05-24T13:26:26.596701 #3877846] INFO -- : make[2]: Leaving directory '/home/opc/ruby/build/master/ext/monitor' I, [2024-05-24T13:26:26.602818 #3877846] INFO -- : make[2]: Entering directory '/home/opc/ruby/build/master/ext/objspace' I, [2024-05-24T13:26:26.608807 #3877846] INFO -- : make[2]: Leaving directory '/home/opc/ruby/build/master/ext/objspace' I, [2024-05-24T13:26:26.627833 #3877846] INFO -- : make[2]: Entering directory '/home/opc/ruby/build/master/ext/openssl' I, [2024-05-24T13:26:26.649555 #3877846] INFO -- : make[2]: Leaving directory '/home/opc/ruby/build/master/ext/openssl' I, [2024-05-24T13:26:26.653874 #3877846] INFO -- : make[2]: Entering directory '/home/opc/ruby/build/master/ext/pathname' I, [2024-05-24T13:26:26.658135 #3877846] INFO -- : make[2]: Leaving directory '/home/opc/ruby/build/master/ext/pathname' I, [2024-05-24T13:26:26.664399 #3877846] INFO -- : make[2]: Entering directory '/home/opc/ruby/build/master/ext/psych' I, [2024-05-24T13:26:26.685957 #3877846] INFO -- : make[2]: Leaving directory '/home/opc/ruby/build/master/ext/psych' I, [2024-05-24T13:26:26.690511 #3877846] INFO -- : make[2]: Entering directory '/home/opc/ruby/build/master/ext/pty' I, [2024-05-24T13:26:26.694689 #3877846] INFO -- : make[2]: Leaving directory '/home/opc/ruby/build/master/ext/pty' I, [2024-05-24T13:26:26.709073 #3877846] INFO -- : make[2]: Entering directory '/home/opc/ruby/build/master/ext/ripper' I, [2024-05-24T13:26:26.716736 #3877846] INFO -- : make[2]: Leaving directory '/home/opc/ruby/build/master/ext/ripper' I, [2024-05-24T13:26:26.718656 #3877846] INFO -- : make[2]: Entering directory '/home/opc/ruby/build/master/ext/rubyvm' I, [2024-05-24T13:26:26.722226 #3877846] INFO -- : make[2]: Leaving directory '/home/opc/ruby/build/master/ext/rubyvm' I, [2024-05-24T13:26:26.734367 #3877846] INFO -- : make[2]: Entering directory '/home/opc/ruby/build/master/ext/socket' I, [2024-05-24T13:26:26.745159 #3877846] INFO -- : make[2]: Leaving directory '/home/opc/ruby/build/master/ext/socket' I, [2024-05-24T13:26:26.760654 #3877846] INFO -- : make[2]: Entering directory '/home/opc/ruby/build/master/.bundle/gems/bigdecimal-3.1.7/ext/bigdecimal' I, [2024-05-24T13:26:26.791689 #3877846] INFO -- : make[2]: Leaving directory '/home/opc/ruby/build/master/.bundle/gems/bigdecimal-3.1.7/ext/bigdecimal' I, [2024-05-24T13:26:26.794415 #3877846] INFO -- : make[2]: Entering directory '/home/opc/ruby/build/master/.bundle/gems/bigdecimal-3.1.8/ext/bigdecimal' I, [2024-05-24T13:26:26.825380 #3877846] INFO -- : make[2]: Leaving directory '/home/opc/ruby/build/master/.bundle/gems/bigdecimal-3.1.8/ext/bigdecimal' I, [2024-05-24T13:26:26.827958 #3877846] INFO -- : make[2]: Entering directory '/home/opc/ruby/build/master/.bundle/gems/debug-1.9.2/ext/debug' I, [2024-05-24T13:26:26.858752 #3877846] INFO -- : make[2]: Leaving directory '/home/opc/ruby/build/master/.bundle/gems/debug-1.9.2/ext/debug' I, [2024-05-24T13:26:26.861334 #3877846] INFO -- : make[2]: Entering directory '/home/opc/ruby/build/master/.bundle/gems/nkf-0.2.0/ext/nkf' I, [2024-05-24T13:26:26.892210 #3877846] INFO -- : make[2]: Leaving directory '/home/opc/ruby/build/master/.bundle/gems/nkf-0.2.0/ext/nkf' I, [2024-05-24T13:26:26.894797 #3877846] INFO -- : make[2]: Entering directory '/home/opc/ruby/build/master/.bundle/gems/racc-1.7.3/ext/racc/cparse' I, [2024-05-24T13:26:26.925631 #3877846] INFO -- : make[2]: Leaving directory '/home/opc/ruby/build/master/.bundle/gems/racc-1.7.3/ext/racc/cparse' I, [2024-05-24T13:26:26.928177 #3877846] INFO -- : make[2]: Entering directory '/home/opc/ruby/build/master/.bundle/gems/racc-1.8.0/ext/racc/cparse' I, [2024-05-24T13:26:26.958593 #3877846] INFO -- : make[2]: Leaving directory '/home/opc/ruby/build/master/.bundle/gems/racc-1.8.0/ext/racc/cparse' I, [2024-05-24T13:26:26.961578 #3877846] INFO -- : make[2]: Entering directory '/home/opc/ruby/build/master/.bundle/gems/rbs-3.4.4/ext/rbs_extension' I, [2024-05-24T13:26:26.991991 #3877846] INFO -- : make[2]: Leaving directory '/home/opc/ruby/build/master/.bundle/gems/rbs-3.4.4/ext/rbs_extension' I, [2024-05-24T13:26:26.994542 #3877846] INFO -- : make[2]: Entering directory '/home/opc/ruby/build/master/.bundle/gems/syslog-0.1.2/ext/syslog' I, [2024-05-24T13:26:27.026037 #3877846] INFO -- : make[2]: Leaving directory '/home/opc/ruby/build/master/.bundle/gems/syslog-0.1.2/ext/syslog' I, [2024-05-24T13:26:27.064857 #3877846] INFO -- : make[2]: Entering directory '/home/opc/ruby/build/master' I, [2024-05-24T13:26:27.149409 #3877846] INFO -- : make[2]: 'ruby' is up to date. I, [2024-05-24T13:26:27.149486 #3877846] INFO -- : make[2]: Leaving directory '/home/opc/ruby/build/master' I, [2024-05-24T13:26:27.149641 #3877846] INFO -- : make[1]: Leaving directory '/home/opc/ruby/build/master' I, [2024-05-24T13:26:27.154057 #3877846] INFO -- : make[1]: Entering directory '/home/opc/ruby/build/master' I, [2024-05-24T13:26:27.154126 #3877846] INFO -- : make[1]: Nothing to be done for 'note'. I, [2024-05-24T13:26:27.154149 #3877846] INFO -- : make[1]: Leaving directory '/home/opc/ruby/build/master' E, [2024-05-24T13:26:27.230784 #3877846] ERROR -- : $ /home/opc/ruby/build/master/miniruby -I/home/opc/ruby/src/master/lib /home/opc/ruby/src/master/tool/runruby.rb --archdir=/home/opc/ruby/build/master --extout=.ext -- /home/opc/ruby/src/master/spec/mspec/bin/mspec-run -B /home/opc/ruby/src/master/spec/default.mspec --error-output stderr --debug -fy -o /tmp/rubytest.idep6q/1-mspec-multi-0 E, [2024-05-24T13:26:27.231217 #3877846] ERROR -- : $ /home/opc/ruby/build/master/miniruby -I/home/opc/ruby/src/master/lib /home/opc/ruby/src/master/tool/runruby.rb --archdir=/home/opc/ruby/build/master --extout=.ext -- /home/opc/ruby/src/master/spec/mspec/bin/mspec-run -B /home/opc/ruby/src/master/spec/default.mspec --error-output stderr --debug -fy -o /tmp/rubytest.idep6q/2-mspec-multi-1 E, [2024-05-24T13:26:27.231458 #3877846] ERROR -- : $ /home/opc/ruby/build/master/miniruby -I/home/opc/ruby/src/master/lib /home/opc/ruby/src/master/tool/runruby.rb --archdir=/home/opc/ruby/build/master --extout=.ext -- /home/opc/ruby/src/master/spec/mspec/bin/mspec-run -B /home/opc/ruby/src/master/spec/default.mspec --error-output stderr --debug -fy -o /tmp/rubytest.idep6q/3-mspec-multi-2 I, [2024-05-24T13:26:27.361914 #3877846] INFO -- : ruby 3.4.0dev (2024-05-24T08:00:15Z master e49d68bf27) [aarch64-linux] I, [2024-05-24T13:26:32.847184 #3877846] INFO -- : 0 ......................................................................... I, [2024-05-24T13:26:35.227923 #3877846] INFO -- : 73 ......................................................................... I, [2024-05-24T13:26:35.415426 #3877846] INFO -- : 146 ......................................................................... I, [2024-05-24T13:26:35.710110 #3877846] INFO -- : 219 ......................................................................... I, [2024-05-24T13:26:35.869776 #3877846] INFO -- : 292 ......................................................................... I, [2024-05-24T13:26:36.107672 #3877846] INFO -- : 365 ......................................................................... I, [2024-05-24T13:26:36.251097 #3877846] INFO -- : 438 ......................................................................... I, [2024-05-24T13:26:36.315597 #3877846] INFO -- : 511 ......................................................................... I, [2024-05-24T13:26:36.377358 #3877846] INFO -- : 584 ......................................................................... I, [2024-05-24T13:26:36.982611 #3877846] INFO -- : 657 ......................................................................... I, [2024-05-24T13:26:37.063585 #3877846] INFO -- : 730 ......................................................................... I, [2024-05-24T13:26:37.115117 #3877846] INFO -- : 803 ......................................................................... I, [2024-05-24T13:26:37.312228 #3877846] INFO -- : 876 ......................................................................... I, [2024-05-24T13:26:37.419066 #3877846] INFO -- : 949 ......................................................................... I, [2024-05-24T13:26:38.013836 #3877846] INFO -- : 1022 ......................................................................... I, [2024-05-24T13:26:40.296734 #3877846] INFO -- : 1095 ......................................................................... I, [2024-05-24T13:26:41.177537 #3877846] INFO -- : 1168 ......................................................................... I, [2024-05-24T13:26:41.345081 #3877846] INFO -- : 1241 ......................................................................... I, [2024-05-24T13:26:41.561485 #3877846] INFO -- : 1314 ......................................................................... I, [2024-05-24T13:26:41.652813 #3877846] INFO -- : 1387 ......................................................................... I, [2024-05-24T13:26:43.667258 #3877846] INFO -- : 1460 ......................................................................... I, [2024-05-24T13:26:46.955780 #3877846] INFO -- : 1533 ......................................................................... I, [2024-05-24T13:26:47.144365 #3877846] INFO -- : 1606 ......................................................................... I, [2024-05-24T13:26:47.960338 #3877846] INFO -- : 1679 ......................................................................... I, [2024-05-24T13:26:48.285267 #3877846] INFO -- : 1752 ......................................................................... I, [2024-05-24T13:26:48.591637 #3877846] INFO -- : 1825 ......................................................................... I, [2024-05-24T13:26:48.919676 #3877846] INFO -- : 1898 ......................................................................... I, [2024-05-24T13:26:49.324632 #3877846] INFO -- : 1971 ......................................................................... I, [2024-05-24T13:26:49.838980 #3877846] INFO -- : 2044 ......................................................................... I, [2024-05-24T13:26:49.945891 #3877846] INFO -- : 2117 ......................................................................... I, [2024-05-24T13:26:50.007385 #3877846] INFO -- : 2190 ......................................................................... I, [2024-05-24T13:26:50.061945 #3877846] INFO -- : 2263 ......................................................................... I, [2024-05-24T13:26:50.110368 #3877846] INFO -- : 2336 ......................................................................... I, [2024-05-24T13:26:50.207862 #3877846] INFO -- : 2409 ......................................................................... I, [2024-05-24T13:26:50.470983 #3877846] INFO -- : 2482 ......................................................................... I, [2024-05-24T13:26:50.624370 #3877846] INFO -- : 2555 ......................................................................... I, [2024-05-24T13:26:51.910279 #3877846] INFO -- : 2628 ......................................................................... I, [2024-05-24T13:26:52.198847 #3877846] INFO -- : 2701 ......................................................................... I, [2024-05-24T13:26:52.328159 #3877846] INFO -- : 2774 ......................................................................... I, [2024-05-24T13:26:52.671044 #3877846] INFO -- : 2847 ......................................................................... I, [2024-05-24T13:26:52.942358 #3877846] INFO -- : 2920 ......................................................................... I, [2024-05-24T13:26:53.062093 #3877846] INFO -- : 2993 ......................................................................... I, [2024-05-24T13:26:53.131061 #3877846] INFO -- : 3066 ......................................................................... I, [2024-05-24T13:26:53.176857 #3877846] INFO -- : 3139 ......................................................................... I, [2024-05-24T13:26:53.235447 #3877846] INFO -- : 3212 ......................................................................... I, [2024-05-24T13:26:53.306038 #3877846] INFO -- : 3285 ......................................................................... I, [2024-05-24T13:26:57.132392 #3877846] INFO -- : 3358 ......................................................................... I, [2024-05-24T13:26:57.156657 #3877846] INFO -- : I, [2024-05-24T13:26:57.156709 #3877846] INFO -- : I, [2024-05-24T13:26:57.156720 #3877846] INFO -- : Finished in 29.925745 seconds I, [2024-05-24T13:26:57.156730 #3877846] INFO -- : I, [2024-05-24T13:26:57.156739 #3877846] INFO -- : 3430 files, 32648 examples, 180040 expectations, 0 failures, 0 errors, 0 tagged I, [2024-05-24T13:26:57.158062 #3877846] INFO -- : $$$[end] "make yes-test-rubyspec MSPECOPT='--error-output stderr --debug -j' TESTS='-j3'" exit with 0.