# Logfile created on 2024-05-24 11:40:19 +0000 by logger.rb/v1.5.3 I, [2024-05-24T11:40:19.898572 #3552469] INFO -- : #, @formatter=nil, @logdev=#, @binmode=false, @mon_data=#, @mon_data_owner_object_id=860>>> I, [2024-05-24T11:40:19.898882 #3552469] INFO -- : $$$[beg] make update-unicode -j3 I, [2024-05-24T11:40:19.992841 #3552469] INFO -- : Downloading Unicode emoji 15.0 files... I, [2024-05-24T11:40:19.992914 #3552469] INFO -- : Downloading Unicode emoji 15.0 files... I, [2024-05-24T11:40:19.993240 #3552469] INFO -- : Downloading Unicode emoji 15.0 files... I, [2024-05-24T11:40:20.074235 #3552469] INFO -- : made symlink emoji/15.0/emoji-sequences.txt to /home/opc/ruby/src/master/.downloaded-cache/emoji/15.0/emoji-sequences.txt E, [2024-05-24T11:40:20.543113 #3552469] ERROR -- : /home/opc/ruby/src/master/tool/downloader.rb:302:in `rescue in download': failed to download emoji/15.0/emoji-test.txt (RuntimeError) E, [2024-05-24T11:40:20.543177 #3552469] ERROR -- : OpenURI::HTTPError: 403 Forbidden: https://www.unicode.org/Public/emoji/15.0/emoji-test.txt E, [2024-05-24T11:40:20.543188 #3552469] ERROR -- : from /home/opc/ruby/src/master/tool/downloader.rb:201:in `download' E, [2024-05-24T11:40:20.543198 #3552469] ERROR -- : from /home/opc/ruby/src/master/tool/downloader.rb:136:in `download' E, [2024-05-24T11:40:20.543206 #3552469] ERROR -- : from /home/opc/ruby/src/master/tool/downloader.rb:482:in `block in
' E, [2024-05-24T11:40:20.543214 #3552469] ERROR -- : from /home/opc/ruby/src/master/tool/downloader.rb:465:in `each' E, [2024-05-24T11:40:20.543223 #3552469] ERROR -- : from /home/opc/ruby/src/master/tool/downloader.rb:465:in `
' E, [2024-05-24T11:40:20.543231 #3552469] ERROR -- : /usr/local/lib/ruby/3.2.0/open-uri.rb:369:in `open_http': 403 Forbidden (OpenURI::HTTPError) E, [2024-05-24T11:40:20.543239 #3552469] ERROR -- : from /usr/local/lib/ruby/3.2.0/open-uri.rb:760:in `buffer_open' E, [2024-05-24T11:40:20.543247 #3552469] ERROR -- : from /usr/local/lib/ruby/3.2.0/open-uri.rb:214:in `block in open_loop' E, [2024-05-24T11:40:20.543256 #3552469] ERROR -- : from /usr/local/lib/ruby/3.2.0/open-uri.rb:212:in `catch' E, [2024-05-24T11:40:20.543264 #3552469] ERROR -- : from /usr/local/lib/ruby/3.2.0/open-uri.rb:212:in `open_loop' E, [2024-05-24T11:40:20.543272 #3552469] ERROR -- : from /usr/local/lib/ruby/3.2.0/open-uri.rb:153:in `open_uri' E, [2024-05-24T11:40:20.543280 #3552469] ERROR -- : from /usr/local/lib/ruby/3.2.0/open-uri.rb:740:in `open' E, [2024-05-24T11:40:20.543288 #3552469] ERROR -- : from /usr/local/lib/ruby/3.2.0/open-uri.rb:748:in `read' E, [2024-05-24T11:40:20.543296 #3552469] ERROR -- : from /home/opc/ruby/src/master/tool/downloader.rb:247:in `block in download' E, [2024-05-24T11:40:20.543305 #3552469] ERROR -- : from /home/opc/ruby/src/master/tool/downloader.rb:378:in `with_retry' E, [2024-05-24T11:40:20.543317 #3552469] ERROR -- : from /home/opc/ruby/src/master/tool/downloader.rb:246:in `download' E, [2024-05-24T11:40:20.543325 #3552469] ERROR -- : from /home/opc/ruby/src/master/tool/downloader.rb:136:in `download' E, [2024-05-24T11:40:20.543333 #3552469] ERROR -- : from /home/opc/ruby/src/master/tool/downloader.rb:482:in `block in
' E, [2024-05-24T11:40:20.543342 #3552469] ERROR -- : from /home/opc/ruby/src/master/tool/downloader.rb:465:in `each' E, [2024-05-24T11:40:20.543350 #3552469] ERROR -- : from /home/opc/ruby/src/master/tool/downloader.rb:465:in `
' E, [2024-05-24T11:40:20.546771 #3552469] ERROR -- : make: *** [uncommon.mk:1756: /home/opc/ruby/src/master/enc/unicode/data/emoji/15.0/emoji-test.txt] Error 1 E, [2024-05-24T11:40:20.546820 #3552469] ERROR -- : make: *** Waiting for unfinished jobs.... E, [2024-05-24T11:40:21.005093 #3552469] ERROR -- : /home/opc/ruby/src/master/tool/downloader.rb:302:in `rescue in download': failed to download emoji/15.0/emoji-sequences.txt (RuntimeError) E, [2024-05-24T11:40:21.005165 #3552469] ERROR -- : EOFError: end of file reached: https://www.unicode.org/Public/emoji/15.0/emoji-sequences.txt E, [2024-05-24T11:40:21.005175 #3552469] ERROR -- : from /home/opc/ruby/src/master/tool/downloader.rb:201:in `download' E, [2024-05-24T11:40:21.005184 #3552469] ERROR -- : from /home/opc/ruby/src/master/tool/downloader.rb:136:in `download' E, [2024-05-24T11:40:21.005219 #3552469] ERROR -- : from /home/opc/ruby/src/master/tool/downloader.rb:482:in `block in
' E, [2024-05-24T11:40:21.005233 #3552469] ERROR -- : from /home/opc/ruby/src/master/tool/downloader.rb:465:in `each' E, [2024-05-24T11:40:21.005242 #3552469] ERROR -- : from /home/opc/ruby/src/master/tool/downloader.rb:465:in `
' E, [2024-05-24T11:40:21.005250 #3552469] ERROR -- : /usr/local/lib/ruby/3.2.0/net/protocol.rb:237:in `rbuf_fill': end of file reached (EOFError) E, [2024-05-24T11:40:21.005259 #3552469] ERROR -- : from /usr/local/lib/ruby/3.2.0/net/protocol.rb:199:in `readuntil' E, [2024-05-24T11:40:21.005267 #3552469] ERROR -- : from /usr/local/lib/ruby/3.2.0/net/protocol.rb:209:in `readline' E, [2024-05-24T11:40:21.005275 #3552469] ERROR -- : from /usr/local/lib/ruby/3.2.0/net/http/response.rb:158:in `read_status_line' E, [2024-05-24T11:40:21.005284 #3552469] ERROR -- : from /usr/local/lib/ruby/3.2.0/net/http/response.rb:147:in `read_new' E, [2024-05-24T11:40:21.005292 #3552469] ERROR -- : from /usr/local/lib/ruby/3.2.0/net/http.rb:1862:in `block in transport_request' E, [2024-05-24T11:40:21.005300 #3552469] ERROR -- : from /usr/local/lib/ruby/3.2.0/net/http.rb:1853:in `catch' E, [2024-05-24T11:40:21.005308 #3552469] ERROR -- : from /usr/local/lib/ruby/3.2.0/net/http.rb:1853:in `transport_request' E, [2024-05-24T11:40:21.005316 #3552469] ERROR -- : from /usr/local/lib/ruby/3.2.0/net/http.rb:1826:in `request' E, [2024-05-24T11:40:21.005325 #3552469] ERROR -- : from /usr/local/lib/ruby/3.2.0/open-uri.rb:333:in `block in open_http' E, [2024-05-24T11:40:21.005333 #3552469] ERROR -- : from /usr/local/lib/ruby/3.2.0/net/http.rb:1238:in `start' E, [2024-05-24T11:40:21.005341 #3552469] ERROR -- : from /usr/local/lib/ruby/3.2.0/open-uri.rb:327:in `open_http' E, [2024-05-24T11:40:21.005349 #3552469] ERROR -- : from /usr/local/lib/ruby/3.2.0/open-uri.rb:760:in `buffer_open' E, [2024-05-24T11:40:21.005357 #3552469] ERROR -- : from /usr/local/lib/ruby/3.2.0/open-uri.rb:214:in `block in open_loop' E, [2024-05-24T11:40:21.005365 #3552469] ERROR -- : from /usr/local/lib/ruby/3.2.0/open-uri.rb:212:in `catch' E, [2024-05-24T11:40:21.005373 #3552469] ERROR -- : from /usr/local/lib/ruby/3.2.0/open-uri.rb:212:in `open_loop' E, [2024-05-24T11:40:21.005381 #3552469] ERROR -- : from /usr/local/lib/ruby/3.2.0/open-uri.rb:153:in `open_uri' E, [2024-05-24T11:40:21.005389 #3552469] ERROR -- : from /usr/local/lib/ruby/3.2.0/open-uri.rb:740:in `open' E, [2024-05-24T11:40:21.005397 #3552469] ERROR -- : from /usr/local/lib/ruby/3.2.0/open-uri.rb:748:in `read' E, [2024-05-24T11:40:21.005409 #3552469] ERROR -- : from /home/opc/ruby/src/master/tool/downloader.rb:247:in `block in download' E, [2024-05-24T11:40:21.005417 #3552469] ERROR -- : from /home/opc/ruby/src/master/tool/downloader.rb:378:in `with_retry' E, [2024-05-24T11:40:21.005425 #3552469] ERROR -- : from /home/opc/ruby/src/master/tool/downloader.rb:246:in `download' E, [2024-05-24T11:40:21.005434 #3552469] ERROR -- : from /home/opc/ruby/src/master/tool/downloader.rb:136:in `download' E, [2024-05-24T11:40:21.005442 #3552469] ERROR -- : from /home/opc/ruby/src/master/tool/downloader.rb:482:in `block in
' E, [2024-05-24T11:40:21.005451 #3552469] ERROR -- : from /home/opc/ruby/src/master/tool/downloader.rb:465:in `each' E, [2024-05-24T11:40:21.005459 #3552469] ERROR -- : from /home/opc/ruby/src/master/tool/downloader.rb:465:in `
' E, [2024-05-24T11:40:21.007285 #3552469] ERROR -- : /home/opc/ruby/src/master/tool/downloader.rb:302:in `rescue in download': failed to download emoji/15.0/emoji-sequences.txt (RuntimeError) E, [2024-05-24T11:40:21.007316 #3552469] ERROR -- : EOFError: end of file reached: https://www.unicode.org/Public/emoji/15.0/emoji-sequences.txt E, [2024-05-24T11:40:21.007326 #3552469] ERROR -- : from /home/opc/ruby/src/master/tool/downloader.rb:201:in `download' E, [2024-05-24T11:40:21.007335 #3552469] ERROR -- : from /home/opc/ruby/src/master/tool/downloader.rb:136:in `download' E, [2024-05-24T11:40:21.007343 #3552469] ERROR -- : from /home/opc/ruby/src/master/tool/downloader.rb:482:in `block in
' E, [2024-05-24T11:40:21.007351 #3552469] ERROR -- : from /home/opc/ruby/src/master/tool/downloader.rb:465:in `each' E, [2024-05-24T11:40:21.007359 #3552469] ERROR -- : from /home/opc/ruby/src/master/tool/downloader.rb:465:in `
' E, [2024-05-24T11:40:21.007367 #3552469] ERROR -- : /usr/local/lib/ruby/3.2.0/net/protocol.rb:237:in `rbuf_fill': end of file reached (EOFError) E, [2024-05-24T11:40:21.007375 #3552469] ERROR -- : from /usr/local/lib/ruby/3.2.0/net/protocol.rb:199:in `readuntil' E, [2024-05-24T11:40:21.007383 #3552469] ERROR -- : from /usr/local/lib/ruby/3.2.0/net/protocol.rb:209:in `readline' E, [2024-05-24T11:40:21.007391 #3552469] ERROR -- : from /usr/local/lib/ruby/3.2.0/net/http/response.rb:158:in `read_status_line' E, [2024-05-24T11:40:21.007400 #3552469] ERROR -- : from /usr/local/lib/ruby/3.2.0/net/http/response.rb:147:in `read_new' E, [2024-05-24T11:40:21.007408 #3552469] ERROR -- : from /usr/local/lib/ruby/3.2.0/net/http.rb:1862:in `block in transport_request' E, [2024-05-24T11:40:21.007416 #3552469] ERROR -- : from /usr/local/lib/ruby/3.2.0/net/http.rb:1853:in `catch' E, [2024-05-24T11:40:21.007425 #3552469] ERROR -- : from /usr/local/lib/ruby/3.2.0/net/http.rb:1853:in `transport_request' E, [2024-05-24T11:40:21.007433 #3552469] ERROR -- : from /usr/local/lib/ruby/3.2.0/net/http.rb:1826:in `request' E, [2024-05-24T11:40:21.007442 #3552469] ERROR -- : from /usr/local/lib/ruby/3.2.0/open-uri.rb:333:in `block in open_http' E, [2024-05-24T11:40:21.007450 #3552469] ERROR -- : from /usr/local/lib/ruby/3.2.0/net/http.rb:1238:in `start' E, [2024-05-24T11:40:21.007458 #3552469] ERROR -- : from /usr/local/lib/ruby/3.2.0/open-uri.rb:327:in `open_http' E, [2024-05-24T11:40:21.007467 #3552469] ERROR -- : from /usr/local/lib/ruby/3.2.0/open-uri.rb:760:in `buffer_open' E, [2024-05-24T11:40:21.007476 #3552469] ERROR -- : from /usr/local/lib/ruby/3.2.0/open-uri.rb:214:in `block in open_loop' E, [2024-05-24T11:40:21.007484 #3552469] ERROR -- : from /usr/local/lib/ruby/3.2.0/open-uri.rb:212:in `catch' E, [2024-05-24T11:40:21.007492 #3552469] ERROR -- : from /usr/local/lib/ruby/3.2.0/open-uri.rb:212:in `open_loop' E, [2024-05-24T11:40:21.007500 #3552469] ERROR -- : from /usr/local/lib/ruby/3.2.0/open-uri.rb:153:in `open_uri' E, [2024-05-24T11:40:21.007508 #3552469] ERROR -- : from /usr/local/lib/ruby/3.2.0/open-uri.rb:740:in `open' E, [2024-05-24T11:40:21.007517 #3552469] ERROR -- : from /usr/local/lib/ruby/3.2.0/open-uri.rb:748:in `read' E, [2024-05-24T11:40:21.007528 #3552469] ERROR -- : from /home/opc/ruby/src/master/tool/downloader.rb:247:in `block in download' E, [2024-05-24T11:40:21.007537 #3552469] ERROR -- : from /home/opc/ruby/src/master/tool/downloader.rb:378:in `with_retry' E, [2024-05-24T11:40:21.007545 #3552469] ERROR -- : from /home/opc/ruby/src/master/tool/downloader.rb:246:in `download' E, [2024-05-24T11:40:21.007553 #3552469] ERROR -- : from /home/opc/ruby/src/master/tool/downloader.rb:136:in `download' E, [2024-05-24T11:40:21.007561 #3552469] ERROR -- : from /home/opc/ruby/src/master/tool/downloader.rb:482:in `block in
' E, [2024-05-24T11:40:21.007569 #3552469] ERROR -- : from /home/opc/ruby/src/master/tool/downloader.rb:465:in `each' E, [2024-05-24T11:40:21.007577 #3552469] ERROR -- : from /home/opc/ruby/src/master/tool/downloader.rb:465:in `
' E, [2024-05-24T11:40:21.008767 #3552469] ERROR -- : make: *** [uncommon.mk:1756: /home/opc/ruby/src/master/enc/unicode/data/emoji/15.0/emoji-zwj-sequences.txt] Error 1 E, [2024-05-24T11:40:21.010423 #3552469] ERROR -- : make: *** [uncommon.mk:1756: /home/opc/ruby/src/master/enc/unicode/data/emoji/15.0/emoji-sequences.txt] Error 1 E, [2024-05-24T11:40:21.010455 #3552469] ERROR -- : make: *** Deleting file '/home/opc/ruby/src/master/enc/unicode/data/emoji/15.0/emoji-sequences.txt' I, [2024-05-24T11:40:21.010548 #3552469] INFO -- : downloading emoji/15.0/emoji-sequences.txt ... downloading emoji/15.0/emoji-sequences.txt ... downloading emoji/15.0/emoji-test.txt ... I, [2024-05-24T11:40:21.010679 #3552469] INFO -- : $$$[end] "make update-unicode -j3" exit with 512. I, [2024-05-24T11:40:21.010709 #3552469] INFO -- : $$$[beg] make update-download -j3 I, [2024-05-24T11:40:21.176645 #3552469] INFO -- : tool/config.guess already exists I, [2024-05-24T11:40:21.176717 #3552469] INFO -- : tool/config.sub already exists I, [2024-05-24T11:40:21.179817 #3552469] INFO -- : Update power_assert to 84e85124c5014a139af39161d484156cfe87a9ed I, [2024-05-24T11:40:21.179967 #3552469] INFO -- : Update rbs to ba7872795d5de04adb8ff500c0e6afdc81a041dd I, [2024-05-24T11:40:21.180102 #3552469] INFO -- : Update typeprof to b19a6416da3a05d57fadd6ffdadb382b6d236ca5 I, [2024-05-24T11:40:21.183472 #3552469] INFO -- : echo 84e85124c5014a139af39161d484156cfe87a9ed | /bin/sh /home/opc/ruby/src/master/tool/ifchange /home/opc/ruby/src/master/.bundle/.timestamp/power_assert.revision - I, [2024-05-24T11:40:21.183663 #3552469] INFO -- : echo ba7872795d5de04adb8ff500c0e6afdc81a041dd | /bin/sh /home/opc/ruby/src/master/tool/ifchange /home/opc/ruby/src/master/.bundle/.timestamp/rbs.revision - I, [2024-05-24T11:40:21.183865 #3552469] INFO -- : echo b19a6416da3a05d57fadd6ffdadb382b6d236ca5 | /bin/sh /home/opc/ruby/src/master/tool/ifchange /home/opc/ruby/src/master/.bundle/.timestamp/typeprof.revision - I, [2024-05-24T11:40:21.190948 #3552469] INFO -- : /home/opc/ruby/src/master/.bundle/.timestamp/rbs.revision unchanged I, [2024-05-24T11:40:21.191018 #3552469] INFO -- : /home/opc/ruby/src/master/.bundle/.timestamp/typeprof.revision unchanged I, [2024-05-24T11:40:21.191864 #3552469] INFO -- : /home/opc/ruby/src/master/.bundle/.timestamp/power_assert.revision unchanged I, [2024-05-24T11:40:21.292164 #3552469] INFO -- : Building power_assert@84e85124c5014a139af39161d484156cfe87a9ed to /home/opc/ruby/src/master/gems/power_assert-2.0.3.gem I, [2024-05-24T11:40:21.408060 #3552469] INFO -- : Successfully built RubyGem I, [2024-05-24T11:40:21.408125 #3552469] INFO -- : Name: power_assert I, [2024-05-24T11:40:21.408135 #3552469] INFO -- : Version: 2.0.4dev I, [2024-05-24T11:40:21.408144 #3552469] INFO -- : File: power_assert-2.0.4dev.gem I, [2024-05-24T11:40:21.491938 #3552469] INFO -- : $$$[end] "make update-download -j3" exit with 0. I, [2024-05-24T11:40:21.492012 #3552469] INFO -- : $$$[beg] make update-rubyspec -j3 I, [2024-05-24T11:40:21.581845 #3552469] INFO -- : make: Nothing to be done for 'update-rubyspec'. I, [2024-05-24T11:40:21.582043 #3552469] INFO -- : $$$[end] "make update-rubyspec -j3" exit with 0. I, [2024-05-24T11:40:21.582096 #3552469] INFO -- : $$$[beg] make update-src -j3 I, [2024-05-24T11:40:22.494766 #3552469] INFO -- : Already up to date. I, [2024-05-24T11:40:22.510278 #3552469] INFO -- : Latest commit hash = e49d68bf27 I, [2024-05-24T11:40:22.510917 #3552469] INFO -- : $$$[end] "make update-src -j3" exit with 0. I, [2024-05-24T11:40:22.510956 #3552469] INFO -- : $$$[beg] make after-update -j3 I, [2024-05-24T11:40:22.616933 #3552469] INFO -- : generating /home/opc/ruby/src/master/ext/ripper/eventids1.h I, [2024-05-24T11:40:22.624530 #3552469] INFO -- : make[1]: Entering directory '/home/opc/ruby/src/master/ext/ripper' I, [2024-05-24T11:40:22.624602 #3552469] INFO -- : make[1]: Nothing to be done for 'src'. I, [2024-05-24T11:40:22.624613 #3552469] INFO -- : make[1]: Leaving directory '/home/opc/ruby/src/master/ext/ripper' I, [2024-05-24T11:40:22.625481 #3552469] INFO -- : generating /home/opc/ruby/src/master/ext/ripper/eventids1.c I, [2024-05-24T11:40:22.630264 #3552469] INFO -- : make[1]: Entering directory '/home/opc/ruby/src/master/ext/ripper' I, [2024-05-24T11:40:22.630307 #3552469] INFO -- : make[1]: Nothing to be done for 'src'. I, [2024-05-24T11:40:22.630317 #3552469] INFO -- : make[1]: Leaving directory '/home/opc/ruby/src/master/ext/ripper' I, [2024-05-24T11:40:22.631121 #3552469] INFO -- : generating /home/opc/ruby/src/master/ext/ripper/eventids2table.c I, [2024-05-24T11:40:22.635104 #3552469] INFO -- : make[1]: Entering directory '/home/opc/ruby/src/master/ext/ripper' I, [2024-05-24T11:40:22.635147 #3552469] INFO -- : make[1]: Nothing to be done for 'src'. I, [2024-05-24T11:40:22.635161 #3552469] INFO -- : make[1]: Leaving directory '/home/opc/ruby/src/master/ext/ripper' I, [2024-05-24T11:40:22.652997 #3552469] INFO -- : /home/opc/ruby/src/master/revision.h updated I, [2024-05-24T11:40:22.654256 #3552469] INFO -- : generating aarch64-linux-fake.rb I, [2024-05-24T11:40:22.712254 #3552469] INFO -- : aarch64-linux-fake.rb updated I, [2024-05-24T11:40:22.713804 #3552469] INFO -- : generating enc.mk I, [2024-05-24T11:40:22.955237 #3552469] INFO -- : making srcs under enc I, [2024-05-24T11:40:22.997916 #3552469] INFO -- : make[1]: Entering directory '/home/opc/ruby/build/master' I, [2024-05-24T11:40:22.997977 #3552469] INFO -- : make[1]: Nothing to be done for 'srcs'. I, [2024-05-24T11:40:22.997988 #3552469] INFO -- : make[1]: Leaving directory '/home/opc/ruby/build/master' I, [2024-05-24T11:40:23.080600 #3552469] INFO -- : Update power_assert to 84e85124c5014a139af39161d484156cfe87a9ed I, [2024-05-24T11:40:23.080665 #3552469] INFO -- : Update rbs to ba7872795d5de04adb8ff500c0e6afdc81a041dd I, [2024-05-24T11:40:23.081687 #3552469] INFO -- : Update typeprof to b19a6416da3a05d57fadd6ffdadb382b6d236ca5 I, [2024-05-24T11:40:23.084846 #3552469] INFO -- : echo 84e85124c5014a139af39161d484156cfe87a9ed | /bin/sh /home/opc/ruby/src/master/tool/ifchange /home/opc/ruby/src/master/.bundle/.timestamp/power_assert.revision - I, [2024-05-24T11:40:23.085093 #3552469] INFO -- : echo ba7872795d5de04adb8ff500c0e6afdc81a041dd | /bin/sh /home/opc/ruby/src/master/tool/ifchange /home/opc/ruby/src/master/.bundle/.timestamp/rbs.revision - I, [2024-05-24T11:40:23.085267 #3552469] INFO -- : echo b19a6416da3a05d57fadd6ffdadb382b6d236ca5 | /bin/sh /home/opc/ruby/src/master/tool/ifchange /home/opc/ruby/src/master/.bundle/.timestamp/typeprof.revision - I, [2024-05-24T11:40:23.090884 #3552469] INFO -- : /home/opc/ruby/src/master/.bundle/.timestamp/power_assert.revision unchanged I, [2024-05-24T11:40:23.091069 #3552469] INFO -- : /home/opc/ruby/src/master/.bundle/.timestamp/typeprof.revision unchanged I, [2024-05-24T11:40:23.091485 #3552469] INFO -- : /home/opc/ruby/src/master/.bundle/.timestamp/rbs.revision unchanged I, [2024-05-24T11:40:23.183218 #3552469] INFO -- : Building power_assert@84e85124c5014a139af39161d484156cfe87a9ed to /home/opc/ruby/src/master/gems/power_assert-2.0.3.gem I, [2024-05-24T11:40:23.297225 #3552469] INFO -- : Successfully built RubyGem I, [2024-05-24T11:40:23.297291 #3552469] INFO -- : Name: power_assert I, [2024-05-24T11:40:23.297302 #3552469] INFO -- : Version: 2.0.4dev I, [2024-05-24T11:40:23.297311 #3552469] INFO -- : File: power_assert-2.0.4dev.gem I, [2024-05-24T11:40:23.299636 #3552469] INFO -- : Extracting bundle gem power_assert-2.0.3... I, [2024-05-24T11:40:23.400016 #3552469] INFO -- : Try with hash version of bundled gems instead of gems/power_assert-2.0.3.gem. We don't use this gem with release version of Ruby. I, [2024-05-24T11:40:23.411191 #3552469] INFO -- : Unpacked gems/power_assert-2.0.4dev.gem I, [2024-05-24T11:40:23.413116 #3552469] INFO -- : $$$[end] "make after-update -j3" exit with 0. I, [2024-05-24T11:40:23.413300 #3552469] INFO -- : $$$[beg] make miniruby -j3 I, [2024-05-24T11:40:23.503445 #3552469] INFO -- : BASERUBY = /usr/local/bin/ruby --disable=gems I, [2024-05-24T11:40:23.503517 #3552469] INFO -- : CC = gcc I, [2024-05-24T11:40:23.503528 #3552469] INFO -- : LD = ld I, [2024-05-24T11:40:23.503536 #3552469] INFO -- : LDSHARED = gcc -shared I, [2024-05-24T11:40:23.503548 #3552469] INFO -- : CFLAGS = -O3 -fno-fast-math -ggdb3 -Wall -Wextra -Wdeprecated-declarations -Wdiv-by-zero -Wduplicated-cond -Wimplicit-function-declaration -Wimplicit-int -Wpointer-arith -Wwrite-strings -Wold-style-definition -Wimplicit-fallthrough=0 -Wmissing-noreturn -Wno-cast-function-type -Wno-constant-logical-operand -Wno-long-long -Wno-missing-field-initializers -Wno-overlength-strings -Wno-packed-bitfield-compat -Wno-parentheses-equality -Wno-self-assign -Wno-tautological-compare -Wno-unused-parameter -Wno-unused-value -Wsuggest-attribute=format -Wsuggest-attribute=noreturn -Wunused-variable -Wmisleading-indentation -Wundef I, [2024-05-24T11:40:23.503559 #3552469] INFO -- : XCFLAGS = -U_FORTIFY_SOURCE -D_FORTIFY_SOURCE=2 -fstack-protector-strong -msign-return-address=all -fno-strict-overflow -fvisibility=hidden -fexcess-precision=standard -DRUBY_EXPORT -fPIE -I. -I.ext/include/aarch64-linux -I/home/opc/ruby/src/master/include -I/home/opc/ruby/src/master -I/home/opc/ruby/src/master/prism -I/home/opc/ruby/src/master/enc/unicode/15.0.0 I, [2024-05-24T11:40:23.503568 #3552469] INFO -- : CPPFLAGS = I, [2024-05-24T11:40:23.503576 #3552469] INFO -- : DLDFLAGS = -Wl,--compress-debug-sections=zlib -fstack-protector-strong -pie I, [2024-05-24T11:40:23.503584 #3552469] INFO -- : SOLIBS = -lz -lrt -lrt -ldl -lcrypt -lm -lpthread I, [2024-05-24T11:40:23.503593 #3552469] INFO -- : LANG = en_US.UTF-8 I, [2024-05-24T11:40:23.503601 #3552469] INFO -- : LC_ALL = I, [2024-05-24T11:40:23.503609 #3552469] INFO -- : LC_CTYPE = I, [2024-05-24T11:40:23.503617 #3552469] INFO -- : MFLAGS = -j3 --jobserver-auth=4,5 I, [2024-05-24T11:40:23.503625 #3552469] INFO -- : RUSTC = rustc I, [2024-05-24T11:40:23.503633 #3552469] INFO -- : YJIT_RUSTC_ARGS = --crate-name=yjit --crate-type=staticlib --edition=2021 -g -C lto=thin -C opt-level=3 -C overflow-checks=on '--out-dir=/home/opc/ruby/build/master/yjit/target/release/' /home/opc/ruby/src/master/yjit/src/lib.rs I, [2024-05-24T11:40:23.504417 #3552469] INFO -- : gcc (GCC) 8.5.0 20210514 (Red Hat 8.5.0-10.1.0.1) I, [2024-05-24T11:40:23.504452 #3552469] INFO -- : Copyright (C) 2018 Free Software Foundation, Inc. I, [2024-05-24T11:40:23.504462 #3552469] INFO -- : This is free software; see the source for copying conditions. There is NO I, [2024-05-24T11:40:23.504471 #3552469] INFO -- : warranty; not even for MERCHANTABILITY or FITNESS FOR A PARTICULAR PURPOSE. I, [2024-05-24T11:40:23.504480 #3552469] INFO -- : I, [2024-05-24T11:40:23.529521 #3552469] INFO -- : compiling /home/opc/ruby/src/master/version.c I, [2024-05-24T11:40:23.676167 #3552469] INFO -- : linking miniruby I, [2024-05-24T11:40:24.725252 #3552469] INFO -- : $$$[end] "make miniruby -j3" exit with 0. I, [2024-05-24T11:40:24.725431 #3552469] INFO -- : $$$[beg] make ruby -j3 I, [2024-05-24T11:40:24.817818 #3552469] INFO -- : BASERUBY = /usr/local/bin/ruby --disable=gems I, [2024-05-24T11:40:24.817899 #3552469] INFO -- : CC = gcc I, [2024-05-24T11:40:24.817910 #3552469] INFO -- : LD = ld I, [2024-05-24T11:40:24.817919 #3552469] INFO -- : LDSHARED = gcc -shared I, [2024-05-24T11:40:24.817930 #3552469] INFO -- : CFLAGS = -O3 -fno-fast-math -ggdb3 -Wall -Wextra -Wdeprecated-declarations -Wdiv-by-zero -Wduplicated-cond -Wimplicit-function-declaration -Wimplicit-int -Wpointer-arith -Wwrite-strings -Wold-style-definition -Wimplicit-fallthrough=0 -Wmissing-noreturn -Wno-cast-function-type -Wno-constant-logical-operand -Wno-long-long -Wno-missing-field-initializers -Wno-overlength-strings -Wno-packed-bitfield-compat -Wno-parentheses-equality -Wno-self-assign -Wno-tautological-compare -Wno-unused-parameter -Wno-unused-value -Wsuggest-attribute=format -Wsuggest-attribute=noreturn -Wunused-variable -Wmisleading-indentation -Wundef I, [2024-05-24T11:40:24.817940 #3552469] INFO -- : XCFLAGS = -U_FORTIFY_SOURCE -D_FORTIFY_SOURCE=2 -fstack-protector-strong -msign-return-address=all -fno-strict-overflow -fvisibility=hidden -fexcess-precision=standard -DRUBY_EXPORT -fPIE -I. -I.ext/include/aarch64-linux -I/home/opc/ruby/src/master/include -I/home/opc/ruby/src/master -I/home/opc/ruby/src/master/prism -I/home/opc/ruby/src/master/enc/unicode/15.0.0 I, [2024-05-24T11:40:24.817949 #3552469] INFO -- : CPPFLAGS = I, [2024-05-24T11:40:24.817957 #3552469] INFO -- : DLDFLAGS = -Wl,--compress-debug-sections=zlib -fstack-protector-strong -pie I, [2024-05-24T11:40:24.817966 #3552469] INFO -- : SOLIBS = -lz -lrt -lrt -ldl -lcrypt -lm -lpthread I, [2024-05-24T11:40:24.817974 #3552469] INFO -- : LANG = en_US.UTF-8 I, [2024-05-24T11:40:24.817983 #3552469] INFO -- : LC_ALL = I, [2024-05-24T11:40:24.817991 #3552469] INFO -- : LC_CTYPE = I, [2024-05-24T11:40:24.817999 #3552469] INFO -- : MFLAGS = -j3 --jobserver-auth=4,5 I, [2024-05-24T11:40:24.818007 #3552469] INFO -- : RUSTC = rustc I, [2024-05-24T11:40:24.818016 #3552469] INFO -- : YJIT_RUSTC_ARGS = --crate-name=yjit --crate-type=staticlib --edition=2021 -g -C lto=thin -C opt-level=3 -C overflow-checks=on '--out-dir=/home/opc/ruby/build/master/yjit/target/release/' /home/opc/ruby/src/master/yjit/src/lib.rs I, [2024-05-24T11:40:24.818949 #3552469] INFO -- : gcc (GCC) 8.5.0 20210514 (Red Hat 8.5.0-10.1.0.1) I, [2024-05-24T11:40:24.818990 #3552469] INFO -- : Copyright (C) 2018 Free Software Foundation, Inc. I, [2024-05-24T11:40:24.819000 #3552469] INFO -- : This is free software; see the source for copying conditions. There is NO I, [2024-05-24T11:40:24.819010 #3552469] INFO -- : warranty; not even for MERCHANTABILITY or FITNESS FOR A PARTICULAR PURPOSE. I, [2024-05-24T11:40:24.819018 #3552469] INFO -- : I, [2024-05-24T11:40:25.003194 #3552469] INFO -- : builtin_binary.inc updated I, [2024-05-24T11:40:25.009179 #3552469] INFO -- : c86294a81d0df6836359a6b5498b71b1ddba3062aa6ec87c7b2896368a948a19 builtin_binary.inc I, [2024-05-24T11:40:25.010483 #3552469] INFO -- : compiling /home/opc/ruby/src/master/builtin.c I, [2024-05-24T11:40:25.363377 #3552469] INFO -- : linking static-library libruby-static.a I, [2024-05-24T11:40:28.103410 #3552469] INFO -- : linking ruby I, [2024-05-24T11:40:29.067061 #3552469] INFO -- : $$$[end] "make ruby -j3" exit with 0. I, [2024-05-24T11:40:29.067240 #3552469] INFO -- : $$$[beg] make all -j3 I, [2024-05-24T11:40:29.157584 #3552469] INFO -- : BASERUBY = /usr/local/bin/ruby --disable=gems I, [2024-05-24T11:40:29.157659 #3552469] INFO -- : CC = gcc I, [2024-05-24T11:40:29.157670 #3552469] INFO -- : LD = ld I, [2024-05-24T11:40:29.157681 #3552469] INFO -- : LDSHARED = gcc -shared I, [2024-05-24T11:40:29.157690 #3552469] INFO -- : CFLAGS = -O3 -fno-fast-math -ggdb3 -Wall -Wextra -Wdeprecated-declarations -Wdiv-by-zero -Wduplicated-cond -Wimplicit-function-declaration -Wimplicit-int -Wpointer-arith -Wwrite-strings -Wold-style-definition -Wimplicit-fallthrough=0 -Wmissing-noreturn -Wno-cast-function-type -Wno-constant-logical-operand -Wno-long-long -Wno-missing-field-initializers -Wno-overlength-strings -Wno-packed-bitfield-compat -Wno-parentheses-equality -Wno-self-assign -Wno-tautological-compare -Wno-unused-parameter -Wno-unused-value -Wsuggest-attribute=format -Wsuggest-attribute=noreturn -Wunused-variable -Wmisleading-indentation -Wundef I, [2024-05-24T11:40:29.157703 #3552469] INFO -- : XCFLAGS = -U_FORTIFY_SOURCE -D_FORTIFY_SOURCE=2 -fstack-protector-strong -msign-return-address=all -fno-strict-overflow -fvisibility=hidden -fexcess-precision=standard -DRUBY_EXPORT -fPIE -I. -I.ext/include/aarch64-linux -I/home/opc/ruby/src/master/include -I/home/opc/ruby/src/master -I/home/opc/ruby/src/master/prism -I/home/opc/ruby/src/master/enc/unicode/15.0.0 I, [2024-05-24T11:40:29.157713 #3552469] INFO -- : CPPFLAGS = I, [2024-05-24T11:40:29.157721 #3552469] INFO -- : DLDFLAGS = -Wl,--compress-debug-sections=zlib -fstack-protector-strong -pie I, [2024-05-24T11:40:29.157730 #3552469] INFO -- : SOLIBS = -lz -lrt -lrt -ldl -lcrypt -lm -lpthread I, [2024-05-24T11:40:29.157739 #3552469] INFO -- : LANG = en_US.UTF-8 I, [2024-05-24T11:40:29.157746 #3552469] INFO -- : LC_ALL = I, [2024-05-24T11:40:29.157755 #3552469] INFO -- : LC_CTYPE = I, [2024-05-24T11:40:29.157763 #3552469] INFO -- : MFLAGS = -j3 --jobserver-auth=4,5 I, [2024-05-24T11:40:29.157771 #3552469] INFO -- : RUSTC = rustc I, [2024-05-24T11:40:29.157779 #3552469] INFO -- : YJIT_RUSTC_ARGS = --crate-name=yjit --crate-type=staticlib --edition=2021 -g -C lto=thin -C opt-level=3 -C overflow-checks=on '--out-dir=/home/opc/ruby/build/master/yjit/target/release/' /home/opc/ruby/src/master/yjit/src/lib.rs I, [2024-05-24T11:40:29.158615 #3552469] INFO -- : gcc (GCC) 8.5.0 20210514 (Red Hat 8.5.0-10.1.0.1) I, [2024-05-24T11:40:29.158652 #3552469] INFO -- : Copyright (C) 2018 Free Software Foundation, Inc. I, [2024-05-24T11:40:29.158663 #3552469] INFO -- : This is free software; see the source for copying conditions. There is NO I, [2024-05-24T11:40:29.158672 #3552469] INFO -- : warranty; not even for MERCHANTABILITY or FITNESS FOR A PARTICULAR PURPOSE. I, [2024-05-24T11:40:29.158681 #3552469] INFO -- : I, [2024-05-24T11:40:29.191736 #3552469] INFO -- : generating encdb.h I, [2024-05-24T11:40:29.193260 #3552469] INFO -- : generating enc.mk I, [2024-05-24T11:40:29.231786 #3552469] INFO -- : encdb.h unchanged I, [2024-05-24T11:40:29.435193 #3552469] INFO -- : making srcs under enc I, [2024-05-24T11:40:29.435401 #3552469] INFO -- : making enc I, [2024-05-24T11:40:29.462559 #3552469] INFO -- : make[1]: Entering directory '/home/opc/ruby/build/master' I, [2024-05-24T11:40:29.462641 #3552469] INFO -- : make[1]: Nothing to be done for 'enc'. I, [2024-05-24T11:40:29.462661 #3552469] INFO -- : make[1]: Leaving directory '/home/opc/ruby/build/master' I, [2024-05-24T11:40:29.477718 #3552469] INFO -- : make[1]: Entering directory '/home/opc/ruby/build/master' I, [2024-05-24T11:40:29.477781 #3552469] INFO -- : make[1]: Nothing to be done for 'srcs'. I, [2024-05-24T11:40:29.477791 #3552469] INFO -- : make[1]: Leaving directory '/home/opc/ruby/build/master' I, [2024-05-24T11:40:29.478563 #3552469] INFO -- : generating transdb.h I, [2024-05-24T11:40:29.625557 #3552469] INFO -- : transdb.h unchanged I, [2024-05-24T11:40:29.626913 #3552469] INFO -- : generating makefiles ext/configure-ext.mk I, [2024-05-24T11:40:29.627137 #3552469] INFO -- : making trans I, [2024-05-24T11:40:29.668999 #3552469] INFO -- : ext/configure-ext.mk updated I, [2024-05-24T11:40:29.672414 #3552469] INFO -- : make[1]: Entering directory '/home/opc/ruby/build/master' I, [2024-05-24T11:40:29.675441 #3552469] INFO -- : make[1]: Entering directory '/home/opc/ruby/build/master' I, [2024-05-24T11:40:29.675503 #3552469] INFO -- : make[1]: Nothing to be done for 'trans'. I, [2024-05-24T11:40:29.675517 #3552469] INFO -- : make[1]: Leaving directory '/home/opc/ruby/build/master' I, [2024-05-24T11:40:29.676160 #3552469] INFO -- : making encs I, [2024-05-24T11:40:29.729127 #3552469] INFO -- : make[1]: Entering directory '/home/opc/ruby/build/master' I, [2024-05-24T11:40:29.729237 #3552469] INFO -- : make[1]: Nothing to be done for 'encs'. I, [2024-05-24T11:40:29.729256 #3552469] INFO -- : make[1]: Leaving directory '/home/opc/ruby/build/master' I, [2024-05-24T11:40:30.513509 #3552469] INFO -- : make[1]: Leaving directory '/home/opc/ruby/build/master' I, [2024-05-24T11:40:30.514256 #3552469] INFO -- : generating makefile exts.mk I, [2024-05-24T11:40:30.575174 #3552469] INFO -- : exts.mk unchanged I, [2024-05-24T11:40:30.581027 #3552469] INFO -- : make[1]: Entering directory '/home/opc/ruby/build/master' I, [2024-05-24T11:40:30.688715 #3552469] INFO -- : make[2]: Entering directory '/home/opc/ruby/build/master/ext/digest' I, [2024-05-24T11:40:30.688837 #3552469] INFO -- : make[2]: Entering directory '/home/opc/ruby/build/master/ext/coverage' I, [2024-05-24T11:40:30.689773 #3552469] INFO -- : make[2]: Entering directory '/home/opc/ruby/build/master/ext/date' I, [2024-05-24T11:40:30.694783 #3552469] INFO -- : make[2]: Leaving directory '/home/opc/ruby/build/master/ext/coverage' I, [2024-05-24T11:40:30.695161 #3552469] INFO -- : make[2]: Leaving directory '/home/opc/ruby/build/master/ext/date' I, [2024-05-24T11:40:30.697896 #3552469] INFO -- : make[2]: Leaving directory '/home/opc/ruby/build/master/ext/digest' I, [2024-05-24T11:40:30.705233 #3552469] INFO -- : make[2]: Entering directory '/home/opc/ruby/build/master/ext/fiddle' I, [2024-05-24T11:40:30.706092 #3552469] INFO -- : make[2]: Entering directory '/home/opc/ruby/build/master/ext/io/console' I, [2024-05-24T11:40:30.714110 #3552469] INFO -- : make[2]: Leaving directory '/home/opc/ruby/build/master/ext/io/console' I, [2024-05-24T11:40:30.714536 #3552469] INFO -- : make[2]: Leaving directory '/home/opc/ruby/build/master/ext/fiddle' I, [2024-05-24T11:40:30.714565 #3552469] INFO -- : make[2]: Entering directory '/home/opc/ruby/build/master/ext/json' I, [2024-05-24T11:40:30.717956 #3552469] INFO -- : make[2]: Entering directory '/home/opc/ruby/build/master/ext/monitor' I, [2024-05-24T11:40:30.720366 #3552469] INFO -- : make[2]: Entering directory '/home/opc/ruby/build/master/ext/objspace' I, [2024-05-24T11:40:30.721932 #3552469] INFO -- : make[2]: Leaving directory '/home/opc/ruby/build/master/ext/monitor' I, [2024-05-24T11:40:30.724180 #3552469] INFO -- : make[2]: Leaving directory '/home/opc/ruby/build/master/ext/json' I, [2024-05-24T11:40:30.728156 #3552469] INFO -- : make[2]: Leaving directory '/home/opc/ruby/build/master/ext/objspace' I, [2024-05-24T11:40:30.731235 #3552469] INFO -- : make[2]: Entering directory '/home/opc/ruby/build/master/ext/pathname' I, [2024-05-24T11:40:30.734301 #3552469] INFO -- : make[2]: Entering directory '/home/opc/ruby/build/master/ext/psych' I, [2024-05-24T11:40:30.735978 #3552469] INFO -- : make[2]: Leaving directory '/home/opc/ruby/build/master/ext/pathname' I, [2024-05-24T11:40:30.740427 #3552469] INFO -- : make[2]: Entering directory '/home/opc/ruby/build/master/ext/pty' I, [2024-05-24T11:40:30.740765 #3552469] INFO -- : make[2]: Entering directory '/home/opc/ruby/build/master/ext/openssl' I, [2024-05-24T11:40:30.747496 #3552469] INFO -- : make[2]: Leaving directory '/home/opc/ruby/build/master/ext/pty' I, [2024-05-24T11:40:30.754997 #3552469] INFO -- : make[2]: Leaving directory '/home/opc/ruby/build/master/ext/psych' I, [2024-05-24T11:40:30.757106 #3552469] INFO -- : make[2]: Entering directory '/home/opc/ruby/build/master/ext/rubyvm' I, [2024-05-24T11:40:30.761103 #3552469] INFO -- : make[2]: Entering directory '/home/opc/ruby/build/master/ext/ripper' I, [2024-05-24T11:40:30.762564 #3552469] INFO -- : make[2]: Leaving directory '/home/opc/ruby/build/master/ext/rubyvm' I, [2024-05-24T11:40:30.763103 #3552469] INFO -- : make[2]: Leaving directory '/home/opc/ruby/build/master/ext/openssl' I, [2024-05-24T11:40:30.771685 #3552469] INFO -- : make[2]: Leaving directory '/home/opc/ruby/build/master/ext/ripper' I, [2024-05-24T11:40:30.774452 #3552469] INFO -- : make[2]: Entering directory '/home/opc/ruby/build/master/.bundle/gems/bigdecimal-3.1.7/ext/bigdecimal' I, [2024-05-24T11:40:30.774904 #3552469] INFO -- : make[2]: Entering directory '/home/opc/ruby/build/master/ext/socket' I, [2024-05-24T11:40:30.778838 #3552469] INFO -- : make[2]: Entering directory '/home/opc/ruby/build/master/.bundle/gems/bigdecimal-3.1.8/ext/bigdecimal' I, [2024-05-24T11:40:30.787313 #3552469] INFO -- : make[2]: Leaving directory '/home/opc/ruby/build/master/ext/socket' I, [2024-05-24T11:40:30.789962 #3552469] INFO -- : make[2]: Entering directory '/home/opc/ruby/build/master/.bundle/gems/debug-1.9.2/ext/debug' I, [2024-05-24T11:40:30.807147 #3552469] INFO -- : make[2]: Leaving directory '/home/opc/ruby/build/master/.bundle/gems/bigdecimal-3.1.7/ext/bigdecimal' I, [2024-05-24T11:40:30.809694 #3552469] INFO -- : make[2]: Entering directory '/home/opc/ruby/build/master/.bundle/gems/nkf-0.2.0/ext/nkf' I, [2024-05-24T11:40:30.814970 #3552469] INFO -- : make[2]: Leaving directory '/home/opc/ruby/build/master/.bundle/gems/bigdecimal-3.1.8/ext/bigdecimal' I, [2024-05-24T11:40:30.817634 #3552469] INFO -- : make[2]: Entering directory '/home/opc/ruby/build/master/.bundle/gems/racc-1.7.3/ext/racc/cparse' I, [2024-05-24T11:40:30.824277 #3552469] INFO -- : make[2]: Leaving directory '/home/opc/ruby/build/master/.bundle/gems/debug-1.9.2/ext/debug' I, [2024-05-24T11:40:30.826943 #3552469] INFO -- : make[2]: Entering directory '/home/opc/ruby/build/master/.bundle/gems/racc-1.8.0/ext/racc/cparse' I, [2024-05-24T11:40:30.842531 #3552469] INFO -- : make[2]: Leaving directory '/home/opc/ruby/build/master/.bundle/gems/nkf-0.2.0/ext/nkf' I, [2024-05-24T11:40:30.846270 #3552469] INFO -- : make[2]: Entering directory '/home/opc/ruby/build/master/.bundle/gems/rbs-3.4.4/ext/rbs_extension' I, [2024-05-24T11:40:30.850513 #3552469] INFO -- : make[2]: Leaving directory '/home/opc/ruby/build/master/.bundle/gems/racc-1.7.3/ext/racc/cparse' I, [2024-05-24T11:40:30.853331 #3552469] INFO -- : make[2]: Entering directory '/home/opc/ruby/build/master/.bundle/gems/syslog-0.1.2/ext/syslog' I, [2024-05-24T11:40:30.862529 #3552469] INFO -- : make[2]: Leaving directory '/home/opc/ruby/build/master/.bundle/gems/racc-1.8.0/ext/racc/cparse' I, [2024-05-24T11:40:30.879360 #3552469] INFO -- : make[2]: Leaving directory '/home/opc/ruby/build/master/.bundle/gems/rbs-3.4.4/ext/rbs_extension' I, [2024-05-24T11:40:30.883836 #3552469] INFO -- : make[2]: Entering directory '/home/opc/ruby/build/master/ext/digest/sha2' I, [2024-05-24T11:40:30.888945 #3552469] INFO -- : make[2]: Leaving directory '/home/opc/ruby/build/master/ext/digest/sha2' I, [2024-05-24T11:40:30.889014 #3552469] INFO -- : make[2]: Leaving directory '/home/opc/ruby/build/master/.bundle/gems/syslog-0.1.2/ext/syslog' I, [2024-05-24T11:40:30.931747 #3552469] INFO -- : make[2]: Entering directory '/home/opc/ruby/build/master' I, [2024-05-24T11:40:31.018773 #3552469] INFO -- : make[2]: 'ruby' is up to date. I, [2024-05-24T11:40:31.018850 #3552469] INFO -- : make[2]: Leaving directory '/home/opc/ruby/build/master' I, [2024-05-24T11:40:31.018979 #3552469] INFO -- : make[1]: Leaving directory '/home/opc/ruby/build/master' I, [2024-05-24T11:40:31.023414 #3552469] INFO -- : make[1]: Entering directory '/home/opc/ruby/build/master' I, [2024-05-24T11:40:31.023450 #3552469] INFO -- : make[1]: Nothing to be done for 'note'. I, [2024-05-24T11:40:31.023460 #3552469] INFO -- : make[1]: Leaving directory '/home/opc/ruby/build/master' I, [2024-05-24T11:40:31.023756 #3552469] INFO -- : $$$[end] "make all -j3" exit with 0. I, [2024-05-24T11:40:31.023906 #3552469] INFO -- : $$$[beg] make install -j3 I, [2024-05-24T11:40:31.120639 #3552469] INFO -- : Update power_assert to 84e85124c5014a139af39161d484156cfe87a9ed I, [2024-05-24T11:40:31.120885 #3552469] INFO -- : Update rbs to ba7872795d5de04adb8ff500c0e6afdc81a041dd I, [2024-05-24T11:40:31.122049 #3552469] INFO -- : Update typeprof to b19a6416da3a05d57fadd6ffdadb382b6d236ca5 I, [2024-05-24T11:40:31.125640 #3552469] INFO -- : echo 84e85124c5014a139af39161d484156cfe87a9ed | /bin/sh /home/opc/ruby/src/master/tool/ifchange /home/opc/ruby/src/master/.bundle/.timestamp/power_assert.revision - I, [2024-05-24T11:40:31.125900 #3552469] INFO -- : echo ba7872795d5de04adb8ff500c0e6afdc81a041dd | /bin/sh /home/opc/ruby/src/master/tool/ifchange /home/opc/ruby/src/master/.bundle/.timestamp/rbs.revision - I, [2024-05-24T11:40:31.126075 #3552469] INFO -- : echo b19a6416da3a05d57fadd6ffdadb382b6d236ca5 | /bin/sh /home/opc/ruby/src/master/tool/ifchange /home/opc/ruby/src/master/.bundle/.timestamp/typeprof.revision - I, [2024-05-24T11:40:31.132742 #3552469] INFO -- : /home/opc/ruby/src/master/.bundle/.timestamp/typeprof.revision unchanged I, [2024-05-24T11:40:31.134228 #3552469] INFO -- : /home/opc/ruby/src/master/.bundle/.timestamp/power_assert.revision unchanged I, [2024-05-24T11:40:31.134883 #3552469] INFO -- : /home/opc/ruby/src/master/.bundle/.timestamp/rbs.revision unchanged I, [2024-05-24T11:40:31.141501 #3552469] INFO -- : BASERUBY = /usr/local/bin/ruby --disable=gems I, [2024-05-24T11:40:31.141551 #3552469] INFO -- : CC = gcc I, [2024-05-24T11:40:31.141578 #3552469] INFO -- : LD = ld I, [2024-05-24T11:40:31.141587 #3552469] INFO -- : LDSHARED = gcc -shared I, [2024-05-24T11:40:31.141597 #3552469] INFO -- : CFLAGS = -O3 -fno-fast-math -ggdb3 -Wall -Wextra -Wdeprecated-declarations -Wdiv-by-zero -Wduplicated-cond -Wimplicit-function-declaration -Wimplicit-int -Wpointer-arith -Wwrite-strings -Wold-style-definition -Wimplicit-fallthrough=0 -Wmissing-noreturn -Wno-cast-function-type -Wno-constant-logical-operand -Wno-long-long -Wno-missing-field-initializers -Wno-overlength-strings -Wno-packed-bitfield-compat -Wno-parentheses-equality -Wno-self-assign -Wno-tautological-compare -Wno-unused-parameter -Wno-unused-value -Wsuggest-attribute=format -Wsuggest-attribute=noreturn -Wunused-variable -Wmisleading-indentation -Wundef I, [2024-05-24T11:40:31.141606 #3552469] INFO -- : XCFLAGS = -U_FORTIFY_SOURCE -D_FORTIFY_SOURCE=2 -fstack-protector-strong -msign-return-address=all -fno-strict-overflow -fvisibility=hidden -fexcess-precision=standard -DRUBY_EXPORT -fPIE -I. -I.ext/include/aarch64-linux -I/home/opc/ruby/src/master/include -I/home/opc/ruby/src/master -I/home/opc/ruby/src/master/prism -I/home/opc/ruby/src/master/enc/unicode/15.0.0 I, [2024-05-24T11:40:31.141614 #3552469] INFO -- : CPPFLAGS = I, [2024-05-24T11:40:31.141622 #3552469] INFO -- : DLDFLAGS = -Wl,--compress-debug-sections=zlib -fstack-protector-strong -pie I, [2024-05-24T11:40:31.141630 #3552469] INFO -- : SOLIBS = -lz -lrt -lrt -ldl -lcrypt -lm -lpthread I, [2024-05-24T11:40:31.141638 #3552469] INFO -- : LANG = en_US.UTF-8 I, [2024-05-24T11:40:31.141646 #3552469] INFO -- : LC_ALL = I, [2024-05-24T11:40:31.141654 #3552469] INFO -- : LC_CTYPE = I, [2024-05-24T11:40:31.141661 #3552469] INFO -- : MFLAGS = -j3 --jobserver-auth=4,5 I, [2024-05-24T11:40:31.141669 #3552469] INFO -- : RUSTC = rustc I, [2024-05-24T11:40:31.141677 #3552469] INFO -- : YJIT_RUSTC_ARGS = --crate-name=yjit --crate-type=staticlib --edition=2021 -g -C lto=thin -C opt-level=3 -C overflow-checks=on '--out-dir=/home/opc/ruby/build/master/yjit/target/release/' /home/opc/ruby/src/master/yjit/src/lib.rs I, [2024-05-24T11:40:31.168722 #3552469] INFO -- : generating encdb.h I, [2024-05-24T11:40:31.168781 #3552469] INFO -- : gcc (GCC) 8.5.0 20210514 (Red Hat 8.5.0-10.1.0.1) I, [2024-05-24T11:40:31.168791 #3552469] INFO -- : Copyright (C) 2018 Free Software Foundation, Inc. I, [2024-05-24T11:40:31.168799 #3552469] INFO -- : This is free software; see the source for copying conditions. There is NO I, [2024-05-24T11:40:31.168808 #3552469] INFO -- : warranty; not even for MERCHANTABILITY or FITNESS FOR A PARTICULAR PURPOSE. I, [2024-05-24T11:40:31.168818 #3552469] INFO -- : I, [2024-05-24T11:40:31.169647 #3552469] INFO -- : generating enc.mk I, [2024-05-24T11:40:31.206875 #3552469] INFO -- : encdb.h unchanged I, [2024-05-24T11:40:31.302145 #3552469] INFO -- : Building power_assert@84e85124c5014a139af39161d484156cfe87a9ed to /home/opc/ruby/src/master/gems/power_assert-2.0.3.gem I, [2024-05-24T11:40:31.415552 #3552469] INFO -- : making srcs under enc I, [2024-05-24T11:40:31.415756 #3552469] INFO -- : making enc I, [2024-05-24T11:40:31.424329 #3552469] INFO -- : Successfully built RubyGem I, [2024-05-24T11:40:31.424391 #3552469] INFO -- : Name: power_assert I, [2024-05-24T11:40:31.424403 #3552469] INFO -- : Version: 2.0.4dev I, [2024-05-24T11:40:31.424411 #3552469] INFO -- : File: power_assert-2.0.4dev.gem I, [2024-05-24T11:40:31.426771 #3552469] INFO -- : Extracting bundle gem power_assert-2.0.3... I, [2024-05-24T11:40:31.444307 #3552469] INFO -- : make[1]: Entering directory '/home/opc/ruby/build/master' I, [2024-05-24T11:40:31.444385 #3552469] INFO -- : make[1]: Nothing to be done for 'enc'. I, [2024-05-24T11:40:31.444418 #3552469] INFO -- : make[1]: Leaving directory '/home/opc/ruby/build/master' I, [2024-05-24T11:40:31.457777 #3552469] INFO -- : make[1]: Entering directory '/home/opc/ruby/build/master' I, [2024-05-24T11:40:31.457839 #3552469] INFO -- : make[1]: Nothing to be done for 'srcs'. I, [2024-05-24T11:40:31.457849 #3552469] INFO -- : make[1]: Leaving directory '/home/opc/ruby/build/master' I, [2024-05-24T11:40:31.458683 #3552469] INFO -- : generating transdb.h I, [2024-05-24T11:40:31.528716 #3552469] INFO -- : Try with hash version of bundled gems instead of gems/power_assert-2.0.3.gem. We don't use this gem with release version of Ruby. I, [2024-05-24T11:40:31.539723 #3552469] INFO -- : Unpacked gems/power_assert-2.0.4dev.gem I, [2024-05-24T11:40:31.605511 #3552469] INFO -- : transdb.h unchanged I, [2024-05-24T11:40:31.606936 #3552469] INFO -- : generating makefiles ext/configure-ext.mk I, [2024-05-24T11:40:31.607089 #3552469] INFO -- : making trans I, [2024-05-24T11:40:31.649358 #3552469] INFO -- : ext/configure-ext.mk unchanged I, [2024-05-24T11:40:31.652891 #3552469] INFO -- : make[1]: Entering directory '/home/opc/ruby/build/master' I, [2024-05-24T11:40:31.655451 #3552469] INFO -- : make[1]: Entering directory '/home/opc/ruby/build/master' I, [2024-05-24T11:40:31.655522 #3552469] INFO -- : make[1]: Nothing to be done for 'trans'. I, [2024-05-24T11:40:31.655533 #3552469] INFO -- : make[1]: Leaving directory '/home/opc/ruby/build/master' I, [2024-05-24T11:40:31.656203 #3552469] INFO -- : making encs I, [2024-05-24T11:40:31.711100 #3552469] INFO -- : make[1]: Entering directory '/home/opc/ruby/build/master' I, [2024-05-24T11:40:31.711179 #3552469] INFO -- : make[1]: Nothing to be done for 'encs'. I, [2024-05-24T11:40:31.711190 #3552469] INFO -- : make[1]: Leaving directory '/home/opc/ruby/build/master' I, [2024-05-24T11:40:32.513391 #3552469] INFO -- : make[1]: Leaving directory '/home/opc/ruby/build/master' I, [2024-05-24T11:40:32.514194 #3552469] INFO -- : generating makefile exts.mk I, [2024-05-24T11:40:32.578070 #3552469] INFO -- : exts.mk unchanged I, [2024-05-24T11:40:32.583334 #3552469] INFO -- : make[1]: Entering directory '/home/opc/ruby/build/master' I, [2024-05-24T11:40:32.692499 #3552469] INFO -- : make[2]: Entering directory '/home/opc/ruby/build/master/ext/coverage' I, [2024-05-24T11:40:32.694935 #3552469] INFO -- : make[2]: Entering directory '/home/opc/ruby/build/master/ext/digest' I, [2024-05-24T11:40:32.696857 #3552469] INFO -- : make[2]: Entering directory '/home/opc/ruby/build/master/ext/date' I, [2024-05-24T11:40:32.700299 #3552469] INFO -- : make[2]: Leaving directory '/home/opc/ruby/build/master/ext/coverage' I, [2024-05-24T11:40:32.702175 #3552469] INFO -- : make[2]: Leaving directory '/home/opc/ruby/build/master/ext/date' I, [2024-05-24T11:40:32.704998 #3552469] INFO -- : make[2]: Leaving directory '/home/opc/ruby/build/master/ext/digest' I, [2024-05-24T11:40:32.711712 #3552469] INFO -- : make[2]: Entering directory '/home/opc/ruby/build/master/ext/io/console' I, [2024-05-24T11:40:32.712198 #3552469] INFO -- : make[2]: Entering directory '/home/opc/ruby/build/master/ext/fiddle' I, [2024-05-24T11:40:32.717255 #3552469] INFO -- : make[2]: Leaving directory '/home/opc/ruby/build/master/ext/io/console' I, [2024-05-24T11:40:32.720562 #3552469] INFO -- : make[2]: Entering directory '/home/opc/ruby/build/master/ext/json' I, [2024-05-24T11:40:32.721402 #3552469] INFO -- : make[2]: Leaving directory '/home/opc/ruby/build/master/ext/fiddle' I, [2024-05-24T11:40:32.724555 #3552469] INFO -- : make[2]: Entering directory '/home/opc/ruby/build/master/ext/monitor' I, [2024-05-24T11:40:32.728558 #3552469] INFO -- : make[2]: Entering directory '/home/opc/ruby/build/master/ext/objspace' I, [2024-05-24T11:40:32.729562 #3552469] INFO -- : make[2]: Leaving directory '/home/opc/ruby/build/master/ext/monitor' I, [2024-05-24T11:40:32.729604 #3552469] INFO -- : make[2]: Leaving directory '/home/opc/ruby/build/master/ext/json' I, [2024-05-24T11:40:32.734841 #3552469] INFO -- : make[2]: Leaving directory '/home/opc/ruby/build/master/ext/objspace' I, [2024-05-24T11:40:32.734899 #3552469] INFO -- : make[2]: Entering directory '/home/opc/ruby/build/master/ext/pathname' I, [2024-05-24T11:40:32.739138 #3552469] INFO -- : make[2]: Leaving directory '/home/opc/ruby/build/master/ext/pathname' I, [2024-05-24T11:40:32.741506 #3552469] INFO -- : make[2]: Entering directory '/home/opc/ruby/build/master/ext/psych' I, [2024-05-24T11:40:32.743351 #3552469] INFO -- : make[2]: Entering directory '/home/opc/ruby/build/master/ext/pty' I, [2024-05-24T11:40:32.748752 #3552469] INFO -- : make[2]: Entering directory '/home/opc/ruby/build/master/ext/openssl' I, [2024-05-24T11:40:32.754884 #3552469] INFO -- : make[2]: Leaving directory '/home/opc/ruby/build/master/ext/pty' I, [2024-05-24T11:40:32.760654 #3552469] INFO -- : make[2]: Leaving directory '/home/opc/ruby/build/master/ext/psych' I, [2024-05-24T11:40:32.764284 #3552469] INFO -- : make[2]: Entering directory '/home/opc/ruby/build/master/ext/rubyvm' I, [2024-05-24T11:40:32.768026 #3552469] INFO -- : make[2]: Leaving directory '/home/opc/ruby/build/master/ext/rubyvm' I, [2024-05-24T11:40:32.769074 #3552469] INFO -- : make[2]: Entering directory '/home/opc/ruby/build/master/ext/ripper' I, [2024-05-24T11:40:32.771030 #3552469] INFO -- : make[2]: Leaving directory '/home/opc/ruby/build/master/ext/openssl' I, [2024-05-24T11:40:32.779126 #3552469] INFO -- : make[2]: Leaving directory '/home/opc/ruby/build/master/ext/ripper' I, [2024-05-24T11:40:32.780011 #3552469] INFO -- : make[2]: Entering directory '/home/opc/ruby/build/master/ext/socket' I, [2024-05-24T11:40:32.782559 #3552469] INFO -- : make[2]: Entering directory '/home/opc/ruby/build/master/.bundle/gems/bigdecimal-3.1.7/ext/bigdecimal' I, [2024-05-24T11:40:32.786306 #3552469] INFO -- : make[2]: Entering directory '/home/opc/ruby/build/master/.bundle/gems/bigdecimal-3.1.8/ext/bigdecimal' I, [2024-05-24T11:40:32.791187 #3552469] INFO -- : make[2]: Leaving directory '/home/opc/ruby/build/master/ext/socket' I, [2024-05-24T11:40:32.793792 #3552469] INFO -- : make[2]: Entering directory '/home/opc/ruby/build/master/.bundle/gems/debug-1.9.2/ext/debug' I, [2024-05-24T11:40:32.817129 #3552469] INFO -- : make[2]: Leaving directory '/home/opc/ruby/build/master/.bundle/gems/bigdecimal-3.1.7/ext/bigdecimal' I, [2024-05-24T11:40:32.820111 #3552469] INFO -- : make[2]: Entering directory '/home/opc/ruby/build/master/.bundle/gems/nkf-0.2.0/ext/nkf' I, [2024-05-24T11:40:32.822617 #3552469] INFO -- : make[2]: Leaving directory '/home/opc/ruby/build/master/.bundle/gems/bigdecimal-3.1.8/ext/bigdecimal' I, [2024-05-24T11:40:32.825119 #3552469] INFO -- : make[2]: Entering directory '/home/opc/ruby/build/master/.bundle/gems/racc-1.7.3/ext/racc/cparse' I, [2024-05-24T11:40:32.828040 #3552469] INFO -- : make[2]: Leaving directory '/home/opc/ruby/build/master/.bundle/gems/debug-1.9.2/ext/debug' I, [2024-05-24T11:40:32.830536 #3552469] INFO -- : make[2]: Entering directory '/home/opc/ruby/build/master/.bundle/gems/racc-1.8.0/ext/racc/cparse' I, [2024-05-24T11:40:32.855503 #3552469] INFO -- : make[2]: Leaving directory '/home/opc/ruby/build/master/.bundle/gems/nkf-0.2.0/ext/nkf' I, [2024-05-24T11:40:32.858659 #3552469] INFO -- : make[2]: Entering directory '/home/opc/ruby/build/master/.bundle/gems/rbs-3.4.4/ext/rbs_extension' I, [2024-05-24T11:40:32.859614 #3552469] INFO -- : make[2]: Leaving directory '/home/opc/ruby/build/master/.bundle/gems/racc-1.7.3/ext/racc/cparse' I, [2024-05-24T11:40:32.866157 #3552469] INFO -- : make[2]: Entering directory '/home/opc/ruby/build/master/.bundle/gems/syslog-0.1.2/ext/syslog' I, [2024-05-24T11:40:32.867068 #3552469] INFO -- : make[2]: Leaving directory '/home/opc/ruby/build/master/.bundle/gems/racc-1.8.0/ext/racc/cparse' I, [2024-05-24T11:40:32.894829 #3552469] INFO -- : make[2]: Entering directory '/home/opc/ruby/build/master/ext/digest/sha2' I, [2024-05-24T11:40:32.895472 #3552469] INFO -- : make[2]: Leaving directory '/home/opc/ruby/build/master/.bundle/gems/rbs-3.4.4/ext/rbs_extension' I, [2024-05-24T11:40:32.900237 #3552469] INFO -- : make[2]: Leaving directory '/home/opc/ruby/build/master/ext/digest/sha2' I, [2024-05-24T11:40:32.900310 #3552469] INFO -- : make[2]: Leaving directory '/home/opc/ruby/build/master/.bundle/gems/syslog-0.1.2/ext/syslog' I, [2024-05-24T11:40:32.944016 #3552469] INFO -- : make[2]: Entering directory '/home/opc/ruby/build/master' I, [2024-05-24T11:40:33.032838 #3552469] INFO -- : make[2]: 'ruby' is up to date. I, [2024-05-24T11:40:33.032920 #3552469] INFO -- : make[2]: Leaving directory '/home/opc/ruby/build/master' I, [2024-05-24T11:40:33.033046 #3552469] INFO -- : make[1]: Leaving directory '/home/opc/ruby/build/master' I, [2024-05-24T11:40:33.037639 #3552469] INFO -- : make[1]: Entering directory '/home/opc/ruby/build/master' I, [2024-05-24T11:40:33.037661 #3552469] INFO -- : make[1]: Nothing to be done for 'note'. I, [2024-05-24T11:40:33.037672 #3552469] INFO -- : make[1]: Leaving directory '/home/opc/ruby/build/master' I, [2024-05-24T11:40:33.037868 #3552469] INFO -- : ./miniruby -I/home/opc/ruby/src/master/lib -I. -I.ext/common /home/opc/ruby/src/master/tool/runruby.rb --extout=.ext -- --disable-gems -r./aarch64-linux-fake /home/opc/ruby/src/master/tool/rbinstall.rb --make="make" --dest-dir="" --extout=".ext" --ext-build-dir="./ext" --mflags="-j3 --jobserver-auth=4,5" --make-flags=" -j3 --jobserver-auth=4,5" --data-mode=0644 --prog-mode=0755 --installed-list .installed.list --mantype="doc" --gnumake --install=all --exclude=doc I, [2024-05-24T11:40:33.201453 #3552469] INFO -- : Installing to I, [2024-05-24T11:40:33.201519 #3552469] INFO -- : installing binary commands: /home/opc/ruby/install/master/bin I, [2024-05-24T11:40:33.213967 #3552469] INFO -- : installing base libraries: /home/opc/ruby/install/master/lib I, [2024-05-24T11:40:33.214492 #3552469] INFO -- : installing arch files: /home/opc/ruby/install/master/lib/ruby/3.4.0+0/aarch64-linux I, [2024-05-24T11:40:33.214648 #3552469] INFO -- : installing pkgconfig data: /home/opc/ruby/install/master/lib/pkgconfig I, [2024-05-24T11:40:33.214793 #3552469] INFO -- : installing extension objects: /home/opc/ruby/install/master/lib/ruby/3.4.0+0/aarch64-linux I, [2024-05-24T11:40:33.227645 #3552469] INFO -- : installing extension objects: /home/opc/ruby/install/master/lib/ruby/site_ruby/3.4.0+0/aarch64-linux I, [2024-05-24T11:40:33.227675 #3552469] INFO -- : installing extension objects: /home/opc/ruby/install/master/lib/ruby/vendor_ruby/3.4.0+0/aarch64-linux I, [2024-05-24T11:40:33.227813 #3552469] INFO -- : installing extension headers: /home/opc/ruby/install/master/include/ruby-3.4.0+0/aarch64-linux I, [2024-05-24T11:40:33.228112 #3552469] INFO -- : installing extension scripts: /home/opc/ruby/install/master/lib/ruby/3.4.0+0 I, [2024-05-24T11:40:33.236144 #3552469] INFO -- : installing extension scripts: /home/opc/ruby/install/master/lib/ruby/site_ruby/3.4.0+0 I, [2024-05-24T11:40:33.236204 #3552469] INFO -- : installing extension scripts: /home/opc/ruby/install/master/lib/ruby/vendor_ruby/3.4.0+0 I, [2024-05-24T11:40:33.236216 #3552469] INFO -- : installing extension headers: /home/opc/ruby/install/master/include/ruby-3.4.0+0/ruby I, [2024-05-24T11:40:33.236289 #3552469] INFO -- : installing command scripts: /home/opc/ruby/install/master/bin I, [2024-05-24T11:40:33.236430 #3552469] INFO -- : installing library scripts: /home/opc/ruby/install/master/lib/ruby/3.4.0+0 I, [2024-05-24T11:40:33.322156 #3552469] INFO -- : installing common headers: /home/opc/ruby/install/master/include/ruby-3.4.0+0 I, [2024-05-24T11:40:33.334464 #3552469] INFO -- : installing manpages: /home/opc/ruby/install/master/share/man/man1 I, [2024-05-24T11:40:33.334982 #3552469] INFO -- : installing default gems from lib: /home/opc/ruby/install/master/lib/ruby/gems/3.4.0+0 I, [2024-05-24T11:40:33.383362 #3552469] INFO -- : benchmark 0.3.0 I, [2024-05-24T11:40:33.387688 #3552469] INFO -- : bundler 2.6.0.dev I, [2024-05-24T11:40:33.392876 #3552469] INFO -- : cgi 0.4.1 I, [2024-05-24T11:40:33.394202 #3552469] INFO -- : delegate 0.3.1 I, [2024-05-24T11:40:33.395335 #3552469] INFO -- : did_you_mean 1.6.3 I, [2024-05-24T11:40:33.396497 #3552469] INFO -- : english 0.8.0 I, [2024-05-24T11:40:33.399537 #3552469] INFO -- : erb 4.0.4 I, [2024-05-24T11:40:33.402284 #3552469] INFO -- : error_highlight 0.6.0 I, [2024-05-24T11:40:33.403401 #3552469] INFO -- : fileutils 1.7.2 I, [2024-05-24T11:40:33.404597 #3552469] INFO -- : find 0.2.0 I, [2024-05-24T11:40:33.405809 #3552469] INFO -- : forwardable 1.3.3 I, [2024-05-24T11:40:33.406933 #3552469] INFO -- : ipaddr 1.2.6 I, [2024-05-24T11:40:33.408042 #3552469] INFO -- : irb 1.13.1 I, [2024-05-24T11:40:33.410925 #3552469] INFO -- : logger 1.6.0 I, [2024-05-24T11:40:33.412051 #3552469] INFO -- : net-http 0.4.1 I, [2024-05-24T11:40:33.413346 #3552469] INFO -- : net-protocol 0.2.2 I, [2024-05-24T11:40:33.414501 #3552469] INFO -- : open-uri 0.4.1 I, [2024-05-24T11:40:33.415686 #3552469] INFO -- : open3 0.2.1 I, [2024-05-24T11:40:33.416860 #3552469] INFO -- : optparse 0.5.0 I, [2024-05-24T11:40:33.418047 #3552469] INFO -- : ostruct 0.6.0 I, [2024-05-24T11:40:33.419123 #3552469] INFO -- : pp 0.5.0 I, [2024-05-24T11:40:33.420304 #3552469] INFO -- : prettyprint 0.2.0 I, [2024-05-24T11:40:33.421493 #3552469] INFO -- : prism 0.29.0 I, [2024-05-24T11:40:33.422708 #3552469] INFO -- : pstore 0.1.3 I, [2024-05-24T11:40:33.423833 #3552469] INFO -- : rdoc 6.7.0 I, [2024-05-24T11:40:33.427687 #3552469] INFO -- : readline 0.0.4 I, [2024-05-24T11:40:33.428863 #3552469] INFO -- : reline 0.5.7 I, [2024-05-24T11:40:33.430080 #3552469] INFO -- : resolv 0.4.0 I, [2024-05-24T11:40:33.432842 #3552469] INFO -- : ruby2_keywords 0.0.5 I, [2024-05-24T11:40:33.434426 #3552469] INFO -- : securerandom 0.3.1 I, [2024-05-24T11:40:33.435520 #3552469] INFO -- : set 1.1.0 I, [2024-05-24T11:40:33.436639 #3552469] INFO -- : shellwords 0.2.0 I, [2024-05-24T11:40:33.437812 #3552469] INFO -- : singleton 0.2.0 I, [2024-05-24T11:40:33.438892 #3552469] INFO -- : syntax_suggest 2.0.0 I, [2024-05-24T11:40:33.441450 #3552469] INFO -- : tempfile 0.2.1 I, [2024-05-24T11:40:33.442591 #3552469] INFO -- : time 0.3.0 I, [2024-05-24T11:40:33.443746 #3552469] INFO -- : timeout 0.4.1 I, [2024-05-24T11:40:33.444910 #3552469] INFO -- : tmpdir 0.2.0 I, [2024-05-24T11:40:33.446102 #3552469] INFO -- : tsort 0.2.0 I, [2024-05-24T11:40:33.447440 #3552469] INFO -- : un 0.3.0 I, [2024-05-24T11:40:33.448578 #3552469] INFO -- : uri 0.13.0 I, [2024-05-24T11:40:33.449777 #3552469] INFO -- : weakref 0.1.3 I, [2024-05-24T11:40:33.450852 #3552469] INFO -- : yaml 0.3.0 I, [2024-05-24T11:40:33.451751 #3552469] INFO -- : installing default gems from ext: /home/opc/ruby/install/master/lib/ruby/gems/3.4.0+0 I, [2024-05-24T11:40:33.461447 #3552469] INFO -- : date 3.3.4 I, [2024-05-24T11:40:33.464799 #3552469] INFO -- : digest 3.1.1 I, [2024-05-24T11:40:33.465972 #3552469] INFO -- : etc 1.4.3 I, [2024-05-24T11:40:33.467123 #3552469] INFO -- : fcntl 1.1.0 I, [2024-05-24T11:40:33.468257 #3552469] INFO -- : fiddle 1.1.3 I, [2024-05-24T11:40:33.469480 #3552469] INFO -- : io-console 0.7.2 I, [2024-05-24T11:40:33.470593 #3552469] INFO -- : io-nonblock 0.3.0 I, [2024-05-24T11:40:33.471695 #3552469] INFO -- : io-wait 0.3.1 I, [2024-05-24T11:40:33.472902 #3552469] INFO -- : json 2.7.2 I, [2024-05-24T11:40:33.474213 #3552469] INFO -- : openssl 3.2.0 I, [2024-05-24T11:40:33.475396 #3552469] INFO -- : pathname 0.3.0 I, [2024-05-24T11:40:33.477072 #3552469] INFO -- : psych 5.1.2 I, [2024-05-24T11:40:33.478405 #3552469] INFO -- : stringio 3.1.1 I, [2024-05-24T11:40:33.479545 #3552469] INFO -- : strscan 3.1.1 I, [2024-05-24T11:40:33.480659 #3552469] INFO -- : zlib 3.1.0 I, [2024-05-24T11:40:33.481655 #3552469] INFO -- : installing bundled gems: /home/opc/ruby/install/master/lib/ruby/gems/3.4.0+0 I, [2024-05-24T11:40:33.482662 #3552469] INFO -- : minitest 5.23.1 I, [2024-05-24T11:40:33.501728 #3552469] INFO -- : rake 13.2.1 I, [2024-05-24T11:40:33.520696 #3552469] INFO -- : test-unit 3.6.2 I, [2024-05-24T11:40:33.537764 #3552469] INFO -- : rexml 3.2.8 I, [2024-05-24T11:40:33.558116 #3552469] INFO -- : rss 0.3.0 I, [2024-05-24T11:40:33.570671 #3552469] INFO -- : net-ftp 0.3.4 I, [2024-05-24T11:40:33.574695 #3552469] INFO -- : net-imap 0.4.11 I, [2024-05-24T11:40:33.588302 #3552469] INFO -- : net-pop 0.1.2 I, [2024-05-24T11:40:33.591210 #3552469] INFO -- : net-smtp 0.5.0 I, [2024-05-24T11:40:33.594831 #3552469] INFO -- : matrix 0.4.2 I, [2024-05-24T11:40:33.603698 #3552469] INFO -- : prime 0.1.2 I, [2024-05-24T11:40:33.612914 #3552469] INFO -- : rbs 3.4.4 I, [2024-05-24T11:40:33.718930 #3552469] INFO -- : typeprof 0.21.11 I, [2024-05-24T11:40:33.733524 #3552469] INFO -- : debug 1.9.2 I, [2024-05-24T11:40:33.745641 #3552469] INFO -- : racc 1.8.0 I, [2024-05-24T11:40:33.759201 #3552469] INFO -- : mutex_m 0.2.0 I, [2024-05-24T11:40:33.762495 #3552469] INFO -- : getoptlong 0.2.1 I, [2024-05-24T11:40:33.767628 #3552469] INFO -- : base64 0.2.0 I, [2024-05-24T11:40:33.770317 #3552469] INFO -- : bigdecimal 3.1.8 I, [2024-05-24T11:40:33.776929 #3552469] INFO -- : observer 0.1.2 I, [2024-05-24T11:40:33.780198 #3552469] INFO -- : abbrev 0.1.2 I, [2024-05-24T11:40:33.783304 #3552469] INFO -- : resolv-replace 0.1.1 I, [2024-05-24T11:40:33.788000 #3552469] INFO -- : rinda 0.2.0 I, [2024-05-24T11:40:33.791763 #3552469] INFO -- : drb 2.2.1 I, [2024-05-24T11:40:33.797116 #3552469] INFO -- : nkf 0.2.0 I, [2024-05-24T11:40:33.804302 #3552469] INFO -- : syslog 0.1.2 I, [2024-05-24T11:40:33.809628 #3552469] INFO -- : csv 3.3.0 I, [2024-05-24T11:40:33.819051 #3552469] INFO -- : installing bundled gem cache: /home/opc/ruby/install/master/lib/ruby/gems/3.4.0+0/cache I, [2024-05-24T11:40:33.820925 #3552469] INFO -- : skipped bundled gems: I, [2024-05-24T11:40:33.820949 #3552469] INFO -- : power_assert-2.0.4dev.gem not found in bundled_gems I, [2024-05-24T11:40:33.824340 #3552469] INFO -- : $$$[end] "make install -j3" exit with 0. I, [2024-05-24T11:40:33.824529 #3552469] INFO -- : $$$[beg] make yes-btest TESTOPTS='-q -j3' I, [2024-05-24T11:40:56.915204 #3552469] INFO -- : PASS all 1936 tests E, [2024-05-24T11:40:56.917183 #3552469] ERROR -- : I, [2024-05-24T11:40:56.917318 #3552469] INFO -- : $$$[end] "make yes-btest TESTOPTS='-q -j3'" exit with 0. I, [2024-05-24T11:40:56.917454 #3552469] INFO -- : $$$[beg] make yes-test-basic TESTS='-j3' I, [2024-05-24T11:40:57.012524 #3552469] INFO -- : BASERUBY = /usr/local/bin/ruby --disable=gems I, [2024-05-24T11:40:57.012603 #3552469] INFO -- : CC = gcc I, [2024-05-24T11:40:57.012615 #3552469] INFO -- : LD = ld I, [2024-05-24T11:40:57.012631 #3552469] INFO -- : LDSHARED = gcc -shared I, [2024-05-24T11:40:57.012644 #3552469] INFO -- : CFLAGS = -O3 -fno-fast-math -ggdb3 -Wall -Wextra -Wdeprecated-declarations -Wdiv-by-zero -Wduplicated-cond -Wimplicit-function-declaration -Wimplicit-int -Wpointer-arith -Wwrite-strings -Wold-style-definition -Wimplicit-fallthrough=0 -Wmissing-noreturn -Wno-cast-function-type -Wno-constant-logical-operand -Wno-long-long -Wno-missing-field-initializers -Wno-overlength-strings -Wno-packed-bitfield-compat -Wno-parentheses-equality -Wno-self-assign -Wno-tautological-compare -Wno-unused-parameter -Wno-unused-value -Wsuggest-attribute=format -Wsuggest-attribute=noreturn -Wunused-variable -Wmisleading-indentation -Wundef I, [2024-05-24T11:40:57.012653 #3552469] INFO -- : XCFLAGS = -U_FORTIFY_SOURCE -D_FORTIFY_SOURCE=2 -fstack-protector-strong -msign-return-address=all -fno-strict-overflow -fvisibility=hidden -fexcess-precision=standard -DRUBY_EXPORT -fPIE -I. -I.ext/include/aarch64-linux -I/home/opc/ruby/src/master/include -I/home/opc/ruby/src/master -I/home/opc/ruby/src/master/prism -I/home/opc/ruby/src/master/enc/unicode/15.0.0 I, [2024-05-24T11:40:57.012661 #3552469] INFO -- : CPPFLAGS = I, [2024-05-24T11:40:57.012669 #3552469] INFO -- : DLDFLAGS = -Wl,--compress-debug-sections=zlib -fstack-protector-strong -pie I, [2024-05-24T11:40:57.012679 #3552469] INFO -- : SOLIBS = -lz -lrt -lrt -ldl -lcrypt -lm -lpthread I, [2024-05-24T11:40:57.012687 #3552469] INFO -- : LANG = en_US.UTF-8 I, [2024-05-24T11:40:57.012695 #3552469] INFO -- : LC_ALL = I, [2024-05-24T11:40:57.012703 #3552469] INFO -- : LC_CTYPE = I, [2024-05-24T11:40:57.012712 #3552469] INFO -- : MFLAGS = I, [2024-05-24T11:40:57.012720 #3552469] INFO -- : RUSTC = rustc I, [2024-05-24T11:40:57.012728 #3552469] INFO -- : YJIT_RUSTC_ARGS = --crate-name=yjit --crate-type=staticlib --edition=2021 -g -C lto=thin -C opt-level=3 -C overflow-checks=on '--out-dir=/home/opc/ruby/build/master/yjit/target/release/' /home/opc/ruby/src/master/yjit/src/lib.rs I, [2024-05-24T11:40:57.013554 #3552469] INFO -- : gcc (GCC) 8.5.0 20210514 (Red Hat 8.5.0-10.1.0.1) I, [2024-05-24T11:40:57.013573 #3552469] INFO -- : Copyright (C) 2018 Free Software Foundation, Inc. I, [2024-05-24T11:40:57.013582 #3552469] INFO -- : This is free software; see the source for copying conditions. There is NO I, [2024-05-24T11:40:57.013591 #3552469] INFO -- : warranty; not even for MERCHANTABILITY or FITNESS FOR A PARTICULAR PURPOSE. I, [2024-05-24T11:40:57.013599 #3552469] INFO -- : I, [2024-05-24T11:40:57.171127 #3552469] INFO -- : Checking leaked global symbols...none I, [2024-05-24T11:40:57.224901 #3552469] INFO -- : /home/opc/ruby/src/master/basictest/test.rb:assignment ....................................................................................................................................................................................................................................................................................................................................................................................OK 372 I, [2024-05-24T11:40:57.224978 #3552469] INFO -- : /home/opc/ruby/src/master/basictest/test.rb:condition ..OK 2 I, [2024-05-24T11:40:57.224999 #3552469] INFO -- : /home/opc/ruby/src/master/basictest/test.rb:if/unless ...OK 3 I, [2024-05-24T11:40:57.225051 #3552469] INFO -- : /home/opc/ruby/src/master/basictest/test.rb:case .....OK 5 I, [2024-05-24T11:40:57.225683 #3552469] INFO -- : /home/opc/ruby/src/master/basictest/test.rb:while/until ........OK 8 I, [2024-05-24T11:40:57.225809 #3552469] INFO -- : /home/opc/ruby/src/master/basictest/test.rb:exception ..........OK 10 I, [2024-05-24T11:40:57.226448 #3552469] INFO -- : /home/opc/ruby/src/master/basictest/test.rb:array .......................................OK 39 I, [2024-05-24T11:40:57.226717 #3552469] INFO -- : /home/opc/ruby/src/master/basictest/test.rb:hash ...........................OK 27 I, [2024-05-24T11:40:57.228355 #3552469] INFO -- : /home/opc/ruby/src/master/basictest/test.rb:iterator ...........................................................................................................OK 107 I, [2024-05-24T11:40:57.229147 #3552469] INFO -- : /home/opc/ruby/src/master/basictest/test.rb:float ................................................................................OK 80 I, [2024-05-24T11:40:57.232659 #3552469] INFO -- : /home/opc/ruby/src/master/basictest/test.rb:bignum ...............................OK 31 I, [2024-05-24T11:40:57.234322 #3552469] INFO -- : /home/opc/ruby/src/master/basictest/test.rb:string & char ..............................................................OK 62 I, [2024-05-24T11:40:57.234523 #3552469] INFO -- : /home/opc/ruby/src/master/basictest/test.rb:assignment ..........OK 10 I, [2024-05-24T11:40:57.234595 #3552469] INFO -- : /home/opc/ruby/src/master/basictest/test.rb:call ......OK 6 I, [2024-05-24T11:40:57.234730 #3552469] INFO -- : /home/opc/ruby/src/master/basictest/test.rb:proc .........OK 9 I, [2024-05-24T11:40:57.334981 #3552469] INFO -- : /home/opc/ruby/src/master/basictest/test.rb:signal ..OK 2 I, [2024-05-24T11:40:57.336645 #3552469] INFO -- : /home/opc/ruby/src/master/basictest/test.rb:eval ...........................OK 27 I, [2024-05-24T11:40:57.469665 #3552469] INFO -- : /home/opc/ruby/src/master/basictest/test.rb:system ........OK 8 I, [2024-05-24T11:40:57.469742 #3552469] INFO -- : /home/opc/ruby/src/master/basictest/test.rb:const .....OK 5 I, [2024-05-24T11:40:57.469840 #3552469] INFO -- : /home/opc/ruby/src/master/basictest/test.rb:clone .....OK 5 I, [2024-05-24T11:40:57.470027 #3552469] INFO -- : /home/opc/ruby/src/master/basictest/test.rb:marshal ....OK 4 I, [2024-05-24T11:40:57.470106 #3552469] INFO -- : /home/opc/ruby/src/master/basictest/test.rb:pack ....OK 4 I, [2024-05-24T11:40:57.470138 #3552469] INFO -- : /home/opc/ruby/src/master/basictest/test.rb:math ..OK 2 I, [2024-05-24T11:40:57.470227 #3552469] INFO -- : /home/opc/ruby/src/master/basictest/test.rb:struct ......OK 6 I, [2024-05-24T11:40:57.470398 #3552469] INFO -- : /home/opc/ruby/src/master/basictest/test.rb:variable ............OK 12 I, [2024-05-24T11:40:57.470440 #3552469] INFO -- : /home/opc/ruby/src/master/basictest/test.rb:trace ...OK 3 I, [2024-05-24T11:40:57.470567 #3552469] INFO -- : /home/opc/ruby/src/master/basictest/test.rb:defined? ............OK 12 I, [2024-05-24T11:40:57.470656 #3552469] INFO -- : /home/opc/ruby/src/master/basictest/test.rb:alias ......OK 6 I, [2024-05-24T11:40:57.471255 #3552469] INFO -- : /home/opc/ruby/src/master/basictest/test.rb:path .......................OK 23 I, [2024-05-24T11:40:57.538758 #3552469] INFO -- : /home/opc/ruby/src/master/basictest/test.rb:gc ....OK 4 I, [2024-05-24T11:40:57.540916 #3552469] INFO -- : I, [2024-05-24T11:40:57.540953 #3552469] INFO -- : test succeeded I, [2024-05-24T11:40:57.541641 #3552469] INFO -- : $$$[end] "make yes-test-basic TESTS='-j3'" exit with 0. I, [2024-05-24T11:40:57.541787 #3552469] INFO -- : $$$[beg] make yes-test-all TESTOPTS='--stderr-on-failure' TESTS='-j3' I, [2024-05-24T11:40:57.666762 #3552469] INFO -- : BASERUBY = /usr/local/bin/ruby --disable=gems I, [2024-05-24T11:40:57.666862 #3552469] INFO -- : CC = gcc I, [2024-05-24T11:40:57.666874 #3552469] INFO -- : LD = ld I, [2024-05-24T11:40:57.666883 #3552469] INFO -- : LDSHARED = gcc -shared I, [2024-05-24T11:40:57.666895 #3552469] INFO -- : CFLAGS = -O3 -fno-fast-math -ggdb3 -Wall -Wextra -Wdeprecated-declarations -Wdiv-by-zero -Wduplicated-cond -Wimplicit-function-declaration -Wimplicit-int -Wpointer-arith -Wwrite-strings -Wold-style-definition -Wimplicit-fallthrough=0 -Wmissing-noreturn -Wno-cast-function-type -Wno-constant-logical-operand -Wno-long-long -Wno-missing-field-initializers -Wno-overlength-strings -Wno-packed-bitfield-compat -Wno-parentheses-equality -Wno-self-assign -Wno-tautological-compare -Wno-unused-parameter -Wno-unused-value -Wsuggest-attribute=format -Wsuggest-attribute=noreturn -Wunused-variable -Wmisleading-indentation -Wundef I, [2024-05-24T11:40:57.666904 #3552469] INFO -- : XCFLAGS = -U_FORTIFY_SOURCE -D_FORTIFY_SOURCE=2 -fstack-protector-strong -msign-return-address=all -fno-strict-overflow -fvisibility=hidden -fexcess-precision=standard -DRUBY_EXPORT -fPIE -I. -I.ext/include/aarch64-linux -I/home/opc/ruby/src/master/include -I/home/opc/ruby/src/master -I/home/opc/ruby/src/master/prism -I/home/opc/ruby/src/master/enc/unicode/15.0.0 I, [2024-05-24T11:40:57.666913 #3552469] INFO -- : CPPFLAGS = I, [2024-05-24T11:40:57.666921 #3552469] INFO -- : DLDFLAGS = -Wl,--compress-debug-sections=zlib -fstack-protector-strong -pie I, [2024-05-24T11:40:57.666930 #3552469] INFO -- : SOLIBS = -lz -lrt -lrt -ldl -lcrypt -lm -lpthread I, [2024-05-24T11:40:57.666938 #3552469] INFO -- : LANG = en_US.UTF-8 I, [2024-05-24T11:40:57.666946 #3552469] INFO -- : LC_ALL = I, [2024-05-24T11:40:57.666954 #3552469] INFO -- : LC_CTYPE = I, [2024-05-24T11:40:57.666962 #3552469] INFO -- : MFLAGS = I, [2024-05-24T11:40:57.666970 #3552469] INFO -- : RUSTC = rustc I, [2024-05-24T11:40:57.666978 #3552469] INFO -- : YJIT_RUSTC_ARGS = --crate-name=yjit --crate-type=staticlib --edition=2021 -g -C lto=thin -C opt-level=3 -C overflow-checks=on '--out-dir=/home/opc/ruby/build/master/yjit/target/release/' /home/opc/ruby/src/master/yjit/src/lib.rs I, [2024-05-24T11:40:57.667625 #3552469] INFO -- : gcc (GCC) 8.5.0 20210514 (Red Hat 8.5.0-10.1.0.1) I, [2024-05-24T11:40:57.667641 #3552469] INFO -- : Copyright (C) 2018 Free Software Foundation, Inc. I, [2024-05-24T11:40:57.667651 #3552469] INFO -- : This is free software; see the source for copying conditions. There is NO I, [2024-05-24T11:40:57.667660 #3552469] INFO -- : warranty; not even for MERCHANTABILITY or FITNESS FOR A PARTICULAR PURPOSE. I, [2024-05-24T11:40:57.667668 #3552469] INFO -- : I, [2024-05-24T11:40:57.669704 #3552469] INFO -- : generating enc.mk I, [2024-05-24T11:40:57.910131 #3552469] INFO -- : generating encdb.h I, [2024-05-24T11:40:57.947696 #3552469] INFO -- : encdb.h unchanged I, [2024-05-24T11:40:57.948949 #3552469] INFO -- : making enc I, [2024-05-24T11:40:57.976631 #3552469] INFO -- : make[1]: Entering directory '/home/opc/ruby/build/master' I, [2024-05-24T11:40:57.976705 #3552469] INFO -- : make[1]: Nothing to be done for 'enc'. I, [2024-05-24T11:40:57.976716 #3552469] INFO -- : make[1]: Leaving directory '/home/opc/ruby/build/master' I, [2024-05-24T11:40:57.977522 #3552469] INFO -- : making srcs under enc I, [2024-05-24T11:40:58.019566 #3552469] INFO -- : make[1]: Entering directory '/home/opc/ruby/build/master' I, [2024-05-24T11:40:58.019616 #3552469] INFO -- : make[1]: Nothing to be done for 'srcs'. I, [2024-05-24T11:40:58.019635 #3552469] INFO -- : make[1]: Leaving directory '/home/opc/ruby/build/master' I, [2024-05-24T11:40:58.020792 #3552469] INFO -- : generating transdb.h I, [2024-05-24T11:40:58.166737 #3552469] INFO -- : transdb.h unchanged I, [2024-05-24T11:40:58.168060 #3552469] INFO -- : making trans I, [2024-05-24T11:40:58.217525 #3552469] INFO -- : make[1]: Entering directory '/home/opc/ruby/build/master' I, [2024-05-24T11:40:58.217583 #3552469] INFO -- : make[1]: Nothing to be done for 'trans'. I, [2024-05-24T11:40:58.217593 #3552469] INFO -- : make[1]: Leaving directory '/home/opc/ruby/build/master' I, [2024-05-24T11:40:58.218389 #3552469] INFO -- : making encs I, [2024-05-24T11:40:58.271631 #3552469] INFO -- : make[1]: Entering directory '/home/opc/ruby/build/master' I, [2024-05-24T11:40:58.271684 #3552469] INFO -- : make[1]: Nothing to be done for 'encs'. I, [2024-05-24T11:40:58.271694 #3552469] INFO -- : make[1]: Leaving directory '/home/opc/ruby/build/master' I, [2024-05-24T11:40:58.273855 #3552469] INFO -- : generating makefiles ext/configure-ext.mk I, [2024-05-24T11:40:58.315945 #3552469] INFO -- : ext/configure-ext.mk updated I, [2024-05-24T11:40:58.319827 #3552469] INFO -- : make[1]: Entering directory '/home/opc/ruby/build/master' I, [2024-05-24T11:41:00.559612 #3552469] INFO -- : make[1]: Leaving directory '/home/opc/ruby/build/master' I, [2024-05-24T11:41:00.560532 #3552469] INFO -- : generating makefile exts.mk I, [2024-05-24T11:41:00.622265 #3552469] INFO -- : exts.mk unchanged I, [2024-05-24T11:41:00.627187 #3552469] INFO -- : make[1]: Entering directory '/home/opc/ruby/build/master' I, [2024-05-24T11:41:00.936627 #3552469] INFO -- : make[2]: Entering directory '/home/opc/ruby/build/master/ext/coverage' I, [2024-05-24T11:41:00.941576 #3552469] INFO -- : make[2]: Leaving directory '/home/opc/ruby/build/master/ext/coverage' I, [2024-05-24T11:41:00.947473 #3552469] INFO -- : make[2]: Entering directory '/home/opc/ruby/build/master/ext/date' I, [2024-05-24T11:41:00.953162 #3552469] INFO -- : make[2]: Leaving directory '/home/opc/ruby/build/master/ext/date' I, [2024-05-24T11:41:00.956819 #3552469] INFO -- : make[2]: Entering directory '/home/opc/ruby/build/master/ext/digest' I, [2024-05-24T11:41:00.966300 #3552469] INFO -- : make[2]: Leaving directory '/home/opc/ruby/build/master/ext/digest' I, [2024-05-24T11:41:00.989552 #3552469] INFO -- : make[2]: Entering directory '/home/opc/ruby/build/master/ext/digest/sha2' I, [2024-05-24T11:41:00.994621 #3552469] INFO -- : make[2]: Leaving directory '/home/opc/ruby/build/master/ext/digest/sha2' I, [2024-05-24T11:41:01.013150 #3552469] INFO -- : make[2]: Entering directory '/home/opc/ruby/build/master/ext/fiddle' I, [2024-05-24T11:41:01.023629 #3552469] INFO -- : make[2]: Leaving directory '/home/opc/ruby/build/master/ext/fiddle' I, [2024-05-24T11:41:01.028095 #3552469] INFO -- : make[2]: Entering directory '/home/opc/ruby/build/master/ext/io/console' I, [2024-05-24T11:41:01.032629 #3552469] INFO -- : make[2]: Leaving directory '/home/opc/ruby/build/master/ext/io/console' I, [2024-05-24T11:41:01.043396 #3552469] INFO -- : make[2]: Entering directory '/home/opc/ruby/build/master/ext/json' I, [2024-05-24T11:41:01.052853 #3552469] INFO -- : make[2]: Leaving directory '/home/opc/ruby/build/master/ext/json' I, [2024-05-24T11:41:01.066505 #3552469] INFO -- : make[2]: Entering directory '/home/opc/ruby/build/master/ext/monitor' I, [2024-05-24T11:41:01.070724 #3552469] INFO -- : make[2]: Leaving directory '/home/opc/ruby/build/master/ext/monitor' I, [2024-05-24T11:41:01.076860 #3552469] INFO -- : make[2]: Entering directory '/home/opc/ruby/build/master/ext/objspace' I, [2024-05-24T11:41:01.083201 #3552469] INFO -- : make[2]: Leaving directory '/home/opc/ruby/build/master/ext/objspace' I, [2024-05-24T11:41:01.102482 #3552469] INFO -- : make[2]: Entering directory '/home/opc/ruby/build/master/ext/openssl' I, [2024-05-24T11:41:01.124546 #3552469] INFO -- : make[2]: Leaving directory '/home/opc/ruby/build/master/ext/openssl' I, [2024-05-24T11:41:01.128897 #3552469] INFO -- : make[2]: Entering directory '/home/opc/ruby/build/master/ext/pathname' I, [2024-05-24T11:41:01.133145 #3552469] INFO -- : make[2]: Leaving directory '/home/opc/ruby/build/master/ext/pathname' I, [2024-05-24T11:41:01.139696 #3552469] INFO -- : make[2]: Entering directory '/home/opc/ruby/build/master/ext/psych' I, [2024-05-24T11:41:01.161796 #3552469] INFO -- : make[2]: Leaving directory '/home/opc/ruby/build/master/ext/psych' I, [2024-05-24T11:41:01.166367 #3552469] INFO -- : make[2]: Entering directory '/home/opc/ruby/build/master/ext/pty' I, [2024-05-24T11:41:01.170684 #3552469] INFO -- : make[2]: Leaving directory '/home/opc/ruby/build/master/ext/pty' I, [2024-05-24T11:41:01.184315 #3552469] INFO -- : make[2]: Entering directory '/home/opc/ruby/build/master/ext/ripper' I, [2024-05-24T11:41:01.192397 #3552469] INFO -- : make[2]: Leaving directory '/home/opc/ruby/build/master/ext/ripper' I, [2024-05-24T11:41:01.194474 #3552469] INFO -- : make[2]: Entering directory '/home/opc/ruby/build/master/ext/rubyvm' I, [2024-05-24T11:41:01.198026 #3552469] INFO -- : make[2]: Leaving directory '/home/opc/ruby/build/master/ext/rubyvm' I, [2024-05-24T11:41:01.210420 #3552469] INFO -- : make[2]: Entering directory '/home/opc/ruby/build/master/ext/socket' I, [2024-05-24T11:41:01.221382 #3552469] INFO -- : make[2]: Leaving directory '/home/opc/ruby/build/master/ext/socket' I, [2024-05-24T11:41:01.237631 #3552469] INFO -- : make[2]: Entering directory '/home/opc/ruby/build/master/.bundle/gems/bigdecimal-3.1.7/ext/bigdecimal' I, [2024-05-24T11:41:01.268989 #3552469] INFO -- : make[2]: Leaving directory '/home/opc/ruby/build/master/.bundle/gems/bigdecimal-3.1.7/ext/bigdecimal' I, [2024-05-24T11:41:01.271681 #3552469] INFO -- : make[2]: Entering directory '/home/opc/ruby/build/master/.bundle/gems/bigdecimal-3.1.8/ext/bigdecimal' I, [2024-05-24T11:41:01.302709 #3552469] INFO -- : make[2]: Leaving directory '/home/opc/ruby/build/master/.bundle/gems/bigdecimal-3.1.8/ext/bigdecimal' I, [2024-05-24T11:41:01.305370 #3552469] INFO -- : make[2]: Entering directory '/home/opc/ruby/build/master/.bundle/gems/debug-1.9.2/ext/debug' I, [2024-05-24T11:41:01.337531 #3552469] INFO -- : make[2]: Leaving directory '/home/opc/ruby/build/master/.bundle/gems/debug-1.9.2/ext/debug' I, [2024-05-24T11:41:01.340114 #3552469] INFO -- : make[2]: Entering directory '/home/opc/ruby/build/master/.bundle/gems/nkf-0.2.0/ext/nkf' I, [2024-05-24T11:41:01.371802 #3552469] INFO -- : make[2]: Leaving directory '/home/opc/ruby/build/master/.bundle/gems/nkf-0.2.0/ext/nkf' I, [2024-05-24T11:41:01.374431 #3552469] INFO -- : make[2]: Entering directory '/home/opc/ruby/build/master/.bundle/gems/racc-1.7.3/ext/racc/cparse' I, [2024-05-24T11:41:01.405948 #3552469] INFO -- : make[2]: Leaving directory '/home/opc/ruby/build/master/.bundle/gems/racc-1.7.3/ext/racc/cparse' I, [2024-05-24T11:41:01.408569 #3552469] INFO -- : make[2]: Entering directory '/home/opc/ruby/build/master/.bundle/gems/racc-1.8.0/ext/racc/cparse' I, [2024-05-24T11:41:01.440244 #3552469] INFO -- : make[2]: Leaving directory '/home/opc/ruby/build/master/.bundle/gems/racc-1.8.0/ext/racc/cparse' I, [2024-05-24T11:41:01.443339 #3552469] INFO -- : make[2]: Entering directory '/home/opc/ruby/build/master/.bundle/gems/rbs-3.4.4/ext/rbs_extension' I, [2024-05-24T11:41:01.475244 #3552469] INFO -- : make[2]: Leaving directory '/home/opc/ruby/build/master/.bundle/gems/rbs-3.4.4/ext/rbs_extension' I, [2024-05-24T11:41:01.477870 #3552469] INFO -- : make[2]: Entering directory '/home/opc/ruby/build/master/.bundle/gems/syslog-0.1.2/ext/syslog' I, [2024-05-24T11:41:01.509543 #3552469] INFO -- : make[2]: Leaving directory '/home/opc/ruby/build/master/.bundle/gems/syslog-0.1.2/ext/syslog' I, [2024-05-24T11:41:01.547672 #3552469] INFO -- : make[2]: Entering directory '/home/opc/ruby/build/master' I, [2024-05-24T11:41:01.633375 #3552469] INFO -- : make[2]: 'ruby' is up to date. I, [2024-05-24T11:41:01.633471 #3552469] INFO -- : make[2]: Leaving directory '/home/opc/ruby/build/master' I, [2024-05-24T11:41:01.633587 #3552469] INFO -- : make[1]: Leaving directory '/home/opc/ruby/build/master' I, [2024-05-24T11:41:01.638218 #3552469] INFO -- : make[1]: Entering directory '/home/opc/ruby/build/master' I, [2024-05-24T11:41:01.638256 #3552469] INFO -- : make[1]: Nothing to be done for 'note'. I, [2024-05-24T11:41:01.638266 #3552469] INFO -- : make[1]: Leaving directory '/home/opc/ruby/build/master' I, [2024-05-24T11:41:01.756898 #3552469] INFO -- : Run options: I, [2024-05-24T11:41:01.756972 #3552469] INFO -- : --seed=12092 I, [2024-05-24T11:41:01.756983 #3552469] INFO -- : "--ruby=./miniruby -I/home/opc/ruby/src/master/lib -I. -I.ext/common /home/opc/ruby/src/master/tool/runruby.rb --extout=.ext -- --disable-gems" I, [2024-05-24T11:41:01.756992 #3552469] INFO -- : --excludes-dir=/home/opc/ruby/src/master/test/.excludes I, [2024-05-24T11:41:01.757001 #3552469] INFO -- : --name=!/memory_leak/ I, [2024-05-24T11:41:01.757009 #3552469] INFO -- : --stderr-on-failure I, [2024-05-24T11:41:01.757017 #3552469] INFO -- : -j3 I, [2024-05-24T11:41:01.757025 #3552469] INFO -- : I, [2024-05-24T11:41:01.757034 #3552469] INFO -- : # Running tests: I, [2024-05-24T11:41:01.757042 #3552469] INFO -- : I, [2024-05-24T11:41:01.896890 #3552469] INFO -- : [ 1/885] 3593337=test_gem_resolver I, [2024-05-24T11:41:01.905882 #3552469] INFO -- : [ 2/885] 3593336=test_gem_source_vendor I, [2024-05-24T11:41:01.922215 #3552469] INFO -- : [ 3/885] 3593338=test_object I, [2024-05-24T11:41:02.083963 #3552469] INFO -- : [ 4/885] 3593336=test_dln I, [2024-05-24T11:41:02.088763 #3552469] INFO -- : [ 5/885] 3593336=unescape_test I, [2024-05-24T11:41:02.255664 #3552469] INFO -- : [ 6/885] 3593338=test_gem_commands_exec_command I, [2024-05-24T11:41:02.411051 #3552469] INFO -- : [ 7/885] 3593337=test_super I, [2024-05-24T11:41:02.896793 #3552469] INFO -- : [ 8/885] 3593337=test_color_printer I, [2024-05-24T11:41:02.970675 #3552469] INFO -- : [ 9/885] 3593337=test_modify_expand I, [2024-05-24T11:41:02.975262 #3552469] INFO -- : [ 10/885] 3593337=test_gem_available_set I, [2024-05-24T11:41:03.092199 #3552469] INFO -- : [ 11/885] 3593337=test_pkg_config I, [2024-05-24T11:41:03.149853 #3552469] INFO -- : [ 12/885] 3593337=errors_test I, [2024-05-24T11:41:03.283058 #3552469] INFO -- : [ 13/885] 3593337=test_convertible I, [2024-05-24T11:41:03.583728 #3552469] INFO -- : [ 14/885] 3593336=test_vm_dump I, [2024-05-24T11:41:03.598589 #3552469] INFO -- : [ 15/885] 3593336=json_encoding_test I, [2024-05-24T11:41:03.634098 #3552469] INFO -- : [ 16/885] 3593336=test_func I, [2024-05-24T11:41:03.943507 #3552469] INFO -- : [ 17/885] 3593338=test_config I, [2024-05-24T11:41:03.982586 #3552469] INFO -- : [ 18/885] 3593338=test_gem_console_ui I, [2024-05-24T11:41:04.281498 #3552469] INFO -- : [ 19/885] 3593338=test_allocation I, [2024-05-24T11:41:04.827197 #3552469] INFO -- : [ 20/885] 3593336=test_ifunless I, [2024-05-24T11:41:04.832363 #3552469] INFO -- : [ 21/885] 3593336=test_insns_leaf I, [2024-05-24T11:41:04.836762 #3552469] INFO -- : [ 22/885] 3593336=test_readpartial I, [2024-05-24T11:41:05.280685 #3552469] INFO -- : [ 23/885] 3593336=test_httpresponse I, [2024-05-24T11:41:05.346484 #3552469] INFO -- : [ 24/885] 3593336=test_rdoc_parser_ruby I, [2024-05-24T11:41:05.993536 #3552469] INFO -- : [ 25/885] 3593336=test_x509req I, [2024-05-24T11:41:06.007500 #3552469] INFO -- : [ 26/885] 3593336=test_pattern_key_name_check I, [2024-05-24T11:41:06.061993 #3552469] INFO -- : [ 27/885] 3593336=test_profile_frames I, [2024-05-24T11:41:06.191631 #3552469] INFO -- : [ 28/885] 3593336=test_debug I, [2024-05-24T11:41:06.236668 #3552469] INFO -- : [ 29/885] 3593336=test_refinement I, [2024-05-24T11:41:06.685349 #3552469] INFO -- : [ 30/885] 3593338=test_transcode I, [2024-05-24T11:41:06.886850 #3552469] INFO -- : [ 31/885] 3593338=test_class2name I, [2024-05-24T11:41:06.912882 #3552469] INFO -- : [ 32/885] 3593338=test_gem_commands_cleanup_command I, [2024-05-24T11:41:07.081776 #3552469] INFO -- : [ 33/885] 3593337=test_dns I, [2024-05-24T11:41:07.547811 #3552469] INFO -- : [ 34/885] 3593338=test_c_union_entity I, [2024-05-24T11:41:07.552247 #3552469] INFO -- : [ 35/885] 3593337=test_notimplement I, [2024-05-24T11:41:07.567420 #3552469] INFO -- : [ 36/885] 3593337=test_cgi_session I, [2024-05-24T11:41:07.583657 #3552469] INFO -- : [ 37/885] 3593338=test_x509crl I, [2024-05-24T11:41:07.603816 #3552469] INFO -- : [ 38/885] 3593337=test_rdoc_markup_heading I, [2024-05-24T11:41:07.710574 #3552469] INFO -- : [ 39/885] 3593338=test_io_console I, [2024-05-24T11:41:07.804642 #3552469] INFO -- : [ 40/885] 3593337=test_flip I, [2024-05-24T11:41:07.824371 #3552469] INFO -- : [ 41/885] 3593337=test_compile_prism I, [2024-05-24T11:41:07.841111 #3552469] INFO -- : .Leaked file descriptor: TestIO_Console#test_noecho: 8 # I, [2024-05-24T11:41:07.872573 #3552469] INFO -- : COMMAND PID USER FD TYPE DEVICE SIZE/OFF NODE NAME I, [2024-05-24T11:41:07.872658 #3552469] INFO -- : ruby 3593338 opc 8r REG 252,0 6940392 13705429 /var/lib/sss/mc/group I, [2024-05-24T11:41:08.139596 #3552469] INFO -- : [ 42/885] 3593337=test_helper I, [2024-05-24T11:41:08.145507 #3552469] INFO -- : [ 43/885] 3593337=test_win32ole_event I, [2024-05-24T11:41:08.176962 #3552469] INFO -- : [ 44/885] 3593337=test_gem_commands_uninstall_command I, [2024-05-24T11:41:09.039182 #3552469] INFO -- : [ 45/885] 3593337=test_rdoc_markup_formatter I, [2024-05-24T11:41:09.053052 #3552469] INFO -- : [ 46/885] 3593337=test_digest_extend I, [2024-05-24T11:41:09.066607 #3552469] INFO -- : [ 47/885] 3593337=test_gem_ext_cmake_builder I, [2024-05-24T11:41:09.097409 #3552469] INFO -- : [ 48/885] 3593337=test_thread_fd_close I, [2024-05-24T11:41:09.131235 #3552469] INFO -- : [ 49/885] 3593337=test_last_thread I, [2024-05-24T11:41:09.887777 #3552469] INFO -- : [ 50/885] 3593336=test_getopts I, [2024-05-24T11:41:09.912050 #3552469] INFO -- : [ 51/885] 3593336=test_emitter I, [2024-05-24T11:41:09.917431 #3552469] INFO -- : [ 52/885] 3593336=test_alias I, [2024-05-24T11:41:10.151455 #3552469] INFO -- : [ 53/885] 3593336=test_fips I, [2024-05-24T11:41:10.173610 #3552469] INFO -- : [ 54/885] 3593337=test_trace I, [2024-05-24T11:41:10.179456 #3552469] INFO -- : [ 55/885] 3593337=test_arity I, [2024-05-24T11:41:10.187584 #3552469] INFO -- : [ 56/885] 3593337=test_gem_path_support I, [2024-05-24T11:41:10.237341 #3552469] INFO -- : [ 57/885] 3593337=test_keyword I, [2024-05-24T11:41:10.353906 #3552469] INFO -- : [ 58/885] 3593336=test_win32ole_type_event I, [2024-05-24T11:41:10.362974 #3552469] INFO -- : [ 59/885] 3593336=test_scalar_scanner I, [2024-05-24T11:41:10.370552 #3552469] INFO -- : [ 60/885] 3593336=test_rb_str_dup I, [2024-05-24T11:41:10.375804 #3552469] INFO -- : [ 61/885] 3593336=test_lambda I, [2024-05-24T11:41:10.437935 #3552469] INFO -- : [ 62/885] 3593336=test_emitter I, [2024-05-24T11:41:10.443473 #3552469] INFO -- : [ 63/885] 3593336=test_x509ext I, [2024-05-24T11:41:10.451900 #3552469] INFO -- : [ 64/885] 3593338=bom_test I, [2024-05-24T11:41:10.467584 #3552469] INFO -- : [ 65/885] 3593336=test_helper_method I, [2024-05-24T11:41:10.557741 #3552469] INFO -- : [ 66/885] 3593338=test_summary I, [2024-05-24T11:41:10.579871 #3552469] INFO -- : [ 67/885] 3593336=test_file I, [2024-05-24T11:41:10.696932 #3552469] INFO -- : [ 68/885] 3593338=test_config I, [2024-05-24T11:41:10.818287 #3552469] INFO -- : [ 69/885] 3593337=test_rdoc_markup_to_html I, [2024-05-24T11:41:10.943512 #3552469] INFO -- : [ 70/885] 3593337=test_foreach I, [2024-05-24T11:41:10.948568 #3552469] INFO -- : [ 71/885] 3593337=test_append I, [2024-05-24T11:41:10.965277 #3552469] INFO -- : [ 72/885] 3593337=test_gem_resolver_installer_set I, [2024-05-24T11:41:11.150541 #3552469] INFO -- : [ 73/885] 3593338=test_helper I, [2024-05-24T11:41:11.160564 #3552469] INFO -- : [ 74/885] 3593338=test_duplicate I, [2024-05-24T11:41:11.166640 #3552469] INFO -- : [ 75/885] 3593338=test_gem_resolver_api_set I, [2024-05-24T11:41:11.220251 #3552469] INFO -- : [ 76/885] 3593337=test_addr I, [2024-05-24T11:41:11.234288 #3552469] INFO -- : [ 77/885] 3593337=test_mailto I, [2024-05-24T11:41:11.250803 #3552469] INFO -- : [ 78/885] 3593338=test_kill_ring I, [2024-05-24T11:41:11.251615 #3552469] INFO -- : [ 79/885] 3593337=test_member I, [2024-05-24T11:41:11.255898 #3552469] INFO -- : [ 80/885] 3593338=test_object I, [2024-05-24T11:41:11.260536 #3552469] INFO -- : [ 81/885] 3593337=test_cgi_header I, [2024-05-24T11:41:11.266589 #3552469] INFO -- : [ 82/885] 3593337=format_errors_test I, [2024-05-24T11:41:11.267542 #3552469] INFO -- : [ 83/885] 3593338=test_case_options I, [2024-05-24T11:41:11.274167 #3552469] INFO -- : [ 84/885] 3593337=test_eval I, [2024-05-24T11:41:11.279711 #3552469] INFO -- : [ 85/885] 3593338=test_monitor I, [2024-05-24T11:41:11.501970 #3552469] INFO -- : [ 86/885] 3593338=test_beginendblock I, [2024-05-24T11:41:11.539462 #3552469] INFO -- : [ 87/885] 3593337=test_whileuntil I, [2024-05-24T11:41:11.547191 #3552469] INFO -- : [ 88/885] 3593337=test_regexp I, [2024-05-24T11:41:11.831386 #3552469] INFO -- : [ 89/885] 3593338=test_nofree I, [2024-05-24T11:41:11.856306 #3552469] INFO -- : [ 90/885] 3593338=test_pointer I, [2024-05-24T11:41:12.478698 #3552469] INFO -- : [ 91/885] 3593338=test_rdoc_normal_class I, [2024-05-24T11:41:12.747625 #3552469] INFO -- : [ 92/885] 3593338=test_within_pipe I, [2024-05-24T11:41:12.946392 #3552469] INFO -- : [ 93/885] 3593338=test_bug_reporter I, [2024-05-24T11:41:12.983312 #3552469] INFO -- : [ 94/885] 3593338=test_gem_installer I, [2024-05-24T11:41:16.831875 #3552469] INFO -- : [ 95/885] 3593336=test_buffered_io I, [2024-05-24T11:41:16.863603 #3552469] INFO -- : [ 96/885] 3593336=test_ossl I, [2024-05-24T11:41:18.236447 #3552469] INFO -- : [ 97/885] 3593338=test_ruby_lex I, [2024-05-24T11:41:18.436853 #3552469] INFO -- : [ 98/885] 3593338=test_arith_seq_extract I, [2024-05-24T11:41:18.559047 #3552469] INFO -- : [ 99/885] 3593338=compiler_test I, [2024-05-24T11:41:18.602934 #3552469] INFO -- : [100/885] 3593338=test_gem_source_subpath_problem I, [2024-05-24T11:41:18.698632 #3552469] INFO -- : [101/885] 3593338=test_object_references I, [2024-05-24T11:41:18.703477 #3552469] INFO -- : [102/885] 3593338=test_data I, [2024-05-24T11:41:18.773969 #3552469] INFO -- : [103/885] 3593338=test_bug-14834 I, [2024-05-24T11:41:18.781039 #3552469] INFO -- : [104/885] 3593338=test_inlinecache I, [2024-05-24T11:41:18.850108 #3552469] INFO -- : [105/885] 3593338=test_socket I, [2024-05-24T11:41:19.855167 #3552469] INFO -- : [106/885] 3593338=test_terminfo I, [2024-05-24T11:41:20.400909 #3552469] INFO -- : [107/885] 3593338=test_thread I, [2024-05-24T11:41:24.181181 #3552469] INFO -- : [108/885] 3593336=test_time_tz I, [2024-05-24T11:41:24.241246 #3552469] INFO -- : [109/885] 3593336=test_addrinfo I, [2024-05-24T11:41:24.263356 #3552469] INFO -- : .Leaked file descriptor: TestSocketAddrinfo#test_addrinfo_timeout: 7 # I, [2024-05-24T11:41:24.297164 #3552469] INFO -- : COMMAND PID USER FD TYPE DEVICE SIZE/OFF NODE NAME I, [2024-05-24T11:41:24.297286 #3552469] INFO -- : ruby 3593336 opc 7u unix 0x0000000000000000 0t0 3122129973 type=STREAM I, [2024-05-24T11:41:24.367257 #3552469] INFO -- : [110/885] 3593336=test_to_ruby I, [2024-05-24T11:41:24.381715 #3552469] INFO -- : [111/885] 3593336=test_windows_1251 I, [2024-05-24T11:41:24.609783 #3552469] INFO -- : [112/885] 3593336=test_gem_ext_builder I, [2024-05-24T11:41:25.630879 #3552469] INFO -- : [113/885] 3593336=test_to_ary_concat I, [2024-05-24T11:41:27.300362 #3552469] INFO -- : [114/885] 3593336=test_history I, [2024-05-24T11:41:27.314769 #3552469] INFO -- : [115/885] 3593336=test_reline I, [2024-05-24T11:41:27.593497 #3552469] INFO -- : [116/885] 3593336=test_call I, [2024-05-24T11:41:27.698380 #3552469] INFO -- : [117/885] 3593336=test_ellipsize I, [2024-05-24T11:41:27.732227 #3552469] INFO -- : [118/885] 3593336=test_gem_commands_build_command I, [2024-05-24T11:41:28.072863 #3552469] INFO -- : [119/885] 3593336=test_symbol I, [2024-05-24T11:41:28.133397 #3552469] INFO -- : [120/885] 3593336=test_project_sanity I, [2024-05-24T11:41:28.144430 #3552469] INFO -- : [121/885] 3593336=location_test I, [2024-05-24T11:41:28.197519 #3552469] INFO -- : [122/885] 3593336=test_delegate I, [2024-05-24T11:41:28.210665 #3552469] INFO -- : [123/885] 3593336=test_chilled I, [2024-05-24T11:41:28.266156 #3552469] INFO -- : [124/885] 3593336=test_ensured I, [2024-05-24T11:41:28.270188 #3552469] INFO -- : [125/885] 3593336=test_euc_jp I, [2024-05-24T11:41:28.276808 #3552469] INFO -- : [126/885] 3593336=test_key_stroke I, [2024-05-24T11:41:28.282470 #3552469] INFO -- : [127/885] 3593336=test_rdoc_markup I, [2024-05-24T11:41:28.292329 #3552469] INFO -- : [128/885] 3593336=test_alias_and_anchor I, [2024-05-24T11:41:28.300983 #3552469] INFO -- : [129/885] 3593336=test_time I, [2024-05-24T11:41:28.515955 #3552469] INFO -- : [130/885] 3593336=test_popen_deadlock I, [2024-05-24T11:41:28.544745 #3552469] INFO -- : [131/885] 3593337=ruby_api_test I, [2024-05-24T11:41:28.680857 #3552469] INFO -- : [132/885] 3593337=test_gem_resolver_index_set I, [2024-05-24T11:41:28.700926 #3552469] INFO -- : [133/885] 3593338=test_webauthn_listener_response I, [2024-05-24T11:41:28.746312 #3552469] INFO -- : [134/885] 3593338=test_sleep I, [2024-05-24T11:41:28.750828 #3552469] INFO -- : [135/885] 3593337=constant_path_node_test I, [2024-05-24T11:41:28.756769 #3552469] INFO -- : [136/885] 3593337=test_set_len I, [2024-05-24T11:41:28.762274 #3552469] INFO -- : [137/885] 3593337=test_interned_str I, [2024-05-24T11:41:28.767115 #3552469] INFO -- : [138/885] 3593337=test_folderitem2_invokeverb I, [2024-05-24T11:41:28.780973 #3552469] INFO -- : [139/885] 3593337=test_pattern_matching I, [2024-05-24T11:41:28.797281 #3552469] INFO -- : [140/885] 3593337=test_gc I, [2024-05-24T11:41:29.020530 #3552469] INFO -- : [141/885] 3593336=test_gem_bundler_version_finder I, [2024-05-24T11:41:29.102952 #3552469] INFO -- : [142/885] 3593336=test_gem_request_set I, [2024-05-24T11:41:29.564781 #3552469] INFO -- : [143/885] 3593336=test_date_marshal I, [2024-05-24T11:41:29.995796 #3552469] INFO -- : [144/885] 3593336=test_have_func I, [2024-05-24T11:41:31.028063 #3552469] INFO -- : [145/885] 3593336=test_configuration I, [2024-05-24T11:41:31.042274 #3552469] INFO -- : [146/885] 3593336=test_gem_resolver_local_specification I, [2024-05-24T11:41:31.077541 #3552469] INFO -- : [147/885] 3593336=test_gem_commands_list_command I, [2024-05-24T11:41:31.092685 #3552469] INFO -- : [148/885] 3593336=test_date_new I, [2024-05-24T11:41:31.096441 #3552469] INFO -- : [149/885] 3593336=test_udp I, [2024-05-24T11:41:31.105395 #3552469] INFO -- : [150/885] 3593336=test_context I, [2024-05-24T11:41:31.226461 #3552469] INFO -- : [151/885] 3593336=test_gem_commands_contents_command I, [2024-05-24T11:41:31.328111 #3552469] INFO -- : [152/885] 3593336=test_coder I, [2024-05-24T11:41:31.348222 #3552469] INFO -- : [153/885] 3593336=test_rdoc_servlet I, [2024-05-24T11:41:31.457515 #3552469] INFO -- : [154/885] 3593336=test_gem_commands_search_command I, [2024-05-24T11:41:31.467403 #3552469] INFO -- : [155/885] 3593336=test_symbol I, [2024-05-24T11:41:33.757272 #3552469] INFO -- : [156/885] 3593338=test_formatter I, [2024-05-24T11:41:33.767597 #3552469] INFO -- : [157/885] 3593338=test_unix I, [2024-05-24T11:41:33.809022 #3552469] INFO -- : [158/885] 3593338=test_integer I, [2024-05-24T11:41:34.981403 #3552469] INFO -- : [159/885] 3593336=test_rbconfig I, [2024-05-24T11:41:34.991391 #3552469] INFO -- : [160/885] 3593336=test_num2int I, [2024-05-24T11:41:34.995389 #3552469] INFO -- : [161/885] 3593336=test_iter_break I, [2024-05-24T11:41:35.055632 #3552469] INFO -- : [162/885] 3593336=test_extlibs I, [2024-05-24T11:41:36.354420 #3552469] INFO -- : [163/885] 3593338=test_gem_commands_signin_command I, [2024-05-24T11:41:36.538479 #3552469] INFO -- : [164/885] 3593338=test_range I, [2024-05-24T11:41:36.624919 #3552469] INFO -- : [165/885] 3593336=test_recursion I, [2024-05-24T11:41:36.628223 #3552469] INFO -- : [166/885] 3593336=test_require I, [2024-05-24T11:41:37.155610 #3552469] INFO -- : [167/885] 3593337=test_enum I, [2024-05-24T11:41:37.188530 #3552469] INFO -- : [168/885] 3593338=test_rdoc_markup_include I, [2024-05-24T11:41:37.207354 #3552469] INFO -- : [169/885] 3593338=test_address_resolve I, [2024-05-24T11:41:37.232832 #3552469] INFO -- : [170/885] 3593338=test_trick I, [2024-05-24T11:41:37.912987 #3552469] INFO -- : [171/885] 3593336=test_ractor I, [2024-05-24T11:41:37.979879 #3552469] INFO -- : [172/885] 3593336=test_stream I, [2024-05-24T11:41:37.990442 #3552469] INFO -- : [173/885] 3593336=test_rdoc_attr I, [2024-05-24T11:41:38.001449 #3552469] INFO -- : [174/885] 3593336=test_locale I, [2024-05-24T11:41:38.032872 #3552469] INFO -- : [175/885] 3593336=test_ts I, [2024-05-24T11:41:38.173550 #3552469] INFO -- : [176/885] 3593337=test_gem I, [2024-05-24T11:41:38.308032 #3552469] INFO -- : [177/885] 3593336=test_registry I, [2024-05-24T11:41:38.316963 #3552469] INFO -- : [178/885] 3593336=json_generator_test I, [2024-05-24T11:41:38.419957 #3552469] INFO -- : [179/885] 3593336=test_ansi_without_terminfo I, [2024-05-24T11:41:38.427627 #3552469] INFO -- : [180/885] 3593336=test_ractor I, [2024-05-24T11:41:38.453982 #3552469] INFO -- : [181/885] 3593336=test_parser I, [2024-05-24T11:41:38.467581 #3552469] INFO -- : [182/885] 3593336=test_rdoc_markup_to_label I, [2024-05-24T11:41:38.535800 #3552469] INFO -- : [183/885] 3593336=test_gem_resolver_best_set I, [2024-05-24T11:41:38.612292 #3552469] INFO -- : [184/885] 3593336=test_cgi_core I, [2024-05-24T11:41:38.623848 #3552469] INFO -- : Leaked file descriptor: TestGem#test_self_clear_paths: 9 # I, [2024-05-24T11:41:38.634143 #3552469] INFO -- : [185/885] 3593336=test_enc_str_buf_cat I, [2024-05-24T11:41:38.648117 #3552469] INFO -- : [186/885] 3593336=newline_test I, [2024-05-24T11:41:38.648444 #3552469] INFO -- : COMMAND PID USER FD TYPE DEVICE SIZE/OFF NODE NAME I, [2024-05-24T11:41:38.648469 #3552469] INFO -- : ruby 3593337 opc 9r REG 252,0 9253600 13705411 /var/lib/sss/mc/passwd I, [2024-05-24T11:41:38.762591 #3552469] INFO -- : [187/885] 3593336=test_bignum I, [2024-05-24T11:41:39.548703 #3552469] INFO -- : [188/885] 3593338=test_rdoc_markup_hard_break I, [2024-05-24T11:41:39.559499 #3552469] INFO -- : [189/885] 3593338=test_marshal I, [2024-05-24T11:41:40.314282 #3552469] INFO -- : [190/885] 3593338=ractor_test I, [2024-05-24T11:41:40.319105 #3552469] INFO -- : [191/885] 3593338=test_ancdata I, [2024-05-24T11:41:40.329958 #3552469] INFO -- : [192/885] 3593338=test_nesting_parser I, [2024-05-24T11:41:40.346585 #3552469] INFO -- : [193/885] 3593338=test_gem_resolver_conflict I, [2024-05-24T11:41:40.384678 #3552469] INFO -- : [194/885] 3593338=test_ractor I, [2024-05-24T11:41:40.487248 #3552469] INFO -- : [195/885] 3593337=test_scheduler I, [2024-05-24T11:41:40.656336 #3552469] INFO -- : [196/885] 3593337=test_gem_commands_help_command I, [2024-05-24T11:41:40.698427 #3552469] INFO -- : [197/885] 3593338=test_ssl I, [2024-05-24T11:41:40.785698 #3552469] INFO -- : [198/885] 3593337=test_rdoc_rd_block_parser I, [2024-05-24T11:41:40.830863 #3552469] INFO -- : [199/885] 3593337=test_x509store I, [2024-05-24T11:41:40.944090 #3552469] INFO -- : [200/885] 3593338=test_rdoc_rd I, [2024-05-24T11:41:40.981645 #3552469] INFO -- : [201/885] 3593338=test_rdoc_markup_to_markdown I, [2024-05-24T11:41:41.041030 #3552469] INFO -- : [202/885] 3593338=test_rdoc_markup_to_joined_paragraph I, [2024-05-24T11:41:41.046262 #3552469] INFO -- : [203/885] 3593338=test_rdoc_generator_pot I, [2024-05-24T11:41:41.068713 #3552469] INFO -- : [204/885] 3593338=test_require_lib I, [2024-05-24T11:41:41.357304 #3552469] INFO -- : [205/885] 3593337=test_gem_gem_runner I, [2024-05-24T11:41:41.407808 #3552469] INFO -- : [206/885] 3593337=test_metaclass I, [2024-05-24T11:41:41.431041 #3552469] INFO -- : [207/885] 3593337=test_objectspace I, [2024-05-24T11:41:42.347769 #3552469] INFO -- : [208/885] 3593337=test_require I, [2024-05-24T11:41:42.358556 #3552469] INFO -- : [209/885] 3593336=test_debugger_integration I, [2024-05-24T11:41:42.369882 #3552469] INFO -- : [210/885] 3593336=test_my_integer I, [2024-05-24T11:41:42.384661 #3552469] INFO -- : [211/885] 3593336=test_gem_resolver_composed_set I, [2024-05-24T11:41:42.393082 #3552469] INFO -- : [212/885] 3593336=test_tracer I, [2024-05-24T11:41:42.400080 #3552469] INFO -- : [213/885] 3593336=test_not I, [2024-05-24T11:41:42.410229 #3552469] INFO -- : [214/885] 3593336=test_cgi_cookie I, [2024-05-24T11:41:42.410711 #3552469] INFO -- : [215/885] 3593336=test_option I, [2024-05-24T11:41:42.533443 #3552469] INFO -- : [216/885] 3593336=test_rdoc_markup_attribute_manager I, [2024-05-24T11:41:42.564198 #3552469] INFO -- : [217/885] 3593336=test_wss I, [2024-05-24T11:41:42.573776 #3552469] INFO -- : [218/885] 3593336=test_gem_source_lock I, [2024-05-24T11:41:42.626679 #3552469] INFO -- : [219/885] 3593336=test_cipher I, [2024-05-24T11:41:42.652569 #3552469] INFO -- : [220/885] 3593336=test_update I, [2024-05-24T11:41:42.661766 #3552469] INFO -- : [221/885] 3593336=test_new I, [2024-05-24T11:41:42.680857 #3552469] INFO -- : [222/885] 3593336=test_rdoc_rd_inline_parser I, [2024-05-24T11:41:42.706367 #3552469] INFO -- : [223/885] 3593336=test_win32ole_type I, [2024-05-24T11:41:42.709411 #3552469] INFO -- : [224/885] 3593336=test_load I, [2024-05-24T11:41:42.722290 #3552469] INFO -- : [225/885] 3593336=test_rdoc_parser_markdown I, [2024-05-24T11:41:42.736104 #3552469] INFO -- : [226/885] 3593336=test_custom_command I, [2024-05-24T11:41:42.746486 #3552469] INFO -- : [227/885] 3593336=fuzzer_test I, [2024-05-24T11:41:42.758408 #3552469] INFO -- : [228/885] 3593336=test_rubyvm I, [2024-05-24T11:41:42.772133 #3552469] INFO -- : [229/885] 3593336=test_cparser I, [2024-05-24T11:41:44.048653 #3552469] INFO -- : [230/885] 3593338=static_inspect_test I, [2024-05-24T11:41:44.053722 #3552469] INFO -- : [231/885] 3593338=test_struct I, [2024-05-24T11:41:44.056994 #3552469] INFO -- : [232/885] 3593338=test_c_struct_entry I, [2024-05-24T11:41:44.100473 #3552469] INFO -- : [233/885] 3593336=test_config I, [2024-05-24T11:41:44.135934 #3552469] INFO -- : [234/885] 3593336=test_ostruct I, [2024-05-24T11:41:44.273520 #3552469] INFO -- : [235/885] 3593336=test_depth_first I, [2024-05-24T11:41:44.279321 #3552469] INFO -- : [236/885] 3593336=test_change_word I, [2024-05-24T11:41:44.288913 #3552469] INFO -- : [237/885] 3593336=test_gem_security_trust_dir I, [2024-05-24T11:41:44.358930 #3552469] INFO -- : [238/885] 3593336=test_module I, [2024-05-24T11:41:44.545105 #3552469] INFO -- : [239/885] 3593338=test_erb_command I, [2024-05-24T11:41:44.567408 #3552469] INFO -- : [240/885] 3593338=test_usrmarshal I, [2024-05-24T11:41:44.787848 #3552469] INFO -- : [241/885] 3593338=test_gem_validator I, [2024-05-24T11:41:44.809843 #3552469] INFO -- : [242/885] 3593338=test_gem_source_installed I, [2024-05-24T11:41:44.829310 #3552469] INFO -- : [243/885] 3593338=test_abi I, [2024-05-24T11:41:45.076574 #3552469] INFO -- : [244/885] 3593338=test_bundled_ca I, [2024-05-24T11:41:45.140001 #3552469] INFO -- : [245/885] 3593337=test_integer_comb I, [2024-05-24T11:41:46.652834 #3552469] INFO -- : [246/885] 3593338=test_load.Leaked file descriptor: TestOptionParserLoad#test_load_xdg_config_dirs: 10 # I, [2024-05-24T11:41:46.659586 #3552469] INFO -- : I, [2024-05-24T11:41:46.680914 #3552469] INFO -- : COMMAND PID USER FD TYPE DEVICE SIZE/OFF NODE NAME I, [2024-05-24T11:41:46.680987 #3552469] INFO -- : ruby 3593338 opc 10r REG 252,0 9253600 13705411 /var/lib/sss/mc/passwd I, [2024-05-24T11:41:46.799802 #3552469] INFO -- : [247/885] 3593338=test_ssl I, [2024-05-24T11:41:46.820650 #3552469] INFO -- : [248/885] 3593336=test_gem_package_task I, [2024-05-24T11:41:46.832270 #3552469] INFO -- : [249/885] 3593336=test_lock_native_thread I, [2024-05-24T11:41:47.102246 #3552469] INFO -- : [250/885] 3593336=test_resize I, [2024-05-24T11:41:47.105887 #3552469] INFO -- : [251/885] 3593336=test_win32ole_param I, [2024-05-24T11:41:47.110118 #3552469] INFO -- : [252/885] 3593336=test_key_error I, [2024-05-24T11:41:47.179028 #3552469] INFO -- : [253/885] 3593336=test_engine I, [2024-05-24T11:41:47.762112 #3552469] INFO -- : [254/885] 3593336=test_fiber I, [2024-05-24T11:41:48.130673 #3552469] INFO -- : [255/885] 3593337=test_gem_commands_mirror I, [2024-05-24T11:41:48.134661 #3552469] INFO -- : [256/885] 3593337=test_rdoc_single_class I, [2024-05-24T11:41:48.148265 #3552469] INFO -- : [257/885] 3593337=test_dup I, [2024-05-24T11:41:48.312958 #3552469] INFO -- : [258/885] 3593337=test_acceptable I, [2024-05-24T11:41:48.426842 #3552469] INFO -- : [259/885] 3593337=test_gem_ext_cargo_builder_link_flag_converter I, [2024-05-24T11:41:48.492985 #3552469] INFO -- : [260/885] 3593337=test_gem_local_remote_options I, [2024-05-24T11:41:48.544250 #3552469] INFO -- : [261/885] 3593337=test_rdoc_token_stream I, [2024-05-24T11:41:48.555559 #3552469] INFO -- : [262/885] 3593337=test_mutex I, [2024-05-24T11:41:49.683295 #3552469] INFO -- : [263/885] 3593337=heredoc_dedent_test I, [2024-05-24T11:41:49.699606 #3552469] INFO -- : [264/885] 3593337=test_type I, [2024-05-24T11:41:49.708224 #3552469] INFO -- : [265/885] 3593337=test_tmpdir I, [2024-05-24T11:41:49.785170 #3552469] INFO -- : [266/885] 3593337=test_struct I, [2024-05-24T11:41:50.310742 #3552469] INFO -- : [267/885] 3593337=test_ractor I, [2024-05-24T11:41:50.392365 #3552469] INFO -- : [268/885] 3593337=test_gem_resolver_installed_specification I, [2024-05-24T11:41:50.459446 #3552469] INFO -- : [269/885] 3593337=test_exception_at_throwing I, [2024-05-24T11:41:50.472802 #3552469] INFO -- : [270/885] 3593337=test_stringscanner I, [2024-05-24T11:41:50.531054 #3552469] INFO -- : [271/885] 3593337=test_fiddle I, [2024-05-24T11:41:50.678335 #3552469] INFO -- : [272/885] 3593337=json_generic_object_test I, [2024-05-24T11:41:50.686250 #3552469] INFO -- : [273/885] 3593337=test_date_arith I, [2024-05-24T11:41:50.699736 #3552469] INFO -- : [274/885] 3593337=test_gem_resolver_vendor_specification I, [2024-05-24T11:41:50.736113 #3552469] INFO -- : [275/885] 3593337=test_gem_safe_marshal I, [2024-05-24T11:41:51.447997 #3552469] INFO -- : [276/885] 3593337=test_rdoc_ri_driver I, [2024-05-24T11:41:51.891161 #3552469] INFO -- : [277/885] 3593337=test_ractor I, [2024-05-24T11:41:51.899616 #3552469] INFO -- : [278/885] 3593337=test_sexp I, [2024-05-24T11:41:51.947316 #3552469] INFO -- : [279/885] 3593337=test_httpheader I, [2024-05-24T11:41:52.321188 #3552469] INFO -- : [280/885] 3593337=test_signedness I, [2024-05-24T11:41:53.753060 #3552469] INFO -- : [281/885] 3593336=test_gem_commands_check_command I, [2024-05-24T11:41:53.768624 #3552469] INFO -- : [282/885] 3593337=test_gem_resolver_git_set I, [2024-05-24T11:41:53.783366 #3552469] INFO -- : [283/885] 3593336=test_digest I, [2024-05-24T11:41:54.430557 #3552469] INFO -- : [284/885] 3593337=test_rdoc_markup_to_ansi I, [2024-05-24T11:41:54.477442 #3552469] INFO -- : [285/885] 3593337=test_evaluation I, [2024-05-24T11:41:54.487396 #3552469] INFO -- : [286/885] 3593337=test_protocol I, [2024-05-24T11:41:54.587582 #3552469] INFO -- : [287/885] 3593336=test_weakkeymap I, [2024-05-24T11:41:54.843412 #3552469] INFO -- : [288/885] 3593337=test_files_test I, [2024-05-24T11:41:54.859546 #3552469] INFO -- : [289/885] 3593336=test_https I, [2024-05-24T11:41:54.904884 #3552469] INFO -- : [290/885] 3593337=test_gem_commands_info_command I, [2024-05-24T11:41:54.919074 #3552469] INFO -- : [291/885] 3593337=test_object_create_start I, [2024-05-24T11:41:54.928554 #3552469] INFO -- : [292/885] 3593337=test_gem_request_set_gem_dependency_api I, [2024-05-24T11:41:55.070713 #3552469] INFO -- : [293/885] 3593336=test_name_error_extension I, [2024-05-24T11:41:55.109483 #3552469] INFO -- : [294/885] 3593336=test_irb I, [2024-05-24T11:41:55.199732 #3552469] INFO -- : [295/885] 3593337=test_rdoc_markup_paragraph I, [2024-05-24T11:41:55.209065 #3552469] INFO -- : [296/885] 3593337=test_x509cert I, [2024-05-24T11:41:55.316906 #3552469] INFO -- : [297/885] 3593337=test_require_path_check I, [2024-05-24T11:41:55.352654 #3552469] INFO -- : [298/885] 3593336=test_bn I, [2024-05-24T11:41:55.356951 #3552469] INFO -- : [299/885] 3593336=test_variable_name_check I, [2024-05-24T11:41:55.431369 #3552469] INFO -- : [300/885] 3593336=test_logdevice I, [2024-05-24T11:41:55.519506 #3552469] INFO -- : [301/885] 3593337=test_ast I, [2024-05-24T11:41:56.144737 #3552469] INFO -- : [302/885] 3593336=test_ssl_session I, [2024-05-24T11:41:57.010969 #3552469] INFO -- : [303/885] 3593336=test_gem_package_tar_header I, [2024-05-24T11:41:57.099076 #3552469] INFO -- : [304/885] 3593336=test_rational2 I, [2024-05-24T11:41:57.120347 #3552469] INFO -- : [305/885] 3593336=test_logperiod I, [2024-05-24T11:41:57.130534 #3552469] INFO -- : [306/885] 3593336=test_case_comprehensive I, [2024-05-24T11:41:57.213941 #3552469] INFO -- : [307/885] 3593338=test_placearg I, [2024-05-24T11:41:57.363300 #3552469] INFO -- : [308/885] 3593338=test_file_exhaustive I, [2024-05-24T11:41:57.594517 #3552469] INFO -- : Leaked file descriptor: TestFileExhaustive#test_expand_path_home_dir_string: 11 # I, [2024-05-24T11:41:57.625573 #3552469] INFO -- : COMMAND PID USER FD TYPE DEVICE SIZE/OFF NODE NAME I, [2024-05-24T11:41:57.625662 #3552469] INFO -- : ruby 3593338 opc 11u unix 0x0000000000000000 0t0 3122135482 type=STREAM I, [2024-05-24T11:42:05.210162 #3552469] INFO -- : [309/885] 3593338=test_completion I, [2024-05-24T11:42:05.840919 #3552469] INFO -- : [310/885] 3593338=parse_stream_test I, [2024-05-24T11:42:05.879445 #3552469] INFO -- : [311/885] 3593338=test_handle I, [2024-05-24T11:42:06.444422 #3552469] INFO -- : [312/885] 3593338=test_delete I, [2024-05-24T11:42:06.453851 #3552469] INFO -- : [313/885] 3593338=test_rdoc_markup_document I, [2024-05-24T11:42:06.464550 #3552469] INFO -- : [314/885] 3593338=test_gem_security_policy I, [2024-05-24T11:42:06.867237 #3552469] INFO -- : [315/885] 3593338=test_io_wait_uncommon I, [2024-05-24T11:42:06.883487 #3552469] INFO -- : [316/885] 3593338=test_gem_ci_detector I, [2024-05-24T11:42:06.897845 #3552469] INFO -- : [317/885] 3593338=test_continuation I, [2024-05-24T11:42:06.903503 #3552469] INFO -- : [318/885] 3593338=test_signal I, [2024-05-24T11:42:08.910624 #3552469] INFO -- : [319/885] 3593338=test_gem_silent_ui I, [2024-05-24T11:42:08.960105 #3552469] INFO -- : [320/885] 3593338=test_fixnum I, [2024-05-24T11:42:08.976011 #3552469] INFO -- : [321/885] 3593338=command_line_test I, [2024-05-24T11:42:08.981182 #3552469] INFO -- : [322/885] 3593338=test_win32ole_variant_m I, [2024-05-24T11:42:09.028399 #3552469] INFO -- : [323/885] 3593338=test_pair I, [2024-05-24T11:42:14.256195 #3552469] INFO -- : [324/885] 3593338=test_gem_commands_signout_command I, [2024-05-24T11:42:14.288233 #3552469] INFO -- : [325/885] 3593338=test_gem_package_tar_reader I, [2024-05-24T11:42:14.359889 #3552469] INFO -- : [326/885] 3593338=test_env I, [2024-05-24T11:42:17.020753 #3552469] INFO -- : [327/885] 3593338=test_document I, [2024-05-24T11:42:17.029879 #3552469] INFO -- : [328/885] 3593338=test_eval I, [2024-05-24T11:42:17.030223 #3552469] INFO -- : [329/885] 3593338=test_gem_safe_yaml I, [2024-05-24T11:42:17.073676 #3552469] INFO -- : [330/885] 3593338=test_gem_commands_setup_command I, [2024-05-24T11:42:17.356353 #3552469] INFO -- : [331/885] 3593336=test_history I, [2024-05-24T11:42:17.392698 #3552469] INFO -- : [332/885] 3593336=test_singleton_function I, [2024-05-24T11:42:17.400034 #3552469] INFO -- : [333/885] 3593336=test_iseq I, [2024-05-24T11:42:17.917877 #3552469] INFO -- : [334/885] 3593338=test_primitive I, [2024-05-24T11:42:17.928650 #3552469] INFO -- : [335/885] 3593338=test_parser I, [2024-05-24T11:42:17.949022 #3552469] INFO -- : [336/885] 3593338=test_rdoc_ri_paths I, [2024-05-24T11:42:17.985907 #3552469] INFO -- : [337/885] 3593338=test_lazy_enumerator I, [2024-05-24T11:42:18.019445 #3552469] INFO -- : [338/885] 3593336=test_cgi_multipart I, [2024-05-24T11:42:18.143807 #3552469] INFO -- : [339/885] 3593336=test_gem_request_set_lockfile_tokenizer I, [2024-05-24T11:42:18.233338 #3552469] INFO -- : [340/885] 3593336=test_ractor_compatibility I, [2024-05-24T11:42:18.424136 #3552469] INFO -- : [341/885] 3593338=test_arithmetic_sequence I, [2024-05-24T11:42:18.439514 #3552469] INFO -- : [342/885] 3593338=integer_parse_test I, [2024-05-24T11:42:18.449351 #3552469] INFO -- : [343/885] 3593338=test_autoconf I, [2024-05-24T11:42:18.452618 #3552469] INFO -- : [344/885] 3593338=test_find_executable I, [2024-05-24T11:42:18.461736 #3552469] INFO -- : [345/885] 3593338=test_sockopt I, [2024-05-24T11:42:18.467097 #3552469] INFO -- : [346/885] 3593338=test_ftp I, [2024-05-24T11:42:18.476685 #3552469] INFO -- : [347/885] 3593338=test_gem_source_fetch_problem I, [2024-05-24T11:42:18.482149 #3552469] INFO -- : [348/885] 3593338=test_install I, [2024-05-24T11:42:18.611917 #3552469] INFO -- : [349/885] 3593336=test_encoding I, [2024-05-24T11:42:18.628564 #3552469] INFO -- : [350/885] 3593336=test_rdoc_comment I, [2024-05-24T11:42:18.667398 #3552469] INFO -- : [351/885] 3593338=test_autoload I, [2024-05-24T11:42:18.684349 #3552469] INFO -- : [352/885] 3593336=test_gem_package I, [2024-05-24T11:42:19.510467 #3552469] INFO -- : [353/885] 3593336=test_array I, [2024-05-24T11:42:22.972570 #3552469] INFO -- : [354/885] 3593338=test_benchmark I, [2024-05-24T11:42:24.446499 #3552469] INFO -- : [355/885] 3593338=test_at_exit I, [2024-05-24T11:42:24.455488 #3552469] INFO -- : [356/885] 3593338=test_have_macro I, [2024-05-24T11:42:24.878209 #3552469] INFO -- : [357/885] 3593338=test_gem_source I, [2024-05-24T11:42:25.207156 #3552469] INFO -- : [358/885] 3593338=test_mkmf I, [2024-05-24T11:42:25.252460 #3552469] INFO -- : [359/885] 3593338=test_class I, [2024-05-24T11:42:25.268004 #3552469] INFO -- : [360/885] 3593338=test_gem_source_git I, [2024-05-24T11:42:26.302792 #3552469] INFO -- : [361/885] 3593338=test_lexer I, [2024-05-24T11:42:26.312755 #3552469] INFO -- : [362/885] 3593338=test_win32ole_method I, [2024-05-24T11:42:26.340157 #3552469] INFO -- : [363/885] 3593338=test_regex_casefold I, [2024-05-24T11:42:26.801955 #3552469] INFO -- : [364/885] 3593338=test_ripper I, [2024-05-24T11:42:27.232898 #3552469] INFO -- : [365/885] 3593338=test_files_ext I, [2024-05-24T11:42:27.244180 #3552469] INFO -- : [366/885] 3593338=test_stringio I, [2024-05-24T11:42:27.354510 #3552469] INFO -- : [367/885] 3593338=test_assembler I, [2024-05-24T11:42:27.365330 #3552469] INFO -- : [368/885] 3593338=test_thread_cv I, [2024-05-24T11:42:28.007106 #3552469] INFO -- : [369/885] 3593338=test_random I, [2024-05-24T11:42:28.022664 #3552469] INFO -- : [370/885] 3593338=test_eval_history I, [2024-05-24T11:42:28.041013 #3552469] INFO -- : [371/885] 3593338=dispatcher_test I, [2024-05-24T11:42:28.047666 #3552469] INFO -- : [372/885] 3593338=test_unicode I, [2024-05-24T11:42:28.056748 #3552469] INFO -- : [373/885] 3593338=test_rdoc_top_level I, [2024-05-24T11:42:28.379422 #3552469] INFO -- : [374/885] 3593338=test_io_m17n I, [2024-05-24T11:42:29.686358 #3552469] INFO -- : [375/885] 3593338=test_cmethod I, [2024-05-24T11:42:29.690428 #3552469] INFO -- : [376/885] 3593338=test_float I, [2024-05-24T11:42:30.434338 #3552469] INFO -- : [377/885] 3593336=test_gem_stub_specification I, [2024-05-24T11:42:30.581910 #3552469] INFO -- : [378/885] 3593336=test_color I, [2024-05-24T11:42:30.654203 #3552469] INFO -- : [379/885] 3593336=test_propertyputref I, [2024-05-24T11:42:30.658896 #3552469] INFO -- : [380/885] 3593336=test_gb18030 I, [2024-05-24T11:42:30.672060 #3552469] INFO -- : [381/885] 3593336=test_gem_commands_lock_command I, [2024-05-24T11:42:30.693813 #3552469] INFO -- : [382/885] 3593336=test_reline_key I, [2024-05-24T11:42:30.777343 #3552469] INFO -- : [383/885] 3593336=test_unicode_normalize I, [2024-05-24T11:42:31.489068 #3552469] INFO -- : [384/885] 3593338=test_gem_stream_ui I, [2024-05-24T11:42:31.607489 #3552469] INFO -- : [385/885] 3593338=test_rdoc_generator_ri I, [2024-05-24T11:42:31.614135 #3552469] INFO -- : [386/885] 3593338=test_scanner_events I, [2024-05-24T11:42:31.660625 #3552469] INFO -- : [387/885] 3593338=test_ocsp I, [2024-05-24T11:42:31.759132 #3552469] INFO -- : [388/885] 3593338=test_ipaddr I, [2024-05-24T11:42:31.786855 #3552469] INFO -- : [389/885] 3593338=test_omap I, [2024-05-24T11:42:31.788996 #3552469] INFO -- : [390/885] 3593338=test_date_strptime I, [2024-05-24T11:42:31.926132 #3552469] INFO -- : [391/885] 3593338=test_rdoc_generator_pot_po I, [2024-05-24T11:42:31.937583 #3552469] INFO -- : [392/885] 3593338=test_shellwords I, [2024-05-24T11:42:31.941920 #3552469] INFO -- : [393/885] 3593338=test_mul I, [2024-05-24T11:42:31.951526 #3552469] INFO -- : [394/885] 3593338=json_ext_parser_test I, [2024-05-24T11:42:31.957725 #3552469] INFO -- : [395/885] 3593338=test_gem_ext_configure_builder I, [2024-05-24T11:42:32.007294 #3552469] INFO -- : [396/885] 3593338=test_nonblock I, [2024-05-24T11:42:32.025909 #3552469] INFO -- : [397/885] 3593338=test_rdoc_parser_simple I, [2024-05-24T11:42:32.042665 #3552469] INFO -- : [398/885] 3593338=test_x509attr I, [2024-05-24T11:42:32.046619 #3552469] INFO -- : [399/885] 3593338=test_printf I, [2024-05-24T11:42:32.075966 #3552469] INFO -- : [400/885] 3593338=test_workspace I, [2024-05-24T11:42:32.215998 #3552469] INFO -- : [401/885] 3593338=magic_comment_test I, [2024-05-24T11:42:32.227013 #3552469] INFO -- : [402/885] 3593338=test_win32ole_variant I, [2024-05-24T11:42:32.240132 #3552469] INFO -- : [403/885] 3593338=test_cgi_modruby I, [2024-05-24T11:42:32.243171 #3552469] INFO -- : [404/885] 3593338=test_win32ole_param_event I, [2024-05-24T11:42:32.249838 #3552469] INFO -- : [405/885] 3593338=test_https_proxy I, [2024-05-24T11:42:32.259359 #3552469] INFO -- : [406/885] 3593338=test_rdoc_parser I, [2024-05-24T11:42:32.331017 #3552469] INFO -- : [407/885] 3593338=test_gem_commands_rebuild_command I, [2024-05-24T11:42:32.342252 #3552469] INFO -- : [408/885] 3593338=test_nomethod_error I, [2024-05-24T11:42:32.356791 #3552469] INFO -- : [409/885] 3593338=test_etc I, [2024-05-24T11:42:32.440934 #3552469] INFO -- : [410/885] 3593338=test_stat I, [2024-05-24T11:42:32.442836 #3552469] INFO -- : [411/885] 3593338=test_files_test_1 I, [2024-05-24T11:42:32.455377 #3552469] INFO -- : [412/885] 3593338=test_dir I, [2024-05-24T11:42:32.824558 #3552469] INFO -- : [413/885] 3593338=test_closure I, [2024-05-24T11:42:34.548763 #3552469] INFO -- : [414/885] 3593336=test_rubygems I, [2024-05-24T11:42:34.721470 #3552469] INFO -- : [415/885] 3593336=test_resolve_symbol I, [2024-05-24T11:42:34.786155 #3552469] INFO -- : [416/885] 3593336=test_path I, [2024-05-24T11:42:34.797963 #3552469] INFO -- : [417/885] 3593336=test_digest I, [2024-05-24T11:42:34.812442 #3552469] INFO -- : [418/885] 3593336=test_rdoc_rd_inline I, [2024-05-24T11:42:34.823437 #3552469] INFO -- : [419/885] 3593336=test_uncorrectable_name_check I, [2024-05-24T11:42:34.843125 #3552469] INFO -- : [420/885] 3593336=test_io I, [2024-05-24T11:42:35.327190 #3552469] INFO -- : [421/885] 3593338=test_argf I, [2024-05-24T11:42:39.162714 #3552469] INFO -- : [422/885] 3593338=test_yaml I, [2024-05-24T11:42:39.292450 #3552469] INFO -- : [423/885] 3593338=test_x509name I, [2024-05-24T11:42:39.301934 #3552469] INFO -- : [424/885] 3593338=test_gem_dependency I, [2024-05-24T11:42:39.472341 #3552469] INFO -- : [425/885] 3593338=test_yjit I, [2024-05-24T11:42:39.496198 #3552469] INFO -- : [426/885] 3593338=test_gem_uninstaller I, [2024-05-24T11:42:40.820635 #3552469] INFO -- : [427/885] 3593338=test_cclass I, [2024-05-24T11:42:40.874423 #3552469] INFO -- : [428/885] 3593338=test_m17n I, [2024-05-24T11:42:40.930071 #3552469] INFO -- : [429/885] 3593338=test_method I, [2024-05-24T11:42:42.752717 #3552469] INFO -- : [430/885] 3593337=test_filter I, [2024-05-24T11:42:42.788689 #3552469] INFO -- : [431/885] 3593337=test_parser_events I, [2024-05-24T11:42:42.933090 #3552469] INFO -- : [432/885] 3593337=test_pkcs12 I, [2024-05-24T11:42:43.744689 #3552469] INFO -- : [433/885] 3593337=test_gem_remote_fetcher I, [2024-05-24T11:42:45.571929 #3552469] INFO -- : [434/885] 3593337=test_json_tree I, [2024-05-24T11:42:45.596666 #3552469] INFO -- : [435/885] 3593337=test_koi8 I, [2024-05-24T11:42:45.614880 #3552469] INFO -- : [436/885] 3593337=test_severity I, [2024-05-24T11:42:45.645159 #3552469] INFO -- : [437/885] 3593337=test_ractor I, [2024-05-24T11:42:45.646803 #3552469] INFO -- : [438/885] 3593337=test_case I, [2024-05-24T11:42:45.665090 #3552469] INFO -- : [439/885] 3593337=test_gem_package_tar_writer I, [2024-05-24T11:42:45.866738 #3552469] INFO -- : [440/885] 3593337=test_str2big I, [2024-05-24T11:42:45.875601 #3552469] INFO -- : [441/885] 3593337=test_utf16 I, [2024-05-24T11:42:45.898739 #3552469] INFO -- : [442/885] 3593337=test_http I, [2024-05-24T11:42:48.219275 #3552469] INFO -- : [443/885] 3593336=attribute_write_test I, [2024-05-24T11:42:48.228868 #3552469] INFO -- : [444/885] 3593336=test_set I, [2024-05-24T11:42:48.240797 #3552469] INFO -- : [445/885] 3593336=test_rdoc_markup_to_rdoc I, [2024-05-24T11:42:48.384788 #3552469] INFO -- : [446/885] 3593336=test_gem_commands_push_command I, [2024-05-24T11:42:48.954733 #3552469] INFO -- : [447/885] 3593336=locals_test I, [2024-05-24T11:42:49.407339 #3552469] INFO -- : [448/885] 3593336=test_too_many_dummy_encodings I, [2024-05-24T11:42:49.415643 #3552469] INFO -- : [449/885] 3593336=test_method_cache I, [2024-05-24T11:42:49.430880 #3552469] INFO -- : [450/885] 3593336=test_sprintf_comb I, [2024-05-24T11:42:49.603776 #3552469] INFO -- : [451/885] 3593336=desugar_compiler_test I, [2024-05-24T11:42:49.631754 #3552469] INFO -- : [452/885] 3593336=test_gem_source_local I, [2024-05-24T11:42:49.851668 #3552469] INFO -- : [453/885] 3593336=test_internal_ivar I, [2024-05-24T11:42:49.858777 #3552469] INFO -- : [454/885] 3593336=test_win32ole I, [2024-05-24T11:42:49.866815 #3552469] INFO -- : [455/885] 3593336=test_rendering I, [2024-05-24T11:42:49.883298 #3552469] INFO -- : [456/885] 3593336=test_gem_gemcutter_utilities I, [2024-05-24T11:42:49.984571 #3552469] INFO -- : [457/885] 3593338=test_rdoc_task I, [2024-05-24T11:42:49.991188 #3552469] INFO -- : [458/885] 3593338=test_tracepoint I, [2024-05-24T11:42:50.273111 #3552469] INFO -- : [459/885] 3593338=test_settracefunc I, [2024-05-24T11:42:50.314348 #3552469] INFO -- : [460/885] 3593336=test_gem_text I, [2024-05-24T11:42:50.392720 #3552469] INFO -- : [461/885] 3593336=test_backtrace I, [2024-05-24T11:42:51.209713 #3552469] INFO -- : [462/885] 3593338=test_pty I, [2024-05-24T11:42:51.689443 #3552469] INFO -- : [463/885] 3593338=test_gem_dependency_installer I, [2024-05-24T11:42:51.764857 #3552469] INFO -- : [464/885] 3593336=test_http I, [2024-05-24T11:42:51.773760 #3552469] INFO -- : [465/885] 3593336=parser_test I, [2024-05-24T11:42:51.788208 #3552469] INFO -- : [466/885] 3593336=test_hash I, [2024-05-24T11:42:54.036154 #3552469] INFO -- : [467/885] 3593338=encoding_test I, [2024-05-24T11:42:54.114001 #3552469] INFO -- : [468/885] 3593338=test_gem_commands_specification_command I, [2024-05-24T11:42:54.249467 #3552469] INFO -- : [469/885] 3593338=test_scan_args I, [2024-05-24T11:42:54.269229 #3552469] INFO -- : [470/885] 3593338=test_gem_commands_which_command I, [2024-05-24T11:42:54.302255 #3552469] INFO -- : [471/885] 3593338=test_gem_request I, [2024-05-24T11:42:54.522718 #3552469] INFO -- : [472/885] 3593338=test_gem_package_old I, [2024-05-24T11:42:54.570609 #3552469] INFO -- : [473/885] 3593338=test_case I, [2024-05-24T11:42:54.602333 #3552469] INFO -- : [474/885] 3593338=test_open-uri I, [2024-05-24T11:42:54.704938 #3552469] INFO -- : [475/885] 3593337=test_enc_associate I, [2024-05-24T11:42:54.983149 #3552469] INFO -- : [476/885] 3593338=test_enumerator I, [2024-05-24T11:42:55.164127 #3552469] INFO -- : [477/885] 3593337=test_gem_command_manager I, [2024-05-24T11:42:55.350977 #3552469] INFO -- : [478/885] 3593337=test_rdoc_context I, [2024-05-24T11:42:55.892710 #3552469] INFO -- : [479/885] 3593336=test_array I, [2024-05-24T11:42:55.907404 #3552469] INFO -- : [480/885] 3593336=test_libs I, [2024-05-24T11:42:55.916565 #3552469] INFO -- : [481/885] 3593336=ripper_test I, [2024-05-24T11:42:56.143086 #3552469] INFO -- : [482/885] 3593337=test_iso_8859 I, [2024-05-24T11:42:56.167176 #3552469] INFO -- : [483/885] 3593337=test_gc I, [2024-05-24T11:42:56.168395 #3552469] INFO -- : [484/885] 3593337=comments_test I, [2024-05-24T11:42:56.178190 #3552469] INFO -- : [485/885] 3593337=test_qsort I, [2024-05-24T11:42:56.186645 #3552469] INFO -- : [486/885] 3593337=test_math I, [2024-05-24T11:42:56.206893 #3552469] INFO -- : [487/885] 3593337=test_safe_load I, [2024-05-24T11:42:56.248350 #3552469] INFO -- : [488/885] 3593337=test_sprintf I, [2024-05-24T11:42:56.609185 #3552469] INFO -- : [489/885] 3593336=test_const I, [2024-05-24T11:42:56.611395 #3552469] INFO -- : [490/885] 3593336=test_rdoc_parser_rd I, [2024-05-24T11:42:56.623805 #3552469] INFO -- : [491/885] 3593337=index_write_test I, [2024-05-24T11:42:56.638433 #3552469] INFO -- : [492/885] 3593336=test_class I, [2024-05-24T11:42:56.651344 #3552469] INFO -- : [493/885] 3593337=test_exit I, [2024-05-24T11:42:56.733073 #3552469] INFO -- : [494/885] 3593337=test_yaml_special_cases I, [2024-05-24T11:42:56.744686 #3552469] INFO -- : [495/885] 3593337=test_recorder I, [2024-05-24T11:42:56.768528 #3552469] INFO -- : [496/885] 3593337=json_addition_test I, [2024-05-24T11:42:56.784816 #3552469] INFO -- : [497/885] 3593337=test_gem_source_list I, [2024-05-24T11:42:56.857092 #3552469] INFO -- : [498/885] 3593337=test_name_error I, [2024-05-24T11:42:56.957312 #3552469] INFO -- : [499/885] 3593337=test_gem_commands_sources_command I, [2024-05-24T11:42:57.168586 #3552469] INFO -- : [500/885] 3593337=test_framework I, [2024-05-24T11:42:57.181846 #3552469] INFO -- : [501/885] 3593337=test_coderange I, [2024-05-24T11:42:57.585321 #3552469] INFO -- : [502/885] 3593337=test_weakmap I, [2024-05-24T11:42:59.700647 #3552469] INFO -- : [503/885] 3593336=test_inadvertent_creation I, [2024-05-24T11:42:59.798709 #3552469] INFO -- : [504/885] 3593336=test_ansi_with_terminfo I, [2024-05-24T11:42:59.893474 #3552469] INFO -- : [505/885] 3593336=test_pack I, [2024-05-24T11:42:59.906835 #3552469] INFO -- : [506/885] 3593336=test_cgi_tag_helper I, [2024-05-24T11:42:59.996615 #3552469] INFO -- : [507/885] 3593336=test_pinned I, [2024-05-24T11:43:00.091666 #3552469] INFO -- : [508/885] 3593336=test_rdoc_generator_json_index I, [2024-05-24T11:43:00.124252 #3552469] INFO -- : [509/885] 3593336=test_date_time I, [2024-05-24T11:43:00.133483 #3552469] INFO -- : [510/885] 3593336=test_nil2vtempty I, [2024-05-24T11:43:00.141391 #3552469] INFO -- : [511/885] 3593336=test_cp949 I, [2024-05-24T11:43:00.154005 #3552469] INFO -- : [512/885] 3593336=test_jaro_winkler I, [2024-05-24T11:43:00.162737 #3552469] INFO -- : [513/885] 3593336=test_condition I, [2024-05-24T11:43:00.175271 #3552469] INFO -- : [514/885] 3593336=test_gem_resolver_vendor_set I, [2024-05-24T11:43:00.206447 #3552469] INFO -- : [515/885] 3593336=test_gem_dependency_resolution_error I, [2024-05-24T11:43:00.257771 #3552469] INFO -- : [516/885] 3593336=test_sleep I, [2024-05-24T11:43:02.269149 #3552469] INFO -- : [517/885] 3593336=test_mixed_unicode_escapes I, [2024-05-24T11:43:02.313490 #3552469] INFO -- : [518/885] 3593336=test_fileutils I, [2024-05-24T11:43:02.470085 #3552469] INFO -- : Leaked file descriptor: TestFileUtils#test_chown_error: 11 # I, [2024-05-24T11:43:02.500770 #3552469] INFO -- : COMMAND PID USER FD TYPE DEVICE SIZE/OFF NODE NAME I, [2024-05-24T11:43:02.500849 #3552469] INFO -- : ruby 3593336 opc 11r REG 252,0 9253600 13705411 /var/lib/sss/mc/passwd I, [2024-05-24T11:43:03.002042 #3552469] INFO -- : [519/885] 3593336=test_sorted_set I, [2024-05-24T11:43:03.163683 #3552469] INFO -- : [520/885] 3593336=test_emoji I, [2024-05-24T11:43:03.210512 #3552469] INFO -- : [521/885] 3593336=test_windows_1252 I, [2024-05-24T11:43:03.502373 #3552469] INFO -- : [522/885] 3593336=test_stack I, [2024-05-24T11:43:04.383033 #3552469] INFO -- : [523/885] 3593336=test_face I, [2024-05-24T11:43:04.419387 #3552469] INFO -- : [524/885] 3593336=test_date_attr I, [2024-05-24T11:43:04.432402 #3552469] INFO -- : [525/885] 3593336=test_sizeof I, [2024-05-24T11:43:06.778692 #3552469] INFO -- : [526/885] 3593337=test_gem_request_set_lockfile_parser I, [2024-05-24T11:43:06.828776 #3552469] INFO -- : [527/885] 3593336=test_stringchar I, [2024-05-24T11:43:06.899033 #3552469] INFO -- : [528/885] 3593336=warnings_test I, [2024-05-24T11:43:06.907693 #3552469] INFO -- : [529/885] 3593337=test_econv I, [2024-05-24T11:43:06.934665 #3552469] INFO -- : [530/885] 3593336=test_gem_install_update_options I, [2024-05-24T11:43:07.181323 #3552469] INFO -- : [531/885] 3593336=test_gem_specification I, [2024-05-24T11:43:07.871584 #3552469] INFO -- : [532/885] 3593337=test_flush I, [2024-05-24T11:43:07.897059 #3552469] INFO -- : [533/885] 3593337=test_pkey_rsa I, [2024-05-24T11:43:08.164724 #3552469] INFO -- : [534/885] 3593337=test_numhash I, [2024-05-24T11:43:08.172094 #3552469] INFO -- : [535/885] 3593337=test_system I, [2024-05-24T11:43:09.142212 #3552469] INFO -- : [536/885] 3593337=test_win32ole_variable I, [2024-05-24T11:43:09.149607 #3552469] INFO -- : [537/885] 3593337=test_parse I, [2024-05-24T11:43:09.671462 #3552469] INFO -- : [538/885] 3593337=test_rdoc_cross_reference I, [2024-05-24T11:43:09.763707 #3552469] INFO -- : [539/885] 3593336=test_rdoc_class_module I, [2024-05-24T11:43:10.134002 #3552469] INFO -- : [540/885] 3593337=test_method_cache I, [2024-05-24T11:43:10.140477 #3552469] INFO -- : [541/885] 3593337=test_undef I, [2024-05-24T11:43:10.149459 #3552469] INFO -- : [542/885] 3593337=test_rdoc_generator_darkfish I, [2024-05-24T11:43:10.317404 #3552469] INFO -- : [543/885] 3593336=test_random I, [2024-05-24T11:43:10.328954 #3552469] INFO -- : [544/885] 3593336=test_gem_resolver_lock_set I, [2024-05-24T11:43:10.359185 #3552469] INFO -- : [545/885] 3593336=test_gem_command I, [2024-05-24T11:43:10.464060 #3552469] INFO -- : [546/885] 3593336=test_asn1 I, [2024-05-24T11:43:10.501405 #3552469] INFO -- : [547/885] 3593336=test_gem_commands_open_command I, [2024-05-24T11:43:10.550942 #3552469] INFO -- : [548/885] 3593337=test_verbose I, [2024-05-24T11:43:10.591772 #3552469] INFO -- : [549/885] 3593337=test_normalize I, [2024-05-24T11:43:10.596805 #3552469] INFO -- : [550/885] 3593337=test_emoji_breaks I, [2024-05-24T11:43:10.598119 #3552469] INFO -- : [551/885] 3593336=test_assignment I, [2024-05-24T11:43:10.608789 #3552469] INFO -- : [552/885] 3593337=test_gem_update_suggestion I, [2024-05-24T11:43:10.721788 #3552469] INFO -- : [553/885] 3593337=test_basicinstructions I, [2024-05-24T11:43:10.792648 #3552469] INFO -- : [554/885] 3593337=test_utf32 I, [2024-05-24T11:43:10.828466 #3552469] INFO -- : [555/885] 3593337=test_gem_resolver_git_specification I, [2024-05-24T11:43:11.185570 #3552469] INFO -- : [556/885] 3593337=test_key_actor_emacs I, [2024-05-24T11:43:12.083656 #3552469] INFO -- : [557/885] 3593337=test_gem_security I, [2024-05-24T11:43:12.100386 #3552469] INFO -- : [558/885] 3593336=test_erb I, [2024-05-24T11:43:12.393646 #3552469] INFO -- : [559/885] 3593336=test_date_ractor I, [2024-05-24T11:43:12.404084 #3552469] INFO -- : [560/885] 3593336=test_variable I, [2024-05-24T11:43:12.506757 #3552469] INFO -- : [561/885] 3593336=test_hash I, [2024-05-24T11:43:12.528517 #3552469] INFO -- : [562/885] 3593336=test_rdoc_tom_doc I, [2024-05-24T11:43:12.614203 #3552469] INFO -- : [563/885] 3593336=test_gem_commands_pristine_command I, [2024-05-24T11:43:13.998640 #3552469] INFO -- : [564/885] 3593336=test_optarg I, [2024-05-24T11:43:14.131559 #3552469] INFO -- : [565/885] 3593336=test_gem_impossible_dependencies_error I, [2024-05-24T11:43:14.143785 #3552469] INFO -- : [566/885] 3593336=test_pp I, [2024-05-24T11:43:14.232931 #3552469] INFO -- : [567/885] 3593336=test_gem_resolver_requirement_list I, [2024-05-24T11:43:14.241468 #3552469] INFO -- : [568/885] 3593336=memsize_test I, [2024-05-24T11:43:14.301657 #3552469] INFO -- : [569/885] 3593336=test_arith_seq_beg_len_step I, [2024-05-24T11:43:14.434679 #3552469] INFO -- : [570/885] 3593336=test_raise_exception I, [2024-05-24T11:43:14.924257 #3552469] INFO -- : [571/885] 3593336=test_exception I, [2024-05-24T11:43:14.940649 #3552469] INFO -- : [572/885] 3593336=test_noarg I, [2024-05-24T11:43:15.154763 #3552469] INFO -- : [573/885] 3593336=test_shapes I, [2024-05-24T11:43:15.163179 #3552469] INFO -- : [574/885] 3593336=test_did_you_mean I, [2024-05-24T11:43:15.239656 #3552469] INFO -- : [575/885] 3593336=test_rdoc_extend I, [2024-05-24T11:43:15.258623 #3552469] INFO -- : [576/885] 3593336=test_cesu8 I, [2024-05-24T11:43:15.268005 #3552469] INFO -- : [577/885] 3593336=test_storage I, [2024-05-24T11:43:15.282477 #3552469] INFO -- : [578/885] 3593336=test_method_name_check I, [2024-05-24T11:43:15.311624 #3552469] INFO -- : [579/885] 3593336=test_err_in_callback I, [2024-05-24T11:43:15.326780 #3552469] INFO -- : [580/885] 3593336=test_merge_keys I, [2024-05-24T11:43:15.337259 #3552469] INFO -- : [581/885] 3593336=test_string I, [2024-05-24T11:43:15.348185 #3552469] INFO -- : [582/885] 3593336=test_iterator I, [2024-05-24T11:43:15.480063 #3552469] INFO -- : [583/885] 3593336=test_gem_commands_install_command I, [2024-05-24T11:43:17.370813 #3552469] INFO -- : [584/885] 3593337=test_kernel I, [2024-05-24T11:43:17.522722 #3552469] INFO -- : [585/885] 3593336=test_rendering I, [2024-05-24T11:43:17.537910 #3552469] INFO -- : [586/885] 3593336=pattern_test I, [2024-05-24T11:43:17.581982 #3552469] INFO -- : [587/885] 3593336=test_gem_rdoc I, [2024-05-24T11:43:17.740044 #3552469] INFO -- : [588/885] 3593336=test_dot_dot I, [2024-05-24T11:43:17.742259 #3552469] INFO -- : [589/885] 3593336=!Nothing_to_test I, [2024-05-24T11:43:17.743973 #3552469] INFO -- : [590/885] 3593336=test_fd_setsize I, [2024-05-24T11:43:17.760769 #3552469] INFO -- : [591/885] 3593336=test_process I, [2024-05-24T11:43:17.800763 #3552469] INFO -- : [592/885] 3593336=test_forwardable I, [2024-05-24T11:43:17.822595 #3552469] INFO -- : [593/885] 3593336=test_array_create I, [2024-05-24T11:43:17.839624 #3552469] INFO -- : [594/885] 3593336=test_memory_view I, [2024-05-24T11:43:18.183547 #3552469] INFO -- : [595/885] 3593337=test_dir_m17n I, [2024-05-24T11:43:18.629175 #3552469] INFO -- : [596/885] 3593336=test_complex I, [2024-05-24T11:43:18.773752 #3552469] INFO -- : [597/885] 3593336=test_threadgroup I, [2024-05-24T11:43:19.386233 #3552469] INFO -- : [598/885] 3593337=test_case_mapping I, [2024-05-24T11:43:19.404793 #3552469] INFO -- : [599/885] 3593337=test_rational I, [2024-05-24T11:43:19.422440 #3552469] INFO -- : [600/885] 3593337=test_gem_ext_cargo_builder_unit I, [2024-05-24T11:43:19.455851 #3552469] INFO -- : [601/885] 3593337=test_ractor I, [2024-05-24T11:43:19.471065 #3552469] INFO -- : [602/885] 3593337=test_gem_resolver_api_specification I, [2024-05-24T11:43:19.575842 #3552469] INFO -- : [603/885] 3593337=test_rdoc_rubygems_hook I, [2024-05-24T11:43:19.669756 #3552469] INFO -- : [604/885] 3593337=test_webauthn_listener I, [2024-05-24T11:43:19.730614 #3552469] INFO -- : [605/885] 3593337=test_key_event_record I, [2024-05-24T11:43:19.733100 #3552469] INFO -- : [606/885] 3593337=test_date_parse I, [2024-05-24T11:43:19.746620 #3552469] INFO -- : [607/885] 3593336=test_mdns I, [2024-05-24T11:43:19.826433 #3552469] INFO -- : [608/885] 3593336=test_open3 I, [2024-05-24T11:43:19.867321 #3552469] INFO -- : [609/885] 3593337=test_arity I, [2024-05-24T11:43:19.874782 #3552469] INFO -- : [610/885] 3593337=test_thread I, [2024-05-24T11:43:19.883786 #3552469] INFO -- : [611/885] 3593337=test_svcb_https I, [2024-05-24T11:43:19.896715 #3552469] INFO -- : [612/885] 3593337=test_pkey_ec I, [2024-05-24T11:43:19.921939 #3552469] INFO -- : [613/885] 3593337=test_buffering I, [2024-05-24T11:43:19.926954 #3552469] INFO -- : [614/885] 3593337=test_yamldbm I, [2024-05-24T11:43:19.945917 #3552469] INFO -- : [615/885] 3593337=test_gem_spec_fetcher I, [2024-05-24T11:43:20.154222 #3552469] INFO -- : [616/885] 3593337=test_unicode_escape I, [2024-05-24T11:43:20.234476 #3552469] INFO -- : [617/885] 3593337=test_switch_hitter I, [2024-05-24T11:43:20.279825 #3552469] INFO -- : [618/885] 3593337=test_default_gems I, [2024-05-24T11:43:20.306130 #3552469] INFO -- : [619/885] 3593337=test_backtrace I, [2024-05-24T11:43:20.313341 #3552469] INFO -- : [620/885] 3593337=test_gbk I, [2024-05-24T11:43:20.330329 #3552469] INFO -- : [621/885] 3593337=test_gem_commands_dependency_command I, [2024-05-24T11:43:20.500408 #3552469] INFO -- : [622/885] 3593337=test_rdoc_method_attr I, [2024-05-24T11:43:20.615500 #3552469] INFO -- : [623/885] 3593337=test_enumerable I, [2024-05-24T11:43:20.629633 #3552469] INFO -- : [624/885] 3593337=test_set I, [2024-05-24T11:43:20.663124 #3552469] INFO -- : [625/885] 3593337=static_literals_test I, [2024-05-24T11:43:20.691001 #3552469] INFO -- : [626/885] 3593337=test_tree_spell_checker I, [2024-05-24T11:43:20.760935 #3552469] INFO -- : [627/885] 3593337=test_grapheme_breaks I, [2024-05-24T11:43:20.821981 #3552469] INFO -- : [628/885] 3593337=test_hash_create I, [2024-05-24T11:43:20.840366 #3552469] INFO -- : [629/885] 3593337=test_queue I, [2024-05-24T11:43:20.842861 #3552469] INFO -- : [630/885] 3593337=test_gem_resolver_lock_specification I, [2024-05-24T11:43:20.893343 #3552469] INFO -- : [631/885] 3593337=test_boolean I, [2024-05-24T11:43:20.919229 #3552469] INFO -- : [632/885] 3593337=test_gc_compact I, [2024-05-24T11:43:22.556978 #3552469] INFO -- : [633/885] 3593336=test_rdoc_i18n_locale I, [2024-05-24T11:43:22.566026 #3552469] INFO -- : [634/885] 3593336=test_dryrun I, [2024-05-24T11:43:22.616739 #3552469] INFO -- : [635/885] 3593336=test_gem_uri_formatter I, [2024-05-24T11:43:22.640251 #3552469] INFO -- : [636/885] 3593336=test_prettyprint I, [2024-05-24T11:43:22.687849 #3552469] INFO -- : [637/885] 3593336=test_ole_methods I, [2024-05-24T11:43:22.713812 #3552469] INFO -- : [638/885] 3593336=test_cgi_util I, [2024-05-24T11:43:23.088928 #3552469] INFO -- : [639/885] 3593336=test_clone I, [2024-05-24T11:43:23.258196 #3552469] INFO -- : [640/885] 3593336=test_enc_raise I, [2024-05-24T11:43:23.337467 #3552469] INFO -- : [641/885] 3593336=test_data_error I, [2024-05-24T11:43:23.340627 #3552469] INFO -- : [642/885] 3593336=test_rdoc_stats I, [2024-05-24T11:43:23.475908 #3552469] INFO -- : [643/885] 3593336=test_files_sample I, [2024-05-24T11:43:23.477927 #3552469] INFO -- : [644/885] 3593336=test_rubyoptions I, [2024-05-24T11:43:23.523039 #3552469] INFO -- : [645/885] 3593338=test_optimization I, [2024-05-24T11:43:24.577685 #3552469] INFO -- : [646/885] 3593337=test_force_exit I, [2024-05-24T11:43:24.585100 #3552469] INFO -- : [647/885] 3593337=test_shift_jis I, [2024-05-24T11:43:24.609392 #3552469] INFO -- : [648/885] 3593337=test_rdoc_store I, [2024-05-24T11:43:25.354416 #3552469] INFO -- : [649/885] 3593337=regexp_test I, [2024-05-24T11:43:25.383184 #3552469] INFO -- : [650/885] 3593337=test_yield I, [2024-05-24T11:43:28.454695 #3552469] INFO -- : [651/885] 3593337=test_remote_fetch_error I, [2024-05-24T11:43:28.479505 #3552469] INFO -- : [652/885] 3593337=test_show_source I, [2024-05-24T11:43:28.487743 #3552469] INFO -- : [653/885] 3593337=test_io_buffer I, [2024-05-24T11:43:28.603254 #3552469] INFO -- : [654/885] 3593337=test_rdoc_context_section I, [2024-05-24T11:43:28.611950 #3552469] INFO -- : [655/885] 3593337=test_deprecated I, [2024-05-24T11:43:28.616524 #3552469] INFO -- : [656/885] 3593337=test_optparse I, [2024-05-24T11:43:28.629762 #3552469] INFO -- : [657/885] 3593337=test_exception I, [2024-05-24T11:43:29.874723 #3552469] INFO -- : [658/885] 3593336=test_bash_completion I, [2024-05-24T11:43:29.881665 #3552469] INFO -- : [659/885] 3593336=test_files_test_2 I, [2024-05-24T11:43:29.890359 #3552469] INFO -- : [660/885] 3593336=test_div I, [2024-05-24T11:43:29.912756 #3552469] INFO -- : [661/885] 3593336=test_rdoc_markup_to_html_crossref I, [2024-05-24T11:43:30.249452 #3552469] INFO -- : [662/885] 3593338=test_scalar I, [2024-05-24T11:43:30.293418 #3552469] INFO -- : [663/885] 3593338=test_syntax I, [2024-05-24T11:43:30.316817 #3552469] INFO -- : [664/885] 3593336=test_class_name_check I, [2024-05-24T11:43:30.449949 #3552469] INFO -- : [665/885] 3593336=test_basicsocket I, [2024-05-24T11:43:30.483256 #3552469] INFO -- : [666/885] 3593336=test_zsh_completion I, [2024-05-24T11:43:30.497912 #3552469] INFO -- : [667/885] 3593336=test_gem_commands_environment_command I, [2024-05-24T11:43:30.569134 #3552469] INFO -- : [668/885] 3593336=test_pkcs7 I, [2024-05-24T11:43:30.741075 #3552469] INFO -- : [669/885] 3593336=test_pack I, [2024-05-24T11:43:30.988254 #3552469] INFO -- : [670/885] 3593336=test_gem_commands_stale_command I, [2024-05-24T11:43:30.994238 #3552469] INFO -- : [671/885] 3593336=ruby_parser_test I, [2024-05-24T11:43:31.008604 #3552469] INFO -- : [672/885] 3593336=test_rdoc_markup_to_tt_only I, [2024-05-24T11:43:31.038306 #3552469] INFO -- : [673/885] 3593336=json_parser_test I, [2024-05-24T11:43:31.378084 #3552469] INFO -- : [674/885] 3593336=test_date_strftime I, [2024-05-24T11:43:31.555003 #3552469] INFO -- : [675/885] 3593336=test_ws I, [2024-05-24T11:43:31.575948 #3552469] INFO -- : [676/885] 3593336=test_gem_commands_cert_command I, [2024-05-24T11:43:33.570587 #3552469] INFO -- : [677/885] 3593336=test_singleton I, [2024-05-24T11:43:33.598806 #3552469] INFO -- : [678/885] 3593336=test_fstring I, [2024-05-24T11:43:33.716061 #3552469] INFO -- : [679/885] 3593336=test_numeric I, [2024-05-24T11:43:33.745742 #3552469] INFO -- : [680/885] 3593336=test_rdoc_require I, [2024-05-24T11:43:33.768779 #3552469] INFO -- : [681/885] 3593336=test_gem_ext_rake_builder I, [2024-05-24T11:43:33.823003 #3552469] INFO -- : [682/885] 3593337=test_word I, [2024-05-24T11:43:33.842991 #3552469] INFO -- : [683/885] 3593337=test_timeout I, [2024-05-24T11:43:34.405423 #3552469] INFO -- : [684/885] 3593336=test_rdoc_markup_raw I, [2024-05-24T11:43:34.416235 #3552469] INFO -- : [685/885] 3593336=test_rdoc_markup_to_bs I, [2024-05-24T11:43:34.470996 #3552469] INFO -- : [686/885] 3593336=test_key_name_check I, [2024-05-24T11:43:34.525471 #3552469] INFO -- : [687/885] 3593336=test_instrumentation_api I, [2024-05-24T11:43:34.727473 #3552469] INFO -- : [688/885] 3593337=test_weakref I, [2024-05-24T11:43:35.021752 #3552469] INFO -- : [689/885] 3593337=test_rdoc_alias I, [2024-05-24T11:43:35.079851 #3552469] INFO -- : [690/885] 3593337=test_ractor I, [2024-05-24T11:43:35.085929 #3552469] INFO -- : [691/885] 3593337=test_null I, [2024-05-24T11:43:35.093357 #3552469] INFO -- : [692/885] 3593337=test_data I, [2024-05-24T11:43:35.107650 #3552469] INFO -- : [693/885] 3593337=test_memory_view I, [2024-05-24T11:43:35.129699 #3552469] INFO -- : [694/885] 3593337=test_multi_irb_commands I, [2024-05-24T11:43:36.315232 #3552469] INFO -- : [695/885] 3593337=test_pkey_dh I, [2024-05-24T11:43:36.461337 #3552469] INFO -- : [696/885] 3593337=test_m17n_comb I, [2024-05-24T11:43:37.455305 #3552469] INFO -- : [697/885] 3593336=test_win32ole_typelib I, [2024-05-24T11:43:37.466049 #3552469] INFO -- : [698/885] 3593336=test_pkey I, [2024-05-24T11:43:37.478600 #3552469] INFO -- : [699/885] 3593336=test_external_new I, [2024-05-24T11:43:37.487112 #3552469] INFO -- : [700/885] 3593336=test_bigzero I, [2024-05-24T11:43:37.501141 #3552469] INFO -- : [701/885] 3593336=test_gem_platform I, [2024-05-24T11:43:37.607059 #3552469] INFO -- : [702/885] 3593336=test_gem_commands_query_command I, [2024-05-24T11:43:38.279100 #3552469] INFO -- : [703/885] 3593336=test_gem_unsatisfiable_dependency_error I, [2024-05-24T11:43:38.300708 #3552469] INFO -- : [704/885] 3593336=test_literal I, [2024-05-24T11:43:38.879649 #3552469] INFO -- : [705/885] 3593336=test_thread I, [2024-05-24T11:43:38.927067 #3552469] INFO -- : [706/885] 3593338=test_complex2 I, [2024-05-24T11:43:38.967390 #3552469] INFO -- : [707/885] 3593338=test_config I, [2024-05-24T11:43:38.994652 #3552469] INFO -- : [708/885] 3593338=test_gem_security_signer I, [2024-05-24T11:43:39.104242 #3552469] INFO -- : [709/885] 3593338=test_gem_util I, [2024-05-24T11:43:39.120103 #3552469] INFO -- : [710/885] 3593336=test_input_method I, [2024-05-24T11:43:39.169680 #3552469] INFO -- : [711/885] 3593336=test_io I, [2024-05-24T11:43:39.290413 #3552469] INFO -- : [712/885] 3593338=test_rdoc_i18n_text I, [2024-05-24T11:43:39.293154 #3552469] INFO -- : [713/885] 3593338=test_gem_doctor I, [2024-05-24T11:43:39.305601 #3552469] INFO -- : [714/885] 3593337=json_fixtures_test I, [2024-05-24T11:43:39.316154 #3552469] INFO -- : [715/885] 3593337=test_len I, [2024-05-24T11:43:39.326476 #3552469] INFO -- : [716/885] 3593337=test_rdoc_parser_c I, [2024-05-24T11:43:39.352906 #3552469] INFO -- : [717/885] 3593338=test_kwargs I, [2024-05-24T11:43:39.359224 #3552469] INFO -- : [718/885] 3593336=test_pack I, [2024-05-24T11:43:39.371796 #3552469] INFO -- : [719/885] 3593338=test_io_wait I, [2024-05-24T11:43:39.714042 #3552469] INFO -- : [720/885] 3593336=parse_test I, [2024-05-24T11:43:39.716835 #3552469] INFO -- : [721/885] 3593338=test_tsort I, [2024-05-24T11:43:39.727487 #3552469] INFO -- : [722/885] 3593338=test_typeddata I, [2024-05-24T11:43:39.853323 #3552469] INFO -- : [723/885] 3593337=test_gem_commands_fetch_command I, [2024-05-24T11:43:39.993738 #3552469] INFO -- : [724/885] 3593338=test_securerandom I, [2024-05-24T11:43:40.032723 #3552469] INFO -- : [725/885] 3593338=test_gem_commands_outdated_command I, [2024-05-24T11:43:40.061509 #3552469] INFO -- : [726/885] 3593337=test_gem_dependency_list I, [2024-05-24T11:43:40.085775 #3552469] INFO -- : [727/885] 3593338=test_rdoc_parser_changelog I, [2024-05-24T11:43:40.150686 #3552469] INFO -- : [728/885] 3593337=parameters_signature_test I, [2024-05-24T11:43:40.164260 #3552469] INFO -- : [729/885] 3593337=redundant_return_test I, [2024-05-24T11:43:40.176219 #3552469] INFO -- : [730/885] 3593337=test_rand I, [2024-05-24T11:43:40.180794 #3552469] INFO -- : [731/885] 3593338=test_string_processing I, [2024-05-24T11:43:40.193783 #3552469] INFO -- : [732/885] 3593338=test_random_formatter I, [2024-05-24T11:43:40.205079 #3552469] INFO -- : [733/885] 3593338=test_rdoc_markup_attributes I, [2024-05-24T11:43:40.205969 #3552469] INFO -- : [734/885] 3593338=test_rdoc_code_object I, [2024-05-24T11:43:40.579893 #3552469] INFO -- : [735/885] 3593338=test_process I, [2024-05-24T11:43:40.694544 #3552469] INFO -- : [736/885] 3593337=test_gem_source_specific_file I, [2024-05-24T11:43:40.805880 #3552469] INFO -- : [737/885] 3593337=test_euc_kr I, [2024-05-24T11:43:40.808240 #3552469] INFO -- : [738/885] 3593337=test_provider I, [2024-05-24T11:43:40.825371 #3552469] INFO -- : [739/885] 3593337=test_bmethod I, [2024-05-24T11:43:40.838460 #3552469] INFO -- : [740/885] 3593337=test_rdoc_encoding I, [2024-05-24T11:43:40.905593 #3552469] INFO -- : [741/885] 3593337=test_win32ole_variant_outarg I, [2024-05-24T11:43:40.910638 #3552469] INFO -- : [742/885] 3593337=test_key_actor_vi I, [2024-05-24T11:43:41.003078 #3552469] INFO -- : [743/885] 3593337=test_postponed_job I, [2024-05-24T11:43:41.339910 #3552469] INFO -- : [744/885] 3593337=test_gem_request_set_lockfile I, [2024-05-24T11:43:41.876385 #3552469] INFO -- : [745/885] 3593337=test_rdoc_markdown I, [2024-05-24T11:43:42.157516 #3552469] INFO -- : [746/885] 3593337=test_httpresponses I, [2024-05-24T11:43:42.181911 #3552469] INFO -- : [747/885] 3593337=test_rdoc_constant I, [2024-05-24T11:43:42.258785 #3552469] INFO -- : [748/885] 3593337=test_deprecate I, [2024-05-24T11:43:42.310890 #3552469] INFO -- : [749/885] 3593337=test_generic I, [2024-05-24T11:43:42.342041 #3552469] INFO -- : [750/885] 3593337=test_rdoc_markup_to_html_snippet I, [2024-05-24T11:43:42.416287 #3552469] INFO -- : [751/885] 3593337=test_common I, [2024-05-24T11:43:42.632541 #3552469] INFO -- : [752/885] 3593337=test_require I, [2024-05-24T11:43:42.645989 #3552469] INFO -- : [753/885] 3593337=test_stringify_symbols I, [2024-05-24T11:43:42.650541 #3552469] INFO -- : [754/885] 3593337=test_objspace I, [2024-05-24T11:43:42.963272 #3552469] INFO -- : [755/885] 3593336=test_rdoc_text I, [2024-05-24T11:43:43.016338 #3552469] INFO -- : [756/885] 3593336=library_symbols_test I, [2024-05-24T11:43:43.024432 #3552469] INFO -- : [757/885] 3593336=test_rdoc_markup_indented_paragraph I, [2024-05-24T11:43:43.035357 #3552469] INFO -- : [758/885] 3593336=test_iseq_load I, [2024-05-24T11:43:44.154672 #3552469] INFO -- : [759/885] 3593336=test_rdoc_markup_parser I, [2024-05-24T11:43:44.216757 #3552469] INFO -- : [760/885] 3593336=test_stream I, [2024-05-24T11:43:44.548017 #3552469] INFO -- : [761/885] 3593336=test_have_library I, [2024-05-24T11:43:45.127544 #3552469] INFO -- : [762/885] 3593336=test_ns_spki I, [2024-05-24T11:43:45.139097 #3552469] INFO -- : [763/885] 3593336=test_path_to_class I, [2024-05-24T11:43:45.149145 #3552469] INFO -- : [764/885] 3593336=test_enumerator I, [2024-05-24T11:43:45.153063 #3552469] INFO -- : [765/885] 3593336=test_reqarg I, [2024-05-24T11:43:45.506228 #3552469] INFO -- : [766/885] 3593336=test_frozen_error I, [2024-05-24T11:43:45.522495 #3552469] INFO -- : [767/885] 3593336=test_gem_version I, [2024-05-24T11:43:45.649170 #3552469] INFO -- : [768/885] 3593336=test_spell_checker I, [2024-05-24T11:43:45.678286 #3552469] INFO -- : [769/885] 3593336=test_gem_ext_ext_conf_builder I, [2024-05-24T11:43:46.820954 #3552469] INFO -- : [770/885] 3593336=test_resource I, [2024-05-24T11:43:46.851683 #3552469] INFO -- : [771/885] 3593336=test_gem_package_tar_reader_entry I, [2024-05-24T11:43:47.241080 #3552469] INFO -- : [772/885] 3593336=test_gem_uri I, [2024-05-24T11:43:47.276197 #3552469] INFO -- : [773/885] 3593336=test_bug-5832 I, [2024-05-24T11:43:47.285160 #3552469] INFO -- : [774/885] 3593336=test_yield_block I, [2024-05-24T11:43:47.299099 #3552469] INFO -- : [775/885] 3593336=test_c_struct_builder I, [2024-05-24T11:43:47.870350 #3552469] INFO -- : [776/885] 3593336=test_ubf_async_safe I, [2024-05-24T11:43:47.886800 #3552469] INFO -- : [777/885] 3593336=test_pstore I, [2024-05-24T11:43:48.107784 #3552469] INFO -- : [778/885] 3593336=test_win32ole_record I, [2024-05-24T11:43:48.126457 #3552469] INFO -- : [779/885] 3593336=test_rdoc_include I, [2024-05-24T11:43:48.160091 #3552469] INFO -- : [780/885] 3593336=test_gem_version_option I, [2024-05-24T11:43:48.207916 #3552469] INFO -- : [781/885] 3593336=test_date_compat I, [2024-05-24T11:43:48.237890 #3552469] INFO -- : [782/885] 3593336=test_gem_ext_cargo_builder I, [2024-05-24T11:43:48.268767 #3552469] INFO -- : [783/885] 3593336=test_proc I, [2024-05-24T11:43:49.101668 #3552469] INFO -- : [784/885] 3593336=test_console_attr I, [2024-05-24T11:43:49.155075 #3552469] INFO -- : [785/885] 3593336=test_gem_commands_unpack_command I, [2024-05-24T11:43:49.510100 #3552469] INFO -- : [786/885] 3593336=test_zlib I, [2024-05-24T11:43:58.337027 #3552469] INFO -- : [787/885] 3593338=test_rdoc_options I, [2024-05-24T11:43:58.600193 #3552469] INFO -- : [788/885] 3593338=test_rat I, [2024-05-24T11:43:58.612879 #3552469] INFO -- : [789/885] 3593338=test_gem_request_connection_pools I, [2024-05-24T11:43:59.671180 #3552469] INFO -- : [790/885] 3593338=test_init I, [2024-05-24T11:44:00.184476 #3552469] INFO -- : [791/885] 3593338=test_flags I, [2024-05-24T11:44:00.590047 #3552469] INFO -- : [792/885] 3593338=test_yamlstore I, [2024-05-24T11:44:00.610358 #3552469] INFO -- : [793/885] 3593338=test_bug-3571 I, [2024-05-24T11:44:00.619961 #3552469] INFO -- : [794/885] 3593338=test_numeric I, [2024-05-24T11:44:00.687760 #3552469] INFO -- : [795/885] 3593338=test_file I, [2024-05-24T11:44:00.704246 #3552469] INFO -- : [796/885] 3593338=test_time I, [2024-05-24T11:44:00.829787 #3552469] INFO -- : [797/885] 3593338=test_capacity I, [2024-05-24T11:44:00.848448 #3552469] INFO -- : [798/885] 3593338=test_gem_commands_owner_command I, [2024-05-24T11:44:01.560261 #3552469] INFO -- : [799/885] 3593338=test_nextafter I, [2024-05-24T11:44:01.648876 #3552469] INFO -- : [800/885] 3593338=test_encoding I, [2024-05-24T11:44:01.860207 #3552469] INFO -- : [801/885] 3593338=test_hmac I, [2024-05-24T11:44:01.868632 #3552469] INFO -- : [802/885] 3593338=test_rdoc_generator_markup I, [2024-05-24T11:44:01.877295 #3552469] INFO -- : [803/885] 3593338=test_constant I, [2024-05-24T11:44:03.784650 #3552469] INFO -- : [804/885] 3593338=test_find I, [2024-05-24T11:44:03.807234 #3552469] INFO -- : [805/885] 3593338=test_pipe I, [2024-05-24T11:44:03.925287 #3552469] INFO -- : [806/885] 3593338=test_macro I, [2024-05-24T11:44:03.956748 #3552469] INFO -- : [807/885] 3593338=test_string I, [2024-05-24T11:44:05.893806 #3552469] INFO -- : [808/885] 3593336=test_gem_resolver_activation_request I, [2024-05-24T11:44:05.917508 #3552469] INFO -- : [809/885] 3593336=test_function I, [2024-05-24T11:44:06.196907 #3552469] INFO -- : [810/885] 3593336=test_gem_commands_server_command I, [2024-05-24T11:44:06.203195 #3552469] INFO -- : [811/885] 3593336=test_win32ole_method_event I, [2024-05-24T11:44:06.214087 #3552469] INFO -- : [812/885] 3593336=test_tcp I, [2024-05-24T11:44:06.365887 #3552469] INFO -- : [813/885] 3593336=parse_comments_test I, [2024-05-24T11:44:06.379497 #3552469] INFO -- : [814/885] 3593336=test_gem_name_tuple I, [2024-05-24T11:44:06.402895 #3552469] INFO -- : [815/885] 3593336=test_rdoc_markup_to_table_of_contents I, [2024-05-24T11:44:06.499181 #3552469] INFO -- : [816/885] 3593336=test_integer I, [2024-05-24T11:44:06.514719 #3552469] INFO -- : [817/885] 3593336=test_gem_requirement I, [2024-05-24T11:44:06.788162 #3552469] INFO -- : [818/885] 3593336=test_tree_builder I, [2024-05-24T11:44:06.799429 #3552469] INFO -- : [819/885] 3593336=test_big5 I, [2024-05-24T11:44:06.810727 #3552469] INFO -- : [820/885] 3593336=test_date I, [2024-05-24T11:44:06.850558 #3552469] INFO -- : [821/885] 3593336=test_gem_commands_update_command I, [2024-05-24T11:44:08.606222 #3552469] INFO -- : [822/885] 3593336=test_protect I, [2024-05-24T11:44:08.625973 #3552469] INFO -- : [823/885] 3593336=test_pathname I, [2024-05-24T11:44:08.871916 #3552469] INFO -- : [824/885] 3593336=test_fnmatch I, [2024-05-24T11:44:08.925486 #3552469] INFO -- : [825/885] 3593336=test_store I, [2024-05-24T11:44:09.279376 #3552469] INFO -- : [826/885] 3593336=test_rdoc_markup_pre_process I, [2024-05-24T11:44:09.593093 #3552469] INFO -- : [827/885] 3593336=test_coverage I, [2024-05-24T11:44:10.229225 #3552469] INFO -- : [828/885] 3593336=test_tempfile I, [2024-05-24T11:44:10.524401 #3552469] INFO -- : [829/885] 3593336=test_http_request I, [2024-05-24T11:44:10.534840 #3552469] INFO -- : [830/885] 3593336=test_erb_m17n I, [2024-05-24T11:44:10.545490 #3552469] INFO -- : [831/885] 3593336=test_rdoc_generator_pot_po_entry I, [2024-05-24T11:44:10.561343 #3552469] INFO -- : [832/885] 3593336=test_timeout I, [2024-05-24T11:44:10.577512 #3552469] INFO -- : [833/885] 3593336=test_rdoc_markup_verbatim I, [2024-05-24T11:44:10.595235 #3552469] INFO -- : [834/885] 3593336=test_webauthn_poller I, [2024-05-24T11:44:10.748810 #3552469] INFO -- : [835/885] 3593336=test_date_conv I, [2024-05-24T11:44:10.761848 #3552469] INFO -- : [836/885] 3593336=test_frozen I, [2024-05-24T11:44:10.772164 #3552469] INFO -- : [837/885] 3593336=test_serialize_subclasses I, [2024-05-24T11:44:10.901297 #3552469] INFO -- : [838/885] 3593336=test_gem_resolver_index_specification I, [2024-05-24T11:44:11.001447 #3552469] INFO -- : [839/885] 3593336=test_egrep_cpp I, [2024-05-24T11:44:11.056251 #3552469] INFO -- : [840/885] 3593336=test_files_lib I, [2024-05-24T11:44:11.215749 #3552469] INFO -- : [841/885] 3593336=test_string_memory I, [2024-05-24T11:44:11.523064 #3552469] INFO -- : [842/885] 3593336=test_help I, [2024-05-24T11:44:11.531988 #3552469] INFO -- : [843/885] 3593336=test_enumerator_kw I, [2024-05-24T11:44:11.541522 #3552469] INFO -- : [844/885] 3593336=test_marshalable I, [2024-05-24T11:44:11.552679 #3552469] INFO -- : [845/885] 3593336=test_line_editor I, [2024-05-24T11:44:11.569143 #3552469] INFO -- : [846/885] 3593336=reflection_test I, [2024-05-24T11:44:11.580575 #3552469] INFO -- : [847/885] 3593336=test_string I, [2024-05-24T11:44:11.604696 #3552469] INFO -- : [848/885] 3593336=json_common_interface_test I, [2024-05-24T11:44:11.638126 #3552469] INFO -- : [849/885] 3593336=test_error_highlight I, [2024-05-24T11:44:12.443968 #3552469] INFO -- : [850/885] 3593336=test_rdoc_any_method I, [2024-05-24T11:44:12.853038 #3552469] INFO -- : [851/885] 3593336=test_function_entry I, [2024-05-24T11:44:12.854865 #3552469] INFO -- : [852/885] 3593336=test_raise I, [2024-05-24T11:44:12.864856 #3552469] INFO -- : [853/885] 3593336=test_complexrational I, [2024-05-24T11:44:12.873236 #3552469] INFO -- : [854/885] 3593336=version_test I, [2024-05-24T11:44:12.881858 #3552469] INFO -- : [855/885] 3593336=test_import I, [2024-05-24T11:44:18.084632 #3552469] INFO -- : [856/885] 3593336=test_human_typo I, [2024-05-24T11:44:18.094509 #3552469] INFO -- : [857/885] 3593336=test_wait I, [2024-05-24T11:44:18.156404 #3552469] INFO -- : [858/885] 3593336=test_nil I, [2024-05-24T11:44:18.171205 #3552469] INFO -- : [859/885] 3593336=test_psych I, [2024-05-24T11:44:18.201831 #3552469] INFO -- : [860/885] 3593336=test_yaml_tree I, [2024-05-24T11:44:18.233966 #3552469] INFO -- : [861/885] 3593336=test_gem_commands_yank_command I, [2024-05-24T11:44:19.585800 #3552469] INFO -- : [862/885] 3593336=test_cstr I, [2024-05-24T11:44:22.669706 #3552469] INFO -- : [863/885] 3593336=test_command I, [2024-05-24T11:44:23.051273 #3552469] INFO -- : [864/885] 3593336=test_euc_tw I, [2024-05-24T11:44:23.068347 #3552469] INFO -- : [865/885] 3593336=test_gem_resolver_dependency_request I, [2024-05-24T11:44:23.110639 #3552469] INFO -- : [866/885] 3593336=test_big2str I, [2024-05-24T11:44:23.135219 #3552469] INFO -- : [867/885] 3593336=test_gem_resolver_specification I, [2024-05-24T11:44:23.156681 #3552469] INFO -- : [868/885] 3593336=test_pkey_dsa I, [2024-05-24T11:44:27.978932 #3552469] INFO -- : [869/885] 3593336=test_logger I, [2024-05-24T11:44:28.007081 #3552469] INFO -- : [870/885] 3593336=json_string_matching_test I, [2024-05-24T11:44:28.022804 #3552469] INFO -- : [871/885] 3593336=test_gem_config_file I, [2024-05-24T11:44:28.233939 #3552469] INFO -- : [872/885] 3593336=test_comparable I, [2024-05-24T11:44:28.250583 #3552469] INFO -- : [873/885] 3593336=test_rdoc_rdoc I, [2024-05-24T11:44:28.336797 #3552469] INFO -- : [874/885] 3593336=test_yjit_exit_locations I, [2024-05-24T11:44:28.356114 #3552469] INFO -- : [875/885] 3593336=test_rdoc_markdown_test I, [2024-05-24T11:44:29.670971 #3552469] INFO -- : [876/885] 3593336=test_io_timeout I, [2024-05-24T11:44:29.690615 #3552469] INFO -- : [877/885] 3593336=test_rdoc_normal_module I, [2024-05-24T11:44:29.724042 #3552469] INFO -- : [878/885] 3593336=test_type_completor I, [2024-05-24T11:44:29.736089 #3552469] INFO -- : [879/885] 3593336=test_io_buffer I, [2024-05-24T11:44:29.849431 #3552469] INFO -- : [880/885] 3593336=test_kdf I, [2024-05-24T11:44:29.921341 #3552469] INFO -- : [881/885] 3593336=test_ldap I, [2024-05-24T11:44:29.947023 #3552469] INFO -- : [882/885] 3593336=test_thread_queue I, [2024-05-24T11:44:36.963970 #3552469] INFO -- : [883/885] 3593336=test_defined I, [2024-05-24T11:44:37.050015 #3552469] INFO -- : [884/885] 3593336=test_passing_block I, [2024-05-24T11:44:37.062544 #3552469] INFO -- : [885/885] 3593336=test_nowrite I, [2024-05-24T11:44:38.850639 #3552469] INFO -- : Finished tests in 217.107899s, 121.0366 tests/s, 43074.6880 assertions/s. I, [2024-05-24T11:44:38.855350 #3552469] INFO -- : 26278 tests, 9351855 assertions, 0 failures, 0 errors, 320 skips I, [2024-05-24T11:44:38.855378 #3552469] INFO -- : I, [2024-05-24T11:44:38.855389 #3552469] INFO -- : ruby -v: ruby 3.4.0dev (2024-05-24T08:00:15Z master e49d68bf27) [aarch64-linux] I, [2024-05-24T11:44:38.856348 #3552469] INFO -- : $$$[end] "make yes-test-all TESTOPTS='--stderr-on-failure' TESTS='-j3'" exit with 0. I, [2024-05-24T11:44:38.856550 #3552469] INFO -- : $$$[beg] make yes-test-rubyspec MSPECOPT='--error-output stderr --debug -j' TESTS='-j3' I, [2024-05-24T11:44:38.982650 #3552469] INFO -- : BASERUBY = /usr/local/bin/ruby --disable=gems I, [2024-05-24T11:44:38.982727 #3552469] INFO -- : CC = gcc I, [2024-05-24T11:44:38.982738 #3552469] INFO -- : LD = ld I, [2024-05-24T11:44:38.982747 #3552469] INFO -- : LDSHARED = gcc -shared I, [2024-05-24T11:44:38.982760 #3552469] INFO -- : CFLAGS = -O3 -fno-fast-math -ggdb3 -Wall -Wextra -Wdeprecated-declarations -Wdiv-by-zero -Wduplicated-cond -Wimplicit-function-declaration -Wimplicit-int -Wpointer-arith -Wwrite-strings -Wold-style-definition -Wimplicit-fallthrough=0 -Wmissing-noreturn -Wno-cast-function-type -Wno-constant-logical-operand -Wno-long-long -Wno-missing-field-initializers -Wno-overlength-strings -Wno-packed-bitfield-compat -Wno-parentheses-equality -Wno-self-assign -Wno-tautological-compare -Wno-unused-parameter -Wno-unused-value -Wsuggest-attribute=format -Wsuggest-attribute=noreturn -Wunused-variable -Wmisleading-indentation -Wundef I, [2024-05-24T11:44:38.982770 #3552469] INFO -- : XCFLAGS = -U_FORTIFY_SOURCE -D_FORTIFY_SOURCE=2 -fstack-protector-strong -msign-return-address=all -fno-strict-overflow -fvisibility=hidden -fexcess-precision=standard -DRUBY_EXPORT -fPIE -I. -I.ext/include/aarch64-linux -I/home/opc/ruby/src/master/include -I/home/opc/ruby/src/master -I/home/opc/ruby/src/master/prism -I/home/opc/ruby/src/master/enc/unicode/15.0.0 I, [2024-05-24T11:44:38.982779 #3552469] INFO -- : CPPFLAGS = I, [2024-05-24T11:44:38.982787 #3552469] INFO -- : DLDFLAGS = -Wl,--compress-debug-sections=zlib -fstack-protector-strong -pie I, [2024-05-24T11:44:38.982797 #3552469] INFO -- : SOLIBS = -lz -lrt -lrt -ldl -lcrypt -lm -lpthread I, [2024-05-24T11:44:38.982806 #3552469] INFO -- : LANG = en_US.UTF-8 I, [2024-05-24T11:44:38.982814 #3552469] INFO -- : LC_ALL = I, [2024-05-24T11:44:38.982822 #3552469] INFO -- : LC_CTYPE = I, [2024-05-24T11:44:38.982830 #3552469] INFO -- : MFLAGS = I, [2024-05-24T11:44:38.982838 #3552469] INFO -- : RUSTC = rustc I, [2024-05-24T11:44:38.982847 #3552469] INFO -- : YJIT_RUSTC_ARGS = --crate-name=yjit --crate-type=staticlib --edition=2021 -g -C lto=thin -C opt-level=3 -C overflow-checks=on '--out-dir=/home/opc/ruby/build/master/yjit/target/release/' /home/opc/ruby/src/master/yjit/src/lib.rs I, [2024-05-24T11:44:38.983476 #3552469] INFO -- : gcc (GCC) 8.5.0 20210514 (Red Hat 8.5.0-10.1.0.1) I, [2024-05-24T11:44:38.983493 #3552469] INFO -- : Copyright (C) 2018 Free Software Foundation, Inc. I, [2024-05-24T11:44:38.983502 #3552469] INFO -- : This is free software; see the source for copying conditions. There is NO I, [2024-05-24T11:44:38.983511 #3552469] INFO -- : warranty; not even for MERCHANTABILITY or FITNESS FOR A PARTICULAR PURPOSE. I, [2024-05-24T11:44:38.983520 #3552469] INFO -- : I, [2024-05-24T11:44:38.985463 #3552469] INFO -- : generating enc.mk I, [2024-05-24T11:44:39.222069 #3552469] INFO -- : generating encdb.h I, [2024-05-24T11:44:39.259442 #3552469] INFO -- : encdb.h unchanged I, [2024-05-24T11:44:39.260690 #3552469] INFO -- : making enc I, [2024-05-24T11:44:39.287945 #3552469] INFO -- : make[1]: Entering directory '/home/opc/ruby/build/master' I, [2024-05-24T11:44:39.288003 #3552469] INFO -- : make[1]: Nothing to be done for 'enc'. I, [2024-05-24T11:44:39.288015 #3552469] INFO -- : make[1]: Leaving directory '/home/opc/ruby/build/master' I, [2024-05-24T11:44:39.288785 #3552469] INFO -- : making srcs under enc I, [2024-05-24T11:44:39.330681 #3552469] INFO -- : make[1]: Entering directory '/home/opc/ruby/build/master' I, [2024-05-24T11:44:39.330746 #3552469] INFO -- : make[1]: Nothing to be done for 'srcs'. I, [2024-05-24T11:44:39.330757 #3552469] INFO -- : make[1]: Leaving directory '/home/opc/ruby/build/master' I, [2024-05-24T11:44:39.331867 #3552469] INFO -- : generating transdb.h I, [2024-05-24T11:44:39.480667 #3552469] INFO -- : transdb.h unchanged I, [2024-05-24T11:44:39.482022 #3552469] INFO -- : making trans I, [2024-05-24T11:44:39.531087 #3552469] INFO -- : make[1]: Entering directory '/home/opc/ruby/build/master' I, [2024-05-24T11:44:39.531160 #3552469] INFO -- : make[1]: Nothing to be done for 'trans'. I, [2024-05-24T11:44:39.531174 #3552469] INFO -- : make[1]: Leaving directory '/home/opc/ruby/build/master' I, [2024-05-24T11:44:39.531954 #3552469] INFO -- : making encs I, [2024-05-24T11:44:39.584431 #3552469] INFO -- : make[1]: Entering directory '/home/opc/ruby/build/master' I, [2024-05-24T11:44:39.584531 #3552469] INFO -- : make[1]: Nothing to be done for 'encs'. I, [2024-05-24T11:44:39.584549 #3552469] INFO -- : make[1]: Leaving directory '/home/opc/ruby/build/master' I, [2024-05-24T11:44:39.586548 #3552469] INFO -- : generating makefiles ext/configure-ext.mk I, [2024-05-24T11:44:39.627181 #3552469] INFO -- : ext/configure-ext.mk updated I, [2024-05-24T11:44:39.630575 #3552469] INFO -- : make[1]: Entering directory '/home/opc/ruby/build/master' I, [2024-05-24T11:44:41.804521 #3552469] INFO -- : make[1]: Leaving directory '/home/opc/ruby/build/master' I, [2024-05-24T11:44:41.805173 #3552469] INFO -- : generating makefile exts.mk I, [2024-05-24T11:44:41.864427 #3552469] INFO -- : exts.mk unchanged I, [2024-05-24T11:44:41.869314 #3552469] INFO -- : make[1]: Entering directory '/home/opc/ruby/build/master' I, [2024-05-24T11:44:42.171268 #3552469] INFO -- : make[2]: Entering directory '/home/opc/ruby/build/master/ext/coverage' I, [2024-05-24T11:44:42.175874 #3552469] INFO -- : make[2]: Leaving directory '/home/opc/ruby/build/master/ext/coverage' I, [2024-05-24T11:44:42.181456 #3552469] INFO -- : make[2]: Entering directory '/home/opc/ruby/build/master/ext/date' I, [2024-05-24T11:44:42.187009 #3552469] INFO -- : make[2]: Leaving directory '/home/opc/ruby/build/master/ext/date' I, [2024-05-24T11:44:42.190490 #3552469] INFO -- : make[2]: Entering directory '/home/opc/ruby/build/master/ext/digest' I, [2024-05-24T11:44:42.199515 #3552469] INFO -- : make[2]: Leaving directory '/home/opc/ruby/build/master/ext/digest' I, [2024-05-24T11:44:42.222133 #3552469] INFO -- : make[2]: Entering directory '/home/opc/ruby/build/master/ext/digest/sha2' I, [2024-05-24T11:44:42.227106 #3552469] INFO -- : make[2]: Leaving directory '/home/opc/ruby/build/master/ext/digest/sha2' I, [2024-05-24T11:44:42.245512 #3552469] INFO -- : make[2]: Entering directory '/home/opc/ruby/build/master/ext/fiddle' I, [2024-05-24T11:44:42.255788 #3552469] INFO -- : make[2]: Leaving directory '/home/opc/ruby/build/master/ext/fiddle' I, [2024-05-24T11:44:42.260294 #3552469] INFO -- : make[2]: Entering directory '/home/opc/ruby/build/master/ext/io/console' I, [2024-05-24T11:44:42.264763 #3552469] INFO -- : make[2]: Leaving directory '/home/opc/ruby/build/master/ext/io/console' I, [2024-05-24T11:44:42.275807 #3552469] INFO -- : make[2]: Entering directory '/home/opc/ruby/build/master/ext/json' I, [2024-05-24T11:44:42.285283 #3552469] INFO -- : make[2]: Leaving directory '/home/opc/ruby/build/master/ext/json' I, [2024-05-24T11:44:42.298777 #3552469] INFO -- : make[2]: Entering directory '/home/opc/ruby/build/master/ext/monitor' I, [2024-05-24T11:44:42.302990 #3552469] INFO -- : make[2]: Leaving directory '/home/opc/ruby/build/master/ext/monitor' I, [2024-05-24T11:44:42.309045 #3552469] INFO -- : make[2]: Entering directory '/home/opc/ruby/build/master/ext/objspace' I, [2024-05-24T11:44:42.315190 #3552469] INFO -- : make[2]: Leaving directory '/home/opc/ruby/build/master/ext/objspace' I, [2024-05-24T11:44:42.334132 #3552469] INFO -- : make[2]: Entering directory '/home/opc/ruby/build/master/ext/openssl' I, [2024-05-24T11:44:42.355879 #3552469] INFO -- : make[2]: Leaving directory '/home/opc/ruby/build/master/ext/openssl' I, [2024-05-24T11:44:42.360185 #3552469] INFO -- : make[2]: Entering directory '/home/opc/ruby/build/master/ext/pathname' I, [2024-05-24T11:44:42.364577 #3552469] INFO -- : make[2]: Leaving directory '/home/opc/ruby/build/master/ext/pathname' I, [2024-05-24T11:44:42.370880 #3552469] INFO -- : make[2]: Entering directory '/home/opc/ruby/build/master/ext/psych' I, [2024-05-24T11:44:42.392723 #3552469] INFO -- : make[2]: Leaving directory '/home/opc/ruby/build/master/ext/psych' I, [2024-05-24T11:44:42.397229 #3552469] INFO -- : make[2]: Entering directory '/home/opc/ruby/build/master/ext/pty' I, [2024-05-24T11:44:42.401642 #3552469] INFO -- : make[2]: Leaving directory '/home/opc/ruby/build/master/ext/pty' I, [2024-05-24T11:44:42.415012 #3552469] INFO -- : make[2]: Entering directory '/home/opc/ruby/build/master/ext/ripper' I, [2024-05-24T11:44:42.422844 #3552469] INFO -- : make[2]: Leaving directory '/home/opc/ruby/build/master/ext/ripper' I, [2024-05-24T11:44:42.424845 #3552469] INFO -- : make[2]: Entering directory '/home/opc/ruby/build/master/ext/rubyvm' I, [2024-05-24T11:44:42.428294 #3552469] INFO -- : make[2]: Leaving directory '/home/opc/ruby/build/master/ext/rubyvm' I, [2024-05-24T11:44:42.440364 #3552469] INFO -- : make[2]: Entering directory '/home/opc/ruby/build/master/ext/socket' I, [2024-05-24T11:44:42.451588 #3552469] INFO -- : make[2]: Leaving directory '/home/opc/ruby/build/master/ext/socket' I, [2024-05-24T11:44:42.467258 #3552469] INFO -- : make[2]: Entering directory '/home/opc/ruby/build/master/.bundle/gems/bigdecimal-3.1.7/ext/bigdecimal' I, [2024-05-24T11:44:42.498063 #3552469] INFO -- : make[2]: Leaving directory '/home/opc/ruby/build/master/.bundle/gems/bigdecimal-3.1.7/ext/bigdecimal' I, [2024-05-24T11:44:42.501587 #3552469] INFO -- : make[2]: Entering directory '/home/opc/ruby/build/master/.bundle/gems/bigdecimal-3.1.8/ext/bigdecimal' I, [2024-05-24T11:44:42.533043 #3552469] INFO -- : make[2]: Leaving directory '/home/opc/ruby/build/master/.bundle/gems/bigdecimal-3.1.8/ext/bigdecimal' I, [2024-05-24T11:44:42.535602 #3552469] INFO -- : make[2]: Entering directory '/home/opc/ruby/build/master/.bundle/gems/debug-1.9.2/ext/debug' I, [2024-05-24T11:44:42.567595 #3552469] INFO -- : make[2]: Leaving directory '/home/opc/ruby/build/master/.bundle/gems/debug-1.9.2/ext/debug' I, [2024-05-24T11:44:42.570327 #3552469] INFO -- : make[2]: Entering directory '/home/opc/ruby/build/master/.bundle/gems/nkf-0.2.0/ext/nkf' I, [2024-05-24T11:44:42.601827 #3552469] INFO -- : make[2]: Leaving directory '/home/opc/ruby/build/master/.bundle/gems/nkf-0.2.0/ext/nkf' I, [2024-05-24T11:44:42.604624 #3552469] INFO -- : make[2]: Entering directory '/home/opc/ruby/build/master/.bundle/gems/racc-1.7.3/ext/racc/cparse' I, [2024-05-24T11:44:42.635634 #3552469] INFO -- : make[2]: Leaving directory '/home/opc/ruby/build/master/.bundle/gems/racc-1.7.3/ext/racc/cparse' I, [2024-05-24T11:44:42.638277 #3552469] INFO -- : make[2]: Entering directory '/home/opc/ruby/build/master/.bundle/gems/racc-1.8.0/ext/racc/cparse' I, [2024-05-24T11:44:42.668314 #3552469] INFO -- : make[2]: Leaving directory '/home/opc/ruby/build/master/.bundle/gems/racc-1.8.0/ext/racc/cparse' I, [2024-05-24T11:44:42.671358 #3552469] INFO -- : make[2]: Entering directory '/home/opc/ruby/build/master/.bundle/gems/rbs-3.4.4/ext/rbs_extension' I, [2024-05-24T11:44:42.701928 #3552469] INFO -- : make[2]: Leaving directory '/home/opc/ruby/build/master/.bundle/gems/rbs-3.4.4/ext/rbs_extension' I, [2024-05-24T11:44:42.704483 #3552469] INFO -- : make[2]: Entering directory '/home/opc/ruby/build/master/.bundle/gems/syslog-0.1.2/ext/syslog' I, [2024-05-24T11:44:42.735559 #3552469] INFO -- : make[2]: Leaving directory '/home/opc/ruby/build/master/.bundle/gems/syslog-0.1.2/ext/syslog' I, [2024-05-24T11:44:42.773675 #3552469] INFO -- : make[2]: Entering directory '/home/opc/ruby/build/master' I, [2024-05-24T11:44:42.857782 #3552469] INFO -- : make[2]: 'ruby' is up to date. I, [2024-05-24T11:44:42.857859 #3552469] INFO -- : make[2]: Leaving directory '/home/opc/ruby/build/master' I, [2024-05-24T11:44:42.857981 #3552469] INFO -- : make[1]: Leaving directory '/home/opc/ruby/build/master' I, [2024-05-24T11:44:42.862426 #3552469] INFO -- : make[1]: Entering directory '/home/opc/ruby/build/master' I, [2024-05-24T11:44:42.862452 #3552469] INFO -- : make[1]: Nothing to be done for 'note'. I, [2024-05-24T11:44:42.862463 #3552469] INFO -- : make[1]: Leaving directory '/home/opc/ruby/build/master' E, [2024-05-24T11:44:42.938713 #3552469] ERROR -- : $ /home/opc/ruby/build/master/miniruby -I/home/opc/ruby/src/master/lib /home/opc/ruby/src/master/tool/runruby.rb --archdir=/home/opc/ruby/build/master --extout=.ext -- /home/opc/ruby/src/master/spec/mspec/bin/mspec-run -B /home/opc/ruby/src/master/spec/default.mspec --error-output stderr --debug -fy -o /tmp/rubytest.80sdou/1-mspec-multi-0 E, [2024-05-24T11:44:42.939079 #3552469] ERROR -- : $ /home/opc/ruby/build/master/miniruby -I/home/opc/ruby/src/master/lib /home/opc/ruby/src/master/tool/runruby.rb --archdir=/home/opc/ruby/build/master --extout=.ext -- /home/opc/ruby/src/master/spec/mspec/bin/mspec-run -B /home/opc/ruby/src/master/spec/default.mspec --error-output stderr --debug -fy -o /tmp/rubytest.80sdou/2-mspec-multi-1 E, [2024-05-24T11:44:42.939377 #3552469] ERROR -- : $ /home/opc/ruby/build/master/miniruby -I/home/opc/ruby/src/master/lib /home/opc/ruby/src/master/tool/runruby.rb --archdir=/home/opc/ruby/build/master --extout=.ext -- /home/opc/ruby/src/master/spec/mspec/bin/mspec-run -B /home/opc/ruby/src/master/spec/default.mspec --error-output stderr --debug -fy -o /tmp/rubytest.80sdou/3-mspec-multi-2 I, [2024-05-24T11:44:43.076576 #3552469] INFO -- : ruby 3.4.0dev (2024-05-24T08:00:15Z master e49d68bf27) [aarch64-linux] I, [2024-05-24T11:44:48.772063 #3552469] INFO -- : 0 ......................................................................... I, [2024-05-24T11:44:51.163195 #3552469] INFO -- : 73 ......................................................................... I, [2024-05-24T11:44:51.355405 #3552469] INFO -- : 146 ......................................................................... I, [2024-05-24T11:44:51.657021 #3552469] INFO -- : 219 ......................................................................... I, [2024-05-24T11:44:51.815106 #3552469] INFO -- : 292 ......................................................................... I, [2024-05-24T11:44:52.067113 #3552469] INFO -- : 365 ......................................................................... I, [2024-05-24T11:44:52.196908 #3552469] INFO -- : 438 ......................................................................... I, [2024-05-24T11:44:52.256957 #3552469] INFO -- : 511 ......................................................................... I, [2024-05-24T11:44:52.317734 #3552469] INFO -- : 584 ......................................................................... I, [2024-05-24T11:44:52.948640 #3552469] INFO -- : 657 ......................................................................... I, [2024-05-24T11:44:53.055891 #3552469] INFO -- : 730 ......................................................................... I, [2024-05-24T11:44:53.111721 #3552469] INFO -- : 803 ......................................................................... I, [2024-05-24T11:44:53.326983 #3552469] INFO -- : 876 ......................................................................... I, [2024-05-24T11:44:53.434358 #3552469] INFO -- : 949 ......................................................................... I, [2024-05-24T11:44:54.062795 #3552469] INFO -- : 1022 ......................................................................... I, [2024-05-24T11:44:56.430878 #3552469] INFO -- : 1095 ......................................................................... I, [2024-05-24T11:44:57.313422 #3552469] INFO -- : 1168 ......................................................................... I, [2024-05-24T11:44:57.457339 #3552469] INFO -- : 1241 ......................................................................... I, [2024-05-24T11:44:57.686687 #3552469] INFO -- : 1314 ......................................................................... I, [2024-05-24T11:44:57.783147 #3552469] INFO -- : 1387 ......................................................................... I, [2024-05-24T11:44:59.819554 #3552469] INFO -- : 1460 ......................................................................... I, [2024-05-24T11:45:03.659184 #3552469] INFO -- : 1533 ......................................................................... I, [2024-05-24T11:45:03.794792 #3552469] INFO -- : 1606 ......................................................................... I, [2024-05-24T11:45:04.612391 #3552469] INFO -- : 1679 ......................................................................... I, [2024-05-24T11:45:04.884616 #3552469] INFO -- : 1752 ......................................................................... I, [2024-05-24T11:45:05.154510 #3552469] INFO -- : 1825 ......................................................................... I, [2024-05-24T11:45:05.492834 #3552469] INFO -- : 1898 ......................................................................... I, [2024-05-24T11:45:05.899392 #3552469] INFO -- : 1971 ......................................................................... I, [2024-05-24T11:45:06.421095 #3552469] INFO -- : 2044 ......................................................................... I, [2024-05-24T11:45:06.529641 #3552469] INFO -- : 2117 ......................................................................... I, [2024-05-24T11:45:06.588909 #3552469] INFO -- : 2190 ......................................................................... I, [2024-05-24T11:45:06.643143 #3552469] INFO -- : 2263 ......................................................................... I, [2024-05-24T11:45:06.692954 #3552469] INFO -- : 2336 ......................................................................... I, [2024-05-24T11:45:06.779842 #3552469] INFO -- : 2409 ......................................................................... I, [2024-05-24T11:45:07.057313 #3552469] INFO -- : 2482 ......................................................................... I, [2024-05-24T11:45:07.203403 #3552469] INFO -- : 2555 ......................................................................... I, [2024-05-24T11:45:08.352407 #3552469] INFO -- : 2628 ......................................................................... I, [2024-05-24T11:45:08.611085 #3552469] INFO -- : 2701 ......................................................................... I, [2024-05-24T11:45:08.745666 #3552469] INFO -- : 2774 ......................................................................... I, [2024-05-24T11:45:09.077242 #3552469] INFO -- : 2847 ......................................................................... I, [2024-05-24T11:45:09.355267 #3552469] INFO -- : 2920 ......................................................................... I, [2024-05-24T11:45:09.482308 #3552469] INFO -- : 2993 ......................................................................... I, [2024-05-24T11:45:09.553750 #3552469] INFO -- : 3066 ......................................................................... I, [2024-05-24T11:45:09.598126 #3552469] INFO -- : 3139 ......................................................................... I, [2024-05-24T11:45:09.668144 #3552469] INFO -- : 3212 ......................................................................... I, [2024-05-24T11:45:09.742893 #3552469] INFO -- : 3285 ......................................................................... I, [2024-05-24T11:45:13.557790 #3552469] INFO -- : 3358 ......................................................................... I, [2024-05-24T11:45:13.578330 #3552469] INFO -- : I, [2024-05-24T11:45:13.578399 #3552469] INFO -- : I, [2024-05-24T11:45:13.578410 #3552469] INFO -- : Finished in 30.639609 seconds I, [2024-05-24T11:45:13.578419 #3552469] INFO -- : I, [2024-05-24T11:45:13.578427 #3552469] INFO -- : 3430 files, 32648 examples, 194232 expectations, 0 failures, 0 errors, 0 tagged I, [2024-05-24T11:45:13.579657 #3552469] INFO -- : $$$[end] "make yes-test-rubyspec MSPECOPT='--error-output stderr --debug -j' TESTS='-j3'" exit with 0.