# Logfile created on 2024-05-22 18:00:41 +0000 by logger.rb/v1.5.3 I, [2024-05-22T18:00:41.118038 #3183896] INFO -- : #, @formatter=nil, @logdev=#, @binmode=false, @mon_data=#, @mon_data_owner_object_id=860>>> I, [2024-05-22T18:00:41.118391 #3183896] INFO -- : $$$[beg] make update-unicode -j3 I, [2024-05-22T18:00:41.210364 #3183896] INFO -- : Downloading Unicode emoji 15.0 files... I, [2024-05-22T18:00:41.210526 #3183896] INFO -- : Downloading Unicode emoji 15.0 files... I, [2024-05-22T18:00:41.210915 #3183896] INFO -- : Downloading Unicode emoji 15.0 files... I, [2024-05-22T18:00:41.292065 #3183896] INFO -- : made symlink emoji/15.0/emoji-sequences.txt to /home/opc/ruby/src/master/.downloaded-cache/emoji/15.0/emoji-sequences.txt I, [2024-05-22T18:00:41.294048 #3183896] INFO -- : downloading emoji/15.0/emoji-sequences.txt ... downloading emoji/15.0/emoji-test.txt ... /home/opc/ruby/src/master/enc/unicode/data/emoji/15.0/emoji-sequences.txt already exists E, [2024-05-22T18:00:41.742466 #3183896] ERROR -- : /home/opc/ruby/src/master/tool/downloader.rb:302:in `rescue in download': failed to download emoji/15.0/emoji-test.txt (RuntimeError) E, [2024-05-22T18:00:41.742537 #3183896] ERROR -- : OpenURI::HTTPError: 403 Forbidden: https://www.unicode.org/Public/emoji/15.0/emoji-test.txt E, [2024-05-22T18:00:41.742548 #3183896] ERROR -- : from /home/opc/ruby/src/master/tool/downloader.rb:201:in `download' E, [2024-05-22T18:00:41.742559 #3183896] ERROR -- : from /home/opc/ruby/src/master/tool/downloader.rb:136:in `download' E, [2024-05-22T18:00:41.742568 #3183896] ERROR -- : from /home/opc/ruby/src/master/tool/downloader.rb:482:in `block in
' E, [2024-05-22T18:00:41.742577 #3183896] ERROR -- : from /home/opc/ruby/src/master/tool/downloader.rb:465:in `each' E, [2024-05-22T18:00:41.742586 #3183896] ERROR -- : from /home/opc/ruby/src/master/tool/downloader.rb:465:in `
' E, [2024-05-22T18:00:41.742594 #3183896] ERROR -- : /usr/local/lib/ruby/3.2.0/open-uri.rb:369:in `open_http': 403 Forbidden (OpenURI::HTTPError) E, [2024-05-22T18:00:41.742603 #3183896] ERROR -- : from /usr/local/lib/ruby/3.2.0/open-uri.rb:760:in `buffer_open' E, [2024-05-22T18:00:41.742612 #3183896] ERROR -- : from /usr/local/lib/ruby/3.2.0/open-uri.rb:214:in `block in open_loop' E, [2024-05-22T18:00:41.742621 #3183896] ERROR -- : from /usr/local/lib/ruby/3.2.0/open-uri.rb:212:in `catch' E, [2024-05-22T18:00:41.742629 #3183896] ERROR -- : from /usr/local/lib/ruby/3.2.0/open-uri.rb:212:in `open_loop' E, [2024-05-22T18:00:41.742638 #3183896] ERROR -- : from /usr/local/lib/ruby/3.2.0/open-uri.rb:153:in `open_uri' E, [2024-05-22T18:00:41.742646 #3183896] ERROR -- : from /usr/local/lib/ruby/3.2.0/open-uri.rb:740:in `open' E, [2024-05-22T18:00:41.742655 #3183896] ERROR -- : from /usr/local/lib/ruby/3.2.0/open-uri.rb:748:in `read' E, [2024-05-22T18:00:41.742666 #3183896] ERROR -- : from /home/opc/ruby/src/master/tool/downloader.rb:247:in `block in download' E, [2024-05-22T18:00:41.742675 #3183896] ERROR -- : from /home/opc/ruby/src/master/tool/downloader.rb:378:in `with_retry' E, [2024-05-22T18:00:41.742684 #3183896] ERROR -- : from /home/opc/ruby/src/master/tool/downloader.rb:246:in `download' E, [2024-05-22T18:00:41.742692 #3183896] ERROR -- : from /home/opc/ruby/src/master/tool/downloader.rb:136:in `download' E, [2024-05-22T18:00:41.742701 #3183896] ERROR -- : from /home/opc/ruby/src/master/tool/downloader.rb:482:in `block in
' E, [2024-05-22T18:00:41.742709 #3183896] ERROR -- : from /home/opc/ruby/src/master/tool/downloader.rb:465:in `each' E, [2024-05-22T18:00:41.742718 #3183896] ERROR -- : from /home/opc/ruby/src/master/tool/downloader.rb:465:in `
' E, [2024-05-22T18:00:41.745464 #3183896] ERROR -- : make: *** [uncommon.mk:1756: /home/opc/ruby/src/master/enc/unicode/data/emoji/15.0/emoji-sequences.txt] Error 1 E, [2024-05-22T18:00:41.745484 #3183896] ERROR -- : make: *** Deleting file '/home/opc/ruby/src/master/enc/unicode/data/emoji/15.0/emoji-sequences.txt' E, [2024-05-22T18:00:41.745533 #3183896] ERROR -- : make: *** Waiting for unfinished jobs.... E, [2024-05-22T18:00:41.759833 #3183896] ERROR -- : /home/opc/ruby/src/master/tool/downloader.rb:302:in `rescue in download': failed to download emoji/15.0/emoji-test.txt (RuntimeError) E, [2024-05-22T18:00:41.759893 #3183896] ERROR -- : OpenURI::HTTPError: 403 Forbidden: https://www.unicode.org/Public/emoji/15.0/emoji-test.txt E, [2024-05-22T18:00:41.759903 #3183896] ERROR -- : from /home/opc/ruby/src/master/tool/downloader.rb:201:in `download' E, [2024-05-22T18:00:41.759913 #3183896] ERROR -- : from /home/opc/ruby/src/master/tool/downloader.rb:136:in `download' E, [2024-05-22T18:00:41.759922 #3183896] ERROR -- : from /home/opc/ruby/src/master/tool/downloader.rb:482:in `block in
' E, [2024-05-22T18:00:41.759931 #3183896] ERROR -- : from /home/opc/ruby/src/master/tool/downloader.rb:465:in `each' E, [2024-05-22T18:00:41.759940 #3183896] ERROR -- : from /home/opc/ruby/src/master/tool/downloader.rb:465:in `
' E, [2024-05-22T18:00:41.759949 #3183896] ERROR -- : /usr/local/lib/ruby/3.2.0/open-uri.rb:369:in `open_http': 403 Forbidden (OpenURI::HTTPError) E, [2024-05-22T18:00:41.759958 #3183896] ERROR -- : from /usr/local/lib/ruby/3.2.0/open-uri.rb:760:in `buffer_open' E, [2024-05-22T18:00:41.759966 #3183896] ERROR -- : from /usr/local/lib/ruby/3.2.0/open-uri.rb:214:in `block in open_loop' E, [2024-05-22T18:00:41.759975 #3183896] ERROR -- : from /usr/local/lib/ruby/3.2.0/open-uri.rb:212:in `catch' E, [2024-05-22T18:00:41.759984 #3183896] ERROR -- : from /usr/local/lib/ruby/3.2.0/open-uri.rb:212:in `open_loop' E, [2024-05-22T18:00:41.759992 #3183896] ERROR -- : from /usr/local/lib/ruby/3.2.0/open-uri.rb:153:in `open_uri' E, [2024-05-22T18:00:41.760001 #3183896] ERROR -- : from /usr/local/lib/ruby/3.2.0/open-uri.rb:740:in `open' E, [2024-05-22T18:00:41.760010 #3183896] ERROR -- : from /usr/local/lib/ruby/3.2.0/open-uri.rb:748:in `read' E, [2024-05-22T18:00:41.760018 #3183896] ERROR -- : from /home/opc/ruby/src/master/tool/downloader.rb:247:in `block in download' E, [2024-05-22T18:00:41.760027 #3183896] ERROR -- : from /home/opc/ruby/src/master/tool/downloader.rb:378:in `with_retry' E, [2024-05-22T18:00:41.760036 #3183896] ERROR -- : from /home/opc/ruby/src/master/tool/downloader.rb:246:in `download' E, [2024-05-22T18:00:41.760044 #3183896] ERROR -- : from /home/opc/ruby/src/master/tool/downloader.rb:136:in `download' E, [2024-05-22T18:00:41.760053 #3183896] ERROR -- : from /home/opc/ruby/src/master/tool/downloader.rb:482:in `block in
' E, [2024-05-22T18:00:41.760062 #3183896] ERROR -- : from /home/opc/ruby/src/master/tool/downloader.rb:465:in `each' E, [2024-05-22T18:00:41.760071 #3183896] ERROR -- : from /home/opc/ruby/src/master/tool/downloader.rb:465:in `
' E, [2024-05-22T18:00:41.762807 #3183896] ERROR -- : make: *** [uncommon.mk:1756: /home/opc/ruby/src/master/enc/unicode/data/emoji/15.0/emoji-test.txt] Error 1 E, [2024-05-22T18:00:42.216325 #3183896] ERROR -- : /home/opc/ruby/src/master/tool/downloader.rb:302:in `rescue in download': failed to download emoji/15.0/emoji-sequences.txt (RuntimeError) E, [2024-05-22T18:00:42.216401 #3183896] ERROR -- : EOFError: end of file reached: https://www.unicode.org/Public/emoji/15.0/emoji-sequences.txt E, [2024-05-22T18:00:42.216413 #3183896] ERROR -- : from /home/opc/ruby/src/master/tool/downloader.rb:201:in `download' E, [2024-05-22T18:00:42.216424 #3183896] ERROR -- : from /home/opc/ruby/src/master/tool/downloader.rb:136:in `download' E, [2024-05-22T18:00:42.216433 #3183896] ERROR -- : from /home/opc/ruby/src/master/tool/downloader.rb:482:in `block in
' E, [2024-05-22T18:00:42.216442 #3183896] ERROR -- : from /home/opc/ruby/src/master/tool/downloader.rb:465:in `each' E, [2024-05-22T18:00:42.216450 #3183896] ERROR -- : from /home/opc/ruby/src/master/tool/downloader.rb:465:in `
' E, [2024-05-22T18:00:42.216459 #3183896] ERROR -- : /usr/local/lib/ruby/3.2.0/net/protocol.rb:237:in `rbuf_fill': end of file reached (EOFError) E, [2024-05-22T18:00:42.216467 #3183896] ERROR -- : from /usr/local/lib/ruby/3.2.0/net/protocol.rb:199:in `readuntil' E, [2024-05-22T18:00:42.216476 #3183896] ERROR -- : from /usr/local/lib/ruby/3.2.0/net/protocol.rb:209:in `readline' E, [2024-05-22T18:00:42.216505 #3183896] ERROR -- : from /usr/local/lib/ruby/3.2.0/net/http/response.rb:158:in `read_status_line' E, [2024-05-22T18:00:42.216530 #3183896] ERROR -- : from /usr/local/lib/ruby/3.2.0/net/http/response.rb:147:in `read_new' E, [2024-05-22T18:00:42.216540 #3183896] ERROR -- : from /usr/local/lib/ruby/3.2.0/net/http.rb:1862:in `block in transport_request' E, [2024-05-22T18:00:42.216549 #3183896] ERROR -- : from /usr/local/lib/ruby/3.2.0/net/http.rb:1853:in `catch' E, [2024-05-22T18:00:42.216557 #3183896] ERROR -- : from /usr/local/lib/ruby/3.2.0/net/http.rb:1853:in `transport_request' E, [2024-05-22T18:00:42.216566 #3183896] ERROR -- : from /usr/local/lib/ruby/3.2.0/net/http.rb:1826:in `request' E, [2024-05-22T18:00:42.216575 #3183896] ERROR -- : from /usr/local/lib/ruby/3.2.0/open-uri.rb:333:in `block in open_http' E, [2024-05-22T18:00:42.216584 #3183896] ERROR -- : from /usr/local/lib/ruby/3.2.0/net/http.rb:1238:in `start' E, [2024-05-22T18:00:42.216592 #3183896] ERROR -- : from /usr/local/lib/ruby/3.2.0/open-uri.rb:327:in `open_http' E, [2024-05-22T18:00:42.216601 #3183896] ERROR -- : from /usr/local/lib/ruby/3.2.0/open-uri.rb:760:in `buffer_open' E, [2024-05-22T18:00:42.216609 #3183896] ERROR -- : from /usr/local/lib/ruby/3.2.0/open-uri.rb:214:in `block in open_loop' E, [2024-05-22T18:00:42.216618 #3183896] ERROR -- : from /usr/local/lib/ruby/3.2.0/open-uri.rb:212:in `catch' E, [2024-05-22T18:00:42.216626 #3183896] ERROR -- : from /usr/local/lib/ruby/3.2.0/open-uri.rb:212:in `open_loop' E, [2024-05-22T18:00:42.216635 #3183896] ERROR -- : from /usr/local/lib/ruby/3.2.0/open-uri.rb:153:in `open_uri' E, [2024-05-22T18:00:42.216644 #3183896] ERROR -- : from /usr/local/lib/ruby/3.2.0/open-uri.rb:740:in `open' E, [2024-05-22T18:00:42.216652 #3183896] ERROR -- : from /usr/local/lib/ruby/3.2.0/open-uri.rb:748:in `read' E, [2024-05-22T18:00:42.216660 #3183896] ERROR -- : from /home/opc/ruby/src/master/tool/downloader.rb:247:in `block in download' E, [2024-05-22T18:00:42.216669 #3183896] ERROR -- : from /home/opc/ruby/src/master/tool/downloader.rb:378:in `with_retry' E, [2024-05-22T18:00:42.216678 #3183896] ERROR -- : from /home/opc/ruby/src/master/tool/downloader.rb:246:in `download' E, [2024-05-22T18:00:42.216686 #3183896] ERROR -- : from /home/opc/ruby/src/master/tool/downloader.rb:136:in `download' E, [2024-05-22T18:00:42.216695 #3183896] ERROR -- : from /home/opc/ruby/src/master/tool/downloader.rb:482:in `block in
' E, [2024-05-22T18:00:42.216704 #3183896] ERROR -- : from /home/opc/ruby/src/master/tool/downloader.rb:465:in `each' E, [2024-05-22T18:00:42.216717 #3183896] ERROR -- : from /home/opc/ruby/src/master/tool/downloader.rb:465:in `
' E, [2024-05-22T18:00:42.219567 #3183896] ERROR -- : make: *** [uncommon.mk:1756: /home/opc/ruby/src/master/enc/unicode/data/emoji/15.0/emoji-zwj-sequences.txt] Error 1 I, [2024-05-22T18:00:42.219625 #3183896] INFO -- : downloading emoji/15.0/emoji-test.txt ... I, [2024-05-22T18:00:42.219834 #3183896] INFO -- : $$$[end] "make update-unicode -j3" exit with 512. I, [2024-05-22T18:00:42.219869 #3183896] INFO -- : $$$[beg] make update-download -j3 I, [2024-05-22T18:00:42.390861 #3183896] INFO -- : tool/config.guess already exists I, [2024-05-22T18:00:42.390955 #3183896] INFO -- : tool/config.sub already exists I, [2024-05-22T18:00:42.394161 #3183896] INFO -- : Update power_assert to 84e85124c5014a139af39161d484156cfe87a9ed I, [2024-05-22T18:00:42.394287 #3183896] INFO -- : Update rbs to ba7872795d5de04adb8ff500c0e6afdc81a041dd I, [2024-05-22T18:00:42.394388 #3183896] INFO -- : Update typeprof to b19a6416da3a05d57fadd6ffdadb382b6d236ca5 I, [2024-05-22T18:00:42.397578 #3183896] INFO -- : echo 84e85124c5014a139af39161d484156cfe87a9ed | /bin/sh /home/opc/ruby/src/master/tool/ifchange /home/opc/ruby/src/master/.bundle/.timestamp/power_assert.revision - I, [2024-05-22T18:00:42.397849 #3183896] INFO -- : echo ba7872795d5de04adb8ff500c0e6afdc81a041dd | /bin/sh /home/opc/ruby/src/master/tool/ifchange /home/opc/ruby/src/master/.bundle/.timestamp/rbs.revision - I, [2024-05-22T18:00:42.398085 #3183896] INFO -- : echo b19a6416da3a05d57fadd6ffdadb382b6d236ca5 | /bin/sh /home/opc/ruby/src/master/tool/ifchange /home/opc/ruby/src/master/.bundle/.timestamp/typeprof.revision - I, [2024-05-22T18:00:42.403782 #3183896] INFO -- : /home/opc/ruby/src/master/.bundle/.timestamp/rbs.revision unchanged I, [2024-05-22T18:00:42.404400 #3183896] INFO -- : /home/opc/ruby/src/master/.bundle/.timestamp/power_assert.revision unchanged I, [2024-05-22T18:00:42.404431 #3183896] INFO -- : /home/opc/ruby/src/master/.bundle/.timestamp/typeprof.revision unchanged I, [2024-05-22T18:00:42.502468 #3183896] INFO -- : Building power_assert@84e85124c5014a139af39161d484156cfe87a9ed to /home/opc/ruby/src/master/gems/power_assert-2.0.3.gem I, [2024-05-22T18:00:42.618828 #3183896] INFO -- : Successfully built RubyGem I, [2024-05-22T18:00:42.618890 #3183896] INFO -- : Name: power_assert I, [2024-05-22T18:00:42.618902 #3183896] INFO -- : Version: 2.0.4dev I, [2024-05-22T18:00:42.618911 #3183896] INFO -- : File: power_assert-2.0.4dev.gem I, [2024-05-22T18:00:42.701986 #3183896] INFO -- : $$$[end] "make update-download -j3" exit with 0. I, [2024-05-22T18:00:42.702064 #3183896] INFO -- : $$$[beg] make update-rubyspec -j3 I, [2024-05-22T18:00:42.794047 #3183896] INFO -- : make: Nothing to be done for 'update-rubyspec'. I, [2024-05-22T18:00:42.794198 #3183896] INFO -- : $$$[end] "make update-rubyspec -j3" exit with 0. I, [2024-05-22T18:00:42.794248 #3183896] INFO -- : $$$[beg] make update-src -j3 I, [2024-05-22T18:00:44.023907 #3183896] INFO -- : Already up to date. I, [2024-05-22T18:00:44.039257 #3183896] INFO -- : Latest commit hash = 5613d6e95b I, [2024-05-22T18:00:44.039887 #3183896] INFO -- : $$$[end] "make update-src -j3" exit with 0. I, [2024-05-22T18:00:44.039937 #3183896] INFO -- : $$$[beg] make after-update -j3 I, [2024-05-22T18:00:44.180896 #3183896] INFO -- : /home/opc/ruby/src/master/revision.h updated I, [2024-05-22T18:00:44.182236 #3183896] INFO -- : generating aarch64-linux-fake.rb I, [2024-05-22T18:00:44.239888 #3183896] INFO -- : aarch64-linux-fake.rb updated I, [2024-05-22T18:00:44.241441 #3183896] INFO -- : generating enc.mk I, [2024-05-22T18:00:44.475174 #3183896] INFO -- : making srcs under enc I, [2024-05-22T18:00:44.517041 #3183896] INFO -- : make[1]: Entering directory '/home/opc/ruby/build/master' I, [2024-05-22T18:00:44.517132 #3183896] INFO -- : make[1]: Nothing to be done for 'srcs'. I, [2024-05-22T18:00:44.517143 #3183896] INFO -- : make[1]: Leaving directory '/home/opc/ruby/build/master' I, [2024-05-22T18:00:44.598262 #3183896] INFO -- : Update power_assert to 84e85124c5014a139af39161d484156cfe87a9ed I, [2024-05-22T18:00:44.598649 #3183896] INFO -- : Update rbs to ba7872795d5de04adb8ff500c0e6afdc81a041dd I, [2024-05-22T18:00:44.599477 #3183896] INFO -- : Update typeprof to b19a6416da3a05d57fadd6ffdadb382b6d236ca5 I, [2024-05-22T18:00:44.602325 #3183896] INFO -- : echo 84e85124c5014a139af39161d484156cfe87a9ed | /bin/sh /home/opc/ruby/src/master/tool/ifchange /home/opc/ruby/src/master/.bundle/.timestamp/power_assert.revision - I, [2024-05-22T18:00:44.602380 #3183896] INFO -- : echo ba7872795d5de04adb8ff500c0e6afdc81a041dd | /bin/sh /home/opc/ruby/src/master/tool/ifchange /home/opc/ruby/src/master/.bundle/.timestamp/rbs.revision - I, [2024-05-22T18:00:44.602576 #3183896] INFO -- : echo b19a6416da3a05d57fadd6ffdadb382b6d236ca5 | /bin/sh /home/opc/ruby/src/master/tool/ifchange /home/opc/ruby/src/master/.bundle/.timestamp/typeprof.revision - I, [2024-05-22T18:00:44.608816 #3183896] INFO -- : /home/opc/ruby/src/master/.bundle/.timestamp/power_assert.revision unchanged I, [2024-05-22T18:00:44.608881 #3183896] INFO -- : /home/opc/ruby/src/master/.bundle/.timestamp/rbs.revision unchanged I, [2024-05-22T18:00:44.610246 #3183896] INFO -- : /home/opc/ruby/src/master/.bundle/.timestamp/typeprof.revision unchanged I, [2024-05-22T18:00:44.701884 #3183896] INFO -- : Building power_assert@84e85124c5014a139af39161d484156cfe87a9ed to /home/opc/ruby/src/master/gems/power_assert-2.0.3.gem I, [2024-05-22T18:00:44.817438 #3183896] INFO -- : Successfully built RubyGem I, [2024-05-22T18:00:44.817503 #3183896] INFO -- : Name: power_assert I, [2024-05-22T18:00:44.817514 #3183896] INFO -- : Version: 2.0.4dev I, [2024-05-22T18:00:44.817524 #3183896] INFO -- : File: power_assert-2.0.4dev.gem I, [2024-05-22T18:00:44.819892 #3183896] INFO -- : Extracting bundle gem power_assert-2.0.3... I, [2024-05-22T18:00:44.920092 #3183896] INFO -- : Try with hash version of bundled gems instead of gems/power_assert-2.0.3.gem. We don't use this gem with release version of Ruby. I, [2024-05-22T18:00:44.930942 #3183896] INFO -- : Unpacked gems/power_assert-2.0.4dev.gem I, [2024-05-22T18:00:44.932800 #3183896] INFO -- : $$$[end] "make after-update -j3" exit with 0. I, [2024-05-22T18:00:44.932955 #3183896] INFO -- : $$$[beg] make miniruby -j3 I, [2024-05-22T18:00:45.024268 #3183896] INFO -- : BASERUBY = /usr/local/bin/ruby --disable=gems I, [2024-05-22T18:00:45.024345 #3183896] INFO -- : CC = gcc I, [2024-05-22T18:00:45.024356 #3183896] INFO -- : LD = ld I, [2024-05-22T18:00:45.024366 #3183896] INFO -- : LDSHARED = gcc -shared I, [2024-05-22T18:00:45.024378 #3183896] INFO -- : CFLAGS = -O3 -fno-fast-math -ggdb3 -Wall -Wextra -Wdeprecated-declarations -Wdiv-by-zero -Wduplicated-cond -Wimplicit-function-declaration -Wimplicit-int -Wpointer-arith -Wwrite-strings -Wold-style-definition -Wimplicit-fallthrough=0 -Wmissing-noreturn -Wno-cast-function-type -Wno-constant-logical-operand -Wno-long-long -Wno-missing-field-initializers -Wno-overlength-strings -Wno-packed-bitfield-compat -Wno-parentheses-equality -Wno-self-assign -Wno-tautological-compare -Wno-unused-parameter -Wno-unused-value -Wsuggest-attribute=format -Wsuggest-attribute=noreturn -Wunused-variable -Wmisleading-indentation -Wundef I, [2024-05-22T18:00:45.024388 #3183896] INFO -- : XCFLAGS = -U_FORTIFY_SOURCE -D_FORTIFY_SOURCE=2 -fstack-protector-strong -msign-return-address=all -fno-strict-overflow -fvisibility=hidden -fexcess-precision=standard -DRUBY_EXPORT -fPIE -I. -I.ext/include/aarch64-linux -I/home/opc/ruby/src/master/include -I/home/opc/ruby/src/master -I/home/opc/ruby/src/master/prism -I/home/opc/ruby/src/master/enc/unicode/15.0.0 I, [2024-05-22T18:00:45.024419 #3183896] INFO -- : CPPFLAGS = I, [2024-05-22T18:00:45.024429 #3183896] INFO -- : DLDFLAGS = -Wl,--compress-debug-sections=zlib -fstack-protector-strong -pie I, [2024-05-22T18:00:45.024439 #3183896] INFO -- : SOLIBS = -lz -lrt -lrt -ldl -lcrypt -lm -lpthread I, [2024-05-22T18:00:45.024447 #3183896] INFO -- : LANG = en_US.UTF-8 I, [2024-05-22T18:00:45.024459 #3183896] INFO -- : LC_ALL = I, [2024-05-22T18:00:45.024467 #3183896] INFO -- : LC_CTYPE = I, [2024-05-22T18:00:45.024476 #3183896] INFO -- : MFLAGS = -j3 --jobserver-auth=4,5 I, [2024-05-22T18:00:45.024484 #3183896] INFO -- : RUSTC = rustc I, [2024-05-22T18:00:45.024537 #3183896] INFO -- : YJIT_RUSTC_ARGS = --crate-name=yjit --crate-type=staticlib --edition=2021 -g -C lto=thin -C opt-level=3 -C overflow-checks=on '--out-dir=/home/opc/ruby/build/master/yjit/target/release/' /home/opc/ruby/src/master/yjit/src/lib.rs I, [2024-05-22T18:00:45.025320 #3183896] INFO -- : gcc (GCC) 8.5.0 20210514 (Red Hat 8.5.0-10.1.0.1) I, [2024-05-22T18:00:45.025361 #3183896] INFO -- : Copyright (C) 2018 Free Software Foundation, Inc. I, [2024-05-22T18:00:45.025372 #3183896] INFO -- : This is free software; see the source for copying conditions. There is NO I, [2024-05-22T18:00:45.025382 #3183896] INFO -- : warranty; not even for MERCHANTABILITY or FITNESS FOR A PARTICULAR PURPOSE. I, [2024-05-22T18:00:45.025391 #3183896] INFO -- : I, [2024-05-22T18:00:45.050510 #3183896] INFO -- : compiling /home/opc/ruby/src/master/version.c I, [2024-05-22T18:00:45.197537 #3183896] INFO -- : linking miniruby I, [2024-05-22T18:00:46.130674 #3183896] INFO -- : $$$[end] "make miniruby -j3" exit with 0. I, [2024-05-22T18:00:46.130841 #3183896] INFO -- : $$$[beg] make ruby -j3 I, [2024-05-22T18:00:46.221192 #3183896] INFO -- : BASERUBY = /usr/local/bin/ruby --disable=gems I, [2024-05-22T18:00:46.221274 #3183896] INFO -- : CC = gcc I, [2024-05-22T18:00:46.221286 #3183896] INFO -- : LD = ld I, [2024-05-22T18:00:46.221295 #3183896] INFO -- : LDSHARED = gcc -shared I, [2024-05-22T18:00:46.221307 #3183896] INFO -- : CFLAGS = -O3 -fno-fast-math -ggdb3 -Wall -Wextra -Wdeprecated-declarations -Wdiv-by-zero -Wduplicated-cond -Wimplicit-function-declaration -Wimplicit-int -Wpointer-arith -Wwrite-strings -Wold-style-definition -Wimplicit-fallthrough=0 -Wmissing-noreturn -Wno-cast-function-type -Wno-constant-logical-operand -Wno-long-long -Wno-missing-field-initializers -Wno-overlength-strings -Wno-packed-bitfield-compat -Wno-parentheses-equality -Wno-self-assign -Wno-tautological-compare -Wno-unused-parameter -Wno-unused-value -Wsuggest-attribute=format -Wsuggest-attribute=noreturn -Wunused-variable -Wmisleading-indentation -Wundef I, [2024-05-22T18:00:46.221318 #3183896] INFO -- : XCFLAGS = -U_FORTIFY_SOURCE -D_FORTIFY_SOURCE=2 -fstack-protector-strong -msign-return-address=all -fno-strict-overflow -fvisibility=hidden -fexcess-precision=standard -DRUBY_EXPORT -fPIE -I. -I.ext/include/aarch64-linux -I/home/opc/ruby/src/master/include -I/home/opc/ruby/src/master -I/home/opc/ruby/src/master/prism -I/home/opc/ruby/src/master/enc/unicode/15.0.0 I, [2024-05-22T18:00:46.221327 #3183896] INFO -- : CPPFLAGS = I, [2024-05-22T18:00:46.221335 #3183896] INFO -- : DLDFLAGS = -Wl,--compress-debug-sections=zlib -fstack-protector-strong -pie I, [2024-05-22T18:00:46.221345 #3183896] INFO -- : SOLIBS = -lz -lrt -lrt -ldl -lcrypt -lm -lpthread I, [2024-05-22T18:00:46.221353 #3183896] INFO -- : LANG = en_US.UTF-8 I, [2024-05-22T18:00:46.221361 #3183896] INFO -- : LC_ALL = I, [2024-05-22T18:00:46.221370 #3183896] INFO -- : LC_CTYPE = I, [2024-05-22T18:00:46.221379 #3183896] INFO -- : MFLAGS = -j3 --jobserver-auth=4,5 I, [2024-05-22T18:00:46.221387 #3183896] INFO -- : RUSTC = rustc I, [2024-05-22T18:00:46.221396 #3183896] INFO -- : YJIT_RUSTC_ARGS = --crate-name=yjit --crate-type=staticlib --edition=2021 -g -C lto=thin -C opt-level=3 -C overflow-checks=on '--out-dir=/home/opc/ruby/build/master/yjit/target/release/' /home/opc/ruby/src/master/yjit/src/lib.rs I, [2024-05-22T18:00:46.222245 #3183896] INFO -- : gcc (GCC) 8.5.0 20210514 (Red Hat 8.5.0-10.1.0.1) I, [2024-05-22T18:00:46.222291 #3183896] INFO -- : Copyright (C) 2018 Free Software Foundation, Inc. I, [2024-05-22T18:00:46.222302 #3183896] INFO -- : This is free software; see the source for copying conditions. There is NO I, [2024-05-22T18:00:46.222318 #3183896] INFO -- : warranty; not even for MERCHANTABILITY or FITNESS FOR A PARTICULAR PURPOSE. I, [2024-05-22T18:00:46.222327 #3183896] INFO -- : I, [2024-05-22T18:00:46.407157 #3183896] INFO -- : builtin_binary.inc updated I, [2024-05-22T18:00:46.410724 #3183896] INFO -- : c5234a9416e4f20f175185e840b25b0f08674d14078ed7083f37e655458e3ca9 builtin_binary.inc I, [2024-05-22T18:00:46.411711 #3183896] INFO -- : compiling /home/opc/ruby/src/master/builtin.c I, [2024-05-22T18:00:46.745447 #3183896] INFO -- : linking static-library libruby-static.a I, [2024-05-22T18:00:49.542112 #3183896] INFO -- : linking ruby I, [2024-05-22T18:00:50.494269 #3183896] INFO -- : $$$[end] "make ruby -j3" exit with 0. I, [2024-05-22T18:00:50.494442 #3183896] INFO -- : $$$[beg] make all -j3 I, [2024-05-22T18:00:50.583073 #3183896] INFO -- : BASERUBY = /usr/local/bin/ruby --disable=gems I, [2024-05-22T18:00:50.583146 #3183896] INFO -- : CC = gcc I, [2024-05-22T18:00:50.583157 #3183896] INFO -- : LD = ld I, [2024-05-22T18:00:50.583167 #3183896] INFO -- : LDSHARED = gcc -shared I, [2024-05-22T18:00:50.583178 #3183896] INFO -- : CFLAGS = -O3 -fno-fast-math -ggdb3 -Wall -Wextra -Wdeprecated-declarations -Wdiv-by-zero -Wduplicated-cond -Wimplicit-function-declaration -Wimplicit-int -Wpointer-arith -Wwrite-strings -Wold-style-definition -Wimplicit-fallthrough=0 -Wmissing-noreturn -Wno-cast-function-type -Wno-constant-logical-operand -Wno-long-long -Wno-missing-field-initializers -Wno-overlength-strings -Wno-packed-bitfield-compat -Wno-parentheses-equality -Wno-self-assign -Wno-tautological-compare -Wno-unused-parameter -Wno-unused-value -Wsuggest-attribute=format -Wsuggest-attribute=noreturn -Wunused-variable -Wmisleading-indentation -Wundef I, [2024-05-22T18:00:50.583188 #3183896] INFO -- : XCFLAGS = -U_FORTIFY_SOURCE -D_FORTIFY_SOURCE=2 -fstack-protector-strong -msign-return-address=all -fno-strict-overflow -fvisibility=hidden -fexcess-precision=standard -DRUBY_EXPORT -fPIE -I. -I.ext/include/aarch64-linux -I/home/opc/ruby/src/master/include -I/home/opc/ruby/src/master -I/home/opc/ruby/src/master/prism -I/home/opc/ruby/src/master/enc/unicode/15.0.0 I, [2024-05-22T18:00:50.583198 #3183896] INFO -- : CPPFLAGS = I, [2024-05-22T18:00:50.583206 #3183896] INFO -- : DLDFLAGS = -Wl,--compress-debug-sections=zlib -fstack-protector-strong -pie I, [2024-05-22T18:00:50.583216 #3183896] INFO -- : SOLIBS = -lz -lrt -lrt -ldl -lcrypt -lm -lpthread I, [2024-05-22T18:00:50.583225 #3183896] INFO -- : LANG = en_US.UTF-8 I, [2024-05-22T18:00:50.583233 #3183896] INFO -- : LC_ALL = I, [2024-05-22T18:00:50.583241 #3183896] INFO -- : LC_CTYPE = I, [2024-05-22T18:00:50.583249 #3183896] INFO -- : MFLAGS = -j3 --jobserver-auth=4,5 I, [2024-05-22T18:00:50.583258 #3183896] INFO -- : RUSTC = rustc I, [2024-05-22T18:00:50.583267 #3183896] INFO -- : YJIT_RUSTC_ARGS = --crate-name=yjit --crate-type=staticlib --edition=2021 -g -C lto=thin -C opt-level=3 -C overflow-checks=on '--out-dir=/home/opc/ruby/build/master/yjit/target/release/' /home/opc/ruby/src/master/yjit/src/lib.rs I, [2024-05-22T18:00:50.583983 #3183896] INFO -- : gcc (GCC) 8.5.0 20210514 (Red Hat 8.5.0-10.1.0.1) I, [2024-05-22T18:00:50.584024 #3183896] INFO -- : Copyright (C) 2018 Free Software Foundation, Inc. I, [2024-05-22T18:00:50.584035 #3183896] INFO -- : This is free software; see the source for copying conditions. There is NO I, [2024-05-22T18:00:50.584045 #3183896] INFO -- : warranty; not even for MERCHANTABILITY or FITNESS FOR A PARTICULAR PURPOSE. I, [2024-05-22T18:00:50.584054 #3183896] INFO -- : I, [2024-05-22T18:00:50.616891 #3183896] INFO -- : generating encdb.h I, [2024-05-22T18:00:50.618417 #3183896] INFO -- : generating enc.mk I, [2024-05-22T18:00:50.655228 #3183896] INFO -- : encdb.h unchanged I, [2024-05-22T18:00:50.856050 #3183896] INFO -- : making srcs under enc I, [2024-05-22T18:00:50.856282 #3183896] INFO -- : making enc I, [2024-05-22T18:00:50.883541 #3183896] INFO -- : make[1]: Entering directory '/home/opc/ruby/build/master' I, [2024-05-22T18:00:50.883608 #3183896] INFO -- : make[1]: Nothing to be done for 'enc'. I, [2024-05-22T18:00:50.883620 #3183896] INFO -- : make[1]: Leaving directory '/home/opc/ruby/build/master' I, [2024-05-22T18:00:50.898364 #3183896] INFO -- : make[1]: Entering directory '/home/opc/ruby/build/master' I, [2024-05-22T18:00:50.898427 #3183896] INFO -- : make[1]: Nothing to be done for 'srcs'. I, [2024-05-22T18:00:50.898438 #3183896] INFO -- : make[1]: Leaving directory '/home/opc/ruby/build/master' I, [2024-05-22T18:00:50.899215 #3183896] INFO -- : generating transdb.h I, [2024-05-22T18:00:51.044135 #3183896] INFO -- : transdb.h unchanged I, [2024-05-22T18:00:51.045561 #3183896] INFO -- : generating makefiles ext/configure-ext.mk I, [2024-05-22T18:00:51.046022 #3183896] INFO -- : making trans I, [2024-05-22T18:00:51.085937 #3183896] INFO -- : ext/configure-ext.mk updated I, [2024-05-22T18:00:51.089350 #3183896] INFO -- : make[1]: Entering directory '/home/opc/ruby/build/master' I, [2024-05-22T18:00:51.094658 #3183896] INFO -- : make[1]: Entering directory '/home/opc/ruby/build/master' I, [2024-05-22T18:00:51.094722 #3183896] INFO -- : make[1]: Nothing to be done for 'trans'. I, [2024-05-22T18:00:51.094735 #3183896] INFO -- : make[1]: Leaving directory '/home/opc/ruby/build/master' I, [2024-05-22T18:00:51.823997 #3183896] INFO -- : making encs I, [2024-05-22T18:00:51.859910 #3183896] INFO -- : make[1]: Leaving directory '/home/opc/ruby/build/master' I, [2024-05-22T18:00:51.860565 #3183896] INFO -- : generating makefile exts.mk I, [2024-05-22T18:00:51.876907 #3183896] INFO -- : make[1]: Entering directory '/home/opc/ruby/build/master' I, [2024-05-22T18:00:51.876975 #3183896] INFO -- : make[1]: Nothing to be done for 'encs'. I, [2024-05-22T18:00:51.876986 #3183896] INFO -- : make[1]: Leaving directory '/home/opc/ruby/build/master' I, [2024-05-22T18:00:51.919651 #3183896] INFO -- : exts.mk unchanged I, [2024-05-22T18:00:51.924617 #3183896] INFO -- : make[1]: Entering directory '/home/opc/ruby/build/master' I, [2024-05-22T18:00:52.086309 #3183896] INFO -- : make[2]: Entering directory '/home/opc/ruby/build/master/ext/coverage' I, [2024-05-22T18:00:52.088404 #3183896] INFO -- : make[2]: Entering directory '/home/opc/ruby/build/master/ext/digest' I, [2024-05-22T18:00:52.090490 #3183896] INFO -- : make[2]: Entering directory '/home/opc/ruby/build/master/ext/date' I, [2024-05-22T18:00:52.091174 #3183896] INFO -- : make[2]: Leaving directory '/home/opc/ruby/build/master/ext/coverage' I, [2024-05-22T18:00:52.097244 #3183896] INFO -- : make[2]: Leaving directory '/home/opc/ruby/build/master/ext/date' I, [2024-05-22T18:00:52.097660 #3183896] INFO -- : make[2]: Leaving directory '/home/opc/ruby/build/master/ext/digest' I, [2024-05-22T18:00:52.104180 #3183896] INFO -- : make[2]: Entering directory '/home/opc/ruby/build/master/ext/io/console' I, [2024-05-22T18:00:52.104732 #3183896] INFO -- : make[2]: Entering directory '/home/opc/ruby/build/master/ext/fiddle' I, [2024-05-22T18:00:52.110799 #3183896] INFO -- : make[2]: Leaving directory '/home/opc/ruby/build/master/ext/io/console' I, [2024-05-22T18:00:52.112898 #3183896] INFO -- : make[2]: Entering directory '/home/opc/ruby/build/master/ext/json' I, [2024-05-22T18:00:52.113367 #3183896] INFO -- : make[2]: Leaving directory '/home/opc/ruby/build/master/ext/fiddle' I, [2024-05-22T18:00:52.115683 #3183896] INFO -- : make[2]: Entering directory '/home/opc/ruby/build/master/ext/monitor' I, [2024-05-22T18:00:52.119552 #3183896] INFO -- : make[2]: Leaving directory '/home/opc/ruby/build/master/ext/json' I, [2024-05-22T18:00:52.121917 #3183896] INFO -- : make[2]: Leaving directory '/home/opc/ruby/build/master/ext/monitor' I, [2024-05-22T18:00:52.122606 #3183896] INFO -- : make[2]: Entering directory '/home/opc/ruby/build/master/ext/objspace' I, [2024-05-22T18:00:52.126129 #3183896] INFO -- : make[2]: Entering directory '/home/opc/ruby/build/master/ext/pathname' I, [2024-05-22T18:00:52.128528 #3183896] INFO -- : make[2]: Leaving directory '/home/opc/ruby/build/master/ext/objspace' I, [2024-05-22T18:00:52.132033 #3183896] INFO -- : make[2]: Leaving directory '/home/opc/ruby/build/master/ext/pathname' I, [2024-05-22T18:00:52.135928 #3183896] INFO -- : make[2]: Entering directory '/home/opc/ruby/build/master/ext/psych' I, [2024-05-22T18:00:52.136392 #3183896] INFO -- : make[2]: Entering directory '/home/opc/ruby/build/master/ext/pty' I, [2024-05-22T18:00:52.140374 #3183896] INFO -- : make[2]: Entering directory '/home/opc/ruby/build/master/ext/openssl' I, [2024-05-22T18:00:52.146453 #3183896] INFO -- : make[2]: Leaving directory '/home/opc/ruby/build/master/ext/pty' I, [2024-05-22T18:00:52.155666 #3183896] INFO -- : make[2]: Leaving directory '/home/opc/ruby/build/master/ext/psych' I, [2024-05-22T18:00:52.157652 #3183896] INFO -- : make[2]: Entering directory '/home/opc/ruby/build/master/ext/rubyvm' I, [2024-05-22T18:00:52.161144 #3183896] INFO -- : make[2]: Leaving directory '/home/opc/ruby/build/master/ext/rubyvm' I, [2024-05-22T18:00:52.161977 #3183896] INFO -- : make[2]: Entering directory '/home/opc/ruby/build/master/ext/ripper' I, [2024-05-22T18:00:52.162992 #3183896] INFO -- : make[2]: Leaving directory '/home/opc/ruby/build/master/ext/openssl' I, [2024-05-22T18:00:52.170075 #3183896] INFO -- : make[2]: Leaving directory '/home/opc/ruby/build/master/ext/ripper' I, [2024-05-22T18:00:52.174453 #3183896] INFO -- : make[2]: Entering directory '/home/opc/ruby/build/master/ext/socket' I, [2024-05-22T18:00:52.175673 #3183896] INFO -- : make[2]: Entering directory '/home/opc/ruby/build/master/.bundle/gems/bigdecimal-3.1.7/ext/bigdecimal' I, [2024-05-22T18:00:52.181030 #3183896] INFO -- : make[2]: Entering directory '/home/opc/ruby/build/master/.bundle/gems/bigdecimal-3.1.8/ext/bigdecimal' I, [2024-05-22T18:00:52.185134 #3183896] INFO -- : make[2]: Leaving directory '/home/opc/ruby/build/master/ext/socket' I, [2024-05-22T18:00:52.187833 #3183896] INFO -- : make[2]: Entering directory '/home/opc/ruby/build/master/.bundle/gems/debug-1.9.2/ext/debug' I, [2024-05-22T18:00:52.207423 #3183896] INFO -- : make[2]: Leaving directory '/home/opc/ruby/build/master/.bundle/gems/bigdecimal-3.1.7/ext/bigdecimal' I, [2024-05-22T18:00:52.210274 #3183896] INFO -- : make[2]: Entering directory '/home/opc/ruby/build/master/.bundle/gems/nkf-0.2.0/ext/nkf' I, [2024-05-22T18:00:52.214552 #3183896] INFO -- : make[2]: Leaving directory '/home/opc/ruby/build/master/.bundle/gems/bigdecimal-3.1.8/ext/bigdecimal' I, [2024-05-22T18:00:52.217028 #3183896] INFO -- : make[2]: Entering directory '/home/opc/ruby/build/master/.bundle/gems/racc-1.7.3/ext/racc/cparse' I, [2024-05-22T18:00:52.220839 #3183896] INFO -- : make[2]: Leaving directory '/home/opc/ruby/build/master/.bundle/gems/debug-1.9.2/ext/debug' I, [2024-05-22T18:00:52.223982 #3183896] INFO -- : make[2]: Entering directory '/home/opc/ruby/build/master/.bundle/gems/racc-1.8.0/ext/racc/cparse' I, [2024-05-22T18:00:52.246035 #3183896] INFO -- : make[2]: Leaving directory '/home/opc/ruby/build/master/.bundle/gems/nkf-0.2.0/ext/nkf' I, [2024-05-22T18:00:52.248589 #3183896] INFO -- : make[2]: Leaving directory '/home/opc/ruby/build/master/.bundle/gems/racc-1.7.3/ext/racc/cparse' I, [2024-05-22T18:00:52.249278 #3183896] INFO -- : make[2]: Entering directory '/home/opc/ruby/build/master/.bundle/gems/rbs-3.4.4/ext/rbs_extension' I, [2024-05-22T18:00:52.251521 #3183896] INFO -- : make[2]: Entering directory '/home/opc/ruby/build/master/.bundle/gems/syslog-0.1.2/ext/syslog' I, [2024-05-22T18:00:52.257843 #3183896] INFO -- : make[2]: Leaving directory '/home/opc/ruby/build/master/.bundle/gems/racc-1.8.0/ext/racc/cparse' I, [2024-05-22T18:00:52.282870 #3183896] INFO -- : make[2]: Leaving directory '/home/opc/ruby/build/master/.bundle/gems/rbs-3.4.4/ext/rbs_extension' I, [2024-05-22T18:00:52.284213 #3183896] INFO -- : make[2]: Entering directory '/home/opc/ruby/build/master/ext/digest/sha2' I, [2024-05-22T18:00:52.286281 #3183896] INFO -- : make[2]: Leaving directory '/home/opc/ruby/build/master/.bundle/gems/syslog-0.1.2/ext/syslog' I, [2024-05-22T18:00:52.289903 #3183896] INFO -- : make[2]: Leaving directory '/home/opc/ruby/build/master/ext/digest/sha2' I, [2024-05-22T18:00:52.328792 #3183896] INFO -- : make[2]: Entering directory '/home/opc/ruby/build/master' I, [2024-05-22T18:00:52.414902 #3183896] INFO -- : make[2]: 'ruby' is up to date. I, [2024-05-22T18:00:52.414978 #3183896] INFO -- : make[2]: Leaving directory '/home/opc/ruby/build/master' I, [2024-05-22T18:00:52.415116 #3183896] INFO -- : make[1]: Leaving directory '/home/opc/ruby/build/master' I, [2024-05-22T18:00:52.419656 #3183896] INFO -- : make[1]: Entering directory '/home/opc/ruby/build/master' I, [2024-05-22T18:00:52.419717 #3183896] INFO -- : make[1]: Nothing to be done for 'note'. I, [2024-05-22T18:00:52.419728 #3183896] INFO -- : make[1]: Leaving directory '/home/opc/ruby/build/master' I, [2024-05-22T18:00:52.419985 #3183896] INFO -- : $$$[end] "make all -j3" exit with 0. I, [2024-05-22T18:00:52.420129 #3183896] INFO -- : $$$[beg] make install -j3 I, [2024-05-22T18:00:52.515014 #3183896] INFO -- : Update power_assert to 84e85124c5014a139af39161d484156cfe87a9ed I, [2024-05-22T18:00:52.515189 #3183896] INFO -- : Update rbs to ba7872795d5de04adb8ff500c0e6afdc81a041dd I, [2024-05-22T18:00:52.516388 #3183896] INFO -- : Update typeprof to b19a6416da3a05d57fadd6ffdadb382b6d236ca5 I, [2024-05-22T18:00:52.519070 #3183896] INFO -- : echo 84e85124c5014a139af39161d484156cfe87a9ed | /bin/sh /home/opc/ruby/src/master/tool/ifchange /home/opc/ruby/src/master/.bundle/.timestamp/power_assert.revision - I, [2024-05-22T18:00:52.519420 #3183896] INFO -- : echo ba7872795d5de04adb8ff500c0e6afdc81a041dd | /bin/sh /home/opc/ruby/src/master/tool/ifchange /home/opc/ruby/src/master/.bundle/.timestamp/rbs.revision - I, [2024-05-22T18:00:52.520073 #3183896] INFO -- : echo b19a6416da3a05d57fadd6ffdadb382b6d236ca5 | /bin/sh /home/opc/ruby/src/master/tool/ifchange /home/opc/ruby/src/master/.bundle/.timestamp/typeprof.revision - I, [2024-05-22T18:00:52.525373 #3183896] INFO -- : /home/opc/ruby/src/master/.bundle/.timestamp/power_assert.revision unchanged I, [2024-05-22T18:00:52.525741 #3183896] INFO -- : /home/opc/ruby/src/master/.bundle/.timestamp/rbs.revision unchanged I, [2024-05-22T18:00:52.527240 #3183896] INFO -- : /home/opc/ruby/src/master/.bundle/.timestamp/typeprof.revision unchanged I, [2024-05-22T18:00:52.529243 #3183896] INFO -- : BASERUBY = /usr/local/bin/ruby --disable=gems I, [2024-05-22T18:00:52.529308 #3183896] INFO -- : CC = gcc I, [2024-05-22T18:00:52.529339 #3183896] INFO -- : LD = ld I, [2024-05-22T18:00:52.529370 #3183896] INFO -- : LDSHARED = gcc -shared I, [2024-05-22T18:00:52.529411 #3183896] INFO -- : CFLAGS = -O3 -fno-fast-math -ggdb3 -Wall -Wextra -Wdeprecated-declarations -Wdiv-by-zero -Wduplicated-cond -Wimplicit-function-declaration -Wimplicit-int -Wpointer-arith -Wwrite-strings -Wold-style-definition -Wimplicit-fallthrough=0 -Wmissing-noreturn -Wno-cast-function-type -Wno-constant-logical-operand -Wno-long-long -Wno-missing-field-initializers -Wno-overlength-strings -Wno-packed-bitfield-compat -Wno-parentheses-equality -Wno-self-assign -Wno-tautological-compare -Wno-unused-parameter -Wno-unused-value -Wsuggest-attribute=format -Wsuggest-attribute=noreturn -Wunused-variable -Wmisleading-indentation -Wundef I, [2024-05-22T18:00:52.529449 #3183896] INFO -- : XCFLAGS = -U_FORTIFY_SOURCE -D_FORTIFY_SOURCE=2 -fstack-protector-strong -msign-return-address=all -fno-strict-overflow -fvisibility=hidden -fexcess-precision=standard -DRUBY_EXPORT -fPIE -I. -I.ext/include/aarch64-linux -I/home/opc/ruby/src/master/include -I/home/opc/ruby/src/master -I/home/opc/ruby/src/master/prism -I/home/opc/ruby/src/master/enc/unicode/15.0.0 I, [2024-05-22T18:00:52.529511 #3183896] INFO -- : CPPFLAGS = I, [2024-05-22T18:00:52.529545 #3183896] INFO -- : DLDFLAGS = -Wl,--compress-debug-sections=zlib -fstack-protector-strong -pie I, [2024-05-22T18:00:52.529556 #3183896] INFO -- : SOLIBS = -lz -lrt -lrt -ldl -lcrypt -lm -lpthread I, [2024-05-22T18:00:52.529570 #3183896] INFO -- : LANG = en_US.UTF-8 I, [2024-05-22T18:00:52.529581 #3183896] INFO -- : LC_ALL = I, [2024-05-22T18:00:52.529589 #3183896] INFO -- : LC_CTYPE = I, [2024-05-22T18:00:52.529598 #3183896] INFO -- : MFLAGS = -j3 --jobserver-auth=4,5 I, [2024-05-22T18:00:52.529606 #3183896] INFO -- : RUSTC = rustc I, [2024-05-22T18:00:52.529615 #3183896] INFO -- : YJIT_RUSTC_ARGS = --crate-name=yjit --crate-type=staticlib --edition=2021 -g -C lto=thin -C opt-level=3 -C overflow-checks=on '--out-dir=/home/opc/ruby/build/master/yjit/target/release/' /home/opc/ruby/src/master/yjit/src/lib.rs I, [2024-05-22T18:00:52.560900 #3183896] INFO -- : gcc (GCC) 8.5.0 20210514 (Red Hat 8.5.0-10.1.0.1) I, [2024-05-22T18:00:52.560974 #3183896] INFO -- : Copyright (C) 2018 Free Software Foundation, Inc. I, [2024-05-22T18:00:52.560985 #3183896] INFO -- : This is free software; see the source for copying conditions. There is NO I, [2024-05-22T18:00:52.560995 #3183896] INFO -- : warranty; not even for MERCHANTABILITY or FITNESS FOR A PARTICULAR PURPOSE. I, [2024-05-22T18:00:52.561005 #3183896] INFO -- : I, [2024-05-22T18:00:52.561460 #3183896] INFO -- : generating encdb.h I, [2024-05-22T18:00:52.561935 #3183896] INFO -- : generating enc.mk I, [2024-05-22T18:00:52.604502 #3183896] INFO -- : encdb.h unchanged I, [2024-05-22T18:00:52.697625 #3183896] INFO -- : Building power_assert@84e85124c5014a139af39161d484156cfe87a9ed to /home/opc/ruby/src/master/gems/power_assert-2.0.3.gem I, [2024-05-22T18:00:52.802017 #3183896] INFO -- : making srcs under enc I, [2024-05-22T18:00:52.802135 #3183896] INFO -- : making enc I, [2024-05-22T18:00:52.822617 #3183896] INFO -- : Successfully built RubyGem I, [2024-05-22T18:00:52.822674 #3183896] INFO -- : Name: power_assert I, [2024-05-22T18:00:52.822685 #3183896] INFO -- : Version: 2.0.4dev I, [2024-05-22T18:00:52.822695 #3183896] INFO -- : File: power_assert-2.0.4dev.gem I, [2024-05-22T18:00:52.825104 #3183896] INFO -- : Extracting bundle gem power_assert-2.0.3... I, [2024-05-22T18:00:52.829704 #3183896] INFO -- : make[1]: Entering directory '/home/opc/ruby/build/master' I, [2024-05-22T18:00:52.829755 #3183896] INFO -- : make[1]: Nothing to be done for 'enc'. I, [2024-05-22T18:00:52.829765 #3183896] INFO -- : make[1]: Leaving directory '/home/opc/ruby/build/master' I, [2024-05-22T18:00:52.844756 #3183896] INFO -- : make[1]: Entering directory '/home/opc/ruby/build/master' I, [2024-05-22T18:00:52.844818 #3183896] INFO -- : make[1]: Nothing to be done for 'srcs'. I, [2024-05-22T18:00:52.844830 #3183896] INFO -- : make[1]: Leaving directory '/home/opc/ruby/build/master' I, [2024-05-22T18:00:52.845728 #3183896] INFO -- : generating transdb.h I, [2024-05-22T18:00:52.924542 #3183896] INFO -- : Try with hash version of bundled gems instead of gems/power_assert-2.0.3.gem. We don't use this gem with release version of Ruby. I, [2024-05-22T18:00:52.934955 #3183896] INFO -- : Unpacked gems/power_assert-2.0.4dev.gem I, [2024-05-22T18:00:52.989786 #3183896] INFO -- : transdb.h unchanged I, [2024-05-22T18:00:52.991186 #3183896] INFO -- : generating makefiles ext/configure-ext.mk I, [2024-05-22T18:00:52.991482 #3183896] INFO -- : making trans I, [2024-05-22T18:00:53.031254 #3183896] INFO -- : ext/configure-ext.mk unchanged I, [2024-05-22T18:00:53.034467 #3183896] INFO -- : make[1]: Entering directory '/home/opc/ruby/build/master' I, [2024-05-22T18:00:53.039964 #3183896] INFO -- : make[1]: Entering directory '/home/opc/ruby/build/master' I, [2024-05-22T18:00:53.040020 #3183896] INFO -- : make[1]: Nothing to be done for 'trans'. I, [2024-05-22T18:00:53.040031 #3183896] INFO -- : make[1]: Leaving directory '/home/opc/ruby/build/master' I, [2024-05-22T18:00:53.040880 #3183896] INFO -- : making encs I, [2024-05-22T18:00:53.095801 #3183896] INFO -- : make[1]: Entering directory '/home/opc/ruby/build/master' I, [2024-05-22T18:00:53.095886 #3183896] INFO -- : make[1]: Nothing to be done for 'encs'. I, [2024-05-22T18:00:53.095926 #3183896] INFO -- : make[1]: Leaving directory '/home/opc/ruby/build/master' I, [2024-05-22T18:00:53.843922 #3183896] INFO -- : make[1]: Leaving directory '/home/opc/ruby/build/master' I, [2024-05-22T18:00:53.844678 #3183896] INFO -- : generating makefile exts.mk I, [2024-05-22T18:00:53.904912 #3183896] INFO -- : exts.mk unchanged I, [2024-05-22T18:00:53.909917 #3183896] INFO -- : make[1]: Entering directory '/home/opc/ruby/build/master' I, [2024-05-22T18:00:54.022635 #3183896] INFO -- : make[2]: Entering directory '/home/opc/ruby/build/master/ext/digest' I, [2024-05-22T18:00:54.024093 #3183896] INFO -- : make[2]: Entering directory '/home/opc/ruby/build/master/ext/coverage' I, [2024-05-22T18:00:54.024713 #3183896] INFO -- : make[2]: Entering directory '/home/opc/ruby/build/master/ext/date' I, [2024-05-22T18:00:54.030485 #3183896] INFO -- : make[2]: Leaving directory '/home/opc/ruby/build/master/ext/coverage' I, [2024-05-22T18:00:54.030880 #3183896] INFO -- : make[2]: Leaving directory '/home/opc/ruby/build/master/ext/date' I, [2024-05-22T18:00:54.034655 #3183896] INFO -- : make[2]: Leaving directory '/home/opc/ruby/build/master/ext/digest' I, [2024-05-22T18:00:54.040060 #3183896] INFO -- : make[2]: Entering directory '/home/opc/ruby/build/master/ext/io/console' I, [2024-05-22T18:00:54.041659 #3183896] INFO -- : make[2]: Entering directory '/home/opc/ruby/build/master/ext/fiddle' I, [2024-05-22T18:00:54.046426 #3183896] INFO -- : make[2]: Leaving directory '/home/opc/ruby/build/master/ext/io/console' I, [2024-05-22T18:00:54.048331 #3183896] INFO -- : make[2]: Entering directory '/home/opc/ruby/build/master/ext/json' I, [2024-05-22T18:00:54.050353 #3183896] INFO -- : make[2]: Entering directory '/home/opc/ruby/build/master/ext/monitor' I, [2024-05-22T18:00:54.051017 #3183896] INFO -- : make[2]: Leaving directory '/home/opc/ruby/build/master/ext/fiddle' I, [2024-05-22T18:00:54.054589 #3183896] INFO -- : make[2]: Leaving directory '/home/opc/ruby/build/master/ext/monitor' I, [2024-05-22T18:00:54.057522 #3183896] INFO -- : make[2]: Entering directory '/home/opc/ruby/build/master/ext/objspace' I, [2024-05-22T18:00:54.057838 #3183896] INFO -- : make[2]: Leaving directory '/home/opc/ruby/build/master/ext/json' I, [2024-05-22T18:00:54.061956 #3183896] INFO -- : make[2]: Entering directory '/home/opc/ruby/build/master/ext/pathname' I, [2024-05-22T18:00:54.063416 #3183896] INFO -- : make[2]: Leaving directory '/home/opc/ruby/build/master/ext/objspace' I, [2024-05-22T18:00:54.066049 #3183896] INFO -- : make[2]: Leaving directory '/home/opc/ruby/build/master/ext/pathname' I, [2024-05-22T18:00:54.069914 #3183896] INFO -- : make[2]: Entering directory '/home/opc/ruby/build/master/ext/psych' I, [2024-05-22T18:00:54.070346 #3183896] INFO -- : make[2]: Entering directory '/home/opc/ruby/build/master/ext/pty' I, [2024-05-22T18:00:54.074074 #3183896] INFO -- : make[2]: Entering directory '/home/opc/ruby/build/master/ext/openssl' I, [2024-05-22T18:00:54.077709 #3183896] INFO -- : make[2]: Leaving directory '/home/opc/ruby/build/master/ext/pty' I, [2024-05-22T18:00:54.085078 #3183896] INFO -- : make[2]: Leaving directory '/home/opc/ruby/build/master/ext/psych' I, [2024-05-22T18:00:54.087003 #3183896] INFO -- : make[2]: Entering directory '/home/opc/ruby/build/master/ext/rubyvm' I, [2024-05-22T18:00:54.092802 #3183896] INFO -- : make[2]: Entering directory '/home/opc/ruby/build/master/ext/ripper' I, [2024-05-22T18:00:54.093246 #3183896] INFO -- : make[2]: Leaving directory '/home/opc/ruby/build/master/ext/rubyvm' I, [2024-05-22T18:00:54.100119 #3183896] INFO -- : make[2]: Leaving directory '/home/opc/ruby/build/master/ext/openssl' I, [2024-05-22T18:00:54.100445 #3183896] INFO -- : make[2]: Leaving directory '/home/opc/ruby/build/master/ext/ripper' I, [2024-05-22T18:00:54.105916 #3183896] INFO -- : make[2]: Entering directory '/home/opc/ruby/build/master/ext/socket' I, [2024-05-22T18:00:54.107329 #3183896] INFO -- : make[2]: Entering directory '/home/opc/ruby/build/master/.bundle/gems/bigdecimal-3.1.7/ext/bigdecimal' I, [2024-05-22T18:00:54.111638 #3183896] INFO -- : make[2]: Entering directory '/home/opc/ruby/build/master/.bundle/gems/bigdecimal-3.1.8/ext/bigdecimal' I, [2024-05-22T18:00:54.118061 #3183896] INFO -- : make[2]: Leaving directory '/home/opc/ruby/build/master/ext/socket' I, [2024-05-22T18:00:54.123682 #3183896] INFO -- : make[2]: Entering directory '/home/opc/ruby/build/master/.bundle/gems/debug-1.9.2/ext/debug' I, [2024-05-22T18:00:54.138733 #3183896] INFO -- : make[2]: Leaving directory '/home/opc/ruby/build/master/.bundle/gems/bigdecimal-3.1.7/ext/bigdecimal' I, [2024-05-22T18:00:54.141238 #3183896] INFO -- : make[2]: Entering directory '/home/opc/ruby/build/master/.bundle/gems/nkf-0.2.0/ext/nkf' I, [2024-05-22T18:00:54.143297 #3183896] INFO -- : make[2]: Leaving directory '/home/opc/ruby/build/master/.bundle/gems/bigdecimal-3.1.8/ext/bigdecimal' I, [2024-05-22T18:00:54.150026 #3183896] INFO -- : make[2]: Entering directory '/home/opc/ruby/build/master/.bundle/gems/racc-1.7.3/ext/racc/cparse' I, [2024-05-22T18:00:54.156367 #3183896] INFO -- : make[2]: Leaving directory '/home/opc/ruby/build/master/.bundle/gems/debug-1.9.2/ext/debug' I, [2024-05-22T18:00:54.158812 #3183896] INFO -- : make[2]: Entering directory '/home/opc/ruby/build/master/.bundle/gems/racc-1.8.0/ext/racc/cparse' I, [2024-05-22T18:00:54.173049 #3183896] INFO -- : make[2]: Leaving directory '/home/opc/ruby/build/master/.bundle/gems/nkf-0.2.0/ext/nkf' I, [2024-05-22T18:00:54.176198 #3183896] INFO -- : make[2]: Entering directory '/home/opc/ruby/build/master/.bundle/gems/rbs-3.4.4/ext/rbs_extension' I, [2024-05-22T18:00:54.183428 #3183896] INFO -- : make[2]: Leaving directory '/home/opc/ruby/build/master/.bundle/gems/racc-1.7.3/ext/racc/cparse' I, [2024-05-22T18:00:54.186338 #3183896] INFO -- : make[2]: Entering directory '/home/opc/ruby/build/master/.bundle/gems/syslog-0.1.2/ext/syslog' I, [2024-05-22T18:00:54.191071 #3183896] INFO -- : make[2]: Leaving directory '/home/opc/ruby/build/master/.bundle/gems/racc-1.8.0/ext/racc/cparse' I, [2024-05-22T18:00:54.209313 #3183896] INFO -- : make[2]: Leaving directory '/home/opc/ruby/build/master/.bundle/gems/rbs-3.4.4/ext/rbs_extension' I, [2024-05-22T18:00:54.213935 #3183896] INFO -- : make[2]: Entering directory '/home/opc/ruby/build/master/ext/digest/sha2' I, [2024-05-22T18:00:54.218928 #3183896] INFO -- : make[2]: Leaving directory '/home/opc/ruby/build/master/ext/digest/sha2' I, [2024-05-22T18:00:54.220192 #3183896] INFO -- : make[2]: Leaving directory '/home/opc/ruby/build/master/.bundle/gems/syslog-0.1.2/ext/syslog' I, [2024-05-22T18:00:54.257931 #3183896] INFO -- : make[2]: Entering directory '/home/opc/ruby/build/master' I, [2024-05-22T18:00:54.342409 #3183896] INFO -- : make[2]: 'ruby' is up to date. I, [2024-05-22T18:00:54.342492 #3183896] INFO -- : make[2]: Leaving directory '/home/opc/ruby/build/master' I, [2024-05-22T18:00:54.342646 #3183896] INFO -- : make[1]: Leaving directory '/home/opc/ruby/build/master' I, [2024-05-22T18:00:54.347170 #3183896] INFO -- : make[1]: Entering directory '/home/opc/ruby/build/master' I, [2024-05-22T18:00:54.347227 #3183896] INFO -- : make[1]: Nothing to be done for 'note'. I, [2024-05-22T18:00:54.347239 #3183896] INFO -- : make[1]: Leaving directory '/home/opc/ruby/build/master' I, [2024-05-22T18:00:54.347395 #3183896] INFO -- : ./miniruby -I/home/opc/ruby/src/master/lib -I. -I.ext/common /home/opc/ruby/src/master/tool/runruby.rb --extout=.ext -- --disable-gems -r./aarch64-linux-fake /home/opc/ruby/src/master/tool/rbinstall.rb --make="make" --dest-dir="" --extout=".ext" --ext-build-dir="./ext" --mflags="-j3 --jobserver-auth=4,5" --make-flags=" -j3 --jobserver-auth=4,5" --data-mode=0644 --prog-mode=0755 --installed-list .installed.list --mantype="doc" --gnumake --install=all --exclude=doc I, [2024-05-22T18:00:54.496721 #3183896] INFO -- : Installing to I, [2024-05-22T18:00:54.496792 #3183896] INFO -- : installing binary commands: /home/opc/ruby/install/master/bin I, [2024-05-22T18:00:54.508766 #3183896] INFO -- : installing base libraries: /home/opc/ruby/install/master/lib I, [2024-05-22T18:00:54.509664 #3183896] INFO -- : installing arch files: /home/opc/ruby/install/master/lib/ruby/3.4.0+0/aarch64-linux I, [2024-05-22T18:00:54.509857 #3183896] INFO -- : installing pkgconfig data: /home/opc/ruby/install/master/lib/pkgconfig I, [2024-05-22T18:00:54.509911 #3183896] INFO -- : installing extension objects: /home/opc/ruby/install/master/lib/ruby/3.4.0+0/aarch64-linux I, [2024-05-22T18:00:54.522438 #3183896] INFO -- : installing extension objects: /home/opc/ruby/install/master/lib/ruby/site_ruby/3.4.0+0/aarch64-linux I, [2024-05-22T18:00:54.525621 #3183896] INFO -- : installing extension objects: /home/opc/ruby/install/master/lib/ruby/vendor_ruby/3.4.0+0/aarch64-linux I, [2024-05-22T18:00:54.525831 #3183896] INFO -- : installing extension headers: /home/opc/ruby/install/master/include/ruby-3.4.0+0/aarch64-linux I, [2024-05-22T18:00:54.526348 #3183896] INFO -- : installing extension scripts: /home/opc/ruby/install/master/lib/ruby/3.4.0+0 I, [2024-05-22T18:00:54.532004 #3183896] INFO -- : installing extension scripts: /home/opc/ruby/install/master/lib/ruby/site_ruby/3.4.0+0 I, [2024-05-22T18:00:54.532022 #3183896] INFO -- : installing extension scripts: /home/opc/ruby/install/master/lib/ruby/vendor_ruby/3.4.0+0 I, [2024-05-22T18:00:54.532033 #3183896] INFO -- : installing extension headers: /home/opc/ruby/install/master/include/ruby-3.4.0+0/ruby I, [2024-05-22T18:00:54.532148 #3183896] INFO -- : installing command scripts: /home/opc/ruby/install/master/bin I, [2024-05-22T18:00:54.532287 #3183896] INFO -- : installing library scripts: /home/opc/ruby/install/master/lib/ruby/3.4.0+0 I, [2024-05-22T18:00:54.619679 #3183896] INFO -- : installing common headers: /home/opc/ruby/install/master/include/ruby-3.4.0+0 I, [2024-05-22T18:00:54.635639 #3183896] INFO -- : installing manpages: /home/opc/ruby/install/master/share/man/man1 I, [2024-05-22T18:00:54.635925 #3183896] INFO -- : installing default gems from lib: /home/opc/ruby/install/master/lib/ruby/gems/3.4.0+0 I, [2024-05-22T18:00:54.677245 #3183896] INFO -- : benchmark 0.3.0 I, [2024-05-22T18:00:54.681520 #3183896] INFO -- : bundler 2.6.0.dev I, [2024-05-22T18:00:54.686962 #3183896] INFO -- : cgi 0.4.1 I, [2024-05-22T18:00:54.688127 #3183896] INFO -- : delegate 0.3.1 I, [2024-05-22T18:00:54.689314 #3183896] INFO -- : did_you_mean 1.6.3 I, [2024-05-22T18:00:54.690428 #3183896] INFO -- : english 0.8.0 I, [2024-05-22T18:00:54.691515 #3183896] INFO -- : erb 4.0.4 I, [2024-05-22T18:00:54.694229 #3183896] INFO -- : error_highlight 0.6.0 I, [2024-05-22T18:00:54.695310 #3183896] INFO -- : fileutils 1.7.2 I, [2024-05-22T18:00:54.696407 #3183896] INFO -- : find 0.2.0 I, [2024-05-22T18:00:54.697568 #3183896] INFO -- : forwardable 1.3.3 I, [2024-05-22T18:00:54.698659 #3183896] INFO -- : ipaddr 1.2.6 I, [2024-05-22T18:00:54.699733 #3183896] INFO -- : irb 1.13.1 I, [2024-05-22T18:00:54.704541 #3183896] INFO -- : logger 1.6.0 I, [2024-05-22T18:00:54.705824 #3183896] INFO -- : net-http 0.4.1 I, [2024-05-22T18:00:54.706975 #3183896] INFO -- : net-protocol 0.2.2 I, [2024-05-22T18:00:54.708120 #3183896] INFO -- : open-uri 0.4.1 I, [2024-05-22T18:00:54.709365 #3183896] INFO -- : open3 0.2.1 I, [2024-05-22T18:00:54.710491 #3183896] INFO -- : optparse 0.5.0 I, [2024-05-22T18:00:54.711649 #3183896] INFO -- : ostruct 0.6.0 I, [2024-05-22T18:00:54.712785 #3183896] INFO -- : pp 0.5.0 I, [2024-05-22T18:00:54.714004 #3183896] INFO -- : prettyprint 0.2.0 I, [2024-05-22T18:00:54.715100 #3183896] INFO -- : prism 0.29.0 I, [2024-05-22T18:00:54.716577 #3183896] INFO -- : pstore 0.1.3 I, [2024-05-22T18:00:54.717702 #3183896] INFO -- : rdoc 6.6.3.1 I, [2024-05-22T18:00:54.721616 #3183896] INFO -- : readline 0.0.4 I, [2024-05-22T18:00:54.722718 #3183896] INFO -- : reline 0.5.7 I, [2024-05-22T18:00:54.723901 #3183896] INFO -- : resolv 0.4.0 I, [2024-05-22T18:00:54.725057 #3183896] INFO -- : ruby2_keywords 0.0.5 I, [2024-05-22T18:00:54.726209 #3183896] INFO -- : securerandom 0.3.1 I, [2024-05-22T18:00:54.727289 #3183896] INFO -- : set 1.1.0 I, [2024-05-22T18:00:54.728402 #3183896] INFO -- : shellwords 0.2.0 I, [2024-05-22T18:00:54.729583 #3183896] INFO -- : singleton 0.2.0 I, [2024-05-22T18:00:54.730698 #3183896] INFO -- : syntax_suggest 2.0.0 I, [2024-05-22T18:00:54.733125 #3183896] INFO -- : tempfile 0.2.1 I, [2024-05-22T18:00:54.734278 #3183896] INFO -- : time 0.3.0 I, [2024-05-22T18:00:54.736901 #3183896] INFO -- : timeout 0.4.1 I, [2024-05-22T18:00:54.738537 #3183896] INFO -- : tmpdir 0.2.0 I, [2024-05-22T18:00:54.739693 #3183896] INFO -- : tsort 0.2.0 I, [2024-05-22T18:00:54.740818 #3183896] INFO -- : un 0.3.0 I, [2024-05-22T18:00:54.741966 #3183896] INFO -- : uri 0.13.0 I, [2024-05-22T18:00:54.743110 #3183896] INFO -- : weakref 0.1.3 I, [2024-05-22T18:00:54.744213 #3183896] INFO -- : yaml 0.3.0 I, [2024-05-22T18:00:54.745183 #3183896] INFO -- : installing default gems from ext: /home/opc/ruby/install/master/lib/ruby/gems/3.4.0+0 I, [2024-05-22T18:00:54.755003 #3183896] INFO -- : date 3.3.4 I, [2024-05-22T18:00:54.756199 #3183896] INFO -- : digest 3.1.1 I, [2024-05-22T18:00:54.757363 #3183896] INFO -- : etc 1.4.3 I, [2024-05-22T18:00:54.758536 #3183896] INFO -- : fcntl 1.1.0 I, [2024-05-22T18:00:54.759662 #3183896] INFO -- : fiddle 1.1.3 I, [2024-05-22T18:00:54.760853 #3183896] INFO -- : io-console 0.7.2 I, [2024-05-22T18:00:54.762010 #3183896] INFO -- : io-nonblock 0.3.0 I, [2024-05-22T18:00:54.763105 #3183896] INFO -- : io-wait 0.3.1 I, [2024-05-22T18:00:54.766158 #3183896] INFO -- : json 2.7.2 I, [2024-05-22T18:00:54.767390 #3183896] INFO -- : openssl 3.2.0 I, [2024-05-22T18:00:54.768605 #3183896] INFO -- : pathname 0.3.0 I, [2024-05-22T18:00:54.769773 #3183896] INFO -- : psych 5.1.2 I, [2024-05-22T18:00:54.771017 #3183896] INFO -- : stringio 3.1.1 I, [2024-05-22T18:00:54.772200 #3183896] INFO -- : strscan 3.1.1 I, [2024-05-22T18:00:54.773355 #3183896] INFO -- : zlib 3.1.0 I, [2024-05-22T18:00:54.774305 #3183896] INFO -- : installing bundled gems: /home/opc/ruby/install/master/lib/ruby/gems/3.4.0+0 I, [2024-05-22T18:00:54.775319 #3183896] INFO -- : minitest 5.23.1 I, [2024-05-22T18:00:54.798376 #3183896] INFO -- : rake 13.2.1 I, [2024-05-22T18:00:54.812279 #3183896] INFO -- : test-unit 3.6.2 I, [2024-05-22T18:00:54.827616 #3183896] INFO -- : rexml 3.2.8 I, [2024-05-22T18:00:54.842344 #3183896] INFO -- : rss 0.3.0 I, [2024-05-22T18:00:54.854348 #3183896] INFO -- : net-ftp 0.3.4 I, [2024-05-22T18:00:54.858246 #3183896] INFO -- : net-imap 0.4.11 I, [2024-05-22T18:00:54.875437 #3183896] INFO -- : net-pop 0.1.2 I, [2024-05-22T18:00:54.878153 #3183896] INFO -- : net-smtp 0.5.0 I, [2024-05-22T18:00:54.881709 #3183896] INFO -- : matrix 0.4.2 I, [2024-05-22T18:00:54.887936 #3183896] INFO -- : prime 0.1.2 I, [2024-05-22T18:00:54.899276 #3183896] INFO -- : rbs 3.4.4 I, [2024-05-22T18:00:55.001827 #3183896] INFO -- : typeprof 0.21.11 I, [2024-05-22T18:00:55.010604 #3183896] INFO -- : debug 1.9.2 I, [2024-05-22T18:00:55.022762 #3183896] INFO -- : racc 1.8.0 I, [2024-05-22T18:00:55.033033 #3183896] INFO -- : mutex_m 0.2.0 I, [2024-05-22T18:00:55.036189 #3183896] INFO -- : getoptlong 0.2.1 I, [2024-05-22T18:00:55.041237 #3183896] INFO -- : base64 0.2.0 I, [2024-05-22T18:00:55.043812 #3183896] INFO -- : bigdecimal 3.1.8 I, [2024-05-22T18:00:55.050146 #3183896] INFO -- : observer 0.1.2 I, [2024-05-22T18:00:55.053299 #3183896] INFO -- : abbrev 0.1.2 I, [2024-05-22T18:00:55.056254 #3183896] INFO -- : resolv-replace 0.1.1 I, [2024-05-22T18:00:55.061455 #3183896] INFO -- : rinda 0.2.0 I, [2024-05-22T18:00:55.064994 #3183896] INFO -- : drb 2.2.1 I, [2024-05-22T18:00:55.069692 #3183896] INFO -- : nkf 0.2.0 I, [2024-05-22T18:00:55.076651 #3183896] INFO -- : syslog 0.1.2 I, [2024-05-22T18:00:55.081701 #3183896] INFO -- : csv 3.3.0 I, [2024-05-22T18:00:55.090914 #3183896] INFO -- : installing bundled gem cache: /home/opc/ruby/install/master/lib/ruby/gems/3.4.0+0/cache I, [2024-05-22T18:00:55.092907 #3183896] INFO -- : skipped bundled gems: I, [2024-05-22T18:00:55.092933 #3183896] INFO -- : power_assert-2.0.4dev.gem not found in bundled_gems I, [2024-05-22T18:00:55.096117 #3183896] INFO -- : $$$[end] "make install -j3" exit with 0. I, [2024-05-22T18:00:55.096266 #3183896] INFO -- : $$$[beg] make yes-btest TESTOPTS='-q -j3' I, [2024-05-22T18:01:18.245142 #3183896] INFO -- : PASS all 1936 tests E, [2024-05-22T18:01:18.247415 #3183896] ERROR -- : I, [2024-05-22T18:01:18.247546 #3183896] INFO -- : $$$[end] "make yes-btest TESTOPTS='-q -j3'" exit with 0. I, [2024-05-22T18:01:18.247705 #3183896] INFO -- : $$$[beg] make yes-test-basic TESTS='-j3' I, [2024-05-22T18:01:18.347639 #3183896] INFO -- : BASERUBY = /usr/local/bin/ruby --disable=gems I, [2024-05-22T18:01:18.347735 #3183896] INFO -- : CC = gcc I, [2024-05-22T18:01:18.347746 #3183896] INFO -- : LD = ld I, [2024-05-22T18:01:18.347755 #3183896] INFO -- : LDSHARED = gcc -shared I, [2024-05-22T18:01:18.347787 #3183896] INFO -- : CFLAGS = -O3 -fno-fast-math -ggdb3 -Wall -Wextra -Wdeprecated-declarations -Wdiv-by-zero -Wduplicated-cond -Wimplicit-function-declaration -Wimplicit-int -Wpointer-arith -Wwrite-strings -Wold-style-definition -Wimplicit-fallthrough=0 -Wmissing-noreturn -Wno-cast-function-type -Wno-constant-logical-operand -Wno-long-long -Wno-missing-field-initializers -Wno-overlength-strings -Wno-packed-bitfield-compat -Wno-parentheses-equality -Wno-self-assign -Wno-tautological-compare -Wno-unused-parameter -Wno-unused-value -Wsuggest-attribute=format -Wsuggest-attribute=noreturn -Wunused-variable -Wmisleading-indentation -Wundef I, [2024-05-22T18:01:18.347798 #3183896] INFO -- : XCFLAGS = -U_FORTIFY_SOURCE -D_FORTIFY_SOURCE=2 -fstack-protector-strong -msign-return-address=all -fno-strict-overflow -fvisibility=hidden -fexcess-precision=standard -DRUBY_EXPORT -fPIE -I. -I.ext/include/aarch64-linux -I/home/opc/ruby/src/master/include -I/home/opc/ruby/src/master -I/home/opc/ruby/src/master/prism -I/home/opc/ruby/src/master/enc/unicode/15.0.0 I, [2024-05-22T18:01:18.347807 #3183896] INFO -- : CPPFLAGS = I, [2024-05-22T18:01:18.347815 #3183896] INFO -- : DLDFLAGS = -Wl,--compress-debug-sections=zlib -fstack-protector-strong -pie I, [2024-05-22T18:01:18.347824 #3183896] INFO -- : SOLIBS = -lz -lrt -lrt -ldl -lcrypt -lm -lpthread I, [2024-05-22T18:01:18.347832 #3183896] INFO -- : LANG = en_US.UTF-8 I, [2024-05-22T18:01:18.347840 #3183896] INFO -- : LC_ALL = I, [2024-05-22T18:01:18.347848 #3183896] INFO -- : LC_CTYPE = I, [2024-05-22T18:01:18.347856 #3183896] INFO -- : MFLAGS = I, [2024-05-22T18:01:18.347864 #3183896] INFO -- : RUSTC = rustc I, [2024-05-22T18:01:18.347873 #3183896] INFO -- : YJIT_RUSTC_ARGS = --crate-name=yjit --crate-type=staticlib --edition=2021 -g -C lto=thin -C opt-level=3 -C overflow-checks=on '--out-dir=/home/opc/ruby/build/master/yjit/target/release/' /home/opc/ruby/src/master/yjit/src/lib.rs I, [2024-05-22T18:01:18.348749 #3183896] INFO -- : gcc (GCC) 8.5.0 20210514 (Red Hat 8.5.0-10.1.0.1) I, [2024-05-22T18:01:18.348810 #3183896] INFO -- : Copyright (C) 2018 Free Software Foundation, Inc. I, [2024-05-22T18:01:18.348821 #3183896] INFO -- : This is free software; see the source for copying conditions. There is NO I, [2024-05-22T18:01:18.348831 #3183896] INFO -- : warranty; not even for MERCHANTABILITY or FITNESS FOR A PARTICULAR PURPOSE. I, [2024-05-22T18:01:18.348840 #3183896] INFO -- : I, [2024-05-22T18:01:18.507829 #3183896] INFO -- : Checking leaked global symbols...none I, [2024-05-22T18:01:18.563662 #3183896] INFO -- : /home/opc/ruby/src/master/basictest/test.rb:assignment ....................................................................................................................................................................................................................................................................................................................................................................................OK 372 I, [2024-05-22T18:01:18.563743 #3183896] INFO -- : /home/opc/ruby/src/master/basictest/test.rb:condition ..OK 2 I, [2024-05-22T18:01:18.563773 #3183896] INFO -- : /home/opc/ruby/src/master/basictest/test.rb:if/unless ...OK 3 I, [2024-05-22T18:01:18.563819 #3183896] INFO -- : /home/opc/ruby/src/master/basictest/test.rb:case .....OK 5 I, [2024-05-22T18:01:18.564508 #3183896] INFO -- : /home/opc/ruby/src/master/basictest/test.rb:while/until ........OK 8 I, [2024-05-22T18:01:18.564629 #3183896] INFO -- : /home/opc/ruby/src/master/basictest/test.rb:exception ..........OK 10 I, [2024-05-22T18:01:18.565295 #3183896] INFO -- : /home/opc/ruby/src/master/basictest/test.rb:array .......................................OK 39 I, [2024-05-22T18:01:18.565561 #3183896] INFO -- : /home/opc/ruby/src/master/basictest/test.rb:hash ...........................OK 27 I, [2024-05-22T18:01:18.567253 #3183896] INFO -- : /home/opc/ruby/src/master/basictest/test.rb:iterator ...........................................................................................................OK 107 I, [2024-05-22T18:01:18.567991 #3183896] INFO -- : /home/opc/ruby/src/master/basictest/test.rb:float ................................................................................OK 80 I, [2024-05-22T18:01:18.571574 #3183896] INFO -- : /home/opc/ruby/src/master/basictest/test.rb:bignum ...............................OK 31 I, [2024-05-22T18:01:18.573347 #3183896] INFO -- : /home/opc/ruby/src/master/basictest/test.rb:string & char ..............................................................OK 62 I, [2024-05-22T18:01:18.573596 #3183896] INFO -- : /home/opc/ruby/src/master/basictest/test.rb:assignment ..........OK 10 I, [2024-05-22T18:01:18.573670 #3183896] INFO -- : /home/opc/ruby/src/master/basictest/test.rb:call ......OK 6 I, [2024-05-22T18:01:18.573802 #3183896] INFO -- : /home/opc/ruby/src/master/basictest/test.rb:proc .........OK 9 I, [2024-05-22T18:01:18.674140 #3183896] INFO -- : /home/opc/ruby/src/master/basictest/test.rb:signal ..OK 2 I, [2024-05-22T18:01:18.675708 #3183896] INFO -- : /home/opc/ruby/src/master/basictest/test.rb:eval ...........................OK 27 I, [2024-05-22T18:01:18.823549 #3183896] INFO -- : /home/opc/ruby/src/master/basictest/test.rb:system ........OK 8 I, [2024-05-22T18:01:18.823627 #3183896] INFO -- : /home/opc/ruby/src/master/basictest/test.rb:const .....OK 5 I, [2024-05-22T18:01:18.823714 #3183896] INFO -- : /home/opc/ruby/src/master/basictest/test.rb:clone .....OK 5 I, [2024-05-22T18:01:18.823967 #3183896] INFO -- : /home/opc/ruby/src/master/basictest/test.rb:marshal ....OK 4 I, [2024-05-22T18:01:18.824046 #3183896] INFO -- : /home/opc/ruby/src/master/basictest/test.rb:pack ....OK 4 I, [2024-05-22T18:01:18.824093 #3183896] INFO -- : /home/opc/ruby/src/master/basictest/test.rb:math ..OK 2 I, [2024-05-22T18:01:18.824173 #3183896] INFO -- : /home/opc/ruby/src/master/basictest/test.rb:struct ......OK 6 I, [2024-05-22T18:01:18.824348 #3183896] INFO -- : /home/opc/ruby/src/master/basictest/test.rb:variable ............OK 12 I, [2024-05-22T18:01:18.824390 #3183896] INFO -- : /home/opc/ruby/src/master/basictest/test.rb:trace ...OK 3 I, [2024-05-22T18:01:18.824545 #3183896] INFO -- : /home/opc/ruby/src/master/basictest/test.rb:defined? ............OK 12 I, [2024-05-22T18:01:18.824637 #3183896] INFO -- : /home/opc/ruby/src/master/basictest/test.rb:alias ......OK 6 I, [2024-05-22T18:01:18.825240 #3183896] INFO -- : /home/opc/ruby/src/master/basictest/test.rb:path .......................OK 23 I, [2024-05-22T18:01:18.894987 #3183896] INFO -- : /home/opc/ruby/src/master/basictest/test.rb:gc ....OK 4 I, [2024-05-22T18:01:18.897262 #3183896] INFO -- : I, [2024-05-22T18:01:18.897307 #3183896] INFO -- : test succeeded I, [2024-05-22T18:01:18.898106 #3183896] INFO -- : $$$[end] "make yes-test-basic TESTS='-j3'" exit with 0. I, [2024-05-22T18:01:18.898318 #3183896] INFO -- : $$$[beg] make yes-test-all TESTOPTS='--stderr-on-failure' TESTS='-j3' I, [2024-05-22T18:01:19.027782 #3183896] INFO -- : BASERUBY = /usr/local/bin/ruby --disable=gems I, [2024-05-22T18:01:19.027866 #3183896] INFO -- : CC = gcc I, [2024-05-22T18:01:19.027877 #3183896] INFO -- : LD = ld I, [2024-05-22T18:01:19.027886 #3183896] INFO -- : LDSHARED = gcc -shared I, [2024-05-22T18:01:19.027899 #3183896] INFO -- : CFLAGS = -O3 -fno-fast-math -ggdb3 -Wall -Wextra -Wdeprecated-declarations -Wdiv-by-zero -Wduplicated-cond -Wimplicit-function-declaration -Wimplicit-int -Wpointer-arith -Wwrite-strings -Wold-style-definition -Wimplicit-fallthrough=0 -Wmissing-noreturn -Wno-cast-function-type -Wno-constant-logical-operand -Wno-long-long -Wno-missing-field-initializers -Wno-overlength-strings -Wno-packed-bitfield-compat -Wno-parentheses-equality -Wno-self-assign -Wno-tautological-compare -Wno-unused-parameter -Wno-unused-value -Wsuggest-attribute=format -Wsuggest-attribute=noreturn -Wunused-variable -Wmisleading-indentation -Wundef I, [2024-05-22T18:01:19.027910 #3183896] INFO -- : XCFLAGS = -U_FORTIFY_SOURCE -D_FORTIFY_SOURCE=2 -fstack-protector-strong -msign-return-address=all -fno-strict-overflow -fvisibility=hidden -fexcess-precision=standard -DRUBY_EXPORT -fPIE -I. -I.ext/include/aarch64-linux -I/home/opc/ruby/src/master/include -I/home/opc/ruby/src/master -I/home/opc/ruby/src/master/prism -I/home/opc/ruby/src/master/enc/unicode/15.0.0 I, [2024-05-22T18:01:19.027921 #3183896] INFO -- : CPPFLAGS = I, [2024-05-22T18:01:19.027930 #3183896] INFO -- : DLDFLAGS = -Wl,--compress-debug-sections=zlib -fstack-protector-strong -pie I, [2024-05-22T18:01:19.027940 #3183896] INFO -- : SOLIBS = -lz -lrt -lrt -ldl -lcrypt -lm -lpthread I, [2024-05-22T18:01:19.027950 #3183896] INFO -- : LANG = en_US.UTF-8 I, [2024-05-22T18:01:19.027959 #3183896] INFO -- : LC_ALL = I, [2024-05-22T18:01:19.027968 #3183896] INFO -- : LC_CTYPE = I, [2024-05-22T18:01:19.027976 #3183896] INFO -- : MFLAGS = I, [2024-05-22T18:01:19.027985 #3183896] INFO -- : RUSTC = rustc I, [2024-05-22T18:01:19.027994 #3183896] INFO -- : YJIT_RUSTC_ARGS = --crate-name=yjit --crate-type=staticlib --edition=2021 -g -C lto=thin -C opt-level=3 -C overflow-checks=on '--out-dir=/home/opc/ruby/build/master/yjit/target/release/' /home/opc/ruby/src/master/yjit/src/lib.rs I, [2024-05-22T18:01:19.028820 #3183896] INFO -- : gcc (GCC) 8.5.0 20210514 (Red Hat 8.5.0-10.1.0.1) I, [2024-05-22T18:01:19.028851 #3183896] INFO -- : Copyright (C) 2018 Free Software Foundation, Inc. I, [2024-05-22T18:01:19.028862 #3183896] INFO -- : This is free software; see the source for copying conditions. There is NO I, [2024-05-22T18:01:19.028871 #3183896] INFO -- : warranty; not even for MERCHANTABILITY or FITNESS FOR A PARTICULAR PURPOSE. I, [2024-05-22T18:01:19.028881 #3183896] INFO -- : I, [2024-05-22T18:01:19.031153 #3183896] INFO -- : generating enc.mk I, [2024-05-22T18:01:19.273581 #3183896] INFO -- : generating encdb.h I, [2024-05-22T18:01:19.312044 #3183896] INFO -- : encdb.h unchanged I, [2024-05-22T18:01:19.313355 #3183896] INFO -- : making enc I, [2024-05-22T18:01:19.340724 #3183896] INFO -- : make[1]: Entering directory '/home/opc/ruby/build/master' I, [2024-05-22T18:01:19.340769 #3183896] INFO -- : make[1]: Nothing to be done for 'enc'. I, [2024-05-22T18:01:19.340783 #3183896] INFO -- : make[1]: Leaving directory '/home/opc/ruby/build/master' I, [2024-05-22T18:01:19.341630 #3183896] INFO -- : making srcs under enc I, [2024-05-22T18:01:19.383696 #3183896] INFO -- : make[1]: Entering directory '/home/opc/ruby/build/master' I, [2024-05-22T18:01:19.383787 #3183896] INFO -- : make[1]: Nothing to be done for 'srcs'. I, [2024-05-22T18:01:19.383808 #3183896] INFO -- : make[1]: Leaving directory '/home/opc/ruby/build/master' I, [2024-05-22T18:01:19.384937 #3183896] INFO -- : generating transdb.h I, [2024-05-22T18:01:19.532798 #3183896] INFO -- : transdb.h unchanged I, [2024-05-22T18:01:19.534456 #3183896] INFO -- : making trans I, [2024-05-22T18:01:19.583287 #3183896] INFO -- : make[1]: Entering directory '/home/opc/ruby/build/master' I, [2024-05-22T18:01:19.583386 #3183896] INFO -- : make[1]: Nothing to be done for 'trans'. I, [2024-05-22T18:01:19.583408 #3183896] INFO -- : make[1]: Leaving directory '/home/opc/ruby/build/master' I, [2024-05-22T18:01:19.584152 #3183896] INFO -- : making encs I, [2024-05-22T18:01:19.636905 #3183896] INFO -- : make[1]: Entering directory '/home/opc/ruby/build/master' I, [2024-05-22T18:01:19.636962 #3183896] INFO -- : make[1]: Nothing to be done for 'encs'. I, [2024-05-22T18:01:19.636973 #3183896] INFO -- : make[1]: Leaving directory '/home/opc/ruby/build/master' I, [2024-05-22T18:01:19.639126 #3183896] INFO -- : generating makefiles ext/configure-ext.mk I, [2024-05-22T18:01:19.682382 #3183896] INFO -- : ext/configure-ext.mk updated I, [2024-05-22T18:01:19.685785 #3183896] INFO -- : make[1]: Entering directory '/home/opc/ruby/build/master' I, [2024-05-22T18:01:21.986241 #3183896] INFO -- : make[1]: Leaving directory '/home/opc/ruby/build/master' I, [2024-05-22T18:01:21.987003 #3183896] INFO -- : generating makefile exts.mk I, [2024-05-22T18:01:22.050222 #3183896] INFO -- : exts.mk unchanged I, [2024-05-22T18:01:22.056933 #3183896] INFO -- : make[1]: Entering directory '/home/opc/ruby/build/master' I, [2024-05-22T18:01:22.371246 #3183896] INFO -- : make[2]: Entering directory '/home/opc/ruby/build/master/ext/coverage' I, [2024-05-22T18:01:22.376178 #3183896] INFO -- : make[2]: Leaving directory '/home/opc/ruby/build/master/ext/coverage' I, [2024-05-22T18:01:22.381985 #3183896] INFO -- : make[2]: Entering directory '/home/opc/ruby/build/master/ext/date' I, [2024-05-22T18:01:22.387551 #3183896] INFO -- : make[2]: Leaving directory '/home/opc/ruby/build/master/ext/date' I, [2024-05-22T18:01:22.391055 #3183896] INFO -- : make[2]: Entering directory '/home/opc/ruby/build/master/ext/digest' I, [2024-05-22T18:01:22.400525 #3183896] INFO -- : make[2]: Leaving directory '/home/opc/ruby/build/master/ext/digest' I, [2024-05-22T18:01:22.423955 #3183896] INFO -- : make[2]: Entering directory '/home/opc/ruby/build/master/ext/digest/sha2' I, [2024-05-22T18:01:22.429412 #3183896] INFO -- : make[2]: Leaving directory '/home/opc/ruby/build/master/ext/digest/sha2' I, [2024-05-22T18:01:22.448447 #3183896] INFO -- : make[2]: Entering directory '/home/opc/ruby/build/master/ext/fiddle' I, [2024-05-22T18:01:22.459108 #3183896] INFO -- : make[2]: Leaving directory '/home/opc/ruby/build/master/ext/fiddle' I, [2024-05-22T18:01:22.463691 #3183896] INFO -- : make[2]: Entering directory '/home/opc/ruby/build/master/ext/io/console' I, [2024-05-22T18:01:22.468375 #3183896] INFO -- : make[2]: Leaving directory '/home/opc/ruby/build/master/ext/io/console' I, [2024-05-22T18:01:22.479740 #3183896] INFO -- : make[2]: Entering directory '/home/opc/ruby/build/master/ext/json' I, [2024-05-22T18:01:22.489655 #3183896] INFO -- : make[2]: Leaving directory '/home/opc/ruby/build/master/ext/json' I, [2024-05-22T18:01:22.503355 #3183896] INFO -- : make[2]: Entering directory '/home/opc/ruby/build/master/ext/monitor' I, [2024-05-22T18:01:22.507868 #3183896] INFO -- : make[2]: Leaving directory '/home/opc/ruby/build/master/ext/monitor' I, [2024-05-22T18:01:22.514136 #3183896] INFO -- : make[2]: Entering directory '/home/opc/ruby/build/master/ext/objspace' I, [2024-05-22T18:01:22.520298 #3183896] INFO -- : make[2]: Leaving directory '/home/opc/ruby/build/master/ext/objspace' I, [2024-05-22T18:01:22.539447 #3183896] INFO -- : make[2]: Entering directory '/home/opc/ruby/build/master/ext/openssl' I, [2024-05-22T18:01:22.561454 #3183896] INFO -- : make[2]: Leaving directory '/home/opc/ruby/build/master/ext/openssl' I, [2024-05-22T18:01:22.565913 #3183896] INFO -- : make[2]: Entering directory '/home/opc/ruby/build/master/ext/pathname' I, [2024-05-22T18:01:22.570417 #3183896] INFO -- : make[2]: Leaving directory '/home/opc/ruby/build/master/ext/pathname' I, [2024-05-22T18:01:22.576965 #3183896] INFO -- : make[2]: Entering directory '/home/opc/ruby/build/master/ext/psych' I, [2024-05-22T18:01:22.598751 #3183896] INFO -- : make[2]: Leaving directory '/home/opc/ruby/build/master/ext/psych' I, [2024-05-22T18:01:22.603376 #3183896] INFO -- : make[2]: Entering directory '/home/opc/ruby/build/master/ext/pty' I, [2024-05-22T18:01:22.607962 #3183896] INFO -- : make[2]: Leaving directory '/home/opc/ruby/build/master/ext/pty' I, [2024-05-22T18:01:22.621702 #3183896] INFO -- : make[2]: Entering directory '/home/opc/ruby/build/master/ext/ripper' I, [2024-05-22T18:01:22.629740 #3183896] INFO -- : make[2]: Leaving directory '/home/opc/ruby/build/master/ext/ripper' I, [2024-05-22T18:01:22.631814 #3183896] INFO -- : make[2]: Entering directory '/home/opc/ruby/build/master/ext/rubyvm' I, [2024-05-22T18:01:22.635564 #3183896] INFO -- : make[2]: Leaving directory '/home/opc/ruby/build/master/ext/rubyvm' I, [2024-05-22T18:01:22.647916 #3183896] INFO -- : make[2]: Entering directory '/home/opc/ruby/build/master/ext/socket' I, [2024-05-22T18:01:22.658794 #3183896] INFO -- : make[2]: Leaving directory '/home/opc/ruby/build/master/ext/socket' I, [2024-05-22T18:01:22.674704 #3183896] INFO -- : make[2]: Entering directory '/home/opc/ruby/build/master/.bundle/gems/bigdecimal-3.1.7/ext/bigdecimal' I, [2024-05-22T18:01:22.707194 #3183896] INFO -- : make[2]: Leaving directory '/home/opc/ruby/build/master/.bundle/gems/bigdecimal-3.1.7/ext/bigdecimal' I, [2024-05-22T18:01:22.709996 #3183896] INFO -- : make[2]: Entering directory '/home/opc/ruby/build/master/.bundle/gems/bigdecimal-3.1.8/ext/bigdecimal' I, [2024-05-22T18:01:22.741211 #3183896] INFO -- : make[2]: Leaving directory '/home/opc/ruby/build/master/.bundle/gems/bigdecimal-3.1.8/ext/bigdecimal' I, [2024-05-22T18:01:22.743903 #3183896] INFO -- : make[2]: Entering directory '/home/opc/ruby/build/master/.bundle/gems/debug-1.9.2/ext/debug' I, [2024-05-22T18:01:22.776379 #3183896] INFO -- : make[2]: Leaving directory '/home/opc/ruby/build/master/.bundle/gems/debug-1.9.2/ext/debug' I, [2024-05-22T18:01:22.778304 #3183896] INFO -- : make[2]: Entering directory '/home/opc/ruby/build/master/.bundle/gems/nkf-0.2.0/ext/nkf' I, [2024-05-22T18:01:22.809923 #3183896] INFO -- : make[2]: Leaving directory '/home/opc/ruby/build/master/.bundle/gems/nkf-0.2.0/ext/nkf' I, [2024-05-22T18:01:22.812567 #3183896] INFO -- : make[2]: Entering directory '/home/opc/ruby/build/master/.bundle/gems/racc-1.7.3/ext/racc/cparse' I, [2024-05-22T18:01:22.844005 #3183896] INFO -- : make[2]: Leaving directory '/home/opc/ruby/build/master/.bundle/gems/racc-1.7.3/ext/racc/cparse' I, [2024-05-22T18:01:22.846787 #3183896] INFO -- : make[2]: Entering directory '/home/opc/ruby/build/master/.bundle/gems/racc-1.8.0/ext/racc/cparse' I, [2024-05-22T18:01:22.879133 #3183896] INFO -- : make[2]: Leaving directory '/home/opc/ruby/build/master/.bundle/gems/racc-1.8.0/ext/racc/cparse' I, [2024-05-22T18:01:22.882283 #3183896] INFO -- : make[2]: Entering directory '/home/opc/ruby/build/master/.bundle/gems/rbs-3.4.4/ext/rbs_extension' I, [2024-05-22T18:01:22.914332 #3183896] INFO -- : make[2]: Leaving directory '/home/opc/ruby/build/master/.bundle/gems/rbs-3.4.4/ext/rbs_extension' I, [2024-05-22T18:01:22.916928 #3183896] INFO -- : make[2]: Entering directory '/home/opc/ruby/build/master/.bundle/gems/syslog-0.1.2/ext/syslog' I, [2024-05-22T18:01:22.948889 #3183896] INFO -- : make[2]: Leaving directory '/home/opc/ruby/build/master/.bundle/gems/syslog-0.1.2/ext/syslog' I, [2024-05-22T18:01:22.987295 #3183896] INFO -- : make[2]: Entering directory '/home/opc/ruby/build/master' I, [2024-05-22T18:01:23.074870 #3183896] INFO -- : make[2]: 'ruby' is up to date. I, [2024-05-22T18:01:23.074954 #3183896] INFO -- : make[2]: Leaving directory '/home/opc/ruby/build/master' I, [2024-05-22T18:01:23.075101 #3183896] INFO -- : make[1]: Leaving directory '/home/opc/ruby/build/master' I, [2024-05-22T18:01:23.079679 #3183896] INFO -- : make[1]: Entering directory '/home/opc/ruby/build/master' I, [2024-05-22T18:01:23.079717 #3183896] INFO -- : make[1]: Nothing to be done for 'note'. I, [2024-05-22T18:01:23.079748 #3183896] INFO -- : make[1]: Leaving directory '/home/opc/ruby/build/master' I, [2024-05-22T18:01:23.198727 #3183896] INFO -- : Run options: I, [2024-05-22T18:01:23.198821 #3183896] INFO -- : --seed=51513 I, [2024-05-22T18:01:23.198841 #3183896] INFO -- : "--ruby=./miniruby -I/home/opc/ruby/src/master/lib -I. -I.ext/common /home/opc/ruby/src/master/tool/runruby.rb --extout=.ext -- --disable-gems" I, [2024-05-22T18:01:23.198860 #3183896] INFO -- : --excludes-dir=/home/opc/ruby/src/master/test/.excludes I, [2024-05-22T18:01:23.198877 #3183896] INFO -- : --name=!/memory_leak/ I, [2024-05-22T18:01:23.198894 #3183896] INFO -- : --stderr-on-failure I, [2024-05-22T18:01:23.198911 #3183896] INFO -- : -j3 I, [2024-05-22T18:01:23.198927 #3183896] INFO -- : I, [2024-05-22T18:01:23.198943 #3183896] INFO -- : # Running tests: I, [2024-05-22T18:01:23.198952 #3183896] INFO -- : I, [2024-05-22T18:01:23.351478 #3183896] INFO -- : [ 1/885] 3224850=test_gem_commands_yank_command I, [2024-05-22T18:01:23.355514 #3183896] INFO -- : [ 2/885] 3224852=test_yaml_tree I, [2024-05-22T18:01:23.384002 #3183896] INFO -- : [ 3/885] 3224851=test_cstr I, [2024-05-22T18:01:23.402588 #3183896] INFO -- : [ 4/885] 3224852=test_gem_resolver_dependency_request I, [2024-05-22T18:01:23.501487 #3183896] INFO -- : [ 5/885] 3224851=test_euc_tw I, [2024-05-22T18:01:23.579204 #3183896] INFO -- : [ 6/885] 3224851=test_command I, [2024-05-22T18:01:23.611278 #3183896] INFO -- : [ 7/885] 3224852=test_big2str I, [2024-05-22T18:01:23.617649 #3183896] INFO -- : [ 8/885] 3224852=test_gem_resolver_specification I, [2024-05-22T18:01:23.662041 #3183896] INFO -- : [ 9/885] 3224852=test_pkey_dsa I, [2024-05-22T18:01:23.948739 #3183896] INFO -- : [ 10/885] 3224851=test_logger I, [2024-05-22T18:01:23.988719 #3183896] INFO -- : [ 11/885] 3224851=test_wait I, [2024-05-22T18:01:24.030838 #3183896] INFO -- : [ 12/885] 3224851=test_human_typo I, [2024-05-22T18:01:24.037464 #3183896] INFO -- : [ 13/885] 3224851=test_import I, [2024-05-22T18:01:24.057935 #3183896] INFO -- : [ 14/885] 3224850=test_psych I, [2024-05-22T18:01:24.113957 #3183896] INFO -- : [ 15/885] 3224850=test_nil I, [2024-05-22T18:01:24.119480 #3183896] INFO -- : [ 16/885] 3224850=test_io_buffer I, [2024-05-22T18:01:24.150637 #3183896] INFO -- : [ 17/885] 3224850=test_ldap I, [2024-05-22T18:01:24.171149 #3183896] INFO -- : [ 18/885] 3224850=test_kdf I, [2024-05-22T18:01:24.245052 #3183896] INFO -- : [ 19/885] 3224850=test_thread_queue I, [2024-05-22T18:01:24.580754 #3183896] INFO -- : [ 20/885] 3224851=test_nowrite I, [2024-05-22T18:01:24.599740 #3183896] INFO -- : [ 21/885] 3224851=test_defined I, [2024-05-22T18:01:24.662588 #3183896] INFO -- : [ 22/885] 3224851=test_passing_block I, [2024-05-22T18:01:24.673131 #3183896] INFO -- : [ 23/885] 3224851=json_string_matching_test I, [2024-05-22T18:01:24.850465 #3183896] INFO -- : [ 24/885] 3224851=test_gem_config_file I, [2024-05-22T18:01:25.031169 #3183896] INFO -- : [ 25/885] 3224851=test_comparable I, [2024-05-22T18:01:25.074886 #3183896] INFO -- : [ 26/885] 3224851=test_rdoc_rdoc I, [2024-05-22T18:01:25.163057 #3183896] INFO -- : [ 27/885] 3224851=test_yjit_exit_locations I, [2024-05-22T18:01:25.168678 #3183896] INFO -- : [ 28/885] 3224851=test_io_timeout I, [2024-05-22T18:01:25.188057 #3183896] INFO -- : [ 29/885] 3224851=test_rdoc_normal_module I, [2024-05-22T18:01:25.238120 #3183896] INFO -- : [ 30/885] 3224851=test_type_completor I, [2024-05-22T18:01:25.306267 #3183896] INFO -- : [ 31/885] 3224851=test_rdoc_markdown_test I, [2024-05-22T18:01:26.163789 #3183896] INFO -- : [ 32/885] 3224852=test_erb_m17n I, [2024-05-22T18:01:26.187621 #3183896] INFO -- : [ 33/885] 3224851=test_rdoc_generator_pot_po_entry I, [2024-05-22T18:01:26.191590 #3183896] INFO -- : [ 34/885] 3224852=test_timeout I, [2024-05-22T18:01:26.196642 #3183896] INFO -- : [ 35/885] 3224852=test_webauthn_poller I, [2024-05-22T18:01:26.201102 #3183896] INFO -- : [ 36/885] 3224851=test_rdoc_markup_verbatim I, [2024-05-22T18:01:26.205837 #3183896] INFO -- : [ 37/885] 3224851=test_date_conv I, [2024-05-22T18:01:26.213968 #3183896] INFO -- : [ 38/885] 3224851=test_gem_resolver_index_specification I, [2024-05-22T18:01:26.302117 #3183896] INFO -- : [ 39/885] 3224851=test_serialize_subclasses I, [2024-05-22T18:01:26.305886 #3183896] INFO -- : [ 40/885] 3224851=test_frozen I, [2024-05-22T18:01:26.344970 #3183896] INFO -- : [ 41/885] 3224851=test_egrep_cpp I, [2024-05-22T18:01:26.357926 #3183896] INFO -- : [ 42/885] 3224852=test_tree_builder I, [2024-05-22T18:01:26.361473 #3183896] INFO -- : [ 43/885] 3224852=test_protect I, [2024-05-22T18:01:26.368584 #3183896] INFO -- : [ 44/885] 3224852=test_gem_commands_update_command I, [2024-05-22T18:01:26.417245 #3183896] INFO -- : [ 45/885] 3224851=test_date I, [2024-05-22T18:01:26.421949 #3183896] INFO -- : [ 46/885] 3224851=test_big5 I, [2024-05-22T18:01:26.431673 #3183896] INFO -- : [ 47/885] 3224851=test_fnmatch I, [2024-05-22T18:01:26.476160 #3183896] INFO -- : [ 48/885] 3224851=test_pathname I, [2024-05-22T18:01:26.684881 #3183896] INFO -- : [ 49/885] 3224851=test_rdoc_markup_pre_process I, [2024-05-22T18:01:26.763101 #3183896] INFO -- : [ 50/885] 3224851=test_store I, [2024-05-22T18:01:27.070876 #3183896] INFO -- : [ 51/885] 3224851=test_http_request I, [2024-05-22T18:01:27.125916 #3183896] INFO -- : [ 52/885] 3224851=test_tempfile I, [2024-05-22T18:01:27.357811 #3183896] INFO -- : [ 53/885] 3224851=test_coverage I, [2024-05-22T18:01:27.926587 #3183896] INFO -- : [ 54/885] 3224852=test_string I, [2024-05-22T18:01:27.947598 #3183896] INFO -- : [ 55/885] 3224852=json_common_interface_test I, [2024-05-22T18:01:27.963420 #3183896] INFO -- : [ 56/885] 3224852=test_rdoc_any_method I, [2024-05-22T18:01:28.037400 #3183896] INFO -- : [ 57/885] 3224851=test_error_highlight I, [2024-05-22T18:01:28.327745 #3183896] INFO -- : [ 58/885] 3224852=test_function_entry I, [2024-05-22T18:01:28.331240 #3183896] INFO -- : [ 59/885] 3224852=test_complexrational I, [2024-05-22T18:01:28.337104 #3183896] INFO -- : [ 60/885] 3224852=test_raise I, [2024-05-22T18:01:28.342793 #3183896] INFO -- : [ 61/885] 3224852=version_test I, [2024-05-22T18:01:28.416205 #3183896] INFO -- : [ 62/885] 3224852=test_files_lib I, [2024-05-22T18:01:28.564123 #3183896] INFO -- : [ 63/885] 3224851=test_string_memory I, [2024-05-22T18:01:28.630727 #3183896] INFO -- : [ 64/885] 3224851=test_help I, [2024-05-22T18:01:28.636905 #3183896] INFO -- : [ 65/885] 3224851=test_enumerator_kw I, [2024-05-22T18:01:28.697510 #3183896] INFO -- : [ 66/885] 3224851=reflection_test I, [2024-05-22T18:01:28.727290 #3183896] INFO -- : [ 67/885] 3224851=test_marshalable I, [2024-05-22T18:01:28.738805 #3183896] INFO -- : [ 68/885] 3224851=test_line_editor I, [2024-05-22T18:01:28.750593 #3183896] INFO -- : [ 69/885] 3224851=test_hmac I, [2024-05-22T18:01:28.793490 #3183896] INFO -- : [ 70/885] 3224851=test_encoding I, [2024-05-22T18:01:28.937685 #3183896] INFO -- : [ 71/885] 3224851=test_rdoc_generator_markup I, [2024-05-22T18:01:28.947329 #3183896] INFO -- : [ 72/885] 3224851=test_constant I, [2024-05-22T18:01:30.205440 #3183896] INFO -- : [ 73/885] 3224850=test_find I, [2024-05-22T18:01:30.224817 #3183896] INFO -- : [ 74/885] 3224850=test_rat I, [2024-05-22T18:01:30.346849 #3183896] INFO -- : [ 75/885] 3224850=test_init I, [2024-05-22T18:01:30.643805 #3183896] INFO -- : [ 76/885] 3224850=test_gem_request_connection_pools I, [2024-05-22T18:01:30.810217 #3183896] INFO -- : [ 77/885] 3224851=test_flags I, [2024-05-22T18:01:31.272784 #3183896] INFO -- : [ 78/885] 3224852=test_bug-3571 I, [2024-05-22T18:01:31.279295 #3183896] INFO -- : [ 79/885] 3224852=test_yamlstore I, [2024-05-22T18:01:31.296749 #3183896] INFO -- : [ 80/885] 3224852=test_numeric I, [2024-05-22T18:01:31.352179 #3183896] INFO -- : [ 81/885] 3224851=test_time I, [2024-05-22T18:01:31.362350 #3183896] INFO -- : [ 82/885] 3224852=test_file I, [2024-05-22T18:01:31.374519 #3183896] INFO -- : [ 83/885] 3224852=test_capacity I, [2024-05-22T18:01:31.388711 #3183896] INFO -- : [ 84/885] 3224852=test_nextafter I, [2024-05-22T18:01:31.456311 #3183896] INFO -- : [ 85/885] 3224851=test_gem_commands_owner_command I, [2024-05-22T18:01:31.487160 #3183896] INFO -- : [ 86/885] 3224852=test_tcp I, [2024-05-22T18:01:31.503231 #3183896] INFO -- : [ 87/885] 3224852=test_win32ole_method_event I, [2024-05-22T18:01:31.515077 #3183896] INFO -- : [ 88/885] 3224852=parse_comments_test I, [2024-05-22T18:01:31.522229 #3183896] INFO -- : [ 89/885] 3224852=test_rdoc_markup_to_table_of_contents I, [2024-05-22T18:01:31.556675 #3183896] INFO -- : [ 90/885] 3224852=test_gem_name_tuple I, [2024-05-22T18:01:31.571707 #3183896] INFO -- : [ 91/885] 3224852=test_integer I, [2024-05-22T18:01:31.628948 #3183896] INFO -- : [ 92/885] 3224852=test_gem_requirement I, [2024-05-22T18:01:31.699374 #3183896] INFO -- : [ 93/885] 3224850=test_macro I, [2024-05-22T18:01:31.705140 #3183896] INFO -- : [ 94/885] 3224850=test_string I, [2024-05-22T18:01:31.756180 #3183896] INFO -- : [ 95/885] 3224852=test_pipe I, [2024-05-22T18:01:31.876610 #3183896] INFO -- : [ 96/885] 3224852=test_function I, [2024-05-22T18:01:32.116696 #3183896] INFO -- : [ 97/885] 3224852=test_gem_resolver_activation_request I, [2024-05-22T18:01:32.123020 #3183896] INFO -- : [ 98/885] 3224851=test_gem_commands_server_command I, [2024-05-22T18:01:32.136228 #3183896] INFO -- : [ 99/885] 3224852=test_gem_package_tar_reader_entry I, [2024-05-22T18:01:32.139973 #3183896] INFO -- : [100/885] 3224851=test_resource I, [2024-05-22T18:01:32.152655 #3183896] INFO -- : [101/885] 3224851=test_gem_uri I, [2024-05-22T18:01:32.190126 #3183896] INFO -- : [102/885] 3224851=test_bug-5832 I, [2024-05-22T18:01:32.195959 #3183896] INFO -- : [103/885] 3224851=test_yield_block I, [2024-05-22T18:01:32.203464 #3183896] INFO -- : [104/885] 3224851=test_c_struct_builder I, [2024-05-22T18:01:32.330318 #3183896] INFO -- : [105/885] 3224852=test_path_to_class I, [2024-05-22T18:01:32.339129 #3183896] INFO -- : [106/885] 3224852=test_enumerator I, [2024-05-22T18:01:32.344850 #3183896] INFO -- : [107/885] 3224852=test_reqarg I, [2024-05-22T18:01:32.378276 #3183896] INFO -- : [108/885] 3224851=test_frozen_error I, [2024-05-22T18:01:32.400689 #3183896] INFO -- : [109/885] 3224851=test_gem_ext_ext_conf_builder I, [2024-05-22T18:01:32.727898 #3183896] INFO -- : [110/885] 3224852=test_spell_checker I, [2024-05-22T18:01:32.733126 #3183896] INFO -- : [111/885] 3224852=test_gem_version I, [2024-05-22T18:01:32.856841 #3183896] INFO -- : [112/885] 3224852=test_gem_ext_cargo_builder I, [2024-05-22T18:01:32.925688 #3183896] INFO -- : [113/885] 3224852=test_proc I, [2024-05-22T18:01:33.504707 #3183896] INFO -- : [114/885] 3224851=test_console_attr I, [2024-05-22T18:01:33.514059 #3183896] INFO -- : [115/885] 3224851=test_gem_commands_unpack_command I, [2024-05-22T18:01:33.854315 #3183896] INFO -- : [116/885] 3224852=test_zlib I, [2024-05-22T18:01:33.868130 #3183896] INFO -- : [117/885] 3224851=test_rdoc_options I, [2024-05-22T18:01:34.132555 #3183896] INFO -- : [118/885] 3224851=test_ubf_async_safe I, [2024-05-22T18:01:34.136711 #3183896] INFO -- : [119/885] 3224851=test_pstore I, [2024-05-22T18:01:34.394509 #3183896] INFO -- : [120/885] 3224851=test_rdoc_include I, [2024-05-22T18:01:34.421413 #3183896] INFO -- : [121/885] 3224851=test_win32ole_record I, [2024-05-22T18:01:34.433677 #3183896] INFO -- : [122/885] 3224851=test_gem_version_option I, [2024-05-22T18:01:34.487472 #3183896] INFO -- : [123/885] 3224851=test_date_compat I, [2024-05-22T18:01:34.492249 #3183896] INFO -- : [124/885] 3224851=test_httpresponses I, [2024-05-22T18:01:34.501134 #3183896] INFO -- : [125/885] 3224851=test_deprecate I, [2024-05-22T18:01:34.551327 #3183896] INFO -- : [126/885] 3224851=test_rdoc_constant I, [2024-05-22T18:01:34.646388 #3183896] INFO -- : [127/885] 3224851=test_generic I, [2024-05-22T18:01:34.670614 #3183896] INFO -- : [128/885] 3224851=test_common I, [2024-05-22T18:01:34.858096 #3183896] INFO -- : [129/885] 3224851=test_rdoc_markup_to_html_snippet I, [2024-05-22T18:01:34.939530 #3183896] INFO -- : [130/885] 3224851=test_win32ole_variant_outarg I, [2024-05-22T18:01:34.950036 #3183896] INFO -- : [131/885] 3224851=test_rdoc_encoding I, [2024-05-22T18:01:34.993605 #3183896] INFO -- : [132/885] 3224851=test_key_actor_vi I, [2024-05-22T18:01:35.183775 #3183896] INFO -- : [133/885] 3224851=test_postponed_job I, [2024-05-22T18:01:35.490435 #3183896] INFO -- : [134/885] 3224851=test_gem_request_set_lockfile I, [2024-05-22T18:01:35.925862 #3183896] INFO -- : [135/885] 3224851=test_rdoc_markdown I, [2024-05-22T18:01:36.198556 #3183896] INFO -- : [136/885] 3224851=test_rdoc_markup_indented_paragraph I, [2024-05-22T18:01:36.220667 #3183896] INFO -- : [137/885] 3224851=test_rdoc_markup_parser I, [2024-05-22T18:01:36.306065 #3183896] INFO -- : [138/885] 3224851=test_iseq_load I, [2024-05-22T18:01:37.426962 #3183896] INFO -- : [139/885] 3224851=test_stream I, [2024-05-22T18:01:37.547458 #3183896] INFO -- : [140/885] 3224851=test_have_library I, [2024-05-22T18:01:38.033272 #3183896] INFO -- : [141/885] 3224852=test_ns_spki I, [2024-05-22T18:01:38.044281 #3183896] INFO -- : [142/885] 3224852=test_stringify_symbols I, [2024-05-22T18:01:38.048620 #3183896] INFO -- : [143/885] 3224852=test_require I, [2024-05-22T18:01:38.117856 #3183896] INFO -- : [144/885] 3224852=test_objspace I, [2024-05-22T18:01:38.316660 #3183896] INFO -- : [145/885] 3224851=test_rdoc_text I, [2024-05-22T18:01:38.355273 #3183896] INFO -- : [146/885] 3224851=library_symbols_test I, [2024-05-22T18:01:38.361275 #3183896] INFO -- : [147/885] 3224851=test_tsort I, [2024-05-22T18:01:38.386892 #3183896] INFO -- : [148/885] 3224851=test_gem_commands_fetch_command I, [2024-05-22T18:01:38.788020 #3183896] INFO -- : [149/885] 3224851=test_typeddata I, [2024-05-22T18:01:38.798163 #3183896] INFO -- : [150/885] 3224851=test_securerandom I, [2024-05-22T18:01:38.850679 #3183896] INFO -- : [151/885] 3224851=test_gem_commands_outdated_command I, [2024-05-22T18:01:38.896568 #3183896] INFO -- : [152/885] 3224851=test_gem_dependency_list I, [2024-05-22T18:01:38.979072 #3183896] INFO -- : [153/885] 3224851=parameters_signature_test I, [2024-05-22T18:01:38.993797 #3183896] INFO -- : [154/885] 3224851=test_rdoc_parser_changelog I, [2024-05-22T18:01:39.053912 #3183896] INFO -- : [155/885] 3224851=test_gem_doctor I, [2024-05-22T18:01:39.117634 #3183896] INFO -- : [156/885] 3224851=json_fixtures_test I, [2024-05-22T18:01:39.125260 #3183896] INFO -- : [157/885] 3224851=test_len I, [2024-05-22T18:01:39.140345 #3183896] INFO -- : [158/885] 3224851=test_rdoc_parser_c I, [2024-05-22T18:01:39.378469 #3183896] INFO -- : [159/885] 3224851=test_kwargs I, [2024-05-22T18:01:39.386874 #3183896] INFO -- : [160/885] 3224851=test_io_wait I, [2024-05-22T18:01:39.740196 #3183896] INFO -- : [161/885] 3224851=test_pack I, [2024-05-22T18:01:39.885769 #3183896] INFO -- : [162/885] 3224850=parse_test I, [2024-05-22T18:01:39.945123 #3183896] INFO -- : [163/885] 3224851=test_rdoc_code_object I, [2024-05-22T18:01:40.322232 #3183896] INFO -- : [164/885] 3224851=test_process I, [2024-05-22T18:01:40.667223 #3183896] INFO -- : Leaked file descriptor: TestProcess#test_uid_from_name: 9 # I, [2024-05-22T18:01:40.667296 #3183896] INFO -- : Leaked file descriptor: TestProcess#test_uid_from_name: 10 # I, [2024-05-22T18:01:40.699337 #3183896] INFO -- : COMMAND PID USER FD TYPE DEVICE SIZE/OFF NODE NAME I, [2024-05-22T18:01:40.699410 #3183896] INFO -- : ruby 3224851 opc 9r REG 252,0 9253600 13705411 /var/lib/sss/mc/passwd I, [2024-05-22T18:01:40.699422 #3183896] INFO -- : ruby 3224851 opc 10u unix 0x0000000000000000 0t0 3097308333 type=STREAM I, [2024-05-22T18:01:42.599970 #3183896] INFO -- : [165/885] 3224850=test_bmethod I, [2024-05-22T18:01:42.605300 #3183896] INFO -- : [166/885] 3224850=test_euc_kr I, [2024-05-22T18:01:42.606857 #3183896] INFO -- : [167/885] 3224850=test_provider I, [2024-05-22T18:01:42.632259 #3183896] INFO -- : [168/885] 3224850=test_gem_source_specific_file I, [2024-05-22T18:01:42.725064 #3183896] INFO -- : [169/885] 3224850=redundant_return_test I, [2024-05-22T18:01:42.735236 #3183896] INFO -- : [170/885] 3224850=test_rand I, [2024-05-22T18:01:43.004432 #3183896] INFO -- : [171/885] 3224850=test_random_formatter I, [2024-05-22T18:01:43.018780 #3183896] INFO -- : [172/885] 3224850=test_string_processing I, [2024-05-22T18:01:43.137069 #3183896] INFO -- : [173/885] 3224850=test_rdoc_markup_attributes I, [2024-05-22T18:01:43.144313 #3183896] INFO -- : [174/885] 3224850=test_win32ole_typelib I, [2024-05-22T18:01:43.171189 #3183896] INFO -- : [175/885] 3224850=test_pkey I, [2024-05-22T18:01:43.183821 #3183896] INFO -- : [176/885] 3224850=test_external_new I, [2024-05-22T18:01:43.188165 #3183896] INFO -- : [177/885] 3224850=test_bigzero I, [2024-05-22T18:01:43.208364 #3183896] INFO -- : [178/885] 3224850=test_gem_commands_query_command I, [2024-05-22T18:01:43.856429 #3183896] INFO -- : [179/885] 3224850=test_gem_platform I, [2024-05-22T18:01:43.992023 #3183896] INFO -- : [180/885] 3224850=test_ractor I, [2024-05-22T18:01:44.018055 #3183896] INFO -- : [181/885] 3224850=test_null I, [2024-05-22T18:01:44.025461 #3183896] INFO -- : [182/885] 3224850=test_data I, [2024-05-22T18:01:44.035290 #3183896] INFO -- : [183/885] 3224850=test_memory_view I, [2024-05-22T18:01:44.057060 #3183896] INFO -- : [184/885] 3224850=test_multi_irb_commands I, [2024-05-22T18:01:44.073554 #3183896] INFO -- : [185/885] 3224850=test_pkey_dh I, [2024-05-22T18:01:45.429898 #3183896] INFO -- : [186/885] 3224850=test_m17n_comb I, [2024-05-22T18:01:47.724759 #3183896] INFO -- : [187/885] 3224850=test_input_method I, [2024-05-22T18:01:47.779529 #3183896] INFO -- : [188/885] 3224850=test_io I, [2024-05-22T18:01:47.992483 #3183896] INFO -- : [189/885] 3224850=test_rdoc_i18n_text I, [2024-05-22T18:01:48.002587 #3183896] INFO -- : [190/885] 3224850=test_gem_unsatisfiable_dependency_error I, [2024-05-22T18:01:48.044409 #3183896] INFO -- : [191/885] 3224850=test_literal I, [2024-05-22T18:01:48.608266 #3183896] INFO -- : [192/885] 3224850=test_thread I, [2024-05-22T18:01:48.636513 #3183896] INFO -- : .Leaked file descriptor: TestProcess#test_gid_from_name: 11 # I, [2024-05-22T18:01:48.665068 #3183896] INFO -- : COMMAND PID USER FD TYPE DEVICE SIZE/OFF NODE NAME I, [2024-05-22T18:01:48.665140 #3183896] INFO -- : ruby 3224851 opc 11r REG 252,0 6940392 13705429 /var/lib/sss/mc/group I, [2024-05-22T18:01:48.827024 #3183896] INFO -- : [193/885] 3224850=test_gem_security_signer I, [2024-05-22T18:01:48.936555 #3183896] INFO -- : [194/885] 3224850=test_complex2 I, [2024-05-22T18:01:48.946535 #3183896] INFO -- : [195/885] 3224850=test_config I, [2024-05-22T18:01:48.998702 #3183896] INFO -- : [196/885] 3224850=test_gem_util I, [2024-05-22T18:01:49.162913 #3183896] INFO -- : [197/885] 3224850=test_class_name_check I, [2024-05-22T18:01:49.179682 #3183896] INFO -- : [198/885] 3224850=test_scalar I, [2024-05-22T18:01:49.200264 #3183896] INFO -- : [199/885] 3224850=test_syntax I, [2024-05-22T18:01:55.292625 #3183896] INFO -- : [200/885] 3224852=test_zsh_completion I, [2024-05-22T18:01:55.299737 #3183896] INFO -- : [201/885] 3224852=test_basicsocket I, [2024-05-22T18:01:55.332313 #3183896] INFO -- : [202/885] 3224852=test_pkcs7 I, [2024-05-22T18:01:55.480742 #3183896] INFO -- : [203/885] 3224852=test_gem_commands_environment_command I, [2024-05-22T18:01:55.544890 #3183896] INFO -- : [204/885] 3224852=test_pack I, [2024-05-22T18:01:55.655127 #3183896] INFO -- : [205/885] 3224850=test_io_buffer I, [2024-05-22T18:01:55.716306 #3183896] INFO -- : [206/885] 3224852=test_rdoc_context_section I, [2024-05-22T18:01:55.725206 #3183896] INFO -- : [207/885] 3224852=test_deprecated I, [2024-05-22T18:01:55.726277 #3183896] INFO -- : [208/885] 3224852=test_optparse I, [2024-05-22T18:01:55.739534 #3183896] INFO -- : [209/885] 3224852=test_exception I, [2024-05-22T18:01:55.769569 #3183896] INFO -- : [210/885] 3224850=test_bash_completion I, [2024-05-22T18:01:55.788468 #3183896] INFO -- : [211/885] 3224850=test_rdoc_markup_to_html_crossref I, [2024-05-22T18:01:56.099852 #3183896] INFO -- : [212/885] 3224850=test_div I, [2024-05-22T18:01:56.138402 #3183896] INFO -- : [213/885] 3224850=test_files_test_2 I, [2024-05-22T18:01:57.805082 #3183896] INFO -- : [214/885] 3224852=test_singleton I, [2024-05-22T18:01:57.815608 #3183896] INFO -- : [215/885] 3224852=test_numeric I, [2024-05-22T18:01:57.822683 #3183896] INFO -- : [216/885] 3224852=test_fstring I, [2024-05-22T18:01:57.960846 #3183896] INFO -- : [217/885] 3224852=test_gem_ext_rake_builder I, [2024-05-22T18:01:58.566031 #3183896] INFO -- : [218/885] 3224852=test_rdoc_require I, [2024-05-22T18:01:58.571114 #3183896] INFO -- : [219/885] 3224852=test_word I, [2024-05-22T18:01:58.580811 #3183896] INFO -- : [220/885] 3224852=test_timeout I, [2024-05-22T18:01:58.683874 #3183896] INFO -- : [221/885] 3224851=test_rdoc_markup_raw I, [2024-05-22T18:01:58.693844 #3183896] INFO -- : [222/885] 3224851=test_rdoc_markup_to_bs I, [2024-05-22T18:01:58.770325 #3183896] INFO -- : [223/885] 3224851=test_key_name_check I, [2024-05-22T18:01:58.797348 #3183896] INFO -- : [224/885] 3224851=test_weakref I, [2024-05-22T18:01:58.861772 #3183896] INFO -- : [225/885] 3224850=test_instrumentation_api I, [2024-05-22T18:01:58.992169 #3183896] INFO -- : [226/885] 3224851=test_rdoc_alias I, [2024-05-22T18:01:59.004655 #3183896] INFO -- : [227/885] 3224851=test_gem_commands_stale_command I, [2024-05-22T18:01:59.005702 #3183896] INFO -- : [228/885] 3224851=ruby_parser_test I, [2024-05-22T18:01:59.015064 #3183896] INFO -- : [229/885] 3224851=test_rdoc_markup_to_tt_only I, [2024-05-22T18:01:59.049493 #3183896] INFO -- : [230/885] 3224851=test_ws I, [2024-05-22T18:01:59.060574 #3183896] INFO -- : [231/885] 3224851=json_parser_test I, [2024-05-22T18:01:59.208785 #3183896] INFO -- : [232/885] 3224851=test_date_strftime I, [2024-05-22T18:01:59.406848 #3183896] INFO -- : [233/885] 3224852=test_gem_commands_cert_command I, [2024-05-22T18:01:59.489647 #3183896] INFO -- : [234/885] 3224851=test_gem_uri_formatter I, [2024-05-22T18:01:59.517744 #3183896] INFO -- : [235/885] 3224851=test_prettyprint I, [2024-05-22T18:01:59.552328 #3183896] INFO -- : [236/885] 3224851=test_ole_methods I, [2024-05-22T18:01:59.567277 #3183896] INFO -- : [237/885] 3224851=test_cgi_util I, [2024-05-22T18:01:59.762587 #3183896] INFO -- : [238/885] 3224851=test_clone I, [2024-05-22T18:01:59.912247 #3183896] INFO -- : [239/885] 3224851=test_enc_raise I, [2024-05-22T18:01:59.932746 #3183896] INFO -- : [240/885] 3224851=test_queue I, [2024-05-22T18:01:59.943932 #3183896] INFO -- : [241/885] 3224851=test_gem_resolver_lock_specification I, [2024-05-22T18:01:59.988278 #3183896] INFO -- : [242/885] 3224851=test_boolean I, [2024-05-22T18:02:00.001122 #3183896] INFO -- : [243/885] 3224851=test_rdoc_i18n_locale I, [2024-05-22T18:02:00.029473 #3183896] INFO -- : [244/885] 3224851=test_gc_compact I, [2024-05-22T18:02:00.637079 #3183896] INFO -- : [245/885] 3224852=test_dryrun I, [2024-05-22T18:02:00.660555 #3183896] INFO -- : [246/885] 3224852=regexp_test I, [2024-05-22T18:02:00.679833 #3183896] INFO -- : [247/885] 3224852=test_yield I, [2024-05-22T18:02:01.784617 #3183896] INFO -- : [248/885] 3224850=test_show_source I, [2024-05-22T18:02:01.793711 #3183896] INFO -- : [249/885] 3224850=test_remote_fetch_error I, [2024-05-22T18:02:01.808898 #3183896] INFO -- : [250/885] 3224850=test_rdoc_stats I, [2024-05-22T18:02:01.858558 #3183896] INFO -- : [251/885] 3224850=test_files_sample I, [2024-05-22T18:02:01.867556 #3183896] INFO -- : [252/885] 3224850=test_data_error I, [2024-05-22T18:02:01.981608 #3183896] INFO -- : [253/885] 3224850=test_rubyoptions I, [2024-05-22T18:02:02.780961 #3183896] INFO -- : [254/885] 3224851=test_force_exit I, [2024-05-22T18:02:02.791078 #3183896] INFO -- : [255/885] 3224851=test_optimization I, [2024-05-22T18:02:03.459863 #3183896] INFO -- : [256/885] 3224852=test_shift_jis I, [2024-05-22T18:02:03.486120 #3183896] INFO -- : [257/885] 3224852=test_rdoc_store I, [2024-05-22T18:02:04.273666 #3183896] INFO -- : [258/885] 3224852=test_key_event_record I, [2024-05-22T18:02:04.297869 #3183896] INFO -- : [259/885] 3224852=test_open3 I, [2024-05-22T18:02:06.909426 #3183896] INFO -- : [260/885] 3224852=test_mdns I, [2024-05-22T18:02:06.922442 #3183896] INFO -- : [261/885] 3224852=test_date_parse I, [2024-05-22T18:02:07.045022 #3183896] INFO -- : [262/885] 3224852=test_arity I, [2024-05-22T18:02:07.050287 #3183896] INFO -- : [263/885] 3224852=test_thread I, [2024-05-22T18:02:07.055173 #3183896] INFO -- : [264/885] 3224852=test_buffering I, [2024-05-22T18:02:07.068369 #3183896] INFO -- : [265/885] 3224852=test_svcb_https I, [2024-05-22T18:02:07.082573 #3183896] INFO -- : [266/885] 3224852=test_pkey_ec I, [2024-05-22T18:02:07.105137 #3183896] INFO -- : [267/885] 3224852=test_rational I, [2024-05-22T18:02:07.128305 #3183896] INFO -- : [268/885] 3224852=test_case_mapping I, [2024-05-22T18:02:07.139438 #3183896] INFO -- : [269/885] 3224852=test_gem_ext_cargo_builder_unit I, [2024-05-22T18:02:07.173764 #3183896] INFO -- : [270/885] 3224852=test_ractor I, [2024-05-22T18:02:07.176966 #3183896] INFO -- : [271/885] 3224852=test_gem_resolver_api_specification I, [2024-05-22T18:02:07.239567 #3183896] INFO -- : [272/885] 3224852=test_rdoc_rubygems_hook I, [2024-05-22T18:02:07.334294 #3183896] INFO -- : [273/885] 3224852=test_webauthn_listener I, [2024-05-22T18:02:07.399757 #3183896] INFO -- : [274/885] 3224852=test_enumerable I, [2024-05-22T18:02:07.416330 #3183896] INFO -- : [275/885] 3224852=test_rdoc_method_attr I, [2024-05-22T18:02:07.553591 #3183896] INFO -- : [276/885] 3224852=test_set I, [2024-05-22T18:02:07.588006 #3183896] INFO -- : [277/885] 3224852=test_tree_spell_checker I, [2024-05-22T18:02:07.658091 #3183896] INFO -- : [278/885] 3224852=static_literals_test I, [2024-05-22T18:02:07.661112 #3183896] INFO -- : [279/885] 3224852=test_hash_create I, [2024-05-22T18:02:07.669810 #3183896] INFO -- : [280/885] 3224852=test_grapheme_breaks I, [2024-05-22T18:02:07.692620 #3183896] INFO -- : [281/885] 3224852=test_yamldbm I, [2024-05-22T18:02:07.704411 #3183896] INFO -- : [282/885] 3224852=test_gem_spec_fetcher I, [2024-05-22T18:02:07.879547 #3183896] INFO -- : [283/885] 3224852=test_unicode_escape I, [2024-05-22T18:02:07.954698 #3183896] INFO -- : [284/885] 3224852=test_switch_hitter I, [2024-05-22T18:02:08.004786 #3183896] INFO -- : [285/885] 3224852=test_default_gems I, [2024-05-22T18:02:08.023841 #3183896] INFO -- : [286/885] 3224852=test_backtrace I, [2024-05-22T18:02:08.031664 #3183896] INFO -- : [287/885] 3224852=test_gbk I, [2024-05-22T18:02:08.047343 #3183896] INFO -- : [288/885] 3224852=test_gem_commands_dependency_command I, [2024-05-22T18:02:08.143012 #3183896] INFO -- : [289/885] 3224852=test_iterator I, [2024-05-22T18:02:08.196075 #3183896] INFO -- : [290/885] 3224852=test_string I, [2024-05-22T18:02:08.213118 #3183896] INFO -- : [291/885] 3224852=test_gem_commands_install_command I, [2024-05-22T18:02:08.439936 #3183896] INFO -- : Leaked file descriptor: TestRubyOptions#test_script_from_stdin: 10 # I, [2024-05-22T18:02:08.440429 #3183896] INFO -- : Leaked file descriptor: TestRubyOptions#test_script_from_stdin: 11 # I, [2024-05-22T18:02:08.467393 #3183896] INFO -- : COMMAND PID USER FD TYPE DEVICE SIZE/OFF NODE NAME I, [2024-05-22T18:02:08.467460 #3183896] INFO -- : ruby 3224850 opc 10r REG 252,0 6940392 13705429 /var/lib/sss/mc/group I, [2024-05-22T18:02:08.467471 #3183896] INFO -- : ruby 3224850 opc 11u unix 0x0000000000000000 0t0 3097316312 type=STREAM I, [2024-05-22T18:02:08.645920 #3183896] INFO -- : [292/885] 3224850=test_rendering I, [2024-05-22T18:02:08.652873 #3183896] INFO -- : [293/885] 3224850=test_kernel I, [2024-05-22T18:02:09.285577 #3183896] INFO -- : [294/885] 3224850=pattern_test I, [2024-05-22T18:02:09.297599 #3183896] INFO -- : [295/885] 3224850=test_dot_dot I, [2024-05-22T18:02:09.317685 #3183896] INFO -- : [296/885] 3224850=test_gem_rdoc I, [2024-05-22T18:02:09.446021 #3183896] INFO -- : [297/885] 3224850=test_did_you_mean I, [2024-05-22T18:02:09.572165 #3183896] INFO -- : [298/885] 3224850=test_shapes I, [2024-05-22T18:02:09.584182 #3183896] INFO -- : [299/885] 3224850=test_cesu8 I, [2024-05-22T18:02:09.598359 #3183896] INFO -- : [300/885] 3224850=test_rdoc_extend I, [2024-05-22T18:02:09.614839 #3183896] INFO -- : [301/885] 3224850=test_storage I, [2024-05-22T18:02:09.616012 #3183896] INFO -- : [302/885] 3224850=test_method_name_check I, [2024-05-22T18:02:09.646631 #3183896] INFO -- : [303/885] 3224850=test_err_in_callback I, [2024-05-22T18:02:09.658754 #3183896] INFO -- : [304/885] 3224850=test_merge_keys I, [2024-05-22T18:02:09.662437 #3183896] INFO -- : [305/885] 3224850=test_array_create I, [2024-05-22T18:02:09.665701 #3183896] INFO -- : [306/885] 3224850=test_dir_m17n I, [2024-05-22T18:02:09.748414 #3183896] INFO -- : [307/885] 3224851=test_memory_view I, [2024-05-22T18:02:10.016963 #3183896] INFO -- : [308/885] 3224852=test_threadgroup I, [2024-05-22T18:02:10.076144 #3183896] INFO -- : [309/885] 3224851=test_complex I, [2024-05-22T18:02:10.158970 #3183896] INFO -- : [310/885] 3224851=!Nothing_to_test I, [2024-05-22T18:02:10.160309 #3183896] INFO -- : [311/885] 3224851=test_fd_setsize I, [2024-05-22T18:02:10.174072 #3183896] INFO -- : [312/885] 3224851=test_forwardable I, [2024-05-22T18:02:10.192224 #3183896] INFO -- : [313/885] 3224851=test_process I, [2024-05-22T18:02:10.216015 #3183896] INFO -- : [314/885] 3224851=test_verbose I, [2024-05-22T18:02:10.288807 #3183896] INFO -- : [315/885] 3224851=test_gem_commands_open_command I, [2024-05-22T18:02:10.345560 #3183896] INFO -- : [316/885] 3224851=test_emoji_breaks I, [2024-05-22T18:02:10.347680 #3183896] INFO -- : [317/885] 3224851=test_normalize I, [2024-05-22T18:02:10.358825 #3183896] INFO -- : [318/885] 3224851=test_gem_update_suggestion I, [2024-05-22T18:02:10.456535 #3183896] INFO -- : [319/885] 3224851=test_assignment I, [2024-05-22T18:02:10.825911 #3183896] INFO -- : [320/885] 3224850=test_undef I, [2024-05-22T18:02:10.836886 #3183896] INFO -- : [321/885] 3224850=test_gem_resolver_lock_set I, [2024-05-22T18:02:10.852630 #3183896] INFO -- : [322/885] 3224850=test_random I, [2024-05-22T18:02:10.893885 #3183896] INFO -- : [323/885] 3224850=test_rdoc_generator_darkfish I, [2024-05-22T18:02:11.029405 #3183896] INFO -- : [324/885] 3224852=test_gem_command I, [2024-05-22T18:02:11.128804 #3183896] INFO -- : [325/885] 3224852=test_asn1 I, [2024-05-22T18:02:11.152807 #3183896] INFO -- : [326/885] 3224852=test_gem_impossible_dependencies_error I, [2024-05-22T18:02:11.161690 #3183896] INFO -- : [327/885] 3224852=test_pp I, [2024-05-22T18:02:11.193866 #3183896] INFO -- : [328/885] 3224850=memsize_test I, [2024-05-22T18:02:11.200343 #3183896] INFO -- : [329/885] 3224850=test_gem_resolver_requirement_list.Leaked file descriptor: PPTestModule::PPFileStatTest#test_nothing_raised: 8 # I, [2024-05-22T18:02:11.206910 #3183896] INFO -- : I, [2024-05-22T18:02:11.212825 #3183896] INFO -- : [330/885] 3224850=test_noarg I, [2024-05-22T18:02:11.224643 #3183896] INFO -- : COMMAND PID USER FD TYPE DEVICE SIZE/OFF NODE NAME I, [2024-05-22T18:02:11.224708 #3183896] INFO -- : ruby 3224852 opc 8r REG 252,0 9253600 13705411 /var/lib/sss/mc/passwd I, [2024-05-22T18:02:11.265456 #3183896] INFO -- : [331/885] 3224852=test_raise_exception I, [2024-05-22T18:02:11.390439 #3183896] INFO -- : [332/885] 3224850=test_arith_seq_beg_len_step I, [2024-05-22T18:02:11.396714 #3183896] INFO -- : [333/885] 3224850=test_exception I, [2024-05-22T18:02:11.409989 #3183896] INFO -- : [334/885] 3224850=test_basicinstructions I, [2024-05-22T18:02:11.478170 #3183896] INFO -- : [335/885] 3224850=test_gem_resolver_git_specification I, [2024-05-22T18:02:11.763265 #3183896] INFO -- : [336/885] 3224851=test_utf32 I, [2024-05-22T18:02:11.771895 #3183896] INFO -- : [337/885] 3224851=test_key_actor_emacs I, [2024-05-22T18:02:11.780663 #3183896] INFO -- : [338/885] 3224850=test_gem_security I, [2024-05-22T18:02:11.853273 #3183896] INFO -- : [339/885] 3224852=test_erb I, [2024-05-22T18:02:11.861973 #3183896] INFO -- : [340/885] 3224851=test_date_ractor I, [2024-05-22T18:02:11.913742 #3183896] INFO -- : [341/885] 3224852=test_variable I, [2024-05-22T18:02:12.008003 #3183896] INFO -- : [342/885] 3224852=test_hash I, [2024-05-22T18:02:12.024115 #3183896] INFO -- : [343/885] 3224852=test_rdoc_tom_doc I, [2024-05-22T18:02:12.075717 #3183896] INFO -- : [344/885] 3224852=test_gem_commands_pristine_command I, [2024-05-22T18:02:12.092744 #3183896] INFO -- : [345/885] 3224851=test_optarg I, [2024-05-22T18:02:12.212972 #3183896] INFO -- : [346/885] 3224851=test_face I, [2024-05-22T18:02:12.234717 #3183896] INFO -- : [347/885] 3224851=test_gem_request_set_lockfile_parser I, [2024-05-22T18:02:12.364865 #3183896] INFO -- : [348/885] 3224851=test_date_attr I, [2024-05-22T18:02:12.520156 #3183896] INFO -- : [349/885] 3224851=test_sizeof I, [2024-05-22T18:02:13.442117 #3183896] INFO -- : [350/885] 3224852=test_stringchar I, [2024-05-22T18:02:13.522590 #3183896] INFO -- : [351/885] 3224852=warnings_test I, [2024-05-22T18:02:13.542397 #3183896] INFO -- : [352/885] 3224852=test_econv I, [2024-05-22T18:02:14.396647 #3183896] INFO -- : [353/885] 3224852=test_gem_install_update_options I, [2024-05-22T18:02:14.516017 #3183896] INFO -- : [354/885] 3224852=test_jaro_winkler I, [2024-05-22T18:02:14.523642 #3183896] INFO -- : [355/885] 3224852=test_cp949 I, [2024-05-22T18:02:14.530998 #3183896] INFO -- : [356/885] 3224852=test_condition I, [2024-05-22T18:02:14.540730 #3183896] INFO -- : [357/885] 3224852=test_gem_resolver_vendor_set I, [2024-05-22T18:02:14.567076 #3183896] INFO -- : [358/885] 3224852=test_gem_dependency_resolution_error I, [2024-05-22T18:02:14.591553 #3183896] INFO -- : [359/885] 3224852=test_fileutils I, [2024-05-22T18:02:14.746502 #3183896] INFO -- : [360/885] 3224851=test_mixed_unicode_escapes I, [2024-05-22T18:02:14.752182 #3183896] INFO -- : [361/885] 3224851=test_sleep I, [2024-05-22T18:02:15.088903 #3183896] INFO -- : [362/885] 3224852=test_emoji I, [2024-05-22T18:02:15.176249 #3183896] INFO -- : [363/885] 3224852=test_sorted_set I, [2024-05-22T18:02:15.303996 #3183896] INFO -- : [364/885] 3224852=test_windows_1252 I, [2024-05-22T18:02:15.484132 #3183896] INFO -- : [365/885] 3224852=test_stack I, [2024-05-22T18:02:16.072450 #3183896] INFO -- : [366/885] 3224852=test_win32ole_variable I, [2024-05-22T18:02:16.073918 #3183896] INFO -- : [367/885] 3224852=test_method_cache I, [2024-05-22T18:02:16.095605 #3183896] INFO -- : [368/885] 3224852=test_rdoc_class_module I, [2024-05-22T18:02:16.638188 #3183896] INFO -- : [369/885] 3224852=test_rdoc_cross_reference I, [2024-05-22T18:02:16.803415 #3183896] INFO -- : [370/885] 3224851=test_parse I, [2024-05-22T18:02:17.074033 #3183896] INFO -- : [371/885] 3224852=test_gem_specification I, [2024-05-22T18:02:17.299128 #3183896] INFO -- : [372/885] 3224851=test_flush I, [2024-05-22T18:02:17.305599 #3183896] INFO -- : [373/885] 3224851=test_pkey_rsa I, [2024-05-22T18:02:17.590810 #3183896] INFO -- : [374/885] 3224851=test_system I, [2024-05-22T18:02:18.493398 #3183896] INFO -- : [375/885] 3224851=test_numhash I, [2024-05-22T18:02:18.497848 #3183896] INFO -- : [376/885] 3224851=test_libs I, [2024-05-22T18:02:18.518440 #3183896] INFO -- : [377/885] 3224851=test_iso_8859 I, [2024-05-22T18:02:18.542294 #3183896] INFO -- : [378/885] 3224851=ripper_test I, [2024-05-22T18:02:18.630169 #3183896] INFO -- : [379/885] 3224850=test_math I, [2024-05-22T18:02:18.658673 #3183896] INFO -- : [380/885] 3224850=comments_test I, [2024-05-22T18:02:18.666803 #3183896] INFO -- : [381/885] 3224850=test_qsort I, [2024-05-22T18:02:18.672598 #3183896] INFO -- : [382/885] 3224850=test_gc I, [2024-05-22T18:02:18.674145 #3183896] INFO -- : [383/885] 3224850=test_safe_load I, [2024-05-22T18:02:18.682483 #3183896] INFO -- : [384/885] 3224850=test_sprintf I, [2024-05-22T18:02:18.885836 #3183896] INFO -- : [385/885] 3224850=test_class I, [2024-05-22T18:02:19.264687 #3183896] INFO -- : [386/885] 3224851=test_exit I, [2024-05-22T18:02:19.273129 #3183896] INFO -- : [387/885] 3224851=test_const I, [2024-05-22T18:02:19.283989 #3183896] INFO -- : [388/885] 3224851=index_write_test I, [2024-05-22T18:02:19.297778 #3183896] INFO -- : [389/885] 3224851=test_rdoc_parser_rd I, [2024-05-22T18:02:19.305029 #3183896] INFO -- : [390/885] 3224851=test_name_error I, [2024-05-22T18:02:19.386188 #3183896] INFO -- : [391/885] 3224851=json_addition_test I, [2024-05-22T18:02:19.402236 #3183896] INFO -- : [392/885] 3224851=test_gem_source_list I, [2024-05-22T18:02:19.483371 #3183896] INFO -- : [393/885] 3224851=test_gem_commands_sources_command I, [2024-05-22T18:02:19.696208 #3183896] INFO -- : [394/885] 3224851=test_yaml_special_cases I, [2024-05-22T18:02:19.702700 #3183896] INFO -- : [395/885] 3224851=test_recorder I, [2024-05-22T18:02:19.730832 #3183896] INFO -- : [396/885] 3224851=test_case I, [2024-05-22T18:02:19.772781 #3183896] INFO -- : [397/885] 3224851=test_open-uri I, [2024-05-22T18:02:19.811167 #3183896] INFO -- : [398/885] 3224852=test_enc_associate I, [2024-05-22T18:02:20.178977 #3183896] INFO -- : [399/885] 3224851=test_enumerator I, [2024-05-22T18:02:20.302424 #3183896] INFO -- : [400/885] 3224852=test_gem_command_manager I, [2024-05-22T18:02:20.471114 #3183896] INFO -- : [401/885] 3224852=test_rdoc_context I, [2024-05-22T18:02:21.275187 #3183896] INFO -- : [402/885] 3224852=test_array I, [2024-05-22T18:02:21.290868 #3183896] INFO -- : [403/885] 3224852=test_rdoc_generator_json_index I, [2024-05-22T18:02:21.319155 #3183896] INFO -- : [404/885] 3224852=test_date_time I, [2024-05-22T18:02:21.333430 #3183896] INFO -- : [405/885] 3224852=test_nil2vtempty I, [2024-05-22T18:02:21.353950 #3183896] INFO -- : [406/885] 3224852=test_framework I, [2024-05-22T18:02:21.359632 #3183896] INFO -- : [407/885] 3224852=test_coderange I, [2024-05-22T18:02:21.488585 #3183896] INFO -- : [408/885] 3224852=test_weakmap I, [2024-05-22T18:02:22.383132 #3183896] INFO -- : [409/885] 3224850=test_ansi_with_terminfo I, [2024-05-22T18:02:22.477791 #3183896] INFO -- : [410/885] 3224850=test_inadvertent_creation I, [2024-05-22T18:02:22.500621 #3183896] INFO -- : [411/885] 3224850=test_cgi_tag_helper I, [2024-05-22T18:02:22.548695 #3183896] INFO -- : [412/885] 3224850=test_pack I, [2024-05-22T18:02:22.585838 #3183896] INFO -- : [413/885] 3224850=test_pinned I, [2024-05-22T18:02:22.627194 #3183896] INFO -- : [414/885] 3224850=test_win32ole I, [2024-05-22T18:02:22.631937 #3183896] INFO -- : [415/885] 3224850=test_internal_ivar I, [2024-05-22T18:02:22.659454 #3183896] INFO -- : [416/885] 3224850=test_gem_source_local I, [2024-05-22T18:02:22.889987 #3183896] INFO -- : [417/885] 3224850=desugar_compiler_test I, [2024-05-22T18:02:22.903817 #3183896] INFO -- : [418/885] 3224850=test_rendering I, [2024-05-22T18:02:22.920408 #3183896] INFO -- : [419/885] 3224850=test_gem_gemcutter_utilities I, [2024-05-22T18:02:23.379388 #3183896] INFO -- : [420/885] 3224850=test_rdoc_task I, [2024-05-22T18:02:23.391901 #3183896] INFO -- : [421/885] 3224850=test_gem_text I, [2024-05-22T18:02:23.505397 #3183896] INFO -- : [422/885] 3224850=test_settracefunc I, [2024-05-22T18:02:24.469574 #3183896] INFO -- : [423/885] 3224850=test_tracepoint I, [2024-05-22T18:02:24.746878 #3183896] INFO -- : [424/885] 3224850=test_backtrace I, [2024-05-22T18:02:26.042209 #3183896] INFO -- : [425/885] 3224850=test_gem_commands_push_command I, [2024-05-22T18:02:26.662073 #3183896] INFO -- : [426/885] 3224850=locals_test I, [2024-05-22T18:02:27.175697 #3183896] INFO -- : [427/885] 3224850=test_method_cache I, [2024-05-22T18:02:27.235761 #3183896] INFO -- : [428/885] 3224850=test_too_many_dummy_encodings I, [2024-05-22T18:02:27.250099 #3183896] INFO -- : [429/885] 3224850=test_sprintf_comb I, [2024-05-22T18:02:27.443757 #3183896] INFO -- : [430/885] 3224850=encoding_test I, [2024-05-22T18:02:27.534277 #3183896] INFO -- : [431/885] 3224850=test_gem_commands_specification_command I, [2024-05-22T18:02:27.681751 #3183896] INFO -- : [432/885] 3224850=test_scan_args I, [2024-05-22T18:02:27.701548 #3183896] INFO -- : [433/885] 3224850=test_gem_commands_which_command I, [2024-05-22T18:02:27.744185 #3183896] INFO -- : [434/885] 3224850=test_gem_request I, [2024-05-22T18:02:27.972722 #3183896] INFO -- : [435/885] 3224850=test_gem_package_old I, [2024-05-22T18:02:28.022506 #3183896] INFO -- : [436/885] 3224850=test_pty I, [2024-05-22T18:02:28.358154 #3183896] INFO -- : [437/885] 3224852=test_gem_dependency_installer I, [2024-05-22T18:02:28.491446 #3183896] INFO -- : [438/885] 3224850=test_http I, [2024-05-22T18:02:28.496949 #3183896] INFO -- : [439/885] 3224850=parser_test I, [2024-05-22T18:02:28.511274 #3183896] INFO -- : [440/885] 3224850=test_hash I, [2024-05-22T18:02:30.991351 #3183896] INFO -- : [441/885] 3224852=test_parser_events I, [2024-05-22T18:02:31.092611 #3183896] INFO -- : [442/885] 3224852=test_filter I, [2024-05-22T18:02:31.219951 #3183896] INFO -- : [443/885] 3224852=test_pkcs12 I, [2024-05-22T18:02:31.877964 #3183896] INFO -- : [444/885] 3224852=test_koi8 I, [2024-05-22T18:02:31.886042 #3183896] INFO -- : [445/885] 3224852=test_json_tree I, [2024-05-22T18:02:31.942118 #3183896] INFO -- : [446/885] 3224852=test_gem_remote_fetcher I, [2024-05-22T18:02:32.431721 #3183896] INFO -- : [447/885] 3224850=test_argf I, [2024-05-22T18:02:33.764901 #3183896] INFO -- : [448/885] 3224852=test_yaml I, [2024-05-22T18:02:33.846479 #3183896] INFO -- : [449/885] 3224852=test_x509name I, [2024-05-22T18:02:33.862620 #3183896] INFO -- : [450/885] 3224852=test_gem_dependency I, [2024-05-22T18:02:34.011710 #3183896] INFO -- : [451/885] 3224852=test_cclass I, [2024-05-22T18:02:34.110683 #3183896] INFO -- : [452/885] 3224852=test_gem_uninstaller I, [2024-05-22T18:02:35.463459 #3183896] INFO -- : [453/885] 3224852=test_yjit I, [2024-05-22T18:02:35.472423 #3183896] INFO -- : [454/885] 3224852=test_method I, [2024-05-22T18:02:36.230393 #3183896] INFO -- : [455/885] 3224850=test_m17n I, [2024-05-22T18:02:36.290951 #3183896] INFO -- : [456/885] 3224850=test_rdoc_markup_to_rdoc I, [2024-05-22T18:02:36.330104 #3183896] INFO -- : [457/885] 3224850=test_case I, [2024-05-22T18:02:36.348010 #3183896] INFO -- : [458/885] 3224850=test_ractor I, [2024-05-22T18:02:36.356149 #3183896] INFO -- : [459/885] 3224850=test_severity I, [2024-05-22T18:02:36.362512 #3183896] INFO -- : [460/885] 3224850=test_str2big I, [2024-05-22T18:02:36.377792 #3183896] INFO -- : [461/885] 3224850=test_gem_package_tar_writer I, [2024-05-22T18:02:36.509371 #3183896] INFO -- : [462/885] 3224850=attribute_write_test I, [2024-05-22T18:02:36.584345 #3183896] INFO -- : [463/885] 3224850=test_http I, [2024-05-22T18:02:43.020280 #3183896] INFO -- : [464/885] 3224852=test_utf16 I, [2024-05-22T18:02:43.036632 #3183896] INFO -- : [465/885] 3224852=test_set I, [2024-05-22T18:02:43.041445 #3183896] INFO -- : [466/885] 3224852=test_win32ole_param_event I, [2024-05-22T18:02:43.060587 #3183896] INFO -- : [467/885] 3224852=test_https_proxy I, [2024-05-22T18:02:43.066851 #3183896] INFO -- : [468/885] 3224852=test_rdoc_parser I, [2024-05-22T18:02:43.091868 #3183896] INFO -- : [469/885] 3224852=test_nomethod_error I, [2024-05-22T18:02:43.188368 #3183896] INFO -- : [470/885] 3224852=test_gem_commands_rebuild_command I, [2024-05-22T18:02:43.200314 #3183896] INFO -- : [471/885] 3224852=test_etc I, [2024-05-22T18:02:43.273343 #3183896] INFO -- : [472/885] 3224852=test_stat I, [2024-05-22T18:02:43.280930 #3183896] INFO -- : [473/885] 3224852=test_printf I, [2024-05-22T18:02:43.293399 #3183896] INFO -- : [474/885] 3224852=test_x509attr I, [2024-05-22T18:02:43.347694 #3183896] INFO -- : [475/885] 3224852=test_workspace I, [2024-05-22T18:02:43.464767 #3183896] INFO -- : [476/885] 3224852=test_win32ole_variant I, [2024-05-22T18:02:43.469140 #3183896] INFO -- : [477/885] 3224852=magic_comment_test I, [2024-05-22T18:02:43.477628 #3183896] INFO -- : [478/885] 3224852=test_cgi_modruby I, [2024-05-22T18:02:43.482067 #3183896] INFO -- : [479/885] 3224852=test_uncorrectable_name_check I, [2024-05-22T18:02:43.518895 #3183896] INFO -- : [480/885] 3224852=test_io I, [2024-05-22T18:02:44.834632 #3183896] INFO -- : [481/885] 3224851=test_dir I, [2024-05-22T18:02:45.136740 #3183896] INFO -- : [482/885] 3224851=test_files_test_1 I, [2024-05-22T18:02:45.220903 #3183896] INFO -- : [483/885] 3224850=test_closure I, [2024-05-22T18:02:47.576003 #3183896] INFO -- : [484/885] 3224850=test_resolve_symbol I, [2024-05-22T18:02:47.625529 #3183896] INFO -- : [485/885] 3224851=test_rubygems I, [2024-05-22T18:02:47.632467 #3183896] INFO -- : [486/885] 3224850=test_path I, [2024-05-22T18:02:47.639750 #3183896] INFO -- : [487/885] 3224850=test_digest I, [2024-05-22T18:02:47.647391 #3183896] INFO -- : [488/885] 3224850=test_rdoc_rd_inline I, [2024-05-22T18:02:47.652198 #3183896] INFO -- : [489/885] 3224850=test_propertyputref I, [2024-05-22T18:02:47.659116 #3183896] INFO -- : [490/885] 3224850=test_gb18030 I, [2024-05-22T18:02:47.663558 #3183896] INFO -- : [491/885] 3224850=test_gem_commands_lock_command I, [2024-05-22T18:02:47.699255 #3183896] INFO -- : [492/885] 3224850=test_reline_key I, [2024-05-22T18:02:47.727031 #3183896] INFO -- : [493/885] 3224850=test_unicode_normalize I, [2024-05-22T18:02:47.771636 #3183896] INFO -- : [494/885] 3224851=test_gem_stream_ui I, [2024-05-22T18:02:47.920883 #3183896] INFO -- : [495/885] 3224851=test_rdoc_generator_ri I, [2024-05-22T18:02:48.008951 #3183896] INFO -- : [496/885] 3224851=test_io_m17n I, [2024-05-22T18:02:49.238234 #3183896] INFO -- : [497/885] 3224851=test_rdoc_top_level I, [2024-05-22T18:02:49.542061 #3183896] INFO -- : [498/885] 3224851=test_cmethod I, [2024-05-22T18:02:49.553291 #3183896] INFO -- : [499/885] 3224851=test_gem_stub_specification I, [2024-05-22T18:02:49.740479 #3183896] INFO -- : [500/885] 3224851=test_float I, [2024-05-22T18:02:51.470697 #3183896] INFO -- : [501/885] 3224850=test_color I, [2024-05-22T18:02:51.509774 #3183896] INFO -- : [502/885] 3224851=test_gem_ext_configure_builder I, [2024-05-22T18:02:51.535296 #3183896] INFO -- : [503/885] 3224851=json_ext_parser_test I, [2024-05-22T18:02:51.543617 #3183896] INFO -- : [504/885] 3224851=test_nonblock I, [2024-05-22T18:02:51.560352 #3183896] INFO -- : [505/885] 3224851=test_rdoc_parser_simple I, [2024-05-22T18:02:51.567521 #3183896] INFO -- : [506/885] 3224850=test_ocsp I, [2024-05-22T18:02:51.584899 #3183896] INFO -- : [507/885] 3224851=test_scanner_events I, [2024-05-22T18:02:51.624978 #3183896] INFO -- : [508/885] 3224851=test_ipaddr I, [2024-05-22T18:02:51.654501 #3183896] INFO -- : [509/885] 3224851=test_date_strptime I, [2024-05-22T18:02:51.664006 #3183896] INFO -- : [510/885] 3224850=test_omap I, [2024-05-22T18:02:51.686324 #3183896] INFO -- : [511/885] 3224850=test_rdoc_generator_pot_po I, [2024-05-22T18:02:51.698166 #3183896] INFO -- : [512/885] 3224850=test_mul I, [2024-05-22T18:02:51.713134 #3183896] INFO -- : [513/885] 3224850=test_shellwords I, [2024-05-22T18:02:51.733606 #3183896] INFO -- : [514/885] 3224850=test_at_exit I, [2024-05-22T18:02:51.743075 #3183896] INFO -- : [515/885] 3224850=test_benchmark I, [2024-05-22T18:02:51.797909 #3183896] INFO -- : [516/885] 3224851=test_gem_source I, [2024-05-22T18:02:52.124790 #3183896] INFO -- : [517/885] 3224851=test_mkmf I, [2024-05-22T18:02:52.227224 #3183896] INFO -- : [518/885] 3224851=test_have_macro I, [2024-05-22T18:02:52.458582 #3183896] INFO -- : [519/885] 3224851=test_class I, [2024-05-22T18:02:52.518415 #3183896] INFO -- : [520/885] 3224851=test_autoload I, [2024-05-22T18:02:53.605535 #3183896] INFO -- : [521/885] 3224850=test_gem_package I, [2024-05-22T18:02:54.192693 #3183896] INFO -- : [522/885] 3224852=test_array I, [2024-05-22T18:02:54.362907 #3183896] INFO -- : [523/885] 3224850=dispatcher_test I, [2024-05-22T18:02:54.376675 #3183896] INFO -- : [524/885] 3224850=test_eval_history I, [2024-05-22T18:02:54.389064 #3183896] INFO -- : [525/885] 3224850=test_unicode I, [2024-05-22T18:02:54.424808 #3183896] INFO -- : [526/885] 3224850=test_gem_source_git I, [2024-05-22T18:02:55.612723 #3183896] INFO -- : [527/885] 3224850=test_regex_casefold I, [2024-05-22T18:02:56.017209 #3183896] INFO -- : [528/885] 3224850=test_win32ole_method I, [2024-05-22T18:02:56.028262 #3183896] INFO -- : [529/885] 3224850=test_lexer I, [2024-05-22T18:02:56.137544 #3183896] INFO -- : [530/885] 3224850=test_ripper I, [2024-05-22T18:02:56.363258 #3183896] INFO -- : [531/885] 3224850=test_files_ext I, [2024-05-22T18:02:56.371459 #3183896] INFO -- : [532/885] 3224850=test_thread_cv I, [2024-05-22T18:02:57.028055 #3183896] INFO -- : [533/885] 3224850=test_stringio I, [2024-05-22T18:02:57.113933 #3183896] INFO -- : [534/885] 3224850=test_assembler I, [2024-05-22T18:02:57.116554 #3183896] INFO -- : [535/885] 3224850=test_random I, [2024-05-22T18:02:57.144632 #3183896] INFO -- : [536/885] 3224850=test_iseq I, [2024-05-22T18:02:57.356880 #3183896] INFO -- : [537/885] 3224851=test_primitive I, [2024-05-22T18:02:57.383580 #3183896] INFO -- : [538/885] 3224851=test_parser I, [2024-05-22T18:02:57.405677 #3183896] INFO -- : [539/885] 3224851=test_rdoc_ri_paths I, [2024-05-22T18:02:57.445558 #3183896] INFO -- : [540/885] 3224851=command_line_test I, [2024-05-22T18:02:57.452484 #3183896] INFO -- : [541/885] 3224851=test_win32ole_variant_m I, [2024-05-22T18:02:57.460757 #3183896] INFO -- : [542/885] 3224851=test_pair I, [2024-05-22T18:02:57.662130 #3183896] INFO -- : [543/885] 3224850=test_env I, [2024-05-22T18:03:00.264888 #3183896] INFO -- : [544/885] 3224850=test_gem_package_tar_reader I, [2024-05-22T18:03:00.326501 #3183896] INFO -- : [545/885] 3224850=test_gem_commands_signout_command I, [2024-05-22T18:03:00.344188 #3183896] INFO -- : [546/885] 3224850=test_gem_safe_yaml I, [2024-05-22T18:03:00.356237 #3183896] INFO -- : [547/885] 3224850=test_document I, [2024-05-22T18:03:00.364171 #3183896] INFO -- : [548/885] 3224850=test_eval I, [2024-05-22T18:03:00.379458 #3183896] INFO -- : [549/885] 3224850=test_history I, [2024-05-22T18:03:00.408008 #3183896] INFO -- : [550/885] 3224850=test_gem_commands_setup_command I, [2024-05-22T18:03:01.227690 #3183896] INFO -- : [551/885] 3224850=test_singleton_function I, [2024-05-22T18:03:01.240822 #3183896] INFO -- : [552/885] 3224850=test_sockopt I, [2024-05-22T18:03:01.251355 #3183896] INFO -- : [553/885] 3224850=test_ftp I, [2024-05-22T18:03:01.267073 #3183896] INFO -- : [554/885] 3224850=test_gem_source_fetch_problem I, [2024-05-22T18:03:01.290639 #3183896] INFO -- : [555/885] 3224850=test_install I, [2024-05-22T18:03:01.584982 #3183896] INFO -- : [556/885] 3224850=test_encoding I, [2024-05-22T18:03:01.624718 #3183896] INFO -- : [557/885] 3224850=test_rdoc_comment I, [2024-05-22T18:03:01.744896 #3183896] INFO -- : [558/885] 3224850=test_gem_request_set_lockfile_tokenizer I, [2024-05-22T18:03:01.825500 #3183896] INFO -- : [559/885] 3224850=test_lazy_enumerator I, [2024-05-22T18:03:02.274213 #3183896] INFO -- : [560/885] 3224850=test_cgi_multipart I, [2024-05-22T18:03:02.379204 #3183896] INFO -- : [561/885] 3224850=test_arithmetic_sequence I, [2024-05-22T18:03:02.458259 #3183896] INFO -- : [562/885] 3224850=test_ractor_compatibility I, [2024-05-22T18:03:02.767304 #3183896] INFO -- : [563/885] 3224850=test_autoconf I, [2024-05-22T18:03:02.776678 #3183896] INFO -- : [564/885] 3224850=integer_parse_test I, [2024-05-22T18:03:02.778528 #3183896] INFO -- : [565/885] 3224850=test_find_executable I, [2024-05-22T18:03:02.804775 #3183896] INFO -- : [566/885] 3224850=test_irb I, [2024-05-22T18:03:02.871776 #3183896] INFO -- : [567/885] 3224851=test_x509cert I, [2024-05-22T18:03:02.965699 #3183896] INFO -- : [568/885] 3224851=test_rdoc_markup_paragraph I, [2024-05-22T18:03:02.971731 #3183896] INFO -- : [569/885] 3224851=test_require_path_check I, [2024-05-22T18:03:03.110362 #3183896] INFO -- : [570/885] 3224850=test_variable_name_check I, [2024-05-22T18:03:03.199857 #3183896] INFO -- : [571/885] 3224851=test_bn I, [2024-05-22T18:03:03.211976 #3183896] INFO -- : [572/885] 3224851=test_logdevice I, [2024-05-22T18:03:03.224044 #3183896] INFO -- : [573/885] 3224850=test_ast I, [2024-05-22T18:03:04.164060 #3183896] INFO -- : [574/885] 3224851=test_rdoc_markup_to_ansi I, [2024-05-22T18:03:04.215590 #3183896] INFO -- : [575/885] 3224851=test_weakkeymap I, [2024-05-22T18:03:04.632923 #3183896] INFO -- : [576/885] 3224851=test_files_test I, [2024-05-22T18:03:04.640291 #3183896] INFO -- : [577/885] 3224851=test_evaluation I, [2024-05-22T18:03:04.651449 #3183896] INFO -- : [578/885] 3224851=test_protocol I, [2024-05-22T18:03:04.958409 #3183896] INFO -- : [579/885] 3224851=test_gem_commands_info_command I, [2024-05-22T18:03:04.983115 #3183896] INFO -- : [580/885] 3224851=test_https I, [2024-05-22T18:03:05.122722 #3183896] INFO -- : [581/885] 3224851=test_object_create_start I, [2024-05-22T18:03:05.135790 #3183896] INFO -- : [582/885] 3224851=test_gem_request_set_gem_dependency_api I, [2024-05-22T18:03:05.470124 #3183896] INFO -- : [583/885] 3224851=test_name_error_extension I, [2024-05-22T18:03:05.496543 #3183896] INFO -- : [584/885] 3224851=test_file_exhaustive I, [2024-05-22T18:03:05.807294 #3183896] INFO -- : [585/885] 3224852=test_completion I, [2024-05-22T18:03:06.560560 #3183896] INFO -- : [586/885] 3224852=test_handle I, [2024-05-22T18:03:07.402768 #3183896] INFO -- : [587/885] 3224852=parse_stream_test I, [2024-05-22T18:03:07.416203 #3183896] INFO -- : [588/885] 3224852=test_gem_security_policy I, [2024-05-22T18:03:07.787316 #3183896] INFO -- : [589/885] 3224852=test_delete I, [2024-05-22T18:03:07.813657 #3183896] INFO -- : [590/885] 3224852=test_rdoc_markup_document I, [2024-05-22T18:03:07.819965 #3183896] INFO -- : [591/885] 3224852=test_io_wait_uncommon I, [2024-05-22T18:03:07.836982 #3183896] INFO -- : [592/885] 3224852=test_gem_ci_detector I, [2024-05-22T18:03:07.857193 #3183896] INFO -- : [593/885] 3224852=test_fixnum I, [2024-05-22T18:03:07.866587 #3183896] INFO -- : [594/885] 3224852=test_gem_silent_ui I, [2024-05-22T18:03:07.912853 #3183896] INFO -- : [595/885] 3224852=test_signal I, [2024-05-22T18:03:09.928750 #3183896] INFO -- : [596/885] 3224852=test_continuation I, [2024-05-22T18:03:09.931888 #3183896] INFO -- : [597/885] 3224852=test_ssl_session I, [2024-05-22T18:03:10.831787 #3183896] INFO -- : [598/885] 3224852=test_gem_package_tar_header I, [2024-05-22T18:03:10.916261 #3183896] INFO -- : [599/885] 3224852=test_rational2 I, [2024-05-22T18:03:10.924384 #3183896] INFO -- : [600/885] 3224852=test_logperiod I, [2024-05-22T18:03:11.326816 #3183896] INFO -- : [601/885] 3224852=test_case_comprehensive I, [2024-05-22T18:03:15.009102 #3183896] INFO -- : [602/885] 3224851=test_placearg I, [2024-05-22T18:03:15.085635 #3183896] INFO -- : [603/885] 3224851=test_mutex I, [2024-05-22T18:03:16.216282 #3183896] INFO -- : [604/885] 3224851=test_rdoc_token_stream I, [2024-05-22T18:03:16.231294 #3183896] INFO -- : [605/885] 3224851=heredoc_dedent_test I, [2024-05-22T18:03:16.234912 #3183896] INFO -- : [606/885] 3224851=test_type I, [2024-05-22T18:03:16.243249 #3183896] INFO -- : [607/885] 3224851=test_tmpdir I, [2024-05-22T18:03:16.325196 #3183896] INFO -- : [608/885] 3224851=test_struct I, [2024-05-22T18:03:16.936876 #3183896] INFO -- : [609/885] 3224851=test_dup I, [2024-05-22T18:03:17.092933 #3183896] INFO -- : [610/885] 3224851=test_rdoc_single_class I, [2024-05-22T18:03:17.096338 #3183896] INFO -- : [611/885] 3224851=test_acceptable I, [2024-05-22T18:03:17.179210 #3183896] INFO -- : [612/885] 3224851=test_gem_ext_cargo_builder_link_flag_converter I, [2024-05-22T18:03:17.248355 #3183896] INFO -- : [613/885] 3224851=test_gem_local_remote_options I, [2024-05-22T18:03:17.311386 #3183896] INFO -- : [614/885] 3224851=test_gem_safe_marshal I, [2024-05-22T18:03:18.111041 #3183896] INFO -- : [615/885] 3224851=test_rdoc_ri_driver I, [2024-05-22T18:03:18.594838 #3183896] INFO -- : [616/885] 3224851=test_httpheader I, [2024-05-22T18:03:18.600353 #3183896] INFO -- : [617/885] 3224851=test_sexp I, [2024-05-22T18:03:18.623879 #3183896] INFO -- : [618/885] 3224851=test_ractor I, [2024-05-22T18:03:18.745517 #3183896] INFO -- : [619/885] 3224851=test_gem_resolver_git_set I, [2024-05-22T18:03:19.330504 #3183896] INFO -- : [620/885] 3224851=test_gem_commands_check_command I, [2024-05-22T18:03:19.365944 #3183896] INFO -- : [621/885] 3224851=test_signedness I, [2024-05-22T18:03:21.244558 #3183896] INFO -- : [622/885] 3224851=test_digest I, [2024-05-22T18:03:22.030001 #3183896] INFO -- : [623/885] 3224851=test_ractor I, [2024-05-22T18:03:22.104186 #3183896] INFO -- : [624/885] 3224851=test_exception_at_throwing I, [2024-05-22T18:03:22.172788 #3183896] INFO -- : [625/885] 3224851=test_gem_resolver_installed_specification I, [2024-05-22T18:03:22.186742 #3183896] INFO -- : [626/885] 3224851=test_stringscanner I, [2024-05-22T18:03:22.292377 #3183896] INFO -- : [627/885] 3224851=test_fiddle I, [2024-05-22T18:03:22.550157 #3183896] INFO -- : [628/885] 3224851=json_generic_object_test I, [2024-05-22T18:03:22.560383 #3183896] INFO -- : [629/885] 3224851=test_gem_resolver_vendor_specification I, [2024-05-22T18:03:22.603183 #3183896] INFO -- : [630/885] 3224851=test_date_arith I, [2024-05-22T18:03:22.614934 #3183896] INFO -- : [631/885] 3224851=test_config I, [2024-05-22T18:03:22.680407 #3183896] INFO -- : [632/885] 3224851=test_ostruct I, [2024-05-22T18:03:22.803962 #3183896] INFO -- : [633/885] 3224851=test_depth_first I, [2024-05-22T18:03:22.811705 #3183896] INFO -- : [634/885] 3224851=test_change_word I, [2024-05-22T18:03:22.824161 #3183896] INFO -- : [635/885] 3224851=test_rdoc_parser_markdown I, [2024-05-22T18:03:22.837018 #3183896] INFO -- : [636/885] 3224851=test_custom_command I, [2024-05-22T18:03:22.846484 #3183896] INFO -- : [637/885] 3224851=fuzzer_test I, [2024-05-22T18:03:22.853491 #3183896] INFO -- : [638/885] 3224851=test_rubyvm I, [2024-05-22T18:03:22.911607 #3183896] INFO -- : [639/885] 3224851=test_cparser I, [2024-05-22T18:03:24.877847 #3183896] INFO -- : [640/885] 3224851=static_inspect_test I, [2024-05-22T18:03:24.883940 #3183896] INFO -- : [641/885] 3224851=test_struct I, [2024-05-22T18:03:24.940280 #3183896] INFO -- : [642/885] 3224851=test_c_struct_entry I, [2024-05-22T18:03:25.705064 #3183896] INFO -- : [643/885] 3224851=test_gem_package_task I, [2024-05-22T18:03:25.750523 #3183896] INFO -- : [644/885] 3224851=test_lock_native_thread I, [2024-05-22T18:03:25.964682 #3183896] INFO -- : [645/885] 3224851=test_resize I, [2024-05-22T18:03:25.979875 #3183896] INFO -- : [646/885] 3224851=test_key_error I, [2024-05-22T18:03:25.983830 #3183896] INFO -- : [647/885] 3224851=test_win32ole_param I, [2024-05-22T18:03:26.003144 #3183896] INFO -- : [648/885] 3224851=test_engine I, [2024-05-22T18:03:26.492714 #3183896] INFO -- : [649/885] 3224851=test_gem_commands_mirror I, [2024-05-22T18:03:26.498620 #3183896] INFO -- : [650/885] 3224851=test_fiber I, [2024-05-22T18:03:31.448275 #3183896] INFO -- : [651/885] 3224852=test_gem_security_trust_dir I, [2024-05-22T18:03:31.504821 #3183896] INFO -- : [652/885] 3224852=test_erb_command I, [2024-05-22T18:03:31.538829 #3183896] INFO -- : [653/885] 3224852=test_module I, [2024-05-22T18:03:32.700550 #3183896] INFO -- : [654/885] 3224851=test_usrmarshal I, [2024-05-22T18:03:32.862173 #3183896] INFO -- : [655/885] 3224851=test_gem_source_installed I, [2024-05-22T18:03:32.867448 #3183896] INFO -- : [656/885] 3224851=test_gem_validator I, [2024-05-22T18:03:32.999910 #3183896] INFO -- : [657/885] 3224851=test_abi I, [2024-05-22T18:03:33.058777 #3183896] INFO -- : [658/885] 3224851=test_load I, [2024-05-22T18:03:33.078998 #3183896] INFO -- : [659/885] 3224851=test_bundled_ca I, [2024-05-22T18:03:35.411079 #3183896] INFO -- : [660/885] 3224852=test_integer_comb I, [2024-05-22T18:03:35.887733 #3183896] INFO -- : [661/885] 3224851=test_ssl I, [2024-05-22T18:03:38.129031 #3183896] INFO -- : [662/885] 3224852=test_require I, [2024-05-22T18:03:40.720790 #3183896] INFO -- : [663/885] 3224852=test_objectspace I, [2024-05-22T18:03:41.673298 #3183896] INFO -- : [664/885] 3224852=test_debugger_integration I, [2024-05-22T18:03:41.688589 #3183896] INFO -- : [665/885] 3224852=test_gem_resolver_composed_set I, [2024-05-22T18:03:41.705931 #3183896] INFO -- : [666/885] 3224852=test_my_integer I, [2024-05-22T18:03:41.714045 #3183896] INFO -- : [667/885] 3224852=test_tracer I, [2024-05-22T18:03:41.723989 #3183896] INFO -- : [668/885] 3224852=test_cgi_cookie I, [2024-05-22T18:03:41.731665 #3183896] INFO -- : [669/885] 3224852=test_not I, [2024-05-22T18:03:41.755744 #3183896] INFO -- : [670/885] 3224852=test_option I, [2024-05-22T18:03:41.846619 #3183896] INFO -- : [671/885] 3224852=test_wss I, [2024-05-22T18:03:41.860552 #3183896] INFO -- : [672/885] 3224852=test_rdoc_markup_attribute_manager I, [2024-05-22T18:03:41.896641 #3183896] INFO -- : [673/885] 3224852=test_rdoc_rd_block_parser I, [2024-05-22T18:03:41.995168 #3183896] INFO -- : [674/885] 3224852=test_x509store I, [2024-05-22T18:03:42.436887 #3183896] INFO -- : [675/885] 3224852=test_rdoc_rd I, [2024-05-22T18:03:42.439351 #3183896] INFO -- : [676/885] 3224852=test_rdoc_generator_pot I, [2024-05-22T18:03:42.456254 #3183896] INFO -- : [677/885] 3224852=test_rdoc_markup_to_markdown I, [2024-05-22T18:03:42.518640 #3183896] INFO -- : [678/885] 3224852=test_rdoc_markup_to_joined_paragraph I, [2024-05-22T18:03:42.535136 #3183896] INFO -- : [679/885] 3224852=test_require_lib I, [2024-05-22T18:03:45.470581 #3183896] INFO -- : [680/885] 3224852=test_gem_gem_runner I, [2024-05-22T18:03:45.516273 #3183896] INFO -- : [681/885] 3224852=test_metaclass I, [2024-05-22T18:03:45.522257 #3183896] INFO -- : [682/885] 3224852=test_win32ole_type I, [2024-05-22T18:03:45.527967 #3183896] INFO -- : [683/885] 3224852=test_rdoc_rd_inline_parser I, [2024-05-22T18:03:45.570418 #3183896] INFO -- : [684/885] 3224852=test_load I, [2024-05-22T18:03:45.575832 #3183896] INFO -- : [685/885] 3224852=test_gem_source_lock I, [2024-05-22T18:03:45.689266 #3183896] INFO -- : [686/885] 3224852=test_cipher I, [2024-05-22T18:03:45.718001 #3183896] INFO -- : [687/885] 3224852=test_update I, [2024-05-22T18:03:45.725552 #3183896] INFO -- : [688/885] 3224852=test_new I, [2024-05-22T18:03:45.737850 #3183896] INFO -- : [689/885] 3224852=test_parser I, [2024-05-22T18:03:45.758239 #3183896] INFO -- : [690/885] 3224852=test_rdoc_markup_to_label I, [2024-05-22T18:03:45.804704 #3183896] INFO -- : [691/885] 3224852=test_gem_resolver_best_set I, [2024-05-22T18:03:45.883318 #3183896] INFO -- : [692/885] 3224852=test_cgi_core I, [2024-05-22T18:03:45.891348 #3183896] INFO -- : [693/885] 3224852=test_registry I, [2024-05-22T18:03:45.900263 #3183896] INFO -- : [694/885] 3224852=test_gem I, [2024-05-22T18:03:46.459197 #3183896] INFO -- : [695/885] 3224851=json_generator_test I, [2024-05-22T18:03:46.555854 #3183896] INFO -- : [696/885] 3224851=test_ansi_without_terminfo I, [2024-05-22T18:03:46.567247 #3183896] INFO -- : [697/885] 3224851=test_ractor I, [2024-05-22T18:03:46.589868 #3183896] INFO -- : [698/885] 3224851=test_gem_resolver_conflict I, [2024-05-22T18:03:46.681293 #3183896] INFO -- : [699/885] 3224851=test_ractor I, [2024-05-22T18:03:46.923737 #3183896] INFO -- : [700/885] 3224851=test_scheduler I, [2024-05-22T18:03:47.084665 #3183896] INFO -- : [701/885] 3224851=test_gem_commands_help_command I, [2024-05-22T18:03:47.222098 #3183896] INFO -- : [702/885] 3224851=test_ssl I, [2024-05-22T18:03:47.276851 #3183896] INFO -- : [703/885] 3224850=test_enc_str_buf_cat I, [2024-05-22T18:03:47.318854 #3183896] INFO -- : [704/885] 3224850=newline_test I, [2024-05-22T18:03:47.403065 #3183896] INFO -- : [705/885] 3224850=test_bignum I, [2024-05-22T18:03:47.405471 #3183896] INFO -- : [706/885] 3224851=test_rdoc_markup_hard_break I, [2024-05-22T18:03:47.417953 #3183896] INFO -- : [707/885] 3224851=ractor_test I, [2024-05-22T18:03:47.475655 #3183896] INFO -- : [708/885] 3224851=test_ancdata I, [2024-05-22T18:03:47.480377 #3183896] INFO -- : [709/885] 3224851=test_marshal I, [2024-05-22T18:03:48.069350 #3183896] INFO -- : [710/885] 3224852=test_nesting_parser I, [2024-05-22T18:03:48.095164 #3183896] INFO -- : [711/885] 3224852=test_gem_commands_contents_command I, [2024-05-22T18:03:48.191796 #3183896] INFO -- : [712/885] 3224852=test_udp I, [2024-05-22T18:03:48.212693 #3183896] INFO -- : [713/885] 3224852=test_context I, [2024-05-22T18:03:48.311617 #3183896] INFO -- : [714/885] 3224852=test_gem_commands_search_command I, [2024-05-22T18:03:48.329978 #3183896] INFO -- : [715/885] 3224852=test_symbol I, [2024-05-22T18:03:48.794387 #3183896] INFO -- : [716/885] 3224851=test_coder I, [2024-05-22T18:03:48.818592 #3183896] INFO -- : [717/885] 3224851=test_rdoc_servlet I, [2024-05-22T18:03:48.920268 #3183896] INFO -- : [718/885] 3224851=test_formatter I, [2024-05-22T18:03:50.134996 #3183896] INFO -- : [719/885] 3224851=test_integer I, [2024-05-22T18:03:51.098841 #3183896] INFO -- : [720/885] 3224850=test_unix I, [2024-05-22T18:03:51.437796 #3183896] INFO -- : [721/885] 3224850=test_have_func I, [2024-05-22T18:03:51.720016 #3183896] INFO -- : [722/885] 3224851=test_date_marshal I, [2024-05-22T18:03:51.736528 #3183896] INFO -- : [723/885] 3224851=test_gem_resolver_local_specification I, [2024-05-22T18:03:51.762933 #3183896] INFO -- : [724/885] 3224851=test_configuration I, [2024-05-22T18:03:51.861360 #3183896] INFO -- : [725/885] 3224851=test_date_new I, [2024-05-22T18:03:51.879159 #3183896] INFO -- : [726/885] 3224851=test_gem_commands_list_command I, [2024-05-22T18:03:51.890795 #3183896] INFO -- : [727/885] 3224851=test_address_resolve I, [2024-05-22T18:03:51.908110 #3183896] INFO -- : [728/885] 3224851=test_stream I, [2024-05-22T18:03:51.976376 #3183896] INFO -- : [729/885] 3224851=test_ractor I, [2024-05-22T18:03:51.992877 #3183896] INFO -- : [730/885] 3224851=test_trick I, [2024-05-22T18:03:52.543468 #3183896] INFO -- : [731/885] 3224850=test_rdoc_attr I, [2024-05-22T18:03:52.571849 #3183896] INFO -- : [732/885] 3224850=test_locale I, [2024-05-22T18:03:52.589765 #3183896] INFO -- : [733/885] 3224850=test_ts I, [2024-05-22T18:03:52.889066 #3183896] INFO -- : [734/885] 3224850=test_rbconfig I, [2024-05-22T18:03:52.903316 #3183896] INFO -- : [735/885] 3224850=test_num2int I, [2024-05-22T18:03:52.973894 #3183896] INFO -- : [736/885] 3224850=test_extlibs I, [2024-05-22T18:03:54.527893 #3183896] INFO -- : [737/885] 3224850=test_iter_break I, [2024-05-22T18:03:54.545896 #3183896] INFO -- : [738/885] 3224850=test_range I, [2024-05-22T18:03:54.607989 #3183896] INFO -- : [739/885] 3224851=test_gem_commands_signin_command I, [2024-05-22T18:03:54.777507 #3183896] INFO -- : [740/885] 3224851=test_require I, [2024-05-22T18:03:55.094312 #3183896] INFO -- : [741/885] 3224852=test_recursion I, [2024-05-22T18:03:55.100430 #3183896] INFO -- : [742/885] 3224852=test_rdoc_markup_include I, [2024-05-22T18:03:55.116709 #3183896] INFO -- : [743/885] 3224852=test_enum I, [2024-05-22T18:03:55.306591 #3183896] INFO -- : [744/885] 3224850=test_ensured I, [2024-05-22T18:03:55.352662 #3183896] INFO -- : [745/885] 3224850=test_euc_jp I, [2024-05-22T18:03:55.363136 #3183896] INFO -- : [746/885] 3224850=test_rdoc_markup I, [2024-05-22T18:03:55.379852 #3183896] INFO -- : [747/885] 3224850=test_key_stroke I, [2024-05-22T18:03:55.414859 #3183896] INFO -- : [748/885] 3224850=test_alias_and_anchor I, [2024-05-22T18:03:55.418438 #3183896] INFO -- : [749/885] 3224850=test_time I, [2024-05-22T18:03:55.632347 #3183896] INFO -- : [750/885] 3224850=test_popen_deadlock I, [2024-05-22T18:03:56.040931 #3183896] INFO -- : [751/885] 3224851=test_project_sanity I, [2024-05-22T18:03:56.108988 #3183896] INFO -- : [752/885] 3224851=test_symbol I, [2024-05-22T18:03:56.119152 #3183896] INFO -- : [753/885] 3224851=location_test I, [2024-05-22T18:03:56.156375 #3183896] INFO -- : [754/885] 3224851=test_chilled I, [2024-05-22T18:03:56.161140 #3183896] INFO -- : [755/885] 3224852=test_delegate I, [2024-05-22T18:03:56.165821 #3183896] INFO -- : [756/885] 3224851=test_interned_str I, [2024-05-22T18:03:56.169974 #3183896] INFO -- : [757/885] 3224851=constant_path_node_test I, [2024-05-22T18:03:56.180180 #3183896] INFO -- : [758/885] 3224852=test_set_len I, [2024-05-22T18:03:56.185129 #3183896] INFO -- : [759/885] 3224851=test_folderitem2_invokeverb I, [2024-05-22T18:03:56.187157 #3183896] INFO -- : [760/885] 3224851=test_pattern_matching I, [2024-05-22T18:03:56.190996 #3183896] INFO -- : [761/885] 3224850=test_gc I, [2024-05-22T18:03:56.204734 #3183896] INFO -- : [762/885] 3224852=test_gem_bundler_version_finder I, [2024-05-22T18:03:56.232439 #3183896] INFO -- : [763/885] 3224852=test_gem_request_set I, [2024-05-22T18:03:56.249473 #3183896] INFO -- : [764/885] 3224851=ruby_api_test I, [2024-05-22T18:03:56.460679 #3183896] INFO -- : [765/885] 3224851=test_gem_resolver_index_set I, [2024-05-22T18:03:56.511211 #3183896] INFO -- : [766/885] 3224851=test_sleep I, [2024-05-22T18:03:56.797871 #3183896] INFO -- : [767/885] 3224852=test_webauthn_listener_response I, [2024-05-22T18:03:56.830824 #3183896] INFO -- : [768/885] 3224852=test_time_tz I, [2024-05-22T18:03:56.889404 #3183896] INFO -- : [769/885] 3224852=test_addrinfo I, [2024-05-22T18:03:56.932918 #3183896] INFO -- : [770/885] 3224852=test_to_ruby I, [2024-05-22T18:03:56.944675 #3183896] INFO -- : [771/885] 3224852=test_data I, [2024-05-22T18:03:57.012540 #3183896] INFO -- : [772/885] 3224852=test_bug-14834 I, [2024-05-22T18:03:57.068177 #3183896] INFO -- : [773/885] 3224852=test_inlinecache I, [2024-05-22T18:03:57.070482 #3183896] INFO -- : [774/885] 3224852=test_terminfo I, [2024-05-22T18:03:57.071995 #3183896] INFO -- : [775/885] 3224852=test_socket I, [2024-05-22T18:03:57.978519 #3183896] INFO -- : [776/885] 3224852=test_thread I, [2024-05-22T18:04:01.533017 #3183896] INFO -- : [777/885] 3224851=test_reline I, [2024-05-22T18:04:01.799202 #3183896] INFO -- : [778/885] 3224851=test_call I, [2024-05-22T18:04:01.988658 #3183896] INFO -- : [779/885] 3224851=test_ellipsize I, [2024-05-22T18:04:02.012409 #3183896] INFO -- : [780/885] 3224851=test_gem_commands_build_command I, [2024-05-22T18:04:02.305022 #3183896] INFO -- : [781/885] 3224851=test_windows_1251 I, [2024-05-22T18:04:02.316051 #3183896] INFO -- : [782/885] 3224851=test_gem_ext_builder I, [2024-05-22T18:04:03.375791 #3183896] INFO -- : [783/885] 3224851=test_to_ary_concat I, [2024-05-22T18:04:06.776799 #3183896] INFO -- : [784/885] 3224852=test_history I, [2024-05-22T18:04:06.791140 #3183896] INFO -- : [785/885] 3224852=test_mailto I, [2024-05-22T18:04:06.800865 #3183896] INFO -- : [786/885] 3224852=test_addr I, [2024-05-22T18:04:06.810489 #3183896] INFO -- : [787/885] 3224852=test_kill_ring I, [2024-05-22T18:04:06.818880 #3183896] INFO -- : [788/885] 3224852=test_member I, [2024-05-22T18:04:06.829816 #3183896] INFO -- : [789/885] 3224852=test_object I, [2024-05-22T18:04:06.836309 #3183896] INFO -- : [790/885] 3224852=format_errors_test I, [2024-05-22T18:04:06.846253 #3183896] INFO -- : [791/885] 3224852=test_cgi_header I, [2024-05-22T18:04:06.903099 #3183896] INFO -- : [792/885] 3224852=test_case_options I, [2024-05-22T18:04:06.923520 #3183896] INFO -- : [793/885] 3224852=test_helper I, [2024-05-22T18:04:06.932693 #3183896] INFO -- : [794/885] 3224852=test_duplicate I, [2024-05-22T18:04:06.945991 #3183896] INFO -- : [795/885] 3224852=test_gem_resolver_api_set I, [2024-05-22T18:04:07.191578 #3183896] INFO -- : [796/885] 3224852=test_bug_reporter I, [2024-05-22T18:04:07.217457 #3183896] INFO -- : [797/885] 3224852=test_gem_installer I, [2024-05-22T18:04:07.272075 #3183896] INFO -- : [798/885] 3224851=test_buffered_io I, [2024-05-22T18:04:07.347971 #3183896] INFO -- : [799/885] 3224851=test_ossl I, [2024-05-22T18:04:07.387834 #3183896] INFO -- : [800/885] 3224850=test_ruby_lex I, [2024-05-22T18:04:07.506658 #3183896] INFO -- : [801/885] 3224850=compiler_test I, [2024-05-22T18:04:07.508704 #3183896] INFO -- : [802/885] 3224850=test_arith_seq_extract I, [2024-05-22T18:04:07.556660 #3183896] INFO -- : [803/885] 3224850=test_gem_source_subpath_problem I, [2024-05-22T18:04:07.645349 #3183896] INFO -- : [804/885] 3224850=test_object_references I, [2024-05-22T18:04:07.665936 #3183896] INFO -- : [805/885] 3224850=test_eval I, [2024-05-22T18:04:07.963097 #3183896] INFO -- : [806/885] 3224850=test_beginendblock I, [2024-05-22T18:04:08.295610 #3183896] INFO -- : [807/885] 3224850=test_monitor I, [2024-05-22T18:04:08.521270 #3183896] INFO -- : [808/885] 3224850=test_regexp I, [2024-05-22T18:04:11.997288 #3183896] INFO -- : [809/885] 3224852=test_whileuntil I, [2024-05-22T18:04:12.004533 #3183896] INFO -- : [810/885] 3224852=test_nofree I, [2024-05-22T18:04:12.050712 #3183896] INFO -- : [811/885] 3224852=test_pointer I, [2024-05-22T18:04:13.998818 #3183896] INFO -- : [812/885] 3224852=test_within_pipe I, [2024-05-22T18:04:14.026549 #3183896] INFO -- : [813/885] 3224852=test_rdoc_normal_class I, [2024-05-22T18:04:14.073981 #3183896] INFO -- : [814/885] 3224852=test_scalar_scanner I, [2024-05-22T18:04:14.098802 #3183896] INFO -- : [815/885] 3224852=test_lambda I, [2024-05-22T18:04:14.159358 #3183896] INFO -- : [816/885] 3224852=test_rb_str_dup I, [2024-05-22T18:04:14.168632 #3183896] INFO -- : [817/885] 3224852=test_trace I, [2024-05-22T18:04:14.193023 #3183896] INFO -- : [818/885] 3224852=test_arity I, [2024-05-22T18:04:14.204432 #3183896] INFO -- : [819/885] 3224852=test_gem_path_support I, [2024-05-22T18:04:14.276785 #3183896] INFO -- : [820/885] 3224852=test_keyword I, [2024-05-22T18:04:14.802701 #3183896] INFO -- : [821/885] 3224852=test_win32ole_type_event I, [2024-05-22T18:04:14.813905 #3183896] INFO -- : [822/885] 3224852=test_rdoc_markup_to_html I, [2024-05-22T18:04:14.908801 #3183896] INFO -- : [823/885] 3224852=test_foreach I, [2024-05-22T18:04:14.916636 #3183896] INFO -- : [824/885] 3224852=test_append I, [2024-05-22T18:04:14.943847 #3183896] INFO -- : [825/885] 3224852=test_gem_resolver_installer_set I, [2024-05-22T18:04:14.988647 #3183896] INFO -- : [826/885] 3224851=test_emitter I, [2024-05-22T18:04:15.000144 #3183896] INFO -- : [827/885] 3224851=test_x509ext I, [2024-05-22T18:04:15.012905 #3183896] INFO -- : [828/885] 3224851=bom_test I, [2024-05-22T18:04:15.022179 #3183896] INFO -- : [829/885] 3224851=test_config I, [2024-05-22T18:04:15.179892 #3183896] INFO -- : [830/885] 3224852=test_file I, [2024-05-22T18:04:15.426033 #3183896] INFO -- : [831/885] 3224851=test_helper_method I, [2024-05-22T18:04:15.438164 #3183896] INFO -- : [832/885] 3224851=test_summary I, [2024-05-22T18:04:15.496480 #3183896] INFO -- : [833/885] 3224851=test_dns I, [2024-05-22T18:04:16.006308 #3183896] INFO -- : [834/885] 3224851=test_notimplement I, [2024-05-22T18:04:16.017412 #3183896] INFO -- : [835/885] 3224851=test_cgi_session I, [2024-05-22T18:04:16.087257 #3183896] INFO -- : [836/885] 3224851=test_c_union_entity I, [2024-05-22T18:04:16.204309 #3183896] INFO -- : [837/885] 3224851=test_x509crl I, [2024-05-22T18:04:16.305600 #3183896] INFO -- : [838/885] 3224851=test_rdoc_markup_heading I, [2024-05-22T18:04:16.313207 #3183896] INFO -- : [839/885] 3224851=test_flip I, [2024-05-22T18:04:16.340960 #3183896] INFO -- : [840/885] 3224851=test_io_console I, [2024-05-22T18:04:18.982008 #3183896] INFO -- : [841/885] 3224851=test_pattern_key_name_check I, [2024-05-22T18:04:18.991011 #3183896] INFO -- : [842/885] 3224851=test_profile_frames I, [2024-05-22T18:04:19.169087 #3183896] INFO -- : [843/885] 3224851=test_debug I, [2024-05-22T18:04:19.186802 #3183896] INFO -- : [844/885] 3224851=test_transcode I, [2024-05-22T18:04:19.576973 #3183896] INFO -- : [845/885] 3224851=test_refinement I, [2024-05-22T18:04:21.370953 #3183896] INFO -- : [846/885] 3224852=test_class2name I, [2024-05-22T18:04:21.398136 #3183896] INFO -- : [847/885] 3224852=test_gem_commands_cleanup_command I, [2024-05-22T18:04:21.993355 #3183896] INFO -- : [848/885] 3224852=test_gem_ext_cmake_builder I, [2024-05-22T18:04:22.005872 #3183896] INFO -- : [849/885] 3224852=test_digest_extend I, [2024-05-22T18:04:22.688187 #3183896] INFO -- : [850/885] 3224852=test_last_thread I, [2024-05-22T18:04:23.072304 #3183896] INFO -- : [851/885] 3224851=test_thread_fd_close I, [2024-05-22T18:04:23.074778 #3183896] INFO -- : [852/885] 3224852=test_getopts I, [2024-05-22T18:04:23.080819 #3183896] INFO -- : [853/885] 3224851=test_emitter I, [2024-05-22T18:04:23.084021 #3183896] INFO -- : [854/885] 3224852=test_fips I, [2024-05-22T18:04:23.156531 #3183896] INFO -- : [855/885] 3224851=test_alias I, [2024-05-22T18:04:23.316997 #3183896] INFO -- : [856/885] 3224851=test_compile_prism I, [2024-05-22T18:04:23.358845 #3183896] INFO -- : [857/885] 3224852=test_helper I, [2024-05-22T18:04:23.363672 #3183896] INFO -- : [858/885] 3224852=test_win32ole_event I, [2024-05-22T18:04:23.372526 #3183896] INFO -- : [859/885] 3224852=test_rdoc_markup_formatter I, [2024-05-22T18:04:23.389260 #3183896] INFO -- : [860/885] 3224852=test_gem_commands_uninstall_command I, [2024-05-22T18:04:23.639721 #3183896] INFO -- : [861/885] 3224851=test_modify_expand I, [2024-05-22T18:04:23.671757 #3183896] INFO -- : [862/885] 3224851=test_gem_available_set I, [2024-05-22T18:04:23.763428 #3183896] INFO -- : [863/885] 3224851=test_pkg_config I, [2024-05-22T18:04:23.820798 #3183896] INFO -- : [864/885] 3224851=test_convertible I, [2024-05-22T18:04:24.267545 #3183896] INFO -- : [865/885] 3224852=errors_test I, [2024-05-22T18:04:24.369470 #3183896] INFO -- : [866/885] 3224852=json_encoding_test I, [2024-05-22T18:04:24.373584 #3183896] INFO -- : [867/885] 3224852=test_vm_dump I, [2024-05-22T18:04:24.383830 #3183896] INFO -- : [868/885] 3224852=test_config I, [2024-05-22T18:04:25.851977 #3183896] INFO -- : [869/885] 3224852=test_func I, [2024-05-22T18:04:27.362943 #3183896] INFO -- : [870/885] 3224851=test_gem_resolver I, [2024-05-22T18:04:27.668612 #3183896] INFO -- : [871/885] 3224851=test_gem_source_vendor I, [2024-05-22T18:04:27.673943 #3183896] INFO -- : [872/885] 3224851=test_dln I, [2024-05-22T18:04:27.689822 #3183896] INFO -- : [873/885] 3224851=test_object I, [2024-05-22T18:04:28.123591 #3183896] INFO -- : [874/885] 3224851=test_gem_commands_exec_command I, [2024-05-22T18:04:29.390348 #3183896] INFO -- : [875/885] 3224851=unescape_test I, [2024-05-22T18:04:30.456674 #3183896] INFO -- : [876/885] 3224852=test_super I, [2024-05-22T18:04:30.791531 #3183896] INFO -- : [877/885] 3224851=test_color_printer I, [2024-05-22T18:04:30.999416 #3183896] INFO -- : [878/885] 3224851=test_readpartial I, [2024-05-22T18:04:31.225342 #3183896] INFO -- : [879/885] 3224851=test_rdoc_parser_ruby I, [2024-05-22T18:04:32.252269 #3183896] INFO -- : [880/885] 3224851=test_httpresponse I, [2024-05-22T18:04:32.289391 #3183896] INFO -- : [881/885] 3224851=test_x509req I, [2024-05-22T18:04:32.317225 #3183896] INFO -- : [882/885] 3224851=test_gem_console_ui I, [2024-05-22T18:04:32.342108 #3183896] INFO -- : [883/885] 3224851=test_allocation I, [2024-05-22T18:04:32.411935 #3183896] INFO -- : [884/885] 3224852=test_ifunless I, [2024-05-22T18:04:32.418035 #3183896] INFO -- : [885/885] 3224852=test_insns_leaf I, [2024-05-22T18:04:51.810922 #3183896] INFO -- : Finished tests in 208.626025s, 126.3601 tests/s, 44822.8259 assertions/s. I, [2024-05-22T18:04:51.815635 #3183896] INFO -- : 26362 tests, 9351208 assertions, 0 failures, 0 errors, 320 skips I, [2024-05-22T18:04:51.815668 #3183896] INFO -- : I, [2024-05-22T18:04:51.815679 #3183896] INFO -- : ruby -v: ruby 3.4.0dev (2024-05-22T06:59:19Z master 5613d6e95b) [aarch64-linux] I, [2024-05-22T18:04:51.816480 #3183896] INFO -- : $$$[end] "make yes-test-all TESTOPTS='--stderr-on-failure' TESTS='-j3'" exit with 0. I, [2024-05-22T18:04:51.816654 #3183896] INFO -- : $$$[beg] make yes-test-rubyspec MSPECOPT='--error-output stderr --debug -j' TESTS='-j3' I, [2024-05-22T18:04:51.943549 #3183896] INFO -- : BASERUBY = /usr/local/bin/ruby --disable=gems I, [2024-05-22T18:04:51.943624 #3183896] INFO -- : CC = gcc I, [2024-05-22T18:04:51.943639 #3183896] INFO -- : LD = ld I, [2024-05-22T18:04:51.943649 #3183896] INFO -- : LDSHARED = gcc -shared I, [2024-05-22T18:04:51.943662 #3183896] INFO -- : CFLAGS = -O3 -fno-fast-math -ggdb3 -Wall -Wextra -Wdeprecated-declarations -Wdiv-by-zero -Wduplicated-cond -Wimplicit-function-declaration -Wimplicit-int -Wpointer-arith -Wwrite-strings -Wold-style-definition -Wimplicit-fallthrough=0 -Wmissing-noreturn -Wno-cast-function-type -Wno-constant-logical-operand -Wno-long-long -Wno-missing-field-initializers -Wno-overlength-strings -Wno-packed-bitfield-compat -Wno-parentheses-equality -Wno-self-assign -Wno-tautological-compare -Wno-unused-parameter -Wno-unused-value -Wsuggest-attribute=format -Wsuggest-attribute=noreturn -Wunused-variable -Wmisleading-indentation -Wundef I, [2024-05-22T18:04:51.943673 #3183896] INFO -- : XCFLAGS = -U_FORTIFY_SOURCE -D_FORTIFY_SOURCE=2 -fstack-protector-strong -msign-return-address=all -fno-strict-overflow -fvisibility=hidden -fexcess-precision=standard -DRUBY_EXPORT -fPIE -I. -I.ext/include/aarch64-linux -I/home/opc/ruby/src/master/include -I/home/opc/ruby/src/master -I/home/opc/ruby/src/master/prism -I/home/opc/ruby/src/master/enc/unicode/15.0.0 I, [2024-05-22T18:04:51.943683 #3183896] INFO -- : CPPFLAGS = I, [2024-05-22T18:04:51.943692 #3183896] INFO -- : DLDFLAGS = -Wl,--compress-debug-sections=zlib -fstack-protector-strong -pie I, [2024-05-22T18:04:51.943702 #3183896] INFO -- : SOLIBS = -lz -lrt -lrt -ldl -lcrypt -lm -lpthread I, [2024-05-22T18:04:51.943711 #3183896] INFO -- : LANG = en_US.UTF-8 I, [2024-05-22T18:04:51.943720 #3183896] INFO -- : LC_ALL = I, [2024-05-22T18:04:51.943728 #3183896] INFO -- : LC_CTYPE = I, [2024-05-22T18:04:51.943737 #3183896] INFO -- : MFLAGS = I, [2024-05-22T18:04:51.943745 #3183896] INFO -- : RUSTC = rustc I, [2024-05-22T18:04:51.943754 #3183896] INFO -- : YJIT_RUSTC_ARGS = --crate-name=yjit --crate-type=staticlib --edition=2021 -g -C lto=thin -C opt-level=3 -C overflow-checks=on '--out-dir=/home/opc/ruby/build/master/yjit/target/release/' /home/opc/ruby/src/master/yjit/src/lib.rs I, [2024-05-22T18:04:51.944419 #3183896] INFO -- : gcc (GCC) 8.5.0 20210514 (Red Hat 8.5.0-10.1.0.1) I, [2024-05-22T18:04:51.944434 #3183896] INFO -- : Copyright (C) 2018 Free Software Foundation, Inc. I, [2024-05-22T18:04:51.944444 #3183896] INFO -- : This is free software; see the source for copying conditions. There is NO I, [2024-05-22T18:04:51.944453 #3183896] INFO -- : warranty; not even for MERCHANTABILITY or FITNESS FOR A PARTICULAR PURPOSE. I, [2024-05-22T18:04:51.944462 #3183896] INFO -- : I, [2024-05-22T18:04:51.946498 #3183896] INFO -- : generating enc.mk I, [2024-05-22T18:04:52.177792 #3183896] INFO -- : generating encdb.h I, [2024-05-22T18:04:52.214745 #3183896] INFO -- : encdb.h unchanged I, [2024-05-22T18:04:52.215962 #3183896] INFO -- : making enc I, [2024-05-22T18:04:52.243175 #3183896] INFO -- : make[1]: Entering directory '/home/opc/ruby/build/master' I, [2024-05-22T18:04:52.243244 #3183896] INFO -- : make[1]: Nothing to be done for 'enc'. I, [2024-05-22T18:04:52.243256 #3183896] INFO -- : make[1]: Leaving directory '/home/opc/ruby/build/master' I, [2024-05-22T18:04:52.243912 #3183896] INFO -- : making srcs under enc I, [2024-05-22T18:04:52.286585 #3183896] INFO -- : make[1]: Entering directory '/home/opc/ruby/build/master' I, [2024-05-22T18:04:52.286655 #3183896] INFO -- : make[1]: Nothing to be done for 'srcs'. I, [2024-05-22T18:04:52.286668 #3183896] INFO -- : make[1]: Leaving directory '/home/opc/ruby/build/master' I, [2024-05-22T18:04:52.287757 #3183896] INFO -- : generating transdb.h I, [2024-05-22T18:04:52.433299 #3183896] INFO -- : transdb.h unchanged I, [2024-05-22T18:04:52.434640 #3183896] INFO -- : making trans I, [2024-05-22T18:04:52.483577 #3183896] INFO -- : make[1]: Entering directory '/home/opc/ruby/build/master' I, [2024-05-22T18:04:52.483660 #3183896] INFO -- : make[1]: Nothing to be done for 'trans'. I, [2024-05-22T18:04:52.483671 #3183896] INFO -- : make[1]: Leaving directory '/home/opc/ruby/build/master' I, [2024-05-22T18:04:52.484402 #3183896] INFO -- : making encs I, [2024-05-22T18:04:52.538838 #3183896] INFO -- : make[1]: Entering directory '/home/opc/ruby/build/master' I, [2024-05-22T18:04:52.538909 #3183896] INFO -- : make[1]: Nothing to be done for 'encs'. I, [2024-05-22T18:04:52.538921 #3183896] INFO -- : make[1]: Leaving directory '/home/opc/ruby/build/master' I, [2024-05-22T18:04:52.541578 #3183896] INFO -- : generating makefiles ext/configure-ext.mk I, [2024-05-22T18:04:52.583289 #3183896] INFO -- : ext/configure-ext.mk updated I, [2024-05-22T18:04:52.586911 #3183896] INFO -- : make[1]: Entering directory '/home/opc/ruby/build/master' I, [2024-05-22T18:04:54.739287 #3183896] INFO -- : make[1]: Leaving directory '/home/opc/ruby/build/master' I, [2024-05-22T18:04:54.740010 #3183896] INFO -- : generating makefile exts.mk I, [2024-05-22T18:04:54.798990 #3183896] INFO -- : exts.mk unchanged I, [2024-05-22T18:04:54.803805 #3183896] INFO -- : make[1]: Entering directory '/home/opc/ruby/build/master' I, [2024-05-22T18:04:55.101391 #3183896] INFO -- : make[2]: Entering directory '/home/opc/ruby/build/master/ext/coverage' I, [2024-05-22T18:04:55.106515 #3183896] INFO -- : make[2]: Leaving directory '/home/opc/ruby/build/master/ext/coverage' I, [2024-05-22T18:04:55.112181 #3183896] INFO -- : make[2]: Entering directory '/home/opc/ruby/build/master/ext/date' I, [2024-05-22T18:04:55.117457 #3183896] INFO -- : make[2]: Leaving directory '/home/opc/ruby/build/master/ext/date' I, [2024-05-22T18:04:55.120812 #3183896] INFO -- : make[2]: Entering directory '/home/opc/ruby/build/master/ext/digest' I, [2024-05-22T18:04:55.129642 #3183896] INFO -- : make[2]: Leaving directory '/home/opc/ruby/build/master/ext/digest' I, [2024-05-22T18:04:55.152201 #3183896] INFO -- : make[2]: Entering directory '/home/opc/ruby/build/master/ext/digest/sha2' I, [2024-05-22T18:04:55.157140 #3183896] INFO -- : make[2]: Leaving directory '/home/opc/ruby/build/master/ext/digest/sha2' I, [2024-05-22T18:04:55.175159 #3183896] INFO -- : make[2]: Entering directory '/home/opc/ruby/build/master/ext/fiddle' I, [2024-05-22T18:04:55.185286 #3183896] INFO -- : make[2]: Leaving directory '/home/opc/ruby/build/master/ext/fiddle' I, [2024-05-22T18:04:55.189852 #3183896] INFO -- : make[2]: Entering directory '/home/opc/ruby/build/master/ext/io/console' I, [2024-05-22T18:04:55.194072 #3183896] INFO -- : make[2]: Leaving directory '/home/opc/ruby/build/master/ext/io/console' I, [2024-05-22T18:04:55.204652 #3183896] INFO -- : make[2]: Entering directory '/home/opc/ruby/build/master/ext/json' I, [2024-05-22T18:04:55.214240 #3183896] INFO -- : make[2]: Leaving directory '/home/opc/ruby/build/master/ext/json' I, [2024-05-22T18:04:55.227122 #3183896] INFO -- : make[2]: Entering directory '/home/opc/ruby/build/master/ext/monitor' I, [2024-05-22T18:04:55.231207 #3183896] INFO -- : make[2]: Leaving directory '/home/opc/ruby/build/master/ext/monitor' I, [2024-05-22T18:04:55.237147 #3183896] INFO -- : make[2]: Entering directory '/home/opc/ruby/build/master/ext/objspace' I, [2024-05-22T18:04:55.242939 #3183896] INFO -- : make[2]: Leaving directory '/home/opc/ruby/build/master/ext/objspace' I, [2024-05-22T18:04:55.261807 #3183896] INFO -- : make[2]: Entering directory '/home/opc/ruby/build/master/ext/openssl' I, [2024-05-22T18:04:55.283389 #3183896] INFO -- : make[2]: Leaving directory '/home/opc/ruby/build/master/ext/openssl' I, [2024-05-22T18:04:55.287654 #3183896] INFO -- : make[2]: Entering directory '/home/opc/ruby/build/master/ext/pathname' I, [2024-05-22T18:04:55.291817 #3183896] INFO -- : make[2]: Leaving directory '/home/opc/ruby/build/master/ext/pathname' I, [2024-05-22T18:04:55.298081 #3183896] INFO -- : make[2]: Entering directory '/home/opc/ruby/build/master/ext/psych' I, [2024-05-22T18:04:55.319302 #3183896] INFO -- : make[2]: Leaving directory '/home/opc/ruby/build/master/ext/psych' I, [2024-05-22T18:04:55.323720 #3183896] INFO -- : make[2]: Entering directory '/home/opc/ruby/build/master/ext/pty' I, [2024-05-22T18:04:55.327860 #3183896] INFO -- : make[2]: Leaving directory '/home/opc/ruby/build/master/ext/pty' I, [2024-05-22T18:04:55.341220 #3183896] INFO -- : make[2]: Entering directory '/home/opc/ruby/build/master/ext/ripper' I, [2024-05-22T18:04:55.349168 #3183896] INFO -- : make[2]: Leaving directory '/home/opc/ruby/build/master/ext/ripper' I, [2024-05-22T18:04:55.351111 #3183896] INFO -- : make[2]: Entering directory '/home/opc/ruby/build/master/ext/rubyvm' I, [2024-05-22T18:04:55.355272 #3183896] INFO -- : make[2]: Leaving directory '/home/opc/ruby/build/master/ext/rubyvm' I, [2024-05-22T18:04:55.367518 #3183896] INFO -- : make[2]: Entering directory '/home/opc/ruby/build/master/ext/socket' I, [2024-05-22T18:04:55.378066 #3183896] INFO -- : make[2]: Leaving directory '/home/opc/ruby/build/master/ext/socket' I, [2024-05-22T18:04:55.393675 #3183896] INFO -- : make[2]: Entering directory '/home/opc/ruby/build/master/.bundle/gems/bigdecimal-3.1.7/ext/bigdecimal' I, [2024-05-22T18:04:55.424457 #3183896] INFO -- : make[2]: Leaving directory '/home/opc/ruby/build/master/.bundle/gems/bigdecimal-3.1.7/ext/bigdecimal' I, [2024-05-22T18:04:55.427153 #3183896] INFO -- : make[2]: Entering directory '/home/opc/ruby/build/master/.bundle/gems/bigdecimal-3.1.8/ext/bigdecimal' I, [2024-05-22T18:04:55.457254 #3183896] INFO -- : make[2]: Leaving directory '/home/opc/ruby/build/master/.bundle/gems/bigdecimal-3.1.8/ext/bigdecimal' I, [2024-05-22T18:04:55.460157 #3183896] INFO -- : make[2]: Entering directory '/home/opc/ruby/build/master/.bundle/gems/debug-1.9.2/ext/debug' I, [2024-05-22T18:04:55.490327 #3183896] INFO -- : make[2]: Leaving directory '/home/opc/ruby/build/master/.bundle/gems/debug-1.9.2/ext/debug' I, [2024-05-22T18:04:55.492825 #3183896] INFO -- : make[2]: Entering directory '/home/opc/ruby/build/master/.bundle/gems/nkf-0.2.0/ext/nkf' I, [2024-05-22T18:04:55.523379 #3183896] INFO -- : make[2]: Leaving directory '/home/opc/ruby/build/master/.bundle/gems/nkf-0.2.0/ext/nkf' I, [2024-05-22T18:04:55.526048 #3183896] INFO -- : make[2]: Entering directory '/home/opc/ruby/build/master/.bundle/gems/racc-1.7.3/ext/racc/cparse' I, [2024-05-22T18:04:55.556715 #3183896] INFO -- : make[2]: Leaving directory '/home/opc/ruby/build/master/.bundle/gems/racc-1.7.3/ext/racc/cparse' I, [2024-05-22T18:04:55.559259 #3183896] INFO -- : make[2]: Entering directory '/home/opc/ruby/build/master/.bundle/gems/racc-1.8.0/ext/racc/cparse' I, [2024-05-22T18:04:55.589331 #3183896] INFO -- : make[2]: Leaving directory '/home/opc/ruby/build/master/.bundle/gems/racc-1.8.0/ext/racc/cparse' I, [2024-05-22T18:04:55.592335 #3183896] INFO -- : make[2]: Entering directory '/home/opc/ruby/build/master/.bundle/gems/rbs-3.4.4/ext/rbs_extension' I, [2024-05-22T18:04:55.622369 #3183896] INFO -- : make[2]: Leaving directory '/home/opc/ruby/build/master/.bundle/gems/rbs-3.4.4/ext/rbs_extension' I, [2024-05-22T18:04:55.624803 #3183896] INFO -- : make[2]: Entering directory '/home/opc/ruby/build/master/.bundle/gems/syslog-0.1.2/ext/syslog' I, [2024-05-22T18:04:55.654847 #3183896] INFO -- : make[2]: Leaving directory '/home/opc/ruby/build/master/.bundle/gems/syslog-0.1.2/ext/syslog' I, [2024-05-22T18:04:55.693082 #3183896] INFO -- : make[2]: Entering directory '/home/opc/ruby/build/master' I, [2024-05-22T18:04:55.777360 #3183896] INFO -- : make[2]: 'ruby' is up to date. I, [2024-05-22T18:04:55.777434 #3183896] INFO -- : make[2]: Leaving directory '/home/opc/ruby/build/master' I, [2024-05-22T18:04:55.777560 #3183896] INFO -- : make[1]: Leaving directory '/home/opc/ruby/build/master' I, [2024-05-22T18:04:55.781953 #3183896] INFO -- : make[1]: Entering directory '/home/opc/ruby/build/master' I, [2024-05-22T18:04:55.782015 #3183896] INFO -- : make[1]: Nothing to be done for 'note'. I, [2024-05-22T18:04:55.782030 #3183896] INFO -- : make[1]: Leaving directory '/home/opc/ruby/build/master' E, [2024-05-22T18:04:55.857357 #3183896] ERROR -- : $ /home/opc/ruby/build/master/miniruby -I/home/opc/ruby/src/master/lib /home/opc/ruby/src/master/tool/runruby.rb --archdir=/home/opc/ruby/build/master --extout=.ext -- /home/opc/ruby/src/master/spec/mspec/bin/mspec-run -B /home/opc/ruby/src/master/spec/default.mspec --error-output stderr --debug -fy -o /tmp/rubytest.8mhtwl/1-mspec-multi-0 E, [2024-05-22T18:04:55.857723 #3183896] ERROR -- : $ /home/opc/ruby/build/master/miniruby -I/home/opc/ruby/src/master/lib /home/opc/ruby/src/master/tool/runruby.rb --archdir=/home/opc/ruby/build/master --extout=.ext -- /home/opc/ruby/src/master/spec/mspec/bin/mspec-run -B /home/opc/ruby/src/master/spec/default.mspec --error-output stderr --debug -fy -o /tmp/rubytest.8mhtwl/2-mspec-multi-1 E, [2024-05-22T18:04:55.858007 #3183896] ERROR -- : $ /home/opc/ruby/build/master/miniruby -I/home/opc/ruby/src/master/lib /home/opc/ruby/src/master/tool/runruby.rb --archdir=/home/opc/ruby/build/master --extout=.ext -- /home/opc/ruby/src/master/spec/mspec/bin/mspec-run -B /home/opc/ruby/src/master/spec/default.mspec --error-output stderr --debug -fy -o /tmp/rubytest.8mhtwl/3-mspec-multi-2 I, [2024-05-22T18:04:55.990384 #3183896] INFO -- : ruby 3.4.0dev (2024-05-22T06:59:19Z master 5613d6e95b) [aarch64-linux] I, [2024-05-22T18:05:01.453562 #3183896] INFO -- : 0 ......................................................................... I, [2024-05-22T18:05:03.772973 #3183896] INFO -- : 73 ......................................................................... I, [2024-05-22T18:05:03.971057 #3183896] INFO -- : 146 ......................................................................... I, [2024-05-22T18:05:04.273489 #3183896] INFO -- : 219 ......................................................................... I, [2024-05-22T18:05:04.437339 #3183896] INFO -- : 292 ......................................................................... I, [2024-05-22T18:05:04.680271 #3183896] INFO -- : 365 ......................................................................... I, [2024-05-22T18:05:04.797004 #3183896] INFO -- : 438 ......................................................................... I, [2024-05-22T18:05:04.857146 #3183896] INFO -- : 511 ......................................................................... I, [2024-05-22T18:05:04.917088 #3183896] INFO -- : 584 ......................................................................... I, [2024-05-22T18:05:05.527068 #3183896] INFO -- : 657 ......................................................................... I, [2024-05-22T18:05:05.626939 #3183896] INFO -- : 730 ......................................................................... I, [2024-05-22T18:05:05.676621 #3183896] INFO -- : 803 ......................................................................... I, [2024-05-22T18:05:05.872937 #3183896] INFO -- : 876 ......................................................................... I, [2024-05-22T18:05:05.983348 #3183896] INFO -- : 949 ......................................................................... I, [2024-05-22T18:05:06.587580 #3183896] INFO -- : 1022 ......................................................................... I, [2024-05-22T18:05:08.830423 #3183896] INFO -- : 1095 ......................................................................... I, [2024-05-22T18:05:09.688227 #3183896] INFO -- : 1168 ......................................................................... I, [2024-05-22T18:05:09.854290 #3183896] INFO -- : 1241 ......................................................................... I, [2024-05-22T18:05:10.066883 #3183896] INFO -- : 1314 ......................................................................... I, [2024-05-22T18:05:10.160634 #3183896] INFO -- : 1387 ......................................................................... I, [2024-05-22T18:05:12.203899 #3183896] INFO -- : 1460 ......................................................................... I, [2024-05-22T18:05:15.735544 #3183896] INFO -- : 1533 ......................................................................... I, [2024-05-22T18:05:15.891551 #3183896] INFO -- : 1606 ......................................................................... I, [2024-05-22T18:05:16.647944 #3183896] INFO -- : 1679 ......................................................................... I, [2024-05-22T18:05:16.893337 #3183896] INFO -- : 1752 ......................................................................... I, [2024-05-22T18:05:17.148469 #3183896] INFO -- : 1825 ......................................................................... I, [2024-05-22T18:05:17.462833 #3183896] INFO -- : 1898 ......................................................................... I, [2024-05-22T18:05:17.866098 #3183896] INFO -- : 1971 ......................................................................... I, [2024-05-22T18:05:18.368684 #3183896] INFO -- : 2044 ......................................................................... I, [2024-05-22T18:05:18.472448 #3183896] INFO -- : 2117 ......................................................................... I, [2024-05-22T18:05:18.536625 #3183896] INFO -- : 2190 ......................................................................... I, [2024-05-22T18:05:18.584233 #3183896] INFO -- : 2263 ......................................................................... I, [2024-05-22T18:05:18.633947 #3183896] INFO -- : 2336 ......................................................................... I, [2024-05-22T18:05:18.723531 #3183896] INFO -- : 2409 ......................................................................... I, [2024-05-22T18:05:19.002637 #3183896] INFO -- : 2482 ......................................................................... I, [2024-05-22T18:05:19.140754 #3183896] INFO -- : 2555 ......................................................................... I, [2024-05-22T18:05:20.423853 #3183896] INFO -- : 2628 ......................................................................... I, [2024-05-22T18:05:20.681574 #3183896] INFO -- : 2701 ......................................................................... I, [2024-05-22T18:05:20.816510 #3183896] INFO -- : 2774 ......................................................................... I, [2024-05-22T18:05:21.153319 #3183896] INFO -- : 2847 ......................................................................... I, [2024-05-22T18:05:21.417137 #3183896] INFO -- : 2920 ......................................................................... I, [2024-05-22T18:05:21.536270 #3183896] INFO -- : 2993 ......................................................................... I, [2024-05-22T18:05:21.596198 #3183896] INFO -- : 3066 ......................................................................... I, [2024-05-22T18:05:21.641582 #3183896] INFO -- : 3139 ......................................................................... I, [2024-05-22T18:05:21.700224 #3183896] INFO -- : 3212 ......................................................................... I, [2024-05-22T18:05:21.764710 #3183896] INFO -- : 3285 ......................................................................... I, [2024-05-22T18:05:25.600453 #3183896] INFO -- : 3358 ......................................................................... I, [2024-05-22T18:05:25.623888 #3183896] INFO -- : I, [2024-05-22T18:05:25.623954 #3183896] INFO -- : I, [2024-05-22T18:05:25.623965 #3183896] INFO -- : Finished in 29.766513 seconds I, [2024-05-22T18:05:25.623998 #3183896] INFO -- : I, [2024-05-22T18:05:25.624010 #3183896] INFO -- : 3430 files, 32648 examples, 181716 expectations, 0 failures, 0 errors, 0 tagged I, [2024-05-22T18:05:25.625370 #3183896] INFO -- : $$$[end] "make yes-test-rubyspec MSPECOPT='--error-output stderr --debug -j' TESTS='-j3'" exit with 0.