# Logfile created on 2024-05-22 10:42:43 +0000 by logger.rb/v1.5.3 I, [2024-05-22T10:42:43.461836 #605161] INFO -- : #, @formatter=nil, @logdev=#, @binmode=false, @mon_data=#, @mon_data_owner_object_id=860>>> I, [2024-05-22T10:42:43.462132 #605161] INFO -- : $$$[beg] make update-unicode -j3 I, [2024-05-22T10:42:43.552137 #605161] INFO -- : Downloading Unicode emoji 15.0 files... I, [2024-05-22T10:42:43.552314 #605161] INFO -- : Downloading Unicode emoji 15.0 files... I, [2024-05-22T10:42:43.552644 #605161] INFO -- : Downloading Unicode emoji 15.0 files... I, [2024-05-22T10:42:43.629328 #605161] INFO -- : made symlink emoji/15.0/emoji-sequences.txt to /home/opc/ruby/src/master/.downloaded-cache/emoji/15.0/emoji-sequences.txt I, [2024-05-22T10:42:43.634785 #605161] INFO -- : downloading emoji/15.0/emoji-sequences.txt ... downloading emoji/15.0/emoji-test.txt ... /home/opc/ruby/src/master/enc/unicode/data/emoji/15.0/emoji-sequences.txt already exists E, [2024-05-22T10:42:44.079182 #605161] ERROR -- : /home/opc/ruby/src/master/tool/downloader.rb:302:in `rescue in download': failed to download emoji/15.0/emoji-test.txt (RuntimeError) E, [2024-05-22T10:42:44.079246 #605161] ERROR -- : OpenURI::HTTPError: 403 Forbidden: https://www.unicode.org/Public/emoji/15.0/emoji-test.txt E, [2024-05-22T10:42:44.079257 #605161] ERROR -- : from /home/opc/ruby/src/master/tool/downloader.rb:201:in `download' E, [2024-05-22T10:42:44.079267 #605161] ERROR -- : from /home/opc/ruby/src/master/tool/downloader.rb:136:in `download' E, [2024-05-22T10:42:44.079275 #605161] ERROR -- : from /home/opc/ruby/src/master/tool/downloader.rb:482:in `block in
' E, [2024-05-22T10:42:44.079284 #605161] ERROR -- : from /home/opc/ruby/src/master/tool/downloader.rb:465:in `each' E, [2024-05-22T10:42:44.079292 #605161] ERROR -- : from /home/opc/ruby/src/master/tool/downloader.rb:465:in `
' E, [2024-05-22T10:42:44.079300 #605161] ERROR -- : /usr/local/lib/ruby/3.2.0/open-uri.rb:369:in `open_http': 403 Forbidden (OpenURI::HTTPError) E, [2024-05-22T10:42:44.079309 #605161] ERROR -- : from /usr/local/lib/ruby/3.2.0/open-uri.rb:760:in `buffer_open' E, [2024-05-22T10:42:44.079317 #605161] ERROR -- : from /usr/local/lib/ruby/3.2.0/open-uri.rb:214:in `block in open_loop' E, [2024-05-22T10:42:44.079325 #605161] ERROR -- : from /usr/local/lib/ruby/3.2.0/open-uri.rb:212:in `catch' E, [2024-05-22T10:42:44.079333 #605161] ERROR -- : from /usr/local/lib/ruby/3.2.0/open-uri.rb:212:in `open_loop' E, [2024-05-22T10:42:44.079341 #605161] ERROR -- : from /usr/local/lib/ruby/3.2.0/open-uri.rb:153:in `open_uri' E, [2024-05-22T10:42:44.079349 #605161] ERROR -- : from /usr/local/lib/ruby/3.2.0/open-uri.rb:740:in `open' E, [2024-05-22T10:42:44.079357 #605161] ERROR -- : from /usr/local/lib/ruby/3.2.0/open-uri.rb:748:in `read' E, [2024-05-22T10:42:44.079369 #605161] ERROR -- : from /home/opc/ruby/src/master/tool/downloader.rb:247:in `block in download' E, [2024-05-22T10:42:44.079377 #605161] ERROR -- : from /home/opc/ruby/src/master/tool/downloader.rb:378:in `with_retry' E, [2024-05-22T10:42:44.079385 #605161] ERROR -- : from /home/opc/ruby/src/master/tool/downloader.rb:246:in `download' E, [2024-05-22T10:42:44.079393 #605161] ERROR -- : from /home/opc/ruby/src/master/tool/downloader.rb:136:in `download' E, [2024-05-22T10:42:44.079401 #605161] ERROR -- : from /home/opc/ruby/src/master/tool/downloader.rb:482:in `block in
' E, [2024-05-22T10:42:44.079409 #605161] ERROR -- : from /home/opc/ruby/src/master/tool/downloader.rb:465:in `each' E, [2024-05-22T10:42:44.079418 #605161] ERROR -- : from /home/opc/ruby/src/master/tool/downloader.rb:465:in `
' E, [2024-05-22T10:42:44.082268 #605161] ERROR -- : make: *** [uncommon.mk:1756: /home/opc/ruby/src/master/enc/unicode/data/emoji/15.0/emoji-test.txt] Error 1 E, [2024-05-22T10:42:44.082307 #605161] ERROR -- : make: *** Waiting for unfinished jobs.... E, [2024-05-22T10:42:44.085218 #605161] ERROR -- : /home/opc/ruby/src/master/tool/downloader.rb:302:in `rescue in download': failed to download emoji/15.0/emoji-test.txt (RuntimeError) E, [2024-05-22T10:42:44.085253 #605161] ERROR -- : OpenURI::HTTPError: 403 Forbidden: https://www.unicode.org/Public/emoji/15.0/emoji-test.txt E, [2024-05-22T10:42:44.085263 #605161] ERROR -- : from /home/opc/ruby/src/master/tool/downloader.rb:201:in `download' E, [2024-05-22T10:42:44.085272 #605161] ERROR -- : from /home/opc/ruby/src/master/tool/downloader.rb:136:in `download' E, [2024-05-22T10:42:44.085281 #605161] ERROR -- : from /home/opc/ruby/src/master/tool/downloader.rb:482:in `block in
' E, [2024-05-22T10:42:44.085290 #605161] ERROR -- : from /home/opc/ruby/src/master/tool/downloader.rb:465:in `each' E, [2024-05-22T10:42:44.085298 #605161] ERROR -- : from /home/opc/ruby/src/master/tool/downloader.rb:465:in `
' E, [2024-05-22T10:42:44.085306 #605161] ERROR -- : /usr/local/lib/ruby/3.2.0/open-uri.rb:369:in `open_http': 403 Forbidden (OpenURI::HTTPError) E, [2024-05-22T10:42:44.085314 #605161] ERROR -- : from /usr/local/lib/ruby/3.2.0/open-uri.rb:760:in `buffer_open' E, [2024-05-22T10:42:44.085322 #605161] ERROR -- : from /usr/local/lib/ruby/3.2.0/open-uri.rb:214:in `block in open_loop' E, [2024-05-22T10:42:44.085330 #605161] ERROR -- : from /usr/local/lib/ruby/3.2.0/open-uri.rb:212:in `catch' E, [2024-05-22T10:42:44.085338 #605161] ERROR -- : from /usr/local/lib/ruby/3.2.0/open-uri.rb:212:in `open_loop' E, [2024-05-22T10:42:44.085346 #605161] ERROR -- : from /usr/local/lib/ruby/3.2.0/open-uri.rb:153:in `open_uri' E, [2024-05-22T10:42:44.085354 #605161] ERROR -- : from /usr/local/lib/ruby/3.2.0/open-uri.rb:740:in `open' E, [2024-05-22T10:42:44.085362 #605161] ERROR -- : from /usr/local/lib/ruby/3.2.0/open-uri.rb:748:in `read' E, [2024-05-22T10:42:44.085371 #605161] ERROR -- : from /home/opc/ruby/src/master/tool/downloader.rb:247:in `block in download' E, [2024-05-22T10:42:44.085378 #605161] ERROR -- : from /home/opc/ruby/src/master/tool/downloader.rb:378:in `with_retry' E, [2024-05-22T10:42:44.085387 #605161] ERROR -- : from /home/opc/ruby/src/master/tool/downloader.rb:246:in `download' E, [2024-05-22T10:42:44.085395 #605161] ERROR -- : from /home/opc/ruby/src/master/tool/downloader.rb:136:in `download' E, [2024-05-22T10:42:44.085403 #605161] ERROR -- : from /home/opc/ruby/src/master/tool/downloader.rb:482:in `block in
' E, [2024-05-22T10:42:44.085412 #605161] ERROR -- : from /home/opc/ruby/src/master/tool/downloader.rb:465:in `each' E, [2024-05-22T10:42:44.085420 #605161] ERROR -- : from /home/opc/ruby/src/master/tool/downloader.rb:465:in `
' E, [2024-05-22T10:42:44.088128 #605161] ERROR -- : make: *** [uncommon.mk:1756: /home/opc/ruby/src/master/enc/unicode/data/emoji/15.0/emoji-zwj-sequences.txt] Error 1 E, [2024-05-22T10:42:44.553880 #605161] ERROR -- : /home/opc/ruby/src/master/tool/downloader.rb:302:in `rescue in download': failed to download emoji/15.0/emoji-sequences.txt (RuntimeError) E, [2024-05-22T10:42:44.553952 #605161] ERROR -- : EOFError: end of file reached: https://www.unicode.org/Public/emoji/15.0/emoji-sequences.txt E, [2024-05-22T10:42:44.553962 #605161] ERROR -- : from /home/opc/ruby/src/master/tool/downloader.rb:201:in `download' E, [2024-05-22T10:42:44.553972 #605161] ERROR -- : from /home/opc/ruby/src/master/tool/downloader.rb:136:in `download' E, [2024-05-22T10:42:44.553980 #605161] ERROR -- : from /home/opc/ruby/src/master/tool/downloader.rb:482:in `block in
' E, [2024-05-22T10:42:44.553988 #605161] ERROR -- : from /home/opc/ruby/src/master/tool/downloader.rb:465:in `each' E, [2024-05-22T10:42:44.553996 #605161] ERROR -- : from /home/opc/ruby/src/master/tool/downloader.rb:465:in `
' E, [2024-05-22T10:42:44.554005 #605161] ERROR -- : /usr/local/lib/ruby/3.2.0/net/protocol.rb:237:in `rbuf_fill': end of file reached (EOFError) E, [2024-05-22T10:42:44.554013 #605161] ERROR -- : from /usr/local/lib/ruby/3.2.0/net/protocol.rb:199:in `readuntil' E, [2024-05-22T10:42:44.554021 #605161] ERROR -- : from /usr/local/lib/ruby/3.2.0/net/protocol.rb:209:in `readline' E, [2024-05-22T10:42:44.554029 #605161] ERROR -- : from /usr/local/lib/ruby/3.2.0/net/http/response.rb:158:in `read_status_line' E, [2024-05-22T10:42:44.554037 #605161] ERROR -- : from /usr/local/lib/ruby/3.2.0/net/http/response.rb:147:in `read_new' E, [2024-05-22T10:42:44.554046 #605161] ERROR -- : from /usr/local/lib/ruby/3.2.0/net/http.rb:1862:in `block in transport_request' E, [2024-05-22T10:42:44.554054 #605161] ERROR -- : from /usr/local/lib/ruby/3.2.0/net/http.rb:1853:in `catch' E, [2024-05-22T10:42:44.554062 #605161] ERROR -- : from /usr/local/lib/ruby/3.2.0/net/http.rb:1853:in `transport_request' E, [2024-05-22T10:42:44.554070 #605161] ERROR -- : from /usr/local/lib/ruby/3.2.0/net/http.rb:1826:in `request' E, [2024-05-22T10:42:44.554078 #605161] ERROR -- : from /usr/local/lib/ruby/3.2.0/open-uri.rb:333:in `block in open_http' E, [2024-05-22T10:42:44.554087 #605161] ERROR -- : from /usr/local/lib/ruby/3.2.0/net/http.rb:1238:in `start' E, [2024-05-22T10:42:44.554095 #605161] ERROR -- : from /usr/local/lib/ruby/3.2.0/open-uri.rb:327:in `open_http' E, [2024-05-22T10:42:44.554103 #605161] ERROR -- : from /usr/local/lib/ruby/3.2.0/open-uri.rb:760:in `buffer_open' E, [2024-05-22T10:42:44.554111 #605161] ERROR -- : from /usr/local/lib/ruby/3.2.0/open-uri.rb:214:in `block in open_loop' E, [2024-05-22T10:42:44.554119 #605161] ERROR -- : from /usr/local/lib/ruby/3.2.0/open-uri.rb:212:in `catch' E, [2024-05-22T10:42:44.554127 #605161] ERROR -- : from /usr/local/lib/ruby/3.2.0/open-uri.rb:212:in `open_loop' E, [2024-05-22T10:42:44.554135 #605161] ERROR -- : from /usr/local/lib/ruby/3.2.0/open-uri.rb:153:in `open_uri' E, [2024-05-22T10:42:44.554143 #605161] ERROR -- : from /usr/local/lib/ruby/3.2.0/open-uri.rb:740:in `open' E, [2024-05-22T10:42:44.554152 #605161] ERROR -- : from /usr/local/lib/ruby/3.2.0/open-uri.rb:748:in `read' E, [2024-05-22T10:42:44.554160 #605161] ERROR -- : from /home/opc/ruby/src/master/tool/downloader.rb:247:in `block in download' E, [2024-05-22T10:42:44.554168 #605161] ERROR -- : from /home/opc/ruby/src/master/tool/downloader.rb:378:in `with_retry' E, [2024-05-22T10:42:44.554176 #605161] ERROR -- : from /home/opc/ruby/src/master/tool/downloader.rb:246:in `download' E, [2024-05-22T10:42:44.554184 #605161] ERROR -- : from /home/opc/ruby/src/master/tool/downloader.rb:136:in `download' E, [2024-05-22T10:42:44.554192 #605161] ERROR -- : from /home/opc/ruby/src/master/tool/downloader.rb:482:in `block in
' E, [2024-05-22T10:42:44.554200 #605161] ERROR -- : from /home/opc/ruby/src/master/tool/downloader.rb:465:in `each' E, [2024-05-22T10:42:44.554208 #605161] ERROR -- : from /home/opc/ruby/src/master/tool/downloader.rb:465:in `
' E, [2024-05-22T10:42:44.556934 #605161] ERROR -- : make: *** [uncommon.mk:1756: /home/opc/ruby/src/master/enc/unicode/data/emoji/15.0/emoji-sequences.txt] Error 1 E, [2024-05-22T10:42:44.556965 #605161] ERROR -- : make: *** Deleting file '/home/opc/ruby/src/master/enc/unicode/data/emoji/15.0/emoji-sequences.txt' I, [2024-05-22T10:42:44.557093 #605161] INFO -- : downloading emoji/15.0/emoji-test.txt ... I, [2024-05-22T10:42:44.557289 #605161] INFO -- : $$$[end] "make update-unicode -j3" exit with 512. I, [2024-05-22T10:42:44.557320 #605161] INFO -- : $$$[beg] make update-download -j3 I, [2024-05-22T10:42:44.724210 #605161] INFO -- : tool/config.guess already exists I, [2024-05-22T10:42:44.724292 #605161] INFO -- : tool/config.sub already exists I, [2024-05-22T10:42:44.727015 #605161] INFO -- : Update power_assert to 84e85124c5014a139af39161d484156cfe87a9ed I, [2024-05-22T10:42:44.727216 #605161] INFO -- : Update rbs to ba7872795d5de04adb8ff500c0e6afdc81a041dd I, [2024-05-22T10:42:44.727348 #605161] INFO -- : Update typeprof to b19a6416da3a05d57fadd6ffdadb382b6d236ca5 I, [2024-05-22T10:42:44.730170 #605161] INFO -- : echo 84e85124c5014a139af39161d484156cfe87a9ed | /bin/sh /home/opc/ruby/src/master/tool/ifchange /home/opc/ruby/src/master/.bundle/.timestamp/power_assert.revision - I, [2024-05-22T10:42:44.730439 #605161] INFO -- : echo ba7872795d5de04adb8ff500c0e6afdc81a041dd | /bin/sh /home/opc/ruby/src/master/tool/ifchange /home/opc/ruby/src/master/.bundle/.timestamp/rbs.revision - I, [2024-05-22T10:42:44.730544 #605161] INFO -- : echo b19a6416da3a05d57fadd6ffdadb382b6d236ca5 | /bin/sh /home/opc/ruby/src/master/tool/ifchange /home/opc/ruby/src/master/.bundle/.timestamp/typeprof.revision - I, [2024-05-22T10:42:44.736270 #605161] INFO -- : /home/opc/ruby/src/master/.bundle/.timestamp/power_assert.revision unchanged I, [2024-05-22T10:42:44.736543 #605161] INFO -- : /home/opc/ruby/src/master/.bundle/.timestamp/rbs.revision unchanged I, [2024-05-22T10:42:44.737993 #605161] INFO -- : /home/opc/ruby/src/master/.bundle/.timestamp/typeprof.revision unchanged I, [2024-05-22T10:42:44.823880 #605161] INFO -- : Building power_assert@84e85124c5014a139af39161d484156cfe87a9ed to /home/opc/ruby/src/master/gems/power_assert-2.0.3.gem I, [2024-05-22T10:42:44.933592 #605161] INFO -- : Successfully built RubyGem I, [2024-05-22T10:42:44.933653 #605161] INFO -- : Name: power_assert I, [2024-05-22T10:42:44.933664 #605161] INFO -- : Version: 2.0.4dev I, [2024-05-22T10:42:44.933673 #605161] INFO -- : File: power_assert-2.0.4dev.gem I, [2024-05-22T10:42:45.014874 #605161] INFO -- : $$$[end] "make update-download -j3" exit with 0. I, [2024-05-22T10:42:45.014959 #605161] INFO -- : $$$[beg] make update-rubyspec -j3 I, [2024-05-22T10:42:45.103194 #605161] INFO -- : make: Nothing to be done for 'update-rubyspec'. I, [2024-05-22T10:42:45.103342 #605161] INFO -- : $$$[end] "make update-rubyspec -j3" exit with 0. I, [2024-05-22T10:42:45.103388 #605161] INFO -- : $$$[beg] make update-src -j3 I, [2024-05-22T10:42:46.089287 #605161] INFO -- : Already up to date. I, [2024-05-22T10:42:46.103933 #605161] INFO -- : Latest commit hash = 5613d6e95b I, [2024-05-22T10:42:46.104517 #605161] INFO -- : $$$[end] "make update-src -j3" exit with 0. I, [2024-05-22T10:42:46.104571 #605161] INFO -- : $$$[beg] make after-update -j3 I, [2024-05-22T10:42:46.240328 #605161] INFO -- : /home/opc/ruby/src/master/revision.h updated I, [2024-05-22T10:42:46.241498 #605161] INFO -- : generating aarch64-linux-fake.rb I, [2024-05-22T10:42:46.298202 #605161] INFO -- : aarch64-linux-fake.rb updated I, [2024-05-22T10:42:46.299375 #605161] INFO -- : generating enc.mk I, [2024-05-22T10:42:46.532530 #605161] INFO -- : making srcs under enc I, [2024-05-22T10:42:46.574674 #605161] INFO -- : make[1]: Entering directory '/home/opc/ruby/build/master' I, [2024-05-22T10:42:46.574738 #605161] INFO -- : make[1]: Nothing to be done for 'srcs'. I, [2024-05-22T10:42:46.574749 #605161] INFO -- : make[1]: Leaving directory '/home/opc/ruby/build/master' I, [2024-05-22T10:42:46.655604 #605161] INFO -- : Update power_assert to 84e85124c5014a139af39161d484156cfe87a9ed I, [2024-05-22T10:42:46.655729 #605161] INFO -- : Update rbs to ba7872795d5de04adb8ff500c0e6afdc81a041dd I, [2024-05-22T10:42:46.656842 #605161] INFO -- : Update typeprof to b19a6416da3a05d57fadd6ffdadb382b6d236ca5 I, [2024-05-22T10:42:46.659437 #605161] INFO -- : echo 84e85124c5014a139af39161d484156cfe87a9ed | /bin/sh /home/opc/ruby/src/master/tool/ifchange /home/opc/ruby/src/master/.bundle/.timestamp/power_assert.revision - I, [2024-05-22T10:42:46.659675 #605161] INFO -- : echo ba7872795d5de04adb8ff500c0e6afdc81a041dd | /bin/sh /home/opc/ruby/src/master/tool/ifchange /home/opc/ruby/src/master/.bundle/.timestamp/rbs.revision - I, [2024-05-22T10:42:46.659858 #605161] INFO -- : echo b19a6416da3a05d57fadd6ffdadb382b6d236ca5 | /bin/sh /home/opc/ruby/src/master/tool/ifchange /home/opc/ruby/src/master/.bundle/.timestamp/typeprof.revision - I, [2024-05-22T10:42:46.664618 #605161] INFO -- : /home/opc/ruby/src/master/.bundle/.timestamp/power_assert.revision unchanged I, [2024-05-22T10:42:46.665517 #605161] INFO -- : /home/opc/ruby/src/master/.bundle/.timestamp/rbs.revision unchanged I, [2024-05-22T10:42:46.665863 #605161] INFO -- : /home/opc/ruby/src/master/.bundle/.timestamp/typeprof.revision unchanged I, [2024-05-22T10:42:46.753285 #605161] INFO -- : Building power_assert@84e85124c5014a139af39161d484156cfe87a9ed to /home/opc/ruby/src/master/gems/power_assert-2.0.3.gem I, [2024-05-22T10:42:46.865801 #605161] INFO -- : Successfully built RubyGem I, [2024-05-22T10:42:46.865873 #605161] INFO -- : Name: power_assert I, [2024-05-22T10:42:46.865887 #605161] INFO -- : Version: 2.0.4dev I, [2024-05-22T10:42:46.865897 #605161] INFO -- : File: power_assert-2.0.4dev.gem I, [2024-05-22T10:42:46.867941 #605161] INFO -- : Extracting bundle gem power_assert-2.0.3... I, [2024-05-22T10:42:46.966628 #605161] INFO -- : Try with hash version of bundled gems instead of gems/power_assert-2.0.3.gem. We don't use this gem with release version of Ruby. I, [2024-05-22T10:42:46.977034 #605161] INFO -- : Unpacked gems/power_assert-2.0.4dev.gem I, [2024-05-22T10:42:46.978743 #605161] INFO -- : $$$[end] "make after-update -j3" exit with 0. I, [2024-05-22T10:42:46.978883 #605161] INFO -- : $$$[beg] make miniruby -j3 I, [2024-05-22T10:42:47.068513 #605161] INFO -- : BASERUBY = /usr/local/bin/ruby --disable=gems I, [2024-05-22T10:42:47.068581 #605161] INFO -- : CC = gcc I, [2024-05-22T10:42:47.068591 #605161] INFO -- : LD = ld I, [2024-05-22T10:42:47.068600 #605161] INFO -- : LDSHARED = gcc -shared I, [2024-05-22T10:42:47.068612 #605161] INFO -- : CFLAGS = -O3 -fno-fast-math -ggdb3 -Wall -Wextra -Wdeprecated-declarations -Wdiv-by-zero -Wduplicated-cond -Wimplicit-function-declaration -Wimplicit-int -Wpointer-arith -Wwrite-strings -Wold-style-definition -Wimplicit-fallthrough=0 -Wmissing-noreturn -Wno-cast-function-type -Wno-constant-logical-operand -Wno-long-long -Wno-missing-field-initializers -Wno-overlength-strings -Wno-packed-bitfield-compat -Wno-parentheses-equality -Wno-self-assign -Wno-tautological-compare -Wno-unused-parameter -Wno-unused-value -Wsuggest-attribute=format -Wsuggest-attribute=noreturn -Wunused-variable -Wmisleading-indentation -Wundef I, [2024-05-22T10:42:47.068622 #605161] INFO -- : XCFLAGS = -U_FORTIFY_SOURCE -D_FORTIFY_SOURCE=2 -fstack-protector-strong -msign-return-address=all -fno-strict-overflow -fvisibility=hidden -fexcess-precision=standard -DRUBY_EXPORT -fPIE -I. -I.ext/include/aarch64-linux -I/home/opc/ruby/src/master/include -I/home/opc/ruby/src/master -I/home/opc/ruby/src/master/prism -I/home/opc/ruby/src/master/enc/unicode/15.0.0 I, [2024-05-22T10:42:47.068630 #605161] INFO -- : CPPFLAGS = I, [2024-05-22T10:42:47.068638 #605161] INFO -- : DLDFLAGS = -Wl,--compress-debug-sections=zlib -fstack-protector-strong -pie I, [2024-05-22T10:42:47.068648 #605161] INFO -- : SOLIBS = -lz -lrt -lrt -ldl -lcrypt -lm -lpthread I, [2024-05-22T10:42:47.068656 #605161] INFO -- : LANG = en_US.UTF-8 I, [2024-05-22T10:42:47.068664 #605161] INFO -- : LC_ALL = I, [2024-05-22T10:42:47.068672 #605161] INFO -- : LC_CTYPE = I, [2024-05-22T10:42:47.068684 #605161] INFO -- : MFLAGS = -j3 --jobserver-auth=4,5 I, [2024-05-22T10:42:47.068692 #605161] INFO -- : RUSTC = rustc I, [2024-05-22T10:42:47.068700 #605161] INFO -- : YJIT_RUSTC_ARGS = --crate-name=yjit --crate-type=staticlib --edition=2021 -g -C lto=thin -C opt-level=3 -C overflow-checks=on '--out-dir=/home/opc/ruby/build/master/yjit/target/release/' /home/opc/ruby/src/master/yjit/src/lib.rs I, [2024-05-22T10:42:47.069463 #605161] INFO -- : gcc (GCC) 8.5.0 20210514 (Red Hat 8.5.0-10.1.0.1) I, [2024-05-22T10:42:47.069499 #605161] INFO -- : Copyright (C) 2018 Free Software Foundation, Inc. I, [2024-05-22T10:42:47.069509 #605161] INFO -- : This is free software; see the source for copying conditions. There is NO I, [2024-05-22T10:42:47.069532 #605161] INFO -- : warranty; not even for MERCHANTABILITY or FITNESS FOR A PARTICULAR PURPOSE. I, [2024-05-22T10:42:47.069544 #605161] INFO -- : I, [2024-05-22T10:42:47.094868 #605161] INFO -- : compiling /home/opc/ruby/src/master/version.c I, [2024-05-22T10:42:47.238562 #605161] INFO -- : linking miniruby I, [2024-05-22T10:42:48.133757 #605161] INFO -- : $$$[end] "make miniruby -j3" exit with 0. I, [2024-05-22T10:42:48.133926 #605161] INFO -- : $$$[beg] make ruby -j3 I, [2024-05-22T10:42:48.223122 #605161] INFO -- : BASERUBY = /usr/local/bin/ruby --disable=gems I, [2024-05-22T10:42:48.223184 #605161] INFO -- : CC = gcc I, [2024-05-22T10:42:48.223195 #605161] INFO -- : LD = ld I, [2024-05-22T10:42:48.223204 #605161] INFO -- : LDSHARED = gcc -shared I, [2024-05-22T10:42:48.223215 #605161] INFO -- : CFLAGS = -O3 -fno-fast-math -ggdb3 -Wall -Wextra -Wdeprecated-declarations -Wdiv-by-zero -Wduplicated-cond -Wimplicit-function-declaration -Wimplicit-int -Wpointer-arith -Wwrite-strings -Wold-style-definition -Wimplicit-fallthrough=0 -Wmissing-noreturn -Wno-cast-function-type -Wno-constant-logical-operand -Wno-long-long -Wno-missing-field-initializers -Wno-overlength-strings -Wno-packed-bitfield-compat -Wno-parentheses-equality -Wno-self-assign -Wno-tautological-compare -Wno-unused-parameter -Wno-unused-value -Wsuggest-attribute=format -Wsuggest-attribute=noreturn -Wunused-variable -Wmisleading-indentation -Wundef I, [2024-05-22T10:42:48.223224 #605161] INFO -- : XCFLAGS = -U_FORTIFY_SOURCE -D_FORTIFY_SOURCE=2 -fstack-protector-strong -msign-return-address=all -fno-strict-overflow -fvisibility=hidden -fexcess-precision=standard -DRUBY_EXPORT -fPIE -I. -I.ext/include/aarch64-linux -I/home/opc/ruby/src/master/include -I/home/opc/ruby/src/master -I/home/opc/ruby/src/master/prism -I/home/opc/ruby/src/master/enc/unicode/15.0.0 I, [2024-05-22T10:42:48.223233 #605161] INFO -- : CPPFLAGS = I, [2024-05-22T10:42:48.223241 #605161] INFO -- : DLDFLAGS = -Wl,--compress-debug-sections=zlib -fstack-protector-strong -pie I, [2024-05-22T10:42:48.223249 #605161] INFO -- : SOLIBS = -lz -lrt -lrt -ldl -lcrypt -lm -lpthread I, [2024-05-22T10:42:48.223257 #605161] INFO -- : LANG = en_US.UTF-8 I, [2024-05-22T10:42:48.223265 #605161] INFO -- : LC_ALL = I, [2024-05-22T10:42:48.223273 #605161] INFO -- : LC_CTYPE = I, [2024-05-22T10:42:48.223281 #605161] INFO -- : MFLAGS = -j3 --jobserver-auth=4,5 I, [2024-05-22T10:42:48.223288 #605161] INFO -- : RUSTC = rustc I, [2024-05-22T10:42:48.223296 #605161] INFO -- : YJIT_RUSTC_ARGS = --crate-name=yjit --crate-type=staticlib --edition=2021 -g -C lto=thin -C opt-level=3 -C overflow-checks=on '--out-dir=/home/opc/ruby/build/master/yjit/target/release/' /home/opc/ruby/src/master/yjit/src/lib.rs I, [2024-05-22T10:42:48.224068 #605161] INFO -- : gcc (GCC) 8.5.0 20210514 (Red Hat 8.5.0-10.1.0.1) I, [2024-05-22T10:42:48.224103 #605161] INFO -- : Copyright (C) 2018 Free Software Foundation, Inc. I, [2024-05-22T10:42:48.224114 #605161] INFO -- : This is free software; see the source for copying conditions. There is NO I, [2024-05-22T10:42:48.224123 #605161] INFO -- : warranty; not even for MERCHANTABILITY or FITNESS FOR A PARTICULAR PURPOSE. I, [2024-05-22T10:42:48.224132 #605161] INFO -- : I, [2024-05-22T10:42:48.407486 #605161] INFO -- : builtin_binary.inc updated I, [2024-05-22T10:42:48.410747 #605161] INFO -- : c5234a9416e4f20f175185e840b25b0f08674d14078ed7083f37e655458e3ca9 builtin_binary.inc I, [2024-05-22T10:42:48.411577 #605161] INFO -- : compiling /home/opc/ruby/src/master/builtin.c I, [2024-05-22T10:42:48.744444 #605161] INFO -- : linking static-library libruby-static.a I, [2024-05-22T10:42:51.486744 #605161] INFO -- : linking ruby I, [2024-05-22T10:42:52.398427 #605161] INFO -- : $$$[end] "make ruby -j3" exit with 0. I, [2024-05-22T10:42:52.398594 #605161] INFO -- : $$$[beg] make all -j3 I, [2024-05-22T10:42:52.487200 #605161] INFO -- : BASERUBY = /usr/local/bin/ruby --disable=gems I, [2024-05-22T10:42:52.487261 #605161] INFO -- : CC = gcc I, [2024-05-22T10:42:52.487272 #605161] INFO -- : LD = ld I, [2024-05-22T10:42:52.487282 #605161] INFO -- : LDSHARED = gcc -shared I, [2024-05-22T10:42:52.487292 #605161] INFO -- : CFLAGS = -O3 -fno-fast-math -ggdb3 -Wall -Wextra -Wdeprecated-declarations -Wdiv-by-zero -Wduplicated-cond -Wimplicit-function-declaration -Wimplicit-int -Wpointer-arith -Wwrite-strings -Wold-style-definition -Wimplicit-fallthrough=0 -Wmissing-noreturn -Wno-cast-function-type -Wno-constant-logical-operand -Wno-long-long -Wno-missing-field-initializers -Wno-overlength-strings -Wno-packed-bitfield-compat -Wno-parentheses-equality -Wno-self-assign -Wno-tautological-compare -Wno-unused-parameter -Wno-unused-value -Wsuggest-attribute=format -Wsuggest-attribute=noreturn -Wunused-variable -Wmisleading-indentation -Wundef I, [2024-05-22T10:42:52.487301 #605161] INFO -- : XCFLAGS = -U_FORTIFY_SOURCE -D_FORTIFY_SOURCE=2 -fstack-protector-strong -msign-return-address=all -fno-strict-overflow -fvisibility=hidden -fexcess-precision=standard -DRUBY_EXPORT -fPIE -I. -I.ext/include/aarch64-linux -I/home/opc/ruby/src/master/include -I/home/opc/ruby/src/master -I/home/opc/ruby/src/master/prism -I/home/opc/ruby/src/master/enc/unicode/15.0.0 I, [2024-05-22T10:42:52.487310 #605161] INFO -- : CPPFLAGS = I, [2024-05-22T10:42:52.487318 #605161] INFO -- : DLDFLAGS = -Wl,--compress-debug-sections=zlib -fstack-protector-strong -pie I, [2024-05-22T10:42:52.487327 #605161] INFO -- : SOLIBS = -lz -lrt -lrt -ldl -lcrypt -lm -lpthread I, [2024-05-22T10:42:52.487335 #605161] INFO -- : LANG = en_US.UTF-8 I, [2024-05-22T10:42:52.487343 #605161] INFO -- : LC_ALL = I, [2024-05-22T10:42:52.487350 #605161] INFO -- : LC_CTYPE = I, [2024-05-22T10:42:52.487358 #605161] INFO -- : MFLAGS = -j3 --jobserver-auth=4,5 I, [2024-05-22T10:42:52.487366 #605161] INFO -- : RUSTC = rustc I, [2024-05-22T10:42:52.487374 #605161] INFO -- : YJIT_RUSTC_ARGS = --crate-name=yjit --crate-type=staticlib --edition=2021 -g -C lto=thin -C opt-level=3 -C overflow-checks=on '--out-dir=/home/opc/ruby/build/master/yjit/target/release/' /home/opc/ruby/src/master/yjit/src/lib.rs I, [2024-05-22T10:42:52.488126 #605161] INFO -- : gcc (GCC) 8.5.0 20210514 (Red Hat 8.5.0-10.1.0.1) I, [2024-05-22T10:42:52.488160 #605161] INFO -- : Copyright (C) 2018 Free Software Foundation, Inc. I, [2024-05-22T10:42:52.488170 #605161] INFO -- : This is free software; see the source for copying conditions. There is NO I, [2024-05-22T10:42:52.488180 #605161] INFO -- : warranty; not even for MERCHANTABILITY or FITNESS FOR A PARTICULAR PURPOSE. I, [2024-05-22T10:42:52.488188 #605161] INFO -- : I, [2024-05-22T10:42:52.520642 #605161] INFO -- : generating encdb.h I, [2024-05-22T10:42:52.522126 #605161] INFO -- : generating enc.mk I, [2024-05-22T10:42:52.560594 #605161] INFO -- : encdb.h unchanged I, [2024-05-22T10:42:52.756863 #605161] INFO -- : making srcs under enc I, [2024-05-22T10:42:52.756932 #605161] INFO -- : making enc I, [2024-05-22T10:42:52.784511 #605161] INFO -- : make[1]: Entering directory '/home/opc/ruby/build/master' I, [2024-05-22T10:42:52.784600 #605161] INFO -- : make[1]: Nothing to be done for 'enc'. I, [2024-05-22T10:42:52.784619 #605161] INFO -- : make[1]: Leaving directory '/home/opc/ruby/build/master' I, [2024-05-22T10:42:52.799126 #605161] INFO -- : make[1]: Entering directory '/home/opc/ruby/build/master' I, [2024-05-22T10:42:52.799180 #605161] INFO -- : make[1]: Nothing to be done for 'srcs'. I, [2024-05-22T10:42:52.799191 #605161] INFO -- : make[1]: Leaving directory '/home/opc/ruby/build/master' I, [2024-05-22T10:42:52.799977 #605161] INFO -- : generating transdb.h I, [2024-05-22T10:42:52.942425 #605161] INFO -- : transdb.h unchanged I, [2024-05-22T10:42:52.943802 #605161] INFO -- : generating makefiles ext/configure-ext.mk I, [2024-05-22T10:42:52.943941 #605161] INFO -- : making trans I, [2024-05-22T10:42:52.983778 #605161] INFO -- : ext/configure-ext.mk updated I, [2024-05-22T10:42:52.986728 #605161] INFO -- : make[1]: Entering directory '/home/opc/ruby/build/master' I, [2024-05-22T10:42:52.993171 #605161] INFO -- : make[1]: Entering directory '/home/opc/ruby/build/master' I, [2024-05-22T10:42:52.993221 #605161] INFO -- : make[1]: Nothing to be done for 'trans'. I, [2024-05-22T10:42:52.993233 #605161] INFO -- : make[1]: Leaving directory '/home/opc/ruby/build/master' I, [2024-05-22T10:42:53.113367 #605161] INFO -- : making encs I, [2024-05-22T10:42:53.167695 #605161] INFO -- : make[1]: Entering directory '/home/opc/ruby/build/master' I, [2024-05-22T10:42:53.167779 #605161] INFO -- : make[1]: Nothing to be done for 'encs'. I, [2024-05-22T10:42:53.167816 #605161] INFO -- : make[1]: Leaving directory '/home/opc/ruby/build/master' I, [2024-05-22T10:42:53.758331 #605161] INFO -- : make[1]: Leaving directory '/home/opc/ruby/build/master' I, [2024-05-22T10:42:53.759216 #605161] INFO -- : generating makefile exts.mk I, [2024-05-22T10:42:53.820153 #605161] INFO -- : exts.mk unchanged I, [2024-05-22T10:42:53.825062 #605161] INFO -- : make[1]: Entering directory '/home/opc/ruby/build/master' I, [2024-05-22T10:42:53.930521 #605161] INFO -- : make[2]: Entering directory '/home/opc/ruby/build/master/ext/coverage' I, [2024-05-22T10:42:53.931075 #605161] INFO -- : make[2]: Entering directory '/home/opc/ruby/build/master/ext/digest' I, [2024-05-22T10:42:53.933867 #605161] INFO -- : make[2]: Entering directory '/home/opc/ruby/build/master/ext/date' I, [2024-05-22T10:42:53.935581 #605161] INFO -- : make[2]: Leaving directory '/home/opc/ruby/build/master/ext/coverage' I, [2024-05-22T10:42:53.939459 #605161] INFO -- : make[2]: Leaving directory '/home/opc/ruby/build/master/ext/date' I, [2024-05-22T10:42:53.940866 #605161] INFO -- : make[2]: Leaving directory '/home/opc/ruby/build/master/ext/digest' I, [2024-05-22T10:42:53.947956 #605161] INFO -- : make[2]: Entering directory '/home/opc/ruby/build/master/ext/fiddle' I, [2024-05-22T10:42:53.948274 #605161] INFO -- : make[2]: Entering directory '/home/opc/ruby/build/master/ext/io/console' I, [2024-05-22T10:42:53.953539 #605161] INFO -- : make[2]: Leaving directory '/home/opc/ruby/build/master/ext/io/console' I, [2024-05-22T10:42:53.955096 #605161] INFO -- : make[2]: Entering directory '/home/opc/ruby/build/master/ext/json' I, [2024-05-22T10:42:53.958332 #605161] INFO -- : make[2]: Leaving directory '/home/opc/ruby/build/master/ext/fiddle' I, [2024-05-22T10:42:53.961469 #605161] INFO -- : make[2]: Leaving directory '/home/opc/ruby/build/master/ext/json' I, [2024-05-22T10:42:53.962299 #605161] INFO -- : make[2]: Entering directory '/home/opc/ruby/build/master/ext/monitor' I, [2024-05-22T10:42:53.964840 #605161] INFO -- : make[2]: Entering directory '/home/opc/ruby/build/master/ext/objspace' I, [2024-05-22T10:42:53.966587 #605161] INFO -- : make[2]: Leaving directory '/home/opc/ruby/build/master/ext/monitor' I, [2024-05-22T10:42:53.970614 #605161] INFO -- : make[2]: Leaving directory '/home/opc/ruby/build/master/ext/objspace' I, [2024-05-22T10:42:53.970889 #605161] INFO -- : make[2]: Entering directory '/home/opc/ruby/build/master/ext/pathname' I, [2024-05-22T10:42:53.975283 #605161] INFO -- : make[2]: Leaving directory '/home/opc/ruby/build/master/ext/pathname' I, [2024-05-22T10:42:53.976715 #605161] INFO -- : make[2]: Entering directory '/home/opc/ruby/build/master/ext/psych' I, [2024-05-22T10:42:53.979623 #605161] INFO -- : make[2]: Entering directory '/home/opc/ruby/build/master/ext/pty' I, [2024-05-22T10:42:53.980573 #605161] INFO -- : make[2]: Entering directory '/home/opc/ruby/build/master/ext/openssl' I, [2024-05-22T10:42:53.983929 #605161] INFO -- : make[2]: Leaving directory '/home/opc/ruby/build/master/ext/pty' I, [2024-05-22T10:42:53.998310 #605161] INFO -- : make[2]: Leaving directory '/home/opc/ruby/build/master/ext/psych' I, [2024-05-22T10:42:53.998631 #605161] INFO -- : make[2]: Entering directory '/home/opc/ruby/build/master/ext/ripper' I, [2024-05-22T10:42:54.000161 #605161] INFO -- : make[2]: Entering directory '/home/opc/ruby/build/master/ext/rubyvm' I, [2024-05-22T10:42:54.003639 #605161] INFO -- : make[2]: Leaving directory '/home/opc/ruby/build/master/ext/rubyvm' I, [2024-05-22T10:42:54.005790 #605161] INFO -- : make[2]: Leaving directory '/home/opc/ruby/build/master/ext/openssl' I, [2024-05-22T10:42:54.006887 #605161] INFO -- : make[2]: Leaving directory '/home/opc/ruby/build/master/ext/ripper' I, [2024-05-22T10:42:54.013437 #605161] INFO -- : make[2]: Entering directory '/home/opc/ruby/build/master/.bundle/gems/bigdecimal-3.1.7/ext/bigdecimal' I, [2024-05-22T10:42:54.016060 #605161] INFO -- : make[2]: Entering directory '/home/opc/ruby/build/master/ext/socket' I, [2024-05-22T10:42:54.017369 #605161] INFO -- : make[2]: Entering directory '/home/opc/ruby/build/master/.bundle/gems/bigdecimal-3.1.8/ext/bigdecimal' I, [2024-05-22T10:42:54.027342 #605161] INFO -- : make[2]: Leaving directory '/home/opc/ruby/build/master/ext/socket' I, [2024-05-22T10:42:54.029882 #605161] INFO -- : make[2]: Entering directory '/home/opc/ruby/build/master/.bundle/gems/debug-1.9.2/ext/debug' I, [2024-05-22T10:42:54.044146 #605161] INFO -- : make[2]: Leaving directory '/home/opc/ruby/build/master/.bundle/gems/bigdecimal-3.1.7/ext/bigdecimal' I, [2024-05-22T10:42:54.046620 #605161] INFO -- : make[2]: Entering directory '/home/opc/ruby/build/master/.bundle/gems/nkf-0.2.0/ext/nkf' I, [2024-05-22T10:42:54.049199 #605161] INFO -- : make[2]: Leaving directory '/home/opc/ruby/build/master/.bundle/gems/bigdecimal-3.1.8/ext/bigdecimal' I, [2024-05-22T10:42:54.051863 #605161] INFO -- : make[2]: Entering directory '/home/opc/ruby/build/master/.bundle/gems/racc-1.7.3/ext/racc/cparse' I, [2024-05-22T10:42:54.061011 #605161] INFO -- : make[2]: Leaving directory '/home/opc/ruby/build/master/.bundle/gems/debug-1.9.2/ext/debug' I, [2024-05-22T10:42:54.064691 #605161] INFO -- : make[2]: Entering directory '/home/opc/ruby/build/master/.bundle/gems/racc-1.8.0/ext/racc/cparse' I, [2024-05-22T10:42:54.079646 #605161] INFO -- : make[2]: Leaving directory '/home/opc/ruby/build/master/.bundle/gems/nkf-0.2.0/ext/nkf' I, [2024-05-22T10:42:54.084143 #605161] INFO -- : make[2]: Leaving directory '/home/opc/ruby/build/master/.bundle/gems/racc-1.7.3/ext/racc/cparse' I, [2024-05-22T10:42:54.086016 #605161] INFO -- : make[2]: Entering directory '/home/opc/ruby/build/master/.bundle/gems/rbs-3.4.4/ext/rbs_extension' I, [2024-05-22T10:42:54.086945 #605161] INFO -- : make[2]: Entering directory '/home/opc/ruby/build/master/.bundle/gems/syslog-0.1.2/ext/syslog' I, [2024-05-22T10:42:54.095892 #605161] INFO -- : make[2]: Leaving directory '/home/opc/ruby/build/master/.bundle/gems/racc-1.8.0/ext/racc/cparse' I, [2024-05-22T10:42:54.117526 #605161] INFO -- : make[2]: Leaving directory '/home/opc/ruby/build/master/.bundle/gems/rbs-3.4.4/ext/rbs_extension' I, [2024-05-22T10:42:54.118038 #605161] INFO -- : make[2]: Leaving directory '/home/opc/ruby/build/master/.bundle/gems/syslog-0.1.2/ext/syslog' I, [2024-05-22T10:42:54.122164 #605161] INFO -- : make[2]: Entering directory '/home/opc/ruby/build/master/ext/digest/sha2' I, [2024-05-22T10:42:54.126770 #605161] INFO -- : make[2]: Leaving directory '/home/opc/ruby/build/master/ext/digest/sha2' I, [2024-05-22T10:42:54.165272 #605161] INFO -- : make[2]: Entering directory '/home/opc/ruby/build/master' I, [2024-05-22T10:42:54.249292 #605161] INFO -- : make[2]: 'ruby' is up to date. I, [2024-05-22T10:42:54.249368 #605161] INFO -- : make[2]: Leaving directory '/home/opc/ruby/build/master' I, [2024-05-22T10:42:54.249517 #605161] INFO -- : make[1]: Leaving directory '/home/opc/ruby/build/master' I, [2024-05-22T10:42:54.253995 #605161] INFO -- : make[1]: Entering directory '/home/opc/ruby/build/master' I, [2024-05-22T10:42:54.254042 #605161] INFO -- : make[1]: Nothing to be done for 'note'. I, [2024-05-22T10:42:54.254053 #605161] INFO -- : make[1]: Leaving directory '/home/opc/ruby/build/master' I, [2024-05-22T10:42:54.254306 #605161] INFO -- : $$$[end] "make all -j3" exit with 0. I, [2024-05-22T10:42:54.254442 #605161] INFO -- : $$$[beg] make install -j3 I, [2024-05-22T10:42:54.348183 #605161] INFO -- : Update power_assert to 84e85124c5014a139af39161d484156cfe87a9ed I, [2024-05-22T10:42:54.348596 #605161] INFO -- : Update rbs to ba7872795d5de04adb8ff500c0e6afdc81a041dd I, [2024-05-22T10:42:54.349029 #605161] INFO -- : Update typeprof to b19a6416da3a05d57fadd6ffdadb382b6d236ca5 I, [2024-05-22T10:42:54.352346 #605161] INFO -- : echo 84e85124c5014a139af39161d484156cfe87a9ed | /bin/sh /home/opc/ruby/src/master/tool/ifchange /home/opc/ruby/src/master/.bundle/.timestamp/power_assert.revision - I, [2024-05-22T10:42:54.352589 #605161] INFO -- : echo ba7872795d5de04adb8ff500c0e6afdc81a041dd | /bin/sh /home/opc/ruby/src/master/tool/ifchange /home/opc/ruby/src/master/.bundle/.timestamp/rbs.revision - I, [2024-05-22T10:42:54.352779 #605161] INFO -- : echo b19a6416da3a05d57fadd6ffdadb382b6d236ca5 | /bin/sh /home/opc/ruby/src/master/tool/ifchange /home/opc/ruby/src/master/.bundle/.timestamp/typeprof.revision - I, [2024-05-22T10:42:54.358620 #605161] INFO -- : /home/opc/ruby/src/master/.bundle/.timestamp/rbs.revision unchanged I, [2024-05-22T10:42:54.361169 #605161] INFO -- : /home/opc/ruby/src/master/.bundle/.timestamp/typeprof.revision unchanged I, [2024-05-22T10:42:54.362069 #605161] INFO -- : /home/opc/ruby/src/master/.bundle/.timestamp/power_assert.revision unchanged I, [2024-05-22T10:42:54.368524 #605161] INFO -- : BASERUBY = /usr/local/bin/ruby --disable=gems I, [2024-05-22T10:42:54.368567 #605161] INFO -- : CC = gcc I, [2024-05-22T10:42:54.368578 #605161] INFO -- : LD = ld I, [2024-05-22T10:42:54.368586 #605161] INFO -- : LDSHARED = gcc -shared I, [2024-05-22T10:42:54.368595 #605161] INFO -- : CFLAGS = -O3 -fno-fast-math -ggdb3 -Wall -Wextra -Wdeprecated-declarations -Wdiv-by-zero -Wduplicated-cond -Wimplicit-function-declaration -Wimplicit-int -Wpointer-arith -Wwrite-strings -Wold-style-definition -Wimplicit-fallthrough=0 -Wmissing-noreturn -Wno-cast-function-type -Wno-constant-logical-operand -Wno-long-long -Wno-missing-field-initializers -Wno-overlength-strings -Wno-packed-bitfield-compat -Wno-parentheses-equality -Wno-self-assign -Wno-tautological-compare -Wno-unused-parameter -Wno-unused-value -Wsuggest-attribute=format -Wsuggest-attribute=noreturn -Wunused-variable -Wmisleading-indentation -Wundef I, [2024-05-22T10:42:54.368605 #605161] INFO -- : XCFLAGS = -U_FORTIFY_SOURCE -D_FORTIFY_SOURCE=2 -fstack-protector-strong -msign-return-address=all -fno-strict-overflow -fvisibility=hidden -fexcess-precision=standard -DRUBY_EXPORT -fPIE -I. -I.ext/include/aarch64-linux -I/home/opc/ruby/src/master/include -I/home/opc/ruby/src/master -I/home/opc/ruby/src/master/prism -I/home/opc/ruby/src/master/enc/unicode/15.0.0 I, [2024-05-22T10:42:54.368613 #605161] INFO -- : CPPFLAGS = I, [2024-05-22T10:42:54.368621 #605161] INFO -- : DLDFLAGS = -Wl,--compress-debug-sections=zlib -fstack-protector-strong -pie I, [2024-05-22T10:42:54.368630 #605161] INFO -- : SOLIBS = -lz -lrt -lrt -ldl -lcrypt -lm -lpthread I, [2024-05-22T10:42:54.368638 #605161] INFO -- : LANG = en_US.UTF-8 I, [2024-05-22T10:42:54.368645 #605161] INFO -- : LC_ALL = I, [2024-05-22T10:42:54.368653 #605161] INFO -- : LC_CTYPE = I, [2024-05-22T10:42:54.368682 #605161] INFO -- : MFLAGS = -j3 --jobserver-auth=4,5 I, [2024-05-22T10:42:54.368690 #605161] INFO -- : RUSTC = rustc I, [2024-05-22T10:42:54.368701 #605161] INFO -- : YJIT_RUSTC_ARGS = --crate-name=yjit --crate-type=staticlib --edition=2021 -g -C lto=thin -C opt-level=3 -C overflow-checks=on '--out-dir=/home/opc/ruby/build/master/yjit/target/release/' /home/opc/ruby/src/master/yjit/src/lib.rs I, [2024-05-22T10:42:54.394909 #605161] INFO -- : generating encdb.h I, [2024-05-22T10:42:54.394958 #605161] INFO -- : gcc (GCC) 8.5.0 20210514 (Red Hat 8.5.0-10.1.0.1) I, [2024-05-22T10:42:54.394968 #605161] INFO -- : Copyright (C) 2018 Free Software Foundation, Inc. I, [2024-05-22T10:42:54.394977 #605161] INFO -- : This is free software; see the source for copying conditions. There is NO I, [2024-05-22T10:42:54.394986 #605161] INFO -- : warranty; not even for MERCHANTABILITY or FITNESS FOR A PARTICULAR PURPOSE. I, [2024-05-22T10:42:54.394994 #605161] INFO -- : I, [2024-05-22T10:42:54.395897 #605161] INFO -- : generating enc.mk I, [2024-05-22T10:42:54.434372 #605161] INFO -- : encdb.h unchanged I, [2024-05-22T10:42:54.527152 #605161] INFO -- : Building power_assert@84e85124c5014a139af39161d484156cfe87a9ed to /home/opc/ruby/src/master/gems/power_assert-2.0.3.gem I, [2024-05-22T10:42:54.640037 #605161] INFO -- : making srcs under enc I, [2024-05-22T10:42:54.640187 #605161] INFO -- : making enc I, [2024-05-22T10:42:54.655434 #605161] INFO -- : Successfully built RubyGem I, [2024-05-22T10:42:54.655485 #605161] INFO -- : Name: power_assert I, [2024-05-22T10:42:54.655495 #605161] INFO -- : Version: 2.0.4dev I, [2024-05-22T10:42:54.655505 #605161] INFO -- : File: power_assert-2.0.4dev.gem I, [2024-05-22T10:42:54.659208 #605161] INFO -- : Extracting bundle gem power_assert-2.0.3... I, [2024-05-22T10:42:54.667806 #605161] INFO -- : make[1]: Entering directory '/home/opc/ruby/build/master' I, [2024-05-22T10:42:54.667869 #605161] INFO -- : make[1]: Nothing to be done for 'enc'. I, [2024-05-22T10:42:54.667900 #605161] INFO -- : make[1]: Leaving directory '/home/opc/ruby/build/master' I, [2024-05-22T10:42:54.682394 #605161] INFO -- : make[1]: Entering directory '/home/opc/ruby/build/master' I, [2024-05-22T10:42:54.682441 #605161] INFO -- : make[1]: Nothing to be done for 'srcs'. I, [2024-05-22T10:42:54.682453 #605161] INFO -- : make[1]: Leaving directory '/home/opc/ruby/build/master' I, [2024-05-22T10:42:54.683192 #605161] INFO -- : generating transdb.h I, [2024-05-22T10:42:54.759264 #605161] INFO -- : Try with hash version of bundled gems instead of gems/power_assert-2.0.3.gem. We don't use this gem with release version of Ruby. I, [2024-05-22T10:42:54.769951 #605161] INFO -- : Unpacked gems/power_assert-2.0.4dev.gem I, [2024-05-22T10:42:54.826884 #605161] INFO -- : transdb.h unchanged I, [2024-05-22T10:42:54.828239 #605161] INFO -- : generating makefiles ext/configure-ext.mk I, [2024-05-22T10:42:54.828288 #605161] INFO -- : making trans I, [2024-05-22T10:42:54.868485 #605161] INFO -- : ext/configure-ext.mk unchanged I, [2024-05-22T10:42:54.871583 #605161] INFO -- : make[1]: Entering directory '/home/opc/ruby/build/master' I, [2024-05-22T10:42:54.876931 #605161] INFO -- : make[1]: Entering directory '/home/opc/ruby/build/master' I, [2024-05-22T10:42:54.876979 #605161] INFO -- : make[1]: Nothing to be done for 'trans'. I, [2024-05-22T10:42:54.876992 #605161] INFO -- : make[1]: Leaving directory '/home/opc/ruby/build/master' I, [2024-05-22T10:42:55.000643 #605161] INFO -- : making encs I, [2024-05-22T10:42:55.055179 #605161] INFO -- : make[1]: Entering directory '/home/opc/ruby/build/master' I, [2024-05-22T10:42:55.055263 #605161] INFO -- : make[1]: Nothing to be done for 'encs'. I, [2024-05-22T10:42:55.055299 #605161] INFO -- : make[1]: Leaving directory '/home/opc/ruby/build/master' I, [2024-05-22T10:42:55.701611 #605161] INFO -- : make[1]: Leaving directory '/home/opc/ruby/build/master' I, [2024-05-22T10:42:55.702394 #605161] INFO -- : generating makefile exts.mk I, [2024-05-22T10:42:55.761098 #605161] INFO -- : exts.mk unchanged I, [2024-05-22T10:42:55.766110 #605161] INFO -- : make[1]: Entering directory '/home/opc/ruby/build/master' I, [2024-05-22T10:42:55.872660 #605161] INFO -- : make[2]: Entering directory '/home/opc/ruby/build/master/ext/digest' I, [2024-05-22T10:42:55.874258 #605161] INFO -- : make[2]: Entering directory '/home/opc/ruby/build/master/ext/coverage' I, [2024-05-22T10:42:55.874967 #605161] INFO -- : make[2]: Entering directory '/home/opc/ruby/build/master/ext/date' I, [2024-05-22T10:42:55.878994 #605161] INFO -- : make[2]: Leaving directory '/home/opc/ruby/build/master/ext/coverage' I, [2024-05-22T10:42:55.882337 #605161] INFO -- : make[2]: Leaving directory '/home/opc/ruby/build/master/ext/date' I, [2024-05-22T10:42:55.885895 #605161] INFO -- : make[2]: Leaving directory '/home/opc/ruby/build/master/ext/digest' I, [2024-05-22T10:42:55.891608 #605161] INFO -- : make[2]: Entering directory '/home/opc/ruby/build/master/ext/io/console' I, [2024-05-22T10:42:55.892988 #605161] INFO -- : make[2]: Entering directory '/home/opc/ruby/build/master/ext/fiddle' I, [2024-05-22T10:42:55.897687 #605161] INFO -- : make[2]: Leaving directory '/home/opc/ruby/build/master/ext/io/console' I, [2024-05-22T10:42:55.899479 #605161] INFO -- : make[2]: Entering directory '/home/opc/ruby/build/master/ext/json' I, [2024-05-22T10:42:55.901881 #605161] INFO -- : make[2]: Entering directory '/home/opc/ruby/build/master/ext/monitor' I, [2024-05-22T10:42:55.901918 #605161] INFO -- : make[2]: Leaving directory '/home/opc/ruby/build/master/ext/fiddle' I, [2024-05-22T10:42:55.906328 #605161] INFO -- : make[2]: Leaving directory '/home/opc/ruby/build/master/ext/monitor' I, [2024-05-22T10:42:55.908841 #605161] INFO -- : make[2]: Leaving directory '/home/opc/ruby/build/master/ext/json' I, [2024-05-22T10:42:55.909208 #605161] INFO -- : make[2]: Entering directory '/home/opc/ruby/build/master/ext/objspace' I, [2024-05-22T10:42:55.912951 #605161] INFO -- : make[2]: Entering directory '/home/opc/ruby/build/master/ext/pathname' I, [2024-05-22T10:42:55.916241 #605161] INFO -- : make[2]: Leaving directory '/home/opc/ruby/build/master/ext/objspace' I, [2024-05-22T10:42:55.918906 #605161] INFO -- : make[2]: Leaving directory '/home/opc/ruby/build/master/ext/pathname' I, [2024-05-22T10:42:55.922689 #605161] INFO -- : make[2]: Entering directory '/home/opc/ruby/build/master/ext/psych' I, [2024-05-22T10:42:55.923261 #605161] INFO -- : make[2]: Entering directory '/home/opc/ruby/build/master/ext/pty' I, [2024-05-22T10:42:55.925722 #605161] INFO -- : make[2]: Entering directory '/home/opc/ruby/build/master/ext/openssl' I, [2024-05-22T10:42:55.929621 #605161] INFO -- : make[2]: Leaving directory '/home/opc/ruby/build/master/ext/pty' I, [2024-05-22T10:42:55.941680 #605161] INFO -- : make[2]: Leaving directory '/home/opc/ruby/build/master/ext/psych' I, [2024-05-22T10:42:55.943655 #605161] INFO -- : make[2]: Entering directory '/home/opc/ruby/build/master/ext/rubyvm' I, [2024-05-22T10:42:55.945062 #605161] INFO -- : make[2]: Entering directory '/home/opc/ruby/build/master/ext/ripper' I, [2024-05-22T10:42:55.946915 #605161] INFO -- : make[2]: Leaving directory '/home/opc/ruby/build/master/ext/openssl' I, [2024-05-22T10:42:55.949385 #605161] INFO -- : make[2]: Leaving directory '/home/opc/ruby/build/master/ext/rubyvm' I, [2024-05-22T10:42:55.954380 #605161] INFO -- : make[2]: Leaving directory '/home/opc/ruby/build/master/ext/ripper' I, [2024-05-22T10:42:55.960480 #605161] INFO -- : make[2]: Entering directory '/home/opc/ruby/build/master/.bundle/gems/bigdecimal-3.1.7/ext/bigdecimal' I, [2024-05-22T10:42:55.961546 #605161] INFO -- : make[2]: Entering directory '/home/opc/ruby/build/master/.bundle/gems/bigdecimal-3.1.8/ext/bigdecimal' I, [2024-05-22T10:42:55.963317 #605161] INFO -- : make[2]: Entering directory '/home/opc/ruby/build/master/ext/socket' I, [2024-05-22T10:42:55.974054 #605161] INFO -- : make[2]: Leaving directory '/home/opc/ruby/build/master/ext/socket' I, [2024-05-22T10:42:55.976544 #605161] INFO -- : make[2]: Entering directory '/home/opc/ruby/build/master/.bundle/gems/debug-1.9.2/ext/debug' I, [2024-05-22T10:42:55.992030 #605161] INFO -- : make[2]: Leaving directory '/home/opc/ruby/build/master/.bundle/gems/bigdecimal-3.1.7/ext/bigdecimal' I, [2024-05-22T10:42:55.994628 #605161] INFO -- : make[2]: Leaving directory '/home/opc/ruby/build/master/.bundle/gems/bigdecimal-3.1.8/ext/bigdecimal' I, [2024-05-22T10:42:55.994669 #605161] INFO -- : make[2]: Entering directory '/home/opc/ruby/build/master/.bundle/gems/nkf-0.2.0/ext/nkf' I, [2024-05-22T10:42:56.001735 #605161] INFO -- : make[2]: Entering directory '/home/opc/ruby/build/master/.bundle/gems/racc-1.7.3/ext/racc/cparse' I, [2024-05-22T10:42:56.008372 #605161] INFO -- : make[2]: Leaving directory '/home/opc/ruby/build/master/.bundle/gems/debug-1.9.2/ext/debug' I, [2024-05-22T10:42:56.011537 #605161] INFO -- : make[2]: Entering directory '/home/opc/ruby/build/master/.bundle/gems/racc-1.8.0/ext/racc/cparse' I, [2024-05-22T10:42:56.024987 #605161] INFO -- : make[2]: Leaving directory '/home/opc/ruby/build/master/.bundle/gems/nkf-0.2.0/ext/nkf' I, [2024-05-22T10:42:56.027964 #605161] INFO -- : make[2]: Entering directory '/home/opc/ruby/build/master/.bundle/gems/rbs-3.4.4/ext/rbs_extension' I, [2024-05-22T10:42:56.033622 #605161] INFO -- : make[2]: Leaving directory '/home/opc/ruby/build/master/.bundle/gems/racc-1.7.3/ext/racc/cparse' I, [2024-05-22T10:42:56.036647 #605161] INFO -- : make[2]: Entering directory '/home/opc/ruby/build/master/.bundle/gems/syslog-0.1.2/ext/syslog' I, [2024-05-22T10:42:56.043276 #605161] INFO -- : make[2]: Leaving directory '/home/opc/ruby/build/master/.bundle/gems/racc-1.8.0/ext/racc/cparse' I, [2024-05-22T10:42:56.059986 #605161] INFO -- : make[2]: Leaving directory '/home/opc/ruby/build/master/.bundle/gems/rbs-3.4.4/ext/rbs_extension' I, [2024-05-22T10:42:56.065647 #605161] INFO -- : make[2]: Entering directory '/home/opc/ruby/build/master/ext/digest/sha2' I, [2024-05-22T10:42:56.070925 #605161] INFO -- : make[2]: Leaving directory '/home/opc/ruby/build/master/ext/digest/sha2' I, [2024-05-22T10:42:56.071216 #605161] INFO -- : make[2]: Leaving directory '/home/opc/ruby/build/master/.bundle/gems/syslog-0.1.2/ext/syslog' I, [2024-05-22T10:42:56.111619 #605161] INFO -- : make[2]: Entering directory '/home/opc/ruby/build/master' I, [2024-05-22T10:42:56.193756 #605161] INFO -- : make[2]: 'ruby' is up to date. I, [2024-05-22T10:42:56.193857 #605161] INFO -- : make[2]: Leaving directory '/home/opc/ruby/build/master' I, [2024-05-22T10:42:56.193988 #605161] INFO -- : make[1]: Leaving directory '/home/opc/ruby/build/master' I, [2024-05-22T10:42:56.198417 #605161] INFO -- : make[1]: Entering directory '/home/opc/ruby/build/master' I, [2024-05-22T10:42:56.198449 #605161] INFO -- : make[1]: Nothing to be done for 'note'. I, [2024-05-22T10:42:56.198461 #605161] INFO -- : make[1]: Leaving directory '/home/opc/ruby/build/master' I, [2024-05-22T10:42:56.198647 #605161] INFO -- : ./miniruby -I/home/opc/ruby/src/master/lib -I. -I.ext/common /home/opc/ruby/src/master/tool/runruby.rb --extout=.ext -- --disable-gems -r./aarch64-linux-fake /home/opc/ruby/src/master/tool/rbinstall.rb --make="make" --dest-dir="" --extout=".ext" --ext-build-dir="./ext" --mflags="-j3 --jobserver-auth=4,5" --make-flags=" -j3 --jobserver-auth=4,5" --data-mode=0644 --prog-mode=0755 --installed-list .installed.list --mantype="doc" --gnumake --install=all --exclude=doc I, [2024-05-22T10:42:56.349977 #605161] INFO -- : Installing to I, [2024-05-22T10:42:56.350048 #605161] INFO -- : installing binary commands: /home/opc/ruby/install/master/bin I, [2024-05-22T10:42:56.362313 #605161] INFO -- : installing base libraries: /home/opc/ruby/install/master/lib I, [2024-05-22T10:42:56.362833 #605161] INFO -- : installing arch files: /home/opc/ruby/install/master/lib/ruby/3.4.0+0/aarch64-linux I, [2024-05-22T10:42:56.362932 #605161] INFO -- : installing pkgconfig data: /home/opc/ruby/install/master/lib/pkgconfig I, [2024-05-22T10:42:56.363005 #605161] INFO -- : installing extension objects: /home/opc/ruby/install/master/lib/ruby/3.4.0+0/aarch64-linux I, [2024-05-22T10:42:56.376561 #605161] INFO -- : installing extension objects: /home/opc/ruby/install/master/lib/ruby/site_ruby/3.4.0+0/aarch64-linux I, [2024-05-22T10:42:56.376632 #605161] INFO -- : installing extension objects: /home/opc/ruby/install/master/lib/ruby/vendor_ruby/3.4.0+0/aarch64-linux I, [2024-05-22T10:42:56.376649 #605161] INFO -- : installing extension headers: /home/opc/ruby/install/master/include/ruby-3.4.0+0/aarch64-linux I, [2024-05-22T10:42:56.376944 #605161] INFO -- : installing extension scripts: /home/opc/ruby/install/master/lib/ruby/3.4.0+0 I, [2024-05-22T10:42:56.384886 #605161] INFO -- : installing extension scripts: /home/opc/ruby/install/master/lib/ruby/site_ruby/3.4.0+0 I, [2024-05-22T10:42:56.384911 #605161] INFO -- : installing extension scripts: /home/opc/ruby/install/master/lib/ruby/vendor_ruby/3.4.0+0 I, [2024-05-22T10:42:56.384922 #605161] INFO -- : installing extension headers: /home/opc/ruby/install/master/include/ruby-3.4.0+0/ruby I, [2024-05-22T10:42:56.385048 #605161] INFO -- : installing command scripts: /home/opc/ruby/install/master/bin I, [2024-05-22T10:42:56.385207 #605161] INFO -- : installing library scripts: /home/opc/ruby/install/master/lib/ruby/3.4.0+0 I, [2024-05-22T10:42:56.468308 #605161] INFO -- : installing common headers: /home/opc/ruby/install/master/include/ruby-3.4.0+0 I, [2024-05-22T10:42:56.480413 #605161] INFO -- : installing manpages: /home/opc/ruby/install/master/share/man/man1 I, [2024-05-22T10:42:56.480753 #605161] INFO -- : installing default gems from lib: /home/opc/ruby/install/master/lib/ruby/gems/3.4.0+0 I, [2024-05-22T10:42:56.525852 #605161] INFO -- : benchmark 0.3.0 I, [2024-05-22T10:42:56.529924 #605161] INFO -- : bundler 2.6.0.dev I, [2024-05-22T10:42:56.534567 #605161] INFO -- : cgi 0.4.1 I, [2024-05-22T10:42:56.535698 #605161] INFO -- : delegate 0.3.1 I, [2024-05-22T10:42:56.536826 #605161] INFO -- : did_you_mean 1.6.3 I, [2024-05-22T10:42:56.537972 #605161] INFO -- : english 0.8.0 I, [2024-05-22T10:42:56.540261 #605161] INFO -- : erb 4.0.4 I, [2024-05-22T10:42:56.543128 #605161] INFO -- : error_highlight 0.6.0 I, [2024-05-22T10:42:56.544205 #605161] INFO -- : fileutils 1.7.2 I, [2024-05-22T10:42:56.545380 #605161] INFO -- : find 0.2.0 I, [2024-05-22T10:42:56.546460 #605161] INFO -- : forwardable 1.3.3 I, [2024-05-22T10:42:56.547544 #605161] INFO -- : ipaddr 1.2.6 I, [2024-05-22T10:42:56.548616 #605161] INFO -- : irb 1.13.1 I, [2024-05-22T10:42:56.551275 #605161] INFO -- : logger 1.6.0 I, [2024-05-22T10:42:56.552367 #605161] INFO -- : net-http 0.4.1 I, [2024-05-22T10:42:56.553566 #605161] INFO -- : net-protocol 0.2.2 I, [2024-05-22T10:42:56.554687 #605161] INFO -- : open-uri 0.4.1 I, [2024-05-22T10:42:56.555817 #605161] INFO -- : open3 0.2.1 I, [2024-05-22T10:42:56.556960 #605161] INFO -- : optparse 0.5.0 I, [2024-05-22T10:42:56.558128 #605161] INFO -- : ostruct 0.6.0 I, [2024-05-22T10:42:56.559195 #605161] INFO -- : pp 0.5.0 I, [2024-05-22T10:42:56.560332 #605161] INFO -- : prettyprint 0.2.0 I, [2024-05-22T10:42:56.561490 #605161] INFO -- : prism 0.29.0 I, [2024-05-22T10:42:56.562732 #605161] INFO -- : pstore 0.1.3 I, [2024-05-22T10:42:56.563868 #605161] INFO -- : rdoc 6.6.3.1 I, [2024-05-22T10:42:56.567748 #605161] INFO -- : readline 0.0.4 I, [2024-05-22T10:42:56.568905 #605161] INFO -- : reline 0.5.7 I, [2024-05-22T10:42:56.570116 #605161] INFO -- : resolv 0.4.0 I, [2024-05-22T10:42:56.571199 #605161] INFO -- : ruby2_keywords 0.0.5 I, [2024-05-22T10:42:56.574140 #605161] INFO -- : securerandom 0.3.1 I, [2024-05-22T10:42:56.575234 #605161] INFO -- : set 1.1.0 I, [2024-05-22T10:42:56.576330 #605161] INFO -- : shellwords 0.2.0 I, [2024-05-22T10:42:56.577503 #605161] INFO -- : singleton 0.2.0 I, [2024-05-22T10:42:56.578559 #605161] INFO -- : syntax_suggest 2.0.0 I, [2024-05-22T10:42:56.580976 #605161] INFO -- : tempfile 0.2.1 I, [2024-05-22T10:42:56.582119 #605161] INFO -- : time 0.3.0 I, [2024-05-22T10:42:56.583262 #605161] INFO -- : timeout 0.4.1 I, [2024-05-22T10:42:56.584385 #605161] INFO -- : tmpdir 0.2.0 I, [2024-05-22T10:42:56.585601 #605161] INFO -- : tsort 0.2.0 I, [2024-05-22T10:42:56.586688 #605161] INFO -- : un 0.3.0 I, [2024-05-22T10:42:56.588026 #605161] INFO -- : uri 0.13.0 I, [2024-05-22T10:42:56.589235 #605161] INFO -- : weakref 0.1.3 I, [2024-05-22T10:42:56.590354 #605161] INFO -- : yaml 0.3.0 I, [2024-05-22T10:42:56.591224 #605161] INFO -- : installing default gems from ext: /home/opc/ruby/install/master/lib/ruby/gems/3.4.0+0 I, [2024-05-22T10:42:56.600511 #605161] INFO -- : date 3.3.4 I, [2024-05-22T10:42:56.603396 #605161] INFO -- : digest 3.1.1 I, [2024-05-22T10:42:56.604515 #605161] INFO -- : etc 1.4.3 I, [2024-05-22T10:42:56.605743 #605161] INFO -- : fcntl 1.1.0 I, [2024-05-22T10:42:56.606855 #605161] INFO -- : fiddle 1.1.3 I, [2024-05-22T10:42:56.607991 #605161] INFO -- : io-console 0.7.2 I, [2024-05-22T10:42:56.609157 #605161] INFO -- : io-nonblock 0.3.0 I, [2024-05-22T10:42:56.610269 #605161] INFO -- : io-wait 0.3.1 I, [2024-05-22T10:42:56.611341 #605161] INFO -- : json 2.7.2 I, [2024-05-22T10:42:56.612559 #605161] INFO -- : openssl 3.2.0 I, [2024-05-22T10:42:56.613788 #605161] INFO -- : pathname 0.3.0 I, [2024-05-22T10:42:56.615317 #605161] INFO -- : psych 5.1.2 I, [2024-05-22T10:42:56.616624 #605161] INFO -- : stringio 3.1.1 I, [2024-05-22T10:42:56.617817 #605161] INFO -- : strscan 3.1.1 I, [2024-05-22T10:42:56.618882 #605161] INFO -- : zlib 3.1.0 I, [2024-05-22T10:42:56.619792 #605161] INFO -- : installing bundled gems: /home/opc/ruby/install/master/lib/ruby/gems/3.4.0+0 I, [2024-05-22T10:42:56.620741 #605161] INFO -- : minitest 5.23.1 I, [2024-05-22T10:42:56.639003 #605161] INFO -- : rake 13.2.1 I, [2024-05-22T10:42:56.652957 #605161] INFO -- : test-unit 3.6.2 I, [2024-05-22T10:42:56.666948 #605161] INFO -- : rexml 3.2.8 I, [2024-05-22T10:42:56.683283 #605161] INFO -- : rss 0.3.0 I, [2024-05-22T10:42:56.692799 #605161] INFO -- : net-ftp 0.3.4 I, [2024-05-22T10:42:56.696805 #605161] INFO -- : net-imap 0.4.11 I, [2024-05-22T10:42:56.714461 #605161] INFO -- : net-pop 0.1.2 I, [2024-05-22T10:42:56.717043 #605161] INFO -- : net-smtp 0.5.0 I, [2024-05-22T10:42:56.720465 #605161] INFO -- : matrix 0.4.2 I, [2024-05-22T10:42:56.728842 #605161] INFO -- : prime 0.1.2 I, [2024-05-22T10:42:56.737776 #605161] INFO -- : rbs 3.4.4 I, [2024-05-22T10:42:56.843418 #605161] INFO -- : typeprof 0.21.11 I, [2024-05-22T10:42:56.851709 #605161] INFO -- : debug 1.9.2 I, [2024-05-22T10:42:56.861507 #605161] INFO -- : racc 1.8.0 I, [2024-05-22T10:42:56.872342 #605161] INFO -- : mutex_m 0.2.0 I, [2024-05-22T10:42:56.875335 #605161] INFO -- : getoptlong 0.2.1 I, [2024-05-22T10:42:56.880328 #605161] INFO -- : base64 0.2.0 I, [2024-05-22T10:42:56.882757 #605161] INFO -- : bigdecimal 3.1.8 I, [2024-05-22T10:42:56.889026 #605161] INFO -- : observer 0.1.2 I, [2024-05-22T10:42:56.892143 #605161] INFO -- : abbrev 0.1.2 I, [2024-05-22T10:42:56.895644 #605161] INFO -- : resolv-replace 0.1.1 I, [2024-05-22T10:42:56.900027 #605161] INFO -- : rinda 0.2.0 I, [2024-05-22T10:42:56.903755 #605161] INFO -- : drb 2.2.1 I, [2024-05-22T10:42:56.908870 #605161] INFO -- : nkf 0.2.0 I, [2024-05-22T10:42:56.915758 #605161] INFO -- : syslog 0.1.2 I, [2024-05-22T10:42:56.920741 #605161] INFO -- : csv 3.3.0 I, [2024-05-22T10:42:56.929863 #605161] INFO -- : installing bundled gem cache: /home/opc/ruby/install/master/lib/ruby/gems/3.4.0+0/cache I, [2024-05-22T10:42:56.931727 #605161] INFO -- : skipped bundled gems: I, [2024-05-22T10:42:56.931752 #605161] INFO -- : power_assert-2.0.4dev.gem not found in bundled_gems I, [2024-05-22T10:42:56.934769 #605161] INFO -- : $$$[end] "make install -j3" exit with 0. I, [2024-05-22T10:42:56.934919 #605161] INFO -- : $$$[beg] make yes-btest TESTOPTS='-q -j3' I, [2024-05-22T10:43:18.965931 #605161] INFO -- : PASS all 1936 tests E, [2024-05-22T10:43:18.967903 #605161] ERROR -- : I, [2024-05-22T10:43:18.968003 #605161] INFO -- : $$$[end] "make yes-btest TESTOPTS='-q -j3'" exit with 0. I, [2024-05-22T10:43:18.968139 #605161] INFO -- : $$$[beg] make yes-test-basic TESTS='-j3' I, [2024-05-22T10:43:19.060524 #605161] INFO -- : BASERUBY = /usr/local/bin/ruby --disable=gems I, [2024-05-22T10:43:19.060593 #605161] INFO -- : CC = gcc I, [2024-05-22T10:43:19.060604 #605161] INFO -- : LD = ld I, [2024-05-22T10:43:19.060615 #605161] INFO -- : LDSHARED = gcc -shared I, [2024-05-22T10:43:19.060624 #605161] INFO -- : CFLAGS = -O3 -fno-fast-math -ggdb3 -Wall -Wextra -Wdeprecated-declarations -Wdiv-by-zero -Wduplicated-cond -Wimplicit-function-declaration -Wimplicit-int -Wpointer-arith -Wwrite-strings -Wold-style-definition -Wimplicit-fallthrough=0 -Wmissing-noreturn -Wno-cast-function-type -Wno-constant-logical-operand -Wno-long-long -Wno-missing-field-initializers -Wno-overlength-strings -Wno-packed-bitfield-compat -Wno-parentheses-equality -Wno-self-assign -Wno-tautological-compare -Wno-unused-parameter -Wno-unused-value -Wsuggest-attribute=format -Wsuggest-attribute=noreturn -Wunused-variable -Wmisleading-indentation -Wundef I, [2024-05-22T10:43:19.060646 #605161] INFO -- : XCFLAGS = -U_FORTIFY_SOURCE -D_FORTIFY_SOURCE=2 -fstack-protector-strong -msign-return-address=all -fno-strict-overflow -fvisibility=hidden -fexcess-precision=standard -DRUBY_EXPORT -fPIE -I. -I.ext/include/aarch64-linux -I/home/opc/ruby/src/master/include -I/home/opc/ruby/src/master -I/home/opc/ruby/src/master/prism -I/home/opc/ruby/src/master/enc/unicode/15.0.0 I, [2024-05-22T10:43:19.060656 #605161] INFO -- : CPPFLAGS = I, [2024-05-22T10:43:19.060664 #605161] INFO -- : DLDFLAGS = -Wl,--compress-debug-sections=zlib -fstack-protector-strong -pie I, [2024-05-22T10:43:19.060672 #605161] INFO -- : SOLIBS = -lz -lrt -lrt -ldl -lcrypt -lm -lpthread I, [2024-05-22T10:43:19.060681 #605161] INFO -- : LANG = en_US.UTF-8 I, [2024-05-22T10:43:19.060689 #605161] INFO -- : LC_ALL = I, [2024-05-22T10:43:19.060696 #605161] INFO -- : LC_CTYPE = I, [2024-05-22T10:43:19.060704 #605161] INFO -- : MFLAGS = I, [2024-05-22T10:43:19.060712 #605161] INFO -- : RUSTC = rustc I, [2024-05-22T10:43:19.060720 #605161] INFO -- : YJIT_RUSTC_ARGS = --crate-name=yjit --crate-type=staticlib --edition=2021 -g -C lto=thin -C opt-level=3 -C overflow-checks=on '--out-dir=/home/opc/ruby/build/master/yjit/target/release/' /home/opc/ruby/src/master/yjit/src/lib.rs I, [2024-05-22T10:43:19.061485 #605161] INFO -- : gcc (GCC) 8.5.0 20210514 (Red Hat 8.5.0-10.1.0.1) I, [2024-05-22T10:43:19.061519 #605161] INFO -- : Copyright (C) 2018 Free Software Foundation, Inc. I, [2024-05-22T10:43:19.061530 #605161] INFO -- : This is free software; see the source for copying conditions. There is NO I, [2024-05-22T10:43:19.061539 #605161] INFO -- : warranty; not even for MERCHANTABILITY or FITNESS FOR A PARTICULAR PURPOSE. I, [2024-05-22T10:43:19.061547 #605161] INFO -- : I, [2024-05-22T10:43:19.218792 #605161] INFO -- : Checking leaked global symbols...none I, [2024-05-22T10:43:19.271520 #605161] INFO -- : /home/opc/ruby/src/master/basictest/test.rb:assignment ....................................................................................................................................................................................................................................................................................................................................................................................OK 372 I, [2024-05-22T10:43:19.271594 #605161] INFO -- : /home/opc/ruby/src/master/basictest/test.rb:condition ..OK 2 I, [2024-05-22T10:43:19.271618 #605161] INFO -- : /home/opc/ruby/src/master/basictest/test.rb:if/unless ...OK 3 I, [2024-05-22T10:43:19.271669 #605161] INFO -- : /home/opc/ruby/src/master/basictest/test.rb:case .....OK 5 I, [2024-05-22T10:43:19.272325 #605161] INFO -- : /home/opc/ruby/src/master/basictest/test.rb:while/until ........OK 8 I, [2024-05-22T10:43:19.272460 #605161] INFO -- : /home/opc/ruby/src/master/basictest/test.rb:exception ..........OK 10 I, [2024-05-22T10:43:19.273193 #605161] INFO -- : /home/opc/ruby/src/master/basictest/test.rb:array .......................................OK 39 I, [2024-05-22T10:43:19.273506 #605161] INFO -- : /home/opc/ruby/src/master/basictest/test.rb:hash ...........................OK 27 I, [2024-05-22T10:43:19.275258 #605161] INFO -- : /home/opc/ruby/src/master/basictest/test.rb:iterator ...........................................................................................................OK 107 I, [2024-05-22T10:43:19.276053 #605161] INFO -- : /home/opc/ruby/src/master/basictest/test.rb:float ................................................................................OK 80 I, [2024-05-22T10:43:19.279633 #605161] INFO -- : /home/opc/ruby/src/master/basictest/test.rb:bignum ...............................OK 31 I, [2024-05-22T10:43:19.281343 #605161] INFO -- : /home/opc/ruby/src/master/basictest/test.rb:string & char ..............................................................OK 62 I, [2024-05-22T10:43:19.281433 #605161] INFO -- : /home/opc/ruby/src/master/basictest/test.rb:assignment ..........OK 10 I, [2024-05-22T10:43:19.281508 #605161] INFO -- : /home/opc/ruby/src/master/basictest/test.rb:call ......OK 6 I, [2024-05-22T10:43:19.281639 #605161] INFO -- : /home/opc/ruby/src/master/basictest/test.rb:proc .........OK 9 I, [2024-05-22T10:43:19.381969 #605161] INFO -- : /home/opc/ruby/src/master/basictest/test.rb:signal ..OK 2 I, [2024-05-22T10:43:19.383351 #605161] INFO -- : /home/opc/ruby/src/master/basictest/test.rb:eval ...........................OK 27 I, [2024-05-22T10:43:19.522046 #605161] INFO -- : /home/opc/ruby/src/master/basictest/test.rb:system ........OK 8 I, [2024-05-22T10:43:19.522114 #605161] INFO -- : /home/opc/ruby/src/master/basictest/test.rb:const .....OK 5 I, [2024-05-22T10:43:19.522201 #605161] INFO -- : /home/opc/ruby/src/master/basictest/test.rb:clone .....OK 5 I, [2024-05-22T10:43:19.522390 #605161] INFO -- : /home/opc/ruby/src/master/basictest/test.rb:marshal ....OK 4 I, [2024-05-22T10:43:19.522469 #605161] INFO -- : /home/opc/ruby/src/master/basictest/test.rb:pack ....OK 4 I, [2024-05-22T10:43:19.522501 #605161] INFO -- : /home/opc/ruby/src/master/basictest/test.rb:math ..OK 2 I, [2024-05-22T10:43:19.522589 #605161] INFO -- : /home/opc/ruby/src/master/basictest/test.rb:struct ......OK 6 I, [2024-05-22T10:43:19.522759 #605161] INFO -- : /home/opc/ruby/src/master/basictest/test.rb:variable ............OK 12 I, [2024-05-22T10:43:19.522801 #605161] INFO -- : /home/opc/ruby/src/master/basictest/test.rb:trace ...OK 3 I, [2024-05-22T10:43:19.522927 #605161] INFO -- : /home/opc/ruby/src/master/basictest/test.rb:defined? ............OK 12 I, [2024-05-22T10:43:19.523015 #605161] INFO -- : /home/opc/ruby/src/master/basictest/test.rb:alias ......OK 6 I, [2024-05-22T10:43:19.523551 #605161] INFO -- : /home/opc/ruby/src/master/basictest/test.rb:path .......................OK 23 I, [2024-05-22T10:43:19.592227 #605161] INFO -- : /home/opc/ruby/src/master/basictest/test.rb:gc ....OK 4 I, [2024-05-22T10:43:19.594203 #605161] INFO -- : I, [2024-05-22T10:43:19.594238 #605161] INFO -- : test succeeded I, [2024-05-22T10:43:19.594817 #605161] INFO -- : $$$[end] "make yes-test-basic TESTS='-j3'" exit with 0. I, [2024-05-22T10:43:19.594976 #605161] INFO -- : $$$[beg] make yes-test-all TESTOPTS='--stderr-on-failure' TESTS='-j3' I, [2024-05-22T10:43:19.720008 #605161] INFO -- : BASERUBY = /usr/local/bin/ruby --disable=gems I, [2024-05-22T10:43:19.720083 #605161] INFO -- : CC = gcc I, [2024-05-22T10:43:19.720094 #605161] INFO -- : LD = ld I, [2024-05-22T10:43:19.720103 #605161] INFO -- : LDSHARED = gcc -shared I, [2024-05-22T10:43:19.720115 #605161] INFO -- : CFLAGS = -O3 -fno-fast-math -ggdb3 -Wall -Wextra -Wdeprecated-declarations -Wdiv-by-zero -Wduplicated-cond -Wimplicit-function-declaration -Wimplicit-int -Wpointer-arith -Wwrite-strings -Wold-style-definition -Wimplicit-fallthrough=0 -Wmissing-noreturn -Wno-cast-function-type -Wno-constant-logical-operand -Wno-long-long -Wno-missing-field-initializers -Wno-overlength-strings -Wno-packed-bitfield-compat -Wno-parentheses-equality -Wno-self-assign -Wno-tautological-compare -Wno-unused-parameter -Wno-unused-value -Wsuggest-attribute=format -Wsuggest-attribute=noreturn -Wunused-variable -Wmisleading-indentation -Wundef I, [2024-05-22T10:43:19.720124 #605161] INFO -- : XCFLAGS = -U_FORTIFY_SOURCE -D_FORTIFY_SOURCE=2 -fstack-protector-strong -msign-return-address=all -fno-strict-overflow -fvisibility=hidden -fexcess-precision=standard -DRUBY_EXPORT -fPIE -I. -I.ext/include/aarch64-linux -I/home/opc/ruby/src/master/include -I/home/opc/ruby/src/master -I/home/opc/ruby/src/master/prism -I/home/opc/ruby/src/master/enc/unicode/15.0.0 I, [2024-05-22T10:43:19.720132 #605161] INFO -- : CPPFLAGS = I, [2024-05-22T10:43:19.720140 #605161] INFO -- : DLDFLAGS = -Wl,--compress-debug-sections=zlib -fstack-protector-strong -pie I, [2024-05-22T10:43:19.720150 #605161] INFO -- : SOLIBS = -lz -lrt -lrt -ldl -lcrypt -lm -lpthread I, [2024-05-22T10:43:19.720158 #605161] INFO -- : LANG = en_US.UTF-8 I, [2024-05-22T10:43:19.720166 #605161] INFO -- : LC_ALL = I, [2024-05-22T10:43:19.720174 #605161] INFO -- : LC_CTYPE = I, [2024-05-22T10:43:19.720182 #605161] INFO -- : MFLAGS = I, [2024-05-22T10:43:19.720189 #605161] INFO -- : RUSTC = rustc I, [2024-05-22T10:43:19.720197 #605161] INFO -- : YJIT_RUSTC_ARGS = --crate-name=yjit --crate-type=staticlib --edition=2021 -g -C lto=thin -C opt-level=3 -C overflow-checks=on '--out-dir=/home/opc/ruby/build/master/yjit/target/release/' /home/opc/ruby/src/master/yjit/src/lib.rs I, [2024-05-22T10:43:19.720928 #605161] INFO -- : gcc (GCC) 8.5.0 20210514 (Red Hat 8.5.0-10.1.0.1) I, [2024-05-22T10:43:19.720951 #605161] INFO -- : Copyright (C) 2018 Free Software Foundation, Inc. I, [2024-05-22T10:43:19.720961 #605161] INFO -- : This is free software; see the source for copying conditions. There is NO I, [2024-05-22T10:43:19.720969 #605161] INFO -- : warranty; not even for MERCHANTABILITY or FITNESS FOR A PARTICULAR PURPOSE. I, [2024-05-22T10:43:19.720978 #605161] INFO -- : I, [2024-05-22T10:43:19.723064 #605161] INFO -- : generating enc.mk I, [2024-05-22T10:43:19.957665 #605161] INFO -- : generating encdb.h I, [2024-05-22T10:43:19.995360 #605161] INFO -- : encdb.h unchanged I, [2024-05-22T10:43:19.996636 #605161] INFO -- : making enc I, [2024-05-22T10:43:20.023909 #605161] INFO -- : make[1]: Entering directory '/home/opc/ruby/build/master' I, [2024-05-22T10:43:20.023964 #605161] INFO -- : make[1]: Nothing to be done for 'enc'. I, [2024-05-22T10:43:20.023975 #605161] INFO -- : make[1]: Leaving directory '/home/opc/ruby/build/master' I, [2024-05-22T10:43:20.024788 #605161] INFO -- : making srcs under enc I, [2024-05-22T10:43:20.066608 #605161] INFO -- : make[1]: Entering directory '/home/opc/ruby/build/master' I, [2024-05-22T10:43:20.066674 #605161] INFO -- : make[1]: Nothing to be done for 'srcs'. I, [2024-05-22T10:43:20.066717 #605161] INFO -- : make[1]: Leaving directory '/home/opc/ruby/build/master' I, [2024-05-22T10:43:20.067884 #605161] INFO -- : generating transdb.h I, [2024-05-22T10:43:20.219126 #605161] INFO -- : transdb.h unchanged I, [2024-05-22T10:43:20.220561 #605161] INFO -- : making trans I, [2024-05-22T10:43:20.269581 #605161] INFO -- : make[1]: Entering directory '/home/opc/ruby/build/master' I, [2024-05-22T10:43:20.269652 #605161] INFO -- : make[1]: Nothing to be done for 'trans'. I, [2024-05-22T10:43:20.269662 #605161] INFO -- : make[1]: Leaving directory '/home/opc/ruby/build/master' I, [2024-05-22T10:43:20.270472 #605161] INFO -- : making encs I, [2024-05-22T10:43:20.323400 #605161] INFO -- : make[1]: Entering directory '/home/opc/ruby/build/master' I, [2024-05-22T10:43:20.323469 #605161] INFO -- : make[1]: Nothing to be done for 'encs'. I, [2024-05-22T10:43:20.323479 #605161] INFO -- : make[1]: Leaving directory '/home/opc/ruby/build/master' I, [2024-05-22T10:43:20.325523 #605161] INFO -- : generating makefiles ext/configure-ext.mk I, [2024-05-22T10:43:20.365668 #605161] INFO -- : ext/configure-ext.mk updated I, [2024-05-22T10:43:20.369167 #605161] INFO -- : make[1]: Entering directory '/home/opc/ruby/build/master' I, [2024-05-22T10:43:22.510581 #605161] INFO -- : make[1]: Leaving directory '/home/opc/ruby/build/master' I, [2024-05-22T10:43:22.511267 #605161] INFO -- : generating makefile exts.mk I, [2024-05-22T10:43:22.569864 #605161] INFO -- : exts.mk unchanged I, [2024-05-22T10:43:22.574876 #605161] INFO -- : make[1]: Entering directory '/home/opc/ruby/build/master' I, [2024-05-22T10:43:22.878261 #605161] INFO -- : make[2]: Entering directory '/home/opc/ruby/build/master/ext/coverage' I, [2024-05-22T10:43:22.883423 #605161] INFO -- : make[2]: Leaving directory '/home/opc/ruby/build/master/ext/coverage' I, [2024-05-22T10:43:22.889395 #605161] INFO -- : make[2]: Entering directory '/home/opc/ruby/build/master/ext/date' I, [2024-05-22T10:43:22.895228 #605161] INFO -- : make[2]: Leaving directory '/home/opc/ruby/build/master/ext/date' I, [2024-05-22T10:43:22.899447 #605161] INFO -- : make[2]: Entering directory '/home/opc/ruby/build/master/ext/digest' I, [2024-05-22T10:43:22.909169 #605161] INFO -- : make[2]: Leaving directory '/home/opc/ruby/build/master/ext/digest' I, [2024-05-22T10:43:22.933718 #605161] INFO -- : make[2]: Entering directory '/home/opc/ruby/build/master/ext/digest/sha2' I, [2024-05-22T10:43:22.938615 #605161] INFO -- : make[2]: Leaving directory '/home/opc/ruby/build/master/ext/digest/sha2' I, [2024-05-22T10:43:22.957793 #605161] INFO -- : make[2]: Entering directory '/home/opc/ruby/build/master/ext/fiddle' I, [2024-05-22T10:43:22.967966 #605161] INFO -- : make[2]: Leaving directory '/home/opc/ruby/build/master/ext/fiddle' I, [2024-05-22T10:43:22.972349 #605161] INFO -- : make[2]: Entering directory '/home/opc/ruby/build/master/ext/io/console' I, [2024-05-22T10:43:22.976668 #605161] INFO -- : make[2]: Leaving directory '/home/opc/ruby/build/master/ext/io/console' I, [2024-05-22T10:43:22.987240 #605161] INFO -- : make[2]: Entering directory '/home/opc/ruby/build/master/ext/json' I, [2024-05-22T10:43:22.996713 #605161] INFO -- : make[2]: Leaving directory '/home/opc/ruby/build/master/ext/json' I, [2024-05-22T10:43:23.009739 #605161] INFO -- : make[2]: Entering directory '/home/opc/ruby/build/master/ext/monitor' I, [2024-05-22T10:43:23.013902 #605161] INFO -- : make[2]: Leaving directory '/home/opc/ruby/build/master/ext/monitor' I, [2024-05-22T10:43:23.019882 #605161] INFO -- : make[2]: Entering directory '/home/opc/ruby/build/master/ext/objspace' I, [2024-05-22T10:43:23.025773 #605161] INFO -- : make[2]: Leaving directory '/home/opc/ruby/build/master/ext/objspace' I, [2024-05-22T10:43:23.044902 #605161] INFO -- : make[2]: Entering directory '/home/opc/ruby/build/master/ext/openssl' I, [2024-05-22T10:43:23.067036 #605161] INFO -- : make[2]: Leaving directory '/home/opc/ruby/build/master/ext/openssl' I, [2024-05-22T10:43:23.071195 #605161] INFO -- : make[2]: Entering directory '/home/opc/ruby/build/master/ext/pathname' I, [2024-05-22T10:43:23.075344 #605161] INFO -- : make[2]: Leaving directory '/home/opc/ruby/build/master/ext/pathname' I, [2024-05-22T10:43:23.081705 #605161] INFO -- : make[2]: Entering directory '/home/opc/ruby/build/master/ext/psych' I, [2024-05-22T10:43:23.103146 #605161] INFO -- : make[2]: Leaving directory '/home/opc/ruby/build/master/ext/psych' I, [2024-05-22T10:43:23.107497 #605161] INFO -- : make[2]: Entering directory '/home/opc/ruby/build/master/ext/pty' I, [2024-05-22T10:43:23.111954 #605161] INFO -- : make[2]: Leaving directory '/home/opc/ruby/build/master/ext/pty' I, [2024-05-22T10:43:23.125300 #605161] INFO -- : make[2]: Entering directory '/home/opc/ruby/build/master/ext/ripper' I, [2024-05-22T10:43:23.132957 #605161] INFO -- : make[2]: Leaving directory '/home/opc/ruby/build/master/ext/ripper' I, [2024-05-22T10:43:23.134889 #605161] INFO -- : make[2]: Entering directory '/home/opc/ruby/build/master/ext/rubyvm' I, [2024-05-22T10:43:23.138313 #605161] INFO -- : make[2]: Leaving directory '/home/opc/ruby/build/master/ext/rubyvm' I, [2024-05-22T10:43:23.150405 #605161] INFO -- : make[2]: Entering directory '/home/opc/ruby/build/master/ext/socket' I, [2024-05-22T10:43:23.161035 #605161] INFO -- : make[2]: Leaving directory '/home/opc/ruby/build/master/ext/socket' I, [2024-05-22T10:43:23.176454 #605161] INFO -- : make[2]: Entering directory '/home/opc/ruby/build/master/.bundle/gems/bigdecimal-3.1.7/ext/bigdecimal' I, [2024-05-22T10:43:23.207293 #605161] INFO -- : make[2]: Leaving directory '/home/opc/ruby/build/master/.bundle/gems/bigdecimal-3.1.7/ext/bigdecimal' I, [2024-05-22T10:43:23.210016 #605161] INFO -- : make[2]: Entering directory '/home/opc/ruby/build/master/.bundle/gems/bigdecimal-3.1.8/ext/bigdecimal' I, [2024-05-22T10:43:23.240741 #605161] INFO -- : make[2]: Leaving directory '/home/opc/ruby/build/master/.bundle/gems/bigdecimal-3.1.8/ext/bigdecimal' I, [2024-05-22T10:43:23.243315 #605161] INFO -- : make[2]: Entering directory '/home/opc/ruby/build/master/.bundle/gems/debug-1.9.2/ext/debug' I, [2024-05-22T10:43:23.274413 #605161] INFO -- : make[2]: Leaving directory '/home/opc/ruby/build/master/.bundle/gems/debug-1.9.2/ext/debug' I, [2024-05-22T10:43:23.276932 #605161] INFO -- : make[2]: Entering directory '/home/opc/ruby/build/master/.bundle/gems/nkf-0.2.0/ext/nkf' I, [2024-05-22T10:43:23.307575 #605161] INFO -- : make[2]: Leaving directory '/home/opc/ruby/build/master/.bundle/gems/nkf-0.2.0/ext/nkf' I, [2024-05-22T10:43:23.310111 #605161] INFO -- : make[2]: Entering directory '/home/opc/ruby/build/master/.bundle/gems/racc-1.7.3/ext/racc/cparse' I, [2024-05-22T10:43:23.340665 #605161] INFO -- : make[2]: Leaving directory '/home/opc/ruby/build/master/.bundle/gems/racc-1.7.3/ext/racc/cparse' I, [2024-05-22T10:43:23.343273 #605161] INFO -- : make[2]: Entering directory '/home/opc/ruby/build/master/.bundle/gems/racc-1.8.0/ext/racc/cparse' I, [2024-05-22T10:43:23.374182 #605161] INFO -- : make[2]: Leaving directory '/home/opc/ruby/build/master/.bundle/gems/racc-1.8.0/ext/racc/cparse' I, [2024-05-22T10:43:23.377106 #605161] INFO -- : make[2]: Entering directory '/home/opc/ruby/build/master/.bundle/gems/rbs-3.4.4/ext/rbs_extension' I, [2024-05-22T10:43:23.407685 #605161] INFO -- : make[2]: Leaving directory '/home/opc/ruby/build/master/.bundle/gems/rbs-3.4.4/ext/rbs_extension' I, [2024-05-22T10:43:23.410313 #605161] INFO -- : make[2]: Entering directory '/home/opc/ruby/build/master/.bundle/gems/syslog-0.1.2/ext/syslog' I, [2024-05-22T10:43:23.441096 #605161] INFO -- : make[2]: Leaving directory '/home/opc/ruby/build/master/.bundle/gems/syslog-0.1.2/ext/syslog' I, [2024-05-22T10:43:23.480227 #605161] INFO -- : make[2]: Entering directory '/home/opc/ruby/build/master' I, [2024-05-22T10:43:23.563917 #605161] INFO -- : make[2]: 'ruby' is up to date. I, [2024-05-22T10:43:23.563991 #605161] INFO -- : make[2]: Leaving directory '/home/opc/ruby/build/master' I, [2024-05-22T10:43:23.564130 #605161] INFO -- : make[1]: Leaving directory '/home/opc/ruby/build/master' I, [2024-05-22T10:43:23.569062 #605161] INFO -- : make[1]: Entering directory '/home/opc/ruby/build/master' I, [2024-05-22T10:43:23.569095 #605161] INFO -- : make[1]: Nothing to be done for 'note'. I, [2024-05-22T10:43:23.569106 #605161] INFO -- : make[1]: Leaving directory '/home/opc/ruby/build/master' I, [2024-05-22T10:43:23.681980 #605161] INFO -- : Run options: I, [2024-05-22T10:43:23.682055 #605161] INFO -- : --seed=61147 I, [2024-05-22T10:43:23.682066 #605161] INFO -- : "--ruby=./miniruby -I/home/opc/ruby/src/master/lib -I. -I.ext/common /home/opc/ruby/src/master/tool/runruby.rb --extout=.ext -- --disable-gems" I, [2024-05-22T10:43:23.682075 #605161] INFO -- : --excludes-dir=/home/opc/ruby/src/master/test/.excludes I, [2024-05-22T10:43:23.682084 #605161] INFO -- : --name=!/memory_leak/ I, [2024-05-22T10:43:23.682092 #605161] INFO -- : --stderr-on-failure I, [2024-05-22T10:43:23.682100 #605161] INFO -- : -j3 I, [2024-05-22T10:43:23.682108 #605161] INFO -- : I, [2024-05-22T10:43:23.682116 #605161] INFO -- : # Running tests: I, [2024-05-22T10:43:23.682125 #605161] INFO -- : I, [2024-05-22T10:43:23.814077 #605161] INFO -- : [ 1/885] 646015=test_threadgroup I, [2024-05-22T10:43:23.816436 #605161] INFO -- : [ 2/885] 646014=test_complex I, [2024-05-22T10:43:23.824582 #605161] INFO -- : [ 3/885] 646016=test_array_create I, [2024-05-22T10:43:23.833579 #605161] INFO -- : [ 4/885] 646016=test_dir_m17n I, [2024-05-22T10:43:23.934337 #605161] INFO -- : [ 5/885] 646014=test_memory_view I, [2024-05-22T10:43:23.960939 #605161] INFO -- : [ 6/885] 646014=test_fd_setsize I, [2024-05-22T10:43:23.966539 #605161] INFO -- : [ 7/885] 646014=test_forwardable I, [2024-05-22T10:43:23.996881 #605161] INFO -- : [ 8/885] 646014=test_process I, [2024-05-22T10:43:24.009332 #605161] INFO -- : [ 9/885] 646014=!Nothing_to_test I, [2024-05-22T10:43:24.086520 #605161] INFO -- : [ 10/885] 646014=pattern_test I, [2024-05-22T10:43:24.103337 #605161] INFO -- : [ 11/885] 646014=test_dot_dot I, [2024-05-22T10:43:24.136538 #605161] INFO -- : [ 12/885] 646014=test_gem_rdoc I, [2024-05-22T10:43:24.640069 #605161] INFO -- : [ 13/885] 646014=test_rendering I, [2024-05-22T10:43:24.677814 #605161] INFO -- : [ 14/885] 646014=test_kernel I, [2024-05-22T10:43:24.872935 #605161] INFO -- : [ 15/885] 646015=test_gem_commands_install_command I, [2024-05-22T10:43:24.979148 #605161] INFO -- : [ 16/885] 646016=test_iterator I, [2024-05-22T10:43:25.034600 #605161] INFO -- : [ 17/885] 646016=test_string I, [2024-05-22T10:43:25.039013 #605161] INFO -- : [ 18/885] 646016=test_merge_keys I, [2024-05-22T10:43:25.075676 #605161] INFO -- : [ 19/885] 646016=test_storage I, [2024-05-22T10:43:25.079207 #605161] INFO -- : [ 20/885] 646016=test_err_in_callback I, [2024-05-22T10:43:25.083525 #605161] INFO -- : [ 21/885] 646016=test_method_name_check I, [2024-05-22T10:43:25.125336 #605161] INFO -- : [ 22/885] 646016=test_cesu8 I, [2024-05-22T10:43:25.136405 #605161] INFO -- : [ 23/885] 646016=test_rdoc_extend I, [2024-05-22T10:43:25.232031 #605161] INFO -- : [ 24/885] 646014=test_did_you_mean I, [2024-05-22T10:43:25.326903 #605161] INFO -- : [ 25/885] 646016=test_shapes I, [2024-05-22T10:43:25.375000 #605161] INFO -- : [ 26/885] 646016=memsize_test I, [2024-05-22T10:43:25.390457 #605161] INFO -- : [ 27/885] 646014=test_gem_resolver_requirement_list I, [2024-05-22T10:43:25.399064 #605161] INFO -- : [ 28/885] 646014=test_noarg I, [2024-05-22T10:43:25.434462 #605161] INFO -- : [ 29/885] 646016=test_exception I, [2024-05-22T10:43:25.473494 #605161] INFO -- : [ 30/885] 646016=test_raise_exception I, [2024-05-22T10:43:25.580687 #605161] INFO -- : [ 31/885] 646014=test_arith_seq_beg_len_step I, [2024-05-22T10:43:25.624228 #605161] INFO -- : [ 32/885] 646014=test_gem_impossible_dependencies_error I, [2024-05-22T10:43:25.629845 #605161] INFO -- : [ 33/885] 646014=test_pp I, [2024-05-22T10:43:25.657058 #605161] INFO -- : Leaked file descriptor: PPTestModule::PPFileStatTest#test_nothing_raised: 7 # I, [2024-05-22T10:43:25.657293 #605161] INFO -- : Leaked file descriptor: PPTestModule::PPFileStatTest#test_nothing_raised: 8 # I, [2024-05-22T10:43:25.657472 #605161] INFO -- : Leaked file descriptor: PPTestModule::PPFileStatTest#test_nothing_raised: 9 # I, [2024-05-22T10:43:25.698818 #605161] INFO -- : COMMAND PID USER FD TYPE DEVICE SIZE/OFF NODE NAME I, [2024-05-22T10:43:25.698886 #605161] INFO -- : ruby 646014 opc 7r REG 252,0 9253600 13705411 /var/lib/sss/mc/passwd I, [2024-05-22T10:43:25.698897 #605161] INFO -- : ruby 646014 opc 8r REG 252,0 6940392 13705429 /var/lib/sss/mc/group I, [2024-05-22T10:43:25.698912 #605161] INFO -- : ruby 646014 opc 9u unix 0x0000000000000000 0t0 3092957194 type=STREAM I, [2024-05-22T10:43:25.743593 #605161] INFO -- : [ 34/885] 646014=test_rdoc_tom_doc I, [2024-05-22T10:43:25.782179 #605161] INFO -- : [ 35/885] 646014=test_optarg I, [2024-05-22T10:43:25.853385 #605161] INFO -- : [ 36/885] 646014=test_gem_commands_pristine_command I, [2024-05-22T10:43:26.049842 #605161] INFO -- : [ 37/885] 646016=test_variable I, [2024-05-22T10:43:26.133321 #605161] INFO -- : [ 38/885] 646016=test_hash I, [2024-05-22T10:43:26.163344 #605161] INFO -- : [ 39/885] 646016=test_gem_security I, [2024-05-22T10:43:27.042197 #605161] INFO -- : [ 40/885] 646015=test_key_actor_emacs I, [2024-05-22T10:43:27.285209 #605161] INFO -- : [ 41/885] 646015=test_date_ractor I, [2024-05-22T10:43:27.294591 #605161] INFO -- : [ 42/885] 646014=test_erb I, [2024-05-22T10:43:27.344680 #605161] INFO -- : [ 43/885] 646014=test_basicinstructions I, [2024-05-22T10:43:27.413995 #605161] INFO -- : [ 44/885] 646014=test_gem_resolver_git_specification I, [2024-05-22T10:43:27.445447 #605161] INFO -- : [ 45/885] 646015=test_utf32 I, [2024-05-22T10:43:27.450651 #605161] INFO -- : [ 46/885] 646015=test_gem_update_suggestion I, [2024-05-22T10:43:27.462256 #605161] INFO -- : [ 47/885] 646015=test_assignment I, [2024-05-22T10:43:27.729097 #605161] INFO -- : [ 48/885] 646014=test_verbose I, [2024-05-22T10:43:27.754184 #605161] INFO -- : [ 49/885] 646014=test_gem_commands_open_command I, [2024-05-22T10:43:27.846342 #605161] INFO -- : [ 50/885] 646014=test_emoji_breaks I, [2024-05-22T10:43:27.848470 #605161] INFO -- : [ 51/885] 646014=test_normalize I, [2024-05-22T10:43:27.869118 #605161] INFO -- : [ 52/885] 646014=test_asn1 I, [2024-05-22T10:43:27.884485 #605161] INFO -- : [ 53/885] 646014=test_gem_command I, [2024-05-22T10:43:27.998894 #605161] INFO -- : [ 54/885] 646014=test_undef I, [2024-05-22T10:43:28.011517 #605161] INFO -- : [ 55/885] 646014=test_gem_resolver_lock_set I, [2024-05-22T10:43:28.026401 #605161] INFO -- : [ 56/885] 646014=test_random I, [2024-05-22T10:43:28.061396 #605161] INFO -- : [ 57/885] 646014=test_rdoc_generator_darkfish I, [2024-05-22T10:43:28.408332 #605161] INFO -- : [ 58/885] 646014=test_yield I, [2024-05-22T10:43:28.737930 #605161] INFO -- : [ 59/885] 646015=test_show_source I, [2024-05-22T10:43:28.745683 #605161] INFO -- : [ 60/885] 646015=test_remote_fetch_error I, [2024-05-22T10:43:28.836686 #605161] INFO -- : [ 61/885] 646015=regexp_test I, [2024-05-22T10:43:28.850517 #605161] INFO -- : [ 62/885] 646015=test_shift_jis I, [2024-05-22T10:43:28.887273 #605161] INFO -- : [ 63/885] 646015=test_rdoc_store I, [2024-05-22T10:43:29.504663 #605161] INFO -- : [ 64/885] 646015=test_force_exit I, [2024-05-22T10:43:29.512864 #605161] INFO -- : [ 65/885] 646015=test_optimization I, [2024-05-22T10:43:31.127312 #605161] INFO -- : [ 66/885] 646014=test_files_sample I, [2024-05-22T10:43:31.137384 #605161] INFO -- : [ 67/885] 646014=test_rdoc_stats I, [2024-05-22T10:43:31.185330 #605161] INFO -- : [ 68/885] 646014=test_data_error I, [2024-05-22T10:43:31.237179 #605161] INFO -- : [ 69/885] 646014=test_rubyoptions I, [2024-05-22T10:43:35.553120 #605161] INFO -- : [ 70/885] 646016=test_enc_raise I, [2024-05-22T10:43:35.584845 #605161] INFO -- : [ 71/885] 646016=test_clone I, [2024-05-22T10:43:35.722620 #605161] INFO -- : [ 72/885] 646016=test_ole_methods I, [2024-05-22T10:43:35.728950 #605161] INFO -- : [ 73/885] 646016=test_cgi_util I, [2024-05-22T10:43:35.951432 #605161] INFO -- : [ 74/885] 646016=test_gem_uri_formatter I, [2024-05-22T10:43:35.971474 #605161] INFO -- : [ 75/885] 646016=test_prettyprint I, [2024-05-22T10:43:35.973012 #605161] INFO -- : [ 76/885] 646015=test_rdoc_i18n_locale I, [2024-05-22T10:43:35.987434 #605161] INFO -- : [ 77/885] 646015=test_gc_compact I, [2024-05-22T10:43:35.996615 #605161] INFO -- : [ 78/885] 646016=test_dryrun I, [2024-05-22T10:43:36.051005 #605161] INFO -- : [ 79/885] 646016=test_gem_resolver_lock_specification I, [2024-05-22T10:43:36.099950 #605161] INFO -- : [ 80/885] 646016=test_boolean I, [2024-05-22T10:43:36.115761 #605161] INFO -- : [ 81/885] 646016=test_queue I, [2024-05-22T10:43:36.116042 #605161] INFO -- : [ 82/885] 646016=test_hash_create I, [2024-05-22T10:43:36.125043 #605161] INFO -- : [ 83/885] 646016=test_grapheme_breaks I, [2024-05-22T10:43:36.148950 #605161] INFO -- : [ 84/885] 646016=test_tree_spell_checker I, [2024-05-22T10:43:36.221994 #605161] INFO -- : [ 85/885] 646016=static_literals_test I, [2024-05-22T10:43:36.225949 #605161] INFO -- : [ 86/885] 646016=test_enumerable I, [2024-05-22T10:43:36.241388 #605161] INFO -- : [ 87/885] 646016=test_rdoc_method_attr I, [2024-05-22T10:43:36.380410 #605161] INFO -- : [ 88/885] 646016=test_set I, [2024-05-22T10:43:36.413484 #605161] INFO -- : [ 89/885] 646016=test_gem_commands_dependency_command I, [2024-05-22T10:43:36.496909 #605161] INFO -- : [ 90/885] 646016=test_backtrace I, [2024-05-22T10:43:36.501324 #605161] INFO -- : [ 91/885] 646016=test_gbk I, [2024-05-22T10:43:36.510094 #605161] INFO -- : [ 92/885] 646016=test_unicode_escape I, [2024-05-22T10:43:36.590953 #605161] INFO -- : [ 93/885] 646016=test_default_gems I, [2024-05-22T10:43:36.637806 #605161] INFO -- : [ 94/885] 646016=test_switch_hitter I, [2024-05-22T10:43:36.652405 #605161] INFO -- : [ 95/885] 646016=test_yamldbm I, [2024-05-22T10:43:36.667535 #605161] INFO -- : [ 96/885] 646016=test_gem_spec_fetcher I, [2024-05-22T10:43:36.854121 #605161] INFO -- : [ 97/885] 646016=test_buffering I, [2024-05-22T10:43:36.854322 #605161] INFO -- : [ 98/885] 646016=test_pkey_ec I, [2024-05-22T10:43:36.899829 #605161] INFO -- : [ 99/885] 646016=test_svcb_https I, [2024-05-22T10:43:36.909252 #605161] INFO -- : [100/885] 646016=test_arity I, [2024-05-22T10:43:36.914135 #605161] INFO -- : [101/885] 646016=test_thread I, [2024-05-22T10:43:36.916638 #605161] INFO -- : [102/885] 646016=test_open3 I, [2024-05-22T10:43:37.523981 #605161] INFO -- : [103/885] 646014=test_mdns I, [2024-05-22T10:43:37.560631 #605161] INFO -- : [104/885] 646014=test_date_parse I, [2024-05-22T10:43:37.672166 #605161] INFO -- : [105/885] 646014=test_key_event_record I, [2024-05-22T10:43:37.697734 #605161] INFO -- : [106/885] 646014=test_webauthn_listener I, [2024-05-22T10:43:37.737849 #605161] INFO -- : Leaked file descriptor: WebauthnListenerTest#test_wait_for_otp_code_options_request: 12 : # I, [2024-05-22T10:43:37.770090 #605161] INFO -- : COMMAND PID USER FD TYPE DEVICE SIZE/OFF NODE NAME I, [2024-05-22T10:43:37.770179 #605161] INFO -- : ruby 646014 opc 12u IPv4 3092960222 0t0 TCP localhost:46309->localhost:53452 (CLOSE_WAIT) I, [2024-05-22T10:43:37.824814 #605161] INFO -- : .Closed file descriptor: WebauthnListenerTest#test_wait_for_otp_code_get_follows_options: 12 I, [2024-05-22T10:43:37.881768 #605161] INFO -- : [107/885] 646014=test_ractor I, [2024-05-22T10:43:37.894411 #605161] INFO -- : [108/885] 646014=test_rdoc_rubygems_hook I, [2024-05-22T10:43:37.976682 #605161] INFO -- : [109/885] 646014=test_gem_resolver_api_specification I, [2024-05-22T10:43:38.030815 #605161] INFO -- : [110/885] 646014=test_rational I, [2024-05-22T10:43:38.048748 #605161] INFO -- : [111/885] 646014=test_case_mapping I, [2024-05-22T10:43:38.058857 #605161] INFO -- : [112/885] 646014=test_gem_ext_cargo_builder_unit I, [2024-05-22T10:43:38.088869 #605161] INFO -- : [113/885] 646014=test_gem_package_old I, [2024-05-22T10:43:38.131905 #605161] INFO -- : [114/885] 646014=test_gem_commands_which_command I, [2024-05-22T10:43:38.185700 #605161] INFO -- : [115/885] 646014=test_gem_request I, [2024-05-22T10:43:38.417972 #605161] INFO -- : [116/885] 646014=test_scan_args I, [2024-05-22T10:43:38.471709 #605161] INFO -- : [117/885] 646014=test_gem_commands_specification_command I, [2024-05-22T10:43:38.634817 #605161] INFO -- : [118/885] 646014=encoding_test I, [2024-05-22T10:43:38.702787 #605161] INFO -- : [119/885] 646014=parser_test I, [2024-05-22T10:43:38.707692 #605161] INFO -- : [120/885] 646014=test_hash I, [2024-05-22T10:43:38.913554 #605161] INFO -- : [121/885] 646015=test_http I, [2024-05-22T10:43:38.953963 #605161] INFO -- : [122/885] 646015=test_gem_dependency_installer I, [2024-05-22T10:43:39.564281 #605161] INFO -- : [123/885] 646016=test_pty I, [2024-05-22T10:43:40.040849 #605161] INFO -- : [124/885] 646016=test_gem_text I, [2024-05-22T10:43:40.144178 #605161] INFO -- : [125/885] 646016=test_settracefunc I, [2024-05-22T10:43:40.911374 #605161] INFO -- : [126/885] 646016=test_tracepoint I, [2024-05-22T10:43:41.274381 #605161] INFO -- : [127/885] 646016=test_backtrace I, [2024-05-22T10:43:41.497671 #605161] INFO -- : [128/885] 646015=test_rdoc_task I, [2024-05-22T10:43:41.619516 #605161] INFO -- : [129/885] 646015=test_gem_gemcutter_utilities I, [2024-05-22T10:43:41.977073 #605161] INFO -- : [130/885] 646015=test_win32ole I, [2024-05-22T10:43:41.977345 #605161] INFO -- : [131/885] 646015=test_internal_ivar I, [2024-05-22T10:43:41.999342 #605161] INFO -- : [132/885] 646015=test_gem_source_local I, [2024-05-22T10:43:42.134689 #605161] INFO -- : [133/885] 646014=desugar_compiler_test I, [2024-05-22T10:43:42.140751 #605161] INFO -- : [134/885] 646014=test_rendering I, [2024-05-22T10:43:42.154920 #605161] INFO -- : [135/885] 646014=test_sprintf_comb I, [2024-05-22T10:43:42.225057 #605161] INFO -- : [136/885] 646015=test_method_cache I, [2024-05-22T10:43:42.228405 #605161] INFO -- : [137/885] 646015=test_too_many_dummy_encodings I, [2024-05-22T10:43:42.285615 #605161] INFO -- : [138/885] 646015=locals_test I, [2024-05-22T10:43:42.307502 #605161] INFO -- : [139/885] 646014=test_gem_commands_push_command I, [2024-05-22T10:43:42.535823 #605161] INFO -- : [140/885] 646016=test_rdoc_markup_to_rdoc I, [2024-05-22T10:43:42.580839 #605161] INFO -- : [141/885] 646016=attribute_write_test I, [2024-05-22T10:43:42.585517 #605161] INFO -- : [142/885] 646016=test_http I, [2024-05-22T10:43:42.684854 #605161] INFO -- : [143/885] 646015=test_utf16 I, [2024-05-22T10:43:42.711898 #605161] INFO -- : [144/885] 646015=test_set I, [2024-05-22T10:43:42.720754 #605161] INFO -- : [145/885] 646015=test_str2big I, [2024-05-22T10:43:42.730283 #605161] INFO -- : [146/885] 646015=test_gem_package_tar_writer I, [2024-05-22T10:43:42.888595 #605161] INFO -- : [147/885] 646014=test_case I, [2024-05-22T10:43:42.893324 #605161] INFO -- : [148/885] 646014=test_ractor I, [2024-05-22T10:43:42.908526 #605161] INFO -- : [149/885] 646014=test_severity I, [2024-05-22T10:43:42.920630 #605161] INFO -- : [150/885] 646014=test_koi8 I, [2024-05-22T10:43:42.922724 #605161] INFO -- : [151/885] 646015=test_json_tree I, [2024-05-22T10:43:42.929185 #605161] INFO -- : [152/885] 646014=test_gem_remote_fetcher I, [2024-05-22T10:43:42.951000 #605161] INFO -- : [153/885] 646015=test_pkcs12 I, [2024-05-22T10:43:43.667889 #605161] INFO -- : [154/885] 646015=test_parser_events I, [2024-05-22T10:43:43.739037 #605161] INFO -- : [155/885] 646015=test_filter I, [2024-05-22T10:43:43.779183 #605161] INFO -- : [156/885] 646015=test_method I, [2024-05-22T10:43:44.939452 #605161] INFO -- : [157/885] 646014=test_m17n I, [2024-05-22T10:43:45.034741 #605161] INFO -- : [158/885] 646014=test_gem_dependency I, [2024-05-22T10:43:45.187166 #605161] INFO -- : [159/885] 646014=test_cclass I, [2024-05-22T10:43:45.270204 #605161] INFO -- : [160/885] 646014=test_gem_uninstaller I, [2024-05-22T10:43:46.510283 #605161] INFO -- : [161/885] 646014=test_yjit I, [2024-05-22T10:43:46.521034 #605161] INFO -- : [162/885] 646014=test_yaml I, [2024-05-22T10:43:46.621844 #605161] INFO -- : [163/885] 646014=test_x509name I, [2024-05-22T10:43:46.758487 #605161] INFO -- : [164/885] 646014=test_argf I, [2024-05-22T10:43:48.680365 #605161] INFO -- : [165/885] 646015=test_win32ole_variable I, [2024-05-22T10:43:48.683397 #605161] INFO -- : [166/885] 646015=test_method_cache I, [2024-05-22T10:43:48.710770 #605161] INFO -- : [167/885] 646015=test_rdoc_class_module I, [2024-05-22T10:43:49.275388 #605161] INFO -- : [168/885] 646015=test_rdoc_cross_reference I, [2024-05-22T10:43:49.669767 #605161] INFO -- : [169/885] 646015=test_parse I, [2024-05-22T10:43:50.136841 #605161] INFO -- : [170/885] 646015=test_system I, [2024-05-22T10:43:50.164547 #605161] INFO -- : [171/885] 646014=test_numhash I, [2024-05-22T10:43:50.173362 #605161] INFO -- : [172/885] 646014=test_flush I, [2024-05-22T10:43:50.273827 #605161] INFO -- : [173/885] 646014=test_pkey_rsa I, [2024-05-22T10:43:50.466511 #605161] INFO -- : [174/885] 646014=test_gem_specification I, [2024-05-22T10:43:51.027104 #605161] INFO -- : [175/885] 646015=test_gem_install_update_options I, [2024-05-22T10:43:51.152468 #605161] INFO -- : [176/885] 646015=test_econv I, [2024-05-22T10:43:51.406743 #605161] INFO -- : [177/885] 646016=test_stringchar I, [2024-05-22T10:43:51.488574 #605161] INFO -- : [178/885] 646016=warnings_test I, [2024-05-22T10:43:51.509929 #605161] INFO -- : [179/885] 646016=test_face I, [2024-05-22T10:43:51.583928 #605161] INFO -- : [180/885] 646016=test_gem_request_set_lockfile_parser I, [2024-05-22T10:43:51.733101 #605161] INFO -- : [181/885] 646016=test_sizeof I, [2024-05-22T10:43:52.007644 #605161] INFO -- : [182/885] 646015=test_date_attr I, [2024-05-22T10:43:52.015913 #605161] INFO -- : [183/885] 646015=test_emoji I, [2024-05-22T10:43:52.051607 #605161] INFO -- : [184/885] 646015=test_sorted_set I, [2024-05-22T10:43:52.288810 #605161] INFO -- : [185/885] 646015=test_stack I, [2024-05-22T10:43:52.878146 #605161] INFO -- : [186/885] 646014=test_windows_1252 I, [2024-05-22T10:43:52.885589 #605161] INFO -- : [187/885] 646014=test_gem_dependency_resolution_error I, [2024-05-22T10:43:52.909291 #605161] INFO -- : [188/885] 646014=test_fileutils I, [2024-05-22T10:43:53.089558 #605161] INFO -- : [189/885] 646015=test_mixed_unicode_escapes I, [2024-05-22T10:43:53.105319 #605161] INFO -- : [190/885] 646015=test_sleep I, [2024-05-22T10:43:53.518727 #605161] INFO -- : [191/885] 646014=test_jaro_winkler I, [2024-05-22T10:43:53.522792 #605161] INFO -- : [192/885] 646014=test_cp949 I, [2024-05-22T10:43:53.529801 #605161] INFO -- : [193/885] 646014=test_gem_resolver_vendor_set I, [2024-05-22T10:43:53.549177 #605161] INFO -- : [194/885] 646014=test_condition I, [2024-05-22T10:43:53.560912 #605161] INFO -- : [195/885] 646014=test_date_time I, [2024-05-22T10:43:53.567362 #605161] INFO -- : [196/885] 646014=test_nil2vtempty I, [2024-05-22T10:43:53.576897 #605161] INFO -- : [197/885] 646014=test_rdoc_generator_json_index I, [2024-05-22T10:43:53.630690 #605161] INFO -- : [198/885] 646014=test_pinned I, [2024-05-22T10:43:53.672167 #605161] INFO -- : [199/885] 646014=test_cgi_tag_helper I, [2024-05-22T10:43:53.706881 #605161] INFO -- : [200/885] 646014=test_pack I, [2024-05-22T10:43:53.740948 #605161] INFO -- : [201/885] 646014=test_weakmap I, [2024-05-22T10:43:54.278955 #605161] INFO -- : [202/885] 646016=test_coderange I, [2024-05-22T10:43:54.283139 #605161] INFO -- : [203/885] 646016=test_ansi_with_terminfo I, [2024-05-22T10:43:54.289980 #605161] INFO -- : [204/885] 646016=test_inadvertent_creation I, [2024-05-22T10:43:54.380931 #605161] INFO -- : [205/885] 646016=test_framework I, [2024-05-22T10:43:54.448640 #605161] INFO -- : [206/885] 646016=test_exit I, [2024-05-22T10:43:54.463415 #605161] INFO -- : [207/885] 646016=test_class I, [2024-05-22T10:43:55.153195 #605161] INFO -- : [208/885] 646015=index_write_test I, [2024-05-22T10:43:55.161731 #605161] INFO -- : [209/885] 646015=test_rdoc_parser_rd I, [2024-05-22T10:43:55.167652 #605161] INFO -- : [210/885] 646015=test_const I, [2024-05-22T10:43:55.188832 #605161] INFO -- : [211/885] 646015=test_gem_commands_sources_command I, [2024-05-22T10:43:55.383641 #605161] INFO -- : [212/885] 646015=test_name_error I, [2024-05-22T10:43:55.482267 #605161] INFO -- : [213/885] 646015=test_gem_source_list I, [2024-05-22T10:43:55.606539 #605161] INFO -- : [214/885] 646015=json_addition_test I, [2024-05-22T10:43:55.612966 #605161] INFO -- : [215/885] 646015=test_recorder I, [2024-05-22T10:43:55.622956 #605161] INFO -- : [216/885] 646015=test_yaml_special_cases I, [2024-05-22T10:43:55.637581 #605161] INFO -- : [217/885] 646015=test_sprintf I, [2024-05-22T10:43:55.840401 #605161] INFO -- : [218/885] 646015=test_safe_load I, [2024-05-22T10:43:55.849068 #605161] INFO -- : [219/885] 646015=test_iso_8859 I, [2024-05-22T10:43:55.908943 #605161] INFO -- : [220/885] 646015=ripper_test I, [2024-05-22T10:43:56.533780 #605161] INFO -- : [221/885] 646015=test_libs I, [2024-05-22T10:43:56.550822 #605161] INFO -- : [222/885] 646015=test_math I, [2024-05-22T10:43:56.558889 #605161] INFO -- : [223/885] 646015=test_qsort I, [2024-05-22T10:43:56.565060 #605161] INFO -- : [224/885] 646015=comments_test I, [2024-05-22T10:43:56.566858 #605161] INFO -- : [225/885] 646015=test_gc I, [2024-05-22T10:43:56.576104 #605161] INFO -- : [226/885] 646015=test_array I, [2024-05-22T10:43:56.591560 #605161] INFO -- : [227/885] 646015=test_gem_command_manager I, [2024-05-22T10:43:56.810726 #605161] INFO -- : [228/885] 646015=test_rdoc_context I, [2024-05-22T10:43:57.599379 #605161] INFO -- : [229/885] 646015=test_enc_associate I, [2024-05-22T10:43:58.984837 #605161] INFO -- : [230/885] 646015=test_enumerator I, [2024-05-22T10:43:59.070181 #605161] INFO -- : [231/885] 646016=test_case I, [2024-05-22T10:43:59.123984 #605161] INFO -- : [232/885] 646016=test_open-uri I, [2024-05-22T10:43:59.509837 #605161] INFO -- : [233/885] 646016=test_gem_requirement I, [2024-05-22T10:43:59.656754 #605161] INFO -- : [234/885] 646016=test_rdoc_markup_to_table_of_contents I, [2024-05-22T10:43:59.692046 #605161] INFO -- : [235/885] 646016=test_gem_name_tuple I, [2024-05-22T10:43:59.762092 #605161] INFO -- : [236/885] 646016=test_integer I, [2024-05-22T10:43:59.769092 #605161] INFO -- : [237/885] 646016=test_tcp I, [2024-05-22T10:43:59.820863 #605161] INFO -- : [238/885] 646016=test_win32ole_method_event I, [2024-05-22T10:43:59.846972 #605161] INFO -- : [239/885] 646016=parse_comments_test I, [2024-05-22T10:43:59.850220 #605161] INFO -- : [240/885] 646014=test_function I, [2024-05-22T10:43:59.857444 #605161] INFO -- : [241/885] 646016=test_gem_resolver_activation_request I, [2024-05-22T10:43:59.873801 #605161] INFO -- : [242/885] 646016=test_gem_commands_server_command I, [2024-05-22T10:44:00.063804 #605161] INFO -- : [243/885] 646016=test_string I, [2024-05-22T10:44:00.073971 #605161] INFO -- : [244/885] 646014=test_macro I, [2024-05-22T10:44:00.079065 #605161] INFO -- : [245/885] 646014=test_pipe I, [2024-05-22T10:44:00.648374 #605161] INFO -- : [246/885] 646014=test_constant I, [2024-05-22T10:44:02.277562 #605161] INFO -- : [247/885] 646014=test_find I, [2024-05-22T10:44:02.297642 #605161] INFO -- : [248/885] 646014=test_rdoc_generator_markup I, [2024-05-22T10:44:02.304925 #605161] INFO -- : [249/885] 646014=test_hmac I, [2024-05-22T10:44:02.364224 #605161] INFO -- : [250/885] 646014=test_encoding I, [2024-05-22T10:44:02.498323 #605161] INFO -- : [251/885] 646014=test_capacity I, [2024-05-22T10:44:02.510589 #605161] INFO -- : [252/885] 646014=test_nextafter I, [2024-05-22T10:44:02.664721 #605161] INFO -- : [253/885] 646014=test_gem_commands_owner_command I, [2024-05-22T10:44:03.325178 #605161] INFO -- : [254/885] 646014=test_time I, [2024-05-22T10:44:03.446004 #605161] INFO -- : [255/885] 646014=test_file I, [2024-05-22T10:44:03.642150 #605161] INFO -- : [256/885] 646014=test_flags I, [2024-05-22T10:44:04.040087 #605161] INFO -- : [257/885] 646014=test_numeric I, [2024-05-22T10:44:04.111190 #605161] INFO -- : [258/885] 646014=test_bug-3571 I, [2024-05-22T10:44:04.120085 #605161] INFO -- : [259/885] 646014=test_yamlstore I, [2024-05-22T10:44:04.133306 #605161] INFO -- : [260/885] 646014=test_rat I, [2024-05-22T10:44:04.165279 #605161] INFO -- : [261/885] 646014=test_init I, [2024-05-22T10:44:04.476188 #605161] INFO -- : [262/885] 646014=test_gem_request_connection_pools I, [2024-05-22T10:44:05.821617 #605161] INFO -- : [263/885] 646014=test_zlib I, [2024-05-22T10:44:11.994167 #605161] INFO -- : [264/885] 646014=test_rdoc_options I, [2024-05-22T10:44:12.311551 #605161] INFO -- : [265/885] 646014=test_gem_commands_unpack_command I, [2024-05-22T10:44:12.662839 #605161] INFO -- : [266/885] 646014=test_gem_ext_cargo_builder I, [2024-05-22T10:44:12.664702 #605161] INFO -- : [267/885] 646014=test_console_attr I, [2024-05-22T10:44:12.688638 #605161] INFO -- : [268/885] 646014=test_proc I, [2024-05-22T10:44:13.641296 #605161] INFO -- : [269/885] 646014=test_date_compat I, [2024-05-22T10:44:13.660807 #605161] INFO -- : [270/885] 646014=test_rdoc_include I, [2024-05-22T10:44:13.685581 #605161] INFO -- : [271/885] 646014=test_win32ole_record I, [2024-05-22T10:44:13.697359 #605161] INFO -- : [272/885] 646014=test_gem_version_option I, [2024-05-22T10:44:13.756139 #605161] INFO -- : [273/885] 646014=test_ubf_async_safe I, [2024-05-22T10:44:13.768000 #605161] INFO -- : [274/885] 646014=test_pstore I, [2024-05-22T10:44:14.031903 #605161] INFO -- : [275/885] 646014=test_c_struct_builder I, [2024-05-22T10:44:14.225448 #605161] INFO -- : [276/885] 646014=test_bug-5832 I, [2024-05-22T10:44:14.234462 #605161] INFO -- : [277/885] 646014=test_yield_block I, [2024-05-22T10:44:14.242990 #605161] INFO -- : [278/885] 646014=test_gem_uri I, [2024-05-22T10:44:14.285023 #605161] INFO -- : [279/885] 646014=test_gem_package_tar_reader_entry I, [2024-05-22T10:44:14.504040 #605161] INFO -- : [280/885] 646014=test_resource I, [2024-05-22T10:44:14.518247 #605161] INFO -- : [281/885] 646014=test_frozen_error I, [2024-05-22T10:44:14.528368 #605161] INFO -- : [282/885] 646014=test_gem_ext_ext_conf_builder I, [2024-05-22T10:44:15.636418 #605161] INFO -- : [283/885] 646014=test_spell_checker I, [2024-05-22T10:44:15.647988 #605161] INFO -- : [284/885] 646014=test_gem_version I, [2024-05-22T10:44:15.789752 #605161] INFO -- : [285/885] 646014=test_reqarg I, [2024-05-22T10:44:16.089163 #605161] INFO -- : [286/885] 646014=test_enumerator I, [2024-05-22T10:44:16.094975 #605161] INFO -- : [287/885] 646014=test_path_to_class I, [2024-05-22T10:44:16.109358 #605161] INFO -- : [288/885] 646014=test_thread_queue I, [2024-05-22T10:44:17.896888 #605161] INFO -- : [289/885] 646015=test_nowrite I, [2024-05-22T10:44:17.920908 #605161] INFO -- : [290/885] 646015=test_passing_block I, [2024-05-22T10:44:17.931805 #605161] INFO -- : [291/885] 646015=test_defined I, [2024-05-22T10:44:18.003017 #605161] INFO -- : [292/885] 646015=test_ldap I, [2024-05-22T10:44:18.022887 #605161] INFO -- : [293/885] 646015=test_kdf I, [2024-05-22T10:44:18.076849 #605161] INFO -- : [294/885] 646015=test_io_buffer I, [2024-05-22T10:44:18.116261 #605161] INFO -- : [295/885] 646015=test_type_completor I, [2024-05-22T10:44:18.128452 #605161] INFO -- : [296/885] 646015=test_rdoc_normal_module I, [2024-05-22T10:44:18.163944 #605161] INFO -- : [297/885] 646015=test_io_timeout I, [2024-05-22T10:44:18.186095 #605161] INFO -- : [298/885] 646015=test_rdoc_markdown_test I, [2024-05-22T10:44:19.179094 #605161] INFO -- : [299/885] 646015=test_rdoc_rdoc I, [2024-05-22T10:44:19.245729 #605161] INFO -- : [300/885] 646015=test_yjit_exit_locations I, [2024-05-22T10:44:19.252890 #605161] INFO -- : [301/885] 646015=test_comparable I, [2024-05-22T10:44:19.259258 #605161] INFO -- : [302/885] 646015=json_string_matching_test I, [2024-05-22T10:44:19.274835 #605161] INFO -- : [303/885] 646015=test_gem_config_file I, [2024-05-22T10:44:19.462081 #605161] INFO -- : [304/885] 646015=test_logger I, [2024-05-22T10:44:19.484588 #605161] INFO -- : [305/885] 646015=test_pkey_dsa I, [2024-05-22T10:44:19.729282 #605161] INFO -- : [306/885] 646016=test_big2str I, [2024-05-22T10:44:19.736027 #605161] INFO -- : [307/885] 646016=test_gem_resolver_specification I, [2024-05-22T10:44:19.782636 #605161] INFO -- : [308/885] 646016=test_cstr I, [2024-05-22T10:44:20.721703 #605161] INFO -- : [309/885] 646016=test_gem_resolver_dependency_request I, [2024-05-22T10:44:20.746712 #605161] INFO -- : [310/885] 646016=test_euc_tw I, [2024-05-22T10:44:20.790574 #605161] INFO -- : [311/885] 646016=test_command I, [2024-05-22T10:44:21.020019 #605161] INFO -- : [312/885] 646016=test_gem_commands_yank_command I, [2024-05-22T10:44:21.420724 #605161] INFO -- : [313/885] 646014=test_yaml_tree I, [2024-05-22T10:44:21.444096 #605161] INFO -- : [314/885] 646014=test_psych I, [2024-05-22T10:44:21.465795 #605161] INFO -- : [315/885] 646014=test_nil I, [2024-05-22T10:44:21.492674 #605161] INFO -- : [316/885] 646014=test_wait I, [2024-05-22T10:44:21.525164 #605161] INFO -- : [317/885] 646016=test_human_typo I, [2024-05-22T10:44:21.532751 #605161] INFO -- : [318/885] 646014=test_import I, [2024-05-22T10:44:21.536850 #605161] INFO -- : [319/885] 646016=version_test I, [2024-05-22T10:44:21.543336 #605161] INFO -- : [320/885] 646016=test_complexrational I, [2024-05-22T10:44:21.545170 #605161] INFO -- : [321/885] 646016=test_raise I, [2024-05-22T10:44:21.563398 #605161] INFO -- : [322/885] 646016=test_rdoc_any_method I, [2024-05-22T10:44:21.953344 #605161] INFO -- : [323/885] 646016=test_error_highlight I, [2024-05-22T10:44:22.548111 #605161] INFO -- : [324/885] 646016=test_function_entry I, [2024-05-22T10:44:22.558159 #605161] INFO -- : [325/885] 646016=test_string I, [2024-05-22T10:44:22.583606 #605161] INFO -- : [326/885] 646016=json_common_interface_test I, [2024-05-22T10:44:22.596677 #605161] INFO -- : [327/885] 646016=reflection_test I, [2024-05-22T10:44:22.606900 #605161] INFO -- : [328/885] 646016=test_line_editor I, [2024-05-22T10:44:22.612694 #605161] INFO -- : [329/885] 646016=test_marshalable I, [2024-05-22T10:44:22.617317 #605161] INFO -- : [330/885] 646016=test_enumerator_kw I, [2024-05-22T10:44:22.633364 #605161] INFO -- : [331/885] 646016=test_string_memory I, [2024-05-22T10:44:22.751087 #605161] INFO -- : [332/885] 646016=test_help I, [2024-05-22T10:44:22.778594 #605161] INFO -- : [333/885] 646016=test_files_lib I, [2024-05-22T10:44:23.365698 #605161] INFO -- : [334/885] 646015=test_gem_resolver_index_specification I, [2024-05-22T10:44:23.386230 #605161] INFO -- : [335/885] 646014=test_serialize_subclasses I, [2024-05-22T10:44:23.391231 #605161] INFO -- : [336/885] 646014=test_frozen I, [2024-05-22T10:44:23.400163 #605161] INFO -- : [337/885] 646014=test_egrep_cpp I, [2024-05-22T10:44:23.427904 #605161] INFO -- : [338/885] 646015=test_webauthn_poller I, [2024-05-22T10:44:23.491807 #605161] INFO -- : [339/885] 646014=test_rdoc_markup_verbatim I, [2024-05-22T10:44:23.498821 #605161] INFO -- : [340/885] 646014=test_date_conv I, [2024-05-22T10:44:23.503487 #605161] INFO -- : [341/885] 646014=test_timeout I, [2024-05-22T10:44:23.508742 #605161] INFO -- : [342/885] 646014=test_erb_m17n I, [2024-05-22T10:44:23.519120 #605161] INFO -- : [343/885] 646014=test_rdoc_generator_pot_po_entry I, [2024-05-22T10:44:23.524577 #605161] INFO -- : [344/885] 646014=test_rdoc_markup_pre_process I, [2024-05-22T10:44:23.584355 #605161] INFO -- : [345/885] 646015=test_store I, [2024-05-22T10:44:23.613523 #605161] INFO -- : [346/885] 646014=test_http_request I, [2024-05-22T10:44:23.643399 #605161] INFO -- : [347/885] 646014=test_tempfile I, [2024-05-22T10:44:23.931562 #605161] INFO -- : [348/885] 646015=test_coverage I, [2024-05-22T10:44:23.973212 #605161] INFO -- : [349/885] 646014=test_fnmatch I, [2024-05-22T10:44:24.021392 #605161] INFO -- : [350/885] 646014=test_pathname I, [2024-05-22T10:44:24.291277 #605161] INFO -- : [351/885] 646014=test_protect I, [2024-05-22T10:44:24.347154 #605161] INFO -- : [352/885] 646014=test_gem_commands_update_command I, [2024-05-22T10:44:24.713588 #605161] INFO -- : [353/885] 646015=test_date I, [2024-05-22T10:44:24.719502 #605161] INFO -- : [354/885] 646015=test_big5 I, [2024-05-22T10:44:24.720831 #605161] INFO -- : [355/885] 646015=test_tree_builder I, [2024-05-22T10:44:24.738093 #605161] INFO -- : [356/885] 646015=test_rdoc_i18n_text I, [2024-05-22T10:44:24.747109 #605161] INFO -- : [357/885] 646015=test_io I, [2024-05-22T10:44:24.976122 #605161] INFO -- : [358/885] 646015=test_input_method I, [2024-05-22T10:44:25.020433 #605161] INFO -- : [359/885] 646015=test_gem_security_signer I, [2024-05-22T10:44:25.176265 #605161] INFO -- : [360/885] 646015=test_config I, [2024-05-22T10:44:25.242921 #605161] INFO -- : [361/885] 646015=test_complex2 I, [2024-05-22T10:44:25.256798 #605161] INFO -- : [362/885] 646015=test_gem_util I, [2024-05-22T10:44:25.429593 #605161] INFO -- : [363/885] 646015=test_thread I, [2024-05-22T10:44:25.607410 #605161] INFO -- : [364/885] 646016=test_gem_unsatisfiable_dependency_error I, [2024-05-22T10:44:25.615541 #605161] INFO -- : [365/885] 646016=test_literal I, [2024-05-22T10:44:25.640398 #605161] INFO -- : [366/885] 646015=test_gem_commands_query_command I, [2024-05-22T10:44:25.986493 #605161] INFO -- : [367/885] 646014=test_gem_platform I, [2024-05-22T10:44:26.103397 #605161] INFO -- : [368/885] 646014=test_bigzero I, [2024-05-22T10:44:26.110393 #605161] INFO -- : [369/885] 646014=test_pkey I, [2024-05-22T10:44:26.127197 #605161] INFO -- : [370/885] 646014=test_external_new I, [2024-05-22T10:44:26.132533 #605161] INFO -- : [371/885] 646014=test_win32ole_typelib I, [2024-05-22T10:44:26.148946 #605161] INFO -- : [372/885] 646014=test_m17n_comb I, [2024-05-22T10:44:26.186705 #605161] INFO -- : [373/885] 646016=test_multi_irb_commands I, [2024-05-22T10:44:26.196627 #605161] INFO -- : [374/885] 646016=test_pkey_dh I, [2024-05-22T10:44:26.289214 #605161] INFO -- : [375/885] 646015=test_data I, [2024-05-22T10:44:26.303876 #605161] INFO -- : [376/885] 646015=test_memory_view I, [2024-05-22T10:44:26.320178 #605161] INFO -- : [377/885] 646015=test_null I, [2024-05-22T10:44:26.364235 #605161] INFO -- : [378/885] 646015=test_ractor I, [2024-05-22T10:44:26.408813 #605161] INFO -- : [379/885] 646015=test_weakref I, [2024-05-22T10:44:26.664810 #605161] INFO -- : [380/885] 646015=test_instrumentation_api I, [2024-05-22T10:44:27.520229 #605161] INFO -- : [381/885] 646016=test_rdoc_alias I, [2024-05-22T10:44:27.557980 #605161] INFO -- : [382/885] 646016=test_timeout I, [2024-05-22T10:44:28.442103 #605161] INFO -- : [383/885] 646016=test_key_name_check I, [2024-05-22T10:44:28.452150 #605161] INFO -- : [384/885] 646016=test_rdoc_markup_to_bs I, [2024-05-22T10:44:28.499190 #605161] INFO -- : [385/885] 646016=test_rdoc_markup_raw I, [2024-05-22T10:44:28.528046 #605161] INFO -- : [386/885] 646016=test_gem_ext_rake_builder I, [2024-05-22T10:44:29.146156 #605161] INFO -- : [387/885] 646016=test_rdoc_require I, [2024-05-22T10:44:29.151260 #605161] INFO -- : [388/885] 646016=test_word I, [2024-05-22T10:44:29.158159 #605161] INFO -- : [389/885] 646016=test_singleton I, [2024-05-22T10:44:29.164212 #605161] INFO -- : [390/885] 646016=test_numeric I, [2024-05-22T10:44:29.174002 #605161] INFO -- : [391/885] 646016=test_fstring I, [2024-05-22T10:44:29.191248 #605161] INFO -- : [392/885] 646014=test_gem_commands_cert_command I, [2024-05-22T10:44:29.277010 #605161] INFO -- : [393/885] 646016=test_rdoc_markup_to_tt_only I, [2024-05-22T10:44:29.321214 #605161] INFO -- : [394/885] 646016=test_ws I, [2024-05-22T10:44:29.426486 #605161] INFO -- : [395/885] 646016=test_date_strftime I, [2024-05-22T10:44:29.615318 #605161] INFO -- : [396/885] 646015=json_parser_test I, [2024-05-22T10:44:29.658539 #605161] INFO -- : [397/885] 646015=test_gem_commands_stale_command I, [2024-05-22T10:44:29.665490 #605161] INFO -- : [398/885] 646015=ruby_parser_test I, [2024-05-22T10:44:29.678257 #605161] INFO -- : [399/885] 646015=test_pack I, [2024-05-22T10:44:29.767099 #605161] INFO -- : [400/885] 646016=test_pkcs7 I, [2024-05-22T10:44:29.843375 #605161] INFO -- : [401/885] 646015=test_gem_commands_environment_command I, [2024-05-22T10:44:29.895716 #605161] INFO -- : [402/885] 646015=test_zsh_completion I, [2024-05-22T10:44:29.905797 #605161] INFO -- : [403/885] 646015=test_basicsocket I, [2024-05-22T10:44:29.918035 #605161] INFO -- : [404/885] 646015=test_class_name_check I, [2024-05-22T10:44:29.937758 #605161] INFO -- : [405/885] 646016=test_syntax I, [2024-05-22T10:44:30.006823 #605161] INFO -- : [406/885] 646015=test_scalar I, [2024-05-22T10:44:30.008144 #605161] INFO -- : [407/885] 646015=test_rdoc_markup_to_html_crossref I, [2024-05-22T10:44:30.284569 #605161] INFO -- : [408/885] 646015=test_div I, [2024-05-22T10:44:30.285744 #605161] INFO -- : [409/885] 646015=test_files_test_2 I, [2024-05-22T10:44:30.825908 #605161] INFO -- : [410/885] 646014=test_bash_completion I, [2024-05-22T10:44:30.853426 #605161] INFO -- : [411/885] 646014=test_exception I, [2024-05-22T10:44:33.002797 #605161] INFO -- : [412/885] 646015=test_optparse I, [2024-05-22T10:44:33.064993 #605161] INFO -- : [413/885] 646015=test_rdoc_context_section I, [2024-05-22T10:44:33.074801 #605161] INFO -- : [414/885] 646015=test_io_buffer I, [2024-05-22T10:44:33.188716 #605161] INFO -- : [415/885] 646015=test_deprecated I, [2024-05-22T10:44:33.199686 #605161] INFO -- : [416/885] 646015=test_ns_spki I, [2024-05-22T10:44:33.208580 #605161] INFO -- : [417/885] 646015=test_stream I, [2024-05-22T10:44:33.547398 #605161] INFO -- : [418/885] 646015=test_have_library I, [2024-05-22T10:44:34.152575 #605161] INFO -- : [419/885] 646014=test_rdoc_markup_indented_paragraph I, [2024-05-22T10:44:34.164799 #605161] INFO -- : [420/885] 646014=test_rdoc_markup_parser I, [2024-05-22T10:44:34.196767 #605161] INFO -- : [421/885] 646015=test_iseq_load I, [2024-05-22T10:44:34.235706 #605161] INFO -- : [422/885] 646014=library_symbols_test I, [2024-05-22T10:44:34.242728 #605161] INFO -- : [423/885] 646014=test_rdoc_text I, [2024-05-22T10:44:34.444478 #605161] INFO -- : [424/885] 646014=test_objspace I, [2024-05-22T10:44:35.332983 #605161] INFO -- : [425/885] 646015=test_stringify_symbols I, [2024-05-22T10:44:35.337679 #605161] INFO -- : [426/885] 646015=test_require I, [2024-05-22T10:44:35.402090 #605161] INFO -- : [427/885] 646015=test_common I, [2024-05-22T10:44:35.568667 #605161] INFO -- : [428/885] 646015=test_rdoc_markup_to_html_snippet I, [2024-05-22T10:44:35.652642 #605161] INFO -- : [429/885] 646015=test_generic I, [2024-05-22T10:44:35.686632 #605161] INFO -- : [430/885] 646015=test_deprecate I, [2024-05-22T10:44:35.733391 #605161] INFO -- : [431/885] 646015=test_rdoc_constant I, [2024-05-22T10:44:35.855158 #605161] INFO -- : [432/885] 646015=test_httpresponses I, [2024-05-22T10:44:35.872589 #605161] INFO -- : [433/885] 646015=test_gem_request_set_lockfile I, [2024-05-22T10:44:36.328992 #605161] INFO -- : [434/885] 646015=test_rdoc_markdown I, [2024-05-22T10:44:36.599207 #605161] INFO -- : [435/885] 646015=test_key_actor_vi I, [2024-05-22T10:44:36.732898 #605161] INFO -- : [436/885] 646015=test_postponed_job I, [2024-05-22T10:44:37.003946 #605161] INFO -- : [437/885] 646015=test_win32ole_variant_outarg I, [2024-05-22T10:44:37.012720 #605161] INFO -- : [438/885] 646015=test_rdoc_encoding I, [2024-05-22T10:44:37.062249 #605161] INFO -- : [439/885] 646015=test_bmethod I, [2024-05-22T10:44:37.064437 #605161] INFO -- : [440/885] 646015=test_provider I, [2024-05-22T10:44:37.074181 #605161] INFO -- : [441/885] 646015=test_euc_kr I, [2024-05-22T10:44:37.091419 #605161] INFO -- : [442/885] 646015=test_gem_source_specific_file I, [2024-05-22T10:44:37.115141 #605161] INFO -- : [443/885] 646016=test_process I, [2024-05-22T10:44:37.198912 #605161] INFO -- : [444/885] 646015=test_rdoc_code_object I, [2024-05-22T10:44:37.525667 #605161] INFO -- : [445/885] 646015=test_rdoc_markup_attributes I, [2024-05-22T10:44:37.582329 #605161] INFO -- : [446/885] 646015=test_rand I, [2024-05-22T10:44:37.926980 #605161] INFO -- : [447/885] 646015=test_random_formatter I, [2024-05-22T10:44:37.945459 #605161] INFO -- : [448/885] 646015=test_string_processing I, [2024-05-22T10:44:37.954221 #605161] INFO -- : [449/885] 646015=redundant_return_test I, [2024-05-22T10:44:37.963880 #605161] INFO -- : [450/885] 646015=parameters_signature_test I, [2024-05-22T10:44:37.975508 #605161] INFO -- : [451/885] 646015=test_rdoc_parser_changelog I, [2024-05-22T10:44:38.069220 #605161] INFO -- : [452/885] 646015=test_gem_commands_outdated_command I, [2024-05-22T10:44:38.136705 #605161] INFO -- : [453/885] 646015=test_gem_dependency_list I, [2024-05-22T10:44:38.214359 #605161] INFO -- : [454/885] 646015=test_securerandom I, [2024-05-22T10:44:38.232396 #605161] INFO -- : [455/885] 646015=test_tsort I, [2024-05-22T10:44:38.246869 #605161] INFO -- : [456/885] 646015=test_gem_commands_fetch_command I, [2024-05-22T10:44:38.423952 #605161] INFO -- : [457/885] 646015=test_typeddata I, [2024-05-22T10:44:38.724643 #605161] INFO -- : [458/885] 646015=parse_test I, [2024-05-22T10:44:41.614581 #605161] INFO -- : [459/885] 646015=test_kwargs I, [2024-05-22T10:44:41.629103 #605161] INFO -- : [460/885] 646015=test_rdoc_parser_c I, [2024-05-22T10:44:41.984337 #605161] INFO -- : [461/885] 646015=test_io_wait I, [2024-05-22T10:44:42.236710 #605161] INFO -- : Leaked file descriptor: TestProcess#test_uid_from_name: 10 # I, [2024-05-22T10:44:42.236802 #605161] INFO -- : Leaked file descriptor: TestProcess#test_uid_from_name: 11 # I, [2024-05-22T10:44:42.268554 #605161] INFO -- : COMMAND PID USER FD TYPE DEVICE SIZE/OFF NODE NAME I, [2024-05-22T10:44:42.268629 #605161] INFO -- : ruby 646016 opc 10r REG 252,0 9253600 13705411 /var/lib/sss/mc/passwd I, [2024-05-22T10:44:42.268641 #605161] INFO -- : ruby 646016 opc 11u unix 0x0000000000000000 0t0 3092969893 type=STREAM I, [2024-05-22T10:44:42.328769 #605161] INFO -- : [462/885] 646015=test_pack I, [2024-05-22T10:44:42.721432 #605161] INFO -- : [463/885] 646015=test_len I, [2024-05-22T10:44:42.743238 #605161] INFO -- : [464/885] 646015=test_gem_doctor I, [2024-05-22T10:44:42.802639 #605161] INFO -- : [465/885] 646015=json_fixtures_test I, [2024-05-22T10:44:42.820331 #605161] INFO -- : [466/885] 646015=test_gem_bundler_version_finder I, [2024-05-22T10:44:42.867192 #605161] INFO -- : [467/885] 646015=test_gem_request_set I, [2024-05-22T10:44:43.439763 #605161] INFO -- : [468/885] 646015=test_gc I, [2024-05-22T10:44:52.857317 #605161] INFO -- : [469/885] 646015=test_pattern_matching I, [2024-05-22T10:44:52.899508 #605161] INFO -- : [470/885] 646015=test_interned_str I, [2024-05-22T10:44:52.906654 #605161] INFO -- : [471/885] 646015=test_set_len I, [2024-05-22T10:44:52.913936 #605161] INFO -- : [472/885] 646015=constant_path_node_test I, [2024-05-22T10:44:52.919041 #605161] INFO -- : [473/885] 646015=test_folderitem2_invokeverb I, [2024-05-22T10:44:52.919380 #605161] INFO -- : [474/885] 646015=test_sleep I, [2024-05-22T10:44:55.338256 #605161] INFO -- : [475/885] 646016=test_webauthn_listener_response I, [2024-05-22T10:44:55.400138 #605161] INFO -- : [476/885] 646016=test_gem_resolver_index_set I, [2024-05-22T10:44:55.445469 #605161] INFO -- : [477/885] 646016=ruby_api_test I, [2024-05-22T10:44:55.589946 #605161] INFO -- : [478/885] 646016=test_time I, [2024-05-22T10:44:55.831320 #605161] INFO -- : [479/885] 646016=test_popen_deadlock I, [2024-05-22T10:44:56.346494 #605161] INFO -- : [480/885] 646016=test_alias_and_anchor I, [2024-05-22T10:44:56.352524 #605161] INFO -- : [481/885] 646016=test_euc_jp I, [2024-05-22T10:44:56.356959 #605161] INFO -- : [482/885] 646016=test_rdoc_markup I, [2024-05-22T10:44:56.367781 #605161] INFO -- : [483/885] 646016=test_key_stroke I, [2024-05-22T10:44:56.420385 #605161] INFO -- : [484/885] 646016=test_ensured I, [2024-05-22T10:44:56.425378 #605161] INFO -- : [485/885] 646016=test_chilled I, [2024-05-22T10:44:56.436847 #605161] INFO -- : [486/885] 646016=test_delegate I, [2024-05-22T10:44:56.457451 #605161] INFO -- : [487/885] 646016=location_test I, [2024-05-22T10:44:56.544086 #605161] INFO -- : [488/885] 646016=test_project_sanity I, [2024-05-22T10:44:56.550241 #605161] INFO -- : [489/885] 646016=test_symbol I, [2024-05-22T10:44:56.557058 #605161] INFO -- : [490/885] 646016=test_ellipsize I, [2024-05-22T10:44:56.578491 #605161] INFO -- : [491/885] 646016=test_call I, [2024-05-22T10:44:56.783993 #605161] INFO -- : [492/885] 646016=test_gem_commands_build_command I, [2024-05-22T10:44:57.240449 #605161] INFO -- : [493/885] 646016=test_reline I, [2024-05-22T10:44:57.925002 #605161] INFO -- : [494/885] 646016=test_to_ary_concat I, [2024-05-22T10:44:57.935243 #605161] INFO -- : [495/885] 646015=test_history I, [2024-05-22T10:44:57.953206 #605161] INFO -- : [496/885] 646015=test_gem_ext_builder I, [2024-05-22T10:44:59.010330 #605161] INFO -- : [497/885] 646015=test_windows_1251 I, [2024-05-22T10:44:59.021260 #605161] INFO -- : [498/885] 646015=test_to_ruby I, [2024-05-22T10:44:59.040455 #605161] INFO -- : [499/885] 646015=test_addrinfo I, [2024-05-22T10:44:59.076703 #605161] INFO -- : Leaked file descriptor: TestSocketAddrinfo#test_addrinfo_timeout: 10 # I, [2024-05-22T10:44:59.108870 #605161] INFO -- : COMMAND PID USER FD TYPE DEVICE SIZE/OFF NODE NAME I, [2024-05-22T10:44:59.108945 #605161] INFO -- : ruby 646015 opc 10u unix 0x0000000000000000 0t0 3092975150 type=STREAM I, [2024-05-22T10:44:59.187059 #605161] INFO -- : [500/885] 646015=test_time_tz I, [2024-05-22T10:44:59.265602 #605161] INFO -- : [501/885] 646015=test_thread I, [2024-05-22T10:45:00.051293 #605161] INFO -- : [502/885] 646016=test_inlinecache I, [2024-05-22T10:45:00.105739 #605161] INFO -- : [503/885] 646016=test_terminfo I, [2024-05-22T10:45:00.117390 #605161] INFO -- : [504/885] 646016=test_socket I, [2024-05-22T10:45:01.103186 #605161] INFO -- : [505/885] 646016=test_bug-14834 I, [2024-05-22T10:45:01.108032 #605161] INFO -- : [506/885] 646016=test_data I, [2024-05-22T10:45:01.170818 #605161] INFO -- : [507/885] 646016=test_gem_commands_help_command I, [2024-05-22T10:45:01.367412 #605161] INFO -- : [508/885] 646016=test_scheduler I, [2024-05-22T10:45:01.413204 #605161] INFO -- : [509/885] 646016=test_ssl I, [2024-05-22T10:45:01.583599 #605161] INFO -- : [510/885] 646016=test_ractor I, [2024-05-22T10:45:01.890326 #605161] INFO -- : [511/885] 646016=test_gem_resolver_conflict I, [2024-05-22T10:45:01.904005 #605161] INFO -- : [512/885] 646016=test_ancdata I, [2024-05-22T10:45:01.966060 #605161] INFO -- : [513/885] 646016=ractor_test I, [2024-05-22T10:45:01.980099 #605161] INFO -- : [514/885] 646016=test_marshal I, [2024-05-22T10:45:03.051570 #605161] INFO -- : [515/885] 646016=test_nesting_parser I, [2024-05-22T10:45:03.069300 #605161] INFO -- : [516/885] 646016=test_rdoc_markup_hard_break I, [2024-05-22T10:45:03.078154 #605161] INFO -- : [517/885] 646016=test_bignum I, [2024-05-22T10:45:06.660661 #605161] INFO -- : [518/885] 646016=newline_test I, [2024-05-22T10:45:06.783917 #605161] INFO -- : [519/885] 646016=test_enc_str_buf_cat I, [2024-05-22T10:45:06.796185 #605161] INFO -- : [520/885] 646016=test_cgi_core I, [2024-05-22T10:45:06.807816 #605161] INFO -- : [521/885] 646016=test_gem_resolver_best_set I, [2024-05-22T10:45:06.887268 #605161] INFO -- : [522/885] 646016=test_rdoc_markup_to_label I, [2024-05-22T10:45:06.933044 #605161] INFO -- : [523/885] 646016=test_parser I, [2024-05-22T10:45:06.947602 #605161] INFO -- : [524/885] 646016=test_ractor I, [2024-05-22T10:45:06.985112 #605161] INFO -- : [525/885] 646016=json_generator_test I, [2024-05-22T10:45:07.058219 #605161] INFO -- : [526/885] 646016=test_ansi_without_terminfo I, [2024-05-22T10:45:07.067968 #605161] INFO -- : [527/885] 646016=test_registry I, [2024-05-22T10:45:07.089874 #605161] INFO -- : [528/885] 646016=test_gem I, [2024-05-22T10:45:08.147715 #605161] INFO -- : [529/885] 646015=test_ts I, [2024-05-22T10:45:08.423400 #605161] INFO -- : [530/885] 646015=test_locale I, [2024-05-22T10:45:08.440654 #605161] INFO -- : [531/885] 646015=test_rdoc_attr I, [2024-05-22T10:45:08.467635 #605161] INFO -- : [532/885] 646015=test_address_resolve I, [2024-05-22T10:45:08.483676 #605161] INFO -- : [533/885] 646015=test_stream I, [2024-05-22T10:45:08.513535 #605161] INFO -- : [534/885] 646015=test_ractor I, [2024-05-22T10:45:08.554525 #605161] INFO -- : [535/885] 646015=test_trick I, [2024-05-22T10:45:09.318918 #605161] INFO -- : [536/885] 646016=test_require I, [2024-05-22T10:45:09.484055 #605161] INFO -- : [537/885] 646014=test_recursion I, [2024-05-22T10:45:09.489933 #605161] INFO -- : [538/885] 646014=test_rdoc_markup_include I, [2024-05-22T10:45:09.505520 #605161] INFO -- : [539/885] 646014=test_enum I, [2024-05-22T10:45:10.446218 #605161] INFO -- : [540/885] 646014=test_extlibs I, [2024-05-22T10:45:10.513922 #605161] INFO -- : [541/885] 646016=test_iter_break I, [2024-05-22T10:45:10.528514 #605161] INFO -- : [542/885] 646016=test_range I, [2024-05-22T10:45:11.075325 #605161] INFO -- : [543/885] 646015=test_gem_commands_signin_command I, [2024-05-22T10:45:11.259794 #605161] INFO -- : [544/885] 646015=test_num2int I, [2024-05-22T10:45:11.303279 #605161] INFO -- : [545/885] 646015=test_rbconfig I, [2024-05-22T10:45:11.313240 #605161] INFO -- : [546/885] 646015=test_integer I, [2024-05-22T10:45:11.360691 #605161] INFO -- : [547/885] 646016=test_unix I, [2024-05-22T10:45:11.412778 #605161] INFO -- : [548/885] 646016=test_formatter I, [2024-05-22T10:45:11.425403 #605161] INFO -- : [549/885] 646016=test_gem_commands_contents_command I, [2024-05-22T10:45:11.541521 #605161] INFO -- : [550/885] 646016=test_context I, [2024-05-22T10:45:11.642731 #605161] INFO -- : [551/885] 646016=test_udp I, [2024-05-22T10:45:11.652210 #605161] INFO -- : [552/885] 646016=test_symbol I, [2024-05-22T10:45:12.060662 #605161] INFO -- : [553/885] 646014=test_gem_commands_search_command I, [2024-05-22T10:45:12.072281 #605161] INFO -- : [554/885] 646014=test_rdoc_servlet I, [2024-05-22T10:45:12.181277 #605161] INFO -- : [555/885] 646014=test_coder I, [2024-05-22T10:45:12.209988 #605161] INFO -- : [556/885] 646014=test_gem_resolver_local_specification I, [2024-05-22T10:45:12.238015 #605161] INFO -- : [557/885] 646014=test_configuration I, [2024-05-22T10:45:12.336671 #605161] INFO -- : [558/885] 646014=test_date_new I, [2024-05-22T10:45:12.355466 #605161] INFO -- : [559/885] 646014=test_gem_commands_list_command I, [2024-05-22T10:45:12.459973 #605161] INFO -- : [560/885] 646014=test_have_func I, [2024-05-22T10:45:13.616936 #605161] INFO -- : [561/885] 646014=test_date_marshal I, [2024-05-22T10:45:13.624790 #605161] INFO -- : [562/885] 646014=test_emitter I, [2024-05-22T10:45:13.645658 #605161] INFO -- : [563/885] 646014=test_fips I, [2024-05-22T10:45:13.778989 #605161] INFO -- : [564/885] 646015=test_alias I, [2024-05-22T10:45:13.912642 #605161] INFO -- : [565/885] 646014=test_getopts I, [2024-05-22T10:45:13.918037 #605161] INFO -- : [566/885] 646014=test_last_thread I, [2024-05-22T10:45:13.931000 #605161] INFO -- : [567/885] 646015=test_thread_fd_close I, [2024-05-22T10:45:13.956102 #605161] INFO -- : [568/885] 646015=test_gem_ext_cmake_builder I, [2024-05-22T10:45:13.968059 #605161] INFO -- : [569/885] 646015=test_digest_extend I, [2024-05-22T10:45:13.993177 #605161] INFO -- : [570/885] 646015=test_rdoc_markup_formatter I, [2024-05-22T10:45:14.072833 #605161] INFO -- : [571/885] 646015=test_gem_commands_uninstall_command I, [2024-05-22T10:45:14.757156 #605161] INFO -- : [572/885] 646015=test_win32ole_event I, [2024-05-22T10:45:14.757385 #605161] INFO -- : [573/885] 646015=test_helper I, [2024-05-22T10:45:14.781118 #605161] INFO -- : [574/885] 646015=test_compile_prism I, [2024-05-22T10:45:14.982162 #605161] INFO -- : [575/885] 646014=test_flip I, [2024-05-22T10:45:15.022691 #605161] INFO -- : [576/885] 646014=test_io_console I, [2024-05-22T10:45:15.107523 #605161] INFO -- : [577/885] 646015=test_rdoc_markup_heading I, [2024-05-22T10:45:15.129738 #605161] INFO -- : [578/885] 646015=test_x509crl I, [2024-05-22T10:45:15.224329 #605161] INFO -- : [579/885] 646015=test_dns I, [2024-05-22T10:45:15.682456 #605161] INFO -- : [580/885] 646015=test_cgi_session I, [2024-05-22T10:45:15.699506 #605161] INFO -- : [581/885] 646015=test_notimplement I, [2024-05-22T10:45:15.736820 #605161] INFO -- : [582/885] 646015=test_c_union_entity I, [2024-05-22T10:45:15.932419 #605161] INFO -- : [583/885] 646015=test_class2name I, [2024-05-22T10:45:15.943465 #605161] INFO -- : [584/885] 646015=test_gem_commands_cleanup_command I, [2024-05-22T10:45:16.105518 #605161] INFO -- : [585/885] 646016=test_debug I, [2024-05-22T10:45:16.116849 #605161] INFO -- : [586/885] 646016=test_transcode I, [2024-05-22T10:45:16.392700 #605161] INFO -- : [587/885] 646016=test_refinement I, [2024-05-22T10:45:16.480967 #605161] INFO -- : [588/885] 646015=test_profile_frames I, [2024-05-22T10:45:16.666248 #605161] INFO -- : [589/885] 646015=test_pattern_key_name_check I, [2024-05-22T10:45:16.674383 #605161] INFO -- : [590/885] 646015=test_x509req I, [2024-05-22T10:45:16.713317 #605161] INFO -- : [591/885] 646015=test_rdoc_parser_ruby I, [2024-05-22T10:45:17.705589 #605161] INFO -- : [592/885] 646014=test_httpresponse I, [2024-05-22T10:45:17.744359 #605161] INFO -- : [593/885] 646014=test_readpartial I, [2024-05-22T10:45:18.152298 #605161] INFO -- : [594/885] 646014=test_insns_leaf I, [2024-05-22T10:45:18.159925 #605161] INFO -- : [595/885] 646014=test_gem_console_ui I, [2024-05-22T10:45:18.167256 #605161] INFO -- : [596/885] 646015=test_ifunless I, [2024-05-22T10:45:18.168177 #605161] INFO -- : [597/885] 646014=test_allocation I, [2024-05-22T10:45:18.181971 #605161] INFO -- : [598/885] 646015=json_encoding_test I, [2024-05-22T10:45:18.185860 #605161] INFO -- : [599/885] 646015=test_vm_dump I, [2024-05-22T10:45:18.196825 #605161] INFO -- : [600/885] 646015=test_config I, [2024-05-22T10:45:18.305992 #605161] INFO -- : [601/885] 646015=test_func I, [2024-05-22T10:45:19.961753 #605161] INFO -- : [602/885] 646016=test_convertible I, [2024-05-22T10:45:20.712888 #605161] INFO -- : [603/885] 646014=errors_test I, [2024-05-22T10:45:20.788171 #605161] INFO -- : [604/885] 646014=test_modify_expand I, [2024-05-22T10:45:20.796906 #605161] INFO -- : [605/885] 646014=test_pkg_config I, [2024-05-22T10:45:20.813874 #605161] INFO -- : [606/885] 646014=test_gem_available_set I, [2024-05-22T10:45:20.913095 #605161] INFO -- : [607/885] 646014=test_color_printer I, [2024-05-22T10:45:20.952614 #605161] INFO -- : [608/885] 646014=test_super I, [2024-05-22T10:45:22.327834 #605161] INFO -- : [609/885] 646014=test_gem_commands_exec_command I, [2024-05-22T10:45:23.677944 #605161] INFO -- : [610/885] 646016=unescape_test I, [2024-05-22T10:45:23.731498 #605161] INFO -- : [611/885] 646014=test_dln I, [2024-05-22T10:45:23.756764 #605161] INFO -- : [612/885] 646014=test_object I, [2024-05-22T10:45:23.761669 #605161] INFO -- : [613/885] 646015=test_gem_resolver I, [2024-05-22T10:45:24.047361 #605161] INFO -- : [614/885] 646015=test_gem_source_vendor I, [2024-05-22T10:45:24.073364 #605161] INFO -- : [615/885] 646015=test_gem_source_subpath_problem I, [2024-05-22T10:45:24.083245 #605161] INFO -- : [616/885] 646014=test_object_references I, [2024-05-22T10:45:24.096465 #605161] INFO -- : [617/885] 646014=test_ruby_lex I, [2024-05-22T10:45:24.178558 #605161] INFO -- : [618/885] 646015=compiler_test I, [2024-05-22T10:45:24.210423 #605161] INFO -- : [619/885] 646015=test_arith_seq_extract I, [2024-05-22T10:45:24.218242 #605161] INFO -- : [620/885] 646014=test_buffered_io I, [2024-05-22T10:45:24.243825 #605161] INFO -- : [621/885] 646014=test_ossl I, [2024-05-22T10:45:24.352696 #605161] INFO -- : [622/885] 646015=test_gem_installer I, [2024-05-22T10:45:25.069061 #605161] INFO -- : [623/885] 646016=test_bug_reporter I, [2024-05-22T10:45:25.224994 #605161] INFO -- : [624/885] 646016=test_pointer I, [2024-05-22T10:45:26.733333 #605161] INFO -- : [625/885] 646016=test_within_pipe I, [2024-05-22T10:45:26.762073 #605161] INFO -- : [626/885] 646016=test_rdoc_normal_class I, [2024-05-22T10:45:26.808172 #605161] INFO -- : [627/885] 646016=test_nofree I, [2024-05-22T10:45:26.833678 #605161] INFO -- : [628/885] 646016=test_regexp I, [2024-05-22T10:45:29.393594 #605161] INFO -- : [629/885] 646015=test_whileuntil I, [2024-05-22T10:45:29.409028 #605161] INFO -- : [630/885] 646015=test_eval I, [2024-05-22T10:45:29.672432 #605161] INFO -- : [631/885] 646015=test_beginendblock I, [2024-05-22T10:45:30.009482 #605161] INFO -- : [632/885] 646015=test_monitor I, [2024-05-22T10:45:30.228577 #605161] INFO -- : [633/885] 646015=test_case_options I, [2024-05-22T10:45:30.237970 #605161] INFO -- : [634/885] 646015=format_errors_test I, [2024-05-22T10:45:30.249019 #605161] INFO -- : [635/885] 646015=test_cgi_header I, [2024-05-22T10:45:30.259958 #605161] INFO -- : [636/885] 646015=test_member I, [2024-05-22T10:45:30.268733 #605161] INFO -- : [637/885] 646015=test_object I, [2024-05-22T10:45:30.279329 #605161] INFO -- : [638/885] 646015=test_mailto I, [2024-05-22T10:45:30.290816 #605161] INFO -- : [639/885] 646015=test_addr I, [2024-05-22T10:45:30.305443 #605161] INFO -- : [640/885] 646015=test_kill_ring I, [2024-05-22T10:45:30.382730 #605161] INFO -- : [641/885] 646015=test_duplicate I, [2024-05-22T10:45:30.397380 #605161] INFO -- : [642/885] 646015=test_gem_resolver_api_set I, [2024-05-22T10:45:30.458691 #605161] INFO -- : [643/885] 646015=test_helper I, [2024-05-22T10:45:30.466951 #605161] INFO -- : [644/885] 646015=test_append I, [2024-05-22T10:45:30.489321 #605161] INFO -- : [645/885] 646015=test_gem_resolver_installer_set I, [2024-05-22T10:45:30.724996 #605161] INFO -- : [646/885] 646015=test_rdoc_markup_to_html I, [2024-05-22T10:45:30.810987 #605161] INFO -- : [647/885] 646015=test_foreach I, [2024-05-22T10:45:30.822177 #605161] INFO -- : [648/885] 646015=bom_test I, [2024-05-22T10:45:30.914122 #605161] INFO -- : [649/885] 646015=test_config I, [2024-05-22T10:45:31.248705 #605161] INFO -- : [650/885] 646015=test_file I, [2024-05-22T10:45:31.980343 #605161] INFO -- : [651/885] 646014=test_summary I, [2024-05-22T10:45:32.036394 #605161] INFO -- : [652/885] 646014=test_helper_method I, [2024-05-22T10:45:32.061084 #605161] INFO -- : [653/885] 646014=test_x509ext I, [2024-05-22T10:45:32.070886 #605161] INFO -- : [654/885] 646014=test_emitter I, [2024-05-22T10:45:32.080028 #605161] INFO -- : [655/885] 646014=test_lambda I, [2024-05-22T10:45:32.139298 #605161] INFO -- : [656/885] 646014=test_rb_str_dup I, [2024-05-22T10:45:32.152775 #605161] INFO -- : [657/885] 646014=test_scalar_scanner I, [2024-05-22T10:45:32.197119 #605161] INFO -- : [658/885] 646014=test_keyword I, [2024-05-22T10:45:32.685926 #605161] INFO -- : [659/885] 646014=test_win32ole_type_event I, [2024-05-22T10:45:32.691690 #605161] INFO -- : [660/885] 646014=test_arity I, [2024-05-22T10:45:32.703001 #605161] INFO -- : [661/885] 646014=test_gem_path_support I, [2024-05-22T10:45:32.742466 #605161] INFO -- : [662/885] 646014=test_trace I, [2024-05-22T10:45:32.752237 #605161] INFO -- : [663/885] 646014=test_unicode I, [2024-05-22T10:45:32.769253 #605161] INFO -- : [664/885] 646014=dispatcher_test I, [2024-05-22T10:45:32.790165 #605161] INFO -- : [665/885] 646014=test_eval_history I, [2024-05-22T10:45:32.795968 #605161] INFO -- : [666/885] 646014=test_random I, [2024-05-22T10:45:32.806182 #605161] INFO -- : [667/885] 646014=test_files_ext I, [2024-05-22T10:45:32.912039 #605161] INFO -- : [668/885] 646014=test_thread_cv I, [2024-05-22T10:45:33.441979 #605161] INFO -- : [669/885] 646014=test_assembler I, [2024-05-22T10:45:33.458481 #605161] INFO -- : [670/885] 646014=test_stringio I, [2024-05-22T10:45:33.619293 #605161] INFO -- : [671/885] 646014=test_ripper I, [2024-05-22T10:45:33.976965 #605161] INFO -- : [672/885] 646014=test_gem_source_git I, [2024-05-22T10:45:34.929263 #605161] INFO -- : [673/885] 646014=test_regex_casefold I, [2024-05-22T10:45:35.328531 #605161] INFO -- : [674/885] 646014=test_win32ole_method I, [2024-05-22T10:45:35.337903 #605161] INFO -- : [675/885] 646014=test_lexer I, [2024-05-22T10:45:35.352366 #605161] INFO -- : [676/885] 646014=test_class I, [2024-05-22T10:45:35.360587 #605161] INFO -- : [677/885] 646014=test_mkmf I, [2024-05-22T10:45:35.391192 #605161] INFO -- : [678/885] 646014=test_gem_source I, [2024-05-22T10:45:35.787218 #605161] INFO -- : [679/885] 646014=test_have_macro I, [2024-05-22T10:45:35.992218 #605161] INFO -- : [680/885] 646014=test_at_exit I, [2024-05-22T10:45:36.001029 #605161] INFO -- : [681/885] 646014=test_benchmark I, [2024-05-22T10:45:37.500200 #605161] INFO -- : [682/885] 646015=test_array I, [2024-05-22T10:45:37.649085 #605161] INFO -- : [683/885] 646014=test_gem_package I, [2024-05-22T10:45:38.447084 #605161] INFO -- : [684/885] 646014=test_autoload I, [2024-05-22T10:45:42.905527 #605161] INFO -- : [685/885] 646014=test_encoding I, [2024-05-22T10:45:42.926380 #605161] INFO -- : [686/885] 646014=test_install I, [2024-05-22T10:45:43.142819 #605161] INFO -- : [687/885] 646014=test_rdoc_comment I, [2024-05-22T10:45:43.190444 #605161] INFO -- : [688/885] 646014=test_gem_source_fetch_problem I, [2024-05-22T10:45:43.208221 #605161] INFO -- : [689/885] 646014=test_sockopt I, [2024-05-22T10:45:43.216441 #605161] INFO -- : [690/885] 646014=test_ftp I, [2024-05-22T10:45:43.225830 #605161] INFO -- : [691/885] 646014=test_find_executable I, [2024-05-22T10:45:43.237564 #605161] INFO -- : [692/885] 646014=test_arithmetic_sequence I, [2024-05-22T10:45:43.321272 #605161] INFO -- : [693/885] 646014=test_ractor_compatibility I, [2024-05-22T10:45:43.657442 #605161] INFO -- : [694/885] 646014=test_autoconf I, [2024-05-22T10:45:43.665746 #605161] INFO -- : [695/885] 646014=integer_parse_test I, [2024-05-22T10:45:43.678908 #605161] INFO -- : [696/885] 646014=test_gem_request_set_lockfile_tokenizer I, [2024-05-22T10:45:43.754665 #605161] INFO -- : [697/885] 646014=test_cgi_multipart I, [2024-05-22T10:45:43.912982 #605161] INFO -- : [698/885] 646014=test_lazy_enumerator I, [2024-05-22T10:45:44.394673 #605161] INFO -- : [699/885] 646014=test_parser I, [2024-05-22T10:45:44.415309 #605161] INFO -- : [700/885] 646014=test_rdoc_ri_paths I, [2024-05-22T10:45:44.459392 #605161] INFO -- : [701/885] 646014=test_primitive I, [2024-05-22T10:45:44.478680 #605161] INFO -- : [702/885] 646014=test_iseq I, [2024-05-22T10:45:45.072519 #605161] INFO -- : [703/885] 646014=test_singleton_function I, [2024-05-22T10:45:45.084715 #605161] INFO -- : [704/885] 646014=test_gem_safe_yaml I, [2024-05-22T10:45:45.093424 #605161] INFO -- : [705/885] 646014=test_eval I, [2024-05-22T10:45:45.100233 #605161] INFO -- : [706/885] 646014=test_document I, [2024-05-22T10:45:45.115656 #605161] INFO -- : [707/885] 646014=test_history I, [2024-05-22T10:45:45.187404 #605161] INFO -- : [708/885] 646014=test_gem_commands_setup_command I, [2024-05-22T10:45:46.196675 #605161] INFO -- : [709/885] 646014=test_pair I, [2024-05-22T10:45:51.328820 #605161] INFO -- : [710/885] 646014=test_win32ole_variant_m I, [2024-05-22T10:45:51.343611 #605161] INFO -- : [711/885] 646014=test_env I, [2024-05-22T10:45:52.783784 #605161] INFO -- : [712/885] 646015=test_gem_package_tar_reader I, [2024-05-22T10:45:52.852625 #605161] INFO -- : [713/885] 646015=test_gem_commands_signout_command I, [2024-05-22T10:45:52.872143 #605161] INFO -- : [714/885] 646015=command_line_test I, [2024-05-22T10:45:52.882532 #605161] INFO -- : [715/885] 646015=test_uncorrectable_name_check I, [2024-05-22T10:45:52.920848 #605161] INFO -- : [716/885] 646015=test_io I, [2024-05-22T10:45:53.911979 #605161] INFO -- : [717/885] 646014=test_rdoc_rd_inline I, [2024-05-22T10:45:53.928607 #605161] INFO -- : [718/885] 646014=test_path I, [2024-05-22T10:45:53.936834 #605161] INFO -- : [719/885] 646014=test_digest I, [2024-05-22T10:45:53.991907 #605161] INFO -- : [720/885] 646014=test_closure I, [2024-05-22T10:45:54.560239 #605161] INFO -- : [721/885] 646016=test_resolve_symbol I, [2024-05-22T10:45:54.610020 #605161] INFO -- : [722/885] 646016=test_rubygems I, [2024-05-22T10:45:54.779347 #605161] INFO -- : [723/885] 646016=test_dir I, [2024-05-22T10:45:55.032455 #605161] INFO -- : [724/885] 646016=test_files_test_1 I, [2024-05-22T10:45:55.036734 #605161] INFO -- : [725/885] 646016=test_stat I, [2024-05-22T10:45:55.043058 #605161] INFO -- : [726/885] 646016=test_nomethod_error I, [2024-05-22T10:45:55.131535 #605161] INFO -- : [727/885] 646016=test_gem_commands_rebuild_command I, [2024-05-22T10:45:55.143145 #605161] INFO -- : [728/885] 646016=test_etc I, [2024-05-22T10:45:55.231785 #605161] INFO -- : [729/885] 646016=test_https_proxy I, [2024-05-22T10:45:55.240648 #605161] INFO -- : [730/885] 646016=test_rdoc_parser I, [2024-05-22T10:45:55.259639 #605161] INFO -- : [731/885] 646016=test_win32ole_param_event I, [2024-05-22T10:45:55.264557 #605161] INFO -- : [732/885] 646016=test_win32ole_variant I, [2024-05-22T10:45:55.271207 #605161] INFO -- : [733/885] 646016=magic_comment_test I, [2024-05-22T10:45:55.278534 #605161] INFO -- : [734/885] 646016=test_cgi_modruby I, [2024-05-22T10:45:55.375069 #605161] INFO -- : [735/885] 646016=test_workspace I, [2024-05-22T10:45:55.408863 #605161] INFO -- : [736/885] 646016=test_printf I, [2024-05-22T10:45:55.416354 #605161] INFO -- : [737/885] 646016=test_x509attr I, [2024-05-22T10:45:55.425026 #605161] INFO -- : [738/885] 646016=test_rdoc_parser_simple I, [2024-05-22T10:45:55.440401 #605161] INFO -- : [739/885] 646016=test_nonblock I, [2024-05-22T10:45:55.456555 #605161] INFO -- : [740/885] 646016=test_gem_ext_configure_builder I, [2024-05-22T10:45:55.503529 #605161] INFO -- : [741/885] 646016=json_ext_parser_test I, [2024-05-22T10:45:55.511689 #605161] INFO -- : [742/885] 646016=test_rdoc_generator_pot_po I, [2024-05-22T10:45:55.520267 #605161] INFO -- : [743/885] 646016=test_mul I, [2024-05-22T10:45:55.526257 #605161] INFO -- : [744/885] 646016=test_shellwords I, [2024-05-22T10:45:55.538563 #605161] INFO -- : [745/885] 646016=test_date_strptime I, [2024-05-22T10:45:55.707834 #605161] INFO -- : [746/885] 646016=test_omap I, [2024-05-22T10:45:55.736649 #605161] INFO -- : [747/885] 646016=test_ocsp I, [2024-05-22T10:45:55.870902 #605161] INFO -- : [748/885] 646016=test_scanner_events I, [2024-05-22T10:45:55.911022 #605161] INFO -- : [749/885] 646016=test_ipaddr I, [2024-05-22T10:45:55.939144 #605161] INFO -- : [750/885] 646016=test_gem_stream_ui I, [2024-05-22T10:45:56.046360 #605161] INFO -- : [751/885] 646016=test_rdoc_generator_ri I, [2024-05-22T10:45:56.093397 #605161] INFO -- : [752/885] 646016=test_unicode_normalize I, [2024-05-22T10:45:56.811549 #605161] INFO -- : [753/885] 646014=test_gem_commands_lock_command I, [2024-05-22T10:45:56.847020 #605161] INFO -- : [754/885] 646014=test_reline_key I, [2024-05-22T10:45:56.852340 #605161] INFO -- : [755/885] 646014=test_propertyputref I, [2024-05-22T10:45:56.859209 #605161] INFO -- : [756/885] 646014=test_gb18030 I, [2024-05-22T10:45:56.866239 #605161] INFO -- : [757/885] 646014=test_color I, [2024-05-22T10:45:56.938881 #605161] INFO -- : [758/885] 646014=test_cmethod I, [2024-05-22T10:45:56.950456 #605161] INFO -- : [759/885] 646014=test_gem_stub_specification I, [2024-05-22T10:45:57.116262 #605161] INFO -- : [760/885] 646014=test_float I, [2024-05-22T10:45:59.141732 #605161] INFO -- : [761/885] 646014=test_io_m17n I, [2024-05-22T10:45:59.972727 #605161] INFO -- : [762/885] 646016=test_rdoc_top_level I, [2024-05-22T10:46:00.274523 #605161] INFO -- : [763/885] 646016=test_engine I, [2024-05-22T10:46:00.436002 #605161] INFO -- : [764/885] 646014=test_gem_commands_mirror I, [2024-05-22T10:46:00.513305 #605161] INFO -- : [765/885] 646014=test_fiber I, [2024-05-22T10:46:00.760246 #605161] INFO -- : [766/885] 646016=test_key_error I, [2024-05-22T10:46:00.766424 #605161] INFO -- : [767/885] 646016=test_win32ole_param I, [2024-05-22T10:46:00.784860 #605161] INFO -- : [768/885] 646016=test_resize I, [2024-05-22T10:46:00.789001 #605161] INFO -- : [769/885] 646016=test_gem_package_task I, [2024-05-22T10:46:00.849431 #605161] INFO -- : [770/885] 646016=test_lock_native_thread I, [2024-05-22T10:46:01.194783 #605161] INFO -- : [771/885] 646016=test_ssl I, [2024-05-22T10:46:05.672240 #605161] INFO -- : [772/885] 646015=test_abi I, [2024-05-22T10:46:05.795910 #605161] INFO -- : [773/885] 646015=test_load I, [2024-05-22T10:46:05.795979 #605161] INFO -- : Leaked file descriptor: TestOptionParserLoad#test_load_nothing: 11 # I, [2024-05-22T10:46:05.829354 #605161] INFO -- : COMMAND PID USER FD TYPE DEVICE SIZE/OFF NODE NAME I, [2024-05-22T10:46:05.829418 #605161] INFO -- : ruby 646015 opc 11r REG 252,0 9253600 13705411 /var/lib/sss/mc/passwd I, [2024-05-22T10:46:05.938073 #605161] INFO -- : [774/885] 646015=test_integer_comb I, [2024-05-22T10:46:06.702728 #605161] INFO -- : [775/885] 646014=test_bundled_ca I, [2024-05-22T10:46:08.357555 #605161] INFO -- : [776/885] 646014=test_usrmarshal I, [2024-05-22T10:46:08.387763 #605161] INFO -- : [777/885] 646015=test_gem_source_installed I, [2024-05-22T10:46:08.413100 #605161] INFO -- : [778/885] 646015=test_gem_validator I, [2024-05-22T10:46:08.440771 #605161] INFO -- : [779/885] 646015=test_gem_security_trust_dir I, [2024-05-22T10:46:08.507081 #605161] INFO -- : [780/885] 646015=test_erb_command I, [2024-05-22T10:46:08.519998 #605161] INFO -- : [781/885] 646014=test_module I, [2024-05-22T10:46:08.530459 #605161] INFO -- : [782/885] 646015=test_change_word I, [2024-05-22T10:46:08.537512 #605161] INFO -- : [783/885] 646015=test_depth_first I, [2024-05-22T10:46:08.553448 #605161] INFO -- : [784/885] 646015=test_ostruct I, [2024-05-22T10:46:08.686469 #605161] INFO -- : [785/885] 646015=test_config I, [2024-05-22T10:46:08.829538 #605161] INFO -- : [786/885] 646015=test_struct I, [2024-05-22T10:46:08.839527 #605161] INFO -- : [787/885] 646015=static_inspect_test I, [2024-05-22T10:46:08.842782 #605161] INFO -- : [788/885] 646015=test_c_struct_entry I, [2024-05-22T10:46:09.888111 #605161] INFO -- : [789/885] 646015=test_rubyvm I, [2024-05-22T10:46:09.904673 #605161] INFO -- : [790/885] 646015=fuzzer_test I, [2024-05-22T10:46:09.927990 #605161] INFO -- : [791/885] 646015=test_cparser I, [2024-05-22T10:46:11.486091 #605161] INFO -- : [792/885] 646014=test_rdoc_parser_markdown I, [2024-05-22T10:46:11.502501 #605161] INFO -- : [793/885] 646014=test_custom_command I, [2024-05-22T10:46:11.504275 #605161] INFO -- : [794/885] 646014=test_load I, [2024-05-22T10:46:11.509756 #605161] INFO -- : [795/885] 646014=test_win32ole_type I, [2024-05-22T10:46:11.516215 #605161] INFO -- : [796/885] 646014=test_rdoc_rd_inline_parser I, [2024-05-22T10:46:11.545012 #605161] INFO -- : [797/885] 646014=test_new I, [2024-05-22T10:46:11.563878 #605161] INFO -- : [798/885] 646014=test_cipher I, [2024-05-22T10:46:11.586427 #605161] INFO -- : [799/885] 646014=test_update I, [2024-05-22T10:46:11.600345 #605161] INFO -- : [800/885] 646014=test_gem_source_lock I, [2024-05-22T10:46:11.629251 #605161] INFO -- : [801/885] 646016=test_option I, [2024-05-22T10:46:11.650971 #605161] INFO -- : [802/885] 646014=test_wss I, [2024-05-22T10:46:11.661815 #605161] INFO -- : [803/885] 646014=test_rdoc_markup_attribute_manager I, [2024-05-22T10:46:11.700271 #605161] INFO -- : [804/885] 646014=test_tracer I, [2024-05-22T10:46:11.702462 #605161] INFO -- : [805/885] 646014=test_cgi_cookie I, [2024-05-22T10:46:11.718705 #605161] INFO -- : [806/885] 646014=test_not I, [2024-05-22T10:46:11.743117 #605161] INFO -- : [807/885] 646014=test_debugger_integration I, [2024-05-22T10:46:11.754423 #605161] INFO -- : [808/885] 646014=test_gem_resolver_composed_set I, [2024-05-22T10:46:11.766833 #605161] INFO -- : [809/885] 646014=test_my_integer I, [2024-05-22T10:46:11.794182 #605161] INFO -- : [810/885] 646014=test_require I, [2024-05-22T10:46:11.831729 #605161] INFO -- : [811/885] 646016=test_objectspace I, [2024-05-22T10:46:12.487290 #605161] INFO -- : [812/885] 646015=test_metaclass I, [2024-05-22T10:46:12.545471 #605161] INFO -- : [813/885] 646015=test_require_lib I, [2024-05-22T10:46:12.805710 #605161] INFO -- : [814/885] 646016=test_gem_gem_runner I, [2024-05-22T10:46:12.879774 #605161] INFO -- : [815/885] 646016=test_rdoc_rd I, [2024-05-22T10:46:12.882984 #605161] INFO -- : [816/885] 646016=test_rdoc_generator_pot I, [2024-05-22T10:46:12.898612 #605161] INFO -- : [817/885] 646016=test_rdoc_markup_to_joined_paragraph I, [2024-05-22T10:46:12.908773 #605161] INFO -- : [818/885] 646016=test_rdoc_markup_to_markdown I, [2024-05-22T10:46:12.946345 #605161] INFO -- : [819/885] 646016=test_rdoc_rd_block_parser I, [2024-05-22T10:46:13.005421 #605161] INFO -- : [820/885] 646016=test_x509store I, [2024-05-22T10:46:13.513083 #605161] INFO -- : [821/885] 646016=test_gem_ci_detector I, [2024-05-22T10:46:13.529517 #605161] INFO -- : [822/885] 646016=test_fixnum I, [2024-05-22T10:46:13.548870 #605161] INFO -- : [823/885] 646016=test_gem_silent_ui I, [2024-05-22T10:46:13.605773 #605161] INFO -- : [824/885] 646016=test_signal I, [2024-05-22T10:46:14.360442 #605161] INFO -- : [825/885] 646014=test_continuation I, [2024-05-22T10:46:14.389968 #605161] INFO -- : [826/885] 646014=test_io_wait_uncommon I, [2024-05-22T10:46:14.410413 #605161] INFO -- : [827/885] 646014=test_handle I, [2024-05-22T10:46:15.384661 #605161] INFO -- : [828/885] 646014=parse_stream_test I, [2024-05-22T10:46:15.396686 #605161] INFO -- : [829/885] 646014=test_gem_security_policy I, [2024-05-22T10:46:15.405334 #605161] INFO -- : [830/885] 646015=test_rdoc_markup_document I, [2024-05-22T10:46:15.424545 #605161] INFO -- : [831/885] 646015=test_delete I, [2024-05-22T10:46:15.439914 #605161] INFO -- : [832/885] 646015=test_file_exhaustive I, [2024-05-22T10:46:15.660659 #605161] INFO -- : [833/885] 646016=test_completion I, [2024-05-22T10:46:15.795104 #605161] INFO -- : [834/885] 646014=test_placearg I, [2024-05-22T10:46:15.854877 #605161] INFO -- : [835/885] 646014=test_rational2 I, [2024-05-22T10:46:15.895818 #605161] INFO -- : [836/885] 646014=test_case_comprehensive I, [2024-05-22T10:46:16.486729 #605161] INFO -- : [837/885] 646016=test_logperiod I, [2024-05-22T10:46:16.551591 #605161] INFO -- : [838/885] 646016=test_ssl_session I, [2024-05-22T10:46:17.371569 #605161] INFO -- : [839/885] 646016=test_gem_package_tar_header I, [2024-05-22T10:46:17.440139 #605161] INFO -- : [840/885] 646016=test_ast I, [2024-05-22T10:46:27.630714 #605161] INFO -- : [841/885] 646015=test_logdevice I, [2024-05-22T10:46:28.712787 #605161] INFO -- : [842/885] 646015=test_require_path_check I, [2024-05-22T10:46:28.826555 #605161] INFO -- : [843/885] 646015=test_variable_name_check I, [2024-05-22T10:46:28.955541 #605161] INFO -- : [844/885] 646015=test_bn I, [2024-05-22T10:46:29.008638 #605161] INFO -- : [845/885] 646015=test_irb I, [2024-05-22T10:46:29.364969 #605161] INFO -- : [846/885] 646015=test_x509cert I, [2024-05-22T10:46:29.457820 #605161] INFO -- : [847/885] 646015=test_rdoc_markup_paragraph I, [2024-05-22T10:46:29.470596 #605161] INFO -- : [848/885] 646015=test_name_error_extension I, [2024-05-22T10:46:29.480683 #605161] INFO -- : [849/885] 646015=test_gem_request_set_gem_dependency_api I, [2024-05-22T10:46:29.749708 #605161] INFO -- : [850/885] 646015=test_gem_commands_info_command I, [2024-05-22T10:46:29.771374 #605161] INFO -- : [851/885] 646015=test_https I, [2024-05-22T10:46:29.956438 #605161] INFO -- : [852/885] 646015=test_object_create_start I, [2024-05-22T10:46:29.992177 #605161] INFO -- : [853/885] 646015=test_rdoc_markup_to_ansi I, [2024-05-22T10:46:30.085095 #605161] INFO -- : [854/885] 646015=test_files_test I, [2024-05-22T10:46:30.091194 #605161] INFO -- : [855/885] 646015=test_weakkeymap I, [2024-05-22T10:46:30.685273 #605161] INFO -- : [856/885] 646015=test_protocol I, [2024-05-22T10:46:31.004353 #605161] INFO -- : [857/885] 646015=test_evaluation I, [2024-05-22T10:46:31.016652 #605161] INFO -- : [858/885] 646015=test_digest I, [2024-05-22T10:46:31.814356 #605161] INFO -- : [859/885] 646015=test_gem_resolver_git_set I, [2024-05-22T10:46:32.428182 #605161] INFO -- : [860/885] 646015=test_gem_commands_check_command I, [2024-05-22T10:46:32.466913 #605161] INFO -- : [861/885] 646015=test_signedness I, [2024-05-22T10:46:34.266330 #605161] INFO -- : [862/885] 646015=test_rdoc_ri_driver I, [2024-05-22T10:46:34.732801 #605161] INFO -- : [863/885] 646015=test_httpheader I, [2024-05-22T10:46:34.764749 #605161] INFO -- : [864/885] 646015=test_sexp I, [2024-05-22T10:46:34.797295 #605161] INFO -- : [865/885] 646015=test_ractor I, [2024-05-22T10:46:34.869759 #605161] INFO -- : [866/885] 646015=test_gem_safe_marshal I, [2024-05-22T10:46:35.574253 #605161] INFO -- : [867/885] 646015=test_gem_resolver_vendor_specification I, [2024-05-22T10:46:35.618762 #605161] INFO -- : [868/885] 646015=test_date_arith I, [2024-05-22T10:46:35.720654 #605161] INFO -- : [869/885] 646015=test_fiddle I, [2024-05-22T10:46:35.946682 #605161] INFO -- : [870/885] 646015=json_generic_object_test I, [2024-05-22T10:46:35.964971 #605161] INFO -- : [871/885] 646015=test_stringscanner I, [2024-05-22T10:46:36.014001 #605161] INFO -- : [872/885] 646015=test_ractor I, [2024-05-22T10:46:36.131413 #605161] INFO -- : [873/885] 646015=test_exception_at_throwing I, [2024-05-22T10:46:36.197292 #605161] INFO -- : [874/885] 646015=test_gem_resolver_installed_specification I, [2024-05-22T10:46:36.210650 #605161] INFO -- : [875/885] 646015=test_struct I, [2024-05-22T10:46:36.800444 #605161] INFO -- : [876/885] 646015=test_tmpdir I, [2024-05-22T10:46:36.875894 #605161] INFO -- : [877/885] 646015=heredoc_dedent_test I, [2024-05-22T10:46:36.888691 #605161] INFO -- : [878/885] 646015=test_type I, [2024-05-22T10:46:37.002768 #605161] INFO -- : [879/885] 646015=test_mutex I, [2024-05-22T10:46:38.033580 #605161] INFO -- : [880/885] 646015=test_rdoc_token_stream I, [2024-05-22T10:46:38.052038 #605161] INFO -- : [881/885] 646015=test_gem_local_remote_options I, [2024-05-22T10:46:38.053468 #605161] INFO -- : [882/885] 646014=test_gem_ext_cargo_builder_link_flag_converter I, [2024-05-22T10:46:38.096907 #605161] INFO -- : [883/885] 646015=test_acceptable I, [2024-05-22T10:46:38.131991 #605161] INFO -- : [884/885] 646014=test_dup I, [2024-05-22T10:46:38.260851 #605161] INFO -- : [885/885] 646015=test_rdoc_single_class I, [2024-05-22T10:47:01.951656 #605161] INFO -- : Finished tests in 218.282954s, 120.4767 tests/s, 42836.0613 assertions/s. I, [2024-05-22T10:47:01.956365 #605161] INFO -- : 26298 tests, 9350382 assertions, 0 failures, 0 errors, 320 skips I, [2024-05-22T10:47:01.956393 #605161] INFO -- : I, [2024-05-22T10:47:01.956404 #605161] INFO -- : ruby -v: ruby 3.4.0dev (2024-05-22T06:59:19Z master 5613d6e95b) [aarch64-linux] I, [2024-05-22T10:47:01.957171 #605161] INFO -- : $$$[end] "make yes-test-all TESTOPTS='--stderr-on-failure' TESTS='-j3'" exit with 0. I, [2024-05-22T10:47:01.957332 #605161] INFO -- : $$$[beg] make yes-test-rubyspec MSPECOPT='--error-output stderr --debug -j' TESTS='-j3' I, [2024-05-22T10:47:02.084269 #605161] INFO -- : BASERUBY = /usr/local/bin/ruby --disable=gems I, [2024-05-22T10:47:02.084351 #605161] INFO -- : CC = gcc I, [2024-05-22T10:47:02.084362 #605161] INFO -- : LD = ld I, [2024-05-22T10:47:02.084371 #605161] INFO -- : LDSHARED = gcc -shared I, [2024-05-22T10:47:02.084384 #605161] INFO -- : CFLAGS = -O3 -fno-fast-math -ggdb3 -Wall -Wextra -Wdeprecated-declarations -Wdiv-by-zero -Wduplicated-cond -Wimplicit-function-declaration -Wimplicit-int -Wpointer-arith -Wwrite-strings -Wold-style-definition -Wimplicit-fallthrough=0 -Wmissing-noreturn -Wno-cast-function-type -Wno-constant-logical-operand -Wno-long-long -Wno-missing-field-initializers -Wno-overlength-strings -Wno-packed-bitfield-compat -Wno-parentheses-equality -Wno-self-assign -Wno-tautological-compare -Wno-unused-parameter -Wno-unused-value -Wsuggest-attribute=format -Wsuggest-attribute=noreturn -Wunused-variable -Wmisleading-indentation -Wundef I, [2024-05-22T10:47:02.084393 #605161] INFO -- : XCFLAGS = -U_FORTIFY_SOURCE -D_FORTIFY_SOURCE=2 -fstack-protector-strong -msign-return-address=all -fno-strict-overflow -fvisibility=hidden -fexcess-precision=standard -DRUBY_EXPORT -fPIE -I. -I.ext/include/aarch64-linux -I/home/opc/ruby/src/master/include -I/home/opc/ruby/src/master -I/home/opc/ruby/src/master/prism -I/home/opc/ruby/src/master/enc/unicode/15.0.0 I, [2024-05-22T10:47:02.084402 #605161] INFO -- : CPPFLAGS = I, [2024-05-22T10:47:02.084411 #605161] INFO -- : DLDFLAGS = -Wl,--compress-debug-sections=zlib -fstack-protector-strong -pie I, [2024-05-22T10:47:02.084419 #605161] INFO -- : SOLIBS = -lz -lrt -lrt -ldl -lcrypt -lm -lpthread I, [2024-05-22T10:47:02.084427 #605161] INFO -- : LANG = en_US.UTF-8 I, [2024-05-22T10:47:02.084437 #605161] INFO -- : LC_ALL = I, [2024-05-22T10:47:02.084445 #605161] INFO -- : LC_CTYPE = I, [2024-05-22T10:47:02.084453 #605161] INFO -- : MFLAGS = I, [2024-05-22T10:47:02.084461 #605161] INFO -- : RUSTC = rustc I, [2024-05-22T10:47:02.084469 #605161] INFO -- : YJIT_RUSTC_ARGS = --crate-name=yjit --crate-type=staticlib --edition=2021 -g -C lto=thin -C opt-level=3 -C overflow-checks=on '--out-dir=/home/opc/ruby/build/master/yjit/target/release/' /home/opc/ruby/src/master/yjit/src/lib.rs I, [2024-05-22T10:47:02.085192 #605161] INFO -- : gcc (GCC) 8.5.0 20210514 (Red Hat 8.5.0-10.1.0.1) I, [2024-05-22T10:47:02.085212 #605161] INFO -- : Copyright (C) 2018 Free Software Foundation, Inc. I, [2024-05-22T10:47:02.085222 #605161] INFO -- : This is free software; see the source for copying conditions. There is NO I, [2024-05-22T10:47:02.085230 #605161] INFO -- : warranty; not even for MERCHANTABILITY or FITNESS FOR A PARTICULAR PURPOSE. I, [2024-05-22T10:47:02.085239 #605161] INFO -- : I, [2024-05-22T10:47:02.087278 #605161] INFO -- : generating enc.mk I, [2024-05-22T10:47:02.321745 #605161] INFO -- : generating encdb.h I, [2024-05-22T10:47:02.358460 #605161] INFO -- : encdb.h unchanged I, [2024-05-22T10:47:02.359707 #605161] INFO -- : making enc I, [2024-05-22T10:47:02.386915 #605161] INFO -- : make[1]: Entering directory '/home/opc/ruby/build/master' I, [2024-05-22T10:47:02.386989 #605161] INFO -- : make[1]: Nothing to be done for 'enc'. I, [2024-05-22T10:47:02.387000 #605161] INFO -- : make[1]: Leaving directory '/home/opc/ruby/build/master' I, [2024-05-22T10:47:02.387812 #605161] INFO -- : making srcs under enc I, [2024-05-22T10:47:02.429549 #605161] INFO -- : make[1]: Entering directory '/home/opc/ruby/build/master' I, [2024-05-22T10:47:02.429625 #605161] INFO -- : make[1]: Nothing to be done for 'srcs'. I, [2024-05-22T10:47:02.429635 #605161] INFO -- : make[1]: Leaving directory '/home/opc/ruby/build/master' I, [2024-05-22T10:47:02.430788 #605161] INFO -- : generating transdb.h I, [2024-05-22T10:47:02.573461 #605161] INFO -- : transdb.h unchanged I, [2024-05-22T10:47:02.574905 #605161] INFO -- : making trans I, [2024-05-22T10:47:02.623285 #605161] INFO -- : make[1]: Entering directory '/home/opc/ruby/build/master' I, [2024-05-22T10:47:02.623342 #605161] INFO -- : make[1]: Nothing to be done for 'trans'. I, [2024-05-22T10:47:02.623353 #605161] INFO -- : make[1]: Leaving directory '/home/opc/ruby/build/master' I, [2024-05-22T10:47:02.624193 #605161] INFO -- : making encs I, [2024-05-22T10:47:02.676863 #605161] INFO -- : make[1]: Entering directory '/home/opc/ruby/build/master' I, [2024-05-22T10:47:02.676939 #605161] INFO -- : make[1]: Nothing to be done for 'encs'. I, [2024-05-22T10:47:02.676950 #605161] INFO -- : make[1]: Leaving directory '/home/opc/ruby/build/master' I, [2024-05-22T10:47:02.679038 #605161] INFO -- : generating makefiles ext/configure-ext.mk I, [2024-05-22T10:47:02.719578 #605161] INFO -- : ext/configure-ext.mk updated I, [2024-05-22T10:47:02.723344 #605161] INFO -- : make[1]: Entering directory '/home/opc/ruby/build/master' I, [2024-05-22T10:47:04.822851 #605161] INFO -- : make[1]: Leaving directory '/home/opc/ruby/build/master' I, [2024-05-22T10:47:04.823575 #605161] INFO -- : generating makefile exts.mk I, [2024-05-22T10:47:04.882084 #605161] INFO -- : exts.mk unchanged I, [2024-05-22T10:47:04.887094 #605161] INFO -- : make[1]: Entering directory '/home/opc/ruby/build/master' I, [2024-05-22T10:47:05.183985 #605161] INFO -- : make[2]: Entering directory '/home/opc/ruby/build/master/ext/coverage' I, [2024-05-22T10:47:05.188649 #605161] INFO -- : make[2]: Leaving directory '/home/opc/ruby/build/master/ext/coverage' I, [2024-05-22T10:47:05.194293 #605161] INFO -- : make[2]: Entering directory '/home/opc/ruby/build/master/ext/date' I, [2024-05-22T10:47:05.199806 #605161] INFO -- : make[2]: Leaving directory '/home/opc/ruby/build/master/ext/date' I, [2024-05-22T10:47:05.203137 #605161] INFO -- : make[2]: Entering directory '/home/opc/ruby/build/master/ext/digest' I, [2024-05-22T10:47:05.211914 #605161] INFO -- : make[2]: Leaving directory '/home/opc/ruby/build/master/ext/digest' I, [2024-05-22T10:47:05.234506 #605161] INFO -- : make[2]: Entering directory '/home/opc/ruby/build/master/ext/digest/sha2' I, [2024-05-22T10:47:05.239398 #605161] INFO -- : make[2]: Leaving directory '/home/opc/ruby/build/master/ext/digest/sha2' I, [2024-05-22T10:47:05.257889 #605161] INFO -- : make[2]: Entering directory '/home/opc/ruby/build/master/ext/fiddle' I, [2024-05-22T10:47:05.268408 #605161] INFO -- : make[2]: Leaving directory '/home/opc/ruby/build/master/ext/fiddle' I, [2024-05-22T10:47:05.272823 #605161] INFO -- : make[2]: Entering directory '/home/opc/ruby/build/master/ext/io/console' I, [2024-05-22T10:47:05.277060 #605161] INFO -- : make[2]: Leaving directory '/home/opc/ruby/build/master/ext/io/console' I, [2024-05-22T10:47:05.287762 #605161] INFO -- : make[2]: Entering directory '/home/opc/ruby/build/master/ext/json' I, [2024-05-22T10:47:05.297226 #605161] INFO -- : make[2]: Leaving directory '/home/opc/ruby/build/master/ext/json' I, [2024-05-22T10:47:05.310228 #605161] INFO -- : make[2]: Entering directory '/home/opc/ruby/build/master/ext/monitor' I, [2024-05-22T10:47:05.314384 #605161] INFO -- : make[2]: Leaving directory '/home/opc/ruby/build/master/ext/monitor' I, [2024-05-22T10:47:05.320352 #605161] INFO -- : make[2]: Entering directory '/home/opc/ruby/build/master/ext/objspace' I, [2024-05-22T10:47:05.326348 #605161] INFO -- : make[2]: Leaving directory '/home/opc/ruby/build/master/ext/objspace' I, [2024-05-22T10:47:05.345159 #605161] INFO -- : make[2]: Entering directory '/home/opc/ruby/build/master/ext/openssl' I, [2024-05-22T10:47:05.366926 #605161] INFO -- : make[2]: Leaving directory '/home/opc/ruby/build/master/ext/openssl' I, [2024-05-22T10:47:05.371165 #605161] INFO -- : make[2]: Entering directory '/home/opc/ruby/build/master/ext/pathname' I, [2024-05-22T10:47:05.375248 #605161] INFO -- : make[2]: Leaving directory '/home/opc/ruby/build/master/ext/pathname' I, [2024-05-22T10:47:05.381743 #605161] INFO -- : make[2]: Entering directory '/home/opc/ruby/build/master/ext/psych' I, [2024-05-22T10:47:05.402917 #605161] INFO -- : make[2]: Leaving directory '/home/opc/ruby/build/master/ext/psych' I, [2024-05-22T10:47:05.407282 #605161] INFO -- : make[2]: Entering directory '/home/opc/ruby/build/master/ext/pty' I, [2024-05-22T10:47:05.411377 #605161] INFO -- : make[2]: Leaving directory '/home/opc/ruby/build/master/ext/pty' I, [2024-05-22T10:47:05.424633 #605161] INFO -- : make[2]: Entering directory '/home/opc/ruby/build/master/ext/ripper' I, [2024-05-22T10:47:05.432323 #605161] INFO -- : make[2]: Leaving directory '/home/opc/ruby/build/master/ext/ripper' I, [2024-05-22T10:47:05.434316 #605161] INFO -- : make[2]: Entering directory '/home/opc/ruby/build/master/ext/rubyvm' I, [2024-05-22T10:47:05.437746 #605161] INFO -- : make[2]: Leaving directory '/home/opc/ruby/build/master/ext/rubyvm' I, [2024-05-22T10:47:05.449981 #605161] INFO -- : make[2]: Entering directory '/home/opc/ruby/build/master/ext/socket' I, [2024-05-22T10:47:05.460667 #605161] INFO -- : make[2]: Leaving directory '/home/opc/ruby/build/master/ext/socket' I, [2024-05-22T10:47:05.475790 #605161] INFO -- : make[2]: Entering directory '/home/opc/ruby/build/master/.bundle/gems/bigdecimal-3.1.7/ext/bigdecimal' I, [2024-05-22T10:47:05.506431 #605161] INFO -- : make[2]: Leaving directory '/home/opc/ruby/build/master/.bundle/gems/bigdecimal-3.1.7/ext/bigdecimal' I, [2024-05-22T10:47:05.509088 #605161] INFO -- : make[2]: Entering directory '/home/opc/ruby/build/master/.bundle/gems/bigdecimal-3.1.8/ext/bigdecimal' I, [2024-05-22T10:47:05.539845 #605161] INFO -- : make[2]: Leaving directory '/home/opc/ruby/build/master/.bundle/gems/bigdecimal-3.1.8/ext/bigdecimal' I, [2024-05-22T10:47:05.542480 #605161] INFO -- : make[2]: Entering directory '/home/opc/ruby/build/master/.bundle/gems/debug-1.9.2/ext/debug' I, [2024-05-22T10:47:05.572394 #605161] INFO -- : make[2]: Leaving directory '/home/opc/ruby/build/master/.bundle/gems/debug-1.9.2/ext/debug' I, [2024-05-22T10:47:05.575010 #605161] INFO -- : make[2]: Entering directory '/home/opc/ruby/build/master/.bundle/gems/nkf-0.2.0/ext/nkf' I, [2024-05-22T10:47:05.605230 #605161] INFO -- : make[2]: Leaving directory '/home/opc/ruby/build/master/.bundle/gems/nkf-0.2.0/ext/nkf' I, [2024-05-22T10:47:05.607780 #605161] INFO -- : make[2]: Entering directory '/home/opc/ruby/build/master/.bundle/gems/racc-1.7.3/ext/racc/cparse' I, [2024-05-22T10:47:05.637981 #605161] INFO -- : make[2]: Leaving directory '/home/opc/ruby/build/master/.bundle/gems/racc-1.7.3/ext/racc/cparse' I, [2024-05-22T10:47:05.640512 #605161] INFO -- : make[2]: Entering directory '/home/opc/ruby/build/master/.bundle/gems/racc-1.8.0/ext/racc/cparse' I, [2024-05-22T10:47:05.671049 #605161] INFO -- : make[2]: Leaving directory '/home/opc/ruby/build/master/.bundle/gems/racc-1.8.0/ext/racc/cparse' I, [2024-05-22T10:47:05.674118 #605161] INFO -- : make[2]: Entering directory '/home/opc/ruby/build/master/.bundle/gems/rbs-3.4.4/ext/rbs_extension' I, [2024-05-22T10:47:05.704163 #605161] INFO -- : make[2]: Leaving directory '/home/opc/ruby/build/master/.bundle/gems/rbs-3.4.4/ext/rbs_extension' I, [2024-05-22T10:47:05.706801 #605161] INFO -- : make[2]: Entering directory '/home/opc/ruby/build/master/.bundle/gems/syslog-0.1.2/ext/syslog' I, [2024-05-22T10:47:05.737533 #605161] INFO -- : make[2]: Leaving directory '/home/opc/ruby/build/master/.bundle/gems/syslog-0.1.2/ext/syslog' I, [2024-05-22T10:47:05.775424 #605161] INFO -- : make[2]: Entering directory '/home/opc/ruby/build/master' I, [2024-05-22T10:47:05.857836 #605161] INFO -- : make[2]: 'ruby' is up to date. I, [2024-05-22T10:47:05.857911 #605161] INFO -- : make[2]: Leaving directory '/home/opc/ruby/build/master' I, [2024-05-22T10:47:05.858020 #605161] INFO -- : make[1]: Leaving directory '/home/opc/ruby/build/master' I, [2024-05-22T10:47:05.862420 #605161] INFO -- : make[1]: Entering directory '/home/opc/ruby/build/master' I, [2024-05-22T10:47:05.862444 #605161] INFO -- : make[1]: Nothing to be done for 'note'. I, [2024-05-22T10:47:05.862457 #605161] INFO -- : make[1]: Leaving directory '/home/opc/ruby/build/master' E, [2024-05-22T10:47:05.938492 #605161] ERROR -- : $ /home/opc/ruby/build/master/miniruby -I/home/opc/ruby/src/master/lib /home/opc/ruby/src/master/tool/runruby.rb --archdir=/home/opc/ruby/build/master --extout=.ext -- /home/opc/ruby/src/master/spec/mspec/bin/mspec-run -B /home/opc/ruby/src/master/spec/default.mspec --error-output stderr --debug -fy -o /tmp/rubytest.2koe8d/1-mspec-multi-0 E, [2024-05-22T10:47:05.938831 #605161] ERROR -- : $ /home/opc/ruby/build/master/miniruby -I/home/opc/ruby/src/master/lib /home/opc/ruby/src/master/tool/runruby.rb --archdir=/home/opc/ruby/build/master --extout=.ext -- /home/opc/ruby/src/master/spec/mspec/bin/mspec-run -B /home/opc/ruby/src/master/spec/default.mspec --error-output stderr --debug -fy -o /tmp/rubytest.2koe8d/2-mspec-multi-1 E, [2024-05-22T10:47:05.939083 #605161] ERROR -- : $ /home/opc/ruby/build/master/miniruby -I/home/opc/ruby/src/master/lib /home/opc/ruby/src/master/tool/runruby.rb --archdir=/home/opc/ruby/build/master --extout=.ext -- /home/opc/ruby/src/master/spec/mspec/bin/mspec-run -B /home/opc/ruby/src/master/spec/default.mspec --error-output stderr --debug -fy -o /tmp/rubytest.2koe8d/3-mspec-multi-2 I, [2024-05-22T10:47:06.067330 #605161] INFO -- : ruby 3.4.0dev (2024-05-22T06:59:19Z master 5613d6e95b) [aarch64-linux] I, [2024-05-22T10:47:11.520785 #605161] INFO -- : 0 ......................................................................... I, [2024-05-22T10:47:13.913416 #605161] INFO -- : 73 ......................................................................... I, [2024-05-22T10:47:14.102991 #605161] INFO -- : 146 ......................................................................... I, [2024-05-22T10:47:14.405619 #605161] INFO -- : 219 ......................................................................... I, [2024-05-22T10:47:14.552567 #605161] INFO -- : 292 ......................................................................... I, [2024-05-22T10:47:14.808697 #605161] INFO -- : 365 ......................................................................... I, [2024-05-22T10:47:14.932266 #605161] INFO -- : 438 ......................................................................... I, [2024-05-22T10:47:14.991506 #605161] INFO -- : 511 ......................................................................... I, [2024-05-22T10:47:15.053778 #605161] INFO -- : 584 ......................................................................... I, [2024-05-22T10:47:15.665467 #605161] INFO -- : 657 ......................................................................... I, [2024-05-22T10:47:15.775752 #605161] INFO -- : 730 ......................................................................... I, [2024-05-22T10:47:15.825011 #605161] INFO -- : 803 ......................................................................... I, [2024-05-22T10:47:16.039167 #605161] INFO -- : 876 ......................................................................... I, [2024-05-22T10:47:16.148108 #605161] INFO -- : 949 ......................................................................... I, [2024-05-22T10:47:16.752685 #605161] INFO -- : 1022 ......................................................................... I, [2024-05-22T10:47:19.060688 #605161] INFO -- : 1095 ......................................................................... I, [2024-05-22T10:47:19.889628 #605161] INFO -- : 1168 ......................................................................... I, [2024-05-22T10:47:20.068032 #605161] INFO -- : 1241 ......................................................................... I, [2024-05-22T10:47:20.301193 #605161] INFO -- : 1314 ......................................................................... I, [2024-05-22T10:47:20.402013 #605161] INFO -- : 1387 ......................................................................... I, [2024-05-22T10:47:22.400922 #605161] INFO -- : 1460 ......................................................................... I, [2024-05-22T10:47:25.711138 #605161] INFO -- : 1533 ......................................................................... I, [2024-05-22T10:47:25.875498 #605161] INFO -- : 1606 ......................................................................... I, [2024-05-22T10:47:26.719321 #605161] INFO -- : 1679 ......................................................................... I, [2024-05-22T10:47:27.040804 #605161] INFO -- : 1752 ......................................................................... I, [2024-05-22T10:47:27.341063 #605161] INFO -- : 1825 ......................................................................... I, [2024-05-22T10:47:27.663581 #605161] INFO -- : 1898 ......................................................................... I, [2024-05-22T10:47:28.065702 #605161] INFO -- : 1971 ......................................................................... I, [2024-05-22T10:47:28.581986 #605161] INFO -- : 2044 ......................................................................... I, [2024-05-22T10:47:28.677907 #605161] INFO -- : 2117 ......................................................................... I, [2024-05-22T10:47:28.739029 #605161] INFO -- : 2190 ......................................................................... I, [2024-05-22T10:47:28.792427 #605161] INFO -- : 2263 ......................................................................... I, [2024-05-22T10:47:28.840624 #605161] INFO -- : 2336 ......................................................................... I, [2024-05-22T10:47:28.935662 #605161] INFO -- : 2409 ......................................................................... I, [2024-05-22T10:47:29.209153 #605161] INFO -- : 2482 ......................................................................... I, [2024-05-22T10:47:29.336816 #605161] INFO -- : 2555 ......................................................................... I, [2024-05-22T10:47:30.574361 #605161] INFO -- : 2628 ......................................................................... I, [2024-05-22T10:47:30.720540 #605161] INFO -- : 2701 ......................................................................... I, [2024-05-22T10:47:30.854189 #605161] INFO -- : 2774 ......................................................................... I, [2024-05-22T10:47:31.188990 #605161] INFO -- : 2847 ......................................................................... I, [2024-05-22T10:47:31.457718 #605161] INFO -- : 2920 ......................................................................... I, [2024-05-22T10:47:31.572865 #605161] INFO -- : 2993 ......................................................................... I, [2024-05-22T10:47:31.641233 #605161] INFO -- : 3066 ......................................................................... I, [2024-05-22T10:47:31.695690 #605161] INFO -- : 3139 ......................................................................... I, [2024-05-22T10:47:31.759699 #605161] INFO -- : 3212 ......................................................................... I, [2024-05-22T10:47:31.829507 #605161] INFO -- : 3285 ......................................................................... I, [2024-05-22T10:47:35.644299 #605161] INFO -- : 3358 ......................................................................... I, [2024-05-22T10:47:35.668937 #605161] INFO -- : I, [2024-05-22T10:47:35.668997 #605161] INFO -- : I, [2024-05-22T10:47:35.669009 #605161] INFO -- : Finished in 29.730320 seconds I, [2024-05-22T10:47:35.669018 #605161] INFO -- : I, [2024-05-22T10:47:35.669026 #605161] INFO -- : 3430 files, 32648 examples, 183633 expectations, 0 failures, 0 errors, 0 tagged I, [2024-05-22T10:47:35.670293 #605161] INFO -- : $$$[end] "make yes-test-rubyspec MSPECOPT='--error-output stderr --debug -j' TESTS='-j3'" exit with 0.