# Logfile created on 2024-05-22 02:57:12 +0000 by logger.rb/v1.5.3 I, [2024-05-22T02:57:12.941823 #1029097] INFO -- : #, @formatter=nil, @logdev=#, @binmode=false, @mon_data=#, @mon_data_owner_object_id=860>>> I, [2024-05-22T02:57:12.942115 #1029097] INFO -- : $$$[beg] make update-unicode -j3 I, [2024-05-22T02:57:13.031584 #1029097] INFO -- : Downloading Unicode emoji 15.0 files... I, [2024-05-22T02:57:13.031782 #1029097] INFO -- : Downloading Unicode emoji 15.0 files... I, [2024-05-22T02:57:13.032112 #1029097] INFO -- : Downloading Unicode emoji 15.0 files... I, [2024-05-22T02:57:13.109843 #1029097] INFO -- : made symlink emoji/15.0/emoji-sequences.txt to /home/opc/ruby/src/master/.downloaded-cache/emoji/15.0/emoji-sequences.txt I, [2024-05-22T02:57:13.109955 #1029097] INFO -- : /home/opc/ruby/src/master/enc/unicode/data/emoji/15.0/emoji-sequences.txt already exists I, [2024-05-22T02:57:13.114697 #1029097] INFO -- : downloading emoji/15.0/emoji-test.txt ... downloading emoji/15.0/emoji-test.txt ... /home/opc/ruby/src/master/enc/unicode/data/emoji/15.0/emoji-sequences.txt already exists E, [2024-05-22T02:57:13.638884 #1029097] ERROR -- : /home/opc/ruby/src/master/tool/downloader.rb:302:in `rescue in download': failed to download emoji/15.0/emoji-test.txt (RuntimeError) E, [2024-05-22T02:57:13.638951 #1029097] ERROR -- : OpenURI::HTTPError: 403 Forbidden: https://www.unicode.org/Public/emoji/15.0/emoji-test.txt E, [2024-05-22T02:57:13.638962 #1029097] ERROR -- : from /home/opc/ruby/src/master/tool/downloader.rb:201:in `download' E, [2024-05-22T02:57:13.638972 #1029097] ERROR -- : from /home/opc/ruby/src/master/tool/downloader.rb:136:in `download' E, [2024-05-22T02:57:13.638981 #1029097] ERROR -- : from /home/opc/ruby/src/master/tool/downloader.rb:482:in `block in
' E, [2024-05-22T02:57:13.638989 #1029097] ERROR -- : from /home/opc/ruby/src/master/tool/downloader.rb:465:in `each' E, [2024-05-22T02:57:13.638997 #1029097] ERROR -- : from /home/opc/ruby/src/master/tool/downloader.rb:465:in `
' E, [2024-05-22T02:57:13.639005 #1029097] ERROR -- : /usr/local/lib/ruby/3.2.0/open-uri.rb:369:in `open_http': 403 Forbidden (OpenURI::HTTPError) E, [2024-05-22T02:57:13.639014 #1029097] ERROR -- : from /usr/local/lib/ruby/3.2.0/open-uri.rb:760:in `buffer_open' E, [2024-05-22T02:57:13.639022 #1029097] ERROR -- : from /usr/local/lib/ruby/3.2.0/open-uri.rb:214:in `block in open_loop' E, [2024-05-22T02:57:13.639030 #1029097] ERROR -- : from /usr/local/lib/ruby/3.2.0/open-uri.rb:212:in `catch' E, [2024-05-22T02:57:13.639039 #1029097] ERROR -- : from /usr/local/lib/ruby/3.2.0/open-uri.rb:212:in `open_loop' E, [2024-05-22T02:57:13.639047 #1029097] ERROR -- : from /usr/local/lib/ruby/3.2.0/open-uri.rb:153:in `open_uri' E, [2024-05-22T02:57:13.639055 #1029097] ERROR -- : from /usr/local/lib/ruby/3.2.0/open-uri.rb:740:in `open' E, [2024-05-22T02:57:13.639067 #1029097] ERROR -- : from /usr/local/lib/ruby/3.2.0/open-uri.rb:748:in `read' E, [2024-05-22T02:57:13.639076 #1029097] ERROR -- : from /home/opc/ruby/src/master/tool/downloader.rb:247:in `block in download' E, [2024-05-22T02:57:13.639084 #1029097] ERROR -- : from /home/opc/ruby/src/master/tool/downloader.rb:378:in `with_retry' E, [2024-05-22T02:57:13.639092 #1029097] ERROR -- : from /home/opc/ruby/src/master/tool/downloader.rb:246:in `download' E, [2024-05-22T02:57:13.639100 #1029097] ERROR -- : from /home/opc/ruby/src/master/tool/downloader.rb:136:in `download' E, [2024-05-22T02:57:13.639108 #1029097] ERROR -- : from /home/opc/ruby/src/master/tool/downloader.rb:482:in `block in
' E, [2024-05-22T02:57:13.639117 #1029097] ERROR -- : from /home/opc/ruby/src/master/tool/downloader.rb:465:in `each' E, [2024-05-22T02:57:13.639125 #1029097] ERROR -- : from /home/opc/ruby/src/master/tool/downloader.rb:465:in `
' E, [2024-05-22T02:57:13.641896 #1029097] ERROR -- : make: *** [uncommon.mk:1756: /home/opc/ruby/src/master/enc/unicode/data/emoji/15.0/emoji-sequences.txt] Error 1 E, [2024-05-22T02:57:13.641922 #1029097] ERROR -- : make: *** Deleting file '/home/opc/ruby/src/master/enc/unicode/data/emoji/15.0/emoji-sequences.txt' E, [2024-05-22T02:57:13.641982 #1029097] ERROR -- : make: *** Waiting for unfinished jobs.... E, [2024-05-22T02:57:13.646324 #1029097] ERROR -- : /home/opc/ruby/src/master/tool/downloader.rb:302:in `rescue in download': failed to download emoji/15.0/emoji-test.txt (RuntimeError) E, [2024-05-22T02:57:13.646366 #1029097] ERROR -- : OpenURI::HTTPError: 403 Forbidden: https://www.unicode.org/Public/emoji/15.0/emoji-test.txt E, [2024-05-22T02:57:13.646377 #1029097] ERROR -- : from /home/opc/ruby/src/master/tool/downloader.rb:201:in `download' E, [2024-05-22T02:57:13.646386 #1029097] ERROR -- : from /home/opc/ruby/src/master/tool/downloader.rb:136:in `download' E, [2024-05-22T02:57:13.646395 #1029097] ERROR -- : from /home/opc/ruby/src/master/tool/downloader.rb:482:in `block in
' E, [2024-05-22T02:57:13.646403 #1029097] ERROR -- : from /home/opc/ruby/src/master/tool/downloader.rb:465:in `each' E, [2024-05-22T02:57:13.646411 #1029097] ERROR -- : from /home/opc/ruby/src/master/tool/downloader.rb:465:in `
' E, [2024-05-22T02:57:13.646419 #1029097] ERROR -- : /usr/local/lib/ruby/3.2.0/open-uri.rb:369:in `open_http': 403 Forbidden (OpenURI::HTTPError) E, [2024-05-22T02:57:13.646427 #1029097] ERROR -- : from /usr/local/lib/ruby/3.2.0/open-uri.rb:760:in `buffer_open' E, [2024-05-22T02:57:13.646436 #1029097] ERROR -- : from /usr/local/lib/ruby/3.2.0/open-uri.rb:214:in `block in open_loop' E, [2024-05-22T02:57:13.646444 #1029097] ERROR -- : from /usr/local/lib/ruby/3.2.0/open-uri.rb:212:in `catch' E, [2024-05-22T02:57:13.646452 #1029097] ERROR -- : from /usr/local/lib/ruby/3.2.0/open-uri.rb:212:in `open_loop' E, [2024-05-22T02:57:13.646460 #1029097] ERROR -- : from /usr/local/lib/ruby/3.2.0/open-uri.rb:153:in `open_uri' E, [2024-05-22T02:57:13.646469 #1029097] ERROR -- : from /usr/local/lib/ruby/3.2.0/open-uri.rb:740:in `open' E, [2024-05-22T02:57:13.646477 #1029097] ERROR -- : from /usr/local/lib/ruby/3.2.0/open-uri.rb:748:in `read' E, [2024-05-22T02:57:13.646485 #1029097] ERROR -- : from /home/opc/ruby/src/master/tool/downloader.rb:247:in `block in download' E, [2024-05-22T02:57:13.646492 #1029097] ERROR -- : from /home/opc/ruby/src/master/tool/downloader.rb:378:in `with_retry' E, [2024-05-22T02:57:13.646501 #1029097] ERROR -- : from /home/opc/ruby/src/master/tool/downloader.rb:246:in `download' E, [2024-05-22T02:57:13.646509 #1029097] ERROR -- : from /home/opc/ruby/src/master/tool/downloader.rb:136:in `download' E, [2024-05-22T02:57:13.646517 #1029097] ERROR -- : from /home/opc/ruby/src/master/tool/downloader.rb:482:in `block in
' E, [2024-05-22T02:57:13.646525 #1029097] ERROR -- : from /home/opc/ruby/src/master/tool/downloader.rb:465:in `each' E, [2024-05-22T02:57:13.646536 #1029097] ERROR -- : from /home/opc/ruby/src/master/tool/downloader.rb:465:in `
' E, [2024-05-22T02:57:13.649210 #1029097] ERROR -- : make: *** [uncommon.mk:1756: /home/opc/ruby/src/master/enc/unicode/data/emoji/15.0/emoji-test.txt] Error 1 E, [2024-05-22T02:57:13.668677 #1029097] ERROR -- : /home/opc/ruby/src/master/tool/downloader.rb:302:in `rescue in download': failed to download emoji/15.0/emoji-test.txt (RuntimeError) E, [2024-05-22T02:57:13.668715 #1029097] ERROR -- : OpenURI::HTTPError: 403 Forbidden: https://www.unicode.org/Public/emoji/15.0/emoji-test.txt E, [2024-05-22T02:57:13.668725 #1029097] ERROR -- : from /home/opc/ruby/src/master/tool/downloader.rb:201:in `download' E, [2024-05-22T02:57:13.668734 #1029097] ERROR -- : from /home/opc/ruby/src/master/tool/downloader.rb:136:in `download' E, [2024-05-22T02:57:13.668742 #1029097] ERROR -- : from /home/opc/ruby/src/master/tool/downloader.rb:482:in `block in
' E, [2024-05-22T02:57:13.668750 #1029097] ERROR -- : from /home/opc/ruby/src/master/tool/downloader.rb:465:in `each' E, [2024-05-22T02:57:13.668758 #1029097] ERROR -- : from /home/opc/ruby/src/master/tool/downloader.rb:465:in `
' E, [2024-05-22T02:57:13.668766 #1029097] ERROR -- : /usr/local/lib/ruby/3.2.0/open-uri.rb:369:in `open_http': 403 Forbidden (OpenURI::HTTPError) E, [2024-05-22T02:57:13.668774 #1029097] ERROR -- : from /usr/local/lib/ruby/3.2.0/open-uri.rb:760:in `buffer_open' E, [2024-05-22T02:57:13.668783 #1029097] ERROR -- : from /usr/local/lib/ruby/3.2.0/open-uri.rb:214:in `block in open_loop' E, [2024-05-22T02:57:13.668791 #1029097] ERROR -- : from /usr/local/lib/ruby/3.2.0/open-uri.rb:212:in `catch' E, [2024-05-22T02:57:13.668799 #1029097] ERROR -- : from /usr/local/lib/ruby/3.2.0/open-uri.rb:212:in `open_loop' E, [2024-05-22T02:57:13.668807 #1029097] ERROR -- : from /usr/local/lib/ruby/3.2.0/open-uri.rb:153:in `open_uri' E, [2024-05-22T02:57:13.668815 #1029097] ERROR -- : from /usr/local/lib/ruby/3.2.0/open-uri.rb:740:in `open' E, [2024-05-22T02:57:13.668823 #1029097] ERROR -- : from /usr/local/lib/ruby/3.2.0/open-uri.rb:748:in `read' E, [2024-05-22T02:57:13.668831 #1029097] ERROR -- : from /home/opc/ruby/src/master/tool/downloader.rb:247:in `block in download' E, [2024-05-22T02:57:13.668840 #1029097] ERROR -- : from /home/opc/ruby/src/master/tool/downloader.rb:378:in `with_retry' E, [2024-05-22T02:57:13.668848 #1029097] ERROR -- : from /home/opc/ruby/src/master/tool/downloader.rb:246:in `download' E, [2024-05-22T02:57:13.668856 #1029097] ERROR -- : from /home/opc/ruby/src/master/tool/downloader.rb:136:in `download' E, [2024-05-22T02:57:13.668864 #1029097] ERROR -- : from /home/opc/ruby/src/master/tool/downloader.rb:482:in `block in
' E, [2024-05-22T02:57:13.668872 #1029097] ERROR -- : from /home/opc/ruby/src/master/tool/downloader.rb:465:in `each' E, [2024-05-22T02:57:13.668881 #1029097] ERROR -- : from /home/opc/ruby/src/master/tool/downloader.rb:465:in `
' E, [2024-05-22T02:57:13.671712 #1029097] ERROR -- : make: *** [uncommon.mk:1756: /home/opc/ruby/src/master/enc/unicode/data/emoji/15.0/emoji-zwj-sequences.txt] Error 1 I, [2024-05-22T02:57:13.671775 #1029097] INFO -- : downloading emoji/15.0/emoji-test.txt ... I, [2024-05-22T02:57:13.671923 #1029097] INFO -- : $$$[end] "make update-unicode -j3" exit with 512. I, [2024-05-22T02:57:13.671970 #1029097] INFO -- : $$$[beg] make update-download -j3 I, [2024-05-22T02:57:13.832761 #1029097] INFO -- : tool/config.guess already exists I, [2024-05-22T02:57:13.832834 #1029097] INFO -- : tool/config.sub already exists I, [2024-05-22T02:57:13.835564 #1029097] INFO -- : Update power_assert to 84e85124c5014a139af39161d484156cfe87a9ed I, [2024-05-22T02:57:13.835720 #1029097] INFO -- : Update rbs to ba7872795d5de04adb8ff500c0e6afdc81a041dd I, [2024-05-22T02:57:13.835992 #1029097] INFO -- : Update typeprof to b19a6416da3a05d57fadd6ffdadb382b6d236ca5 I, [2024-05-22T02:57:13.838889 #1029097] INFO -- : echo b19a6416da3a05d57fadd6ffdadb382b6d236ca5 | /bin/sh /home/opc/ruby/src/master/tool/ifchange /home/opc/ruby/src/master/.bundle/.timestamp/typeprof.revision - I, [2024-05-22T02:57:13.839135 #1029097] INFO -- : echo 84e85124c5014a139af39161d484156cfe87a9ed | /bin/sh /home/opc/ruby/src/master/tool/ifchange /home/opc/ruby/src/master/.bundle/.timestamp/power_assert.revision - I, [2024-05-22T02:57:13.839309 #1029097] INFO -- : echo ba7872795d5de04adb8ff500c0e6afdc81a041dd | /bin/sh /home/opc/ruby/src/master/tool/ifchange /home/opc/ruby/src/master/.bundle/.timestamp/rbs.revision - I, [2024-05-22T02:57:13.845152 #1029097] INFO -- : /home/opc/ruby/src/master/.bundle/.timestamp/power_assert.revision unchanged I, [2024-05-22T02:57:13.845833 #1029097] INFO -- : /home/opc/ruby/src/master/.bundle/.timestamp/typeprof.revision unchanged I, [2024-05-22T02:57:13.846397 #1029097] INFO -- : /home/opc/ruby/src/master/.bundle/.timestamp/rbs.revision unchanged I, [2024-05-22T02:57:13.933855 #1029097] INFO -- : Building power_assert@84e85124c5014a139af39161d484156cfe87a9ed to /home/opc/ruby/src/master/gems/power_assert-2.0.3.gem I, [2024-05-22T02:57:14.043764 #1029097] INFO -- : Successfully built RubyGem I, [2024-05-22T02:57:14.043826 #1029097] INFO -- : Name: power_assert I, [2024-05-22T02:57:14.043837 #1029097] INFO -- : Version: 2.0.4dev I, [2024-05-22T02:57:14.043845 #1029097] INFO -- : File: power_assert-2.0.4dev.gem I, [2024-05-22T02:57:14.124606 #1029097] INFO -- : $$$[end] "make update-download -j3" exit with 0. I, [2024-05-22T02:57:14.124678 #1029097] INFO -- : $$$[beg] make update-rubyspec -j3 I, [2024-05-22T02:57:14.213310 #1029097] INFO -- : make: Nothing to be done for 'update-rubyspec'. I, [2024-05-22T02:57:14.213468 #1029097] INFO -- : $$$[end] "make update-rubyspec -j3" exit with 0. I, [2024-05-22T02:57:14.213517 #1029097] INFO -- : $$$[beg] make update-src -j3 I, [2024-05-22T02:57:15.106418 #1029097] INFO -- : Already up to date. I, [2024-05-22T02:57:15.121309 #1029097] INFO -- : Latest commit hash = f8e6752219 I, [2024-05-22T02:57:15.121903 #1029097] INFO -- : $$$[end] "make update-src -j3" exit with 0. I, [2024-05-22T02:57:15.121944 #1029097] INFO -- : $$$[beg] make after-update -j3 I, [2024-05-22T02:57:15.258081 #1029097] INFO -- : /home/opc/ruby/src/master/revision.h updated I, [2024-05-22T02:57:15.259232 #1029097] INFO -- : generating aarch64-linux-fake.rb I, [2024-05-22T02:57:15.316483 #1029097] INFO -- : aarch64-linux-fake.rb updated I, [2024-05-22T02:57:15.318036 #1029097] INFO -- : generating enc.mk I, [2024-05-22T02:57:15.554458 #1029097] INFO -- : making srcs under enc I, [2024-05-22T02:57:15.596397 #1029097] INFO -- : make[1]: Entering directory '/home/opc/ruby/build/master' I, [2024-05-22T02:57:15.596464 #1029097] INFO -- : make[1]: Nothing to be done for 'srcs'. I, [2024-05-22T02:57:15.596474 #1029097] INFO -- : make[1]: Leaving directory '/home/opc/ruby/build/master' I, [2024-05-22T02:57:15.676894 #1029097] INFO -- : Update power_assert to 84e85124c5014a139af39161d484156cfe87a9ed I, [2024-05-22T02:57:15.677025 #1029097] INFO -- : Update rbs to ba7872795d5de04adb8ff500c0e6afdc81a041dd I, [2024-05-22T02:57:15.678144 #1029097] INFO -- : Update typeprof to b19a6416da3a05d57fadd6ffdadb382b6d236ca5 I, [2024-05-22T02:57:15.681309 #1029097] INFO -- : echo 84e85124c5014a139af39161d484156cfe87a9ed | /bin/sh /home/opc/ruby/src/master/tool/ifchange /home/opc/ruby/src/master/.bundle/.timestamp/power_assert.revision - I, [2024-05-22T02:57:15.681465 #1029097] INFO -- : echo ba7872795d5de04adb8ff500c0e6afdc81a041dd | /bin/sh /home/opc/ruby/src/master/tool/ifchange /home/opc/ruby/src/master/.bundle/.timestamp/rbs.revision - I, [2024-05-22T02:57:15.681600 #1029097] INFO -- : echo b19a6416da3a05d57fadd6ffdadb382b6d236ca5 | /bin/sh /home/opc/ruby/src/master/tool/ifchange /home/opc/ruby/src/master/.bundle/.timestamp/typeprof.revision - I, [2024-05-22T02:57:15.687295 #1029097] INFO -- : /home/opc/ruby/src/master/.bundle/.timestamp/typeprof.revision unchanged I, [2024-05-22T02:57:15.687344 #1029097] INFO -- : /home/opc/ruby/src/master/.bundle/.timestamp/rbs.revision unchanged I, [2024-05-22T02:57:15.687533 #1029097] INFO -- : /home/opc/ruby/src/master/.bundle/.timestamp/power_assert.revision unchanged I, [2024-05-22T02:57:15.780012 #1029097] INFO -- : Building power_assert@84e85124c5014a139af39161d484156cfe87a9ed to /home/opc/ruby/src/master/gems/power_assert-2.0.3.gem I, [2024-05-22T02:57:15.891402 #1029097] INFO -- : Successfully built RubyGem I, [2024-05-22T02:57:15.891458 #1029097] INFO -- : Name: power_assert I, [2024-05-22T02:57:15.891469 #1029097] INFO -- : Version: 2.0.4dev I, [2024-05-22T02:57:15.891478 #1029097] INFO -- : File: power_assert-2.0.4dev.gem I, [2024-05-22T02:57:15.894173 #1029097] INFO -- : Extracting bundle gem power_assert-2.0.3... I, [2024-05-22T02:57:15.992469 #1029097] INFO -- : Try with hash version of bundled gems instead of gems/power_assert-2.0.3.gem. We don't use this gem with release version of Ruby. I, [2024-05-22T02:57:16.002660 #1029097] INFO -- : Unpacked gems/power_assert-2.0.4dev.gem I, [2024-05-22T02:57:16.004549 #1029097] INFO -- : $$$[end] "make after-update -j3" exit with 0. I, [2024-05-22T02:57:16.004691 #1029097] INFO -- : $$$[beg] make miniruby -j3 I, [2024-05-22T02:57:16.092692 #1029097] INFO -- : BASERUBY = /usr/local/bin/ruby --disable=gems I, [2024-05-22T02:57:16.092755 #1029097] INFO -- : CC = gcc I, [2024-05-22T02:57:16.092766 #1029097] INFO -- : LD = ld I, [2024-05-22T02:57:16.092775 #1029097] INFO -- : LDSHARED = gcc -shared I, [2024-05-22T02:57:16.092786 #1029097] INFO -- : CFLAGS = -O3 -fno-fast-math -ggdb3 -Wall -Wextra -Wdeprecated-declarations -Wdiv-by-zero -Wduplicated-cond -Wimplicit-function-declaration -Wimplicit-int -Wpointer-arith -Wwrite-strings -Wold-style-definition -Wimplicit-fallthrough=0 -Wmissing-noreturn -Wno-cast-function-type -Wno-constant-logical-operand -Wno-long-long -Wno-missing-field-initializers -Wno-overlength-strings -Wno-packed-bitfield-compat -Wno-parentheses-equality -Wno-self-assign -Wno-tautological-compare -Wno-unused-parameter -Wno-unused-value -Wsuggest-attribute=format -Wsuggest-attribute=noreturn -Wunused-variable -Wmisleading-indentation -Wundef I, [2024-05-22T02:57:16.092796 #1029097] INFO -- : XCFLAGS = -U_FORTIFY_SOURCE -D_FORTIFY_SOURCE=2 -fstack-protector-strong -msign-return-address=all -fno-strict-overflow -fvisibility=hidden -fexcess-precision=standard -DRUBY_EXPORT -fPIE -I. -I.ext/include/aarch64-linux -I/home/opc/ruby/src/master/include -I/home/opc/ruby/src/master -I/home/opc/ruby/src/master/prism -I/home/opc/ruby/src/master/enc/unicode/15.0.0 I, [2024-05-22T02:57:16.092805 #1029097] INFO -- : CPPFLAGS = I, [2024-05-22T02:57:16.092813 #1029097] INFO -- : DLDFLAGS = -Wl,--compress-debug-sections=zlib -fstack-protector-strong -pie I, [2024-05-22T02:57:16.092822 #1029097] INFO -- : SOLIBS = -lz -lrt -lrt -ldl -lcrypt -lm -lpthread I, [2024-05-22T02:57:16.092830 #1029097] INFO -- : LANG = en_US.UTF-8 I, [2024-05-22T02:57:16.092838 #1029097] INFO -- : LC_ALL = I, [2024-05-22T02:57:16.092845 #1029097] INFO -- : LC_CTYPE = I, [2024-05-22T02:57:16.092854 #1029097] INFO -- : MFLAGS = -j3 --jobserver-auth=4,5 I, [2024-05-22T02:57:16.092862 #1029097] INFO -- : RUSTC = rustc I, [2024-05-22T02:57:16.092870 #1029097] INFO -- : YJIT_RUSTC_ARGS = --crate-name=yjit --crate-type=staticlib --edition=2021 -g -C lto=thin -C opt-level=3 -C overflow-checks=on '--out-dir=/home/opc/ruby/build/master/yjit/target/release/' /home/opc/ruby/src/master/yjit/src/lib.rs I, [2024-05-22T02:57:16.093682 #1029097] INFO -- : gcc (GCC) 8.5.0 20210514 (Red Hat 8.5.0-10.1.0.1) I, [2024-05-22T02:57:16.093719 #1029097] INFO -- : Copyright (C) 2018 Free Software Foundation, Inc. I, [2024-05-22T02:57:16.093730 #1029097] INFO -- : This is free software; see the source for copying conditions. There is NO I, [2024-05-22T02:57:16.093739 #1029097] INFO -- : warranty; not even for MERCHANTABILITY or FITNESS FOR A PARTICULAR PURPOSE. I, [2024-05-22T02:57:16.093748 #1029097] INFO -- : I, [2024-05-22T02:57:16.118745 #1029097] INFO -- : compiling /home/opc/ruby/src/master/version.c I, [2024-05-22T02:57:16.262325 #1029097] INFO -- : linking miniruby I, [2024-05-22T02:57:17.157943 #1029097] INFO -- : $$$[end] "make miniruby -j3" exit with 0. I, [2024-05-22T02:57:17.158124 #1029097] INFO -- : $$$[beg] make ruby -j3 I, [2024-05-22T02:57:17.247724 #1029097] INFO -- : BASERUBY = /usr/local/bin/ruby --disable=gems I, [2024-05-22T02:57:17.247789 #1029097] INFO -- : CC = gcc I, [2024-05-22T02:57:17.247800 #1029097] INFO -- : LD = ld I, [2024-05-22T02:57:17.247809 #1029097] INFO -- : LDSHARED = gcc -shared I, [2024-05-22T02:57:17.247820 #1029097] INFO -- : CFLAGS = -O3 -fno-fast-math -ggdb3 -Wall -Wextra -Wdeprecated-declarations -Wdiv-by-zero -Wduplicated-cond -Wimplicit-function-declaration -Wimplicit-int -Wpointer-arith -Wwrite-strings -Wold-style-definition -Wimplicit-fallthrough=0 -Wmissing-noreturn -Wno-cast-function-type -Wno-constant-logical-operand -Wno-long-long -Wno-missing-field-initializers -Wno-overlength-strings -Wno-packed-bitfield-compat -Wno-parentheses-equality -Wno-self-assign -Wno-tautological-compare -Wno-unused-parameter -Wno-unused-value -Wsuggest-attribute=format -Wsuggest-attribute=noreturn -Wunused-variable -Wmisleading-indentation -Wundef I, [2024-05-22T02:57:17.247829 #1029097] INFO -- : XCFLAGS = -U_FORTIFY_SOURCE -D_FORTIFY_SOURCE=2 -fstack-protector-strong -msign-return-address=all -fno-strict-overflow -fvisibility=hidden -fexcess-precision=standard -DRUBY_EXPORT -fPIE -I. -I.ext/include/aarch64-linux -I/home/opc/ruby/src/master/include -I/home/opc/ruby/src/master -I/home/opc/ruby/src/master/prism -I/home/opc/ruby/src/master/enc/unicode/15.0.0 I, [2024-05-22T02:57:17.247838 #1029097] INFO -- : CPPFLAGS = I, [2024-05-22T02:57:17.247846 #1029097] INFO -- : DLDFLAGS = -Wl,--compress-debug-sections=zlib -fstack-protector-strong -pie I, [2024-05-22T02:57:17.247855 #1029097] INFO -- : SOLIBS = -lz -lrt -lrt -ldl -lcrypt -lm -lpthread I, [2024-05-22T02:57:17.247863 #1029097] INFO -- : LANG = en_US.UTF-8 I, [2024-05-22T02:57:17.247871 #1029097] INFO -- : LC_ALL = I, [2024-05-22T02:57:17.247879 #1029097] INFO -- : LC_CTYPE = I, [2024-05-22T02:57:17.247887 #1029097] INFO -- : MFLAGS = -j3 --jobserver-auth=4,5 I, [2024-05-22T02:57:17.247896 #1029097] INFO -- : RUSTC = rustc I, [2024-05-22T02:57:17.247904 #1029097] INFO -- : YJIT_RUSTC_ARGS = --crate-name=yjit --crate-type=staticlib --edition=2021 -g -C lto=thin -C opt-level=3 -C overflow-checks=on '--out-dir=/home/opc/ruby/build/master/yjit/target/release/' /home/opc/ruby/src/master/yjit/src/lib.rs I, [2024-05-22T02:57:17.248688 #1029097] INFO -- : gcc (GCC) 8.5.0 20210514 (Red Hat 8.5.0-10.1.0.1) I, [2024-05-22T02:57:17.248735 #1029097] INFO -- : Copyright (C) 2018 Free Software Foundation, Inc. I, [2024-05-22T02:57:17.248746 #1029097] INFO -- : This is free software; see the source for copying conditions. There is NO I, [2024-05-22T02:57:17.248755 #1029097] INFO -- : warranty; not even for MERCHANTABILITY or FITNESS FOR A PARTICULAR PURPOSE. I, [2024-05-22T02:57:17.248764 #1029097] INFO -- : I, [2024-05-22T02:57:17.432901 #1029097] INFO -- : builtin_binary.inc updated I, [2024-05-22T02:57:17.436180 #1029097] INFO -- : c5234a9416e4f20f175185e840b25b0f08674d14078ed7083f37e655458e3ca9 builtin_binary.inc I, [2024-05-22T02:57:17.437161 #1029097] INFO -- : compiling /home/opc/ruby/src/master/builtin.c I, [2024-05-22T02:57:17.764716 #1029097] INFO -- : linking static-library libruby-static.a I, [2024-05-22T02:57:20.200862 #1029097] INFO -- : linking ruby I, [2024-05-22T02:57:21.113805 #1029097] INFO -- : $$$[end] "make ruby -j3" exit with 0. I, [2024-05-22T02:57:21.113976 #1029097] INFO -- : $$$[beg] make all -j3 I, [2024-05-22T02:57:21.202770 #1029097] INFO -- : BASERUBY = /usr/local/bin/ruby --disable=gems I, [2024-05-22T02:57:21.202834 #1029097] INFO -- : CC = gcc I, [2024-05-22T02:57:21.202845 #1029097] INFO -- : LD = ld I, [2024-05-22T02:57:21.202854 #1029097] INFO -- : LDSHARED = gcc -shared I, [2024-05-22T02:57:21.202866 #1029097] INFO -- : CFLAGS = -O3 -fno-fast-math -ggdb3 -Wall -Wextra -Wdeprecated-declarations -Wdiv-by-zero -Wduplicated-cond -Wimplicit-function-declaration -Wimplicit-int -Wpointer-arith -Wwrite-strings -Wold-style-definition -Wimplicit-fallthrough=0 -Wmissing-noreturn -Wno-cast-function-type -Wno-constant-logical-operand -Wno-long-long -Wno-missing-field-initializers -Wno-overlength-strings -Wno-packed-bitfield-compat -Wno-parentheses-equality -Wno-self-assign -Wno-tautological-compare -Wno-unused-parameter -Wno-unused-value -Wsuggest-attribute=format -Wsuggest-attribute=noreturn -Wunused-variable -Wmisleading-indentation -Wundef I, [2024-05-22T02:57:21.202878 #1029097] INFO -- : XCFLAGS = -U_FORTIFY_SOURCE -D_FORTIFY_SOURCE=2 -fstack-protector-strong -msign-return-address=all -fno-strict-overflow -fvisibility=hidden -fexcess-precision=standard -DRUBY_EXPORT -fPIE -I. -I.ext/include/aarch64-linux -I/home/opc/ruby/src/master/include -I/home/opc/ruby/src/master -I/home/opc/ruby/src/master/prism -I/home/opc/ruby/src/master/enc/unicode/15.0.0 I, [2024-05-22T02:57:21.202887 #1029097] INFO -- : CPPFLAGS = I, [2024-05-22T02:57:21.202895 #1029097] INFO -- : DLDFLAGS = -Wl,--compress-debug-sections=zlib -fstack-protector-strong -pie I, [2024-05-22T02:57:21.202904 #1029097] INFO -- : SOLIBS = -lz -lrt -lrt -ldl -lcrypt -lm -lpthread I, [2024-05-22T02:57:21.202912 #1029097] INFO -- : LANG = en_US.UTF-8 I, [2024-05-22T02:57:21.202920 #1029097] INFO -- : LC_ALL = I, [2024-05-22T02:57:21.202928 #1029097] INFO -- : LC_CTYPE = I, [2024-05-22T02:57:21.202936 #1029097] INFO -- : MFLAGS = -j3 --jobserver-auth=4,5 I, [2024-05-22T02:57:21.202944 #1029097] INFO -- : RUSTC = rustc I, [2024-05-22T02:57:21.202952 #1029097] INFO -- : YJIT_RUSTC_ARGS = --crate-name=yjit --crate-type=staticlib --edition=2021 -g -C lto=thin -C opt-level=3 -C overflow-checks=on '--out-dir=/home/opc/ruby/build/master/yjit/target/release/' /home/opc/ruby/src/master/yjit/src/lib.rs I, [2024-05-22T02:57:21.203670 #1029097] INFO -- : gcc (GCC) 8.5.0 20210514 (Red Hat 8.5.0-10.1.0.1) I, [2024-05-22T02:57:21.203704 #1029097] INFO -- : Copyright (C) 2018 Free Software Foundation, Inc. I, [2024-05-22T02:57:21.203715 #1029097] INFO -- : This is free software; see the source for copying conditions. There is NO I, [2024-05-22T02:57:21.203724 #1029097] INFO -- : warranty; not even for MERCHANTABILITY or FITNESS FOR A PARTICULAR PURPOSE. I, [2024-05-22T02:57:21.203733 #1029097] INFO -- : I, [2024-05-22T02:57:21.236391 #1029097] INFO -- : generating encdb.h I, [2024-05-22T02:57:21.237845 #1029097] INFO -- : generating enc.mk I, [2024-05-22T02:57:21.274353 #1029097] INFO -- : encdb.h unchanged I, [2024-05-22T02:57:21.479659 #1029097] INFO -- : making srcs under enc I, [2024-05-22T02:57:21.479724 #1029097] INFO -- : making enc I, [2024-05-22T02:57:21.507669 #1029097] INFO -- : make[1]: Entering directory '/home/opc/ruby/build/master' I, [2024-05-22T02:57:21.507755 #1029097] INFO -- : make[1]: Nothing to be done for 'enc'. I, [2024-05-22T02:57:21.507779 #1029097] INFO -- : make[1]: Leaving directory '/home/opc/ruby/build/master' I, [2024-05-22T02:57:21.522015 #1029097] INFO -- : make[1]: Entering directory '/home/opc/ruby/build/master' I, [2024-05-22T02:57:21.522058 #1029097] INFO -- : make[1]: Nothing to be done for 'srcs'. I, [2024-05-22T02:57:21.522072 #1029097] INFO -- : make[1]: Leaving directory '/home/opc/ruby/build/master' I, [2024-05-22T02:57:21.522871 #1029097] INFO -- : generating transdb.h I, [2024-05-22T02:57:21.668212 #1029097] INFO -- : transdb.h unchanged I, [2024-05-22T02:57:21.669683 #1029097] INFO -- : generating makefiles ext/configure-ext.mk I, [2024-05-22T02:57:21.669705 #1029097] INFO -- : making trans I, [2024-05-22T02:57:21.710169 #1029097] INFO -- : ext/configure-ext.mk updated I, [2024-05-22T02:57:21.713398 #1029097] INFO -- : make[1]: Entering directory '/home/opc/ruby/build/master' I, [2024-05-22T02:57:21.718501 #1029097] INFO -- : make[1]: Entering directory '/home/opc/ruby/build/master' I, [2024-05-22T02:57:21.718561 #1029097] INFO -- : make[1]: Nothing to be done for 'trans'. I, [2024-05-22T02:57:21.718600 #1029097] INFO -- : make[1]: Leaving directory '/home/opc/ruby/build/master' I, [2024-05-22T02:57:21.901065 #1029097] INFO -- : making encs I, [2024-05-22T02:57:21.955600 #1029097] INFO -- : make[1]: Entering directory '/home/opc/ruby/build/master' I, [2024-05-22T02:57:21.955687 #1029097] INFO -- : make[1]: Nothing to be done for 'encs'. I, [2024-05-22T02:57:21.955724 #1029097] INFO -- : make[1]: Leaving directory '/home/opc/ruby/build/master' I, [2024-05-22T02:57:22.481826 #1029097] INFO -- : make[1]: Leaving directory '/home/opc/ruby/build/master' I, [2024-05-22T02:57:22.482525 #1029097] INFO -- : generating makefile exts.mk I, [2024-05-22T02:57:22.542194 #1029097] INFO -- : exts.mk unchanged I, [2024-05-22T02:57:22.547097 #1029097] INFO -- : make[1]: Entering directory '/home/opc/ruby/build/master' I, [2024-05-22T02:57:22.654132 #1029097] INFO -- : make[2]: Entering directory '/home/opc/ruby/build/master/ext/coverage' I, [2024-05-22T02:57:22.654243 #1029097] INFO -- : make[2]: Entering directory '/home/opc/ruby/build/master/ext/digest' I, [2024-05-22T02:57:22.656033 #1029097] INFO -- : make[2]: Entering directory '/home/opc/ruby/build/master/ext/date' I, [2024-05-22T02:57:22.658834 #1029097] INFO -- : make[2]: Leaving directory '/home/opc/ruby/build/master/ext/coverage' I, [2024-05-22T02:57:22.661435 #1029097] INFO -- : make[2]: Leaving directory '/home/opc/ruby/build/master/ext/date' I, [2024-05-22T02:57:22.663530 #1029097] INFO -- : make[2]: Leaving directory '/home/opc/ruby/build/master/ext/digest' I, [2024-05-22T02:57:22.669881 #1029097] INFO -- : make[2]: Entering directory '/home/opc/ruby/build/master/ext/io/console' I, [2024-05-22T02:57:22.671040 #1029097] INFO -- : make[2]: Entering directory '/home/opc/ruby/build/master/ext/fiddle' I, [2024-05-22T02:57:22.673993 #1029097] INFO -- : make[2]: Leaving directory '/home/opc/ruby/build/master/ext/io/console' I, [2024-05-22T02:57:22.676095 #1029097] INFO -- : make[2]: Entering directory '/home/opc/ruby/build/master/ext/json' I, [2024-05-22T02:57:22.679997 #1029097] INFO -- : make[2]: Entering directory '/home/opc/ruby/build/master/ext/monitor' I, [2024-05-22T02:57:22.681472 #1029097] INFO -- : make[2]: Leaving directory '/home/opc/ruby/build/master/ext/fiddle' I, [2024-05-22T02:57:22.684358 #1029097] INFO -- : make[2]: Leaving directory '/home/opc/ruby/build/master/ext/monitor' I, [2024-05-22T02:57:22.685660 #1029097] INFO -- : make[2]: Leaving directory '/home/opc/ruby/build/master/ext/json' I, [2024-05-22T02:57:22.687478 #1029097] INFO -- : make[2]: Entering directory '/home/opc/ruby/build/master/ext/objspace' I, [2024-05-22T02:57:22.689795 #1029097] INFO -- : make[2]: Entering directory '/home/opc/ruby/build/master/ext/pathname' I, [2024-05-22T02:57:22.693469 #1029097] INFO -- : make[2]: Leaving directory '/home/opc/ruby/build/master/ext/objspace' I, [2024-05-22T02:57:22.694651 #1029097] INFO -- : make[2]: Leaving directory '/home/opc/ruby/build/master/ext/pathname' I, [2024-05-22T02:57:22.698955 #1029097] INFO -- : make[2]: Entering directory '/home/opc/ruby/build/master/ext/pty' I, [2024-05-22T02:57:22.699692 #1029097] INFO -- : make[2]: Entering directory '/home/opc/ruby/build/master/ext/psych' I, [2024-05-22T02:57:22.704387 #1029097] INFO -- : make[2]: Entering directory '/home/opc/ruby/build/master/ext/openssl' I, [2024-05-22T02:57:22.706849 #1029097] INFO -- : make[2]: Leaving directory '/home/opc/ruby/build/master/ext/pty' I, [2024-05-22T02:57:22.715137 #1029097] INFO -- : make[2]: Leaving directory '/home/opc/ruby/build/master/ext/psych' I, [2024-05-22T02:57:22.716969 #1029097] INFO -- : make[2]: Entering directory '/home/opc/ruby/build/master/ext/rubyvm' I, [2024-05-22T02:57:22.721161 #1029097] INFO -- : make[2]: Leaving directory '/home/opc/ruby/build/master/ext/rubyvm' I, [2024-05-22T02:57:22.722938 #1029097] INFO -- : make[2]: Entering directory '/home/opc/ruby/build/master/ext/ripper' I, [2024-05-22T02:57:22.729820 #1029097] INFO -- : make[2]: Leaving directory '/home/opc/ruby/build/master/ext/openssl' I, [2024-05-22T02:57:22.730398 #1029097] INFO -- : make[2]: Leaving directory '/home/opc/ruby/build/master/ext/ripper' I, [2024-05-22T02:57:22.733811 #1029097] INFO -- : make[2]: Entering directory '/home/opc/ruby/build/master/ext/socket' I, [2024-05-22T02:57:22.737913 #1029097] INFO -- : make[2]: Entering directory '/home/opc/ruby/build/master/.bundle/gems/bigdecimal-3.1.7/ext/bigdecimal' I, [2024-05-22T02:57:22.742523 #1029097] INFO -- : make[2]: Entering directory '/home/opc/ruby/build/master/.bundle/gems/bigdecimal-3.1.8/ext/bigdecimal' I, [2024-05-22T02:57:22.745766 #1029097] INFO -- : make[2]: Leaving directory '/home/opc/ruby/build/master/ext/socket' I, [2024-05-22T02:57:22.749420 #1029097] INFO -- : make[2]: Entering directory '/home/opc/ruby/build/master/.bundle/gems/debug-1.9.2/ext/debug' I, [2024-05-22T02:57:22.768711 #1029097] INFO -- : make[2]: Leaving directory '/home/opc/ruby/build/master/.bundle/gems/bigdecimal-3.1.7/ext/bigdecimal' I, [2024-05-22T02:57:22.774345 #1029097] INFO -- : make[2]: Entering directory '/home/opc/ruby/build/master/.bundle/gems/nkf-0.2.0/ext/nkf' I, [2024-05-22T02:57:22.774942 #1029097] INFO -- : make[2]: Leaving directory '/home/opc/ruby/build/master/.bundle/gems/bigdecimal-3.1.8/ext/bigdecimal' I, [2024-05-22T02:57:22.780662 #1029097] INFO -- : make[2]: Entering directory '/home/opc/ruby/build/master/.bundle/gems/racc-1.7.3/ext/racc/cparse' I, [2024-05-22T02:57:22.782556 #1029097] INFO -- : make[2]: Leaving directory '/home/opc/ruby/build/master/.bundle/gems/debug-1.9.2/ext/debug' I, [2024-05-22T02:57:22.784937 #1029097] INFO -- : make[2]: Entering directory '/home/opc/ruby/build/master/.bundle/gems/racc-1.8.0/ext/racc/cparse' I, [2024-05-22T02:57:22.804819 #1029097] INFO -- : make[2]: Leaving directory '/home/opc/ruby/build/master/.bundle/gems/nkf-0.2.0/ext/nkf' I, [2024-05-22T02:57:22.807790 #1029097] INFO -- : make[2]: Entering directory '/home/opc/ruby/build/master/.bundle/gems/rbs-3.4.4/ext/rbs_extension' I, [2024-05-22T02:57:22.813131 #1029097] INFO -- : make[2]: Leaving directory '/home/opc/ruby/build/master/.bundle/gems/racc-1.7.3/ext/racc/cparse' I, [2024-05-22T02:57:22.817778 #1029097] INFO -- : make[2]: Leaving directory '/home/opc/ruby/build/master/.bundle/gems/racc-1.8.0/ext/racc/cparse' I, [2024-05-22T02:57:22.818495 #1029097] INFO -- : make[2]: Entering directory '/home/opc/ruby/build/master/.bundle/gems/syslog-0.1.2/ext/syslog' I, [2024-05-22T02:57:22.839413 #1029097] INFO -- : make[2]: Leaving directory '/home/opc/ruby/build/master/.bundle/gems/rbs-3.4.4/ext/rbs_extension' I, [2024-05-22T02:57:22.843841 #1029097] INFO -- : make[2]: Entering directory '/home/opc/ruby/build/master/ext/digest/sha2' I, [2024-05-22T02:57:22.850822 #1029097] INFO -- : make[2]: Leaving directory '/home/opc/ruby/build/master/.bundle/gems/syslog-0.1.2/ext/syslog' I, [2024-05-22T02:57:22.851336 #1029097] INFO -- : make[2]: Leaving directory '/home/opc/ruby/build/master/ext/digest/sha2' I, [2024-05-22T02:57:22.890510 #1029097] INFO -- : make[2]: Entering directory '/home/opc/ruby/build/master' I, [2024-05-22T02:57:22.974056 #1029097] INFO -- : make[2]: 'ruby' is up to date. I, [2024-05-22T02:57:22.974137 #1029097] INFO -- : make[2]: Leaving directory '/home/opc/ruby/build/master' I, [2024-05-22T02:57:22.974263 #1029097] INFO -- : make[1]: Leaving directory '/home/opc/ruby/build/master' I, [2024-05-22T02:57:22.978799 #1029097] INFO -- : make[1]: Entering directory '/home/opc/ruby/build/master' I, [2024-05-22T02:57:22.978835 #1029097] INFO -- : make[1]: Nothing to be done for 'note'. I, [2024-05-22T02:57:22.978845 #1029097] INFO -- : make[1]: Leaving directory '/home/opc/ruby/build/master' I, [2024-05-22T02:57:22.979159 #1029097] INFO -- : $$$[end] "make all -j3" exit with 0. I, [2024-05-22T02:57:22.979296 #1029097] INFO -- : $$$[beg] make install -j3 I, [2024-05-22T02:57:23.076810 #1029097] INFO -- : Update power_assert to 84e85124c5014a139af39161d484156cfe87a9ed I, [2024-05-22T02:57:23.076984 #1029097] INFO -- : Update rbs to ba7872795d5de04adb8ff500c0e6afdc81a041dd I, [2024-05-22T02:57:23.077943 #1029097] INFO -- : Update typeprof to b19a6416da3a05d57fadd6ffdadb382b6d236ca5 I, [2024-05-22T02:57:23.080774 #1029097] INFO -- : echo 84e85124c5014a139af39161d484156cfe87a9ed | /bin/sh /home/opc/ruby/src/master/tool/ifchange /home/opc/ruby/src/master/.bundle/.timestamp/power_assert.revision - I, [2024-05-22T02:57:23.081385 #1029097] INFO -- : echo ba7872795d5de04adb8ff500c0e6afdc81a041dd | /bin/sh /home/opc/ruby/src/master/tool/ifchange /home/opc/ruby/src/master/.bundle/.timestamp/rbs.revision - I, [2024-05-22T02:57:23.082494 #1029097] INFO -- : echo b19a6416da3a05d57fadd6ffdadb382b6d236ca5 | /bin/sh /home/opc/ruby/src/master/tool/ifchange /home/opc/ruby/src/master/.bundle/.timestamp/typeprof.revision - I, [2024-05-22T02:57:23.086441 #1029097] INFO -- : /home/opc/ruby/src/master/.bundle/.timestamp/power_assert.revision unchanged I, [2024-05-22T02:57:23.087950 #1029097] INFO -- : /home/opc/ruby/src/master/.bundle/.timestamp/rbs.revision unchanged I, [2024-05-22T02:57:23.088121 #1029097] INFO -- : /home/opc/ruby/src/master/.bundle/.timestamp/typeprof.revision unchanged I, [2024-05-22T02:57:23.090113 #1029097] INFO -- : BASERUBY = /usr/local/bin/ruby --disable=gems I, [2024-05-22T02:57:23.090180 #1029097] INFO -- : CC = gcc I, [2024-05-22T02:57:23.090215 #1029097] INFO -- : LD = ld I, [2024-05-22T02:57:23.090245 #1029097] INFO -- : LDSHARED = gcc -shared I, [2024-05-22T02:57:23.090288 #1029097] INFO -- : CFLAGS = -O3 -fno-fast-math -ggdb3 -Wall -Wextra -Wdeprecated-declarations -Wdiv-by-zero -Wduplicated-cond -Wimplicit-function-declaration -Wimplicit-int -Wpointer-arith -Wwrite-strings -Wold-style-definition -Wimplicit-fallthrough=0 -Wmissing-noreturn -Wno-cast-function-type -Wno-constant-logical-operand -Wno-long-long -Wno-missing-field-initializers -Wno-overlength-strings -Wno-packed-bitfield-compat -Wno-parentheses-equality -Wno-self-assign -Wno-tautological-compare -Wno-unused-parameter -Wno-unused-value -Wsuggest-attribute=format -Wsuggest-attribute=noreturn -Wunused-variable -Wmisleading-indentation -Wundef I, [2024-05-22T02:57:23.090328 #1029097] INFO -- : XCFLAGS = -U_FORTIFY_SOURCE -D_FORTIFY_SOURCE=2 -fstack-protector-strong -msign-return-address=all -fno-strict-overflow -fvisibility=hidden -fexcess-precision=standard -DRUBY_EXPORT -fPIE -I. -I.ext/include/aarch64-linux -I/home/opc/ruby/src/master/include -I/home/opc/ruby/src/master -I/home/opc/ruby/src/master/prism -I/home/opc/ruby/src/master/enc/unicode/15.0.0 I, [2024-05-22T02:57:23.090363 #1029097] INFO -- : CPPFLAGS = I, [2024-05-22T02:57:23.090397 #1029097] INFO -- : DLDFLAGS = -Wl,--compress-debug-sections=zlib -fstack-protector-strong -pie I, [2024-05-22T02:57:23.090431 #1029097] INFO -- : SOLIBS = -lz -lrt -lrt -ldl -lcrypt -lm -lpthread I, [2024-05-22T02:57:23.090465 #1029097] INFO -- : LANG = en_US.UTF-8 I, [2024-05-22T02:57:23.090498 #1029097] INFO -- : LC_ALL = I, [2024-05-22T02:57:23.090531 #1029097] INFO -- : LC_CTYPE = I, [2024-05-22T02:57:23.090563 #1029097] INFO -- : MFLAGS = -j3 --jobserver-auth=4,5 I, [2024-05-22T02:57:23.090599 #1029097] INFO -- : RUSTC = rustc I, [2024-05-22T02:57:23.090636 #1029097] INFO -- : YJIT_RUSTC_ARGS = --crate-name=yjit --crate-type=staticlib --edition=2021 -g -C lto=thin -C opt-level=3 -C overflow-checks=on '--out-dir=/home/opc/ruby/build/master/yjit/target/release/' /home/opc/ruby/src/master/yjit/src/lib.rs I, [2024-05-22T02:57:23.121370 #1029097] INFO -- : generating encdb.h I, [2024-05-22T02:57:23.121444 #1029097] INFO -- : gcc (GCC) 8.5.0 20210514 (Red Hat 8.5.0-10.1.0.1) I, [2024-05-22T02:57:23.121454 #1029097] INFO -- : Copyright (C) 2018 Free Software Foundation, Inc. I, [2024-05-22T02:57:23.121462 #1029097] INFO -- : This is free software; see the source for copying conditions. There is NO I, [2024-05-22T02:57:23.121471 #1029097] INFO -- : warranty; not even for MERCHANTABILITY or FITNESS FOR A PARTICULAR PURPOSE. I, [2024-05-22T02:57:23.121483 #1029097] INFO -- : I, [2024-05-22T02:57:23.122038 #1029097] INFO -- : generating enc.mk I, [2024-05-22T02:57:23.165025 #1029097] INFO -- : encdb.h unchanged I, [2024-05-22T02:57:23.259043 #1029097] INFO -- : Building power_assert@84e85124c5014a139af39161d484156cfe87a9ed to /home/opc/ruby/src/master/gems/power_assert-2.0.3.gem I, [2024-05-22T02:57:23.361782 #1029097] INFO -- : making srcs under enc I, [2024-05-22T02:57:23.362254 #1029097] INFO -- : making enc I, [2024-05-22T02:57:23.376745 #1029097] INFO -- : Successfully built RubyGem I, [2024-05-22T02:57:23.376793 #1029097] INFO -- : Name: power_assert I, [2024-05-22T02:57:23.376803 #1029097] INFO -- : Version: 2.0.4dev I, [2024-05-22T02:57:23.376812 #1029097] INFO -- : File: power_assert-2.0.4dev.gem I, [2024-05-22T02:57:23.379273 #1029097] INFO -- : Extracting bundle gem power_assert-2.0.3... I, [2024-05-22T02:57:23.390304 #1029097] INFO -- : make[1]: Entering directory '/home/opc/ruby/build/master' I, [2024-05-22T02:57:23.390388 #1029097] INFO -- : make[1]: Nothing to be done for 'enc'. I, [2024-05-22T02:57:23.390422 #1029097] INFO -- : make[1]: Leaving directory '/home/opc/ruby/build/master' I, [2024-05-22T02:57:23.403956 #1029097] INFO -- : make[1]: Entering directory '/home/opc/ruby/build/master' I, [2024-05-22T02:57:23.404017 #1029097] INFO -- : make[1]: Nothing to be done for 'srcs'. I, [2024-05-22T02:57:23.404038 #1029097] INFO -- : make[1]: Leaving directory '/home/opc/ruby/build/master' I, [2024-05-22T02:57:23.404900 #1029097] INFO -- : generating transdb.h I, [2024-05-22T02:57:23.477960 #1029097] INFO -- : Try with hash version of bundled gems instead of gems/power_assert-2.0.3.gem. We don't use this gem with release version of Ruby. I, [2024-05-22T02:57:23.488181 #1029097] INFO -- : Unpacked gems/power_assert-2.0.4dev.gem I, [2024-05-22T02:57:23.550453 #1029097] INFO -- : transdb.h unchanged I, [2024-05-22T02:57:23.551805 #1029097] INFO -- : generating makefiles ext/configure-ext.mk I, [2024-05-22T02:57:23.552030 #1029097] INFO -- : making trans I, [2024-05-22T02:57:23.592342 #1029097] INFO -- : ext/configure-ext.mk unchanged I, [2024-05-22T02:57:23.595414 #1029097] INFO -- : make[1]: Entering directory '/home/opc/ruby/build/master' I, [2024-05-22T02:57:23.600238 #1029097] INFO -- : make[1]: Entering directory '/home/opc/ruby/build/master' I, [2024-05-22T02:57:23.600311 #1029097] INFO -- : make[1]: Nothing to be done for 'trans'. I, [2024-05-22T02:57:23.600347 #1029097] INFO -- : make[1]: Leaving directory '/home/opc/ruby/build/master' I, [2024-05-22T02:57:24.304740 #1029097] INFO -- : making encs I, [2024-05-22T02:57:24.357320 #1029097] INFO -- : make[1]: Entering directory '/home/opc/ruby/build/master' I, [2024-05-22T02:57:24.357396 #1029097] INFO -- : make[1]: Nothing to be done for 'encs'. I, [2024-05-22T02:57:24.357426 #1029097] INFO -- : make[1]: Leaving directory '/home/opc/ruby/build/master' I, [2024-05-22T02:57:24.362928 #1029097] INFO -- : make[1]: Leaving directory '/home/opc/ruby/build/master' I, [2024-05-22T02:57:24.363603 #1029097] INFO -- : generating makefile exts.mk I, [2024-05-22T02:57:24.423900 #1029097] INFO -- : exts.mk unchanged I, [2024-05-22T02:57:24.428821 #1029097] INFO -- : make[1]: Entering directory '/home/opc/ruby/build/master' I, [2024-05-22T02:57:24.535839 #1029097] INFO -- : make[2]: Entering directory '/home/opc/ruby/build/master/ext/coverage' I, [2024-05-22T02:57:24.538006 #1029097] INFO -- : make[2]: Entering directory '/home/opc/ruby/build/master/ext/date' I, [2024-05-22T02:57:24.538193 #1029097] INFO -- : make[2]: Entering directory '/home/opc/ruby/build/master/ext/digest' I, [2024-05-22T02:57:24.540754 #1029097] INFO -- : make[2]: Leaving directory '/home/opc/ruby/build/master/ext/coverage' I, [2024-05-22T02:57:24.543154 #1029097] INFO -- : make[2]: Leaving directory '/home/opc/ruby/build/master/ext/date' I, [2024-05-22T02:57:24.546934 #1029097] INFO -- : make[2]: Leaving directory '/home/opc/ruby/build/master/ext/digest' I, [2024-05-22T02:57:24.551792 #1029097] INFO -- : make[2]: Entering directory '/home/opc/ruby/build/master/ext/io/console' I, [2024-05-22T02:57:24.554193 #1029097] INFO -- : make[2]: Entering directory '/home/opc/ruby/build/master/ext/fiddle' I, [2024-05-22T02:57:24.555971 #1029097] INFO -- : make[2]: Leaving directory '/home/opc/ruby/build/master/ext/io/console' I, [2024-05-22T02:57:24.557992 #1029097] INFO -- : make[2]: Entering directory '/home/opc/ruby/build/master/ext/json' I, [2024-05-22T02:57:24.561745 #1029097] INFO -- : make[2]: Entering directory '/home/opc/ruby/build/master/ext/monitor' I, [2024-05-22T02:57:24.564686 #1029097] INFO -- : make[2]: Leaving directory '/home/opc/ruby/build/master/ext/fiddle' I, [2024-05-22T02:57:24.566305 #1029097] INFO -- : make[2]: Leaving directory '/home/opc/ruby/build/master/ext/monitor' I, [2024-05-22T02:57:24.567455 #1029097] INFO -- : make[2]: Leaving directory '/home/opc/ruby/build/master/ext/json' I, [2024-05-22T02:57:24.570840 #1029097] INFO -- : make[2]: Entering directory '/home/opc/ruby/build/master/ext/objspace' I, [2024-05-22T02:57:24.571405 #1029097] INFO -- : make[2]: Entering directory '/home/opc/ruby/build/master/ext/pathname' I, [2024-05-22T02:57:24.575475 #1029097] INFO -- : make[2]: Leaving directory '/home/opc/ruby/build/master/ext/pathname' I, [2024-05-22T02:57:24.577089 #1029097] INFO -- : make[2]: Leaving directory '/home/opc/ruby/build/master/ext/objspace' I, [2024-05-22T02:57:24.581416 #1029097] INFO -- : make[2]: Entering directory '/home/opc/ruby/build/master/ext/pty' I, [2024-05-22T02:57:24.581625 #1029097] INFO -- : make[2]: Entering directory '/home/opc/ruby/build/master/ext/psych' I, [2024-05-22T02:57:24.585841 #1029097] INFO -- : make[2]: Leaving directory '/home/opc/ruby/build/master/ext/pty' I, [2024-05-22T02:57:24.585897 #1029097] INFO -- : make[2]: Entering directory '/home/opc/ruby/build/master/ext/openssl' I, [2024-05-22T02:57:24.601794 #1029097] INFO -- : make[2]: Leaving directory '/home/opc/ruby/build/master/ext/psych' I, [2024-05-22T02:57:24.604345 #1029097] INFO -- : make[2]: Entering directory '/home/opc/ruby/build/master/ext/ripper' I, [2024-05-22T02:57:24.604737 #1029097] INFO -- : make[2]: Leaving directory '/home/opc/ruby/build/master/ext/openssl' I, [2024-05-22T02:57:24.605908 #1029097] INFO -- : make[2]: Entering directory '/home/opc/ruby/build/master/ext/rubyvm' I, [2024-05-22T02:57:24.609562 #1029097] INFO -- : make[2]: Leaving directory '/home/opc/ruby/build/master/ext/rubyvm' I, [2024-05-22T02:57:24.612387 #1029097] INFO -- : make[2]: Leaving directory '/home/opc/ruby/build/master/ext/ripper' I, [2024-05-22T02:57:24.617354 #1029097] INFO -- : make[2]: Entering directory '/home/opc/ruby/build/master/ext/socket' I, [2024-05-22T02:57:24.618979 #1029097] INFO -- : make[2]: Entering directory '/home/opc/ruby/build/master/.bundle/gems/bigdecimal-3.1.7/ext/bigdecimal' I, [2024-05-22T02:57:24.620539 #1029097] INFO -- : make[2]: Entering directory '/home/opc/ruby/build/master/.bundle/gems/bigdecimal-3.1.8/ext/bigdecimal' I, [2024-05-22T02:57:24.629525 #1029097] INFO -- : make[2]: Leaving directory '/home/opc/ruby/build/master/ext/socket' I, [2024-05-22T02:57:24.632104 #1029097] INFO -- : make[2]: Entering directory '/home/opc/ruby/build/master/.bundle/gems/debug-1.9.2/ext/debug' I, [2024-05-22T02:57:24.650662 #1029097] INFO -- : make[2]: Leaving directory '/home/opc/ruby/build/master/.bundle/gems/bigdecimal-3.1.7/ext/bigdecimal' I, [2024-05-22T02:57:24.651889 #1029097] INFO -- : make[2]: Leaving directory '/home/opc/ruby/build/master/.bundle/gems/bigdecimal-3.1.8/ext/bigdecimal' I, [2024-05-22T02:57:24.653601 #1029097] INFO -- : make[2]: Entering directory '/home/opc/ruby/build/master/.bundle/gems/nkf-0.2.0/ext/nkf' I, [2024-05-22T02:57:24.660148 #1029097] INFO -- : make[2]: Entering directory '/home/opc/ruby/build/master/.bundle/gems/racc-1.7.3/ext/racc/cparse' I, [2024-05-22T02:57:24.664294 #1029097] INFO -- : make[2]: Leaving directory '/home/opc/ruby/build/master/.bundle/gems/debug-1.9.2/ext/debug' I, [2024-05-22T02:57:24.669288 #1029097] INFO -- : make[2]: Entering directory '/home/opc/ruby/build/master/.bundle/gems/racc-1.8.0/ext/racc/cparse' I, [2024-05-22T02:57:24.683443 #1029097] INFO -- : make[2]: Leaving directory '/home/opc/ruby/build/master/.bundle/gems/nkf-0.2.0/ext/nkf' I, [2024-05-22T02:57:24.687146 #1029097] INFO -- : make[2]: Entering directory '/home/opc/ruby/build/master/.bundle/gems/rbs-3.4.4/ext/rbs_extension' I, [2024-05-22T02:57:24.691795 #1029097] INFO -- : make[2]: Leaving directory '/home/opc/ruby/build/master/.bundle/gems/racc-1.7.3/ext/racc/cparse' I, [2024-05-22T02:57:24.694646 #1029097] INFO -- : make[2]: Entering directory '/home/opc/ruby/build/master/.bundle/gems/syslog-0.1.2/ext/syslog' I, [2024-05-22T02:57:24.701825 #1029097] INFO -- : make[2]: Leaving directory '/home/opc/ruby/build/master/.bundle/gems/racc-1.8.0/ext/racc/cparse' I, [2024-05-22T02:57:24.719160 #1029097] INFO -- : make[2]: Leaving directory '/home/opc/ruby/build/master/.bundle/gems/rbs-3.4.4/ext/rbs_extension' I, [2024-05-22T02:57:24.723595 #1029097] INFO -- : make[2]: Entering directory '/home/opc/ruby/build/master/ext/digest/sha2' I, [2024-05-22T02:57:24.729956 #1029097] INFO -- : make[2]: Leaving directory '/home/opc/ruby/build/master/.bundle/gems/syslog-0.1.2/ext/syslog' I, [2024-05-22T02:57:24.731075 #1029097] INFO -- : make[2]: Leaving directory '/home/opc/ruby/build/master/ext/digest/sha2' I, [2024-05-22T02:57:24.771668 #1029097] INFO -- : make[2]: Entering directory '/home/opc/ruby/build/master' I, [2024-05-22T02:57:24.856112 #1029097] INFO -- : make[2]: 'ruby' is up to date. I, [2024-05-22T02:57:24.856193 #1029097] INFO -- : make[2]: Leaving directory '/home/opc/ruby/build/master' I, [2024-05-22T02:57:24.856421 #1029097] INFO -- : make[1]: Leaving directory '/home/opc/ruby/build/master' I, [2024-05-22T02:57:24.860875 #1029097] INFO -- : make[1]: Entering directory '/home/opc/ruby/build/master' I, [2024-05-22T02:57:24.860915 #1029097] INFO -- : make[1]: Nothing to be done for 'note'. I, [2024-05-22T02:57:24.860927 #1029097] INFO -- : make[1]: Leaving directory '/home/opc/ruby/build/master' I, [2024-05-22T02:57:24.861054 #1029097] INFO -- : ./miniruby -I/home/opc/ruby/src/master/lib -I. -I.ext/common /home/opc/ruby/src/master/tool/runruby.rb --extout=.ext -- --disable-gems -r./aarch64-linux-fake /home/opc/ruby/src/master/tool/rbinstall.rb --make="make" --dest-dir="" --extout=".ext" --ext-build-dir="./ext" --mflags="-j3 --jobserver-auth=4,5" --make-flags=" -j3 --jobserver-auth=4,5" --data-mode=0644 --prog-mode=0755 --installed-list .installed.list --mantype="doc" --gnumake --install=all --exclude=doc I, [2024-05-22T02:57:25.017338 #1029097] INFO -- : Installing to I, [2024-05-22T02:57:25.017407 #1029097] INFO -- : installing binary commands: /home/opc/ruby/install/master/bin I, [2024-05-22T02:57:25.029280 #1029097] INFO -- : installing base libraries: /home/opc/ruby/install/master/lib I, [2024-05-22T02:57:25.029816 #1029097] INFO -- : installing arch files: /home/opc/ruby/install/master/lib/ruby/3.4.0+0/aarch64-linux I, [2024-05-22T02:57:25.029919 #1029097] INFO -- : installing pkgconfig data: /home/opc/ruby/install/master/lib/pkgconfig I, [2024-05-22T02:57:25.029995 #1029097] INFO -- : installing extension objects: /home/opc/ruby/install/master/lib/ruby/3.4.0+0/aarch64-linux I, [2024-05-22T02:57:25.042914 #1029097] INFO -- : installing extension objects: /home/opc/ruby/install/master/lib/ruby/site_ruby/3.4.0+0/aarch64-linux I, [2024-05-22T02:57:25.042936 #1029097] INFO -- : installing extension objects: /home/opc/ruby/install/master/lib/ruby/vendor_ruby/3.4.0+0/aarch64-linux I, [2024-05-22T02:57:25.043066 #1029097] INFO -- : installing extension headers: /home/opc/ruby/install/master/include/ruby-3.4.0+0/aarch64-linux I, [2024-05-22T02:57:25.043364 #1029097] INFO -- : installing extension scripts: /home/opc/ruby/install/master/lib/ruby/3.4.0+0 I, [2024-05-22T02:57:25.051421 #1029097] INFO -- : installing extension scripts: /home/opc/ruby/install/master/lib/ruby/site_ruby/3.4.0+0 I, [2024-05-22T02:57:25.051442 #1029097] INFO -- : installing extension scripts: /home/opc/ruby/install/master/lib/ruby/vendor_ruby/3.4.0+0 I, [2024-05-22T02:57:25.051454 #1029097] INFO -- : installing extension headers: /home/opc/ruby/install/master/include/ruby-3.4.0+0/ruby I, [2024-05-22T02:57:25.051594 #1029097] INFO -- : installing command scripts: /home/opc/ruby/install/master/bin I, [2024-05-22T02:57:25.051730 #1029097] INFO -- : installing library scripts: /home/opc/ruby/install/master/lib/ruby/3.4.0+0 I, [2024-05-22T02:57:25.134703 #1029097] INFO -- : installing common headers: /home/opc/ruby/install/master/include/ruby-3.4.0+0 I, [2024-05-22T02:57:25.146901 #1029097] INFO -- : installing manpages: /home/opc/ruby/install/master/share/man/man1 I, [2024-05-22T02:57:25.147189 #1029097] INFO -- : installing default gems from lib: /home/opc/ruby/install/master/lib/ruby/gems/3.4.0+0 I, [2024-05-22T02:57:25.193998 #1029097] INFO -- : benchmark 0.3.0 I, [2024-05-22T02:57:25.198144 #1029097] INFO -- : bundler 2.6.0.dev I, [2024-05-22T02:57:25.202903 #1029097] INFO -- : cgi 0.4.1 I, [2024-05-22T02:57:25.204090 #1029097] INFO -- : delegate 0.3.1 I, [2024-05-22T02:57:25.205268 #1029097] INFO -- : did_you_mean 1.6.3 I, [2024-05-22T02:57:25.206443 #1029097] INFO -- : english 0.8.0 I, [2024-05-22T02:57:25.208784 #1029097] INFO -- : erb 4.0.4 I, [2024-05-22T02:57:25.211713 #1029097] INFO -- : error_highlight 0.6.0 I, [2024-05-22T02:57:25.212831 #1029097] INFO -- : fileutils 1.7.2 I, [2024-05-22T02:57:25.214009 #1029097] INFO -- : find 0.2.0 I, [2024-05-22T02:57:25.215101 #1029097] INFO -- : forwardable 1.3.3 I, [2024-05-22T02:57:25.216182 #1029097] INFO -- : ipaddr 1.2.6 I, [2024-05-22T02:57:25.217344 #1029097] INFO -- : irb 1.13.1 I, [2024-05-22T02:57:25.220018 #1029097] INFO -- : logger 1.6.0 I, [2024-05-22T02:57:25.221172 #1029097] INFO -- : net-http 0.4.1 I, [2024-05-22T02:57:25.222372 #1029097] INFO -- : net-protocol 0.2.2 I, [2024-05-22T02:57:25.223548 #1029097] INFO -- : open-uri 0.4.1 I, [2024-05-22T02:57:25.224781 #1029097] INFO -- : open3 0.2.1 I, [2024-05-22T02:57:25.226029 #1029097] INFO -- : optparse 0.5.0 I, [2024-05-22T02:57:25.227230 #1029097] INFO -- : ostruct 0.6.0 I, [2024-05-22T02:57:25.228324 #1029097] INFO -- : pp 0.5.0 I, [2024-05-22T02:57:25.229571 #1029097] INFO -- : prettyprint 0.2.0 I, [2024-05-22T02:57:25.230694 #1029097] INFO -- : prism 0.29.0 I, [2024-05-22T02:57:25.231983 #1029097] INFO -- : pstore 0.1.3 I, [2024-05-22T02:57:25.233264 #1029097] INFO -- : rdoc 6.6.3.1 I, [2024-05-22T02:57:25.237420 #1029097] INFO -- : readline 0.0.4 I, [2024-05-22T02:57:25.238561 #1029097] INFO -- : reline 0.5.7 I, [2024-05-22T02:57:25.239744 #1029097] INFO -- : resolv 0.4.0 I, [2024-05-22T02:57:25.240910 #1029097] INFO -- : ruby2_keywords 0.0.5 I, [2024-05-22T02:57:25.243956 #1029097] INFO -- : securerandom 0.3.1 I, [2024-05-22T02:57:25.245179 #1029097] INFO -- : set 1.1.0 I, [2024-05-22T02:57:25.246362 #1029097] INFO -- : shellwords 0.2.0 I, [2024-05-22T02:57:25.247515 #1029097] INFO -- : singleton 0.2.0 I, [2024-05-22T02:57:25.248708 #1029097] INFO -- : syntax_suggest 2.0.0 I, [2024-05-22T02:57:25.251503 #1029097] INFO -- : tempfile 0.2.1 I, [2024-05-22T02:57:25.252673 #1029097] INFO -- : time 0.3.0 I, [2024-05-22T02:57:25.253895 #1029097] INFO -- : timeout 0.4.1 I, [2024-05-22T02:57:25.255005 #1029097] INFO -- : tmpdir 0.2.0 I, [2024-05-22T02:57:25.256145 #1029097] INFO -- : tsort 0.2.0 I, [2024-05-22T02:57:25.257352 #1029097] INFO -- : un 0.3.0 I, [2024-05-22T02:57:25.258704 #1029097] INFO -- : uri 0.13.0 I, [2024-05-22T02:57:25.259887 #1029097] INFO -- : weakref 0.1.3 I, [2024-05-22T02:57:25.261074 #1029097] INFO -- : yaml 0.3.0 I, [2024-05-22T02:57:25.262082 #1029097] INFO -- : installing default gems from ext: /home/opc/ruby/install/master/lib/ruby/gems/3.4.0+0 I, [2024-05-22T02:57:25.271590 #1029097] INFO -- : date 3.3.4 I, [2024-05-22T02:57:25.274702 #1029097] INFO -- : digest 3.1.1 I, [2024-05-22T02:57:25.275816 #1029097] INFO -- : etc 1.4.3 I, [2024-05-22T02:57:25.277004 #1029097] INFO -- : fcntl 1.1.0 I, [2024-05-22T02:57:25.278169 #1029097] INFO -- : fiddle 1.1.3 I, [2024-05-22T02:57:25.279295 #1029097] INFO -- : io-console 0.7.2 I, [2024-05-22T02:57:25.280385 #1029097] INFO -- : io-nonblock 0.3.0 I, [2024-05-22T02:57:25.281565 #1029097] INFO -- : io-wait 0.3.1 I, [2024-05-22T02:57:25.282624 #1029097] INFO -- : json 2.7.2 I, [2024-05-22T02:57:25.283827 #1029097] INFO -- : openssl 3.2.0 I, [2024-05-22T02:57:25.285090 #1029097] INFO -- : pathname 0.3.0 I, [2024-05-22T02:57:25.286702 #1029097] INFO -- : psych 5.1.2 I, [2024-05-22T02:57:25.287922 #1029097] INFO -- : stringio 3.1.1 I, [2024-05-22T02:57:25.289083 #1029097] INFO -- : strscan 3.1.1 I, [2024-05-22T02:57:25.290185 #1029097] INFO -- : zlib 3.1.0 I, [2024-05-22T02:57:25.291091 #1029097] INFO -- : installing bundled gems: /home/opc/ruby/install/master/lib/ruby/gems/3.4.0+0 I, [2024-05-22T02:57:25.292062 #1029097] INFO -- : minitest 5.23.0 I, [2024-05-22T02:57:25.313245 #1029097] INFO -- : rake 13.2.1 I, [2024-05-22T02:57:25.327570 #1029097] INFO -- : test-unit 3.6.2 I, [2024-05-22T02:57:25.344625 #1029097] INFO -- : rexml 3.2.8 I, [2024-05-22T02:57:25.368571 #1029097] INFO -- : rss 0.3.0 I, [2024-05-22T02:57:25.376019 #1029097] INFO -- : net-ftp 0.3.4 I, [2024-05-22T02:57:25.381683 #1029097] INFO -- : net-imap 0.4.11 I, [2024-05-22T02:57:25.397064 #1029097] INFO -- : net-pop 0.1.2 I, [2024-05-22T02:57:25.400287 #1029097] INFO -- : net-smtp 0.5.0 I, [2024-05-22T02:57:25.404318 #1029097] INFO -- : matrix 0.4.2 I, [2024-05-22T02:57:25.413656 #1029097] INFO -- : prime 0.1.2 I, [2024-05-22T02:57:25.423371 #1029097] INFO -- : rbs 3.4.4 I, [2024-05-22T02:57:25.531808 #1029097] INFO -- : typeprof 0.21.11 I, [2024-05-22T02:57:25.546630 #1029097] INFO -- : debug 1.9.2 I, [2024-05-22T02:57:25.558946 #1029097] INFO -- : racc 1.8.0 I, [2024-05-22T02:57:25.572431 #1029097] INFO -- : mutex_m 0.2.0 I, [2024-05-22T02:57:25.575580 #1029097] INFO -- : getoptlong 0.2.1 I, [2024-05-22T02:57:25.580764 #1029097] INFO -- : base64 0.2.0 I, [2024-05-22T02:57:25.583470 #1029097] INFO -- : bigdecimal 3.1.8 I, [2024-05-22T02:57:25.590040 #1029097] INFO -- : observer 0.1.2 I, [2024-05-22T02:57:25.593260 #1029097] INFO -- : abbrev 0.1.2 I, [2024-05-22T02:57:25.596156 #1029097] INFO -- : resolv-replace 0.1.1 I, [2024-05-22T02:57:25.599538 #1029097] INFO -- : rinda 0.2.0 I, [2024-05-22T02:57:25.604378 #1029097] INFO -- : drb 2.2.1 I, [2024-05-22T02:57:25.609252 #1029097] INFO -- : nkf 0.2.0 I, [2024-05-22T02:57:25.616551 #1029097] INFO -- : syslog 0.1.2 I, [2024-05-22T02:57:25.621726 #1029097] INFO -- : csv 3.3.0 I, [2024-05-22T02:57:25.634440 #1029097] INFO -- : installing bundled gem cache: /home/opc/ruby/install/master/lib/ruby/gems/3.4.0+0/cache I, [2024-05-22T02:57:25.636456 #1029097] INFO -- : skipped bundled gems: I, [2024-05-22T02:57:25.636478 #1029097] INFO -- : power_assert-2.0.4dev.gem not found in bundled_gems I, [2024-05-22T02:57:25.639576 #1029097] INFO -- : $$$[end] "make install -j3" exit with 0. I, [2024-05-22T02:57:25.639722 #1029097] INFO -- : $$$[beg] make yes-btest TESTOPTS='-q -j3' I, [2024-05-22T02:57:47.690151 #1029097] INFO -- : PASS all 1936 tests E, [2024-05-22T02:57:47.691989 #1029097] ERROR -- : I, [2024-05-22T02:57:47.692104 #1029097] INFO -- : $$$[end] "make yes-btest TESTOPTS='-q -j3'" exit with 0. I, [2024-05-22T02:57:47.692264 #1029097] INFO -- : $$$[beg] make yes-test-basic TESTS='-j3' I, [2024-05-22T02:57:47.784987 #1029097] INFO -- : BASERUBY = /usr/local/bin/ruby --disable=gems I, [2024-05-22T02:57:47.785059 #1029097] INFO -- : CC = gcc I, [2024-05-22T02:57:47.785070 #1029097] INFO -- : LD = ld I, [2024-05-22T02:57:47.785079 #1029097] INFO -- : LDSHARED = gcc -shared I, [2024-05-22T02:57:47.785089 #1029097] INFO -- : CFLAGS = -O3 -fno-fast-math -ggdb3 -Wall -Wextra -Wdeprecated-declarations -Wdiv-by-zero -Wduplicated-cond -Wimplicit-function-declaration -Wimplicit-int -Wpointer-arith -Wwrite-strings -Wold-style-definition -Wimplicit-fallthrough=0 -Wmissing-noreturn -Wno-cast-function-type -Wno-constant-logical-operand -Wno-long-long -Wno-missing-field-initializers -Wno-overlength-strings -Wno-packed-bitfield-compat -Wno-parentheses-equality -Wno-self-assign -Wno-tautological-compare -Wno-unused-parameter -Wno-unused-value -Wsuggest-attribute=format -Wsuggest-attribute=noreturn -Wunused-variable -Wmisleading-indentation -Wundef I, [2024-05-22T02:57:47.785124 #1029097] INFO -- : XCFLAGS = -U_FORTIFY_SOURCE -D_FORTIFY_SOURCE=2 -fstack-protector-strong -msign-return-address=all -fno-strict-overflow -fvisibility=hidden -fexcess-precision=standard -DRUBY_EXPORT -fPIE -I. -I.ext/include/aarch64-linux -I/home/opc/ruby/src/master/include -I/home/opc/ruby/src/master -I/home/opc/ruby/src/master/prism -I/home/opc/ruby/src/master/enc/unicode/15.0.0 I, [2024-05-22T02:57:47.785135 #1029097] INFO -- : CPPFLAGS = I, [2024-05-22T02:57:47.785143 #1029097] INFO -- : DLDFLAGS = -Wl,--compress-debug-sections=zlib -fstack-protector-strong -pie I, [2024-05-22T02:57:47.785166 #1029097] INFO -- : SOLIBS = -lz -lrt -lrt -ldl -lcrypt -lm -lpthread I, [2024-05-22T02:57:47.785175 #1029097] INFO -- : LANG = en_US.UTF-8 I, [2024-05-22T02:57:47.785183 #1029097] INFO -- : LC_ALL = I, [2024-05-22T02:57:47.785191 #1029097] INFO -- : LC_CTYPE = I, [2024-05-22T02:57:47.785199 #1029097] INFO -- : MFLAGS = I, [2024-05-22T02:57:47.785207 #1029097] INFO -- : RUSTC = rustc I, [2024-05-22T02:57:47.785215 #1029097] INFO -- : YJIT_RUSTC_ARGS = --crate-name=yjit --crate-type=staticlib --edition=2021 -g -C lto=thin -C opt-level=3 -C overflow-checks=on '--out-dir=/home/opc/ruby/build/master/yjit/target/release/' /home/opc/ruby/src/master/yjit/src/lib.rs I, [2024-05-22T02:57:47.785979 #1029097] INFO -- : gcc (GCC) 8.5.0 20210514 (Red Hat 8.5.0-10.1.0.1) I, [2024-05-22T02:57:47.786015 #1029097] INFO -- : Copyright (C) 2018 Free Software Foundation, Inc. I, [2024-05-22T02:57:47.786025 #1029097] INFO -- : This is free software; see the source for copying conditions. There is NO I, [2024-05-22T02:57:47.786034 #1029097] INFO -- : warranty; not even for MERCHANTABILITY or FITNESS FOR A PARTICULAR PURPOSE. I, [2024-05-22T02:57:47.786043 #1029097] INFO -- : I, [2024-05-22T02:57:47.945010 #1029097] INFO -- : Checking leaked global symbols...none I, [2024-05-22T02:57:47.998491 #1029097] INFO -- : /home/opc/ruby/src/master/basictest/test.rb:assignment ....................................................................................................................................................................................................................................................................................................................................................................................OK 372 I, [2024-05-22T02:57:47.998562 #1029097] INFO -- : /home/opc/ruby/src/master/basictest/test.rb:condition ..OK 2 I, [2024-05-22T02:57:47.998593 #1029097] INFO -- : /home/opc/ruby/src/master/basictest/test.rb:if/unless ...OK 3 I, [2024-05-22T02:57:47.998647 #1029097] INFO -- : /home/opc/ruby/src/master/basictest/test.rb:case .....OK 5 I, [2024-05-22T02:57:47.999300 #1029097] INFO -- : /home/opc/ruby/src/master/basictest/test.rb:while/until ........OK 8 I, [2024-05-22T02:57:47.999428 #1029097] INFO -- : /home/opc/ruby/src/master/basictest/test.rb:exception ..........OK 10 I, [2024-05-22T02:57:48.000122 #1029097] INFO -- : /home/opc/ruby/src/master/basictest/test.rb:array .......................................OK 39 I, [2024-05-22T02:57:48.000400 #1029097] INFO -- : /home/opc/ruby/src/master/basictest/test.rb:hash ...........................OK 27 I, [2024-05-22T02:57:48.002229 #1029097] INFO -- : /home/opc/ruby/src/master/basictest/test.rb:iterator ...........................................................................................................OK 107 I, [2024-05-22T02:57:48.003022 #1029097] INFO -- : /home/opc/ruby/src/master/basictest/test.rb:float ................................................................................OK 80 I, [2024-05-22T02:57:48.006558 #1029097] INFO -- : /home/opc/ruby/src/master/basictest/test.rb:bignum ...............................OK 31 I, [2024-05-22T02:57:48.008212 #1029097] INFO -- : /home/opc/ruby/src/master/basictest/test.rb:string & char ..............................................................OK 62 I, [2024-05-22T02:57:48.008293 #1029097] INFO -- : /home/opc/ruby/src/master/basictest/test.rb:assignment ..........OK 10 I, [2024-05-22T02:57:48.008367 #1029097] INFO -- : /home/opc/ruby/src/master/basictest/test.rb:call ......OK 6 I, [2024-05-22T02:57:48.008757 #1029097] INFO -- : /home/opc/ruby/src/master/basictest/test.rb:proc .........OK 9 I, [2024-05-22T02:57:48.109045 #1029097] INFO -- : /home/opc/ruby/src/master/basictest/test.rb:signal ..OK 2 I, [2024-05-22T02:57:48.110535 #1029097] INFO -- : /home/opc/ruby/src/master/basictest/test.rb:eval ...........................OK 27 I, [2024-05-22T02:57:48.248238 #1029097] INFO -- : /home/opc/ruby/src/master/basictest/test.rb:system ........OK 8 I, [2024-05-22T02:57:48.248318 #1029097] INFO -- : /home/opc/ruby/src/master/basictest/test.rb:const .....OK 5 I, [2024-05-22T02:57:48.248421 #1029097] INFO -- : /home/opc/ruby/src/master/basictest/test.rb:clone .....OK 5 I, [2024-05-22T02:57:48.248664 #1029097] INFO -- : /home/opc/ruby/src/master/basictest/test.rb:marshal ....OK 4 I, [2024-05-22T02:57:48.248741 #1029097] INFO -- : /home/opc/ruby/src/master/basictest/test.rb:pack ....OK 4 I, [2024-05-22T02:57:48.248775 #1029097] INFO -- : /home/opc/ruby/src/master/basictest/test.rb:math ..OK 2 I, [2024-05-22T02:57:48.248865 #1029097] INFO -- : /home/opc/ruby/src/master/basictest/test.rb:struct ......OK 6 I, [2024-05-22T02:57:48.249037 #1029097] INFO -- : /home/opc/ruby/src/master/basictest/test.rb:variable ............OK 12 I, [2024-05-22T02:57:48.249079 #1029097] INFO -- : /home/opc/ruby/src/master/basictest/test.rb:trace ...OK 3 I, [2024-05-22T02:57:48.249258 #1029097] INFO -- : /home/opc/ruby/src/master/basictest/test.rb:defined? ............OK 12 I, [2024-05-22T02:57:48.249346 #1029097] INFO -- : /home/opc/ruby/src/master/basictest/test.rb:alias ......OK 6 I, [2024-05-22T02:57:48.249877 #1029097] INFO -- : /home/opc/ruby/src/master/basictest/test.rb:path .......................OK 23 I, [2024-05-22T02:57:48.318212 #1029097] INFO -- : /home/opc/ruby/src/master/basictest/test.rb:gc ....OK 4 I, [2024-05-22T02:57:48.320050 #1029097] INFO -- : I, [2024-05-22T02:57:48.320078 #1029097] INFO -- : test succeeded I, [2024-05-22T02:57:48.320740 #1029097] INFO -- : $$$[end] "make yes-test-basic TESTS='-j3'" exit with 0. I, [2024-05-22T02:57:48.320908 #1029097] INFO -- : $$$[beg] make yes-test-all TESTOPTS='--stderr-on-failure' TESTS='-j3' I, [2024-05-22T02:57:48.445607 #1029097] INFO -- : BASERUBY = /usr/local/bin/ruby --disable=gems I, [2024-05-22T02:57:48.445683 #1029097] INFO -- : CC = gcc I, [2024-05-22T02:57:48.445694 #1029097] INFO -- : LD = ld I, [2024-05-22T02:57:48.445703 #1029097] INFO -- : LDSHARED = gcc -shared I, [2024-05-22T02:57:48.445715 #1029097] INFO -- : CFLAGS = -O3 -fno-fast-math -ggdb3 -Wall -Wextra -Wdeprecated-declarations -Wdiv-by-zero -Wduplicated-cond -Wimplicit-function-declaration -Wimplicit-int -Wpointer-arith -Wwrite-strings -Wold-style-definition -Wimplicit-fallthrough=0 -Wmissing-noreturn -Wno-cast-function-type -Wno-constant-logical-operand -Wno-long-long -Wno-missing-field-initializers -Wno-overlength-strings -Wno-packed-bitfield-compat -Wno-parentheses-equality -Wno-self-assign -Wno-tautological-compare -Wno-unused-parameter -Wno-unused-value -Wsuggest-attribute=format -Wsuggest-attribute=noreturn -Wunused-variable -Wmisleading-indentation -Wundef I, [2024-05-22T02:57:48.445724 #1029097] INFO -- : XCFLAGS = -U_FORTIFY_SOURCE -D_FORTIFY_SOURCE=2 -fstack-protector-strong -msign-return-address=all -fno-strict-overflow -fvisibility=hidden -fexcess-precision=standard -DRUBY_EXPORT -fPIE -I. -I.ext/include/aarch64-linux -I/home/opc/ruby/src/master/include -I/home/opc/ruby/src/master -I/home/opc/ruby/src/master/prism -I/home/opc/ruby/src/master/enc/unicode/15.0.0 I, [2024-05-22T02:57:48.445733 #1029097] INFO -- : CPPFLAGS = I, [2024-05-22T02:57:48.445741 #1029097] INFO -- : DLDFLAGS = -Wl,--compress-debug-sections=zlib -fstack-protector-strong -pie I, [2024-05-22T02:57:48.445750 #1029097] INFO -- : SOLIBS = -lz -lrt -lrt -ldl -lcrypt -lm -lpthread I, [2024-05-22T02:57:48.445758 #1029097] INFO -- : LANG = en_US.UTF-8 I, [2024-05-22T02:57:48.445766 #1029097] INFO -- : LC_ALL = I, [2024-05-22T02:57:48.445775 #1029097] INFO -- : LC_CTYPE = I, [2024-05-22T02:57:48.445782 #1029097] INFO -- : MFLAGS = I, [2024-05-22T02:57:48.445790 #1029097] INFO -- : RUSTC = rustc I, [2024-05-22T02:57:48.445798 #1029097] INFO -- : YJIT_RUSTC_ARGS = --crate-name=yjit --crate-type=staticlib --edition=2021 -g -C lto=thin -C opt-level=3 -C overflow-checks=on '--out-dir=/home/opc/ruby/build/master/yjit/target/release/' /home/opc/ruby/src/master/yjit/src/lib.rs I, [2024-05-22T02:57:48.446538 #1029097] INFO -- : gcc (GCC) 8.5.0 20210514 (Red Hat 8.5.0-10.1.0.1) I, [2024-05-22T02:57:48.446572 #1029097] INFO -- : Copyright (C) 2018 Free Software Foundation, Inc. I, [2024-05-22T02:57:48.446583 #1029097] INFO -- : This is free software; see the source for copying conditions. There is NO I, [2024-05-22T02:57:48.446592 #1029097] INFO -- : warranty; not even for MERCHANTABILITY or FITNESS FOR A PARTICULAR PURPOSE. I, [2024-05-22T02:57:48.446600 #1029097] INFO -- : I, [2024-05-22T02:57:48.448520 #1029097] INFO -- : generating enc.mk I, [2024-05-22T02:57:48.688455 #1029097] INFO -- : generating encdb.h I, [2024-05-22T02:57:48.726449 #1029097] INFO -- : encdb.h unchanged I, [2024-05-22T02:57:48.727680 #1029097] INFO -- : making enc I, [2024-05-22T02:57:48.754933 #1029097] INFO -- : make[1]: Entering directory '/home/opc/ruby/build/master' I, [2024-05-22T02:57:48.755012 #1029097] INFO -- : make[1]: Nothing to be done for 'enc'. I, [2024-05-22T02:57:48.755023 #1029097] INFO -- : make[1]: Leaving directory '/home/opc/ruby/build/master' I, [2024-05-22T02:57:48.755694 #1029097] INFO -- : making srcs under enc I, [2024-05-22T02:57:48.797457 #1029097] INFO -- : make[1]: Entering directory '/home/opc/ruby/build/master' I, [2024-05-22T02:57:48.797523 #1029097] INFO -- : make[1]: Nothing to be done for 'srcs'. I, [2024-05-22T02:57:48.797534 #1029097] INFO -- : make[1]: Leaving directory '/home/opc/ruby/build/master' I, [2024-05-22T02:57:48.798662 #1029097] INFO -- : generating transdb.h I, [2024-05-22T02:57:48.941647 #1029097] INFO -- : transdb.h unchanged I, [2024-05-22T02:57:48.942962 #1029097] INFO -- : making trans I, [2024-05-22T02:57:48.991231 #1029097] INFO -- : make[1]: Entering directory '/home/opc/ruby/build/master' I, [2024-05-22T02:57:48.991308 #1029097] INFO -- : make[1]: Nothing to be done for 'trans'. I, [2024-05-22T02:57:48.991329 #1029097] INFO -- : make[1]: Leaving directory '/home/opc/ruby/build/master' I, [2024-05-22T02:57:48.992090 #1029097] INFO -- : making encs I, [2024-05-22T02:57:49.044346 #1029097] INFO -- : make[1]: Entering directory '/home/opc/ruby/build/master' I, [2024-05-22T02:57:49.044422 #1029097] INFO -- : make[1]: Nothing to be done for 'encs'. I, [2024-05-22T02:57:49.044433 #1029097] INFO -- : make[1]: Leaving directory '/home/opc/ruby/build/master' I, [2024-05-22T02:57:49.046428 #1029097] INFO -- : generating makefiles ext/configure-ext.mk I, [2024-05-22T02:57:49.086711 #1029097] INFO -- : ext/configure-ext.mk updated I, [2024-05-22T02:57:49.090572 #1029097] INFO -- : make[1]: Entering directory '/home/opc/ruby/build/master' I, [2024-05-22T02:57:51.234256 #1029097] INFO -- : make[1]: Leaving directory '/home/opc/ruby/build/master' I, [2024-05-22T02:57:51.234971 #1029097] INFO -- : generating makefile exts.mk I, [2024-05-22T02:57:51.332772 #1029097] INFO -- : exts.mk unchanged I, [2024-05-22T02:57:51.338217 #1029097] INFO -- : make[1]: Entering directory '/home/opc/ruby/build/master' I, [2024-05-22T02:57:51.633271 #1029097] INFO -- : make[2]: Entering directory '/home/opc/ruby/build/master/ext/coverage' I, [2024-05-22T02:57:51.637799 #1029097] INFO -- : make[2]: Leaving directory '/home/opc/ruby/build/master/ext/coverage' I, [2024-05-22T02:57:51.643427 #1029097] INFO -- : make[2]: Entering directory '/home/opc/ruby/build/master/ext/date' I, [2024-05-22T02:57:51.648807 #1029097] INFO -- : make[2]: Leaving directory '/home/opc/ruby/build/master/ext/date' I, [2024-05-22T02:57:51.652079 #1029097] INFO -- : make[2]: Entering directory '/home/opc/ruby/build/master/ext/digest' I, [2024-05-22T02:57:51.660959 #1029097] INFO -- : make[2]: Leaving directory '/home/opc/ruby/build/master/ext/digest' I, [2024-05-22T02:57:51.683391 #1029097] INFO -- : make[2]: Entering directory '/home/opc/ruby/build/master/ext/digest/sha2' I, [2024-05-22T02:57:51.688185 #1029097] INFO -- : make[2]: Leaving directory '/home/opc/ruby/build/master/ext/digest/sha2' I, [2024-05-22T02:57:51.706430 #1029097] INFO -- : make[2]: Entering directory '/home/opc/ruby/build/master/ext/fiddle' I, [2024-05-22T02:57:51.716406 #1029097] INFO -- : make[2]: Leaving directory '/home/opc/ruby/build/master/ext/fiddle' I, [2024-05-22T02:57:51.720552 #1029097] INFO -- : make[2]: Entering directory '/home/opc/ruby/build/master/ext/io/console' I, [2024-05-22T02:57:51.724795 #1029097] INFO -- : make[2]: Leaving directory '/home/opc/ruby/build/master/ext/io/console' I, [2024-05-22T02:57:51.735498 #1029097] INFO -- : make[2]: Entering directory '/home/opc/ruby/build/master/ext/json' I, [2024-05-22T02:57:51.744927 #1029097] INFO -- : make[2]: Leaving directory '/home/opc/ruby/build/master/ext/json' I, [2024-05-22T02:57:51.757805 #1029097] INFO -- : make[2]: Entering directory '/home/opc/ruby/build/master/ext/monitor' I, [2024-05-22T02:57:51.762004 #1029097] INFO -- : make[2]: Leaving directory '/home/opc/ruby/build/master/ext/monitor' I, [2024-05-22T02:57:51.768051 #1029097] INFO -- : make[2]: Entering directory '/home/opc/ruby/build/master/ext/objspace' I, [2024-05-22T02:57:51.773901 #1029097] INFO -- : make[2]: Leaving directory '/home/opc/ruby/build/master/ext/objspace' I, [2024-05-22T02:57:51.793062 #1029097] INFO -- : make[2]: Entering directory '/home/opc/ruby/build/master/ext/openssl' I, [2024-05-22T02:57:51.814913 #1029097] INFO -- : make[2]: Leaving directory '/home/opc/ruby/build/master/ext/openssl' I, [2024-05-22T02:57:51.819144 #1029097] INFO -- : make[2]: Entering directory '/home/opc/ruby/build/master/ext/pathname' I, [2024-05-22T02:57:51.823224 #1029097] INFO -- : make[2]: Leaving directory '/home/opc/ruby/build/master/ext/pathname' I, [2024-05-22T02:57:51.829537 #1029097] INFO -- : make[2]: Entering directory '/home/opc/ruby/build/master/ext/psych' I, [2024-05-22T02:57:51.850924 #1029097] INFO -- : make[2]: Leaving directory '/home/opc/ruby/build/master/ext/psych' I, [2024-05-22T02:57:51.855279 #1029097] INFO -- : make[2]: Entering directory '/home/opc/ruby/build/master/ext/pty' I, [2024-05-22T02:57:51.859470 #1029097] INFO -- : make[2]: Leaving directory '/home/opc/ruby/build/master/ext/pty' I, [2024-05-22T02:57:51.872942 #1029097] INFO -- : make[2]: Entering directory '/home/opc/ruby/build/master/ext/ripper' I, [2024-05-22T02:57:51.880591 #1029097] INFO -- : make[2]: Leaving directory '/home/opc/ruby/build/master/ext/ripper' I, [2024-05-22T02:57:51.882623 #1029097] INFO -- : make[2]: Entering directory '/home/opc/ruby/build/master/ext/rubyvm' I, [2024-05-22T02:57:51.886145 #1029097] INFO -- : make[2]: Leaving directory '/home/opc/ruby/build/master/ext/rubyvm' I, [2024-05-22T02:57:51.898148 #1029097] INFO -- : make[2]: Entering directory '/home/opc/ruby/build/master/ext/socket' I, [2024-05-22T02:57:51.908882 #1029097] INFO -- : make[2]: Leaving directory '/home/opc/ruby/build/master/ext/socket' I, [2024-05-22T02:57:51.925131 #1029097] INFO -- : make[2]: Entering directory '/home/opc/ruby/build/master/.bundle/gems/bigdecimal-3.1.7/ext/bigdecimal' I, [2024-05-22T02:57:51.956310 #1029097] INFO -- : make[2]: Leaving directory '/home/opc/ruby/build/master/.bundle/gems/bigdecimal-3.1.7/ext/bigdecimal' I, [2024-05-22T02:57:51.958983 #1029097] INFO -- : make[2]: Entering directory '/home/opc/ruby/build/master/.bundle/gems/bigdecimal-3.1.8/ext/bigdecimal' I, [2024-05-22T02:57:51.988858 #1029097] INFO -- : make[2]: Leaving directory '/home/opc/ruby/build/master/.bundle/gems/bigdecimal-3.1.8/ext/bigdecimal' I, [2024-05-22T02:57:51.991478 #1029097] INFO -- : make[2]: Entering directory '/home/opc/ruby/build/master/.bundle/gems/debug-1.9.2/ext/debug' I, [2024-05-22T02:57:52.021825 #1029097] INFO -- : make[2]: Leaving directory '/home/opc/ruby/build/master/.bundle/gems/debug-1.9.2/ext/debug' I, [2024-05-22T02:57:52.024344 #1029097] INFO -- : make[2]: Entering directory '/home/opc/ruby/build/master/.bundle/gems/nkf-0.2.0/ext/nkf' I, [2024-05-22T02:57:52.054635 #1029097] INFO -- : make[2]: Leaving directory '/home/opc/ruby/build/master/.bundle/gems/nkf-0.2.0/ext/nkf' I, [2024-05-22T02:57:52.057216 #1029097] INFO -- : make[2]: Entering directory '/home/opc/ruby/build/master/.bundle/gems/racc-1.7.3/ext/racc/cparse' I, [2024-05-22T02:57:52.087268 #1029097] INFO -- : make[2]: Leaving directory '/home/opc/ruby/build/master/.bundle/gems/racc-1.7.3/ext/racc/cparse' I, [2024-05-22T02:57:52.089867 #1029097] INFO -- : make[2]: Entering directory '/home/opc/ruby/build/master/.bundle/gems/racc-1.8.0/ext/racc/cparse' I, [2024-05-22T02:57:52.121270 #1029097] INFO -- : make[2]: Leaving directory '/home/opc/ruby/build/master/.bundle/gems/racc-1.8.0/ext/racc/cparse' I, [2024-05-22T02:57:52.124465 #1029097] INFO -- : make[2]: Entering directory '/home/opc/ruby/build/master/.bundle/gems/rbs-3.4.4/ext/rbs_extension' I, [2024-05-22T02:57:52.155522 #1029097] INFO -- : make[2]: Leaving directory '/home/opc/ruby/build/master/.bundle/gems/rbs-3.4.4/ext/rbs_extension' I, [2024-05-22T02:57:52.158090 #1029097] INFO -- : make[2]: Entering directory '/home/opc/ruby/build/master/.bundle/gems/syslog-0.1.2/ext/syslog' I, [2024-05-22T02:57:52.188950 #1029097] INFO -- : make[2]: Leaving directory '/home/opc/ruby/build/master/.bundle/gems/syslog-0.1.2/ext/syslog' I, [2024-05-22T02:57:52.227828 #1029097] INFO -- : make[2]: Entering directory '/home/opc/ruby/build/master' I, [2024-05-22T02:57:52.311908 #1029097] INFO -- : make[2]: 'ruby' is up to date. I, [2024-05-22T02:57:52.311984 #1029097] INFO -- : make[2]: Leaving directory '/home/opc/ruby/build/master' I, [2024-05-22T02:57:52.312117 #1029097] INFO -- : make[1]: Leaving directory '/home/opc/ruby/build/master' I, [2024-05-22T02:57:52.316567 #1029097] INFO -- : make[1]: Entering directory '/home/opc/ruby/build/master' I, [2024-05-22T02:57:52.316602 #1029097] INFO -- : make[1]: Nothing to be done for 'note'. I, [2024-05-22T02:57:52.316612 #1029097] INFO -- : make[1]: Leaving directory '/home/opc/ruby/build/master' I, [2024-05-22T02:57:52.430892 #1029097] INFO -- : Run options: I, [2024-05-22T02:57:52.430969 #1029097] INFO -- : --seed=44694 I, [2024-05-22T02:57:52.430980 #1029097] INFO -- : "--ruby=./miniruby -I/home/opc/ruby/src/master/lib -I. -I.ext/common /home/opc/ruby/src/master/tool/runruby.rb --extout=.ext -- --disable-gems" I, [2024-05-22T02:57:52.430990 #1029097] INFO -- : --excludes-dir=/home/opc/ruby/src/master/test/.excludes I, [2024-05-22T02:57:52.430999 #1029097] INFO -- : --name=!/memory_leak/ I, [2024-05-22T02:57:52.431007 #1029097] INFO -- : --stderr-on-failure I, [2024-05-22T02:57:52.431015 #1029097] INFO -- : -j3 I, [2024-05-22T02:57:52.431024 #1029097] INFO -- : I, [2024-05-22T02:57:52.431032 #1029097] INFO -- : # Running tests: I, [2024-05-22T02:57:52.431040 #1029097] INFO -- : I, [2024-05-22T02:57:52.562051 #1029097] INFO -- : [ 1/885] 1069976=test_webauthn_listener_response I, [2024-05-22T02:57:52.567016 #1029097] INFO -- : [ 2/885] 1069978=test_sleep I, [2024-05-22T02:57:52.729080 #1029097] INFO -- : [ 3/885] 1069977=test_gem_resolver_index_set I, [2024-05-22T02:57:52.747737 #1029097] INFO -- : [ 4/885] 1069976=ruby_api_test I, [2024-05-22T02:57:52.766434 #1029097] INFO -- : [ 5/885] 1069977=test_gem_bundler_version_finder I, [2024-05-22T02:57:52.813464 #1029097] INFO -- : [ 6/885] 1069977=test_gem_request_set I, [2024-05-22T02:57:52.972372 #1029097] INFO -- : [ 7/885] 1069976=test_gc I, [2024-05-22T02:57:53.305462 #1029097] INFO -- : [ 8/885] 1069977=test_pattern_matching I, [2024-05-22T02:57:53.318005 #1029097] INFO -- : [ 9/885] 1069977=test_interned_str I, [2024-05-22T02:57:53.394275 #1029097] INFO -- : [ 10/885] 1069977=constant_path_node_test I, [2024-05-22T02:57:53.398354 #1029097] INFO -- : [ 11/885] 1069977=test_set_len I, [2024-05-22T02:57:53.402704 #1029097] INFO -- : [ 12/885] 1069977=test_folderitem2_invokeverb I, [2024-05-22T02:57:53.412431 #1029097] INFO -- : [ 13/885] 1069977=test_delegate I, [2024-05-22T02:57:53.423877 #1029097] INFO -- : [ 14/885] 1069977=test_chilled I, [2024-05-22T02:57:53.435214 #1029097] INFO -- : [ 15/885] 1069977=location_test I, [2024-05-22T02:57:53.482439 #1029097] INFO -- : [ 16/885] 1069977=test_symbol I, [2024-05-22T02:57:53.507141 #1029097] INFO -- : [ 17/885] 1069977=test_project_sanity I, [2024-05-22T02:57:53.543455 #1029097] INFO -- : [ 18/885] 1069977=test_time I, [2024-05-22T02:57:53.701046 #1029097] INFO -- : [ 19/885] 1069977=test_popen_deadlock I, [2024-05-22T02:57:54.236786 #1029097] INFO -- : [ 20/885] 1069977=test_alias_and_anchor I, [2024-05-22T02:57:54.243938 #1029097] INFO -- : [ 21/885] 1069977=test_euc_jp I, [2024-05-22T02:57:54.308593 #1029097] INFO -- : [ 22/885] 1069977=test_key_stroke I, [2024-05-22T02:57:54.348123 #1029097] INFO -- : [ 23/885] 1069977=test_rdoc_markup I, [2024-05-22T02:57:54.457856 #1029097] INFO -- : [ 24/885] 1069977=test_ensured I, [2024-05-22T02:57:54.840473 #1029097] INFO -- : [ 25/885] 1069977=test_to_ary_concat I, [2024-05-22T02:57:55.638751 #1029097] INFO -- : [ 26/885] 1069977=test_history I, [2024-05-22T02:57:55.756235 #1029097] INFO -- : [ 27/885] 1069977=test_gem_ext_builder I, [2024-05-22T02:57:56.652344 #1029097] INFO -- : [ 28/885] 1069977=test_windows_1251 I, [2024-05-22T02:57:56.677569 #1029097] INFO -- : [ 29/885] 1069977=test_call I, [2024-05-22T02:57:56.786301 #1029097] INFO -- : [ 30/885] 1069977=test_ellipsize I, [2024-05-22T02:57:56.829390 #1029097] INFO -- : [ 31/885] 1069977=test_gem_commands_build_command I, [2024-05-22T02:57:57.117575 #1029097] INFO -- : [ 32/885] 1069977=test_reline I, [2024-05-22T02:57:57.431590 #1029097] INFO -- : [ 33/885] 1069977=test_thread I, [2024-05-22T02:57:57.571898 #1029097] INFO -- : [ 34/885] 1069978=test_inlinecache I, [2024-05-22T02:57:57.669709 #1029097] INFO -- : [ 35/885] 1069978=test_terminfo I, [2024-05-22T02:57:57.685836 #1029097] INFO -- : [ 36/885] 1069978=test_socket I, [2024-05-22T02:57:58.576442 #1029097] INFO -- : .Leaked thread: TestSocket#test_accept_loop: # I, [2024-05-22T02:57:58.577454 #1029097] INFO -- : Finished thread: TestSocket#test_unix: # I, [2024-05-22T02:57:58.628349 #1029097] INFO -- : [ 37/885] 1069978=test_bug-14834 I, [2024-05-22T02:57:58.660434 #1029097] INFO -- : [ 38/885] 1069978=test_data I, [2024-05-22T02:57:58.684960 #1029097] INFO -- : [ 39/885] 1069978=test_to_ruby I, [2024-05-22T02:57:58.700320 #1029097] INFO -- : [ 40/885] 1069978=test_addrinfo I, [2024-05-22T02:57:58.722081 #1029097] INFO -- : .Leaked file descriptor: TestSocketAddrinfo#test_addrinfo_timeout: 7 # I, [2024-05-22T02:57:58.752277 #1029097] INFO -- : COMMAND PID USER FD TYPE DEVICE SIZE/OFF NODE NAME I, [2024-05-22T02:57:58.752351 #1029097] INFO -- : ruby 1069978 opc 7u unix 0x0000000000000000 0t0 3088356270 type=STREAM I, [2024-05-22T02:57:58.813551 #1029097] INFO -- : [ 41/885] 1069978=test_time_tz I, [2024-05-22T02:57:58.928549 #1029097] INFO -- : [ 42/885] 1069978=ractor_test I, [2024-05-22T02:57:58.932580 #1029097] INFO -- : [ 43/885] 1069978=test_ancdata I, [2024-05-22T02:57:58.974215 #1029097] INFO -- : [ 44/885] 1069978=test_marshal I, [2024-05-22T02:57:59.307357 #1029097] INFO -- : [ 45/885] 1069978=test_nesting_parser I, [2024-05-22T02:57:59.443472 #1029097] INFO -- : [ 46/885] 1069978=test_rdoc_markup_hard_break I, [2024-05-22T02:57:59.504839 #1029097] INFO -- : [ 47/885] 1069978=newline_test I, [2024-05-22T02:57:59.590111 #1029097] INFO -- : [ 48/885] 1069978=test_bignum I, [2024-05-22T02:58:00.291971 #1029097] INFO -- : [ 49/885] 1069976=test_enc_str_buf_cat I, [2024-05-22T02:58:00.298513 #1029097] INFO -- : [ 50/885] 1069976=test_scheduler I, [2024-05-22T02:58:00.444546 #1029097] INFO -- : [ 51/885] 1069976=test_gem_commands_help_command I, [2024-05-22T02:58:00.669466 #1029097] INFO -- : [ 52/885] 1069976=test_ssl I, [2024-05-22T02:58:00.869001 #1029097] INFO -- : [ 53/885] 1069976=test_ractor I, [2024-05-22T02:58:01.135039 #1029097] INFO -- : [ 54/885] 1069976=test_gem_resolver_conflict I, [2024-05-22T02:58:01.190813 #1029097] INFO -- : [ 55/885] 1069976=test_ractor I, [2024-05-22T02:58:01.206103 #1029097] INFO -- : [ 56/885] 1069976=json_generator_test I, [2024-05-22T02:58:01.368999 #1029097] INFO -- : [ 57/885] 1069976=test_ansi_without_terminfo I, [2024-05-22T02:58:01.391202 #1029097] INFO -- : [ 58/885] 1069976=test_gem I, [2024-05-22T02:58:01.536035 #1029097] INFO -- : Leaked file descriptor: TestGem#test_self_clear_paths: 7 # I, [2024-05-22T02:58:01.564702 #1029097] INFO -- : COMMAND PID USER FD TYPE DEVICE SIZE/OFF NODE NAME I, [2024-05-22T02:58:01.564773 #1029097] INFO -- : ruby 1069976 opc 7r REG 252,0 9253600 13705411 /var/lib/sss/mc/passwd I, [2024-05-22T02:58:03.182585 #1029097] INFO -- : [ 59/885] 1069978=test_registry I, [2024-05-22T02:58:03.192918 #1029097] INFO -- : [ 60/885] 1069978=test_cgi_core I, [2024-05-22T02:58:03.374644 #1029097] INFO -- : [ 61/885] 1069978=test_gem_resolver_best_set I, [2024-05-22T02:58:03.438648 #1029097] INFO -- : [ 62/885] 1069978=test_rdoc_markup_to_label I, [2024-05-22T02:58:03.495830 #1029097] INFO -- : [ 63/885] 1069978=test_parser I, [2024-05-22T02:58:03.525081 #1029097] INFO -- : [ 64/885] 1069978=test_require I, [2024-05-22T02:58:03.615848 #1029097] INFO -- : [ 65/885] 1069976=test_recursion I, [2024-05-22T02:58:03.628242 #1029097] INFO -- : [ 66/885] 1069976=test_enum I, [2024-05-22T02:58:04.469213 #1029097] INFO -- : [ 67/885] 1069976=test_rdoc_markup_include I, [2024-05-22T02:58:04.629939 #1029097] INFO -- : [ 68/885] 1069976=test_iter_break I, [2024-05-22T02:58:04.647210 #1029097] INFO -- : [ 69/885] 1069976=test_extlibs I, [2024-05-22T02:58:04.780511 #1029097] INFO -- : [ 70/885] 1069978=test_gem_commands_signin_command I, [2024-05-22T02:58:04.918380 #1029097] INFO -- : [ 71/885] 1069978=test_range I, [2024-05-22T02:58:05.638371 #1029097] INFO -- : [ 72/885] 1069978=test_num2int I, [2024-05-22T02:58:05.644904 #1029097] INFO -- : [ 73/885] 1069978=test_rbconfig I, [2024-05-22T02:58:05.655008 #1029097] INFO -- : [ 74/885] 1069978=test_ts I, [2024-05-22T02:58:05.952749 #1029097] INFO -- : [ 75/885] 1069978=test_locale I, [2024-05-22T02:58:05.972635 #1029097] INFO -- : [ 76/885] 1069978=test_rdoc_attr I, [2024-05-22T02:58:05.985145 #1029097] INFO -- : [ 77/885] 1069978=test_address_resolve I, [2024-05-22T02:58:06.011775 #1029097] INFO -- : [ 78/885] 1069978=test_ractor I, [2024-05-22T02:58:06.064529 #1029097] INFO -- : [ 79/885] 1069978=test_trick I, [2024-05-22T02:58:06.172708 #1029097] INFO -- : [ 80/885] 1069976=test_stream I, [2024-05-22T02:58:06.276658 #1029097] INFO -- : [ 81/885] 1069976=test_configuration I, [2024-05-22T02:58:06.281971 #1029097] INFO -- : [ 82/885] 1069976=test_gem_resolver_local_specification I, [2024-05-22T02:58:06.295887 #1029097] INFO -- : [ 83/885] 1069977=test_gem_commands_list_command I, [2024-05-22T02:58:06.298752 #1029097] INFO -- : [ 84/885] 1069977=test_date_new I, [2024-05-22T02:58:06.310240 #1029097] INFO -- : [ 85/885] 1069976=test_have_func I, [2024-05-22T02:58:06.314405 #1029097] INFO -- : [ 86/885] 1069977=test_date_marshal I, [2024-05-22T02:58:06.321296 #1029097] INFO -- : [ 87/885] 1069977=test_integer I, [2024-05-22T02:58:07.628835 #1029097] INFO -- : [ 88/885] 1069976=test_unix I, [2024-05-22T02:58:07.668428 #1029097] INFO -- : [ 89/885] 1069976=test_formatter I, [2024-05-22T02:58:07.675789 #1029097] INFO -- : [ 90/885] 1069976=test_udp I, [2024-05-22T02:58:07.764134 #1029097] INFO -- : [ 91/885] 1069976=test_context I, [2024-05-22T02:58:07.855090 #1029097] INFO -- : [ 92/885] 1069976=test_gem_commands_contents_command I, [2024-05-22T02:58:07.973069 #1029097] INFO -- : [ 93/885] 1069976=test_coder I, [2024-05-22T02:58:07.989738 #1029097] INFO -- : [ 94/885] 1069976=test_rdoc_servlet I, [2024-05-22T02:58:08.136731 #1029097] INFO -- : [ 95/885] 1069976=test_gem_commands_search_command I, [2024-05-22T02:58:08.151039 #1029097] INFO -- : [ 96/885] 1069976=test_symbol I, [2024-05-22T02:58:08.404057 #1029097] INFO -- : [ 97/885] 1069978=test_rdoc_markup_formatter I, [2024-05-22T02:58:08.441536 #1029097] INFO -- : [ 98/885] 1069978=test_gem_commands_uninstall_command I, [2024-05-22T02:58:08.754905 #1029097] INFO -- : [ 99/885] 1069977=test_win32ole_event I, [2024-05-22T02:58:08.755034 #1029097] INFO -- : [100/885] 1069977=test_helper I, [2024-05-22T02:58:08.767934 #1029097] INFO -- : [101/885] 1069977=test_compile_prism I, [2024-05-22T02:58:09.042226 #1029097] INFO -- : [102/885] 1069977=test_emitter I, [2024-05-22T02:58:09.056424 #1029097] INFO -- : [103/885] 1069977=test_alias I, [2024-05-22T02:58:09.240619 #1029097] INFO -- : [104/885] 1069977=test_fips I, [2024-05-22T02:58:09.254169 #1029097] INFO -- : [105/885] 1069978=test_getopts I, [2024-05-22T02:58:09.261364 #1029097] INFO -- : [106/885] 1069978=test_thread_fd_close I, [2024-05-22T02:58:09.408530 #1029097] INFO -- : [107/885] 1069978=test_last_thread I, [2024-05-22T02:58:09.495203 #1029097] INFO -- : [108/885] 1069977=test_digest_extend I, [2024-05-22T02:58:09.523296 #1029097] INFO -- : [109/885] 1069977=test_gem_ext_cmake_builder I, [2024-05-22T02:58:09.530686 #1029097] INFO -- : [110/885] 1069977=test_class2name I, [2024-05-22T02:58:09.556136 #1029097] INFO -- : [111/885] 1069977=test_gem_commands_cleanup_command I, [2024-05-22T02:58:10.112511 #1029097] INFO -- : [112/885] 1069977=test_debug I, [2024-05-22T02:58:10.128231 #1029097] INFO -- : [113/885] 1069977=test_transcode I, [2024-05-22T02:58:10.320217 #1029097] INFO -- : [114/885] 1069977=test_refinement I, [2024-05-22T02:58:10.340380 #1029097] INFO -- : [115/885] 1069978=test_profile_frames I, [2024-05-22T02:58:10.506108 #1029097] INFO -- : [116/885] 1069978=test_pattern_key_name_check I, [2024-05-22T02:58:10.541499 #1029097] INFO -- : [117/885] 1069978=test_io_console I, [2024-05-22T02:58:10.617842 #1029097] INFO -- : .Leaked file descriptor: TestIO_Console#test_ioflush2: 9 # I, [2024-05-22T02:58:10.641343 #1029097] INFO -- : COMMAND PID USER FD TYPE DEVICE SIZE/OFF NODE NAME I, [2024-05-22T02:58:10.641413 #1029097] INFO -- : ruby 1069978 opc 9r REG 252,0 6940392 13705429 /var/lib/sss/mc/group I, [2024-05-22T02:58:11.643514 #1029097] INFO -- : [118/885] 1069976=test_flip I, [2024-05-22T02:58:11.653764 #1029097] INFO -- : [119/885] 1069976=test_rdoc_markup_heading I, [2024-05-22T02:58:11.668625 #1029097] INFO -- : [120/885] 1069976=test_x509crl I, [2024-05-22T02:58:11.774155 #1029097] INFO -- : [121/885] 1069976=test_dns I, [2024-05-22T02:58:12.248987 #1029097] INFO -- : [122/885] 1069976=test_cgi_session I, [2024-05-22T02:58:12.260360 #1029097] INFO -- : [123/885] 1069976=test_notimplement I, [2024-05-22T02:58:12.297721 #1029097] INFO -- : [124/885] 1069976=test_c_union_entity I, [2024-05-22T02:58:12.356475 #1029097] INFO -- : [125/885] 1069976=test_insns_leaf I, [2024-05-22T02:58:12.365073 #1029097] INFO -- : [126/885] 1069976=test_gem_console_ui I, [2024-05-22T02:58:12.368927 #1029097] INFO -- : [127/885] 1069976=test_ifunless I, [2024-05-22T02:58:12.500184 #1029097] INFO -- : [128/885] 1069976=test_allocation I, [2024-05-22T02:58:13.214310 #1029097] INFO -- : [129/885] 1069978=test_x509req I, [2024-05-22T02:58:13.232466 #1029097] INFO -- : [130/885] 1069978=test_rdoc_parser_ruby I, [2024-05-22T02:58:13.772108 #1029097] INFO -- : [131/885] 1069978=test_httpresponse I, [2024-05-22T02:58:13.838934 #1029097] INFO -- : [132/885] 1069978=test_readpartial I, [2024-05-22T02:58:13.851353 #1029097] INFO -- : [133/885] 1069977=test_super I, [2024-05-22T02:58:14.248155 #1029097] INFO -- : [134/885] 1069978=test_color_printer I, [2024-05-22T02:58:14.264005 #1029097] INFO -- : [135/885] 1069978=unescape_test I, [2024-05-22T02:58:14.616104 #1029097] INFO -- : [136/885] 1069977=test_gem_commands_exec_command I, [2024-05-22T02:58:14.796391 #1029097] INFO -- : [137/885] 1069976=test_dln I, [2024-05-22T02:58:14.803326 #1029097] INFO -- : [138/885] 1069976=test_object I, [2024-05-22T02:58:15.155384 #1029097] INFO -- : [139/885] 1069976=test_gem_resolver I, [2024-05-22T02:58:15.437763 #1029097] INFO -- : [140/885] 1069976=test_gem_source_vendor I, [2024-05-22T02:58:15.443569 #1029097] INFO -- : [141/885] 1069976=test_vm_dump I, [2024-05-22T02:58:15.455712 #1029097] INFO -- : [142/885] 1069976=json_encoding_test I, [2024-05-22T02:58:15.468621 #1029097] INFO -- : [143/885] 1069976=test_config I, [2024-05-22T02:58:15.479327 #1029097] INFO -- : [144/885] 1069978=test_func I, [2024-05-22T02:58:15.502309 #1029097] INFO -- : [145/885] 1069976=errors_test I, [2024-05-22T02:58:15.648234 #1029097] INFO -- : [146/885] 1069976=test_convertible I, [2024-05-22T02:58:15.951364 #1029097] INFO -- : [147/885] 1069977=test_modify_expand I, [2024-05-22T02:58:15.970494 #1029097] INFO -- : [148/885] 1069977=test_gem_available_set I, [2024-05-22T02:58:16.077787 #1029097] INFO -- : [149/885] 1069977=test_pkg_config I, [2024-05-22T02:58:16.112989 #1029097] INFO -- : [150/885] 1069977=test_pointer I, [2024-05-22T02:58:16.873861 #1029097] INFO -- : [151/885] 1069977=test_within_pipe I, [2024-05-22T02:58:16.918931 #1029097] INFO -- : [152/885] 1069977=test_rdoc_normal_class I, [2024-05-22T02:58:17.020261 #1029097] INFO -- : [153/885] 1069977=test_regexp I, [2024-05-22T02:58:18.003887 #1029097] INFO -- : [154/885] 1069978=test_whileuntil I, [2024-05-22T02:58:18.011660 #1029097] INFO -- : [155/885] 1069978=test_nofree I, [2024-05-22T02:58:18.021175 #1029097] INFO -- : [156/885] 1069978=test_eval I, [2024-05-22T02:58:18.281419 #1029097] INFO -- : [157/885] 1069978=test_monitor I, [2024-05-22T02:58:18.539761 #1029097] INFO -- : [158/885] 1069978=test_beginendblock I, [2024-05-22T02:58:18.868990 #1029097] INFO -- : [159/885] 1069978=test_gem_source_subpath_problem I, [2024-05-22T02:58:18.963019 #1029097] INFO -- : [160/885] 1069978=test_object_references I, [2024-05-22T02:58:18.972444 #1029097] INFO -- : [161/885] 1069978=test_ruby_lex I, [2024-05-22T02:58:19.090377 #1029097] INFO -- : [162/885] 1069978=compiler_test I, [2024-05-22T02:58:19.149391 #1029097] INFO -- : [163/885] 1069978=test_arith_seq_extract I, [2024-05-22T02:58:19.152578 #1029097] INFO -- : [164/885] 1069976=test_buffered_io I, [2024-05-22T02:58:19.197434 #1029097] INFO -- : [165/885] 1069976=test_ossl I, [2024-05-22T02:58:19.288126 #1029097] INFO -- : [166/885] 1069978=test_bug_reporter I, [2024-05-22T02:58:19.459400 #1029097] INFO -- : [167/885] 1069978=test_gem_installer I, [2024-05-22T02:58:24.387618 #1029097] INFO -- : [168/885] 1069978=test_duplicate I, [2024-05-22T02:58:24.399264 #1029097] INFO -- : [169/885] 1069978=test_gem_resolver_api_set I, [2024-05-22T02:58:24.464899 #1029097] INFO -- : [170/885] 1069978=test_helper I, [2024-05-22T02:58:24.470025 #1029097] INFO -- : [171/885] 1069978=test_case_options I, [2024-05-22T02:58:24.476903 #1029097] INFO -- : [172/885] 1069978=test_cgi_header I, [2024-05-22T02:58:24.480980 #1029097] INFO -- : [173/885] 1069978=format_errors_test I, [2024-05-22T02:58:24.484660 #1029097] INFO -- : [174/885] 1069978=test_member I, [2024-05-22T02:58:24.489431 #1029097] INFO -- : [175/885] 1069978=test_object I, [2024-05-22T02:58:24.498066 #1029097] INFO -- : [176/885] 1069978=test_mailto I, [2024-05-22T02:58:24.503644 #1029097] INFO -- : [177/885] 1069978=test_addr I, [2024-05-22T02:58:24.519059 #1029097] INFO -- : [178/885] 1069978=test_kill_ring I, [2024-05-22T02:58:24.528735 #1029097] INFO -- : [179/885] 1069978=bom_test I, [2024-05-22T02:58:24.535620 #1029097] INFO -- : [180/885] 1069978=test_helper_method I, [2024-05-22T02:58:24.554481 #1029097] INFO -- : [181/885] 1069978=test_summary I, [2024-05-22T02:58:24.788927 #1029097] INFO -- : [182/885] 1069978=test_config I, [2024-05-22T02:58:25.118009 #1029097] INFO -- : [183/885] 1069978=test_file I, [2024-05-22T02:58:26.372477 #1029097] INFO -- : [184/885] 1069976=test_emitter I, [2024-05-22T02:58:26.380206 #1029097] INFO -- : [185/885] 1069976=test_x509ext I, [2024-05-22T02:58:26.385694 #1029097] INFO -- : [186/885] 1069976=test_append I, [2024-05-22T02:58:26.394656 #1029097] INFO -- : [187/885] 1069976=test_gem_resolver_installer_set I, [2024-05-22T02:58:26.633225 #1029097] INFO -- : [188/885] 1069976=test_rdoc_markup_to_html I, [2024-05-22T02:58:26.716680 #1029097] INFO -- : [189/885] 1069976=test_foreach I, [2024-05-22T02:58:26.788589 #1029097] INFO -- : [190/885] 1069976=test_keyword I, [2024-05-22T02:58:27.251984 #1029097] INFO -- : [191/885] 1069976=test_win32ole_type_event I, [2024-05-22T02:58:27.256810 #1029097] INFO -- : [192/885] 1069976=test_arity I, [2024-05-22T02:58:27.266613 #1029097] INFO -- : [193/885] 1069976=test_gem_path_support I, [2024-05-22T02:58:27.317689 #1029097] INFO -- : [194/885] 1069976=test_trace I, [2024-05-22T02:58:27.324087 #1029097] INFO -- : [195/885] 1069976=test_rb_str_dup I, [2024-05-22T02:58:27.336785 #1029097] INFO -- : [196/885] 1069976=test_lambda I, [2024-05-22T02:58:27.392826 #1029097] INFO -- : [197/885] 1069976=test_scalar_scanner I, [2024-05-22T02:58:27.404329 #1029097] INFO -- : [198/885] 1069976=test_random I, [2024-05-22T02:58:27.509720 #1029097] INFO -- : [199/885] 1069976=test_files_ext I, [2024-05-22T02:58:27.616193 #1029097] INFO -- : [200/885] 1069976=test_thread_cv I, [2024-05-22T02:58:28.157228 #1029097] INFO -- : [201/885] 1069976=test_stringio I, [2024-05-22T02:58:28.284373 #1029097] INFO -- : [202/885] 1069976=test_assembler I, [2024-05-22T02:58:28.292539 #1029097] INFO -- : [203/885] 1069976=test_ripper I, [2024-05-22T02:58:28.628742 #1029097] INFO -- : [204/885] 1069976=test_gem_source_git I, [2024-05-22T02:58:29.612983 #1029097] INFO -- : [205/885] 1069976=test_win32ole_method I, [2024-05-22T02:58:29.622188 #1029097] INFO -- : [206/885] 1069976=test_lexer I, [2024-05-22T02:58:29.693553 #1029097] INFO -- : [207/885] 1069976=test_regex_casefold I, [2024-05-22T02:58:30.080974 #1029097] INFO -- : [208/885] 1069976=test_unicode I, [2024-05-22T02:58:30.090958 #1029097] INFO -- : [209/885] 1069976=test_eval_history I, [2024-05-22T02:58:30.109224 #1029097] INFO -- : [210/885] 1069976=dispatcher_test I, [2024-05-22T02:58:30.151225 #1029097] INFO -- : [211/885] 1069976=test_array I, [2024-05-22T02:58:31.320384 #1029097] INFO -- : [212/885] 1069978=test_gem_package I, [2024-05-22T02:58:32.091876 #1029097] INFO -- : [213/885] 1069978=test_autoload I, [2024-05-22T02:58:33.059759 #1029097] INFO -- : [214/885] 1069977=test_class I, [2024-05-22T02:58:33.060325 #1029097] INFO -- : [215/885] 1069977=test_have_macro I, [2024-05-22T02:58:33.449401 #1029097] INFO -- : [216/885] 1069977=test_mkmf I, [2024-05-22T02:58:33.483699 #1029097] INFO -- : [217/885] 1069977=test_gem_source I, [2024-05-22T02:58:33.808047 #1029097] INFO -- : [218/885] 1069977=test_at_exit I, [2024-05-22T02:58:33.990785 #1029097] INFO -- : [219/885] 1069977=test_benchmark I, [2024-05-22T02:58:35.177071 #1029097] INFO -- : [220/885] 1069977=test_find_executable I, [2024-05-22T02:58:35.222736 #1029097] INFO -- : [221/885] 1069977=test_ractor_compatibility I, [2024-05-22T02:58:35.531667 #1029097] INFO -- : [222/885] 1069977=test_arithmetic_sequence I, [2024-05-22T02:58:35.537470 #1029097] INFO -- : [223/885] 1069977=test_autoconf I, [2024-05-22T02:58:35.541154 #1029097] INFO -- : [224/885] 1069977=integer_parse_test I, [2024-05-22T02:58:35.552455 #1029097] INFO -- : [225/885] 1069977=test_gem_request_set_lockfile_tokenizer I, [2024-05-22T02:58:35.617533 #1029097] INFO -- : [226/885] 1069977=test_cgi_multipart I, [2024-05-22T02:58:35.742148 #1029097] INFO -- : [227/885] 1069977=test_lazy_enumerator I, [2024-05-22T02:58:36.357089 #1029097] INFO -- : [228/885] 1069977=test_install I, [2024-05-22T02:58:36.369059 #1029097] INFO -- : [229/885] 1069977=test_encoding I, [2024-05-22T02:58:36.377165 #1029097] INFO -- : [230/885] 1069977=test_rdoc_comment I, [2024-05-22T02:58:36.437061 #1029097] INFO -- : [231/885] 1069977=test_gem_source_fetch_problem I, [2024-05-22T02:58:36.450794 #1029097] INFO -- : [232/885] 1069977=test_sockopt I, [2024-05-22T02:58:36.471149 #1029097] INFO -- : [233/885] 1069977=test_ftp I, [2024-05-22T02:58:36.475771 #1029097] INFO -- : [234/885] 1069977=test_singleton_function I, [2024-05-22T02:58:36.480073 #1029097] INFO -- : [235/885] 1069977=test_document I, [2024-05-22T02:58:36.483920 #1029097] INFO -- : [236/885] 1069977=test_eval I, [2024-05-22T02:58:36.490765 #1029097] INFO -- : [237/885] 1069977=test_gem_safe_yaml I, [2024-05-22T02:58:36.525260 #1029097] INFO -- : [238/885] 1069977=test_gem_commands_setup_command I, [2024-05-22T02:58:36.608060 #1029097] INFO -- : [239/885] 1069978=test_history I, [2024-05-22T02:58:36.637232 #1029097] INFO -- : [240/885] 1069978=test_win32ole_variant_m I, [2024-05-22T02:58:36.643823 #1029097] INFO -- : [241/885] 1069978=test_pair I, [2024-05-22T02:58:37.372706 #1029097] INFO -- : [242/885] 1069977=test_gem_package_tar_reader I, [2024-05-22T02:58:37.412182 #1029097] INFO -- : [243/885] 1069977=test_gem_commands_signout_command I, [2024-05-22T02:58:37.489305 #1029097] INFO -- : [244/885] 1069977=test_env I, [2024-05-22T02:58:39.930661 #1029097] INFO -- : [245/885] 1069976=command_line_test I, [2024-05-22T02:58:39.933764 #1029097] INFO -- : [246/885] 1069976=test_parser I, [2024-05-22T02:58:39.943454 #1029097] INFO -- : [247/885] 1069977=test_rdoc_ri_paths I, [2024-05-22T02:58:39.964636 #1029097] INFO -- : [248/885] 1069976=test_primitive I, [2024-05-22T02:58:39.969776 #1029097] INFO -- : [249/885] 1069977=test_iseq I, [2024-05-22T02:58:39.977927 #1029097] INFO -- : [250/885] 1069976=test_rdoc_rd_inline I, [2024-05-22T02:58:39.992200 #1029097] INFO -- : [251/885] 1069976=test_path I, [2024-05-22T02:58:39.996426 #1029097] INFO -- : [252/885] 1069976=test_digest I, [2024-05-22T02:58:40.049002 #1029097] INFO -- : [253/885] 1069976=test_closure I, [2024-05-22T02:58:40.588148 #1029097] INFO -- : [254/885] 1069977=test_rubygems I, [2024-05-22T02:58:40.794587 #1029097] INFO -- : [255/885] 1069977=test_resolve_symbol I, [2024-05-22T02:58:40.845361 #1029097] INFO -- : [256/885] 1069977=test_files_test_1 I, [2024-05-22T02:58:41.944072 #1029097] INFO -- : [257/885] 1069978=test_dir I, [2024-05-22T02:58:42.245470 #1029097] INFO -- : Leaked file descriptor: TestDir#test_home: 11 # I, [2024-05-22T02:58:42.272636 #1029097] INFO -- : COMMAND PID USER FD TYPE DEVICE SIZE/OFF NODE NAME I, [2024-05-22T02:58:42.272707 #1029097] INFO -- : ruby 1069978 opc 11r REG 252,0 9253600 13705411 /var/lib/sss/mc/passwd I, [2024-05-22T02:58:42.311464 #1029097] INFO -- : [258/885] 1069978=test_uncorrectable_name_check I, [2024-05-22T02:58:42.320213 #1029097] INFO -- : [259/885] 1069978=test_io I, [2024-05-22T02:58:42.470343 #1029097] INFO -- : [260/885] 1069976=magic_comment_test I, [2024-05-22T02:58:42.476589 #1029097] INFO -- : [261/885] 1069976=test_win32ole_variant I, [2024-05-22T02:58:42.487857 #1029097] INFO -- : [262/885] 1069976=test_cgi_modruby I, [2024-05-22T02:58:42.494385 #1029097] INFO -- : [263/885] 1069976=test_workspace I, [2024-05-22T02:58:42.614343 #1029097] INFO -- : [264/885] 1069976=test_printf I, [2024-05-22T02:58:42.638428 #1029097] INFO -- : [265/885] 1069976=test_x509attr I, [2024-05-22T02:58:42.645159 #1029097] INFO -- : [266/885] 1069976=test_stat I, [2024-05-22T02:58:42.663643 #1029097] INFO -- : [267/885] 1069976=test_gem_commands_rebuild_command I, [2024-05-22T02:58:42.740420 #1029097] INFO -- : [268/885] 1069976=test_nomethod_error I, [2024-05-22T02:58:42.776002 #1029097] INFO -- : [269/885] 1069976=test_etc I, [2024-05-22T02:58:42.780177 #1029097] INFO -- : Leaked file descriptor: TestEtc#test_getgrgid: 10 # I, [2024-05-22T02:58:42.780224 #1029097] INFO -- : Leaked file descriptor: TestEtc#test_getgrgid: 11 # I, [2024-05-22T02:58:42.805804 #1029097] INFO -- : COMMAND PID USER FD TYPE DEVICE SIZE/OFF NODE NAME I, [2024-05-22T02:58:42.805876 #1029097] INFO -- : ruby 1069976 opc 10u unix 0x0000000000000000 0t0 3088363391 type=STREAM I, [2024-05-22T02:58:42.805887 #1029097] INFO -- : ruby 1069976 opc 11r REG 252,0 6940392 13705429 /var/lib/sss/mc/group I, [2024-05-22T02:58:42.975793 #1029097] INFO -- : [270/885] 1069976=test_https_proxy I, [2024-05-22T02:58:42.983655 #1029097] INFO -- : [271/885] 1069976=test_rdoc_parser I, [2024-05-22T02:58:43.010536 #1029097] INFO -- : [272/885] 1069976=test_win32ole_param_event I, [2024-05-22T02:58:43.016619 #1029097] INFO -- : [273/885] 1069976=test_rdoc_generator_pot_po I, [2024-05-22T02:58:43.024608 #1029097] INFO -- : [274/885] 1069976=test_shellwords I, [2024-05-22T02:58:43.032465 #1029097] INFO -- : [275/885] 1069976=test_mul I, [2024-05-22T02:58:43.044341 #1029097] INFO -- : [276/885] 1069976=test_omap I, [2024-05-22T02:58:43.053708 #1029097] INFO -- : [277/885] 1069976=test_date_strptime I, [2024-05-22T02:58:43.172530 #1029097] INFO -- : [278/885] 1069976=test_scanner_events I, [2024-05-22T02:58:43.217775 #1029097] INFO -- : [279/885] 1069976=test_ocsp I, [2024-05-22T02:58:43.306546 #1029097] INFO -- : [280/885] 1069976=test_ipaddr I, [2024-05-22T02:58:43.315126 #1029097] INFO -- : [281/885] 1069977=test_rdoc_parser_simple I, [2024-05-22T02:58:43.327557 #1029097] INFO -- : [282/885] 1069977=test_nonblock I, [2024-05-22T02:58:43.349734 #1029097] INFO -- : [283/885] 1069977=test_gem_ext_configure_builder I, [2024-05-22T02:58:43.372840 #1029097] INFO -- : [284/885] 1069976=json_ext_parser_test I, [2024-05-22T02:58:43.384614 #1029097] INFO -- : [285/885] 1069976=test_color I, [2024-05-22T02:58:43.394723 #1029097] INFO -- : [286/885] 1069977=test_cmethod I, [2024-05-22T02:58:43.428251 #1029097] INFO -- : [287/885] 1069977=test_float I, [2024-05-22T02:58:43.467052 #1029097] INFO -- : [288/885] 1069976=test_gem_stub_specification I, [2024-05-22T02:58:43.632653 #1029097] INFO -- : [289/885] 1069976=test_io_m17n I, [2024-05-22T02:58:44.867899 #1029097] INFO -- : [290/885] 1069976=test_rdoc_top_level I, [2024-05-22T02:58:44.989291 #1029097] INFO -- : [291/885] 1069977=test_gem_stream_ui I, [2024-05-22T02:58:45.093170 #1029097] INFO -- : [292/885] 1069977=test_rdoc_generator_ri I, [2024-05-22T02:58:45.108084 #1029097] INFO -- : [293/885] 1069977=test_unicode_normalize I, [2024-05-22T02:58:45.150799 #1029097] INFO -- : [294/885] 1069976=test_gem_commands_lock_command I, [2024-05-22T02:58:45.180730 #1029097] INFO -- : [295/885] 1069976=test_reline_key I, [2024-05-22T02:58:45.186115 #1029097] INFO -- : [296/885] 1069976=test_propertyputref I, [2024-05-22T02:58:45.196918 #1029097] INFO -- : [297/885] 1069976=test_gb18030 I, [2024-05-22T02:58:45.234107 #1029097] INFO -- : [298/885] 1069976=test_ssl I, [2024-05-22T02:58:48.936220 #1029097] INFO -- : [299/885] 1069977=test_abi I, [2024-05-22T02:58:49.059022 #1029097] INFO -- : [300/885] 1069977=test_integer_comb I, [2024-05-22T02:58:50.905944 #1029097] INFO -- : [301/885] 1069978=test_bundled_ca I, [2024-05-22T02:58:51.765903 #1029097] INFO -- : [302/885] 1069977=test_load I, [2024-05-22T02:58:51.766899 #1029097] INFO -- : Leaked file descriptor: TestOptionParserLoad#test_load_xdg_config_dirs: 10 # I, [2024-05-22T02:58:51.792399 #1029097] INFO -- : COMMAND PID USER FD TYPE DEVICE SIZE/OFF NODE NAME I, [2024-05-22T02:58:51.792459 #1029097] INFO -- : ruby 1069977 opc 10r REG 252,0 9253600 13705411 /var/lib/sss/mc/passwd I, [2024-05-22T02:58:51.859734 #1029097] INFO -- : [303/885] 1069977=test_usrmarshal I, [2024-05-22T02:58:52.054692 #1029097] INFO -- : [304/885] 1069977=test_gem_validator I, [2024-05-22T02:58:52.075645 #1029097] INFO -- : [305/885] 1069977=test_gem_source_installed I, [2024-05-22T02:58:52.087139 #1029097] INFO -- : [306/885] 1069977=test_gem_security_trust_dir I, [2024-05-22T02:58:52.144381 #1029097] INFO -- : [307/885] 1069977=test_erb_command I, [2024-05-22T02:58:52.181663 #1029097] INFO -- : [308/885] 1069977=test_module I, [2024-05-22T02:58:53.240381 #1029097] INFO -- : [309/885] 1069978=test_engine I, [2024-05-22T02:58:53.703147 #1029097] INFO -- : [310/885] 1069978=test_fiber I, [2024-05-22T02:58:55.683024 #1029097] INFO -- : [311/885] 1069976=test_gem_commands_mirror I, [2024-05-22T02:58:55.700713 #1029097] INFO -- : [312/885] 1069976=test_win32ole_param I, [2024-05-22T02:58:55.706217 #1029097] INFO -- : [313/885] 1069976=test_key_error I, [2024-05-22T02:58:55.722494 #1029097] INFO -- : [314/885] 1069976=test_resize I, [2024-05-22T02:58:55.726493 #1029097] INFO -- : [315/885] 1069976=test_gem_package_task I, [2024-05-22T02:58:55.730499 #1029097] INFO -- : [316/885] 1069976=test_lock_native_thread I, [2024-05-22T02:58:56.017858 #1029097] INFO -- : [317/885] 1069976=test_struct I, [2024-05-22T02:58:56.026677 #1029097] INFO -- : [318/885] 1069976=static_inspect_test I, [2024-05-22T02:58:56.076773 #1029097] INFO -- : [319/885] 1069976=test_c_struct_entry I, [2024-05-22T02:58:56.324732 #1029097] INFO -- : [320/885] 1069977=fuzzer_test I, [2024-05-22T02:58:56.333415 #1029097] INFO -- : [321/885] 1069977=test_rubyvm I, [2024-05-22T02:58:56.339387 #1029097] INFO -- : [322/885] 1069977=test_cparser I, [2024-05-22T02:58:56.737703 #1029097] INFO -- : [323/885] 1069976=test_rdoc_parser_markdown I, [2024-05-22T02:58:56.759112 #1029097] INFO -- : [324/885] 1069976=test_custom_command I, [2024-05-22T02:58:56.774007 #1029097] INFO -- : [325/885] 1069976=test_change_word I, [2024-05-22T02:58:56.775290 #1029097] INFO -- : [326/885] 1069976=test_depth_first I, [2024-05-22T02:58:56.792391 #1029097] INFO -- : [327/885] 1069976=test_ostruct I, [2024-05-22T02:58:56.920928 #1029097] INFO -- : [328/885] 1069976=test_config I, [2024-05-22T02:58:56.998128 #1029097] INFO -- : [329/885] 1069976=test_new I, [2024-05-22T02:58:57.012666 #1029097] INFO -- : [330/885] 1069976=test_cipher I, [2024-05-22T02:58:57.033591 #1029097] INFO -- : [331/885] 1069976=test_update I, [2024-05-22T02:58:57.044149 #1029097] INFO -- : [332/885] 1069976=test_gem_source_lock I, [2024-05-22T02:58:57.094186 #1029097] INFO -- : [333/885] 1069976=test_load I, [2024-05-22T02:58:57.095368 #1029097] INFO -- : [334/885] 1069976=test_rdoc_rd_inline_parser I, [2024-05-22T02:58:57.144365 #1029097] INFO -- : [335/885] 1069976=test_win32ole_type I, [2024-05-22T02:58:57.147598 #1029097] INFO -- : [336/885] 1069976=test_metaclass I, [2024-05-22T02:58:57.201150 #1029097] INFO -- : [337/885] 1069976=test_require_lib I, [2024-05-22T02:58:58.500647 #1029097] INFO -- : [338/885] 1069977=test_gem_gem_runner I, [2024-05-22T02:58:58.547944 #1029097] INFO -- : [339/885] 1069977=test_rdoc_rd I, [2024-05-22T02:58:58.551125 #1029097] INFO -- : [340/885] 1069977=test_rdoc_generator_pot I, [2024-05-22T02:58:58.563099 #1029097] INFO -- : [341/885] 1069977=test_rdoc_markup_to_joined_paragraph I, [2024-05-22T02:58:58.573981 #1029097] INFO -- : [342/885] 1069977=test_rdoc_markup_to_markdown I, [2024-05-22T02:58:58.624908 #1029097] INFO -- : [343/885] 1069977=test_rdoc_rd_block_parser I, [2024-05-22T02:58:58.654705 #1029097] INFO -- : [344/885] 1069977=test_x509store I, [2024-05-22T02:58:59.175260 #1029097] INFO -- : [345/885] 1069977=test_option I, [2024-05-22T02:58:59.277543 #1029097] INFO -- : [346/885] 1069977=test_rdoc_markup_attribute_manager I, [2024-05-22T02:58:59.320860 #1029097] INFO -- : [347/885] 1069977=test_wss I, [2024-05-22T02:58:59.327884 #1029097] INFO -- : [348/885] 1069977=test_tracer I, [2024-05-22T02:58:59.393490 #1029097] INFO -- : [349/885] 1069977=test_not I, [2024-05-22T02:58:59.408593 #1029097] INFO -- : [350/885] 1069977=test_cgi_cookie I, [2024-05-22T02:58:59.448275 #1029097] INFO -- : [351/885] 1069977=test_debugger_integration I, [2024-05-22T02:58:59.494866 #1029097] INFO -- : [352/885] 1069977=test_my_integer I, [2024-05-22T02:58:59.505241 #1029097] INFO -- : [353/885] 1069977=test_gem_resolver_composed_set I, [2024-05-22T02:58:59.531697 #1029097] INFO -- : [354/885] 1069977=test_objectspace I, [2024-05-22T02:58:59.747881 #1029097] INFO -- : [355/885] 1069978=test_require I, [2024-05-22T02:59:00.018809 #1029097] INFO -- : [356/885] 1069976=test_placearg I, [2024-05-22T02:59:00.195834 #1029097] INFO -- : [357/885] 1069976=test_rational2 I, [2024-05-22T02:59:00.204188 #1029097] INFO -- : [358/885] 1069976=test_logperiod I, [2024-05-22T02:59:00.239447 #1029097] INFO -- : [359/885] 1069976=test_case_comprehensive I, [2024-05-22T02:59:00.620561 #1029097] INFO -- : [360/885] 1069977=test_ssl_session I, [2024-05-22T02:59:01.347480 #1029097] INFO -- : [361/885] 1069977=test_gem_package_tar_header I, [2024-05-22T02:59:01.419274 #1029097] INFO -- : [362/885] 1069977=test_gem_ci_detector I, [2024-05-22T02:59:01.485137 #1029097] INFO -- : [363/885] 1069977=test_continuation I, [2024-05-22T02:59:01.494887 #1029097] INFO -- : [364/885] 1069977=test_fixnum I, [2024-05-22T02:59:01.513516 #1029097] INFO -- : [365/885] 1069977=test_gem_silent_ui I, [2024-05-22T02:59:01.565608 #1029097] INFO -- : [366/885] 1069977=test_signal I, [2024-05-22T02:59:02.342786 #1029097] INFO -- : [367/885] 1069978=test_io_wait_uncommon I, [2024-05-22T02:59:02.354419 #1029097] INFO -- : [368/885] 1069978=parse_stream_test I, [2024-05-22T02:59:02.391867 #1029097] INFO -- : [369/885] 1069978=test_handle I, [2024-05-22T02:59:02.912706 #1029097] INFO -- : [370/885] 1069978=test_gem_security_policy I, [2024-05-22T02:59:03.261805 #1029097] INFO -- : [371/885] 1069978=test_rdoc_markup_document I, [2024-05-22T02:59:03.274623 #1029097] INFO -- : [372/885] 1069978=test_delete I, [2024-05-22T02:59:03.318115 #1029097] INFO -- : [373/885] 1069978=test_file_exhaustive I, [2024-05-22T02:59:03.643928 #1029097] INFO -- : [374/885] 1069977=test_completion I, [2024-05-22T02:59:04.304737 #1029097] INFO -- : [375/885] 1069977=test_name_error_extension I, [2024-05-22T02:59:04.319048 #1029097] INFO -- : [376/885] 1069977=test_gem_request_set_gem_dependency_api I, [2024-05-22T02:59:04.576937 #1029097] INFO -- : [377/885] 1069977=test_gem_commands_info_command I, [2024-05-22T02:59:04.608241 #1029097] INFO -- : [378/885] 1069977=test_https I, [2024-05-22T02:59:04.830254 #1029097] INFO -- : [379/885] 1069977=test_object_create_start I, [2024-05-22T02:59:04.841599 #1029097] INFO -- : [380/885] 1069977=test_rdoc_markup_to_ansi I, [2024-05-22T02:59:04.880533 #1029097] INFO -- : [381/885] 1069977=test_evaluation I, [2024-05-22T02:59:04.888172 #1029097] INFO -- : [382/885] 1069977=test_protocol I, [2024-05-22T02:59:05.195300 #1029097] INFO -- : [383/885] 1069977=test_files_test I, [2024-05-22T02:59:05.309987 #1029097] INFO -- : [384/885] 1069977=test_weakkeymap I, [2024-05-22T02:59:05.697345 #1029097] INFO -- : [385/885] 1069977=test_ast I, [2024-05-22T02:59:11.196297 #1029097] INFO -- : [386/885] 1069978=test_logdevice I, [2024-05-22T02:59:12.088906 #1029097] INFO -- : [387/885] 1069978=test_require_path_check I, [2024-05-22T02:59:12.205920 #1029097] INFO -- : [388/885] 1069978=test_variable_name_check I, [2024-05-22T02:59:12.249407 #1029097] INFO -- : [389/885] 1069978=test_bn I, [2024-05-22T02:59:12.261885 #1029097] INFO -- : [390/885] 1069978=test_irb I, [2024-05-22T02:59:12.515268 #1029097] INFO -- : [391/885] 1069978=test_rdoc_markup_paragraph I, [2024-05-22T02:59:12.527253 #1029097] INFO -- : [392/885] 1069978=test_x509cert I, [2024-05-22T02:59:12.608706 #1029097] INFO -- : [393/885] 1069978=test_gem_resolver_vendor_specification I, [2024-05-22T02:59:12.641211 #1029097] INFO -- : [394/885] 1069978=test_date_arith I, [2024-05-22T02:59:12.689376 #1029097] INFO -- : [395/885] 1069978=test_fiddle I, [2024-05-22T02:59:12.798562 #1029097] INFO -- : [396/885] 1069978=json_generic_object_test I, [2024-05-22T02:59:12.812248 #1029097] INFO -- : [397/885] 1069978=test_stringscanner I, [2024-05-22T02:59:12.869419 #1029097] INFO -- : [398/885] 1069978=test_ractor I, [2024-05-22T02:59:12.934270 #1029097] INFO -- : [399/885] 1069978=test_gem_resolver_installed_specification I, [2024-05-22T02:59:12.962008 #1029097] INFO -- : [400/885] 1069978=test_exception_at_throwing I, [2024-05-22T02:59:13.058531 #1029097] INFO -- : [401/885] 1069978=test_digest I, [2024-05-22T02:59:13.852809 #1029097] INFO -- : [402/885] 1069978=test_signedness I, [2024-05-22T02:59:15.732401 #1029097] INFO -- : [403/885] 1069978=test_gem_resolver_git_set I, [2024-05-22T02:59:16.338427 #1029097] INFO -- : [404/885] 1069978=test_gem_commands_check_command I, [2024-05-22T02:59:16.375138 #1029097] INFO -- : [405/885] 1069978=test_rdoc_ri_driver I, [2024-05-22T02:59:16.855618 #1029097] INFO -- : [406/885] 1069978=test_ractor I, [2024-05-22T02:59:16.889613 #1029097] INFO -- : [407/885] 1069978=test_httpheader I, [2024-05-22T02:59:16.909344 #1029097] INFO -- : [408/885] 1069978=test_sexp I, [2024-05-22T02:59:16.940707 #1029097] INFO -- : [409/885] 1069978=test_gem_safe_marshal I, [2024-05-22T02:59:17.749764 #1029097] INFO -- : [410/885] 1069978=test_gem_local_remote_options I, [2024-05-22T02:59:17.814804 #1029097] INFO -- : [411/885] 1069978=test_gem_ext_cargo_builder_link_flag_converter I, [2024-05-22T02:59:17.919209 #1029097] INFO -- : [412/885] 1069978=test_acceptable I, [2024-05-22T02:59:17.995184 #1029097] INFO -- : [413/885] 1069978=test_dup I, [2024-05-22T02:59:18.154792 #1029097] INFO -- : [414/885] 1069978=test_rdoc_single_class I, [2024-05-22T02:59:18.159249 #1029097] INFO -- : [415/885] 1069978=test_struct I, [2024-05-22T02:59:18.733626 #1029097] INFO -- : [416/885] 1069978=test_tmpdir I, [2024-05-22T02:59:18.806322 #1029097] INFO -- : [417/885] 1069978=heredoc_dedent_test I, [2024-05-22T02:59:18.816906 #1029097] INFO -- : [418/885] 1069978=test_type I, [2024-05-22T02:59:18.825086 #1029097] INFO -- : [419/885] 1069978=test_mutex I, [2024-05-22T02:59:19.956276 #1029097] INFO -- : [420/885] 1069978=test_rdoc_token_stream I, [2024-05-22T02:59:19.958309 #1029097] INFO -- : [421/885] 1069978=test_fd_setsize I, [2024-05-22T02:59:19.984019 #1029097] INFO -- : [422/885] 1069978=test_process I, [2024-05-22T02:59:19.997143 #1029097] INFO -- : [423/885] 1069978=test_forwardable I, [2024-05-22T02:59:20.055750 #1029097] INFO -- : [424/885] 1069978=!Nothing_to_test I, [2024-05-22T02:59:20.071909 #1029097] INFO -- : [425/885] 1069978=test_complex I, [2024-05-22T02:59:20.162258 #1029097] INFO -- : [426/885] 1069978=test_threadgroup I, [2024-05-22T02:59:21.160614 #1029097] INFO -- : [427/885] 1069978=test_array_create I, [2024-05-22T02:59:21.257053 #1029097] INFO -- : [428/885] 1069978=test_dir_m17n I, [2024-05-22T02:59:21.622249 #1029097] INFO -- : [429/885] 1069976=test_memory_view I, [2024-05-22T02:59:22.087810 #1029097] INFO -- : [430/885] 1069976=test_merge_keys I, [2024-05-22T02:59:22.104794 #1029097] INFO -- : [431/885] 1069976=test_storage I, [2024-05-22T02:59:22.121274 #1029097] INFO -- : [432/885] 1069976=test_err_in_callback I, [2024-05-22T02:59:22.122201 #1029097] INFO -- : [433/885] 1069976=test_method_name_check I, [2024-05-22T02:59:22.180383 #1029097] INFO -- : [434/885] 1069976=test_rdoc_extend I, [2024-05-22T02:59:22.208474 #1029097] INFO -- : [435/885] 1069976=test_cesu8 I, [2024-05-22T02:59:22.212996 #1029097] INFO -- : [436/885] 1069976=test_shapes I, [2024-05-22T02:59:22.220713 #1029097] INFO -- : [437/885] 1069976=test_did_you_mean I, [2024-05-22T02:59:22.288309 #1029097] INFO -- : [438/885] 1069976=pattern_test I, [2024-05-22T02:59:22.338555 #1029097] INFO -- : [439/885] 1069976=test_gem_rdoc I, [2024-05-22T02:59:22.393643 #1029097] INFO -- : [440/885] 1069978=test_dot_dot I, [2024-05-22T02:59:22.407271 #1029097] INFO -- : [441/885] 1069978=test_kernel I, [2024-05-22T02:59:22.466744 #1029097] INFO -- : [442/885] 1069976=test_rendering I, [2024-05-22T02:59:22.474356 #1029097] INFO -- : [443/885] 1069976=test_gem_commands_install_command I, [2024-05-22T02:59:22.988802 #1029097] INFO -- : [444/885] 1069978=test_iterator I, [2024-05-22T02:59:23.059287 #1029097] INFO -- : [445/885] 1069978=test_string I, [2024-05-22T02:59:23.063921 #1029097] INFO -- : [446/885] 1069978=test_rdoc_tom_doc I, [2024-05-22T02:59:23.081189 #1029097] INFO -- : [447/885] 1069978=test_gem_commands_pristine_command I, [2024-05-22T02:59:24.417897 #1029097] INFO -- : [448/885] 1069976=test_optarg I, [2024-05-22T02:59:24.487695 #1029097] INFO -- : [449/885] 1069976=test_variable I, [2024-05-22T02:59:24.522509 #1029097] INFO -- : [450/885] 1069978=test_hash I, [2024-05-22T02:59:24.554177 #1029097] INFO -- : [451/885] 1069978=test_key_actor_emacs I, [2024-05-22T02:59:24.586428 #1029097] INFO -- : [452/885] 1069976=test_gem_security I, [2024-05-22T02:59:24.714500 #1029097] INFO -- : [453/885] 1069978=test_erb I, [2024-05-22T02:59:24.769170 #1029097] INFO -- : [454/885] 1069978=test_date_ractor I, [2024-05-22T02:59:25.000854 #1029097] INFO -- : [455/885] 1069978=test_basicinstructions I, [2024-05-22T02:59:25.070933 #1029097] INFO -- : [456/885] 1069978=test_utf32 I, [2024-05-22T02:59:25.102233 #1029097] INFO -- : [457/885] 1069978=test_gem_resolver_git_specification I, [2024-05-22T02:59:25.371831 #1029097] INFO -- : [458/885] 1069978=test_gem_resolver_requirement_list I, [2024-05-22T02:59:25.376268 #1029097] INFO -- : [459/885] 1069978=memsize_test I, [2024-05-22T02:59:25.395905 #1029097] INFO -- : [460/885] 1069978=test_raise_exception I, [2024-05-22T02:59:25.995825 #1029097] INFO -- : [461/885] 1069978=test_arith_seq_beg_len_step I, [2024-05-22T02:59:26.005742 #1029097] INFO -- : [462/885] 1069978=test_exception I, [2024-05-22T02:59:26.018198 #1029097] INFO -- : [463/885] 1069978=test_noarg I, [2024-05-22T02:59:26.144768 #1029097] INFO -- : [464/885] 1069978=test_gem_impossible_dependencies_error I, [2024-05-22T02:59:26.147956 #1029097] INFO -- : [465/885] 1069978=test_pp I, [2024-05-22T02:59:26.196680 #1029097] INFO -- : [466/885] 1069978=test_asn1 I, [2024-05-22T02:59:26.215275 #1029097] INFO -- : [467/885] 1069978=test_gem_command I, [2024-05-22T02:59:26.332423 #1029097] INFO -- : [468/885] 1069978=test_undef I, [2024-05-22T02:59:26.342507 #1029097] INFO -- : [469/885] 1069978=test_rdoc_generator_darkfish I, [2024-05-22T02:59:26.674561 #1029097] INFO -- : [470/885] 1069978=test_gem_resolver_lock_set I, [2024-05-22T02:59:26.703460 #1029097] INFO -- : [471/885] 1069978=test_random I, [2024-05-22T02:59:26.708729 #1029097] INFO -- : [472/885] 1069978=test_assignment I, [2024-05-22T02:59:28.158758 #1029097] INFO -- : [473/885] 1069978=test_gem_update_suggestion I, [2024-05-22T02:59:28.245828 #1029097] INFO -- : [474/885] 1069978=test_verbose I, [2024-05-22T02:59:28.265016 #1029097] INFO -- : [475/885] 1069978=test_gem_commands_open_command I, [2024-05-22T02:59:28.362805 #1029097] INFO -- : [476/885] 1069978=test_normalize I, [2024-05-22T02:59:28.367999 #1029097] INFO -- : [477/885] 1069978=test_emoji_breaks I, [2024-05-22T02:59:28.372411 #1029097] INFO -- : [478/885] 1069978=test_shift_jis I, [2024-05-22T02:59:28.397217 #1029097] INFO -- : [479/885] 1069978=test_rdoc_store I, [2024-05-22T02:59:28.866167 #1029097] INFO -- : [480/885] 1069976=test_force_exit I, [2024-05-22T02:59:28.877529 #1029097] INFO -- : [481/885] 1069976=test_optimization I, [2024-05-22T02:59:29.084095 #1029097] INFO -- : [482/885] 1069978=test_data_error I, [2024-05-22T02:59:29.161277 #1029097] INFO -- : [483/885] 1069978=test_rdoc_stats I, [2024-05-22T02:59:29.203933 #1029097] INFO -- : [484/885] 1069978=test_files_sample I, [2024-05-22T02:59:29.273723 #1029097] INFO -- : [485/885] 1069978=test_rubyoptions I, [2024-05-22T02:59:35.457949 #1029097] INFO -- : [486/885] 1069978=test_yield I, [2024-05-22T02:59:35.527647 #1029097] INFO -- : [487/885] 1069976=test_show_source I, [2024-05-22T02:59:35.539152 #1029097] INFO -- : [488/885] 1069976=test_remote_fetch_error I, [2024-05-22T02:59:35.559599 #1029097] INFO -- : [489/885] 1069976=regexp_test I, [2024-05-22T02:59:35.565954 #1029097] INFO -- : [490/885] 1069976=test_rdoc_i18n_locale I, [2024-05-22T02:59:35.613600 #1029097] INFO -- : [491/885] 1069976=test_gc_compact I, [2024-05-22T02:59:38.399770 #1029097] INFO -- : [492/885] 1069978=test_dryrun I, [2024-05-22T02:59:38.418902 #1029097] INFO -- : [493/885] 1069978=test_gem_resolver_lock_specification I, [2024-05-22T02:59:38.466772 #1029097] INFO -- : [494/885] 1069978=test_boolean I, [2024-05-22T02:59:38.478519 #1029097] INFO -- : [495/885] 1069978=test_queue I, [2024-05-22T02:59:38.489173 #1029097] INFO -- : [496/885] 1069978=test_enc_raise I, [2024-05-22T02:59:38.491691 #1029097] INFO -- : [497/885] 1069978=test_clone I, [2024-05-22T02:59:38.655115 #1029097] INFO -- : [498/885] 1069978=test_ole_methods I, [2024-05-22T02:59:38.668811 #1029097] INFO -- : [499/885] 1069978=test_cgi_util I, [2024-05-22T02:59:38.870402 #1029097] INFO -- : [500/885] 1069978=test_gem_uri_formatter I, [2024-05-22T02:59:38.882742 #1029097] INFO -- : [501/885] 1069978=test_prettyprint I, [2024-05-22T02:59:38.920309 #1029097] INFO -- : [502/885] 1069978=test_gem_commands_dependency_command I, [2024-05-22T02:59:39.019140 #1029097] INFO -- : [503/885] 1069978=test_backtrace I, [2024-05-22T02:59:39.024791 #1029097] INFO -- : [504/885] 1069978=test_gbk I, [2024-05-22T02:59:39.031181 #1029097] INFO -- : [505/885] 1069978=test_unicode_escape I, [2024-05-22T02:59:39.100310 #1029097] INFO -- : [506/885] 1069978=test_switch_hitter I, [2024-05-22T02:59:39.171885 #1029097] INFO -- : [507/885] 1069978=test_default_gems I, [2024-05-22T02:59:39.179067 #1029097] INFO -- : [508/885] 1069978=test_yamldbm I, [2024-05-22T02:59:39.195145 #1029097] INFO -- : [509/885] 1069978=test_gem_spec_fetcher I, [2024-05-22T02:59:39.217782 #1029097] INFO -- : [510/885] 1069976=test_hash_create I, [2024-05-22T02:59:39.224746 #1029097] INFO -- : [511/885] 1069976=test_grapheme_breaks I, [2024-05-22T02:59:39.242699 #1029097] INFO -- : [512/885] 1069976=static_literals_test I, [2024-05-22T02:59:39.265614 #1029097] INFO -- : [513/885] 1069976=test_tree_spell_checker I, [2024-05-22T02:59:39.337939 #1029097] INFO -- : [514/885] 1069976=test_rdoc_method_attr I, [2024-05-22T02:59:39.364288 #1029097] INFO -- : [515/885] 1069978=test_enumerable I, [2024-05-22T02:59:39.374263 #1029097] INFO -- : [516/885] 1069978=test_set I, [2024-05-22T02:59:39.408743 #1029097] INFO -- : [517/885] 1069978=test_webauthn_listener I, [2024-05-22T02:59:39.422740 #1029097] INFO -- : Leaked file descriptor: WebauthnListenerTest#test_wait_for_otp_code_options_request: 14 : # I, [2024-05-22T02:59:39.455208 #1029097] INFO -- : COMMAND PID USER FD TYPE DEVICE SIZE/OFF NODE NAME I, [2024-05-22T02:59:39.455273 #1029097] INFO -- : ruby 1069978 opc 14u IPv4 3088377903 0t0 TCP localhost:41531->localhost:52580 (CLOSE_WAIT) I, [2024-05-22T02:59:39.492171 #1029097] INFO -- : [518/885] 1069976=test_ractor I, [2024-05-22T02:59:39.493875 #1029097] INFO -- : [519/885] 1069976=test_rdoc_rubygems_hook I, [2024-05-22T02:59:39.520327 #1029097] INFO -- : .Closed file descriptor: WebauthnListenerTest#test_wait_for_otp_code_get_follows_options: 14 I, [2024-05-22T02:59:39.582668 #1029097] INFO -- : [520/885] 1069976=test_gem_resolver_api_specification I, [2024-05-22T02:59:39.592135 #1029097] INFO -- : [521/885] 1069978=test_case_mapping I, [2024-05-22T02:59:39.600293 #1029097] INFO -- : [522/885] 1069978=test_rational I, [2024-05-22T02:59:39.621784 #1029097] INFO -- : [523/885] 1069978=test_gem_ext_cargo_builder_unit I, [2024-05-22T02:59:39.632348 #1029097] INFO -- : [524/885] 1069976=test_buffering I, [2024-05-22T02:59:39.639710 #1029097] INFO -- : [525/885] 1069976=test_svcb_https I, [2024-05-22T02:59:39.653378 #1029097] INFO -- : [526/885] 1069978=test_pkey_ec I, [2024-05-22T02:59:39.663818 #1029097] INFO -- : [527/885] 1069976=test_arity I, [2024-05-22T02:59:39.673807 #1029097] INFO -- : [528/885] 1069978=test_thread I, [2024-05-22T02:59:39.674984 #1029097] INFO -- : [529/885] 1069978=test_date_parse I, [2024-05-22T02:59:39.703741 #1029097] INFO -- : [530/885] 1069976=test_open3 I, [2024-05-22T02:59:39.802111 #1029097] INFO -- : [531/885] 1069978=test_mdns I, [2024-05-22T02:59:39.804175 #1029097] INFO -- : [532/885] 1069978=test_key_event_record I, [2024-05-22T02:59:39.807870 #1029097] INFO -- : [533/885] 1069978=parser_test I, [2024-05-22T02:59:39.820445 #1029097] INFO -- : [534/885] 1069978=test_hash I, [2024-05-22T02:59:42.414515 #1029097] INFO -- : [535/885] 1069976=test_http I, [2024-05-22T02:59:42.416254 #1029097] INFO -- : [536/885] 1069976=test_gem_dependency_installer I, [2024-05-22T02:59:44.180678 #1029097] INFO -- : [537/885] 1069978=test_pty I, [2024-05-22T02:59:44.655775 #1029097] INFO -- : [538/885] 1069978=test_gem_package_old I, [2024-05-22T02:59:44.709344 #1029097] INFO -- : [539/885] 1069978=test_gem_commands_which_command I, [2024-05-22T02:59:44.753002 #1029097] INFO -- : [540/885] 1069978=test_gem_request I, [2024-05-22T02:59:44.988162 #1029097] INFO -- : [541/885] 1069978=test_gem_commands_specification_command I, [2024-05-22T02:59:45.037469 #1029097] INFO -- : [542/885] 1069976=test_scan_args I, [2024-05-22T02:59:45.067371 #1029097] INFO -- : [543/885] 1069976=encoding_test I, [2024-05-22T02:59:45.128137 #1029097] INFO -- : [544/885] 1069978=test_sprintf_comb I, [2024-05-22T02:59:45.156044 #1029097] INFO -- : [545/885] 1069976=test_too_many_dummy_encodings I, [2024-05-22T02:59:45.226727 #1029097] INFO -- : [546/885] 1069976=test_method_cache I, [2024-05-22T02:59:45.240775 #1029097] INFO -- : [547/885] 1069976=locals_test I, [2024-05-22T02:59:45.295032 #1029097] INFO -- : [548/885] 1069978=test_gem_commands_push_command I, [2024-05-22T02:59:45.670317 #1029097] INFO -- : [549/885] 1069976=test_tracepoint I, [2024-05-22T02:59:45.993628 #1029097] INFO -- : [550/885] 1069976=test_gem_text I, [2024-05-22T02:59:46.048976 #1029097] INFO -- : [551/885] 1069976=test_settracefunc I, [2024-05-22T02:59:46.050723 #1029097] INFO -- : [552/885] 1069978=test_backtrace I, [2024-05-22T02:59:47.150561 #1029097] INFO -- : [553/885] 1069976=test_rdoc_task I, [2024-05-22T02:59:47.169150 #1029097] INFO -- : [554/885] 1069976=test_gem_gemcutter_utilities I, [2024-05-22T02:59:47.391855 #1029097] INFO -- : [555/885] 1069978=test_win32ole I, [2024-05-22T02:59:47.397951 #1029097] INFO -- : [556/885] 1069978=test_internal_ivar I, [2024-05-22T02:59:47.409591 #1029097] INFO -- : [557/885] 1069978=desugar_compiler_test I, [2024-05-22T02:59:47.424128 #1029097] INFO -- : [558/885] 1069978=test_gem_source_local I, [2024-05-22T02:59:47.643528 #1029097] INFO -- : [559/885] 1069976=test_rendering I, [2024-05-22T02:59:47.664605 #1029097] INFO -- : [560/885] 1069976=test_http I, [2024-05-22T02:59:47.670746 #1029097] INFO -- : [561/885] 1069978=test_utf16 I, [2024-05-22T02:59:47.684126 #1029097] INFO -- : [562/885] 1069978=attribute_write_test I, [2024-05-22T02:59:47.686454 #1029097] INFO -- : [563/885] 1069978=test_set I, [2024-05-22T02:59:47.698533 #1029097] INFO -- : [564/885] 1069978=test_gem_package_tar_writer I, [2024-05-22T02:59:47.847692 #1029097] INFO -- : [565/885] 1069978=test_str2big I, [2024-05-22T02:59:47.855292 #1029097] INFO -- : [566/885] 1069978=test_severity I, [2024-05-22T02:59:47.856784 #1029097] INFO -- : [567/885] 1069978=test_case I, [2024-05-22T02:59:47.860761 #1029097] INFO -- : [568/885] 1069978=test_ractor I, [2024-05-22T02:59:47.882038 #1029097] INFO -- : [569/885] 1069978=test_rdoc_markup_to_rdoc I, [2024-05-22T02:59:47.945872 #1029097] INFO -- : [570/885] 1069978=test_m17n I, [2024-05-22T02:59:48.010500 #1029097] INFO -- : [571/885] 1069978=test_method I, [2024-05-22T02:59:50.669082 #1029097] INFO -- : [572/885] 1069977=test_gem_dependency I, [2024-05-22T02:59:50.836066 #1029097] INFO -- : [573/885] 1069977=test_cclass I, [2024-05-22T02:59:50.984531 #1029097] INFO -- : [574/885] 1069977=test_gem_uninstaller I, [2024-05-22T02:59:52.247409 #1029097] INFO -- : [575/885] 1069977=test_yjit I, [2024-05-22T02:59:52.266083 #1029097] INFO -- : [576/885] 1069977=test_yaml I, [2024-05-22T02:59:52.345282 #1029097] INFO -- : [577/885] 1069977=test_x509name I, [2024-05-22T02:59:52.420904 #1029097] INFO -- : [578/885] 1069977=test_argf I, [2024-05-22T02:59:55.942326 #1029097] INFO -- : [579/885] 1069977=test_gem_remote_fetcher I, [2024-05-22T02:59:56.553683 #1029097] INFO -- : [580/885] 1069976=test_koi8 I, [2024-05-22T02:59:56.563452 #1029097] INFO -- : [581/885] 1069976=test_json_tree I, [2024-05-22T02:59:56.584213 #1029097] INFO -- : [582/885] 1069976=test_pkcs12 I, [2024-05-22T02:59:57.286956 #1029097] INFO -- : [583/885] 1069976=test_filter I, [2024-05-22T02:59:57.335471 #1029097] INFO -- : [584/885] 1069976=test_parser_events I, [2024-05-22T02:59:57.457168 #1029097] INFO -- : [585/885] 1069976=test_numhash I, [2024-05-22T02:59:57.465894 #1029097] INFO -- : [586/885] 1069976=test_system I, [2024-05-22T02:59:57.946003 #1029097] INFO -- : [587/885] 1069977=test_flush I, [2024-05-22T02:59:57.983074 #1029097] INFO -- : [588/885] 1069977=test_pkey_rsa I, [2024-05-22T02:59:58.001169 #1029097] INFO -- : [589/885] 1069978=test_gem_specification I, [2024-05-22T02:59:58.241878 #1029097] INFO -- : [590/885] 1069977=test_win32ole_variable I, [2024-05-22T02:59:58.263956 #1029097] INFO -- : [591/885] 1069977=test_rdoc_class_module I, [2024-05-22T02:59:58.338876 #1029097] INFO -- : [592/885] 1069976=test_rdoc_cross_reference I, [2024-05-22T02:59:58.755128 #1029097] INFO -- : [593/885] 1069977=test_parse I, [2024-05-22T02:59:58.766601 #1029097] INFO -- : [594/885] 1069976=test_method_cache I, [2024-05-22T02:59:58.772379 #1029097] INFO -- : [595/885] 1069976=test_sorted_set I, [2024-05-22T02:59:59.001214 #1029097] INFO -- : [596/885] 1069976=test_emoji I, [2024-05-22T02:59:59.058805 #1029097] INFO -- : [597/885] 1069976=test_stack I, [2024-05-22T02:59:59.222125 #1029097] INFO -- : [598/885] 1069977=test_windows_1252 I, [2024-05-22T02:59:59.247116 #1029097] INFO -- : [599/885] 1069977=test_gem_dependency_resolution_error I, [2024-05-22T02:59:59.257002 #1029097] INFO -- : [600/885] 1069977=test_mixed_unicode_escapes I, [2024-05-22T02:59:59.273523 #1029097] INFO -- : [601/885] 1069977=test_sleep I, [2024-05-22T02:59:59.855318 #1029097] INFO -- : [602/885] 1069976=test_fileutils I, [2024-05-22T03:00:00.361689 #1029097] INFO -- : [603/885] 1069976=test_cp949 I, [2024-05-22T03:00:00.372040 #1029097] INFO -- : [604/885] 1069976=test_jaro_winkler I, [2024-05-22T03:00:00.383661 #1029097] INFO -- : [605/885] 1069976=test_condition I, [2024-05-22T03:00:00.389310 #1029097] INFO -- : [606/885] 1069976=test_gem_resolver_vendor_set I, [2024-05-22T03:00:00.418807 #1029097] INFO -- : [607/885] 1069976=test_gem_install_update_options I, [2024-05-22T03:00:00.554054 #1029097] INFO -- : [608/885] 1069976=test_econv I, [2024-05-22T03:00:00.756998 #1029097] INFO -- : [609/885] 1069978=test_stringchar I, [2024-05-22T03:00:00.768807 #1029097] INFO -- : [610/885] 1069978=warnings_test I, [2024-05-22T03:00:00.781603 #1029097] INFO -- : [611/885] 1069978=test_face I, [2024-05-22T03:00:00.802227 #1029097] INFO -- : [612/885] 1069978=test_date_attr I, [2024-05-22T03:00:01.316829 #1029097] INFO -- : [613/885] 1069978=test_sizeof I, [2024-05-22T03:00:01.323682 #1029097] INFO -- : [614/885] 1069977=test_gem_request_set_lockfile_parser I, [2024-05-22T03:00:01.409874 #1029097] INFO -- : [615/885] 1069976=test_pinned I, [2024-05-22T03:00:01.484797 #1029097] INFO -- : [616/885] 1069977=test_pack I, [2024-05-22T03:00:01.548512 #1029097] INFO -- : [617/885] 1069977=test_cgi_tag_helper I, [2024-05-22T03:00:01.556805 #1029097] INFO -- : [618/885] 1069976=test_coderange I, [2024-05-22T03:00:01.558467 #1029097] INFO -- : [619/885] 1069976=test_weakmap I, [2024-05-22T03:00:01.570898 #1029097] INFO -- : [620/885] 1069977=test_inadvertent_creation I, [2024-05-22T03:00:01.665671 #1029097] INFO -- : [621/885] 1069977=test_ansi_with_terminfo I, [2024-05-22T03:00:01.667533 #1029097] INFO -- : [622/885] 1069977=test_framework I, [2024-05-22T03:00:01.677086 #1029097] INFO -- : [623/885] 1069977=test_date_time I, [2024-05-22T03:00:01.688732 #1029097] INFO -- : [624/885] 1069977=test_nil2vtempty I, [2024-05-22T03:00:01.700424 #1029097] INFO -- : [625/885] 1069977=test_rdoc_generator_json_index I, [2024-05-22T03:00:01.732137 #1029097] INFO -- : [626/885] 1069977=test_array I, [2024-05-22T03:00:01.752126 #1029097] INFO -- : [627/885] 1069977=test_gem_command_manager I, [2024-05-22T03:00:01.939371 #1029097] INFO -- : [628/885] 1069977=test_rdoc_context I, [2024-05-22T03:00:02.723008 #1029097] INFO -- : [629/885] 1069977=test_enc_associate I, [2024-05-22T03:00:03.150578 #1029097] INFO -- : [630/885] 1069977=test_enumerator I, [2024-05-22T03:00:03.196339 #1029097] INFO -- : [631/885] 1069978=test_case I, [2024-05-22T03:00:03.259971 #1029097] INFO -- : [632/885] 1069978=test_open-uri I, [2024-05-22T03:00:03.646144 #1029097] INFO -- : [633/885] 1069978=test_const I, [2024-05-22T03:00:03.653970 #1029097] INFO -- : [634/885] 1069978=index_write_test I, [2024-05-22T03:00:03.662591 #1029097] INFO -- : [635/885] 1069978=test_rdoc_parser_rd I, [2024-05-22T03:00:03.694282 #1029097] INFO -- : [636/885] 1069978=test_class I, [2024-05-22T03:00:08.829052 #1029097] INFO -- : [637/885] 1069978=test_exit I, [2024-05-22T03:00:08.908292 #1029097] INFO -- : [638/885] 1069978=test_name_error I, [2024-05-22T03:00:08.991319 #1029097] INFO -- : [639/885] 1069978=test_gem_source_list I, [2024-05-22T03:00:09.074218 #1029097] INFO -- : [640/885] 1069978=json_addition_test I, [2024-05-22T03:00:09.090854 #1029097] INFO -- : [641/885] 1069978=test_gem_commands_sources_command I, [2024-05-22T03:00:09.315942 #1029097] INFO -- : [642/885] 1069978=test_yaml_special_cases I, [2024-05-22T03:00:09.328376 #1029097] INFO -- : [643/885] 1069978=test_recorder I, [2024-05-22T03:00:09.434440 #1029097] INFO -- : [644/885] 1069978=test_sprintf I, [2024-05-22T03:00:09.569150 #1029097] INFO -- : [645/885] 1069978=test_safe_load I, [2024-05-22T03:00:09.583037 #1029097] INFO -- : [646/885] 1069978=test_libs I, [2024-05-22T03:00:09.595825 #1029097] INFO -- : [647/885] 1069978=test_iso_8859 I, [2024-05-22T03:00:09.718760 #1029097] INFO -- : [648/885] 1069978=ripper_test I, [2024-05-22T03:00:10.388696 #1029097] INFO -- : [649/885] 1069978=test_qsort I, [2024-05-22T03:00:10.397072 #1029097] INFO -- : [650/885] 1069978=comments_test I, [2024-05-22T03:00:10.399079 #1029097] INFO -- : [651/885] 1069978=test_gc I, [2024-05-22T03:00:10.410257 #1029097] INFO -- : [652/885] 1069978=test_math I, [2024-05-22T03:00:10.430570 #1029097] INFO -- : [653/885] 1069978=test_function I, [2024-05-22T03:00:10.671360 #1029097] INFO -- : [654/885] 1069978=test_gem_resolver_activation_request I, [2024-05-22T03:00:10.689598 #1029097] INFO -- : [655/885] 1069978=test_gem_commands_server_command I, [2024-05-22T03:00:10.697000 #1029097] INFO -- : [656/885] 1069978=test_pipe I, [2024-05-22T03:00:10.817632 #1029097] INFO -- : [657/885] 1069978=test_macro I, [2024-05-22T03:00:10.851439 #1029097] INFO -- : [658/885] 1069978=test_string I, [2024-05-22T03:00:14.307774 #1029097] INFO -- : [659/885] 1069976=test_gem_requirement I, [2024-05-22T03:00:14.472990 #1029097] INFO -- : [660/885] 1069976=test_gem_name_tuple I, [2024-05-22T03:00:14.495336 #1029097] INFO -- : [661/885] 1069976=test_rdoc_markup_to_table_of_contents I, [2024-05-22T03:00:14.575511 #1029097] INFO -- : [662/885] 1069976=test_integer I, [2024-05-22T03:00:14.612673 #1029097] INFO -- : [663/885] 1069976=test_tcp I, [2024-05-22T03:00:14.761424 #1029097] INFO -- : [664/885] 1069976=test_win32ole_method_event I, [2024-05-22T03:00:14.769473 #1029097] INFO -- : [665/885] 1069976=parse_comments_test I, [2024-05-22T03:00:14.781279 #1029097] INFO -- : [666/885] 1069976=test_capacity I, [2024-05-22T03:00:14.800062 #1029097] INFO -- : [667/885] 1069976=test_gem_commands_owner_command I, [2024-05-22T03:00:15.539748 #1029097] INFO -- : [668/885] 1069976=test_nextafter I, [2024-05-22T03:00:15.690825 #1029097] INFO -- : [669/885] 1069976=test_file I, [2024-05-22T03:00:15.700732 #1029097] INFO -- : [670/885] 1069976=test_time I, [2024-05-22T03:00:16.005307 #1029097] INFO -- : [671/885] 1069976=test_flags I, [2024-05-22T03:00:16.411113 #1029097] INFO -- : [672/885] 1069976=test_bug-3571 I, [2024-05-22T03:00:16.423975 #1029097] INFO -- : [673/885] 1069976=test_yamlstore I, [2024-05-22T03:00:16.442153 #1029097] INFO -- : [674/885] 1069976=test_numeric I, [2024-05-22T03:00:16.524416 #1029097] INFO -- : [675/885] 1069976=test_rat I, [2024-05-22T03:00:16.546923 #1029097] INFO -- : [676/885] 1069976=test_gem_request_connection_pools I, [2024-05-22T03:00:17.658506 #1029097] INFO -- : [677/885] 1069976=test_init I, [2024-05-22T03:00:18.364227 #1029097] INFO -- : [678/885] 1069976=test_constant I, [2024-05-22T03:00:20.848731 #1029097] INFO -- : [679/885] 1069976=test_find I, [2024-05-22T03:00:20.884989 #1029097] INFO -- : [680/885] 1069976=test_rdoc_generator_markup I, [2024-05-22T03:00:20.927884 #1029097] INFO -- : [681/885] 1069976=test_encoding I, [2024-05-22T03:00:21.225891 #1029097] INFO -- : [682/885] 1069976=test_hmac I, [2024-05-22T03:00:21.235805 #1029097] INFO -- : [683/885] 1069976=test_date_compat I, [2024-05-22T03:00:21.241880 #1029097] INFO -- : [684/885] 1069976=test_win32ole_record I, [2024-05-22T03:00:21.266086 #1029097] INFO -- : [685/885] 1069976=test_rdoc_include I, [2024-05-22T03:00:21.323733 #1029097] INFO -- : [686/885] 1069976=test_gem_version_option I, [2024-05-22T03:00:21.403377 #1029097] INFO -- : [687/885] 1069976=test_ubf_async_safe I, [2024-05-22T03:00:21.422454 #1029097] INFO -- : [688/885] 1069976=test_pstore I, [2024-05-22T03:00:21.671513 #1029097] INFO -- : [689/885] 1069976=test_zlib I, [2024-05-22T03:00:35.545224 #1029097] INFO -- : [690/885] 1069976=test_rdoc_options I, [2024-05-22T03:00:35.879012 #1029097] INFO -- : [691/885] 1069976=test_gem_commands_unpack_command I, [2024-05-22T03:00:36.260461 #1029097] INFO -- : [692/885] 1069976=test_gem_ext_cargo_builder I, [2024-05-22T03:00:36.288241 #1029097] INFO -- : [693/885] 1069976=test_proc I, [2024-05-22T03:00:37.192554 #1029097] INFO -- : [694/885] 1069976=test_console_attr I, [2024-05-22T03:00:37.282263 #1029097] INFO -- : [695/885] 1069976=test_frozen_error I, [2024-05-22T03:00:37.298667 #1029097] INFO -- : [696/885] 1069976=test_spell_checker I, [2024-05-22T03:00:37.315319 #1029097] INFO -- : [697/885] 1069976=test_gem_version I, [2024-05-22T03:00:37.661428 #1029097] INFO -- : [698/885] 1069976=test_gem_ext_ext_conf_builder I, [2024-05-22T03:00:38.633287 #1029097] INFO -- : [699/885] 1069976=test_reqarg I, [2024-05-22T03:00:39.041327 #1029097] INFO -- : [700/885] 1069976=test_enumerator I, [2024-05-22T03:00:39.050261 #1029097] INFO -- : [701/885] 1069976=test_path_to_class I, [2024-05-22T03:00:39.139958 #1029097] INFO -- : [702/885] 1069976=test_c_struct_builder I, [2024-05-22T03:00:39.539994 #1029097] INFO -- : [703/885] 1069976=test_bug-5832 I, [2024-05-22T03:00:39.551053 #1029097] INFO -- : [704/885] 1069976=test_yield_block I, [2024-05-22T03:00:39.564151 #1029097] INFO -- : [705/885] 1069976=test_gem_uri I, [2024-05-22T03:00:39.604843 #1029097] INFO -- : [706/885] 1069976=test_resource I, [2024-05-22T03:00:39.639542 #1029097] INFO -- : [707/885] 1069976=test_gem_package_tar_reader_entry I, [2024-05-22T03:00:40.055991 #1029097] INFO -- : [708/885] 1069976=test_type_completor I, [2024-05-22T03:00:40.073975 #1029097] INFO -- : [709/885] 1069976=test_rdoc_normal_module I, [2024-05-22T03:00:40.113785 #1029097] INFO -- : [710/885] 1069976=test_io_timeout I, [2024-05-22T03:00:40.142167 #1029097] INFO -- : [711/885] 1069976=test_rdoc_markdown_test I, [2024-05-22T03:00:41.433194 #1029097] INFO -- : [712/885] 1069976=test_rdoc_rdoc I, [2024-05-22T03:00:41.524700 #1029097] INFO -- : [713/885] 1069976=test_yjit_exit_locations I, [2024-05-22T03:00:41.534855 #1029097] INFO -- : [714/885] 1069976=test_comparable I, [2024-05-22T03:00:41.547678 #1029097] INFO -- : [715/885] 1069976=json_string_matching_test I, [2024-05-22T03:00:41.563996 #1029097] INFO -- : [716/885] 1069976=test_gem_config_file I, [2024-05-22T03:00:41.800404 #1029097] INFO -- : [717/885] 1069976=test_thread_queue I, [2024-05-22T03:00:47.551647 #1029097] INFO -- : [718/885] 1069977=test_defined I, [2024-05-22T03:00:47.631013 #1029097] INFO -- : [719/885] 1069977=test_passing_block I, [2024-05-22T03:00:47.644892 #1029097] INFO -- : [720/885] 1069977=test_nowrite I, [2024-05-22T03:00:47.681619 #1029097] INFO -- : [721/885] 1069977=test_kdf I, [2024-05-22T03:00:47.739141 #1029097] INFO -- : [722/885] 1069977=test_ldap I, [2024-05-22T03:00:47.752240 #1029097] INFO -- : [723/885] 1069977=test_io_buffer I, [2024-05-22T03:00:47.849766 #1029097] INFO -- : [724/885] 1069977=test_nil I, [2024-05-22T03:00:47.862233 #1029097] INFO -- : [725/885] 1069977=test_psych I, [2024-05-22T03:00:47.890294 #1029097] INFO -- : [726/885] 1069977=test_human_typo I, [2024-05-22T03:00:47.988280 #1029097] INFO -- : [727/885] 1069977=test_import I, [2024-05-22T03:00:48.793193 #1029097] INFO -- : [728/885] 1069976=test_wait I, [2024-05-22T03:00:48.831737 #1029097] INFO -- : [729/885] 1069976=test_logger I, [2024-05-22T03:00:48.859585 #1029097] INFO -- : [730/885] 1069976=test_pkey_dsa I, [2024-05-22T03:00:51.246475 #1029097] INFO -- : [731/885] 1069976=test_big2str I, [2024-05-22T03:00:51.270632 #1029097] INFO -- : [732/885] 1069976=test_gem_resolver_specification I, [2024-05-22T03:00:51.291606 #1029097] INFO -- : [733/885] 1069976=test_cstr I, [2024-05-22T03:00:51.744664 #1029097] INFO -- : [734/885] 1069977=test_euc_tw I, [2024-05-22T03:00:51.772072 #1029097] INFO -- : [735/885] 1069977=test_command I, [2024-05-22T03:00:52.153845 #1029097] INFO -- : [736/885] 1069977=test_gem_resolver_dependency_request I, [2024-05-22T03:00:52.194195 #1029097] INFO -- : [737/885] 1069977=test_yaml_tree I, [2024-05-22T03:00:52.244162 #1029097] INFO -- : [738/885] 1069977=test_gem_commands_yank_command I, [2024-05-22T03:00:52.757587 #1029097] INFO -- : [739/885] 1069977=reflection_test I, [2024-05-22T03:00:52.768798 #1029097] INFO -- : [740/885] 1069977=test_line_editor I, [2024-05-22T03:00:52.780669 #1029097] INFO -- : [741/885] 1069977=test_marshalable I, [2024-05-22T03:00:52.790306 #1029097] INFO -- : [742/885] 1069977=test_enumerator_kw I, [2024-05-22T03:00:52.927032 #1029097] INFO -- : [743/885] 1069977=test_string_memory I, [2024-05-22T03:00:53.176338 #1029097] INFO -- : [744/885] 1069977=test_help I, [2024-05-22T03:00:53.178342 #1029097] INFO -- : [745/885] 1069977=test_files_lib I, [2024-05-22T03:00:53.186230 #1029097] INFO -- : [746/885] 1069977=version_test I, [2024-05-22T03:00:53.188291 #1029097] INFO -- : [747/885] 1069977=test_raise I, [2024-05-22T03:00:53.200666 #1029097] INFO -- : [748/885] 1069977=test_complexrational I, [2024-05-22T03:00:53.221742 #1029097] INFO -- : [749/885] 1069977=test_error_highlight I, [2024-05-22T03:00:53.398736 #1029097] INFO -- : [750/885] 1069978=test_rdoc_any_method I, [2024-05-22T03:00:53.868533 #1029097] INFO -- : [751/885] 1069977=test_function_entry I, [2024-05-22T03:00:53.876090 #1029097] INFO -- : [752/885] 1069977=test_string I, [2024-05-22T03:00:53.880691 #1029097] INFO -- : [753/885] 1069978=json_common_interface_test I, [2024-05-22T03:00:53.891896 #1029097] INFO -- : [754/885] 1069977=test_rdoc_markup_pre_process I, [2024-05-22T03:00:53.909084 #1029097] INFO -- : [755/885] 1069978=test_store I, [2024-05-22T03:00:54.119589 #1029097] INFO -- : [756/885] 1069976=test_coverage I, [2024-05-22T03:00:54.199750 #1029097] INFO -- : [757/885] 1069977=test_http_request I, [2024-05-22T03:00:54.209680 #1029097] INFO -- : [758/885] 1069978=test_tempfile I, [2024-05-22T03:00:54.214130 #1029097] INFO -- : [759/885] 1069977=test_fnmatch I, [2024-05-22T03:00:54.264306 #1029097] INFO -- : [760/885] 1069977=test_pathname I, [2024-05-22T03:00:54.459077 #1029097] INFO -- : [761/885] 1069978=test_gem_commands_update_command I, [2024-05-22T03:00:54.503378 #1029097] INFO -- : [762/885] 1069977=test_date I, [2024-05-22T03:00:54.518705 #1029097] INFO -- : [763/885] 1069977=test_big5 I, [2024-05-22T03:00:54.614655 #1029097] INFO -- : [764/885] 1069977=test_protect I, [2024-05-22T03:00:54.636967 #1029097] INFO -- : [765/885] 1069977=test_tree_builder I, [2024-05-22T03:00:54.639607 #1029097] INFO -- : [766/885] 1069977=test_frozen I, [2024-05-22T03:00:54.661755 #1029097] INFO -- : [767/885] 1069977=test_gem_resolver_index_specification I, [2024-05-22T03:00:54.713235 #1029097] INFO -- : [768/885] 1069977=test_serialize_subclasses I, [2024-05-22T03:00:54.732969 #1029097] INFO -- : [769/885] 1069977=test_egrep_cpp I, [2024-05-22T03:00:54.844685 #1029097] INFO -- : [770/885] 1069977=test_rdoc_markup_verbatim I, [2024-05-22T03:00:54.858847 #1029097] INFO -- : [771/885] 1069977=test_webauthn_poller I, [2024-05-22T03:00:54.941950 #1029097] INFO -- : [772/885] 1069976=test_date_conv I, [2024-05-22T03:00:55.009077 #1029097] INFO -- : [773/885] 1069976=test_timeout I, [2024-05-22T03:00:55.017088 #1029097] INFO -- : [774/885] 1069977=test_erb_m17n I, [2024-05-22T03:00:55.025441 #1029097] INFO -- : [775/885] 1069976=test_rdoc_generator_pot_po_entry I, [2024-05-22T03:00:55.033452 #1029097] INFO -- : [776/885] 1069977=test_complex2 I, [2024-05-22T03:00:55.047531 #1029097] INFO -- : [777/885] 1069976=test_config I, [2024-05-22T03:00:55.068867 #1029097] INFO -- : [778/885] 1069977=test_gem_security_signer I, [2024-05-22T03:00:55.098463 #1029097] INFO -- : [779/885] 1069976=test_gem_util I, [2024-05-22T03:00:55.164307 #1029097] INFO -- : [780/885] 1069977=test_thread I, [2024-05-22T03:00:55.275839 #1029097] INFO -- : [781/885] 1069976=test_gem_unsatisfiable_dependency_error I, [2024-05-22T03:00:55.309171 #1029097] INFO -- : [782/885] 1069976=test_literal I, [2024-05-22T03:00:55.398341 #1029097] INFO -- : [783/885] 1069977=test_rdoc_i18n_text I, [2024-05-22T03:00:55.411546 #1029097] INFO -- : [784/885] 1069977=test_io I, [2024-05-22T03:00:55.616253 #1029097] INFO -- : [785/885] 1069977=test_input_method I, [2024-05-22T03:00:55.653239 #1029097] INFO -- : [786/885] 1069977=test_m17n_comb I, [2024-05-22T03:00:55.867877 #1029097] INFO -- : [787/885] 1069976=test_multi_irb_commands I, [2024-05-22T03:00:55.875835 #1029097] INFO -- : [788/885] 1069976=test_pkey_dh I, [2024-05-22T03:00:56.245932 #1029097] INFO -- : [789/885] 1069978=test_data I, [2024-05-22T03:00:56.260681 #1029097] INFO -- : [790/885] 1069978=test_memory_view I, [2024-05-22T03:00:56.298081 #1029097] INFO -- : [791/885] 1069978=test_ractor I, [2024-05-22T03:00:56.341315 #1029097] INFO -- : [792/885] 1069978=test_null I, [2024-05-22T03:00:56.351381 #1029097] INFO -- : [793/885] 1069978=test_gem_platform I, [2024-05-22T03:00:56.480853 #1029097] INFO -- : [794/885] 1069978=test_gem_commands_query_command I, [2024-05-22T03:00:57.182253 #1029097] INFO -- : [795/885] 1069978=test_bigzero I, [2024-05-22T03:00:57.197380 #1029097] INFO -- : [796/885] 1069978=test_pkey I, [2024-05-22T03:00:57.209809 #1029097] INFO -- : [797/885] 1069978=test_external_new I, [2024-05-22T03:00:57.212478 #1029097] INFO -- : [798/885] 1069978=test_win32ole_typelib I, [2024-05-22T03:00:57.228813 #1029097] INFO -- : [799/885] 1069978=test_gem_commands_cert_command I, [2024-05-22T03:00:57.246823 #1029097] INFO -- : [800/885] 1069976=test_rdoc_markup_to_tt_only I, [2024-05-22T03:00:57.293709 #1029097] INFO -- : [801/885] 1069976=json_parser_test I, [2024-05-22T03:00:57.338245 #1029097] INFO -- : [802/885] 1069976=test_date_strftime I, [2024-05-22T03:00:57.841404 #1029097] INFO -- : [803/885] 1069976=test_ws I, [2024-05-22T03:00:57.860876 #1029097] INFO -- : [804/885] 1069976=test_gem_commands_stale_command I, [2024-05-22T03:00:57.866807 #1029097] INFO -- : [805/885] 1069976=ruby_parser_test I, [2024-05-22T03:00:57.878401 #1029097] INFO -- : [806/885] 1069976=test_instrumentation_api I, [2024-05-22T03:00:58.202103 #1029097] INFO -- : [807/885] 1069977=test_weakref I, [2024-05-22T03:00:58.665540 #1029097] INFO -- : [808/885] 1069977=test_rdoc_alias I, [2024-05-22T03:00:58.687525 #1029097] INFO -- : [809/885] 1069977=test_timeout I, [2024-05-22T03:00:58.884586 #1029097] INFO -- : [810/885] 1069978=test_rdoc_markup_raw I, [2024-05-22T03:00:58.900568 #1029097] INFO -- : [811/885] 1069978=test_key_name_check I, [2024-05-22T03:00:58.927748 #1029097] INFO -- : [812/885] 1069978=test_rdoc_markup_to_bs I, [2024-05-22T03:00:58.973377 #1029097] INFO -- : [813/885] 1069978=test_rdoc_require I, [2024-05-22T03:00:59.136733 #1029097] INFO -- : [814/885] 1069978=test_gem_ext_rake_builder I, [2024-05-22T03:00:59.699496 #1029097] INFO -- : [815/885] 1069978=test_word I, [2024-05-22T03:00:59.707607 #1029097] INFO -- : [816/885] 1069978=test_singleton I, [2024-05-22T03:00:59.708466 #1029097] INFO -- : [817/885] 1069977=test_numeric I, [2024-05-22T03:00:59.719526 #1029097] INFO -- : [818/885] 1069978=test_fstring I, [2024-05-22T03:00:59.722820 #1029097] INFO -- : [819/885] 1069977=test_div I, [2024-05-22T03:00:59.738096 #1029097] INFO -- : [820/885] 1069977=test_files_test_2 I, [2024-05-22T03:00:59.758870 #1029097] INFO -- : [821/885] 1069977=test_rdoc_markup_to_html_crossref I, [2024-05-22T03:00:59.835055 #1029097] INFO -- : [822/885] 1069978=test_exception I, [2024-05-22T03:01:00.055584 #1029097] INFO -- : [823/885] 1069977=test_bash_completion I, [2024-05-22T03:01:00.059291 #1029097] INFO -- : [824/885] 1069977=test_optparse I, [2024-05-22T03:01:00.071379 #1029097] INFO -- : [825/885] 1069977=test_io_buffer I, [2024-05-22T03:01:00.195601 #1029097] INFO -- : [826/885] 1069977=test_rdoc_context_section I, [2024-05-22T03:01:00.213012 #1029097] INFO -- : [827/885] 1069977=test_deprecated I, [2024-05-22T03:01:00.230074 #1029097] INFO -- : [828/885] 1069977=test_pack I, [2024-05-22T03:01:00.420240 #1029097] INFO -- : [829/885] 1069977=test_pkcs7 I, [2024-05-22T03:01:00.596061 #1029097] INFO -- : [830/885] 1069977=test_gem_commands_environment_command I, [2024-05-22T03:01:00.667678 #1029097] INFO -- : [831/885] 1069977=test_basicsocket I, [2024-05-22T03:01:00.685999 #1029097] INFO -- : [832/885] 1069977=test_zsh_completion I, [2024-05-22T03:01:00.717466 #1029097] INFO -- : [833/885] 1069977=test_syntax I, [2024-05-22T03:01:00.836196 #1029097] INFO -- : [834/885] 1069976=test_scalar I, [2024-05-22T03:01:00.869311 #1029097] INFO -- : [835/885] 1069976=test_class_name_check I, [2024-05-22T03:01:01.003942 #1029097] INFO -- : [836/885] 1069976=library_symbols_test I, [2024-05-22T03:01:01.014826 #1029097] INFO -- : [837/885] 1069976=test_rdoc_text I, [2024-05-22T03:01:01.060912 #1029097] INFO -- : [838/885] 1069976=test_objspace I, [2024-05-22T03:01:05.088018 #1029097] INFO -- : [839/885] 1069978=test_stringify_symbols I, [2024-05-22T03:01:05.092379 #1029097] INFO -- : [840/885] 1069978=test_require I, [2024-05-22T03:01:05.099482 #1029097] INFO -- : [841/885] 1069978=test_ns_spki I, [2024-05-22T03:01:05.110077 #1029097] INFO -- : [842/885] 1069978=test_stream I, [2024-05-22T03:01:05.269609 #1029097] INFO -- : [843/885] 1069978=test_have_library I, [2024-05-22T03:01:06.016568 #1029097] INFO -- : [844/885] 1069978=test_rdoc_markup_indented_paragraph I, [2024-05-22T03:01:06.040389 #1029097] INFO -- : [845/885] 1069978=test_iseq_load I, [2024-05-22T03:01:07.164533 #1029097] INFO -- : [846/885] 1069978=test_rdoc_markup_parser I, [2024-05-22T03:01:07.326122 #1029097] INFO -- : [847/885] 1069978=test_gem_request_set_lockfile I, [2024-05-22T03:01:07.866207 #1029097] INFO -- : [848/885] 1069978=test_rdoc_markdown I, [2024-05-22T03:01:08.158857 #1029097] INFO -- : [849/885] 1069978=test_key_actor_vi I, [2024-05-22T03:01:08.255680 #1029097] INFO -- : [850/885] 1069978=test_postponed_job I, [2024-05-22T03:01:08.591319 #1029097] INFO -- : [851/885] 1069978=test_win32ole_variant_outarg I, [2024-05-22T03:01:08.602420 #1029097] INFO -- : [852/885] 1069978=test_rdoc_encoding I, [2024-05-22T03:01:08.661790 #1029097] INFO -- : [853/885] 1069978=test_rdoc_markup_to_html_snippet I, [2024-05-22T03:01:08.751517 #1029097] INFO -- : [854/885] 1069978=test_common I, [2024-05-22T03:01:08.934400 #1029097] INFO -- : [855/885] 1069978=test_generic I, [2024-05-22T03:01:08.973431 #1029097] INFO -- : [856/885] 1069978=test_rdoc_constant I, [2024-05-22T03:01:09.073175 #1029097] INFO -- : [857/885] 1069978=test_deprecate I, [2024-05-22T03:01:09.122362 #1029097] INFO -- : [858/885] 1069978=test_httpresponses I, [2024-05-22T03:01:09.129903 #1029097] INFO -- : [859/885] 1069978=test_rdoc_markup_attributes I, [2024-05-22T03:01:09.141517 #1029097] INFO -- : [860/885] 1069978=test_rand I, [2024-05-22T03:01:09.660525 #1029097] INFO -- : [861/885] 1069978=test_string_processing I, [2024-05-22T03:01:09.671270 #1029097] INFO -- : [862/885] 1069978=test_random_formatter I, [2024-05-22T03:01:09.695169 #1029097] INFO -- : [863/885] 1069978=redundant_return_test I, [2024-05-22T03:01:09.701923 #1029097] INFO -- : [864/885] 1069978=test_euc_kr I, [2024-05-22T03:01:09.704145 #1029097] INFO -- : [865/885] 1069978=test_provider I, [2024-05-22T03:01:09.725077 #1029097] INFO -- : [866/885] 1069978=test_gem_source_specific_file I, [2024-05-22T03:01:09.828855 #1029097] INFO -- : [867/885] 1069978=test_bmethod I, [2024-05-22T03:01:09.856102 #1029097] INFO -- : [868/885] 1069978=test_process I, [2024-05-22T03:01:12.326308 #1029097] INFO -- : [869/885] 1069977=test_rdoc_code_object I, [2024-05-22T03:01:12.693879 #1029097] INFO -- : [870/885] 1069977=parse_test I, [2024-05-22T03:01:15.833142 #1029097] INFO -- : [871/885] 1069977=test_rdoc_parser_c I, [2024-05-22T03:01:16.575209 #1029097] INFO -- : [872/885] 1069977=test_kwargs I, [2024-05-22T03:01:16.586723 #1029097] INFO -- : [873/885] 1069977=test_io_wait I, [2024-05-22T03:01:16.928889 #1029097] INFO -- : [874/885] 1069977=test_pack I, [2024-05-22T03:01:17.143355 #1029097] INFO -- : [875/885] 1069977=test_len I, [2024-05-22T03:01:17.161404 #1029097] INFO -- : [876/885] 1069977=test_gem_doctor I, [2024-05-22T03:01:17.243573 #1029097] INFO -- : [877/885] 1069977=json_fixtures_test I, [2024-05-22T03:01:17.245925 #1029097] INFO -- : [878/885] 1069977=test_rdoc_parser_changelog I, [2024-05-22T03:01:17.412799 #1029097] INFO -- : [879/885] 1069977=parameters_signature_test I, [2024-05-22T03:01:17.460246 #1029097] INFO -- : [880/885] 1069977=test_gem_commands_outdated_command I, [2024-05-22T03:01:17.515140 #1029097] INFO -- : [881/885] 1069977=test_gem_dependency_list I, [2024-05-22T03:01:17.612000 #1029097] INFO -- : [882/885] 1069977=test_securerandom I, [2024-05-22T03:01:17.658378 #1029097] INFO -- : [883/885] 1069977=test_tsort I, [2024-05-22T03:01:17.668822 #1029097] INFO -- : [884/885] 1069977=test_typeddata I, [2024-05-22T03:01:17.972532 #1029097] INFO -- : [885/885] 1069977=test_gem_commands_fetch_command I, [2024-05-22T03:02:03.728823 #1029097] INFO -- : Finished tests in 251.311322s, 104.7307 tests/s, 37222.5927 assertions/s. I, [2024-05-22T03:02:03.733511 #1029097] INFO -- : 26320 tests, 9354459 assertions, 0 failures, 0 errors, 322 skips I, [2024-05-22T03:02:03.733544 #1029097] INFO -- : I, [2024-05-22T03:02:03.733555 #1029097] INFO -- : ruby -v: ruby 3.4.0dev (2024-05-22T01:45:02Z master f8e6752219) [aarch64-linux] I, [2024-05-22T03:02:03.734386 #1029097] INFO -- : $$$[end] "make yes-test-all TESTOPTS='--stderr-on-failure' TESTS='-j3'" exit with 0. I, [2024-05-22T03:02:03.734556 #1029097] INFO -- : $$$[beg] make yes-test-rubyspec MSPECOPT='--error-output stderr --debug -j' TESTS='-j3' I, [2024-05-22T03:02:03.863067 #1029097] INFO -- : BASERUBY = /usr/local/bin/ruby --disable=gems I, [2024-05-22T03:02:03.863141 #1029097] INFO -- : CC = gcc I, [2024-05-22T03:02:03.863152 #1029097] INFO -- : LD = ld I, [2024-05-22T03:02:03.863161 #1029097] INFO -- : LDSHARED = gcc -shared I, [2024-05-22T03:02:03.863173 #1029097] INFO -- : CFLAGS = -O3 -fno-fast-math -ggdb3 -Wall -Wextra -Wdeprecated-declarations -Wdiv-by-zero -Wduplicated-cond -Wimplicit-function-declaration -Wimplicit-int -Wpointer-arith -Wwrite-strings -Wold-style-definition -Wimplicit-fallthrough=0 -Wmissing-noreturn -Wno-cast-function-type -Wno-constant-logical-operand -Wno-long-long -Wno-missing-field-initializers -Wno-overlength-strings -Wno-packed-bitfield-compat -Wno-parentheses-equality -Wno-self-assign -Wno-tautological-compare -Wno-unused-parameter -Wno-unused-value -Wsuggest-attribute=format -Wsuggest-attribute=noreturn -Wunused-variable -Wmisleading-indentation -Wundef I, [2024-05-22T03:02:03.863183 #1029097] INFO -- : XCFLAGS = -U_FORTIFY_SOURCE -D_FORTIFY_SOURCE=2 -fstack-protector-strong -msign-return-address=all -fno-strict-overflow -fvisibility=hidden -fexcess-precision=standard -DRUBY_EXPORT -fPIE -I. -I.ext/include/aarch64-linux -I/home/opc/ruby/src/master/include -I/home/opc/ruby/src/master -I/home/opc/ruby/src/master/prism -I/home/opc/ruby/src/master/enc/unicode/15.0.0 I, [2024-05-22T03:02:03.863192 #1029097] INFO -- : CPPFLAGS = I, [2024-05-22T03:02:03.863201 #1029097] INFO -- : DLDFLAGS = -Wl,--compress-debug-sections=zlib -fstack-protector-strong -pie I, [2024-05-22T03:02:03.863209 #1029097] INFO -- : SOLIBS = -lz -lrt -lrt -ldl -lcrypt -lm -lpthread I, [2024-05-22T03:02:03.863218 #1029097] INFO -- : LANG = en_US.UTF-8 I, [2024-05-22T03:02:03.863226 #1029097] INFO -- : LC_ALL = I, [2024-05-22T03:02:03.863234 #1029097] INFO -- : LC_CTYPE = I, [2024-05-22T03:02:03.863242 #1029097] INFO -- : MFLAGS = I, [2024-05-22T03:02:03.863250 #1029097] INFO -- : RUSTC = rustc I, [2024-05-22T03:02:03.863258 #1029097] INFO -- : YJIT_RUSTC_ARGS = --crate-name=yjit --crate-type=staticlib --edition=2021 -g -C lto=thin -C opt-level=3 -C overflow-checks=on '--out-dir=/home/opc/ruby/build/master/yjit/target/release/' /home/opc/ruby/src/master/yjit/src/lib.rs I, [2024-05-22T03:02:03.863880 #1029097] INFO -- : gcc (GCC) 8.5.0 20210514 (Red Hat 8.5.0-10.1.0.1) I, [2024-05-22T03:02:03.863897 #1029097] INFO -- : Copyright (C) 2018 Free Software Foundation, Inc. I, [2024-05-22T03:02:03.863907 #1029097] INFO -- : This is free software; see the source for copying conditions. There is NO I, [2024-05-22T03:02:03.863915 #1029097] INFO -- : warranty; not even for MERCHANTABILITY or FITNESS FOR A PARTICULAR PURPOSE. I, [2024-05-22T03:02:03.863924 #1029097] INFO -- : I, [2024-05-22T03:02:03.865979 #1029097] INFO -- : generating enc.mk I, [2024-05-22T03:02:04.097208 #1029097] INFO -- : generating encdb.h I, [2024-05-22T03:02:04.134877 #1029097] INFO -- : encdb.h unchanged I, [2024-05-22T03:02:04.136073 #1029097] INFO -- : making enc I, [2024-05-22T03:02:04.163571 #1029097] INFO -- : make[1]: Entering directory '/home/opc/ruby/build/master' I, [2024-05-22T03:02:04.163635 #1029097] INFO -- : make[1]: Nothing to be done for 'enc'. I, [2024-05-22T03:02:04.163646 #1029097] INFO -- : make[1]: Leaving directory '/home/opc/ruby/build/master' I, [2024-05-22T03:02:04.164236 #1029097] INFO -- : making srcs under enc I, [2024-05-22T03:02:04.206805 #1029097] INFO -- : make[1]: Entering directory '/home/opc/ruby/build/master' I, [2024-05-22T03:02:04.206870 #1029097] INFO -- : make[1]: Nothing to be done for 'srcs'. I, [2024-05-22T03:02:04.206880 #1029097] INFO -- : make[1]: Leaving directory '/home/opc/ruby/build/master' I, [2024-05-22T03:02:04.207874 #1029097] INFO -- : generating transdb.h I, [2024-05-22T03:02:04.356651 #1029097] INFO -- : transdb.h unchanged I, [2024-05-22T03:02:04.358039 #1029097] INFO -- : making trans I, [2024-05-22T03:02:04.407067 #1029097] INFO -- : make[1]: Entering directory '/home/opc/ruby/build/master' I, [2024-05-22T03:02:04.407130 #1029097] INFO -- : make[1]: Nothing to be done for 'trans'. I, [2024-05-22T03:02:04.407151 #1029097] INFO -- : make[1]: Leaving directory '/home/opc/ruby/build/master' I, [2024-05-22T03:02:04.407817 #1029097] INFO -- : making encs I, [2024-05-22T03:02:04.462128 #1029097] INFO -- : make[1]: Entering directory '/home/opc/ruby/build/master' I, [2024-05-22T03:02:04.462187 #1029097] INFO -- : make[1]: Nothing to be done for 'encs'. I, [2024-05-22T03:02:04.462198 #1029097] INFO -- : make[1]: Leaving directory '/home/opc/ruby/build/master' I, [2024-05-22T03:02:04.464207 #1029097] INFO -- : generating makefiles ext/configure-ext.mk I, [2024-05-22T03:02:04.504750 #1029097] INFO -- : ext/configure-ext.mk updated I, [2024-05-22T03:02:04.507859 #1029097] INFO -- : make[1]: Entering directory '/home/opc/ruby/build/master' I, [2024-05-22T03:02:06.627901 #1029097] INFO -- : make[1]: Leaving directory '/home/opc/ruby/build/master' I, [2024-05-22T03:02:06.628593 #1029097] INFO -- : generating makefile exts.mk I, [2024-05-22T03:02:06.688070 #1029097] INFO -- : exts.mk unchanged I, [2024-05-22T03:02:06.692893 #1029097] INFO -- : make[1]: Entering directory '/home/opc/ruby/build/master' I, [2024-05-22T03:02:06.989644 #1029097] INFO -- : make[2]: Entering directory '/home/opc/ruby/build/master/ext/coverage' I, [2024-05-22T03:02:06.994309 #1029097] INFO -- : make[2]: Leaving directory '/home/opc/ruby/build/master/ext/coverage' I, [2024-05-22T03:02:06.999974 #1029097] INFO -- : make[2]: Entering directory '/home/opc/ruby/build/master/ext/date' I, [2024-05-22T03:02:07.005199 #1029097] INFO -- : make[2]: Leaving directory '/home/opc/ruby/build/master/ext/date' I, [2024-05-22T03:02:07.008661 #1029097] INFO -- : make[2]: Entering directory '/home/opc/ruby/build/master/ext/digest' I, [2024-05-22T03:02:07.017427 #1029097] INFO -- : make[2]: Leaving directory '/home/opc/ruby/build/master/ext/digest' I, [2024-05-22T03:02:07.039674 #1029097] INFO -- : make[2]: Entering directory '/home/opc/ruby/build/master/ext/digest/sha2' I, [2024-05-22T03:02:07.044561 #1029097] INFO -- : make[2]: Leaving directory '/home/opc/ruby/build/master/ext/digest/sha2' I, [2024-05-22T03:02:07.062778 #1029097] INFO -- : make[2]: Entering directory '/home/opc/ruby/build/master/ext/fiddle' I, [2024-05-22T03:02:07.072792 #1029097] INFO -- : make[2]: Leaving directory '/home/opc/ruby/build/master/ext/fiddle' I, [2024-05-22T03:02:07.077039 #1029097] INFO -- : make[2]: Entering directory '/home/opc/ruby/build/master/ext/io/console' I, [2024-05-22T03:02:07.081162 #1029097] INFO -- : make[2]: Leaving directory '/home/opc/ruby/build/master/ext/io/console' I, [2024-05-22T03:02:07.091839 #1029097] INFO -- : make[2]: Entering directory '/home/opc/ruby/build/master/ext/json' I, [2024-05-22T03:02:07.101181 #1029097] INFO -- : make[2]: Leaving directory '/home/opc/ruby/build/master/ext/json' I, [2024-05-22T03:02:07.114480 #1029097] INFO -- : make[2]: Entering directory '/home/opc/ruby/build/master/ext/monitor' I, [2024-05-22T03:02:07.118571 #1029097] INFO -- : make[2]: Leaving directory '/home/opc/ruby/build/master/ext/monitor' I, [2024-05-22T03:02:07.124586 #1029097] INFO -- : make[2]: Entering directory '/home/opc/ruby/build/master/ext/objspace' I, [2024-05-22T03:02:07.130443 #1029097] INFO -- : make[2]: Leaving directory '/home/opc/ruby/build/master/ext/objspace' I, [2024-05-22T03:02:07.149456 #1029097] INFO -- : make[2]: Entering directory '/home/opc/ruby/build/master/ext/openssl' I, [2024-05-22T03:02:07.171113 #1029097] INFO -- : make[2]: Leaving directory '/home/opc/ruby/build/master/ext/openssl' I, [2024-05-22T03:02:07.175246 #1029097] INFO -- : make[2]: Entering directory '/home/opc/ruby/build/master/ext/pathname' I, [2024-05-22T03:02:07.179322 #1029097] INFO -- : make[2]: Leaving directory '/home/opc/ruby/build/master/ext/pathname' I, [2024-05-22T03:02:07.185697 #1029097] INFO -- : make[2]: Entering directory '/home/opc/ruby/build/master/ext/psych' I, [2024-05-22T03:02:07.207108 #1029097] INFO -- : make[2]: Leaving directory '/home/opc/ruby/build/master/ext/psych' I, [2024-05-22T03:02:07.211523 #1029097] INFO -- : make[2]: Entering directory '/home/opc/ruby/build/master/ext/pty' I, [2024-05-22T03:02:07.215637 #1029097] INFO -- : make[2]: Leaving directory '/home/opc/ruby/build/master/ext/pty' I, [2024-05-22T03:02:07.228964 #1029097] INFO -- : make[2]: Entering directory '/home/opc/ruby/build/master/ext/ripper' I, [2024-05-22T03:02:07.236646 #1029097] INFO -- : make[2]: Leaving directory '/home/opc/ruby/build/master/ext/ripper' I, [2024-05-22T03:02:07.238605 #1029097] INFO -- : make[2]: Entering directory '/home/opc/ruby/build/master/ext/rubyvm' I, [2024-05-22T03:02:07.241930 #1029097] INFO -- : make[2]: Leaving directory '/home/opc/ruby/build/master/ext/rubyvm' I, [2024-05-22T03:02:07.253894 #1029097] INFO -- : make[2]: Entering directory '/home/opc/ruby/build/master/ext/socket' I, [2024-05-22T03:02:07.264571 #1029097] INFO -- : make[2]: Leaving directory '/home/opc/ruby/build/master/ext/socket' I, [2024-05-22T03:02:07.279760 #1029097] INFO -- : make[2]: Entering directory '/home/opc/ruby/build/master/.bundle/gems/bigdecimal-3.1.7/ext/bigdecimal' I, [2024-05-22T03:02:07.310944 #1029097] INFO -- : make[2]: Leaving directory '/home/opc/ruby/build/master/.bundle/gems/bigdecimal-3.1.7/ext/bigdecimal' I, [2024-05-22T03:02:07.313521 #1029097] INFO -- : make[2]: Entering directory '/home/opc/ruby/build/master/.bundle/gems/bigdecimal-3.1.8/ext/bigdecimal' I, [2024-05-22T03:02:07.343413 #1029097] INFO -- : make[2]: Leaving directory '/home/opc/ruby/build/master/.bundle/gems/bigdecimal-3.1.8/ext/bigdecimal' I, [2024-05-22T03:02:07.345943 #1029097] INFO -- : make[2]: Entering directory '/home/opc/ruby/build/master/.bundle/gems/debug-1.9.2/ext/debug' I, [2024-05-22T03:02:07.376295 #1029097] INFO -- : make[2]: Leaving directory '/home/opc/ruby/build/master/.bundle/gems/debug-1.9.2/ext/debug' I, [2024-05-22T03:02:07.378669 #1029097] INFO -- : make[2]: Entering directory '/home/opc/ruby/build/master/.bundle/gems/nkf-0.2.0/ext/nkf' I, [2024-05-22T03:02:07.408988 #1029097] INFO -- : make[2]: Leaving directory '/home/opc/ruby/build/master/.bundle/gems/nkf-0.2.0/ext/nkf' I, [2024-05-22T03:02:07.411368 #1029097] INFO -- : make[2]: Entering directory '/home/opc/ruby/build/master/.bundle/gems/racc-1.7.3/ext/racc/cparse' I, [2024-05-22T03:02:07.441470 #1029097] INFO -- : make[2]: Leaving directory '/home/opc/ruby/build/master/.bundle/gems/racc-1.7.3/ext/racc/cparse' I, [2024-05-22T03:02:07.443837 #1029097] INFO -- : make[2]: Entering directory '/home/opc/ruby/build/master/.bundle/gems/racc-1.8.0/ext/racc/cparse' I, [2024-05-22T03:02:07.474054 #1029097] INFO -- : make[2]: Leaving directory '/home/opc/ruby/build/master/.bundle/gems/racc-1.8.0/ext/racc/cparse' I, [2024-05-22T03:02:07.476988 #1029097] INFO -- : make[2]: Entering directory '/home/opc/ruby/build/master/.bundle/gems/rbs-3.4.4/ext/rbs_extension' I, [2024-05-22T03:02:07.507112 #1029097] INFO -- : make[2]: Leaving directory '/home/opc/ruby/build/master/.bundle/gems/rbs-3.4.4/ext/rbs_extension' I, [2024-05-22T03:02:07.509680 #1029097] INFO -- : make[2]: Entering directory '/home/opc/ruby/build/master/.bundle/gems/syslog-0.1.2/ext/syslog' I, [2024-05-22T03:02:07.539884 #1029097] INFO -- : make[2]: Leaving directory '/home/opc/ruby/build/master/.bundle/gems/syslog-0.1.2/ext/syslog' I, [2024-05-22T03:02:07.578440 #1029097] INFO -- : make[2]: Entering directory '/home/opc/ruby/build/master' I, [2024-05-22T03:02:07.662004 #1029097] INFO -- : make[2]: 'ruby' is up to date. I, [2024-05-22T03:02:07.662078 #1029097] INFO -- : make[2]: Leaving directory '/home/opc/ruby/build/master' I, [2024-05-22T03:02:07.662210 #1029097] INFO -- : make[1]: Leaving directory '/home/opc/ruby/build/master' I, [2024-05-22T03:02:07.666679 #1029097] INFO -- : make[1]: Entering directory '/home/opc/ruby/build/master' I, [2024-05-22T03:02:07.666710 #1029097] INFO -- : make[1]: Nothing to be done for 'note'. I, [2024-05-22T03:02:07.666722 #1029097] INFO -- : make[1]: Leaving directory '/home/opc/ruby/build/master' E, [2024-05-22T03:02:07.743903 #1029097] ERROR -- : $ /home/opc/ruby/build/master/miniruby -I/home/opc/ruby/src/master/lib /home/opc/ruby/src/master/tool/runruby.rb --archdir=/home/opc/ruby/build/master --extout=.ext -- /home/opc/ruby/src/master/spec/mspec/bin/mspec-run -B /home/opc/ruby/src/master/spec/default.mspec --error-output stderr --debug -fy -o /tmp/rubytest.nk7niz/1-mspec-multi-0 E, [2024-05-22T03:02:07.744283 #1029097] ERROR -- : $ /home/opc/ruby/build/master/miniruby -I/home/opc/ruby/src/master/lib /home/opc/ruby/src/master/tool/runruby.rb --archdir=/home/opc/ruby/build/master --extout=.ext -- /home/opc/ruby/src/master/spec/mspec/bin/mspec-run -B /home/opc/ruby/src/master/spec/default.mspec --error-output stderr --debug -fy -o /tmp/rubytest.nk7niz/2-mspec-multi-1 E, [2024-05-22T03:02:07.744597 #1029097] ERROR -- : $ /home/opc/ruby/build/master/miniruby -I/home/opc/ruby/src/master/lib /home/opc/ruby/src/master/tool/runruby.rb --archdir=/home/opc/ruby/build/master --extout=.ext -- /home/opc/ruby/src/master/spec/mspec/bin/mspec-run -B /home/opc/ruby/src/master/spec/default.mspec --error-output stderr --debug -fy -o /tmp/rubytest.nk7niz/3-mspec-multi-2 I, [2024-05-22T03:02:07.881706 #1029097] INFO -- : ruby 3.4.0dev (2024-05-22T01:45:02Z master f8e6752219) [aarch64-linux] I, [2024-05-22T03:02:13.354242 #1029097] INFO -- : 0 ......................................................................... I, [2024-05-22T03:02:15.676527 #1029097] INFO -- : 73 ......................................................................... I, [2024-05-22T03:02:15.834702 #1029097] INFO -- : 146 ......................................................................... I, [2024-05-22T03:02:16.126135 #1029097] INFO -- : 219 ......................................................................... I, [2024-05-22T03:02:16.277553 #1029097] INFO -- : 292 ......................................................................... I, [2024-05-22T03:02:16.523088 #1029097] INFO -- : 365 ......................................................................... I, [2024-05-22T03:02:16.645986 #1029097] INFO -- : 438 ......................................................................... I, [2024-05-22T03:02:16.707234 #1029097] INFO -- : 511 ......................................................................... I, [2024-05-22T03:02:16.768717 #1029097] INFO -- : 584 ......................................................................... I, [2024-05-22T03:02:17.378817 #1029097] INFO -- : 657 ......................................................................... I, [2024-05-22T03:02:17.484828 #1029097] INFO -- : 730 ......................................................................... I, [2024-05-22T03:02:17.540343 #1029097] INFO -- : 803 ......................................................................... I, [2024-05-22T03:02:17.741376 #1029097] INFO -- : 876 ......................................................................... I, [2024-05-22T03:02:17.841268 #1029097] INFO -- : 949 ......................................................................... I, [2024-05-22T03:02:18.428570 #1029097] INFO -- : 1022 ......................................................................... I, [2024-05-22T03:02:20.725727 #1029097] INFO -- : 1095 ......................................................................... I, [2024-05-22T03:02:21.583509 #1029097] INFO -- : 1168 ......................................................................... I, [2024-05-22T03:02:21.732043 #1029097] INFO -- : 1241 ......................................................................... I, [2024-05-22T03:02:21.962339 #1029097] INFO -- : 1314 ......................................................................... I, [2024-05-22T03:02:22.060421 #1029097] INFO -- : 1387 ......................................................................... I, [2024-05-22T03:02:24.047328 #1029097] INFO -- : 1460 ......................................................................... I, [2024-05-22T03:02:27.649594 #1029097] INFO -- : 1533 ......................................................................... I, [2024-05-22T03:02:27.803062 #1029097] INFO -- : 1606 ......................................................................... I, [2024-05-22T03:02:28.626586 #1029097] INFO -- : 1679 ......................................................................... I, [2024-05-22T03:02:28.851807 #1029097] INFO -- : 1752 ......................................................................... I, [2024-05-22T03:02:29.112203 #1029097] INFO -- : 1825 ......................................................................... I, [2024-05-22T03:02:29.439798 #1029097] INFO -- : 1898 ......................................................................... I, [2024-05-22T03:02:29.829405 #1029097] INFO -- : 1971 ......................................................................... I, [2024-05-22T03:02:30.340724 #1029097] INFO -- : 2044 ......................................................................... I, [2024-05-22T03:02:30.452136 #1029097] INFO -- : 2117 ......................................................................... I, [2024-05-22T03:02:30.522417 #1029097] INFO -- : 2190 ......................................................................... I, [2024-05-22T03:02:30.574278 #1029097] INFO -- : 2263 ......................................................................... I, [2024-05-22T03:02:30.629830 #1029097] INFO -- : 2336 ......................................................................... I, [2024-05-22T03:02:30.719499 #1029097] INFO -- : 2409 ......................................................................... I, [2024-05-22T03:02:31.005182 #1029097] INFO -- : 2482 ......................................................................... I, [2024-05-22T03:02:31.150697 #1029097] INFO -- : 2555 ......................................................................... I, [2024-05-22T03:02:32.435717 #1029097] INFO -- : 2628 ......................................................................... I, [2024-05-22T03:02:32.758182 #1029097] INFO -- : 2701 ......................................................................... I, [2024-05-22T03:02:32.922988 #1029097] INFO -- : 2774 ......................................................................... I, [2024-05-22T03:02:33.268347 #1029097] INFO -- : 2847 ......................................................................... I, [2024-05-22T03:02:33.545581 #1029097] INFO -- : 2920 ......................................................................... I, [2024-05-22T03:02:33.672397 #1029097] INFO -- : 2993 ......................................................................... I, [2024-05-22T03:02:33.735267 #1029097] INFO -- : 3066 ......................................................................... I, [2024-05-22T03:02:33.781903 #1029097] INFO -- : 3139 ......................................................................... I, [2024-05-22T03:02:33.839667 #1029097] INFO -- : 3212 ......................................................................... I, [2024-05-22T03:02:33.905889 #1029097] INFO -- : 3285 ......................................................................... I, [2024-05-22T03:02:37.736815 #1029097] INFO -- : 3358 ......................................................................... I, [2024-05-22T03:02:37.759676 #1029097] INFO -- : I, [2024-05-22T03:02:37.759750 #1029097] INFO -- : I, [2024-05-22T03:02:37.759761 #1029097] INFO -- : Finished in 30.015738 seconds I, [2024-05-22T03:02:37.759771 #1029097] INFO -- : I, [2024-05-22T03:02:37.759779 #1029097] INFO -- : 3430 files, 32648 examples, 183520 expectations, 0 failures, 0 errors, 0 tagged I, [2024-05-22T03:02:37.760958 #1029097] INFO -- : $$$[end] "make yes-test-rubyspec MSPECOPT='--error-output stderr --debug -j' TESTS='-j3'" exit with 0.