# Logfile created on 2024-05-21 19:45:05 +0000 by logger.rb/v1.5.3 I, [2024-05-21T19:45:05.815230 #3381936] INFO -- : #, @formatter=nil, @logdev=#, @binmode=false, @mon_data=#, @mon_data_owner_object_id=860>>> I, [2024-05-21T19:45:05.816479 #3381936] INFO -- : $$$[beg] make update-unicode -j3 I, [2024-05-21T19:45:05.907064 #3381936] INFO -- : Downloading Unicode emoji 15.0 files... I, [2024-05-21T19:45:05.907219 #3381936] INFO -- : Downloading Unicode emoji 15.0 files... I, [2024-05-21T19:45:05.907448 #3381936] INFO -- : Downloading Unicode emoji 15.0 files... I, [2024-05-21T19:45:05.983502 #3381936] INFO -- : made symlink emoji/15.0/emoji-sequences.txt to /home/opc/ruby/src/master/.downloaded-cache/emoji/15.0/emoji-sequences.txt I, [2024-05-21T19:45:05.984356 #3381936] INFO -- : downloading emoji/15.0/emoji-test.txt ... /home/opc/ruby/src/master/enc/unicode/data/emoji/15.0/emoji-sequences.txt already exists I, [2024-05-21T19:45:05.988454 #3381936] INFO -- : downloading emoji/15.0/emoji-test.txt ... /home/opc/ruby/src/master/enc/unicode/data/emoji/15.0/emoji-sequences.txt already exists E, [2024-05-21T19:45:06.427417 #3381936] ERROR -- : /home/opc/ruby/src/master/tool/downloader.rb:302:in `rescue in download': failed to download emoji/15.0/emoji-test.txt (RuntimeError) E, [2024-05-21T19:45:06.427483 #3381936] ERROR -- : OpenURI::HTTPError: 403 Forbidden: https://www.unicode.org/Public/emoji/15.0/emoji-test.txt E, [2024-05-21T19:45:06.427494 #3381936] ERROR -- : from /home/opc/ruby/src/master/tool/downloader.rb:201:in `download' E, [2024-05-21T19:45:06.427504 #3381936] ERROR -- : from /home/opc/ruby/src/master/tool/downloader.rb:136:in `download' E, [2024-05-21T19:45:06.427512 #3381936] ERROR -- : from /home/opc/ruby/src/master/tool/downloader.rb:482:in `block in
' E, [2024-05-21T19:45:06.427520 #3381936] ERROR -- : from /home/opc/ruby/src/master/tool/downloader.rb:465:in `each' E, [2024-05-21T19:45:06.427528 #3381936] ERROR -- : from /home/opc/ruby/src/master/tool/downloader.rb:465:in `
' E, [2024-05-21T19:45:06.427537 #3381936] ERROR -- : /usr/local/lib/ruby/3.2.0/open-uri.rb:369:in `open_http': 403 Forbidden (OpenURI::HTTPError) E, [2024-05-21T19:45:06.427545 #3381936] ERROR -- : from /usr/local/lib/ruby/3.2.0/open-uri.rb:760:in `buffer_open' E, [2024-05-21T19:45:06.427553 #3381936] ERROR -- : from /usr/local/lib/ruby/3.2.0/open-uri.rb:214:in `block in open_loop' E, [2024-05-21T19:45:06.427561 #3381936] ERROR -- : from /usr/local/lib/ruby/3.2.0/open-uri.rb:212:in `catch' E, [2024-05-21T19:45:06.427569 #3381936] ERROR -- : from /usr/local/lib/ruby/3.2.0/open-uri.rb:212:in `open_loop' E, [2024-05-21T19:45:06.427577 #3381936] ERROR -- : from /usr/local/lib/ruby/3.2.0/open-uri.rb:153:in `open_uri' E, [2024-05-21T19:45:06.427585 #3381936] ERROR -- : from /usr/local/lib/ruby/3.2.0/open-uri.rb:740:in `open' E, [2024-05-21T19:45:06.427597 #3381936] ERROR -- : from /usr/local/lib/ruby/3.2.0/open-uri.rb:748:in `read' E, [2024-05-21T19:45:06.427605 #3381936] ERROR -- : from /home/opc/ruby/src/master/tool/downloader.rb:247:in `block in download' E, [2024-05-21T19:45:06.427613 #3381936] ERROR -- : from /home/opc/ruby/src/master/tool/downloader.rb:378:in `with_retry' E, [2024-05-21T19:45:06.427621 #3381936] ERROR -- : from /home/opc/ruby/src/master/tool/downloader.rb:246:in `download' E, [2024-05-21T19:45:06.427629 #3381936] ERROR -- : from /home/opc/ruby/src/master/tool/downloader.rb:136:in `download' E, [2024-05-21T19:45:06.427637 #3381936] ERROR -- : from /home/opc/ruby/src/master/tool/downloader.rb:482:in `block in
' E, [2024-05-21T19:45:06.427645 #3381936] ERROR -- : from /home/opc/ruby/src/master/tool/downloader.rb:465:in `each' E, [2024-05-21T19:45:06.427652 #3381936] ERROR -- : from /home/opc/ruby/src/master/tool/downloader.rb:465:in `
' E, [2024-05-21T19:45:06.428265 #3381936] ERROR -- : /home/opc/ruby/src/master/tool/downloader.rb:302:in `rescue in download': failed to download emoji/15.0/emoji-test.txt (RuntimeError) E, [2024-05-21T19:45:06.428288 #3381936] ERROR -- : OpenURI::HTTPError: 403 Forbidden: https://www.unicode.org/Public/emoji/15.0/emoji-test.txt E, [2024-05-21T19:45:06.428297 #3381936] ERROR -- : from /home/opc/ruby/src/master/tool/downloader.rb:201:in `download' E, [2024-05-21T19:45:06.428306 #3381936] ERROR -- : from /home/opc/ruby/src/master/tool/downloader.rb:136:in `download' E, [2024-05-21T19:45:06.428314 #3381936] ERROR -- : from /home/opc/ruby/src/master/tool/downloader.rb:482:in `block in
' E, [2024-05-21T19:45:06.428322 #3381936] ERROR -- : from /home/opc/ruby/src/master/tool/downloader.rb:465:in `each' E, [2024-05-21T19:45:06.428331 #3381936] ERROR -- : from /home/opc/ruby/src/master/tool/downloader.rb:465:in `
' E, [2024-05-21T19:45:06.428339 #3381936] ERROR -- : /usr/local/lib/ruby/3.2.0/open-uri.rb:369:in `open_http': 403 Forbidden (OpenURI::HTTPError) E, [2024-05-21T19:45:06.428347 #3381936] ERROR -- : from /usr/local/lib/ruby/3.2.0/open-uri.rb:760:in `buffer_open' E, [2024-05-21T19:45:06.428355 #3381936] ERROR -- : from /usr/local/lib/ruby/3.2.0/open-uri.rb:214:in `block in open_loop' E, [2024-05-21T19:45:06.428363 #3381936] ERROR -- : from /usr/local/lib/ruby/3.2.0/open-uri.rb:212:in `catch' E, [2024-05-21T19:45:06.428371 #3381936] ERROR -- : from /usr/local/lib/ruby/3.2.0/open-uri.rb:212:in `open_loop' E, [2024-05-21T19:45:06.428379 #3381936] ERROR -- : from /usr/local/lib/ruby/3.2.0/open-uri.rb:153:in `open_uri' E, [2024-05-21T19:45:06.428388 #3381936] ERROR -- : from /usr/local/lib/ruby/3.2.0/open-uri.rb:740:in `open' E, [2024-05-21T19:45:06.428396 #3381936] ERROR -- : from /usr/local/lib/ruby/3.2.0/open-uri.rb:748:in `read' E, [2024-05-21T19:45:06.428404 #3381936] ERROR -- : from /home/opc/ruby/src/master/tool/downloader.rb:247:in `block in download' E, [2024-05-21T19:45:06.428412 #3381936] ERROR -- : from /home/opc/ruby/src/master/tool/downloader.rb:378:in `with_retry' E, [2024-05-21T19:45:06.428421 #3381936] ERROR -- : from /home/opc/ruby/src/master/tool/downloader.rb:246:in `download' E, [2024-05-21T19:45:06.428429 #3381936] ERROR -- : from /home/opc/ruby/src/master/tool/downloader.rb:136:in `download' E, [2024-05-21T19:45:06.428437 #3381936] ERROR -- : from /home/opc/ruby/src/master/tool/downloader.rb:482:in `block in
' E, [2024-05-21T19:45:06.428445 #3381936] ERROR -- : from /home/opc/ruby/src/master/tool/downloader.rb:465:in `each' E, [2024-05-21T19:45:06.428454 #3381936] ERROR -- : from /home/opc/ruby/src/master/tool/downloader.rb:465:in `
' E, [2024-05-21T19:45:06.430661 #3381936] ERROR -- : make: *** [uncommon.mk:1756: /home/opc/ruby/src/master/enc/unicode/data/emoji/15.0/emoji-zwj-sequences.txt] Error 1 E, [2024-05-21T19:45:06.430706 #3381936] ERROR -- : make: *** Waiting for unfinished jobs.... E, [2024-05-21T19:45:06.431357 #3381936] ERROR -- : make: *** [uncommon.mk:1756: /home/opc/ruby/src/master/enc/unicode/data/emoji/15.0/emoji-test.txt] Error 1 E, [2024-05-21T19:45:06.446231 #3381936] ERROR -- : /home/opc/ruby/src/master/tool/downloader.rb:302:in `rescue in download': failed to download emoji/15.0/emoji-test.txt (RuntimeError) E, [2024-05-21T19:45:06.446270 #3381936] ERROR -- : OpenURI::HTTPError: 403 Forbidden: https://www.unicode.org/Public/emoji/15.0/emoji-test.txt E, [2024-05-21T19:45:06.446281 #3381936] ERROR -- : from /home/opc/ruby/src/master/tool/downloader.rb:201:in `download' E, [2024-05-21T19:45:06.446290 #3381936] ERROR -- : from /home/opc/ruby/src/master/tool/downloader.rb:136:in `download' E, [2024-05-21T19:45:06.446298 #3381936] ERROR -- : from /home/opc/ruby/src/master/tool/downloader.rb:482:in `block in
' E, [2024-05-21T19:45:06.446307 #3381936] ERROR -- : from /home/opc/ruby/src/master/tool/downloader.rb:465:in `each' E, [2024-05-21T19:45:06.446315 #3381936] ERROR -- : from /home/opc/ruby/src/master/tool/downloader.rb:465:in `
' E, [2024-05-21T19:45:06.446323 #3381936] ERROR -- : /usr/local/lib/ruby/3.2.0/open-uri.rb:369:in `open_http': 403 Forbidden (OpenURI::HTTPError) E, [2024-05-21T19:45:06.446332 #3381936] ERROR -- : from /usr/local/lib/ruby/3.2.0/open-uri.rb:760:in `buffer_open' E, [2024-05-21T19:45:06.446340 #3381936] ERROR -- : from /usr/local/lib/ruby/3.2.0/open-uri.rb:214:in `block in open_loop' E, [2024-05-21T19:45:06.446348 #3381936] ERROR -- : from /usr/local/lib/ruby/3.2.0/open-uri.rb:212:in `catch' E, [2024-05-21T19:45:06.446356 #3381936] ERROR -- : from /usr/local/lib/ruby/3.2.0/open-uri.rb:212:in `open_loop' E, [2024-05-21T19:45:06.446364 #3381936] ERROR -- : from /usr/local/lib/ruby/3.2.0/open-uri.rb:153:in `open_uri' E, [2024-05-21T19:45:06.446372 #3381936] ERROR -- : from /usr/local/lib/ruby/3.2.0/open-uri.rb:740:in `open' E, [2024-05-21T19:45:06.446380 #3381936] ERROR -- : from /usr/local/lib/ruby/3.2.0/open-uri.rb:748:in `read' E, [2024-05-21T19:45:06.446388 #3381936] ERROR -- : from /home/opc/ruby/src/master/tool/downloader.rb:247:in `block in download' E, [2024-05-21T19:45:06.446397 #3381936] ERROR -- : from /home/opc/ruby/src/master/tool/downloader.rb:378:in `with_retry' E, [2024-05-21T19:45:06.446405 #3381936] ERROR -- : from /home/opc/ruby/src/master/tool/downloader.rb:246:in `download' E, [2024-05-21T19:45:06.446413 #3381936] ERROR -- : from /home/opc/ruby/src/master/tool/downloader.rb:136:in `download' E, [2024-05-21T19:45:06.446422 #3381936] ERROR -- : from /home/opc/ruby/src/master/tool/downloader.rb:482:in `block in
' E, [2024-05-21T19:45:06.446430 #3381936] ERROR -- : from /home/opc/ruby/src/master/tool/downloader.rb:465:in `each' E, [2024-05-21T19:45:06.446438 #3381936] ERROR -- : from /home/opc/ruby/src/master/tool/downloader.rb:465:in `
' E, [2024-05-21T19:45:06.449118 #3381936] ERROR -- : make: *** [uncommon.mk:1756: /home/opc/ruby/src/master/enc/unicode/data/emoji/15.0/emoji-sequences.txt] Error 1 E, [2024-05-21T19:45:06.449150 #3381936] ERROR -- : make: *** Deleting file '/home/opc/ruby/src/master/enc/unicode/data/emoji/15.0/emoji-sequences.txt' I, [2024-05-21T19:45:06.449278 #3381936] INFO -- : downloading emoji/15.0/emoji-test.txt ... I, [2024-05-21T19:45:06.449448 #3381936] INFO -- : $$$[end] "make update-unicode -j3" exit with 512. I, [2024-05-21T19:45:06.449495 #3381936] INFO -- : $$$[beg] make update-download -j3 I, [2024-05-21T19:45:06.613445 #3381936] INFO -- : tool/config.guess already exists I, [2024-05-21T19:45:06.613516 #3381936] INFO -- : tool/config.sub already exists I, [2024-05-21T19:45:06.616547 #3381936] INFO -- : Update power_assert to 84e85124c5014a139af39161d484156cfe87a9ed I, [2024-05-21T19:45:06.616815 #3381936] INFO -- : Update rbs to ba7872795d5de04adb8ff500c0e6afdc81a041dd I, [2024-05-21T19:45:06.616923 #3381936] INFO -- : Update typeprof to b19a6416da3a05d57fadd6ffdadb382b6d236ca5 I, [2024-05-21T19:45:06.620291 #3381936] INFO -- : echo ba7872795d5de04adb8ff500c0e6afdc81a041dd | /bin/sh /home/opc/ruby/src/master/tool/ifchange /home/opc/ruby/src/master/.bundle/.timestamp/rbs.revision - I, [2024-05-21T19:45:06.621277 #3381936] INFO -- : echo 84e85124c5014a139af39161d484156cfe87a9ed | /bin/sh /home/opc/ruby/src/master/tool/ifchange /home/opc/ruby/src/master/.bundle/.timestamp/power_assert.revision - I, [2024-05-21T19:45:06.621503 #3381936] INFO -- : echo b19a6416da3a05d57fadd6ffdadb382b6d236ca5 | /bin/sh /home/opc/ruby/src/master/tool/ifchange /home/opc/ruby/src/master/.bundle/.timestamp/typeprof.revision - I, [2024-05-21T19:45:06.627842 #3381936] INFO -- : /home/opc/ruby/src/master/.bundle/.timestamp/typeprof.revision unchanged I, [2024-05-21T19:45:06.628348 #3381936] INFO -- : /home/opc/ruby/src/master/.bundle/.timestamp/rbs.revision unchanged I, [2024-05-21T19:45:06.628380 #3381936] INFO -- : /home/opc/ruby/src/master/.bundle/.timestamp/power_assert.revision unchanged I, [2024-05-21T19:45:06.721503 #3381936] INFO -- : Building power_assert@84e85124c5014a139af39161d484156cfe87a9ed to /home/opc/ruby/src/master/gems/power_assert-2.0.3.gem I, [2024-05-21T19:45:06.832318 #3381936] INFO -- : Successfully built RubyGem I, [2024-05-21T19:45:06.832400 #3381936] INFO -- : Name: power_assert I, [2024-05-21T19:45:06.832419 #3381936] INFO -- : Version: 2.0.4dev I, [2024-05-21T19:45:06.832428 #3381936] INFO -- : File: power_assert-2.0.4dev.gem I, [2024-05-21T19:45:06.913113 #3381936] INFO -- : $$$[end] "make update-download -j3" exit with 0. I, [2024-05-21T19:45:06.913208 #3381936] INFO -- : $$$[beg] make update-rubyspec -j3 I, [2024-05-21T19:45:07.002474 #3381936] INFO -- : make: Nothing to be done for 'update-rubyspec'. I, [2024-05-21T19:45:07.002640 #3381936] INFO -- : $$$[end] "make update-rubyspec -j3" exit with 0. I, [2024-05-21T19:45:07.002685 #3381936] INFO -- : $$$[beg] make update-src -j3 I, [2024-05-21T19:45:08.277984 #3381936] INFO -- : Already up to date. I, [2024-05-21T19:45:08.293724 #3381936] INFO -- : Latest commit hash = b20adf90e3 I, [2024-05-21T19:45:08.294382 #3381936] INFO -- : $$$[end] "make update-src -j3" exit with 0. I, [2024-05-21T19:45:08.294426 #3381936] INFO -- : $$$[beg] make after-update -j3 I, [2024-05-21T19:45:08.430866 #3381936] INFO -- : /home/opc/ruby/src/master/revision.h updated I, [2024-05-21T19:45:08.432044 #3381936] INFO -- : generating aarch64-linux-fake.rb I, [2024-05-21T19:45:08.489295 #3381936] INFO -- : aarch64-linux-fake.rb updated I, [2024-05-21T19:45:08.490718 #3381936] INFO -- : generating enc.mk I, [2024-05-21T19:45:08.722964 #3381936] INFO -- : making srcs under enc I, [2024-05-21T19:45:08.765491 #3381936] INFO -- : make[1]: Entering directory '/home/opc/ruby/build/master' I, [2024-05-21T19:45:08.765538 #3381936] INFO -- : make[1]: Nothing to be done for 'srcs'. I, [2024-05-21T19:45:08.765549 #3381936] INFO -- : make[1]: Leaving directory '/home/opc/ruby/build/master' I, [2024-05-21T19:45:08.847391 #3381936] INFO -- : Update power_assert to 84e85124c5014a139af39161d484156cfe87a9ed I, [2024-05-21T19:45:08.847647 #3381936] INFO -- : Update rbs to ba7872795d5de04adb8ff500c0e6afdc81a041dd I, [2024-05-21T19:45:08.848691 #3381936] INFO -- : Update typeprof to b19a6416da3a05d57fadd6ffdadb382b6d236ca5 I, [2024-05-21T19:45:08.851682 #3381936] INFO -- : echo ba7872795d5de04adb8ff500c0e6afdc81a041dd | /bin/sh /home/opc/ruby/src/master/tool/ifchange /home/opc/ruby/src/master/.bundle/.timestamp/rbs.revision - I, [2024-05-21T19:45:08.851803 #3381936] INFO -- : echo 84e85124c5014a139af39161d484156cfe87a9ed | /bin/sh /home/opc/ruby/src/master/tool/ifchange /home/opc/ruby/src/master/.bundle/.timestamp/power_assert.revision - I, [2024-05-21T19:45:08.851976 #3381936] INFO -- : echo b19a6416da3a05d57fadd6ffdadb382b6d236ca5 | /bin/sh /home/opc/ruby/src/master/tool/ifchange /home/opc/ruby/src/master/.bundle/.timestamp/typeprof.revision - I, [2024-05-21T19:45:08.857349 #3381936] INFO -- : /home/opc/ruby/src/master/.bundle/.timestamp/rbs.revision unchanged I, [2024-05-21T19:45:08.858106 #3381936] INFO -- : /home/opc/ruby/src/master/.bundle/.timestamp/power_assert.revision unchanged I, [2024-05-21T19:45:08.858665 #3381936] INFO -- : /home/opc/ruby/src/master/.bundle/.timestamp/typeprof.revision unchanged I, [2024-05-21T19:45:09.037842 #3381936] INFO -- : Building power_assert@84e85124c5014a139af39161d484156cfe87a9ed to /home/opc/ruby/src/master/gems/power_assert-2.0.3.gem I, [2024-05-21T19:45:09.148541 #3381936] INFO -- : Successfully built RubyGem I, [2024-05-21T19:45:09.148600 #3381936] INFO -- : Name: power_assert I, [2024-05-21T19:45:09.148610 #3381936] INFO -- : Version: 2.0.4dev I, [2024-05-21T19:45:09.148619 #3381936] INFO -- : File: power_assert-2.0.4dev.gem I, [2024-05-21T19:45:09.151002 #3381936] INFO -- : Extracting bundle gem power_assert-2.0.3... I, [2024-05-21T19:45:09.250070 #3381936] INFO -- : Try with hash version of bundled gems instead of gems/power_assert-2.0.3.gem. We don't use this gem with release version of Ruby. I, [2024-05-21T19:45:09.262307 #3381936] INFO -- : Unpacked gems/power_assert-2.0.4dev.gem I, [2024-05-21T19:45:09.264289 #3381936] INFO -- : $$$[end] "make after-update -j3" exit with 0. I, [2024-05-21T19:45:09.264454 #3381936] INFO -- : $$$[beg] make miniruby -j3 I, [2024-05-21T19:45:09.353399 #3381936] INFO -- : BASERUBY = /usr/local/bin/ruby --disable=gems I, [2024-05-21T19:45:09.353462 #3381936] INFO -- : CC = gcc I, [2024-05-21T19:45:09.353473 #3381936] INFO -- : LD = ld I, [2024-05-21T19:45:09.353484 #3381936] INFO -- : LDSHARED = gcc -shared I, [2024-05-21T19:45:09.353494 #3381936] INFO -- : CFLAGS = -O3 -fno-fast-math -ggdb3 -Wall -Wextra -Wdeprecated-declarations -Wdiv-by-zero -Wduplicated-cond -Wimplicit-function-declaration -Wimplicit-int -Wpointer-arith -Wwrite-strings -Wold-style-definition -Wimplicit-fallthrough=0 -Wmissing-noreturn -Wno-cast-function-type -Wno-constant-logical-operand -Wno-long-long -Wno-missing-field-initializers -Wno-overlength-strings -Wno-packed-bitfield-compat -Wno-parentheses-equality -Wno-self-assign -Wno-tautological-compare -Wno-unused-parameter -Wno-unused-value -Wsuggest-attribute=format -Wsuggest-attribute=noreturn -Wunused-variable -Wmisleading-indentation -Wundef I, [2024-05-21T19:45:09.353503 #3381936] INFO -- : XCFLAGS = -U_FORTIFY_SOURCE -D_FORTIFY_SOURCE=2 -fstack-protector-strong -msign-return-address=all -fno-strict-overflow -fvisibility=hidden -fexcess-precision=standard -DRUBY_EXPORT -fPIE -I. -I.ext/include/aarch64-linux -I/home/opc/ruby/src/master/include -I/home/opc/ruby/src/master -I/home/opc/ruby/src/master/prism -I/home/opc/ruby/src/master/enc/unicode/15.0.0 I, [2024-05-21T19:45:09.353512 #3381936] INFO -- : CPPFLAGS = I, [2024-05-21T19:45:09.353520 #3381936] INFO -- : DLDFLAGS = -Wl,--compress-debug-sections=zlib -fstack-protector-strong -pie I, [2024-05-21T19:45:09.353529 #3381936] INFO -- : SOLIBS = -lz -lrt -lrt -ldl -lcrypt -lm -lpthread I, [2024-05-21T19:45:09.353537 #3381936] INFO -- : LANG = en_US.UTF-8 I, [2024-05-21T19:45:09.353544 #3381936] INFO -- : LC_ALL = I, [2024-05-21T19:45:09.353552 #3381936] INFO -- : LC_CTYPE = I, [2024-05-21T19:45:09.353560 #3381936] INFO -- : MFLAGS = -j3 --jobserver-auth=4,5 I, [2024-05-21T19:45:09.353568 #3381936] INFO -- : RUSTC = rustc I, [2024-05-21T19:45:09.353577 #3381936] INFO -- : YJIT_RUSTC_ARGS = --crate-name=yjit --crate-type=staticlib --edition=2021 -g -C lto=thin -C opt-level=3 -C overflow-checks=on '--out-dir=/home/opc/ruby/build/master/yjit/target/release/' /home/opc/ruby/src/master/yjit/src/lib.rs I, [2024-05-21T19:45:09.354421 #3381936] INFO -- : gcc (GCC) 8.5.0 20210514 (Red Hat 8.5.0-10.1.0.1) I, [2024-05-21T19:45:09.354475 #3381936] INFO -- : Copyright (C) 2018 Free Software Foundation, Inc. I, [2024-05-21T19:45:09.354485 #3381936] INFO -- : This is free software; see the source for copying conditions. There is NO I, [2024-05-21T19:45:09.354494 #3381936] INFO -- : warranty; not even for MERCHANTABILITY or FITNESS FOR A PARTICULAR PURPOSE. I, [2024-05-21T19:45:09.354503 #3381936] INFO -- : I, [2024-05-21T19:45:09.379866 #3381936] INFO -- : compiling /home/opc/ruby/src/master/version.c I, [2024-05-21T19:45:09.524958 #3381936] INFO -- : linking miniruby I, [2024-05-21T19:45:10.423145 #3381936] INFO -- : $$$[end] "make miniruby -j3" exit with 0. I, [2024-05-21T19:45:10.423314 #3381936] INFO -- : $$$[beg] make ruby -j3 I, [2024-05-21T19:45:10.513152 #3381936] INFO -- : BASERUBY = /usr/local/bin/ruby --disable=gems I, [2024-05-21T19:45:10.513240 #3381936] INFO -- : CC = gcc I, [2024-05-21T19:45:10.513250 #3381936] INFO -- : LD = ld I, [2024-05-21T19:45:10.513259 #3381936] INFO -- : LDSHARED = gcc -shared I, [2024-05-21T19:45:10.513270 #3381936] INFO -- : CFLAGS = -O3 -fno-fast-math -ggdb3 -Wall -Wextra -Wdeprecated-declarations -Wdiv-by-zero -Wduplicated-cond -Wimplicit-function-declaration -Wimplicit-int -Wpointer-arith -Wwrite-strings -Wold-style-definition -Wimplicit-fallthrough=0 -Wmissing-noreturn -Wno-cast-function-type -Wno-constant-logical-operand -Wno-long-long -Wno-missing-field-initializers -Wno-overlength-strings -Wno-packed-bitfield-compat -Wno-parentheses-equality -Wno-self-assign -Wno-tautological-compare -Wno-unused-parameter -Wno-unused-value -Wsuggest-attribute=format -Wsuggest-attribute=noreturn -Wunused-variable -Wmisleading-indentation -Wundef I, [2024-05-21T19:45:10.513280 #3381936] INFO -- : XCFLAGS = -U_FORTIFY_SOURCE -D_FORTIFY_SOURCE=2 -fstack-protector-strong -msign-return-address=all -fno-strict-overflow -fvisibility=hidden -fexcess-precision=standard -DRUBY_EXPORT -fPIE -I. -I.ext/include/aarch64-linux -I/home/opc/ruby/src/master/include -I/home/opc/ruby/src/master -I/home/opc/ruby/src/master/prism -I/home/opc/ruby/src/master/enc/unicode/15.0.0 I, [2024-05-21T19:45:10.513288 #3381936] INFO -- : CPPFLAGS = I, [2024-05-21T19:45:10.513297 #3381936] INFO -- : DLDFLAGS = -Wl,--compress-debug-sections=zlib -fstack-protector-strong -pie I, [2024-05-21T19:45:10.513306 #3381936] INFO -- : SOLIBS = -lz -lrt -lrt -ldl -lcrypt -lm -lpthread I, [2024-05-21T19:45:10.513314 #3381936] INFO -- : LANG = en_US.UTF-8 I, [2024-05-21T19:45:10.513321 #3381936] INFO -- : LC_ALL = I, [2024-05-21T19:45:10.513329 #3381936] INFO -- : LC_CTYPE = I, [2024-05-21T19:45:10.513337 #3381936] INFO -- : MFLAGS = -j3 --jobserver-auth=4,5 I, [2024-05-21T19:45:10.513345 #3381936] INFO -- : RUSTC = rustc I, [2024-05-21T19:45:10.513353 #3381936] INFO -- : YJIT_RUSTC_ARGS = --crate-name=yjit --crate-type=staticlib --edition=2021 -g -C lto=thin -C opt-level=3 -C overflow-checks=on '--out-dir=/home/opc/ruby/build/master/yjit/target/release/' /home/opc/ruby/src/master/yjit/src/lib.rs I, [2024-05-21T19:45:10.514084 #3381936] INFO -- : gcc (GCC) 8.5.0 20210514 (Red Hat 8.5.0-10.1.0.1) I, [2024-05-21T19:45:10.514118 #3381936] INFO -- : Copyright (C) 2018 Free Software Foundation, Inc. I, [2024-05-21T19:45:10.514128 #3381936] INFO -- : This is free software; see the source for copying conditions. There is NO I, [2024-05-21T19:45:10.514138 #3381936] INFO -- : warranty; not even for MERCHANTABILITY or FITNESS FOR A PARTICULAR PURPOSE. I, [2024-05-21T19:45:10.514146 #3381936] INFO -- : I, [2024-05-21T19:45:10.693244 #3381936] INFO -- : builtin_binary.inc updated I, [2024-05-21T19:45:10.697717 #3381936] INFO -- : c5234a9416e4f20f175185e840b25b0f08674d14078ed7083f37e655458e3ca9 builtin_binary.inc I, [2024-05-21T19:45:10.698655 #3381936] INFO -- : compiling /home/opc/ruby/src/master/builtin.c I, [2024-05-21T19:45:11.020498 #3381936] INFO -- : linking static-library libruby-static.a I, [2024-05-21T19:45:13.940231 #3381936] INFO -- : linking ruby I, [2024-05-21T19:45:14.882503 #3381936] INFO -- : $$$[end] "make ruby -j3" exit with 0. I, [2024-05-21T19:45:14.882669 #3381936] INFO -- : $$$[beg] make all -j3 I, [2024-05-21T19:45:14.970456 #3381936] INFO -- : BASERUBY = /usr/local/bin/ruby --disable=gems I, [2024-05-21T19:45:14.970521 #3381936] INFO -- : CC = gcc I, [2024-05-21T19:45:14.970531 #3381936] INFO -- : LD = ld I, [2024-05-21T19:45:14.970539 #3381936] INFO -- : LDSHARED = gcc -shared I, [2024-05-21T19:45:14.970548 #3381936] INFO -- : CFLAGS = -O3 -fno-fast-math -ggdb3 -Wall -Wextra -Wdeprecated-declarations -Wdiv-by-zero -Wduplicated-cond -Wimplicit-function-declaration -Wimplicit-int -Wpointer-arith -Wwrite-strings -Wold-style-definition -Wimplicit-fallthrough=0 -Wmissing-noreturn -Wno-cast-function-type -Wno-constant-logical-operand -Wno-long-long -Wno-missing-field-initializers -Wno-overlength-strings -Wno-packed-bitfield-compat -Wno-parentheses-equality -Wno-self-assign -Wno-tautological-compare -Wno-unused-parameter -Wno-unused-value -Wsuggest-attribute=format -Wsuggest-attribute=noreturn -Wunused-variable -Wmisleading-indentation -Wundef I, [2024-05-21T19:45:14.970563 #3381936] INFO -- : XCFLAGS = -U_FORTIFY_SOURCE -D_FORTIFY_SOURCE=2 -fstack-protector-strong -msign-return-address=all -fno-strict-overflow -fvisibility=hidden -fexcess-precision=standard -DRUBY_EXPORT -fPIE -I. -I.ext/include/aarch64-linux -I/home/opc/ruby/src/master/include -I/home/opc/ruby/src/master -I/home/opc/ruby/src/master/prism -I/home/opc/ruby/src/master/enc/unicode/15.0.0 I, [2024-05-21T19:45:14.970572 #3381936] INFO -- : CPPFLAGS = I, [2024-05-21T19:45:14.970580 #3381936] INFO -- : DLDFLAGS = -Wl,--compress-debug-sections=zlib -fstack-protector-strong -pie I, [2024-05-21T19:45:14.970589 #3381936] INFO -- : SOLIBS = -lz -lrt -lrt -ldl -lcrypt -lm -lpthread I, [2024-05-21T19:45:14.970597 #3381936] INFO -- : LANG = en_US.UTF-8 I, [2024-05-21T19:45:14.970604 #3381936] INFO -- : LC_ALL = I, [2024-05-21T19:45:14.970612 #3381936] INFO -- : LC_CTYPE = I, [2024-05-21T19:45:14.970620 #3381936] INFO -- : MFLAGS = -j3 --jobserver-auth=4,5 I, [2024-05-21T19:45:14.970628 #3381936] INFO -- : RUSTC = rustc I, [2024-05-21T19:45:14.970636 #3381936] INFO -- : YJIT_RUSTC_ARGS = --crate-name=yjit --crate-type=staticlib --edition=2021 -g -C lto=thin -C opt-level=3 -C overflow-checks=on '--out-dir=/home/opc/ruby/build/master/yjit/target/release/' /home/opc/ruby/src/master/yjit/src/lib.rs I, [2024-05-21T19:45:14.971365 #3381936] INFO -- : gcc (GCC) 8.5.0 20210514 (Red Hat 8.5.0-10.1.0.1) I, [2024-05-21T19:45:14.971401 #3381936] INFO -- : Copyright (C) 2018 Free Software Foundation, Inc. I, [2024-05-21T19:45:14.971411 #3381936] INFO -- : This is free software; see the source for copying conditions. There is NO I, [2024-05-21T19:45:14.971421 #3381936] INFO -- : warranty; not even for MERCHANTABILITY or FITNESS FOR A PARTICULAR PURPOSE. I, [2024-05-21T19:45:14.971429 #3381936] INFO -- : I, [2024-05-21T19:45:15.003572 #3381936] INFO -- : generating encdb.h I, [2024-05-21T19:45:15.004916 #3381936] INFO -- : generating enc.mk I, [2024-05-21T19:45:15.041359 #3381936] INFO -- : encdb.h unchanged I, [2024-05-21T19:45:15.248214 #3381936] INFO -- : making srcs under enc I, [2024-05-21T19:45:15.249021 #3381936] INFO -- : making enc I, [2024-05-21T19:45:15.276642 #3381936] INFO -- : make[1]: Entering directory '/home/opc/ruby/build/master' I, [2024-05-21T19:45:15.276711 #3381936] INFO -- : make[1]: Nothing to be done for 'enc'. I, [2024-05-21T19:45:15.276722 #3381936] INFO -- : make[1]: Leaving directory '/home/opc/ruby/build/master' I, [2024-05-21T19:45:15.290179 #3381936] INFO -- : make[1]: Entering directory '/home/opc/ruby/build/master' I, [2024-05-21T19:45:15.290232 #3381936] INFO -- : make[1]: Nothing to be done for 'srcs'. I, [2024-05-21T19:45:15.290243 #3381936] INFO -- : make[1]: Leaving directory '/home/opc/ruby/build/master' I, [2024-05-21T19:45:15.291056 #3381936] INFO -- : generating transdb.h I, [2024-05-21T19:45:15.433648 #3381936] INFO -- : transdb.h unchanged I, [2024-05-21T19:45:15.435081 #3381936] INFO -- : generating makefiles ext/configure-ext.mk I, [2024-05-21T19:45:15.435335 #3381936] INFO -- : making trans I, [2024-05-21T19:45:15.474981 #3381936] INFO -- : ext/configure-ext.mk updated I, [2024-05-21T19:45:15.478326 #3381936] INFO -- : make[1]: Entering directory '/home/opc/ruby/build/master' I, [2024-05-21T19:45:15.483622 #3381936] INFO -- : make[1]: Entering directory '/home/opc/ruby/build/master' I, [2024-05-21T19:45:15.483689 #3381936] INFO -- : make[1]: Nothing to be done for 'trans'. I, [2024-05-21T19:45:15.483705 #3381936] INFO -- : make[1]: Leaving directory '/home/opc/ruby/build/master' I, [2024-05-21T19:45:16.212850 #3381936] INFO -- : making encs I, [2024-05-21T19:45:16.240680 #3381936] INFO -- : make[1]: Leaving directory '/home/opc/ruby/build/master' I, [2024-05-21T19:45:16.241371 #3381936] INFO -- : generating makefile exts.mk I, [2024-05-21T19:45:16.266170 #3381936] INFO -- : make[1]: Entering directory '/home/opc/ruby/build/master' I, [2024-05-21T19:45:16.266256 #3381936] INFO -- : make[1]: Nothing to be done for 'encs'. I, [2024-05-21T19:45:16.266267 #3381936] INFO -- : make[1]: Leaving directory '/home/opc/ruby/build/master' I, [2024-05-21T19:45:16.300393 #3381936] INFO -- : exts.mk unchanged I, [2024-05-21T19:45:16.305322 #3381936] INFO -- : make[1]: Entering directory '/home/opc/ruby/build/master' I, [2024-05-21T19:45:16.409441 #3381936] INFO -- : make[2]: Entering directory '/home/opc/ruby/build/master/ext/coverage' I, [2024-05-21T19:45:16.411698 #3381936] INFO -- : make[2]: Entering directory '/home/opc/ruby/build/master/ext/digest' I, [2024-05-21T19:45:16.413382 #3381936] INFO -- : make[2]: Entering directory '/home/opc/ruby/build/master/ext/date' I, [2024-05-21T19:45:16.418961 #3381936] INFO -- : make[2]: Leaving directory '/home/opc/ruby/build/master/ext/date' I, [2024-05-21T19:45:16.419013 #3381936] INFO -- : make[2]: Leaving directory '/home/opc/ruby/build/master/ext/coverage' I, [2024-05-21T19:45:16.421980 #3381936] INFO -- : make[2]: Leaving directory '/home/opc/ruby/build/master/ext/digest' I, [2024-05-21T19:45:16.430126 #3381936] INFO -- : make[2]: Entering directory '/home/opc/ruby/build/master/ext/io/console' I, [2024-05-21T19:45:16.430874 #3381936] INFO -- : make[2]: Entering directory '/home/opc/ruby/build/master/ext/fiddle' I, [2024-05-21T19:45:16.435651 #3381936] INFO -- : make[2]: Leaving directory '/home/opc/ruby/build/master/ext/io/console' I, [2024-05-21T19:45:16.437465 #3381936] INFO -- : make[2]: Entering directory '/home/opc/ruby/build/master/ext/json' I, [2024-05-21T19:45:16.439433 #3381936] INFO -- : make[2]: Entering directory '/home/opc/ruby/build/master/ext/monitor' I, [2024-05-21T19:45:16.440016 #3381936] INFO -- : make[2]: Leaving directory '/home/opc/ruby/build/master/ext/fiddle' I, [2024-05-21T19:45:16.445236 #3381936] INFO -- : make[2]: Leaving directory '/home/opc/ruby/build/master/ext/monitor' I, [2024-05-21T19:45:16.446079 #3381936] INFO -- : make[2]: Entering directory '/home/opc/ruby/build/master/ext/objspace' I, [2024-05-21T19:45:16.446115 #3381936] INFO -- : make[2]: Leaving directory '/home/opc/ruby/build/master/ext/json' I, [2024-05-21T19:45:16.450174 #3381936] INFO -- : make[2]: Entering directory '/home/opc/ruby/build/master/ext/pathname' I, [2024-05-21T19:45:16.452110 #3381936] INFO -- : make[2]: Leaving directory '/home/opc/ruby/build/master/ext/objspace' I, [2024-05-21T19:45:16.455779 #3381936] INFO -- : make[2]: Leaving directory '/home/opc/ruby/build/master/ext/pathname' I, [2024-05-21T19:45:16.458579 #3381936] INFO -- : make[2]: Entering directory '/home/opc/ruby/build/master/ext/psych' I, [2024-05-21T19:45:16.460027 #3381936] INFO -- : make[2]: Entering directory '/home/opc/ruby/build/master/ext/pty' I, [2024-05-21T19:45:16.464621 #3381936] INFO -- : make[2]: Leaving directory '/home/opc/ruby/build/master/ext/pty' I, [2024-05-21T19:45:16.465897 #3381936] INFO -- : make[2]: Entering directory '/home/opc/ruby/build/master/ext/openssl' I, [2024-05-21T19:45:16.477271 #3381936] INFO -- : make[2]: Leaving directory '/home/opc/ruby/build/master/ext/psych' I, [2024-05-21T19:45:16.479211 #3381936] INFO -- : make[2]: Entering directory '/home/opc/ruby/build/master/ext/rubyvm' I, [2024-05-21T19:45:16.481004 #3381936] INFO -- : make[2]: Entering directory '/home/opc/ruby/build/master/ext/ripper' I, [2024-05-21T19:45:16.482775 #3381936] INFO -- : make[2]: Leaving directory '/home/opc/ruby/build/master/ext/rubyvm' I, [2024-05-21T19:45:16.488283 #3381936] INFO -- : make[2]: Leaving directory '/home/opc/ruby/build/master/ext/openssl' I, [2024-05-21T19:45:16.488865 #3381936] INFO -- : make[2]: Leaving directory '/home/opc/ruby/build/master/ext/ripper' I, [2024-05-21T19:45:16.495160 #3381936] INFO -- : make[2]: Entering directory '/home/opc/ruby/build/master/ext/socket' I, [2024-05-21T19:45:16.495459 #3381936] INFO -- : make[2]: Entering directory '/home/opc/ruby/build/master/.bundle/gems/bigdecimal-3.1.7/ext/bigdecimal' I, [2024-05-21T19:45:16.499921 #3381936] INFO -- : make[2]: Entering directory '/home/opc/ruby/build/master/.bundle/gems/bigdecimal-3.1.8/ext/bigdecimal' I, [2024-05-21T19:45:16.506424 #3381936] INFO -- : make[2]: Leaving directory '/home/opc/ruby/build/master/ext/socket' I, [2024-05-21T19:45:16.508934 #3381936] INFO -- : make[2]: Entering directory '/home/opc/ruby/build/master/.bundle/gems/debug-1.9.2/ext/debug' I, [2024-05-21T19:45:16.531820 #3381936] INFO -- : make[2]: Leaving directory '/home/opc/ruby/build/master/.bundle/gems/bigdecimal-3.1.8/ext/bigdecimal' I, [2024-05-21T19:45:16.532656 #3381936] INFO -- : make[2]: Leaving directory '/home/opc/ruby/build/master/.bundle/gems/bigdecimal-3.1.7/ext/bigdecimal' I, [2024-05-21T19:45:16.534369 #3381936] INFO -- : make[2]: Entering directory '/home/opc/ruby/build/master/.bundle/gems/nkf-0.2.0/ext/nkf' I, [2024-05-21T19:45:16.535005 #3381936] INFO -- : make[2]: Entering directory '/home/opc/ruby/build/master/.bundle/gems/racc-1.7.3/ext/racc/cparse' I, [2024-05-21T19:45:16.541514 #3381936] INFO -- : make[2]: Leaving directory '/home/opc/ruby/build/master/.bundle/gems/debug-1.9.2/ext/debug' I, [2024-05-21T19:45:16.546120 #3381936] INFO -- : make[2]: Entering directory '/home/opc/ruby/build/master/.bundle/gems/racc-1.8.0/ext/racc/cparse' I, [2024-05-21T19:45:16.566968 #3381936] INFO -- : make[2]: Leaving directory '/home/opc/ruby/build/master/.bundle/gems/nkf-0.2.0/ext/nkf' I, [2024-05-21T19:45:16.567041 #3381936] INFO -- : make[2]: Leaving directory '/home/opc/ruby/build/master/.bundle/gems/racc-1.7.3/ext/racc/cparse' I, [2024-05-21T19:45:16.569983 #3381936] INFO -- : make[2]: Entering directory '/home/opc/ruby/build/master/.bundle/gems/syslog-0.1.2/ext/syslog' I, [2024-05-21T19:45:16.570043 #3381936] INFO -- : make[2]: Entering directory '/home/opc/ruby/build/master/.bundle/gems/rbs-3.4.4/ext/rbs_extension' I, [2024-05-21T19:45:16.584913 #3381936] INFO -- : make[2]: Leaving directory '/home/opc/ruby/build/master/.bundle/gems/racc-1.8.0/ext/racc/cparse' I, [2024-05-21T19:45:16.601630 #3381936] INFO -- : make[2]: Leaving directory '/home/opc/ruby/build/master/.bundle/gems/syslog-0.1.2/ext/syslog' I, [2024-05-21T19:45:16.607383 #3381936] INFO -- : make[2]: Entering directory '/home/opc/ruby/build/master/ext/digest/sha2' I, [2024-05-21T19:45:16.611687 #3381936] INFO -- : make[2]: Leaving directory '/home/opc/ruby/build/master/ext/digest/sha2' I, [2024-05-21T19:45:16.612148 #3381936] INFO -- : make[2]: Leaving directory '/home/opc/ruby/build/master/.bundle/gems/rbs-3.4.4/ext/rbs_extension' I, [2024-05-21T19:45:16.653035 #3381936] INFO -- : make[2]: Entering directory '/home/opc/ruby/build/master' I, [2024-05-21T19:45:16.736014 #3381936] INFO -- : make[2]: 'ruby' is up to date. I, [2024-05-21T19:45:16.736101 #3381936] INFO -- : make[2]: Leaving directory '/home/opc/ruby/build/master' I, [2024-05-21T19:45:16.736223 #3381936] INFO -- : make[1]: Leaving directory '/home/opc/ruby/build/master' I, [2024-05-21T19:45:16.740750 #3381936] INFO -- : make[1]: Entering directory '/home/opc/ruby/build/master' I, [2024-05-21T19:45:16.740807 #3381936] INFO -- : make[1]: Nothing to be done for 'note'. I, [2024-05-21T19:45:16.740817 #3381936] INFO -- : make[1]: Leaving directory '/home/opc/ruby/build/master' I, [2024-05-21T19:45:16.741084 #3381936] INFO -- : $$$[end] "make all -j3" exit with 0. I, [2024-05-21T19:45:16.741462 #3381936] INFO -- : $$$[beg] make install -j3 I, [2024-05-21T19:45:16.834852 #3381936] INFO -- : Update power_assert to 84e85124c5014a139af39161d484156cfe87a9ed I, [2024-05-21T19:45:16.835025 #3381936] INFO -- : Update rbs to ba7872795d5de04adb8ff500c0e6afdc81a041dd I, [2024-05-21T19:45:16.836227 #3381936] INFO -- : Update typeprof to b19a6416da3a05d57fadd6ffdadb382b6d236ca5 I, [2024-05-21T19:45:16.839163 #3381936] INFO -- : echo 84e85124c5014a139af39161d484156cfe87a9ed | /bin/sh /home/opc/ruby/src/master/tool/ifchange /home/opc/ruby/src/master/.bundle/.timestamp/power_assert.revision - I, [2024-05-21T19:45:16.839406 #3381936] INFO -- : echo ba7872795d5de04adb8ff500c0e6afdc81a041dd | /bin/sh /home/opc/ruby/src/master/tool/ifchange /home/opc/ruby/src/master/.bundle/.timestamp/rbs.revision - I, [2024-05-21T19:45:16.839903 #3381936] INFO -- : echo b19a6416da3a05d57fadd6ffdadb382b6d236ca5 | /bin/sh /home/opc/ruby/src/master/tool/ifchange /home/opc/ruby/src/master/.bundle/.timestamp/typeprof.revision - I, [2024-05-21T19:45:16.845739 #3381936] INFO -- : /home/opc/ruby/src/master/.bundle/.timestamp/rbs.revision unchanged I, [2024-05-21T19:45:16.846210 #3381936] INFO -- : /home/opc/ruby/src/master/.bundle/.timestamp/power_assert.revision unchanged I, [2024-05-21T19:45:16.847173 #3381936] INFO -- : /home/opc/ruby/src/master/.bundle/.timestamp/typeprof.revision unchanged I, [2024-05-21T19:45:16.849051 #3381936] INFO -- : BASERUBY = /usr/local/bin/ruby --disable=gems I, [2024-05-21T19:45:16.849109 #3381936] INFO -- : CC = gcc I, [2024-05-21T19:45:16.849141 #3381936] INFO -- : LD = ld I, [2024-05-21T19:45:16.849229 #3381936] INFO -- : LDSHARED = gcc -shared I, [2024-05-21T19:45:16.849272 #3381936] INFO -- : CFLAGS = -O3 -fno-fast-math -ggdb3 -Wall -Wextra -Wdeprecated-declarations -Wdiv-by-zero -Wduplicated-cond -Wimplicit-function-declaration -Wimplicit-int -Wpointer-arith -Wwrite-strings -Wold-style-definition -Wimplicit-fallthrough=0 -Wmissing-noreturn -Wno-cast-function-type -Wno-constant-logical-operand -Wno-long-long -Wno-missing-field-initializers -Wno-overlength-strings -Wno-packed-bitfield-compat -Wno-parentheses-equality -Wno-self-assign -Wno-tautological-compare -Wno-unused-parameter -Wno-unused-value -Wsuggest-attribute=format -Wsuggest-attribute=noreturn -Wunused-variable -Wmisleading-indentation -Wundef I, [2024-05-21T19:45:16.849309 #3381936] INFO -- : XCFLAGS = -U_FORTIFY_SOURCE -D_FORTIFY_SOURCE=2 -fstack-protector-strong -msign-return-address=all -fno-strict-overflow -fvisibility=hidden -fexcess-precision=standard -DRUBY_EXPORT -fPIE -I. -I.ext/include/aarch64-linux -I/home/opc/ruby/src/master/include -I/home/opc/ruby/src/master -I/home/opc/ruby/src/master/prism -I/home/opc/ruby/src/master/enc/unicode/15.0.0 I, [2024-05-21T19:45:16.849340 #3381936] INFO -- : CPPFLAGS = I, [2024-05-21T19:45:16.849371 #3381936] INFO -- : DLDFLAGS = -Wl,--compress-debug-sections=zlib -fstack-protector-strong -pie I, [2024-05-21T19:45:16.849431 #3381936] INFO -- : SOLIBS = -lz -lrt -lrt -ldl -lcrypt -lm -lpthread I, [2024-05-21T19:45:16.849470 #3381936] INFO -- : LANG = en_US.UTF-8 I, [2024-05-21T19:45:16.849482 #3381936] INFO -- : LC_ALL = I, [2024-05-21T19:45:16.849491 #3381936] INFO -- : LC_CTYPE = I, [2024-05-21T19:45:16.849500 #3381936] INFO -- : MFLAGS = -j3 --jobserver-auth=4,5 I, [2024-05-21T19:45:16.849508 #3381936] INFO -- : RUSTC = rustc I, [2024-05-21T19:45:16.849516 #3381936] INFO -- : YJIT_RUSTC_ARGS = --crate-name=yjit --crate-type=staticlib --edition=2021 -g -C lto=thin -C opt-level=3 -C overflow-checks=on '--out-dir=/home/opc/ruby/build/master/yjit/target/release/' /home/opc/ruby/src/master/yjit/src/lib.rs I, [2024-05-21T19:45:16.880632 #3381936] INFO -- : generating encdb.h I, [2024-05-21T19:45:16.880702 #3381936] INFO -- : gcc (GCC) 8.5.0 20210514 (Red Hat 8.5.0-10.1.0.1) I, [2024-05-21T19:45:16.880713 #3381936] INFO -- : Copyright (C) 2018 Free Software Foundation, Inc. I, [2024-05-21T19:45:16.880723 #3381936] INFO -- : This is free software; see the source for copying conditions. There is NO I, [2024-05-21T19:45:16.880732 #3381936] INFO -- : warranty; not even for MERCHANTABILITY or FITNESS FOR A PARTICULAR PURPOSE. I, [2024-05-21T19:45:16.880743 #3381936] INFO -- : I, [2024-05-21T19:45:16.881371 #3381936] INFO -- : generating enc.mk I, [2024-05-21T19:45:16.923302 #3381936] INFO -- : encdb.h unchanged I, [2024-05-21T19:45:17.015760 #3381936] INFO -- : Building power_assert@84e85124c5014a139af39161d484156cfe87a9ed to /home/opc/ruby/src/master/gems/power_assert-2.0.3.gem I, [2024-05-21T19:45:17.122392 #3381936] INFO -- : making srcs under enc I, [2024-05-21T19:45:17.122628 #3381936] INFO -- : making enc I, [2024-05-21T19:45:17.137212 #3381936] INFO -- : Successfully built RubyGem I, [2024-05-21T19:45:17.137267 #3381936] INFO -- : Name: power_assert I, [2024-05-21T19:45:17.137277 #3381936] INFO -- : Version: 2.0.4dev I, [2024-05-21T19:45:17.137286 #3381936] INFO -- : File: power_assert-2.0.4dev.gem I, [2024-05-21T19:45:17.139732 #3381936] INFO -- : Extracting bundle gem power_assert-2.0.3... I, [2024-05-21T19:45:17.151365 #3381936] INFO -- : make[1]: Entering directory '/home/opc/ruby/build/master' I, [2024-05-21T19:45:17.151446 #3381936] INFO -- : make[1]: Nothing to be done for 'enc'. I, [2024-05-21T19:45:17.151480 #3381936] INFO -- : make[1]: Leaving directory '/home/opc/ruby/build/master' I, [2024-05-21T19:45:17.164458 #3381936] INFO -- : make[1]: Entering directory '/home/opc/ruby/build/master' I, [2024-05-21T19:45:17.164589 #3381936] INFO -- : make[1]: Nothing to be done for 'srcs'. I, [2024-05-21T19:45:17.164611 #3381936] INFO -- : make[1]: Leaving directory '/home/opc/ruby/build/master' I, [2024-05-21T19:45:17.165466 #3381936] INFO -- : generating transdb.h I, [2024-05-21T19:45:17.239080 #3381936] INFO -- : Try with hash version of bundled gems instead of gems/power_assert-2.0.3.gem. We don't use this gem with release version of Ruby. I, [2024-05-21T19:45:17.249784 #3381936] INFO -- : Unpacked gems/power_assert-2.0.4dev.gem I, [2024-05-21T19:45:17.309854 #3381936] INFO -- : transdb.h unchanged I, [2024-05-21T19:45:17.311262 #3381936] INFO -- : generating makefiles ext/configure-ext.mk I, [2024-05-21T19:45:17.311413 #3381936] INFO -- : making trans I, [2024-05-21T19:45:17.351310 #3381936] INFO -- : ext/configure-ext.mk unchanged I, [2024-05-21T19:45:17.354395 #3381936] INFO -- : make[1]: Entering directory '/home/opc/ruby/build/master' I, [2024-05-21T19:45:17.359668 #3381936] INFO -- : make[1]: Entering directory '/home/opc/ruby/build/master' I, [2024-05-21T19:45:17.359729 #3381936] INFO -- : make[1]: Nothing to be done for 'trans'. I, [2024-05-21T19:45:17.359741 #3381936] INFO -- : make[1]: Leaving directory '/home/opc/ruby/build/master' I, [2024-05-21T19:45:17.483407 #3381936] INFO -- : making encs I, [2024-05-21T19:45:17.538481 #3381936] INFO -- : make[1]: Entering directory '/home/opc/ruby/build/master' I, [2024-05-21T19:45:17.538556 #3381936] INFO -- : make[1]: Nothing to be done for 'encs'. I, [2024-05-21T19:45:17.538567 #3381936] INFO -- : make[1]: Leaving directory '/home/opc/ruby/build/master' I, [2024-05-21T19:45:18.148014 #3381936] INFO -- : make[1]: Leaving directory '/home/opc/ruby/build/master' I, [2024-05-21T19:45:18.148750 #3381936] INFO -- : generating makefile exts.mk I, [2024-05-21T19:45:18.207246 #3381936] INFO -- : exts.mk unchanged I, [2024-05-21T19:45:18.212123 #3381936] INFO -- : make[1]: Entering directory '/home/opc/ruby/build/master' I, [2024-05-21T19:45:18.317824 #3381936] INFO -- : make[2]: Entering directory '/home/opc/ruby/build/master/ext/coverage' I, [2024-05-21T19:45:18.320350 #3381936] INFO -- : make[2]: Entering directory '/home/opc/ruby/build/master/ext/digest' I, [2024-05-21T19:45:18.320526 #3381936] INFO -- : make[2]: Entering directory '/home/opc/ruby/build/master/ext/date' I, [2024-05-21T19:45:18.323667 #3381936] INFO -- : make[2]: Leaving directory '/home/opc/ruby/build/master/ext/coverage' I, [2024-05-21T19:45:18.327248 #3381936] INFO -- : make[2]: Leaving directory '/home/opc/ruby/build/master/ext/date' I, [2024-05-21T19:45:18.329473 #3381936] INFO -- : make[2]: Leaving directory '/home/opc/ruby/build/master/ext/digest' I, [2024-05-21T19:45:18.335463 #3381936] INFO -- : make[2]: Entering directory '/home/opc/ruby/build/master/ext/io/console' I, [2024-05-21T19:45:18.336460 #3381936] INFO -- : make[2]: Entering directory '/home/opc/ruby/build/master/ext/fiddle' I, [2024-05-21T19:45:18.342856 #3381936] INFO -- : make[2]: Leaving directory '/home/opc/ruby/build/master/ext/io/console' I, [2024-05-21T19:45:18.343757 #3381936] INFO -- : make[2]: Entering directory '/home/opc/ruby/build/master/ext/json' I, [2024-05-21T19:45:18.346911 #3381936] INFO -- : make[2]: Entering directory '/home/opc/ruby/build/master/ext/monitor' I, [2024-05-21T19:45:18.346957 #3381936] INFO -- : make[2]: Leaving directory '/home/opc/ruby/build/master/ext/fiddle' I, [2024-05-21T19:45:18.350684 #3381936] INFO -- : make[2]: Leaving directory '/home/opc/ruby/build/master/ext/monitor' I, [2024-05-21T19:45:18.353546 #3381936] INFO -- : make[2]: Leaving directory '/home/opc/ruby/build/master/ext/json' I, [2024-05-21T19:45:18.354302 #3381936] INFO -- : make[2]: Entering directory '/home/opc/ruby/build/master/ext/objspace' I, [2024-05-21T19:45:18.357680 #3381936] INFO -- : make[2]: Entering directory '/home/opc/ruby/build/master/ext/pathname' I, [2024-05-21T19:45:18.361626 #3381936] INFO -- : make[2]: Leaving directory '/home/opc/ruby/build/master/ext/pathname' I, [2024-05-21T19:45:18.363609 #3381936] INFO -- : make[2]: Leaving directory '/home/opc/ruby/build/master/ext/objspace' I, [2024-05-21T19:45:18.367981 #3381936] INFO -- : make[2]: Entering directory '/home/opc/ruby/build/master/ext/pty' I, [2024-05-21T19:45:18.368166 #3381936] INFO -- : make[2]: Entering directory '/home/opc/ruby/build/master/ext/psych' I, [2024-05-21T19:45:18.369698 #3381936] INFO -- : make[2]: Entering directory '/home/opc/ruby/build/master/ext/openssl' I, [2024-05-21T19:45:18.373912 #3381936] INFO -- : make[2]: Leaving directory '/home/opc/ruby/build/master/ext/pty' I, [2024-05-21T19:45:18.387895 #3381936] INFO -- : make[2]: Entering directory '/home/opc/ruby/build/master/ext/ripper' I, [2024-05-21T19:45:18.388905 #3381936] INFO -- : make[2]: Leaving directory '/home/opc/ruby/build/master/ext/psych' I, [2024-05-21T19:45:18.390845 #3381936] INFO -- : make[2]: Entering directory '/home/opc/ruby/build/master/ext/rubyvm' I, [2024-05-21T19:45:18.391434 #3381936] INFO -- : make[2]: Leaving directory '/home/opc/ruby/build/master/ext/openssl' I, [2024-05-21T19:45:18.396042 #3381936] INFO -- : make[2]: Leaving directory '/home/opc/ruby/build/master/ext/ripper' I, [2024-05-21T19:45:18.396804 #3381936] INFO -- : make[2]: Leaving directory '/home/opc/ruby/build/master/ext/rubyvm' I, [2024-05-21T19:45:18.403530 #3381936] INFO -- : make[2]: Entering directory '/home/opc/ruby/build/master/.bundle/gems/bigdecimal-3.1.7/ext/bigdecimal' I, [2024-05-21T19:45:18.403862 #3381936] INFO -- : make[2]: Entering directory '/home/opc/ruby/build/master/ext/socket' I, [2024-05-21T19:45:18.407380 #3381936] INFO -- : make[2]: Entering directory '/home/opc/ruby/build/master/.bundle/gems/bigdecimal-3.1.8/ext/bigdecimal' I, [2024-05-21T19:45:18.421638 #3381936] INFO -- : make[2]: Leaving directory '/home/opc/ruby/build/master/ext/socket' I, [2024-05-21T19:45:18.425372 #3381936] INFO -- : make[2]: Entering directory '/home/opc/ruby/build/master/.bundle/gems/debug-1.9.2/ext/debug' I, [2024-05-21T19:45:18.437826 #3381936] INFO -- : make[2]: Leaving directory '/home/opc/ruby/build/master/.bundle/gems/bigdecimal-3.1.7/ext/bigdecimal' I, [2024-05-21T19:45:18.438665 #3381936] INFO -- : make[2]: Leaving directory '/home/opc/ruby/build/master/.bundle/gems/bigdecimal-3.1.8/ext/bigdecimal' I, [2024-05-21T19:45:18.440926 #3381936] INFO -- : make[2]: Entering directory '/home/opc/ruby/build/master/.bundle/gems/nkf-0.2.0/ext/nkf' I, [2024-05-21T19:45:18.443274 #3381936] INFO -- : make[2]: Entering directory '/home/opc/ruby/build/master/.bundle/gems/racc-1.7.3/ext/racc/cparse' I, [2024-05-21T19:45:18.459365 #3381936] INFO -- : make[2]: Leaving directory '/home/opc/ruby/build/master/.bundle/gems/debug-1.9.2/ext/debug' I, [2024-05-21T19:45:18.465276 #3381936] INFO -- : make[2]: Entering directory '/home/opc/ruby/build/master/.bundle/gems/racc-1.8.0/ext/racc/cparse' I, [2024-05-21T19:45:18.472903 #3381936] INFO -- : make[2]: Leaving directory '/home/opc/ruby/build/master/.bundle/gems/nkf-0.2.0/ext/nkf' I, [2024-05-21T19:45:18.475751 #3381936] INFO -- : make[2]: Entering directory '/home/opc/ruby/build/master/.bundle/gems/rbs-3.4.4/ext/rbs_extension' I, [2024-05-21T19:45:18.476003 #3381936] INFO -- : make[2]: Leaving directory '/home/opc/ruby/build/master/.bundle/gems/racc-1.7.3/ext/racc/cparse' I, [2024-05-21T19:45:18.478463 #3381936] INFO -- : make[2]: Entering directory '/home/opc/ruby/build/master/.bundle/gems/syslog-0.1.2/ext/syslog' I, [2024-05-21T19:45:18.498903 #3381936] INFO -- : make[2]: Leaving directory '/home/opc/ruby/build/master/.bundle/gems/racc-1.8.0/ext/racc/cparse' I, [2024-05-21T19:45:18.508633 #3381936] INFO -- : make[2]: Leaving directory '/home/opc/ruby/build/master/.bundle/gems/rbs-3.4.4/ext/rbs_extension' I, [2024-05-21T19:45:18.512525 #3381936] INFO -- : make[2]: Leaving directory '/home/opc/ruby/build/master/.bundle/gems/syslog-0.1.2/ext/syslog' I, [2024-05-21T19:45:18.516891 #3381936] INFO -- : make[2]: Entering directory '/home/opc/ruby/build/master/ext/digest/sha2' I, [2024-05-21T19:45:18.521772 #3381936] INFO -- : make[2]: Leaving directory '/home/opc/ruby/build/master/ext/digest/sha2' I, [2024-05-21T19:45:18.559606 #3381936] INFO -- : make[2]: Entering directory '/home/opc/ruby/build/master' I, [2024-05-21T19:45:18.642117 #3381936] INFO -- : make[2]: 'ruby' is up to date. I, [2024-05-21T19:45:18.642196 #3381936] INFO -- : make[2]: Leaving directory '/home/opc/ruby/build/master' I, [2024-05-21T19:45:18.642603 #3381936] INFO -- : make[1]: Leaving directory '/home/opc/ruby/build/master' I, [2024-05-21T19:45:18.646997 #3381936] INFO -- : make[1]: Entering directory '/home/opc/ruby/build/master' I, [2024-05-21T19:45:18.647018 #3381936] INFO -- : make[1]: Nothing to be done for 'note'. I, [2024-05-21T19:45:18.647028 #3381936] INFO -- : make[1]: Leaving directory '/home/opc/ruby/build/master' I, [2024-05-21T19:45:18.647183 #3381936] INFO -- : ./miniruby -I/home/opc/ruby/src/master/lib -I. -I.ext/common /home/opc/ruby/src/master/tool/runruby.rb --extout=.ext -- --disable-gems -r./aarch64-linux-fake /home/opc/ruby/src/master/tool/rbinstall.rb --make="make" --dest-dir="" --extout=".ext" --ext-build-dir="./ext" --mflags="-j3 --jobserver-auth=4,5" --make-flags=" -j3 --jobserver-auth=4,5" --data-mode=0644 --prog-mode=0755 --installed-list .installed.list --mantype="doc" --gnumake --install=all --exclude=doc I, [2024-05-21T19:45:18.797793 #3381936] INFO -- : Installing to I, [2024-05-21T19:45:18.797865 #3381936] INFO -- : installing binary commands: /home/opc/ruby/install/master/bin I, [2024-05-21T19:45:18.809587 #3381936] INFO -- : installing base libraries: /home/opc/ruby/install/master/lib I, [2024-05-21T19:45:18.811271 #3381936] INFO -- : installing arch files: /home/opc/ruby/install/master/lib/ruby/3.4.0+0/aarch64-linux I, [2024-05-21T19:45:18.811397 #3381936] INFO -- : installing pkgconfig data: /home/opc/ruby/install/master/lib/pkgconfig I, [2024-05-21T19:45:18.811438 #3381936] INFO -- : installing extension objects: /home/opc/ruby/install/master/lib/ruby/3.4.0+0/aarch64-linux I, [2024-05-21T19:45:18.824070 #3381936] INFO -- : installing extension objects: /home/opc/ruby/install/master/lib/ruby/site_ruby/3.4.0+0/aarch64-linux I, [2024-05-21T19:45:18.824095 #3381936] INFO -- : installing extension objects: /home/opc/ruby/install/master/lib/ruby/vendor_ruby/3.4.0+0/aarch64-linux I, [2024-05-21T19:45:18.824200 #3381936] INFO -- : installing extension headers: /home/opc/ruby/install/master/include/ruby-3.4.0+0/aarch64-linux I, [2024-05-21T19:45:18.824505 #3381936] INFO -- : installing extension scripts: /home/opc/ruby/install/master/lib/ruby/3.4.0+0 I, [2024-05-21T19:45:18.832173 #3381936] INFO -- : installing extension scripts: /home/opc/ruby/install/master/lib/ruby/site_ruby/3.4.0+0 I, [2024-05-21T19:45:18.832209 #3381936] INFO -- : installing extension scripts: /home/opc/ruby/install/master/lib/ruby/vendor_ruby/3.4.0+0 I, [2024-05-21T19:45:18.832230 #3381936] INFO -- : installing extension headers: /home/opc/ruby/install/master/include/ruby-3.4.0+0/ruby I, [2024-05-21T19:45:18.832309 #3381936] INFO -- : installing command scripts: /home/opc/ruby/install/master/bin I, [2024-05-21T19:45:18.832438 #3381936] INFO -- : installing library scripts: /home/opc/ruby/install/master/lib/ruby/3.4.0+0 I, [2024-05-21T19:45:18.913839 #3381936] INFO -- : installing common headers: /home/opc/ruby/install/master/include/ruby-3.4.0+0 I, [2024-05-21T19:45:18.925395 #3381936] INFO -- : installing manpages: /home/opc/ruby/install/master/share/man/man1 I, [2024-05-21T19:45:18.925661 #3381936] INFO -- : installing default gems from lib: /home/opc/ruby/install/master/lib/ruby/gems/3.4.0+0 I, [2024-05-21T19:45:18.971647 #3381936] INFO -- : benchmark 0.3.0 I, [2024-05-21T19:45:18.975642 #3381936] INFO -- : bundler 2.6.0.dev I, [2024-05-21T19:45:18.980741 #3381936] INFO -- : cgi 0.4.1 I, [2024-05-21T19:45:18.981935 #3381936] INFO -- : delegate 0.3.1 I, [2024-05-21T19:45:18.983009 #3381936] INFO -- : did_you_mean 1.6.3 I, [2024-05-21T19:45:18.984083 #3381936] INFO -- : english 0.8.0 I, [2024-05-21T19:45:18.986287 #3381936] INFO -- : erb 4.0.4 I, [2024-05-21T19:45:18.989265 #3381936] INFO -- : error_highlight 0.6.0 I, [2024-05-21T19:45:18.990339 #3381936] INFO -- : fileutils 1.7.2 I, [2024-05-21T19:45:18.992234 #3381936] INFO -- : find 0.2.0 I, [2024-05-21T19:45:18.993437 #3381936] INFO -- : forwardable 1.3.3 I, [2024-05-21T19:45:18.994518 #3381936] INFO -- : ipaddr 1.2.6 I, [2024-05-21T19:45:18.995577 #3381936] INFO -- : irb 1.13.1 I, [2024-05-21T19:45:18.998459 #3381936] INFO -- : logger 1.6.0 I, [2024-05-21T19:45:18.999540 #3381936] INFO -- : net-http 0.4.1 I, [2024-05-21T19:45:19.000728 #3381936] INFO -- : net-protocol 0.2.2 I, [2024-05-21T19:45:19.001927 #3381936] INFO -- : open-uri 0.4.1 I, [2024-05-21T19:45:19.003065 #3381936] INFO -- : open3 0.2.1 I, [2024-05-21T19:45:19.004187 #3381936] INFO -- : optparse 0.5.0 I, [2024-05-21T19:45:19.005406 #3381936] INFO -- : ostruct 0.6.0 I, [2024-05-21T19:45:19.006461 #3381936] INFO -- : pp 0.5.0 I, [2024-05-21T19:45:19.007605 #3381936] INFO -- : prettyprint 0.2.0 I, [2024-05-21T19:45:19.008721 #3381936] INFO -- : prism 0.29.0 I, [2024-05-21T19:45:19.009961 #3381936] INFO -- : pstore 0.1.3 I, [2024-05-21T19:45:19.011039 #3381936] INFO -- : rdoc 6.6.3.1 I, [2024-05-21T19:45:19.014708 #3381936] INFO -- : readline 0.0.4 I, [2024-05-21T19:45:19.015810 #3381936] INFO -- : reline 0.5.7 I, [2024-05-21T19:45:19.017018 #3381936] INFO -- : resolv 0.4.0 I, [2024-05-21T19:45:19.018124 #3381936] INFO -- : ruby2_keywords 0.0.5 I, [2024-05-21T19:45:19.020889 #3381936] INFO -- : securerandom 0.3.1 I, [2024-05-21T19:45:19.022011 #3381936] INFO -- : set 1.1.0 I, [2024-05-21T19:45:19.023086 #3381936] INFO -- : shellwords 0.2.0 I, [2024-05-21T19:45:19.024161 #3381936] INFO -- : singleton 0.2.0 I, [2024-05-21T19:45:19.025279 #3381936] INFO -- : syntax_suggest 2.0.0 I, [2024-05-21T19:45:19.029252 #3381936] INFO -- : tempfile 0.2.1 I, [2024-05-21T19:45:19.030372 #3381936] INFO -- : time 0.3.0 I, [2024-05-21T19:45:19.031757 #3381936] INFO -- : timeout 0.4.1 I, [2024-05-21T19:45:19.032889 #3381936] INFO -- : tmpdir 0.2.0 I, [2024-05-21T19:45:19.034069 #3381936] INFO -- : tsort 0.2.0 I, [2024-05-21T19:45:19.035148 #3381936] INFO -- : un 0.3.0 I, [2024-05-21T19:45:19.036223 #3381936] INFO -- : uri 0.13.0 I, [2024-05-21T19:45:19.037491 #3381936] INFO -- : weakref 0.1.3 I, [2024-05-21T19:45:19.038591 #3381936] INFO -- : yaml 0.3.0 I, [2024-05-21T19:45:19.039442 #3381936] INFO -- : installing default gems from ext: /home/opc/ruby/install/master/lib/ruby/gems/3.4.0+0 I, [2024-05-21T19:45:19.048867 #3381936] INFO -- : date 3.3.4 I, [2024-05-21T19:45:19.051961 #3381936] INFO -- : digest 3.1.1 I, [2024-05-21T19:45:19.053105 #3381936] INFO -- : etc 1.4.3 I, [2024-05-21T19:45:19.054277 #3381936] INFO -- : fcntl 1.1.0 I, [2024-05-21T19:45:19.055354 #3381936] INFO -- : fiddle 1.1.3 I, [2024-05-21T19:45:19.056462 #3381936] INFO -- : io-console 0.7.2 I, [2024-05-21T19:45:19.057609 #3381936] INFO -- : io-nonblock 0.3.0 I, [2024-05-21T19:45:19.059611 #3381936] INFO -- : io-wait 0.3.1 I, [2024-05-21T19:45:19.060793 #3381936] INFO -- : json 2.7.2 I, [2024-05-21T19:45:19.062054 #3381936] INFO -- : openssl 3.2.0 I, [2024-05-21T19:45:19.063199 #3381936] INFO -- : pathname 0.3.0 I, [2024-05-21T19:45:19.064668 #3381936] INFO -- : psych 5.1.2 I, [2024-05-21T19:45:19.065962 #3381936] INFO -- : stringio 3.1.1 I, [2024-05-21T19:45:19.067846 #3381936] INFO -- : strscan 3.1.1 I, [2024-05-21T19:45:19.068980 #3381936] INFO -- : zlib 3.1.0 I, [2024-05-21T19:45:19.069934 #3381936] INFO -- : installing bundled gems: /home/opc/ruby/install/master/lib/ruby/gems/3.4.0+0 I, [2024-05-21T19:45:19.070901 #3381936] INFO -- : minitest 5.23.0 I, [2024-05-21T19:45:19.088649 #3381936] INFO -- : rake 13.2.1 I, [2024-05-21T19:45:19.104102 #3381936] INFO -- : test-unit 3.6.2 I, [2024-05-21T19:45:19.123630 #3381936] INFO -- : rexml 3.2.8 I, [2024-05-21T19:45:19.143326 #3381936] INFO -- : rss 0.3.0 I, [2024-05-21T19:45:19.153083 #3381936] INFO -- : net-ftp 0.3.4 I, [2024-05-21T19:45:19.157838 #3381936] INFO -- : net-imap 0.4.11 I, [2024-05-21T19:45:19.177852 #3381936] INFO -- : net-pop 0.1.2 I, [2024-05-21T19:45:19.180605 #3381936] INFO -- : net-smtp 0.5.0 I, [2024-05-21T19:45:19.184815 #3381936] INFO -- : matrix 0.4.2 I, [2024-05-21T19:45:19.193115 #3381936] INFO -- : prime 0.1.2 I, [2024-05-21T19:45:19.201908 #3381936] INFO -- : rbs 3.4.4 I, [2024-05-21T19:45:19.317402 #3381936] INFO -- : typeprof 0.21.11 I, [2024-05-21T19:45:19.325753 #3381936] INFO -- : debug 1.9.2 I, [2024-05-21T19:45:19.337124 #3381936] INFO -- : racc 1.8.0 I, [2024-05-21T19:45:19.352825 #3381936] INFO -- : mutex_m 0.2.0 I, [2024-05-21T19:45:19.355924 #3381936] INFO -- : getoptlong 0.2.1 I, [2024-05-21T19:45:19.361831 #3381936] INFO -- : base64 0.2.0 I, [2024-05-21T19:45:19.364348 #3381936] INFO -- : bigdecimal 3.1.8 I, [2024-05-21T19:45:19.370687 #3381936] INFO -- : observer 0.1.2 I, [2024-05-21T19:45:19.373782 #3381936] INFO -- : abbrev 0.1.2 I, [2024-05-21T19:45:19.376632 #3381936] INFO -- : resolv-replace 0.1.1 I, [2024-05-21T19:45:19.379822 #3381936] INFO -- : rinda 0.2.0 I, [2024-05-21T19:45:19.384683 #3381936] INFO -- : drb 2.2.1 I, [2024-05-21T19:45:19.389288 #3381936] INFO -- : nkf 0.2.0 I, [2024-05-21T19:45:19.396229 #3381936] INFO -- : syslog 0.1.2 I, [2024-05-21T19:45:19.401065 #3381936] INFO -- : csv 3.3.0 I, [2024-05-21T19:45:19.409693 #3381936] INFO -- : installing bundled gem cache: /home/opc/ruby/install/master/lib/ruby/gems/3.4.0+0/cache I, [2024-05-21T19:45:19.411517 #3381936] INFO -- : skipped bundled gems: I, [2024-05-21T19:45:19.411533 #3381936] INFO -- : power_assert-2.0.4dev.gem not found in bundled_gems I, [2024-05-21T19:45:19.414672 #3381936] INFO -- : $$$[end] "make install -j3" exit with 0. I, [2024-05-21T19:45:19.414852 #3381936] INFO -- : $$$[beg] make yes-btest TESTOPTS='-q -j3' I, [2024-05-21T19:45:42.494097 #3381936] INFO -- : PASS all 1936 tests E, [2024-05-21T19:45:42.496166 #3381936] ERROR -- : I, [2024-05-21T19:45:42.496296 #3381936] INFO -- : $$$[end] "make yes-btest TESTOPTS='-q -j3'" exit with 0. I, [2024-05-21T19:45:42.496472 #3381936] INFO -- : $$$[beg] make yes-test-basic TESTS='-j3' I, [2024-05-21T19:45:42.591107 #3381936] INFO -- : BASERUBY = /usr/local/bin/ruby --disable=gems I, [2024-05-21T19:45:42.591178 #3381936] INFO -- : CC = gcc I, [2024-05-21T19:45:42.591189 #3381936] INFO -- : LD = ld I, [2024-05-21T19:45:42.591198 #3381936] INFO -- : LDSHARED = gcc -shared I, [2024-05-21T19:45:42.591209 #3381936] INFO -- : CFLAGS = -O3 -fno-fast-math -ggdb3 -Wall -Wextra -Wdeprecated-declarations -Wdiv-by-zero -Wduplicated-cond -Wimplicit-function-declaration -Wimplicit-int -Wpointer-arith -Wwrite-strings -Wold-style-definition -Wimplicit-fallthrough=0 -Wmissing-noreturn -Wno-cast-function-type -Wno-constant-logical-operand -Wno-long-long -Wno-missing-field-initializers -Wno-overlength-strings -Wno-packed-bitfield-compat -Wno-parentheses-equality -Wno-self-assign -Wno-tautological-compare -Wno-unused-parameter -Wno-unused-value -Wsuggest-attribute=format -Wsuggest-attribute=noreturn -Wunused-variable -Wmisleading-indentation -Wundef I, [2024-05-21T19:45:42.591219 #3381936] INFO -- : XCFLAGS = -U_FORTIFY_SOURCE -D_FORTIFY_SOURCE=2 -fstack-protector-strong -msign-return-address=all -fno-strict-overflow -fvisibility=hidden -fexcess-precision=standard -DRUBY_EXPORT -fPIE -I. -I.ext/include/aarch64-linux -I/home/opc/ruby/src/master/include -I/home/opc/ruby/src/master -I/home/opc/ruby/src/master/prism -I/home/opc/ruby/src/master/enc/unicode/15.0.0 I, [2024-05-21T19:45:42.591227 #3381936] INFO -- : CPPFLAGS = I, [2024-05-21T19:45:42.591235 #3381936] INFO -- : DLDFLAGS = -Wl,--compress-debug-sections=zlib -fstack-protector-strong -pie I, [2024-05-21T19:45:42.591257 #3381936] INFO -- : SOLIBS = -lz -lrt -lrt -ldl -lcrypt -lm -lpthread I, [2024-05-21T19:45:42.592773 #3381936] INFO -- : LANG = en_US.UTF-8 I, [2024-05-21T19:45:42.592789 #3381936] INFO -- : LC_ALL = I, [2024-05-21T19:45:42.592798 #3381936] INFO -- : LC_CTYPE = I, [2024-05-21T19:45:42.592806 #3381936] INFO -- : MFLAGS = I, [2024-05-21T19:45:42.592813 #3381936] INFO -- : RUSTC = rustc I, [2024-05-21T19:45:42.592821 #3381936] INFO -- : YJIT_RUSTC_ARGS = --crate-name=yjit --crate-type=staticlib --edition=2021 -g -C lto=thin -C opt-level=3 -C overflow-checks=on '--out-dir=/home/opc/ruby/build/master/yjit/target/release/' /home/opc/ruby/src/master/yjit/src/lib.rs I, [2024-05-21T19:45:42.592834 #3381936] INFO -- : gcc (GCC) 8.5.0 20210514 (Red Hat 8.5.0-10.1.0.1) I, [2024-05-21T19:45:42.592842 #3381936] INFO -- : Copyright (C) 2018 Free Software Foundation, Inc. I, [2024-05-21T19:45:42.592850 #3381936] INFO -- : This is free software; see the source for copying conditions. There is NO I, [2024-05-21T19:45:42.592857 #3381936] INFO -- : warranty; not even for MERCHANTABILITY or FITNESS FOR A PARTICULAR PURPOSE. I, [2024-05-21T19:45:42.592865 #3381936] INFO -- : I, [2024-05-21T19:45:42.749142 #3381936] INFO -- : Checking leaked global symbols...none I, [2024-05-21T19:45:42.803000 #3381936] INFO -- : /home/opc/ruby/src/master/basictest/test.rb:assignment ....................................................................................................................................................................................................................................................................................................................................................................................OK 372 I, [2024-05-21T19:45:42.803076 #3381936] INFO -- : /home/opc/ruby/src/master/basictest/test.rb:condition ..OK 2 I, [2024-05-21T19:45:42.803103 #3381936] INFO -- : /home/opc/ruby/src/master/basictest/test.rb:if/unless ...OK 3 I, [2024-05-21T19:45:42.803152 #3381936] INFO -- : /home/opc/ruby/src/master/basictest/test.rb:case .....OK 5 I, [2024-05-21T19:45:42.803778 #3381936] INFO -- : /home/opc/ruby/src/master/basictest/test.rb:while/until ........OK 8 I, [2024-05-21T19:45:42.803906 #3381936] INFO -- : /home/opc/ruby/src/master/basictest/test.rb:exception ..........OK 10 I, [2024-05-21T19:45:42.804577 #3381936] INFO -- : /home/opc/ruby/src/master/basictest/test.rb:array .......................................OK 39 I, [2024-05-21T19:45:42.804858 #3381936] INFO -- : /home/opc/ruby/src/master/basictest/test.rb:hash ...........................OK 27 I, [2024-05-21T19:45:42.806632 #3381936] INFO -- : /home/opc/ruby/src/master/basictest/test.rb:iterator ...........................................................................................................OK 107 I, [2024-05-21T19:45:42.807419 #3381936] INFO -- : /home/opc/ruby/src/master/basictest/test.rb:float ................................................................................OK 80 I, [2024-05-21T19:45:42.811035 #3381936] INFO -- : /home/opc/ruby/src/master/basictest/test.rb:bignum ...............................OK 31 I, [2024-05-21T19:45:42.812909 #3381936] INFO -- : /home/opc/ruby/src/master/basictest/test.rb:string & char ..............................................................OK 62 I, [2024-05-21T19:45:42.812996 #3381936] INFO -- : /home/opc/ruby/src/master/basictest/test.rb:assignment ..........OK 10 I, [2024-05-21T19:45:42.813074 #3381936] INFO -- : /home/opc/ruby/src/master/basictest/test.rb:call ......OK 6 I, [2024-05-21T19:45:42.813409 #3381936] INFO -- : /home/opc/ruby/src/master/basictest/test.rb:proc .........OK 9 I, [2024-05-21T19:45:42.913683 #3381936] INFO -- : /home/opc/ruby/src/master/basictest/test.rb:signal ..OK 2 I, [2024-05-21T19:45:42.915263 #3381936] INFO -- : /home/opc/ruby/src/master/basictest/test.rb:eval ...........................OK 27 I, [2024-05-21T19:45:43.060775 #3381936] INFO -- : /home/opc/ruby/src/master/basictest/test.rb:system ........OK 8 I, [2024-05-21T19:45:43.060849 #3381936] INFO -- : /home/opc/ruby/src/master/basictest/test.rb:const .....OK 5 I, [2024-05-21T19:45:43.060966 #3381936] INFO -- : /home/opc/ruby/src/master/basictest/test.rb:clone .....OK 5 I, [2024-05-21T19:45:43.061197 #3381936] INFO -- : /home/opc/ruby/src/master/basictest/test.rb:marshal ....OK 4 I, [2024-05-21T19:45:43.061281 #3381936] INFO -- : /home/opc/ruby/src/master/basictest/test.rb:pack ....OK 4 I, [2024-05-21T19:45:43.061316 #3381936] INFO -- : /home/opc/ruby/src/master/basictest/test.rb:math ..OK 2 I, [2024-05-21T19:45:43.061413 #3381936] INFO -- : /home/opc/ruby/src/master/basictest/test.rb:struct ......OK 6 I, [2024-05-21T19:45:43.061596 #3381936] INFO -- : /home/opc/ruby/src/master/basictest/test.rb:variable ............OK 12 I, [2024-05-21T19:45:43.061627 #3381936] INFO -- : /home/opc/ruby/src/master/basictest/test.rb:trace ...OK 3 I, [2024-05-21T19:45:43.061764 #3381936] INFO -- : /home/opc/ruby/src/master/basictest/test.rb:defined? ............OK 12 I, [2024-05-21T19:45:43.061855 #3381936] INFO -- : /home/opc/ruby/src/master/basictest/test.rb:alias ......OK 6 I, [2024-05-21T19:45:43.062365 #3381936] INFO -- : /home/opc/ruby/src/master/basictest/test.rb:path .......................OK 23 I, [2024-05-21T19:45:43.131380 #3381936] INFO -- : /home/opc/ruby/src/master/basictest/test.rb:gc ....OK 4 I, [2024-05-21T19:45:43.133610 #3381936] INFO -- : I, [2024-05-21T19:45:43.133671 #3381936] INFO -- : test succeeded I, [2024-05-21T19:45:43.134217 #3381936] INFO -- : $$$[end] "make yes-test-basic TESTS='-j3'" exit with 0. I, [2024-05-21T19:45:43.134402 #3381936] INFO -- : $$$[beg] make yes-test-all TESTOPTS='--stderr-on-failure' TESTS='-j3' I, [2024-05-21T19:45:43.262023 #3381936] INFO -- : BASERUBY = /usr/local/bin/ruby --disable=gems I, [2024-05-21T19:45:43.262099 #3381936] INFO -- : CC = gcc I, [2024-05-21T19:45:43.262111 #3381936] INFO -- : LD = ld I, [2024-05-21T19:45:43.262119 #3381936] INFO -- : LDSHARED = gcc -shared I, [2024-05-21T19:45:43.262132 #3381936] INFO -- : CFLAGS = -O3 -fno-fast-math -ggdb3 -Wall -Wextra -Wdeprecated-declarations -Wdiv-by-zero -Wduplicated-cond -Wimplicit-function-declaration -Wimplicit-int -Wpointer-arith -Wwrite-strings -Wold-style-definition -Wimplicit-fallthrough=0 -Wmissing-noreturn -Wno-cast-function-type -Wno-constant-logical-operand -Wno-long-long -Wno-missing-field-initializers -Wno-overlength-strings -Wno-packed-bitfield-compat -Wno-parentheses-equality -Wno-self-assign -Wno-tautological-compare -Wno-unused-parameter -Wno-unused-value -Wsuggest-attribute=format -Wsuggest-attribute=noreturn -Wunused-variable -Wmisleading-indentation -Wundef I, [2024-05-21T19:45:43.262142 #3381936] INFO -- : XCFLAGS = -U_FORTIFY_SOURCE -D_FORTIFY_SOURCE=2 -fstack-protector-strong -msign-return-address=all -fno-strict-overflow -fvisibility=hidden -fexcess-precision=standard -DRUBY_EXPORT -fPIE -I. -I.ext/include/aarch64-linux -I/home/opc/ruby/src/master/include -I/home/opc/ruby/src/master -I/home/opc/ruby/src/master/prism -I/home/opc/ruby/src/master/enc/unicode/15.0.0 I, [2024-05-21T19:45:43.262151 #3381936] INFO -- : CPPFLAGS = I, [2024-05-21T19:45:43.262159 #3381936] INFO -- : DLDFLAGS = -Wl,--compress-debug-sections=zlib -fstack-protector-strong -pie I, [2024-05-21T19:45:43.262169 #3381936] INFO -- : SOLIBS = -lz -lrt -lrt -ldl -lcrypt -lm -lpthread I, [2024-05-21T19:45:43.262177 #3381936] INFO -- : LANG = en_US.UTF-8 I, [2024-05-21T19:45:43.262185 #3381936] INFO -- : LC_ALL = I, [2024-05-21T19:45:43.262193 #3381936] INFO -- : LC_CTYPE = I, [2024-05-21T19:45:43.262201 #3381936] INFO -- : MFLAGS = I, [2024-05-21T19:45:43.262209 #3381936] INFO -- : RUSTC = rustc I, [2024-05-21T19:45:43.262217 #3381936] INFO -- : YJIT_RUSTC_ARGS = --crate-name=yjit --crate-type=staticlib --edition=2021 -g -C lto=thin -C opt-level=3 -C overflow-checks=on '--out-dir=/home/opc/ruby/build/master/yjit/target/release/' /home/opc/ruby/src/master/yjit/src/lib.rs I, [2024-05-21T19:45:43.263004 #3381936] INFO -- : gcc (GCC) 8.5.0 20210514 (Red Hat 8.5.0-10.1.0.1) I, [2024-05-21T19:45:43.263043 #3381936] INFO -- : Copyright (C) 2018 Free Software Foundation, Inc. I, [2024-05-21T19:45:43.263053 #3381936] INFO -- : This is free software; see the source for copying conditions. There is NO I, [2024-05-21T19:45:43.263063 #3381936] INFO -- : warranty; not even for MERCHANTABILITY or FITNESS FOR A PARTICULAR PURPOSE. I, [2024-05-21T19:45:43.263071 #3381936] INFO -- : I, [2024-05-21T19:45:43.265001 #3381936] INFO -- : generating enc.mk I, [2024-05-21T19:45:43.502119 #3381936] INFO -- : generating encdb.h I, [2024-05-21T19:45:43.539609 #3381936] INFO -- : encdb.h unchanged I, [2024-05-21T19:45:43.540904 #3381936] INFO -- : making enc I, [2024-05-21T19:45:43.568449 #3381936] INFO -- : make[1]: Entering directory '/home/opc/ruby/build/master' I, [2024-05-21T19:45:43.568535 #3381936] INFO -- : make[1]: Nothing to be done for 'enc'. I, [2024-05-21T19:45:43.568547 #3381936] INFO -- : make[1]: Leaving directory '/home/opc/ruby/build/master' I, [2024-05-21T19:45:43.569420 #3381936] INFO -- : making srcs under enc I, [2024-05-21T19:45:43.611399 #3381936] INFO -- : make[1]: Entering directory '/home/opc/ruby/build/master' I, [2024-05-21T19:45:43.611478 #3381936] INFO -- : make[1]: Nothing to be done for 'srcs'. I, [2024-05-21T19:45:43.611500 #3381936] INFO -- : make[1]: Leaving directory '/home/opc/ruby/build/master' I, [2024-05-21T19:45:43.612633 #3381936] INFO -- : generating transdb.h I, [2024-05-21T19:45:43.758791 #3381936] INFO -- : transdb.h unchanged I, [2024-05-21T19:45:43.760168 #3381936] INFO -- : making trans I, [2024-05-21T19:45:43.808625 #3381936] INFO -- : make[1]: Entering directory '/home/opc/ruby/build/master' I, [2024-05-21T19:45:43.808718 #3381936] INFO -- : make[1]: Nothing to be done for 'trans'. I, [2024-05-21T19:45:43.808729 #3381936] INFO -- : make[1]: Leaving directory '/home/opc/ruby/build/master' I, [2024-05-21T19:45:43.809560 #3381936] INFO -- : making encs I, [2024-05-21T19:45:43.861889 #3381936] INFO -- : make[1]: Entering directory '/home/opc/ruby/build/master' I, [2024-05-21T19:45:43.861963 #3381936] INFO -- : make[1]: Nothing to be done for 'encs'. I, [2024-05-21T19:45:43.861974 #3381936] INFO -- : make[1]: Leaving directory '/home/opc/ruby/build/master' I, [2024-05-21T19:45:43.863924 #3381936] INFO -- : generating makefiles ext/configure-ext.mk I, [2024-05-21T19:45:43.903571 #3381936] INFO -- : ext/configure-ext.mk updated I, [2024-05-21T19:45:43.906744 #3381936] INFO -- : make[1]: Entering directory '/home/opc/ruby/build/master' I, [2024-05-21T19:45:46.084743 #3381936] INFO -- : make[1]: Leaving directory '/home/opc/ruby/build/master' I, [2024-05-21T19:45:46.085595 #3381936] INFO -- : generating makefile exts.mk I, [2024-05-21T19:45:46.148386 #3381936] INFO -- : exts.mk unchanged I, [2024-05-21T19:45:46.153501 #3381936] INFO -- : make[1]: Entering directory '/home/opc/ruby/build/master' I, [2024-05-21T19:45:46.453378 #3381936] INFO -- : make[2]: Entering directory '/home/opc/ruby/build/master/ext/coverage' I, [2024-05-21T19:45:46.458187 #3381936] INFO -- : make[2]: Leaving directory '/home/opc/ruby/build/master/ext/coverage' I, [2024-05-21T19:45:46.463717 #3381936] INFO -- : make[2]: Entering directory '/home/opc/ruby/build/master/ext/date' I, [2024-05-21T19:45:46.469099 #3381936] INFO -- : make[2]: Leaving directory '/home/opc/ruby/build/master/ext/date' I, [2024-05-21T19:45:46.472481 #3381936] INFO -- : make[2]: Entering directory '/home/opc/ruby/build/master/ext/digest' I, [2024-05-21T19:45:46.481527 #3381936] INFO -- : make[2]: Leaving directory '/home/opc/ruby/build/master/ext/digest' I, [2024-05-21T19:45:46.504330 #3381936] INFO -- : make[2]: Entering directory '/home/opc/ruby/build/master/ext/digest/sha2' I, [2024-05-21T19:45:46.509764 #3381936] INFO -- : make[2]: Leaving directory '/home/opc/ruby/build/master/ext/digest/sha2' I, [2024-05-21T19:45:46.528005 #3381936] INFO -- : make[2]: Entering directory '/home/opc/ruby/build/master/ext/fiddle' I, [2024-05-21T19:45:46.538421 #3381936] INFO -- : make[2]: Leaving directory '/home/opc/ruby/build/master/ext/fiddle' I, [2024-05-21T19:45:46.542846 #3381936] INFO -- : make[2]: Entering directory '/home/opc/ruby/build/master/ext/io/console' I, [2024-05-21T19:45:46.547296 #3381936] INFO -- : make[2]: Leaving directory '/home/opc/ruby/build/master/ext/io/console' I, [2024-05-21T19:45:46.558319 #3381936] INFO -- : make[2]: Entering directory '/home/opc/ruby/build/master/ext/json' I, [2024-05-21T19:45:46.567957 #3381936] INFO -- : make[2]: Leaving directory '/home/opc/ruby/build/master/ext/json' I, [2024-05-21T19:45:46.581317 #3381936] INFO -- : make[2]: Entering directory '/home/opc/ruby/build/master/ext/monitor' I, [2024-05-21T19:45:46.585773 #3381936] INFO -- : make[2]: Leaving directory '/home/opc/ruby/build/master/ext/monitor' I, [2024-05-21T19:45:46.592117 #3381936] INFO -- : make[2]: Entering directory '/home/opc/ruby/build/master/ext/objspace' I, [2024-05-21T19:45:46.598503 #3381936] INFO -- : make[2]: Leaving directory '/home/opc/ruby/build/master/ext/objspace' I, [2024-05-21T19:45:46.617527 #3381936] INFO -- : make[2]: Entering directory '/home/opc/ruby/build/master/ext/openssl' I, [2024-05-21T19:45:46.639298 #3381936] INFO -- : make[2]: Leaving directory '/home/opc/ruby/build/master/ext/openssl' I, [2024-05-21T19:45:46.643623 #3381936] INFO -- : make[2]: Entering directory '/home/opc/ruby/build/master/ext/pathname' I, [2024-05-21T19:45:46.647871 #3381936] INFO -- : make[2]: Leaving directory '/home/opc/ruby/build/master/ext/pathname' I, [2024-05-21T19:45:46.654156 #3381936] INFO -- : make[2]: Entering directory '/home/opc/ruby/build/master/ext/psych' I, [2024-05-21T19:45:46.675544 #3381936] INFO -- : make[2]: Leaving directory '/home/opc/ruby/build/master/ext/psych' I, [2024-05-21T19:45:46.680105 #3381936] INFO -- : make[2]: Entering directory '/home/opc/ruby/build/master/ext/pty' I, [2024-05-21T19:45:46.684575 #3381936] INFO -- : make[2]: Leaving directory '/home/opc/ruby/build/master/ext/pty' I, [2024-05-21T19:45:46.698057 #3381936] INFO -- : make[2]: Entering directory '/home/opc/ruby/build/master/ext/ripper' I, [2024-05-21T19:45:46.706064 #3381936] INFO -- : make[2]: Leaving directory '/home/opc/ruby/build/master/ext/ripper' I, [2024-05-21T19:45:46.708093 #3381936] INFO -- : make[2]: Entering directory '/home/opc/ruby/build/master/ext/rubyvm' I, [2024-05-21T19:45:46.711764 #3381936] INFO -- : make[2]: Leaving directory '/home/opc/ruby/build/master/ext/rubyvm' I, [2024-05-21T19:45:46.723819 #3381936] INFO -- : make[2]: Entering directory '/home/opc/ruby/build/master/ext/socket' I, [2024-05-21T19:45:46.734605 #3381936] INFO -- : make[2]: Leaving directory '/home/opc/ruby/build/master/ext/socket' I, [2024-05-21T19:45:46.750072 #3381936] INFO -- : make[2]: Entering directory '/home/opc/ruby/build/master/.bundle/gems/bigdecimal-3.1.7/ext/bigdecimal' I, [2024-05-21T19:45:46.781096 #3381936] INFO -- : make[2]: Leaving directory '/home/opc/ruby/build/master/.bundle/gems/bigdecimal-3.1.7/ext/bigdecimal' I, [2024-05-21T19:45:46.783929 #3381936] INFO -- : make[2]: Entering directory '/home/opc/ruby/build/master/.bundle/gems/bigdecimal-3.1.8/ext/bigdecimal' I, [2024-05-21T19:45:46.814245 #3381936] INFO -- : make[2]: Leaving directory '/home/opc/ruby/build/master/.bundle/gems/bigdecimal-3.1.8/ext/bigdecimal' I, [2024-05-21T19:45:46.816824 #3381936] INFO -- : make[2]: Entering directory '/home/opc/ruby/build/master/.bundle/gems/debug-1.9.2/ext/debug' I, [2024-05-21T19:45:46.847453 #3381936] INFO -- : make[2]: Leaving directory '/home/opc/ruby/build/master/.bundle/gems/debug-1.9.2/ext/debug' I, [2024-05-21T19:45:46.849937 #3381936] INFO -- : make[2]: Entering directory '/home/opc/ruby/build/master/.bundle/gems/nkf-0.2.0/ext/nkf' I, [2024-05-21T19:45:46.880261 #3381936] INFO -- : make[2]: Leaving directory '/home/opc/ruby/build/master/.bundle/gems/nkf-0.2.0/ext/nkf' I, [2024-05-21T19:45:46.882877 #3381936] INFO -- : make[2]: Entering directory '/home/opc/ruby/build/master/.bundle/gems/racc-1.7.3/ext/racc/cparse' I, [2024-05-21T19:45:46.913594 #3381936] INFO -- : make[2]: Leaving directory '/home/opc/ruby/build/master/.bundle/gems/racc-1.7.3/ext/racc/cparse' I, [2024-05-21T19:45:46.916151 #3381936] INFO -- : make[2]: Entering directory '/home/opc/ruby/build/master/.bundle/gems/racc-1.8.0/ext/racc/cparse' I, [2024-05-21T19:45:46.946983 #3381936] INFO -- : make[2]: Leaving directory '/home/opc/ruby/build/master/.bundle/gems/racc-1.8.0/ext/racc/cparse' I, [2024-05-21T19:45:46.949983 #3381936] INFO -- : make[2]: Entering directory '/home/opc/ruby/build/master/.bundle/gems/rbs-3.4.4/ext/rbs_extension' I, [2024-05-21T19:45:46.979986 #3381936] INFO -- : make[2]: Leaving directory '/home/opc/ruby/build/master/.bundle/gems/rbs-3.4.4/ext/rbs_extension' I, [2024-05-21T19:45:46.982510 #3381936] INFO -- : make[2]: Entering directory '/home/opc/ruby/build/master/.bundle/gems/syslog-0.1.2/ext/syslog' I, [2024-05-21T19:45:47.012678 #3381936] INFO -- : make[2]: Leaving directory '/home/opc/ruby/build/master/.bundle/gems/syslog-0.1.2/ext/syslog' I, [2024-05-21T19:45:47.050803 #3381936] INFO -- : make[2]: Entering directory '/home/opc/ruby/build/master' I, [2024-05-21T19:45:47.134168 #3381936] INFO -- : make[2]: 'ruby' is up to date. I, [2024-05-21T19:45:47.134255 #3381936] INFO -- : make[2]: Leaving directory '/home/opc/ruby/build/master' I, [2024-05-21T19:45:47.134359 #3381936] INFO -- : make[1]: Leaving directory '/home/opc/ruby/build/master' I, [2024-05-21T19:45:47.138776 #3381936] INFO -- : make[1]: Entering directory '/home/opc/ruby/build/master' I, [2024-05-21T19:45:47.138819 #3381936] INFO -- : make[1]: Nothing to be done for 'note'. I, [2024-05-21T19:45:47.138829 #3381936] INFO -- : make[1]: Leaving directory '/home/opc/ruby/build/master' I, [2024-05-21T19:45:47.252697 #3381936] INFO -- : Run options: I, [2024-05-21T19:45:47.252787 #3381936] INFO -- : --seed=6376 I, [2024-05-21T19:45:47.252807 #3381936] INFO -- : "--ruby=./miniruby -I/home/opc/ruby/src/master/lib -I. -I.ext/common /home/opc/ruby/src/master/tool/runruby.rb --extout=.ext -- --disable-gems" I, [2024-05-21T19:45:47.252825 #3381936] INFO -- : --excludes-dir=/home/opc/ruby/src/master/test/.excludes I, [2024-05-21T19:45:47.252840 #3381936] INFO -- : --name=!/memory_leak/ I, [2024-05-21T19:45:47.252856 #3381936] INFO -- : --stderr-on-failure I, [2024-05-21T19:45:47.252871 #3381936] INFO -- : -j3 I, [2024-05-21T19:45:47.252887 #3381936] INFO -- : I, [2024-05-21T19:45:47.252901 #3381936] INFO -- : # Running tests: I, [2024-05-21T19:45:47.252910 #3381936] INFO -- : I, [2024-05-21T19:45:47.388559 #3381936] INFO -- : [ 1/885] 3422788=test_arity I, [2024-05-21T19:45:47.391945 #3381936] INFO -- : [ 2/885] 3422789=test_thread I, [2024-05-21T19:45:47.394002 #3381936] INFO -- : [ 3/885] 3422789=test_pkey_ec I, [2024-05-21T19:45:47.394981 #3381936] INFO -- : [ 4/885] 3422787=test_svcb_https I, [2024-05-21T19:45:47.426537 #3381936] INFO -- : [ 5/885] 3422788=test_buffering I, [2024-05-21T19:45:47.436692 #3381936] INFO -- : [ 6/885] 3422787=test_key_event_record I, [2024-05-21T19:45:47.443187 #3381936] INFO -- : [ 7/885] 3422788=test_mdns I, [2024-05-21T19:45:47.454486 #3381936] INFO -- : [ 8/885] 3422789=test_open3 I, [2024-05-21T19:45:47.480768 #3381936] INFO -- : [ 9/885] 3422788=test_date_parse I, [2024-05-21T19:45:47.483414 #3381936] INFO -- : [ 10/885] 3422787=test_ractor I, [2024-05-21T19:45:47.493527 #3381936] INFO -- : [ 11/885] 3422787=test_gem_resolver_api_specification I, [2024-05-21T19:45:47.652055 #3381936] INFO -- : [ 12/885] 3422788=test_rdoc_rubygems_hook I, [2024-05-21T19:45:47.737106 #3381936] INFO -- : [ 13/885] 3422787=test_webauthn_listener I, [2024-05-21T19:45:47.911628 #3381936] INFO -- : [ 14/885] 3422788=test_rational I, [2024-05-21T19:45:47.937126 #3381936] INFO -- : [ 15/885] 3422788=test_case_mapping I, [2024-05-21T19:45:47.948225 #3381936] INFO -- : [ 16/885] 3422788=test_gem_ext_cargo_builder_unit I, [2024-05-21T19:45:48.007758 #3381936] INFO -- : [ 17/885] 3422787=test_grapheme_breaks I, [2024-05-21T19:45:48.028736 #3381936] INFO -- : [ 18/885] 3422787=test_hash_create I, [2024-05-21T19:45:48.039161 #3381936] INFO -- : [ 19/885] 3422787=test_enumerable I, [2024-05-21T19:45:48.071322 #3381936] INFO -- : [ 20/885] 3422787=test_rdoc_method_attr I, [2024-05-21T19:45:48.134373 #3381936] INFO -- : [ 21/885] 3422788=test_set I, [2024-05-21T19:45:48.186516 #3381936] INFO -- : [ 22/885] 3422788=test_tree_spell_checker I, [2024-05-21T19:45:48.236473 #3381936] INFO -- : [ 23/885] 3422788=static_literals_test I, [2024-05-21T19:45:48.289830 #3381936] INFO -- : [ 24/885] 3422788=test_backtrace I, [2024-05-21T19:45:48.295444 #3381936] INFO -- : [ 25/885] 3422788=test_gbk I, [2024-05-21T19:45:48.298463 #3381936] INFO -- : [ 26/885] 3422788=test_gem_commands_dependency_command I, [2024-05-21T19:45:48.346022 #3381936] INFO -- : [ 27/885] 3422787=test_yamldbm I, [2024-05-21T19:45:48.355532 #3381936] INFO -- : [ 28/885] 3422787=test_gem_spec_fetcher I, [2024-05-21T19:45:48.409500 #3381936] INFO -- : [ 29/885] 3422788=test_unicode_escape I, [2024-05-21T19:45:48.487395 #3381936] INFO -- : [ 30/885] 3422788=test_default_gems I, [2024-05-21T19:45:48.542021 #3381936] INFO -- : [ 31/885] 3422787=test_switch_hitter I, [2024-05-21T19:45:48.545055 #3381936] INFO -- : [ 32/885] 3422788=test_clone I, [2024-05-21T19:45:48.574835 #3381936] INFO -- : [ 33/885] 3422787=test_enc_raise I, [2024-05-21T19:45:48.585312 #3381936] INFO -- : [ 34/885] 3422787=test_gem_uri_formatter I, [2024-05-21T19:45:48.602807 #3381936] INFO -- : [ 35/885] 3422787=test_prettyprint I, [2024-05-21T19:45:48.619797 #3381936] INFO -- : [ 36/885] 3422787=test_ole_methods I, [2024-05-21T19:45:48.637300 #3381936] INFO -- : [ 37/885] 3422787=test_cgi_util I, [2024-05-21T19:45:48.755188 #3381936] INFO -- : [ 38/885] 3422788=test_rdoc_i18n_locale I, [2024-05-21T19:45:48.763699 #3381936] INFO -- : [ 39/885] 3422788=test_gc_compact I, [2024-05-21T19:45:48.841324 #3381936] INFO -- : [ 40/885] 3422787=test_dryrun I, [2024-05-21T19:45:48.860851 #3381936] INFO -- : [ 41/885] 3422787=test_queue I, [2024-05-21T19:45:48.897658 #3381936] INFO -- : [ 42/885] 3422787=test_gem_resolver_lock_specification I, [2024-05-21T19:45:48.989591 #3381936] INFO -- : [ 43/885] 3422787=test_boolean I, [2024-05-21T19:45:49.077212 #3381936] INFO -- : [ 44/885] 3422787=regexp_test I, [2024-05-21T19:45:49.118604 #3381936] INFO -- : [ 45/885] 3422787=test_yield I, [2024-05-21T19:45:50.312068 #3381936] INFO -- : [ 46/885] 3422789=test_remote_fetch_error I, [2024-05-21T19:45:50.458059 #3381936] INFO -- : [ 47/885] 3422789=test_show_source I, [2024-05-21T19:45:50.461792 #3381936] INFO -- : [ 48/885] 3422789=test_shift_jis I, [2024-05-21T19:45:50.545333 #3381936] INFO -- : [ 49/885] 3422789=test_rdoc_store I, [2024-05-21T19:45:51.275987 #3381936] INFO -- : [ 50/885] 3422789=test_files_sample I, [2024-05-21T19:45:51.337337 #3381936] INFO -- : [ 51/885] 3422789=test_rdoc_stats I, [2024-05-21T19:45:51.343861 #3381936] INFO -- : [ 52/885] 3422788=test_data_error I, [2024-05-21T19:45:51.411324 #3381936] INFO -- : [ 53/885] 3422789=test_rubyoptions I, [2024-05-21T19:45:51.421961 #3381936] INFO -- : [ 54/885] 3422788=test_optimization I, [2024-05-21T19:45:51.817056 #3381936] INFO -- : [ 55/885] 3422787=test_force_exit I, [2024-05-21T19:45:51.857624 #3381936] INFO -- : [ 56/885] 3422787=test_gem_commands_open_command I, [2024-05-21T19:45:51.946668 #3381936] INFO -- : [ 57/885] 3422787=test_verbose I, [2024-05-21T19:45:51.982954 #3381936] INFO -- : [ 58/885] 3422787=test_emoji_breaks I, [2024-05-21T19:45:51.985358 #3381936] INFO -- : [ 59/885] 3422787=test_normalize I, [2024-05-21T19:45:51.998295 #3381936] INFO -- : [ 60/885] 3422787=test_gem_update_suggestion I, [2024-05-21T19:45:52.104368 #3381936] INFO -- : [ 61/885] 3422787=test_assignment I, [2024-05-21T19:45:53.348662 #3381936] INFO -- : [ 62/885] 3422787=test_gem_command I, [2024-05-21T19:45:53.450005 #3381936] INFO -- : [ 63/885] 3422787=test_asn1 I, [2024-05-21T19:45:53.484258 #3381936] INFO -- : [ 64/885] 3422787=test_undef I, [2024-05-21T19:45:53.496669 #3381936] INFO -- : [ 65/885] 3422787=test_gem_resolver_lock_set I, [2024-05-21T19:45:53.516942 #3381936] INFO -- : [ 66/885] 3422787=test_random I, [2024-05-21T19:45:53.520305 #3381936] INFO -- : [ 67/885] 3422787=test_rdoc_generator_darkfish I, [2024-05-21T19:45:53.892129 #3381936] INFO -- : [ 68/885] 3422787=test_gem_impossible_dependencies_error I, [2024-05-21T19:45:53.901220 #3381936] INFO -- : [ 69/885] 3422787=test_pp I, [2024-05-21T19:45:53.942969 #3381936] INFO -- : Leaked file descriptor: PPTestModule::PPFileStatTest#test_nothing_raised: 8 # I, [2024-05-21T19:45:53.974890 #3381936] INFO -- : COMMAND PID USER FD TYPE DEVICE SIZE/OFF NODE NAME I, [2024-05-21T19:45:53.974963 #3381936] INFO -- : ruby 3422787 opc 8r REG 252,0 9253600 13705411 /var/lib/sss/mc/passwd I, [2024-05-21T19:45:54.015630 #3381936] INFO -- : [ 70/885] 3422787=memsize_test I, [2024-05-21T19:45:54.022392 #3381936] INFO -- : [ 71/885] 3422787=test_gem_resolver_requirement_list I, [2024-05-21T19:45:54.030001 #3381936] INFO -- : [ 72/885] 3422787=test_noarg I, [2024-05-21T19:45:54.213306 #3381936] INFO -- : [ 73/885] 3422787=test_exception I, [2024-05-21T19:45:54.252570 #3381936] INFO -- : [ 74/885] 3422787=test_raise_exception I, [2024-05-21T19:45:54.864006 #3381936] INFO -- : [ 75/885] 3422787=test_arith_seq_beg_len_step I, [2024-05-21T19:45:54.880097 #3381936] INFO -- : [ 76/885] 3422787=test_variable I, [2024-05-21T19:45:54.970404 #3381936] INFO -- : [ 77/885] 3422787=test_hash I, [2024-05-21T19:45:55.009765 #3381936] INFO -- : [ 78/885] 3422787=test_rdoc_tom_doc I, [2024-05-21T19:45:55.027933 #3381936] INFO -- : [ 79/885] 3422787=test_optarg I, [2024-05-21T19:45:55.105332 #3381936] INFO -- : [ 80/885] 3422787=test_gem_commands_pristine_command I, [2024-05-21T19:45:56.451062 #3381936] INFO -- : Leaked file descriptor: TestRubyOptions#test_script_from_stdin: 10 # I, [2024-05-21T19:45:56.462981 #3381936] INFO -- : [ 81/885] 3422787=test_basicinstructions I, [2024-05-21T19:45:56.480368 #3381936] INFO -- : COMMAND PID USER FD TYPE DEVICE SIZE/OFF NODE NAME I, [2024-05-21T19:45:56.480442 #3381936] INFO -- : ruby 3422789 opc 10r REG 252,0 6940392 13705429 /var/lib/sss/mc/group I, [2024-05-21T19:45:56.522788 #3381936] INFO -- : [ 82/885] 3422787=test_gem_resolver_git_specification I, [2024-05-21T19:45:56.903209 #3381936] INFO -- : [ 83/885] 3422787=test_utf32 I, [2024-05-21T19:45:56.917250 #3381936] INFO -- : [ 84/885] 3422787=test_gem_security I, [2024-05-21T19:45:57.598329 #3381936] INFO -- : [ 85/885] 3422789=test_key_actor_emacs I, [2024-05-21T19:45:57.761602 #3381936] INFO -- : [ 86/885] 3422789=test_date_ractor I, [2024-05-21T19:45:57.935684 #3381936] INFO -- : [ 87/885] 3422789=test_erb I, [2024-05-21T19:45:57.976408 #3381936] INFO -- : [ 88/885] 3422789=test_rendering I, [2024-05-21T19:45:58.014403 #3381936] INFO -- : [ 89/885] 3422789=test_kernel I, [2024-05-21T19:45:58.040607 #3381936] INFO -- : [ 90/885] 3422788=pattern_test I, [2024-05-21T19:45:58.060792 #3381936] INFO -- : [ 91/885] 3422788=test_dot_dot I, [2024-05-21T19:45:58.076141 #3381936] INFO -- : [ 92/885] 3422788=test_gem_rdoc I, [2024-05-21T19:45:58.219732 #3381936] INFO -- : [ 93/885] 3422788=test_string I, [2024-05-21T19:45:58.231732 #3381936] INFO -- : [ 94/885] 3422788=test_iterator I, [2024-05-21T19:45:58.307275 #3381936] INFO -- : [ 95/885] 3422788=test_gem_commands_install_command I, [2024-05-21T19:45:58.545904 #3381936] INFO -- : [ 96/885] 3422789=test_storage I, [2024-05-21T19:45:58.572291 #3381936] INFO -- : [ 97/885] 3422789=test_method_name_check I, [2024-05-21T19:45:58.583670 #3381936] INFO -- : [ 98/885] 3422789=test_err_in_callback I, [2024-05-21T19:45:58.596206 #3381936] INFO -- : [ 99/885] 3422789=test_merge_keys I, [2024-05-21T19:45:58.604854 #3381936] INFO -- : [100/885] 3422789=test_did_you_mean I, [2024-05-21T19:45:58.740692 #3381936] INFO -- : [101/885] 3422789=test_shapes I, [2024-05-21T19:45:58.745414 #3381936] INFO -- : [102/885] 3422789=test_cesu8 I, [2024-05-21T19:45:58.763131 #3381936] INFO -- : [103/885] 3422789=test_rdoc_extend I, [2024-05-21T19:45:58.776386 #3381936] INFO -- : [104/885] 3422789=test_array_create I, [2024-05-21T19:45:58.784432 #3381936] INFO -- : [105/885] 3422789=test_dir_m17n I, [2024-05-21T19:45:59.971285 #3381936] INFO -- : [106/885] 3422789=test_memory_view I, [2024-05-21T19:46:00.124212 #3381936] INFO -- : [107/885] 3422789=test_threadgroup I, [2024-05-21T19:46:00.175654 #3381936] INFO -- : [108/885] 3422788=test_complex I, [2024-05-21T19:46:00.253798 #3381936] INFO -- : [109/885] 3422788=test_fd_setsize I, [2024-05-21T19:46:00.261242 #3381936] INFO -- : [110/885] 3422788=test_forwardable I, [2024-05-21T19:46:00.280383 #3381936] INFO -- : [111/885] 3422788=test_process I, [2024-05-21T19:46:00.295108 #3381936] INFO -- : [112/885] 3422788=!Nothing_to_test I, [2024-05-21T19:46:00.304738 #3381936] INFO -- : [113/885] 3422788=test_sprintf I, [2024-05-21T19:46:00.552827 #3381936] INFO -- : [114/885] 3422788=test_exit I, [2024-05-21T19:46:00.669520 #3381936] INFO -- : [115/885] 3422788=test_class I, [2024-05-21T19:46:01.169568 #3381936] INFO -- : [116/885] 3422789=index_write_test I, [2024-05-21T19:46:01.191777 #3381936] INFO -- : [117/885] 3422789=test_rdoc_parser_rd I, [2024-05-21T19:46:01.210365 #3381936] INFO -- : [118/885] 3422789=test_const I, [2024-05-21T19:46:01.213835 #3381936] INFO -- : [119/885] 3422789=test_recorder I, [2024-05-21T19:46:01.221897 #3381936] INFO -- : [120/885] 3422789=test_yaml_special_cases I, [2024-05-21T19:46:01.256534 #3381936] INFO -- : [121/885] 3422789=test_gem_commands_sources_command I, [2024-05-21T19:46:01.450793 #3381936] INFO -- : [122/885] 3422789=test_name_error I, [2024-05-21T19:46:01.548149 #3381936] INFO -- : [123/885] 3422789=json_addition_test I, [2024-05-21T19:46:01.558383 #3381936] INFO -- : [124/885] 3422789=test_gem_source_list I, [2024-05-21T19:46:01.619591 #3381936] INFO -- : [125/885] 3422789=test_iso_8859 I, [2024-05-21T19:46:01.678669 #3381936] INFO -- : [126/885] 3422789=ripper_test I, [2024-05-21T19:46:02.240768 #3381936] INFO -- : [127/885] 3422789=test_libs I, [2024-05-21T19:46:02.251710 #3381936] INFO -- : [128/885] 3422789=test_math I, [2024-05-21T19:46:02.259238 #3381936] INFO -- : [129/885] 3422789=test_gc I, [2024-05-21T19:46:02.268991 #3381936] INFO -- : [130/885] 3422789=comments_test I, [2024-05-21T19:46:02.274629 #3381936] INFO -- : [131/885] 3422789=test_qsort I, [2024-05-21T19:46:02.286850 #3381936] INFO -- : [132/885] 3422789=test_safe_load I, [2024-05-21T19:46:02.299537 #3381936] INFO -- : [133/885] 3422789=test_gem_command_manager I, [2024-05-21T19:46:02.500731 #3381936] INFO -- : [134/885] 3422789=test_rdoc_context I, [2024-05-21T19:46:03.191689 #3381936] INFO -- : [135/885] 3422789=test_array I, [2024-05-21T19:46:03.219205 #3381936] INFO -- : [136/885] 3422789=test_case I, [2024-05-21T19:46:03.236951 #3381936] INFO -- : [137/885] 3422789=test_open-uri I, [2024-05-21T19:46:03.653312 #3381936] INFO -- : [138/885] 3422789=test_enc_associate I, [2024-05-21T19:46:03.808118 #3381936] INFO -- : [139/885] 3422788=test_enumerator I, [2024-05-21T19:46:04.076033 #3381936] INFO -- : [140/885] 3422789=test_date_time I, [2024-05-21T19:46:04.083805 #3381936] INFO -- : [141/885] 3422789=test_nil2vtempty I, [2024-05-21T19:46:04.098258 #3381936] INFO -- : [142/885] 3422789=test_rdoc_generator_json_index I, [2024-05-21T19:46:04.125503 #3381936] INFO -- : [143/885] 3422789=test_cgi_tag_helper I, [2024-05-21T19:46:04.149761 #3381936] INFO -- : [144/885] 3422787=test_pack I, [2024-05-21T19:46:04.161425 #3381936] INFO -- : [145/885] 3422789=test_pinned I, [2024-05-21T19:46:04.178380 #3381936] INFO -- : [146/885] 3422787=test_framework I, [2024-05-21T19:46:04.184909 #3381936] INFO -- : [147/885] 3422787=test_weakmap I, [2024-05-21T19:46:04.214609 #3381936] INFO -- : [148/885] 3422789=test_coderange I, [2024-05-21T19:46:04.222527 #3381936] INFO -- : [149/885] 3422789=test_ansi_with_terminfo I, [2024-05-21T19:46:04.232947 #3381936] INFO -- : [150/885] 3422789=test_inadvertent_creation I, [2024-05-21T19:46:04.331894 #3381936] INFO -- : [151/885] 3422789=test_econv I, [2024-05-21T19:46:05.240035 #3381936] INFO -- : [152/885] 3422789=test_gem_install_update_options I, [2024-05-21T19:46:05.375603 #3381936] INFO -- : [153/885] 3422789=test_face I, [2024-05-21T19:46:05.404305 #3381936] INFO -- : [154/885] 3422789=test_gem_request_set_lockfile_parser I, [2024-05-21T19:46:06.630005 #3381936] INFO -- : [155/885] 3422789=test_sizeof I, [2024-05-21T19:46:08.100735 #3381936] INFO -- : [156/885] 3422789=test_date_attr I, [2024-05-21T19:46:08.168262 #3381936] INFO -- : [157/885] 3422789=test_stringchar I, [2024-05-21T19:46:08.179405 #3381936] INFO -- : [158/885] 3422789=warnings_test I, [2024-05-21T19:46:08.194572 #3381936] INFO -- : [159/885] 3422789=test_emoji I, [2024-05-21T19:46:08.294204 #3381936] INFO -- : [160/885] 3422789=test_sorted_set I, [2024-05-21T19:46:08.434942 #3381936] INFO -- : [161/885] 3422789=test_windows_1252 I, [2024-05-21T19:46:08.634340 #3381936] INFO -- : [162/885] 3422789=test_stack I, [2024-05-21T19:46:08.689245 #3381936] INFO -- : [163/885] 3422787=test_jaro_winkler I, [2024-05-21T19:46:08.696621 #3381936] INFO -- : [164/885] 3422787=test_cp949 I, [2024-05-21T19:46:08.705786 #3381936] INFO -- : [165/885] 3422787=test_gem_resolver_vendor_set I, [2024-05-21T19:46:08.725863 #3381936] INFO -- : [166/885] 3422787=test_condition I, [2024-05-21T19:46:08.735176 #3381936] INFO -- : [167/885] 3422787=test_gem_dependency_resolution_error I, [2024-05-21T19:46:08.757543 #3381936] INFO -- : [168/885] 3422787=test_fileutils I, [2024-05-21T19:46:09.337367 #3381936] INFO -- : [169/885] 3422789=test_sleep I, [2024-05-21T19:46:09.445557 #3381936] INFO -- : [170/885] 3422787=test_mixed_unicode_escapes I, [2024-05-21T19:46:09.453771 #3381936] INFO -- : [171/885] 3422787=test_win32ole_variable I, [2024-05-21T19:46:09.455204 #3381936] INFO -- : [172/885] 3422787=test_method_cache I, [2024-05-21T19:46:09.470112 #3381936] INFO -- : [173/885] 3422787=test_rdoc_cross_reference I, [2024-05-21T19:46:09.845297 #3381936] INFO -- : [174/885] 3422787=test_parse I, [2024-05-21T19:46:10.308640 #3381936] INFO -- : [175/885] 3422787=test_rdoc_class_module I, [2024-05-21T19:46:10.786446 #3381936] INFO -- : [176/885] 3422787=test_flush I, [2024-05-21T19:46:10.796655 #3381936] INFO -- : [177/885] 3422787=test_pkey_rsa I, [2024-05-21T19:46:11.062335 #3381936] INFO -- : [178/885] 3422787=test_system I, [2024-05-21T19:46:11.387010 #3381936] INFO -- : [179/885] 3422789=test_numhash I, [2024-05-21T19:46:11.411985 #3381936] INFO -- : [180/885] 3422789=test_gem_specification I, [2024-05-21T19:46:11.900322 #3381936] INFO -- : [181/885] 3422787=test_pkcs12 I, [2024-05-21T19:46:12.591276 #3381936] INFO -- : [182/885] 3422787=test_json_tree I, [2024-05-21T19:46:12.598357 #3381936] INFO -- : [183/885] 3422787=test_koi8 I, [2024-05-21T19:46:12.611539 #3381936] INFO -- : [184/885] 3422787=test_gem_remote_fetcher I, [2024-05-21T19:46:14.028203 #3381936] INFO -- : [185/885] 3422789=test_parser_events I, [2024-05-21T19:46:14.100764 #3381936] INFO -- : [186/885] 3422789=test_filter I, [2024-05-21T19:46:14.123464 #3381936] INFO -- : [187/885] 3422789=test_gem_dependency I, [2024-05-21T19:46:14.279746 #3381936] INFO -- : [188/885] 3422789=test_yjit I, [2024-05-21T19:46:14.286997 #3381936] INFO -- : [189/885] 3422789=test_cclass I, [2024-05-21T19:46:14.353342 #3381936] INFO -- : [190/885] 3422789=test_gem_uninstaller I, [2024-05-21T19:46:14.717784 #3381936] INFO -- : [191/885] 3422787=test_method I, [2024-05-21T19:46:15.693253 #3381936] INFO -- : [192/885] 3422789=test_m17n I, [2024-05-21T19:46:15.766531 #3381936] INFO -- : [193/885] 3422789=test_argf I, [2024-05-21T19:46:15.831728 #3381936] INFO -- : [194/885] 3422788=test_yaml I, [2024-05-21T19:46:15.901580 #3381936] INFO -- : [195/885] 3422788=test_x509name I, [2024-05-21T19:46:15.918204 #3381936] INFO -- : [196/885] 3422788=test_rdoc_markup_to_rdoc I, [2024-05-21T19:46:15.968701 #3381936] INFO -- : [197/885] 3422788=attribute_write_test I, [2024-05-21T19:46:15.982260 #3381936] INFO -- : [198/885] 3422788=test_utf16 I, [2024-05-21T19:46:16.057642 #3381936] INFO -- : [199/885] 3422788=test_http I, [2024-05-21T19:46:19.455830 #3381936] INFO -- : [200/885] 3422789=test_set I, [2024-05-21T19:46:19.467463 #3381936] INFO -- : [201/885] 3422789=test_ractor I, [2024-05-21T19:46:19.467924 #3381936] INFO -- : [202/885] 3422789=test_case I, [2024-05-21T19:46:19.477123 #3381936] INFO -- : [203/885] 3422789=test_severity I, [2024-05-21T19:46:19.484095 #3381936] INFO -- : [204/885] 3422789=test_str2big I, [2024-05-21T19:46:19.496060 #3381936] INFO -- : [205/885] 3422789=test_gem_package_tar_writer I, [2024-05-21T19:46:19.621382 #3381936] INFO -- : [206/885] 3422789=test_rdoc_task I, [2024-05-21T19:46:19.654697 #3381936] INFO -- : [207/885] 3422789=test_settracefunc I, [2024-05-21T19:46:20.411225 #3381936] INFO -- : [208/885] 3422787=test_gem_text I, [2024-05-21T19:46:20.461334 #3381936] INFO -- : [209/885] 3422789=test_tracepoint I, [2024-05-21T19:46:20.520714 #3381936] INFO -- : [210/885] 3422787=test_backtrace I, [2024-05-21T19:46:20.804084 #3381936] INFO -- : [211/885] 3422789=desugar_compiler_test I, [2024-05-21T19:46:20.827705 #3381936] INFO -- : [212/885] 3422789=test_gem_source_local I, [2024-05-21T19:46:21.048390 #3381936] INFO -- : [213/885] 3422789=test_win32ole I, [2024-05-21T19:46:21.054203 #3381936] INFO -- : [214/885] 3422789=test_internal_ivar I, [2024-05-21T19:46:21.062762 #3381936] INFO -- : [215/885] 3422789=test_rendering I, [2024-05-21T19:46:21.077663 #3381936] INFO -- : [216/885] 3422789=test_gem_gemcutter_utilities I, [2024-05-21T19:46:21.497318 #3381936] INFO -- : [217/885] 3422789=test_method_cache I, [2024-05-21T19:46:21.506170 #3381936] INFO -- : [218/885] 3422789=test_too_many_dummy_encodings I, [2024-05-21T19:46:21.560031 #3381936] INFO -- : [219/885] 3422789=test_sprintf_comb I, [2024-05-21T19:46:21.734722 #3381936] INFO -- : [220/885] 3422789=test_gem_commands_push_command I, [2024-05-21T19:46:21.766076 #3381936] INFO -- : [221/885] 3422787=locals_test I, [2024-05-21T19:46:22.145597 #3381936] INFO -- : [222/885] 3422787=test_gem_commands_which_command I, [2024-05-21T19:46:22.192526 #3381936] INFO -- : [223/885] 3422787=test_gem_request I, [2024-05-21T19:46:22.292158 #3381936] INFO -- : [224/885] 3422789=test_gem_package_old I, [2024-05-21T19:46:22.351116 #3381936] INFO -- : [225/885] 3422789=encoding_test I, [2024-05-21T19:46:22.395181 #3381936] INFO -- : [226/885] 3422787=test_scan_args I, [2024-05-21T19:46:22.411685 #3381936] INFO -- : [227/885] 3422787=test_gem_commands_specification_command I, [2024-05-21T19:46:22.418228 #3381936] INFO -- : [228/885] 3422789=test_http I, [2024-05-21T19:46:22.425432 #3381936] INFO -- : [229/885] 3422789=parser_test I, [2024-05-21T19:46:22.427000 #3381936] INFO -- : [230/885] 3422789=test_hash I, [2024-05-21T19:46:22.544438 #3381936] INFO -- : [231/885] 3422787=test_pty I, [2024-05-21T19:46:23.015786 #3381936] INFO -- : [232/885] 3422787=test_gem_dependency_installer I, [2024-05-21T19:46:24.574620 #3381936] INFO -- : [233/885] 3422788=test_webauthn_poller I, [2024-05-21T19:46:24.736771 #3381936] INFO -- : [234/885] 3422788=test_rdoc_markup_verbatim I, [2024-05-21T19:46:24.741052 #3381936] INFO -- : [235/885] 3422788=test_date_conv I, [2024-05-21T19:46:24.748892 #3381936] INFO -- : [236/885] 3422788=test_serialize_subclasses I, [2024-05-21T19:46:24.758513 #3381936] INFO -- : [237/885] 3422788=test_gem_resolver_index_specification I, [2024-05-21T19:46:24.809727 #3381936] INFO -- : [238/885] 3422788=test_frozen I, [2024-05-21T19:46:24.832909 #3381936] INFO -- : [239/885] 3422788=test_egrep_cpp I, [2024-05-21T19:46:24.959318 #3381936] INFO -- : [240/885] 3422788=test_erb_m17n I, [2024-05-21T19:46:24.964484 #3381936] INFO -- : [241/885] 3422788=test_rdoc_generator_pot_po_entry I, [2024-05-21T19:46:24.974287 #3381936] INFO -- : [242/885] 3422788=test_timeout I, [2024-05-21T19:46:24.991556 #3381936] INFO -- : [243/885] 3422788=test_pathname I, [2024-05-21T19:46:25.221247 #3381936] INFO -- : [244/885] 3422788=test_fnmatch I, [2024-05-21T19:46:25.268702 #3381936] INFO -- : [245/885] 3422788=test_store I, [2024-05-21T19:46:25.311563 #3381936] INFO -- : [246/885] 3422787=test_rdoc_markup_pre_process I, [2024-05-21T19:46:25.466426 #3381936] INFO -- : [247/885] 3422787=test_tempfile I, [2024-05-21T19:46:25.578141 #3381936] INFO -- : [248/885] 3422788=test_http_request I, [2024-05-21T19:46:25.604774 #3381936] INFO -- : [249/885] 3422788=test_coverage I, [2024-05-21T19:46:25.691915 #3381936] INFO -- : [250/885] 3422787=test_tree_builder I, [2024-05-21T19:46:25.700995 #3381936] INFO -- : [251/885] 3422787=test_protect I, [2024-05-21T19:46:25.705094 #3381936] INFO -- : [252/885] 3422787=test_date I, [2024-05-21T19:46:25.713380 #3381936] INFO -- : [253/885] 3422787=test_big5 I, [2024-05-21T19:46:25.714681 #3381936] INFO -- : [254/885] 3422787=test_gem_commands_update_command I, [2024-05-21T19:46:26.301826 #3381936] INFO -- : [255/885] 3422788=test_complexrational I, [2024-05-21T19:46:26.303852 #3381936] INFO -- : [256/885] 3422788=test_raise I, [2024-05-21T19:46:26.304659 #3381936] INFO -- : [257/885] 3422788=version_test I, [2024-05-21T19:46:26.316415 #3381936] INFO -- : [258/885] 3422788=test_string I, [2024-05-21T19:46:26.342105 #3381936] INFO -- : [259/885] 3422788=json_common_interface_test I, [2024-05-21T19:46:26.343422 #3381936] INFO -- : [260/885] 3422788=test_rdoc_any_method I, [2024-05-21T19:46:26.368746 #3381936] INFO -- : [261/885] 3422789=test_error_highlight I, [2024-05-21T19:46:26.750265 #3381936] INFO -- : [262/885] 3422788=test_function_entry I, [2024-05-21T19:46:26.755558 #3381936] INFO -- : [263/885] 3422788=test_enumerator_kw I, [2024-05-21T19:46:26.759723 #3381936] INFO -- : [264/885] 3422788=test_marshalable I, [2024-05-21T19:46:26.763715 #3381936] INFO -- : [265/885] 3422788=test_line_editor I, [2024-05-21T19:46:26.815672 #3381936] INFO -- : [266/885] 3422788=reflection_test I, [2024-05-21T19:46:26.820031 #3381936] INFO -- : [267/885] 3422788=test_files_lib I, [2024-05-21T19:46:26.977510 #3381936] INFO -- : [268/885] 3422789=test_string_memory I, [2024-05-21T19:46:27.103508 #3381936] INFO -- : [269/885] 3422789=test_help I, [2024-05-21T19:46:27.113226 #3381936] INFO -- : [270/885] 3422789=test_big2str I, [2024-05-21T19:46:27.123878 #3381936] INFO -- : [271/885] 3422789=test_gem_resolver_specification I, [2024-05-21T19:46:27.156445 #3381936] INFO -- : [272/885] 3422789=test_pkey_dsa I, [2024-05-21T19:46:27.259285 #3381936] INFO -- : [273/885] 3422787=test_logger I, [2024-05-21T19:46:27.350457 #3381936] INFO -- : [274/885] 3422787=test_gem_commands_yank_command I, [2024-05-21T19:46:27.796101 #3381936] INFO -- : [275/885] 3422787=test_yaml_tree I, [2024-05-21T19:46:27.856683 #3381936] INFO -- : [276/885] 3422787=test_cstr I, [2024-05-21T19:46:29.208931 #3381936] INFO -- : [277/885] 3422787=test_gem_resolver_dependency_request I, [2024-05-21T19:46:29.236442 #3381936] INFO -- : [278/885] 3422787=test_command I, [2024-05-21T19:46:29.508558 #3381936] INFO -- : [279/885] 3422787=test_euc_tw I, [2024-05-21T19:46:29.525469 #3381936] INFO -- : [280/885] 3422787=test_psych I, [2024-05-21T19:46:29.588021 #3381936] INFO -- : [281/885] 3422787=test_nil I, [2024-05-21T19:46:29.596852 #3381936] INFO -- : [282/885] 3422787=test_wait I, [2024-05-21T19:46:29.691063 #3381936] INFO -- : [283/885] 3422787=test_import I, [2024-05-21T19:46:29.720302 #3381936] INFO -- : [284/885] 3422788=test_human_typo I, [2024-05-21T19:46:29.725019 #3381936] INFO -- : [285/885] 3422788=test_ldap I, [2024-05-21T19:46:29.727474 #3381936] INFO -- : [286/885] 3422788=test_kdf I, [2024-05-21T19:46:29.795920 #3381936] INFO -- : [287/885] 3422788=test_thread_queue I, [2024-05-21T19:46:30.046846 #3381936] INFO -- : [288/885] 3422789=test_nowrite I, [2024-05-21T19:46:30.075549 #3381936] INFO -- : [289/885] 3422789=test_passing_block I, [2024-05-21T19:46:30.088740 #3381936] INFO -- : [290/885] 3422789=test_defined I, [2024-05-21T19:46:30.158952 #3381936] INFO -- : [291/885] 3422789=test_io_buffer I, [2024-05-21T19:46:30.205781 #3381936] INFO -- : [292/885] 3422789=test_rdoc_rdoc I, [2024-05-21T19:46:30.268597 #3381936] INFO -- : [293/885] 3422789=test_yjit_exit_locations I, [2024-05-21T19:46:30.273603 #3381936] INFO -- : [294/885] 3422789=test_io_timeout I, [2024-05-21T19:46:30.281389 #3381936] INFO -- : [295/885] 3422789=test_rdoc_normal_module I, [2024-05-21T19:46:30.327066 #3381936] INFO -- : [296/885] 3422789=test_type_completor I, [2024-05-21T19:46:30.341809 #3381936] INFO -- : [297/885] 3422789=test_rdoc_markdown_test I, [2024-05-21T19:46:31.510265 #3381936] INFO -- : [298/885] 3422789=json_string_matching_test I, [2024-05-21T19:46:31.520585 #3381936] INFO -- : [299/885] 3422789=test_gem_config_file I, [2024-05-21T19:46:31.564302 #3381936] INFO -- : [300/885] 3422787=test_comparable I, [2024-05-21T19:46:31.565099 #3381936] INFO -- : [301/885] 3422787=test_bug-5832 I, [2024-05-21T19:46:31.570395 #3381936] INFO -- : [302/885] 3422787=test_yield_block I, [2024-05-21T19:46:31.574383 #3381936] INFO -- : [303/885] 3422787=test_c_struct_builder I, [2024-05-21T19:46:31.703642 #3381936] INFO -- : [304/885] 3422789=test_gem_package_tar_reader_entry I, [2024-05-21T19:46:31.801894 #3381936] INFO -- : [305/885] 3422787=test_resource I, [2024-05-21T19:46:31.814702 #3381936] INFO -- : [306/885] 3422787=test_gem_uri I, [2024-05-21T19:46:31.845502 #3381936] INFO -- : [307/885] 3422787=test_reqarg I, [2024-05-21T19:46:31.949990 #3381936] INFO -- : [308/885] 3422789=test_frozen_error I, [2024-05-21T19:46:31.951478 #3381936] INFO -- : [309/885] 3422789=test_gem_ext_ext_conf_builder I, [2024-05-21T19:46:32.120215 #3381936] INFO -- : [310/885] 3422787=test_gem_version I, [2024-05-21T19:46:32.213030 #3381936] INFO -- : [311/885] 3422787=test_spell_checker I, [2024-05-21T19:46:32.220293 #3381936] INFO -- : [312/885] 3422787=test_path_to_class I, [2024-05-21T19:46:32.224229 #3381936] INFO -- : [313/885] 3422787=test_enumerator I, [2024-05-21T19:46:32.396992 #3381936] INFO -- : [314/885] 3422787=test_zlib I, [2024-05-21T19:46:32.982297 #3381936] INFO -- : [315/885] 3422789=test_rdoc_options I, [2024-05-21T19:46:33.256002 #3381936] INFO -- : [316/885] 3422789=test_gem_ext_cargo_builder I, [2024-05-21T19:46:33.257781 #3381936] INFO -- : [317/885] 3422789=test_console_attr I, [2024-05-21T19:46:33.279720 #3381936] INFO -- : [318/885] 3422789=test_proc I, [2024-05-21T19:46:34.108683 #3381936] INFO -- : [319/885] 3422789=test_gem_commands_unpack_command I, [2024-05-21T19:46:34.441104 #3381936] INFO -- : [320/885] 3422789=test_rdoc_include I, [2024-05-21T19:46:34.465963 #3381936] INFO -- : [321/885] 3422789=test_win32ole_record I, [2024-05-21T19:46:34.476818 #3381936] INFO -- : [322/885] 3422789=test_gem_version_option I, [2024-05-21T19:46:34.527520 #3381936] INFO -- : [323/885] 3422789=test_date_compat I, [2024-05-21T19:46:34.538420 #3381936] INFO -- : [324/885] 3422789=test_ubf_async_safe I, [2024-05-21T19:46:34.553658 #3381936] INFO -- : [325/885] 3422789=test_pstore I, [2024-05-21T19:46:34.746051 #3381936] INFO -- : [326/885] 3422789=test_rdoc_generator_markup I, [2024-05-21T19:46:34.922724 #3381936] INFO -- : [327/885] 3422789=test_constant I, [2024-05-21T19:46:35.051404 #3381936] INFO -- : [328/885] 3422788=test_find I, [2024-05-21T19:46:35.074889 #3381936] INFO -- : [329/885] 3422788=test_hmac I, [2024-05-21T19:46:35.085085 #3381936] INFO -- : [330/885] 3422788=test_encoding I, [2024-05-21T19:46:35.289423 #3381936] INFO -- : [331/885] 3422788=test_time I, [2024-05-21T19:46:35.408697 #3381936] INFO -- : [332/885] 3422788=test_file I, [2024-05-21T19:46:35.415981 #3381936] INFO -- : [333/885] 3422788=test_capacity I, [2024-05-21T19:46:35.432201 #3381936] INFO -- : [334/885] 3422788=test_nextafter I, [2024-05-21T19:46:35.569136 #3381936] INFO -- : [335/885] 3422788=test_gem_commands_owner_command I, [2024-05-21T19:46:36.252926 #3381936] INFO -- : [336/885] 3422788=test_rat I, [2024-05-21T19:46:36.321427 #3381936] INFO -- : [337/885] 3422788=test_init I, [2024-05-21T19:46:36.632700 #3381936] INFO -- : [338/885] 3422789=test_gem_request_connection_pools I, [2024-05-21T19:46:36.644163 #3381936] INFO -- : [339/885] 3422788=test_flags I, [2024-05-21T19:46:37.197271 #3381936] INFO -- : [340/885] 3422788=test_numeric I, [2024-05-21T19:46:37.264273 #3381936] INFO -- : [341/885] 3422788=test_bug-3571 I, [2024-05-21T19:46:37.269371 #3381936] INFO -- : [342/885] 3422788=test_yamlstore I, [2024-05-21T19:46:37.288139 #3381936] INFO -- : [343/885] 3422788=test_gem_requirement I, [2024-05-21T19:46:37.420793 #3381936] INFO -- : [344/885] 3422788=test_win32ole_method_event I, [2024-05-21T19:46:37.426714 #3381936] INFO -- : [345/885] 3422788=test_tcp I, [2024-05-21T19:46:37.530932 #3381936] INFO -- : [346/885] 3422788=parse_comments_test I, [2024-05-21T19:46:37.549954 #3381936] INFO -- : [347/885] 3422788=test_rdoc_markup_to_table_of_contents I, [2024-05-21T19:46:37.586689 #3381936] INFO -- : [348/885] 3422788=test_gem_name_tuple I, [2024-05-21T19:46:37.648519 #3381936] INFO -- : [349/885] 3422788=test_integer I, [2024-05-21T19:46:37.656807 #3381936] INFO -- : [350/885] 3422788=test_gem_resolver_activation_request I, [2024-05-21T19:46:37.674961 #3381936] INFO -- : [351/885] 3422788=test_function I, [2024-05-21T19:46:37.678398 #3381936] INFO -- : [352/885] 3422789=test_gem_commands_server_command I, [2024-05-21T19:46:37.720635 #3381936] INFO -- : [353/885] 3422789=test_string I, [2024-05-21T19:46:37.907223 #3381936] INFO -- : [354/885] 3422788=test_macro I, [2024-05-21T19:46:37.913243 #3381936] INFO -- : [355/885] 3422788=test_pipe I, [2024-05-21T19:46:38.033138 #3381936] INFO -- : [356/885] 3422788=test_gem_commands_outdated_command I, [2024-05-21T19:46:38.097245 #3381936] INFO -- : [357/885] 3422788=test_gem_dependency_list I, [2024-05-21T19:46:38.173771 #3381936] INFO -- : [358/885] 3422788=parameters_signature_test I, [2024-05-21T19:46:38.187606 #3381936] INFO -- : [359/885] 3422788=test_rdoc_parser_changelog I, [2024-05-21T19:46:38.252625 #3381936] INFO -- : [360/885] 3422788=test_tsort I, [2024-05-21T19:46:38.266955 #3381936] INFO -- : [361/885] 3422788=test_gem_commands_fetch_command I, [2024-05-21T19:46:38.438097 #3381936] INFO -- : [362/885] 3422788=test_typeddata I, [2024-05-21T19:46:38.683789 #3381936] INFO -- : [363/885] 3422788=test_securerandom I, [2024-05-21T19:46:38.719474 #3381936] INFO -- : [364/885] 3422788=test_kwargs I, [2024-05-21T19:46:38.734518 #3381936] INFO -- : [365/885] 3422788=test_rdoc_parser_c I, [2024-05-21T19:46:38.972650 #3381936] INFO -- : [366/885] 3422788=test_pack I, [2024-05-21T19:46:39.332613 #3381936] INFO -- : [367/885] 3422788=test_io_wait I, [2024-05-21T19:46:39.440423 #3381936] INFO -- : [368/885] 3422787=parse_test I, [2024-05-21T19:46:39.563573 #3381936] INFO -- : [369/885] 3422788=test_gem_doctor I, [2024-05-21T19:46:39.624101 #3381936] INFO -- : [370/885] 3422788=json_fixtures_test I, [2024-05-21T19:46:39.629131 #3381936] INFO -- : [371/885] 3422788=test_len I, [2024-05-21T19:46:39.637542 #3381936] INFO -- : [372/885] 3422788=test_bmethod I, [2024-05-21T19:46:39.638958 #3381936] INFO -- : [373/885] 3422788=test_gem_source_specific_file I, [2024-05-21T19:46:39.736755 #3381936] INFO -- : [374/885] 3422788=test_provider I, [2024-05-21T19:46:39.736848 #3381936] INFO -- : [375/885] 3422788=test_euc_kr I, [2024-05-21T19:46:39.744067 #3381936] INFO -- : [376/885] 3422788=test_rdoc_code_object I, [2024-05-21T19:46:40.116277 #3381936] INFO -- : [377/885] 3422788=test_process I, [2024-05-21T19:46:42.025655 #3381936] INFO -- : [378/885] 3422787=test_rdoc_markup_attributes I, [2024-05-21T19:46:42.031854 #3381936] INFO -- : [379/885] 3422787=redundant_return_test I, [2024-05-21T19:46:42.297971 #3381936] INFO -- : [380/885] 3422787=test_rand I, [2024-05-21T19:46:42.416907 #3381936] INFO -- : [381/885] 3422787=test_random_formatter I, [2024-05-21T19:46:42.431434 #3381936] INFO -- : [382/885] 3422787=test_string_processing I, [2024-05-21T19:46:42.440334 #3381936] INFO -- : [383/885] 3422787=test_generic I, [2024-05-21T19:46:42.463643 #3381936] INFO -- : [384/885] 3422787=test_common I, [2024-05-21T19:46:42.648494 #3381936] INFO -- : [385/885] 3422787=test_rdoc_markup_to_html_snippet I, [2024-05-21T19:46:42.741512 #3381936] INFO -- : [386/885] 3422787=test_httpresponses I, [2024-05-21T19:46:42.757693 #3381936] INFO -- : [387/885] 3422787=test_deprecate I, [2024-05-21T19:46:42.803081 #3381936] INFO -- : [388/885] 3422787=test_rdoc_constant I, [2024-05-21T19:46:42.894570 #3381936] INFO -- : [389/885] 3422787=test_key_actor_vi I, [2024-05-21T19:46:43.010377 #3381936] INFO -- : [390/885] 3422787=test_postponed_job I, [2024-05-21T19:46:43.312806 #3381936] INFO -- : [391/885] 3422787=test_gem_request_set_lockfile I, [2024-05-21T19:46:43.818532 #3381936] INFO -- : [392/885] 3422787=test_rdoc_markdown I, [2024-05-21T19:46:44.056200 #3381936] INFO -- : [393/885] 3422787=test_rdoc_encoding I, [2024-05-21T19:46:44.090500 #3381936] INFO -- : [394/885] 3422787=test_win32ole_variant_outarg I, [2024-05-21T19:46:44.099688 #3381936] INFO -- : [395/885] 3422787=test_stream I, [2024-05-21T19:46:44.309081 #3381936] INFO -- : [396/885] 3422787=test_have_library I, [2024-05-21T19:46:45.062210 #3381936] INFO -- : [397/885] 3422787=test_ns_spki I, [2024-05-21T19:46:45.071798 #3381936] INFO -- : [398/885] 3422787=test_rdoc_markup_indented_paragraph I, [2024-05-21T19:46:45.084534 #3381936] INFO -- : [399/885] 3422787=test_rdoc_markup_parser I, [2024-05-21T19:46:45.159364 #3381936] INFO -- : [400/885] 3422787=test_iseq_load I, [2024-05-21T19:46:45.945195 #3381936] INFO -- : Leaked file descriptor: TestProcess#test_uid_from_name: 10 # I, [2024-05-21T19:46:45.945297 #3381936] INFO -- : Leaked file descriptor: TestProcess#test_uid_from_name: 11 # I, [2024-05-21T19:46:45.971508 #3381936] INFO -- : COMMAND PID USER FD TYPE DEVICE SIZE/OFF NODE NAME I, [2024-05-21T19:46:45.971595 #3381936] INFO -- : ruby 3422788 opc 10r REG 252,0 9253600 13705411 /var/lib/sss/mc/passwd I, [2024-05-21T19:46:45.971611 #3381936] INFO -- : ruby 3422788 opc 11u unix 0x0000000000000000 0t0 3084092483 type=STREAM I, [2024-05-21T19:46:46.292931 #3381936] INFO -- : [401/885] 3422787=test_rdoc_text I, [2024-05-21T19:46:46.366609 #3381936] INFO -- : [402/885] 3422787=library_symbols_test I, [2024-05-21T19:46:46.368294 #3381936] INFO -- : [403/885] 3422787=test_require I, [2024-05-21T19:46:46.377439 #3381936] INFO -- : [404/885] 3422787=test_stringify_symbols I, [2024-05-21T19:46:46.383381 #3381936] INFO -- : [405/885] 3422787=test_objspace I, [2024-05-21T19:46:57.311571 #3381936] INFO -- : [406/885] 3422788=test_gem_commands_environment_command I, [2024-05-21T19:46:57.373761 #3381936] INFO -- : [407/885] 3422788=test_pkcs7 I, [2024-05-21T19:46:57.548303 #3381936] INFO -- : [408/885] 3422788=test_pack I, [2024-05-21T19:46:57.742024 #3381936] INFO -- : [409/885] 3422788=test_class_name_check I, [2024-05-21T19:46:57.829064 #3381936] INFO -- : [410/885] 3422788=test_scalar I, [2024-05-21T19:46:57.851121 #3381936] INFO -- : [411/885] 3422788=test_syntax I, [2024-05-21T19:47:03.601355 #3381936] INFO -- : [412/885] 3422789=test_zsh_completion I, [2024-05-21T19:47:03.607414 #3381936] INFO -- : [413/885] 3422789=test_basicsocket I, [2024-05-21T19:47:03.622710 #3381936] INFO -- : [414/885] 3422789=test_bash_completion I, [2024-05-21T19:47:03.636804 #3381936] INFO -- : [415/885] 3422789=test_exception I, [2024-05-21T19:47:05.376369 #3381936] INFO -- : [416/885] 3422788=test_rdoc_markup_to_html_crossref I, [2024-05-21T19:47:05.666779 #3381936] INFO -- : [417/885] 3422788=test_files_test_2 I, [2024-05-21T19:47:05.672266 #3381936] INFO -- : [418/885] 3422788=test_div I, [2024-05-21T19:47:05.680039 #3381936] INFO -- : [419/885] 3422788=test_rdoc_context_section I, [2024-05-21T19:47:05.692223 #3381936] INFO -- : [420/885] 3422788=test_io_buffer I, [2024-05-21T19:47:05.808078 #3381936] INFO -- : [421/885] 3422788=test_deprecated I, [2024-05-21T19:47:05.817847 #3381936] INFO -- : [422/885] 3422788=test_optparse I, [2024-05-21T19:47:06.072929 #3381936] INFO -- : [423/885] 3422788=test_timeout I, [2024-05-21T19:47:06.795099 #3381936] INFO -- : [424/885] 3422788=test_rdoc_markup_to_bs I, [2024-05-21T19:47:06.841623 #3381936] INFO -- : [425/885] 3422788=test_key_name_check I, [2024-05-21T19:47:06.848037 #3381936] INFO -- : [426/885] 3422788=test_rdoc_markup_raw I, [2024-05-21T19:47:06.933594 #3381936] INFO -- : [427/885] 3422788=test_weakref I, [2024-05-21T19:47:07.048340 #3381936] INFO -- : [428/885] 3422789=test_instrumentation_api I, [2024-05-21T19:47:07.130660 #3381936] INFO -- : [429/885] 3422788=test_rdoc_alias I, [2024-05-21T19:47:07.139640 #3381936] INFO -- : [430/885] 3422788=test_singleton I, [2024-05-21T19:47:07.196854 #3381936] INFO -- : [431/885] 3422788=test_fstring I, [2024-05-21T19:47:07.258406 #3381936] INFO -- : [432/885] 3422788=test_numeric I, [2024-05-21T19:47:07.404703 #3381936] INFO -- : [433/885] 3422788=test_gem_ext_rake_builder I, [2024-05-21T19:47:07.894109 #3381936] INFO -- : [434/885] 3422788=test_rdoc_require I, [2024-05-21T19:47:07.899291 #3381936] INFO -- : [435/885] 3422788=test_word I, [2024-05-21T19:47:07.915075 #3381936] INFO -- : [436/885] 3422788=test_gem_commands_cert_command I, [2024-05-21T19:47:09.245256 #3381936] INFO -- : [437/885] 3422788=test_gem_commands_stale_command I, [2024-05-21T19:47:09.250792 #3381936] INFO -- : [438/885] 3422788=ruby_parser_test I, [2024-05-21T19:47:09.256988 #3381936] INFO -- : [439/885] 3422788=test_rdoc_markup_to_tt_only I, [2024-05-21T19:47:09.299961 #3381936] INFO -- : [440/885] 3422788=test_ws I, [2024-05-21T19:47:09.404731 #3381936] INFO -- : [441/885] 3422788=test_date_strftime I, [2024-05-21T19:47:09.753076 #3381936] INFO -- : [442/885] 3422788=json_parser_test I, [2024-05-21T19:47:09.791297 #3381936] INFO -- : [443/885] 3422788=test_bigzero I, [2024-05-21T19:47:09.809771 #3381936] INFO -- : [444/885] 3422788=test_gem_commands_query_command I, [2024-05-21T19:47:10.068638 #3381936] INFO -- : [445/885] 3422789=test_gem_platform I, [2024-05-21T19:47:10.182925 #3381936] INFO -- : [446/885] 3422789=test_win32ole_typelib I, [2024-05-21T19:47:10.191926 #3381936] INFO -- : [447/885] 3422789=test_pkey I, [2024-05-21T19:47:10.202069 #3381936] INFO -- : [448/885] 3422789=test_external_new I, [2024-05-21T19:47:10.229834 #3381936] INFO -- : [449/885] 3422789=test_multi_irb_commands I, [2024-05-21T19:47:10.271266 #3381936] INFO -- : [450/885] 3422789=test_pkey_dh I, [2024-05-21T19:47:10.494725 #3381936] INFO -- : [451/885] 3422788=test_m17n_comb I, [2024-05-21T19:47:11.605578 #3381936] INFO -- : [452/885] 3422789=test_null I, [2024-05-21T19:47:11.621749 #3381936] INFO -- : [453/885] 3422789=test_ractor I, [2024-05-21T19:47:11.665371 #3381936] INFO -- : [454/885] 3422789=test_data I, [2024-05-21T19:47:11.684063 #3381936] INFO -- : [455/885] 3422789=test_memory_view I, [2024-05-21T19:47:11.700800 #3381936] INFO -- : [456/885] 3422789=test_io I, [2024-05-21T19:47:11.901873 #3381936] INFO -- : [457/885] 3422789=test_rdoc_i18n_text I, [2024-05-21T19:47:11.913247 #3381936] INFO -- : [458/885] 3422789=test_input_method I, [2024-05-21T19:47:11.948817 #3381936] INFO -- : [459/885] 3422789=test_thread I, [2024-05-21T19:47:12.169703 #3381936] INFO -- : [460/885] 3422789=test_gem_security_signer I, [2024-05-21T19:47:12.320369 #3381936] INFO -- : [461/885] 3422789=test_config I, [2024-05-21T19:47:12.374758 #3381936] INFO -- : [462/885] 3422789=test_complex2 I, [2024-05-21T19:47:12.385322 #3381936] INFO -- : [463/885] 3422789=test_gem_util I, [2024-05-21T19:47:12.546755 #3381936] INFO -- : [464/885] 3422789=test_gem_unsatisfiable_dependency_error I, [2024-05-21T19:47:12.563559 #3381936] INFO -- : [465/885] 3422789=test_literal I, [2024-05-21T19:47:13.154764 #3381936] INFO -- : [466/885] 3422789=test_unix I, [2024-05-21T19:47:13.293450 #3381936] INFO -- : [467/885] 3422789=test_integer I, [2024-05-21T19:47:13.461689 #3381936] INFO -- : [468/885] 3422788=test_gem_commands_contents_command I, [2024-05-21T19:47:13.568018 #3381936] INFO -- : [469/885] 3422788=test_context I, [2024-05-21T19:47:13.657092 #3381936] INFO -- : [470/885] 3422788=test_udp I, [2024-05-21T19:47:14.557749 #3381936] INFO -- : [471/885] 3422788=test_symbol I, [2024-05-21T19:47:16.058373 #3381936] INFO -- : [472/885] 3422789=test_gem_commands_search_command I, [2024-05-21T19:47:16.072120 #3381936] INFO -- : [473/885] 3422789=test_rdoc_servlet I, [2024-05-21T19:47:16.165145 #3381936] INFO -- : [474/885] 3422789=test_coder I, [2024-05-21T19:47:16.176885 #3381936] INFO -- : [475/885] 3422789=test_formatter I, [2024-05-21T19:47:16.193333 #3381936] INFO -- : [476/885] 3422789=test_gem_resolver_local_specification I, [2024-05-21T19:47:16.233982 #3381936] INFO -- : [477/885] 3422789=test_configuration I, [2024-05-21T19:47:16.370871 #3381936] INFO -- : [478/885] 3422789=test_date_new I, [2024-05-21T19:47:16.399813 #3381936] INFO -- : [479/885] 3422789=test_gem_commands_list_command I, [2024-05-21T19:47:16.734765 #3381936] INFO -- : [480/885] 3422789=test_have_func I, [2024-05-21T19:47:18.123240 #3381936] INFO -- : [481/885] 3422789=test_date_marshal I, [2024-05-21T19:47:18.141873 #3381936] INFO -- : [482/885] 3422789=test_locale I, [2024-05-21T19:47:18.175923 #3381936] INFO -- : [483/885] 3422789=test_ts I, [2024-05-21T19:47:18.446949 #3381936] INFO -- : [484/885] 3422788=test_address_resolve I, [2024-05-21T19:47:18.466486 #3381936] INFO -- : [485/885] 3422788=test_stream I, [2024-05-21T19:47:18.476119 #3381936] INFO -- : [486/885] 3422788=test_trick I, [2024-05-21T19:47:18.597621 #3381936] INFO -- : [487/885] 3422789=test_ractor I, [2024-05-21T19:47:18.607024 #3381936] INFO -- : [488/885] 3422789=test_rdoc_attr I, [2024-05-21T19:47:18.708863 #3381936] INFO -- : [489/885] 3422789=test_extlibs I, [2024-05-21T19:47:20.739968 #3381936] INFO -- : [490/885] 3422789=test_iter_break I, [2024-05-21T19:47:20.755869 #3381936] INFO -- : [491/885] 3422789=test_range I, [2024-05-21T19:47:21.433463 #3381936] INFO -- : [492/885] 3422788=test_gem_commands_signin_command I, [2024-05-21T19:47:21.588774 #3381936] INFO -- : [493/885] 3422788=test_recursion I, [2024-05-21T19:47:21.706241 #3381936] INFO -- : [494/885] 3422788=test_require I, [2024-05-21T19:47:21.748650 #3381936] INFO -- : [495/885] 3422789=test_rdoc_markup_include I, [2024-05-21T19:47:21.773409 #3381936] INFO -- : [496/885] 3422789=test_enum I, [2024-05-21T19:47:22.940336 #3381936] INFO -- : [497/885] 3422789=test_rbconfig I, [2024-05-21T19:47:22.959756 #3381936] INFO -- : [498/885] 3422789=test_num2int I, [2024-05-21T19:47:22.981885 #3381936] INFO -- : [499/885] 3422789=test_gem_resolver_best_set I, [2024-05-21T19:47:23.056806 #3381936] INFO -- : [500/885] 3422789=test_cgi_core I, [2024-05-21T19:47:23.067202 #3381936] INFO -- : [501/885] 3422789=test_parser I, [2024-05-21T19:47:23.088771 #3381936] INFO -- : [502/885] 3422789=test_rdoc_markup_to_label I, [2024-05-21T19:47:23.128308 #3381936] INFO -- : [503/885] 3422789=json_generator_test I, [2024-05-21T19:47:23.282726 #3381936] INFO -- : [504/885] 3422788=test_ansi_without_terminfo I, [2024-05-21T19:47:23.300560 #3381936] INFO -- : [505/885] 3422788=test_ractor I, [2024-05-21T19:47:23.300635 #3381936] INFO -- : [506/885] 3422789=test_registry I, [2024-05-21T19:47:23.324702 #3381936] INFO -- : [507/885] 3422789=test_gem I, [2024-05-21T19:47:23.332984 #3381936] INFO -- : [508/885] 3422788=test_gem_commands_help_command I, [2024-05-21T19:47:23.419885 #3381936] INFO -- : [509/885] 3422788=test_scheduler I, [2024-05-21T19:47:23.666974 #3381936] INFO -- : [510/885] 3422788=test_ssl I, [2024-05-21T19:47:23.899167 #3381936] INFO -- : [511/885] 3422788=test_gem_resolver_conflict I, [2024-05-21T19:47:23.992836 #3381936] INFO -- : [512/885] 3422788=test_ractor I, [2024-05-21T19:47:24.244224 #3381936] INFO -- : [513/885] 3422788=test_rdoc_markup_hard_break I, [2024-05-21T19:47:24.256241 #3381936] INFO -- : [514/885] 3422788=test_marshal I, [2024-05-21T19:47:24.991483 #3381936] INFO -- : Leaked file descriptor: TestGem#test_self_clear_paths: 9 # I, [2024-05-21T19:47:25.039522 #3381936] INFO -- : COMMAND PID USER FD TYPE DEVICE SIZE/OFF NODE NAME I, [2024-05-21T19:47:25.039644 #3381936] INFO -- : ruby 3422789 opc 9r REG 252,0 9253600 13705411 /var/lib/sss/mc/passwd I, [2024-05-21T19:47:25.567145 #3381936] INFO -- : [515/885] 3422788=test_ancdata I, [2024-05-21T19:47:25.592780 #3381936] INFO -- : [516/885] 3422788=ractor_test I, [2024-05-21T19:47:25.664475 #3381936] INFO -- : [517/885] 3422787=test_nesting_parser I, [2024-05-21T19:47:25.666952 #3381936] INFO -- : [518/885] 3422788=test_enc_str_buf_cat I, [2024-05-21T19:47:25.675174 #3381936] INFO -- : [519/885] 3422788=test_bignum I, [2024-05-21T19:47:25.693137 #3381936] INFO -- : [520/885] 3422787=newline_test I, [2024-05-21T19:47:25.742662 #3381936] INFO -- : [521/885] 3422789=test_addrinfo I, [2024-05-21T19:47:25.765879 #3381936] INFO -- : [522/885] 3422787=test_to_ruby I, [2024-05-21T19:47:25.788606 #3381936] INFO -- : [523/885] 3422787=test_time_tz I, [2024-05-21T19:47:25.831603 #3381936] INFO -- : Leaked file descriptor: TestSocketAddrinfo#test_addrinfo_timeout: 11 # I, [2024-05-21T19:47:25.849668 #3381936] INFO -- : [524/885] 3422787=test_inlinecache I, [2024-05-21T19:47:25.861856 #3381936] INFO -- : COMMAND PID USER FD TYPE DEVICE SIZE/OFF NODE NAME I, [2024-05-21T19:47:25.861921 #3381936] INFO -- : ruby 3422789 opc 11u unix 0x0000000000000000 0t0 3084095045 type=STREAM I, [2024-05-21T19:47:25.911148 #3381936] INFO -- : [525/885] 3422787=test_socket I, [2024-05-21T19:47:25.914365 #3381936] INFO -- : [526/885] 3422789=test_terminfo I, [2024-05-21T19:47:25.915481 #3381936] INFO -- : [527/885] 3422789=test_thread I, [2024-05-21T19:47:26.829811 #3381936] INFO -- : [528/885] 3422787=test_data I, [2024-05-21T19:47:26.898773 #3381936] INFO -- : [529/885] 3422787=test_bug-14834 I, [2024-05-21T19:47:26.905377 #3381936] INFO -- : [530/885] 3422787=test_ellipsize I, [2024-05-21T19:47:26.988457 #3381936] INFO -- : [531/885] 3422787=test_call I, [2024-05-21T19:47:27.175637 #3381936] INFO -- : [532/885] 3422787=test_gem_commands_build_command I, [2024-05-21T19:47:27.464085 #3381936] INFO -- : [533/885] 3422787=test_reline I, [2024-05-21T19:47:27.727302 #3381936] INFO -- : [534/885] 3422787=test_gem_ext_builder I, [2024-05-21T19:47:29.215745 #3381936] INFO -- : [535/885] 3422787=test_to_ary_concat I, [2024-05-21T19:47:29.320483 #3381936] INFO -- : [536/885] 3422788=test_history I, [2024-05-21T19:47:29.331641 #3381936] INFO -- : [537/885] 3422788=test_windows_1251 I, [2024-05-21T19:47:29.341270 #3381936] INFO -- : [538/885] 3422788=test_alias_and_anchor I, [2024-05-21T19:47:29.351124 #3381936] INFO -- : [539/885] 3422788=test_time I, [2024-05-21T19:47:29.578004 #3381936] INFO -- : [540/885] 3422788=test_popen_deadlock I, [2024-05-21T19:47:30.117012 #3381936] INFO -- : [541/885] 3422788=test_ensured I, [2024-05-21T19:47:30.121553 #3381936] INFO -- : [542/885] 3422788=test_euc_jp I, [2024-05-21T19:47:30.129392 #3381936] INFO -- : [543/885] 3422788=test_rdoc_markup I, [2024-05-21T19:47:30.140874 #3381936] INFO -- : [544/885] 3422788=test_key_stroke I, [2024-05-21T19:47:30.152439 #3381936] INFO -- : [545/885] 3422788=location_test I, [2024-05-21T19:47:30.242670 #3381936] INFO -- : [546/885] 3422788=test_chilled I, [2024-05-21T19:47:30.250016 #3381936] INFO -- : [547/885] 3422788=test_delegate I, [2024-05-21T19:47:30.312739 #3381936] INFO -- : [548/885] 3422788=test_project_sanity I, [2024-05-21T19:47:30.317833 #3381936] INFO -- : [549/885] 3422788=test_symbol I, [2024-05-21T19:47:30.419013 #3381936] INFO -- : [550/885] 3422788=test_gc I, [2024-05-21T19:47:32.117861 #3381936] INFO -- : [551/885] 3422787=test_gem_bundler_version_finder I, [2024-05-21T19:47:32.152688 #3381936] INFO -- : [552/885] 3422787=test_gem_request_set I, [2024-05-21T19:47:32.691315 #3381936] INFO -- : [553/885] 3422787=test_set_len I, [2024-05-21T19:47:32.696907 #3381936] INFO -- : [554/885] 3422787=constant_path_node_test I, [2024-05-21T19:47:32.702618 #3381936] INFO -- : [555/885] 3422787=test_interned_str I, [2024-05-21T19:47:32.707652 #3381936] INFO -- : [556/885] 3422787=test_folderitem2_invokeverb I, [2024-05-21T19:47:32.728141 #3381936] INFO -- : [557/885] 3422787=test_pattern_matching I, [2024-05-21T19:47:32.921424 #3381936] INFO -- : [558/885] 3422787=test_sleep I, [2024-05-21T19:47:34.730490 #3381936] INFO -- : [559/885] 3422789=test_webauthn_listener_response I, [2024-05-21T19:47:34.781579 #3381936] INFO -- : [560/885] 3422789=ruby_api_test I, [2024-05-21T19:47:34.916153 #3381936] INFO -- : [561/885] 3422789=test_gem_resolver_index_set I, [2024-05-21T19:47:34.952087 #3381936] INFO -- : [562/885] 3422789=test_scalar_scanner I, [2024-05-21T19:47:34.972713 #3381936] INFO -- : [563/885] 3422789=test_lambda I, [2024-05-21T19:47:35.025444 #3381936] INFO -- : [564/885] 3422789=test_rb_str_dup I, [2024-05-21T19:47:35.033941 #3381936] INFO -- : [565/885] 3422789=test_arity I, [2024-05-21T19:47:35.057298 #3381936] INFO -- : [566/885] 3422789=test_gem_path_support I, [2024-05-21T19:47:35.088895 #3381936] INFO -- : [567/885] 3422789=test_keyword I, [2024-05-21T19:47:35.611381 #3381936] INFO -- : [568/885] 3422789=test_win32ole_type_event I, [2024-05-21T19:47:35.614136 #3381936] INFO -- : [569/885] 3422789=test_trace I, [2024-05-21T19:47:35.628871 #3381936] INFO -- : [570/885] 3422789=test_rdoc_markup_to_html I, [2024-05-21T19:47:35.714870 #3381936] INFO -- : [571/885] 3422789=test_foreach I, [2024-05-21T19:47:35.722474 #3381936] INFO -- : [572/885] 3422789=test_append I, [2024-05-21T19:47:35.742880 #3381936] INFO -- : [573/885] 3422789=test_gem_resolver_installer_set I, [2024-05-21T19:47:35.958077 #3381936] INFO -- : [574/885] 3422789=bom_test I, [2024-05-21T19:47:36.037460 #3381936] INFO -- : [575/885] 3422789=test_config I, [2024-05-21T19:47:36.347455 #3381936] INFO -- : [576/885] 3422789=test_file I, [2024-05-21T19:47:37.752999 #3381936] INFO -- : [577/885] 3422787=test_summary I, [2024-05-21T19:47:37.809835 #3381936] INFO -- : [578/885] 3422787=test_helper_method I, [2024-05-21T19:47:37.819814 #3381936] INFO -- : [579/885] 3422787=test_x509ext I, [2024-05-21T19:47:37.824667 #3381936] INFO -- : [580/885] 3422787=test_emitter I, [2024-05-21T19:47:37.836538 #3381936] INFO -- : [581/885] 3422787=format_errors_test I, [2024-05-21T19:47:37.845298 #3381936] INFO -- : [582/885] 3422787=test_cgi_header I, [2024-05-21T19:47:37.850594 #3381936] INFO -- : [583/885] 3422787=test_case_options I, [2024-05-21T19:47:37.858862 #3381936] INFO -- : [584/885] 3422787=test_addr I, [2024-05-21T19:47:37.867409 #3381936] INFO -- : [585/885] 3422787=test_mailto I, [2024-05-21T19:47:37.874557 #3381936] INFO -- : [586/885] 3422787=test_kill_ring I, [2024-05-21T19:47:37.884330 #3381936] INFO -- : [587/885] 3422787=test_member I, [2024-05-21T19:47:37.890948 #3381936] INFO -- : [588/885] 3422787=test_object I, [2024-05-21T19:47:37.895151 #3381936] INFO -- : [589/885] 3422787=test_helper I, [2024-05-21T19:47:37.899830 #3381936] INFO -- : [590/885] 3422787=test_duplicate I, [2024-05-21T19:47:37.910275 #3381936] INFO -- : [591/885] 3422787=test_gem_resolver_api_set I, [2024-05-21T19:47:37.985090 #3381936] INFO -- : [592/885] 3422787=test_ruby_lex I, [2024-05-21T19:47:38.101722 #3381936] INFO -- : [593/885] 3422787=compiler_test I, [2024-05-21T19:47:38.103524 #3381936] INFO -- : [594/885] 3422787=test_arith_seq_extract I, [2024-05-21T19:47:38.140886 #3381936] INFO -- : [595/885] 3422787=test_gem_source_subpath_problem I, [2024-05-21T19:47:38.223765 #3381936] INFO -- : [596/885] 3422787=test_object_references I, [2024-05-21T19:47:38.257039 #3381936] INFO -- : [597/885] 3422787=test_gem_installer I, [2024-05-21T19:47:39.346672 #3381936] INFO -- : [598/885] 3422788=test_bug_reporter I, [2024-05-21T19:47:39.526922 #3381936] INFO -- : [599/885] 3422788=test_buffered_io I, [2024-05-21T19:47:39.527761 #3381936] INFO -- : [600/885] 3422788=test_ossl I, [2024-05-21T19:47:42.531882 #3381936] INFO -- : [601/885] 3422789=test_nofree I, [2024-05-21T19:47:42.556028 #3381936] INFO -- : [602/885] 3422789=test_regexp I, [2024-05-21T19:47:42.813849 #3381936] INFO -- : [603/885] 3422787=test_whileuntil I, [2024-05-21T19:47:42.841118 #3381936] INFO -- : [604/885] 3422787=test_pointer I, [2024-05-21T19:47:44.406860 #3381936] INFO -- : [605/885] 3422787=test_rdoc_normal_class I, [2024-05-21T19:47:44.452765 #3381936] INFO -- : [606/885] 3422787=test_within_pipe I, [2024-05-21T19:47:44.470989 #3381936] INFO -- : [607/885] 3422787=test_eval I, [2024-05-21T19:47:44.857004 #3381936] INFO -- : [608/885] 3422787=test_beginendblock I, [2024-05-21T19:47:45.070187 #3381936] INFO -- : [609/885] 3422787=test_monitor I, [2024-05-21T19:47:45.333380 #3381936] INFO -- : [610/885] 3422787=json_encoding_test I, [2024-05-21T19:47:45.336970 #3381936] INFO -- : [611/885] 3422787=test_vm_dump I, [2024-05-21T19:47:45.390654 #3381936] INFO -- : [612/885] 3422787=test_func I, [2024-05-21T19:47:47.198693 #3381936] INFO -- : [613/885] 3422788=test_config I, [2024-05-21T19:47:47.232343 #3381936] INFO -- : [614/885] 3422788=test_modify_expand I, [2024-05-21T19:47:47.242367 #3381936] INFO -- : [615/885] 3422788=test_pkg_config I, [2024-05-21T19:47:47.267392 #3381936] INFO -- : [616/885] 3422788=test_gem_available_set I, [2024-05-21T19:47:47.508399 #3381936] INFO -- : [617/885] 3422788=test_convertible I, [2024-05-21T19:47:49.749139 #3381936] INFO -- : [618/885] 3422787=errors_test I, [2024-05-21T19:47:49.876778 #3381936] INFO -- : [619/885] 3422787=test_gem_commands_exec_command I, [2024-05-21T19:47:51.285467 #3381936] INFO -- : [620/885] 3422787=unescape_test I, [2024-05-21T19:47:51.372251 #3381936] INFO -- : [621/885] 3422788=test_color_printer I, [2024-05-21T19:47:51.382204 #3381936] INFO -- : [622/885] 3422788=test_super I, [2024-05-21T19:47:52.632692 #3381936] INFO -- : [623/885] 3422787=test_gem_resolver I, [2024-05-21T19:47:52.874110 #3381936] INFO -- : [624/885] 3422788=test_gem_source_vendor I, [2024-05-21T19:47:52.889060 #3381936] INFO -- : [625/885] 3422788=test_object I, [2024-05-21T19:47:52.927760 #3381936] INFO -- : [626/885] 3422787=test_dln I, [2024-05-21T19:47:52.931606 #3381936] INFO -- : [627/885] 3422787=test_x509req I, [2024-05-21T19:47:52.960882 #3381936] INFO -- : [628/885] 3422787=test_readpartial I, [2024-05-21T19:47:53.219545 #3381936] INFO -- : [629/885] 3422788=test_httpresponse I, [2024-05-21T19:47:53.259017 #3381936] INFO -- : [630/885] 3422788=test_rdoc_parser_ruby I, [2024-05-21T19:47:53.363490 #3381936] INFO -- : [631/885] 3422787=test_insns_leaf I, [2024-05-21T19:47:53.368056 #3381936] INFO -- : [632/885] 3422787=test_gem_console_ui I, [2024-05-21T19:47:53.384305 #3381936] INFO -- : [633/885] 3422787=test_allocation I, [2024-05-21T19:47:54.238205 #3381936] INFO -- : [634/885] 3422788=test_ifunless I, [2024-05-21T19:47:54.246867 #3381936] INFO -- : [635/885] 3422788=test_rdoc_markup_heading I, [2024-05-21T19:47:54.256200 #3381936] INFO -- : [636/885] 3422788=test_flip I, [2024-05-21T19:47:54.288035 #3381936] INFO -- : [637/885] 3422788=test_io_console I, [2024-05-21T19:47:56.175063 #3381936] INFO -- : [638/885] 3422787=test_dns I, [2024-05-21T19:47:56.404125 #3381936] INFO -- : [639/885] 3422787=test_notimplement I, [2024-05-21T19:47:56.418225 #3381936] INFO -- : [640/885] 3422787=test_cgi_session I, [2024-05-21T19:47:56.438480 #3381936] INFO -- : [641/885] 3422787=test_c_union_entity I, [2024-05-21T19:47:56.620512 #3381936] INFO -- : [642/885] 3422787=test_x509crl I, [2024-05-21T19:47:56.711930 #3381936] INFO -- : [643/885] 3422787=test_debug I, [2024-05-21T19:47:56.733738 #3381936] INFO -- : [644/885] 3422787=test_transcode I, [2024-05-21T19:47:56.893340 #3381936] INFO -- : [645/885] 3422788=test_refinement I, [2024-05-21T19:47:56.907970 #3381936] INFO -- : [646/885] 3422787=test_class2name I, [2024-05-21T19:47:56.958306 #3381936] INFO -- : [647/885] 3422787=test_gem_commands_cleanup_command I, [2024-05-21T19:47:57.581055 #3381936] INFO -- : [648/885] 3422787=test_pattern_key_name_check I, [2024-05-21T19:47:57.589048 #3381936] INFO -- : [649/885] 3422787=test_profile_frames I, [2024-05-21T19:47:57.764111 #3381936] INFO -- : [650/885] 3422787=test_getopts I, [2024-05-21T19:47:57.771947 #3381936] INFO -- : [651/885] 3422787=test_emitter I, [2024-05-21T19:47:57.840335 #3381936] INFO -- : [652/885] 3422787=test_fips I, [2024-05-21T19:47:58.067534 #3381936] INFO -- : [653/885] 3422787=test_alias I, [2024-05-21T19:47:58.217262 #3381936] INFO -- : [654/885] 3422787=test_gem_ext_cmake_builder I, [2024-05-21T19:47:58.249236 #3381936] INFO -- : [655/885] 3422787=test_digest_extend I, [2024-05-21T19:47:58.323248 #3381936] INFO -- : [656/885] 3422787=test_last_thread I, [2024-05-21T19:47:59.339274 #3381936] INFO -- : [657/885] 3422787=test_thread_fd_close I, [2024-05-21T19:47:59.344331 #3381936] INFO -- : [658/885] 3422787=test_win32ole_event I, [2024-05-21T19:47:59.369499 #3381936] INFO -- : [659/885] 3422787=test_gem_commands_uninstall_command I, [2024-05-21T19:48:00.205697 #3381936] INFO -- : [660/885] 3422787=test_rdoc_markup_formatter I, [2024-05-21T19:48:00.226104 #3381936] INFO -- : [661/885] 3422787=test_compile_prism I, [2024-05-21T19:48:00.550271 #3381936] INFO -- : [662/885] 3422787=test_helper I, [2024-05-21T19:48:00.607304 #3381936] INFO -- : [663/885] 3422787=test_unicode_normalize I, [2024-05-21T19:48:00.676945 #3381936] INFO -- : [664/885] 3422788=test_gem_stream_ui I, [2024-05-21T19:48:00.780729 #3381936] INFO -- : [665/885] 3422788=test_rdoc_generator_ri I, [2024-05-21T19:48:00.786537 #3381936] INFO -- : [666/885] 3422788=test_propertyputref I, [2024-05-21T19:48:00.793613 #3381936] INFO -- : [667/885] 3422788=test_gb18030 I, [2024-05-21T19:48:00.808530 #3381936] INFO -- : [668/885] 3422788=test_gem_commands_lock_command I, [2024-05-21T19:48:00.896872 #3381936] INFO -- : [669/885] 3422788=test_reline_key I, [2024-05-21T19:48:00.910008 #3381936] INFO -- : [670/885] 3422788=test_color I, [2024-05-21T19:48:01.060087 #3381936] INFO -- : [671/885] 3422788=test_io_m17n I, [2024-05-21T19:48:02.340039 #3381936] INFO -- : [672/885] 3422788=test_rdoc_top_level I, [2024-05-21T19:48:02.621905 #3381936] INFO -- : [673/885] 3422788=test_cmethod I, [2024-05-21T19:48:02.641230 #3381936] INFO -- : [674/885] 3422788=test_gem_stub_specification I, [2024-05-21T19:48:02.814479 #3381936] INFO -- : [675/885] 3422788=test_float I, [2024-05-21T19:48:04.380890 #3381936] INFO -- : [676/885] 3422787=test_nonblock I, [2024-05-21T19:48:04.404295 #3381936] INFO -- : [677/885] 3422787=test_rdoc_parser_simple I, [2024-05-21T19:48:04.441984 #3381936] INFO -- : [678/885] 3422787=json_ext_parser_test I, [2024-05-21T19:48:04.464676 #3381936] INFO -- : [679/885] 3422787=test_gem_ext_configure_builder I, [2024-05-21T19:48:04.493489 #3381936] INFO -- : [680/885] 3422787=test_rdoc_generator_pot_po I, [2024-05-21T19:48:04.504049 #3381936] INFO -- : [681/885] 3422787=test_mul I, [2024-05-21T19:48:04.518307 #3381936] INFO -- : [682/885] 3422787=test_shellwords I, [2024-05-21T19:48:04.546523 #3381936] INFO -- : [683/885] 3422787=test_ocsp I, [2024-05-21T19:48:04.647124 #3381936] INFO -- : [684/885] 3422787=test_scanner_events I, [2024-05-21T19:48:04.695137 #3381936] INFO -- : [685/885] 3422787=test_ipaddr I, [2024-05-21T19:48:04.739914 #3381936] INFO -- : [686/885] 3422787=test_date_strptime I, [2024-05-21T19:48:04.870245 #3381936] INFO -- : [687/885] 3422787=test_omap I, [2024-05-21T19:48:04.882541 #3381936] INFO -- : [688/885] 3422787=test_nomethod_error I, [2024-05-21T19:48:04.900747 #3381936] INFO -- : [689/885] 3422787=test_gem_commands_rebuild_command I, [2024-05-21T19:48:04.914464 #3381936] INFO -- : [690/885] 3422788=test_etc I, [2024-05-21T19:48:04.951538 #3381936] INFO -- : [691/885] 3422787=test_stat I, [2024-05-21T19:48:04.956917 #3381936] INFO -- : [692/885] 3422787=test_win32ole_param_event I, [2024-05-21T19:48:04.966029 #3381936] INFO -- : [693/885] 3422787=test_https_proxy I, [2024-05-21T19:48:04.975811 #3381936] INFO -- : [694/885] 3422787=test_rdoc_parser I, [2024-05-21T19:48:04.990514 #3381936] INFO -- : [695/885] 3422788=test_win32ole_variant I, [2024-05-21T19:48:04.999308 #3381936] INFO -- : [696/885] 3422787=magic_comment_test I, [2024-05-21T19:48:05.009290 #3381936] INFO -- : [697/885] 3422788=test_cgi_modruby I, [2024-05-21T19:48:05.011146 #3381936] INFO -- : [698/885] 3422787=test_x509attr I, [2024-05-21T19:48:05.018504 #3381936] INFO -- : [699/885] 3422788=test_printf I, [2024-05-21T19:48:05.029214 #3381936] INFO -- : [700/885] 3422787=test_workspace I, [2024-05-21T19:48:05.045247 #3381936] INFO -- : [701/885] 3422788=test_uncorrectable_name_check I, [2024-05-21T19:48:05.082689 #3381936] INFO -- : [702/885] 3422788=test_io I, [2024-05-21T19:48:05.153286 #3381936] INFO -- : [703/885] 3422787=test_path I, [2024-05-21T19:48:05.190478 #3381936] INFO -- : [704/885] 3422787=test_digest I, [2024-05-21T19:48:05.202123 #3381936] INFO -- : [705/885] 3422787=test_rdoc_rd_inline I, [2024-05-21T19:48:05.220473 #3381936] INFO -- : [706/885] 3422787=test_dir I, [2024-05-21T19:48:05.654599 #3381936] INFO -- : [707/885] 3422787=test_files_test_1 I, [2024-05-21T19:48:08.062550 #3381936] INFO -- : [708/885] 3422787=test_closure I, [2024-05-21T19:48:11.075661 #3381936] INFO -- : [709/885] 3422789=test_resolve_symbol I, [2024-05-21T19:48:11.094069 #3381936] INFO -- : [710/885] 3422789=test_rubygems I, [2024-05-21T19:48:11.246931 #3381936] INFO -- : [711/885] 3422789=test_primitive I, [2024-05-21T19:48:11.263238 #3381936] INFO -- : [712/885] 3422789=test_parser I, [2024-05-21T19:48:11.283325 #3381936] INFO -- : [713/885] 3422789=test_rdoc_ri_paths I, [2024-05-21T19:48:11.320944 #3381936] INFO -- : [714/885] 3422789=test_iseq I, [2024-05-21T19:48:11.365115 #3381936] INFO -- : [715/885] 3422787=test_gem_safe_yaml I, [2024-05-21T19:48:11.376951 #3381936] INFO -- : [716/885] 3422787=test_eval I, [2024-05-21T19:48:11.377479 #3381936] INFO -- : [717/885] 3422787=test_document I, [2024-05-21T19:48:11.399629 #3381936] INFO -- : [718/885] 3422787=test_history I, [2024-05-21T19:48:11.435317 #3381936] INFO -- : [719/885] 3422787=test_gem_commands_setup_command I, [2024-05-21T19:48:11.819830 #3381936] INFO -- : [720/885] 3422789=test_singleton_function I, [2024-05-21T19:48:11.827686 #3381936] INFO -- : [721/885] 3422789=command_line_test I, [2024-05-21T19:48:11.875746 #3381936] INFO -- : [722/885] 3422789=test_pair I, [2024-05-21T19:48:12.285929 #3381936] INFO -- : [723/885] 3422787=test_win32ole_variant_m I, [2024-05-21T19:48:12.302187 #3381936] INFO -- : [724/885] 3422787=test_env I, [2024-05-21T19:48:14.764312 #3381936] INFO -- : [725/885] 3422787=test_gem_commands_signout_command I, [2024-05-21T19:48:14.774121 #3381936] INFO -- : [726/885] 3422787=test_gem_package_tar_reader I, [2024-05-21T19:48:14.854200 #3381936] INFO -- : [727/885] 3422787=test_gem_source_fetch_problem I, [2024-05-21T19:48:14.876160 #3381936] INFO -- : [728/885] 3422787=test_encoding I, [2024-05-21T19:48:14.927522 #3381936] INFO -- : [729/885] 3422787=test_install I, [2024-05-21T19:48:15.185396 #3381936] INFO -- : [730/885] 3422787=test_rdoc_comment I, [2024-05-21T19:48:15.233562 #3381936] INFO -- : [731/885] 3422787=test_sockopt I, [2024-05-21T19:48:15.245778 #3381936] INFO -- : [732/885] 3422787=test_ftp I, [2024-05-21T19:48:15.260845 #3381936] INFO -- : [733/885] 3422787=test_arithmetic_sequence I, [2024-05-21T19:48:15.275603 #3381936] INFO -- : [734/885] 3422787=test_ractor_compatibility I, [2024-05-21T19:48:15.648739 #3381936] INFO -- : [735/885] 3422787=integer_parse_test I, [2024-05-21T19:48:15.666694 #3381936] INFO -- : [736/885] 3422787=test_autoconf I, [2024-05-21T19:48:15.672072 #3381936] INFO -- : [737/885] 3422787=test_find_executable I, [2024-05-21T19:48:15.691973 #3381936] INFO -- : [738/885] 3422787=test_lazy_enumerator I, [2024-05-21T19:48:16.146964 #3381936] INFO -- : [739/885] 3422787=test_cgi_multipart I, [2024-05-21T19:48:16.258158 #3381936] INFO -- : [740/885] 3422787=test_gem_request_set_lockfile_tokenizer I, [2024-05-21T19:48:16.325270 #3381936] INFO -- : [741/885] 3422787=test_gem_source I, [2024-05-21T19:48:16.668457 #3381936] INFO -- : [742/885] 3422787=test_mkmf I, [2024-05-21T19:48:16.730041 #3381936] INFO -- : [743/885] 3422787=test_have_macro I, [2024-05-21T19:48:16.978290 #3381936] INFO -- : [744/885] 3422787=test_class I, [2024-05-21T19:48:16.992089 #3381936] INFO -- : [745/885] 3422787=test_benchmark I, [2024-05-21T19:48:17.176307 #3381936] INFO -- : [746/885] 3422789=test_at_exit I, [2024-05-21T19:48:17.211759 #3381936] INFO -- : [747/885] 3422789=test_gem_package I, [2024-05-21T19:48:17.346079 #3381936] INFO -- : [748/885] 3422788=test_array I, [2024-05-21T19:48:18.000467 #3381936] INFO -- : [749/885] 3422789=test_autoload I, [2024-05-21T19:48:18.973843 #3381936] INFO -- : [750/885] 3422787=dispatcher_test I, [2024-05-21T19:48:18.985657 #3381936] INFO -- : [751/885] 3422787=test_eval_history I, [2024-05-21T19:48:19.002523 #3381936] INFO -- : [752/885] 3422787=test_unicode I, [2024-05-21T19:48:19.009142 #3381936] INFO -- : [753/885] 3422787=test_files_ext I, [2024-05-21T19:48:19.012907 #3381936] INFO -- : [754/885] 3422787=test_assembler I, [2024-05-21T19:48:19.027684 #3381936] INFO -- : [755/885] 3422787=test_stringio I, [2024-05-21T19:48:19.119449 #3381936] INFO -- : [756/885] 3422787=test_thread_cv I, [2024-05-21T19:48:19.775328 #3381936] INFO -- : [757/885] 3422787=test_random I, [2024-05-21T19:48:19.960102 #3381936] INFO -- : [758/885] 3422787=test_gem_source_git I, [2024-05-21T19:48:21.043344 #3381936] INFO -- : [759/885] 3422787=test_regex_casefold I, [2024-05-21T19:48:21.449572 #3381936] INFO -- : [760/885] 3422787=test_win32ole_method I, [2024-05-21T19:48:21.458721 #3381936] INFO -- : [761/885] 3422787=test_lexer I, [2024-05-21T19:48:21.476296 #3381936] INFO -- : [762/885] 3422787=test_ripper I, [2024-05-21T19:48:21.793894 #3381936] INFO -- : [763/885] 3422787=test_tmpdir I, [2024-05-21T19:48:21.873601 #3381936] INFO -- : [764/885] 3422787=test_struct I, [2024-05-21T19:48:22.409643 #3381936] INFO -- : [765/885] 3422787=test_rdoc_token_stream I, [2024-05-21T19:48:22.435420 #3381936] INFO -- : [766/885] 3422787=test_mutex I, [2024-05-21T19:48:22.872679 #3381936] INFO -- : [767/885] 3422789=heredoc_dedent_test I, [2024-05-21T19:48:22.880625 #3381936] INFO -- : [768/885] 3422789=test_type I, [2024-05-21T19:48:22.890562 #3381936] INFO -- : [769/885] 3422789=test_gem_ext_cargo_builder_link_flag_converter I, [2024-05-21T19:48:22.966683 #3381936] INFO -- : [770/885] 3422789=test_gem_local_remote_options I, [2024-05-21T19:48:23.139927 #3381936] INFO -- : [771/885] 3422789=test_dup I, [2024-05-21T19:48:23.162428 #3381936] INFO -- : [772/885] 3422789=test_rdoc_single_class I, [2024-05-21T19:48:23.172712 #3381936] INFO -- : [773/885] 3422789=test_acceptable I, [2024-05-21T19:48:23.341684 #3381936] INFO -- : [774/885] 3422789=test_gem_resolver_git_set I, [2024-05-21T19:48:23.558084 #3381936] INFO -- : [775/885] 3422787=test_gem_commands_check_command I, [2024-05-21T19:48:23.614759 #3381936] INFO -- : [776/885] 3422787=test_signedness I, [2024-05-21T19:48:23.880752 #3381936] INFO -- : [777/885] 3422789=test_digest I, [2024-05-21T19:48:24.668911 #3381936] INFO -- : [778/885] 3422789=test_gem_safe_marshal I, [2024-05-21T19:48:25.344734 #3381936] INFO -- : [779/885] 3422787=test_rdoc_ri_driver I, [2024-05-21T19:48:25.378297 #3381936] INFO -- : [780/885] 3422789=test_sexp I, [2024-05-21T19:48:25.398303 #3381936] INFO -- : [781/885] 3422789=test_httpheader I, [2024-05-21T19:48:25.411346 #3381936] INFO -- : [782/885] 3422789=test_ractor I, [2024-05-21T19:48:25.481246 #3381936] INFO -- : [783/885] 3422789=test_fiddle I, [2024-05-21T19:48:25.694056 #3381936] INFO -- : [784/885] 3422789=json_generic_object_test I, [2024-05-21T19:48:25.709367 #3381936] INFO -- : [785/885] 3422789=test_gem_resolver_vendor_specification I, [2024-05-21T19:48:25.734390 #3381936] INFO -- : [786/885] 3422789=test_date_arith I, [2024-05-21T19:48:25.743642 #3381936] INFO -- : [787/885] 3422789=test_ractor I, [2024-05-21T19:48:25.843051 #3381936] INFO -- : [788/885] 3422789=test_exception_at_throwing I, [2024-05-21T19:48:25.887276 #3381936] INFO -- : [789/885] 3422787=test_gem_resolver_installed_specification I, [2024-05-21T19:48:25.902141 #3381936] INFO -- : [790/885] 3422789=test_stringscanner I, [2024-05-21T19:48:25.913367 #3381936] INFO -- : [791/885] 3422787=test_logdevice I, [2024-05-21T19:48:25.966870 #3381936] INFO -- : [792/885] 3422789=test_ast I, [2024-05-21T19:48:26.952702 #3381936] INFO -- : [793/885] 3422787=test_irb I, [2024-05-21T19:48:27.239091 #3381936] INFO -- : [794/885] 3422787=test_x509cert I, [2024-05-21T19:48:27.325464 #3381936] INFO -- : [795/885] 3422787=test_rdoc_markup_paragraph I, [2024-05-21T19:48:27.341639 #3381936] INFO -- : [796/885] 3422787=test_require_path_check I, [2024-05-21T19:48:27.429773 #3381936] INFO -- : [797/885] 3422787=test_bn I, [2024-05-21T19:48:27.441614 #3381936] INFO -- : [798/885] 3422787=test_variable_name_check I, [2024-05-21T19:48:27.502151 #3381936] INFO -- : [799/885] 3422787=test_gem_request_set_gem_dependency_api I, [2024-05-21T19:48:27.786270 #3381936] INFO -- : [800/885] 3422787=test_name_error_extension I, [2024-05-21T19:48:27.798260 #3381936] INFO -- : [801/885] 3422787=test_rdoc_markup_to_ansi I, [2024-05-21T19:48:27.861693 #3381936] INFO -- : [802/885] 3422787=test_weakkeymap I, [2024-05-21T19:48:28.557036 #3381936] INFO -- : [803/885] 3422787=test_files_test I, [2024-05-21T19:48:28.566236 #3381936] INFO -- : [804/885] 3422787=test_protocol I, [2024-05-21T19:48:28.880592 #3381936] INFO -- : [805/885] 3422787=test_evaluation I, [2024-05-21T19:48:28.882906 #3381936] INFO -- : [806/885] 3422787=test_https I, [2024-05-21T19:48:29.050647 #3381936] INFO -- : [807/885] 3422787=test_gem_commands_info_command I, [2024-05-21T19:48:29.062461 #3381936] INFO -- : [808/885] 3422787=test_object_create_start I, [2024-05-21T19:48:29.075223 #3381936] INFO -- : [809/885] 3422787=test_io_wait_uncommon I, [2024-05-21T19:48:29.088822 #3381936] INFO -- : [810/885] 3422787=test_gem_ci_detector I, [2024-05-21T19:48:29.097577 #3381936] INFO -- : [811/885] 3422787=test_gem_silent_ui I, [2024-05-21T19:48:29.153760 #3381936] INFO -- : [812/885] 3422787=test_signal I, [2024-05-21T19:48:31.215834 #3381936] INFO -- : [813/885] 3422787=test_fixnum I, [2024-05-21T19:48:31.239832 #3381936] INFO -- : [814/885] 3422787=test_continuation I, [2024-05-21T19:48:31.243450 #3381936] INFO -- : [815/885] 3422787=test_file_exhaustive I, [2024-05-21T19:48:31.466734 #3381936] INFO -- : [816/885] 3422788=test_completion I, [2024-05-21T19:48:32.600838 #3381936] INFO -- : [817/885] 3422788=test_handle I, [2024-05-21T19:48:33.626179 #3381936] INFO -- : [818/885] 3422788=parse_stream_test I, [2024-05-21T19:48:33.642775 #3381936] INFO -- : [819/885] 3422788=test_delete I, [2024-05-21T19:48:33.651979 #3381936] INFO -- : [820/885] 3422788=test_rdoc_markup_document I, [2024-05-21T19:48:33.675449 #3381936] INFO -- : [821/885] 3422788=test_gem_security_policy I, [2024-05-21T19:48:34.066554 #3381936] INFO -- : [822/885] 3422788=test_rational2 I, [2024-05-21T19:48:34.069784 #3381936] INFO -- : [823/885] 3422788=test_case_comprehensive I, [2024-05-21T19:48:45.886911 #3381936] INFO -- : [824/885] 3422787=test_logperiod I, [2024-05-21T19:48:45.897144 #3381936] INFO -- : [825/885] 3422787=test_placearg I, [2024-05-21T19:48:46.038424 #3381936] INFO -- : [826/885] 3422787=test_ssl_session I, [2024-05-21T19:48:46.839360 #3381936] INFO -- : [827/885] 3422787=test_gem_package_tar_header I, [2024-05-21T19:48:46.900049 #3381936] INFO -- : [828/885] 3422787=test_tracer I, [2024-05-21T19:48:46.901807 #3381936] INFO -- : [829/885] 3422787=test_cgi_cookie I, [2024-05-21T19:48:46.912810 #3381936] INFO -- : [830/885] 3422787=test_not I, [2024-05-21T19:48:46.923898 #3381936] INFO -- : [831/885] 3422787=test_option I, [2024-05-21T19:48:47.050817 #3381936] INFO -- : [832/885] 3422787=test_wss I, [2024-05-21T19:48:47.159152 #3381936] INFO -- : [833/885] 3422787=test_rdoc_markup_attribute_manager I, [2024-05-21T19:48:47.197825 #3381936] INFO -- : [834/885] 3422787=test_require I, [2024-05-21T19:48:49.667957 #3381936] INFO -- : [835/885] 3422787=test_objectspace I, [2024-05-21T19:48:50.675816 #3381936] INFO -- : [836/885] 3422787=test_debugger_integration I, [2024-05-21T19:48:50.689203 #3381936] INFO -- : [837/885] 3422787=test_gem_resolver_composed_set I, [2024-05-21T19:48:50.706754 #3381936] INFO -- : [838/885] 3422787=test_my_integer I, [2024-05-21T19:48:50.751713 #3381936] INFO -- : [839/885] 3422787=test_require_lib I, [2024-05-21T19:48:53.696362 #3381936] INFO -- : [840/885] 3422787=test_gem_gem_runner I, [2024-05-21T19:48:53.752720 #3381936] INFO -- : [841/885] 3422787=test_metaclass I, [2024-05-21T19:48:53.762834 #3381936] INFO -- : [842/885] 3422787=test_rdoc_rd_block_parser I, [2024-05-21T19:48:53.931471 #3381936] INFO -- : [843/885] 3422787=test_x509store I, [2024-05-21T19:48:54.182456 #3381936] INFO -- : [844/885] 3422788=test_rdoc_rd I, [2024-05-21T19:48:54.194818 #3381936] INFO -- : [845/885] 3422788=test_rdoc_markup_to_markdown I, [2024-05-21T19:48:54.240395 #3381936] INFO -- : [846/885] 3422788=test_rdoc_markup_to_joined_paragraph I, [2024-05-21T19:48:54.251057 #3381936] INFO -- : [847/885] 3422788=test_rdoc_generator_pot I, [2024-05-21T19:48:54.255999 #3381936] INFO -- : [848/885] 3422788=test_load I, [2024-05-21T19:48:54.259597 #3381936] INFO -- : [849/885] 3422788=test_win32ole_type I, [2024-05-21T19:48:54.270931 #3381936] INFO -- : [850/885] 3422788=test_rdoc_rd_inline_parser I, [2024-05-21T19:48:54.289570 #3381936] INFO -- : [851/885] 3422788=test_cipher I, [2024-05-21T19:48:54.328030 #3381936] INFO -- : [852/885] 3422788=test_update I, [2024-05-21T19:48:54.338868 #3381936] INFO -- : [853/885] 3422788=test_new I, [2024-05-21T19:48:54.350943 #3381936] INFO -- : [854/885] 3422788=test_gem_source_lock I, [2024-05-21T19:48:54.409703 #3381936] INFO -- : [855/885] 3422788=test_depth_first I, [2024-05-21T19:48:54.419277 #3381936] INFO -- : [856/885] 3422788=test_change_word I, [2024-05-21T19:48:54.433317 #3381936] INFO -- : [857/885] 3422788=test_config I, [2024-05-21T19:48:54.445274 #3381936] INFO -- : [858/885] 3422787=test_ostruct I, [2024-05-21T19:48:54.533954 #3381936] INFO -- : [859/885] 3422788=test_rubyvm I, [2024-05-21T19:48:54.548638 #3381936] INFO -- : [860/885] 3422788=fuzzer_test I, [2024-05-21T19:48:54.598677 #3381936] INFO -- : [861/885] 3422788=test_cparser I, [2024-05-21T19:48:54.613766 #3381936] INFO -- : [862/885] 3422787=static_inspect_test I, [2024-05-21T19:48:54.624961 #3381936] INFO -- : [863/885] 3422787=test_struct I, [2024-05-21T19:48:54.683105 #3381936] INFO -- : [864/885] 3422787=test_c_struct_entry I, [2024-05-21T19:48:56.152567 #3381936] INFO -- : [865/885] 3422787=test_rdoc_parser_markdown I, [2024-05-21T19:48:56.178731 #3381936] INFO -- : [866/885] 3422787=test_custom_command I, [2024-05-21T19:48:56.190934 #3381936] INFO -- : [867/885] 3422787=test_key_error I, [2024-05-21T19:48:56.193891 #3381936] INFO -- : [868/885] 3422787=test_win32ole_param I, [2024-05-21T19:48:56.197556 #3381936] INFO -- : [869/885] 3422787=test_engine I, [2024-05-21T19:48:56.702437 #3381936] INFO -- : [870/885] 3422787=test_gem_commands_mirror I, [2024-05-21T19:48:56.726614 #3381936] INFO -- : [871/885] 3422787=test_fiber I, [2024-05-21T19:48:57.080409 #3381936] INFO -- : [872/885] 3422788=test_gem_package_task I, [2024-05-21T19:48:57.096392 #3381936] INFO -- : [873/885] 3422788=test_lock_native_thread I, [2024-05-21T19:48:57.392681 #3381936] INFO -- : [874/885] 3422788=test_resize I, [2024-05-21T19:48:57.423249 #3381936] INFO -- : [875/885] 3422788=test_abi I, [2024-05-21T19:48:57.554404 #3381936] INFO -- : [876/885] 3422788=test_load I, [2024-05-21T19:48:57.615892 #3381936] INFO -- : [877/885] 3422788=test_bundled_ca I, [2024-05-21T19:48:59.273501 #3381936] INFO -- : [878/885] 3422788=test_integer_comb I, [2024-05-21T19:49:01.968544 #3381936] INFO -- : [879/885] 3422788=test_ssl I, [2024-05-21T19:49:02.956749 #3381936] INFO -- : [880/885] 3422787=test_gem_security_trust_dir I, [2024-05-21T19:49:03.030871 #3381936] INFO -- : [881/885] 3422787=test_module I, [2024-05-21T19:49:08.472383 #3381936] INFO -- : [882/885] 3422787=test_erb_command I, [2024-05-21T19:49:08.556986 #3381936] INFO -- : [883/885] 3422787=test_usrmarshal I, [2024-05-21T19:49:08.692388 #3381936] INFO -- : [884/885] 3422787=test_gem_source_installed I, [2024-05-21T19:49:08.708124 #3381936] INFO -- : [885/885] 3422787=test_gem_validator I, [2024-05-21T19:49:12.527015 #3381936] INFO -- : Finished tests in 205.288309s, 128.3074 tests/s, 45568.9467 assertions/s. I, [2024-05-21T19:49:12.531908 #3381936] INFO -- : 26340 tests, 9354772 assertions, 0 failures, 0 errors, 320 skips I, [2024-05-21T19:49:12.531940 #3381936] INFO -- : I, [2024-05-21T19:49:12.531952 #3381936] INFO -- : ruby -v: ruby 3.4.0dev (2024-05-21T18:45:16Z master b20adf90e3) [aarch64-linux] I, [2024-05-21T19:49:12.532883 #3381936] INFO -- : $$$[end] "make yes-test-all TESTOPTS='--stderr-on-failure' TESTS='-j3'" exit with 0. I, [2024-05-21T19:49:12.533024 #3381936] INFO -- : $$$[beg] make yes-test-rubyspec MSPECOPT='--error-output stderr --debug -j' TESTS='-j3' I, [2024-05-21T19:49:12.658716 #3381936] INFO -- : BASERUBY = /usr/local/bin/ruby --disable=gems I, [2024-05-21T19:49:12.658795 #3381936] INFO -- : CC = gcc I, [2024-05-21T19:49:12.658807 #3381936] INFO -- : LD = ld I, [2024-05-21T19:49:12.658816 #3381936] INFO -- : LDSHARED = gcc -shared I, [2024-05-21T19:49:12.658827 #3381936] INFO -- : CFLAGS = -O3 -fno-fast-math -ggdb3 -Wall -Wextra -Wdeprecated-declarations -Wdiv-by-zero -Wduplicated-cond -Wimplicit-function-declaration -Wimplicit-int -Wpointer-arith -Wwrite-strings -Wold-style-definition -Wimplicit-fallthrough=0 -Wmissing-noreturn -Wno-cast-function-type -Wno-constant-logical-operand -Wno-long-long -Wno-missing-field-initializers -Wno-overlength-strings -Wno-packed-bitfield-compat -Wno-parentheses-equality -Wno-self-assign -Wno-tautological-compare -Wno-unused-parameter -Wno-unused-value -Wsuggest-attribute=format -Wsuggest-attribute=noreturn -Wunused-variable -Wmisleading-indentation -Wundef I, [2024-05-21T19:49:12.658837 #3381936] INFO -- : XCFLAGS = -U_FORTIFY_SOURCE -D_FORTIFY_SOURCE=2 -fstack-protector-strong -msign-return-address=all -fno-strict-overflow -fvisibility=hidden -fexcess-precision=standard -DRUBY_EXPORT -fPIE -I. -I.ext/include/aarch64-linux -I/home/opc/ruby/src/master/include -I/home/opc/ruby/src/master -I/home/opc/ruby/src/master/prism -I/home/opc/ruby/src/master/enc/unicode/15.0.0 I, [2024-05-21T19:49:12.658847 #3381936] INFO -- : CPPFLAGS = I, [2024-05-21T19:49:12.658856 #3381936] INFO -- : DLDFLAGS = -Wl,--compress-debug-sections=zlib -fstack-protector-strong -pie I, [2024-05-21T19:49:12.658866 #3381936] INFO -- : SOLIBS = -lz -lrt -lrt -ldl -lcrypt -lm -lpthread I, [2024-05-21T19:49:12.658874 #3381936] INFO -- : LANG = en_US.UTF-8 I, [2024-05-21T19:49:12.658883 #3381936] INFO -- : LC_ALL = I, [2024-05-21T19:49:12.658891 #3381936] INFO -- : LC_CTYPE = I, [2024-05-21T19:49:12.658900 #3381936] INFO -- : MFLAGS = I, [2024-05-21T19:49:12.658908 #3381936] INFO -- : RUSTC = rustc I, [2024-05-21T19:49:12.658916 #3381936] INFO -- : YJIT_RUSTC_ARGS = --crate-name=yjit --crate-type=staticlib --edition=2021 -g -C lto=thin -C opt-level=3 -C overflow-checks=on '--out-dir=/home/opc/ruby/build/master/yjit/target/release/' /home/opc/ruby/src/master/yjit/src/lib.rs I, [2024-05-21T19:49:12.659568 #3381936] INFO -- : gcc (GCC) 8.5.0 20210514 (Red Hat 8.5.0-10.1.0.1) I, [2024-05-21T19:49:12.659587 #3381936] INFO -- : Copyright (C) 2018 Free Software Foundation, Inc. I, [2024-05-21T19:49:12.659597 #3381936] INFO -- : This is free software; see the source for copying conditions. There is NO I, [2024-05-21T19:49:12.659606 #3381936] INFO -- : warranty; not even for MERCHANTABILITY or FITNESS FOR A PARTICULAR PURPOSE. I, [2024-05-21T19:49:12.659614 #3381936] INFO -- : I, [2024-05-21T19:49:12.661613 #3381936] INFO -- : generating enc.mk I, [2024-05-21T19:49:12.895128 #3381936] INFO -- : generating encdb.h I, [2024-05-21T19:49:12.931873 #3381936] INFO -- : encdb.h unchanged I, [2024-05-21T19:49:12.933086 #3381936] INFO -- : making enc I, [2024-05-21T19:49:12.960858 #3381936] INFO -- : make[1]: Entering directory '/home/opc/ruby/build/master' I, [2024-05-21T19:49:12.960913 #3381936] INFO -- : make[1]: Nothing to be done for 'enc'. I, [2024-05-21T19:49:12.960924 #3381936] INFO -- : make[1]: Leaving directory '/home/opc/ruby/build/master' I, [2024-05-21T19:49:12.961611 #3381936] INFO -- : making srcs under enc I, [2024-05-21T19:49:13.004049 #3381936] INFO -- : make[1]: Entering directory '/home/opc/ruby/build/master' I, [2024-05-21T19:49:13.004094 #3381936] INFO -- : make[1]: Nothing to be done for 'srcs'. I, [2024-05-21T19:49:13.004105 #3381936] INFO -- : make[1]: Leaving directory '/home/opc/ruby/build/master' I, [2024-05-21T19:49:13.005283 #3381936] INFO -- : generating transdb.h I, [2024-05-21T19:49:13.150745 #3381936] INFO -- : transdb.h unchanged I, [2024-05-21T19:49:13.152146 #3381936] INFO -- : making trans I, [2024-05-21T19:49:13.201617 #3381936] INFO -- : make[1]: Entering directory '/home/opc/ruby/build/master' I, [2024-05-21T19:49:13.201696 #3381936] INFO -- : make[1]: Nothing to be done for 'trans'. I, [2024-05-21T19:49:13.201706 #3381936] INFO -- : make[1]: Leaving directory '/home/opc/ruby/build/master' I, [2024-05-21T19:49:13.202459 #3381936] INFO -- : making encs I, [2024-05-21T19:49:13.255601 #3381936] INFO -- : make[1]: Entering directory '/home/opc/ruby/build/master' I, [2024-05-21T19:49:13.255667 #3381936] INFO -- : make[1]: Nothing to be done for 'encs'. I, [2024-05-21T19:49:13.255678 #3381936] INFO -- : make[1]: Leaving directory '/home/opc/ruby/build/master' I, [2024-05-21T19:49:13.257711 #3381936] INFO -- : generating makefiles ext/configure-ext.mk I, [2024-05-21T19:49:13.298972 #3381936] INFO -- : ext/configure-ext.mk updated I, [2024-05-21T19:49:13.302448 #3381936] INFO -- : make[1]: Entering directory '/home/opc/ruby/build/master' I, [2024-05-21T19:49:15.438252 #3381936] INFO -- : make[1]: Leaving directory '/home/opc/ruby/build/master' I, [2024-05-21T19:49:15.438960 #3381936] INFO -- : generating makefile exts.mk I, [2024-05-21T19:49:15.497423 #3381936] INFO -- : exts.mk unchanged I, [2024-05-21T19:49:15.502305 #3381936] INFO -- : make[1]: Entering directory '/home/opc/ruby/build/master' I, [2024-05-21T19:49:15.797506 #3381936] INFO -- : make[2]: Entering directory '/home/opc/ruby/build/master/ext/coverage' I, [2024-05-21T19:49:15.802255 #3381936] INFO -- : make[2]: Leaving directory '/home/opc/ruby/build/master/ext/coverage' I, [2024-05-21T19:49:15.807882 #3381936] INFO -- : make[2]: Entering directory '/home/opc/ruby/build/master/ext/date' I, [2024-05-21T19:49:15.812984 #3381936] INFO -- : make[2]: Leaving directory '/home/opc/ruby/build/master/ext/date' I, [2024-05-21T19:49:15.816413 #3381936] INFO -- : make[2]: Entering directory '/home/opc/ruby/build/master/ext/digest' I, [2024-05-21T19:49:15.825439 #3381936] INFO -- : make[2]: Leaving directory '/home/opc/ruby/build/master/ext/digest' I, [2024-05-21T19:49:15.847950 #3381936] INFO -- : make[2]: Entering directory '/home/opc/ruby/build/master/ext/digest/sha2' I, [2024-05-21T19:49:15.852935 #3381936] INFO -- : make[2]: Leaving directory '/home/opc/ruby/build/master/ext/digest/sha2' I, [2024-05-21T19:49:15.871094 #3381936] INFO -- : make[2]: Entering directory '/home/opc/ruby/build/master/ext/fiddle' I, [2024-05-21T19:49:15.881331 #3381936] INFO -- : make[2]: Leaving directory '/home/opc/ruby/build/master/ext/fiddle' I, [2024-05-21T19:49:15.885616 #3381936] INFO -- : make[2]: Entering directory '/home/opc/ruby/build/master/ext/io/console' I, [2024-05-21T19:49:15.889819 #3381936] INFO -- : make[2]: Leaving directory '/home/opc/ruby/build/master/ext/io/console' I, [2024-05-21T19:49:15.900322 #3381936] INFO -- : make[2]: Entering directory '/home/opc/ruby/build/master/ext/json' I, [2024-05-21T19:49:15.909624 #3381936] INFO -- : make[2]: Leaving directory '/home/opc/ruby/build/master/ext/json' I, [2024-05-21T19:49:15.922501 #3381936] INFO -- : make[2]: Entering directory '/home/opc/ruby/build/master/ext/monitor' I, [2024-05-21T19:49:15.926670 #3381936] INFO -- : make[2]: Leaving directory '/home/opc/ruby/build/master/ext/monitor' I, [2024-05-21T19:49:15.933023 #3381936] INFO -- : make[2]: Entering directory '/home/opc/ruby/build/master/ext/objspace' I, [2024-05-21T19:49:15.939070 #3381936] INFO -- : make[2]: Leaving directory '/home/opc/ruby/build/master/ext/objspace' I, [2024-05-21T19:49:15.958312 #3381936] INFO -- : make[2]: Entering directory '/home/opc/ruby/build/master/ext/openssl' I, [2024-05-21T19:49:15.980057 #3381936] INFO -- : make[2]: Leaving directory '/home/opc/ruby/build/master/ext/openssl' I, [2024-05-21T19:49:15.984328 #3381936] INFO -- : make[2]: Entering directory '/home/opc/ruby/build/master/ext/pathname' I, [2024-05-21T19:49:15.988457 #3381936] INFO -- : make[2]: Leaving directory '/home/opc/ruby/build/master/ext/pathname' I, [2024-05-21T19:49:15.994866 #3381936] INFO -- : make[2]: Entering directory '/home/opc/ruby/build/master/ext/psych' I, [2024-05-21T19:49:16.016395 #3381936] INFO -- : make[2]: Leaving directory '/home/opc/ruby/build/master/ext/psych' I, [2024-05-21T19:49:16.020889 #3381936] INFO -- : make[2]: Entering directory '/home/opc/ruby/build/master/ext/pty' I, [2024-05-21T19:49:16.025284 #3381936] INFO -- : make[2]: Leaving directory '/home/opc/ruby/build/master/ext/pty' I, [2024-05-21T19:49:16.039640 #3381936] INFO -- : make[2]: Entering directory '/home/opc/ruby/build/master/ext/ripper' I, [2024-05-21T19:49:16.047668 #3381936] INFO -- : make[2]: Leaving directory '/home/opc/ruby/build/master/ext/ripper' I, [2024-05-21T19:49:16.049717 #3381936] INFO -- : make[2]: Entering directory '/home/opc/ruby/build/master/ext/rubyvm' I, [2024-05-21T19:49:16.053176 #3381936] INFO -- : make[2]: Leaving directory '/home/opc/ruby/build/master/ext/rubyvm' I, [2024-05-21T19:49:16.065556 #3381936] INFO -- : make[2]: Entering directory '/home/opc/ruby/build/master/ext/socket' I, [2024-05-21T19:49:16.076181 #3381936] INFO -- : make[2]: Leaving directory '/home/opc/ruby/build/master/ext/socket' I, [2024-05-21T19:49:16.091916 #3381936] INFO -- : make[2]: Entering directory '/home/opc/ruby/build/master/.bundle/gems/bigdecimal-3.1.7/ext/bigdecimal' I, [2024-05-21T19:49:16.122732 #3381936] INFO -- : make[2]: Leaving directory '/home/opc/ruby/build/master/.bundle/gems/bigdecimal-3.1.7/ext/bigdecimal' I, [2024-05-21T19:49:16.125519 #3381936] INFO -- : make[2]: Entering directory '/home/opc/ruby/build/master/.bundle/gems/bigdecimal-3.1.8/ext/bigdecimal' I, [2024-05-21T19:49:16.156700 #3381936] INFO -- : make[2]: Leaving directory '/home/opc/ruby/build/master/.bundle/gems/bigdecimal-3.1.8/ext/bigdecimal' I, [2024-05-21T19:49:16.159309 #3381936] INFO -- : make[2]: Entering directory '/home/opc/ruby/build/master/.bundle/gems/debug-1.9.2/ext/debug' I, [2024-05-21T19:49:16.189808 #3381936] INFO -- : make[2]: Leaving directory '/home/opc/ruby/build/master/.bundle/gems/debug-1.9.2/ext/debug' I, [2024-05-21T19:49:16.192575 #3381936] INFO -- : make[2]: Entering directory '/home/opc/ruby/build/master/.bundle/gems/nkf-0.2.0/ext/nkf' I, [2024-05-21T19:49:16.223123 #3381936] INFO -- : make[2]: Leaving directory '/home/opc/ruby/build/master/.bundle/gems/nkf-0.2.0/ext/nkf' I, [2024-05-21T19:49:16.225667 #3381936] INFO -- : make[2]: Entering directory '/home/opc/ruby/build/master/.bundle/gems/racc-1.7.3/ext/racc/cparse' I, [2024-05-21T19:49:16.256340 #3381936] INFO -- : make[2]: Leaving directory '/home/opc/ruby/build/master/.bundle/gems/racc-1.7.3/ext/racc/cparse' I, [2024-05-21T19:49:16.258787 #3381936] INFO -- : make[2]: Entering directory '/home/opc/ruby/build/master/.bundle/gems/racc-1.8.0/ext/racc/cparse' I, [2024-05-21T19:49:16.289424 #3381936] INFO -- : make[2]: Leaving directory '/home/opc/ruby/build/master/.bundle/gems/racc-1.8.0/ext/racc/cparse' I, [2024-05-21T19:49:16.292359 #3381936] INFO -- : make[2]: Entering directory '/home/opc/ruby/build/master/.bundle/gems/rbs-3.4.4/ext/rbs_extension' I, [2024-05-21T19:49:16.322586 #3381936] INFO -- : make[2]: Leaving directory '/home/opc/ruby/build/master/.bundle/gems/rbs-3.4.4/ext/rbs_extension' I, [2024-05-21T19:49:16.325069 #3381936] INFO -- : make[2]: Entering directory '/home/opc/ruby/build/master/.bundle/gems/syslog-0.1.2/ext/syslog' I, [2024-05-21T19:49:16.355343 #3381936] INFO -- : make[2]: Leaving directory '/home/opc/ruby/build/master/.bundle/gems/syslog-0.1.2/ext/syslog' I, [2024-05-21T19:49:16.393393 #3381936] INFO -- : make[2]: Entering directory '/home/opc/ruby/build/master' I, [2024-05-21T19:49:16.476042 #3381936] INFO -- : make[2]: 'ruby' is up to date. I, [2024-05-21T19:49:16.476116 #3381936] INFO -- : make[2]: Leaving directory '/home/opc/ruby/build/master' I, [2024-05-21T19:49:16.476241 #3381936] INFO -- : make[1]: Leaving directory '/home/opc/ruby/build/master' I, [2024-05-21T19:49:16.480656 #3381936] INFO -- : make[1]: Entering directory '/home/opc/ruby/build/master' I, [2024-05-21T19:49:16.480705 #3381936] INFO -- : make[1]: Nothing to be done for 'note'. I, [2024-05-21T19:49:16.480716 #3381936] INFO -- : make[1]: Leaving directory '/home/opc/ruby/build/master' E, [2024-05-21T19:49:16.555354 #3381936] ERROR -- : $ /home/opc/ruby/build/master/miniruby -I/home/opc/ruby/src/master/lib /home/opc/ruby/src/master/tool/runruby.rb --archdir=/home/opc/ruby/build/master --extout=.ext -- /home/opc/ruby/src/master/spec/mspec/bin/mspec-run -B /home/opc/ruby/src/master/spec/default.mspec --error-output stderr --debug -fy -o /tmp/rubytest.86ednq/1-mspec-multi-0 E, [2024-05-21T19:49:16.555695 #3381936] ERROR -- : $ /home/opc/ruby/build/master/miniruby -I/home/opc/ruby/src/master/lib /home/opc/ruby/src/master/tool/runruby.rb --archdir=/home/opc/ruby/build/master --extout=.ext -- /home/opc/ruby/src/master/spec/mspec/bin/mspec-run -B /home/opc/ruby/src/master/spec/default.mspec --error-output stderr --debug -fy -o /tmp/rubytest.86ednq/2-mspec-multi-1 E, [2024-05-21T19:49:16.555948 #3381936] ERROR -- : $ /home/opc/ruby/build/master/miniruby -I/home/opc/ruby/src/master/lib /home/opc/ruby/src/master/tool/runruby.rb --archdir=/home/opc/ruby/build/master --extout=.ext -- /home/opc/ruby/src/master/spec/mspec/bin/mspec-run -B /home/opc/ruby/src/master/spec/default.mspec --error-output stderr --debug -fy -o /tmp/rubytest.86ednq/3-mspec-multi-2 I, [2024-05-21T19:49:16.686918 #3381936] INFO -- : ruby 3.4.0dev (2024-05-21T18:45:16Z master b20adf90e3) [aarch64-linux] I, [2024-05-21T19:49:22.139476 #3381936] INFO -- : 0 ......................................................................... I, [2024-05-21T19:49:24.557125 #3381936] INFO -- : 73 ......................................................................... I, [2024-05-21T19:49:24.730524 #3381936] INFO -- : 146 ......................................................................... I, [2024-05-21T19:49:25.018662 #3381936] INFO -- : 219 ......................................................................... I, [2024-05-21T19:49:25.180311 #3381936] INFO -- : 292 ......................................................................... I, [2024-05-21T19:49:25.422580 #3381936] INFO -- : 365 ......................................................................... I, [2024-05-21T19:49:25.547519 #3381936] INFO -- : 438 ......................................................................... I, [2024-05-21T19:49:25.607228 #3381936] INFO -- : 511 ......................................................................... I, [2024-05-21T19:49:25.668652 #3381936] INFO -- : 584 ......................................................................... I, [2024-05-21T19:49:26.269685 #3381936] INFO -- : 657 ......................................................................... I, [2024-05-21T19:49:26.364725 #3381936] INFO -- : 730 ......................................................................... I, [2024-05-21T19:49:26.411384 #3381936] INFO -- : 803 ......................................................................... I, [2024-05-21T19:49:26.614072 #3381936] INFO -- : 876 ......................................................................... I, [2024-05-21T19:49:26.722268 #3381936] INFO -- : 949 ......................................................................... I, [2024-05-21T19:49:27.305411 #3381936] INFO -- : 1022 ......................................................................... I, [2024-05-21T19:49:29.595749 #3381936] INFO -- : 1095 ......................................................................... I, [2024-05-21T19:49:30.519955 #3381936] INFO -- : 1168 ......................................................................... I, [2024-05-21T19:49:30.661044 #3381936] INFO -- : 1241 ......................................................................... I, [2024-05-21T19:49:30.897655 #3381936] INFO -- : 1314 ......................................................................... I, [2024-05-21T19:49:30.992629 #3381936] INFO -- : 1387 ......................................................................... I, [2024-05-21T19:49:33.002282 #3381936] INFO -- : 1460 ......................................................................... I, [2024-05-21T19:49:36.380174 #3381936] INFO -- : 1533 ......................................................................... I, [2024-05-21T19:49:36.530455 #3381936] INFO -- : 1606 ......................................................................... I, [2024-05-21T19:49:37.323955 #3381936] INFO -- : 1679 ......................................................................... I, [2024-05-21T19:49:37.587818 #3381936] INFO -- : 1752 ......................................................................... I, [2024-05-21T19:49:37.835891 #3381936] INFO -- : 1825 ......................................................................... I, [2024-05-21T19:49:38.177409 #3381936] INFO -- : 1898 ......................................................................... I, [2024-05-21T19:49:38.563426 #3381936] INFO -- : 1971 ......................................................................... I, [2024-05-21T19:49:39.064087 #3381936] INFO -- : 2044 ......................................................................... I, [2024-05-21T19:49:39.182351 #3381936] INFO -- : 2117 ......................................................................... I, [2024-05-21T19:49:39.241643 #3381936] INFO -- : 2190 ......................................................................... I, [2024-05-21T19:49:39.291988 #3381936] INFO -- : 2263 ......................................................................... I, [2024-05-21T19:49:39.337369 #3381936] INFO -- : 2336 ......................................................................... I, [2024-05-21T19:49:39.428612 #3381936] INFO -- : 2409 ......................................................................... I, [2024-05-21T19:49:39.680506 #3381936] INFO -- : 2482 ......................................................................... I, [2024-05-21T19:49:39.826600 #3381936] INFO -- : 2555 ......................................................................... I, [2024-05-21T19:49:41.099946 #3381936] INFO -- : 2628 ......................................................................... I, [2024-05-21T19:49:41.429880 #3381936] INFO -- : 2701 ......................................................................... I, [2024-05-21T19:49:41.632478 #3381936] INFO -- : 2774 ......................................................................... I, [2024-05-21T19:49:41.958725 #3381936] INFO -- : 2847 ......................................................................... I, [2024-05-21T19:49:42.214349 #3381936] INFO -- : 2920 ......................................................................... I, [2024-05-21T19:49:42.320319 #3381936] INFO -- : 2993 ......................................................................... I, [2024-05-21T19:49:42.388513 #3381936] INFO -- : 3066 ......................................................................... I, [2024-05-21T19:49:42.433448 #3381936] INFO -- : 3139 ......................................................................... I, [2024-05-21T19:49:42.490649 #3381936] INFO -- : 3212 ......................................................................... I, [2024-05-21T19:49:42.554959 #3381936] INFO -- : 3285 ......................................................................... I, [2024-05-21T19:49:46.391143 #3381936] INFO -- : 3358 ......................................................................... I, [2024-05-21T19:49:46.414261 #3381936] INFO -- : I, [2024-05-21T19:49:46.414325 #3381936] INFO -- : I, [2024-05-21T19:49:46.414338 #3381936] INFO -- : Finished in 29.858876 seconds I, [2024-05-21T19:49:46.414347 #3381936] INFO -- : I, [2024-05-21T19:49:46.414356 #3381936] INFO -- : 3430 files, 32648 examples, 172806 expectations, 0 failures, 0 errors, 0 tagged I, [2024-05-21T19:49:46.415562 #3381936] INFO -- : $$$[end] "make yes-test-rubyspec MSPECOPT='--error-output stderr --debug -j' TESTS='-j3'" exit with 0.