# Logfile created on 2024-05-21 15:56:15 +0000 by logger.rb/v1.5.3 I, [2024-05-21T15:56:15.256638 #2068002] INFO -- : #, @formatter=nil, @logdev=#, @binmode=false, @mon_data=#, @mon_data_owner_object_id=860>>> I, [2024-05-21T15:56:15.256927 #2068002] INFO -- : $$$[beg] make update-unicode -j3 I, [2024-05-21T15:56:15.347219 #2068002] INFO -- : Downloading Unicode emoji 15.0 files... I, [2024-05-21T15:56:15.347385 #2068002] INFO -- : Downloading Unicode emoji 15.0 files... I, [2024-05-21T15:56:15.347697 #2068002] INFO -- : Downloading Unicode emoji 15.0 files... I, [2024-05-21T15:56:15.427020 #2068002] INFO -- : made symlink emoji/15.0/emoji-sequences.txt to /home/opc/ruby/src/master/.downloaded-cache/emoji/15.0/emoji-sequences.txt I, [2024-05-21T15:56:15.429708 #2068002] INFO -- : downloading emoji/15.0/emoji-sequences.txt ... downloading emoji/15.0/emoji-test.txt ... /home/opc/ruby/src/master/enc/unicode/data/emoji/15.0/emoji-sequences.txt already exists E, [2024-05-21T15:56:15.919131 #2068002] ERROR -- : /home/opc/ruby/src/master/tool/downloader.rb:302:in `rescue in download': failed to download emoji/15.0/emoji-test.txt (RuntimeError) E, [2024-05-21T15:56:15.919198 #2068002] ERROR -- : OpenURI::HTTPError: 403 Forbidden: https://www.unicode.org/Public/emoji/15.0/emoji-test.txt E, [2024-05-21T15:56:15.919210 #2068002] ERROR -- : from /home/opc/ruby/src/master/tool/downloader.rb:201:in `download' E, [2024-05-21T15:56:15.919220 #2068002] ERROR -- : from /home/opc/ruby/src/master/tool/downloader.rb:136:in `download' E, [2024-05-21T15:56:15.919228 #2068002] ERROR -- : from /home/opc/ruby/src/master/tool/downloader.rb:482:in `block in
' E, [2024-05-21T15:56:15.919236 #2068002] ERROR -- : from /home/opc/ruby/src/master/tool/downloader.rb:465:in `each' E, [2024-05-21T15:56:15.919244 #2068002] ERROR -- : from /home/opc/ruby/src/master/tool/downloader.rb:465:in `
' E, [2024-05-21T15:56:15.919253 #2068002] ERROR -- : /usr/local/lib/ruby/3.2.0/open-uri.rb:369:in `open_http': 403 Forbidden (OpenURI::HTTPError) E, [2024-05-21T15:56:15.919261 #2068002] ERROR -- : from /usr/local/lib/ruby/3.2.0/open-uri.rb:760:in `buffer_open' E, [2024-05-21T15:56:15.919269 #2068002] ERROR -- : from /usr/local/lib/ruby/3.2.0/open-uri.rb:214:in `block in open_loop' E, [2024-05-21T15:56:15.919278 #2068002] ERROR -- : from /usr/local/lib/ruby/3.2.0/open-uri.rb:212:in `catch' E, [2024-05-21T15:56:15.919286 #2068002] ERROR -- : from /usr/local/lib/ruby/3.2.0/open-uri.rb:212:in `open_loop' E, [2024-05-21T15:56:15.919294 #2068002] ERROR -- : from /usr/local/lib/ruby/3.2.0/open-uri.rb:153:in `open_uri' E, [2024-05-21T15:56:15.919302 #2068002] ERROR -- : from /usr/local/lib/ruby/3.2.0/open-uri.rb:740:in `open' E, [2024-05-21T15:56:15.919310 #2068002] ERROR -- : from /usr/local/lib/ruby/3.2.0/open-uri.rb:748:in `read' E, [2024-05-21T15:56:15.919322 #2068002] ERROR -- : from /home/opc/ruby/src/master/tool/downloader.rb:247:in `block in download' E, [2024-05-21T15:56:15.919330 #2068002] ERROR -- : from /home/opc/ruby/src/master/tool/downloader.rb:378:in `with_retry' E, [2024-05-21T15:56:15.919338 #2068002] ERROR -- : from /home/opc/ruby/src/master/tool/downloader.rb:246:in `download' E, [2024-05-21T15:56:15.919346 #2068002] ERROR -- : from /home/opc/ruby/src/master/tool/downloader.rb:136:in `download' E, [2024-05-21T15:56:15.919354 #2068002] ERROR -- : from /home/opc/ruby/src/master/tool/downloader.rb:482:in `block in
' E, [2024-05-21T15:56:15.919363 #2068002] ERROR -- : from /home/opc/ruby/src/master/tool/downloader.rb:465:in `each' E, [2024-05-21T15:56:15.919370 #2068002] ERROR -- : from /home/opc/ruby/src/master/tool/downloader.rb:465:in `
' E, [2024-05-21T15:56:15.922167 #2068002] ERROR -- : make: *** [uncommon.mk:1756: /home/opc/ruby/src/master/enc/unicode/data/emoji/15.0/emoji-sequences.txt] Error 1 E, [2024-05-21T15:56:15.922214 #2068002] ERROR -- : make: *** Deleting file '/home/opc/ruby/src/master/enc/unicode/data/emoji/15.0/emoji-sequences.txt' E, [2024-05-21T15:56:15.922227 #2068002] ERROR -- : make: *** Waiting for unfinished jobs.... E, [2024-05-21T15:56:15.984654 #2068002] ERROR -- : /home/opc/ruby/src/master/tool/downloader.rb:302:in `rescue in download': failed to download emoji/15.0/emoji-test.txt (RuntimeError) E, [2024-05-21T15:56:15.984714 #2068002] ERROR -- : OpenURI::HTTPError: 403 Forbidden: https://www.unicode.org/Public/emoji/15.0/emoji-test.txt E, [2024-05-21T15:56:15.984725 #2068002] ERROR -- : from /home/opc/ruby/src/master/tool/downloader.rb:201:in `download' E, [2024-05-21T15:56:15.984734 #2068002] ERROR -- : from /home/opc/ruby/src/master/tool/downloader.rb:136:in `download' E, [2024-05-21T15:56:15.984742 #2068002] ERROR -- : from /home/opc/ruby/src/master/tool/downloader.rb:482:in `block in
' E, [2024-05-21T15:56:15.984750 #2068002] ERROR -- : from /home/opc/ruby/src/master/tool/downloader.rb:465:in `each' E, [2024-05-21T15:56:15.984758 #2068002] ERROR -- : from /home/opc/ruby/src/master/tool/downloader.rb:465:in `
' E, [2024-05-21T15:56:15.984767 #2068002] ERROR -- : /usr/local/lib/ruby/3.2.0/open-uri.rb:369:in `open_http': 403 Forbidden (OpenURI::HTTPError) E, [2024-05-21T15:56:15.984775 #2068002] ERROR -- : from /usr/local/lib/ruby/3.2.0/open-uri.rb:760:in `buffer_open' E, [2024-05-21T15:56:15.984782 #2068002] ERROR -- : from /usr/local/lib/ruby/3.2.0/open-uri.rb:214:in `block in open_loop' E, [2024-05-21T15:56:15.984791 #2068002] ERROR -- : from /usr/local/lib/ruby/3.2.0/open-uri.rb:212:in `catch' E, [2024-05-21T15:56:15.984799 #2068002] ERROR -- : from /usr/local/lib/ruby/3.2.0/open-uri.rb:212:in `open_loop' E, [2024-05-21T15:56:15.984807 #2068002] ERROR -- : from /usr/local/lib/ruby/3.2.0/open-uri.rb:153:in `open_uri' E, [2024-05-21T15:56:15.984815 #2068002] ERROR -- : from /usr/local/lib/ruby/3.2.0/open-uri.rb:740:in `open' E, [2024-05-21T15:56:15.984823 #2068002] ERROR -- : from /usr/local/lib/ruby/3.2.0/open-uri.rb:748:in `read' E, [2024-05-21T15:56:15.984831 #2068002] ERROR -- : from /home/opc/ruby/src/master/tool/downloader.rb:247:in `block in download' E, [2024-05-21T15:56:15.984840 #2068002] ERROR -- : from /home/opc/ruby/src/master/tool/downloader.rb:378:in `with_retry' E, [2024-05-21T15:56:15.984848 #2068002] ERROR -- : from /home/opc/ruby/src/master/tool/downloader.rb:246:in `download' E, [2024-05-21T15:56:15.984856 #2068002] ERROR -- : from /home/opc/ruby/src/master/tool/downloader.rb:136:in `download' E, [2024-05-21T15:56:15.984864 #2068002] ERROR -- : from /home/opc/ruby/src/master/tool/downloader.rb:482:in `block in
' E, [2024-05-21T15:56:15.984873 #2068002] ERROR -- : from /home/opc/ruby/src/master/tool/downloader.rb:465:in `each' E, [2024-05-21T15:56:15.984881 #2068002] ERROR -- : from /home/opc/ruby/src/master/tool/downloader.rb:465:in `
' E, [2024-05-21T15:56:15.987691 #2068002] ERROR -- : make: *** [uncommon.mk:1756: /home/opc/ruby/src/master/enc/unicode/data/emoji/15.0/emoji-test.txt] Error 1 E, [2024-05-21T15:56:16.396183 #2068002] ERROR -- : /home/opc/ruby/src/master/tool/downloader.rb:302:in `rescue in download': failed to download emoji/15.0/emoji-sequences.txt (RuntimeError) E, [2024-05-21T15:56:16.396254 #2068002] ERROR -- : EOFError: end of file reached: https://www.unicode.org/Public/emoji/15.0/emoji-sequences.txt E, [2024-05-21T15:56:16.396265 #2068002] ERROR -- : from /home/opc/ruby/src/master/tool/downloader.rb:201:in `download' E, [2024-05-21T15:56:16.396274 #2068002] ERROR -- : from /home/opc/ruby/src/master/tool/downloader.rb:136:in `download' E, [2024-05-21T15:56:16.396283 #2068002] ERROR -- : from /home/opc/ruby/src/master/tool/downloader.rb:482:in `block in
' E, [2024-05-21T15:56:16.396291 #2068002] ERROR -- : from /home/opc/ruby/src/master/tool/downloader.rb:465:in `each' E, [2024-05-21T15:56:16.396300 #2068002] ERROR -- : from /home/opc/ruby/src/master/tool/downloader.rb:465:in `
' E, [2024-05-21T15:56:16.396308 #2068002] ERROR -- : /usr/local/lib/ruby/3.2.0/net/protocol.rb:237:in `rbuf_fill': end of file reached (EOFError) E, [2024-05-21T15:56:16.396317 #2068002] ERROR -- : from /usr/local/lib/ruby/3.2.0/net/protocol.rb:199:in `readuntil' E, [2024-05-21T15:56:16.396325 #2068002] ERROR -- : from /usr/local/lib/ruby/3.2.0/net/protocol.rb:209:in `readline' E, [2024-05-21T15:56:16.396333 #2068002] ERROR -- : from /usr/local/lib/ruby/3.2.0/net/http/response.rb:158:in `read_status_line' E, [2024-05-21T15:56:16.396342 #2068002] ERROR -- : from /usr/local/lib/ruby/3.2.0/net/http/response.rb:147:in `read_new' E, [2024-05-21T15:56:16.396351 #2068002] ERROR -- : from /usr/local/lib/ruby/3.2.0/net/http.rb:1862:in `block in transport_request' E, [2024-05-21T15:56:16.396359 #2068002] ERROR -- : from /usr/local/lib/ruby/3.2.0/net/http.rb:1853:in `catch' E, [2024-05-21T15:56:16.396367 #2068002] ERROR -- : from /usr/local/lib/ruby/3.2.0/net/http.rb:1853:in `transport_request' E, [2024-05-21T15:56:16.396375 #2068002] ERROR -- : from /usr/local/lib/ruby/3.2.0/net/http.rb:1826:in `request' E, [2024-05-21T15:56:16.396384 #2068002] ERROR -- : from /usr/local/lib/ruby/3.2.0/open-uri.rb:333:in `block in open_http' E, [2024-05-21T15:56:16.396392 #2068002] ERROR -- : from /usr/local/lib/ruby/3.2.0/net/http.rb:1238:in `start' E, [2024-05-21T15:56:16.396400 #2068002] ERROR -- : from /usr/local/lib/ruby/3.2.0/open-uri.rb:327:in `open_http' E, [2024-05-21T15:56:16.396408 #2068002] ERROR -- : from /usr/local/lib/ruby/3.2.0/open-uri.rb:760:in `buffer_open' E, [2024-05-21T15:56:16.396416 #2068002] ERROR -- : from /usr/local/lib/ruby/3.2.0/open-uri.rb:214:in `block in open_loop' E, [2024-05-21T15:56:16.396424 #2068002] ERROR -- : from /usr/local/lib/ruby/3.2.0/open-uri.rb:212:in `catch' E, [2024-05-21T15:56:16.396432 #2068002] ERROR -- : from /usr/local/lib/ruby/3.2.0/open-uri.rb:212:in `open_loop' E, [2024-05-21T15:56:16.396440 #2068002] ERROR -- : from /usr/local/lib/ruby/3.2.0/open-uri.rb:153:in `open_uri' E, [2024-05-21T15:56:16.396448 #2068002] ERROR -- : from /usr/local/lib/ruby/3.2.0/open-uri.rb:740:in `open' E, [2024-05-21T15:56:16.396456 #2068002] ERROR -- : from /usr/local/lib/ruby/3.2.0/open-uri.rb:748:in `read' E, [2024-05-21T15:56:16.396465 #2068002] ERROR -- : from /home/opc/ruby/src/master/tool/downloader.rb:247:in `block in download' E, [2024-05-21T15:56:16.396473 #2068002] ERROR -- : from /home/opc/ruby/src/master/tool/downloader.rb:378:in `with_retry' E, [2024-05-21T15:56:16.396481 #2068002] ERROR -- : from /home/opc/ruby/src/master/tool/downloader.rb:246:in `download' E, [2024-05-21T15:56:16.396513 #2068002] ERROR -- : from /home/opc/ruby/src/master/tool/downloader.rb:136:in `download' E, [2024-05-21T15:56:16.396523 #2068002] ERROR -- : from /home/opc/ruby/src/master/tool/downloader.rb:482:in `block in
' E, [2024-05-21T15:56:16.396531 #2068002] ERROR -- : from /home/opc/ruby/src/master/tool/downloader.rb:465:in `each' E, [2024-05-21T15:56:16.396542 #2068002] ERROR -- : from /home/opc/ruby/src/master/tool/downloader.rb:465:in `
' E, [2024-05-21T15:56:16.399214 #2068002] ERROR -- : make: *** [uncommon.mk:1756: /home/opc/ruby/src/master/enc/unicode/data/emoji/15.0/emoji-zwj-sequences.txt] Error 1 I, [2024-05-21T15:56:16.399306 #2068002] INFO -- : downloading emoji/15.0/emoji-test.txt ... I, [2024-05-21T15:56:16.399469 #2068002] INFO -- : $$$[end] "make update-unicode -j3" exit with 512. I, [2024-05-21T15:56:16.399504 #2068002] INFO -- : $$$[beg] make update-download -j3 I, [2024-05-21T15:56:16.564775 #2068002] INFO -- : tool/config.guess already exists I, [2024-05-21T15:56:16.564856 #2068002] INFO -- : tool/config.sub already exists I, [2024-05-21T15:56:16.567545 #2068002] INFO -- : Update power_assert to 84e85124c5014a139af39161d484156cfe87a9ed I, [2024-05-21T15:56:16.567738 #2068002] INFO -- : Update rbs to ba7872795d5de04adb8ff500c0e6afdc81a041dd I, [2024-05-21T15:56:16.567862 #2068002] INFO -- : Update typeprof to b19a6416da3a05d57fadd6ffdadb382b6d236ca5 I, [2024-05-21T15:56:16.570974 #2068002] INFO -- : echo 84e85124c5014a139af39161d484156cfe87a9ed | /bin/sh /home/opc/ruby/src/master/tool/ifchange /home/opc/ruby/src/master/.bundle/.timestamp/power_assert.revision - I, [2024-05-21T15:56:16.571124 #2068002] INFO -- : echo ba7872795d5de04adb8ff500c0e6afdc81a041dd | /bin/sh /home/opc/ruby/src/master/tool/ifchange /home/opc/ruby/src/master/.bundle/.timestamp/rbs.revision - I, [2024-05-21T15:56:16.571275 #2068002] INFO -- : echo b19a6416da3a05d57fadd6ffdadb382b6d236ca5 | /bin/sh /home/opc/ruby/src/master/tool/ifchange /home/opc/ruby/src/master/.bundle/.timestamp/typeprof.revision - I, [2024-05-21T15:56:16.576365 #2068002] INFO -- : /home/opc/ruby/src/master/.bundle/.timestamp/power_assert.revision unchanged I, [2024-05-21T15:56:16.577375 #2068002] INFO -- : /home/opc/ruby/src/master/.bundle/.timestamp/rbs.revision unchanged I, [2024-05-21T15:56:16.578472 #2068002] INFO -- : /home/opc/ruby/src/master/.bundle/.timestamp/typeprof.revision unchanged I, [2024-05-21T15:56:16.668319 #2068002] INFO -- : Building power_assert@84e85124c5014a139af39161d484156cfe87a9ed to /home/opc/ruby/src/master/gems/power_assert-2.0.3.gem I, [2024-05-21T15:56:16.780899 #2068002] INFO -- : Successfully built RubyGem I, [2024-05-21T15:56:16.780951 #2068002] INFO -- : Name: power_assert I, [2024-05-21T15:56:16.780962 #2068002] INFO -- : Version: 2.0.4dev I, [2024-05-21T15:56:16.780971 #2068002] INFO -- : File: power_assert-2.0.4dev.gem I, [2024-05-21T15:56:16.859969 #2068002] INFO -- : $$$[end] "make update-download -j3" exit with 0. I, [2024-05-21T15:56:16.860041 #2068002] INFO -- : $$$[beg] make update-rubyspec -j3 I, [2024-05-21T15:56:16.947540 #2068002] INFO -- : make: Nothing to be done for 'update-rubyspec'. I, [2024-05-21T15:56:16.947684 #2068002] INFO -- : $$$[end] "make update-rubyspec -j3" exit with 0. I, [2024-05-21T15:56:16.947734 #2068002] INFO -- : $$$[beg] make update-src -j3 I, [2024-05-21T15:56:17.847564 #2068002] INFO -- : Already up to date. I, [2024-05-21T15:56:17.863909 #2068002] INFO -- : Latest commit hash = ff43b4a28b I, [2024-05-21T15:56:17.864598 #2068002] INFO -- : $$$[end] "make update-src -j3" exit with 0. I, [2024-05-21T15:56:17.864647 #2068002] INFO -- : $$$[beg] make after-update -j3 I, [2024-05-21T15:56:17.999947 #2068002] INFO -- : /home/opc/ruby/src/master/revision.h updated I, [2024-05-21T15:56:18.001076 #2068002] INFO -- : generating aarch64-linux-fake.rb I, [2024-05-21T15:56:18.057576 #2068002] INFO -- : aarch64-linux-fake.rb updated I, [2024-05-21T15:56:18.059188 #2068002] INFO -- : generating enc.mk I, [2024-05-21T15:56:18.288010 #2068002] INFO -- : making srcs under enc I, [2024-05-21T15:56:18.330237 #2068002] INFO -- : make[1]: Entering directory '/home/opc/ruby/build/master' I, [2024-05-21T15:56:18.330292 #2068002] INFO -- : make[1]: Nothing to be done for 'srcs'. I, [2024-05-21T15:56:18.330304 #2068002] INFO -- : make[1]: Leaving directory '/home/opc/ruby/build/master' I, [2024-05-21T15:56:18.411219 #2068002] INFO -- : Update power_assert to 84e85124c5014a139af39161d484156cfe87a9ed I, [2024-05-21T15:56:18.411400 #2068002] INFO -- : Update rbs to ba7872795d5de04adb8ff500c0e6afdc81a041dd I, [2024-05-21T15:56:18.412353 #2068002] INFO -- : Update typeprof to b19a6416da3a05d57fadd6ffdadb382b6d236ca5 I, [2024-05-21T15:56:18.415173 #2068002] INFO -- : echo 84e85124c5014a139af39161d484156cfe87a9ed | /bin/sh /home/opc/ruby/src/master/tool/ifchange /home/opc/ruby/src/master/.bundle/.timestamp/power_assert.revision - I, [2024-05-21T15:56:18.415362 #2068002] INFO -- : echo ba7872795d5de04adb8ff500c0e6afdc81a041dd | /bin/sh /home/opc/ruby/src/master/tool/ifchange /home/opc/ruby/src/master/.bundle/.timestamp/rbs.revision - I, [2024-05-21T15:56:18.415512 #2068002] INFO -- : echo b19a6416da3a05d57fadd6ffdadb382b6d236ca5 | /bin/sh /home/opc/ruby/src/master/tool/ifchange /home/opc/ruby/src/master/.bundle/.timestamp/typeprof.revision - I, [2024-05-21T15:56:18.420857 #2068002] INFO -- : /home/opc/ruby/src/master/.bundle/.timestamp/typeprof.revision unchanged I, [2024-05-21T15:56:18.420900 #2068002] INFO -- : /home/opc/ruby/src/master/.bundle/.timestamp/rbs.revision unchanged I, [2024-05-21T15:56:18.420910 #2068002] INFO -- : /home/opc/ruby/src/master/.bundle/.timestamp/power_assert.revision unchanged I, [2024-05-21T15:56:18.511474 #2068002] INFO -- : Building power_assert@84e85124c5014a139af39161d484156cfe87a9ed to /home/opc/ruby/src/master/gems/power_assert-2.0.3.gem I, [2024-05-21T15:56:18.622953 #2068002] INFO -- : Successfully built RubyGem I, [2024-05-21T15:56:18.623009 #2068002] INFO -- : Name: power_assert I, [2024-05-21T15:56:18.623020 #2068002] INFO -- : Version: 2.0.4dev I, [2024-05-21T15:56:18.623029 #2068002] INFO -- : File: power_assert-2.0.4dev.gem I, [2024-05-21T15:56:18.625086 #2068002] INFO -- : Extracting bundle gem power_assert-2.0.3... I, [2024-05-21T15:56:18.724428 #2068002] INFO -- : Try with hash version of bundled gems instead of gems/power_assert-2.0.3.gem. We don't use this gem with release version of Ruby. I, [2024-05-21T15:56:18.734955 #2068002] INFO -- : Unpacked gems/power_assert-2.0.4dev.gem I, [2024-05-21T15:56:18.736648 #2068002] INFO -- : $$$[end] "make after-update -j3" exit with 0. I, [2024-05-21T15:56:18.736789 #2068002] INFO -- : $$$[beg] make miniruby -j3 I, [2024-05-21T15:56:18.826781 #2068002] INFO -- : BASERUBY = /usr/local/bin/ruby --disable=gems I, [2024-05-21T15:56:18.826847 #2068002] INFO -- : CC = gcc I, [2024-05-21T15:56:18.826858 #2068002] INFO -- : LD = ld I, [2024-05-21T15:56:18.826867 #2068002] INFO -- : LDSHARED = gcc -shared I, [2024-05-21T15:56:18.826878 #2068002] INFO -- : CFLAGS = -O3 -fno-fast-math -ggdb3 -Wall -Wextra -Wdeprecated-declarations -Wdiv-by-zero -Wduplicated-cond -Wimplicit-function-declaration -Wimplicit-int -Wpointer-arith -Wwrite-strings -Wold-style-definition -Wimplicit-fallthrough=0 -Wmissing-noreturn -Wno-cast-function-type -Wno-constant-logical-operand -Wno-long-long -Wno-missing-field-initializers -Wno-overlength-strings -Wno-packed-bitfield-compat -Wno-parentheses-equality -Wno-self-assign -Wno-tautological-compare -Wno-unused-parameter -Wno-unused-value -Wsuggest-attribute=format -Wsuggest-attribute=noreturn -Wunused-variable -Wmisleading-indentation -Wundef I, [2024-05-21T15:56:18.826887 #2068002] INFO -- : XCFLAGS = -U_FORTIFY_SOURCE -D_FORTIFY_SOURCE=2 -fstack-protector-strong -msign-return-address=all -fno-strict-overflow -fvisibility=hidden -fexcess-precision=standard -DRUBY_EXPORT -fPIE -I. -I.ext/include/aarch64-linux -I/home/opc/ruby/src/master/include -I/home/opc/ruby/src/master -I/home/opc/ruby/src/master/prism -I/home/opc/ruby/src/master/enc/unicode/15.0.0 I, [2024-05-21T15:56:18.826896 #2068002] INFO -- : CPPFLAGS = I, [2024-05-21T15:56:18.826904 #2068002] INFO -- : DLDFLAGS = -Wl,--compress-debug-sections=zlib -fstack-protector-strong -pie I, [2024-05-21T15:56:18.826932 #2068002] INFO -- : SOLIBS = -lz -lrt -lrt -ldl -lcrypt -lm -lpthread I, [2024-05-21T15:56:18.826940 #2068002] INFO -- : LANG = en_US.UTF-8 I, [2024-05-21T15:56:18.826951 #2068002] INFO -- : LC_ALL = I, [2024-05-21T15:56:18.826959 #2068002] INFO -- : LC_CTYPE = I, [2024-05-21T15:56:18.826966 #2068002] INFO -- : MFLAGS = -j3 --jobserver-auth=4,5 I, [2024-05-21T15:56:18.826974 #2068002] INFO -- : RUSTC = rustc I, [2024-05-21T15:56:18.826982 #2068002] INFO -- : YJIT_RUSTC_ARGS = --crate-name=yjit --crate-type=staticlib --edition=2021 -g -C lto=thin -C opt-level=3 -C overflow-checks=on '--out-dir=/home/opc/ruby/build/master/yjit/target/release/' /home/opc/ruby/src/master/yjit/src/lib.rs I, [2024-05-21T15:56:18.827721 #2068002] INFO -- : gcc (GCC) 8.5.0 20210514 (Red Hat 8.5.0-10.1.0.1) I, [2024-05-21T15:56:18.827753 #2068002] INFO -- : Copyright (C) 2018 Free Software Foundation, Inc. I, [2024-05-21T15:56:18.827763 #2068002] INFO -- : This is free software; see the source for copying conditions. There is NO I, [2024-05-21T15:56:18.827773 #2068002] INFO -- : warranty; not even for MERCHANTABILITY or FITNESS FOR A PARTICULAR PURPOSE. I, [2024-05-21T15:56:18.827781 #2068002] INFO -- : I, [2024-05-21T15:56:18.853865 #2068002] INFO -- : compiling /home/opc/ruby/src/master/version.c I, [2024-05-21T15:56:18.996371 #2068002] INFO -- : linking miniruby I, [2024-05-21T15:56:19.890907 #2068002] INFO -- : $$$[end] "make miniruby -j3" exit with 0. I, [2024-05-21T15:56:19.891076 #2068002] INFO -- : $$$[beg] make ruby -j3 I, [2024-05-21T15:56:19.980604 #2068002] INFO -- : BASERUBY = /usr/local/bin/ruby --disable=gems I, [2024-05-21T15:56:19.980672 #2068002] INFO -- : CC = gcc I, [2024-05-21T15:56:19.980683 #2068002] INFO -- : LD = ld I, [2024-05-21T15:56:19.980691 #2068002] INFO -- : LDSHARED = gcc -shared I, [2024-05-21T15:56:19.980703 #2068002] INFO -- : CFLAGS = -O3 -fno-fast-math -ggdb3 -Wall -Wextra -Wdeprecated-declarations -Wdiv-by-zero -Wduplicated-cond -Wimplicit-function-declaration -Wimplicit-int -Wpointer-arith -Wwrite-strings -Wold-style-definition -Wimplicit-fallthrough=0 -Wmissing-noreturn -Wno-cast-function-type -Wno-constant-logical-operand -Wno-long-long -Wno-missing-field-initializers -Wno-overlength-strings -Wno-packed-bitfield-compat -Wno-parentheses-equality -Wno-self-assign -Wno-tautological-compare -Wno-unused-parameter -Wno-unused-value -Wsuggest-attribute=format -Wsuggest-attribute=noreturn -Wunused-variable -Wmisleading-indentation -Wundef I, [2024-05-21T15:56:19.980713 #2068002] INFO -- : XCFLAGS = -U_FORTIFY_SOURCE -D_FORTIFY_SOURCE=2 -fstack-protector-strong -msign-return-address=all -fno-strict-overflow -fvisibility=hidden -fexcess-precision=standard -DRUBY_EXPORT -fPIE -I. -I.ext/include/aarch64-linux -I/home/opc/ruby/src/master/include -I/home/opc/ruby/src/master -I/home/opc/ruby/src/master/prism -I/home/opc/ruby/src/master/enc/unicode/15.0.0 I, [2024-05-21T15:56:19.980722 #2068002] INFO -- : CPPFLAGS = I, [2024-05-21T15:56:19.980730 #2068002] INFO -- : DLDFLAGS = -Wl,--compress-debug-sections=zlib -fstack-protector-strong -pie I, [2024-05-21T15:56:19.980738 #2068002] INFO -- : SOLIBS = -lz -lrt -lrt -ldl -lcrypt -lm -lpthread I, [2024-05-21T15:56:19.980746 #2068002] INFO -- : LANG = en_US.UTF-8 I, [2024-05-21T15:56:19.980754 #2068002] INFO -- : LC_ALL = I, [2024-05-21T15:56:19.980762 #2068002] INFO -- : LC_CTYPE = I, [2024-05-21T15:56:19.980770 #2068002] INFO -- : MFLAGS = -j3 --jobserver-auth=4,5 I, [2024-05-21T15:56:19.980777 #2068002] INFO -- : RUSTC = rustc I, [2024-05-21T15:56:19.980786 #2068002] INFO -- : YJIT_RUSTC_ARGS = --crate-name=yjit --crate-type=staticlib --edition=2021 -g -C lto=thin -C opt-level=3 -C overflow-checks=on '--out-dir=/home/opc/ruby/build/master/yjit/target/release/' /home/opc/ruby/src/master/yjit/src/lib.rs I, [2024-05-21T15:56:19.981540 #2068002] INFO -- : gcc (GCC) 8.5.0 20210514 (Red Hat 8.5.0-10.1.0.1) I, [2024-05-21T15:56:19.981575 #2068002] INFO -- : Copyright (C) 2018 Free Software Foundation, Inc. I, [2024-05-21T15:56:19.981586 #2068002] INFO -- : This is free software; see the source for copying conditions. There is NO I, [2024-05-21T15:56:19.981598 #2068002] INFO -- : warranty; not even for MERCHANTABILITY or FITNESS FOR A PARTICULAR PURPOSE. I, [2024-05-21T15:56:19.981618 #2068002] INFO -- : I, [2024-05-21T15:56:20.164163 #2068002] INFO -- : builtin_binary.inc updated I, [2024-05-21T15:56:20.169101 #2068002] INFO -- : c5234a9416e4f20f175185e840b25b0f08674d14078ed7083f37e655458e3ca9 builtin_binary.inc I, [2024-05-21T15:56:20.170039 #2068002] INFO -- : compiling /home/opc/ruby/src/master/builtin.c I, [2024-05-21T15:56:20.495961 #2068002] INFO -- : linking static-library libruby-static.a I, [2024-05-21T15:56:22.185712 #2068002] INFO -- : linking ruby I, [2024-05-21T15:56:23.093714 #2068002] INFO -- : $$$[end] "make ruby -j3" exit with 0. I, [2024-05-21T15:56:23.093881 #2068002] INFO -- : $$$[beg] make all -j3 I, [2024-05-21T15:56:23.182335 #2068002] INFO -- : BASERUBY = /usr/local/bin/ruby --disable=gems I, [2024-05-21T15:56:23.182404 #2068002] INFO -- : CC = gcc I, [2024-05-21T15:56:23.182415 #2068002] INFO -- : LD = ld I, [2024-05-21T15:56:23.182423 #2068002] INFO -- : LDSHARED = gcc -shared I, [2024-05-21T15:56:23.182461 #2068002] INFO -- : CFLAGS = -O3 -fno-fast-math -ggdb3 -Wall -Wextra -Wdeprecated-declarations -Wdiv-by-zero -Wduplicated-cond -Wimplicit-function-declaration -Wimplicit-int -Wpointer-arith -Wwrite-strings -Wold-style-definition -Wimplicit-fallthrough=0 -Wmissing-noreturn -Wno-cast-function-type -Wno-constant-logical-operand -Wno-long-long -Wno-missing-field-initializers -Wno-overlength-strings -Wno-packed-bitfield-compat -Wno-parentheses-equality -Wno-self-assign -Wno-tautological-compare -Wno-unused-parameter -Wno-unused-value -Wsuggest-attribute=format -Wsuggest-attribute=noreturn -Wunused-variable -Wmisleading-indentation -Wundef I, [2024-05-21T15:56:23.182472 #2068002] INFO -- : XCFLAGS = -U_FORTIFY_SOURCE -D_FORTIFY_SOURCE=2 -fstack-protector-strong -msign-return-address=all -fno-strict-overflow -fvisibility=hidden -fexcess-precision=standard -DRUBY_EXPORT -fPIE -I. -I.ext/include/aarch64-linux -I/home/opc/ruby/src/master/include -I/home/opc/ruby/src/master -I/home/opc/ruby/src/master/prism -I/home/opc/ruby/src/master/enc/unicode/15.0.0 I, [2024-05-21T15:56:23.182481 #2068002] INFO -- : CPPFLAGS = I, [2024-05-21T15:56:23.182489 #2068002] INFO -- : DLDFLAGS = -Wl,--compress-debug-sections=zlib -fstack-protector-strong -pie I, [2024-05-21T15:56:23.182498 #2068002] INFO -- : SOLIBS = -lz -lrt -lrt -ldl -lcrypt -lm -lpthread I, [2024-05-21T15:56:23.182506 #2068002] INFO -- : LANG = en_US.UTF-8 I, [2024-05-21T15:56:23.182513 #2068002] INFO -- : LC_ALL = I, [2024-05-21T15:56:23.182521 #2068002] INFO -- : LC_CTYPE = I, [2024-05-21T15:56:23.182529 #2068002] INFO -- : MFLAGS = -j3 --jobserver-auth=4,5 I, [2024-05-21T15:56:23.182537 #2068002] INFO -- : RUSTC = rustc I, [2024-05-21T15:56:23.182545 #2068002] INFO -- : YJIT_RUSTC_ARGS = --crate-name=yjit --crate-type=staticlib --edition=2021 -g -C lto=thin -C opt-level=3 -C overflow-checks=on '--out-dir=/home/opc/ruby/build/master/yjit/target/release/' /home/opc/ruby/src/master/yjit/src/lib.rs I, [2024-05-21T15:56:23.183290 #2068002] INFO -- : gcc (GCC) 8.5.0 20210514 (Red Hat 8.5.0-10.1.0.1) I, [2024-05-21T15:56:23.183326 #2068002] INFO -- : Copyright (C) 2018 Free Software Foundation, Inc. I, [2024-05-21T15:56:23.183336 #2068002] INFO -- : This is free software; see the source for copying conditions. There is NO I, [2024-05-21T15:56:23.183345 #2068002] INFO -- : warranty; not even for MERCHANTABILITY or FITNESS FOR A PARTICULAR PURPOSE. I, [2024-05-21T15:56:23.183354 #2068002] INFO -- : I, [2024-05-21T15:56:23.215717 #2068002] INFO -- : generating encdb.h I, [2024-05-21T15:56:23.217115 #2068002] INFO -- : generating enc.mk I, [2024-05-21T15:56:23.254969 #2068002] INFO -- : encdb.h unchanged I, [2024-05-21T15:56:23.453158 #2068002] INFO -- : making srcs under enc I, [2024-05-21T15:56:23.453224 #2068002] INFO -- : making enc I, [2024-05-21T15:56:23.480619 #2068002] INFO -- : make[1]: Entering directory '/home/opc/ruby/build/master' I, [2024-05-21T15:56:23.480697 #2068002] INFO -- : make[1]: Nothing to be done for 'enc'. I, [2024-05-21T15:56:23.480708 #2068002] INFO -- : make[1]: Leaving directory '/home/opc/ruby/build/master' I, [2024-05-21T15:56:23.495453 #2068002] INFO -- : make[1]: Entering directory '/home/opc/ruby/build/master' I, [2024-05-21T15:56:23.495517 #2068002] INFO -- : make[1]: Nothing to be done for 'srcs'. I, [2024-05-21T15:56:23.495536 #2068002] INFO -- : make[1]: Leaving directory '/home/opc/ruby/build/master' I, [2024-05-21T15:56:23.496291 #2068002] INFO -- : generating transdb.h I, [2024-05-21T15:56:23.638301 #2068002] INFO -- : transdb.h unchanged I, [2024-05-21T15:56:23.639695 #2068002] INFO -- : generating makefiles ext/configure-ext.mk I, [2024-05-21T15:56:23.639742 #2068002] INFO -- : making trans I, [2024-05-21T15:56:23.679394 #2068002] INFO -- : ext/configure-ext.mk updated I, [2024-05-21T15:56:23.682367 #2068002] INFO -- : make[1]: Entering directory '/home/opc/ruby/build/master' I, [2024-05-21T15:56:23.689010 #2068002] INFO -- : make[1]: Entering directory '/home/opc/ruby/build/master' I, [2024-05-21T15:56:23.689058 #2068002] INFO -- : make[1]: Nothing to be done for 'trans'. I, [2024-05-21T15:56:23.689069 #2068002] INFO -- : make[1]: Leaving directory '/home/opc/ruby/build/master' I, [2024-05-21T15:56:23.872710 #2068002] INFO -- : making encs I, [2024-05-21T15:56:23.927135 #2068002] INFO -- : make[1]: Entering directory '/home/opc/ruby/build/master' I, [2024-05-21T15:56:23.927222 #2068002] INFO -- : make[1]: Nothing to be done for 'encs'. I, [2024-05-21T15:56:23.927258 #2068002] INFO -- : make[1]: Leaving directory '/home/opc/ruby/build/master' I, [2024-05-21T15:56:24.443022 #2068002] INFO -- : make[1]: Leaving directory '/home/opc/ruby/build/master' I, [2024-05-21T15:56:24.443746 #2068002] INFO -- : generating makefile exts.mk I, [2024-05-21T15:56:24.503509 #2068002] INFO -- : exts.mk unchanged I, [2024-05-21T15:56:24.508433 #2068002] INFO -- : make[1]: Entering directory '/home/opc/ruby/build/master' I, [2024-05-21T15:56:24.612285 #2068002] INFO -- : make[2]: Entering directory '/home/opc/ruby/build/master/ext/coverage' I, [2024-05-21T15:56:24.614891 #2068002] INFO -- : make[2]: Entering directory '/home/opc/ruby/build/master/ext/digest' I, [2024-05-21T15:56:24.616842 #2068002] INFO -- : make[2]: Leaving directory '/home/opc/ruby/build/master/ext/coverage' I, [2024-05-21T15:56:24.617600 #2068002] INFO -- : make[2]: Entering directory '/home/opc/ruby/build/master/ext/date' I, [2024-05-21T15:56:24.623167 #2068002] INFO -- : make[2]: Leaving directory '/home/opc/ruby/build/master/ext/date' I, [2024-05-21T15:56:24.623764 #2068002] INFO -- : make[2]: Leaving directory '/home/opc/ruby/build/master/ext/digest' I, [2024-05-21T15:56:24.629024 #2068002] INFO -- : make[2]: Entering directory '/home/opc/ruby/build/master/ext/io/console' I, [2024-05-21T15:56:24.630819 #2068002] INFO -- : make[2]: Entering directory '/home/opc/ruby/build/master/ext/fiddle' I, [2024-05-21T15:56:24.633200 #2068002] INFO -- : make[2]: Leaving directory '/home/opc/ruby/build/master/ext/io/console' I, [2024-05-21T15:56:24.635161 #2068002] INFO -- : make[2]: Entering directory '/home/opc/ruby/build/master/ext/json' I, [2024-05-21T15:56:24.640418 #2068002] INFO -- : make[2]: Entering directory '/home/opc/ruby/build/master/ext/monitor' I, [2024-05-21T15:56:24.641049 #2068002] INFO -- : make[2]: Leaving directory '/home/opc/ruby/build/master/ext/fiddle' I, [2024-05-21T15:56:24.644609 #2068002] INFO -- : make[2]: Leaving directory '/home/opc/ruby/build/master/ext/json' I, [2024-05-21T15:56:24.646957 #2068002] INFO -- : make[2]: Leaving directory '/home/opc/ruby/build/master/ext/monitor' I, [2024-05-21T15:56:24.647285 #2068002] INFO -- : make[2]: Entering directory '/home/opc/ruby/build/master/ext/objspace' I, [2024-05-21T15:56:24.651158 #2068002] INFO -- : make[2]: Entering directory '/home/opc/ruby/build/master/ext/pathname' I, [2024-05-21T15:56:24.653575 #2068002] INFO -- : make[2]: Leaving directory '/home/opc/ruby/build/master/ext/objspace' I, [2024-05-21T15:56:24.656720 #2068002] INFO -- : make[2]: Leaving directory '/home/opc/ruby/build/master/ext/pathname' I, [2024-05-21T15:56:24.659887 #2068002] INFO -- : make[2]: Entering directory '/home/opc/ruby/build/master/ext/psych' I, [2024-05-21T15:56:24.661222 #2068002] INFO -- : make[2]: Entering directory '/home/opc/ruby/build/master/ext/pty' I, [2024-05-21T15:56:24.665688 #2068002] INFO -- : make[2]: Entering directory '/home/opc/ruby/build/master/ext/openssl' I, [2024-05-21T15:56:24.672780 #2068002] INFO -- : make[2]: Leaving directory '/home/opc/ruby/build/master/ext/pty' I, [2024-05-21T15:56:24.676481 #2068002] INFO -- : make[2]: Leaving directory '/home/opc/ruby/build/master/ext/psych' I, [2024-05-21T15:56:24.680175 #2068002] INFO -- : make[2]: Entering directory '/home/opc/ruby/build/master/ext/rubyvm' I, [2024-05-21T15:56:24.683376 #2068002] INFO -- : make[2]: Leaving directory '/home/opc/ruby/build/master/ext/rubyvm' I, [2024-05-21T15:56:24.685200 #2068002] INFO -- : make[2]: Entering directory '/home/opc/ruby/build/master/ext/ripper' I, [2024-05-21T15:56:24.688213 #2068002] INFO -- : make[2]: Leaving directory '/home/opc/ruby/build/master/ext/openssl' I, [2024-05-21T15:56:24.695400 #2068002] INFO -- : make[2]: Entering directory '/home/opc/ruby/build/master/ext/socket' I, [2024-05-21T15:56:24.696407 #2068002] INFO -- : make[2]: Leaving directory '/home/opc/ruby/build/master/ext/ripper' I, [2024-05-21T15:56:24.699279 #2068002] INFO -- : make[2]: Entering directory '/home/opc/ruby/build/master/.bundle/gems/bigdecimal-3.1.7/ext/bigdecimal' I, [2024-05-21T15:56:24.705913 #2068002] INFO -- : make[2]: Leaving directory '/home/opc/ruby/build/master/ext/socket' I, [2024-05-21T15:56:24.706792 #2068002] INFO -- : make[2]: Entering directory '/home/opc/ruby/build/master/.bundle/gems/bigdecimal-3.1.8/ext/bigdecimal' I, [2024-05-21T15:56:24.708198 #2068002] INFO -- : make[2]: Entering directory '/home/opc/ruby/build/master/.bundle/gems/debug-1.9.2/ext/debug' I, [2024-05-21T15:56:24.730628 #2068002] INFO -- : make[2]: Leaving directory '/home/opc/ruby/build/master/.bundle/gems/bigdecimal-3.1.7/ext/bigdecimal' I, [2024-05-21T15:56:24.733698 #2068002] INFO -- : make[2]: Entering directory '/home/opc/ruby/build/master/.bundle/gems/nkf-0.2.0/ext/nkf' I, [2024-05-21T15:56:24.738993 #2068002] INFO -- : make[2]: Leaving directory '/home/opc/ruby/build/master/.bundle/gems/bigdecimal-3.1.8/ext/bigdecimal' I, [2024-05-21T15:56:24.739115 #2068002] INFO -- : make[2]: Leaving directory '/home/opc/ruby/build/master/.bundle/gems/debug-1.9.2/ext/debug' I, [2024-05-21T15:56:24.741469 #2068002] INFO -- : make[2]: Entering directory '/home/opc/ruby/build/master/.bundle/gems/racc-1.7.3/ext/racc/cparse' I, [2024-05-21T15:56:24.743430 #2068002] INFO -- : make[2]: Entering directory '/home/opc/ruby/build/master/.bundle/gems/racc-1.8.0/ext/racc/cparse' I, [2024-05-21T15:56:24.765337 #2068002] INFO -- : make[2]: Leaving directory '/home/opc/ruby/build/master/.bundle/gems/nkf-0.2.0/ext/nkf' I, [2024-05-21T15:56:24.768251 #2068002] INFO -- : make[2]: Entering directory '/home/opc/ruby/build/master/.bundle/gems/rbs-3.4.4/ext/rbs_extension' I, [2024-05-21T15:56:24.773197 #2068002] INFO -- : make[2]: Leaving directory '/home/opc/ruby/build/master/.bundle/gems/racc-1.7.3/ext/racc/cparse' I, [2024-05-21T15:56:24.775942 #2068002] INFO -- : make[2]: Entering directory '/home/opc/ruby/build/master/.bundle/gems/syslog-0.1.2/ext/syslog' I, [2024-05-21T15:56:24.775976 #2068002] INFO -- : make[2]: Leaving directory '/home/opc/ruby/build/master/.bundle/gems/racc-1.8.0/ext/racc/cparse' I, [2024-05-21T15:56:24.799268 #2068002] INFO -- : make[2]: Leaving directory '/home/opc/ruby/build/master/.bundle/gems/rbs-3.4.4/ext/rbs_extension' I, [2024-05-21T15:56:24.803246 #2068002] INFO -- : make[2]: Entering directory '/home/opc/ruby/build/master/ext/digest/sha2' I, [2024-05-21T15:56:24.805546 #2068002] INFO -- : make[2]: Leaving directory '/home/opc/ruby/build/master/.bundle/gems/syslog-0.1.2/ext/syslog' I, [2024-05-21T15:56:24.808221 #2068002] INFO -- : make[2]: Leaving directory '/home/opc/ruby/build/master/ext/digest/sha2' I, [2024-05-21T15:56:24.846637 #2068002] INFO -- : make[2]: Entering directory '/home/opc/ruby/build/master' I, [2024-05-21T15:56:24.929385 #2068002] INFO -- : make[2]: 'ruby' is up to date. I, [2024-05-21T15:56:24.929456 #2068002] INFO -- : make[2]: Leaving directory '/home/opc/ruby/build/master' I, [2024-05-21T15:56:24.929595 #2068002] INFO -- : make[1]: Leaving directory '/home/opc/ruby/build/master' I, [2024-05-21T15:56:24.933978 #2068002] INFO -- : make[1]: Entering directory '/home/opc/ruby/build/master' I, [2024-05-21T15:56:24.934008 #2068002] INFO -- : make[1]: Nothing to be done for 'note'. I, [2024-05-21T15:56:24.934019 #2068002] INFO -- : make[1]: Leaving directory '/home/opc/ruby/build/master' I, [2024-05-21T15:56:24.934335 #2068002] INFO -- : $$$[end] "make all -j3" exit with 0. I, [2024-05-21T15:56:24.934477 #2068002] INFO -- : $$$[beg] make install -j3 I, [2024-05-21T15:56:25.028595 #2068002] INFO -- : Update power_assert to 84e85124c5014a139af39161d484156cfe87a9ed I, [2024-05-21T15:56:25.028914 #2068002] INFO -- : Update typeprof to b19a6416da3a05d57fadd6ffdadb382b6d236ca5 I, [2024-05-21T15:56:25.029901 #2068002] INFO -- : Update rbs to ba7872795d5de04adb8ff500c0e6afdc81a041dd I, [2024-05-21T15:56:25.032647 #2068002] INFO -- : echo 84e85124c5014a139af39161d484156cfe87a9ed | /bin/sh /home/opc/ruby/src/master/tool/ifchange /home/opc/ruby/src/master/.bundle/.timestamp/power_assert.revision - I, [2024-05-21T15:56:25.032896 #2068002] INFO -- : echo ba7872795d5de04adb8ff500c0e6afdc81a041dd | /bin/sh /home/opc/ruby/src/master/tool/ifchange /home/opc/ruby/src/master/.bundle/.timestamp/rbs.revision - I, [2024-05-21T15:56:25.033156 #2068002] INFO -- : echo b19a6416da3a05d57fadd6ffdadb382b6d236ca5 | /bin/sh /home/opc/ruby/src/master/tool/ifchange /home/opc/ruby/src/master/.bundle/.timestamp/typeprof.revision - I, [2024-05-21T15:56:25.037813 #2068002] INFO -- : /home/opc/ruby/src/master/.bundle/.timestamp/power_assert.revision unchanged I, [2024-05-21T15:56:25.038549 #2068002] INFO -- : /home/opc/ruby/src/master/.bundle/.timestamp/rbs.revision unchanged I, [2024-05-21T15:56:25.038583 #2068002] INFO -- : /home/opc/ruby/src/master/.bundle/.timestamp/typeprof.revision unchanged I, [2024-05-21T15:56:25.041648 #2068002] INFO -- : BASERUBY = /usr/local/bin/ruby --disable=gems I, [2024-05-21T15:56:25.041689 #2068002] INFO -- : CC = gcc I, [2024-05-21T15:56:25.041713 #2068002] INFO -- : LD = ld I, [2024-05-21T15:56:25.041729 #2068002] INFO -- : LDSHARED = gcc -shared I, [2024-05-21T15:56:25.041738 #2068002] INFO -- : CFLAGS = -O3 -fno-fast-math -ggdb3 -Wall -Wextra -Wdeprecated-declarations -Wdiv-by-zero -Wduplicated-cond -Wimplicit-function-declaration -Wimplicit-int -Wpointer-arith -Wwrite-strings -Wold-style-definition -Wimplicit-fallthrough=0 -Wmissing-noreturn -Wno-cast-function-type -Wno-constant-logical-operand -Wno-long-long -Wno-missing-field-initializers -Wno-overlength-strings -Wno-packed-bitfield-compat -Wno-parentheses-equality -Wno-self-assign -Wno-tautological-compare -Wno-unused-parameter -Wno-unused-value -Wsuggest-attribute=format -Wsuggest-attribute=noreturn -Wunused-variable -Wmisleading-indentation -Wundef I, [2024-05-21T15:56:25.041748 #2068002] INFO -- : XCFLAGS = -U_FORTIFY_SOURCE -D_FORTIFY_SOURCE=2 -fstack-protector-strong -msign-return-address=all -fno-strict-overflow -fvisibility=hidden -fexcess-precision=standard -DRUBY_EXPORT -fPIE -I. -I.ext/include/aarch64-linux -I/home/opc/ruby/src/master/include -I/home/opc/ruby/src/master -I/home/opc/ruby/src/master/prism -I/home/opc/ruby/src/master/enc/unicode/15.0.0 I, [2024-05-21T15:56:25.041758 #2068002] INFO -- : CPPFLAGS = I, [2024-05-21T15:56:25.041766 #2068002] INFO -- : DLDFLAGS = -Wl,--compress-debug-sections=zlib -fstack-protector-strong -pie I, [2024-05-21T15:56:25.041775 #2068002] INFO -- : SOLIBS = -lz -lrt -lrt -ldl -lcrypt -lm -lpthread I, [2024-05-21T15:56:25.041785 #2068002] INFO -- : LANG = en_US.UTF-8 I, [2024-05-21T15:56:25.041793 #2068002] INFO -- : LC_ALL = I, [2024-05-21T15:56:25.041801 #2068002] INFO -- : LC_CTYPE = I, [2024-05-21T15:56:25.041808 #2068002] INFO -- : MFLAGS = -j3 --jobserver-auth=4,5 I, [2024-05-21T15:56:25.041816 #2068002] INFO -- : RUSTC = rustc I, [2024-05-21T15:56:25.041824 #2068002] INFO -- : YJIT_RUSTC_ARGS = --crate-name=yjit --crate-type=staticlib --edition=2021 -g -C lto=thin -C opt-level=3 -C overflow-checks=on '--out-dir=/home/opc/ruby/build/master/yjit/target/release/' /home/opc/ruby/src/master/yjit/src/lib.rs I, [2024-05-21T15:56:25.072795 #2068002] INFO -- : generating encdb.h I, [2024-05-21T15:56:25.072997 #2068002] INFO -- : gcc (GCC) 8.5.0 20210514 (Red Hat 8.5.0-10.1.0.1) I, [2024-05-21T15:56:25.073036 #2068002] INFO -- : Copyright (C) 2018 Free Software Foundation, Inc. I, [2024-05-21T15:56:25.073046 #2068002] INFO -- : This is free software; see the source for copying conditions. There is NO I, [2024-05-21T15:56:25.073055 #2068002] INFO -- : warranty; not even for MERCHANTABILITY or FITNESS FOR A PARTICULAR PURPOSE. I, [2024-05-21T15:56:25.073063 #2068002] INFO -- : I, [2024-05-21T15:56:25.073642 #2068002] INFO -- : generating enc.mk I, [2024-05-21T15:56:25.110097 #2068002] INFO -- : encdb.h unchanged I, [2024-05-21T15:56:25.201129 #2068002] INFO -- : Building power_assert@84e85124c5014a139af39161d484156cfe87a9ed to /home/opc/ruby/src/master/gems/power_assert-2.0.3.gem I, [2024-05-21T15:56:25.311213 #2068002] INFO -- : making srcs under enc I, [2024-05-21T15:56:25.311274 #2068002] INFO -- : making enc I, [2024-05-21T15:56:25.321072 #2068002] INFO -- : Successfully built RubyGem I, [2024-05-21T15:56:25.321117 #2068002] INFO -- : Name: power_assert I, [2024-05-21T15:56:25.321128 #2068002] INFO -- : Version: 2.0.4dev I, [2024-05-21T15:56:25.321137 #2068002] INFO -- : File: power_assert-2.0.4dev.gem I, [2024-05-21T15:56:25.326869 #2068002] INFO -- : Extracting bundle gem power_assert-2.0.3... I, [2024-05-21T15:56:25.339457 #2068002] INFO -- : make[1]: Entering directory '/home/opc/ruby/build/master' I, [2024-05-21T15:56:25.339517 #2068002] INFO -- : make[1]: Nothing to be done for 'enc'. I, [2024-05-21T15:56:25.339549 #2068002] INFO -- : make[1]: Leaving directory '/home/opc/ruby/build/master' I, [2024-05-21T15:56:25.353814 #2068002] INFO -- : make[1]: Entering directory '/home/opc/ruby/build/master' I, [2024-05-21T15:56:25.353858 #2068002] INFO -- : make[1]: Nothing to be done for 'srcs'. I, [2024-05-21T15:56:25.353867 #2068002] INFO -- : make[1]: Leaving directory '/home/opc/ruby/build/master' I, [2024-05-21T15:56:25.354659 #2068002] INFO -- : generating transdb.h I, [2024-05-21T15:56:25.427943 #2068002] INFO -- : Try with hash version of bundled gems instead of gems/power_assert-2.0.3.gem. We don't use this gem with release version of Ruby. I, [2024-05-21T15:56:25.439014 #2068002] INFO -- : Unpacked gems/power_assert-2.0.4dev.gem I, [2024-05-21T15:56:25.497075 #2068002] INFO -- : transdb.h unchanged I, [2024-05-21T15:56:25.498452 #2068002] INFO -- : generating makefiles ext/configure-ext.mk I, [2024-05-21T15:56:25.498629 #2068002] INFO -- : making trans I, [2024-05-21T15:56:25.537341 #2068002] INFO -- : ext/configure-ext.mk unchanged I, [2024-05-21T15:56:25.540245 #2068002] INFO -- : make[1]: Entering directory '/home/opc/ruby/build/master' I, [2024-05-21T15:56:25.547019 #2068002] INFO -- : make[1]: Entering directory '/home/opc/ruby/build/master' I, [2024-05-21T15:56:25.547071 #2068002] INFO -- : make[1]: Nothing to be done for 'trans'. I, [2024-05-21T15:56:25.547083 #2068002] INFO -- : make[1]: Leaving directory '/home/opc/ruby/build/master' I, [2024-05-21T15:56:26.253641 #2068002] INFO -- : making encs I, [2024-05-21T15:56:26.285846 #2068002] INFO -- : make[1]: Leaving directory '/home/opc/ruby/build/master' I, [2024-05-21T15:56:26.286445 #2068002] INFO -- : generating makefile exts.mk I, [2024-05-21T15:56:26.307029 #2068002] INFO -- : make[1]: Entering directory '/home/opc/ruby/build/master' I, [2024-05-21T15:56:26.307082 #2068002] INFO -- : make[1]: Nothing to be done for 'encs'. I, [2024-05-21T15:56:26.307092 #2068002] INFO -- : make[1]: Leaving directory '/home/opc/ruby/build/master' I, [2024-05-21T15:56:26.345171 #2068002] INFO -- : exts.mk unchanged I, [2024-05-21T15:56:26.350166 #2068002] INFO -- : make[1]: Entering directory '/home/opc/ruby/build/master' I, [2024-05-21T15:56:26.458135 #2068002] INFO -- : make[2]: Entering directory '/home/opc/ruby/build/master/ext/digest' I, [2024-05-21T15:56:26.458203 #2068002] INFO -- : make[2]: Entering directory '/home/opc/ruby/build/master/ext/coverage' I, [2024-05-21T15:56:26.460242 #2068002] INFO -- : make[2]: Entering directory '/home/opc/ruby/build/master/ext/date' I, [2024-05-21T15:56:26.462991 #2068002] INFO -- : make[2]: Leaving directory '/home/opc/ruby/build/master/ext/coverage' I, [2024-05-21T15:56:26.465497 #2068002] INFO -- : make[2]: Leaving directory '/home/opc/ruby/build/master/ext/date' I, [2024-05-21T15:56:26.466916 #2068002] INFO -- : make[2]: Leaving directory '/home/opc/ruby/build/master/ext/digest' I, [2024-05-21T15:56:26.473917 #2068002] INFO -- : make[2]: Entering directory '/home/opc/ruby/build/master/ext/fiddle' I, [2024-05-21T15:56:26.474768 #2068002] INFO -- : make[2]: Entering directory '/home/opc/ruby/build/master/ext/io/console' I, [2024-05-21T15:56:26.479076 #2068002] INFO -- : make[2]: Leaving directory '/home/opc/ruby/build/master/ext/io/console' I, [2024-05-21T15:56:26.481127 #2068002] INFO -- : make[2]: Entering directory '/home/opc/ruby/build/master/ext/json' I, [2024-05-21T15:56:26.482857 #2068002] INFO -- : make[2]: Leaving directory '/home/opc/ruby/build/master/ext/fiddle' I, [2024-05-21T15:56:26.484440 #2068002] INFO -- : make[2]: Entering directory '/home/opc/ruby/build/master/ext/monitor' I, [2024-05-21T15:56:26.488954 #2068002] INFO -- : make[2]: Entering directory '/home/opc/ruby/build/master/ext/objspace' I, [2024-05-21T15:56:26.491006 #2068002] INFO -- : make[2]: Leaving directory '/home/opc/ruby/build/master/ext/json' I, [2024-05-21T15:56:26.491224 #2068002] INFO -- : make[2]: Leaving directory '/home/opc/ruby/build/master/ext/monitor' I, [2024-05-21T15:56:26.495124 #2068002] INFO -- : make[2]: Leaving directory '/home/opc/ruby/build/master/ext/objspace' I, [2024-05-21T15:56:26.498739 #2068002] INFO -- : make[2]: Entering directory '/home/opc/ruby/build/master/ext/pathname' I, [2024-05-21T15:56:26.501571 #2068002] INFO -- : make[2]: Entering directory '/home/opc/ruby/build/master/ext/psych' I, [2024-05-21T15:56:26.502931 #2068002] INFO -- : make[2]: Leaving directory '/home/opc/ruby/build/master/ext/pathname' I, [2024-05-21T15:56:26.512641 #2068002] INFO -- : make[2]: Entering directory '/home/opc/ruby/build/master/ext/pty' I, [2024-05-21T15:56:26.514102 #2068002] INFO -- : make[2]: Entering directory '/home/opc/ruby/build/master/ext/openssl' I, [2024-05-21T15:56:26.515355 #2068002] INFO -- : make[2]: Leaving directory '/home/opc/ruby/build/master/ext/psych' I, [2024-05-21T15:56:26.517663 #2068002] INFO -- : make[2]: Leaving directory '/home/opc/ruby/build/master/ext/pty' I, [2024-05-21T15:56:26.523189 #2068002] INFO -- : make[2]: Entering directory '/home/opc/ruby/build/master/ext/rubyvm' I, [2024-05-21T15:56:26.526521 #2068002] INFO -- : make[2]: Leaving directory '/home/opc/ruby/build/master/ext/rubyvm' I, [2024-05-21T15:56:26.528848 #2068002] INFO -- : make[2]: Entering directory '/home/opc/ruby/build/master/ext/ripper' I, [2024-05-21T15:56:26.534811 #2068002] INFO -- : make[2]: Leaving directory '/home/opc/ruby/build/master/ext/openssl' I, [2024-05-21T15:56:26.537196 #2068002] INFO -- : make[2]: Leaving directory '/home/opc/ruby/build/master/ext/ripper' I, [2024-05-21T15:56:26.538929 #2068002] INFO -- : make[2]: Entering directory '/home/opc/ruby/build/master/ext/socket' I, [2024-05-21T15:56:26.544269 #2068002] INFO -- : make[2]: Entering directory '/home/opc/ruby/build/master/.bundle/gems/bigdecimal-3.1.7/ext/bigdecimal' I, [2024-05-21T15:56:26.545738 #2068002] INFO -- : make[2]: Entering directory '/home/opc/ruby/build/master/.bundle/gems/bigdecimal-3.1.8/ext/bigdecimal' I, [2024-05-21T15:56:26.549779 #2068002] INFO -- : make[2]: Leaving directory '/home/opc/ruby/build/master/ext/socket' I, [2024-05-21T15:56:26.552070 #2068002] INFO -- : make[2]: Entering directory '/home/opc/ruby/build/master/.bundle/gems/debug-1.9.2/ext/debug' I, [2024-05-21T15:56:26.576001 #2068002] INFO -- : make[2]: Leaving directory '/home/opc/ruby/build/master/.bundle/gems/bigdecimal-3.1.8/ext/bigdecimal' I, [2024-05-21T15:56:26.576364 #2068002] INFO -- : make[2]: Leaving directory '/home/opc/ruby/build/master/.bundle/gems/bigdecimal-3.1.7/ext/bigdecimal' I, [2024-05-21T15:56:26.578463 #2068002] INFO -- : make[2]: Entering directory '/home/opc/ruby/build/master/.bundle/gems/nkf-0.2.0/ext/nkf' I, [2024-05-21T15:56:26.578849 #2068002] INFO -- : make[2]: Entering directory '/home/opc/ruby/build/master/.bundle/gems/racc-1.7.3/ext/racc/cparse' I, [2024-05-21T15:56:26.583337 #2068002] INFO -- : make[2]: Leaving directory '/home/opc/ruby/build/master/.bundle/gems/debug-1.9.2/ext/debug' I, [2024-05-21T15:56:26.585797 #2068002] INFO -- : make[2]: Entering directory '/home/opc/ruby/build/master/.bundle/gems/racc-1.8.0/ext/racc/cparse' I, [2024-05-21T15:56:26.608860 #2068002] INFO -- : make[2]: Leaving directory '/home/opc/ruby/build/master/.bundle/gems/nkf-0.2.0/ext/nkf' I, [2024-05-21T15:56:26.610712 #2068002] INFO -- : make[2]: Leaving directory '/home/opc/ruby/build/master/.bundle/gems/racc-1.7.3/ext/racc/cparse' I, [2024-05-21T15:56:26.611977 #2068002] INFO -- : make[2]: Entering directory '/home/opc/ruby/build/master/.bundle/gems/rbs-3.4.4/ext/rbs_extension' I, [2024-05-21T15:56:26.613509 #2068002] INFO -- : make[2]: Entering directory '/home/opc/ruby/build/master/.bundle/gems/syslog-0.1.2/ext/syslog' I, [2024-05-21T15:56:26.618786 #2068002] INFO -- : make[2]: Leaving directory '/home/opc/ruby/build/master/.bundle/gems/racc-1.8.0/ext/racc/cparse' I, [2024-05-21T15:56:26.643410 #2068002] INFO -- : make[2]: Leaving directory '/home/opc/ruby/build/master/.bundle/gems/rbs-3.4.4/ext/rbs_extension' I, [2024-05-21T15:56:26.643609 #2068002] INFO -- : make[2]: Entering directory '/home/opc/ruby/build/master/ext/digest/sha2' I, [2024-05-21T15:56:26.644347 #2068002] INFO -- : make[2]: Leaving directory '/home/opc/ruby/build/master/.bundle/gems/syslog-0.1.2/ext/syslog' I, [2024-05-21T15:56:26.648646 #2068002] INFO -- : make[2]: Leaving directory '/home/opc/ruby/build/master/ext/digest/sha2' I, [2024-05-21T15:56:26.687284 #2068002] INFO -- : make[2]: Entering directory '/home/opc/ruby/build/master' I, [2024-05-21T15:56:26.771008 #2068002] INFO -- : make[2]: 'ruby' is up to date. I, [2024-05-21T15:56:26.771091 #2068002] INFO -- : make[2]: Leaving directory '/home/opc/ruby/build/master' I, [2024-05-21T15:56:26.771208 #2068002] INFO -- : make[1]: Leaving directory '/home/opc/ruby/build/master' I, [2024-05-21T15:56:26.775509 #2068002] INFO -- : make[1]: Entering directory '/home/opc/ruby/build/master' I, [2024-05-21T15:56:26.775540 #2068002] INFO -- : make[1]: Nothing to be done for 'note'. I, [2024-05-21T15:56:26.775550 #2068002] INFO -- : make[1]: Leaving directory '/home/opc/ruby/build/master' I, [2024-05-21T15:56:26.775761 #2068002] INFO -- : ./miniruby -I/home/opc/ruby/src/master/lib -I. -I.ext/common /home/opc/ruby/src/master/tool/runruby.rb --extout=.ext -- --disable-gems -r./aarch64-linux-fake /home/opc/ruby/src/master/tool/rbinstall.rb --make="make" --dest-dir="" --extout=".ext" --ext-build-dir="./ext" --mflags="-j3 --jobserver-auth=4,5" --make-flags=" -j3 --jobserver-auth=4,5" --data-mode=0644 --prog-mode=0755 --installed-list .installed.list --mantype="doc" --gnumake --install=all --exclude=doc I, [2024-05-21T15:56:26.925669 #2068002] INFO -- : Installing to I, [2024-05-21T15:56:26.925740 #2068002] INFO -- : installing binary commands: /home/opc/ruby/install/master/bin I, [2024-05-21T15:56:27.112722 #2068002] INFO -- : installing base libraries: /home/opc/ruby/install/master/lib I, [2024-05-21T15:56:27.113218 #2068002] INFO -- : installing arch files: /home/opc/ruby/install/master/lib/ruby/3.4.0+0/aarch64-linux I, [2024-05-21T15:56:27.113362 #2068002] INFO -- : installing pkgconfig data: /home/opc/ruby/install/master/lib/pkgconfig I, [2024-05-21T15:56:27.113430 #2068002] INFO -- : installing extension objects: /home/opc/ruby/install/master/lib/ruby/3.4.0+0/aarch64-linux I, [2024-05-21T15:56:27.126134 #2068002] INFO -- : installing extension objects: /home/opc/ruby/install/master/lib/ruby/site_ruby/3.4.0+0/aarch64-linux I, [2024-05-21T15:56:27.129208 #2068002] INFO -- : installing extension objects: /home/opc/ruby/install/master/lib/ruby/vendor_ruby/3.4.0+0/aarch64-linux I, [2024-05-21T15:56:27.129478 #2068002] INFO -- : installing extension headers: /home/opc/ruby/install/master/include/ruby-3.4.0+0/aarch64-linux I, [2024-05-21T15:56:27.130004 #2068002] INFO -- : installing extension scripts: /home/opc/ruby/install/master/lib/ruby/3.4.0+0 I, [2024-05-21T15:56:27.135813 #2068002] INFO -- : installing extension scripts: /home/opc/ruby/install/master/lib/ruby/site_ruby/3.4.0+0 I, [2024-05-21T15:56:27.135835 #2068002] INFO -- : installing extension scripts: /home/opc/ruby/install/master/lib/ruby/vendor_ruby/3.4.0+0 I, [2024-05-21T15:56:27.135847 #2068002] INFO -- : installing extension headers: /home/opc/ruby/install/master/include/ruby-3.4.0+0/ruby I, [2024-05-21T15:56:27.135979 #2068002] INFO -- : installing command scripts: /home/opc/ruby/install/master/bin I, [2024-05-21T15:56:27.136123 #2068002] INFO -- : installing library scripts: /home/opc/ruby/install/master/lib/ruby/3.4.0+0 I, [2024-05-21T15:56:27.222103 #2068002] INFO -- : installing common headers: /home/opc/ruby/install/master/include/ruby-3.4.0+0 I, [2024-05-21T15:56:27.238208 #2068002] INFO -- : installing manpages: /home/opc/ruby/install/master/share/man/man1 I, [2024-05-21T15:56:27.238493 #2068002] INFO -- : installing default gems from lib: /home/opc/ruby/install/master/lib/ruby/gems/3.4.0+0 I, [2024-05-21T15:56:27.279127 #2068002] INFO -- : benchmark 0.3.0 I, [2024-05-21T15:56:27.283145 #2068002] INFO -- : bundler 2.6.0.dev I, [2024-05-21T15:56:27.288144 #2068002] INFO -- : cgi 0.4.1 I, [2024-05-21T15:56:27.289402 #2068002] INFO -- : delegate 0.3.1 I, [2024-05-21T15:56:27.290480 #2068002] INFO -- : did_you_mean 1.6.3 I, [2024-05-21T15:56:27.291554 #2068002] INFO -- : english 0.8.0 I, [2024-05-21T15:56:27.292667 #2068002] INFO -- : erb 4.0.4 I, [2024-05-21T15:56:27.295234 #2068002] INFO -- : error_highlight 0.6.0 I, [2024-05-21T15:56:27.296373 #2068002] INFO -- : fileutils 1.7.2 I, [2024-05-21T15:56:27.297569 #2068002] INFO -- : find 0.2.0 I, [2024-05-21T15:56:27.298720 #2068002] INFO -- : forwardable 1.3.3 I, [2024-05-21T15:56:27.299837 #2068002] INFO -- : ipaddr 1.2.6 I, [2024-05-21T15:56:27.301023 #2068002] INFO -- : irb 1.13.1 I, [2024-05-21T15:56:27.305254 #2068002] INFO -- : logger 1.6.0 I, [2024-05-21T15:56:27.306437 #2068002] INFO -- : net-http 0.4.1 I, [2024-05-21T15:56:27.307599 #2068002] INFO -- : net-protocol 0.2.2 I, [2024-05-21T15:56:27.308830 #2068002] INFO -- : open-uri 0.4.1 I, [2024-05-21T15:56:27.310046 #2068002] INFO -- : open3 0.2.1 I, [2024-05-21T15:56:27.311213 #2068002] INFO -- : optparse 0.5.0 I, [2024-05-21T15:56:27.312402 #2068002] INFO -- : ostruct 0.6.0 I, [2024-05-21T15:56:27.313562 #2068002] INFO -- : pp 0.5.0 I, [2024-05-21T15:56:27.314723 #2068002] INFO -- : prettyprint 0.2.0 I, [2024-05-21T15:56:27.315902 #2068002] INFO -- : prism 0.29.0 I, [2024-05-21T15:56:27.317420 #2068002] INFO -- : pstore 0.1.3 I, [2024-05-21T15:56:27.318523 #2068002] INFO -- : rdoc 6.6.3.1 I, [2024-05-21T15:56:27.322379 #2068002] INFO -- : readline 0.0.4 I, [2024-05-21T15:56:27.323494 #2068002] INFO -- : reline 0.5.7 I, [2024-05-21T15:56:27.324681 #2068002] INFO -- : resolv 0.4.0 I, [2024-05-21T15:56:27.325888 #2068002] INFO -- : ruby2_keywords 0.0.5 I, [2024-05-21T15:56:27.327042 #2068002] INFO -- : securerandom 0.3.1 I, [2024-05-21T15:56:27.328160 #2068002] INFO -- : set 1.1.0 I, [2024-05-21T15:56:27.329383 #2068002] INFO -- : shellwords 0.2.0 I, [2024-05-21T15:56:27.330541 #2068002] INFO -- : singleton 0.2.0 I, [2024-05-21T15:56:27.331671 #2068002] INFO -- : syntax_suggest 2.0.0 I, [2024-05-21T15:56:27.334185 #2068002] INFO -- : tempfile 0.2.1 I, [2024-05-21T15:56:27.335304 #2068002] INFO -- : time 0.3.0 I, [2024-05-21T15:56:27.337565 #2068002] INFO -- : timeout 0.4.1 I, [2024-05-21T15:56:27.339128 #2068002] INFO -- : tmpdir 0.2.0 I, [2024-05-21T15:56:27.340288 #2068002] INFO -- : tsort 0.2.0 I, [2024-05-21T15:56:27.341474 #2068002] INFO -- : un 0.3.0 I, [2024-05-21T15:56:27.342564 #2068002] INFO -- : uri 0.13.0 I, [2024-05-21T15:56:27.343702 #2068002] INFO -- : weakref 0.1.3 I, [2024-05-21T15:56:27.344862 #2068002] INFO -- : yaml 0.3.0 I, [2024-05-21T15:56:27.345825 #2068002] INFO -- : installing default gems from ext: /home/opc/ruby/install/master/lib/ruby/gems/3.4.0+0 I, [2024-05-21T15:56:27.355486 #2068002] INFO -- : date 3.3.4 I, [2024-05-21T15:56:27.356667 #2068002] INFO -- : digest 3.1.1 I, [2024-05-21T15:56:27.357822 #2068002] INFO -- : etc 1.4.3 I, [2024-05-21T15:56:27.359060 #2068002] INFO -- : fcntl 1.1.0 I, [2024-05-21T15:56:27.360172 #2068002] INFO -- : fiddle 1.1.3 I, [2024-05-21T15:56:27.361355 #2068002] INFO -- : io-console 0.7.2 I, [2024-05-21T15:56:27.362514 #2068002] INFO -- : io-nonblock 0.3.0 I, [2024-05-21T15:56:27.363670 #2068002] INFO -- : io-wait 0.3.1 I, [2024-05-21T15:56:27.366392 #2068002] INFO -- : json 2.7.2 I, [2024-05-21T15:56:27.367699 #2068002] INFO -- : openssl 3.2.0 I, [2024-05-21T15:56:27.369001 #2068002] INFO -- : pathname 0.3.0 I, [2024-05-21T15:56:27.370182 #2068002] INFO -- : psych 5.1.2 I, [2024-05-21T15:56:27.371445 #2068002] INFO -- : stringio 3.1.1 I, [2024-05-21T15:56:27.372641 #2068002] INFO -- : strscan 3.1.1 I, [2024-05-21T15:56:27.373836 #2068002] INFO -- : zlib 3.1.0 I, [2024-05-21T15:56:27.374794 #2068002] INFO -- : installing bundled gems: /home/opc/ruby/install/master/lib/ruby/gems/3.4.0+0 I, [2024-05-21T15:56:27.375903 #2068002] INFO -- : minitest 5.23.0 I, [2024-05-21T15:56:27.392191 #2068002] INFO -- : rake 13.2.1 I, [2024-05-21T15:56:27.407868 #2068002] INFO -- : test-unit 3.6.2 I, [2024-05-21T15:56:27.423013 #2068002] INFO -- : rexml 3.2.8 I, [2024-05-21T15:56:27.437740 #2068002] INFO -- : rss 0.3.0 I, [2024-05-21T15:56:27.449558 #2068002] INFO -- : net-ftp 0.3.4 I, [2024-05-21T15:56:27.453305 #2068002] INFO -- : net-imap 0.4.11 I, [2024-05-21T15:56:27.464669 #2068002] INFO -- : net-pop 0.1.2 I, [2024-05-21T15:56:27.467255 #2068002] INFO -- : net-smtp 0.5.0 I, [2024-05-21T15:56:27.470726 #2068002] INFO -- : matrix 0.4.2 I, [2024-05-21T15:56:27.476838 #2068002] INFO -- : prime 0.1.2 I, [2024-05-21T15:56:27.487674 #2068002] INFO -- : rbs 3.4.4 I, [2024-05-21T15:56:27.592577 #2068002] INFO -- : typeprof 0.21.11 I, [2024-05-21T15:56:27.600744 #2068002] INFO -- : debug 1.9.2 I, [2024-05-21T15:56:27.612414 #2068002] INFO -- : racc 1.8.0 I, [2024-05-21T15:56:27.622539 #2068002] INFO -- : mutex_m 0.2.0 I, [2024-05-21T15:56:27.625624 #2068002] INFO -- : getoptlong 0.2.1 I, [2024-05-21T15:56:27.630543 #2068002] INFO -- : base64 0.2.0 I, [2024-05-21T15:56:27.633089 #2068002] INFO -- : bigdecimal 3.1.8 I, [2024-05-21T15:56:27.639299 #2068002] INFO -- : observer 0.1.2 I, [2024-05-21T15:56:27.642420 #2068002] INFO -- : abbrev 0.1.2 I, [2024-05-21T15:56:27.645405 #2068002] INFO -- : resolv-replace 0.1.1 I, [2024-05-21T15:56:27.650323 #2068002] INFO -- : rinda 0.2.0 I, [2024-05-21T15:56:27.653867 #2068002] INFO -- : drb 2.2.1 I, [2024-05-21T15:56:27.658478 #2068002] INFO -- : nkf 0.2.0 I, [2024-05-21T15:56:27.665539 #2068002] INFO -- : syslog 0.1.2 I, [2024-05-21T15:56:27.670197 #2068002] INFO -- : csv 3.3.0 I, [2024-05-21T15:56:27.679011 #2068002] INFO -- : installing bundled gem cache: /home/opc/ruby/install/master/lib/ruby/gems/3.4.0+0/cache I, [2024-05-21T15:56:27.681015 #2068002] INFO -- : skipped bundled gems: I, [2024-05-21T15:56:27.681040 #2068002] INFO -- : power_assert-2.0.4dev.gem not found in bundled_gems I, [2024-05-21T15:56:27.684068 #2068002] INFO -- : $$$[end] "make install -j3" exit with 0. I, [2024-05-21T15:56:27.684204 #2068002] INFO -- : $$$[beg] make yes-btest TESTOPTS='-q -j3' I, [2024-05-21T15:56:49.948217 #2068002] INFO -- : PASS all 1936 tests E, [2024-05-21T15:56:49.950403 #2068002] ERROR -- : I, [2024-05-21T15:56:49.950524 #2068002] INFO -- : $$$[end] "make yes-btest TESTOPTS='-q -j3'" exit with 0. I, [2024-05-21T15:56:49.950686 #2068002] INFO -- : $$$[beg] make yes-test-basic TESTS='-j3' I, [2024-05-21T15:56:50.042983 #2068002] INFO -- : BASERUBY = /usr/local/bin/ruby --disable=gems I, [2024-05-21T15:56:50.044471 #2068002] INFO -- : CC = gcc I, [2024-05-21T15:56:50.044556 #2068002] INFO -- : LD = ld I, [2024-05-21T15:56:50.044568 #2068002] INFO -- : LDSHARED = gcc -shared I, [2024-05-21T15:56:50.044598 #2068002] INFO -- : CFLAGS = -O3 -fno-fast-math -ggdb3 -Wall -Wextra -Wdeprecated-declarations -Wdiv-by-zero -Wduplicated-cond -Wimplicit-function-declaration -Wimplicit-int -Wpointer-arith -Wwrite-strings -Wold-style-definition -Wimplicit-fallthrough=0 -Wmissing-noreturn -Wno-cast-function-type -Wno-constant-logical-operand -Wno-long-long -Wno-missing-field-initializers -Wno-overlength-strings -Wno-packed-bitfield-compat -Wno-parentheses-equality -Wno-self-assign -Wno-tautological-compare -Wno-unused-parameter -Wno-unused-value -Wsuggest-attribute=format -Wsuggest-attribute=noreturn -Wunused-variable -Wmisleading-indentation -Wundef I, [2024-05-21T15:56:50.044609 #2068002] INFO -- : XCFLAGS = -U_FORTIFY_SOURCE -D_FORTIFY_SOURCE=2 -fstack-protector-strong -msign-return-address=all -fno-strict-overflow -fvisibility=hidden -fexcess-precision=standard -DRUBY_EXPORT -fPIE -I. -I.ext/include/aarch64-linux -I/home/opc/ruby/src/master/include -I/home/opc/ruby/src/master -I/home/opc/ruby/src/master/prism -I/home/opc/ruby/src/master/enc/unicode/15.0.0 I, [2024-05-21T15:56:50.044617 #2068002] INFO -- : CPPFLAGS = I, [2024-05-21T15:56:50.044625 #2068002] INFO -- : DLDFLAGS = -Wl,--compress-debug-sections=zlib -fstack-protector-strong -pie I, [2024-05-21T15:56:50.044633 #2068002] INFO -- : SOLIBS = -lz -lrt -lrt -ldl -lcrypt -lm -lpthread I, [2024-05-21T15:56:50.044641 #2068002] INFO -- : LANG = en_US.UTF-8 I, [2024-05-21T15:56:50.044648 #2068002] INFO -- : LC_ALL = I, [2024-05-21T15:56:50.044668 #2068002] INFO -- : LC_CTYPE = I, [2024-05-21T15:56:50.044676 #2068002] INFO -- : MFLAGS = I, [2024-05-21T15:56:50.044684 #2068002] INFO -- : RUSTC = rustc I, [2024-05-21T15:56:50.044692 #2068002] INFO -- : YJIT_RUSTC_ARGS = --crate-name=yjit --crate-type=staticlib --edition=2021 -g -C lto=thin -C opt-level=3 -C overflow-checks=on '--out-dir=/home/opc/ruby/build/master/yjit/target/release/' /home/opc/ruby/src/master/yjit/src/lib.rs I, [2024-05-21T15:56:50.044700 #2068002] INFO -- : gcc (GCC) 8.5.0 20210514 (Red Hat 8.5.0-10.1.0.1) I, [2024-05-21T15:56:50.044707 #2068002] INFO -- : Copyright (C) 2018 Free Software Foundation, Inc. I, [2024-05-21T15:56:50.044715 #2068002] INFO -- : This is free software; see the source for copying conditions. There is NO I, [2024-05-21T15:56:50.044723 #2068002] INFO -- : warranty; not even for MERCHANTABILITY or FITNESS FOR A PARTICULAR PURPOSE. I, [2024-05-21T15:56:50.044731 #2068002] INFO -- : I, [2024-05-21T15:56:50.202336 #2068002] INFO -- : Checking leaked global symbols...none I, [2024-05-21T15:56:50.255209 #2068002] INFO -- : /home/opc/ruby/src/master/basictest/test.rb:assignment ....................................................................................................................................................................................................................................................................................................................................................................................OK 372 I, [2024-05-21T15:56:50.255286 #2068002] INFO -- : /home/opc/ruby/src/master/basictest/test.rb:condition ..OK 2 I, [2024-05-21T15:56:50.255300 #2068002] INFO -- : /home/opc/ruby/src/master/basictest/test.rb:if/unless ...OK 3 I, [2024-05-21T15:56:50.255359 #2068002] INFO -- : /home/opc/ruby/src/master/basictest/test.rb:case .....OK 5 I, [2024-05-21T15:56:50.255943 #2068002] INFO -- : /home/opc/ruby/src/master/basictest/test.rb:while/until ........OK 8 I, [2024-05-21T15:56:50.256067 #2068002] INFO -- : /home/opc/ruby/src/master/basictest/test.rb:exception ..........OK 10 I, [2024-05-21T15:56:50.256736 #2068002] INFO -- : /home/opc/ruby/src/master/basictest/test.rb:array .......................................OK 39 I, [2024-05-21T15:56:50.257004 #2068002] INFO -- : /home/opc/ruby/src/master/basictest/test.rb:hash ...........................OK 27 I, [2024-05-21T15:56:50.258749 #2068002] INFO -- : /home/opc/ruby/src/master/basictest/test.rb:iterator ...........................................................................................................OK 107 I, [2024-05-21T15:56:50.259526 #2068002] INFO -- : /home/opc/ruby/src/master/basictest/test.rb:float ................................................................................OK 80 I, [2024-05-21T15:56:50.263046 #2068002] INFO -- : /home/opc/ruby/src/master/basictest/test.rb:bignum ...............................OK 31 I, [2024-05-21T15:56:50.264675 #2068002] INFO -- : /home/opc/ruby/src/master/basictest/test.rb:string & char ..............................................................OK 62 I, [2024-05-21T15:56:50.264830 #2068002] INFO -- : /home/opc/ruby/src/master/basictest/test.rb:assignment ..........OK 10 I, [2024-05-21T15:56:50.264905 #2068002] INFO -- : /home/opc/ruby/src/master/basictest/test.rb:call ......OK 6 I, [2024-05-21T15:56:50.265040 #2068002] INFO -- : /home/opc/ruby/src/master/basictest/test.rb:proc .........OK 9 I, [2024-05-21T15:56:50.365344 #2068002] INFO -- : /home/opc/ruby/src/master/basictest/test.rb:signal ..OK 2 I, [2024-05-21T15:56:50.366778 #2068002] INFO -- : /home/opc/ruby/src/master/basictest/test.rb:eval ...........................OK 27 I, [2024-05-21T15:56:50.498051 #2068002] INFO -- : /home/opc/ruby/src/master/basictest/test.rb:system ........OK 8 I, [2024-05-21T15:56:50.498117 #2068002] INFO -- : /home/opc/ruby/src/master/basictest/test.rb:const .....OK 5 I, [2024-05-21T15:56:50.498221 #2068002] INFO -- : /home/opc/ruby/src/master/basictest/test.rb:clone .....OK 5 I, [2024-05-21T15:56:50.498410 #2068002] INFO -- : /home/opc/ruby/src/master/basictest/test.rb:marshal ....OK 4 I, [2024-05-21T15:56:50.498489 #2068002] INFO -- : /home/opc/ruby/src/master/basictest/test.rb:pack ....OK 4 I, [2024-05-21T15:56:50.498520 #2068002] INFO -- : /home/opc/ruby/src/master/basictest/test.rb:math ..OK 2 I, [2024-05-21T15:56:50.498622 #2068002] INFO -- : /home/opc/ruby/src/master/basictest/test.rb:struct ......OK 6 I, [2024-05-21T15:56:50.498779 #2068002] INFO -- : /home/opc/ruby/src/master/basictest/test.rb:variable ............OK 12 I, [2024-05-21T15:56:50.498820 #2068002] INFO -- : /home/opc/ruby/src/master/basictest/test.rb:trace ...OK 3 I, [2024-05-21T15:56:50.498949 #2068002] INFO -- : /home/opc/ruby/src/master/basictest/test.rb:defined? ............OK 12 I, [2024-05-21T15:56:50.499035 #2068002] INFO -- : /home/opc/ruby/src/master/basictest/test.rb:alias ......OK 6 I, [2024-05-21T15:56:50.499572 #2068002] INFO -- : /home/opc/ruby/src/master/basictest/test.rb:path .......................OK 23 I, [2024-05-21T15:56:50.567605 #2068002] INFO -- : /home/opc/ruby/src/master/basictest/test.rb:gc ....OK 4 I, [2024-05-21T15:56:50.569477 #2068002] INFO -- : I, [2024-05-21T15:56:50.569506 #2068002] INFO -- : test succeeded I, [2024-05-21T15:56:50.570123 #2068002] INFO -- : $$$[end] "make yes-test-basic TESTS='-j3'" exit with 0. I, [2024-05-21T15:56:50.570326 #2068002] INFO -- : $$$[beg] make yes-test-all TESTOPTS='--stderr-on-failure' TESTS='-j3' I, [2024-05-21T15:56:50.694034 #2068002] INFO -- : BASERUBY = /usr/local/bin/ruby --disable=gems I, [2024-05-21T15:56:50.694111 #2068002] INFO -- : CC = gcc I, [2024-05-21T15:56:50.694145 #2068002] INFO -- : LD = ld I, [2024-05-21T15:56:50.694158 #2068002] INFO -- : LDSHARED = gcc -shared I, [2024-05-21T15:56:50.694168 #2068002] INFO -- : CFLAGS = -O3 -fno-fast-math -ggdb3 -Wall -Wextra -Wdeprecated-declarations -Wdiv-by-zero -Wduplicated-cond -Wimplicit-function-declaration -Wimplicit-int -Wpointer-arith -Wwrite-strings -Wold-style-definition -Wimplicit-fallthrough=0 -Wmissing-noreturn -Wno-cast-function-type -Wno-constant-logical-operand -Wno-long-long -Wno-missing-field-initializers -Wno-overlength-strings -Wno-packed-bitfield-compat -Wno-parentheses-equality -Wno-self-assign -Wno-tautological-compare -Wno-unused-parameter -Wno-unused-value -Wsuggest-attribute=format -Wsuggest-attribute=noreturn -Wunused-variable -Wmisleading-indentation -Wundef I, [2024-05-21T15:56:50.694177 #2068002] INFO -- : XCFLAGS = -U_FORTIFY_SOURCE -D_FORTIFY_SOURCE=2 -fstack-protector-strong -msign-return-address=all -fno-strict-overflow -fvisibility=hidden -fexcess-precision=standard -DRUBY_EXPORT -fPIE -I. -I.ext/include/aarch64-linux -I/home/opc/ruby/src/master/include -I/home/opc/ruby/src/master -I/home/opc/ruby/src/master/prism -I/home/opc/ruby/src/master/enc/unicode/15.0.0 I, [2024-05-21T15:56:50.694187 #2068002] INFO -- : CPPFLAGS = I, [2024-05-21T15:56:50.694195 #2068002] INFO -- : DLDFLAGS = -Wl,--compress-debug-sections=zlib -fstack-protector-strong -pie I, [2024-05-21T15:56:50.694205 #2068002] INFO -- : SOLIBS = -lz -lrt -lrt -ldl -lcrypt -lm -lpthread I, [2024-05-21T15:56:50.694213 #2068002] INFO -- : LANG = en_US.UTF-8 I, [2024-05-21T15:56:50.694221 #2068002] INFO -- : LC_ALL = I, [2024-05-21T15:56:50.694229 #2068002] INFO -- : LC_CTYPE = I, [2024-05-21T15:56:50.694237 #2068002] INFO -- : MFLAGS = I, [2024-05-21T15:56:50.694245 #2068002] INFO -- : RUSTC = rustc I, [2024-05-21T15:56:50.694253 #2068002] INFO -- : YJIT_RUSTC_ARGS = --crate-name=yjit --crate-type=staticlib --edition=2021 -g -C lto=thin -C opt-level=3 -C overflow-checks=on '--out-dir=/home/opc/ruby/build/master/yjit/target/release/' /home/opc/ruby/src/master/yjit/src/lib.rs I, [2024-05-21T15:56:50.694886 #2068002] INFO -- : gcc (GCC) 8.5.0 20210514 (Red Hat 8.5.0-10.1.0.1) I, [2024-05-21T15:56:50.694903 #2068002] INFO -- : Copyright (C) 2018 Free Software Foundation, Inc. I, [2024-05-21T15:56:50.694912 #2068002] INFO -- : This is free software; see the source for copying conditions. There is NO I, [2024-05-21T15:56:50.694920 #2068002] INFO -- : warranty; not even for MERCHANTABILITY or FITNESS FOR A PARTICULAR PURPOSE. I, [2024-05-21T15:56:50.694928 #2068002] INFO -- : I, [2024-05-21T15:56:50.696926 #2068002] INFO -- : generating enc.mk I, [2024-05-21T15:56:50.933877 #2068002] INFO -- : generating encdb.h I, [2024-05-21T15:56:50.971953 #2068002] INFO -- : encdb.h unchanged I, [2024-05-21T15:56:50.973150 #2068002] INFO -- : making enc I, [2024-05-21T15:56:51.000285 #2068002] INFO -- : make[1]: Entering directory '/home/opc/ruby/build/master' I, [2024-05-21T15:56:51.000327 #2068002] INFO -- : make[1]: Nothing to be done for 'enc'. I, [2024-05-21T15:56:51.000337 #2068002] INFO -- : make[1]: Leaving directory '/home/opc/ruby/build/master' I, [2024-05-21T15:56:51.001108 #2068002] INFO -- : making srcs under enc I, [2024-05-21T15:56:51.043086 #2068002] INFO -- : make[1]: Entering directory '/home/opc/ruby/build/master' I, [2024-05-21T15:56:51.043170 #2068002] INFO -- : make[1]: Nothing to be done for 'srcs'. I, [2024-05-21T15:56:51.043181 #2068002] INFO -- : make[1]: Leaving directory '/home/opc/ruby/build/master' I, [2024-05-21T15:56:51.044263 #2068002] INFO -- : generating transdb.h I, [2024-05-21T15:56:51.186232 #2068002] INFO -- : transdb.h unchanged I, [2024-05-21T15:56:51.187386 #2068002] INFO -- : making trans I, [2024-05-21T15:56:51.235666 #2068002] INFO -- : make[1]: Entering directory '/home/opc/ruby/build/master' I, [2024-05-21T15:56:51.235742 #2068002] INFO -- : make[1]: Nothing to be done for 'trans'. I, [2024-05-21T15:56:51.235753 #2068002] INFO -- : make[1]: Leaving directory '/home/opc/ruby/build/master' I, [2024-05-21T15:56:51.236481 #2068002] INFO -- : making encs I, [2024-05-21T15:56:51.289130 #2068002] INFO -- : make[1]: Entering directory '/home/opc/ruby/build/master' I, [2024-05-21T15:56:51.289200 #2068002] INFO -- : make[1]: Nothing to be done for 'encs'. I, [2024-05-21T15:56:51.289210 #2068002] INFO -- : make[1]: Leaving directory '/home/opc/ruby/build/master' I, [2024-05-21T15:56:51.291136 #2068002] INFO -- : generating makefiles ext/configure-ext.mk I, [2024-05-21T15:56:51.330961 #2068002] INFO -- : ext/configure-ext.mk updated I, [2024-05-21T15:56:51.334193 #2068002] INFO -- : make[1]: Entering directory '/home/opc/ruby/build/master' I, [2024-05-21T15:56:53.474977 #2068002] INFO -- : make[1]: Leaving directory '/home/opc/ruby/build/master' I, [2024-05-21T15:56:53.475662 #2068002] INFO -- : generating makefile exts.mk I, [2024-05-21T15:56:53.534404 #2068002] INFO -- : exts.mk unchanged I, [2024-05-21T15:56:53.539271 #2068002] INFO -- : make[1]: Entering directory '/home/opc/ruby/build/master' I, [2024-05-21T15:56:53.836263 #2068002] INFO -- : make[2]: Entering directory '/home/opc/ruby/build/master/ext/coverage' I, [2024-05-21T15:56:53.840851 #2068002] INFO -- : make[2]: Leaving directory '/home/opc/ruby/build/master/ext/coverage' I, [2024-05-21T15:56:53.846414 #2068002] INFO -- : make[2]: Entering directory '/home/opc/ruby/build/master/ext/date' I, [2024-05-21T15:56:53.851620 #2068002] INFO -- : make[2]: Leaving directory '/home/opc/ruby/build/master/ext/date' I, [2024-05-21T15:56:53.854992 #2068002] INFO -- : make[2]: Entering directory '/home/opc/ruby/build/master/ext/digest' I, [2024-05-21T15:56:53.863658 #2068002] INFO -- : make[2]: Leaving directory '/home/opc/ruby/build/master/ext/digest' I, [2024-05-21T15:56:53.886089 #2068002] INFO -- : make[2]: Entering directory '/home/opc/ruby/build/master/ext/digest/sha2' I, [2024-05-21T15:56:53.890935 #2068002] INFO -- : make[2]: Leaving directory '/home/opc/ruby/build/master/ext/digest/sha2' I, [2024-05-21T15:56:53.908795 #2068002] INFO -- : make[2]: Entering directory '/home/opc/ruby/build/master/ext/fiddle' I, [2024-05-21T15:56:53.919122 #2068002] INFO -- : make[2]: Leaving directory '/home/opc/ruby/build/master/ext/fiddle' I, [2024-05-21T15:56:53.923358 #2068002] INFO -- : make[2]: Entering directory '/home/opc/ruby/build/master/ext/io/console' I, [2024-05-21T15:56:53.927505 #2068002] INFO -- : make[2]: Leaving directory '/home/opc/ruby/build/master/ext/io/console' I, [2024-05-21T15:56:53.938125 #2068002] INFO -- : make[2]: Entering directory '/home/opc/ruby/build/master/ext/json' I, [2024-05-21T15:56:53.947549 #2068002] INFO -- : make[2]: Leaving directory '/home/opc/ruby/build/master/ext/json' I, [2024-05-21T15:56:53.960430 #2068002] INFO -- : make[2]: Entering directory '/home/opc/ruby/build/master/ext/monitor' I, [2024-05-21T15:56:53.964535 #2068002] INFO -- : make[2]: Leaving directory '/home/opc/ruby/build/master/ext/monitor' I, [2024-05-21T15:56:53.970654 #2068002] INFO -- : make[2]: Entering directory '/home/opc/ruby/build/master/ext/objspace' I, [2024-05-21T15:56:53.976570 #2068002] INFO -- : make[2]: Leaving directory '/home/opc/ruby/build/master/ext/objspace' I, [2024-05-21T15:56:53.995432 #2068002] INFO -- : make[2]: Entering directory '/home/opc/ruby/build/master/ext/openssl' I, [2024-05-21T15:56:54.016994 #2068002] INFO -- : make[2]: Leaving directory '/home/opc/ruby/build/master/ext/openssl' I, [2024-05-21T15:56:54.021508 #2068002] INFO -- : make[2]: Entering directory '/home/opc/ruby/build/master/ext/pathname' I, [2024-05-21T15:56:54.025607 #2068002] INFO -- : make[2]: Leaving directory '/home/opc/ruby/build/master/ext/pathname' I, [2024-05-21T15:56:54.031796 #2068002] INFO -- : make[2]: Entering directory '/home/opc/ruby/build/master/ext/psych' I, [2024-05-21T15:56:54.054239 #2068002] INFO -- : make[2]: Leaving directory '/home/opc/ruby/build/master/ext/psych' I, [2024-05-21T15:56:54.058778 #2068002] INFO -- : make[2]: Entering directory '/home/opc/ruby/build/master/ext/pty' I, [2024-05-21T15:56:54.062954 #2068002] INFO -- : make[2]: Leaving directory '/home/opc/ruby/build/master/ext/pty' I, [2024-05-21T15:56:54.076159 #2068002] INFO -- : make[2]: Entering directory '/home/opc/ruby/build/master/ext/ripper' I, [2024-05-21T15:56:54.083823 #2068002] INFO -- : make[2]: Leaving directory '/home/opc/ruby/build/master/ext/ripper' I, [2024-05-21T15:56:54.085790 #2068002] INFO -- : make[2]: Entering directory '/home/opc/ruby/build/master/ext/rubyvm' I, [2024-05-21T15:56:54.089075 #2068002] INFO -- : make[2]: Leaving directory '/home/opc/ruby/build/master/ext/rubyvm' I, [2024-05-21T15:56:54.100988 #2068002] INFO -- : make[2]: Entering directory '/home/opc/ruby/build/master/ext/socket' I, [2024-05-21T15:56:54.111592 #2068002] INFO -- : make[2]: Leaving directory '/home/opc/ruby/build/master/ext/socket' I, [2024-05-21T15:56:54.126771 #2068002] INFO -- : make[2]: Entering directory '/home/opc/ruby/build/master/.bundle/gems/bigdecimal-3.1.7/ext/bigdecimal' I, [2024-05-21T15:56:54.156892 #2068002] INFO -- : make[2]: Leaving directory '/home/opc/ruby/build/master/.bundle/gems/bigdecimal-3.1.7/ext/bigdecimal' I, [2024-05-21T15:56:54.159580 #2068002] INFO -- : make[2]: Entering directory '/home/opc/ruby/build/master/.bundle/gems/bigdecimal-3.1.8/ext/bigdecimal' I, [2024-05-21T15:56:54.189594 #2068002] INFO -- : make[2]: Leaving directory '/home/opc/ruby/build/master/.bundle/gems/bigdecimal-3.1.8/ext/bigdecimal' I, [2024-05-21T15:56:54.192187 #2068002] INFO -- : make[2]: Entering directory '/home/opc/ruby/build/master/.bundle/gems/debug-1.9.2/ext/debug' I, [2024-05-21T15:56:54.222111 #2068002] INFO -- : make[2]: Leaving directory '/home/opc/ruby/build/master/.bundle/gems/debug-1.9.2/ext/debug' I, [2024-05-21T15:56:54.224735 #2068002] INFO -- : make[2]: Entering directory '/home/opc/ruby/build/master/.bundle/gems/nkf-0.2.0/ext/nkf' I, [2024-05-21T15:56:54.254971 #2068002] INFO -- : make[2]: Leaving directory '/home/opc/ruby/build/master/.bundle/gems/nkf-0.2.0/ext/nkf' I, [2024-05-21T15:56:54.257498 #2068002] INFO -- : make[2]: Entering directory '/home/opc/ruby/build/master/.bundle/gems/racc-1.7.3/ext/racc/cparse' I, [2024-05-21T15:56:54.287185 #2068002] INFO -- : make[2]: Leaving directory '/home/opc/ruby/build/master/.bundle/gems/racc-1.7.3/ext/racc/cparse' I, [2024-05-21T15:56:54.289724 #2068002] INFO -- : make[2]: Entering directory '/home/opc/ruby/build/master/.bundle/gems/racc-1.8.0/ext/racc/cparse' I, [2024-05-21T15:56:54.319759 #2068002] INFO -- : make[2]: Leaving directory '/home/opc/ruby/build/master/.bundle/gems/racc-1.8.0/ext/racc/cparse' I, [2024-05-21T15:56:54.322707 #2068002] INFO -- : make[2]: Entering directory '/home/opc/ruby/build/master/.bundle/gems/rbs-3.4.4/ext/rbs_extension' I, [2024-05-21T15:56:54.352561 #2068002] INFO -- : make[2]: Leaving directory '/home/opc/ruby/build/master/.bundle/gems/rbs-3.4.4/ext/rbs_extension' I, [2024-05-21T15:56:54.355069 #2068002] INFO -- : make[2]: Entering directory '/home/opc/ruby/build/master/.bundle/gems/syslog-0.1.2/ext/syslog' I, [2024-05-21T15:56:54.385700 #2068002] INFO -- : make[2]: Leaving directory '/home/opc/ruby/build/master/.bundle/gems/syslog-0.1.2/ext/syslog' I, [2024-05-21T15:56:54.423701 #2068002] INFO -- : make[2]: Entering directory '/home/opc/ruby/build/master' I, [2024-05-21T15:56:54.507070 #2068002] INFO -- : make[2]: 'ruby' is up to date. I, [2024-05-21T15:56:54.507148 #2068002] INFO -- : make[2]: Leaving directory '/home/opc/ruby/build/master' I, [2024-05-21T15:56:54.507251 #2068002] INFO -- : make[1]: Leaving directory '/home/opc/ruby/build/master' I, [2024-05-21T15:56:54.511679 #2068002] INFO -- : make[1]: Entering directory '/home/opc/ruby/build/master' I, [2024-05-21T15:56:54.511705 #2068002] INFO -- : make[1]: Nothing to be done for 'note'. I, [2024-05-21T15:56:54.511715 #2068002] INFO -- : make[1]: Leaving directory '/home/opc/ruby/build/master' I, [2024-05-21T15:56:54.623536 #2068002] INFO -- : Run options: I, [2024-05-21T15:56:54.623626 #2068002] INFO -- : --seed=46039 I, [2024-05-21T15:56:54.623646 #2068002] INFO -- : "--ruby=./miniruby -I/home/opc/ruby/src/master/lib -I. -I.ext/common /home/opc/ruby/src/master/tool/runruby.rb --extout=.ext -- --disable-gems" I, [2024-05-21T15:56:54.623663 #2068002] INFO -- : --excludes-dir=/home/opc/ruby/src/master/test/.excludes I, [2024-05-21T15:56:54.623671 #2068002] INFO -- : --name=!/memory_leak/ I, [2024-05-21T15:56:54.623679 #2068002] INFO -- : --stderr-on-failure I, [2024-05-21T15:56:54.623687 #2068002] INFO -- : -j3 I, [2024-05-21T15:56:54.623696 #2068002] INFO -- : I, [2024-05-21T15:56:54.623704 #2068002] INFO -- : # Running tests: I, [2024-05-21T15:56:54.623712 #2068002] INFO -- : I, [2024-05-21T15:56:54.754344 #2068002] INFO -- : [ 1/885] 2108858=test_scanner_events I, [2024-05-21T15:56:54.756174 #2068002] INFO -- : [ 2/885] 2108859=test_ocsp I, [2024-05-21T15:56:54.774407 #2068002] INFO -- : [ 3/885] 2108860=test_ipaddr I, [2024-05-21T15:56:54.800798 #2068002] INFO -- : [ 4/885] 2108860=test_omap I, [2024-05-21T15:56:54.808437 #2068002] INFO -- : [ 5/885] 2108858=test_date_strptime I, [2024-05-21T15:56:54.823469 #2068002] INFO -- : [ 6/885] 2108860=test_rdoc_generator_pot_po I, [2024-05-21T15:56:54.894941 #2068002] INFO -- : [ 7/885] 2108859=test_shellwords I, [2024-05-21T15:56:54.904203 #2068002] INFO -- : [ 8/885] 2108859=test_mul I, [2024-05-21T15:56:54.908097 #2068002] INFO -- : [ 9/885] 2108859=json_ext_parser_test I, [2024-05-21T15:56:54.918576 #2068002] INFO -- : [ 10/885] 2108858=test_gem_ext_configure_builder I, [2024-05-21T15:56:54.924815 #2068002] INFO -- : [ 11/885] 2108859=test_nonblock I, [2024-05-21T15:56:54.934670 #2068002] INFO -- : [ 12/885] 2108860=test_rdoc_parser_simple I, [2024-05-21T15:56:54.960727 #2068002] INFO -- : [ 13/885] 2108859=test_io_m17n I, [2024-05-21T15:56:55.016319 #2068002] INFO -- : [ 14/885] 2108860=test_rdoc_top_level I, [2024-05-21T15:56:55.115125 #2068002] INFO -- : [ 15/885] 2108858=test_cmethod I, [2024-05-21T15:56:55.124779 #2068002] INFO -- : [ 16/885] 2108858=test_float I, [2024-05-21T15:56:55.263736 #2068002] INFO -- : [ 17/885] 2108860=test_gem_stub_specification I, [2024-05-21T15:56:55.589133 #2068002] INFO -- : [ 18/885] 2108860=test_color I, [2024-05-21T15:56:55.705865 #2068002] INFO -- : [ 19/885] 2108860=test_propertyputref I, [2024-05-21T15:56:55.709733 #2068002] INFO -- : [ 20/885] 2108860=test_gb18030 I, [2024-05-21T15:56:55.720016 #2068002] INFO -- : [ 21/885] 2108860=test_gem_commands_lock_command I, [2024-05-21T15:56:55.741360 #2068002] INFO -- : [ 22/885] 2108860=test_reline_key I, [2024-05-21T15:56:55.754872 #2068002] INFO -- : [ 23/885] 2108860=test_unicode_normalize I, [2024-05-21T15:56:56.196512 #2068002] INFO -- : [ 24/885] 2108859=test_gem_stream_ui I, [2024-05-21T15:56:56.442096 #2068002] INFO -- : [ 25/885] 2108859=test_rdoc_generator_ri I, [2024-05-21T15:56:56.452056 #2068002] INFO -- : [ 26/885] 2108858=test_files_test_1 I, [2024-05-21T15:56:56.533409 #2068002] INFO -- : [ 27/885] 2108859=test_dir I, [2024-05-21T15:56:56.658772 #2068002] INFO -- : Leaked file descriptor: TestDir#test_home: 7 # I, [2024-05-21T15:56:56.658843 #2068002] INFO -- : Leaked file descriptor: TestDir#test_home: 8 # I, [2024-05-21T15:56:56.685077 #2068002] INFO -- : COMMAND PID USER FD TYPE DEVICE SIZE/OFF NODE NAME I, [2024-05-21T15:56:56.685153 #2068002] INFO -- : ruby 2108859 opc 7r REG 252,0 9253600 13705411 /var/lib/sss/mc/passwd I, [2024-05-21T15:56:56.685163 #2068002] INFO -- : ruby 2108859 opc 8u unix 0x0000000000000000 0t0 3081829352 type=STREAM I, [2024-05-21T15:56:56.868698 #2068002] INFO -- : [ 28/885] 2108859=test_closure I, [2024-05-21T15:56:58.837818 #2068002] INFO -- : [ 29/885] 2108859=test_rubygems I, [2024-05-21T15:56:58.991285 #2068002] INFO -- : [ 30/885] 2108859=test_resolve_symbol I, [2024-05-21T15:56:59.005833 #2068002] INFO -- : [ 31/885] 2108858=test_path I, [2024-05-21T15:56:59.024304 #2068002] INFO -- : [ 32/885] 2108858=test_digest I, [2024-05-21T15:56:59.028467 #2068002] INFO -- : [ 33/885] 2108858=test_rdoc_rd_inline I, [2024-05-21T15:56:59.037780 #2068002] INFO -- : [ 34/885] 2108859=test_uncorrectable_name_check I, [2024-05-21T15:56:59.079223 #2068002] INFO -- : [ 35/885] 2108859=test_io I, [2024-05-21T15:56:59.173012 #2068002] INFO -- : [ 36/885] 2108858=test_x509attr I, [2024-05-21T15:56:59.179958 #2068002] INFO -- : [ 37/885] 2108858=test_printf I, [2024-05-21T15:56:59.284749 #2068002] INFO -- : [ 38/885] 2108858=test_workspace I, [2024-05-21T15:56:59.443862 #2068002] INFO -- : [ 39/885] 2108858=magic_comment_test I, [2024-05-21T15:56:59.510272 #2068002] INFO -- : [ 40/885] 2108858=test_win32ole_variant I, [2024-05-21T15:56:59.516021 #2068002] INFO -- : [ 41/885] 2108860=test_cgi_modruby I, [2024-05-21T15:56:59.518172 #2068002] INFO -- : [ 42/885] 2108858=test_win32ole_param_event I, [2024-05-21T15:56:59.538595 #2068002] INFO -- : [ 43/885] 2108858=test_https_proxy I, [2024-05-21T15:56:59.549813 #2068002] INFO -- : [ 44/885] 2108860=test_rdoc_parser I, [2024-05-21T15:56:59.584175 #2068002] INFO -- : [ 45/885] 2108860=test_gem_commands_rebuild_command I, [2024-05-21T15:56:59.589228 #2068002] INFO -- : [ 46/885] 2108858=test_nomethod_error I, [2024-05-21T15:56:59.621900 #2068002] INFO -- : [ 47/885] 2108858=test_etc I, [2024-05-21T15:56:59.623126 #2068002] INFO -- : Leaked file descriptor: TestEtc#test_getgrgid: 8 # I, [2024-05-21T15:56:59.649504 #2068002] INFO -- : [ 48/885] 2108860=test_statCOMMAND PID USER FD TYPE DEVICE SIZE/OFF NODE NAME I, [2024-05-21T15:56:59.649577 #2068002] INFO -- : ruby 2108858 opc 8u unix 0x0000000000000000 0t0 3081830880 type=STREAM I, [2024-05-21T15:56:59.652653 #2068002] INFO -- : I, [2024-05-21T15:56:59.668007 #2068002] INFO -- : [ 49/885] 2108860=test_lazy_enumerator I, [2024-05-21T15:56:59.675570 #2068002] INFO -- : Leaked file descriptor: TestEtc#test_getpwnam: 9 # I, [2024-05-21T15:56:59.691523 #2068002] INFO -- : COMMAND PID USER FD TYPE DEVICE SIZE/OFF NODE NAME I, [2024-05-21T15:56:59.691591 #2068002] INFO -- : ruby 2108858 opc 9r REG 252,0 9253600 13705411 /var/lib/sss/mc/passwd I, [2024-05-21T15:56:59.813754 #2068002] INFO -- : [ 50/885] 2108858=test_cgi_multipart I, [2024-05-21T15:56:59.904443 #2068002] INFO -- : [ 51/885] 2108858=test_gem_request_set_lockfile_tokenizer I, [2024-05-21T15:57:00.035974 #2068002] INFO -- : [ 52/885] 2108858=test_ractor_compatibility I, [2024-05-21T15:57:00.112670 #2068002] INFO -- : [ 53/885] 2108860=test_arithmetic_sequence I, [2024-05-21T15:57:00.130432 #2068002] INFO -- : [ 54/885] 2108860=integer_parse_test I, [2024-05-21T15:57:00.190499 #2068002] INFO -- : [ 55/885] 2108860=test_autoconf I, [2024-05-21T15:57:00.209906 #2068002] INFO -- : [ 56/885] 2108860=test_find_executable I, [2024-05-21T15:57:00.281865 #2068002] INFO -- : [ 57/885] 2108860=test_sockopt I, [2024-05-21T15:57:00.301725 #2068002] INFO -- : [ 58/885] 2108860=test_ftp I, [2024-05-21T15:57:00.313048 #2068002] INFO -- : [ 59/885] 2108860=test_gem_source_fetch_problem I, [2024-05-21T15:57:00.323611 #2068002] INFO -- : [ 60/885] 2108860=test_install I, [2024-05-21T15:57:00.360940 #2068002] INFO -- : [ 61/885] 2108858=test_encoding I, [2024-05-21T15:57:00.384576 #2068002] INFO -- : [ 62/885] 2108858=test_rdoc_comment I, [2024-05-21T15:57:00.442542 #2068002] INFO -- : [ 63/885] 2108858=command_line_test I, [2024-05-21T15:57:00.446034 #2068002] INFO -- : [ 64/885] 2108858=test_win32ole_variant_m I, [2024-05-21T15:57:00.502022 #2068002] INFO -- : [ 65/885] 2108858=test_pair I, [2024-05-21T15:57:00.530145 #2068002] INFO -- : [ 66/885] 2108860=test_gem_commands_signout_command I, [2024-05-21T15:57:00.564967 #2068002] INFO -- : [ 67/885] 2108860=test_gem_package_tar_reader I, [2024-05-21T15:57:00.609801 #2068002] INFO -- : [ 68/885] 2108860=test_env I, [2024-05-21T15:57:03.125883 #2068002] INFO -- : [ 69/885] 2108860=test_document I, [2024-05-21T15:57:03.169218 #2068002] INFO -- : [ 70/885] 2108860=test_eval I, [2024-05-21T15:57:03.188640 #2068002] INFO -- : [ 71/885] 2108860=test_gem_safe_yaml I, [2024-05-21T15:57:03.220770 #2068002] INFO -- : [ 72/885] 2108860=test_gem_commands_setup_command I, [2024-05-21T15:57:04.042324 #2068002] INFO -- : [ 73/885] 2108860=test_history I, [2024-05-21T15:57:04.067624 #2068002] INFO -- : [ 74/885] 2108860=test_singleton_function I, [2024-05-21T15:57:04.076276 #2068002] INFO -- : [ 75/885] 2108860=test_iseq I, [2024-05-21T15:57:04.618066 #2068002] INFO -- : [ 76/885] 2108860=test_primitive I, [2024-05-21T15:57:04.644857 #2068002] INFO -- : [ 77/885] 2108860=test_parser I, [2024-05-21T15:57:04.673899 #2068002] INFO -- : [ 78/885] 2108860=test_rdoc_ri_paths I, [2024-05-21T15:57:04.726395 #2068002] INFO -- : [ 79/885] 2108860=test_gem_source_git I, [2024-05-21T15:57:05.731379 #2068002] INFO -- : [ 80/885] 2108860=test_win32ole_method I, [2024-05-21T15:57:05.739311 #2068002] INFO -- : [ 81/885] 2108860=test_lexer I, [2024-05-21T15:57:05.777877 #2068002] INFO -- : [ 82/885] 2108860=test_regex_casefold I, [2024-05-21T15:57:05.778312 #2068002] INFO -- : [ 83/885] 2108858=test_ripper I, [2024-05-21T15:57:05.800463 #2068002] INFO -- : [ 84/885] 2108859=test_files_ext I, [2024-05-21T15:57:05.896681 #2068002] INFO -- : [ 85/885] 2108859=test_stringio I, [2024-05-21T15:57:05.991495 #2068002] INFO -- : [ 86/885] 2108859=test_assembler I, [2024-05-21T15:57:05.991845 #2068002] INFO -- : [ 87/885] 2108859=test_thread_cv I, [2024-05-21T15:57:06.115198 #2068002] INFO -- : [ 88/885] 2108858=test_random I, [2024-05-21T15:57:06.122534 #2068002] INFO -- : [ 89/885] 2108858=test_eval_history I, [2024-05-21T15:57:06.135389 #2068002] INFO -- : [ 90/885] 2108858=dispatcher_test I, [2024-05-21T15:57:06.157430 #2068002] INFO -- : [ 91/885] 2108858=test_unicode I, [2024-05-21T15:57:06.179579 #2068002] INFO -- : [ 92/885] 2108860=test_autoload I, [2024-05-21T15:57:06.211767 #2068002] INFO -- : [ 93/885] 2108858=test_gem_package I, [2024-05-21T15:57:06.640380 #2068002] INFO -- : [ 94/885] 2108859=test_array I, [2024-05-21T15:57:06.911213 #2068002] INFO -- : [ 95/885] 2108858=test_benchmark I, [2024-05-21T15:57:08.199939 #2068002] INFO -- : [ 96/885] 2108858=test_at_exit I, [2024-05-21T15:57:08.256955 #2068002] INFO -- : [ 97/885] 2108858=test_have_macro I, [2024-05-21T15:57:08.606964 #2068002] INFO -- : [ 98/885] 2108858=test_gem_source I, [2024-05-21T15:57:08.932058 #2068002] INFO -- : [ 99/885] 2108858=test_mkmf I, [2024-05-21T15:57:08.954739 #2068002] INFO -- : [100/885] 2108858=test_class I, [2024-05-21T15:57:08.971286 #2068002] INFO -- : [101/885] 2108858=test_ractor I, [2024-05-21T15:57:09.049074 #2068002] INFO -- : [102/885] 2108858=test_gem_resolver_installed_specification I, [2024-05-21T15:57:09.072622 #2068002] INFO -- : [103/885] 2108858=test_exception_at_throwing I, [2024-05-21T15:57:09.124613 #2068002] INFO -- : [104/885] 2108858=test_stringscanner I, [2024-05-21T15:57:09.208028 #2068002] INFO -- : [105/885] 2108858=test_fiddle I, [2024-05-21T15:57:09.267223 #2068002] INFO -- : [106/885] 2108858=json_generic_object_test I, [2024-05-21T15:57:09.276004 #2068002] INFO -- : [107/885] 2108858=test_gem_resolver_vendor_specification I, [2024-05-21T15:57:09.306615 #2068002] INFO -- : [108/885] 2108858=test_date_arith I, [2024-05-21T15:57:09.330568 #2068002] INFO -- : [109/885] 2108858=test_gem_safe_marshal I, [2024-05-21T15:57:10.030590 #2068002] INFO -- : [110/885] 2108858=test_rdoc_ri_driver I, [2024-05-21T15:57:10.476127 #2068002] INFO -- : [111/885] 2108858=test_ractor I, [2024-05-21T15:57:10.482123 #2068002] INFO -- : [112/885] 2108858=test_sexp I, [2024-05-21T15:57:10.504557 #2068002] INFO -- : [113/885] 2108858=test_httpheader I, [2024-05-21T15:57:10.729529 #2068002] INFO -- : [114/885] 2108858=test_signedness I, [2024-05-21T15:57:10.804191 #2068002] INFO -- : [115/885] 2108860=test_gem_resolver_git_set I, [2024-05-21T15:57:10.860613 #2068002] INFO -- : [116/885] 2108859=test_gem_commands_check_command I, [2024-05-21T15:57:10.882551 #2068002] INFO -- : [117/885] 2108859=test_digest I, [2024-05-21T15:57:11.353461 #2068002] INFO -- : [118/885] 2108860=test_dup I, [2024-05-21T15:57:11.506553 #2068002] INFO -- : [119/885] 2108860=test_rdoc_single_class I, [2024-05-21T15:57:11.519168 #2068002] INFO -- : [120/885] 2108860=test_acceptable I, [2024-05-21T15:57:11.646412 #2068002] INFO -- : [121/885] 2108860=test_gem_ext_cargo_builder_link_flag_converter I, [2024-05-21T15:57:11.648788 #2068002] INFO -- : [122/885] 2108859=test_gem_local_remote_options I, [2024-05-21T15:57:11.697425 #2068002] INFO -- : [123/885] 2108859=test_rdoc_token_stream I, [2024-05-21T15:57:11.706078 #2068002] INFO -- : [124/885] 2108859=test_mutex I, [2024-05-21T15:57:11.719817 #2068002] INFO -- : [125/885] 2108860=heredoc_dedent_test I, [2024-05-21T15:57:11.727419 #2068002] INFO -- : [126/885] 2108860=test_type I, [2024-05-21T15:57:11.740740 #2068002] INFO -- : [127/885] 2108860=test_tmpdir I, [2024-05-21T15:57:11.812683 #2068002] INFO -- : [128/885] 2108860=test_struct I, [2024-05-21T15:57:12.340076 #2068002] INFO -- : [129/885] 2108858=test_ssl_session I, [2024-05-21T15:57:12.350504 #2068002] INFO -- : [130/885] 2108860=test_gem_package_tar_header I, [2024-05-21T15:57:12.410224 #2068002] INFO -- : [131/885] 2108860=test_rational2 I, [2024-05-21T15:57:12.415108 #2068002] INFO -- : [132/885] 2108860=test_logperiod I, [2024-05-21T15:57:12.430371 #2068002] INFO -- : [133/885] 2108860=test_case_comprehensive I, [2024-05-21T15:57:12.849029 #2068002] INFO -- : [134/885] 2108859=test_placearg I, [2024-05-21T15:57:12.992824 #2068002] INFO -- : [135/885] 2108859=test_file_exhaustive I, [2024-05-21T15:57:13.175957 #2068002] INFO -- : [136/885] 2108858=test_completion I, [2024-05-21T15:57:13.797091 #2068002] INFO -- : [137/885] 2108858=parse_stream_test I, [2024-05-21T15:57:13.828037 #2068002] INFO -- : [138/885] 2108858=test_handle I, [2024-05-21T15:57:14.233600 #2068002] INFO -- : [139/885] 2108858=test_delete I, [2024-05-21T15:57:14.240675 #2068002] INFO -- : [140/885] 2108858=test_rdoc_markup_document I, [2024-05-21T15:57:14.262242 #2068002] INFO -- : [141/885] 2108858=test_gem_security_policy I, [2024-05-21T15:57:14.620974 #2068002] INFO -- : [142/885] 2108858=test_io_wait_uncommon I, [2024-05-21T15:57:14.651312 #2068002] INFO -- : [143/885] 2108858=test_gem_ci_detector I, [2024-05-21T15:57:14.666398 #2068002] INFO -- : [144/885] 2108858=test_continuation I, [2024-05-21T15:57:14.675272 #2068002] INFO -- : [145/885] 2108858=test_gem_silent_ui I, [2024-05-21T15:57:14.753303 #2068002] INFO -- : [146/885] 2108858=test_signal I, [2024-05-21T15:57:16.676557 #2068002] INFO -- : [147/885] 2108858=test_fixnum I, [2024-05-21T15:57:16.683192 #2068002] INFO -- : [148/885] 2108858=test_rdoc_markup_to_ansi I, [2024-05-21T15:57:16.726013 #2068002] INFO -- : [149/885] 2108858=test_evaluation I, [2024-05-21T15:57:16.731557 #2068002] INFO -- : [150/885] 2108858=test_protocol I, [2024-05-21T15:57:17.039443 #2068002] INFO -- : [151/885] 2108858=test_weakkeymap I, [2024-05-21T15:57:17.336820 #2068002] INFO -- : [152/885] 2108858=test_files_test I, [2024-05-21T15:57:17.338631 #2068002] INFO -- : [153/885] 2108858=test_https I, [2024-05-21T15:57:17.514370 #2068002] INFO -- : [154/885] 2108858=test_gem_commands_info_command I, [2024-05-21T15:57:17.528461 #2068002] INFO -- : [155/885] 2108858=test_object_create_start I, [2024-05-21T15:57:17.529943 #2068002] INFO -- : [156/885] 2108858=test_gem_request_set_gem_dependency_api I, [2024-05-21T15:57:17.845479 #2068002] INFO -- : [157/885] 2108858=test_name_error_extension I, [2024-05-21T15:57:17.885968 #2068002] INFO -- : [158/885] 2108858=test_irb I, [2024-05-21T15:57:18.082307 #2068002] INFO -- : [159/885] 2108858=test_rdoc_markup_paragraph I, [2024-05-21T15:57:18.087276 #2068002] INFO -- : [160/885] 2108858=test_x509cert I, [2024-05-21T15:57:18.180233 #2068002] INFO -- : [161/885] 2108858=test_require_path_check I, [2024-05-21T15:57:18.261150 #2068002] INFO -- : [162/885] 2108858=test_bn I, [2024-05-21T15:57:18.264687 #2068002] INFO -- : [163/885] 2108858=test_variable_name_check I, [2024-05-21T15:57:18.324739 #2068002] INFO -- : [164/885] 2108858=test_logdevice I, [2024-05-21T15:57:18.849233 #2068002] INFO -- : [165/885] 2108859=test_ast I, [2024-05-21T15:57:19.154156 #2068002] INFO -- : [166/885] 2108858=test_gem_source_lock I, [2024-05-21T15:57:19.218849 #2068002] INFO -- : [167/885] 2108858=test_cipher I, [2024-05-21T15:57:19.260350 #2068002] INFO -- : [168/885] 2108858=test_update I, [2024-05-21T15:57:19.265292 #2068002] INFO -- : [169/885] 2108858=test_new I, [2024-05-21T15:57:19.276790 #2068002] INFO -- : [170/885] 2108858=test_rdoc_rd_inline_parser I, [2024-05-21T15:57:19.288443 #2068002] INFO -- : [171/885] 2108858=test_win32ole_type I, [2024-05-21T15:57:19.292498 #2068002] INFO -- : [172/885] 2108858=test_load I, [2024-05-21T15:57:19.293130 #2068002] INFO -- : [173/885] 2108858=test_rdoc_rd_block_parser I, [2024-05-21T15:57:19.377187 #2068002] INFO -- : [174/885] 2108858=test_x509store I, [2024-05-21T15:57:19.836326 #2068002] INFO -- : [175/885] 2108858=test_rdoc_rd I, [2024-05-21T15:57:19.845615 #2068002] INFO -- : [176/885] 2108858=test_rdoc_markup_to_markdown I, [2024-05-21T15:57:19.895742 #2068002] INFO -- : [177/885] 2108858=test_rdoc_markup_to_joined_paragraph I, [2024-05-21T15:57:19.904894 #2068002] INFO -- : [178/885] 2108858=test_rdoc_generator_pot I, [2024-05-21T15:57:19.917429 #2068002] INFO -- : [179/885] 2108858=test_require_lib I, [2024-05-21T15:57:22.861654 #2068002] INFO -- : [180/885] 2108858=test_gem_gem_runner I, [2024-05-21T15:57:22.954085 #2068002] INFO -- : [181/885] 2108858=test_metaclass I, [2024-05-21T15:57:22.954720 #2068002] INFO -- : [182/885] 2108858=test_objectspace I, [2024-05-21T15:57:23.929204 #2068002] INFO -- : [183/885] 2108858=test_require I, [2024-05-21T15:57:26.426873 #2068002] INFO -- : [184/885] 2108858=test_debugger_integration I, [2024-05-21T15:57:26.443032 #2068002] INFO -- : [185/885] 2108858=test_my_integer I, [2024-05-21T15:57:26.451981 #2068002] INFO -- : [186/885] 2108858=test_gem_resolver_composed_set I, [2024-05-21T15:57:26.487934 #2068002] INFO -- : [187/885] 2108858=test_tracer I, [2024-05-21T15:57:26.501184 #2068002] INFO -- : [188/885] 2108858=test_not I, [2024-05-21T15:57:26.509420 #2068002] INFO -- : [189/885] 2108858=test_cgi_cookie I, [2024-05-21T15:57:26.534646 #2068002] INFO -- : [190/885] 2108858=test_option I, [2024-05-21T15:57:26.636823 #2068002] INFO -- : [191/885] 2108858=test_rdoc_markup_attribute_manager I, [2024-05-21T15:57:26.668834 #2068002] INFO -- : [192/885] 2108858=test_wss I, [2024-05-21T15:57:26.678843 #2068002] INFO -- : [193/885] 2108858=test_gem_security_trust_dir I, [2024-05-21T15:57:26.768629 #2068002] INFO -- : [194/885] 2108858=test_module I, [2024-05-21T15:57:29.731924 #2068002] INFO -- : [195/885] 2108858=test_erb_command I, [2024-05-21T15:57:29.779021 #2068002] INFO -- : [196/885] 2108858=test_usrmarshal I, [2024-05-21T15:57:29.955123 #2068002] INFO -- : [197/885] 2108858=test_gem_validator I, [2024-05-21T15:57:30.003293 #2068002] INFO -- : [198/885] 2108858=test_gem_source_installed I, [2024-05-21T15:57:30.015442 #2068002] INFO -- : [199/885] 2108858=test_abi I, [2024-05-21T15:57:30.235777 #2068002] INFO -- : [200/885] 2108858=test_bundled_ca I, [2024-05-21T15:57:31.821860 #2068002] INFO -- : [201/885] 2108858=test_integer_comb I, [2024-05-21T15:57:34.231643 #2068002] INFO -- : [202/885] 2108858=test_load I, [2024-05-21T15:57:34.250973 #2068002] INFO -- : [203/885] 2108858=test_ssl I, [2024-05-21T15:57:34.457200 #2068002] INFO -- : [204/885] 2108860=test_gem_package_task I, [2024-05-21T15:57:34.457831 #2068002] INFO -- : [205/885] 2108860=test_lock_native_thread I, [2024-05-21T15:57:34.765119 #2068002] INFO -- : [206/885] 2108860=test_resize I, [2024-05-21T15:57:34.771343 #2068002] INFO -- : [207/885] 2108860=test_win32ole_param I, [2024-05-21T15:57:34.776746 #2068002] INFO -- : [208/885] 2108860=test_key_error I, [2024-05-21T15:57:34.780965 #2068002] INFO -- : [209/885] 2108860=test_engine I, [2024-05-21T15:57:35.308345 #2068002] INFO -- : [210/885] 2108860=test_fiber I, [2024-05-21T15:57:41.477021 #2068002] INFO -- : [211/885] 2108860=test_gem_commands_mirror I, [2024-05-21T15:57:41.490375 #2068002] INFO -- : [212/885] 2108860=test_rdoc_parser_markdown I, [2024-05-21T15:57:41.509693 #2068002] INFO -- : [213/885] 2108860=test_custom_command I, [2024-05-21T15:57:41.521617 #2068002] INFO -- : [214/885] 2108860=fuzzer_test I, [2024-05-21T15:57:41.541397 #2068002] INFO -- : [215/885] 2108860=test_rubyvm I, [2024-05-21T15:57:41.612399 #2068002] INFO -- : [216/885] 2108860=test_cparser I, [2024-05-21T15:57:43.709071 #2068002] INFO -- : [217/885] 2108860=static_inspect_test I, [2024-05-21T15:57:43.716363 #2068002] INFO -- : [218/885] 2108860=test_struct I, [2024-05-21T15:57:43.721144 #2068002] INFO -- : [219/885] 2108860=test_c_struct_entry I, [2024-05-21T15:57:44.577720 #2068002] INFO -- : [220/885] 2108860=test_config I, [2024-05-21T15:57:44.660578 #2068002] INFO -- : [221/885] 2108860=test_ostruct I, [2024-05-21T15:57:44.702969 #2068002] INFO -- : [222/885] 2108858=test_depth_first I, [2024-05-21T15:57:44.707905 #2068002] INFO -- : [223/885] 2108858=test_change_word I, [2024-05-21T15:57:44.711940 #2068002] INFO -- : [224/885] 2108858=test_rbconfig I, [2024-05-21T15:57:44.713783 #2068002] INFO -- : [225/885] 2108858=test_num2int I, [2024-05-21T15:57:44.725220 #2068002] INFO -- : [226/885] 2108858=test_iter_break I, [2024-05-21T15:57:44.734232 #2068002] INFO -- : [227/885] 2108858=test_extlibs I, [2024-05-21T15:57:44.806075 #2068002] INFO -- : [228/885] 2108860=test_gem_commands_signin_command I, [2024-05-21T15:57:44.951638 #2068002] INFO -- : [229/885] 2108860=test_range I, [2024-05-21T15:57:45.688044 #2068002] INFO -- : [230/885] 2108860=test_recursion I, [2024-05-21T15:57:45.738455 #2068002] INFO -- : [231/885] 2108860=test_require I, [2024-05-21T15:57:46.310962 #2068002] INFO -- : [232/885] 2108858=test_enum I, [2024-05-21T15:57:46.993593 #2068002] INFO -- : [233/885] 2108860=test_rdoc_markup_include I, [2024-05-21T15:57:46.996754 #2068002] INFO -- : [234/885] 2108860=test_address_resolve I, [2024-05-21T15:57:47.037164 #2068002] INFO -- : [235/885] 2108860=test_trick I, [2024-05-21T15:57:47.228578 #2068002] INFO -- : [236/885] 2108858=test_ractor I, [2024-05-21T15:57:47.243015 #2068002] INFO -- : [237/885] 2108858=test_stream I, [2024-05-21T15:57:47.253731 #2068002] INFO -- : [238/885] 2108858=test_rdoc_attr I, [2024-05-21T15:57:47.270193 #2068002] INFO -- : [239/885] 2108858=test_locale I, [2024-05-21T15:57:47.286421 #2068002] INFO -- : [240/885] 2108858=test_ts I, [2024-05-21T15:57:47.665608 #2068002] INFO -- : [241/885] 2108858=test_have_func I, [2024-05-21T15:57:48.845400 #2068002] INFO -- : [242/885] 2108858=test_date_marshal I, [2024-05-21T15:57:48.871428 #2068002] INFO -- : [243/885] 2108858=test_configuration I, [2024-05-21T15:57:48.953814 #2068002] INFO -- : [244/885] 2108858=test_gem_resolver_local_specification I, [2024-05-21T15:57:48.984483 #2068002] INFO -- : [245/885] 2108858=test_gem_commands_list_command I, [2024-05-21T15:57:48.994781 #2068002] INFO -- : [246/885] 2108858=test_date_new I, [2024-05-21T15:57:49.000281 #2068002] INFO -- : [247/885] 2108858=test_udp I, [2024-05-21T15:57:49.016670 #2068002] INFO -- : [248/885] 2108858=test_context I, [2024-05-21T15:57:49.106994 #2068002] INFO -- : [249/885] 2108858=test_gem_commands_contents_command I, [2024-05-21T15:57:49.217631 #2068002] INFO -- : [250/885] 2108858=test_coder I, [2024-05-21T15:57:49.239136 #2068002] INFO -- : [251/885] 2108858=test_rdoc_servlet I, [2024-05-21T15:57:49.347937 #2068002] INFO -- : [252/885] 2108858=test_gem_commands_search_command I, [2024-05-21T15:57:49.364175 #2068002] INFO -- : [253/885] 2108858=test_symbol I, [2024-05-21T15:57:49.650356 #2068002] INFO -- : [254/885] 2108860=test_formatter I, [2024-05-21T15:57:49.666956 #2068002] INFO -- : [255/885] 2108860=test_unix I, [2024-05-21T15:57:49.720462 #2068002] INFO -- : [256/885] 2108860=test_integer I, [2024-05-21T15:57:52.361990 #2068002] INFO -- : [257/885] 2108860=test_enc_str_buf_cat I, [2024-05-21T15:57:52.372779 #2068002] INFO -- : [258/885] 2108860=newline_test I, [2024-05-21T15:57:52.454073 #2068002] INFO -- : [259/885] 2108860=test_bignum I, [2024-05-21T15:57:53.190585 #2068002] INFO -- : [260/885] 2108858=test_rdoc_markup_hard_break I, [2024-05-21T15:57:53.195757 #2068002] INFO -- : [261/885] 2108858=test_marshal I, [2024-05-21T15:57:54.126638 #2068002] INFO -- : [262/885] 2108858=ractor_test I, [2024-05-21T15:57:54.155895 #2068002] INFO -- : [263/885] 2108858=test_ancdata I, [2024-05-21T15:57:54.164280 #2068002] INFO -- : [264/885] 2108858=test_nesting_parser I, [2024-05-21T15:57:54.184827 #2068002] INFO -- : [265/885] 2108858=test_gem_resolver_conflict I, [2024-05-21T15:57:54.206785 #2068002] INFO -- : [266/885] 2108858=test_ractor I, [2024-05-21T15:57:54.544077 #2068002] INFO -- : [267/885] 2108858=test_scheduler I, [2024-05-21T15:57:54.731703 #2068002] INFO -- : [268/885] 2108858=test_gem_commands_help_command I, [2024-05-21T15:57:54.845891 #2068002] INFO -- : [269/885] 2108858=test_ssl I, [2024-05-21T15:57:54.942871 #2068002] INFO -- : [270/885] 2108858=test_gem I, [2024-05-21T15:57:56.131491 #2068002] INFO -- : [271/885] 2108860=test_registry I, [2024-05-21T15:57:56.142049 #2068002] INFO -- : [272/885] 2108860=json_generator_test I, [2024-05-21T15:57:56.255234 #2068002] INFO -- : [273/885] 2108860=test_ansi_without_terminfo I, [2024-05-21T15:57:56.274675 #2068002] INFO -- : [274/885] 2108860=test_ractor I, [2024-05-21T15:57:56.283327 #2068002] INFO -- : [275/885] 2108860=test_parser I, [2024-05-21T15:57:56.301229 #2068002] INFO -- : [276/885] 2108860=test_rdoc_markup_to_label I, [2024-05-21T15:57:56.340425 #2068002] INFO -- : [277/885] 2108860=test_gem_resolver_best_set I, [2024-05-21T15:57:56.431088 #2068002] INFO -- : [278/885] 2108860=test_cgi_core I, [2024-05-21T15:57:56.441555 #2068002] INFO -- : [279/885] 2108860=test_windows_1251 I, [2024-05-21T15:57:56.457192 #2068002] INFO -- : [280/885] 2108860=test_gem_ext_builder I, [2024-05-21T15:57:57.179766 #2068002] INFO -- : [281/885] 2108858=test_to_ary_concat I, [2024-05-21T15:57:57.508213 #2068002] INFO -- : [282/885] 2108860=test_history I, [2024-05-21T15:57:57.527233 #2068002] INFO -- : [283/885] 2108860=test_reline I, [2024-05-21T15:57:57.802504 #2068002] INFO -- : [284/885] 2108860=test_call I, [2024-05-21T15:57:57.975193 #2068002] INFO -- : [285/885] 2108860=test_ellipsize I, [2024-05-21T15:57:57.996247 #2068002] INFO -- : [286/885] 2108860=test_gem_commands_build_command I, [2024-05-21T15:57:58.305072 #2068002] INFO -- : [287/885] 2108860=test_data I, [2024-05-21T15:57:58.325397 #2068002] INFO -- : [288/885] 2108860=test_bug-14834 I, [2024-05-21T15:57:58.392710 #2068002] INFO -- : [289/885] 2108860=test_inlinecache I, [2024-05-21T15:57:58.452724 #2068002] INFO -- : [290/885] 2108860=test_socket I, [2024-05-21T15:57:59.232204 #2068002] INFO -- : .Leaked thread: TestSocket#test_accept_loop_multi_port: # I, [2024-05-21T15:57:59.233549 #2068002] INFO -- : Finished thread: TestSocket#test_unix: # I, [2024-05-21T15:57:59.571532 #2068002] INFO -- : [291/885] 2108860=test_terminfo I, [2024-05-21T15:57:59.572324 #2068002] INFO -- : [292/885] 2108860=test_thread I, [2024-05-21T15:57:59.927782 #2068002] INFO -- : [293/885] 2108858=test_time_tz I, [2024-05-21T15:57:59.980793 #2068002] INFO -- : [294/885] 2108858=test_addrinfo I, [2024-05-21T15:58:00.100647 #2068002] INFO -- : [295/885] 2108858=test_to_ruby I, [2024-05-21T15:58:00.118461 #2068002] INFO -- : [296/885] 2108858=ruby_api_test I, [2024-05-21T15:58:00.235385 #2068002] INFO -- : [297/885] 2108858=test_gem_resolver_index_set I, [2024-05-21T15:58:00.268213 #2068002] INFO -- : [298/885] 2108858=test_webauthn_listener_response I, [2024-05-21T15:58:00.318478 #2068002] INFO -- : [299/885] 2108858=test_sleep I, [2024-05-21T15:58:01.573333 #2068002] INFO -- : [300/885] 2108859=constant_path_node_test I, [2024-05-21T15:58:01.581763 #2068002] INFO -- : [301/885] 2108859=test_set_len I, [2024-05-21T15:58:01.587023 #2068002] INFO -- : [302/885] 2108859=test_interned_str I, [2024-05-21T15:58:01.591818 #2068002] INFO -- : [303/885] 2108859=test_folderitem2_invokeverb I, [2024-05-21T15:58:01.609025 #2068002] INFO -- : [304/885] 2108859=test_pattern_matching I, [2024-05-21T15:58:01.706842 #2068002] INFO -- : [305/885] 2108859=test_gc I, [2024-05-21T15:58:05.310142 #2068002] INFO -- : [306/885] 2108858=test_gem_bundler_version_finder I, [2024-05-21T15:58:05.372872 #2068002] INFO -- : [307/885] 2108858=test_gem_request_set I, [2024-05-21T15:58:05.913563 #2068002] INFO -- : [308/885] 2108858=test_symbol I, [2024-05-21T15:58:05.969132 #2068002] INFO -- : [309/885] 2108858=test_project_sanity I, [2024-05-21T15:58:05.978859 #2068002] INFO -- : [310/885] 2108858=location_test I, [2024-05-21T15:58:06.048586 #2068002] INFO -- : [311/885] 2108858=test_delegate I, [2024-05-21T15:58:06.058912 #2068002] INFO -- : [312/885] 2108858=test_chilled I, [2024-05-21T15:58:06.112215 #2068002] INFO -- : [313/885] 2108858=test_ensured I, [2024-05-21T15:58:06.117392 #2068002] INFO -- : [314/885] 2108858=test_euc_jp I, [2024-05-21T15:58:06.126129 #2068002] INFO -- : [315/885] 2108858=test_key_stroke I, [2024-05-21T15:58:06.133664 #2068002] INFO -- : [316/885] 2108858=test_rdoc_markup I, [2024-05-21T15:58:06.143895 #2068002] INFO -- : [317/885] 2108858=test_alias_and_anchor I, [2024-05-21T15:58:06.167349 #2068002] INFO -- : [318/885] 2108858=test_time I, [2024-05-21T15:58:06.370225 #2068002] INFO -- : [319/885] 2108858=test_popen_deadlock I, [2024-05-21T15:58:06.846686 #2068002] INFO -- : [320/885] 2108858=test_emitter I, [2024-05-21T15:58:06.857440 #2068002] INFO -- : [321/885] 2108858=test_x509ext I, [2024-05-21T15:58:06.866325 #2068002] INFO -- : [322/885] 2108858=bom_test I, [2024-05-21T15:58:06.878560 #2068002] INFO -- : [323/885] 2108858=test_helper_method I, [2024-05-21T15:58:06.887759 #2068002] INFO -- : [324/885] 2108858=test_summary I, [2024-05-21T15:58:07.077473 #2068002] INFO -- : [325/885] 2108858=test_config I, [2024-05-21T15:58:07.422698 #2068002] INFO -- : [326/885] 2108858=test_file I, [2024-05-21T15:58:08.290125 #2068002] INFO -- : [327/885] 2108860=test_rdoc_markup_to_html I, [2024-05-21T15:58:08.448377 #2068002] INFO -- : [328/885] 2108860=test_foreach I, [2024-05-21T15:58:08.456166 #2068002] INFO -- : [329/885] 2108860=test_append I, [2024-05-21T15:58:08.479451 #2068002] INFO -- : [330/885] 2108860=test_gem_resolver_installer_set I, [2024-05-21T15:58:08.718739 #2068002] INFO -- : [331/885] 2108860=test_trace I, [2024-05-21T15:58:08.728045 #2068002] INFO -- : [332/885] 2108860=test_arity I, [2024-05-21T15:58:08.738768 #2068002] INFO -- : [333/885] 2108860=test_gem_path_support I, [2024-05-21T15:58:08.788826 #2068002] INFO -- : [334/885] 2108860=test_keyword I, [2024-05-21T15:58:09.254286 #2068002] INFO -- : [335/885] 2108860=test_win32ole_type_event I, [2024-05-21T15:58:09.261330 #2068002] INFO -- : [336/885] 2108860=test_scalar_scanner I, [2024-05-21T15:58:09.274047 #2068002] INFO -- : [337/885] 2108860=test_rb_str_dup I, [2024-05-21T15:58:09.284679 #2068002] INFO -- : [338/885] 2108860=test_lambda I, [2024-05-21T15:58:09.349010 #2068002] INFO -- : [339/885] 2108860=test_eval I, [2024-05-21T15:58:09.592237 #2068002] INFO -- : [340/885] 2108860=test_monitor I, [2024-05-21T15:58:09.693915 #2068002] INFO -- : [341/885] 2108859=test_beginendblock I, [2024-05-21T15:58:09.878072 #2068002] INFO -- : [342/885] 2108860=test_regexp I, [2024-05-21T15:58:09.978099 #2068002] INFO -- : [343/885] 2108859=test_whileuntil I, [2024-05-21T15:58:09.984531 #2068002] INFO -- : [344/885] 2108859=test_nofree I, [2024-05-21T15:58:10.021114 #2068002] INFO -- : [345/885] 2108859=test_pointer I, [2024-05-21T15:58:10.969921 #2068002] INFO -- : [346/885] 2108859=test_rdoc_normal_class I, [2024-05-21T15:58:11.064716 #2068002] INFO -- : [347/885] 2108859=test_within_pipe I, [2024-05-21T15:58:11.193630 #2068002] INFO -- : [348/885] 2108859=test_bug_reporter I, [2024-05-21T15:58:11.349073 #2068002] INFO -- : [349/885] 2108859=test_gem_installer I, [2024-05-21T15:58:13.636706 #2068002] INFO -- : [350/885] 2108858=test_buffered_io I, [2024-05-21T15:58:14.222188 #2068002] INFO -- : [351/885] 2108858=test_ossl I, [2024-05-21T15:58:16.167230 #2068002] INFO -- : [352/885] 2108859=test_ruby_lex I, [2024-05-21T15:58:16.290249 #2068002] INFO -- : [353/885] 2108859=compiler_test I, [2024-05-21T15:58:16.348244 #2068002] INFO -- : [354/885] 2108859=test_arith_seq_extract I, [2024-05-21T15:58:16.502223 #2068002] INFO -- : [355/885] 2108859=test_gem_source_subpath_problem I, [2024-05-21T15:58:16.602651 #2068002] INFO -- : [356/885] 2108859=test_object_references I, [2024-05-21T15:58:16.607014 #2068002] INFO -- : [357/885] 2108859=test_helper I, [2024-05-21T15:58:16.613995 #2068002] INFO -- : [358/885] 2108859=test_duplicate I, [2024-05-21T15:58:16.626148 #2068002] INFO -- : [359/885] 2108859=test_gem_resolver_api_set I, [2024-05-21T15:58:16.721710 #2068002] INFO -- : [360/885] 2108859=test_addr I, [2024-05-21T15:58:16.745014 #2068002] INFO -- : [361/885] 2108859=test_mailto I, [2024-05-21T15:58:16.755793 #2068002] INFO -- : [362/885] 2108859=test_kill_ring I, [2024-05-21T15:58:16.762759 #2068002] INFO -- : [363/885] 2108859=test_member I, [2024-05-21T15:58:16.770674 #2068002] INFO -- : [364/885] 2108859=test_object I, [2024-05-21T15:58:16.784404 #2068002] INFO -- : [365/885] 2108859=test_cgi_header I, [2024-05-21T15:58:16.792011 #2068002] INFO -- : [366/885] 2108859=format_errors_test I, [2024-05-21T15:58:16.799551 #2068002] INFO -- : [367/885] 2108859=test_case_options I, [2024-05-21T15:58:16.810992 #2068002] INFO -- : [368/885] 2108859=test_gem_console_ui I, [2024-05-21T15:58:16.970780 #2068002] INFO -- : [369/885] 2108859=test_allocation I, [2024-05-21T15:58:19.304939 #2068002] INFO -- : [370/885] 2108859=test_ifunless I, [2024-05-21T15:58:19.313377 #2068002] INFO -- : [371/885] 2108859=test_insns_leaf I, [2024-05-21T15:58:19.324333 #2068002] INFO -- : [372/885] 2108859=test_readpartial I, [2024-05-21T15:58:19.762522 #2068002] INFO -- : [373/885] 2108859=test_httpresponse I, [2024-05-21T15:58:19.810026 #2068002] INFO -- : [374/885] 2108859=test_rdoc_parser_ruby I, [2024-05-21T15:58:20.950291 #2068002] INFO -- : [375/885] 2108859=test_x509req I, [2024-05-21T15:58:20.980662 #2068002] INFO -- : [376/885] 2108859=test_gem_resolver I, [2024-05-21T15:58:21.273472 #2068002] INFO -- : [377/885] 2108859=test_gem_source_vendor I, [2024-05-21T15:58:21.288453 #2068002] INFO -- : [378/885] 2108859=test_object I, [2024-05-21T15:58:21.381999 #2068002] INFO -- : [379/885] 2108858=test_dln I, [2024-05-21T15:58:21.426708 #2068002] INFO -- : [380/885] 2108858=unescape_test I, [2024-05-21T15:58:21.626820 #2068002] INFO -- : [381/885] 2108859=test_gem_commands_exec_command I, [2024-05-21T15:58:22.691600 #2068002] INFO -- : [382/885] 2108858=test_super I, [2024-05-21T15:58:22.965773 #2068002] INFO -- : [383/885] 2108859=test_color_printer I, [2024-05-21T15:58:22.972741 #2068002] INFO -- : [384/885] 2108859=test_modify_expand I, [2024-05-21T15:58:22.993423 #2068002] INFO -- : [385/885] 2108859=test_gem_available_set I, [2024-05-21T15:58:23.109238 #2068002] INFO -- : [386/885] 2108859=test_pkg_config I, [2024-05-21T15:58:23.129019 #2068002] INFO -- : [387/885] 2108859=errors_test I, [2024-05-21T15:58:23.810313 #2068002] INFO -- : [388/885] 2108859=test_convertible I, [2024-05-21T15:58:24.013749 #2068002] INFO -- : [389/885] 2108858=test_vm_dump I, [2024-05-21T15:58:24.020565 #2068002] INFO -- : [390/885] 2108858=json_encoding_test I, [2024-05-21T15:58:24.071746 #2068002] INFO -- : [391/885] 2108858=test_func I, [2024-05-21T15:58:26.896651 #2068002] INFO -- : [392/885] 2108859=test_config I, [2024-05-21T15:58:26.937100 #2068002] INFO -- : [393/885] 2108859=test_compile_prism I, [2024-05-21T15:58:27.250648 #2068002] INFO -- : [394/885] 2108859=test_helper I, [2024-05-21T15:58:27.261089 #2068002] INFO -- : [395/885] 2108859=test_win32ole_event I, [2024-05-21T15:58:27.286063 #2068002] INFO -- : [396/885] 2108859=test_gem_commands_uninstall_command I, [2024-05-21T15:58:28.144793 #2068002] INFO -- : [397/885] 2108859=test_rdoc_markup_formatter I, [2024-05-21T15:58:28.166616 #2068002] INFO -- : [398/885] 2108859=test_digest_extend I, [2024-05-21T15:58:28.200640 #2068002] INFO -- : [399/885] 2108859=test_gem_ext_cmake_builder I, [2024-05-21T15:58:28.213457 #2068002] INFO -- : [400/885] 2108859=test_thread_fd_close I, [2024-05-21T15:58:28.565925 #2068002] INFO -- : [401/885] 2108859=test_last_thread I, [2024-05-21T15:58:28.741442 #2068002] INFO -- : [402/885] 2108858=test_getopts I, [2024-05-21T15:58:28.748845 #2068002] INFO -- : [403/885] 2108858=test_emitter I, [2024-05-21T15:58:28.804735 #2068002] INFO -- : [404/885] 2108858=test_alias I, [2024-05-21T15:58:29.071905 #2068002] INFO -- : [405/885] 2108858=test_fips I, [2024-05-21T15:58:29.153444 #2068002] INFO -- : [406/885] 2108858=test_pattern_key_name_check I, [2024-05-21T15:58:29.160621 #2068002] INFO -- : [407/885] 2108858=test_profile_frames I, [2024-05-21T15:58:29.279678 #2068002] INFO -- : [408/885] 2108859=test_debug I, [2024-05-21T15:58:29.308957 #2068002] INFO -- : [409/885] 2108859=test_transcode I, [2024-05-21T15:58:29.420795 #2068002] INFO -- : [410/885] 2108858=test_refinement I, [2024-05-21T15:58:29.543013 #2068002] INFO -- : [411/885] 2108859=test_class2name I, [2024-05-21T15:58:29.596425 #2068002] INFO -- : [412/885] 2108859=test_gem_commands_cleanup_command I, [2024-05-21T15:58:30.194318 #2068002] INFO -- : [413/885] 2108859=test_dns I, [2024-05-21T15:58:30.656474 #2068002] INFO -- : [414/885] 2108859=test_notimplement I, [2024-05-21T15:58:30.670744 #2068002] INFO -- : [415/885] 2108859=test_cgi_session I, [2024-05-21T15:58:30.739031 #2068002] INFO -- : [416/885] 2108859=test_c_union_entity I, [2024-05-21T15:58:30.851473 #2068002] INFO -- : [417/885] 2108859=test_x509crl I, [2024-05-21T15:58:30.948316 #2068002] INFO -- : [418/885] 2108859=test_rdoc_markup_heading I, [2024-05-21T15:58:30.962909 #2068002] INFO -- : [419/885] 2108859=test_io_console I, [2024-05-21T15:58:30.963375 #2068002] INFO -- : Leaked file descriptor: TestIO_Console#test_winsize: 12 # I, [2024-05-21T15:58:31.004949 #2068002] INFO -- : COMMAND PID USER FD TYPE DEVICE SIZE/OFF NODE NAME I, [2024-05-21T15:58:31.005018 #2068002] INFO -- : ruby 2108859 opc 12r REG 252,0 6940392 13705429 /var/lib/sss/mc/group I, [2024-05-21T15:58:33.048691 #2068002] INFO -- : [420/885] 2108858=test_flip I, [2024-05-21T15:58:33.055355 #2068002] INFO -- : [421/885] 2108858=test_files_lib I, [2024-05-21T15:58:33.198754 #2068002] INFO -- : [422/885] 2108858=test_string_memory I, [2024-05-21T15:58:33.256257 #2068002] INFO -- : [423/885] 2108858=test_help I, [2024-05-21T15:58:33.260916 #2068002] INFO -- : [424/885] 2108858=test_enumerator_kw I, [2024-05-21T15:58:33.266198 #2068002] INFO -- : [425/885] 2108858=test_marshalable I, [2024-05-21T15:58:33.272814 #2068002] INFO -- : [426/885] 2108858=test_line_editor I, [2024-05-21T15:58:33.280706 #2068002] INFO -- : [427/885] 2108858=reflection_test I, [2024-05-21T15:58:33.292841 #2068002] INFO -- : [428/885] 2108858=test_string I, [2024-05-21T15:58:33.304795 #2068002] INFO -- : [429/885] 2108858=json_common_interface_test I, [2024-05-21T15:58:33.329638 #2068002] INFO -- : [430/885] 2108858=test_error_highlight I, [2024-05-21T15:58:33.630990 #2068002] INFO -- : [431/885] 2108859=test_rdoc_any_method I, [2024-05-21T15:58:33.803529 #2068002] INFO -- : [432/885] 2108858=test_function_entry I, [2024-05-21T15:58:33.804953 #2068002] INFO -- : [433/885] 2108858=test_raise I, [2024-05-21T15:58:33.808570 #2068002] INFO -- : [434/885] 2108858=test_complexrational I, [2024-05-21T15:58:33.825967 #2068002] INFO -- : [435/885] 2108858=version_test I, [2024-05-21T15:58:33.828953 #2068002] INFO -- : [436/885] 2108858=test_tree_builder I, [2024-05-21T15:58:33.845103 #2068002] INFO -- : [437/885] 2108858=test_date I, [2024-05-21T15:58:33.847969 #2068002] INFO -- : [438/885] 2108858=test_big5 I, [2024-05-21T15:58:33.856464 #2068002] INFO -- : [439/885] 2108858=test_gem_commands_update_command I, [2024-05-21T15:58:34.016925 #2068002] INFO -- : [440/885] 2108859=test_protect I, [2024-05-21T15:58:34.038554 #2068002] INFO -- : [441/885] 2108859=test_pathname I, [2024-05-21T15:58:34.266838 #2068002] INFO -- : [442/885] 2108859=test_fnmatch I, [2024-05-21T15:58:34.317843 #2068002] INFO -- : [443/885] 2108859=test_store I, [2024-05-21T15:58:34.676936 #2068002] INFO -- : [444/885] 2108859=test_rdoc_markup_pre_process I, [2024-05-21T15:58:34.898029 #2068002] INFO -- : [445/885] 2108859=test_coverage I, [2024-05-21T15:58:35.548147 #2068002] INFO -- : [446/885] 2108859=test_tempfile I, [2024-05-21T15:58:35.578614 #2068002] INFO -- : [447/885] 2108858=test_http_request I, [2024-05-21T15:58:35.590839 #2068002] INFO -- : [448/885] 2108858=test_erb_m17n I, [2024-05-21T15:58:35.602327 #2068002] INFO -- : [449/885] 2108858=test_rdoc_generator_pot_po_entry I, [2024-05-21T15:58:35.619574 #2068002] INFO -- : [450/885] 2108858=test_timeout I, [2024-05-21T15:58:35.628254 #2068002] INFO -- : [451/885] 2108858=test_rdoc_markup_verbatim I, [2024-05-21T15:58:35.634234 #2068002] INFO -- : [452/885] 2108858=test_webauthn_poller I, [2024-05-21T15:58:35.785874 #2068002] INFO -- : [453/885] 2108859=test_date_conv I, [2024-05-21T15:58:35.795838 #2068002] INFO -- : [454/885] 2108858=test_frozen I, [2024-05-21T15:58:35.802344 #2068002] INFO -- : [455/885] 2108859=test_serialize_subclasses I, [2024-05-21T15:58:35.804867 #2068002] INFO -- : [456/885] 2108858=test_gem_resolver_index_specification I, [2024-05-21T15:58:35.813736 #2068002] INFO -- : [457/885] 2108859=test_egrep_cpp I, [2024-05-21T15:58:35.868396 #2068002] INFO -- : [458/885] 2108858=json_string_matching_test I, [2024-05-21T15:58:35.882746 #2068002] INFO -- : [459/885] 2108858=test_gem_config_file I, [2024-05-21T15:58:35.967588 #2068002] INFO -- : [460/885] 2108859=test_comparable I, [2024-05-21T15:58:35.986198 #2068002] INFO -- : [461/885] 2108859=test_rdoc_rdoc I, [2024-05-21T15:58:36.066368 #2068002] INFO -- : [462/885] 2108858=test_yjit_exit_locations I, [2024-05-21T15:58:36.067998 #2068002] INFO -- : [463/885] 2108858=test_io_timeout I, [2024-05-21T15:58:36.085414 #2068002] INFO -- : [464/885] 2108858=test_rdoc_normal_module I, [2024-05-21T15:58:36.092041 #2068002] INFO -- : [465/885] 2108859=test_type_completor I, [2024-05-21T15:58:36.101069 #2068002] INFO -- : [466/885] 2108859=test_rdoc_markdown_test I, [2024-05-21T15:58:36.141878 #2068002] INFO -- : [467/885] 2108858=test_io_buffer I, [2024-05-21T15:58:36.199119 #2068002] INFO -- : [468/885] 2108858=test_kdf I, [2024-05-21T15:58:36.269185 #2068002] INFO -- : [469/885] 2108858=test_ldap I, [2024-05-21T15:58:36.282261 #2068002] INFO -- : [470/885] 2108858=test_thread_queue I, [2024-05-21T15:58:36.964733 #2068002] INFO -- : [471/885] 2108859=test_defined I, [2024-05-21T15:58:37.055727 #2068002] INFO -- : [472/885] 2108859=test_passing_block I, [2024-05-21T15:58:37.064376 #2068002] INFO -- : [473/885] 2108859=test_nowrite I, [2024-05-21T15:58:37.139337 #2068002] INFO -- : [474/885] 2108859=test_import I, [2024-05-21T15:58:39.452745 #2068002] INFO -- : [475/885] 2108859=test_human_typo I, [2024-05-21T15:58:39.460177 #2068002] INFO -- : [476/885] 2108859=test_wait I, [2024-05-21T15:58:39.515728 #2068002] INFO -- : [477/885] 2108859=test_nil I, [2024-05-21T15:58:39.524949 #2068002] INFO -- : [478/885] 2108859=test_psych I, [2024-05-21T15:58:39.550844 #2068002] INFO -- : [479/885] 2108859=test_yaml_tree I, [2024-05-21T15:58:39.593501 #2068002] INFO -- : [480/885] 2108859=test_gem_commands_yank_command I, [2024-05-21T15:58:40.101014 #2068002] INFO -- : [481/885] 2108859=test_cstr I, [2024-05-21T15:58:41.913340 #2068002] INFO -- : [482/885] 2108859=test_command I, [2024-05-21T15:58:42.198583 #2068002] INFO -- : [483/885] 2108859=test_euc_tw I, [2024-05-21T15:58:42.208427 #2068002] INFO -- : [484/885] 2108859=test_gem_resolver_dependency_request I, [2024-05-21T15:58:42.236904 #2068002] INFO -- : [485/885] 2108859=test_big2str I, [2024-05-21T15:58:42.239469 #2068002] INFO -- : [486/885] 2108859=test_gem_resolver_specification I, [2024-05-21T15:58:42.352691 #2068002] INFO -- : [487/885] 2108859=test_pkey_dsa I, [2024-05-21T15:58:42.597553 #2068002] INFO -- : [488/885] 2108860=test_logger I, [2024-05-21T15:58:42.622012 #2068002] INFO -- : [489/885] 2108860=test_ubf_async_safe I, [2024-05-21T15:58:42.632818 #2068002] INFO -- : [490/885] 2108860=test_pstore I, [2024-05-21T15:58:42.789026 #2068002] INFO -- : [491/885] 2108860=test_win32ole_record I, [2024-05-21T15:58:42.808803 #2068002] INFO -- : [492/885] 2108860=test_rdoc_include I, [2024-05-21T15:58:42.908453 #2068002] INFO -- : [493/885] 2108860=test_gem_version_option I, [2024-05-21T15:58:42.953745 #2068002] INFO -- : [494/885] 2108860=test_date_compat I, [2024-05-21T15:58:42.980004 #2068002] INFO -- : [495/885] 2108860=test_gem_ext_cargo_builder I, [2024-05-21T15:58:42.999521 #2068002] INFO -- : [496/885] 2108860=test_proc I, [2024-05-21T15:58:43.078625 #2068002] INFO -- : [497/885] 2108858=test_console_attr I, [2024-05-21T15:58:43.090244 #2068002] INFO -- : [498/885] 2108858=test_gem_commands_unpack_command I, [2024-05-21T15:58:43.408641 #2068002] INFO -- : [499/885] 2108858=test_zlib I, [2024-05-21T15:58:43.892145 #2068002] INFO -- : [500/885] 2108860=test_rdoc_options I, [2024-05-21T15:58:44.144315 #2068002] INFO -- : [501/885] 2108860=test_path_to_class I, [2024-05-21T15:58:44.157449 #2068002] INFO -- : [502/885] 2108860=test_enumerator I, [2024-05-21T15:58:44.174058 #2068002] INFO -- : [503/885] 2108860=test_reqarg I, [2024-05-21T15:58:44.216453 #2068002] INFO -- : [504/885] 2108859=test_frozen_error I, [2024-05-21T15:58:44.230258 #2068002] INFO -- : [505/885] 2108859=test_gem_version I, [2024-05-21T15:58:44.321742 #2068002] INFO -- : [506/885] 2108859=test_spell_checker I, [2024-05-21T15:58:44.357525 #2068002] INFO -- : [507/885] 2108859=test_gem_ext_ext_conf_builder I, [2024-05-21T15:58:44.509776 #2068002] INFO -- : [508/885] 2108860=test_resource I, [2024-05-21T15:58:44.595271 #2068002] INFO -- : [509/885] 2108860=test_gem_package_tar_reader_entry I, [2024-05-21T15:58:44.939695 #2068002] INFO -- : [510/885] 2108860=test_gem_uri I, [2024-05-21T15:58:44.973147 #2068002] INFO -- : [511/885] 2108860=test_bug-5832 I, [2024-05-21T15:58:44.980962 #2068002] INFO -- : [512/885] 2108860=test_yield_block I, [2024-05-21T15:58:45.058214 #2068002] INFO -- : [513/885] 2108860=test_c_struct_builder I, [2024-05-21T15:58:45.403749 #2068002] INFO -- : [514/885] 2108860=test_pipe I, [2024-05-21T15:58:45.453473 #2068002] INFO -- : [515/885] 2108859=test_macro I, [2024-05-21T15:58:45.456220 #2068002] INFO -- : [516/885] 2108859=test_string I, [2024-05-21T15:58:45.526332 #2068002] INFO -- : [517/885] 2108860=test_gem_resolver_activation_request I, [2024-05-21T15:58:45.546061 #2068002] INFO -- : [518/885] 2108860=test_function I, [2024-05-21T15:58:45.811339 #2068002] INFO -- : [519/885] 2108860=test_gem_commands_server_command I, [2024-05-21T15:58:45.816790 #2068002] INFO -- : [520/885] 2108860=test_win32ole_method_event I, [2024-05-21T15:58:45.825644 #2068002] INFO -- : [521/885] 2108860=test_tcp I, [2024-05-21T15:58:45.949808 #2068002] INFO -- : [522/885] 2108860=parse_comments_test I, [2024-05-21T15:58:45.960958 #2068002] INFO -- : [523/885] 2108860=test_gem_name_tuple I, [2024-05-21T15:58:45.982551 #2068002] INFO -- : [524/885] 2108860=test_rdoc_markup_to_table_of_contents I, [2024-05-21T15:58:46.025538 #2068002] INFO -- : [525/885] 2108860=test_integer I, [2024-05-21T15:58:46.091576 #2068002] INFO -- : [526/885] 2108860=test_gem_requirement I, [2024-05-21T15:58:46.331343 #2068002] INFO -- : [527/885] 2108860=test_rat I, [2024-05-21T15:58:46.349113 #2068002] INFO -- : [528/885] 2108860=test_gem_request_connection_pools I, [2024-05-21T15:58:47.405334 #2068002] INFO -- : [529/885] 2108860=test_init I, [2024-05-21T15:58:47.928287 #2068002] INFO -- : [530/885] 2108860=test_flags I, [2024-05-21T15:58:48.306518 #2068002] INFO -- : [531/885] 2108860=test_bug-3571 I, [2024-05-21T15:58:48.329450 #2068002] INFO -- : [532/885] 2108860=test_yamlstore I, [2024-05-21T15:58:48.346162 #2068002] INFO -- : [533/885] 2108860=test_numeric I, [2024-05-21T15:58:48.409302 #2068002] INFO -- : [534/885] 2108860=test_file I, [2024-05-21T15:58:48.424783 #2068002] INFO -- : [535/885] 2108860=test_time I, [2024-05-21T15:58:48.539171 #2068002] INFO -- : [536/885] 2108860=test_capacity I, [2024-05-21T15:58:48.559130 #2068002] INFO -- : [537/885] 2108860=test_gem_commands_owner_command I, [2024-05-21T15:58:49.211769 #2068002] INFO -- : [538/885] 2108860=test_nextafter I, [2024-05-21T15:58:49.380573 #2068002] INFO -- : [539/885] 2108860=test_encoding I, [2024-05-21T15:58:49.565701 #2068002] INFO -- : [540/885] 2108860=test_hmac I, [2024-05-21T15:58:49.575208 #2068002] INFO -- : [541/885] 2108860=test_rdoc_generator_markup I, [2024-05-21T15:58:49.863489 #2068002] INFO -- : [542/885] 2108860=test_constant I, [2024-05-21T15:58:51.556743 #2068002] INFO -- : [543/885] 2108860=test_find I, [2024-05-21T15:58:51.582598 #2068002] INFO -- : [544/885] 2108860=redundant_return_test I, [2024-05-21T15:58:51.594122 #2068002] INFO -- : [545/885] 2108860=test_rand I, [2024-05-21T15:58:51.900734 #2068002] INFO -- : [546/885] 2108858=test_string_processing I, [2024-05-21T15:58:51.911664 #2068002] INFO -- : [547/885] 2108858=test_random_formatter I, [2024-05-21T15:58:51.928662 #2068002] INFO -- : [548/885] 2108858=test_rdoc_markup_attributes I, [2024-05-21T15:58:51.943554 #2068002] INFO -- : [549/885] 2108858=test_rdoc_code_object I, [2024-05-21T15:58:52.066034 #2068002] INFO -- : [550/885] 2108860=test_process I, [2024-05-21T15:58:52.333009 #2068002] INFO -- : Leaked file descriptor: TestProcess#test_gid_from_name: 10 # I, [2024-05-21T15:58:52.356588 #2068002] INFO -- : [551/885] 2108858=test_gem_source_specific_file I, [2024-05-21T15:58:52.388228 #2068002] INFO -- : COMMAND PID USER FD TYPE DEVICE SIZE/OFF NODE NAME I, [2024-05-21T15:58:52.388346 #2068002] INFO -- : ruby 2108860 opc 10u unix 0x0000000000000000 0t0 3081846786 type=STREAM I, [2024-05-21T15:58:52.547866 #2068002] INFO -- : [552/885] 2108858=test_euc_kr I, [2024-05-21T15:58:52.551967 #2068002] INFO -- : [553/885] 2108858=test_provider I, [2024-05-21T15:58:52.562087 #2068002] INFO -- : [554/885] 2108858=test_bmethod I, [2024-05-21T15:58:52.586380 #2068002] INFO -- : [555/885] 2108858=test_gem_doctor I, [2024-05-21T15:58:52.694792 #2068002] INFO -- : [556/885] 2108858=json_fixtures_test I, [2024-05-21T15:58:52.724063 #2068002] INFO -- : [557/885] 2108858=test_len I, [2024-05-21T15:58:52.762732 #2068002] INFO -- : [558/885] 2108858=test_rdoc_parser_c I, [2024-05-21T15:58:53.116129 #2068002] INFO -- : [559/885] 2108858=test_kwargs I, [2024-05-21T15:58:53.234964 #2068002] INFO -- : [560/885] 2108858=test_pack I, [2024-05-21T15:58:53.352604 #2068002] INFO -- : [561/885] 2108858=test_io_wait I, [2024-05-21T15:58:53.765154 #2068002] INFO -- : [562/885] 2108858=parse_test I, [2024-05-21T15:58:57.621081 #2068002] INFO -- : [563/885] 2108858=test_tsort I, [2024-05-21T15:58:57.633787 #2068002] INFO -- : [564/885] 2108858=test_typeddata I, [2024-05-21T15:58:57.890403 #2068002] INFO -- : [565/885] 2108858=test_gem_commands_fetch_command I, [2024-05-21T15:58:58.067851 #2068002] INFO -- : [566/885] 2108858=test_securerandom I, [2024-05-21T15:58:58.101067 #2068002] INFO -- : [567/885] 2108858=test_gem_commands_outdated_command I, [2024-05-21T15:58:58.140036 #2068002] INFO -- : [568/885] 2108858=test_gem_dependency_list I, [2024-05-21T15:58:58.228770 #2068002] INFO -- : [569/885] 2108858=test_rdoc_parser_changelog I, [2024-05-21T15:58:58.311741 #2068002] INFO -- : [570/885] 2108858=parameters_signature_test I, [2024-05-21T15:58:58.313883 #2068002] INFO -- : [571/885] 2108858=test_require I, [2024-05-21T15:58:58.326500 #2068002] INFO -- : [572/885] 2108858=test_stringify_symbols I, [2024-05-21T15:58:58.345229 #2068002] INFO -- : [573/885] 2108858=test_objspace I, [2024-05-21T15:59:05.082854 #2068002] INFO -- : Leaked file descriptor: TestProcess#test_uid_from_name: 11 # I, [2024-05-21T15:59:05.116809 #2068002] INFO -- : COMMAND PID USER FD TYPE DEVICE SIZE/OFF NODE NAME I, [2024-05-21T15:59:05.116879 #2068002] INFO -- : ruby 2108860 opc 11r REG 252,0 9253600 13705411 /var/lib/sss/mc/passwd I, [2024-05-21T15:59:12.258419 #2068002] INFO -- : [574/885] 2108860=test_rdoc_text I, [2024-05-21T15:59:12.318572 #2068002] INFO -- : [575/885] 2108860=library_symbols_test I, [2024-05-21T15:59:12.326953 #2068002] INFO -- : [576/885] 2108860=test_rdoc_markup_indented_paragraph I, [2024-05-21T15:59:12.338771 #2068002] INFO -- : [577/885] 2108860=test_iseq_load I, [2024-05-21T15:59:13.497231 #2068002] INFO -- : [578/885] 2108860=test_rdoc_markup_parser I, [2024-05-21T15:59:13.576564 #2068002] INFO -- : [579/885] 2108860=test_stream I, [2024-05-21T15:59:13.804543 #2068002] INFO -- : [580/885] 2108860=test_have_library I, [2024-05-21T15:59:14.450123 #2068002] INFO -- : [581/885] 2108860=test_ns_spki I, [2024-05-21T15:59:14.464385 #2068002] INFO -- : [582/885] 2108860=test_rdoc_encoding I, [2024-05-21T15:59:14.538699 #2068002] INFO -- : [583/885] 2108860=test_win32ole_variant_outarg I, [2024-05-21T15:59:14.551014 #2068002] INFO -- : [584/885] 2108860=test_key_actor_vi I, [2024-05-21T15:59:14.680906 #2068002] INFO -- : [585/885] 2108860=test_postponed_job I, [2024-05-21T15:59:15.043392 #2068002] INFO -- : [586/885] 2108860=test_gem_request_set_lockfile I, [2024-05-21T15:59:15.410864 #2068002] INFO -- : [587/885] 2108860=test_rdoc_markdown I, [2024-05-21T15:59:15.686344 #2068002] INFO -- : [588/885] 2108860=test_httpresponses I, [2024-05-21T15:59:15.707467 #2068002] INFO -- : [589/885] 2108860=test_rdoc_constant I, [2024-05-21T15:59:15.803291 #2068002] INFO -- : [590/885] 2108860=test_deprecate I, [2024-05-21T15:59:15.851421 #2068002] INFO -- : [591/885] 2108860=test_generic I, [2024-05-21T15:59:15.885053 #2068002] INFO -- : [592/885] 2108860=test_rdoc_markup_to_html_snippet I, [2024-05-21T15:59:16.028609 #2068002] INFO -- : [593/885] 2108860=test_common I, [2024-05-21T15:59:16.135217 #2068002] INFO -- : [594/885] 2108860=test_gem_commands_stale_command I, [2024-05-21T15:59:16.140942 #2068002] INFO -- : [595/885] 2108860=ruby_parser_test I, [2024-05-21T15:59:16.150932 #2068002] INFO -- : [596/885] 2108860=test_rdoc_markup_to_tt_only I, [2024-05-21T15:59:16.201421 #2068002] INFO -- : [597/885] 2108860=json_parser_test I, [2024-05-21T15:59:16.245363 #2068002] INFO -- : [598/885] 2108860=test_date_strftime I, [2024-05-21T15:59:16.685768 #2068002] INFO -- : [599/885] 2108860=test_ws I, [2024-05-21T15:59:16.708135 #2068002] INFO -- : [600/885] 2108860=test_gem_commands_cert_command I, [2024-05-21T15:59:18.170132 #2068002] INFO -- : [601/885] 2108859=test_singleton I, [2024-05-21T15:59:18.185095 #2068002] INFO -- : [602/885] 2108859=test_fstring I, [2024-05-21T15:59:18.286075 #2068002] INFO -- : [603/885] 2108860=test_numeric I, [2024-05-21T15:59:18.291521 #2068002] INFO -- : [604/885] 2108860=test_rdoc_require I, [2024-05-21T15:59:18.307513 #2068002] INFO -- : [605/885] 2108859=test_gem_ext_rake_builder I, [2024-05-21T15:59:18.311256 #2068002] INFO -- : [606/885] 2108860=test_word I, [2024-05-21T15:59:18.332671 #2068002] INFO -- : [607/885] 2108860=test_timeout I, [2024-05-21T15:59:18.916901 #2068002] INFO -- : [608/885] 2108859=test_rdoc_markup_raw I, [2024-05-21T15:59:18.926948 #2068002] INFO -- : [609/885] 2108859=test_rdoc_markup_to_bs I, [2024-05-21T15:59:18.978895 #2068002] INFO -- : [610/885] 2108859=test_key_name_check I, [2024-05-21T15:59:19.037880 #2068002] INFO -- : [611/885] 2108859=test_instrumentation_api I, [2024-05-21T15:59:19.257182 #2068002] INFO -- : [612/885] 2108860=test_weakref I, [2024-05-21T15:59:19.697201 #2068002] INFO -- : [613/885] 2108860=test_rdoc_alias I, [2024-05-21T15:59:19.705970 #2068002] INFO -- : [614/885] 2108860=test_io_buffer I, [2024-05-21T15:59:19.824079 #2068002] INFO -- : [615/885] 2108860=test_rdoc_context_section I, [2024-05-21T15:59:19.838864 #2068002] INFO -- : [616/885] 2108860=test_deprecated I, [2024-05-21T15:59:19.839378 #2068002] INFO -- : [617/885] 2108860=test_optparse I, [2024-05-21T15:59:19.852526 #2068002] INFO -- : [618/885] 2108860=test_exception I, [2024-05-21T15:59:21.954601 #2068002] INFO -- : [619/885] 2108859=test_bash_completion I, [2024-05-21T15:59:21.956847 #2068002] INFO -- : [620/885] 2108859=test_files_test_2 I, [2024-05-21T15:59:21.967091 #2068002] INFO -- : [621/885] 2108859=test_div I, [2024-05-21T15:59:21.981702 #2068002] INFO -- : [622/885] 2108859=test_rdoc_markup_to_html_crossref I, [2024-05-21T15:59:22.300549 #2068002] INFO -- : [623/885] 2108859=test_scalar I, [2024-05-21T15:59:22.322254 #2068002] INFO -- : [624/885] 2108859=test_syntax I, [2024-05-21T15:59:25.603050 #2068002] INFO -- : [625/885] 2108860=test_class_name_check I, [2024-05-21T15:59:25.705020 #2068002] INFO -- : [626/885] 2108860=test_basicsocket I, [2024-05-21T15:59:25.718654 #2068002] INFO -- : [627/885] 2108860=test_zsh_completion I, [2024-05-21T15:59:25.733457 #2068002] INFO -- : [628/885] 2108860=test_gem_commands_environment_command I, [2024-05-21T15:59:25.800555 #2068002] INFO -- : [629/885] 2108860=test_pkcs7 I, [2024-05-21T15:59:25.966039 #2068002] INFO -- : [630/885] 2108860=test_pack I, [2024-05-21T15:59:26.149620 #2068002] INFO -- : [631/885] 2108860=test_gem_unsatisfiable_dependency_error I, [2024-05-21T15:59:26.169574 #2068002] INFO -- : [632/885] 2108860=test_literal I, [2024-05-21T15:59:26.741923 #2068002] INFO -- : [633/885] 2108860=test_thread I, [2024-05-21T15:59:26.959902 #2068002] INFO -- : [634/885] 2108860=test_complex2 I, [2024-05-21T15:59:27.002687 #2068002] INFO -- : [635/885] 2108860=test_config I, [2024-05-21T15:59:27.028980 #2068002] INFO -- : [636/885] 2108860=test_gem_security_signer I, [2024-05-21T15:59:27.188694 #2068002] INFO -- : [637/885] 2108860=test_gem_util I, [2024-05-21T15:59:27.282967 #2068002] INFO -- : [638/885] 2108860=test_input_method I, [2024-05-21T15:59:27.325067 #2068002] INFO -- : [639/885] 2108860=test_io I, [2024-05-21T15:59:27.542896 #2068002] INFO -- : [640/885] 2108860=test_rdoc_i18n_text I, [2024-05-21T15:59:27.609813 #2068002] INFO -- : [641/885] 2108860=test_ractor I, [2024-05-21T15:59:27.617329 #2068002] INFO -- : [642/885] 2108860=test_null I, [2024-05-21T15:59:27.628091 #2068002] INFO -- : [643/885] 2108860=test_data I, [2024-05-21T15:59:27.640998 #2068002] INFO -- : [644/885] 2108860=test_memory_view I, [2024-05-21T15:59:27.668343 #2068002] INFO -- : [645/885] 2108860=test_multi_irb_commands I, [2024-05-21T15:59:27.686950 #2068002] INFO -- : [646/885] 2108860=test_pkey_dh I, [2024-05-21T15:59:29.128599 #2068002] INFO -- : [647/885] 2108860=test_m17n_comb I, [2024-05-21T15:59:30.822426 #2068002] INFO -- : [648/885] 2108859=test_win32ole_typelib I, [2024-05-21T15:59:30.833484 #2068002] INFO -- : [649/885] 2108859=test_pkey I, [2024-05-21T15:59:30.844582 #2068002] INFO -- : [650/885] 2108859=test_external_new I, [2024-05-21T15:59:30.850621 #2068002] INFO -- : [651/885] 2108859=test_bigzero I, [2024-05-21T15:59:30.864309 #2068002] INFO -- : [652/885] 2108859=test_gem_platform I, [2024-05-21T15:59:31.039052 #2068002] INFO -- : [653/885] 2108859=test_gem_commands_query_command I, [2024-05-21T15:59:31.648397 #2068002] INFO -- : [654/885] 2108859=test_yamldbm I, [2024-05-21T15:59:31.668299 #2068002] INFO -- : [655/885] 2108859=test_gem_spec_fetcher I, [2024-05-21T15:59:31.856683 #2068002] INFO -- : [656/885] 2108859=test_unicode_escape I, [2024-05-21T15:59:31.941553 #2068002] INFO -- : [657/885] 2108859=test_switch_hitter I, [2024-05-21T15:59:31.987581 #2068002] INFO -- : [658/885] 2108859=test_default_gems I, [2024-05-21T15:59:32.014288 #2068002] INFO -- : [659/885] 2108859=test_backtrace I, [2024-05-21T15:59:32.021023 #2068002] INFO -- : [660/885] 2108859=test_gbk I, [2024-05-21T15:59:32.033904 #2068002] INFO -- : [661/885] 2108859=test_gem_commands_dependency_command I, [2024-05-21T15:59:32.135035 #2068002] INFO -- : [662/885] 2108859=test_rdoc_method_attr I, [2024-05-21T15:59:32.154120 #2068002] INFO -- : [663/885] 2108860=test_enumerable I, [2024-05-21T15:59:32.156192 #2068002] INFO -- : [664/885] 2108860=test_set I, [2024-05-21T15:59:32.199981 #2068002] INFO -- : [665/885] 2108860=static_literals_test I, [2024-05-21T15:59:32.207715 #2068002] INFO -- : [666/885] 2108860=test_tree_spell_checker I, [2024-05-21T15:59:32.276545 #2068002] INFO -- : [667/885] 2108860=test_grapheme_breaks I, [2024-05-21T15:59:32.298188 #2068002] INFO -- : [668/885] 2108859=test_hash_create I, [2024-05-21T15:59:32.298580 #2068002] INFO -- : [669/885] 2108859=test_case_mapping I, [2024-05-21T15:59:32.308686 #2068002] INFO -- : [670/885] 2108860=test_rational I, [2024-05-21T15:59:32.325933 #2068002] INFO -- : [671/885] 2108859=test_gem_ext_cargo_builder_unit I, [2024-05-21T15:59:32.340617 #2068002] INFO -- : [672/885] 2108860=test_ractor I, [2024-05-21T15:59:32.360574 #2068002] INFO -- : [673/885] 2108859=test_gem_resolver_api_specification I, [2024-05-21T15:59:32.376304 #2068002] INFO -- : [674/885] 2108860=test_rdoc_rubygems_hook I, [2024-05-21T15:59:32.412835 #2068002] INFO -- : [675/885] 2108859=test_webauthn_listener I, [2024-05-21T15:59:32.453088 #2068002] INFO -- : Leaked file descriptor: WebauthnListenerTest#test_wait_for_otp_code_get_follows_options: 14 : # I, [2024-05-21T15:59:32.462363 #2068002] INFO -- : [676/885] 2108860=test_key_event_record I, [2024-05-21T15:59:32.482230 #2068002] INFO -- : [677/885] 2108860=test_date_parse I, [2024-05-21T15:59:32.483771 #2068002] INFO -- : COMMAND PID USER FD TYPE DEVICE SIZE/OFF NODE NAME I, [2024-05-21T15:59:32.483803 #2068002] INFO -- : ruby 2108859 opc 14u IPv4 3081850902 0t0 TCP localhost:34659->localhost:35526 (CLOSE_WAIT) I, [2024-05-21T15:59:32.574268 #2068002] INFO -- : [678/885] 2108859=test_mdns I, [2024-05-21T15:59:32.578705 #2068002] INFO -- : [679/885] 2108859=test_open3 I, [2024-05-21T15:59:32.591245 #2068002] INFO -- : [680/885] 2108860=test_arity I, [2024-05-21T15:59:32.606421 #2068002] INFO -- : [681/885] 2108860=test_thread I, [2024-05-21T15:59:32.615601 #2068002] INFO -- : [682/885] 2108860=test_svcb_https I, [2024-05-21T15:59:32.630507 #2068002] INFO -- : [683/885] 2108860=test_pkey_ec I, [2024-05-21T15:59:32.655376 #2068002] INFO -- : [684/885] 2108860=test_buffering I, [2024-05-21T15:59:32.660945 #2068002] INFO -- : [685/885] 2108860=test_data_error I, [2024-05-21T15:59:32.750170 #2068002] INFO -- : [686/885] 2108860=test_rdoc_stats I, [2024-05-21T15:59:32.955381 #2068002] INFO -- : [687/885] 2108860=test_files_sample I, [2024-05-21T15:59:33.026109 #2068002] INFO -- : [688/885] 2108860=test_rubyoptions I, [2024-05-21T15:59:34.676162 #2068002] INFO -- : .Closed file descriptor: TestOpen3#test_capture3_flip: 14 I, [2024-05-21T15:59:35.414226 #2068002] INFO -- : [689/885] 2108859=test_optimization I, [2024-05-21T15:59:39.463437 #2068002] INFO -- : [690/885] 2108860=test_force_exit I, [2024-05-21T15:59:39.471500 #2068002] INFO -- : [691/885] 2108860=test_shift_jis I, [2024-05-21T15:59:39.493948 #2068002] INFO -- : [692/885] 2108860=test_rdoc_store I, [2024-05-21T15:59:40.176035 #2068002] INFO -- : [693/885] 2108860=regexp_test I, [2024-05-21T15:59:40.197744 #2068002] INFO -- : [694/885] 2108860=test_yield I, [2024-05-21T15:59:42.075050 #2068002] INFO -- : [695/885] 2108859=test_remote_fetch_error I, [2024-05-21T15:59:42.099190 #2068002] INFO -- : [696/885] 2108859=test_show_source I, [2024-05-21T15:59:42.110913 #2068002] INFO -- : [697/885] 2108859=test_queue I, [2024-05-21T15:59:42.121769 #2068002] INFO -- : [698/885] 2108859=test_gem_resolver_lock_specification I, [2024-05-21T15:59:42.164793 #2068002] INFO -- : [699/885] 2108859=test_boolean I, [2024-05-21T15:59:42.179022 #2068002] INFO -- : [700/885] 2108859=test_rdoc_i18n_locale I, [2024-05-21T15:59:42.212312 #2068002] INFO -- : [701/885] 2108859=test_gc_compact I, [2024-05-21T15:59:42.638051 #2068002] INFO -- : [702/885] 2108858=test_dryrun I, [2024-05-21T15:59:42.678065 #2068002] INFO -- : [703/885] 2108858=test_gem_uri_formatter I, [2024-05-21T15:59:42.701344 #2068002] INFO -- : [704/885] 2108858=test_prettyprint I, [2024-05-21T15:59:42.729495 #2068002] INFO -- : [705/885] 2108858=test_ole_methods I, [2024-05-21T15:59:42.744571 #2068002] INFO -- : [706/885] 2108858=test_cgi_util I, [2024-05-21T15:59:43.003491 #2068002] INFO -- : [707/885] 2108858=test_clone I, [2024-05-21T15:59:43.070752 #2068002] INFO -- : [708/885] 2108860=test_enc_raise I, [2024-05-21T15:59:43.090000 #2068002] INFO -- : [709/885] 2108860=test_basicinstructions I, [2024-05-21T15:59:43.153236 #2068002] INFO -- : [710/885] 2108860=test_utf32 I, [2024-05-21T15:59:43.155863 #2068002] INFO -- : [711/885] 2108858=test_gem_resolver_git_specification I, [2024-05-21T15:59:43.175902 #2068002] INFO -- : [712/885] 2108860=test_key_actor_emacs I, [2024-05-21T15:59:43.273202 #2068002] INFO -- : [713/885] 2108860=test_gem_security I, [2024-05-21T15:59:43.509063 #2068002] INFO -- : [714/885] 2108858=test_erb I, [2024-05-21T15:59:43.557952 #2068002] INFO -- : [715/885] 2108858=test_date_ractor I, [2024-05-21T15:59:43.792903 #2068002] INFO -- : [716/885] 2108858=test_variable I, [2024-05-21T15:59:43.894052 #2068002] INFO -- : [717/885] 2108858=test_hash I, [2024-05-21T15:59:43.914445 #2068002] INFO -- : [718/885] 2108858=test_rdoc_tom_doc I, [2024-05-21T15:59:43.943064 #2068002] INFO -- : [719/885] 2108858=test_gem_commands_pristine_command I, [2024-05-21T15:59:45.351490 #2068002] INFO -- : [720/885] 2108858=test_optarg I, [2024-05-21T15:59:45.419043 #2068002] INFO -- : [721/885] 2108858=test_gem_impossible_dependencies_error I, [2024-05-21T15:59:45.429123 #2068002] INFO -- : [722/885] 2108858=test_pp I, [2024-05-21T15:59:45.479256 #2068002] INFO -- : [723/885] 2108858=test_gem_resolver_requirement_list I, [2024-05-21T15:59:45.484164 #2068002] INFO -- : [724/885] 2108858=memsize_test I, [2024-05-21T15:59:45.599196 #2068002] INFO -- : [725/885] 2108858=test_raise_exception I, [2024-05-21T15:59:45.608818 #2068002] INFO -- : [726/885] 2108859=test_arith_seq_beg_len_step I, [2024-05-21T15:59:45.612803 #2068002] INFO -- : [727/885] 2108859=test_exception I, [2024-05-21T15:59:45.634310 #2068002] INFO -- : [728/885] 2108859=test_noarg I, [2024-05-21T15:59:45.766214 #2068002] INFO -- : [729/885] 2108859=test_undef I, [2024-05-21T15:59:45.799376 #2068002] INFO -- : [730/885] 2108859=test_rdoc_generator_darkfish I, [2024-05-21T15:59:46.083617 #2068002] INFO -- : [731/885] 2108858=test_gem_resolver_lock_set I, [2024-05-21T15:59:46.102329 #2068002] INFO -- : [732/885] 2108858=test_random I, [2024-05-21T15:59:46.106213 #2068002] INFO -- : [733/885] 2108859=test_gem_command I, [2024-05-21T15:59:46.117683 #2068002] INFO -- : [734/885] 2108858=test_asn1 I, [2024-05-21T15:59:46.140599 #2068002] INFO -- : [735/885] 2108858=test_gem_commands_open_command I, [2024-05-21T15:59:46.217532 #2068002] INFO -- : [736/885] 2108859=test_verbose I, [2024-05-21T15:59:46.242048 #2068002] INFO -- : [737/885] 2108858=test_normalize I, [2024-05-21T15:59:46.245575 #2068002] INFO -- : [738/885] 2108858=test_emoji_breaks I, [2024-05-21T15:59:46.281336 #2068002] INFO -- : [739/885] 2108859=test_assignment I, [2024-05-21T15:59:46.312967 #2068002] INFO -- : [740/885] 2108858=test_gem_update_suggestion I, [2024-05-21T15:59:46.390854 #2068002] INFO -- : [741/885] 2108858=!Nothing_to_test I, [2024-05-21T15:59:46.392441 #2068002] INFO -- : [742/885] 2108858=test_fd_setsize I, [2024-05-21T15:59:46.394626 #2068002] INFO -- : [743/885] 2108858=test_process I, [2024-05-21T15:59:46.441900 #2068002] INFO -- : [744/885] 2108858=test_forwardable I, [2024-05-21T15:59:46.461028 #2068002] INFO -- : [745/885] 2108858=test_array_create I, [2024-05-21T15:59:46.470835 #2068002] INFO -- : [746/885] 2108858=test_dir_m17n I, [2024-05-21T15:59:47.639768 #2068002] INFO -- : [747/885] 2108859=test_memory_view I, [2024-05-21T15:59:47.644702 #2068002] INFO -- : [748/885] 2108858=test_complex I, [2024-05-21T15:59:47.749758 #2068002] INFO -- : [749/885] 2108858=test_threadgroup I, [2024-05-21T15:59:48.066282 #2068002] INFO -- : [750/885] 2108859=test_shapes I, [2024-05-21T15:59:48.072666 #2068002] INFO -- : [751/885] 2108859=test_did_you_mean I, [2024-05-21T15:59:48.136140 #2068002] INFO -- : [752/885] 2108859=test_rdoc_extend I, [2024-05-21T15:59:48.151577 #2068002] INFO -- : [753/885] 2108859=test_cesu8 I, [2024-05-21T15:59:48.163093 #2068002] INFO -- : [754/885] 2108859=test_storage I, [2024-05-21T15:59:48.173607 #2068002] INFO -- : [755/885] 2108859=test_method_name_check I, [2024-05-21T15:59:48.220032 #2068002] INFO -- : [756/885] 2108859=test_err_in_callback I, [2024-05-21T15:59:48.226784 #2068002] INFO -- : [757/885] 2108859=test_merge_keys I, [2024-05-21T15:59:48.232798 #2068002] INFO -- : [758/885] 2108859=test_string I, [2024-05-21T15:59:48.242849 #2068002] INFO -- : [759/885] 2108859=test_iterator I, [2024-05-21T15:59:48.341527 #2068002] INFO -- : [760/885] 2108859=test_gem_commands_install_command I, [2024-05-21T15:59:48.765983 #2068002] INFO -- : [761/885] 2108858=test_kernel I, [2024-05-21T15:59:48.839981 #2068002] INFO -- : [762/885] 2108860=test_rendering I, [2024-05-21T15:59:48.860560 #2068002] INFO -- : [763/885] 2108860=pattern_test I, [2024-05-21T15:59:48.890320 #2068002] INFO -- : [764/885] 2108860=test_gem_rdoc I, [2024-05-21T15:59:49.035096 #2068002] INFO -- : [765/885] 2108860=test_dot_dot I, [2024-05-21T15:59:49.039919 #2068002] INFO -- : [766/885] 2108860=test_framework I, [2024-05-21T15:59:49.045892 #2068002] INFO -- : [767/885] 2108860=test_coderange I, [2024-05-21T15:59:49.061402 #2068002] INFO -- : [768/885] 2108860=test_weakmap I, [2024-05-21T15:59:49.416202 #2068002] INFO -- : [769/885] 2108858=test_inadvertent_creation I, [2024-05-21T15:59:49.508394 #2068002] INFO -- : [770/885] 2108858=test_ansi_with_terminfo I, [2024-05-21T15:59:49.522609 #2068002] INFO -- : [771/885] 2108858=test_pack I, [2024-05-21T15:59:49.573332 #2068002] INFO -- : [772/885] 2108858=test_cgi_tag_helper I, [2024-05-21T15:59:49.625385 #2068002] INFO -- : [773/885] 2108858=test_pinned I, [2024-05-21T15:59:49.708332 #2068002] INFO -- : [774/885] 2108858=test_rdoc_generator_json_index I, [2024-05-21T15:59:49.733897 #2068002] INFO -- : [775/885] 2108858=test_date_time I, [2024-05-21T15:59:49.752704 #2068002] INFO -- : [776/885] 2108858=test_nil2vtempty I, [2024-05-21T15:59:49.773168 #2068002] INFO -- : [777/885] 2108858=test_case I, [2024-05-21T15:59:49.803297 #2068002] INFO -- : [778/885] 2108858=test_open-uri I, [2024-05-21T15:59:50.190054 #2068002] INFO -- : [779/885] 2108859=test_enc_associate I, [2024-05-21T15:59:50.252744 #2068002] INFO -- : [780/885] 2108858=test_enumerator I, [2024-05-21T15:59:50.660696 #2068002] INFO -- : [781/885] 2108859=test_gem_command_manager I, [2024-05-21T15:59:50.840298 #2068002] INFO -- : [782/885] 2108859=test_rdoc_context I, [2024-05-21T15:59:51.631965 #2068002] INFO -- : [783/885] 2108859=test_array I, [2024-05-21T15:59:51.649121 #2068002] INFO -- : [784/885] 2108859=test_libs I, [2024-05-21T15:59:51.666079 #2068002] INFO -- : [785/885] 2108859=test_iso_8859 I, [2024-05-21T15:59:51.727279 #2068002] INFO -- : [786/885] 2108859=ripper_test I, [2024-05-21T15:59:52.416276 #2068002] INFO -- : [787/885] 2108859=test_gc I, [2024-05-21T15:59:52.426042 #2068002] INFO -- : [788/885] 2108859=comments_test I, [2024-05-21T15:59:52.435549 #2068002] INFO -- : [789/885] 2108859=test_qsort I, [2024-05-21T15:59:52.446558 #2068002] INFO -- : [790/885] 2108859=test_math I, [2024-05-21T15:59:52.472645 #2068002] INFO -- : [791/885] 2108859=test_safe_load I, [2024-05-21T15:59:52.492422 #2068002] INFO -- : [792/885] 2108859=test_sprintf I, [2024-05-21T15:59:52.748097 #2068002] INFO -- : [793/885] 2108859=test_const I, [2024-05-21T15:59:52.757188 #2068002] INFO -- : [794/885] 2108859=index_write_test I, [2024-05-21T15:59:52.769473 #2068002] INFO -- : [795/885] 2108859=test_rdoc_parser_rd I, [2024-05-21T15:59:52.792890 #2068002] INFO -- : [796/885] 2108859=test_class I, [2024-05-21T15:59:59.394185 #2068002] INFO -- : [797/885] 2108859=test_exit I, [2024-05-21T15:59:59.476568 #2068002] INFO -- : [798/885] 2108859=test_yaml_special_cases I, [2024-05-21T15:59:59.494534 #2068002] INFO -- : [799/885] 2108859=test_recorder I, [2024-05-21T15:59:59.507227 #2068002] INFO -- : [800/885] 2108859=test_name_error I, [2024-05-21T15:59:59.689295 #2068002] INFO -- : [801/885] 2108859=json_addition_test I, [2024-05-21T15:59:59.705612 #2068002] INFO -- : [802/885] 2108859=test_gem_source_list I, [2024-05-21T15:59:59.783741 #2068002] INFO -- : [803/885] 2108859=test_gem_commands_sources_command I, [2024-05-21T16:00:00.027275 #2068002] INFO -- : [804/885] 2108859=test_gem_specification I, [2024-05-21T16:00:03.127037 #2068002] INFO -- : [805/885] 2108859=test_flush I, [2024-05-21T16:00:03.210119 #2068002] INFO -- : [806/885] 2108859=test_pkey_rsa I, [2024-05-21T16:00:03.413687 #2068002] INFO -- : [807/885] 2108859=test_numhash I, [2024-05-21T16:00:03.426920 #2068002] INFO -- : [808/885] 2108859=test_system I, [2024-05-21T16:00:04.242818 #2068002] INFO -- : [809/885] 2108860=test_win32ole_variable I, [2024-05-21T16:00:04.263633 #2068002] INFO -- : [810/885] 2108860=test_rdoc_cross_reference I, [2024-05-21T16:00:04.302157 #2068002] INFO -- : [811/885] 2108859=test_parse I, [2024-05-21T16:00:04.683810 #2068002] INFO -- : [812/885] 2108860=test_rdoc_class_module I, [2024-05-21T16:00:04.811385 #2068002] INFO -- : [813/885] 2108859=test_method_cache I, [2024-05-21T16:00:04.815415 #2068002] INFO -- : [814/885] 2108859=test_cp949 I, [2024-05-21T16:00:04.826563 #2068002] INFO -- : [815/885] 2108859=test_jaro_winkler I, [2024-05-21T16:00:04.828292 #2068002] INFO -- : [816/885] 2108859=test_condition I, [2024-05-21T16:00:04.838884 #2068002] INFO -- : [817/885] 2108859=test_gem_resolver_vendor_set I, [2024-05-21T16:00:04.868282 #2068002] INFO -- : [818/885] 2108859=test_gem_dependency_resolution_error I, [2024-05-21T16:00:04.889224 #2068002] INFO -- : [819/885] 2108859=test_sleep I, [2024-05-21T16:00:05.222283 #2068002] INFO -- : [820/885] 2108860=test_mixed_unicode_escapes I, [2024-05-21T16:00:05.244514 #2068002] INFO -- : [821/885] 2108860=test_fileutils I, [2024-05-21T16:00:05.801804 #2068002] INFO -- : [822/885] 2108860=test_sorted_set I, [2024-05-21T16:00:05.940022 #2068002] INFO -- : [823/885] 2108860=test_emoji I, [2024-05-21T16:00:05.979121 #2068002] INFO -- : [824/885] 2108860=test_windows_1252 I, [2024-05-21T16:00:06.342437 #2068002] INFO -- : [825/885] 2108860=test_stack I, [2024-05-21T16:00:06.872614 #2068002] INFO -- : [826/885] 2108860=test_face I, [2024-05-21T16:00:06.902986 #2068002] INFO -- : [827/885] 2108860=test_date_attr I, [2024-05-21T16:00:06.933076 #2068002] INFO -- : [828/885] 2108860=test_sizeof I, [2024-05-21T16:00:06.945505 #2068002] INFO -- : [829/885] 2108859=test_gem_request_set_lockfile_parser I, [2024-05-21T16:00:07.142357 #2068002] INFO -- : [830/885] 2108859=test_stringchar I, [2024-05-21T16:00:07.167866 #2068002] INFO -- : [831/885] 2108859=warnings_test I, [2024-05-21T16:00:07.196030 #2068002] INFO -- : [832/885] 2108859=test_econv I, [2024-05-21T16:00:08.113801 #2068002] INFO -- : [833/885] 2108859=test_gem_install_update_options I, [2024-05-21T16:00:08.264791 #2068002] INFO -- : [834/885] 2108859=test_severity I, [2024-05-21T16:00:08.283123 #2068002] INFO -- : [835/885] 2108859=test_ractor I, [2024-05-21T16:00:08.283842 #2068002] INFO -- : [836/885] 2108859=test_case I, [2024-05-21T16:00:08.302486 #2068002] INFO -- : [837/885] 2108859=test_gem_package_tar_writer I, [2024-05-21T16:00:08.567935 #2068002] INFO -- : [838/885] 2108859=test_str2big I, [2024-05-21T16:00:08.584220 #2068002] INFO -- : [839/885] 2108859=test_utf16 I, [2024-05-21T16:00:08.638008 #2068002] INFO -- : [840/885] 2108859=test_http I, [2024-05-21T16:00:09.262539 #2068002] INFO -- : [841/885] 2108860=attribute_write_test I, [2024-05-21T16:00:09.273072 #2068002] INFO -- : [842/885] 2108860=test_set I, [2024-05-21T16:00:09.286564 #2068002] INFO -- : [843/885] 2108860=test_rdoc_markup_to_rdoc I, [2024-05-21T16:00:09.572609 #2068002] INFO -- : [844/885] 2108860=test_argf I, [2024-05-21T16:00:13.086307 #2068002] INFO -- : [845/885] 2108860=test_yaml I, [2024-05-21T16:00:13.262072 #2068002] INFO -- : [846/885] 2108860=test_x509name I, [2024-05-21T16:00:13.280232 #2068002] INFO -- : [847/885] 2108860=test_gem_dependency I, [2024-05-21T16:00:13.441572 #2068002] INFO -- : [848/885] 2108860=test_yjit I, [2024-05-21T16:00:13.449282 #2068002] INFO -- : [849/885] 2108860=test_cclass I, [2024-05-21T16:00:13.553218 #2068002] INFO -- : [850/885] 2108860=test_gem_uninstaller I, [2024-05-21T16:00:14.876775 #2068002] INFO -- : [851/885] 2108860=test_m17n I, [2024-05-21T16:00:15.755643 #2068002] INFO -- : [852/885] 2108860=test_method I, [2024-05-21T16:00:17.315032 #2068002] INFO -- : [853/885] 2108859=test_filter I, [2024-05-21T16:00:17.356338 #2068002] INFO -- : [854/885] 2108859=test_parser_events I, [2024-05-21T16:00:17.573473 #2068002] INFO -- : [855/885] 2108859=test_pkcs12 I, [2024-05-21T16:00:18.245766 #2068002] INFO -- : [856/885] 2108859=test_gem_remote_fetcher I, [2024-05-21T16:00:20.055518 #2068002] INFO -- : [857/885] 2108859=test_json_tree I, [2024-05-21T16:00:20.067872 #2068002] INFO -- : [858/885] 2108859=test_koi8 I, [2024-05-21T16:00:20.178717 #2068002] INFO -- : [859/885] 2108859=test_pty I, [2024-05-21T16:00:20.584635 #2068002] INFO -- : [860/885] 2108859=test_gem_dependency_installer I, [2024-05-21T16:00:23.366566 #2068002] INFO -- : [861/885] 2108859=test_http I, [2024-05-21T16:00:23.375726 #2068002] INFO -- : [862/885] 2108859=parser_test I, [2024-05-21T16:00:23.399353 #2068002] INFO -- : [863/885] 2108859=test_hash I, [2024-05-21T16:00:23.500028 #2068002] INFO -- : [864/885] 2108858=encoding_test I, [2024-05-21T16:00:23.582365 #2068002] INFO -- : [865/885] 2108858=test_gem_commands_specification_command I, [2024-05-21T16:00:23.732802 #2068002] INFO -- : [866/885] 2108858=test_scan_args I, [2024-05-21T16:00:23.751355 #2068002] INFO -- : [867/885] 2108858=test_gem_commands_which_command I, [2024-05-21T16:00:23.804255 #2068002] INFO -- : [868/885] 2108858=test_gem_request I, [2024-05-21T16:00:24.046848 #2068002] INFO -- : [869/885] 2108858=test_gem_package_old I, [2024-05-21T16:00:24.119263 #2068002] INFO -- : [870/885] 2108858=test_gem_commands_push_command I, [2024-05-21T16:00:24.761046 #2068002] INFO -- : [871/885] 2108858=locals_test I, [2024-05-21T16:00:25.389987 #2068002] INFO -- : [872/885] 2108858=test_too_many_dummy_encodings I, [2024-05-21T16:00:25.396594 #2068002] INFO -- : [873/885] 2108858=test_method_cache I, [2024-05-21T16:00:25.415605 #2068002] INFO -- : [874/885] 2108858=test_sprintf_comb I, [2024-05-21T16:00:25.577824 #2068002] INFO -- : [875/885] 2108858=test_gem_source_local I, [2024-05-21T16:00:25.830746 #2068002] INFO -- : [876/885] 2108858=desugar_compiler_test I, [2024-05-21T16:00:25.840472 #2068002] INFO -- : [877/885] 2108858=test_win32ole I, [2024-05-21T16:00:25.848729 #2068002] INFO -- : [878/885] 2108858=test_internal_ivar I, [2024-05-21T16:00:25.857707 #2068002] INFO -- : [879/885] 2108858=test_rendering I, [2024-05-21T16:00:25.876163 #2068002] INFO -- : [880/885] 2108858=test_gem_gemcutter_utilities I, [2024-05-21T16:00:26.338564 #2068002] INFO -- : [881/885] 2108858=test_rdoc_task I, [2024-05-21T16:00:26.442349 #2068002] INFO -- : [882/885] 2108858=test_tracepoint I, [2024-05-21T16:00:26.676473 #2068002] INFO -- : [883/885] 2108858=test_settracefunc I, [2024-05-21T16:00:27.943755 #2068002] INFO -- : [884/885] 2108858=test_gem_text I, [2024-05-21T16:00:28.020955 #2068002] INFO -- : [885/885] 2108858=test_backtrace I, [2024-05-21T16:00:33.531433 #2068002] INFO -- : Finished tests in 218.921540s, 120.1115 tests/s, 42720.8990 assertions/s. I, [2024-05-21T16:00:33.536711 #2068002] INFO -- : 26295 tests, 9352525 assertions, 0 failures, 0 errors, 322 skips I, [2024-05-21T16:00:33.536749 #2068002] INFO -- : I, [2024-05-21T16:00:33.536761 #2068002] INFO -- : ruby -v: ruby 3.4.0dev (2024-05-21T15:46:45Z master ff43b4a28b) [aarch64-linux] I, [2024-05-21T16:00:33.537615 #2068002] INFO -- : $$$[end] "make yes-test-all TESTOPTS='--stderr-on-failure' TESTS='-j3'" exit with 0. I, [2024-05-21T16:00:33.537770 #2068002] INFO -- : $$$[beg] make yes-test-rubyspec MSPECOPT='--error-output stderr --debug -j' TESTS='-j3' I, [2024-05-21T16:00:33.668435 #2068002] INFO -- : BASERUBY = /usr/local/bin/ruby --disable=gems I, [2024-05-21T16:00:33.668535 #2068002] INFO -- : CC = gcc I, [2024-05-21T16:00:33.668548 #2068002] INFO -- : LD = ld I, [2024-05-21T16:00:33.668557 #2068002] INFO -- : LDSHARED = gcc -shared I, [2024-05-21T16:00:33.668570 #2068002] INFO -- : CFLAGS = -O3 -fno-fast-math -ggdb3 -Wall -Wextra -Wdeprecated-declarations -Wdiv-by-zero -Wduplicated-cond -Wimplicit-function-declaration -Wimplicit-int -Wpointer-arith -Wwrite-strings -Wold-style-definition -Wimplicit-fallthrough=0 -Wmissing-noreturn -Wno-cast-function-type -Wno-constant-logical-operand -Wno-long-long -Wno-missing-field-initializers -Wno-overlength-strings -Wno-packed-bitfield-compat -Wno-parentheses-equality -Wno-self-assign -Wno-tautological-compare -Wno-unused-parameter -Wno-unused-value -Wsuggest-attribute=format -Wsuggest-attribute=noreturn -Wunused-variable -Wmisleading-indentation -Wundef I, [2024-05-21T16:00:33.668579 #2068002] INFO -- : XCFLAGS = -U_FORTIFY_SOURCE -D_FORTIFY_SOURCE=2 -fstack-protector-strong -msign-return-address=all -fno-strict-overflow -fvisibility=hidden -fexcess-precision=standard -DRUBY_EXPORT -fPIE -I. -I.ext/include/aarch64-linux -I/home/opc/ruby/src/master/include -I/home/opc/ruby/src/master -I/home/opc/ruby/src/master/prism -I/home/opc/ruby/src/master/enc/unicode/15.0.0 I, [2024-05-21T16:00:33.668588 #2068002] INFO -- : CPPFLAGS = I, [2024-05-21T16:00:33.668597 #2068002] INFO -- : DLDFLAGS = -Wl,--compress-debug-sections=zlib -fstack-protector-strong -pie I, [2024-05-21T16:00:33.668624 #2068002] INFO -- : SOLIBS = -lz -lrt -lrt -ldl -lcrypt -lm -lpthread I, [2024-05-21T16:00:33.668640 #2068002] INFO -- : LANG = en_US.UTF-8 I, [2024-05-21T16:00:33.668649 #2068002] INFO -- : LC_ALL = I, [2024-05-21T16:00:33.668657 #2068002] INFO -- : LC_CTYPE = I, [2024-05-21T16:00:33.668666 #2068002] INFO -- : MFLAGS = I, [2024-05-21T16:00:33.668674 #2068002] INFO -- : RUSTC = rustc I, [2024-05-21T16:00:33.668682 #2068002] INFO -- : YJIT_RUSTC_ARGS = --crate-name=yjit --crate-type=staticlib --edition=2021 -g -C lto=thin -C opt-level=3 -C overflow-checks=on '--out-dir=/home/opc/ruby/build/master/yjit/target/release/' /home/opc/ruby/src/master/yjit/src/lib.rs I, [2024-05-21T16:00:33.669373 #2068002] INFO -- : gcc (GCC) 8.5.0 20210514 (Red Hat 8.5.0-10.1.0.1) I, [2024-05-21T16:00:33.669391 #2068002] INFO -- : Copyright (C) 2018 Free Software Foundation, Inc. I, [2024-05-21T16:00:33.669400 #2068002] INFO -- : This is free software; see the source for copying conditions. There is NO I, [2024-05-21T16:00:33.669409 #2068002] INFO -- : warranty; not even for MERCHANTABILITY or FITNESS FOR A PARTICULAR PURPOSE. I, [2024-05-21T16:00:33.669417 #2068002] INFO -- : I, [2024-05-21T16:00:33.671434 #2068002] INFO -- : generating enc.mk I, [2024-05-21T16:00:33.917441 #2068002] INFO -- : generating encdb.h I, [2024-05-21T16:00:33.955903 #2068002] INFO -- : encdb.h unchanged I, [2024-05-21T16:00:33.957200 #2068002] INFO -- : making enc I, [2024-05-21T16:00:33.984801 #2068002] INFO -- : make[1]: Entering directory '/home/opc/ruby/build/master' I, [2024-05-21T16:00:33.984866 #2068002] INFO -- : make[1]: Nothing to be done for 'enc'. I, [2024-05-21T16:00:33.984877 #2068002] INFO -- : make[1]: Leaving directory '/home/opc/ruby/build/master' I, [2024-05-21T16:00:33.985696 #2068002] INFO -- : making srcs under enc I, [2024-05-21T16:00:34.027943 #2068002] INFO -- : make[1]: Entering directory '/home/opc/ruby/build/master' I, [2024-05-21T16:00:34.028017 #2068002] INFO -- : make[1]: Nothing to be done for 'srcs'. I, [2024-05-21T16:00:34.028028 #2068002] INFO -- : make[1]: Leaving directory '/home/opc/ruby/build/master' I, [2024-05-21T16:00:34.029189 #2068002] INFO -- : generating transdb.h I, [2024-05-21T16:00:34.179374 #2068002] INFO -- : transdb.h unchanged I, [2024-05-21T16:00:34.180741 #2068002] INFO -- : making trans I, [2024-05-21T16:00:34.229464 #2068002] INFO -- : make[1]: Entering directory '/home/opc/ruby/build/master' I, [2024-05-21T16:00:34.229536 #2068002] INFO -- : make[1]: Nothing to be done for 'trans'. I, [2024-05-21T16:00:34.229547 #2068002] INFO -- : make[1]: Leaving directory '/home/opc/ruby/build/master' I, [2024-05-21T16:00:34.230309 #2068002] INFO -- : making encs I, [2024-05-21T16:00:34.283052 #2068002] INFO -- : make[1]: Entering directory '/home/opc/ruby/build/master' I, [2024-05-21T16:00:34.283132 #2068002] INFO -- : make[1]: Nothing to be done for 'encs'. I, [2024-05-21T16:00:34.283142 #2068002] INFO -- : make[1]: Leaving directory '/home/opc/ruby/build/master' I, [2024-05-21T16:00:34.285239 #2068002] INFO -- : generating makefiles ext/configure-ext.mk I, [2024-05-21T16:00:34.328355 #2068002] INFO -- : ext/configure-ext.mk updated I, [2024-05-21T16:00:34.331959 #2068002] INFO -- : make[1]: Entering directory '/home/opc/ruby/build/master' I, [2024-05-21T16:00:36.700223 #2068002] INFO -- : make[1]: Leaving directory '/home/opc/ruby/build/master' I, [2024-05-21T16:00:36.700994 #2068002] INFO -- : generating makefile exts.mk I, [2024-05-21T16:00:36.763455 #2068002] INFO -- : exts.mk unchanged I, [2024-05-21T16:00:36.768665 #2068002] INFO -- : make[1]: Entering directory '/home/opc/ruby/build/master' I, [2024-05-21T16:00:37.080299 #2068002] INFO -- : make[2]: Entering directory '/home/opc/ruby/build/master/ext/coverage' I, [2024-05-21T16:00:37.085212 #2068002] INFO -- : make[2]: Leaving directory '/home/opc/ruby/build/master/ext/coverage' I, [2024-05-21T16:00:37.091355 #2068002] INFO -- : make[2]: Entering directory '/home/opc/ruby/build/master/ext/date' I, [2024-05-21T16:00:37.096797 #2068002] INFO -- : make[2]: Leaving directory '/home/opc/ruby/build/master/ext/date' I, [2024-05-21T16:00:37.100274 #2068002] INFO -- : make[2]: Entering directory '/home/opc/ruby/build/master/ext/digest' I, [2024-05-21T16:00:37.109818 #2068002] INFO -- : make[2]: Leaving directory '/home/opc/ruby/build/master/ext/digest' I, [2024-05-21T16:00:37.133460 #2068002] INFO -- : make[2]: Entering directory '/home/opc/ruby/build/master/ext/digest/sha2' I, [2024-05-21T16:00:37.138776 #2068002] INFO -- : make[2]: Leaving directory '/home/opc/ruby/build/master/ext/digest/sha2' I, [2024-05-21T16:00:37.157672 #2068002] INFO -- : make[2]: Entering directory '/home/opc/ruby/build/master/ext/fiddle' I, [2024-05-21T16:00:37.168403 #2068002] INFO -- : make[2]: Leaving directory '/home/opc/ruby/build/master/ext/fiddle' I, [2024-05-21T16:00:37.172900 #2068002] INFO -- : make[2]: Entering directory '/home/opc/ruby/build/master/ext/io/console' I, [2024-05-21T16:00:37.177747 #2068002] INFO -- : make[2]: Leaving directory '/home/opc/ruby/build/master/ext/io/console' I, [2024-05-21T16:00:37.188858 #2068002] INFO -- : make[2]: Entering directory '/home/opc/ruby/build/master/ext/json' I, [2024-05-21T16:00:37.198633 #2068002] INFO -- : make[2]: Leaving directory '/home/opc/ruby/build/master/ext/json' I, [2024-05-21T16:00:37.211970 #2068002] INFO -- : make[2]: Entering directory '/home/opc/ruby/build/master/ext/monitor' I, [2024-05-21T16:00:37.216504 #2068002] INFO -- : make[2]: Leaving directory '/home/opc/ruby/build/master/ext/monitor' I, [2024-05-21T16:00:37.222679 #2068002] INFO -- : make[2]: Entering directory '/home/opc/ruby/build/master/ext/objspace' I, [2024-05-21T16:00:37.228947 #2068002] INFO -- : make[2]: Leaving directory '/home/opc/ruby/build/master/ext/objspace' I, [2024-05-21T16:00:37.248303 #2068002] INFO -- : make[2]: Entering directory '/home/opc/ruby/build/master/ext/openssl' I, [2024-05-21T16:00:37.270677 #2068002] INFO -- : make[2]: Leaving directory '/home/opc/ruby/build/master/ext/openssl' I, [2024-05-21T16:00:37.275098 #2068002] INFO -- : make[2]: Entering directory '/home/opc/ruby/build/master/ext/pathname' I, [2024-05-21T16:00:37.279797 #2068002] INFO -- : make[2]: Leaving directory '/home/opc/ruby/build/master/ext/pathname' I, [2024-05-21T16:00:37.286263 #2068002] INFO -- : make[2]: Entering directory '/home/opc/ruby/build/master/ext/psych' I, [2024-05-21T16:00:37.308102 #2068002] INFO -- : make[2]: Leaving directory '/home/opc/ruby/build/master/ext/psych' I, [2024-05-21T16:00:37.312752 #2068002] INFO -- : make[2]: Entering directory '/home/opc/ruby/build/master/ext/pty' I, [2024-05-21T16:00:37.317332 #2068002] INFO -- : make[2]: Leaving directory '/home/opc/ruby/build/master/ext/pty' I, [2024-05-21T16:00:37.331398 #2068002] INFO -- : make[2]: Entering directory '/home/opc/ruby/build/master/ext/ripper' I, [2024-05-21T16:00:37.339653 #2068002] INFO -- : make[2]: Leaving directory '/home/opc/ruby/build/master/ext/ripper' I, [2024-05-21T16:00:37.341781 #2068002] INFO -- : make[2]: Entering directory '/home/opc/ruby/build/master/ext/rubyvm' I, [2024-05-21T16:00:37.345581 #2068002] INFO -- : make[2]: Leaving directory '/home/opc/ruby/build/master/ext/rubyvm' I, [2024-05-21T16:00:37.357795 #2068002] INFO -- : make[2]: Entering directory '/home/opc/ruby/build/master/ext/socket' I, [2024-05-21T16:00:37.368851 #2068002] INFO -- : make[2]: Leaving directory '/home/opc/ruby/build/master/ext/socket' I, [2024-05-21T16:00:37.385122 #2068002] INFO -- : make[2]: Entering directory '/home/opc/ruby/build/master/.bundle/gems/bigdecimal-3.1.7/ext/bigdecimal' I, [2024-05-21T16:00:37.417884 #2068002] INFO -- : make[2]: Leaving directory '/home/opc/ruby/build/master/.bundle/gems/bigdecimal-3.1.7/ext/bigdecimal' I, [2024-05-21T16:00:37.420663 #2068002] INFO -- : make[2]: Entering directory '/home/opc/ruby/build/master/.bundle/gems/bigdecimal-3.1.8/ext/bigdecimal' I, [2024-05-21T16:00:37.452881 #2068002] INFO -- : make[2]: Leaving directory '/home/opc/ruby/build/master/.bundle/gems/bigdecimal-3.1.8/ext/bigdecimal' I, [2024-05-21T16:00:37.455550 #2068002] INFO -- : make[2]: Entering directory '/home/opc/ruby/build/master/.bundle/gems/debug-1.9.2/ext/debug' I, [2024-05-21T16:00:37.487550 #2068002] INFO -- : make[2]: Leaving directory '/home/opc/ruby/build/master/.bundle/gems/debug-1.9.2/ext/debug' I, [2024-05-21T16:00:37.490196 #2068002] INFO -- : make[2]: Entering directory '/home/opc/ruby/build/master/.bundle/gems/nkf-0.2.0/ext/nkf' I, [2024-05-21T16:00:37.522508 #2068002] INFO -- : make[2]: Leaving directory '/home/opc/ruby/build/master/.bundle/gems/nkf-0.2.0/ext/nkf' I, [2024-05-21T16:00:37.525158 #2068002] INFO -- : make[2]: Entering directory '/home/opc/ruby/build/master/.bundle/gems/racc-1.7.3/ext/racc/cparse' I, [2024-05-21T16:00:37.557387 #2068002] INFO -- : make[2]: Leaving directory '/home/opc/ruby/build/master/.bundle/gems/racc-1.7.3/ext/racc/cparse' I, [2024-05-21T16:00:37.560354 #2068002] INFO -- : make[2]: Entering directory '/home/opc/ruby/build/master/.bundle/gems/racc-1.8.0/ext/racc/cparse' I, [2024-05-21T16:00:37.594124 #2068002] INFO -- : make[2]: Leaving directory '/home/opc/ruby/build/master/.bundle/gems/racc-1.8.0/ext/racc/cparse' I, [2024-05-21T16:00:37.597187 #2068002] INFO -- : make[2]: Entering directory '/home/opc/ruby/build/master/.bundle/gems/rbs-3.4.4/ext/rbs_extension' I, [2024-05-21T16:00:37.629966 #2068002] INFO -- : make[2]: Leaving directory '/home/opc/ruby/build/master/.bundle/gems/rbs-3.4.4/ext/rbs_extension' I, [2024-05-21T16:00:37.632641 #2068002] INFO -- : make[2]: Entering directory '/home/opc/ruby/build/master/.bundle/gems/syslog-0.1.2/ext/syslog' I, [2024-05-21T16:00:37.665203 #2068002] INFO -- : make[2]: Leaving directory '/home/opc/ruby/build/master/.bundle/gems/syslog-0.1.2/ext/syslog' I, [2024-05-21T16:00:37.703790 #2068002] INFO -- : make[2]: Entering directory '/home/opc/ruby/build/master' I, [2024-05-21T16:00:37.792780 #2068002] INFO -- : make[2]: 'ruby' is up to date. I, [2024-05-21T16:00:37.792856 #2068002] INFO -- : make[2]: Leaving directory '/home/opc/ruby/build/master' I, [2024-05-21T16:00:37.793010 #2068002] INFO -- : make[1]: Leaving directory '/home/opc/ruby/build/master' I, [2024-05-21T16:00:37.797797 #2068002] INFO -- : make[1]: Entering directory '/home/opc/ruby/build/master' I, [2024-05-21T16:00:37.797868 #2068002] INFO -- : make[1]: Nothing to be done for 'note'. I, [2024-05-21T16:00:37.797879 #2068002] INFO -- : make[1]: Leaving directory '/home/opc/ruby/build/master' E, [2024-05-21T16:00:37.878522 #2068002] ERROR -- : $ /home/opc/ruby/build/master/miniruby -I/home/opc/ruby/src/master/lib /home/opc/ruby/src/master/tool/runruby.rb --archdir=/home/opc/ruby/build/master --extout=.ext -- /home/opc/ruby/src/master/spec/mspec/bin/mspec-run -B /home/opc/ruby/src/master/spec/default.mspec --error-output stderr --debug -fy -o /tmp/rubytest.svtzeb/1-mspec-multi-0 E, [2024-05-21T16:00:37.878898 #2068002] ERROR -- : $ /home/opc/ruby/build/master/miniruby -I/home/opc/ruby/src/master/lib /home/opc/ruby/src/master/tool/runruby.rb --archdir=/home/opc/ruby/build/master --extout=.ext -- /home/opc/ruby/src/master/spec/mspec/bin/mspec-run -B /home/opc/ruby/src/master/spec/default.mspec --error-output stderr --debug -fy -o /tmp/rubytest.svtzeb/2-mspec-multi-1 E, [2024-05-21T16:00:37.879172 #2068002] ERROR -- : $ /home/opc/ruby/build/master/miniruby -I/home/opc/ruby/src/master/lib /home/opc/ruby/src/master/tool/runruby.rb --archdir=/home/opc/ruby/build/master --extout=.ext -- /home/opc/ruby/src/master/spec/mspec/bin/mspec-run -B /home/opc/ruby/src/master/spec/default.mspec --error-output stderr --debug -fy -o /tmp/rubytest.svtzeb/3-mspec-multi-2 I, [2024-05-21T16:00:38.022871 #2068002] INFO -- : ruby 3.4.0dev (2024-05-21T15:46:45Z master ff43b4a28b) [aarch64-linux] I, [2024-05-21T16:00:44.020509 #2068002] INFO -- : 0 ......................................................................... I, [2024-05-21T16:00:46.449680 #2068002] INFO -- : 73 ......................................................................... I, [2024-05-21T16:00:46.651518 #2068002] INFO -- : 146 ......................................................................... I, [2024-05-21T16:00:46.959014 #2068002] INFO -- : 219 ......................................................................... I, [2024-05-21T16:00:47.109642 #2068002] INFO -- : 292 ......................................................................... I, [2024-05-21T16:00:47.354845 #2068002] INFO -- : 365 ......................................................................... I, [2024-05-21T16:00:47.486686 #2068002] INFO -- : 438 ......................................................................... I, [2024-05-21T16:00:47.544267 #2068002] INFO -- : 511 ......................................................................... I, [2024-05-21T16:00:47.609537 #2068002] INFO -- : 584 ......................................................................... I, [2024-05-21T16:00:48.244166 #2068002] INFO -- : 657 ......................................................................... I, [2024-05-21T16:00:48.351133 #2068002] INFO -- : 730 ......................................................................... I, [2024-05-21T16:00:48.400194 #2068002] INFO -- : 803 ......................................................................... I, [2024-05-21T16:00:48.604125 #2068002] INFO -- : 876 ......................................................................... I, [2024-05-21T16:00:48.709688 #2068002] INFO -- : 949 ......................................................................... I, [2024-05-21T16:00:49.327747 #2068002] INFO -- : 1022 ......................................................................... I, [2024-05-21T16:00:51.916195 #2068002] INFO -- : 1095 ......................................................................... I, [2024-05-21T16:00:52.939044 #2068002] INFO -- : 1168 ......................................................................... I, [2024-05-21T16:00:53.072162 #2068002] INFO -- : 1241 ......................................................................... I, [2024-05-21T16:00:53.339878 #2068002] INFO -- : 1314 ......................................................................... I, [2024-05-21T16:00:53.438272 #2068002] INFO -- : 1387 ......................................................................... I, [2024-05-21T16:00:55.732863 #2068002] INFO -- : 1460 ......................................................................... I, [2024-05-21T16:00:59.484440 #2068002] INFO -- : 1533 ......................................................................... I, [2024-05-21T16:00:59.860087 #2068002] INFO -- : 1606 ......................................................................... I, [2024-05-21T16:01:00.839612 #2068002] INFO -- : 1679 ......................................................................... I, [2024-05-21T16:01:01.081616 #2068002] INFO -- : 1752 ......................................................................... I, [2024-05-21T16:01:01.406020 #2068002] INFO -- : 1825 ......................................................................... I, [2024-05-21T16:01:01.868414 #2068002] INFO -- : 1898 ......................................................................... I, [2024-05-21T16:01:02.247578 #2068002] INFO -- : 1971 ......................................................................... I, [2024-05-21T16:01:02.846228 #2068002] INFO -- : 2044 ......................................................................... I, [2024-05-21T16:01:02.970804 #2068002] INFO -- : 2117 ......................................................................... I, [2024-05-21T16:01:03.042934 #2068002] INFO -- : 2190 ......................................................................... I, [2024-05-21T16:01:03.094834 #2068002] INFO -- : 2263 ......................................................................... I, [2024-05-21T16:01:03.149502 #2068002] INFO -- : 2336 ......................................................................... I, [2024-05-21T16:01:03.239197 #2068002] INFO -- : 2409 ......................................................................... I, [2024-05-21T16:01:03.534736 #2068002] INFO -- : 2482 ......................................................................... I, [2024-05-21T16:01:03.698281 #2068002] INFO -- : 2555 ......................................................................... I, [2024-05-21T16:01:04.948317 #2068002] INFO -- : 2628 ......................................................................... I, [2024-05-21T16:01:05.159052 #2068002] INFO -- : 2701 ......................................................................... I, [2024-05-21T16:01:05.303314 #2068002] INFO -- : 2774 ......................................................................... I, [2024-05-21T16:01:05.626833 #2068002] INFO -- : 2847 ......................................................................... I, [2024-05-21T16:01:05.909435 #2068002] INFO -- : 2920 ......................................................................... I, [2024-05-21T16:01:06.017340 #2068002] INFO -- : 2993 ......................................................................... I, [2024-05-21T16:01:06.086657 #2068002] INFO -- : 3066 ......................................................................... I, [2024-05-21T16:01:06.148558 #2068002] INFO -- : 3139 ......................................................................... I, [2024-05-21T16:01:06.209853 #2068002] INFO -- : 3212 ......................................................................... I, [2024-05-21T16:01:06.280764 #2068002] INFO -- : 3285 ......................................................................... I, [2024-05-21T16:01:10.091025 #2068002] INFO -- : 3358 ......................................................................... I, [2024-05-21T16:01:10.119613 #2068002] INFO -- : I, [2024-05-21T16:01:10.119695 #2068002] INFO -- : I, [2024-05-21T16:01:10.119707 #2068002] INFO -- : Finished in 32.240966 seconds I, [2024-05-21T16:01:10.119716 #2068002] INFO -- : I, [2024-05-21T16:01:10.119725 #2068002] INFO -- : 3430 files, 32648 examples, 195810 expectations, 0 failures, 0 errors, 0 tagged I, [2024-05-21T16:01:10.121311 #2068002] INFO -- : $$$[end] "make yes-test-rubyspec MSPECOPT='--error-output stderr --debug -j' TESTS='-j3'" exit with 0.