# Logfile created on 2024-05-21 00:40:04 +0000 by logger.rb/v1.5.3 I, [2024-05-21T00:40:04.913191 #3531013] INFO -- : #, @formatter=nil, @logdev=#, @binmode=false, @mon_data=#, @mon_data_owner_object_id=860>>> I, [2024-05-21T00:40:04.913492 #3531013] INFO -- : $$$[beg] make update-unicode -j3 I, [2024-05-21T00:40:05.003513 #3531013] INFO -- : Downloading Unicode emoji 15.0 files... I, [2024-05-21T00:40:05.003784 #3531013] INFO -- : Downloading Unicode emoji 15.0 files... I, [2024-05-21T00:40:05.003881 #3531013] INFO -- : Downloading Unicode emoji 15.0 files... I, [2024-05-21T00:40:05.081775 #3531013] INFO -- : made symlink emoji/15.0/emoji-sequences.txt to /home/opc/ruby/src/master/.downloaded-cache/emoji/15.0/emoji-sequences.txt I, [2024-05-21T00:40:05.082986 #3531013] INFO -- : downloading emoji/15.0/emoji-test.txt ... /home/opc/ruby/src/master/enc/unicode/data/emoji/15.0/emoji-sequences.txt already exists I, [2024-05-21T00:40:05.083812 #3531013] INFO -- : downloading emoji/15.0/emoji-test.txt ... /home/opc/ruby/src/master/enc/unicode/data/emoji/15.0/emoji-sequences.txt already exists E, [2024-05-21T00:40:05.536424 #3531013] ERROR -- : /home/opc/ruby/src/master/tool/downloader.rb:302:in `rescue in download': failed to download emoji/15.0/emoji-test.txt (RuntimeError) E, [2024-05-21T00:40:05.536504 #3531013] ERROR -- : OpenURI::HTTPError: 403 Forbidden: https://www.unicode.org/Public/emoji/15.0/emoji-test.txt E, [2024-05-21T00:40:05.536519 #3531013] ERROR -- : from /home/opc/ruby/src/master/tool/downloader.rb:201:in `download' E, [2024-05-21T00:40:05.536530 #3531013] ERROR -- : from /home/opc/ruby/src/master/tool/downloader.rb:136:in `download' E, [2024-05-21T00:40:05.536539 #3531013] ERROR -- : from /home/opc/ruby/src/master/tool/downloader.rb:482:in `block in
' E, [2024-05-21T00:40:05.536547 #3531013] ERROR -- : from /home/opc/ruby/src/master/tool/downloader.rb:465:in `each' E, [2024-05-21T00:40:05.536555 #3531013] ERROR -- : from /home/opc/ruby/src/master/tool/downloader.rb:465:in `
' E, [2024-05-21T00:40:05.536563 #3531013] ERROR -- : /usr/local/lib/ruby/3.2.0/open-uri.rb:369:in `open_http': 403 Forbidden (OpenURI::HTTPError) E, [2024-05-21T00:40:05.536572 #3531013] ERROR -- : from /usr/local/lib/ruby/3.2.0/open-uri.rb:760:in `buffer_open' E, [2024-05-21T00:40:05.536580 #3531013] ERROR -- : from /usr/local/lib/ruby/3.2.0/open-uri.rb:214:in `block in open_loop' E, [2024-05-21T00:40:05.536589 #3531013] ERROR -- : from /usr/local/lib/ruby/3.2.0/open-uri.rb:212:in `catch' E, [2024-05-21T00:40:05.536597 #3531013] ERROR -- : from /usr/local/lib/ruby/3.2.0/open-uri.rb:212:in `open_loop' E, [2024-05-21T00:40:05.536605 #3531013] ERROR -- : from /usr/local/lib/ruby/3.2.0/open-uri.rb:153:in `open_uri' E, [2024-05-21T00:40:05.536613 #3531013] ERROR -- : from /usr/local/lib/ruby/3.2.0/open-uri.rb:740:in `open' E, [2024-05-21T00:40:05.536625 #3531013] ERROR -- : from /usr/local/lib/ruby/3.2.0/open-uri.rb:748:in `read' E, [2024-05-21T00:40:05.536633 #3531013] ERROR -- : from /home/opc/ruby/src/master/tool/downloader.rb:247:in `block in download' E, [2024-05-21T00:40:05.536641 #3531013] ERROR -- : from /home/opc/ruby/src/master/tool/downloader.rb:378:in `with_retry' E, [2024-05-21T00:40:05.536649 #3531013] ERROR -- : from /home/opc/ruby/src/master/tool/downloader.rb:246:in `download' E, [2024-05-21T00:40:05.536658 #3531013] ERROR -- : from /home/opc/ruby/src/master/tool/downloader.rb:136:in `download' E, [2024-05-21T00:40:05.536666 #3531013] ERROR -- : from /home/opc/ruby/src/master/tool/downloader.rb:482:in `block in
' E, [2024-05-21T00:40:05.536675 #3531013] ERROR -- : from /home/opc/ruby/src/master/tool/downloader.rb:465:in `each' E, [2024-05-21T00:40:05.536683 #3531013] ERROR -- : from /home/opc/ruby/src/master/tool/downloader.rb:465:in `
' E, [2024-05-21T00:40:05.537150 #3531013] ERROR -- : /home/opc/ruby/src/master/tool/downloader.rb:302:in `rescue in download': failed to download emoji/15.0/emoji-test.txt (RuntimeError) E, [2024-05-21T00:40:05.537170 #3531013] ERROR -- : OpenURI::HTTPError: 403 Forbidden: https://www.unicode.org/Public/emoji/15.0/emoji-test.txt E, [2024-05-21T00:40:05.537180 #3531013] ERROR -- : from /home/opc/ruby/src/master/tool/downloader.rb:201:in `download' E, [2024-05-21T00:40:05.537189 #3531013] ERROR -- : from /home/opc/ruby/src/master/tool/downloader.rb:136:in `download' E, [2024-05-21T00:40:05.537198 #3531013] ERROR -- : from /home/opc/ruby/src/master/tool/downloader.rb:482:in `block in
' E, [2024-05-21T00:40:05.537206 #3531013] ERROR -- : from /home/opc/ruby/src/master/tool/downloader.rb:465:in `each' E, [2024-05-21T00:40:05.537214 #3531013] ERROR -- : from /home/opc/ruby/src/master/tool/downloader.rb:465:in `
' E, [2024-05-21T00:40:05.537222 #3531013] ERROR -- : /usr/local/lib/ruby/3.2.0/open-uri.rb:369:in `open_http': 403 Forbidden (OpenURI::HTTPError) E, [2024-05-21T00:40:05.537230 #3531013] ERROR -- : from /usr/local/lib/ruby/3.2.0/open-uri.rb:760:in `buffer_open' E, [2024-05-21T00:40:05.537238 #3531013] ERROR -- : from /usr/local/lib/ruby/3.2.0/open-uri.rb:214:in `block in open_loop' E, [2024-05-21T00:40:05.537246 #3531013] ERROR -- : from /usr/local/lib/ruby/3.2.0/open-uri.rb:212:in `catch' E, [2024-05-21T00:40:05.537254 #3531013] ERROR -- : from /usr/local/lib/ruby/3.2.0/open-uri.rb:212:in `open_loop' E, [2024-05-21T00:40:05.537262 #3531013] ERROR -- : from /usr/local/lib/ruby/3.2.0/open-uri.rb:153:in `open_uri' E, [2024-05-21T00:40:05.537270 #3531013] ERROR -- : from /usr/local/lib/ruby/3.2.0/open-uri.rb:740:in `open' E, [2024-05-21T00:40:05.537278 #3531013] ERROR -- : from /usr/local/lib/ruby/3.2.0/open-uri.rb:748:in `read' E, [2024-05-21T00:40:05.537286 #3531013] ERROR -- : from /home/opc/ruby/src/master/tool/downloader.rb:247:in `block in download' E, [2024-05-21T00:40:05.537295 #3531013] ERROR -- : from /home/opc/ruby/src/master/tool/downloader.rb:378:in `with_retry' E, [2024-05-21T00:40:05.537303 #3531013] ERROR -- : from /home/opc/ruby/src/master/tool/downloader.rb:246:in `download' E, [2024-05-21T00:40:05.537311 #3531013] ERROR -- : from /home/opc/ruby/src/master/tool/downloader.rb:136:in `download' E, [2024-05-21T00:40:05.537319 #3531013] ERROR -- : from /home/opc/ruby/src/master/tool/downloader.rb:482:in `block in
' E, [2024-05-21T00:40:05.537327 #3531013] ERROR -- : from /home/opc/ruby/src/master/tool/downloader.rb:465:in `each' E, [2024-05-21T00:40:05.537335 #3531013] ERROR -- : from /home/opc/ruby/src/master/tool/downloader.rb:465:in `
' E, [2024-05-21T00:40:05.539416 #3531013] ERROR -- : make: *** [uncommon.mk:1756: /home/opc/ruby/src/master/enc/unicode/data/emoji/15.0/emoji-zwj-sequences.txt] Error 1 E, [2024-05-21T00:40:05.539449 #3531013] ERROR -- : make: *** Waiting for unfinished jobs.... E, [2024-05-21T00:40:05.540116 #3531013] ERROR -- : make: *** [uncommon.mk:1756: /home/opc/ruby/src/master/enc/unicode/data/emoji/15.0/emoji-test.txt] Error 1 E, [2024-05-21T00:40:05.553242 #3531013] ERROR -- : /home/opc/ruby/src/master/tool/downloader.rb:302:in `rescue in download': failed to download emoji/15.0/emoji-test.txt (RuntimeError) E, [2024-05-21T00:40:05.553300 #3531013] ERROR -- : OpenURI::HTTPError: 403 Forbidden: https://www.unicode.org/Public/emoji/15.0/emoji-test.txt E, [2024-05-21T00:40:05.553311 #3531013] ERROR -- : from /home/opc/ruby/src/master/tool/downloader.rb:201:in `download' E, [2024-05-21T00:40:05.553320 #3531013] ERROR -- : from /home/opc/ruby/src/master/tool/downloader.rb:136:in `download' E, [2024-05-21T00:40:05.553328 #3531013] ERROR -- : from /home/opc/ruby/src/master/tool/downloader.rb:482:in `block in
' E, [2024-05-21T00:40:05.553337 #3531013] ERROR -- : from /home/opc/ruby/src/master/tool/downloader.rb:465:in `each' E, [2024-05-21T00:40:05.553345 #3531013] ERROR -- : from /home/opc/ruby/src/master/tool/downloader.rb:465:in `
' E, [2024-05-21T00:40:05.553353 #3531013] ERROR -- : /usr/local/lib/ruby/3.2.0/open-uri.rb:369:in `open_http': 403 Forbidden (OpenURI::HTTPError) E, [2024-05-21T00:40:05.553361 #3531013] ERROR -- : from /usr/local/lib/ruby/3.2.0/open-uri.rb:760:in `buffer_open' E, [2024-05-21T00:40:05.553369 #3531013] ERROR -- : from /usr/local/lib/ruby/3.2.0/open-uri.rb:214:in `block in open_loop' E, [2024-05-21T00:40:05.553377 #3531013] ERROR -- : from /usr/local/lib/ruby/3.2.0/open-uri.rb:212:in `catch' E, [2024-05-21T00:40:05.553385 #3531013] ERROR -- : from /usr/local/lib/ruby/3.2.0/open-uri.rb:212:in `open_loop' E, [2024-05-21T00:40:05.553393 #3531013] ERROR -- : from /usr/local/lib/ruby/3.2.0/open-uri.rb:153:in `open_uri' E, [2024-05-21T00:40:05.553401 #3531013] ERROR -- : from /usr/local/lib/ruby/3.2.0/open-uri.rb:740:in `open' E, [2024-05-21T00:40:05.553409 #3531013] ERROR -- : from /usr/local/lib/ruby/3.2.0/open-uri.rb:748:in `read' E, [2024-05-21T00:40:05.553417 #3531013] ERROR -- : from /home/opc/ruby/src/master/tool/downloader.rb:247:in `block in download' E, [2024-05-21T00:40:05.553426 #3531013] ERROR -- : from /home/opc/ruby/src/master/tool/downloader.rb:378:in `with_retry' E, [2024-05-21T00:40:05.553434 #3531013] ERROR -- : from /home/opc/ruby/src/master/tool/downloader.rb:246:in `download' E, [2024-05-21T00:40:05.553442 #3531013] ERROR -- : from /home/opc/ruby/src/master/tool/downloader.rb:136:in `download' E, [2024-05-21T00:40:05.553450 #3531013] ERROR -- : from /home/opc/ruby/src/master/tool/downloader.rb:482:in `block in
' E, [2024-05-21T00:40:05.553458 #3531013] ERROR -- : from /home/opc/ruby/src/master/tool/downloader.rb:465:in `each' E, [2024-05-21T00:40:05.553466 #3531013] ERROR -- : from /home/opc/ruby/src/master/tool/downloader.rb:465:in `
' E, [2024-05-21T00:40:05.556195 #3531013] ERROR -- : make: *** [uncommon.mk:1756: /home/opc/ruby/src/master/enc/unicode/data/emoji/15.0/emoji-sequences.txt] Error 1 E, [2024-05-21T00:40:05.556227 #3531013] ERROR -- : make: *** Deleting file '/home/opc/ruby/src/master/enc/unicode/data/emoji/15.0/emoji-sequences.txt' I, [2024-05-21T00:40:05.556369 #3531013] INFO -- : downloading emoji/15.0/emoji-test.txt ... I, [2024-05-21T00:40:05.556653 #3531013] INFO -- : $$$[end] "make update-unicode -j3" exit with 512. I, [2024-05-21T00:40:05.556710 #3531013] INFO -- : $$$[beg] make update-download -j3 I, [2024-05-21T00:40:05.720033 #3531013] INFO -- : tool/config.guess already exists I, [2024-05-21T00:40:05.720100 #3531013] INFO -- : tool/config.sub already exists I, [2024-05-21T00:40:05.722995 #3531013] INFO -- : Update power_assert to 84e85124c5014a139af39161d484156cfe87a9ed I, [2024-05-21T00:40:05.723111 #3531013] INFO -- : Update rbs to ba7872795d5de04adb8ff500c0e6afdc81a041dd I, [2024-05-21T00:40:05.723378 #3531013] INFO -- : Update typeprof to b19a6416da3a05d57fadd6ffdadb382b6d236ca5 I, [2024-05-21T00:40:05.726827 #3531013] INFO -- : echo 84e85124c5014a139af39161d484156cfe87a9ed | /bin/sh /home/opc/ruby/src/master/tool/ifchange /home/opc/ruby/src/master/.bundle/.timestamp/power_assert.revision - I, [2024-05-21T00:40:05.727054 #3531013] INFO -- : echo ba7872795d5de04adb8ff500c0e6afdc81a041dd | /bin/sh /home/opc/ruby/src/master/tool/ifchange /home/opc/ruby/src/master/.bundle/.timestamp/rbs.revision - I, [2024-05-21T00:40:05.727228 #3531013] INFO -- : echo b19a6416da3a05d57fadd6ffdadb382b6d236ca5 | /bin/sh /home/opc/ruby/src/master/tool/ifchange /home/opc/ruby/src/master/.bundle/.timestamp/typeprof.revision - I, [2024-05-21T00:40:05.732309 #3531013] INFO -- : /home/opc/ruby/src/master/.bundle/.timestamp/rbs.revision unchanged I, [2024-05-21T00:40:05.733201 #3531013] INFO -- : /home/opc/ruby/src/master/.bundle/.timestamp/power_assert.revision unchanged I, [2024-05-21T00:40:05.734928 #3531013] INFO -- : /home/opc/ruby/src/master/.bundle/.timestamp/typeprof.revision unchanged I, [2024-05-21T00:40:05.826509 #3531013] INFO -- : Building power_assert@84e85124c5014a139af39161d484156cfe87a9ed to /home/opc/ruby/src/master/gems/power_assert-2.0.3.gem I, [2024-05-21T00:40:05.938720 #3531013] INFO -- : Successfully built RubyGem I, [2024-05-21T00:40:05.938777 #3531013] INFO -- : Name: power_assert I, [2024-05-21T00:40:05.938788 #3531013] INFO -- : Version: 2.0.4dev I, [2024-05-21T00:40:05.938797 #3531013] INFO -- : File: power_assert-2.0.4dev.gem I, [2024-05-21T00:40:06.018241 #3531013] INFO -- : $$$[end] "make update-download -j3" exit with 0. I, [2024-05-21T00:40:06.018307 #3531013] INFO -- : $$$[beg] make update-rubyspec -j3 I, [2024-05-21T00:40:06.106650 #3531013] INFO -- : make: Nothing to be done for 'update-rubyspec'. I, [2024-05-21T00:40:06.106788 #3531013] INFO -- : $$$[end] "make update-rubyspec -j3" exit with 0. I, [2024-05-21T00:40:06.106834 #3531013] INFO -- : $$$[beg] make update-src -j3 I, [2024-05-21T00:40:07.064125 #3531013] INFO -- : Already up to date. I, [2024-05-21T00:40:07.078632 #3531013] INFO -- : Latest commit hash = 86cf074fa1 I, [2024-05-21T00:40:07.079189 #3531013] INFO -- : $$$[end] "make update-src -j3" exit with 0. I, [2024-05-21T00:40:07.079220 #3531013] INFO -- : $$$[beg] make after-update -j3 I, [2024-05-21T00:40:07.182568 #3531013] INFO -- : generating /home/opc/ruby/src/master/ext/ripper/eventids2table.c I, [2024-05-21T00:40:07.189311 #3531013] INFO -- : make[1]: Entering directory '/home/opc/ruby/src/master/ext/ripper' I, [2024-05-21T00:40:07.189393 #3531013] INFO -- : make[1]: Nothing to be done for 'src'. I, [2024-05-21T00:40:07.189431 #3531013] INFO -- : make[1]: Leaving directory '/home/opc/ruby/src/master/ext/ripper' I, [2024-05-21T00:40:07.216158 #3531013] INFO -- : /home/opc/ruby/src/master/revision.h updated I, [2024-05-21T00:40:07.217287 #3531013] INFO -- : generating aarch64-linux-fake.rb I, [2024-05-21T00:40:07.274723 #3531013] INFO -- : aarch64-linux-fake.rb updated I, [2024-05-21T00:40:07.276142 #3531013] INFO -- : generating enc.mk I, [2024-05-21T00:40:07.513160 #3531013] INFO -- : making srcs under enc I, [2024-05-21T00:40:07.555678 #3531013] INFO -- : make[1]: Entering directory '/home/opc/ruby/build/master' I, [2024-05-21T00:40:07.555750 #3531013] INFO -- : make[1]: Nothing to be done for 'srcs'. I, [2024-05-21T00:40:07.555771 #3531013] INFO -- : make[1]: Leaving directory '/home/opc/ruby/build/master' I, [2024-05-21T00:40:07.636467 #3531013] INFO -- : Update power_assert to 84e85124c5014a139af39161d484156cfe87a9ed I, [2024-05-21T00:40:07.636564 #3531013] INFO -- : Update rbs to ba7872795d5de04adb8ff500c0e6afdc81a041dd I, [2024-05-21T00:40:07.637558 #3531013] INFO -- : Update typeprof to b19a6416da3a05d57fadd6ffdadb382b6d236ca5 I, [2024-05-21T00:40:07.640347 #3531013] INFO -- : echo 84e85124c5014a139af39161d484156cfe87a9ed | /bin/sh /home/opc/ruby/src/master/tool/ifchange /home/opc/ruby/src/master/.bundle/.timestamp/power_assert.revision - I, [2024-05-21T00:40:07.640611 #3531013] INFO -- : echo ba7872795d5de04adb8ff500c0e6afdc81a041dd | /bin/sh /home/opc/ruby/src/master/tool/ifchange /home/opc/ruby/src/master/.bundle/.timestamp/rbs.revision - I, [2024-05-21T00:40:07.641186 #3531013] INFO -- : echo b19a6416da3a05d57fadd6ffdadb382b6d236ca5 | /bin/sh /home/opc/ruby/src/master/tool/ifchange /home/opc/ruby/src/master/.bundle/.timestamp/typeprof.revision - I, [2024-05-21T00:40:07.645932 #3531013] INFO -- : /home/opc/ruby/src/master/.bundle/.timestamp/power_assert.revision unchanged I, [2024-05-21T00:40:07.645983 #3531013] INFO -- : /home/opc/ruby/src/master/.bundle/.timestamp/rbs.revision unchanged I, [2024-05-21T00:40:07.646861 #3531013] INFO -- : /home/opc/ruby/src/master/.bundle/.timestamp/typeprof.revision unchanged I, [2024-05-21T00:40:07.737425 #3531013] INFO -- : Building power_assert@84e85124c5014a139af39161d484156cfe87a9ed to /home/opc/ruby/src/master/gems/power_assert-2.0.3.gem I, [2024-05-21T00:40:07.847143 #3531013] INFO -- : Successfully built RubyGem I, [2024-05-21T00:40:07.847200 #3531013] INFO -- : Name: power_assert I, [2024-05-21T00:40:07.847210 #3531013] INFO -- : Version: 2.0.4dev I, [2024-05-21T00:40:07.847219 #3531013] INFO -- : File: power_assert-2.0.4dev.gem I, [2024-05-21T00:40:07.849503 #3531013] INFO -- : Extracting bundle gem power_assert-2.0.3... I, [2024-05-21T00:40:07.949607 #3531013] INFO -- : Try with hash version of bundled gems instead of gems/power_assert-2.0.3.gem. We don't use this gem with release version of Ruby. I, [2024-05-21T00:40:07.960905 #3531013] INFO -- : Unpacked gems/power_assert-2.0.4dev.gem I, [2024-05-21T00:40:07.962763 #3531013] INFO -- : $$$[end] "make after-update -j3" exit with 0. I, [2024-05-21T00:40:07.962915 #3531013] INFO -- : $$$[beg] make miniruby -j3 I, [2024-05-21T00:40:08.051367 #3531013] INFO -- : BASERUBY = /usr/local/bin/ruby --disable=gems I, [2024-05-21T00:40:08.051431 #3531013] INFO -- : CC = gcc I, [2024-05-21T00:40:08.051442 #3531013] INFO -- : LD = ld I, [2024-05-21T00:40:08.051454 #3531013] INFO -- : LDSHARED = gcc -shared I, [2024-05-21T00:40:08.051463 #3531013] INFO -- : CFLAGS = -O3 -fno-fast-math -ggdb3 -Wall -Wextra -Wdeprecated-declarations -Wdiv-by-zero -Wduplicated-cond -Wimplicit-function-declaration -Wimplicit-int -Wpointer-arith -Wwrite-strings -Wold-style-definition -Wimplicit-fallthrough=0 -Wmissing-noreturn -Wno-cast-function-type -Wno-constant-logical-operand -Wno-long-long -Wno-missing-field-initializers -Wno-overlength-strings -Wno-packed-bitfield-compat -Wno-parentheses-equality -Wno-self-assign -Wno-tautological-compare -Wno-unused-parameter -Wno-unused-value -Wsuggest-attribute=format -Wsuggest-attribute=noreturn -Wunused-variable -Wmisleading-indentation -Wundef I, [2024-05-21T00:40:08.051472 #3531013] INFO -- : XCFLAGS = -U_FORTIFY_SOURCE -D_FORTIFY_SOURCE=2 -fstack-protector-strong -msign-return-address=all -fno-strict-overflow -fvisibility=hidden -fexcess-precision=standard -DRUBY_EXPORT -fPIE -I. -I.ext/include/aarch64-linux -I/home/opc/ruby/src/master/include -I/home/opc/ruby/src/master -I/home/opc/ruby/src/master/prism -I/home/opc/ruby/src/master/enc/unicode/15.0.0 I, [2024-05-21T00:40:08.051481 #3531013] INFO -- : CPPFLAGS = I, [2024-05-21T00:40:08.051489 #3531013] INFO -- : DLDFLAGS = -Wl,--compress-debug-sections=zlib -fstack-protector-strong -pie I, [2024-05-21T00:40:08.051498 #3531013] INFO -- : SOLIBS = -lz -lrt -lrt -ldl -lcrypt -lm -lpthread I, [2024-05-21T00:40:08.051506 #3531013] INFO -- : LANG = en_US.UTF-8 I, [2024-05-21T00:40:08.051513 #3531013] INFO -- : LC_ALL = I, [2024-05-21T00:40:08.051521 #3531013] INFO -- : LC_CTYPE = I, [2024-05-21T00:40:08.051529 #3531013] INFO -- : MFLAGS = -j3 --jobserver-auth=4,5 I, [2024-05-21T00:40:08.051557 #3531013] INFO -- : RUSTC = rustc I, [2024-05-21T00:40:08.051567 #3531013] INFO -- : YJIT_RUSTC_ARGS = --crate-name=yjit --crate-type=staticlib --edition=2021 -g -C lto=thin -C opt-level=3 -C overflow-checks=on '--out-dir=/home/opc/ruby/build/master/yjit/target/release/' /home/opc/ruby/src/master/yjit/src/lib.rs I, [2024-05-21T00:40:08.052276 #3531013] INFO -- : gcc (GCC) 8.5.0 20210514 (Red Hat 8.5.0-10.1.0.1) I, [2024-05-21T00:40:08.052312 #3531013] INFO -- : Copyright (C) 2018 Free Software Foundation, Inc. I, [2024-05-21T00:40:08.052325 #3531013] INFO -- : This is free software; see the source for copying conditions. There is NO I, [2024-05-21T00:40:08.052335 #3531013] INFO -- : warranty; not even for MERCHANTABILITY or FITNESS FOR A PARTICULAR PURPOSE. I, [2024-05-21T00:40:08.052344 #3531013] INFO -- : I, [2024-05-21T00:40:08.077767 #3531013] INFO -- : compiling /home/opc/ruby/src/master/version.c I, [2024-05-21T00:40:08.218253 #3531013] INFO -- : linking miniruby I, [2024-05-21T00:40:09.113990 #3531013] INFO -- : $$$[end] "make miniruby -j3" exit with 0. I, [2024-05-21T00:40:09.114153 #3531013] INFO -- : $$$[beg] make ruby -j3 I, [2024-05-21T00:40:09.201613 #3531013] INFO -- : BASERUBY = /usr/local/bin/ruby --disable=gems I, [2024-05-21T00:40:09.201677 #3531013] INFO -- : CC = gcc I, [2024-05-21T00:40:09.201689 #3531013] INFO -- : LD = ld I, [2024-05-21T00:40:09.201700 #3531013] INFO -- : LDSHARED = gcc -shared I, [2024-05-21T00:40:09.201709 #3531013] INFO -- : CFLAGS = -O3 -fno-fast-math -ggdb3 -Wall -Wextra -Wdeprecated-declarations -Wdiv-by-zero -Wduplicated-cond -Wimplicit-function-declaration -Wimplicit-int -Wpointer-arith -Wwrite-strings -Wold-style-definition -Wimplicit-fallthrough=0 -Wmissing-noreturn -Wno-cast-function-type -Wno-constant-logical-operand -Wno-long-long -Wno-missing-field-initializers -Wno-overlength-strings -Wno-packed-bitfield-compat -Wno-parentheses-equality -Wno-self-assign -Wno-tautological-compare -Wno-unused-parameter -Wno-unused-value -Wsuggest-attribute=format -Wsuggest-attribute=noreturn -Wunused-variable -Wmisleading-indentation -Wundef I, [2024-05-21T00:40:09.201719 #3531013] INFO -- : XCFLAGS = -U_FORTIFY_SOURCE -D_FORTIFY_SOURCE=2 -fstack-protector-strong -msign-return-address=all -fno-strict-overflow -fvisibility=hidden -fexcess-precision=standard -DRUBY_EXPORT -fPIE -I. -I.ext/include/aarch64-linux -I/home/opc/ruby/src/master/include -I/home/opc/ruby/src/master -I/home/opc/ruby/src/master/prism -I/home/opc/ruby/src/master/enc/unicode/15.0.0 I, [2024-05-21T00:40:09.201728 #3531013] INFO -- : CPPFLAGS = I, [2024-05-21T00:40:09.201736 #3531013] INFO -- : DLDFLAGS = -Wl,--compress-debug-sections=zlib -fstack-protector-strong -pie I, [2024-05-21T00:40:09.201745 #3531013] INFO -- : SOLIBS = -lz -lrt -lrt -ldl -lcrypt -lm -lpthread I, [2024-05-21T00:40:09.201753 #3531013] INFO -- : LANG = en_US.UTF-8 I, [2024-05-21T00:40:09.201761 #3531013] INFO -- : LC_ALL = I, [2024-05-21T00:40:09.201769 #3531013] INFO -- : LC_CTYPE = I, [2024-05-21T00:40:09.201777 #3531013] INFO -- : MFLAGS = -j3 --jobserver-auth=4,5 I, [2024-05-21T00:40:09.201785 #3531013] INFO -- : RUSTC = rustc I, [2024-05-21T00:40:09.201793 #3531013] INFO -- : YJIT_RUSTC_ARGS = --crate-name=yjit --crate-type=staticlib --edition=2021 -g -C lto=thin -C opt-level=3 -C overflow-checks=on '--out-dir=/home/opc/ruby/build/master/yjit/target/release/' /home/opc/ruby/src/master/yjit/src/lib.rs I, [2024-05-21T00:40:09.202456 #3531013] INFO -- : gcc (GCC) 8.5.0 20210514 (Red Hat 8.5.0-10.1.0.1) I, [2024-05-21T00:40:09.202472 #3531013] INFO -- : Copyright (C) 2018 Free Software Foundation, Inc. I, [2024-05-21T00:40:09.202482 #3531013] INFO -- : This is free software; see the source for copying conditions. There is NO I, [2024-05-21T00:40:09.202490 #3531013] INFO -- : warranty; not even for MERCHANTABILITY or FITNESS FOR A PARTICULAR PURPOSE. I, [2024-05-21T00:40:09.202498 #3531013] INFO -- : I, [2024-05-21T00:40:09.382067 #3531013] INFO -- : builtin_binary.inc updated I, [2024-05-21T00:40:09.385457 #3531013] INFO -- : c5234a9416e4f20f175185e840b25b0f08674d14078ed7083f37e655458e3ca9 builtin_binary.inc I, [2024-05-21T00:40:09.386472 #3531013] INFO -- : compiling /home/opc/ruby/src/master/builtin.c I, [2024-05-21T00:40:09.708307 #3531013] INFO -- : linking static-library libruby-static.a I, [2024-05-21T00:40:12.371577 #3531013] INFO -- : linking ruby I, [2024-05-21T00:40:13.279166 #3531013] INFO -- : $$$[end] "make ruby -j3" exit with 0. I, [2024-05-21T00:40:13.279336 #3531013] INFO -- : $$$[beg] make all -j3 I, [2024-05-21T00:40:13.367208 #3531013] INFO -- : BASERUBY = /usr/local/bin/ruby --disable=gems I, [2024-05-21T00:40:13.367281 #3531013] INFO -- : CC = gcc I, [2024-05-21T00:40:13.367295 #3531013] INFO -- : LD = ld I, [2024-05-21T00:40:13.367304 #3531013] INFO -- : LDSHARED = gcc -shared I, [2024-05-21T00:40:13.367316 #3531013] INFO -- : CFLAGS = -O3 -fno-fast-math -ggdb3 -Wall -Wextra -Wdeprecated-declarations -Wdiv-by-zero -Wduplicated-cond -Wimplicit-function-declaration -Wimplicit-int -Wpointer-arith -Wwrite-strings -Wold-style-definition -Wimplicit-fallthrough=0 -Wmissing-noreturn -Wno-cast-function-type -Wno-constant-logical-operand -Wno-long-long -Wno-missing-field-initializers -Wno-overlength-strings -Wno-packed-bitfield-compat -Wno-parentheses-equality -Wno-self-assign -Wno-tautological-compare -Wno-unused-parameter -Wno-unused-value -Wsuggest-attribute=format -Wsuggest-attribute=noreturn -Wunused-variable -Wmisleading-indentation -Wundef I, [2024-05-21T00:40:13.367325 #3531013] INFO -- : XCFLAGS = -U_FORTIFY_SOURCE -D_FORTIFY_SOURCE=2 -fstack-protector-strong -msign-return-address=all -fno-strict-overflow -fvisibility=hidden -fexcess-precision=standard -DRUBY_EXPORT -fPIE -I. -I.ext/include/aarch64-linux -I/home/opc/ruby/src/master/include -I/home/opc/ruby/src/master -I/home/opc/ruby/src/master/prism -I/home/opc/ruby/src/master/enc/unicode/15.0.0 I, [2024-05-21T00:40:13.367334 #3531013] INFO -- : CPPFLAGS = I, [2024-05-21T00:40:13.367342 #3531013] INFO -- : DLDFLAGS = -Wl,--compress-debug-sections=zlib -fstack-protector-strong -pie I, [2024-05-21T00:40:13.367351 #3531013] INFO -- : SOLIBS = -lz -lrt -lrt -ldl -lcrypt -lm -lpthread I, [2024-05-21T00:40:13.367359 #3531013] INFO -- : LANG = en_US.UTF-8 I, [2024-05-21T00:40:13.367367 #3531013] INFO -- : LC_ALL = I, [2024-05-21T00:40:13.367375 #3531013] INFO -- : LC_CTYPE = I, [2024-05-21T00:40:13.367383 #3531013] INFO -- : MFLAGS = -j3 --jobserver-auth=4,5 I, [2024-05-21T00:40:13.367391 #3531013] INFO -- : RUSTC = rustc I, [2024-05-21T00:40:13.367399 #3531013] INFO -- : YJIT_RUSTC_ARGS = --crate-name=yjit --crate-type=staticlib --edition=2021 -g -C lto=thin -C opt-level=3 -C overflow-checks=on '--out-dir=/home/opc/ruby/build/master/yjit/target/release/' /home/opc/ruby/src/master/yjit/src/lib.rs I, [2024-05-21T00:40:13.368137 #3531013] INFO -- : gcc (GCC) 8.5.0 20210514 (Red Hat 8.5.0-10.1.0.1) I, [2024-05-21T00:40:13.368173 #3531013] INFO -- : Copyright (C) 2018 Free Software Foundation, Inc. I, [2024-05-21T00:40:13.368184 #3531013] INFO -- : This is free software; see the source for copying conditions. There is NO I, [2024-05-21T00:40:13.368193 #3531013] INFO -- : warranty; not even for MERCHANTABILITY or FITNESS FOR A PARTICULAR PURPOSE. I, [2024-05-21T00:40:13.368202 #3531013] INFO -- : I, [2024-05-21T00:40:13.400712 #3531013] INFO -- : generating encdb.h I, [2024-05-21T00:40:13.402073 #3531013] INFO -- : generating enc.mk I, [2024-05-21T00:40:13.438958 #3531013] INFO -- : encdb.h unchanged I, [2024-05-21T00:40:13.637587 #3531013] INFO -- : making srcs under enc I, [2024-05-21T00:40:13.637651 #3531013] INFO -- : making enc I, [2024-05-21T00:40:13.665291 #3531013] INFO -- : make[1]: Entering directory '/home/opc/ruby/build/master' I, [2024-05-21T00:40:13.665361 #3531013] INFO -- : make[1]: Nothing to be done for 'enc'. I, [2024-05-21T00:40:13.665372 #3531013] INFO -- : make[1]: Leaving directory '/home/opc/ruby/build/master' I, [2024-05-21T00:40:13.679916 #3531013] INFO -- : make[1]: Entering directory '/home/opc/ruby/build/master' I, [2024-05-21T00:40:13.679983 #3531013] INFO -- : make[1]: Nothing to be done for 'srcs'. I, [2024-05-21T00:40:13.679994 #3531013] INFO -- : make[1]: Leaving directory '/home/opc/ruby/build/master' I, [2024-05-21T00:40:13.680769 #3531013] INFO -- : generating transdb.h I, [2024-05-21T00:40:13.822937 #3531013] INFO -- : transdb.h unchanged I, [2024-05-21T00:40:13.824238 #3531013] INFO -- : generating makefiles ext/configure-ext.mk I, [2024-05-21T00:40:13.824392 #3531013] INFO -- : making trans I, [2024-05-21T00:40:13.864625 #3531013] INFO -- : ext/configure-ext.mk updated I, [2024-05-21T00:40:13.868014 #3531013] INFO -- : make[1]: Entering directory '/home/opc/ruby/build/master' I, [2024-05-21T00:40:13.872818 #3531013] INFO -- : make[1]: Entering directory '/home/opc/ruby/build/master' I, [2024-05-21T00:40:13.872858 #3531013] INFO -- : make[1]: Nothing to be done for 'trans'. I, [2024-05-21T00:40:13.872871 #3531013] INFO -- : make[1]: Leaving directory '/home/opc/ruby/build/master' I, [2024-05-21T00:40:14.292593 #3531013] INFO -- : making encs I, [2024-05-21T00:40:14.346083 #3531013] INFO -- : make[1]: Entering directory '/home/opc/ruby/build/master' I, [2024-05-21T00:40:14.346172 #3531013] INFO -- : make[1]: Nothing to be done for 'encs'. I, [2024-05-21T00:40:14.346208 #3531013] INFO -- : make[1]: Leaving directory '/home/opc/ruby/build/master' I, [2024-05-21T00:40:14.652603 #3531013] INFO -- : make[1]: Leaving directory '/home/opc/ruby/build/master' I, [2024-05-21T00:40:14.653363 #3531013] INFO -- : generating makefile exts.mk I, [2024-05-21T00:40:14.715971 #3531013] INFO -- : exts.mk unchanged I, [2024-05-21T00:40:14.721218 #3531013] INFO -- : make[1]: Entering directory '/home/opc/ruby/build/master' I, [2024-05-21T00:40:14.831864 #3531013] INFO -- : make[2]: Entering directory '/home/opc/ruby/build/master/ext/digest' I, [2024-05-21T00:40:14.832806 #3531013] INFO -- : make[2]: Entering directory '/home/opc/ruby/build/master/ext/coverage' I, [2024-05-21T00:40:14.834527 #3531013] INFO -- : make[2]: Entering directory '/home/opc/ruby/build/master/ext/date' I, [2024-05-21T00:40:14.837430 #3531013] INFO -- : make[2]: Leaving directory '/home/opc/ruby/build/master/ext/coverage' I, [2024-05-21T00:40:14.840271 #3531013] INFO -- : make[2]: Leaving directory '/home/opc/ruby/build/master/ext/date' I, [2024-05-21T00:40:14.840819 #3531013] INFO -- : make[2]: Leaving directory '/home/opc/ruby/build/master/ext/digest' I, [2024-05-21T00:40:14.847998 #3531013] INFO -- : make[2]: Entering directory '/home/opc/ruby/build/master/ext/fiddle' I, [2024-05-21T00:40:14.850332 #3531013] INFO -- : make[2]: Entering directory '/home/opc/ruby/build/master/ext/io/console' I, [2024-05-21T00:40:14.856438 #3531013] INFO -- : make[2]: Leaving directory '/home/opc/ruby/build/master/ext/fiddle' I, [2024-05-21T00:40:14.857789 #3531013] INFO -- : make[2]: Leaving directory '/home/opc/ruby/build/master/ext/io/console' I, [2024-05-21T00:40:14.857965 #3531013] INFO -- : make[2]: Entering directory '/home/opc/ruby/build/master/ext/json' I, [2024-05-21T00:40:14.860510 #3531013] INFO -- : make[2]: Entering directory '/home/opc/ruby/build/master/ext/monitor' I, [2024-05-21T00:40:14.863987 #3531013] INFO -- : make[2]: Entering directory '/home/opc/ruby/build/master/ext/objspace' I, [2024-05-21T00:40:14.866169 #3531013] INFO -- : make[2]: Leaving directory '/home/opc/ruby/build/master/ext/monitor' I, [2024-05-21T00:40:14.868086 #3531013] INFO -- : make[2]: Leaving directory '/home/opc/ruby/build/master/ext/json' I, [2024-05-21T00:40:14.870389 #3531013] INFO -- : make[2]: Leaving directory '/home/opc/ruby/build/master/ext/objspace' I, [2024-05-21T00:40:14.874424 #3531013] INFO -- : make[2]: Entering directory '/home/opc/ruby/build/master/ext/pathname' I, [2024-05-21T00:40:14.876861 #3531013] INFO -- : make[2]: Entering directory '/home/opc/ruby/build/master/ext/psych' I, [2024-05-21T00:40:14.879167 #3531013] INFO -- : make[2]: Leaving directory '/home/opc/ruby/build/master/ext/pathname' I, [2024-05-21T00:40:14.883643 #3531013] INFO -- : make[2]: Entering directory '/home/opc/ruby/build/master/ext/pty' I, [2024-05-21T00:40:14.886588 #3531013] INFO -- : make[2]: Entering directory '/home/opc/ruby/build/master/ext/openssl' I, [2024-05-21T00:40:14.889266 #3531013] INFO -- : make[2]: Leaving directory '/home/opc/ruby/build/master/ext/pty' I, [2024-05-21T00:40:14.897925 #3531013] INFO -- : make[2]: Leaving directory '/home/opc/ruby/build/master/ext/psych' I, [2024-05-21T00:40:14.899719 #3531013] INFO -- : make[2]: Entering directory '/home/opc/ruby/build/master/ext/rubyvm' I, [2024-05-21T00:40:14.903472 #3531013] INFO -- : make[2]: Entering directory '/home/opc/ruby/build/master/ext/ripper' I, [2024-05-21T00:40:14.904916 #3531013] INFO -- : make[2]: Leaving directory '/home/opc/ruby/build/master/ext/rubyvm' I, [2024-05-21T00:40:14.909016 #3531013] INFO -- : make[2]: Leaving directory '/home/opc/ruby/build/master/ext/openssl' I, [2024-05-21T00:40:14.911987 #3531013] INFO -- : make[2]: Leaving directory '/home/opc/ruby/build/master/ext/ripper' I, [2024-05-21T00:40:14.917656 #3531013] INFO -- : make[2]: Entering directory '/home/opc/ruby/build/master/ext/socket' I, [2024-05-21T00:40:14.918984 #3531013] INFO -- : make[2]: Entering directory '/home/opc/ruby/build/master/.bundle/gems/bigdecimal-3.1.7/ext/bigdecimal' I, [2024-05-21T00:40:14.922326 #3531013] INFO -- : make[2]: Entering directory '/home/opc/ruby/build/master/.bundle/gems/bigdecimal-3.1.8/ext/bigdecimal' I, [2024-05-21T00:40:14.932187 #3531013] INFO -- : make[2]: Leaving directory '/home/opc/ruby/build/master/ext/socket' I, [2024-05-21T00:40:14.935736 #3531013] INFO -- : make[2]: Entering directory '/home/opc/ruby/build/master/.bundle/gems/debug-1.9.2/ext/debug' I, [2024-05-21T00:40:14.951774 #3531013] INFO -- : make[2]: Leaving directory '/home/opc/ruby/build/master/.bundle/gems/bigdecimal-3.1.7/ext/bigdecimal' I, [2024-05-21T00:40:14.958034 #3531013] INFO -- : make[2]: Leaving directory '/home/opc/ruby/build/master/.bundle/gems/bigdecimal-3.1.8/ext/bigdecimal' I, [2024-05-21T00:40:14.958561 #3531013] INFO -- : make[2]: Entering directory '/home/opc/ruby/build/master/.bundle/gems/nkf-0.2.0/ext/nkf' I, [2024-05-21T00:40:14.960552 #3531013] INFO -- : make[2]: Entering directory '/home/opc/ruby/build/master/.bundle/gems/racc-1.7.3/ext/racc/cparse' I, [2024-05-21T00:40:14.969410 #3531013] INFO -- : make[2]: Leaving directory '/home/opc/ruby/build/master/.bundle/gems/debug-1.9.2/ext/debug' I, [2024-05-21T00:40:14.972258 #3531013] INFO -- : make[2]: Entering directory '/home/opc/ruby/build/master/.bundle/gems/racc-1.8.0/ext/racc/cparse' I, [2024-05-21T00:40:14.992980 #3531013] INFO -- : make[2]: Leaving directory '/home/opc/ruby/build/master/.bundle/gems/racc-1.7.3/ext/racc/cparse' I, [2024-05-21T00:40:14.993445 #3531013] INFO -- : make[2]: Leaving directory '/home/opc/ruby/build/master/.bundle/gems/nkf-0.2.0/ext/nkf' I, [2024-05-21T00:40:14.996102 #3531013] INFO -- : make[2]: Entering directory '/home/opc/ruby/build/master/.bundle/gems/syslog-0.1.2/ext/syslog' I, [2024-05-21T00:40:14.996241 #3531013] INFO -- : make[2]: Entering directory '/home/opc/ruby/build/master/.bundle/gems/rbs-3.4.4/ext/rbs_extension' I, [2024-05-21T00:40:15.004789 #3531013] INFO -- : make[2]: Leaving directory '/home/opc/ruby/build/master/.bundle/gems/racc-1.8.0/ext/racc/cparse' I, [2024-05-21T00:40:15.028361 #3531013] INFO -- : make[2]: Entering directory '/home/opc/ruby/build/master/ext/digest/sha2' I, [2024-05-21T00:40:15.028665 #3531013] INFO -- : make[2]: Leaving directory '/home/opc/ruby/build/master/.bundle/gems/rbs-3.4.4/ext/rbs_extension' I, [2024-05-21T00:40:15.033151 #3531013] INFO -- : make[2]: Leaving directory '/home/opc/ruby/build/master/ext/digest/sha2' I, [2024-05-21T00:40:15.035157 #3531013] INFO -- : make[2]: Leaving directory '/home/opc/ruby/build/master/.bundle/gems/syslog-0.1.2/ext/syslog' I, [2024-05-21T00:40:15.076667 #3531013] INFO -- : make[2]: Entering directory '/home/opc/ruby/build/master' I, [2024-05-21T00:40:15.165825 #3531013] INFO -- : make[2]: 'ruby' is up to date. I, [2024-05-21T00:40:15.165907 #3531013] INFO -- : make[2]: Leaving directory '/home/opc/ruby/build/master' I, [2024-05-21T00:40:15.166057 #3531013] INFO -- : make[1]: Leaving directory '/home/opc/ruby/build/master' I, [2024-05-21T00:40:15.170778 #3531013] INFO -- : make[1]: Entering directory '/home/opc/ruby/build/master' I, [2024-05-21T00:40:15.170853 #3531013] INFO -- : make[1]: Nothing to be done for 'note'. I, [2024-05-21T00:40:15.170869 #3531013] INFO -- : make[1]: Leaving directory '/home/opc/ruby/build/master' I, [2024-05-21T00:40:15.171131 #3531013] INFO -- : $$$[end] "make all -j3" exit with 0. I, [2024-05-21T00:40:15.171295 #3531013] INFO -- : $$$[beg] make install -j3 I, [2024-05-21T00:40:15.267942 #3531013] INFO -- : Update power_assert to 84e85124c5014a139af39161d484156cfe87a9ed I, [2024-05-21T00:40:15.268088 #3531013] INFO -- : Update rbs to ba7872795d5de04adb8ff500c0e6afdc81a041dd I, [2024-05-21T00:40:15.268535 #3531013] INFO -- : Update typeprof to b19a6416da3a05d57fadd6ffdadb382b6d236ca5 I, [2024-05-21T00:40:15.272341 #3531013] INFO -- : echo 84e85124c5014a139af39161d484156cfe87a9ed | /bin/sh /home/opc/ruby/src/master/tool/ifchange /home/opc/ruby/src/master/.bundle/.timestamp/power_assert.revision - I, [2024-05-21T00:40:15.272549 #3531013] INFO -- : echo ba7872795d5de04adb8ff500c0e6afdc81a041dd | /bin/sh /home/opc/ruby/src/master/tool/ifchange /home/opc/ruby/src/master/.bundle/.timestamp/rbs.revision - I, [2024-05-21T00:40:15.272749 #3531013] INFO -- : echo b19a6416da3a05d57fadd6ffdadb382b6d236ca5 | /bin/sh /home/opc/ruby/src/master/tool/ifchange /home/opc/ruby/src/master/.bundle/.timestamp/typeprof.revision - I, [2024-05-21T00:40:15.279354 #3531013] INFO -- : /home/opc/ruby/src/master/.bundle/.timestamp/typeprof.revision unchanged I, [2024-05-21T00:40:15.279426 #3531013] INFO -- : /home/opc/ruby/src/master/.bundle/.timestamp/power_assert.revision unchanged I, [2024-05-21T00:40:15.280028 #3531013] INFO -- : /home/opc/ruby/src/master/.bundle/.timestamp/rbs.revision unchanged I, [2024-05-21T00:40:15.283615 #3531013] INFO -- : BASERUBY = /usr/local/bin/ruby --disable=gems I, [2024-05-21T00:40:15.283670 #3531013] INFO -- : CC = gcc I, [2024-05-21T00:40:15.283681 #3531013] INFO -- : LD = ld I, [2024-05-21T00:40:15.283690 #3531013] INFO -- : LDSHARED = gcc -shared I, [2024-05-21T00:40:15.283699 #3531013] INFO -- : CFLAGS = -O3 -fno-fast-math -ggdb3 -Wall -Wextra -Wdeprecated-declarations -Wdiv-by-zero -Wduplicated-cond -Wimplicit-function-declaration -Wimplicit-int -Wpointer-arith -Wwrite-strings -Wold-style-definition -Wimplicit-fallthrough=0 -Wmissing-noreturn -Wno-cast-function-type -Wno-constant-logical-operand -Wno-long-long -Wno-missing-field-initializers -Wno-overlength-strings -Wno-packed-bitfield-compat -Wno-parentheses-equality -Wno-self-assign -Wno-tautological-compare -Wno-unused-parameter -Wno-unused-value -Wsuggest-attribute=format -Wsuggest-attribute=noreturn -Wunused-variable -Wmisleading-indentation -Wundef I, [2024-05-21T00:40:15.283708 #3531013] INFO -- : XCFLAGS = -U_FORTIFY_SOURCE -D_FORTIFY_SOURCE=2 -fstack-protector-strong -msign-return-address=all -fno-strict-overflow -fvisibility=hidden -fexcess-precision=standard -DRUBY_EXPORT -fPIE -I. -I.ext/include/aarch64-linux -I/home/opc/ruby/src/master/include -I/home/opc/ruby/src/master -I/home/opc/ruby/src/master/prism -I/home/opc/ruby/src/master/enc/unicode/15.0.0 I, [2024-05-21T00:40:15.283716 #3531013] INFO -- : CPPFLAGS = I, [2024-05-21T00:40:15.283724 #3531013] INFO -- : DLDFLAGS = -Wl,--compress-debug-sections=zlib -fstack-protector-strong -pie I, [2024-05-21T00:40:15.283751 #3531013] INFO -- : SOLIBS = -lz -lrt -lrt -ldl -lcrypt -lm -lpthread I, [2024-05-21T00:40:15.283760 #3531013] INFO -- : LANG = en_US.UTF-8 I, [2024-05-21T00:40:15.283768 #3531013] INFO -- : LC_ALL = I, [2024-05-21T00:40:15.283775 #3531013] INFO -- : LC_CTYPE = I, [2024-05-21T00:40:15.283783 #3531013] INFO -- : MFLAGS = -j3 --jobserver-auth=4,5 I, [2024-05-21T00:40:15.283791 #3531013] INFO -- : RUSTC = rustc I, [2024-05-21T00:40:15.283799 #3531013] INFO -- : YJIT_RUSTC_ARGS = --crate-name=yjit --crate-type=staticlib --edition=2021 -g -C lto=thin -C opt-level=3 -C overflow-checks=on '--out-dir=/home/opc/ruby/build/master/yjit/target/release/' /home/opc/ruby/src/master/yjit/src/lib.rs I, [2024-05-21T00:40:15.316230 #3531013] INFO -- : generating encdb.h I, [2024-05-21T00:40:15.316448 #3531013] INFO -- : gcc (GCC) 8.5.0 20210514 (Red Hat 8.5.0-10.1.0.1) I, [2024-05-21T00:40:15.316475 #3531013] INFO -- : Copyright (C) 2018 Free Software Foundation, Inc. I, [2024-05-21T00:40:15.316500 #3531013] INFO -- : This is free software; see the source for copying conditions. There is NO I, [2024-05-21T00:40:15.316515 #3531013] INFO -- : warranty; not even for MERCHANTABILITY or FITNESS FOR A PARTICULAR PURPOSE. I, [2024-05-21T00:40:15.316525 #3531013] INFO -- : I, [2024-05-21T00:40:15.317322 #3531013] INFO -- : generating enc.mk I, [2024-05-21T00:40:15.355500 #3531013] INFO -- : encdb.h unchanged I, [2024-05-21T00:40:15.453519 #3531013] INFO -- : Building power_assert@84e85124c5014a139af39161d484156cfe87a9ed to /home/opc/ruby/src/master/gems/power_assert-2.0.3.gem I, [2024-05-21T00:40:15.564876 #3531013] INFO -- : making srcs under enc I, [2024-05-21T00:40:15.565495 #3531013] INFO -- : making enc I, [2024-05-21T00:40:15.580624 #3531013] INFO -- : Successfully built RubyGem I, [2024-05-21T00:40:15.580690 #3531013] INFO -- : Name: power_assert I, [2024-05-21T00:40:15.580702 #3531013] INFO -- : Version: 2.0.4dev I, [2024-05-21T00:40:15.580710 #3531013] INFO -- : File: power_assert-2.0.4dev.gem I, [2024-05-21T00:40:15.583069 #3531013] INFO -- : Extracting bundle gem power_assert-2.0.3... I, [2024-05-21T00:40:15.593827 #3531013] INFO -- : make[1]: Entering directory '/home/opc/ruby/build/master' I, [2024-05-21T00:40:15.593914 #3531013] INFO -- : make[1]: Nothing to be done for 'enc'. I, [2024-05-21T00:40:15.593948 #3531013] INFO -- : make[1]: Leaving directory '/home/opc/ruby/build/master' I, [2024-05-21T00:40:15.607399 #3531013] INFO -- : make[1]: Entering directory '/home/opc/ruby/build/master' I, [2024-05-21T00:40:15.607460 #3531013] INFO -- : make[1]: Nothing to be done for 'srcs'. I, [2024-05-21T00:40:15.607472 #3531013] INFO -- : make[1]: Leaving directory '/home/opc/ruby/build/master' I, [2024-05-21T00:40:15.608418 #3531013] INFO -- : generating transdb.h I, [2024-05-21T00:40:15.683132 #3531013] INFO -- : Try with hash version of bundled gems instead of gems/power_assert-2.0.3.gem. We don't use this gem with release version of Ruby. I, [2024-05-21T00:40:15.693893 #3531013] INFO -- : Unpacked gems/power_assert-2.0.4dev.gem I, [2024-05-21T00:40:15.757953 #3531013] INFO -- : transdb.h unchanged I, [2024-05-21T00:40:15.759390 #3531013] INFO -- : generating makefiles ext/configure-ext.mk I, [2024-05-21T00:40:15.759552 #3531013] INFO -- : making trans I, [2024-05-21T00:40:15.800712 #3531013] INFO -- : ext/configure-ext.mk unchanged I, [2024-05-21T00:40:15.803848 #3531013] INFO -- : make[1]: Entering directory '/home/opc/ruby/build/master' I, [2024-05-21T00:40:15.808024 #3531013] INFO -- : make[1]: Entering directory '/home/opc/ruby/build/master' I, [2024-05-21T00:40:15.808081 #3531013] INFO -- : make[1]: Nothing to be done for 'trans'. I, [2024-05-21T00:40:15.808094 #3531013] INFO -- : make[1]: Leaving directory '/home/opc/ruby/build/master' I, [2024-05-21T00:40:16.233384 #3531013] INFO -- : making encs I, [2024-05-21T00:40:16.286332 #3531013] INFO -- : make[1]: Entering directory '/home/opc/ruby/build/master' I, [2024-05-21T00:40:16.286419 #3531013] INFO -- : make[1]: Nothing to be done for 'encs'. I, [2024-05-21T00:40:16.286453 #3531013] INFO -- : make[1]: Leaving directory '/home/opc/ruby/build/master' I, [2024-05-21T00:40:16.591219 #3531013] INFO -- : make[1]: Leaving directory '/home/opc/ruby/build/master' I, [2024-05-21T00:40:16.591938 #3531013] INFO -- : generating makefile exts.mk I, [2024-05-21T00:40:16.653369 #3531013] INFO -- : exts.mk unchanged I, [2024-05-21T00:40:16.658370 #3531013] INFO -- : make[1]: Entering directory '/home/opc/ruby/build/master' I, [2024-05-21T00:40:16.764983 #3531013] INFO -- : make[2]: Entering directory '/home/opc/ruby/build/master/ext/coverage' I, [2024-05-21T00:40:16.767682 #3531013] INFO -- : make[2]: Entering directory '/home/opc/ruby/build/master/ext/digest' I, [2024-05-21T00:40:16.767723 #3531013] INFO -- : make[2]: Entering directory '/home/opc/ruby/build/master/ext/date' I, [2024-05-21T00:40:16.771014 #3531013] INFO -- : make[2]: Leaving directory '/home/opc/ruby/build/master/ext/coverage' I, [2024-05-21T00:40:16.774237 #3531013] INFO -- : make[2]: Leaving directory '/home/opc/ruby/build/master/ext/date' I, [2024-05-21T00:40:16.777180 #3531013] INFO -- : make[2]: Leaving directory '/home/opc/ruby/build/master/ext/digest' I, [2024-05-21T00:40:16.783353 #3531013] INFO -- : make[2]: Entering directory '/home/opc/ruby/build/master/ext/io/console' I, [2024-05-21T00:40:16.784724 #3531013] INFO -- : make[2]: Entering directory '/home/opc/ruby/build/master/ext/fiddle' I, [2024-05-21T00:40:16.790637 #3531013] INFO -- : make[2]: Leaving directory '/home/opc/ruby/build/master/ext/io/console' I, [2024-05-21T00:40:16.792448 #3531013] INFO -- : make[2]: Entering directory '/home/opc/ruby/build/master/ext/json' I, [2024-05-21T00:40:16.796784 #3531013] INFO -- : make[2]: Entering directory '/home/opc/ruby/build/master/ext/monitor' I, [2024-05-21T00:40:16.796842 #3531013] INFO -- : make[2]: Leaving directory '/home/opc/ruby/build/master/ext/fiddle' I, [2024-05-21T00:40:16.801182 #3531013] INFO -- : make[2]: Leaving directory '/home/opc/ruby/build/master/ext/monitor' I, [2024-05-21T00:40:16.801412 #3531013] INFO -- : make[2]: Leaving directory '/home/opc/ruby/build/master/ext/json' I, [2024-05-21T00:40:16.804680 #3531013] INFO -- : make[2]: Entering directory '/home/opc/ruby/build/master/ext/objspace' I, [2024-05-21T00:40:16.805675 #3531013] INFO -- : make[2]: Entering directory '/home/opc/ruby/build/master/ext/pathname' I, [2024-05-21T00:40:16.812154 #3531013] INFO -- : make[2]: Leaving directory '/home/opc/ruby/build/master/ext/objspace' I, [2024-05-21T00:40:16.814425 #3531013] INFO -- : make[2]: Leaving directory '/home/opc/ruby/build/master/ext/pathname' I, [2024-05-21T00:40:16.818793 #3531013] INFO -- : make[2]: Entering directory '/home/opc/ruby/build/master/ext/pty' I, [2024-05-21T00:40:16.820265 #3531013] INFO -- : make[2]: Entering directory '/home/opc/ruby/build/master/ext/psych' I, [2024-05-21T00:40:16.820690 #3531013] INFO -- : make[2]: Entering directory '/home/opc/ruby/build/master/ext/openssl' I, [2024-05-21T00:40:16.824834 #3531013] INFO -- : make[2]: Leaving directory '/home/opc/ruby/build/master/ext/pty' I, [2024-05-21T00:40:16.838446 #3531013] INFO -- : make[2]: Entering directory '/home/opc/ruby/build/master/ext/ripper' I, [2024-05-21T00:40:16.841323 #3531013] INFO -- : make[2]: Leaving directory '/home/opc/ruby/build/master/ext/psych' I, [2024-05-21T00:40:16.843355 #3531013] INFO -- : make[2]: Entering directory '/home/opc/ruby/build/master/ext/rubyvm' I, [2024-05-21T00:40:16.846690 #3531013] INFO -- : make[2]: Leaving directory '/home/opc/ruby/build/master/ext/ripper' I, [2024-05-21T00:40:16.846725 #3531013] INFO -- : make[2]: Leaving directory '/home/opc/ruby/build/master/ext/openssl' I, [2024-05-21T00:40:16.846978 #3531013] INFO -- : make[2]: Leaving directory '/home/opc/ruby/build/master/ext/rubyvm' I, [2024-05-21T00:40:16.854015 #3531013] INFO -- : make[2]: Entering directory '/home/opc/ruby/build/master/.bundle/gems/bigdecimal-3.1.7/ext/bigdecimal' I, [2024-05-21T00:40:16.858854 #3531013] INFO -- : make[2]: Entering directory '/home/opc/ruby/build/master/ext/socket' I, [2024-05-21T00:40:16.860148 #3531013] INFO -- : make[2]: Entering directory '/home/opc/ruby/build/master/.bundle/gems/bigdecimal-3.1.8/ext/bigdecimal' I, [2024-05-21T00:40:16.870264 #3531013] INFO -- : make[2]: Leaving directory '/home/opc/ruby/build/master/ext/socket' I, [2024-05-21T00:40:16.874254 #3531013] INFO -- : make[2]: Entering directory '/home/opc/ruby/build/master/.bundle/gems/debug-1.9.2/ext/debug' I, [2024-05-21T00:40:16.886785 #3531013] INFO -- : make[2]: Leaving directory '/home/opc/ruby/build/master/.bundle/gems/bigdecimal-3.1.7/ext/bigdecimal' I, [2024-05-21T00:40:16.889338 #3531013] INFO -- : make[2]: Entering directory '/home/opc/ruby/build/master/.bundle/gems/nkf-0.2.0/ext/nkf' I, [2024-05-21T00:40:16.891772 #3531013] INFO -- : make[2]: Leaving directory '/home/opc/ruby/build/master/.bundle/gems/bigdecimal-3.1.8/ext/bigdecimal' I, [2024-05-21T00:40:16.894478 #3531013] INFO -- : make[2]: Entering directory '/home/opc/ruby/build/master/.bundle/gems/racc-1.7.3/ext/racc/cparse' I, [2024-05-21T00:40:16.907508 #3531013] INFO -- : make[2]: Leaving directory '/home/opc/ruby/build/master/.bundle/gems/debug-1.9.2/ext/debug' I, [2024-05-21T00:40:16.910080 #3531013] INFO -- : make[2]: Entering directory '/home/opc/ruby/build/master/.bundle/gems/racc-1.8.0/ext/racc/cparse' I, [2024-05-21T00:40:16.921945 #3531013] INFO -- : make[2]: Leaving directory '/home/opc/ruby/build/master/.bundle/gems/nkf-0.2.0/ext/nkf' I, [2024-05-21T00:40:16.924824 #3531013] INFO -- : make[2]: Entering directory '/home/opc/ruby/build/master/.bundle/gems/rbs-3.4.4/ext/rbs_extension' I, [2024-05-21T00:40:16.929898 #3531013] INFO -- : make[2]: Leaving directory '/home/opc/ruby/build/master/.bundle/gems/racc-1.7.3/ext/racc/cparse' I, [2024-05-21T00:40:16.933156 #3531013] INFO -- : make[2]: Entering directory '/home/opc/ruby/build/master/.bundle/gems/syslog-0.1.2/ext/syslog' I, [2024-05-21T00:40:16.941196 #3531013] INFO -- : make[2]: Leaving directory '/home/opc/ruby/build/master/.bundle/gems/racc-1.8.0/ext/racc/cparse' I, [2024-05-21T00:40:16.957852 #3531013] INFO -- : make[2]: Leaving directory '/home/opc/ruby/build/master/.bundle/gems/rbs-3.4.4/ext/rbs_extension' I, [2024-05-21T00:40:16.962753 #3531013] INFO -- : make[2]: Entering directory '/home/opc/ruby/build/master/ext/digest/sha2' I, [2024-05-21T00:40:16.965373 #3531013] INFO -- : make[2]: Leaving directory '/home/opc/ruby/build/master/.bundle/gems/syslog-0.1.2/ext/syslog' I, [2024-05-21T00:40:16.967952 #3531013] INFO -- : make[2]: Leaving directory '/home/opc/ruby/build/master/ext/digest/sha2' I, [2024-05-21T00:40:17.008204 #3531013] INFO -- : make[2]: Entering directory '/home/opc/ruby/build/master' I, [2024-05-21T00:40:17.092151 #3531013] INFO -- : make[2]: 'ruby' is up to date. I, [2024-05-21T00:40:17.092244 #3531013] INFO -- : make[2]: Leaving directory '/home/opc/ruby/build/master' I, [2024-05-21T00:40:17.092345 #3531013] INFO -- : make[1]: Leaving directory '/home/opc/ruby/build/master' I, [2024-05-21T00:40:17.096846 #3531013] INFO -- : make[1]: Entering directory '/home/opc/ruby/build/master' I, [2024-05-21T00:40:17.096890 #3531013] INFO -- : make[1]: Nothing to be done for 'note'. I, [2024-05-21T00:40:17.096901 #3531013] INFO -- : make[1]: Leaving directory '/home/opc/ruby/build/master' I, [2024-05-21T00:40:17.097051 #3531013] INFO -- : ./miniruby -I/home/opc/ruby/src/master/lib -I. -I.ext/common /home/opc/ruby/src/master/tool/runruby.rb --extout=.ext -- --disable-gems -r./aarch64-linux-fake /home/opc/ruby/src/master/tool/rbinstall.rb --make="make" --dest-dir="" --extout=".ext" --ext-build-dir="./ext" --mflags="-j3 --jobserver-auth=4,5" --make-flags=" -j3 --jobserver-auth=4,5" --data-mode=0644 --prog-mode=0755 --installed-list .installed.list --mantype="doc" --gnumake --install=all --exclude=doc I, [2024-05-21T00:40:17.253559 #3531013] INFO -- : Installing to I, [2024-05-21T00:40:17.253630 #3531013] INFO -- : installing binary commands: /home/opc/ruby/install/master/bin I, [2024-05-21T00:40:17.266186 #3531013] INFO -- : installing base libraries: /home/opc/ruby/install/master/lib I, [2024-05-21T00:40:17.266695 #3531013] INFO -- : installing arch files: /home/opc/ruby/install/master/lib/ruby/3.4.0+0/aarch64-linux I, [2024-05-21T00:40:17.266810 #3531013] INFO -- : installing pkgconfig data: /home/opc/ruby/install/master/lib/pkgconfig I, [2024-05-21T00:40:17.266885 #3531013] INFO -- : installing extension objects: /home/opc/ruby/install/master/lib/ruby/3.4.0+0/aarch64-linux I, [2024-05-21T00:40:17.280190 #3531013] INFO -- : installing extension objects: /home/opc/ruby/install/master/lib/ruby/site_ruby/3.4.0+0/aarch64-linux I, [2024-05-21T00:40:17.280218 #3531013] INFO -- : installing extension objects: /home/opc/ruby/install/master/lib/ruby/vendor_ruby/3.4.0+0/aarch64-linux I, [2024-05-21T00:40:17.280335 #3531013] INFO -- : installing extension headers: /home/opc/ruby/install/master/include/ruby-3.4.0+0/aarch64-linux I, [2024-05-21T00:40:17.280672 #3531013] INFO -- : installing extension scripts: /home/opc/ruby/install/master/lib/ruby/3.4.0+0 I, [2024-05-21T00:40:17.288827 #3531013] INFO -- : installing extension scripts: /home/opc/ruby/install/master/lib/ruby/site_ruby/3.4.0+0 I, [2024-05-21T00:40:17.288852 #3531013] INFO -- : installing extension scripts: /home/opc/ruby/install/master/lib/ruby/vendor_ruby/3.4.0+0 I, [2024-05-21T00:40:17.288862 #3531013] INFO -- : installing extension headers: /home/opc/ruby/install/master/include/ruby-3.4.0+0/ruby I, [2024-05-21T00:40:17.288989 #3531013] INFO -- : installing command scripts: /home/opc/ruby/install/master/bin I, [2024-05-21T00:40:17.289162 #3531013] INFO -- : installing library scripts: /home/opc/ruby/install/master/lib/ruby/3.4.0+0 I, [2024-05-21T00:40:17.375757 #3531013] INFO -- : installing common headers: /home/opc/ruby/install/master/include/ruby-3.4.0+0 I, [2024-05-21T00:40:17.388164 #3531013] INFO -- : installing manpages: /home/opc/ruby/install/master/share/man/man1 I, [2024-05-21T00:40:17.388466 #3531013] INFO -- : installing default gems from lib: /home/opc/ruby/install/master/lib/ruby/gems/3.4.0+0 I, [2024-05-21T00:40:17.435619 #3531013] INFO -- : benchmark 0.3.0 I, [2024-05-21T00:40:17.439857 #3531013] INFO -- : bundler 2.6.0.dev I, [2024-05-21T00:40:17.444769 #3531013] INFO -- : cgi 0.4.1 I, [2024-05-21T00:40:17.446007 #3531013] INFO -- : delegate 0.3.1 I, [2024-05-21T00:40:17.447105 #3531013] INFO -- : did_you_mean 1.6.3 I, [2024-05-21T00:40:17.448225 #3531013] INFO -- : english 0.8.0 I, [2024-05-21T00:40:17.450694 #3531013] INFO -- : erb 4.0.4 I, [2024-05-21T00:40:17.453620 #3531013] INFO -- : error_highlight 0.6.0 I, [2024-05-21T00:40:17.454723 #3531013] INFO -- : fileutils 1.7.2 I, [2024-05-21T00:40:17.455839 #3531013] INFO -- : find 0.2.0 I, [2024-05-21T00:40:17.457011 #3531013] INFO -- : forwardable 1.3.3 I, [2024-05-21T00:40:17.458164 #3531013] INFO -- : ipaddr 1.2.6 I, [2024-05-21T00:40:17.459326 #3531013] INFO -- : irb 1.13.1 I, [2024-05-21T00:40:17.462010 #3531013] INFO -- : logger 1.6.0 I, [2024-05-21T00:40:17.463146 #3531013] INFO -- : net-http 0.4.1 I, [2024-05-21T00:40:17.464369 #3531013] INFO -- : net-protocol 0.2.2 I, [2024-05-21T00:40:17.465635 #3531013] INFO -- : open-uri 0.4.1 I, [2024-05-21T00:40:17.466813 #3531013] INFO -- : open3 0.2.1 I, [2024-05-21T00:40:17.467982 #3531013] INFO -- : optparse 0.5.0 I, [2024-05-21T00:40:17.469222 #3531013] INFO -- : ostruct 0.6.0 I, [2024-05-21T00:40:17.470316 #3531013] INFO -- : pp 0.5.0 I, [2024-05-21T00:40:17.471450 #3531013] INFO -- : prettyprint 0.2.0 I, [2024-05-21T00:40:17.472626 #3531013] INFO -- : prism 0.29.0 I, [2024-05-21T00:40:17.473898 #3531013] INFO -- : pstore 0.1.3 I, [2024-05-21T00:40:17.475039 #3531013] INFO -- : rdoc 6.6.3.1 I, [2024-05-21T00:40:17.478941 #3531013] INFO -- : readline 0.0.4 I, [2024-05-21T00:40:17.480100 #3531013] INFO -- : reline 0.5.7 I, [2024-05-21T00:40:17.481374 #3531013] INFO -- : resolv 0.4.0 I, [2024-05-21T00:40:17.482520 #3531013] INFO -- : ruby2_keywords 0.0.5 I, [2024-05-21T00:40:17.485595 #3531013] INFO -- : securerandom 0.3.1 I, [2024-05-21T00:40:17.486736 #3531013] INFO -- : set 1.1.0 I, [2024-05-21T00:40:17.487901 #3531013] INFO -- : shellwords 0.2.0 I, [2024-05-21T00:40:17.489069 #3531013] INFO -- : singleton 0.2.0 I, [2024-05-21T00:40:17.490227 #3531013] INFO -- : syntax_suggest 2.0.0 I, [2024-05-21T00:40:17.492678 #3531013] INFO -- : tempfile 0.2.1 I, [2024-05-21T00:40:17.493851 #3531013] INFO -- : time 0.3.0 I, [2024-05-21T00:40:17.495041 #3531013] INFO -- : timeout 0.4.1 I, [2024-05-21T00:40:17.496176 #3531013] INFO -- : tmpdir 0.2.0 I, [2024-05-21T00:40:17.497406 #3531013] INFO -- : tsort 0.2.0 I, [2024-05-21T00:40:17.498550 #3531013] INFO -- : un 0.3.0 I, [2024-05-21T00:40:17.499946 #3531013] INFO -- : uri 0.13.0 I, [2024-05-21T00:40:17.501165 #3531013] INFO -- : weakref 0.1.3 I, [2024-05-21T00:40:17.502312 #3531013] INFO -- : yaml 0.3.0 I, [2024-05-21T00:40:17.503272 #3531013] INFO -- : installing default gems from ext: /home/opc/ruby/install/master/lib/ruby/gems/3.4.0+0 I, [2024-05-21T00:40:17.512951 #3531013] INFO -- : date 3.3.4 I, [2024-05-21T00:40:17.516170 #3531013] INFO -- : digest 3.1.1 I, [2024-05-21T00:40:17.517370 #3531013] INFO -- : etc 1.4.3 I, [2024-05-21T00:40:17.518575 #3531013] INFO -- : fcntl 1.1.0 I, [2024-05-21T00:40:17.519741 #3531013] INFO -- : fiddle 1.1.3 I, [2024-05-21T00:40:17.520968 #3531013] INFO -- : io-console 0.7.2 I, [2024-05-21T00:40:17.522168 #3531013] INFO -- : io-nonblock 0.3.0 I, [2024-05-21T00:40:17.523339 #3531013] INFO -- : io-wait 0.3.1 I, [2024-05-21T00:40:17.524465 #3531013] INFO -- : json 2.7.2 I, [2024-05-21T00:40:17.525875 #3531013] INFO -- : openssl 3.2.0 I, [2024-05-21T00:40:17.527122 #3531013] INFO -- : pathname 0.3.0 I, [2024-05-21T00:40:17.528812 #3531013] INFO -- : psych 5.1.2 I, [2024-05-21T00:40:17.530164 #3531013] INFO -- : stringio 3.1.1 I, [2024-05-21T00:40:17.531392 #3531013] INFO -- : strscan 3.1.1 I, [2024-05-21T00:40:17.532628 #3531013] INFO -- : zlib 3.1.0 I, [2024-05-21T00:40:17.533641 #3531013] INFO -- : installing bundled gems: /home/opc/ruby/install/master/lib/ruby/gems/3.4.0+0 I, [2024-05-21T00:40:17.534657 #3531013] INFO -- : minitest 5.23.0 I, [2024-05-21T00:40:17.553401 #3531013] INFO -- : rake 13.2.1 I, [2024-05-21T00:40:17.568454 #3531013] INFO -- : test-unit 3.6.2 I, [2024-05-21T00:40:17.583071 #3531013] INFO -- : rexml 3.2.8 I, [2024-05-21T00:40:17.600408 #3531013] INFO -- : rss 0.3.0 I, [2024-05-21T00:40:17.611101 #3531013] INFO -- : net-ftp 0.3.4 I, [2024-05-21T00:40:17.616028 #3531013] INFO -- : net-imap 0.4.11 I, [2024-05-21T00:40:17.634837 #3531013] INFO -- : net-pop 0.1.2 I, [2024-05-21T00:40:17.637765 #3531013] INFO -- : net-smtp 0.5.0 I, [2024-05-21T00:40:17.641435 #3531013] INFO -- : matrix 0.4.2 I, [2024-05-21T00:40:17.650217 #3531013] INFO -- : prime 0.1.2 I, [2024-05-21T00:40:17.659521 #3531013] INFO -- : rbs 3.4.4 I, [2024-05-21T00:40:17.769766 #3531013] INFO -- : typeprof 0.21.11 I, [2024-05-21T00:40:17.778769 #3531013] INFO -- : debug 1.9.2 I, [2024-05-21T00:40:17.789425 #3531013] INFO -- : racc 1.8.0 I, [2024-05-21T00:40:17.801470 #3531013] INFO -- : mutex_m 0.2.0 I, [2024-05-21T00:40:17.804641 #3531013] INFO -- : getoptlong 0.2.1 I, [2024-05-21T00:40:17.809807 #3531013] INFO -- : base64 0.2.0 I, [2024-05-21T00:40:17.812378 #3531013] INFO -- : bigdecimal 3.1.8 I, [2024-05-21T00:40:17.819091 #3531013] INFO -- : observer 0.1.2 I, [2024-05-21T00:40:17.822388 #3531013] INFO -- : abbrev 0.1.2 I, [2024-05-21T00:40:17.825380 #3531013] INFO -- : resolv-replace 0.1.1 I, [2024-05-21T00:40:17.828710 #3531013] INFO -- : rinda 0.2.0 I, [2024-05-21T00:40:17.833860 #3531013] INFO -- : drb 2.2.1 I, [2024-05-21T00:40:17.838481 #3531013] INFO -- : nkf 0.2.0 I, [2024-05-21T00:40:17.845473 #3531013] INFO -- : syslog 0.1.2 I, [2024-05-21T00:40:17.850399 #3531013] INFO -- : csv 3.3.0 I, [2024-05-21T00:40:17.859346 #3531013] INFO -- : installing bundled gem cache: /home/opc/ruby/install/master/lib/ruby/gems/3.4.0+0/cache I, [2024-05-21T00:40:17.861270 #3531013] INFO -- : skipped bundled gems: I, [2024-05-21T00:40:17.861289 #3531013] INFO -- : power_assert-2.0.4dev.gem not found in bundled_gems I, [2024-05-21T00:40:17.864396 #3531013] INFO -- : $$$[end] "make install -j3" exit with 0. I, [2024-05-21T00:40:17.864642 #3531013] INFO -- : $$$[beg] make yes-btest TESTOPTS='-q -j3' I, [2024-05-21T00:40:43.416320 #3531013] INFO -- : PASS all 1936 tests E, [2024-05-21T00:40:43.418108 #3531013] ERROR -- : I, [2024-05-21T00:40:43.418234 #3531013] INFO -- : $$$[end] "make yes-btest TESTOPTS='-q -j3'" exit with 0. I, [2024-05-21T00:40:43.418368 #3531013] INFO -- : $$$[beg] make yes-test-basic TESTS='-j3' I, [2024-05-21T00:40:43.514824 #3531013] INFO -- : BASERUBY = /usr/local/bin/ruby --disable=gems I, [2024-05-21T00:40:43.514903 #3531013] INFO -- : CC = gcc I, [2024-05-21T00:40:43.514915 #3531013] INFO -- : LD = ld I, [2024-05-21T00:40:43.514923 #3531013] INFO -- : LDSHARED = gcc -shared I, [2024-05-21T00:40:43.514942 #3531013] INFO -- : CFLAGS = -O3 -fno-fast-math -ggdb3 -Wall -Wextra -Wdeprecated-declarations -Wdiv-by-zero -Wduplicated-cond -Wimplicit-function-declaration -Wimplicit-int -Wpointer-arith -Wwrite-strings -Wold-style-definition -Wimplicit-fallthrough=0 -Wmissing-noreturn -Wno-cast-function-type -Wno-constant-logical-operand -Wno-long-long -Wno-missing-field-initializers -Wno-overlength-strings -Wno-packed-bitfield-compat -Wno-parentheses-equality -Wno-self-assign -Wno-tautological-compare -Wno-unused-parameter -Wno-unused-value -Wsuggest-attribute=format -Wsuggest-attribute=noreturn -Wunused-variable -Wmisleading-indentation -Wundef I, [2024-05-21T00:40:43.514952 #3531013] INFO -- : XCFLAGS = -U_FORTIFY_SOURCE -D_FORTIFY_SOURCE=2 -fstack-protector-strong -msign-return-address=all -fno-strict-overflow -fvisibility=hidden -fexcess-precision=standard -DRUBY_EXPORT -fPIE -I. -I.ext/include/aarch64-linux -I/home/opc/ruby/src/master/include -I/home/opc/ruby/src/master -I/home/opc/ruby/src/master/prism -I/home/opc/ruby/src/master/enc/unicode/15.0.0 I, [2024-05-21T00:40:43.516430 #3531013] INFO -- : CPPFLAGS = I, [2024-05-21T00:40:43.516470 #3531013] INFO -- : DLDFLAGS = -Wl,--compress-debug-sections=zlib -fstack-protector-strong -pie I, [2024-05-21T00:40:43.516480 #3531013] INFO -- : SOLIBS = -lz -lrt -lrt -ldl -lcrypt -lm -lpthread I, [2024-05-21T00:40:43.516522 #3531013] INFO -- : LANG = en_US.UTF-8 I, [2024-05-21T00:40:43.516533 #3531013] INFO -- : LC_ALL = I, [2024-05-21T00:40:43.516541 #3531013] INFO -- : LC_CTYPE = I, [2024-05-21T00:40:43.516548 #3531013] INFO -- : MFLAGS = I, [2024-05-21T00:40:43.516556 #3531013] INFO -- : RUSTC = rustc I, [2024-05-21T00:40:43.516564 #3531013] INFO -- : YJIT_RUSTC_ARGS = --crate-name=yjit --crate-type=staticlib --edition=2021 -g -C lto=thin -C opt-level=3 -C overflow-checks=on '--out-dir=/home/opc/ruby/build/master/yjit/target/release/' /home/opc/ruby/src/master/yjit/src/lib.rs I, [2024-05-21T00:40:43.516577 #3531013] INFO -- : gcc (GCC) 8.5.0 20210514 (Red Hat 8.5.0-10.1.0.1) I, [2024-05-21T00:40:43.516585 #3531013] INFO -- : Copyright (C) 2018 Free Software Foundation, Inc. I, [2024-05-21T00:40:43.516593 #3531013] INFO -- : This is free software; see the source for copying conditions. There is NO I, [2024-05-21T00:40:43.516601 #3531013] INFO -- : warranty; not even for MERCHANTABILITY or FITNESS FOR A PARTICULAR PURPOSE. I, [2024-05-21T00:40:43.516609 #3531013] INFO -- : I, [2024-05-21T00:40:43.679718 #3531013] INFO -- : Checking leaked global symbols...none I, [2024-05-21T00:40:43.734966 #3531013] INFO -- : /home/opc/ruby/src/master/basictest/test.rb:assignment ....................................................................................................................................................................................................................................................................................................................................................................................OK 372 I, [2024-05-21T00:40:43.735052 #3531013] INFO -- : /home/opc/ruby/src/master/basictest/test.rb:condition ..OK 2 I, [2024-05-21T00:40:43.735066 #3531013] INFO -- : /home/opc/ruby/src/master/basictest/test.rb:if/unless ...OK 3 I, [2024-05-21T00:40:43.735125 #3531013] INFO -- : /home/opc/ruby/src/master/basictest/test.rb:case .....OK 5 I, [2024-05-21T00:40:43.735718 #3531013] INFO -- : /home/opc/ruby/src/master/basictest/test.rb:while/until ........OK 8 I, [2024-05-21T00:40:43.735839 #3531013] INFO -- : /home/opc/ruby/src/master/basictest/test.rb:exception ..........OK 10 I, [2024-05-21T00:40:43.736520 #3531013] INFO -- : /home/opc/ruby/src/master/basictest/test.rb:array .......................................OK 39 I, [2024-05-21T00:40:43.736766 #3531013] INFO -- : /home/opc/ruby/src/master/basictest/test.rb:hash ...........................OK 27 I, [2024-05-21T00:40:43.738450 #3531013] INFO -- : /home/opc/ruby/src/master/basictest/test.rb:iterator ...........................................................................................................OK 107 I, [2024-05-21T00:40:43.739188 #3531013] INFO -- : /home/opc/ruby/src/master/basictest/test.rb:float ................................................................................OK 80 I, [2024-05-21T00:40:43.742696 #3531013] INFO -- : /home/opc/ruby/src/master/basictest/test.rb:bignum ...............................OK 31 I, [2024-05-21T00:40:43.744262 #3531013] INFO -- : /home/opc/ruby/src/master/basictest/test.rb:string & char ..............................................................OK 62 I, [2024-05-21T00:40:43.744350 #3531013] INFO -- : /home/opc/ruby/src/master/basictest/test.rb:assignment ..........OK 10 I, [2024-05-21T00:40:43.744421 #3531013] INFO -- : /home/opc/ruby/src/master/basictest/test.rb:call ......OK 6 I, [2024-05-21T00:40:43.744563 #3531013] INFO -- : /home/opc/ruby/src/master/basictest/test.rb:proc .........OK 9 I, [2024-05-21T00:40:43.844817 #3531013] INFO -- : /home/opc/ruby/src/master/basictest/test.rb:signal ..OK 2 I, [2024-05-21T00:40:43.846178 #3531013] INFO -- : /home/opc/ruby/src/master/basictest/test.rb:eval ...........................OK 27 I, [2024-05-21T00:40:43.982109 #3531013] INFO -- : /home/opc/ruby/src/master/basictest/test.rb:system ........OK 8 I, [2024-05-21T00:40:43.982181 #3531013] INFO -- : /home/opc/ruby/src/master/basictest/test.rb:const .....OK 5 I, [2024-05-21T00:40:43.982272 #3531013] INFO -- : /home/opc/ruby/src/master/basictest/test.rb:clone .....OK 5 I, [2024-05-21T00:40:43.982483 #3531013] INFO -- : /home/opc/ruby/src/master/basictest/test.rb:marshal ....OK 4 I, [2024-05-21T00:40:43.982563 #3531013] INFO -- : /home/opc/ruby/src/master/basictest/test.rb:pack ....OK 4 I, [2024-05-21T00:40:43.982595 #3531013] INFO -- : /home/opc/ruby/src/master/basictest/test.rb:math ..OK 2 I, [2024-05-21T00:40:43.982686 #3531013] INFO -- : /home/opc/ruby/src/master/basictest/test.rb:struct ......OK 6 I, [2024-05-21T00:40:43.982854 #3531013] INFO -- : /home/opc/ruby/src/master/basictest/test.rb:variable ............OK 12 I, [2024-05-21T00:40:43.982895 #3531013] INFO -- : /home/opc/ruby/src/master/basictest/test.rb:trace ...OK 3 I, [2024-05-21T00:40:43.983024 #3531013] INFO -- : /home/opc/ruby/src/master/basictest/test.rb:defined? ............OK 12 I, [2024-05-21T00:40:43.983112 #3531013] INFO -- : /home/opc/ruby/src/master/basictest/test.rb:alias ......OK 6 I, [2024-05-21T00:40:43.983629 #3531013] INFO -- : /home/opc/ruby/src/master/basictest/test.rb:path .......................OK 23 I, [2024-05-21T00:40:44.052812 #3531013] INFO -- : /home/opc/ruby/src/master/basictest/test.rb:gc ....OK 4 I, [2024-05-21T00:40:44.054959 #3531013] INFO -- : I, [2024-05-21T00:40:44.055001 #3531013] INFO -- : test succeeded I, [2024-05-21T00:40:44.055630 #3531013] INFO -- : $$$[end] "make yes-test-basic TESTS='-j3'" exit with 0. I, [2024-05-21T00:40:44.055827 #3531013] INFO -- : $$$[beg] make yes-test-all TESTOPTS='--stderr-on-failure' TESTS='-j3' I, [2024-05-21T00:40:44.184976 #3531013] INFO -- : BASERUBY = /usr/local/bin/ruby --disable=gems I, [2024-05-21T00:40:44.185051 #3531013] INFO -- : CC = gcc I, [2024-05-21T00:40:44.185063 #3531013] INFO -- : LD = ld I, [2024-05-21T00:40:44.185072 #3531013] INFO -- : LDSHARED = gcc -shared I, [2024-05-21T00:40:44.185084 #3531013] INFO -- : CFLAGS = -O3 -fno-fast-math -ggdb3 -Wall -Wextra -Wdeprecated-declarations -Wdiv-by-zero -Wduplicated-cond -Wimplicit-function-declaration -Wimplicit-int -Wpointer-arith -Wwrite-strings -Wold-style-definition -Wimplicit-fallthrough=0 -Wmissing-noreturn -Wno-cast-function-type -Wno-constant-logical-operand -Wno-long-long -Wno-missing-field-initializers -Wno-overlength-strings -Wno-packed-bitfield-compat -Wno-parentheses-equality -Wno-self-assign -Wno-tautological-compare -Wno-unused-parameter -Wno-unused-value -Wsuggest-attribute=format -Wsuggest-attribute=noreturn -Wunused-variable -Wmisleading-indentation -Wundef I, [2024-05-21T00:40:44.185122 #3531013] INFO -- : XCFLAGS = -U_FORTIFY_SOURCE -D_FORTIFY_SOURCE=2 -fstack-protector-strong -msign-return-address=all -fno-strict-overflow -fvisibility=hidden -fexcess-precision=standard -DRUBY_EXPORT -fPIE -I. -I.ext/include/aarch64-linux -I/home/opc/ruby/src/master/include -I/home/opc/ruby/src/master -I/home/opc/ruby/src/master/prism -I/home/opc/ruby/src/master/enc/unicode/15.0.0 I, [2024-05-21T00:40:44.185132 #3531013] INFO -- : CPPFLAGS = I, [2024-05-21T00:40:44.185140 #3531013] INFO -- : DLDFLAGS = -Wl,--compress-debug-sections=zlib -fstack-protector-strong -pie I, [2024-05-21T00:40:44.185150 #3531013] INFO -- : SOLIBS = -lz -lrt -lrt -ldl -lcrypt -lm -lpthread I, [2024-05-21T00:40:44.185158 #3531013] INFO -- : LANG = en_US.UTF-8 I, [2024-05-21T00:40:44.185166 #3531013] INFO -- : LC_ALL = I, [2024-05-21T00:40:44.185175 #3531013] INFO -- : LC_CTYPE = I, [2024-05-21T00:40:44.185183 #3531013] INFO -- : MFLAGS = I, [2024-05-21T00:40:44.185191 #3531013] INFO -- : RUSTC = rustc I, [2024-05-21T00:40:44.185199 #3531013] INFO -- : YJIT_RUSTC_ARGS = --crate-name=yjit --crate-type=staticlib --edition=2021 -g -C lto=thin -C opt-level=3 -C overflow-checks=on '--out-dir=/home/opc/ruby/build/master/yjit/target/release/' /home/opc/ruby/src/master/yjit/src/lib.rs I, [2024-05-21T00:40:44.185917 #3531013] INFO -- : gcc (GCC) 8.5.0 20210514 (Red Hat 8.5.0-10.1.0.1) I, [2024-05-21T00:40:44.185933 #3531013] INFO -- : Copyright (C) 2018 Free Software Foundation, Inc. I, [2024-05-21T00:40:44.185942 #3531013] INFO -- : This is free software; see the source for copying conditions. There is NO I, [2024-05-21T00:40:44.185951 #3531013] INFO -- : warranty; not even for MERCHANTABILITY or FITNESS FOR A PARTICULAR PURPOSE. I, [2024-05-21T00:40:44.185959 #3531013] INFO -- : I, [2024-05-21T00:40:44.187997 #3531013] INFO -- : generating enc.mk I, [2024-05-21T00:40:44.433646 #3531013] INFO -- : generating encdb.h I, [2024-05-21T00:40:44.471111 #3531013] INFO -- : encdb.h unchanged I, [2024-05-21T00:40:44.472301 #3531013] INFO -- : making enc I, [2024-05-21T00:40:44.500051 #3531013] INFO -- : make[1]: Entering directory '/home/opc/ruby/build/master' I, [2024-05-21T00:40:44.500110 #3531013] INFO -- : make[1]: Nothing to be done for 'enc'. I, [2024-05-21T00:40:44.500121 #3531013] INFO -- : make[1]: Leaving directory '/home/opc/ruby/build/master' I, [2024-05-21T00:40:44.500881 #3531013] INFO -- : making srcs under enc I, [2024-05-21T00:40:44.543039 #3531013] INFO -- : make[1]: Entering directory '/home/opc/ruby/build/master' I, [2024-05-21T00:40:44.543109 #3531013] INFO -- : make[1]: Nothing to be done for 'srcs'. I, [2024-05-21T00:40:44.543131 #3531013] INFO -- : make[1]: Leaving directory '/home/opc/ruby/build/master' I, [2024-05-21T00:40:44.544258 #3531013] INFO -- : generating transdb.h I, [2024-05-21T00:40:44.690157 #3531013] INFO -- : transdb.h unchanged I, [2024-05-21T00:40:44.691553 #3531013] INFO -- : making trans I, [2024-05-21T00:40:44.740869 #3531013] INFO -- : make[1]: Entering directory '/home/opc/ruby/build/master' I, [2024-05-21T00:40:44.740936 #3531013] INFO -- : make[1]: Nothing to be done for 'trans'. I, [2024-05-21T00:40:44.740946 #3531013] INFO -- : make[1]: Leaving directory '/home/opc/ruby/build/master' I, [2024-05-21T00:40:44.741759 #3531013] INFO -- : making encs I, [2024-05-21T00:40:44.795397 #3531013] INFO -- : make[1]: Entering directory '/home/opc/ruby/build/master' I, [2024-05-21T00:40:44.795468 #3531013] INFO -- : make[1]: Nothing to be done for 'encs'. I, [2024-05-21T00:40:44.795482 #3531013] INFO -- : make[1]: Leaving directory '/home/opc/ruby/build/master' I, [2024-05-21T00:40:44.797514 #3531013] INFO -- : generating makefiles ext/configure-ext.mk I, [2024-05-21T00:40:44.839056 #3531013] INFO -- : ext/configure-ext.mk updated I, [2024-05-21T00:40:44.842485 #3531013] INFO -- : make[1]: Entering directory '/home/opc/ruby/build/master' I, [2024-05-21T00:40:47.022305 #3531013] INFO -- : make[1]: Leaving directory '/home/opc/ruby/build/master' I, [2024-05-21T00:40:47.023048 #3531013] INFO -- : generating makefile exts.mk I, [2024-05-21T00:40:47.083585 #3531013] INFO -- : exts.mk unchanged I, [2024-05-21T00:40:47.088640 #3531013] INFO -- : make[1]: Entering directory '/home/opc/ruby/build/master' I, [2024-05-21T00:40:47.390375 #3531013] INFO -- : make[2]: Entering directory '/home/opc/ruby/build/master/ext/coverage' I, [2024-05-21T00:40:47.395182 #3531013] INFO -- : make[2]: Leaving directory '/home/opc/ruby/build/master/ext/coverage' I, [2024-05-21T00:40:47.400875 #3531013] INFO -- : make[2]: Entering directory '/home/opc/ruby/build/master/ext/date' I, [2024-05-21T00:40:47.406404 #3531013] INFO -- : make[2]: Leaving directory '/home/opc/ruby/build/master/ext/date' I, [2024-05-21T00:40:47.410083 #3531013] INFO -- : make[2]: Entering directory '/home/opc/ruby/build/master/ext/digest' I, [2024-05-21T00:40:47.419299 #3531013] INFO -- : make[2]: Leaving directory '/home/opc/ruby/build/master/ext/digest' I, [2024-05-21T00:40:47.442706 #3531013] INFO -- : make[2]: Entering directory '/home/opc/ruby/build/master/ext/digest/sha2' I, [2024-05-21T00:40:47.447900 #3531013] INFO -- : make[2]: Leaving directory '/home/opc/ruby/build/master/ext/digest/sha2' I, [2024-05-21T00:40:47.466691 #3531013] INFO -- : make[2]: Entering directory '/home/opc/ruby/build/master/ext/fiddle' I, [2024-05-21T00:40:47.477165 #3531013] INFO -- : make[2]: Leaving directory '/home/opc/ruby/build/master/ext/fiddle' I, [2024-05-21T00:40:47.481602 #3531013] INFO -- : make[2]: Entering directory '/home/opc/ruby/build/master/ext/io/console' I, [2024-05-21T00:40:47.486270 #3531013] INFO -- : make[2]: Leaving directory '/home/opc/ruby/build/master/ext/io/console' I, [2024-05-21T00:40:47.497233 #3531013] INFO -- : make[2]: Entering directory '/home/opc/ruby/build/master/ext/json' I, [2024-05-21T00:40:47.506803 #3531013] INFO -- : make[2]: Leaving directory '/home/opc/ruby/build/master/ext/json' I, [2024-05-21T00:40:47.520063 #3531013] INFO -- : make[2]: Entering directory '/home/opc/ruby/build/master/ext/monitor' I, [2024-05-21T00:40:47.524214 #3531013] INFO -- : make[2]: Leaving directory '/home/opc/ruby/build/master/ext/monitor' I, [2024-05-21T00:40:47.530463 #3531013] INFO -- : make[2]: Entering directory '/home/opc/ruby/build/master/ext/objspace' I, [2024-05-21T00:40:47.536384 #3531013] INFO -- : make[2]: Leaving directory '/home/opc/ruby/build/master/ext/objspace' I, [2024-05-21T00:40:47.555429 #3531013] INFO -- : make[2]: Entering directory '/home/opc/ruby/build/master/ext/openssl' I, [2024-05-21T00:40:47.577242 #3531013] INFO -- : make[2]: Leaving directory '/home/opc/ruby/build/master/ext/openssl' I, [2024-05-21T00:40:47.581538 #3531013] INFO -- : make[2]: Entering directory '/home/opc/ruby/build/master/ext/pathname' I, [2024-05-21T00:40:47.585945 #3531013] INFO -- : make[2]: Leaving directory '/home/opc/ruby/build/master/ext/pathname' I, [2024-05-21T00:40:47.592366 #3531013] INFO -- : make[2]: Entering directory '/home/opc/ruby/build/master/ext/psych' I, [2024-05-21T00:40:47.613912 #3531013] INFO -- : make[2]: Leaving directory '/home/opc/ruby/build/master/ext/psych' I, [2024-05-21T00:40:47.618425 #3531013] INFO -- : make[2]: Entering directory '/home/opc/ruby/build/master/ext/pty' I, [2024-05-21T00:40:47.622646 #3531013] INFO -- : make[2]: Leaving directory '/home/opc/ruby/build/master/ext/pty' I, [2024-05-21T00:40:47.636090 #3531013] INFO -- : make[2]: Entering directory '/home/opc/ruby/build/master/ext/ripper' I, [2024-05-21T00:40:47.643988 #3531013] INFO -- : make[2]: Leaving directory '/home/opc/ruby/build/master/ext/ripper' I, [2024-05-21T00:40:47.646096 #3531013] INFO -- : make[2]: Entering directory '/home/opc/ruby/build/master/ext/rubyvm' I, [2024-05-21T00:40:47.649972 #3531013] INFO -- : make[2]: Leaving directory '/home/opc/ruby/build/master/ext/rubyvm' I, [2024-05-21T00:40:47.662204 #3531013] INFO -- : make[2]: Entering directory '/home/opc/ruby/build/master/ext/socket' I, [2024-05-21T00:40:47.673002 #3531013] INFO -- : make[2]: Leaving directory '/home/opc/ruby/build/master/ext/socket' I, [2024-05-21T00:40:47.688648 #3531013] INFO -- : make[2]: Entering directory '/home/opc/ruby/build/master/.bundle/gems/bigdecimal-3.1.7/ext/bigdecimal' I, [2024-05-21T00:40:47.720911 #3531013] INFO -- : make[2]: Leaving directory '/home/opc/ruby/build/master/.bundle/gems/bigdecimal-3.1.7/ext/bigdecimal' I, [2024-05-21T00:40:47.723588 #3531013] INFO -- : make[2]: Entering directory '/home/opc/ruby/build/master/.bundle/gems/bigdecimal-3.1.8/ext/bigdecimal' I, [2024-05-21T00:40:47.754833 #3531013] INFO -- : make[2]: Leaving directory '/home/opc/ruby/build/master/.bundle/gems/bigdecimal-3.1.8/ext/bigdecimal' I, [2024-05-21T00:40:47.757637 #3531013] INFO -- : make[2]: Entering directory '/home/opc/ruby/build/master/.bundle/gems/debug-1.9.2/ext/debug' I, [2024-05-21T00:40:47.788983 #3531013] INFO -- : make[2]: Leaving directory '/home/opc/ruby/build/master/.bundle/gems/debug-1.9.2/ext/debug' I, [2024-05-21T00:40:47.791574 #3531013] INFO -- : make[2]: Entering directory '/home/opc/ruby/build/master/.bundle/gems/nkf-0.2.0/ext/nkf' I, [2024-05-21T00:40:47.822966 #3531013] INFO -- : make[2]: Leaving directory '/home/opc/ruby/build/master/.bundle/gems/nkf-0.2.0/ext/nkf' I, [2024-05-21T00:40:47.825554 #3531013] INFO -- : make[2]: Entering directory '/home/opc/ruby/build/master/.bundle/gems/racc-1.7.3/ext/racc/cparse' I, [2024-05-21T00:40:47.856837 #3531013] INFO -- : make[2]: Leaving directory '/home/opc/ruby/build/master/.bundle/gems/racc-1.7.3/ext/racc/cparse' I, [2024-05-21T00:40:47.859887 #3531013] INFO -- : make[2]: Entering directory '/home/opc/ruby/build/master/.bundle/gems/racc-1.8.0/ext/racc/cparse' I, [2024-05-21T00:40:47.891371 #3531013] INFO -- : make[2]: Leaving directory '/home/opc/ruby/build/master/.bundle/gems/racc-1.8.0/ext/racc/cparse' I, [2024-05-21T00:40:47.894523 #3531013] INFO -- : make[2]: Entering directory '/home/opc/ruby/build/master/.bundle/gems/rbs-3.4.4/ext/rbs_extension' I, [2024-05-21T00:40:47.926183 #3531013] INFO -- : make[2]: Leaving directory '/home/opc/ruby/build/master/.bundle/gems/rbs-3.4.4/ext/rbs_extension' I, [2024-05-21T00:40:47.928772 #3531013] INFO -- : make[2]: Entering directory '/home/opc/ruby/build/master/.bundle/gems/syslog-0.1.2/ext/syslog' I, [2024-05-21T00:40:47.960311 #3531013] INFO -- : make[2]: Leaving directory '/home/opc/ruby/build/master/.bundle/gems/syslog-0.1.2/ext/syslog' I, [2024-05-21T00:40:47.998626 #3531013] INFO -- : make[2]: Entering directory '/home/opc/ruby/build/master' I, [2024-05-21T00:40:48.085266 #3531013] INFO -- : make[2]: 'ruby' is up to date. I, [2024-05-21T00:40:48.085348 #3531013] INFO -- : make[2]: Leaving directory '/home/opc/ruby/build/master' I, [2024-05-21T00:40:48.085497 #3531013] INFO -- : make[1]: Leaving directory '/home/opc/ruby/build/master' I, [2024-05-21T00:40:48.090070 #3531013] INFO -- : make[1]: Entering directory '/home/opc/ruby/build/master' I, [2024-05-21T00:40:48.090134 #3531013] INFO -- : make[1]: Nothing to be done for 'note'. I, [2024-05-21T00:40:48.090145 #3531013] INFO -- : make[1]: Leaving directory '/home/opc/ruby/build/master' I, [2024-05-21T00:40:48.204860 #3531013] INFO -- : Run options: I, [2024-05-21T00:40:48.204938 #3531013] INFO -- : --seed=14583 I, [2024-05-21T00:40:48.204969 #3531013] INFO -- : "--ruby=./miniruby -I/home/opc/ruby/src/master/lib -I. -I.ext/common /home/opc/ruby/src/master/tool/runruby.rb --extout=.ext -- --disable-gems" I, [2024-05-21T00:40:48.204980 #3531013] INFO -- : --excludes-dir=/home/opc/ruby/src/master/test/.excludes I, [2024-05-21T00:40:48.204989 #3531013] INFO -- : --name=!/memory_leak/ I, [2024-05-21T00:40:48.204997 #3531013] INFO -- : --stderr-on-failure I, [2024-05-21T00:40:48.205005 #3531013] INFO -- : -j3 I, [2024-05-21T00:40:48.205014 #3531013] INFO -- : I, [2024-05-21T00:40:48.205022 #3531013] INFO -- : # Running tests: I, [2024-05-21T00:40:48.205030 #3531013] INFO -- : I, [2024-05-21T00:40:48.340194 #3531013] INFO -- : [ 1/885] 3571883=test_rdoc_markup_to_rdoc I, [2024-05-21T00:40:48.342794 #3531013] INFO -- : [ 2/885] 3571884=test_ractor I, [2024-05-21T00:40:48.352212 #3531013] INFO -- : [ 3/885] 3571885=test_case I, [2024-05-21T00:40:48.352670 #3531013] INFO -- : [ 4/885] 3571885=test_severity I, [2024-05-21T00:40:48.358507 #3531013] INFO -- : [ 5/885] 3571884=test_str2big I, [2024-05-21T00:40:48.360581 #3531013] INFO -- : [ 6/885] 3571885=test_gem_package_tar_writer I, [2024-05-21T00:40:48.433318 #3531013] INFO -- : [ 7/885] 3571884=attribute_write_test I, [2024-05-21T00:40:48.445931 #3531013] INFO -- : [ 8/885] 3571884=test_utf16 I, [2024-05-21T00:40:48.464346 #3531013] INFO -- : [ 9/885] 3571884=test_http I, [2024-05-21T00:40:48.534472 #3531013] INFO -- : [ 10/885] 3571883=test_set I, [2024-05-21T00:40:48.538495 #3531013] INFO -- : [ 11/885] 3571883=test_parser_events I, [2024-05-21T00:40:48.613677 #3531013] INFO -- : [ 12/885] 3571883=test_filter I, [2024-05-21T00:40:48.656630 #3531013] INFO -- : [ 13/885] 3571885=test_pkcs12 I, [2024-05-21T00:40:48.664306 #3531013] INFO -- : [ 14/885] 3571883=test_json_tree I, [2024-05-21T00:40:48.669274 #3531013] INFO -- : [ 15/885] 3571883=test_koi8 I, [2024-05-21T00:40:48.710530 #3531013] INFO -- : [ 16/885] 3571883=test_gem_remote_fetcher I, [2024-05-21T00:40:49.357750 #3531013] INFO -- : [ 17/885] 3571885=test_argf I, [2024-05-21T00:40:50.923547 #3531013] INFO -- : [ 18/885] 3571883=test_yaml I, [2024-05-21T00:40:50.982437 #3531013] INFO -- : [ 19/885] 3571883=test_x509name I, [2024-05-21T00:40:50.988800 #3531013] INFO -- : [ 20/885] 3571883=test_gem_dependency I, [2024-05-21T00:40:51.143399 #3531013] INFO -- : [ 21/885] 3571883=test_yjit I, [2024-05-21T00:40:51.147984 #3531013] INFO -- : [ 22/885] 3571883=test_gem_uninstaller I, [2024-05-21T00:40:52.378841 #3531013] INFO -- : [ 23/885] 3571883=test_cclass I, [2024-05-21T00:40:52.491990 #3531013] INFO -- : [ 24/885] 3571883=test_method I, [2024-05-21T00:40:52.949713 #3531013] INFO -- : [ 25/885] 3571885=test_m17n I, [2024-05-21T00:40:53.090422 #3531013] INFO -- : [ 26/885] 3571885=encoding_test I, [2024-05-21T00:40:53.157425 #3531013] INFO -- : [ 27/885] 3571885=test_gem_commands_specification_command I, [2024-05-21T00:40:53.329075 #3531013] INFO -- : [ 28/885] 3571885=test_scan_args I, [2024-05-21T00:40:53.340822 #3531013] INFO -- : [ 29/885] 3571885=test_gem_commands_which_command I, [2024-05-21T00:40:53.390709 #3531013] INFO -- : [ 30/885] 3571885=test_gem_request I, [2024-05-21T00:40:53.617229 #3531013] INFO -- : [ 31/885] 3571885=test_gem_package_old I, [2024-05-21T00:40:53.662562 #3531013] INFO -- : [ 32/885] 3571885=test_pty.Leaked file descriptor: TestPTY#test_open_with_block: 8 # I, [2024-05-21T00:40:53.689480 #3531013] INFO -- : COMMAND PID USER FD TYPE DEVICE SIZE/OFF NODE NAME I, [2024-05-21T00:40:53.689552 #3531013] INFO -- : ruby 3571885 opc 8r REG 252,0 6940392 13705429 /var/lib/sss/mc/group I, [2024-05-21T00:40:53.705242 #3531013] INFO -- : I, [2024-05-21T00:40:54.179111 #3531013] INFO -- : [ 33/885] 3571885=test_gem_dependency_installer I, [2024-05-21T00:40:56.226832 #3531013] INFO -- : [ 34/885] 3571883=test_http I, [2024-05-21T00:40:56.237262 #3531013] INFO -- : [ 35/885] 3571883=parser_test I, [2024-05-21T00:40:56.311933 #3531013] INFO -- : [ 36/885] 3571883=test_hash I, [2024-05-21T00:40:56.374985 #3531013] INFO -- : [ 37/885] 3571885=desugar_compiler_test I, [2024-05-21T00:40:56.393037 #3531013] INFO -- : [ 38/885] 3571885=test_gem_source_local I, [2024-05-21T00:40:56.620721 #3531013] INFO -- : [ 39/885] 3571885=test_internal_ivar I, [2024-05-21T00:40:56.627340 #3531013] INFO -- : [ 40/885] 3571885=test_win32ole I, [2024-05-21T00:40:56.680392 #3531013] INFO -- : [ 41/885] 3571885=test_rendering I, [2024-05-21T00:40:56.806539 #3531013] INFO -- : [ 42/885] 3571885=test_gem_gemcutter_utilities I, [2024-05-21T00:40:57.143983 #3531013] INFO -- : [ 43/885] 3571885=test_rdoc_task I, [2024-05-21T00:40:57.170329 #3531013] INFO -- : [ 44/885] 3571885=test_settracefunc I, [2024-05-21T00:40:57.252313 #3531013] INFO -- : [ 45/885] 3571884=test_gem_text I, [2024-05-21T00:40:57.466580 #3531013] INFO -- : [ 46/885] 3571884=test_tracepoint I, [2024-05-21T00:40:57.718177 #3531013] INFO -- : [ 47/885] 3571884=test_backtrace I, [2024-05-21T00:40:58.030375 #3531013] INFO -- : [ 48/885] 3571885=test_gem_commands_push_command I, [2024-05-21T00:40:58.623761 #3531013] INFO -- : [ 49/885] 3571885=locals_test I, [2024-05-21T00:40:58.988860 #3531013] INFO -- : [ 50/885] 3571885=test_method_cache I, [2024-05-21T00:40:59.002351 #3531013] INFO -- : [ 51/885] 3571885=test_too_many_dummy_encodings I, [2024-05-21T00:40:59.022444 #3531013] INFO -- : [ 52/885] 3571884=test_sprintf_comb I, [2024-05-21T00:40:59.070999 #3531013] INFO -- : [ 53/885] 3571885=test_rdoc_generator_json_index I, [2024-05-21T00:40:59.176232 #3531013] INFO -- : [ 54/885] 3571884=test_date_time I, [2024-05-21T00:40:59.182901 #3531013] INFO -- : [ 55/885] 3571884=test_nil2vtempty I, [2024-05-21T00:40:59.205570 #3531013] INFO -- : [ 56/885] 3571884=test_framework I, [2024-05-21T00:40:59.210430 #3531013] INFO -- : [ 57/885] 3571884=test_coderange I, [2024-05-21T00:40:59.234556 #3531013] INFO -- : [ 58/885] 3571884=test_weakmap I, [2024-05-21T00:40:59.280105 #3531013] INFO -- : [ 59/885] 3571885=test_ansi_with_terminfo I, [2024-05-21T00:40:59.281325 #3531013] INFO -- : [ 60/885] 3571885=test_inadvertent_creation I, [2024-05-21T00:40:59.402687 #3531013] INFO -- : [ 61/885] 3571885=test_cgi_tag_helper I, [2024-05-21T00:40:59.419202 #3531013] INFO -- : [ 62/885] 3571885=test_pack I, [2024-05-21T00:40:59.464806 #3531013] INFO -- : [ 63/885] 3571885=test_pinned I, [2024-05-21T00:40:59.513857 #3531013] INFO -- : [ 64/885] 3571885=test_libs I, [2024-05-21T00:40:59.557830 #3531013] INFO -- : [ 65/885] 3571885=ripper_test I, [2024-05-21T00:40:59.772822 #3531013] INFO -- : [ 66/885] 3571883=test_iso_8859 I, [2024-05-21T00:40:59.797466 #3531013] INFO -- : [ 67/885] 3571883=test_math I, [2024-05-21T00:40:59.812402 #3531013] INFO -- : [ 68/885] 3571883=test_gc I, [2024-05-21T00:40:59.816522 #3531013] INFO -- : [ 69/885] 3571883=test_qsort I, [2024-05-21T00:40:59.822983 #3531013] INFO -- : [ 70/885] 3571883=comments_test I, [2024-05-21T00:40:59.828362 #3531013] INFO -- : [ 71/885] 3571883=test_safe_load I, [2024-05-21T00:40:59.840297 #3531013] INFO -- : [ 72/885] 3571883=test_sprintf I, [2024-05-21T00:41:00.040939 #3531013] INFO -- : [ 73/885] 3571883=test_class I, [2024-05-21T00:41:00.376793 #3531013] INFO -- : [ 74/885] 3571885=test_exit I, [2024-05-21T00:41:00.386439 #3531013] INFO -- : [ 75/885] 3571885=test_const I, [2024-05-21T00:41:00.398288 #3531013] INFO -- : [ 76/885] 3571885=test_rdoc_parser_rd I, [2024-05-21T00:41:00.424130 #3531013] INFO -- : [ 77/885] 3571885=index_write_test I, [2024-05-21T00:41:00.438703 #3531013] INFO -- : [ 78/885] 3571885=test_yaml_special_cases I, [2024-05-21T00:41:00.447070 #3531013] INFO -- : [ 79/885] 3571885=test_recorder I, [2024-05-21T00:41:00.456201 #3531013] INFO -- : [ 80/885] 3571885=test_gem_source_list I, [2024-05-21T00:41:00.532434 #3531013] INFO -- : [ 81/885] 3571885=json_addition_test I, [2024-05-21T00:41:00.538636 #3531013] INFO -- : [ 82/885] 3571885=test_name_error I, [2024-05-21T00:41:00.628948 #3531013] INFO -- : [ 83/885] 3571885=test_gem_commands_sources_command I, [2024-05-21T00:41:00.844398 #3531013] INFO -- : [ 84/885] 3571885=test_case I, [2024-05-21T00:41:00.979543 #3531013] INFO -- : [ 85/885] 3571885=test_open-uri I, [2024-05-21T00:41:01.383295 #3531013] INFO -- : [ 86/885] 3571885=test_enc_associate I, [2024-05-21T00:41:02.093267 #3531013] INFO -- : [ 87/885] 3571885=test_enumerator I, [2024-05-21T00:41:02.269819 #3531013] INFO -- : [ 88/885] 3571884=test_gem_command_manager I, [2024-05-21T00:41:02.276178 #3531013] INFO -- : [ 89/885] 3571883=test_rdoc_context I, [2024-05-21T00:41:02.447707 #3531013] INFO -- : [ 90/885] 3571884=test_array I, [2024-05-21T00:41:02.456520 #3531013] INFO -- : [ 91/885] 3571884=test_win32ole_variable I, [2024-05-21T00:41:02.464039 #3531013] INFO -- : [ 92/885] 3571884=test_method_cache I, [2024-05-21T00:41:02.466349 #3531013] INFO -- : [ 93/885] 3571884=test_parse I, [2024-05-21T00:41:02.970410 #3531013] INFO -- : [ 94/885] 3571884=test_rdoc_cross_reference I, [2024-05-21T00:41:03.061144 #3531013] INFO -- : [ 95/885] 3571883=test_rdoc_class_module I, [2024-05-21T00:41:03.581304 #3531013] INFO -- : [ 96/885] 3571884=test_gem_specification I, [2024-05-21T00:41:03.588860 #3531013] INFO -- : [ 97/885] 3571883=test_flush I, [2024-05-21T00:41:03.601046 #3531013] INFO -- : [ 98/885] 3571883=test_pkey_rsa I, [2024-05-21T00:41:03.882344 #3531013] INFO -- : [ 99/885] 3571883=test_system I, [2024-05-21T00:41:04.770846 #3531013] INFO -- : [100/885] 3571883=test_numhash I, [2024-05-21T00:41:04.775387 #3531013] INFO -- : [101/885] 3571883=test_face I, [2024-05-21T00:41:04.856169 #3531013] INFO -- : [102/885] 3571883=test_gem_request_set_lockfile_parser I, [2024-05-21T00:41:05.018334 #3531013] INFO -- : [103/885] 3571883=test_date_attr I, [2024-05-21T00:41:05.119331 #3531013] INFO -- : [104/885] 3571883=test_sizeof I, [2024-05-21T00:41:06.078600 #3531013] INFO -- : [105/885] 3571884=test_stringchar I, [2024-05-21T00:41:06.094133 #3531013] INFO -- : [106/885] 3571884=warnings_test I, [2024-05-21T00:41:06.116811 #3531013] INFO -- : [107/885] 3571884=test_econv I, [2024-05-21T00:41:07.047539 #3531013] INFO -- : [108/885] 3571884=test_gem_install_update_options I, [2024-05-21T00:41:07.207196 #3531013] INFO -- : [109/885] 3571884=test_jaro_winkler I, [2024-05-21T00:41:07.211700 #3531013] INFO -- : [110/885] 3571884=test_cp949 I, [2024-05-21T00:41:07.217944 #3531013] INFO -- : [111/885] 3571884=test_condition I, [2024-05-21T00:41:07.226403 #3531013] INFO -- : [112/885] 3571884=test_gem_resolver_vendor_set I, [2024-05-21T00:41:07.255584 #3531013] INFO -- : [113/885] 3571884=test_gem_dependency_resolution_error I, [2024-05-21T00:41:07.284642 #3531013] INFO -- : [114/885] 3571884=test_fileutils I, [2024-05-21T00:41:07.709393 #3531013] INFO -- : [115/885] 3571883=test_sleep I, [2024-05-21T00:41:07.740221 #3531013] INFO -- : Leaked file descriptor: TestFileUtils#test_chown_error: 11 # I, [2024-05-21T00:41:07.766555 #3531013] INFO -- : COMMAND PID USER FD TYPE DEVICE SIZE/OFF NODE NAME I, [2024-05-21T00:41:07.766634 #3531013] INFO -- : ruby 3571884 opc 11r REG 252,0 9253600 13705411 /var/lib/sss/mc/passwd I, [2024-05-21T00:41:07.912907 #3531013] INFO -- : [116/885] 3571884=test_mixed_unicode_escapes I, [2024-05-21T00:41:07.921956 #3531013] INFO -- : [117/885] 3571884=test_emoji I, [2024-05-21T00:41:08.025270 #3531013] INFO -- : [118/885] 3571884=test_sorted_set I, [2024-05-21T00:41:08.370286 #3531013] INFO -- : [119/885] 3571884=test_stack I, [2024-05-21T00:41:09.045882 #3531013] INFO -- : [120/885] 3571884=test_windows_1252 I, [2024-05-21T00:41:09.053521 #3531013] INFO -- : [121/885] 3571884=test_gem_impossible_dependencies_error I, [2024-05-21T00:41:09.062024 #3531013] INFO -- : [122/885] 3571884=test_pp I, [2024-05-21T00:41:09.091858 #3531013] INFO -- : [123/885] 3571884=memsize_test I, [2024-05-21T00:41:09.099393 #3531013] INFO -- : [124/885] 3571884=test_gem_resolver_requirement_list I, [2024-05-21T00:41:09.108106 #3531013] INFO -- : [125/885] 3571884=test_noarg I, [2024-05-21T00:41:09.340761 #3531013] INFO -- : [126/885] 3571884=test_arith_seq_beg_len_step I, [2024-05-21T00:41:09.470928 #3531013] INFO -- : [127/885] 3571884=test_raise_exception I, [2024-05-21T00:41:09.771048 #3531013] INFO -- : [128/885] 3571883=test_exception I, [2024-05-21T00:41:09.788950 #3531013] INFO -- : [129/885] 3571883=test_basicinstructions I, [2024-05-21T00:41:09.864352 #3531013] INFO -- : [130/885] 3571883=test_gem_resolver_git_specification I, [2024-05-21T00:41:09.970485 #3531013] INFO -- : [131/885] 3571884=test_utf32 I, [2024-05-21T00:41:10.100292 #3531013] INFO -- : [132/885] 3571884=test_key_actor_emacs I, [2024-05-21T00:41:10.200678 #3531013] INFO -- : [133/885] 3571883=test_gem_security I, [2024-05-21T00:41:10.231888 #3531013] INFO -- : [134/885] 3571884=test_erb I, [2024-05-21T00:41:10.525131 #3531013] INFO -- : [135/885] 3571884=test_date_ractor I, [2024-05-21T00:41:10.609815 #3531013] INFO -- : [136/885] 3571884=test_variable I, [2024-05-21T00:41:10.635301 #3531013] INFO -- : [137/885] 3571884=test_hash I, [2024-05-21T00:41:10.652617 #3531013] INFO -- : [138/885] 3571884=test_rdoc_tom_doc I, [2024-05-21T00:41:10.706890 #3531013] INFO -- : [139/885] 3571884=test_gem_commands_pristine_command I, [2024-05-21T00:41:12.167421 #3531013] INFO -- : [140/885] 3571884=test_optarg I, [2024-05-21T00:41:12.234689 #3531013] INFO -- : [141/885] 3571884=test_gem_commands_open_command I, [2024-05-21T00:41:12.337453 #3531013] INFO -- : [142/885] 3571884=test_verbose I, [2024-05-21T00:41:12.391286 #3531013] INFO -- : [143/885] 3571884=test_emoji_breaks I, [2024-05-21T00:41:12.393467 #3531013] INFO -- : [144/885] 3571884=test_normalize I, [2024-05-21T00:41:12.403683 #3531013] INFO -- : [145/885] 3571884=test_gem_update_suggestion I, [2024-05-21T00:41:12.511165 #3531013] INFO -- : [146/885] 3571884=test_assignment I, [2024-05-21T00:41:13.922457 #3531013] INFO -- : [147/885] 3571884=test_undef I, [2024-05-21T00:41:13.927652 #3531013] INFO -- : [148/885] 3571884=test_random I, [2024-05-21T00:41:13.945770 #3531013] INFO -- : [149/885] 3571884=test_gem_resolver_lock_set I, [2024-05-21T00:41:13.994288 #3531013] INFO -- : [150/885] 3571884=test_rdoc_generator_darkfish I, [2024-05-21T00:41:14.354767 #3531013] INFO -- : [151/885] 3571884=test_gem_command I, [2024-05-21T00:41:14.496848 #3531013] INFO -- : [152/885] 3571884=test_asn1 I, [2024-05-21T00:41:14.511581 #3531013] INFO -- : [153/885] 3571884=test_array_create I, [2024-05-21T00:41:14.559784 #3531013] INFO -- : [154/885] 3571884=test_memory_view I, [2024-05-21T00:41:14.934492 #3531013] INFO -- : [155/885] 3571884=test_dir_m17n I, [2024-05-21T00:41:15.916881 #3531013] INFO -- : [156/885] 3571883=test_threadgroup I, [2024-05-21T00:41:16.152326 #3531013] INFO -- : [157/885] 3571884=test_complex I, [2024-05-21T00:41:16.224527 #3531013] INFO -- : [158/885] 3571884=!Nothing_to_test I, [2024-05-21T00:41:16.226118 #3531013] INFO -- : [159/885] 3571884=test_fd_setsize I, [2024-05-21T00:41:16.235625 #3531013] INFO -- : [160/885] 3571884=test_forwardable I, [2024-05-21T00:41:16.262042 #3531013] INFO -- : [161/885] 3571884=test_process I, [2024-05-21T00:41:16.282481 #3531013] INFO -- : [162/885] 3571884=test_string I, [2024-05-21T00:41:16.327424 #3531013] INFO -- : [163/885] 3571884=test_iterator I, [2024-05-21T00:41:16.420898 #3531013] INFO -- : [164/885] 3571884=test_gem_commands_install_command I, [2024-05-21T00:41:16.947929 #3531013] INFO -- : [165/885] 3571883=test_rendering I, [2024-05-21T00:41:17.034769 #3531013] INFO -- : [166/885] 3571883=test_kernel I, [2024-05-21T00:41:17.730709 #3531013] INFO -- : [167/885] 3571883=pattern_test I, [2024-05-21T00:41:17.765435 #3531013] INFO -- : [168/885] 3571883=test_dot_dot I, [2024-05-21T00:41:17.774609 #3531013] INFO -- : [169/885] 3571883=test_gem_rdoc I, [2024-05-21T00:41:17.979409 #3531013] INFO -- : [170/885] 3571883=test_did_you_mean I, [2024-05-21T00:41:18.069787 #3531013] INFO -- : [171/885] 3571883=test_shapes I, [2024-05-21T00:41:18.079496 #3531013] INFO -- : [172/885] 3571883=test_cesu8 I, [2024-05-21T00:41:18.096699 #3531013] INFO -- : [173/885] 3571883=test_rdoc_extend I, [2024-05-21T00:41:18.108000 #3531013] INFO -- : [174/885] 3571883=test_storage I, [2024-05-21T00:41:18.117336 #3531013] INFO -- : [175/885] 3571883=test_err_in_callback I, [2024-05-21T00:41:18.135755 #3531013] INFO -- : [176/885] 3571883=test_method_name_check I, [2024-05-21T00:41:18.151999 #3531013] INFO -- : [177/885] 3571883=test_merge_keys I, [2024-05-21T00:41:18.166890 #3531013] INFO -- : [178/885] 3571883=test_enumerable I, [2024-05-21T00:41:18.191493 #3531013] INFO -- : [179/885] 3571883=test_rdoc_method_attr I, [2024-05-21T00:41:18.200068 #3531013] INFO -- : [180/885] 3571884=test_set I, [2024-05-21T00:41:18.237937 #3531013] INFO -- : [181/885] 3571884=test_tree_spell_checker I, [2024-05-21T00:41:18.293259 #3531013] INFO -- : [182/885] 3571883=static_literals_test I, [2024-05-21T00:41:18.303778 #3531013] INFO -- : [183/885] 3571883=test_grapheme_breaks I, [2024-05-21T00:41:18.312763 #3531013] INFO -- : [184/885] 3571884=test_hash_create I, [2024-05-21T00:41:18.315276 #3531013] INFO -- : [185/885] 3571884=test_yamldbm I, [2024-05-21T00:41:18.321656 #3531013] INFO -- : [186/885] 3571883=test_gem_spec_fetcher I, [2024-05-21T00:41:18.330304 #3531013] INFO -- : [187/885] 3571884=test_unicode_escape I, [2024-05-21T00:41:18.408449 #3531013] INFO -- : [188/885] 3571884=test_switch_hitter I, [2024-05-21T00:41:18.434341 #3531013] INFO -- : [189/885] 3571884=test_default_gems I, [2024-05-21T00:41:18.489040 #3531013] INFO -- : [190/885] 3571884=test_backtrace I, [2024-05-21T00:41:18.500865 #3531013] INFO -- : [191/885] 3571884=test_gbk I, [2024-05-21T00:41:18.512690 #3531013] INFO -- : [192/885] 3571884=test_gem_commands_dependency_command I, [2024-05-21T00:41:18.561282 #3531013] INFO -- : [193/885] 3571883=test_key_event_record I, [2024-05-21T00:41:18.569330 #3531013] INFO -- : [194/885] 3571883=test_mdns I, [2024-05-21T00:41:18.581899 #3531013] INFO -- : [195/885] 3571883=test_open3 I, [2024-05-21T00:41:18.647478 #3531013] INFO -- : [196/885] 3571884=test_date_parse I, [2024-05-21T00:41:18.772999 #3531013] INFO -- : [197/885] 3571884=test_arity I, [2024-05-21T00:41:18.778691 #3531013] INFO -- : [198/885] 3571884=test_thread I, [2024-05-21T00:41:18.791547 #3531013] INFO -- : [199/885] 3571884=test_svcb_https I, [2024-05-21T00:41:18.825079 #3531013] INFO -- : [200/885] 3571884=test_pkey_ec I, [2024-05-21T00:41:18.911867 #3531013] INFO -- : [201/885] 3571884=test_buffering I, [2024-05-21T00:41:18.950372 #3531013] INFO -- : [202/885] 3571884=test_rational I, [2024-05-21T00:41:18.998702 #3531013] INFO -- : [203/885] 3571884=test_case_mapping I, [2024-05-21T00:41:19.020406 #3531013] INFO -- : [204/885] 3571884=test_gem_ext_cargo_builder_unit I, [2024-05-21T00:41:19.048020 #3531013] INFO -- : [205/885] 3571884=test_ractor I, [2024-05-21T00:41:19.077848 #3531013] INFO -- : [206/885] 3571884=test_rdoc_rubygems_hook I, [2024-05-21T00:41:19.172757 #3531013] INFO -- : [207/885] 3571884=test_gem_resolver_api_specification I, [2024-05-21T00:41:19.243613 #3531013] INFO -- : [208/885] 3571884=test_webauthn_listener I, [2024-05-21T00:41:19.332269 #3531013] INFO -- : .Closed file descriptor: WebauthnListenerTest#test_wait_for_otp_code_get_follows_options: 14 I, [2024-05-21T00:41:19.361972 #3531013] INFO -- : [209/885] 3571884=regexp_test I, [2024-05-21T00:41:19.383505 #3531013] INFO -- : [210/885] 3571884=test_yield I, [2024-05-21T00:41:21.526813 #3531013] INFO -- : [211/885] 3571885=test_remote_fetch_error I, [2024-05-21T00:41:21.593064 #3531013] INFO -- : [212/885] 3571885=test_show_source I, [2024-05-21T00:41:21.608779 #3531013] INFO -- : [213/885] 3571885=test_rdoc_stats I, [2024-05-21T00:41:21.668650 #3531013] INFO -- : [214/885] 3571885=test_files_sample I, [2024-05-21T00:41:21.727495 #3531013] INFO -- : [215/885] 3571883=test_data_error I, [2024-05-21T00:41:21.746082 #3531013] INFO -- : [216/885] 3571885=test_rubyoptions I, [2024-05-21T00:41:21.755311 #3531013] INFO -- : [217/885] 3571883=test_optimization I, [2024-05-21T00:41:22.980528 #3531013] INFO -- : [218/885] 3571884=test_force_exit I, [2024-05-21T00:41:22.989361 #3531013] INFO -- : [219/885] 3571884=test_shift_jis I, [2024-05-21T00:41:23.007940 #3531013] INFO -- : [220/885] 3571884=test_rdoc_store I, [2024-05-21T00:41:23.740936 #3531013] INFO -- : [221/885] 3571884=test_gem_uri_formatter I, [2024-05-21T00:41:23.765992 #3531013] INFO -- : [222/885] 3571884=test_prettyprint I, [2024-05-21T00:41:23.789056 #3531013] INFO -- : [223/885] 3571884=test_ole_methods I, [2024-05-21T00:41:23.810592 #3531013] INFO -- : [224/885] 3571884=test_cgi_util I, [2024-05-21T00:41:24.037163 #3531013] INFO -- : [225/885] 3571884=test_clone I, [2024-05-21T00:41:24.222515 #3531013] INFO -- : [226/885] 3571884=test_enc_raise I, [2024-05-21T00:41:24.227677 #3531013] INFO -- : [227/885] 3571884=test_queue I, [2024-05-21T00:41:24.240303 #3531013] INFO -- : [228/885] 3571884=test_gem_resolver_lock_specification I, [2024-05-21T00:41:24.295439 #3531013] INFO -- : [229/885] 3571884=test_boolean I, [2024-05-21T00:41:24.304647 #3531013] INFO -- : [230/885] 3571884=test_gc_compact I, [2024-05-21T00:41:27.430609 #3531013] INFO -- : [231/885] 3571884=test_rdoc_i18n_locale I, [2024-05-21T00:41:27.443089 #3531013] INFO -- : [232/885] 3571884=test_dryrun I, [2024-05-21T00:41:27.466083 #3531013] INFO -- : [233/885] 3571884=test_singleton I, [2024-05-21T00:41:27.476314 #3531013] INFO -- : [234/885] 3571884=test_fstring I, [2024-05-21T00:41:27.590282 #3531013] INFO -- : [235/885] 3571884=test_numeric I, [2024-05-21T00:41:27.591590 #3531013] INFO -- : [236/885] 3571884=test_gem_ext_rake_builder I, [2024-05-21T00:41:28.260347 #3531013] INFO -- : [237/885] 3571885=test_rdoc_require I, [2024-05-21T00:41:28.264123 #3531013] INFO -- : [238/885] 3571885=test_word I, [2024-05-21T00:41:28.275281 #3531013] INFO -- : [239/885] 3571885=test_timeout I, [2024-05-21T00:41:28.285233 #3531013] INFO -- : [240/885] 3571884=test_rdoc_markup_raw I, [2024-05-21T00:41:28.294026 #3531013] INFO -- : [241/885] 3571884=test_key_name_check I, [2024-05-21T00:41:28.306112 #3531013] INFO -- : [242/885] 3571884=test_rdoc_markup_to_bs I, [2024-05-21T00:41:28.384043 #3531013] INFO -- : [243/885] 3571884=test_weakref I, [2024-05-21T00:41:28.630893 #3531013] INFO -- : [244/885] 3571884=test_instrumentation_api I, [2024-05-21T00:41:28.705448 #3531013] INFO -- : [245/885] 3571883=test_rdoc_alias I, [2024-05-21T00:41:28.737630 #3531013] INFO -- : [246/885] 3571883=test_gem_commands_stale_command I, [2024-05-21T00:41:28.742648 #3531013] INFO -- : [247/885] 3571883=ruby_parser_test I, [2024-05-21T00:41:28.747976 #3531013] INFO -- : [248/885] 3571883=test_rdoc_markup_to_tt_only I, [2024-05-21T00:41:28.778372 #3531013] INFO -- : [249/885] 3571883=test_ws I, [2024-05-21T00:41:28.798677 #3531013] INFO -- : [250/885] 3571883=json_parser_test I, [2024-05-21T00:41:28.824184 #3531013] INFO -- : [251/885] 3571883=test_date_strftime I, [2024-05-21T00:41:29.264566 #3531013] INFO -- : [252/885] 3571883=test_gem_commands_cert_command I, [2024-05-21T00:41:29.282246 #3531013] INFO -- : [253/885] 3571885=test_class_name_check I, [2024-05-21T00:41:29.378280 #3531013] INFO -- : [254/885] 3571885=test_syntax I, [2024-05-21T00:41:31.232920 #3531013] INFO -- : [255/885] 3571883=test_scalar I, [2024-05-21T00:41:31.237350 #3531013] INFO -- : [256/885] 3571883=test_zsh_completion I, [2024-05-21T00:41:31.243289 #3531013] INFO -- : [257/885] 3571883=test_basicsocket I, [2024-05-21T00:41:31.285931 #3531013] INFO -- : [258/885] 3571883=test_gem_commands_environment_command I, [2024-05-21T00:41:31.347088 #3531013] INFO -- : [259/885] 3571883=test_pkcs7 I, [2024-05-21T00:41:31.509835 #3531013] INFO -- : [260/885] 3571883=test_pack I, [2024-05-21T00:41:31.618129 #3531013] INFO -- : [261/885] 3571884=test_io_buffer I, [2024-05-21T00:41:31.680918 #3531013] INFO -- : [262/885] 3571883=test_rdoc_context_section I, [2024-05-21T00:41:31.692037 #3531013] INFO -- : [263/885] 3571883=test_deprecated I, [2024-05-21T00:41:31.693797 #3531013] INFO -- : [264/885] 3571883=test_optparse I, [2024-05-21T00:41:31.696680 #3531013] INFO -- : [265/885] 3571883=test_exception I, [2024-05-21T00:41:31.709658 #3531013] INFO -- : [266/885] 3571884=test_bash_completion I, [2024-05-21T00:41:31.711986 #3531013] INFO -- : [267/885] 3571884=test_rdoc_markup_to_html_crossref I, [2024-05-21T00:41:32.063716 #3531013] INFO -- : [268/885] 3571884=test_files_test_2 I, [2024-05-21T00:41:34.699899 #3531013] INFO -- : [269/885] 3571883=test_div I, [2024-05-21T00:41:34.713552 #3531013] INFO -- : [270/885] 3571883=test_input_method I, [2024-05-21T00:41:34.736188 #3531013] INFO -- : [271/885] 3571884=test_io I, [2024-05-21T00:41:34.747106 #3531013] INFO -- : [272/885] 3571883=test_rdoc_i18n_text I, [2024-05-21T00:41:34.756877 #3531013] INFO -- : [273/885] 3571883=test_gem_unsatisfiable_dependency_error I, [2024-05-21T00:41:34.773718 #3531013] INFO -- : [274/885] 3571883=test_literal I, [2024-05-21T00:41:34.952038 #3531013] INFO -- : [275/885] 3571884=test_thread I, [2024-05-21T00:41:35.208998 #3531013] INFO -- : [276/885] 3571884=test_gem_security_signer I, [2024-05-21T00:41:35.287099 #3531013] INFO -- : [277/885] 3571883=test_complex2 I, [2024-05-21T00:41:35.298797 #3531013] INFO -- : [278/885] 3571883=test_config I, [2024-05-21T00:41:35.310292 #3531013] INFO -- : [279/885] 3571884=test_gem_util I, [2024-05-21T00:41:35.359560 #3531013] INFO -- : [280/885] 3571883=test_win32ole_typelib I, [2024-05-21T00:41:35.368629 #3531013] INFO -- : [281/885] 3571883=test_pkey I, [2024-05-21T00:41:35.376932 #3531013] INFO -- : [282/885] 3571883=test_external_new I, [2024-05-21T00:41:35.382205 #3531013] INFO -- : [283/885] 3571883=test_bigzero I, [2024-05-21T00:41:35.400725 #3531013] INFO -- : [284/885] 3571883=test_gem_commands_query_command I, [2024-05-21T00:41:35.478947 #3531013] INFO -- : [285/885] 3571884=test_gem_platform I, [2024-05-21T00:41:35.588739 #3531013] INFO -- : [286/885] 3571884=test_ractor I, [2024-05-21T00:41:35.655613 #3531013] INFO -- : [287/885] 3571884=test_null I, [2024-05-21T00:41:35.656726 #3531013] INFO -- : [288/885] 3571884=test_data I, [2024-05-21T00:41:35.669299 #3531013] INFO -- : [289/885] 3571884=test_memory_view I, [2024-05-21T00:41:35.691319 #3531013] INFO -- : [290/885] 3571884=test_multi_irb_commands I, [2024-05-21T00:41:35.729697 #3531013] INFO -- : [291/885] 3571884=test_pkey_dh I, [2024-05-21T00:41:36.048923 #3531013] INFO -- : [292/885] 3571883=test_m17n_comb I, [2024-05-21T00:41:36.233813 #3531013] INFO -- : [293/885] 3571885=test_rdoc_code_object I, [2024-05-21T00:41:36.590338 #3531013] INFO -- : [294/885] 3571885=test_process I, [2024-05-21T00:41:37.051143 #3531013] INFO -- : [295/885] 3571884=test_bmethod I, [2024-05-21T00:41:37.060624 #3531013] INFO -- : [296/885] 3571884=test_gem_source_specific_file I, [2024-05-21T00:41:37.161540 #3531013] INFO -- : [297/885] 3571884=test_euc_kr I, [2024-05-21T00:41:37.163457 #3531013] INFO -- : [298/885] 3571884=test_provider I, [2024-05-21T00:41:37.169460 #3531013] INFO -- : [299/885] 3571884=redundant_return_test I, [2024-05-21T00:41:37.217159 #3531013] INFO -- : [300/885] 3571884=test_rand I, [2024-05-21T00:41:37.536851 #3531013] INFO -- : [301/885] 3571884=test_random_formatter I, [2024-05-21T00:41:37.568908 #3531013] INFO -- : [302/885] 3571884=test_string_processing I, [2024-05-21T00:41:37.575033 #3531013] INFO -- : [303/885] 3571884=test_rdoc_markup_attributes I, [2024-05-21T00:41:37.580863 #3531013] INFO -- : [304/885] 3571884=test_tsort I, [2024-05-21T00:41:37.602665 #3531013] INFO -- : [305/885] 3571884=test_gem_commands_fetch_command I, [2024-05-21T00:41:37.758903 #3531013] INFO -- : [306/885] 3571884=test_typeddata I, [2024-05-21T00:41:37.992818 #3531013] INFO -- : [307/885] 3571884=test_securerandom I, [2024-05-21T00:41:38.004806 #3531013] INFO -- : [308/885] 3571884=test_gem_commands_outdated_command I, [2024-05-21T00:41:38.056562 #3531013] INFO -- : [309/885] 3571884=test_gem_dependency_list I, [2024-05-21T00:41:38.130802 #3531013] INFO -- : [310/885] 3571884=parameters_signature_test I, [2024-05-21T00:41:38.148692 #3531013] INFO -- : [311/885] 3571884=test_rdoc_parser_changelog I, [2024-05-21T00:41:38.217833 #3531013] INFO -- : [312/885] 3571884=test_gem_doctor I, [2024-05-21T00:41:38.274398 #3531013] INFO -- : [313/885] 3571884=json_fixtures_test I, [2024-05-21T00:41:38.280721 #3531013] INFO -- : [314/885] 3571884=test_len I, [2024-05-21T00:41:38.294099 #3531013] INFO -- : [315/885] 3571884=test_rdoc_parser_c I, [2024-05-21T00:41:38.513559 #3531013] INFO -- : [316/885] 3571884=test_kwargs I, [2024-05-21T00:41:38.516712 #3531013] INFO -- : [317/885] 3571884=test_pack I, [2024-05-21T00:41:38.784878 #3531013] INFO -- : [318/885] 3571884=test_io_wait I, [2024-05-21T00:41:38.867918 #3531013] INFO -- : [319/885] 3571883=parse_test I, [2024-05-21T00:41:39.126872 #3531013] INFO -- : [320/885] 3571884=test_rdoc_markup_indented_paragraph I, [2024-05-21T00:41:39.135113 #3531013] INFO -- : [321/885] 3571884=test_rdoc_markup_parser I, [2024-05-21T00:41:39.219481 #3531013] INFO -- : [322/885] 3571884=test_iseq_load I, [2024-05-21T00:41:40.714657 #3531013] INFO -- : [323/885] 3571884=test_stream I, [2024-05-21T00:41:40.730238 #3531013] INFO -- : [324/885] 3571884=test_have_library I, [2024-05-21T00:41:41.091903 #3531013] INFO -- : .Leaked file descriptor: TestProcess#test_seteuid_name: 10 # I, [2024-05-21T00:41:41.119190 #3531013] INFO -- : COMMAND PID USER FD TYPE DEVICE SIZE/OFF NODE NAME I, [2024-05-21T00:41:41.119261 #3531013] INFO -- : ruby 3571885 opc 10r REG 252,0 9253600 13705411 /var/lib/sss/mc/passwd I, [2024-05-21T00:41:41.750932 #3531013] INFO -- : [325/885] 3571884=test_ns_spki I, [2024-05-21T00:41:41.753831 #3531013] INFO -- : [326/885] 3571884=test_require I, [2024-05-21T00:41:41.756374 #3531013] INFO -- : [327/885] 3571884=test_stringify_symbols I, [2024-05-21T00:41:41.784783 #3531013] INFO -- : [328/885] 3571884=test_objspace I, [2024-05-21T00:41:41.985998 #3531013] INFO -- : [329/885] 3571883=test_rdoc_text I, [2024-05-21T00:41:42.009158 #3531013] INFO -- : [330/885] 3571883=library_symbols_test I, [2024-05-21T00:41:42.042312 #3531013] INFO -- : [331/885] 3571883=test_httpresponses I, [2024-05-21T00:41:42.052651 #3531013] INFO -- : [332/885] 3571883=test_deprecate I, [2024-05-21T00:41:42.095088 #3531013] INFO -- : [333/885] 3571883=test_rdoc_constant I, [2024-05-21T00:41:42.186955 #3531013] INFO -- : [334/885] 3571883=test_generic I, [2024-05-21T00:41:42.222174 #3531013] INFO -- : [335/885] 3571883=test_common I, [2024-05-21T00:41:42.392655 #3531013] INFO -- : [336/885] 3571883=test_rdoc_markup_to_html_snippet I, [2024-05-21T00:41:42.463202 #3531013] INFO -- : [337/885] 3571883=test_rdoc_encoding I, [2024-05-21T00:41:42.504554 #3531013] INFO -- : [338/885] 3571883=test_win32ole_variant_outarg I, [2024-05-21T00:41:42.517681 #3531013] INFO -- : [339/885] 3571883=test_key_actor_vi I, [2024-05-21T00:41:42.701728 #3531013] INFO -- : [340/885] 3571883=test_postponed_job I, [2024-05-21T00:41:42.982447 #3531013] INFO -- : [341/885] 3571883=test_gem_request_set_lockfile I, [2024-05-21T00:41:43.478560 #3531013] INFO -- : [342/885] 3571883=test_rdoc_markdown I, [2024-05-21T00:41:43.760599 #3531013] INFO -- : [343/885] 3571883=test_gem_ext_cargo_builder I, [2024-05-21T00:41:43.805823 #3531013] INFO -- : [344/885] 3571883=test_proc I, [2024-05-21T00:41:44.608805 #3531013] INFO -- : Leaked file descriptor: TestProcess#test_uid_from_name: 11 # I, [2024-05-21T00:41:44.638089 #3531013] INFO -- : COMMAND PID USER FD TYPE DEVICE SIZE/OFF NODE NAME I, [2024-05-21T00:41:44.638162 #3531013] INFO -- : ruby 3571885 opc 11u unix 0x0000000000000000 0t0 3072557618 type=STREAM I, [2024-05-21T00:41:44.682558 #3531013] INFO -- : [345/885] 3571883=test_console_attr I, [2024-05-21T00:41:44.690889 #3531013] INFO -- : [346/885] 3571883=test_gem_commands_unpack_command I, [2024-05-21T00:41:45.126362 #3531013] INFO -- : [347/885] 3571883=test_zlib I, [2024-05-21T00:41:53.130453 #3531013] INFO -- : [348/885] 3571883=test_rdoc_options I, [2024-05-21T00:41:53.389510 #3531013] INFO -- : [349/885] 3571883=test_ubf_async_safe I, [2024-05-21T00:41:53.402925 #3531013] INFO -- : [350/885] 3571883=test_pstore I, [2024-05-21T00:41:53.620508 #3531013] INFO -- : [351/885] 3571883=test_rdoc_include I, [2024-05-21T00:41:53.657268 #3531013] INFO -- : [352/885] 3571883=test_win32ole_record I, [2024-05-21T00:41:53.667988 #3531013] INFO -- : [353/885] 3571883=test_gem_version_option I, [2024-05-21T00:41:53.719580 #3531013] INFO -- : [354/885] 3571883=test_date_compat I, [2024-05-21T00:41:53.734431 #3531013] INFO -- : [355/885] 3571883=test_gem_package_tar_reader_entry I, [2024-05-21T00:41:53.960033 #3531013] INFO -- : [356/885] 3571883=test_resource I, [2024-05-21T00:41:53.972700 #3531013] INFO -- : [357/885] 3571883=test_gem_uri I, [2024-05-21T00:41:54.003901 #3531013] INFO -- : [358/885] 3571883=test_bug-5832 I, [2024-05-21T00:41:54.017568 #3531013] INFO -- : [359/885] 3571883=test_yield_block I, [2024-05-21T00:41:54.076003 #3531013] INFO -- : [360/885] 3571883=test_c_struct_builder I, [2024-05-21T00:41:54.306743 #3531013] INFO -- : [361/885] 3571883=test_path_to_class I, [2024-05-21T00:41:54.313080 #3531013] INFO -- : [362/885] 3571883=test_enumerator I, [2024-05-21T00:41:54.322063 #3531013] INFO -- : [363/885] 3571883=test_reqarg I, [2024-05-21T00:41:54.629243 #3531013] INFO -- : [364/885] 3571883=test_frozen_error I, [2024-05-21T00:41:54.645401 #3531013] INFO -- : [365/885] 3571883=test_gem_ext_ext_conf_builder I, [2024-05-21T00:41:54.793745 #3531013] INFO -- : [366/885] 3571885=test_gem_version I, [2024-05-21T00:41:54.931924 #3531013] INFO -- : [367/885] 3571885=test_spell_checker I, [2024-05-21T00:41:54.943689 #3531013] INFO -- : [368/885] 3571885=test_win32ole_method_event I, [2024-05-21T00:41:54.954456 #3531013] INFO -- : [369/885] 3571885=test_tcp I, [2024-05-21T00:41:55.037275 #3531013] INFO -- : [370/885] 3571885=parse_comments_test I, [2024-05-21T00:41:55.045778 #3531013] INFO -- : [371/885] 3571885=test_rdoc_markup_to_table_of_contents I, [2024-05-21T00:41:55.095495 #3531013] INFO -- : [372/885] 3571885=test_gem_name_tuple I, [2024-05-21T00:41:55.164058 #3531013] INFO -- : [373/885] 3571885=test_integer I, [2024-05-21T00:41:55.174807 #3531013] INFO -- : [374/885] 3571885=test_gem_requirement I, [2024-05-21T00:41:55.318520 #3531013] INFO -- : [375/885] 3571885=test_macro I, [2024-05-21T00:41:55.383074 #3531013] INFO -- : [376/885] 3571885=test_string I, [2024-05-21T00:41:55.739103 #3531013] INFO -- : [377/885] 3571883=test_pipe I, [2024-05-21T00:41:55.858826 #3531013] INFO -- : [378/885] 3571883=test_gem_resolver_activation_request I, [2024-05-21T00:41:55.877014 #3531013] INFO -- : [379/885] 3571883=test_function I, [2024-05-21T00:41:56.109579 #3531013] INFO -- : [380/885] 3571883=test_gem_commands_server_command I, [2024-05-21T00:41:56.164460 #3531013] INFO -- : [381/885] 3571883=test_hmac I, [2024-05-21T00:41:56.174323 #3531013] INFO -- : [382/885] 3571883=test_encoding I, [2024-05-21T00:41:56.361821 #3531013] INFO -- : [383/885] 3571883=test_rdoc_generator_markup I, [2024-05-21T00:41:56.648116 #3531013] INFO -- : [384/885] 3571883=test_constant I, [2024-05-21T00:41:58.269076 #3531013] INFO -- : [385/885] 3571883=test_find I, [2024-05-21T00:41:58.288977 #3531013] INFO -- : [386/885] 3571883=test_rat I, [2024-05-21T00:41:58.307263 #3531013] INFO -- : [387/885] 3571883=test_init I, [2024-05-21T00:41:58.627076 #3531013] INFO -- : [388/885] 3571883=test_gem_request_connection_pools I, [2024-05-21T00:41:59.777758 #3531013] INFO -- : [389/885] 3571883=test_flags I, [2024-05-21T00:42:00.313634 #3531013] INFO -- : [390/885] 3571883=test_yamlstore I, [2024-05-21T00:42:00.337317 #3531013] INFO -- : [391/885] 3571883=test_bug-3571 I, [2024-05-21T00:42:00.349916 #3531013] INFO -- : [392/885] 3571883=test_numeric I, [2024-05-21T00:42:00.432918 #3531013] INFO -- : [393/885] 3571883=test_time I, [2024-05-21T00:42:00.548015 #3531013] INFO -- : [394/885] 3571883=test_file I, [2024-05-21T00:42:00.555813 #3531013] INFO -- : [395/885] 3571883=test_capacity I, [2024-05-21T00:42:00.569874 #3531013] INFO -- : [396/885] 3571883=test_nextafter I, [2024-05-21T00:42:00.670041 #3531013] INFO -- : [397/885] 3571883=test_gem_commands_owner_command I, [2024-05-21T00:42:01.320794 #3531013] INFO -- : [398/885] 3571883=test_string I, [2024-05-21T00:42:01.341700 #3531013] INFO -- : [399/885] 3571883=json_common_interface_test I, [2024-05-21T00:42:01.368864 #3531013] INFO -- : [400/885] 3571883=test_rdoc_any_method I, [2024-05-21T00:42:01.766650 #3531013] INFO -- : [401/885] 3571883=test_error_highlight I, [2024-05-21T00:42:02.407534 #3531013] INFO -- : [402/885] 3571883=test_function_entry I, [2024-05-21T00:42:02.418771 #3531013] INFO -- : [403/885] 3571883=test_complexrational I, [2024-05-21T00:42:02.420903 #3531013] INFO -- : [404/885] 3571883=test_raise I, [2024-05-21T00:42:02.427254 #3531013] INFO -- : [405/885] 3571883=version_test I, [2024-05-21T00:42:02.501562 #3531013] INFO -- : [406/885] 3571883=test_files_lib I, [2024-05-21T00:42:05.390955 #3531013] INFO -- : [407/885] 3571883=test_string_memory I, [2024-05-21T00:42:05.546950 #3531013] INFO -- : [408/885] 3571883=test_help I, [2024-05-21T00:42:05.551555 #3531013] INFO -- : [409/885] 3571883=test_enumerator_kw I, [2024-05-21T00:42:05.561466 #3531013] INFO -- : [410/885] 3571883=test_line_editor I, [2024-05-21T00:42:05.567084 #3531013] INFO -- : [411/885] 3571883=test_marshalable I, [2024-05-21T00:42:05.577959 #3531013] INFO -- : [412/885] 3571883=reflection_test I, [2024-05-21T00:42:05.586469 #3531013] INFO -- : [413/885] 3571883=test_erb_m17n I, [2024-05-21T00:42:05.596674 #3531013] INFO -- : [414/885] 3571883=test_rdoc_generator_pot_po_entry I, [2024-05-21T00:42:05.604794 #3531013] INFO -- : [415/885] 3571883=test_timeout I, [2024-05-21T00:42:05.616979 #3531013] INFO -- : [416/885] 3571883=test_webauthn_poller I, [2024-05-21T00:42:05.769994 #3531013] INFO -- : [417/885] 3571883=test_rdoc_markup_verbatim I, [2024-05-21T00:42:05.777846 #3531013] INFO -- : [418/885] 3571883=test_date_conv I, [2024-05-21T00:42:05.783168 #3531013] INFO -- : [419/885] 3571883=test_serialize_subclasses I, [2024-05-21T00:42:05.794184 #3531013] INFO -- : [420/885] 3571883=test_gem_resolver_index_specification I, [2024-05-21T00:42:05.847502 #3531013] INFO -- : [421/885] 3571883=test_frozen I, [2024-05-21T00:42:05.914772 #3531013] INFO -- : [422/885] 3571883=test_egrep_cpp I, [2024-05-21T00:42:05.967638 #3531013] INFO -- : [423/885] 3571883=test_tree_builder I, [2024-05-21T00:42:05.972869 #3531013] INFO -- : [424/885] 3571883=test_protect I, [2024-05-21T00:42:05.978042 #3531013] INFO -- : [425/885] 3571883=test_big5 I, [2024-05-21T00:42:05.984838 #3531013] INFO -- : [426/885] 3571883=test_date I, [2024-05-21T00:42:06.019557 #3531013] INFO -- : [427/885] 3571883=test_gem_commands_update_command I, [2024-05-21T00:42:07.639599 #3531013] INFO -- : [428/885] 3571883=test_pathname I, [2024-05-21T00:42:07.857974 #3531013] INFO -- : [429/885] 3571883=test_fnmatch I, [2024-05-21T00:42:07.908747 #3531013] INFO -- : [430/885] 3571883=test_store I, [2024-05-21T00:42:08.252913 #3531013] INFO -- : [431/885] 3571883=test_rdoc_markup_pre_process I, [2024-05-21T00:42:08.360728 #3531013] INFO -- : [432/885] 3571883=test_tempfile I, [2024-05-21T00:42:08.579189 #3531013] INFO -- : [433/885] 3571883=test_http_request I, [2024-05-21T00:42:08.604681 #3531013] INFO -- : [434/885] 3571883=test_coverage I, [2024-05-21T00:42:09.217820 #3531013] INFO -- : [435/885] 3571883=test_io_buffer I, [2024-05-21T00:42:09.329613 #3531013] INFO -- : [436/885] 3571883=test_ldap I, [2024-05-21T00:42:09.337738 #3531013] INFO -- : [437/885] 3571883=test_kdf I, [2024-05-21T00:42:09.410944 #3531013] INFO -- : [438/885] 3571883=test_thread_queue I, [2024-05-21T00:42:15.212609 #3531013] INFO -- : [439/885] 3571885=test_nowrite I, [2024-05-21T00:42:15.233146 #3531013] INFO -- : [440/885] 3571885=test_defined I, [2024-05-21T00:42:15.308406 #3531013] INFO -- : [441/885] 3571885=test_passing_block I, [2024-05-21T00:42:15.312996 #3531013] INFO -- : [442/885] 3571885=json_string_matching_test I, [2024-05-21T00:42:15.323492 #3531013] INFO -- : [443/885] 3571885=test_gem_config_file I, [2024-05-21T00:42:15.495327 #3531013] INFO -- : [444/885] 3571885=test_comparable I, [2024-05-21T00:42:15.513181 #3531013] INFO -- : [445/885] 3571885=test_rdoc_rdoc I, [2024-05-21T00:42:15.565925 #3531013] INFO -- : [446/885] 3571885=test_yjit_exit_locations I, [2024-05-21T00:42:15.601478 #3531013] INFO -- : [447/885] 3571885=test_rdoc_markdown_test I, [2024-05-21T00:42:15.655184 #3531013] INFO -- : [448/885] 3571884=test_type_completor I, [2024-05-21T00:42:15.674879 #3531013] INFO -- : [449/885] 3571884=test_rdoc_normal_module I, [2024-05-21T00:42:15.710902 #3531013] INFO -- : [450/885] 3571884=test_io_timeout I, [2024-05-21T00:42:15.728711 #3531013] INFO -- : [451/885] 3571884=test_gem_commands_yank_command I, [2024-05-21T00:42:15.785549 #3531013] INFO -- : [452/885] 3571883=test_yaml_tree I, [2024-05-21T00:42:15.805182 #3531013] INFO -- : [453/885] 3571883=test_cstr I, [2024-05-21T00:42:16.242155 #3531013] INFO -- : [454/885] 3571884=test_gem_resolver_dependency_request I, [2024-05-21T00:42:16.280675 #3531013] INFO -- : [455/885] 3571884=test_command I, [2024-05-21T00:42:16.573786 #3531013] INFO -- : [456/885] 3571884=test_euc_tw I, [2024-05-21T00:42:16.580192 #3531013] INFO -- : [457/885] 3571884=test_big2str I, [2024-05-21T00:42:16.591601 #3531013] INFO -- : [458/885] 3571884=test_gem_resolver_specification I, [2024-05-21T00:42:16.623334 #3531013] INFO -- : [459/885] 3571884=test_logger I, [2024-05-21T00:42:16.646564 #3531013] INFO -- : [460/885] 3571884=test_pkey_dsa I, [2024-05-21T00:42:16.748950 #3531013] INFO -- : [461/885] 3571885=test_wait I, [2024-05-21T00:42:16.836347 #3531013] INFO -- : [462/885] 3571885=test_import I, [2024-05-21T00:42:17.647437 #3531013] INFO -- : [463/885] 3571883=test_human_typo I, [2024-05-21T00:42:17.658618 #3531013] INFO -- : [464/885] 3571883=test_psych I, [2024-05-21T00:42:17.681483 #3531013] INFO -- : [465/885] 3571883=test_nil I, [2024-05-21T00:42:17.715815 #3531013] INFO -- : [466/885] 3571883=test_readpartial I, [2024-05-21T00:42:18.102403 #3531013] INFO -- : [467/885] 3571883=test_httpresponse I, [2024-05-21T00:42:18.148154 #3531013] INFO -- : [468/885] 3571883=test_rdoc_parser_ruby I, [2024-05-21T00:42:18.585392 #3531013] INFO -- : [469/885] 3571885=test_x509req I, [2024-05-21T00:42:18.606132 #3531013] INFO -- : [470/885] 3571885=test_gem_console_ui I, [2024-05-21T00:42:18.617362 #3531013] INFO -- : [471/885] 3571885=test_ifunless I, [2024-05-21T00:42:18.624970 #3531013] INFO -- : [472/885] 3571885=test_allocation I, [2024-05-21T00:42:18.842842 #3531013] INFO -- : [473/885] 3571883=test_insns_leaf I, [2024-05-21T00:42:18.847691 #3531013] INFO -- : [474/885] 3571883=test_modify_expand I, [2024-05-21T00:42:18.864025 #3531013] INFO -- : [475/885] 3571883=test_gem_available_set I, [2024-05-21T00:42:18.969345 #3531013] INFO -- : [476/885] 3571883=test_pkg_config I, [2024-05-21T00:42:19.022296 #3531013] INFO -- : [477/885] 3571883=test_convertible I, [2024-05-21T00:42:19.703437 #3531013] INFO -- : [478/885] 3571884=errors_test I, [2024-05-21T00:42:19.817554 #3531013] INFO -- : [479/885] 3571884=json_encoding_test I, [2024-05-21T00:42:19.820684 #3531013] INFO -- : [480/885] 3571884=test_vm_dump I, [2024-05-21T00:42:19.876057 #3531013] INFO -- : [481/885] 3571884=test_func I, [2024-05-21T00:42:21.090080 #3531013] INFO -- : [482/885] 3571885=test_config I, [2024-05-21T00:42:21.172164 #3531013] INFO -- : [483/885] 3571885=test_gem_resolver I, [2024-05-21T00:42:21.457008 #3531013] INFO -- : [484/885] 3571885=test_gem_source_vendor I, [2024-05-21T00:42:21.472835 #3531013] INFO -- : [485/885] 3571885=test_object I, [2024-05-21T00:42:21.776695 #3531013] INFO -- : [486/885] 3571885=test_dln I, [2024-05-21T00:42:21.790472 #3531013] INFO -- : [487/885] 3571885=test_gem_commands_exec_command I, [2024-05-21T00:42:22.589695 #3531013] INFO -- : [488/885] 3571883=unescape_test I, [2024-05-21T00:42:23.146342 #3531013] INFO -- : [489/885] 3571885=test_super I, [2024-05-21T00:42:23.724418 #3531013] INFO -- : [490/885] 3571884=test_color_printer I, [2024-05-21T00:42:23.756555 #3531013] INFO -- : [491/885] 3571884=test_gem_ext_cmake_builder I, [2024-05-21T00:42:23.766606 #3531013] INFO -- : [492/885] 3571884=test_digest_extend I, [2024-05-21T00:42:23.810090 #3531013] INFO -- : [493/885] 3571884=test_last_thread I, [2024-05-21T00:42:23.966575 #3531013] INFO -- : [494/885] 3571883=test_thread_fd_close I, [2024-05-21T00:42:23.972659 #3531013] INFO -- : [495/885] 3571883=test_getopts I, [2024-05-21T00:42:23.979039 #3531013] INFO -- : [496/885] 3571883=test_emitter I, [2024-05-21T00:42:24.061884 #3531013] INFO -- : [497/885] 3571883=test_fips I, [2024-05-21T00:42:24.255320 #3531013] INFO -- : [498/885] 3571883=test_alias I, [2024-05-21T00:42:24.373188 #3531013] INFO -- : [499/885] 3571885=test_compile_prism I, [2024-05-21T00:42:24.386069 #3531013] INFO -- : [500/885] 3571883=test_helper I, [2024-05-21T00:42:24.389436 #3531013] INFO -- : [501/885] 3571883=test_win32ole_event I, [2024-05-21T00:42:24.393149 #3531013] INFO -- : [502/885] 3571883=test_gem_commands_uninstall_command I, [2024-05-21T00:42:24.652861 #3531013] INFO -- : [503/885] 3571885=test_rdoc_markup_formatter I, [2024-05-21T00:42:24.671148 #3531013] INFO -- : [504/885] 3571885=test_dns I, [2024-05-21T00:42:24.878496 #3531013] INFO -- : [505/885] 3571884=test_c_union_entity I, [2024-05-21T00:42:24.972698 #3531013] INFO -- : [506/885] 3571884=test_cgi_session I, [2024-05-21T00:42:24.993963 #3531013] INFO -- : [507/885] 3571884=test_notimplement I, [2024-05-21T00:42:25.016974 #3531013] INFO -- : [508/885] 3571884=test_x509crl I, [2024-05-21T00:42:25.109253 #3531013] INFO -- : [509/885] 3571884=test_rdoc_markup_heading I, [2024-05-21T00:42:25.115381 #3531013] INFO -- : [510/885] 3571884=test_flip I, [2024-05-21T00:42:25.132753 #3531013] INFO -- : [511/885] 3571885=test_io_console I, [2024-05-21T00:42:25.165433 #3531013] INFO -- : [512/885] 3571884=test_pattern_key_name_check I, [2024-05-21T00:42:25.172340 #3531013] INFO -- : [513/885] 3571884=test_profile_frames I, [2024-05-21T00:42:25.228156 #3531013] INFO -- : [514/885] 3571883=test_debug I, [2024-05-21T00:42:25.276095 #3531013] INFO -- : [515/885] 3571883=test_refinement I, [2024-05-21T00:42:25.343964 #3531013] INFO -- : [516/885] 3571884=test_transcode I, [2024-05-21T00:42:25.589058 #3531013] INFO -- : [517/885] 3571884=test_class2name I, [2024-05-21T00:42:25.626170 #3531013] INFO -- : [518/885] 3571884=test_gem_commands_cleanup_command I, [2024-05-21T00:42:26.179813 #3531013] INFO -- : [519/885] 3571884=test_rdoc_markup_to_html I, [2024-05-21T00:42:26.268102 #3531013] INFO -- : [520/885] 3571884=test_foreach I, [2024-05-21T00:42:26.274625 #3531013] INFO -- : [521/885] 3571884=test_append I, [2024-05-21T00:42:26.296053 #3531013] INFO -- : [522/885] 3571884=test_gem_resolver_installer_set I, [2024-05-21T00:42:26.531291 #3531013] INFO -- : [523/885] 3571884=test_emitter I, [2024-05-21T00:42:26.539646 #3531013] INFO -- : [524/885] 3571884=test_x509ext I, [2024-05-21T00:42:26.550631 #3531013] INFO -- : [525/885] 3571884=bom_test I, [2024-05-21T00:42:26.566817 #3531013] INFO -- : [526/885] 3571884=test_file I, [2024-05-21T00:42:27.864615 #3531013] INFO -- : [527/885] 3571885=test_config I, [2024-05-21T00:42:28.193045 #3531013] INFO -- : [528/885] 3571885=test_helper_method I, [2024-05-21T00:42:28.205435 #3531013] INFO -- : [529/885] 3571885=test_summary I, [2024-05-21T00:42:28.352870 #3531013] INFO -- : [530/885] 3571885=test_scalar_scanner I, [2024-05-21T00:42:28.365841 #3531013] INFO -- : [531/885] 3571885=test_lambda I, [2024-05-21T00:42:28.426575 #3531013] INFO -- : [532/885] 3571885=test_rb_str_dup I, [2024-05-21T00:42:28.435738 #3531013] INFO -- : [533/885] 3571885=test_trace I, [2024-05-21T00:42:28.446340 #3531013] INFO -- : [534/885] 3571885=test_arity I, [2024-05-21T00:42:28.455569 #3531013] INFO -- : [535/885] 3571885=test_gem_path_support I, [2024-05-21T00:42:28.524371 #3531013] INFO -- : [536/885] 3571885=test_keyword I, [2024-05-21T00:42:28.815270 #3531013] INFO -- : [537/885] 3571883=test_win32ole_type_event I, [2024-05-21T00:42:28.989305 #3531013] INFO -- : [538/885] 3571883=test_bug_reporter I, [2024-05-21T00:42:29.048941 #3531013] INFO -- : [539/885] 3571885=test_gem_installer I, [2024-05-21T00:42:29.056274 #3531013] INFO -- : [540/885] 3571883=test_buffered_io I, [2024-05-21T00:42:29.058165 #3531013] INFO -- : [541/885] 3571883=test_ossl I, [2024-05-21T00:42:32.765195 #3531013] INFO -- : [542/885] 3571884=test_ruby_lex I, [2024-05-21T00:42:32.877652 #3531013] INFO -- : [543/885] 3571884=test_arith_seq_extract I, [2024-05-21T00:42:32.896063 #3531013] INFO -- : [544/885] 3571884=compiler_test I, [2024-05-21T00:42:32.938862 #3531013] INFO -- : [545/885] 3571884=test_gem_source_subpath_problem I, [2024-05-21T00:42:33.027852 #3531013] INFO -- : [546/885] 3571884=test_object_references I, [2024-05-21T00:42:33.046639 #3531013] INFO -- : [547/885] 3571884=test_eval I, [2024-05-21T00:42:33.371098 #3531013] INFO -- : [548/885] 3571884=test_beginendblock I, [2024-05-21T00:42:33.648711 #3531013] INFO -- : [549/885] 3571884=test_monitor I, [2024-05-21T00:42:33.703410 #3531013] INFO -- : [550/885] 3571885=test_whileuntil I, [2024-05-21T00:42:33.721352 #3531013] INFO -- : [551/885] 3571885=test_regexp I, [2024-05-21T00:42:33.869624 #3531013] INFO -- : [552/885] 3571884=test_nofree I, [2024-05-21T00:42:33.888164 #3531013] INFO -- : [553/885] 3571884=test_pointer I, [2024-05-21T00:42:35.232690 #3531013] INFO -- : [554/885] 3571884=test_rdoc_normal_class I, [2024-05-21T00:42:35.286560 #3531013] INFO -- : [555/885] 3571884=test_within_pipe I, [2024-05-21T00:42:35.303986 #3531013] INFO -- : [556/885] 3571884=test_addr I, [2024-05-21T00:42:35.319675 #3531013] INFO -- : [557/885] 3571884=test_mailto I, [2024-05-21T00:42:35.330805 #3531013] INFO -- : [558/885] 3571884=test_kill_ring I, [2024-05-21T00:42:35.338056 #3531013] INFO -- : [559/885] 3571884=test_member I, [2024-05-21T00:42:35.347146 #3531013] INFO -- : [560/885] 3571884=test_object I, [2024-05-21T00:42:35.358321 #3531013] INFO -- : [561/885] 3571884=format_errors_test I, [2024-05-21T00:42:35.370684 #3531013] INFO -- : [562/885] 3571884=test_cgi_header I, [2024-05-21T00:42:35.382214 #3531013] INFO -- : [563/885] 3571884=test_case_options I, [2024-05-21T00:42:35.382953 #3531013] INFO -- : [564/885] 3571884=test_helper I, [2024-05-21T00:42:35.388947 #3531013] INFO -- : [565/885] 3571884=test_duplicate I, [2024-05-21T00:42:35.404859 #3531013] INFO -- : [566/885] 3571884=test_gem_resolver_api_set I, [2024-05-21T00:42:35.474665 #3531013] INFO -- : [567/885] 3571884=test_reline I, [2024-05-21T00:42:35.745407 #3531013] INFO -- : [568/885] 3571884=test_call I, [2024-05-21T00:42:35.984044 #3531013] INFO -- : [569/885] 3571884=test_ellipsize I, [2024-05-21T00:42:36.018904 #3531013] INFO -- : [570/885] 3571884=test_gem_commands_build_command I, [2024-05-21T00:42:36.315746 #3531013] INFO -- : [571/885] 3571884=test_windows_1251 I, [2024-05-21T00:42:36.327504 #3531013] INFO -- : [572/885] 3571884=test_gem_ext_builder I, [2024-05-21T00:42:36.453899 #3531013] INFO -- : [573/885] 3571883=test_to_ary_concat I, [2024-05-21T00:42:37.360982 #3531013] INFO -- : [574/885] 3571884=test_history I, [2024-05-21T00:42:37.384738 #3531013] INFO -- : [575/885] 3571884=test_time_tz I, [2024-05-21T00:42:37.500821 #3531013] INFO -- : [576/885] 3571884=test_addrinfo I, [2024-05-21T00:42:37.538063 #3531013] INFO -- : [577/885] 3571884=test_to_ruby I, [2024-05-21T00:42:37.548849 #3531013] INFO -- : [578/885] 3571884=test_data I, [2024-05-21T00:42:37.616561 #3531013] INFO -- : [579/885] 3571884=test_bug-14834 I, [2024-05-21T00:42:37.626285 #3531013] INFO -- : [580/885] 3571884=test_inlinecache I, [2024-05-21T00:42:37.687904 #3531013] INFO -- : [581/885] 3571884=test_socket I, [2024-05-21T00:42:38.596074 #3531013] INFO -- : [582/885] 3571884=test_terminfo I, [2024-05-21T00:42:38.613242 #3531013] INFO -- : [583/885] 3571884=test_thread I, [2024-05-21T00:42:40.274203 #3531013] INFO -- : [584/885] 3571883=constant_path_node_test I, [2024-05-21T00:42:40.281331 #3531013] INFO -- : [585/885] 3571883=test_set_len I, [2024-05-21T00:42:40.286695 #3531013] INFO -- : [586/885] 3571883=test_interned_str I, [2024-05-21T00:42:40.289622 #3531013] INFO -- : [587/885] 3571883=test_folderitem2_invokeverb I, [2024-05-21T00:42:40.311826 #3531013] INFO -- : [588/885] 3571883=test_pattern_matching I, [2024-05-21T00:42:40.332159 #3531013] INFO -- : [589/885] 3571883=test_gc I, [2024-05-21T00:42:47.414429 #3531013] INFO -- : [590/885] 3571884=test_gem_bundler_version_finder I, [2024-05-21T00:42:47.454907 #3531013] INFO -- : [591/885] 3571884=test_gem_request_set I, [2024-05-21T00:42:48.033968 #3531013] INFO -- : [592/885] 3571884=ruby_api_test I, [2024-05-21T00:42:48.242451 #3531013] INFO -- : [593/885] 3571884=test_gem_resolver_index_set I, [2024-05-21T00:42:49.152629 #3531013] INFO -- : [594/885] 3571884=test_sleep I, [2024-05-21T00:42:50.079680 #3531013] INFO -- : [595/885] 3571883=test_webauthn_listener_response I, [2024-05-21T00:42:50.150737 #3531013] INFO -- : [596/885] 3571883=test_ensured I, [2024-05-21T00:42:50.156813 #3531013] INFO -- : [597/885] 3571883=test_euc_jp I, [2024-05-21T00:42:50.163584 #3531013] INFO -- : [598/885] 3571883=test_rdoc_markup I, [2024-05-21T00:42:50.179129 #3531013] INFO -- : [599/885] 3571883=test_key_stroke I, [2024-05-21T00:42:50.188448 #3531013] INFO -- : [600/885] 3571883=test_alias_and_anchor I, [2024-05-21T00:42:50.199038 #3531013] INFO -- : [601/885] 3571883=test_time I, [2024-05-21T00:42:50.404562 #3531013] INFO -- : [602/885] 3571883=test_popen_deadlock I, [2024-05-21T00:42:50.946830 #3531013] INFO -- : [603/885] 3571883=test_project_sanity I, [2024-05-21T00:42:50.954729 #3531013] INFO -- : [604/885] 3571883=test_symbol I, [2024-05-21T00:42:50.965825 #3531013] INFO -- : [605/885] 3571883=location_test I, [2024-05-21T00:42:51.080963 #3531013] INFO -- : [606/885] 3571883=test_chilled I, [2024-05-21T00:42:51.090167 #3531013] INFO -- : [607/885] 3571883=test_delegate I, [2024-05-21T00:42:51.106355 #3531013] INFO -- : [608/885] 3571883=test_address_resolve I, [2024-05-21T00:42:51.122374 #3531013] INFO -- : [609/885] 3571883=test_stream I, [2024-05-21T00:42:51.142067 #3531013] INFO -- : [610/885] 3571883=test_trick I, [2024-05-21T00:42:53.340852 #3531013] INFO -- : [611/885] 3571884=test_ractor I, [2024-05-21T00:42:53.350384 #3531013] INFO -- : [612/885] 3571884=test_rdoc_attr I, [2024-05-21T00:42:53.366577 #3531013] INFO -- : [613/885] 3571884=test_locale I, [2024-05-21T00:42:53.404591 #3531013] INFO -- : [614/885] 3571884=test_ts I, [2024-05-21T00:42:53.616098 #3531013] INFO -- : [615/885] 3571883=test_rbconfig I, [2024-05-21T00:42:53.686985 #3531013] INFO -- : [616/885] 3571883=test_num2int I, [2024-05-21T00:42:53.693714 #3531013] INFO -- : [617/885] 3571884=test_extlibs I, [2024-05-21T00:42:53.700182 #3531013] INFO -- : [618/885] 3571883=test_iter_break I, [2024-05-21T00:42:53.716446 #3531013] INFO -- : [619/885] 3571883=test_range I, [2024-05-21T00:42:54.465331 #3531013] INFO -- : [620/885] 3571883=test_gem_commands_signin_command I, [2024-05-21T00:42:54.623371 #3531013] INFO -- : [621/885] 3571883=test_recursion I, [2024-05-21T00:42:54.645620 #3531013] INFO -- : [622/885] 3571883=test_require I, [2024-05-21T00:42:55.275587 #3531013] INFO -- : [623/885] 3571884=test_rdoc_markup_include I, [2024-05-21T00:42:55.297478 #3531013] INFO -- : [624/885] 3571884=test_enum I, [2024-05-21T00:42:55.985510 #3531013] INFO -- : [625/885] 3571883=test_gem_commands_contents_command I, [2024-05-21T00:42:56.100776 #3531013] INFO -- : [626/885] 3571883=test_udp I, [2024-05-21T00:42:56.147386 #3531013] INFO -- : [627/885] 3571883=test_context I, [2024-05-21T00:42:56.279603 #3531013] INFO -- : [628/885] 3571883=test_gem_commands_search_command I, [2024-05-21T00:42:56.306465 #3531013] INFO -- : [629/885] 3571883=test_symbol I, [2024-05-21T00:42:56.355009 #3531013] INFO -- : [630/885] 3571884=test_coder I, [2024-05-21T00:42:56.361545 #3531013] INFO -- : [631/885] 3571884=test_rdoc_servlet I, [2024-05-21T00:42:56.451802 #3531013] INFO -- : [632/885] 3571884=test_formatter I, [2024-05-21T00:42:56.478112 #3531013] INFO -- : [633/885] 3571884=test_unix I, [2024-05-21T00:42:56.522361 #3531013] INFO -- : [634/885] 3571884=test_integer I, [2024-05-21T00:42:56.776175 #3531013] INFO -- : [635/885] 3571885=test_date_marshal I, [2024-05-21T00:42:57.070750 #3531013] INFO -- : [636/885] 3571885=test_have_func I, [2024-05-21T00:42:58.148982 #3531013] INFO -- : [637/885] 3571885=test_gem_resolver_local_specification I, [2024-05-21T00:42:58.175568 #3531013] INFO -- : [638/885] 3571885=test_configuration I, [2024-05-21T00:42:58.266617 #3531013] INFO -- : [639/885] 3571885=test_date_new I, [2024-05-21T00:42:58.282940 #3531013] INFO -- : [640/885] 3571885=test_gem_commands_list_command I, [2024-05-21T00:42:58.304320 #3531013] INFO -- : [641/885] 3571885=test_gem_resolver_conflict I, [2024-05-21T00:42:58.405332 #3531013] INFO -- : [642/885] 3571885=test_ractor I, [2024-05-21T00:42:58.696695 #3531013] INFO -- : [643/885] 3571885=test_scheduler I, [2024-05-21T00:42:58.898807 #3531013] INFO -- : [644/885] 3571885=test_gem_commands_help_command I, [2024-05-21T00:42:58.988751 #3531013] INFO -- : [645/885] 3571885=test_ssl I, [2024-05-21T00:42:59.070984 #3531013] INFO -- : [646/885] 3571884=test_enc_str_buf_cat I, [2024-05-21T00:42:59.078065 #3531013] INFO -- : [647/885] 3571885=newline_test I, [2024-05-21T00:42:59.082607 #3531013] INFO -- : [648/885] 3571884=test_bignum I, [2024-05-21T00:42:59.207477 #3531013] INFO -- : [649/885] 3571885=test_rdoc_markup_hard_break I, [2024-05-21T00:42:59.219614 #3531013] INFO -- : [650/885] 3571885=test_marshal I, [2024-05-21T00:43:00.452783 #3531013] INFO -- : [651/885] 3571885=ractor_test I, [2024-05-21T00:43:00.458909 #3531013] INFO -- : [652/885] 3571885=test_ancdata I, [2024-05-21T00:43:00.470397 #3531013] INFO -- : [653/885] 3571885=test_nesting_parser I, [2024-05-21T00:43:00.490298 #3531013] INFO -- : [654/885] 3571885=test_parser I, [2024-05-21T00:43:00.508772 #3531013] INFO -- : [655/885] 3571885=test_rdoc_markup_to_label I, [2024-05-21T00:43:00.559321 #3531013] INFO -- : [656/885] 3571885=test_gem_resolver_best_set I, [2024-05-21T00:43:00.639895 #3531013] INFO -- : [657/885] 3571885=test_cgi_core I, [2024-05-21T00:43:00.644002 #3531013] INFO -- : [658/885] 3571885=test_registry I, [2024-05-21T00:43:00.660810 #3531013] INFO -- : [659/885] 3571885=test_gem I, [2024-05-21T00:43:02.732122 #3531013] INFO -- : [660/885] 3571884=json_generator_test I, [2024-05-21T00:43:02.806908 #3531013] INFO -- : [661/885] 3571883=test_ansi_without_terminfo I, [2024-05-21T00:43:02.811549 #3531013] INFO -- : [662/885] 3571883=test_ractor I, [2024-05-21T00:43:02.830754 #3531013] INFO -- : [663/885] 3571883=test_win32ole_type I, [2024-05-21T00:43:02.844827 #3531013] INFO -- : [664/885] 3571883=test_rdoc_rd_inline_parser I, [2024-05-21T00:43:02.845714 #3531013] INFO -- : [665/885] 3571884=test_load I, [2024-05-21T00:43:02.847765 #3531013] INFO -- : [666/885] 3571884=test_gem_source_lock I, [2024-05-21T00:43:02.869824 #3531013] INFO -- : [667/885] 3571883=test_cipher I, [2024-05-21T00:43:02.899489 #3531013] INFO -- : [668/885] 3571883=test_update I, [2024-05-21T00:43:02.909042 #3531013] INFO -- : [669/885] 3571884=test_new I, [2024-05-21T00:43:02.914032 #3531013] INFO -- : [670/885] 3571885=test_require I, [2024-05-21T00:43:02.916433 #3531013] INFO -- : [671/885] 3571883=test_objectspace I, [2024-05-21T00:43:02.920730 #3531013] INFO -- : [672/885] 3571884=test_debugger_integration I, [2024-05-21T00:43:02.958047 #3531013] INFO -- : [673/885] 3571884=test_gem_resolver_composed_set I, [2024-05-21T00:43:02.972619 #3531013] INFO -- : [674/885] 3571884=test_my_integer I, [2024-05-21T00:43:02.983711 #3531013] INFO -- : [675/885] 3571884=test_tracer I, [2024-05-21T00:43:02.992851 #3531013] INFO -- : [676/885] 3571884=test_cgi_cookie I, [2024-05-21T00:43:02.999570 #3531013] INFO -- : [677/885] 3571884=test_not I, [2024-05-21T00:43:03.022256 #3531013] INFO -- : [678/885] 3571884=test_option I, [2024-05-21T00:43:03.122518 #3531013] INFO -- : [679/885] 3571884=test_wss I, [2024-05-21T00:43:03.132739 #3531013] INFO -- : [680/885] 3571884=test_rdoc_markup_attribute_manager I, [2024-05-21T00:43:03.173220 #3531013] INFO -- : [681/885] 3571884=test_rdoc_rd_block_parser I, [2024-05-21T00:43:03.257195 #3531013] INFO -- : [682/885] 3571884=test_x509store I, [2024-05-21T00:43:03.722309 #3531013] INFO -- : [683/885] 3571884=test_rdoc_rd I, [2024-05-21T00:43:03.729866 #3531013] INFO -- : [684/885] 3571884=test_rdoc_markup_to_joined_paragraph I, [2024-05-21T00:43:03.738414 #3531013] INFO -- : [685/885] 3571884=test_rdoc_markup_to_markdown I, [2024-05-21T00:43:03.786095 #3531013] INFO -- : [686/885] 3571884=test_rdoc_generator_pot I, [2024-05-21T00:43:03.842826 #3531013] INFO -- : [687/885] 3571884=test_require_lib I, [2024-05-21T00:43:03.931015 #3531013] INFO -- : [688/885] 3571883=test_gem_gem_runner I, [2024-05-21T00:43:03.996216 #3531013] INFO -- : [689/885] 3571883=test_metaclass I, [2024-05-21T00:43:04.003760 #3531013] INFO -- : [690/885] 3571883=test_gem_package_task I, [2024-05-21T00:43:04.053866 #3531013] INFO -- : [691/885] 3571883=test_lock_native_thread I, [2024-05-21T00:43:04.354464 #3531013] INFO -- : [692/885] 3571883=test_resize I, [2024-05-21T00:43:04.361492 #3531013] INFO -- : [693/885] 3571883=test_key_error I, [2024-05-21T00:43:04.365962 #3531013] INFO -- : [694/885] 3571883=test_win32ole_param I, [2024-05-21T00:43:04.406201 #3531013] INFO -- : [695/885] 3571883=test_engine I, [2024-05-21T00:43:04.875595 #3531013] INFO -- : [696/885] 3571883=test_gem_commands_mirror I, [2024-05-21T00:43:04.906250 #3531013] INFO -- : [697/885] 3571883=test_fiber I, [2024-05-21T00:43:05.617251 #3531013] INFO -- : [698/885] 3571885=test_gem_security_trust_dir I, [2024-05-21T00:43:05.698904 #3531013] INFO -- : [699/885] 3571885=test_module I, [2024-05-21T00:43:06.683571 #3531013] INFO -- : [700/885] 3571884=test_erb_command I, [2024-05-21T00:43:06.762274 #3531013] INFO -- : [701/885] 3571884=test_usrmarshal I, [2024-05-21T00:43:06.890021 #3531013] INFO -- : [702/885] 3571884=test_gem_source_installed I, [2024-05-21T00:43:06.908405 #3531013] INFO -- : [703/885] 3571884=test_gem_validator I, [2024-05-21T00:43:06.975389 #3531013] INFO -- : [704/885] 3571884=test_abi I, [2024-05-21T00:43:07.079890 #3531013] INFO -- : [705/885] 3571884=test_load I, [2024-05-21T00:43:07.154494 #3531013] INFO -- : [706/885] 3571884=test_integer_comb I, [2024-05-21T00:43:09.331854 #3531013] INFO -- : [707/885] 3571885=test_bundled_ca I, [2024-05-21T00:43:09.841695 #3531013] INFO -- : [708/885] 3571884=test_ssl I, [2024-05-21T00:43:11.066956 #3531013] INFO -- : [709/885] 3571883=test_config I, [2024-05-21T00:43:11.077082 #3531013] INFO -- : [710/885] 3571885=test_ostruct I, [2024-05-21T00:43:11.166075 #3531013] INFO -- : [711/885] 3571883=test_depth_first I, [2024-05-21T00:43:11.173869 #3531013] INFO -- : [712/885] 3571883=test_change_word I, [2024-05-21T00:43:11.186475 #3531013] INFO -- : [713/885] 3571883=test_rdoc_parser_markdown I, [2024-05-21T00:43:11.208033 #3531013] INFO -- : [714/885] 3571883=test_custom_command I, [2024-05-21T00:43:11.208941 #3531013] INFO -- : [715/885] 3571883=fuzzer_test I, [2024-05-21T00:43:11.222563 #3531013] INFO -- : [716/885] 3571885=test_rubyvm I, [2024-05-21T00:43:11.236548 #3531013] INFO -- : [717/885] 3571883=test_cparser I, [2024-05-21T00:43:11.243134 #3531013] INFO -- : [718/885] 3571885=test_struct I, [2024-05-21T00:43:11.251385 #3531013] INFO -- : [719/885] 3571885=static_inspect_test I, [2024-05-21T00:43:11.281377 #3531013] INFO -- : [720/885] 3571885=test_c_struct_entry I, [2024-05-21T00:43:11.997975 #3531013] INFO -- : [721/885] 3571885=test_gem_safe_marshal I, [2024-05-21T00:43:12.743037 #3531013] INFO -- : [722/885] 3571885=test_rdoc_ri_driver I, [2024-05-21T00:43:13.124795 #3531013] INFO -- : [723/885] 3571885=test_sexp I, [2024-05-21T00:43:13.155067 #3531013] INFO -- : [724/885] 3571885=test_httpheader I, [2024-05-21T00:43:13.187750 #3531013] INFO -- : [725/885] 3571885=test_ractor I, [2024-05-21T00:43:13.232527 #3531013] INFO -- : [726/885] 3571885=test_gem_commands_check_command I, [2024-05-21T00:43:13.251605 #3531013] INFO -- : [727/885] 3571885=test_gem_resolver_git_set I, [2024-05-21T00:43:13.769837 #3531013] INFO -- : [728/885] 3571883=test_signedness I, [2024-05-21T00:43:13.856879 #3531013] INFO -- : [729/885] 3571885=test_digest I, [2024-05-21T00:43:14.630553 #3531013] INFO -- : [730/885] 3571885=test_ractor I, [2024-05-21T00:43:14.747382 #3531013] INFO -- : [731/885] 3571885=test_exception_at_throwing I, [2024-05-21T00:43:14.756281 #3531013] INFO -- : [732/885] 3571885=test_gem_resolver_installed_specification I, [2024-05-21T00:43:14.829864 #3531013] INFO -- : [733/885] 3571885=test_stringscanner I, [2024-05-21T00:43:14.906797 #3531013] INFO -- : [734/885] 3571885=test_fiddle I, [2024-05-21T00:43:15.055483 #3531013] INFO -- : [735/885] 3571885=json_generic_object_test I, [2024-05-21T00:43:15.065794 #3531013] INFO -- : [736/885] 3571885=test_date_arith I, [2024-05-21T00:43:15.079496 #3531013] INFO -- : [737/885] 3571885=test_gem_resolver_vendor_specification I, [2024-05-21T00:43:15.108869 #3531013] INFO -- : [738/885] 3571885=test_rdoc_token_stream I, [2024-05-21T00:43:15.218789 #3531013] INFO -- : [739/885] 3571885=test_mutex I, [2024-05-21T00:43:15.518795 #3531013] INFO -- : [740/885] 3571883=heredoc_dedent_test I, [2024-05-21T00:43:15.532399 #3531013] INFO -- : [741/885] 3571883=test_type I, [2024-05-21T00:43:15.540090 #3531013] INFO -- : [742/885] 3571883=test_tmpdir I, [2024-05-21T00:43:15.621338 #3531013] INFO -- : [743/885] 3571883=test_struct I, [2024-05-21T00:43:16.143185 #3531013] INFO -- : [744/885] 3571883=test_rdoc_single_class I, [2024-05-21T00:43:16.151503 #3531013] INFO -- : [745/885] 3571883=test_dup I, [2024-05-21T00:43:16.262715 #3531013] INFO -- : [746/885] 3571885=test_acceptable I, [2024-05-21T00:43:16.312270 #3531013] INFO -- : [747/885] 3571883=test_gem_ext_cargo_builder_link_flag_converter I, [2024-05-21T00:43:16.330272 #3531013] INFO -- : [748/885] 3571885=test_gem_local_remote_options I, [2024-05-21T00:43:16.379833 #3531013] INFO -- : [749/885] 3571883=test_file_exhaustive I, [2024-05-21T00:43:16.387557 #3531013] INFO -- : [750/885] 3571885=test_completion I, [2024-05-21T00:43:17.134544 #3531013] INFO -- : [751/885] 3571885=test_handle I, [2024-05-21T00:43:17.925714 #3531013] INFO -- : Leaked file descriptor: TestFileExhaustive#test_expand_path_error_for_nonexistent_username: 11 # I, [2024-05-21T00:43:17.947466 #3531013] INFO -- : [752/885] 3571885=parse_stream_test I, [2024-05-21T00:43:17.956686 #3531013] INFO -- : [753/885] 3571885=test_rdoc_markup_document I, [2024-05-21T00:43:17.958430 #3531013] INFO -- : COMMAND PID USER FD TYPE DEVICE SIZE/OFF NODE NAME I, [2024-05-21T00:43:17.958463 #3531013] INFO -- : ruby 3571883 opc 11r REG 252,0 9253600 13705411 /var/lib/sss/mc/passwd I, [2024-05-21T00:43:17.971537 #3531013] INFO -- : [754/885] 3571885=test_delete I, [2024-05-21T00:43:17.988665 #3531013] INFO -- : [755/885] 3571885=test_gem_security_policy I, [2024-05-21T00:43:18.338856 #3531013] INFO -- : [756/885] 3571885=test_io_wait_uncommon I, [2024-05-21T00:43:18.355020 #3531013] INFO -- : [757/885] 3571885=test_gem_ci_detector I, [2024-05-21T00:43:18.366608 #3531013] INFO -- : [758/885] 3571885=test_signal I, [2024-05-21T00:43:20.110659 #3531013] INFO -- : [759/885] 3571884=test_gem_silent_ui I, [2024-05-21T00:43:20.160848 #3531013] INFO -- : [760/885] 3571884=test_fixnum I, [2024-05-21T00:43:20.170878 #3531013] INFO -- : [761/885] 3571884=test_continuation I, [2024-05-21T00:43:20.206334 #3531013] INFO -- : [762/885] 3571884=test_ssl_session I, [2024-05-21T00:43:20.403382 #3531013] INFO -- : [763/885] 3571885=test_gem_package_tar_header I, [2024-05-21T00:43:20.476224 #3531013] INFO -- : [764/885] 3571885=test_rational2 I, [2024-05-21T00:43:20.527249 #3531013] INFO -- : [765/885] 3571885=test_logperiod I, [2024-05-21T00:43:20.542567 #3531013] INFO -- : [766/885] 3571885=test_case_comprehensive I, [2024-05-21T00:43:21.040739 #3531013] INFO -- : [767/885] 3571884=test_placearg I, [2024-05-21T00:43:21.122371 #3531013] INFO -- : [768/885] 3571884=test_irb I, [2024-05-21T00:43:21.395318 #3531013] INFO -- : [769/885] 3571884=test_x509cert I, [2024-05-21T00:43:21.478056 #3531013] INFO -- : [770/885] 3571884=test_rdoc_markup_paragraph I, [2024-05-21T00:43:21.518128 #3531013] INFO -- : [771/885] 3571884=test_require_path_check I, [2024-05-21T00:43:21.674556 #3531013] INFO -- : [772/885] 3571884=test_bn I, [2024-05-21T00:43:21.696906 #3531013] INFO -- : [773/885] 3571884=test_variable_name_check I, [2024-05-21T00:43:21.819484 #3531013] INFO -- : [774/885] 3571884=test_logdevice I, [2024-05-21T00:43:22.696477 #3531013] INFO -- : [775/885] 3571884=test_ast I, [2024-05-21T00:43:28.434319 #3531013] INFO -- : [776/885] 3571883=test_rdoc_markup_to_ansi I, [2024-05-21T00:43:28.486835 #3531013] INFO -- : [777/885] 3571883=test_files_test I, [2024-05-21T00:43:28.496175 #3531013] INFO -- : [778/885] 3571883=test_weakkeymap I, [2024-05-21T00:43:29.051414 #3531013] INFO -- : [779/885] 3571883=test_evaluation I, [2024-05-21T00:43:29.060112 #3531013] INFO -- : [780/885] 3571883=test_protocol I, [2024-05-21T00:43:29.383873 #3531013] INFO -- : [781/885] 3571883=test_https I, [2024-05-21T00:43:29.519714 #3531013] INFO -- : [782/885] 3571883=test_gem_commands_info_command I, [2024-05-21T00:43:29.616546 #3531013] INFO -- : [783/885] 3571883=test_object_create_start I, [2024-05-21T00:43:29.632910 #3531013] INFO -- : [784/885] 3571883=test_gem_request_set_gem_dependency_api I, [2024-05-21T00:43:29.914235 #3531013] INFO -- : [785/885] 3571883=test_name_error_extension I, [2024-05-21T00:43:29.932457 #3531013] INFO -- : [786/885] 3571883=test_sockopt I, [2024-05-21T00:43:29.940732 #3531013] INFO -- : [787/885] 3571883=test_ftp I, [2024-05-21T00:43:29.958269 #3531013] INFO -- : [788/885] 3571883=test_gem_source_fetch_problem I, [2024-05-21T00:43:29.970547 #3531013] INFO -- : [789/885] 3571883=test_install I, [2024-05-21T00:43:30.157129 #3531013] INFO -- : [790/885] 3571883=test_encoding I, [2024-05-21T00:43:30.189386 #3531013] INFO -- : [791/885] 3571883=test_rdoc_comment I, [2024-05-21T00:43:30.243027 #3531013] INFO -- : [792/885] 3571883=test_cgi_multipart I, [2024-05-21T00:43:30.334957 #3531013] INFO -- : [793/885] 3571883=test_lazy_enumerator I, [2024-05-21T00:43:30.912617 #3531013] INFO -- : [794/885] 3571883=test_gem_request_set_lockfile_tokenizer I, [2024-05-21T00:43:30.979429 #3531013] INFO -- : [795/885] 3571883=test_arithmetic_sequence I, [2024-05-21T00:43:31.055285 #3531013] INFO -- : [796/885] 3571883=test_ractor_compatibility I, [2024-05-21T00:43:31.345463 #3531013] INFO -- : [797/885] 3571883=integer_parse_test I, [2024-05-21T00:43:31.351725 #3531013] INFO -- : [798/885] 3571883=test_autoconf I, [2024-05-21T00:43:31.359054 #3531013] INFO -- : [799/885] 3571883=test_find_executable I, [2024-05-21T00:43:31.379220 #3531013] INFO -- : [800/885] 3571883=test_iseq I, [2024-05-21T00:43:31.946102 #3531013] INFO -- : [801/885] 3571883=test_primitive I, [2024-05-21T00:43:31.982594 #3531013] INFO -- : [802/885] 3571883=test_parser I, [2024-05-21T00:43:32.004725 #3531013] INFO -- : [803/885] 3571883=test_rdoc_ri_paths I, [2024-05-21T00:43:32.036770 #3531013] INFO -- : [804/885] 3571883=command_line_test I, [2024-05-21T00:43:32.042458 #3531013] INFO -- : [805/885] 3571883=test_win32ole_variant_m I, [2024-05-21T00:43:32.059455 #3531013] INFO -- : [806/885] 3571883=test_pair I, [2024-05-21T00:43:37.419846 #3531013] INFO -- : [807/885] 3571883=test_env I, [2024-05-21T00:43:40.020469 #3531013] INFO -- : [808/885] 3571883=test_gem_commands_signout_command I, [2024-05-21T00:43:40.058046 #3531013] INFO -- : [809/885] 3571883=test_gem_package_tar_reader I, [2024-05-21T00:43:40.122432 #3531013] INFO -- : [810/885] 3571883=test_gem_safe_yaml I, [2024-05-21T00:43:40.135849 #3531013] INFO -- : [811/885] 3571883=test_document I, [2024-05-21T00:43:40.143770 #3531013] INFO -- : [812/885] 3571883=test_eval I, [2024-05-21T00:43:40.149810 #3531013] INFO -- : [813/885] 3571883=test_history I, [2024-05-21T00:43:40.204778 #3531013] INFO -- : [814/885] 3571883=test_gem_commands_setup_command I, [2024-05-21T00:43:40.956136 #3531013] INFO -- : [815/885] 3571885=test_singleton_function I, [2024-05-21T00:43:40.974900 #3531013] INFO -- : [816/885] 3571885=dispatcher_test I, [2024-05-21T00:43:40.979131 #3531013] INFO -- : [817/885] 3571885=test_eval_history I, [2024-05-21T00:43:40.999290 #3531013] INFO -- : [818/885] 3571885=test_unicode I, [2024-05-21T00:43:41.005204 #3531013] INFO -- : [819/885] 3571885=test_gem_source_git I, [2024-05-21T00:43:41.096084 #3531013] INFO -- : [820/885] 3571883=test_regex_casefold I, [2024-05-21T00:43:41.518133 #3531013] INFO -- : [821/885] 3571883=test_lexer I, [2024-05-21T00:43:41.545541 #3531013] INFO -- : [822/885] 3571883=test_win32ole_method I, [2024-05-21T00:43:41.557359 #3531013] INFO -- : [823/885] 3571883=test_ripper I, [2024-05-21T00:43:41.860180 #3531013] INFO -- : [824/885] 3571883=test_files_ext I, [2024-05-21T00:43:41.875098 #3531013] INFO -- : [825/885] 3571883=test_stringio I, [2024-05-21T00:43:41.960173 #3531013] INFO -- : [826/885] 3571883=test_assembler I, [2024-05-21T00:43:42.002857 #3531013] INFO -- : [827/885] 3571883=test_thread_cv I, [2024-05-21T00:43:42.181020 #3531013] INFO -- : [828/885] 3571885=test_random I, [2024-05-21T00:43:42.195975 #3531013] INFO -- : [829/885] 3571885=test_benchmark I, [2024-05-21T00:43:42.632523 #3531013] INFO -- : [830/885] 3571883=test_at_exit I, [2024-05-21T00:43:42.645668 #3531013] INFO -- : [831/885] 3571883=test_mkmf I, [2024-05-21T00:43:42.682073 #3531013] INFO -- : [832/885] 3571883=test_gem_source I, [2024-05-21T00:43:42.992231 #3531013] INFO -- : [833/885] 3571883=test_have_macro I, [2024-05-21T00:43:43.263854 #3531013] INFO -- : [834/885] 3571883=test_class I, [2024-05-21T00:43:43.273308 #3531013] INFO -- : [835/885] 3571883=test_autoload I, [2024-05-21T00:43:43.896170 #3531013] INFO -- : [836/885] 3571885=test_gem_package I, [2024-05-21T00:43:44.624241 #3531013] INFO -- : [837/885] 3571885=test_array I, [2024-05-21T00:43:47.706355 #3531013] INFO -- : [838/885] 3571883=json_ext_parser_test I, [2024-05-21T00:43:47.716779 #3531013] INFO -- : [839/885] 3571883=test_gem_ext_configure_builder I, [2024-05-21T00:43:47.760981 #3531013] INFO -- : [840/885] 3571883=test_nonblock I, [2024-05-21T00:43:47.793483 #3531013] INFO -- : [841/885] 3571883=test_rdoc_parser_simple I, [2024-05-21T00:43:47.828162 #3531013] INFO -- : [842/885] 3571883=test_ocsp I, [2024-05-21T00:43:47.920747 #3531013] INFO -- : [843/885] 3571883=test_scanner_events I, [2024-05-21T00:43:47.977434 #3531013] INFO -- : [844/885] 3571883=test_ipaddr I, [2024-05-21T00:43:48.033849 #3531013] INFO -- : [845/885] 3571883=test_date_strptime I, [2024-05-21T00:43:48.116071 #3531013] INFO -- : [846/885] 3571883=test_omap I, [2024-05-21T00:43:48.126843 #3531013] INFO -- : [847/885] 3571883=test_rdoc_generator_pot_po I, [2024-05-21T00:43:48.140321 #3531013] INFO -- : [848/885] 3571883=test_mul I, [2024-05-21T00:43:48.166261 #3531013] INFO -- : [849/885] 3571883=test_shellwords I, [2024-05-21T00:43:48.173956 #3531013] INFO -- : [850/885] 3571883=test_propertyputref I, [2024-05-21T00:43:48.182643 #3531013] INFO -- : [851/885] 3571883=test_gb18030 I, [2024-05-21T00:43:48.198455 #3531013] INFO -- : [852/885] 3571883=test_gem_commands_lock_command I, [2024-05-21T00:43:48.226368 #3531013] INFO -- : [853/885] 3571883=test_reline_key I, [2024-05-21T00:43:48.270641 #3531013] INFO -- : [854/885] 3571883=test_unicode_normalize I, [2024-05-21T00:43:52.060758 #3531013] INFO -- : [855/885] 3571883=test_gem_stream_ui I, [2024-05-21T00:43:52.191375 #3531013] INFO -- : [856/885] 3571883=test_rdoc_generator_ri I, [2024-05-21T00:43:52.211628 #3531013] INFO -- : [857/885] 3571883=test_rdoc_top_level I, [2024-05-21T00:43:52.487536 #3531013] INFO -- : [858/885] 3571883=test_io_m17n I, [2024-05-21T00:43:53.867460 #3531013] INFO -- : [859/885] 3571883=test_cmethod I, [2024-05-21T00:43:53.886690 #3531013] INFO -- : [860/885] 3571883=test_gem_stub_specification I, [2024-05-21T00:43:54.054943 #3531013] INFO -- : [861/885] 3571883=test_float I, [2024-05-21T00:43:56.648119 #3531013] INFO -- : [862/885] 3571883=test_color I, [2024-05-21T00:43:56.755526 #3531013] INFO -- : [863/885] 3571883=test_uncorrectable_name_check I, [2024-05-21T00:43:56.766629 #3531013] INFO -- : [864/885] 3571883=test_io I, [2024-05-21T00:43:58.379893 #3531013] INFO -- : [865/885] 3571885=test_dir I, [2024-05-21T00:43:58.708172 #3531013] INFO -- : [866/885] 3571885=test_files_test_1 I, [2024-05-21T00:43:58.708238 #3531013] INFO -- : [867/885] 3571885=test_closure I, [2024-05-21T00:44:01.522055 #3531013] INFO -- : [868/885] 3571885=test_resolve_symbol I, [2024-05-21T00:44:01.595937 #3531013] INFO -- : [869/885] 3571885=test_rubygems I, [2024-05-21T00:44:01.737358 #3531013] INFO -- : [870/885] 3571885=test_path I, [2024-05-21T00:44:01.741333 #3531013] INFO -- : [871/885] 3571885=test_digest I, [2024-05-21T00:44:01.750323 #3531013] INFO -- : [872/885] 3571885=test_rdoc_rd_inline I, [2024-05-21T00:44:01.760570 #3531013] INFO -- : [873/885] 3571885=test_win32ole_param_event I, [2024-05-21T00:44:01.766176 #3531013] INFO -- : [874/885] 3571885=test_https_proxy I, [2024-05-21T00:44:01.781459 #3531013] INFO -- : [875/885] 3571885=test_rdoc_parser I, [2024-05-21T00:44:01.810591 #3531013] INFO -- : [876/885] 3571885=test_nomethod_error I, [2024-05-21T00:44:01.848807 #3531013] INFO -- : [877/885] 3571885=test_gem_commands_rebuild_command I, [2024-05-21T00:44:01.921169 #3531013] INFO -- : [878/885] 3571885=test_etc I, [2024-05-21T00:44:02.030965 #3531013] INFO -- : [879/885] 3571885=test_stat I, [2024-05-21T00:44:02.036701 #3531013] INFO -- : [880/885] 3571885=test_x509attr I, [2024-05-21T00:44:02.041057 #3531013] INFO -- : [881/885] 3571885=test_printf I, [2024-05-21T00:44:02.158835 #3531013] INFO -- : [882/885] 3571885=test_workspace I, [2024-05-21T00:44:02.193576 #3531013] INFO -- : [883/885] 3571885=test_win32ole_variant I, [2024-05-21T00:44:02.208769 #3531013] INFO -- : [884/885] 3571885=magic_comment_test I, [2024-05-21T00:44:02.211741 #3531013] INFO -- : [885/885] 3571885=test_cgi_modruby I, [2024-05-21T00:44:12.705680 #3531013] INFO -- : Finished tests in 204.514838s, 128.6166 tests/s, 45732.3884 assertions/s. I, [2024-05-21T00:44:12.710548 #3531013] INFO -- : 26304 tests, 9352952 assertions, 0 failures, 0 errors, 320 skips I, [2024-05-21T00:44:12.710583 #3531013] INFO -- : I, [2024-05-21T00:44:12.710594 #3531013] INFO -- : ruby -v: ruby 3.4.0dev (2024-05-20T20:33:57Z master 86cf074fa1) [aarch64-linux] I, [2024-05-21T00:44:12.711432 #3531013] INFO -- : $$$[end] "make yes-test-all TESTOPTS='--stderr-on-failure' TESTS='-j3'" exit with 0. I, [2024-05-21T00:44:12.711592 #3531013] INFO -- : $$$[beg] make yes-test-rubyspec MSPECOPT='--error-output stderr --debug -j' TESTS='-j3' I, [2024-05-21T00:44:12.837051 #3531013] INFO -- : BASERUBY = /usr/local/bin/ruby --disable=gems I, [2024-05-21T00:44:12.837156 #3531013] INFO -- : CC = gcc I, [2024-05-21T00:44:12.837170 #3531013] INFO -- : LD = ld I, [2024-05-21T00:44:12.837183 #3531013] INFO -- : LDSHARED = gcc -shared I, [2024-05-21T00:44:12.837193 #3531013] INFO -- : CFLAGS = -O3 -fno-fast-math -ggdb3 -Wall -Wextra -Wdeprecated-declarations -Wdiv-by-zero -Wduplicated-cond -Wimplicit-function-declaration -Wimplicit-int -Wpointer-arith -Wwrite-strings -Wold-style-definition -Wimplicit-fallthrough=0 -Wmissing-noreturn -Wno-cast-function-type -Wno-constant-logical-operand -Wno-long-long -Wno-missing-field-initializers -Wno-overlength-strings -Wno-packed-bitfield-compat -Wno-parentheses-equality -Wno-self-assign -Wno-tautological-compare -Wno-unused-parameter -Wno-unused-value -Wsuggest-attribute=format -Wsuggest-attribute=noreturn -Wunused-variable -Wmisleading-indentation -Wundef I, [2024-05-21T00:44:12.837202 #3531013] INFO -- : XCFLAGS = -U_FORTIFY_SOURCE -D_FORTIFY_SOURCE=2 -fstack-protector-strong -msign-return-address=all -fno-strict-overflow -fvisibility=hidden -fexcess-precision=standard -DRUBY_EXPORT -fPIE -I. -I.ext/include/aarch64-linux -I/home/opc/ruby/src/master/include -I/home/opc/ruby/src/master -I/home/opc/ruby/src/master/prism -I/home/opc/ruby/src/master/enc/unicode/15.0.0 I, [2024-05-21T00:44:12.837213 #3531013] INFO -- : CPPFLAGS = I, [2024-05-21T00:44:12.837221 #3531013] INFO -- : DLDFLAGS = -Wl,--compress-debug-sections=zlib -fstack-protector-strong -pie I, [2024-05-21T00:44:12.837230 #3531013] INFO -- : SOLIBS = -lz -lrt -lrt -ldl -lcrypt -lm -lpthread I, [2024-05-21T00:44:12.837239 #3531013] INFO -- : LANG = en_US.UTF-8 I, [2024-05-21T00:44:12.837247 #3531013] INFO -- : LC_ALL = I, [2024-05-21T00:44:12.837255 #3531013] INFO -- : LC_CTYPE = I, [2024-05-21T00:44:12.837263 #3531013] INFO -- : MFLAGS = I, [2024-05-21T00:44:12.837271 #3531013] INFO -- : RUSTC = rustc I, [2024-05-21T00:44:12.837279 #3531013] INFO -- : YJIT_RUSTC_ARGS = --crate-name=yjit --crate-type=staticlib --edition=2021 -g -C lto=thin -C opt-level=3 -C overflow-checks=on '--out-dir=/home/opc/ruby/build/master/yjit/target/release/' /home/opc/ruby/src/master/yjit/src/lib.rs I, [2024-05-21T00:44:12.838223 #3531013] INFO -- : gcc (GCC) 8.5.0 20210514 (Red Hat 8.5.0-10.1.0.1) I, [2024-05-21T00:44:12.838241 #3531013] INFO -- : Copyright (C) 2018 Free Software Foundation, Inc. I, [2024-05-21T00:44:12.838251 #3531013] INFO -- : This is free software; see the source for copying conditions. There is NO I, [2024-05-21T00:44:12.838259 #3531013] INFO -- : warranty; not even for MERCHANTABILITY or FITNESS FOR A PARTICULAR PURPOSE. I, [2024-05-21T00:44:12.838268 #3531013] INFO -- : I, [2024-05-21T00:44:12.840896 #3531013] INFO -- : generating enc.mk I, [2024-05-21T00:44:13.072150 #3531013] INFO -- : generating encdb.h I, [2024-05-21T00:44:13.109228 #3531013] INFO -- : encdb.h unchanged I, [2024-05-21T00:44:13.110519 #3531013] INFO -- : making enc I, [2024-05-21T00:44:13.138122 #3531013] INFO -- : make[1]: Entering directory '/home/opc/ruby/build/master' I, [2024-05-21T00:44:13.138158 #3531013] INFO -- : make[1]: Nothing to be done for 'enc'. I, [2024-05-21T00:44:13.138170 #3531013] INFO -- : make[1]: Leaving directory '/home/opc/ruby/build/master' I, [2024-05-21T00:44:13.138929 #3531013] INFO -- : making srcs under enc I, [2024-05-21T00:44:13.181933 #3531013] INFO -- : make[1]: Entering directory '/home/opc/ruby/build/master' I, [2024-05-21T00:44:13.181987 #3531013] INFO -- : make[1]: Nothing to be done for 'srcs'. I, [2024-05-21T00:44:13.181998 #3531013] INFO -- : make[1]: Leaving directory '/home/opc/ruby/build/master' I, [2024-05-21T00:44:13.183134 #3531013] INFO -- : generating transdb.h I, [2024-05-21T00:44:13.329633 #3531013] INFO -- : transdb.h unchanged I, [2024-05-21T00:44:13.330974 #3531013] INFO -- : making trans I, [2024-05-21T00:44:13.380214 #3531013] INFO -- : make[1]: Entering directory '/home/opc/ruby/build/master' I, [2024-05-21T00:44:13.380309 #3531013] INFO -- : make[1]: Nothing to be done for 'trans'. I, [2024-05-21T00:44:13.380330 #3531013] INFO -- : make[1]: Leaving directory '/home/opc/ruby/build/master' I, [2024-05-21T00:44:13.381108 #3531013] INFO -- : making encs I, [2024-05-21T00:44:13.434363 #3531013] INFO -- : make[1]: Entering directory '/home/opc/ruby/build/master' I, [2024-05-21T00:44:13.434414 #3531013] INFO -- : make[1]: Nothing to be done for 'encs'. I, [2024-05-21T00:44:13.434424 #3531013] INFO -- : make[1]: Leaving directory '/home/opc/ruby/build/master' I, [2024-05-21T00:44:13.436434 #3531013] INFO -- : generating makefiles ext/configure-ext.mk I, [2024-05-21T00:44:13.476287 #3531013] INFO -- : ext/configure-ext.mk updated I, [2024-05-21T00:44:13.480022 #3531013] INFO -- : make[1]: Entering directory '/home/opc/ruby/build/master' I, [2024-05-21T00:44:15.635211 #3531013] INFO -- : make[1]: Leaving directory '/home/opc/ruby/build/master' I, [2024-05-21T00:44:15.635899 #3531013] INFO -- : generating makefile exts.mk I, [2024-05-21T00:44:15.695323 #3531013] INFO -- : exts.mk unchanged I, [2024-05-21T00:44:15.700281 #3531013] INFO -- : make[1]: Entering directory '/home/opc/ruby/build/master' I, [2024-05-21T00:44:15.996805 #3531013] INFO -- : make[2]: Entering directory '/home/opc/ruby/build/master/ext/coverage' I, [2024-05-21T00:44:16.001449 #3531013] INFO -- : make[2]: Leaving directory '/home/opc/ruby/build/master/ext/coverage' I, [2024-05-21T00:44:16.007415 #3531013] INFO -- : make[2]: Entering directory '/home/opc/ruby/build/master/ext/date' I, [2024-05-21T00:44:16.012611 #3531013] INFO -- : make[2]: Leaving directory '/home/opc/ruby/build/master/ext/date' I, [2024-05-21T00:44:16.015912 #3531013] INFO -- : make[2]: Entering directory '/home/opc/ruby/build/master/ext/digest' I, [2024-05-21T00:44:16.024559 #3531013] INFO -- : make[2]: Leaving directory '/home/opc/ruby/build/master/ext/digest' I, [2024-05-21T00:44:16.046732 #3531013] INFO -- : make[2]: Entering directory '/home/opc/ruby/build/master/ext/digest/sha2' I, [2024-05-21T00:44:16.051833 #3531013] INFO -- : make[2]: Leaving directory '/home/opc/ruby/build/master/ext/digest/sha2' I, [2024-05-21T00:44:16.069726 #3531013] INFO -- : make[2]: Entering directory '/home/opc/ruby/build/master/ext/fiddle' I, [2024-05-21T00:44:16.079925 #3531013] INFO -- : make[2]: Leaving directory '/home/opc/ruby/build/master/ext/fiddle' I, [2024-05-21T00:44:16.084205 #3531013] INFO -- : make[2]: Entering directory '/home/opc/ruby/build/master/ext/io/console' I, [2024-05-21T00:44:16.088613 #3531013] INFO -- : make[2]: Leaving directory '/home/opc/ruby/build/master/ext/io/console' I, [2024-05-21T00:44:16.099356 #3531013] INFO -- : make[2]: Entering directory '/home/opc/ruby/build/master/ext/json' I, [2024-05-21T00:44:16.108714 #3531013] INFO -- : make[2]: Leaving directory '/home/opc/ruby/build/master/ext/json' I, [2024-05-21T00:44:16.121579 #3531013] INFO -- : make[2]: Entering directory '/home/opc/ruby/build/master/ext/monitor' I, [2024-05-21T00:44:16.125613 #3531013] INFO -- : make[2]: Leaving directory '/home/opc/ruby/build/master/ext/monitor' I, [2024-05-21T00:44:16.131551 #3531013] INFO -- : make[2]: Entering directory '/home/opc/ruby/build/master/ext/objspace' I, [2024-05-21T00:44:16.137429 #3531013] INFO -- : make[2]: Leaving directory '/home/opc/ruby/build/master/ext/objspace' I, [2024-05-21T00:44:16.156411 #3531013] INFO -- : make[2]: Entering directory '/home/opc/ruby/build/master/ext/openssl' I, [2024-05-21T00:44:16.178263 #3531013] INFO -- : make[2]: Leaving directory '/home/opc/ruby/build/master/ext/openssl' I, [2024-05-21T00:44:16.182355 #3531013] INFO -- : make[2]: Entering directory '/home/opc/ruby/build/master/ext/pathname' I, [2024-05-21T00:44:16.186403 #3531013] INFO -- : make[2]: Leaving directory '/home/opc/ruby/build/master/ext/pathname' I, [2024-05-21T00:44:16.192609 #3531013] INFO -- : make[2]: Entering directory '/home/opc/ruby/build/master/ext/psych' I, [2024-05-21T00:44:16.214248 #3531013] INFO -- : make[2]: Leaving directory '/home/opc/ruby/build/master/ext/psych' I, [2024-05-21T00:44:16.218983 #3531013] INFO -- : make[2]: Entering directory '/home/opc/ruby/build/master/ext/pty' I, [2024-05-21T00:44:16.223108 #3531013] INFO -- : make[2]: Leaving directory '/home/opc/ruby/build/master/ext/pty' I, [2024-05-21T00:44:16.236335 #3531013] INFO -- : make[2]: Entering directory '/home/opc/ruby/build/master/ext/ripper' I, [2024-05-21T00:44:16.243851 #3531013] INFO -- : make[2]: Leaving directory '/home/opc/ruby/build/master/ext/ripper' I, [2024-05-21T00:44:16.245799 #3531013] INFO -- : make[2]: Entering directory '/home/opc/ruby/build/master/ext/rubyvm' I, [2024-05-21T00:44:16.249305 #3531013] INFO -- : make[2]: Leaving directory '/home/opc/ruby/build/master/ext/rubyvm' I, [2024-05-21T00:44:16.261433 #3531013] INFO -- : make[2]: Entering directory '/home/opc/ruby/build/master/ext/socket' I, [2024-05-21T00:44:16.272126 #3531013] INFO -- : make[2]: Leaving directory '/home/opc/ruby/build/master/ext/socket' I, [2024-05-21T00:44:16.287777 #3531013] INFO -- : make[2]: Entering directory '/home/opc/ruby/build/master/.bundle/gems/bigdecimal-3.1.7/ext/bigdecimal' I, [2024-05-21T00:44:16.318879 #3531013] INFO -- : make[2]: Leaving directory '/home/opc/ruby/build/master/.bundle/gems/bigdecimal-3.1.7/ext/bigdecimal' I, [2024-05-21T00:44:16.321522 #3531013] INFO -- : make[2]: Entering directory '/home/opc/ruby/build/master/.bundle/gems/bigdecimal-3.1.8/ext/bigdecimal' I, [2024-05-21T00:44:16.352875 #3531013] INFO -- : make[2]: Leaving directory '/home/opc/ruby/build/master/.bundle/gems/bigdecimal-3.1.8/ext/bigdecimal' I, [2024-05-21T00:44:16.355444 #3531013] INFO -- : make[2]: Entering directory '/home/opc/ruby/build/master/.bundle/gems/debug-1.9.2/ext/debug' I, [2024-05-21T00:44:16.386785 #3531013] INFO -- : make[2]: Leaving directory '/home/opc/ruby/build/master/.bundle/gems/debug-1.9.2/ext/debug' I, [2024-05-21T00:44:16.389382 #3531013] INFO -- : make[2]: Entering directory '/home/opc/ruby/build/master/.bundle/gems/nkf-0.2.0/ext/nkf' I, [2024-05-21T00:44:16.421167 #3531013] INFO -- : make[2]: Leaving directory '/home/opc/ruby/build/master/.bundle/gems/nkf-0.2.0/ext/nkf' I, [2024-05-21T00:44:16.423667 #3531013] INFO -- : make[2]: Entering directory '/home/opc/ruby/build/master/.bundle/gems/racc-1.7.3/ext/racc/cparse' I, [2024-05-21T00:44:16.454384 #3531013] INFO -- : make[2]: Leaving directory '/home/opc/ruby/build/master/.bundle/gems/racc-1.7.3/ext/racc/cparse' I, [2024-05-21T00:44:16.456820 #3531013] INFO -- : make[2]: Entering directory '/home/opc/ruby/build/master/.bundle/gems/racc-1.8.0/ext/racc/cparse' I, [2024-05-21T00:44:16.487612 #3531013] INFO -- : make[2]: Leaving directory '/home/opc/ruby/build/master/.bundle/gems/racc-1.8.0/ext/racc/cparse' I, [2024-05-21T00:44:16.490597 #3531013] INFO -- : make[2]: Entering directory '/home/opc/ruby/build/master/.bundle/gems/rbs-3.4.4/ext/rbs_extension' I, [2024-05-21T00:44:16.520912 #3531013] INFO -- : make[2]: Leaving directory '/home/opc/ruby/build/master/.bundle/gems/rbs-3.4.4/ext/rbs_extension' I, [2024-05-21T00:44:16.523458 #3531013] INFO -- : make[2]: Entering directory '/home/opc/ruby/build/master/.bundle/gems/syslog-0.1.2/ext/syslog' I, [2024-05-21T00:44:16.554192 #3531013] INFO -- : make[2]: Leaving directory '/home/opc/ruby/build/master/.bundle/gems/syslog-0.1.2/ext/syslog' I, [2024-05-21T00:44:16.592579 #3531013] INFO -- : make[2]: Entering directory '/home/opc/ruby/build/master' I, [2024-05-21T00:44:16.675427 #3531013] INFO -- : make[2]: 'ruby' is up to date. I, [2024-05-21T00:44:16.675502 #3531013] INFO -- : make[2]: Leaving directory '/home/opc/ruby/build/master' I, [2024-05-21T00:44:16.675660 #3531013] INFO -- : make[1]: Leaving directory '/home/opc/ruby/build/master' I, [2024-05-21T00:44:16.680235 #3531013] INFO -- : make[1]: Entering directory '/home/opc/ruby/build/master' I, [2024-05-21T00:44:16.680279 #3531013] INFO -- : make[1]: Nothing to be done for 'note'. I, [2024-05-21T00:44:16.680290 #3531013] INFO -- : make[1]: Leaving directory '/home/opc/ruby/build/master' E, [2024-05-21T00:44:16.755631 #3531013] ERROR -- : $ /home/opc/ruby/build/master/miniruby -I/home/opc/ruby/src/master/lib /home/opc/ruby/src/master/tool/runruby.rb --archdir=/home/opc/ruby/build/master --extout=.ext -- /home/opc/ruby/src/master/spec/mspec/bin/mspec-run -B /home/opc/ruby/src/master/spec/default.mspec --error-output stderr --debug -fy -o /tmp/rubytest.hu7io0/1-mspec-multi-0 E, [2024-05-21T00:44:16.756072 #3531013] ERROR -- : $ /home/opc/ruby/build/master/miniruby -I/home/opc/ruby/src/master/lib /home/opc/ruby/src/master/tool/runruby.rb --archdir=/home/opc/ruby/build/master --extout=.ext -- /home/opc/ruby/src/master/spec/mspec/bin/mspec-run -B /home/opc/ruby/src/master/spec/default.mspec --error-output stderr --debug -fy -o /tmp/rubytest.hu7io0/2-mspec-multi-1 E, [2024-05-21T00:44:16.756347 #3531013] ERROR -- : $ /home/opc/ruby/build/master/miniruby -I/home/opc/ruby/src/master/lib /home/opc/ruby/src/master/tool/runruby.rb --archdir=/home/opc/ruby/build/master --extout=.ext -- /home/opc/ruby/src/master/spec/mspec/bin/mspec-run -B /home/opc/ruby/src/master/spec/default.mspec --error-output stderr --debug -fy -o /tmp/rubytest.hu7io0/3-mspec-multi-2 I, [2024-05-21T00:44:16.886378 #3531013] INFO -- : ruby 3.4.0dev (2024-05-20T20:33:57Z master 86cf074fa1) [aarch64-linux] I, [2024-05-21T00:44:22.321344 #3531013] INFO -- : 0 ......................................................................... I, [2024-05-21T00:44:24.704344 #3531013] INFO -- : 73 ......................................................................... I, [2024-05-21T00:44:24.873179 #3531013] INFO -- : 146 ......................................................................... I, [2024-05-21T00:44:25.172275 #3531013] INFO -- : 219 ......................................................................... I, [2024-05-21T00:44:25.342098 #3531013] INFO -- : 292 ......................................................................... I, [2024-05-21T00:44:25.587248 #3531013] INFO -- : 365 ......................................................................... I, [2024-05-21T00:44:25.705616 #3531013] INFO -- : 438 ......................................................................... I, [2024-05-21T00:44:25.763428 #3531013] INFO -- : 511 ......................................................................... I, [2024-05-21T00:44:25.822251 #3531013] INFO -- : 584 ......................................................................... I, [2024-05-21T00:44:26.435486 #3531013] INFO -- : 657 ......................................................................... I, [2024-05-21T00:44:26.548362 #3531013] INFO -- : 730 ......................................................................... I, [2024-05-21T00:44:26.597757 #3531013] INFO -- : 803 ......................................................................... I, [2024-05-21T00:44:26.802431 #3531013] INFO -- : 876 ......................................................................... I, [2024-05-21T00:44:26.908301 #3531013] INFO -- : 949 ......................................................................... I, [2024-05-21T00:44:27.491557 #3531013] INFO -- : 1022 ......................................................................... I, [2024-05-21T00:44:29.799922 #3531013] INFO -- : 1095 ......................................................................... I, [2024-05-21T00:44:30.669248 #3531013] INFO -- : 1168 ......................................................................... I, [2024-05-21T00:44:30.857170 #3531013] INFO -- : 1241 ......................................................................... I, [2024-05-21T00:44:31.083631 #3531013] INFO -- : 1314 ......................................................................... I, [2024-05-21T00:44:31.183321 #3531013] INFO -- : 1387 ......................................................................... I, [2024-05-21T00:44:33.181185 #3531013] INFO -- : 1460 ......................................................................... I, [2024-05-21T00:44:36.633652 #3531013] INFO -- : 1533 ......................................................................... I, [2024-05-21T00:44:36.811360 #3531013] INFO -- : 1606 ......................................................................... I, [2024-05-21T00:44:37.652908 #3531013] INFO -- : 1679 ......................................................................... I, [2024-05-21T00:44:37.984141 #3531013] INFO -- : 1752 ......................................................................... I, [2024-05-21T00:44:38.250574 #3531013] INFO -- : 1825 ......................................................................... I, [2024-05-21T00:44:38.582472 #3531013] INFO -- : 1898 ......................................................................... I, [2024-05-21T00:44:38.964564 #3531013] INFO -- : 1971 ......................................................................... I, [2024-05-21T00:44:39.461925 #3531013] INFO -- : 2044 ......................................................................... I, [2024-05-21T00:44:39.562789 #3531013] INFO -- : 2117 ......................................................................... I, [2024-05-21T00:44:39.624909 #3531013] INFO -- : 2190 ......................................................................... I, [2024-05-21T00:44:39.675578 #3531013] INFO -- : 2263 ......................................................................... I, [2024-05-21T00:44:39.723878 #3531013] INFO -- : 2336 ......................................................................... I, [2024-05-21T00:44:39.817013 #3531013] INFO -- : 2409 ......................................................................... I, [2024-05-21T00:44:40.063071 #3531013] INFO -- : 2482 ......................................................................... I, [2024-05-21T00:44:40.195281 #3531013] INFO -- : 2555 ......................................................................... I, [2024-05-21T00:44:41.479219 #3531013] INFO -- : 2628 ......................................................................... I, [2024-05-21T00:44:41.710827 #3531013] INFO -- : 2701 ......................................................................... I, [2024-05-21T00:44:41.858780 #3531013] INFO -- : 2774 ......................................................................... I, [2024-05-21T00:44:42.185290 #3531013] INFO -- : 2847 ......................................................................... I, [2024-05-21T00:44:42.443052 #3531013] INFO -- : 2920 ......................................................................... I, [2024-05-21T00:44:42.565694 #3531013] INFO -- : 2993 ......................................................................... I, [2024-05-21T00:44:42.627374 #3531013] INFO -- : 3066 ......................................................................... I, [2024-05-21T00:44:42.678939 #3531013] INFO -- : 3139 ......................................................................... I, [2024-05-21T00:44:42.745549 #3531013] INFO -- : 3212 ......................................................................... I, [2024-05-21T00:44:42.816154 #3531013] INFO -- : 3285 ......................................................................... I, [2024-05-21T00:44:46.629647 #3531013] INFO -- : 3358 ......................................................................... I, [2024-05-21T00:44:46.652346 #3531013] INFO -- : I, [2024-05-21T00:44:46.652396 #3531013] INFO -- : I, [2024-05-21T00:44:46.652408 #3531013] INFO -- : Finished in 29.896685 seconds I, [2024-05-21T00:44:46.652417 #3531013] INFO -- : I, [2024-05-21T00:44:46.652425 #3531013] INFO -- : 3430 files, 32648 examples, 185699 expectations, 0 failures, 0 errors, 0 tagged I, [2024-05-21T00:44:46.653783 #3531013] INFO -- : $$$[end] "make yes-test-rubyspec MSPECOPT='--error-output stderr --debug -j' TESTS='-j3'" exit with 0.