# Logfile created on 2024-05-19 09:19:55 +0000 by logger.rb/v1.5.3 I, [2024-05-19T09:19:55.182594 #467798] INFO -- : #, @formatter=nil, @logdev=#, @binmode=false, @mon_data=#, @mon_data_owner_object_id=860>>> I, [2024-05-19T09:19:55.182889 #467798] INFO -- : $$$[beg] make update-unicode -j3 I, [2024-05-19T09:19:55.271928 #467798] INFO -- : Downloading Unicode emoji 15.0 files... I, [2024-05-19T09:19:55.271989 #467798] INFO -- : Downloading Unicode emoji 15.0 files... I, [2024-05-19T09:19:55.272377 #467798] INFO -- : Downloading Unicode emoji 15.0 files... I, [2024-05-19T09:19:55.348977 #467798] INFO -- : made symlink emoji/15.0/emoji-sequences.txt to /home/opc/ruby/src/master/.downloaded-cache/emoji/15.0/emoji-sequences.txt I, [2024-05-19T09:19:55.350534 #467798] INFO -- : downloading emoji/15.0/emoji-test.txt ... /home/opc/ruby/src/master/enc/unicode/data/emoji/15.0/emoji-sequences.txt already exists I, [2024-05-19T09:19:55.358094 #467798] INFO -- : downloading emoji/15.0/emoji-test.txt ... /home/opc/ruby/src/master/enc/unicode/data/emoji/15.0/emoji-sequences.txt already exists E, [2024-05-19T09:19:55.824160 #467798] ERROR -- : /home/opc/ruby/src/master/tool/downloader.rb:302:in `rescue in download': failed to download emoji/15.0/emoji-test.txt (RuntimeError) E, [2024-05-19T09:19:55.824228 #467798] ERROR -- : OpenURI::HTTPError: 403 Forbidden: https://www.unicode.org/Public/emoji/15.0/emoji-test.txt E, [2024-05-19T09:19:55.824240 #467798] ERROR -- : from /home/opc/ruby/src/master/tool/downloader.rb:201:in `download' E, [2024-05-19T09:19:55.824250 #467798] ERROR -- : from /home/opc/ruby/src/master/tool/downloader.rb:136:in `download' E, [2024-05-19T09:19:55.824258 #467798] ERROR -- : from /home/opc/ruby/src/master/tool/downloader.rb:482:in `block in
' E, [2024-05-19T09:19:55.824266 #467798] ERROR -- : from /home/opc/ruby/src/master/tool/downloader.rb:465:in `each' E, [2024-05-19T09:19:55.824275 #467798] ERROR -- : from /home/opc/ruby/src/master/tool/downloader.rb:465:in `
' E, [2024-05-19T09:19:55.824283 #467798] ERROR -- : /usr/local/lib/ruby/3.2.0/open-uri.rb:369:in `open_http': 403 Forbidden (OpenURI::HTTPError) E, [2024-05-19T09:19:55.824291 #467798] ERROR -- : from /usr/local/lib/ruby/3.2.0/open-uri.rb:760:in `buffer_open' E, [2024-05-19T09:19:55.824299 #467798] ERROR -- : from /usr/local/lib/ruby/3.2.0/open-uri.rb:214:in `block in open_loop' E, [2024-05-19T09:19:55.824307 #467798] ERROR -- : from /usr/local/lib/ruby/3.2.0/open-uri.rb:212:in `catch' E, [2024-05-19T09:19:55.824316 #467798] ERROR -- : from /usr/local/lib/ruby/3.2.0/open-uri.rb:212:in `open_loop' E, [2024-05-19T09:19:55.824324 #467798] ERROR -- : from /usr/local/lib/ruby/3.2.0/open-uri.rb:153:in `open_uri' E, [2024-05-19T09:19:55.824332 #467798] ERROR -- : from /usr/local/lib/ruby/3.2.0/open-uri.rb:740:in `open' E, [2024-05-19T09:19:55.824343 #467798] ERROR -- : from /usr/local/lib/ruby/3.2.0/open-uri.rb:748:in `read' E, [2024-05-19T09:19:55.824352 #467798] ERROR -- : from /home/opc/ruby/src/master/tool/downloader.rb:247:in `block in download' E, [2024-05-19T09:19:55.824360 #467798] ERROR -- : from /home/opc/ruby/src/master/tool/downloader.rb:378:in `with_retry' E, [2024-05-19T09:19:55.824368 #467798] ERROR -- : from /home/opc/ruby/src/master/tool/downloader.rb:246:in `download' E, [2024-05-19T09:19:55.824376 #467798] ERROR -- : from /home/opc/ruby/src/master/tool/downloader.rb:136:in `download' E, [2024-05-19T09:19:55.824384 #467798] ERROR -- : from /home/opc/ruby/src/master/tool/downloader.rb:482:in `block in
' E, [2024-05-19T09:19:55.824393 #467798] ERROR -- : from /home/opc/ruby/src/master/tool/downloader.rb:465:in `each' E, [2024-05-19T09:19:55.824400 #467798] ERROR -- : from /home/opc/ruby/src/master/tool/downloader.rb:465:in `
' E, [2024-05-19T09:19:55.827102 #467798] ERROR -- : make: *** [uncommon.mk:1765: /home/opc/ruby/src/master/enc/unicode/data/emoji/15.0/emoji-test.txt] Error 1 E, [2024-05-19T09:19:55.827129 #467798] ERROR -- : make: *** Waiting for unfinished jobs.... E, [2024-05-19T09:19:55.839535 #467798] ERROR -- : /home/opc/ruby/src/master/tool/downloader.rb:302:in `rescue in download': failed to download emoji/15.0/emoji-test.txt (RuntimeError) E, [2024-05-19T09:19:55.839582 #467798] ERROR -- : OpenURI::HTTPError: 403 Forbidden: https://www.unicode.org/Public/emoji/15.0/emoji-test.txt E, [2024-05-19T09:19:55.839593 #467798] ERROR -- : from /home/opc/ruby/src/master/tool/downloader.rb:201:in `download' E, [2024-05-19T09:19:55.839603 #467798] ERROR -- : from /home/opc/ruby/src/master/tool/downloader.rb:136:in `download' E, [2024-05-19T09:19:55.839612 #467798] ERROR -- : from /home/opc/ruby/src/master/tool/downloader.rb:482:in `block in
' E, [2024-05-19T09:19:55.839620 #467798] ERROR -- : from /home/opc/ruby/src/master/tool/downloader.rb:465:in `each' E, [2024-05-19T09:19:55.839629 #467798] ERROR -- : from /home/opc/ruby/src/master/tool/downloader.rb:465:in `
' E, [2024-05-19T09:19:55.839637 #467798] ERROR -- : /usr/local/lib/ruby/3.2.0/open-uri.rb:369:in `open_http': 403 Forbidden (OpenURI::HTTPError) E, [2024-05-19T09:19:55.839645 #467798] ERROR -- : from /usr/local/lib/ruby/3.2.0/open-uri.rb:760:in `buffer_open' E, [2024-05-19T09:19:55.839653 #467798] ERROR -- : from /usr/local/lib/ruby/3.2.0/open-uri.rb:214:in `block in open_loop' E, [2024-05-19T09:19:55.839662 #467798] ERROR -- : from /usr/local/lib/ruby/3.2.0/open-uri.rb:212:in `catch' E, [2024-05-19T09:19:55.839670 #467798] ERROR -- : from /usr/local/lib/ruby/3.2.0/open-uri.rb:212:in `open_loop' E, [2024-05-19T09:19:55.839678 #467798] ERROR -- : from /usr/local/lib/ruby/3.2.0/open-uri.rb:153:in `open_uri' E, [2024-05-19T09:19:55.839686 #467798] ERROR -- : from /usr/local/lib/ruby/3.2.0/open-uri.rb:740:in `open' E, [2024-05-19T09:19:55.839695 #467798] ERROR -- : from /usr/local/lib/ruby/3.2.0/open-uri.rb:748:in `read' E, [2024-05-19T09:19:55.839703 #467798] ERROR -- : from /home/opc/ruby/src/master/tool/downloader.rb:247:in `block in download' E, [2024-05-19T09:19:55.839711 #467798] ERROR -- : from /home/opc/ruby/src/master/tool/downloader.rb:378:in `with_retry' E, [2024-05-19T09:19:55.839720 #467798] ERROR -- : from /home/opc/ruby/src/master/tool/downloader.rb:246:in `download' E, [2024-05-19T09:19:55.839728 #467798] ERROR -- : from /home/opc/ruby/src/master/tool/downloader.rb:136:in `download' E, [2024-05-19T09:19:55.839736 #467798] ERROR -- : from /home/opc/ruby/src/master/tool/downloader.rb:482:in `block in
' E, [2024-05-19T09:19:55.839772 #467798] ERROR -- : from /home/opc/ruby/src/master/tool/downloader.rb:465:in `each' E, [2024-05-19T09:19:55.839782 #467798] ERROR -- : from /home/opc/ruby/src/master/tool/downloader.rb:465:in `
' E, [2024-05-19T09:19:55.842654 #467798] ERROR -- : make: *** [uncommon.mk:1765: /home/opc/ruby/src/master/enc/unicode/data/emoji/15.0/emoji-sequences.txt] Error 1 E, [2024-05-19T09:19:55.842698 #467798] ERROR -- : make: *** Deleting file '/home/opc/ruby/src/master/enc/unicode/data/emoji/15.0/emoji-sequences.txt' E, [2024-05-19T09:19:55.866536 #467798] ERROR -- : /home/opc/ruby/src/master/tool/downloader.rb:302:in `rescue in download': failed to download emoji/15.0/emoji-test.txt (RuntimeError) E, [2024-05-19T09:19:55.866581 #467798] ERROR -- : OpenURI::HTTPError: 403 Forbidden: https://www.unicode.org/Public/emoji/15.0/emoji-test.txt E, [2024-05-19T09:19:55.866592 #467798] ERROR -- : from /home/opc/ruby/src/master/tool/downloader.rb:201:in `download' E, [2024-05-19T09:19:55.866623 #467798] ERROR -- : from /home/opc/ruby/src/master/tool/downloader.rb:136:in `download' E, [2024-05-19T09:19:55.866632 #467798] ERROR -- : from /home/opc/ruby/src/master/tool/downloader.rb:482:in `block in
' E, [2024-05-19T09:19:55.866641 #467798] ERROR -- : from /home/opc/ruby/src/master/tool/downloader.rb:465:in `each' E, [2024-05-19T09:19:55.866649 #467798] ERROR -- : from /home/opc/ruby/src/master/tool/downloader.rb:465:in `
' E, [2024-05-19T09:19:55.866657 #467798] ERROR -- : /usr/local/lib/ruby/3.2.0/open-uri.rb:369:in `open_http': 403 Forbidden (OpenURI::HTTPError) E, [2024-05-19T09:19:55.866665 #467798] ERROR -- : from /usr/local/lib/ruby/3.2.0/open-uri.rb:760:in `buffer_open' E, [2024-05-19T09:19:55.866674 #467798] ERROR -- : from /usr/local/lib/ruby/3.2.0/open-uri.rb:214:in `block in open_loop' E, [2024-05-19T09:19:55.866682 #467798] ERROR -- : from /usr/local/lib/ruby/3.2.0/open-uri.rb:212:in `catch' E, [2024-05-19T09:19:55.866690 #467798] ERROR -- : from /usr/local/lib/ruby/3.2.0/open-uri.rb:212:in `open_loop' E, [2024-05-19T09:19:55.866698 #467798] ERROR -- : from /usr/local/lib/ruby/3.2.0/open-uri.rb:153:in `open_uri' E, [2024-05-19T09:19:55.866706 #467798] ERROR -- : from /usr/local/lib/ruby/3.2.0/open-uri.rb:740:in `open' E, [2024-05-19T09:19:55.866714 #467798] ERROR -- : from /usr/local/lib/ruby/3.2.0/open-uri.rb:748:in `read' E, [2024-05-19T09:19:55.866722 #467798] ERROR -- : from /home/opc/ruby/src/master/tool/downloader.rb:247:in `block in download' E, [2024-05-19T09:19:55.866731 #467798] ERROR -- : from /home/opc/ruby/src/master/tool/downloader.rb:378:in `with_retry' E, [2024-05-19T09:19:55.866740 #467798] ERROR -- : from /home/opc/ruby/src/master/tool/downloader.rb:246:in `download' E, [2024-05-19T09:19:55.866748 #467798] ERROR -- : from /home/opc/ruby/src/master/tool/downloader.rb:136:in `download' E, [2024-05-19T09:19:55.866756 #467798] ERROR -- : from /home/opc/ruby/src/master/tool/downloader.rb:482:in `block in
' E, [2024-05-19T09:19:55.866764 #467798] ERROR -- : from /home/opc/ruby/src/master/tool/downloader.rb:465:in `each' E, [2024-05-19T09:19:55.866772 #467798] ERROR -- : from /home/opc/ruby/src/master/tool/downloader.rb:465:in `
' E, [2024-05-19T09:19:55.869581 #467798] ERROR -- : make: *** [uncommon.mk:1765: /home/opc/ruby/src/master/enc/unicode/data/emoji/15.0/emoji-zwj-sequences.txt] Error 1 I, [2024-05-19T09:19:55.869643 #467798] INFO -- : downloading emoji/15.0/emoji-test.txt ... I, [2024-05-19T09:19:55.869784 #467798] INFO -- : $$$[end] "make update-unicode -j3" exit with 512. I, [2024-05-19T09:19:55.869812 #467798] INFO -- : $$$[beg] make update-download -j3 I, [2024-05-19T09:19:56.031012 #467798] INFO -- : tool/config.guess already exists I, [2024-05-19T09:19:56.031100 #467798] INFO -- : tool/config.sub already exists I, [2024-05-19T09:19:56.034358 #467798] INFO -- : Update power_assert to 84e85124c5014a139af39161d484156cfe87a9ed I, [2024-05-19T09:19:56.034548 #467798] INFO -- : Update rbs to ba7872795d5de04adb8ff500c0e6afdc81a041dd I, [2024-05-19T09:19:56.034673 #467798] INFO -- : Update typeprof to b19a6416da3a05d57fadd6ffdadb382b6d236ca5 I, [2024-05-19T09:19:56.037894 #467798] INFO -- : echo ba7872795d5de04adb8ff500c0e6afdc81a041dd | /bin/sh /home/opc/ruby/src/master/tool/ifchange /home/opc/ruby/src/master/.bundle/.timestamp/rbs.revision - I, [2024-05-19T09:19:56.038142 #467798] INFO -- : echo 84e85124c5014a139af39161d484156cfe87a9ed | /bin/sh /home/opc/ruby/src/master/tool/ifchange /home/opc/ruby/src/master/.bundle/.timestamp/power_assert.revision - I, [2024-05-19T09:19:56.038404 #467798] INFO -- : echo b19a6416da3a05d57fadd6ffdadb382b6d236ca5 | /bin/sh /home/opc/ruby/src/master/tool/ifchange /home/opc/ruby/src/master/.bundle/.timestamp/typeprof.revision - I, [2024-05-19T09:19:56.043283 #467798] INFO -- : /home/opc/ruby/src/master/.bundle/.timestamp/rbs.revision unchanged I, [2024-05-19T09:19:56.043806 #467798] INFO -- : /home/opc/ruby/src/master/.bundle/.timestamp/typeprof.revision unchanged I, [2024-05-19T09:19:56.044647 #467798] INFO -- : /home/opc/ruby/src/master/.bundle/.timestamp/power_assert.revision unchanged I, [2024-05-19T09:19:56.133974 #467798] INFO -- : Building power_assert@84e85124c5014a139af39161d484156cfe87a9ed to /home/opc/ruby/src/master/gems/power_assert-2.0.3.gem I, [2024-05-19T09:19:56.242880 #467798] INFO -- : Successfully built RubyGem I, [2024-05-19T09:19:56.242940 #467798] INFO -- : Name: power_assert I, [2024-05-19T09:19:56.242950 #467798] INFO -- : Version: 2.0.4dev I, [2024-05-19T09:19:56.242959 #467798] INFO -- : File: power_assert-2.0.4dev.gem I, [2024-05-19T09:19:56.322411 #467798] INFO -- : $$$[end] "make update-download -j3" exit with 0. I, [2024-05-19T09:19:56.322483 #467798] INFO -- : $$$[beg] make update-rubyspec -j3 I, [2024-05-19T09:19:56.411632 #467798] INFO -- : make: Nothing to be done for 'update-rubyspec'. I, [2024-05-19T09:19:56.411828 #467798] INFO -- : $$$[end] "make update-rubyspec -j3" exit with 0. I, [2024-05-19T09:19:56.411895 #467798] INFO -- : $$$[beg] make update-src -j3 I, [2024-05-19T09:19:57.276908 #467798] INFO -- : Already up to date. I, [2024-05-19T09:19:57.291682 #467798] INFO -- : Latest commit hash = 7afc16aa48 I, [2024-05-19T09:19:57.292249 #467798] INFO -- : $$$[end] "make update-src -j3" exit with 0. I, [2024-05-19T09:19:57.292289 #467798] INFO -- : $$$[beg] make after-update -j3 I, [2024-05-19T09:19:57.395697 #467798] INFO -- : generating /home/opc/ruby/src/master/ext/ripper/eventids2table.c I, [2024-05-19T09:19:57.402049 #467798] INFO -- : make[1]: Entering directory '/home/opc/ruby/src/master/ext/ripper' I, [2024-05-19T09:19:57.402094 #467798] INFO -- : make[1]: Nothing to be done for 'src'. I, [2024-05-19T09:19:57.402106 #467798] INFO -- : make[1]: Leaving directory '/home/opc/ruby/src/master/ext/ripper' I, [2024-05-19T09:19:57.430074 #467798] INFO -- : /home/opc/ruby/src/master/revision.h updated I, [2024-05-19T09:19:57.431225 #467798] INFO -- : generating aarch64-linux-fake.rb I, [2024-05-19T09:19:57.487879 #467798] INFO -- : aarch64-linux-fake.rb updated I, [2024-05-19T09:19:57.489623 #467798] INFO -- : generating enc.mk I, [2024-05-19T09:19:57.720422 #467798] INFO -- : making srcs under enc I, [2024-05-19T09:19:57.762164 #467798] INFO -- : make[1]: Entering directory '/home/opc/ruby/build/master' I, [2024-05-19T09:19:57.762239 #467798] INFO -- : make[1]: Nothing to be done for 'srcs'. I, [2024-05-19T09:19:57.762249 #467798] INFO -- : make[1]: Leaving directory '/home/opc/ruby/build/master' I, [2024-05-19T09:19:57.844808 #467798] INFO -- : Update power_assert to 84e85124c5014a139af39161d484156cfe87a9ed I, [2024-05-19T09:19:57.844874 #467798] INFO -- : Update rbs to ba7872795d5de04adb8ff500c0e6afdc81a041dd I, [2024-05-19T09:19:57.845864 #467798] INFO -- : Update typeprof to b19a6416da3a05d57fadd6ffdadb382b6d236ca5 I, [2024-05-19T09:19:57.848413 #467798] INFO -- : echo 84e85124c5014a139af39161d484156cfe87a9ed | /bin/sh /home/opc/ruby/src/master/tool/ifchange /home/opc/ruby/src/master/.bundle/.timestamp/power_assert.revision - I, [2024-05-19T09:19:57.848591 #467798] INFO -- : echo ba7872795d5de04adb8ff500c0e6afdc81a041dd | /bin/sh /home/opc/ruby/src/master/tool/ifchange /home/opc/ruby/src/master/.bundle/.timestamp/rbs.revision - I, [2024-05-19T09:19:57.848988 #467798] INFO -- : echo b19a6416da3a05d57fadd6ffdadb382b6d236ca5 | /bin/sh /home/opc/ruby/src/master/tool/ifchange /home/opc/ruby/src/master/.bundle/.timestamp/typeprof.revision - I, [2024-05-19T09:19:57.854499 #467798] INFO -- : /home/opc/ruby/src/master/.bundle/.timestamp/rbs.revision unchanged I, [2024-05-19T09:19:57.854549 #467798] INFO -- : /home/opc/ruby/src/master/.bundle/.timestamp/typeprof.revision unchanged I, [2024-05-19T09:19:57.854561 #467798] INFO -- : /home/opc/ruby/src/master/.bundle/.timestamp/power_assert.revision unchanged I, [2024-05-19T09:19:57.945142 #467798] INFO -- : Building power_assert@84e85124c5014a139af39161d484156cfe87a9ed to /home/opc/ruby/src/master/gems/power_assert-2.0.3.gem I, [2024-05-19T09:19:58.055859 #467798] INFO -- : Successfully built RubyGem I, [2024-05-19T09:19:58.055940 #467798] INFO -- : Name: power_assert I, [2024-05-19T09:19:58.055961 #467798] INFO -- : Version: 2.0.4dev I, [2024-05-19T09:19:58.055978 #467798] INFO -- : File: power_assert-2.0.4dev.gem I, [2024-05-19T09:19:58.058344 #467798] INFO -- : Extracting bundle gem power_assert-2.0.3... I, [2024-05-19T09:19:58.154587 #467798] INFO -- : Try with hash version of bundled gems instead of gems/power_assert-2.0.3.gem. We don't use this gem with release version of Ruby. I, [2024-05-19T09:19:58.164664 #467798] INFO -- : Unpacked gems/power_assert-2.0.4dev.gem I, [2024-05-19T09:19:58.166550 #467798] INFO -- : $$$[end] "make after-update -j3" exit with 0. I, [2024-05-19T09:19:58.166693 #467798] INFO -- : $$$[beg] make miniruby -j3 I, [2024-05-19T09:19:58.255060 #467798] INFO -- : BASERUBY = /usr/local/bin/ruby --disable=gems I, [2024-05-19T09:19:58.255166 #467798] INFO -- : CC = gcc I, [2024-05-19T09:19:58.255182 #467798] INFO -- : LD = ld I, [2024-05-19T09:19:58.255194 #467798] INFO -- : LDSHARED = gcc -shared I, [2024-05-19T09:19:58.255203 #467798] INFO -- : CFLAGS = -O3 -fno-fast-math -ggdb3 -Wall -Wextra -Wdeprecated-declarations -Wdiv-by-zero -Wduplicated-cond -Wimplicit-function-declaration -Wimplicit-int -Wpointer-arith -Wwrite-strings -Wold-style-definition -Wimplicit-fallthrough=0 -Wmissing-noreturn -Wno-cast-function-type -Wno-constant-logical-operand -Wno-long-long -Wno-missing-field-initializers -Wno-overlength-strings -Wno-packed-bitfield-compat -Wno-parentheses-equality -Wno-self-assign -Wno-tautological-compare -Wno-unused-parameter -Wno-unused-value -Wsuggest-attribute=format -Wsuggest-attribute=noreturn -Wunused-variable -Wmisleading-indentation -Wundef I, [2024-05-19T09:19:58.255213 #467798] INFO -- : XCFLAGS = -U_FORTIFY_SOURCE -D_FORTIFY_SOURCE=2 -fstack-protector-strong -msign-return-address=all -fno-strict-overflow -fvisibility=hidden -fexcess-precision=standard -DRUBY_EXPORT -fPIE -I. -I.ext/include/aarch64-linux -I/home/opc/ruby/src/master/include -I/home/opc/ruby/src/master -I/home/opc/ruby/src/master/prism -I/home/opc/ruby/src/master/enc/unicode/15.0.0 I, [2024-05-19T09:19:58.255222 #467798] INFO -- : CPPFLAGS = I, [2024-05-19T09:19:58.255230 #467798] INFO -- : DLDFLAGS = -Wl,--compress-debug-sections=zlib -fstack-protector-strong -pie I, [2024-05-19T09:19:58.255238 #467798] INFO -- : SOLIBS = -lz -lrt -lrt -ldl -lcrypt -lm -lpthread I, [2024-05-19T09:19:58.255247 #467798] INFO -- : LANG = en_US.UTF-8 I, [2024-05-19T09:19:58.255254 #467798] INFO -- : LC_ALL = I, [2024-05-19T09:19:58.255262 #467798] INFO -- : LC_CTYPE = I, [2024-05-19T09:19:58.255289 #467798] INFO -- : MFLAGS = -j3 --jobserver-auth=4,5 I, [2024-05-19T09:19:58.255299 #467798] INFO -- : RUSTC = rustc I, [2024-05-19T09:19:58.255307 #467798] INFO -- : YJIT_RUSTC_ARGS = --crate-name=yjit --crate-type=staticlib --edition=2021 -g -C lto=thin -C opt-level=3 -C overflow-checks=on '--out-dir=/home/opc/ruby/build/master/yjit/target/release/' /home/opc/ruby/src/master/yjit/src/lib.rs I, [2024-05-19T09:19:58.256024 #467798] INFO -- : gcc (GCC) 8.5.0 20210514 (Red Hat 8.5.0-10.1.0.1) I, [2024-05-19T09:19:58.256057 #467798] INFO -- : Copyright (C) 2018 Free Software Foundation, Inc. I, [2024-05-19T09:19:58.256067 #467798] INFO -- : This is free software; see the source for copying conditions. There is NO I, [2024-05-19T09:19:58.256080 #467798] INFO -- : warranty; not even for MERCHANTABILITY or FITNESS FOR A PARTICULAR PURPOSE. I, [2024-05-19T09:19:58.256088 #467798] INFO -- : I, [2024-05-19T09:19:58.280839 #467798] INFO -- : compiling /home/opc/ruby/src/master/version.c I, [2024-05-19T09:19:58.423364 #467798] INFO -- : linking miniruby I, [2024-05-19T09:19:59.325822 #467798] INFO -- : $$$[end] "make miniruby -j3" exit with 0. I, [2024-05-19T09:19:59.325989 #467798] INFO -- : $$$[beg] make ruby -j3 I, [2024-05-19T09:19:59.413793 #467798] INFO -- : BASERUBY = /usr/local/bin/ruby --disable=gems I, [2024-05-19T09:19:59.413862 #467798] INFO -- : CC = gcc I, [2024-05-19T09:19:59.413873 #467798] INFO -- : LD = ld I, [2024-05-19T09:19:59.413882 #467798] INFO -- : LDSHARED = gcc -shared I, [2024-05-19T09:19:59.413893 #467798] INFO -- : CFLAGS = -O3 -fno-fast-math -ggdb3 -Wall -Wextra -Wdeprecated-declarations -Wdiv-by-zero -Wduplicated-cond -Wimplicit-function-declaration -Wimplicit-int -Wpointer-arith -Wwrite-strings -Wold-style-definition -Wimplicit-fallthrough=0 -Wmissing-noreturn -Wno-cast-function-type -Wno-constant-logical-operand -Wno-long-long -Wno-missing-field-initializers -Wno-overlength-strings -Wno-packed-bitfield-compat -Wno-parentheses-equality -Wno-self-assign -Wno-tautological-compare -Wno-unused-parameter -Wno-unused-value -Wsuggest-attribute=format -Wsuggest-attribute=noreturn -Wunused-variable -Wmisleading-indentation -Wundef I, [2024-05-19T09:19:59.413903 #467798] INFO -- : XCFLAGS = -U_FORTIFY_SOURCE -D_FORTIFY_SOURCE=2 -fstack-protector-strong -msign-return-address=all -fno-strict-overflow -fvisibility=hidden -fexcess-precision=standard -DRUBY_EXPORT -fPIE -I. -I.ext/include/aarch64-linux -I/home/opc/ruby/src/master/include -I/home/opc/ruby/src/master -I/home/opc/ruby/src/master/prism -I/home/opc/ruby/src/master/enc/unicode/15.0.0 I, [2024-05-19T09:19:59.413912 #467798] INFO -- : CPPFLAGS = I, [2024-05-19T09:19:59.413920 #467798] INFO -- : DLDFLAGS = -Wl,--compress-debug-sections=zlib -fstack-protector-strong -pie I, [2024-05-19T09:19:59.413929 #467798] INFO -- : SOLIBS = -lz -lrt -lrt -ldl -lcrypt -lm -lpthread I, [2024-05-19T09:19:59.413937 #467798] INFO -- : LANG = en_US.UTF-8 I, [2024-05-19T09:19:59.413945 #467798] INFO -- : LC_ALL = I, [2024-05-19T09:19:59.413952 #467798] INFO -- : LC_CTYPE = I, [2024-05-19T09:19:59.413960 #467798] INFO -- : MFLAGS = -j3 --jobserver-auth=4,5 I, [2024-05-19T09:19:59.413968 #467798] INFO -- : RUSTC = rustc I, [2024-05-19T09:19:59.413976 #467798] INFO -- : YJIT_RUSTC_ARGS = --crate-name=yjit --crate-type=staticlib --edition=2021 -g -C lto=thin -C opt-level=3 -C overflow-checks=on '--out-dir=/home/opc/ruby/build/master/yjit/target/release/' /home/opc/ruby/src/master/yjit/src/lib.rs I, [2024-05-19T09:19:59.414705 #467798] INFO -- : gcc (GCC) 8.5.0 20210514 (Red Hat 8.5.0-10.1.0.1) I, [2024-05-19T09:19:59.414739 #467798] INFO -- : Copyright (C) 2018 Free Software Foundation, Inc. I, [2024-05-19T09:19:59.414749 #467798] INFO -- : This is free software; see the source for copying conditions. There is NO I, [2024-05-19T09:19:59.414758 #467798] INFO -- : warranty; not even for MERCHANTABILITY or FITNESS FOR A PARTICULAR PURPOSE. I, [2024-05-19T09:19:59.414767 #467798] INFO -- : I, [2024-05-19T09:19:59.597340 #467798] INFO -- : builtin_binary.inc updated I, [2024-05-19T09:19:59.599762 #467798] INFO -- : c5234a9416e4f20f175185e840b25b0f08674d14078ed7083f37e655458e3ca9 builtin_binary.inc I, [2024-05-19T09:19:59.600699 #467798] INFO -- : compiling /home/opc/ruby/src/master/builtin.c I, [2024-05-19T09:19:59.921039 #467798] INFO -- : linking static-library libruby-static.a I, [2024-05-19T09:20:02.776399 #467798] INFO -- : linking ruby I, [2024-05-19T09:20:03.693878 #467798] INFO -- : $$$[end] "make ruby -j3" exit with 0. I, [2024-05-19T09:20:03.694044 #467798] INFO -- : $$$[beg] make all -j3 I, [2024-05-19T09:20:03.781608 #467798] INFO -- : BASERUBY = /usr/local/bin/ruby --disable=gems I, [2024-05-19T09:20:03.781678 #467798] INFO -- : CC = gcc I, [2024-05-19T09:20:03.781689 #467798] INFO -- : LD = ld I, [2024-05-19T09:20:03.781698 #467798] INFO -- : LDSHARED = gcc -shared I, [2024-05-19T09:20:03.781709 #467798] INFO -- : CFLAGS = -O3 -fno-fast-math -ggdb3 -Wall -Wextra -Wdeprecated-declarations -Wdiv-by-zero -Wduplicated-cond -Wimplicit-function-declaration -Wimplicit-int -Wpointer-arith -Wwrite-strings -Wold-style-definition -Wimplicit-fallthrough=0 -Wmissing-noreturn -Wno-cast-function-type -Wno-constant-logical-operand -Wno-long-long -Wno-missing-field-initializers -Wno-overlength-strings -Wno-packed-bitfield-compat -Wno-parentheses-equality -Wno-self-assign -Wno-tautological-compare -Wno-unused-parameter -Wno-unused-value -Wsuggest-attribute=format -Wsuggest-attribute=noreturn -Wunused-variable -Wmisleading-indentation -Wundef I, [2024-05-19T09:20:03.781718 #467798] INFO -- : XCFLAGS = -U_FORTIFY_SOURCE -D_FORTIFY_SOURCE=2 -fstack-protector-strong -msign-return-address=all -fno-strict-overflow -fvisibility=hidden -fexcess-precision=standard -DRUBY_EXPORT -fPIE -I. -I.ext/include/aarch64-linux -I/home/opc/ruby/src/master/include -I/home/opc/ruby/src/master -I/home/opc/ruby/src/master/prism -I/home/opc/ruby/src/master/enc/unicode/15.0.0 I, [2024-05-19T09:20:03.781727 #467798] INFO -- : CPPFLAGS = I, [2024-05-19T09:20:03.781735 #467798] INFO -- : DLDFLAGS = -Wl,--compress-debug-sections=zlib -fstack-protector-strong -pie I, [2024-05-19T09:20:03.781744 #467798] INFO -- : SOLIBS = -lz -lrt -lrt -ldl -lcrypt -lm -lpthread I, [2024-05-19T09:20:03.781752 #467798] INFO -- : LANG = en_US.UTF-8 I, [2024-05-19T09:20:03.781760 #467798] INFO -- : LC_ALL = I, [2024-05-19T09:20:03.781768 #467798] INFO -- : LC_CTYPE = I, [2024-05-19T09:20:03.781776 #467798] INFO -- : MFLAGS = -j3 --jobserver-auth=4,5 I, [2024-05-19T09:20:03.781784 #467798] INFO -- : RUSTC = rustc I, [2024-05-19T09:20:03.781792 #467798] INFO -- : YJIT_RUSTC_ARGS = --crate-name=yjit --crate-type=staticlib --edition=2021 -g -C lto=thin -C opt-level=3 -C overflow-checks=on '--out-dir=/home/opc/ruby/build/master/yjit/target/release/' /home/opc/ruby/src/master/yjit/src/lib.rs I, [2024-05-19T09:20:03.782747 #467798] INFO -- : gcc (GCC) 8.5.0 20210514 (Red Hat 8.5.0-10.1.0.1) I, [2024-05-19T09:20:03.782781 #467798] INFO -- : Copyright (C) 2018 Free Software Foundation, Inc. I, [2024-05-19T09:20:03.782790 #467798] INFO -- : This is free software; see the source for copying conditions. There is NO I, [2024-05-19T09:20:03.782799 #467798] INFO -- : warranty; not even for MERCHANTABILITY or FITNESS FOR A PARTICULAR PURPOSE. I, [2024-05-19T09:20:03.782808 #467798] INFO -- : I, [2024-05-19T09:20:03.815264 #467798] INFO -- : generating encdb.h I, [2024-05-19T09:20:03.816670 #467798] INFO -- : generating enc.mk I, [2024-05-19T09:20:03.852684 #467798] INFO -- : encdb.h unchanged I, [2024-05-19T09:20:04.049100 #467798] INFO -- : making srcs under enc I, [2024-05-19T09:20:04.049164 #467798] INFO -- : making enc I, [2024-05-19T09:20:04.076906 #467798] INFO -- : make[1]: Entering directory '/home/opc/ruby/build/master' I, [2024-05-19T09:20:04.076972 #467798] INFO -- : make[1]: Nothing to be done for 'enc'. I, [2024-05-19T09:20:04.076983 #467798] INFO -- : make[1]: Leaving directory '/home/opc/ruby/build/master' I, [2024-05-19T09:20:04.091040 #467798] INFO -- : make[1]: Entering directory '/home/opc/ruby/build/master' I, [2024-05-19T09:20:04.091114 #467798] INFO -- : make[1]: Nothing to be done for 'srcs'. I, [2024-05-19T09:20:04.091127 #467798] INFO -- : make[1]: Leaving directory '/home/opc/ruby/build/master' I, [2024-05-19T09:20:04.091948 #467798] INFO -- : generating transdb.h I, [2024-05-19T09:20:04.245761 #467798] INFO -- : transdb.h unchanged I, [2024-05-19T09:20:04.247101 #467798] INFO -- : generating makefiles ext/configure-ext.mk I, [2024-05-19T09:20:04.247237 #467798] INFO -- : making trans I, [2024-05-19T09:20:04.286846 #467798] INFO -- : ext/configure-ext.mk updated I, [2024-05-19T09:20:04.290164 #467798] INFO -- : make[1]: Entering directory '/home/opc/ruby/build/master' I, [2024-05-19T09:20:04.295567 #467798] INFO -- : make[1]: Entering directory '/home/opc/ruby/build/master' I, [2024-05-19T09:20:04.295618 #467798] INFO -- : make[1]: Nothing to be done for 'trans'. I, [2024-05-19T09:20:04.295629 #467798] INFO -- : make[1]: Leaving directory '/home/opc/ruby/build/master' I, [2024-05-19T09:20:04.974626 #467798] INFO -- : making encs I, [2024-05-19T09:20:05.028881 #467798] INFO -- : make[1]: Entering directory '/home/opc/ruby/build/master' I, [2024-05-19T09:20:05.028950 #467798] INFO -- : make[1]: Nothing to be done for 'encs'. I, [2024-05-19T09:20:05.028963 #467798] INFO -- : make[1]: Leaving directory '/home/opc/ruby/build/master' I, [2024-05-19T09:20:05.029835 #467798] INFO -- : make[1]: Leaving directory '/home/opc/ruby/build/master' I, [2024-05-19T09:20:05.030578 #467798] INFO -- : generating makefile exts.mk I, [2024-05-19T09:20:05.088483 #467798] INFO -- : exts.mk unchanged I, [2024-05-19T09:20:05.093406 #467798] INFO -- : make[1]: Entering directory '/home/opc/ruby/build/master' I, [2024-05-19T09:20:05.198968 #467798] INFO -- : make[2]: Entering directory '/home/opc/ruby/build/master/ext/coverage' I, [2024-05-19T09:20:05.199590 #467798] INFO -- : make[2]: Entering directory '/home/opc/ruby/build/master/ext/digest' I, [2024-05-19T09:20:05.199682 #467798] INFO -- : make[2]: Entering directory '/home/opc/ruby/build/master/ext/date' I, [2024-05-19T09:20:05.204573 #467798] INFO -- : make[2]: Leaving directory '/home/opc/ruby/build/master/ext/date' I, [2024-05-19T09:20:05.205273 #467798] INFO -- : make[2]: Leaving directory '/home/opc/ruby/build/master/ext/coverage' I, [2024-05-19T09:20:05.207942 #467798] INFO -- : make[2]: Leaving directory '/home/opc/ruby/build/master/ext/digest' I, [2024-05-19T09:20:05.214640 #467798] INFO -- : make[2]: Entering directory '/home/opc/ruby/build/master/ext/io/console' I, [2024-05-19T09:20:05.214936 #467798] INFO -- : make[2]: Entering directory '/home/opc/ruby/build/master/ext/fiddle' I, [2024-05-19T09:20:05.219641 #467798] INFO -- : make[2]: Leaving directory '/home/opc/ruby/build/master/ext/io/console' I, [2024-05-19T09:20:05.221708 #467798] INFO -- : make[2]: Entering directory '/home/opc/ruby/build/master/ext/json' I, [2024-05-19T09:20:05.224778 #467798] INFO -- : make[2]: Entering directory '/home/opc/ruby/build/master/ext/monitor' I, [2024-05-19T09:20:05.225210 #467798] INFO -- : make[2]: Leaving directory '/home/opc/ruby/build/master/ext/fiddle' I, [2024-05-19T09:20:05.228958 #467798] INFO -- : make[2]: Leaving directory '/home/opc/ruby/build/master/ext/monitor' I, [2024-05-19T09:20:05.231411 #467798] INFO -- : make[2]: Leaving directory '/home/opc/ruby/build/master/ext/json' I, [2024-05-19T09:20:05.231445 #467798] INFO -- : make[2]: Entering directory '/home/opc/ruby/build/master/ext/objspace' I, [2024-05-19T09:20:05.235351 #467798] INFO -- : make[2]: Entering directory '/home/opc/ruby/build/master/ext/pathname' I, [2024-05-19T09:20:05.237457 #467798] INFO -- : make[2]: Leaving directory '/home/opc/ruby/build/master/ext/objspace' I, [2024-05-19T09:20:05.239634 #467798] INFO -- : make[2]: Leaving directory '/home/opc/ruby/build/master/ext/pathname' I, [2024-05-19T09:20:05.243678 #467798] INFO -- : make[2]: Entering directory '/home/opc/ruby/build/master/ext/psych' I, [2024-05-19T09:20:05.243726 #467798] INFO -- : make[2]: Entering directory '/home/opc/ruby/build/master/ext/pty' I, [2024-05-19T09:20:05.247895 #467798] INFO -- : make[2]: Entering directory '/home/opc/ruby/build/master/ext/openssl' I, [2024-05-19T09:20:05.249182 #467798] INFO -- : make[2]: Leaving directory '/home/opc/ruby/build/master/ext/pty' I, [2024-05-19T09:20:05.262749 #467798] INFO -- : make[2]: Entering directory '/home/opc/ruby/build/master/ext/ripper' I, [2024-05-19T09:20:05.263377 #467798] INFO -- : make[2]: Leaving directory '/home/opc/ruby/build/master/ext/psych' I, [2024-05-19T09:20:05.266302 #467798] INFO -- : make[2]: Entering directory '/home/opc/ruby/build/master/ext/rubyvm' I, [2024-05-19T09:20:05.269540 #467798] INFO -- : make[2]: Leaving directory '/home/opc/ruby/build/master/ext/ripper' I, [2024-05-19T09:20:05.270049 #467798] INFO -- : make[2]: Leaving directory '/home/opc/ruby/build/master/ext/rubyvm' I, [2024-05-19T09:20:05.270255 #467798] INFO -- : make[2]: Leaving directory '/home/opc/ruby/build/master/ext/openssl' I, [2024-05-19T09:20:05.276982 #467798] INFO -- : make[2]: Entering directory '/home/opc/ruby/build/master/.bundle/gems/bigdecimal-3.1.7/ext/bigdecimal' I, [2024-05-19T09:20:05.281355 #467798] INFO -- : make[2]: Entering directory '/home/opc/ruby/build/master/.bundle/gems/bigdecimal-3.1.8/ext/bigdecimal' I, [2024-05-19T09:20:05.281884 #467798] INFO -- : make[2]: Entering directory '/home/opc/ruby/build/master/ext/socket' I, [2024-05-19T09:20:05.292623 #467798] INFO -- : make[2]: Leaving directory '/home/opc/ruby/build/master/ext/socket' I, [2024-05-19T09:20:05.295069 #467798] INFO -- : make[2]: Entering directory '/home/opc/ruby/build/master/.bundle/gems/debug-1.9.2/ext/debug' I, [2024-05-19T09:20:05.311855 #467798] INFO -- : make[2]: Leaving directory '/home/opc/ruby/build/master/.bundle/gems/bigdecimal-3.1.7/ext/bigdecimal' I, [2024-05-19T09:20:05.312545 #467798] INFO -- : make[2]: Leaving directory '/home/opc/ruby/build/master/.bundle/gems/bigdecimal-3.1.8/ext/bigdecimal' I, [2024-05-19T09:20:05.314391 #467798] INFO -- : make[2]: Entering directory '/home/opc/ruby/build/master/.bundle/gems/nkf-0.2.0/ext/nkf' I, [2024-05-19T09:20:05.314832 #467798] INFO -- : make[2]: Entering directory '/home/opc/ruby/build/master/.bundle/gems/racc-1.7.3/ext/racc/cparse' I, [2024-05-19T09:20:05.326255 #467798] INFO -- : make[2]: Leaving directory '/home/opc/ruby/build/master/.bundle/gems/debug-1.9.2/ext/debug' I, [2024-05-19T09:20:05.329189 #467798] INFO -- : make[2]: Entering directory '/home/opc/ruby/build/master/.bundle/gems/rbs-3.4.4/ext/rbs_extension' I, [2024-05-19T09:20:05.346133 #467798] INFO -- : make[2]: Leaving directory '/home/opc/ruby/build/master/.bundle/gems/racc-1.7.3/ext/racc/cparse' I, [2024-05-19T09:20:05.346197 #467798] INFO -- : make[2]: Leaving directory '/home/opc/ruby/build/master/.bundle/gems/nkf-0.2.0/ext/nkf' I, [2024-05-19T09:20:05.348597 #467798] INFO -- : make[2]: Entering directory '/home/opc/ruby/build/master/.bundle/gems/syslog-0.1.2/ext/syslog' I, [2024-05-19T09:20:05.361793 #467798] INFO -- : make[2]: Leaving directory '/home/opc/ruby/build/master/.bundle/gems/rbs-3.4.4/ext/rbs_extension' I, [2024-05-19T09:20:05.375078 #467798] INFO -- : make[2]: Entering directory '/home/opc/ruby/build/master/ext/digest/sha2' I, [2024-05-19T09:20:05.378757 #467798] INFO -- : make[2]: Leaving directory '/home/opc/ruby/build/master/.bundle/gems/syslog-0.1.2/ext/syslog' I, [2024-05-19T09:20:05.380061 #467798] INFO -- : make[2]: Leaving directory '/home/opc/ruby/build/master/ext/digest/sha2' I, [2024-05-19T09:20:05.421063 #467798] INFO -- : make[2]: Entering directory '/home/opc/ruby/build/master' I, [2024-05-19T09:20:05.503253 #467798] INFO -- : make[2]: 'ruby' is up to date. I, [2024-05-19T09:20:05.503325 #467798] INFO -- : make[2]: Leaving directory '/home/opc/ruby/build/master' I, [2024-05-19T09:20:05.503475 #467798] INFO -- : make[1]: Leaving directory '/home/opc/ruby/build/master' I, [2024-05-19T09:20:05.507953 #467798] INFO -- : make[1]: Entering directory '/home/opc/ruby/build/master' I, [2024-05-19T09:20:05.508011 #467798] INFO -- : make[1]: Nothing to be done for 'note'. I, [2024-05-19T09:20:05.508022 #467798] INFO -- : make[1]: Leaving directory '/home/opc/ruby/build/master' I, [2024-05-19T09:20:05.508317 #467798] INFO -- : $$$[end] "make all -j3" exit with 0. I, [2024-05-19T09:20:05.508461 #467798] INFO -- : $$$[beg] make install -j3 I, [2024-05-19T09:20:05.601995 #467798] INFO -- : Update power_assert to 84e85124c5014a139af39161d484156cfe87a9ed I, [2024-05-19T09:20:05.602280 #467798] INFO -- : Update rbs to ba7872795d5de04adb8ff500c0e6afdc81a041dd I, [2024-05-19T09:20:05.603080 #467798] INFO -- : Update typeprof to b19a6416da3a05d57fadd6ffdadb382b6d236ca5 I, [2024-05-19T09:20:05.606101 #467798] INFO -- : echo 84e85124c5014a139af39161d484156cfe87a9ed | /bin/sh /home/opc/ruby/src/master/tool/ifchange /home/opc/ruby/src/master/.bundle/.timestamp/power_assert.revision - I, [2024-05-19T09:20:05.606332 #467798] INFO -- : echo ba7872795d5de04adb8ff500c0e6afdc81a041dd | /bin/sh /home/opc/ruby/src/master/tool/ifchange /home/opc/ruby/src/master/.bundle/.timestamp/rbs.revision - I, [2024-05-19T09:20:05.606967 #467798] INFO -- : echo b19a6416da3a05d57fadd6ffdadb382b6d236ca5 | /bin/sh /home/opc/ruby/src/master/tool/ifchange /home/opc/ruby/src/master/.bundle/.timestamp/typeprof.revision - I, [2024-05-19T09:20:05.612728 #467798] INFO -- : /home/opc/ruby/src/master/.bundle/.timestamp/power_assert.revision unchanged I, [2024-05-19T09:20:05.612906 #467798] INFO -- : /home/opc/ruby/src/master/.bundle/.timestamp/rbs.revision unchanged I, [2024-05-19T09:20:05.614498 #467798] INFO -- : /home/opc/ruby/src/master/.bundle/.timestamp/typeprof.revision unchanged I, [2024-05-19T09:20:05.616262 #467798] INFO -- : BASERUBY = /usr/local/bin/ruby --disable=gems I, [2024-05-19T09:20:05.616298 #467798] INFO -- : CC = gcc I, [2024-05-19T09:20:05.616310 #467798] INFO -- : LD = ld I, [2024-05-19T09:20:05.616319 #467798] INFO -- : LDSHARED = gcc -shared I, [2024-05-19T09:20:05.616328 #467798] INFO -- : CFLAGS = -O3 -fno-fast-math -ggdb3 -Wall -Wextra -Wdeprecated-declarations -Wdiv-by-zero -Wduplicated-cond -Wimplicit-function-declaration -Wimplicit-int -Wpointer-arith -Wwrite-strings -Wold-style-definition -Wimplicit-fallthrough=0 -Wmissing-noreturn -Wno-cast-function-type -Wno-constant-logical-operand -Wno-long-long -Wno-missing-field-initializers -Wno-overlength-strings -Wno-packed-bitfield-compat -Wno-parentheses-equality -Wno-self-assign -Wno-tautological-compare -Wno-unused-parameter -Wno-unused-value -Wsuggest-attribute=format -Wsuggest-attribute=noreturn -Wunused-variable -Wmisleading-indentation -Wundef I, [2024-05-19T09:20:05.616337 #467798] INFO -- : XCFLAGS = -U_FORTIFY_SOURCE -D_FORTIFY_SOURCE=2 -fstack-protector-strong -msign-return-address=all -fno-strict-overflow -fvisibility=hidden -fexcess-precision=standard -DRUBY_EXPORT -fPIE -I. -I.ext/include/aarch64-linux -I/home/opc/ruby/src/master/include -I/home/opc/ruby/src/master -I/home/opc/ruby/src/master/prism -I/home/opc/ruby/src/master/enc/unicode/15.0.0 I, [2024-05-19T09:20:05.616346 #467798] INFO -- : CPPFLAGS = I, [2024-05-19T09:20:05.616354 #467798] INFO -- : DLDFLAGS = -Wl,--compress-debug-sections=zlib -fstack-protector-strong -pie I, [2024-05-19T09:20:05.616364 #467798] INFO -- : SOLIBS = -lz -lrt -lrt -ldl -lcrypt -lm -lpthread I, [2024-05-19T09:20:05.616372 #467798] INFO -- : LANG = en_US.UTF-8 I, [2024-05-19T09:20:05.616380 #467798] INFO -- : LC_ALL = I, [2024-05-19T09:20:05.616411 #467798] INFO -- : LC_CTYPE = I, [2024-05-19T09:20:05.616421 #467798] INFO -- : MFLAGS = -j3 --jobserver-auth=4,5 I, [2024-05-19T09:20:05.616429 #467798] INFO -- : RUSTC = rustc I, [2024-05-19T09:20:05.616437 #467798] INFO -- : YJIT_RUSTC_ARGS = --crate-name=yjit --crate-type=staticlib --edition=2021 -g -C lto=thin -C opt-level=3 -C overflow-checks=on '--out-dir=/home/opc/ruby/build/master/yjit/target/release/' /home/opc/ruby/src/master/yjit/src/lib.rs I, [2024-05-19T09:20:05.648289 #467798] INFO -- : generating encdb.h I, [2024-05-19T09:20:05.648355 #467798] INFO -- : gcc (GCC) 8.5.0 20210514 (Red Hat 8.5.0-10.1.0.1) I, [2024-05-19T09:20:05.648365 #467798] INFO -- : Copyright (C) 2018 Free Software Foundation, Inc. I, [2024-05-19T09:20:05.648374 #467798] INFO -- : This is free software; see the source for copying conditions. There is NO I, [2024-05-19T09:20:05.648383 #467798] INFO -- : warranty; not even for MERCHANTABILITY or FITNESS FOR A PARTICULAR PURPOSE. I, [2024-05-19T09:20:05.648391 #467798] INFO -- : I, [2024-05-19T09:20:05.648979 #467798] INFO -- : generating enc.mk I, [2024-05-19T09:20:05.690998 #467798] INFO -- : encdb.h unchanged I, [2024-05-19T09:20:05.782973 #467798] INFO -- : Building power_assert@84e85124c5014a139af39161d484156cfe87a9ed to /home/opc/ruby/src/master/gems/power_assert-2.0.3.gem I, [2024-05-19T09:20:05.886803 #467798] INFO -- : making srcs under enc I, [2024-05-19T09:20:05.886900 #467798] INFO -- : making enc I, [2024-05-19T09:20:05.895899 #467798] INFO -- : Successfully built RubyGem I, [2024-05-19T09:20:05.895949 #467798] INFO -- : Name: power_assert I, [2024-05-19T09:20:05.895960 #467798] INFO -- : Version: 2.0.4dev I, [2024-05-19T09:20:05.895968 #467798] INFO -- : File: power_assert-2.0.4dev.gem I, [2024-05-19T09:20:05.898337 #467798] INFO -- : Extracting bundle gem power_assert-2.0.3... I, [2024-05-19T09:20:05.914208 #467798] INFO -- : make[1]: Entering directory '/home/opc/ruby/build/master' I, [2024-05-19T09:20:05.914264 #467798] INFO -- : make[1]: Nothing to be done for 'enc'. I, [2024-05-19T09:20:05.914275 #467798] INFO -- : make[1]: Leaving directory '/home/opc/ruby/build/master' I, [2024-05-19T09:20:05.929581 #467798] INFO -- : make[1]: Entering directory '/home/opc/ruby/build/master' I, [2024-05-19T09:20:05.929630 #467798] INFO -- : make[1]: Nothing to be done for 'srcs'. I, [2024-05-19T09:20:05.929642 #467798] INFO -- : make[1]: Leaving directory '/home/opc/ruby/build/master' I, [2024-05-19T09:20:05.930466 #467798] INFO -- : generating transdb.h I, [2024-05-19T09:20:05.995334 #467798] INFO -- : Try with hash version of bundled gems instead of gems/power_assert-2.0.3.gem. We don't use this gem with release version of Ruby. I, [2024-05-19T09:20:06.005205 #467798] INFO -- : Unpacked gems/power_assert-2.0.4dev.gem I, [2024-05-19T09:20:06.074880 #467798] INFO -- : transdb.h unchanged I, [2024-05-19T09:20:06.076205 #467798] INFO -- : generating makefiles ext/configure-ext.mk I, [2024-05-19T09:20:06.076247 #467798] INFO -- : making trans I, [2024-05-19T09:20:06.115445 #467798] INFO -- : ext/configure-ext.mk unchanged I, [2024-05-19T09:20:06.118562 #467798] INFO -- : make[1]: Entering directory '/home/opc/ruby/build/master' I, [2024-05-19T09:20:06.125122 #467798] INFO -- : make[1]: Entering directory '/home/opc/ruby/build/master' I, [2024-05-19T09:20:06.125179 #467798] INFO -- : make[1]: Nothing to be done for 'trans'. I, [2024-05-19T09:20:06.125192 #467798] INFO -- : make[1]: Leaving directory '/home/opc/ruby/build/master' I, [2024-05-19T09:20:06.245300 #467798] INFO -- : making encs I, [2024-05-19T09:20:06.298590 #467798] INFO -- : make[1]: Entering directory '/home/opc/ruby/build/master' I, [2024-05-19T09:20:06.298681 #467798] INFO -- : make[1]: Nothing to be done for 'encs'. I, [2024-05-19T09:20:06.298693 #467798] INFO -- : make[1]: Leaving directory '/home/opc/ruby/build/master' I, [2024-05-19T09:20:06.873833 #467798] INFO -- : make[1]: Leaving directory '/home/opc/ruby/build/master' I, [2024-05-19T09:20:06.874566 #467798] INFO -- : generating makefile exts.mk I, [2024-05-19T09:20:06.933938 #467798] INFO -- : exts.mk unchanged I, [2024-05-19T09:20:06.938886 #467798] INFO -- : make[1]: Entering directory '/home/opc/ruby/build/master' I, [2024-05-19T09:20:07.042796 #467798] INFO -- : make[2]: Entering directory '/home/opc/ruby/build/master/ext/coverage' I, [2024-05-19T09:20:07.044012 #467798] INFO -- : make[2]: Entering directory '/home/opc/ruby/build/master/ext/digest' I, [2024-05-19T09:20:07.044698 #467798] INFO -- : make[2]: Entering directory '/home/opc/ruby/build/master/ext/date' I, [2024-05-19T09:20:07.047625 #467798] INFO -- : make[2]: Leaving directory '/home/opc/ruby/build/master/ext/coverage' I, [2024-05-19T09:20:07.051361 #467798] INFO -- : make[2]: Leaving directory '/home/opc/ruby/build/master/ext/date' I, [2024-05-19T09:20:07.054218 #467798] INFO -- : make[2]: Leaving directory '/home/opc/ruby/build/master/ext/digest' I, [2024-05-19T09:20:07.059757 #467798] INFO -- : make[2]: Entering directory '/home/opc/ruby/build/master/ext/io/console' I, [2024-05-19T09:20:07.061413 #467798] INFO -- : make[2]: Entering directory '/home/opc/ruby/build/master/ext/fiddle' I, [2024-05-19T09:20:07.065972 #467798] INFO -- : make[2]: Leaving directory '/home/opc/ruby/build/master/ext/io/console' I, [2024-05-19T09:20:07.066761 #467798] INFO -- : make[2]: Entering directory '/home/opc/ruby/build/master/ext/json' I, [2024-05-19T09:20:07.069965 #467798] INFO -- : make[2]: Entering directory '/home/opc/ruby/build/master/ext/monitor' I, [2024-05-19T09:20:07.070369 #467798] INFO -- : make[2]: Leaving directory '/home/opc/ruby/build/master/ext/fiddle' I, [2024-05-19T09:20:07.076282 #467798] INFO -- : make[2]: Entering directory '/home/opc/ruby/build/master/ext/objspace' I, [2024-05-19T09:20:07.076505 #467798] INFO -- : make[2]: Leaving directory '/home/opc/ruby/build/master/ext/monitor' I, [2024-05-19T09:20:07.077406 #467798] INFO -- : make[2]: Leaving directory '/home/opc/ruby/build/master/ext/json' I, [2024-05-19T09:20:07.080861 #467798] INFO -- : make[2]: Entering directory '/home/opc/ruby/build/master/ext/pathname' I, [2024-05-19T09:20:07.082413 #467798] INFO -- : make[2]: Leaving directory '/home/opc/ruby/build/master/ext/objspace' I, [2024-05-19T09:20:07.089745 #467798] INFO -- : make[2]: Leaving directory '/home/opc/ruby/build/master/ext/pathname' I, [2024-05-19T09:20:07.090080 #467798] INFO -- : make[2]: Entering directory '/home/opc/ruby/build/master/ext/psych' I, [2024-05-19T09:20:07.095416 #467798] INFO -- : make[2]: Entering directory '/home/opc/ruby/build/master/ext/openssl' I, [2024-05-19T09:20:07.096778 #467798] INFO -- : make[2]: Entering directory '/home/opc/ruby/build/master/ext/pty' I, [2024-05-19T09:20:07.101297 #467798] INFO -- : make[2]: Leaving directory '/home/opc/ruby/build/master/ext/pty' I, [2024-05-19T09:20:07.108884 #467798] INFO -- : make[2]: Leaving directory '/home/opc/ruby/build/master/ext/psych' I, [2024-05-19T09:20:07.110782 #467798] INFO -- : make[2]: Entering directory '/home/opc/ruby/build/master/ext/rubyvm' I, [2024-05-19T09:20:07.114231 #467798] INFO -- : make[2]: Leaving directory '/home/opc/ruby/build/master/ext/rubyvm' I, [2024-05-19T09:20:07.115244 #467798] INFO -- : make[2]: Entering directory '/home/opc/ruby/build/master/ext/ripper' I, [2024-05-19T09:20:07.118635 #467798] INFO -- : make[2]: Leaving directory '/home/opc/ruby/build/master/ext/openssl' I, [2024-05-19T09:20:07.121790 #467798] INFO -- : make[2]: Leaving directory '/home/opc/ruby/build/master/ext/ripper' I, [2024-05-19T09:20:07.128608 #467798] INFO -- : make[2]: Entering directory '/home/opc/ruby/build/master/ext/socket' I, [2024-05-19T09:20:07.128645 #467798] INFO -- : make[2]: Entering directory '/home/opc/ruby/build/master/.bundle/gems/bigdecimal-3.1.7/ext/bigdecimal' I, [2024-05-19T09:20:07.129523 #467798] INFO -- : make[2]: Entering directory '/home/opc/ruby/build/master/.bundle/gems/bigdecimal-3.1.8/ext/bigdecimal' I, [2024-05-19T09:20:07.139474 #467798] INFO -- : make[2]: Leaving directory '/home/opc/ruby/build/master/ext/socket' I, [2024-05-19T09:20:07.142125 #467798] INFO -- : make[2]: Entering directory '/home/opc/ruby/build/master/.bundle/gems/debug-1.9.2/ext/debug' I, [2024-05-19T09:20:07.160377 #467798] INFO -- : make[2]: Leaving directory '/home/opc/ruby/build/master/.bundle/gems/bigdecimal-3.1.8/ext/bigdecimal' I, [2024-05-19T09:20:07.161694 #467798] INFO -- : make[2]: Leaving directory '/home/opc/ruby/build/master/.bundle/gems/bigdecimal-3.1.7/ext/bigdecimal' I, [2024-05-19T09:20:07.163354 #467798] INFO -- : make[2]: Entering directory '/home/opc/ruby/build/master/.bundle/gems/nkf-0.2.0/ext/nkf' I, [2024-05-19T09:20:07.166773 #467798] INFO -- : make[2]: Entering directory '/home/opc/ruby/build/master/.bundle/gems/racc-1.7.3/ext/racc/cparse' I, [2024-05-19T09:20:07.175471 #467798] INFO -- : make[2]: Leaving directory '/home/opc/ruby/build/master/.bundle/gems/debug-1.9.2/ext/debug' I, [2024-05-19T09:20:07.178448 #467798] INFO -- : make[2]: Entering directory '/home/opc/ruby/build/master/.bundle/gems/rbs-3.4.4/ext/rbs_extension' I, [2024-05-19T09:20:07.195431 #467798] INFO -- : make[2]: Leaving directory '/home/opc/ruby/build/master/.bundle/gems/nkf-0.2.0/ext/nkf' I, [2024-05-19T09:20:07.199290 #467798] INFO -- : make[2]: Entering directory '/home/opc/ruby/build/master/.bundle/gems/syslog-0.1.2/ext/syslog' I, [2024-05-19T09:20:07.202599 #467798] INFO -- : make[2]: Leaving directory '/home/opc/ruby/build/master/.bundle/gems/racc-1.7.3/ext/racc/cparse' I, [2024-05-19T09:20:07.213106 #467798] INFO -- : make[2]: Leaving directory '/home/opc/ruby/build/master/.bundle/gems/rbs-3.4.4/ext/rbs_extension' I, [2024-05-19T09:20:07.222094 #467798] INFO -- : make[2]: Entering directory '/home/opc/ruby/build/master/ext/digest/sha2' I, [2024-05-19T09:20:07.227575 #467798] INFO -- : make[2]: Leaving directory '/home/opc/ruby/build/master/ext/digest/sha2' I, [2024-05-19T09:20:07.233985 #467798] INFO -- : make[2]: Leaving directory '/home/opc/ruby/build/master/.bundle/gems/syslog-0.1.2/ext/syslog' I, [2024-05-19T09:20:07.272117 #467798] INFO -- : make[2]: Entering directory '/home/opc/ruby/build/master' I, [2024-05-19T09:20:07.356234 #467798] INFO -- : make[2]: 'ruby' is up to date. I, [2024-05-19T09:20:07.356309 #467798] INFO -- : make[2]: Leaving directory '/home/opc/ruby/build/master' I, [2024-05-19T09:20:07.356457 #467798] INFO -- : make[1]: Leaving directory '/home/opc/ruby/build/master' I, [2024-05-19T09:20:07.360837 #467798] INFO -- : make[1]: Entering directory '/home/opc/ruby/build/master' I, [2024-05-19T09:20:07.360883 #467798] INFO -- : make[1]: Nothing to be done for 'note'. I, [2024-05-19T09:20:07.360893 #467798] INFO -- : make[1]: Leaving directory '/home/opc/ruby/build/master' I, [2024-05-19T09:20:07.361030 #467798] INFO -- : ./miniruby -I/home/opc/ruby/src/master/lib -I. -I.ext/common /home/opc/ruby/src/master/tool/runruby.rb --extout=.ext -- --disable-gems -r./aarch64-linux-fake /home/opc/ruby/src/master/tool/rbinstall.rb --make="make" --dest-dir="" --extout=".ext" --ext-build-dir="./ext" --mflags="-j3 --jobserver-auth=4,5" --make-flags=" -j3 --jobserver-auth=4,5" --data-mode=0644 --prog-mode=0755 --installed-list .installed.list --mantype="doc" --gnumake --install=all --exclude=doc I, [2024-05-19T09:20:07.513517 #467798] INFO -- : Installing to I, [2024-05-19T09:20:07.513585 #467798] INFO -- : installing binary commands: /home/opc/ruby/install/master/bin I, [2024-05-19T09:20:07.525693 #467798] INFO -- : installing base libraries: /home/opc/ruby/install/master/lib I, [2024-05-19T09:20:07.526213 #467798] INFO -- : installing arch files: /home/opc/ruby/install/master/lib/ruby/3.4.0+0/aarch64-linux I, [2024-05-19T09:20:07.526339 #467798] INFO -- : installing pkgconfig data: /home/opc/ruby/install/master/lib/pkgconfig I, [2024-05-19T09:20:07.526418 #467798] INFO -- : installing extension objects: /home/opc/ruby/install/master/lib/ruby/3.4.0+0/aarch64-linux I, [2024-05-19T09:20:07.542663 #467798] INFO -- : installing extension objects: /home/opc/ruby/install/master/lib/ruby/site_ruby/3.4.0+0/aarch64-linux I, [2024-05-19T09:20:07.542701 #467798] INFO -- : installing extension objects: /home/opc/ruby/install/master/lib/ruby/vendor_ruby/3.4.0+0/aarch64-linux I, [2024-05-19T09:20:07.542944 #467798] INFO -- : installing extension headers: /home/opc/ruby/install/master/include/ruby-3.4.0+0/aarch64-linux I, [2024-05-19T09:20:07.543457 #467798] INFO -- : installing extension scripts: /home/opc/ruby/install/master/lib/ruby/3.4.0+0 I, [2024-05-19T09:20:07.549508 #467798] INFO -- : installing extension scripts: /home/opc/ruby/install/master/lib/ruby/site_ruby/3.4.0+0 I, [2024-05-19T09:20:07.549535 #467798] INFO -- : installing extension scripts: /home/opc/ruby/install/master/lib/ruby/vendor_ruby/3.4.0+0 I, [2024-05-19T09:20:07.549545 #467798] INFO -- : installing extension headers: /home/opc/ruby/install/master/include/ruby-3.4.0+0/ruby I, [2024-05-19T09:20:07.549663 #467798] INFO -- : installing command scripts: /home/opc/ruby/install/master/bin I, [2024-05-19T09:20:07.549996 #467798] INFO -- : installing library scripts: /home/opc/ruby/install/master/lib/ruby/3.4.0+0 I, [2024-05-19T09:20:07.636936 #467798] INFO -- : installing common headers: /home/opc/ruby/install/master/include/ruby-3.4.0+0 I, [2024-05-19T09:20:07.653058 #467798] INFO -- : installing manpages: /home/opc/ruby/install/master/share/man/man1 I, [2024-05-19T09:20:07.653397 #467798] INFO -- : installing default gems from lib: /home/opc/ruby/install/master/lib/ruby/gems/3.4.0+0 I, [2024-05-19T09:20:07.693825 #467798] INFO -- : benchmark 0.3.0 I, [2024-05-19T09:20:07.698037 #467798] INFO -- : bundler 2.6.0.dev I, [2024-05-19T09:20:07.703670 #467798] INFO -- : cgi 0.4.1 I, [2024-05-19T09:20:07.704875 #467798] INFO -- : delegate 0.3.1 I, [2024-05-19T09:20:07.706062 #467798] INFO -- : did_you_mean 1.6.3 I, [2024-05-19T09:20:07.707360 #467798] INFO -- : english 0.8.0 I, [2024-05-19T09:20:07.708468 #467798] INFO -- : erb 4.0.4 I, [2024-05-19T09:20:07.711227 #467798] INFO -- : error_highlight 0.6.0 I, [2024-05-19T09:20:07.712336 #467798] INFO -- : fileutils 1.7.2 I, [2024-05-19T09:20:07.713579 #467798] INFO -- : find 0.2.0 I, [2024-05-19T09:20:07.714665 #467798] INFO -- : forwardable 1.3.3 I, [2024-05-19T09:20:07.715752 #467798] INFO -- : ipaddr 1.2.6 I, [2024-05-19T09:20:07.716873 #467798] INFO -- : irb 1.13.1 I, [2024-05-19T09:20:07.721082 #467798] INFO -- : logger 1.6.0 I, [2024-05-19T09:20:07.722830 #467798] INFO -- : net-http 0.4.1 I, [2024-05-19T09:20:07.723994 #467798] INFO -- : net-protocol 0.2.2 I, [2024-05-19T09:20:07.725180 #467798] INFO -- : open-uri 0.4.1 I, [2024-05-19T09:20:07.726374 #467798] INFO -- : open3 0.2.1 I, [2024-05-19T09:20:07.727507 #467798] INFO -- : optparse 0.5.0 I, [2024-05-19T09:20:07.728674 #467798] INFO -- : ostruct 0.6.0 I, [2024-05-19T09:20:07.729801 #467798] INFO -- : pp 0.5.0 I, [2024-05-19T09:20:07.730945 #467798] INFO -- : prettyprint 0.2.0 I, [2024-05-19T09:20:07.732060 #467798] INFO -- : prism 0.29.0 I, [2024-05-19T09:20:07.733621 #467798] INFO -- : pstore 0.1.3 I, [2024-05-19T09:20:07.734695 #467798] INFO -- : rdoc 6.6.3.1 I, [2024-05-19T09:20:07.738637 #467798] INFO -- : readline 0.0.4 I, [2024-05-19T09:20:07.739737 #467798] INFO -- : reline 0.5.7 I, [2024-05-19T09:20:07.740958 #467798] INFO -- : resolv 0.4.0 I, [2024-05-19T09:20:07.742120 #467798] INFO -- : ruby2_keywords 0.0.5 I, [2024-05-19T09:20:07.743222 #467798] INFO -- : securerandom 0.3.1 I, [2024-05-19T09:20:07.744316 #467798] INFO -- : set 1.1.0 I, [2024-05-19T09:20:07.745509 #467798] INFO -- : shellwords 0.2.0 I, [2024-05-19T09:20:07.746646 #467798] INFO -- : singleton 0.2.0 I, [2024-05-19T09:20:07.747727 #467798] INFO -- : syntax_suggest 2.0.0 I, [2024-05-19T09:20:07.750298 #467798] INFO -- : tempfile 0.2.1 I, [2024-05-19T09:20:07.751421 #467798] INFO -- : time 0.3.0 I, [2024-05-19T09:20:07.752606 #467798] INFO -- : timeout 0.4.1 I, [2024-05-19T09:20:07.755652 #467798] INFO -- : tmpdir 0.2.0 I, [2024-05-19T09:20:07.756795 #467798] INFO -- : tsort 0.2.0 I, [2024-05-19T09:20:07.757923 #467798] INFO -- : un 0.3.0 I, [2024-05-19T09:20:07.758991 #467798] INFO -- : uri 0.13.0 I, [2024-05-19T09:20:07.760133 #467798] INFO -- : weakref 0.1.3 I, [2024-05-19T09:20:07.761331 #467798] INFO -- : yaml 0.3.0 I, [2024-05-19T09:20:07.762215 #467798] INFO -- : installing default gems from ext: /home/opc/ruby/install/master/lib/ruby/gems/3.4.0+0 I, [2024-05-19T09:20:07.772110 #467798] INFO -- : date 3.3.4 I, [2024-05-19T09:20:07.773426 #467798] INFO -- : digest 3.1.1 I, [2024-05-19T09:20:07.774588 #467798] INFO -- : etc 1.4.3 I, [2024-05-19T09:20:07.775761 #467798] INFO -- : fcntl 1.1.0 I, [2024-05-19T09:20:07.776907 #467798] INFO -- : fiddle 1.1.3 I, [2024-05-19T09:20:07.778125 #467798] INFO -- : io-console 0.7.2 I, [2024-05-19T09:20:07.779223 #467798] INFO -- : io-nonblock 0.3.0 I, [2024-05-19T09:20:07.780334 #467798] INFO -- : io-wait 0.3.1 I, [2024-05-19T09:20:07.781499 #467798] INFO -- : json 2.7.2 I, [2024-05-19T09:20:07.784940 #467798] INFO -- : openssl 3.2.0 I, [2024-05-19T09:20:07.786139 #467798] INFO -- : pathname 0.3.0 I, [2024-05-19T09:20:07.787240 #467798] INFO -- : psych 5.1.2 I, [2024-05-19T09:20:07.788483 #467798] INFO -- : stringio 3.1.1 I, [2024-05-19T09:20:07.789700 #467798] INFO -- : strscan 3.1.1 I, [2024-05-19T09:20:07.790796 #467798] INFO -- : zlib 3.1.0 I, [2024-05-19T09:20:07.791728 #467798] INFO -- : installing bundled gems: /home/opc/ruby/install/master/lib/ruby/gems/3.4.0+0 I, [2024-05-19T09:20:07.792764 #467798] INFO -- : minitest 5.23.0 I, [2024-05-19T09:20:07.811735 #467798] INFO -- : rake 13.2.1 I, [2024-05-19T09:20:07.827666 #467798] INFO -- : test-unit 3.6.2 I, [2024-05-19T09:20:07.842759 #467798] INFO -- : rexml 3.2.6 I, [2024-05-19T09:20:07.856905 #467798] INFO -- : rss 0.3.0 I, [2024-05-19T09:20:07.868865 #467798] INFO -- : net-ftp 0.3.4 I, [2024-05-19T09:20:07.872712 #467798] INFO -- : net-imap 0.4.11 I, [2024-05-19T09:20:07.887643 #467798] INFO -- : net-pop 0.1.2 I, [2024-05-19T09:20:07.890697 #467798] INFO -- : net-smtp 0.5.0 I, [2024-05-19T09:20:07.894252 #467798] INFO -- : matrix 0.4.2 I, [2024-05-19T09:20:07.900442 #467798] INFO -- : prime 0.1.2 I, [2024-05-19T09:20:07.911739 #467798] INFO -- : rbs 3.4.4 I, [2024-05-19T09:20:08.011593 #467798] INFO -- : typeprof 0.21.11 I, [2024-05-19T09:20:08.019824 #467798] INFO -- : debug 1.9.2 I, [2024-05-19T09:20:08.035620 #467798] INFO -- : racc 1.7.3 I, [2024-05-19T09:20:08.047089 #467798] INFO -- : mutex_m 0.2.0 I, [2024-05-19T09:20:08.050240 #467798] INFO -- : getoptlong 0.2.1 I, [2024-05-19T09:20:08.055747 #467798] INFO -- : base64 0.2.0 I, [2024-05-19T09:20:08.058473 #467798] INFO -- : bigdecimal 3.1.8 I, [2024-05-19T09:20:08.066795 #467798] INFO -- : observer 0.1.2 I, [2024-05-19T09:20:08.069940 #467798] INFO -- : abbrev 0.1.2 I, [2024-05-19T09:20:08.072905 #467798] INFO -- : resolv-replace 0.1.1 I, [2024-05-19T09:20:08.078075 #467798] INFO -- : rinda 0.2.0 I, [2024-05-19T09:20:08.081763 #467798] INFO -- : drb 2.2.1 I, [2024-05-19T09:20:08.088364 #467798] INFO -- : nkf 0.2.0 I, [2024-05-19T09:20:08.097346 #467798] INFO -- : syslog 0.1.2 I, [2024-05-19T09:20:08.102015 #467798] INFO -- : csv 3.3.0 I, [2024-05-19T09:20:08.113347 #467798] INFO -- : installing bundled gem cache: /home/opc/ruby/install/master/lib/ruby/gems/3.4.0+0/cache I, [2024-05-19T09:20:08.115179 #467798] INFO -- : skipped bundled gems: I, [2024-05-19T09:20:08.115211 #467798] INFO -- : power_assert-2.0.4dev.gem not found in bundled_gems I, [2024-05-19T09:20:08.118386 #467798] INFO -- : $$$[end] "make install -j3" exit with 0. I, [2024-05-19T09:20:08.118535 #467798] INFO -- : $$$[beg] make yes-btest TESTOPTS='-q -j3' I, [2024-05-19T09:20:30.878307 #467798] INFO -- : PASS all 1936 tests E, [2024-05-19T09:20:30.880403 #467798] ERROR -- : I, [2024-05-19T09:20:30.880528 #467798] INFO -- : $$$[end] "make yes-btest TESTOPTS='-q -j3'" exit with 0. I, [2024-05-19T09:20:30.880689 #467798] INFO -- : $$$[beg] make yes-test-basic TESTS='-j3' I, [2024-05-19T09:20:30.974356 #467798] INFO -- : BASERUBY = /usr/local/bin/ruby --disable=gems I, [2024-05-19T09:20:30.974430 #467798] INFO -- : CC = gcc I, [2024-05-19T09:20:30.974441 #467798] INFO -- : LD = ld I, [2024-05-19T09:20:30.974451 #467798] INFO -- : LDSHARED = gcc -shared I, [2024-05-19T09:20:30.974472 #467798] INFO -- : CFLAGS = -O3 -fno-fast-math -ggdb3 -Wall -Wextra -Wdeprecated-declarations -Wdiv-by-zero -Wduplicated-cond -Wimplicit-function-declaration -Wimplicit-int -Wpointer-arith -Wwrite-strings -Wold-style-definition -Wimplicit-fallthrough=0 -Wmissing-noreturn -Wno-cast-function-type -Wno-constant-logical-operand -Wno-long-long -Wno-missing-field-initializers -Wno-overlength-strings -Wno-packed-bitfield-compat -Wno-parentheses-equality -Wno-self-assign -Wno-tautological-compare -Wno-unused-parameter -Wno-unused-value -Wsuggest-attribute=format -Wsuggest-attribute=noreturn -Wunused-variable -Wmisleading-indentation -Wundef I, [2024-05-19T09:20:30.974482 #467798] INFO -- : XCFLAGS = -U_FORTIFY_SOURCE -D_FORTIFY_SOURCE=2 -fstack-protector-strong -msign-return-address=all -fno-strict-overflow -fvisibility=hidden -fexcess-precision=standard -DRUBY_EXPORT -fPIE -I. -I.ext/include/aarch64-linux -I/home/opc/ruby/src/master/include -I/home/opc/ruby/src/master -I/home/opc/ruby/src/master/prism -I/home/opc/ruby/src/master/enc/unicode/15.0.0 I, [2024-05-19T09:20:30.974490 #467798] INFO -- : CPPFLAGS = I, [2024-05-19T09:20:30.974498 #467798] INFO -- : DLDFLAGS = -Wl,--compress-debug-sections=zlib -fstack-protector-strong -pie I, [2024-05-19T09:20:30.974507 #467798] INFO -- : SOLIBS = -lz -lrt -lrt -ldl -lcrypt -lm -lpthread I, [2024-05-19T09:20:30.975904 #467798] INFO -- : LANG = en_US.UTF-8 I, [2024-05-19T09:20:30.975916 #467798] INFO -- : LC_ALL = I, [2024-05-19T09:20:30.975924 #467798] INFO -- : LC_CTYPE = I, [2024-05-19T09:20:30.975932 #467798] INFO -- : MFLAGS = I, [2024-05-19T09:20:30.975939 #467798] INFO -- : RUSTC = rustc I, [2024-05-19T09:20:30.975947 #467798] INFO -- : YJIT_RUSTC_ARGS = --crate-name=yjit --crate-type=staticlib --edition=2021 -g -C lto=thin -C opt-level=3 -C overflow-checks=on '--out-dir=/home/opc/ruby/build/master/yjit/target/release/' /home/opc/ruby/src/master/yjit/src/lib.rs I, [2024-05-19T09:20:30.975975 #467798] INFO -- : gcc (GCC) 8.5.0 20210514 (Red Hat 8.5.0-10.1.0.1) I, [2024-05-19T09:20:30.975983 #467798] INFO -- : Copyright (C) 2018 Free Software Foundation, Inc. I, [2024-05-19T09:20:30.975991 #467798] INFO -- : This is free software; see the source for copying conditions. There is NO I, [2024-05-19T09:20:30.975999 #467798] INFO -- : warranty; not even for MERCHANTABILITY or FITNESS FOR A PARTICULAR PURPOSE. I, [2024-05-19T09:20:30.976007 #467798] INFO -- : I, [2024-05-19T09:20:31.131391 #467798] INFO -- : Checking leaked global symbols...none I, [2024-05-19T09:20:31.184398 #467798] INFO -- : /home/opc/ruby/src/master/basictest/test.rb:assignment ....................................................................................................................................................................................................................................................................................................................................................................................OK 372 I, [2024-05-19T09:20:31.184479 #467798] INFO -- : /home/opc/ruby/src/master/basictest/test.rb:condition ..OK 2 I, [2024-05-19T09:20:31.184509 #467798] INFO -- : /home/opc/ruby/src/master/basictest/test.rb:if/unless ...OK 3 I, [2024-05-19T09:20:31.184562 #467798] INFO -- : /home/opc/ruby/src/master/basictest/test.rb:case .....OK 5 I, [2024-05-19T09:20:31.185205 #467798] INFO -- : /home/opc/ruby/src/master/basictest/test.rb:while/until ........OK 8 I, [2024-05-19T09:20:31.185349 #467798] INFO -- : /home/opc/ruby/src/master/basictest/test.rb:exception ..........OK 10 I, [2024-05-19T09:20:31.185976 #467798] INFO -- : /home/opc/ruby/src/master/basictest/test.rb:array .......................................OK 39 I, [2024-05-19T09:20:31.186234 #467798] INFO -- : /home/opc/ruby/src/master/basictest/test.rb:hash ...........................OK 27 I, [2024-05-19T09:20:31.187875 #467798] INFO -- : /home/opc/ruby/src/master/basictest/test.rb:iterator ...........................................................................................................OK 107 I, [2024-05-19T09:20:31.188621 #467798] INFO -- : /home/opc/ruby/src/master/basictest/test.rb:float ................................................................................OK 80 I, [2024-05-19T09:20:31.192272 #467798] INFO -- : /home/opc/ruby/src/master/basictest/test.rb:bignum ...............................OK 31 I, [2024-05-19T09:20:31.193901 #467798] INFO -- : /home/opc/ruby/src/master/basictest/test.rb:string & char ..............................................................OK 62 I, [2024-05-19T09:20:31.193960 #467798] INFO -- : /home/opc/ruby/src/master/basictest/test.rb:assignment ..........OK 10 I, [2024-05-19T09:20:31.194021 #467798] INFO -- : /home/opc/ruby/src/master/basictest/test.rb:call ......OK 6 I, [2024-05-19T09:20:31.194141 #467798] INFO -- : /home/opc/ruby/src/master/basictest/test.rb:proc .........OK 9 I, [2024-05-19T09:20:31.294401 #467798] INFO -- : /home/opc/ruby/src/master/basictest/test.rb:signal ..OK 2 I, [2024-05-19T09:20:31.295811 #467798] INFO -- : /home/opc/ruby/src/master/basictest/test.rb:eval ...........................OK 27 I, [2024-05-19T09:20:31.436165 #467798] INFO -- : /home/opc/ruby/src/master/basictest/test.rb:system ........OK 8 I, [2024-05-19T09:20:31.436237 #467798] INFO -- : /home/opc/ruby/src/master/basictest/test.rb:const .....OK 5 I, [2024-05-19T09:20:31.436358 #467798] INFO -- : /home/opc/ruby/src/master/basictest/test.rb:clone .....OK 5 I, [2024-05-19T09:20:31.436556 #467798] INFO -- : /home/opc/ruby/src/master/basictest/test.rb:marshal ....OK 4 I, [2024-05-19T09:20:31.436633 #467798] INFO -- : /home/opc/ruby/src/master/basictest/test.rb:pack ....OK 4 I, [2024-05-19T09:20:31.436665 #467798] INFO -- : /home/opc/ruby/src/master/basictest/test.rb:math ..OK 2 I, [2024-05-19T09:20:31.436757 #467798] INFO -- : /home/opc/ruby/src/master/basictest/test.rb:struct ......OK 6 I, [2024-05-19T09:20:31.436926 #467798] INFO -- : /home/opc/ruby/src/master/basictest/test.rb:variable ............OK 12 I, [2024-05-19T09:20:31.436967 #467798] INFO -- : /home/opc/ruby/src/master/basictest/test.rb:trace ...OK 3 I, [2024-05-19T09:20:31.437095 #467798] INFO -- : /home/opc/ruby/src/master/basictest/test.rb:defined? ............OK 12 I, [2024-05-19T09:20:31.437183 #467798] INFO -- : /home/opc/ruby/src/master/basictest/test.rb:alias ......OK 6 I, [2024-05-19T09:20:31.437948 #467798] INFO -- : /home/opc/ruby/src/master/basictest/test.rb:path .......................OK 23 I, [2024-05-19T09:20:31.505875 #467798] INFO -- : /home/opc/ruby/src/master/basictest/test.rb:gc ....OK 4 I, [2024-05-19T09:20:31.507844 #467798] INFO -- : I, [2024-05-19T09:20:31.507872 #467798] INFO -- : test succeeded I, [2024-05-19T09:20:31.508401 #467798] INFO -- : $$$[end] "make yes-test-basic TESTS='-j3'" exit with 0. I, [2024-05-19T09:20:31.508618 #467798] INFO -- : $$$[beg] make yes-test-all TESTOPTS='--stderr-on-failure' TESTS='-j3' I, [2024-05-19T09:20:31.633572 #467798] INFO -- : BASERUBY = /usr/local/bin/ruby --disable=gems I, [2024-05-19T09:20:31.633647 #467798] INFO -- : CC = gcc I, [2024-05-19T09:20:31.633658 #467798] INFO -- : LD = ld I, [2024-05-19T09:20:31.633667 #467798] INFO -- : LDSHARED = gcc -shared I, [2024-05-19T09:20:31.633679 #467798] INFO -- : CFLAGS = -O3 -fno-fast-math -ggdb3 -Wall -Wextra -Wdeprecated-declarations -Wdiv-by-zero -Wduplicated-cond -Wimplicit-function-declaration -Wimplicit-int -Wpointer-arith -Wwrite-strings -Wold-style-definition -Wimplicit-fallthrough=0 -Wmissing-noreturn -Wno-cast-function-type -Wno-constant-logical-operand -Wno-long-long -Wno-missing-field-initializers -Wno-overlength-strings -Wno-packed-bitfield-compat -Wno-parentheses-equality -Wno-self-assign -Wno-tautological-compare -Wno-unused-parameter -Wno-unused-value -Wsuggest-attribute=format -Wsuggest-attribute=noreturn -Wunused-variable -Wmisleading-indentation -Wundef I, [2024-05-19T09:20:31.633689 #467798] INFO -- : XCFLAGS = -U_FORTIFY_SOURCE -D_FORTIFY_SOURCE=2 -fstack-protector-strong -msign-return-address=all -fno-strict-overflow -fvisibility=hidden -fexcess-precision=standard -DRUBY_EXPORT -fPIE -I. -I.ext/include/aarch64-linux -I/home/opc/ruby/src/master/include -I/home/opc/ruby/src/master -I/home/opc/ruby/src/master/prism -I/home/opc/ruby/src/master/enc/unicode/15.0.0 I, [2024-05-19T09:20:31.633698 #467798] INFO -- : CPPFLAGS = I, [2024-05-19T09:20:31.633707 #467798] INFO -- : DLDFLAGS = -Wl,--compress-debug-sections=zlib -fstack-protector-strong -pie I, [2024-05-19T09:20:31.633716 #467798] INFO -- : SOLIBS = -lz -lrt -lrt -ldl -lcrypt -lm -lpthread I, [2024-05-19T09:20:31.633725 #467798] INFO -- : LANG = en_US.UTF-8 I, [2024-05-19T09:20:31.633733 #467798] INFO -- : LC_ALL = I, [2024-05-19T09:20:31.633741 #467798] INFO -- : LC_CTYPE = I, [2024-05-19T09:20:31.633750 #467798] INFO -- : MFLAGS = I, [2024-05-19T09:20:31.633758 #467798] INFO -- : RUSTC = rustc I, [2024-05-19T09:20:31.633766 #467798] INFO -- : YJIT_RUSTC_ARGS = --crate-name=yjit --crate-type=staticlib --edition=2021 -g -C lto=thin -C opt-level=3 -C overflow-checks=on '--out-dir=/home/opc/ruby/build/master/yjit/target/release/' /home/opc/ruby/src/master/yjit/src/lib.rs I, [2024-05-19T09:20:31.634481 #467798] INFO -- : gcc (GCC) 8.5.0 20210514 (Red Hat 8.5.0-10.1.0.1) I, [2024-05-19T09:20:31.634524 #467798] INFO -- : Copyright (C) 2018 Free Software Foundation, Inc. I, [2024-05-19T09:20:31.634535 #467798] INFO -- : This is free software; see the source for copying conditions. There is NO I, [2024-05-19T09:20:31.634545 #467798] INFO -- : warranty; not even for MERCHANTABILITY or FITNESS FOR A PARTICULAR PURPOSE. I, [2024-05-19T09:20:31.634554 #467798] INFO -- : I, [2024-05-19T09:20:31.636569 #467798] INFO -- : generating enc.mk I, [2024-05-19T09:20:31.872865 #467798] INFO -- : generating encdb.h I, [2024-05-19T09:20:31.911666 #467798] INFO -- : encdb.h unchanged I, [2024-05-19T09:20:31.912923 #467798] INFO -- : making enc I, [2024-05-19T09:20:31.941087 #467798] INFO -- : make[1]: Entering directory '/home/opc/ruby/build/master' I, [2024-05-19T09:20:31.941148 #467798] INFO -- : make[1]: Nothing to be done for 'enc'. I, [2024-05-19T09:20:31.941159 #467798] INFO -- : make[1]: Leaving directory '/home/opc/ruby/build/master' I, [2024-05-19T09:20:31.941981 #467798] INFO -- : making srcs under enc I, [2024-05-19T09:20:31.983911 #467798] INFO -- : make[1]: Entering directory '/home/opc/ruby/build/master' I, [2024-05-19T09:20:31.983950 #467798] INFO -- : make[1]: Nothing to be done for 'srcs'. I, [2024-05-19T09:20:31.983961 #467798] INFO -- : make[1]: Leaving directory '/home/opc/ruby/build/master' I, [2024-05-19T09:20:31.985111 #467798] INFO -- : generating transdb.h I, [2024-05-19T09:20:32.129365 #467798] INFO -- : transdb.h unchanged I, [2024-05-19T09:20:32.130719 #467798] INFO -- : making trans I, [2024-05-19T09:20:32.179124 #467798] INFO -- : make[1]: Entering directory '/home/opc/ruby/build/master' I, [2024-05-19T09:20:32.179182 #467798] INFO -- : make[1]: Nothing to be done for 'trans'. I, [2024-05-19T09:20:32.179193 #467798] INFO -- : make[1]: Leaving directory '/home/opc/ruby/build/master' I, [2024-05-19T09:20:32.180071 #467798] INFO -- : making encs I, [2024-05-19T09:20:32.232905 #467798] INFO -- : make[1]: Entering directory '/home/opc/ruby/build/master' I, [2024-05-19T09:20:32.232974 #467798] INFO -- : make[1]: Nothing to be done for 'encs'. I, [2024-05-19T09:20:32.232985 #467798] INFO -- : make[1]: Leaving directory '/home/opc/ruby/build/master' I, [2024-05-19T09:20:32.235043 #467798] INFO -- : generating makefiles ext/configure-ext.mk I, [2024-05-19T09:20:32.275948 #467798] INFO -- : ext/configure-ext.mk updated I, [2024-05-19T09:20:32.279515 #467798] INFO -- : make[1]: Entering directory '/home/opc/ruby/build/master' I, [2024-05-19T09:20:34.447013 #467798] INFO -- : make[1]: Leaving directory '/home/opc/ruby/build/master' I, [2024-05-19T09:20:34.447769 #467798] INFO -- : generating makefile exts.mk I, [2024-05-19T09:20:34.511461 #467798] INFO -- : exts.mk unchanged I, [2024-05-19T09:20:34.516568 #467798] INFO -- : make[1]: Entering directory '/home/opc/ruby/build/master' I, [2024-05-19T09:20:34.816655 #467798] INFO -- : make[2]: Entering directory '/home/opc/ruby/build/master/ext/coverage' I, [2024-05-19T09:20:34.821631 #467798] INFO -- : make[2]: Leaving directory '/home/opc/ruby/build/master/ext/coverage' I, [2024-05-19T09:20:34.827442 #467798] INFO -- : make[2]: Entering directory '/home/opc/ruby/build/master/ext/date' I, [2024-05-19T09:20:34.832864 #467798] INFO -- : make[2]: Leaving directory '/home/opc/ruby/build/master/ext/date' I, [2024-05-19T09:20:34.836305 #467798] INFO -- : make[2]: Entering directory '/home/opc/ruby/build/master/ext/digest' I, [2024-05-19T09:20:34.845688 #467798] INFO -- : make[2]: Leaving directory '/home/opc/ruby/build/master/ext/digest' I, [2024-05-19T09:20:34.868900 #467798] INFO -- : make[2]: Entering directory '/home/opc/ruby/build/master/ext/digest/sha2' I, [2024-05-19T09:20:34.873971 #467798] INFO -- : make[2]: Leaving directory '/home/opc/ruby/build/master/ext/digest/sha2' I, [2024-05-19T09:20:34.892855 #467798] INFO -- : make[2]: Entering directory '/home/opc/ruby/build/master/ext/fiddle' I, [2024-05-19T09:20:34.903116 #467798] INFO -- : make[2]: Leaving directory '/home/opc/ruby/build/master/ext/fiddle' I, [2024-05-19T09:20:34.907519 #467798] INFO -- : make[2]: Entering directory '/home/opc/ruby/build/master/ext/io/console' I, [2024-05-19T09:20:34.911964 #467798] INFO -- : make[2]: Leaving directory '/home/opc/ruby/build/master/ext/io/console' I, [2024-05-19T09:20:34.922892 #467798] INFO -- : make[2]: Entering directory '/home/opc/ruby/build/master/ext/json' I, [2024-05-19T09:20:34.932405 #467798] INFO -- : make[2]: Leaving directory '/home/opc/ruby/build/master/ext/json' I, [2024-05-19T09:20:34.945720 #467798] INFO -- : make[2]: Entering directory '/home/opc/ruby/build/master/ext/monitor' I, [2024-05-19T09:20:34.949978 #467798] INFO -- : make[2]: Leaving directory '/home/opc/ruby/build/master/ext/monitor' I, [2024-05-19T09:20:34.956174 #467798] INFO -- : make[2]: Entering directory '/home/opc/ruby/build/master/ext/objspace' I, [2024-05-19T09:20:34.962343 #467798] INFO -- : make[2]: Leaving directory '/home/opc/ruby/build/master/ext/objspace' I, [2024-05-19T09:20:34.981360 #467798] INFO -- : make[2]: Entering directory '/home/opc/ruby/build/master/ext/openssl' I, [2024-05-19T09:20:35.003260 #467798] INFO -- : make[2]: Leaving directory '/home/opc/ruby/build/master/ext/openssl' I, [2024-05-19T09:20:35.007616 #467798] INFO -- : make[2]: Entering directory '/home/opc/ruby/build/master/ext/pathname' I, [2024-05-19T09:20:35.012019 #467798] INFO -- : make[2]: Leaving directory '/home/opc/ruby/build/master/ext/pathname' I, [2024-05-19T09:20:35.018426 #467798] INFO -- : make[2]: Entering directory '/home/opc/ruby/build/master/ext/psych' I, [2024-05-19T09:20:35.040029 #467798] INFO -- : make[2]: Leaving directory '/home/opc/ruby/build/master/ext/psych' I, [2024-05-19T09:20:35.044679 #467798] INFO -- : make[2]: Entering directory '/home/opc/ruby/build/master/ext/pty' I, [2024-05-19T09:20:35.048989 #467798] INFO -- : make[2]: Leaving directory '/home/opc/ruby/build/master/ext/pty' I, [2024-05-19T09:20:35.062807 #467798] INFO -- : make[2]: Entering directory '/home/opc/ruby/build/master/ext/ripper' I, [2024-05-19T09:20:35.070736 #467798] INFO -- : make[2]: Leaving directory '/home/opc/ruby/build/master/ext/ripper' I, [2024-05-19T09:20:35.072833 #467798] INFO -- : make[2]: Entering directory '/home/opc/ruby/build/master/ext/rubyvm' I, [2024-05-19T09:20:35.076558 #467798] INFO -- : make[2]: Leaving directory '/home/opc/ruby/build/master/ext/rubyvm' I, [2024-05-19T09:20:35.088680 #467798] INFO -- : make[2]: Entering directory '/home/opc/ruby/build/master/ext/socket' I, [2024-05-19T09:20:35.099603 #467798] INFO -- : make[2]: Leaving directory '/home/opc/ruby/build/master/ext/socket' I, [2024-05-19T09:20:35.115313 #467798] INFO -- : make[2]: Entering directory '/home/opc/ruby/build/master/.bundle/gems/bigdecimal-3.1.7/ext/bigdecimal' I, [2024-05-19T09:20:35.147055 #467798] INFO -- : make[2]: Leaving directory '/home/opc/ruby/build/master/.bundle/gems/bigdecimal-3.1.7/ext/bigdecimal' I, [2024-05-19T09:20:35.150005 #467798] INFO -- : make[2]: Entering directory '/home/opc/ruby/build/master/.bundle/gems/bigdecimal-3.1.8/ext/bigdecimal' I, [2024-05-19T09:20:35.181422 #467798] INFO -- : make[2]: Leaving directory '/home/opc/ruby/build/master/.bundle/gems/bigdecimal-3.1.8/ext/bigdecimal' I, [2024-05-19T09:20:35.184316 #467798] INFO -- : make[2]: Entering directory '/home/opc/ruby/build/master/.bundle/gems/debug-1.9.2/ext/debug' I, [2024-05-19T09:20:35.217602 #467798] INFO -- : make[2]: Leaving directory '/home/opc/ruby/build/master/.bundle/gems/debug-1.9.2/ext/debug' I, [2024-05-19T09:20:35.220167 #467798] INFO -- : make[2]: Entering directory '/home/opc/ruby/build/master/.bundle/gems/nkf-0.2.0/ext/nkf' I, [2024-05-19T09:20:35.250749 #467798] INFO -- : make[2]: Leaving directory '/home/opc/ruby/build/master/.bundle/gems/nkf-0.2.0/ext/nkf' I, [2024-05-19T09:20:35.253375 #467798] INFO -- : make[2]: Entering directory '/home/opc/ruby/build/master/.bundle/gems/racc-1.7.3/ext/racc/cparse' I, [2024-05-19T09:20:35.284976 #467798] INFO -- : make[2]: Leaving directory '/home/opc/ruby/build/master/.bundle/gems/racc-1.7.3/ext/racc/cparse' I, [2024-05-19T09:20:35.287978 #467798] INFO -- : make[2]: Entering directory '/home/opc/ruby/build/master/.bundle/gems/rbs-3.4.4/ext/rbs_extension' I, [2024-05-19T09:20:35.318538 #467798] INFO -- : make[2]: Leaving directory '/home/opc/ruby/build/master/.bundle/gems/rbs-3.4.4/ext/rbs_extension' I, [2024-05-19T09:20:35.321090 #467798] INFO -- : make[2]: Entering directory '/home/opc/ruby/build/master/.bundle/gems/syslog-0.1.2/ext/syslog' I, [2024-05-19T09:20:35.351607 #467798] INFO -- : make[2]: Leaving directory '/home/opc/ruby/build/master/.bundle/gems/syslog-0.1.2/ext/syslog' I, [2024-05-19T09:20:35.389824 #467798] INFO -- : make[2]: Entering directory '/home/opc/ruby/build/master' I, [2024-05-19T09:20:35.473639 #467798] INFO -- : make[2]: 'ruby' is up to date. I, [2024-05-19T09:20:35.473720 #467798] INFO -- : make[2]: Leaving directory '/home/opc/ruby/build/master' I, [2024-05-19T09:20:35.473848 #467798] INFO -- : make[1]: Leaving directory '/home/opc/ruby/build/master' I, [2024-05-19T09:20:35.478353 #467798] INFO -- : make[1]: Entering directory '/home/opc/ruby/build/master' I, [2024-05-19T09:20:35.478402 #467798] INFO -- : make[1]: Nothing to be done for 'note'. I, [2024-05-19T09:20:35.478412 #467798] INFO -- : make[1]: Leaving directory '/home/opc/ruby/build/master' I, [2024-05-19T09:20:35.592556 #467798] INFO -- : Run options: I, [2024-05-19T09:20:35.592619 #467798] INFO -- : --seed=63702 I, [2024-05-19T09:20:35.592629 #467798] INFO -- : "--ruby=./miniruby -I/home/opc/ruby/src/master/lib -I. -I.ext/common /home/opc/ruby/src/master/tool/runruby.rb --extout=.ext -- --disable-gems" I, [2024-05-19T09:20:35.592638 #467798] INFO -- : --excludes-dir=/home/opc/ruby/src/master/test/.excludes I, [2024-05-19T09:20:35.592647 #467798] INFO -- : --name=!/memory_leak/ I, [2024-05-19T09:20:35.592655 #467798] INFO -- : --stderr-on-failure I, [2024-05-19T09:20:35.592663 #467798] INFO -- : -j3 I, [2024-05-19T09:20:35.592672 #467798] INFO -- : I, [2024-05-19T09:20:35.592680 #467798] INFO -- : # Running tests: I, [2024-05-19T09:20:35.592689 #467798] INFO -- : I, [2024-05-19T09:20:35.729104 #467798] INFO -- : [ 1/885] 508669=test_gem_resolver_conflict I, [2024-05-19T09:20:35.730666 #467798] INFO -- : [ 2/885] 508671=test_ractor I, [2024-05-19T09:20:35.744418 #467798] INFO -- : [ 3/885] 508670=test_scheduler I, [2024-05-19T09:20:35.897114 #467798] INFO -- : [ 4/885] 508670=test_gem_commands_help_command I, [2024-05-19T09:20:35.931107 #467798] INFO -- : [ 5/885] 508669=test_ssl I, [2024-05-19T09:20:36.099772 #467798] INFO -- : [ 6/885] 508671=test_enc_str_buf_cat I, [2024-05-19T09:20:36.108770 #467798] INFO -- : [ 7/885] 508671=newline_test I, [2024-05-19T09:20:36.137485 #467798] INFO -- : [ 8/885] 508669=test_bignum I, [2024-05-19T09:20:36.164479 #467798] INFO -- : [ 9/885] 508670=test_rdoc_markup_hard_break I, [2024-05-19T09:20:36.291155 #467798] INFO -- : [ 10/885] 508671=ractor_test I, [2024-05-19T09:20:36.296891 #467798] INFO -- : [ 11/885] 508670=test_ancdata I, [2024-05-19T09:20:36.313797 #467798] INFO -- : [ 12/885] 508670=test_marshal I, [2024-05-19T09:20:36.323590 #467798] INFO -- : [ 13/885] 508671=test_nesting_parser I, [2024-05-19T09:20:36.436768 #467798] INFO -- : [ 14/885] 508671=test_parser I, [2024-05-19T09:20:36.589858 #467798] INFO -- : [ 15/885] 508671=test_rdoc_markup_to_label I, [2024-05-19T09:20:36.648290 #467798] INFO -- : [ 16/885] 508671=test_gem_resolver_best_set I, [2024-05-19T09:20:36.773444 #467798] INFO -- : [ 17/885] 508670=test_cgi_core I, [2024-05-19T09:20:36.776995 #467798] INFO -- : [ 18/885] 508670=test_registry I, [2024-05-19T09:20:36.792795 #467798] INFO -- : [ 19/885] 508670=test_gem I, [2024-05-19T09:20:36.794226 #467798] INFO -- : Leaked file descriptor: TestGem#test_self_clear_paths: 7 # I, [2024-05-19T09:20:36.822952 #467798] INFO -- : COMMAND PID USER FD TYPE DEVICE SIZE/OFF NODE NAME I, [2024-05-19T09:20:36.823054 #467798] INFO -- : ruby 508670 opc 7r REG 252,0 9253600 13705411 /var/lib/sss/mc/passwd I, [2024-05-19T09:20:36.901296 #467798] INFO -- : [ 20/885] 508671=json_generator_test I, [2024-05-19T09:20:36.993422 #467798] INFO -- : [ 21/885] 508671=test_ansi_without_terminfo I, [2024-05-19T09:20:37.008724 #467798] INFO -- : [ 22/885] 508671=test_ractor I, [2024-05-19T09:20:37.032449 #467798] INFO -- : [ 23/885] 508671=test_address_resolve I, [2024-05-19T09:20:37.046742 #467798] INFO -- : [ 24/885] 508671=test_stream I, [2024-05-19T09:20:37.060298 #467798] INFO -- : [ 25/885] 508671=test_ractor I, [2024-05-19T09:20:37.102078 #467798] INFO -- : [ 26/885] 508671=test_trick I, [2024-05-19T09:20:39.046804 #467798] INFO -- : [ 27/885] 508670=test_rdoc_attr I, [2024-05-19T09:20:39.164521 #467798] INFO -- : [ 28/885] 508670=test_locale I, [2024-05-19T09:20:39.195235 #467798] INFO -- : [ 29/885] 508670=test_ts I, [2024-05-19T09:20:39.392527 #467798] INFO -- : [ 30/885] 508671=test_rbconfig I, [2024-05-19T09:20:39.395903 #467798] INFO -- : [ 31/885] 508671=test_num2int I, [2024-05-19T09:20:39.415203 #467798] INFO -- : [ 32/885] 508671=test_extlibs I, [2024-05-19T09:20:39.473299 #467798] INFO -- : [ 33/885] 508670=test_iter_break I, [2024-05-19T09:20:39.513654 #467798] INFO -- : [ 34/885] 508670=test_range I, [2024-05-19T09:20:39.787699 #467798] INFO -- : [ 35/885] 508669=test_gem_commands_signin_command I, [2024-05-19T09:20:39.940452 #467798] INFO -- : [ 36/885] 508669=test_require I, [2024-05-19T09:20:40.263169 #467798] INFO -- : [ 37/885] 508670=test_recursion I, [2024-05-19T09:20:40.264648 #467798] INFO -- : [ 38/885] 508670=test_rdoc_markup_include I, [2024-05-19T09:20:40.286686 #467798] INFO -- : [ 39/885] 508670=test_enum I, [2024-05-19T09:20:41.008972 #467798] INFO -- : [ 40/885] 508671=test_gem_commands_contents_command I, [2024-05-19T09:20:41.124239 #467798] INFO -- : [ 41/885] 508671=test_udp I, [2024-05-19T09:20:41.139457 #467798] INFO -- : [ 42/885] 508671=test_context I, [2024-05-19T09:20:41.148845 #467798] INFO -- : [ 43/885] 508670=test_gem_commands_search_command I, [2024-05-19T09:20:41.168273 #467798] INFO -- : [ 44/885] 508670=test_symbol I, [2024-05-19T09:20:41.240129 #467798] INFO -- : [ 45/885] 508671=test_coder I, [2024-05-19T09:20:41.247437 #467798] INFO -- : [ 46/885] 508669=test_rdoc_servlet I, [2024-05-19T09:20:41.264863 #467798] INFO -- : [ 47/885] 508671=test_formatter I, [2024-05-19T09:20:41.273027 #467798] INFO -- : [ 48/885] 508671=test_integer I, [2024-05-19T09:20:41.576703 #467798] INFO -- : [ 49/885] 508669=test_unix I, [2024-05-19T09:20:41.602181 #467798] INFO -- : [ 50/885] 508669=test_date_marshal I, [2024-05-19T09:20:41.618234 #467798] INFO -- : [ 51/885] 508669=test_have_func I, [2024-05-19T09:20:43.023278 #467798] INFO -- : [ 52/885] 508669=test_gem_resolver_local_specification I, [2024-05-19T09:20:43.125384 #467798] INFO -- : [ 53/885] 508669=test_configuration I, [2024-05-19T09:20:43.137691 #467798] INFO -- : [ 54/885] 508669=test_date_new I, [2024-05-19T09:20:43.153465 #467798] INFO -- : [ 55/885] 508669=test_gem_commands_list_command I, [2024-05-19T09:20:43.157552 #467798] INFO -- : [ 56/885] 508669=test_interned_str I, [2024-05-19T09:20:43.243483 #467798] INFO -- : [ 57/885] 508669=constant_path_node_test I, [2024-05-19T09:20:43.248290 #467798] INFO -- : [ 58/885] 508669=test_set_len I, [2024-05-19T09:20:43.253482 #467798] INFO -- : [ 59/885] 508669=test_folderitem2_invokeverb I, [2024-05-19T09:20:43.282093 #467798] INFO -- : [ 60/885] 508669=test_pattern_matching I, [2024-05-19T09:20:43.431910 #467798] INFO -- : [ 61/885] 508669=test_gc I, [2024-05-19T09:20:43.784702 #467798] INFO -- : [ 62/885] 508670=test_gem_bundler_version_finder I, [2024-05-19T09:20:43.812695 #467798] INFO -- : [ 63/885] 508671=test_gem_request_set I, [2024-05-19T09:20:43.894869 #467798] INFO -- : [ 64/885] 508670=ruby_api_test I, [2024-05-19T09:20:44.042336 #467798] INFO -- : [ 65/885] 508670=test_gem_resolver_index_set I, [2024-05-19T09:20:44.074925 #467798] INFO -- : [ 66/885] 508670=test_sleep I, [2024-05-19T09:20:44.358254 #467798] INFO -- : [ 67/885] 508671=test_webauthn_listener_response I, [2024-05-19T09:20:44.425260 #467798] INFO -- : [ 68/885] 508671=test_ensured I, [2024-05-19T09:20:44.429405 #467798] INFO -- : [ 69/885] 508671=test_euc_jp I, [2024-05-19T09:20:44.433970 #467798] INFO -- : [ 70/885] 508671=test_rdoc_markup I, [2024-05-19T09:20:44.441902 #467798] INFO -- : [ 71/885] 508671=test_key_stroke I, [2024-05-19T09:20:44.445380 #467798] INFO -- : [ 72/885] 508671=test_alias_and_anchor I, [2024-05-19T09:20:44.461419 #467798] INFO -- : [ 73/885] 508671=test_time I, [2024-05-19T09:20:44.634851 #467798] INFO -- : [ 74/885] 508671=test_popen_deadlock I, [2024-05-19T09:20:45.194835 #467798] INFO -- : [ 75/885] 508671=test_project_sanity I, [2024-05-19T09:20:45.200009 #467798] INFO -- : [ 76/885] 508671=test_symbol I, [2024-05-19T09:20:45.209443 #467798] INFO -- : [ 77/885] 508671=location_test I, [2024-05-19T09:20:45.254588 #467798] INFO -- : [ 78/885] 508671=test_chilled I, [2024-05-19T09:20:45.264803 #467798] INFO -- : [ 79/885] 508671=test_delegate I, [2024-05-19T09:20:45.276653 #467798] INFO -- : [ 80/885] 508671=test_reline I, [2024-05-19T09:20:45.544714 #467798] INFO -- : [ 81/885] 508671=test_call I, [2024-05-19T09:20:45.656698 #467798] INFO -- : [ 82/885] 508671=test_ellipsize I, [2024-05-19T09:20:45.682060 #467798] INFO -- : [ 83/885] 508671=test_gem_commands_build_command I, [2024-05-19T09:20:45.982702 #467798] INFO -- : [ 84/885] 508671=test_windows_1251 I, [2024-05-19T09:20:45.992858 #467798] INFO -- : [ 85/885] 508671=test_gem_ext_builder I, [2024-05-19T09:20:47.642266 #467798] INFO -- : [ 86/885] 508671=test_to_ary_concat I, [2024-05-19T09:20:48.628728 #467798] INFO -- : [ 87/885] 508671=test_history I, [2024-05-19T09:20:48.643023 #467798] INFO -- : [ 88/885] 508671=test_time_tz I, [2024-05-19T09:20:48.699656 #467798] INFO -- : [ 89/885] 508671=test_addrinfo I, [2024-05-19T09:20:48.714286 #467798] INFO -- : Leaked file descriptor: TestSocketAddrinfo#test_addrinfo_timeout: 7 # I, [2024-05-19T09:20:48.742378 #467798] INFO -- : COMMAND PID USER FD TYPE DEVICE SIZE/OFF NODE NAME I, [2024-05-19T09:20:48.742453 #467798] INFO -- : ruby 508671 opc 7u unix 0x0000000000000000 0t0 3048812807 type=STREAM I, [2024-05-19T09:20:48.805165 #467798] INFO -- : [ 90/885] 508671=test_to_ruby I, [2024-05-19T09:20:48.809976 #467798] INFO -- : [ 91/885] 508671=test_data I, [2024-05-19T09:20:48.873922 #467798] INFO -- : [ 92/885] 508671=test_bug-14834 I, [2024-05-19T09:20:48.878202 #467798] INFO -- : [ 93/885] 508671=test_inlinecache I, [2024-05-19T09:20:48.930835 #467798] INFO -- : [ 94/885] 508671=test_terminfo I, [2024-05-19T09:20:48.957889 #467798] INFO -- : [ 95/885] 508671=test_socket I, [2024-05-19T09:20:49.117131 #467798] INFO -- : [ 96/885] 508670=test_thread I, [2024-05-19T09:20:49.935321 #467798] INFO -- : [ 97/885] 508671=test_bug_reporter I, [2024-05-19T09:20:50.203500 #467798] INFO -- : [ 98/885] 508671=test_gem_installer I, [2024-05-19T09:20:51.211157 #467798] INFO -- : [ 99/885] 508669=test_buffered_io I, [2024-05-19T09:20:51.218385 #467798] INFO -- : [100/885] 508669=test_ossl I, [2024-05-19T09:20:55.051844 #467798] INFO -- : [101/885] 508671=test_ruby_lex I, [2024-05-19T09:20:55.109859 #467798] INFO -- : [102/885] 508671=test_arith_seq_extract I, [2024-05-19T09:20:55.212877 #467798] INFO -- : [103/885] 508671=compiler_test I, [2024-05-19T09:20:55.251685 #467798] INFO -- : [104/885] 508671=test_gem_source_subpath_problem I, [2024-05-19T09:20:55.330324 #467798] INFO -- : [105/885] 508671=test_object_references I, [2024-05-19T09:20:55.343630 #467798] INFO -- : [106/885] 508671=test_eval I, [2024-05-19T09:20:55.600999 #467798] INFO -- : [107/885] 508671=test_beginendblock I, [2024-05-19T09:20:55.899217 #467798] INFO -- : [108/885] 508671=test_monitor I, [2024-05-19T09:20:56.113188 #467798] INFO -- : [109/885] 508671=test_whileuntil I, [2024-05-19T09:20:56.158338 #467798] INFO -- : [110/885] 508671=test_regexp I, [2024-05-19T09:20:58.058184 #467798] INFO -- : [111/885] 508670=test_nofree I, [2024-05-19T09:20:58.063913 #467798] INFO -- : [112/885] 508670=test_pointer I, [2024-05-19T09:20:58.549833 #467798] INFO -- : [113/885] 508669=test_within_pipe I, [2024-05-19T09:20:58.640094 #467798] INFO -- : [114/885] 508669=test_rdoc_normal_class I, [2024-05-19T09:20:58.728623 #467798] INFO -- : [115/885] 508669=test_mailto I, [2024-05-19T09:20:58.750714 #467798] INFO -- : [116/885] 508669=test_addr I, [2024-05-19T09:20:58.773457 #467798] INFO -- : [117/885] 508669=test_kill_ring I, [2024-05-19T09:20:58.785205 #467798] INFO -- : [118/885] 508669=test_member I, [2024-05-19T09:20:58.796404 #467798] INFO -- : [119/885] 508669=test_object I, [2024-05-19T09:20:58.799666 #467798] INFO -- : [120/885] 508670=format_errors_test I, [2024-05-19T09:20:58.807624 #467798] INFO -- : [121/885] 508669=test_cgi_header I, [2024-05-19T09:20:58.811195 #467798] INFO -- : [122/885] 508670=test_case_options I, [2024-05-19T09:20:58.813963 #467798] INFO -- : [123/885] 508669=test_helper I, [2024-05-19T09:20:58.817727 #467798] INFO -- : [124/885] 508670=test_duplicate I, [2024-05-19T09:20:58.822934 #467798] INFO -- : [125/885] 508669=test_gem_resolver_api_set I, [2024-05-19T09:20:58.833837 #467798] INFO -- : [126/885] 508670=test_rdoc_markup_to_html I, [2024-05-19T09:20:58.896725 #467798] INFO -- : [127/885] 508669=test_foreach I, [2024-05-19T09:20:58.902481 #467798] INFO -- : [128/885] 508669=test_append I, [2024-05-19T09:20:58.908663 #467798] INFO -- : [129/885] 508669=test_gem_resolver_installer_set I, [2024-05-19T09:20:58.958289 #467798] INFO -- : [130/885] 508670=test_emitter I, [2024-05-19T09:20:58.963570 #467798] INFO -- : [131/885] 508670=test_x509ext I, [2024-05-19T09:20:58.969824 #467798] INFO -- : [132/885] 508670=bom_test I, [2024-05-19T09:20:58.988545 #467798] INFO -- : [133/885] 508670=test_file I, [2024-05-19T09:20:59.242420 #467798] INFO -- : [134/885] 508669=test_config I, [2024-05-19T09:20:59.564628 #467798] INFO -- : [135/885] 508669=test_helper_method I, [2024-05-19T09:20:59.616171 #467798] INFO -- : [136/885] 508669=test_summary I, [2024-05-19T09:20:59.733898 #467798] INFO -- : [137/885] 508669=test_scalar_scanner I, [2024-05-19T09:20:59.744814 #467798] INFO -- : [138/885] 508669=test_lambda I, [2024-05-19T09:20:59.807693 #467798] INFO -- : [139/885] 508669=test_rb_str_dup I, [2024-05-19T09:20:59.825777 #467798] INFO -- : [140/885] 508669=test_trace I, [2024-05-19T09:20:59.833615 #467798] INFO -- : [141/885] 508669=test_arity I, [2024-05-19T09:20:59.842899 #467798] INFO -- : [142/885] 508669=test_gem_path_support I, [2024-05-19T09:20:59.944918 #467798] INFO -- : [143/885] 508669=test_keyword I, [2024-05-19T09:21:00.404418 #467798] INFO -- : [144/885] 508669=test_win32ole_type_event I, [2024-05-19T09:21:00.427278 #467798] INFO -- : [145/885] 508669=test_gem_ext_cmake_builder I, [2024-05-19T09:21:00.439158 #467798] INFO -- : [146/885] 508669=test_digest_extend I, [2024-05-19T09:21:00.678277 #467798] INFO -- : [147/885] 508669=test_last_thread I, [2024-05-19T09:21:01.510462 #467798] INFO -- : [148/885] 508669=test_thread_fd_close I, [2024-05-19T09:21:01.518140 #467798] INFO -- : [149/885] 508669=test_getopts I, [2024-05-19T09:21:01.555511 #467798] INFO -- : [150/885] 508669=test_emitter I, [2024-05-19T09:21:01.644857 #467798] INFO -- : [151/885] 508669=test_fips I, [2024-05-19T09:21:01.839603 #467798] INFO -- : [152/885] 508669=test_alias I, [2024-05-19T09:21:01.988210 #467798] INFO -- : [153/885] 508669=test_compile_prism I, [2024-05-19T09:21:02.268242 #467798] INFO -- : [154/885] 508669=test_helper I, [2024-05-19T09:21:02.272667 #467798] INFO -- : [155/885] 508669=test_win32ole_event I, [2024-05-19T09:21:02.285552 #467798] INFO -- : [156/885] 508669=test_rdoc_markup_formatter I, [2024-05-19T09:21:02.348335 #467798] INFO -- : [157/885] 508669=test_gem_commands_uninstall_command I, [2024-05-19T09:21:03.136094 #467798] INFO -- : [158/885] 508669=test_dns I, [2024-05-19T09:21:03.623107 #467798] INFO -- : [159/885] 508669=test_c_union_entity I, [2024-05-19T09:21:03.696094 #467798] INFO -- : [160/885] 508669=test_notimplement I, [2024-05-19T09:21:03.708384 #467798] INFO -- : [161/885] 508669=test_cgi_session I, [2024-05-19T09:21:03.773100 #467798] INFO -- : [162/885] 508669=test_x509crl I, [2024-05-19T09:21:03.822997 #467798] INFO -- : [163/885] 508669=test_rdoc_markup_heading I, [2024-05-19T09:21:03.850684 #467798] INFO -- : [164/885] 508669=test_flip I, [2024-05-19T09:21:03.868865 #467798] INFO -- : [165/885] 508669=test_io_console I, [2024-05-19T09:21:03.871932 #467798] INFO -- : Leaked file descriptor: TestIO_Console#test_iflush: 10 # I, [2024-05-19T09:21:03.900588 #467798] INFO -- : COMMAND PID USER FD TYPE DEVICE SIZE/OFF NODE NAME I, [2024-05-19T09:21:03.900655 #467798] INFO -- : ruby 508669 opc 10r REG 252,0 6940392 13705429 /var/lib/sss/mc/group I, [2024-05-19T09:21:05.173702 #467798] INFO -- : [166/885] 508670=test_pattern_key_name_check I, [2024-05-19T09:21:05.279401 #467798] INFO -- : [167/885] 508670=test_profile_frames I, [2024-05-19T09:21:05.349280 #467798] INFO -- : [168/885] 508670=test_debug I, [2024-05-19T09:21:05.397637 #467798] INFO -- : [169/885] 508670=test_refinement I, [2024-05-19T09:21:06.605408 #467798] INFO -- : [170/885] 508669=test_transcode I, [2024-05-19T09:21:06.801183 #467798] INFO -- : [171/885] 508669=test_class2name I, [2024-05-19T09:21:06.827795 #467798] INFO -- : [172/885] 508669=test_gem_commands_cleanup_command I, [2024-05-19T09:21:07.478004 #467798] INFO -- : [173/885] 508669=test_readpartial I, [2024-05-19T09:21:07.909980 #467798] INFO -- : [174/885] 508669=test_rdoc_parser_ruby I, [2024-05-19T09:21:08.749166 #467798] INFO -- : [175/885] 508669=test_httpresponse I, [2024-05-19T09:21:08.790409 #467798] INFO -- : [176/885] 508669=test_x509req I, [2024-05-19T09:21:08.813346 #467798] INFO -- : [177/885] 508669=test_gem_console_ui I, [2024-05-19T09:21:08.828923 #467798] INFO -- : [178/885] 508669=test_allocation I, [2024-05-19T09:21:09.086050 #467798] INFO -- : [179/885] 508670=test_ifunless I, [2024-05-19T09:21:09.094911 #467798] INFO -- : [180/885] 508670=test_insns_leaf I, [2024-05-19T09:21:09.100296 #467798] INFO -- : [181/885] 508670=test_modify_expand I, [2024-05-19T09:21:09.117760 #467798] INFO -- : [182/885] 508670=test_gem_available_set I, [2024-05-19T09:21:09.279336 #467798] INFO -- : [183/885] 508670=test_pkg_config I, [2024-05-19T09:21:09.303874 #467798] INFO -- : [184/885] 508670=test_convertible I, [2024-05-19T09:21:11.323993 #467798] INFO -- : [185/885] 508669=errors_test I, [2024-05-19T09:21:11.409759 #467798] INFO -- : [186/885] 508669=json_encoding_test I, [2024-05-19T09:21:11.411736 #467798] INFO -- : [187/885] 508669=test_vm_dump I, [2024-05-19T09:21:11.428770 #467798] INFO -- : [188/885] 508669=test_config I, [2024-05-19T09:21:11.496297 #467798] INFO -- : [189/885] 508669=test_func I, [2024-05-19T09:21:13.121620 #467798] INFO -- : [190/885] 508671=test_gem_resolver I, [2024-05-19T09:21:13.242557 #467798] INFO -- : [191/885] 508670=test_gem_source_vendor I, [2024-05-19T09:21:13.255621 #467798] INFO -- : [192/885] 508670=test_dln I, [2024-05-19T09:21:13.257634 #467798] INFO -- : [193/885] 508670=test_object I, [2024-05-19T09:21:13.463817 #467798] INFO -- : [194/885] 508671=test_gem_commands_exec_command I, [2024-05-19T09:21:13.641053 #467798] INFO -- : [195/885] 508670=unescape_test I, [2024-05-19T09:21:14.837025 #467798] INFO -- : [196/885] 508671=test_super I, [2024-05-19T09:21:15.032212 #467798] INFO -- : [197/885] 508670=test_color_printer I, [2024-05-19T09:21:15.036401 #467798] INFO -- : [198/885] 508670=test_uncorrectable_name_check I, [2024-05-19T09:21:15.140681 #467798] INFO -- : [199/885] 508670=test_io I, [2024-05-19T09:21:15.723349 #467798] INFO -- : [200/885] 508669=test_dir I, [2024-05-19T09:21:15.951584 #467798] INFO -- : [201/885] 508671=test_files_test_1 I, [2024-05-19T09:21:16.037739 #467798] INFO -- : Leaked file descriptor: TestDir#test_home: 9 # I, [2024-05-19T09:21:16.037818 #467798] INFO -- : Leaked file descriptor: TestDir#test_home: 11 # I, [2024-05-19T09:21:16.066391 #467798] INFO -- : COMMAND PID USER FD TYPE DEVICE SIZE/OFF NODE NAME I, [2024-05-19T09:21:16.066480 #467798] INFO -- : ruby 508669 opc 9r REG 252,0 9253600 13705411 /var/lib/sss/mc/passwd I, [2024-05-19T09:21:16.066491 #467798] INFO -- : ruby 508669 opc 10r REG 252,0 6940392 13705429 /var/lib/sss/mc/group I, [2024-05-19T09:21:16.066500 #467798] INFO -- : ruby 508669 opc 11u unix 0x0000000000000000 0t0 3048814873 type=STREAM I, [2024-05-19T09:21:16.165542 #467798] INFO -- : [202/885] 508669=test_closure I, [2024-05-19T09:21:18.560077 #467798] INFO -- : [203/885] 508671=test_resolve_symbol I, [2024-05-19T09:21:18.616310 #467798] INFO -- : [204/885] 508669=test_rubygems I, [2024-05-19T09:21:18.623115 #467798] INFO -- : [205/885] 508671=test_path I, [2024-05-19T09:21:18.654838 #467798] INFO -- : [206/885] 508671=test_digest I, [2024-05-19T09:21:18.680737 #467798] INFO -- : [207/885] 508671=test_rdoc_rd_inline I, [2024-05-19T09:21:18.687521 #467798] INFO -- : [208/885] 508671=test_win32ole_param_event I, [2024-05-19T09:21:18.724689 #467798] INFO -- : [209/885] 508671=test_https_proxy I, [2024-05-19T09:21:18.758392 #467798] INFO -- : [210/885] 508671=test_rdoc_parser I, [2024-05-19T09:21:18.765703 #467798] INFO -- : [211/885] 508669=test_nomethod_error I, [2024-05-19T09:21:18.770015 #467798] INFO -- : [212/885] 508669=test_gem_commands_rebuild_command I, [2024-05-19T09:21:18.818428 #467798] INFO -- : [213/885] 508671=test_etc I, [2024-05-19T09:21:18.820999 #467798] INFO -- : Leaked file descriptor: TestEtc#test_getgrgid: 8 # I, [2024-05-19T09:21:18.849422 #467798] INFO -- : COMMAND PID USER FD TYPE DEVICE SIZE/OFF NODE NAME I, [2024-05-19T09:21:18.849503 #467798] INFO -- : ruby 508671 opc 8r REG 252,0 6940392 13705429 /var/lib/sss/mc/group I, [2024-05-19T09:21:18.866322 #467798] INFO -- : [214/885] 508669=test_stat I, [2024-05-19T09:21:18.878964 #467798] INFO -- : [215/885] 508669=test_printf I, [2024-05-19T09:21:18.887752 #467798] INFO -- : Leaked file descriptor: TestEtc#test_getlogin: 9 # I, [2024-05-19T09:21:18.894817 #467798] INFO -- : [216/885] 508669=test_x509attr I, [2024-05-19T09:21:18.897458 #467798] INFO -- : [217/885] 508669=test_workspaceCOMMAND PID USER FD TYPE DEVICE SIZE/OFF NODE NAME I, [2024-05-19T09:21:18.897532 #467798] INFO -- : ruby 508671 opc 9r REG 252,0 9253600 13705411 /var/lib/sss/mc/passwd I, [2024-05-19T09:21:18.905336 #467798] INFO -- : I, [2024-05-19T09:21:19.022177 #467798] INFO -- : [218/885] 508671=test_win32ole_variant I, [2024-05-19T09:21:19.028001 #467798] INFO -- : [219/885] 508671=magic_comment_test I, [2024-05-19T09:21:19.038086 #467798] INFO -- : [220/885] 508671=test_cgi_modruby I, [2024-05-19T09:21:19.038315 #467798] INFO -- : [221/885] 508671=test_gem_ext_configure_builder I, [2024-05-19T09:21:19.043236 #467798] INFO -- : [222/885] 508669=json_ext_parser_test I, [2024-05-19T09:21:19.052724 #467798] INFO -- : [223/885] 508669=test_nonblock I, [2024-05-19T09:21:19.086860 #467798] INFO -- : [224/885] 508669=test_rdoc_parser_simple I, [2024-05-19T09:21:19.109805 #467798] INFO -- : [225/885] 508669=test_ocsp I, [2024-05-19T09:21:19.119202 #467798] INFO -- : [226/885] 508671=test_scanner_events I, [2024-05-19T09:21:19.160872 #467798] INFO -- : [227/885] 508671=test_ipaddr I, [2024-05-19T09:21:19.188799 #467798] INFO -- : [228/885] 508671=test_date_strptime I, [2024-05-19T09:21:19.220666 #467798] INFO -- : [229/885] 508669=test_omap I, [2024-05-19T09:21:19.230572 #467798] INFO -- : [230/885] 508669=test_rdoc_generator_pot_po I, [2024-05-19T09:21:19.240092 #467798] INFO -- : [231/885] 508669=test_mul I, [2024-05-19T09:21:19.248960 #467798] INFO -- : [232/885] 508669=test_shellwords I, [2024-05-19T09:21:19.255481 #467798] INFO -- : [233/885] 508669=test_propertyputref I, [2024-05-19T09:21:19.264943 #467798] INFO -- : [234/885] 508669=test_gb18030 I, [2024-05-19T09:21:19.281783 #467798] INFO -- : [235/885] 508669=test_gem_commands_lock_command I, [2024-05-19T09:21:19.308457 #467798] INFO -- : [236/885] 508669=test_reline_key I, [2024-05-19T09:21:19.314836 #467798] INFO -- : [237/885] 508669=test_unicode_normalize I, [2024-05-19T09:21:19.328134 #467798] INFO -- : [238/885] 508671=test_gem_stream_ui I, [2024-05-19T09:21:19.446016 #467798] INFO -- : [239/885] 508671=test_rdoc_generator_ri I, [2024-05-19T09:21:19.468140 #467798] INFO -- : [240/885] 508671=test_rdoc_top_level I, [2024-05-19T09:21:19.750862 #467798] INFO -- : [241/885] 508671=test_io_m17n I, [2024-05-19T09:21:21.111850 #467798] INFO -- : [242/885] 508671=test_cmethod I, [2024-05-19T09:21:21.121723 #467798] INFO -- : [243/885] 508671=test_gem_stub_specification I, [2024-05-19T09:21:21.324961 #467798] INFO -- : [244/885] 508671=test_float I, [2024-05-19T09:21:23.093143 #467798] INFO -- : [245/885] 508671=test_color I, [2024-05-19T09:21:23.110487 #467798] INFO -- : [246/885] 508671=dispatcher_test I, [2024-05-19T09:21:23.121071 #467798] INFO -- : [247/885] 508671=test_eval_history I, [2024-05-19T09:21:23.132657 #467798] INFO -- : [248/885] 508671=test_unicode I, [2024-05-19T09:21:23.167799 #467798] INFO -- : [249/885] 508671=test_gem_source_git I, [2024-05-19T09:21:23.530386 #467798] INFO -- : [250/885] 508669=test_regex_casefold I, [2024-05-19T09:21:24.040682 #467798] INFO -- : [251/885] 508669=test_lexer I, [2024-05-19T09:21:24.048793 #467798] INFO -- : [252/885] 508670=test_win32ole_method I, [2024-05-19T09:21:24.052111 #467798] INFO -- : [253/885] 508670=test_ripper I, [2024-05-19T09:21:24.063717 #467798] INFO -- : [254/885] 508669=test_files_ext I, [2024-05-19T09:21:24.196703 #467798] INFO -- : [255/885] 508669=test_thread_cv I, [2024-05-19T09:21:24.282705 #467798] INFO -- : [256/885] 508671=test_stringio I, [2024-05-19T09:21:24.369800 #467798] INFO -- : [257/885] 508671=test_assembler I, [2024-05-19T09:21:24.376549 #467798] INFO -- : [258/885] 508671=test_random I, [2024-05-19T09:21:24.382153 #467798] INFO -- : [259/885] 508670=test_at_exit I, [2024-05-19T09:21:24.400730 #467798] INFO -- : [260/885] 508671=test_benchmark I, [2024-05-19T09:21:24.419363 #467798] INFO -- : [261/885] 508670=test_gem_source I, [2024-05-19T09:21:24.733987 #467798] INFO -- : [262/885] 508670=test_mkmf I, [2024-05-19T09:21:24.812972 #467798] INFO -- : [263/885] 508670=test_have_macro I, [2024-05-19T09:21:24.839594 #467798] INFO -- : [264/885] 508669=test_class I, [2024-05-19T09:21:24.861987 #467798] INFO -- : [265/885] 508669=test_autoload I, [2024-05-19T09:21:25.067550 #467798] INFO -- : [266/885] 508670=test_gem_package I, [2024-05-19T09:21:25.839061 #467798] INFO -- : [267/885] 508670=test_array I, [2024-05-19T09:21:25.890180 #467798] INFO -- : [268/885] 508671=test_sockopt I, [2024-05-19T09:21:25.896279 #467798] INFO -- : [269/885] 508671=test_ftp I, [2024-05-19T09:21:25.902439 #467798] INFO -- : [270/885] 508671=test_gem_source_fetch_problem I, [2024-05-19T09:21:25.930754 #467798] INFO -- : [271/885] 508671=test_install I, [2024-05-19T09:21:26.148036 #467798] INFO -- : [272/885] 508671=test_encoding I, [2024-05-19T09:21:26.170319 #467798] INFO -- : [273/885] 508671=test_rdoc_comment I, [2024-05-19T09:21:26.237403 #467798] INFO -- : [274/885] 508671=test_gem_request_set_lockfile_tokenizer I, [2024-05-19T09:21:26.310514 #467798] INFO -- : [275/885] 508671=test_lazy_enumerator I, [2024-05-19T09:21:26.788154 #467798] INFO -- : [276/885] 508671=test_cgi_multipart I, [2024-05-19T09:21:26.917274 #467798] INFO -- : [277/885] 508671=test_arithmetic_sequence I, [2024-05-19T09:21:26.995816 #467798] INFO -- : [278/885] 508671=test_ractor_compatibility I, [2024-05-19T09:21:27.297548 #467798] INFO -- : [279/885] 508671=test_autoconf I, [2024-05-19T09:21:27.304708 #467798] INFO -- : [280/885] 508671=integer_parse_test I, [2024-05-19T09:21:27.314977 #467798] INFO -- : [281/885] 508671=test_find_executable I, [2024-05-19T09:21:27.346645 #467798] INFO -- : [282/885] 508671=test_iseq I, [2024-05-19T09:21:27.930429 #467798] INFO -- : [283/885] 508671=test_primitive I, [2024-05-19T09:21:27.948672 #467798] INFO -- : [284/885] 508671=test_parser I, [2024-05-19T09:21:27.975934 #467798] INFO -- : [285/885] 508671=test_rdoc_ri_paths I, [2024-05-19T09:21:28.046937 #467798] INFO -- : [286/885] 508671=command_line_test I, [2024-05-19T09:21:28.053919 #467798] INFO -- : [287/885] 508671=test_win32ole_variant_m I, [2024-05-19T09:21:28.110188 #467798] INFO -- : [288/885] 508671=test_pair I, [2024-05-19T09:21:29.340939 #467798] INFO -- : [289/885] 508669=test_env I, [2024-05-19T09:21:31.843578 #467798] INFO -- : [290/885] 508669=test_gem_package_tar_reader I, [2024-05-19T09:21:31.980820 #467798] INFO -- : [291/885] 508669=test_gem_commands_signout_command I, [2024-05-19T09:21:32.007950 #467798] INFO -- : [292/885] 508669=test_gem_safe_yaml I, [2024-05-19T09:21:32.021890 #467798] INFO -- : [293/885] 508669=test_document I, [2024-05-19T09:21:32.031277 #467798] INFO -- : [294/885] 508669=test_eval I, [2024-05-19T09:21:32.048758 #467798] INFO -- : [295/885] 508669=test_history I, [2024-05-19T09:21:32.112128 #467798] INFO -- : [296/885] 508669=test_gem_commands_setup_command I, [2024-05-19T09:21:32.908141 #467798] INFO -- : [297/885] 508669=test_singleton_function I, [2024-05-19T09:21:32.993924 #467798] INFO -- : [298/885] 508669=test_file_exhaustive I, [2024-05-19T09:21:33.407558 #467798] INFO -- : [299/885] 508671=test_completion I, [2024-05-19T09:21:33.784169 #467798] INFO -- : [300/885] 508670=test_handle I, [2024-05-19T09:21:34.044175 #467798] INFO -- : [301/885] 508671=parse_stream_test I, [2024-05-19T09:21:34.058876 #467798] INFO -- : [302/885] 508671=test_gem_security_policy I, [2024-05-19T09:21:34.256010 #467798] INFO -- : [303/885] 508670=test_delete I, [2024-05-19T09:21:34.261854 #467798] INFO -- : [304/885] 508670=test_rdoc_markup_document I, [2024-05-19T09:21:34.271240 #467798] INFO -- : [305/885] 508670=test_io_wait_uncommon I, [2024-05-19T09:21:34.278701 #467798] INFO -- : [306/885] 508670=test_gem_ci_detector I, [2024-05-19T09:21:34.296821 #467798] INFO -- : [307/885] 508670=test_fixnum I, [2024-05-19T09:21:34.322071 #467798] INFO -- : [308/885] 508670=test_signal I, [2024-05-19T09:21:34.418793 #467798] INFO -- : [309/885] 508671=test_gem_silent_ui I, [2024-05-19T09:21:34.470691 #467798] INFO -- : [310/885] 508671=test_continuation I, [2024-05-19T09:21:34.483725 #467798] INFO -- : [311/885] 508671=test_ssl_session I, [2024-05-19T09:21:35.347002 #467798] INFO -- : [312/885] 508671=test_gem_package_tar_header I, [2024-05-19T09:21:35.400682 #467798] INFO -- : [313/885] 508671=test_rational2 I, [2024-05-19T09:21:35.405121 #467798] INFO -- : [314/885] 508671=test_logperiod I, [2024-05-19T09:21:35.717558 #467798] INFO -- : [315/885] 508671=test_case_comprehensive I, [2024-05-19T09:21:36.270290 #467798] INFO -- : [316/885] 508670=test_placearg I, [2024-05-19T09:21:36.458752 #467798] INFO -- : [317/885] 508670=test_irb I, [2024-05-19T09:21:36.622647 #467798] INFO -- : [318/885] 508670=test_x509cert I, [2024-05-19T09:21:36.702953 #467798] INFO -- : [319/885] 508670=test_rdoc_markup_paragraph I, [2024-05-19T09:21:36.763038 #467798] INFO -- : [320/885] 508670=test_require_path_check I, [2024-05-19T09:21:36.793979 #467798] INFO -- : [321/885] 508670=test_variable_name_check I, [2024-05-19T09:21:36.840772 #467798] INFO -- : [322/885] 508670=test_bn I, [2024-05-19T09:21:36.882697 #467798] INFO -- : [323/885] 508670=test_logdevice I, [2024-05-19T09:21:37.761176 #467798] INFO -- : [324/885] 508670=test_ast I, [2024-05-19T09:21:45.147368 #467798] INFO -- : [325/885] 508669=test_rdoc_markup_to_ansi I, [2024-05-19T09:21:45.196012 #467798] INFO -- : [326/885] 508669=test_files_test I, [2024-05-19T09:21:45.205617 #467798] INFO -- : [327/885] 508669=test_weakkeymap I, [2024-05-19T09:21:45.914959 #467798] INFO -- : [328/885] 508669=test_evaluation I, [2024-05-19T09:21:45.924767 #467798] INFO -- : [329/885] 508669=test_protocol I, [2024-05-19T09:21:46.250774 #467798] INFO -- : [330/885] 508669=test_gem_commands_info_command I, [2024-05-19T09:21:46.279704 #467798] INFO -- : [331/885] 508669=test_https I, [2024-05-19T09:21:46.412740 #467798] INFO -- : [332/885] 508669=test_object_create_start I, [2024-05-19T09:21:46.412814 #467798] INFO -- : [333/885] 508669=test_gem_request_set_gem_dependency_api I, [2024-05-19T09:21:46.788648 #467798] INFO -- : [334/885] 508669=test_name_error_extension I, [2024-05-19T09:21:46.811613 #467798] INFO -- : [335/885] 508669=test_gem_safe_marshal I, [2024-05-19T09:21:47.541820 #467798] INFO -- : [336/885] 508669=test_rdoc_ri_driver I, [2024-05-19T09:21:47.956222 #467798] INFO -- : [337/885] 508669=test_httpheader I, [2024-05-19T09:21:47.991966 #467798] INFO -- : [338/885] 508669=test_sexp I, [2024-05-19T09:21:48.072027 #467798] INFO -- : [339/885] 508669=test_ractor I, [2024-05-19T09:21:48.087798 #467798] INFO -- : [340/885] 508669=test_gem_commands_check_command I, [2024-05-19T09:21:48.174066 #467798] INFO -- : [341/885] 508669=test_gem_resolver_git_set I, [2024-05-19T09:21:48.849075 #467798] INFO -- : [342/885] 508669=test_signedness I, [2024-05-19T09:21:50.581339 #467798] INFO -- : [343/885] 508669=test_digest I, [2024-05-19T09:21:51.400283 #467798] INFO -- : [344/885] 508669=test_ractor I, [2024-05-19T09:21:51.530251 #467798] INFO -- : [345/885] 508669=test_exception_at_throwing I, [2024-05-19T09:21:51.592718 #467798] INFO -- : [346/885] 508669=test_gem_resolver_installed_specification I, [2024-05-19T09:21:51.620792 #467798] INFO -- : [347/885] 508669=test_stringscanner I, [2024-05-19T09:21:51.716458 #467798] INFO -- : [348/885] 508669=test_fiddle I, [2024-05-19T09:21:52.094394 #467798] INFO -- : [349/885] 508669=json_generic_object_test I, [2024-05-19T09:21:52.112400 #467798] INFO -- : [350/885] 508669=test_date_arith I, [2024-05-19T09:21:52.120990 #467798] INFO -- : [351/885] 508669=test_gem_resolver_vendor_specification I, [2024-05-19T09:21:52.168826 #467798] INFO -- : [352/885] 508669=test_mutex I, [2024-05-19T09:21:53.301451 #467798] INFO -- : [353/885] 508669=test_rdoc_token_stream I, [2024-05-19T09:21:53.314540 #467798] INFO -- : [354/885] 508669=heredoc_dedent_test I, [2024-05-19T09:21:53.331720 #467798] INFO -- : [355/885] 508669=test_type I, [2024-05-19T09:21:53.340681 #467798] INFO -- : [356/885] 508669=test_tmpdir I, [2024-05-19T09:21:53.423584 #467798] INFO -- : [357/885] 508669=test_struct I, [2024-05-19T09:21:54.024654 #467798] INFO -- : [358/885] 508669=test_rdoc_single_class I, [2024-05-19T09:21:54.034859 #467798] INFO -- : [359/885] 508669=test_dup I, [2024-05-19T09:21:54.188247 #467798] INFO -- : [360/885] 508669=test_acceptable I, [2024-05-19T09:21:54.266298 #467798] INFO -- : [361/885] 508669=test_gem_ext_cargo_builder_link_flag_converter I, [2024-05-19T09:21:54.422676 #467798] INFO -- : [362/885] 508669=test_gem_local_remote_options I, [2024-05-19T09:21:54.469334 #467798] INFO -- : [363/885] 508669=test_gem_package_task I, [2024-05-19T09:21:54.504705 #467798] INFO -- : [364/885] 508669=test_lock_native_thread I, [2024-05-19T09:21:54.728941 #467798] INFO -- : [365/885] 508669=test_resize I, [2024-05-19T09:21:54.748367 #467798] INFO -- : [366/885] 508669=test_key_error I, [2024-05-19T09:21:54.760821 #467798] INFO -- : [367/885] 508669=test_win32ole_param I, [2024-05-19T09:21:54.813911 #467798] INFO -- : [368/885] 508669=test_engine I, [2024-05-19T09:21:55.282754 #467798] INFO -- : [369/885] 508669=test_gem_commands_mirror I, [2024-05-19T09:21:55.295058 #467798] INFO -- : [370/885] 508669=test_fiber I, [2024-05-19T09:21:55.362015 #467798] INFO -- : [371/885] 508671=test_gem_security_trust_dir I, [2024-05-19T09:21:55.420683 #467798] INFO -- : [372/885] 508671=test_erb_command I, [2024-05-19T09:21:55.464064 #467798] INFO -- : [373/885] 508671=test_module I, [2024-05-19T09:21:58.842988 #467798] INFO -- : [374/885] 508671=test_usrmarshal I, [2024-05-19T09:21:59.034032 #467798] INFO -- : [375/885] 508671=test_gem_source_installed I, [2024-05-19T09:21:59.048716 #467798] INFO -- : [376/885] 508671=test_gem_validator I, [2024-05-19T09:21:59.082077 #467798] INFO -- : [377/885] 508671=test_abi I, [2024-05-19T09:21:59.221309 #467798] INFO -- : [378/885] 508671=test_load I, [2024-05-19T09:21:59.349383 #467798] INFO -- : [379/885] 508671=test_integer_comb I, [2024-05-19T09:22:01.745414 #467798] INFO -- : [380/885] 508669=test_bundled_ca I, [2024-05-19T09:22:01.938471 #467798] INFO -- : [381/885] 508671=test_ssl I, [2024-05-19T09:22:03.542476 #467798] INFO -- : [382/885] 508669=test_config I, [2024-05-19T09:22:03.653908 #467798] INFO -- : [383/885] 508669=test_ostruct I, [2024-05-19T09:22:03.787626 #467798] INFO -- : [384/885] 508669=test_depth_first I, [2024-05-19T09:22:03.805722 #467798] INFO -- : [385/885] 508669=test_change_word I, [2024-05-19T09:22:03.816835 #467798] INFO -- : [386/885] 508669=test_rdoc_parser_markdown I, [2024-05-19T09:22:03.852661 #467798] INFO -- : [387/885] 508669=test_custom_command I, [2024-05-19T09:22:03.863668 #467798] INFO -- : [388/885] 508669=fuzzer_test I, [2024-05-19T09:22:03.883080 #467798] INFO -- : [389/885] 508669=test_rubyvm I, [2024-05-19T09:22:03.966278 #467798] INFO -- : [390/885] 508669=test_cparser I, [2024-05-19T09:22:06.648974 #467798] INFO -- : [391/885] 508669=test_struct I, [2024-05-19T09:22:06.658843 #467798] INFO -- : [392/885] 508669=static_inspect_test I, [2024-05-19T09:22:06.708416 #467798] INFO -- : [393/885] 508669=test_c_struct_entry I, [2024-05-19T09:22:07.775897 #467798] INFO -- : [394/885] 508669=test_win32ole_type I, [2024-05-19T09:22:07.787804 #467798] INFO -- : [395/885] 508669=test_rdoc_rd_inline_parser I, [2024-05-19T09:22:07.826864 #467798] INFO -- : [396/885] 508669=test_load I, [2024-05-19T09:22:07.836798 #467798] INFO -- : [397/885] 508669=test_gem_source_lock I, [2024-05-19T09:22:07.888621 #467798] INFO -- : [398/885] 508669=test_cipher I, [2024-05-19T09:22:07.929198 #467798] INFO -- : [399/885] 508669=test_update I, [2024-05-19T09:22:07.947294 #467798] INFO -- : [400/885] 508669=test_new I, [2024-05-19T09:22:07.966521 #467798] INFO -- : [401/885] 508669=test_require I, [2024-05-19T09:22:10.609307 #467798] INFO -- : [402/885] 508669=test_objectspace I, [2024-05-19T09:22:11.619191 #467798] INFO -- : [403/885] 508669=test_debugger_integration I, [2024-05-19T09:22:11.649055 #467798] INFO -- : [404/885] 508669=test_gem_resolver_composed_set I, [2024-05-19T09:22:11.667751 #467798] INFO -- : [405/885] 508669=test_my_integer I, [2024-05-19T09:22:11.673755 #467798] INFO -- : [406/885] 508669=test_tracer I, [2024-05-19T09:22:11.684854 #467798] INFO -- : [407/885] 508669=test_cgi_cookie I, [2024-05-19T09:22:11.698970 #467798] INFO -- : [408/885] 508669=test_not I, [2024-05-19T09:22:11.714086 #467798] INFO -- : [409/885] 508669=test_option I, [2024-05-19T09:22:11.832109 #467798] INFO -- : [410/885] 508669=test_wss I, [2024-05-19T09:22:11.841054 #467798] INFO -- : [411/885] 508669=test_rdoc_markup_attribute_manager I, [2024-05-19T09:22:11.884355 #467798] INFO -- : [412/885] 508669=test_rdoc_rd_block_parser I, [2024-05-19T09:22:11.958088 #467798] INFO -- : [413/885] 508669=test_x509store I, [2024-05-19T09:22:12.356223 #467798] INFO -- : [414/885] 508671=test_rdoc_rd I, [2024-05-19T09:22:12.364826 #467798] INFO -- : [415/885] 508671=test_rdoc_generator_pot I, [2024-05-19T09:22:12.376055 #467798] INFO -- : [416/885] 508671=test_rdoc_markup_to_joined_paragraph I, [2024-05-19T09:22:12.385765 #467798] INFO -- : [417/885] 508671=test_rdoc_markup_to_markdown I, [2024-05-19T09:22:12.433131 #467798] INFO -- : [418/885] 508671=test_require_lib I, [2024-05-19T09:22:12.472157 #467798] INFO -- : [419/885] 508669=test_gem_gem_runner I, [2024-05-19T09:22:12.522033 #467798] INFO -- : [420/885] 508669=test_metaclass I, [2024-05-19T09:22:12.546084 #467798] INFO -- : [421/885] 508669=regexp_test I, [2024-05-19T09:22:12.630197 #467798] INFO -- : [422/885] 508669=test_yield I, [2024-05-19T09:22:15.446823 #467798] INFO -- : [423/885] 508671=test_show_source I, [2024-05-19T09:22:15.456654 #467798] INFO -- : [424/885] 508671=test_remote_fetch_error I, [2024-05-19T09:22:15.473908 #467798] INFO -- : [425/885] 508671=test_rdoc_stats I, [2024-05-19T09:22:15.500326 #467798] INFO -- : [426/885] 508671=test_files_sample I, [2024-05-19T09:22:15.509723 #467798] INFO -- : [427/885] 508671=test_data_error I, [2024-05-19T09:22:15.622419 #467798] INFO -- : [428/885] 508671=test_rubyoptions I, [2024-05-19T09:22:15.647213 #467798] INFO -- : [429/885] 508669=test_force_exit I, [2024-05-19T09:22:15.647539 #467798] INFO -- : [430/885] 508669=test_optimization I, [2024-05-19T09:22:20.593213 #467798] INFO -- : [431/885] 508670=test_shift_jis I, [2024-05-19T09:22:20.610691 #467798] INFO -- : [432/885] 508670=test_rdoc_store I, [2024-05-19T09:22:21.256848 #467798] INFO -- : [433/885] 508670=test_gem_uri_formatter I, [2024-05-19T09:22:21.274774 #467798] INFO -- : [434/885] 508670=test_prettyprint I, [2024-05-19T09:22:21.322871 #467798] INFO -- : [435/885] 508670=test_ole_methods I, [2024-05-19T09:22:21.333931 #467798] INFO -- : [436/885] 508670=test_cgi_util I, [2024-05-19T09:22:21.544452 #467798] INFO -- : [437/885] 508670=test_clone I, [2024-05-19T09:22:21.704646 #467798] INFO -- : [438/885] 508670=test_enc_raise I, [2024-05-19T09:22:21.716775 #467798] INFO -- : [439/885] 508670=test_queue I, [2024-05-19T09:22:21.737511 #467798] INFO -- : [440/885] 508670=test_gem_resolver_lock_specification I, [2024-05-19T09:22:21.766217 #467798] INFO -- : [441/885] 508670=test_boolean I, [2024-05-19T09:22:21.812899 #467798] INFO -- : [442/885] 508670=test_gc_compact I, [2024-05-19T09:22:22.015377 #467798] INFO -- : [443/885] 508671=test_rdoc_i18n_locale I, [2024-05-19T09:22:22.027976 #467798] INFO -- : [444/885] 508671=test_dryrun I, [2024-05-19T09:22:22.063296 #467798] INFO -- : [445/885] 508671=test_enumerable I, [2024-05-19T09:22:22.086107 #467798] INFO -- : [446/885] 508671=test_rdoc_method_attr I, [2024-05-19T09:22:22.246134 #467798] INFO -- : [447/885] 508671=test_set I, [2024-05-19T09:22:22.276849 #467798] INFO -- : [448/885] 508671=test_tree_spell_checker I, [2024-05-19T09:22:22.300425 #467798] INFO -- : [449/885] 508671=static_literals_test I, [2024-05-19T09:22:22.302441 #467798] INFO -- : [450/885] 508671=test_hash_create I, [2024-05-19T09:22:22.318487 #467798] INFO -- : [451/885] 508671=test_grapheme_breaks I, [2024-05-19T09:22:22.332443 #467798] INFO -- : [452/885] 508671=test_yamldbm I, [2024-05-19T09:22:22.344754 #467798] INFO -- : [453/885] 508669=test_gem_spec_fetcher I, [2024-05-19T09:22:22.354654 #467798] INFO -- : [454/885] 508671=test_unicode_escape I, [2024-05-19T09:22:22.437579 #467798] INFO -- : [455/885] 508671=test_switch_hitter I, [2024-05-19T09:22:22.451157 #467798] INFO -- : [456/885] 508671=test_default_gems I, [2024-05-19T09:22:22.498884 #467798] INFO -- : [457/885] 508671=test_backtrace I, [2024-05-19T09:22:22.515525 #467798] INFO -- : [458/885] 508671=test_gbk I, [2024-05-19T09:22:22.522900 #467798] INFO -- : [459/885] 508671=test_gem_commands_dependency_command I, [2024-05-19T09:22:22.554479 #467798] INFO -- : [460/885] 508669=test_key_event_record I, [2024-05-19T09:22:22.556731 #467798] INFO -- : [461/885] 508669=test_open3 I, [2024-05-19T09:22:22.622561 #467798] INFO -- : [462/885] 508671=test_mdns I, [2024-05-19T09:22:22.643200 #467798] INFO -- : [463/885] 508671=test_date_parse I, [2024-05-19T09:22:22.771345 #467798] INFO -- : [464/885] 508671=test_arity I, [2024-05-19T09:22:22.776462 #467798] INFO -- : [465/885] 508671=test_thread I, [2024-05-19T09:22:22.782997 #467798] INFO -- : [466/885] 508671=test_buffering I, [2024-05-19T09:22:22.789902 #467798] INFO -- : [467/885] 508671=test_svcb_https I, [2024-05-19T09:22:22.805609 #467798] INFO -- : [468/885] 508671=test_pkey_ec I, [2024-05-19T09:22:22.838712 #467798] INFO -- : [469/885] 508671=test_rational I, [2024-05-19T09:22:22.871813 #467798] INFO -- : [470/885] 508671=test_case_mapping I, [2024-05-19T09:22:22.891652 #467798] INFO -- : [471/885] 508671=test_gem_ext_cargo_builder_unit I, [2024-05-19T09:22:22.931892 #467798] INFO -- : [472/885] 508671=test_ractor I, [2024-05-19T09:22:22.938481 #467798] INFO -- : [473/885] 508671=test_gem_resolver_api_specification I, [2024-05-19T09:22:23.000142 #467798] INFO -- : [474/885] 508671=test_rdoc_rubygems_hook I, [2024-05-19T09:22:23.087784 #467798] INFO -- : [475/885] 508671=test_webauthn_listener I, [2024-05-19T09:22:23.171150 #467798] INFO -- : Leaked file descriptor: WebauthnListenerTest#test_wait_for_otp_code_get_follows_options: 14 : # I, [2024-05-19T09:22:23.205405 #467798] INFO -- : COMMAND PID USER FD TYPE DEVICE SIZE/OFF NODE NAME I, [2024-05-19T09:22:23.205480 #467798] INFO -- : ruby 508671 opc 14u IPv4 3048830196 0t0 TCP localhost:37289->localhost:43292 (CLOSE_WAIT) I, [2024-05-19T09:22:23.304111 #467798] INFO -- : [476/885] 508671=test_array_create I, [2024-05-19T09:22:23.359228 #467798] INFO -- : [477/885] 508671=test_memory_view I, [2024-05-19T09:22:23.367222 #467798] INFO -- : Closed file descriptor: Fiddle::TestMemoryView#test_memory_view_multi_dimensional: 14 I, [2024-05-19T09:22:23.904829 #467798] INFO -- : [478/885] 508671=test_dir_m17n I, [2024-05-19T09:22:25.258361 #467798] INFO -- : [479/885] 508671=test_threadgroup I, [2024-05-19T09:22:25.359163 #467798] INFO -- : [480/885] 508670=test_complex I, [2024-05-19T09:22:25.368883 #467798] INFO -- : [481/885] 508669=!Nothing_to_test I, [2024-05-19T09:22:25.370321 #467798] INFO -- : [482/885] 508669=test_fd_setsize I, [2024-05-19T09:22:25.380729 #467798] INFO -- : [483/885] 508669=test_forwardable I, [2024-05-19T09:22:25.395993 #467798] INFO -- : [484/885] 508669=test_process I, [2024-05-19T09:22:25.446232 #467798] INFO -- : [485/885] 508669=test_iterator I, [2024-05-19T09:22:25.461363 #467798] INFO -- : [486/885] 508670=test_string I, [2024-05-19T09:22:25.486543 #467798] INFO -- : [487/885] 508670=test_gem_commands_install_command I, [2024-05-19T09:22:25.524679 #467798] INFO -- : [488/885] 508669=test_rendering I, [2024-05-19T09:22:25.534668 #467798] INFO -- : [489/885] 508669=test_kernel I, [2024-05-19T09:22:26.236907 #467798] INFO -- : [490/885] 508669=pattern_test I, [2024-05-19T09:22:26.249020 #467798] INFO -- : [491/885] 508671=test_dot_dot I, [2024-05-19T09:22:26.253784 #467798] INFO -- : [492/885] 508669=test_gem_rdoc I, [2024-05-19T09:22:26.265189 #467798] INFO -- : [493/885] 508671=test_did_you_mean I, [2024-05-19T09:22:26.363671 #467798] INFO -- : [494/885] 508671=test_shapes I, [2024-05-19T09:22:26.368636 #467798] INFO -- : [495/885] 508671=test_cesu8 I, [2024-05-19T09:22:26.377634 #467798] INFO -- : [496/885] 508671=test_rdoc_extend I, [2024-05-19T09:22:26.410032 #467798] INFO -- : [497/885] 508671=test_storage I, [2024-05-19T09:22:26.413976 #467798] INFO -- : [498/885] 508669=test_method_name_check I, [2024-05-19T09:22:26.418451 #467798] INFO -- : [499/885] 508671=test_err_in_callback I, [2024-05-19T09:22:26.432538 #467798] INFO -- : [500/885] 508671=test_merge_keys I, [2024-05-19T09:22:26.440076 #467798] INFO -- : [501/885] 508671=test_gem_impossible_dependencies_error I, [2024-05-19T09:22:26.456300 #467798] INFO -- : [502/885] 508671=test_pp I, [2024-05-19T09:22:26.471737 #467798] INFO -- : [503/885] 508669=memsize_test I, [2024-05-19T09:22:26.480599 #467798] INFO -- : [504/885] 508669=test_gem_resolver_requirement_list I, [2024-05-19T09:22:26.493211 #467798] INFO -- : [505/885] 508669=test_noarg I, [2024-05-19T09:22:26.523793 #467798] INFO -- : [506/885] 508671=test_arith_seq_beg_len_step I, [2024-05-19T09:22:26.532443 #467798] INFO -- : [507/885] 508671=test_raise_exception I, [2024-05-19T09:22:26.637953 #467798] INFO -- : [508/885] 508669=test_exception I, [2024-05-19T09:22:26.672724 #467798] INFO -- : [509/885] 508669=test_basicinstructions I, [2024-05-19T09:22:26.737655 #467798] INFO -- : [510/885] 508669=test_gem_resolver_git_specification I, [2024-05-19T09:22:27.117645 #467798] INFO -- : [511/885] 508669=test_utf32 I, [2024-05-19T09:22:27.120820 #467798] INFO -- : [512/885] 508671=test_key_actor_emacs I, [2024-05-19T09:22:27.130230 #467798] INFO -- : [513/885] 508669=test_gem_security I, [2024-05-19T09:22:27.140716 #467798] INFO -- : [514/885] 508670=test_erb I, [2024-05-19T09:22:27.200115 #467798] INFO -- : [515/885] 508670=test_date_ractor I, [2024-05-19T09:22:27.262557 #467798] INFO -- : [516/885] 508671=test_variable I, [2024-05-19T09:22:27.347028 #467798] INFO -- : [517/885] 508671=test_hash I, [2024-05-19T09:22:27.367765 #467798] INFO -- : [518/885] 508671=test_rdoc_tom_doc I, [2024-05-19T09:22:27.420545 #467798] INFO -- : [519/885] 508671=test_gem_commands_pristine_command I, [2024-05-19T09:22:27.450948 #467798] INFO -- : [520/885] 508670=test_optarg I, [2024-05-19T09:22:27.520702 #467798] INFO -- : [521/885] 508670=test_verbose I, [2024-05-19T09:22:27.540731 #467798] INFO -- : [522/885] 508670=test_gem_commands_open_command I, [2024-05-19T09:22:27.633981 #467798] INFO -- : [523/885] 508670=test_emoji_breaks I, [2024-05-19T09:22:27.636169 #467798] INFO -- : [524/885] 508670=test_normalize I, [2024-05-19T09:22:27.636311 #467798] INFO -- : [525/885] 508670=test_gem_update_suggestion I, [2024-05-19T09:22:27.652589 #467798] INFO -- : [526/885] 508670=test_assignment I, [2024-05-19T09:22:28.771760 #467798] INFO -- : [527/885] 508671=test_undef I, [2024-05-19T09:22:28.778795 #467798] INFO -- : [528/885] 508671=test_random I, [2024-05-19T09:22:28.788131 #467798] INFO -- : [529/885] 508671=test_gem_resolver_lock_set I, [2024-05-19T09:22:28.843925 #467798] INFO -- : [530/885] 508671=test_rdoc_generator_darkfish I, [2024-05-19T09:22:28.860688 #467798] INFO -- : [531/885] 508670=test_gem_command I, [2024-05-19T09:22:28.969757 #467798] INFO -- : [532/885] 508670=test_asn1 I, [2024-05-19T09:22:28.972078 #467798] INFO -- : [533/885] 508670=test_win32ole_variable I, [2024-05-19T09:22:28.976469 #467798] INFO -- : [534/885] 508670=test_method_cache I, [2024-05-19T09:22:28.996529 #467798] INFO -- : [535/885] 508670=test_rdoc_class_module I, [2024-05-19T09:22:29.164570 #467798] INFO -- : [536/885] 508671=test_parse I, [2024-05-19T09:22:29.522692 #467798] INFO -- : [537/885] 508670=test_rdoc_cross_reference I, [2024-05-19T09:22:29.655732 #467798] INFO -- : [538/885] 508671=test_gem_specification I, [2024-05-19T09:22:29.894770 #467798] INFO -- : [539/885] 508670=test_flush I, [2024-05-19T09:22:29.901178 #467798] INFO -- : [540/885] 508670=test_pkey_rsa I, [2024-05-19T09:22:30.179257 #467798] INFO -- : [541/885] 508670=test_system I, [2024-05-19T09:22:31.036439 #467798] INFO -- : [542/885] 508670=test_numhash I, [2024-05-19T09:22:31.043356 #467798] INFO -- : [543/885] 508670=test_face I, [2024-05-19T09:22:31.068468 #467798] INFO -- : [544/885] 508670=test_gem_request_set_lockfile_parser I, [2024-05-19T09:22:31.194302 #467798] INFO -- : [545/885] 508670=test_date_attr I, [2024-05-19T09:22:31.240880 #467798] INFO -- : [546/885] 508670=test_sizeof I, [2024-05-19T09:22:31.933833 #467798] INFO -- : [547/885] 508669=test_stringchar I, [2024-05-19T09:22:31.959077 #467798] INFO -- : [548/885] 508669=warnings_test I, [2024-05-19T09:22:31.982395 #467798] INFO -- : [549/885] 508669=test_econv I, [2024-05-19T09:22:32.132855 #467798] INFO -- : [550/885] 508671=test_gem_install_update_options I, [2024-05-19T09:22:32.262375 #467798] INFO -- : [551/885] 508671=test_jaro_winkler I, [2024-05-19T09:22:32.268035 #467798] INFO -- : [552/885] 508671=test_cp949 I, [2024-05-19T09:22:32.278454 #467798] INFO -- : [553/885] 508671=test_condition I, [2024-05-19T09:22:32.289633 #467798] INFO -- : [554/885] 508671=test_gem_resolver_vendor_set I, [2024-05-19T09:22:32.316781 #467798] INFO -- : [555/885] 508671=test_gem_dependency_resolution_error I, [2024-05-19T09:22:32.340983 #467798] INFO -- : [556/885] 508671=test_fileutils I, [2024-05-19T09:22:32.879011 #467798] INFO -- : [557/885] 508669=test_mixed_unicode_escapes I, [2024-05-19T09:22:32.887836 #467798] INFO -- : [558/885] 508669=test_sleep I, [2024-05-19T09:22:33.000520 #467798] INFO -- : [559/885] 508671=test_emoji I, [2024-05-19T09:22:33.088294 #467798] INFO -- : [560/885] 508671=test_sorted_set I, [2024-05-19T09:22:33.222098 #467798] INFO -- : [561/885] 508671=test_windows_1252 I, [2024-05-19T09:22:33.478397 #467798] INFO -- : [562/885] 508671=test_stack I, [2024-05-19T09:22:33.577188 #467798] INFO -- : [563/885] 508670=test_rdoc_generator_json_index I, [2024-05-19T09:22:33.613071 #467798] INFO -- : [564/885] 508670=test_date_time I, [2024-05-19T09:22:33.619599 #467798] INFO -- : [565/885] 508670=test_nil2vtempty I, [2024-05-19T09:22:33.621466 #467798] INFO -- : [566/885] 508670=test_framework I, [2024-05-19T09:22:33.626606 #467798] INFO -- : [567/885] 508670=test_coderange I, [2024-05-19T09:22:33.710154 #467798] INFO -- : [568/885] 508670=test_weakmap I, [2024-05-19T09:22:34.003765 #467798] INFO -- : [569/885] 508671=test_ansi_with_terminfo I, [2024-05-19T09:22:34.016370 #467798] INFO -- : [570/885] 508671=test_inadvertent_creation I, [2024-05-19T09:22:34.113271 #467798] INFO -- : [571/885] 508671=test_cgi_tag_helper I, [2024-05-19T09:22:34.174240 #467798] INFO -- : [572/885] 508671=test_pack I, [2024-05-19T09:22:34.231269 #467798] INFO -- : [573/885] 508671=test_pinned I, [2024-05-19T09:22:34.289730 #467798] INFO -- : [574/885] 508671=test_libs I, [2024-05-19T09:22:34.328393 #467798] INFO -- : [575/885] 508671=ripper_test I, [2024-05-19T09:22:34.840673 #467798] INFO -- : [576/885] 508671=test_iso_8859 I, [2024-05-19T09:22:34.864619 #467798] INFO -- : [577/885] 508671=test_math I, [2024-05-19T09:22:34.882765 #467798] INFO -- : [578/885] 508671=test_qsort I, [2024-05-19T09:22:34.888648 #467798] INFO -- : [579/885] 508671=comments_test I, [2024-05-19T09:22:34.892591 #467798] INFO -- : [580/885] 508671=test_gc I, [2024-05-19T09:22:34.900604 #467798] INFO -- : [581/885] 508671=test_safe_load I, [2024-05-19T09:22:34.911497 #467798] INFO -- : [582/885] 508671=test_sprintf I, [2024-05-19T09:22:34.945159 #467798] INFO -- : [583/885] 508669=test_class I, [2024-05-19T09:22:35.146634 #467798] INFO -- : [584/885] 508671=test_exit I, [2024-05-19T09:22:35.228814 #467798] INFO -- : [585/885] 508671=test_const I, [2024-05-19T09:22:35.238369 #467798] INFO -- : [586/885] 508671=test_rdoc_parser_rd I, [2024-05-19T09:22:35.252039 #467798] INFO -- : [587/885] 508671=index_write_test I, [2024-05-19T09:22:35.268820 #467798] INFO -- : [588/885] 508671=json_addition_test I, [2024-05-19T09:22:35.282189 #467798] INFO -- : [589/885] 508671=test_gem_source_list I, [2024-05-19T09:22:35.351936 #467798] INFO -- : [590/885] 508671=test_name_error I, [2024-05-19T09:22:35.448231 #467798] INFO -- : [591/885] 508671=test_gem_commands_sources_command I, [2024-05-19T09:22:35.665277 #467798] INFO -- : [592/885] 508671=test_yaml_special_cases I, [2024-05-19T09:22:35.680485 #467798] INFO -- : [593/885] 508671=test_recorder I, [2024-05-19T09:22:35.692951 #467798] INFO -- : [594/885] 508671=test_case I, [2024-05-19T09:22:35.762012 #467798] INFO -- : [595/885] 508671=test_open-uri I, [2024-05-19T09:22:36.173470 #467798] INFO -- : [596/885] 508671=test_enc_associate I, [2024-05-19T09:22:36.737518 #467798] INFO -- : [597/885] 508671=test_enumerator I, [2024-05-19T09:22:38.053208 #467798] INFO -- : [598/885] 508669=test_gem_command_manager I, [2024-05-19T09:22:38.242058 #467798] INFO -- : [599/885] 508669=test_rdoc_context I, [2024-05-19T09:22:39.089476 #467798] INFO -- : [600/885] 508669=test_array I, [2024-05-19T09:22:39.108073 #467798] INFO -- : [601/885] 508669=encoding_test I, [2024-05-19T09:22:39.209758 #467798] INFO -- : [602/885] 508669=test_gem_commands_specification_command I, [2024-05-19T09:22:39.357580 #467798] INFO -- : [603/885] 508669=test_scan_args I, [2024-05-19T09:22:39.384779 #467798] INFO -- : [604/885] 508669=test_gem_commands_which_command I, [2024-05-19T09:22:39.432263 #467798] INFO -- : [605/885] 508669=test_gem_request I, [2024-05-19T09:22:39.672399 #467798] INFO -- : [606/885] 508669=test_gem_package_old I, [2024-05-19T09:22:39.727476 #467798] INFO -- : [607/885] 508669=test_pty I, [2024-05-19T09:22:40.246437 #467798] INFO -- : [608/885] 508669=test_gem_dependency_installer I, [2024-05-19T09:22:41.351838 #467798] INFO -- : [609/885] 508670=test_http I, [2024-05-19T09:22:41.364433 #467798] INFO -- : [610/885] 508670=parser_test I, [2024-05-19T09:22:41.378521 #467798] INFO -- : [611/885] 508670=test_hash I, [2024-05-19T09:22:42.898214 #467798] INFO -- : [612/885] 508669=test_internal_ivar I, [2024-05-19T09:22:42.905963 #467798] INFO -- : [613/885] 508669=test_win32ole I, [2024-05-19T09:22:42.920717 #467798] INFO -- : [614/885] 508669=desugar_compiler_test I, [2024-05-19T09:22:42.958200 #467798] INFO -- : [615/885] 508669=test_gem_source_local I, [2024-05-19T09:22:43.197185 #467798] INFO -- : [616/885] 508669=test_rendering I, [2024-05-19T09:22:43.227414 #467798] INFO -- : [617/885] 508669=test_gem_gemcutter_utilities I, [2024-05-19T09:22:43.669627 #467798] INFO -- : [618/885] 508669=test_rdoc_task I, [2024-05-19T09:22:43.682686 #467798] INFO -- : [619/885] 508669=test_gem_text I, [2024-05-19T09:22:43.930497 #467798] INFO -- : [620/885] 508669=test_settracefunc I, [2024-05-19T09:22:45.004966 #467798] INFO -- : [621/885] 508669=test_tracepoint I, [2024-05-19T09:22:45.324352 #467798] INFO -- : [622/885] 508669=test_backtrace I, [2024-05-19T09:22:46.136330 #467798] INFO -- : [623/885] 508670=test_gem_commands_push_command I, [2024-05-19T09:22:46.664822 #467798] INFO -- : [624/885] 508669=locals_test I, [2024-05-19T09:22:46.794951 #467798] INFO -- : [625/885] 508670=test_method_cache I, [2024-05-19T09:22:46.856900 #467798] INFO -- : [626/885] 508670=test_too_many_dummy_encodings I, [2024-05-19T09:22:46.872779 #467798] INFO -- : [627/885] 508670=test_sprintf_comb I, [2024-05-19T09:22:47.121914 #467798] INFO -- : [628/885] 508669=test_rdoc_markup_to_rdoc I, [2024-05-19T09:22:47.123996 #467798] INFO -- : [629/885] 508670=test_case I, [2024-05-19T09:22:47.137923 #467798] INFO -- : [630/885] 508670=test_ractor I, [2024-05-19T09:22:47.143657 #467798] INFO -- : [631/885] 508670=test_severity I, [2024-05-19T09:22:47.151550 #467798] INFO -- : [632/885] 508670=test_str2big I, [2024-05-19T09:22:47.160442 #467798] INFO -- : [633/885] 508670=test_gem_package_tar_writer I, [2024-05-19T09:22:47.177884 #467798] INFO -- : [634/885] 508669=attribute_write_test I, [2024-05-19T09:22:47.183527 #467798] INFO -- : [635/885] 508669=test_http I, [2024-05-19T09:22:47.340885 #467798] INFO -- : [636/885] 508670=test_utf16 I, [2024-05-19T09:22:47.359054 #467798] INFO -- : [637/885] 508670=test_set I, [2024-05-19T09:22:47.376698 #467798] INFO -- : [638/885] 508670=test_parser_events I, [2024-05-19T09:22:47.446186 #467798] INFO -- : [639/885] 508670=test_filter I, [2024-05-19T09:22:47.539239 #467798] INFO -- : [640/885] 508670=test_pkcs12 I, [2024-05-19T09:22:48.166171 #467798] INFO -- : [641/885] 508670=test_koi8 I, [2024-05-19T09:22:48.180725 #467798] INFO -- : [642/885] 508670=test_json_tree I, [2024-05-19T09:22:48.243069 #467798] INFO -- : [643/885] 508670=test_gem_remote_fetcher I, [2024-05-19T09:22:50.288423 #467798] INFO -- : [644/885] 508670=test_argf I, [2024-05-19T09:22:53.741172 #467798] INFO -- : [645/885] 508670=test_yaml I, [2024-05-19T09:22:53.867111 #467798] INFO -- : [646/885] 508670=test_x509name I, [2024-05-19T09:22:53.882444 #467798] INFO -- : [647/885] 508670=test_gem_dependency I, [2024-05-19T09:22:54.062204 #467798] INFO -- : [648/885] 508670=test_gem_uninstaller I, [2024-05-19T09:22:55.292224 #467798] INFO -- : [649/885] 508670=test_cclass I, [2024-05-19T09:22:55.347274 #467798] INFO -- : [650/885] 508670=test_yjit I, [2024-05-19T09:22:55.519232 #467798] INFO -- : [651/885] 508670=test_method I, [2024-05-19T09:22:56.002218 #467798] INFO -- : [652/885] 508669=test_m17n I, [2024-05-19T09:22:56.070131 #467798] INFO -- : [653/885] 508669=test_io_buffer I, [2024-05-19T09:22:56.175258 #467798] INFO -- : [654/885] 508669=test_ldap I, [2024-05-19T09:22:56.197886 #467798] INFO -- : [655/885] 508669=test_kdf I, [2024-05-19T09:22:57.360605 #467798] INFO -- : [656/885] 508669=test_thread_queue I, [2024-05-19T09:23:03.040303 #467798] INFO -- : [657/885] 508669=test_nowrite I, [2024-05-19T09:23:03.097083 #467798] INFO -- : [658/885] 508669=test_defined I, [2024-05-19T09:23:03.182466 #467798] INFO -- : [659/885] 508669=test_passing_block I, [2024-05-19T09:23:03.194040 #467798] INFO -- : [660/885] 508669=json_string_matching_test I, [2024-05-19T09:23:03.210120 #467798] INFO -- : [661/885] 508669=test_gem_config_file I, [2024-05-19T09:23:03.409426 #467798] INFO -- : [662/885] 508669=test_comparable I, [2024-05-19T09:23:03.426896 #467798] INFO -- : [663/885] 508669=test_rdoc_rdoc I, [2024-05-19T09:23:03.503984 #467798] INFO -- : [664/885] 508669=test_yjit_exit_locations I, [2024-05-19T09:23:03.524093 #467798] INFO -- : [665/885] 508669=test_rdoc_markdown_test I, [2024-05-19T09:23:04.797933 #467798] INFO -- : [666/885] 508669=test_rdoc_normal_module I, [2024-05-19T09:23:04.832206 #467798] INFO -- : [667/885] 508669=test_type_completor I, [2024-05-19T09:23:04.842822 #467798] INFO -- : [668/885] 508669=test_io_timeout I, [2024-05-19T09:23:04.864170 #467798] INFO -- : [669/885] 508669=test_gem_commands_yank_command I, [2024-05-19T09:23:05.383829 #467798] INFO -- : [670/885] 508669=test_yaml_tree I, [2024-05-19T09:23:05.431148 #467798] INFO -- : [671/885] 508669=test_cstr I, [2024-05-19T09:23:06.223924 #467798] INFO -- : [672/885] 508670=test_gem_resolver_dependency_request I, [2024-05-19T09:23:06.254196 #467798] INFO -- : [673/885] 508670=test_euc_tw I, [2024-05-19T09:23:06.268823 #467798] INFO -- : [674/885] 508670=test_command I, [2024-05-19T09:23:06.569906 #467798] INFO -- : [675/885] 508670=test_big2str I, [2024-05-19T09:23:06.596562 #467798] INFO -- : [676/885] 508670=test_gem_resolver_specification I, [2024-05-19T09:23:06.622545 #467798] INFO -- : [677/885] 508670=test_logger I, [2024-05-19T09:23:06.647408 #467798] INFO -- : [678/885] 508670=test_pkey_dsa I, [2024-05-19T09:23:07.843073 #467798] INFO -- : [679/885] 508671=test_wait I, [2024-05-19T09:23:07.883769 #467798] INFO -- : [680/885] 508671=test_human_typo I, [2024-05-19T09:23:07.922740 #467798] INFO -- : [681/885] 508671=test_import I, [2024-05-19T09:23:08.573071 #467798] INFO -- : [682/885] 508669=test_psych I, [2024-05-19T09:23:08.600756 #467798] INFO -- : [683/885] 508669=test_nil I, [2024-05-19T09:23:08.612692 #467798] INFO -- : [684/885] 508669=test_string I, [2024-05-19T09:23:08.635435 #467798] INFO -- : [685/885] 508669=json_common_interface_test I, [2024-05-19T09:23:08.650365 #467798] INFO -- : [686/885] 508669=test_rdoc_any_method I, [2024-05-19T09:23:09.030601 #467798] INFO -- : [687/885] 508669=test_error_highlight I, [2024-05-19T09:23:09.370305 #467798] INFO -- : [688/885] 508670=test_function_entry I, [2024-05-19T09:23:09.371464 #467798] INFO -- : [689/885] 508670=test_complexrational I, [2024-05-19T09:23:09.379309 #467798] INFO -- : [690/885] 508670=test_raise I, [2024-05-19T09:23:09.385072 #467798] INFO -- : [691/885] 508670=version_test I, [2024-05-19T09:23:09.387271 #467798] INFO -- : [692/885] 508670=test_files_lib I, [2024-05-19T09:23:09.722194 #467798] INFO -- : [693/885] 508669=test_string_memory I, [2024-05-19T09:23:10.161213 #467798] INFO -- : [694/885] 508669=test_help I, [2024-05-19T09:23:10.170404 #467798] INFO -- : [695/885] 508669=test_enumerator_kw I, [2024-05-19T09:23:10.174059 #467798] INFO -- : [696/885] 508669=reflection_test I, [2024-05-19T09:23:10.192881 #467798] INFO -- : [697/885] 508669=test_line_editor I, [2024-05-19T09:23:10.205853 #467798] INFO -- : [698/885] 508669=test_marshalable I, [2024-05-19T09:23:10.216316 #467798] INFO -- : [699/885] 508669=test_erb_m17n I, [2024-05-19T09:23:10.230961 #467798] INFO -- : [700/885] 508669=test_rdoc_generator_pot_po_entry I, [2024-05-19T09:23:10.243569 #467798] INFO -- : [701/885] 508669=test_timeout I, [2024-05-19T09:23:10.272458 #467798] INFO -- : [702/885] 508669=test_webauthn_poller I, [2024-05-19T09:23:10.417606 #467798] INFO -- : [703/885] 508669=test_rdoc_markup_verbatim I, [2024-05-19T09:23:10.434737 #467798] INFO -- : [704/885] 508669=test_date_conv I, [2024-05-19T09:23:10.465737 #467798] INFO -- : [705/885] 508669=test_gem_resolver_index_specification I, [2024-05-19T09:23:10.512402 #467798] INFO -- : [706/885] 508669=test_serialize_subclasses I, [2024-05-19T09:23:10.523922 #467798] INFO -- : [707/885] 508669=test_frozen I, [2024-05-19T09:23:10.540556 #467798] INFO -- : [708/885] 508669=test_egrep_cpp I, [2024-05-19T09:23:10.652023 #467798] INFO -- : [709/885] 508669=test_tree_builder I, [2024-05-19T09:23:10.655812 #467798] INFO -- : [710/885] 508669=test_protect I, [2024-05-19T09:23:10.705085 #467798] INFO -- : [711/885] 508669=test_gem_commands_update_command I, [2024-05-19T09:23:10.890573 #467798] INFO -- : [712/885] 508671=test_big5 I, [2024-05-19T09:23:10.900428 #467798] INFO -- : [713/885] 508671=test_date I, [2024-05-19T09:23:10.912880 #467798] INFO -- : [714/885] 508671=test_fnmatch I, [2024-05-19T09:23:10.953012 #467798] INFO -- : [715/885] 508671=test_pathname I, [2024-05-19T09:23:11.184613 #467798] INFO -- : [716/885] 508671=test_rdoc_markup_pre_process I, [2024-05-19T09:23:11.335129 #467798] INFO -- : [717/885] 508671=test_store I, [2024-05-19T09:23:11.658794 #467798] INFO -- : [718/885] 508671=test_http_request I, [2024-05-19T09:23:11.674784 #467798] INFO -- : [719/885] 508671=test_tempfile I, [2024-05-19T09:23:11.939431 #467798] INFO -- : [720/885] 508671=test_coverage I, [2024-05-19T09:23:12.287551 #467798] INFO -- : [721/885] 508670=test_tcp I, [2024-05-19T09:23:12.428200 #467798] INFO -- : [722/885] 508669=test_win32ole_method_event I, [2024-05-19T09:23:12.431314 #467798] INFO -- : [723/885] 508669=parse_comments_test I, [2024-05-19T09:23:12.438147 #467798] INFO -- : [724/885] 508670=test_rdoc_markup_to_table_of_contents I, [2024-05-19T09:23:12.438593 #467798] INFO -- : [725/885] 508669=test_gem_name_tuple I, [2024-05-19T09:23:12.469694 #467798] INFO -- : [726/885] 508669=test_integer I, [2024-05-19T09:23:12.501491 #467798] INFO -- : [727/885] 508670=test_gem_requirement I, [2024-05-19T09:23:12.546503 #467798] INFO -- : [728/885] 508669=test_macro I, [2024-05-19T09:23:12.556797 #467798] INFO -- : [729/885] 508669=test_string I, [2024-05-19T09:23:12.702058 #467798] INFO -- : [730/885] 508670=test_pipe I, [2024-05-19T09:23:12.747635 #467798] INFO -- : [731/885] 508671=test_function I, [2024-05-19T09:23:12.828066 #467798] INFO -- : [732/885] 508670=test_gem_resolver_activation_request I, [2024-05-19T09:23:12.844666 #467798] INFO -- : [733/885] 508670=test_gem_commands_server_command I, [2024-05-19T09:23:12.850819 #467798] INFO -- : [734/885] 508670=test_hmac I, [2024-05-19T09:23:12.860583 #467798] INFO -- : [735/885] 508670=test_encoding I, [2024-05-19T09:23:12.992655 #467798] INFO -- : [736/885] 508671=test_rdoc_generator_markup I, [2024-05-19T09:23:13.028439 #467798] INFO -- : [737/885] 508671=test_constant I, [2024-05-19T09:23:13.038694 #467798] INFO -- : [738/885] 508670=test_find I, [2024-05-19T09:23:13.064428 #467798] INFO -- : [739/885] 508670=test_rat I, [2024-05-19T09:23:13.200685 #467798] INFO -- : [740/885] 508670=test_init I, [2024-05-19T09:23:13.424940 #467798] INFO -- : [741/885] 508670=test_gem_request_connection_pools I, [2024-05-19T09:23:14.667267 #467798] INFO -- : [742/885] 508670=test_flags I, [2024-05-19T09:23:15.001799 #467798] INFO -- : [743/885] 508671=test_yamlstore I, [2024-05-19T09:23:15.023862 #467798] INFO -- : [744/885] 508671=test_bug-3571 I, [2024-05-19T09:23:15.036312 #467798] INFO -- : [745/885] 508671=test_numeric I, [2024-05-19T09:23:15.069188 #467798] INFO -- : [746/885] 508670=test_time I, [2024-05-19T09:23:15.109335 #467798] INFO -- : [747/885] 508671=test_file I, [2024-05-19T09:23:15.118088 #467798] INFO -- : [748/885] 508671=test_capacity I, [2024-05-19T09:23:15.132004 #467798] INFO -- : [749/885] 508671=test_nextafter I, [2024-05-19T09:23:15.167219 #467798] INFO -- : [750/885] 508670=test_gem_commands_owner_command I, [2024-05-19T09:23:15.223848 #467798] INFO -- : [751/885] 508671=test_gem_ext_cargo_builder I, [2024-05-19T09:23:15.262674 #467798] INFO -- : [752/885] 508671=test_proc I, [2024-05-19T09:23:15.850128 #467798] INFO -- : [753/885] 508670=test_console_attr I, [2024-05-19T09:23:15.876787 #467798] INFO -- : [754/885] 508670=test_gem_commands_unpack_command I, [2024-05-19T09:23:16.157178 #467798] INFO -- : [755/885] 508671=test_zlib I, [2024-05-19T09:23:16.235119 #467798] INFO -- : [756/885] 508670=test_rdoc_options I, [2024-05-19T09:23:16.509873 #467798] INFO -- : [757/885] 508670=test_ubf_async_safe I, [2024-05-19T09:23:16.522341 #467798] INFO -- : [758/885] 508670=test_pstore I, [2024-05-19T09:23:16.755812 #467798] INFO -- : [759/885] 508670=test_rdoc_include I, [2024-05-19T09:23:16.778713 #467798] INFO -- : [760/885] 508670=test_win32ole_record I, [2024-05-19T09:23:16.793684 #467798] INFO -- : [761/885] 508670=test_gem_version_option I, [2024-05-19T09:23:16.857114 #467798] INFO -- : [762/885] 508670=test_date_compat I, [2024-05-19T09:23:16.873033 #467798] INFO -- : [763/885] 508670=test_gem_package_tar_reader_entry I, [2024-05-19T09:23:17.176537 #467798] INFO -- : [764/885] 508670=test_resource I, [2024-05-19T09:23:17.217290 #467798] INFO -- : [765/885] 508670=test_gem_uri I, [2024-05-19T09:23:17.256483 #467798] INFO -- : [766/885] 508670=test_bug-5832 I, [2024-05-19T09:23:17.272427 #467798] INFO -- : [767/885] 508670=test_yield_block I, [2024-05-19T09:23:17.339495 #467798] INFO -- : [768/885] 508670=test_c_struct_builder I, [2024-05-19T09:23:17.629015 #467798] INFO -- : [769/885] 508670=test_path_to_class I, [2024-05-19T09:23:17.637191 #467798] INFO -- : [770/885] 508670=test_enumerator I, [2024-05-19T09:23:17.643154 #467798] INFO -- : [771/885] 508670=test_reqarg I, [2024-05-19T09:23:17.954596 #467798] INFO -- : [772/885] 508670=test_frozen_error I, [2024-05-19T09:23:18.281851 #467798] INFO -- : [773/885] 508670=test_gem_ext_ext_conf_builder I, [2024-05-19T09:23:19.073027 #467798] INFO -- : [774/885] 508670=test_spell_checker I, [2024-05-19T09:23:19.086706 #467798] INFO -- : [775/885] 508670=test_gem_version I, [2024-05-19T09:23:19.251574 #467798] INFO -- : [776/885] 508670=test_rdoc_markup_indented_paragraph I, [2024-05-19T09:23:19.264623 #467798] INFO -- : [777/885] 508670=test_rdoc_markup_parser I, [2024-05-19T09:23:19.321938 #467798] INFO -- : [778/885] 508670=test_iseq_load I, [2024-05-19T09:23:20.491018 #467798] INFO -- : [779/885] 508670=test_stream I, [2024-05-19T09:23:20.825062 #467798] INFO -- : [780/885] 508670=test_have_library I, [2024-05-19T09:23:21.355912 #467798] INFO -- : [781/885] 508670=test_ns_spki I, [2024-05-19T09:23:21.367004 #467798] INFO -- : [782/885] 508670=test_stringify_symbols I, [2024-05-19T09:23:21.370706 #467798] INFO -- : [783/885] 508670=test_require I, [2024-05-19T09:23:22.284081 #467798] INFO -- : [784/885] 508670=test_objspace I, [2024-05-19T09:23:27.687256 #467798] INFO -- : [785/885] 508671=test_rdoc_text I, [2024-05-19T09:23:27.727262 #467798] INFO -- : [786/885] 508671=library_symbols_test I, [2024-05-19T09:23:27.733137 #467798] INFO -- : [787/885] 508671=test_httpresponses I, [2024-05-19T09:23:27.743581 #467798] INFO -- : [788/885] 508671=test_deprecate I, [2024-05-19T09:23:27.800293 #467798] INFO -- : [789/885] 508671=test_rdoc_constant I, [2024-05-19T09:23:27.896839 #467798] INFO -- : [790/885] 508671=test_generic I, [2024-05-19T09:23:27.926735 #467798] INFO -- : [791/885] 508671=test_common I, [2024-05-19T09:23:28.098640 #467798] INFO -- : [792/885] 508671=test_rdoc_markup_to_html_snippet I, [2024-05-19T09:23:28.177726 #467798] INFO -- : [793/885] 508671=test_win32ole_variant_outarg I, [2024-05-19T09:23:28.190684 #467798] INFO -- : [794/885] 508671=test_rdoc_encoding I, [2024-05-19T09:23:28.248795 #467798] INFO -- : [795/885] 508671=test_key_actor_vi I, [2024-05-19T09:23:28.374457 #467798] INFO -- : [796/885] 508671=test_postponed_job I, [2024-05-19T09:23:28.664952 #467798] INFO -- : [797/885] 508671=test_gem_request_set_lockfile I, [2024-05-19T09:23:29.119774 #467798] INFO -- : [798/885] 508671=test_rdoc_markdown I, [2024-05-19T09:23:29.401497 #467798] INFO -- : [799/885] 508671=test_rdoc_code_object I, [2024-05-19T09:23:29.799678 #467798] INFO -- : [800/885] 508671=test_process I, [2024-05-19T09:23:48.100242 #467798] INFO -- : [801/885] 508671=test_bmethod I, [2024-05-19T09:23:48.105823 #467798] INFO -- : [802/885] 508671=test_euc_kr I, [2024-05-19T09:23:48.109318 #467798] INFO -- : [803/885] 508671=test_provider I, [2024-05-19T09:23:48.125346 #467798] INFO -- : [804/885] 508671=test_gem_source_specific_file I, [2024-05-19T09:23:48.220797 #467798] INFO -- : [805/885] 508671=redundant_return_test I, [2024-05-19T09:23:48.240338 #467798] INFO -- : [806/885] 508671=test_rand I, [2024-05-19T09:23:48.740412 #467798] INFO -- : [807/885] 508671=test_random_formatter I, [2024-05-19T09:23:48.761950 #467798] INFO -- : [808/885] 508671=test_string_processing I, [2024-05-19T09:23:48.769726 #467798] INFO -- : [809/885] 508671=test_rdoc_markup_attributes I, [2024-05-19T09:23:48.780094 #467798] INFO -- : [810/885] 508671=test_tsort I, [2024-05-19T09:23:48.809276 #467798] INFO -- : [811/885] 508671=test_gem_commands_fetch_command I, [2024-05-19T09:23:48.973525 #467798] INFO -- : [812/885] 508671=test_typeddata I, [2024-05-19T09:23:49.213700 #467798] INFO -- : [813/885] 508671=test_securerandom I, [2024-05-19T09:23:49.252189 #467798] INFO -- : [814/885] 508671=test_gem_commands_outdated_command I, [2024-05-19T09:23:49.295941 #467798] INFO -- : [815/885] 508671=test_gem_dependency_list I, [2024-05-19T09:23:49.380789 #467798] INFO -- : [816/885] 508671=parameters_signature_test I, [2024-05-19T09:23:49.396678 #467798] INFO -- : [817/885] 508671=test_rdoc_parser_changelog I, [2024-05-19T09:23:49.493861 #467798] INFO -- : [818/885] 508671=test_gem_doctor I, [2024-05-19T09:23:49.548123 #467798] INFO -- : [819/885] 508671=json_fixtures_test I, [2024-05-19T09:23:49.556387 #467798] INFO -- : [820/885] 508671=test_len I, [2024-05-19T09:23:49.573783 #467798] INFO -- : [821/885] 508671=test_rdoc_parser_c I, [2024-05-19T09:23:49.976816 #467798] INFO -- : [822/885] 508671=test_kwargs I, [2024-05-19T09:23:49.986912 #467798] INFO -- : [823/885] 508671=test_io_wait I, [2024-05-19T09:23:50.366795 #467798] INFO -- : [824/885] 508671=test_pack I, [2024-05-19T09:23:50.708653 #467798] INFO -- : [825/885] 508671=parse_test I, [2024-05-19T09:23:54.196479 #467798] INFO -- : [826/885] 508671=test_input_method I, [2024-05-19T09:23:54.243308 #467798] INFO -- : [827/885] 508671=test_io I, [2024-05-19T09:23:54.427966 #467798] INFO -- : [828/885] 508671=test_rdoc_i18n_text I, [2024-05-19T09:23:54.439967 #467798] INFO -- : [829/885] 508671=test_gem_unsatisfiable_dependency_error I, [2024-05-19T09:23:54.496691 #467798] INFO -- : [830/885] 508671=test_literal I, [2024-05-19T09:23:55.076474 #467798] INFO -- : [831/885] 508671=test_thread I, [2024-05-19T09:23:55.301255 #467798] INFO -- : [832/885] 508671=test_gem_security_signer I, [2024-05-19T09:23:55.404340 #467798] INFO -- : [833/885] 508671=test_complex2 I, [2024-05-19T09:23:55.416413 #467798] INFO -- : [834/885] 508671=test_config I, [2024-05-19T09:23:55.537909 #467798] INFO -- : [835/885] 508671=test_gem_util I, [2024-05-19T09:23:55.627186 #467798] INFO -- : [836/885] 508671=test_win32ole_typelib I, [2024-05-19T09:23:55.638326 #467798] INFO -- : [837/885] 508671=test_pkey I, [2024-05-19T09:23:55.653126 #467798] INFO -- : [838/885] 508671=test_external_new I, [2024-05-19T09:23:55.660013 #467798] INFO -- : [839/885] 508671=test_bigzero I, [2024-05-19T09:23:55.685391 #467798] INFO -- : [840/885] 508671=test_gem_commands_query_command I, [2024-05-19T09:23:56.395534 #467798] INFO -- : [841/885] 508671=test_gem_platform I, [2024-05-19T09:23:56.562666 #467798] INFO -- : [842/885] 508671=test_ractor I, [2024-05-19T09:23:56.568961 #467798] INFO -- : [843/885] 508671=test_null I, [2024-05-19T09:23:56.579299 #467798] INFO -- : [844/885] 508671=test_data I, [2024-05-19T09:23:56.591611 #467798] INFO -- : [845/885] 508671=test_memory_view I, [2024-05-19T09:23:56.613894 #467798] INFO -- : [846/885] 508671=test_multi_irb_commands I, [2024-05-19T09:23:56.622862 #467798] INFO -- : [847/885] 508671=test_pkey_dh I, [2024-05-19T09:23:58.034203 #467798] INFO -- : [848/885] 508671=test_m17n_comb I, [2024-05-19T09:24:01.055240 #467798] INFO -- : [849/885] 508671=test_singleton I, [2024-05-19T09:24:01.066929 #467798] INFO -- : [850/885] 508671=test_numeric I, [2024-05-19T09:24:01.068302 #467798] INFO -- : [851/885] 508671=test_fstring I, [2024-05-19T09:24:01.328682 #467798] INFO -- : [852/885] 508671=test_gem_ext_rake_builder I, [2024-05-19T09:24:01.863310 #467798] INFO -- : [853/885] 508671=test_rdoc_require I, [2024-05-19T09:24:01.868775 #467798] INFO -- : [854/885] 508671=test_word I, [2024-05-19T09:24:01.888423 #467798] INFO -- : [855/885] 508671=test_timeout I, [2024-05-19T09:24:02.804725 #467798] INFO -- : [856/885] 508671=test_rdoc_markup_raw I, [2024-05-19T09:24:02.813762 #467798] INFO -- : [857/885] 508671=test_key_name_check I, [2024-05-19T09:24:02.826177 #467798] INFO -- : [858/885] 508671=test_rdoc_markup_to_bs I, [2024-05-19T09:24:02.873412 #467798] INFO -- : [859/885] 508671=test_weakref I, [2024-05-19T09:24:06.258390 #467798] INFO -- : [860/885] 508671=test_instrumentation_api I, [2024-05-19T09:24:06.282152 #467798] INFO -- : [861/885] 508671=test_rdoc_alias I, [2024-05-19T09:24:06.304085 #467798] INFO -- : [862/885] 508671=test_gem_commands_stale_command I, [2024-05-19T09:24:06.310117 #467798] INFO -- : [863/885] 508671=ruby_parser_test I, [2024-05-19T09:24:06.319386 #467798] INFO -- : [864/885] 508671=test_rdoc_markup_to_tt_only I, [2024-05-19T09:24:06.366797 #467798] INFO -- : [865/885] 508671=test_ws I, [2024-05-19T09:24:06.382803 #467798] INFO -- : [866/885] 508671=json_parser_test I, [2024-05-19T09:24:06.523963 #467798] INFO -- : [867/885] 508671=test_date_strftime I, [2024-05-19T09:24:06.698343 #467798] INFO -- : [868/885] 508669=test_gem_commands_cert_command I, [2024-05-19T09:24:06.897037 #467798] INFO -- : [869/885] 508671=test_class_name_check I, [2024-05-19T09:24:07.030880 #467798] INFO -- : [870/885] 508671=test_scalar I, [2024-05-19T09:24:07.057086 #467798] INFO -- : [871/885] 508671=test_syntax I, [2024-05-19T09:24:08.318533 #467798] INFO -- : [872/885] 508669=test_zsh_completion I, [2024-05-19T09:24:08.330984 #467798] INFO -- : [873/885] 508669=test_basicsocket I, [2024-05-19T09:24:08.358489 #467798] INFO -- : [874/885] 508669=test_pkcs7 I, [2024-05-19T09:24:08.528575 #467798] INFO -- : [875/885] 508669=test_gem_commands_environment_command I, [2024-05-19T09:24:08.588656 #467798] INFO -- : [876/885] 508669=test_pack I, [2024-05-19T09:24:08.779736 #467798] INFO -- : [877/885] 508669=test_io_buffer I, [2024-05-19T09:24:08.902409 #467798] INFO -- : [878/885] 508669=test_rdoc_context_section I, [2024-05-19T09:24:08.920540 #467798] INFO -- : [879/885] 508669=test_deprecated I, [2024-05-19T09:24:08.922323 #467798] INFO -- : [880/885] 508669=test_optparse I, [2024-05-19T09:24:09.265098 #467798] INFO -- : [881/885] 508669=test_exception I, [2024-05-19T09:24:11.598454 #467798] INFO -- : [882/885] 508670=test_bash_completion I, [2024-05-19T09:24:11.620215 #467798] INFO -- : [883/885] 508670=test_rdoc_markup_to_html_crossref I, [2024-05-19T09:24:11.885365 #467798] INFO -- : [884/885] 508670=test_div I, [2024-05-19T09:24:12.379178 #467798] INFO -- : [885/885] 508670=test_files_test_2 I, [2024-05-19T09:24:16.829241 #467798] INFO -- : Finished tests in 221.250829s, 118.8832 tests/s, 42264.3253 assertions/s. I, [2024-05-19T09:24:16.833916 #467798] INFO -- : 26303 tests, 9351017 assertions, 0 failures, 0 errors, 320 skips I, [2024-05-19T09:24:16.833952 #467798] INFO -- : I, [2024-05-19T09:24:16.833964 #467798] INFO -- : ruby -v: ruby 3.4.0dev (2024-05-19T03:08:35Z master 7afc16aa48) [aarch64-linux] I, [2024-05-19T09:24:16.834747 #467798] INFO -- : $$$[end] "make yes-test-all TESTOPTS='--stderr-on-failure' TESTS='-j3'" exit with 0. I, [2024-05-19T09:24:16.834904 #467798] INFO -- : $$$[beg] make yes-test-rubyspec MSPECOPT='--error-output stderr --debug -j' TESTS='-j3' I, [2024-05-19T09:24:16.959948 #467798] INFO -- : BASERUBY = /usr/local/bin/ruby --disable=gems I, [2024-05-19T09:24:16.960021 #467798] INFO -- : CC = gcc I, [2024-05-19T09:24:16.960032 #467798] INFO -- : LD = ld I, [2024-05-19T09:24:16.960041 #467798] INFO -- : LDSHARED = gcc -shared I, [2024-05-19T09:24:16.960053 #467798] INFO -- : CFLAGS = -O3 -fno-fast-math -ggdb3 -Wall -Wextra -Wdeprecated-declarations -Wdiv-by-zero -Wduplicated-cond -Wimplicit-function-declaration -Wimplicit-int -Wpointer-arith -Wwrite-strings -Wold-style-definition -Wimplicit-fallthrough=0 -Wmissing-noreturn -Wno-cast-function-type -Wno-constant-logical-operand -Wno-long-long -Wno-missing-field-initializers -Wno-overlength-strings -Wno-packed-bitfield-compat -Wno-parentheses-equality -Wno-self-assign -Wno-tautological-compare -Wno-unused-parameter -Wno-unused-value -Wsuggest-attribute=format -Wsuggest-attribute=noreturn -Wunused-variable -Wmisleading-indentation -Wundef I, [2024-05-19T09:24:16.960063 #467798] INFO -- : XCFLAGS = -U_FORTIFY_SOURCE -D_FORTIFY_SOURCE=2 -fstack-protector-strong -msign-return-address=all -fno-strict-overflow -fvisibility=hidden -fexcess-precision=standard -DRUBY_EXPORT -fPIE -I. -I.ext/include/aarch64-linux -I/home/opc/ruby/src/master/include -I/home/opc/ruby/src/master -I/home/opc/ruby/src/master/prism -I/home/opc/ruby/src/master/enc/unicode/15.0.0 I, [2024-05-19T09:24:16.960072 #467798] INFO -- : CPPFLAGS = I, [2024-05-19T09:24:16.960080 #467798] INFO -- : DLDFLAGS = -Wl,--compress-debug-sections=zlib -fstack-protector-strong -pie I, [2024-05-19T09:24:16.960089 #467798] INFO -- : SOLIBS = -lz -lrt -lrt -ldl -lcrypt -lm -lpthread I, [2024-05-19T09:24:16.960098 #467798] INFO -- : LANG = en_US.UTF-8 I, [2024-05-19T09:24:16.960106 #467798] INFO -- : LC_ALL = I, [2024-05-19T09:24:16.960114 #467798] INFO -- : LC_CTYPE = I, [2024-05-19T09:24:16.960122 #467798] INFO -- : MFLAGS = I, [2024-05-19T09:24:16.960130 #467798] INFO -- : RUSTC = rustc I, [2024-05-19T09:24:16.960139 #467798] INFO -- : YJIT_RUSTC_ARGS = --crate-name=yjit --crate-type=staticlib --edition=2021 -g -C lto=thin -C opt-level=3 -C overflow-checks=on '--out-dir=/home/opc/ruby/build/master/yjit/target/release/' /home/opc/ruby/src/master/yjit/src/lib.rs I, [2024-05-19T09:24:16.960928 #467798] INFO -- : gcc (GCC) 8.5.0 20210514 (Red Hat 8.5.0-10.1.0.1) I, [2024-05-19T09:24:16.960971 #467798] INFO -- : Copyright (C) 2018 Free Software Foundation, Inc. I, [2024-05-19T09:24:16.960982 #467798] INFO -- : This is free software; see the source for copying conditions. There is NO I, [2024-05-19T09:24:16.960992 #467798] INFO -- : warranty; not even for MERCHANTABILITY or FITNESS FOR A PARTICULAR PURPOSE. I, [2024-05-19T09:24:16.961000 #467798] INFO -- : I, [2024-05-19T09:24:16.962957 #467798] INFO -- : generating enc.mk I, [2024-05-19T09:24:17.194655 #467798] INFO -- : generating encdb.h I, [2024-05-19T09:24:17.231881 #467798] INFO -- : encdb.h unchanged I, [2024-05-19T09:24:17.233173 #467798] INFO -- : making enc I, [2024-05-19T09:24:17.260766 #467798] INFO -- : make[1]: Entering directory '/home/opc/ruby/build/master' I, [2024-05-19T09:24:17.260804 #467798] INFO -- : make[1]: Nothing to be done for 'enc'. I, [2024-05-19T09:24:17.260815 #467798] INFO -- : make[1]: Leaving directory '/home/opc/ruby/build/master' I, [2024-05-19T09:24:17.261563 #467798] INFO -- : making srcs under enc I, [2024-05-19T09:24:17.303933 #467798] INFO -- : make[1]: Entering directory '/home/opc/ruby/build/master' I, [2024-05-19T09:24:17.304016 #467798] INFO -- : make[1]: Nothing to be done for 'srcs'. I, [2024-05-19T09:24:17.304036 #467798] INFO -- : make[1]: Leaving directory '/home/opc/ruby/build/master' I, [2024-05-19T09:24:17.305012 #467798] INFO -- : generating transdb.h I, [2024-05-19T09:24:17.450067 #467798] INFO -- : transdb.h unchanged I, [2024-05-19T09:24:17.451340 #467798] INFO -- : making trans I, [2024-05-19T09:24:17.500304 #467798] INFO -- : make[1]: Entering directory '/home/opc/ruby/build/master' I, [2024-05-19T09:24:17.500383 #467798] INFO -- : make[1]: Nothing to be done for 'trans'. I, [2024-05-19T09:24:17.500402 #467798] INFO -- : make[1]: Leaving directory '/home/opc/ruby/build/master' I, [2024-05-19T09:24:17.501085 #467798] INFO -- : making encs I, [2024-05-19T09:24:17.554211 #467798] INFO -- : make[1]: Entering directory '/home/opc/ruby/build/master' I, [2024-05-19T09:24:17.554279 #467798] INFO -- : make[1]: Nothing to be done for 'encs'. I, [2024-05-19T09:24:17.554482 #467798] INFO -- : make[1]: Leaving directory '/home/opc/ruby/build/master' I, [2024-05-19T09:24:17.556185 #467798] INFO -- : generating makefiles ext/configure-ext.mk I, [2024-05-19T09:24:17.596542 #467798] INFO -- : ext/configure-ext.mk updated I, [2024-05-19T09:24:17.599723 #467798] INFO -- : make[1]: Entering directory '/home/opc/ruby/build/master' I, [2024-05-19T09:24:19.652185 #467798] INFO -- : make[1]: Leaving directory '/home/opc/ruby/build/master' I, [2024-05-19T09:24:19.652881 #467798] INFO -- : generating makefile exts.mk I, [2024-05-19T09:24:19.712848 #467798] INFO -- : exts.mk unchanged I, [2024-05-19T09:24:19.717910 #467798] INFO -- : make[1]: Entering directory '/home/opc/ruby/build/master' I, [2024-05-19T09:24:20.015198 #467798] INFO -- : make[2]: Entering directory '/home/opc/ruby/build/master/ext/coverage' I, [2024-05-19T09:24:20.019831 #467798] INFO -- : make[2]: Leaving directory '/home/opc/ruby/build/master/ext/coverage' I, [2024-05-19T09:24:20.025299 #467798] INFO -- : make[2]: Entering directory '/home/opc/ruby/build/master/ext/date' I, [2024-05-19T09:24:20.030560 #467798] INFO -- : make[2]: Leaving directory '/home/opc/ruby/build/master/ext/date' I, [2024-05-19T09:24:20.033949 #467798] INFO -- : make[2]: Entering directory '/home/opc/ruby/build/master/ext/digest' I, [2024-05-19T09:24:20.042780 #467798] INFO -- : make[2]: Leaving directory '/home/opc/ruby/build/master/ext/digest' I, [2024-05-19T09:24:20.065103 #467798] INFO -- : make[2]: Entering directory '/home/opc/ruby/build/master/ext/digest/sha2' I, [2024-05-19T09:24:20.069994 #467798] INFO -- : make[2]: Leaving directory '/home/opc/ruby/build/master/ext/digest/sha2' I, [2024-05-19T09:24:20.087866 #467798] INFO -- : make[2]: Entering directory '/home/opc/ruby/build/master/ext/fiddle' I, [2024-05-19T09:24:20.098072 #467798] INFO -- : make[2]: Leaving directory '/home/opc/ruby/build/master/ext/fiddle' I, [2024-05-19T09:24:20.102407 #467798] INFO -- : make[2]: Entering directory '/home/opc/ruby/build/master/ext/io/console' I, [2024-05-19T09:24:20.106620 #467798] INFO -- : make[2]: Leaving directory '/home/opc/ruby/build/master/ext/io/console' I, [2024-05-19T09:24:20.117347 #467798] INFO -- : make[2]: Entering directory '/home/opc/ruby/build/master/ext/json' I, [2024-05-19T09:24:20.126700 #467798] INFO -- : make[2]: Leaving directory '/home/opc/ruby/build/master/ext/json' I, [2024-05-19T09:24:20.139660 #467798] INFO -- : make[2]: Entering directory '/home/opc/ruby/build/master/ext/monitor' I, [2024-05-19T09:24:20.143719 #467798] INFO -- : make[2]: Leaving directory '/home/opc/ruby/build/master/ext/monitor' I, [2024-05-19T09:24:20.149748 #467798] INFO -- : make[2]: Entering directory '/home/opc/ruby/build/master/ext/objspace' I, [2024-05-19T09:24:20.155552 #467798] INFO -- : make[2]: Leaving directory '/home/opc/ruby/build/master/ext/objspace' I, [2024-05-19T09:24:20.174742 #467798] INFO -- : make[2]: Entering directory '/home/opc/ruby/build/master/ext/openssl' I, [2024-05-19T09:24:20.196332 #467798] INFO -- : make[2]: Leaving directory '/home/opc/ruby/build/master/ext/openssl' I, [2024-05-19T09:24:20.200648 #467798] INFO -- : make[2]: Entering directory '/home/opc/ruby/build/master/ext/pathname' I, [2024-05-19T09:24:20.204878 #467798] INFO -- : make[2]: Leaving directory '/home/opc/ruby/build/master/ext/pathname' I, [2024-05-19T09:24:20.211572 #467798] INFO -- : make[2]: Entering directory '/home/opc/ruby/build/master/ext/psych' I, [2024-05-19T09:24:20.233156 #467798] INFO -- : make[2]: Leaving directory '/home/opc/ruby/build/master/ext/psych' I, [2024-05-19T09:24:20.237577 #467798] INFO -- : make[2]: Entering directory '/home/opc/ruby/build/master/ext/pty' I, [2024-05-19T09:24:20.241706 #467798] INFO -- : make[2]: Leaving directory '/home/opc/ruby/build/master/ext/pty' I, [2024-05-19T09:24:20.255061 #467798] INFO -- : make[2]: Entering directory '/home/opc/ruby/build/master/ext/ripper' I, [2024-05-19T09:24:20.262741 #467798] INFO -- : make[2]: Leaving directory '/home/opc/ruby/build/master/ext/ripper' I, [2024-05-19T09:24:20.264666 #467798] INFO -- : make[2]: Entering directory '/home/opc/ruby/build/master/ext/rubyvm' I, [2024-05-19T09:24:20.268000 #467798] INFO -- : make[2]: Leaving directory '/home/opc/ruby/build/master/ext/rubyvm' I, [2024-05-19T09:24:20.279907 #467798] INFO -- : make[2]: Entering directory '/home/opc/ruby/build/master/ext/socket' I, [2024-05-19T09:24:20.290511 #467798] INFO -- : make[2]: Leaving directory '/home/opc/ruby/build/master/ext/socket' I, [2024-05-19T09:24:20.305713 #467798] INFO -- : make[2]: Entering directory '/home/opc/ruby/build/master/.bundle/gems/bigdecimal-3.1.7/ext/bigdecimal' I, [2024-05-19T09:24:20.337732 #467798] INFO -- : make[2]: Leaving directory '/home/opc/ruby/build/master/.bundle/gems/bigdecimal-3.1.7/ext/bigdecimal' I, [2024-05-19T09:24:20.340356 #467798] INFO -- : make[2]: Entering directory '/home/opc/ruby/build/master/.bundle/gems/bigdecimal-3.1.8/ext/bigdecimal' I, [2024-05-19T09:24:20.370900 #467798] INFO -- : make[2]: Leaving directory '/home/opc/ruby/build/master/.bundle/gems/bigdecimal-3.1.8/ext/bigdecimal' I, [2024-05-19T09:24:20.373461 #467798] INFO -- : make[2]: Entering directory '/home/opc/ruby/build/master/.bundle/gems/debug-1.9.2/ext/debug' I, [2024-05-19T09:24:20.403361 #467798] INFO -- : make[2]: Leaving directory '/home/opc/ruby/build/master/.bundle/gems/debug-1.9.2/ext/debug' I, [2024-05-19T09:24:20.406036 #467798] INFO -- : make[2]: Entering directory '/home/opc/ruby/build/master/.bundle/gems/nkf-0.2.0/ext/nkf' I, [2024-05-19T09:24:20.436481 #467798] INFO -- : make[2]: Leaving directory '/home/opc/ruby/build/master/.bundle/gems/nkf-0.2.0/ext/nkf' I, [2024-05-19T09:24:20.439213 #467798] INFO -- : make[2]: Entering directory '/home/opc/ruby/build/master/.bundle/gems/racc-1.7.3/ext/racc/cparse' I, [2024-05-19T09:24:20.470109 #467798] INFO -- : make[2]: Leaving directory '/home/opc/ruby/build/master/.bundle/gems/racc-1.7.3/ext/racc/cparse' I, [2024-05-19T09:24:20.473002 #467798] INFO -- : make[2]: Entering directory '/home/opc/ruby/build/master/.bundle/gems/rbs-3.4.4/ext/rbs_extension' I, [2024-05-19T09:24:20.503318 #467798] INFO -- : make[2]: Leaving directory '/home/opc/ruby/build/master/.bundle/gems/rbs-3.4.4/ext/rbs_extension' I, [2024-05-19T09:24:20.505838 #467798] INFO -- : make[2]: Entering directory '/home/opc/ruby/build/master/.bundle/gems/syslog-0.1.2/ext/syslog' I, [2024-05-19T09:24:20.535975 #467798] INFO -- : make[2]: Leaving directory '/home/opc/ruby/build/master/.bundle/gems/syslog-0.1.2/ext/syslog' I, [2024-05-19T09:24:20.575256 #467798] INFO -- : make[2]: Entering directory '/home/opc/ruby/build/master' I, [2024-05-19T09:24:20.658337 #467798] INFO -- : make[2]: 'ruby' is up to date. I, [2024-05-19T09:24:20.658434 #467798] INFO -- : make[2]: Leaving directory '/home/opc/ruby/build/master' I, [2024-05-19T09:24:20.658517 #467798] INFO -- : make[1]: Leaving directory '/home/opc/ruby/build/master' I, [2024-05-19T09:24:20.662875 #467798] INFO -- : make[1]: Entering directory '/home/opc/ruby/build/master' I, [2024-05-19T09:24:20.662914 #467798] INFO -- : make[1]: Nothing to be done for 'note'. I, [2024-05-19T09:24:20.662933 #467798] INFO -- : make[1]: Leaving directory '/home/opc/ruby/build/master' E, [2024-05-19T09:24:20.740675 #467798] ERROR -- : $ /home/opc/ruby/build/master/miniruby -I/home/opc/ruby/src/master/lib /home/opc/ruby/src/master/tool/runruby.rb --archdir=/home/opc/ruby/build/master --extout=.ext -- /home/opc/ruby/src/master/spec/mspec/bin/mspec-run -B /home/opc/ruby/src/master/spec/default.mspec --error-output stderr --debug -fy -o /tmp/rubytest.s5ftna/1-mspec-multi-0 E, [2024-05-19T09:24:20.741016 #467798] ERROR -- : $ /home/opc/ruby/build/master/miniruby -I/home/opc/ruby/src/master/lib /home/opc/ruby/src/master/tool/runruby.rb --archdir=/home/opc/ruby/build/master --extout=.ext -- /home/opc/ruby/src/master/spec/mspec/bin/mspec-run -B /home/opc/ruby/src/master/spec/default.mspec --error-output stderr --debug -fy -o /tmp/rubytest.s5ftna/2-mspec-multi-1 E, [2024-05-19T09:24:20.741307 #467798] ERROR -- : $ /home/opc/ruby/build/master/miniruby -I/home/opc/ruby/src/master/lib /home/opc/ruby/src/master/tool/runruby.rb --archdir=/home/opc/ruby/build/master --extout=.ext -- /home/opc/ruby/src/master/spec/mspec/bin/mspec-run -B /home/opc/ruby/src/master/spec/default.mspec --error-output stderr --debug -fy -o /tmp/rubytest.s5ftna/3-mspec-multi-2 I, [2024-05-19T09:24:20.874418 #467798] INFO -- : ruby 3.4.0dev (2024-05-19T03:08:35Z master 7afc16aa48) [aarch64-linux] I, [2024-05-19T09:24:26.394666 #467798] INFO -- : 0 ......................................................................... I, [2024-05-19T09:24:28.724114 #467798] INFO -- : 73 ......................................................................... I, [2024-05-19T09:24:28.901841 #467798] INFO -- : 146 ......................................................................... I, [2024-05-19T09:24:29.198966 #467798] INFO -- : 219 ......................................................................... I, [2024-05-19T09:24:29.356666 #467798] INFO -- : 292 ......................................................................... I, [2024-05-19T09:24:29.585426 #467798] INFO -- : 365 ......................................................................... I, [2024-05-19T09:24:29.707346 #467798] INFO -- : 438 ......................................................................... I, [2024-05-19T09:24:29.765714 #467798] INFO -- : 511 ......................................................................... I, [2024-05-19T09:24:29.825272 #467798] INFO -- : 584 ......................................................................... I, [2024-05-19T09:24:30.419380 #467798] INFO -- : 657 ......................................................................... I, [2024-05-19T09:24:30.540308 #467798] INFO -- : 730 ......................................................................... I, [2024-05-19T09:24:30.588446 #467798] INFO -- : 803 ......................................................................... I, [2024-05-19T09:24:30.780285 #467798] INFO -- : 876 ......................................................................... I, [2024-05-19T09:24:30.891387 #467798] INFO -- : 949 ......................................................................... I, [2024-05-19T09:24:31.471815 #467798] INFO -- : 1022 ......................................................................... I, [2024-05-19T09:24:33.793176 #467798] INFO -- : 1095 ......................................................................... I, [2024-05-19T09:24:34.599155 #467798] INFO -- : 1168 ......................................................................... I, [2024-05-19T09:24:34.779579 #467798] INFO -- : 1241 ......................................................................... I, [2024-05-19T09:24:34.989489 #467798] INFO -- : 1314 ......................................................................... I, [2024-05-19T09:24:35.084392 #467798] INFO -- : 1387 ......................................................................... I, [2024-05-19T09:24:37.109837 #467798] INFO -- : 1460 ......................................................................... I, [2024-05-19T09:24:40.342013 #467798] INFO -- : 1533 ......................................................................... I, [2024-05-19T09:24:40.492061 #467798] INFO -- : 1606 ......................................................................... I, [2024-05-19T09:24:41.304837 #467798] INFO -- : 1679 ......................................................................... I, [2024-05-19T09:24:41.627561 #467798] INFO -- : 1752 ......................................................................... I, [2024-05-19T09:24:42.010055 #467798] INFO -- : 1825 ......................................................................... I, [2024-05-19T09:24:42.315119 #467798] INFO -- : 1898 ......................................................................... I, [2024-05-19T09:24:42.720575 #467798] INFO -- : 1971 ......................................................................... I, [2024-05-19T09:24:43.227189 #467798] INFO -- : 2044 ......................................................................... I, [2024-05-19T09:24:43.331730 #467798] INFO -- : 2117 ......................................................................... I, [2024-05-19T09:24:43.395417 #467798] INFO -- : 2190 ......................................................................... I, [2024-05-19T09:24:43.443892 #467798] INFO -- : 2263 ......................................................................... I, [2024-05-19T09:24:43.491878 #467798] INFO -- : 2336 ......................................................................... I, [2024-05-19T09:24:43.577450 #467798] INFO -- : 2409 ......................................................................... I, [2024-05-19T09:24:43.841440 #467798] INFO -- : 2482 ......................................................................... I, [2024-05-19T09:24:43.975914 #467798] INFO -- : 2555 ......................................................................... I, [2024-05-19T09:24:45.247214 #467798] INFO -- : 2628 ......................................................................... I, [2024-05-19T09:24:45.527170 #467798] INFO -- : 2701 ......................................................................... I, [2024-05-19T09:24:45.721662 #467798] INFO -- : 2774 ......................................................................... I, [2024-05-19T09:24:46.029790 #467798] INFO -- : 2847 ......................................................................... I, [2024-05-19T09:24:46.295944 #467798] INFO -- : 2920 ......................................................................... I, [2024-05-19T09:24:46.406389 #467798] INFO -- : 2993 ......................................................................... I, [2024-05-19T09:24:46.471889 #467798] INFO -- : 3066 ......................................................................... I, [2024-05-19T09:24:46.510681 #467798] INFO -- : 3139 ......................................................................... I, [2024-05-19T09:24:46.570502 #467798] INFO -- : 3212 ......................................................................... I, [2024-05-19T09:24:46.637635 #467798] INFO -- : 3285 ......................................................................... I, [2024-05-19T09:24:50.476983 #467798] INFO -- : 3358 ......................................................................... I, [2024-05-19T09:24:50.499898 #467798] INFO -- : I, [2024-05-19T09:24:50.499957 #467798] INFO -- : I, [2024-05-19T09:24:50.499967 #467798] INFO -- : Finished in 29.759140 seconds I, [2024-05-19T09:24:50.499976 #467798] INFO -- : I, [2024-05-19T09:24:50.499984 #467798] INFO -- : 3430 files, 32648 examples, 182979 expectations, 0 failures, 0 errors, 0 tagged I, [2024-05-19T09:24:50.501307 #467798] INFO -- : $$$[end] "make yes-test-rubyspec MSPECOPT='--error-output stderr --debug -j' TESTS='-j3'" exit with 0.