# Logfile created on 2024-05-18 15:44:26 +0000 by logger.rb/v1.5.3 I, [2024-05-18T15:44:26.303904 #543288] INFO -- : #, @formatter=nil, @logdev=#, @binmode=false, @mon_data=#, @mon_data_owner_object_id=860>>> I, [2024-05-18T15:44:26.304205 #543288] INFO -- : $$$[beg] make update-unicode -j3 I, [2024-05-18T15:44:26.394001 #543288] INFO -- : Downloading Unicode emoji 15.0 files... I, [2024-05-18T15:44:26.394245 #543288] INFO -- : Downloading Unicode emoji 15.0 files... I, [2024-05-18T15:44:26.394607 #543288] INFO -- : Downloading Unicode emoji 15.0 files... I, [2024-05-18T15:44:26.470710 #543288] INFO -- : made symlink emoji/15.0/emoji-sequences.txt to /home/opc/ruby/src/master/.downloaded-cache/emoji/15.0/emoji-sequences.txt I, [2024-05-18T15:44:26.474312 #543288] INFO -- : downloading emoji/15.0/emoji-test.txt ... /home/opc/ruby/src/master/enc/unicode/data/emoji/15.0/emoji-sequences.txt already exists I, [2024-05-18T15:44:26.474765 #543288] INFO -- : downloading emoji/15.0/emoji-test.txt ... /home/opc/ruby/src/master/enc/unicode/data/emoji/15.0/emoji-sequences.txt already exists E, [2024-05-18T15:44:26.928132 #543288] ERROR -- : /home/opc/ruby/src/master/tool/downloader.rb:302:in `rescue in download': failed to download emoji/15.0/emoji-test.txt (RuntimeError) E, [2024-05-18T15:44:26.928197 #543288] ERROR -- : OpenURI::HTTPError: 403 Forbidden: https://www.unicode.org/Public/emoji/15.0/emoji-test.txt E, [2024-05-18T15:44:26.928208 #543288] ERROR -- : from /home/opc/ruby/src/master/tool/downloader.rb:201:in `download' E, [2024-05-18T15:44:26.928219 #543288] ERROR -- : from /home/opc/ruby/src/master/tool/downloader.rb:136:in `download' E, [2024-05-18T15:44:26.928227 #543288] ERROR -- : from /home/opc/ruby/src/master/tool/downloader.rb:482:in `block in
' E, [2024-05-18T15:44:26.928236 #543288] ERROR -- : from /home/opc/ruby/src/master/tool/downloader.rb:465:in `each' E, [2024-05-18T15:44:26.928245 #543288] ERROR -- : from /home/opc/ruby/src/master/tool/downloader.rb:465:in `
' E, [2024-05-18T15:44:26.928253 #543288] ERROR -- : /usr/local/lib/ruby/3.2.0/open-uri.rb:369:in `open_http': 403 Forbidden (OpenURI::HTTPError) E, [2024-05-18T15:44:26.928262 #543288] ERROR -- : from /usr/local/lib/ruby/3.2.0/open-uri.rb:760:in `buffer_open' E, [2024-05-18T15:44:26.928271 #543288] ERROR -- : from /usr/local/lib/ruby/3.2.0/open-uri.rb:214:in `block in open_loop' E, [2024-05-18T15:44:26.928279 #543288] ERROR -- : from /usr/local/lib/ruby/3.2.0/open-uri.rb:212:in `catch' E, [2024-05-18T15:44:26.928288 #543288] ERROR -- : from /usr/local/lib/ruby/3.2.0/open-uri.rb:212:in `open_loop' E, [2024-05-18T15:44:26.928297 #543288] ERROR -- : from /usr/local/lib/ruby/3.2.0/open-uri.rb:153:in `open_uri' E, [2024-05-18T15:44:26.928305 #543288] ERROR -- : from /usr/local/lib/ruby/3.2.0/open-uri.rb:740:in `open' E, [2024-05-18T15:44:26.928316 #543288] ERROR -- : from /usr/local/lib/ruby/3.2.0/open-uri.rb:748:in `read' E, [2024-05-18T15:44:26.928325 #543288] ERROR -- : from /home/opc/ruby/src/master/tool/downloader.rb:247:in `block in download' E, [2024-05-18T15:44:26.928334 #543288] ERROR -- : from /home/opc/ruby/src/master/tool/downloader.rb:378:in `with_retry' E, [2024-05-18T15:44:26.928342 #543288] ERROR -- : from /home/opc/ruby/src/master/tool/downloader.rb:246:in `download' E, [2024-05-18T15:44:26.928351 #543288] ERROR -- : from /home/opc/ruby/src/master/tool/downloader.rb:136:in `download' E, [2024-05-18T15:44:26.928359 #543288] ERROR -- : from /home/opc/ruby/src/master/tool/downloader.rb:482:in `block in
' E, [2024-05-18T15:44:26.928368 #543288] ERROR -- : from /home/opc/ruby/src/master/tool/downloader.rb:465:in `each' E, [2024-05-18T15:44:26.928377 #543288] ERROR -- : from /home/opc/ruby/src/master/tool/downloader.rb:465:in `
' E, [2024-05-18T15:44:26.931306 #543288] ERROR -- : make: *** [uncommon.mk:1765: /home/opc/ruby/src/master/enc/unicode/data/emoji/15.0/emoji-zwj-sequences.txt] Error 1 E, [2024-05-18T15:44:26.931344 #543288] ERROR -- : make: *** Waiting for unfinished jobs.... E, [2024-05-18T15:44:26.938463 #543288] ERROR -- : /home/opc/ruby/src/master/tool/downloader.rb:302:in `rescue in download': failed to download emoji/15.0/emoji-test.txt (RuntimeError) E, [2024-05-18T15:44:26.938501 #543288] ERROR -- : OpenURI::HTTPError: 403 Forbidden: https://www.unicode.org/Public/emoji/15.0/emoji-test.txt E, [2024-05-18T15:44:26.938511 #543288] ERROR -- : from /home/opc/ruby/src/master/tool/downloader.rb:201:in `download' E, [2024-05-18T15:44:26.938520 #543288] ERROR -- : from /home/opc/ruby/src/master/tool/downloader.rb:136:in `download' E, [2024-05-18T15:44:26.938530 #543288] ERROR -- : from /home/opc/ruby/src/master/tool/downloader.rb:482:in `block in
' E, [2024-05-18T15:44:26.938538 #543288] ERROR -- : from /home/opc/ruby/src/master/tool/downloader.rb:465:in `each' E, [2024-05-18T15:44:26.938547 #543288] ERROR -- : from /home/opc/ruby/src/master/tool/downloader.rb:465:in `
' E, [2024-05-18T15:44:26.938555 #543288] ERROR -- : /usr/local/lib/ruby/3.2.0/open-uri.rb:369:in `open_http': 403 Forbidden (OpenURI::HTTPError) E, [2024-05-18T15:44:26.938563 #543288] ERROR -- : from /usr/local/lib/ruby/3.2.0/open-uri.rb:760:in `buffer_open' E, [2024-05-18T15:44:26.938572 #543288] ERROR -- : from /usr/local/lib/ruby/3.2.0/open-uri.rb:214:in `block in open_loop' E, [2024-05-18T15:44:26.938580 #543288] ERROR -- : from /usr/local/lib/ruby/3.2.0/open-uri.rb:212:in `catch' E, [2024-05-18T15:44:26.938588 #543288] ERROR -- : from /usr/local/lib/ruby/3.2.0/open-uri.rb:212:in `open_loop' E, [2024-05-18T15:44:26.938597 #543288] ERROR -- : from /usr/local/lib/ruby/3.2.0/open-uri.rb:153:in `open_uri' E, [2024-05-18T15:44:26.938606 #543288] ERROR -- : from /usr/local/lib/ruby/3.2.0/open-uri.rb:740:in `open' E, [2024-05-18T15:44:26.938614 #543288] ERROR -- : from /usr/local/lib/ruby/3.2.0/open-uri.rb:748:in `read' E, [2024-05-18T15:44:26.938622 #543288] ERROR -- : from /home/opc/ruby/src/master/tool/downloader.rb:247:in `block in download' E, [2024-05-18T15:44:26.938631 #543288] ERROR -- : from /home/opc/ruby/src/master/tool/downloader.rb:378:in `with_retry' E, [2024-05-18T15:44:26.938640 #543288] ERROR -- : from /home/opc/ruby/src/master/tool/downloader.rb:246:in `download' E, [2024-05-18T15:44:26.938648 #543288] ERROR -- : from /home/opc/ruby/src/master/tool/downloader.rb:136:in `download' E, [2024-05-18T15:44:26.938657 #543288] ERROR -- : from /home/opc/ruby/src/master/tool/downloader.rb:482:in `block in
' E, [2024-05-18T15:44:26.938666 #543288] ERROR -- : from /home/opc/ruby/src/master/tool/downloader.rb:465:in `each' E, [2024-05-18T15:44:26.938674 #543288] ERROR -- : from /home/opc/ruby/src/master/tool/downloader.rb:465:in `
' E, [2024-05-18T15:44:26.941478 #543288] ERROR -- : make: *** [uncommon.mk:1765: /home/opc/ruby/src/master/enc/unicode/data/emoji/15.0/emoji-test.txt] Error 1 E, [2024-05-18T15:44:26.996172 #543288] ERROR -- : /home/opc/ruby/src/master/tool/downloader.rb:302:in `rescue in download': failed to download emoji/15.0/emoji-test.txt (RuntimeError) E, [2024-05-18T15:44:26.996231 #543288] ERROR -- : OpenURI::HTTPError: 403 Forbidden: https://www.unicode.org/Public/emoji/15.0/emoji-test.txt E, [2024-05-18T15:44:26.996243 #543288] ERROR -- : from /home/opc/ruby/src/master/tool/downloader.rb:201:in `download' E, [2024-05-18T15:44:26.996253 #543288] ERROR -- : from /home/opc/ruby/src/master/tool/downloader.rb:136:in `download' E, [2024-05-18T15:44:26.996262 #543288] ERROR -- : from /home/opc/ruby/src/master/tool/downloader.rb:482:in `block in
' E, [2024-05-18T15:44:26.996271 #543288] ERROR -- : from /home/opc/ruby/src/master/tool/downloader.rb:465:in `each' E, [2024-05-18T15:44:26.996279 #543288] ERROR -- : from /home/opc/ruby/src/master/tool/downloader.rb:465:in `
' E, [2024-05-18T15:44:26.996288 #543288] ERROR -- : /usr/local/lib/ruby/3.2.0/open-uri.rb:369:in `open_http': 403 Forbidden (OpenURI::HTTPError) E, [2024-05-18T15:44:26.996297 #543288] ERROR -- : from /usr/local/lib/ruby/3.2.0/open-uri.rb:760:in `buffer_open' E, [2024-05-18T15:44:26.996305 #543288] ERROR -- : from /usr/local/lib/ruby/3.2.0/open-uri.rb:214:in `block in open_loop' E, [2024-05-18T15:44:26.996314 #543288] ERROR -- : from /usr/local/lib/ruby/3.2.0/open-uri.rb:212:in `catch' E, [2024-05-18T15:44:26.996322 #543288] ERROR -- : from /usr/local/lib/ruby/3.2.0/open-uri.rb:212:in `open_loop' E, [2024-05-18T15:44:26.996331 #543288] ERROR -- : from /usr/local/lib/ruby/3.2.0/open-uri.rb:153:in `open_uri' E, [2024-05-18T15:44:26.996339 #543288] ERROR -- : from /usr/local/lib/ruby/3.2.0/open-uri.rb:740:in `open' E, [2024-05-18T15:44:26.996347 #543288] ERROR -- : from /usr/local/lib/ruby/3.2.0/open-uri.rb:748:in `read' E, [2024-05-18T15:44:26.996356 #543288] ERROR -- : from /home/opc/ruby/src/master/tool/downloader.rb:247:in `block in download' E, [2024-05-18T15:44:26.996365 #543288] ERROR -- : from /home/opc/ruby/src/master/tool/downloader.rb:378:in `with_retry' E, [2024-05-18T15:44:26.996374 #543288] ERROR -- : from /home/opc/ruby/src/master/tool/downloader.rb:246:in `download' E, [2024-05-18T15:44:26.996382 #543288] ERROR -- : from /home/opc/ruby/src/master/tool/downloader.rb:136:in `download' E, [2024-05-18T15:44:26.996391 #543288] ERROR -- : from /home/opc/ruby/src/master/tool/downloader.rb:482:in `block in
' E, [2024-05-18T15:44:26.996399 #543288] ERROR -- : from /home/opc/ruby/src/master/tool/downloader.rb:465:in `each' E, [2024-05-18T15:44:26.996408 #543288] ERROR -- : from /home/opc/ruby/src/master/tool/downloader.rb:465:in `
' E, [2024-05-18T15:44:26.999242 #543288] ERROR -- : make: *** [uncommon.mk:1765: /home/opc/ruby/src/master/enc/unicode/data/emoji/15.0/emoji-sequences.txt] Error 1 E, [2024-05-18T15:44:26.999284 #543288] ERROR -- : make: *** Deleting file '/home/opc/ruby/src/master/enc/unicode/data/emoji/15.0/emoji-sequences.txt' I, [2024-05-18T15:44:26.999355 #543288] INFO -- : downloading emoji/15.0/emoji-test.txt ... I, [2024-05-18T15:44:26.999496 #543288] INFO -- : $$$[end] "make update-unicode -j3" exit with 512. I, [2024-05-18T15:44:26.999534 #543288] INFO -- : $$$[beg] make update-download -j3 I, [2024-05-18T15:44:27.160114 #543288] INFO -- : tool/config.guess already exists I, [2024-05-18T15:44:27.160181 #543288] INFO -- : tool/config.sub already exists I, [2024-05-18T15:44:27.163054 #543288] INFO -- : Update power_assert to 84e85124c5014a139af39161d484156cfe87a9ed I, [2024-05-18T15:44:27.163160 #543288] INFO -- : Update rbs to ba7872795d5de04adb8ff500c0e6afdc81a041dd I, [2024-05-18T15:44:27.163503 #543288] INFO -- : Update typeprof to b19a6416da3a05d57fadd6ffdadb382b6d236ca5 I, [2024-05-18T15:44:27.166419 #543288] INFO -- : echo 84e85124c5014a139af39161d484156cfe87a9ed | /bin/sh /home/opc/ruby/src/master/tool/ifchange /home/opc/ruby/src/master/.bundle/.timestamp/power_assert.revision - I, [2024-05-18T15:44:27.166676 #543288] INFO -- : echo ba7872795d5de04adb8ff500c0e6afdc81a041dd | /bin/sh /home/opc/ruby/src/master/tool/ifchange /home/opc/ruby/src/master/.bundle/.timestamp/rbs.revision - I, [2024-05-18T15:44:27.166837 #543288] INFO -- : echo b19a6416da3a05d57fadd6ffdadb382b6d236ca5 | /bin/sh /home/opc/ruby/src/master/tool/ifchange /home/opc/ruby/src/master/.bundle/.timestamp/typeprof.revision - I, [2024-05-18T15:44:27.172288 #543288] INFO -- : /home/opc/ruby/src/master/.bundle/.timestamp/rbs.revision unchanged I, [2024-05-18T15:44:27.172766 #543288] INFO -- : /home/opc/ruby/src/master/.bundle/.timestamp/typeprof.revision unchanged I, [2024-05-18T15:44:27.174164 #543288] INFO -- : /home/opc/ruby/src/master/.bundle/.timestamp/power_assert.revision unchanged I, [2024-05-18T15:44:27.262048 #543288] INFO -- : Building power_assert@84e85124c5014a139af39161d484156cfe87a9ed to /home/opc/ruby/src/master/gems/power_assert-2.0.3.gem I, [2024-05-18T15:44:27.374213 #543288] INFO -- : Successfully built RubyGem I, [2024-05-18T15:44:27.374272 #543288] INFO -- : Name: power_assert I, [2024-05-18T15:44:27.374284 #543288] INFO -- : Version: 2.0.4dev I, [2024-05-18T15:44:27.374293 #543288] INFO -- : File: power_assert-2.0.4dev.gem I, [2024-05-18T15:44:27.453212 #543288] INFO -- : $$$[end] "make update-download -j3" exit with 0. I, [2024-05-18T15:44:27.453281 #543288] INFO -- : $$$[beg] make update-rubyspec -j3 I, [2024-05-18T15:44:27.540977 #543288] INFO -- : make: Nothing to be done for 'update-rubyspec'. I, [2024-05-18T15:44:27.541143 #543288] INFO -- : $$$[end] "make update-rubyspec -j3" exit with 0. I, [2024-05-18T15:44:27.541179 #543288] INFO -- : $$$[beg] make update-src -j3 I, [2024-05-18T15:44:28.589580 #543288] INFO -- : Already up to date. I, [2024-05-18T15:44:28.603811 #543288] INFO -- : Latest commit hash = dbbaf871de I, [2024-05-18T15:44:28.604411 #543288] INFO -- : $$$[end] "make update-src -j3" exit with 0. I, [2024-05-18T15:44:28.604454 #543288] INFO -- : $$$[beg] make after-update -j3 I, [2024-05-18T15:44:28.706580 #543288] INFO -- : generating /home/opc/ruby/src/master/ext/ripper/eventids2table.c I, [2024-05-18T15:44:28.713169 #543288] INFO -- : make[1]: Entering directory '/home/opc/ruby/src/master/ext/ripper' I, [2024-05-18T15:44:28.713222 #543288] INFO -- : make[1]: Nothing to be done for 'src'. I, [2024-05-18T15:44:28.713233 #543288] INFO -- : make[1]: Leaving directory '/home/opc/ruby/src/master/ext/ripper' I, [2024-05-18T15:44:28.739465 #543288] INFO -- : /home/opc/ruby/src/master/revision.h updated I, [2024-05-18T15:44:28.740564 #543288] INFO -- : generating aarch64-linux-fake.rb I, [2024-05-18T15:44:28.797417 #543288] INFO -- : aarch64-linux-fake.rb updated I, [2024-05-18T15:44:28.798805 #543288] INFO -- : generating enc.mk I, [2024-05-18T15:44:29.028756 #543288] INFO -- : making srcs under enc I, [2024-05-18T15:44:29.070677 #543288] INFO -- : make[1]: Entering directory '/home/opc/ruby/build/master' I, [2024-05-18T15:44:29.070758 #543288] INFO -- : make[1]: Nothing to be done for 'srcs'. I, [2024-05-18T15:44:29.070779 #543288] INFO -- : make[1]: Leaving directory '/home/opc/ruby/build/master' I, [2024-05-18T15:44:29.150060 #543288] INFO -- : Update power_assert to 84e85124c5014a139af39161d484156cfe87a9ed I, [2024-05-18T15:44:29.150208 #543288] INFO -- : Update rbs to ba7872795d5de04adb8ff500c0e6afdc81a041dd I, [2024-05-18T15:44:29.151267 #543288] INFO -- : Update typeprof to b19a6416da3a05d57fadd6ffdadb382b6d236ca5 I, [2024-05-18T15:44:29.153999 #543288] INFO -- : echo 84e85124c5014a139af39161d484156cfe87a9ed | /bin/sh /home/opc/ruby/src/master/tool/ifchange /home/opc/ruby/src/master/.bundle/.timestamp/power_assert.revision - I, [2024-05-18T15:44:29.154246 #543288] INFO -- : echo ba7872795d5de04adb8ff500c0e6afdc81a041dd | /bin/sh /home/opc/ruby/src/master/tool/ifchange /home/opc/ruby/src/master/.bundle/.timestamp/rbs.revision - I, [2024-05-18T15:44:29.154417 #543288] INFO -- : echo b19a6416da3a05d57fadd6ffdadb382b6d236ca5 | /bin/sh /home/opc/ruby/src/master/tool/ifchange /home/opc/ruby/src/master/.bundle/.timestamp/typeprof.revision - I, [2024-05-18T15:44:29.159943 #543288] INFO -- : /home/opc/ruby/src/master/.bundle/.timestamp/rbs.revision unchanged I, [2024-05-18T15:44:29.159997 #543288] INFO -- : /home/opc/ruby/src/master/.bundle/.timestamp/typeprof.revision unchanged I, [2024-05-18T15:44:29.160011 #543288] INFO -- : /home/opc/ruby/src/master/.bundle/.timestamp/power_assert.revision unchanged I, [2024-05-18T15:44:29.251104 #543288] INFO -- : Building power_assert@84e85124c5014a139af39161d484156cfe87a9ed to /home/opc/ruby/src/master/gems/power_assert-2.0.3.gem I, [2024-05-18T15:44:29.360311 #543288] INFO -- : Successfully built RubyGem I, [2024-05-18T15:44:29.360388 #543288] INFO -- : Name: power_assert I, [2024-05-18T15:44:29.360401 #543288] INFO -- : Version: 2.0.4dev I, [2024-05-18T15:44:29.360411 #543288] INFO -- : File: power_assert-2.0.4dev.gem I, [2024-05-18T15:44:29.362704 #543288] INFO -- : Extracting bundle gem power_assert-2.0.3... I, [2024-05-18T15:44:29.458111 #543288] INFO -- : Try with hash version of bundled gems instead of gems/power_assert-2.0.3.gem. We don't use this gem with release version of Ruby. I, [2024-05-18T15:44:29.467994 #543288] INFO -- : Unpacked gems/power_assert-2.0.4dev.gem I, [2024-05-18T15:44:29.469612 #543288] INFO -- : $$$[end] "make after-update -j3" exit with 0. I, [2024-05-18T15:44:29.469758 #543288] INFO -- : $$$[beg] make miniruby -j3 I, [2024-05-18T15:44:29.559135 #543288] INFO -- : BASERUBY = /usr/local/bin/ruby --disable=gems I, [2024-05-18T15:44:29.559200 #543288] INFO -- : CC = gcc I, [2024-05-18T15:44:29.559211 #543288] INFO -- : LD = ld I, [2024-05-18T15:44:29.559221 #543288] INFO -- : LDSHARED = gcc -shared I, [2024-05-18T15:44:29.559233 #543288] INFO -- : CFLAGS = -O3 -fno-fast-math -ggdb3 -Wall -Wextra -Wdeprecated-declarations -Wdiv-by-zero -Wduplicated-cond -Wimplicit-function-declaration -Wimplicit-int -Wpointer-arith -Wwrite-strings -Wold-style-definition -Wimplicit-fallthrough=0 -Wmissing-noreturn -Wno-cast-function-type -Wno-constant-logical-operand -Wno-long-long -Wno-missing-field-initializers -Wno-overlength-strings -Wno-packed-bitfield-compat -Wno-parentheses-equality -Wno-self-assign -Wno-tautological-compare -Wno-unused-parameter -Wno-unused-value -Wsuggest-attribute=format -Wsuggest-attribute=noreturn -Wunused-variable -Wmisleading-indentation -Wundef I, [2024-05-18T15:44:29.559243 #543288] INFO -- : XCFLAGS = -U_FORTIFY_SOURCE -D_FORTIFY_SOURCE=2 -fstack-protector-strong -msign-return-address=all -fno-strict-overflow -fvisibility=hidden -fexcess-precision=standard -DRUBY_EXPORT -fPIE -I. -I.ext/include/aarch64-linux -I/home/opc/ruby/src/master/include -I/home/opc/ruby/src/master -I/home/opc/ruby/src/master/prism -I/home/opc/ruby/src/master/enc/unicode/15.0.0 I, [2024-05-18T15:44:29.559252 #543288] INFO -- : CPPFLAGS = I, [2024-05-18T15:44:29.559261 #543288] INFO -- : DLDFLAGS = -Wl,--compress-debug-sections=zlib -fstack-protector-strong -pie I, [2024-05-18T15:44:29.559270 #543288] INFO -- : SOLIBS = -lz -lrt -lrt -ldl -lcrypt -lm -lpthread I, [2024-05-18T15:44:29.559279 #543288] INFO -- : LANG = en_US.UTF-8 I, [2024-05-18T15:44:29.559304 #543288] INFO -- : LC_ALL = I, [2024-05-18T15:44:29.559315 #543288] INFO -- : LC_CTYPE = I, [2024-05-18T15:44:29.559323 #543288] INFO -- : MFLAGS = -j3 --jobserver-auth=4,5 I, [2024-05-18T15:44:29.559352 #543288] INFO -- : RUSTC = rustc I, [2024-05-18T15:44:29.559362 #543288] INFO -- : YJIT_RUSTC_ARGS = --crate-name=yjit --crate-type=staticlib --edition=2021 -g -C lto=thin -C opt-level=3 -C overflow-checks=on '--out-dir=/home/opc/ruby/build/master/yjit/target/release/' /home/opc/ruby/src/master/yjit/src/lib.rs I, [2024-05-18T15:44:29.560065 #543288] INFO -- : gcc (GCC) 8.5.0 20210514 (Red Hat 8.5.0-10.1.0.1) I, [2024-05-18T15:44:29.560099 #543288] INFO -- : Copyright (C) 2018 Free Software Foundation, Inc. I, [2024-05-18T15:44:29.560110 #543288] INFO -- : This is free software; see the source for copying conditions. There is NO I, [2024-05-18T15:44:29.560123 #543288] INFO -- : warranty; not even for MERCHANTABILITY or FITNESS FOR A PARTICULAR PURPOSE. I, [2024-05-18T15:44:29.560132 #543288] INFO -- : I, [2024-05-18T15:44:29.584832 #543288] INFO -- : compiling /home/opc/ruby/src/master/version.c I, [2024-05-18T15:44:29.724964 #543288] INFO -- : linking miniruby I, [2024-05-18T15:44:30.618513 #543288] INFO -- : $$$[end] "make miniruby -j3" exit with 0. I, [2024-05-18T15:44:30.618684 #543288] INFO -- : $$$[beg] make ruby -j3 I, [2024-05-18T15:44:30.708088 #543288] INFO -- : BASERUBY = /usr/local/bin/ruby --disable=gems I, [2024-05-18T15:44:30.708155 #543288] INFO -- : CC = gcc I, [2024-05-18T15:44:30.708167 #543288] INFO -- : LD = ld I, [2024-05-18T15:44:30.708176 #543288] INFO -- : LDSHARED = gcc -shared I, [2024-05-18T15:44:30.708188 #543288] INFO -- : CFLAGS = -O3 -fno-fast-math -ggdb3 -Wall -Wextra -Wdeprecated-declarations -Wdiv-by-zero -Wduplicated-cond -Wimplicit-function-declaration -Wimplicit-int -Wpointer-arith -Wwrite-strings -Wold-style-definition -Wimplicit-fallthrough=0 -Wmissing-noreturn -Wno-cast-function-type -Wno-constant-logical-operand -Wno-long-long -Wno-missing-field-initializers -Wno-overlength-strings -Wno-packed-bitfield-compat -Wno-parentheses-equality -Wno-self-assign -Wno-tautological-compare -Wno-unused-parameter -Wno-unused-value -Wsuggest-attribute=format -Wsuggest-attribute=noreturn -Wunused-variable -Wmisleading-indentation -Wundef I, [2024-05-18T15:44:30.708198 #543288] INFO -- : XCFLAGS = -U_FORTIFY_SOURCE -D_FORTIFY_SOURCE=2 -fstack-protector-strong -msign-return-address=all -fno-strict-overflow -fvisibility=hidden -fexcess-precision=standard -DRUBY_EXPORT -fPIE -I. -I.ext/include/aarch64-linux -I/home/opc/ruby/src/master/include -I/home/opc/ruby/src/master -I/home/opc/ruby/src/master/prism -I/home/opc/ruby/src/master/enc/unicode/15.0.0 I, [2024-05-18T15:44:30.708208 #543288] INFO -- : CPPFLAGS = I, [2024-05-18T15:44:30.708216 #543288] INFO -- : DLDFLAGS = -Wl,--compress-debug-sections=zlib -fstack-protector-strong -pie I, [2024-05-18T15:44:30.708225 #543288] INFO -- : SOLIBS = -lz -lrt -lrt -ldl -lcrypt -lm -lpthread I, [2024-05-18T15:44:30.708234 #543288] INFO -- : LANG = en_US.UTF-8 I, [2024-05-18T15:44:30.708242 #543288] INFO -- : LC_ALL = I, [2024-05-18T15:44:30.708250 #543288] INFO -- : LC_CTYPE = I, [2024-05-18T15:44:30.708259 #543288] INFO -- : MFLAGS = -j3 --jobserver-auth=4,5 I, [2024-05-18T15:44:30.708268 #543288] INFO -- : RUSTC = rustc I, [2024-05-18T15:44:30.708276 #543288] INFO -- : YJIT_RUSTC_ARGS = --crate-name=yjit --crate-type=staticlib --edition=2021 -g -C lto=thin -C opt-level=3 -C overflow-checks=on '--out-dir=/home/opc/ruby/build/master/yjit/target/release/' /home/opc/ruby/src/master/yjit/src/lib.rs I, [2024-05-18T15:44:30.708972 #543288] INFO -- : gcc (GCC) 8.5.0 20210514 (Red Hat 8.5.0-10.1.0.1) I, [2024-05-18T15:44:30.709000 #543288] INFO -- : Copyright (C) 2018 Free Software Foundation, Inc. I, [2024-05-18T15:44:30.709010 #543288] INFO -- : This is free software; see the source for copying conditions. There is NO I, [2024-05-18T15:44:30.709019 #543288] INFO -- : warranty; not even for MERCHANTABILITY or FITNESS FOR A PARTICULAR PURPOSE. I, [2024-05-18T15:44:30.709028 #543288] INFO -- : I, [2024-05-18T15:44:30.891820 #543288] INFO -- : builtin_binary.inc updated I, [2024-05-18T15:44:30.896614 #543288] INFO -- : c5234a9416e4f20f175185e840b25b0f08674d14078ed7083f37e655458e3ca9 builtin_binary.inc I, [2024-05-18T15:44:30.897440 #543288] INFO -- : compiling /home/opc/ruby/src/master/builtin.c I, [2024-05-18T15:44:31.225781 #543288] INFO -- : linking static-library libruby-static.a I, [2024-05-18T15:44:33.381157 #543288] INFO -- : linking ruby I, [2024-05-18T15:44:34.299136 #543288] INFO -- : $$$[end] "make ruby -j3" exit with 0. I, [2024-05-18T15:44:34.299303 #543288] INFO -- : $$$[beg] make all -j3 I, [2024-05-18T15:44:34.388117 #543288] INFO -- : BASERUBY = /usr/local/bin/ruby --disable=gems I, [2024-05-18T15:44:34.388191 #543288] INFO -- : CC = gcc I, [2024-05-18T15:44:34.388203 #543288] INFO -- : LD = ld I, [2024-05-18T15:44:34.388212 #543288] INFO -- : LDSHARED = gcc -shared I, [2024-05-18T15:44:34.388223 #543288] INFO -- : CFLAGS = -O3 -fno-fast-math -ggdb3 -Wall -Wextra -Wdeprecated-declarations -Wdiv-by-zero -Wduplicated-cond -Wimplicit-function-declaration -Wimplicit-int -Wpointer-arith -Wwrite-strings -Wold-style-definition -Wimplicit-fallthrough=0 -Wmissing-noreturn -Wno-cast-function-type -Wno-constant-logical-operand -Wno-long-long -Wno-missing-field-initializers -Wno-overlength-strings -Wno-packed-bitfield-compat -Wno-parentheses-equality -Wno-self-assign -Wno-tautological-compare -Wno-unused-parameter -Wno-unused-value -Wsuggest-attribute=format -Wsuggest-attribute=noreturn -Wunused-variable -Wmisleading-indentation -Wundef I, [2024-05-18T15:44:34.388234 #543288] INFO -- : XCFLAGS = -U_FORTIFY_SOURCE -D_FORTIFY_SOURCE=2 -fstack-protector-strong -msign-return-address=all -fno-strict-overflow -fvisibility=hidden -fexcess-precision=standard -DRUBY_EXPORT -fPIE -I. -I.ext/include/aarch64-linux -I/home/opc/ruby/src/master/include -I/home/opc/ruby/src/master -I/home/opc/ruby/src/master/prism -I/home/opc/ruby/src/master/enc/unicode/15.0.0 I, [2024-05-18T15:44:34.388243 #543288] INFO -- : CPPFLAGS = I, [2024-05-18T15:44:34.388252 #543288] INFO -- : DLDFLAGS = -Wl,--compress-debug-sections=zlib -fstack-protector-strong -pie I, [2024-05-18T15:44:34.388261 #543288] INFO -- : SOLIBS = -lz -lrt -lrt -ldl -lcrypt -lm -lpthread I, [2024-05-18T15:44:34.388270 #543288] INFO -- : LANG = en_US.UTF-8 I, [2024-05-18T15:44:34.388278 #543288] INFO -- : LC_ALL = I, [2024-05-18T15:44:34.388286 #543288] INFO -- : LC_CTYPE = I, [2024-05-18T15:44:34.388295 #543288] INFO -- : MFLAGS = -j3 --jobserver-auth=4,5 I, [2024-05-18T15:44:34.388303 #543288] INFO -- : RUSTC = rustc I, [2024-05-18T15:44:34.388312 #543288] INFO -- : YJIT_RUSTC_ARGS = --crate-name=yjit --crate-type=staticlib --edition=2021 -g -C lto=thin -C opt-level=3 -C overflow-checks=on '--out-dir=/home/opc/ruby/build/master/yjit/target/release/' /home/opc/ruby/src/master/yjit/src/lib.rs I, [2024-05-18T15:44:34.389153 #543288] INFO -- : gcc (GCC) 8.5.0 20210514 (Red Hat 8.5.0-10.1.0.1) I, [2024-05-18T15:44:34.389192 #543288] INFO -- : Copyright (C) 2018 Free Software Foundation, Inc. I, [2024-05-18T15:44:34.389203 #543288] INFO -- : This is free software; see the source for copying conditions. There is NO I, [2024-05-18T15:44:34.389213 #543288] INFO -- : warranty; not even for MERCHANTABILITY or FITNESS FOR A PARTICULAR PURPOSE. I, [2024-05-18T15:44:34.389222 #543288] INFO -- : I, [2024-05-18T15:44:34.421872 #543288] INFO -- : generating encdb.h I, [2024-05-18T15:44:34.423277 #543288] INFO -- : generating enc.mk I, [2024-05-18T15:44:34.460898 #543288] INFO -- : encdb.h unchanged I, [2024-05-18T15:44:34.658609 #543288] INFO -- : making srcs under enc I, [2024-05-18T15:44:34.658679 #543288] INFO -- : making enc I, [2024-05-18T15:44:34.686540 #543288] INFO -- : make[1]: Entering directory '/home/opc/ruby/build/master' I, [2024-05-18T15:44:34.686608 #543288] INFO -- : make[1]: Nothing to be done for 'enc'. I, [2024-05-18T15:44:34.686619 #543288] INFO -- : make[1]: Leaving directory '/home/opc/ruby/build/master' I, [2024-05-18T15:44:34.700627 #543288] INFO -- : make[1]: Entering directory '/home/opc/ruby/build/master' I, [2024-05-18T15:44:34.700667 #543288] INFO -- : make[1]: Nothing to be done for 'srcs'. I, [2024-05-18T15:44:34.700678 #543288] INFO -- : make[1]: Leaving directory '/home/opc/ruby/build/master' I, [2024-05-18T15:44:34.701466 #543288] INFO -- : generating transdb.h I, [2024-05-18T15:44:34.846868 #543288] INFO -- : transdb.h unchanged I, [2024-05-18T15:44:34.848450 #543288] INFO -- : generating makefiles ext/configure-ext.mk I, [2024-05-18T15:44:34.848597 #543288] INFO -- : making trans I, [2024-05-18T15:44:34.887962 #543288] INFO -- : ext/configure-ext.mk updated I, [2024-05-18T15:44:34.891092 #543288] INFO -- : make[1]: Entering directory '/home/opc/ruby/build/master' I, [2024-05-18T15:44:34.898810 #543288] INFO -- : make[1]: Entering directory '/home/opc/ruby/build/master' I, [2024-05-18T15:44:34.898855 #543288] INFO -- : make[1]: Nothing to be done for 'trans'. I, [2024-05-18T15:44:34.898866 #543288] INFO -- : make[1]: Leaving directory '/home/opc/ruby/build/master' I, [2024-05-18T15:44:35.079881 #543288] INFO -- : making encs I, [2024-05-18T15:44:35.132471 #543288] INFO -- : make[1]: Entering directory '/home/opc/ruby/build/master' I, [2024-05-18T15:44:35.132578 #543288] INFO -- : make[1]: Nothing to be done for 'encs'. I, [2024-05-18T15:44:35.132612 #543288] INFO -- : make[1]: Leaving directory '/home/opc/ruby/build/master' I, [2024-05-18T15:44:35.646574 #543288] INFO -- : make[1]: Leaving directory '/home/opc/ruby/build/master' I, [2024-05-18T15:44:35.647344 #543288] INFO -- : generating makefile exts.mk I, [2024-05-18T15:44:35.706924 #543288] INFO -- : exts.mk unchanged I, [2024-05-18T15:44:35.711715 #543288] INFO -- : make[1]: Entering directory '/home/opc/ruby/build/master' I, [2024-05-18T15:44:35.817804 #543288] INFO -- : make[2]: Entering directory '/home/opc/ruby/build/master/ext/coverage' I, [2024-05-18T15:44:35.819843 #543288] INFO -- : make[2]: Entering directory '/home/opc/ruby/build/master/ext/digest' I, [2024-05-18T15:44:35.821957 #543288] INFO -- : make[2]: Entering directory '/home/opc/ruby/build/master/ext/date' I, [2024-05-18T15:44:35.825523 #543288] INFO -- : make[2]: Leaving directory '/home/opc/ruby/build/master/ext/coverage' I, [2024-05-18T15:44:35.828562 #543288] INFO -- : make[2]: Leaving directory '/home/opc/ruby/build/master/ext/date' I, [2024-05-18T15:44:35.831884 #543288] INFO -- : make[2]: Leaving directory '/home/opc/ruby/build/master/ext/digest' I, [2024-05-18T15:44:35.836799 #543288] INFO -- : make[2]: Entering directory '/home/opc/ruby/build/master/ext/io/console' I, [2024-05-18T15:44:35.839102 #543288] INFO -- : make[2]: Entering directory '/home/opc/ruby/build/master/ext/fiddle' I, [2024-05-18T15:44:35.843903 #543288] INFO -- : make[2]: Leaving directory '/home/opc/ruby/build/master/ext/io/console' I, [2024-05-18T15:44:35.847579 #543288] INFO -- : make[2]: Entering directory '/home/opc/ruby/build/master/ext/json' I, [2024-05-18T15:44:35.849982 #543288] INFO -- : make[2]: Leaving directory '/home/opc/ruby/build/master/ext/fiddle' I, [2024-05-18T15:44:35.851566 #543288] INFO -- : make[2]: Entering directory '/home/opc/ruby/build/master/ext/monitor' I, [2024-05-18T15:44:35.855600 #543288] INFO -- : make[2]: Leaving directory '/home/opc/ruby/build/master/ext/monitor' I, [2024-05-18T15:44:35.856225 #543288] INFO -- : make[2]: Leaving directory '/home/opc/ruby/build/master/ext/json' I, [2024-05-18T15:44:35.857352 #543288] INFO -- : make[2]: Entering directory '/home/opc/ruby/build/master/ext/objspace' I, [2024-05-18T15:44:35.860397 #543288] INFO -- : make[2]: Entering directory '/home/opc/ruby/build/master/ext/pathname' I, [2024-05-18T15:44:35.863174 #543288] INFO -- : make[2]: Leaving directory '/home/opc/ruby/build/master/ext/objspace' I, [2024-05-18T15:44:35.865283 #543288] INFO -- : make[2]: Leaving directory '/home/opc/ruby/build/master/ext/pathname' I, [2024-05-18T15:44:35.869441 #543288] INFO -- : make[2]: Entering directory '/home/opc/ruby/build/master/ext/psych' I, [2024-05-18T15:44:35.871744 #543288] INFO -- : make[2]: Entering directory '/home/opc/ruby/build/master/ext/pty' I, [2024-05-18T15:44:35.874590 #543288] INFO -- : make[2]: Entering directory '/home/opc/ruby/build/master/ext/openssl' I, [2024-05-18T15:44:35.881124 #543288] INFO -- : make[2]: Leaving directory '/home/opc/ruby/build/master/ext/pty' I, [2024-05-18T15:44:35.884577 #543288] INFO -- : make[2]: Leaving directory '/home/opc/ruby/build/master/ext/psych' I, [2024-05-18T15:44:35.892824 #543288] INFO -- : make[2]: Entering directory '/home/opc/ruby/build/master/ext/ripper' I, [2024-05-18T15:44:35.893239 #543288] INFO -- : make[2]: Entering directory '/home/opc/ruby/build/master/ext/rubyvm' I, [2024-05-18T15:44:35.897697 #543288] INFO -- : make[2]: Leaving directory '/home/opc/ruby/build/master/ext/openssl' I, [2024-05-18T15:44:35.899407 #543288] INFO -- : make[2]: Leaving directory '/home/opc/ruby/build/master/ext/ripper' I, [2024-05-18T15:44:35.899565 #543288] INFO -- : make[2]: Leaving directory '/home/opc/ruby/build/master/ext/rubyvm' I, [2024-05-18T15:44:35.908386 #543288] INFO -- : make[2]: Entering directory '/home/opc/ruby/build/master/.bundle/gems/bigdecimal-3.1.7/ext/bigdecimal' I, [2024-05-18T15:44:35.910449 #543288] INFO -- : make[2]: Entering directory '/home/opc/ruby/build/master/.bundle/gems/bigdecimal-3.1.8/ext/bigdecimal' I, [2024-05-18T15:44:35.911258 #543288] INFO -- : make[2]: Entering directory '/home/opc/ruby/build/master/ext/socket' I, [2024-05-18T15:44:35.922657 #543288] INFO -- : make[2]: Leaving directory '/home/opc/ruby/build/master/ext/socket' I, [2024-05-18T15:44:35.925171 #543288] INFO -- : make[2]: Entering directory '/home/opc/ruby/build/master/.bundle/gems/debug-1.9.2/ext/debug' I, [2024-05-18T15:44:35.942304 #543288] INFO -- : make[2]: Leaving directory '/home/opc/ruby/build/master/.bundle/gems/bigdecimal-3.1.7/ext/bigdecimal' I, [2024-05-18T15:44:35.944806 #543288] INFO -- : make[2]: Entering directory '/home/opc/ruby/build/master/.bundle/gems/nkf-0.2.0/ext/nkf' I, [2024-05-18T15:44:35.950619 #543288] INFO -- : make[2]: Leaving directory '/home/opc/ruby/build/master/.bundle/gems/bigdecimal-3.1.8/ext/bigdecimal' I, [2024-05-18T15:44:35.953231 #543288] INFO -- : make[2]: Entering directory '/home/opc/ruby/build/master/.bundle/gems/racc-1.7.3/ext/racc/cparse' I, [2024-05-18T15:44:35.958469 #543288] INFO -- : make[2]: Leaving directory '/home/opc/ruby/build/master/.bundle/gems/debug-1.9.2/ext/debug' I, [2024-05-18T15:44:35.961603 #543288] INFO -- : make[2]: Entering directory '/home/opc/ruby/build/master/.bundle/gems/rbs-3.4.4/ext/rbs_extension' I, [2024-05-18T15:44:35.979885 #543288] INFO -- : make[2]: Leaving directory '/home/opc/ruby/build/master/.bundle/gems/nkf-0.2.0/ext/nkf' I, [2024-05-18T15:44:35.982667 #543288] INFO -- : make[2]: Entering directory '/home/opc/ruby/build/master/.bundle/gems/syslog-0.1.2/ext/syslog' I, [2024-05-18T15:44:35.993697 #543288] INFO -- : make[2]: Leaving directory '/home/opc/ruby/build/master/.bundle/gems/rbs-3.4.4/ext/rbs_extension' I, [2024-05-18T15:44:35.996106 #543288] INFO -- : make[2]: Leaving directory '/home/opc/ruby/build/master/.bundle/gems/racc-1.7.3/ext/racc/cparse' I, [2024-05-18T15:44:36.010216 #543288] INFO -- : make[2]: Entering directory '/home/opc/ruby/build/master/ext/digest/sha2' I, [2024-05-18T15:44:36.013831 #543288] INFO -- : make[2]: Leaving directory '/home/opc/ruby/build/master/.bundle/gems/syslog-0.1.2/ext/syslog' I, [2024-05-18T15:44:36.015433 #543288] INFO -- : make[2]: Leaving directory '/home/opc/ruby/build/master/ext/digest/sha2' I, [2024-05-18T15:44:36.055327 #543288] INFO -- : make[2]: Entering directory '/home/opc/ruby/build/master' I, [2024-05-18T15:44:36.139628 #543288] INFO -- : make[2]: 'ruby' is up to date. I, [2024-05-18T15:44:36.139708 #543288] INFO -- : make[2]: Leaving directory '/home/opc/ruby/build/master' I, [2024-05-18T15:44:36.139854 #543288] INFO -- : make[1]: Leaving directory '/home/opc/ruby/build/master' I, [2024-05-18T15:44:36.144363 #543288] INFO -- : make[1]: Entering directory '/home/opc/ruby/build/master' I, [2024-05-18T15:44:36.144429 #543288] INFO -- : make[1]: Nothing to be done for 'note'. I, [2024-05-18T15:44:36.144440 #543288] INFO -- : make[1]: Leaving directory '/home/opc/ruby/build/master' I, [2024-05-18T15:44:36.144775 #543288] INFO -- : $$$[end] "make all -j3" exit with 0. I, [2024-05-18T15:44:36.144953 #543288] INFO -- : $$$[beg] make install -j3 I, [2024-05-18T15:44:36.239973 #543288] INFO -- : Update power_assert to 84e85124c5014a139af39161d484156cfe87a9ed I, [2024-05-18T15:44:36.240201 #543288] INFO -- : Update rbs to ba7872795d5de04adb8ff500c0e6afdc81a041dd I, [2024-05-18T15:44:36.241567 #543288] INFO -- : Update typeprof to b19a6416da3a05d57fadd6ffdadb382b6d236ca5 I, [2024-05-18T15:44:36.244404 #543288] INFO -- : echo ba7872795d5de04adb8ff500c0e6afdc81a041dd | /bin/sh /home/opc/ruby/src/master/tool/ifchange /home/opc/ruby/src/master/.bundle/.timestamp/rbs.revision - I, [2024-05-18T15:44:36.244452 #543288] INFO -- : echo b19a6416da3a05d57fadd6ffdadb382b6d236ca5 | /bin/sh /home/opc/ruby/src/master/tool/ifchange /home/opc/ruby/src/master/.bundle/.timestamp/typeprof.revision - I, [2024-05-18T15:44:36.244831 #543288] INFO -- : echo 84e85124c5014a139af39161d484156cfe87a9ed | /bin/sh /home/opc/ruby/src/master/tool/ifchange /home/opc/ruby/src/master/.bundle/.timestamp/power_assert.revision - I, [2024-05-18T15:44:36.250441 #543288] INFO -- : /home/opc/ruby/src/master/.bundle/.timestamp/rbs.revision unchanged I, [2024-05-18T15:44:36.250526 #543288] INFO -- : /home/opc/ruby/src/master/.bundle/.timestamp/typeprof.revision unchanged I, [2024-05-18T15:44:36.250939 #543288] INFO -- : /home/opc/ruby/src/master/.bundle/.timestamp/power_assert.revision unchanged I, [2024-05-18T15:44:36.253608 #543288] INFO -- : BASERUBY = /usr/local/bin/ruby --disable=gems I, [2024-05-18T15:44:36.253646 #543288] INFO -- : CC = gcc I, [2024-05-18T15:44:36.253657 #543288] INFO -- : LD = ld I, [2024-05-18T15:44:36.253667 #543288] INFO -- : LDSHARED = gcc -shared I, [2024-05-18T15:44:36.253676 #543288] INFO -- : CFLAGS = -O3 -fno-fast-math -ggdb3 -Wall -Wextra -Wdeprecated-declarations -Wdiv-by-zero -Wduplicated-cond -Wimplicit-function-declaration -Wimplicit-int -Wpointer-arith -Wwrite-strings -Wold-style-definition -Wimplicit-fallthrough=0 -Wmissing-noreturn -Wno-cast-function-type -Wno-constant-logical-operand -Wno-long-long -Wno-missing-field-initializers -Wno-overlength-strings -Wno-packed-bitfield-compat -Wno-parentheses-equality -Wno-self-assign -Wno-tautological-compare -Wno-unused-parameter -Wno-unused-value -Wsuggest-attribute=format -Wsuggest-attribute=noreturn -Wunused-variable -Wmisleading-indentation -Wundef I, [2024-05-18T15:44:36.253686 #543288] INFO -- : XCFLAGS = -U_FORTIFY_SOURCE -D_FORTIFY_SOURCE=2 -fstack-protector-strong -msign-return-address=all -fno-strict-overflow -fvisibility=hidden -fexcess-precision=standard -DRUBY_EXPORT -fPIE -I. -I.ext/include/aarch64-linux -I/home/opc/ruby/src/master/include -I/home/opc/ruby/src/master -I/home/opc/ruby/src/master/prism -I/home/opc/ruby/src/master/enc/unicode/15.0.0 I, [2024-05-18T15:44:36.253695 #543288] INFO -- : CPPFLAGS = I, [2024-05-18T15:44:36.253705 #543288] INFO -- : DLDFLAGS = -Wl,--compress-debug-sections=zlib -fstack-protector-strong -pie I, [2024-05-18T15:44:36.253714 #543288] INFO -- : SOLIBS = -lz -lrt -lrt -ldl -lcrypt -lm -lpthread I, [2024-05-18T15:44:36.253723 #543288] INFO -- : LANG = en_US.UTF-8 I, [2024-05-18T15:44:36.253731 #543288] INFO -- : LC_ALL = I, [2024-05-18T15:44:36.253762 #543288] INFO -- : LC_CTYPE = I, [2024-05-18T15:44:36.253770 #543288] INFO -- : MFLAGS = -j3 --jobserver-auth=4,5 I, [2024-05-18T15:44:36.253779 #543288] INFO -- : RUSTC = rustc I, [2024-05-18T15:44:36.253787 #543288] INFO -- : YJIT_RUSTC_ARGS = --crate-name=yjit --crate-type=staticlib --edition=2021 -g -C lto=thin -C opt-level=3 -C overflow-checks=on '--out-dir=/home/opc/ruby/build/master/yjit/target/release/' /home/opc/ruby/src/master/yjit/src/lib.rs I, [2024-05-18T15:44:36.285554 #543288] INFO -- : generating encdb.h I, [2024-05-18T15:44:36.285601 #543288] INFO -- : gcc (GCC) 8.5.0 20210514 (Red Hat 8.5.0-10.1.0.1) I, [2024-05-18T15:44:36.285611 #543288] INFO -- : Copyright (C) 2018 Free Software Foundation, Inc. I, [2024-05-18T15:44:36.285622 #543288] INFO -- : This is free software; see the source for copying conditions. There is NO I, [2024-05-18T15:44:36.285631 #543288] INFO -- : warranty; not even for MERCHANTABILITY or FITNESS FOR A PARTICULAR PURPOSE. I, [2024-05-18T15:44:36.285639 #543288] INFO -- : I, [2024-05-18T15:44:36.291377 #543288] INFO -- : generating enc.mk I, [2024-05-18T15:44:36.322523 #543288] INFO -- : encdb.h unchanged I, [2024-05-18T15:44:36.414946 #543288] INFO -- : Building power_assert@84e85124c5014a139af39161d484156cfe87a9ed to /home/opc/ruby/src/master/gems/power_assert-2.0.3.gem I, [2024-05-18T15:44:36.532222 #543288] INFO -- : Successfully built RubyGem I, [2024-05-18T15:44:36.532514 #543288] INFO -- : Name: power_assert I, [2024-05-18T15:44:36.532539 #543288] INFO -- : Version: 2.0.4dev I, [2024-05-18T15:44:36.532550 #543288] INFO -- : File: power_assert-2.0.4dev.gem I, [2024-05-18T15:44:36.534717 #543288] INFO -- : Extracting bundle gem power_assert-2.0.3... I, [2024-05-18T15:44:36.536333 #543288] INFO -- : making srcs under enc I, [2024-05-18T15:44:36.536475 #543288] INFO -- : making enc I, [2024-05-18T15:44:36.563930 #543288] INFO -- : make[1]: Entering directory '/home/opc/ruby/build/master' I, [2024-05-18T15:44:36.563994 #543288] INFO -- : make[1]: Nothing to be done for 'enc'. I, [2024-05-18T15:44:36.564005 #543288] INFO -- : make[1]: Leaving directory '/home/opc/ruby/build/master' I, [2024-05-18T15:44:36.578459 #543288] INFO -- : make[1]: Entering directory '/home/opc/ruby/build/master' I, [2024-05-18T15:44:36.578523 #543288] INFO -- : make[1]: Nothing to be done for 'srcs'. I, [2024-05-18T15:44:36.578535 #543288] INFO -- : make[1]: Leaving directory '/home/opc/ruby/build/master' I, [2024-05-18T15:44:36.579335 #543288] INFO -- : generating transdb.h I, [2024-05-18T15:44:36.634948 #543288] INFO -- : Try with hash version of bundled gems instead of gems/power_assert-2.0.3.gem. We don't use this gem with release version of Ruby. I, [2024-05-18T15:44:36.646040 #543288] INFO -- : Unpacked gems/power_assert-2.0.4dev.gem I, [2024-05-18T15:44:36.722160 #543288] INFO -- : transdb.h unchanged I, [2024-05-18T15:44:36.723489 #543288] INFO -- : generating makefiles ext/configure-ext.mk I, [2024-05-18T15:44:36.723672 #543288] INFO -- : making trans I, [2024-05-18T15:44:36.762498 #543288] INFO -- : ext/configure-ext.mk unchanged I, [2024-05-18T15:44:36.765483 #543288] INFO -- : make[1]: Entering directory '/home/opc/ruby/build/master' I, [2024-05-18T15:44:36.771917 #543288] INFO -- : make[1]: Entering directory '/home/opc/ruby/build/master' I, [2024-05-18T15:44:36.771962 #543288] INFO -- : make[1]: Nothing to be done for 'trans'. I, [2024-05-18T15:44:36.771975 #543288] INFO -- : make[1]: Leaving directory '/home/opc/ruby/build/master' I, [2024-05-18T15:44:36.890483 #543288] INFO -- : making encs I, [2024-05-18T15:44:36.944721 #543288] INFO -- : make[1]: Entering directory '/home/opc/ruby/build/master' I, [2024-05-18T15:44:36.944806 #543288] INFO -- : make[1]: Nothing to be done for 'encs'. I, [2024-05-18T15:44:36.944841 #543288] INFO -- : make[1]: Leaving directory '/home/opc/ruby/build/master' I, [2024-05-18T15:44:37.514391 #543288] INFO -- : make[1]: Leaving directory '/home/opc/ruby/build/master' I, [2024-05-18T15:44:37.515078 #543288] INFO -- : generating makefile exts.mk I, [2024-05-18T15:44:37.575688 #543288] INFO -- : exts.mk unchanged I, [2024-05-18T15:44:37.580525 #543288] INFO -- : make[1]: Entering directory '/home/opc/ruby/build/master' I, [2024-05-18T15:44:37.684904 #543288] INFO -- : make[2]: Entering directory '/home/opc/ruby/build/master/ext/coverage' I, [2024-05-18T15:44:37.687152 #543288] INFO -- : make[2]: Entering directory '/home/opc/ruby/build/master/ext/digest' I, [2024-05-18T15:44:37.689099 #543288] INFO -- : make[2]: Entering directory '/home/opc/ruby/build/master/ext/date' I, [2024-05-18T15:44:37.690673 #543288] INFO -- : make[2]: Leaving directory '/home/opc/ruby/build/master/ext/coverage' I, [2024-05-18T15:44:37.694308 #543288] INFO -- : make[2]: Leaving directory '/home/opc/ruby/build/master/ext/date' I, [2024-05-18T15:44:37.697859 #543288] INFO -- : make[2]: Leaving directory '/home/opc/ruby/build/master/ext/digest' I, [2024-05-18T15:44:37.702107 #543288] INFO -- : make[2]: Entering directory '/home/opc/ruby/build/master/ext/io/console' I, [2024-05-18T15:44:37.704957 #543288] INFO -- : make[2]: Entering directory '/home/opc/ruby/build/master/ext/fiddle' I, [2024-05-18T15:44:37.707398 #543288] INFO -- : make[2]: Leaving directory '/home/opc/ruby/build/master/ext/io/console' I, [2024-05-18T15:44:37.709633 #543288] INFO -- : make[2]: Entering directory '/home/opc/ruby/build/master/ext/json' I, [2024-05-18T15:44:37.713321 #543288] INFO -- : make[2]: Entering directory '/home/opc/ruby/build/master/ext/monitor' I, [2024-05-18T15:44:37.717770 #543288] INFO -- : make[2]: Leaving directory '/home/opc/ruby/build/master/ext/fiddle' I, [2024-05-18T15:44:37.718659 #543288] INFO -- : make[2]: Leaving directory '/home/opc/ruby/build/master/ext/json' I, [2024-05-18T15:44:37.719723 #543288] INFO -- : make[2]: Leaving directory '/home/opc/ruby/build/master/ext/monitor' I, [2024-05-18T15:44:37.723812 #543288] INFO -- : make[2]: Entering directory '/home/opc/ruby/build/master/ext/pathname' I, [2024-05-18T15:44:37.724016 #543288] INFO -- : make[2]: Entering directory '/home/opc/ruby/build/master/ext/objspace' I, [2024-05-18T15:44:37.729979 #543288] INFO -- : make[2]: Leaving directory '/home/opc/ruby/build/master/ext/objspace' I, [2024-05-18T15:44:37.731176 #543288] INFO -- : make[2]: Leaving directory '/home/opc/ruby/build/master/ext/pathname' I, [2024-05-18T15:44:37.735443 #543288] INFO -- : make[2]: Entering directory '/home/opc/ruby/build/master/ext/pty' I, [2024-05-18T15:44:37.736460 #543288] INFO -- : make[2]: Entering directory '/home/opc/ruby/build/master/ext/psych' I, [2024-05-18T15:44:37.744277 #543288] INFO -- : make[2]: Entering directory '/home/opc/ruby/build/master/ext/openssl' I, [2024-05-18T15:44:37.744317 #543288] INFO -- : make[2]: Leaving directory '/home/opc/ruby/build/master/ext/pty' I, [2024-05-18T15:44:37.755370 #543288] INFO -- : make[2]: Leaving directory '/home/opc/ruby/build/master/ext/psych' I, [2024-05-18T15:44:37.757331 #543288] INFO -- : make[2]: Entering directory '/home/opc/ruby/build/master/ext/rubyvm' I, [2024-05-18T15:44:37.758098 #543288] INFO -- : make[2]: Leaving directory '/home/opc/ruby/build/master/ext/openssl' I, [2024-05-18T15:44:37.762299 #543288] INFO -- : make[2]: Leaving directory '/home/opc/ruby/build/master/ext/rubyvm' I, [2024-05-18T15:44:37.763137 #543288] INFO -- : make[2]: Entering directory '/home/opc/ruby/build/master/ext/ripper' I, [2024-05-18T15:44:37.770407 #543288] INFO -- : make[2]: Entering directory '/home/opc/ruby/build/master/ext/socket' I, [2024-05-18T15:44:37.770531 #543288] INFO -- : make[2]: Leaving directory '/home/opc/ruby/build/master/ext/ripper' I, [2024-05-18T15:44:37.774271 #543288] INFO -- : make[2]: Entering directory '/home/opc/ruby/build/master/.bundle/gems/bigdecimal-3.1.7/ext/bigdecimal' I, [2024-05-18T15:44:37.778853 #543288] INFO -- : make[2]: Entering directory '/home/opc/ruby/build/master/.bundle/gems/bigdecimal-3.1.8/ext/bigdecimal' I, [2024-05-18T15:44:37.783945 #543288] INFO -- : make[2]: Leaving directory '/home/opc/ruby/build/master/ext/socket' I, [2024-05-18T15:44:37.786630 #543288] INFO -- : make[2]: Entering directory '/home/opc/ruby/build/master/.bundle/gems/debug-1.9.2/ext/debug' I, [2024-05-18T15:44:37.807847 #543288] INFO -- : make[2]: Leaving directory '/home/opc/ruby/build/master/.bundle/gems/bigdecimal-3.1.7/ext/bigdecimal' I, [2024-05-18T15:44:37.810402 #543288] INFO -- : make[2]: Entering directory '/home/opc/ruby/build/master/.bundle/gems/nkf-0.2.0/ext/nkf' I, [2024-05-18T15:44:37.811586 #543288] INFO -- : make[2]: Leaving directory '/home/opc/ruby/build/master/.bundle/gems/bigdecimal-3.1.8/ext/bigdecimal' I, [2024-05-18T15:44:37.817608 #543288] INFO -- : make[2]: Leaving directory '/home/opc/ruby/build/master/.bundle/gems/debug-1.9.2/ext/debug' I, [2024-05-18T15:44:37.819598 #543288] INFO -- : make[2]: Entering directory '/home/opc/ruby/build/master/.bundle/gems/racc-1.7.3/ext/racc/cparse' I, [2024-05-18T15:44:37.823013 #543288] INFO -- : make[2]: Entering directory '/home/opc/ruby/build/master/.bundle/gems/rbs-3.4.4/ext/rbs_extension' I, [2024-05-18T15:44:37.842424 #543288] INFO -- : make[2]: Leaving directory '/home/opc/ruby/build/master/.bundle/gems/nkf-0.2.0/ext/nkf' I, [2024-05-18T15:44:37.849258 #543288] INFO -- : make[2]: Entering directory '/home/opc/ruby/build/master/.bundle/gems/syslog-0.1.2/ext/syslog' I, [2024-05-18T15:44:37.850669 #543288] INFO -- : make[2]: Leaving directory '/home/opc/ruby/build/master/.bundle/gems/racc-1.7.3/ext/racc/cparse' I, [2024-05-18T15:44:37.856102 #543288] INFO -- : make[2]: Leaving directory '/home/opc/ruby/build/master/.bundle/gems/rbs-3.4.4/ext/rbs_extension' I, [2024-05-18T15:44:37.867111 #543288] INFO -- : make[2]: Entering directory '/home/opc/ruby/build/master/ext/digest/sha2' I, [2024-05-18T15:44:37.874482 #543288] INFO -- : make[2]: Leaving directory '/home/opc/ruby/build/master/ext/digest/sha2' I, [2024-05-18T15:44:37.880477 #543288] INFO -- : make[2]: Leaving directory '/home/opc/ruby/build/master/.bundle/gems/syslog-0.1.2/ext/syslog' I, [2024-05-18T15:44:37.919127 #543288] INFO -- : make[2]: Entering directory '/home/opc/ruby/build/master' I, [2024-05-18T15:44:38.003460 #543288] INFO -- : make[2]: 'ruby' is up to date. I, [2024-05-18T15:44:38.003553 #543288] INFO -- : make[2]: Leaving directory '/home/opc/ruby/build/master' I, [2024-05-18T15:44:38.003672 #543288] INFO -- : make[1]: Leaving directory '/home/opc/ruby/build/master' I, [2024-05-18T15:44:38.008111 #543288] INFO -- : make[1]: Entering directory '/home/opc/ruby/build/master' I, [2024-05-18T15:44:38.008143 #543288] INFO -- : make[1]: Nothing to be done for 'note'. I, [2024-05-18T15:44:38.008154 #543288] INFO -- : make[1]: Leaving directory '/home/opc/ruby/build/master' I, [2024-05-18T15:44:38.008305 #543288] INFO -- : ./miniruby -I/home/opc/ruby/src/master/lib -I. -I.ext/common /home/opc/ruby/src/master/tool/runruby.rb --extout=.ext -- --disable-gems -r./aarch64-linux-fake /home/opc/ruby/src/master/tool/rbinstall.rb --make="make" --dest-dir="" --extout=".ext" --ext-build-dir="./ext" --mflags="-j3 --jobserver-auth=4,5" --make-flags=" -j3 --jobserver-auth=4,5" --data-mode=0644 --prog-mode=0755 --installed-list .installed.list --mantype="doc" --gnumake --install=all --exclude=doc I, [2024-05-18T15:44:38.159047 #543288] INFO -- : Installing to I, [2024-05-18T15:44:38.159135 #543288] INFO -- : installing binary commands: /home/opc/ruby/install/master/bin I, [2024-05-18T15:44:38.171420 #543288] INFO -- : installing base libraries: /home/opc/ruby/install/master/lib I, [2024-05-18T15:44:38.171922 #543288] INFO -- : installing arch files: /home/opc/ruby/install/master/lib/ruby/3.4.0+0/aarch64-linux I, [2024-05-18T15:44:38.172048 #543288] INFO -- : installing pkgconfig data: /home/opc/ruby/install/master/lib/pkgconfig I, [2024-05-18T15:44:38.172127 #543288] INFO -- : installing extension objects: /home/opc/ruby/install/master/lib/ruby/3.4.0+0/aarch64-linux I, [2024-05-18T15:44:38.188201 #543288] INFO -- : installing extension objects: /home/opc/ruby/install/master/lib/ruby/site_ruby/3.4.0+0/aarch64-linux I, [2024-05-18T15:44:38.188239 #543288] INFO -- : installing extension objects: /home/opc/ruby/install/master/lib/ruby/vendor_ruby/3.4.0+0/aarch64-linux I, [2024-05-18T15:44:38.188461 #543288] INFO -- : installing extension headers: /home/opc/ruby/install/master/include/ruby-3.4.0+0/aarch64-linux I, [2024-05-18T15:44:38.189021 #543288] INFO -- : installing extension scripts: /home/opc/ruby/install/master/lib/ruby/3.4.0+0 I, [2024-05-18T15:44:38.195008 #543288] INFO -- : installing extension scripts: /home/opc/ruby/install/master/lib/ruby/site_ruby/3.4.0+0 I, [2024-05-18T15:44:38.195043 #543288] INFO -- : installing extension scripts: /home/opc/ruby/install/master/lib/ruby/vendor_ruby/3.4.0+0 I, [2024-05-18T15:44:38.195064 #543288] INFO -- : installing extension headers: /home/opc/ruby/install/master/include/ruby-3.4.0+0/ruby I, [2024-05-18T15:44:38.195153 #543288] INFO -- : installing command scripts: /home/opc/ruby/install/master/bin I, [2024-05-18T15:44:38.195284 #543288] INFO -- : installing library scripts: /home/opc/ruby/install/master/lib/ruby/3.4.0+0 I, [2024-05-18T15:44:38.281787 #543288] INFO -- : installing common headers: /home/opc/ruby/install/master/include/ruby-3.4.0+0 I, [2024-05-18T15:44:38.297544 #543288] INFO -- : installing manpages: /home/opc/ruby/install/master/share/man/man1 I, [2024-05-18T15:44:38.297812 #543288] INFO -- : installing default gems from lib: /home/opc/ruby/install/master/lib/ruby/gems/3.4.0+0 I, [2024-05-18T15:44:38.338361 #543288] INFO -- : benchmark 0.3.0 I, [2024-05-18T15:44:38.342547 #543288] INFO -- : bundler 2.6.0.dev I, [2024-05-18T15:44:38.347809 #543288] INFO -- : cgi 0.4.1 I, [2024-05-18T15:44:38.349076 #543288] INFO -- : delegate 0.3.1 I, [2024-05-18T15:44:38.350269 #543288] INFO -- : did_you_mean 1.6.3 I, [2024-05-18T15:44:38.351418 #543288] INFO -- : english 0.8.0 I, [2024-05-18T15:44:38.352587 #543288] INFO -- : erb 4.0.4 I, [2024-05-18T15:44:38.355253 #543288] INFO -- : error_highlight 0.6.0 I, [2024-05-18T15:44:38.356372 #543288] INFO -- : fileutils 1.7.2 I, [2024-05-18T15:44:38.357624 #543288] INFO -- : find 0.2.0 I, [2024-05-18T15:44:38.358720 #543288] INFO -- : forwardable 1.3.3 I, [2024-05-18T15:44:38.359834 #543288] INFO -- : ipaddr 1.2.6 I, [2024-05-18T15:44:38.360973 #543288] INFO -- : irb 1.13.1 I, [2024-05-18T15:44:38.365370 #543288] INFO -- : logger 1.6.0 I, [2024-05-18T15:44:38.366550 #543288] INFO -- : net-http 0.4.1 I, [2024-05-18T15:44:38.367735 #543288] INFO -- : net-protocol 0.2.2 I, [2024-05-18T15:44:38.368913 #543288] INFO -- : open-uri 0.4.1 I, [2024-05-18T15:44:38.370150 #543288] INFO -- : open3 0.2.1 I, [2024-05-18T15:44:38.371280 #543288] INFO -- : optparse 0.5.0 I, [2024-05-18T15:44:38.372427 #543288] INFO -- : ostruct 0.6.0 I, [2024-05-18T15:44:38.373585 #543288] INFO -- : pp 0.5.0 I, [2024-05-18T15:44:38.374779 #543288] INFO -- : prettyprint 0.2.0 I, [2024-05-18T15:44:38.375909 #543288] INFO -- : prism 0.29.0 I, [2024-05-18T15:44:38.377413 #543288] INFO -- : pstore 0.1.3 I, [2024-05-18T15:44:38.378509 #543288] INFO -- : rdoc 6.6.3.1 I, [2024-05-18T15:44:38.382571 #543288] INFO -- : readline 0.0.4 I, [2024-05-18T15:44:38.383677 #543288] INFO -- : reline 0.5.7 I, [2024-05-18T15:44:38.384911 #543288] INFO -- : resolv 0.4.0 I, [2024-05-18T15:44:38.386108 #543288] INFO -- : ruby2_keywords 0.0.5 I, [2024-05-18T15:44:38.387215 #543288] INFO -- : securerandom 0.3.1 I, [2024-05-18T15:44:38.388275 #543288] INFO -- : set 1.1.0 I, [2024-05-18T15:44:38.389469 #543288] INFO -- : shellwords 0.2.0 I, [2024-05-18T15:44:38.390547 #543288] INFO -- : singleton 0.2.0 I, [2024-05-18T15:44:38.391611 #543288] INFO -- : syntax_suggest 2.0.0 I, [2024-05-18T15:44:38.394211 #543288] INFO -- : tempfile 0.2.1 I, [2024-05-18T15:44:38.395296 #543288] INFO -- : time 0.3.0 I, [2024-05-18T15:44:38.396407 #543288] INFO -- : timeout 0.4.1 I, [2024-05-18T15:44:38.398996 #543288] INFO -- : tmpdir 0.2.0 I, [2024-05-18T15:44:38.400108 #543288] INFO -- : tsort 0.2.0 I, [2024-05-18T15:44:38.401277 #543288] INFO -- : un 0.3.0 I, [2024-05-18T15:44:38.402360 #543288] INFO -- : uri 0.13.0 I, [2024-05-18T15:44:38.403479 #543288] INFO -- : weakref 0.1.3 I, [2024-05-18T15:44:38.404599 #543288] INFO -- : yaml 0.3.0 I, [2024-05-18T15:44:38.405515 #543288] INFO -- : installing default gems from ext: /home/opc/ruby/install/master/lib/ruby/gems/3.4.0+0 I, [2024-05-18T15:44:38.415221 #543288] INFO -- : date 3.3.4 I, [2024-05-18T15:44:38.416395 #543288] INFO -- : digest 3.1.1 I, [2024-05-18T15:44:38.417635 #543288] INFO -- : etc 1.4.3 I, [2024-05-18T15:44:38.418820 #543288] INFO -- : fcntl 1.1.0 I, [2024-05-18T15:44:38.419929 #543288] INFO -- : fiddle 1.1.3 I, [2024-05-18T15:44:38.421156 #543288] INFO -- : io-console 0.7.2 I, [2024-05-18T15:44:38.422270 #543288] INFO -- : io-nonblock 0.3.0 I, [2024-05-18T15:44:38.423376 #543288] INFO -- : io-wait 0.3.1 I, [2024-05-18T15:44:38.426108 #543288] INFO -- : json 2.7.2 I, [2024-05-18T15:44:38.427347 #543288] INFO -- : openssl 3.2.0 I, [2024-05-18T15:44:38.428476 #543288] INFO -- : pathname 0.3.0 I, [2024-05-18T15:44:38.429704 #543288] INFO -- : psych 5.1.2 I, [2024-05-18T15:44:38.430936 #543288] INFO -- : stringio 3.1.1 I, [2024-05-18T15:44:38.432061 #543288] INFO -- : strscan 3.1.1 I, [2024-05-18T15:44:38.433221 #543288] INFO -- : zlib 3.1.0 I, [2024-05-18T15:44:38.434145 #543288] INFO -- : installing bundled gems: /home/opc/ruby/install/master/lib/ruby/gems/3.4.0+0 I, [2024-05-18T15:44:38.435095 #543288] INFO -- : minitest 5.23.0 I, [2024-05-18T15:44:38.455015 #543288] INFO -- : rake 13.2.1 I, [2024-05-18T15:44:38.470505 #543288] INFO -- : test-unit 3.6.2 I, [2024-05-18T15:44:38.485769 #543288] INFO -- : rexml 3.2.6 I, [2024-05-18T15:44:38.500292 #543288] INFO -- : rss 0.3.0 I, [2024-05-18T15:44:38.511599 #543288] INFO -- : net-ftp 0.3.4 I, [2024-05-18T15:44:38.515317 #543288] INFO -- : net-imap 0.4.11 I, [2024-05-18T15:44:38.531326 #543288] INFO -- : net-pop 0.1.2 I, [2024-05-18T15:44:38.534237 #543288] INFO -- : net-smtp 0.5.0 I, [2024-05-18T15:44:38.538011 #543288] INFO -- : matrix 0.4.2 I, [2024-05-18T15:44:38.544068 #543288] INFO -- : prime 0.1.2 I, [2024-05-18T15:44:38.555090 #543288] INFO -- : rbs 3.4.4 I, [2024-05-18T15:44:38.659280 #543288] INFO -- : typeprof 0.21.11 I, [2024-05-18T15:44:38.667771 #543288] INFO -- : debug 1.9.2 I, [2024-05-18T15:44:38.685644 #543288] INFO -- : racc 1.7.3 I, [2024-05-18T15:44:38.697739 #543288] INFO -- : mutex_m 0.2.0 I, [2024-05-18T15:44:38.700770 #543288] INFO -- : getoptlong 0.2.1 I, [2024-05-18T15:44:38.705797 #543288] INFO -- : base64 0.2.0 I, [2024-05-18T15:44:38.708235 #543288] INFO -- : bigdecimal 3.1.8 I, [2024-05-18T15:44:38.716710 #543288] INFO -- : observer 0.1.2 I, [2024-05-18T15:44:38.719931 #543288] INFO -- : abbrev 0.1.2 I, [2024-05-18T15:44:38.723029 #543288] INFO -- : resolv-replace 0.1.1 I, [2024-05-18T15:44:38.728090 #543288] INFO -- : rinda 0.2.0 I, [2024-05-18T15:44:38.731737 #543288] INFO -- : drb 2.2.1 I, [2024-05-18T15:44:38.738136 #543288] INFO -- : nkf 0.2.0 I, [2024-05-18T15:44:38.746795 #543288] INFO -- : syslog 0.1.2 I, [2024-05-18T15:44:38.751416 #543288] INFO -- : csv 3.3.0 I, [2024-05-18T15:44:38.761939 #543288] INFO -- : installing bundled gem cache: /home/opc/ruby/install/master/lib/ruby/gems/3.4.0+0/cache I, [2024-05-18T15:44:38.763759 #543288] INFO -- : skipped bundled gems: I, [2024-05-18T15:44:38.763788 #543288] INFO -- : power_assert-2.0.4dev.gem not found in bundled_gems I, [2024-05-18T15:44:38.766753 #543288] INFO -- : $$$[end] "make install -j3" exit with 0. I, [2024-05-18T15:44:38.766903 #543288] INFO -- : $$$[beg] make yes-btest TESTOPTS='-q -j3' I, [2024-05-18T15:45:01.049138 #543288] INFO -- : PASS all 1936 tests E, [2024-05-18T15:45:01.051196 #543288] ERROR -- : I, [2024-05-18T15:45:01.051312 #543288] INFO -- : $$$[end] "make yes-btest TESTOPTS='-q -j3'" exit with 0. I, [2024-05-18T15:45:01.051446 #543288] INFO -- : $$$[beg] make yes-test-basic TESTS='-j3' I, [2024-05-18T15:45:01.143693 #543288] INFO -- : BASERUBY = /usr/local/bin/ruby --disable=gems I, [2024-05-18T15:45:01.143764 #543288] INFO -- : CC = gcc I, [2024-05-18T15:45:01.143777 #543288] INFO -- : LD = ld I, [2024-05-18T15:45:01.143786 #543288] INFO -- : LDSHARED = gcc -shared I, [2024-05-18T15:45:01.143805 #543288] INFO -- : CFLAGS = -O3 -fno-fast-math -ggdb3 -Wall -Wextra -Wdeprecated-declarations -Wdiv-by-zero -Wduplicated-cond -Wimplicit-function-declaration -Wimplicit-int -Wpointer-arith -Wwrite-strings -Wold-style-definition -Wimplicit-fallthrough=0 -Wmissing-noreturn -Wno-cast-function-type -Wno-constant-logical-operand -Wno-long-long -Wno-missing-field-initializers -Wno-overlength-strings -Wno-packed-bitfield-compat -Wno-parentheses-equality -Wno-self-assign -Wno-tautological-compare -Wno-unused-parameter -Wno-unused-value -Wsuggest-attribute=format -Wsuggest-attribute=noreturn -Wunused-variable -Wmisleading-indentation -Wundef I, [2024-05-18T15:45:01.143815 #543288] INFO -- : XCFLAGS = -U_FORTIFY_SOURCE -D_FORTIFY_SOURCE=2 -fstack-protector-strong -msign-return-address=all -fno-strict-overflow -fvisibility=hidden -fexcess-precision=standard -DRUBY_EXPORT -fPIE -I. -I.ext/include/aarch64-linux -I/home/opc/ruby/src/master/include -I/home/opc/ruby/src/master -I/home/opc/ruby/src/master/prism -I/home/opc/ruby/src/master/enc/unicode/15.0.0 I, [2024-05-18T15:45:01.143824 #543288] INFO -- : CPPFLAGS = I, [2024-05-18T15:45:01.143833 #543288] INFO -- : DLDFLAGS = -Wl,--compress-debug-sections=zlib -fstack-protector-strong -pie I, [2024-05-18T15:45:01.143842 #543288] INFO -- : SOLIBS = -lz -lrt -lrt -ldl -lcrypt -lm -lpthread I, [2024-05-18T15:45:01.143851 #543288] INFO -- : LANG = en_US.UTF-8 I, [2024-05-18T15:45:01.145350 #543288] INFO -- : LC_ALL = I, [2024-05-18T15:45:01.145364 #543288] INFO -- : LC_CTYPE = I, [2024-05-18T15:45:01.145372 #543288] INFO -- : MFLAGS = I, [2024-05-18T15:45:01.145380 #543288] INFO -- : RUSTC = rustc I, [2024-05-18T15:45:01.145389 #543288] INFO -- : YJIT_RUSTC_ARGS = --crate-name=yjit --crate-type=staticlib --edition=2021 -g -C lto=thin -C opt-level=3 -C overflow-checks=on '--out-dir=/home/opc/ruby/build/master/yjit/target/release/' /home/opc/ruby/src/master/yjit/src/lib.rs I, [2024-05-18T15:45:01.145415 #543288] INFO -- : gcc (GCC) 8.5.0 20210514 (Red Hat 8.5.0-10.1.0.1) I, [2024-05-18T15:45:01.145424 #543288] INFO -- : Copyright (C) 2018 Free Software Foundation, Inc. I, [2024-05-18T15:45:01.145433 #543288] INFO -- : This is free software; see the source for copying conditions. There is NO I, [2024-05-18T15:45:01.145441 #543288] INFO -- : warranty; not even for MERCHANTABILITY or FITNESS FOR A PARTICULAR PURPOSE. I, [2024-05-18T15:45:01.145449 #543288] INFO -- : I, [2024-05-18T15:45:01.300157 #543288] INFO -- : Checking leaked global symbols...none I, [2024-05-18T15:45:01.354659 #543288] INFO -- : /home/opc/ruby/src/master/basictest/test.rb:assignment ....................................................................................................................................................................................................................................................................................................................................................................................OK 372 I, [2024-05-18T15:45:01.354734 #543288] INFO -- : /home/opc/ruby/src/master/basictest/test.rb:condition ..OK 2 I, [2024-05-18T15:45:01.354759 #543288] INFO -- : /home/opc/ruby/src/master/basictest/test.rb:if/unless ...OK 3 I, [2024-05-18T15:45:01.354810 #543288] INFO -- : /home/opc/ruby/src/master/basictest/test.rb:case .....OK 5 I, [2024-05-18T15:45:01.355395 #543288] INFO -- : /home/opc/ruby/src/master/basictest/test.rb:while/until ........OK 8 I, [2024-05-18T15:45:01.355524 #543288] INFO -- : /home/opc/ruby/src/master/basictest/test.rb:exception ..........OK 10 I, [2024-05-18T15:45:01.356181 #543288] INFO -- : /home/opc/ruby/src/master/basictest/test.rb:array .......................................OK 39 I, [2024-05-18T15:45:01.356461 #543288] INFO -- : /home/opc/ruby/src/master/basictest/test.rb:hash ...........................OK 27 I, [2024-05-18T15:45:01.358263 #543288] INFO -- : /home/opc/ruby/src/master/basictest/test.rb:iterator ...........................................................................................................OK 107 I, [2024-05-18T15:45:01.359044 #543288] INFO -- : /home/opc/ruby/src/master/basictest/test.rb:float ................................................................................OK 80 I, [2024-05-18T15:45:01.362815 #543288] INFO -- : /home/opc/ruby/src/master/basictest/test.rb:bignum ...............................OK 31 I, [2024-05-18T15:45:01.364438 #543288] INFO -- : /home/opc/ruby/src/master/basictest/test.rb:string & char ..............................................................OK 62 I, [2024-05-18T15:45:01.364624 #543288] INFO -- : /home/opc/ruby/src/master/basictest/test.rb:assignment ..........OK 10 I, [2024-05-18T15:45:01.364699 #543288] INFO -- : /home/opc/ruby/src/master/basictest/test.rb:call ......OK 6 I, [2024-05-18T15:45:01.364830 #543288] INFO -- : /home/opc/ruby/src/master/basictest/test.rb:proc .........OK 9 I, [2024-05-18T15:45:01.465295 #543288] INFO -- : /home/opc/ruby/src/master/basictest/test.rb:signal ..OK 2 I, [2024-05-18T15:45:01.466930 #543288] INFO -- : /home/opc/ruby/src/master/basictest/test.rb:eval ...........................OK 27 I, [2024-05-18T15:45:01.598292 #543288] INFO -- : /home/opc/ruby/src/master/basictest/test.rb:system ........OK 8 I, [2024-05-18T15:45:01.598357 #543288] INFO -- : /home/opc/ruby/src/master/basictest/test.rb:const .....OK 5 I, [2024-05-18T15:45:01.598450 #543288] INFO -- : /home/opc/ruby/src/master/basictest/test.rb:clone .....OK 5 I, [2024-05-18T15:45:01.598629 #543288] INFO -- : /home/opc/ruby/src/master/basictest/test.rb:marshal ....OK 4 I, [2024-05-18T15:45:01.598723 #543288] INFO -- : /home/opc/ruby/src/master/basictest/test.rb:pack ....OK 4 I, [2024-05-18T15:45:01.598751 #543288] INFO -- : /home/opc/ruby/src/master/basictest/test.rb:math ..OK 2 I, [2024-05-18T15:45:01.598830 #543288] INFO -- : /home/opc/ruby/src/master/basictest/test.rb:struct ......OK 6 I, [2024-05-18T15:45:01.598978 #543288] INFO -- : /home/opc/ruby/src/master/basictest/test.rb:variable ............OK 12 I, [2024-05-18T15:45:01.599013 #543288] INFO -- : /home/opc/ruby/src/master/basictest/test.rb:trace ...OK 3 I, [2024-05-18T15:45:01.599118 #543288] INFO -- : /home/opc/ruby/src/master/basictest/test.rb:defined? ............OK 12 I, [2024-05-18T15:45:01.599196 #543288] INFO -- : /home/opc/ruby/src/master/basictest/test.rb:alias ......OK 6 I, [2024-05-18T15:45:01.599687 #543288] INFO -- : /home/opc/ruby/src/master/basictest/test.rb:path .......................OK 23 I, [2024-05-18T15:45:01.669873 #543288] INFO -- : /home/opc/ruby/src/master/basictest/test.rb:gc ....OK 4 I, [2024-05-18T15:45:01.671860 #543288] INFO -- : I, [2024-05-18T15:45:01.671896 #543288] INFO -- : test succeeded I, [2024-05-18T15:45:01.672709 #543288] INFO -- : $$$[end] "make yes-test-basic TESTS='-j3'" exit with 0. I, [2024-05-18T15:45:01.672896 #543288] INFO -- : $$$[beg] make yes-test-all TESTOPTS='--stderr-on-failure' TESTS='-j3' I, [2024-05-18T15:45:01.799645 #543288] INFO -- : BASERUBY = /usr/local/bin/ruby --disable=gems I, [2024-05-18T15:45:01.799722 #543288] INFO -- : CC = gcc I, [2024-05-18T15:45:01.799734 #543288] INFO -- : LD = ld I, [2024-05-18T15:45:01.799744 #543288] INFO -- : LDSHARED = gcc -shared I, [2024-05-18T15:45:01.799757 #543288] INFO -- : CFLAGS = -O3 -fno-fast-math -ggdb3 -Wall -Wextra -Wdeprecated-declarations -Wdiv-by-zero -Wduplicated-cond -Wimplicit-function-declaration -Wimplicit-int -Wpointer-arith -Wwrite-strings -Wold-style-definition -Wimplicit-fallthrough=0 -Wmissing-noreturn -Wno-cast-function-type -Wno-constant-logical-operand -Wno-long-long -Wno-missing-field-initializers -Wno-overlength-strings -Wno-packed-bitfield-compat -Wno-parentheses-equality -Wno-self-assign -Wno-tautological-compare -Wno-unused-parameter -Wno-unused-value -Wsuggest-attribute=format -Wsuggest-attribute=noreturn -Wunused-variable -Wmisleading-indentation -Wundef I, [2024-05-18T15:45:01.799767 #543288] INFO -- : XCFLAGS = -U_FORTIFY_SOURCE -D_FORTIFY_SOURCE=2 -fstack-protector-strong -msign-return-address=all -fno-strict-overflow -fvisibility=hidden -fexcess-precision=standard -DRUBY_EXPORT -fPIE -I. -I.ext/include/aarch64-linux -I/home/opc/ruby/src/master/include -I/home/opc/ruby/src/master -I/home/opc/ruby/src/master/prism -I/home/opc/ruby/src/master/enc/unicode/15.0.0 I, [2024-05-18T15:45:01.799777 #543288] INFO -- : CPPFLAGS = I, [2024-05-18T15:45:01.799785 #543288] INFO -- : DLDFLAGS = -Wl,--compress-debug-sections=zlib -fstack-protector-strong -pie I, [2024-05-18T15:45:01.799795 #543288] INFO -- : SOLIBS = -lz -lrt -lrt -ldl -lcrypt -lm -lpthread I, [2024-05-18T15:45:01.799804 #543288] INFO -- : LANG = en_US.UTF-8 I, [2024-05-18T15:45:01.799812 #543288] INFO -- : LC_ALL = I, [2024-05-18T15:45:01.799821 #543288] INFO -- : LC_CTYPE = I, [2024-05-18T15:45:01.799830 #543288] INFO -- : MFLAGS = I, [2024-05-18T15:45:01.799839 #543288] INFO -- : RUSTC = rustc I, [2024-05-18T15:45:01.799848 #543288] INFO -- : YJIT_RUSTC_ARGS = --crate-name=yjit --crate-type=staticlib --edition=2021 -g -C lto=thin -C opt-level=3 -C overflow-checks=on '--out-dir=/home/opc/ruby/build/master/yjit/target/release/' /home/opc/ruby/src/master/yjit/src/lib.rs I, [2024-05-18T15:45:01.800706 #543288] INFO -- : gcc (GCC) 8.5.0 20210514 (Red Hat 8.5.0-10.1.0.1) I, [2024-05-18T15:45:01.800735 #543288] INFO -- : Copyright (C) 2018 Free Software Foundation, Inc. I, [2024-05-18T15:45:01.800745 #543288] INFO -- : This is free software; see the source for copying conditions. There is NO I, [2024-05-18T15:45:01.800755 #543288] INFO -- : warranty; not even for MERCHANTABILITY or FITNESS FOR A PARTICULAR PURPOSE. I, [2024-05-18T15:45:01.800763 #543288] INFO -- : I, [2024-05-18T15:45:01.802857 #543288] INFO -- : generating enc.mk I, [2024-05-18T15:45:02.041988 #543288] INFO -- : generating encdb.h I, [2024-05-18T15:45:02.079054 #543288] INFO -- : encdb.h unchanged I, [2024-05-18T15:45:02.080397 #543288] INFO -- : making enc I, [2024-05-18T15:45:02.107664 #543288] INFO -- : make[1]: Entering directory '/home/opc/ruby/build/master' I, [2024-05-18T15:45:02.107718 #543288] INFO -- : make[1]: Nothing to be done for 'enc'. I, [2024-05-18T15:45:02.107730 #543288] INFO -- : make[1]: Leaving directory '/home/opc/ruby/build/master' I, [2024-05-18T15:45:02.108643 #543288] INFO -- : making srcs under enc I, [2024-05-18T15:45:02.150917 #543288] INFO -- : make[1]: Entering directory '/home/opc/ruby/build/master' I, [2024-05-18T15:45:02.150992 #543288] INFO -- : make[1]: Nothing to be done for 'srcs'. I, [2024-05-18T15:45:02.151003 #543288] INFO -- : make[1]: Leaving directory '/home/opc/ruby/build/master' I, [2024-05-18T15:45:02.152187 #543288] INFO -- : generating transdb.h I, [2024-05-18T15:45:02.295175 #543288] INFO -- : transdb.h unchanged I, [2024-05-18T15:45:02.296544 #543288] INFO -- : making trans I, [2024-05-18T15:45:02.346029 #543288] INFO -- : make[1]: Entering directory '/home/opc/ruby/build/master' I, [2024-05-18T15:45:02.346096 #543288] INFO -- : make[1]: Nothing to be done for 'trans'. I, [2024-05-18T15:45:02.346107 #543288] INFO -- : make[1]: Leaving directory '/home/opc/ruby/build/master' I, [2024-05-18T15:45:02.346950 #543288] INFO -- : making encs I, [2024-05-18T15:45:02.399349 #543288] INFO -- : make[1]: Entering directory '/home/opc/ruby/build/master' I, [2024-05-18T15:45:02.399420 #543288] INFO -- : make[1]: Nothing to be done for 'encs'. I, [2024-05-18T15:45:02.399432 #543288] INFO -- : make[1]: Leaving directory '/home/opc/ruby/build/master' I, [2024-05-18T15:45:02.401448 #543288] INFO -- : generating makefiles ext/configure-ext.mk I, [2024-05-18T15:45:02.440961 #543288] INFO -- : ext/configure-ext.mk updated I, [2024-05-18T15:45:02.444820 #543288] INFO -- : make[1]: Entering directory '/home/opc/ruby/build/master' I, [2024-05-18T15:45:04.503940 #543288] INFO -- : make[1]: Leaving directory '/home/opc/ruby/build/master' I, [2024-05-18T15:45:04.504658 #543288] INFO -- : generating makefile exts.mk I, [2024-05-18T15:45:04.563323 #543288] INFO -- : exts.mk unchanged I, [2024-05-18T15:45:04.568183 #543288] INFO -- : make[1]: Entering directory '/home/opc/ruby/build/master' I, [2024-05-18T15:45:04.865546 #543288] INFO -- : make[2]: Entering directory '/home/opc/ruby/build/master/ext/coverage' I, [2024-05-18T15:45:04.874501 #543288] INFO -- : make[2]: Leaving directory '/home/opc/ruby/build/master/ext/coverage' I, [2024-05-18T15:45:04.880800 #543288] INFO -- : make[2]: Entering directory '/home/opc/ruby/build/master/ext/date' I, [2024-05-18T15:45:04.886785 #543288] INFO -- : make[2]: Leaving directory '/home/opc/ruby/build/master/ext/date' I, [2024-05-18T15:45:04.890246 #543288] INFO -- : make[2]: Entering directory '/home/opc/ruby/build/master/ext/digest' I, [2024-05-18T15:45:04.899406 #543288] INFO -- : make[2]: Leaving directory '/home/opc/ruby/build/master/ext/digest' I, [2024-05-18T15:45:04.922909 #543288] INFO -- : make[2]: Entering directory '/home/opc/ruby/build/master/ext/digest/sha2' I, [2024-05-18T15:45:04.928365 #543288] INFO -- : make[2]: Leaving directory '/home/opc/ruby/build/master/ext/digest/sha2' I, [2024-05-18T15:45:04.946927 #543288] INFO -- : make[2]: Entering directory '/home/opc/ruby/build/master/ext/fiddle' I, [2024-05-18T15:45:04.957437 #543288] INFO -- : make[2]: Leaving directory '/home/opc/ruby/build/master/ext/fiddle' I, [2024-05-18T15:45:04.962249 #543288] INFO -- : make[2]: Entering directory '/home/opc/ruby/build/master/ext/io/console' I, [2024-05-18T15:45:04.966758 #543288] INFO -- : make[2]: Leaving directory '/home/opc/ruby/build/master/ext/io/console' I, [2024-05-18T15:45:04.978750 #543288] INFO -- : make[2]: Entering directory '/home/opc/ruby/build/master/ext/json' I, [2024-05-18T15:45:04.988477 #543288] INFO -- : make[2]: Leaving directory '/home/opc/ruby/build/master/ext/json' I, [2024-05-18T15:45:05.002226 #543288] INFO -- : make[2]: Entering directory '/home/opc/ruby/build/master/ext/monitor' I, [2024-05-18T15:45:05.006660 #543288] INFO -- : make[2]: Leaving directory '/home/opc/ruby/build/master/ext/monitor' I, [2024-05-18T15:45:05.012759 #543288] INFO -- : make[2]: Entering directory '/home/opc/ruby/build/master/ext/objspace' I, [2024-05-18T15:45:05.019039 #543288] INFO -- : make[2]: Leaving directory '/home/opc/ruby/build/master/ext/objspace' I, [2024-05-18T15:45:05.038447 #543288] INFO -- : make[2]: Entering directory '/home/opc/ruby/build/master/ext/openssl' I, [2024-05-18T15:45:05.065183 #543288] INFO -- : make[2]: Leaving directory '/home/opc/ruby/build/master/ext/openssl' I, [2024-05-18T15:45:05.069505 #543288] INFO -- : make[2]: Entering directory '/home/opc/ruby/build/master/ext/pathname' I, [2024-05-18T15:45:05.074111 #543288] INFO -- : make[2]: Leaving directory '/home/opc/ruby/build/master/ext/pathname' I, [2024-05-18T15:45:05.080326 #543288] INFO -- : make[2]: Entering directory '/home/opc/ruby/build/master/ext/psych' I, [2024-05-18T15:45:05.101944 #543288] INFO -- : make[2]: Leaving directory '/home/opc/ruby/build/master/ext/psych' I, [2024-05-18T15:45:05.106716 #543288] INFO -- : make[2]: Entering directory '/home/opc/ruby/build/master/ext/pty' I, [2024-05-18T15:45:05.111010 #543288] INFO -- : make[2]: Leaving directory '/home/opc/ruby/build/master/ext/pty' I, [2024-05-18T15:45:05.124447 #543288] INFO -- : make[2]: Entering directory '/home/opc/ruby/build/master/ext/ripper' I, [2024-05-18T15:45:05.132243 #543288] INFO -- : make[2]: Leaving directory '/home/opc/ruby/build/master/ext/ripper' I, [2024-05-18T15:45:05.134219 #543288] INFO -- : make[2]: Entering directory '/home/opc/ruby/build/master/ext/rubyvm' I, [2024-05-18T15:45:05.137699 #543288] INFO -- : make[2]: Leaving directory '/home/opc/ruby/build/master/ext/rubyvm' I, [2024-05-18T15:45:05.149752 #543288] INFO -- : make[2]: Entering directory '/home/opc/ruby/build/master/ext/socket' I, [2024-05-18T15:45:05.160539 #543288] INFO -- : make[2]: Leaving directory '/home/opc/ruby/build/master/ext/socket' I, [2024-05-18T15:45:05.176415 #543288] INFO -- : make[2]: Entering directory '/home/opc/ruby/build/master/.bundle/gems/bigdecimal-3.1.7/ext/bigdecimal' I, [2024-05-18T15:45:05.207582 #543288] INFO -- : make[2]: Leaving directory '/home/opc/ruby/build/master/.bundle/gems/bigdecimal-3.1.7/ext/bigdecimal' I, [2024-05-18T15:45:05.210229 #543288] INFO -- : make[2]: Entering directory '/home/opc/ruby/build/master/.bundle/gems/bigdecimal-3.1.8/ext/bigdecimal' I, [2024-05-18T15:45:05.240646 #543288] INFO -- : make[2]: Leaving directory '/home/opc/ruby/build/master/.bundle/gems/bigdecimal-3.1.8/ext/bigdecimal' I, [2024-05-18T15:45:05.243202 #543288] INFO -- : make[2]: Entering directory '/home/opc/ruby/build/master/.bundle/gems/debug-1.9.2/ext/debug' I, [2024-05-18T15:45:05.273709 #543288] INFO -- : make[2]: Leaving directory '/home/opc/ruby/build/master/.bundle/gems/debug-1.9.2/ext/debug' I, [2024-05-18T15:45:05.276213 #543288] INFO -- : make[2]: Entering directory '/home/opc/ruby/build/master/.bundle/gems/nkf-0.2.0/ext/nkf' I, [2024-05-18T15:45:05.307131 #543288] INFO -- : make[2]: Leaving directory '/home/opc/ruby/build/master/.bundle/gems/nkf-0.2.0/ext/nkf' I, [2024-05-18T15:45:05.309883 #543288] INFO -- : make[2]: Entering directory '/home/opc/ruby/build/master/.bundle/gems/racc-1.7.3/ext/racc/cparse' I, [2024-05-18T15:45:05.340523 #543288] INFO -- : make[2]: Leaving directory '/home/opc/ruby/build/master/.bundle/gems/racc-1.7.3/ext/racc/cparse' I, [2024-05-18T15:45:05.343512 #543288] INFO -- : make[2]: Entering directory '/home/opc/ruby/build/master/.bundle/gems/rbs-3.4.4/ext/rbs_extension' I, [2024-05-18T15:45:05.391544 #543288] INFO -- : make[2]: Leaving directory '/home/opc/ruby/build/master/.bundle/gems/rbs-3.4.4/ext/rbs_extension' I, [2024-05-18T15:45:05.394225 #543288] INFO -- : make[2]: Entering directory '/home/opc/ruby/build/master/.bundle/gems/syslog-0.1.2/ext/syslog' I, [2024-05-18T15:45:05.425094 #543288] INFO -- : make[2]: Leaving directory '/home/opc/ruby/build/master/.bundle/gems/syslog-0.1.2/ext/syslog' I, [2024-05-18T15:45:05.463366 #543288] INFO -- : make[2]: Entering directory '/home/opc/ruby/build/master' I, [2024-05-18T15:45:05.547190 #543288] INFO -- : make[2]: 'ruby' is up to date. I, [2024-05-18T15:45:05.547264 #543288] INFO -- : make[2]: Leaving directory '/home/opc/ruby/build/master' I, [2024-05-18T15:45:05.547396 #543288] INFO -- : make[1]: Leaving directory '/home/opc/ruby/build/master' I, [2024-05-18T15:45:05.551836 #543288] INFO -- : make[1]: Entering directory '/home/opc/ruby/build/master' I, [2024-05-18T15:45:05.551868 #543288] INFO -- : make[1]: Nothing to be done for 'note'. I, [2024-05-18T15:45:05.551880 #543288] INFO -- : make[1]: Leaving directory '/home/opc/ruby/build/master' I, [2024-05-18T15:45:05.663697 #543288] INFO -- : Run options: I, [2024-05-18T15:45:05.663768 #543288] INFO -- : --seed=39772 I, [2024-05-18T15:45:05.663779 #543288] INFO -- : "--ruby=./miniruby -I/home/opc/ruby/src/master/lib -I. -I.ext/common /home/opc/ruby/src/master/tool/runruby.rb --extout=.ext -- --disable-gems" I, [2024-05-18T15:45:05.663789 #543288] INFO -- : --excludes-dir=/home/opc/ruby/src/master/test/.excludes I, [2024-05-18T15:45:05.663797 #543288] INFO -- : --name=!/memory_leak/ I, [2024-05-18T15:45:05.663806 #543288] INFO -- : --stderr-on-failure I, [2024-05-18T15:45:05.663815 #543288] INFO -- : -j3 I, [2024-05-18T15:45:05.663823 #543288] INFO -- : I, [2024-05-18T15:45:05.663832 #543288] INFO -- : # Running tests: I, [2024-05-18T15:45:05.663841 #543288] INFO -- : I, [2024-05-18T15:45:05.792783 #543288] INFO -- : [ 1/885] 584232=test_gem_request_set_gem_dependency_api I, [2024-05-18T15:45:05.798688 #543288] INFO -- : [ 2/885] 584233=test_name_error_extension I, [2024-05-18T15:45:05.807900 #543288] INFO -- : [ 3/885] 584234=test_rdoc_markup_to_ansi I, [2024-05-18T15:45:05.820639 #543288] INFO -- : [ 4/885] 584233=test_weakkeymap I, [2024-05-18T15:45:05.926645 #543288] INFO -- : [ 5/885] 584233=test_files_test I, [2024-05-18T15:45:05.980608 #543288] INFO -- : [ 6/885] 584234=test_protocol I, [2024-05-18T15:45:05.994949 #543288] INFO -- : [ 7/885] 584233=test_evaluation I, [2024-05-18T15:45:05.999382 #543288] INFO -- : [ 8/885] 584233=test_https I, [2024-05-18T15:45:06.222505 #543288] INFO -- : [ 9/885] 584232=test_gem_commands_info_command I, [2024-05-18T15:45:06.263072 #543288] INFO -- : [ 10/885] 584232=test_object_create_start I, [2024-05-18T15:45:06.267287 #543288] INFO -- : [ 11/885] 584232=test_logdevice I, [2024-05-18T15:45:06.303188 #543288] INFO -- : [ 12/885] 584233=test_ast I, [2024-05-18T15:45:06.333416 #543288] INFO -- : [ 13/885] 584234=test_irb I, [2024-05-18T15:45:06.690620 #543288] INFO -- : [ 14/885] 584234=test_x509cert I, [2024-05-18T15:45:06.783112 #543288] INFO -- : [ 15/885] 584234=test_rdoc_markup_paragraph I, [2024-05-18T15:45:06.827110 #543288] INFO -- : [ 16/885] 584234=test_require_path_check I, [2024-05-18T15:45:06.857781 #543288] INFO -- : [ 17/885] 584234=test_bn I, [2024-05-18T15:45:06.880186 #543288] INFO -- : [ 18/885] 584234=test_variable_name_check I, [2024-05-18T15:45:06.911735 #543288] INFO -- : [ 19/885] 584234=test_rational2 I, [2024-05-18T15:45:06.925382 #543288] INFO -- : [ 20/885] 584234=test_case_comprehensive I, [2024-05-18T15:45:07.172884 #543288] INFO -- : [ 21/885] 584232=test_logperiod I, [2024-05-18T15:45:07.179903 #543288] INFO -- : [ 22/885] 584232=test_placearg I, [2024-05-18T15:45:07.389335 #543288] INFO -- : [ 23/885] 584232=test_ssl_session I, [2024-05-18T15:45:08.214834 #543288] INFO -- : [ 24/885] 584232=test_gem_package_tar_header I, [2024-05-18T15:45:08.268592 #543288] INFO -- : [ 25/885] 584232=test_io_wait_uncommon I, [2024-05-18T15:45:08.287366 #543288] INFO -- : [ 26/885] 584232=test_gem_ci_detector I, [2024-05-18T15:45:08.298195 #543288] INFO -- : [ 27/885] 584232=test_signal I, [2024-05-18T15:45:10.267882 #543288] INFO -- : [ 28/885] 584232=test_gem_silent_ui I, [2024-05-18T15:45:10.313103 #543288] INFO -- : [ 29/885] 584232=test_fixnum I, [2024-05-18T15:45:10.332582 #543288] INFO -- : [ 30/885] 584232=test_continuation I, [2024-05-18T15:45:10.356409 #543288] INFO -- : [ 31/885] 584232=test_file_exhaustive I, [2024-05-18T15:45:10.734909 #543288] INFO -- : Leaked file descriptor: TestFileExhaustive#test_expand_path_home_dir_string: 8 # I, [2024-05-18T15:45:10.735136 #543288] INFO -- : Leaked file descriptor: TestFileExhaustive#test_expand_path_home_dir_string: 9 # I, [2024-05-18T15:45:10.764397 #543288] INFO -- : COMMAND PID USER FD TYPE DEVICE SIZE/OFF NODE NAME I, [2024-05-18T15:45:10.764469 #543288] INFO -- : ruby 584232 opc 8r REG 252,0 9253600 13705411 /var/lib/sss/mc/passwd I, [2024-05-18T15:45:10.764480 #543288] INFO -- : ruby 584232 opc 9u unix 0x0000000000000000 0t0 3038195034 type=STREAM I, [2024-05-18T15:45:15.370401 #543288] INFO -- : [ 32/885] 584232=test_completion I, [2024-05-18T15:45:16.020755 #543288] INFO -- : [ 33/885] 584232=test_handle I, [2024-05-18T15:45:16.307695 #543288] INFO -- : [ 34/885] 584232=parse_stream_test I, [2024-05-18T15:45:16.329148 #543288] INFO -- : [ 35/885] 584232=test_delete I, [2024-05-18T15:45:16.341968 #543288] INFO -- : [ 36/885] 584232=test_rdoc_markup_document I, [2024-05-18T15:45:16.500978 #543288] INFO -- : [ 37/885] 584232=test_gem_security_policy I, [2024-05-18T15:45:16.873678 #543288] INFO -- : [ 38/885] 584232=test_gem_ext_cargo_builder_link_flag_converter I, [2024-05-18T15:45:16.949260 #543288] INFO -- : [ 39/885] 584232=test_gem_local_remote_options I, [2024-05-18T15:45:16.991825 #543288] INFO -- : [ 40/885] 584232=test_rdoc_single_class I, [2024-05-18T15:45:16.997533 #543288] INFO -- : [ 41/885] 584232=test_dup I, [2024-05-18T15:45:17.159338 #543288] INFO -- : [ 42/885] 584232=test_acceptable I, [2024-05-18T15:45:17.213329 #543288] INFO -- : [ 43/885] 584232=test_tmpdir I, [2024-05-18T15:45:17.302081 #543288] INFO -- : [ 44/885] 584232=test_struct I, [2024-05-18T15:45:17.853726 #543288] INFO -- : [ 45/885] 584232=test_rdoc_token_stream I, [2024-05-18T15:45:17.877356 #543288] INFO -- : [ 46/885] 584232=test_mutex I, [2024-05-18T15:45:18.992214 #543288] INFO -- : [ 47/885] 584232=heredoc_dedent_test I, [2024-05-18T15:45:18.999594 #543288] INFO -- : [ 48/885] 584232=test_type I, [2024-05-18T15:45:19.038694 #543288] INFO -- : [ 49/885] 584232=test_fiddle I, [2024-05-18T15:45:19.089396 #543288] INFO -- : [ 50/885] 584232=json_generic_object_test I, [2024-05-18T15:45:19.100927 #543288] INFO -- : [ 51/885] 584232=test_date_arith I, [2024-05-18T15:45:19.111534 #543288] INFO -- : [ 52/885] 584232=test_gem_resolver_vendor_specification I, [2024-05-18T15:45:19.159666 #543288] INFO -- : [ 53/885] 584232=test_ractor I, [2024-05-18T15:45:19.253533 #543288] INFO -- : [ 54/885] 584232=test_exception_at_throwing I, [2024-05-18T15:45:19.279564 #543288] INFO -- : [ 55/885] 584232=test_gem_resolver_installed_specification I, [2024-05-18T15:45:19.307152 #543288] INFO -- : [ 56/885] 584232=test_stringscanner I, [2024-05-18T15:45:19.392771 #543288] INFO -- : [ 57/885] 584232=test_gem_commands_check_command I, [2024-05-18T15:45:19.468899 #543288] INFO -- : [ 58/885] 584232=test_gem_resolver_git_set I, [2024-05-18T15:45:19.998941 #543288] INFO -- : [ 59/885] 584232=test_signedness I, [2024-05-18T15:45:21.976753 #543288] INFO -- : [ 60/885] 584232=test_digest I, [2024-05-18T15:45:22.741594 #543288] INFO -- : [ 61/885] 584232=test_gem_safe_marshal I, [2024-05-18T15:45:23.457159 #543288] INFO -- : [ 62/885] 584232=test_rdoc_ri_driver I, [2024-05-18T15:45:23.886231 #543288] INFO -- : [ 63/885] 584232=test_sexp I, [2024-05-18T15:45:23.945915 #543288] INFO -- : [ 64/885] 584232=test_httpheader I, [2024-05-18T15:45:24.018797 #543288] INFO -- : [ 65/885] 584232=test_ractor I, [2024-05-18T15:45:24.023400 #543288] INFO -- : [ 66/885] 584232=test_rubyvm I, [2024-05-18T15:45:24.032013 #543288] INFO -- : [ 67/885] 584232=fuzzer_test I, [2024-05-18T15:45:24.053131 #543288] INFO -- : [ 68/885] 584232=test_cparser I, [2024-05-18T15:45:24.992159 #543288] INFO -- : [ 69/885] 584232=static_inspect_test I, [2024-05-18T15:45:24.999048 #543288] INFO -- : [ 70/885] 584232=test_struct I, [2024-05-18T15:45:25.026643 #543288] INFO -- : [ 71/885] 584232=test_c_struct_entry I, [2024-05-18T15:45:25.402526 #543288] INFO -- : [ 72/885] 584232=test_rdoc_parser_markdown I, [2024-05-18T15:45:25.406522 #543288] INFO -- : [ 73/885] 584232=test_custom_command I, [2024-05-18T15:45:25.414916 #543288] INFO -- : [ 74/885] 584232=test_depth_first I, [2024-05-18T15:45:25.417630 #543288] INFO -- : [ 75/885] 584232=test_change_word I, [2024-05-18T15:45:25.424725 #543288] INFO -- : [ 76/885] 584232=test_config I, [2024-05-18T15:45:25.463107 #543288] INFO -- : [ 77/885] 584232=test_ostruct I, [2024-05-18T15:45:25.643413 #543288] INFO -- : [ 78/885] 584232=test_abi I, [2024-05-18T15:45:25.670475 #543288] INFO -- : [ 79/885] 584234=test_load I, [2024-05-18T15:45:25.672289 #543288] INFO -- : Leaked file descriptor: TestOptionParserLoad#test_load_xdg_config_home: 7 # I, [2024-05-18T15:45:25.700106 #543288] INFO -- : COMMAND PID USER FD TYPE DEVICE SIZE/OFF NODE NAME I, [2024-05-18T15:45:25.700177 #543288] INFO -- : ruby 584234 opc 7r REG 252,0 9253600 13705411 /var/lib/sss/mc/passwd I, [2024-05-18T15:45:25.727110 #543288] INFO -- : [ 80/885] 584234=test_bundled_ca I, [2024-05-18T15:45:25.743019 #543288] INFO -- : [ 81/885] 584232=test_integer_comb I, [2024-05-18T15:45:27.939488 #543288] INFO -- : [ 82/885] 584234=test_ssl I, [2024-05-18T15:45:28.131054 #543288] INFO -- : [ 83/885] 584232=test_gem_security_trust_dir I, [2024-05-18T15:45:28.175703 #543288] INFO -- : [ 84/885] 584232=test_module I, [2024-05-18T15:45:30.826494 #543288] INFO -- : [ 85/885] 584232=test_erb_command I, [2024-05-18T15:45:30.911630 #543288] INFO -- : [ 86/885] 584232=test_usrmarshal I, [2024-05-18T15:45:31.046858 #543288] INFO -- : [ 87/885] 584232=test_gem_source_installed I, [2024-05-18T15:45:31.061244 #543288] INFO -- : [ 88/885] 584232=test_gem_validator I, [2024-05-18T15:45:31.104952 #543288] INFO -- : [ 89/885] 584232=test_key_error I, [2024-05-18T15:45:31.112092 #543288] INFO -- : [ 90/885] 584232=test_win32ole_param I, [2024-05-18T15:45:31.140704 #543288] INFO -- : [ 91/885] 584232=test_engine I, [2024-05-18T15:45:31.596476 #543288] INFO -- : [ 92/885] 584232=test_gem_commands_mirror I, [2024-05-18T15:45:31.605684 #543288] INFO -- : [ 93/885] 584232=test_fiber I, [2024-05-18T15:45:37.734371 #543288] INFO -- : [ 94/885] 584232=test_gem_package_task I, [2024-05-18T15:45:37.744023 #543288] INFO -- : [ 95/885] 584232=test_lock_native_thread I, [2024-05-18T15:45:38.013484 #543288] INFO -- : [ 96/885] 584232=test_resize I, [2024-05-18T15:45:38.018355 #543288] INFO -- : [ 97/885] 584232=test_require_lib I, [2024-05-18T15:45:38.371876 #543288] INFO -- : [ 98/885] 584234=test_gem_gem_runner I, [2024-05-18T15:45:38.441536 #543288] INFO -- : [ 99/885] 584234=test_metaclass I, [2024-05-18T15:45:38.463048 #543288] INFO -- : [100/885] 584234=test_rdoc_rd_block_parser I, [2024-05-18T15:45:38.490510 #543288] INFO -- : [101/885] 584234=test_x509store I, [2024-05-18T15:45:39.006577 #543288] INFO -- : [102/885] 584234=test_rdoc_rd I, [2024-05-18T15:45:39.013494 #543288] INFO -- : [103/885] 584234=test_rdoc_markup_to_markdown I, [2024-05-18T15:45:39.057340 #543288] INFO -- : [104/885] 584234=test_rdoc_markup_to_joined_paragraph I, [2024-05-18T15:45:39.062854 #543288] INFO -- : [105/885] 584234=test_rdoc_generator_pot I, [2024-05-18T15:45:39.091436 #543288] INFO -- : [106/885] 584234=test_tracer I, [2024-05-18T15:45:39.095685 #543288] INFO -- : [107/885] 584234=test_cgi_cookie I, [2024-05-18T15:45:39.104723 #543288] INFO -- : [108/885] 584234=test_not I, [2024-05-18T15:45:39.121282 #543288] INFO -- : [109/885] 584234=test_option I, [2024-05-18T15:45:39.241768 #543288] INFO -- : [110/885] 584234=test_wss I, [2024-05-18T15:45:39.261845 #543288] INFO -- : [111/885] 584234=test_rdoc_markup_attribute_manager I, [2024-05-18T15:45:39.308881 #543288] INFO -- : [112/885] 584234=test_require I, [2024-05-18T15:45:41.057700 #543288] INFO -- : [113/885] 584232=test_objectspace I, [2024-05-18T15:45:41.920049 #543288] INFO -- : [114/885] 584232=test_debugger_integration I, [2024-05-18T15:45:41.930397 #543288] INFO -- : [115/885] 584232=test_gem_resolver_composed_set I, [2024-05-18T15:45:41.940415 #543288] INFO -- : [116/885] 584232=test_my_integer I, [2024-05-18T15:45:41.949893 #543288] INFO -- : [117/885] 584232=test_cipher I, [2024-05-18T15:45:41.970580 #543288] INFO -- : [118/885] 584234=test_update I, [2024-05-18T15:45:41.982335 #543288] INFO -- : [119/885] 584232=test_new I, [2024-05-18T15:45:41.989953 #543288] INFO -- : [120/885] 584232=test_gem_source_lock I, [2024-05-18T15:45:41.991395 #543288] INFO -- : [121/885] 584234=test_load I, [2024-05-18T15:45:41.997575 #543288] INFO -- : [122/885] 584234=test_win32ole_type I, [2024-05-18T15:45:42.002057 #543288] INFO -- : [123/885] 584234=test_rdoc_rd_inline_parser I, [2024-05-18T15:45:42.019002 #543288] INFO -- : [124/885] 584234=test_win32ole_variant I, [2024-05-18T15:45:42.026452 #543288] INFO -- : [125/885] 584234=magic_comment_test I, [2024-05-18T15:45:42.057105 #543288] INFO -- : [126/885] 584232=test_cgi_modruby I, [2024-05-18T15:45:42.058197 #543288] INFO -- : [127/885] 584232=test_x509attr I, [2024-05-18T15:45:42.064684 #543288] INFO -- : [128/885] 584232=test_printf I, [2024-05-18T15:45:42.088757 #543288] INFO -- : [129/885] 584232=test_workspace I, [2024-05-18T15:45:42.092774 #543288] INFO -- : [130/885] 584234=test_nomethod_error I, [2024-05-18T15:45:42.097838 #543288] INFO -- : [131/885] 584234=test_gem_commands_rebuild_command I, [2024-05-18T15:45:42.194725 #543288] INFO -- : [132/885] 584234=test_etc I, [2024-05-18T15:45:42.224476 #543288] INFO -- : [133/885] 584232=test_stat I, [2024-05-18T15:45:42.229816 #543288] INFO -- : [134/885] 584232=test_win32ole_param_event I, [2024-05-18T15:45:42.232894 #543288] INFO -- : Leaked file descriptor: TestEtc#test_getgrgid: 9 # I, [2024-05-18T15:45:42.245778 #543288] INFO -- : [135/885] 584232=test_https_proxy I, [2024-05-18T15:45:42.249201 #543288] INFO -- : [136/885] 584232=test_rdoc_parser I, [2024-05-18T15:45:42.261617 #543288] INFO -- : COMMAND PID USER FD TYPE DEVICE SIZE/OFF NODE NAME I, [2024-05-18T15:45:42.261663 #543288] INFO -- : ruby 584234 opc 9u unix 0x0000000000000000 0t0 3038197128 type=STREAM I, [2024-05-18T15:45:42.283267 #543288] INFO -- : [137/885] 584232=test_path I, [2024-05-18T15:45:42.292297 #543288] INFO -- : [138/885] 584232=test_digest I, [2024-05-18T15:45:42.303547 #543288] INFO -- : [139/885] 584232=test_rdoc_rd_inline I, [2024-05-18T15:45:42.317852 #543288] INFO -- : [140/885] 584232=test_dir I, [2024-05-18T15:45:42.394570 #543288] INFO -- : [141/885] 584234=test_files_test_1 I, [2024-05-18T15:45:42.641832 #543288] INFO -- : [142/885] 584232=test_closure I, [2024-05-18T15:45:44.885562 #543288] INFO -- : [143/885] 584232=test_resolve_symbol I, [2024-05-18T15:45:44.907250 #543288] INFO -- : [144/885] 584234=test_rubygems I, [2024-05-18T15:45:44.911212 #543288] INFO -- : [145/885] 584232=test_uncorrectable_name_check I, [2024-05-18T15:45:44.968565 #543288] INFO -- : [146/885] 584232=test_io I, [2024-05-18T15:45:45.053162 #543288] INFO -- : [147/885] 584234=test_color I, [2024-05-18T15:45:45.133242 #543288] INFO -- : [148/885] 584234=test_rdoc_top_level I, [2024-05-18T15:45:45.398832 #543288] INFO -- : [149/885] 584234=test_io_m17n I, [2024-05-18T15:45:46.672049 #543288] INFO -- : [150/885] 584234=test_cmethod I, [2024-05-18T15:45:46.680988 #543288] INFO -- : [151/885] 584234=test_gem_stub_specification I, [2024-05-18T15:45:46.832440 #543288] INFO -- : [152/885] 584234=test_float I, [2024-05-18T15:45:47.557597 #543288] INFO -- : [153/885] 584233=test_unicode_normalize I, [2024-05-18T15:45:48.405834 #543288] INFO -- : [154/885] 584234=test_gem_stream_ui I, [2024-05-18T15:45:48.513653 #543288] INFO -- : [155/885] 584234=test_rdoc_generator_ri I, [2024-05-18T15:45:48.518537 #543288] INFO -- : [156/885] 584234=test_propertyputref I, [2024-05-18T15:45:48.523672 #543288] INFO -- : [157/885] 584234=test_gb18030 I, [2024-05-18T15:45:48.535244 #543288] INFO -- : [158/885] 584234=test_gem_commands_lock_command I, [2024-05-18T15:45:48.560166 #543288] INFO -- : [159/885] 584234=test_reline_key I, [2024-05-18T15:45:48.565088 #543288] INFO -- : [160/885] 584234=test_rdoc_generator_pot_po I, [2024-05-18T15:45:48.576615 #543288] INFO -- : [161/885] 584234=test_mul I, [2024-05-18T15:45:48.588002 #543288] INFO -- : [162/885] 584234=test_shellwords I, [2024-05-18T15:45:48.600729 #543288] INFO -- : [163/885] 584234=test_ocsp I, [2024-05-18T15:45:48.698241 #543288] INFO -- : [164/885] 584234=test_scanner_events I, [2024-05-18T15:45:48.747421 #543288] INFO -- : [165/885] 584234=test_ipaddr I, [2024-05-18T15:45:48.804764 #543288] INFO -- : [166/885] 584234=test_date_strptime I, [2024-05-18T15:45:48.889791 #543288] INFO -- : [167/885] 584234=test_omap I, [2024-05-18T15:45:48.897627 #543288] INFO -- : [168/885] 584234=test_nonblock I, [2024-05-18T15:45:48.920249 #543288] INFO -- : [169/885] 584234=test_rdoc_parser_simple I, [2024-05-18T15:45:48.941780 #543288] INFO -- : [170/885] 584234=json_ext_parser_test I, [2024-05-18T15:45:48.960710 #543288] INFO -- : [171/885] 584234=test_gem_ext_configure_builder I, [2024-05-18T15:45:49.006683 #543288] INFO -- : [172/885] 584234=test_gem_package I, [2024-05-18T15:45:49.876762 #543288] INFO -- : [173/885] 584234=test_array I, [2024-05-18T15:45:51.206840 #543288] INFO -- : [174/885] 584233=test_autoload I, [2024-05-18T15:45:53.444975 #543288] INFO -- : [175/885] 584232=test_gem_source I, [2024-05-18T15:45:53.764448 #543288] INFO -- : [176/885] 584232=test_mkmf I, [2024-05-18T15:45:53.841584 #543288] INFO -- : [177/885] 584232=test_have_macro I, [2024-05-18T15:45:54.063111 #543288] INFO -- : [178/885] 584232=test_class I, [2024-05-18T15:45:54.070404 #543288] INFO -- : [179/885] 584232=test_benchmark I, [2024-05-18T15:45:55.476122 #543288] INFO -- : [180/885] 584232=test_at_exit I, [2024-05-18T15:45:55.534893 #543288] INFO -- : [181/885] 584232=test_files_ext I, [2024-05-18T15:45:55.607913 #543288] INFO -- : [182/885] 584232=test_assembler I, [2024-05-18T15:45:55.623048 #543288] INFO -- : [183/885] 584232=test_stringio I, [2024-05-18T15:45:55.642035 #543288] INFO -- : [184/885] 584233=test_thread_cv I, [2024-05-18T15:45:55.699763 #543288] INFO -- : [185/885] 584232=test_random I, [2024-05-18T15:45:55.744817 #543288] INFO -- : [186/885] 584232=test_gem_source_git I, [2024-05-18T15:45:56.303155 #543288] INFO -- : [187/885] 584233=test_regex_casefold I, [2024-05-18T15:45:56.728566 #543288] INFO -- : [188/885] 584233=test_lexer I, [2024-05-18T15:45:56.735242 #543288] INFO -- : [189/885] 584233=test_win32ole_method I, [2024-05-18T15:45:56.745619 #543288] INFO -- : [190/885] 584233=test_ripper I, [2024-05-18T15:45:56.800309 #543288] INFO -- : [191/885] 584232=dispatcher_test I, [2024-05-18T15:45:56.804525 #543288] INFO -- : [192/885] 584232=test_eval_history I, [2024-05-18T15:45:56.836121 #543288] INFO -- : [193/885] 584232=test_unicode I, [2024-05-18T15:45:56.844672 #543288] INFO -- : [194/885] 584232=test_gem_safe_yaml I, [2024-05-18T15:45:56.851099 #543288] INFO -- : [195/885] 584232=test_eval I, [2024-05-18T15:45:56.863411 #543288] INFO -- : [196/885] 584232=test_document I, [2024-05-18T15:45:56.881367 #543288] INFO -- : [197/885] 584232=test_history I, [2024-05-18T15:45:56.920784 #543288] INFO -- : [198/885] 584232=test_gem_commands_setup_command I, [2024-05-18T15:45:57.091983 #543288] INFO -- : [199/885] 584233=test_singleton_function I, [2024-05-18T15:45:57.123050 #543288] INFO -- : [200/885] 584233=command_line_test I, [2024-05-18T15:45:57.150796 #543288] INFO -- : [201/885] 584234=test_pair I, [2024-05-18T15:45:57.170100 #543288] INFO -- : [202/885] 584233=test_win32ole_variant_m I, [2024-05-18T15:45:57.177410 #543288] INFO -- : [203/885] 584233=test_env I, [2024-05-18T15:45:57.780322 #543288] INFO -- : [204/885] 584232=test_gem_commands_signout_command I, [2024-05-18T15:45:57.797629 #543288] INFO -- : [205/885] 584232=test_gem_package_tar_reader I, [2024-05-18T15:45:57.835742 #543288] INFO -- : [206/885] 584232=test_primitive I, [2024-05-18T15:45:57.852916 #543288] INFO -- : [207/885] 584232=test_parser I, [2024-05-18T15:45:57.862890 #543288] INFO -- : [208/885] 584232=test_rdoc_ri_paths I, [2024-05-18T15:45:57.906132 #543288] INFO -- : [209/885] 584232=test_iseq I, [2024-05-18T15:45:58.510963 #543288] INFO -- : [210/885] 584232=test_arithmetic_sequence I, [2024-05-18T15:45:58.559101 #543288] INFO -- : [211/885] 584232=test_ractor_compatibility I, [2024-05-18T15:45:58.873344 #543288] INFO -- : [212/885] 584232=integer_parse_test I, [2024-05-18T15:45:58.881022 #543288] INFO -- : [213/885] 584232=test_autoconf I, [2024-05-18T15:45:58.892534 #543288] INFO -- : [214/885] 584232=test_find_executable I, [2024-05-18T15:45:58.899720 #543288] INFO -- : [215/885] 584232=test_lazy_enumerator I, [2024-05-18T15:45:59.329010 #543288] INFO -- : [216/885] 584232=test_cgi_multipart I, [2024-05-18T15:45:59.426598 #543288] INFO -- : [217/885] 584232=test_gem_request_set_lockfile_tokenizer I, [2024-05-18T15:45:59.525177 #543288] INFO -- : [218/885] 584232=test_gem_source_fetch_problem I, [2024-05-18T15:45:59.537938 #543288] INFO -- : [219/885] 584232=test_encoding I, [2024-05-18T15:45:59.556849 #543288] INFO -- : [220/885] 584232=test_install I, [2024-05-18T15:45:59.714542 #543288] INFO -- : [221/885] 584233=test_rdoc_comment I, [2024-05-18T15:45:59.738529 #543288] INFO -- : [222/885] 584232=test_sockopt I, [2024-05-18T15:45:59.743866 #543288] INFO -- : [223/885] 584232=test_ftp I, [2024-05-18T15:45:59.744288 #543288] INFO -- : [224/885] 584232=test_helper I, [2024-05-18T15:45:59.748873 #543288] INFO -- : [225/885] 584232=test_duplicate I, [2024-05-18T15:45:59.758826 #543288] INFO -- : [226/885] 584232=test_gem_resolver_api_set I, [2024-05-18T15:45:59.826338 #543288] INFO -- : [227/885] 584232=format_errors_test I, [2024-05-18T15:45:59.828401 #543288] INFO -- : [228/885] 584232=test_cgi_header I, [2024-05-18T15:45:59.835151 #543288] INFO -- : [229/885] 584232=test_case_options I, [2024-05-18T15:45:59.853777 #543288] INFO -- : [230/885] 584232=test_addr I, [2024-05-18T15:45:59.868614 #543288] INFO -- : [231/885] 584232=test_mailto I, [2024-05-18T15:45:59.871505 #543288] INFO -- : [232/885] 584232=test_kill_ring I, [2024-05-18T15:45:59.881429 #543288] INFO -- : [233/885] 584233=test_member I, [2024-05-18T15:45:59.885328 #543288] INFO -- : [234/885] 584233=test_object I, [2024-05-18T15:45:59.894532 #543288] INFO -- : [235/885] 584232=test_nofree I, [2024-05-18T15:45:59.905369 #543288] INFO -- : [236/885] 584232=test_whileuntil I, [2024-05-18T15:45:59.909349 #543288] INFO -- : [237/885] 584232=test_regexp I, [2024-05-18T15:45:59.924704 #543288] INFO -- : [238/885] 584233=test_pointer I, [2024-05-18T15:46:01.395493 #543288] INFO -- : [239/885] 584233=test_rdoc_normal_class I, [2024-05-18T15:46:01.496780 #543288] INFO -- : [240/885] 584233=test_within_pipe I, [2024-05-18T15:46:01.565855 #543288] INFO -- : [241/885] 584233=test_eval I, [2024-05-18T15:46:01.832180 #543288] INFO -- : [242/885] 584233=test_beginendblock I, [2024-05-18T15:46:02.145322 #543288] INFO -- : [243/885] 584233=test_monitor I, [2024-05-18T15:46:02.407252 #543288] INFO -- : [244/885] 584233=test_ruby_lex I, [2024-05-18T15:46:02.529252 #543288] INFO -- : [245/885] 584234=test_arith_seq_extract I, [2024-05-18T15:46:02.543198 #543288] INFO -- : [246/885] 584233=compiler_test I, [2024-05-18T15:46:02.593580 #543288] INFO -- : [247/885] 584233=test_gem_source_subpath_problem I, [2024-05-18T15:46:02.652473 #543288] INFO -- : [248/885] 584234=test_object_references I, [2024-05-18T15:46:02.725413 #543288] INFO -- : [249/885] 584234=test_gem_installer I, [2024-05-18T15:46:03.065915 #543288] INFO -- : [250/885] 584233=test_bug_reporter I, [2024-05-18T15:46:03.080118 #543288] INFO -- : [251/885] 584233=test_buffered_io I, [2024-05-18T15:46:03.096933 #543288] INFO -- : [252/885] 584233=test_ossl I, [2024-05-18T15:46:07.639512 #543288] INFO -- : [253/885] 584234=test_arity I, [2024-05-18T15:46:07.648565 #543288] INFO -- : [254/885] 584234=test_gem_path_support I, [2024-05-18T15:46:07.716002 #543288] INFO -- : [255/885] 584234=test_keyword I, [2024-05-18T15:46:08.219201 #543288] INFO -- : [256/885] 584234=test_win32ole_type_event I, [2024-05-18T15:46:08.241617 #543288] INFO -- : [257/885] 584234=test_trace I, [2024-05-18T15:46:08.252327 #543288] INFO -- : [258/885] 584234=test_scalar_scanner I, [2024-05-18T15:46:08.266939 #543288] INFO -- : [259/885] 584234=test_lambda I, [2024-05-18T15:46:08.324636 #543288] INFO -- : [260/885] 584234=test_rb_str_dup I, [2024-05-18T15:46:08.334673 #543288] INFO -- : [261/885] 584234=bom_test I, [2024-05-18T15:46:08.353903 #543288] INFO -- : [262/885] 584234=test_file I, [2024-05-18T15:46:10.516239 #543288] INFO -- : [263/885] 584233=test_config I, [2024-05-18T15:46:10.833507 #543288] INFO -- : [264/885] 584233=test_summary I, [2024-05-18T15:46:10.969417 #543288] INFO -- : [265/885] 584233=test_helper_method I, [2024-05-18T15:46:10.982569 #543288] INFO -- : [266/885] 584233=test_x509ext I, [2024-05-18T15:46:10.993682 #543288] INFO -- : [267/885] 584233=test_emitter I, [2024-05-18T15:46:11.009622 #543288] INFO -- : [268/885] 584233=test_rdoc_markup_to_html I, [2024-05-18T15:46:11.170458 #543288] INFO -- : [269/885] 584233=test_foreach I, [2024-05-18T15:46:11.179156 #543288] INFO -- : [270/885] 584233=test_append I, [2024-05-18T15:46:11.198204 #543288] INFO -- : [271/885] 584233=test_gem_resolver_installer_set I, [2024-05-18T15:46:11.448462 #543288] INFO -- : [272/885] 584233=test_debug I, [2024-05-18T15:46:11.660857 #543288] INFO -- : [273/885] 584233=test_refinement I, [2024-05-18T15:46:14.566434 #543288] INFO -- : [274/885] 584234=test_transcode I, [2024-05-18T15:46:14.765632 #543288] INFO -- : [275/885] 584234=test_class2name I, [2024-05-18T15:46:14.779556 #543288] INFO -- : [276/885] 584234=test_gem_commands_cleanup_command I, [2024-05-18T15:46:15.452630 #543288] INFO -- : [277/885] 584233=test_pattern_key_name_check I, [2024-05-18T15:46:15.474215 #543288] INFO -- : [278/885] 584233=test_profile_frames I, [2024-05-18T15:46:15.555060 #543288] INFO -- : [279/885] 584234=test_rdoc_markup_heading I, [2024-05-18T15:46:15.583288 #543288] INFO -- : [280/885] 584234=test_flip I, [2024-05-18T15:46:15.647662 #543288] INFO -- : [281/885] 584234=test_io_console I, [2024-05-18T15:46:15.759428 #543288] INFO -- : [282/885] 584233=test_dns I, [2024-05-18T15:46:16.217348 #543288] INFO -- : [283/885] 584233=test_c_union_entity I, [2024-05-18T15:46:16.397491 #543288] INFO -- : [284/885] 584233=test_notimplement I, [2024-05-18T15:46:16.397567 #543288] INFO -- : [285/885] 584233=test_cgi_session I, [2024-05-18T15:46:16.446645 #543288] INFO -- : [286/885] 584233=test_x509crl I, [2024-05-18T15:46:16.532758 #543288] INFO -- : [287/885] 584233=test_win32ole_event I, [2024-05-18T15:46:16.594066 #543288] INFO -- : [288/885] 584233=test_gem_commands_uninstall_command I, [2024-05-18T15:46:17.361665 #543288] INFO -- : [289/885] 584233=test_rdoc_markup_formatter I, [2024-05-18T15:46:17.396553 #543288] INFO -- : [290/885] 584233=test_compile_prism I, [2024-05-18T15:46:17.707357 #543288] INFO -- : [291/885] 584233=test_helper I, [2024-05-18T15:46:17.720028 #543288] INFO -- : [292/885] 584233=test_getopts I, [2024-05-18T15:46:17.730603 #543288] INFO -- : [293/885] 584233=test_emitter I, [2024-05-18T15:46:17.818488 #543288] INFO -- : [294/885] 584233=test_fips I, [2024-05-18T15:46:18.018696 #543288] INFO -- : [295/885] 584233=test_alias I, [2024-05-18T15:46:18.176587 #543288] INFO -- : [296/885] 584233=test_gem_ext_cmake_builder I, [2024-05-18T15:46:18.197885 #543288] INFO -- : [297/885] 584233=test_digest_extend I, [2024-05-18T15:46:18.212632 #543288] INFO -- : [298/885] 584233=test_last_thread I, [2024-05-18T15:46:18.327129 #543288] INFO -- : [299/885] 584234=test_thread_fd_close I, [2024-05-18T15:46:18.357652 #543288] INFO -- : [300/885] 584234=test_gem_commands_exec_command I, [2024-05-18T15:46:19.050489 #543288] INFO -- : [301/885] 584232=unescape_test I, [2024-05-18T15:46:19.284315 #543288] INFO -- : [302/885] 584233=test_color_printer I, [2024-05-18T15:46:19.318726 #543288] INFO -- : [303/885] 584233=test_super I, [2024-05-18T15:46:19.656126 #543288] INFO -- : [304/885] 584234=test_gem_resolver I, [2024-05-18T15:46:19.942258 #543288] INFO -- : [305/885] 584234=test_gem_source_vendor I, [2024-05-18T15:46:19.949740 #543288] INFO -- : [306/885] 584234=test_object I, [2024-05-18T15:46:20.355545 #543288] INFO -- : [307/885] 584234=test_dln I, [2024-05-18T15:46:20.364291 #543288] INFO -- : [308/885] 584234=json_encoding_test I, [2024-05-18T15:46:20.365965 #543288] INFO -- : [309/885] 584234=test_vm_dump I, [2024-05-18T15:46:20.373142 #543288] INFO -- : [310/885] 584234=test_func I, [2024-05-18T15:46:20.668679 #543288] INFO -- : [311/885] 584232=test_config I, [2024-05-18T15:46:20.700641 #543288] INFO -- : [312/885] 584232=test_modify_expand I, [2024-05-18T15:46:20.724314 #543288] INFO -- : [313/885] 584232=test_pkg_config I, [2024-05-18T15:46:20.735293 #543288] INFO -- : [314/885] 584232=test_gem_available_set I, [2024-05-18T15:46:21.053373 #543288] INFO -- : [315/885] 584232=test_convertible I, [2024-05-18T15:46:21.322900 #543288] INFO -- : [316/885] 584233=errors_test I, [2024-05-18T15:46:21.411534 #543288] INFO -- : [317/885] 584233=test_insns_leaf I, [2024-05-18T15:46:21.428678 #543288] INFO -- : [318/885] 584233=test_gem_console_ui I, [2024-05-18T15:46:21.801490 #543288] INFO -- : [319/885] 584233=test_allocation I, [2024-05-18T15:46:24.261624 #543288] INFO -- : [320/885] 584233=test_ifunless I, [2024-05-18T15:46:24.278814 #543288] INFO -- : [321/885] 584233=test_x509req I, [2024-05-18T15:46:24.296869 #543288] INFO -- : [322/885] 584233=test_readpartial I, [2024-05-18T15:46:24.727794 #543288] INFO -- : [323/885] 584233=test_httpresponse I, [2024-05-18T15:46:24.846832 #543288] INFO -- : [324/885] 584233=test_rdoc_parser_ruby I, [2024-05-18T15:46:25.247963 #543288] INFO -- : [325/885] 584232=json_generator_test I, [2024-05-18T15:46:25.360422 #543288] INFO -- : [326/885] 584232=test_ansi_without_terminfo I, [2024-05-18T15:46:25.372713 #543288] INFO -- : [327/885] 584232=test_ractor I, [2024-05-18T15:46:25.391797 #543288] INFO -- : [328/885] 584232=test_registry I, [2024-05-18T15:46:25.391863 #543288] INFO -- : [329/885] 584232=test_gem I, [2024-05-18T15:46:26.256738 #543288] INFO -- : [330/885] 584234=test_gem_resolver_best_set I, [2024-05-18T15:46:26.292601 #543288] INFO -- : [331/885] 584233=test_cgi_core I, [2024-05-18T15:46:26.308750 #543288] INFO -- : [332/885] 584233=test_parser I, [2024-05-18T15:46:26.332697 #543288] INFO -- : [333/885] 584233=test_rdoc_markup_to_label I, [2024-05-18T15:46:26.344735 #543288] INFO -- : [334/885] 584234=test_rdoc_markup_hard_break I, [2024-05-18T15:46:26.360698 #543288] INFO -- : [335/885] 584234=test_marshal I, [2024-05-18T15:46:26.375507 #543288] INFO -- : [336/885] 584233=test_ancdata I, [2024-05-18T15:46:26.436470 #543288] INFO -- : [337/885] 584233=ractor_test I, [2024-05-18T15:46:26.509463 #543288] INFO -- : [338/885] 584233=test_nesting_parser I, [2024-05-18T15:46:26.528082 #543288] INFO -- : [339/885] 584233=test_enc_str_buf_cat I, [2024-05-18T15:46:26.539667 #543288] INFO -- : [340/885] 584233=test_bignum I, [2024-05-18T15:46:27.357261 #543288] INFO -- : [341/885] 584234=newline_test I, [2024-05-18T15:46:27.459949 #543288] INFO -- : [342/885] 584234=test_gem_commands_help_command I, [2024-05-18T15:46:27.498033 #543288] INFO -- : [343/885] 584234=test_scheduler I, [2024-05-18T15:46:27.646978 #543288] INFO -- : [344/885] 584234=test_ssl I, [2024-05-18T15:46:27.872747 #543288] INFO -- : [345/885] 584232=test_gem_resolver_conflict I, [2024-05-18T15:46:27.891850 #543288] INFO -- : [346/885] 584232=test_ractor I, [2024-05-18T15:46:27.956568 #543288] INFO -- : [347/885] 584234=test_gem_resolver_local_specification I, [2024-05-18T15:46:27.974006 #543288] INFO -- : [348/885] 584234=test_configuration I, [2024-05-18T15:46:28.132656 #543288] INFO -- : [349/885] 584234=test_date_new I, [2024-05-18T15:46:28.141486 #543288] INFO -- : [350/885] 584234=test_gem_commands_list_command I, [2024-05-18T15:46:28.153744 #543288] INFO -- : [351/885] 584234=test_date_marshal I, [2024-05-18T15:46:28.224408 #543288] INFO -- : [352/885] 584234=test_have_func I, [2024-05-18T15:46:28.235042 #543288] INFO -- : [353/885] 584232=test_unix I, [2024-05-18T15:46:28.282783 #543288] INFO -- : [354/885] 584232=test_integer I, [2024-05-18T15:46:29.447508 #543288] INFO -- : [355/885] 584234=test_gem_commands_contents_command I, [2024-05-18T15:46:29.552829 #543288] INFO -- : [356/885] 584234=test_context I, [2024-05-18T15:46:29.652056 #543288] INFO -- : [357/885] 584234=test_udp I, [2024-05-18T15:46:29.685571 #543288] INFO -- : [358/885] 584234=test_symbol I, [2024-05-18T15:46:30.162824 #543288] INFO -- : [359/885] 584233=test_gem_commands_search_command I, [2024-05-18T15:46:30.180899 #543288] INFO -- : [360/885] 584233=test_rdoc_servlet I, [2024-05-18T15:46:30.358335 #543288] INFO -- : [361/885] 584233=test_coder I, [2024-05-18T15:46:30.379658 #543288] INFO -- : [362/885] 584233=test_formatter I, [2024-05-18T15:46:30.441501 #543288] INFO -- : [363/885] 584233=test_extlibs I, [2024-05-18T15:46:30.826213 #543288] INFO -- : [364/885] 584232=test_iter_break I, [2024-05-18T15:46:30.829753 #543288] INFO -- : [365/885] 584232=test_range I, [2024-05-18T15:46:31.581548 #543288] INFO -- : [366/885] 584232=test_gem_commands_signin_command I, [2024-05-18T15:46:31.752226 #543288] INFO -- : [367/885] 584232=test_recursion I, [2024-05-18T15:46:31.765236 #543288] INFO -- : [368/885] 584232=test_require I, [2024-05-18T15:46:31.995028 #543288] INFO -- : [369/885] 584233=test_rdoc_markup_include I, [2024-05-18T15:46:32.005180 #543288] INFO -- : [370/885] 584233=test_enum I, [2024-05-18T15:46:33.023024 #543288] INFO -- : [371/885] 584232=test_rbconfig I, [2024-05-18T15:46:33.034904 #543288] INFO -- : [372/885] 584232=test_num2int I, [2024-05-18T15:46:33.046641 #543288] INFO -- : [373/885] 584232=test_locale I, [2024-05-18T15:46:33.097974 #543288] INFO -- : [374/885] 584233=test_ts I, [2024-05-18T15:46:33.110368 #543288] INFO -- : [375/885] 584232=test_address_resolve I, [2024-05-18T15:46:33.122682 #543288] INFO -- : [376/885] 584232=test_stream I, [2024-05-18T15:46:33.133172 #543288] INFO -- : [377/885] 584232=test_trick I, [2024-05-18T15:46:33.439427 #543288] INFO -- : [378/885] 584233=test_ractor I, [2024-05-18T15:46:33.448485 #543288] INFO -- : [379/885] 584233=test_rdoc_attr I, [2024-05-18T15:46:33.467386 #543288] INFO -- : [380/885] 584233=location_test I, [2024-05-18T15:46:33.606792 #543288] INFO -- : [381/885] 584233=test_chilled I, [2024-05-18T15:46:33.618767 #543288] INFO -- : [382/885] 584233=test_delegate I, [2024-05-18T15:46:33.692553 #543288] INFO -- : [383/885] 584233=test_project_sanity I, [2024-05-18T15:46:33.701365 #543288] INFO -- : [384/885] 584233=test_symbol I, [2024-05-18T15:46:33.712893 #543288] INFO -- : [385/885] 584233=test_alias_and_anchor I, [2024-05-18T15:46:33.726796 #543288] INFO -- : [386/885] 584233=test_time I, [2024-05-18T15:46:33.861694 #543288] INFO -- : [387/885] 584234=test_popen_deadlock I, [2024-05-18T15:46:33.910930 #543288] INFO -- : [388/885] 584233=test_ensured I, [2024-05-18T15:46:33.962553 #543288] INFO -- : [389/885] 584233=test_euc_jp I, [2024-05-18T15:46:33.975956 #543288] INFO -- : [390/885] 584233=test_rdoc_markup I, [2024-05-18T15:46:33.978298 #543288] INFO -- : [391/885] 584233=test_key_stroke I, [2024-05-18T15:46:34.034667 #543288] INFO -- : [392/885] 584233=test_sleep I, [2024-05-18T15:46:34.455948 #543288] INFO -- : [393/885] 584234=test_webauthn_listener_response I, [2024-05-18T15:46:34.481286 #543288] INFO -- : [394/885] 584234=ruby_api_test I, [2024-05-18T15:46:34.668819 #543288] INFO -- : [395/885] 584234=test_gem_resolver_index_set I, [2024-05-18T15:46:35.036001 #543288] INFO -- : [396/885] 584234=test_gc I, [2024-05-18T15:46:35.582555 #543288] INFO -- : [397/885] 584232=test_gem_bundler_version_finder I, [2024-05-18T15:46:35.619933 #543288] INFO -- : [398/885] 584232=test_gem_request_set I, [2024-05-18T15:46:36.118461 #543288] INFO -- : [399/885] 584232=test_set_len I, [2024-05-18T15:46:36.123806 #543288] INFO -- : [400/885] 584232=constant_path_node_test I, [2024-05-18T15:46:36.127649 #543288] INFO -- : [401/885] 584232=test_interned_str I, [2024-05-18T15:46:36.132417 #543288] INFO -- : [402/885] 584232=test_folderitem2_invokeverb I, [2024-05-18T15:46:36.148526 #543288] INFO -- : [403/885] 584232=test_pattern_matching I, [2024-05-18T15:46:36.215154 #543288] INFO -- : [404/885] 584232=test_inlinecache I, [2024-05-18T15:46:36.225830 #543288] INFO -- : [405/885] 584232=test_socket I, [2024-05-18T15:46:37.120982 #543288] INFO -- : [406/885] 584232=test_terminfo I, [2024-05-18T15:46:37.133106 #543288] INFO -- : [407/885] 584232=test_thread I, [2024-05-18T15:46:39.011633 #543288] INFO -- : [408/885] 584233=test_data I, [2024-05-18T15:46:39.078106 #543288] INFO -- : [409/885] 584233=test_bug-14834 I, [2024-05-18T15:46:39.083841 #543288] INFO -- : [410/885] 584233=test_addrinfo I, [2024-05-18T15:46:39.095503 #543288] INFO -- : Leaked file descriptor: TestSocketAddrinfo#test_addrinfo_timeout: 10 # I, [2024-05-18T15:46:39.125428 #543288] INFO -- : COMMAND PID USER FD TYPE DEVICE SIZE/OFF NODE NAME I, [2024-05-18T15:46:39.125501 #543288] INFO -- : ruby 584233 opc 10u unix 0x0000000000000000 0t0 3038207112 type=STREAM I, [2024-05-18T15:46:39.229786 #543288] INFO -- : [411/885] 584233=test_to_ruby I, [2024-05-18T15:46:39.248385 #543288] INFO -- : [412/885] 584233=test_time_tz I, [2024-05-18T15:46:39.399425 #543288] INFO -- : [413/885] 584233=test_gem_ext_builder I, [2024-05-18T15:46:40.504941 #543288] INFO -- : [414/885] 584233=test_to_ary_concat I, [2024-05-18T15:46:44.004378 #543288] INFO -- : [415/885] 584234=test_history I, [2024-05-18T15:46:44.017699 #543288] INFO -- : [416/885] 584234=test_windows_1251 I, [2024-05-18T15:46:44.025994 #543288] INFO -- : [417/885] 584234=test_ellipsize I, [2024-05-18T15:46:44.054655 #543288] INFO -- : [418/885] 584234=test_call I, [2024-05-18T15:46:44.269261 #543288] INFO -- : [419/885] 584234=test_gem_commands_build_command I, [2024-05-18T15:46:44.621009 #543288] INFO -- : [420/885] 584234=test_reline I, [2024-05-18T15:46:44.903368 #543288] INFO -- : [421/885] 584234=test_key_actor_vi I, [2024-05-18T15:46:45.039403 #543288] INFO -- : [422/885] 584234=test_postponed_job I, [2024-05-18T15:46:45.301385 #543288] INFO -- : [423/885] 584234=test_gem_request_set_lockfile I, [2024-05-18T15:46:45.311219 #543288] INFO -- : [424/885] 584233=test_rdoc_markdown I, [2024-05-18T15:46:45.553061 #543288] INFO -- : [425/885] 584233=test_rdoc_encoding I, [2024-05-18T15:46:45.635987 #543288] INFO -- : [426/885] 584233=test_win32ole_variant_outarg I, [2024-05-18T15:46:45.649840 #543288] INFO -- : [427/885] 584233=test_generic I, [2024-05-18T15:46:45.677436 #543288] INFO -- : [428/885] 584233=test_common I, [2024-05-18T15:46:45.752559 #543288] INFO -- : [429/885] 584234=test_rdoc_markup_to_html_snippet I, [2024-05-18T15:46:45.820816 #543288] INFO -- : [430/885] 584234=test_httpresponses I, [2024-05-18T15:46:45.828563 #543288] INFO -- : [431/885] 584234=test_deprecate I, [2024-05-18T15:46:45.852373 #543288] INFO -- : [432/885] 584232=test_rdoc_constant I, [2024-05-18T15:46:45.854912 #543288] INFO -- : [433/885] 584233=test_rdoc_text I, [2024-05-18T15:46:45.873973 #543288] INFO -- : [434/885] 584234=library_symbols_test I, [2024-05-18T15:46:45.884011 #543288] INFO -- : [435/885] 584234=test_require I, [2024-05-18T15:46:45.885815 #543288] INFO -- : [436/885] 584234=test_stringify_symbols I, [2024-05-18T15:46:45.898843 #543288] INFO -- : [437/885] 584233=test_objspace I, [2024-05-18T15:46:45.905277 #543288] INFO -- : [438/885] 584234=test_stream I, [2024-05-18T15:46:45.914366 #543288] INFO -- : [439/885] 584234=test_have_library I, [2024-05-18T15:46:46.024419 #543288] INFO -- : [440/885] 584232=test_ns_spki I, [2024-05-18T15:46:46.031890 #543288] INFO -- : [441/885] 584232=test_rdoc_markup_indented_paragraph I, [2024-05-18T15:46:46.048802 #543288] INFO -- : [442/885] 584232=test_rdoc_markup_parser I, [2024-05-18T15:46:46.111653 #543288] INFO -- : [443/885] 584232=test_iseq_load I, [2024-05-18T15:46:46.790719 #543288] INFO -- : [444/885] 584234=test_kwargs I, [2024-05-18T15:46:46.830060 #543288] INFO -- : [445/885] 584234=test_rdoc_parser_c I, [2024-05-18T15:46:47.243547 #543288] INFO -- : [446/885] 584232=test_pack I, [2024-05-18T15:46:47.326841 #543288] INFO -- : [447/885] 584234=test_io_wait I, [2024-05-18T15:46:47.508551 #543288] INFO -- : [448/885] 584232=parse_test I, [2024-05-18T15:46:47.663173 #543288] INFO -- : [449/885] 584234=test_gem_doctor I, [2024-05-18T15:46:47.742291 #543288] INFO -- : [450/885] 584234=json_fixtures_test I, [2024-05-18T15:46:47.752044 #543288] INFO -- : [451/885] 584234=test_len I, [2024-05-18T15:46:47.756872 #543288] INFO -- : [452/885] 584234=test_gem_commands_outdated_command I, [2024-05-18T15:46:47.829852 #543288] INFO -- : [453/885] 584234=test_gem_dependency_list I, [2024-05-18T15:46:47.934479 #543288] INFO -- : [454/885] 584234=parameters_signature_test I, [2024-05-18T15:46:48.006477 #543288] INFO -- : [455/885] 584234=test_rdoc_parser_changelog I, [2024-05-18T15:46:48.131634 #543288] INFO -- : [456/885] 584234=test_tsort I, [2024-05-18T15:46:48.147639 #543288] INFO -- : [457/885] 584234=test_gem_commands_fetch_command I, [2024-05-18T15:46:48.325942 #543288] INFO -- : [458/885] 584234=test_typeddata I, [2024-05-18T15:46:48.592715 #543288] INFO -- : [459/885] 584234=test_securerandom I, [2024-05-18T15:46:48.644683 #543288] INFO -- : [460/885] 584234=test_rdoc_markup_attributes I, [2024-05-18T15:46:48.653809 #543288] INFO -- : [461/885] 584234=redundant_return_test I, [2024-05-18T15:46:48.657832 #543288] INFO -- : [462/885] 584234=test_rand I, [2024-05-18T15:46:49.226185 #543288] INFO -- : [463/885] 584234=test_random_formatter I, [2024-05-18T15:46:49.227917 #543288] INFO -- : [464/885] 584234=test_string_processing I, [2024-05-18T15:46:49.236692 #543288] INFO -- : [465/885] 584234=test_bmethod I, [2024-05-18T15:46:49.251072 #543288] INFO -- : [466/885] 584234=test_gem_source_specific_file I, [2024-05-18T15:46:49.347857 #543288] INFO -- : [467/885] 584234=test_provider I, [2024-05-18T15:46:49.349721 #543288] INFO -- : [468/885] 584234=test_euc_kr I, [2024-05-18T15:46:49.357766 #543288] INFO -- : [469/885] 584234=test_rdoc_code_object I, [2024-05-18T15:46:49.711196 #543288] INFO -- : [470/885] 584234=test_process I, [2024-05-18T15:46:50.216212 #543288] INFO -- : [471/885] 584232=test_multi_irb_commands I, [2024-05-18T15:46:50.231197 #543288] INFO -- : [472/885] 584232=test_pkey_dh I, [2024-05-18T15:46:51.547171 #543288] INFO -- : [473/885] 584232=test_m17n_comb I, [2024-05-18T15:46:53.967838 #543288] INFO -- : [474/885] 584232=test_null I, [2024-05-18T15:46:54.024406 #543288] INFO -- : [475/885] 584232=test_ractor I, [2024-05-18T15:46:54.030937 #543288] INFO -- : [476/885] 584232=test_data I, [2024-05-18T15:46:54.046786 #543288] INFO -- : [477/885] 584232=test_memory_view I, [2024-05-18T15:46:54.061277 #543288] INFO -- : [478/885] 584232=test_bigzero I, [2024-05-18T15:46:54.081322 #543288] INFO -- : [479/885] 584232=test_gem_commands_query_command I, [2024-05-18T15:46:54.688194 #543288] INFO -- : [480/885] 584232=test_gem_platform I, [2024-05-18T15:46:54.793283 #543288] INFO -- : [481/885] 584232=test_win32ole_typelib I, [2024-05-18T15:46:54.800586 #543288] INFO -- : [482/885] 584232=test_pkey I, [2024-05-18T15:46:54.809598 #543288] INFO -- : [483/885] 584232=test_external_new I, [2024-05-18T15:46:54.825089 #543288] INFO -- : [484/885] 584232=test_thread I, [2024-05-18T15:46:55.040513 #543288] INFO -- : [485/885] 584232=test_gem_security_signer I, [2024-05-18T15:46:55.181591 #543288] INFO -- : [486/885] 584232=test_config I, [2024-05-18T15:46:55.206335 #543288] INFO -- : [487/885] 584232=test_complex2 I, [2024-05-18T15:46:55.289115 #543288] INFO -- : [488/885] 584232=test_gem_util I, [2024-05-18T15:46:55.376671 #543288] INFO -- : [489/885] 584232=test_gem_unsatisfiable_dependency_error I, [2024-05-18T15:46:55.399942 #543288] INFO -- : [490/885] 584232=test_literal I, [2024-05-18T15:46:55.927979 #543288] INFO -- : [491/885] 584232=test_io I, [2024-05-18T15:46:56.128773 #543288] INFO -- : [492/885] 584232=test_rdoc_i18n_text I, [2024-05-18T15:46:56.140100 #543288] INFO -- : [493/885] 584232=test_input_method I, [2024-05-18T15:46:56.175038 #543288] INFO -- : [494/885] 584232=test_bash_completion I, [2024-05-18T15:46:56.200052 #543288] INFO -- : [495/885] 584232=test_exception I, [2024-05-18T15:47:00.315639 #543288] INFO -- : [496/885] 584232=test_rdoc_markup_to_html_crossref I, [2024-05-18T15:47:00.611791 #543288] INFO -- : [497/885] 584232=test_files_test_2 I, [2024-05-18T15:47:00.620241 #543288] INFO -- : [498/885] 584232=test_div I, [2024-05-18T15:47:00.629819 #543288] INFO -- : [499/885] 584232=test_rdoc_context_section I, [2024-05-18T15:47:00.642993 #543288] INFO -- : [500/885] 584232=test_io_buffer I, [2024-05-18T15:47:00.759621 #543288] INFO -- : [501/885] 584232=test_deprecated I, [2024-05-18T15:47:00.760313 #543288] INFO -- : [502/885] 584232=test_optparse I, [2024-05-18T15:47:00.775437 #543288] INFO -- : [503/885] 584232=test_gem_commands_environment_command I, [2024-05-18T15:47:00.845966 #543288] INFO -- : [504/885] 584232=test_pkcs7 I, [2024-05-18T15:47:01.012765 #543288] INFO -- : [505/885] 584232=test_pack I, [2024-05-18T15:47:01.204553 #543288] INFO -- : [506/885] 584232=test_class_name_check I, [2024-05-18T15:47:01.245899 #543288] INFO -- : [507/885] 584232=test_scalar I, [2024-05-18T15:47:01.272276 #543288] INFO -- : [508/885] 584232=test_syntax I, [2024-05-18T15:47:07.673784 #543288] INFO -- : [509/885] 584234=test_zsh_completion I, [2024-05-18T15:47:07.684832 #543288] INFO -- : [510/885] 584234=test_basicsocket I, [2024-05-18T15:47:07.712923 #543288] INFO -- : [511/885] 584234=test_gem_commands_cert_command I, [2024-05-18T15:47:10.001367 #543288] INFO -- : [512/885] 584232=test_gem_commands_stale_command I, [2024-05-18T15:47:10.009232 #543288] INFO -- : [513/885] 584232=ruby_parser_test I, [2024-05-18T15:47:10.022556 #543288] INFO -- : [514/885] 584232=test_rdoc_markup_to_tt_only I, [2024-05-18T15:47:10.062846 #543288] INFO -- : [515/885] 584232=test_ws I, [2024-05-18T15:47:10.133575 #543288] INFO -- : [516/885] 584232=test_date_strftime I, [2024-05-18T15:47:10.402470 #543288] INFO -- : [517/885] 584234=json_parser_test I, [2024-05-18T15:47:10.555154 #543288] INFO -- : [518/885] 584234=test_timeout I, [2024-05-18T15:47:10.566809 #543288] INFO -- : [519/885] 584232=test_rdoc_markup_to_bs I, [2024-05-18T15:47:10.619740 #543288] INFO -- : [520/885] 584232=test_key_name_check I, [2024-05-18T15:47:10.628350 #543288] INFO -- : [521/885] 584232=test_rdoc_markup_raw I, [2024-05-18T15:47:10.644069 #543288] INFO -- : [522/885] 584232=test_weakref I, [2024-05-18T15:47:10.996854 #543288] INFO -- : [523/885] 584232=test_instrumentation_api I, [2024-05-18T15:47:11.289703 #543288] INFO -- : [524/885] 584234=test_rdoc_alias I, [2024-05-18T15:47:11.299603 #543288] INFO -- : [525/885] 584234=test_singleton I, [2024-05-18T15:47:11.309772 #543288] INFO -- : [526/885] 584234=test_fstring I, [2024-05-18T15:47:11.424775 #543288] INFO -- : [527/885] 584234=test_numeric I, [2024-05-18T15:47:11.612795 #543288] INFO -- : [528/885] 584234=test_gem_ext_rake_builder I, [2024-05-18T15:47:12.128954 #543288] INFO -- : [529/885] 584234=test_rdoc_require I, [2024-05-18T15:47:12.134705 #543288] INFO -- : [530/885] 584234=test_word I, [2024-05-18T15:47:12.145600 #543288] INFO -- : [531/885] 584234=test_psych I, [2024-05-18T15:47:12.197249 #543288] INFO -- : [532/885] 584234=test_nil I, [2024-05-18T15:47:12.208947 #543288] INFO -- : [533/885] 584234=test_wait I, [2024-05-18T15:47:12.336100 #543288] INFO -- : [534/885] 584234=test_import I, [2024-05-18T15:47:13.935457 #543288] INFO -- : [535/885] 584232=test_human_typo I, [2024-05-18T15:47:13.945359 #543288] INFO -- : [536/885] 584232=test_big2str I, [2024-05-18T15:47:13.952283 #543288] INFO -- : [537/885] 584232=test_gem_resolver_specification I, [2024-05-18T15:47:13.993074 #543288] INFO -- : [538/885] 584232=test_pkey_dsa I, [2024-05-18T15:47:15.260726 #543288] INFO -- : [539/885] 584234=test_logger I, [2024-05-18T15:47:15.290702 #543288] INFO -- : [540/885] 584234=test_gem_commands_yank_command I, [2024-05-18T15:47:15.808895 #543288] INFO -- : [541/885] 584234=test_yaml_tree I, [2024-05-18T15:47:16.326898 #543288] INFO -- : [542/885] 584234=test_cstr I, [2024-05-18T15:47:17.951048 #543288] INFO -- : [543/885] 584232=test_gem_resolver_dependency_request I, [2024-05-18T15:47:17.988924 #543288] INFO -- : [544/885] 584232=test_command I, [2024-05-18T15:47:18.194171 #543288] INFO -- : [545/885] 584234=test_euc_tw I, [2024-05-18T15:47:18.214125 #543288] INFO -- : [546/885] 584234=test_rdoc_rdoc I, [2024-05-18T15:47:18.216577 #543288] INFO -- : [547/885] 584232=test_yjit_exit_locations I, [2024-05-18T15:47:18.224358 #543288] INFO -- : [548/885] 584232=test_rdoc_markdown_test I, [2024-05-18T15:47:18.305974 #543288] INFO -- : [549/885] 584234=test_io_timeout I, [2024-05-18T15:47:18.322311 #543288] INFO -- : [550/885] 584234=test_rdoc_normal_module I, [2024-05-18T15:47:18.356650 #543288] INFO -- : [551/885] 584234=test_type_completor I, [2024-05-18T15:47:18.373134 #543288] INFO -- : [552/885] 584234=json_string_matching_test I, [2024-05-18T15:47:18.387093 #543288] INFO -- : [553/885] 584234=test_gem_config_file I, [2024-05-18T15:47:18.586101 #543288] INFO -- : [554/885] 584234=test_comparable I, [2024-05-18T15:47:18.598138 #543288] INFO -- : [555/885] 584234=test_ldap I, [2024-05-18T15:47:18.608662 #543288] INFO -- : [556/885] 584234=test_kdf I, [2024-05-18T15:47:18.789878 #543288] INFO -- : [557/885] 584234=test_thread_queue I, [2024-05-18T15:47:19.379557 #543288] INFO -- : [558/885] 584232=test_nowrite I, [2024-05-18T15:47:19.402864 #543288] INFO -- : [559/885] 584232=test_passing_block I, [2024-05-18T15:47:19.418172 #543288] INFO -- : [560/885] 584232=test_defined I, [2024-05-18T15:47:19.520553 #543288] INFO -- : [561/885] 584232=test_io_buffer I, [2024-05-18T15:47:19.616348 #543288] INFO -- : [562/885] 584232=test_pathname I, [2024-05-18T15:47:19.829360 #543288] INFO -- : [563/885] 584232=test_fnmatch I, [2024-05-18T15:47:19.873464 #543288] INFO -- : [564/885] 584232=test_store I, [2024-05-18T15:47:20.162203 #543288] INFO -- : [565/885] 584232=test_rdoc_markup_pre_process I, [2024-05-18T15:47:20.351050 #543288] INFO -- : [566/885] 584232=test_tempfile I, [2024-05-18T15:47:20.572374 #543288] INFO -- : [567/885] 584232=test_http_request I, [2024-05-18T15:47:20.592833 #543288] INFO -- : [568/885] 584232=test_coverage I, [2024-05-18T15:47:21.256770 #543288] INFO -- : [569/885] 584232=test_tree_builder I, [2024-05-18T15:47:21.266590 #543288] INFO -- : [570/885] 584232=test_protect I, [2024-05-18T15:47:21.271659 #543288] INFO -- : [571/885] 584232=test_big5 I, [2024-05-18T15:47:21.280132 #543288] INFO -- : [572/885] 584232=test_date I, [2024-05-18T15:47:21.337267 #543288] INFO -- : [573/885] 584232=test_gem_commands_update_command I, [2024-05-18T15:47:22.874490 #543288] INFO -- : [574/885] 584232=test_webauthn_poller I, [2024-05-18T15:47:23.023245 #543288] INFO -- : [575/885] 584232=test_rdoc_markup_verbatim I, [2024-05-18T15:47:23.032670 #543288] INFO -- : [576/885] 584232=test_date_conv I, [2024-05-18T15:47:23.039164 #543288] INFO -- : [577/885] 584232=test_serialize_subclasses I, [2024-05-18T15:47:23.050090 #543288] INFO -- : [578/885] 584232=test_gem_resolver_index_specification I, [2024-05-18T15:47:23.099415 #543288] INFO -- : [579/885] 584232=test_frozen I, [2024-05-18T15:47:23.142883 #543288] INFO -- : [580/885] 584232=test_egrep_cpp I, [2024-05-18T15:47:23.195708 #543288] INFO -- : [581/885] 584232=test_erb_m17n I, [2024-05-18T15:47:23.202133 #543288] INFO -- : [582/885] 584232=test_rdoc_generator_pot_po_entry I, [2024-05-18T15:47:23.214217 #543288] INFO -- : [583/885] 584232=test_timeout I, [2024-05-18T15:47:23.222114 #543288] INFO -- : [584/885] 584232=test_enumerator_kw I, [2024-05-18T15:47:23.229157 #543288] INFO -- : [585/885] 584232=test_marshalable I, [2024-05-18T15:47:23.238794 #543288] INFO -- : [586/885] 584232=test_line_editor I, [2024-05-18T15:47:23.247307 #543288] INFO -- : [587/885] 584232=reflection_test I, [2024-05-18T15:47:23.249456 #543288] INFO -- : [588/885] 584232=test_files_lib I, [2024-05-18T15:47:23.323084 #543288] INFO -- : [589/885] 584232=test_string_memory I, [2024-05-18T15:47:23.459670 #543288] INFO -- : [590/885] 584232=test_help I, [2024-05-18T15:47:23.467667 #543288] INFO -- : [591/885] 584232=test_complexrational I, [2024-05-18T15:47:23.469657 #543288] INFO -- : [592/885] 584232=test_raise I, [2024-05-18T15:47:23.474335 #543288] INFO -- : [593/885] 584232=version_test I, [2024-05-18T15:47:23.485181 #543288] INFO -- : [594/885] 584232=test_string I, [2024-05-18T15:47:23.504891 #543288] INFO -- : [595/885] 584232=json_common_interface_test I, [2024-05-18T15:47:23.523552 #543288] INFO -- : [596/885] 584232=test_rdoc_any_method I, [2024-05-18T15:47:23.893904 #543288] INFO -- : [597/885] 584232=test_error_highlight I, [2024-05-18T15:47:24.402065 #543288] INFO -- : [598/885] 584232=test_function_entry I, [2024-05-18T15:47:24.418638 #543288] INFO -- : [599/885] 584232=test_time I, [2024-05-18T15:47:24.539091 #543288] INFO -- : [600/885] 584232=test_file I, [2024-05-18T15:47:24.547540 #543288] INFO -- : [601/885] 584232=test_capacity I, [2024-05-18T15:47:24.561188 #543288] INFO -- : [602/885] 584232=test_nextafter I, [2024-05-18T15:47:24.654967 #543288] INFO -- : [603/885] 584232=test_gem_commands_owner_command I, [2024-05-18T15:47:24.760696 #543288] INFO -- : [604/885] 584234=test_rat I, [2024-05-18T15:47:24.778377 #543288] INFO -- : [605/885] 584234=test_init I, [2024-05-18T15:47:25.115397 #543288] INFO -- : [606/885] 584234=test_gem_request_connection_pools I, [2024-05-18T15:47:25.478214 #543288] INFO -- : [607/885] 584232=test_flags I, [2024-05-18T15:47:25.865065 #543288] INFO -- : [608/885] 584232=test_numeric I, [2024-05-18T15:47:25.929620 #543288] INFO -- : [609/885] 584232=test_yamlstore I, [2024-05-18T15:47:25.953808 #543288] INFO -- : [610/885] 584232=test_bug-3571 I, [2024-05-18T15:47:25.961578 #543288] INFO -- : [611/885] 584232=test_rdoc_generator_markup I, [2024-05-18T15:47:26.124544 #543288] INFO -- : [612/885] 584232=test_constant I, [2024-05-18T15:47:26.170422 #543288] INFO -- : [613/885] 584234=test_find I, [2024-05-18T15:47:26.198070 #543288] INFO -- : [614/885] 584234=test_hmac I, [2024-05-18T15:47:26.269648 #543288] INFO -- : [615/885] 584234=test_encoding I, [2024-05-18T15:47:26.409715 #543288] INFO -- : [616/885] 584234=test_gem_resolver_activation_request I, [2024-05-18T15:47:26.431472 #543288] INFO -- : [617/885] 584234=test_function I, [2024-05-18T15:47:26.685802 #543288] INFO -- : [618/885] 584234=test_gem_commands_server_command I, [2024-05-18T15:47:26.726775 #543288] INFO -- : [619/885] 584234=test_string I, [2024-05-18T15:47:27.888884 #543288] INFO -- : [620/885] 584232=test_macro I, [2024-05-18T15:47:27.896257 #543288] INFO -- : [621/885] 584232=test_pipe I, [2024-05-18T15:47:28.023819 #543288] INFO -- : [622/885] 584232=test_gem_requirement I, [2024-05-18T15:47:28.171768 #543288] INFO -- : [623/885] 584232=test_win32ole_method_event I, [2024-05-18T15:47:28.183317 #543288] INFO -- : [624/885] 584232=test_tcp I, [2024-05-18T15:47:28.229906 #543288] INFO -- : [625/885] 584232=parse_comments_test I, [2024-05-18T15:47:28.237234 #543288] INFO -- : [626/885] 584232=test_rdoc_markup_to_table_of_contents I, [2024-05-18T15:47:28.281528 #543288] INFO -- : [627/885] 584232=test_gem_name_tuple I, [2024-05-18T15:47:28.300301 #543288] INFO -- : [628/885] 584232=test_integer I, [2024-05-18T15:47:28.364653 #543288] INFO -- : [629/885] 584232=test_reqarg I, [2024-05-18T15:47:28.737570 #543288] INFO -- : [630/885] 584232=test_frozen_error I, [2024-05-18T15:47:28.856863 #543288] INFO -- : [631/885] 584232=test_gem_ext_ext_conf_builder I, [2024-05-18T15:47:29.884045 #543288] INFO -- : [632/885] 584232=test_gem_version I, [2024-05-18T15:47:29.986378 #543288] INFO -- : [633/885] 584232=test_spell_checker I, [2024-05-18T15:47:29.993325 #543288] INFO -- : [634/885] 584232=test_path_to_class I, [2024-05-18T15:47:30.003238 #543288] INFO -- : [635/885] 584232=test_enumerator I, [2024-05-18T15:47:30.010675 #543288] INFO -- : [636/885] 584232=test_bug-5832 I, [2024-05-18T15:47:30.017285 #543288] INFO -- : [637/885] 584232=test_yield_block I, [2024-05-18T15:47:30.088752 #543288] INFO -- : [638/885] 584232=test_c_struct_builder I, [2024-05-18T15:47:30.402555 #543288] INFO -- : [639/885] 584232=test_gem_package_tar_reader_entry I, [2024-05-18T15:47:30.693475 #543288] INFO -- : [640/885] 584232=test_resource I, [2024-05-18T15:47:30.712514 #543288] INFO -- : [641/885] 584232=test_gem_uri I, [2024-05-18T15:47:30.755340 #543288] INFO -- : [642/885] 584232=test_rdoc_include I, [2024-05-18T15:47:30.779733 #543288] INFO -- : [643/885] 584232=test_win32ole_record I, [2024-05-18T15:47:30.790551 #543288] INFO -- : [644/885] 584232=test_gem_version_option I, [2024-05-18T15:47:30.850772 #543288] INFO -- : [645/885] 584232=test_date_compat I, [2024-05-18T15:47:30.868034 #543288] INFO -- : [646/885] 584232=test_ubf_async_safe I, [2024-05-18T15:47:30.879596 #543288] INFO -- : [647/885] 584232=test_pstore I, [2024-05-18T15:47:31.130510 #543288] INFO -- : [648/885] 584232=test_zlib I, [2024-05-18T15:47:42.304315 #543288] INFO -- : [649/885] 584232=test_rdoc_options I, [2024-05-18T15:47:42.663694 #543288] INFO -- : [650/885] 584232=test_gem_ext_cargo_builder I, [2024-05-18T15:47:42.665683 #543288] INFO -- : [651/885] 584232=test_console_attr I, [2024-05-18T15:47:42.696648 #543288] INFO -- : [652/885] 584232=test_proc I, [2024-05-18T15:47:43.595781 #543288] INFO -- : [653/885] 584232=test_gem_commands_unpack_command I, [2024-05-18T15:47:43.925126 #543288] INFO -- : [654/885] 584232=test_emoji I, [2024-05-18T15:47:44.026690 #543288] INFO -- : [655/885] 584232=test_sorted_set I, [2024-05-18T15:47:44.169486 #543288] INFO -- : [656/885] 584232=test_windows_1252 I, [2024-05-18T15:47:44.364773 #543288] INFO -- : [657/885] 584232=test_stack I, [2024-05-18T15:47:44.913769 #543288] INFO -- : [658/885] 584233=test_jaro_winkler I, [2024-05-18T15:47:44.922562 #543288] INFO -- : [659/885] 584233=test_cp949 I, [2024-05-18T15:47:44.936731 #543288] INFO -- : [660/885] 584233=test_gem_resolver_vendor_set I, [2024-05-18T15:47:44.962195 #543288] INFO -- : [661/885] 584233=test_condition I, [2024-05-18T15:47:44.974534 #543288] INFO -- : [662/885] 584233=test_gem_dependency_resolution_error I, [2024-05-18T15:47:45.002496 #543288] INFO -- : [663/885] 584233=test_fileutils I, [2024-05-18T15:47:45.078846 #543288] INFO -- : Leaked file descriptor: TestFileUtils#test_chown_error: 11 # I, [2024-05-18T15:47:45.116076 #543288] INFO -- : COMMAND PID USER FD TYPE DEVICE SIZE/OFF NODE NAME I, [2024-05-18T15:47:45.116149 #543288] INFO -- : ruby 584233 opc 11r REG 252,0 9253600 13705411 /var/lib/sss/mc/passwd I, [2024-05-18T15:47:45.275025 #543288] INFO -- : [664/885] 584232=test_sleep I, [2024-05-18T15:47:45.661981 #543288] INFO -- : [665/885] 584233=test_mixed_unicode_escapes I, [2024-05-18T15:47:45.675739 #543288] INFO -- : [666/885] 584233=test_econv I, [2024-05-18T15:47:46.544787 #543288] INFO -- : [667/885] 584233=test_gem_install_update_options I, [2024-05-18T15:47:46.756383 #543288] INFO -- : [668/885] 584233=test_face I, [2024-05-18T15:47:46.800400 #543288] INFO -- : [669/885] 584233=test_gem_request_set_lockfile_parser I, [2024-05-18T15:47:47.277629 #543288] INFO -- : [670/885] 584233=test_sizeof I, [2024-05-18T15:47:47.325729 #543288] INFO -- : [671/885] 584232=test_date_attr I, [2024-05-18T15:47:47.463398 #543288] INFO -- : [672/885] 584232=test_stringchar I, [2024-05-18T15:47:47.490215 #543288] INFO -- : [673/885] 584232=warnings_test I, [2024-05-18T15:47:47.508118 #543288] INFO -- : [674/885] 584232=test_flush I, [2024-05-18T15:47:47.518216 #543288] INFO -- : [675/885] 584232=test_pkey_rsa I, [2024-05-18T15:47:47.829386 #543288] INFO -- : [676/885] 584232=test_system I, [2024-05-18T15:47:48.721480 #543288] INFO -- : [677/885] 584232=test_numhash I, [2024-05-18T15:47:48.771626 #543288] INFO -- : [678/885] 584232=test_gem_specification I, [2024-05-18T15:47:49.355833 #543288] INFO -- : [679/885] 584233=test_win32ole_variable I, [2024-05-18T15:47:49.357298 #543288] INFO -- : [680/885] 584233=test_method_cache I, [2024-05-18T15:47:49.376482 #543288] INFO -- : [681/885] 584233=test_parse I, [2024-05-18T15:47:49.840276 #543288] INFO -- : [682/885] 584233=test_rdoc_cross_reference I, [2024-05-18T15:47:50.238745 #543288] INFO -- : [683/885] 584233=test_rdoc_class_module I, [2024-05-18T15:47:50.734058 #543288] INFO -- : [684/885] 584233=test_gem_command_manager I, [2024-05-18T15:47:50.882502 #543288] INFO -- : [685/885] 584233=test_rdoc_context I, [2024-05-18T15:47:51.357188 #543288] INFO -- : [686/885] 584232=test_array I, [2024-05-18T15:47:51.375166 #543288] INFO -- : [687/885] 584232=test_case I, [2024-05-18T15:47:51.412691 #543288] INFO -- : [688/885] 584232=test_open-uri I, [2024-05-18T15:47:51.623815 #543288] INFO -- : [689/885] 584233=test_enc_associate I, [2024-05-18T15:47:51.865234 #543288] INFO -- : [690/885] 584232=test_enumerator I, [2024-05-18T15:47:52.066200 #543288] INFO -- : [691/885] 584233=test_sprintf I, [2024-05-18T15:47:52.291620 #543288] INFO -- : [692/885] 584233=test_exit I, [2024-05-18T15:47:52.447651 #543288] INFO -- : [693/885] 584233=test_class I, [2024-05-18T15:47:55.629212 #543288] INFO -- : [694/885] 584233=test_rdoc_parser_rd I, [2024-05-18T15:47:55.656757 #543288] INFO -- : [695/885] 584233=index_write_test I, [2024-05-18T15:47:55.670885 #543288] INFO -- : [696/885] 584233=test_const I, [2024-05-18T15:47:55.681156 #543288] INFO -- : [697/885] 584233=test_recorder I, [2024-05-18T15:47:55.691154 #543288] INFO -- : [698/885] 584233=test_yaml_special_cases I, [2024-05-18T15:47:55.715001 #543288] INFO -- : [699/885] 584233=test_gem_commands_sources_command I, [2024-05-18T15:47:55.941331 #543288] INFO -- : [700/885] 584233=json_addition_test I, [2024-05-18T15:47:55.958901 #543288] INFO -- : [701/885] 584233=test_gem_source_list I, [2024-05-18T15:47:56.023035 #543288] INFO -- : [702/885] 584233=test_name_error I, [2024-05-18T15:47:56.138274 #543288] INFO -- : [703/885] 584233=ripper_test I, [2024-05-18T15:47:56.794843 #543288] INFO -- : [704/885] 584233=test_iso_8859 I, [2024-05-18T15:47:56.823468 #543288] INFO -- : [705/885] 584233=test_libs I, [2024-05-18T15:47:56.841542 #543288] INFO -- : [706/885] 584233=test_math I, [2024-05-18T15:47:56.855847 #543288] INFO -- : [707/885] 584233=test_gc I, [2024-05-18T15:47:56.864725 #543288] INFO -- : [708/885] 584233=comments_test I, [2024-05-18T15:47:56.876904 #543288] INFO -- : [709/885] 584233=test_qsort I, [2024-05-18T15:47:56.886809 #543288] INFO -- : [710/885] 584233=test_safe_load I, [2024-05-18T15:47:56.906593 #543288] INFO -- : [711/885] 584233=test_cgi_tag_helper I, [2024-05-18T15:47:57.004765 #543288] INFO -- : [712/885] 584233=test_pack I, [2024-05-18T15:47:57.092838 #543288] INFO -- : [713/885] 584233=test_pinned I, [2024-05-18T15:47:57.175661 #543288] INFO -- : [714/885] 584233=test_framework I, [2024-05-18T15:47:57.184918 #543288] INFO -- : [715/885] 584233=test_weakmap I, [2024-05-18T15:48:03.689128 #543288] INFO -- : [716/885] 584234=test_coderange I, [2024-05-18T15:48:03.693647 #543288] INFO -- : [717/885] 584234=test_ansi_with_terminfo I, [2024-05-18T15:48:03.704393 #543288] INFO -- : [718/885] 584234=test_inadvertent_creation I, [2024-05-18T15:48:03.807866 #543288] INFO -- : [719/885] 584234=test_date_time I, [2024-05-18T15:48:03.818532 #543288] INFO -- : [720/885] 584234=test_nil2vtempty I, [2024-05-18T15:48:03.831619 #543288] INFO -- : [721/885] 584234=test_rdoc_generator_json_index I, [2024-05-18T15:48:03.857905 #543288] INFO -- : [722/885] 584234=test_method_cache I, [2024-05-18T15:48:03.917403 #543288] INFO -- : [723/885] 584234=test_too_many_dummy_encodings I, [2024-05-18T15:48:03.935077 #543288] INFO -- : [724/885] 584234=test_sprintf_comb I, [2024-05-18T15:48:04.128573 #543288] INFO -- : [725/885] 584234=test_gem_commands_push_command I, [2024-05-18T15:48:04.768007 #543288] INFO -- : [726/885] 584234=locals_test I, [2024-05-18T15:48:05.168362 #543288] INFO -- : [727/885] 584234=test_rdoc_task I, [2024-05-18T15:48:05.198725 #543288] INFO -- : [728/885] 584234=test_settracefunc I, [2024-05-18T15:48:06.234911 #543288] INFO -- : [729/885] 584234=test_gem_text I, [2024-05-18T15:48:06.376933 #543288] INFO -- : [730/885] 584234=test_tracepoint I, [2024-05-18T15:48:06.718752 #543288] INFO -- : [731/885] 584234=test_backtrace I, [2024-05-18T15:48:08.135884 #543288] INFO -- : [732/885] 584234=desugar_compiler_test I, [2024-05-18T15:48:08.167500 #543288] INFO -- : [733/885] 584234=test_gem_source_local I, [2024-05-18T15:48:08.418319 #543288] INFO -- : [734/885] 584234=test_internal_ivar I, [2024-05-18T15:48:08.426129 #543288] INFO -- : [735/885] 584234=test_win32ole I, [2024-05-18T15:48:08.434858 #543288] INFO -- : [736/885] 584234=test_rendering I, [2024-05-18T15:48:08.456052 #543288] INFO -- : [737/885] 584234=test_gem_gemcutter_utilities I, [2024-05-18T15:48:08.931872 #543288] INFO -- : [738/885] 584234=test_http I, [2024-05-18T15:48:08.938003 #543288] INFO -- : [739/885] 584234=parser_test I, [2024-05-18T15:48:08.959746 #543288] INFO -- : [740/885] 584234=test_hash I, [2024-05-18T15:48:11.892594 #543288] INFO -- : [741/885] 584233=test_pty I, [2024-05-18T15:48:12.406877 #543288] INFO -- : [742/885] 584233=test_gem_dependency_installer I, [2024-05-18T15:48:14.150783 #543288] INFO -- : [743/885] 584234=test_gem_commands_which_command I, [2024-05-18T15:48:14.225276 #543288] INFO -- : [744/885] 584234=test_gem_request I, [2024-05-18T15:48:14.513009 #543288] INFO -- : [745/885] 584234=test_gem_package_old I, [2024-05-18T15:48:14.580266 #543288] INFO -- : [746/885] 584234=encoding_test I, [2024-05-18T15:48:14.672959 #543288] INFO -- : [747/885] 584234=test_scan_args I, [2024-05-18T15:48:14.686333 #543288] INFO -- : [748/885] 584234=test_gem_commands_specification_command I, [2024-05-18T15:48:14.851018 #543288] INFO -- : [749/885] 584234=test_gem_dependency I, [2024-05-18T15:48:15.025084 #543288] INFO -- : [750/885] 584234=test_yjit I, [2024-05-18T15:48:15.070730 #543288] INFO -- : [751/885] 584234=test_gem_uninstaller I, [2024-05-18T15:48:15.091185 #543288] INFO -- : [752/885] 584233=test_cclass I, [2024-05-18T15:48:15.152015 #543288] INFO -- : [753/885] 584233=test_method I, [2024-05-18T15:48:16.554382 #543288] INFO -- : [754/885] 584234=test_m17n I, [2024-05-18T15:48:16.702268 #543288] INFO -- : [755/885] 584234=test_argf I, [2024-05-18T15:48:20.451922 #543288] INFO -- : [756/885] 584234=test_yaml I, [2024-05-18T15:48:20.623765 #543288] INFO -- : [757/885] 584234=test_x509name I, [2024-05-18T15:48:20.710220 #543288] INFO -- : [758/885] 584234=test_pkcs12 I, [2024-05-18T15:48:21.355126 #543288] INFO -- : [759/885] 584234=test_json_tree I, [2024-05-18T15:48:21.369014 #543288] INFO -- : [760/885] 584234=test_koi8 I, [2024-05-18T15:48:21.395718 #543288] INFO -- : [761/885] 584234=test_gem_remote_fetcher I, [2024-05-18T15:48:23.261179 #543288] INFO -- : [762/885] 584234=test_parser_events I, [2024-05-18T15:48:23.371800 #543288] INFO -- : [763/885] 584234=test_filter I, [2024-05-18T15:48:23.485140 #543288] INFO -- : [764/885] 584234=attribute_write_test I, [2024-05-18T15:48:23.497396 #543288] INFO -- : [765/885] 584234=test_utf16 I, [2024-05-18T15:48:23.523900 #543288] INFO -- : [766/885] 584234=test_http I, [2024-05-18T15:48:25.960708 #543288] INFO -- : [767/885] 584232=test_set I, [2024-05-18T15:48:25.975367 #543288] INFO -- : [768/885] 584232=test_ractor I, [2024-05-18T15:48:25.976144 #543288] INFO -- : [769/885] 584232=test_case I, [2024-05-18T15:48:25.981968 #543288] INFO -- : [770/885] 584232=test_severity I, [2024-05-18T15:48:25.988700 #543288] INFO -- : [771/885] 584232=test_str2big I, [2024-05-18T15:48:26.000282 #543288] INFO -- : [772/885] 584232=test_gem_package_tar_writer I, [2024-05-18T15:48:26.153844 #543288] INFO -- : [773/885] 584232=test_rdoc_markup_to_rdoc I, [2024-05-18T15:48:26.365966 #543288] INFO -- : [774/885] 584232=test_gc_compact I, [2024-05-18T15:48:29.620407 #543288] INFO -- : [775/885] 584232=test_rdoc_i18n_locale I, [2024-05-18T15:48:29.628772 #543288] INFO -- : [776/885] 584232=test_dryrun I, [2024-05-18T15:48:29.658527 #543288] INFO -- : [777/885] 584232=test_queue I, [2024-05-18T15:48:29.669913 #543288] INFO -- : [778/885] 584232=test_gem_resolver_lock_specification I, [2024-05-18T15:48:29.693083 #543288] INFO -- : [779/885] 584233=test_boolean I, [2024-05-18T15:48:29.706976 #543288] INFO -- : [780/885] 584233=test_clone I, [2024-05-18T15:48:29.713924 #543288] INFO -- : [781/885] 584232=test_enc_raise I, [2024-05-18T15:48:29.727595 #543288] INFO -- : [782/885] 584232=test_gem_uri_formatter I, [2024-05-18T15:48:29.746594 #543288] INFO -- : [783/885] 584232=test_prettyprint I, [2024-05-18T15:48:29.788290 #543288] INFO -- : [784/885] 584232=test_ole_methods I, [2024-05-18T15:48:29.801726 #543288] INFO -- : [785/885] 584232=test_cgi_util I, [2024-05-18T15:48:29.862513 #543288] INFO -- : [786/885] 584233=test_shift_jis I, [2024-05-18T15:48:29.893703 #543288] INFO -- : [787/885] 584233=test_rdoc_store I, [2024-05-18T15:48:30.058070 #543288] INFO -- : [788/885] 584232=test_files_sample I, [2024-05-18T15:48:30.059003 #543288] INFO -- : [789/885] 584232=test_rdoc_stats I, [2024-05-18T15:48:30.096306 #543288] INFO -- : [790/885] 584232=test_data_error I, [2024-05-18T15:48:30.166576 #543288] INFO -- : [791/885] 584232=test_rubyoptions I, [2024-05-18T15:48:30.513978 #543288] INFO -- : [792/885] 584233=test_optimization I, [2024-05-18T15:48:32.196539 #543288] INFO -- : [793/885] 584234=test_force_exit I, [2024-05-18T15:48:32.205827 #543288] INFO -- : [794/885] 584234=regexp_test I, [2024-05-18T15:48:32.235717 #543288] INFO -- : [795/885] 584234=test_yield I, [2024-05-18T15:48:35.587699 #543288] INFO -- : [796/885] 584234=test_remote_fetch_error I, [2024-05-18T15:48:35.614992 #543288] INFO -- : [797/885] 584234=test_show_source I, [2024-05-18T15:48:35.630108 #543288] INFO -- : [798/885] 584234=test_ractor I, [2024-05-18T15:48:35.654180 #543288] INFO -- : [799/885] 584234=test_gem_resolver_api_specification I, [2024-05-18T15:48:35.701110 #543288] INFO -- : [800/885] 584234=test_rdoc_rubygems_hook I, [2024-05-18T15:48:35.807211 #543288] INFO -- : [801/885] 584234=test_webauthn_listener I, [2024-05-18T15:48:35.848101 #543288] INFO -- : Leaked file descriptor: WebauthnListenerTest#test_wait_for_otp_code_options_request: 14 : # I, [2024-05-18T15:48:35.886137 #543288] INFO -- : COMMAND PID USER FD TYPE DEVICE SIZE/OFF NODE NAME I, [2024-05-18T15:48:35.886211 #543288] INFO -- : ruby 584234 opc 14u IPv4 3038221142 0t0 TCP localhost:36739->localhost:42038 (CLOSE_WAIT) I, [2024-05-18T15:48:35.968756 #543288] INFO -- : .Closed file descriptor: WebauthnListenerTest#test_wait_for_otp_code_get_request: 14 I, [2024-05-18T15:48:36.008841 #543288] INFO -- : [802/885] 584234=test_rational I, [2024-05-18T15:48:36.028739 #543288] INFO -- : [803/885] 584234=test_case_mapping I, [2024-05-18T15:48:36.045374 #543288] INFO -- : [804/885] 584234=test_gem_ext_cargo_builder_unit I, [2024-05-18T15:48:36.080741 #543288] INFO -- : [805/885] 584234=test_arity I, [2024-05-18T15:48:36.087272 #543288] INFO -- : [806/885] 584234=test_thread I, [2024-05-18T15:48:36.097493 #543288] INFO -- : [807/885] 584234=test_pkey_ec I, [2024-05-18T15:48:36.115926 #543288] INFO -- : [808/885] 584234=test_svcb_https I, [2024-05-18T15:48:36.144512 #543288] INFO -- : [809/885] 584234=test_buffering I, [2024-05-18T15:48:36.147653 #543288] INFO -- : [810/885] 584234=test_key_event_record I, [2024-05-18T15:48:36.155351 #543288] INFO -- : [811/885] 584234=test_mdns I, [2024-05-18T15:48:36.207591 #543288] INFO -- : [812/885] 584234=test_open3 I, [2024-05-18T15:48:36.348709 #543288] INFO -- : [813/885] 584232=test_date_parse I, [2024-05-18T15:48:36.474883 #543288] INFO -- : [814/885] 584232=test_backtrace I, [2024-05-18T15:48:36.481742 #543288] INFO -- : [815/885] 584232=test_gbk I, [2024-05-18T15:48:36.495810 #543288] INFO -- : [816/885] 584232=test_gem_commands_dependency_command I, [2024-05-18T15:48:36.669363 #543288] INFO -- : [817/885] 584232=test_yamldbm I, [2024-05-18T15:48:36.686243 #543288] INFO -- : [818/885] 584232=test_gem_spec_fetcher I, [2024-05-18T15:48:36.863547 #543288] INFO -- : [819/885] 584232=test_unicode_escape I, [2024-05-18T15:48:36.965899 #543288] INFO -- : [820/885] 584232=test_default_gems I, [2024-05-18T15:48:36.994095 #543288] INFO -- : [821/885] 584232=test_switch_hitter I, [2024-05-18T15:48:37.037167 #543288] INFO -- : [822/885] 584232=test_grapheme_breaks I, [2024-05-18T15:48:37.046490 #543288] INFO -- : [823/885] 584232=test_hash_create I, [2024-05-18T15:48:37.055557 #543288] INFO -- : [824/885] 584232=test_enumerable I, [2024-05-18T15:48:37.089194 #543288] INFO -- : [825/885] 584232=test_rdoc_method_attr I, [2024-05-18T15:48:37.308725 #543288] INFO -- : [826/885] 584232=test_set I, [2024-05-18T15:48:37.345354 #543288] INFO -- : [827/885] 584232=test_tree_spell_checker I, [2024-05-18T15:48:37.353949 #543288] INFO -- : [828/885] 584233=static_literals_test I, [2024-05-18T15:48:37.361003 #543288] INFO -- : [829/885] 584233=test_storage I, [2024-05-18T15:48:37.382705 #543288] INFO -- : [830/885] 584233=test_method_name_check I, [2024-05-18T15:48:37.405263 #543288] INFO -- : [831/885] 584232=test_err_in_callback I, [2024-05-18T15:48:37.405639 #543288] INFO -- : [832/885] 584232=test_merge_keys I, [2024-05-18T15:48:37.422076 #543288] INFO -- : [833/885] 584233=test_did_you_mean I, [2024-05-18T15:48:37.430536 #543288] INFO -- : [834/885] 584232=test_shapes I, [2024-05-18T15:48:37.433089 #543288] INFO -- : [835/885] 584232=test_cesu8 I, [2024-05-18T15:48:37.455280 #543288] INFO -- : [836/885] 584232=test_rdoc_extend I, [2024-05-18T15:48:37.470583 #543288] INFO -- : [837/885] 584232=test_rendering I, [2024-05-18T15:48:37.482936 #543288] INFO -- : [838/885] 584232=test_kernel I, [2024-05-18T15:48:37.512985 #543288] INFO -- : [839/885] 584233=pattern_test I, [2024-05-18T15:48:37.556915 #543288] INFO -- : [840/885] 584233=test_dot_dot I, [2024-05-18T15:48:37.635733 #543288] INFO -- : [841/885] 584233=test_gem_rdoc I, [2024-05-18T15:48:37.766718 #543288] INFO -- : [842/885] 584233=test_string I, [2024-05-18T15:48:37.778875 #543288] INFO -- : [843/885] 584233=test_iterator I, [2024-05-18T15:48:37.895129 #543288] INFO -- : [844/885] 584233=test_gem_commands_install_command I, [2024-05-18T15:48:38.125735 #543288] INFO -- : [845/885] 584232=test_fd_setsize I, [2024-05-18T15:48:38.132848 #543288] INFO -- : [846/885] 584232=test_forwardable I, [2024-05-18T15:48:38.159546 #543288] INFO -- : [847/885] 584232=test_process I, [2024-05-18T15:48:38.197920 #543288] INFO -- : [848/885] 584232=!Nothing_to_test I, [2024-05-18T15:48:38.199729 #543288] INFO -- : [849/885] 584232=test_array_create I, [2024-05-18T15:48:38.209824 #543288] INFO -- : [850/885] 584232=test_memory_view I, [2024-05-18T15:48:38.922259 #543288] INFO -- : [851/885] 584232=test_dir_m17n I, [2024-05-18T15:48:38.956753 #543288] INFO -- : [852/885] 584234=test_threadgroup I, [2024-05-18T15:48:39.881062 #543288] INFO -- : [853/885] 584233=test_complex I, [2024-05-18T15:48:39.971736 #543288] INFO -- : [854/885] 584233=test_gem_command I, [2024-05-18T15:48:39.976657 #543288] INFO -- : [855/885] 584234=test_asn1 I, [2024-05-18T15:48:40.012731 #543288] INFO -- : [856/885] 584234=test_undef I, [2024-05-18T15:48:40.015126 #543288] INFO -- : [857/885] 584234=test_random I, [2024-05-18T15:48:40.028123 #543288] INFO -- : [858/885] 584234=test_gem_resolver_lock_set I, [2024-05-18T15:48:40.056357 #543288] INFO -- : [859/885] 584234=test_rdoc_generator_darkfish I, [2024-05-18T15:48:40.091287 #543288] INFO -- : [860/885] 584232=test_gem_commands_open_command I, [2024-05-18T15:48:40.095689 #543288] INFO -- : [861/885] 584233=test_verbose I, [2024-05-18T15:48:40.148290 #543288] INFO -- : [862/885] 584233=test_emoji_breaks I, [2024-05-18T15:48:40.150581 #543288] INFO -- : [863/885] 584233=test_normalize I, [2024-05-18T15:48:40.150805 #543288] INFO -- : [864/885] 584233=test_gem_update_suggestion I, [2024-05-18T15:48:40.167890 #543288] INFO -- : [865/885] 584233=test_assignment I, [2024-05-18T15:48:40.206495 #543288] INFO -- : [866/885] 584232=test_variable I, [2024-05-18T15:48:40.291675 #543288] INFO -- : [867/885] 584232=test_hash I, [2024-05-18T15:48:40.316685 #543288] INFO -- : [868/885] 584232=test_rdoc_tom_doc I, [2024-05-18T15:48:40.335004 #543288] INFO -- : [869/885] 584232=test_optarg I, [2024-05-18T15:48:40.403577 #543288] INFO -- : [870/885] 584232=test_gem_commands_pristine_command I, [2024-05-18T15:48:40.515442 #543288] INFO -- : [871/885] 584234=test_basicinstructions I, [2024-05-18T15:48:40.595135 #543288] INFO -- : [872/885] 584234=test_gem_resolver_git_specification I, [2024-05-18T15:48:40.919655 #543288] INFO -- : [873/885] 584234=test_utf32 I, [2024-05-18T15:48:40.933238 #543288] INFO -- : [874/885] 584234=test_gem_security I, [2024-05-18T15:48:41.615811 #543288] INFO -- : [875/885] 584233=test_key_actor_emacs I, [2024-05-18T15:48:41.838053 #543288] INFO -- : [876/885] 584233=test_date_ractor I, [2024-05-18T15:48:41.849859 #543288] INFO -- : [877/885] 584232=test_erb I, [2024-05-18T15:48:41.907511 #543288] INFO -- : [878/885] 584232=test_gem_impossible_dependencies_error I, [2024-05-18T15:48:41.917830 #543288] INFO -- : [879/885] 584232=test_pp I, [2024-05-18T15:48:41.936822 #543288] INFO -- : [880/885] 584233=memsize_test I, [2024-05-18T15:48:41.950675 #543288] INFO -- : [881/885] 584233=test_gem_resolver_requirement_list I, [2024-05-18T15:48:41.962943 #543288] INFO -- : [882/885] 584233=test_noarg I, [2024-05-18T15:48:41.988308 #543288] INFO -- : [883/885] 584232=test_exception I, [2024-05-18T15:48:42.020112 #543288] INFO -- : [884/885] 584232=test_arith_seq_beg_len_step I, [2024-05-18T15:48:42.083070 #543288] INFO -- : [885/885] 584232=test_raise_exception I, [2024-05-18T15:48:52.879682 #543288] INFO -- : Finished tests in 227.228957s, 115.6235 tests/s, 41145.5923 assertions/s. I, [2024-05-18T15:48:52.884497 #543288] INFO -- : 26273 tests, 9349470 assertions, 0 failures, 0 errors, 320 skips I, [2024-05-18T15:48:52.884535 #543288] INFO -- : I, [2024-05-18T15:48:52.884547 #543288] INFO -- : ruby -v: ruby 3.4.0dev (2024-05-18T15:29:00Z master dbbaf871de) [aarch64-linux] I, [2024-05-18T15:48:52.885717 #543288] INFO -- : $$$[end] "make yes-test-all TESTOPTS='--stderr-on-failure' TESTS='-j3'" exit with 0. I, [2024-05-18T15:48:52.885850 #543288] INFO -- : $$$[beg] make yes-test-rubyspec MSPECOPT='--error-output stderr --debug -j' TESTS='-j3' I, [2024-05-18T15:48:53.013531 #543288] INFO -- : BASERUBY = /usr/local/bin/ruby --disable=gems I, [2024-05-18T15:48:53.013608 #543288] INFO -- : CC = gcc I, [2024-05-18T15:48:53.013620 #543288] INFO -- : LD = ld I, [2024-05-18T15:48:53.013633 #543288] INFO -- : LDSHARED = gcc -shared I, [2024-05-18T15:48:53.013643 #543288] INFO -- : CFLAGS = -O3 -fno-fast-math -ggdb3 -Wall -Wextra -Wdeprecated-declarations -Wdiv-by-zero -Wduplicated-cond -Wimplicit-function-declaration -Wimplicit-int -Wpointer-arith -Wwrite-strings -Wold-style-definition -Wimplicit-fallthrough=0 -Wmissing-noreturn -Wno-cast-function-type -Wno-constant-logical-operand -Wno-long-long -Wno-missing-field-initializers -Wno-overlength-strings -Wno-packed-bitfield-compat -Wno-parentheses-equality -Wno-self-assign -Wno-tautological-compare -Wno-unused-parameter -Wno-unused-value -Wsuggest-attribute=format -Wsuggest-attribute=noreturn -Wunused-variable -Wmisleading-indentation -Wundef I, [2024-05-18T15:48:53.013653 #543288] INFO -- : XCFLAGS = -U_FORTIFY_SOURCE -D_FORTIFY_SOURCE=2 -fstack-protector-strong -msign-return-address=all -fno-strict-overflow -fvisibility=hidden -fexcess-precision=standard -DRUBY_EXPORT -fPIE -I. -I.ext/include/aarch64-linux -I/home/opc/ruby/src/master/include -I/home/opc/ruby/src/master -I/home/opc/ruby/src/master/prism -I/home/opc/ruby/src/master/enc/unicode/15.0.0 I, [2024-05-18T15:48:53.013662 #543288] INFO -- : CPPFLAGS = I, [2024-05-18T15:48:53.013671 #543288] INFO -- : DLDFLAGS = -Wl,--compress-debug-sections=zlib -fstack-protector-strong -pie I, [2024-05-18T15:48:53.013681 #543288] INFO -- : SOLIBS = -lz -lrt -lrt -ldl -lcrypt -lm -lpthread I, [2024-05-18T15:48:53.013689 #543288] INFO -- : LANG = en_US.UTF-8 I, [2024-05-18T15:48:53.013698 #543288] INFO -- : LC_ALL = I, [2024-05-18T15:48:53.013707 #543288] INFO -- : LC_CTYPE = I, [2024-05-18T15:48:53.013715 #543288] INFO -- : MFLAGS = I, [2024-05-18T15:48:53.013723 #543288] INFO -- : RUSTC = rustc I, [2024-05-18T15:48:53.013732 #543288] INFO -- : YJIT_RUSTC_ARGS = --crate-name=yjit --crate-type=staticlib --edition=2021 -g -C lto=thin -C opt-level=3 -C overflow-checks=on '--out-dir=/home/opc/ruby/build/master/yjit/target/release/' /home/opc/ruby/src/master/yjit/src/lib.rs I, [2024-05-18T15:48:53.014619 #543288] INFO -- : gcc (GCC) 8.5.0 20210514 (Red Hat 8.5.0-10.1.0.1) I, [2024-05-18T15:48:53.014641 #543288] INFO -- : Copyright (C) 2018 Free Software Foundation, Inc. I, [2024-05-18T15:48:53.014651 #543288] INFO -- : This is free software; see the source for copying conditions. There is NO I, [2024-05-18T15:48:53.014660 #543288] INFO -- : warranty; not even for MERCHANTABILITY or FITNESS FOR A PARTICULAR PURPOSE. I, [2024-05-18T15:48:53.014669 #543288] INFO -- : I, [2024-05-18T15:48:53.016739 #543288] INFO -- : generating enc.mk I, [2024-05-18T15:48:53.250002 #543288] INFO -- : generating encdb.h I, [2024-05-18T15:48:53.287104 #543288] INFO -- : encdb.h unchanged I, [2024-05-18T15:48:53.288472 #543288] INFO -- : making enc I, [2024-05-18T15:48:53.315744 #543288] INFO -- : make[1]: Entering directory '/home/opc/ruby/build/master' I, [2024-05-18T15:48:53.315824 #543288] INFO -- : make[1]: Nothing to be done for 'enc'. I, [2024-05-18T15:48:53.315836 #543288] INFO -- : make[1]: Leaving directory '/home/opc/ruby/build/master' I, [2024-05-18T15:48:53.316587 #543288] INFO -- : making srcs under enc I, [2024-05-18T15:48:53.358663 #543288] INFO -- : make[1]: Entering directory '/home/opc/ruby/build/master' I, [2024-05-18T15:48:53.358729 #543288] INFO -- : make[1]: Nothing to be done for 'srcs'. I, [2024-05-18T15:48:53.358740 #543288] INFO -- : make[1]: Leaving directory '/home/opc/ruby/build/master' I, [2024-05-18T15:48:53.359871 #543288] INFO -- : generating transdb.h I, [2024-05-18T15:48:53.503530 #543288] INFO -- : transdb.h unchanged I, [2024-05-18T15:48:53.504841 #543288] INFO -- : making trans I, [2024-05-18T15:48:53.553520 #543288] INFO -- : make[1]: Entering directory '/home/opc/ruby/build/master' I, [2024-05-18T15:48:53.553590 #543288] INFO -- : make[1]: Nothing to be done for 'trans'. I, [2024-05-18T15:48:53.553601 #543288] INFO -- : make[1]: Leaving directory '/home/opc/ruby/build/master' I, [2024-05-18T15:48:53.554344 #543288] INFO -- : making encs I, [2024-05-18T15:48:53.606592 #543288] INFO -- : make[1]: Entering directory '/home/opc/ruby/build/master' I, [2024-05-18T15:48:53.606666 #543288] INFO -- : make[1]: Nothing to be done for 'encs'. I, [2024-05-18T15:48:53.606677 #543288] INFO -- : make[1]: Leaving directory '/home/opc/ruby/build/master' I, [2024-05-18T15:48:53.608654 #543288] INFO -- : generating makefiles ext/configure-ext.mk I, [2024-05-18T15:48:53.648303 #543288] INFO -- : ext/configure-ext.mk updated I, [2024-05-18T15:48:53.651469 #543288] INFO -- : make[1]: Entering directory '/home/opc/ruby/build/master' I, [2024-05-18T15:48:55.725918 #543288] INFO -- : make[1]: Leaving directory '/home/opc/ruby/build/master' I, [2024-05-18T15:48:55.726563 #543288] INFO -- : generating makefile exts.mk I, [2024-05-18T15:48:55.787151 #543288] INFO -- : exts.mk unchanged I, [2024-05-18T15:48:55.791939 #543288] INFO -- : make[1]: Entering directory '/home/opc/ruby/build/master' I, [2024-05-18T15:48:56.089993 #543288] INFO -- : make[2]: Entering directory '/home/opc/ruby/build/master/ext/coverage' I, [2024-05-18T15:48:56.094481 #543288] INFO -- : make[2]: Leaving directory '/home/opc/ruby/build/master/ext/coverage' I, [2024-05-18T15:48:56.100231 #543288] INFO -- : make[2]: Entering directory '/home/opc/ruby/build/master/ext/date' I, [2024-05-18T15:48:56.105628 #543288] INFO -- : make[2]: Leaving directory '/home/opc/ruby/build/master/ext/date' I, [2024-05-18T15:48:56.108994 #543288] INFO -- : make[2]: Entering directory '/home/opc/ruby/build/master/ext/digest' I, [2024-05-18T15:48:56.117781 #543288] INFO -- : make[2]: Leaving directory '/home/opc/ruby/build/master/ext/digest' I, [2024-05-18T15:48:56.140230 #543288] INFO -- : make[2]: Entering directory '/home/opc/ruby/build/master/ext/digest/sha2' I, [2024-05-18T15:48:56.145246 #543288] INFO -- : make[2]: Leaving directory '/home/opc/ruby/build/master/ext/digest/sha2' I, [2024-05-18T15:48:56.163577 #543288] INFO -- : make[2]: Entering directory '/home/opc/ruby/build/master/ext/fiddle' I, [2024-05-18T15:48:56.173819 #543288] INFO -- : make[2]: Leaving directory '/home/opc/ruby/build/master/ext/fiddle' I, [2024-05-18T15:48:56.178147 #543288] INFO -- : make[2]: Entering directory '/home/opc/ruby/build/master/ext/io/console' I, [2024-05-18T15:48:56.182394 #543288] INFO -- : make[2]: Leaving directory '/home/opc/ruby/build/master/ext/io/console' I, [2024-05-18T15:48:56.192959 #543288] INFO -- : make[2]: Entering directory '/home/opc/ruby/build/master/ext/json' I, [2024-05-18T15:48:56.202541 #543288] INFO -- : make[2]: Leaving directory '/home/opc/ruby/build/master/ext/json' I, [2024-05-18T15:48:56.215392 #543288] INFO -- : make[2]: Entering directory '/home/opc/ruby/build/master/ext/monitor' I, [2024-05-18T15:48:56.219752 #543288] INFO -- : make[2]: Leaving directory '/home/opc/ruby/build/master/ext/monitor' I, [2024-05-18T15:48:56.225782 #543288] INFO -- : make[2]: Entering directory '/home/opc/ruby/build/master/ext/objspace' I, [2024-05-18T15:48:56.231576 #543288] INFO -- : make[2]: Leaving directory '/home/opc/ruby/build/master/ext/objspace' I, [2024-05-18T15:48:56.250490 #543288] INFO -- : make[2]: Entering directory '/home/opc/ruby/build/master/ext/openssl' I, [2024-05-18T15:48:56.272220 #543288] INFO -- : make[2]: Leaving directory '/home/opc/ruby/build/master/ext/openssl' I, [2024-05-18T15:48:56.276406 #543288] INFO -- : make[2]: Entering directory '/home/opc/ruby/build/master/ext/pathname' I, [2024-05-18T15:48:56.280615 #543288] INFO -- : make[2]: Leaving directory '/home/opc/ruby/build/master/ext/pathname' I, [2024-05-18T15:48:56.286902 #543288] INFO -- : make[2]: Entering directory '/home/opc/ruby/build/master/ext/psych' I, [2024-05-18T15:48:56.308202 #543288] INFO -- : make[2]: Leaving directory '/home/opc/ruby/build/master/ext/psych' I, [2024-05-18T15:48:56.312671 #543288] INFO -- : make[2]: Entering directory '/home/opc/ruby/build/master/ext/pty' I, [2024-05-18T15:48:56.316915 #543288] INFO -- : make[2]: Leaving directory '/home/opc/ruby/build/master/ext/pty' I, [2024-05-18T15:48:56.330667 #543288] INFO -- : make[2]: Entering directory '/home/opc/ruby/build/master/ext/ripper' I, [2024-05-18T15:48:56.338381 #543288] INFO -- : make[2]: Leaving directory '/home/opc/ruby/build/master/ext/ripper' I, [2024-05-18T15:48:56.340384 #543288] INFO -- : make[2]: Entering directory '/home/opc/ruby/build/master/ext/rubyvm' I, [2024-05-18T15:48:56.343804 #543288] INFO -- : make[2]: Leaving directory '/home/opc/ruby/build/master/ext/rubyvm' I, [2024-05-18T15:48:56.355817 #543288] INFO -- : make[2]: Entering directory '/home/opc/ruby/build/master/ext/socket' I, [2024-05-18T15:48:56.366562 #543288] INFO -- : make[2]: Leaving directory '/home/opc/ruby/build/master/ext/socket' I, [2024-05-18T15:48:56.381941 #543288] INFO -- : make[2]: Entering directory '/home/opc/ruby/build/master/.bundle/gems/bigdecimal-3.1.7/ext/bigdecimal' I, [2024-05-18T15:48:56.413145 #543288] INFO -- : make[2]: Leaving directory '/home/opc/ruby/build/master/.bundle/gems/bigdecimal-3.1.7/ext/bigdecimal' I, [2024-05-18T15:48:56.415899 #543288] INFO -- : make[2]: Entering directory '/home/opc/ruby/build/master/.bundle/gems/bigdecimal-3.1.8/ext/bigdecimal' I, [2024-05-18T15:48:56.446936 #543288] INFO -- : make[2]: Leaving directory '/home/opc/ruby/build/master/.bundle/gems/bigdecimal-3.1.8/ext/bigdecimal' I, [2024-05-18T15:48:56.449544 #543288] INFO -- : make[2]: Entering directory '/home/opc/ruby/build/master/.bundle/gems/debug-1.9.2/ext/debug' I, [2024-05-18T15:48:56.480979 #543288] INFO -- : make[2]: Leaving directory '/home/opc/ruby/build/master/.bundle/gems/debug-1.9.2/ext/debug' I, [2024-05-18T15:48:56.483523 #543288] INFO -- : make[2]: Entering directory '/home/opc/ruby/build/master/.bundle/gems/nkf-0.2.0/ext/nkf' I, [2024-05-18T15:48:56.514127 #543288] INFO -- : make[2]: Leaving directory '/home/opc/ruby/build/master/.bundle/gems/nkf-0.2.0/ext/nkf' I, [2024-05-18T15:48:56.516710 #543288] INFO -- : make[2]: Entering directory '/home/opc/ruby/build/master/.bundle/gems/racc-1.7.3/ext/racc/cparse' I, [2024-05-18T15:48:56.547153 #543288] INFO -- : make[2]: Leaving directory '/home/opc/ruby/build/master/.bundle/gems/racc-1.7.3/ext/racc/cparse' I, [2024-05-18T15:48:56.550225 #543288] INFO -- : make[2]: Entering directory '/home/opc/ruby/build/master/.bundle/gems/rbs-3.4.4/ext/rbs_extension' I, [2024-05-18T15:48:56.580660 #543288] INFO -- : make[2]: Leaving directory '/home/opc/ruby/build/master/.bundle/gems/rbs-3.4.4/ext/rbs_extension' I, [2024-05-18T15:48:56.583243 #543288] INFO -- : make[2]: Entering directory '/home/opc/ruby/build/master/.bundle/gems/syslog-0.1.2/ext/syslog' I, [2024-05-18T15:48:56.613682 #543288] INFO -- : make[2]: Leaving directory '/home/opc/ruby/build/master/.bundle/gems/syslog-0.1.2/ext/syslog' I, [2024-05-18T15:48:56.651769 #543288] INFO -- : make[2]: Entering directory '/home/opc/ruby/build/master' I, [2024-05-18T15:48:56.734747 #543288] INFO -- : make[2]: 'ruby' is up to date. I, [2024-05-18T15:48:56.734836 #543288] INFO -- : make[2]: Leaving directory '/home/opc/ruby/build/master' I, [2024-05-18T15:48:56.734962 #543288] INFO -- : make[1]: Leaving directory '/home/opc/ruby/build/master' I, [2024-05-18T15:48:56.739399 #543288] INFO -- : make[1]: Entering directory '/home/opc/ruby/build/master' I, [2024-05-18T15:48:56.739438 #543288] INFO -- : make[1]: Nothing to be done for 'note'. I, [2024-05-18T15:48:56.739449 #543288] INFO -- : make[1]: Leaving directory '/home/opc/ruby/build/master' E, [2024-05-18T15:48:56.814527 #543288] ERROR -- : $ /home/opc/ruby/build/master/miniruby -I/home/opc/ruby/src/master/lib /home/opc/ruby/src/master/tool/runruby.rb --archdir=/home/opc/ruby/build/master --extout=.ext -- /home/opc/ruby/src/master/spec/mspec/bin/mspec-run -B /home/opc/ruby/src/master/spec/default.mspec --error-output stderr --debug -fy -o /tmp/rubytest.l60ahl/1-mspec-multi-0 E, [2024-05-18T15:48:56.814883 #543288] ERROR -- : $ /home/opc/ruby/build/master/miniruby -I/home/opc/ruby/src/master/lib /home/opc/ruby/src/master/tool/runruby.rb --archdir=/home/opc/ruby/build/master --extout=.ext -- /home/opc/ruby/src/master/spec/mspec/bin/mspec-run -B /home/opc/ruby/src/master/spec/default.mspec --error-output stderr --debug -fy -o /tmp/rubytest.l60ahl/2-mspec-multi-1 E, [2024-05-18T15:48:56.815215 #543288] ERROR -- : $ /home/opc/ruby/build/master/miniruby -I/home/opc/ruby/src/master/lib /home/opc/ruby/src/master/tool/runruby.rb --archdir=/home/opc/ruby/build/master --extout=.ext -- /home/opc/ruby/src/master/spec/mspec/bin/mspec-run -B /home/opc/ruby/src/master/spec/default.mspec --error-output stderr --debug -fy -o /tmp/rubytest.l60ahl/3-mspec-multi-2 I, [2024-05-18T15:48:56.949145 #543288] INFO -- : ruby 3.4.0dev (2024-05-18T15:29:00Z master dbbaf871de) [aarch64-linux] I, [2024-05-18T15:49:02.329203 #543288] INFO -- : 0 ......................................................................... I, [2024-05-18T15:49:04.854266 #543288] INFO -- : 73 ......................................................................... I, [2024-05-18T15:49:04.998319 #543288] INFO -- : 146 ......................................................................... I, [2024-05-18T15:49:05.288188 #543288] INFO -- : 219 ......................................................................... I, [2024-05-18T15:49:05.450864 #543288] INFO -- : 292 ......................................................................... I, [2024-05-18T15:49:05.691957 #543288] INFO -- : 365 ......................................................................... I, [2024-05-18T15:49:05.820638 #543288] INFO -- : 438 ......................................................................... I, [2024-05-18T15:49:05.878714 #543288] INFO -- : 511 ......................................................................... I, [2024-05-18T15:49:05.940180 #543288] INFO -- : 584 ......................................................................... I, [2024-05-18T15:49:06.572227 #543288] INFO -- : 657 ......................................................................... I, [2024-05-18T15:49:06.653642 #543288] INFO -- : 730 ......................................................................... I, [2024-05-18T15:49:06.702429 #543288] INFO -- : 803 ......................................................................... I, [2024-05-18T15:49:06.889979 #543288] INFO -- : 876 ......................................................................... I, [2024-05-18T15:49:07.007835 #543288] INFO -- : 949 ......................................................................... I, [2024-05-18T15:49:07.590567 #543288] INFO -- : 1022 ......................................................................... I, [2024-05-18T15:49:09.917710 #543288] INFO -- : 1095 ......................................................................... I, [2024-05-18T15:49:10.691037 #543288] INFO -- : 1168 ......................................................................... I, [2024-05-18T15:49:10.880792 #543288] INFO -- : 1241 ......................................................................... I, [2024-05-18T15:49:11.052946 #543288] INFO -- : 1314 ......................................................................... I, [2024-05-18T15:49:11.147568 #543288] INFO -- : 1387 ......................................................................... I, [2024-05-18T15:49:13.224906 #543288] INFO -- : 1460 ......................................................................... I, [2024-05-18T15:49:16.547467 #543288] INFO -- : 1533 ......................................................................... I, [2024-05-18T15:49:16.694784 #543288] INFO -- : 1606 ......................................................................... I, [2024-05-18T15:49:17.524211 #543288] INFO -- : 1679 ......................................................................... I, [2024-05-18T15:49:17.829304 #543288] INFO -- : 1752 ......................................................................... I, [2024-05-18T15:49:18.106470 #543288] INFO -- : 1825 ......................................................................... I, [2024-05-18T15:49:18.417134 #543288] INFO -- : 1898 ......................................................................... I, [2024-05-18T15:49:18.824383 #543288] INFO -- : 1971 ......................................................................... I, [2024-05-18T15:49:19.316611 #543288] INFO -- : 2044 ......................................................................... I, [2024-05-18T15:49:19.402316 #543288] INFO -- : 2117 ......................................................................... I, [2024-05-18T15:49:19.460765 #543288] INFO -- : 2190 ......................................................................... I, [2024-05-18T15:49:19.511047 #543288] INFO -- : 2263 ......................................................................... I, [2024-05-18T15:49:19.564283 #543288] INFO -- : 2336 ......................................................................... I, [2024-05-18T15:49:19.658449 #543288] INFO -- : 2409 ......................................................................... I, [2024-05-18T15:49:19.921378 #543288] INFO -- : 2482 ......................................................................... I, [2024-05-18T15:49:20.063216 #543288] INFO -- : 2555 ......................................................................... I, [2024-05-18T15:49:21.356903 #543288] INFO -- : 2628 ......................................................................... I, [2024-05-18T15:49:21.625337 #543288] INFO -- : 2701 ......................................................................... I, [2024-05-18T15:49:21.759744 #543288] INFO -- : 2774 ......................................................................... I, [2024-05-18T15:49:22.089476 #543288] INFO -- : 2847 ......................................................................... I, [2024-05-18T15:49:22.339007 #543288] INFO -- : 2920 ......................................................................... I, [2024-05-18T15:49:22.451131 #543288] INFO -- : 2993 ......................................................................... I, [2024-05-18T15:49:22.522741 #543288] INFO -- : 3066 ......................................................................... I, [2024-05-18T15:49:22.570096 #543288] INFO -- : 3139 ......................................................................... I, [2024-05-18T15:49:22.630012 #543288] INFO -- : 3212 ......................................................................... I, [2024-05-18T15:49:22.698762 #543288] INFO -- : 3285 ......................................................................... I, [2024-05-18T15:49:26.550779 #543288] INFO -- : 3358 ........................................................................ I, [2024-05-18T15:49:26.550852 #543288] INFO -- : I, [2024-05-18T15:49:26.550865 #543288] INFO -- : Finished in 29.736182 seconds I, [2024-05-18T15:49:26.550875 #543288] INFO -- : I, [2024-05-18T15:49:26.550884 #543288] INFO -- : 3429 files, 32607 examples, 183510 expectations, 0 failures, 0 errors, 0 tagged I, [2024-05-18T15:49:26.552511 #543288] INFO -- : $$$[end] "make yes-test-rubyspec MSPECOPT='--error-output stderr --debug -j' TESTS='-j3'" exit with 0.