# Logfile created on 2024-05-17 19:30:21 +0000 by logger.rb/v1.5.3 I, [2024-05-17T19:30:21.560694 #1799568] INFO -- : #, @formatter=nil, @logdev=#, @binmode=false, @mon_data=#, @mon_data_owner_object_id=860>>> I, [2024-05-17T19:30:21.561002 #1799568] INFO -- : $$$[beg] make update-unicode -j3 I, [2024-05-17T19:30:21.651198 #1799568] INFO -- : Downloading Unicode emoji 15.0 files... I, [2024-05-17T19:30:21.651368 #1799568] INFO -- : Downloading Unicode emoji 15.0 files... I, [2024-05-17T19:30:21.651693 #1799568] INFO -- : Downloading Unicode emoji 15.0 files... I, [2024-05-17T19:30:21.728332 #1799568] INFO -- : made symlink emoji/15.0/emoji-sequences.txt to /home/opc/ruby/src/master/.downloaded-cache/emoji/15.0/emoji-sequences.txt I, [2024-05-17T19:30:21.729157 #1799568] INFO -- : downloading emoji/15.0/emoji-test.txt ... /home/opc/ruby/src/master/enc/unicode/data/emoji/15.0/emoji-sequences.txt already exists I, [2024-05-17T19:30:21.732967 #1799568] INFO -- : downloading emoji/15.0/emoji-test.txt ... /home/opc/ruby/src/master/enc/unicode/data/emoji/15.0/emoji-sequences.txt already exists E, [2024-05-17T19:30:22.184205 #1799568] ERROR -- : /home/opc/ruby/src/master/tool/downloader.rb:302:in `rescue in download': failed to download emoji/15.0/emoji-test.txt (RuntimeError) E, [2024-05-17T19:30:22.184272 #1799568] ERROR -- : OpenURI::HTTPError: 403 Forbidden: https://www.unicode.org/Public/emoji/15.0/emoji-test.txt E, [2024-05-17T19:30:22.184284 #1799568] ERROR -- : from /home/opc/ruby/src/master/tool/downloader.rb:201:in `download' E, [2024-05-17T19:30:22.184294 #1799568] ERROR -- : from /home/opc/ruby/src/master/tool/downloader.rb:136:in `download' E, [2024-05-17T19:30:22.184303 #1799568] ERROR -- : from /home/opc/ruby/src/master/tool/downloader.rb:482:in `block in
' E, [2024-05-17T19:30:22.184311 #1799568] ERROR -- : from /home/opc/ruby/src/master/tool/downloader.rb:465:in `each' E, [2024-05-17T19:30:22.184319 #1799568] ERROR -- : from /home/opc/ruby/src/master/tool/downloader.rb:465:in `
' E, [2024-05-17T19:30:22.184328 #1799568] ERROR -- : /usr/local/lib/ruby/3.2.0/open-uri.rb:369:in `open_http': 403 Forbidden (OpenURI::HTTPError) E, [2024-05-17T19:30:22.184336 #1799568] ERROR -- : from /usr/local/lib/ruby/3.2.0/open-uri.rb:760:in `buffer_open' E, [2024-05-17T19:30:22.184345 #1799568] ERROR -- : from /usr/local/lib/ruby/3.2.0/open-uri.rb:214:in `block in open_loop' E, [2024-05-17T19:30:22.184353 #1799568] ERROR -- : from /usr/local/lib/ruby/3.2.0/open-uri.rb:212:in `catch' E, [2024-05-17T19:30:22.184361 #1799568] ERROR -- : from /usr/local/lib/ruby/3.2.0/open-uri.rb:212:in `open_loop' E, [2024-05-17T19:30:22.184369 #1799568] ERROR -- : from /usr/local/lib/ruby/3.2.0/open-uri.rb:153:in `open_uri' E, [2024-05-17T19:30:22.184377 #1799568] ERROR -- : from /usr/local/lib/ruby/3.2.0/open-uri.rb:740:in `open' E, [2024-05-17T19:30:22.184388 #1799568] ERROR -- : from /usr/local/lib/ruby/3.2.0/open-uri.rb:748:in `read' E, [2024-05-17T19:30:22.184396 #1799568] ERROR -- : from /home/opc/ruby/src/master/tool/downloader.rb:247:in `block in download' E, [2024-05-17T19:30:22.184404 #1799568] ERROR -- : from /home/opc/ruby/src/master/tool/downloader.rb:378:in `with_retry' E, [2024-05-17T19:30:22.184412 #1799568] ERROR -- : from /home/opc/ruby/src/master/tool/downloader.rb:246:in `download' E, [2024-05-17T19:30:22.184420 #1799568] ERROR -- : from /home/opc/ruby/src/master/tool/downloader.rb:136:in `download' E, [2024-05-17T19:30:22.184429 #1799568] ERROR -- : from /home/opc/ruby/src/master/tool/downloader.rb:482:in `block in
' E, [2024-05-17T19:30:22.184437 #1799568] ERROR -- : from /home/opc/ruby/src/master/tool/downloader.rb:465:in `each' E, [2024-05-17T19:30:22.184444 #1799568] ERROR -- : from /home/opc/ruby/src/master/tool/downloader.rb:465:in `
' E, [2024-05-17T19:30:22.187208 #1799568] ERROR -- : make: *** [uncommon.mk:1765: /home/opc/ruby/src/master/enc/unicode/data/emoji/15.0/emoji-sequences.txt] Error 1 E, [2024-05-17T19:30:22.187251 #1799568] ERROR -- : make: *** Deleting file '/home/opc/ruby/src/master/enc/unicode/data/emoji/15.0/emoji-sequences.txt' E, [2024-05-17T19:30:22.187265 #1799568] ERROR -- : make: *** Waiting for unfinished jobs.... E, [2024-05-17T19:30:22.189437 #1799568] ERROR -- : /home/opc/ruby/src/master/tool/downloader.rb:302:in `rescue in download': failed to download emoji/15.0/emoji-test.txt (RuntimeError) E, [2024-05-17T19:30:22.189469 #1799568] ERROR -- : OpenURI::HTTPError: 403 Forbidden: https://www.unicode.org/Public/emoji/15.0/emoji-test.txt E, [2024-05-17T19:30:22.189479 #1799568] ERROR -- : from /home/opc/ruby/src/master/tool/downloader.rb:201:in `download' E, [2024-05-17T19:30:22.189488 #1799568] ERROR -- : from /home/opc/ruby/src/master/tool/downloader.rb:136:in `download' E, [2024-05-17T19:30:22.189496 #1799568] ERROR -- : from /home/opc/ruby/src/master/tool/downloader.rb:482:in `block in
' E, [2024-05-17T19:30:22.189504 #1799568] ERROR -- : from /home/opc/ruby/src/master/tool/downloader.rb:465:in `each' E, [2024-05-17T19:30:22.189512 #1799568] ERROR -- : from /home/opc/ruby/src/master/tool/downloader.rb:465:in `
' E, [2024-05-17T19:30:22.189520 #1799568] ERROR -- : /usr/local/lib/ruby/3.2.0/open-uri.rb:369:in `open_http': 403 Forbidden (OpenURI::HTTPError) E, [2024-05-17T19:30:22.189528 #1799568] ERROR -- : from /usr/local/lib/ruby/3.2.0/open-uri.rb:760:in `buffer_open' E, [2024-05-17T19:30:22.189536 #1799568] ERROR -- : from /usr/local/lib/ruby/3.2.0/open-uri.rb:214:in `block in open_loop' E, [2024-05-17T19:30:22.189544 #1799568] ERROR -- : from /usr/local/lib/ruby/3.2.0/open-uri.rb:212:in `catch' E, [2024-05-17T19:30:22.189552 #1799568] ERROR -- : from /usr/local/lib/ruby/3.2.0/open-uri.rb:212:in `open_loop' E, [2024-05-17T19:30:22.189560 #1799568] ERROR -- : from /usr/local/lib/ruby/3.2.0/open-uri.rb:153:in `open_uri' E, [2024-05-17T19:30:22.189568 #1799568] ERROR -- : from /usr/local/lib/ruby/3.2.0/open-uri.rb:740:in `open' E, [2024-05-17T19:30:22.189576 #1799568] ERROR -- : from /usr/local/lib/ruby/3.2.0/open-uri.rb:748:in `read' E, [2024-05-17T19:30:22.189584 #1799568] ERROR -- : from /home/opc/ruby/src/master/tool/downloader.rb:247:in `block in download' E, [2024-05-17T19:30:22.189592 #1799568] ERROR -- : from /home/opc/ruby/src/master/tool/downloader.rb:378:in `with_retry' E, [2024-05-17T19:30:22.189601 #1799568] ERROR -- : from /home/opc/ruby/src/master/tool/downloader.rb:246:in `download' E, [2024-05-17T19:30:22.189609 #1799568] ERROR -- : from /home/opc/ruby/src/master/tool/downloader.rb:136:in `download' E, [2024-05-17T19:30:22.189617 #1799568] ERROR -- : from /home/opc/ruby/src/master/tool/downloader.rb:482:in `block in
' E, [2024-05-17T19:30:22.189625 #1799568] ERROR -- : from /home/opc/ruby/src/master/tool/downloader.rb:465:in `each' E, [2024-05-17T19:30:22.189636 #1799568] ERROR -- : from /home/opc/ruby/src/master/tool/downloader.rb:465:in `
' E, [2024-05-17T19:30:22.192605 #1799568] ERROR -- : /home/opc/ruby/src/master/tool/downloader.rb:302:in `rescue in download': failed to download emoji/15.0/emoji-test.txt (RuntimeError) E, [2024-05-17T19:30:22.192649 #1799568] ERROR -- : OpenURI::HTTPError: 403 Forbidden: https://www.unicode.org/Public/emoji/15.0/emoji-test.txt E, [2024-05-17T19:30:22.192662 #1799568] ERROR -- : from /home/opc/ruby/src/master/tool/downloader.rb:201:in `download' E, [2024-05-17T19:30:22.192671 #1799568] ERROR -- : from /home/opc/ruby/src/master/tool/downloader.rb:136:in `download' E, [2024-05-17T19:30:22.192680 #1799568] ERROR -- : from /home/opc/ruby/src/master/tool/downloader.rb:482:in `block in
' E, [2024-05-17T19:30:22.192688 #1799568] ERROR -- : from /home/opc/ruby/src/master/tool/downloader.rb:465:in `each' E, [2024-05-17T19:30:22.192697 #1799568] ERROR -- : from /home/opc/ruby/src/master/tool/downloader.rb:465:in `
' E, [2024-05-17T19:30:22.192705 #1799568] ERROR -- : /usr/local/lib/ruby/3.2.0/open-uri.rb:369:in `open_http': 403 Forbidden (OpenURI::HTTPError) E, [2024-05-17T19:30:22.192713 #1799568] ERROR -- : from /usr/local/lib/ruby/3.2.0/open-uri.rb:760:in `buffer_open' E, [2024-05-17T19:30:22.192722 #1799568] ERROR -- : from /usr/local/lib/ruby/3.2.0/open-uri.rb:214:in `block in open_loop' E, [2024-05-17T19:30:22.192731 #1799568] ERROR -- : from /usr/local/lib/ruby/3.2.0/open-uri.rb:212:in `catch' E, [2024-05-17T19:30:22.192739 #1799568] ERROR -- : from /usr/local/lib/ruby/3.2.0/open-uri.rb:212:in `open_loop' E, [2024-05-17T19:30:22.192748 #1799568] ERROR -- : from /usr/local/lib/ruby/3.2.0/open-uri.rb:153:in `open_uri' E, [2024-05-17T19:30:22.192756 #1799568] ERROR -- : from /usr/local/lib/ruby/3.2.0/open-uri.rb:740:in `open' E, [2024-05-17T19:30:22.192763 #1799568] ERROR -- : from /usr/local/lib/ruby/3.2.0/open-uri.rb:748:in `read' E, [2024-05-17T19:30:22.192772 #1799568] ERROR -- : from /home/opc/ruby/src/master/tool/downloader.rb:247:in `block in download' E, [2024-05-17T19:30:22.192780 #1799568] ERROR -- : from /home/opc/ruby/src/master/tool/downloader.rb:378:in `with_retry' E, [2024-05-17T19:30:22.192788 #1799568] ERROR -- : from /home/opc/ruby/src/master/tool/downloader.rb:246:in `download' E, [2024-05-17T19:30:22.192796 #1799568] ERROR -- : from /home/opc/ruby/src/master/tool/downloader.rb:136:in `download' E, [2024-05-17T19:30:22.192805 #1799568] ERROR -- : from /home/opc/ruby/src/master/tool/downloader.rb:482:in `block in
' E, [2024-05-17T19:30:22.192813 #1799568] ERROR -- : from /home/opc/ruby/src/master/tool/downloader.rb:465:in `each' E, [2024-05-17T19:30:22.192820 #1799568] ERROR -- : from /home/opc/ruby/src/master/tool/downloader.rb:465:in `
' E, [2024-05-17T19:30:22.193227 #1799568] ERROR -- : make: *** [uncommon.mk:1765: /home/opc/ruby/src/master/enc/unicode/data/emoji/15.0/emoji-zwj-sequences.txt] Error 1 E, [2024-05-17T19:30:22.195556 #1799568] ERROR -- : make: *** [uncommon.mk:1765: /home/opc/ruby/src/master/enc/unicode/data/emoji/15.0/emoji-test.txt] Error 1 I, [2024-05-17T19:30:22.195611 #1799568] INFO -- : downloading emoji/15.0/emoji-test.txt ... I, [2024-05-17T19:30:22.195749 #1799568] INFO -- : $$$[end] "make update-unicode -j3" exit with 512. I, [2024-05-17T19:30:22.195775 #1799568] INFO -- : $$$[beg] make update-download -j3 I, [2024-05-17T19:30:22.361146 #1799568] INFO -- : tool/config.guess already exists I, [2024-05-17T19:30:22.361217 #1799568] INFO -- : tool/config.sub already exists I, [2024-05-17T19:30:22.364224 #1799568] INFO -- : Update power_assert to 84e85124c5014a139af39161d484156cfe87a9ed I, [2024-05-17T19:30:22.364367 #1799568] INFO -- : Update rbs to ba7872795d5de04adb8ff500c0e6afdc81a041dd I, [2024-05-17T19:30:22.364674 #1799568] INFO -- : Update typeprof to b19a6416da3a05d57fadd6ffdadb382b6d236ca5 I, [2024-05-17T19:30:22.367964 #1799568] INFO -- : echo 84e85124c5014a139af39161d484156cfe87a9ed | /bin/sh /home/opc/ruby/src/master/tool/ifchange /home/opc/ruby/src/master/.bundle/.timestamp/power_assert.revision - I, [2024-05-17T19:30:22.368196 #1799568] INFO -- : echo ba7872795d5de04adb8ff500c0e6afdc81a041dd | /bin/sh /home/opc/ruby/src/master/tool/ifchange /home/opc/ruby/src/master/.bundle/.timestamp/rbs.revision - I, [2024-05-17T19:30:22.368232 #1799568] INFO -- : echo b19a6416da3a05d57fadd6ffdadb382b6d236ca5 | /bin/sh /home/opc/ruby/src/master/tool/ifchange /home/opc/ruby/src/master/.bundle/.timestamp/typeprof.revision - I, [2024-05-17T19:30:22.374840 #1799568] INFO -- : /home/opc/ruby/src/master/.bundle/.timestamp/power_assert.revision unchanged I, [2024-05-17T19:30:22.375106 #1799568] INFO -- : /home/opc/ruby/src/master/.bundle/.timestamp/rbs.revision unchanged I, [2024-05-17T19:30:22.375346 #1799568] INFO -- : /home/opc/ruby/src/master/.bundle/.timestamp/typeprof.revision unchanged I, [2024-05-17T19:30:22.466497 #1799568] INFO -- : Building power_assert@84e85124c5014a139af39161d484156cfe87a9ed to /home/opc/ruby/src/master/gems/power_assert-2.0.3.gem I, [2024-05-17T19:30:22.577481 #1799568] INFO -- : Successfully built RubyGem I, [2024-05-17T19:30:22.577540 #1799568] INFO -- : Name: power_assert I, [2024-05-17T19:30:22.577551 #1799568] INFO -- : Version: 2.0.4dev I, [2024-05-17T19:30:22.577560 #1799568] INFO -- : File: power_assert-2.0.4dev.gem I, [2024-05-17T19:30:22.659585 #1799568] INFO -- : $$$[end] "make update-download -j3" exit with 0. I, [2024-05-17T19:30:22.659658 #1799568] INFO -- : $$$[beg] make update-rubyspec -j3 I, [2024-05-17T19:30:22.747620 #1799568] INFO -- : make: Nothing to be done for 'update-rubyspec'. I, [2024-05-17T19:30:22.747816 #1799568] INFO -- : $$$[end] "make update-rubyspec -j3" exit with 0. I, [2024-05-17T19:30:22.747867 #1799568] INFO -- : $$$[beg] make update-src -j3 I, [2024-05-17T19:30:23.737177 #1799568] INFO -- : Already up to date. I, [2024-05-17T19:30:23.752121 #1799568] INFO -- : Latest commit hash = e61d24d77e I, [2024-05-17T19:30:23.752717 #1799568] INFO -- : $$$[end] "make update-src -j3" exit with 0. I, [2024-05-17T19:30:23.752769 #1799568] INFO -- : $$$[beg] make after-update -j3 I, [2024-05-17T19:30:23.855081 #1799568] INFO -- : generating /home/opc/ruby/src/master/ext/ripper/eventids2table.c I, [2024-05-17T19:30:23.861706 #1799568] INFO -- : make[1]: Entering directory '/home/opc/ruby/src/master/ext/ripper' I, [2024-05-17T19:30:23.861754 #1799568] INFO -- : make[1]: Nothing to be done for 'src'. I, [2024-05-17T19:30:23.861765 #1799568] INFO -- : make[1]: Leaving directory '/home/opc/ruby/src/master/ext/ripper' I, [2024-05-17T19:30:23.888106 #1799568] INFO -- : /home/opc/ruby/src/master/revision.h updated I, [2024-05-17T19:30:23.889310 #1799568] INFO -- : generating aarch64-linux-fake.rb I, [2024-05-17T19:30:23.946038 #1799568] INFO -- : aarch64-linux-fake.rb updated I, [2024-05-17T19:30:23.947759 #1799568] INFO -- : generating enc.mk I, [2024-05-17T19:30:24.177655 #1799568] INFO -- : making srcs under enc I, [2024-05-17T19:30:24.219504 #1799568] INFO -- : make[1]: Entering directory '/home/opc/ruby/build/master' I, [2024-05-17T19:30:24.219581 #1799568] INFO -- : make[1]: Nothing to be done for 'srcs'. I, [2024-05-17T19:30:24.219592 #1799568] INFO -- : make[1]: Leaving directory '/home/opc/ruby/build/master' I, [2024-05-17T19:30:24.300707 #1799568] INFO -- : Update power_assert to 84e85124c5014a139af39161d484156cfe87a9ed I, [2024-05-17T19:30:24.300775 #1799568] INFO -- : Update rbs to ba7872795d5de04adb8ff500c0e6afdc81a041dd I, [2024-05-17T19:30:24.301857 #1799568] INFO -- : Update typeprof to b19a6416da3a05d57fadd6ffdadb382b6d236ca5 I, [2024-05-17T19:30:24.304792 #1799568] INFO -- : echo 84e85124c5014a139af39161d484156cfe87a9ed | /bin/sh /home/opc/ruby/src/master/tool/ifchange /home/opc/ruby/src/master/.bundle/.timestamp/power_assert.revision - I, [2024-05-17T19:30:24.304940 #1799568] INFO -- : echo ba7872795d5de04adb8ff500c0e6afdc81a041dd | /bin/sh /home/opc/ruby/src/master/tool/ifchange /home/opc/ruby/src/master/.bundle/.timestamp/rbs.revision - I, [2024-05-17T19:30:24.305088 #1799568] INFO -- : echo b19a6416da3a05d57fadd6ffdadb382b6d236ca5 | /bin/sh /home/opc/ruby/src/master/tool/ifchange /home/opc/ruby/src/master/.bundle/.timestamp/typeprof.revision - I, [2024-05-17T19:30:24.310851 #1799568] INFO -- : /home/opc/ruby/src/master/.bundle/.timestamp/power_assert.revision unchanged I, [2024-05-17T19:30:24.310916 #1799568] INFO -- : /home/opc/ruby/src/master/.bundle/.timestamp/typeprof.revision unchanged I, [2024-05-17T19:30:24.312304 #1799568] INFO -- : /home/opc/ruby/src/master/.bundle/.timestamp/rbs.revision unchanged I, [2024-05-17T19:30:24.405194 #1799568] INFO -- : Building power_assert@84e85124c5014a139af39161d484156cfe87a9ed to /home/opc/ruby/src/master/gems/power_assert-2.0.3.gem I, [2024-05-17T19:30:24.517522 #1799568] INFO -- : Successfully built RubyGem I, [2024-05-17T19:30:24.517585 #1799568] INFO -- : Name: power_assert I, [2024-05-17T19:30:24.517595 #1799568] INFO -- : Version: 2.0.4dev I, [2024-05-17T19:30:24.517605 #1799568] INFO -- : File: power_assert-2.0.4dev.gem I, [2024-05-17T19:30:24.519842 #1799568] INFO -- : Extracting bundle gem power_assert-2.0.3... I, [2024-05-17T19:30:24.617988 #1799568] INFO -- : Try with hash version of bundled gems instead of gems/power_assert-2.0.3.gem. We don't use this gem with release version of Ruby. I, [2024-05-17T19:30:24.628774 #1799568] INFO -- : Unpacked gems/power_assert-2.0.4dev.gem I, [2024-05-17T19:30:24.630941 #1799568] INFO -- : $$$[end] "make after-update -j3" exit with 0. I, [2024-05-17T19:30:24.631079 #1799568] INFO -- : $$$[beg] make miniruby -j3 I, [2024-05-17T19:30:24.719212 #1799568] INFO -- : BASERUBY = /usr/local/bin/ruby --disable=gems I, [2024-05-17T19:30:24.719284 #1799568] INFO -- : CC = gcc I, [2024-05-17T19:30:24.719295 #1799568] INFO -- : LD = ld I, [2024-05-17T19:30:24.719305 #1799568] INFO -- : LDSHARED = gcc -shared I, [2024-05-17T19:30:24.719316 #1799568] INFO -- : CFLAGS = -O3 -fno-fast-math -ggdb3 -Wall -Wextra -Wdeprecated-declarations -Wdiv-by-zero -Wduplicated-cond -Wimplicit-function-declaration -Wimplicit-int -Wpointer-arith -Wwrite-strings -Wold-style-definition -Wimplicit-fallthrough=0 -Wmissing-noreturn -Wno-cast-function-type -Wno-constant-logical-operand -Wno-long-long -Wno-missing-field-initializers -Wno-overlength-strings -Wno-packed-bitfield-compat -Wno-parentheses-equality -Wno-self-assign -Wno-tautological-compare -Wno-unused-parameter -Wno-unused-value -Wsuggest-attribute=format -Wsuggest-attribute=noreturn -Wunused-variable -Wmisleading-indentation -Wundef I, [2024-05-17T19:30:24.719326 #1799568] INFO -- : XCFLAGS = -U_FORTIFY_SOURCE -D_FORTIFY_SOURCE=2 -fstack-protector-strong -msign-return-address=all -fno-strict-overflow -fvisibility=hidden -fexcess-precision=standard -DRUBY_EXPORT -fPIE -I. -I.ext/include/aarch64-linux -I/home/opc/ruby/src/master/include -I/home/opc/ruby/src/master -I/home/opc/ruby/src/master/prism -I/home/opc/ruby/src/master/enc/unicode/15.0.0 I, [2024-05-17T19:30:24.719334 #1799568] INFO -- : CPPFLAGS = I, [2024-05-17T19:30:24.719343 #1799568] INFO -- : DLDFLAGS = -Wl,--compress-debug-sections=zlib -fstack-protector-strong -pie I, [2024-05-17T19:30:24.719352 #1799568] INFO -- : SOLIBS = -lz -lrt -lrt -ldl -lcrypt -lm -lpthread I, [2024-05-17T19:30:24.719360 #1799568] INFO -- : LANG = en_US.UTF-8 I, [2024-05-17T19:30:24.719368 #1799568] INFO -- : LC_ALL = I, [2024-05-17T19:30:24.719375 #1799568] INFO -- : LC_CTYPE = I, [2024-05-17T19:30:24.719384 #1799568] INFO -- : MFLAGS = -j3 --jobserver-auth=4,5 I, [2024-05-17T19:30:24.719414 #1799568] INFO -- : RUSTC = rustc I, [2024-05-17T19:30:24.719423 #1799568] INFO -- : YJIT_RUSTC_ARGS = --crate-name=yjit --crate-type=staticlib --edition=2021 -g -C lto=thin -C opt-level=3 -C overflow-checks=on '--out-dir=/home/opc/ruby/build/master/yjit/target/release/' /home/opc/ruby/src/master/yjit/src/lib.rs I, [2024-05-17T19:30:24.720027 #1799568] INFO -- : gcc (GCC) 8.5.0 20210514 (Red Hat 8.5.0-10.1.0.1) I, [2024-05-17T19:30:24.720047 #1799568] INFO -- : Copyright (C) 2018 Free Software Foundation, Inc. I, [2024-05-17T19:30:24.720060 #1799568] INFO -- : This is free software; see the source for copying conditions. There is NO I, [2024-05-17T19:30:24.720069 #1799568] INFO -- : warranty; not even for MERCHANTABILITY or FITNESS FOR A PARTICULAR PURPOSE. I, [2024-05-17T19:30:24.720077 #1799568] INFO -- : I, [2024-05-17T19:30:24.744986 #1799568] INFO -- : compiling /home/opc/ruby/src/master/version.c I, [2024-05-17T19:30:24.888298 #1799568] INFO -- : linking miniruby I, [2024-05-17T19:30:25.790002 #1799568] INFO -- : $$$[end] "make miniruby -j3" exit with 0. I, [2024-05-17T19:30:25.790224 #1799568] INFO -- : $$$[beg] make ruby -j3 I, [2024-05-17T19:30:25.878410 #1799568] INFO -- : BASERUBY = /usr/local/bin/ruby --disable=gems I, [2024-05-17T19:30:25.878474 #1799568] INFO -- : CC = gcc I, [2024-05-17T19:30:25.878485 #1799568] INFO -- : LD = ld I, [2024-05-17T19:30:25.878496 #1799568] INFO -- : LDSHARED = gcc -shared I, [2024-05-17T19:30:25.878505 #1799568] INFO -- : CFLAGS = -O3 -fno-fast-math -ggdb3 -Wall -Wextra -Wdeprecated-declarations -Wdiv-by-zero -Wduplicated-cond -Wimplicit-function-declaration -Wimplicit-int -Wpointer-arith -Wwrite-strings -Wold-style-definition -Wimplicit-fallthrough=0 -Wmissing-noreturn -Wno-cast-function-type -Wno-constant-logical-operand -Wno-long-long -Wno-missing-field-initializers -Wno-overlength-strings -Wno-packed-bitfield-compat -Wno-parentheses-equality -Wno-self-assign -Wno-tautological-compare -Wno-unused-parameter -Wno-unused-value -Wsuggest-attribute=format -Wsuggest-attribute=noreturn -Wunused-variable -Wmisleading-indentation -Wundef I, [2024-05-17T19:30:25.878515 #1799568] INFO -- : XCFLAGS = -U_FORTIFY_SOURCE -D_FORTIFY_SOURCE=2 -fstack-protector-strong -msign-return-address=all -fno-strict-overflow -fvisibility=hidden -fexcess-precision=standard -DRUBY_EXPORT -fPIE -I. -I.ext/include/aarch64-linux -I/home/opc/ruby/src/master/include -I/home/opc/ruby/src/master -I/home/opc/ruby/src/master/prism -I/home/opc/ruby/src/master/enc/unicode/15.0.0 I, [2024-05-17T19:30:25.878524 #1799568] INFO -- : CPPFLAGS = I, [2024-05-17T19:30:25.878532 #1799568] INFO -- : DLDFLAGS = -Wl,--compress-debug-sections=zlib -fstack-protector-strong -pie I, [2024-05-17T19:30:25.878540 #1799568] INFO -- : SOLIBS = -lz -lrt -lrt -ldl -lcrypt -lm -lpthread I, [2024-05-17T19:30:25.878549 #1799568] INFO -- : LANG = en_US.UTF-8 I, [2024-05-17T19:30:25.878556 #1799568] INFO -- : LC_ALL = I, [2024-05-17T19:30:25.878565 #1799568] INFO -- : LC_CTYPE = I, [2024-05-17T19:30:25.878572 #1799568] INFO -- : MFLAGS = -j3 --jobserver-auth=4,5 I, [2024-05-17T19:30:25.878580 #1799568] INFO -- : RUSTC = rustc I, [2024-05-17T19:30:25.878588 #1799568] INFO -- : YJIT_RUSTC_ARGS = --crate-name=yjit --crate-type=staticlib --edition=2021 -g -C lto=thin -C opt-level=3 -C overflow-checks=on '--out-dir=/home/opc/ruby/build/master/yjit/target/release/' /home/opc/ruby/src/master/yjit/src/lib.rs I, [2024-05-17T19:30:25.879316 #1799568] INFO -- : gcc (GCC) 8.5.0 20210514 (Red Hat 8.5.0-10.1.0.1) I, [2024-05-17T19:30:25.879351 #1799568] INFO -- : Copyright (C) 2018 Free Software Foundation, Inc. I, [2024-05-17T19:30:25.879362 #1799568] INFO -- : This is free software; see the source for copying conditions. There is NO I, [2024-05-17T19:30:25.879371 #1799568] INFO -- : warranty; not even for MERCHANTABILITY or FITNESS FOR A PARTICULAR PURPOSE. I, [2024-05-17T19:30:25.879379 #1799568] INFO -- : I, [2024-05-17T19:30:26.059117 #1799568] INFO -- : builtin_binary.inc updated I, [2024-05-17T19:30:26.062450 #1799568] INFO -- : c5234a9416e4f20f175185e840b25b0f08674d14078ed7083f37e655458e3ca9 builtin_binary.inc I, [2024-05-17T19:30:26.063334 #1799568] INFO -- : compiling /home/opc/ruby/src/master/builtin.c I, [2024-05-17T19:30:26.389256 #1799568] INFO -- : linking static-library libruby-static.a I, [2024-05-17T19:30:29.077765 #1799568] INFO -- : linking ruby I, [2024-05-17T19:30:29.999023 #1799568] INFO -- : $$$[end] "make ruby -j3" exit with 0. I, [2024-05-17T19:30:29.999201 #1799568] INFO -- : $$$[beg] make all -j3 I, [2024-05-17T19:30:30.087260 #1799568] INFO -- : BASERUBY = /usr/local/bin/ruby --disable=gems I, [2024-05-17T19:30:30.087324 #1799568] INFO -- : CC = gcc I, [2024-05-17T19:30:30.087335 #1799568] INFO -- : LD = ld I, [2024-05-17T19:30:30.087344 #1799568] INFO -- : LDSHARED = gcc -shared I, [2024-05-17T19:30:30.087354 #1799568] INFO -- : CFLAGS = -O3 -fno-fast-math -ggdb3 -Wall -Wextra -Wdeprecated-declarations -Wdiv-by-zero -Wduplicated-cond -Wimplicit-function-declaration -Wimplicit-int -Wpointer-arith -Wwrite-strings -Wold-style-definition -Wimplicit-fallthrough=0 -Wmissing-noreturn -Wno-cast-function-type -Wno-constant-logical-operand -Wno-long-long -Wno-missing-field-initializers -Wno-overlength-strings -Wno-packed-bitfield-compat -Wno-parentheses-equality -Wno-self-assign -Wno-tautological-compare -Wno-unused-parameter -Wno-unused-value -Wsuggest-attribute=format -Wsuggest-attribute=noreturn -Wunused-variable -Wmisleading-indentation -Wundef I, [2024-05-17T19:30:30.087363 #1799568] INFO -- : XCFLAGS = -U_FORTIFY_SOURCE -D_FORTIFY_SOURCE=2 -fstack-protector-strong -msign-return-address=all -fno-strict-overflow -fvisibility=hidden -fexcess-precision=standard -DRUBY_EXPORT -fPIE -I. -I.ext/include/aarch64-linux -I/home/opc/ruby/src/master/include -I/home/opc/ruby/src/master -I/home/opc/ruby/src/master/prism -I/home/opc/ruby/src/master/enc/unicode/15.0.0 I, [2024-05-17T19:30:30.087372 #1799568] INFO -- : CPPFLAGS = I, [2024-05-17T19:30:30.087380 #1799568] INFO -- : DLDFLAGS = -Wl,--compress-debug-sections=zlib -fstack-protector-strong -pie I, [2024-05-17T19:30:30.087389 #1799568] INFO -- : SOLIBS = -lz -lrt -lrt -ldl -lcrypt -lm -lpthread I, [2024-05-17T19:30:30.087397 #1799568] INFO -- : LANG = en_US.UTF-8 I, [2024-05-17T19:30:30.087404 #1799568] INFO -- : LC_ALL = I, [2024-05-17T19:30:30.087412 #1799568] INFO -- : LC_CTYPE = I, [2024-05-17T19:30:30.087420 #1799568] INFO -- : MFLAGS = -j3 --jobserver-auth=4,5 I, [2024-05-17T19:30:30.087428 #1799568] INFO -- : RUSTC = rustc I, [2024-05-17T19:30:30.087436 #1799568] INFO -- : YJIT_RUSTC_ARGS = --crate-name=yjit --crate-type=staticlib --edition=2021 -g -C lto=thin -C opt-level=3 -C overflow-checks=on '--out-dir=/home/opc/ruby/build/master/yjit/target/release/' /home/opc/ruby/src/master/yjit/src/lib.rs I, [2024-05-17T19:30:30.088228 #1799568] INFO -- : gcc (GCC) 8.5.0 20210514 (Red Hat 8.5.0-10.1.0.1) I, [2024-05-17T19:30:30.088261 #1799568] INFO -- : Copyright (C) 2018 Free Software Foundation, Inc. I, [2024-05-17T19:30:30.088272 #1799568] INFO -- : This is free software; see the source for copying conditions. There is NO I, [2024-05-17T19:30:30.088281 #1799568] INFO -- : warranty; not even for MERCHANTABILITY or FITNESS FOR A PARTICULAR PURPOSE. I, [2024-05-17T19:30:30.088290 #1799568] INFO -- : I, [2024-05-17T19:30:30.121911 #1799568] INFO -- : generating encdb.h I, [2024-05-17T19:30:30.123441 #1799568] INFO -- : generating enc.mk I, [2024-05-17T19:30:30.160047 #1799568] INFO -- : encdb.h unchanged I, [2024-05-17T19:30:30.358959 #1799568] INFO -- : making srcs under enc I, [2024-05-17T19:30:30.359127 #1799568] INFO -- : making enc I, [2024-05-17T19:30:30.386422 #1799568] INFO -- : make[1]: Entering directory '/home/opc/ruby/build/master' I, [2024-05-17T19:30:30.386488 #1799568] INFO -- : make[1]: Nothing to be done for 'enc'. I, [2024-05-17T19:30:30.386499 #1799568] INFO -- : make[1]: Leaving directory '/home/opc/ruby/build/master' I, [2024-05-17T19:30:30.401780 #1799568] INFO -- : make[1]: Entering directory '/home/opc/ruby/build/master' I, [2024-05-17T19:30:30.401817 #1799568] INFO -- : make[1]: Nothing to be done for 'srcs'. I, [2024-05-17T19:30:30.401828 #1799568] INFO -- : make[1]: Leaving directory '/home/opc/ruby/build/master' I, [2024-05-17T19:30:30.402557 #1799568] INFO -- : generating transdb.h I, [2024-05-17T19:30:30.548749 #1799568] INFO -- : transdb.h unchanged I, [2024-05-17T19:30:30.550079 #1799568] INFO -- : generating makefiles ext/configure-ext.mk I, [2024-05-17T19:30:30.550253 #1799568] INFO -- : making trans I, [2024-05-17T19:30:30.590252 #1799568] INFO -- : ext/configure-ext.mk updated I, [2024-05-17T19:30:30.593507 #1799568] INFO -- : make[1]: Entering directory '/home/opc/ruby/build/master' I, [2024-05-17T19:30:30.598476 #1799568] INFO -- : make[1]: Entering directory '/home/opc/ruby/build/master' I, [2024-05-17T19:30:30.598517 #1799568] INFO -- : make[1]: Nothing to be done for 'trans'. I, [2024-05-17T19:30:30.598529 #1799568] INFO -- : make[1]: Leaving directory '/home/opc/ruby/build/master' I, [2024-05-17T19:30:31.287487 #1799568] INFO -- : making encs I, [2024-05-17T19:30:31.329973 #1799568] INFO -- : make[1]: Leaving directory '/home/opc/ruby/build/master' I, [2024-05-17T19:30:31.330684 #1799568] INFO -- : generating makefile exts.mk I, [2024-05-17T19:30:31.340274 #1799568] INFO -- : make[1]: Entering directory '/home/opc/ruby/build/master' I, [2024-05-17T19:30:31.340332 #1799568] INFO -- : make[1]: Nothing to be done for 'encs'. I, [2024-05-17T19:30:31.340347 #1799568] INFO -- : make[1]: Leaving directory '/home/opc/ruby/build/master' I, [2024-05-17T19:30:31.390242 #1799568] INFO -- : exts.mk unchanged I, [2024-05-17T19:30:31.394990 #1799568] INFO -- : make[1]: Entering directory '/home/opc/ruby/build/master' I, [2024-05-17T19:30:31.502577 #1799568] INFO -- : make[2]: Entering directory '/home/opc/ruby/build/master/ext/coverage' I, [2024-05-17T19:30:31.505214 #1799568] INFO -- : make[2]: Entering directory '/home/opc/ruby/build/master/ext/digest' I, [2024-05-17T19:30:31.505333 #1799568] INFO -- : make[2]: Entering directory '/home/opc/ruby/build/master/ext/date' I, [2024-05-17T19:30:31.507073 #1799568] INFO -- : make[2]: Leaving directory '/home/opc/ruby/build/master/ext/coverage' I, [2024-05-17T19:30:31.512134 #1799568] INFO -- : make[2]: Leaving directory '/home/opc/ruby/build/master/ext/date' I, [2024-05-17T19:30:31.513284 #1799568] INFO -- : make[2]: Leaving directory '/home/opc/ruby/build/master/ext/digest' I, [2024-05-17T19:30:31.519372 #1799568] INFO -- : make[2]: Entering directory '/home/opc/ruby/build/master/ext/io/console' I, [2024-05-17T19:30:31.520320 #1799568] INFO -- : make[2]: Entering directory '/home/opc/ruby/build/master/ext/fiddle' I, [2024-05-17T19:30:31.525163 #1799568] INFO -- : make[2]: Leaving directory '/home/opc/ruby/build/master/ext/io/console' I, [2024-05-17T19:30:31.527409 #1799568] INFO -- : make[2]: Entering directory '/home/opc/ruby/build/master/ext/json' I, [2024-05-17T19:30:31.529017 #1799568] INFO -- : make[2]: Leaving directory '/home/opc/ruby/build/master/ext/fiddle' I, [2024-05-17T19:30:31.530900 #1799568] INFO -- : make[2]: Entering directory '/home/opc/ruby/build/master/ext/monitor' I, [2024-05-17T19:30:31.535652 #1799568] INFO -- : make[2]: Leaving directory '/home/opc/ruby/build/master/ext/json' I, [2024-05-17T19:30:31.536247 #1799568] INFO -- : make[2]: Entering directory '/home/opc/ruby/build/master/ext/objspace' I, [2024-05-17T19:30:31.539846 #1799568] INFO -- : make[2]: Leaving directory '/home/opc/ruby/build/master/ext/monitor' I, [2024-05-17T19:30:31.541635 #1799568] INFO -- : make[2]: Leaving directory '/home/opc/ruby/build/master/ext/objspace' I, [2024-05-17T19:30:31.544030 #1799568] INFO -- : make[2]: Entering directory '/home/opc/ruby/build/master/ext/pathname' I, [2024-05-17T19:30:31.547901 #1799568] INFO -- : make[2]: Entering directory '/home/opc/ruby/build/master/ext/psych' I, [2024-05-17T19:30:31.552521 #1799568] INFO -- : make[2]: Leaving directory '/home/opc/ruby/build/master/ext/pathname' I, [2024-05-17T19:30:31.552657 #1799568] INFO -- : make[2]: Entering directory '/home/opc/ruby/build/master/ext/pty' I, [2024-05-17T19:30:31.556065 #1799568] INFO -- : make[2]: Entering directory '/home/opc/ruby/build/master/ext/openssl' I, [2024-05-17T19:30:31.558088 #1799568] INFO -- : make[2]: Leaving directory '/home/opc/ruby/build/master/ext/pty' I, [2024-05-17T19:30:31.568661 #1799568] INFO -- : make[2]: Leaving directory '/home/opc/ruby/build/master/ext/psych' I, [2024-05-17T19:30:31.570436 #1799568] INFO -- : make[2]: Entering directory '/home/opc/ruby/build/master/ext/rubyvm' I, [2024-05-17T19:30:31.573160 #1799568] INFO -- : make[2]: Entering directory '/home/opc/ruby/build/master/ext/ripper' I, [2024-05-17T19:30:31.575077 #1799568] INFO -- : make[2]: Leaving directory '/home/opc/ruby/build/master/ext/rubyvm' I, [2024-05-17T19:30:31.580562 #1799568] INFO -- : make[2]: Leaving directory '/home/opc/ruby/build/master/ext/ripper' I, [2024-05-17T19:30:31.581100 #1799568] INFO -- : make[2]: Leaving directory '/home/opc/ruby/build/master/ext/openssl' I, [2024-05-17T19:30:31.587346 #1799568] INFO -- : make[2]: Entering directory '/home/opc/ruby/build/master/ext/socket' I, [2024-05-17T19:30:31.588133 #1799568] INFO -- : make[2]: Entering directory '/home/opc/ruby/build/master/.bundle/gems/bigdecimal-3.1.7/ext/bigdecimal' I, [2024-05-17T19:30:31.592501 #1799568] INFO -- : make[2]: Entering directory '/home/opc/ruby/build/master/.bundle/gems/bigdecimal-3.1.8/ext/bigdecimal' I, [2024-05-17T19:30:31.599062 #1799568] INFO -- : make[2]: Leaving directory '/home/opc/ruby/build/master/ext/socket' I, [2024-05-17T19:30:31.605831 #1799568] INFO -- : make[2]: Entering directory '/home/opc/ruby/build/master/.bundle/gems/debug-1.9.2/ext/debug' I, [2024-05-17T19:30:31.618673 #1799568] INFO -- : make[2]: Leaving directory '/home/opc/ruby/build/master/.bundle/gems/bigdecimal-3.1.7/ext/bigdecimal' I, [2024-05-17T19:30:31.621315 #1799568] INFO -- : make[2]: Entering directory '/home/opc/ruby/build/master/.bundle/gems/nkf-0.2.0/ext/nkf' I, [2024-05-17T19:30:31.623897 #1799568] INFO -- : make[2]: Leaving directory '/home/opc/ruby/build/master/.bundle/gems/bigdecimal-3.1.8/ext/bigdecimal' I, [2024-05-17T19:30:31.629721 #1799568] INFO -- : make[2]: Entering directory '/home/opc/ruby/build/master/.bundle/gems/racc-1.7.3/ext/racc/cparse' I, [2024-05-17T19:30:31.638352 #1799568] INFO -- : make[2]: Leaving directory '/home/opc/ruby/build/master/.bundle/gems/debug-1.9.2/ext/debug' I, [2024-05-17T19:30:31.641214 #1799568] INFO -- : make[2]: Entering directory '/home/opc/ruby/build/master/.bundle/gems/rbs-3.4.4/ext/rbs_extension' I, [2024-05-17T19:30:31.651814 #1799568] INFO -- : make[2]: Leaving directory '/home/opc/ruby/build/master/.bundle/gems/nkf-0.2.0/ext/nkf' I, [2024-05-17T19:30:31.658134 #1799568] INFO -- : make[2]: Entering directory '/home/opc/ruby/build/master/.bundle/gems/syslog-0.1.2/ext/syslog' I, [2024-05-17T19:30:31.662179 #1799568] INFO -- : make[2]: Leaving directory '/home/opc/ruby/build/master/.bundle/gems/racc-1.7.3/ext/racc/cparse' I, [2024-05-17T19:30:31.676387 #1799568] INFO -- : make[2]: Leaving directory '/home/opc/ruby/build/master/.bundle/gems/rbs-3.4.4/ext/rbs_extension' I, [2024-05-17T19:30:31.681931 #1799568] INFO -- : make[2]: Entering directory '/home/opc/ruby/build/master/ext/digest/sha2' I, [2024-05-17T19:30:31.689188 #1799568] INFO -- : make[2]: Leaving directory '/home/opc/ruby/build/master/ext/digest/sha2' I, [2024-05-17T19:30:31.689241 #1799568] INFO -- : make[2]: Leaving directory '/home/opc/ruby/build/master/.bundle/gems/syslog-0.1.2/ext/syslog' I, [2024-05-17T19:30:31.730302 #1799568] INFO -- : make[2]: Entering directory '/home/opc/ruby/build/master' I, [2024-05-17T19:30:31.815693 #1799568] INFO -- : make[2]: 'ruby' is up to date. I, [2024-05-17T19:30:31.815764 #1799568] INFO -- : make[2]: Leaving directory '/home/opc/ruby/build/master' I, [2024-05-17T19:30:31.815883 #1799568] INFO -- : make[1]: Leaving directory '/home/opc/ruby/build/master' I, [2024-05-17T19:30:31.820277 #1799568] INFO -- : make[1]: Entering directory '/home/opc/ruby/build/master' I, [2024-05-17T19:30:31.820321 #1799568] INFO -- : make[1]: Nothing to be done for 'note'. I, [2024-05-17T19:30:31.820333 #1799568] INFO -- : make[1]: Leaving directory '/home/opc/ruby/build/master' I, [2024-05-17T19:30:31.820639 #1799568] INFO -- : $$$[end] "make all -j3" exit with 0. I, [2024-05-17T19:30:31.820792 #1799568] INFO -- : $$$[beg] make install -j3 I, [2024-05-17T19:30:31.914721 #1799568] INFO -- : Update power_assert to 84e85124c5014a139af39161d484156cfe87a9ed I, [2024-05-17T19:30:31.914792 #1799568] INFO -- : Update rbs to ba7872795d5de04adb8ff500c0e6afdc81a041dd I, [2024-05-17T19:30:31.915907 #1799568] INFO -- : Update typeprof to b19a6416da3a05d57fadd6ffdadb382b6d236ca5 I, [2024-05-17T19:30:31.918938 #1799568] INFO -- : echo ba7872795d5de04adb8ff500c0e6afdc81a041dd | /bin/sh /home/opc/ruby/src/master/tool/ifchange /home/opc/ruby/src/master/.bundle/.timestamp/rbs.revision - I, [2024-05-17T19:30:31.919171 #1799568] INFO -- : echo 84e85124c5014a139af39161d484156cfe87a9ed | /bin/sh /home/opc/ruby/src/master/tool/ifchange /home/opc/ruby/src/master/.bundle/.timestamp/power_assert.revision - I, [2024-05-17T19:30:31.919488 #1799568] INFO -- : echo b19a6416da3a05d57fadd6ffdadb382b6d236ca5 | /bin/sh /home/opc/ruby/src/master/tool/ifchange /home/opc/ruby/src/master/.bundle/.timestamp/typeprof.revision - I, [2024-05-17T19:30:31.924960 #1799568] INFO -- : /home/opc/ruby/src/master/.bundle/.timestamp/rbs.revision unchanged I, [2024-05-17T19:30:31.925170 #1799568] INFO -- : /home/opc/ruby/src/master/.bundle/.timestamp/power_assert.revision unchanged I, [2024-05-17T19:30:31.926617 #1799568] INFO -- : /home/opc/ruby/src/master/.bundle/.timestamp/typeprof.revision unchanged I, [2024-05-17T19:30:31.930117 #1799568] INFO -- : BASERUBY = /usr/local/bin/ruby --disable=gems I, [2024-05-17T19:30:31.930159 #1799568] INFO -- : CC = gcc I, [2024-05-17T19:30:31.930170 #1799568] INFO -- : LD = ld I, [2024-05-17T19:30:31.930180 #1799568] INFO -- : LDSHARED = gcc -shared I, [2024-05-17T19:30:31.930189 #1799568] INFO -- : CFLAGS = -O3 -fno-fast-math -ggdb3 -Wall -Wextra -Wdeprecated-declarations -Wdiv-by-zero -Wduplicated-cond -Wimplicit-function-declaration -Wimplicit-int -Wpointer-arith -Wwrite-strings -Wold-style-definition -Wimplicit-fallthrough=0 -Wmissing-noreturn -Wno-cast-function-type -Wno-constant-logical-operand -Wno-long-long -Wno-missing-field-initializers -Wno-overlength-strings -Wno-packed-bitfield-compat -Wno-parentheses-equality -Wno-self-assign -Wno-tautological-compare -Wno-unused-parameter -Wno-unused-value -Wsuggest-attribute=format -Wsuggest-attribute=noreturn -Wunused-variable -Wmisleading-indentation -Wundef I, [2024-05-17T19:30:31.930200 #1799568] INFO -- : XCFLAGS = -U_FORTIFY_SOURCE -D_FORTIFY_SOURCE=2 -fstack-protector-strong -msign-return-address=all -fno-strict-overflow -fvisibility=hidden -fexcess-precision=standard -DRUBY_EXPORT -fPIE -I. -I.ext/include/aarch64-linux -I/home/opc/ruby/src/master/include -I/home/opc/ruby/src/master -I/home/opc/ruby/src/master/prism -I/home/opc/ruby/src/master/enc/unicode/15.0.0 I, [2024-05-17T19:30:31.930209 #1799568] INFO -- : CPPFLAGS = I, [2024-05-17T19:30:31.930217 #1799568] INFO -- : DLDFLAGS = -Wl,--compress-debug-sections=zlib -fstack-protector-strong -pie I, [2024-05-17T19:30:31.930225 #1799568] INFO -- : SOLIBS = -lz -lrt -lrt -ldl -lcrypt -lm -lpthread I, [2024-05-17T19:30:31.930233 #1799568] INFO -- : LANG = en_US.UTF-8 I, [2024-05-17T19:30:31.930241 #1799568] INFO -- : LC_ALL = I, [2024-05-17T19:30:31.930267 #1799568] INFO -- : LC_CTYPE = I, [2024-05-17T19:30:31.930276 #1799568] INFO -- : MFLAGS = -j3 --jobserver-auth=4,5 I, [2024-05-17T19:30:31.930284 #1799568] INFO -- : RUSTC = rustc I, [2024-05-17T19:30:31.930292 #1799568] INFO -- : YJIT_RUSTC_ARGS = --crate-name=yjit --crate-type=staticlib --edition=2021 -g -C lto=thin -C opt-level=3 -C overflow-checks=on '--out-dir=/home/opc/ruby/build/master/yjit/target/release/' /home/opc/ruby/src/master/yjit/src/lib.rs I, [2024-05-17T19:30:31.961236 #1799568] INFO -- : generating encdb.h I, [2024-05-17T19:30:31.961378 #1799568] INFO -- : gcc (GCC) 8.5.0 20210514 (Red Hat 8.5.0-10.1.0.1) I, [2024-05-17T19:30:31.961397 #1799568] INFO -- : Copyright (C) 2018 Free Software Foundation, Inc. I, [2024-05-17T19:30:31.961406 #1799568] INFO -- : This is free software; see the source for copying conditions. There is NO I, [2024-05-17T19:30:31.961471 #1799568] INFO -- : warranty; not even for MERCHANTABILITY or FITNESS FOR A PARTICULAR PURPOSE. I, [2024-05-17T19:30:31.961480 #1799568] INFO -- : I, [2024-05-17T19:30:31.962325 #1799568] INFO -- : generating enc.mk I, [2024-05-17T19:30:31.999069 #1799568] INFO -- : encdb.h unchanged I, [2024-05-17T19:30:32.089284 #1799568] INFO -- : Building power_assert@84e85124c5014a139af39161d484156cfe87a9ed to /home/opc/ruby/src/master/gems/power_assert-2.0.3.gem I, [2024-05-17T19:30:32.203087 #1799568] INFO -- : making srcs under enc I, [2024-05-17T19:30:32.203295 #1799568] INFO -- : making enc I, [2024-05-17T19:30:32.210617 #1799568] INFO -- : Successfully built RubyGem I, [2024-05-17T19:30:32.210662 #1799568] INFO -- : Name: power_assert I, [2024-05-17T19:30:32.210673 #1799568] INFO -- : Version: 2.0.4dev I, [2024-05-17T19:30:32.210682 #1799568] INFO -- : File: power_assert-2.0.4dev.gem I, [2024-05-17T19:30:32.212770 #1799568] INFO -- : Extracting bundle gem power_assert-2.0.3... I, [2024-05-17T19:30:32.231775 #1799568] INFO -- : make[1]: Entering directory '/home/opc/ruby/build/master' I, [2024-05-17T19:30:32.231847 #1799568] INFO -- : make[1]: Nothing to be done for 'enc'. I, [2024-05-17T19:30:32.231878 #1799568] INFO -- : make[1]: Leaving directory '/home/opc/ruby/build/master' I, [2024-05-17T19:30:32.245253 #1799568] INFO -- : make[1]: Entering directory '/home/opc/ruby/build/master' I, [2024-05-17T19:30:32.245305 #1799568] INFO -- : make[1]: Nothing to be done for 'srcs'. I, [2024-05-17T19:30:32.245317 #1799568] INFO -- : make[1]: Leaving directory '/home/opc/ruby/build/master' I, [2024-05-17T19:30:32.246137 #1799568] INFO -- : generating transdb.h I, [2024-05-17T19:30:32.311118 #1799568] INFO -- : Try with hash version of bundled gems instead of gems/power_assert-2.0.3.gem. We don't use this gem with release version of Ruby. I, [2024-05-17T19:30:32.321202 #1799568] INFO -- : Unpacked gems/power_assert-2.0.4dev.gem I, [2024-05-17T19:30:32.390106 #1799568] INFO -- : transdb.h unchanged I, [2024-05-17T19:30:32.391521 #1799568] INFO -- : generating makefiles ext/configure-ext.mk I, [2024-05-17T19:30:32.391557 #1799568] INFO -- : making trans I, [2024-05-17T19:30:32.431021 #1799568] INFO -- : ext/configure-ext.mk unchanged I, [2024-05-17T19:30:32.434002 #1799568] INFO -- : make[1]: Entering directory '/home/opc/ruby/build/master' I, [2024-05-17T19:30:32.440550 #1799568] INFO -- : make[1]: Entering directory '/home/opc/ruby/build/master' I, [2024-05-17T19:30:32.440603 #1799568] INFO -- : make[1]: Nothing to be done for 'trans'. I, [2024-05-17T19:30:32.440615 #1799568] INFO -- : make[1]: Leaving directory '/home/opc/ruby/build/master' I, [2024-05-17T19:30:32.441376 #1799568] INFO -- : making encs I, [2024-05-17T19:30:32.496942 #1799568] INFO -- : make[1]: Entering directory '/home/opc/ruby/build/master' I, [2024-05-17T19:30:32.497008 #1799568] INFO -- : make[1]: Nothing to be done for 'encs'. I, [2024-05-17T19:30:32.497019 #1799568] INFO -- : make[1]: Leaving directory '/home/opc/ruby/build/master' I, [2024-05-17T19:30:33.189891 #1799568] INFO -- : make[1]: Leaving directory '/home/opc/ruby/build/master' I, [2024-05-17T19:30:33.190556 #1799568] INFO -- : generating makefile exts.mk I, [2024-05-17T19:30:33.251389 #1799568] INFO -- : exts.mk unchanged I, [2024-05-17T19:30:33.256222 #1799568] INFO -- : make[1]: Entering directory '/home/opc/ruby/build/master' I, [2024-05-17T19:30:33.359981 #1799568] INFO -- : make[2]: Entering directory '/home/opc/ruby/build/master/ext/coverage' I, [2024-05-17T19:30:33.362623 #1799568] INFO -- : make[2]: Entering directory '/home/opc/ruby/build/master/ext/digest' I, [2024-05-17T19:30:33.363357 #1799568] INFO -- : make[2]: Entering directory '/home/opc/ruby/build/master/ext/date' I, [2024-05-17T19:30:33.364691 #1799568] INFO -- : make[2]: Leaving directory '/home/opc/ruby/build/master/ext/coverage' I, [2024-05-17T19:30:33.370758 #1799568] INFO -- : make[2]: Leaving directory '/home/opc/ruby/build/master/ext/date' I, [2024-05-17T19:30:33.374984 #1799568] INFO -- : make[2]: Leaving directory '/home/opc/ruby/build/master/ext/digest' I, [2024-05-17T19:30:33.379083 #1799568] INFO -- : make[2]: Entering directory '/home/opc/ruby/build/master/ext/io/console' I, [2024-05-17T19:30:33.379310 #1799568] INFO -- : make[2]: Entering directory '/home/opc/ruby/build/master/ext/fiddle' I, [2024-05-17T19:30:33.384343 #1799568] INFO -- : make[2]: Leaving directory '/home/opc/ruby/build/master/ext/io/console' I, [2024-05-17T19:30:33.386206 #1799568] INFO -- : make[2]: Entering directory '/home/opc/ruby/build/master/ext/json' I, [2024-05-17T19:30:33.392256 #1799568] INFO -- : make[2]: Entering directory '/home/opc/ruby/build/master/ext/monitor' I, [2024-05-17T19:30:33.392807 #1799568] INFO -- : make[2]: Leaving directory '/home/opc/ruby/build/master/ext/fiddle' I, [2024-05-17T19:30:33.393382 #1799568] INFO -- : make[2]: Leaving directory '/home/opc/ruby/build/master/ext/json' I, [2024-05-17T19:30:33.396832 #1799568] INFO -- : make[2]: Leaving directory '/home/opc/ruby/build/master/ext/monitor' I, [2024-05-17T19:30:33.399034 #1799568] INFO -- : make[2]: Entering directory '/home/opc/ruby/build/master/ext/objspace' I, [2024-05-17T19:30:33.401777 #1799568] INFO -- : make[2]: Entering directory '/home/opc/ruby/build/master/ext/pathname' I, [2024-05-17T19:30:33.404901 #1799568] INFO -- : make[2]: Leaving directory '/home/opc/ruby/build/master/ext/objspace' I, [2024-05-17T19:30:33.405948 #1799568] INFO -- : make[2]: Leaving directory '/home/opc/ruby/build/master/ext/pathname' I, [2024-05-17T19:30:33.410529 #1799568] INFO -- : make[2]: Entering directory '/home/opc/ruby/build/master/ext/pty' I, [2024-05-17T19:30:33.411345 #1799568] INFO -- : make[2]: Entering directory '/home/opc/ruby/build/master/ext/psych' I, [2024-05-17T19:30:33.412592 #1799568] INFO -- : make[2]: Entering directory '/home/opc/ruby/build/master/ext/openssl' I, [2024-05-17T19:30:33.417865 #1799568] INFO -- : make[2]: Leaving directory '/home/opc/ruby/build/master/ext/pty' I, [2024-05-17T19:30:33.430869 #1799568] INFO -- : make[2]: Leaving directory '/home/opc/ruby/build/master/ext/psych' I, [2024-05-17T19:30:33.432837 #1799568] INFO -- : make[2]: Entering directory '/home/opc/ruby/build/master/ext/rubyvm' I, [2024-05-17T19:30:33.433341 #1799568] INFO -- : make[2]: Leaving directory '/home/opc/ruby/build/master/ext/openssl' I, [2024-05-17T19:30:33.434409 #1799568] INFO -- : make[2]: Entering directory '/home/opc/ruby/build/master/ext/ripper' I, [2024-05-17T19:30:33.437703 #1799568] INFO -- : make[2]: Leaving directory '/home/opc/ruby/build/master/ext/rubyvm' I, [2024-05-17T19:30:33.443247 #1799568] INFO -- : make[2]: Leaving directory '/home/opc/ruby/build/master/ext/ripper' I, [2024-05-17T19:30:33.445319 #1799568] INFO -- : make[2]: Entering directory '/home/opc/ruby/build/master/ext/socket' I, [2024-05-17T19:30:33.449503 #1799568] INFO -- : make[2]: Entering directory '/home/opc/ruby/build/master/.bundle/gems/bigdecimal-3.1.7/ext/bigdecimal' I, [2024-05-17T19:30:33.449990 #1799568] INFO -- : make[2]: Entering directory '/home/opc/ruby/build/master/.bundle/gems/bigdecimal-3.1.8/ext/bigdecimal' I, [2024-05-17T19:30:33.455846 #1799568] INFO -- : make[2]: Leaving directory '/home/opc/ruby/build/master/ext/socket' I, [2024-05-17T19:30:33.458759 #1799568] INFO -- : make[2]: Entering directory '/home/opc/ruby/build/master/.bundle/gems/debug-1.9.2/ext/debug' I, [2024-05-17T19:30:33.481115 #1799568] INFO -- : make[2]: Leaving directory '/home/opc/ruby/build/master/.bundle/gems/bigdecimal-3.1.7/ext/bigdecimal' I, [2024-05-17T19:30:33.481968 #1799568] INFO -- : make[2]: Leaving directory '/home/opc/ruby/build/master/.bundle/gems/bigdecimal-3.1.8/ext/bigdecimal' I, [2024-05-17T19:30:33.483566 #1799568] INFO -- : make[2]: Entering directory '/home/opc/ruby/build/master/.bundle/gems/nkf-0.2.0/ext/nkf' I, [2024-05-17T19:30:33.484398 #1799568] INFO -- : make[2]: Entering directory '/home/opc/ruby/build/master/.bundle/gems/racc-1.7.3/ext/racc/cparse' I, [2024-05-17T19:30:33.492104 #1799568] INFO -- : make[2]: Leaving directory '/home/opc/ruby/build/master/.bundle/gems/debug-1.9.2/ext/debug' I, [2024-05-17T19:30:33.495010 #1799568] INFO -- : make[2]: Entering directory '/home/opc/ruby/build/master/.bundle/gems/rbs-3.4.4/ext/rbs_extension' I, [2024-05-17T19:30:33.516059 #1799568] INFO -- : make[2]: Leaving directory '/home/opc/ruby/build/master/.bundle/gems/racc-1.7.3/ext/racc/cparse' I, [2024-05-17T19:30:33.520978 #1799568] INFO -- : make[2]: Entering directory '/home/opc/ruby/build/master/.bundle/gems/syslog-0.1.2/ext/syslog' I, [2024-05-17T19:30:33.522759 #1799568] INFO -- : make[2]: Leaving directory '/home/opc/ruby/build/master/.bundle/gems/nkf-0.2.0/ext/nkf' I, [2024-05-17T19:30:33.529677 #1799568] INFO -- : make[2]: Leaving directory '/home/opc/ruby/build/master/.bundle/gems/rbs-3.4.4/ext/rbs_extension' I, [2024-05-17T19:30:33.539698 #1799568] INFO -- : make[2]: Entering directory '/home/opc/ruby/build/master/ext/digest/sha2' I, [2024-05-17T19:30:33.544721 #1799568] INFO -- : make[2]: Leaving directory '/home/opc/ruby/build/master/ext/digest/sha2' I, [2024-05-17T19:30:33.553169 #1799568] INFO -- : make[2]: Leaving directory '/home/opc/ruby/build/master/.bundle/gems/syslog-0.1.2/ext/syslog' I, [2024-05-17T19:30:33.591203 #1799568] INFO -- : make[2]: Entering directory '/home/opc/ruby/build/master' I, [2024-05-17T19:30:33.675923 #1799568] INFO -- : make[2]: 'ruby' is up to date. I, [2024-05-17T19:30:33.676011 #1799568] INFO -- : make[2]: Leaving directory '/home/opc/ruby/build/master' I, [2024-05-17T19:30:33.676108 #1799568] INFO -- : make[1]: Leaving directory '/home/opc/ruby/build/master' I, [2024-05-17T19:30:33.680501 #1799568] INFO -- : make[1]: Entering directory '/home/opc/ruby/build/master' I, [2024-05-17T19:30:33.680530 #1799568] INFO -- : make[1]: Nothing to be done for 'note'. I, [2024-05-17T19:30:33.680541 #1799568] INFO -- : make[1]: Leaving directory '/home/opc/ruby/build/master' I, [2024-05-17T19:30:33.680825 #1799568] INFO -- : ./miniruby -I/home/opc/ruby/src/master/lib -I. -I.ext/common /home/opc/ruby/src/master/tool/runruby.rb --extout=.ext -- --disable-gems -r./aarch64-linux-fake /home/opc/ruby/src/master/tool/rbinstall.rb --make="make" --dest-dir="" --extout=".ext" --ext-build-dir="./ext" --mflags="-j3 --jobserver-auth=4,5" --make-flags=" -j3 --jobserver-auth=4,5" --data-mode=0644 --prog-mode=0755 --installed-list .installed.list --mantype="doc" --gnumake --install=all --exclude=doc I, [2024-05-17T19:30:33.832122 #1799568] INFO -- : Installing to I, [2024-05-17T19:30:33.832196 #1799568] INFO -- : installing binary commands: /home/opc/ruby/install/master/bin I, [2024-05-17T19:30:33.843981 #1799568] INFO -- : installing base libraries: /home/opc/ruby/install/master/lib I, [2024-05-17T19:30:33.844480 #1799568] INFO -- : installing arch files: /home/opc/ruby/install/master/lib/ruby/3.4.0+0/aarch64-linux I, [2024-05-17T19:30:33.844673 #1799568] INFO -- : installing pkgconfig data: /home/opc/ruby/install/master/lib/pkgconfig I, [2024-05-17T19:30:33.844729 #1799568] INFO -- : installing extension objects: /home/opc/ruby/install/master/lib/ruby/3.4.0+0/aarch64-linux I, [2024-05-17T19:30:33.857306 #1799568] INFO -- : installing extension objects: /home/opc/ruby/install/master/lib/ruby/site_ruby/3.4.0+0/aarch64-linux I, [2024-05-17T19:30:33.857360 #1799568] INFO -- : installing extension objects: /home/opc/ruby/install/master/lib/ruby/vendor_ruby/3.4.0+0/aarch64-linux I, [2024-05-17T19:30:33.857877 #1799568] INFO -- : installing extension headers: /home/opc/ruby/install/master/include/ruby-3.4.0+0/aarch64-linux I, [2024-05-17T19:30:33.858138 #1799568] INFO -- : installing extension scripts: /home/opc/ruby/install/master/lib/ruby/3.4.0+0 I, [2024-05-17T19:30:33.865884 #1799568] INFO -- : installing extension scripts: /home/opc/ruby/install/master/lib/ruby/site_ruby/3.4.0+0 I, [2024-05-17T19:30:33.865903 #1799568] INFO -- : installing extension scripts: /home/opc/ruby/install/master/lib/ruby/vendor_ruby/3.4.0+0 I, [2024-05-17T19:30:33.865917 #1799568] INFO -- : installing extension headers: /home/opc/ruby/install/master/include/ruby-3.4.0+0/ruby I, [2024-05-17T19:30:33.866028 #1799568] INFO -- : installing command scripts: /home/opc/ruby/install/master/bin I, [2024-05-17T19:30:33.866156 #1799568] INFO -- : installing library scripts: /home/opc/ruby/install/master/lib/ruby/3.4.0+0 I, [2024-05-17T19:30:33.949051 #1799568] INFO -- : installing common headers: /home/opc/ruby/install/master/include/ruby-3.4.0+0 I, [2024-05-17T19:30:33.961198 #1799568] INFO -- : installing manpages: /home/opc/ruby/install/master/share/man/man1 I, [2024-05-17T19:30:33.961531 #1799568] INFO -- : installing default gems from lib: /home/opc/ruby/install/master/lib/ruby/gems/3.4.0+0 I, [2024-05-17T19:30:34.006509 #1799568] INFO -- : benchmark 0.3.0 I, [2024-05-17T19:30:34.010526 #1799568] INFO -- : bundler 2.6.0.dev I, [2024-05-17T19:30:34.015263 #1799568] INFO -- : cgi 0.4.1 I, [2024-05-17T19:30:34.016392 #1799568] INFO -- : delegate 0.3.1 I, [2024-05-17T19:30:34.017578 #1799568] INFO -- : did_you_mean 1.6.3 I, [2024-05-17T19:30:34.018686 #1799568] INFO -- : english 0.8.0 I, [2024-05-17T19:30:34.020885 #1799568] INFO -- : erb 4.0.4 I, [2024-05-17T19:30:34.023793 #1799568] INFO -- : error_highlight 0.6.0 I, [2024-05-17T19:30:34.024949 #1799568] INFO -- : fileutils 1.7.2 I, [2024-05-17T19:30:34.026093 #1799568] INFO -- : find 0.2.0 I, [2024-05-17T19:30:34.027187 #1799568] INFO -- : forwardable 1.3.3 I, [2024-05-17T19:30:34.028268 #1799568] INFO -- : ipaddr 1.2.6 I, [2024-05-17T19:30:34.029361 #1799568] INFO -- : irb 1.13.1 I, [2024-05-17T19:30:34.032031 #1799568] INFO -- : logger 1.6.0 I, [2024-05-17T19:30:34.033166 #1799568] INFO -- : net-http 0.4.1 I, [2024-05-17T19:30:34.034357 #1799568] INFO -- : net-protocol 0.2.2 I, [2024-05-17T19:30:34.035509 #1799568] INFO -- : open-uri 0.4.1 I, [2024-05-17T19:30:34.036652 #1799568] INFO -- : open3 0.2.1 I, [2024-05-17T19:30:34.037820 #1799568] INFO -- : optparse 0.5.0 I, [2024-05-17T19:30:34.038950 #1799568] INFO -- : ostruct 0.6.0 I, [2024-05-17T19:30:34.039993 #1799568] INFO -- : pp 0.5.0 I, [2024-05-17T19:30:34.041158 #1799568] INFO -- : prettyprint 0.2.0 I, [2024-05-17T19:30:34.042290 #1799568] INFO -- : prism 0.29.0 I, [2024-05-17T19:30:34.043483 #1799568] INFO -- : pstore 0.1.3 I, [2024-05-17T19:30:34.044578 #1799568] INFO -- : rdoc 6.6.3.1 I, [2024-05-17T19:30:34.048465 #1799568] INFO -- : readline 0.0.4 I, [2024-05-17T19:30:34.049652 #1799568] INFO -- : reline 0.5.7 I, [2024-05-17T19:30:34.050798 #1799568] INFO -- : resolv 0.4.0 I, [2024-05-17T19:30:34.051881 #1799568] INFO -- : ruby2_keywords 0.0.5 I, [2024-05-17T19:30:34.054633 #1799568] INFO -- : securerandom 0.3.1 I, [2024-05-17T19:30:34.055724 #1799568] INFO -- : set 1.1.0 I, [2024-05-17T19:30:34.056845 #1799568] INFO -- : shellwords 0.2.0 I, [2024-05-17T19:30:34.058005 #1799568] INFO -- : singleton 0.2.0 I, [2024-05-17T19:30:34.059079 #1799568] INFO -- : syntax_suggest 2.0.0 I, [2024-05-17T19:30:34.061637 #1799568] INFO -- : tempfile 0.2.1 I, [2024-05-17T19:30:34.062726 #1799568] INFO -- : time 0.3.0 I, [2024-05-17T19:30:34.063858 #1799568] INFO -- : timeout 0.4.1 I, [2024-05-17T19:30:34.064956 #1799568] INFO -- : tmpdir 0.2.0 I, [2024-05-17T19:30:34.066338 #1799568] INFO -- : tsort 0.2.0 I, [2024-05-17T19:30:34.067436 #1799568] INFO -- : un 0.3.0 I, [2024-05-17T19:30:34.068504 #1799568] INFO -- : uri 0.13.0 I, [2024-05-17T19:30:34.069741 #1799568] INFO -- : weakref 0.1.3 I, [2024-05-17T19:30:34.070809 #1799568] INFO -- : yaml 0.3.0 I, [2024-05-17T19:30:34.071673 #1799568] INFO -- : installing default gems from ext: /home/opc/ruby/install/master/lib/ruby/gems/3.4.0+0 I, [2024-05-17T19:30:34.080950 #1799568] INFO -- : date 3.3.4 I, [2024-05-17T19:30:34.083849 #1799568] INFO -- : digest 3.1.1 I, [2024-05-17T19:30:34.085014 #1799568] INFO -- : etc 1.4.3 I, [2024-05-17T19:30:34.086205 #1799568] INFO -- : fcntl 1.1.0 I, [2024-05-17T19:30:34.087305 #1799568] INFO -- : fiddle 1.1.3 I, [2024-05-17T19:30:34.088412 #1799568] INFO -- : io-console 0.7.2 I, [2024-05-17T19:30:34.089565 #1799568] INFO -- : io-nonblock 0.3.0 I, [2024-05-17T19:30:34.090659 #1799568] INFO -- : io-wait 0.3.1 I, [2024-05-17T19:30:34.091719 #1799568] INFO -- : json 2.7.2 I, [2024-05-17T19:30:34.092985 #1799568] INFO -- : openssl 3.2.0 I, [2024-05-17T19:30:34.094188 #1799568] INFO -- : pathname 0.3.0 I, [2024-05-17T19:30:34.095633 #1799568] INFO -- : psych 5.1.2 I, [2024-05-17T19:30:34.096891 #1799568] INFO -- : stringio 3.1.1 I, [2024-05-17T19:30:34.098080 #1799568] INFO -- : strscan 3.1.1 I, [2024-05-17T19:30:34.099150 #1799568] INFO -- : zlib 3.1.0 I, [2024-05-17T19:30:34.100048 #1799568] INFO -- : installing bundled gems: /home/opc/ruby/install/master/lib/ruby/gems/3.4.0+0 I, [2024-05-17T19:30:34.101062 #1799568] INFO -- : minitest 5.23.0 I, [2024-05-17T19:30:34.122685 #1799568] INFO -- : rake 13.2.1 I, [2024-05-17T19:30:34.136663 #1799568] INFO -- : test-unit 3.6.2 I, [2024-05-17T19:30:34.150658 #1799568] INFO -- : rexml 3.2.6 I, [2024-05-17T19:30:34.167481 #1799568] INFO -- : rss 0.3.0 I, [2024-05-17T19:30:34.177342 #1799568] INFO -- : net-ftp 0.3.4 I, [2024-05-17T19:30:34.181510 #1799568] INFO -- : net-imap 0.4.11 I, [2024-05-17T19:30:34.197928 #1799568] INFO -- : net-pop 0.1.2 I, [2024-05-17T19:30:34.200523 #1799568] INFO -- : net-smtp 0.5.0 I, [2024-05-17T19:30:34.204033 #1799568] INFO -- : matrix 0.4.2 I, [2024-05-17T19:30:34.212126 #1799568] INFO -- : prime 0.1.2 I, [2024-05-17T19:30:34.221037 #1799568] INFO -- : rbs 3.4.4 I, [2024-05-17T19:30:34.325583 #1799568] INFO -- : typeprof 0.21.11 I, [2024-05-17T19:30:34.333966 #1799568] INFO -- : debug 1.9.2 I, [2024-05-17T19:30:34.350166 #1799568] INFO -- : racc 1.7.3 I, [2024-05-17T19:30:34.363492 #1799568] INFO -- : mutex_m 0.2.0 I, [2024-05-17T19:30:34.366559 #1799568] INFO -- : getoptlong 0.2.1 I, [2024-05-17T19:30:34.371515 #1799568] INFO -- : base64 0.2.0 I, [2024-05-17T19:30:34.374076 #1799568] INFO -- : bigdecimal 3.1.8 I, [2024-05-17T19:30:34.382003 #1799568] INFO -- : observer 0.1.2 I, [2024-05-17T19:30:34.385011 #1799568] INFO -- : abbrev 0.1.2 I, [2024-05-17T19:30:34.388030 #1799568] INFO -- : resolv-replace 0.1.1 I, [2024-05-17T19:30:34.391393 #1799568] INFO -- : rinda 0.2.0 I, [2024-05-17T19:30:34.396214 #1799568] INFO -- : drb 2.2.1 I, [2024-05-17T19:30:34.402645 #1799568] INFO -- : nkf 0.2.0 I, [2024-05-17T19:30:34.411573 #1799568] INFO -- : syslog 0.1.2 I, [2024-05-17T19:30:34.416370 #1799568] INFO -- : csv 3.3.0 I, [2024-05-17T19:30:34.426907 #1799568] INFO -- : installing bundled gem cache: /home/opc/ruby/install/master/lib/ruby/gems/3.4.0+0/cache I, [2024-05-17T19:30:34.428812 #1799568] INFO -- : skipped bundled gems: I, [2024-05-17T19:30:34.428834 #1799568] INFO -- : power_assert-2.0.4dev.gem not found in bundled_gems I, [2024-05-17T19:30:34.431708 #1799568] INFO -- : $$$[end] "make install -j3" exit with 0. I, [2024-05-17T19:30:34.431855 #1799568] INFO -- : $$$[beg] make yes-btest TESTOPTS='-q -j3' I, [2024-05-17T19:30:56.185817 #1799568] INFO -- : PASS all 1936 tests E, [2024-05-17T19:30:56.187363 #1799568] ERROR -- : I, [2024-05-17T19:30:56.187476 #1799568] INFO -- : $$$[end] "make yes-btest TESTOPTS='-q -j3'" exit with 0. I, [2024-05-17T19:30:56.187610 #1799568] INFO -- : $$$[beg] make yes-test-basic TESTS='-j3' I, [2024-05-17T19:30:56.281108 #1799568] INFO -- : BASERUBY = /usr/local/bin/ruby --disable=gems I, [2024-05-17T19:30:56.281171 #1799568] INFO -- : CC = gcc I, [2024-05-17T19:30:56.281182 #1799568] INFO -- : LD = ld I, [2024-05-17T19:30:56.281191 #1799568] INFO -- : LDSHARED = gcc -shared I, [2024-05-17T19:30:56.281209 #1799568] INFO -- : CFLAGS = -O3 -fno-fast-math -ggdb3 -Wall -Wextra -Wdeprecated-declarations -Wdiv-by-zero -Wduplicated-cond -Wimplicit-function-declaration -Wimplicit-int -Wpointer-arith -Wwrite-strings -Wold-style-definition -Wimplicit-fallthrough=0 -Wmissing-noreturn -Wno-cast-function-type -Wno-constant-logical-operand -Wno-long-long -Wno-missing-field-initializers -Wno-overlength-strings -Wno-packed-bitfield-compat -Wno-parentheses-equality -Wno-self-assign -Wno-tautological-compare -Wno-unused-parameter -Wno-unused-value -Wsuggest-attribute=format -Wsuggest-attribute=noreturn -Wunused-variable -Wmisleading-indentation -Wundef I, [2024-05-17T19:30:56.281219 #1799568] INFO -- : XCFLAGS = -U_FORTIFY_SOURCE -D_FORTIFY_SOURCE=2 -fstack-protector-strong -msign-return-address=all -fno-strict-overflow -fvisibility=hidden -fexcess-precision=standard -DRUBY_EXPORT -fPIE -I. -I.ext/include/aarch64-linux -I/home/opc/ruby/src/master/include -I/home/opc/ruby/src/master -I/home/opc/ruby/src/master/prism -I/home/opc/ruby/src/master/enc/unicode/15.0.0 I, [2024-05-17T19:30:56.281228 #1799568] INFO -- : CPPFLAGS = I, [2024-05-17T19:30:56.281236 #1799568] INFO -- : DLDFLAGS = -Wl,--compress-debug-sections=zlib -fstack-protector-strong -pie I, [2024-05-17T19:30:56.281245 #1799568] INFO -- : SOLIBS = -lz -lrt -lrt -ldl -lcrypt -lm -lpthread I, [2024-05-17T19:30:56.281264 #1799568] INFO -- : LANG = en_US.UTF-8 I, [2024-05-17T19:30:56.282716 #1799568] INFO -- : LC_ALL = I, [2024-05-17T19:30:56.282728 #1799568] INFO -- : LC_CTYPE = I, [2024-05-17T19:30:56.282736 #1799568] INFO -- : MFLAGS = I, [2024-05-17T19:30:56.282744 #1799568] INFO -- : RUSTC = rustc I, [2024-05-17T19:30:56.282752 #1799568] INFO -- : YJIT_RUSTC_ARGS = --crate-name=yjit --crate-type=staticlib --edition=2021 -g -C lto=thin -C opt-level=3 -C overflow-checks=on '--out-dir=/home/opc/ruby/build/master/yjit/target/release/' /home/opc/ruby/src/master/yjit/src/lib.rs I, [2024-05-17T19:30:56.283549 #1799568] INFO -- : gcc (GCC) 8.5.0 20210514 (Red Hat 8.5.0-10.1.0.1) I, [2024-05-17T19:30:56.283583 #1799568] INFO -- : Copyright (C) 2018 Free Software Foundation, Inc. I, [2024-05-17T19:30:56.283593 #1799568] INFO -- : This is free software; see the source for copying conditions. There is NO I, [2024-05-17T19:30:56.283602 #1799568] INFO -- : warranty; not even for MERCHANTABILITY or FITNESS FOR A PARTICULAR PURPOSE. I, [2024-05-17T19:30:56.283610 #1799568] INFO -- : I, [2024-05-17T19:30:56.441096 #1799568] INFO -- : Checking leaked global symbols...none I, [2024-05-17T19:30:56.493692 #1799568] INFO -- : /home/opc/ruby/src/master/basictest/test.rb:assignment ....................................................................................................................................................................................................................................................................................................................................................................................OK 372 I, [2024-05-17T19:30:56.493762 #1799568] INFO -- : /home/opc/ruby/src/master/basictest/test.rb:condition ..OK 2 I, [2024-05-17T19:30:56.493787 #1799568] INFO -- : /home/opc/ruby/src/master/basictest/test.rb:if/unless ...OK 3 I, [2024-05-17T19:30:56.493832 #1799568] INFO -- : /home/opc/ruby/src/master/basictest/test.rb:case .....OK 5 I, [2024-05-17T19:30:56.494386 #1799568] INFO -- : /home/opc/ruby/src/master/basictest/test.rb:while/until ........OK 8 I, [2024-05-17T19:30:56.494507 #1799568] INFO -- : /home/opc/ruby/src/master/basictest/test.rb:exception ..........OK 10 I, [2024-05-17T19:30:56.495121 #1799568] INFO -- : /home/opc/ruby/src/master/basictest/test.rb:array .......................................OK 39 I, [2024-05-17T19:30:56.495380 #1799568] INFO -- : /home/opc/ruby/src/master/basictest/test.rb:hash ...........................OK 27 I, [2024-05-17T19:30:56.497039 #1799568] INFO -- : /home/opc/ruby/src/master/basictest/test.rb:iterator ...........................................................................................................OK 107 I, [2024-05-17T19:30:56.497799 #1799568] INFO -- : /home/opc/ruby/src/master/basictest/test.rb:float ................................................................................OK 80 I, [2024-05-17T19:30:56.501557 #1799568] INFO -- : /home/opc/ruby/src/master/basictest/test.rb:bignum ...............................OK 31 I, [2024-05-17T19:30:56.503129 #1799568] INFO -- : /home/opc/ruby/src/master/basictest/test.rb:string & char ..............................................................OK 62 I, [2024-05-17T19:30:56.503219 #1799568] INFO -- : /home/opc/ruby/src/master/basictest/test.rb:assignment ..........OK 10 I, [2024-05-17T19:30:56.503288 #1799568] INFO -- : /home/opc/ruby/src/master/basictest/test.rb:call ......OK 6 I, [2024-05-17T19:30:56.503414 #1799568] INFO -- : /home/opc/ruby/src/master/basictest/test.rb:proc .........OK 9 I, [2024-05-17T19:30:56.603695 #1799568] INFO -- : /home/opc/ruby/src/master/basictest/test.rb:signal ..OK 2 I, [2024-05-17T19:30:56.605181 #1799568] INFO -- : /home/opc/ruby/src/master/basictest/test.rb:eval ...........................OK 27 I, [2024-05-17T19:30:56.739964 #1799568] INFO -- : /home/opc/ruby/src/master/basictest/test.rb:system ........OK 8 I, [2024-05-17T19:30:56.740033 #1799568] INFO -- : /home/opc/ruby/src/master/basictest/test.rb:const .....OK 5 I, [2024-05-17T19:30:56.740128 #1799568] INFO -- : /home/opc/ruby/src/master/basictest/test.rb:clone .....OK 5 I, [2024-05-17T19:30:56.740336 #1799568] INFO -- : /home/opc/ruby/src/master/basictest/test.rb:marshal ....OK 4 I, [2024-05-17T19:30:56.740414 #1799568] INFO -- : /home/opc/ruby/src/master/basictest/test.rb:pack ....OK 4 I, [2024-05-17T19:30:56.740446 #1799568] INFO -- : /home/opc/ruby/src/master/basictest/test.rb:math ..OK 2 I, [2024-05-17T19:30:56.740566 #1799568] INFO -- : /home/opc/ruby/src/master/basictest/test.rb:struct ......OK 6 I, [2024-05-17T19:30:56.740725 #1799568] INFO -- : /home/opc/ruby/src/master/basictest/test.rb:variable ............OK 12 I, [2024-05-17T19:30:56.740761 #1799568] INFO -- : /home/opc/ruby/src/master/basictest/test.rb:trace ...OK 3 I, [2024-05-17T19:30:56.740888 #1799568] INFO -- : /home/opc/ruby/src/master/basictest/test.rb:defined? ............OK 12 I, [2024-05-17T19:30:56.740977 #1799568] INFO -- : /home/opc/ruby/src/master/basictest/test.rb:alias ......OK 6 I, [2024-05-17T19:30:56.741533 #1799568] INFO -- : /home/opc/ruby/src/master/basictest/test.rb:path .......................OK 23 I, [2024-05-17T19:30:56.808806 #1799568] INFO -- : /home/opc/ruby/src/master/basictest/test.rb:gc ....OK 4 I, [2024-05-17T19:30:56.810810 #1799568] INFO -- : I, [2024-05-17T19:30:56.810839 #1799568] INFO -- : test succeeded I, [2024-05-17T19:30:56.811580 #1799568] INFO -- : $$$[end] "make yes-test-basic TESTS='-j3'" exit with 0. I, [2024-05-17T19:30:56.811765 #1799568] INFO -- : $$$[beg] make yes-test-all TESTOPTS='--stderr-on-failure' TESTS='-j3' I, [2024-05-17T19:30:56.936210 #1799568] INFO -- : BASERUBY = /usr/local/bin/ruby --disable=gems I, [2024-05-17T19:30:56.936283 #1799568] INFO -- : CC = gcc I, [2024-05-17T19:30:56.936295 #1799568] INFO -- : LD = ld I, [2024-05-17T19:30:56.936306 #1799568] INFO -- : LDSHARED = gcc -shared I, [2024-05-17T19:30:56.936316 #1799568] INFO -- : CFLAGS = -O3 -fno-fast-math -ggdb3 -Wall -Wextra -Wdeprecated-declarations -Wdiv-by-zero -Wduplicated-cond -Wimplicit-function-declaration -Wimplicit-int -Wpointer-arith -Wwrite-strings -Wold-style-definition -Wimplicit-fallthrough=0 -Wmissing-noreturn -Wno-cast-function-type -Wno-constant-logical-operand -Wno-long-long -Wno-missing-field-initializers -Wno-overlength-strings -Wno-packed-bitfield-compat -Wno-parentheses-equality -Wno-self-assign -Wno-tautological-compare -Wno-unused-parameter -Wno-unused-value -Wsuggest-attribute=format -Wsuggest-attribute=noreturn -Wunused-variable -Wmisleading-indentation -Wundef I, [2024-05-17T19:30:56.936325 #1799568] INFO -- : XCFLAGS = -U_FORTIFY_SOURCE -D_FORTIFY_SOURCE=2 -fstack-protector-strong -msign-return-address=all -fno-strict-overflow -fvisibility=hidden -fexcess-precision=standard -DRUBY_EXPORT -fPIE -I. -I.ext/include/aarch64-linux -I/home/opc/ruby/src/master/include -I/home/opc/ruby/src/master -I/home/opc/ruby/src/master/prism -I/home/opc/ruby/src/master/enc/unicode/15.0.0 I, [2024-05-17T19:30:56.936334 #1799568] INFO -- : CPPFLAGS = I, [2024-05-17T19:30:56.936343 #1799568] INFO -- : DLDFLAGS = -Wl,--compress-debug-sections=zlib -fstack-protector-strong -pie I, [2024-05-17T19:30:56.936353 #1799568] INFO -- : SOLIBS = -lz -lrt -lrt -ldl -lcrypt -lm -lpthread I, [2024-05-17T19:30:56.936361 #1799568] INFO -- : LANG = en_US.UTF-8 I, [2024-05-17T19:30:56.936369 #1799568] INFO -- : LC_ALL = I, [2024-05-17T19:30:56.936377 #1799568] INFO -- : LC_CTYPE = I, [2024-05-17T19:30:56.936385 #1799568] INFO -- : MFLAGS = I, [2024-05-17T19:30:56.936393 #1799568] INFO -- : RUSTC = rustc I, [2024-05-17T19:30:56.936402 #1799568] INFO -- : YJIT_RUSTC_ARGS = --crate-name=yjit --crate-type=staticlib --edition=2021 -g -C lto=thin -C opt-level=3 -C overflow-checks=on '--out-dir=/home/opc/ruby/build/master/yjit/target/release/' /home/opc/ruby/src/master/yjit/src/lib.rs I, [2024-05-17T19:30:56.937104 #1799568] INFO -- : gcc (GCC) 8.5.0 20210514 (Red Hat 8.5.0-10.1.0.1) I, [2024-05-17T19:30:56.937128 #1799568] INFO -- : Copyright (C) 2018 Free Software Foundation, Inc. I, [2024-05-17T19:30:56.937138 #1799568] INFO -- : This is free software; see the source for copying conditions. There is NO I, [2024-05-17T19:30:56.937147 #1799568] INFO -- : warranty; not even for MERCHANTABILITY or FITNESS FOR A PARTICULAR PURPOSE. I, [2024-05-17T19:30:56.937155 #1799568] INFO -- : I, [2024-05-17T19:30:56.939142 #1799568] INFO -- : generating enc.mk I, [2024-05-17T19:30:57.177076 #1799568] INFO -- : generating encdb.h I, [2024-05-17T19:30:57.213671 #1799568] INFO -- : encdb.h unchanged I, [2024-05-17T19:30:57.214942 #1799568] INFO -- : making enc I, [2024-05-17T19:30:57.242121 #1799568] INFO -- : make[1]: Entering directory '/home/opc/ruby/build/master' I, [2024-05-17T19:30:57.242175 #1799568] INFO -- : make[1]: Nothing to be done for 'enc'. I, [2024-05-17T19:30:57.242187 #1799568] INFO -- : make[1]: Leaving directory '/home/opc/ruby/build/master' I, [2024-05-17T19:30:57.242926 #1799568] INFO -- : making srcs under enc I, [2024-05-17T19:30:57.284572 #1799568] INFO -- : make[1]: Entering directory '/home/opc/ruby/build/master' I, [2024-05-17T19:30:57.284617 #1799568] INFO -- : make[1]: Nothing to be done for 'srcs'. I, [2024-05-17T19:30:57.284628 #1799568] INFO -- : make[1]: Leaving directory '/home/opc/ruby/build/master' I, [2024-05-17T19:30:57.285782 #1799568] INFO -- : generating transdb.h I, [2024-05-17T19:30:57.428061 #1799568] INFO -- : transdb.h unchanged I, [2024-05-17T19:30:57.429405 #1799568] INFO -- : making trans I, [2024-05-17T19:30:57.477868 #1799568] INFO -- : make[1]: Entering directory '/home/opc/ruby/build/master' I, [2024-05-17T19:30:57.477926 #1799568] INFO -- : make[1]: Nothing to be done for 'trans'. I, [2024-05-17T19:30:57.477936 #1799568] INFO -- : make[1]: Leaving directory '/home/opc/ruby/build/master' I, [2024-05-17T19:30:57.478625 #1799568] INFO -- : making encs I, [2024-05-17T19:30:57.530949 #1799568] INFO -- : make[1]: Entering directory '/home/opc/ruby/build/master' I, [2024-05-17T19:30:57.531026 #1799568] INFO -- : make[1]: Nothing to be done for 'encs'. I, [2024-05-17T19:30:57.531036 #1799568] INFO -- : make[1]: Leaving directory '/home/opc/ruby/build/master' I, [2024-05-17T19:30:57.533046 #1799568] INFO -- : generating makefiles ext/configure-ext.mk I, [2024-05-17T19:30:57.572877 #1799568] INFO -- : ext/configure-ext.mk updated I, [2024-05-17T19:30:57.575780 #1799568] INFO -- : make[1]: Entering directory '/home/opc/ruby/build/master' I, [2024-05-17T19:30:59.650574 #1799568] INFO -- : make[1]: Leaving directory '/home/opc/ruby/build/master' I, [2024-05-17T19:30:59.651283 #1799568] INFO -- : generating makefile exts.mk I, [2024-05-17T19:30:59.710886 #1799568] INFO -- : exts.mk unchanged I, [2024-05-17T19:30:59.715744 #1799568] INFO -- : make[1]: Entering directory '/home/opc/ruby/build/master' I, [2024-05-17T19:31:00.012902 #1799568] INFO -- : make[2]: Entering directory '/home/opc/ruby/build/master/ext/coverage' I, [2024-05-17T19:31:00.017578 #1799568] INFO -- : make[2]: Leaving directory '/home/opc/ruby/build/master/ext/coverage' I, [2024-05-17T19:31:00.023227 #1799568] INFO -- : make[2]: Entering directory '/home/opc/ruby/build/master/ext/date' I, [2024-05-17T19:31:00.028362 #1799568] INFO -- : make[2]: Leaving directory '/home/opc/ruby/build/master/ext/date' I, [2024-05-17T19:31:00.031812 #1799568] INFO -- : make[2]: Entering directory '/home/opc/ruby/build/master/ext/digest' I, [2024-05-17T19:31:00.040647 #1799568] INFO -- : make[2]: Leaving directory '/home/opc/ruby/build/master/ext/digest' I, [2024-05-17T19:31:00.062997 #1799568] INFO -- : make[2]: Entering directory '/home/opc/ruby/build/master/ext/digest/sha2' I, [2024-05-17T19:31:00.067895 #1799568] INFO -- : make[2]: Leaving directory '/home/opc/ruby/build/master/ext/digest/sha2' I, [2024-05-17T19:31:00.085908 #1799568] INFO -- : make[2]: Entering directory '/home/opc/ruby/build/master/ext/fiddle' I, [2024-05-17T19:31:00.095939 #1799568] INFO -- : make[2]: Leaving directory '/home/opc/ruby/build/master/ext/fiddle' I, [2024-05-17T19:31:00.100180 #1799568] INFO -- : make[2]: Entering directory '/home/opc/ruby/build/master/ext/io/console' I, [2024-05-17T19:31:00.104517 #1799568] INFO -- : make[2]: Leaving directory '/home/opc/ruby/build/master/ext/io/console' I, [2024-05-17T19:31:00.115004 #1799568] INFO -- : make[2]: Entering directory '/home/opc/ruby/build/master/ext/json' I, [2024-05-17T19:31:00.124463 #1799568] INFO -- : make[2]: Leaving directory '/home/opc/ruby/build/master/ext/json' I, [2024-05-17T19:31:00.137133 #1799568] INFO -- : make[2]: Entering directory '/home/opc/ruby/build/master/ext/monitor' I, [2024-05-17T19:31:00.141323 #1799568] INFO -- : make[2]: Leaving directory '/home/opc/ruby/build/master/ext/monitor' I, [2024-05-17T19:31:00.147359 #1799568] INFO -- : make[2]: Entering directory '/home/opc/ruby/build/master/ext/objspace' I, [2024-05-17T19:31:00.153285 #1799568] INFO -- : make[2]: Leaving directory '/home/opc/ruby/build/master/ext/objspace' I, [2024-05-17T19:31:00.172653 #1799568] INFO -- : make[2]: Entering directory '/home/opc/ruby/build/master/ext/openssl' I, [2024-05-17T19:31:00.194088 #1799568] INFO -- : make[2]: Leaving directory '/home/opc/ruby/build/master/ext/openssl' I, [2024-05-17T19:31:00.198279 #1799568] INFO -- : make[2]: Entering directory '/home/opc/ruby/build/master/ext/pathname' I, [2024-05-17T19:31:00.202436 #1799568] INFO -- : make[2]: Leaving directory '/home/opc/ruby/build/master/ext/pathname' I, [2024-05-17T19:31:00.208727 #1799568] INFO -- : make[2]: Entering directory '/home/opc/ruby/build/master/ext/psych' I, [2024-05-17T19:31:00.230021 #1799568] INFO -- : make[2]: Leaving directory '/home/opc/ruby/build/master/ext/psych' I, [2024-05-17T19:31:00.234400 #1799568] INFO -- : make[2]: Entering directory '/home/opc/ruby/build/master/ext/pty' I, [2024-05-17T19:31:00.238530 #1799568] INFO -- : make[2]: Leaving directory '/home/opc/ruby/build/master/ext/pty' I, [2024-05-17T19:31:00.251716 #1799568] INFO -- : make[2]: Entering directory '/home/opc/ruby/build/master/ext/ripper' I, [2024-05-17T19:31:00.259397 #1799568] INFO -- : make[2]: Leaving directory '/home/opc/ruby/build/master/ext/ripper' I, [2024-05-17T19:31:00.261235 #1799568] INFO -- : make[2]: Entering directory '/home/opc/ruby/build/master/ext/rubyvm' I, [2024-05-17T19:31:00.264551 #1799568] INFO -- : make[2]: Leaving directory '/home/opc/ruby/build/master/ext/rubyvm' I, [2024-05-17T19:31:00.276546 #1799568] INFO -- : make[2]: Entering directory '/home/opc/ruby/build/master/ext/socket' I, [2024-05-17T19:31:00.287189 #1799568] INFO -- : make[2]: Leaving directory '/home/opc/ruby/build/master/ext/socket' I, [2024-05-17T19:31:00.302330 #1799568] INFO -- : make[2]: Entering directory '/home/opc/ruby/build/master/.bundle/gems/bigdecimal-3.1.7/ext/bigdecimal' I, [2024-05-17T19:31:00.333231 #1799568] INFO -- : make[2]: Leaving directory '/home/opc/ruby/build/master/.bundle/gems/bigdecimal-3.1.7/ext/bigdecimal' I, [2024-05-17T19:31:00.335795 #1799568] INFO -- : make[2]: Entering directory '/home/opc/ruby/build/master/.bundle/gems/bigdecimal-3.1.8/ext/bigdecimal' I, [2024-05-17T19:31:00.366447 #1799568] INFO -- : make[2]: Leaving directory '/home/opc/ruby/build/master/.bundle/gems/bigdecimal-3.1.8/ext/bigdecimal' I, [2024-05-17T19:31:00.368979 #1799568] INFO -- : make[2]: Entering directory '/home/opc/ruby/build/master/.bundle/gems/debug-1.9.2/ext/debug' I, [2024-05-17T19:31:00.399740 #1799568] INFO -- : make[2]: Leaving directory '/home/opc/ruby/build/master/.bundle/gems/debug-1.9.2/ext/debug' I, [2024-05-17T19:31:00.402238 #1799568] INFO -- : make[2]: Entering directory '/home/opc/ruby/build/master/.bundle/gems/nkf-0.2.0/ext/nkf' I, [2024-05-17T19:31:00.432770 #1799568] INFO -- : make[2]: Leaving directory '/home/opc/ruby/build/master/.bundle/gems/nkf-0.2.0/ext/nkf' I, [2024-05-17T19:31:00.435226 #1799568] INFO -- : make[2]: Entering directory '/home/opc/ruby/build/master/.bundle/gems/racc-1.7.3/ext/racc/cparse' I, [2024-05-17T19:31:00.465789 #1799568] INFO -- : make[2]: Leaving directory '/home/opc/ruby/build/master/.bundle/gems/racc-1.7.3/ext/racc/cparse' I, [2024-05-17T19:31:00.468717 #1799568] INFO -- : make[2]: Entering directory '/home/opc/ruby/build/master/.bundle/gems/rbs-3.4.4/ext/rbs_extension' I, [2024-05-17T19:31:00.498904 #1799568] INFO -- : make[2]: Leaving directory '/home/opc/ruby/build/master/.bundle/gems/rbs-3.4.4/ext/rbs_extension' I, [2024-05-17T19:31:00.501400 #1799568] INFO -- : make[2]: Entering directory '/home/opc/ruby/build/master/.bundle/gems/syslog-0.1.2/ext/syslog' I, [2024-05-17T19:31:00.532211 #1799568] INFO -- : make[2]: Leaving directory '/home/opc/ruby/build/master/.bundle/gems/syslog-0.1.2/ext/syslog' I, [2024-05-17T19:31:00.570601 #1799568] INFO -- : make[2]: Entering directory '/home/opc/ruby/build/master' I, [2024-05-17T19:31:00.654070 #1799568] INFO -- : make[2]: 'ruby' is up to date. I, [2024-05-17T19:31:00.654139 #1799568] INFO -- : make[2]: Leaving directory '/home/opc/ruby/build/master' I, [2024-05-17T19:31:00.654273 #1799568] INFO -- : make[1]: Leaving directory '/home/opc/ruby/build/master' I, [2024-05-17T19:31:00.658635 #1799568] INFO -- : make[1]: Entering directory '/home/opc/ruby/build/master' I, [2024-05-17T19:31:00.658684 #1799568] INFO -- : make[1]: Nothing to be done for 'note'. I, [2024-05-17T19:31:00.658703 #1799568] INFO -- : make[1]: Leaving directory '/home/opc/ruby/build/master' I, [2024-05-17T19:31:00.773729 #1799568] INFO -- : Run options: I, [2024-05-17T19:31:00.773809 #1799568] INFO -- : --seed=24501 I, [2024-05-17T19:31:00.773821 #1799568] INFO -- : "--ruby=./miniruby -I/home/opc/ruby/src/master/lib -I. -I.ext/common /home/opc/ruby/src/master/tool/runruby.rb --extout=.ext -- --disable-gems" I, [2024-05-17T19:31:00.773831 #1799568] INFO -- : --excludes-dir=/home/opc/ruby/src/master/test/.excludes I, [2024-05-17T19:31:00.773839 #1799568] INFO -- : --name=!/memory_leak/ I, [2024-05-17T19:31:00.773848 #1799568] INFO -- : --stderr-on-failure I, [2024-05-17T19:31:00.773856 #1799568] INFO -- : -j3 I, [2024-05-17T19:31:00.773864 #1799568] INFO -- : I, [2024-05-17T19:31:00.773872 #1799568] INFO -- : # Running tests: I, [2024-05-17T19:31:00.773880 #1799568] INFO -- : I, [2024-05-17T19:31:00.903284 #1799568] INFO -- : [ 1/885] 1840540=test_rdoc_markup_to_tt_only I, [2024-05-17T19:31:00.910055 #1799568] INFO -- : [ 2/885] 1840539=test_date_strftime I, [2024-05-17T19:31:00.938083 #1799568] INFO -- : [ 3/885] 1840541=json_parser_test I, [2024-05-17T19:31:00.977838 #1799568] INFO -- : [ 4/885] 1840541=test_ws I, [2024-05-17T19:31:01.010421 #1799568] INFO -- : [ 5/885] 1840541=test_gem_commands_stale_command I, [2024-05-17T19:31:01.061134 #1799568] INFO -- : [ 6/885] 1840540=ruby_parser_test I, [2024-05-17T19:31:01.147496 #1799568] INFO -- : [ 7/885] 1840540=test_gem_commands_cert_command I, [2024-05-17T19:31:01.310408 #1799568] INFO -- : [ 8/885] 1840541=test_rdoc_require I, [2024-05-17T19:31:01.328257 #1799568] INFO -- : [ 9/885] 1840539=test_gem_ext_rake_builder I, [2024-05-17T19:31:01.348727 #1799568] INFO -- : [ 10/885] 1840541=test_word I, [2024-05-17T19:31:01.356077 #1799568] INFO -- : [ 11/885] 1840541=test_singleton I, [2024-05-17T19:31:01.361732 #1799568] INFO -- : [ 12/885] 1840541=test_fstring I, [2024-05-17T19:31:01.496753 #1799568] INFO -- : [ 13/885] 1840541=test_numeric I, [2024-05-17T19:31:01.548740 #1799568] INFO -- : [ 14/885] 1840541=test_instrumentation_api I, [2024-05-17T19:31:02.168536 #1799568] INFO -- : [ 15/885] 1840539=test_weakref I, [2024-05-17T19:31:02.357003 #1799568] INFO -- : [ 16/885] 1840539=test_rdoc_alias I, [2024-05-17T19:31:02.438872 #1799568] INFO -- : [ 17/885] 1840539=test_timeout I, [2024-05-17T19:31:02.479692 #1799568] INFO -- : [ 18/885] 1840540=test_rdoc_markup_to_bs I, [2024-05-17T19:31:02.524861 #1799568] INFO -- : [ 19/885] 1840540=test_key_name_check I, [2024-05-17T19:31:02.527765 #1799568] INFO -- : [ 20/885] 1840540=test_rdoc_markup_raw I, [2024-05-17T19:31:02.581501 #1799568] INFO -- : [ 21/885] 1840540=test_optparse I, [2024-05-17T19:31:02.592636 #1799568] INFO -- : [ 22/885] 1840540=test_rdoc_context_section I, [2024-05-17T19:31:02.599326 #1799568] INFO -- : [ 23/885] 1840540=test_io_buffer I, [2024-05-17T19:31:02.710762 #1799568] INFO -- : [ 24/885] 1840540=test_deprecated I, [2024-05-17T19:31:02.796004 #1799568] INFO -- : [ 25/885] 1840540=test_files_test_2 I, [2024-05-17T19:31:03.240245 #1799568] INFO -- : [ 26/885] 1840539=test_div I, [2024-05-17T19:31:03.262620 #1799568] INFO -- : [ 27/885] 1840539=test_rdoc_markup_to_html_crossref I, [2024-05-17T19:31:03.533650 #1799568] INFO -- : [ 28/885] 1840539=test_bash_completion I, [2024-05-17T19:31:03.544942 #1799568] INFO -- : [ 29/885] 1840539=test_exception I, [2024-05-17T19:31:04.468242 #1799568] INFO -- : [ 30/885] 1840541=test_basicsocket I, [2024-05-17T19:31:04.477692 #1799568] INFO -- : [ 31/885] 1840541=test_zsh_completion I, [2024-05-17T19:31:04.481263 #1799568] INFO -- : [ 32/885] 1840541=test_scalar I, [2024-05-17T19:31:04.505774 #1799568] INFO -- : [ 33/885] 1840541=test_syntax I, [2024-05-17T19:31:05.077142 #1799568] INFO -- : [ 34/885] 1840539=test_class_name_check I, [2024-05-17T19:31:05.091039 #1799568] INFO -- : [ 35/885] 1840539=test_pack I, [2024-05-17T19:31:05.267529 #1799568] INFO -- : [ 36/885] 1840539=test_gem_commands_environment_command I, [2024-05-17T19:31:05.335539 #1799568] INFO -- : [ 37/885] 1840539=test_pkcs7 I, [2024-05-17T19:31:05.496647 #1799568] INFO -- : [ 38/885] 1840539=test_gem_unsatisfiable_dependency_error I, [2024-05-17T19:31:05.506448 #1799568] INFO -- : [ 39/885] 1840539=test_literal I, [2024-05-17T19:31:05.725011 #1799568] INFO -- : [ 40/885] 1840540=test_config I, [2024-05-17T19:31:05.784001 #1799568] INFO -- : [ 41/885] 1840540=test_complex2 I, [2024-05-17T19:31:05.806869 #1799568] INFO -- : [ 42/885] 1840540=test_gem_security_signer I, [2024-05-17T19:31:05.902713 #1799568] INFO -- : [ 43/885] 1840540=test_gem_util I, [2024-05-17T19:31:06.052032 #1799568] INFO -- : [ 44/885] 1840540=test_thread I, [2024-05-17T19:31:06.153809 #1799568] INFO -- : [ 45/885] 1840539=test_input_method I, [2024-05-17T19:31:06.215794 #1799568] INFO -- : [ 46/885] 1840539=test_rdoc_i18n_text I, [2024-05-17T19:31:06.250300 #1799568] INFO -- : [ 47/885] 1840539=test_io I, [2024-05-17T19:31:06.277302 #1799568] INFO -- : [ 48/885] 1840540=test_data I, [2024-05-17T19:31:06.284038 #1799568] INFO -- : [ 49/885] 1840540=test_memory_view I, [2024-05-17T19:31:06.305353 #1799568] INFO -- : [ 50/885] 1840540=test_null I, [2024-05-17T19:31:06.358447 #1799568] INFO -- : [ 51/885] 1840540=test_ractor I, [2024-05-17T19:31:06.418030 #1799568] INFO -- : [ 52/885] 1840540=test_m17n_comb I, [2024-05-17T19:31:06.429830 #1799568] INFO -- : [ 53/885] 1840539=test_multi_irb_commands I, [2024-05-17T19:31:06.437658 #1799568] INFO -- : [ 54/885] 1840539=test_pkey_dh I, [2024-05-17T19:31:07.796772 #1799568] INFO -- : [ 55/885] 1840539=test_pkey I, [2024-05-17T19:31:07.800638 #1799568] INFO -- : [ 56/885] 1840539=test_external_new I, [2024-05-17T19:31:07.809654 #1799568] INFO -- : [ 57/885] 1840539=test_win32ole_typelib I, [2024-05-17T19:31:07.811376 #1799568] INFO -- : [ 58/885] 1840539=test_gem_platform I, [2024-05-17T19:31:07.962642 #1799568] INFO -- : [ 59/885] 1840539=test_gem_commands_query_command I, [2024-05-17T19:31:08.564788 #1799568] INFO -- : [ 60/885] 1840539=test_bigzero I, [2024-05-17T19:31:08.573477 #1799568] INFO -- : [ 61/885] 1840539=test_rand I, [2024-05-17T19:31:08.755760 #1799568] INFO -- : [ 62/885] 1840540=test_string_processing I, [2024-05-17T19:31:08.761916 #1799568] INFO -- : [ 63/885] 1840540=test_random_formatter I, [2024-05-17T19:31:08.784417 #1799568] INFO -- : [ 64/885] 1840540=redundant_return_test I, [2024-05-17T19:31:08.789045 #1799568] INFO -- : [ 65/885] 1840540=test_rdoc_markup_attributes I, [2024-05-17T19:31:08.844389 #1799568] INFO -- : [ 66/885] 1840540=test_process I, [2024-05-17T19:31:08.857332 #1799568] INFO -- : [ 67/885] 1840539=test_rdoc_code_object I, [2024-05-17T19:31:08.932377 #1799568] INFO -- : .Leaked file descriptor: TestProcess#test_seteuid_name: 7 # I, [2024-05-17T19:31:08.966911 #1799568] INFO -- : COMMAND PID USER FD TYPE DEVICE SIZE/OFF NODE NAME I, [2024-05-17T19:31:08.966981 #1799568] INFO -- : ruby 1840540 opc 7r REG 252,0 9253600 13705411 /var/lib/sss/mc/passwd I, [2024-05-17T19:31:09.161633 #1799568] INFO -- : [ 68/885] 1840539=test_gem_source_specific_file I, [2024-05-17T19:31:09.237994 #1799568] INFO -- : [ 69/885] 1840539=test_provider I, [2024-05-17T19:31:09.249645 #1799568] INFO -- : [ 70/885] 1840539=test_euc_kr I, [2024-05-17T19:31:09.255958 #1799568] INFO -- : [ 71/885] 1840539=test_bmethod I, [2024-05-17T19:31:09.259899 #1799568] INFO -- : [ 72/885] 1840539=test_len I, [2024-05-17T19:31:09.271322 #1799568] INFO -- : [ 73/885] 1840539=test_gem_doctor I, [2024-05-17T19:31:09.330185 #1799568] INFO -- : [ 74/885] 1840539=json_fixtures_test I, [2024-05-17T19:31:09.371544 #1799568] INFO -- : [ 75/885] 1840539=parse_test I, [2024-05-17T19:31:09.910058 #1799568] INFO -- : [ 76/885] 1840541=test_kwargs I, [2024-05-17T19:31:09.924870 #1799568] INFO -- : [ 77/885] 1840541=test_rdoc_parser_c I, [2024-05-17T19:31:10.070619 #1799568] INFO -- : [ 78/885] 1840541=test_pack I, [2024-05-17T19:31:10.260895 #1799568] INFO -- : [ 79/885] 1840541=test_io_wait I, [2024-05-17T19:31:10.606245 #1799568] INFO -- : [ 80/885] 1840541=test_securerandom I, [2024-05-17T19:31:10.670957 #1799568] INFO -- : [ 81/885] 1840541=test_tsort I, [2024-05-17T19:31:10.680008 #1799568] INFO -- : [ 82/885] 1840541=test_typeddata I, [2024-05-17T19:31:10.913149 #1799568] INFO -- : [ 83/885] 1840541=test_gem_commands_fetch_command I, [2024-05-17T19:31:11.125106 #1799568] INFO -- : [ 84/885] 1840541=test_rdoc_parser_changelog I, [2024-05-17T19:31:11.193000 #1799568] INFO -- : [ 85/885] 1840541=parameters_signature_test I, [2024-05-17T19:31:11.289991 #1799568] INFO -- : [ 86/885] 1840541=test_gem_commands_outdated_command I, [2024-05-17T19:31:11.367505 #1799568] INFO -- : [ 87/885] 1840541=test_gem_dependency_list I, [2024-05-17T19:31:11.443694 #1799568] INFO -- : [ 88/885] 1840541=test_objspace I, [2024-05-17T19:31:12.091164 #1799568] INFO -- : [ 89/885] 1840539=test_require I, [2024-05-17T19:31:12.101603 #1799568] INFO -- : [ 90/885] 1840539=test_stringify_symbols I, [2024-05-17T19:31:12.110468 #1799568] INFO -- : [ 91/885] 1840539=library_symbols_test I, [2024-05-17T19:31:12.120235 #1799568] INFO -- : [ 92/885] 1840539=test_rdoc_text I, [2024-05-17T19:31:12.181496 #1799568] INFO -- : [ 93/885] 1840539=test_rdoc_markup_indented_paragraph I, [2024-05-17T19:31:12.474865 #1799568] INFO -- : [ 94/885] 1840539=test_iseq_load I, [2024-05-17T19:31:12.492832 #1799568] INFO -- : Leaked file descriptor: TestProcess#test_uid_from_name: 8 # I, [2024-05-17T19:31:12.517779 #1799568] INFO -- : COMMAND PID USER FD TYPE DEVICE SIZE/OFF NODE NAME I, [2024-05-17T19:31:12.517853 #1799568] INFO -- : ruby 1840540 opc 8u unix 0x0000000000000000 0t0 3026002532 type=STREAM I, [2024-05-17T19:31:13.328753 #1799568] INFO -- : [ 95/885] 1840539=test_rdoc_markup_parser I, [2024-05-17T19:31:13.384764 #1799568] INFO -- : [ 96/885] 1840539=test_ns_spki I, [2024-05-17T19:31:13.397131 #1799568] INFO -- : [ 97/885] 1840539=test_stream I, [2024-05-17T19:31:13.629164 #1799568] INFO -- : [ 98/885] 1840539=test_have_library I, [2024-05-17T19:31:14.371711 #1799568] INFO -- : [ 99/885] 1840539=test_rdoc_encoding I, [2024-05-17T19:31:14.405762 #1799568] INFO -- : [100/885] 1840539=test_win32ole_variant_outarg I, [2024-05-17T19:31:14.443367 #1799568] INFO -- : [101/885] 1840539=test_gem_request_set_lockfile I, [2024-05-17T19:31:14.868561 #1799568] INFO -- : [102/885] 1840539=test_rdoc_markdown I, [2024-05-17T19:31:15.120956 #1799568] INFO -- : [103/885] 1840539=test_key_actor_vi I, [2024-05-17T19:31:15.298273 #1799568] INFO -- : [104/885] 1840539=test_postponed_job I, [2024-05-17T19:31:15.579962 #1799568] INFO -- : [105/885] 1840539=test_rdoc_constant I, [2024-05-17T19:31:15.665846 #1799568] INFO -- : [106/885] 1840539=test_deprecate I, [2024-05-17T19:31:15.748073 #1799568] INFO -- : [107/885] 1840539=test_httpresponses I, [2024-05-17T19:31:15.760664 #1799568] INFO -- : [108/885] 1840539=test_rdoc_markup_to_html_snippet I, [2024-05-17T19:31:15.815777 #1799568] INFO -- : [109/885] 1840539=test_common I, [2024-05-17T19:31:16.007682 #1799568] INFO -- : [110/885] 1840539=test_generic I, [2024-05-17T19:31:16.030714 #1799568] INFO -- : [111/885] 1840539=test_ubf_async_safe I, [2024-05-17T19:31:16.040135 #1799568] INFO -- : [112/885] 1840539=test_pstore I, [2024-05-17T19:31:16.240746 #1799568] INFO -- : [113/885] 1840539=test_date_compat I, [2024-05-17T19:31:16.245907 #1799568] INFO -- : [114/885] 1840539=test_win32ole_record I, [2024-05-17T19:31:16.267086 #1799568] INFO -- : [115/885] 1840539=test_rdoc_include I, [2024-05-17T19:31:16.297911 #1799568] INFO -- : [116/885] 1840539=test_gem_version_option I, [2024-05-17T19:31:16.368912 #1799568] INFO -- : [117/885] 1840539=test_gem_commands_unpack_command I, [2024-05-17T19:31:16.720302 #1799568] INFO -- : [118/885] 1840539=test_gem_ext_cargo_builder I, [2024-05-17T19:31:16.721977 #1799568] INFO -- : [119/885] 1840539=test_console_attr I, [2024-05-17T19:31:16.746790 #1799568] INFO -- : [120/885] 1840539=test_proc I, [2024-05-17T19:31:17.661639 #1799568] INFO -- : [121/885] 1840539=test_zlib I, [2024-05-17T19:31:19.687309 #1799568] INFO -- : .Leaked file descriptor: TestProcess#test_gid_from_name: 9 # I, [2024-05-17T19:31:19.717689 #1799568] INFO -- : COMMAND PID USER FD TYPE DEVICE SIZE/OFF NODE NAME I, [2024-05-17T19:31:19.717762 #1799568] INFO -- : ruby 1840540 opc 9r REG 252,0 6940392 13705429 /var/lib/sss/mc/group I, [2024-05-17T19:31:23.548095 #1799568] INFO -- : [122/885] 1840539=test_rdoc_options I, [2024-05-17T19:31:23.857158 #1799568] INFO -- : [123/885] 1840539=test_enumerator I, [2024-05-17T19:31:23.862027 #1799568] INFO -- : [124/885] 1840539=test_path_to_class I, [2024-05-17T19:31:23.867190 #1799568] INFO -- : [125/885] 1840539=test_frozen_error I, [2024-05-17T19:31:23.876191 #1799568] INFO -- : [126/885] 1840539=test_gem_version I, [2024-05-17T19:31:23.982717 #1799568] INFO -- : [127/885] 1840539=test_spell_checker I, [2024-05-17T19:31:24.088826 #1799568] INFO -- : [128/885] 1840539=test_gem_ext_ext_conf_builder I, [2024-05-17T19:31:25.117824 #1799568] INFO -- : [129/885] 1840539=test_reqarg I, [2024-05-17T19:31:25.488055 #1799568] INFO -- : [130/885] 1840539=test_gem_uri I, [2024-05-17T19:31:25.521658 #1799568] INFO -- : [131/885] 1840539=test_resource I, [2024-05-17T19:31:25.571304 #1799568] INFO -- : [132/885] 1840539=test_gem_package_tar_reader_entry I, [2024-05-17T19:31:25.864844 #1799568] INFO -- : [133/885] 1840539=test_c_struct_builder I, [2024-05-17T19:31:25.933270 #1799568] INFO -- : [134/885] 1840541=test_bug-5832 I, [2024-05-17T19:31:25.939129 #1799568] INFO -- : [135/885] 1840541=test_yield_block I, [2024-05-17T19:31:25.946492 #1799568] INFO -- : [136/885] 1840541=test_pipe I, [2024-05-17T19:31:26.050866 #1799568] INFO -- : [137/885] 1840539=test_string I, [2024-05-17T19:31:26.107092 #1799568] INFO -- : [138/885] 1840541=test_macro I, [2024-05-17T19:31:26.128159 #1799568] INFO -- : [139/885] 1840541=test_gem_resolver_activation_request I, [2024-05-17T19:31:26.161101 #1799568] INFO -- : [140/885] 1840541=test_function I, [2024-05-17T19:31:26.392360 #1799568] INFO -- : [141/885] 1840541=test_gem_commands_server_command I, [2024-05-17T19:31:26.400669 #1799568] INFO -- : [142/885] 1840541=test_gem_name_tuple I, [2024-05-17T19:31:26.418878 #1799568] INFO -- : [143/885] 1840541=test_rdoc_markup_to_table_of_contents I, [2024-05-17T19:31:26.449644 #1799568] INFO -- : [144/885] 1840541=test_integer I, [2024-05-17T19:31:26.505563 #1799568] INFO -- : [145/885] 1840541=test_win32ole_method_event I, [2024-05-17T19:31:26.525181 #1799568] INFO -- : [146/885] 1840541=test_tcp I, [2024-05-17T19:31:26.597294 #1799568] INFO -- : [147/885] 1840541=parse_comments_test I, [2024-05-17T19:31:26.609023 #1799568] INFO -- : [148/885] 1840541=test_gem_requirement I, [2024-05-17T19:31:26.791894 #1799568] INFO -- : [149/885] 1840541=test_flags I, [2024-05-17T19:31:27.264016 #1799568] INFO -- : [150/885] 1840540=test_numeric I, [2024-05-17T19:31:27.334346 #1799568] INFO -- : [151/885] 1840540=test_bug-3571 I, [2024-05-17T19:31:27.345094 #1799568] INFO -- : [152/885] 1840540=test_yamlstore I, [2024-05-17T19:31:27.348829 #1799568] INFO -- : [153/885] 1840541=test_rat I, [2024-05-17T19:31:27.356050 #1799568] INFO -- : [154/885] 1840540=test_gem_request_connection_pools I, [2024-05-17T19:31:27.370631 #1799568] INFO -- : [155/885] 1840541=test_init I, [2024-05-17T19:31:27.704146 #1799568] INFO -- : [156/885] 1840541=test_capacity I, [2024-05-17T19:31:27.723420 #1799568] INFO -- : [157/885] 1840541=test_gem_commands_owner_command I, [2024-05-17T19:31:28.349775 #1799568] INFO -- : [158/885] 1840541=test_nextafter I, [2024-05-17T19:31:28.410978 #1799568] INFO -- : [159/885] 1840540=test_file I, [2024-05-17T19:31:28.441567 #1799568] INFO -- : [160/885] 1840541=test_time I, [2024-05-17T19:31:28.451609 #1799568] INFO -- : [161/885] 1840540=test_encoding I, [2024-05-17T19:31:28.578120 #1799568] INFO -- : [162/885] 1840541=test_hmac I, [2024-05-17T19:31:28.586388 #1799568] INFO -- : [163/885] 1840541=test_constant I, [2024-05-17T19:31:28.660724 #1799568] INFO -- : [164/885] 1840540=test_find I, [2024-05-17T19:31:28.681911 #1799568] INFO -- : [165/885] 1840540=test_rdoc_generator_markup I, [2024-05-17T19:31:28.717104 #1799568] INFO -- : [166/885] 1840540=test_string_memory I, [2024-05-17T19:31:28.779389 #1799568] INFO -- : [167/885] 1840540=test_help I, [2024-05-17T19:31:28.781134 #1799568] INFO -- : [168/885] 1840540=test_files_lib I, [2024-05-17T19:31:28.787026 #1799568] INFO -- : [169/885] 1840540=test_marshalable I, [2024-05-17T19:31:28.793376 #1799568] INFO -- : [170/885] 1840540=test_line_editor I, [2024-05-17T19:31:28.802113 #1799568] INFO -- : [171/885] 1840540=reflection_test I, [2024-05-17T19:31:28.807311 #1799568] INFO -- : [172/885] 1840540=test_enumerator_kw I, [2024-05-17T19:31:28.823242 #1799568] INFO -- : [173/885] 1840540=test_error_highlight I, [2024-05-17T19:31:29.266366 #1799568] INFO -- : [174/885] 1840540=test_rdoc_any_method I, [2024-05-17T19:31:29.649150 #1799568] INFO -- : [175/885] 1840540=test_function_entry I, [2024-05-17T19:31:29.660697 #1799568] INFO -- : [176/885] 1840540=test_string I, [2024-05-17T19:31:29.683220 #1799568] INFO -- : [177/885] 1840540=json_common_interface_test I, [2024-05-17T19:31:29.692050 #1799568] INFO -- : [178/885] 1840540=version_test I, [2024-05-17T19:31:29.695613 #1799568] INFO -- : [179/885] 1840540=test_raise I, [2024-05-17T19:31:29.703739 #1799568] INFO -- : [180/885] 1840540=test_complexrational I, [2024-05-17T19:31:29.712438 #1799568] INFO -- : [181/885] 1840540=test_date I, [2024-05-17T19:31:29.716508 #1799568] INFO -- : [182/885] 1840540=test_big5 I, [2024-05-17T19:31:29.817363 #1799568] INFO -- : [183/885] 1840540=test_gem_commands_update_command I, [2024-05-17T19:31:30.660111 #1799568] INFO -- : [184/885] 1840541=test_protect I, [2024-05-17T19:31:30.672926 #1799568] INFO -- : [185/885] 1840541=test_tree_builder I, [2024-05-17T19:31:30.681254 #1799568] INFO -- : [186/885] 1840541=test_store I, [2024-05-17T19:31:31.033323 #1799568] INFO -- : [187/885] 1840541=test_rdoc_markup_pre_process I, [2024-05-17T19:31:31.124896 #1799568] INFO -- : [188/885] 1840541=test_coverage I, [2024-05-17T19:31:31.451520 #1799568] INFO -- : [189/885] 1840540=test_tempfile I, [2024-05-17T19:31:31.667499 #1799568] INFO -- : [190/885] 1840540=test_http_request I, [2024-05-17T19:31:31.712223 #1799568] INFO -- : [191/885] 1840540=test_pathname I, [2024-05-17T19:31:31.805841 #1799568] INFO -- : [192/885] 1840541=test_fnmatch I, [2024-05-17T19:31:31.867771 #1799568] INFO -- : [193/885] 1840541=test_timeout I, [2024-05-17T19:31:31.880603 #1799568] INFO -- : [194/885] 1840541=test_erb_m17n I, [2024-05-17T19:31:31.888066 #1799568] INFO -- : [195/885] 1840541=test_rdoc_generator_pot_po_entry I, [2024-05-17T19:31:31.897249 #1799568] INFO -- : [196/885] 1840541=test_frozen I, [2024-05-17T19:31:31.921549 #1799568] INFO -- : [197/885] 1840541=test_serialize_subclasses I, [2024-05-17T19:31:31.932062 #1799568] INFO -- : [198/885] 1840541=test_gem_resolver_index_specification I, [2024-05-17T19:31:31.980033 #1799568] INFO -- : [199/885] 1840540=test_egrep_cpp I, [2024-05-17T19:31:31.988555 #1799568] INFO -- : [200/885] 1840541=test_rdoc_markup_verbatim I, [2024-05-17T19:31:32.002376 #1799568] INFO -- : [201/885] 1840541=test_webauthn_poller I, [2024-05-17T19:31:32.091148 #1799568] INFO -- : [202/885] 1840540=test_date_conv I, [2024-05-17T19:31:32.104710 #1799568] INFO -- : [203/885] 1840540=test_comparable I, [2024-05-17T19:31:32.108404 #1799568] INFO -- : [204/885] 1840540=json_string_matching_test I, [2024-05-17T19:31:32.117781 #1799568] INFO -- : [205/885] 1840540=test_gem_config_file I, [2024-05-17T19:31:32.142186 #1799568] INFO -- : [206/885] 1840541=test_io_timeout I, [2024-05-17T19:31:32.156718 #1799568] INFO -- : [207/885] 1840541=test_rdoc_normal_module I, [2024-05-17T19:31:32.223967 #1799568] INFO -- : [208/885] 1840541=test_type_completor I, [2024-05-17T19:31:32.228132 #1799568] INFO -- : [209/885] 1840541=test_rdoc_markdown_test I, [2024-05-17T19:31:32.320574 #1799568] INFO -- : [210/885] 1840540=test_rdoc_rdoc I, [2024-05-17T19:31:32.432080 #1799568] INFO -- : [211/885] 1840540=test_yjit_exit_locations I, [2024-05-17T19:31:32.442207 #1799568] INFO -- : [212/885] 1840540=test_io_buffer I, [2024-05-17T19:31:32.509319 #1799568] INFO -- : [213/885] 1840540=test_thread_queue I, [2024-05-17T19:31:33.227099 #1799568] INFO -- : [214/885] 1840541=test_passing_block I, [2024-05-17T19:31:33.236834 #1799568] INFO -- : [215/885] 1840541=test_defined I, [2024-05-17T19:31:33.308822 #1799568] INFO -- : [216/885] 1840541=test_nowrite I, [2024-05-17T19:31:33.338362 #1799568] INFO -- : [217/885] 1840541=test_kdf I, [2024-05-17T19:31:33.399024 #1799568] INFO -- : [218/885] 1840541=test_ldap I, [2024-05-17T19:31:33.435501 #1799568] INFO -- : [219/885] 1840541=test_import I, [2024-05-17T19:31:34.718080 #1799568] INFO -- : [220/885] 1840541=test_human_typo I, [2024-05-17T19:31:34.723985 #1799568] INFO -- : [221/885] 1840541=test_wait I, [2024-05-17T19:31:34.778396 #1799568] INFO -- : [222/885] 1840541=test_nil I, [2024-05-17T19:31:34.792886 #1799568] INFO -- : [223/885] 1840541=test_psych I, [2024-05-17T19:31:34.987660 #1799568] INFO -- : [224/885] 1840541=test_cstr I, [2024-05-17T19:31:35.830876 #1799568] INFO -- : [225/885] 1840541=test_command I, [2024-05-17T19:31:36.097465 #1799568] INFO -- : [226/885] 1840541=test_euc_tw I, [2024-05-17T19:31:36.105962 #1799568] INFO -- : [227/885] 1840541=test_gem_resolver_dependency_request I, [2024-05-17T19:31:36.138023 #1799568] INFO -- : [228/885] 1840541=test_yaml_tree I, [2024-05-17T19:31:36.170445 #1799568] INFO -- : [229/885] 1840541=test_gem_commands_yank_command I, [2024-05-17T19:31:36.682595 #1799568] INFO -- : [230/885] 1840541=test_pkey_dsa I, [2024-05-17T19:31:37.716820 #1799568] INFO -- : [231/885] 1840540=test_logger I, [2024-05-17T19:31:37.762351 #1799568] INFO -- : [232/885] 1840540=test_big2str I, [2024-05-17T19:31:37.771886 #1799568] INFO -- : [233/885] 1840540=test_gem_resolver_specification I, [2024-05-17T19:31:37.802219 #1799568] INFO -- : [234/885] 1840540=test_gem_package_tar_writer I, [2024-05-17T19:31:37.923314 #1799568] INFO -- : [235/885] 1840540=test_str2big I, [2024-05-17T19:31:37.927580 #1799568] INFO -- : [236/885] 1840540=test_severity I, [2024-05-17T19:31:37.938953 #1799568] INFO -- : [237/885] 1840540=test_ractor I, [2024-05-17T19:31:37.939469 #1799568] INFO -- : [238/885] 1840540=test_case I, [2024-05-17T19:31:37.949894 #1799568] INFO -- : [239/885] 1840540=test_utf16 I, [2024-05-17T19:31:38.003633 #1799568] INFO -- : [240/885] 1840540=test_http I, [2024-05-17T19:31:39.933684 #1799568] INFO -- : [241/885] 1840541=attribute_write_test I, [2024-05-17T19:31:39.941543 #1799568] INFO -- : [242/885] 1840541=test_set I, [2024-05-17T19:31:39.948433 #1799568] INFO -- : [243/885] 1840541=test_rdoc_markup_to_rdoc I, [2024-05-17T19:31:40.000924 #1799568] INFO -- : [244/885] 1840541=test_yaml I, [2024-05-17T19:31:40.095287 #1799568] INFO -- : [245/885] 1840541=test_x509name I, [2024-05-17T19:31:40.114649 #1799568] INFO -- : [246/885] 1840541=test_argf I, [2024-05-17T19:31:43.699302 #1799568] INFO -- : [247/885] 1840541=test_m17n I, [2024-05-17T19:31:43.795135 #1799568] INFO -- : [248/885] 1840541=test_method I, [2024-05-17T19:31:44.749299 #1799568] INFO -- : [249/885] 1840539=test_gem_dependency I, [2024-05-17T19:31:44.887677 #1799568] INFO -- : [250/885] 1840539=test_yjit I, [2024-05-17T19:31:44.911069 #1799568] INFO -- : [251/885] 1840539=test_cclass I, [2024-05-17T19:31:44.979007 #1799568] INFO -- : [252/885] 1840539=test_gem_uninstaller I, [2024-05-17T19:31:46.224009 #1799568] INFO -- : [253/885] 1840539=test_filter I, [2024-05-17T19:31:46.259361 #1799568] INFO -- : [254/885] 1840539=test_parser_events I, [2024-05-17T19:31:46.366219 #1799568] INFO -- : [255/885] 1840539=test_gem_remote_fetcher I, [2024-05-17T19:31:46.540782 #1799568] INFO -- : [256/885] 1840540=test_json_tree I, [2024-05-17T19:31:46.547630 #1799568] INFO -- : [257/885] 1840540=test_koi8 I, [2024-05-17T19:31:46.639896 #1799568] INFO -- : [258/885] 1840540=test_pkcs12 I, [2024-05-17T19:31:47.286164 #1799568] INFO -- : [259/885] 1840540=test_gem_dependency_installer I, [2024-05-17T19:31:48.300872 #1799568] INFO -- : [260/885] 1840539=test_pty I, [2024-05-17T19:31:48.767606 #1799568] INFO -- : [261/885] 1840539=parser_test I, [2024-05-17T19:31:48.788813 #1799568] INFO -- : [262/885] 1840539=test_hash I, [2024-05-17T19:31:49.473867 #1799568] INFO -- : [263/885] 1840541=test_http I, [2024-05-17T19:31:49.488534 #1799568] INFO -- : [264/885] 1840541=test_scan_args I, [2024-05-17T19:31:49.502400 #1799568] INFO -- : [265/885] 1840541=test_gem_commands_specification_command I, [2024-05-17T19:31:49.641123 #1799568] INFO -- : [266/885] 1840541=encoding_test I, [2024-05-17T19:31:49.720524 #1799568] INFO -- : [267/885] 1840541=test_gem_package_old I, [2024-05-17T19:31:49.752779 #1799568] INFO -- : [268/885] 1840540=test_gem_commands_which_command I, [2024-05-17T19:31:49.762236 #1799568] INFO -- : [269/885] 1840541=test_gem_request I, [2024-05-17T19:31:49.792442 #1799568] INFO -- : [270/885] 1840540=locals_test I, [2024-05-17T19:31:49.977804 #1799568] INFO -- : [271/885] 1840541=test_gem_commands_push_command I, [2024-05-17T19:31:50.306177 #1799568] INFO -- : [272/885] 1840540=test_sprintf_comb I, [2024-05-17T19:31:50.448182 #1799568] INFO -- : [273/885] 1840540=test_too_many_dummy_encodings I, [2024-05-17T19:31:50.500791 #1799568] INFO -- : [274/885] 1840540=test_method_cache I, [2024-05-17T19:31:50.500946 #1799568] INFO -- : [275/885] 1840540=test_gem_gemcutter_utilities I, [2024-05-17T19:31:50.694305 #1799568] INFO -- : [276/885] 1840541=desugar_compiler_test I, [2024-05-17T19:31:50.704791 #1799568] INFO -- : [277/885] 1840541=test_gem_source_local I, [2024-05-17T19:31:50.935993 #1799568] INFO -- : [278/885] 1840541=test_win32ole I, [2024-05-17T19:31:50.947834 #1799568] INFO -- : [279/885] 1840541=test_internal_ivar I, [2024-05-17T19:31:50.949040 #1799568] INFO -- : [280/885] 1840541=test_rendering I, [2024-05-17T19:31:50.960317 #1799568] INFO -- : [281/885] 1840541=test_tracepoint I, [2024-05-17T19:31:51.012667 #1799568] INFO -- : [282/885] 1840540=test_settracefunc I, [2024-05-17T19:31:51.249719 #1799568] INFO -- : [283/885] 1840541=test_gem_text I, [2024-05-17T19:31:51.331417 #1799568] INFO -- : [284/885] 1840541=test_backtrace I, [2024-05-17T19:31:51.899174 #1799568] INFO -- : [285/885] 1840540=test_rdoc_task I, [2024-05-17T19:31:51.906335 #1799568] INFO -- : [286/885] 1840540=test_weakmap I, [2024-05-17T19:31:52.575478 #1799568] INFO -- : [287/885] 1840539=test_coderange I, [2024-05-17T19:31:52.582645 #1799568] INFO -- : [288/885] 1840539=test_inadvertent_creation I, [2024-05-17T19:31:52.605649 #1799568] INFO -- : [289/885] 1840541=test_ansi_with_terminfo I, [2024-05-17T19:31:52.607482 #1799568] INFO -- : [290/885] 1840541=test_framework I, [2024-05-17T19:31:52.651650 #1799568] INFO -- : [291/885] 1840541=test_pinned I, [2024-05-17T19:31:52.692114 #1799568] INFO -- : [292/885] 1840539=test_pack I, [2024-05-17T19:31:52.704820 #1799568] INFO -- : [293/885] 1840541=test_cgi_tag_helper I, [2024-05-17T19:31:52.715118 #1799568] INFO -- : [294/885] 1840541=test_rdoc_generator_json_index I, [2024-05-17T19:31:52.727757 #1799568] INFO -- : [295/885] 1840539=test_date_time I, [2024-05-17T19:31:52.739036 #1799568] INFO -- : [296/885] 1840541=test_nil2vtempty I, [2024-05-17T19:31:52.743095 #1799568] INFO -- : [297/885] 1840541=test_enc_associate I, [2024-05-17T19:31:52.760142 #1799568] INFO -- : [298/885] 1840539=test_enumerator I, [2024-05-17T19:31:53.241083 #1799568] INFO -- : [299/885] 1840541=test_case I, [2024-05-17T19:31:53.386332 #1799568] INFO -- : [300/885] 1840541=test_open-uri I, [2024-05-17T19:31:53.730258 #1799568] INFO -- : [301/885] 1840541=test_array I, [2024-05-17T19:31:53.786560 #1799568] INFO -- : [302/885] 1840541=test_gem_command_manager I, [2024-05-17T19:31:53.964109 #1799568] INFO -- : [303/885] 1840541=test_rdoc_context I, [2024-05-17T19:31:54.697006 #1799568] INFO -- : [304/885] 1840541=test_safe_load I, [2024-05-17T19:31:54.710967 #1799568] INFO -- : [305/885] 1840541=test_iso_8859 I, [2024-05-17T19:31:54.765350 #1799568] INFO -- : [306/885] 1840541=ripper_test I, [2024-05-17T19:31:55.389271 #1799568] INFO -- : [307/885] 1840541=test_libs I, [2024-05-17T19:31:55.397130 #1799568] INFO -- : [308/885] 1840541=test_gc I, [2024-05-17T19:31:55.404978 #1799568] INFO -- : [309/885] 1840541=comments_test I, [2024-05-17T19:31:55.412032 #1799568] INFO -- : [310/885] 1840541=test_qsort I, [2024-05-17T19:31:55.424904 #1799568] INFO -- : [311/885] 1840541=test_math I, [2024-05-17T19:31:55.449239 #1799568] INFO -- : [312/885] 1840541=index_write_test I, [2024-05-17T19:31:55.473934 #1799568] INFO -- : [313/885] 1840541=test_rdoc_parser_rd I, [2024-05-17T19:31:55.490094 #1799568] INFO -- : [314/885] 1840541=test_const I, [2024-05-17T19:31:55.564773 #1799568] INFO -- : [315/885] 1840541=test_exit I, [2024-05-17T19:31:55.577573 #1799568] INFO -- : [316/885] 1840541=test_class I, [2024-05-17T19:31:57.990592 #1799568] INFO -- : [317/885] 1840540=test_recorder I, [2024-05-17T19:31:57.998649 #1799568] INFO -- : [318/885] 1840540=test_yaml_special_cases I, [2024-05-17T19:31:58.017226 #1799568] INFO -- : [319/885] 1840540=test_gem_commands_sources_command I, [2024-05-17T19:31:58.218495 #1799568] INFO -- : [320/885] 1840540=test_name_error I, [2024-05-17T19:31:58.311062 #1799568] INFO -- : [321/885] 1840540=json_addition_test I, [2024-05-17T19:31:58.319703 #1799568] INFO -- : [322/885] 1840540=test_gem_source_list I, [2024-05-17T19:31:58.390138 #1799568] INFO -- : [323/885] 1840540=test_sprintf I, [2024-05-17T19:31:58.600764 #1799568] INFO -- : [324/885] 1840540=test_gem_specification I, [2024-05-17T19:31:59.786004 #1799568] INFO -- : [325/885] 1840541=test_numhash I, [2024-05-17T19:31:59.788654 #1799568] INFO -- : [326/885] 1840541=test_system I, [2024-05-17T19:32:00.673739 #1799568] INFO -- : [327/885] 1840541=test_flush I, [2024-05-17T19:32:00.730269 #1799568] INFO -- : [328/885] 1840541=test_pkey_rsa I, [2024-05-17T19:32:00.955949 #1799568] INFO -- : [329/885] 1840541=test_win32ole_variable I, [2024-05-17T19:32:00.973931 #1799568] INFO -- : [330/885] 1840541=test_rdoc_cross_reference I, [2024-05-17T19:32:01.183576 #1799568] INFO -- : [331/885] 1840540=test_parse I, [2024-05-17T19:32:01.389792 #1799568] INFO -- : [332/885] 1840541=test_rdoc_class_module I, [2024-05-17T19:32:01.678102 #1799568] INFO -- : [333/885] 1840540=test_method_cache I, [2024-05-17T19:32:01.687740 #1799568] INFO -- : [334/885] 1840540=test_gem_dependency_resolution_error I, [2024-05-17T19:32:01.697152 #1799568] INFO -- : [335/885] 1840540=test_sleep I, [2024-05-17T19:32:01.892655 #1799568] INFO -- : [336/885] 1840541=test_mixed_unicode_escapes I, [2024-05-17T19:32:01.915493 #1799568] INFO -- : [337/885] 1840541=test_fileutils I, [2024-05-17T19:32:02.144695 #1799568] INFO -- : Leaked file descriptor: TestFileUtils#test_chown_error: 11 # I, [2024-05-17T19:32:02.175841 #1799568] INFO -- : COMMAND PID USER FD TYPE DEVICE SIZE/OFF NODE NAME I, [2024-05-17T19:32:02.175916 #1799568] INFO -- : ruby 1840541 opc 11r REG 252,0 9253600 13705411 /var/lib/sss/mc/passwd I, [2024-05-17T19:32:02.482747 #1799568] INFO -- : [338/885] 1840541=test_cp949 I, [2024-05-17T19:32:02.488715 #1799568] INFO -- : [339/885] 1840541=test_jaro_winkler I, [2024-05-17T19:32:02.498299 #1799568] INFO -- : [340/885] 1840541=test_gem_resolver_vendor_set I, [2024-05-17T19:32:02.519408 #1799568] INFO -- : [341/885] 1840541=test_condition I, [2024-05-17T19:32:02.590063 #1799568] INFO -- : [342/885] 1840541=test_sorted_set I, [2024-05-17T19:32:02.722388 #1799568] INFO -- : [343/885] 1840541=test_emoji I, [2024-05-17T19:32:02.748772 #1799568] INFO -- : [344/885] 1840541=test_windows_1252 I, [2024-05-17T19:32:02.934496 #1799568] INFO -- : [345/885] 1840541=test_stack I, [2024-05-17T19:32:03.542009 #1799568] INFO -- : [346/885] 1840541=test_stringchar I, [2024-05-17T19:32:03.664390 #1799568] INFO -- : [347/885] 1840541=warnings_test I, [2024-05-17T19:32:03.680827 #1799568] INFO -- : [348/885] 1840541=test_face I, [2024-05-17T19:32:03.695511 #1799568] INFO -- : [349/885] 1840541=test_sizeof I, [2024-05-17T19:32:03.747085 #1799568] INFO -- : [350/885] 1840540=test_date_attr I, [2024-05-17T19:32:03.759424 #1799568] INFO -- : [351/885] 1840540=test_gem_request_set_lockfile_parser I, [2024-05-17T19:32:03.896150 #1799568] INFO -- : [352/885] 1840540=test_gem_install_update_options I, [2024-05-17T19:32:04.039974 #1799568] INFO -- : [353/885] 1840540=test_econv I, [2024-05-17T19:32:04.998047 #1799568] INFO -- : [354/885] 1840540=test_gem_security I, [2024-05-17T19:32:06.063951 #1799568] INFO -- : [355/885] 1840541=test_key_actor_emacs I, [2024-05-17T19:32:06.451426 #1799568] INFO -- : [356/885] 1840541=test_date_ractor I, [2024-05-17T19:32:06.460993 #1799568] INFO -- : [357/885] 1840541=test_erb I, [2024-05-17T19:32:06.523433 #1799568] INFO -- : [358/885] 1840541=test_basicinstructions I, [2024-05-17T19:32:06.598685 #1799568] INFO -- : [359/885] 1840541=test_utf32 I, [2024-05-17T19:32:06.612540 #1799568] INFO -- : [360/885] 1840541=test_gem_resolver_git_specification I, [2024-05-17T19:32:06.913942 #1799568] INFO -- : [361/885] 1840541=test_rdoc_tom_doc I, [2024-05-17T19:32:06.993083 #1799568] INFO -- : [362/885] 1840541=test_optarg I, [2024-05-17T19:32:07.087540 #1799568] INFO -- : [363/885] 1840541=test_gem_commands_pristine_command I, [2024-05-17T19:32:08.460669 #1799568] INFO -- : [364/885] 1840541=test_variable I, [2024-05-17T19:32:08.557833 #1799568] INFO -- : [365/885] 1840541=test_hash I, [2024-05-17T19:32:08.581943 #1799568] INFO -- : [366/885] 1840541=test_gem_resolver_requirement_list I, [2024-05-17T19:32:08.587193 #1799568] INFO -- : [367/885] 1840541=memsize_test I, [2024-05-17T19:32:08.595531 #1799568] INFO -- : [368/885] 1840541=test_exception I, [2024-05-17T19:32:08.633696 #1799568] INFO -- : [369/885] 1840541=test_raise_exception I, [2024-05-17T19:32:09.248346 #1799568] INFO -- : [370/885] 1840541=test_arith_seq_beg_len_step I, [2024-05-17T19:32:09.305027 #1799568] INFO -- : [371/885] 1840541=test_noarg I, [2024-05-17T19:32:09.379575 #1799568] INFO -- : [372/885] 1840541=test_gem_impossible_dependencies_error I, [2024-05-17T19:32:09.389536 #1799568] INFO -- : [373/885] 1840541=test_pp I, [2024-05-17T19:32:09.440801 #1799568] INFO -- : [374/885] 1840541=test_undef I, [2024-05-17T19:32:09.474512 #1799568] INFO -- : [375/885] 1840541=test_rdoc_generator_darkfish I, [2024-05-17T19:32:09.800323 #1799568] INFO -- : [376/885] 1840541=test_gem_resolver_lock_set I, [2024-05-17T19:32:09.823923 #1799568] INFO -- : [377/885] 1840541=test_random I, [2024-05-17T19:32:09.837531 #1799568] INFO -- : [378/885] 1840541=test_asn1 I, [2024-05-17T19:32:09.859035 #1799568] INFO -- : [379/885] 1840541=test_gem_command I, [2024-05-17T19:32:09.978866 #1799568] INFO -- : [380/885] 1840541=test_assignment I, [2024-05-17T19:32:11.320916 #1799568] INFO -- : [381/885] 1840541=test_gem_update_suggestion I, [2024-05-17T19:32:11.492174 #1799568] INFO -- : [382/885] 1840541=test_gem_commands_open_command I, [2024-05-17T19:32:11.521012 #1799568] INFO -- : [383/885] 1840541=test_verbose I, [2024-05-17T19:32:11.537638 #1799568] INFO -- : [384/885] 1840541=test_normalize I, [2024-05-17T19:32:11.544359 #1799568] INFO -- : [385/885] 1840541=test_emoji_breaks I, [2024-05-17T19:32:11.545765 #1799568] INFO -- : [386/885] 1840541=!Nothing_to_test I, [2024-05-17T19:32:11.547150 #1799568] INFO -- : [387/885] 1840541=test_fd_setsize I, [2024-05-17T19:32:11.558578 #1799568] INFO -- : [388/885] 1840541=test_process I, [2024-05-17T19:32:11.592754 #1799568] INFO -- : [389/885] 1840541=test_forwardable I, [2024-05-17T19:32:11.620847 #1799568] INFO -- : [390/885] 1840541=test_complex I, [2024-05-17T19:32:11.710850 #1799568] INFO -- : [391/885] 1840541=test_threadgroup I, [2024-05-17T19:32:12.713896 #1799568] INFO -- : [392/885] 1840541=test_array_create I, [2024-05-17T19:32:12.822635 #1799568] INFO -- : [393/885] 1840541=test_dir_m17n I, [2024-05-17T19:32:13.954150 #1799568] INFO -- : [394/885] 1840541=test_memory_view I, [2024-05-17T19:32:13.958199 #1799568] INFO -- : [395/885] 1840539=test_rdoc_extend I, [2024-05-17T19:32:13.986575 #1799568] INFO -- : [396/885] 1840539=test_cesu8 I, [2024-05-17T19:32:13.990915 #1799568] INFO -- : [397/885] 1840539=test_shapes I, [2024-05-17T19:32:13.998308 #1799568] INFO -- : [398/885] 1840539=test_did_you_mean I, [2024-05-17T19:32:14.056248 #1799568] INFO -- : [399/885] 1840539=test_merge_keys I, [2024-05-17T19:32:14.058550 #1799568] INFO -- : [400/885] 1840539=test_storage I, [2024-05-17T19:32:14.077850 #1799568] INFO -- : [401/885] 1840539=test_method_name_check I, [2024-05-17T19:32:14.119162 #1799568] INFO -- : [402/885] 1840539=test_err_in_callback I, [2024-05-17T19:32:14.144849 #1799568] INFO -- : [403/885] 1840539=test_gem_commands_install_command I, [2024-05-17T19:32:14.358376 #1799568] INFO -- : [404/885] 1840541=test_string I, [2024-05-17T19:32:14.382246 #1799568] INFO -- : [405/885] 1840541=test_iterator I, [2024-05-17T19:32:14.448188 #1799568] INFO -- : [406/885] 1840541=pattern_test I, [2024-05-17T19:32:14.482675 #1799568] INFO -- : [407/885] 1840541=test_gem_rdoc I, [2024-05-17T19:32:14.651475 #1799568] INFO -- : [408/885] 1840541=test_dot_dot I, [2024-05-17T19:32:14.663950 #1799568] INFO -- : [409/885] 1840541=test_kernel I, [2024-05-17T19:32:15.259625 #1799568] INFO -- : [410/885] 1840540=test_rendering I, [2024-05-17T19:32:15.291254 #1799568] INFO -- : [411/885] 1840540=test_unicode_escape I, [2024-05-17T19:32:15.340945 #1799568] INFO -- : [412/885] 1840541=test_default_gems I, [2024-05-17T19:32:15.368799 #1799568] INFO -- : [413/885] 1840541=test_switch_hitter I, [2024-05-17T19:32:15.372673 #1799568] INFO -- : [414/885] 1840540=test_yamldbm I, [2024-05-17T19:32:15.381864 #1799568] INFO -- : [415/885] 1840540=test_gem_spec_fetcher I, [2024-05-17T19:32:15.415241 #1799568] INFO -- : [416/885] 1840541=test_gem_commands_dependency_command I, [2024-05-17T19:32:15.498448 #1799568] INFO -- : [417/885] 1840541=test_backtrace I, [2024-05-17T19:32:15.509499 #1799568] INFO -- : [418/885] 1840541=test_gbk I, [2024-05-17T19:32:15.520705 #1799568] INFO -- : [419/885] 1840541=static_literals_test I, [2024-05-17T19:32:15.522295 #1799568] INFO -- : [420/885] 1840541=test_tree_spell_checker I, [2024-05-17T19:32:15.603145 #1799568] INFO -- : [421/885] 1840541=test_rdoc_method_attr I, [2024-05-17T19:32:15.608822 #1799568] INFO -- : [422/885] 1840540=test_enumerable I, [2024-05-17T19:32:15.612690 #1799568] INFO -- : [423/885] 1840540=test_set I, [2024-05-17T19:32:15.657701 #1799568] INFO -- : [424/885] 1840540=test_grapheme_breaks I, [2024-05-17T19:32:15.674503 #1799568] INFO -- : [425/885] 1840540=test_hash_create I, [2024-05-17T19:32:15.679566 #1799568] INFO -- : [426/885] 1840540=test_case_mapping I, [2024-05-17T19:32:15.688928 #1799568] INFO -- : [427/885] 1840540=test_rational I, [2024-05-17T19:32:15.722661 #1799568] INFO -- : [428/885] 1840540=test_gem_ext_cargo_builder_unit I, [2024-05-17T19:32:15.726356 #1799568] INFO -- : [429/885] 1840541=test_webauthn_listener I, [2024-05-17T19:32:15.743109 #1799568] INFO -- : [430/885] 1840540=test_ractor I, [2024-05-17T19:32:15.756303 #1799568] INFO -- : [431/885] 1840540=test_gem_resolver_api_specification I, [2024-05-17T19:32:15.809265 #1799568] INFO -- : [432/885] 1840540=test_rdoc_rubygems_hook I, [2024-05-17T19:32:15.838186 #1799568] INFO -- : Leaked file descriptor: WebauthnListenerTest#test_wait_for_otp_code_options_request: 14 : # I, [2024-05-17T19:32:15.869155 #1799568] INFO -- : COMMAND PID USER FD TYPE DEVICE SIZE/OFF NODE NAME I, [2024-05-17T19:32:15.869218 #1799568] INFO -- : ruby 1840541 opc 14u IPv4 3026011375 0t0 TCP localhost:36417->localhost:38526 (CLOSE_WAIT) I, [2024-05-17T19:32:15.888853 #1799568] INFO -- : [433/885] 1840540=test_date_parse I, [2024-05-17T19:32:15.948772 #1799568] INFO -- : [434/885] 1840541=test_mdns I, [2024-05-17T19:32:15.961668 #1799568] INFO -- : [435/885] 1840541=test_open3 I, [2024-05-17T19:32:15.979971 #1799568] INFO -- : [436/885] 1840539=test_key_event_record I, [2024-05-17T19:32:15.994087 #1799568] INFO -- : [437/885] 1840539=test_pkey_ec I, [2024-05-17T19:32:16.016463 #1799568] INFO -- : [438/885] 1840539=test_svcb_https I, [2024-05-17T19:32:16.017937 #1799568] INFO -- : [439/885] 1840539=test_buffering I, [2024-05-17T19:32:16.035082 #1799568] INFO -- : [440/885] 1840540=test_arity I, [2024-05-17T19:32:16.040227 #1799568] INFO -- : [441/885] 1840540=test_thread I, [2024-05-17T19:32:16.053720 #1799568] INFO -- : [442/885] 1840540=test_optimization I, [2024-05-17T19:32:16.070757 #1799568] INFO -- : [443/885] 1840539=test_force_exit I, [2024-05-17T19:32:16.099950 #1799568] INFO -- : [444/885] 1840539=test_data_error I, [2024-05-17T19:32:16.160866 #1799568] INFO -- : [445/885] 1840539=test_files_sample I, [2024-05-17T19:32:16.243878 #1799568] INFO -- : [446/885] 1840539=test_rdoc_stats I, [2024-05-17T19:32:16.318029 #1799568] INFO -- : [447/885] 1840539=test_rubyoptions I, [2024-05-17T19:32:17.448913 #1799568] INFO -- : .Closed file descriptor: TestOpen3#test_capture2: 14 I, [2024-05-17T19:32:18.535750 #1799568] INFO -- : [448/885] 1840541=test_shift_jis I, [2024-05-17T19:32:18.555018 #1799568] INFO -- : [449/885] 1840541=test_rdoc_store I, [2024-05-17T19:32:19.336529 #1799568] INFO -- : [450/885] 1840541=test_yield I, [2024-05-17T19:32:22.458828 #1799568] INFO -- : [451/885] 1840541=test_remote_fetch_error I, [2024-05-17T19:32:22.480574 #1799568] INFO -- : [452/885] 1840541=test_show_source I, [2024-05-17T19:32:22.490038 #1799568] INFO -- : [453/885] 1840541=regexp_test I, [2024-05-17T19:32:22.506946 #1799568] INFO -- : [454/885] 1840541=test_gem_resolver_lock_specification I, [2024-05-17T19:32:22.556226 #1799568] INFO -- : [455/885] 1840541=test_boolean I, [2024-05-17T19:32:22.567103 #1799568] INFO -- : [456/885] 1840541=test_queue I, [2024-05-17T19:32:22.580663 #1799568] INFO -- : [457/885] 1840541=test_rdoc_i18n_locale I, [2024-05-17T19:32:22.588088 #1799568] INFO -- : [458/885] 1840541=test_gc_compact I, [2024-05-17T19:32:22.863225 #1799568] INFO -- : [459/885] 1840539=test_dryrun I, [2024-05-17T19:32:22.893067 #1799568] INFO -- : [460/885] 1840539=test_ole_methods I, [2024-05-17T19:32:22.909811 #1799568] INFO -- : [461/885] 1840539=test_cgi_util I, [2024-05-17T19:32:23.020395 #1799568] INFO -- : [462/885] 1840540=test_gem_uri_formatter I, [2024-05-17T19:32:23.036765 #1799568] INFO -- : [463/885] 1840540=test_prettyprint I, [2024-05-17T19:32:23.094659 #1799568] INFO -- : [464/885] 1840539=test_enc_raise I, [2024-05-17T19:32:23.098645 #1799568] INFO -- : [465/885] 1840540=test_clone I, [2024-05-17T19:32:23.105809 #1799568] INFO -- : [466/885] 1840539=test_gem_source_lock I, [2024-05-17T19:32:23.167004 #1799568] INFO -- : [467/885] 1840539=test_new I, [2024-05-17T19:32:23.186593 #1799568] INFO -- : [468/885] 1840539=test_cipher I, [2024-05-17T19:32:23.202410 #1799568] INFO -- : [469/885] 1840539=test_update I, [2024-05-17T19:32:23.216713 #1799568] INFO -- : [470/885] 1840539=test_rdoc_rd_inline_parser I, [2024-05-17T19:32:23.230085 #1799568] INFO -- : [471/885] 1840539=test_win32ole_type I, [2024-05-17T19:32:23.231715 #1799568] INFO -- : [472/885] 1840539=test_load I, [2024-05-17T19:32:23.237387 #1799568] INFO -- : [473/885] 1840539=test_rdoc_rd I, [2024-05-17T19:32:23.254577 #1799568] INFO -- : [474/885] 1840539=test_rdoc_markup_to_markdown I, [2024-05-17T19:32:23.293264 #1799568] INFO -- : [475/885] 1840539=test_rdoc_markup_to_joined_paragraph I, [2024-05-17T19:32:23.295013 #1799568] INFO -- : [476/885] 1840539=test_rdoc_generator_pot I, [2024-05-17T19:32:23.300082 #1799568] INFO -- : [477/885] 1840540=test_rdoc_rd_block_parser I, [2024-05-17T19:32:23.304355 #1799568] INFO -- : [478/885] 1840539=test_x509store I, [2024-05-17T19:32:23.335265 #1799568] INFO -- : [479/885] 1840540=test_metaclass I, [2024-05-17T19:32:23.364712 #1799568] INFO -- : [480/885] 1840540=test_require_lib I, [2024-05-17T19:32:23.821132 #1799568] INFO -- : [481/885] 1840539=test_gem_gem_runner I, [2024-05-17T19:32:23.879850 #1799568] INFO -- : [482/885] 1840539=test_debugger_integration I, [2024-05-17T19:32:23.890202 #1799568] INFO -- : [483/885] 1840539=test_my_integer I, [2024-05-17T19:32:23.899413 #1799568] INFO -- : [484/885] 1840539=test_gem_resolver_composed_set I, [2024-05-17T19:32:23.920065 #1799568] INFO -- : [485/885] 1840539=test_objectspace I, [2024-05-17T19:32:24.888116 #1799568] INFO -- : [486/885] 1840539=test_require I, [2024-05-17T19:32:26.052561 #1799568] INFO -- : [487/885] 1840541=test_option I, [2024-05-17T19:32:26.172753 #1799568] INFO -- : [488/885] 1840541=test_rdoc_markup_attribute_manager I, [2024-05-17T19:32:26.210712 #1799568] INFO -- : [489/885] 1840541=test_wss I, [2024-05-17T19:32:26.218786 #1799568] INFO -- : [490/885] 1840541=test_tracer I, [2024-05-17T19:32:26.231162 #1799568] INFO -- : [491/885] 1840541=test_not I, [2024-05-17T19:32:26.243527 #1799568] INFO -- : [492/885] 1840541=test_cgi_cookie I, [2024-05-17T19:32:26.256634 #1799568] INFO -- : [493/885] 1840541=test_usrmarshal I, [2024-05-17T19:32:26.390080 #1799568] INFO -- : [494/885] 1840540=test_gem_validator I, [2024-05-17T19:32:26.420780 #1799568] INFO -- : [495/885] 1840540=test_gem_source_installed I, [2024-05-17T19:32:26.432108 #1799568] INFO -- : [496/885] 1840540=test_gem_security_trust_dir I, [2024-05-17T19:32:26.450467 #1799568] INFO -- : [497/885] 1840541=test_module I, [2024-05-17T19:32:26.496632 #1799568] INFO -- : [498/885] 1840540=test_erb_command I, [2024-05-17T19:32:26.562539 #1799568] INFO -- : [499/885] 1840540=test_ssl I, [2024-05-17T19:32:27.587062 #1799568] INFO -- : [500/885] 1840539=test_abi I, [2024-05-17T19:32:27.796641 #1799568] INFO -- : [501/885] 1840539=test_bundled_ca I, [2024-05-17T19:32:29.624631 #1799568] INFO -- : [502/885] 1840539=test_integer_comb I, [2024-05-17T19:32:30.246808 #1799568] INFO -- : [503/885] 1840541=test_load I, [2024-05-17T19:32:30.253675 #1799568] INFO -- : [504/885] 1840541=test_resize I, [2024-05-17T19:32:30.266953 #1799568] INFO -- : [505/885] 1840541=test_gem_package_task I, [2024-05-17T19:32:30.417349 #1799568] INFO -- : [506/885] 1840541=test_lock_native_thread I, [2024-05-17T19:32:30.625702 #1799568] INFO -- : [507/885] 1840541=test_engine I, [2024-05-17T19:32:31.052884 #1799568] INFO -- : [508/885] 1840541=test_fiber I, [2024-05-17T19:32:32.187066 #1799568] INFO -- : [509/885] 1840539=test_gem_commands_mirror I, [2024-05-17T19:32:32.200516 #1799568] INFO -- : [510/885] 1840539=test_win32ole_param I, [2024-05-17T19:32:32.204719 #1799568] INFO -- : [511/885] 1840539=test_key_error I, [2024-05-17T19:32:32.223906 #1799568] INFO -- : [512/885] 1840539=test_rdoc_parser_markdown I, [2024-05-17T19:32:32.234879 #1799568] INFO -- : [513/885] 1840539=test_custom_command I, [2024-05-17T19:32:32.240571 #1799568] INFO -- : [514/885] 1840539=static_inspect_test I, [2024-05-17T19:32:32.244777 #1799568] INFO -- : [515/885] 1840539=test_struct I, [2024-05-17T19:32:32.288328 #1799568] INFO -- : [516/885] 1840539=test_c_struct_entry I, [2024-05-17T19:32:32.853679 #1799568] INFO -- : [517/885] 1840539=test_rubyvm I, [2024-05-17T19:32:32.862176 #1799568] INFO -- : [518/885] 1840539=fuzzer_test I, [2024-05-17T19:32:32.904996 #1799568] INFO -- : [519/885] 1840539=test_cparser I, [2024-05-17T19:32:34.400551 #1799568] INFO -- : [520/885] 1840539=test_ostruct I, [2024-05-17T19:32:34.524612 #1799568] INFO -- : [521/885] 1840539=test_config I, [2024-05-17T19:32:34.565258 #1799568] INFO -- : [522/885] 1840539=test_change_word I, [2024-05-17T19:32:34.569953 #1799568] INFO -- : [523/885] 1840539=test_depth_first I, [2024-05-17T19:32:34.578162 #1799568] INFO -- : [524/885] 1840539=test_stringscanner I, [2024-05-17T19:32:34.624553 #1799568] INFO -- : [525/885] 1840539=test_ractor I, [2024-05-17T19:32:34.697607 #1799568] INFO -- : [526/885] 1840539=test_gem_resolver_installed_specification I, [2024-05-17T19:32:34.768517 #1799568] INFO -- : [527/885] 1840539=test_exception_at_throwing I, [2024-05-17T19:32:34.779235 #1799568] INFO -- : [528/885] 1840539=test_gem_resolver_vendor_specification I, [2024-05-17T19:32:34.811268 #1799568] INFO -- : [529/885] 1840539=test_date_arith I, [2024-05-17T19:32:34.850293 #1799568] INFO -- : [530/885] 1840539=test_fiddle I, [2024-05-17T19:32:34.986339 #1799568] INFO -- : [531/885] 1840539=json_generic_object_test I, [2024-05-17T19:32:35.001124 #1799568] INFO -- : [532/885] 1840539=test_rdoc_ri_driver I, [2024-05-17T19:32:35.390596 #1799568] INFO -- : [533/885] 1840539=test_ractor I, [2024-05-17T19:32:35.398076 #1799568] INFO -- : [534/885] 1840539=test_sexp I, [2024-05-17T19:32:35.420844 #1799568] INFO -- : [535/885] 1840539=test_httpheader I, [2024-05-17T19:32:35.426726 #1799568] INFO -- : [536/885] 1840539=test_gem_safe_marshal I, [2024-05-17T19:32:36.119731 #1799568] INFO -- : [537/885] 1840539=test_digest I, [2024-05-17T19:32:36.892514 #1799568] INFO -- : [538/885] 1840539=test_signedness I, [2024-05-17T19:32:37.015317 #1799568] INFO -- : [539/885] 1840540=test_gem_resolver_git_set I, [2024-05-17T19:32:37.207313 #1799568] INFO -- : [540/885] 1840541=test_gem_commands_check_command I, [2024-05-17T19:32:37.274297 #1799568] INFO -- : [541/885] 1840541=test_acceptable I, [2024-05-17T19:32:37.303011 #1799568] INFO -- : [542/885] 1840541=test_dup I, [2024-05-17T19:32:37.463871 #1799568] INFO -- : [543/885] 1840541=test_rdoc_single_class I, [2024-05-17T19:32:37.474217 #1799568] INFO -- : [544/885] 1840541=test_gem_local_remote_options I, [2024-05-17T19:32:37.533248 #1799568] INFO -- : [545/885] 1840541=test_gem_ext_cargo_builder_link_flag_converter I, [2024-05-17T19:32:37.600691 #1799568] INFO -- : [546/885] 1840541=heredoc_dedent_test I, [2024-05-17T19:32:37.611376 #1799568] INFO -- : [547/885] 1840541=test_type I, [2024-05-17T19:32:37.616739 #1799568] INFO -- : [548/885] 1840541=test_rdoc_token_stream I, [2024-05-17T19:32:37.635307 #1799568] INFO -- : [549/885] 1840541=test_mutex I, [2024-05-17T19:32:37.643551 #1799568] INFO -- : [550/885] 1840540=test_struct I, [2024-05-17T19:32:38.159552 #1799568] INFO -- : [551/885] 1840540=test_tmpdir I, [2024-05-17T19:32:38.244521 #1799568] INFO -- : [552/885] 1840540=test_ssl_session I, [2024-05-17T19:32:38.625020 #1799568] INFO -- : [553/885] 1840539=test_gem_package_tar_header I, [2024-05-17T19:32:38.724318 #1799568] INFO -- : [554/885] 1840539=test_placearg I, [2024-05-17T19:32:38.754848 #1799568] INFO -- : [555/885] 1840539=test_rational2 I, [2024-05-17T19:32:38.780878 #1799568] INFO -- : [556/885] 1840541=test_case_comprehensive I, [2024-05-17T19:32:38.810223 #1799568] INFO -- : [557/885] 1840539=test_logperiod I, [2024-05-17T19:32:38.816855 #1799568] INFO -- : [558/885] 1840539=parse_stream_test I, [2024-05-17T19:32:38.870265 #1799568] INFO -- : [559/885] 1840539=test_handle I, [2024-05-17T19:32:39.128034 #1799568] INFO -- : [560/885] 1840540=test_delete I, [2024-05-17T19:32:39.143925 #1799568] INFO -- : [561/885] 1840540=test_rdoc_markup_document I, [2024-05-17T19:32:39.160087 #1799568] INFO -- : [562/885] 1840540=test_gem_security_policy I, [2024-05-17T19:32:39.550351 #1799568] INFO -- : [563/885] 1840540=test_file_exhaustive I, [2024-05-17T19:32:39.604835 #1799568] INFO -- : [564/885] 1840539=test_completion I, [2024-05-17T19:32:40.307134 #1799568] INFO -- : [565/885] 1840539=test_gem_ci_detector I, [2024-05-17T19:32:40.318028 #1799568] INFO -- : [566/885] 1840539=test_continuation I, [2024-05-17T19:32:40.332203 #1799568] INFO -- : [567/885] 1840539=test_gem_silent_ui I, [2024-05-17T19:32:40.374857 #1799568] INFO -- : [568/885] 1840539=test_signal I, [2024-05-17T19:32:42.367574 #1799568] INFO -- : [569/885] 1840539=test_fixnum I, [2024-05-17T19:32:42.388899 #1799568] INFO -- : [570/885] 1840539=test_io_wait_uncommon I, [2024-05-17T19:32:42.408663 #1799568] INFO -- : [571/885] 1840539=test_https I, [2024-05-17T19:32:42.611758 #1799568] INFO -- : [572/885] 1840539=test_gem_commands_info_command I, [2024-05-17T19:32:42.635696 #1799568] INFO -- : [573/885] 1840539=test_object_create_start I, [2024-05-17T19:32:42.644837 #1799568] INFO -- : [574/885] 1840539=test_rdoc_markup_to_ansi I, [2024-05-17T19:32:42.685306 #1799568] INFO -- : [575/885] 1840539=test_protocol I, [2024-05-17T19:32:42.995029 #1799568] INFO -- : [576/885] 1840539=test_evaluation I, [2024-05-17T19:32:43.002111 #1799568] INFO -- : [577/885] 1840539=test_weakkeymap I, [2024-05-17T19:32:43.407778 #1799568] INFO -- : [578/885] 1840539=test_files_test I, [2024-05-17T19:32:43.416172 #1799568] INFO -- : [579/885] 1840539=test_name_error_extension I, [2024-05-17T19:32:43.429527 #1799568] INFO -- : [580/885] 1840539=test_gem_request_set_gem_dependency_api I, [2024-05-17T19:32:43.710443 #1799568] INFO -- : [581/885] 1840539=test_require_path_check I, [2024-05-17T19:32:43.865815 #1799568] INFO -- : [582/885] 1840539=test_bn I, [2024-05-17T19:32:43.890817 #1799568] INFO -- : [583/885] 1840539=test_variable_name_check I, [2024-05-17T19:32:43.993472 #1799568] INFO -- : [584/885] 1840539=test_irb I, [2024-05-17T19:32:44.258723 #1799568] INFO -- : [585/885] 1840539=test_rdoc_markup_paragraph I, [2024-05-17T19:32:44.277129 #1799568] INFO -- : [586/885] 1840539=test_x509cert I, [2024-05-17T19:32:44.412604 #1799568] INFO -- : [587/885] 1840539=test_ast I, [2024-05-17T19:32:48.007790 #1799568] INFO -- : [588/885] 1840540=test_logdevice I, [2024-05-17T19:32:48.908663 #1799568] INFO -- : [589/885] 1840540=test_lazy_enumerator I, [2024-05-17T19:32:49.364826 #1799568] INFO -- : [590/885] 1840540=test_cgi_multipart I, [2024-05-17T19:32:49.471126 #1799568] INFO -- : [591/885] 1840540=test_gem_request_set_lockfile_tokenizer I, [2024-05-17T19:32:49.539198 #1799568] INFO -- : [592/885] 1840540=test_find_executable I, [2024-05-17T19:32:49.549779 #1799568] INFO -- : [593/885] 1840540=test_ractor_compatibility I, [2024-05-17T19:32:49.903936 #1799568] INFO -- : [594/885] 1840540=test_arithmetic_sequence I, [2024-05-17T19:32:49.911225 #1799568] INFO -- : [595/885] 1840540=integer_parse_test I, [2024-05-17T19:32:49.917296 #1799568] INFO -- : [596/885] 1840540=test_autoconf I, [2024-05-17T19:32:49.922546 #1799568] INFO -- : [597/885] 1840540=test_sockopt I, [2024-05-17T19:32:49.927325 #1799568] INFO -- : [598/885] 1840540=test_ftp I, [2024-05-17T19:32:49.937347 #1799568] INFO -- : [599/885] 1840540=test_encoding I, [2024-05-17T19:32:50.007366 #1799568] INFO -- : [600/885] 1840540=test_install I, [2024-05-17T19:32:50.134839 #1799568] INFO -- : [601/885] 1840540=test_rdoc_comment I, [2024-05-17T19:32:50.179345 #1799568] INFO -- : [602/885] 1840540=test_gem_source_fetch_problem I, [2024-05-17T19:32:50.206583 #1799568] INFO -- : [603/885] 1840540=test_pair I, [2024-05-17T19:32:55.426732 #1799568] INFO -- : [604/885] 1840540=test_win32ole_variant_m I, [2024-05-17T19:32:55.443889 #1799568] INFO -- : [605/885] 1840540=test_gem_commands_signout_command I, [2024-05-17T19:32:55.486885 #1799568] INFO -- : [606/885] 1840540=test_gem_package_tar_reader I, [2024-05-17T19:32:55.532884 #1799568] INFO -- : [607/885] 1840540=test_env I, [2024-05-17T19:32:58.129498 #1799568] INFO -- : [608/885] 1840540=command_line_test I, [2024-05-17T19:32:58.131427 #1799568] INFO -- : [609/885] 1840540=test_singleton_function I, [2024-05-17T19:32:58.135982 #1799568] INFO -- : [610/885] 1840540=test_eval I, [2024-05-17T19:32:58.141653 #1799568] INFO -- : [611/885] 1840540=test_document I, [2024-05-17T19:32:58.147833 #1799568] INFO -- : [612/885] 1840540=test_gem_safe_yaml I, [2024-05-17T19:32:58.163357 #1799568] INFO -- : [613/885] 1840540=test_gem_commands_setup_command I, [2024-05-17T19:32:58.992696 #1799568] INFO -- : [614/885] 1840541=test_history I, [2024-05-17T19:32:59.024024 #1799568] INFO -- : [615/885] 1840541=test_iseq I, [2024-05-17T19:32:59.112532 #1799568] INFO -- : [616/885] 1840540=test_parser I, [2024-05-17T19:32:59.136735 #1799568] INFO -- : [617/885] 1840540=test_rdoc_ri_paths I, [2024-05-17T19:32:59.177400 #1799568] INFO -- : [618/885] 1840540=test_primitive I, [2024-05-17T19:32:59.186626 #1799568] INFO -- : [619/885] 1840540=test_ripper I, [2024-05-17T19:32:59.545875 #1799568] INFO -- : [620/885] 1840540=test_gem_source_git I, [2024-05-17T19:32:59.575372 #1799568] INFO -- : [621/885] 1840541=test_win32ole_method I, [2024-05-17T19:32:59.579817 #1799568] INFO -- : [622/885] 1840541=test_lexer I, [2024-05-17T19:32:59.599204 #1799568] INFO -- : [623/885] 1840541=test_regex_casefold I, [2024-05-17T19:33:00.065263 #1799568] INFO -- : [624/885] 1840541=test_random I, [2024-05-17T19:33:00.096833 #1799568] INFO -- : [625/885] 1840541=test_files_ext I, [2024-05-17T19:33:00.195673 #1799568] INFO -- : [626/885] 1840541=test_assembler I, [2024-05-17T19:33:00.207049 #1799568] INFO -- : [627/885] 1840541=test_stringio I, [2024-05-17T19:33:00.314767 #1799568] INFO -- : [628/885] 1840541=test_thread_cv I, [2024-05-17T19:33:00.517356 #1799568] INFO -- : [629/885] 1840540=test_unicode I, [2024-05-17T19:33:00.534718 #1799568] INFO -- : [630/885] 1840540=test_eval_history I, [2024-05-17T19:33:00.546649 #1799568] INFO -- : [631/885] 1840540=dispatcher_test I, [2024-05-17T19:33:00.561995 #1799568] INFO -- : [632/885] 1840540=test_autoload I, [2024-05-17T19:33:00.964043 #1799568] INFO -- : [633/885] 1840541=test_array I, [2024-05-17T19:33:04.945063 #1799568] INFO -- : [634/885] 1840540=test_gem_package I, [2024-05-17T19:33:05.729524 #1799568] INFO -- : [635/885] 1840540=test_benchmark I, [2024-05-17T19:33:07.303429 #1799568] INFO -- : [636/885] 1840540=test_at_exit I, [2024-05-17T19:33:07.308707 #1799568] INFO -- : [637/885] 1840540=test_class I, [2024-05-17T19:33:07.323717 #1799568] INFO -- : [638/885] 1840540=test_have_macro I, [2024-05-17T19:33:07.718396 #1799568] INFO -- : [639/885] 1840540=test_gem_source I, [2024-05-17T19:33:08.081296 #1799568] INFO -- : [640/885] 1840540=test_mkmf I, [2024-05-17T19:33:08.117994 #1799568] INFO -- : [641/885] 1840540=test_omap I, [2024-05-17T19:33:08.132192 #1799568] INFO -- : [642/885] 1840540=test_date_strptime I, [2024-05-17T19:33:08.271172 #1799568] INFO -- : [643/885] 1840540=test_scanner_events I, [2024-05-17T19:33:08.316439 #1799568] INFO -- : [644/885] 1840540=test_ocsp I, [2024-05-17T19:33:08.412771 #1799568] INFO -- : [645/885] 1840540=test_ipaddr I, [2024-05-17T19:33:08.425451 #1799568] INFO -- : [646/885] 1840540=test_rdoc_generator_pot_po I, [2024-05-17T19:33:08.429799 #1799568] INFO -- : [647/885] 1840540=test_shellwords I, [2024-05-17T19:33:08.455402 #1799568] INFO -- : [648/885] 1840540=test_mul I, [2024-05-17T19:33:08.466513 #1799568] INFO -- : [649/885] 1840540=json_ext_parser_test I, [2024-05-17T19:33:08.484831 #1799568] INFO -- : [650/885] 1840540=test_gem_ext_configure_builder I, [2024-05-17T19:33:08.521281 #1799568] INFO -- : [651/885] 1840540=test_rdoc_parser_simple I, [2024-05-17T19:33:08.543625 #1799568] INFO -- : [652/885] 1840540=test_nonblock I, [2024-05-17T19:33:08.555763 #1799568] INFO -- : [653/885] 1840540=test_cmethod I, [2024-05-17T19:33:08.589144 #1799568] INFO -- : [654/885] 1840540=test_float I, [2024-05-17T19:33:10.400134 #1799568] INFO -- : [655/885] 1840540=test_gem_stub_specification I, [2024-05-17T19:33:10.595264 #1799568] INFO -- : [656/885] 1840540=test_io_m17n I, [2024-05-17T19:33:11.916115 #1799568] INFO -- : [657/885] 1840540=test_rdoc_top_level I, [2024-05-17T19:33:12.190552 #1799568] INFO -- : [658/885] 1840540=test_color I, [2024-05-17T19:33:12.279363 #1799568] INFO -- : [659/885] 1840540=test_gem_commands_lock_command I, [2024-05-17T19:33:12.305485 #1799568] INFO -- : [660/885] 1840540=test_reline_key I, [2024-05-17T19:33:12.314036 #1799568] INFO -- : [661/885] 1840540=test_propertyputref I, [2024-05-17T19:33:12.315792 #1799568] INFO -- : [662/885] 1840540=test_gb18030 I, [2024-05-17T19:33:12.328186 #1799568] INFO -- : [663/885] 1840540=test_gem_stream_ui I, [2024-05-17T19:33:12.438949 #1799568] INFO -- : [664/885] 1840540=test_rdoc_generator_ri I, [2024-05-17T19:33:12.455408 #1799568] INFO -- : [665/885] 1840540=test_unicode_normalize I, [2024-05-17T19:33:15.272839 #1799568] INFO -- : [666/885] 1840541=test_closure I, [2024-05-17T19:33:16.598806 #1799568] INFO -- : [667/885] 1840540=test_rubygems I, [2024-05-17T19:33:16.755117 #1799568] INFO -- : [668/885] 1840540=test_resolve_symbol I, [2024-05-17T19:33:16.808417 #1799568] INFO -- : [669/885] 1840540=test_files_test_1 I, [2024-05-17T19:33:16.817612 #1799568] INFO -- : [670/885] 1840540=test_dir I, [2024-05-17T19:33:17.174182 #1799568] INFO -- : [671/885] 1840540=test_rdoc_rd_inline I, [2024-05-17T19:33:17.180203 #1799568] INFO -- : [672/885] 1840540=test_path I, [2024-05-17T19:33:17.197741 #1799568] INFO -- : [673/885] 1840540=test_digest I, [2024-05-17T19:33:17.209086 #1799568] INFO -- : [674/885] 1840540=test_uncorrectable_name_check I, [2024-05-17T19:33:17.237318 #1799568] INFO -- : [675/885] 1840540=test_io I, [2024-05-17T19:33:18.196615 #1799568] INFO -- : [676/885] 1840541=test_workspace I, [2024-05-17T19:33:18.320876 #1799568] INFO -- : [677/885] 1840541=test_x509attr I, [2024-05-17T19:33:18.331739 #1799568] INFO -- : [678/885] 1840541=test_printf I, [2024-05-17T19:33:18.350322 #1799568] INFO -- : [679/885] 1840541=magic_comment_test I, [2024-05-17T19:33:18.357099 #1799568] INFO -- : [680/885] 1840541=test_win32ole_variant I, [2024-05-17T19:33:18.363677 #1799568] INFO -- : [681/885] 1840541=test_cgi_modruby I, [2024-05-17T19:33:18.375492 #1799568] INFO -- : [682/885] 1840541=test_https_proxy I, [2024-05-17T19:33:18.377736 #1799568] INFO -- : [683/885] 1840541=test_rdoc_parser I, [2024-05-17T19:33:18.410519 #1799568] INFO -- : [684/885] 1840541=test_win32ole_param_event I, [2024-05-17T19:33:18.417447 #1799568] INFO -- : [685/885] 1840541=test_stat I, [2024-05-17T19:33:18.425113 #1799568] INFO -- : [686/885] 1840541=test_gem_commands_rebuild_command I, [2024-05-17T19:33:18.529012 #1799568] INFO -- : [687/885] 1840541=test_nomethod_error I, [2024-05-17T19:33:18.536589 #1799568] INFO -- : [688/885] 1840541=test_etc I, [2024-05-17T19:33:18.637276 #1799568] INFO -- : [689/885] 1840541=test_gem_console_ui I, [2024-05-17T19:33:18.641202 #1799568] INFO -- : [690/885] 1840541=test_allocation I, [2024-05-17T19:33:20.927117 #1799568] INFO -- : [691/885] 1840541=test_ifunless I, [2024-05-17T19:33:20.934536 #1799568] INFO -- : [692/885] 1840541=test_insns_leaf I, [2024-05-17T19:33:20.938592 #1799568] INFO -- : [693/885] 1840541=test_httpresponse I, [2024-05-17T19:33:20.994230 #1799568] INFO -- : [694/885] 1840541=test_rdoc_parser_ruby I, [2024-05-17T19:33:22.171642 #1799568] INFO -- : [695/885] 1840541=test_readpartial I, [2024-05-17T19:33:22.573548 #1799568] INFO -- : [696/885] 1840541=test_x509req I, [2024-05-17T19:33:22.607379 #1799568] INFO -- : [697/885] 1840541=test_object I, [2024-05-17T19:33:22.920446 #1799568] INFO -- : [698/885] 1840541=test_dln I, [2024-05-17T19:33:22.945181 #1799568] INFO -- : [699/885] 1840541=test_gem_resolver I, [2024-05-17T19:33:23.308929 #1799568] INFO -- : [700/885] 1840541=test_gem_source_vendor I, [2024-05-17T19:33:23.323949 #1799568] INFO -- : [701/885] 1840541=test_color_printer I, [2024-05-17T19:33:23.335933 #1799568] INFO -- : [702/885] 1840541=test_super I, [2024-05-17T19:33:25.375974 #1799568] INFO -- : [703/885] 1840541=unescape_test I, [2024-05-17T19:33:26.708502 #1799568] INFO -- : [704/885] 1840541=test_gem_commands_exec_command I, [2024-05-17T19:33:28.210191 #1799568] INFO -- : [705/885] 1840541=errors_test I, [2024-05-17T19:33:28.727827 #1799568] INFO -- : [706/885] 1840541=test_convertible I, [2024-05-17T19:33:30.440394 #1799568] INFO -- : [707/885] 1840539=test_modify_expand I, [2024-05-17T19:33:30.442294 #1799568] INFO -- : [708/885] 1840539=test_pkg_config I, [2024-05-17T19:33:30.472064 #1799568] INFO -- : [709/885] 1840539=test_gem_available_set I, [2024-05-17T19:33:30.550041 #1799568] INFO -- : [710/885] 1840539=test_vm_dump I, [2024-05-17T19:33:30.556530 #1799568] INFO -- : [711/885] 1840539=json_encoding_test I, [2024-05-17T19:33:30.565591 #1799568] INFO -- : [712/885] 1840539=test_func I, [2024-05-17T19:33:30.690858 #1799568] INFO -- : [713/885] 1840540=test_config I, [2024-05-17T19:33:30.723854 #1799568] INFO -- : [714/885] 1840540=test_helper I, [2024-05-17T19:33:30.729059 #1799568] INFO -- : [715/885] 1840540=test_compile_prism I, [2024-05-17T19:33:31.245244 #1799568] INFO -- : [716/885] 1840540=test_gem_commands_uninstall_command I, [2024-05-17T19:33:31.931563 #1799568] INFO -- : [717/885] 1840541=test_rdoc_markup_formatter I, [2024-05-17T19:33:31.941386 #1799568] INFO -- : [718/885] 1840541=test_win32ole_event I, [2024-05-17T19:33:31.955021 #1799568] INFO -- : [719/885] 1840541=test_thread_fd_close I, [2024-05-17T19:33:31.960879 #1799568] INFO -- : [720/885] 1840541=test_last_thread I, [2024-05-17T19:33:31.974554 #1799568] INFO -- : [721/885] 1840540=test_digest_extend I, [2024-05-17T19:33:32.017749 #1799568] INFO -- : [722/885] 1840540=test_gem_ext_cmake_builder I, [2024-05-17T19:33:32.026657 #1799568] INFO -- : [723/885] 1840540=test_emitter I, [2024-05-17T19:33:32.035307 #1799568] INFO -- : [724/885] 1840540=test_alias I, [2024-05-17T19:33:32.254044 #1799568] INFO -- : [725/885] 1840540=test_fips I, [2024-05-17T19:33:32.445077 #1799568] INFO -- : [726/885] 1840540=test_getopts I, [2024-05-17T19:33:32.454401 #1799568] INFO -- : [727/885] 1840540=test_profile_frames I, [2024-05-17T19:33:32.625290 #1799568] INFO -- : [728/885] 1840540=test_pattern_key_name_check I, [2024-05-17T19:33:32.637665 #1799568] INFO -- : [729/885] 1840540=test_class2name I, [2024-05-17T19:33:32.677083 #1799568] INFO -- : [730/885] 1840540=test_gem_commands_cleanup_command I, [2024-05-17T19:33:33.026643 #1799568] INFO -- : [731/885] 1840541=test_debug I, [2024-05-17T19:33:33.049228 #1799568] INFO -- : [732/885] 1840541=test_transcode I, [2024-05-17T19:33:33.242727 #1799568] INFO -- : [733/885] 1840541=test_refinement I, [2024-05-17T19:33:33.265452 #1799568] INFO -- : [734/885] 1840540=test_x509crl I, [2024-05-17T19:33:33.367422 #1799568] INFO -- : [735/885] 1840540=test_dns I, [2024-05-17T19:33:33.838957 #1799568] INFO -- : [736/885] 1840540=test_notimplement I, [2024-05-17T19:33:33.852272 #1799568] INFO -- : [737/885] 1840540=test_cgi_session I, [2024-05-17T19:33:33.906840 #1799568] INFO -- : [738/885] 1840540=test_c_union_entity I, [2024-05-17T19:33:34.172225 #1799568] INFO -- : [739/885] 1840540=test_io_console I, [2024-05-17T19:33:35.205066 #1799568] INFO -- : [740/885] 1840539=test_flip I, [2024-05-17T19:33:35.232639 #1799568] INFO -- : [741/885] 1840539=test_rdoc_markup_heading I, [2024-05-17T19:33:35.243130 #1799568] INFO -- : [742/885] 1840539=test_x509ext I, [2024-05-17T19:33:35.251206 #1799568] INFO -- : [743/885] 1840539=test_emitter I, [2024-05-17T19:33:35.260272 #1799568] INFO -- : [744/885] 1840539=bom_test I, [2024-05-17T19:33:35.308521 #1799568] INFO -- : [745/885] 1840539=test_summary I, [2024-05-17T19:33:35.334877 #1799568] INFO -- : [746/885] 1840539=test_helper_method I, [2024-05-17T19:33:35.419611 #1799568] INFO -- : [747/885] 1840539=test_config I, [2024-05-17T19:33:35.730823 #1799568] INFO -- : [748/885] 1840539=test_file I, [2024-05-17T19:33:36.793282 #1799568] INFO -- : [749/885] 1840540=test_append I, [2024-05-17T19:33:36.799508 #1799568] INFO -- : [750/885] 1840540=test_gem_resolver_installer_set I, [2024-05-17T19:33:37.015072 #1799568] INFO -- : [751/885] 1840541=test_rdoc_markup_to_html I, [2024-05-17T19:33:37.031682 #1799568] INFO -- : [752/885] 1840540=test_foreach I, [2024-05-17T19:33:37.039690 #1799568] INFO -- : [753/885] 1840540=test_trace I, [2024-05-17T19:33:37.051479 #1799568] INFO -- : [754/885] 1840540=test_keyword I, [2024-05-17T19:33:37.123483 #1799568] INFO -- : [755/885] 1840541=test_win32ole_type_event I, [2024-05-17T19:33:37.157307 #1799568] INFO -- : [756/885] 1840541=test_arity I, [2024-05-17T19:33:37.192521 #1799568] INFO -- : [757/885] 1840541=test_gem_path_support I, [2024-05-17T19:33:37.225371 #1799568] INFO -- : [758/885] 1840541=test_rb_str_dup I, [2024-05-17T19:33:37.234946 #1799568] INFO -- : [759/885] 1840541=test_lambda I, [2024-05-17T19:33:37.296887 #1799568] INFO -- : [760/885] 1840541=test_scalar_scanner I, [2024-05-17T19:33:37.312662 #1799568] INFO -- : [761/885] 1840541=test_eval I, [2024-05-17T19:33:37.555113 #1799568] INFO -- : [762/885] 1840541=test_monitor I, [2024-05-17T19:33:37.563388 #1799568] INFO -- : [763/885] 1840540=test_beginendblock I, [2024-05-17T19:33:37.784962 #1799568] INFO -- : [764/885] 1840541=test_pointer I, [2024-05-17T19:33:37.889030 #1799568] INFO -- : [765/885] 1840540=test_rdoc_normal_class I, [2024-05-17T19:33:37.987463 #1799568] INFO -- : [766/885] 1840540=test_within_pipe I, [2024-05-17T19:33:38.038476 #1799568] INFO -- : [767/885] 1840540=test_nofree I, [2024-05-17T19:33:38.053768 #1799568] INFO -- : [768/885] 1840540=test_regexp I, [2024-05-17T19:33:39.898679 #1799568] INFO -- : [769/885] 1840541=test_whileuntil I, [2024-05-17T19:33:39.906987 #1799568] INFO -- : [770/885] 1840541=test_buffered_io I, [2024-05-17T19:33:39.978015 #1799568] INFO -- : [771/885] 1840541=test_ossl I, [2024-05-17T19:33:41.998998 #1799568] INFO -- : [772/885] 1840539=test_gem_installer I, [2024-05-17T19:33:47.055855 #1799568] INFO -- : [773/885] 1840539=test_bug_reporter I, [2024-05-17T19:33:47.105804 #1799568] INFO -- : [774/885] 1840539=test_gem_source_subpath_problem I, [2024-05-17T19:33:47.200319 #1799568] INFO -- : [775/885] 1840539=test_object_references I, [2024-05-17T19:33:47.213368 #1799568] INFO -- : [776/885] 1840539=test_ruby_lex I, [2024-05-17T19:33:47.343218 #1799568] INFO -- : [777/885] 1840539=compiler_test I, [2024-05-17T19:33:47.404698 #1799568] INFO -- : [778/885] 1840539=test_arith_seq_extract I, [2024-05-17T19:33:47.518617 #1799568] INFO -- : [779/885] 1840539=test_duplicate I, [2024-05-17T19:33:47.534065 #1799568] INFO -- : [780/885] 1840539=test_gem_resolver_api_set I, [2024-05-17T19:33:47.600030 #1799568] INFO -- : [781/885] 1840539=test_helper I, [2024-05-17T19:33:47.610990 #1799568] INFO -- : [782/885] 1840539=test_member I, [2024-05-17T19:33:47.619499 #1799568] INFO -- : [783/885] 1840539=test_object I, [2024-05-17T19:33:47.630105 #1799568] INFO -- : [784/885] 1840539=test_addr I, [2024-05-17T19:33:47.640179 #1799568] INFO -- : [785/885] 1840539=test_mailto I, [2024-05-17T19:33:47.645490 #1799568] INFO -- : [786/885] 1840541=test_kill_ring I, [2024-05-17T19:33:47.650871 #1799568] INFO -- : [787/885] 1840539=test_case_options I, [2024-05-17T19:33:47.658564 #1799568] INFO -- : [788/885] 1840541=test_cgi_header I, [2024-05-17T19:33:47.660290 #1799568] INFO -- : [789/885] 1840539=format_errors_test I, [2024-05-17T19:33:47.668291 #1799568] INFO -- : [790/885] 1840541=test_windows_1251 I, [2024-05-17T19:33:47.669962 #1799568] INFO -- : [791/885] 1840539=test_to_ary_concat I, [2024-05-17T19:33:47.682647 #1799568] INFO -- : [792/885] 1840541=test_history I, [2024-05-17T19:33:47.707578 #1799568] INFO -- : [793/885] 1840541=test_gem_ext_builder I, [2024-05-17T19:33:48.786787 #1799568] INFO -- : [794/885] 1840541=test_reline I, [2024-05-17T19:33:49.062630 #1799568] INFO -- : [795/885] 1840541=test_ellipsize I, [2024-05-17T19:33:49.092554 #1799568] INFO -- : [796/885] 1840541=test_call I, [2024-05-17T19:33:49.306588 #1799568] INFO -- : [797/885] 1840541=test_gem_commands_build_command I, [2024-05-17T19:33:49.775769 #1799568] INFO -- : [798/885] 1840541=test_bug-14834 I, [2024-05-17T19:33:49.784924 #1799568] INFO -- : [799/885] 1840541=test_data I, [2024-05-17T19:33:49.802838 #1799568] INFO -- : [800/885] 1840541=test_thread I, [2024-05-17T19:33:51.653201 #1799568] INFO -- : [801/885] 1840539=test_inlinecache I, [2024-05-17T19:33:51.731578 #1799568] INFO -- : [802/885] 1840539=test_socket I, [2024-05-17T19:33:52.666572 #1799568] INFO -- : [803/885] 1840539=test_terminfo I, [2024-05-17T19:33:52.699020 #1799568] INFO -- : [804/885] 1840539=test_time_tz I, [2024-05-17T19:33:52.807105 #1799568] INFO -- : [805/885] 1840539=test_to_ruby I, [2024-05-17T19:33:52.825078 #1799568] INFO -- : [806/885] 1840539=test_addrinfo I, [2024-05-17T19:33:52.866867 #1799568] INFO -- : [807/885] 1840539=test_gem_resolver_index_set I, [2024-05-17T19:33:52.904434 #1799568] INFO -- : [808/885] 1840539=ruby_api_test I, [2024-05-17T19:33:53.037900 #1799568] INFO -- : [809/885] 1840539=test_webauthn_listener_response I, [2024-05-17T19:33:55.774203 #1799568] INFO -- : [810/885] 1840539=test_sleep I, [2024-05-17T19:33:58.086572 #1799568] INFO -- : [811/885] 1840539=test_pattern_matching I, [2024-05-17T19:33:58.109736 #1799568] INFO -- : [812/885] 1840539=test_set_len I, [2024-05-17T19:33:58.116919 #1799568] INFO -- : [813/885] 1840539=constant_path_node_test I, [2024-05-17T19:33:58.126424 #1799568] INFO -- : [814/885] 1840539=test_interned_str I, [2024-05-17T19:33:58.131701 #1799568] INFO -- : [815/885] 1840539=test_folderitem2_invokeverb I, [2024-05-17T19:33:58.142442 #1799568] INFO -- : [816/885] 1840539=test_gem_bundler_version_finder I, [2024-05-17T19:33:58.197363 #1799568] INFO -- : [817/885] 1840539=test_gem_request_set I, [2024-05-17T19:33:58.562811 #1799568] INFO -- : [818/885] 1840541=test_gc I, [2024-05-17T19:33:58.746410 #1799568] INFO -- : [819/885] 1840539=test_symbol I, [2024-05-17T19:33:58.856794 #1799568] INFO -- : [820/885] 1840539=test_project_sanity I, [2024-05-17T19:33:58.868697 #1799568] INFO -- : [821/885] 1840539=test_delegate I, [2024-05-17T19:33:58.881201 #1799568] INFO -- : [822/885] 1840539=test_chilled I, [2024-05-17T19:33:58.893758 #1799568] INFO -- : [823/885] 1840539=location_test I, [2024-05-17T19:33:58.934455 #1799568] INFO -- : [824/885] 1840539=test_euc_jp I, [2024-05-17T19:33:58.952251 #1799568] INFO -- : [825/885] 1840539=test_key_stroke I, [2024-05-17T19:33:58.962792 #1799568] INFO -- : [826/885] 1840539=test_rdoc_markup I, [2024-05-17T19:33:59.035195 #1799568] INFO -- : [827/885] 1840539=test_ensured I, [2024-05-17T19:33:59.046806 #1799568] INFO -- : [828/885] 1840539=test_time I, [2024-05-17T19:33:59.266808 #1799568] INFO -- : [829/885] 1840539=test_popen_deadlock I, [2024-05-17T19:33:59.792436 #1799568] INFO -- : [830/885] 1840539=test_alias_and_anchor I, [2024-05-17T19:33:59.805742 #1799568] INFO -- : [831/885] 1840539=test_num2int I, [2024-05-17T19:33:59.816423 #1799568] INFO -- : [832/885] 1840539=test_rbconfig I, [2024-05-17T19:33:59.823707 #1799568] INFO -- : [833/885] 1840539=test_recursion I, [2024-05-17T19:33:59.863049 #1799568] INFO -- : [834/885] 1840539=test_require I, [2024-05-17T19:34:01.228140 #1799568] INFO -- : [835/885] 1840539=test_enum I, [2024-05-17T19:34:02.204379 #1799568] INFO -- : [836/885] 1840539=test_rdoc_markup_include I, [2024-05-17T19:34:02.211344 #1799568] INFO -- : [837/885] 1840539=test_iter_break I, [2024-05-17T19:34:02.216766 #1799568] INFO -- : [838/885] 1840539=test_extlibs I, [2024-05-17T19:34:03.801673 #1799568] INFO -- : [839/885] 1840539=test_gem_commands_signin_command I, [2024-05-17T19:34:04.018173 #1799568] INFO -- : [840/885] 1840539=test_range I, [2024-05-17T19:34:04.801818 #1799568] INFO -- : [841/885] 1840539=test_rdoc_attr I, [2024-05-17T19:34:04.819237 #1799568] INFO -- : [842/885] 1840539=test_address_resolve I, [2024-05-17T19:34:04.846826 #1799568] INFO -- : [843/885] 1840539=test_trick I, [2024-05-17T19:34:07.400696 #1799568] INFO -- : [844/885] 1840539=test_ractor I, [2024-05-17T19:34:07.402575 #1799568] INFO -- : [845/885] 1840539=test_stream I, [2024-05-17T19:34:07.503135 #1799568] INFO -- : [846/885] 1840539=test_ts I, [2024-05-17T19:34:07.791365 #1799568] INFO -- : [847/885] 1840539=test_locale I, [2024-05-17T19:34:07.992587 #1799568] INFO -- : [848/885] 1840539=test_have_func I, [2024-05-17T19:34:09.094427 #1799568] INFO -- : [849/885] 1840539=test_date_marshal I, [2024-05-17T19:34:09.104267 #1799568] INFO -- : [850/885] 1840539=test_configuration I, [2024-05-17T19:34:09.205020 #1799568] INFO -- : [851/885] 1840539=test_gem_resolver_local_specification I, [2024-05-17T19:34:09.241464 #1799568] INFO -- : [852/885] 1840539=test_gem_commands_list_command I, [2024-05-17T19:34:09.254279 #1799568] INFO -- : [853/885] 1840539=test_date_new I, [2024-05-17T19:34:09.265405 #1799568] INFO -- : [854/885] 1840539=test_formatter I, [2024-05-17T19:34:09.280399 #1799568] INFO -- : [855/885] 1840539=test_context I, [2024-05-17T19:34:09.378751 #1799568] INFO -- : [856/885] 1840539=test_udp I, [2024-05-17T19:34:09.397518 #1799568] INFO -- : [857/885] 1840539=test_gem_commands_contents_command I, [2024-05-17T19:34:09.498781 #1799568] INFO -- : [858/885] 1840539=test_rdoc_servlet I, [2024-05-17T19:34:09.507839 #1799568] INFO -- : [859/885] 1840541=test_coder I, [2024-05-17T19:34:09.524302 #1799568] INFO -- : [860/885] 1840541=test_symbol I, [2024-05-17T19:34:09.619409 #1799568] INFO -- : [861/885] 1840539=test_gem_commands_search_command I, [2024-05-17T19:34:09.637322 #1799568] INFO -- : [862/885] 1840539=test_unix I, [2024-05-17T19:34:09.675358 #1799568] INFO -- : [863/885] 1840539=test_integer I, [2024-05-17T19:34:12.422320 #1799568] INFO -- : [864/885] 1840539=test_bignum I, [2024-05-17T19:34:15.857559 #1799568] INFO -- : [865/885] 1840540=newline_test I, [2024-05-17T19:34:16.002721 #1799568] INFO -- : [866/885] 1840540=test_enc_str_buf_cat I, [2024-05-17T19:34:16.033520 #1799568] INFO -- : [867/885] 1840540=test_marshal I, [2024-05-17T19:34:16.052595 #1799568] INFO -- : [868/885] 1840539=test_ancdata I, [2024-05-17T19:34:16.084729 #1799568] INFO -- : [869/885] 1840539=ractor_test I, [2024-05-17T19:34:16.141188 #1799568] INFO -- : [870/885] 1840539=test_nesting_parser I, [2024-05-17T19:34:16.147879 #1799568] INFO -- : [871/885] 1840539=test_rdoc_markup_hard_break I, [2024-05-17T19:34:16.247698 #1799568] INFO -- : [872/885] 1840539=test_ractor I, [2024-05-17T19:34:16.503441 #1799568] INFO -- : [873/885] 1840539=test_gem_resolver_conflict I, [2024-05-17T19:34:16.534178 #1799568] INFO -- : [874/885] 1840539=test_gem_commands_help_command I, [2024-05-17T19:34:16.594028 #1799568] INFO -- : [875/885] 1840539=test_scheduler I, [2024-05-17T19:34:16.795853 #1799568] INFO -- : [876/885] 1840539=test_ssl I, [2024-05-17T19:34:16.899782 #1799568] INFO -- : [877/885] 1840539=test_gem I, [2024-05-17T19:34:17.077087 #1799568] INFO -- : [878/885] 1840541=test_registry I, [2024-05-17T19:34:17.091708 #1799568] INFO -- : [879/885] 1840541=test_ractor I, [2024-05-17T19:34:17.104774 #1799568] INFO -- : [880/885] 1840541=json_generator_test I, [2024-05-17T19:34:17.204907 #1799568] INFO -- : [881/885] 1840541=test_ansi_without_terminfo I, [2024-05-17T19:34:17.215537 #1799568] INFO -- : [882/885] 1840541=test_rdoc_markup_to_label I, [2024-05-17T19:34:17.344968 #1799568] INFO -- : [883/885] 1840541=test_parser I, [2024-05-17T19:34:17.361338 #1799568] INFO -- : [884/885] 1840541=test_cgi_core I, [2024-05-17T19:34:17.376354 #1799568] INFO -- : [885/885] 1840541=test_gem_resolver_best_set I, [2024-05-17T19:34:19.023428 #1799568] INFO -- : Leaked file descriptor: TestGem#test_self_clear_paths: 11 # I, [2024-05-17T19:34:19.053532 #1799568] INFO -- : COMMAND PID USER FD TYPE DEVICE SIZE/OFF NODE NAME I, [2024-05-17T19:34:19.053594 #1799568] INFO -- : ruby 1840539 opc 11r REG 252,0 9253600 13705411 /var/lib/sss/mc/passwd I, [2024-05-17T19:34:19.136530 #1799568] INFO -- : Finished tests in 198.376858s, 132.6768 tests/s, 47131.9592 assertions/s. I, [2024-05-17T19:34:19.141195 #1799568] INFO -- : 26320 tests, 9349890 assertions, 0 failures, 0 errors, 320 skips I, [2024-05-17T19:34:19.141224 #1799568] INFO -- : I, [2024-05-17T19:34:19.141235 #1799568] INFO -- : ruby -v: ruby 3.4.0dev (2024-05-17T15:29:00Z master e61d24d77e) [aarch64-linux] I, [2024-05-17T19:34:19.142045 #1799568] INFO -- : $$$[end] "make yes-test-all TESTOPTS='--stderr-on-failure' TESTS='-j3'" exit with 0. I, [2024-05-17T19:34:19.142191 #1799568] INFO -- : $$$[beg] make yes-test-rubyspec MSPECOPT='--error-output stderr --debug -j' TESTS='-j3' I, [2024-05-17T19:34:19.267382 #1799568] INFO -- : BASERUBY = /usr/local/bin/ruby --disable=gems I, [2024-05-17T19:34:19.267460 #1799568] INFO -- : CC = gcc I, [2024-05-17T19:34:19.267471 #1799568] INFO -- : LD = ld I, [2024-05-17T19:34:19.267482 #1799568] INFO -- : LDSHARED = gcc -shared I, [2024-05-17T19:34:19.267503 #1799568] INFO -- : CFLAGS = -O3 -fno-fast-math -ggdb3 -Wall -Wextra -Wdeprecated-declarations -Wdiv-by-zero -Wduplicated-cond -Wimplicit-function-declaration -Wimplicit-int -Wpointer-arith -Wwrite-strings -Wold-style-definition -Wimplicit-fallthrough=0 -Wmissing-noreturn -Wno-cast-function-type -Wno-constant-logical-operand -Wno-long-long -Wno-missing-field-initializers -Wno-overlength-strings -Wno-packed-bitfield-compat -Wno-parentheses-equality -Wno-self-assign -Wno-tautological-compare -Wno-unused-parameter -Wno-unused-value -Wsuggest-attribute=format -Wsuggest-attribute=noreturn -Wunused-variable -Wmisleading-indentation -Wundef I, [2024-05-17T19:34:19.267521 #1799568] INFO -- : XCFLAGS = -U_FORTIFY_SOURCE -D_FORTIFY_SOURCE=2 -fstack-protector-strong -msign-return-address=all -fno-strict-overflow -fvisibility=hidden -fexcess-precision=standard -DRUBY_EXPORT -fPIE -I. -I.ext/include/aarch64-linux -I/home/opc/ruby/src/master/include -I/home/opc/ruby/src/master -I/home/opc/ruby/src/master/prism -I/home/opc/ruby/src/master/enc/unicode/15.0.0 I, [2024-05-17T19:34:19.267538 #1799568] INFO -- : CPPFLAGS = I, [2024-05-17T19:34:19.267554 #1799568] INFO -- : DLDFLAGS = -Wl,--compress-debug-sections=zlib -fstack-protector-strong -pie I, [2024-05-17T19:34:19.267571 #1799568] INFO -- : SOLIBS = -lz -lrt -lrt -ldl -lcrypt -lm -lpthread I, [2024-05-17T19:34:19.267587 #1799568] INFO -- : LANG = en_US.UTF-8 I, [2024-05-17T19:34:19.267602 #1799568] INFO -- : LC_ALL = I, [2024-05-17T19:34:19.267617 #1799568] INFO -- : LC_CTYPE = I, [2024-05-17T19:34:19.267634 #1799568] INFO -- : MFLAGS = I, [2024-05-17T19:34:19.267649 #1799568] INFO -- : RUSTC = rustc I, [2024-05-17T19:34:19.267665 #1799568] INFO -- : YJIT_RUSTC_ARGS = --crate-name=yjit --crate-type=staticlib --edition=2021 -g -C lto=thin -C opt-level=3 -C overflow-checks=on '--out-dir=/home/opc/ruby/build/master/yjit/target/release/' /home/opc/ruby/src/master/yjit/src/lib.rs I, [2024-05-17T19:34:19.268295 #1799568] INFO -- : gcc (GCC) 8.5.0 20210514 (Red Hat 8.5.0-10.1.0.1) I, [2024-05-17T19:34:19.268311 #1799568] INFO -- : Copyright (C) 2018 Free Software Foundation, Inc. I, [2024-05-17T19:34:19.268320 #1799568] INFO -- : This is free software; see the source for copying conditions. There is NO I, [2024-05-17T19:34:19.268329 #1799568] INFO -- : warranty; not even for MERCHANTABILITY or FITNESS FOR A PARTICULAR PURPOSE. I, [2024-05-17T19:34:19.268337 #1799568] INFO -- : I, [2024-05-17T19:34:19.270428 #1799568] INFO -- : generating enc.mk I, [2024-05-17T19:34:19.502710 #1799568] INFO -- : generating encdb.h I, [2024-05-17T19:34:19.540209 #1799568] INFO -- : encdb.h unchanged I, [2024-05-17T19:34:19.541385 #1799568] INFO -- : making enc I, [2024-05-17T19:34:19.568919 #1799568] INFO -- : make[1]: Entering directory '/home/opc/ruby/build/master' I, [2024-05-17T19:34:19.568960 #1799568] INFO -- : make[1]: Nothing to be done for 'enc'. I, [2024-05-17T19:34:19.568971 #1799568] INFO -- : make[1]: Leaving directory '/home/opc/ruby/build/master' I, [2024-05-17T19:34:19.569683 #1799568] INFO -- : making srcs under enc I, [2024-05-17T19:34:19.611857 #1799568] INFO -- : make[1]: Entering directory '/home/opc/ruby/build/master' I, [2024-05-17T19:34:19.611898 #1799568] INFO -- : make[1]: Nothing to be done for 'srcs'. I, [2024-05-17T19:34:19.611908 #1799568] INFO -- : make[1]: Leaving directory '/home/opc/ruby/build/master' I, [2024-05-17T19:34:19.612948 #1799568] INFO -- : generating transdb.h I, [2024-05-17T19:34:19.758889 #1799568] INFO -- : transdb.h unchanged I, [2024-05-17T19:34:19.760189 #1799568] INFO -- : making trans I, [2024-05-17T19:34:19.809591 #1799568] INFO -- : make[1]: Entering directory '/home/opc/ruby/build/master' I, [2024-05-17T19:34:19.809644 #1799568] INFO -- : make[1]: Nothing to be done for 'trans'. I, [2024-05-17T19:34:19.809655 #1799568] INFO -- : make[1]: Leaving directory '/home/opc/ruby/build/master' I, [2024-05-17T19:34:19.810422 #1799568] INFO -- : making encs I, [2024-05-17T19:34:19.863518 #1799568] INFO -- : make[1]: Entering directory '/home/opc/ruby/build/master' I, [2024-05-17T19:34:19.863615 #1799568] INFO -- : make[1]: Nothing to be done for 'encs'. I, [2024-05-17T19:34:19.863643 #1799568] INFO -- : make[1]: Leaving directory '/home/opc/ruby/build/master' I, [2024-05-17T19:34:19.865576 #1799568] INFO -- : generating makefiles ext/configure-ext.mk I, [2024-05-17T19:34:19.905169 #1799568] INFO -- : ext/configure-ext.mk updated I, [2024-05-17T19:34:19.908361 #1799568] INFO -- : make[1]: Entering directory '/home/opc/ruby/build/master' I, [2024-05-17T19:34:21.985328 #1799568] INFO -- : make[1]: Leaving directory '/home/opc/ruby/build/master' I, [2024-05-17T19:34:21.986044 #1799568] INFO -- : generating makefile exts.mk I, [2024-05-17T19:34:22.045047 #1799568] INFO -- : exts.mk unchanged I, [2024-05-17T19:34:22.050030 #1799568] INFO -- : make[1]: Entering directory '/home/opc/ruby/build/master' I, [2024-05-17T19:34:22.347267 #1799568] INFO -- : make[2]: Entering directory '/home/opc/ruby/build/master/ext/coverage' I, [2024-05-17T19:34:22.351932 #1799568] INFO -- : make[2]: Leaving directory '/home/opc/ruby/build/master/ext/coverage' I, [2024-05-17T19:34:22.357519 #1799568] INFO -- : make[2]: Entering directory '/home/opc/ruby/build/master/ext/date' I, [2024-05-17T19:34:22.362658 #1799568] INFO -- : make[2]: Leaving directory '/home/opc/ruby/build/master/ext/date' I, [2024-05-17T19:34:22.365950 #1799568] INFO -- : make[2]: Entering directory '/home/opc/ruby/build/master/ext/digest' I, [2024-05-17T19:34:22.374942 #1799568] INFO -- : make[2]: Leaving directory '/home/opc/ruby/build/master/ext/digest' I, [2024-05-17T19:34:22.396864 #1799568] INFO -- : make[2]: Entering directory '/home/opc/ruby/build/master/ext/digest/sha2' I, [2024-05-17T19:34:22.401665 #1799568] INFO -- : make[2]: Leaving directory '/home/opc/ruby/build/master/ext/digest/sha2' I, [2024-05-17T19:34:22.419639 #1799568] INFO -- : make[2]: Entering directory '/home/opc/ruby/build/master/ext/fiddle' I, [2024-05-17T19:34:22.429691 #1799568] INFO -- : make[2]: Leaving directory '/home/opc/ruby/build/master/ext/fiddle' I, [2024-05-17T19:34:22.433983 #1799568] INFO -- : make[2]: Entering directory '/home/opc/ruby/build/master/ext/io/console' I, [2024-05-17T19:34:22.438192 #1799568] INFO -- : make[2]: Leaving directory '/home/opc/ruby/build/master/ext/io/console' I, [2024-05-17T19:34:22.448741 #1799568] INFO -- : make[2]: Entering directory '/home/opc/ruby/build/master/ext/json' I, [2024-05-17T19:34:22.458114 #1799568] INFO -- : make[2]: Leaving directory '/home/opc/ruby/build/master/ext/json' I, [2024-05-17T19:34:22.470920 #1799568] INFO -- : make[2]: Entering directory '/home/opc/ruby/build/master/ext/monitor' I, [2024-05-17T19:34:22.474993 #1799568] INFO -- : make[2]: Leaving directory '/home/opc/ruby/build/master/ext/monitor' I, [2024-05-17T19:34:22.481477 #1799568] INFO -- : make[2]: Entering directory '/home/opc/ruby/build/master/ext/objspace' I, [2024-05-17T19:34:22.487257 #1799568] INFO -- : make[2]: Leaving directory '/home/opc/ruby/build/master/ext/objspace' I, [2024-05-17T19:34:22.506366 #1799568] INFO -- : make[2]: Entering directory '/home/opc/ruby/build/master/ext/openssl' I, [2024-05-17T19:34:22.528008 #1799568] INFO -- : make[2]: Leaving directory '/home/opc/ruby/build/master/ext/openssl' I, [2024-05-17T19:34:22.532085 #1799568] INFO -- : make[2]: Entering directory '/home/opc/ruby/build/master/ext/pathname' I, [2024-05-17T19:34:22.536173 #1799568] INFO -- : make[2]: Leaving directory '/home/opc/ruby/build/master/ext/pathname' I, [2024-05-17T19:34:22.542415 #1799568] INFO -- : make[2]: Entering directory '/home/opc/ruby/build/master/ext/psych' I, [2024-05-17T19:34:22.563939 #1799568] INFO -- : make[2]: Leaving directory '/home/opc/ruby/build/master/ext/psych' I, [2024-05-17T19:34:22.568304 #1799568] INFO -- : make[2]: Entering directory '/home/opc/ruby/build/master/ext/pty' I, [2024-05-17T19:34:22.572355 #1799568] INFO -- : make[2]: Leaving directory '/home/opc/ruby/build/master/ext/pty' I, [2024-05-17T19:34:22.585940 #1799568] INFO -- : make[2]: Entering directory '/home/opc/ruby/build/master/ext/ripper' I, [2024-05-17T19:34:22.593658 #1799568] INFO -- : make[2]: Leaving directory '/home/opc/ruby/build/master/ext/ripper' I, [2024-05-17T19:34:22.595471 #1799568] INFO -- : make[2]: Entering directory '/home/opc/ruby/build/master/ext/rubyvm' I, [2024-05-17T19:34:22.599200 #1799568] INFO -- : make[2]: Leaving directory '/home/opc/ruby/build/master/ext/rubyvm' I, [2024-05-17T19:34:22.611122 #1799568] INFO -- : make[2]: Entering directory '/home/opc/ruby/build/master/ext/socket' I, [2024-05-17T19:34:22.621737 #1799568] INFO -- : make[2]: Leaving directory '/home/opc/ruby/build/master/ext/socket' I, [2024-05-17T19:34:22.636840 #1799568] INFO -- : make[2]: Entering directory '/home/opc/ruby/build/master/.bundle/gems/bigdecimal-3.1.7/ext/bigdecimal' I, [2024-05-17T19:34:22.667849 #1799568] INFO -- : make[2]: Leaving directory '/home/opc/ruby/build/master/.bundle/gems/bigdecimal-3.1.7/ext/bigdecimal' I, [2024-05-17T19:34:22.670823 #1799568] INFO -- : make[2]: Entering directory '/home/opc/ruby/build/master/.bundle/gems/bigdecimal-3.1.8/ext/bigdecimal' I, [2024-05-17T19:34:22.701812 #1799568] INFO -- : make[2]: Leaving directory '/home/opc/ruby/build/master/.bundle/gems/bigdecimal-3.1.8/ext/bigdecimal' I, [2024-05-17T19:34:22.704426 #1799568] INFO -- : make[2]: Entering directory '/home/opc/ruby/build/master/.bundle/gems/debug-1.9.2/ext/debug' I, [2024-05-17T19:34:22.736325 #1799568] INFO -- : make[2]: Leaving directory '/home/opc/ruby/build/master/.bundle/gems/debug-1.9.2/ext/debug' I, [2024-05-17T19:34:22.738913 #1799568] INFO -- : make[2]: Entering directory '/home/opc/ruby/build/master/.bundle/gems/nkf-0.2.0/ext/nkf' I, [2024-05-17T19:34:22.770608 #1799568] INFO -- : make[2]: Leaving directory '/home/opc/ruby/build/master/.bundle/gems/nkf-0.2.0/ext/nkf' I, [2024-05-17T19:34:22.773166 #1799568] INFO -- : make[2]: Entering directory '/home/opc/ruby/build/master/.bundle/gems/racc-1.7.3/ext/racc/cparse' I, [2024-05-17T19:34:22.803737 #1799568] INFO -- : make[2]: Leaving directory '/home/opc/ruby/build/master/.bundle/gems/racc-1.7.3/ext/racc/cparse' I, [2024-05-17T19:34:22.810228 #1799568] INFO -- : make[2]: Entering directory '/home/opc/ruby/build/master/.bundle/gems/rbs-3.4.4/ext/rbs_extension' I, [2024-05-17T19:34:22.841744 #1799568] INFO -- : make[2]: Leaving directory '/home/opc/ruby/build/master/.bundle/gems/rbs-3.4.4/ext/rbs_extension' I, [2024-05-17T19:34:22.844262 #1799568] INFO -- : make[2]: Entering directory '/home/opc/ruby/build/master/.bundle/gems/syslog-0.1.2/ext/syslog' I, [2024-05-17T19:34:22.875686 #1799568] INFO -- : make[2]: Leaving directory '/home/opc/ruby/build/master/.bundle/gems/syslog-0.1.2/ext/syslog' I, [2024-05-17T19:34:22.914558 #1799568] INFO -- : make[2]: Entering directory '/home/opc/ruby/build/master' I, [2024-05-17T19:34:22.998527 #1799568] INFO -- : make[2]: 'ruby' is up to date. I, [2024-05-17T19:34:22.998597 #1799568] INFO -- : make[2]: Leaving directory '/home/opc/ruby/build/master' I, [2024-05-17T19:34:22.998709 #1799568] INFO -- : make[1]: Leaving directory '/home/opc/ruby/build/master' I, [2024-05-17T19:34:23.002952 #1799568] INFO -- : make[1]: Entering directory '/home/opc/ruby/build/master' I, [2024-05-17T19:34:23.002998 #1799568] INFO -- : make[1]: Nothing to be done for 'note'. I, [2024-05-17T19:34:23.003010 #1799568] INFO -- : make[1]: Leaving directory '/home/opc/ruby/build/master' E, [2024-05-17T19:34:23.078888 #1799568] ERROR -- : $ /home/opc/ruby/build/master/miniruby -I/home/opc/ruby/src/master/lib /home/opc/ruby/src/master/tool/runruby.rb --archdir=/home/opc/ruby/build/master --extout=.ext -- /home/opc/ruby/src/master/spec/mspec/bin/mspec-run -B /home/opc/ruby/src/master/spec/default.mspec --error-output stderr --debug -fy -o /tmp/rubytest.m6r2kj/1-mspec-multi-0 E, [2024-05-17T19:34:23.079222 #1799568] ERROR -- : $ /home/opc/ruby/build/master/miniruby -I/home/opc/ruby/src/master/lib /home/opc/ruby/src/master/tool/runruby.rb --archdir=/home/opc/ruby/build/master --extout=.ext -- /home/opc/ruby/src/master/spec/mspec/bin/mspec-run -B /home/opc/ruby/src/master/spec/default.mspec --error-output stderr --debug -fy -o /tmp/rubytest.m6r2kj/2-mspec-multi-1 E, [2024-05-17T19:34:23.079507 #1799568] ERROR -- : $ /home/opc/ruby/build/master/miniruby -I/home/opc/ruby/src/master/lib /home/opc/ruby/src/master/tool/runruby.rb --archdir=/home/opc/ruby/build/master --extout=.ext -- /home/opc/ruby/src/master/spec/mspec/bin/mspec-run -B /home/opc/ruby/src/master/spec/default.mspec --error-output stderr --debug -fy -o /tmp/rubytest.m6r2kj/3-mspec-multi-2 I, [2024-05-17T19:34:23.208317 #1799568] INFO -- : ruby 3.4.0dev (2024-05-17T15:29:00Z master e61d24d77e) [aarch64-linux] I, [2024-05-17T19:34:28.645067 #1799568] INFO -- : 0 ......................................................................... I, [2024-05-17T19:34:31.044072 #1799568] INFO -- : 73 ......................................................................... I, [2024-05-17T19:34:31.194612 #1799568] INFO -- : 146 ......................................................................... I, [2024-05-17T19:34:31.487138 #1799568] INFO -- : 219 ......................................................................... I, [2024-05-17T19:34:31.653480 #1799568] INFO -- : 292 ......................................................................... I, [2024-05-17T19:34:31.891323 #1799568] INFO -- : 365 ......................................................................... I, [2024-05-17T19:34:32.017031 #1799568] INFO -- : 438 ......................................................................... I, [2024-05-17T19:34:32.074016 #1799568] INFO -- : 511 ......................................................................... I, [2024-05-17T19:34:32.131915 #1799568] INFO -- : 584 ......................................................................... I, [2024-05-17T19:34:32.742828 #1799568] INFO -- : 657 ......................................................................... I, [2024-05-17T19:34:32.828703 #1799568] INFO -- : 730 ......................................................................... I, [2024-05-17T19:34:32.876119 #1799568] INFO -- : 803 ......................................................................... I, [2024-05-17T19:34:33.079594 #1799568] INFO -- : 876 ......................................................................... I, [2024-05-17T19:34:33.182208 #1799568] INFO -- : 949 ......................................................................... I, [2024-05-17T19:34:33.766350 #1799568] INFO -- : 1022 ......................................................................... I, [2024-05-17T19:34:36.063450 #1799568] INFO -- : 1095 ......................................................................... I, [2024-05-17T19:34:36.865477 #1799568] INFO -- : 1168 ......................................................................... I, [2024-05-17T19:34:37.035477 #1799568] INFO -- : 1241 ......................................................................... I, [2024-05-17T19:34:37.218702 #1799568] INFO -- : 1314 ......................................................................... I, [2024-05-17T19:34:37.312529 #1799568] INFO -- : 1387 ......................................................................... I, [2024-05-17T19:34:39.362229 #1799568] INFO -- : 1460 ......................................................................... I, [2024-05-17T19:34:42.830660 #1799568] INFO -- : 1533 ......................................................................... I, [2024-05-17T19:34:42.963868 #1799568] INFO -- : 1606 ......................................................................... I, [2024-05-17T19:34:43.747788 #1799568] INFO -- : 1679 ......................................................................... I, [2024-05-17T19:34:43.994477 #1799568] INFO -- : 1752 ......................................................................... I, [2024-05-17T19:34:44.243264 #1799568] INFO -- : 1825 ......................................................................... I, [2024-05-17T19:34:44.565494 #1799568] INFO -- : 1898 ......................................................................... I, [2024-05-17T19:34:44.966036 #1799568] INFO -- : 1971 ......................................................................... I, [2024-05-17T19:34:45.464682 #1799568] INFO -- : 2044 ......................................................................... I, [2024-05-17T19:34:45.549574 #1799568] INFO -- : 2117 ......................................................................... I, [2024-05-17T19:34:45.606017 #1799568] INFO -- : 2190 ......................................................................... I, [2024-05-17T19:34:45.654070 #1799568] INFO -- : 2263 ......................................................................... I, [2024-05-17T19:34:45.701184 #1799568] INFO -- : 2336 ......................................................................... I, [2024-05-17T19:34:45.793993 #1799568] INFO -- : 2409 ......................................................................... I, [2024-05-17T19:34:46.078569 #1799568] INFO -- : 2482 ......................................................................... I, [2024-05-17T19:34:46.212351 #1799568] INFO -- : 2555 ......................................................................... I, [2024-05-17T19:34:47.523958 #1799568] INFO -- : 2628 ......................................................................... I, [2024-05-17T19:34:47.695267 #1799568] INFO -- : 2701 ......................................................................... I, [2024-05-17T19:34:47.840472 #1799568] INFO -- : 2774 ......................................................................... I, [2024-05-17T19:34:48.141229 #1799568] INFO -- : 2847 ......................................................................... I, [2024-05-17T19:34:48.415219 #1799568] INFO -- : 2920 ......................................................................... I, [2024-05-17T19:34:48.537789 #1799568] INFO -- : 2993 ......................................................................... I, [2024-05-17T19:34:48.603017 #1799568] INFO -- : 3066 ......................................................................... I, [2024-05-17T19:34:48.665987 #1799568] INFO -- : 3139 ......................................................................... I, [2024-05-17T19:34:48.729585 #1799568] INFO -- : 3212 ......................................................................... I, [2024-05-17T19:34:48.803481 #1799568] INFO -- : 3285 ......................................................................... I, [2024-05-17T19:34:52.628706 #1799568] INFO -- : 3358 ........................................................................ I, [2024-05-17T19:34:52.628775 #1799568] INFO -- : I, [2024-05-17T19:34:52.628788 #1799568] INFO -- : Finished in 29.549736 seconds I, [2024-05-17T19:34:52.628797 #1799568] INFO -- : I, [2024-05-17T19:34:52.628805 #1799568] INFO -- : 3429 files, 32607 examples, 182941 expectations, 0 failures, 0 errors, 0 tagged I, [2024-05-17T19:34:52.630055 #1799568] INFO -- : $$$[end] "make yes-test-rubyspec MSPECOPT='--error-output stderr --debug -j' TESTS='-j3'" exit with 0.