# Logfile created on 2024-05-17 08:01:25 +0000 by logger.rb/v1.5.3 I, [2024-05-17T08:01:25.401189 #844344] INFO -- : #, @formatter=nil, @logdev=#, @binmode=false, @mon_data=#, @mon_data_owner_object_id=860>>> I, [2024-05-17T08:01:25.401530 #844344] INFO -- : $$$[beg] make update-unicode -j3 I, [2024-05-17T08:01:25.499051 #844344] INFO -- : Downloading Unicode emoji 15.0 files... I, [2024-05-17T08:01:25.499217 #844344] INFO -- : Downloading Unicode emoji 15.0 files... I, [2024-05-17T08:01:25.499439 #844344] INFO -- : Downloading Unicode emoji 15.0 files... I, [2024-05-17T08:01:25.582057 #844344] INFO -- : made symlink emoji/15.0/emoji-sequences.txt to /home/opc/ruby/src/master/.downloaded-cache/emoji/15.0/emoji-sequences.txt I, [2024-05-17T08:01:25.583865 #844344] INFO -- : downloading emoji/15.0/emoji-test.txt ... /home/opc/ruby/src/master/enc/unicode/data/emoji/15.0/emoji-sequences.txt already exists I, [2024-05-17T08:01:25.589972 #844344] INFO -- : downloading emoji/15.0/emoji-test.txt ... /home/opc/ruby/src/master/enc/unicode/data/emoji/15.0/emoji-sequences.txt already exists E, [2024-05-17T08:01:26.049508 #844344] ERROR -- : /home/opc/ruby/src/master/tool/downloader.rb:302:in `rescue in download': failed to download emoji/15.0/emoji-test.txt (RuntimeError) E, [2024-05-17T08:01:26.049581 #844344] ERROR -- : OpenURI::HTTPError: 403 Forbidden: https://www.unicode.org/Public/emoji/15.0/emoji-test.txt E, [2024-05-17T08:01:26.049592 #844344] ERROR -- : from /home/opc/ruby/src/master/tool/downloader.rb:201:in `download' E, [2024-05-17T08:01:26.049602 #844344] ERROR -- : from /home/opc/ruby/src/master/tool/downloader.rb:136:in `download' E, [2024-05-17T08:01:26.049610 #844344] ERROR -- : from /home/opc/ruby/src/master/tool/downloader.rb:482:in `block in
' E, [2024-05-17T08:01:26.049619 #844344] ERROR -- : from /home/opc/ruby/src/master/tool/downloader.rb:465:in `each' E, [2024-05-17T08:01:26.049627 #844344] ERROR -- : from /home/opc/ruby/src/master/tool/downloader.rb:465:in `
' E, [2024-05-17T08:01:26.049635 #844344] ERROR -- : /usr/local/lib/ruby/3.2.0/open-uri.rb:369:in `open_http': 403 Forbidden (OpenURI::HTTPError) E, [2024-05-17T08:01:26.049644 #844344] ERROR -- : from /usr/local/lib/ruby/3.2.0/open-uri.rb:760:in `buffer_open' E, [2024-05-17T08:01:26.049652 #844344] ERROR -- : from /usr/local/lib/ruby/3.2.0/open-uri.rb:214:in `block in open_loop' E, [2024-05-17T08:01:26.049662 #844344] ERROR -- : from /usr/local/lib/ruby/3.2.0/open-uri.rb:212:in `catch' E, [2024-05-17T08:01:26.049670 #844344] ERROR -- : from /usr/local/lib/ruby/3.2.0/open-uri.rb:212:in `open_loop' E, [2024-05-17T08:01:26.049678 #844344] ERROR -- : from /usr/local/lib/ruby/3.2.0/open-uri.rb:153:in `open_uri' E, [2024-05-17T08:01:26.049686 #844344] ERROR -- : from /usr/local/lib/ruby/3.2.0/open-uri.rb:740:in `open' E, [2024-05-17T08:01:26.049699 #844344] ERROR -- : from /usr/local/lib/ruby/3.2.0/open-uri.rb:748:in `read' E, [2024-05-17T08:01:26.049708 #844344] ERROR -- : from /home/opc/ruby/src/master/tool/downloader.rb:247:in `block in download' E, [2024-05-17T08:01:26.049716 #844344] ERROR -- : from /home/opc/ruby/src/master/tool/downloader.rb:378:in `with_retry' E, [2024-05-17T08:01:26.049724 #844344] ERROR -- : from /home/opc/ruby/src/master/tool/downloader.rb:246:in `download' E, [2024-05-17T08:01:26.049733 #844344] ERROR -- : from /home/opc/ruby/src/master/tool/downloader.rb:136:in `download' E, [2024-05-17T08:01:26.049741 #844344] ERROR -- : from /home/opc/ruby/src/master/tool/downloader.rb:482:in `block in
' E, [2024-05-17T08:01:26.049749 #844344] ERROR -- : from /home/opc/ruby/src/master/tool/downloader.rb:465:in `each' E, [2024-05-17T08:01:26.049757 #844344] ERROR -- : from /home/opc/ruby/src/master/tool/downloader.rb:465:in `
' E, [2024-05-17T08:01:26.049822 #844344] ERROR -- : /home/opc/ruby/src/master/tool/downloader.rb:302:in `rescue in download': failed to download emoji/15.0/emoji-test.txt (RuntimeError) E, [2024-05-17T08:01:26.049839 #844344] ERROR -- : OpenURI::HTTPError: 403 Forbidden: https://www.unicode.org/Public/emoji/15.0/emoji-test.txt E, [2024-05-17T08:01:26.049848 #844344] ERROR -- : from /home/opc/ruby/src/master/tool/downloader.rb:201:in `download' E, [2024-05-17T08:01:26.049856 #844344] ERROR -- : from /home/opc/ruby/src/master/tool/downloader.rb:136:in `download' E, [2024-05-17T08:01:26.049865 #844344] ERROR -- : from /home/opc/ruby/src/master/tool/downloader.rb:482:in `block in
' E, [2024-05-17T08:01:26.049873 #844344] ERROR -- : from /home/opc/ruby/src/master/tool/downloader.rb:465:in `each' E, [2024-05-17T08:01:26.049882 #844344] ERROR -- : from /home/opc/ruby/src/master/tool/downloader.rb:465:in `
' E, [2024-05-17T08:01:26.049890 #844344] ERROR -- : /usr/local/lib/ruby/3.2.0/open-uri.rb:369:in `open_http': 403 Forbidden (OpenURI::HTTPError) E, [2024-05-17T08:01:26.049899 #844344] ERROR -- : from /usr/local/lib/ruby/3.2.0/open-uri.rb:760:in `buffer_open' E, [2024-05-17T08:01:26.049907 #844344] ERROR -- : from /usr/local/lib/ruby/3.2.0/open-uri.rb:214:in `block in open_loop' E, [2024-05-17T08:01:26.049915 #844344] ERROR -- : from /usr/local/lib/ruby/3.2.0/open-uri.rb:212:in `catch' E, [2024-05-17T08:01:26.049923 #844344] ERROR -- : from /usr/local/lib/ruby/3.2.0/open-uri.rb:212:in `open_loop' E, [2024-05-17T08:01:26.049932 #844344] ERROR -- : from /usr/local/lib/ruby/3.2.0/open-uri.rb:153:in `open_uri' E, [2024-05-17T08:01:26.049940 #844344] ERROR -- : from /usr/local/lib/ruby/3.2.0/open-uri.rb:740:in `open' E, [2024-05-17T08:01:26.049948 #844344] ERROR -- : from /usr/local/lib/ruby/3.2.0/open-uri.rb:748:in `read' E, [2024-05-17T08:01:26.049956 #844344] ERROR -- : from /home/opc/ruby/src/master/tool/downloader.rb:247:in `block in download' E, [2024-05-17T08:01:26.049965 #844344] ERROR -- : from /home/opc/ruby/src/master/tool/downloader.rb:378:in `with_retry' E, [2024-05-17T08:01:26.049973 #844344] ERROR -- : from /home/opc/ruby/src/master/tool/downloader.rb:246:in `download' E, [2024-05-17T08:01:26.049981 #844344] ERROR -- : from /home/opc/ruby/src/master/tool/downloader.rb:136:in `download' E, [2024-05-17T08:01:26.049989 #844344] ERROR -- : from /home/opc/ruby/src/master/tool/downloader.rb:482:in `block in
' E, [2024-05-17T08:01:26.049997 #844344] ERROR -- : from /home/opc/ruby/src/master/tool/downloader.rb:465:in `each' E, [2024-05-17T08:01:26.050006 #844344] ERROR -- : from /home/opc/ruby/src/master/tool/downloader.rb:465:in `
' E, [2024-05-17T08:01:26.052864 #844344] ERROR -- : make: *** [uncommon.mk:1765: /home/opc/ruby/src/master/enc/unicode/data/emoji/15.0/emoji-sequences.txt] Error 1 E, [2024-05-17T08:01:26.052927 #844344] ERROR -- : make: *** Deleting file '/home/opc/ruby/src/master/enc/unicode/data/emoji/15.0/emoji-sequences.txt' E, [2024-05-17T08:01:26.052939 #844344] ERROR -- : make: *** Waiting for unfinished jobs.... E, [2024-05-17T08:01:26.053096 #844344] ERROR -- : make: *** [uncommon.mk:1765: /home/opc/ruby/src/master/enc/unicode/data/emoji/15.0/emoji-zwj-sequences.txt] Error 1 E, [2024-05-17T08:01:26.064857 #844344] ERROR -- : /home/opc/ruby/src/master/tool/downloader.rb:302:in `rescue in download': failed to download emoji/15.0/emoji-test.txt (RuntimeError) E, [2024-05-17T08:01:26.064908 #844344] ERROR -- : OpenURI::HTTPError: 403 Forbidden: https://www.unicode.org/Public/emoji/15.0/emoji-test.txt E, [2024-05-17T08:01:26.064918 #844344] ERROR -- : from /home/opc/ruby/src/master/tool/downloader.rb:201:in `download' E, [2024-05-17T08:01:26.064928 #844344] ERROR -- : from /home/opc/ruby/src/master/tool/downloader.rb:136:in `download' E, [2024-05-17T08:01:26.064936 #844344] ERROR -- : from /home/opc/ruby/src/master/tool/downloader.rb:482:in `block in
' E, [2024-05-17T08:01:26.064944 #844344] ERROR -- : from /home/opc/ruby/src/master/tool/downloader.rb:465:in `each' E, [2024-05-17T08:01:26.064953 #844344] ERROR -- : from /home/opc/ruby/src/master/tool/downloader.rb:465:in `
' E, [2024-05-17T08:01:26.064961 #844344] ERROR -- : /usr/local/lib/ruby/3.2.0/open-uri.rb:369:in `open_http': 403 Forbidden (OpenURI::HTTPError) E, [2024-05-17T08:01:26.064969 #844344] ERROR -- : from /usr/local/lib/ruby/3.2.0/open-uri.rb:760:in `buffer_open' E, [2024-05-17T08:01:26.064977 #844344] ERROR -- : from /usr/local/lib/ruby/3.2.0/open-uri.rb:214:in `block in open_loop' E, [2024-05-17T08:01:26.064986 #844344] ERROR -- : from /usr/local/lib/ruby/3.2.0/open-uri.rb:212:in `catch' E, [2024-05-17T08:01:26.064994 #844344] ERROR -- : from /usr/local/lib/ruby/3.2.0/open-uri.rb:212:in `open_loop' E, [2024-05-17T08:01:26.065003 #844344] ERROR -- : from /usr/local/lib/ruby/3.2.0/open-uri.rb:153:in `open_uri' E, [2024-05-17T08:01:26.065011 #844344] ERROR -- : from /usr/local/lib/ruby/3.2.0/open-uri.rb:740:in `open' E, [2024-05-17T08:01:26.065019 #844344] ERROR -- : from /usr/local/lib/ruby/3.2.0/open-uri.rb:748:in `read' E, [2024-05-17T08:01:26.065027 #844344] ERROR -- : from /home/opc/ruby/src/master/tool/downloader.rb:247:in `block in download' E, [2024-05-17T08:01:26.065036 #844344] ERROR -- : from /home/opc/ruby/src/master/tool/downloader.rb:378:in `with_retry' E, [2024-05-17T08:01:26.065044 #844344] ERROR -- : from /home/opc/ruby/src/master/tool/downloader.rb:246:in `download' E, [2024-05-17T08:01:26.065052 #844344] ERROR -- : from /home/opc/ruby/src/master/tool/downloader.rb:136:in `download' E, [2024-05-17T08:01:26.065061 #844344] ERROR -- : from /home/opc/ruby/src/master/tool/downloader.rb:482:in `block in
' E, [2024-05-17T08:01:26.065070 #844344] ERROR -- : from /home/opc/ruby/src/master/tool/downloader.rb:465:in `each' E, [2024-05-17T08:01:26.065078 #844344] ERROR -- : from /home/opc/ruby/src/master/tool/downloader.rb:465:in `
' E, [2024-05-17T08:01:26.068166 #844344] ERROR -- : make: *** [uncommon.mk:1765: /home/opc/ruby/src/master/enc/unicode/data/emoji/15.0/emoji-test.txt] Error 1 I, [2024-05-17T08:01:26.068244 #844344] INFO -- : downloading emoji/15.0/emoji-test.txt ... I, [2024-05-17T08:01:26.068409 #844344] INFO -- : $$$[end] "make update-unicode -j3" exit with 512. I, [2024-05-17T08:01:26.068460 #844344] INFO -- : $$$[beg] make update-download -j3 I, [2024-05-17T08:01:26.243974 #844344] INFO -- : tool/config.guess already exists I, [2024-05-17T08:01:26.244050 #844344] INFO -- : tool/config.sub already exists I, [2024-05-17T08:01:26.247267 #844344] INFO -- : Update minitest to ea9caafc0754b1d6236a490d59e624b53209734a I, [2024-05-17T08:01:26.247447 #844344] INFO -- : Update power_assert to 84e85124c5014a139af39161d484156cfe87a9ed I, [2024-05-17T08:01:26.247597 #844344] INFO -- : Update rbs to ba7872795d5de04adb8ff500c0e6afdc81a041dd I, [2024-05-17T08:01:26.250900 #844344] INFO -- : echo ea9caafc0754b1d6236a490d59e624b53209734a | /bin/sh /home/opc/ruby/src/master/tool/ifchange /home/opc/ruby/src/master/.bundle/.timestamp/minitest.revision - I, [2024-05-17T08:01:26.251209 #844344] INFO -- : echo 84e85124c5014a139af39161d484156cfe87a9ed | /bin/sh /home/opc/ruby/src/master/tool/ifchange /home/opc/ruby/src/master/.bundle/.timestamp/power_assert.revision - I, [2024-05-17T08:01:26.251401 #844344] INFO -- : echo ba7872795d5de04adb8ff500c0e6afdc81a041dd | /bin/sh /home/opc/ruby/src/master/tool/ifchange /home/opc/ruby/src/master/.bundle/.timestamp/rbs.revision - I, [2024-05-17T08:01:26.257576 #844344] INFO -- : /home/opc/ruby/src/master/.bundle/.timestamp/minitest.revision unchanged I, [2024-05-17T08:01:26.257640 #844344] INFO -- : /home/opc/ruby/src/master/.bundle/.timestamp/rbs.revision unchanged I, [2024-05-17T08:01:26.257840 #844344] INFO -- : /home/opc/ruby/src/master/.bundle/.timestamp/power_assert.revision unchanged I, [2024-05-17T08:01:26.260083 #844344] INFO -- : Update typeprof to b19a6416da3a05d57fadd6ffdadb382b6d236ca5 I, [2024-05-17T08:01:26.267885 #844344] INFO -- : echo b19a6416da3a05d57fadd6ffdadb382b6d236ca5 | /bin/sh /home/opc/ruby/src/master/tool/ifchange /home/opc/ruby/src/master/.bundle/.timestamp/typeprof.revision - I, [2024-05-17T08:01:26.274995 #844344] INFO -- : /home/opc/ruby/src/master/.bundle/.timestamp/typeprof.revision unchanged I, [2024-05-17T08:01:26.352955 #844344] INFO -- : Building power_assert@84e85124c5014a139af39161d484156cfe87a9ed to /home/opc/ruby/src/master/gems/power_assert-2.0.3.gem I, [2024-05-17T08:01:26.472791 #844344] INFO -- : Successfully built RubyGem I, [2024-05-17T08:01:26.472856 #844344] INFO -- : Name: power_assert I, [2024-05-17T08:01:26.472868 #844344] INFO -- : Version: 2.0.4dev I, [2024-05-17T08:01:26.472876 #844344] INFO -- : File: power_assert-2.0.4dev.gem I, [2024-05-17T08:01:26.558493 #844344] INFO -- : $$$[end] "make update-download -j3" exit with 0. I, [2024-05-17T08:01:26.558594 #844344] INFO -- : $$$[beg] make update-rubyspec -j3 I, [2024-05-17T08:01:26.651455 #844344] INFO -- : make: Nothing to be done for 'update-rubyspec'. I, [2024-05-17T08:01:26.651637 #844344] INFO -- : $$$[end] "make update-rubyspec -j3" exit with 0. I, [2024-05-17T08:01:26.651689 #844344] INFO -- : $$$[beg] make update-src -j3 I, [2024-05-17T08:01:27.727553 #844344] INFO -- : Already up to date. I, [2024-05-17T08:01:27.742426 #844344] INFO -- : Latest commit hash = 534f1c37e3 I, [2024-05-17T08:01:27.743143 #844344] INFO -- : $$$[end] "make update-src -j3" exit with 0. I, [2024-05-17T08:01:27.743192 #844344] INFO -- : $$$[beg] make after-update -j3 I, [2024-05-17T08:01:27.847077 #844344] INFO -- : generating /home/opc/ruby/src/master/ext/ripper/eventids2table.c I, [2024-05-17T08:01:27.853815 #844344] INFO -- : make[1]: Entering directory '/home/opc/ruby/src/master/ext/ripper' I, [2024-05-17T08:01:27.853876 #844344] INFO -- : make[1]: Nothing to be done for 'src'. I, [2024-05-17T08:01:27.853887 #844344] INFO -- : make[1]: Leaving directory '/home/opc/ruby/src/master/ext/ripper' I, [2024-05-17T08:01:27.881804 #844344] INFO -- : /home/opc/ruby/src/master/revision.h updated I, [2024-05-17T08:01:27.882955 #844344] INFO -- : generating aarch64-linux-fake.rb I, [2024-05-17T08:01:27.939823 #844344] INFO -- : aarch64-linux-fake.rb updated I, [2024-05-17T08:01:27.941533 #844344] INFO -- : generating enc.mk I, [2024-05-17T08:01:28.172080 #844344] INFO -- : making srcs under enc I, [2024-05-17T08:01:28.214539 #844344] INFO -- : make[1]: Entering directory '/home/opc/ruby/build/master' I, [2024-05-17T08:01:28.214592 #844344] INFO -- : make[1]: Nothing to be done for 'srcs'. I, [2024-05-17T08:01:28.214602 #844344] INFO -- : make[1]: Leaving directory '/home/opc/ruby/build/master' I, [2024-05-17T08:01:28.295092 #844344] INFO -- : Update minitest to ea9caafc0754b1d6236a490d59e624b53209734a I, [2024-05-17T08:01:28.295497 #844344] INFO -- : Update rbs to ba7872795d5de04adb8ff500c0e6afdc81a041dd I, [2024-05-17T08:01:28.295529 #844344] INFO -- : Update power_assert to 84e85124c5014a139af39161d484156cfe87a9ed I, [2024-05-17T08:01:28.298759 #844344] INFO -- : echo ea9caafc0754b1d6236a490d59e624b53209734a | /bin/sh /home/opc/ruby/src/master/tool/ifchange /home/opc/ruby/src/master/.bundle/.timestamp/minitest.revision - I, [2024-05-17T08:01:28.299242 #844344] INFO -- : echo 84e85124c5014a139af39161d484156cfe87a9ed | /bin/sh /home/opc/ruby/src/master/tool/ifchange /home/opc/ruby/src/master/.bundle/.timestamp/power_assert.revision - I, [2024-05-17T08:01:28.299447 #844344] INFO -- : echo ba7872795d5de04adb8ff500c0e6afdc81a041dd | /bin/sh /home/opc/ruby/src/master/tool/ifchange /home/opc/ruby/src/master/.bundle/.timestamp/rbs.revision - I, [2024-05-17T08:01:28.304771 #844344] INFO -- : /home/opc/ruby/src/master/.bundle/.timestamp/minitest.revision unchanged I, [2024-05-17T08:01:28.304823 #844344] INFO -- : /home/opc/ruby/src/master/.bundle/.timestamp/power_assert.revision unchanged I, [2024-05-17T08:01:28.305063 #844344] INFO -- : /home/opc/ruby/src/master/.bundle/.timestamp/rbs.revision unchanged I, [2024-05-17T08:01:28.307189 #844344] INFO -- : Update typeprof to b19a6416da3a05d57fadd6ffdadb382b6d236ca5 I, [2024-05-17T08:01:28.311176 #844344] INFO -- : echo b19a6416da3a05d57fadd6ffdadb382b6d236ca5 | /bin/sh /home/opc/ruby/src/master/tool/ifchange /home/opc/ruby/src/master/.bundle/.timestamp/typeprof.revision - I, [2024-05-17T08:01:28.323415 #844344] INFO -- : /home/opc/ruby/src/master/.bundle/.timestamp/typeprof.revision unchanged I, [2024-05-17T08:01:28.397482 #844344] INFO -- : Building power_assert@84e85124c5014a139af39161d484156cfe87a9ed to /home/opc/ruby/src/master/gems/power_assert-2.0.3.gem I, [2024-05-17T08:01:28.509267 #844344] INFO -- : Successfully built RubyGem I, [2024-05-17T08:01:28.509330 #844344] INFO -- : Name: power_assert I, [2024-05-17T08:01:28.509341 #844344] INFO -- : Version: 2.0.4dev I, [2024-05-17T08:01:28.509350 #844344] INFO -- : File: power_assert-2.0.4dev.gem I, [2024-05-17T08:01:28.511556 #844344] INFO -- : Extracting bundle gem power_assert-2.0.3... I, [2024-05-17T08:01:28.608661 #844344] INFO -- : Try with hash version of bundled gems instead of gems/power_assert-2.0.3.gem. We don't use this gem with release version of Ruby. I, [2024-05-17T08:01:28.618896 #844344] INFO -- : Unpacked gems/power_assert-2.0.4dev.gem I, [2024-05-17T08:01:28.620701 #844344] INFO -- : $$$[end] "make after-update -j3" exit with 0. I, [2024-05-17T08:01:28.620854 #844344] INFO -- : $$$[beg] make miniruby -j3 I, [2024-05-17T08:01:28.711275 #844344] INFO -- : BASERUBY = /usr/local/bin/ruby --disable=gems I, [2024-05-17T08:01:28.711360 #844344] INFO -- : CC = gcc I, [2024-05-17T08:01:28.711374 #844344] INFO -- : LD = ld I, [2024-05-17T08:01:28.711383 #844344] INFO -- : LDSHARED = gcc -shared I, [2024-05-17T08:01:28.711395 #844344] INFO -- : CFLAGS = -O3 -fno-fast-math -ggdb3 -Wall -Wextra -Wdeprecated-declarations -Wdiv-by-zero -Wduplicated-cond -Wimplicit-function-declaration -Wimplicit-int -Wpointer-arith -Wwrite-strings -Wold-style-definition -Wimplicit-fallthrough=0 -Wmissing-noreturn -Wno-cast-function-type -Wno-constant-logical-operand -Wno-long-long -Wno-missing-field-initializers -Wno-overlength-strings -Wno-packed-bitfield-compat -Wno-parentheses-equality -Wno-self-assign -Wno-tautological-compare -Wno-unused-parameter -Wno-unused-value -Wsuggest-attribute=format -Wsuggest-attribute=noreturn -Wunused-variable -Wmisleading-indentation -Wundef I, [2024-05-17T08:01:28.711405 #844344] INFO -- : XCFLAGS = -U_FORTIFY_SOURCE -D_FORTIFY_SOURCE=2 -fstack-protector-strong -msign-return-address=all -fno-strict-overflow -fvisibility=hidden -fexcess-precision=standard -DRUBY_EXPORT -fPIE -I. -I.ext/include/aarch64-linux -I/home/opc/ruby/src/master/include -I/home/opc/ruby/src/master -I/home/opc/ruby/src/master/prism -I/home/opc/ruby/src/master/enc/unicode/15.0.0 I, [2024-05-17T08:01:28.711414 #844344] INFO -- : CPPFLAGS = I, [2024-05-17T08:01:28.711422 #844344] INFO -- : DLDFLAGS = -Wl,--compress-debug-sections=zlib -fstack-protector-strong -pie I, [2024-05-17T08:01:28.711431 #844344] INFO -- : SOLIBS = -lz -lrt -lrt -ldl -lcrypt -lm -lpthread I, [2024-05-17T08:01:28.711462 #844344] INFO -- : LANG = en_US.UTF-8 I, [2024-05-17T08:01:28.711473 #844344] INFO -- : LC_ALL = I, [2024-05-17T08:01:28.711481 #844344] INFO -- : LC_CTYPE = I, [2024-05-17T08:01:28.711488 #844344] INFO -- : MFLAGS = -j3 --jobserver-auth=4,5 I, [2024-05-17T08:01:28.711496 #844344] INFO -- : RUSTC = rustc I, [2024-05-17T08:01:28.711504 #844344] INFO -- : YJIT_RUSTC_ARGS = --crate-name=yjit --crate-type=staticlib --edition=2021 -g -C lto=thin -C opt-level=3 -C overflow-checks=on '--out-dir=/home/opc/ruby/build/master/yjit/target/release/' /home/opc/ruby/src/master/yjit/src/lib.rs I, [2024-05-17T08:01:28.712260 #844344] INFO -- : gcc (GCC) 8.5.0 20210514 (Red Hat 8.5.0-10.1.0.1) I, [2024-05-17T08:01:28.712297 #844344] INFO -- : Copyright (C) 2018 Free Software Foundation, Inc. I, [2024-05-17T08:01:28.712308 #844344] INFO -- : This is free software; see the source for copying conditions. There is NO I, [2024-05-17T08:01:28.712317 #844344] INFO -- : warranty; not even for MERCHANTABILITY or FITNESS FOR A PARTICULAR PURPOSE. I, [2024-05-17T08:01:28.712325 #844344] INFO -- : I, [2024-05-17T08:01:28.737218 #844344] INFO -- : compiling /home/opc/ruby/src/master/version.c I, [2024-05-17T08:01:28.883413 #844344] INFO -- : linking miniruby I, [2024-05-17T08:01:29.799456 #844344] INFO -- : $$$[end] "make miniruby -j3" exit with 0. I, [2024-05-17T08:01:29.799631 #844344] INFO -- : $$$[beg] make ruby -j3 I, [2024-05-17T08:01:29.888915 #844344] INFO -- : BASERUBY = /usr/local/bin/ruby --disable=gems I, [2024-05-17T08:01:29.888979 #844344] INFO -- : CC = gcc I, [2024-05-17T08:01:29.888990 #844344] INFO -- : LD = ld I, [2024-05-17T08:01:29.889001 #844344] INFO -- : LDSHARED = gcc -shared I, [2024-05-17T08:01:29.889010 #844344] INFO -- : CFLAGS = -O3 -fno-fast-math -ggdb3 -Wall -Wextra -Wdeprecated-declarations -Wdiv-by-zero -Wduplicated-cond -Wimplicit-function-declaration -Wimplicit-int -Wpointer-arith -Wwrite-strings -Wold-style-definition -Wimplicit-fallthrough=0 -Wmissing-noreturn -Wno-cast-function-type -Wno-constant-logical-operand -Wno-long-long -Wno-missing-field-initializers -Wno-overlength-strings -Wno-packed-bitfield-compat -Wno-parentheses-equality -Wno-self-assign -Wno-tautological-compare -Wno-unused-parameter -Wno-unused-value -Wsuggest-attribute=format -Wsuggest-attribute=noreturn -Wunused-variable -Wmisleading-indentation -Wundef I, [2024-05-17T08:01:29.889019 #844344] INFO -- : XCFLAGS = -U_FORTIFY_SOURCE -D_FORTIFY_SOURCE=2 -fstack-protector-strong -msign-return-address=all -fno-strict-overflow -fvisibility=hidden -fexcess-precision=standard -DRUBY_EXPORT -fPIE -I. -I.ext/include/aarch64-linux -I/home/opc/ruby/src/master/include -I/home/opc/ruby/src/master -I/home/opc/ruby/src/master/prism -I/home/opc/ruby/src/master/enc/unicode/15.0.0 I, [2024-05-17T08:01:29.889028 #844344] INFO -- : CPPFLAGS = I, [2024-05-17T08:01:29.889037 #844344] INFO -- : DLDFLAGS = -Wl,--compress-debug-sections=zlib -fstack-protector-strong -pie I, [2024-05-17T08:01:29.889045 #844344] INFO -- : SOLIBS = -lz -lrt -lrt -ldl -lcrypt -lm -lpthread I, [2024-05-17T08:01:29.889053 #844344] INFO -- : LANG = en_US.UTF-8 I, [2024-05-17T08:01:29.889061 #844344] INFO -- : LC_ALL = I, [2024-05-17T08:01:29.889069 #844344] INFO -- : LC_CTYPE = I, [2024-05-17T08:01:29.889077 #844344] INFO -- : MFLAGS = -j3 --jobserver-auth=4,5 I, [2024-05-17T08:01:29.889085 #844344] INFO -- : RUSTC = rustc I, [2024-05-17T08:01:29.889093 #844344] INFO -- : YJIT_RUSTC_ARGS = --crate-name=yjit --crate-type=staticlib --edition=2021 -g -C lto=thin -C opt-level=3 -C overflow-checks=on '--out-dir=/home/opc/ruby/build/master/yjit/target/release/' /home/opc/ruby/src/master/yjit/src/lib.rs I, [2024-05-17T08:01:29.889984 #844344] INFO -- : gcc (GCC) 8.5.0 20210514 (Red Hat 8.5.0-10.1.0.1) I, [2024-05-17T08:01:29.890020 #844344] INFO -- : Copyright (C) 2018 Free Software Foundation, Inc. I, [2024-05-17T08:01:29.890031 #844344] INFO -- : This is free software; see the source for copying conditions. There is NO I, [2024-05-17T08:01:29.890043 #844344] INFO -- : warranty; not even for MERCHANTABILITY or FITNESS FOR A PARTICULAR PURPOSE. I, [2024-05-17T08:01:29.890052 #844344] INFO -- : I, [2024-05-17T08:01:30.071507 #844344] INFO -- : builtin_binary.inc updated I, [2024-05-17T08:01:30.074649 #844344] INFO -- : c5234a9416e4f20f175185e840b25b0f08674d14078ed7083f37e655458e3ca9 builtin_binary.inc I, [2024-05-17T08:01:30.075481 #844344] INFO -- : compiling /home/opc/ruby/src/master/builtin.c I, [2024-05-17T08:01:30.401089 #844344] INFO -- : linking static-library libruby-static.a I, [2024-05-17T08:01:33.105711 #844344] INFO -- : linking ruby I, [2024-05-17T08:01:34.034189 #844344] INFO -- : $$$[end] "make ruby -j3" exit with 0. I, [2024-05-17T08:01:34.034356 #844344] INFO -- : $$$[beg] make all -j3 I, [2024-05-17T08:01:34.123706 #844344] INFO -- : BASERUBY = /usr/local/bin/ruby --disable=gems I, [2024-05-17T08:01:34.123778 #844344] INFO -- : CC = gcc I, [2024-05-17T08:01:34.123792 #844344] INFO -- : LD = ld I, [2024-05-17T08:01:34.123801 #844344] INFO -- : LDSHARED = gcc -shared I, [2024-05-17T08:01:34.123812 #844344] INFO -- : CFLAGS = -O3 -fno-fast-math -ggdb3 -Wall -Wextra -Wdeprecated-declarations -Wdiv-by-zero -Wduplicated-cond -Wimplicit-function-declaration -Wimplicit-int -Wpointer-arith -Wwrite-strings -Wold-style-definition -Wimplicit-fallthrough=0 -Wmissing-noreturn -Wno-cast-function-type -Wno-constant-logical-operand -Wno-long-long -Wno-missing-field-initializers -Wno-overlength-strings -Wno-packed-bitfield-compat -Wno-parentheses-equality -Wno-self-assign -Wno-tautological-compare -Wno-unused-parameter -Wno-unused-value -Wsuggest-attribute=format -Wsuggest-attribute=noreturn -Wunused-variable -Wmisleading-indentation -Wundef I, [2024-05-17T08:01:34.123822 #844344] INFO -- : XCFLAGS = -U_FORTIFY_SOURCE -D_FORTIFY_SOURCE=2 -fstack-protector-strong -msign-return-address=all -fno-strict-overflow -fvisibility=hidden -fexcess-precision=standard -DRUBY_EXPORT -fPIE -I. -I.ext/include/aarch64-linux -I/home/opc/ruby/src/master/include -I/home/opc/ruby/src/master -I/home/opc/ruby/src/master/prism -I/home/opc/ruby/src/master/enc/unicode/15.0.0 I, [2024-05-17T08:01:34.123831 #844344] INFO -- : CPPFLAGS = I, [2024-05-17T08:01:34.123839 #844344] INFO -- : DLDFLAGS = -Wl,--compress-debug-sections=zlib -fstack-protector-strong -pie I, [2024-05-17T08:01:34.123848 #844344] INFO -- : SOLIBS = -lz -lrt -lrt -ldl -lcrypt -lm -lpthread I, [2024-05-17T08:01:34.123856 #844344] INFO -- : LANG = en_US.UTF-8 I, [2024-05-17T08:01:34.123864 #844344] INFO -- : LC_ALL = I, [2024-05-17T08:01:34.123872 #844344] INFO -- : LC_CTYPE = I, [2024-05-17T08:01:34.123881 #844344] INFO -- : MFLAGS = -j3 --jobserver-auth=4,5 I, [2024-05-17T08:01:34.123889 #844344] INFO -- : RUSTC = rustc I, [2024-05-17T08:01:34.123897 #844344] INFO -- : YJIT_RUSTC_ARGS = --crate-name=yjit --crate-type=staticlib --edition=2021 -g -C lto=thin -C opt-level=3 -C overflow-checks=on '--out-dir=/home/opc/ruby/build/master/yjit/target/release/' /home/opc/ruby/src/master/yjit/src/lib.rs I, [2024-05-17T08:01:34.124794 #844344] INFO -- : gcc (GCC) 8.5.0 20210514 (Red Hat 8.5.0-10.1.0.1) I, [2024-05-17T08:01:34.124837 #844344] INFO -- : Copyright (C) 2018 Free Software Foundation, Inc. I, [2024-05-17T08:01:34.124848 #844344] INFO -- : This is free software; see the source for copying conditions. There is NO I, [2024-05-17T08:01:34.124857 #844344] INFO -- : warranty; not even for MERCHANTABILITY or FITNESS FOR A PARTICULAR PURPOSE. I, [2024-05-17T08:01:34.124866 #844344] INFO -- : I, [2024-05-17T08:01:34.157363 #844344] INFO -- : generating encdb.h I, [2024-05-17T08:01:34.158729 #844344] INFO -- : generating enc.mk I, [2024-05-17T08:01:34.195729 #844344] INFO -- : encdb.h unchanged I, [2024-05-17T08:01:34.392175 #844344] INFO -- : making srcs under enc I, [2024-05-17T08:01:34.392304 #844344] INFO -- : making enc I, [2024-05-17T08:01:34.419642 #844344] INFO -- : make[1]: Entering directory '/home/opc/ruby/build/master' I, [2024-05-17T08:01:34.419721 #844344] INFO -- : make[1]: Nothing to be done for 'enc'. I, [2024-05-17T08:01:34.419735 #844344] INFO -- : make[1]: Leaving directory '/home/opc/ruby/build/master' I, [2024-05-17T08:01:34.434190 #844344] INFO -- : make[1]: Entering directory '/home/opc/ruby/build/master' I, [2024-05-17T08:01:34.434250 #844344] INFO -- : make[1]: Nothing to be done for 'srcs'. I, [2024-05-17T08:01:34.434260 #844344] INFO -- : make[1]: Leaving directory '/home/opc/ruby/build/master' I, [2024-05-17T08:01:34.434993 #844344] INFO -- : generating transdb.h I, [2024-05-17T08:01:34.577933 #844344] INFO -- : transdb.h unchanged I, [2024-05-17T08:01:34.579224 #844344] INFO -- : generating makefiles ext/configure-ext.mk I, [2024-05-17T08:01:34.579480 #844344] INFO -- : making trans I, [2024-05-17T08:01:34.619062 #844344] INFO -- : ext/configure-ext.mk updated I, [2024-05-17T08:01:34.622529 #844344] INFO -- : make[1]: Entering directory '/home/opc/ruby/build/master' I, [2024-05-17T08:01:34.628120 #844344] INFO -- : make[1]: Entering directory '/home/opc/ruby/build/master' I, [2024-05-17T08:01:34.628178 #844344] INFO -- : make[1]: Nothing to be done for 'trans'. I, [2024-05-17T08:01:34.628208 #844344] INFO -- : make[1]: Leaving directory '/home/opc/ruby/build/master' I, [2024-05-17T08:01:34.628949 #844344] INFO -- : making encs I, [2024-05-17T08:01:34.683618 #844344] INFO -- : make[1]: Entering directory '/home/opc/ruby/build/master' I, [2024-05-17T08:01:34.683686 #844344] INFO -- : make[1]: Nothing to be done for 'encs'. I, [2024-05-17T08:01:34.683696 #844344] INFO -- : make[1]: Leaving directory '/home/opc/ruby/build/master' I, [2024-05-17T08:01:35.385388 #844344] INFO -- : make[1]: Leaving directory '/home/opc/ruby/build/master' I, [2024-05-17T08:01:35.386205 #844344] INFO -- : generating makefile exts.mk I, [2024-05-17T08:01:35.445460 #844344] INFO -- : exts.mk unchanged I, [2024-05-17T08:01:35.450416 #844344] INFO -- : make[1]: Entering directory '/home/opc/ruby/build/master' I, [2024-05-17T08:01:35.553742 #844344] INFO -- : make[2]: Entering directory '/home/opc/ruby/build/master/ext/coverage' I, [2024-05-17T08:01:35.555293 #844344] INFO -- : make[2]: Entering directory '/home/opc/ruby/build/master/ext/digest' I, [2024-05-17T08:01:35.555623 #844344] INFO -- : make[2]: Entering directory '/home/opc/ruby/build/master/ext/date' I, [2024-05-17T08:01:35.558855 #844344] INFO -- : make[2]: Leaving directory '/home/opc/ruby/build/master/ext/coverage' I, [2024-05-17T08:01:35.560735 #844344] INFO -- : make[2]: Leaving directory '/home/opc/ruby/build/master/ext/date' I, [2024-05-17T08:01:35.564539 #844344] INFO -- : make[2]: Leaving directory '/home/opc/ruby/build/master/ext/digest' I, [2024-05-17T08:01:35.569630 #844344] INFO -- : make[2]: Entering directory '/home/opc/ruby/build/master/ext/io/console' I, [2024-05-17T08:01:35.571973 #844344] INFO -- : make[2]: Entering directory '/home/opc/ruby/build/master/ext/fiddle' I, [2024-05-17T08:01:35.574331 #844344] INFO -- : make[2]: Leaving directory '/home/opc/ruby/build/master/ext/io/console' I, [2024-05-17T08:01:35.576289 #844344] INFO -- : make[2]: Entering directory '/home/opc/ruby/build/master/ext/json' I, [2024-05-17T08:01:35.579763 #844344] INFO -- : make[2]: Entering directory '/home/opc/ruby/build/master/ext/monitor' I, [2024-05-17T08:01:35.582519 #844344] INFO -- : make[2]: Leaving directory '/home/opc/ruby/build/master/ext/fiddle' I, [2024-05-17T08:01:35.583042 #844344] INFO -- : make[2]: Leaving directory '/home/opc/ruby/build/master/ext/monitor' I, [2024-05-17T08:01:35.586015 #844344] INFO -- : make[2]: Leaving directory '/home/opc/ruby/build/master/ext/json' I, [2024-05-17T08:01:35.588804 #844344] INFO -- : make[2]: Entering directory '/home/opc/ruby/build/master/ext/objspace' I, [2024-05-17T08:01:35.590052 #844344] INFO -- : make[2]: Entering directory '/home/opc/ruby/build/master/ext/pathname' I, [2024-05-17T08:01:35.594085 #844344] INFO -- : make[2]: Leaving directory '/home/opc/ruby/build/master/ext/pathname' I, [2024-05-17T08:01:35.594849 #844344] INFO -- : make[2]: Leaving directory '/home/opc/ruby/build/master/ext/objspace' I, [2024-05-17T08:01:35.599275 #844344] INFO -- : make[2]: Entering directory '/home/opc/ruby/build/master/ext/pty' I, [2024-05-17T08:01:35.600339 #844344] INFO -- : make[2]: Entering directory '/home/opc/ruby/build/master/ext/psych' I, [2024-05-17T08:01:35.602243 #844344] INFO -- : make[2]: Entering directory '/home/opc/ruby/build/master/ext/openssl' I, [2024-05-17T08:01:35.607043 #844344] INFO -- : make[2]: Leaving directory '/home/opc/ruby/build/master/ext/pty' I, [2024-05-17T08:01:35.621744 #844344] INFO -- : make[2]: Leaving directory '/home/opc/ruby/build/master/ext/psych' I, [2024-05-17T08:01:35.622769 #844344] INFO -- : make[2]: Leaving directory '/home/opc/ruby/build/master/ext/openssl' I, [2024-05-17T08:01:35.623627 #844344] INFO -- : make[2]: Entering directory '/home/opc/ruby/build/master/ext/ripper' I, [2024-05-17T08:01:35.623729 #844344] INFO -- : make[2]: Entering directory '/home/opc/ruby/build/master/ext/rubyvm' I, [2024-05-17T08:01:35.627723 #844344] INFO -- : make[2]: Leaving directory '/home/opc/ruby/build/master/ext/rubyvm' I, [2024-05-17T08:01:35.630749 #844344] INFO -- : make[2]: Leaving directory '/home/opc/ruby/build/master/ext/ripper' I, [2024-05-17T08:01:35.636116 #844344] INFO -- : make[2]: Entering directory '/home/opc/ruby/build/master/ext/socket' I, [2024-05-17T08:01:35.639088 #844344] INFO -- : make[2]: Entering directory '/home/opc/ruby/build/master/.bundle/gems/bigdecimal-3.1.8/ext/bigdecimal' I, [2024-05-17T08:01:35.639145 #844344] INFO -- : make[2]: Entering directory '/home/opc/ruby/build/master/.bundle/gems/bigdecimal-3.1.7/ext/bigdecimal' I, [2024-05-17T08:01:35.648986 #844344] INFO -- : make[2]: Leaving directory '/home/opc/ruby/build/master/ext/socket' I, [2024-05-17T08:01:35.654550 #844344] INFO -- : make[2]: Entering directory '/home/opc/ruby/build/master/.bundle/gems/debug-1.9.2/ext/debug' I, [2024-05-17T08:01:35.670881 #844344] INFO -- : make[2]: Leaving directory '/home/opc/ruby/build/master/.bundle/gems/bigdecimal-3.1.7/ext/bigdecimal' I, [2024-05-17T08:01:35.671247 #844344] INFO -- : make[2]: Leaving directory '/home/opc/ruby/build/master/.bundle/gems/bigdecimal-3.1.8/ext/bigdecimal' I, [2024-05-17T08:01:35.673443 #844344] INFO -- : make[2]: Entering directory '/home/opc/ruby/build/master/.bundle/gems/nkf-0.2.0/ext/nkf' I, [2024-05-17T08:01:35.678514 #844344] INFO -- : make[2]: Entering directory '/home/opc/ruby/build/master/.bundle/gems/racc-1.7.3/ext/racc/cparse' I, [2024-05-17T08:01:35.687632 #844344] INFO -- : make[2]: Leaving directory '/home/opc/ruby/build/master/.bundle/gems/debug-1.9.2/ext/debug' I, [2024-05-17T08:01:35.690626 #844344] INFO -- : make[2]: Entering directory '/home/opc/ruby/build/master/.bundle/gems/rbs-3.4.4/ext/rbs_extension' I, [2024-05-17T08:01:35.704720 #844344] INFO -- : make[2]: Leaving directory '/home/opc/ruby/build/master/.bundle/gems/nkf-0.2.0/ext/nkf' I, [2024-05-17T08:01:35.707631 #844344] INFO -- : make[2]: Entering directory '/home/opc/ruby/build/master/.bundle/gems/syslog-0.1.2/ext/syslog' I, [2024-05-17T08:01:35.711994 #844344] INFO -- : make[2]: Leaving directory '/home/opc/ruby/build/master/.bundle/gems/racc-1.7.3/ext/racc/cparse' I, [2024-05-17T08:01:35.722792 #844344] INFO -- : make[2]: Leaving directory '/home/opc/ruby/build/master/.bundle/gems/rbs-3.4.4/ext/rbs_extension' I, [2024-05-17T08:01:35.731895 #844344] INFO -- : make[2]: Entering directory '/home/opc/ruby/build/master/ext/digest/sha2' I, [2024-05-17T08:01:35.737181 #844344] INFO -- : make[2]: Leaving directory '/home/opc/ruby/build/master/ext/digest/sha2' I, [2024-05-17T08:01:35.738586 #844344] INFO -- : make[2]: Leaving directory '/home/opc/ruby/build/master/.bundle/gems/syslog-0.1.2/ext/syslog' I, [2024-05-17T08:01:35.776923 #844344] INFO -- : make[2]: Entering directory '/home/opc/ruby/build/master' I, [2024-05-17T08:01:35.863802 #844344] INFO -- : make[2]: 'ruby' is up to date. I, [2024-05-17T08:01:35.863878 #844344] INFO -- : make[2]: Leaving directory '/home/opc/ruby/build/master' I, [2024-05-17T08:01:35.864052 #844344] INFO -- : make[1]: Leaving directory '/home/opc/ruby/build/master' I, [2024-05-17T08:01:35.868454 #844344] INFO -- : make[1]: Entering directory '/home/opc/ruby/build/master' I, [2024-05-17T08:01:35.868527 #844344] INFO -- : make[1]: Nothing to be done for 'note'. I, [2024-05-17T08:01:35.868544 #844344] INFO -- : make[1]: Leaving directory '/home/opc/ruby/build/master' I, [2024-05-17T08:01:35.869004 #844344] INFO -- : $$$[end] "make all -j3" exit with 0. I, [2024-05-17T08:01:35.869170 #844344] INFO -- : $$$[beg] make install -j3 I, [2024-05-17T08:01:35.965564 #844344] INFO -- : Update minitest to ea9caafc0754b1d6236a490d59e624b53209734a I, [2024-05-17T08:01:35.965655 #844344] INFO -- : Update power_assert to 84e85124c5014a139af39161d484156cfe87a9ed I, [2024-05-17T08:01:35.966112 #844344] INFO -- : Update rbs to ba7872795d5de04adb8ff500c0e6afdc81a041dd I, [2024-05-17T08:01:35.969053 #844344] INFO -- : echo ea9caafc0754b1d6236a490d59e624b53209734a | /bin/sh /home/opc/ruby/src/master/tool/ifchange /home/opc/ruby/src/master/.bundle/.timestamp/minitest.revision - I, [2024-05-17T08:01:35.969509 #844344] INFO -- : echo ba7872795d5de04adb8ff500c0e6afdc81a041dd | /bin/sh /home/opc/ruby/src/master/tool/ifchange /home/opc/ruby/src/master/.bundle/.timestamp/rbs.revision - I, [2024-05-17T08:01:35.969697 #844344] INFO -- : echo 84e85124c5014a139af39161d484156cfe87a9ed | /bin/sh /home/opc/ruby/src/master/tool/ifchange /home/opc/ruby/src/master/.bundle/.timestamp/power_assert.revision - I, [2024-05-17T08:01:35.975036 #844344] INFO -- : /home/opc/ruby/src/master/.bundle/.timestamp/minitest.revision unchanged I, [2024-05-17T08:01:35.975669 #844344] INFO -- : /home/opc/ruby/src/master/.bundle/.timestamp/rbs.revision unchanged I, [2024-05-17T08:01:35.976554 #844344] INFO -- : /home/opc/ruby/src/master/.bundle/.timestamp/power_assert.revision unchanged I, [2024-05-17T08:01:35.979374 #844344] INFO -- : BASERUBY = /usr/local/bin/ruby --disable=gems I, [2024-05-17T08:01:35.979406 #844344] INFO -- : CC = gcc I, [2024-05-17T08:01:35.979436 #844344] INFO -- : LD = ld I, [2024-05-17T08:01:35.979448 #844344] INFO -- : LDSHARED = gcc -shared I, [2024-05-17T08:01:35.979457 #844344] INFO -- : CFLAGS = -O3 -fno-fast-math -ggdb3 -Wall -Wextra -Wdeprecated-declarations -Wdiv-by-zero -Wduplicated-cond -Wimplicit-function-declaration -Wimplicit-int -Wpointer-arith -Wwrite-strings -Wold-style-definition -Wimplicit-fallthrough=0 -Wmissing-noreturn -Wno-cast-function-type -Wno-constant-logical-operand -Wno-long-long -Wno-missing-field-initializers -Wno-overlength-strings -Wno-packed-bitfield-compat -Wno-parentheses-equality -Wno-self-assign -Wno-tautological-compare -Wno-unused-parameter -Wno-unused-value -Wsuggest-attribute=format -Wsuggest-attribute=noreturn -Wunused-variable -Wmisleading-indentation -Wundef I, [2024-05-17T08:01:35.979467 #844344] INFO -- : XCFLAGS = -U_FORTIFY_SOURCE -D_FORTIFY_SOURCE=2 -fstack-protector-strong -msign-return-address=all -fno-strict-overflow -fvisibility=hidden -fexcess-precision=standard -DRUBY_EXPORT -fPIE -I. -I.ext/include/aarch64-linux -I/home/opc/ruby/src/master/include -I/home/opc/ruby/src/master -I/home/opc/ruby/src/master/prism -I/home/opc/ruby/src/master/enc/unicode/15.0.0 I, [2024-05-17T08:01:35.979477 #844344] INFO -- : CPPFLAGS = I, [2024-05-17T08:01:35.979485 #844344] INFO -- : DLDFLAGS = -Wl,--compress-debug-sections=zlib -fstack-protector-strong -pie I, [2024-05-17T08:01:35.979493 #844344] INFO -- : SOLIBS = -lz -lrt -lrt -ldl -lcrypt -lm -lpthread I, [2024-05-17T08:01:35.979501 #844344] INFO -- : LANG = en_US.UTF-8 I, [2024-05-17T08:01:35.979509 #844344] INFO -- : LC_ALL = I, [2024-05-17T08:01:35.979517 #844344] INFO -- : LC_CTYPE = I, [2024-05-17T08:01:35.979525 #844344] INFO -- : MFLAGS = -j3 --jobserver-auth=4,5 I, [2024-05-17T08:01:35.979533 #844344] INFO -- : RUSTC = rustc I, [2024-05-17T08:01:35.979541 #844344] INFO -- : YJIT_RUSTC_ARGS = --crate-name=yjit --crate-type=staticlib --edition=2021 -g -C lto=thin -C opt-level=3 -C overflow-checks=on '--out-dir=/home/opc/ruby/build/master/yjit/target/release/' /home/opc/ruby/src/master/yjit/src/lib.rs I, [2024-05-17T08:01:35.980902 #844344] INFO -- : Update typeprof to b19a6416da3a05d57fadd6ffdadb382b6d236ca5 I, [2024-05-17T08:01:36.011863 #844344] INFO -- : gcc (GCC) 8.5.0 20210514 (Red Hat 8.5.0-10.1.0.1) I, [2024-05-17T08:01:36.011933 #844344] INFO -- : Copyright (C) 2018 Free Software Foundation, Inc. I, [2024-05-17T08:01:36.011944 #844344] INFO -- : This is free software; see the source for copying conditions. There is NO I, [2024-05-17T08:01:36.011954 #844344] INFO -- : warranty; not even for MERCHANTABILITY or FITNESS FOR A PARTICULAR PURPOSE. I, [2024-05-17T08:01:36.011963 #844344] INFO -- : I, [2024-05-17T08:01:36.012314 #844344] INFO -- : generating encdb.h I, [2024-05-17T08:01:36.013310 #844344] INFO -- : generating enc.mk I, [2024-05-17T08:01:36.017551 #844344] INFO -- : echo b19a6416da3a05d57fadd6ffdadb382b6d236ca5 | /bin/sh /home/opc/ruby/src/master/tool/ifchange /home/opc/ruby/src/master/.bundle/.timestamp/typeprof.revision - I, [2024-05-17T08:01:36.023589 #844344] INFO -- : /home/opc/ruby/src/master/.bundle/.timestamp/typeprof.revision unchanged I, [2024-05-17T08:01:36.056282 #844344] INFO -- : encdb.h unchanged I, [2024-05-17T08:01:36.154712 #844344] INFO -- : Building power_assert@84e85124c5014a139af39161d484156cfe87a9ed to /home/opc/ruby/src/master/gems/power_assert-2.0.3.gem I, [2024-05-17T08:01:36.256253 #844344] INFO -- : making srcs under enc I, [2024-05-17T08:01:36.256319 #844344] INFO -- : making enc I, [2024-05-17T08:01:36.276053 #844344] INFO -- : Successfully built RubyGem I, [2024-05-17T08:01:36.276109 #844344] INFO -- : Name: power_assert I, [2024-05-17T08:01:36.276119 #844344] INFO -- : Version: 2.0.4dev I, [2024-05-17T08:01:36.276128 #844344] INFO -- : File: power_assert-2.0.4dev.gem I, [2024-05-17T08:01:36.278614 #844344] INFO -- : Extracting bundle gem power_assert-2.0.3... I, [2024-05-17T08:01:36.284122 #844344] INFO -- : make[1]: Entering directory '/home/opc/ruby/build/master' I, [2024-05-17T08:01:36.284173 #844344] INFO -- : make[1]: Nothing to be done for 'enc'. I, [2024-05-17T08:01:36.284184 #844344] INFO -- : make[1]: Leaving directory '/home/opc/ruby/build/master' I, [2024-05-17T08:01:36.299142 #844344] INFO -- : make[1]: Entering directory '/home/opc/ruby/build/master' I, [2024-05-17T08:01:36.299199 #844344] INFO -- : make[1]: Nothing to be done for 'srcs'. I, [2024-05-17T08:01:36.299210 #844344] INFO -- : make[1]: Leaving directory '/home/opc/ruby/build/master' I, [2024-05-17T08:01:36.299977 #844344] INFO -- : generating transdb.h I, [2024-05-17T08:01:36.376988 #844344] INFO -- : Try with hash version of bundled gems instead of gems/power_assert-2.0.3.gem. We don't use this gem with release version of Ruby. I, [2024-05-17T08:01:36.388171 #844344] INFO -- : Unpacked gems/power_assert-2.0.4dev.gem I, [2024-05-17T08:01:36.443755 #844344] INFO -- : transdb.h unchanged I, [2024-05-17T08:01:36.445263 #844344] INFO -- : generating makefiles ext/configure-ext.mk I, [2024-05-17T08:01:36.445307 #844344] INFO -- : making trans I, [2024-05-17T08:01:36.485045 #844344] INFO -- : ext/configure-ext.mk unchanged I, [2024-05-17T08:01:36.488101 #844344] INFO -- : make[1]: Entering directory '/home/opc/ruby/build/master' I, [2024-05-17T08:01:36.494141 #844344] INFO -- : make[1]: Entering directory '/home/opc/ruby/build/master' I, [2024-05-17T08:01:36.494198 #844344] INFO -- : make[1]: Nothing to be done for 'trans'. I, [2024-05-17T08:01:36.494208 #844344] INFO -- : make[1]: Leaving directory '/home/opc/ruby/build/master' I, [2024-05-17T08:01:36.793926 #844344] INFO -- : making encs I, [2024-05-17T08:01:36.847034 #844344] INFO -- : make[1]: Entering directory '/home/opc/ruby/build/master' I, [2024-05-17T08:01:36.847122 #844344] INFO -- : make[1]: Nothing to be done for 'encs'. I, [2024-05-17T08:01:36.847159 #844344] INFO -- : make[1]: Leaving directory '/home/opc/ruby/build/master' I, [2024-05-17T08:01:37.269104 #844344] INFO -- : make[1]: Leaving directory '/home/opc/ruby/build/master' I, [2024-05-17T08:01:37.269976 #844344] INFO -- : generating makefile exts.mk I, [2024-05-17T08:01:37.329873 #844344] INFO -- : exts.mk unchanged I, [2024-05-17T08:01:37.335077 #844344] INFO -- : make[1]: Entering directory '/home/opc/ruby/build/master' I, [2024-05-17T08:01:37.438857 #844344] INFO -- : make[2]: Entering directory '/home/opc/ruby/build/master/ext/coverage' I, [2024-05-17T08:01:37.439804 #844344] INFO -- : make[2]: Entering directory '/home/opc/ruby/build/master/ext/digest' I, [2024-05-17T08:01:37.439908 #844344] INFO -- : make[2]: Entering directory '/home/opc/ruby/build/master/ext/date' I, [2024-05-17T08:01:37.443817 #844344] INFO -- : make[2]: Leaving directory '/home/opc/ruby/build/master/ext/coverage' I, [2024-05-17T08:01:37.445374 #844344] INFO -- : make[2]: Leaving directory '/home/opc/ruby/build/master/ext/date' I, [2024-05-17T08:01:37.449334 #844344] INFO -- : make[2]: Leaving directory '/home/opc/ruby/build/master/ext/digest' I, [2024-05-17T08:01:37.453985 #844344] INFO -- : make[2]: Entering directory '/home/opc/ruby/build/master/ext/io/console' I, [2024-05-17T08:01:37.456236 #844344] INFO -- : make[2]: Entering directory '/home/opc/ruby/build/master/ext/fiddle' I, [2024-05-17T08:01:37.458646 #844344] INFO -- : make[2]: Leaving directory '/home/opc/ruby/build/master/ext/io/console' I, [2024-05-17T08:01:37.460822 #844344] INFO -- : make[2]: Entering directory '/home/opc/ruby/build/master/ext/json' I, [2024-05-17T08:01:37.464425 #844344] INFO -- : make[2]: Entering directory '/home/opc/ruby/build/master/ext/monitor' I, [2024-05-17T08:01:37.466353 #844344] INFO -- : make[2]: Leaving directory '/home/opc/ruby/build/master/ext/fiddle' I, [2024-05-17T08:01:37.468640 #844344] INFO -- : make[2]: Leaving directory '/home/opc/ruby/build/master/ext/monitor' I, [2024-05-17T08:01:37.470445 #844344] INFO -- : make[2]: Leaving directory '/home/opc/ruby/build/master/ext/json' I, [2024-05-17T08:01:37.474522 #844344] INFO -- : make[2]: Entering directory '/home/opc/ruby/build/master/ext/pathname' I, [2024-05-17T08:01:37.474564 #844344] INFO -- : make[2]: Entering directory '/home/opc/ruby/build/master/ext/objspace' I, [2024-05-17T08:01:37.480745 #844344] INFO -- : make[2]: Leaving directory '/home/opc/ruby/build/master/ext/objspace' I, [2024-05-17T08:01:37.480800 #844344] INFO -- : make[2]: Leaving directory '/home/opc/ruby/build/master/ext/pathname' I, [2024-05-17T08:01:37.485385 #844344] INFO -- : make[2]: Entering directory '/home/opc/ruby/build/master/ext/pty' I, [2024-05-17T08:01:37.486887 #844344] INFO -- : make[2]: Entering directory '/home/opc/ruby/build/master/ext/psych' I, [2024-05-17T08:01:37.487888 #844344] INFO -- : make[2]: Entering directory '/home/opc/ruby/build/master/ext/openssl' I, [2024-05-17T08:01:37.494998 #844344] INFO -- : make[2]: Leaving directory '/home/opc/ruby/build/master/ext/pty' I, [2024-05-17T08:01:37.506612 #844344] INFO -- : make[2]: Leaving directory '/home/opc/ruby/build/master/ext/psych' I, [2024-05-17T08:01:37.508787 #844344] INFO -- : make[2]: Entering directory '/home/opc/ruby/build/master/ext/rubyvm' I, [2024-05-17T08:01:37.511952 #844344] INFO -- : make[2]: Leaving directory '/home/opc/ruby/build/master/ext/openssl' I, [2024-05-17T08:01:37.512299 #844344] INFO -- : make[2]: Leaving directory '/home/opc/ruby/build/master/ext/rubyvm' I, [2024-05-17T08:01:37.512840 #844344] INFO -- : make[2]: Entering directory '/home/opc/ruby/build/master/ext/ripper' I, [2024-05-17T08:01:37.520675 #844344] INFO -- : make[2]: Leaving directory '/home/opc/ruby/build/master/ext/ripper' I, [2024-05-17T08:01:37.523303 #844344] INFO -- : make[2]: Entering directory '/home/opc/ruby/build/master/.bundle/gems/bigdecimal-3.1.7/ext/bigdecimal' I, [2024-05-17T08:01:37.524228 #844344] INFO -- : make[2]: Entering directory '/home/opc/ruby/build/master/ext/socket' I, [2024-05-17T08:01:37.527411 #844344] INFO -- : make[2]: Entering directory '/home/opc/ruby/build/master/.bundle/gems/bigdecimal-3.1.8/ext/bigdecimal' I, [2024-05-17T08:01:37.535245 #844344] INFO -- : make[2]: Leaving directory '/home/opc/ruby/build/master/ext/socket' I, [2024-05-17T08:01:37.537783 #844344] INFO -- : make[2]: Entering directory '/home/opc/ruby/build/master/.bundle/gems/debug-1.9.2/ext/debug' I, [2024-05-17T08:01:37.554377 #844344] INFO -- : make[2]: Leaving directory '/home/opc/ruby/build/master/.bundle/gems/bigdecimal-3.1.7/ext/bigdecimal' I, [2024-05-17T08:01:37.556758 #844344] INFO -- : make[2]: Entering directory '/home/opc/ruby/build/master/.bundle/gems/nkf-0.2.0/ext/nkf' I, [2024-05-17T08:01:37.558714 #844344] INFO -- : make[2]: Leaving directory '/home/opc/ruby/build/master/.bundle/gems/bigdecimal-3.1.8/ext/bigdecimal' I, [2024-05-17T08:01:37.561175 #844344] INFO -- : make[2]: Entering directory '/home/opc/ruby/build/master/.bundle/gems/racc-1.7.3/ext/racc/cparse' I, [2024-05-17T08:01:37.570420 #844344] INFO -- : make[2]: Leaving directory '/home/opc/ruby/build/master/.bundle/gems/debug-1.9.2/ext/debug' I, [2024-05-17T08:01:37.573312 #844344] INFO -- : make[2]: Entering directory '/home/opc/ruby/build/master/.bundle/gems/rbs-3.4.4/ext/rbs_extension' I, [2024-05-17T08:01:37.588697 #844344] INFO -- : make[2]: Leaving directory '/home/opc/ruby/build/master/.bundle/gems/nkf-0.2.0/ext/nkf' I, [2024-05-17T08:01:37.591486 #844344] INFO -- : make[2]: Entering directory '/home/opc/ruby/build/master/.bundle/gems/syslog-0.1.2/ext/syslog' I, [2024-05-17T08:01:37.595336 #844344] INFO -- : make[2]: Leaving directory '/home/opc/ruby/build/master/.bundle/gems/racc-1.7.3/ext/racc/cparse' I, [2024-05-17T08:01:37.608306 #844344] INFO -- : make[2]: Leaving directory '/home/opc/ruby/build/master/.bundle/gems/rbs-3.4.4/ext/rbs_extension' I, [2024-05-17T08:01:37.613869 #844344] INFO -- : make[2]: Entering directory '/home/opc/ruby/build/master/ext/digest/sha2' I, [2024-05-17T08:01:37.618804 #844344] INFO -- : make[2]: Leaving directory '/home/opc/ruby/build/master/ext/digest/sha2' I, [2024-05-17T08:01:37.622468 #844344] INFO -- : make[2]: Leaving directory '/home/opc/ruby/build/master/.bundle/gems/syslog-0.1.2/ext/syslog' I, [2024-05-17T08:01:37.660299 #844344] INFO -- : make[2]: Entering directory '/home/opc/ruby/build/master' I, [2024-05-17T08:01:37.744513 #844344] INFO -- : make[2]: 'ruby' is up to date. I, [2024-05-17T08:01:37.744588 #844344] INFO -- : make[2]: Leaving directory '/home/opc/ruby/build/master' I, [2024-05-17T08:01:37.744829 #844344] INFO -- : make[1]: Leaving directory '/home/opc/ruby/build/master' I, [2024-05-17T08:01:37.749358 #844344] INFO -- : make[1]: Entering directory '/home/opc/ruby/build/master' I, [2024-05-17T08:01:37.749407 #844344] INFO -- : make[1]: Nothing to be done for 'note'. I, [2024-05-17T08:01:37.749418 #844344] INFO -- : make[1]: Leaving directory '/home/opc/ruby/build/master' I, [2024-05-17T08:01:37.749596 #844344] INFO -- : ./miniruby -I/home/opc/ruby/src/master/lib -I. -I.ext/common /home/opc/ruby/src/master/tool/runruby.rb --extout=.ext -- --disable-gems -r./aarch64-linux-fake /home/opc/ruby/src/master/tool/rbinstall.rb --make="make" --dest-dir="" --extout=".ext" --ext-build-dir="./ext" --mflags="-j3 --jobserver-auth=4,5" --make-flags=" -j3 --jobserver-auth=4,5" --data-mode=0644 --prog-mode=0755 --installed-list .installed.list --mantype="doc" --gnumake --install=all --exclude=doc I, [2024-05-17T08:01:37.903809 #844344] INFO -- : Installing to I, [2024-05-17T08:01:37.903880 #844344] INFO -- : installing binary commands: /home/opc/ruby/install/master/bin I, [2024-05-17T08:01:37.915818 #844344] INFO -- : installing base libraries: /home/opc/ruby/install/master/lib I, [2024-05-17T08:01:37.916365 #844344] INFO -- : installing arch files: /home/opc/ruby/install/master/lib/ruby/3.4.0+0/aarch64-linux I, [2024-05-17T08:01:37.916524 #844344] INFO -- : installing pkgconfig data: /home/opc/ruby/install/master/lib/pkgconfig I, [2024-05-17T08:01:37.916578 #844344] INFO -- : installing extension objects: /home/opc/ruby/install/master/lib/ruby/3.4.0+0/aarch64-linux I, [2024-05-17T08:01:37.929265 #844344] INFO -- : installing extension objects: /home/opc/ruby/install/master/lib/ruby/site_ruby/3.4.0+0/aarch64-linux I, [2024-05-17T08:01:37.929311 #844344] INFO -- : installing extension objects: /home/opc/ruby/install/master/lib/ruby/vendor_ruby/3.4.0+0/aarch64-linux I, [2024-05-17T08:01:37.929543 #844344] INFO -- : installing extension headers: /home/opc/ruby/install/master/include/ruby-3.4.0+0/aarch64-linux I, [2024-05-17T08:01:37.929836 #844344] INFO -- : installing extension scripts: /home/opc/ruby/install/master/lib/ruby/3.4.0+0 I, [2024-05-17T08:01:37.937708 #844344] INFO -- : installing extension scripts: /home/opc/ruby/install/master/lib/ruby/site_ruby/3.4.0+0 I, [2024-05-17T08:01:37.937730 #844344] INFO -- : installing extension scripts: /home/opc/ruby/install/master/lib/ruby/vendor_ruby/3.4.0+0 I, [2024-05-17T08:01:37.937741 #844344] INFO -- : installing extension headers: /home/opc/ruby/install/master/include/ruby-3.4.0+0/ruby I, [2024-05-17T08:01:37.937856 #844344] INFO -- : installing command scripts: /home/opc/ruby/install/master/bin I, [2024-05-17T08:01:37.937995 #844344] INFO -- : installing library scripts: /home/opc/ruby/install/master/lib/ruby/3.4.0+0 I, [2024-05-17T08:01:38.021557 #844344] INFO -- : installing common headers: /home/opc/ruby/install/master/include/ruby-3.4.0+0 I, [2024-05-17T08:01:38.033487 #844344] INFO -- : installing manpages: /home/opc/ruby/install/master/share/man/man1 I, [2024-05-17T08:01:38.033771 #844344] INFO -- : installing default gems from lib: /home/opc/ruby/install/master/lib/ruby/gems/3.4.0+0 I, [2024-05-17T08:01:38.080401 #844344] INFO -- : benchmark 0.3.0 I, [2024-05-17T08:01:38.084425 #844344] INFO -- : bundler 2.6.0.dev I, [2024-05-17T08:01:38.089148 #844344] INFO -- : cgi 0.4.1 I, [2024-05-17T08:01:38.090312 #844344] INFO -- : delegate 0.3.1 I, [2024-05-17T08:01:38.091427 #844344] INFO -- : did_you_mean 1.6.3 I, [2024-05-17T08:01:38.092621 #844344] INFO -- : english 0.8.0 I, [2024-05-17T08:01:38.095057 #844344] INFO -- : erb 4.0.4 I, [2024-05-17T08:01:38.097986 #844344] INFO -- : error_highlight 0.6.0 I, [2024-05-17T08:01:38.099088 #844344] INFO -- : fileutils 1.7.2 I, [2024-05-17T08:01:38.100171 #844344] INFO -- : find 0.2.0 I, [2024-05-17T08:01:38.101361 #844344] INFO -- : forwardable 1.3.3 I, [2024-05-17T08:01:38.102457 #844344] INFO -- : ipaddr 1.2.6 I, [2024-05-17T08:01:38.103534 #844344] INFO -- : irb 1.13.1 I, [2024-05-17T08:01:38.106227 #844344] INFO -- : logger 1.6.0 I, [2024-05-17T08:01:38.107324 #844344] INFO -- : net-http 0.4.1 I, [2024-05-17T08:01:38.108471 #844344] INFO -- : net-protocol 0.2.2 I, [2024-05-17T08:01:38.109721 #844344] INFO -- : open-uri 0.4.1 I, [2024-05-17T08:01:38.110855 #844344] INFO -- : open3 0.2.1 I, [2024-05-17T08:01:38.111987 #844344] INFO -- : optparse 0.5.0 I, [2024-05-17T08:01:38.113204 #844344] INFO -- : ostruct 0.6.0 I, [2024-05-17T08:01:38.114280 #844344] INFO -- : pp 0.5.0 I, [2024-05-17T08:01:38.115421 #844344] INFO -- : prettyprint 0.2.0 I, [2024-05-17T08:01:38.116523 #844344] INFO -- : prism 0.29.0 I, [2024-05-17T08:01:38.117792 #844344] INFO -- : pstore 0.1.3 I, [2024-05-17T08:01:38.118881 #844344] INFO -- : rdoc 6.6.3.1 I, [2024-05-17T08:01:38.122617 #844344] INFO -- : readline 0.0.4 I, [2024-05-17T08:01:38.123746 #844344] INFO -- : reline 0.5.7 I, [2024-05-17T08:01:38.124942 #844344] INFO -- : resolv 0.4.0 I, [2024-05-17T08:01:38.126107 #844344] INFO -- : ruby2_keywords 0.0.5 I, [2024-05-17T08:01:38.128623 #844344] INFO -- : securerandom 0.3.1 I, [2024-05-17T08:01:38.130147 #844344] INFO -- : set 1.1.0 I, [2024-05-17T08:01:38.131258 #844344] INFO -- : shellwords 0.2.0 I, [2024-05-17T08:01:38.132370 #844344] INFO -- : singleton 0.2.0 I, [2024-05-17T08:01:38.133544 #844344] INFO -- : syntax_suggest 2.0.0 I, [2024-05-17T08:01:38.136084 #844344] INFO -- : tempfile 0.2.1 I, [2024-05-17T08:01:38.137248 #844344] INFO -- : time 0.3.0 I, [2024-05-17T08:01:38.138403 #844344] INFO -- : timeout 0.4.1 I, [2024-05-17T08:01:38.139513 #844344] INFO -- : tmpdir 0.2.0 I, [2024-05-17T08:01:38.140912 #844344] INFO -- : tsort 0.2.0 I, [2024-05-17T08:01:38.142059 #844344] INFO -- : un 0.3.0 I, [2024-05-17T08:01:38.143142 #844344] INFO -- : uri 0.13.0 I, [2024-05-17T08:01:38.144377 #844344] INFO -- : weakref 0.1.3 I, [2024-05-17T08:01:38.145555 #844344] INFO -- : yaml 0.3.0 I, [2024-05-17T08:01:38.146445 #844344] INFO -- : installing default gems from ext: /home/opc/ruby/install/master/lib/ruby/gems/3.4.0+0 I, [2024-05-17T08:01:38.156145 #844344] INFO -- : date 3.3.4 I, [2024-05-17T08:01:38.159542 #844344] INFO -- : digest 3.1.1 I, [2024-05-17T08:01:38.160739 #844344] INFO -- : etc 1.4.3 I, [2024-05-17T08:01:38.161991 #844344] INFO -- : fcntl 1.1.0 I, [2024-05-17T08:01:38.163125 #844344] INFO -- : fiddle 1.1.3 I, [2024-05-17T08:01:38.164290 #844344] INFO -- : io-console 0.7.2 I, [2024-05-17T08:01:38.165567 #844344] INFO -- : io-nonblock 0.3.0 I, [2024-05-17T08:01:38.166692 #844344] INFO -- : io-wait 0.3.1 I, [2024-05-17T08:01:38.167812 #844344] INFO -- : json 2.7.2 I, [2024-05-17T08:01:38.169538 #844344] INFO -- : openssl 3.2.0 I, [2024-05-17T08:01:38.170711 #844344] INFO -- : pathname 0.3.0 I, [2024-05-17T08:01:38.172081 #844344] INFO -- : psych 5.1.2 I, [2024-05-17T08:01:38.173500 #844344] INFO -- : stringio 3.1.1 I, [2024-05-17T08:01:38.174668 #844344] INFO -- : strscan 3.1.1 I, [2024-05-17T08:01:38.175796 #844344] INFO -- : zlib 3.1.0 I, [2024-05-17T08:01:38.176747 #844344] INFO -- : installing bundled gems: /home/opc/ruby/install/master/lib/ruby/gems/3.4.0+0 I, [2024-05-17T08:01:38.177453 #844344] INFO -- : minitest 5.22.3 I, [2024-05-17T08:01:38.192107 #844344] INFO -- : rake 13.2.1 I, [2024-05-17T08:01:38.206537 #844344] INFO -- : test-unit 3.6.2 I, [2024-05-17T08:01:38.220745 #844344] INFO -- : rexml 3.2.6 I, [2024-05-17T08:01:38.238008 #844344] INFO -- : rss 0.3.0 I, [2024-05-17T08:01:38.247992 #844344] INFO -- : net-ftp 0.3.4 I, [2024-05-17T08:01:38.252027 #844344] INFO -- : net-imap 0.4.11 I, [2024-05-17T08:01:38.268301 #844344] INFO -- : net-pop 0.1.2 I, [2024-05-17T08:01:38.271237 #844344] INFO -- : net-smtp 0.5.0 I, [2024-05-17T08:01:38.274777 #844344] INFO -- : matrix 0.4.2 I, [2024-05-17T08:01:38.283375 #844344] INFO -- : prime 0.1.2 I, [2024-05-17T08:01:38.292358 #844344] INFO -- : rbs 3.4.4 I, [2024-05-17T08:01:38.392915 #844344] INFO -- : typeprof 0.21.11 I, [2024-05-17T08:01:38.401360 #844344] INFO -- : debug 1.9.2 I, [2024-05-17T08:01:38.412831 #844344] INFO -- : racc 1.7.3 I, [2024-05-17T08:01:38.422597 #844344] INFO -- : mutex_m 0.2.0 I, [2024-05-17T08:01:38.425931 #844344] INFO -- : getoptlong 0.2.1 I, [2024-05-17T08:01:38.430591 #844344] INFO -- : base64 0.2.0 I, [2024-05-17T08:01:38.433092 #844344] INFO -- : bigdecimal 3.1.8 I, [2024-05-17T08:01:38.439308 #844344] INFO -- : observer 0.1.2 I, [2024-05-17T08:01:38.443786 #844344] INFO -- : abbrev 0.1.2 I, [2024-05-17T08:01:38.446723 #844344] INFO -- : resolv-replace 0.1.1 I, [2024-05-17T08:01:38.450322 #844344] INFO -- : rinda 0.2.0 I, [2024-05-17T08:01:38.453827 #844344] INFO -- : drb 2.2.1 I, [2024-05-17T08:01:38.458605 #844344] INFO -- : nkf 0.2.0 I, [2024-05-17T08:01:38.465277 #844344] INFO -- : syslog 0.1.2 I, [2024-05-17T08:01:38.469910 #844344] INFO -- : csv 3.3.0 I, [2024-05-17T08:01:38.480299 #844344] INFO -- : installing bundled gem cache: /home/opc/ruby/install/master/lib/ruby/gems/3.4.0+0/cache I, [2024-05-17T08:01:38.482159 #844344] INFO -- : skipped bundled gems: I, [2024-05-17T08:01:38.482188 #844344] INFO -- : power_assert-2.0.4dev.gem not found in bundled_gems I, [2024-05-17T08:01:38.485112 #844344] INFO -- : $$$[end] "make install -j3" exit with 0. I, [2024-05-17T08:01:38.485351 #844344] INFO -- : $$$[beg] make yes-btest TESTOPTS='-q -j3' I, [2024-05-17T08:02:01.327280 #844344] INFO -- : PASS all 1936 tests E, [2024-05-17T08:02:01.329114 #844344] ERROR -- : I, [2024-05-17T08:02:01.329249 #844344] INFO -- : $$$[end] "make yes-btest TESTOPTS='-q -j3'" exit with 0. I, [2024-05-17T08:02:01.329490 #844344] INFO -- : $$$[beg] make yes-test-basic TESTS='-j3' I, [2024-05-17T08:02:01.422410 #844344] INFO -- : BASERUBY = /usr/local/bin/ruby --disable=gems I, [2024-05-17T08:02:01.422487 #844344] INFO -- : CC = gcc I, [2024-05-17T08:02:01.422498 #844344] INFO -- : LD = ld I, [2024-05-17T08:02:01.423979 #844344] INFO -- : LDSHARED = gcc -shared I, [2024-05-17T08:02:01.423999 #844344] INFO -- : CFLAGS = -O3 -fno-fast-math -ggdb3 -Wall -Wextra -Wdeprecated-declarations -Wdiv-by-zero -Wduplicated-cond -Wimplicit-function-declaration -Wimplicit-int -Wpointer-arith -Wwrite-strings -Wold-style-definition -Wimplicit-fallthrough=0 -Wmissing-noreturn -Wno-cast-function-type -Wno-constant-logical-operand -Wno-long-long -Wno-missing-field-initializers -Wno-overlength-strings -Wno-packed-bitfield-compat -Wno-parentheses-equality -Wno-self-assign -Wno-tautological-compare -Wno-unused-parameter -Wno-unused-value -Wsuggest-attribute=format -Wsuggest-attribute=noreturn -Wunused-variable -Wmisleading-indentation -Wundef I, [2024-05-17T08:02:01.424025 #844344] INFO -- : XCFLAGS = -U_FORTIFY_SOURCE -D_FORTIFY_SOURCE=2 -fstack-protector-strong -msign-return-address=all -fno-strict-overflow -fvisibility=hidden -fexcess-precision=standard -DRUBY_EXPORT -fPIE -I. -I.ext/include/aarch64-linux -I/home/opc/ruby/src/master/include -I/home/opc/ruby/src/master -I/home/opc/ruby/src/master/prism -I/home/opc/ruby/src/master/enc/unicode/15.0.0 I, [2024-05-17T08:02:01.424034 #844344] INFO -- : CPPFLAGS = I, [2024-05-17T08:02:01.424043 #844344] INFO -- : DLDFLAGS = -Wl,--compress-debug-sections=zlib -fstack-protector-strong -pie I, [2024-05-17T08:02:01.424051 #844344] INFO -- : SOLIBS = -lz -lrt -lrt -ldl -lcrypt -lm -lpthread I, [2024-05-17T08:02:01.424059 #844344] INFO -- : LANG = en_US.UTF-8 I, [2024-05-17T08:02:01.424067 #844344] INFO -- : LC_ALL = I, [2024-05-17T08:02:01.424075 #844344] INFO -- : LC_CTYPE = I, [2024-05-17T08:02:01.424082 #844344] INFO -- : MFLAGS = I, [2024-05-17T08:02:01.424090 #844344] INFO -- : RUSTC = rustc I, [2024-05-17T08:02:01.424097 #844344] INFO -- : YJIT_RUSTC_ARGS = --crate-name=yjit --crate-type=staticlib --edition=2021 -g -C lto=thin -C opt-level=3 -C overflow-checks=on '--out-dir=/home/opc/ruby/build/master/yjit/target/release/' /home/opc/ruby/src/master/yjit/src/lib.rs I, [2024-05-17T08:02:01.424885 #844344] INFO -- : gcc (GCC) 8.5.0 20210514 (Red Hat 8.5.0-10.1.0.1) I, [2024-05-17T08:02:01.424930 #844344] INFO -- : Copyright (C) 2018 Free Software Foundation, Inc. I, [2024-05-17T08:02:01.424940 #844344] INFO -- : This is free software; see the source for copying conditions. There is NO I, [2024-05-17T08:02:01.424949 #844344] INFO -- : warranty; not even for MERCHANTABILITY or FITNESS FOR A PARTICULAR PURPOSE. I, [2024-05-17T08:02:01.424958 #844344] INFO -- : I, [2024-05-17T08:02:01.579734 #844344] INFO -- : Checking leaked global symbols...none I, [2024-05-17T08:02:01.631760 #844344] INFO -- : /home/opc/ruby/src/master/basictest/test.rb:assignment ....................................................................................................................................................................................................................................................................................................................................................................................OK 372 I, [2024-05-17T08:02:01.631832 #844344] INFO -- : /home/opc/ruby/src/master/basictest/test.rb:condition ..OK 2 I, [2024-05-17T08:02:01.631858 #844344] INFO -- : /home/opc/ruby/src/master/basictest/test.rb:if/unless ...OK 3 I, [2024-05-17T08:02:01.631904 #844344] INFO -- : /home/opc/ruby/src/master/basictest/test.rb:case .....OK 5 I, [2024-05-17T08:02:01.632457 #844344] INFO -- : /home/opc/ruby/src/master/basictest/test.rb:while/until ........OK 8 I, [2024-05-17T08:02:01.632591 #844344] INFO -- : /home/opc/ruby/src/master/basictest/test.rb:exception ..........OK 10 I, [2024-05-17T08:02:01.633226 #844344] INFO -- : /home/opc/ruby/src/master/basictest/test.rb:array .......................................OK 39 I, [2024-05-17T08:02:01.633483 #844344] INFO -- : /home/opc/ruby/src/master/basictest/test.rb:hash ...........................OK 27 I, [2024-05-17T08:02:01.635112 #844344] INFO -- : /home/opc/ruby/src/master/basictest/test.rb:iterator ...........................................................................................................OK 107 I, [2024-05-17T08:02:01.635840 #844344] INFO -- : /home/opc/ruby/src/master/basictest/test.rb:float ................................................................................OK 80 I, [2024-05-17T08:02:01.639481 #844344] INFO -- : /home/opc/ruby/src/master/basictest/test.rb:bignum ...............................OK 31 I, [2024-05-17T08:02:01.641054 #844344] INFO -- : /home/opc/ruby/src/master/basictest/test.rb:string & char ..............................................................OK 62 I, [2024-05-17T08:02:01.641152 #844344] INFO -- : /home/opc/ruby/src/master/basictest/test.rb:assignment ..........OK 10 I, [2024-05-17T08:02:01.641222 #844344] INFO -- : /home/opc/ruby/src/master/basictest/test.rb:call ......OK 6 I, [2024-05-17T08:02:01.641342 #844344] INFO -- : /home/opc/ruby/src/master/basictest/test.rb:proc .........OK 9 I, [2024-05-17T08:02:01.741588 #844344] INFO -- : /home/opc/ruby/src/master/basictest/test.rb:signal ..OK 2 I, [2024-05-17T08:02:01.743352 #844344] INFO -- : /home/opc/ruby/src/master/basictest/test.rb:eval ...........................OK 27 I, [2024-05-17T08:02:01.882469 #844344] INFO -- : /home/opc/ruby/src/master/basictest/test.rb:system ........OK 8 I, [2024-05-17T08:02:01.882535 #844344] INFO -- : /home/opc/ruby/src/master/basictest/test.rb:const .....OK 5 I, [2024-05-17T08:02:01.882546 #844344] INFO -- : /home/opc/ruby/src/master/basictest/test.rb:clone .....OK 5 I, [2024-05-17T08:02:01.882555 #844344] INFO -- : /home/opc/ruby/src/master/basictest/test.rb:marshal ....OK 4 I, [2024-05-17T08:02:01.882568 #844344] INFO -- : /home/opc/ruby/src/master/basictest/test.rb:pack ....OK 4 I, [2024-05-17T08:02:01.882576 #844344] INFO -- : /home/opc/ruby/src/master/basictest/test.rb:math ..OK 2 I, [2024-05-17T08:02:01.882584 #844344] INFO -- : /home/opc/ruby/src/master/basictest/test.rb:struct ......OK 6 I, [2024-05-17T08:02:01.882593 #844344] INFO -- : /home/opc/ruby/src/master/basictest/test.rb:variable ............OK 12 I, [2024-05-17T08:02:01.882603 #844344] INFO -- : /home/opc/ruby/src/master/basictest/test.rb:trace ...OK 3 I, [2024-05-17T08:02:01.882611 #844344] INFO -- : /home/opc/ruby/src/master/basictest/test.rb:defined? ............OK 12 I, [2024-05-17T08:02:01.882619 #844344] INFO -- : /home/opc/ruby/src/master/basictest/test.rb:alias ......OK 6 I, [2024-05-17T08:02:01.882627 #844344] INFO -- : /home/opc/ruby/src/master/basictest/test.rb:path .......................OK 23 I, [2024-05-17T08:02:01.947557 #844344] INFO -- : /home/opc/ruby/src/master/basictest/test.rb:gc ....OK 4 I, [2024-05-17T08:02:01.949553 #844344] INFO -- : I, [2024-05-17T08:02:01.949595 #844344] INFO -- : test succeeded I, [2024-05-17T08:02:01.950116 #844344] INFO -- : $$$[end] "make yes-test-basic TESTS='-j3'" exit with 0. I, [2024-05-17T08:02:01.950322 #844344] INFO -- : $$$[beg] make yes-test-all TESTOPTS='--stderr-on-failure' TESTS='-j3' I, [2024-05-17T08:02:02.073836 #844344] INFO -- : BASERUBY = /usr/local/bin/ruby --disable=gems I, [2024-05-17T08:02:02.073911 #844344] INFO -- : CC = gcc I, [2024-05-17T08:02:02.073922 #844344] INFO -- : LD = ld I, [2024-05-17T08:02:02.073931 #844344] INFO -- : LDSHARED = gcc -shared I, [2024-05-17T08:02:02.073942 #844344] INFO -- : CFLAGS = -O3 -fno-fast-math -ggdb3 -Wall -Wextra -Wdeprecated-declarations -Wdiv-by-zero -Wduplicated-cond -Wimplicit-function-declaration -Wimplicit-int -Wpointer-arith -Wwrite-strings -Wold-style-definition -Wimplicit-fallthrough=0 -Wmissing-noreturn -Wno-cast-function-type -Wno-constant-logical-operand -Wno-long-long -Wno-missing-field-initializers -Wno-overlength-strings -Wno-packed-bitfield-compat -Wno-parentheses-equality -Wno-self-assign -Wno-tautological-compare -Wno-unused-parameter -Wno-unused-value -Wsuggest-attribute=format -Wsuggest-attribute=noreturn -Wunused-variable -Wmisleading-indentation -Wundef I, [2024-05-17T08:02:02.073952 #844344] INFO -- : XCFLAGS = -U_FORTIFY_SOURCE -D_FORTIFY_SOURCE=2 -fstack-protector-strong -msign-return-address=all -fno-strict-overflow -fvisibility=hidden -fexcess-precision=standard -DRUBY_EXPORT -fPIE -I. -I.ext/include/aarch64-linux -I/home/opc/ruby/src/master/include -I/home/opc/ruby/src/master -I/home/opc/ruby/src/master/prism -I/home/opc/ruby/src/master/enc/unicode/15.0.0 I, [2024-05-17T08:02:02.073961 #844344] INFO -- : CPPFLAGS = I, [2024-05-17T08:02:02.073969 #844344] INFO -- : DLDFLAGS = -Wl,--compress-debug-sections=zlib -fstack-protector-strong -pie I, [2024-05-17T08:02:02.073979 #844344] INFO -- : SOLIBS = -lz -lrt -lrt -ldl -lcrypt -lm -lpthread I, [2024-05-17T08:02:02.073988 #844344] INFO -- : LANG = en_US.UTF-8 I, [2024-05-17T08:02:02.073997 #844344] INFO -- : LC_ALL = I, [2024-05-17T08:02:02.074005 #844344] INFO -- : LC_CTYPE = I, [2024-05-17T08:02:02.074013 #844344] INFO -- : MFLAGS = I, [2024-05-17T08:02:02.074021 #844344] INFO -- : RUSTC = rustc I, [2024-05-17T08:02:02.074029 #844344] INFO -- : YJIT_RUSTC_ARGS = --crate-name=yjit --crate-type=staticlib --edition=2021 -g -C lto=thin -C opt-level=3 -C overflow-checks=on '--out-dir=/home/opc/ruby/build/master/yjit/target/release/' /home/opc/ruby/src/master/yjit/src/lib.rs I, [2024-05-17T08:02:02.074704 #844344] INFO -- : gcc (GCC) 8.5.0 20210514 (Red Hat 8.5.0-10.1.0.1) I, [2024-05-17T08:02:02.074720 #844344] INFO -- : Copyright (C) 2018 Free Software Foundation, Inc. I, [2024-05-17T08:02:02.074730 #844344] INFO -- : This is free software; see the source for copying conditions. There is NO I, [2024-05-17T08:02:02.074738 #844344] INFO -- : warranty; not even for MERCHANTABILITY or FITNESS FOR A PARTICULAR PURPOSE. I, [2024-05-17T08:02:02.074747 #844344] INFO -- : I, [2024-05-17T08:02:02.076678 #844344] INFO -- : generating enc.mk I, [2024-05-17T08:02:02.314468 #844344] INFO -- : generating encdb.h I, [2024-05-17T08:02:02.351123 #844344] INFO -- : encdb.h unchanged I, [2024-05-17T08:02:02.352307 #844344] INFO -- : making enc I, [2024-05-17T08:02:02.379757 #844344] INFO -- : make[1]: Entering directory '/home/opc/ruby/build/master' I, [2024-05-17T08:02:02.379823 #844344] INFO -- : make[1]: Nothing to be done for 'enc'. I, [2024-05-17T08:02:02.379835 #844344] INFO -- : make[1]: Leaving directory '/home/opc/ruby/build/master' I, [2024-05-17T08:02:02.380632 #844344] INFO -- : making srcs under enc I, [2024-05-17T08:02:02.422380 #844344] INFO -- : make[1]: Entering directory '/home/opc/ruby/build/master' I, [2024-05-17T08:02:02.422426 #844344] INFO -- : make[1]: Nothing to be done for 'srcs'. I, [2024-05-17T08:02:02.422437 #844344] INFO -- : make[1]: Leaving directory '/home/opc/ruby/build/master' I, [2024-05-17T08:02:02.423617 #844344] INFO -- : generating transdb.h I, [2024-05-17T08:02:02.566943 #844344] INFO -- : transdb.h unchanged I, [2024-05-17T08:02:02.568311 #844344] INFO -- : making trans I, [2024-05-17T08:02:02.616906 #844344] INFO -- : make[1]: Entering directory '/home/opc/ruby/build/master' I, [2024-05-17T08:02:02.616966 #844344] INFO -- : make[1]: Nothing to be done for 'trans'. I, [2024-05-17T08:02:02.616977 #844344] INFO -- : make[1]: Leaving directory '/home/opc/ruby/build/master' I, [2024-05-17T08:02:02.617839 #844344] INFO -- : making encs I, [2024-05-17T08:02:02.670321 #844344] INFO -- : make[1]: Entering directory '/home/opc/ruby/build/master' I, [2024-05-17T08:02:02.670395 #844344] INFO -- : make[1]: Nothing to be done for 'encs'. I, [2024-05-17T08:02:02.670405 #844344] INFO -- : make[1]: Leaving directory '/home/opc/ruby/build/master' I, [2024-05-17T08:02:02.672428 #844344] INFO -- : generating makefiles ext/configure-ext.mk I, [2024-05-17T08:02:02.712678 #844344] INFO -- : ext/configure-ext.mk updated I, [2024-05-17T08:02:02.715839 #844344] INFO -- : make[1]: Entering directory '/home/opc/ruby/build/master' I, [2024-05-17T08:02:04.827753 #844344] INFO -- : make[1]: Leaving directory '/home/opc/ruby/build/master' I, [2024-05-17T08:02:04.828442 #844344] INFO -- : generating makefile exts.mk I, [2024-05-17T08:02:04.887170 #844344] INFO -- : exts.mk unchanged I, [2024-05-17T08:02:04.891974 #844344] INFO -- : make[1]: Entering directory '/home/opc/ruby/build/master' I, [2024-05-17T08:02:05.187149 #844344] INFO -- : make[2]: Entering directory '/home/opc/ruby/build/master/ext/coverage' I, [2024-05-17T08:02:05.191736 #844344] INFO -- : make[2]: Leaving directory '/home/opc/ruby/build/master/ext/coverage' I, [2024-05-17T08:02:05.197335 #844344] INFO -- : make[2]: Entering directory '/home/opc/ruby/build/master/ext/date' I, [2024-05-17T08:02:05.202514 #844344] INFO -- : make[2]: Leaving directory '/home/opc/ruby/build/master/ext/date' I, [2024-05-17T08:02:05.205923 #844344] INFO -- : make[2]: Entering directory '/home/opc/ruby/build/master/ext/digest' I, [2024-05-17T08:02:05.214578 #844344] INFO -- : make[2]: Leaving directory '/home/opc/ruby/build/master/ext/digest' I, [2024-05-17T08:02:05.237781 #844344] INFO -- : make[2]: Entering directory '/home/opc/ruby/build/master/ext/digest/sha2' I, [2024-05-17T08:02:05.242668 #844344] INFO -- : make[2]: Leaving directory '/home/opc/ruby/build/master/ext/digest/sha2' I, [2024-05-17T08:02:05.261325 #844344] INFO -- : make[2]: Entering directory '/home/opc/ruby/build/master/ext/fiddle' I, [2024-05-17T08:02:05.271706 #844344] INFO -- : make[2]: Leaving directory '/home/opc/ruby/build/master/ext/fiddle' I, [2024-05-17T08:02:05.276066 #844344] INFO -- : make[2]: Entering directory '/home/opc/ruby/build/master/ext/io/console' I, [2024-05-17T08:02:05.280417 #844344] INFO -- : make[2]: Leaving directory '/home/opc/ruby/build/master/ext/io/console' I, [2024-05-17T08:02:05.291354 #844344] INFO -- : make[2]: Entering directory '/home/opc/ruby/build/master/ext/json' I, [2024-05-17T08:02:05.300686 #844344] INFO -- : make[2]: Leaving directory '/home/opc/ruby/build/master/ext/json' I, [2024-05-17T08:02:05.313873 #844344] INFO -- : make[2]: Entering directory '/home/opc/ruby/build/master/ext/monitor' I, [2024-05-17T08:02:05.318159 #844344] INFO -- : make[2]: Leaving directory '/home/opc/ruby/build/master/ext/monitor' I, [2024-05-17T08:02:05.324119 #844344] INFO -- : make[2]: Entering directory '/home/opc/ruby/build/master/ext/objspace' I, [2024-05-17T08:02:05.330044 #844344] INFO -- : make[2]: Leaving directory '/home/opc/ruby/build/master/ext/objspace' I, [2024-05-17T08:02:05.349339 #844344] INFO -- : make[2]: Entering directory '/home/opc/ruby/build/master/ext/openssl' I, [2024-05-17T08:02:05.370906 #844344] INFO -- : make[2]: Leaving directory '/home/opc/ruby/build/master/ext/openssl' I, [2024-05-17T08:02:05.375118 #844344] INFO -- : make[2]: Entering directory '/home/opc/ruby/build/master/ext/pathname' I, [2024-05-17T08:02:05.379340 #844344] INFO -- : make[2]: Leaving directory '/home/opc/ruby/build/master/ext/pathname' I, [2024-05-17T08:02:05.385532 #844344] INFO -- : make[2]: Entering directory '/home/opc/ruby/build/master/ext/psych' I, [2024-05-17T08:02:05.406839 #844344] INFO -- : make[2]: Leaving directory '/home/opc/ruby/build/master/ext/psych' I, [2024-05-17T08:02:05.411355 #844344] INFO -- : make[2]: Entering directory '/home/opc/ruby/build/master/ext/pty' I, [2024-05-17T08:02:05.415616 #844344] INFO -- : make[2]: Leaving directory '/home/opc/ruby/build/master/ext/pty' I, [2024-05-17T08:02:05.429067 #844344] INFO -- : make[2]: Entering directory '/home/opc/ruby/build/master/ext/ripper' I, [2024-05-17T08:02:05.436884 #844344] INFO -- : make[2]: Leaving directory '/home/opc/ruby/build/master/ext/ripper' I, [2024-05-17T08:02:05.438921 #844344] INFO -- : make[2]: Entering directory '/home/opc/ruby/build/master/ext/rubyvm' I, [2024-05-17T08:02:05.442457 #844344] INFO -- : make[2]: Leaving directory '/home/opc/ruby/build/master/ext/rubyvm' I, [2024-05-17T08:02:05.454530 #844344] INFO -- : make[2]: Entering directory '/home/opc/ruby/build/master/ext/socket' I, [2024-05-17T08:02:05.465090 #844344] INFO -- : make[2]: Leaving directory '/home/opc/ruby/build/master/ext/socket' I, [2024-05-17T08:02:05.480689 #844344] INFO -- : make[2]: Entering directory '/home/opc/ruby/build/master/.bundle/gems/bigdecimal-3.1.7/ext/bigdecimal' I, [2024-05-17T08:02:05.511460 #844344] INFO -- : make[2]: Leaving directory '/home/opc/ruby/build/master/.bundle/gems/bigdecimal-3.1.7/ext/bigdecimal' I, [2024-05-17T08:02:05.514125 #844344] INFO -- : make[2]: Entering directory '/home/opc/ruby/build/master/.bundle/gems/bigdecimal-3.1.8/ext/bigdecimal' I, [2024-05-17T08:02:05.544930 #844344] INFO -- : make[2]: Leaving directory '/home/opc/ruby/build/master/.bundle/gems/bigdecimal-3.1.8/ext/bigdecimal' I, [2024-05-17T08:02:05.547482 #844344] INFO -- : make[2]: Entering directory '/home/opc/ruby/build/master/.bundle/gems/debug-1.9.2/ext/debug' I, [2024-05-17T08:02:05.577864 #844344] INFO -- : make[2]: Leaving directory '/home/opc/ruby/build/master/.bundle/gems/debug-1.9.2/ext/debug' I, [2024-05-17T08:02:05.580373 #844344] INFO -- : make[2]: Entering directory '/home/opc/ruby/build/master/.bundle/gems/nkf-0.2.0/ext/nkf' I, [2024-05-17T08:02:05.610451 #844344] INFO -- : make[2]: Leaving directory '/home/opc/ruby/build/master/.bundle/gems/nkf-0.2.0/ext/nkf' I, [2024-05-17T08:02:05.613025 #844344] INFO -- : make[2]: Entering directory '/home/opc/ruby/build/master/.bundle/gems/racc-1.7.3/ext/racc/cparse' I, [2024-05-17T08:02:05.643225 #844344] INFO -- : make[2]: Leaving directory '/home/opc/ruby/build/master/.bundle/gems/racc-1.7.3/ext/racc/cparse' I, [2024-05-17T08:02:05.646286 #844344] INFO -- : make[2]: Entering directory '/home/opc/ruby/build/master/.bundle/gems/rbs-3.4.4/ext/rbs_extension' I, [2024-05-17T08:02:05.676455 #844344] INFO -- : make[2]: Leaving directory '/home/opc/ruby/build/master/.bundle/gems/rbs-3.4.4/ext/rbs_extension' I, [2024-05-17T08:02:05.679039 #844344] INFO -- : make[2]: Entering directory '/home/opc/ruby/build/master/.bundle/gems/syslog-0.1.2/ext/syslog' I, [2024-05-17T08:02:05.709498 #844344] INFO -- : make[2]: Leaving directory '/home/opc/ruby/build/master/.bundle/gems/syslog-0.1.2/ext/syslog' I, [2024-05-17T08:02:05.747460 #844344] INFO -- : make[2]: Entering directory '/home/opc/ruby/build/master' I, [2024-05-17T08:02:05.832097 #844344] INFO -- : make[2]: 'ruby' is up to date. I, [2024-05-17T08:02:05.832188 #844344] INFO -- : make[2]: Leaving directory '/home/opc/ruby/build/master' I, [2024-05-17T08:02:05.832303 #844344] INFO -- : make[1]: Leaving directory '/home/opc/ruby/build/master' I, [2024-05-17T08:02:05.836953 #844344] INFO -- : make[1]: Entering directory '/home/opc/ruby/build/master' I, [2024-05-17T08:02:05.837011 #844344] INFO -- : make[1]: Nothing to be done for 'note'. I, [2024-05-17T08:02:05.837025 #844344] INFO -- : make[1]: Leaving directory '/home/opc/ruby/build/master' I, [2024-05-17T08:02:05.950128 #844344] INFO -- : Run options: I, [2024-05-17T08:02:05.950219 #844344] INFO -- : --seed=5870 I, [2024-05-17T08:02:05.950239 #844344] INFO -- : "--ruby=./miniruby -I/home/opc/ruby/src/master/lib -I. -I.ext/common /home/opc/ruby/src/master/tool/runruby.rb --extout=.ext -- --disable-gems" I, [2024-05-17T08:02:05.950258 #844344] INFO -- : --excludes-dir=/home/opc/ruby/src/master/test/.excludes I, [2024-05-17T08:02:05.950274 #844344] INFO -- : --name=!/memory_leak/ I, [2024-05-17T08:02:05.950290 #844344] INFO -- : --stderr-on-failure I, [2024-05-17T08:02:05.950303 #844344] INFO -- : -j3 I, [2024-05-17T08:02:05.950311 #844344] INFO -- : I, [2024-05-17T08:02:05.950319 #844344] INFO -- : # Running tests: I, [2024-05-17T08:02:05.950328 #844344] INFO -- : I, [2024-05-17T08:02:06.080813 #844344] INFO -- : [ 1/885] 885343=test_gem_package_task I, [2024-05-17T08:02:06.087761 #844344] INFO -- : [ 2/885] 885344=test_lock_native_thread I, [2024-05-17T08:02:06.092537 #844344] INFO -- : [ 3/885] 885345=test_resize I, [2024-05-17T08:02:06.096036 #844344] INFO -- : [ 4/885] 885345=test_win32ole_param I, [2024-05-17T08:02:06.102085 #844344] INFO -- : [ 5/885] 885345=test_key_error I, [2024-05-17T08:02:06.214041 #844344] INFO -- : [ 6/885] 885345=test_engine I, [2024-05-17T08:02:06.249160 #844344] INFO -- : [ 7/885] 885343=test_fiber I, [2024-05-17T08:02:06.368793 #844344] INFO -- : [ 8/885] 885344=test_gem_commands_mirror I, [2024-05-17T08:02:06.554078 #844344] INFO -- : [ 9/885] 885344=test_gem_security_trust_dir I, [2024-05-17T08:02:06.609937 #844344] INFO -- : [ 10/885] 885344=test_erb_command I, [2024-05-17T08:02:06.623158 #844344] INFO -- : [ 11/885] 885345=test_module I, [2024-05-17T08:02:06.635403 #844344] INFO -- : [ 12/885] 885344=test_usrmarshal I, [2024-05-17T08:02:06.882536 #844344] INFO -- : [ 13/885] 885344=test_gem_validator I, [2024-05-17T08:02:06.902860 #844344] INFO -- : [ 14/885] 885344=test_gem_source_installed I, [2024-05-17T08:02:06.941965 #844344] INFO -- : [ 15/885] 885344=test_abi I, [2024-05-17T08:02:07.126597 #844344] INFO -- : [ 16/885] 885344=test_integer_comb I, [2024-05-17T08:02:08.115694 #844344] INFO -- : [ 17/885] 885345=test_bundled_ca I, [2024-05-17T08:02:09.334308 #844344] INFO -- : [ 18/885] 885344=test_load I, [2024-05-17T08:02:09.337683 #844344] INFO -- : Leaked file descriptor: TestOptionParserLoad#test_load_xdg_config_home: 7 # I, [2024-05-17T08:02:09.360752 #844344] INFO -- : COMMAND PID USER FD TYPE DEVICE SIZE/OFF NODE NAME I, [2024-05-17T08:02:09.360820 #844344] INFO -- : ruby 885344 opc 7r REG 252,0 9253600 13705411 /var/lib/sss/mc/passwd I, [2024-05-17T08:02:09.455867 #844344] INFO -- : [ 19/885] 885344=test_ssl I, [2024-05-17T08:02:09.946295 #844344] INFO -- : [ 20/885] 885345=test_config I, [2024-05-17T08:02:09.989682 #844344] INFO -- : [ 21/885] 885345=test_ostruct I, [2024-05-17T08:02:10.113576 #844344] INFO -- : [ 22/885] 885345=test_depth_first I, [2024-05-17T08:02:10.123344 #844344] INFO -- : [ 23/885] 885345=test_change_word I, [2024-05-17T08:02:10.303841 #844344] INFO -- : [ 24/885] 885345=test_rdoc_parser_markdown I, [2024-05-17T08:02:10.346849 #844344] INFO -- : [ 25/885] 885345=test_custom_command I, [2024-05-17T08:02:10.400761 #844344] INFO -- : [ 26/885] 885345=test_rubyvm I, [2024-05-17T08:02:10.472742 #844344] INFO -- : [ 27/885] 885345=fuzzer_test I, [2024-05-17T08:02:10.509483 #844344] INFO -- : [ 28/885] 885345=test_cparser I, [2024-05-17T08:02:11.047526 #844344] INFO -- : [ 29/885] 885345=test_struct I, [2024-05-17T08:02:11.053094 #844344] INFO -- : [ 30/885] 885345=static_inspect_test I, [2024-05-17T08:02:11.071238 #844344] INFO -- : [ 31/885] 885345=test_c_struct_entry I, [2024-05-17T08:02:11.315834 #844344] INFO -- : [ 32/885] 885345=test_rdoc_rd_inline_parser I, [2024-05-17T08:02:11.340011 #844344] INFO -- : [ 33/885] 885345=test_win32ole_type I, [2024-05-17T08:02:11.345684 #844344] INFO -- : [ 34/885] 885345=test_load I, [2024-05-17T08:02:11.356597 #844344] INFO -- : [ 35/885] 885345=test_gem_source_lock I, [2024-05-17T08:02:11.448922 #844344] INFO -- : [ 36/885] 885345=test_cipher I, [2024-05-17T08:02:11.467147 #844344] INFO -- : [ 37/885] 885345=test_update I, [2024-05-17T08:02:11.471024 #844344] INFO -- : [ 38/885] 885345=test_new I, [2024-05-17T08:02:11.511299 #844344] INFO -- : [ 39/885] 885345=test_objectspace I, [2024-05-17T08:02:12.323524 #844344] INFO -- : [ 40/885] 885345=test_require I, [2024-05-17T08:02:12.336653 #844344] INFO -- : [ 41/885] 885343=test_debugger_integration I, [2024-05-17T08:02:12.347650 #844344] INFO -- : [ 42/885] 885343=test_my_integer I, [2024-05-17T08:02:12.362517 #844344] INFO -- : [ 43/885] 885343=test_gem_resolver_composed_set I, [2024-05-17T08:02:12.386820 #844344] INFO -- : [ 44/885] 885343=test_tracer I, [2024-05-17T08:02:12.471497 #844344] INFO -- : [ 45/885] 885343=test_not I, [2024-05-17T08:02:12.484493 #844344] INFO -- : [ 46/885] 885343=test_cgi_cookie I, [2024-05-17T08:02:12.538354 #844344] INFO -- : [ 47/885] 885343=test_option I, [2024-05-17T08:02:12.638216 #844344] INFO -- : [ 48/885] 885343=test_rdoc_markup_attribute_manager I, [2024-05-17T08:02:12.799676 #844344] INFO -- : [ 49/885] 885343=test_wss I, [2024-05-17T08:02:12.800176 #844344] INFO -- : [ 50/885] 885343=test_rdoc_rd_block_parser I, [2024-05-17T08:02:12.870695 #844344] INFO -- : [ 51/885] 885343=test_x509store I, [2024-05-17T08:02:13.371435 #844344] INFO -- : [ 52/885] 885343=test_rdoc_rd I, [2024-05-17T08:02:13.404027 #844344] INFO -- : [ 53/885] 885343=test_rdoc_generator_pot I, [2024-05-17T08:02:13.411009 #844344] INFO -- : [ 54/885] 885343=test_rdoc_markup_to_joined_paragraph I, [2024-05-17T08:02:13.420513 #844344] INFO -- : [ 55/885] 885343=test_rdoc_markup_to_markdown I, [2024-05-17T08:02:13.524902 #844344] INFO -- : [ 56/885] 885343=test_require_lib I, [2024-05-17T08:02:14.912537 #844344] INFO -- : [ 57/885] 885345=test_gem_gem_runner I, [2024-05-17T08:02:14.970380 #844344] INFO -- : [ 58/885] 885345=test_metaclass I, [2024-05-17T08:02:15.001623 #844344] INFO -- : [ 59/885] 885345=test_file_exhaustive I, [2024-05-17T08:02:15.571155 #844344] INFO -- : Leaked file descriptor: TestFileExhaustive#test_expand_path_home_dir_string: 9 # I, [2024-05-17T08:02:15.597687 #844344] INFO -- : COMMAND PID USER FD TYPE DEVICE SIZE/OFF NODE NAME I, [2024-05-17T08:02:15.597754 #844344] INFO -- : ruby 885345 opc 9r REG 252,0 9253600 13705411 /var/lib/sss/mc/passwd I, [2024-05-17T08:02:16.358423 #844344] INFO -- : [ 60/885] 885343=test_completion I, [2024-05-17T08:02:16.965010 #844344] INFO -- : [ 61/885] 885343=parse_stream_test I, [2024-05-17T08:02:16.995195 #844344] INFO -- : [ 62/885] 885343=test_handle I, [2024-05-17T08:02:17.276407 #844344] INFO -- : [ 63/885] 885343=test_gem_security_policy I, [2024-05-17T08:02:17.632051 #844344] INFO -- : [ 64/885] 885343=test_delete I, [2024-05-17T08:02:17.635884 #844344] INFO -- : [ 65/885] 885343=test_rdoc_markup_document I, [2024-05-17T08:02:17.644796 #844344] INFO -- : [ 66/885] 885343=test_io_wait_uncommon I, [2024-05-17T08:02:17.655874 #844344] INFO -- : [ 67/885] 885343=test_gem_ci_detector I, [2024-05-17T08:02:17.666979 #844344] INFO -- : [ 68/885] 885343=test_continuation I, [2024-05-17T08:02:17.679467 #844344] INFO -- : [ 69/885] 885343=test_fixnum I, [2024-05-17T08:02:17.692024 #844344] INFO -- : [ 70/885] 885343=test_gem_silent_ui I, [2024-05-17T08:02:17.776314 #844344] INFO -- : [ 71/885] 885343=test_signal I, [2024-05-17T08:02:19.663590 #844344] INFO -- : [ 72/885] 885343=test_ssl_session I, [2024-05-17T08:02:19.746583 #844344] INFO -- : [ 73/885] 885344=test_gem_package_tar_header I, [2024-05-17T08:02:19.808933 #844344] INFO -- : [ 74/885] 885344=test_rational2 I, [2024-05-17T08:02:19.868265 #844344] INFO -- : [ 75/885] 885344=test_case_comprehensive I, [2024-05-17T08:02:20.521619 #844344] INFO -- : [ 76/885] 885343=test_logperiod I, [2024-05-17T08:02:20.530083 #844344] INFO -- : [ 77/885] 885343=test_placearg I, [2024-05-17T08:02:20.663685 #844344] INFO -- : [ 78/885] 885343=test_irb I, [2024-05-17T08:02:20.922416 #844344] INFO -- : [ 79/885] 885343=test_rdoc_markup_paragraph I, [2024-05-17T08:02:20.932353 #844344] INFO -- : [ 80/885] 885343=test_x509cert I, [2024-05-17T08:02:21.030061 #844344] INFO -- : [ 81/885] 885343=test_require_path_check I, [2024-05-17T08:02:21.102338 #844344] INFO -- : [ 82/885] 885343=test_variable_name_check I, [2024-05-17T08:02:21.133058 #844344] INFO -- : [ 83/885] 885343=test_bn I, [2024-05-17T08:02:21.152626 #844344] INFO -- : [ 84/885] 885343=test_logdevice I, [2024-05-17T08:02:21.532042 #844344] INFO -- : [ 85/885] 885345=test_ast I, [2024-05-17T08:02:22.030651 #844344] INFO -- : [ 86/885] 885343=test_rdoc_markup_to_ansi I, [2024-05-17T08:02:22.081110 #844344] INFO -- : [ 87/885] 885343=test_protocol I, [2024-05-17T08:02:22.390859 #844344] INFO -- : [ 88/885] 885343=test_evaluation I, [2024-05-17T08:02:22.462906 #844344] INFO -- : [ 89/885] 885343=test_files_test I, [2024-05-17T08:02:22.467992 #844344] INFO -- : [ 90/885] 885343=test_weakkeymap I, [2024-05-17T08:02:22.728715 #844344] INFO -- : [ 91/885] 885343=test_gem_commands_info_command I, [2024-05-17T08:02:22.817398 #844344] INFO -- : [ 92/885] 885343=test_https I, [2024-05-17T08:02:22.941044 #844344] INFO -- : [ 93/885] 885343=test_object_create_start I, [2024-05-17T08:02:22.956723 #844344] INFO -- : [ 94/885] 885343=test_gem_request_set_gem_dependency_api I, [2024-05-17T08:02:23.240581 #844344] INFO -- : [ 95/885] 885343=test_name_error_extension I, [2024-05-17T08:02:23.258046 #844344] INFO -- : [ 96/885] 885343=test_gem_safe_marshal I, [2024-05-17T08:02:23.949189 #844344] INFO -- : [ 97/885] 885343=test_rdoc_ri_driver I, [2024-05-17T08:02:24.348998 #844344] INFO -- : [ 98/885] 885343=test_ractor I, [2024-05-17T08:02:24.388611 #844344] INFO -- : [ 99/885] 885343=test_httpheader I, [2024-05-17T08:02:24.401698 #844344] INFO -- : [100/885] 885343=test_sexp I, [2024-05-17T08:02:24.468852 #844344] INFO -- : [101/885] 885343=test_signedness I, [2024-05-17T08:02:26.320794 #844344] INFO -- : [102/885] 885343=test_gem_resolver_git_set I, [2024-05-17T08:02:26.923317 #844344] INFO -- : [103/885] 885343=test_gem_commands_check_command I, [2024-05-17T08:02:26.957036 #844344] INFO -- : [104/885] 885343=test_digest I, [2024-05-17T08:02:27.780669 #844344] INFO -- : [105/885] 885343=test_ractor I, [2024-05-17T08:02:27.860677 #844344] INFO -- : [106/885] 885343=test_gem_resolver_installed_specification I, [2024-05-17T08:02:27.939390 #844344] INFO -- : [107/885] 885343=test_exception_at_throwing I, [2024-05-17T08:02:27.953243 #844344] INFO -- : [108/885] 885343=test_stringscanner I, [2024-05-17T08:02:28.003600 #844344] INFO -- : [109/885] 885343=test_fiddle I, [2024-05-17T08:02:28.115793 #844344] INFO -- : [110/885] 885343=json_generic_object_test I, [2024-05-17T08:02:28.131063 #844344] INFO -- : [111/885] 885343=test_gem_resolver_vendor_specification I, [2024-05-17T08:02:28.173678 #844344] INFO -- : [112/885] 885343=test_date_arith I, [2024-05-17T08:02:28.188821 #844344] INFO -- : [113/885] 885343=test_mutex I, [2024-05-17T08:02:29.324206 #844344] INFO -- : [114/885] 885343=test_rdoc_token_stream I, [2024-05-17T08:02:29.334648 #844344] INFO -- : [115/885] 885343=heredoc_dedent_test I, [2024-05-17T08:02:29.341814 #844344] INFO -- : [116/885] 885343=test_type I, [2024-05-17T08:02:29.349115 #844344] INFO -- : [117/885] 885343=test_tmpdir I, [2024-05-17T08:02:29.420933 #844344] INFO -- : [118/885] 885343=test_struct I, [2024-05-17T08:02:30.003170 #844344] INFO -- : [119/885] 885343=test_dup I, [2024-05-17T08:02:30.172947 #844344] INFO -- : [120/885] 885343=test_rdoc_single_class I, [2024-05-17T08:02:30.182651 #844344] INFO -- : [121/885] 885343=test_acceptable I, [2024-05-17T08:02:30.250071 #844344] INFO -- : [122/885] 885343=test_gem_ext_cargo_builder_link_flag_converter I, [2024-05-17T08:02:30.313696 #844344] INFO -- : [123/885] 885343=test_gem_local_remote_options I, [2024-05-17T08:02:30.361098 #844344] INFO -- : [124/885] 885343=test_eval_history I, [2024-05-17T08:02:30.367192 #844344] INFO -- : [125/885] 885343=dispatcher_test I, [2024-05-17T08:02:30.384597 #844344] INFO -- : [126/885] 885343=test_unicode I, [2024-05-17T08:02:30.411307 #844344] INFO -- : [127/885] 885343=test_gem_source_git I, [2024-05-17T08:02:31.382165 #844344] INFO -- : [128/885] 885343=test_win32ole_method I, [2024-05-17T08:02:31.386715 #844344] INFO -- : [129/885] 885343=test_lexer I, [2024-05-17T08:02:31.408760 #844344] INFO -- : [130/885] 885343=test_regex_casefold I, [2024-05-17T08:02:31.821187 #844344] INFO -- : [131/885] 885343=test_ripper I, [2024-05-17T08:02:32.140637 #844344] INFO -- : [132/885] 885343=test_files_ext I, [2024-05-17T08:02:32.140974 #844344] INFO -- : [133/885] 885343=test_thread_cv I, [2024-05-17T08:02:32.788369 #844344] INFO -- : [134/885] 885343=test_assembler I, [2024-05-17T08:02:32.793639 #844344] INFO -- : [135/885] 885343=test_stringio I, [2024-05-17T08:02:32.904126 #844344] INFO -- : [136/885] 885343=test_random I, [2024-05-17T08:02:32.923655 #844344] INFO -- : [137/885] 885343=test_at_exit I, [2024-05-17T08:02:32.932042 #844344] INFO -- : [138/885] 885343=test_benchmark I, [2024-05-17T08:02:34.362363 #844344] INFO -- : [139/885] 885343=test_have_macro I, [2024-05-17T08:02:34.651653 #844344] INFO -- : [140/885] 885343=test_gem_source I, [2024-05-17T08:02:34.987077 #844344] INFO -- : [141/885] 885343=test_mkmf I, [2024-05-17T08:02:35.015879 #844344] INFO -- : [142/885] 885343=test_class I, [2024-05-17T08:02:35.036684 #844344] INFO -- : [143/885] 885343=test_autoload I, [2024-05-17T08:02:39.266025 #844344] INFO -- : [144/885] 885343=test_gem_package I, [2024-05-17T08:02:39.559953 #844344] INFO -- : [145/885] 885344=test_array I, [2024-05-17T08:02:39.971145 #844344] INFO -- : [146/885] 885343=test_sockopt I, [2024-05-17T08:02:39.976425 #844344] INFO -- : [147/885] 885343=test_ftp I, [2024-05-17T08:02:39.984911 #844344] INFO -- : [148/885] 885343=test_gem_source_fetch_problem I, [2024-05-17T08:02:40.000771 #844344] INFO -- : [149/885] 885343=test_encoding I, [2024-05-17T08:02:40.050778 #844344] INFO -- : [150/885] 885343=test_install I, [2024-05-17T08:02:40.202856 #844344] INFO -- : [151/885] 885343=test_rdoc_comment I, [2024-05-17T08:02:40.250641 #844344] INFO -- : [152/885] 885343=test_gem_request_set_lockfile_tokenizer I, [2024-05-17T08:02:40.309819 #844344] INFO -- : [153/885] 885343=test_lazy_enumerator I, [2024-05-17T08:02:40.785062 #844344] INFO -- : [154/885] 885343=test_cgi_multipart I, [2024-05-17T08:02:40.939492 #844344] INFO -- : [155/885] 885343=test_ractor_compatibility I, [2024-05-17T08:02:41.243996 #844344] INFO -- : [156/885] 885343=test_arithmetic_sequence I, [2024-05-17T08:02:41.253107 #844344] INFO -- : [157/885] 885343=test_autoconf I, [2024-05-17T08:02:41.257602 #844344] INFO -- : [158/885] 885343=integer_parse_test I, [2024-05-17T08:02:41.260049 #844344] INFO -- : [159/885] 885343=test_find_executable I, [2024-05-17T08:02:41.263838 #844344] INFO -- : [160/885] 885343=test_iseq I, [2024-05-17T08:02:41.877018 #844344] INFO -- : [161/885] 885343=test_primitive I, [2024-05-17T08:02:41.901472 #844344] INFO -- : [162/885] 885343=test_parser I, [2024-05-17T08:02:41.926420 #844344] INFO -- : [163/885] 885343=test_rdoc_ri_paths I, [2024-05-17T08:02:41.963020 #844344] INFO -- : [164/885] 885343=command_line_test I, [2024-05-17T08:02:42.043478 #844344] INFO -- : [165/885] 885343=test_pair I, [2024-05-17T08:02:44.105739 #844344] INFO -- : [166/885] 885344=test_win32ole_variant_m I, [2024-05-17T08:02:44.114637 #844344] INFO -- : [167/885] 885344=test_gem_package_tar_reader I, [2024-05-17T08:02:44.144988 #844344] INFO -- : [168/885] 885344=test_gem_commands_signout_command I, [2024-05-17T08:02:44.175205 #844344] INFO -- : [169/885] 885344=test_env I, [2024-05-17T08:02:46.636962 #844344] INFO -- : [170/885] 885344=test_eval I, [2024-05-17T08:02:46.644920 #844344] INFO -- : [171/885] 885344=test_document I, [2024-05-17T08:02:46.651761 #844344] INFO -- : [172/885] 885344=test_gem_safe_yaml I, [2024-05-17T08:02:46.657622 #844344] INFO -- : [173/885] 885344=test_gem_commands_setup_command I, [2024-05-17T08:02:47.267689 #844344] INFO -- : [174/885] 885343=test_history I, [2024-05-17T08:02:47.302775 #844344] INFO -- : [175/885] 885343=test_singleton_function I, [2024-05-17T08:02:47.306241 #844344] INFO -- : [176/885] 885343=test_uncorrectable_name_check I, [2024-05-17T08:02:47.312625 #844344] INFO -- : [177/885] 885343=test_io I, [2024-05-17T08:02:47.447193 #844344] INFO -- : [178/885] 885344=test_files_test_1 I, [2024-05-17T08:02:49.920807 #844344] INFO -- : [179/885] 885344=test_dir I, [2024-05-17T08:02:49.991994 #844344] INFO -- : Leaked file descriptor: TestDir#test_home: 8 # I, [2024-05-17T08:02:50.028553 #844344] INFO -- : COMMAND PID USER FD TYPE DEVICE SIZE/OFF NODE NAME I, [2024-05-17T08:02:50.028629 #844344] INFO -- : ruby 885344 opc 8u unix 0x0000000000000000 0t0 3019102762 type=STREAM I, [2024-05-17T08:02:50.271588 #844344] INFO -- : [180/885] 885344=test_closure I, [2024-05-17T08:02:52.213111 #844344] INFO -- : [181/885] 885344=test_rubygems I, [2024-05-17T08:02:52.358896 #844344] INFO -- : [182/885] 885344=test_resolve_symbol I, [2024-05-17T08:02:52.416362 #844344] INFO -- : [183/885] 885344=test_path I, [2024-05-17T08:02:52.418069 #844344] INFO -- : [184/885] 885344=test_digest I, [2024-05-17T08:02:52.423871 #844344] INFO -- : [185/885] 885344=test_rdoc_rd_inline I, [2024-05-17T08:02:52.549188 #844344] INFO -- : [186/885] 885344=test_win32ole_param_event I, [2024-05-17T08:02:52.600824 #844344] INFO -- : [187/885] 885344=test_https_proxy I, [2024-05-17T08:02:52.652962 #844344] INFO -- : [188/885] 885344=test_rdoc_parser I, [2024-05-17T08:02:52.682980 #844344] INFO -- : [189/885] 885344=test_gem_commands_rebuild_command I, [2024-05-17T08:02:52.740686 #844344] INFO -- : [190/885] 885344=test_nomethod_error I, [2024-05-17T08:02:52.765402 #844344] INFO -- : [191/885] 885344=test_etc I, [2024-05-17T08:02:52.767146 #844344] INFO -- : Leaked file descriptor: TestEtc#test_getgrgid: 9 # I, [2024-05-17T08:02:52.794062 #844344] INFO -- : COMMAND PID USER FD TYPE DEVICE SIZE/OFF NODE NAME I, [2024-05-17T08:02:52.794133 #844344] INFO -- : ruby 885344 opc 9r REG 252,0 6940392 13705429 /var/lib/sss/mc/group I, [2024-05-17T08:02:52.910954 #844344] INFO -- : [192/885] 885344=test_stat I, [2024-05-17T08:02:52.920230 #844344] INFO -- : [193/885] 885344=test_printf I, [2024-05-17T08:02:52.935469 #844344] INFO -- : [194/885] 885344=test_x509attr I, [2024-05-17T08:02:52.941649 #844344] INFO -- : [195/885] 885344=test_workspace I, [2024-05-17T08:02:53.215259 #844344] INFO -- : [196/885] 885344=magic_comment_test I, [2024-05-17T08:02:53.247471 #844344] INFO -- : [197/885] 885344=test_win32ole_variant I, [2024-05-17T08:02:53.258269 #844344] INFO -- : [198/885] 885344=test_cgi_modruby I, [2024-05-17T08:02:53.276953 #844344] INFO -- : [199/885] 885344=test_gem_ext_configure_builder I, [2024-05-17T08:02:53.317184 #844344] INFO -- : [200/885] 885344=json_ext_parser_test I, [2024-05-17T08:02:53.325231 #844344] INFO -- : [201/885] 885344=test_nonblock I, [2024-05-17T08:02:53.351133 #844344] INFO -- : [202/885] 885344=test_rdoc_parser_simple I, [2024-05-17T08:02:53.379415 #844344] INFO -- : [203/885] 885344=test_scanner_events I, [2024-05-17T08:02:53.425662 #844344] INFO -- : [204/885] 885344=test_ocsp I, [2024-05-17T08:02:53.513660 #844344] INFO -- : [205/885] 885344=test_ipaddr I, [2024-05-17T08:02:53.545800 #844344] INFO -- : [206/885] 885344=test_omap I, [2024-05-17T08:02:53.557893 #844344] INFO -- : [207/885] 885344=test_date_strptime I, [2024-05-17T08:02:53.668092 #844344] INFO -- : [208/885] 885344=test_rdoc_generator_pot_po I, [2024-05-17T08:02:53.677577 #844344] INFO -- : [209/885] 885344=test_shellwords I, [2024-05-17T08:02:53.686954 #844344] INFO -- : [210/885] 885344=test_mul I, [2024-05-17T08:02:53.693468 #844344] INFO -- : [211/885] 885344=test_propertyputref I, [2024-05-17T08:02:53.698188 #844344] INFO -- : [212/885] 885344=test_gb18030 I, [2024-05-17T08:02:53.709200 #844344] INFO -- : [213/885] 885344=test_gem_commands_lock_command I, [2024-05-17T08:02:53.738824 #844344] INFO -- : [214/885] 885344=test_reline_key I, [2024-05-17T08:02:53.741688 #844344] INFO -- : [215/885] 885344=test_unicode_normalize I, [2024-05-17T08:02:56.207949 #844344] INFO -- : [216/885] 885343=test_gem_stream_ui I, [2024-05-17T08:02:56.318186 #844344] INFO -- : [217/885] 885343=test_rdoc_generator_ri I, [2024-05-17T08:02:56.323076 #844344] INFO -- : [218/885] 885343=test_io_m17n I, [2024-05-17T08:02:57.400810 #844344] INFO -- : [219/885] 885344=test_rdoc_top_level I, [2024-05-17T08:02:57.619105 #844344] INFO -- : [220/885] 885343=test_cmethod I, [2024-05-17T08:02:57.627127 #844344] INFO -- : [221/885] 885343=test_float I, [2024-05-17T08:02:57.751961 #844344] INFO -- : [222/885] 885344=test_gem_stub_specification I, [2024-05-17T08:02:57.974126 #844344] INFO -- : [223/885] 885344=test_color I, [2024-05-17T08:02:58.023718 #844344] INFO -- : [224/885] 885344=test_digest_extend I, [2024-05-17T08:02:58.068163 #844344] INFO -- : [225/885] 885344=test_gem_ext_cmake_builder I, [2024-05-17T08:02:58.080883 #844344] INFO -- : [226/885] 885344=test_thread_fd_close I, [2024-05-17T08:02:58.244896 #844344] INFO -- : [227/885] 885344=test_last_thread I, [2024-05-17T08:02:59.148653 #844344] INFO -- : [228/885] 885344=test_getopts I, [2024-05-17T08:02:59.158054 #844344] INFO -- : [229/885] 885344=test_emitter I, [2024-05-17T08:02:59.163209 #844344] INFO -- : [230/885] 885344=test_alias I, [2024-05-17T08:02:59.300333 #844344] INFO -- : [231/885] 885344=test_fips I, [2024-05-17T08:02:59.321088 #844344] INFO -- : [232/885] 885343=test_compile_prism I, [2024-05-17T08:02:59.565335 #844344] INFO -- : [233/885] 885344=test_helper I, [2024-05-17T08:02:59.571999 #844344] INFO -- : [234/885] 885344=test_win32ole_event I, [2024-05-17T08:02:59.572528 #844344] INFO -- : [235/885] 885344=test_rdoc_markup_formatter I, [2024-05-17T08:02:59.589768 #844344] INFO -- : [236/885] 885343=test_gem_commands_uninstall_command I, [2024-05-17T08:02:59.602904 #844344] INFO -- : [237/885] 885344=test_dns I, [2024-05-17T08:03:00.059336 #844344] INFO -- : [238/885] 885344=test_notimplement I, [2024-05-17T08:03:00.076142 #844344] INFO -- : [239/885] 885344=test_cgi_session I, [2024-05-17T08:03:00.095993 #844344] INFO -- : [240/885] 885344=test_c_union_entity I, [2024-05-17T08:03:00.279719 #844344] INFO -- : [241/885] 885344=test_x509crl I, [2024-05-17T08:03:00.376251 #844344] INFO -- : [242/885] 885344=test_rdoc_markup_heading I, [2024-05-17T08:03:00.387834 #844344] INFO -- : [243/885] 885344=test_io_console I, [2024-05-17T08:03:00.436238 #844344] INFO -- : [244/885] 885343=test_flip I, [2024-05-17T08:03:00.490884 #844344] INFO -- : [245/885] 885343=test_pattern_key_name_check I, [2024-05-17T08:03:00.492651 #844344] INFO -- : [246/885] 885343=test_profile_frames I, [2024-05-17T08:03:00.660782 #844344] INFO -- : [247/885] 885343=test_debug I, [2024-05-17T08:03:00.685648 #844344] INFO -- : [248/885] 885343=test_transcode I, [2024-05-17T08:03:00.852004 #844344] INFO -- : [249/885] 885343=test_refinement I, [2024-05-17T08:03:02.999131 #844344] INFO -- : [250/885] 885344=test_class2name I, [2024-05-17T08:03:03.004916 #844344] INFO -- : [251/885] 885344=test_gem_commands_cleanup_command I, [2024-05-17T08:03:03.629105 #844344] INFO -- : [252/885] 885344=test_readpartial I, [2024-05-17T08:03:04.036051 #844344] INFO -- : [253/885] 885344=test_rdoc_parser_ruby I, [2024-05-17T08:03:04.442586 #844344] INFO -- : [254/885] 885343=test_httpresponse I, [2024-05-17T08:03:04.481386 #844344] INFO -- : [255/885] 885343=test_x509req I, [2024-05-17T08:03:04.503214 #844344] INFO -- : [256/885] 885343=test_gem_console_ui I, [2024-05-17T08:03:04.514819 #844344] INFO -- : [257/885] 885343=test_allocation I, [2024-05-17T08:03:05.287684 #844344] INFO -- : [258/885] 885344=test_ifunless I, [2024-05-17T08:03:05.294141 #844344] INFO -- : [259/885] 885344=test_insns_leaf I, [2024-05-17T08:03:05.301370 #844344] INFO -- : [260/885] 885344=test_modify_expand I, [2024-05-17T08:03:05.333472 #844344] INFO -- : [261/885] 885344=test_pkg_config I, [2024-05-17T08:03:05.346106 #844344] INFO -- : [262/885] 885344=test_gem_available_set I, [2024-05-17T08:03:05.451781 #844344] INFO -- : [263/885] 885344=errors_test I, [2024-05-17T08:03:05.527539 #844344] INFO -- : [264/885] 885344=test_convertible I, [2024-05-17T08:03:05.738165 #844344] INFO -- : [265/885] 885345=test_vm_dump I, [2024-05-17T08:03:05.749368 #844344] INFO -- : [266/885] 885345=json_encoding_test I, [2024-05-17T08:03:05.779677 #844344] INFO -- : [267/885] 885345=test_config I, [2024-05-17T08:03:05.812008 #844344] INFO -- : [268/885] 885345=test_func I, [2024-05-17T08:03:06.911703 #844344] INFO -- : [269/885] 885343=test_gem_resolver I, [2024-05-17T08:03:07.203908 #844344] INFO -- : [270/885] 885343=test_gem_source_vendor I, [2024-05-17T08:03:07.206668 #844344] INFO -- : [271/885] 885343=test_dln I, [2024-05-17T08:03:07.223421 #844344] INFO -- : [272/885] 885343=test_object I, [2024-05-17T08:03:07.571221 #844344] INFO -- : [273/885] 885343=unescape_test I, [2024-05-17T08:03:08.983278 #844344] INFO -- : [274/885] 885343=test_gem_commands_exec_command I, [2024-05-17T08:03:09.188115 #844344] INFO -- : [275/885] 885344=test_color_printer I, [2024-05-17T08:03:09.215364 #844344] INFO -- : [276/885] 885344=test_super I, [2024-05-17T08:03:09.296451 #844344] INFO -- : [277/885] 885345=test_gem_installer I, [2024-05-17T08:03:10.261916 #844344] INFO -- : [278/885] 885343=test_bug_reporter I, [2024-05-17T08:03:10.450414 #844344] INFO -- : [279/885] 885343=test_buffered_io I, [2024-05-17T08:03:10.465461 #844344] INFO -- : [280/885] 885343=test_ossl I, [2024-05-17T08:03:10.948714 #844344] INFO -- : [281/885] 885344=test_ruby_lex I, [2024-05-17T08:03:11.077859 #844344] INFO -- : [282/885] 885344=compiler_test I, [2024-05-17T08:03:11.136258 #844344] INFO -- : [283/885] 885344=test_arith_seq_extract I, [2024-05-17T08:03:11.285458 #844344] INFO -- : [284/885] 885344=test_gem_source_subpath_problem I, [2024-05-17T08:03:11.361917 #844344] INFO -- : [285/885] 885344=test_object_references I, [2024-05-17T08:03:11.395958 #844344] INFO -- : [286/885] 885344=test_eval I, [2024-05-17T08:03:11.736611 #844344] INFO -- : [287/885] 885344=test_monitor I, [2024-05-17T08:03:11.965076 #844344] INFO -- : [288/885] 885344=test_beginendblock I, [2024-05-17T08:03:12.347923 #844344] INFO -- : [289/885] 885344=test_nofree I, [2024-05-17T08:03:12.367992 #844344] INFO -- : [290/885] 885344=test_regexp I, [2024-05-17T08:03:14.240745 #844344] INFO -- : [291/885] 885345=test_whileuntil I, [2024-05-17T08:03:14.278202 #844344] INFO -- : [292/885] 885345=test_pointer I, [2024-05-17T08:03:15.196812 #844344] INFO -- : [293/885] 885345=test_within_pipe I, [2024-05-17T08:03:15.233363 #844344] INFO -- : [294/885] 885345=test_rdoc_normal_class I, [2024-05-17T08:03:15.300295 #844344] INFO -- : [295/885] 885345=test_mailto I, [2024-05-17T08:03:15.330801 #844344] INFO -- : [296/885] 885345=test_addr I, [2024-05-17T08:03:15.342048 #844344] INFO -- : [297/885] 885345=test_kill_ring I, [2024-05-17T08:03:15.348882 #844344] INFO -- : [298/885] 885345=test_member I, [2024-05-17T08:03:15.356713 #844344] INFO -- : [299/885] 885345=test_object I, [2024-05-17T08:03:15.369252 #844344] INFO -- : [300/885] 885345=test_cgi_header I, [2024-05-17T08:03:15.378851 #844344] INFO -- : [301/885] 885345=format_errors_test I, [2024-05-17T08:03:15.384823 #844344] INFO -- : [302/885] 885345=test_case_options I, [2024-05-17T08:03:15.385288 #844344] INFO -- : [303/885] 885345=test_helper I, [2024-05-17T08:03:15.392066 #844344] INFO -- : [304/885] 885345=test_duplicate I, [2024-05-17T08:03:15.405440 #844344] INFO -- : [305/885] 885345=test_gem_resolver_api_set I, [2024-05-17T08:03:15.494456 #844344] INFO -- : [306/885] 885345=test_rdoc_markup_to_html I, [2024-05-17T08:03:15.592833 #844344] INFO -- : [307/885] 885345=test_foreach I, [2024-05-17T08:03:15.599907 #844344] INFO -- : [308/885] 885345=test_append I, [2024-05-17T08:03:15.610708 #844344] INFO -- : [309/885] 885345=test_gem_resolver_installer_set I, [2024-05-17T08:03:15.868409 #844344] INFO -- : [310/885] 885345=test_x509ext I, [2024-05-17T08:03:15.876748 #844344] INFO -- : [311/885] 885345=test_emitter I, [2024-05-17T08:03:15.888455 #844344] INFO -- : [312/885] 885345=bom_test I, [2024-05-17T08:03:15.904233 #844344] INFO -- : [313/885] 885345=test_summary I, [2024-05-17T08:03:16.025555 #844344] INFO -- : [314/885] 885345=test_helper_method I, [2024-05-17T08:03:16.128681 #844344] INFO -- : [315/885] 885345=test_config I, [2024-05-17T08:03:16.455193 #844344] INFO -- : [316/885] 885345=test_file I, [2024-05-17T08:03:17.824245 #844344] INFO -- : [317/885] 885343=test_scalar_scanner I, [2024-05-17T08:03:17.834844 #844344] INFO -- : [318/885] 885343=test_rb_str_dup I, [2024-05-17T08:03:17.845812 #844344] INFO -- : [319/885] 885343=test_lambda I, [2024-05-17T08:03:17.924435 #844344] INFO -- : [320/885] 885343=test_trace I, [2024-05-17T08:03:17.931695 #844344] INFO -- : [321/885] 885343=test_arity I, [2024-05-17T08:03:17.940877 #844344] INFO -- : [322/885] 885343=test_gem_path_support I, [2024-05-17T08:03:18.050666 #844344] INFO -- : [323/885] 885343=test_keyword I, [2024-05-17T08:03:18.512737 #844344] INFO -- : [324/885] 885343=test_win32ole_type_event I, [2024-05-17T08:03:18.517304 #844344] INFO -- : [325/885] 885343=test_interned_str I, [2024-05-17T08:03:18.523040 #844344] INFO -- : [326/885] 885343=test_set_len I, [2024-05-17T08:03:18.528738 #844344] INFO -- : [327/885] 885343=constant_path_node_test I, [2024-05-17T08:03:18.531311 #844344] INFO -- : [328/885] 885343=test_folderitem2_invokeverb I, [2024-05-17T08:03:18.548531 #844344] INFO -- : [329/885] 885343=test_pattern_matching I, [2024-05-17T08:03:19.532412 #844344] INFO -- : [330/885] 885343=test_gc I, [2024-05-17T08:03:22.689936 #844344] INFO -- : [331/885] 885345=test_gem_bundler_version_finder I, [2024-05-17T08:03:22.733329 #844344] INFO -- : [332/885] 885345=test_gem_request_set I, [2024-05-17T08:03:23.309490 #844344] INFO -- : [333/885] 885345=ruby_api_test I, [2024-05-17T08:03:23.495837 #844344] INFO -- : [334/885] 885345=test_gem_resolver_index_set I, [2024-05-17T08:03:23.535088 #844344] INFO -- : [335/885] 885345=test_webauthn_listener_response I, [2024-05-17T08:03:24.126762 #844344] INFO -- : [336/885] 885345=test_sleep I, [2024-05-17T08:03:27.939665 #844344] INFO -- : [337/885] 885343=test_ensured I, [2024-05-17T08:03:27.945229 #844344] INFO -- : [338/885] 885343=test_euc_jp I, [2024-05-17T08:03:27.958721 #844344] INFO -- : [339/885] 885343=test_key_stroke I, [2024-05-17T08:03:27.966874 #844344] INFO -- : [340/885] 885343=test_rdoc_markup I, [2024-05-17T08:03:27.976697 #844344] INFO -- : [341/885] 885343=test_alias_and_anchor I, [2024-05-17T08:03:27.986299 #844344] INFO -- : [342/885] 885343=test_time I, [2024-05-17T08:03:28.190605 #844344] INFO -- : [343/885] 885343=test_popen_deadlock I, [2024-05-17T08:03:28.563970 #844344] INFO -- : [344/885] 885345=test_symbol I, [2024-05-17T08:03:28.615867 #844344] INFO -- : [345/885] 885345=test_project_sanity I, [2024-05-17T08:03:28.648253 #844344] INFO -- : [346/885] 885345=location_test I, [2024-05-17T08:03:28.674819 #844344] INFO -- : [347/885] 885343=test_delegate I, [2024-05-17T08:03:28.693818 #844344] INFO -- : [348/885] 885345=test_chilled I, [2024-05-17T08:03:28.700807 #844344] INFO -- : [349/885] 885345=test_reline I, [2024-05-17T08:03:28.710909 #844344] INFO -- : [350/885] 885343=test_ellipsize I, [2024-05-17T08:03:28.745459 #844344] INFO -- : [351/885] 885343=test_call I, [2024-05-17T08:03:28.954818 #844344] INFO -- : [352/885] 885343=test_gem_commands_build_command I, [2024-05-17T08:03:28.974733 #844344] INFO -- : [353/885] 885345=test_windows_1251 I, [2024-05-17T08:03:28.986472 #844344] INFO -- : [354/885] 885345=test_gem_ext_builder I, [2024-05-17T08:03:29.340811 #844344] INFO -- : [355/885] 885343=test_to_ary_concat I, [2024-05-17T08:03:30.065431 #844344] INFO -- : [356/885] 885345=test_history I, [2024-05-17T08:03:30.095340 #844344] INFO -- : [357/885] 885345=test_time_tz I, [2024-05-17T08:03:30.224762 #844344] INFO -- : [358/885] 885345=test_addrinfo I, [2024-05-17T08:03:30.262057 #844344] INFO -- : [359/885] 885345=test_to_ruby I, [2024-05-17T08:03:30.277533 #844344] INFO -- : [360/885] 885345=test_data I, [2024-05-17T08:03:30.345692 #844344] INFO -- : [361/885] 885345=test_bug-14834 I, [2024-05-17T08:03:30.352009 #844344] INFO -- : [362/885] 885345=test_inlinecache I, [2024-05-17T08:03:30.405755 #844344] INFO -- : [363/885] 885345=test_terminfo I, [2024-05-17T08:03:30.527281 #844344] INFO -- : [364/885] 885345=test_socket I, [2024-05-17T08:03:30.776562 #844344] INFO -- : .Leaked thread: TestSocket#test_accept_loop_multi_port: # I, [2024-05-17T08:03:30.777624 #844344] INFO -- : .Finished thread: TestSocket#test_udp_recvmsg_truncation: # I, [2024-05-17T08:03:31.402155 #844344] INFO -- : [365/885] 885345=test_thread I, [2024-05-17T08:03:32.902849 #844344] INFO -- : [366/885] 885343=test_gem_resolver_conflict I, [2024-05-17T08:03:32.998042 #844344] INFO -- : [367/885] 885343=test_ractor I, [2024-05-17T08:03:33.269103 #844344] INFO -- : [368/885] 885343=test_gem_commands_help_command I, [2024-05-17T08:03:33.307023 #844344] INFO -- : [369/885] 885343=test_scheduler I, [2024-05-17T08:03:33.491528 #844344] INFO -- : [370/885] 885343=test_ssl I, [2024-05-17T08:03:33.653261 #844344] INFO -- : [371/885] 885343=test_enc_str_buf_cat I, [2024-05-17T08:03:33.663395 #844344] INFO -- : [372/885] 885343=test_bignum I, [2024-05-17T08:03:37.267695 #844344] INFO -- : [373/885] 885343=newline_test I, [2024-05-17T08:03:37.339268 #844344] INFO -- : [374/885] 885343=test_rdoc_markup_hard_break I, [2024-05-17T08:03:37.345853 #844344] INFO -- : [375/885] 885343=test_ancdata I, [2024-05-17T08:03:37.407900 #844344] INFO -- : [376/885] 885343=ractor_test I, [2024-05-17T08:03:37.421817 #844344] INFO -- : [377/885] 885343=test_marshal I, [2024-05-17T08:03:38.710809 #844344] INFO -- : [378/885] 885343=test_nesting_parser I, [2024-05-17T08:03:38.735548 #844344] INFO -- : [379/885] 885343=test_parser I, [2024-05-17T08:03:38.750661 #844344] INFO -- : [380/885] 885343=test_rdoc_markup_to_label I, [2024-05-17T08:03:38.803570 #844344] INFO -- : [381/885] 885343=test_gem_resolver_best_set I, [2024-05-17T08:03:38.878685 #844344] INFO -- : [382/885] 885343=test_cgi_core I, [2024-05-17T08:03:38.904265 #844344] INFO -- : [383/885] 885343=test_gem I, [2024-05-17T08:03:39.577430 #844344] INFO -- : Leaked file descriptor: TestGem#test_self_clear_paths: 10 # I, [2024-05-17T08:03:39.608175 #844344] INFO -- : COMMAND PID USER FD TYPE DEVICE SIZE/OFF NODE NAME I, [2024-05-17T08:03:39.608247 #844344] INFO -- : ruby 885343 opc 10r REG 252,0 9253600 13705411 /var/lib/sss/mc/passwd I, [2024-05-17T08:03:40.144742 #844344] INFO -- : [384/885] 885345=test_registry I, [2024-05-17T08:03:40.152661 #844344] INFO -- : [385/885] 885345=json_generator_test I, [2024-05-17T08:03:40.248662 #844344] INFO -- : [386/885] 885345=test_ansi_without_terminfo I, [2024-05-17T08:03:40.264151 #844344] INFO -- : [387/885] 885345=test_ractor I, [2024-05-17T08:03:40.272945 #844344] INFO -- : [388/885] 885345=test_address_resolve I, [2024-05-17T08:03:40.341723 #844344] INFO -- : [389/885] 885345=test_ractor I, [2024-05-17T08:03:40.356430 #844344] INFO -- : [390/885] 885345=test_trick I, [2024-05-17T08:03:41.291245 #844344] INFO -- : [391/885] 885343=test_stream I, [2024-05-17T08:03:41.303710 #844344] INFO -- : [392/885] 885343=test_rdoc_attr I, [2024-05-17T08:03:41.317628 #844344] INFO -- : [393/885] 885343=test_locale I, [2024-05-17T08:03:41.358290 #844344] INFO -- : [394/885] 885343=test_ts I, [2024-05-17T08:03:41.644663 #844344] INFO -- : [395/885] 885343=test_rbconfig I, [2024-05-17T08:03:41.656738 #844344] INFO -- : [396/885] 885343=test_num2int I, [2024-05-17T08:03:41.664584 #844344] INFO -- : [397/885] 885343=test_iter_break I, [2024-05-17T08:03:41.728669 #844344] INFO -- : [398/885] 885343=test_extlibs I, [2024-05-17T08:03:42.794685 #844344] INFO -- : [399/885] 885344=test_gem_commands_signin_command I, [2024-05-17T08:03:42.811296 #844344] INFO -- : [400/885] 885345=test_range I, [2024-05-17T08:03:42.968683 #844344] INFO -- : [401/885] 885344=test_require I, [2024-05-17T08:03:43.292271 #844344] INFO -- : [402/885] 885343=test_recursion I, [2024-05-17T08:03:43.300693 #844344] INFO -- : [403/885] 885343=test_enum I, [2024-05-17T08:03:43.574835 #844344] INFO -- : [404/885] 885345=test_rdoc_markup_include I, [2024-05-17T08:03:43.588078 #844344] INFO -- : [405/885] 885345=test_context I, [2024-05-17T08:03:43.679293 #844344] INFO -- : [406/885] 885345=test_udp I, [2024-05-17T08:03:43.686454 #844344] INFO -- : [407/885] 885345=test_gem_commands_contents_command I, [2024-05-17T08:03:43.836906 #844344] INFO -- : [408/885] 885345=test_rdoc_servlet I, [2024-05-17T08:03:43.934187 #844344] INFO -- : [409/885] 885345=test_coder I, [2024-05-17T08:03:43.948277 #844344] INFO -- : [410/885] 885345=test_symbol I, [2024-05-17T08:03:44.265081 #844344] INFO -- : [411/885] 885344=test_gem_commands_search_command I, [2024-05-17T08:03:44.266991 #844344] INFO -- : [412/885] 885344=test_formatter I, [2024-05-17T08:03:44.284427 #844344] INFO -- : [413/885] 885344=test_integer I, [2024-05-17T08:03:44.294457 #844344] INFO -- : [414/885] 885343=test_unix I, [2024-05-17T08:03:44.357789 #844344] INFO -- : [415/885] 885343=test_have_func I, [2024-05-17T08:03:45.569066 #844344] INFO -- : [416/885] 885343=test_date_marshal I, [2024-05-17T08:03:45.613383 #844344] INFO -- : [417/885] 885343=test_configuration I, [2024-05-17T08:03:45.669020 #844344] INFO -- : [418/885] 885343=test_gem_resolver_local_specification I, [2024-05-17T08:03:45.706363 #844344] INFO -- : [419/885] 885343=test_gem_commands_list_command I, [2024-05-17T08:03:45.780087 #844344] INFO -- : [420/885] 885343=test_date_new I, [2024-05-17T08:03:45.797064 #844344] INFO -- : [421/885] 885343=test_input_method I, [2024-05-17T08:03:45.830450 #844344] INFO -- : [422/885] 885343=test_io I, [2024-05-17T08:03:46.020831 #844344] INFO -- : [423/885] 885343=test_rdoc_i18n_text I, [2024-05-17T08:03:46.032658 #844344] INFO -- : [424/885] 885343=test_gem_unsatisfiable_dependency_error I, [2024-05-17T08:03:46.052765 #844344] INFO -- : [425/885] 885343=test_literal I, [2024-05-17T08:03:46.662002 #844344] INFO -- : [426/885] 885343=test_thread I, [2024-05-17T08:03:46.875927 #844344] INFO -- : [427/885] 885343=test_config I, [2024-05-17T08:03:46.900950 #844344] INFO -- : [428/885] 885344=test_complex2 I, [2024-05-17T08:03:46.913366 #844344] INFO -- : [429/885] 885344=test_gem_security_signer I, [2024-05-17T08:03:46.924897 #844344] INFO -- : [430/885] 885343=test_gem_util I, [2024-05-17T08:03:47.013648 #844344] INFO -- : [431/885] 885344=test_win32ole_typelib I, [2024-05-17T08:03:47.023769 #844344] INFO -- : [432/885] 885344=test_pkey I, [2024-05-17T08:03:47.035779 #844344] INFO -- : [433/885] 885344=test_external_new I, [2024-05-17T08:03:47.043163 #844344] INFO -- : [434/885] 885344=test_bigzero I, [2024-05-17T08:03:47.055584 #844344] INFO -- : [435/885] 885344=test_gem_platform I, [2024-05-17T08:03:47.090770 #844344] INFO -- : [436/885] 885343=test_gem_commands_query_command I, [2024-05-17T08:03:47.155474 #844344] INFO -- : [437/885] 885344=test_null I, [2024-05-17T08:03:47.180989 #844344] INFO -- : [438/885] 885344=test_ractor I, [2024-05-17T08:03:47.241628 #844344] INFO -- : [439/885] 885344=test_data I, [2024-05-17T08:03:47.256431 #844344] INFO -- : [440/885] 885344=test_memory_view I, [2024-05-17T08:03:47.284704 #844344] INFO -- : [441/885] 885344=test_multi_irb_commands I, [2024-05-17T08:03:47.287150 #844344] INFO -- : [442/885] 885344=test_pkey_dh I, [2024-05-17T08:03:47.879482 #844344] INFO -- : [443/885] 885343=test_m17n_comb I, [2024-05-17T08:03:48.126266 #844344] INFO -- : [444/885] 885345=test_singleton I, [2024-05-17T08:03:48.135828 #844344] INFO -- : [445/885] 885345=test_numeric I, [2024-05-17T08:03:48.144950 #844344] INFO -- : [446/885] 885345=test_fstring I, [2024-05-17T08:03:48.252129 #844344] INFO -- : [447/885] 885345=test_rdoc_require I, [2024-05-17T08:03:48.386007 #844344] INFO -- : [448/885] 885345=test_gem_ext_rake_builder I, [2024-05-17T08:03:48.621151 #844344] INFO -- : [449/885] 885344=test_word I, [2024-05-17T08:03:48.632938 #844344] INFO -- : [450/885] 885344=test_timeout I, [2024-05-17T08:03:48.852954 #844344] INFO -- : [451/885] 885345=test_key_name_check I, [2024-05-17T08:03:48.863861 #844344] INFO -- : [452/885] 885345=test_rdoc_markup_to_bs I, [2024-05-17T08:03:48.908502 #844344] INFO -- : [453/885] 885345=test_rdoc_markup_raw I, [2024-05-17T08:03:48.911359 #844344] INFO -- : [454/885] 885345=test_instrumentation_api I, [2024-05-17T08:03:49.566008 #844344] INFO -- : [455/885] 885344=test_weakref I, [2024-05-17T08:03:49.927580 #844344] INFO -- : [456/885] 885344=test_rdoc_alias I, [2024-05-17T08:03:49.937292 #844344] INFO -- : [457/885] 885344=test_gem_commands_stale_command I, [2024-05-17T08:03:49.947867 #844344] INFO -- : [458/885] 885344=ruby_parser_test I, [2024-05-17T08:03:49.956325 #844344] INFO -- : [459/885] 885344=test_rdoc_markup_to_tt_only I, [2024-05-17T08:03:49.999299 #844344] INFO -- : [460/885] 885344=test_date_strftime I, [2024-05-17T08:03:50.430539 #844344] INFO -- : [461/885] 885344=json_parser_test I, [2024-05-17T08:03:50.469293 #844344] INFO -- : [462/885] 885344=test_ws I, [2024-05-17T08:03:50.546764 #844344] INFO -- : [463/885] 885344=test_gem_commands_cert_command I, [2024-05-17T08:03:50.834745 #844344] INFO -- : [464/885] 885343=test_scalar I, [2024-05-17T08:03:50.907316 #844344] INFO -- : [465/885] 885343=test_syntax I, [2024-05-17T08:03:51.408696 #844344] INFO -- : [466/885] 885344=test_class_name_check I, [2024-05-17T08:03:51.440323 #844344] INFO -- : [467/885] 885344=test_basicsocket I, [2024-05-17T08:03:51.469998 #844344] INFO -- : [468/885] 885344=test_zsh_completion I, [2024-05-17T08:03:51.489599 #844344] INFO -- : [469/885] 885344=test_pkcs7 I, [2024-05-17T08:03:51.667826 #844344] INFO -- : [470/885] 885344=test_gem_commands_environment_command I, [2024-05-17T08:03:51.726539 #844344] INFO -- : [471/885] 885344=test_pack I, [2024-05-17T08:03:51.866718 #844344] INFO -- : [472/885] 885345=test_rdoc_context_section I, [2024-05-17T08:03:51.878756 #844344] INFO -- : [473/885] 885345=test_io_buffer I, [2024-05-17T08:03:51.890033 #844344] INFO -- : [474/885] 885344=test_deprecated I, [2024-05-17T08:03:51.900282 #844344] INFO -- : [475/885] 885344=test_optparse I, [2024-05-17T08:03:51.956298 #844344] INFO -- : [476/885] 885344=test_bash_completion I, [2024-05-17T08:03:51.978217 #844344] INFO -- : [477/885] 885344=test_exception I, [2024-05-17T08:03:52.003880 #844344] INFO -- : [478/885] 885345=test_div I, [2024-05-17T08:03:52.094405 #844344] INFO -- : [479/885] 885345=test_files_test_2 I, [2024-05-17T08:03:54.657466 #844344] INFO -- : [480/885] 885345=test_rdoc_markup_to_html_crossref I, [2024-05-17T08:03:54.968630 #844344] INFO -- : [481/885] 885345=test_rdoc_markup_indented_paragraph I, [2024-05-17T08:03:55.976893 #844344] INFO -- : [482/885] 885345=test_iseq_load I, [2024-05-17T08:03:56.174947 #844344] INFO -- : [483/885] 885345=test_rdoc_markup_parser I, [2024-05-17T08:03:56.230291 #844344] INFO -- : [484/885] 885345=test_stream I, [2024-05-17T08:03:56.232215 #844344] INFO -- : [485/885] 885345=test_have_library I, [2024-05-17T08:03:57.028571 #844344] INFO -- : [486/885] 885344=test_ns_spki I, [2024-05-17T08:03:57.041450 #844344] INFO -- : [487/885] 885344=test_stringify_symbols I, [2024-05-17T08:03:57.046405 #844344] INFO -- : [488/885] 885344=test_require I, [2024-05-17T08:03:57.080720 #844344] INFO -- : [489/885] 885344=test_objspace I, [2024-05-17T08:03:57.243647 #844344] INFO -- : [490/885] 885345=test_rdoc_text I, [2024-05-17T08:03:57.304636 #844344] INFO -- : [491/885] 885345=library_symbols_test I, [2024-05-17T08:03:57.325093 #844344] INFO -- : [492/885] 885345=test_httpresponses I, [2024-05-17T08:03:57.339828 #844344] INFO -- : [493/885] 885345=test_rdoc_constant I, [2024-05-17T08:03:57.431184 #844344] INFO -- : [494/885] 885345=test_deprecate I, [2024-05-17T08:03:57.477627 #844344] INFO -- : [495/885] 885345=test_generic I, [2024-05-17T08:03:57.501532 #844344] INFO -- : [496/885] 885345=test_rdoc_markup_to_html_snippet I, [2024-05-17T08:03:57.673455 #844344] INFO -- : [497/885] 885345=test_common I, [2024-05-17T08:03:57.776022 #844344] INFO -- : [498/885] 885345=test_win32ole_variant_outarg I, [2024-05-17T08:03:57.788069 #844344] INFO -- : [499/885] 885345=test_rdoc_encoding I, [2024-05-17T08:03:57.875466 #844344] INFO -- : [500/885] 885345=test_key_actor_vi I, [2024-05-17T08:03:57.993958 #844344] INFO -- : [501/885] 885345=test_postponed_job I, [2024-05-17T08:03:58.330844 #844344] INFO -- : [502/885] 885345=test_gem_request_set_lockfile I, [2024-05-17T08:03:58.791203 #844344] INFO -- : [503/885] 885345=test_rdoc_markdown I, [2024-05-17T08:03:59.041517 #844344] INFO -- : [504/885] 885345=test_rdoc_code_object I, [2024-05-17T08:03:59.374770 #844344] INFO -- : [505/885] 885345=test_process I, [2024-05-17T08:03:59.791283 #844344] INFO -- : [506/885] 885343=test_provider I, [2024-05-17T08:03:59.792067 #844344] INFO -- : [507/885] 885343=test_euc_kr I, [2024-05-17T08:03:59.815940 #844344] INFO -- : [508/885] 885343=test_gem_source_specific_file I, [2024-05-17T08:03:59.921490 #844344] INFO -- : [509/885] 885343=test_bmethod I, [2024-05-17T08:03:59.930743 #844344] INFO -- : [510/885] 885343=redundant_return_test I, [2024-05-17T08:03:59.944705 #844344] INFO -- : [511/885] 885343=test_rand I, [2024-05-17T08:04:00.416084 #844344] INFO -- : [512/885] 885343=test_string_processing I, [2024-05-17T08:04:00.425078 #844344] INFO -- : [513/885] 885343=test_random_formatter I, [2024-05-17T08:04:00.448164 #844344] INFO -- : [514/885] 885343=test_rdoc_markup_attributes I, [2024-05-17T08:04:00.463001 #844344] INFO -- : [515/885] 885343=test_tsort I, [2024-05-17T08:04:00.492190 #844344] INFO -- : [516/885] 885343=test_typeddata I, [2024-05-17T08:04:00.718238 #844344] INFO -- : [517/885] 885343=test_gem_commands_fetch_command I, [2024-05-17T08:04:00.953786 #844344] INFO -- : [518/885] 885343=test_securerandom I, [2024-05-17T08:04:00.991372 #844344] INFO -- : [519/885] 885343=test_gem_commands_outdated_command I, [2024-05-17T08:04:01.039106 #844344] INFO -- : [520/885] 885343=test_gem_dependency_list I, [2024-05-17T08:04:01.118582 #844344] INFO -- : [521/885] 885343=test_rdoc_parser_changelog I, [2024-05-17T08:04:01.230231 #844344] INFO -- : [522/885] 885343=parameters_signature_test I, [2024-05-17T08:04:01.252513 #844344] INFO -- : [523/885] 885343=test_gem_doctor I, [2024-05-17T08:04:01.300209 #844344] INFO -- : [524/885] 885343=json_fixtures_test I, [2024-05-17T08:04:01.309159 #844344] INFO -- : [525/885] 885343=test_len I, [2024-05-17T08:04:01.317687 #844344] INFO -- : [526/885] 885343=test_kwargs I, [2024-05-17T08:04:01.334553 #844344] INFO -- : [527/885] 885343=test_rdoc_parser_c I, [2024-05-17T08:04:01.810555 #844344] INFO -- : [528/885] 885343=test_io_wait I, [2024-05-17T08:04:02.220634 #844344] INFO -- : [529/885] 885343=test_pack I, [2024-05-17T08:04:02.447484 #844344] INFO -- : [530/885] 885343=parse_test I, [2024-05-17T08:04:05.715855 #844344] INFO -- : [531/885] 885343=test_tcp I, [2024-05-17T08:04:05.847086 #844344] INFO -- : [532/885] 885343=test_win32ole_method_event I, [2024-05-17T08:04:05.859562 #844344] INFO -- : [533/885] 885343=parse_comments_test I, [2024-05-17T08:04:05.871450 #844344] INFO -- : [534/885] 885343=test_gem_name_tuple I, [2024-05-17T08:04:05.892884 #844344] INFO -- : [535/885] 885343=test_rdoc_markup_to_table_of_contents I, [2024-05-17T08:04:05.928413 #844344] INFO -- : [536/885] 885343=test_integer I, [2024-05-17T08:04:05.997266 #844344] INFO -- : [537/885] 885343=test_gem_requirement I, [2024-05-17T08:04:06.149911 #844344] INFO -- : [538/885] 885343=test_pipe I, [2024-05-17T08:04:06.299022 #844344] INFO -- : [539/885] 885343=test_string I, [2024-05-17T08:04:16.597500 #844344] INFO -- : [540/885] 885345=test_macro I, [2024-05-17T08:04:16.609782 #844344] INFO -- : [541/885] 885345=test_function I, [2024-05-17T08:04:16.853465 #844344] INFO -- : [542/885] 885345=test_gem_resolver_activation_request I, [2024-05-17T08:04:16.868667 #844344] INFO -- : [543/885] 885345=test_gem_commands_server_command I, [2024-05-17T08:04:16.929182 #844344] INFO -- : [544/885] 885345=test_encoding I, [2024-05-17T08:04:17.061388 #844344] INFO -- : [545/885] 885345=test_hmac I, [2024-05-17T08:04:17.069736 #844344] INFO -- : [546/885] 885345=test_rdoc_generator_markup I, [2024-05-17T08:04:17.248020 #844344] INFO -- : [547/885] 885345=test_constant I, [2024-05-17T08:04:18.995421 #844344] INFO -- : [548/885] 885345=test_find I, [2024-05-17T08:04:19.020341 #844344] INFO -- : [549/885] 885345=test_rat I, [2024-05-17T08:04:20.036757 #844344] INFO -- : [550/885] 885345=test_gem_request_connection_pools I, [2024-05-17T08:04:20.083782 #844344] INFO -- : [551/885] 885345=test_init I, [2024-05-17T08:04:20.593350 #844344] INFO -- : [552/885] 885345=test_flags I, [2024-05-17T08:04:20.984684 #844344] INFO -- : [553/885] 885345=test_numeric I, [2024-05-17T08:04:21.053886 #844344] INFO -- : [554/885] 885345=test_bug-3571 I, [2024-05-17T08:04:21.065219 #844344] INFO -- : [555/885] 885345=test_yamlstore I, [2024-05-17T08:04:21.081155 #844344] INFO -- : [556/885] 885345=test_file I, [2024-05-17T08:04:21.096596 #844344] INFO -- : [557/885] 885345=test_time I, [2024-05-17T08:04:21.216908 #844344] INFO -- : [558/885] 885345=test_capacity I, [2024-05-17T08:04:21.237280 #844344] INFO -- : [559/885] 885345=test_gem_commands_owner_command I, [2024-05-17T08:04:21.888670 #844344] INFO -- : [560/885] 885345=test_nextafter I, [2024-05-17T08:04:22.055797 #844344] INFO -- : [561/885] 885345=test_gem_ext_cargo_builder I, [2024-05-17T08:04:22.057812 #844344] INFO -- : [562/885] 885345=test_console_attr I, [2024-05-17T08:04:22.088896 #844344] INFO -- : [563/885] 885345=test_proc I, [2024-05-17T08:04:23.045521 #844344] INFO -- : [564/885] 885345=test_gem_commands_unpack_command I, [2024-05-17T08:04:23.371682 #844344] INFO -- : [565/885] 885345=test_zlib I, [2024-05-17T08:04:32.632838 #844344] INFO -- : [566/885] 885345=test_rdoc_options I, [2024-05-17T08:04:32.966212 #844344] INFO -- : [567/885] 885345=test_ubf_async_safe I, [2024-05-17T08:04:32.974602 #844344] INFO -- : [568/885] 885345=test_pstore I, [2024-05-17T08:04:33.189072 #844344] INFO -- : [569/885] 885345=test_win32ole_record I, [2024-05-17T08:04:33.205336 #844344] INFO -- : [570/885] 885345=test_rdoc_include I, [2024-05-17T08:04:33.240360 #844344] INFO -- : [571/885] 885345=test_gem_version_option I, [2024-05-17T08:04:33.301650 #844344] INFO -- : [572/885] 885345=test_date_compat I, [2024-05-17T08:04:33.309181 #844344] INFO -- : [573/885] 885345=test_resource I, [2024-05-17T08:04:33.330850 #844344] INFO -- : [574/885] 885345=test_gem_package_tar_reader_entry I, [2024-05-17T08:04:33.633229 #844344] INFO -- : [575/885] 885345=test_gem_uri I, [2024-05-17T08:04:33.666577 #844344] INFO -- : [576/885] 885345=test_bug-5832 I, [2024-05-17T08:04:33.673983 #844344] INFO -- : [577/885] 885345=test_yield_block I, [2024-05-17T08:04:33.730781 #844344] INFO -- : [578/885] 885345=test_c_struct_builder I, [2024-05-17T08:04:33.983599 #844344] INFO -- : [579/885] 885345=test_path_to_class I, [2024-05-17T08:04:33.990760 #844344] INFO -- : [580/885] 885345=test_enumerator I, [2024-05-17T08:04:34.000127 #844344] INFO -- : [581/885] 885345=test_reqarg I, [2024-05-17T08:04:34.314811 #844344] INFO -- : [582/885] 885345=test_frozen_error I, [2024-05-17T08:04:34.327517 #844344] INFO -- : [583/885] 885345=test_spell_checker I, [2024-05-17T08:04:34.341944 #844344] INFO -- : [584/885] 885345=test_gem_version I, [2024-05-17T08:04:34.608760 #844344] INFO -- : [585/885] 885345=test_gem_ext_ext_conf_builder I, [2024-05-17T08:04:35.595133 #844344] INFO -- : [586/885] 885345=test_io_buffer I, [2024-05-17T08:04:35.665861 #844344] INFO -- : [587/885] 885345=test_kdf I, [2024-05-17T08:04:35.731531 #844344] INFO -- : [588/885] 885345=test_ldap I, [2024-05-17T08:04:35.743621 #844344] INFO -- : [589/885] 885345=test_thread_queue I, [2024-05-17T08:04:42.599683 #844344] INFO -- : [590/885] 885345=test_passing_block I, [2024-05-17T08:04:42.618673 #844344] INFO -- : [591/885] 885345=test_defined I, [2024-05-17T08:04:42.698565 #844344] INFO -- : [592/885] 885345=test_nowrite I, [2024-05-17T08:04:42.735760 #844344] INFO -- : [593/885] 885345=json_string_matching_test I, [2024-05-17T08:04:42.748958 #844344] INFO -- : [594/885] 885345=test_gem_config_file I, [2024-05-17T08:04:42.943408 #844344] INFO -- : [595/885] 885345=test_comparable I, [2024-05-17T08:04:42.957882 #844344] INFO -- : [596/885] 885345=test_rdoc_rdoc I, [2024-05-17T08:04:43.033597 #844344] INFO -- : [597/885] 885345=test_yjit_exit_locations I, [2024-05-17T08:04:43.048942 #844344] INFO -- : [598/885] 885345=test_rdoc_normal_module I, [2024-05-17T08:04:43.083871 #844344] INFO -- : [599/885] 885345=test_type_completor I, [2024-05-17T08:04:43.091402 #844344] INFO -- : [600/885] 885345=test_io_timeout I, [2024-05-17T08:04:43.140419 #844344] INFO -- : [601/885] 885345=test_rdoc_markdown_test I, [2024-05-17T08:04:44.335054 #844344] INFO -- : [602/885] 885345=test_yaml_tree I, [2024-05-17T08:04:44.382837 #844344] INFO -- : [603/885] 885345=test_gem_commands_yank_command I, [2024-05-17T08:04:45.316373 #844344] INFO -- : [604/885] 885345=test_cstr I, [2024-05-17T08:04:46.945555 #844344] INFO -- : [605/885] 885345=test_euc_tw I, [2024-05-17T08:04:46.961340 #844344] INFO -- : [606/885] 885345=test_command I, [2024-05-17T08:04:47.286999 #844344] INFO -- : [607/885] 885345=test_gem_resolver_dependency_request I, [2024-05-17T08:04:47.318993 #844344] INFO -- : [608/885] 885345=test_big2str I, [2024-05-17T08:04:47.344992 #844344] INFO -- : [609/885] 885345=test_gem_resolver_specification I, [2024-05-17T08:04:47.368657 #844344] INFO -- : [610/885] 885345=test_logger I, [2024-05-17T08:04:47.399006 #844344] INFO -- : [611/885] 885345=test_pkey_dsa I, [2024-05-17T08:04:48.232195 #844344] INFO -- : [612/885] 885343=test_human_typo I, [2024-05-17T08:04:48.305480 #844344] INFO -- : [613/885] 885343=test_import I, [2024-05-17T08:04:50.255853 #844344] INFO -- : [614/885] 885345=test_wait I, [2024-05-17T08:04:50.314368 #844344] INFO -- : [615/885] 885345=test_nil I, [2024-05-17T08:04:50.324828 #844344] INFO -- : [616/885] 885345=test_psych I, [2024-05-17T08:04:50.361591 #844344] INFO -- : [617/885] 885345=test_string I, [2024-05-17T08:04:50.381480 #844344] INFO -- : [618/885] 885345=json_common_interface_test I, [2024-05-17T08:04:50.425035 #844344] INFO -- : [619/885] 885345=test_error_highlight I, [2024-05-17T08:04:51.129776 #844344] INFO -- : [620/885] 885345=test_rdoc_any_method I, [2024-05-17T08:04:51.512716 #844344] INFO -- : [621/885] 885345=test_function_entry I, [2024-05-17T08:04:51.514328 #844344] INFO -- : [622/885] 885345=test_raise I, [2024-05-17T08:04:51.524780 #844344] INFO -- : [623/885] 885345=test_complexrational I, [2024-05-17T08:04:51.526532 #844344] INFO -- : [624/885] 885345=version_test I, [2024-05-17T08:04:51.533253 #844344] INFO -- : [625/885] 885345=test_files_lib I, [2024-05-17T08:04:51.541204 #844344] INFO -- : [626/885] 885345=test_string_memory I, [2024-05-17T08:04:51.605285 #844344] INFO -- : [627/885] 885343=test_help I, [2024-05-17T08:04:51.612198 #844344] INFO -- : [628/885] 885343=test_enumerator_kw I, [2024-05-17T08:04:51.613866 #844344] INFO -- : [629/885] 885343=reflection_test I, [2024-05-17T08:04:51.632588 #844344] INFO -- : [630/885] 885343=test_line_editor I, [2024-05-17T08:04:51.643450 #844344] INFO -- : [631/885] 885343=test_marshalable I, [2024-05-17T08:04:51.653341 #844344] INFO -- : [632/885] 885343=test_erb_m17n I, [2024-05-17T08:04:51.665858 #844344] INFO -- : [633/885] 885343=test_rdoc_generator_pot_po_entry I, [2024-05-17T08:04:51.681179 #844344] INFO -- : [634/885] 885343=test_timeout I, [2024-05-17T08:04:51.696592 #844344] INFO -- : [635/885] 885343=test_rdoc_markup_verbatim I, [2024-05-17T08:04:51.747874 #844344] INFO -- : [636/885] 885343=test_webauthn_poller I, [2024-05-17T08:04:51.755769 #844344] INFO -- : [637/885] 885345=test_date_conv I, [2024-05-17T08:04:51.765064 #844344] INFO -- : [638/885] 885345=test_frozen I, [2024-05-17T08:04:51.779722 #844344] INFO -- : [639/885] 885345=test_gem_resolver_index_specification I, [2024-05-17T08:04:51.833412 #844344] INFO -- : [640/885] 885345=test_serialize_subclasses I, [2024-05-17T08:04:51.837870 #844344] INFO -- : [641/885] 885345=test_egrep_cpp I, [2024-05-17T08:04:51.873499 #844344] INFO -- : [642/885] 885343=test_tree_builder I, [2024-05-17T08:04:51.884449 #844344] INFO -- : [643/885] 885343=test_gem_commands_update_command I, [2024-05-17T08:04:51.920774 #844344] INFO -- : [644/885] 885344=test_date I, [2024-05-17T08:04:51.930452 #844344] INFO -- : [645/885] 885344=test_big5 I, [2024-05-17T08:04:51.938238 #844344] INFO -- : [646/885] 885344=test_protect I, [2024-05-17T08:04:51.940142 #844344] INFO -- : [647/885] 885345=test_fnmatch I, [2024-05-17T08:04:51.944430 #844344] INFO -- : [648/885] 885344=test_pathname I, [2024-05-17T08:04:51.989506 #844344] INFO -- : [649/885] 885345=test_rdoc_markup_pre_process I, [2024-05-17T08:04:52.176133 #844344] INFO -- : [650/885] 885344=test_store I, [2024-05-17T08:04:52.207749 #844344] INFO -- : [651/885] 885345=test_coverage I, [2024-05-17T08:04:52.504755 #844344] INFO -- : [652/885] 885344=test_http_request I, [2024-05-17T08:04:52.519386 #844344] INFO -- : [653/885] 885344=test_tempfile I, [2024-05-17T08:04:52.841058 #844344] INFO -- : [654/885] 885344=encoding_test I, [2024-05-17T08:04:52.996874 #844344] INFO -- : [655/885] 885344=test_scan_args I, [2024-05-17T08:04:53.021651 #844344] INFO -- : [656/885] 885344=test_gem_commands_specification_command I, [2024-05-17T08:04:53.069270 #844344] INFO -- : [657/885] 885345=test_gem_commands_which_command I, [2024-05-17T08:04:53.141883 #844344] INFO -- : [658/885] 885344=test_gem_request I, [2024-05-17T08:04:53.159246 #844344] INFO -- : [659/885] 885345=test_gem_package_old I, [2024-05-17T08:04:53.212450 #844344] INFO -- : [660/885] 885345=test_pty I, [2024-05-17T08:04:53.372731 #844344] INFO -- : [661/885] 885344=test_gem_dependency_installer I, [2024-05-17T08:04:53.604895 #844344] INFO -- : [662/885] 885343=test_http I, [2024-05-17T08:04:53.611738 #844344] INFO -- : [663/885] 885343=parser_test I, [2024-05-17T08:04:53.624246 #844344] INFO -- : [664/885] 885343=test_hash I, [2024-05-17T08:04:53.695337 #844344] INFO -- : [665/885] 885345=test_win32ole I, [2024-05-17T08:04:53.695667 #844344] INFO -- : [666/885] 885345=test_internal_ivar I, [2024-05-17T08:04:53.725382 #844344] INFO -- : [667/885] 885345=test_gem_source_local I, [2024-05-17T08:04:53.963706 #844344] INFO -- : [668/885] 885345=desugar_compiler_test I, [2024-05-17T08:04:53.975488 #844344] INFO -- : [669/885] 885345=test_rendering I, [2024-05-17T08:04:53.994944 #844344] INFO -- : [670/885] 885345=test_gem_gemcutter_utilities I, [2024-05-17T08:04:54.451313 #844344] INFO -- : [671/885] 885345=test_rdoc_task I, [2024-05-17T08:04:54.462788 #844344] INFO -- : [672/885] 885345=test_tracepoint I, [2024-05-17T08:04:54.875228 #844344] INFO -- : [673/885] 885345=test_gem_text I, [2024-05-17T08:04:54.978212 #844344] INFO -- : [674/885] 885345=test_settracefunc I, [2024-05-17T08:04:56.055735 #844344] INFO -- : [675/885] 885345=test_backtrace I, [2024-05-17T08:04:56.066141 #844344] INFO -- : [676/885] 885344=test_gem_commands_push_command I, [2024-05-17T08:04:56.708609 #844344] INFO -- : [677/885] 885344=locals_test I, [2024-05-17T08:04:57.134448 #844344] INFO -- : [678/885] 885344=test_too_many_dummy_encodings I, [2024-05-17T08:04:57.142339 #844344] INFO -- : [679/885] 885344=test_method_cache I, [2024-05-17T08:04:57.153272 #844344] INFO -- : [680/885] 885344=test_sprintf_comb I, [2024-05-17T08:04:57.319681 #844344] INFO -- : [681/885] 885344=test_rdoc_markup_to_rdoc I, [2024-05-17T08:04:57.386266 #844344] INFO -- : [682/885] 885344=test_severity I, [2024-05-17T08:04:57.393450 #844344] INFO -- : [683/885] 885344=test_case I, [2024-05-17T08:04:57.400869 #844344] INFO -- : [684/885] 885344=test_ractor I, [2024-05-17T08:04:57.412144 #844344] INFO -- : [685/885] 885345=test_gem_package_tar_writer I, [2024-05-17T08:04:57.420754 #844344] INFO -- : [686/885] 885344=test_str2big I, [2024-05-17T08:04:57.429519 #844344] INFO -- : [687/885] 885344=test_http I, [2024-05-17T08:04:57.608438 #844344] INFO -- : [688/885] 885345=test_utf16 I, [2024-05-17T08:04:57.626768 #844344] INFO -- : [689/885] 885345=attribute_write_test I, [2024-05-17T08:04:57.635745 #844344] INFO -- : [690/885] 885345=test_set I, [2024-05-17T08:04:57.648283 #844344] INFO -- : [691/885] 885345=test_filter I, [2024-05-17T08:04:57.674546 #844344] INFO -- : [692/885] 885345=test_parser_events I, [2024-05-17T08:04:57.779698 #844344] INFO -- : [693/885] 885345=test_pkcs12 I, [2024-05-17T08:04:57.900892 #844344] INFO -- : [694/885] 885343=test_gem_remote_fetcher I, [2024-05-17T08:04:58.478955 #844344] INFO -- : [695/885] 885345=test_koi8 I, [2024-05-17T08:04:58.487566 #844344] INFO -- : [696/885] 885345=test_json_tree I, [2024-05-17T08:04:58.511420 #844344] INFO -- : [697/885] 885345=test_argf I, [2024-05-17T08:04:59.895213 #844344] INFO -- : [698/885] 885343=test_yaml I, [2024-05-17T08:05:00.048814 #844344] INFO -- : [699/885] 885343=test_x509name I, [2024-05-17T08:05:00.066339 #844344] INFO -- : [700/885] 885343=test_gem_dependency I, [2024-05-17T08:05:00.217358 #844344] INFO -- : [701/885] 885343=test_cclass I, [2024-05-17T08:05:00.267213 #844344] INFO -- : [702/885] 885343=test_gem_uninstaller I, [2024-05-17T08:05:01.481449 #844344] INFO -- : [703/885] 885343=test_yjit I, [2024-05-17T08:05:01.501729 #844344] INFO -- : [704/885] 885343=test_m17n I, [2024-05-17T08:05:01.569622 #844344] INFO -- : [705/885] 885343=test_method I, [2024-05-17T08:05:02.111775 #844344] INFO -- : [706/885] 885345=test_win32ole_variable I, [2024-05-17T08:05:02.133026 #844344] INFO -- : [707/885] 885345=test_rdoc_class_module I, [2024-05-17T08:05:02.714959 #844344] INFO -- : [708/885] 885345=test_rdoc_cross_reference I, [2024-05-17T08:05:03.139899 #844344] INFO -- : [709/885] 885345=test_parse I, [2024-05-17T08:05:03.586191 #844344] INFO -- : [710/885] 885345=test_method_cache I, [2024-05-17T08:05:03.625357 #844344] INFO -- : [711/885] 885345=test_gem_specification I, [2024-05-17T08:05:06.117960 #844344] INFO -- : [712/885] 885345=test_flush I, [2024-05-17T08:05:06.194457 #844344] INFO -- : [713/885] 885345=test_pkey_rsa I, [2024-05-17T08:05:06.366169 #844344] INFO -- : [714/885] 885344=test_numhash I, [2024-05-17T08:05:06.376365 #844344] INFO -- : [715/885] 885344=test_system I, [2024-05-17T08:05:06.408984 #844344] INFO -- : [716/885] 885345=test_face I, [2024-05-17T08:05:06.630371 #844344] INFO -- : [717/885] 885345=test_sizeof I, [2024-05-17T08:05:07.231301 #844344] INFO -- : [718/885] 885344=test_date_attr I, [2024-05-17T08:05:07.250412 #844344] INFO -- : [719/885] 885344=test_gem_request_set_lockfile_parser I, [2024-05-17T08:05:07.424259 #844344] INFO -- : [720/885] 885344=test_stringchar I, [2024-05-17T08:05:07.440256 #844344] INFO -- : [721/885] 885344=warnings_test I, [2024-05-17T08:05:07.460839 #844344] INFO -- : [722/885] 885344=test_econv I, [2024-05-17T08:05:08.405968 #844344] INFO -- : [723/885] 885344=test_gem_install_update_options I, [2024-05-17T08:05:08.519577 #844344] INFO -- : [724/885] 885344=test_cp949 I, [2024-05-17T08:05:08.528288 #844344] INFO -- : [725/885] 885344=test_jaro_winkler I, [2024-05-17T08:05:08.541447 #844344] INFO -- : [726/885] 885344=test_gem_resolver_vendor_set I, [2024-05-17T08:05:08.565993 #844344] INFO -- : [727/885] 885344=test_condition I, [2024-05-17T08:05:08.577982 #844344] INFO -- : [728/885] 885344=test_gem_dependency_resolution_error I, [2024-05-17T08:05:08.586252 #844344] INFO -- : [729/885] 885344=test_mixed_unicode_escapes I, [2024-05-17T08:05:08.845653 #844344] INFO -- : [730/885] 885344=test_sleep I, [2024-05-17T08:05:08.872118 #844344] INFO -- : [731/885] 885345=test_fileutils I, [2024-05-17T08:05:09.425003 #844344] INFO -- : [732/885] 885345=test_sorted_set I, [2024-05-17T08:05:09.560813 #844344] INFO -- : [733/885] 885345=test_emoji I, [2024-05-17T08:05:09.600955 #844344] INFO -- : [734/885] 885345=test_windows_1252 I, [2024-05-17T08:05:09.957682 #844344] INFO -- : [735/885] 885345=test_stack I, [2024-05-17T08:05:10.400072 #844344] INFO -- : [736/885] 885345=test_rdoc_generator_json_index I, [2024-05-17T08:05:10.432714 #844344] INFO -- : [737/885] 885345=test_date_time I, [2024-05-17T08:05:10.440823 #844344] INFO -- : [738/885] 885345=test_nil2vtempty I, [2024-05-17T08:05:10.442429 #844344] INFO -- : [739/885] 885345=test_framework I, [2024-05-17T08:05:10.600051 #844344] INFO -- : [740/885] 885345=test_weakmap I, [2024-05-17T08:05:10.649720 #844344] INFO -- : [741/885] 885344=test_coderange I, [2024-05-17T08:05:10.661977 #844344] INFO -- : [742/885] 885344=test_inadvertent_creation I, [2024-05-17T08:05:10.753587 #844344] INFO -- : [743/885] 885344=test_ansi_with_terminfo I, [2024-05-17T08:05:10.840175 #844344] INFO -- : [744/885] 885344=test_pack I, [2024-05-17T08:05:10.854381 #844344] INFO -- : [745/885] 885344=test_cgi_tag_helper I, [2024-05-17T08:05:10.941536 #844344] INFO -- : [746/885] 885344=test_pinned I, [2024-05-17T08:05:11.027586 #844344] INFO -- : [747/885] 885344=test_iso_8859 I, [2024-05-17T08:05:11.082608 #844344] INFO -- : [748/885] 885344=ripper_test I, [2024-05-17T08:05:11.596873 #844344] INFO -- : [749/885] 885344=test_libs I, [2024-05-17T08:05:11.618490 #844344] INFO -- : [750/885] 885344=test_qsort I, [2024-05-17T08:05:11.628558 #844344] INFO -- : [751/885] 885344=comments_test I, [2024-05-17T08:05:11.630873 #844344] INFO -- : [752/885] 885344=test_gc I, [2024-05-17T08:05:11.641944 #844344] INFO -- : [753/885] 885344=test_math I, [2024-05-17T08:05:11.660853 #844344] INFO -- : [754/885] 885344=test_safe_load I, [2024-05-17T08:05:11.675033 #844344] INFO -- : [755/885] 885344=test_sprintf I, [2024-05-17T08:05:11.872671 #844344] INFO -- : [756/885] 885344=index_write_test I, [2024-05-17T08:05:11.904212 #844344] INFO -- : [757/885] 885344=test_rdoc_parser_rd I, [2024-05-17T08:05:11.934640 #844344] INFO -- : [758/885] 885344=test_const I, [2024-05-17T08:05:11.947932 #844344] INFO -- : [759/885] 885344=test_exit I, [2024-05-17T08:05:12.039770 #844344] INFO -- : [760/885] 885344=test_class I, [2024-05-17T08:05:14.495297 #844344] INFO -- : [761/885] 885344=test_gem_commands_sources_command I, [2024-05-17T08:05:14.709240 #844344] INFO -- : [762/885] 885344=test_name_error I, [2024-05-17T08:05:14.801958 #844344] INFO -- : [763/885] 885344=json_addition_test I, [2024-05-17T08:05:14.816613 #844344] INFO -- : [764/885] 885344=test_gem_source_list I, [2024-05-17T08:05:14.871661 #844344] INFO -- : [765/885] 885344=test_recorder I, [2024-05-17T08:05:14.894071 #844344] INFO -- : [766/885] 885344=test_yaml_special_cases I, [2024-05-17T08:05:14.912877 #844344] INFO -- : [767/885] 885344=test_case I, [2024-05-17T08:05:14.958728 #844344] INFO -- : [768/885] 885344=test_open-uri I, [2024-05-17T08:05:15.240697 #844344] INFO -- : [769/885] 885343=test_enc_associate I, [2024-05-17T08:05:15.348408 #844344] INFO -- : [770/885] 885344=test_enumerator I, [2024-05-17T08:05:15.718625 #844344] INFO -- : [771/885] 885343=test_gem_command_manager I, [2024-05-17T08:05:15.900145 #844344] INFO -- : [772/885] 885343=test_rdoc_context I, [2024-05-17T08:05:16.645198 #844344] INFO -- : [773/885] 885343=test_array I, [2024-05-17T08:05:16.649512 #844344] INFO -- : [774/885] 885343=test_array_create I, [2024-05-17T08:05:16.660937 #844344] INFO -- : [775/885] 885343=test_dir_m17n I, [2024-05-17T08:05:17.959971 #844344] INFO -- : [776/885] 885343=test_memory_view I, [2024-05-17T08:05:18.609241 #844344] INFO -- : [777/885] 885343=test_complex I, [2024-05-17T08:05:19.702664 #844344] INFO -- : [778/885] 885343=test_threadgroup I, [2024-05-17T08:05:19.705549 #844344] INFO -- : [779/885] 885343=!Nothing_to_test I, [2024-05-17T08:05:19.707119 #844344] INFO -- : [780/885] 885343=test_fd_setsize I, [2024-05-17T08:05:19.750827 #844344] INFO -- : [781/885] 885343=test_process I, [2024-05-17T08:05:19.765869 #844344] INFO -- : [782/885] 885343=test_forwardable I, [2024-05-17T08:05:19.799349 #844344] INFO -- : [783/885] 885343=test_iterator I, [2024-05-17T08:05:19.861797 #844344] INFO -- : [784/885] 885343=test_string I, [2024-05-17T08:05:19.885652 #844344] INFO -- : [785/885] 885343=test_gem_commands_install_command I, [2024-05-17T08:05:21.967111 #844344] INFO -- : [786/885] 885343=test_kernel I, [2024-05-17T08:05:21.973489 #844344] INFO -- : [787/885] 885345=test_rendering I, [2024-05-17T08:05:21.992761 #844344] INFO -- : [788/885] 885345=pattern_test I, [2024-05-17T08:05:22.027067 #844344] INFO -- : [789/885] 885345=test_gem_rdoc I, [2024-05-17T08:05:22.162738 #844344] INFO -- : [790/885] 885345=test_dot_dot I, [2024-05-17T08:05:22.163930 #844344] INFO -- : [791/885] 885345=test_shapes I, [2024-05-17T08:05:22.179026 #844344] INFO -- : [792/885] 885345=test_did_you_mean I, [2024-05-17T08:05:22.240724 #844344] INFO -- : [793/885] 885345=test_rdoc_extend I, [2024-05-17T08:05:22.273187 #844344] INFO -- : [794/885] 885345=test_cesu8 I, [2024-05-17T08:05:22.276782 #844344] INFO -- : [795/885] 885345=test_storage I, [2024-05-17T08:05:22.305797 #844344] INFO -- : [796/885] 885345=test_method_name_check I, [2024-05-17T08:05:22.363132 #844344] INFO -- : [797/885] 885345=test_err_in_callback I, [2024-05-17T08:05:22.371921 #844344] INFO -- : [798/885] 885345=test_merge_keys I, [2024-05-17T08:05:22.388822 #844344] INFO -- : [799/885] 885345=test_gem_impossible_dependencies_error I, [2024-05-17T08:05:22.390970 #844344] INFO -- : [800/885] 885345=test_pp I, [2024-05-17T08:05:22.472445 #844344] INFO -- : [801/885] 885345=test_gem_resolver_requirement_list I, [2024-05-17T08:05:22.479545 #844344] INFO -- : [802/885] 885345=memsize_test I, [2024-05-17T08:05:22.497939 #844344] INFO -- : [803/885] 885345=test_exception I, [2024-05-17T08:05:22.576019 #844344] INFO -- : [804/885] 885345=test_raise_exception I, [2024-05-17T08:05:22.639523 #844344] INFO -- : [805/885] 885343=test_arith_seq_beg_len_step I, [2024-05-17T08:05:22.650502 #844344] INFO -- : [806/885] 885343=test_noarg I, [2024-05-17T08:05:22.781864 #844344] INFO -- : [807/885] 885343=test_basicinstructions I, [2024-05-17T08:05:22.850858 #844344] INFO -- : [808/885] 885343=test_utf32 I, [2024-05-17T08:05:22.882474 #844344] INFO -- : [809/885] 885343=test_gem_resolver_git_specification I, [2024-05-17T08:05:23.166127 #844344] INFO -- : [810/885] 885345=test_gem_security I, [2024-05-17T08:05:23.174006 #844344] INFO -- : [811/885] 885343=test_key_actor_emacs I, [2024-05-17T08:05:23.506879 #844344] INFO -- : [812/885] 885343=test_date_ractor I, [2024-05-17T08:05:23.518353 #844344] INFO -- : [813/885] 885343=test_erb I, [2024-05-17T08:05:23.584980 #844344] INFO -- : [814/885] 885343=test_variable I, [2024-05-17T08:05:23.698145 #844344] INFO -- : [815/885] 885343=test_hash I, [2024-05-17T08:05:23.716728 #844344] INFO -- : [816/885] 885343=test_rdoc_tom_doc I, [2024-05-17T08:05:23.743137 #844344] INFO -- : [817/885] 885343=test_optarg I, [2024-05-17T08:05:23.838398 #844344] INFO -- : [818/885] 885343=test_gem_commands_pristine_command I, [2024-05-17T08:05:25.314199 #844344] INFO -- : [819/885] 885343=test_verbose I, [2024-05-17T08:05:25.421378 #844344] INFO -- : [820/885] 885343=test_gem_commands_open_command I, [2024-05-17T08:05:25.443911 #844344] INFO -- : [821/885] 885343=test_normalize I, [2024-05-17T08:05:25.452699 #844344] INFO -- : [822/885] 885343=test_emoji_breaks I, [2024-05-17T08:05:25.468979 #844344] INFO -- : [823/885] 885343=test_assignment I, [2024-05-17T08:05:26.923214 #844344] INFO -- : [824/885] 885343=test_gem_update_suggestion I, [2024-05-17T08:05:26.931957 #844344] INFO -- : [825/885] 885343=test_undef I, [2024-05-17T08:05:26.984894 #844344] INFO -- : [826/885] 885343=test_rdoc_generator_darkfish I, [2024-05-17T08:05:27.331985 #844344] INFO -- : [827/885] 885343=test_gem_resolver_lock_set I, [2024-05-17T08:05:27.370413 #844344] INFO -- : [828/885] 885343=test_random I, [2024-05-17T08:05:27.410486 #844344] INFO -- : [829/885] 885343=test_gem_command I, [2024-05-17T08:05:27.552087 #844344] INFO -- : [830/885] 885343=test_asn1 I, [2024-05-17T08:05:27.573216 #844344] INFO -- : [831/885] 885343=regexp_test I, [2024-05-17T08:05:27.593604 #844344] INFO -- : [832/885] 885343=test_yield I, [2024-05-17T08:05:30.661786 #844344] INFO -- : [833/885] 885343=test_show_source I, [2024-05-17T08:05:30.673516 #844344] INFO -- : [834/885] 885343=test_remote_fetch_error I, [2024-05-17T08:05:30.756741 #844344] INFO -- : [835/885] 885343=test_data_error I, [2024-05-17T08:05:30.758708 #844344] INFO -- : [836/885] 885343=test_files_sample I, [2024-05-17T08:05:30.770962 #844344] INFO -- : [837/885] 885343=test_rdoc_stats I, [2024-05-17T08:05:30.849893 #844344] INFO -- : [838/885] 885343=test_rubyoptions I, [2024-05-17T08:05:32.206358 #844344] INFO -- : [839/885] 885345=test_force_exit I, [2024-05-17T08:05:32.276666 #844344] INFO -- : [840/885] 885345=test_optimization I, [2024-05-17T08:05:37.136481 #844344] INFO -- : [841/885] 885343=test_shift_jis I, [2024-05-17T08:05:37.159348 #844344] INFO -- : [842/885] 885343=test_rdoc_store I, [2024-05-17T08:05:37.834805 #844344] INFO -- : [843/885] 885343=test_gem_uri_formatter I, [2024-05-17T08:05:37.866872 #844344] INFO -- : [844/885] 885343=test_prettyprint I, [2024-05-17T08:05:37.908388 #844344] INFO -- : [845/885] 885343=test_ole_methods I, [2024-05-17T08:05:37.923335 #844344] INFO -- : [846/885] 885343=test_cgi_util I, [2024-05-17T08:05:38.174482 #844344] INFO -- : [847/885] 885343=test_clone I, [2024-05-17T08:05:38.341045 #844344] INFO -- : [848/885] 885343=test_enc_raise I, [2024-05-17T08:05:38.353000 #844344] INFO -- : [849/885] 885343=test_queue I, [2024-05-17T08:05:38.369405 #844344] INFO -- : [850/885] 885343=test_gem_resolver_lock_specification I, [2024-05-17T08:05:38.418079 #844344] INFO -- : [851/885] 885343=test_boolean I, [2024-05-17T08:05:38.436873 #844344] INFO -- : [852/885] 885343=test_rdoc_i18n_locale I, [2024-05-17T08:05:38.498290 #844344] INFO -- : [853/885] 885343=test_gc_compact I, [2024-05-17T08:05:38.844416 #844344] INFO -- : [854/885] 885345=test_dryrun I, [2024-05-17T08:05:38.895808 #844344] INFO -- : [855/885] 885345=test_rdoc_method_attr I, [2024-05-17T08:05:39.084197 #844344] INFO -- : [856/885] 885345=test_enumerable I, [2024-05-17T08:05:39.099254 #844344] INFO -- : [857/885] 885345=test_set I, [2024-05-17T08:05:39.139784 #844344] INFO -- : [858/885] 885345=static_literals_test I, [2024-05-17T08:05:39.168708 #844344] INFO -- : [859/885] 885345=test_tree_spell_checker I, [2024-05-17T08:05:39.220142 #844344] INFO -- : [860/885] 885345=test_hash_create I, [2024-05-17T08:05:39.237329 #844344] INFO -- : [861/885] 885345=test_grapheme_breaks I, [2024-05-17T08:05:39.251690 #844344] INFO -- : [862/885] 885345=test_yamldbm I, [2024-05-17T08:05:39.269246 #844344] INFO -- : [863/885] 885345=test_gem_spec_fetcher I, [2024-05-17T08:05:39.444125 #844344] INFO -- : [864/885] 885345=test_unicode_escape I, [2024-05-17T08:05:39.562275 #844344] INFO -- : [865/885] 885345=test_default_gems I, [2024-05-17T08:05:39.586249 #844344] INFO -- : [866/885] 885345=test_switch_hitter I, [2024-05-17T08:05:39.604859 #844344] INFO -- : [867/885] 885345=test_backtrace I, [2024-05-17T08:05:39.613484 #844344] INFO -- : [868/885] 885345=test_gbk I, [2024-05-17T08:05:39.630877 #844344] INFO -- : [869/885] 885345=test_gem_commands_dependency_command I, [2024-05-17T08:05:39.715851 #844344] INFO -- : [870/885] 885345=test_key_event_record I, [2024-05-17T08:05:39.719127 #844344] INFO -- : [871/885] 885345=test_date_parse I, [2024-05-17T08:05:39.919936 #844344] INFO -- : [872/885] 885345=test_open3 I, [2024-05-17T08:05:42.677099 #844344] INFO -- : [873/885] 885345=test_mdns I, [2024-05-17T08:05:42.689777 #844344] INFO -- : [874/885] 885345=test_arity I, [2024-05-17T08:05:42.695260 #844344] INFO -- : [875/885] 885345=test_thread I, [2024-05-17T08:05:42.703703 #844344] INFO -- : [876/885] 885345=test_buffering I, [2024-05-17T08:05:42.715317 #844344] INFO -- : [877/885] 885345=test_pkey_ec I, [2024-05-17T08:05:42.744243 #844344] INFO -- : [878/885] 885345=test_svcb_https I, [2024-05-17T08:05:42.823518 #844344] INFO -- : [879/885] 885345=test_case_mapping I, [2024-05-17T08:05:42.842499 #844344] INFO -- : [880/885] 885345=test_rational I, [2024-05-17T08:05:42.875265 #844344] INFO -- : [881/885] 885345=test_gem_ext_cargo_builder_unit I, [2024-05-17T08:05:42.896819 #844344] INFO -- : [882/885] 885345=test_ractor I, [2024-05-17T08:05:42.910788 #844344] INFO -- : [883/885] 885343=test_gem_resolver_api_specification I, [2024-05-17T08:05:42.920152 #844344] INFO -- : [884/885] 885345=test_rdoc_rubygems_hook I, [2024-05-17T08:05:42.962044 #844344] INFO -- : [885/885] 885343=test_webauthn_listener I, [2024-05-17T08:05:43.011999 #844344] INFO -- : Leaked file descriptor: WebauthnListenerTest#test_wait_for_otp_code_options_request: 13 : # I, [2024-05-17T08:05:43.041184 #844344] INFO -- : COMMAND PID USER FD TYPE DEVICE SIZE/OFF NODE NAME I, [2024-05-17T08:05:43.041254 #844344] INFO -- : ruby 885343 opc 13u IPv4 3019129194 0t0 TCP localhost:39883->localhost:50718 (CLOSE_WAIT) I, [2024-05-17T08:05:43.132661 #844344] INFO -- : Closed file descriptor: WebauthnListenerTest#test_wait_for_otp_code_get_follows_options: 13 I, [2024-05-17T08:05:56.104191 #844344] INFO -- : Finished tests in 230.167658s, 114.2819 tests/s, 40621.9192 assertions/s. I, [2024-05-17T08:05:56.108820 #844344] INFO -- : 26304 tests, 9349852 assertions, 0 failures, 0 errors, 320 skips I, [2024-05-17T08:05:56.108851 #844344] INFO -- : I, [2024-05-17T08:05:56.108863 #844344] INFO -- : ruby -v: ruby 3.4.0dev (2024-05-17T02:50:59Z master 534f1c37e3) [aarch64-linux] I, [2024-05-17T08:05:56.109759 #844344] INFO -- : $$$[end] "make yes-test-all TESTOPTS='--stderr-on-failure' TESTS='-j3'" exit with 0. I, [2024-05-17T08:05:56.109914 #844344] INFO -- : $$$[beg] make yes-test-rubyspec MSPECOPT='--error-output stderr --debug -j' TESTS='-j3' I, [2024-05-17T08:05:56.234283 #844344] INFO -- : BASERUBY = /usr/local/bin/ruby --disable=gems I, [2024-05-17T08:05:56.234361 #844344] INFO -- : CC = gcc I, [2024-05-17T08:05:56.234373 #844344] INFO -- : LD = ld I, [2024-05-17T08:05:56.234382 #844344] INFO -- : LDSHARED = gcc -shared I, [2024-05-17T08:05:56.234393 #844344] INFO -- : CFLAGS = -O3 -fno-fast-math -ggdb3 -Wall -Wextra -Wdeprecated-declarations -Wdiv-by-zero -Wduplicated-cond -Wimplicit-function-declaration -Wimplicit-int -Wpointer-arith -Wwrite-strings -Wold-style-definition -Wimplicit-fallthrough=0 -Wmissing-noreturn -Wno-cast-function-type -Wno-constant-logical-operand -Wno-long-long -Wno-missing-field-initializers -Wno-overlength-strings -Wno-packed-bitfield-compat -Wno-parentheses-equality -Wno-self-assign -Wno-tautological-compare -Wno-unused-parameter -Wno-unused-value -Wsuggest-attribute=format -Wsuggest-attribute=noreturn -Wunused-variable -Wmisleading-indentation -Wundef I, [2024-05-17T08:05:56.234404 #844344] INFO -- : XCFLAGS = -U_FORTIFY_SOURCE -D_FORTIFY_SOURCE=2 -fstack-protector-strong -msign-return-address=all -fno-strict-overflow -fvisibility=hidden -fexcess-precision=standard -DRUBY_EXPORT -fPIE -I. -I.ext/include/aarch64-linux -I/home/opc/ruby/src/master/include -I/home/opc/ruby/src/master -I/home/opc/ruby/src/master/prism -I/home/opc/ruby/src/master/enc/unicode/15.0.0 I, [2024-05-17T08:05:56.234413 #844344] INFO -- : CPPFLAGS = I, [2024-05-17T08:05:56.234421 #844344] INFO -- : DLDFLAGS = -Wl,--compress-debug-sections=zlib -fstack-protector-strong -pie I, [2024-05-17T08:05:56.234430 #844344] INFO -- : SOLIBS = -lz -lrt -lrt -ldl -lcrypt -lm -lpthread I, [2024-05-17T08:05:56.234439 #844344] INFO -- : LANG = en_US.UTF-8 I, [2024-05-17T08:05:56.234447 #844344] INFO -- : LC_ALL = I, [2024-05-17T08:05:56.234455 #844344] INFO -- : LC_CTYPE = I, [2024-05-17T08:05:56.234463 #844344] INFO -- : MFLAGS = I, [2024-05-17T08:05:56.234471 #844344] INFO -- : RUSTC = rustc I, [2024-05-17T08:05:56.234479 #844344] INFO -- : YJIT_RUSTC_ARGS = --crate-name=yjit --crate-type=staticlib --edition=2021 -g -C lto=thin -C opt-level=3 -C overflow-checks=on '--out-dir=/home/opc/ruby/build/master/yjit/target/release/' /home/opc/ruby/src/master/yjit/src/lib.rs I, [2024-05-17T08:05:56.235142 #844344] INFO -- : gcc (GCC) 8.5.0 20210514 (Red Hat 8.5.0-10.1.0.1) I, [2024-05-17T08:05:56.235158 #844344] INFO -- : Copyright (C) 2018 Free Software Foundation, Inc. I, [2024-05-17T08:05:56.235167 #844344] INFO -- : This is free software; see the source for copying conditions. There is NO I, [2024-05-17T08:05:56.235177 #844344] INFO -- : warranty; not even for MERCHANTABILITY or FITNESS FOR A PARTICULAR PURPOSE. I, [2024-05-17T08:05:56.235185 #844344] INFO -- : I, [2024-05-17T08:05:56.237084 #844344] INFO -- : generating enc.mk I, [2024-05-17T08:05:56.470921 #844344] INFO -- : generating encdb.h I, [2024-05-17T08:05:56.508940 #844344] INFO -- : encdb.h unchanged I, [2024-05-17T08:05:56.510157 #844344] INFO -- : making enc I, [2024-05-17T08:05:56.537726 #844344] INFO -- : make[1]: Entering directory '/home/opc/ruby/build/master' I, [2024-05-17T08:05:56.537780 #844344] INFO -- : make[1]: Nothing to be done for 'enc'. I, [2024-05-17T08:05:56.537792 #844344] INFO -- : make[1]: Leaving directory '/home/opc/ruby/build/master' I, [2024-05-17T08:05:56.538721 #844344] INFO -- : making srcs under enc I, [2024-05-17T08:05:56.580989 #844344] INFO -- : make[1]: Entering directory '/home/opc/ruby/build/master' I, [2024-05-17T08:05:56.581054 #844344] INFO -- : make[1]: Nothing to be done for 'srcs'. I, [2024-05-17T08:05:56.581065 #844344] INFO -- : make[1]: Leaving directory '/home/opc/ruby/build/master' I, [2024-05-17T08:05:56.582165 #844344] INFO -- : generating transdb.h I, [2024-05-17T08:05:56.727009 #844344] INFO -- : transdb.h unchanged I, [2024-05-17T08:05:56.728288 #844344] INFO -- : making trans I, [2024-05-17T08:05:56.777349 #844344] INFO -- : make[1]: Entering directory '/home/opc/ruby/build/master' I, [2024-05-17T08:05:56.777383 #844344] INFO -- : make[1]: Nothing to be done for 'trans'. I, [2024-05-17T08:05:56.777602 #844344] INFO -- : make[1]: Leaving directory '/home/opc/ruby/build/master' I, [2024-05-17T08:05:56.778199 #844344] INFO -- : making encs I, [2024-05-17T08:05:56.831224 #844344] INFO -- : make[1]: Entering directory '/home/opc/ruby/build/master' I, [2024-05-17T08:05:56.831268 #844344] INFO -- : make[1]: Nothing to be done for 'encs'. I, [2024-05-17T08:05:56.831279 #844344] INFO -- : make[1]: Leaving directory '/home/opc/ruby/build/master' I, [2024-05-17T08:05:56.833518 #844344] INFO -- : generating makefiles ext/configure-ext.mk I, [2024-05-17T08:05:56.873021 #844344] INFO -- : ext/configure-ext.mk updated I, [2024-05-17T08:05:56.876088 #844344] INFO -- : make[1]: Entering directory '/home/opc/ruby/build/master' I, [2024-05-17T08:05:58.963510 #844344] INFO -- : make[1]: Leaving directory '/home/opc/ruby/build/master' I, [2024-05-17T08:05:58.964231 #844344] INFO -- : generating makefile exts.mk I, [2024-05-17T08:05:59.022559 #844344] INFO -- : exts.mk unchanged I, [2024-05-17T08:05:59.027453 #844344] INFO -- : make[1]: Entering directory '/home/opc/ruby/build/master' I, [2024-05-17T08:05:59.321281 #844344] INFO -- : make[2]: Entering directory '/home/opc/ruby/build/master/ext/coverage' I, [2024-05-17T08:05:59.325885 #844344] INFO -- : make[2]: Leaving directory '/home/opc/ruby/build/master/ext/coverage' I, [2024-05-17T08:05:59.331472 #844344] INFO -- : make[2]: Entering directory '/home/opc/ruby/build/master/ext/date' I, [2024-05-17T08:05:59.336604 #844344] INFO -- : make[2]: Leaving directory '/home/opc/ruby/build/master/ext/date' I, [2024-05-17T08:05:59.339851 #844344] INFO -- : make[2]: Entering directory '/home/opc/ruby/build/master/ext/digest' I, [2024-05-17T08:05:59.348541 #844344] INFO -- : make[2]: Leaving directory '/home/opc/ruby/build/master/ext/digest' I, [2024-05-17T08:05:59.370850 #844344] INFO -- : make[2]: Entering directory '/home/opc/ruby/build/master/ext/digest/sha2' I, [2024-05-17T08:05:59.375761 #844344] INFO -- : make[2]: Leaving directory '/home/opc/ruby/build/master/ext/digest/sha2' I, [2024-05-17T08:05:59.393848 #844344] INFO -- : make[2]: Entering directory '/home/opc/ruby/build/master/ext/fiddle' I, [2024-05-17T08:05:59.403825 #844344] INFO -- : make[2]: Leaving directory '/home/opc/ruby/build/master/ext/fiddle' I, [2024-05-17T08:05:59.408121 #844344] INFO -- : make[2]: Entering directory '/home/opc/ruby/build/master/ext/io/console' I, [2024-05-17T08:05:59.412278 #844344] INFO -- : make[2]: Leaving directory '/home/opc/ruby/build/master/ext/io/console' I, [2024-05-17T08:05:59.423593 #844344] INFO -- : make[2]: Entering directory '/home/opc/ruby/build/master/ext/json' I, [2024-05-17T08:05:59.433880 #844344] INFO -- : make[2]: Leaving directory '/home/opc/ruby/build/master/ext/json' I, [2024-05-17T08:05:59.446938 #844344] INFO -- : make[2]: Entering directory '/home/opc/ruby/build/master/ext/monitor' I, [2024-05-17T08:05:59.451160 #844344] INFO -- : make[2]: Leaving directory '/home/opc/ruby/build/master/ext/monitor' I, [2024-05-17T08:05:59.457248 #844344] INFO -- : make[2]: Entering directory '/home/opc/ruby/build/master/ext/objspace' I, [2024-05-17T08:05:59.463119 #844344] INFO -- : make[2]: Leaving directory '/home/opc/ruby/build/master/ext/objspace' I, [2024-05-17T08:05:59.481938 #844344] INFO -- : make[2]: Entering directory '/home/opc/ruby/build/master/ext/openssl' I, [2024-05-17T08:05:59.504231 #844344] INFO -- : make[2]: Leaving directory '/home/opc/ruby/build/master/ext/openssl' I, [2024-05-17T08:05:59.508441 #844344] INFO -- : make[2]: Entering directory '/home/opc/ruby/build/master/ext/pathname' I, [2024-05-17T08:05:59.512579 #844344] INFO -- : make[2]: Leaving directory '/home/opc/ruby/build/master/ext/pathname' I, [2024-05-17T08:05:59.518802 #844344] INFO -- : make[2]: Entering directory '/home/opc/ruby/build/master/ext/psych' I, [2024-05-17T08:05:59.540012 #844344] INFO -- : make[2]: Leaving directory '/home/opc/ruby/build/master/ext/psych' I, [2024-05-17T08:05:59.544410 #844344] INFO -- : make[2]: Entering directory '/home/opc/ruby/build/master/ext/pty' I, [2024-05-17T08:05:59.548550 #844344] INFO -- : make[2]: Leaving directory '/home/opc/ruby/build/master/ext/pty' I, [2024-05-17T08:05:59.561787 #844344] INFO -- : make[2]: Entering directory '/home/opc/ruby/build/master/ext/ripper' I, [2024-05-17T08:05:59.569416 #844344] INFO -- : make[2]: Leaving directory '/home/opc/ruby/build/master/ext/ripper' I, [2024-05-17T08:05:59.571533 #844344] INFO -- : make[2]: Entering directory '/home/opc/ruby/build/master/ext/rubyvm' I, [2024-05-17T08:05:59.575049 #844344] INFO -- : make[2]: Leaving directory '/home/opc/ruby/build/master/ext/rubyvm' I, [2024-05-17T08:05:59.587030 #844344] INFO -- : make[2]: Entering directory '/home/opc/ruby/build/master/ext/socket' I, [2024-05-17T08:05:59.597487 #844344] INFO -- : make[2]: Leaving directory '/home/opc/ruby/build/master/ext/socket' I, [2024-05-17T08:05:59.612766 #844344] INFO -- : make[2]: Entering directory '/home/opc/ruby/build/master/.bundle/gems/bigdecimal-3.1.7/ext/bigdecimal' I, [2024-05-17T08:05:59.643374 #844344] INFO -- : make[2]: Leaving directory '/home/opc/ruby/build/master/.bundle/gems/bigdecimal-3.1.7/ext/bigdecimal' I, [2024-05-17T08:05:59.646062 #844344] INFO -- : make[2]: Entering directory '/home/opc/ruby/build/master/.bundle/gems/bigdecimal-3.1.8/ext/bigdecimal' I, [2024-05-17T08:05:59.676120 #844344] INFO -- : make[2]: Leaving directory '/home/opc/ruby/build/master/.bundle/gems/bigdecimal-3.1.8/ext/bigdecimal' I, [2024-05-17T08:05:59.678800 #844344] INFO -- : make[2]: Entering directory '/home/opc/ruby/build/master/.bundle/gems/debug-1.9.2/ext/debug' I, [2024-05-17T08:05:59.709731 #844344] INFO -- : make[2]: Leaving directory '/home/opc/ruby/build/master/.bundle/gems/debug-1.9.2/ext/debug' I, [2024-05-17T08:05:59.712316 #844344] INFO -- : make[2]: Entering directory '/home/opc/ruby/build/master/.bundle/gems/nkf-0.2.0/ext/nkf' I, [2024-05-17T08:05:59.742603 #844344] INFO -- : make[2]: Leaving directory '/home/opc/ruby/build/master/.bundle/gems/nkf-0.2.0/ext/nkf' I, [2024-05-17T08:05:59.745084 #844344] INFO -- : make[2]: Entering directory '/home/opc/ruby/build/master/.bundle/gems/racc-1.7.3/ext/racc/cparse' I, [2024-05-17T08:05:59.775218 #844344] INFO -- : make[2]: Leaving directory '/home/opc/ruby/build/master/.bundle/gems/racc-1.7.3/ext/racc/cparse' I, [2024-05-17T08:05:59.778160 #844344] INFO -- : make[2]: Entering directory '/home/opc/ruby/build/master/.bundle/gems/rbs-3.4.4/ext/rbs_extension' I, [2024-05-17T08:05:59.808298 #844344] INFO -- : make[2]: Leaving directory '/home/opc/ruby/build/master/.bundle/gems/rbs-3.4.4/ext/rbs_extension' I, [2024-05-17T08:05:59.810813 #844344] INFO -- : make[2]: Entering directory '/home/opc/ruby/build/master/.bundle/gems/syslog-0.1.2/ext/syslog' I, [2024-05-17T08:05:59.841982 #844344] INFO -- : make[2]: Leaving directory '/home/opc/ruby/build/master/.bundle/gems/syslog-0.1.2/ext/syslog' I, [2024-05-17T08:05:59.880593 #844344] INFO -- : make[2]: Entering directory '/home/opc/ruby/build/master' I, [2024-05-17T08:05:59.963834 #844344] INFO -- : make[2]: 'ruby' is up to date. I, [2024-05-17T08:05:59.963911 #844344] INFO -- : make[2]: Leaving directory '/home/opc/ruby/build/master' I, [2024-05-17T08:05:59.964067 #844344] INFO -- : make[1]: Leaving directory '/home/opc/ruby/build/master' I, [2024-05-17T08:05:59.968585 #844344] INFO -- : make[1]: Entering directory '/home/opc/ruby/build/master' I, [2024-05-17T08:05:59.968650 #844344] INFO -- : make[1]: Nothing to be done for 'note'. I, [2024-05-17T08:05:59.968662 #844344] INFO -- : make[1]: Leaving directory '/home/opc/ruby/build/master' E, [2024-05-17T08:06:00.045545 #844344] ERROR -- : $ /home/opc/ruby/build/master/miniruby -I/home/opc/ruby/src/master/lib /home/opc/ruby/src/master/tool/runruby.rb --archdir=/home/opc/ruby/build/master --extout=.ext -- /home/opc/ruby/src/master/spec/mspec/bin/mspec-run -B /home/opc/ruby/src/master/spec/default.mspec --error-output stderr --debug -fy -o /tmp/rubytest.tdoli4/1-mspec-multi-0 E, [2024-05-17T08:06:00.045917 #844344] ERROR -- : $ /home/opc/ruby/build/master/miniruby -I/home/opc/ruby/src/master/lib /home/opc/ruby/src/master/tool/runruby.rb --archdir=/home/opc/ruby/build/master --extout=.ext -- /home/opc/ruby/src/master/spec/mspec/bin/mspec-run -B /home/opc/ruby/src/master/spec/default.mspec --error-output stderr --debug -fy -o /tmp/rubytest.tdoli4/2-mspec-multi-1 E, [2024-05-17T08:06:00.046171 #844344] ERROR -- : $ /home/opc/ruby/build/master/miniruby -I/home/opc/ruby/src/master/lib /home/opc/ruby/src/master/tool/runruby.rb --archdir=/home/opc/ruby/build/master --extout=.ext -- /home/opc/ruby/src/master/spec/mspec/bin/mspec-run -B /home/opc/ruby/src/master/spec/default.mspec --error-output stderr --debug -fy -o /tmp/rubytest.tdoli4/3-mspec-multi-2 I, [2024-05-17T08:06:00.181673 #844344] INFO -- : ruby 3.4.0dev (2024-05-17T02:50:59Z master 534f1c37e3) [aarch64-linux] I, [2024-05-17T08:06:05.598525 #844344] INFO -- : 0 ......................................................................... I, [2024-05-17T08:06:07.965363 #844344] INFO -- : 73 ......................................................................... I, [2024-05-17T08:06:08.136262 #844344] INFO -- : 146 ......................................................................... I, [2024-05-17T08:06:08.432718 #844344] INFO -- : 219 ......................................................................... I, [2024-05-17T08:06:08.589082 #844344] INFO -- : 292 ......................................................................... I, [2024-05-17T08:06:08.834998 #844344] INFO -- : 365 ......................................................................... I, [2024-05-17T08:06:08.966883 #844344] INFO -- : 438 ......................................................................... I, [2024-05-17T08:06:09.030156 #844344] INFO -- : 511 ......................................................................... I, [2024-05-17T08:06:09.091428 #844344] INFO -- : 584 ......................................................................... I, [2024-05-17T08:06:09.714942 #844344] INFO -- : 657 ......................................................................... I, [2024-05-17T08:06:09.806345 #844344] INFO -- : 730 ......................................................................... I, [2024-05-17T08:06:09.855094 #844344] INFO -- : 803 ......................................................................... I, [2024-05-17T08:06:10.049369 #844344] INFO -- : 876 ......................................................................... I, [2024-05-17T08:06:10.156256 #844344] INFO -- : 949 ......................................................................... I, [2024-05-17T08:06:10.752907 #844344] INFO -- : 1022 ......................................................................... I, [2024-05-17T08:06:13.055497 #844344] INFO -- : 1095 ......................................................................... I, [2024-05-17T08:06:13.814608 #844344] INFO -- : 1168 ......................................................................... I, [2024-05-17T08:06:13.999696 #844344] INFO -- : 1241 ......................................................................... I, [2024-05-17T08:06:14.174398 #844344] INFO -- : 1314 ......................................................................... I, [2024-05-17T08:06:14.265092 #844344] INFO -- : 1387 ......................................................................... I, [2024-05-17T08:06:16.327948 #844344] INFO -- : 1460 ......................................................................... I, [2024-05-17T08:06:19.653978 #844344] INFO -- : 1533 ......................................................................... I, [2024-05-17T08:06:19.825794 #844344] INFO -- : 1606 ......................................................................... I, [2024-05-17T08:06:20.650062 #844344] INFO -- : 1679 ......................................................................... I, [2024-05-17T08:06:20.953774 #844344] INFO -- : 1752 ......................................................................... I, [2024-05-17T08:06:21.220120 #844344] INFO -- : 1825 ......................................................................... I, [2024-05-17T08:06:21.541591 #844344] INFO -- : 1898 ......................................................................... I, [2024-05-17T08:06:21.935740 #844344] INFO -- : 1971 ......................................................................... I, [2024-05-17T08:06:22.449658 #844344] INFO -- : 2044 ......................................................................... I, [2024-05-17T08:06:22.531220 #844344] INFO -- : 2117 ......................................................................... I, [2024-05-17T08:06:22.587531 #844344] INFO -- : 2190 ......................................................................... I, [2024-05-17T08:06:22.637299 #844344] INFO -- : 2263 ......................................................................... I, [2024-05-17T08:06:22.689962 #844344] INFO -- : 2336 ......................................................................... I, [2024-05-17T08:06:22.789570 #844344] INFO -- : 2409 ......................................................................... I, [2024-05-17T08:06:23.044890 #844344] INFO -- : 2482 ......................................................................... I, [2024-05-17T08:06:23.167238 #844344] INFO -- : 2555 ......................................................................... I, [2024-05-17T08:06:24.369612 #844344] INFO -- : 2628 ......................................................................... I, [2024-05-17T08:06:24.527855 #844344] INFO -- : 2701 ......................................................................... I, [2024-05-17T08:06:24.662005 #844344] INFO -- : 2774 ......................................................................... I, [2024-05-17T08:06:24.989495 #844344] INFO -- : 2847 ......................................................................... I, [2024-05-17T08:06:25.234863 #844344] INFO -- : 2920 ......................................................................... I, [2024-05-17T08:06:25.353379 #844344] INFO -- : 2993 ......................................................................... I, [2024-05-17T08:06:25.431886 #844344] INFO -- : 3066 ......................................................................... I, [2024-05-17T08:06:25.481451 #844344] INFO -- : 3139 ......................................................................... I, [2024-05-17T08:06:25.547646 #844344] INFO -- : 3212 ......................................................................... I, [2024-05-17T08:06:25.622723 #844344] INFO -- : 3285 ......................................................................... I, [2024-05-17T08:06:29.458266 #844344] INFO -- : 3358 ........................................................................ I, [2024-05-17T08:06:29.458339 #844344] INFO -- : I, [2024-05-17T08:06:29.458350 #844344] INFO -- : Finished in 29.412734 seconds I, [2024-05-17T08:06:29.458359 #844344] INFO -- : I, [2024-05-17T08:06:29.458368 #844344] INFO -- : 3429 files, 32607 examples, 177722 expectations, 0 failures, 0 errors, 0 tagged I, [2024-05-17T08:06:29.459631 #844344] INFO -- : $$$[end] "make yes-test-rubyspec MSPECOPT='--error-output stderr --debug -j' TESTS='-j3'" exit with 0.