# Logfile created on 2024-05-15 19:34:00 +0000 by logger.rb/v1.5.3 I, [2024-05-15T19:34:00.021579 #598486] INFO -- : #, @formatter=nil, @logdev=#, @binmode=false, @mon_data=#, @mon_data_owner_object_id=860>>> I, [2024-05-15T19:34:00.021886 #598486] INFO -- : $$$[beg] make update-unicode -j3 I, [2024-05-15T19:34:00.112843 #598486] INFO -- : Downloading Unicode emoji 15.0 files... I, [2024-05-15T19:34:00.112965 #598486] INFO -- : Downloading Unicode emoji 15.0 files... I, [2024-05-15T19:34:00.113264 #598486] INFO -- : Downloading Unicode emoji 15.0 files... I, [2024-05-15T19:34:00.190105 #598486] INFO -- : made symlink emoji/15.0/emoji-sequences.txt to /home/opc/ruby/src/master/.downloaded-cache/emoji/15.0/emoji-sequences.txt I, [2024-05-15T19:34:00.193491 #598486] INFO -- : downloading emoji/15.0/emoji-sequences.txt ... downloading emoji/15.0/emoji-test.txt ... /home/opc/ruby/src/master/enc/unicode/data/emoji/15.0/emoji-sequences.txt already exists E, [2024-05-15T19:34:00.711876 #598486] ERROR -- : /home/opc/ruby/src/master/tool/downloader.rb:302:in `rescue in download': failed to download emoji/15.0/emoji-test.txt (RuntimeError) E, [2024-05-15T19:34:00.711944 #598486] ERROR -- : OpenURI::HTTPError: 403 Forbidden: https://www.unicode.org/Public/emoji/15.0/emoji-test.txt E, [2024-05-15T19:34:00.711955 #598486] ERROR -- : from /home/opc/ruby/src/master/tool/downloader.rb:201:in `download' E, [2024-05-15T19:34:00.711965 #598486] ERROR -- : from /home/opc/ruby/src/master/tool/downloader.rb:136:in `download' E, [2024-05-15T19:34:00.711973 #598486] ERROR -- : from /home/opc/ruby/src/master/tool/downloader.rb:482:in `block in
' E, [2024-05-15T19:34:00.711982 #598486] ERROR -- : from /home/opc/ruby/src/master/tool/downloader.rb:465:in `each' E, [2024-05-15T19:34:00.711990 #598486] ERROR -- : from /home/opc/ruby/src/master/tool/downloader.rb:465:in `
' E, [2024-05-15T19:34:00.711998 #598486] ERROR -- : /usr/local/lib/ruby/3.2.0/open-uri.rb:369:in `open_http': 403 Forbidden (OpenURI::HTTPError) E, [2024-05-15T19:34:00.712006 #598486] ERROR -- : from /usr/local/lib/ruby/3.2.0/open-uri.rb:760:in `buffer_open' E, [2024-05-15T19:34:00.712014 #598486] ERROR -- : from /usr/local/lib/ruby/3.2.0/open-uri.rb:214:in `block in open_loop' E, [2024-05-15T19:34:00.712023 #598486] ERROR -- : from /usr/local/lib/ruby/3.2.0/open-uri.rb:212:in `catch' E, [2024-05-15T19:34:00.712030 #598486] ERROR -- : from /usr/local/lib/ruby/3.2.0/open-uri.rb:212:in `open_loop' E, [2024-05-15T19:34:00.712038 #598486] ERROR -- : from /usr/local/lib/ruby/3.2.0/open-uri.rb:153:in `open_uri' E, [2024-05-15T19:34:00.712046 #598486] ERROR -- : from /usr/local/lib/ruby/3.2.0/open-uri.rb:740:in `open' E, [2024-05-15T19:34:00.712054 #598486] ERROR -- : from /usr/local/lib/ruby/3.2.0/open-uri.rb:748:in `read' E, [2024-05-15T19:34:00.712066 #598486] ERROR -- : from /home/opc/ruby/src/master/tool/downloader.rb:247:in `block in download' E, [2024-05-15T19:34:00.712074 #598486] ERROR -- : from /home/opc/ruby/src/master/tool/downloader.rb:378:in `with_retry' E, [2024-05-15T19:34:00.712082 #598486] ERROR -- : from /home/opc/ruby/src/master/tool/downloader.rb:246:in `download' E, [2024-05-15T19:34:00.712091 #598486] ERROR -- : from /home/opc/ruby/src/master/tool/downloader.rb:136:in `download' E, [2024-05-15T19:34:00.712099 #598486] ERROR -- : from /home/opc/ruby/src/master/tool/downloader.rb:482:in `block in
' E, [2024-05-15T19:34:00.712107 #598486] ERROR -- : from /home/opc/ruby/src/master/tool/downloader.rb:465:in `each' E, [2024-05-15T19:34:00.712115 #598486] ERROR -- : from /home/opc/ruby/src/master/tool/downloader.rb:465:in `
' E, [2024-05-15T19:34:00.712314 #598486] ERROR -- : /home/opc/ruby/src/master/tool/downloader.rb:302:in `rescue in download': failed to download emoji/15.0/emoji-test.txt (RuntimeError) E, [2024-05-15T19:34:00.712331 #598486] ERROR -- : OpenURI::HTTPError: 403 Forbidden: https://www.unicode.org/Public/emoji/15.0/emoji-test.txt E, [2024-05-15T19:34:00.712341 #598486] ERROR -- : from /home/opc/ruby/src/master/tool/downloader.rb:201:in `download' E, [2024-05-15T19:34:00.712349 #598486] ERROR -- : from /home/opc/ruby/src/master/tool/downloader.rb:136:in `download' E, [2024-05-15T19:34:00.712358 #598486] ERROR -- : from /home/opc/ruby/src/master/tool/downloader.rb:482:in `block in
' E, [2024-05-15T19:34:00.712366 #598486] ERROR -- : from /home/opc/ruby/src/master/tool/downloader.rb:465:in `each' E, [2024-05-15T19:34:00.712374 #598486] ERROR -- : from /home/opc/ruby/src/master/tool/downloader.rb:465:in `
' E, [2024-05-15T19:34:00.712382 #598486] ERROR -- : /usr/local/lib/ruby/3.2.0/open-uri.rb:369:in `open_http': 403 Forbidden (OpenURI::HTTPError) E, [2024-05-15T19:34:00.712390 #598486] ERROR -- : from /usr/local/lib/ruby/3.2.0/open-uri.rb:760:in `buffer_open' E, [2024-05-15T19:34:00.712398 #598486] ERROR -- : from /usr/local/lib/ruby/3.2.0/open-uri.rb:214:in `block in open_loop' E, [2024-05-15T19:34:00.712406 #598486] ERROR -- : from /usr/local/lib/ruby/3.2.0/open-uri.rb:212:in `catch' E, [2024-05-15T19:34:00.712414 #598486] ERROR -- : from /usr/local/lib/ruby/3.2.0/open-uri.rb:212:in `open_loop' E, [2024-05-15T19:34:00.712422 #598486] ERROR -- : from /usr/local/lib/ruby/3.2.0/open-uri.rb:153:in `open_uri' E, [2024-05-15T19:34:00.712430 #598486] ERROR -- : from /usr/local/lib/ruby/3.2.0/open-uri.rb:740:in `open' E, [2024-05-15T19:34:00.712438 #598486] ERROR -- : from /usr/local/lib/ruby/3.2.0/open-uri.rb:748:in `read' E, [2024-05-15T19:34:00.712446 #598486] ERROR -- : from /home/opc/ruby/src/master/tool/downloader.rb:247:in `block in download' E, [2024-05-15T19:34:00.712454 #598486] ERROR -- : from /home/opc/ruby/src/master/tool/downloader.rb:378:in `with_retry' E, [2024-05-15T19:34:00.712463 #598486] ERROR -- : from /home/opc/ruby/src/master/tool/downloader.rb:246:in `download' E, [2024-05-15T19:34:00.712471 #598486] ERROR -- : from /home/opc/ruby/src/master/tool/downloader.rb:136:in `download' E, [2024-05-15T19:34:00.712479 #598486] ERROR -- : from /home/opc/ruby/src/master/tool/downloader.rb:482:in `block in
' E, [2024-05-15T19:34:00.712506 #598486] ERROR -- : from /home/opc/ruby/src/master/tool/downloader.rb:465:in `each' E, [2024-05-15T19:34:00.712522 #598486] ERROR -- : from /home/opc/ruby/src/master/tool/downloader.rb:465:in `
' E, [2024-05-15T19:34:00.715013 #598486] ERROR -- : make: *** [uncommon.mk:1765: /home/opc/ruby/src/master/enc/unicode/data/emoji/15.0/emoji-test.txt] Error 1 E, [2024-05-15T19:34:00.715054 #598486] ERROR -- : make: *** Waiting for unfinished jobs.... E, [2024-05-15T19:34:00.715342 #598486] ERROR -- : make: *** [uncommon.mk:1765: /home/opc/ruby/src/master/enc/unicode/data/emoji/15.0/emoji-zwj-sequences.txt] Error 1 E, [2024-05-15T19:34:01.128188 #598486] ERROR -- : /home/opc/ruby/src/master/tool/downloader.rb:302:in `rescue in download': failed to download emoji/15.0/emoji-sequences.txt (RuntimeError) E, [2024-05-15T19:34:01.128259 #598486] ERROR -- : EOFError: end of file reached: https://www.unicode.org/Public/emoji/15.0/emoji-sequences.txt E, [2024-05-15T19:34:01.128270 #598486] ERROR -- : from /home/opc/ruby/src/master/tool/downloader.rb:201:in `download' E, [2024-05-15T19:34:01.128280 #598486] ERROR -- : from /home/opc/ruby/src/master/tool/downloader.rb:136:in `download' E, [2024-05-15T19:34:01.128289 #598486] ERROR -- : from /home/opc/ruby/src/master/tool/downloader.rb:482:in `block in
' E, [2024-05-15T19:34:01.128297 #598486] ERROR -- : from /home/opc/ruby/src/master/tool/downloader.rb:465:in `each' E, [2024-05-15T19:34:01.128305 #598486] ERROR -- : from /home/opc/ruby/src/master/tool/downloader.rb:465:in `
' E, [2024-05-15T19:34:01.128313 #598486] ERROR -- : /usr/local/lib/ruby/3.2.0/net/protocol.rb:237:in `rbuf_fill': end of file reached (EOFError) E, [2024-05-15T19:34:01.128344 #598486] ERROR -- : from /usr/local/lib/ruby/3.2.0/net/protocol.rb:199:in `readuntil' E, [2024-05-15T19:34:01.128354 #598486] ERROR -- : from /usr/local/lib/ruby/3.2.0/net/protocol.rb:209:in `readline' E, [2024-05-15T19:34:01.128363 #598486] ERROR -- : from /usr/local/lib/ruby/3.2.0/net/http/response.rb:158:in `read_status_line' E, [2024-05-15T19:34:01.128371 #598486] ERROR -- : from /usr/local/lib/ruby/3.2.0/net/http/response.rb:147:in `read_new' E, [2024-05-15T19:34:01.128379 #598486] ERROR -- : from /usr/local/lib/ruby/3.2.0/net/http.rb:1862:in `block in transport_request' E, [2024-05-15T19:34:01.128387 #598486] ERROR -- : from /usr/local/lib/ruby/3.2.0/net/http.rb:1853:in `catch' E, [2024-05-15T19:34:01.128395 #598486] ERROR -- : from /usr/local/lib/ruby/3.2.0/net/http.rb:1853:in `transport_request' E, [2024-05-15T19:34:01.128403 #598486] ERROR -- : from /usr/local/lib/ruby/3.2.0/net/http.rb:1826:in `request' E, [2024-05-15T19:34:01.128411 #598486] ERROR -- : from /usr/local/lib/ruby/3.2.0/open-uri.rb:333:in `block in open_http' E, [2024-05-15T19:34:01.128419 #598486] ERROR -- : from /usr/local/lib/ruby/3.2.0/net/http.rb:1238:in `start' E, [2024-05-15T19:34:01.128427 #598486] ERROR -- : from /usr/local/lib/ruby/3.2.0/open-uri.rb:327:in `open_http' E, [2024-05-15T19:34:01.128435 #598486] ERROR -- : from /usr/local/lib/ruby/3.2.0/open-uri.rb:760:in `buffer_open' E, [2024-05-15T19:34:01.128443 #598486] ERROR -- : from /usr/local/lib/ruby/3.2.0/open-uri.rb:214:in `block in open_loop' E, [2024-05-15T19:34:01.128451 #598486] ERROR -- : from /usr/local/lib/ruby/3.2.0/open-uri.rb:212:in `catch' E, [2024-05-15T19:34:01.128459 #598486] ERROR -- : from /usr/local/lib/ruby/3.2.0/open-uri.rb:212:in `open_loop' E, [2024-05-15T19:34:01.128467 #598486] ERROR -- : from /usr/local/lib/ruby/3.2.0/open-uri.rb:153:in `open_uri' E, [2024-05-15T19:34:01.128475 #598486] ERROR -- : from /usr/local/lib/ruby/3.2.0/open-uri.rb:740:in `open' E, [2024-05-15T19:34:01.128483 #598486] ERROR -- : from /usr/local/lib/ruby/3.2.0/open-uri.rb:748:in `read' E, [2024-05-15T19:34:01.128507 #598486] ERROR -- : from /home/opc/ruby/src/master/tool/downloader.rb:247:in `block in download' E, [2024-05-15T19:34:01.128517 #598486] ERROR -- : from /home/opc/ruby/src/master/tool/downloader.rb:378:in `with_retry' E, [2024-05-15T19:34:01.128525 #598486] ERROR -- : from /home/opc/ruby/src/master/tool/downloader.rb:246:in `download' E, [2024-05-15T19:34:01.128533 #598486] ERROR -- : from /home/opc/ruby/src/master/tool/downloader.rb:136:in `download' E, [2024-05-15T19:34:01.128541 #598486] ERROR -- : from /home/opc/ruby/src/master/tool/downloader.rb:482:in `block in
' E, [2024-05-15T19:34:01.128549 #598486] ERROR -- : from /home/opc/ruby/src/master/tool/downloader.rb:465:in `each' E, [2024-05-15T19:34:01.128557 #598486] ERROR -- : from /home/opc/ruby/src/master/tool/downloader.rb:465:in `
' E, [2024-05-15T19:34:01.131313 #598486] ERROR -- : make: *** [uncommon.mk:1765: /home/opc/ruby/src/master/enc/unicode/data/emoji/15.0/emoji-sequences.txt] Error 1 E, [2024-05-15T19:34:01.131346 #598486] ERROR -- : make: *** Deleting file '/home/opc/ruby/src/master/enc/unicode/data/emoji/15.0/emoji-sequences.txt' I, [2024-05-15T19:34:01.131475 #598486] INFO -- : downloading emoji/15.0/emoji-test.txt ... I, [2024-05-15T19:34:01.131592 #598486] INFO -- : $$$[end] "make update-unicode -j3" exit with 512. I, [2024-05-15T19:34:01.131623 #598486] INFO -- : $$$[beg] make update-download -j3 I, [2024-05-15T19:34:01.292105 #598486] INFO -- : tool/config.guess already exists I, [2024-05-15T19:34:01.292171 #598486] INFO -- : tool/config.sub already exists I, [2024-05-15T19:34:01.295087 #598486] INFO -- : Update minitest to ea9caafc0754b1d6236a490d59e624b53209734a I, [2024-05-15T19:34:01.295290 #598486] INFO -- : Update power_assert to 84e85124c5014a139af39161d484156cfe87a9ed I, [2024-05-15T19:34:01.295479 #598486] INFO -- : Update rbs to ba7872795d5de04adb8ff500c0e6afdc81a041dd I, [2024-05-15T19:34:01.298547 #598486] INFO -- : echo ea9caafc0754b1d6236a490d59e624b53209734a | /bin/sh /home/opc/ruby/src/master/tool/ifchange /home/opc/ruby/src/master/.bundle/.timestamp/minitest.revision - I, [2024-05-15T19:34:01.298788 #598486] INFO -- : echo 84e85124c5014a139af39161d484156cfe87a9ed | /bin/sh /home/opc/ruby/src/master/tool/ifchange /home/opc/ruby/src/master/.bundle/.timestamp/power_assert.revision - I, [2024-05-15T19:34:01.299057 #598486] INFO -- : echo ba7872795d5de04adb8ff500c0e6afdc81a041dd | /bin/sh /home/opc/ruby/src/master/tool/ifchange /home/opc/ruby/src/master/.bundle/.timestamp/rbs.revision - I, [2024-05-15T19:34:01.304540 #598486] INFO -- : /home/opc/ruby/src/master/.bundle/.timestamp/minitest.revision unchanged I, [2024-05-15T19:34:01.304608 #598486] INFO -- : /home/opc/ruby/src/master/.bundle/.timestamp/power_assert.revision unchanged I, [2024-05-15T19:34:01.305370 #598486] INFO -- : /home/opc/ruby/src/master/.bundle/.timestamp/rbs.revision unchanged I, [2024-05-15T19:34:01.307241 #598486] INFO -- : Update typeprof to b19a6416da3a05d57fadd6ffdadb382b6d236ca5 I, [2024-05-15T19:34:01.318244 #598486] INFO -- : echo b19a6416da3a05d57fadd6ffdadb382b6d236ca5 | /bin/sh /home/opc/ruby/src/master/tool/ifchange /home/opc/ruby/src/master/.bundle/.timestamp/typeprof.revision - I, [2024-05-15T19:34:01.323922 #598486] INFO -- : /home/opc/ruby/src/master/.bundle/.timestamp/typeprof.revision unchanged I, [2024-05-15T19:34:01.394580 #598486] INFO -- : Building power_assert@84e85124c5014a139af39161d484156cfe87a9ed to /home/opc/ruby/src/master/gems/power_assert-2.0.3.gem I, [2024-05-15T19:34:01.502993 #598486] INFO -- : Successfully built RubyGem I, [2024-05-15T19:34:01.503047 #598486] INFO -- : Name: power_assert I, [2024-05-15T19:34:01.503058 #598486] INFO -- : Version: 2.0.4dev I, [2024-05-15T19:34:01.503067 #598486] INFO -- : File: power_assert-2.0.4dev.gem I, [2024-05-15T19:34:01.584950 #598486] INFO -- : $$$[end] "make update-download -j3" exit with 0. I, [2024-05-15T19:34:01.585050 #598486] INFO -- : $$$[beg] make update-rubyspec -j3 I, [2024-05-15T19:34:01.674585 #598486] INFO -- : make: Nothing to be done for 'update-rubyspec'. I, [2024-05-15T19:34:01.674724 #598486] INFO -- : $$$[end] "make update-rubyspec -j3" exit with 0. I, [2024-05-15T19:34:01.674747 #598486] INFO -- : $$$[beg] make update-src -j3 I, [2024-05-15T19:34:02.663528 #598486] INFO -- : Already up to date. I, [2024-05-15T19:34:02.678463 #598486] INFO -- : Latest commit hash = 2aed14d65b I, [2024-05-15T19:34:02.679022 #598486] INFO -- : $$$[end] "make update-src -j3" exit with 0. I, [2024-05-15T19:34:02.679060 #598486] INFO -- : $$$[beg] make after-update -j3 I, [2024-05-15T19:34:02.782030 #598486] INFO -- : generating /home/opc/ruby/src/master/ext/ripper/eventids2table.c I, [2024-05-15T19:34:02.788532 #598486] INFO -- : make[1]: Entering directory '/home/opc/ruby/src/master/ext/ripper' I, [2024-05-15T19:34:02.788583 #598486] INFO -- : make[1]: Nothing to be done for 'src'. I, [2024-05-15T19:34:02.788594 #598486] INFO -- : make[1]: Leaving directory '/home/opc/ruby/src/master/ext/ripper' I, [2024-05-15T19:34:02.815598 #598486] INFO -- : /home/opc/ruby/src/master/revision.h updated I, [2024-05-15T19:34:02.816709 #598486] INFO -- : generating aarch64-linux-fake.rb I, [2024-05-15T19:34:02.873283 #598486] INFO -- : aarch64-linux-fake.rb updated I, [2024-05-15T19:34:02.874619 #598486] INFO -- : generating enc.mk I, [2024-05-15T19:34:03.105552 #598486] INFO -- : making srcs under enc I, [2024-05-15T19:34:03.147857 #598486] INFO -- : make[1]: Entering directory '/home/opc/ruby/build/master' I, [2024-05-15T19:34:03.147914 #598486] INFO -- : make[1]: Nothing to be done for 'srcs'. I, [2024-05-15T19:34:03.147925 #598486] INFO -- : make[1]: Leaving directory '/home/opc/ruby/build/master' I, [2024-05-15T19:34:03.230268 #598486] INFO -- : Update minitest to ea9caafc0754b1d6236a490d59e624b53209734a I, [2024-05-15T19:34:03.230328 #598486] INFO -- : Update power_assert to 84e85124c5014a139af39161d484156cfe87a9ed I, [2024-05-15T19:34:03.230700 #598486] INFO -- : Update rbs to ba7872795d5de04adb8ff500c0e6afdc81a041dd I, [2024-05-15T19:34:03.233688 #598486] INFO -- : echo ea9caafc0754b1d6236a490d59e624b53209734a | /bin/sh /home/opc/ruby/src/master/tool/ifchange /home/opc/ruby/src/master/.bundle/.timestamp/minitest.revision - I, [2024-05-15T19:34:03.233901 #598486] INFO -- : echo 84e85124c5014a139af39161d484156cfe87a9ed | /bin/sh /home/opc/ruby/src/master/tool/ifchange /home/opc/ruby/src/master/.bundle/.timestamp/power_assert.revision - I, [2024-05-15T19:34:03.234020 #598486] INFO -- : echo ba7872795d5de04adb8ff500c0e6afdc81a041dd | /bin/sh /home/opc/ruby/src/master/tool/ifchange /home/opc/ruby/src/master/.bundle/.timestamp/rbs.revision - I, [2024-05-15T19:34:03.239884 #598486] INFO -- : /home/opc/ruby/src/master/.bundle/.timestamp/rbs.revision unchanged I, [2024-05-15T19:34:03.240813 #598486] INFO -- : /home/opc/ruby/src/master/.bundle/.timestamp/minitest.revision unchanged I, [2024-05-15T19:34:03.241306 #598486] INFO -- : /home/opc/ruby/src/master/.bundle/.timestamp/power_assert.revision unchanged I, [2024-05-15T19:34:03.243709 #598486] INFO -- : Update typeprof to b19a6416da3a05d57fadd6ffdadb382b6d236ca5 I, [2024-05-15T19:34:03.250444 #598486] INFO -- : echo b19a6416da3a05d57fadd6ffdadb382b6d236ca5 | /bin/sh /home/opc/ruby/src/master/tool/ifchange /home/opc/ruby/src/master/.bundle/.timestamp/typeprof.revision - I, [2024-05-15T19:34:03.258661 #598486] INFO -- : /home/opc/ruby/src/master/.bundle/.timestamp/typeprof.revision unchanged I, [2024-05-15T19:34:03.331947 #598486] INFO -- : Building power_assert@84e85124c5014a139af39161d484156cfe87a9ed to /home/opc/ruby/src/master/gems/power_assert-2.0.3.gem I, [2024-05-15T19:34:03.443826 #598486] INFO -- : Successfully built RubyGem I, [2024-05-15T19:34:03.443887 #598486] INFO -- : Name: power_assert I, [2024-05-15T19:34:03.443898 #598486] INFO -- : Version: 2.0.4dev I, [2024-05-15T19:34:03.443906 #598486] INFO -- : File: power_assert-2.0.4dev.gem I, [2024-05-15T19:34:03.446308 #598486] INFO -- : Extracting bundle gem power_assert-2.0.3... I, [2024-05-15T19:34:03.543733 #598486] INFO -- : Try with hash version of bundled gems instead of gems/power_assert-2.0.3.gem. We don't use this gem with release version of Ruby. I, [2024-05-15T19:34:03.553844 #598486] INFO -- : Unpacked gems/power_assert-2.0.4dev.gem I, [2024-05-15T19:34:03.555720 #598486] INFO -- : $$$[end] "make after-update -j3" exit with 0. I, [2024-05-15T19:34:03.555854 #598486] INFO -- : $$$[beg] make miniruby -j3 I, [2024-05-15T19:34:03.644444 #598486] INFO -- : BASERUBY = /usr/local/bin/ruby --disable=gems I, [2024-05-15T19:34:03.644554 #598486] INFO -- : CC = gcc I, [2024-05-15T19:34:03.644568 #598486] INFO -- : LD = ld I, [2024-05-15T19:34:03.644578 #598486] INFO -- : LDSHARED = gcc -shared I, [2024-05-15T19:34:03.644590 #598486] INFO -- : CFLAGS = -O3 -fno-fast-math -ggdb3 -Wall -Wextra -Wdeprecated-declarations -Wdiv-by-zero -Wduplicated-cond -Wimplicit-function-declaration -Wimplicit-int -Wpointer-arith -Wwrite-strings -Wold-style-definition -Wimplicit-fallthrough=0 -Wmissing-noreturn -Wno-cast-function-type -Wno-constant-logical-operand -Wno-long-long -Wno-missing-field-initializers -Wno-overlength-strings -Wno-packed-bitfield-compat -Wno-parentheses-equality -Wno-self-assign -Wno-tautological-compare -Wno-unused-parameter -Wno-unused-value -Wsuggest-attribute=format -Wsuggest-attribute=noreturn -Wunused-variable -Wmisleading-indentation -Wundef I, [2024-05-15T19:34:03.644604 #598486] INFO -- : XCFLAGS = -U_FORTIFY_SOURCE -D_FORTIFY_SOURCE=2 -fstack-protector-strong -msign-return-address=all -fno-strict-overflow -fvisibility=hidden -fexcess-precision=standard -DRUBY_EXPORT -fPIE -I. -I.ext/include/aarch64-linux -I/home/opc/ruby/src/master/include -I/home/opc/ruby/src/master -I/home/opc/ruby/src/master/prism -I/home/opc/ruby/src/master/enc/unicode/15.0.0 I, [2024-05-15T19:34:03.644613 #598486] INFO -- : CPPFLAGS = I, [2024-05-15T19:34:03.644621 #598486] INFO -- : DLDFLAGS = -Wl,--compress-debug-sections=zlib -fstack-protector-strong -pie I, [2024-05-15T19:34:03.644630 #598486] INFO -- : SOLIBS = -lz -lrt -lrt -ldl -lcrypt -lm -lpthread I, [2024-05-15T19:34:03.644638 #598486] INFO -- : LANG = en_US.UTF-8 I, [2024-05-15T19:34:03.644646 #598486] INFO -- : LC_ALL = I, [2024-05-15T19:34:03.644654 #598486] INFO -- : LC_CTYPE = I, [2024-05-15T19:34:03.644661 #598486] INFO -- : MFLAGS = -j3 --jobserver-auth=4,5 I, [2024-05-15T19:34:03.644669 #598486] INFO -- : RUSTC = rustc I, [2024-05-15T19:34:03.644678 #598486] INFO -- : YJIT_RUSTC_ARGS = --crate-name=yjit --crate-type=staticlib --edition=2021 -g -C lto=thin -C opt-level=3 -C overflow-checks=on '--out-dir=/home/opc/ruby/build/master/yjit/target/release/' /home/opc/ruby/src/master/yjit/src/lib.rs I, [2024-05-15T19:34:03.645476 #598486] INFO -- : gcc (GCC) 8.5.0 20210514 (Red Hat 8.5.0-10.1.0.1) I, [2024-05-15T19:34:03.645513 #598486] INFO -- : Copyright (C) 2018 Free Software Foundation, Inc. I, [2024-05-15T19:34:03.645523 #598486] INFO -- : This is free software; see the source for copying conditions. There is NO I, [2024-05-15T19:34:03.645532 #598486] INFO -- : warranty; not even for MERCHANTABILITY or FITNESS FOR A PARTICULAR PURPOSE. I, [2024-05-15T19:34:03.645541 #598486] INFO -- : I, [2024-05-15T19:34:03.670377 #598486] INFO -- : compiling /home/opc/ruby/src/master/version.c I, [2024-05-15T19:34:03.812677 #598486] INFO -- : linking miniruby I, [2024-05-15T19:34:04.722398 #598486] INFO -- : $$$[end] "make miniruby -j3" exit with 0. I, [2024-05-15T19:34:04.722560 #598486] INFO -- : $$$[beg] make ruby -j3 I, [2024-05-15T19:34:04.810869 #598486] INFO -- : BASERUBY = /usr/local/bin/ruby --disable=gems I, [2024-05-15T19:34:04.810938 #598486] INFO -- : CC = gcc I, [2024-05-15T19:34:04.810950 #598486] INFO -- : LD = ld I, [2024-05-15T19:34:04.810960 #598486] INFO -- : LDSHARED = gcc -shared I, [2024-05-15T19:34:04.810970 #598486] INFO -- : CFLAGS = -O3 -fno-fast-math -ggdb3 -Wall -Wextra -Wdeprecated-declarations -Wdiv-by-zero -Wduplicated-cond -Wimplicit-function-declaration -Wimplicit-int -Wpointer-arith -Wwrite-strings -Wold-style-definition -Wimplicit-fallthrough=0 -Wmissing-noreturn -Wno-cast-function-type -Wno-constant-logical-operand -Wno-long-long -Wno-missing-field-initializers -Wno-overlength-strings -Wno-packed-bitfield-compat -Wno-parentheses-equality -Wno-self-assign -Wno-tautological-compare -Wno-unused-parameter -Wno-unused-value -Wsuggest-attribute=format -Wsuggest-attribute=noreturn -Wunused-variable -Wmisleading-indentation -Wundef I, [2024-05-15T19:34:04.810979 #598486] INFO -- : XCFLAGS = -U_FORTIFY_SOURCE -D_FORTIFY_SOURCE=2 -fstack-protector-strong -msign-return-address=all -fno-strict-overflow -fvisibility=hidden -fexcess-precision=standard -DRUBY_EXPORT -fPIE -I. -I.ext/include/aarch64-linux -I/home/opc/ruby/src/master/include -I/home/opc/ruby/src/master -I/home/opc/ruby/src/master/prism -I/home/opc/ruby/src/master/enc/unicode/15.0.0 I, [2024-05-15T19:34:04.810988 #598486] INFO -- : CPPFLAGS = I, [2024-05-15T19:34:04.810999 #598486] INFO -- : DLDFLAGS = -Wl,--compress-debug-sections=zlib -fstack-protector-strong -pie I, [2024-05-15T19:34:04.811008 #598486] INFO -- : SOLIBS = -lz -lrt -lrt -ldl -lcrypt -lm -lpthread I, [2024-05-15T19:34:04.811016 #598486] INFO -- : LANG = en_US.UTF-8 I, [2024-05-15T19:34:04.811024 #598486] INFO -- : LC_ALL = I, [2024-05-15T19:34:04.811033 #598486] INFO -- : LC_CTYPE = I, [2024-05-15T19:34:04.811041 #598486] INFO -- : MFLAGS = -j3 --jobserver-auth=4,5 I, [2024-05-15T19:34:04.811049 #598486] INFO -- : RUSTC = rustc I, [2024-05-15T19:34:04.811057 #598486] INFO -- : YJIT_RUSTC_ARGS = --crate-name=yjit --crate-type=staticlib --edition=2021 -g -C lto=thin -C opt-level=3 -C overflow-checks=on '--out-dir=/home/opc/ruby/build/master/yjit/target/release/' /home/opc/ruby/src/master/yjit/src/lib.rs I, [2024-05-15T19:34:04.811689 #598486] INFO -- : gcc (GCC) 8.5.0 20210514 (Red Hat 8.5.0-10.1.0.1) I, [2024-05-15T19:34:04.811707 #598486] INFO -- : Copyright (C) 2018 Free Software Foundation, Inc. I, [2024-05-15T19:34:04.811716 #598486] INFO -- : This is free software; see the source for copying conditions. There is NO I, [2024-05-15T19:34:04.811725 #598486] INFO -- : warranty; not even for MERCHANTABILITY or FITNESS FOR A PARTICULAR PURPOSE. I, [2024-05-15T19:34:04.811733 #598486] INFO -- : I, [2024-05-15T19:34:04.992284 #598486] INFO -- : builtin_binary.inc updated I, [2024-05-15T19:34:04.995641 #598486] INFO -- : c5234a9416e4f20f175185e840b25b0f08674d14078ed7083f37e655458e3ca9 builtin_binary.inc I, [2024-05-15T19:34:04.996672 #598486] INFO -- : compiling /home/opc/ruby/src/master/builtin.c I, [2024-05-15T19:34:05.319391 #598486] INFO -- : linking static-library libruby-static.a I, [2024-05-15T19:34:07.803533 #598486] INFO -- : linking ruby I, [2024-05-15T19:34:08.759740 #598486] INFO -- : $$$[end] "make ruby -j3" exit with 0. I, [2024-05-15T19:34:08.759903 #598486] INFO -- : $$$[beg] make all -j3 I, [2024-05-15T19:34:08.849640 #598486] INFO -- : BASERUBY = /usr/local/bin/ruby --disable=gems I, [2024-05-15T19:34:08.849711 #598486] INFO -- : CC = gcc I, [2024-05-15T19:34:08.849722 #598486] INFO -- : LD = ld I, [2024-05-15T19:34:08.849731 #598486] INFO -- : LDSHARED = gcc -shared I, [2024-05-15T19:34:08.849740 #598486] INFO -- : CFLAGS = -O3 -fno-fast-math -ggdb3 -Wall -Wextra -Wdeprecated-declarations -Wdiv-by-zero -Wduplicated-cond -Wimplicit-function-declaration -Wimplicit-int -Wpointer-arith -Wwrite-strings -Wold-style-definition -Wimplicit-fallthrough=0 -Wmissing-noreturn -Wno-cast-function-type -Wno-constant-logical-operand -Wno-long-long -Wno-missing-field-initializers -Wno-overlength-strings -Wno-packed-bitfield-compat -Wno-parentheses-equality -Wno-self-assign -Wno-tautological-compare -Wno-unused-parameter -Wno-unused-value -Wsuggest-attribute=format -Wsuggest-attribute=noreturn -Wunused-variable -Wmisleading-indentation -Wundef I, [2024-05-15T19:34:08.849750 #598486] INFO -- : XCFLAGS = -U_FORTIFY_SOURCE -D_FORTIFY_SOURCE=2 -fstack-protector-strong -msign-return-address=all -fno-strict-overflow -fvisibility=hidden -fexcess-precision=standard -DRUBY_EXPORT -fPIE -I. -I.ext/include/aarch64-linux -I/home/opc/ruby/src/master/include -I/home/opc/ruby/src/master -I/home/opc/ruby/src/master/prism -I/home/opc/ruby/src/master/enc/unicode/15.0.0 I, [2024-05-15T19:34:08.849759 #598486] INFO -- : CPPFLAGS = I, [2024-05-15T19:34:08.849768 #598486] INFO -- : DLDFLAGS = -Wl,--compress-debug-sections=zlib -fstack-protector-strong -pie I, [2024-05-15T19:34:08.849778 #598486] INFO -- : SOLIBS = -lz -lrt -lrt -ldl -lcrypt -lm -lpthread I, [2024-05-15T19:34:08.849786 #598486] INFO -- : LANG = en_US.UTF-8 I, [2024-05-15T19:34:08.849794 #598486] INFO -- : LC_ALL = I, [2024-05-15T19:34:08.849802 #598486] INFO -- : LC_CTYPE = I, [2024-05-15T19:34:08.849810 #598486] INFO -- : MFLAGS = -j3 --jobserver-auth=4,5 I, [2024-05-15T19:34:08.849819 #598486] INFO -- : RUSTC = rustc I, [2024-05-15T19:34:08.849827 #598486] INFO -- : YJIT_RUSTC_ARGS = --crate-name=yjit --crate-type=staticlib --edition=2021 -g -C lto=thin -C opt-level=3 -C overflow-checks=on '--out-dir=/home/opc/ruby/build/master/yjit/target/release/' /home/opc/ruby/src/master/yjit/src/lib.rs I, [2024-05-15T19:34:08.850571 #598486] INFO -- : gcc (GCC) 8.5.0 20210514 (Red Hat 8.5.0-10.1.0.1) I, [2024-05-15T19:34:08.850611 #598486] INFO -- : Copyright (C) 2018 Free Software Foundation, Inc. I, [2024-05-15T19:34:08.850621 #598486] INFO -- : This is free software; see the source for copying conditions. There is NO I, [2024-05-15T19:34:08.850631 #598486] INFO -- : warranty; not even for MERCHANTABILITY or FITNESS FOR A PARTICULAR PURPOSE. I, [2024-05-15T19:34:08.850639 #598486] INFO -- : I, [2024-05-15T19:34:08.883052 #598486] INFO -- : generating encdb.h I, [2024-05-15T19:34:08.884405 #598486] INFO -- : generating enc.mk I, [2024-05-15T19:34:08.921982 #598486] INFO -- : encdb.h unchanged I, [2024-05-15T19:34:09.121682 #598486] INFO -- : making srcs under enc I, [2024-05-15T19:34:09.122179 #598486] INFO -- : making enc I, [2024-05-15T19:34:09.149276 #598486] INFO -- : make[1]: Entering directory '/home/opc/ruby/build/master' I, [2024-05-15T19:34:09.149343 #598486] INFO -- : make[1]: Nothing to be done for 'enc'. I, [2024-05-15T19:34:09.149353 #598486] INFO -- : make[1]: Leaving directory '/home/opc/ruby/build/master' I, [2024-05-15T19:34:09.163706 #598486] INFO -- : make[1]: Entering directory '/home/opc/ruby/build/master' I, [2024-05-15T19:34:09.163740 #598486] INFO -- : make[1]: Nothing to be done for 'srcs'. I, [2024-05-15T19:34:09.163750 #598486] INFO -- : make[1]: Leaving directory '/home/opc/ruby/build/master' I, [2024-05-15T19:34:09.164565 #598486] INFO -- : generating transdb.h I, [2024-05-15T19:34:09.306868 #598486] INFO -- : transdb.h unchanged I, [2024-05-15T19:34:09.308231 #598486] INFO -- : generating makefiles ext/configure-ext.mk I, [2024-05-15T19:34:09.308374 #598486] INFO -- : making trans I, [2024-05-15T19:34:09.348281 #598486] INFO -- : ext/configure-ext.mk updated I, [2024-05-15T19:34:09.351372 #598486] INFO -- : make[1]: Entering directory '/home/opc/ruby/build/master' I, [2024-05-15T19:34:09.357096 #598486] INFO -- : make[1]: Entering directory '/home/opc/ruby/build/master' I, [2024-05-15T19:34:09.357146 #598486] INFO -- : make[1]: Nothing to be done for 'trans'. I, [2024-05-15T19:34:09.357156 #598486] INFO -- : make[1]: Leaving directory '/home/opc/ruby/build/master' I, [2024-05-15T19:34:10.093132 #598486] INFO -- : making encs I, [2024-05-15T19:34:10.154554 #598486] INFO -- : make[1]: Leaving directory '/home/opc/ruby/build/master' I, [2024-05-15T19:34:10.155238 #598486] INFO -- : generating makefile exts.mk I, [2024-05-15T19:34:10.162326 #598486] INFO -- : make[1]: Entering directory '/home/opc/ruby/build/master' I, [2024-05-15T19:34:10.162376 #598486] INFO -- : make[1]: Nothing to be done for 'encs'. I, [2024-05-15T19:34:10.162387 #598486] INFO -- : make[1]: Leaving directory '/home/opc/ruby/build/master' I, [2024-05-15T19:34:10.213502 #598486] INFO -- : exts.mk unchanged I, [2024-05-15T19:34:10.218364 #598486] INFO -- : make[1]: Entering directory '/home/opc/ruby/build/master' I, [2024-05-15T19:34:10.326737 #598486] INFO -- : make[2]: Entering directory '/home/opc/ruby/build/master/ext/coverage' I, [2024-05-15T19:34:10.328434 #598486] INFO -- : make[2]: Entering directory '/home/opc/ruby/build/master/ext/digest' I, [2024-05-15T19:34:10.329133 #598486] INFO -- : make[2]: Entering directory '/home/opc/ruby/build/master/ext/date' I, [2024-05-15T19:34:10.333661 #598486] INFO -- : make[2]: Leaving directory '/home/opc/ruby/build/master/ext/coverage' I, [2024-05-15T19:34:10.334595 #598486] INFO -- : make[2]: Leaving directory '/home/opc/ruby/build/master/ext/date' I, [2024-05-15T19:34:10.337786 #598486] INFO -- : make[2]: Leaving directory '/home/opc/ruby/build/master/ext/digest' I, [2024-05-15T19:34:10.343674 #598486] INFO -- : make[2]: Entering directory '/home/opc/ruby/build/master/ext/io/console' I, [2024-05-15T19:34:10.345196 #598486] INFO -- : make[2]: Entering directory '/home/opc/ruby/build/master/ext/fiddle' I, [2024-05-15T19:34:10.349220 #598486] INFO -- : make[2]: Leaving directory '/home/opc/ruby/build/master/ext/io/console' I, [2024-05-15T19:34:10.351029 #598486] INFO -- : make[2]: Entering directory '/home/opc/ruby/build/master/ext/json' I, [2024-05-15T19:34:10.356284 #598486] INFO -- : make[2]: Entering directory '/home/opc/ruby/build/master/ext/monitor' I, [2024-05-15T19:34:10.357257 #598486] INFO -- : make[2]: Leaving directory '/home/opc/ruby/build/master/ext/json' I, [2024-05-15T19:34:10.358563 #598486] INFO -- : make[2]: Leaving directory '/home/opc/ruby/build/master/ext/fiddle' I, [2024-05-15T19:34:10.360746 #598486] INFO -- : make[2]: Leaving directory '/home/opc/ruby/build/master/ext/monitor' I, [2024-05-15T19:34:10.364832 #598486] INFO -- : make[2]: Entering directory '/home/opc/ruby/build/master/ext/pathname' I, [2024-05-15T19:34:10.364870 #598486] INFO -- : make[2]: Entering directory '/home/opc/ruby/build/master/ext/objspace' I, [2024-05-15T19:34:10.369039 #598486] INFO -- : make[2]: Leaving directory '/home/opc/ruby/build/master/ext/pathname' I, [2024-05-15T19:34:10.371681 #598486] INFO -- : make[2]: Leaving directory '/home/opc/ruby/build/master/ext/objspace' I, [2024-05-15T19:34:10.375209 #598486] INFO -- : make[2]: Entering directory '/home/opc/ruby/build/master/ext/psych' I, [2024-05-15T19:34:10.376529 #598486] INFO -- : make[2]: Entering directory '/home/opc/ruby/build/master/ext/pty' I, [2024-05-15T19:34:10.378893 #598486] INFO -- : make[2]: Entering directory '/home/opc/ruby/build/master/ext/openssl' I, [2024-05-15T19:34:10.387006 #598486] INFO -- : make[2]: Leaving directory '/home/opc/ruby/build/master/ext/pty' I, [2024-05-15T19:34:10.389701 #598486] INFO -- : make[2]: Leaving directory '/home/opc/ruby/build/master/ext/psych' I, [2024-05-15T19:34:10.397125 #598486] INFO -- : make[2]: Entering directory '/home/opc/ruby/build/master/ext/rubyvm' I, [2024-05-15T19:34:10.397832 #598486] INFO -- : make[2]: Entering directory '/home/opc/ruby/build/master/ext/ripper' I, [2024-05-15T19:34:10.400624 #598486] INFO -- : make[2]: Leaving directory '/home/opc/ruby/build/master/ext/rubyvm' I, [2024-05-15T19:34:10.400692 #598486] INFO -- : make[2]: Leaving directory '/home/opc/ruby/build/master/ext/openssl' I, [2024-05-15T19:34:10.405604 #598486] INFO -- : make[2]: Leaving directory '/home/opc/ruby/build/master/ext/ripper' I, [2024-05-15T19:34:10.412174 #598486] INFO -- : make[2]: Entering directory '/home/opc/ruby/build/master/.bundle/gems/bigdecimal-3.1.7/ext/bigdecimal' I, [2024-05-15T19:34:10.412706 #598486] INFO -- : make[2]: Entering directory '/home/opc/ruby/build/master/ext/socket' I, [2024-05-15T19:34:10.417794 #598486] INFO -- : make[2]: Entering directory '/home/opc/ruby/build/master/.bundle/gems/bigdecimal-3.1.8/ext/bigdecimal' I, [2024-05-15T19:34:10.423241 #598486] INFO -- : make[2]: Leaving directory '/home/opc/ruby/build/master/ext/socket' I, [2024-05-15T19:34:10.425650 #598486] INFO -- : make[2]: Entering directory '/home/opc/ruby/build/master/.bundle/gems/debug-1.9.2/ext/debug' I, [2024-05-15T19:34:10.442904 #598486] INFO -- : make[2]: Leaving directory '/home/opc/ruby/build/master/.bundle/gems/bigdecimal-3.1.7/ext/bigdecimal' I, [2024-05-15T19:34:10.445773 #598486] INFO -- : make[2]: Entering directory '/home/opc/ruby/build/master/.bundle/gems/nkf-0.2.0/ext/nkf' I, [2024-05-15T19:34:10.450993 #598486] INFO -- : make[2]: Leaving directory '/home/opc/ruby/build/master/.bundle/gems/bigdecimal-3.1.8/ext/bigdecimal' I, [2024-05-15T19:34:10.454538 #598486] INFO -- : make[2]: Entering directory '/home/opc/ruby/build/master/.bundle/gems/racc-1.7.3/ext/racc/cparse' I, [2024-05-15T19:34:10.456753 #598486] INFO -- : make[2]: Leaving directory '/home/opc/ruby/build/master/.bundle/gems/debug-1.9.2/ext/debug' I, [2024-05-15T19:34:10.459680 #598486] INFO -- : make[2]: Entering directory '/home/opc/ruby/build/master/.bundle/gems/rbs-3.4.4/ext/rbs_extension' I, [2024-05-15T19:34:10.477881 #598486] INFO -- : make[2]: Leaving directory '/home/opc/ruby/build/master/.bundle/gems/nkf-0.2.0/ext/nkf' I, [2024-05-15T19:34:10.480762 #598486] INFO -- : make[2]: Entering directory '/home/opc/ruby/build/master/.bundle/gems/syslog-0.1.2/ext/syslog' I, [2024-05-15T19:34:10.486338 #598486] INFO -- : make[2]: Leaving directory '/home/opc/ruby/build/master/.bundle/gems/racc-1.7.3/ext/racc/cparse' I, [2024-05-15T19:34:10.494400 #598486] INFO -- : make[2]: Leaving directory '/home/opc/ruby/build/master/.bundle/gems/rbs-3.4.4/ext/rbs_extension' I, [2024-05-15T19:34:10.503487 #598486] INFO -- : make[2]: Entering directory '/home/opc/ruby/build/master/ext/digest/sha2' I, [2024-05-15T19:34:10.510698 #598486] INFO -- : make[2]: Leaving directory '/home/opc/ruby/build/master/ext/digest/sha2' I, [2024-05-15T19:34:10.514731 #598486] INFO -- : make[2]: Leaving directory '/home/opc/ruby/build/master/.bundle/gems/syslog-0.1.2/ext/syslog' I, [2024-05-15T19:34:10.552605 #598486] INFO -- : make[2]: Entering directory '/home/opc/ruby/build/master' I, [2024-05-15T19:34:10.636866 #598486] INFO -- : make[2]: 'ruby' is up to date. I, [2024-05-15T19:34:10.636946 #598486] INFO -- : make[2]: Leaving directory '/home/opc/ruby/build/master' I, [2024-05-15T19:34:10.637114 #598486] INFO -- : make[1]: Leaving directory '/home/opc/ruby/build/master' I, [2024-05-15T19:34:10.641784 #598486] INFO -- : make[1]: Entering directory '/home/opc/ruby/build/master' I, [2024-05-15T19:34:10.641837 #598486] INFO -- : make[1]: Nothing to be done for 'note'. I, [2024-05-15T19:34:10.641847 #598486] INFO -- : make[1]: Leaving directory '/home/opc/ruby/build/master' I, [2024-05-15T19:34:10.642518 #598486] INFO -- : $$$[end] "make all -j3" exit with 0. I, [2024-05-15T19:34:10.642668 #598486] INFO -- : $$$[beg] make install -j3 I, [2024-05-15T19:34:10.740070 #598486] INFO -- : Update minitest to ea9caafc0754b1d6236a490d59e624b53209734a I, [2024-05-15T19:34:10.740246 #598486] INFO -- : Update power_assert to 84e85124c5014a139af39161d484156cfe87a9ed I, [2024-05-15T19:34:10.740433 #598486] INFO -- : Update rbs to ba7872795d5de04adb8ff500c0e6afdc81a041dd I, [2024-05-15T19:34:10.743373 #598486] INFO -- : echo 84e85124c5014a139af39161d484156cfe87a9ed | /bin/sh /home/opc/ruby/src/master/tool/ifchange /home/opc/ruby/src/master/.bundle/.timestamp/power_assert.revision - I, [2024-05-15T19:34:10.744435 #598486] INFO -- : echo ea9caafc0754b1d6236a490d59e624b53209734a | /bin/sh /home/opc/ruby/src/master/tool/ifchange /home/opc/ruby/src/master/.bundle/.timestamp/minitest.revision - I, [2024-05-15T19:34:10.745662 #598486] INFO -- : echo ba7872795d5de04adb8ff500c0e6afdc81a041dd | /bin/sh /home/opc/ruby/src/master/tool/ifchange /home/opc/ruby/src/master/.bundle/.timestamp/rbs.revision - I, [2024-05-15T19:34:10.749913 #598486] INFO -- : /home/opc/ruby/src/master/.bundle/.timestamp/power_assert.revision unchanged I, [2024-05-15T19:34:10.750421 #598486] INFO -- : /home/opc/ruby/src/master/.bundle/.timestamp/minitest.revision unchanged I, [2024-05-15T19:34:10.752418 #598486] INFO -- : Update typeprof to b19a6416da3a05d57fadd6ffdadb382b6d236ca5 I, [2024-05-15T19:34:10.753028 #598486] INFO -- : /home/opc/ruby/src/master/.bundle/.timestamp/rbs.revision unchanged I, [2024-05-15T19:34:10.754892 #598486] INFO -- : BASERUBY = /usr/local/bin/ruby --disable=gems I, [2024-05-15T19:34:10.755542 #598486] INFO -- : CC = gcc I, [2024-05-15T19:34:10.755596 #598486] INFO -- : LD = ld I, [2024-05-15T19:34:10.755628 #598486] INFO -- : LDSHARED = gcc -shared I, [2024-05-15T19:34:10.755668 #598486] INFO -- : CFLAGS = -O3 -fno-fast-math -ggdb3 -Wall -Wextra -Wdeprecated-declarations -Wdiv-by-zero -Wduplicated-cond -Wimplicit-function-declaration -Wimplicit-int -Wpointer-arith -Wwrite-strings -Wold-style-definition -Wimplicit-fallthrough=0 -Wmissing-noreturn -Wno-cast-function-type -Wno-constant-logical-operand -Wno-long-long -Wno-missing-field-initializers -Wno-overlength-strings -Wno-packed-bitfield-compat -Wno-parentheses-equality -Wno-self-assign -Wno-tautological-compare -Wno-unused-parameter -Wno-unused-value -Wsuggest-attribute=format -Wsuggest-attribute=noreturn -Wunused-variable -Wmisleading-indentation -Wundef I, [2024-05-15T19:34:10.755711 #598486] INFO -- : XCFLAGS = -U_FORTIFY_SOURCE -D_FORTIFY_SOURCE=2 -fstack-protector-strong -msign-return-address=all -fno-strict-overflow -fvisibility=hidden -fexcess-precision=standard -DRUBY_EXPORT -fPIE -I. -I.ext/include/aarch64-linux -I/home/opc/ruby/src/master/include -I/home/opc/ruby/src/master -I/home/opc/ruby/src/master/prism -I/home/opc/ruby/src/master/enc/unicode/15.0.0 I, [2024-05-15T19:34:10.755743 #598486] INFO -- : CPPFLAGS = I, [2024-05-15T19:34:10.755778 #598486] INFO -- : DLDFLAGS = -Wl,--compress-debug-sections=zlib -fstack-protector-strong -pie I, [2024-05-15T19:34:10.755809 #598486] INFO -- : SOLIBS = -lz -lrt -lrt -ldl -lcrypt -lm -lpthread I, [2024-05-15T19:34:10.755838 #598486] INFO -- : LANG = en_US.UTF-8 I, [2024-05-15T19:34:10.755865 #598486] INFO -- : LC_ALL = I, [2024-05-15T19:34:10.755892 #598486] INFO -- : LC_CTYPE = I, [2024-05-15T19:34:10.755919 #598486] INFO -- : MFLAGS = -j3 --jobserver-auth=4,5 I, [2024-05-15T19:34:10.755944 #598486] INFO -- : RUSTC = rustc I, [2024-05-15T19:34:10.755975 #598486] INFO -- : YJIT_RUSTC_ARGS = --crate-name=yjit --crate-type=staticlib --edition=2021 -g -C lto=thin -C opt-level=3 -C overflow-checks=on '--out-dir=/home/opc/ruby/build/master/yjit/target/release/' /home/opc/ruby/src/master/yjit/src/lib.rs I, [2024-05-15T19:34:10.786364 #598486] INFO -- : echo b19a6416da3a05d57fadd6ffdadb382b6d236ca5 | /bin/sh /home/opc/ruby/src/master/tool/ifchange /home/opc/ruby/src/master/.bundle/.timestamp/typeprof.revision - I, [2024-05-15T19:34:10.787210 #598486] INFO -- : gcc (GCC) 8.5.0 20210514 (Red Hat 8.5.0-10.1.0.1) I, [2024-05-15T19:34:10.787252 #598486] INFO -- : Copyright (C) 2018 Free Software Foundation, Inc. I, [2024-05-15T19:34:10.787262 #598486] INFO -- : This is free software; see the source for copying conditions. There is NO I, [2024-05-15T19:34:10.787271 #598486] INFO -- : warranty; not even for MERCHANTABILITY or FITNESS FOR A PARTICULAR PURPOSE. I, [2024-05-15T19:34:10.787280 #598486] INFO -- : I, [2024-05-15T19:34:10.787708 #598486] INFO -- : generating encdb.h I, [2024-05-15T19:34:10.789915 #598486] INFO -- : generating enc.mk I, [2024-05-15T19:34:10.792714 #598486] INFO -- : /home/opc/ruby/src/master/.bundle/.timestamp/typeprof.revision unchanged I, [2024-05-15T19:34:10.825998 #598486] INFO -- : encdb.h unchanged I, [2024-05-15T19:34:10.920085 #598486] INFO -- : Building power_assert@84e85124c5014a139af39161d484156cfe87a9ed to /home/opc/ruby/src/master/gems/power_assert-2.0.3.gem I, [2024-05-15T19:34:11.033379 #598486] INFO -- : making srcs under enc I, [2024-05-15T19:34:11.033442 #598486] INFO -- : making enc I, [2024-05-15T19:34:11.040702 #598486] INFO -- : Successfully built RubyGem I, [2024-05-15T19:34:11.040756 #598486] INFO -- : Name: power_assert I, [2024-05-15T19:34:11.040767 #598486] INFO -- : Version: 2.0.4dev I, [2024-05-15T19:34:11.040776 #598486] INFO -- : File: power_assert-2.0.4dev.gem I, [2024-05-15T19:34:11.043230 #598486] INFO -- : Extracting bundle gem power_assert-2.0.3... I, [2024-05-15T19:34:11.070379 #598486] INFO -- : make[1]: Entering directory '/home/opc/ruby/build/master' I, [2024-05-15T19:34:11.070461 #598486] INFO -- : make[1]: Nothing to be done for 'enc'. I, [2024-05-15T19:34:11.070495 #598486] INFO -- : make[1]: Leaving directory '/home/opc/ruby/build/master' I, [2024-05-15T19:34:11.077199 #598486] INFO -- : make[1]: Entering directory '/home/opc/ruby/build/master' I, [2024-05-15T19:34:11.077246 #598486] INFO -- : make[1]: Nothing to be done for 'srcs'. I, [2024-05-15T19:34:11.077256 #598486] INFO -- : make[1]: Leaving directory '/home/opc/ruby/build/master' I, [2024-05-15T19:34:11.078131 #598486] INFO -- : generating transdb.h I, [2024-05-15T19:34:11.142617 #598486] INFO -- : Try with hash version of bundled gems instead of gems/power_assert-2.0.3.gem. We don't use this gem with release version of Ruby. I, [2024-05-15T19:34:11.153496 #598486] INFO -- : Unpacked gems/power_assert-2.0.4dev.gem I, [2024-05-15T19:34:11.224605 #598486] INFO -- : transdb.h unchanged I, [2024-05-15T19:34:11.226044 #598486] INFO -- : generating makefiles ext/configure-ext.mk I, [2024-05-15T19:34:11.226245 #598486] INFO -- : making trans I, [2024-05-15T19:34:11.266526 #598486] INFO -- : ext/configure-ext.mk unchanged I, [2024-05-15T19:34:11.269252 #598486] INFO -- : make[1]: Entering directory '/home/opc/ruby/build/master' I, [2024-05-15T19:34:11.276515 #598486] INFO -- : make[1]: Entering directory '/home/opc/ruby/build/master' I, [2024-05-15T19:34:11.276574 #598486] INFO -- : make[1]: Nothing to be done for 'trans'. I, [2024-05-15T19:34:11.276587 #598486] INFO -- : make[1]: Leaving directory '/home/opc/ruby/build/master' I, [2024-05-15T19:34:11.398734 #598486] INFO -- : making encs I, [2024-05-15T19:34:11.453850 #598486] INFO -- : make[1]: Entering directory '/home/opc/ruby/build/master' I, [2024-05-15T19:34:11.453950 #598486] INFO -- : make[1]: Nothing to be done for 'encs'. I, [2024-05-15T19:34:11.453989 #598486] INFO -- : make[1]: Leaving directory '/home/opc/ruby/build/master' I, [2024-05-15T19:34:12.046347 #598486] INFO -- : make[1]: Leaving directory '/home/opc/ruby/build/master' I, [2024-05-15T19:34:12.047048 #598486] INFO -- : generating makefile exts.mk I, [2024-05-15T19:34:12.106257 #598486] INFO -- : exts.mk unchanged I, [2024-05-15T19:34:12.111221 #598486] INFO -- : make[1]: Entering directory '/home/opc/ruby/build/master' I, [2024-05-15T19:34:12.217449 #598486] INFO -- : make[2]: Entering directory '/home/opc/ruby/build/master/ext/coverage' I, [2024-05-15T19:34:12.219379 #598486] INFO -- : make[2]: Entering directory '/home/opc/ruby/build/master/ext/digest' I, [2024-05-15T19:34:12.219585 #598486] INFO -- : make[2]: Entering directory '/home/opc/ruby/build/master/ext/date' I, [2024-05-15T19:34:12.222413 #598486] INFO -- : make[2]: Leaving directory '/home/opc/ruby/build/master/ext/coverage' I, [2024-05-15T19:34:12.225581 #598486] INFO -- : make[2]: Leaving directory '/home/opc/ruby/build/master/ext/date' I, [2024-05-15T19:34:12.229791 #598486] INFO -- : make[2]: Leaving directory '/home/opc/ruby/build/master/ext/digest' I, [2024-05-15T19:34:12.235283 #598486] INFO -- : make[2]: Entering directory '/home/opc/ruby/build/master/ext/io/console' I, [2024-05-15T19:34:12.236770 #598486] INFO -- : make[2]: Entering directory '/home/opc/ruby/build/master/ext/fiddle' I, [2024-05-15T19:34:12.241733 #598486] INFO -- : make[2]: Leaving directory '/home/opc/ruby/build/master/ext/io/console' I, [2024-05-15T19:34:12.243839 #598486] INFO -- : make[2]: Entering directory '/home/opc/ruby/build/master/ext/json' I, [2024-05-15T19:34:12.245833 #598486] INFO -- : make[2]: Leaving directory '/home/opc/ruby/build/master/ext/fiddle' I, [2024-05-15T19:34:12.246080 #598486] INFO -- : make[2]: Entering directory '/home/opc/ruby/build/master/ext/monitor' I, [2024-05-15T19:34:12.250215 #598486] INFO -- : make[2]: Leaving directory '/home/opc/ruby/build/master/ext/monitor' I, [2024-05-15T19:34:12.252029 #598486] INFO -- : make[2]: Leaving directory '/home/opc/ruby/build/master/ext/json' I, [2024-05-15T19:34:12.253628 #598486] INFO -- : make[2]: Entering directory '/home/opc/ruby/build/master/ext/objspace' I, [2024-05-15T19:34:12.256202 #598486] INFO -- : make[2]: Entering directory '/home/opc/ruby/build/master/ext/pathname' I, [2024-05-15T19:34:12.259512 #598486] INFO -- : make[2]: Leaving directory '/home/opc/ruby/build/master/ext/objspace' I, [2024-05-15T19:34:12.260824 #598486] INFO -- : make[2]: Leaving directory '/home/opc/ruby/build/master/ext/pathname' I, [2024-05-15T19:34:12.265083 #598486] INFO -- : make[2]: Entering directory '/home/opc/ruby/build/master/ext/pty' I, [2024-05-15T19:34:12.265777 #598486] INFO -- : make[2]: Entering directory '/home/opc/ruby/build/master/ext/psych' I, [2024-05-15T19:34:12.270456 #598486] INFO -- : make[2]: Entering directory '/home/opc/ruby/build/master/ext/openssl' I, [2024-05-15T19:34:12.278384 #598486] INFO -- : make[2]: Leaving directory '/home/opc/ruby/build/master/ext/pty' I, [2024-05-15T19:34:12.283453 #598486] INFO -- : make[2]: Leaving directory '/home/opc/ruby/build/master/ext/psych' I, [2024-05-15T19:34:12.286782 #598486] INFO -- : make[2]: Entering directory '/home/opc/ruby/build/master/ext/rubyvm' I, [2024-05-15T19:34:12.290435 #598486] INFO -- : make[2]: Leaving directory '/home/opc/ruby/build/master/ext/rubyvm' I, [2024-05-15T19:34:12.291351 #598486] INFO -- : make[2]: Leaving directory '/home/opc/ruby/build/master/ext/openssl' I, [2024-05-15T19:34:12.292634 #598486] INFO -- : make[2]: Entering directory '/home/opc/ruby/build/master/ext/ripper' I, [2024-05-15T19:34:12.300533 #598486] INFO -- : make[2]: Leaving directory '/home/opc/ruby/build/master/ext/ripper' I, [2024-05-15T19:34:12.302907 #598486] INFO -- : make[2]: Entering directory '/home/opc/ruby/build/master/.bundle/gems/bigdecimal-3.1.7/ext/bigdecimal' I, [2024-05-15T19:34:12.303265 #598486] INFO -- : make[2]: Entering directory '/home/opc/ruby/build/master/ext/socket' I, [2024-05-15T19:34:12.306841 #598486] INFO -- : make[2]: Entering directory '/home/opc/ruby/build/master/.bundle/gems/bigdecimal-3.1.8/ext/bigdecimal' I, [2024-05-15T19:34:12.314250 #598486] INFO -- : make[2]: Leaving directory '/home/opc/ruby/build/master/ext/socket' I, [2024-05-15T19:34:12.317052 #598486] INFO -- : make[2]: Entering directory '/home/opc/ruby/build/master/.bundle/gems/debug-1.9.2/ext/debug' I, [2024-05-15T19:34:12.336312 #598486] INFO -- : make[2]: Leaving directory '/home/opc/ruby/build/master/.bundle/gems/bigdecimal-3.1.7/ext/bigdecimal' I, [2024-05-15T19:34:12.338534 #598486] INFO -- : make[2]: Leaving directory '/home/opc/ruby/build/master/.bundle/gems/bigdecimal-3.1.8/ext/bigdecimal' I, [2024-05-15T19:34:12.339319 #598486] INFO -- : make[2]: Entering directory '/home/opc/ruby/build/master/.bundle/gems/nkf-0.2.0/ext/nkf' I, [2024-05-15T19:34:12.340765 #598486] INFO -- : make[2]: Entering directory '/home/opc/ruby/build/master/.bundle/gems/racc-1.7.3/ext/racc/cparse' I, [2024-05-15T19:34:12.350198 #598486] INFO -- : make[2]: Leaving directory '/home/opc/ruby/build/master/.bundle/gems/debug-1.9.2/ext/debug' I, [2024-05-15T19:34:12.353143 #598486] INFO -- : make[2]: Entering directory '/home/opc/ruby/build/master/.bundle/gems/rbs-3.4.4/ext/rbs_extension' I, [2024-05-15T19:34:12.370447 #598486] INFO -- : make[2]: Leaving directory '/home/opc/ruby/build/master/.bundle/gems/nkf-0.2.0/ext/nkf' I, [2024-05-15T19:34:12.371505 #598486] INFO -- : make[2]: Leaving directory '/home/opc/ruby/build/master/.bundle/gems/racc-1.7.3/ext/racc/cparse' I, [2024-05-15T19:34:12.373472 #598486] INFO -- : make[2]: Entering directory '/home/opc/ruby/build/master/.bundle/gems/syslog-0.1.2/ext/syslog' I, [2024-05-15T19:34:12.384926 #598486] INFO -- : make[2]: Leaving directory '/home/opc/ruby/build/master/.bundle/gems/rbs-3.4.4/ext/rbs_extension' I, [2024-05-15T19:34:12.391143 #598486] INFO -- : make[2]: Entering directory '/home/opc/ruby/build/master/ext/digest/sha2' I, [2024-05-15T19:34:12.396124 #598486] INFO -- : make[2]: Leaving directory '/home/opc/ruby/build/master/ext/digest/sha2' I, [2024-05-15T19:34:12.405995 #598486] INFO -- : make[2]: Leaving directory '/home/opc/ruby/build/master/.bundle/gems/syslog-0.1.2/ext/syslog' I, [2024-05-15T19:34:12.444111 #598486] INFO -- : make[2]: Entering directory '/home/opc/ruby/build/master' I, [2024-05-15T19:34:12.526969 #598486] INFO -- : make[2]: 'ruby' is up to date. I, [2024-05-15T19:34:12.527044 #598486] INFO -- : make[2]: Leaving directory '/home/opc/ruby/build/master' I, [2024-05-15T19:34:12.527160 #598486] INFO -- : make[1]: Leaving directory '/home/opc/ruby/build/master' I, [2024-05-15T19:34:12.531663 #598486] INFO -- : make[1]: Entering directory '/home/opc/ruby/build/master' I, [2024-05-15T19:34:12.531705 #598486] INFO -- : make[1]: Nothing to be done for 'note'. I, [2024-05-15T19:34:12.531715 #598486] INFO -- : make[1]: Leaving directory '/home/opc/ruby/build/master' I, [2024-05-15T19:34:12.531861 #598486] INFO -- : ./miniruby -I/home/opc/ruby/src/master/lib -I. -I.ext/common /home/opc/ruby/src/master/tool/runruby.rb --extout=.ext -- --disable-gems -r./aarch64-linux-fake /home/opc/ruby/src/master/tool/rbinstall.rb --make="make" --dest-dir="" --extout=".ext" --ext-build-dir="./ext" --mflags="-j3 --jobserver-auth=4,5" --make-flags=" -j3 --jobserver-auth=4,5" --data-mode=0644 --prog-mode=0755 --installed-list .installed.list --mantype="doc" --gnumake --install=all --exclude=doc I, [2024-05-15T19:34:12.690169 #598486] INFO -- : Installing to I, [2024-05-15T19:34:12.690242 #598486] INFO -- : installing binary commands: /home/opc/ruby/install/master/bin I, [2024-05-15T19:34:12.701995 #598486] INFO -- : installing base libraries: /home/opc/ruby/install/master/lib I, [2024-05-15T19:34:12.702457 #598486] INFO -- : installing arch files: /home/opc/ruby/install/master/lib/ruby/3.4.0+0/aarch64-linux I, [2024-05-15T19:34:12.702566 #598486] INFO -- : installing pkgconfig data: /home/opc/ruby/install/master/lib/pkgconfig I, [2024-05-15T19:34:12.702645 #598486] INFO -- : installing extension objects: /home/opc/ruby/install/master/lib/ruby/3.4.0+0/aarch64-linux I, [2024-05-15T19:34:12.715353 #598486] INFO -- : installing extension objects: /home/opc/ruby/install/master/lib/ruby/site_ruby/3.4.0+0/aarch64-linux I, [2024-05-15T19:34:12.715395 #598486] INFO -- : installing extension objects: /home/opc/ruby/install/master/lib/ruby/vendor_ruby/3.4.0+0/aarch64-linux I, [2024-05-15T19:34:12.715504 #598486] INFO -- : installing extension headers: /home/opc/ruby/install/master/include/ruby-3.4.0+0/aarch64-linux I, [2024-05-15T19:34:12.715764 #598486] INFO -- : installing extension scripts: /home/opc/ruby/install/master/lib/ruby/3.4.0+0 I, [2024-05-15T19:34:12.725992 #598486] INFO -- : installing extension scripts: /home/opc/ruby/install/master/lib/ruby/site_ruby/3.4.0+0 I, [2024-05-15T19:34:12.726028 #598486] INFO -- : installing extension scripts: /home/opc/ruby/install/master/lib/ruby/vendor_ruby/3.4.0+0 I, [2024-05-15T19:34:12.726038 #598486] INFO -- : installing extension headers: /home/opc/ruby/install/master/include/ruby-3.4.0+0/ruby I, [2024-05-15T19:34:12.726154 #598486] INFO -- : installing command scripts: /home/opc/ruby/install/master/bin I, [2024-05-15T19:34:12.726294 #598486] INFO -- : installing library scripts: /home/opc/ruby/install/master/lib/ruby/3.4.0+0 I, [2024-05-15T19:34:12.811637 #598486] INFO -- : installing common headers: /home/opc/ruby/install/master/include/ruby-3.4.0+0 I, [2024-05-15T19:34:12.825005 #598486] INFO -- : installing manpages: /home/opc/ruby/install/master/share/man/man1 I, [2024-05-15T19:34:12.825520 #598486] INFO -- : installing default gems from lib: /home/opc/ruby/install/master/lib/ruby/gems/3.4.0+0 I, [2024-05-15T19:34:12.872042 #598486] INFO -- : benchmark 0.3.0 I, [2024-05-15T19:34:12.886097 #598486] INFO -- : bundler 2.6.0.dev I, [2024-05-15T19:34:12.893169 #598486] INFO -- : cgi 0.4.1 I, [2024-05-15T19:34:12.894434 #598486] INFO -- : delegate 0.3.1 I, [2024-05-15T19:34:12.895581 #598486] INFO -- : did_you_mean 1.6.3 I, [2024-05-15T19:34:12.896747 #598486] INFO -- : english 0.8.0 I, [2024-05-15T19:34:12.897934 #598486] INFO -- : erb 4.0.4 I, [2024-05-15T19:34:12.900570 #598486] INFO -- : error_highlight 0.6.0 I, [2024-05-15T19:34:12.901830 #598486] INFO -- : fileutils 1.7.2 I, [2024-05-15T19:34:12.902997 #598486] INFO -- : find 0.2.0 I, [2024-05-15T19:34:12.904137 #598486] INFO -- : forwardable 1.3.3 I, [2024-05-15T19:34:12.905375 #598486] INFO -- : ipaddr 1.2.6 I, [2024-05-15T19:34:12.906525 #598486] INFO -- : irb 1.13.1 I, [2024-05-15T19:34:12.911377 #598486] INFO -- : logger 1.6.0 I, [2024-05-15T19:34:12.912666 #598486] INFO -- : net-http 0.4.1 I, [2024-05-15T19:34:12.913943 #598486] INFO -- : net-protocol 0.2.2 I, [2024-05-15T19:34:12.915159 #598486] INFO -- : open-uri 0.4.1 I, [2024-05-15T19:34:12.916407 #598486] INFO -- : open3 0.2.1 I, [2024-05-15T19:34:12.917641 #598486] INFO -- : optparse 0.5.0 I, [2024-05-15T19:34:12.918834 #598486] INFO -- : ostruct 0.6.0 I, [2024-05-15T19:34:12.919953 #598486] INFO -- : pp 0.5.0 I, [2024-05-15T19:34:12.921209 #598486] INFO -- : prettyprint 0.2.0 I, [2024-05-15T19:34:12.922361 #598486] INFO -- : prism 0.29.0 I, [2024-05-15T19:34:12.923598 #598486] INFO -- : pstore 0.1.3 I, [2024-05-15T19:34:12.926628 #598486] INFO -- : rdoc 6.6.3.1 I, [2024-05-15T19:34:12.930560 #598486] INFO -- : readline 0.0.4 I, [2024-05-15T19:34:12.931687 #598486] INFO -- : reline 0.5.7 I, [2024-05-15T19:34:12.932949 #598486] INFO -- : resolv 0.4.0 I, [2024-05-15T19:34:12.934182 #598486] INFO -- : ruby2_keywords 0.0.5 I, [2024-05-15T19:34:12.935328 #598486] INFO -- : securerandom 0.3.1 I, [2024-05-15T19:34:12.936468 #598486] INFO -- : set 1.1.0 I, [2024-05-15T19:34:12.937726 #598486] INFO -- : shellwords 0.2.0 I, [2024-05-15T19:34:12.938880 #598486] INFO -- : singleton 0.2.0 I, [2024-05-15T19:34:12.940011 #598486] INFO -- : syntax_suggest 2.0.0 I, [2024-05-15T19:34:12.944263 #598486] INFO -- : tempfile 0.2.1 I, [2024-05-15T19:34:12.945498 #598486] INFO -- : time 0.3.0 I, [2024-05-15T19:34:12.946679 #598486] INFO -- : timeout 0.4.1 I, [2024-05-15T19:34:12.947816 #598486] INFO -- : tmpdir 0.2.0 I, [2024-05-15T19:34:12.949073 #598486] INFO -- : tsort 0.2.0 I, [2024-05-15T19:34:12.950229 #598486] INFO -- : un 0.3.0 I, [2024-05-15T19:34:12.952288 #598486] INFO -- : uri 0.13.0 I, [2024-05-15T19:34:12.954515 #598486] INFO -- : weakref 0.1.3 I, [2024-05-15T19:34:12.956430 #598486] INFO -- : yaml 0.3.0 I, [2024-05-15T19:34:12.957894 #598486] INFO -- : installing default gems from ext: /home/opc/ruby/install/master/lib/ruby/gems/3.4.0+0 I, [2024-05-15T19:34:12.971656 #598486] INFO -- : date 3.3.4 I, [2024-05-15T19:34:12.973009 #598486] INFO -- : digest 3.1.1 I, [2024-05-15T19:34:12.974195 #598486] INFO -- : etc 1.4.3 I, [2024-05-15T19:34:12.975371 #598486] INFO -- : fcntl 1.1.0 I, [2024-05-15T19:34:12.976521 #598486] INFO -- : fiddle 1.1.3 I, [2024-05-15T19:34:12.977746 #598486] INFO -- : io-console 0.7.2 I, [2024-05-15T19:34:12.978881 #598486] INFO -- : io-nonblock 0.3.0 I, [2024-05-15T19:34:12.980020 #598486] INFO -- : io-wait 0.3.1 I, [2024-05-15T19:34:12.982274 #598486] INFO -- : json 2.7.2 I, [2024-05-15T19:34:12.983907 #598486] INFO -- : openssl 3.2.0 I, [2024-05-15T19:34:12.985154 #598486] INFO -- : pathname 0.3.0 I, [2024-05-15T19:34:12.986312 #598486] INFO -- : psych 5.1.2 I, [2024-05-15T19:34:12.987612 #598486] INFO -- : stringio 3.1.1 I, [2024-05-15T19:34:12.988896 #598486] INFO -- : strscan 3.1.1 I, [2024-05-15T19:34:12.990110 #598486] INFO -- : zlib 3.1.0 I, [2024-05-15T19:34:12.991072 #598486] INFO -- : installing bundled gems: /home/opc/ruby/install/master/lib/ruby/gems/3.4.0+0 I, [2024-05-15T19:34:12.991743 #598486] INFO -- : minitest 5.22.3 I, [2024-05-15T19:34:13.007085 #598486] INFO -- : rake 13.2.1 I, [2024-05-15T19:34:13.021310 #598486] INFO -- : test-unit 3.6.2 I, [2024-05-15T19:34:13.038053 #598486] INFO -- : rexml 3.2.6 I, [2024-05-15T19:34:13.053834 #598486] INFO -- : rss 0.3.0 I, [2024-05-15T19:34:13.068280 #598486] INFO -- : net-ftp 0.3.4 I, [2024-05-15T19:34:13.072760 #598486] INFO -- : net-imap 0.4.11 I, [2024-05-15T19:34:13.088232 #598486] INFO -- : net-pop 0.1.2 I, [2024-05-15T19:34:13.090963 #598486] INFO -- : net-smtp 0.5.0 I, [2024-05-15T19:34:13.094365 #598486] INFO -- : matrix 0.4.2 I, [2024-05-15T19:34:13.100521 #598486] INFO -- : prime 0.1.2 I, [2024-05-15T19:34:13.111080 #598486] INFO -- : rbs 3.4.4 I, [2024-05-15T19:34:13.212517 #598486] INFO -- : typeprof 0.21.11 I, [2024-05-15T19:34:13.221132 #598486] INFO -- : debug 1.9.2 I, [2024-05-15T19:34:13.231100 #598486] INFO -- : racc 1.7.3 I, [2024-05-15T19:34:13.240742 #598486] INFO -- : mutex_m 0.2.0 I, [2024-05-15T19:34:13.243627 #598486] INFO -- : getoptlong 0.2.1 I, [2024-05-15T19:34:13.248200 #598486] INFO -- : base64 0.2.0 I, [2024-05-15T19:34:13.251918 #598486] INFO -- : bigdecimal 3.1.8 I, [2024-05-15T19:34:13.257782 #598486] INFO -- : observer 0.1.2 I, [2024-05-15T19:34:13.261107 #598486] INFO -- : abbrev 0.1.2 I, [2024-05-15T19:34:13.263783 #598486] INFO -- : resolv-replace 0.1.1 I, [2024-05-15T19:34:13.267031 #598486] INFO -- : rinda 0.2.0 I, [2024-05-15T19:34:13.270429 #598486] INFO -- : drb 2.2.1 I, [2024-05-15T19:34:13.274873 #598486] INFO -- : nkf 0.2.0 I, [2024-05-15T19:34:13.281347 #598486] INFO -- : syslog 0.1.2 I, [2024-05-15T19:34:13.285839 #598486] INFO -- : csv 3.3.0 I, [2024-05-15T19:34:13.302145 #598486] INFO -- : installing bundled gem cache: /home/opc/ruby/install/master/lib/ruby/gems/3.4.0+0/cache I, [2024-05-15T19:34:13.304089 #598486] INFO -- : skipped bundled gems: I, [2024-05-15T19:34:13.304107 #598486] INFO -- : power_assert-2.0.4dev.gem not found in bundled_gems I, [2024-05-15T19:34:13.307360 #598486] INFO -- : $$$[end] "make install -j3" exit with 0. I, [2024-05-15T19:34:13.307507 #598486] INFO -- : $$$[beg] make yes-btest TESTOPTS='-q -j3' I, [2024-05-15T19:34:35.383970 #598486] INFO -- : PASS all 1936 tests E, [2024-05-15T19:34:35.386197 #598486] ERROR -- : I, [2024-05-15T19:34:35.387782 #598486] INFO -- : $$$[end] "make yes-btest TESTOPTS='-q -j3'" exit with 0. I, [2024-05-15T19:34:35.387962 #598486] INFO -- : $$$[beg] make yes-test-basic TESTS='-j3' I, [2024-05-15T19:34:35.518625 #598486] INFO -- : BASERUBY = /usr/local/bin/ruby --disable=gems I, [2024-05-15T19:34:35.518696 #598486] INFO -- : CC = gcc I, [2024-05-15T19:34:35.518707 #598486] INFO -- : LD = ld I, [2024-05-15T19:34:35.518716 #598486] INFO -- : LDSHARED = gcc -shared I, [2024-05-15T19:34:35.518736 #598486] INFO -- : CFLAGS = -O3 -fno-fast-math -ggdb3 -Wall -Wextra -Wdeprecated-declarations -Wdiv-by-zero -Wduplicated-cond -Wimplicit-function-declaration -Wimplicit-int -Wpointer-arith -Wwrite-strings -Wold-style-definition -Wimplicit-fallthrough=0 -Wmissing-noreturn -Wno-cast-function-type -Wno-constant-logical-operand -Wno-long-long -Wno-missing-field-initializers -Wno-overlength-strings -Wno-packed-bitfield-compat -Wno-parentheses-equality -Wno-self-assign -Wno-tautological-compare -Wno-unused-parameter -Wno-unused-value -Wsuggest-attribute=format -Wsuggest-attribute=noreturn -Wunused-variable -Wmisleading-indentation -Wundef I, [2024-05-15T19:34:35.518746 #598486] INFO -- : XCFLAGS = -U_FORTIFY_SOURCE -D_FORTIFY_SOURCE=2 -fstack-protector-strong -msign-return-address=all -fno-strict-overflow -fvisibility=hidden -fexcess-precision=standard -DRUBY_EXPORT -fPIE -I. -I.ext/include/aarch64-linux -I/home/opc/ruby/src/master/include -I/home/opc/ruby/src/master -I/home/opc/ruby/src/master/prism -I/home/opc/ruby/src/master/enc/unicode/15.0.0 I, [2024-05-15T19:34:35.518755 #598486] INFO -- : CPPFLAGS = I, [2024-05-15T19:34:35.518763 #598486] INFO -- : DLDFLAGS = -Wl,--compress-debug-sections=zlib -fstack-protector-strong -pie I, [2024-05-15T19:34:35.518772 #598486] INFO -- : SOLIBS = -lz -lrt -lrt -ldl -lcrypt -lm -lpthread I, [2024-05-15T19:34:35.518779 #598486] INFO -- : LANG = en_US.UTF-8 I, [2024-05-15T19:34:35.518787 #598486] INFO -- : LC_ALL = I, [2024-05-15T19:34:35.518795 #598486] INFO -- : LC_CTYPE = I, [2024-05-15T19:34:35.518802 #598486] INFO -- : MFLAGS = I, [2024-05-15T19:34:35.518810 #598486] INFO -- : RUSTC = rustc I, [2024-05-15T19:34:35.518818 #598486] INFO -- : YJIT_RUSTC_ARGS = --crate-name=yjit --crate-type=staticlib --edition=2021 -g -C lto=thin -C opt-level=3 -C overflow-checks=on '--out-dir=/home/opc/ruby/build/master/yjit/target/release/' /home/opc/ruby/src/master/yjit/src/lib.rs I, [2024-05-15T19:34:35.519446 #598486] INFO -- : gcc (GCC) 8.5.0 20210514 (Red Hat 8.5.0-10.1.0.1) I, [2024-05-15T19:34:35.519462 #598486] INFO -- : Copyright (C) 2018 Free Software Foundation, Inc. I, [2024-05-15T19:34:35.519471 #598486] INFO -- : This is free software; see the source for copying conditions. There is NO I, [2024-05-15T19:34:35.519480 #598486] INFO -- : warranty; not even for MERCHANTABILITY or FITNESS FOR A PARTICULAR PURPOSE. I, [2024-05-15T19:34:35.519488 #598486] INFO -- : I, [2024-05-15T19:34:35.675906 #598486] INFO -- : Checking leaked global symbols...none I, [2024-05-15T19:34:35.728124 #598486] INFO -- : /home/opc/ruby/src/master/basictest/test.rb:assignment ....................................................................................................................................................................................................................................................................................................................................................................................OK 372 I, [2024-05-15T19:34:35.728200 #598486] INFO -- : /home/opc/ruby/src/master/basictest/test.rb:condition ..OK 2 I, [2024-05-15T19:34:35.728213 #598486] INFO -- : /home/opc/ruby/src/master/basictest/test.rb:if/unless ...OK 3 I, [2024-05-15T19:34:35.728265 #598486] INFO -- : /home/opc/ruby/src/master/basictest/test.rb:case .....OK 5 I, [2024-05-15T19:34:35.728845 #598486] INFO -- : /home/opc/ruby/src/master/basictest/test.rb:while/until ........OK 8 I, [2024-05-15T19:34:35.728963 #598486] INFO -- : /home/opc/ruby/src/master/basictest/test.rb:exception ..........OK 10 I, [2024-05-15T19:34:35.729600 #598486] INFO -- : /home/opc/ruby/src/master/basictest/test.rb:array .......................................OK 39 I, [2024-05-15T19:34:35.729857 #598486] INFO -- : /home/opc/ruby/src/master/basictest/test.rb:hash ...........................OK 27 I, [2024-05-15T19:34:35.731486 #598486] INFO -- : /home/opc/ruby/src/master/basictest/test.rb:iterator ...........................................................................................................OK 107 I, [2024-05-15T19:34:35.732220 #598486] INFO -- : /home/opc/ruby/src/master/basictest/test.rb:float ................................................................................OK 80 I, [2024-05-15T19:34:35.735746 #598486] INFO -- : /home/opc/ruby/src/master/basictest/test.rb:bignum ...............................OK 31 I, [2024-05-15T19:34:35.737349 #598486] INFO -- : /home/opc/ruby/src/master/basictest/test.rb:string & char ..............................................................OK 62 I, [2024-05-15T19:34:35.737415 #598486] INFO -- : /home/opc/ruby/src/master/basictest/test.rb:assignment ..........OK 10 I, [2024-05-15T19:34:35.737486 #598486] INFO -- : /home/opc/ruby/src/master/basictest/test.rb:call ......OK 6 I, [2024-05-15T19:34:35.737609 #598486] INFO -- : /home/opc/ruby/src/master/basictest/test.rb:proc .........OK 9 I, [2024-05-15T19:34:35.837819 #598486] INFO -- : /home/opc/ruby/src/master/basictest/test.rb:signal ..OK 2 I, [2024-05-15T19:34:35.839222 #598486] INFO -- : /home/opc/ruby/src/master/basictest/test.rb:eval ...........................OK 27 I, [2024-05-15T19:34:35.971810 #598486] INFO -- : /home/opc/ruby/src/master/basictest/test.rb:system ........OK 8 I, [2024-05-15T19:34:35.971880 #598486] INFO -- : /home/opc/ruby/src/master/basictest/test.rb:const .....OK 5 I, [2024-05-15T19:34:35.971988 #598486] INFO -- : /home/opc/ruby/src/master/basictest/test.rb:clone .....OK 5 I, [2024-05-15T19:34:35.972188 #598486] INFO -- : /home/opc/ruby/src/master/basictest/test.rb:marshal ....OK 4 I, [2024-05-15T19:34:35.972267 #598486] INFO -- : /home/opc/ruby/src/master/basictest/test.rb:pack ....OK 4 I, [2024-05-15T19:34:35.972300 #598486] INFO -- : /home/opc/ruby/src/master/basictest/test.rb:math ..OK 2 I, [2024-05-15T19:34:35.972390 #598486] INFO -- : /home/opc/ruby/src/master/basictest/test.rb:struct ......OK 6 I, [2024-05-15T19:34:35.972586 #598486] INFO -- : /home/opc/ruby/src/master/basictest/test.rb:variable ............OK 12 I, [2024-05-15T19:34:35.972624 #598486] INFO -- : /home/opc/ruby/src/master/basictest/test.rb:trace ...OK 3 I, [2024-05-15T19:34:35.972750 #598486] INFO -- : /home/opc/ruby/src/master/basictest/test.rb:defined? ............OK 12 I, [2024-05-15T19:34:35.972838 #598486] INFO -- : /home/opc/ruby/src/master/basictest/test.rb:alias ......OK 6 I, [2024-05-15T19:34:35.973415 #598486] INFO -- : /home/opc/ruby/src/master/basictest/test.rb:path .......................OK 23 I, [2024-05-15T19:34:36.040066 #598486] INFO -- : /home/opc/ruby/src/master/basictest/test.rb:gc ....OK 4 I, [2024-05-15T19:34:36.042199 #598486] INFO -- : I, [2024-05-15T19:34:36.042232 #598486] INFO -- : test succeeded I, [2024-05-15T19:34:36.042750 #598486] INFO -- : $$$[end] "make yes-test-basic TESTS='-j3'" exit with 0. I, [2024-05-15T19:34:36.042900 #598486] INFO -- : $$$[beg] make yes-test-all TESTOPTS='--stderr-on-failure' TESTS='-j3' I, [2024-05-15T19:34:36.167789 #598486] INFO -- : BASERUBY = /usr/local/bin/ruby --disable=gems I, [2024-05-15T19:34:36.167865 #598486] INFO -- : CC = gcc I, [2024-05-15T19:34:36.167876 #598486] INFO -- : LD = ld I, [2024-05-15T19:34:36.167885 #598486] INFO -- : LDSHARED = gcc -shared I, [2024-05-15T19:34:36.167894 #598486] INFO -- : CFLAGS = -O3 -fno-fast-math -ggdb3 -Wall -Wextra -Wdeprecated-declarations -Wdiv-by-zero -Wduplicated-cond -Wimplicit-function-declaration -Wimplicit-int -Wpointer-arith -Wwrite-strings -Wold-style-definition -Wimplicit-fallthrough=0 -Wmissing-noreturn -Wno-cast-function-type -Wno-constant-logical-operand -Wno-long-long -Wno-missing-field-initializers -Wno-overlength-strings -Wno-packed-bitfield-compat -Wno-parentheses-equality -Wno-self-assign -Wno-tautological-compare -Wno-unused-parameter -Wno-unused-value -Wsuggest-attribute=format -Wsuggest-attribute=noreturn -Wunused-variable -Wmisleading-indentation -Wundef I, [2024-05-15T19:34:36.167906 #598486] INFO -- : XCFLAGS = -U_FORTIFY_SOURCE -D_FORTIFY_SOURCE=2 -fstack-protector-strong -msign-return-address=all -fno-strict-overflow -fvisibility=hidden -fexcess-precision=standard -DRUBY_EXPORT -fPIE -I. -I.ext/include/aarch64-linux -I/home/opc/ruby/src/master/include -I/home/opc/ruby/src/master -I/home/opc/ruby/src/master/prism -I/home/opc/ruby/src/master/enc/unicode/15.0.0 I, [2024-05-15T19:34:36.167914 #598486] INFO -- : CPPFLAGS = I, [2024-05-15T19:34:36.167922 #598486] INFO -- : DLDFLAGS = -Wl,--compress-debug-sections=zlib -fstack-protector-strong -pie I, [2024-05-15T19:34:36.167931 #598486] INFO -- : SOLIBS = -lz -lrt -lrt -ldl -lcrypt -lm -lpthread I, [2024-05-15T19:34:36.167939 #598486] INFO -- : LANG = en_US.UTF-8 I, [2024-05-15T19:34:36.167947 #598486] INFO -- : LC_ALL = I, [2024-05-15T19:34:36.167955 #598486] INFO -- : LC_CTYPE = I, [2024-05-15T19:34:36.167963 #598486] INFO -- : MFLAGS = I, [2024-05-15T19:34:36.167970 #598486] INFO -- : RUSTC = rustc I, [2024-05-15T19:34:36.167978 #598486] INFO -- : YJIT_RUSTC_ARGS = --crate-name=yjit --crate-type=staticlib --edition=2021 -g -C lto=thin -C opt-level=3 -C overflow-checks=on '--out-dir=/home/opc/ruby/build/master/yjit/target/release/' /home/opc/ruby/src/master/yjit/src/lib.rs I, [2024-05-15T19:34:36.168601 #598486] INFO -- : gcc (GCC) 8.5.0 20210514 (Red Hat 8.5.0-10.1.0.1) I, [2024-05-15T19:34:36.168621 #598486] INFO -- : Copyright (C) 2018 Free Software Foundation, Inc. I, [2024-05-15T19:34:36.168630 #598486] INFO -- : This is free software; see the source for copying conditions. There is NO I, [2024-05-15T19:34:36.168639 #598486] INFO -- : warranty; not even for MERCHANTABILITY or FITNESS FOR A PARTICULAR PURPOSE. I, [2024-05-15T19:34:36.168647 #598486] INFO -- : I, [2024-05-15T19:34:36.170649 #598486] INFO -- : generating enc.mk I, [2024-05-15T19:34:36.406847 #598486] INFO -- : generating encdb.h I, [2024-05-15T19:34:36.443789 #598486] INFO -- : encdb.h unchanged I, [2024-05-15T19:34:36.445036 #598486] INFO -- : making enc I, [2024-05-15T19:34:36.472370 #598486] INFO -- : make[1]: Entering directory '/home/opc/ruby/build/master' I, [2024-05-15T19:34:36.472446 #598486] INFO -- : make[1]: Nothing to be done for 'enc'. I, [2024-05-15T19:34:36.472466 #598486] INFO -- : make[1]: Leaving directory '/home/opc/ruby/build/master' I, [2024-05-15T19:34:36.473836 #598486] INFO -- : making srcs under enc I, [2024-05-15T19:34:36.515566 #598486] INFO -- : make[1]: Entering directory '/home/opc/ruby/build/master' I, [2024-05-15T19:34:36.515614 #598486] INFO -- : make[1]: Nothing to be done for 'srcs'. I, [2024-05-15T19:34:36.515624 #598486] INFO -- : make[1]: Leaving directory '/home/opc/ruby/build/master' I, [2024-05-15T19:34:36.516783 #598486] INFO -- : generating transdb.h I, [2024-05-15T19:34:36.659501 #598486] INFO -- : transdb.h unchanged I, [2024-05-15T19:34:36.660820 #598486] INFO -- : making trans I, [2024-05-15T19:34:36.709017 #598486] INFO -- : make[1]: Entering directory '/home/opc/ruby/build/master' I, [2024-05-15T19:34:36.709090 #598486] INFO -- : make[1]: Nothing to be done for 'trans'. I, [2024-05-15T19:34:36.709109 #598486] INFO -- : make[1]: Leaving directory '/home/opc/ruby/build/master' I, [2024-05-15T19:34:36.709828 #598486] INFO -- : making encs I, [2024-05-15T19:34:36.761841 #598486] INFO -- : make[1]: Entering directory '/home/opc/ruby/build/master' I, [2024-05-15T19:34:36.761904 #598486] INFO -- : make[1]: Nothing to be done for 'encs'. I, [2024-05-15T19:34:36.761914 #598486] INFO -- : make[1]: Leaving directory '/home/opc/ruby/build/master' I, [2024-05-15T19:34:36.763857 #598486] INFO -- : generating makefiles ext/configure-ext.mk I, [2024-05-15T19:34:36.803433 #598486] INFO -- : ext/configure-ext.mk updated I, [2024-05-15T19:34:36.806678 #598486] INFO -- : make[1]: Entering directory '/home/opc/ruby/build/master' I, [2024-05-15T19:34:38.867379 #598486] INFO -- : make[1]: Leaving directory '/home/opc/ruby/build/master' I, [2024-05-15T19:34:38.868088 #598486] INFO -- : generating makefile exts.mk I, [2024-05-15T19:34:38.926974 #598486] INFO -- : exts.mk unchanged I, [2024-05-15T19:34:38.931782 #598486] INFO -- : make[1]: Entering directory '/home/opc/ruby/build/master' I, [2024-05-15T19:34:39.231084 #598486] INFO -- : make[2]: Entering directory '/home/opc/ruby/build/master/ext/coverage' I, [2024-05-15T19:34:39.235697 #598486] INFO -- : make[2]: Leaving directory '/home/opc/ruby/build/master/ext/coverage' I, [2024-05-15T19:34:39.241367 #598486] INFO -- : make[2]: Entering directory '/home/opc/ruby/build/master/ext/date' I, [2024-05-15T19:34:39.246605 #598486] INFO -- : make[2]: Leaving directory '/home/opc/ruby/build/master/ext/date' I, [2024-05-15T19:34:39.249970 #598486] INFO -- : make[2]: Entering directory '/home/opc/ruby/build/master/ext/digest' I, [2024-05-15T19:34:39.258612 #598486] INFO -- : make[2]: Leaving directory '/home/opc/ruby/build/master/ext/digest' I, [2024-05-15T19:34:39.280707 #598486] INFO -- : make[2]: Entering directory '/home/opc/ruby/build/master/ext/digest/sha2' I, [2024-05-15T19:34:39.285447 #598486] INFO -- : make[2]: Leaving directory '/home/opc/ruby/build/master/ext/digest/sha2' I, [2024-05-15T19:34:39.303559 #598486] INFO -- : make[2]: Entering directory '/home/opc/ruby/build/master/ext/fiddle' I, [2024-05-15T19:34:39.313552 #598486] INFO -- : make[2]: Leaving directory '/home/opc/ruby/build/master/ext/fiddle' I, [2024-05-15T19:34:39.317867 #598486] INFO -- : make[2]: Entering directory '/home/opc/ruby/build/master/ext/io/console' I, [2024-05-15T19:34:39.322079 #598486] INFO -- : make[2]: Leaving directory '/home/opc/ruby/build/master/ext/io/console' I, [2024-05-15T19:34:39.332966 #598486] INFO -- : make[2]: Entering directory '/home/opc/ruby/build/master/ext/json' I, [2024-05-15T19:34:39.343021 #598486] INFO -- : make[2]: Leaving directory '/home/opc/ruby/build/master/ext/json' I, [2024-05-15T19:34:39.356207 #598486] INFO -- : make[2]: Entering directory '/home/opc/ruby/build/master/ext/monitor' I, [2024-05-15T19:34:39.360359 #598486] INFO -- : make[2]: Leaving directory '/home/opc/ruby/build/master/ext/monitor' I, [2024-05-15T19:34:39.366404 #598486] INFO -- : make[2]: Entering directory '/home/opc/ruby/build/master/ext/objspace' I, [2024-05-15T19:34:39.372269 #598486] INFO -- : make[2]: Leaving directory '/home/opc/ruby/build/master/ext/objspace' I, [2024-05-15T19:34:39.391237 #598486] INFO -- : make[2]: Entering directory '/home/opc/ruby/build/master/ext/openssl' I, [2024-05-15T19:34:39.412856 #598486] INFO -- : make[2]: Leaving directory '/home/opc/ruby/build/master/ext/openssl' I, [2024-05-15T19:34:39.417246 #598486] INFO -- : make[2]: Entering directory '/home/opc/ruby/build/master/ext/pathname' I, [2024-05-15T19:34:39.421620 #598486] INFO -- : make[2]: Leaving directory '/home/opc/ruby/build/master/ext/pathname' I, [2024-05-15T19:34:39.427855 #598486] INFO -- : make[2]: Entering directory '/home/opc/ruby/build/master/ext/psych' I, [2024-05-15T19:34:39.449311 #598486] INFO -- : make[2]: Leaving directory '/home/opc/ruby/build/master/ext/psych' I, [2024-05-15T19:34:39.453974 #598486] INFO -- : make[2]: Entering directory '/home/opc/ruby/build/master/ext/pty' I, [2024-05-15T19:34:39.458205 #598486] INFO -- : make[2]: Leaving directory '/home/opc/ruby/build/master/ext/pty' I, [2024-05-15T19:34:39.471765 #598486] INFO -- : make[2]: Entering directory '/home/opc/ruby/build/master/ext/ripper' I, [2024-05-15T19:34:39.479632 #598486] INFO -- : make[2]: Leaving directory '/home/opc/ruby/build/master/ext/ripper' I, [2024-05-15T19:34:39.481665 #598486] INFO -- : make[2]: Entering directory '/home/opc/ruby/build/master/ext/rubyvm' I, [2024-05-15T19:34:39.485053 #598486] INFO -- : make[2]: Leaving directory '/home/opc/ruby/build/master/ext/rubyvm' I, [2024-05-15T19:34:39.497105 #598486] INFO -- : make[2]: Entering directory '/home/opc/ruby/build/master/ext/socket' I, [2024-05-15T19:34:39.507851 #598486] INFO -- : make[2]: Leaving directory '/home/opc/ruby/build/master/ext/socket' I, [2024-05-15T19:34:39.523698 #598486] INFO -- : make[2]: Entering directory '/home/opc/ruby/build/master/.bundle/gems/bigdecimal-3.1.7/ext/bigdecimal' I, [2024-05-15T19:34:39.554662 #598486] INFO -- : make[2]: Leaving directory '/home/opc/ruby/build/master/.bundle/gems/bigdecimal-3.1.7/ext/bigdecimal' I, [2024-05-15T19:34:39.557344 #598486] INFO -- : make[2]: Entering directory '/home/opc/ruby/build/master/.bundle/gems/bigdecimal-3.1.8/ext/bigdecimal' I, [2024-05-15T19:34:39.587563 #598486] INFO -- : make[2]: Leaving directory '/home/opc/ruby/build/master/.bundle/gems/bigdecimal-3.1.8/ext/bigdecimal' I, [2024-05-15T19:34:39.590220 #598486] INFO -- : make[2]: Entering directory '/home/opc/ruby/build/master/.bundle/gems/debug-1.9.2/ext/debug' I, [2024-05-15T19:34:39.620855 #598486] INFO -- : make[2]: Leaving directory '/home/opc/ruby/build/master/.bundle/gems/debug-1.9.2/ext/debug' I, [2024-05-15T19:34:39.623469 #598486] INFO -- : make[2]: Entering directory '/home/opc/ruby/build/master/.bundle/gems/nkf-0.2.0/ext/nkf' I, [2024-05-15T19:34:39.654010 #598486] INFO -- : make[2]: Leaving directory '/home/opc/ruby/build/master/.bundle/gems/nkf-0.2.0/ext/nkf' I, [2024-05-15T19:34:39.656868 #598486] INFO -- : make[2]: Entering directory '/home/opc/ruby/build/master/.bundle/gems/racc-1.7.3/ext/racc/cparse' I, [2024-05-15T19:34:39.686920 #598486] INFO -- : make[2]: Leaving directory '/home/opc/ruby/build/master/.bundle/gems/racc-1.7.3/ext/racc/cparse' I, [2024-05-15T19:34:39.690000 #598486] INFO -- : make[2]: Entering directory '/home/opc/ruby/build/master/.bundle/gems/rbs-3.4.4/ext/rbs_extension' I, [2024-05-15T19:34:39.719990 #598486] INFO -- : make[2]: Leaving directory '/home/opc/ruby/build/master/.bundle/gems/rbs-3.4.4/ext/rbs_extension' I, [2024-05-15T19:34:39.722578 #598486] INFO -- : make[2]: Entering directory '/home/opc/ruby/build/master/.bundle/gems/syslog-0.1.2/ext/syslog' I, [2024-05-15T19:34:39.752499 #598486] INFO -- : make[2]: Leaving directory '/home/opc/ruby/build/master/.bundle/gems/syslog-0.1.2/ext/syslog' I, [2024-05-15T19:34:39.790668 #598486] INFO -- : make[2]: Entering directory '/home/opc/ruby/build/master' I, [2024-05-15T19:34:39.875389 #598486] INFO -- : make[2]: 'ruby' is up to date. I, [2024-05-15T19:34:39.875473 #598486] INFO -- : make[2]: Leaving directory '/home/opc/ruby/build/master' I, [2024-05-15T19:34:39.875637 #598486] INFO -- : make[1]: Leaving directory '/home/opc/ruby/build/master' I, [2024-05-15T19:34:39.880020 #598486] INFO -- : make[1]: Entering directory '/home/opc/ruby/build/master' I, [2024-05-15T19:34:39.880043 #598486] INFO -- : make[1]: Nothing to be done for 'note'. I, [2024-05-15T19:34:39.880053 #598486] INFO -- : make[1]: Leaving directory '/home/opc/ruby/build/master' I, [2024-05-15T19:34:39.991678 #598486] INFO -- : Run options: I, [2024-05-15T19:34:39.991752 #598486] INFO -- : --seed=22482 I, [2024-05-15T19:34:39.991763 #598486] INFO -- : "--ruby=./miniruby -I/home/opc/ruby/src/master/lib -I. -I.ext/common /home/opc/ruby/src/master/tool/runruby.rb --extout=.ext -- --disable-gems" I, [2024-05-15T19:34:39.991772 #598486] INFO -- : --excludes-dir=/home/opc/ruby/src/master/test/.excludes I, [2024-05-15T19:34:39.991780 #598486] INFO -- : --name=!/memory_leak/ I, [2024-05-15T19:34:39.991789 #598486] INFO -- : --stderr-on-failure I, [2024-05-15T19:34:39.991797 #598486] INFO -- : -j3 I, [2024-05-15T19:34:39.991805 #598486] INFO -- : I, [2024-05-15T19:34:39.991813 #598486] INFO -- : # Running tests: I, [2024-05-15T19:34:39.991821 #598486] INFO -- : I, [2024-05-15T19:34:40.167090 #598486] INFO -- : [ 1/885] 639392=test_class_name_check I, [2024-05-15T19:34:40.178541 #598486] INFO -- : [ 2/885] 639391=test_syntax I, [2024-05-15T19:34:40.197236 #598486] INFO -- : [ 3/885] 639392=test_scalar I, [2024-05-15T19:34:40.204420 #598486] INFO -- : [ 4/885] 639392=test_zsh_completion I, [2024-05-15T19:34:40.206624 #598486] INFO -- : [ 5/885] 639392=test_basicsocket I, [2024-05-15T19:34:40.233885 #598486] INFO -- : [ 6/885] 639392=test_pkcs7 I, [2024-05-15T19:34:40.265289 #598486] INFO -- : [ 7/885] 639393=test_gem_commands_environment_command I, [2024-05-15T19:34:40.426506 #598486] INFO -- : [ 8/885] 639392=test_pack I, [2024-05-15T19:34:40.459170 #598486] INFO -- : [ 9/885] 639393=test_io_buffer I, [2024-05-15T19:34:40.597675 #598486] INFO -- : [ 10/885] 639393=test_rdoc_context_section I, [2024-05-15T19:34:40.606123 #598486] INFO -- : [ 11/885] 639392=test_deprecated I, [2024-05-15T19:34:40.664337 #598486] INFO -- : [ 12/885] 639392=test_optparse I, [2024-05-15T19:34:40.677039 #598486] INFO -- : [ 13/885] 639392=test_exception I, [2024-05-15T19:34:40.719915 #598486] INFO -- : [ 14/885] 639393=test_bash_completion I, [2024-05-15T19:34:40.742233 #598486] INFO -- : [ 15/885] 639393=test_rdoc_markup_to_html_crossref I, [2024-05-15T19:34:41.064347 #598486] INFO -- : [ 16/885] 639393=test_div I, [2024-05-15T19:34:41.101406 #598486] INFO -- : [ 17/885] 639393=test_files_test_2 I, [2024-05-15T19:34:41.880173 #598486] INFO -- : [ 18/885] 639392=test_singleton I, [2024-05-15T19:34:41.886135 #598486] INFO -- : [ 19/885] 639392=test_numeric I, [2024-05-15T19:34:41.892045 #598486] INFO -- : [ 20/885] 639392=test_fstring I, [2024-05-15T19:34:42.030589 #598486] INFO -- : [ 21/885] 639392=test_gem_ext_rake_builder I, [2024-05-15T19:34:42.810128 #598486] INFO -- : [ 22/885] 639392=test_rdoc_require I, [2024-05-15T19:34:42.967027 #598486] INFO -- : [ 23/885] 639392=test_word I, [2024-05-15T19:34:42.975094 #598486] INFO -- : [ 24/885] 639392=test_timeout I, [2024-05-15T19:34:43.800150 #598486] INFO -- : [ 25/885] 639392=test_rdoc_markup_raw I, [2024-05-15T19:34:43.808459 #598486] INFO -- : [ 26/885] 639393=test_key_name_check I, [2024-05-15T19:34:43.809480 #598486] INFO -- : [ 27/885] 639393=test_rdoc_markup_to_bs I, [2024-05-15T19:34:43.824644 #598486] INFO -- : [ 28/885] 639392=test_weakref I, [2024-05-15T19:34:43.864040 #598486] INFO -- : [ 29/885] 639393=test_instrumentation_api I, [2024-05-15T19:34:43.964696 #598486] INFO -- : [ 30/885] 639392=test_rdoc_alias I, [2024-05-15T19:34:43.976126 #598486] INFO -- : [ 31/885] 639392=test_gem_commands_stale_command I, [2024-05-15T19:34:44.041317 #598486] INFO -- : [ 32/885] 639392=ruby_parser_test I, [2024-05-15T19:34:44.064446 #598486] INFO -- : [ 33/885] 639392=test_rdoc_markup_to_tt_only I, [2024-05-15T19:34:44.119226 #598486] INFO -- : [ 34/885] 639392=test_ws I, [2024-05-15T19:34:44.135684 #598486] INFO -- : [ 35/885] 639392=json_parser_test I, [2024-05-15T19:34:44.267833 #598486] INFO -- : [ 36/885] 639392=test_date_strftime I, [2024-05-15T19:34:44.628018 #598486] INFO -- : [ 37/885] 639392=test_gem_commands_cert_command I, [2024-05-15T19:34:45.060479 #598486] INFO -- : [ 38/885] 639391=test_win32ole_typelib I, [2024-05-15T19:34:45.097441 #598486] INFO -- : [ 39/885] 639391=test_pkey I, [2024-05-15T19:34:45.102337 #598486] INFO -- : [ 40/885] 639391=test_external_new I, [2024-05-15T19:34:45.105158 #598486] INFO -- : [ 41/885] 639391=test_bigzero I, [2024-05-15T19:34:45.240068 #598486] INFO -- : [ 42/885] 639391=test_gem_commands_query_command I, [2024-05-15T19:34:45.842916 #598486] INFO -- : [ 43/885] 639391=test_gem_platform I, [2024-05-15T19:34:45.932635 #598486] INFO -- : [ 44/885] 639391=test_ractor I, [2024-05-15T19:34:45.999320 #598486] INFO -- : [ 45/885] 639391=test_null I, [2024-05-15T19:34:46.005941 #598486] INFO -- : [ 46/885] 639391=test_data I, [2024-05-15T19:34:46.013373 #598486] INFO -- : [ 47/885] 639391=test_memory_view I, [2024-05-15T19:34:46.035086 #598486] INFO -- : [ 48/885] 639391=test_multi_irb_commands I, [2024-05-15T19:34:46.044555 #598486] INFO -- : [ 49/885] 639391=test_pkey_dh I, [2024-05-15T19:34:46.809196 #598486] INFO -- : [ 50/885] 639392=test_m17n_comb I, [2024-05-15T19:34:46.824748 #598486] INFO -- : [ 51/885] 639393=test_input_method I, [2024-05-15T19:34:46.966306 #598486] INFO -- : [ 52/885] 639393=test_io I, [2024-05-15T19:34:47.235008 #598486] INFO -- : [ 53/885] 639393=test_rdoc_i18n_text I, [2024-05-15T19:34:47.236020 #598486] INFO -- : [ 54/885] 639393=test_gem_unsatisfiable_dependency_error I, [2024-05-15T19:34:47.304217 #598486] INFO -- : [ 55/885] 639393=test_literal I, [2024-05-15T19:34:47.358207 #598486] INFO -- : [ 56/885] 639391=test_thread I, [2024-05-15T19:34:47.591225 #598486] INFO -- : [ 57/885] 639391=test_gem_security_signer I, [2024-05-15T19:34:47.689484 #598486] INFO -- : [ 58/885] 639391=test_complex2 I, [2024-05-15T19:34:47.703763 #598486] INFO -- : [ 59/885] 639391=test_config I, [2024-05-15T19:34:47.758322 #598486] INFO -- : [ 60/885] 639391=test_gem_util I, [2024-05-15T19:34:47.814397 #598486] INFO -- : [ 61/885] 639393=test_tsort I, [2024-05-15T19:34:47.848768 #598486] INFO -- : [ 62/885] 639393=test_gem_commands_fetch_command I, [2024-05-15T19:34:47.912779 #598486] INFO -- : [ 63/885] 639391=test_typeddata I, [2024-05-15T19:34:48.040799 #598486] INFO -- : [ 64/885] 639393=test_securerandom I, [2024-05-15T19:34:48.103670 #598486] INFO -- : [ 65/885] 639393=test_gem_commands_outdated_command I, [2024-05-15T19:34:48.147603 #598486] INFO -- : [ 66/885] 639393=test_gem_dependency_list I, [2024-05-15T19:34:48.164665 #598486] INFO -- : [ 67/885] 639391=parameters_signature_test I, [2024-05-15T19:34:48.243355 #598486] INFO -- : [ 68/885] 639393=test_rdoc_parser_changelog I, [2024-05-15T19:34:48.248764 #598486] INFO -- : [ 69/885] 639391=test_gem_doctor I, [2024-05-15T19:34:48.310904 #598486] INFO -- : [ 70/885] 639391=json_fixtures_test I, [2024-05-15T19:34:48.322106 #598486] INFO -- : [ 71/885] 639393=test_len I, [2024-05-15T19:34:48.329437 #598486] INFO -- : [ 72/885] 639393=test_rdoc_parser_c I, [2024-05-15T19:34:48.333578 #598486] INFO -- : [ 73/885] 639391=test_kwargs I, [2024-05-15T19:34:48.341087 #598486] INFO -- : [ 74/885] 639391=test_io_wait I, [2024-05-15T19:34:48.528004 #598486] INFO -- : [ 75/885] 639393=test_pack I, [2024-05-15T19:34:48.681402 #598486] INFO -- : [ 76/885] 639391=parse_test I, [2024-05-15T19:34:48.719523 #598486] INFO -- : [ 77/885] 639393=test_rdoc_code_object I, [2024-05-15T19:34:49.034940 #598486] INFO -- : [ 78/885] 639393=test_process I, [2024-05-15T19:34:49.077535 #598486] INFO -- : .Leaked file descriptor: TestProcess#test_seteuid_name: 7 # I, [2024-05-15T19:34:49.080242 #598486] INFO -- : [ 79/885] 639392=test_bmethod I, [2024-05-15T19:34:49.088693 #598486] INFO -- : [ 80/885] 639392=test_euc_kr I, [2024-05-15T19:34:49.095770 #598486] INFO -- : [ 81/885] 639392=test_provider I, [2024-05-15T19:34:49.097811 #598486] INFO -- : [ 82/885] 639392=test_gem_source_specific_file I, [2024-05-15T19:34:49.103950 #598486] INFO -- : COMMAND PID USER FD TYPE DEVICE SIZE/OFF NODE NAME I, [2024-05-15T19:34:49.103991 #598486] INFO -- : ruby 639393 opc 7r REG 252,0 9253600 13705411 /var/lib/sss/mc/passwd I, [2024-05-15T19:34:49.185230 #598486] INFO -- : [ 83/885] 639392=redundant_return_test I, [2024-05-15T19:34:49.192731 #598486] INFO -- : [ 84/885] 639392=test_rand I, [2024-05-15T19:34:49.538004 #598486] INFO -- : [ 85/885] 639392=test_random_formatter I, [2024-05-15T19:34:49.566733 #598486] INFO -- : [ 86/885] 639392=test_string_processing I, [2024-05-15T19:34:49.651395 #598486] INFO -- : [ 87/885] 639392=test_rdoc_markup_attributes I, [2024-05-15T19:34:49.662958 #598486] INFO -- : [ 88/885] 639392=test_httpresponses I, [2024-05-15T19:34:49.702323 #598486] INFO -- : [ 89/885] 639392=test_deprecate I, [2024-05-15T19:34:49.763279 #598486] INFO -- : [ 90/885] 639392=test_rdoc_constant I, [2024-05-15T19:34:49.866797 #598486] INFO -- : [ 91/885] 639392=test_generic I, [2024-05-15T19:34:49.880681 #598486] INFO -- : [ 92/885] 639392=test_common I, [2024-05-15T19:34:50.070778 #598486] INFO -- : [ 93/885] 639392=test_rdoc_markup_to_html_snippet I, [2024-05-15T19:34:50.164109 #598486] INFO -- : [ 94/885] 639392=test_win32ole_variant_outarg I, [2024-05-15T19:34:50.173608 #598486] INFO -- : [ 95/885] 639392=test_rdoc_encoding I, [2024-05-15T19:34:50.205116 #598486] INFO -- : [ 96/885] 639392=test_key_actor_vi I, [2024-05-15T19:34:50.343036 #598486] INFO -- : [ 97/885] 639392=test_postponed_job I, [2024-05-15T19:34:50.692642 #598486] INFO -- : [ 98/885] 639392=test_gem_request_set_lockfile I, [2024-05-15T19:34:51.245107 #598486] INFO -- : [ 99/885] 639392=test_rdoc_markdown I, [2024-05-15T19:34:51.421708 #598486] INFO -- : [100/885] 639391=test_rdoc_markup_indented_paragraph I, [2024-05-15T19:34:51.514313 #598486] INFO -- : [101/885] 639392=test_rdoc_markup_parser I, [2024-05-15T19:34:51.560657 #598486] INFO -- : [102/885] 639392=test_iseq_load I, [2024-05-15T19:34:51.596522 #598486] INFO -- : [103/885] 639391=test_stream I, [2024-05-15T19:34:51.831179 #598486] INFO -- : [104/885] 639391=test_have_library I, [2024-05-15T19:34:52.577455 #598486] INFO -- : [105/885] 639391=test_ns_spki I, [2024-05-15T19:34:52.586676 #598486] INFO -- : [106/885] 639391=test_stringify_symbols I, [2024-05-15T19:34:52.589992 #598486] INFO -- : [107/885] 639391=test_require I, [2024-05-15T19:34:52.709414 #598486] INFO -- : [108/885] 639391=test_objspace I, [2024-05-15T19:34:52.719734 #598486] INFO -- : [109/885] 639392=test_rdoc_text I, [2024-05-15T19:34:52.771841 #598486] INFO -- : [110/885] 639392=library_symbols_test I, [2024-05-15T19:34:52.788735 #598486] INFO -- : [111/885] 639392=test_gem_package_tar_reader_entry I, [2024-05-15T19:34:52.881400 #598486] INFO -- : Leaked file descriptor: TestProcess#test_uid_from_name: 8 # I, [2024-05-15T19:34:52.910541 #598486] INFO -- : COMMAND PID USER FD TYPE DEVICE SIZE/OFF NODE NAME I, [2024-05-15T19:34:52.910606 #598486] INFO -- : ruby 639393 opc 8u unix 0x0000000000000000 0t0 2997063739 type=STREAM I, [2024-05-15T19:34:53.003485 #598486] INFO -- : [112/885] 639392=test_resource I, [2024-05-15T19:34:53.018341 #598486] INFO -- : [113/885] 639392=test_gem_uri I, [2024-05-15T19:34:53.053061 #598486] INFO -- : [114/885] 639392=test_bug-5832 I, [2024-05-15T19:34:53.057562 #598486] INFO -- : [115/885] 639392=test_yield_block I, [2024-05-15T19:34:53.091840 #598486] INFO -- : [116/885] 639392=test_c_struct_builder I, [2024-05-15T19:34:53.223765 #598486] INFO -- : [117/885] 639392=test_path_to_class I, [2024-05-15T19:34:53.233160 #598486] INFO -- : [118/885] 639392=test_enumerator I, [2024-05-15T19:34:53.289939 #598486] INFO -- : [119/885] 639392=test_reqarg I, [2024-05-15T19:34:53.586711 #598486] INFO -- : [120/885] 639392=test_frozen_error I, [2024-05-15T19:34:53.704759 #598486] INFO -- : [121/885] 639392=test_gem_ext_ext_conf_builder I, [2024-05-15T19:34:54.736061 #598486] INFO -- : [122/885] 639392=test_spell_checker I, [2024-05-15T19:34:54.746177 #598486] INFO -- : [123/885] 639392=test_gem_version I, [2024-05-15T19:34:54.882394 #598486] INFO -- : [124/885] 639392=test_gem_ext_cargo_builder I, [2024-05-15T19:34:54.906420 #598486] INFO -- : [125/885] 639392=test_proc I, [2024-05-15T19:34:55.903643 #598486] INFO -- : [126/885] 639392=test_console_attr I, [2024-05-15T19:34:55.930559 #598486] INFO -- : [127/885] 639392=test_gem_commands_unpack_command I, [2024-05-15T19:34:56.493544 #598486] INFO -- : [128/885] 639392=test_zlib I, [2024-05-15T19:34:59.676786 #598486] INFO -- : .Leaked file descriptor: TestProcess#test_gid_from_name: 9 # I, [2024-05-15T19:34:59.709294 #598486] INFO -- : COMMAND PID USER FD TYPE DEVICE SIZE/OFF NODE NAME I, [2024-05-15T19:34:59.709366 #598486] INFO -- : ruby 639393 opc 9r REG 252,0 6940392 13705429 /var/lib/sss/mc/group I, [2024-05-15T19:35:00.924952 #598486] INFO -- : [129/885] 639392=test_rdoc_options I, [2024-05-15T19:35:01.210094 #598486] INFO -- : [130/885] 639392=test_ubf_async_safe I, [2024-05-15T19:35:01.217835 #598486] INFO -- : [131/885] 639392=test_pstore I, [2024-05-15T19:35:01.416418 #598486] INFO -- : [132/885] 639392=test_rdoc_include I, [2024-05-15T19:35:01.443906 #598486] INFO -- : [133/885] 639392=test_win32ole_record I, [2024-05-15T19:35:01.452280 #598486] INFO -- : [134/885] 639392=test_gem_version_option I, [2024-05-15T19:35:01.498844 #598486] INFO -- : [135/885] 639392=test_date_compat I, [2024-05-15T19:35:01.503747 #598486] INFO -- : [136/885] 639392=test_hmac I, [2024-05-15T19:35:01.509926 #598486] INFO -- : [137/885] 639392=test_encoding I, [2024-05-15T19:35:01.688928 #598486] INFO -- : [138/885] 639392=test_rdoc_generator_markup I, [2024-05-15T19:35:02.348751 #598486] INFO -- : [139/885] 639392=test_constant I, [2024-05-15T19:35:03.587091 #598486] INFO -- : [140/885] 639392=test_find I, [2024-05-15T19:35:03.607018 #598486] INFO -- : [141/885] 639392=test_rat I, [2024-05-15T19:35:03.693296 #598486] INFO -- : [142/885] 639392=test_init I, [2024-05-15T19:35:03.990313 #598486] INFO -- : [143/885] 639392=test_gem_request_connection_pools I, [2024-05-15T19:35:05.038802 #598486] INFO -- : [144/885] 639392=test_flags I, [2024-05-15T19:35:05.613337 #598486] INFO -- : [145/885] 639392=test_bug-3571 I, [2024-05-15T19:35:05.619743 #598486] INFO -- : [146/885] 639392=test_yamlstore I, [2024-05-15T19:35:05.644435 #598486] INFO -- : [147/885] 639392=test_numeric I, [2024-05-15T19:35:05.720691 #598486] INFO -- : [148/885] 639392=test_time I, [2024-05-15T19:35:05.835219 #598486] INFO -- : [149/885] 639392=test_file I, [2024-05-15T19:35:05.841470 #598486] INFO -- : [150/885] 639392=test_capacity I, [2024-05-15T19:35:05.857541 #598486] INFO -- : [151/885] 639392=test_nextafter I, [2024-05-15T19:35:05.962552 #598486] INFO -- : [152/885] 639392=test_gem_commands_owner_command I, [2024-05-15T19:35:06.598436 #598486] INFO -- : [153/885] 639392=test_tcp I, [2024-05-15T19:35:06.699003 #598486] INFO -- : [154/885] 639392=test_win32ole_method_event I, [2024-05-15T19:35:06.703521 #598486] INFO -- : [155/885] 639392=parse_comments_test I, [2024-05-15T19:35:06.712239 #598486] INFO -- : [156/885] 639392=test_rdoc_markup_to_table_of_contents I, [2024-05-15T19:35:06.752612 #598486] INFO -- : [157/885] 639392=test_gem_name_tuple I, [2024-05-15T19:35:06.769733 #598486] INFO -- : [158/885] 639392=test_integer I, [2024-05-15T19:35:06.837217 #598486] INFO -- : [159/885] 639392=test_gem_requirement I, [2024-05-15T19:35:07.008187 #598486] INFO -- : [160/885] 639392=test_macro I, [2024-05-15T19:35:07.037357 #598486] INFO -- : [161/885] 639392=test_string I, [2024-05-15T19:35:07.120914 #598486] INFO -- : [162/885] 639393=test_pipe I, [2024-05-15T19:35:07.272821 #598486] INFO -- : [163/885] 639393=test_function I, [2024-05-15T19:35:07.512708 #598486] INFO -- : [164/885] 639393=test_gem_resolver_activation_request I, [2024-05-15T19:35:07.538739 #598486] INFO -- : [165/885] 639393=test_gem_commands_server_command I, [2024-05-15T19:35:07.547477 #598486] INFO -- : [166/885] 639393=test_erb_m17n I, [2024-05-15T19:35:07.557176 #598486] INFO -- : [167/885] 639393=test_rdoc_generator_pot_po_entry I, [2024-05-15T19:35:07.572817 #598486] INFO -- : [168/885] 639393=test_timeout I, [2024-05-15T19:35:07.604949 #598486] INFO -- : [169/885] 639393=test_webauthn_poller I, [2024-05-15T19:35:07.761151 #598486] INFO -- : [170/885] 639393=test_rdoc_markup_verbatim I, [2024-05-15T19:35:07.769788 #598486] INFO -- : [171/885] 639393=test_date_conv I, [2024-05-15T19:35:07.784650 #598486] INFO -- : [172/885] 639393=test_gem_resolver_index_specification I, [2024-05-15T19:35:07.848360 #598486] INFO -- : [173/885] 639393=test_serialize_subclasses I, [2024-05-15T19:35:07.862448 #598486] INFO -- : [174/885] 639393=test_frozen I, [2024-05-15T19:35:07.972799 #598486] INFO -- : [175/885] 639393=test_egrep_cpp I, [2024-05-15T19:35:08.030098 #598486] INFO -- : [176/885] 639393=test_tree_builder I, [2024-05-15T19:35:08.043431 #598486] INFO -- : [177/885] 639393=test_protect I, [2024-05-15T19:35:08.127853 #598486] INFO -- : [178/885] 639393=test_gem_commands_update_command I, [2024-05-15T19:35:09.508654 #598486] INFO -- : [179/885] 639391=test_date I, [2024-05-15T19:35:09.515507 #598486] INFO -- : [180/885] 639391=test_big5 I, [2024-05-15T19:35:09.531107 #598486] INFO -- : [181/885] 639391=test_fnmatch I, [2024-05-15T19:35:09.562349 #598486] INFO -- : [182/885] 639391=test_pathname I, [2024-05-15T19:35:09.705393 #598486] INFO -- : [183/885] 639393=test_rdoc_markup_pre_process I, [2024-05-15T19:35:09.796636 #598486] INFO -- : [184/885] 639393=test_store I, [2024-05-15T19:35:09.818678 #598486] INFO -- : [185/885] 639391=test_http_request I, [2024-05-15T19:35:09.935434 #598486] INFO -- : [186/885] 639391=test_tempfile I, [2024-05-15T19:35:10.169181 #598486] INFO -- : [187/885] 639393=test_coverage I, [2024-05-15T19:35:10.204851 #598486] INFO -- : [188/885] 639391=test_string I, [2024-05-15T19:35:10.233069 #598486] INFO -- : [189/885] 639391=json_common_interface_test I, [2024-05-15T19:35:10.268700 #598486] INFO -- : [190/885] 639391=test_rdoc_any_method I, [2024-05-15T19:35:10.681360 #598486] INFO -- : [191/885] 639391=test_error_highlight I, [2024-05-15T19:35:10.861235 #598486] INFO -- : [192/885] 639393=test_function_entry I, [2024-05-15T19:35:10.863930 #598486] INFO -- : [193/885] 639393=test_complexrational I, [2024-05-15T19:35:10.869555 #598486] INFO -- : [194/885] 639393=test_raise I, [2024-05-15T19:35:10.871138 #598486] INFO -- : [195/885] 639393=version_test I, [2024-05-15T19:35:10.960871 #598486] INFO -- : [196/885] 639393=test_files_lib I, [2024-05-15T19:35:10.960956 #598486] INFO -- : [197/885] 639393=test_string_memory I, [2024-05-15T19:35:11.063683 #598486] INFO -- : [198/885] 639393=test_help I, [2024-05-15T19:35:11.069443 #598486] INFO -- : [199/885] 639393=test_enumerator_kw I, [2024-05-15T19:35:11.073535 #598486] INFO -- : [200/885] 639393=reflection_test I, [2024-05-15T19:35:11.084071 #598486] INFO -- : [201/885] 639393=test_line_editor I, [2024-05-15T19:35:11.092659 #598486] INFO -- : [202/885] 639393=test_marshalable I, [2024-05-15T19:35:11.097150 #598486] INFO -- : [203/885] 639393=test_gem_commands_yank_command I, [2024-05-15T19:35:11.109480 #598486] INFO -- : [204/885] 639391=test_yaml_tree I, [2024-05-15T19:35:11.226955 #598486] INFO -- : [205/885] 639391=test_cstr I, [2024-05-15T19:35:11.632058 #598486] INFO -- : [206/885] 639393=test_gem_resolver_dependency_request I, [2024-05-15T19:35:11.659361 #598486] INFO -- : [207/885] 639393=test_euc_tw I, [2024-05-15T19:35:11.671002 #598486] INFO -- : [208/885] 639393=test_command I, [2024-05-15T19:35:11.911202 #598486] INFO -- : [209/885] 639393=test_big2str I, [2024-05-15T19:35:11.918947 #598486] INFO -- : [210/885] 639393=test_gem_resolver_specification I, [2024-05-15T19:35:11.953278 #598486] INFO -- : [211/885] 639393=test_logger I, [2024-05-15T19:35:11.993822 #598486] INFO -- : [212/885] 639393=test_pkey_dsa I, [2024-05-15T19:35:12.069670 #598486] INFO -- : [213/885] 639391=test_wait I, [2024-05-15T19:35:12.130650 #598486] INFO -- : [214/885] 639391=test_human_typo I, [2024-05-15T19:35:12.187692 #598486] INFO -- : [215/885] 639391=test_import I, [2024-05-15T19:35:13.519730 #598486] INFO -- : [216/885] 639391=test_psych I, [2024-05-15T19:35:13.543320 #598486] INFO -- : [217/885] 639391=test_nil I, [2024-05-15T19:35:13.554431 #598486] INFO -- : [218/885] 639391=test_io_buffer I, [2024-05-15T19:35:13.600086 #598486] INFO -- : [219/885] 639391=test_ldap I, [2024-05-15T19:35:13.613165 #598486] INFO -- : [220/885] 639391=test_kdf I, [2024-05-15T19:35:13.696762 #598486] INFO -- : [221/885] 639391=test_thread_queue I, [2024-05-15T19:35:13.721296 #598486] INFO -- : [222/885] 639393=test_nowrite I, [2024-05-15T19:35:13.756682 #598486] INFO -- : [223/885] 639393=test_defined I, [2024-05-15T19:35:13.821665 #598486] INFO -- : [224/885] 639393=test_passing_block I, [2024-05-15T19:35:13.832318 #598486] INFO -- : [225/885] 639393=json_string_matching_test I, [2024-05-15T19:35:13.841887 #598486] INFO -- : [226/885] 639393=test_gem_config_file I, [2024-05-15T19:35:14.023722 #598486] INFO -- : [227/885] 639393=test_comparable I, [2024-05-15T19:35:14.029922 #598486] INFO -- : [228/885] 639393=test_rdoc_rdoc I, [2024-05-15T19:35:14.108732 #598486] INFO -- : [229/885] 639393=test_yjit_exit_locations I, [2024-05-15T19:35:14.111837 #598486] INFO -- : [230/885] 639393=test_type_completor I, [2024-05-15T19:35:14.126666 #598486] INFO -- : [231/885] 639393=test_rdoc_normal_module I, [2024-05-15T19:35:14.186577 #598486] INFO -- : [232/885] 639393=test_io_timeout I, [2024-05-15T19:35:14.201936 #598486] INFO -- : [233/885] 639393=test_rdoc_markdown_test I, [2024-05-15T19:35:15.176248 #598486] INFO -- : [234/885] 639393=test_parser_events I, [2024-05-15T19:35:15.244440 #598486] INFO -- : [235/885] 639393=test_filter I, [2024-05-15T19:35:15.410193 #598486] INFO -- : [236/885] 639393=test_pkcs12 I, [2024-05-15T19:35:15.970253 #598486] INFO -- : [237/885] 639393=test_koi8 I, [2024-05-15T19:35:15.978574 #598486] INFO -- : [238/885] 639393=test_json_tree I, [2024-05-15T19:35:16.029946 #598486] INFO -- : [239/885] 639393=test_gem_remote_fetcher I, [2024-05-15T19:35:17.972255 #598486] INFO -- : [240/885] 639393=test_argf I, [2024-05-15T19:35:18.503000 #598486] INFO -- : [241/885] 639391=test_yaml I, [2024-05-15T19:35:18.590080 #598486] INFO -- : [242/885] 639391=test_x509name I, [2024-05-15T19:35:18.602368 #598486] INFO -- : [243/885] 639391=test_gem_dependency I, [2024-05-15T19:35:18.768704 #598486] INFO -- : [244/885] 639391=test_cclass I, [2024-05-15T19:35:18.902727 #598486] INFO -- : [245/885] 639391=test_gem_uninstaller I, [2024-05-15T19:35:20.214631 #598486] INFO -- : [246/885] 639391=test_yjit I, [2024-05-15T19:35:20.230723 #598486] INFO -- : [247/885] 639391=test_method I, [2024-05-15T19:35:21.708359 #598486] INFO -- : [248/885] 639393=test_m17n I, [2024-05-15T19:35:21.788028 #598486] INFO -- : [249/885] 639393=test_rdoc_markup_to_rdoc I, [2024-05-15T19:35:21.834024 #598486] INFO -- : [250/885] 639393=test_case I, [2024-05-15T19:35:21.844788 #598486] INFO -- : [251/885] 639393=test_ractor I, [2024-05-15T19:35:21.859716 #598486] INFO -- : [252/885] 639393=test_severity I, [2024-05-15T19:35:21.865329 #598486] INFO -- : [253/885] 639393=test_str2big I, [2024-05-15T19:35:21.882644 #598486] INFO -- : [254/885] 639393=test_gem_package_tar_writer I, [2024-05-15T19:35:22.026983 #598486] INFO -- : [255/885] 639393=attribute_write_test I, [2024-05-15T19:35:22.076657 #598486] INFO -- : [256/885] 639393=test_http I, [2024-05-15T19:35:25.442887 #598486] INFO -- : [257/885] 639392=test_utf16 I, [2024-05-15T19:35:25.451325 #598486] INFO -- : [258/885] 639392=test_set I, [2024-05-15T19:35:25.456345 #598486] INFO -- : [259/885] 639392=test_win32ole I, [2024-05-15T19:35:25.460584 #598486] INFO -- : [260/885] 639392=test_internal_ivar I, [2024-05-15T19:35:25.471295 #598486] INFO -- : [261/885] 639392=desugar_compiler_test I, [2024-05-15T19:35:25.495206 #598486] INFO -- : [262/885] 639392=test_gem_source_local I, [2024-05-15T19:35:25.709309 #598486] INFO -- : [263/885] 639392=test_rendering I, [2024-05-15T19:35:25.726477 #598486] INFO -- : [264/885] 639392=test_gem_gemcutter_utilities I, [2024-05-15T19:35:25.900371 #598486] INFO -- : [265/885] 639391=test_rdoc_task I, [2024-05-15T19:35:25.910455 #598486] INFO -- : [266/885] 639391=test_gem_text I, [2024-05-15T19:35:25.991977 #598486] INFO -- : [267/885] 639391=test_settracefunc I, [2024-05-15T19:35:26.161632 #598486] INFO -- : [268/885] 639392=test_tracepoint I, [2024-05-15T19:35:26.482471 #598486] INFO -- : [269/885] 639392=test_backtrace I, [2024-05-15T19:35:26.895451 #598486] INFO -- : [270/885] 639391=test_gem_commands_push_command I, [2024-05-15T19:35:27.480615 #598486] INFO -- : [271/885] 639391=locals_test I, [2024-05-15T19:35:27.727376 #598486] INFO -- : [272/885] 639392=test_method_cache I, [2024-05-15T19:35:27.732650 #598486] INFO -- : [273/885] 639392=test_too_many_dummy_encodings I, [2024-05-15T19:35:27.790539 #598486] INFO -- : [274/885] 639392=test_sprintf_comb I, [2024-05-15T19:35:27.826371 #598486] INFO -- : [275/885] 639391=encoding_test I, [2024-05-15T19:35:27.901652 #598486] INFO -- : [276/885] 639391=test_gem_commands_specification_command I, [2024-05-15T19:35:27.980741 #598486] INFO -- : [277/885] 639392=test_scan_args I, [2024-05-15T19:35:28.001740 #598486] INFO -- : [278/885] 639392=test_gem_commands_which_command I, [2024-05-15T19:35:28.032115 #598486] INFO -- : [279/885] 639392=test_gem_request I, [2024-05-15T19:35:28.042618 #598486] INFO -- : [280/885] 639391=test_gem_package_old I, [2024-05-15T19:35:28.094446 #598486] INFO -- : [281/885] 639391=test_pty I, [2024-05-15T19:35:28.099463 #598486] INFO -- : Leaked file descriptor: TestPTY#test_open_with_block: 11 # I, [2024-05-15T19:35:28.120220 #598486] INFO -- : COMMAND PID USER FD TYPE DEVICE SIZE/OFF NODE NAME I, [2024-05-15T19:35:28.120285 #598486] INFO -- : ruby 639391 opc 11u unix 0x0000000000000000 0t0 2997068938 type=STREAM I, [2024-05-15T19:35:28.291804 #598486] INFO -- : [282/885] 639392=test_gem_dependency_installer I, [2024-05-15T19:35:28.623450 #598486] INFO -- : [283/885] 639391=test_http I, [2024-05-15T19:35:28.629084 #598486] INFO -- : [284/885] 639391=parser_test I, [2024-05-15T19:35:28.644106 #598486] INFO -- : [285/885] 639391=test_hash I, [2024-05-15T19:35:30.599792 #598486] INFO -- : [286/885] 639392=test_libs I, [2024-05-15T19:35:30.612799 #598486] INFO -- : [287/885] 639392=test_iso_8859 I, [2024-05-15T19:35:30.640123 #598486] INFO -- : [288/885] 639392=ripper_test I, [2024-05-15T19:35:30.668158 #598486] INFO -- : [289/885] 639393=test_math I, [2024-05-15T19:35:30.677093 #598486] INFO -- : [290/885] 639393=test_qsort I, [2024-05-15T19:35:30.686848 #598486] INFO -- : [291/885] 639393=comments_test I, [2024-05-15T19:35:30.689572 #598486] INFO -- : [292/885] 639393=test_gc I, [2024-05-15T19:35:30.691340 #598486] INFO -- : [293/885] 639393=test_safe_load I, [2024-05-15T19:35:30.700835 #598486] INFO -- : [294/885] 639393=test_sprintf I, [2024-05-15T19:35:30.922135 #598486] INFO -- : [295/885] 639393=test_class I, [2024-05-15T19:35:31.466682 #598486] INFO -- : [296/885] 639392=test_exit I, [2024-05-15T19:35:31.478331 #598486] INFO -- : [297/885] 639392=test_const I, [2024-05-15T19:35:31.483009 #598486] INFO -- : [298/885] 639392=index_write_test I, [2024-05-15T19:35:31.494465 #598486] INFO -- : [299/885] 639392=test_rdoc_parser_rd I, [2024-05-15T19:35:31.504926 #598486] INFO -- : [300/885] 639392=test_name_error I, [2024-05-15T19:35:31.587658 #598486] INFO -- : [301/885] 639392=test_gem_source_list I, [2024-05-15T19:35:31.659209 #598486] INFO -- : [302/885] 639392=json_addition_test I, [2024-05-15T19:35:31.679936 #598486] INFO -- : [303/885] 639392=test_gem_commands_sources_command I, [2024-05-15T19:35:31.874423 #598486] INFO -- : [304/885] 639392=test_yaml_special_cases I, [2024-05-15T19:35:31.882963 #598486] INFO -- : [305/885] 639392=test_recorder I, [2024-05-15T19:35:31.892598 #598486] INFO -- : [306/885] 639392=test_case I, [2024-05-15T19:35:32.009205 #598486] INFO -- : [307/885] 639392=test_open-uri I, [2024-05-15T19:35:32.436798 #598486] INFO -- : [308/885] 639392=test_enc_associate I, [2024-05-15T19:35:32.569064 #598486] INFO -- : [309/885] 639391=test_enumerator I, [2024-05-15T19:35:32.897835 #598486] INFO -- : [310/885] 639392=test_gem_command_manager I, [2024-05-15T19:35:33.121835 #598486] INFO -- : [311/885] 639392=test_rdoc_context I, [2024-05-15T19:35:33.904202 #598486] INFO -- : [312/885] 639392=test_array I, [2024-05-15T19:35:33.913946 #598486] INFO -- : [313/885] 639392=test_rdoc_generator_json_index I, [2024-05-15T19:35:33.945238 #598486] INFO -- : [314/885] 639392=test_date_time I, [2024-05-15T19:35:33.953362 #598486] INFO -- : [315/885] 639392=test_nil2vtempty I, [2024-05-15T19:35:33.955215 #598486] INFO -- : [316/885] 639392=test_framework I, [2024-05-15T19:35:33.960732 #598486] INFO -- : [317/885] 639392=test_coderange I, [2024-05-15T19:35:34.028903 #598486] INFO -- : [318/885] 639392=test_weakmap I, [2024-05-15T19:35:35.041725 #598486] INFO -- : [319/885] 639393=test_ansi_with_terminfo I, [2024-05-15T19:35:35.053266 #598486] INFO -- : [320/885] 639393=test_inadvertent_creation I, [2024-05-15T19:35:35.159095 #598486] INFO -- : [321/885] 639393=test_cgi_tag_helper I, [2024-05-15T19:35:35.203824 #598486] INFO -- : [322/885] 639393=test_pack I, [2024-05-15T19:35:35.244958 #598486] INFO -- : [323/885] 639393=test_pinned I, [2024-05-15T19:35:35.291608 #598486] INFO -- : [324/885] 639393=test_face I, [2024-05-15T19:35:35.322699 #598486] INFO -- : [325/885] 639393=test_gem_request_set_lockfile_parser I, [2024-05-15T19:35:35.446868 #598486] INFO -- : [326/885] 639393=test_date_attr I, [2024-05-15T19:35:36.515255 #598486] INFO -- : [327/885] 639393=test_sizeof I, [2024-05-15T19:35:38.047058 #598486] INFO -- : [328/885] 639393=test_stringchar I, [2024-05-15T19:35:38.057976 #598486] INFO -- : [329/885] 639393=warnings_test I, [2024-05-15T19:35:38.080161 #598486] INFO -- : [330/885] 639393=test_econv I, [2024-05-15T19:35:38.998848 #598486] INFO -- : [331/885] 639393=test_gem_install_update_options I, [2024-05-15T19:35:39.135770 #598486] INFO -- : [332/885] 639393=test_jaro_winkler I, [2024-05-15T19:35:39.144382 #598486] INFO -- : [333/885] 639393=test_cp949 I, [2024-05-15T19:35:39.148972 #598486] INFO -- : [334/885] 639393=test_condition I, [2024-05-15T19:35:39.158751 #598486] INFO -- : [335/885] 639393=test_gem_resolver_vendor_set I, [2024-05-15T19:35:39.187648 #598486] INFO -- : [336/885] 639393=test_gem_dependency_resolution_error I, [2024-05-15T19:35:39.210213 #598486] INFO -- : [337/885] 639393=test_fileutils I, [2024-05-15T19:35:39.706197 #598486] INFO -- : [338/885] 639393=test_mixed_unicode_escapes I, [2024-05-15T19:35:41.300237 #598486] INFO -- : [339/885] 639393=test_sleep I, [2024-05-15T19:35:41.385684 #598486] INFO -- : [340/885] 639392=test_emoji I, [2024-05-15T19:35:41.478875 #598486] INFO -- : [341/885] 639392=test_sorted_set I, [2024-05-15T19:35:41.713473 #598486] INFO -- : [342/885] 639392=test_stack I, [2024-05-15T19:35:41.765528 #598486] INFO -- : [343/885] 639393=test_windows_1252 I, [2024-05-15T19:35:41.771197 #598486] INFO -- : [344/885] 639393=test_win32ole_variable I, [2024-05-15T19:35:41.772902 #598486] INFO -- : [345/885] 639393=test_method_cache I, [2024-05-15T19:35:41.790354 #598486] INFO -- : [346/885] 639393=test_rdoc_class_module I, [2024-05-15T19:35:42.321803 #598486] INFO -- : [347/885] 639393=test_rdoc_cross_reference I, [2024-05-15T19:35:42.680674 #598486] INFO -- : [348/885] 639392=test_parse I, [2024-05-15T19:35:42.751167 #598486] INFO -- : [349/885] 639393=test_gem_specification I, [2024-05-15T19:35:43.211937 #598486] INFO -- : [350/885] 639392=test_flush I, [2024-05-15T19:35:43.270882 #598486] INFO -- : [351/885] 639392=test_pkey_rsa I, [2024-05-15T19:35:43.504277 #598486] INFO -- : [352/885] 639392=test_system I, [2024-05-15T19:35:44.387452 #598486] INFO -- : [353/885] 639392=test_numhash I, [2024-05-15T19:35:44.388395 #598486] INFO -- : [354/885] 639392=test_verbose I, [2024-05-15T19:35:44.438704 #598486] INFO -- : [355/885] 639392=test_gem_commands_open_command I, [2024-05-15T19:35:44.543618 #598486] INFO -- : [356/885] 639392=test_emoji_breaks I, [2024-05-15T19:35:44.545946 #598486] INFO -- : [357/885] 639392=test_normalize I, [2024-05-15T19:35:44.557333 #598486] INFO -- : [358/885] 639392=test_gem_update_suggestion I, [2024-05-15T19:35:44.644204 #598486] INFO -- : [359/885] 639392=test_assignment I, [2024-05-15T19:35:45.121939 #598486] INFO -- : [360/885] 639393=test_undef I, [2024-05-15T19:35:45.132179 #598486] INFO -- : [361/885] 639393=test_gem_resolver_lock_set I, [2024-05-15T19:35:45.152655 #598486] INFO -- : [362/885] 639393=test_random I, [2024-05-15T19:35:45.195198 #598486] INFO -- : [363/885] 639393=test_rdoc_generator_darkfish I, [2024-05-15T19:35:45.517368 #598486] INFO -- : [364/885] 639393=test_gem_command I, [2024-05-15T19:35:45.633112 #598486] INFO -- : [365/885] 639393=test_asn1 I, [2024-05-15T19:35:45.655644 #598486] INFO -- : [366/885] 639393=test_gem_impossible_dependencies_error I, [2024-05-15T19:35:45.665047 #598486] INFO -- : [367/885] 639393=test_pp I, [2024-05-15T19:35:45.728250 #598486] INFO -- : [368/885] 639393=memsize_test I, [2024-05-15T19:35:45.736861 #598486] INFO -- : [369/885] 639393=test_gem_resolver_requirement_list I, [2024-05-15T19:35:45.816764 #598486] INFO -- : [370/885] 639393=test_noarg I, [2024-05-15T19:35:46.049078 #598486] INFO -- : [371/885] 639393=test_raise_exception I, [2024-05-15T19:35:46.111683 #598486] INFO -- : [372/885] 639392=test_arith_seq_beg_len_step I, [2024-05-15T19:35:46.121593 #598486] INFO -- : [373/885] 639392=test_exception I, [2024-05-15T19:35:46.132368 #598486] INFO -- : [374/885] 639392=test_basicinstructions I, [2024-05-15T19:35:46.202988 #598486] INFO -- : [375/885] 639392=test_gem_resolver_git_specification I, [2024-05-15T19:35:46.485091 #598486] INFO -- : [376/885] 639392=test_utf32 I, [2024-05-15T19:35:46.512032 #598486] INFO -- : [377/885] 639392=test_key_actor_emacs I, [2024-05-15T19:35:46.603705 #598486] INFO -- : [378/885] 639392=test_gem_security I, [2024-05-15T19:35:46.632961 #598486] INFO -- : [379/885] 639393=test_erb I, [2024-05-15T19:35:46.911722 #598486] INFO -- : [380/885] 639393=test_date_ractor I, [2024-05-15T19:35:46.918730 #598486] INFO -- : [381/885] 639393=test_variable I, [2024-05-15T19:35:47.015827 #598486] INFO -- : [382/885] 639393=test_hash I, [2024-05-15T19:35:47.035970 #598486] INFO -- : [383/885] 639393=test_rdoc_tom_doc I, [2024-05-15T19:35:47.118818 #598486] INFO -- : [384/885] 639393=test_gem_commands_pristine_command I, [2024-05-15T19:35:48.552677 #598486] INFO -- : [385/885] 639393=test_optarg I, [2024-05-15T19:35:48.567871 #598486] INFO -- : [386/885] 639393=test_iterator I, [2024-05-15T19:35:48.651695 #598486] INFO -- : [387/885] 639393=test_string I, [2024-05-15T19:35:48.670220 #598486] INFO -- : [388/885] 639393=test_gem_commands_install_command I, [2024-05-15T19:35:50.539531 #598486] INFO -- : [389/885] 639393=test_rendering I, [2024-05-15T19:35:50.586939 #598486] INFO -- : [390/885] 639393=test_kernel I, [2024-05-15T19:35:51.178383 #598486] INFO -- : [391/885] 639393=pattern_test I, [2024-05-15T19:35:51.202610 #598486] INFO -- : [392/885] 639393=test_dot_dot I, [2024-05-15T19:35:51.220065 #598486] INFO -- : [393/885] 639393=test_gem_rdoc I, [2024-05-15T19:35:51.416646 #598486] INFO -- : [394/885] 639393=test_did_you_mean I, [2024-05-15T19:35:51.425966 #598486] INFO -- : [395/885] 639393=test_shapes I, [2024-05-15T19:35:51.434395 #598486] INFO -- : [396/885] 639393=test_cesu8 I, [2024-05-15T19:35:51.448308 #598486] INFO -- : [397/885] 639393=test_rdoc_extend I, [2024-05-15T19:35:51.464761 #598486] INFO -- : [398/885] 639393=test_storage I, [2024-05-15T19:35:51.470679 #598486] INFO -- : [399/885] 639393=test_err_in_callback I, [2024-05-15T19:35:51.487691 #598486] INFO -- : [400/885] 639393=test_method_name_check I, [2024-05-15T19:35:51.537070 #598486] INFO -- : [401/885] 639393=test_merge_keys I, [2024-05-15T19:35:51.543450 #598486] INFO -- : [402/885] 639393=test_array_create I, [2024-05-15T19:35:51.653362 #598486] INFO -- : [403/885] 639393=test_dir_m17n I, [2024-05-15T19:35:52.791926 #598486] INFO -- : [404/885] 639393=test_memory_view I, [2024-05-15T19:35:52.935094 #598486] INFO -- : [405/885] 639392=test_threadgroup I, [2024-05-15T19:35:52.947758 #598486] INFO -- : [406/885] 639391=test_complex I, [2024-05-15T19:35:53.023976 #598486] INFO -- : [407/885] 639391=!Nothing_to_test I, [2024-05-15T19:35:53.025407 #598486] INFO -- : [408/885] 639391=test_fd_setsize I, [2024-05-15T19:35:53.033566 #598486] INFO -- : [409/885] 639391=test_forwardable I, [2024-05-15T19:35:53.051248 #598486] INFO -- : [410/885] 639391=test_process I, [2024-05-15T19:35:53.112434 #598486] INFO -- : [411/885] 639391=test_key_event_record I, [2024-05-15T19:35:53.157980 #598486] INFO -- : [412/885] 639393=test_open3 I, [2024-05-15T19:35:53.162331 #598486] INFO -- : [413/885] 639391=test_mdns I, [2024-05-15T19:35:53.173913 #598486] INFO -- : [414/885] 639391=test_date_parse I, [2024-05-15T19:35:53.286937 #598486] INFO -- : [415/885] 639391=test_arity I, [2024-05-15T19:35:53.290196 #598486] INFO -- : [416/885] 639391=test_thread I, [2024-05-15T19:35:53.295179 #598486] INFO -- : [417/885] 639391=test_buffering I, [2024-05-15T19:35:53.300632 #598486] INFO -- : [418/885] 639391=test_svcb_https I, [2024-05-15T19:35:53.305385 #598486] INFO -- : [419/885] 639391=test_pkey_ec I, [2024-05-15T19:35:53.339091 #598486] INFO -- : [420/885] 639391=test_rational I, [2024-05-15T19:35:53.360665 #598486] INFO -- : [421/885] 639391=test_case_mapping I, [2024-05-15T19:35:53.380061 #598486] INFO -- : [422/885] 639391=test_gem_ext_cargo_builder_unit I, [2024-05-15T19:35:53.407667 #598486] INFO -- : [423/885] 639391=test_ractor I, [2024-05-15T19:35:53.413793 #598486] INFO -- : [424/885] 639391=test_rdoc_rubygems_hook I, [2024-05-15T19:35:53.509519 #598486] INFO -- : [425/885] 639391=test_gem_resolver_api_specification I, [2024-05-15T19:35:53.568886 #598486] INFO -- : [426/885] 639391=test_webauthn_listener I, [2024-05-15T19:35:53.630448 #598486] INFO -- : [427/885] 639391=test_enumerable I, [2024-05-15T19:35:53.644477 #598486] INFO -- : [428/885] 639391=test_rdoc_method_attr I, [2024-05-15T19:35:53.786795 #598486] INFO -- : [429/885] 639391=test_set I, [2024-05-15T19:35:53.836693 #598486] INFO -- : [430/885] 639391=test_tree_spell_checker I, [2024-05-15T19:35:53.895485 #598486] INFO -- : [431/885] 639391=static_literals_test I, [2024-05-15T19:35:53.897400 #598486] INFO -- : [432/885] 639391=test_hash_create I, [2024-05-15T19:35:53.903102 #598486] INFO -- : [433/885] 639391=test_grapheme_breaks I, [2024-05-15T19:35:53.923822 #598486] INFO -- : [434/885] 639391=test_yamldbm I, [2024-05-15T19:35:53.940551 #598486] INFO -- : [435/885] 639391=test_gem_spec_fetcher I, [2024-05-15T19:35:53.963591 #598486] INFO -- : [436/885] 639392=test_unicode_escape I, [2024-05-15T19:35:54.201626 #598486] INFO -- : [437/885] 639391=test_switch_hitter I, [2024-05-15T19:35:54.203930 #598486] INFO -- : [438/885] 639392=test_default_gems I, [2024-05-15T19:35:54.216731 #598486] INFO -- : [439/885] 639391=test_backtrace I, [2024-05-15T19:35:54.227239 #598486] INFO -- : [440/885] 639391=test_gbk I, [2024-05-15T19:35:54.242221 #598486] INFO -- : [441/885] 639391=test_gem_commands_dependency_command I, [2024-05-15T19:35:54.260270 #598486] INFO -- : [442/885] 639392=test_gem_uri_formatter I, [2024-05-15T19:35:54.279823 #598486] INFO -- : [443/885] 639392=test_prettyprint I, [2024-05-15T19:35:54.316043 #598486] INFO -- : [444/885] 639392=test_ole_methods I, [2024-05-15T19:35:54.318061 #598486] INFO -- : [445/885] 639392=test_cgi_util I, [2024-05-15T19:35:54.329900 #598486] INFO -- : [446/885] 639391=test_clone I, [2024-05-15T19:35:54.503679 #598486] INFO -- : [447/885] 639391=test_enc_raise I, [2024-05-15T19:35:54.509824 #598486] INFO -- : [448/885] 639391=test_queue I, [2024-05-15T19:35:54.520249 #598486] INFO -- : [449/885] 639391=test_gem_resolver_lock_specification I, [2024-05-15T19:35:54.566194 #598486] INFO -- : [450/885] 639392=test_boolean I, [2024-05-15T19:35:54.567127 #598486] INFO -- : [451/885] 639391=test_rdoc_i18n_locale I, [2024-05-15T19:35:54.580562 #598486] INFO -- : [452/885] 639392=test_gc_compact I, [2024-05-15T19:35:54.601277 #598486] INFO -- : [453/885] 639391=test_dryrun I, [2024-05-15T19:35:54.626917 #598486] INFO -- : [454/885] 639391=regexp_test I, [2024-05-15T19:35:54.642398 #598486] INFO -- : [455/885] 639391=test_yield I, [2024-05-15T19:35:55.879877 #598486] INFO -- : [456/885] 639393=test_show_source I, [2024-05-15T19:35:55.889193 #598486] INFO -- : [457/885] 639393=test_remote_fetch_error I, [2024-05-15T19:35:55.908350 #598486] INFO -- : [458/885] 639393=test_rdoc_stats I, [2024-05-15T19:35:55.987440 #598486] INFO -- : [459/885] 639393=test_files_sample I, [2024-05-15T19:35:56.062128 #598486] INFO -- : [460/885] 639393=test_data_error I, [2024-05-15T19:35:56.077650 #598486] INFO -- : [461/885] 639393=test_rubyoptions I, [2024-05-15T19:35:57.706189 #598486] INFO -- : [462/885] 639392=test_force_exit I, [2024-05-15T19:35:57.716685 #598486] INFO -- : [463/885] 639392=test_optimization I, [2024-05-15T19:35:57.722663 #598486] INFO -- : [464/885] 639391=test_shift_jis I, [2024-05-15T19:35:57.750733 #598486] INFO -- : [465/885] 639391=test_rdoc_store I, [2024-05-15T19:35:58.428211 #598486] INFO -- : [466/885] 639391=test_require I, [2024-05-15T19:36:01.142040 #598486] INFO -- : [467/885] 639391=test_objectspace I, [2024-05-15T19:36:02.129803 #598486] INFO -- : [468/885] 639391=test_debugger_integration I, [2024-05-15T19:36:02.139641 #598486] INFO -- : [469/885] 639391=test_gem_resolver_composed_set I, [2024-05-15T19:36:02.156258 #598486] INFO -- : [470/885] 639391=test_my_integer I, [2024-05-15T19:36:02.203748 #598486] INFO -- : [471/885] 639391=test_tracer I, [2024-05-15T19:36:02.205054 #598486] INFO -- : [472/885] 639391=test_cgi_cookie I, [2024-05-15T19:36:02.221953 #598486] INFO -- : [473/885] 639391=test_not I, [2024-05-15T19:36:02.256817 #598486] INFO -- : [474/885] 639391=test_option I, [2024-05-15T19:36:02.350128 #598486] INFO -- : [475/885] 639391=test_wss I, [2024-05-15T19:36:02.361909 #598486] INFO -- : [476/885] 639391=test_rdoc_markup_attribute_manager I, [2024-05-15T19:36:02.423410 #598486] INFO -- : [477/885] 639391=test_rdoc_rd_block_parser I, [2024-05-15T19:36:02.543760 #598486] INFO -- : [478/885] 639391=test_x509store I, [2024-05-15T19:36:02.937093 #598486] INFO -- : [479/885] 639393=test_rdoc_rd I, [2024-05-15T19:36:02.943106 #598486] INFO -- : [480/885] 639393=test_rdoc_generator_pot I, [2024-05-15T19:36:02.948689 #598486] INFO -- : [481/885] 639393=test_rdoc_markup_to_joined_paragraph I, [2024-05-15T19:36:02.957462 #598486] INFO -- : [482/885] 639393=test_rdoc_markup_to_markdown I, [2024-05-15T19:36:02.958338 #598486] INFO -- : [483/885] 639391=test_require_lib I, [2024-05-15T19:36:03.033570 #598486] INFO -- : [484/885] 639393=test_gem_gem_runner I, [2024-05-15T19:36:03.082317 #598486] INFO -- : [485/885] 639393=test_metaclass I, [2024-05-15T19:36:03.087883 #598486] INFO -- : [486/885] 639393=test_win32ole_type I, [2024-05-15T19:36:03.097044 #598486] INFO -- : [487/885] 639393=test_rdoc_rd_inline_parser I, [2024-05-15T19:36:03.120280 #598486] INFO -- : [488/885] 639393=test_load I, [2024-05-15T19:36:03.135954 #598486] INFO -- : [489/885] 639393=test_gem_source_lock I, [2024-05-15T19:36:03.195183 #598486] INFO -- : [490/885] 639393=test_cipher I, [2024-05-15T19:36:03.221068 #598486] INFO -- : [491/885] 639393=test_update I, [2024-05-15T19:36:03.222084 #598486] INFO -- : [492/885] 639393=test_new I, [2024-05-15T19:36:03.237769 #598486] INFO -- : [493/885] 639393=test_config I, [2024-05-15T19:36:03.302921 #598486] INFO -- : [494/885] 639393=test_ostruct I, [2024-05-15T19:36:03.412570 #598486] INFO -- : [495/885] 639393=test_depth_first I, [2024-05-15T19:36:03.415869 #598486] INFO -- : [496/885] 639393=test_change_word I, [2024-05-15T19:36:03.427947 #598486] INFO -- : [497/885] 639393=test_rdoc_parser_markdown I, [2024-05-15T19:36:03.440827 #598486] INFO -- : [498/885] 639393=test_custom_command I, [2024-05-15T19:36:03.450000 #598486] INFO -- : [499/885] 639393=fuzzer_test I, [2024-05-15T19:36:03.468324 #598486] INFO -- : [500/885] 639393=test_rubyvm I, [2024-05-15T19:36:03.518083 #598486] INFO -- : [501/885] 639393=test_cparser I, [2024-05-15T19:36:04.448072 #598486] INFO -- : [502/885] 639392=test_struct I, [2024-05-15T19:36:04.456303 #598486] INFO -- : [503/885] 639392=static_inspect_test I, [2024-05-15T19:36:04.476939 #598486] INFO -- : [504/885] 639392=test_c_struct_entry I, [2024-05-15T19:36:05.141699 #598486] INFO -- : [505/885] 639392=test_gem_package_task I, [2024-05-15T19:36:05.147484 #598486] INFO -- : [506/885] 639392=test_lock_native_thread I, [2024-05-15T19:36:05.159213 #598486] INFO -- : [507/885] 639393=test_resize I, [2024-05-15T19:36:05.165079 #598486] INFO -- : [508/885] 639393=test_key_error I, [2024-05-15T19:36:05.170487 #598486] INFO -- : [509/885] 639393=test_win32ole_param I, [2024-05-15T19:36:05.230068 #598486] INFO -- : [510/885] 639393=test_engine I, [2024-05-15T19:36:05.403399 #598486] INFO -- : [511/885] 639392=test_gem_commands_mirror I, [2024-05-15T19:36:05.411273 #598486] INFO -- : [512/885] 639392=test_fiber I, [2024-05-15T19:36:05.684642 #598486] INFO -- : [513/885] 639393=test_gem_security_trust_dir I, [2024-05-15T19:36:05.756600 #598486] INFO -- : [514/885] 639393=test_erb_command I, [2024-05-15T19:36:05.804800 #598486] INFO -- : [515/885] 639393=test_module I, [2024-05-15T19:36:06.023696 #598486] INFO -- : [516/885] 639391=test_usrmarshal I, [2024-05-15T19:36:06.217227 #598486] INFO -- : [517/885] 639391=test_gem_source_installed I, [2024-05-15T19:36:06.228315 #598486] INFO -- : [518/885] 639391=test_gem_validator I, [2024-05-15T19:36:06.293506 #598486] INFO -- : [519/885] 639391=test_abi I, [2024-05-15T19:36:06.395356 #598486] INFO -- : [520/885] 639391=test_load I, [2024-05-15T19:36:06.398748 #598486] INFO -- : Leaked file descriptor: TestOptionParserLoad#test_load_nothing: 10 # I, [2024-05-15T19:36:06.425809 #598486] INFO -- : COMMAND PID USER FD TYPE DEVICE SIZE/OFF NODE NAME I, [2024-05-15T19:36:06.425870 #598486] INFO -- : ruby 639391 opc 10r REG 252,0 9253600 13705411 /var/lib/sss/mc/passwd I, [2024-05-15T19:36:06.482509 #598486] INFO -- : [521/885] 639391=test_integer_comb I, [2024-05-15T19:36:09.149749 #598486] INFO -- : [522/885] 639391=test_bundled_ca I, [2024-05-15T19:36:09.263423 #598486] INFO -- : [523/885] 639393=test_ssl I, [2024-05-15T19:36:11.266929 #598486] INFO -- : [524/885] 639391=test_mutex I, [2024-05-15T19:36:11.574427 #598486] INFO -- : [525/885] 639392=test_rdoc_token_stream I, [2024-05-15T19:36:11.582258 #598486] INFO -- : [526/885] 639392=heredoc_dedent_test I, [2024-05-15T19:36:11.590993 #598486] INFO -- : [527/885] 639392=test_type I, [2024-05-15T19:36:11.598213 #598486] INFO -- : [528/885] 639392=test_tmpdir I, [2024-05-15T19:36:11.669792 #598486] INFO -- : [529/885] 639392=test_struct I, [2024-05-15T19:36:12.174666 #598486] INFO -- : [530/885] 639392=test_dup I, [2024-05-15T19:36:12.323189 #598486] INFO -- : [531/885] 639392=test_rdoc_single_class I, [2024-05-15T19:36:12.357894 #598486] INFO -- : [532/885] 639392=test_acceptable I, [2024-05-15T19:36:12.368746 #598486] INFO -- : [533/885] 639391=test_gem_ext_cargo_builder_link_flag_converter I, [2024-05-15T19:36:12.388956 #598486] INFO -- : [534/885] 639392=test_gem_local_remote_options I, [2024-05-15T19:36:12.430258 #598486] INFO -- : [535/885] 639391=test_gem_safe_marshal I, [2024-05-15T19:36:12.485822 #598486] INFO -- : [536/885] 639392=test_rdoc_ri_driver I, [2024-05-15T19:36:12.867179 #598486] INFO -- : [537/885] 639392=test_httpheader I, [2024-05-15T19:36:12.887118 #598486] INFO -- : [538/885] 639392=test_sexp I, [2024-05-15T19:36:12.919491 #598486] INFO -- : [539/885] 639392=test_ractor I, [2024-05-15T19:36:12.975077 #598486] INFO -- : [540/885] 639392=test_gem_resolver_git_set I, [2024-05-15T19:36:13.198652 #598486] INFO -- : [541/885] 639391=test_gem_commands_check_command I, [2024-05-15T19:36:13.272411 #598486] INFO -- : [542/885] 639391=test_signedness I, [2024-05-15T19:36:13.743777 #598486] INFO -- : [543/885] 639392=test_digest I, [2024-05-15T19:36:14.559058 #598486] INFO -- : [544/885] 639392=test_ractor I, [2024-05-15T19:36:14.687157 #598486] INFO -- : [545/885] 639392=test_exception_at_throwing I, [2024-05-15T19:36:14.731320 #598486] INFO -- : [546/885] 639392=test_gem_resolver_installed_specification I, [2024-05-15T19:36:14.755362 #598486] INFO -- : [547/885] 639392=test_stringscanner I, [2024-05-15T19:36:14.885610 #598486] INFO -- : [548/885] 639392=test_fiddle I, [2024-05-15T19:36:15.030509 #598486] INFO -- : [549/885] 639392=json_generic_object_test I, [2024-05-15T19:36:15.045066 #598486] INFO -- : [550/885] 639392=test_gem_resolver_vendor_specification I, [2024-05-15T19:36:15.064743 #598486] INFO -- : [551/885] 639392=test_date_arith I, [2024-05-15T19:36:15.076454 #598486] INFO -- : [552/885] 639391=test_irb I, [2024-05-15T19:36:15.100241 #598486] INFO -- : [553/885] 639392=test_x509cert I, [2024-05-15T19:36:15.179605 #598486] INFO -- : [554/885] 639392=test_rdoc_markup_paragraph I, [2024-05-15T19:36:15.184338 #598486] INFO -- : [555/885] 639392=test_require_path_check I, [2024-05-15T19:36:15.348827 #598486] INFO -- : [556/885] 639391=test_variable_name_check I, [2024-05-15T19:36:15.356554 #598486] INFO -- : [557/885] 639392=test_bn I, [2024-05-15T19:36:15.385333 #598486] INFO -- : [558/885] 639392=test_logdevice I, [2024-05-15T19:36:15.484095 #598486] INFO -- : [559/885] 639391=test_ast I, [2024-05-15T19:36:16.330172 #598486] INFO -- : [560/885] 639392=test_rdoc_markup_to_ansi I, [2024-05-15T19:36:16.376712 #598486] INFO -- : [561/885] 639392=test_files_test I, [2024-05-15T19:36:16.438735 #598486] INFO -- : [562/885] 639392=test_weakkeymap I, [2024-05-15T19:36:17.286151 #598486] INFO -- : [563/885] 639392=test_evaluation I, [2024-05-15T19:36:17.294415 #598486] INFO -- : [564/885] 639392=test_protocol I, [2024-05-15T19:36:17.604736 #598486] INFO -- : [565/885] 639392=test_gem_commands_info_command I, [2024-05-15T19:36:17.632428 #598486] INFO -- : [566/885] 639392=test_https I, [2024-05-15T19:36:18.057990 #598486] INFO -- : [567/885] 639392=test_object_create_start I, [2024-05-15T19:36:18.066957 #598486] INFO -- : [568/885] 639392=test_gem_request_set_gem_dependency_api I, [2024-05-15T19:36:18.391373 #598486] INFO -- : [569/885] 639392=test_name_error_extension I, [2024-05-15T19:36:18.417312 #598486] INFO -- : [570/885] 639392=test_file_exhaustive I, [2024-05-15T19:36:19.394106 #598486] INFO -- : Leaked file descriptor: TestFileExhaustive#test_expand_path_home: 10 # I, [2024-05-15T19:36:19.394182 #598486] INFO -- : Leaked file descriptor: TestFileExhaustive#test_expand_path_home: 11 # I, [2024-05-15T19:36:19.422649 #598486] INFO -- : COMMAND PID USER FD TYPE DEVICE SIZE/OFF NODE NAME I, [2024-05-15T19:36:19.422683 #598486] INFO -- : ruby 639392 opc 10r REG 252,0 9253600 13705411 /var/lib/sss/mc/passwd I, [2024-05-15T19:36:19.422694 #598486] INFO -- : ruby 639392 opc 11u unix 0x0000000000000000 0t0 2997078766 type=STREAM I, [2024-05-15T19:36:19.942128 #598486] INFO -- : [571/885] 639393=test_completion I, [2024-05-15T19:36:20.592899 #598486] INFO -- : [572/885] 639393=test_handle I, [2024-05-15T19:36:21.405445 #598486] INFO -- : [573/885] 639393=parse_stream_test I, [2024-05-15T19:36:21.407707 #598486] INFO -- : [574/885] 639393=test_gem_security_policy I, [2024-05-15T19:36:21.798787 #598486] INFO -- : [575/885] 639393=test_rdoc_markup_document I, [2024-05-15T19:36:21.819729 #598486] INFO -- : [576/885] 639393=test_delete I, [2024-05-15T19:36:21.820716 #598486] INFO -- : [577/885] 639393=test_io_wait_uncommon I, [2024-05-15T19:36:21.845577 #598486] INFO -- : [578/885] 639393=test_gem_ci_detector I, [2024-05-15T19:36:21.850997 #598486] INFO -- : [579/885] 639393=test_fixnum I, [2024-05-15T19:36:21.867762 #598486] INFO -- : [580/885] 639393=test_gem_silent_ui I, [2024-05-15T19:36:21.929082 #598486] INFO -- : [581/885] 639393=test_signal I, [2024-05-15T19:36:23.937185 #598486] INFO -- : [582/885] 639393=test_continuation I, [2024-05-15T19:36:23.945965 #598486] INFO -- : [583/885] 639393=test_ssl_session I, [2024-05-15T19:36:24.798993 #598486] INFO -- : [584/885] 639393=test_gem_package_tar_header I, [2024-05-15T19:36:24.915719 #598486] INFO -- : [585/885] 639393=test_rational2 I, [2024-05-15T19:36:24.921720 #598486] INFO -- : [586/885] 639393=test_logperiod I, [2024-05-15T19:36:25.096091 #598486] INFO -- : [587/885] 639393=test_case_comprehensive I, [2024-05-15T19:36:27.964469 #598486] INFO -- : [588/885] 639392=test_placearg I, [2024-05-15T19:36:28.023009 #598486] INFO -- : [589/885] 639392=test_iseq I, [2024-05-15T19:36:28.588792 #598486] INFO -- : [590/885] 639392=test_primitive I, [2024-05-15T19:36:28.594426 #598486] INFO -- : [591/885] 639392=test_parser I, [2024-05-15T19:36:28.623792 #598486] INFO -- : [592/885] 639392=test_rdoc_ri_paths I, [2024-05-15T19:36:28.710717 #598486] INFO -- : [593/885] 639392=command_line_test I, [2024-05-15T19:36:28.714107 #598486] INFO -- : [594/885] 639392=test_win32ole_variant_m I, [2024-05-15T19:36:28.722806 #598486] INFO -- : [595/885] 639392=test_pair I, [2024-05-15T19:36:34.075490 #598486] INFO -- : [596/885] 639392=test_env I, [2024-05-15T19:36:36.515434 #598486] INFO -- : [597/885] 639392=test_gem_package_tar_reader I, [2024-05-15T19:36:36.611694 #598486] INFO -- : [598/885] 639392=test_gem_commands_signout_command I, [2024-05-15T19:36:36.632382 #598486] INFO -- : [599/885] 639392=test_gem_safe_yaml I, [2024-05-15T19:36:36.643103 #598486] INFO -- : [600/885] 639392=test_document I, [2024-05-15T19:36:36.649423 #598486] INFO -- : [601/885] 639392=test_eval I, [2024-05-15T19:36:36.663343 #598486] INFO -- : [602/885] 639392=test_history I, [2024-05-15T19:36:36.736119 #598486] INFO -- : [603/885] 639392=test_gem_commands_setup_command I, [2024-05-15T19:36:37.514808 #598486] INFO -- : [604/885] 639392=test_singleton_function I, [2024-05-15T19:36:37.525533 #598486] INFO -- : [605/885] 639392=test_sockopt I, [2024-05-15T19:36:37.535267 #598486] INFO -- : [606/885] 639392=test_ftp I, [2024-05-15T19:36:37.545067 #598486] INFO -- : [607/885] 639392=test_gem_source_fetch_problem I, [2024-05-15T19:36:37.554249 #598486] INFO -- : [608/885] 639392=test_install I, [2024-05-15T19:36:37.752158 #598486] INFO -- : [609/885] 639392=test_encoding I, [2024-05-15T19:36:37.769976 #598486] INFO -- : [610/885] 639392=test_rdoc_comment I, [2024-05-15T19:36:37.812771 #598486] INFO -- : [611/885] 639392=test_gem_request_set_lockfile_tokenizer I, [2024-05-15T19:36:37.959325 #598486] INFO -- : [612/885] 639392=test_cgi_multipart I, [2024-05-15T19:36:38.014404 #598486] INFO -- : [613/885] 639392=test_lazy_enumerator I, [2024-05-15T19:36:38.468712 #598486] INFO -- : [614/885] 639392=test_arithmetic_sequence I, [2024-05-15T19:36:38.548163 #598486] INFO -- : [615/885] 639392=test_ractor_compatibility I, [2024-05-15T19:36:38.844337 #598486] INFO -- : [616/885] 639392=test_autoconf I, [2024-05-15T19:36:38.849389 #598486] INFO -- : [617/885] 639392=integer_parse_test I, [2024-05-15T19:36:38.856636 #598486] INFO -- : [618/885] 639392=test_find_executable I, [2024-05-15T19:36:38.869408 #598486] INFO -- : [619/885] 639392=test_at_exit I, [2024-05-15T19:36:38.912458 #598486] INFO -- : [620/885] 639392=test_benchmark I, [2024-05-15T19:36:40.516354 #598486] INFO -- : [621/885] 639392=test_mkmf I, [2024-05-15T19:36:40.543995 #598486] INFO -- : [622/885] 639392=test_gem_source I, [2024-05-15T19:36:40.921874 #598486] INFO -- : [623/885] 639392=test_have_macro I, [2024-05-15T19:36:41.161919 #598486] INFO -- : [624/885] 639392=test_class I, [2024-05-15T19:36:41.178341 #598486] INFO -- : [625/885] 639392=test_autoload I, [2024-05-15T19:36:45.431312 #598486] INFO -- : [626/885] 639393=test_gem_package I, [2024-05-15T19:36:45.445820 #598486] INFO -- : [627/885] 639392=test_array I, [2024-05-15T19:36:46.232185 #598486] INFO -- : [628/885] 639393=dispatcher_test I, [2024-05-15T19:36:46.244298 #598486] INFO -- : [629/885] 639393=test_eval_history I, [2024-05-15T19:36:46.253484 #598486] INFO -- : [630/885] 639393=test_unicode I, [2024-05-15T19:36:46.304974 #598486] INFO -- : [631/885] 639393=test_gem_source_git I, [2024-05-15T19:36:47.300427 #598486] INFO -- : [632/885] 639393=test_regex_casefold I, [2024-05-15T19:36:47.854400 #598486] INFO -- : [633/885] 639393=test_win32ole_method I, [2024-05-15T19:36:47.857997 #598486] INFO -- : [634/885] 639393=test_lexer I, [2024-05-15T19:36:47.885140 #598486] INFO -- : [635/885] 639393=test_ripper I, [2024-05-15T19:36:48.210108 #598486] INFO -- : [636/885] 639393=test_files_ext I, [2024-05-15T19:36:48.243787 #598486] INFO -- : [637/885] 639393=test_thread_cv I, [2024-05-15T19:36:48.882826 #598486] INFO -- : [638/885] 639393=test_stringio I, [2024-05-15T19:36:48.989105 #598486] INFO -- : [639/885] 639393=test_assembler I, [2024-05-15T19:36:48.990629 #598486] INFO -- : [640/885] 639393=test_random I, [2024-05-15T19:36:49.009790 #598486] INFO -- : [641/885] 639393=test_propertyputref I, [2024-05-15T19:36:49.010726 #598486] INFO -- : [642/885] 639393=test_gb18030 I, [2024-05-15T19:36:49.030732 #598486] INFO -- : [643/885] 639393=test_gem_commands_lock_command I, [2024-05-15T19:36:49.062344 #598486] INFO -- : [644/885] 639393=test_reline_key I, [2024-05-15T19:36:49.251965 #598486] INFO -- : [645/885] 639393=test_unicode_normalize I, [2024-05-15T19:36:53.269335 #598486] INFO -- : [646/885] 639393=test_gem_stream_ui I, [2024-05-15T19:36:53.375534 #598486] INFO -- : [647/885] 639393=test_rdoc_generator_ri I, [2024-05-15T19:36:53.400861 #598486] INFO -- : [648/885] 639393=test_io_m17n I, [2024-05-15T19:36:54.738220 #598486] INFO -- : [649/885] 639393=test_rdoc_top_level I, [2024-05-15T19:36:55.024163 #598486] INFO -- : [650/885] 639393=test_cmethod I, [2024-05-15T19:36:55.028778 #598486] INFO -- : [651/885] 639393=test_gem_stub_specification I, [2024-05-15T19:36:55.201037 #598486] INFO -- : [652/885] 639393=test_float I, [2024-05-15T19:36:57.516415 #598486] INFO -- : [653/885] 639393=test_color I, [2024-05-15T19:36:57.628940 #598486] INFO -- : [654/885] 639393=test_gem_ext_configure_builder I, [2024-05-15T19:36:57.656766 #598486] INFO -- : [655/885] 639393=json_ext_parser_test I, [2024-05-15T19:36:57.669412 #598486] INFO -- : [656/885] 639393=test_nonblock I, [2024-05-15T19:36:57.694168 #598486] INFO -- : [657/885] 639393=test_rdoc_parser_simple I, [2024-05-15T19:36:57.743748 #598486] INFO -- : [658/885] 639393=test_ocsp I, [2024-05-15T19:36:57.834002 #598486] INFO -- : [659/885] 639393=test_scanner_events I, [2024-05-15T19:36:57.841046 #598486] INFO -- : [660/885] 639392=test_ipaddr I, [2024-05-15T19:36:57.868333 #598486] INFO -- : [661/885] 639393=test_date_strptime I, [2024-05-15T19:36:57.880724 #598486] INFO -- : [662/885] 639392=test_omap I, [2024-05-15T19:36:57.887787 #598486] INFO -- : [663/885] 639392=test_rdoc_generator_pot_po I, [2024-05-15T19:36:57.893959 #598486] INFO -- : [664/885] 639392=test_mul I, [2024-05-15T19:36:57.910440 #598486] INFO -- : [665/885] 639392=test_shellwords I, [2024-05-15T19:36:57.916786 #598486] INFO -- : [666/885] 639392=test_win32ole_param_event I, [2024-05-15T19:36:57.918325 #598486] INFO -- : [667/885] 639392=test_https_proxy I, [2024-05-15T19:36:57.936755 #598486] INFO -- : [668/885] 639392=test_rdoc_parser I, [2024-05-15T19:36:57.964250 #598486] INFO -- : [669/885] 639392=test_nomethod_error I, [2024-05-15T19:36:57.976233 #598486] INFO -- : [670/885] 639392=test_gem_commands_rebuild_command I, [2024-05-15T19:36:58.079167 #598486] INFO -- : [671/885] 639392=test_etc I, [2024-05-15T19:36:58.112921 #598486] INFO -- : [672/885] 639393=test_stat I, [2024-05-15T19:36:58.121172 #598486] INFO -- : [673/885] 639393=test_printf I, [2024-05-15T19:36:58.139487 #598486] INFO -- : [674/885] 639393=test_x509attr I, [2024-05-15T19:36:58.162169 #598486] INFO -- : [675/885] 639393=test_workspace I, [2024-05-15T19:36:58.172158 #598486] INFO -- : [676/885] 639392=test_win32ole_variant I, [2024-05-15T19:36:58.190107 #598486] INFO -- : [677/885] 639392=magic_comment_test I, [2024-05-15T19:36:58.198807 #598486] INFO -- : [678/885] 639392=test_cgi_modruby I, [2024-05-15T19:36:58.204206 #598486] INFO -- : [679/885] 639392=test_uncorrectable_name_check I, [2024-05-15T19:36:58.275079 #598486] INFO -- : [680/885] 639392=test_io I, [2024-05-15T19:36:58.294163 #598486] INFO -- : [681/885] 639393=test_dir I, [2024-05-15T19:36:58.655359 #598486] INFO -- : [682/885] 639393=test_files_test_1 I, [2024-05-15T19:36:58.695372 #598486] INFO -- : [683/885] 639393=test_closure I, [2024-05-15T19:37:01.363738 #598486] INFO -- : [684/885] 639391=test_resolve_symbol I, [2024-05-15T19:37:01.374102 #598486] INFO -- : [685/885] 639391=test_rubygems I, [2024-05-15T19:37:01.519512 #598486] INFO -- : [686/885] 639391=test_path I, [2024-05-15T19:37:01.528721 #598486] INFO -- : [687/885] 639391=test_digest I, [2024-05-15T19:37:01.538050 #598486] INFO -- : [688/885] 639391=test_rdoc_rd_inline I, [2024-05-15T19:37:01.542722 #598486] INFO -- : [689/885] 639391=test_modify_expand I, [2024-05-15T19:37:01.567543 #598486] INFO -- : [690/885] 639391=test_gem_available_set I, [2024-05-15T19:37:01.668155 #598486] INFO -- : [691/885] 639391=test_pkg_config I, [2024-05-15T19:37:01.708304 #598486] INFO -- : [692/885] 639391=test_convertible I, [2024-05-15T19:37:01.900538 #598486] INFO -- : [693/885] 639393=errors_test I, [2024-05-15T19:37:01.977459 #598486] INFO -- : [694/885] 639393=json_encoding_test I, [2024-05-15T19:37:01.981245 #598486] INFO -- : [695/885] 639393=test_vm_dump I, [2024-05-15T19:37:01.991694 #598486] INFO -- : [696/885] 639393=test_config I, [2024-05-15T19:37:02.114316 #598486] INFO -- : [697/885] 639393=test_func I, [2024-05-15T19:37:05.287177 #598486] INFO -- : [698/885] 639391=test_gem_resolver I, [2024-05-15T19:37:05.598066 #598486] INFO -- : [699/885] 639391=test_gem_source_vendor I, [2024-05-15T19:37:05.604726 #598486] INFO -- : [700/885] 639391=test_dln I, [2024-05-15T19:37:05.618044 #598486] INFO -- : [701/885] 639391=test_object I, [2024-05-15T19:37:05.951329 #598486] INFO -- : [702/885] 639391=test_gem_commands_exec_command I, [2024-05-15T19:37:07.316255 #598486] INFO -- : [703/885] 639391=unescape_test I, [2024-05-15T19:37:08.742351 #598486] INFO -- : [704/885] 639391=test_super I, [2024-05-15T19:37:09.747694 #598486] INFO -- : [705/885] 639392=test_color_printer I, [2024-05-15T19:37:09.755411 #598486] INFO -- : [706/885] 639392=test_readpartial I, [2024-05-15T19:37:09.778831 #598486] INFO -- : [707/885] 639393=test_rdoc_parser_ruby I, [2024-05-15T19:37:10.164550 #598486] INFO -- : [708/885] 639392=test_httpresponse I, [2024-05-15T19:37:10.199866 #598486] INFO -- : [709/885] 639392=test_x509req I, [2024-05-15T19:37:10.216457 #598486] INFO -- : [710/885] 639392=test_gem_console_ui I, [2024-05-15T19:37:10.228652 #598486] INFO -- : [711/885] 639392=test_ifunless I, [2024-05-15T19:37:10.235109 #598486] INFO -- : [712/885] 639392=test_allocation I, [2024-05-15T19:37:10.365946 #598486] INFO -- : [713/885] 639391=test_insns_leaf I, [2024-05-15T19:37:10.379216 #598486] INFO -- : [714/885] 639391=test_dns I, [2024-05-15T19:37:10.856727 #598486] INFO -- : [715/885] 639391=test_cgi_session I, [2024-05-15T19:37:10.885586 #598486] INFO -- : [716/885] 639391=test_notimplement I, [2024-05-15T19:37:10.889620 #598486] INFO -- : [717/885] 639391=test_c_union_entity I, [2024-05-15T19:37:11.082166 #598486] INFO -- : [718/885] 639391=test_x509crl I, [2024-05-15T19:37:11.200724 #598486] INFO -- : [719/885] 639391=test_rdoc_markup_heading I, [2024-05-15T19:37:11.210827 #598486] INFO -- : [720/885] 639391=test_flip I, [2024-05-15T19:37:11.235449 #598486] INFO -- : [721/885] 639391=test_io_console I, [2024-05-15T19:37:11.258401 #598486] INFO -- : [722/885] 639393=test_pattern_key_name_check I, [2024-05-15T19:37:11.270074 #598486] INFO -- : [723/885] 639393=test_profile_frames I, [2024-05-15T19:37:11.442773 #598486] INFO -- : [724/885] 639393=test_debug I, [2024-05-15T19:37:11.449570 #598486] INFO -- : [725/885] 639393=test_transcode I, [2024-05-15T19:37:11.663774 #598486] INFO -- : [726/885] 639393=test_refinement I, [2024-05-15T19:37:12.602131 #598486] INFO -- : [727/885] 639392=test_class2name I, [2024-05-15T19:37:12.618085 #598486] INFO -- : [728/885] 639392=test_gem_commands_cleanup_command I, [2024-05-15T19:37:13.203959 #598486] INFO -- : [729/885] 639392=test_gem_ext_cmake_builder I, [2024-05-15T19:37:13.218297 #598486] INFO -- : [730/885] 639392=test_digest_extend I, [2024-05-15T19:37:13.305735 #598486] INFO -- : [731/885] 639392=test_last_thread I, [2024-05-15T19:37:13.809358 #598486] INFO -- : [732/885] 639391=test_thread_fd_close I, [2024-05-15T19:37:13.817045 #598486] INFO -- : [733/885] 639391=test_getopts I, [2024-05-15T19:37:13.838707 #598486] INFO -- : [734/885] 639391=test_emitter I, [2024-05-15T19:37:13.922600 #598486] INFO -- : [735/885] 639391=test_fips I, [2024-05-15T19:37:14.109079 #598486] INFO -- : [736/885] 639391=test_alias I, [2024-05-15T19:37:14.251945 #598486] INFO -- : [737/885] 639391=test_compile_prism I, [2024-05-15T19:37:14.282892 #598486] INFO -- : [738/885] 639392=test_helper I, [2024-05-15T19:37:14.290719 #598486] INFO -- : [739/885] 639392=test_win32ole_event I, [2024-05-15T19:37:14.303940 #598486] INFO -- : [740/885] 639392=test_rdoc_markup_formatter I, [2024-05-15T19:37:14.326223 #598486] INFO -- : [741/885] 639392=test_gem_commands_uninstall_command I, [2024-05-15T19:37:14.608600 #598486] INFO -- : [742/885] 639391=test_scalar_scanner I, [2024-05-15T19:37:14.636526 #598486] INFO -- : [743/885] 639391=test_lambda I, [2024-05-15T19:37:14.704742 #598486] INFO -- : [744/885] 639391=test_rb_str_dup I, [2024-05-15T19:37:14.712731 #598486] INFO -- : [745/885] 639391=test_trace I, [2024-05-15T19:37:14.729479 #598486] INFO -- : [746/885] 639391=test_arity I, [2024-05-15T19:37:14.745639 #598486] INFO -- : [747/885] 639391=test_gem_path_support I, [2024-05-15T19:37:14.801157 #598486] INFO -- : [748/885] 639391=test_keyword I, [2024-05-15T19:37:15.167950 #598486] INFO -- : [749/885] 639392=test_win32ole_type_event I, [2024-05-15T19:37:15.187430 #598486] INFO -- : [750/885] 639392=test_rdoc_markup_to_html I, [2024-05-15T19:37:15.282894 #598486] INFO -- : [751/885] 639392=test_foreach I, [2024-05-15T19:37:15.289801 #598486] INFO -- : [752/885] 639392=test_append I, [2024-05-15T19:37:15.315551 #598486] INFO -- : [753/885] 639392=test_gem_resolver_installer_set I, [2024-05-15T19:37:15.388944 #598486] INFO -- : [754/885] 639391=test_emitter I, [2024-05-15T19:37:15.393046 #598486] INFO -- : [755/885] 639391=test_x509ext I, [2024-05-15T19:37:15.415247 #598486] INFO -- : [756/885] 639391=bom_test I, [2024-05-15T19:37:15.424674 #598486] INFO -- : [757/885] 639391=test_config I, [2024-05-15T19:37:15.568599 #598486] INFO -- : [758/885] 639392=test_file I, [2024-05-15T19:37:15.588481 #598486] INFO -- : [759/885] 639393=test_helper_method I, [2024-05-15T19:37:15.642158 #598486] INFO -- : [760/885] 639393=test_summary I, [2024-05-15T19:37:15.693035 #598486] INFO -- : [761/885] 639393=test_mailto I, [2024-05-15T19:37:15.704759 #598486] INFO -- : [762/885] 639393=test_addr I, [2024-05-15T19:37:15.716855 #598486] INFO -- : [763/885] 639393=test_kill_ring I, [2024-05-15T19:37:15.726570 #598486] INFO -- : [764/885] 639393=test_member I, [2024-05-15T19:37:15.734514 #598486] INFO -- : [765/885] 639393=test_object I, [2024-05-15T19:37:15.743110 #598486] INFO -- : [766/885] 639393=format_errors_test I, [2024-05-15T19:37:15.746612 #598486] INFO -- : [767/885] 639393=test_cgi_header I, [2024-05-15T19:37:15.762457 #598486] INFO -- : [768/885] 639393=test_case_options I, [2024-05-15T19:37:15.762999 #598486] INFO -- : [769/885] 639393=test_helper I, [2024-05-15T19:37:15.770899 #598486] INFO -- : [770/885] 639393=test_duplicate I, [2024-05-15T19:37:15.784881 #598486] INFO -- : [771/885] 639393=test_gem_resolver_api_set I, [2024-05-15T19:37:15.822436 #598486] INFO -- : [772/885] 639391=test_bug_reporter I, [2024-05-15T19:37:15.980562 #598486] INFO -- : [773/885] 639393=test_gem_installer I, [2024-05-15T19:37:16.005460 #598486] INFO -- : [774/885] 639391=test_buffered_io I, [2024-05-15T19:37:16.042159 #598486] INFO -- : [775/885] 639391=test_ossl I, [2024-05-15T19:37:20.477901 #598486] INFO -- : [776/885] 639393=test_ruby_lex I, [2024-05-15T19:37:20.596225 #598486] INFO -- : [777/885] 639393=compiler_test I, [2024-05-15T19:37:20.652215 #598486] INFO -- : [778/885] 639393=test_arith_seq_extract I, [2024-05-15T19:37:20.791904 #598486] INFO -- : [779/885] 639393=test_gem_source_subpath_problem I, [2024-05-15T19:37:20.879219 #598486] INFO -- : [780/885] 639393=test_object_references I, [2024-05-15T19:37:20.894646 #598486] INFO -- : [781/885] 639393=test_eval I, [2024-05-15T19:37:21.191774 #598486] INFO -- : [782/885] 639393=test_beginendblock I, [2024-05-15T19:37:21.630661 #598486] INFO -- : [783/885] 639393=test_monitor I, [2024-05-15T19:37:21.756706 #598486] INFO -- : [784/885] 639392=test_regexp I, [2024-05-15T19:37:21.766503 #598486] INFO -- : [785/885] 639393=test_whileuntil I, [2024-05-15T19:37:21.775258 #598486] INFO -- : [786/885] 639393=test_nofree I, [2024-05-15T19:37:21.777082 #598486] INFO -- : [787/885] 639393=test_pointer I, [2024-05-15T19:37:23.445318 #598486] INFO -- : [788/885] 639391=test_within_pipe I, [2024-05-15T19:37:23.475831 #598486] INFO -- : [789/885] 639391=test_rdoc_normal_class I, [2024-05-15T19:37:23.541715 #598486] INFO -- : [790/885] 639391=test_time_tz I, [2024-05-15T19:37:23.629822 #598486] INFO -- : [791/885] 639391=test_addrinfo I, [2024-05-15T19:37:23.674402 #598486] INFO -- : [792/885] 639391=test_to_ruby I, [2024-05-15T19:37:23.694555 #598486] INFO -- : [793/885] 639391=test_data I, [2024-05-15T19:37:23.750848 #598486] INFO -- : [794/885] 639391=test_bug-14834 I, [2024-05-15T19:37:23.775741 #598486] INFO -- : [795/885] 639391=test_inlinecache I, [2024-05-15T19:37:23.830830 #598486] INFO -- : [796/885] 639391=test_terminfo I, [2024-05-15T19:37:23.840659 #598486] INFO -- : [797/885] 639391=test_socket I, [2024-05-15T19:37:24.553101 #598486] INFO -- : [798/885] 639393=test_thread I, [2024-05-15T19:37:24.855493 #598486] INFO -- : [799/885] 639391=test_reline I, [2024-05-15T19:37:25.246650 #598486] INFO -- : [800/885] 639391=test_call I, [2024-05-15T19:37:25.458692 #598486] INFO -- : [801/885] 639391=test_ellipsize I, [2024-05-15T19:37:25.494340 #598486] INFO -- : [802/885] 639391=test_gem_commands_build_command I, [2024-05-15T19:37:25.838406 #598486] INFO -- : [803/885] 639391=test_windows_1251 I, [2024-05-15T19:37:25.901843 #598486] INFO -- : [804/885] 639391=test_gem_ext_builder I, [2024-05-15T19:37:27.789265 #598486] INFO -- : [805/885] 639391=test_to_ary_concat I, [2024-05-15T19:37:31.276679 #598486] INFO -- : [806/885] 639391=test_history I, [2024-05-15T19:37:31.294935 #598486] INFO -- : [807/885] 639391=test_ensured I, [2024-05-15T19:37:31.347119 #598486] INFO -- : [808/885] 639391=test_euc_jp I, [2024-05-15T19:37:31.357683 #598486] INFO -- : [809/885] 639391=test_rdoc_markup I, [2024-05-15T19:37:31.358656 #598486] INFO -- : [810/885] 639391=test_key_stroke I, [2024-05-15T19:37:31.388891 #598486] INFO -- : [811/885] 639391=test_alias_and_anchor I, [2024-05-15T19:37:31.404704 #598486] INFO -- : [812/885] 639391=test_time I, [2024-05-15T19:37:31.619926 #598486] INFO -- : [813/885] 639391=test_popen_deadlock I, [2024-05-15T19:37:32.207290 #598486] INFO -- : [814/885] 639391=test_project_sanity I, [2024-05-15T19:37:32.215872 #598486] INFO -- : [815/885] 639391=test_symbol I, [2024-05-15T19:37:32.229968 #598486] INFO -- : [816/885] 639391=location_test I, [2024-05-15T19:37:32.343409 #598486] INFO -- : [817/885] 639391=test_chilled I, [2024-05-15T19:37:32.353751 #598486] INFO -- : [818/885] 639391=test_delegate I, [2024-05-15T19:37:32.369961 #598486] INFO -- : [819/885] 639391=test_interned_str I, [2024-05-15T19:37:32.377151 #598486] INFO -- : [820/885] 639391=constant_path_node_test I, [2024-05-15T19:37:32.385885 #598486] INFO -- : [821/885] 639391=test_set_len I, [2024-05-15T19:37:32.391929 #598486] INFO -- : [822/885] 639391=test_folderitem2_invokeverb I, [2024-05-15T19:37:32.407600 #598486] INFO -- : [823/885] 639391=test_pattern_matching I, [2024-05-15T19:37:32.620740 #598486] INFO -- : [824/885] 639391=test_gc I, [2024-05-15T19:37:33.858063 #598486] INFO -- : [825/885] 639393=test_gem_bundler_version_finder I, [2024-05-15T19:37:33.973271 #598486] INFO -- : [826/885] 639393=test_gem_request_set I, [2024-05-15T19:37:34.793185 #598486] INFO -- : [827/885] 639393=ruby_api_test I, [2024-05-15T19:37:34.812853 #598486] INFO -- : [828/885] 639393=test_gem_resolver_index_set I, [2024-05-15T19:37:35.129382 #598486] INFO -- : [829/885] 639393=test_sleep I, [2024-05-15T19:37:39.868620 #598486] INFO -- : [830/885] 639393=test_webauthn_listener_response I, [2024-05-15T19:37:39.901392 #598486] INFO -- : [831/885] 639393=test_gem_commands_contents_command I, [2024-05-15T19:37:40.023957 #598486] INFO -- : [832/885] 639393=test_udp I, [2024-05-15T19:37:40.044476 #598486] INFO -- : [833/885] 639393=test_context I, [2024-05-15T19:37:40.143031 #598486] INFO -- : [834/885] 639393=test_gem_commands_search_command I, [2024-05-15T19:37:40.168786 #598486] INFO -- : [835/885] 639393=test_symbol I, [2024-05-15T19:37:43.156155 #598486] INFO -- : [836/885] 639391=test_coder I, [2024-05-15T19:37:43.185567 #598486] INFO -- : [837/885] 639391=test_rdoc_servlet I, [2024-05-15T19:37:43.282400 #598486] INFO -- : [838/885] 639391=test_formatter I, [2024-05-15T19:37:43.296016 #598486] INFO -- : [839/885] 639391=test_integer I, [2024-05-15T19:37:45.819775 #598486] INFO -- : [840/885] 639391=test_unix I, [2024-05-15T19:37:46.069987 #598486] INFO -- : [841/885] 639391=test_have_func I, [2024-05-15T19:37:47.204849 #598486] INFO -- : [842/885] 639391=test_date_marshal I, [2024-05-15T19:37:47.224885 #598486] INFO -- : [843/885] 639391=test_gem_resolver_local_specification I, [2024-05-15T19:37:47.255963 #598486] INFO -- : [844/885] 639391=test_configuration I, [2024-05-15T19:37:47.351271 #598486] INFO -- : [845/885] 639391=test_date_new I, [2024-05-15T19:37:47.374369 #598486] INFO -- : [846/885] 639391=test_gem_commands_list_command I, [2024-05-15T19:37:47.386972 #598486] INFO -- : [847/885] 639391=test_address_resolve I, [2024-05-15T19:37:47.414724 #598486] INFO -- : [848/885] 639391=test_stream I, [2024-05-15T19:37:47.482488 #598486] INFO -- : [849/885] 639391=test_ractor I, [2024-05-15T19:37:47.504913 #598486] INFO -- : [850/885] 639391=test_trick I, [2024-05-15T19:37:49.127334 #598486] INFO -- : [851/885] 639393=test_rdoc_attr I, [2024-05-15T19:37:49.146472 #598486] INFO -- : [852/885] 639393=test_locale I, [2024-05-15T19:37:49.186234 #598486] INFO -- : [853/885] 639393=test_ts I, [2024-05-15T19:37:49.465567 #598486] INFO -- : [854/885] 639393=test_rbconfig I, [2024-05-15T19:37:49.485206 #598486] INFO -- : [855/885] 639393=test_num2int I, [2024-05-15T19:37:49.551394 #598486] INFO -- : [856/885] 639393=test_extlibs I, [2024-05-15T19:37:50.025602 #598486] INFO -- : [857/885] 639391=test_iter_break I, [2024-05-15T19:37:50.030492 #598486] INFO -- : [858/885] 639391=test_range I, [2024-05-15T19:37:50.810999 #598486] INFO -- : [859/885] 639391=test_gem_commands_signin_command I, [2024-05-15T19:37:50.959645 #598486] INFO -- : [860/885] 639391=test_require I, [2024-05-15T19:37:51.114083 #598486] INFO -- : [861/885] 639393=test_recursion I, [2024-05-15T19:37:51.197166 #598486] INFO -- : [862/885] 639393=test_rdoc_markup_include I, [2024-05-15T19:37:51.214672 #598486] INFO -- : [863/885] 639393=test_enum I, [2024-05-15T19:37:52.260572 #598486] INFO -- : [864/885] 639391=test_parser I, [2024-05-15T19:37:52.287523 #598486] INFO -- : [865/885] 639391=test_rdoc_markup_to_label I, [2024-05-15T19:37:52.341378 #598486] INFO -- : [866/885] 639391=test_gem_resolver_best_set I, [2024-05-15T19:37:52.354046 #598486] INFO -- : [867/885] 639392=test_cgi_core I, [2024-05-15T19:37:52.383139 #598486] INFO -- : [868/885] 639393=test_registry I, [2024-05-15T19:37:52.385927 #598486] INFO -- : [869/885] 639393=test_gem I, [2024-05-15T19:37:52.386236 #598486] INFO -- : [870/885] 639392=json_generator_test I, [2024-05-15T19:37:52.408682 #598486] INFO -- : [871/885] 639391=test_ansi_without_terminfo I, [2024-05-15T19:37:52.428432 #598486] INFO -- : [872/885] 639391=test_ractor I, [2024-05-15T19:37:52.471093 #598486] INFO -- : [873/885] 639391=test_gem_resolver_conflict I, [2024-05-15T19:37:52.491063 #598486] INFO -- : [874/885] 639391=test_ractor I, [2024-05-15T19:37:52.517056 #598486] INFO -- : [875/885] 639392=test_scheduler I, [2024-05-15T19:37:52.732798 #598486] INFO -- : [876/885] 639392=test_gem_commands_help_command I, [2024-05-15T19:37:52.812517 #598486] INFO -- : [877/885] 639392=test_ssl I, [2024-05-15T19:37:52.815281 #598486] INFO -- : [878/885] 639391=test_enc_str_buf_cat I, [2024-05-15T19:37:52.830386 #598486] INFO -- : [879/885] 639391=newline_test I, [2024-05-15T19:37:52.909210 #598486] INFO -- : [880/885] 639391=test_bignum I, [2024-05-15T19:37:52.933974 #598486] INFO -- : [881/885] 639392=test_rdoc_markup_hard_break I, [2024-05-15T19:37:52.963871 #598486] INFO -- : [882/885] 639392=ractor_test I, [2024-05-15T19:37:53.000806 #598486] INFO -- : [883/885] 639392=test_ancdata I, [2024-05-15T19:37:53.015039 #598486] INFO -- : [884/885] 639392=test_marshal I, [2024-05-15T19:37:54.395479 #598486] INFO -- : [885/885] 639392=test_nesting_parser I, [2024-05-15T19:37:56.528900 #598486] INFO -- : Finished tests in 196.550282s, 133.8741 tests/s, 47563.1574 assertions/s. E, [2024-05-15T19:37:56.529121 #598486] ERROR -- : Children under /tmp/rubytest.m2b28z: E, [2024-05-15T19:37:56.529240 #598486] ERROR -- : * drwx------ 4 28 2024-05-15 19:36:58 +0000 gem_rebuild20240515-639392-ik80pf/ E, [2024-05-15T19:37:56.529258 #598486] ERROR -- : * drwxrwxr-x 2 40 2024-05-15 19:36:58 +0000 old/ E, [2024-05-15T19:37:56.529310 #598486] ERROR -- : * -rw-rw-r-- 1 4096 2024-05-15 19:36:58 +0000 rebuild_test_gem-1.0.0.gem E, [2024-05-15T19:37:56.529455 #598486] ERROR -- : * drwxrwxr-x 2 40 2024-05-15 19:36:58 +0000 new/ E, [2024-05-15T19:37:56.529477 #598486] ERROR -- : * -rw-rw-r-- 1 4096 2024-05-15 19:36:58 +0000 rebuild_test_gem-1.0.0.gem I, [2024-05-15T19:37:56.535377 #598486] INFO -- : 26313 tests, 9348552 assertions, 0 failures, 0 errors, 320 skips I, [2024-05-15T19:37:56.535419 #598486] INFO -- : I, [2024-05-15T19:37:56.535430 #598486] INFO -- : ruby -v: ruby 3.4.0dev (2024-05-15T16:49:45Z master 2aed14d65b) [aarch64-linux] I, [2024-05-15T19:37:56.536238 #598486] INFO -- : $$$[end] "make yes-test-all TESTOPTS='--stderr-on-failure' TESTS='-j3'" exit with 0. I, [2024-05-15T19:37:56.536402 #598486] INFO -- : $$$[beg] make yes-test-rubyspec MSPECOPT='--error-output stderr --debug -j' TESTS='-j3' I, [2024-05-15T19:37:56.659915 #598486] INFO -- : BASERUBY = /usr/local/bin/ruby --disable=gems I, [2024-05-15T19:37:56.659992 #598486] INFO -- : CC = gcc I, [2024-05-15T19:37:56.660003 #598486] INFO -- : LD = ld I, [2024-05-15T19:37:56.660011 #598486] INFO -- : LDSHARED = gcc -shared I, [2024-05-15T19:37:56.660023 #598486] INFO -- : CFLAGS = -O3 -fno-fast-math -ggdb3 -Wall -Wextra -Wdeprecated-declarations -Wdiv-by-zero -Wduplicated-cond -Wimplicit-function-declaration -Wimplicit-int -Wpointer-arith -Wwrite-strings -Wold-style-definition -Wimplicit-fallthrough=0 -Wmissing-noreturn -Wno-cast-function-type -Wno-constant-logical-operand -Wno-long-long -Wno-missing-field-initializers -Wno-overlength-strings -Wno-packed-bitfield-compat -Wno-parentheses-equality -Wno-self-assign -Wno-tautological-compare -Wno-unused-parameter -Wno-unused-value -Wsuggest-attribute=format -Wsuggest-attribute=noreturn -Wunused-variable -Wmisleading-indentation -Wundef I, [2024-05-15T19:37:56.660034 #598486] INFO -- : XCFLAGS = -U_FORTIFY_SOURCE -D_FORTIFY_SOURCE=2 -fstack-protector-strong -msign-return-address=all -fno-strict-overflow -fvisibility=hidden -fexcess-precision=standard -DRUBY_EXPORT -fPIE -I. -I.ext/include/aarch64-linux -I/home/opc/ruby/src/master/include -I/home/opc/ruby/src/master -I/home/opc/ruby/src/master/prism -I/home/opc/ruby/src/master/enc/unicode/15.0.0 I, [2024-05-15T19:37:56.660044 #598486] INFO -- : CPPFLAGS = I, [2024-05-15T19:37:56.660052 #598486] INFO -- : DLDFLAGS = -Wl,--compress-debug-sections=zlib -fstack-protector-strong -pie I, [2024-05-15T19:37:56.660061 #598486] INFO -- : SOLIBS = -lz -lrt -lrt -ldl -lcrypt -lm -lpthread I, [2024-05-15T19:37:56.660070 #598486] INFO -- : LANG = en_US.UTF-8 I, [2024-05-15T19:37:56.660077 #598486] INFO -- : LC_ALL = I, [2024-05-15T19:37:56.660085 #598486] INFO -- : LC_CTYPE = I, [2024-05-15T19:37:56.660093 #598486] INFO -- : MFLAGS = I, [2024-05-15T19:37:56.660101 #598486] INFO -- : RUSTC = rustc I, [2024-05-15T19:37:56.660109 #598486] INFO -- : YJIT_RUSTC_ARGS = --crate-name=yjit --crate-type=staticlib --edition=2021 -g -C lto=thin -C opt-level=3 -C overflow-checks=on '--out-dir=/home/opc/ruby/build/master/yjit/target/release/' /home/opc/ruby/src/master/yjit/src/lib.rs I, [2024-05-15T19:37:56.660777 #598486] INFO -- : gcc (GCC) 8.5.0 20210514 (Red Hat 8.5.0-10.1.0.1) I, [2024-05-15T19:37:56.660800 #598486] INFO -- : Copyright (C) 2018 Free Software Foundation, Inc. I, [2024-05-15T19:37:56.660810 #598486] INFO -- : This is free software; see the source for copying conditions. There is NO I, [2024-05-15T19:37:56.660818 #598486] INFO -- : warranty; not even for MERCHANTABILITY or FITNESS FOR A PARTICULAR PURPOSE. I, [2024-05-15T19:37:56.660826 #598486] INFO -- : I, [2024-05-15T19:37:56.662872 #598486] INFO -- : generating enc.mk I, [2024-05-15T19:37:56.893557 #598486] INFO -- : generating encdb.h I, [2024-05-15T19:37:56.930641 #598486] INFO -- : encdb.h unchanged I, [2024-05-15T19:37:56.931926 #598486] INFO -- : making enc I, [2024-05-15T19:37:56.959035 #598486] INFO -- : make[1]: Entering directory '/home/opc/ruby/build/master' I, [2024-05-15T19:37:56.959089 #598486] INFO -- : make[1]: Nothing to be done for 'enc'. I, [2024-05-15T19:37:56.959100 #598486] INFO -- : make[1]: Leaving directory '/home/opc/ruby/build/master' I, [2024-05-15T19:37:56.959813 #598486] INFO -- : making srcs under enc I, [2024-05-15T19:37:57.001349 #598486] INFO -- : make[1]: Entering directory '/home/opc/ruby/build/master' I, [2024-05-15T19:37:57.001418 #598486] INFO -- : make[1]: Nothing to be done for 'srcs'. I, [2024-05-15T19:37:57.001428 #598486] INFO -- : make[1]: Leaving directory '/home/opc/ruby/build/master' I, [2024-05-15T19:37:57.002522 #598486] INFO -- : generating transdb.h I, [2024-05-15T19:37:57.145654 #598486] INFO -- : transdb.h unchanged I, [2024-05-15T19:37:57.146889 #598486] INFO -- : making trans I, [2024-05-15T19:37:57.195028 #598486] INFO -- : make[1]: Entering directory '/home/opc/ruby/build/master' I, [2024-05-15T19:37:57.195099 #598486] INFO -- : make[1]: Nothing to be done for 'trans'. I, [2024-05-15T19:37:57.195110 #598486] INFO -- : make[1]: Leaving directory '/home/opc/ruby/build/master' I, [2024-05-15T19:37:57.195777 #598486] INFO -- : making encs I, [2024-05-15T19:37:57.247870 #598486] INFO -- : make[1]: Entering directory '/home/opc/ruby/build/master' I, [2024-05-15T19:37:57.247945 #598486] INFO -- : make[1]: Nothing to be done for 'encs'. I, [2024-05-15T19:37:57.247955 #598486] INFO -- : make[1]: Leaving directory '/home/opc/ruby/build/master' I, [2024-05-15T19:37:57.250045 #598486] INFO -- : generating makefiles ext/configure-ext.mk I, [2024-05-15T19:37:57.289957 #598486] INFO -- : ext/configure-ext.mk updated I, [2024-05-15T19:37:57.293137 #598486] INFO -- : make[1]: Entering directory '/home/opc/ruby/build/master' I, [2024-05-15T19:37:59.339801 #598486] INFO -- : make[1]: Leaving directory '/home/opc/ruby/build/master' I, [2024-05-15T19:37:59.340463 #598486] INFO -- : generating makefile exts.mk I, [2024-05-15T19:37:59.398459 #598486] INFO -- : exts.mk unchanged I, [2024-05-15T19:37:59.403226 #598486] INFO -- : make[1]: Entering directory '/home/opc/ruby/build/master' I, [2024-05-15T19:37:59.698664 #598486] INFO -- : make[2]: Entering directory '/home/opc/ruby/build/master/ext/coverage' I, [2024-05-15T19:37:59.703461 #598486] INFO -- : make[2]: Leaving directory '/home/opc/ruby/build/master/ext/coverage' I, [2024-05-15T19:37:59.709068 #598486] INFO -- : make[2]: Entering directory '/home/opc/ruby/build/master/ext/date' I, [2024-05-15T19:37:59.714640 #598486] INFO -- : make[2]: Leaving directory '/home/opc/ruby/build/master/ext/date' I, [2024-05-15T19:37:59.717930 #598486] INFO -- : make[2]: Entering directory '/home/opc/ruby/build/master/ext/digest' I, [2024-05-15T19:37:59.726575 #598486] INFO -- : make[2]: Leaving directory '/home/opc/ruby/build/master/ext/digest' I, [2024-05-15T19:37:59.748760 #598486] INFO -- : make[2]: Entering directory '/home/opc/ruby/build/master/ext/digest/sha2' I, [2024-05-15T19:37:59.753616 #598486] INFO -- : make[2]: Leaving directory '/home/opc/ruby/build/master/ext/digest/sha2' I, [2024-05-15T19:37:59.771633 #598486] INFO -- : make[2]: Entering directory '/home/opc/ruby/build/master/ext/fiddle' I, [2024-05-15T19:37:59.781746 #598486] INFO -- : make[2]: Leaving directory '/home/opc/ruby/build/master/ext/fiddle' I, [2024-05-15T19:37:59.785959 #598486] INFO -- : make[2]: Entering directory '/home/opc/ruby/build/master/ext/io/console' I, [2024-05-15T19:37:59.790322 #598486] INFO -- : make[2]: Leaving directory '/home/opc/ruby/build/master/ext/io/console' I, [2024-05-15T19:37:59.800918 #598486] INFO -- : make[2]: Entering directory '/home/opc/ruby/build/master/ext/json' I, [2024-05-15T19:37:59.810173 #598486] INFO -- : make[2]: Leaving directory '/home/opc/ruby/build/master/ext/json' I, [2024-05-15T19:37:59.823000 #598486] INFO -- : make[2]: Entering directory '/home/opc/ruby/build/master/ext/monitor' I, [2024-05-15T19:37:59.827019 #598486] INFO -- : make[2]: Leaving directory '/home/opc/ruby/build/master/ext/monitor' I, [2024-05-15T19:37:59.833277 #598486] INFO -- : make[2]: Entering directory '/home/opc/ruby/build/master/ext/objspace' I, [2024-05-15T19:37:59.839455 #598486] INFO -- : make[2]: Leaving directory '/home/opc/ruby/build/master/ext/objspace' I, [2024-05-15T19:37:59.859147 #598486] INFO -- : make[2]: Entering directory '/home/opc/ruby/build/master/ext/openssl' I, [2024-05-15T19:37:59.880609 #598486] INFO -- : make[2]: Leaving directory '/home/opc/ruby/build/master/ext/openssl' I, [2024-05-15T19:37:59.884788 #598486] INFO -- : make[2]: Entering directory '/home/opc/ruby/build/master/ext/pathname' I, [2024-05-15T19:37:59.888862 #598486] INFO -- : make[2]: Leaving directory '/home/opc/ruby/build/master/ext/pathname' I, [2024-05-15T19:37:59.895068 #598486] INFO -- : make[2]: Entering directory '/home/opc/ruby/build/master/ext/psych' I, [2024-05-15T19:37:59.916206 #598486] INFO -- : make[2]: Leaving directory '/home/opc/ruby/build/master/ext/psych' I, [2024-05-15T19:37:59.920551 #598486] INFO -- : make[2]: Entering directory '/home/opc/ruby/build/master/ext/pty' I, [2024-05-15T19:37:59.924691 #598486] INFO -- : make[2]: Leaving directory '/home/opc/ruby/build/master/ext/pty' I, [2024-05-15T19:37:59.937869 #598486] INFO -- : make[2]: Entering directory '/home/opc/ruby/build/master/ext/ripper' I, [2024-05-15T19:37:59.945532 #598486] INFO -- : make[2]: Leaving directory '/home/opc/ruby/build/master/ext/ripper' I, [2024-05-15T19:37:59.947565 #598486] INFO -- : make[2]: Entering directory '/home/opc/ruby/build/master/ext/rubyvm' I, [2024-05-15T19:37:59.950996 #598486] INFO -- : make[2]: Leaving directory '/home/opc/ruby/build/master/ext/rubyvm' I, [2024-05-15T19:37:59.962956 #598486] INFO -- : make[2]: Entering directory '/home/opc/ruby/build/master/ext/socket' I, [2024-05-15T19:37:59.973520 #598486] INFO -- : make[2]: Leaving directory '/home/opc/ruby/build/master/ext/socket' I, [2024-05-15T19:37:59.988706 #598486] INFO -- : make[2]: Entering directory '/home/opc/ruby/build/master/.bundle/gems/bigdecimal-3.1.7/ext/bigdecimal' I, [2024-05-15T19:38:00.019249 #598486] INFO -- : make[2]: Leaving directory '/home/opc/ruby/build/master/.bundle/gems/bigdecimal-3.1.7/ext/bigdecimal' I, [2024-05-15T19:38:00.021921 #598486] INFO -- : make[2]: Entering directory '/home/opc/ruby/build/master/.bundle/gems/bigdecimal-3.1.8/ext/bigdecimal' I, [2024-05-15T19:38:00.053142 #598486] INFO -- : make[2]: Leaving directory '/home/opc/ruby/build/master/.bundle/gems/bigdecimal-3.1.8/ext/bigdecimal' I, [2024-05-15T19:38:00.055724 #598486] INFO -- : make[2]: Entering directory '/home/opc/ruby/build/master/.bundle/gems/debug-1.9.2/ext/debug' I, [2024-05-15T19:38:00.086603 #598486] INFO -- : make[2]: Leaving directory '/home/opc/ruby/build/master/.bundle/gems/debug-1.9.2/ext/debug' I, [2024-05-15T19:38:00.089208 #598486] INFO -- : make[2]: Entering directory '/home/opc/ruby/build/master/.bundle/gems/nkf-0.2.0/ext/nkf' I, [2024-05-15T19:38:00.119292 #598486] INFO -- : make[2]: Leaving directory '/home/opc/ruby/build/master/.bundle/gems/nkf-0.2.0/ext/nkf' I, [2024-05-15T19:38:00.121848 #598486] INFO -- : make[2]: Entering directory '/home/opc/ruby/build/master/.bundle/gems/racc-1.7.3/ext/racc/cparse' I, [2024-05-15T19:38:00.151658 #598486] INFO -- : make[2]: Leaving directory '/home/opc/ruby/build/master/.bundle/gems/racc-1.7.3/ext/racc/cparse' I, [2024-05-15T19:38:00.154668 #598486] INFO -- : make[2]: Entering directory '/home/opc/ruby/build/master/.bundle/gems/rbs-3.4.4/ext/rbs_extension' I, [2024-05-15T19:38:00.184852 #598486] INFO -- : make[2]: Leaving directory '/home/opc/ruby/build/master/.bundle/gems/rbs-3.4.4/ext/rbs_extension' I, [2024-05-15T19:38:00.187399 #598486] INFO -- : make[2]: Entering directory '/home/opc/ruby/build/master/.bundle/gems/syslog-0.1.2/ext/syslog' I, [2024-05-15T19:38:00.217435 #598486] INFO -- : make[2]: Leaving directory '/home/opc/ruby/build/master/.bundle/gems/syslog-0.1.2/ext/syslog' I, [2024-05-15T19:38:00.256074 #598486] INFO -- : make[2]: Entering directory '/home/opc/ruby/build/master' I, [2024-05-15T19:38:00.339065 #598486] INFO -- : make[2]: 'ruby' is up to date. I, [2024-05-15T19:38:00.339158 #598486] INFO -- : make[2]: Leaving directory '/home/opc/ruby/build/master' I, [2024-05-15T19:38:00.339241 #598486] INFO -- : make[1]: Leaving directory '/home/opc/ruby/build/master' I, [2024-05-15T19:38:00.343620 #598486] INFO -- : make[1]: Entering directory '/home/opc/ruby/build/master' I, [2024-05-15T19:38:00.343670 #598486] INFO -- : make[1]: Nothing to be done for 'note'. I, [2024-05-15T19:38:00.343680 #598486] INFO -- : make[1]: Leaving directory '/home/opc/ruby/build/master' E, [2024-05-15T19:38:00.419345 #598486] ERROR -- : $ /home/opc/ruby/build/master/miniruby -I/home/opc/ruby/src/master/lib /home/opc/ruby/src/master/tool/runruby.rb --archdir=/home/opc/ruby/build/master --extout=.ext -- /home/opc/ruby/src/master/spec/mspec/bin/mspec-run -B /home/opc/ruby/src/master/spec/default.mspec --error-output stderr --debug -fy -o /tmp/rubytest.2sdisg/1-mspec-multi-0 E, [2024-05-15T19:38:00.419683 #598486] ERROR -- : $ /home/opc/ruby/build/master/miniruby -I/home/opc/ruby/src/master/lib /home/opc/ruby/src/master/tool/runruby.rb --archdir=/home/opc/ruby/build/master --extout=.ext -- /home/opc/ruby/src/master/spec/mspec/bin/mspec-run -B /home/opc/ruby/src/master/spec/default.mspec --error-output stderr --debug -fy -o /tmp/rubytest.2sdisg/2-mspec-multi-1 E, [2024-05-15T19:38:00.419950 #598486] ERROR -- : $ /home/opc/ruby/build/master/miniruby -I/home/opc/ruby/src/master/lib /home/opc/ruby/src/master/tool/runruby.rb --archdir=/home/opc/ruby/build/master --extout=.ext -- /home/opc/ruby/src/master/spec/mspec/bin/mspec-run -B /home/opc/ruby/src/master/spec/default.mspec --error-output stderr --debug -fy -o /tmp/rubytest.2sdisg/3-mspec-multi-2 I, [2024-05-15T19:38:00.555411 #598486] INFO -- : ruby 3.4.0dev (2024-05-15T16:49:45Z master 2aed14d65b) [aarch64-linux] I, [2024-05-15T19:38:05.884456 #598486] INFO -- : 0 ......................................................................... I, [2024-05-15T19:38:08.320041 #598486] INFO -- : 73 ......................................................................... I, [2024-05-15T19:38:08.494934 #598486] INFO -- : 146 ......................................................................... I, [2024-05-15T19:38:08.789954 #598486] INFO -- : 219 ......................................................................... I, [2024-05-15T19:38:08.938515 #598486] INFO -- : 292 ......................................................................... I, [2024-05-15T19:38:09.181260 #598486] INFO -- : 365 ......................................................................... I, [2024-05-15T19:38:09.306410 #598486] INFO -- : 438 ......................................................................... I, [2024-05-15T19:38:09.365384 #598486] INFO -- : 511 ......................................................................... I, [2024-05-15T19:38:09.425780 #598486] INFO -- : 584 ......................................................................... I, [2024-05-15T19:38:10.032704 #598486] INFO -- : 657 ......................................................................... I, [2024-05-15T19:38:10.140275 #598486] INFO -- : 730 ......................................................................... I, [2024-05-15T19:38:10.191774 #598486] INFO -- : 803 ......................................................................... I, [2024-05-15T19:38:10.394150 #598486] INFO -- : 876 ......................................................................... I, [2024-05-15T19:38:10.500797 #598486] INFO -- : 949 ......................................................................... I, [2024-05-15T19:38:11.145563 #598486] INFO -- : 1022 ......................................................................... I, [2024-05-15T19:38:13.445746 #598486] INFO -- : 1095 ......................................................................... I, [2024-05-15T19:38:14.311392 #598486] INFO -- : 1168 ......................................................................... I, [2024-05-15T19:38:14.456421 #598486] INFO -- : 1241 ......................................................................... I, [2024-05-15T19:38:14.633539 #598486] INFO -- : 1314 ......................................................................... I, [2024-05-15T19:38:14.724843 #598486] INFO -- : 1387 ......................................................................... I, [2024-05-15T19:38:16.802277 #598486] INFO -- : 1460 ......................................................................... I, [2024-05-15T19:38:19.963540 #598486] INFO -- : 1533 ......................................................................... I, [2024-05-15T19:38:20.108676 #598486] INFO -- : 1606 ......................................................................... I, [2024-05-15T19:38:20.935567 #598486] INFO -- : 1679 ......................................................................... I, [2024-05-15T19:38:21.266891 #598486] INFO -- : 1752 ......................................................................... I, [2024-05-15T19:38:21.613690 #598486] INFO -- : 1825 ......................................................................... I, [2024-05-15T19:38:21.935701 #598486] INFO -- : 1898 ......................................................................... I, [2024-05-15T19:38:22.327460 #598486] INFO -- : 1971 ......................................................................... I, [2024-05-15T19:38:22.838468 #598486] INFO -- : 2044 ......................................................................... I, [2024-05-15T19:38:22.922885 #598486] INFO -- : 2117 ......................................................................... I, [2024-05-15T19:38:22.982346 #598486] INFO -- : 2190 ......................................................................... I, [2024-05-15T19:38:23.030980 #598486] INFO -- : 2263 ......................................................................... I, [2024-05-15T19:38:23.078154 #598486] INFO -- : 2336 ......................................................................... I, [2024-05-15T19:38:23.168860 #598486] INFO -- : 2409 ......................................................................... I, [2024-05-15T19:38:23.451824 #598486] INFO -- : 2482 ......................................................................... I, [2024-05-15T19:38:23.582123 #598486] INFO -- : 2555 ......................................................................... I, [2024-05-15T19:38:24.887169 #598486] INFO -- : 2628 ......................................................................... I, [2024-05-15T19:38:25.036560 #598486] INFO -- : 2701 ......................................................................... I, [2024-05-15T19:38:25.170791 #598486] INFO -- : 2774 ......................................................................... I, [2024-05-15T19:38:25.503522 #598486] INFO -- : 2847 ......................................................................... I, [2024-05-15T19:38:25.767546 #598486] INFO -- : 2920 ......................................................................... I, [2024-05-15T19:38:25.884544 #598486] INFO -- : 2993 ......................................................................... I, [2024-05-15T19:38:25.945798 #598486] INFO -- : 3066 ......................................................................... I, [2024-05-15T19:38:26.003472 #598486] INFO -- : 3139 ......................................................................... I, [2024-05-15T19:38:26.070104 #598486] INFO -- : 3212 ......................................................................... I, [2024-05-15T19:38:26.147302 #598486] INFO -- : 3285 ......................................................................... I, [2024-05-15T19:38:29.972055 #598486] INFO -- : 3358 ........................................................................ I, [2024-05-15T19:38:29.972133 #598486] INFO -- : I, [2024-05-15T19:38:29.972145 #598486] INFO -- : Finished in 29.552684 seconds I, [2024-05-15T19:38:29.972154 #598486] INFO -- : I, [2024-05-15T19:38:29.972163 #598486] INFO -- : 3429 files, 32607 examples, 191232 expectations, 0 failures, 0 errors, 0 tagged I, [2024-05-15T19:38:29.973551 #598486] INFO -- : $$$[end] "make yes-test-rubyspec MSPECOPT='--error-output stderr --debug -j' TESTS='-j3'" exit with 0.