# Logfile created on 2024-05-15 00:06:22 +0000 by logger.rb/v1.5.3 I, [2024-05-15T00:06:22.331283 #171953] INFO -- : #, @formatter=nil, @logdev=#, @binmode=false, @mon_data=#, @mon_data_owner_object_id=860>>> I, [2024-05-15T00:06:22.331575 #171953] INFO -- : $$$[beg] make update-unicode -j3 I, [2024-05-15T00:06:22.420956 #171953] INFO -- : Downloading Unicode emoji 15.0 files... I, [2024-05-15T00:06:22.421252 #171953] INFO -- : Downloading Unicode emoji 15.0 files... I, [2024-05-15T00:06:22.421412 #171953] INFO -- : Downloading Unicode emoji 15.0 files... I, [2024-05-15T00:06:22.497523 #171953] INFO -- : made symlink emoji/15.0/emoji-sequences.txt to /home/opc/ruby/src/master/.downloaded-cache/emoji/15.0/emoji-sequences.txt I, [2024-05-15T00:06:22.499959 #171953] INFO -- : downloading emoji/15.0/emoji-test.txt ... /home/opc/ruby/src/master/enc/unicode/data/emoji/15.0/emoji-sequences.txt already exists I, [2024-05-15T00:06:22.500135 #171953] INFO -- : downloading emoji/15.0/emoji-test.txt ... /home/opc/ruby/src/master/enc/unicode/data/emoji/15.0/emoji-sequences.txt already exists E, [2024-05-15T00:06:22.984229 #171953] ERROR -- : /home/opc/ruby/src/master/tool/downloader.rb:302:in `rescue in download': failed to download emoji/15.0/emoji-test.txt (RuntimeError) E, [2024-05-15T00:06:22.984297 #171953] ERROR -- : OpenURI::HTTPError: 403 Forbidden: https://www.unicode.org/Public/emoji/15.0/emoji-test.txt E, [2024-05-15T00:06:22.984308 #171953] ERROR -- : from /home/opc/ruby/src/master/tool/downloader.rb:201:in `download' E, [2024-05-15T00:06:22.984318 #171953] ERROR -- : from /home/opc/ruby/src/master/tool/downloader.rb:136:in `download' E, [2024-05-15T00:06:22.984327 #171953] ERROR -- : from /home/opc/ruby/src/master/tool/downloader.rb:482:in `block in
' E, [2024-05-15T00:06:22.984335 #171953] ERROR -- : from /home/opc/ruby/src/master/tool/downloader.rb:465:in `each' E, [2024-05-15T00:06:22.984344 #171953] ERROR -- : from /home/opc/ruby/src/master/tool/downloader.rb:465:in `
' E, [2024-05-15T00:06:22.984379 #171953] ERROR -- : /usr/local/lib/ruby/3.2.0/open-uri.rb:369:in `open_http': 403 Forbidden (OpenURI::HTTPError) E, [2024-05-15T00:06:22.984389 #171953] ERROR -- : from /usr/local/lib/ruby/3.2.0/open-uri.rb:760:in `buffer_open' E, [2024-05-15T00:06:22.984397 #171953] ERROR -- : from /usr/local/lib/ruby/3.2.0/open-uri.rb:214:in `block in open_loop' E, [2024-05-15T00:06:22.984406 #171953] ERROR -- : from /usr/local/lib/ruby/3.2.0/open-uri.rb:212:in `catch' E, [2024-05-15T00:06:22.984414 #171953] ERROR -- : from /usr/local/lib/ruby/3.2.0/open-uri.rb:212:in `open_loop' E, [2024-05-15T00:06:22.984422 #171953] ERROR -- : from /usr/local/lib/ruby/3.2.0/open-uri.rb:153:in `open_uri' E, [2024-05-15T00:06:22.984430 #171953] ERROR -- : from /usr/local/lib/ruby/3.2.0/open-uri.rb:740:in `open' E, [2024-05-15T00:06:22.984441 #171953] ERROR -- : from /usr/local/lib/ruby/3.2.0/open-uri.rb:748:in `read' E, [2024-05-15T00:06:22.984449 #171953] ERROR -- : from /home/opc/ruby/src/master/tool/downloader.rb:247:in `block in download' E, [2024-05-15T00:06:22.984457 #171953] ERROR -- : from /home/opc/ruby/src/master/tool/downloader.rb:378:in `with_retry' E, [2024-05-15T00:06:22.984466 #171953] ERROR -- : from /home/opc/ruby/src/master/tool/downloader.rb:246:in `download' E, [2024-05-15T00:06:22.984474 #171953] ERROR -- : from /home/opc/ruby/src/master/tool/downloader.rb:136:in `download' E, [2024-05-15T00:06:22.984482 #171953] ERROR -- : from /home/opc/ruby/src/master/tool/downloader.rb:482:in `block in
' E, [2024-05-15T00:06:22.984511 #171953] ERROR -- : from /home/opc/ruby/src/master/tool/downloader.rb:465:in `each' E, [2024-05-15T00:06:22.984520 #171953] ERROR -- : from /home/opc/ruby/src/master/tool/downloader.rb:465:in `
' E, [2024-05-15T00:06:22.987482 #171953] ERROR -- : make: *** [uncommon.mk:1765: /home/opc/ruby/src/master/enc/unicode/data/emoji/15.0/emoji-zwj-sequences.txt] Error 1 E, [2024-05-15T00:06:22.987521 #171953] ERROR -- : make: *** Waiting for unfinished jobs.... E, [2024-05-15T00:06:22.991937 #171953] ERROR -- : /home/opc/ruby/src/master/tool/downloader.rb:302:in `rescue in download': failed to download emoji/15.0/emoji-test.txt (RuntimeError) E, [2024-05-15T00:06:22.991996 #171953] ERROR -- : OpenURI::HTTPError: 403 Forbidden: https://www.unicode.org/Public/emoji/15.0/emoji-test.txt E, [2024-05-15T00:06:22.992007 #171953] ERROR -- : from /home/opc/ruby/src/master/tool/downloader.rb:201:in `download' E, [2024-05-15T00:06:22.992017 #171953] ERROR -- : from /home/opc/ruby/src/master/tool/downloader.rb:136:in `download' E, [2024-05-15T00:06:22.992026 #171953] ERROR -- : from /home/opc/ruby/src/master/tool/downloader.rb:482:in `block in
' E, [2024-05-15T00:06:22.992034 #171953] ERROR -- : from /home/opc/ruby/src/master/tool/downloader.rb:465:in `each' E, [2024-05-15T00:06:22.992042 #171953] ERROR -- : from /home/opc/ruby/src/master/tool/downloader.rb:465:in `
' E, [2024-05-15T00:06:22.992050 #171953] ERROR -- : /usr/local/lib/ruby/3.2.0/open-uri.rb:369:in `open_http': 403 Forbidden (OpenURI::HTTPError) E, [2024-05-15T00:06:22.992059 #171953] ERROR -- : from /usr/local/lib/ruby/3.2.0/open-uri.rb:760:in `buffer_open' E, [2024-05-15T00:06:22.992067 #171953] ERROR -- : from /usr/local/lib/ruby/3.2.0/open-uri.rb:214:in `block in open_loop' E, [2024-05-15T00:06:22.992075 #171953] ERROR -- : from /usr/local/lib/ruby/3.2.0/open-uri.rb:212:in `catch' E, [2024-05-15T00:06:22.992083 #171953] ERROR -- : from /usr/local/lib/ruby/3.2.0/open-uri.rb:212:in `open_loop' E, [2024-05-15T00:06:22.992091 #171953] ERROR -- : from /usr/local/lib/ruby/3.2.0/open-uri.rb:153:in `open_uri' E, [2024-05-15T00:06:22.992099 #171953] ERROR -- : from /usr/local/lib/ruby/3.2.0/open-uri.rb:740:in `open' E, [2024-05-15T00:06:22.992107 #171953] ERROR -- : from /usr/local/lib/ruby/3.2.0/open-uri.rb:748:in `read' E, [2024-05-15T00:06:22.992115 #171953] ERROR -- : from /home/opc/ruby/src/master/tool/downloader.rb:247:in `block in download' E, [2024-05-15T00:06:22.992123 #171953] ERROR -- : from /home/opc/ruby/src/master/tool/downloader.rb:378:in `with_retry' E, [2024-05-15T00:06:22.992131 #171953] ERROR -- : from /home/opc/ruby/src/master/tool/downloader.rb:246:in `download' E, [2024-05-15T00:06:22.992139 #171953] ERROR -- : from /home/opc/ruby/src/master/tool/downloader.rb:136:in `download' E, [2024-05-15T00:06:22.992148 #171953] ERROR -- : from /home/opc/ruby/src/master/tool/downloader.rb:482:in `block in
' E, [2024-05-15T00:06:22.992156 #171953] ERROR -- : from /home/opc/ruby/src/master/tool/downloader.rb:465:in `each' E, [2024-05-15T00:06:22.992164 #171953] ERROR -- : from /home/opc/ruby/src/master/tool/downloader.rb:465:in `
' E, [2024-05-15T00:06:22.994912 #171953] ERROR -- : make: *** [uncommon.mk:1765: /home/opc/ruby/src/master/enc/unicode/data/emoji/15.0/emoji-sequences.txt] Error 1 E, [2024-05-15T00:06:22.994937 #171953] ERROR -- : make: *** Deleting file '/home/opc/ruby/src/master/enc/unicode/data/emoji/15.0/emoji-sequences.txt' E, [2024-05-15T00:06:22.999448 #171953] ERROR -- : /home/opc/ruby/src/master/tool/downloader.rb:302:in `rescue in download': failed to download emoji/15.0/emoji-test.txt (RuntimeError) E, [2024-05-15T00:06:22.999501 #171953] ERROR -- : OpenURI::HTTPError: 403 Forbidden: https://www.unicode.org/Public/emoji/15.0/emoji-test.txt E, [2024-05-15T00:06:22.999516 #171953] ERROR -- : from /home/opc/ruby/src/master/tool/downloader.rb:201:in `download' E, [2024-05-15T00:06:22.999526 #171953] ERROR -- : from /home/opc/ruby/src/master/tool/downloader.rb:136:in `download' E, [2024-05-15T00:06:22.999535 #171953] ERROR -- : from /home/opc/ruby/src/master/tool/downloader.rb:482:in `block in
' E, [2024-05-15T00:06:22.999543 #171953] ERROR -- : from /home/opc/ruby/src/master/tool/downloader.rb:465:in `each' E, [2024-05-15T00:06:22.999552 #171953] ERROR -- : from /home/opc/ruby/src/master/tool/downloader.rb:465:in `
' E, [2024-05-15T00:06:22.999560 #171953] ERROR -- : /usr/local/lib/ruby/3.2.0/open-uri.rb:369:in `open_http': 403 Forbidden (OpenURI::HTTPError) E, [2024-05-15T00:06:22.999568 #171953] ERROR -- : from /usr/local/lib/ruby/3.2.0/open-uri.rb:760:in `buffer_open' E, [2024-05-15T00:06:22.999576 #171953] ERROR -- : from /usr/local/lib/ruby/3.2.0/open-uri.rb:214:in `block in open_loop' E, [2024-05-15T00:06:22.999584 #171953] ERROR -- : from /usr/local/lib/ruby/3.2.0/open-uri.rb:212:in `catch' E, [2024-05-15T00:06:22.999593 #171953] ERROR -- : from /usr/local/lib/ruby/3.2.0/open-uri.rb:212:in `open_loop' E, [2024-05-15T00:06:22.999601 #171953] ERROR -- : from /usr/local/lib/ruby/3.2.0/open-uri.rb:153:in `open_uri' E, [2024-05-15T00:06:22.999609 #171953] ERROR -- : from /usr/local/lib/ruby/3.2.0/open-uri.rb:740:in `open' E, [2024-05-15T00:06:22.999617 #171953] ERROR -- : from /usr/local/lib/ruby/3.2.0/open-uri.rb:748:in `read' E, [2024-05-15T00:06:22.999625 #171953] ERROR -- : from /home/opc/ruby/src/master/tool/downloader.rb:247:in `block in download' E, [2024-05-15T00:06:22.999633 #171953] ERROR -- : from /home/opc/ruby/src/master/tool/downloader.rb:378:in `with_retry' E, [2024-05-15T00:06:22.999641 #171953] ERROR -- : from /home/opc/ruby/src/master/tool/downloader.rb:246:in `download' E, [2024-05-15T00:06:22.999649 #171953] ERROR -- : from /home/opc/ruby/src/master/tool/downloader.rb:136:in `download' E, [2024-05-15T00:06:22.999657 #171953] ERROR -- : from /home/opc/ruby/src/master/tool/downloader.rb:482:in `block in
' E, [2024-05-15T00:06:22.999666 #171953] ERROR -- : from /home/opc/ruby/src/master/tool/downloader.rb:465:in `each' E, [2024-05-15T00:06:22.999674 #171953] ERROR -- : from /home/opc/ruby/src/master/tool/downloader.rb:465:in `
' E, [2024-05-15T00:06:23.002410 #171953] ERROR -- : make: *** [uncommon.mk:1765: /home/opc/ruby/src/master/enc/unicode/data/emoji/15.0/emoji-test.txt] Error 1 I, [2024-05-15T00:06:23.002548 #171953] INFO -- : downloading emoji/15.0/emoji-test.txt ... I, [2024-05-15T00:06:23.002874 #171953] INFO -- : $$$[end] "make update-unicode -j3" exit with 512. I, [2024-05-15T00:06:23.002910 #171953] INFO -- : $$$[beg] make update-download -j3 I, [2024-05-15T00:06:23.170038 #171953] INFO -- : tool/config.guess already exists I, [2024-05-15T00:06:23.170103 #171953] INFO -- : tool/config.sub already exists I, [2024-05-15T00:06:23.172808 #171953] INFO -- : Update minitest to ea9caafc0754b1d6236a490d59e624b53209734a I, [2024-05-15T00:06:23.173053 #171953] INFO -- : Update power_assert to 84e85124c5014a139af39161d484156cfe87a9ed I, [2024-05-15T00:06:23.173089 #171953] INFO -- : Update rbs to ba7872795d5de04adb8ff500c0e6afdc81a041dd I, [2024-05-15T00:06:23.176028 #171953] INFO -- : echo ea9caafc0754b1d6236a490d59e624b53209734a | /bin/sh /home/opc/ruby/src/master/tool/ifchange /home/opc/ruby/src/master/.bundle/.timestamp/minitest.revision - I, [2024-05-15T00:06:23.176219 #171953] INFO -- : echo ba7872795d5de04adb8ff500c0e6afdc81a041dd | /bin/sh /home/opc/ruby/src/master/tool/ifchange /home/opc/ruby/src/master/.bundle/.timestamp/rbs.revision - I, [2024-05-15T00:06:23.176365 #171953] INFO -- : echo 84e85124c5014a139af39161d484156cfe87a9ed | /bin/sh /home/opc/ruby/src/master/tool/ifchange /home/opc/ruby/src/master/.bundle/.timestamp/power_assert.revision - I, [2024-05-15T00:06:23.181972 #171953] INFO -- : /home/opc/ruby/src/master/.bundle/.timestamp/power_assert.revision unchanged I, [2024-05-15T00:06:23.182031 #171953] INFO -- : /home/opc/ruby/src/master/.bundle/.timestamp/minitest.revision unchanged I, [2024-05-15T00:06:23.182372 #171953] INFO -- : /home/opc/ruby/src/master/.bundle/.timestamp/rbs.revision unchanged I, [2024-05-15T00:06:23.184403 #171953] INFO -- : Update typeprof to b19a6416da3a05d57fadd6ffdadb382b6d236ca5 I, [2024-05-15T00:06:23.187415 #171953] INFO -- : echo b19a6416da3a05d57fadd6ffdadb382b6d236ca5 | /bin/sh /home/opc/ruby/src/master/tool/ifchange /home/opc/ruby/src/master/.bundle/.timestamp/typeprof.revision - I, [2024-05-15T00:06:23.192822 #171953] INFO -- : /home/opc/ruby/src/master/.bundle/.timestamp/typeprof.revision unchanged I, [2024-05-15T00:06:23.284203 #171953] INFO -- : Building power_assert@84e85124c5014a139af39161d484156cfe87a9ed to /home/opc/ruby/src/master/gems/power_assert-2.0.3.gem I, [2024-05-15T00:06:23.393357 #171953] INFO -- : Successfully built RubyGem I, [2024-05-15T00:06:23.393412 #171953] INFO -- : Name: power_assert I, [2024-05-15T00:06:23.393425 #171953] INFO -- : Version: 2.0.4dev I, [2024-05-15T00:06:23.393434 #171953] INFO -- : File: power_assert-2.0.4dev.gem I, [2024-05-15T00:06:23.473515 #171953] INFO -- : $$$[end] "make update-download -j3" exit with 0. I, [2024-05-15T00:06:23.473584 #171953] INFO -- : $$$[beg] make update-rubyspec -j3 I, [2024-05-15T00:06:23.562338 #171953] INFO -- : make: Nothing to be done for 'update-rubyspec'. I, [2024-05-15T00:06:23.562465 #171953] INFO -- : $$$[end] "make update-rubyspec -j3" exit with 0. I, [2024-05-15T00:06:23.562487 #171953] INFO -- : $$$[beg] make update-src -j3 I, [2024-05-15T00:06:24.527106 #171953] INFO -- : Already up to date. I, [2024-05-15T00:06:24.541886 #171953] INFO -- : Latest commit hash = e3e1e53098 I, [2024-05-15T00:06:24.542454 #171953] INFO -- : $$$[end] "make update-src -j3" exit with 0. I, [2024-05-15T00:06:24.542493 #171953] INFO -- : $$$[beg] make after-update -j3 I, [2024-05-15T00:06:24.644732 #171953] INFO -- : generating /home/opc/ruby/src/master/ext/ripper/eventids2table.c I, [2024-05-15T00:06:24.651162 #171953] INFO -- : make[1]: Entering directory '/home/opc/ruby/src/master/ext/ripper' I, [2024-05-15T00:06:24.651216 #171953] INFO -- : make[1]: Nothing to be done for 'src'. I, [2024-05-15T00:06:24.651227 #171953] INFO -- : make[1]: Leaving directory '/home/opc/ruby/src/master/ext/ripper' I, [2024-05-15T00:06:24.677683 #171953] INFO -- : /home/opc/ruby/src/master/revision.h updated I, [2024-05-15T00:06:24.678830 #171953] INFO -- : generating aarch64-linux-fake.rb I, [2024-05-15T00:06:24.738404 #171953] INFO -- : aarch64-linux-fake.rb updated I, [2024-05-15T00:06:24.739710 #171953] INFO -- : generating enc.mk I, [2024-05-15T00:06:24.969868 #171953] INFO -- : making srcs under enc I, [2024-05-15T00:06:25.011605 #171953] INFO -- : make[1]: Entering directory '/home/opc/ruby/build/master' I, [2024-05-15T00:06:25.011675 #171953] INFO -- : make[1]: Nothing to be done for 'srcs'. I, [2024-05-15T00:06:25.011686 #171953] INFO -- : make[1]: Leaving directory '/home/opc/ruby/build/master' I, [2024-05-15T00:06:25.091419 #171953] INFO -- : Update minitest to ea9caafc0754b1d6236a490d59e624b53209734a I, [2024-05-15T00:06:25.091683 #171953] INFO -- : Update power_assert to 84e85124c5014a139af39161d484156cfe87a9ed I, [2024-05-15T00:06:25.091822 #171953] INFO -- : Update rbs to ba7872795d5de04adb8ff500c0e6afdc81a041dd I, [2024-05-15T00:06:25.094823 #171953] INFO -- : echo ea9caafc0754b1d6236a490d59e624b53209734a | /bin/sh /home/opc/ruby/src/master/tool/ifchange /home/opc/ruby/src/master/.bundle/.timestamp/minitest.revision - I, [2024-05-15T00:06:25.095080 #171953] INFO -- : echo ba7872795d5de04adb8ff500c0e6afdc81a041dd | /bin/sh /home/opc/ruby/src/master/tool/ifchange /home/opc/ruby/src/master/.bundle/.timestamp/rbs.revision - I, [2024-05-15T00:06:25.095627 #171953] INFO -- : echo 84e85124c5014a139af39161d484156cfe87a9ed | /bin/sh /home/opc/ruby/src/master/tool/ifchange /home/opc/ruby/src/master/.bundle/.timestamp/power_assert.revision - I, [2024-05-15T00:06:25.100579 #171953] INFO -- : /home/opc/ruby/src/master/.bundle/.timestamp/rbs.revision unchanged I, [2024-05-15T00:06:25.100820 #171953] INFO -- : /home/opc/ruby/src/master/.bundle/.timestamp/power_assert.revision unchanged I, [2024-05-15T00:06:25.101082 #171953] INFO -- : /home/opc/ruby/src/master/.bundle/.timestamp/minitest.revision unchanged I, [2024-05-15T00:06:25.103653 #171953] INFO -- : Update typeprof to b19a6416da3a05d57fadd6ffdadb382b6d236ca5 I, [2024-05-15T00:06:25.106921 #171953] INFO -- : echo b19a6416da3a05d57fadd6ffdadb382b6d236ca5 | /bin/sh /home/opc/ruby/src/master/tool/ifchange /home/opc/ruby/src/master/.bundle/.timestamp/typeprof.revision - I, [2024-05-15T00:06:25.112543 #171953] INFO -- : /home/opc/ruby/src/master/.bundle/.timestamp/typeprof.revision unchanged I, [2024-05-15T00:06:25.194566 #171953] INFO -- : Building power_assert@84e85124c5014a139af39161d484156cfe87a9ed to /home/opc/ruby/src/master/gems/power_assert-2.0.3.gem I, [2024-05-15T00:06:25.302995 #171953] INFO -- : Successfully built RubyGem I, [2024-05-15T00:06:25.303070 #171953] INFO -- : Name: power_assert I, [2024-05-15T00:06:25.303090 #171953] INFO -- : Version: 2.0.4dev I, [2024-05-15T00:06:25.303107 #171953] INFO -- : File: power_assert-2.0.4dev.gem I, [2024-05-15T00:06:25.305115 #171953] INFO -- : Extracting bundle gem power_assert-2.0.3... I, [2024-05-15T00:06:25.400208 #171953] INFO -- : Try with hash version of bundled gems instead of gems/power_assert-2.0.3.gem. We don't use this gem with release version of Ruby. I, [2024-05-15T00:06:25.410842 #171953] INFO -- : Unpacked gems/power_assert-2.0.4dev.gem I, [2024-05-15T00:06:25.412761 #171953] INFO -- : $$$[end] "make after-update -j3" exit with 0. I, [2024-05-15T00:06:25.412917 #171953] INFO -- : $$$[beg] make miniruby -j3 I, [2024-05-15T00:06:25.501565 #171953] INFO -- : BASERUBY = /usr/local/bin/ruby --disable=gems I, [2024-05-15T00:06:25.501627 #171953] INFO -- : CC = gcc I, [2024-05-15T00:06:25.501639 #171953] INFO -- : LD = ld I, [2024-05-15T00:06:25.501648 #171953] INFO -- : LDSHARED = gcc -shared I, [2024-05-15T00:06:25.501659 #171953] INFO -- : CFLAGS = -O3 -fno-fast-math -ggdb3 -Wall -Wextra -Wdeprecated-declarations -Wdiv-by-zero -Wduplicated-cond -Wimplicit-function-declaration -Wimplicit-int -Wpointer-arith -Wwrite-strings -Wold-style-definition -Wimplicit-fallthrough=0 -Wmissing-noreturn -Wno-cast-function-type -Wno-constant-logical-operand -Wno-long-long -Wno-missing-field-initializers -Wno-overlength-strings -Wno-packed-bitfield-compat -Wno-parentheses-equality -Wno-self-assign -Wno-tautological-compare -Wno-unused-parameter -Wno-unused-value -Wsuggest-attribute=format -Wsuggest-attribute=noreturn -Wunused-variable -Wmisleading-indentation -Wundef I, [2024-05-15T00:06:25.501668 #171953] INFO -- : XCFLAGS = -U_FORTIFY_SOURCE -D_FORTIFY_SOURCE=2 -fstack-protector-strong -msign-return-address=all -fno-strict-overflow -fvisibility=hidden -fexcess-precision=standard -DRUBY_EXPORT -fPIE -I. -I.ext/include/aarch64-linux -I/home/opc/ruby/src/master/include -I/home/opc/ruby/src/master -I/home/opc/ruby/src/master/prism -I/home/opc/ruby/src/master/enc/unicode/15.0.0 I, [2024-05-15T00:06:25.501677 #171953] INFO -- : CPPFLAGS = I, [2024-05-15T00:06:25.501685 #171953] INFO -- : DLDFLAGS = -Wl,--compress-debug-sections=zlib -fstack-protector-strong -pie I, [2024-05-15T00:06:25.501694 #171953] INFO -- : SOLIBS = -lz -lrt -lrt -ldl -lcrypt -lm -lpthread I, [2024-05-15T00:06:25.501730 #171953] INFO -- : LANG = en_US.UTF-8 I, [2024-05-15T00:06:25.501742 #171953] INFO -- : LC_ALL = I, [2024-05-15T00:06:25.501750 #171953] INFO -- : LC_CTYPE = I, [2024-05-15T00:06:25.501757 #171953] INFO -- : MFLAGS = -j3 --jobserver-auth=4,5 I, [2024-05-15T00:06:25.501765 #171953] INFO -- : RUSTC = rustc I, [2024-05-15T00:06:25.501773 #171953] INFO -- : YJIT_RUSTC_ARGS = --crate-name=yjit --crate-type=staticlib --edition=2021 -g -C lto=thin -C opt-level=3 -C overflow-checks=on '--out-dir=/home/opc/ruby/build/master/yjit/target/release/' /home/opc/ruby/src/master/yjit/src/lib.rs I, [2024-05-15T00:06:25.502482 #171953] INFO -- : gcc (GCC) 8.5.0 20210514 (Red Hat 8.5.0-10.1.0.1) I, [2024-05-15T00:06:25.502517 #171953] INFO -- : Copyright (C) 2018 Free Software Foundation, Inc. I, [2024-05-15T00:06:25.502528 #171953] INFO -- : This is free software; see the source for copying conditions. There is NO I, [2024-05-15T00:06:25.502537 #171953] INFO -- : warranty; not even for MERCHANTABILITY or FITNESS FOR A PARTICULAR PURPOSE. I, [2024-05-15T00:06:25.502545 #171953] INFO -- : I, [2024-05-15T00:06:25.527236 #171953] INFO -- : compiling /home/opc/ruby/src/master/version.c I, [2024-05-15T00:06:25.667882 #171953] INFO -- : linking miniruby I, [2024-05-15T00:06:26.547966 #171953] INFO -- : $$$[end] "make miniruby -j3" exit with 0. I, [2024-05-15T00:06:26.548133 #171953] INFO -- : $$$[beg] make ruby -j3 I, [2024-05-15T00:06:26.638392 #171953] INFO -- : BASERUBY = /usr/local/bin/ruby --disable=gems I, [2024-05-15T00:06:26.638460 #171953] INFO -- : CC = gcc I, [2024-05-15T00:06:26.638472 #171953] INFO -- : LD = ld I, [2024-05-15T00:06:26.638481 #171953] INFO -- : LDSHARED = gcc -shared I, [2024-05-15T00:06:26.638490 #171953] INFO -- : CFLAGS = -O3 -fno-fast-math -ggdb3 -Wall -Wextra -Wdeprecated-declarations -Wdiv-by-zero -Wduplicated-cond -Wimplicit-function-declaration -Wimplicit-int -Wpointer-arith -Wwrite-strings -Wold-style-definition -Wimplicit-fallthrough=0 -Wmissing-noreturn -Wno-cast-function-type -Wno-constant-logical-operand -Wno-long-long -Wno-missing-field-initializers -Wno-overlength-strings -Wno-packed-bitfield-compat -Wno-parentheses-equality -Wno-self-assign -Wno-tautological-compare -Wno-unused-parameter -Wno-unused-value -Wsuggest-attribute=format -Wsuggest-attribute=noreturn -Wunused-variable -Wmisleading-indentation -Wundef I, [2024-05-15T00:06:26.638501 #171953] INFO -- : XCFLAGS = -U_FORTIFY_SOURCE -D_FORTIFY_SOURCE=2 -fstack-protector-strong -msign-return-address=all -fno-strict-overflow -fvisibility=hidden -fexcess-precision=standard -DRUBY_EXPORT -fPIE -I. -I.ext/include/aarch64-linux -I/home/opc/ruby/src/master/include -I/home/opc/ruby/src/master -I/home/opc/ruby/src/master/prism -I/home/opc/ruby/src/master/enc/unicode/15.0.0 I, [2024-05-15T00:06:26.638510 #171953] INFO -- : CPPFLAGS = I, [2024-05-15T00:06:26.638518 #171953] INFO -- : DLDFLAGS = -Wl,--compress-debug-sections=zlib -fstack-protector-strong -pie I, [2024-05-15T00:06:26.638527 #171953] INFO -- : SOLIBS = -lz -lrt -lrt -ldl -lcrypt -lm -lpthread I, [2024-05-15T00:06:26.638535 #171953] INFO -- : LANG = en_US.UTF-8 I, [2024-05-15T00:06:26.638543 #171953] INFO -- : LC_ALL = I, [2024-05-15T00:06:26.638550 #171953] INFO -- : LC_CTYPE = I, [2024-05-15T00:06:26.638558 #171953] INFO -- : MFLAGS = -j3 --jobserver-auth=4,5 I, [2024-05-15T00:06:26.638566 #171953] INFO -- : RUSTC = rustc I, [2024-05-15T00:06:26.638574 #171953] INFO -- : YJIT_RUSTC_ARGS = --crate-name=yjit --crate-type=staticlib --edition=2021 -g -C lto=thin -C opt-level=3 -C overflow-checks=on '--out-dir=/home/opc/ruby/build/master/yjit/target/release/' /home/opc/ruby/src/master/yjit/src/lib.rs I, [2024-05-15T00:06:26.639294 #171953] INFO -- : gcc (GCC) 8.5.0 20210514 (Red Hat 8.5.0-10.1.0.1) I, [2024-05-15T00:06:26.639335 #171953] INFO -- : Copyright (C) 2018 Free Software Foundation, Inc. I, [2024-05-15T00:06:26.639345 #171953] INFO -- : This is free software; see the source for copying conditions. There is NO I, [2024-05-15T00:06:26.639358 #171953] INFO -- : warranty; not even for MERCHANTABILITY or FITNESS FOR A PARTICULAR PURPOSE. I, [2024-05-15T00:06:26.639367 #171953] INFO -- : I, [2024-05-15T00:06:26.820168 #171953] INFO -- : builtin_binary.inc updated I, [2024-05-15T00:06:26.824525 #171953] INFO -- : c5234a9416e4f20f175185e840b25b0f08674d14078ed7083f37e655458e3ca9 builtin_binary.inc I, [2024-05-15T00:06:26.825756 #171953] INFO -- : compiling /home/opc/ruby/src/master/builtin.c I, [2024-05-15T00:06:27.148809 #171953] INFO -- : linking static-library libruby-static.a I, [2024-05-15T00:06:30.779921 #171953] INFO -- : linking ruby I, [2024-05-15T00:06:31.690507 #171953] INFO -- : $$$[end] "make ruby -j3" exit with 0. I, [2024-05-15T00:06:31.690672 #171953] INFO -- : $$$[beg] make all -j3 I, [2024-05-15T00:06:31.778650 #171953] INFO -- : BASERUBY = /usr/local/bin/ruby --disable=gems I, [2024-05-15T00:06:31.778716 #171953] INFO -- : CC = gcc I, [2024-05-15T00:06:31.778728 #171953] INFO -- : LD = ld I, [2024-05-15T00:06:31.778740 #171953] INFO -- : LDSHARED = gcc -shared I, [2024-05-15T00:06:31.778750 #171953] INFO -- : CFLAGS = -O3 -fno-fast-math -ggdb3 -Wall -Wextra -Wdeprecated-declarations -Wdiv-by-zero -Wduplicated-cond -Wimplicit-function-declaration -Wimplicit-int -Wpointer-arith -Wwrite-strings -Wold-style-definition -Wimplicit-fallthrough=0 -Wmissing-noreturn -Wno-cast-function-type -Wno-constant-logical-operand -Wno-long-long -Wno-missing-field-initializers -Wno-overlength-strings -Wno-packed-bitfield-compat -Wno-parentheses-equality -Wno-self-assign -Wno-tautological-compare -Wno-unused-parameter -Wno-unused-value -Wsuggest-attribute=format -Wsuggest-attribute=noreturn -Wunused-variable -Wmisleading-indentation -Wundef I, [2024-05-15T00:06:31.778759 #171953] INFO -- : XCFLAGS = -U_FORTIFY_SOURCE -D_FORTIFY_SOURCE=2 -fstack-protector-strong -msign-return-address=all -fno-strict-overflow -fvisibility=hidden -fexcess-precision=standard -DRUBY_EXPORT -fPIE -I. -I.ext/include/aarch64-linux -I/home/opc/ruby/src/master/include -I/home/opc/ruby/src/master -I/home/opc/ruby/src/master/prism -I/home/opc/ruby/src/master/enc/unicode/15.0.0 I, [2024-05-15T00:06:31.778768 #171953] INFO -- : CPPFLAGS = I, [2024-05-15T00:06:31.778776 #171953] INFO -- : DLDFLAGS = -Wl,--compress-debug-sections=zlib -fstack-protector-strong -pie I, [2024-05-15T00:06:31.778785 #171953] INFO -- : SOLIBS = -lz -lrt -lrt -ldl -lcrypt -lm -lpthread I, [2024-05-15T00:06:31.778793 #171953] INFO -- : LANG = en_US.UTF-8 I, [2024-05-15T00:06:31.778801 #171953] INFO -- : LC_ALL = I, [2024-05-15T00:06:31.778809 #171953] INFO -- : LC_CTYPE = I, [2024-05-15T00:06:31.778817 #171953] INFO -- : MFLAGS = -j3 --jobserver-auth=4,5 I, [2024-05-15T00:06:31.778824 #171953] INFO -- : RUSTC = rustc I, [2024-05-15T00:06:31.778833 #171953] INFO -- : YJIT_RUSTC_ARGS = --crate-name=yjit --crate-type=staticlib --edition=2021 -g -C lto=thin -C opt-level=3 -C overflow-checks=on '--out-dir=/home/opc/ruby/build/master/yjit/target/release/' /home/opc/ruby/src/master/yjit/src/lib.rs I, [2024-05-15T00:06:31.779617 #171953] INFO -- : gcc (GCC) 8.5.0 20210514 (Red Hat 8.5.0-10.1.0.1) I, [2024-05-15T00:06:31.779656 #171953] INFO -- : Copyright (C) 2018 Free Software Foundation, Inc. I, [2024-05-15T00:06:31.779667 #171953] INFO -- : This is free software; see the source for copying conditions. There is NO I, [2024-05-15T00:06:31.779676 #171953] INFO -- : warranty; not even for MERCHANTABILITY or FITNESS FOR A PARTICULAR PURPOSE. I, [2024-05-15T00:06:31.779684 #171953] INFO -- : I, [2024-05-15T00:06:31.811982 #171953] INFO -- : generating encdb.h I, [2024-05-15T00:06:31.813403 #171953] INFO -- : generating enc.mk I, [2024-05-15T00:06:31.850283 #171953] INFO -- : encdb.h unchanged I, [2024-05-15T00:06:32.045430 #171953] INFO -- : making srcs under enc I, [2024-05-15T00:06:32.045500 #171953] INFO -- : making enc I, [2024-05-15T00:06:32.073026 #171953] INFO -- : make[1]: Entering directory '/home/opc/ruby/build/master' I, [2024-05-15T00:06:32.073113 #171953] INFO -- : make[1]: Nothing to be done for 'enc'. I, [2024-05-15T00:06:32.073164 #171953] INFO -- : make[1]: Leaving directory '/home/opc/ruby/build/master' I, [2024-05-15T00:06:32.087625 #171953] INFO -- : make[1]: Entering directory '/home/opc/ruby/build/master' I, [2024-05-15T00:06:32.087671 #171953] INFO -- : make[1]: Nothing to be done for 'srcs'. I, [2024-05-15T00:06:32.087681 #171953] INFO -- : make[1]: Leaving directory '/home/opc/ruby/build/master' I, [2024-05-15T00:06:32.088434 #171953] INFO -- : generating transdb.h I, [2024-05-15T00:06:32.230979 #171953] INFO -- : transdb.h unchanged I, [2024-05-15T00:06:32.232327 #171953] INFO -- : generating makefiles ext/configure-ext.mk I, [2024-05-15T00:06:32.232527 #171953] INFO -- : making trans I, [2024-05-15T00:06:32.273575 #171953] INFO -- : ext/configure-ext.mk updated I, [2024-05-15T00:06:32.276897 #171953] INFO -- : make[1]: Entering directory '/home/opc/ruby/build/master' I, [2024-05-15T00:06:32.281637 #171953] INFO -- : make[1]: Entering directory '/home/opc/ruby/build/master' I, [2024-05-15T00:06:32.281695 #171953] INFO -- : make[1]: Nothing to be done for 'trans'. I, [2024-05-15T00:06:32.281706 #171953] INFO -- : make[1]: Leaving directory '/home/opc/ruby/build/master' I, [2024-05-15T00:06:32.964360 #171953] INFO -- : making encs I, [2024-05-15T00:06:32.999716 #171953] INFO -- : make[1]: Leaving directory '/home/opc/ruby/build/master' I, [2024-05-15T00:06:33.000403 #171953] INFO -- : generating makefile exts.mk I, [2024-05-15T00:06:33.017759 #171953] INFO -- : make[1]: Entering directory '/home/opc/ruby/build/master' I, [2024-05-15T00:06:33.017812 #171953] INFO -- : make[1]: Nothing to be done for 'encs'. I, [2024-05-15T00:06:33.017824 #171953] INFO -- : make[1]: Leaving directory '/home/opc/ruby/build/master' I, [2024-05-15T00:06:33.059140 #171953] INFO -- : exts.mk unchanged I, [2024-05-15T00:06:33.063944 #171953] INFO -- : make[1]: Entering directory '/home/opc/ruby/build/master' I, [2024-05-15T00:06:33.170213 #171953] INFO -- : make[2]: Entering directory '/home/opc/ruby/build/master/ext/coverage' I, [2024-05-15T00:06:33.171362 #171953] INFO -- : make[2]: Entering directory '/home/opc/ruby/build/master/ext/date' I, [2024-05-15T00:06:33.171547 #171953] INFO -- : make[2]: Entering directory '/home/opc/ruby/build/master/ext/digest' I, [2024-05-15T00:06:33.174898 #171953] INFO -- : make[2]: Leaving directory '/home/opc/ruby/build/master/ext/coverage' I, [2024-05-15T00:06:33.177393 #171953] INFO -- : make[2]: Leaving directory '/home/opc/ruby/build/master/ext/date' I, [2024-05-15T00:06:33.179777 #171953] INFO -- : make[2]: Leaving directory '/home/opc/ruby/build/master/ext/digest' I, [2024-05-15T00:06:33.186251 #171953] INFO -- : make[2]: Entering directory '/home/opc/ruby/build/master/ext/io/console' I, [2024-05-15T00:06:33.186815 #171953] INFO -- : make[2]: Entering directory '/home/opc/ruby/build/master/ext/fiddle' I, [2024-05-15T00:06:33.192912 #171953] INFO -- : make[2]: Leaving directory '/home/opc/ruby/build/master/ext/io/console' I, [2024-05-15T00:06:33.193922 #171953] INFO -- : make[2]: Entering directory '/home/opc/ruby/build/master/ext/json' I, [2024-05-15T00:06:33.197002 #171953] INFO -- : make[2]: Entering directory '/home/opc/ruby/build/master/ext/monitor' I, [2024-05-15T00:06:33.197040 #171953] INFO -- : make[2]: Leaving directory '/home/opc/ruby/build/master/ext/fiddle' I, [2024-05-15T00:06:33.200960 #171953] INFO -- : make[2]: Leaving directory '/home/opc/ruby/build/master/ext/monitor' I, [2024-05-15T00:06:33.203558 #171953] INFO -- : make[2]: Leaving directory '/home/opc/ruby/build/master/ext/json' I, [2024-05-15T00:06:33.203867 #171953] INFO -- : make[2]: Entering directory '/home/opc/ruby/build/master/ext/objspace' I, [2024-05-15T00:06:33.207529 #171953] INFO -- : make[2]: Entering directory '/home/opc/ruby/build/master/ext/pathname' I, [2024-05-15T00:06:33.212526 #171953] INFO -- : make[2]: Leaving directory '/home/opc/ruby/build/master/ext/pathname' I, [2024-05-15T00:06:33.212978 #171953] INFO -- : make[2]: Leaving directory '/home/opc/ruby/build/master/ext/objspace' I, [2024-05-15T00:06:33.217410 #171953] INFO -- : make[2]: Entering directory '/home/opc/ruby/build/master/ext/pty' I, [2024-05-15T00:06:33.218879 #171953] INFO -- : make[2]: Entering directory '/home/opc/ruby/build/master/ext/psych' I, [2024-05-15T00:06:33.222099 #171953] INFO -- : make[2]: Entering directory '/home/opc/ruby/build/master/ext/openssl' I, [2024-05-15T00:06:33.224528 #171953] INFO -- : make[2]: Leaving directory '/home/opc/ruby/build/master/ext/pty' I, [2024-05-15T00:06:33.232696 #171953] INFO -- : make[2]: Leaving directory '/home/opc/ruby/build/master/ext/psych' I, [2024-05-15T00:06:33.238034 #171953] INFO -- : make[2]: Entering directory '/home/opc/ruby/build/master/ext/rubyvm' I, [2024-05-15T00:06:33.240757 #171953] INFO -- : make[2]: Entering directory '/home/opc/ruby/build/master/ext/ripper' I, [2024-05-15T00:06:33.241953 #171953] INFO -- : make[2]: Leaving directory '/home/opc/ruby/build/master/ext/rubyvm' I, [2024-05-15T00:06:33.246744 #171953] INFO -- : make[2]: Leaving directory '/home/opc/ruby/build/master/ext/openssl' I, [2024-05-15T00:06:33.248224 #171953] INFO -- : make[2]: Leaving directory '/home/opc/ruby/build/master/ext/ripper' I, [2024-05-15T00:06:33.255172 #171953] INFO -- : make[2]: Entering directory '/home/opc/ruby/build/master/.bundle/gems/bigdecimal-3.1.7/ext/bigdecimal' I, [2024-05-15T00:06:33.256155 #171953] INFO -- : make[2]: Entering directory '/home/opc/ruby/build/master/ext/socket' I, [2024-05-15T00:06:33.258174 #171953] INFO -- : make[2]: Entering directory '/home/opc/ruby/build/master/.bundle/gems/bigdecimal-3.1.8/ext/bigdecimal' I, [2024-05-15T00:06:33.266945 #171953] INFO -- : make[2]: Leaving directory '/home/opc/ruby/build/master/ext/socket' I, [2024-05-15T00:06:33.269486 #171953] INFO -- : make[2]: Entering directory '/home/opc/ruby/build/master/.bundle/gems/debug-1.9.2/ext/debug' I, [2024-05-15T00:06:33.287082 #171953] INFO -- : make[2]: Leaving directory '/home/opc/ruby/build/master/.bundle/gems/bigdecimal-3.1.7/ext/bigdecimal' I, [2024-05-15T00:06:33.289550 #171953] INFO -- : make[2]: Leaving directory '/home/opc/ruby/build/master/.bundle/gems/bigdecimal-3.1.8/ext/bigdecimal' I, [2024-05-15T00:06:33.289824 #171953] INFO -- : make[2]: Entering directory '/home/opc/ruby/build/master/.bundle/gems/nkf-0.2.0/ext/nkf' I, [2024-05-15T00:06:33.291838 #171953] INFO -- : make[2]: Entering directory '/home/opc/ruby/build/master/.bundle/gems/racc-1.7.3/ext/racc/cparse' I, [2024-05-15T00:06:33.302517 #171953] INFO -- : make[2]: Leaving directory '/home/opc/ruby/build/master/.bundle/gems/debug-1.9.2/ext/debug' I, [2024-05-15T00:06:33.305590 #171953] INFO -- : make[2]: Entering directory '/home/opc/ruby/build/master/.bundle/gems/rbs-3.4.4/ext/rbs_extension' I, [2024-05-15T00:06:33.320966 #171953] INFO -- : make[2]: Leaving directory '/home/opc/ruby/build/master/.bundle/gems/nkf-0.2.0/ext/nkf' I, [2024-05-15T00:06:33.322519 #171953] INFO -- : make[2]: Leaving directory '/home/opc/ruby/build/master/.bundle/gems/racc-1.7.3/ext/racc/cparse' I, [2024-05-15T00:06:33.324252 #171953] INFO -- : make[2]: Entering directory '/home/opc/ruby/build/master/.bundle/gems/syslog-0.1.2/ext/syslog' I, [2024-05-15T00:06:33.341160 #171953] INFO -- : make[2]: Leaving directory '/home/opc/ruby/build/master/.bundle/gems/rbs-3.4.4/ext/rbs_extension' I, [2024-05-15T00:06:33.345981 #171953] INFO -- : make[2]: Entering directory '/home/opc/ruby/build/master/ext/digest/sha2' I, [2024-05-15T00:06:33.352320 #171953] INFO -- : make[2]: Leaving directory '/home/opc/ruby/build/master/ext/digest/sha2' I, [2024-05-15T00:06:33.357325 #171953] INFO -- : make[2]: Leaving directory '/home/opc/ruby/build/master/.bundle/gems/syslog-0.1.2/ext/syslog' I, [2024-05-15T00:06:33.395550 #171953] INFO -- : make[2]: Entering directory '/home/opc/ruby/build/master' I, [2024-05-15T00:06:33.478108 #171953] INFO -- : make[2]: 'ruby' is up to date. I, [2024-05-15T00:06:33.478181 #171953] INFO -- : make[2]: Leaving directory '/home/opc/ruby/build/master' I, [2024-05-15T00:06:33.478301 #171953] INFO -- : make[1]: Leaving directory '/home/opc/ruby/build/master' I, [2024-05-15T00:06:33.483468 #171953] INFO -- : make[1]: Entering directory '/home/opc/ruby/build/master' I, [2024-05-15T00:06:33.483522 #171953] INFO -- : make[1]: Nothing to be done for 'note'. I, [2024-05-15T00:06:33.483533 #171953] INFO -- : make[1]: Leaving directory '/home/opc/ruby/build/master' I, [2024-05-15T00:06:33.483798 #171953] INFO -- : $$$[end] "make all -j3" exit with 0. I, [2024-05-15T00:06:33.483932 #171953] INFO -- : $$$[beg] make install -j3 I, [2024-05-15T00:06:33.577297 #171953] INFO -- : Update minitest to ea9caafc0754b1d6236a490d59e624b53209734a I, [2024-05-15T00:06:33.577427 #171953] INFO -- : Update power_assert to 84e85124c5014a139af39161d484156cfe87a9ed I, [2024-05-15T00:06:33.577682 #171953] INFO -- : Update rbs to ba7872795d5de04adb8ff500c0e6afdc81a041dd I, [2024-05-15T00:06:33.580956 #171953] INFO -- : echo ea9caafc0754b1d6236a490d59e624b53209734a | /bin/sh /home/opc/ruby/src/master/tool/ifchange /home/opc/ruby/src/master/.bundle/.timestamp/minitest.revision - I, [2024-05-15T00:06:33.581770 #171953] INFO -- : echo 84e85124c5014a139af39161d484156cfe87a9ed | /bin/sh /home/opc/ruby/src/master/tool/ifchange /home/opc/ruby/src/master/.bundle/.timestamp/power_assert.revision - I, [2024-05-15T00:06:33.582135 #171953] INFO -- : echo ba7872795d5de04adb8ff500c0e6afdc81a041dd | /bin/sh /home/opc/ruby/src/master/tool/ifchange /home/opc/ruby/src/master/.bundle/.timestamp/rbs.revision - I, [2024-05-15T00:06:33.587239 #171953] INFO -- : /home/opc/ruby/src/master/.bundle/.timestamp/minitest.revision unchanged I, [2024-05-15T00:06:33.587800 #171953] INFO -- : /home/opc/ruby/src/master/.bundle/.timestamp/power_assert.revision unchanged I, [2024-05-15T00:06:33.589718 #171953] INFO -- : /home/opc/ruby/src/master/.bundle/.timestamp/rbs.revision unchanged I, [2024-05-15T00:06:33.590415 #171953] INFO -- : Update typeprof to b19a6416da3a05d57fadd6ffdadb382b6d236ca5 I, [2024-05-15T00:06:33.596620 #171953] INFO -- : BASERUBY = /usr/local/bin/ruby --disable=gems I, [2024-05-15T00:06:33.596665 #171953] INFO -- : CC = gcc I, [2024-05-15T00:06:33.596676 #171953] INFO -- : LD = ld I, [2024-05-15T00:06:33.596685 #171953] INFO -- : LDSHARED = gcc -shared I, [2024-05-15T00:06:33.596694 #171953] INFO -- : CFLAGS = -O3 -fno-fast-math -ggdb3 -Wall -Wextra -Wdeprecated-declarations -Wdiv-by-zero -Wduplicated-cond -Wimplicit-function-declaration -Wimplicit-int -Wpointer-arith -Wwrite-strings -Wold-style-definition -Wimplicit-fallthrough=0 -Wmissing-noreturn -Wno-cast-function-type -Wno-constant-logical-operand -Wno-long-long -Wno-missing-field-initializers -Wno-overlength-strings -Wno-packed-bitfield-compat -Wno-parentheses-equality -Wno-self-assign -Wno-tautological-compare -Wno-unused-parameter -Wno-unused-value -Wsuggest-attribute=format -Wsuggest-attribute=noreturn -Wunused-variable -Wmisleading-indentation -Wundef I, [2024-05-15T00:06:33.596703 #171953] INFO -- : XCFLAGS = -U_FORTIFY_SOURCE -D_FORTIFY_SOURCE=2 -fstack-protector-strong -msign-return-address=all -fno-strict-overflow -fvisibility=hidden -fexcess-precision=standard -DRUBY_EXPORT -fPIE -I. -I.ext/include/aarch64-linux -I/home/opc/ruby/src/master/include -I/home/opc/ruby/src/master -I/home/opc/ruby/src/master/prism -I/home/opc/ruby/src/master/enc/unicode/15.0.0 I, [2024-05-15T00:06:33.596712 #171953] INFO -- : CPPFLAGS = I, [2024-05-15T00:06:33.596720 #171953] INFO -- : DLDFLAGS = -Wl,--compress-debug-sections=zlib -fstack-protector-strong -pie I, [2024-05-15T00:06:33.596729 #171953] INFO -- : SOLIBS = -lz -lrt -lrt -ldl -lcrypt -lm -lpthread I, [2024-05-15T00:06:33.596737 #171953] INFO -- : LANG = en_US.UTF-8 I, [2024-05-15T00:06:33.596744 #171953] INFO -- : LC_ALL = I, [2024-05-15T00:06:33.596752 #171953] INFO -- : LC_CTYPE = I, [2024-05-15T00:06:33.596760 #171953] INFO -- : MFLAGS = -j3 --jobserver-auth=4,5 I, [2024-05-15T00:06:33.596767 #171953] INFO -- : RUSTC = rustc I, [2024-05-15T00:06:33.596778 #171953] INFO -- : YJIT_RUSTC_ARGS = --crate-name=yjit --crate-type=staticlib --edition=2021 -g -C lto=thin -C opt-level=3 -C overflow-checks=on '--out-dir=/home/opc/ruby/build/master/yjit/target/release/' /home/opc/ruby/src/master/yjit/src/lib.rs I, [2024-05-15T00:06:33.624896 #171953] INFO -- : echo b19a6416da3a05d57fadd6ffdadb382b6d236ca5 | /bin/sh /home/opc/ruby/src/master/tool/ifchange /home/opc/ruby/src/master/.bundle/.timestamp/typeprof.revision - I, [2024-05-15T00:06:33.625863 #171953] INFO -- : gcc (GCC) 8.5.0 20210514 (Red Hat 8.5.0-10.1.0.1) I, [2024-05-15T00:06:33.625898 #171953] INFO -- : Copyright (C) 2018 Free Software Foundation, Inc. I, [2024-05-15T00:06:33.625908 #171953] INFO -- : This is free software; see the source for copying conditions. There is NO I, [2024-05-15T00:06:33.625917 #171953] INFO -- : warranty; not even for MERCHANTABILITY or FITNESS FOR A PARTICULAR PURPOSE. I, [2024-05-15T00:06:33.625925 #171953] INFO -- : I, [2024-05-15T00:06:33.626589 #171953] INFO -- : generating encdb.h I, [2024-05-15T00:06:33.628274 #171953] INFO -- : generating enc.mk I, [2024-05-15T00:06:33.632942 #171953] INFO -- : /home/opc/ruby/src/master/.bundle/.timestamp/typeprof.revision unchanged I, [2024-05-15T00:06:33.663751 #171953] INFO -- : encdb.h unchanged I, [2024-05-15T00:06:33.755523 #171953] INFO -- : Building power_assert@84e85124c5014a139af39161d484156cfe87a9ed to /home/opc/ruby/src/master/gems/power_assert-2.0.3.gem I, [2024-05-15T00:06:33.871456 #171953] INFO -- : Successfully built RubyGem I, [2024-05-15T00:06:33.871514 #171953] INFO -- : Name: power_assert I, [2024-05-15T00:06:33.871525 #171953] INFO -- : Version: 2.0.4dev I, [2024-05-15T00:06:33.871534 #171953] INFO -- : File: power_assert-2.0.4dev.gem I, [2024-05-15T00:06:33.873833 #171953] INFO -- : Extracting bundle gem power_assert-2.0.3... I, [2024-05-15T00:06:33.876884 #171953] INFO -- : making srcs under enc I, [2024-05-15T00:06:33.877172 #171953] INFO -- : making enc I, [2024-05-15T00:06:33.906176 #171953] INFO -- : make[1]: Entering directory '/home/opc/ruby/build/master' I, [2024-05-15T00:06:33.906245 #171953] INFO -- : make[1]: Nothing to be done for 'enc'. I, [2024-05-15T00:06:33.906278 #171953] INFO -- : make[1]: Leaving directory '/home/opc/ruby/build/master' I, [2024-05-15T00:06:33.919232 #171953] INFO -- : make[1]: Entering directory '/home/opc/ruby/build/master' I, [2024-05-15T00:06:33.919285 #171953] INFO -- : make[1]: Nothing to be done for 'srcs'. I, [2024-05-15T00:06:33.919297 #171953] INFO -- : make[1]: Leaving directory '/home/opc/ruby/build/master' I, [2024-05-15T00:06:33.920062 #171953] INFO -- : generating transdb.h I, [2024-05-15T00:06:33.971070 #171953] INFO -- : Try with hash version of bundled gems instead of gems/power_assert-2.0.3.gem. We don't use this gem with release version of Ruby. I, [2024-05-15T00:06:33.981252 #171953] INFO -- : Unpacked gems/power_assert-2.0.4dev.gem I, [2024-05-15T00:06:34.068857 #171953] INFO -- : transdb.h unchanged I, [2024-05-15T00:06:34.070207 #171953] INFO -- : generating makefiles ext/configure-ext.mk I, [2024-05-15T00:06:34.070338 #171953] INFO -- : making trans I, [2024-05-15T00:06:34.110176 #171953] INFO -- : ext/configure-ext.mk unchanged I, [2024-05-15T00:06:34.113005 #171953] INFO -- : make[1]: Entering directory '/home/opc/ruby/build/master' I, [2024-05-15T00:06:34.118581 #171953] INFO -- : make[1]: Entering directory '/home/opc/ruby/build/master' I, [2024-05-15T00:06:34.118635 #171953] INFO -- : make[1]: Nothing to be done for 'trans'. I, [2024-05-15T00:06:34.118647 #171953] INFO -- : make[1]: Leaving directory '/home/opc/ruby/build/master' I, [2024-05-15T00:06:34.236069 #171953] INFO -- : making encs I, [2024-05-15T00:06:34.289416 #171953] INFO -- : make[1]: Entering directory '/home/opc/ruby/build/master' I, [2024-05-15T00:06:34.289502 #171953] INFO -- : make[1]: Nothing to be done for 'encs'. I, [2024-05-15T00:06:34.289536 #171953] INFO -- : make[1]: Leaving directory '/home/opc/ruby/build/master' I, [2024-05-15T00:06:34.849523 #171953] INFO -- : make[1]: Leaving directory '/home/opc/ruby/build/master' I, [2024-05-15T00:06:34.850193 #171953] INFO -- : generating makefile exts.mk I, [2024-05-15T00:06:34.909169 #171953] INFO -- : exts.mk unchanged I, [2024-05-15T00:06:34.914036 #171953] INFO -- : make[1]: Entering directory '/home/opc/ruby/build/master' I, [2024-05-15T00:06:35.018000 #171953] INFO -- : make[2]: Entering directory '/home/opc/ruby/build/master/ext/coverage' I, [2024-05-15T00:06:35.019774 #171953] INFO -- : make[2]: Entering directory '/home/opc/ruby/build/master/ext/digest' I, [2024-05-15T00:06:35.021601 #171953] INFO -- : make[2]: Entering directory '/home/opc/ruby/build/master/ext/date' I, [2024-05-15T00:06:35.024269 #171953] INFO -- : make[2]: Leaving directory '/home/opc/ruby/build/master/ext/coverage' I, [2024-05-15T00:06:35.029285 #171953] INFO -- : make[2]: Leaving directory '/home/opc/ruby/build/master/ext/date' I, [2024-05-15T00:06:35.029699 #171953] INFO -- : make[2]: Leaving directory '/home/opc/ruby/build/master/ext/digest' I, [2024-05-15T00:06:35.036894 #171953] INFO -- : make[2]: Entering directory '/home/opc/ruby/build/master/ext/fiddle' I, [2024-05-15T00:06:35.037714 #171953] INFO -- : make[2]: Entering directory '/home/opc/ruby/build/master/ext/io/console' I, [2024-05-15T00:06:35.043298 #171953] INFO -- : make[2]: Leaving directory '/home/opc/ruby/build/master/ext/io/console' I, [2024-05-15T00:06:35.044316 #171953] INFO -- : make[2]: Entering directory '/home/opc/ruby/build/master/ext/json' I, [2024-05-15T00:06:35.047640 #171953] INFO -- : make[2]: Leaving directory '/home/opc/ruby/build/master/ext/fiddle' I, [2024-05-15T00:06:35.048622 #171953] INFO -- : make[2]: Entering directory '/home/opc/ruby/build/master/ext/monitor' I, [2024-05-15T00:06:35.053717 #171953] INFO -- : make[2]: Entering directory '/home/opc/ruby/build/master/ext/objspace' I, [2024-05-15T00:06:35.054034 #171953] INFO -- : make[2]: Leaving directory '/home/opc/ruby/build/master/ext/json' I, [2024-05-15T00:06:35.055324 #171953] INFO -- : make[2]: Leaving directory '/home/opc/ruby/build/master/ext/monitor' I, [2024-05-15T00:06:35.059361 #171953] INFO -- : make[2]: Entering directory '/home/opc/ruby/build/master/ext/pathname' I, [2024-05-15T00:06:35.062938 #171953] INFO -- : make[2]: Leaving directory '/home/opc/ruby/build/master/ext/pathname' I, [2024-05-15T00:06:35.066530 #171953] INFO -- : make[2]: Leaving directory '/home/opc/ruby/build/master/ext/objspace' I, [2024-05-15T00:06:35.069110 #171953] INFO -- : make[2]: Entering directory '/home/opc/ruby/build/master/ext/psych' I, [2024-05-15T00:06:35.070789 #171953] INFO -- : make[2]: Entering directory '/home/opc/ruby/build/master/ext/pty' I, [2024-05-15T00:06:35.073506 #171953] INFO -- : make[2]: Entering directory '/home/opc/ruby/build/master/ext/openssl' I, [2024-05-15T00:06:35.075070 #171953] INFO -- : make[2]: Leaving directory '/home/opc/ruby/build/master/ext/pty' I, [2024-05-15T00:06:35.089538 #171953] INFO -- : make[2]: Entering directory '/home/opc/ruby/build/master/ext/ripper' I, [2024-05-15T00:06:35.090909 #171953] INFO -- : make[2]: Leaving directory '/home/opc/ruby/build/master/ext/psych' I, [2024-05-15T00:06:35.092799 #171953] INFO -- : make[2]: Entering directory '/home/opc/ruby/build/master/ext/rubyvm' I, [2024-05-15T00:06:35.095161 #171953] INFO -- : make[2]: Leaving directory '/home/opc/ruby/build/master/ext/openssl' I, [2024-05-15T00:06:35.096282 #171953] INFO -- : make[2]: Leaving directory '/home/opc/ruby/build/master/ext/rubyvm' I, [2024-05-15T00:06:35.097364 #171953] INFO -- : make[2]: Leaving directory '/home/opc/ruby/build/master/ext/ripper' I, [2024-05-15T00:06:35.103730 #171953] INFO -- : make[2]: Entering directory '/home/opc/ruby/build/master/.bundle/gems/bigdecimal-3.1.7/ext/bigdecimal' I, [2024-05-15T00:06:35.107260 #171953] INFO -- : make[2]: Entering directory '/home/opc/ruby/build/master/ext/socket' I, [2024-05-15T00:06:35.107510 #171953] INFO -- : make[2]: Entering directory '/home/opc/ruby/build/master/.bundle/gems/bigdecimal-3.1.8/ext/bigdecimal' I, [2024-05-15T00:06:35.118710 #171953] INFO -- : make[2]: Leaving directory '/home/opc/ruby/build/master/ext/socket' I, [2024-05-15T00:06:35.121359 #171953] INFO -- : make[2]: Entering directory '/home/opc/ruby/build/master/.bundle/gems/debug-1.9.2/ext/debug' I, [2024-05-15T00:06:35.134939 #171953] INFO -- : make[2]: Leaving directory '/home/opc/ruby/build/master/.bundle/gems/bigdecimal-3.1.7/ext/bigdecimal' I, [2024-05-15T00:06:35.138164 #171953] INFO -- : make[2]: Entering directory '/home/opc/ruby/build/master/.bundle/gems/nkf-0.2.0/ext/nkf' I, [2024-05-15T00:06:35.140046 #171953] INFO -- : make[2]: Leaving directory '/home/opc/ruby/build/master/.bundle/gems/bigdecimal-3.1.8/ext/bigdecimal' I, [2024-05-15T00:06:35.142685 #171953] INFO -- : make[2]: Entering directory '/home/opc/ruby/build/master/.bundle/gems/racc-1.7.3/ext/racc/cparse' I, [2024-05-15T00:06:35.152777 #171953] INFO -- : make[2]: Leaving directory '/home/opc/ruby/build/master/.bundle/gems/debug-1.9.2/ext/debug' I, [2024-05-15T00:06:35.155782 #171953] INFO -- : make[2]: Entering directory '/home/opc/ruby/build/master/.bundle/gems/rbs-3.4.4/ext/rbs_extension' I, [2024-05-15T00:06:35.169980 #171953] INFO -- : make[2]: Leaving directory '/home/opc/ruby/build/master/.bundle/gems/nkf-0.2.0/ext/nkf' I, [2024-05-15T00:06:35.172773 #171953] INFO -- : make[2]: Entering directory '/home/opc/ruby/build/master/.bundle/gems/syslog-0.1.2/ext/syslog' I, [2024-05-15T00:06:35.173664 #171953] INFO -- : make[2]: Leaving directory '/home/opc/ruby/build/master/.bundle/gems/racc-1.7.3/ext/racc/cparse' I, [2024-05-15T00:06:35.188233 #171953] INFO -- : make[2]: Leaving directory '/home/opc/ruby/build/master/.bundle/gems/rbs-3.4.4/ext/rbs_extension' I, [2024-05-15T00:06:35.192776 #171953] INFO -- : make[2]: Entering directory '/home/opc/ruby/build/master/ext/digest/sha2' I, [2024-05-15T00:06:35.197882 #171953] INFO -- : make[2]: Leaving directory '/home/opc/ruby/build/master/ext/digest/sha2' I, [2024-05-15T00:06:35.202366 #171953] INFO -- : make[2]: Leaving directory '/home/opc/ruby/build/master/.bundle/gems/syslog-0.1.2/ext/syslog' I, [2024-05-15T00:06:35.240206 #171953] INFO -- : make[2]: Entering directory '/home/opc/ruby/build/master' I, [2024-05-15T00:06:35.322485 #171953] INFO -- : make[2]: 'ruby' is up to date. I, [2024-05-15T00:06:35.322555 #171953] INFO -- : make[2]: Leaving directory '/home/opc/ruby/build/master' I, [2024-05-15T00:06:35.322738 #171953] INFO -- : make[1]: Leaving directory '/home/opc/ruby/build/master' I, [2024-05-15T00:06:35.327061 #171953] INFO -- : make[1]: Entering directory '/home/opc/ruby/build/master' I, [2024-05-15T00:06:35.327095 #171953] INFO -- : make[1]: Nothing to be done for 'note'. I, [2024-05-15T00:06:35.327105 #171953] INFO -- : make[1]: Leaving directory '/home/opc/ruby/build/master' I, [2024-05-15T00:06:35.327301 #171953] INFO -- : ./miniruby -I/home/opc/ruby/src/master/lib -I. -I.ext/common /home/opc/ruby/src/master/tool/runruby.rb --extout=.ext -- --disable-gems -r./aarch64-linux-fake /home/opc/ruby/src/master/tool/rbinstall.rb --make="make" --dest-dir="" --extout=".ext" --ext-build-dir="./ext" --mflags="-j3 --jobserver-auth=4,5" --make-flags=" -j3 --jobserver-auth=4,5" --data-mode=0644 --prog-mode=0755 --installed-list .installed.list --mantype="doc" --gnumake --install=all --exclude=doc I, [2024-05-15T00:06:35.475416 #171953] INFO -- : Installing to I, [2024-05-15T00:06:35.475489 #171953] INFO -- : installing binary commands: /home/opc/ruby/install/master/bin I, [2024-05-15T00:06:35.487272 #171953] INFO -- : installing base libraries: /home/opc/ruby/install/master/lib I, [2024-05-15T00:06:35.487750 #171953] INFO -- : installing arch files: /home/opc/ruby/install/master/lib/ruby/3.4.0+0/aarch64-linux I, [2024-05-15T00:06:35.487884 #171953] INFO -- : installing pkgconfig data: /home/opc/ruby/install/master/lib/pkgconfig I, [2024-05-15T00:06:35.487946 #171953] INFO -- : installing extension objects: /home/opc/ruby/install/master/lib/ruby/3.4.0+0/aarch64-linux I, [2024-05-15T00:06:35.500345 #171953] INFO -- : installing extension objects: /home/opc/ruby/install/master/lib/ruby/site_ruby/3.4.0+0/aarch64-linux I, [2024-05-15T00:06:35.500387 #171953] INFO -- : installing extension objects: /home/opc/ruby/install/master/lib/ruby/vendor_ruby/3.4.0+0/aarch64-linux I, [2024-05-15T00:06:35.500478 #171953] INFO -- : installing extension headers: /home/opc/ruby/install/master/include/ruby-3.4.0+0/aarch64-linux I, [2024-05-15T00:06:35.500785 #171953] INFO -- : installing extension scripts: /home/opc/ruby/install/master/lib/ruby/3.4.0+0 I, [2024-05-15T00:06:35.510500 #171953] INFO -- : installing extension scripts: /home/opc/ruby/install/master/lib/ruby/site_ruby/3.4.0+0 I, [2024-05-15T00:06:35.510537 #171953] INFO -- : installing extension scripts: /home/opc/ruby/install/master/lib/ruby/vendor_ruby/3.4.0+0 I, [2024-05-15T00:06:35.510549 #171953] INFO -- : installing extension headers: /home/opc/ruby/install/master/include/ruby-3.4.0+0/ruby I, [2024-05-15T00:06:35.510635 #171953] INFO -- : installing command scripts: /home/opc/ruby/install/master/bin I, [2024-05-15T00:06:35.510764 #171953] INFO -- : installing library scripts: /home/opc/ruby/install/master/lib/ruby/3.4.0+0 I, [2024-05-15T00:06:35.591892 #171953] INFO -- : installing common headers: /home/opc/ruby/install/master/include/ruby-3.4.0+0 I, [2024-05-15T00:06:35.603456 #171953] INFO -- : installing manpages: /home/opc/ruby/install/master/share/man/man1 I, [2024-05-15T00:06:35.603777 #171953] INFO -- : installing default gems from lib: /home/opc/ruby/install/master/lib/ruby/gems/3.4.0+0 I, [2024-05-15T00:06:35.647152 #171953] INFO -- : benchmark 0.3.0 I, [2024-05-15T00:06:35.659737 #171953] INFO -- : bundler 2.6.0.dev I, [2024-05-15T00:06:35.665610 #171953] INFO -- : cgi 0.4.1 I, [2024-05-15T00:06:35.667031 #171953] INFO -- : delegate 0.3.1 I, [2024-05-15T00:06:35.668094 #171953] INFO -- : did_you_mean 1.6.3 I, [2024-05-15T00:06:35.669236 #171953] INFO -- : english 0.8.0 I, [2024-05-15T00:06:35.670334 #171953] INFO -- : erb 4.0.4 I, [2024-05-15T00:06:35.672886 #171953] INFO -- : error_highlight 0.6.0 I, [2024-05-15T00:06:35.673995 #171953] INFO -- : fileutils 1.7.2 I, [2024-05-15T00:06:35.675052 #171953] INFO -- : find 0.2.0 I, [2024-05-15T00:06:35.676126 #171953] INFO -- : forwardable 1.3.3 I, [2024-05-15T00:06:35.677235 #171953] INFO -- : ipaddr 1.2.6 I, [2024-05-15T00:06:35.678302 #171953] INFO -- : irb 1.13.1 I, [2024-05-15T00:06:35.681947 #171953] INFO -- : logger 1.6.0 I, [2024-05-15T00:06:35.683216 #171953] INFO -- : net-http 0.4.1 I, [2024-05-15T00:06:35.684332 #171953] INFO -- : net-protocol 0.2.2 I, [2024-05-15T00:06:35.685502 #171953] INFO -- : open-uri 0.4.1 I, [2024-05-15T00:06:35.686650 #171953] INFO -- : open3 0.2.1 I, [2024-05-15T00:06:35.687723 #171953] INFO -- : optparse 0.5.0 I, [2024-05-15T00:06:35.688860 #171953] INFO -- : ostruct 0.6.0 I, [2024-05-15T00:06:35.689961 #171953] INFO -- : pp 0.5.0 I, [2024-05-15T00:06:35.691047 #171953] INFO -- : prettyprint 0.2.0 I, [2024-05-15T00:06:35.692133 #171953] INFO -- : prism 0.29.0 I, [2024-05-15T00:06:35.693334 #171953] INFO -- : pstore 0.1.3 I, [2024-05-15T00:06:35.695278 #171953] INFO -- : rdoc 6.6.3.1 I, [2024-05-15T00:06:35.699411 #171953] INFO -- : readline 0.0.4 I, [2024-05-15T00:06:35.700557 #171953] INFO -- : reline 0.5.7 I, [2024-05-15T00:06:35.701755 #171953] INFO -- : resolv 0.4.0 I, [2024-05-15T00:06:35.702845 #171953] INFO -- : ruby2_keywords 0.0.5 I, [2024-05-15T00:06:35.703968 #171953] INFO -- : securerandom 0.3.1 I, [2024-05-15T00:06:35.705134 #171953] INFO -- : set 1.1.0 I, [2024-05-15T00:06:35.706264 #171953] INFO -- : shellwords 0.2.0 I, [2024-05-15T00:06:35.707364 #171953] INFO -- : singleton 0.2.0 I, [2024-05-15T00:06:35.708457 #171953] INFO -- : syntax_suggest 2.0.0 I, [2024-05-15T00:06:35.711000 #171953] INFO -- : tempfile 0.2.1 I, [2024-05-15T00:06:35.713198 #171953] INFO -- : time 0.3.0 I, [2024-05-15T00:06:35.714332 #171953] INFO -- : timeout 0.4.1 I, [2024-05-15T00:06:35.715417 #171953] INFO -- : tmpdir 0.2.0 I, [2024-05-15T00:06:35.716575 #171953] INFO -- : tsort 0.2.0 I, [2024-05-15T00:06:35.717726 #171953] INFO -- : un 0.3.0 I, [2024-05-15T00:06:35.718835 #171953] INFO -- : uri 0.13.0 I, [2024-05-15T00:06:35.721078 #171953] INFO -- : weakref 0.1.3 I, [2024-05-15T00:06:35.722871 #171953] INFO -- : yaml 0.3.0 I, [2024-05-15T00:06:35.724166 #171953] INFO -- : installing default gems from ext: /home/opc/ruby/install/master/lib/ruby/gems/3.4.0+0 I, [2024-05-15T00:06:35.737834 #171953] INFO -- : date 3.3.4 I, [2024-05-15T00:06:35.738984 #171953] INFO -- : digest 3.1.1 I, [2024-05-15T00:06:35.740057 #171953] INFO -- : etc 1.4.3 I, [2024-05-15T00:06:35.741255 #171953] INFO -- : fcntl 1.1.0 I, [2024-05-15T00:06:35.742361 #171953] INFO -- : fiddle 1.1.3 I, [2024-05-15T00:06:35.743452 #171953] INFO -- : io-console 0.7.2 I, [2024-05-15T00:06:35.744608 #171953] INFO -- : io-nonblock 0.3.0 I, [2024-05-15T00:06:35.745770 #171953] INFO -- : io-wait 0.3.1 I, [2024-05-15T00:06:35.746839 #171953] INFO -- : json 2.7.2 I, [2024-05-15T00:06:35.749091 #171953] INFO -- : openssl 3.2.0 I, [2024-05-15T00:06:35.750271 #171953] INFO -- : pathname 0.3.0 I, [2024-05-15T00:06:35.751361 #171953] INFO -- : psych 5.1.2 I, [2024-05-15T00:06:35.752653 #171953] INFO -- : stringio 3.1.1 I, [2024-05-15T00:06:35.753851 #171953] INFO -- : strscan 3.1.1 I, [2024-05-15T00:06:35.754927 #171953] INFO -- : zlib 3.1.0 I, [2024-05-15T00:06:35.755835 #171953] INFO -- : installing bundled gems: /home/opc/ruby/install/master/lib/ruby/gems/3.4.0+0 I, [2024-05-15T00:06:35.756446 #171953] INFO -- : minitest 5.22.3 I, [2024-05-15T00:06:35.769862 #171953] INFO -- : rake 13.2.1 I, [2024-05-15T00:06:35.782787 #171953] INFO -- : test-unit 3.6.2 I, [2024-05-15T00:06:35.798097 #171953] INFO -- : rexml 3.2.6 I, [2024-05-15T00:06:35.812373 #171953] INFO -- : rss 0.3.0 I, [2024-05-15T00:06:35.826381 #171953] INFO -- : net-ftp 0.3.4 I, [2024-05-15T00:06:35.829930 #171953] INFO -- : net-imap 0.4.11 I, [2024-05-15T00:06:35.844340 #171953] INFO -- : net-pop 0.1.2 I, [2024-05-15T00:06:35.846851 #171953] INFO -- : net-smtp 0.5.0 I, [2024-05-15T00:06:35.850015 #171953] INFO -- : matrix 0.4.2 I, [2024-05-15T00:06:35.855576 #171953] INFO -- : prime 0.1.2 I, [2024-05-15T00:06:35.865272 #171953] INFO -- : rbs 3.4.4 I, [2024-05-15T00:06:35.961303 #171953] INFO -- : typeprof 0.21.11 I, [2024-05-15T00:06:35.969110 #171953] INFO -- : debug 1.9.2 I, [2024-05-15T00:06:35.978439 #171953] INFO -- : racc 1.7.3 I, [2024-05-15T00:06:35.987647 #171953] INFO -- : mutex_m 0.2.0 I, [2024-05-15T00:06:35.990447 #171953] INFO -- : getoptlong 0.2.1 I, [2024-05-15T00:06:35.994770 #171953] INFO -- : base64 0.2.0 I, [2024-05-15T00:06:35.998134 #171953] INFO -- : bigdecimal 3.1.8 I, [2024-05-15T00:06:36.003764 #171953] INFO -- : observer 0.1.2 I, [2024-05-15T00:06:36.006951 #171953] INFO -- : abbrev 0.1.2 I, [2024-05-15T00:06:36.009669 #171953] INFO -- : resolv-replace 0.1.1 I, [2024-05-15T00:06:36.012779 #171953] INFO -- : rinda 0.2.0 I, [2024-05-15T00:06:36.016053 #171953] INFO -- : drb 2.2.1 I, [2024-05-15T00:06:36.020365 #171953] INFO -- : nkf 0.2.0 I, [2024-05-15T00:06:36.026566 #171953] INFO -- : syslog 0.1.2 I, [2024-05-15T00:06:36.030894 #171953] INFO -- : csv 3.3.0 I, [2024-05-15T00:06:36.047046 #171953] INFO -- : installing bundled gem cache: /home/opc/ruby/install/master/lib/ruby/gems/3.4.0+0/cache I, [2024-05-15T00:06:36.048962 #171953] INFO -- : skipped bundled gems: I, [2024-05-15T00:06:36.048993 #171953] INFO -- : power_assert-2.0.4dev.gem not found in bundled_gems I, [2024-05-15T00:06:36.051994 #171953] INFO -- : $$$[end] "make install -j3" exit with 0. I, [2024-05-15T00:06:36.052135 #171953] INFO -- : $$$[beg] make yes-btest TESTOPTS='-q -j3' I, [2024-05-15T00:06:58.029317 #171953] INFO -- : PASS all 1936 tests E, [2024-05-15T00:06:58.031121 #171953] ERROR -- : I, [2024-05-15T00:06:58.031241 #171953] INFO -- : $$$[end] "make yes-btest TESTOPTS='-q -j3'" exit with 0. I, [2024-05-15T00:06:58.031384 #171953] INFO -- : $$$[beg] make yes-test-basic TESTS='-j3' I, [2024-05-15T00:06:58.124336 #171953] INFO -- : BASERUBY = /usr/local/bin/ruby --disable=gems I, [2024-05-15T00:06:58.124412 #171953] INFO -- : CC = gcc I, [2024-05-15T00:06:58.124424 #171953] INFO -- : LD = ld I, [2024-05-15T00:06:58.125956 #171953] INFO -- : LDSHARED = gcc -shared I, [2024-05-15T00:06:58.125975 #171953] INFO -- : CFLAGS = -O3 -fno-fast-math -ggdb3 -Wall -Wextra -Wdeprecated-declarations -Wdiv-by-zero -Wduplicated-cond -Wimplicit-function-declaration -Wimplicit-int -Wpointer-arith -Wwrite-strings -Wold-style-definition -Wimplicit-fallthrough=0 -Wmissing-noreturn -Wno-cast-function-type -Wno-constant-logical-operand -Wno-long-long -Wno-missing-field-initializers -Wno-overlength-strings -Wno-packed-bitfield-compat -Wno-parentheses-equality -Wno-self-assign -Wno-tautological-compare -Wno-unused-parameter -Wno-unused-value -Wsuggest-attribute=format -Wsuggest-attribute=noreturn -Wunused-variable -Wmisleading-indentation -Wundef I, [2024-05-15T00:06:58.126001 #171953] INFO -- : XCFLAGS = -U_FORTIFY_SOURCE -D_FORTIFY_SOURCE=2 -fstack-protector-strong -msign-return-address=all -fno-strict-overflow -fvisibility=hidden -fexcess-precision=standard -DRUBY_EXPORT -fPIE -I. -I.ext/include/aarch64-linux -I/home/opc/ruby/src/master/include -I/home/opc/ruby/src/master -I/home/opc/ruby/src/master/prism -I/home/opc/ruby/src/master/enc/unicode/15.0.0 I, [2024-05-15T00:06:58.126010 #171953] INFO -- : CPPFLAGS = I, [2024-05-15T00:06:58.126018 #171953] INFO -- : DLDFLAGS = -Wl,--compress-debug-sections=zlib -fstack-protector-strong -pie I, [2024-05-15T00:06:58.126026 #171953] INFO -- : SOLIBS = -lz -lrt -lrt -ldl -lcrypt -lm -lpthread I, [2024-05-15T00:06:58.126034 #171953] INFO -- : LANG = en_US.UTF-8 I, [2024-05-15T00:06:58.126042 #171953] INFO -- : LC_ALL = I, [2024-05-15T00:06:58.126049 #171953] INFO -- : LC_CTYPE = I, [2024-05-15T00:06:58.126057 #171953] INFO -- : MFLAGS = I, [2024-05-15T00:06:58.126064 #171953] INFO -- : RUSTC = rustc I, [2024-05-15T00:06:58.126072 #171953] INFO -- : YJIT_RUSTC_ARGS = --crate-name=yjit --crate-type=staticlib --edition=2021 -g -C lto=thin -C opt-level=3 -C overflow-checks=on '--out-dir=/home/opc/ruby/build/master/yjit/target/release/' /home/opc/ruby/src/master/yjit/src/lib.rs I, [2024-05-15T00:06:58.126080 #171953] INFO -- : gcc (GCC) 8.5.0 20210514 (Red Hat 8.5.0-10.1.0.1) I, [2024-05-15T00:06:58.126088 #171953] INFO -- : Copyright (C) 2018 Free Software Foundation, Inc. I, [2024-05-15T00:06:58.126095 #171953] INFO -- : This is free software; see the source for copying conditions. There is NO I, [2024-05-15T00:06:58.126103 #171953] INFO -- : warranty; not even for MERCHANTABILITY or FITNESS FOR A PARTICULAR PURPOSE. I, [2024-05-15T00:06:58.126111 #171953] INFO -- : I, [2024-05-15T00:06:58.282075 #171953] INFO -- : Checking leaked global symbols...none I, [2024-05-15T00:06:58.335000 #171953] INFO -- : /home/opc/ruby/src/master/basictest/test.rb:assignment ....................................................................................................................................................................................................................................................................................................................................................................................OK 372 I, [2024-05-15T00:06:58.335073 #171953] INFO -- : /home/opc/ruby/src/master/basictest/test.rb:condition ..OK 2 I, [2024-05-15T00:06:58.335102 #171953] INFO -- : /home/opc/ruby/src/master/basictest/test.rb:if/unless ...OK 3 I, [2024-05-15T00:06:58.335154 #171953] INFO -- : /home/opc/ruby/src/master/basictest/test.rb:case .....OK 5 I, [2024-05-15T00:06:58.335914 #171953] INFO -- : /home/opc/ruby/src/master/basictest/test.rb:while/until ........OK 8 I, [2024-05-15T00:06:58.336038 #171953] INFO -- : /home/opc/ruby/src/master/basictest/test.rb:exception ..........OK 10 I, [2024-05-15T00:06:58.336714 #171953] INFO -- : /home/opc/ruby/src/master/basictest/test.rb:array .......................................OK 39 I, [2024-05-15T00:06:58.336985 #171953] INFO -- : /home/opc/ruby/src/master/basictest/test.rb:hash ...........................OK 27 I, [2024-05-15T00:06:58.339487 #171953] INFO -- : /home/opc/ruby/src/master/basictest/test.rb:iterator ...........................................................................................................OK 107 I, [2024-05-15T00:06:58.340251 #171953] INFO -- : /home/opc/ruby/src/master/basictest/test.rb:float ................................................................................OK 80 I, [2024-05-15T00:06:58.343766 #171953] INFO -- : /home/opc/ruby/src/master/basictest/test.rb:bignum ...............................OK 31 I, [2024-05-15T00:06:58.345412 #171953] INFO -- : /home/opc/ruby/src/master/basictest/test.rb:string & char ..............................................................OK 62 I, [2024-05-15T00:06:58.345498 #171953] INFO -- : /home/opc/ruby/src/master/basictest/test.rb:assignment ..........OK 10 I, [2024-05-15T00:06:58.345572 #171953] INFO -- : /home/opc/ruby/src/master/basictest/test.rb:call ......OK 6 I, [2024-05-15T00:06:58.345704 #171953] INFO -- : /home/opc/ruby/src/master/basictest/test.rb:proc .........OK 9 I, [2024-05-15T00:06:58.445969 #171953] INFO -- : /home/opc/ruby/src/master/basictest/test.rb:signal ..OK 2 I, [2024-05-15T00:06:58.447911 #171953] INFO -- : /home/opc/ruby/src/master/basictest/test.rb:eval ...........................OK 27 I, [2024-05-15T00:06:58.584088 #171953] INFO -- : /home/opc/ruby/src/master/basictest/test.rb:system ........OK 8 I, [2024-05-15T00:06:58.584153 #171953] INFO -- : /home/opc/ruby/src/master/basictest/test.rb:const .....OK 5 I, [2024-05-15T00:06:58.584255 #171953] INFO -- : /home/opc/ruby/src/master/basictest/test.rb:clone .....OK 5 I, [2024-05-15T00:06:58.584446 #171953] INFO -- : /home/opc/ruby/src/master/basictest/test.rb:marshal ....OK 4 I, [2024-05-15T00:06:58.584543 #171953] INFO -- : /home/opc/ruby/src/master/basictest/test.rb:pack ....OK 4 I, [2024-05-15T00:06:58.584576 #171953] INFO -- : /home/opc/ruby/src/master/basictest/test.rb:math ..OK 2 I, [2024-05-15T00:06:58.584668 #171953] INFO -- : /home/opc/ruby/src/master/basictest/test.rb:struct ......OK 6 I, [2024-05-15T00:06:58.584846 #171953] INFO -- : /home/opc/ruby/src/master/basictest/test.rb:variable ............OK 12 I, [2024-05-15T00:06:58.584875 #171953] INFO -- : /home/opc/ruby/src/master/basictest/test.rb:trace ...OK 3 I, [2024-05-15T00:06:58.585009 #171953] INFO -- : /home/opc/ruby/src/master/basictest/test.rb:defined? ............OK 12 I, [2024-05-15T00:06:58.585099 #171953] INFO -- : /home/opc/ruby/src/master/basictest/test.rb:alias ......OK 6 I, [2024-05-15T00:06:58.585657 #171953] INFO -- : /home/opc/ruby/src/master/basictest/test.rb:path .......................OK 23 I, [2024-05-15T00:06:58.654139 #171953] INFO -- : /home/opc/ruby/src/master/basictest/test.rb:gc ....OK 4 I, [2024-05-15T00:06:58.656043 #171953] INFO -- : I, [2024-05-15T00:06:58.656073 #171953] INFO -- : test succeeded I, [2024-05-15T00:06:58.656656 #171953] INFO -- : $$$[end] "make yes-test-basic TESTS='-j3'" exit with 0. I, [2024-05-15T00:06:58.656850 #171953] INFO -- : $$$[beg] make yes-test-all TESTOPTS='--stderr-on-failure' TESTS='-j3' I, [2024-05-15T00:06:58.780969 #171953] INFO -- : BASERUBY = /usr/local/bin/ruby --disable=gems I, [2024-05-15T00:06:58.781042 #171953] INFO -- : CC = gcc I, [2024-05-15T00:06:58.781053 #171953] INFO -- : LD = ld I, [2024-05-15T00:06:58.781063 #171953] INFO -- : LDSHARED = gcc -shared I, [2024-05-15T00:06:58.781075 #171953] INFO -- : CFLAGS = -O3 -fno-fast-math -ggdb3 -Wall -Wextra -Wdeprecated-declarations -Wdiv-by-zero -Wduplicated-cond -Wimplicit-function-declaration -Wimplicit-int -Wpointer-arith -Wwrite-strings -Wold-style-definition -Wimplicit-fallthrough=0 -Wmissing-noreturn -Wno-cast-function-type -Wno-constant-logical-operand -Wno-long-long -Wno-missing-field-initializers -Wno-overlength-strings -Wno-packed-bitfield-compat -Wno-parentheses-equality -Wno-self-assign -Wno-tautological-compare -Wno-unused-parameter -Wno-unused-value -Wsuggest-attribute=format -Wsuggest-attribute=noreturn -Wunused-variable -Wmisleading-indentation -Wundef I, [2024-05-15T00:06:58.781085 #171953] INFO -- : XCFLAGS = -U_FORTIFY_SOURCE -D_FORTIFY_SOURCE=2 -fstack-protector-strong -msign-return-address=all -fno-strict-overflow -fvisibility=hidden -fexcess-precision=standard -DRUBY_EXPORT -fPIE -I. -I.ext/include/aarch64-linux -I/home/opc/ruby/src/master/include -I/home/opc/ruby/src/master -I/home/opc/ruby/src/master/prism -I/home/opc/ruby/src/master/enc/unicode/15.0.0 I, [2024-05-15T00:06:58.781094 #171953] INFO -- : CPPFLAGS = I, [2024-05-15T00:06:58.781103 #171953] INFO -- : DLDFLAGS = -Wl,--compress-debug-sections=zlib -fstack-protector-strong -pie I, [2024-05-15T00:06:58.781112 #171953] INFO -- : SOLIBS = -lz -lrt -lrt -ldl -lcrypt -lm -lpthread I, [2024-05-15T00:06:58.781169 #171953] INFO -- : LANG = en_US.UTF-8 I, [2024-05-15T00:06:58.781182 #171953] INFO -- : LC_ALL = I, [2024-05-15T00:06:58.781190 #171953] INFO -- : LC_CTYPE = I, [2024-05-15T00:06:58.781199 #171953] INFO -- : MFLAGS = I, [2024-05-15T00:06:58.781207 #171953] INFO -- : RUSTC = rustc I, [2024-05-15T00:06:58.781215 #171953] INFO -- : YJIT_RUSTC_ARGS = --crate-name=yjit --crate-type=staticlib --edition=2021 -g -C lto=thin -C opt-level=3 -C overflow-checks=on '--out-dir=/home/opc/ruby/build/master/yjit/target/release/' /home/opc/ruby/src/master/yjit/src/lib.rs I, [2024-05-15T00:06:58.782124 #171953] INFO -- : gcc (GCC) 8.5.0 20210514 (Red Hat 8.5.0-10.1.0.1) I, [2024-05-15T00:06:58.782139 #171953] INFO -- : Copyright (C) 2018 Free Software Foundation, Inc. I, [2024-05-15T00:06:58.782148 #171953] INFO -- : This is free software; see the source for copying conditions. There is NO I, [2024-05-15T00:06:58.782157 #171953] INFO -- : warranty; not even for MERCHANTABILITY or FITNESS FOR A PARTICULAR PURPOSE. I, [2024-05-15T00:06:58.782165 #171953] INFO -- : I, [2024-05-15T00:06:58.784106 #171953] INFO -- : generating enc.mk I, [2024-05-15T00:06:59.016627 #171953] INFO -- : generating encdb.h I, [2024-05-15T00:06:59.053420 #171953] INFO -- : encdb.h unchanged I, [2024-05-15T00:06:59.054625 #171953] INFO -- : making enc I, [2024-05-15T00:06:59.081837 #171953] INFO -- : make[1]: Entering directory '/home/opc/ruby/build/master' I, [2024-05-15T00:06:59.081876 #171953] INFO -- : make[1]: Nothing to be done for 'enc'. I, [2024-05-15T00:06:59.081888 #171953] INFO -- : make[1]: Leaving directory '/home/opc/ruby/build/master' I, [2024-05-15T00:06:59.082656 #171953] INFO -- : making srcs under enc I, [2024-05-15T00:06:59.124306 #171953] INFO -- : make[1]: Entering directory '/home/opc/ruby/build/master' I, [2024-05-15T00:06:59.124344 #171953] INFO -- : make[1]: Nothing to be done for 'srcs'. I, [2024-05-15T00:06:59.124356 #171953] INFO -- : make[1]: Leaving directory '/home/opc/ruby/build/master' I, [2024-05-15T00:06:59.125540 #171953] INFO -- : generating transdb.h I, [2024-05-15T00:06:59.268814 #171953] INFO -- : transdb.h unchanged I, [2024-05-15T00:06:59.270141 #171953] INFO -- : making trans I, [2024-05-15T00:06:59.318603 #171953] INFO -- : make[1]: Entering directory '/home/opc/ruby/build/master' I, [2024-05-15T00:06:59.318674 #171953] INFO -- : make[1]: Nothing to be done for 'trans'. I, [2024-05-15T00:06:59.318685 #171953] INFO -- : make[1]: Leaving directory '/home/opc/ruby/build/master' I, [2024-05-15T00:06:59.319413 #171953] INFO -- : making encs I, [2024-05-15T00:06:59.371779 #171953] INFO -- : make[1]: Entering directory '/home/opc/ruby/build/master' I, [2024-05-15T00:06:59.371849 #171953] INFO -- : make[1]: Nothing to be done for 'encs'. I, [2024-05-15T00:06:59.371859 #171953] INFO -- : make[1]: Leaving directory '/home/opc/ruby/build/master' I, [2024-05-15T00:06:59.374217 #171953] INFO -- : generating makefiles ext/configure-ext.mk I, [2024-05-15T00:06:59.414764 #171953] INFO -- : ext/configure-ext.mk updated I, [2024-05-15T00:06:59.418457 #171953] INFO -- : make[1]: Entering directory '/home/opc/ruby/build/master' I, [2024-05-15T00:07:01.466773 #171953] INFO -- : make[1]: Leaving directory '/home/opc/ruby/build/master' I, [2024-05-15T00:07:01.467507 #171953] INFO -- : generating makefile exts.mk I, [2024-05-15T00:07:01.525535 #171953] INFO -- : exts.mk unchanged I, [2024-05-15T00:07:01.530617 #171953] INFO -- : make[1]: Entering directory '/home/opc/ruby/build/master' I, [2024-05-15T00:07:01.824796 #171953] INFO -- : make[2]: Entering directory '/home/opc/ruby/build/master/ext/coverage' I, [2024-05-15T00:07:01.829455 #171953] INFO -- : make[2]: Leaving directory '/home/opc/ruby/build/master/ext/coverage' I, [2024-05-15T00:07:01.835230 #171953] INFO -- : make[2]: Entering directory '/home/opc/ruby/build/master/ext/date' I, [2024-05-15T00:07:01.840397 #171953] INFO -- : make[2]: Leaving directory '/home/opc/ruby/build/master/ext/date' I, [2024-05-15T00:07:01.843684 #171953] INFO -- : make[2]: Entering directory '/home/opc/ruby/build/master/ext/digest' I, [2024-05-15T00:07:01.852504 #171953] INFO -- : make[2]: Leaving directory '/home/opc/ruby/build/master/ext/digest' I, [2024-05-15T00:07:01.875100 #171953] INFO -- : make[2]: Entering directory '/home/opc/ruby/build/master/ext/digest/sha2' I, [2024-05-15T00:07:01.879969 #171953] INFO -- : make[2]: Leaving directory '/home/opc/ruby/build/master/ext/digest/sha2' I, [2024-05-15T00:07:01.898067 #171953] INFO -- : make[2]: Entering directory '/home/opc/ruby/build/master/ext/fiddle' I, [2024-05-15T00:07:01.908047 #171953] INFO -- : make[2]: Leaving directory '/home/opc/ruby/build/master/ext/fiddle' I, [2024-05-15T00:07:01.912308 #171953] INFO -- : make[2]: Entering directory '/home/opc/ruby/build/master/ext/io/console' I, [2024-05-15T00:07:01.916557 #171953] INFO -- : make[2]: Leaving directory '/home/opc/ruby/build/master/ext/io/console' I, [2024-05-15T00:07:01.927395 #171953] INFO -- : make[2]: Entering directory '/home/opc/ruby/build/master/ext/json' I, [2024-05-15T00:07:01.936633 #171953] INFO -- : make[2]: Leaving directory '/home/opc/ruby/build/master/ext/json' I, [2024-05-15T00:07:01.949818 #171953] INFO -- : make[2]: Entering directory '/home/opc/ruby/build/master/ext/monitor' I, [2024-05-15T00:07:01.954451 #171953] INFO -- : make[2]: Leaving directory '/home/opc/ruby/build/master/ext/monitor' I, [2024-05-15T00:07:01.960363 #171953] INFO -- : make[2]: Entering directory '/home/opc/ruby/build/master/ext/objspace' I, [2024-05-15T00:07:01.966247 #171953] INFO -- : make[2]: Leaving directory '/home/opc/ruby/build/master/ext/objspace' I, [2024-05-15T00:07:01.985108 #171953] INFO -- : make[2]: Entering directory '/home/opc/ruby/build/master/ext/openssl' I, [2024-05-15T00:07:02.006872 #171953] INFO -- : make[2]: Leaving directory '/home/opc/ruby/build/master/ext/openssl' I, [2024-05-15T00:07:02.011244 #171953] INFO -- : make[2]: Entering directory '/home/opc/ruby/build/master/ext/pathname' I, [2024-05-15T00:07:02.015573 #171953] INFO -- : make[2]: Leaving directory '/home/opc/ruby/build/master/ext/pathname' I, [2024-05-15T00:07:02.021865 #171953] INFO -- : make[2]: Entering directory '/home/opc/ruby/build/master/ext/psych' I, [2024-05-15T00:07:02.043098 #171953] INFO -- : make[2]: Leaving directory '/home/opc/ruby/build/master/ext/psych' I, [2024-05-15T00:07:02.047542 #171953] INFO -- : make[2]: Entering directory '/home/opc/ruby/build/master/ext/pty' I, [2024-05-15T00:07:02.051654 #171953] INFO -- : make[2]: Leaving directory '/home/opc/ruby/build/master/ext/pty' I, [2024-05-15T00:07:02.064880 #171953] INFO -- : make[2]: Entering directory '/home/opc/ruby/build/master/ext/ripper' I, [2024-05-15T00:07:02.072569 #171953] INFO -- : make[2]: Leaving directory '/home/opc/ruby/build/master/ext/ripper' I, [2024-05-15T00:07:02.074573 #171953] INFO -- : make[2]: Entering directory '/home/opc/ruby/build/master/ext/rubyvm' I, [2024-05-15T00:07:02.077960 #171953] INFO -- : make[2]: Leaving directory '/home/opc/ruby/build/master/ext/rubyvm' I, [2024-05-15T00:07:02.089895 #171953] INFO -- : make[2]: Entering directory '/home/opc/ruby/build/master/ext/socket' I, [2024-05-15T00:07:02.100612 #171953] INFO -- : make[2]: Leaving directory '/home/opc/ruby/build/master/ext/socket' I, [2024-05-15T00:07:02.115635 #171953] INFO -- : make[2]: Entering directory '/home/opc/ruby/build/master/.bundle/gems/bigdecimal-3.1.7/ext/bigdecimal' I, [2024-05-15T00:07:02.145616 #171953] INFO -- : make[2]: Leaving directory '/home/opc/ruby/build/master/.bundle/gems/bigdecimal-3.1.7/ext/bigdecimal' I, [2024-05-15T00:07:02.148242 #171953] INFO -- : make[2]: Entering directory '/home/opc/ruby/build/master/.bundle/gems/bigdecimal-3.1.8/ext/bigdecimal' I, [2024-05-15T00:07:02.178487 #171953] INFO -- : make[2]: Leaving directory '/home/opc/ruby/build/master/.bundle/gems/bigdecimal-3.1.8/ext/bigdecimal' I, [2024-05-15T00:07:02.181032 #171953] INFO -- : make[2]: Entering directory '/home/opc/ruby/build/master/.bundle/gems/debug-1.9.2/ext/debug' I, [2024-05-15T00:07:02.211193 #171953] INFO -- : make[2]: Leaving directory '/home/opc/ruby/build/master/.bundle/gems/debug-1.9.2/ext/debug' I, [2024-05-15T00:07:02.213748 #171953] INFO -- : make[2]: Entering directory '/home/opc/ruby/build/master/.bundle/gems/nkf-0.2.0/ext/nkf' I, [2024-05-15T00:07:02.243506 #171953] INFO -- : make[2]: Leaving directory '/home/opc/ruby/build/master/.bundle/gems/nkf-0.2.0/ext/nkf' I, [2024-05-15T00:07:02.246057 #171953] INFO -- : make[2]: Entering directory '/home/opc/ruby/build/master/.bundle/gems/racc-1.7.3/ext/racc/cparse' I, [2024-05-15T00:07:02.276364 #171953] INFO -- : make[2]: Leaving directory '/home/opc/ruby/build/master/.bundle/gems/racc-1.7.3/ext/racc/cparse' I, [2024-05-15T00:07:02.279334 #171953] INFO -- : make[2]: Entering directory '/home/opc/ruby/build/master/.bundle/gems/rbs-3.4.4/ext/rbs_extension' I, [2024-05-15T00:07:02.309532 #171953] INFO -- : make[2]: Leaving directory '/home/opc/ruby/build/master/.bundle/gems/rbs-3.4.4/ext/rbs_extension' I, [2024-05-15T00:07:02.312058 #171953] INFO -- : make[2]: Entering directory '/home/opc/ruby/build/master/.bundle/gems/syslog-0.1.2/ext/syslog' I, [2024-05-15T00:07:02.341903 #171953] INFO -- : make[2]: Leaving directory '/home/opc/ruby/build/master/.bundle/gems/syslog-0.1.2/ext/syslog' I, [2024-05-15T00:07:02.379959 #171953] INFO -- : make[2]: Entering directory '/home/opc/ruby/build/master' I, [2024-05-15T00:07:02.462804 #171953] INFO -- : make[2]: 'ruby' is up to date. I, [2024-05-15T00:07:02.462897 #171953] INFO -- : make[2]: Leaving directory '/home/opc/ruby/build/master' I, [2024-05-15T00:07:02.462994 #171953] INFO -- : make[1]: Leaving directory '/home/opc/ruby/build/master' I, [2024-05-15T00:07:02.467461 #171953] INFO -- : make[1]: Entering directory '/home/opc/ruby/build/master' I, [2024-05-15T00:07:02.467521 #171953] INFO -- : make[1]: Nothing to be done for 'note'. I, [2024-05-15T00:07:02.467532 #171953] INFO -- : make[1]: Leaving directory '/home/opc/ruby/build/master' I, [2024-05-15T00:07:02.579210 #171953] INFO -- : Run options: I, [2024-05-15T00:07:02.579287 #171953] INFO -- : --seed=52547 I, [2024-05-15T00:07:02.579298 #171953] INFO -- : "--ruby=./miniruby -I/home/opc/ruby/src/master/lib -I. -I.ext/common /home/opc/ruby/src/master/tool/runruby.rb --extout=.ext -- --disable-gems" I, [2024-05-15T00:07:02.579308 #171953] INFO -- : --excludes-dir=/home/opc/ruby/src/master/test/.excludes I, [2024-05-15T00:07:02.579316 #171953] INFO -- : --name=!/memory_leak/ I, [2024-05-15T00:07:02.579325 #171953] INFO -- : --stderr-on-failure I, [2024-05-15T00:07:02.579333 #171953] INFO -- : -j3 I, [2024-05-15T00:07:02.579341 #171953] INFO -- : I, [2024-05-15T00:07:02.579350 #171953] INFO -- : # Running tests: I, [2024-05-15T00:07:02.579358 #171953] INFO -- : I, [2024-05-15T00:07:02.712709 #171953] INFO -- : [ 1/885] 212845=test_framework I, [2024-05-15T00:07:02.716852 #171953] INFO -- : [ 2/885] 212844=test_coderange I, [2024-05-15T00:07:02.717986 #171953] INFO -- : [ 3/885] 212846=test_weakmap I, [2024-05-15T00:07:02.736359 #171953] INFO -- : [ 4/885] 212844=test_inadvertent_creation I, [2024-05-15T00:07:02.736598 #171953] INFO -- : [ 5/885] 212845=test_ansi_with_terminfo I, [2024-05-15T00:07:02.800339 #171953] INFO -- : [ 6/885] 212845=test_pack I, [2024-05-15T00:07:02.801859 #171953] INFO -- : [ 7/885] 212845=test_cgi_tag_helper I, [2024-05-15T00:07:02.819557 #171953] INFO -- : [ 8/885] 212845=test_pinned I, [2024-05-15T00:07:02.835940 #171953] INFO -- : [ 9/885] 212844=test_rdoc_generator_json_index I, [2024-05-15T00:07:02.861528 #171953] INFO -- : [ 10/885] 212845=test_date_time I, [2024-05-15T00:07:02.870287 #171953] INFO -- : [ 11/885] 212845=test_nil2vtempty I, [2024-05-15T00:07:02.887418 #171953] INFO -- : [ 12/885] 212845=test_case I, [2024-05-15T00:07:02.993829 #171953] INFO -- : [ 13/885] 212845=test_open-uri I, [2024-05-15T00:07:03.023190 #171953] INFO -- : [ 14/885] 212844=test_enc_associate I, [2024-05-15T00:07:03.318264 #171953] INFO -- : [ 15/885] 212845=test_enumerator I, [2024-05-15T00:07:03.521225 #171953] INFO -- : [ 16/885] 212844=test_gem_command_manager I, [2024-05-15T00:07:03.671758 #171953] INFO -- : [ 17/885] 212846=test_rdoc_context I, [2024-05-15T00:07:03.849028 #171953] INFO -- : [ 18/885] 212844=test_array I, [2024-05-15T00:07:03.875696 #171953] INFO -- : [ 19/885] 212844=test_libs I, [2024-05-15T00:07:03.910154 #171953] INFO -- : [ 20/885] 212844=ripper_test I, [2024-05-15T00:07:04.444988 #171953] INFO -- : [ 21/885] 212846=test_iso_8859 I, [2024-05-15T00:07:04.489220 #171953] INFO -- : [ 22/885] 212846=test_gc I, [2024-05-15T00:07:04.493534 #171953] INFO -- : [ 23/885] 212846=test_qsort I, [2024-05-15T00:07:04.499414 #171953] INFO -- : [ 24/885] 212846=comments_test I, [2024-05-15T00:07:04.525643 #171953] INFO -- : [ 25/885] 212844=test_math I, [2024-05-15T00:07:04.535719 #171953] INFO -- : [ 26/885] 212844=test_safe_load I, [2024-05-15T00:07:04.582217 #171953] INFO -- : [ 27/885] 212844=test_sprintf I, [2024-05-15T00:07:04.586640 #171953] INFO -- : [ 28/885] 212846=test_const I, [2024-05-15T00:07:04.595486 #171953] INFO -- : [ 29/885] 212846=test_rdoc_parser_rd I, [2024-05-15T00:07:04.618862 #171953] INFO -- : [ 30/885] 212846=index_write_test I, [2024-05-15T00:07:04.630467 #171953] INFO -- : [ 31/885] 212846=test_class I, [2024-05-15T00:07:04.800438 #171953] INFO -- : [ 32/885] 212844=test_exit I, [2024-05-15T00:07:04.812419 #171953] INFO -- : [ 33/885] 212844=test_yaml_special_cases I, [2024-05-15T00:07:04.816370 #171953] INFO -- : [ 34/885] 212844=test_recorder I, [2024-05-15T00:07:04.839506 #171953] INFO -- : [ 35/885] 212844=json_addition_test I, [2024-05-15T00:07:04.849095 #171953] INFO -- : [ 36/885] 212844=test_gem_source_list I, [2024-05-15T00:07:04.909963 #171953] INFO -- : [ 37/885] 212844=test_name_error I, [2024-05-15T00:07:04.995690 #171953] INFO -- : [ 38/885] 212844=test_gem_commands_sources_command I, [2024-05-15T00:07:05.224207 #171953] INFO -- : [ 39/885] 212844=test_gem_specification I, [2024-05-15T00:07:06.780221 #171953] INFO -- : [ 40/885] 212846=test_flush I, [2024-05-15T00:07:06.784629 #171953] INFO -- : [ 41/885] 212846=test_pkey_rsa I, [2024-05-15T00:07:07.113956 #171953] INFO -- : [ 42/885] 212846=test_numhash I, [2024-05-15T00:07:07.118649 #171953] INFO -- : [ 43/885] 212846=test_system I, [2024-05-15T00:07:07.220511 #171953] INFO -- : [ 44/885] 212845=test_win32ole_variable I, [2024-05-15T00:07:07.229683 #171953] INFO -- : [ 45/885] 212845=test_parse I, [2024-05-15T00:07:07.431584 #171953] INFO -- : [ 46/885] 212844=test_rdoc_cross_reference I, [2024-05-15T00:07:07.790029 #171953] INFO -- : [ 47/885] 212845=test_rdoc_class_module I, [2024-05-15T00:07:07.858210 #171953] INFO -- : [ 48/885] 212844=test_method_cache I, [2024-05-15T00:07:07.862508 #171953] INFO -- : [ 49/885] 212844=test_cp949 I, [2024-05-15T00:07:07.870463 #171953] INFO -- : [ 50/885] 212844=test_jaro_winkler I, [2024-05-15T00:07:07.873674 #171953] INFO -- : [ 51/885] 212844=test_condition I, [2024-05-15T00:07:07.888763 #171953] INFO -- : [ 52/885] 212844=test_gem_resolver_vendor_set I, [2024-05-15T00:07:07.905655 #171953] INFO -- : [ 53/885] 212844=test_gem_dependency_resolution_error I, [2024-05-15T00:07:07.956992 #171953] INFO -- : [ 54/885] 212844=test_sleep I, [2024-05-15T00:07:08.053273 #171953] INFO -- : [ 55/885] 212846=test_mixed_unicode_escapes I, [2024-05-15T00:07:08.073349 #171953] INFO -- : [ 56/885] 212846=test_fileutils I, [2024-05-15T00:07:08.460937 #171953] INFO -- : [ 57/885] 212845=test_sorted_set I, [2024-05-15T00:07:08.485026 #171953] INFO -- : Leaked file descriptor: TestFileUtils#test_chown_error: 9 # I, [2024-05-15T00:07:08.514689 #171953] INFO -- : COMMAND PID USER FD TYPE DEVICE SIZE/OFF NODE NAME I, [2024-05-15T00:07:08.514764 #171953] INFO -- : ruby 212846 opc 9r REG 252,0 9253600 13705411 /var/lib/sss/mc/passwd I, [2024-05-15T00:07:08.614149 #171953] INFO -- : [ 58/885] 212846=test_emoji I, [2024-05-15T00:07:08.640641 #171953] INFO -- : [ 59/885] 212846=test_windows_1252 I, [2024-05-15T00:07:08.652766 #171953] INFO -- : [ 60/885] 212846=test_stack I, [2024-05-15T00:07:08.658545 #171953] INFO -- : [ 61/885] 212845=test_face I, [2024-05-15T00:07:08.672226 #171953] INFO -- : [ 62/885] 212845=test_date_attr I, [2024-05-15T00:07:08.819779 #171953] INFO -- : [ 63/885] 212845=test_sizeof I, [2024-05-15T00:07:09.566033 #171953] INFO -- : [ 64/885] 212846=test_gem_request_set_lockfile_parser I, [2024-05-15T00:07:09.689369 #171953] INFO -- : [ 65/885] 212846=test_stringchar I, [2024-05-15T00:07:09.768908 #171953] INFO -- : [ 66/885] 212846=warnings_test I, [2024-05-15T00:07:09.782293 #171953] INFO -- : [ 67/885] 212846=test_econv I, [2024-05-15T00:07:09.971839 #171953] INFO -- : [ 68/885] 212844=test_gem_install_update_options I, [2024-05-15T00:07:10.099183 #171953] INFO -- : [ 69/885] 212844=test_severity I, [2024-05-15T00:07:10.110803 #171953] INFO -- : [ 70/885] 212844=test_ractor I, [2024-05-15T00:07:10.111338 #171953] INFO -- : [ 71/885] 212844=test_case I, [2024-05-15T00:07:10.124650 #171953] INFO -- : [ 72/885] 212844=test_gem_package_tar_writer I, [2024-05-15T00:07:10.236332 #171953] INFO -- : [ 73/885] 212844=test_str2big I, [2024-05-15T00:07:10.254222 #171953] INFO -- : [ 74/885] 212844=test_utf16 I, [2024-05-15T00:07:10.353892 #171953] INFO -- : [ 75/885] 212844=test_http I, [2024-05-15T00:07:10.647288 #171953] INFO -- : [ 76/885] 212846=attribute_write_test I, [2024-05-15T00:07:10.656811 #171953] INFO -- : [ 77/885] 212846=test_set I, [2024-05-15T00:07:10.682450 #171953] INFO -- : [ 78/885] 212846=test_rdoc_markup_to_rdoc I, [2024-05-15T00:07:10.751984 #171953] INFO -- : [ 79/885] 212846=test_argf I, [2024-05-15T00:07:11.032870 #171953] INFO -- : [ 80/885] 212845=test_yaml I, [2024-05-15T00:07:11.132604 #171953] INFO -- : [ 81/885] 212845=test_x509name I, [2024-05-15T00:07:11.218050 #171953] INFO -- : [ 82/885] 212845=test_gem_dependency I, [2024-05-15T00:07:11.480264 #171953] INFO -- : [ 83/885] 212845=test_yjit I, [2024-05-15T00:07:11.487399 #171953] INFO -- : [ 84/885] 212845=test_gem_uninstaller I, [2024-05-15T00:07:12.748749 #171953] INFO -- : [ 85/885] 212845=test_cclass I, [2024-05-15T00:07:12.857172 #171953] INFO -- : [ 86/885] 212845=test_m17n I, [2024-05-15T00:07:12.952325 #171953] INFO -- : [ 87/885] 212845=test_method I, [2024-05-15T00:07:14.321691 #171953] INFO -- : [ 88/885] 212846=test_filter I, [2024-05-15T00:07:14.375843 #171953] INFO -- : [ 89/885] 212846=test_parser_events I, [2024-05-15T00:07:14.450468 #171953] INFO -- : [ 90/885] 212846=test_pkcs12 I, [2024-05-15T00:07:15.198834 #171953] INFO -- : [ 91/885] 212846=test_gem_remote_fetcher I, [2024-05-15T00:07:16.991973 #171953] INFO -- : [ 92/885] 212846=test_json_tree I, [2024-05-15T00:07:16.997378 #171953] INFO -- : [ 93/885] 212846=test_koi8 I, [2024-05-15T00:07:17.002501 #171953] INFO -- : [ 94/885] 212846=test_pty I, [2024-05-15T00:07:17.224307 #171953] INFO -- : [ 95/885] 212845=test_gem_dependency_installer I, [2024-05-15T00:07:17.454345 #171953] INFO -- : [ 96/885] 212846=test_http I, [2024-05-15T00:07:17.459525 #171953] INFO -- : [ 97/885] 212846=parser_test I, [2024-05-15T00:07:17.472562 #171953] INFO -- : [ 98/885] 212846=test_hash I, [2024-05-15T00:07:19.074548 #171953] INFO -- : [ 99/885] 212844=encoding_test I, [2024-05-15T00:07:19.137283 #171953] INFO -- : [100/885] 212844=test_gem_commands_specification_command I, [2024-05-15T00:07:19.268434 #171953] INFO -- : [101/885] 212844=test_scan_args I, [2024-05-15T00:07:19.289948 #171953] INFO -- : [102/885] 212844=test_gem_commands_which_command I, [2024-05-15T00:07:19.324615 #171953] INFO -- : [103/885] 212844=test_gem_request I, [2024-05-15T00:07:19.505867 #171953] INFO -- : [104/885] 212845=test_gem_package_old I, [2024-05-15T00:07:19.554242 #171953] INFO -- : [105/885] 212845=test_gem_commands_push_command I, [2024-05-15T00:07:19.585830 #171953] INFO -- : [106/885] 212844=locals_test I, [2024-05-15T00:07:20.068185 #171953] INFO -- : [107/885] 212844=test_too_many_dummy_encodings I, [2024-05-15T00:07:20.080798 #171953] INFO -- : [108/885] 212844=test_method_cache I, [2024-05-15T00:07:20.092561 #171953] INFO -- : [109/885] 212844=test_sprintf_comb I, [2024-05-15T00:07:20.195756 #171953] INFO -- : [110/885] 212845=test_gem_source_local I, [2024-05-15T00:07:20.238536 #171953] INFO -- : [111/885] 212844=desugar_compiler_test I, [2024-05-15T00:07:20.243068 #171953] INFO -- : [112/885] 212844=test_internal_ivar I, [2024-05-15T00:07:20.248792 #171953] INFO -- : [113/885] 212844=test_win32ole I, [2024-05-15T00:07:20.267785 #171953] INFO -- : [114/885] 212844=test_rendering I, [2024-05-15T00:07:20.309502 #171953] INFO -- : [115/885] 212844=test_gem_gemcutter_utilities I, [2024-05-15T00:07:20.442761 #171953] INFO -- : [116/885] 212845=test_rdoc_task I, [2024-05-15T00:07:20.553568 #171953] INFO -- : [117/885] 212845=test_tracepoint I, [2024-05-15T00:07:20.732560 #171953] INFO -- : [118/885] 212845=test_settracefunc I, [2024-05-15T00:07:20.779046 #171953] INFO -- : [119/885] 212844=test_gem_text I, [2024-05-15T00:07:20.846889 #171953] INFO -- : [120/885] 212844=test_backtrace I, [2024-05-15T00:07:20.988997 #171953] INFO -- : [121/885] 212846=test_yamldbm I, [2024-05-15T00:07:21.019184 #171953] INFO -- : [122/885] 212846=test_gem_spec_fetcher I, [2024-05-15T00:07:21.194857 #171953] INFO -- : [123/885] 212846=test_unicode_escape I, [2024-05-15T00:07:21.272732 #171953] INFO -- : [124/885] 212846=test_switch_hitter I, [2024-05-15T00:07:21.308770 #171953] INFO -- : [125/885] 212846=test_default_gems I, [2024-05-15T00:07:21.338657 #171953] INFO -- : [126/885] 212846=test_backtrace I, [2024-05-15T00:07:21.342602 #171953] INFO -- : [127/885] 212846=test_gbk I, [2024-05-15T00:07:21.363168 #171953] INFO -- : [128/885] 212846=test_gem_commands_dependency_command I, [2024-05-15T00:07:21.451727 #171953] INFO -- : [129/885] 212846=test_rdoc_method_attr I, [2024-05-15T00:07:21.550582 #171953] INFO -- : [130/885] 212846=test_enumerable I, [2024-05-15T00:07:21.553846 #171953] INFO -- : [131/885] 212846=test_set I, [2024-05-15T00:07:21.575327 #171953] INFO -- : [132/885] 212845=static_literals_test I, [2024-05-15T00:07:21.586556 #171953] INFO -- : [133/885] 212846=test_tree_spell_checker I, [2024-05-15T00:07:21.615576 #171953] INFO -- : [134/885] 212846=test_grapheme_breaks I, [2024-05-15T00:07:21.634870 #171953] INFO -- : [135/885] 212846=test_hash_create I, [2024-05-15T00:07:21.643325 #171953] INFO -- : [136/885] 212846=test_case_mapping I, [2024-05-15T00:07:21.652771 #171953] INFO -- : [137/885] 212846=test_rational I, [2024-05-15T00:07:21.666980 #171953] INFO -- : [138/885] 212845=test_gem_ext_cargo_builder_unit I, [2024-05-15T00:07:21.675978 #171953] INFO -- : [139/885] 212846=test_ractor I, [2024-05-15T00:07:21.692983 #171953] INFO -- : [140/885] 212846=test_gem_resolver_api_specification I, [2024-05-15T00:07:21.696595 #171953] INFO -- : [141/885] 212845=test_rdoc_rubygems_hook I, [2024-05-15T00:07:21.730976 #171953] INFO -- : [142/885] 212846=test_webauthn_listener I, [2024-05-15T00:07:21.775825 #171953] INFO -- : [143/885] 212845=test_key_event_record I, [2024-05-15T00:07:21.778835 #171953] INFO -- : [144/885] 212845=test_date_parse I, [2024-05-15T00:07:21.799025 #171953] INFO -- : [145/885] 212846=test_mdns I, [2024-05-15T00:07:21.882675 #171953] INFO -- : [146/885] 212846=test_open3 I, [2024-05-15T00:07:21.905014 #171953] INFO -- : [147/885] 212845=test_arity I, [2024-05-15T00:07:21.909960 #171953] INFO -- : [148/885] 212845=test_thread I, [2024-05-15T00:07:21.916750 #171953] INFO -- : [149/885] 212845=test_svcb_https I, [2024-05-15T00:07:21.925028 #171953] INFO -- : [150/885] 212845=test_pkey_ec I, [2024-05-15T00:07:21.942221 #171953] INFO -- : [151/885] 212845=test_buffering I, [2024-05-15T00:07:22.008150 #171953] INFO -- : [152/885] 212845=test_data_error I, [2024-05-15T00:07:22.011752 #171953] INFO -- : [153/885] 212845=test_rdoc_stats I, [2024-05-15T00:07:22.067141 #171953] INFO -- : [154/885] 212845=test_files_sample I, [2024-05-15T00:07:22.211715 #171953] INFO -- : [155/885] 212844=test_rubyoptions I, [2024-05-15T00:07:22.277882 #171953] INFO -- : [156/885] 212845=test_optimization I, [2024-05-15T00:07:24.459334 #171953] INFO -- : [157/885] 212846=test_force_exit I, [2024-05-15T00:07:24.463034 #171953] INFO -- : [158/885] 212846=test_shift_jis I, [2024-05-15T00:07:24.487385 #171953] INFO -- : [159/885] 212846=test_rdoc_store I, [2024-05-15T00:07:25.118148 #171953] INFO -- : [160/885] 212846=regexp_test I, [2024-05-15T00:07:25.133327 #171953] INFO -- : [161/885] 212846=test_yield I, [2024-05-15T00:07:27.862667 #171953] INFO -- : [162/885] 212846=test_remote_fetch_error I, [2024-05-15T00:07:27.889960 #171953] INFO -- : [163/885] 212846=test_show_source I, [2024-05-15T00:07:27.900681 #171953] INFO -- : [164/885] 212846=test_queue I, [2024-05-15T00:07:27.901649 #171953] INFO -- : [165/885] 212846=test_gem_resolver_lock_specification I, [2024-05-15T00:07:27.954757 #171953] INFO -- : [166/885] 212846=test_boolean I, [2024-05-15T00:07:27.979518 #171953] INFO -- : [167/885] 212846=test_gc_compact I, [2024-05-15T00:07:28.590798 #171953] INFO -- : [168/885] 212844=test_rdoc_i18n_locale I, [2024-05-15T00:07:28.601936 #171953] INFO -- : [169/885] 212844=test_dryrun I, [2024-05-15T00:07:28.625408 #171953] INFO -- : [170/885] 212844=test_gem_uri_formatter I, [2024-05-15T00:07:28.644753 #171953] INFO -- : [171/885] 212844=test_prettyprint I, [2024-05-15T00:07:28.662309 #171953] INFO -- : [172/885] 212844=test_ole_methods I, [2024-05-15T00:07:28.671772 #171953] INFO -- : [173/885] 212844=test_cgi_util I, [2024-05-15T00:07:28.893894 #171953] INFO -- : [174/885] 212844=test_clone I, [2024-05-15T00:07:29.021517 #171953] INFO -- : [175/885] 212844=test_enc_raise I, [2024-05-15T00:07:29.035582 #171953] INFO -- : [176/885] 212844=test_basicinstructions I, [2024-05-15T00:07:29.095152 #171953] INFO -- : [177/885] 212844=test_utf32 I, [2024-05-15T00:07:29.108742 #171953] INFO -- : [178/885] 212844=test_gem_resolver_git_specification I, [2024-05-15T00:07:29.121550 #171953] INFO -- : [179/885] 212845=test_key_actor_emacs I, [2024-05-15T00:07:29.349607 #171953] INFO -- : [180/885] 212845=test_gem_security I, [2024-05-15T00:07:29.441886 #171953] INFO -- : [181/885] 212844=test_erb I, [2024-05-15T00:07:29.711205 #171953] INFO -- : [182/885] 212844=test_date_ractor I, [2024-05-15T00:07:29.789454 #171953] INFO -- : [183/885] 212844=test_variable I, [2024-05-15T00:07:29.811013 #171953] INFO -- : [184/885] 212844=test_hash I, [2024-05-15T00:07:29.826431 #171953] INFO -- : [185/885] 212844=test_rdoc_tom_doc I, [2024-05-15T00:07:29.874194 #171953] INFO -- : [186/885] 212844=test_gem_commands_pristine_command I, [2024-05-15T00:07:30.685075 #171953] INFO -- : [187/885] 212846=test_optarg I, [2024-05-15T00:07:30.814209 #171953] INFO -- : [188/885] 212846=test_gem_impossible_dependencies_error I, [2024-05-15T00:07:30.833116 #171953] INFO -- : [189/885] 212846=test_pp I, [2024-05-15T00:07:30.899654 #171953] INFO -- : [190/885] 212846=test_gem_resolver_requirement_list I, [2024-05-15T00:07:30.905645 #171953] INFO -- : [191/885] 212846=memsize_test I, [2024-05-15T00:07:30.907509 #171953] INFO -- : [192/885] 212846=test_arith_seq_beg_len_step I, [2024-05-15T00:07:31.084841 #171953] INFO -- : [193/885] 212846=test_raise_exception I, [2024-05-15T00:07:31.213397 #171953] INFO -- : [194/885] 212844=test_exception I, [2024-05-15T00:07:31.227095 #171953] INFO -- : [195/885] 212844=test_noarg I, [2024-05-15T00:07:31.395372 #171953] INFO -- : [196/885] 212844=test_undef I, [2024-05-15T00:07:31.405107 #171953] INFO -- : [197/885] 212844=test_rdoc_generator_darkfish I, [2024-05-15T00:07:31.546076 #171953] INFO -- : [198/885] 212846=test_random I, [2024-05-15T00:07:31.556351 #171953] INFO -- : [199/885] 212846=test_gem_resolver_lock_set I, [2024-05-15T00:07:31.587759 #171953] INFO -- : [200/885] 212846=test_gem_command I, [2024-05-15T00:07:31.700900 #171953] INFO -- : [201/885] 212846=test_asn1 I, [2024-05-15T00:07:31.724389 #171953] INFO -- : [202/885] 212846=test_gem_commands_open_command I, [2024-05-15T00:07:31.744830 #171953] INFO -- : [203/885] 212844=test_verbose I, [2024-05-15T00:07:31.780606 #171953] INFO -- : [204/885] 212844=test_normalize I, [2024-05-15T00:07:31.789662 #171953] INFO -- : [205/885] 212844=test_emoji_breaks I, [2024-05-15T00:07:31.806099 #171953] INFO -- : [206/885] 212844=test_assignment I, [2024-05-15T00:07:31.829838 #171953] INFO -- : [207/885] 212846=test_gem_update_suggestion I, [2024-05-15T00:07:31.908166 #171953] INFO -- : [208/885] 212846=!Nothing_to_test I, [2024-05-15T00:07:31.909923 #171953] INFO -- : [209/885] 212846=test_fd_setsize I, [2024-05-15T00:07:31.915283 #171953] INFO -- : [210/885] 212846=test_process I, [2024-05-15T00:07:31.956406 #171953] INFO -- : [211/885] 212846=test_forwardable I, [2024-05-15T00:07:31.974520 #171953] INFO -- : [212/885] 212846=test_array_create I, [2024-05-15T00:07:32.028596 #171953] INFO -- : [213/885] 212846=test_memory_view I, [2024-05-15T00:07:32.275747 #171953] INFO -- : [214/885] 212846=test_dir_m17n I, [2024-05-15T00:07:33.018641 #171953] INFO -- : [215/885] 212844=test_complex I, [2024-05-15T00:07:33.106658 #171953] INFO -- : [216/885] 212844=test_threadgroup I, [2024-05-15T00:07:33.441970 #171953] INFO -- : [217/885] 212846=test_shapes I, [2024-05-15T00:07:33.447160 #171953] INFO -- : [218/885] 212846=test_did_you_mean I, [2024-05-15T00:07:33.508056 #171953] INFO -- : [219/885] 212846=test_rdoc_extend I, [2024-05-15T00:07:33.521118 #171953] INFO -- : [220/885] 212846=test_cesu8 I, [2024-05-15T00:07:33.526644 #171953] INFO -- : [221/885] 212846=test_storage I, [2024-05-15T00:07:33.536857 #171953] INFO -- : [222/885] 212846=test_method_name_check I, [2024-05-15T00:07:33.550881 #171953] INFO -- : [223/885] 212846=test_err_in_callback I, [2024-05-15T00:07:33.556698 #171953] INFO -- : [224/885] 212846=test_merge_keys I, [2024-05-15T00:07:33.560096 #171953] INFO -- : [225/885] 212846=test_string I, [2024-05-15T00:07:33.568743 #171953] INFO -- : [226/885] 212846=test_iterator I, [2024-05-15T00:07:33.665860 #171953] INFO -- : [227/885] 212846=test_gem_commands_install_command I, [2024-05-15T00:07:34.151888 #171953] INFO -- : [228/885] 212844=test_kernel I, [2024-05-15T00:07:34.798018 #171953] INFO -- : [229/885] 212844=test_rendering I, [2024-05-15T00:07:34.840239 #171953] INFO -- : [230/885] 212844=pattern_test I, [2024-05-15T00:07:34.877830 #171953] INFO -- : [231/885] 212844=test_gem_rdoc I, [2024-05-15T00:07:35.029292 #171953] INFO -- : [232/885] 212844=test_dot_dot I, [2024-05-15T00:07:35.034084 #171953] INFO -- : [233/885] 212844=redundant_return_test I, [2024-05-15T00:07:35.044159 #171953] INFO -- : [234/885] 212844=test_rand I, [2024-05-15T00:07:35.263598 #171953] INFO -- : [235/885] 212846=test_string_processing I, [2024-05-15T00:07:35.274456 #171953] INFO -- : [236/885] 212846=test_random_formatter I, [2024-05-15T00:07:35.293218 #171953] INFO -- : [237/885] 212846=test_rdoc_markup_attributes I, [2024-05-15T00:07:35.307349 #171953] INFO -- : [238/885] 212846=test_rdoc_code_object I, [2024-05-15T00:07:35.416673 #171953] INFO -- : [239/885] 212844=test_process I, [2024-05-15T00:07:35.632001 #171953] INFO -- : [240/885] 212846=test_gem_source_specific_file I, [2024-05-15T00:07:35.718027 #171953] INFO -- : [241/885] 212846=test_euc_kr I, [2024-05-15T00:07:35.719716 #171953] INFO -- : [242/885] 212846=test_provider I, [2024-05-15T00:07:35.725360 #171953] INFO -- : [243/885] 212846=test_bmethod I, [2024-05-15T00:07:35.733060 #171953] INFO -- : [244/885] 212846=test_gem_doctor I, [2024-05-15T00:07:35.781825 #171953] INFO -- : [245/885] 212846=json_fixtures_test I, [2024-05-15T00:07:35.788674 #171953] INFO -- : [246/885] 212846=test_len I, [2024-05-15T00:07:35.796704 #171953] INFO -- : [247/885] 212846=test_rdoc_parser_c I, [2024-05-15T00:07:35.989415 #171953] INFO -- : [248/885] 212846=test_kwargs I, [2024-05-15T00:07:36.010488 #171953] INFO -- : [249/885] 212846=test_pack I, [2024-05-15T00:07:36.285797 #171953] INFO -- : [250/885] 212846=test_io_wait I, [2024-05-15T00:07:36.530963 #171953] INFO -- : [251/885] 212845=parse_test I, [2024-05-15T00:07:36.554755 #171953] INFO -- : [252/885] 212846=test_tsort I, [2024-05-15T00:07:36.556994 #171953] INFO -- : [253/885] 212846=test_typeddata I, [2024-05-15T00:07:36.798743 #171953] INFO -- : [254/885] 212846=test_gem_commands_fetch_command I, [2024-05-15T00:07:37.015618 #171953] INFO -- : [255/885] 212846=test_securerandom I, [2024-05-15T00:07:37.029513 #171953] INFO -- : [256/885] 212846=test_gem_commands_outdated_command I, [2024-05-15T00:07:37.092224 #171953] INFO -- : [257/885] 212846=test_gem_dependency_list I, [2024-05-15T00:07:37.179955 #171953] INFO -- : [258/885] 212846=test_rdoc_parser_changelog I, [2024-05-15T00:07:37.268364 #171953] INFO -- : [259/885] 212846=parameters_signature_test I, [2024-05-15T00:07:37.275359 #171953] INFO -- : [260/885] 212846=test_require I, [2024-05-15T00:07:37.277019 #171953] INFO -- : [261/885] 212846=test_stringify_symbols I, [2024-05-15T00:07:37.296679 #171953] INFO -- : [262/885] 212846=test_objspace I, [2024-05-15T00:07:39.784219 #171953] INFO -- : [263/885] 212845=test_rdoc_text I, [2024-05-15T00:07:39.835181 #171953] INFO -- : [264/885] 212845=library_symbols_test I, [2024-05-15T00:07:39.842258 #171953] INFO -- : [265/885] 212845=test_rdoc_markup_indented_paragraph I, [2024-05-15T00:07:39.848527 #171953] INFO -- : [266/885] 212845=test_iseq_load I, [2024-05-15T00:07:40.072220 #171953] INFO -- : Leaked file descriptor: TestProcess#test_execopts_uid: 10 # I, [2024-05-15T00:07:40.106802 #171953] INFO -- : COMMAND PID USER FD TYPE DEVICE SIZE/OFF NODE NAME I, [2024-05-15T00:07:40.106876 #171953] INFO -- : ruby 212844 opc 10r REG 252,0 9253600 13705411 /var/lib/sss/mc/passwd I, [2024-05-15T00:07:40.996767 #171953] INFO -- : [267/885] 212845=test_rdoc_markup_parser I, [2024-05-15T00:07:41.045933 #171953] INFO -- : [268/885] 212845=test_stream I, [2024-05-15T00:07:41.156622 #171953] INFO -- : [269/885] 212845=test_have_library I, [2024-05-15T00:07:41.943845 #171953] INFO -- : [270/885] 212845=test_ns_spki I, [2024-05-15T00:07:41.952860 #171953] INFO -- : [271/885] 212845=test_rdoc_encoding I, [2024-05-15T00:07:41.982430 #171953] INFO -- : [272/885] 212845=test_win32ole_variant_outarg I, [2024-05-15T00:07:41.982643 #171953] INFO -- : [273/885] 212845=test_key_actor_vi I, [2024-05-15T00:07:42.110175 #171953] INFO -- : [274/885] 212845=test_postponed_job I, [2024-05-15T00:07:42.408516 #171953] INFO -- : [275/885] 212845=test_gem_request_set_lockfile I, [2024-05-15T00:07:42.842596 #171953] INFO -- : Leaked file descriptor: TestProcess#test_uid_from_name: 11 # I, [2024-05-15T00:07:42.860848 #171953] INFO -- : [276/885] 212845=test_rdoc_markdown I, [2024-05-15T00:07:42.865267 #171953] INFO -- : COMMAND PID USER FD TYPE DEVICE SIZE/OFF NODE NAME I, [2024-05-15T00:07:42.865331 #171953] INFO -- : ruby 212844 opc 11u unix 0x0000000000000000 0t0 2985382511 type=STREAM I, [2024-05-15T00:07:43.131226 #171953] INFO -- : [277/885] 212845=test_httpresponses I, [2024-05-15T00:07:43.146172 #171953] INFO -- : [278/885] 212845=test_rdoc_constant I, [2024-05-15T00:07:43.240672 #171953] INFO -- : [279/885] 212845=test_deprecate I, [2024-05-15T00:07:43.290170 #171953] INFO -- : [280/885] 212845=test_generic I, [2024-05-15T00:07:43.315293 #171953] INFO -- : [281/885] 212845=test_rdoc_markup_to_html_snippet I, [2024-05-15T00:07:43.397472 #171953] INFO -- : [282/885] 212845=test_common I, [2024-05-15T00:07:43.578915 #171953] INFO -- : [283/885] 212845=test_gem_commands_stale_command I, [2024-05-15T00:07:43.584423 #171953] INFO -- : [284/885] 212845=ruby_parser_test I, [2024-05-15T00:07:43.593296 #171953] INFO -- : [285/885] 212845=test_rdoc_markup_to_tt_only I, [2024-05-15T00:07:43.636944 #171953] INFO -- : [286/885] 212845=json_parser_test I, [2024-05-15T00:07:43.678896 #171953] INFO -- : [287/885] 212845=test_date_strftime I, [2024-05-15T00:07:44.171213 #171953] INFO -- : [288/885] 212845=test_ws I, [2024-05-15T00:07:44.190023 #171953] INFO -- : [289/885] 212845=test_gem_commands_cert_command I, [2024-05-15T00:07:44.925913 #171953] INFO -- : [290/885] 212845=test_singleton I, [2024-05-15T00:07:44.986775 #171953] INFO -- : [291/885] 212845=test_fstring I, [2024-05-15T00:07:45.044441 #171953] INFO -- : [292/885] 212845=test_numeric I, [2024-05-15T00:07:45.057867 #171953] INFO -- : [293/885] 212845=test_rdoc_require I, [2024-05-15T00:07:45.183321 #171953] INFO -- : [294/885] 212845=test_gem_ext_rake_builder I, [2024-05-15T00:07:45.677719 #171953] INFO -- : [295/885] 212845=test_word I, [2024-05-15T00:07:45.787364 #171953] INFO -- : [296/885] 212845=test_timeout I, [2024-05-15T00:07:46.501840 #171953] INFO -- : [297/885] 212845=test_rdoc_markup_raw I, [2024-05-15T00:07:46.515010 #171953] INFO -- : [298/885] 212845=test_key_name_check I, [2024-05-15T00:07:46.521575 #171953] INFO -- : [299/885] 212845=test_rdoc_markup_to_bs I, [2024-05-15T00:07:47.546147 #171953] INFO -- : [300/885] 212845=test_instrumentation_api I, [2024-05-15T00:07:49.651943 #171953] INFO -- : [301/885] 212845=test_weakref I, [2024-05-15T00:07:49.852805 #171953] INFO -- : [302/885] 212845=test_rdoc_alias I, [2024-05-15T00:07:49.964209 #171953] INFO -- : [303/885] 212845=test_io_buffer I, [2024-05-15T00:07:49.996858 #171953] INFO -- : [304/885] 212845=test_rdoc_context_section I, [2024-05-15T00:07:50.011012 #171953] INFO -- : [305/885] 212845=test_deprecated I, [2024-05-15T00:07:50.011463 #171953] INFO -- : [306/885] 212845=test_optparse I, [2024-05-15T00:07:50.024345 #171953] INFO -- : [307/885] 212845=test_exception I, [2024-05-15T00:07:52.608073 #171953] INFO -- : [308/885] 212844=test_bash_completion I, [2024-05-15T00:07:52.815585 #171953] INFO -- : [309/885] 212844=test_files_test_2 I, [2024-05-15T00:07:53.083670 #171953] INFO -- : [310/885] 212845=test_div I, [2024-05-15T00:07:53.100169 #171953] INFO -- : [311/885] 212845=test_rdoc_markup_to_html_crossref I, [2024-05-15T00:07:53.402565 #171953] INFO -- : [312/885] 212845=test_scalar I, [2024-05-15T00:07:53.428248 #171953] INFO -- : [313/885] 212845=test_syntax I, [2024-05-15T00:07:55.348392 #171953] INFO -- : [314/885] 212844=test_class_name_check I, [2024-05-15T00:07:55.375640 #171953] INFO -- : [315/885] 212844=test_basicsocket I, [2024-05-15T00:07:55.393761 #171953] INFO -- : [316/885] 212844=test_zsh_completion I, [2024-05-15T00:07:55.406331 #171953] INFO -- : [317/885] 212844=test_gem_commands_environment_command I, [2024-05-15T00:07:55.482153 #171953] INFO -- : [318/885] 212844=test_pkcs7 I, [2024-05-15T00:07:55.654420 #171953] INFO -- : [319/885] 212844=test_pack I, [2024-05-15T00:07:55.839549 #171953] INFO -- : [320/885] 212844=test_gem_unsatisfiable_dependency_error I, [2024-05-15T00:07:55.947842 #171953] INFO -- : [321/885] 212844=test_literal I, [2024-05-15T00:07:56.548056 #171953] INFO -- : [322/885] 212844=test_thread I, [2024-05-15T00:07:56.679579 #171953] INFO -- : [323/885] 212844=test_complex2 I, [2024-05-15T00:07:56.688763 #171953] INFO -- : [324/885] 212844=test_config I, [2024-05-15T00:07:56.742642 #171953] INFO -- : [325/885] 212844=test_gem_security_signer I, [2024-05-15T00:07:56.845960 #171953] INFO -- : [326/885] 212844=test_gem_util I, [2024-05-15T00:07:57.013832 #171953] INFO -- : [327/885] 212844=test_input_method I, [2024-05-15T00:07:57.265311 #171953] INFO -- : [328/885] 212844=test_io I, [2024-05-15T00:07:57.309728 #171953] INFO -- : [329/885] 212844=test_rdoc_i18n_text I, [2024-05-15T00:07:57.371404 #171953] INFO -- : [330/885] 212844=test_ractor I, [2024-05-15T00:07:57.375904 #171953] INFO -- : [331/885] 212844=test_null I, [2024-05-15T00:07:57.386399 #171953] INFO -- : [332/885] 212844=test_data I, [2024-05-15T00:07:57.400208 #171953] INFO -- : [333/885] 212844=test_memory_view I, [2024-05-15T00:07:57.417588 #171953] INFO -- : [334/885] 212844=test_multi_irb_commands I, [2024-05-15T00:07:58.351097 #171953] INFO -- : [335/885] 212844=test_pkey_dh I, [2024-05-15T00:07:58.821013 #171953] INFO -- : [336/885] 212844=test_m17n_comb I, [2024-05-15T00:08:00.982708 #171953] INFO -- : [337/885] 212844=test_win32ole_typelib I, [2024-05-15T00:08:00.992585 #171953] INFO -- : [338/885] 212844=test_pkey I, [2024-05-15T00:08:01.005776 #171953] INFO -- : [339/885] 212844=test_external_new I, [2024-05-15T00:08:01.011390 #171953] INFO -- : [340/885] 212844=test_bigzero I, [2024-05-15T00:08:01.015786 #171953] INFO -- : [341/885] 212844=test_gem_platform I, [2024-05-15T00:08:01.024780 #171953] INFO -- : [342/885] 212845=test_gem_commands_query_command I, [2024-05-15T00:08:01.124606 #171953] INFO -- : [343/885] 212844=test_files_lib I, [2024-05-15T00:08:01.130409 #171953] INFO -- : [344/885] 212844=test_string_memory I, [2024-05-15T00:08:01.284938 #171953] INFO -- : [345/885] 212844=test_help I, [2024-05-15T00:08:01.288945 #171953] INFO -- : [346/885] 212844=test_enumerator_kw I, [2024-05-15T00:08:01.302478 #171953] INFO -- : [347/885] 212844=test_line_editor I, [2024-05-15T00:08:01.311326 #171953] INFO -- : [348/885] 212844=test_marshalable I, [2024-05-15T00:08:01.318544 #171953] INFO -- : [349/885] 212844=reflection_test I, [2024-05-15T00:08:01.328681 #171953] INFO -- : [350/885] 212844=test_string I, [2024-05-15T00:08:01.345395 #171953] INFO -- : [351/885] 212844=json_common_interface_test I, [2024-05-15T00:08:01.357787 #171953] INFO -- : [352/885] 212844=test_error_highlight I, [2024-05-15T00:08:01.686322 #171953] INFO -- : [353/885] 212845=test_rdoc_any_method I, [2024-05-15T00:08:01.814412 #171953] INFO -- : [354/885] 212844=test_function_entry I, [2024-05-15T00:08:01.814797 #171953] INFO -- : [355/885] 212844=test_raise I, [2024-05-15T00:08:01.824247 #171953] INFO -- : [356/885] 212844=test_complexrational I, [2024-05-15T00:08:01.835019 #171953] INFO -- : [357/885] 212844=version_test I, [2024-05-15T00:08:01.836233 #171953] INFO -- : [358/885] 212844=test_tree_builder I, [2024-05-15T00:08:01.846926 #171953] INFO -- : [359/885] 212844=test_big5 I, [2024-05-15T00:08:01.855734 #171953] INFO -- : [360/885] 212844=test_date I, [2024-05-15T00:08:01.859074 #171953] INFO -- : [361/885] 212844=test_gem_commands_update_command I, [2024-05-15T00:08:02.118400 #171953] INFO -- : [362/885] 212845=test_protect I, [2024-05-15T00:08:02.134641 #171953] INFO -- : [363/885] 212845=test_pathname I, [2024-05-15T00:08:02.348277 #171953] INFO -- : [364/885] 212845=test_fnmatch I, [2024-05-15T00:08:02.399098 #171953] INFO -- : [365/885] 212845=test_store I, [2024-05-15T00:08:02.750081 #171953] INFO -- : [366/885] 212845=test_rdoc_markup_pre_process I, [2024-05-15T00:08:02.864241 #171953] INFO -- : [367/885] 212845=test_coverage I, [2024-05-15T00:08:03.627382 #171953] INFO -- : [368/885] 212845=test_tempfile I, [2024-05-15T00:08:03.635743 #171953] INFO -- : [369/885] 212844=test_http_request I, [2024-05-15T00:08:03.638315 #171953] INFO -- : [370/885] 212844=test_erb_m17n I, [2024-05-15T00:08:03.646491 #171953] INFO -- : [371/885] 212844=test_rdoc_generator_pot_po_entry I, [2024-05-15T00:08:03.673027 #171953] INFO -- : [372/885] 212844=test_timeout I, [2024-05-15T00:08:03.681607 #171953] INFO -- : [373/885] 212844=test_rdoc_markup_verbatim I, [2024-05-15T00:08:03.695772 #171953] INFO -- : [374/885] 212844=test_webauthn_poller I, [2024-05-15T00:08:03.848377 #171953] INFO -- : [375/885] 212845=test_date_conv I, [2024-05-15T00:08:03.853516 #171953] INFO -- : [376/885] 212844=test_frozen I, [2024-05-15T00:08:03.856294 #171953] INFO -- : [377/885] 212844=test_serialize_subclasses I, [2024-05-15T00:08:03.859620 #171953] INFO -- : [378/885] 212844=test_gem_resolver_index_specification I, [2024-05-15T00:08:03.870188 #171953] INFO -- : [379/885] 212845=test_egrep_cpp I, [2024-05-15T00:08:03.927745 #171953] INFO -- : [380/885] 212844=json_string_matching_test I, [2024-05-15T00:08:03.947997 #171953] INFO -- : [381/885] 212844=test_gem_config_file I, [2024-05-15T00:08:03.982155 #171953] INFO -- : [382/885] 212845=test_comparable I, [2024-05-15T00:08:03.989429 #171953] INFO -- : [383/885] 212845=test_rdoc_rdoc I, [2024-05-15T00:08:04.059772 #171953] INFO -- : [384/885] 212845=test_yjit_exit_locations I, [2024-05-15T00:08:04.064912 #171953] INFO -- : [385/885] 212845=test_rdoc_markdown_test I, [2024-05-15T00:08:04.168664 #171953] INFO -- : [386/885] 212844=test_rdoc_normal_module I, [2024-05-15T00:08:04.201768 #171953] INFO -- : [387/885] 212844=test_type_completor I, [2024-05-15T00:08:04.212210 #171953] INFO -- : [388/885] 212844=test_io_timeout I, [2024-05-15T00:08:04.220475 #171953] INFO -- : [389/885] 212844=test_io_buffer I, [2024-05-15T00:08:04.307998 #171953] INFO -- : [390/885] 212844=test_kdf I, [2024-05-15T00:08:04.335460 #171953] INFO -- : [391/885] 212844=test_ldap I, [2024-05-15T00:08:04.346737 #171953] INFO -- : [392/885] 212844=test_thread_queue I, [2024-05-15T00:08:05.192725 #171953] INFO -- : [393/885] 212845=test_defined I, [2024-05-15T00:08:05.266770 #171953] INFO -- : [394/885] 212845=test_passing_block I, [2024-05-15T00:08:05.276668 #171953] INFO -- : [395/885] 212845=test_nowrite I, [2024-05-15T00:08:05.301628 #171953] INFO -- : [396/885] 212845=test_import I, [2024-05-15T00:08:06.358708 #171953] INFO -- : [397/885] 212846=test_human_typo I, [2024-05-15T00:08:06.368127 #171953] INFO -- : [398/885] 212846=test_wait I, [2024-05-15T00:08:06.422907 #171953] INFO -- : [399/885] 212846=test_nil I, [2024-05-15T00:08:06.432923 #171953] INFO -- : [400/885] 212846=test_psych I, [2024-05-15T00:08:06.464739 #171953] INFO -- : [401/885] 212846=test_yaml_tree I, [2024-05-15T00:08:06.484693 #171953] INFO -- : [402/885] 212846=test_gem_commands_yank_command I, [2024-05-15T00:08:07.012704 #171953] INFO -- : [403/885] 212846=test_cstr I, [2024-05-15T00:08:07.582634 #171953] INFO -- : [404/885] 212845=test_command I, [2024-05-15T00:08:07.888940 #171953] INFO -- : [405/885] 212845=test_euc_tw I, [2024-05-15T00:08:07.899041 #171953] INFO -- : [406/885] 212845=test_gem_resolver_dependency_request I, [2024-05-15T00:08:07.926759 #171953] INFO -- : [407/885] 212845=test_big2str I, [2024-05-15T00:08:07.935566 #171953] INFO -- : [408/885] 212845=test_gem_resolver_specification I, [2024-05-15T00:08:07.963740 #171953] INFO -- : [409/885] 212845=test_logger I, [2024-05-15T00:08:08.072119 #171953] INFO -- : [410/885] 212845=test_pkey_dsa I, [2024-05-15T00:08:08.346227 #171953] INFO -- : [411/885] 212846=test_ubf_async_safe I, [2024-05-15T00:08:08.354879 #171953] INFO -- : [412/885] 212846=test_pstore I, [2024-05-15T00:08:08.553113 #171953] INFO -- : [413/885] 212846=test_win32ole_record I, [2024-05-15T00:08:08.567959 #171953] INFO -- : [414/885] 212846=test_rdoc_include I, [2024-05-15T00:08:08.600288 #171953] INFO -- : [415/885] 212846=test_gem_version_option I, [2024-05-15T00:08:08.647306 #171953] INFO -- : [416/885] 212846=test_date_compat I, [2024-05-15T00:08:08.648853 #171953] INFO -- : [417/885] 212846=test_gem_ext_cargo_builder I, [2024-05-15T00:08:08.712992 #171953] INFO -- : [418/885] 212846=test_proc I, [2024-05-15T00:08:09.514592 #171953] INFO -- : [419/885] 212846=test_console_attr I, [2024-05-15T00:08:09.534150 #171953] INFO -- : [420/885] 212846=test_gem_commands_unpack_command I, [2024-05-15T00:08:09.891989 #171953] INFO -- : [421/885] 212846=test_zlib I, [2024-05-15T00:08:11.220377 #171953] INFO -- : [422/885] 212844=test_rdoc_options I, [2024-05-15T00:08:11.466734 #171953] INFO -- : [423/885] 212844=test_path_to_class I, [2024-05-15T00:08:11.471415 #171953] INFO -- : [424/885] 212844=test_enumerator I, [2024-05-15T00:08:11.482139 #171953] INFO -- : [425/885] 212844=test_reqarg I, [2024-05-15T00:08:11.786838 #171953] INFO -- : [426/885] 212844=test_frozen_error I, [2024-05-15T00:08:11.797074 #171953] INFO -- : [427/885] 212844=test_gem_version I, [2024-05-15T00:08:11.896352 #171953] INFO -- : [428/885] 212844=test_spell_checker I, [2024-05-15T00:08:12.004050 #171953] INFO -- : [429/885] 212844=test_gem_ext_ext_conf_builder I, [2024-05-15T00:08:12.987919 #171953] INFO -- : [430/885] 212844=test_resource I, [2024-05-15T00:08:13.006723 #171953] INFO -- : [431/885] 212844=test_gem_package_tar_reader_entry I, [2024-05-15T00:08:13.236983 #171953] INFO -- : [432/885] 212844=test_gem_uri I, [2024-05-15T00:08:13.267287 #171953] INFO -- : [433/885] 212844=test_bug-5832 I, [2024-05-15T00:08:13.272341 #171953] INFO -- : [434/885] 212844=test_yield_block I, [2024-05-15T00:08:13.308637 #171953] INFO -- : [435/885] 212844=test_c_struct_builder I, [2024-05-15T00:08:13.542430 #171953] INFO -- : [436/885] 212844=test_pipe I, [2024-05-15T00:08:13.655254 #171953] INFO -- : [437/885] 212844=test_macro I, [2024-05-15T00:08:13.720069 #171953] INFO -- : [438/885] 212844=test_string I, [2024-05-15T00:08:14.784291 #171953] INFO -- : [439/885] 212845=test_gem_resolver_activation_request I, [2024-05-15T00:08:14.803486 #171953] INFO -- : [440/885] 212845=test_function I, [2024-05-15T00:08:15.052970 #171953] INFO -- : [441/885] 212845=test_gem_commands_server_command I, [2024-05-15T00:08:15.058883 #171953] INFO -- : [442/885] 212845=test_win32ole_method_event I, [2024-05-15T00:08:15.077503 #171953] INFO -- : [443/885] 212845=test_tcp I, [2024-05-15T00:08:15.420606 #171953] INFO -- : [444/885] 212845=parse_comments_test I, [2024-05-15T00:08:15.441113 #171953] INFO -- : [445/885] 212845=test_gem_name_tuple I, [2024-05-15T00:08:15.465197 #171953] INFO -- : [446/885] 212845=test_rdoc_markup_to_table_of_contents I, [2024-05-15T00:08:15.585818 #171953] INFO -- : [447/885] 212845=test_integer I, [2024-05-15T00:08:15.598075 #171953] INFO -- : [448/885] 212845=test_gem_requirement I, [2024-05-15T00:08:15.747784 #171953] INFO -- : [449/885] 212845=test_rat I, [2024-05-15T00:08:15.767557 #171953] INFO -- : [450/885] 212846=test_gem_request_connection_pools I, [2024-05-15T00:08:15.800740 #171953] INFO -- : [451/885] 212845=test_init I, [2024-05-15T00:08:16.165717 #171953] INFO -- : [452/885] 212845=test_flags I, [2024-05-15T00:08:16.644458 #171953] INFO -- : [453/885] 212845=test_yamlstore I, [2024-05-15T00:08:16.666016 #171953] INFO -- : [454/885] 212845=test_bug-3571 I, [2024-05-15T00:08:16.674780 #171953] INFO -- : [455/885] 212845=test_numeric I, [2024-05-15T00:08:16.742824 #171953] INFO -- : [456/885] 212845=test_file I, [2024-05-15T00:08:16.756467 #171953] INFO -- : [457/885] 212845=test_time I, [2024-05-15T00:08:16.835113 #171953] INFO -- : [458/885] 212846=test_capacity I, [2024-05-15T00:08:16.855469 #171953] INFO -- : [459/885] 212846=test_gem_commands_owner_command I, [2024-05-15T00:08:16.870510 #171953] INFO -- : [460/885] 212845=test_nextafter I, [2024-05-15T00:08:16.973797 #171953] INFO -- : [461/885] 212845=test_encoding I, [2024-05-15T00:08:17.162421 #171953] INFO -- : [462/885] 212845=test_hmac I, [2024-05-15T00:08:17.169381 #171953] INFO -- : [463/885] 212845=test_rdoc_generator_markup I, [2024-05-15T00:08:17.192480 #171953] INFO -- : [464/885] 212845=test_constant I, [2024-05-15T00:08:17.518328 #171953] INFO -- : [465/885] 212846=test_find I, [2024-05-15T00:08:17.552295 #171953] INFO -- : [466/885] 212846=test_emitter I, [2024-05-15T00:08:17.559854 #171953] INFO -- : [467/885] 212846=test_x509ext I, [2024-05-15T00:08:17.569299 #171953] INFO -- : [468/885] 212846=bom_test I, [2024-05-15T00:08:17.581436 #171953] INFO -- : [469/885] 212846=test_helper_method I, [2024-05-15T00:08:17.593821 #171953] INFO -- : [470/885] 212846=test_summary I, [2024-05-15T00:08:17.657512 #171953] INFO -- : [471/885] 212846=test_file I, [2024-05-15T00:08:19.043900 #171953] INFO -- : [472/885] 212845=test_config I, [2024-05-15T00:08:19.361991 #171953] INFO -- : [473/885] 212845=test_rdoc_markup_to_html I, [2024-05-15T00:08:19.450941 #171953] INFO -- : [474/885] 212845=test_foreach I, [2024-05-15T00:08:19.456844 #171953] INFO -- : [475/885] 212845=test_append I, [2024-05-15T00:08:19.467164 #171953] INFO -- : [476/885] 212845=test_gem_resolver_installer_set I, [2024-05-15T00:08:19.715727 #171953] INFO -- : [477/885] 212845=test_trace I, [2024-05-15T00:08:19.723832 #171953] INFO -- : [478/885] 212845=test_arity I, [2024-05-15T00:08:19.734018 #171953] INFO -- : [479/885] 212845=test_gem_path_support I, [2024-05-15T00:08:19.802896 #171953] INFO -- : [480/885] 212845=test_keyword I, [2024-05-15T00:08:20.296873 #171953] INFO -- : [481/885] 212845=test_win32ole_type_event I, [2024-05-15T00:08:20.307046 #171953] INFO -- : [482/885] 212845=test_scalar_scanner I, [2024-05-15T00:08:20.313578 #171953] INFO -- : [483/885] 212845=test_rb_str_dup I, [2024-05-15T00:08:20.320706 #171953] INFO -- : [484/885] 212845=test_lambda I, [2024-05-15T00:08:20.384002 #171953] INFO -- : [485/885] 212845=test_eval I, [2024-05-15T00:08:20.632551 #171953] INFO -- : [486/885] 212845=test_monitor I, [2024-05-15T00:08:20.852997 #171953] INFO -- : [487/885] 212845=test_beginendblock I, [2024-05-15T00:08:21.160764 #171953] INFO -- : [488/885] 212845=test_whileuntil I, [2024-05-15T00:08:21.180737 #171953] INFO -- : [489/885] 212845=test_regexp I, [2024-05-15T00:08:23.847212 #171953] INFO -- : [490/885] 212846=test_nofree I, [2024-05-15T00:08:23.894293 #171953] INFO -- : [491/885] 212846=test_pointer I, [2024-05-15T00:08:25.113710 #171953] INFO -- : [492/885] 212846=test_rdoc_normal_class I, [2024-05-15T00:08:25.163736 #171953] INFO -- : [493/885] 212846=test_within_pipe I, [2024-05-15T00:08:25.209382 #171953] INFO -- : [494/885] 212846=test_bug_reporter I, [2024-05-15T00:08:25.451636 #171953] INFO -- : [495/885] 212846=test_gem_installer I, [2024-05-15T00:08:30.326372 #171953] INFO -- : [496/885] 212846=test_buffered_io I, [2024-05-15T00:08:30.398525 #171953] INFO -- : [497/885] 212846=test_ossl I, [2024-05-15T00:08:37.718320 #171953] INFO -- : [498/885] 212846=test_ruby_lex I, [2024-05-15T00:08:37.843402 #171953] INFO -- : [499/885] 212846=test_arith_seq_extract I, [2024-05-15T00:08:37.856048 #171953] INFO -- : [500/885] 212846=compiler_test I, [2024-05-15T00:08:37.924609 #171953] INFO -- : [501/885] 212846=test_gem_source_subpath_problem I, [2024-05-15T00:08:38.076267 #171953] INFO -- : [502/885] 212846=test_object_references I, [2024-05-15T00:08:38.079191 #171953] INFO -- : [503/885] 212846=test_helper I, [2024-05-15T00:08:38.084694 #171953] INFO -- : [504/885] 212846=test_duplicate I, [2024-05-15T00:08:38.098424 #171953] INFO -- : [505/885] 212846=test_gem_resolver_api_set I, [2024-05-15T00:08:38.180783 #171953] INFO -- : [506/885] 212846=test_addr I, [2024-05-15T00:08:38.197605 #171953] INFO -- : [507/885] 212846=test_mailto I, [2024-05-15T00:08:38.207608 #171953] INFO -- : [508/885] 212846=test_kill_ring I, [2024-05-15T00:08:38.215546 #171953] INFO -- : [509/885] 212846=test_member I, [2024-05-15T00:08:38.221798 #171953] INFO -- : [510/885] 212846=test_object I, [2024-05-15T00:08:38.231538 #171953] INFO -- : [511/885] 212846=test_cgi_header I, [2024-05-15T00:08:38.240990 #171953] INFO -- : [512/885] 212846=format_errors_test I, [2024-05-15T00:08:38.248336 #171953] INFO -- : [513/885] 212846=test_case_options I, [2024-05-15T00:08:38.260372 #171953] INFO -- : [514/885] 212846=test_gem_console_ui I, [2024-05-15T00:08:38.573872 #171953] INFO -- : [515/885] 212846=test_allocation I, [2024-05-15T00:08:38.874323 #171953] INFO -- : [516/885] 212844=test_ifunless I, [2024-05-15T00:08:38.878738 #171953] INFO -- : [517/885] 212844=test_insns_leaf I, [2024-05-15T00:08:38.909428 #171953] INFO -- : [518/885] 212844=test_readpartial I, [2024-05-15T00:08:39.298972 #171953] INFO -- : [519/885] 212844=test_httpresponse I, [2024-05-15T00:08:39.330754 #171953] INFO -- : [520/885] 212844=test_rdoc_parser_ruby I, [2024-05-15T00:08:40.012594 #171953] INFO -- : [521/885] 212844=test_x509req I, [2024-05-15T00:08:40.041039 #171953] INFO -- : [522/885] 212844=test_gem_resolver I, [2024-05-15T00:08:40.347261 #171953] INFO -- : [523/885] 212844=test_gem_source_vendor I, [2024-05-15T00:08:40.364920 #171953] INFO -- : [524/885] 212844=test_object I, [2024-05-15T00:08:40.647857 #171953] INFO -- : [525/885] 212846=test_dln I, [2024-05-15T00:08:40.680146 #171953] INFO -- : [526/885] 212846=unescape_test I, [2024-05-15T00:08:40.724006 #171953] INFO -- : [527/885] 212844=test_gem_commands_exec_command I, [2024-05-15T00:08:42.046450 #171953] INFO -- : [528/885] 212844=test_super I, [2024-05-15T00:08:42.129391 #171953] INFO -- : [529/885] 212846=test_color_printer I, [2024-05-15T00:08:42.137741 #171953] INFO -- : [530/885] 212846=test_modify_expand I, [2024-05-15T00:08:42.168250 #171953] INFO -- : [531/885] 212846=test_gem_available_set I, [2024-05-15T00:08:42.284480 #171953] INFO -- : [532/885] 212846=test_pkg_config I, [2024-05-15T00:08:42.301908 #171953] INFO -- : [533/885] 212846=errors_test I, [2024-05-15T00:08:43.447616 #171953] INFO -- : [534/885] 212846=test_convertible I, [2024-05-15T00:08:43.452352 #171953] INFO -- : [535/885] 212844=test_vm_dump I, [2024-05-15T00:08:43.457540 #171953] INFO -- : [536/885] 212844=json_encoding_test I, [2024-05-15T00:08:43.514773 #171953] INFO -- : [537/885] 212844=test_func I, [2024-05-15T00:08:45.992633 #171953] INFO -- : [538/885] 212846=test_config I, [2024-05-15T00:08:46.032865 #171953] INFO -- : [539/885] 212846=test_compile_prism I, [2024-05-15T00:08:46.325911 #171953] INFO -- : [540/885] 212846=test_helper I, [2024-05-15T00:08:46.331936 #171953] INFO -- : [541/885] 212846=test_win32ole_event I, [2024-05-15T00:08:46.364783 #171953] INFO -- : [542/885] 212846=test_gem_commands_uninstall_command I, [2024-05-15T00:08:47.207451 #171953] INFO -- : [543/885] 212846=test_rdoc_markup_formatter I, [2024-05-15T00:08:47.226557 #171953] INFO -- : [544/885] 212846=test_digest_extend I, [2024-05-15T00:08:47.260468 #171953] INFO -- : [545/885] 212846=test_gem_ext_cmake_builder I, [2024-05-15T00:08:47.267017 #171953] INFO -- : [546/885] 212846=test_thread_fd_close I, [2024-05-15T00:08:47.419631 #171953] INFO -- : [547/885] 212846=test_last_thread I, [2024-05-15T00:08:47.842011 #171953] INFO -- : [548/885] 212844=test_getopts I, [2024-05-15T00:08:47.848536 #171953] INFO -- : [549/885] 212844=test_emitter I, [2024-05-15T00:08:47.854358 #171953] INFO -- : [550/885] 212844=test_alias I, [2024-05-15T00:08:48.063208 #171953] INFO -- : [551/885] 212844=test_fips I, [2024-05-15T00:08:48.245321 #171953] INFO -- : [552/885] 212844=test_pattern_key_name_check I, [2024-05-15T00:08:48.250968 #171953] INFO -- : [553/885] 212844=test_profile_frames I, [2024-05-15T00:08:48.344479 #171953] INFO -- : [554/885] 212846=test_debug I, [2024-05-15T00:08:48.351772 #171953] INFO -- : [555/885] 212846=test_refinement I, [2024-05-15T00:08:48.502694 #171953] INFO -- : [556/885] 212844=test_transcode I, [2024-05-15T00:08:48.769359 #171953] INFO -- : [557/885] 212844=test_class2name I, [2024-05-15T00:08:48.770315 #171953] INFO -- : [558/885] 212844=test_gem_commands_cleanup_command I, [2024-05-15T00:08:48.990537 #171953] INFO -- : [559/885] 212845=test_dns I, [2024-05-15T00:08:49.375284 #171953] INFO -- : [560/885] 212844=test_c_union_entity I, [2024-05-15T00:08:49.457420 #171953] INFO -- : [561/885] 212845=test_notimplement I, [2024-05-15T00:08:49.472257 #171953] INFO -- : [562/885] 212845=test_cgi_session I, [2024-05-15T00:08:49.483109 #171953] INFO -- : [563/885] 212844=test_x509crl I, [2024-05-15T00:08:49.497021 #171953] INFO -- : [564/885] 212845=test_rdoc_markup_heading I, [2024-05-15T00:08:49.503261 #171953] INFO -- : [565/885] 212845=test_io_console I, [2024-05-15T00:08:49.597174 #171953] INFO -- : [566/885] 212844=test_flip I, [2024-05-15T00:08:49.621200 #171953] INFO -- : [567/885] 212844=test_rbconfig I, [2024-05-15T00:08:49.632234 #171953] INFO -- : [568/885] 212844=test_num2int I, [2024-05-15T00:08:49.638099 #171953] INFO -- : [569/885] 212844=test_iter_break I, [2024-05-15T00:08:49.645389 #171953] INFO -- : [570/885] 212844=test_extlibs I, [2024-05-15T00:08:49.918089 #171953] INFO -- : Leaked file descriptor: TestIO_Console#test_noecho2: 10 # I, [2024-05-15T00:08:49.942921 #171953] INFO -- : COMMAND PID USER FD TYPE DEVICE SIZE/OFF NODE NAME I, [2024-05-15T00:08:49.942991 #171953] INFO -- : ruby 212845 opc 10r REG 252,0 6940392 13705429 /var/lib/sss/mc/group I, [2024-05-15T00:08:51.144183 #171953] INFO -- : [571/885] 212844=test_gem_commands_signin_command I, [2024-05-15T00:08:51.331032 #171953] INFO -- : [572/885] 212844=test_range I, [2024-05-15T00:08:52.015880 #171953] INFO -- : [573/885] 212844=test_recursion I, [2024-05-15T00:08:52.043366 #171953] INFO -- : [574/885] 212844=test_require I, [2024-05-15T00:08:52.080308 #171953] INFO -- : [575/885] 212846=test_enum I, [2024-05-15T00:08:52.167543 #171953] INFO -- : [576/885] 212845=test_rdoc_markup_include I, [2024-05-15T00:08:52.176076 #171953] INFO -- : [577/885] 212845=test_address_resolve I, [2024-05-15T00:08:52.196694 #171953] INFO -- : [578/885] 212845=test_trick I, [2024-05-15T00:08:53.074016 #171953] INFO -- : [579/885] 212846=test_ractor I, [2024-05-15T00:08:53.138837 #171953] INFO -- : [580/885] 212846=test_stream I, [2024-05-15T00:08:53.148682 #171953] INFO -- : [581/885] 212846=test_rdoc_attr I, [2024-05-15T00:08:53.168689 #171953] INFO -- : [582/885] 212846=test_locale I, [2024-05-15T00:08:53.192809 #171953] INFO -- : [583/885] 212846=test_ts I, [2024-05-15T00:08:53.273454 #171953] INFO -- : [584/885] 212844=test_date_marshal I, [2024-05-15T00:08:53.274084 #171953] INFO -- : [585/885] 212844=test_have_func I, [2024-05-15T00:08:53.472473 #171953] INFO -- : [586/885] 212846=test_configuration I, [2024-05-15T00:08:53.558964 #171953] INFO -- : [587/885] 212846=test_gem_resolver_local_specification I, [2024-05-15T00:08:53.603751 #171953] INFO -- : [588/885] 212846=test_gem_commands_list_command I, [2024-05-15T00:08:53.620189 #171953] INFO -- : [589/885] 212846=test_date_new I, [2024-05-15T00:08:53.630016 #171953] INFO -- : [590/885] 212846=test_udp I, [2024-05-15T00:08:53.642776 #171953] INFO -- : [591/885] 212846=test_context I, [2024-05-15T00:08:53.764267 #171953] INFO -- : [592/885] 212846=test_gem_commands_contents_command I, [2024-05-15T00:08:53.887531 #171953] INFO -- : [593/885] 212846=test_coder I, [2024-05-15T00:08:53.912687 #171953] INFO -- : [594/885] 212846=test_rdoc_servlet I, [2024-05-15T00:08:54.028802 #171953] INFO -- : [595/885] 212846=test_gem_commands_search_command I, [2024-05-15T00:08:54.049842 #171953] INFO -- : [596/885] 212846=test_symbol I, [2024-05-15T00:08:54.595005 #171953] INFO -- : [597/885] 212844=test_formatter I, [2024-05-15T00:08:54.595320 #171953] INFO -- : [598/885] 212844=test_unix I, [2024-05-15T00:08:54.644903 #171953] INFO -- : [599/885] 212844=test_integer I, [2024-05-15T00:08:54.732021 #171953] INFO -- : [600/885] 212845=test_enc_str_buf_cat I, [2024-05-15T00:08:54.795058 #171953] INFO -- : [601/885] 212845=newline_test I, [2024-05-15T00:08:54.881567 #171953] INFO -- : [602/885] 212845=test_bignum I, [2024-05-15T00:08:57.052445 #171953] INFO -- : [603/885] 212844=test_rdoc_markup_hard_break I, [2024-05-15T00:08:57.067685 #171953] INFO -- : [604/885] 212844=test_marshal I, [2024-05-15T00:08:58.326124 #171953] INFO -- : [605/885] 212844=ractor_test I, [2024-05-15T00:08:58.332711 #171953] INFO -- : [606/885] 212844=test_ancdata I, [2024-05-15T00:08:58.345184 #171953] INFO -- : [607/885] 212844=test_nesting_parser I, [2024-05-15T00:08:58.363936 #171953] INFO -- : [608/885] 212844=test_gem_resolver_conflict I, [2024-05-15T00:08:58.464573 #171953] INFO -- : [609/885] 212844=test_ractor I, [2024-05-15T00:08:58.519324 #171953] INFO -- : [610/885] 212845=test_scheduler I, [2024-05-15T00:08:58.688667 #171953] INFO -- : [611/885] 212845=test_gem_commands_help_command I, [2024-05-15T00:08:58.726723 #171953] INFO -- : [612/885] 212844=test_ssl I, [2024-05-15T00:08:58.755792 #171953] INFO -- : [613/885] 212845=test_gem I, [2024-05-15T00:08:58.766239 #171953] INFO -- : [614/885] 212846=test_registry I, [2024-05-15T00:08:58.775558 #171953] INFO -- : [615/885] 212846=json_generator_test I, [2024-05-15T00:08:58.881784 #171953] INFO -- : [616/885] 212846=test_ansi_without_terminfo I, [2024-05-15T00:08:58.888272 #171953] INFO -- : [617/885] 212846=test_ractor I, [2024-05-15T00:08:58.904710 #171953] INFO -- : [618/885] 212844=test_parser I, [2024-05-15T00:08:58.906846 #171953] INFO -- : [619/885] 212846=test_rdoc_markup_to_label I, [2024-05-15T00:08:58.972140 #171953] INFO -- : [620/885] 212844=test_gem_resolver_best_set I, [2024-05-15T00:08:58.993624 #171953] INFO -- : [621/885] 212846=test_cgi_core I, [2024-05-15T00:08:59.012809 #171953] INFO -- : [622/885] 212846=test_windows_1251 I, [2024-05-15T00:08:59.018221 #171953] INFO -- : [623/885] 212846=test_gem_ext_builder I, [2024-05-15T00:08:59.046868 #171953] INFO -- : [624/885] 212844=test_to_ary_concat I, [2024-05-15T00:09:00.052594 #171953] INFO -- : [625/885] 212846=test_history I, [2024-05-15T00:09:00.114271 #171953] INFO -- : [626/885] 212846=test_reline I, [2024-05-15T00:09:00.367758 #171953] INFO -- : [627/885] 212846=test_call I, [2024-05-15T00:09:00.556001 #171953] INFO -- : Leaked file descriptor: TestGem#test_self_clear_paths: 9 # I, [2024-05-15T00:09:00.580691 #171953] INFO -- : COMMAND PID USER FD TYPE DEVICE SIZE/OFF NODE NAME I, [2024-05-15T00:09:00.580766 #171953] INFO -- : ruby 212845 opc 9r REG 252,0 9253600 13705411 /var/lib/sss/mc/passwd I, [2024-05-15T00:09:00.636543 #171953] INFO -- : [628/885] 212846=test_ellipsize I, [2024-05-15T00:09:00.643087 #171953] INFO -- : [629/885] 212846=test_gem_commands_build_commandEnvironment variable changed: TestGem#test_self_clear_paths : "GEM_PRIVATE_KEY_PASSPHRASE" added I, [2024-05-15T00:09:00.643162 #171953] INFO -- : Environment variable changed: TestGem#test_self_clear_paths : "GEM_SPEC_CACHE" added I, [2024-05-15T00:09:00.643173 #171953] INFO -- : Environment variable changed: TestGem#test_self_clear_paths : "HOME" changed : "/home/opc" -> "/tmp/rubytest.hyijbe/test_rubygems_20240515-212845-qj47gn/userhome" I, [2024-05-15T00:09:00.643183 #171953] INFO -- : Environment variable changed: TestGem#test_self_clear_paths : "RUBYGEMS_PREVENT_UPDATE_SUGGESTION" added I, [2024-05-15T00:09:00.647761 #171953] INFO -- : I, [2024-05-15T00:09:00.981013 #171953] INFO -- : [630/885] 212846=test_data I, [2024-05-15T00:09:00.985263 #171953] INFO -- : [631/885] 212846=test_bug-14834 I, [2024-05-15T00:09:01.064244 #171953] INFO -- : [632/885] 212846=test_inlinecache I, [2024-05-15T00:09:01.106239 #171953] INFO -- : [633/885] 212845=test_socket I, [2024-05-15T00:09:01.118598 #171953] INFO -- : [634/885] 212846=test_terminfo I, [2024-05-15T00:09:01.147385 #171953] INFO -- : [635/885] 212846=test_thread I, [2024-05-15T00:09:01.837255 #171953] INFO -- : .Leaked thread: TestSocket#test_accept_loop_multi_port: # I, [2024-05-15T00:09:01.838187 #171953] INFO -- : Finished thread: TestSocket#test_bintime: # I, [2024-05-15T00:09:02.261750 #171953] INFO -- : [636/885] 212845=test_time_tz I, [2024-05-15T00:09:02.408584 #171953] INFO -- : [637/885] 212845=test_addrinfo I, [2024-05-15T00:09:02.485523 #171953] INFO -- : Leaked file descriptor: TestSocketAddrinfo#test_addrinfo_timeout: 11 # I, [2024-05-15T00:09:02.509330 #171953] INFO -- : [638/885] 212844=test_to_ruby I, [2024-05-15T00:09:02.509752 #171953] INFO -- : COMMAND PID USER FD TYPE DEVICE SIZE/OFF NODE NAME I, [2024-05-15T00:09:02.509784 #171953] INFO -- : ruby 212845 opc 11u unix 0x0000000000000000 0t0 2985388881 type=STREAM I, [2024-05-15T00:09:02.532842 #171953] INFO -- : [639/885] 212844=ruby_api_test I, [2024-05-15T00:09:02.641282 #171953] INFO -- : [640/885] 212845=test_gem_resolver_index_set I, [2024-05-15T00:09:02.655336 #171953] INFO -- : [641/885] 212844=test_webauthn_listener_response I, [2024-05-15T00:09:02.677595 #171953] INFO -- : [642/885] 212844=test_sleep I, [2024-05-15T00:09:02.694686 #171953] INFO -- : [643/885] 212845=constant_path_node_test I, [2024-05-15T00:09:02.703254 #171953] INFO -- : [644/885] 212845=test_set_len I, [2024-05-15T00:09:02.708465 #171953] INFO -- : [645/885] 212845=test_interned_str I, [2024-05-15T00:09:02.713334 #171953] INFO -- : [646/885] 212845=test_folderitem2_invokeverb I, [2024-05-15T00:09:02.739132 #171953] INFO -- : [647/885] 212845=test_pattern_matching I, [2024-05-15T00:09:02.800665 #171953] INFO -- : [648/885] 212845=test_gc I, [2024-05-15T00:09:07.698539 #171953] INFO -- : [649/885] 212844=test_gem_bundler_version_finder I, [2024-05-15T00:09:07.761741 #171953] INFO -- : [650/885] 212844=test_gem_request_set I, [2024-05-15T00:09:08.317851 #171953] INFO -- : [651/885] 212844=test_symbol I, [2024-05-15T00:09:08.375967 #171953] INFO -- : [652/885] 212844=test_project_sanity I, [2024-05-15T00:09:08.388715 #171953] INFO -- : [653/885] 212844=location_test I, [2024-05-15T00:09:08.487796 #171953] INFO -- : [654/885] 212844=test_delegate I, [2024-05-15T00:09:08.501994 #171953] INFO -- : [655/885] 212844=test_chilled I, [2024-05-15T00:09:08.555436 #171953] INFO -- : [656/885] 212844=test_ensured I, [2024-05-15T00:09:08.561231 #171953] INFO -- : [657/885] 212844=test_euc_jp I, [2024-05-15T00:09:08.571747 #171953] INFO -- : [658/885] 212844=test_key_stroke I, [2024-05-15T00:09:08.579090 #171953] INFO -- : [659/885] 212844=test_rdoc_markup I, [2024-05-15T00:09:08.587601 #171953] INFO -- : [660/885] 212844=test_alias_and_anchor I, [2024-05-15T00:09:08.595823 #171953] INFO -- : [661/885] 212844=test_time I, [2024-05-15T00:09:08.816930 #171953] INFO -- : [662/885] 212844=test_popen_deadlock I, [2024-05-15T00:09:09.351233 #171953] INFO -- : [663/885] 212844=test_ractor I, [2024-05-15T00:09:09.420678 #171953] INFO -- : [664/885] 212844=test_gem_resolver_installed_specification I, [2024-05-15T00:09:09.489479 #171953] INFO -- : [665/885] 212844=test_exception_at_throwing I, [2024-05-15T00:09:09.500889 #171953] INFO -- : [666/885] 212844=test_stringscanner I, [2024-05-15T00:09:09.582646 #171953] INFO -- : [667/885] 212844=test_fiddle I, [2024-05-15T00:09:09.738840 #171953] INFO -- : [668/885] 212844=json_generic_object_test I, [2024-05-15T00:09:09.747752 #171953] INFO -- : [669/885] 212844=test_date_arith I, [2024-05-15T00:09:09.756690 #171953] INFO -- : [670/885] 212844=test_gem_resolver_vendor_specification I, [2024-05-15T00:09:09.794619 #171953] INFO -- : [671/885] 212844=test_gem_safe_marshal I, [2024-05-15T00:09:10.493434 #171953] INFO -- : [672/885] 212844=test_rdoc_ri_driver I, [2024-05-15T00:09:10.842638 #171953] INFO -- : [673/885] 212846=test_ractor I, [2024-05-15T00:09:10.884736 #171953] INFO -- : [674/885] 212844=test_sexp I, [2024-05-15T00:09:10.906171 #171953] INFO -- : [675/885] 212844=test_httpheader I, [2024-05-15T00:09:10.914587 #171953] INFO -- : [676/885] 212844=test_signedness I, [2024-05-15T00:09:10.927644 #171953] INFO -- : [677/885] 212846=test_gem_commands_check_command I, [2024-05-15T00:09:11.032600 #171953] INFO -- : [678/885] 212846=test_gem_resolver_git_set I, [2024-05-15T00:09:11.592135 #171953] INFO -- : [679/885] 212846=test_digest I, [2024-05-15T00:09:12.224547 #171953] INFO -- : [680/885] 212845=test_rdoc_single_class I, [2024-05-15T00:09:12.234591 #171953] INFO -- : [681/885] 212845=test_dup I, [2024-05-15T00:09:12.370199 #171953] INFO -- : [682/885] 212846=test_acceptable I, [2024-05-15T00:09:12.399301 #171953] INFO -- : [683/885] 212845=test_gem_ext_cargo_builder_link_flag_converter I, [2024-05-15T00:09:12.421040 #171953] INFO -- : [684/885] 212846=test_gem_local_remote_options I, [2024-05-15T00:09:12.461743 #171953] INFO -- : [685/885] 212845=test_rdoc_token_stream I, [2024-05-15T00:09:12.475921 #171953] INFO -- : [686/885] 212845=test_mutex I, [2024-05-15T00:09:12.482950 #171953] INFO -- : [687/885] 212846=heredoc_dedent_test I, [2024-05-15T00:09:12.498294 #171953] INFO -- : [688/885] 212846=test_type I, [2024-05-15T00:09:12.512683 #171953] INFO -- : [689/885] 212846=test_tmpdir I, [2024-05-15T00:09:12.596678 #171953] INFO -- : [690/885] 212846=test_struct I, [2024-05-15T00:09:12.801633 #171953] INFO -- : [691/885] 212844=test_ssl_session I, [2024-05-15T00:09:13.106040 #171953] INFO -- : [692/885] 212846=test_gem_package_tar_header I, [2024-05-15T00:09:13.179502 #171953] INFO -- : [693/885] 212846=test_rational2 I, [2024-05-15T00:09:13.188307 #171953] INFO -- : [694/885] 212846=test_logperiod I, [2024-05-15T00:09:13.240266 #171953] INFO -- : [695/885] 212846=test_case_comprehensive I, [2024-05-15T00:09:13.550686 #171953] INFO -- : [696/885] 212844=test_placearg I, [2024-05-15T00:09:13.613052 #171953] INFO -- : [697/885] 212844=test_file_exhaustive I, [2024-05-15T00:09:13.630376 #171953] INFO -- : [698/885] 212845=test_completion I, [2024-05-15T00:09:14.766489 #171953] INFO -- : [699/885] 212845=parse_stream_test I, [2024-05-15T00:09:14.804646 #171953] INFO -- : [700/885] 212845=test_handle I, [2024-05-15T00:09:15.893715 #171953] INFO -- : [701/885] 212845=test_delete I, [2024-05-15T00:09:15.899732 #171953] INFO -- : [702/885] 212845=test_rdoc_markup_document I, [2024-05-15T00:09:15.926813 #171953] INFO -- : [703/885] 212845=test_gem_security_policy I, [2024-05-15T00:09:16.305993 #171953] INFO -- : [704/885] 212845=test_io_wait_uncommon I, [2024-05-15T00:09:16.320898 #171953] INFO -- : [705/885] 212845=test_gem_ci_detector I, [2024-05-15T00:09:16.329047 #171953] INFO -- : Environment variable changed: TestCiDetector#test_ci_strings : "GEM_SPEC_CACHE" changed : "/tmp/rubytest.hyijbe/test_rubygems_20240515-212845-qj47gn/spec_cache" -> "/tmp/rubytest.hyijbe/test_rubygems_20240515-212845-214ir9/spec_cache" I, [2024-05-15T00:09:16.329119 #171953] INFO -- : Environment variable changed: TestCiDetector#test_ci_strings : "HOME" changed : "/tmp/rubytest.hyijbe/test_rubygems_20240515-212845-qj47gn/userhome" -> "/tmp/rubytest.hyijbe/test_rubygems_20240515-212845-214ir9/userhome" I, [2024-05-15T00:09:16.404115 #171953] INFO -- : Environment variable changed: TestCiDetector#test_ci? : "GEM_SPEC_CACHE" changed : "/tmp/rubytest.hyijbe/test_rubygems_20240515-212845-214ir9/spec_cache" -> "/tmp/rubytest.hyijbe/test_rubygems_20240515-212845-jcc8vw/spec_cache" I, [2024-05-15T00:09:16.404191 #171953] INFO -- : Environment variable changed: TestCiDetector#test_ci? : "HOME" changed : "/tmp/rubytest.hyijbe/test_rubygems_20240515-212845-214ir9/userhome" -> "/tmp/rubytest.hyijbe/test_rubygems_20240515-212845-jcc8vw/userhome" I, [2024-05-15T00:09:16.479001 #171953] INFO -- : [706/885] 212845=test_continuation I, [2024-05-15T00:09:16.483221 #171953] INFO -- : [707/885] 212845=test_signal I, [2024-05-15T00:09:18.528889 #171953] INFO -- : [708/885] 212845=test_gem_silent_ui I, [2024-05-15T00:09:18.574032 #171953] INFO -- : [709/885] 212845=test_fixnum I, [2024-05-15T00:09:18.592325 #171953] INFO -- : [710/885] 212845=test_rdoc_markup_to_ansi I, [2024-05-15T00:09:18.637252 #171953] INFO -- : [711/885] 212845=test_evaluation I, [2024-05-15T00:09:18.647641 #171953] INFO -- : [712/885] 212845=test_protocol I, [2024-05-15T00:09:18.951998 #171953] INFO -- : [713/885] 212845=test_files_test I, [2024-05-15T00:09:18.960458 #171953] INFO -- : [714/885] 212845=test_weakkeymap I, [2024-05-15T00:09:19.490877 #171953] INFO -- : [715/885] 212845=test_https I, [2024-05-15T00:09:19.660112 #171953] INFO -- : [716/885] 212845=test_gem_commands_info_command I, [2024-05-15T00:09:19.742754 #171953] INFO -- : [717/885] 212845=test_object_create_start I, [2024-05-15T00:09:19.746743 #171953] INFO -- : [718/885] 212845=test_gem_request_set_gem_dependency_api I, [2024-05-15T00:09:20.023365 #171953] INFO -- : [719/885] 212845=test_name_error_extension I, [2024-05-15T00:09:20.056780 #171953] INFO -- : [720/885] 212845=test_irb I, [2024-05-15T00:09:20.324936 #171953] INFO -- : [721/885] 212845=test_rdoc_markup_paragraph I, [2024-05-15T00:09:20.341436 #171953] INFO -- : [722/885] 212845=test_x509cert I, [2024-05-15T00:09:20.466643 #171953] INFO -- : [723/885] 212845=test_require_path_check I, [2024-05-15T00:09:20.596402 #171953] INFO -- : [724/885] 212845=test_bn I, [2024-05-15T00:09:20.626224 #171953] INFO -- : [725/885] 212845=test_variable_name_check I, [2024-05-15T00:09:20.728412 #171953] INFO -- : [726/885] 212845=test_logdevice I, [2024-05-15T00:09:21.701295 #171953] INFO -- : [727/885] 212845=test_ast I, [2024-05-15T00:09:24.027705 #171953] INFO -- : [728/885] 212844=test_gem_source_lock I, [2024-05-15T00:09:24.090891 #171953] INFO -- : [729/885] 212844=test_cipher I, [2024-05-15T00:09:24.108051 #171953] INFO -- : [730/885] 212844=test_update I, [2024-05-15T00:09:24.116044 #171953] INFO -- : [731/885] 212844=test_new I, [2024-05-15T00:09:24.119248 #171953] INFO -- : [732/885] 212844=test_rdoc_rd_inline_parser I, [2024-05-15T00:09:24.159354 #171953] INFO -- : [733/885] 212844=test_win32ole_type I, [2024-05-15T00:09:24.161084 #171953] INFO -- : [734/885] 212844=test_load I, [2024-05-15T00:09:24.175648 #171953] INFO -- : [735/885] 212844=test_rdoc_rd_block_parser I, [2024-05-15T00:09:24.275890 #171953] INFO -- : [736/885] 212844=test_x509store I, [2024-05-15T00:09:24.728871 #171953] INFO -- : [737/885] 212844=test_rdoc_rd I, [2024-05-15T00:09:24.737835 #171953] INFO -- : [738/885] 212844=test_rdoc_markup_to_joined_paragraph I, [2024-05-15T00:09:24.754547 #171953] INFO -- : [739/885] 212844=test_rdoc_markup_to_markdown I, [2024-05-15T00:09:24.798476 #171953] INFO -- : [740/885] 212844=test_rdoc_generator_pot I, [2024-05-15T00:09:24.803503 #171953] INFO -- : [741/885] 212844=test_require_lib I, [2024-05-15T00:09:27.975987 #171953] INFO -- : [742/885] 212844=test_gem_gem_runner I, [2024-05-15T00:09:28.023316 #171953] INFO -- : [743/885] 212844=test_metaclass I, [2024-05-15T00:09:28.096103 #171953] INFO -- : [744/885] 212844=test_objectspace I, [2024-05-15T00:09:28.980518 #171953] INFO -- : [745/885] 212844=test_require I, [2024-05-15T00:09:31.684901 #171953] INFO -- : [746/885] 212844=test_debugger_integration I, [2024-05-15T00:09:31.696853 #171953] INFO -- : [747/885] 212844=test_my_integer I, [2024-05-15T00:09:31.762916 #171953] INFO -- : [748/885] 212844=test_gem_resolver_composed_set I, [2024-05-15T00:09:31.781511 #171953] INFO -- : [749/885] 212844=test_tracer I, [2024-05-15T00:09:31.788245 #171953] INFO -- : [750/885] 212844=test_not I, [2024-05-15T00:09:31.798452 #171953] INFO -- : [751/885] 212844=test_cgi_cookie I, [2024-05-15T00:09:31.925436 #171953] INFO -- : [752/885] 212844=test_option I, [2024-05-15T00:09:31.931016 #171953] INFO -- : [753/885] 212844=test_rdoc_markup_attribute_manager I, [2024-05-15T00:09:31.971800 #171953] INFO -- : [754/885] 212844=test_wss I, [2024-05-15T00:09:31.983491 #171953] INFO -- : [755/885] 212844=test_gem_security_trust_dir I, [2024-05-15T00:09:32.054325 #171953] INFO -- : [756/885] 212844=test_module I, [2024-05-15T00:09:35.252014 #171953] INFO -- : [757/885] 212844=test_erb_command I, [2024-05-15T00:09:35.286726 #171953] INFO -- : [758/885] 212844=test_usrmarshal I, [2024-05-15T00:09:35.500588 #171953] INFO -- : [759/885] 212844=test_gem_validator I, [2024-05-15T00:09:35.530647 #171953] INFO -- : [760/885] 212844=test_gem_source_installed I, [2024-05-15T00:09:35.574785 #171953] INFO -- : [761/885] 212844=test_abi I, [2024-05-15T00:09:35.739630 #171953] INFO -- : [762/885] 212844=test_integer_comb I, [2024-05-15T00:09:35.880316 #171953] INFO -- : [763/885] 212846=test_bundled_ca I, [2024-05-15T00:09:37.267038 #171953] INFO -- : [764/885] 212846=test_load I, [2024-05-15T00:09:37.296507 #171953] INFO -- : [765/885] 212846=test_ssl I, [2024-05-15T00:09:38.369102 #171953] INFO -- : [766/885] 212844=test_gem_package_task I, [2024-05-15T00:09:38.393835 #171953] INFO -- : [767/885] 212844=test_lock_native_thread I, [2024-05-15T00:09:38.655227 #171953] INFO -- : [768/885] 212844=test_resize I, [2024-05-15T00:09:38.661932 #171953] INFO -- : [769/885] 212844=test_win32ole_param I, [2024-05-15T00:09:38.669034 #171953] INFO -- : [770/885] 212844=test_key_error I, [2024-05-15T00:09:38.761749 #171953] INFO -- : [771/885] 212844=test_engine I, [2024-05-15T00:09:39.209206 #171953] INFO -- : [772/885] 212844=test_fiber I, [2024-05-15T00:09:45.446956 #171953] INFO -- : [773/885] 212844=test_gem_commands_mirror I, [2024-05-15T00:09:45.458107 #171953] INFO -- : [774/885] 212844=test_rdoc_parser_markdown I, [2024-05-15T00:09:45.481796 #171953] INFO -- : [775/885] 212844=test_custom_command I, [2024-05-15T00:09:45.482256 #171953] INFO -- : [776/885] 212844=fuzzer_test I, [2024-05-15T00:09:45.499044 #171953] INFO -- : [777/885] 212844=test_rubyvm I, [2024-05-15T00:09:45.565648 #171953] INFO -- : [778/885] 212844=test_cparser I, [2024-05-15T00:09:47.813786 #171953] INFO -- : [779/885] 212844=test_struct I, [2024-05-15T00:09:47.826968 #171953] INFO -- : [780/885] 212844=static_inspect_test I, [2024-05-15T00:09:47.836750 #171953] INFO -- : [781/885] 212844=test_c_struct_entry I, [2024-05-15T00:09:47.865784 #171953] INFO -- : [782/885] 212846=test_config I, [2024-05-15T00:09:47.932784 #171953] INFO -- : [783/885] 212846=test_ostruct I, [2024-05-15T00:09:48.096713 #171953] INFO -- : [784/885] 212846=test_depth_first I, [2024-05-15T00:09:48.158034 #171953] INFO -- : [785/885] 212846=test_change_word I, [2024-05-15T00:09:48.160768 #171953] INFO -- : [786/885] 212846=test_scanner_events I, [2024-05-15T00:09:48.209553 #171953] INFO -- : [787/885] 212846=test_ocsp I, [2024-05-15T00:09:48.313206 #171953] INFO -- : [788/885] 212846=test_ipaddr I, [2024-05-15T00:09:48.339266 #171953] INFO -- : [789/885] 212846=test_omap I, [2024-05-15T00:09:48.349271 #171953] INFO -- : [790/885] 212846=test_date_strptime I, [2024-05-15T00:09:48.478285 #171953] INFO -- : [791/885] 212846=test_rdoc_generator_pot_po I, [2024-05-15T00:09:48.488530 #171953] INFO -- : [792/885] 212846=test_shellwords I, [2024-05-15T00:09:48.499240 #171953] INFO -- : [793/885] 212846=test_mul I, [2024-05-15T00:09:48.507253 #171953] INFO -- : [794/885] 212846=json_ext_parser_test I, [2024-05-15T00:09:48.520690 #171953] INFO -- : [795/885] 212846=test_gem_ext_configure_builder I, [2024-05-15T00:09:48.565019 #171953] INFO -- : [796/885] 212846=test_nonblock I, [2024-05-15T00:09:48.590985 #171953] INFO -- : [797/885] 212846=test_rdoc_parser_simple I, [2024-05-15T00:09:48.620369 #171953] INFO -- : [798/885] 212846=test_rdoc_top_level I, [2024-05-15T00:09:48.744312 #171953] INFO -- : [799/885] 212844=test_io_m17n I, [2024-05-15T00:09:48.953582 #171953] INFO -- : [800/885] 212846=test_cmethod I, [2024-05-15T00:09:48.989575 #171953] INFO -- : [801/885] 212846=test_float I, [2024-05-15T00:09:50.054132 #171953] INFO -- : [802/885] 212844=test_gem_stub_specification I, [2024-05-15T00:09:50.219057 #171953] INFO -- : [803/885] 212844=test_color I, [2024-05-15T00:09:50.353440 #171953] INFO -- : [804/885] 212844=test_propertyputref I, [2024-05-15T00:09:50.361863 #171953] INFO -- : [805/885] 212844=test_gb18030 I, [2024-05-15T00:09:50.376177 #171953] INFO -- : [806/885] 212844=test_gem_commands_lock_command I, [2024-05-15T00:09:50.400136 #171953] INFO -- : [807/885] 212844=test_reline_key I, [2024-05-15T00:09:50.407582 #171953] INFO -- : [808/885] 212844=test_unicode_normalize I, [2024-05-15T00:09:51.085948 #171953] INFO -- : [809/885] 212846=test_gem_stream_ui I, [2024-05-15T00:09:51.205796 #171953] INFO -- : [810/885] 212846=test_rdoc_generator_ri I, [2024-05-15T00:09:51.253754 #171953] INFO -- : [811/885] 212846=test_files_test_1 I, [2024-05-15T00:09:53.886603 #171953] INFO -- : [812/885] 212846=test_dir I, [2024-05-15T00:09:54.243577 #171953] INFO -- : [813/885] 212846=test_closure I, [2024-05-15T00:09:54.371098 #171953] INFO -- : [814/885] 212844=test_rubygems I, [2024-05-15T00:09:54.551734 #171953] INFO -- : [815/885] 212844=test_resolve_symbol I, [2024-05-15T00:09:54.569035 #171953] INFO -- : [816/885] 212844=test_path I, [2024-05-15T00:09:54.578887 #171953] INFO -- : [817/885] 212844=test_digest I, [2024-05-15T00:09:54.588908 #171953] INFO -- : [818/885] 212844=test_rdoc_rd_inline I, [2024-05-15T00:09:54.599391 #171953] INFO -- : [819/885] 212844=test_uncorrectable_name_check I, [2024-05-15T00:09:54.643485 #171953] INFO -- : [820/885] 212844=test_io I, [2024-05-15T00:09:57.077843 #171953] INFO -- : [821/885] 212846=test_x509attr I, [2024-05-15T00:09:57.091838 #171953] INFO -- : [822/885] 212846=test_printf I, [2024-05-15T00:09:57.102546 #171953] INFO -- : [823/885] 212846=test_workspace I, [2024-05-15T00:09:57.229782 #171953] INFO -- : [824/885] 212846=magic_comment_test I, [2024-05-15T00:09:57.237812 #171953] INFO -- : [825/885] 212846=test_win32ole_variant I, [2024-05-15T00:09:57.244324 #171953] INFO -- : [826/885] 212846=test_cgi_modruby I, [2024-05-15T00:09:57.246863 #171953] INFO -- : [827/885] 212846=test_win32ole_param_event I, [2024-05-15T00:09:57.253417 #171953] INFO -- : [828/885] 212846=test_https_proxy I, [2024-05-15T00:09:57.260121 #171953] INFO -- : [829/885] 212846=test_rdoc_parser I, [2024-05-15T00:09:57.319767 #171953] INFO -- : [830/885] 212846=test_gem_commands_rebuild_command I, [2024-05-15T00:09:57.384744 #171953] INFO -- : [831/885] 212846=test_nomethod_error I, [2024-05-15T00:09:57.399555 #171953] INFO -- : [832/885] 212846=test_etc I, [2024-05-15T00:09:57.491055 #171953] INFO -- : [833/885] 212846=test_stat I, [2024-05-15T00:09:57.497400 #171953] INFO -- : [834/885] 212846=test_lazy_enumerator I, [2024-05-15T00:09:57.947672 #171953] INFO -- : [835/885] 212846=test_cgi_multipart I, [2024-05-15T00:09:58.078448 #171953] INFO -- : [836/885] 212846=test_gem_request_set_lockfile_tokenizer I, [2024-05-15T00:09:58.149778 #171953] INFO -- : [837/885] 212846=test_ractor_compatibility I, [2024-05-15T00:09:58.536808 #171953] INFO -- : [838/885] 212846=test_arithmetic_sequence I, [2024-05-15T00:09:58.562658 #171953] INFO -- : [839/885] 212846=integer_parse_test I, [2024-05-15T00:09:58.575231 #171953] INFO -- : [840/885] 212846=test_autoconf I, [2024-05-15T00:09:58.582948 #171953] INFO -- : [841/885] 212846=test_find_executable I, [2024-05-15T00:09:58.592726 #171953] INFO -- : [842/885] 212846=test_sockopt I, [2024-05-15T00:09:58.603513 #171953] INFO -- : [843/885] 212846=test_ftp I, [2024-05-15T00:09:58.613681 #171953] INFO -- : [844/885] 212846=test_gem_source_fetch_problem I, [2024-05-15T00:09:58.638499 #171953] INFO -- : [845/885] 212846=test_install I, [2024-05-15T00:09:58.819702 #171953] INFO -- : [846/885] 212846=test_encoding I, [2024-05-15T00:09:58.840451 #171953] INFO -- : [847/885] 212846=test_rdoc_comment I, [2024-05-15T00:09:58.883647 #171953] INFO -- : [848/885] 212846=command_line_test I, [2024-05-15T00:09:58.900378 #171953] INFO -- : [849/885] 212846=test_win32ole_variant_m I, [2024-05-15T00:09:58.907962 #171953] INFO -- : [850/885] 212846=test_pair I, [2024-05-15T00:10:04.192255 #171953] INFO -- : [851/885] 212846=test_gem_commands_signout_command I, [2024-05-15T00:10:04.209704 #171953] INFO -- : [852/885] 212846=test_gem_package_tar_reader I, [2024-05-15T00:10:04.254842 #171953] INFO -- : [853/885] 212846=test_env I, [2024-05-15T00:10:06.205364 #171953] INFO -- : [854/885] 212845=test_document I, [2024-05-15T00:10:06.217064 #171953] INFO -- : [855/885] 212845=test_eval I, [2024-05-15T00:10:06.229092 #171953] INFO -- : [856/885] 212845=test_gem_safe_yaml I, [2024-05-15T00:10:06.281940 #171953] INFO -- : [857/885] 212845=test_gem_commands_setup_command I, [2024-05-15T00:10:06.780689 #171953] INFO -- : [858/885] 212846=test_history I, [2024-05-15T00:10:06.823026 #171953] INFO -- : [859/885] 212846=test_singleton_function I, [2024-05-15T00:10:06.833244 #171953] INFO -- : [860/885] 212846=test_iseq I, [2024-05-15T00:10:07.025691 #171953] INFO -- : [861/885] 212845=test_primitive I, [2024-05-15T00:10:07.065196 #171953] INFO -- : [862/885] 212845=test_parser I, [2024-05-15T00:10:07.086275 #171953] INFO -- : [863/885] 212845=test_rdoc_ri_paths I, [2024-05-15T00:10:07.155836 #171953] INFO -- : [864/885] 212845=test_gem_source_git I, [2024-05-15T00:10:07.392799 #171953] INFO -- : [865/885] 212846=test_lexer I, [2024-05-15T00:10:07.402992 #171953] INFO -- : [866/885] 212846=test_win32ole_method I, [2024-05-15T00:10:07.436656 #171953] INFO -- : [867/885] 212846=test_regex_casefold I, [2024-05-15T00:10:07.912542 #171953] INFO -- : [868/885] 212846=test_ripper I, [2024-05-15T00:10:08.274182 #171953] INFO -- : [869/885] 212846=test_files_ext I, [2024-05-15T00:10:08.290372 #171953] INFO -- : [870/885] 212846=test_stringio I, [2024-05-15T00:10:08.292783 #171953] INFO -- : [871/885] 212845=test_assembler I, [2024-05-15T00:10:08.297189 #171953] INFO -- : [872/885] 212845=test_thread_cv I, [2024-05-15T00:10:08.378197 #171953] INFO -- : [873/885] 212846=test_random I, [2024-05-15T00:10:08.394543 #171953] INFO -- : [874/885] 212846=test_eval_history I, [2024-05-15T00:10:08.423285 #171953] INFO -- : [875/885] 212846=dispatcher_test I, [2024-05-15T00:10:08.432793 #171953] INFO -- : [876/885] 212846=test_unicode I, [2024-05-15T00:10:08.434525 #171953] INFO -- : [877/885] 212846=test_autoload I, [2024-05-15T00:10:09.000535 #171953] INFO -- : [878/885] 212845=test_gem_package I, [2024-05-15T00:10:09.732038 #171953] INFO -- : [879/885] 212845=test_array I, [2024-05-15T00:10:10.405103 #171953] INFO -- : [880/885] 212844=test_benchmark I, [2024-05-15T00:10:12.341627 #171953] INFO -- : [881/885] 212844=test_at_exit I, [2024-05-15T00:10:12.428747 #171953] INFO -- : [882/885] 212844=test_have_macro I, [2024-05-15T00:10:12.643493 #171953] INFO -- : [883/885] 212844=test_gem_source I, [2024-05-15T00:10:12.863621 #171953] INFO -- : [884/885] 212846=test_mkmf I, [2024-05-15T00:10:12.892403 #171953] INFO -- : [885/885] 212846=test_class I, [2024-05-15T00:10:25.190101 #171953] INFO -- : Finished tests in 202.624240s, 129.7722 tests/s, 46140.3976 assertions/s. E, [2024-05-15T00:10:25.190306 #171953] ERROR -- : Children under /tmp/rubytest.hyijbe: E, [2024-05-15T00:10:25.190501 #171953] ERROR -- : * drwx------ 4 28 2024-05-15 00:09:57 +0000 gem_rebuild20240515-212846-ug2wdn/ E, [2024-05-15T00:10:25.190519 #171953] ERROR -- : * drwxrwxr-x 2 40 2024-05-15 00:09:57 +0000 old/ E, [2024-05-15T00:10:25.190555 #171953] ERROR -- : * -rw-rw-r-- 1 4096 2024-05-15 00:09:57 +0000 rebuild_test_gem-1.0.0.gem E, [2024-05-15T00:10:25.190703 #171953] ERROR -- : * drwxrwxr-x 2 40 2024-05-15 00:09:57 +0000 new/ E, [2024-05-15T00:10:25.190720 #171953] ERROR -- : * -rw-rw-r-- 1 4096 2024-05-15 00:09:57 +0000 rebuild_test_gem-1.0.0.gem I, [2024-05-15T00:10:25.196401 #171953] INFO -- : 26295 tests, 9349163 assertions, 0 failures, 0 errors, 320 skips I, [2024-05-15T00:10:25.196423 #171953] INFO -- : I, [2024-05-15T00:10:25.196434 #171953] INFO -- : ruby -v: ruby 3.4.0dev (2024-05-14T21:44:34Z master e3e1e53098) [aarch64-linux] I, [2024-05-15T00:10:25.197278 #171953] INFO -- : $$$[end] "make yes-test-all TESTOPTS='--stderr-on-failure' TESTS='-j3'" exit with 0. I, [2024-05-15T00:10:25.197543 #171953] INFO -- : $$$[beg] make yes-test-rubyspec MSPECOPT='--error-output stderr --debug -j' TESTS='-j3' I, [2024-05-15T00:10:25.323255 #171953] INFO -- : BASERUBY = /usr/local/bin/ruby --disable=gems I, [2024-05-15T00:10:25.323329 #171953] INFO -- : CC = gcc I, [2024-05-15T00:10:25.323342 #171953] INFO -- : LD = ld I, [2024-05-15T00:10:25.323351 #171953] INFO -- : LDSHARED = gcc -shared I, [2024-05-15T00:10:25.323364 #171953] INFO -- : CFLAGS = -O3 -fno-fast-math -ggdb3 -Wall -Wextra -Wdeprecated-declarations -Wdiv-by-zero -Wduplicated-cond -Wimplicit-function-declaration -Wimplicit-int -Wpointer-arith -Wwrite-strings -Wold-style-definition -Wimplicit-fallthrough=0 -Wmissing-noreturn -Wno-cast-function-type -Wno-constant-logical-operand -Wno-long-long -Wno-missing-field-initializers -Wno-overlength-strings -Wno-packed-bitfield-compat -Wno-parentheses-equality -Wno-self-assign -Wno-tautological-compare -Wno-unused-parameter -Wno-unused-value -Wsuggest-attribute=format -Wsuggest-attribute=noreturn -Wunused-variable -Wmisleading-indentation -Wundef I, [2024-05-15T00:10:25.323375 #171953] INFO -- : XCFLAGS = -U_FORTIFY_SOURCE -D_FORTIFY_SOURCE=2 -fstack-protector-strong -msign-return-address=all -fno-strict-overflow -fvisibility=hidden -fexcess-precision=standard -DRUBY_EXPORT -fPIE -I. -I.ext/include/aarch64-linux -I/home/opc/ruby/src/master/include -I/home/opc/ruby/src/master -I/home/opc/ruby/src/master/prism -I/home/opc/ruby/src/master/enc/unicode/15.0.0 I, [2024-05-15T00:10:25.323384 #171953] INFO -- : CPPFLAGS = I, [2024-05-15T00:10:25.323393 #171953] INFO -- : DLDFLAGS = -Wl,--compress-debug-sections=zlib -fstack-protector-strong -pie I, [2024-05-15T00:10:25.323402 #171953] INFO -- : SOLIBS = -lz -lrt -lrt -ldl -lcrypt -lm -lpthread I, [2024-05-15T00:10:25.323411 #171953] INFO -- : LANG = en_US.UTF-8 I, [2024-05-15T00:10:25.323419 #171953] INFO -- : LC_ALL = I, [2024-05-15T00:10:25.323428 #171953] INFO -- : LC_CTYPE = I, [2024-05-15T00:10:25.323436 #171953] INFO -- : MFLAGS = I, [2024-05-15T00:10:25.323444 #171953] INFO -- : RUSTC = rustc I, [2024-05-15T00:10:25.323453 #171953] INFO -- : YJIT_RUSTC_ARGS = --crate-name=yjit --crate-type=staticlib --edition=2021 -g -C lto=thin -C opt-level=3 -C overflow-checks=on '--out-dir=/home/opc/ruby/build/master/yjit/target/release/' /home/opc/ruby/src/master/yjit/src/lib.rs I, [2024-05-15T00:10:25.324148 #171953] INFO -- : gcc (GCC) 8.5.0 20210514 (Red Hat 8.5.0-10.1.0.1) I, [2024-05-15T00:10:25.324164 #171953] INFO -- : Copyright (C) 2018 Free Software Foundation, Inc. I, [2024-05-15T00:10:25.324173 #171953] INFO -- : This is free software; see the source for copying conditions. There is NO I, [2024-05-15T00:10:25.324182 #171953] INFO -- : warranty; not even for MERCHANTABILITY or FITNESS FOR A PARTICULAR PURPOSE. I, [2024-05-15T00:10:25.324191 #171953] INFO -- : I, [2024-05-15T00:10:25.326453 #171953] INFO -- : generating enc.mk I, [2024-05-15T00:10:25.564964 #171953] INFO -- : generating encdb.h I, [2024-05-15T00:10:25.601411 #171953] INFO -- : encdb.h unchanged I, [2024-05-15T00:10:25.602651 #171953] INFO -- : making enc I, [2024-05-15T00:10:25.629722 #171953] INFO -- : make[1]: Entering directory '/home/opc/ruby/build/master' I, [2024-05-15T00:10:25.629769 #171953] INFO -- : make[1]: Nothing to be done for 'enc'. I, [2024-05-15T00:10:25.629781 #171953] INFO -- : make[1]: Leaving directory '/home/opc/ruby/build/master' I, [2024-05-15T00:10:25.630469 #171953] INFO -- : making srcs under enc I, [2024-05-15T00:10:25.672230 #171953] INFO -- : make[1]: Entering directory '/home/opc/ruby/build/master' I, [2024-05-15T00:10:25.672280 #171953] INFO -- : make[1]: Nothing to be done for 'srcs'. I, [2024-05-15T00:10:25.672505 #171953] INFO -- : make[1]: Leaving directory '/home/opc/ruby/build/master' I, [2024-05-15T00:10:25.673537 #171953] INFO -- : generating transdb.h I, [2024-05-15T00:10:25.817326 #171953] INFO -- : transdb.h unchanged I, [2024-05-15T00:10:25.818699 #171953] INFO -- : making trans I, [2024-05-15T00:10:25.866878 #171953] INFO -- : make[1]: Entering directory '/home/opc/ruby/build/master' I, [2024-05-15T00:10:25.866921 #171953] INFO -- : make[1]: Nothing to be done for 'trans'. I, [2024-05-15T00:10:25.866935 #171953] INFO -- : make[1]: Leaving directory '/home/opc/ruby/build/master' I, [2024-05-15T00:10:25.867744 #171953] INFO -- : making encs I, [2024-05-15T00:10:25.920104 #171953] INFO -- : make[1]: Entering directory '/home/opc/ruby/build/master' I, [2024-05-15T00:10:25.920187 #171953] INFO -- : make[1]: Nothing to be done for 'encs'. I, [2024-05-15T00:10:25.920208 #171953] INFO -- : make[1]: Leaving directory '/home/opc/ruby/build/master' I, [2024-05-15T00:10:25.922207 #171953] INFO -- : generating makefiles ext/configure-ext.mk I, [2024-05-15T00:10:25.962252 #171953] INFO -- : ext/configure-ext.mk updated I, [2024-05-15T00:10:25.965788 #171953] INFO -- : make[1]: Entering directory '/home/opc/ruby/build/master' I, [2024-05-15T00:10:28.023532 #171953] INFO -- : make[1]: Leaving directory '/home/opc/ruby/build/master' I, [2024-05-15T00:10:28.024249 #171953] INFO -- : generating makefile exts.mk I, [2024-05-15T00:10:28.082842 #171953] INFO -- : exts.mk unchanged I, [2024-05-15T00:10:28.087695 #171953] INFO -- : make[1]: Entering directory '/home/opc/ruby/build/master' I, [2024-05-15T00:10:28.383063 #171953] INFO -- : make[2]: Entering directory '/home/opc/ruby/build/master/ext/coverage' I, [2024-05-15T00:10:28.387617 #171953] INFO -- : make[2]: Leaving directory '/home/opc/ruby/build/master/ext/coverage' I, [2024-05-15T00:10:28.393170 #171953] INFO -- : make[2]: Entering directory '/home/opc/ruby/build/master/ext/date' I, [2024-05-15T00:10:28.398583 #171953] INFO -- : make[2]: Leaving directory '/home/opc/ruby/build/master/ext/date' I, [2024-05-15T00:10:28.401914 #171953] INFO -- : make[2]: Entering directory '/home/opc/ruby/build/master/ext/digest' I, [2024-05-15T00:10:28.410577 #171953] INFO -- : make[2]: Leaving directory '/home/opc/ruby/build/master/ext/digest' I, [2024-05-15T00:10:28.432925 #171953] INFO -- : make[2]: Entering directory '/home/opc/ruby/build/master/ext/digest/sha2' I, [2024-05-15T00:10:28.437858 #171953] INFO -- : make[2]: Leaving directory '/home/opc/ruby/build/master/ext/digest/sha2' I, [2024-05-15T00:10:28.455756 #171953] INFO -- : make[2]: Entering directory '/home/opc/ruby/build/master/ext/fiddle' I, [2024-05-15T00:10:28.465885 #171953] INFO -- : make[2]: Leaving directory '/home/opc/ruby/build/master/ext/fiddle' I, [2024-05-15T00:10:28.470101 #171953] INFO -- : make[2]: Entering directory '/home/opc/ruby/build/master/ext/io/console' I, [2024-05-15T00:10:28.474596 #171953] INFO -- : make[2]: Leaving directory '/home/opc/ruby/build/master/ext/io/console' I, [2024-05-15T00:10:28.485106 #171953] INFO -- : make[2]: Entering directory '/home/opc/ruby/build/master/ext/json' I, [2024-05-15T00:10:28.494472 #171953] INFO -- : make[2]: Leaving directory '/home/opc/ruby/build/master/ext/json' I, [2024-05-15T00:10:28.507372 #171953] INFO -- : make[2]: Entering directory '/home/opc/ruby/build/master/ext/monitor' I, [2024-05-15T00:10:28.511583 #171953] INFO -- : make[2]: Leaving directory '/home/opc/ruby/build/master/ext/monitor' I, [2024-05-15T00:10:28.517499 #171953] INFO -- : make[2]: Entering directory '/home/opc/ruby/build/master/ext/objspace' I, [2024-05-15T00:10:28.523384 #171953] INFO -- : make[2]: Leaving directory '/home/opc/ruby/build/master/ext/objspace' I, [2024-05-15T00:10:28.542137 #171953] INFO -- : make[2]: Entering directory '/home/opc/ruby/build/master/ext/openssl' I, [2024-05-15T00:10:28.563762 #171953] INFO -- : make[2]: Leaving directory '/home/opc/ruby/build/master/ext/openssl' I, [2024-05-15T00:10:28.567937 #171953] INFO -- : make[2]: Entering directory '/home/opc/ruby/build/master/ext/pathname' I, [2024-05-15T00:10:28.572175 #171953] INFO -- : make[2]: Leaving directory '/home/opc/ruby/build/master/ext/pathname' I, [2024-05-15T00:10:28.578463 #171953] INFO -- : make[2]: Entering directory '/home/opc/ruby/build/master/ext/psych' I, [2024-05-15T00:10:28.599619 #171953] INFO -- : make[2]: Leaving directory '/home/opc/ruby/build/master/ext/psych' I, [2024-05-15T00:10:28.604016 #171953] INFO -- : make[2]: Entering directory '/home/opc/ruby/build/master/ext/pty' I, [2024-05-15T00:10:28.608304 #171953] INFO -- : make[2]: Leaving directory '/home/opc/ruby/build/master/ext/pty' I, [2024-05-15T00:10:28.621492 #171953] INFO -- : make[2]: Entering directory '/home/opc/ruby/build/master/ext/ripper' I, [2024-05-15T00:10:28.629328 #171953] INFO -- : make[2]: Leaving directory '/home/opc/ruby/build/master/ext/ripper' I, [2024-05-15T00:10:28.631196 #171953] INFO -- : make[2]: Entering directory '/home/opc/ruby/build/master/ext/rubyvm' I, [2024-05-15T00:10:28.634598 #171953] INFO -- : make[2]: Leaving directory '/home/opc/ruby/build/master/ext/rubyvm' I, [2024-05-15T00:10:28.646498 #171953] INFO -- : make[2]: Entering directory '/home/opc/ruby/build/master/ext/socket' I, [2024-05-15T00:10:28.657013 #171953] INFO -- : make[2]: Leaving directory '/home/opc/ruby/build/master/ext/socket' I, [2024-05-15T00:10:28.672174 #171953] INFO -- : make[2]: Entering directory '/home/opc/ruby/build/master/.bundle/gems/bigdecimal-3.1.7/ext/bigdecimal' I, [2024-05-15T00:10:28.702516 #171953] INFO -- : make[2]: Leaving directory '/home/opc/ruby/build/master/.bundle/gems/bigdecimal-3.1.7/ext/bigdecimal' I, [2024-05-15T00:10:28.705180 #171953] INFO -- : make[2]: Entering directory '/home/opc/ruby/build/master/.bundle/gems/bigdecimal-3.1.8/ext/bigdecimal' I, [2024-05-15T00:10:28.734818 #171953] INFO -- : make[2]: Leaving directory '/home/opc/ruby/build/master/.bundle/gems/bigdecimal-3.1.8/ext/bigdecimal' I, [2024-05-15T00:10:28.737339 #171953] INFO -- : make[2]: Entering directory '/home/opc/ruby/build/master/.bundle/gems/debug-1.9.2/ext/debug' I, [2024-05-15T00:10:28.767279 #171953] INFO -- : make[2]: Leaving directory '/home/opc/ruby/build/master/.bundle/gems/debug-1.9.2/ext/debug' I, [2024-05-15T00:10:28.769752 #171953] INFO -- : make[2]: Entering directory '/home/opc/ruby/build/master/.bundle/gems/nkf-0.2.0/ext/nkf' I, [2024-05-15T00:10:28.799793 #171953] INFO -- : make[2]: Leaving directory '/home/opc/ruby/build/master/.bundle/gems/nkf-0.2.0/ext/nkf' I, [2024-05-15T00:10:28.802299 #171953] INFO -- : make[2]: Entering directory '/home/opc/ruby/build/master/.bundle/gems/racc-1.7.3/ext/racc/cparse' I, [2024-05-15T00:10:28.832436 #171953] INFO -- : make[2]: Leaving directory '/home/opc/ruby/build/master/.bundle/gems/racc-1.7.3/ext/racc/cparse' I, [2024-05-15T00:10:28.835460 #171953] INFO -- : make[2]: Entering directory '/home/opc/ruby/build/master/.bundle/gems/rbs-3.4.4/ext/rbs_extension' I, [2024-05-15T00:10:28.866967 #171953] INFO -- : make[2]: Leaving directory '/home/opc/ruby/build/master/.bundle/gems/rbs-3.4.4/ext/rbs_extension' I, [2024-05-15T00:10:28.869533 #171953] INFO -- : make[2]: Entering directory '/home/opc/ruby/build/master/.bundle/gems/syslog-0.1.2/ext/syslog' I, [2024-05-15T00:10:28.899847 #171953] INFO -- : make[2]: Leaving directory '/home/opc/ruby/build/master/.bundle/gems/syslog-0.1.2/ext/syslog' I, [2024-05-15T00:10:28.937857 #171953] INFO -- : make[2]: Entering directory '/home/opc/ruby/build/master' I, [2024-05-15T00:10:29.020846 #171953] INFO -- : make[2]: 'ruby' is up to date. I, [2024-05-15T00:10:29.020921 #171953] INFO -- : make[2]: Leaving directory '/home/opc/ruby/build/master' I, [2024-05-15T00:10:29.021042 #171953] INFO -- : make[1]: Leaving directory '/home/opc/ruby/build/master' I, [2024-05-15T00:10:29.025467 #171953] INFO -- : make[1]: Entering directory '/home/opc/ruby/build/master' I, [2024-05-15T00:10:29.025505 #171953] INFO -- : make[1]: Nothing to be done for 'note'. I, [2024-05-15T00:10:29.025515 #171953] INFO -- : make[1]: Leaving directory '/home/opc/ruby/build/master' E, [2024-05-15T00:10:29.099954 #171953] ERROR -- : $ /home/opc/ruby/build/master/miniruby -I/home/opc/ruby/src/master/lib /home/opc/ruby/src/master/tool/runruby.rb --archdir=/home/opc/ruby/build/master --extout=.ext -- /home/opc/ruby/src/master/spec/mspec/bin/mspec-run -B /home/opc/ruby/src/master/spec/default.mspec --error-output stderr --debug -fy -o /tmp/rubytest.12ql7k/1-mspec-multi-0 E, [2024-05-15T00:10:29.100303 #171953] ERROR -- : $ /home/opc/ruby/build/master/miniruby -I/home/opc/ruby/src/master/lib /home/opc/ruby/src/master/tool/runruby.rb --archdir=/home/opc/ruby/build/master --extout=.ext -- /home/opc/ruby/src/master/spec/mspec/bin/mspec-run -B /home/opc/ruby/src/master/spec/default.mspec --error-output stderr --debug -fy -o /tmp/rubytest.12ql7k/2-mspec-multi-1 E, [2024-05-15T00:10:29.100572 #171953] ERROR -- : $ /home/opc/ruby/build/master/miniruby -I/home/opc/ruby/src/master/lib /home/opc/ruby/src/master/tool/runruby.rb --archdir=/home/opc/ruby/build/master --extout=.ext -- /home/opc/ruby/src/master/spec/mspec/bin/mspec-run -B /home/opc/ruby/src/master/spec/default.mspec --error-output stderr --debug -fy -o /tmp/rubytest.12ql7k/3-mspec-multi-2 I, [2024-05-15T00:10:29.231732 #171953] INFO -- : ruby 3.4.0dev (2024-05-14T21:44:34Z master e3e1e53098) [aarch64-linux] I, [2024-05-15T00:10:34.551148 #171953] INFO -- : 0 ......................................................................... I, [2024-05-15T00:10:36.946309 #171953] INFO -- : 73 ......................................................................... I, [2024-05-15T00:10:37.114062 #171953] INFO -- : 146 ......................................................................... I, [2024-05-15T00:10:37.416702 #171953] INFO -- : 219 ......................................................................... I, [2024-05-15T00:10:37.573951 #171953] INFO -- : 292 ......................................................................... I, [2024-05-15T00:10:37.809698 #171953] INFO -- : 365 ......................................................................... I, [2024-05-15T00:10:37.937485 #171953] INFO -- : 438 ......................................................................... I, [2024-05-15T00:10:37.994588 #171953] INFO -- : 511 ......................................................................... I, [2024-05-15T00:10:38.053849 #171953] INFO -- : 584 ......................................................................... I, [2024-05-15T00:10:38.729067 #171953] INFO -- : 657 ......................................................................... I, [2024-05-15T00:10:38.828997 #171953] INFO -- : 730 ......................................................................... I, [2024-05-15T00:10:38.880971 #171953] INFO -- : 803 ......................................................................... I, [2024-05-15T00:10:39.097020 #171953] INFO -- : 876 ......................................................................... I, [2024-05-15T00:10:39.206220 #171953] INFO -- : 949 ......................................................................... I, [2024-05-15T00:10:39.811332 #171953] INFO -- : 1022 ......................................................................... I, [2024-05-15T00:10:42.125211 #171953] INFO -- : 1095 ......................................................................... I, [2024-05-15T00:10:42.935509 #171953] INFO -- : 1168 ......................................................................... I, [2024-05-15T00:10:43.114453 #171953] INFO -- : 1241 ......................................................................... I, [2024-05-15T00:10:43.303449 #171953] INFO -- : 1314 ......................................................................... I, [2024-05-15T00:10:43.401300 #171953] INFO -- : 1387 ......................................................................... I, [2024-05-15T00:10:45.440346 #171953] INFO -- : 1460 ......................................................................... I, [2024-05-15T00:10:48.831763 #171953] INFO -- : 1533 ......................................................................... I, [2024-05-15T00:10:48.993258 #171953] INFO -- : 1606 ......................................................................... I, [2024-05-15T00:10:49.800153 #171953] INFO -- : 1679 ......................................................................... I, [2024-05-15T00:10:50.097278 #171953] INFO -- : 1752 ......................................................................... I, [2024-05-15T00:10:50.343837 #171953] INFO -- : 1825 ......................................................................... I, [2024-05-15T00:10:50.661187 #171953] INFO -- : 1898 ......................................................................... I, [2024-05-15T00:10:51.069634 #171953] INFO -- : 1971 ......................................................................... I, [2024-05-15T00:10:51.584226 #171953] INFO -- : 2044 ......................................................................... I, [2024-05-15T00:10:51.668971 #171953] INFO -- : 2117 ......................................................................... I, [2024-05-15T00:10:51.727004 #171953] INFO -- : 2190 ......................................................................... I, [2024-05-15T00:10:51.779431 #171953] INFO -- : 2263 ......................................................................... I, [2024-05-15T00:10:51.825458 #171953] INFO -- : 2336 ......................................................................... I, [2024-05-15T00:10:51.914867 #171953] INFO -- : 2409 ......................................................................... I, [2024-05-15T00:10:52.190218 #171953] INFO -- : 2482 ......................................................................... I, [2024-05-15T00:10:52.332311 #171953] INFO -- : 2555 ......................................................................... I, [2024-05-15T00:10:53.624915 #171953] INFO -- : 2628 ......................................................................... I, [2024-05-15T00:10:53.796262 #171953] INFO -- : 2701 ......................................................................... I, [2024-05-15T00:10:53.938032 #171953] INFO -- : 2774 ......................................................................... I, [2024-05-15T00:10:54.227714 #171953] INFO -- : 2847 ......................................................................... I, [2024-05-15T00:10:54.500855 #171953] INFO -- : 2920 ......................................................................... I, [2024-05-15T00:10:54.607204 #171953] INFO -- : 2993 ......................................................................... I, [2024-05-15T00:10:54.681885 #171953] INFO -- : 3066 ......................................................................... I, [2024-05-15T00:10:54.725986 #171953] INFO -- : 3139 ......................................................................... I, [2024-05-15T00:10:54.796659 #171953] INFO -- : 3212 ......................................................................... I, [2024-05-15T00:10:54.871773 #171953] INFO -- : 3285 ......................................................................... I, [2024-05-15T00:10:58.706647 #171953] INFO -- : 3358 ........................................................................ I, [2024-05-15T00:10:58.706721 #171953] INFO -- : I, [2024-05-15T00:10:58.706733 #171953] INFO -- : Finished in 29.606632 seconds I, [2024-05-15T00:10:58.706741 #171953] INFO -- : I, [2024-05-15T00:10:58.706750 #171953] INFO -- : 3429 files, 32607 examples, 191573 expectations, 0 failures, 0 errors, 0 tagged I, [2024-05-15T00:10:58.708198 #171953] INFO -- : $$$[end] "make yes-test-rubyspec MSPECOPT='--error-output stderr --debug -j' TESTS='-j3'" exit with 0.