# Logfile created on 2024-05-14 21:48:14 +0000 by logger.rb/v1.5.3 I, [2024-05-14T21:48:14.998531 #2511758] INFO -- : #, @formatter=nil, @logdev=#, @binmode=false, @mon_data=#, @mon_data_owner_object_id=860>>> I, [2024-05-14T21:48:14.998837 #2511758] INFO -- : $$$[beg] make update-unicode -j3 I, [2024-05-14T21:48:15.090994 #2511758] INFO -- : Downloading Unicode emoji 15.0 files... I, [2024-05-14T21:48:15.091178 #2511758] INFO -- : Downloading Unicode emoji 15.0 files... I, [2024-05-14T21:48:15.091433 #2511758] INFO -- : Downloading Unicode emoji 15.0 files... I, [2024-05-14T21:48:15.173236 #2511758] INFO -- : made symlink emoji/15.0/emoji-sequences.txt to /home/opc/ruby/src/master/.downloaded-cache/emoji/15.0/emoji-sequences.txt I, [2024-05-14T21:48:15.174665 #2511758] INFO -- : downloading emoji/15.0/emoji-test.txt ... /home/opc/ruby/src/master/enc/unicode/data/emoji/15.0/emoji-sequences.txt already exists I, [2024-05-14T21:48:15.178840 #2511758] INFO -- : downloading emoji/15.0/emoji-test.txt ... /home/opc/ruby/src/master/enc/unicode/data/emoji/15.0/emoji-sequences.txt already exists E, [2024-05-14T21:48:15.681213 #2511758] ERROR -- : /home/opc/ruby/src/master/tool/downloader.rb:302:in `rescue in download': failed to download emoji/15.0/emoji-test.txt (RuntimeError) E, [2024-05-14T21:48:15.681279 #2511758] ERROR -- : OpenURI::HTTPError: 403 Forbidden: https://www.unicode.org/Public/emoji/15.0/emoji-test.txt E, [2024-05-14T21:48:15.681291 #2511758] ERROR -- : from /home/opc/ruby/src/master/tool/downloader.rb:201:in `download' E, [2024-05-14T21:48:15.681300 #2511758] ERROR -- : from /home/opc/ruby/src/master/tool/downloader.rb:136:in `download' E, [2024-05-14T21:48:15.681308 #2511758] ERROR -- : from /home/opc/ruby/src/master/tool/downloader.rb:482:in `block in
' E, [2024-05-14T21:48:15.681317 #2511758] ERROR -- : from /home/opc/ruby/src/master/tool/downloader.rb:465:in `each' E, [2024-05-14T21:48:15.681325 #2511758] ERROR -- : from /home/opc/ruby/src/master/tool/downloader.rb:465:in `
' E, [2024-05-14T21:48:15.681333 #2511758] ERROR -- : /usr/local/lib/ruby/3.2.0/open-uri.rb:369:in `open_http': 403 Forbidden (OpenURI::HTTPError) E, [2024-05-14T21:48:15.681341 #2511758] ERROR -- : from /usr/local/lib/ruby/3.2.0/open-uri.rb:760:in `buffer_open' E, [2024-05-14T21:48:15.681349 #2511758] ERROR -- : from /usr/local/lib/ruby/3.2.0/open-uri.rb:214:in `block in open_loop' E, [2024-05-14T21:48:15.681358 #2511758] ERROR -- : from /usr/local/lib/ruby/3.2.0/open-uri.rb:212:in `catch' E, [2024-05-14T21:48:15.681366 #2511758] ERROR -- : from /usr/local/lib/ruby/3.2.0/open-uri.rb:212:in `open_loop' E, [2024-05-14T21:48:15.681374 #2511758] ERROR -- : from /usr/local/lib/ruby/3.2.0/open-uri.rb:153:in `open_uri' E, [2024-05-14T21:48:15.681382 #2511758] ERROR -- : from /usr/local/lib/ruby/3.2.0/open-uri.rb:740:in `open' E, [2024-05-14T21:48:15.681393 #2511758] ERROR -- : from /usr/local/lib/ruby/3.2.0/open-uri.rb:748:in `read' E, [2024-05-14T21:48:15.681401 #2511758] ERROR -- : from /home/opc/ruby/src/master/tool/downloader.rb:247:in `block in download' E, [2024-05-14T21:48:15.681409 #2511758] ERROR -- : from /home/opc/ruby/src/master/tool/downloader.rb:378:in `with_retry' E, [2024-05-14T21:48:15.681417 #2511758] ERROR -- : from /home/opc/ruby/src/master/tool/downloader.rb:246:in `download' E, [2024-05-14T21:48:15.681426 #2511758] ERROR -- : from /home/opc/ruby/src/master/tool/downloader.rb:136:in `download' E, [2024-05-14T21:48:15.681434 #2511758] ERROR -- : from /home/opc/ruby/src/master/tool/downloader.rb:482:in `block in
' E, [2024-05-14T21:48:15.681442 #2511758] ERROR -- : from /home/opc/ruby/src/master/tool/downloader.rb:465:in `each' E, [2024-05-14T21:48:15.681449 #2511758] ERROR -- : from /home/opc/ruby/src/master/tool/downloader.rb:465:in `
' E, [2024-05-14T21:48:15.684274 #2511758] ERROR -- : make: *** [uncommon.mk:1765: /home/opc/ruby/src/master/enc/unicode/data/emoji/15.0/emoji-sequences.txt] Error 1 E, [2024-05-14T21:48:15.684296 #2511758] ERROR -- : make: *** Deleting file '/home/opc/ruby/src/master/enc/unicode/data/emoji/15.0/emoji-sequences.txt' E, [2024-05-14T21:48:15.684433 #2511758] ERROR -- : make: *** Waiting for unfinished jobs.... E, [2024-05-14T21:48:15.692538 #2511758] ERROR -- : /home/opc/ruby/src/master/tool/downloader.rb:302:in `rescue in download': failed to download emoji/15.0/emoji-test.txt (RuntimeError) E, [2024-05-14T21:48:15.692589 #2511758] ERROR -- : OpenURI::HTTPError: 403 Forbidden: https://www.unicode.org/Public/emoji/15.0/emoji-test.txt E, [2024-05-14T21:48:15.692600 #2511758] ERROR -- : from /home/opc/ruby/src/master/tool/downloader.rb:201:in `download' E, [2024-05-14T21:48:15.692609 #2511758] ERROR -- : from /home/opc/ruby/src/master/tool/downloader.rb:136:in `download' E, [2024-05-14T21:48:15.692618 #2511758] ERROR -- : from /home/opc/ruby/src/master/tool/downloader.rb:482:in `block in
' E, [2024-05-14T21:48:15.692626 #2511758] ERROR -- : from /home/opc/ruby/src/master/tool/downloader.rb:465:in `each' E, [2024-05-14T21:48:15.692634 #2511758] ERROR -- : from /home/opc/ruby/src/master/tool/downloader.rb:465:in `
' E, [2024-05-14T21:48:15.692642 #2511758] ERROR -- : /usr/local/lib/ruby/3.2.0/open-uri.rb:369:in `open_http': 403 Forbidden (OpenURI::HTTPError) E, [2024-05-14T21:48:15.692650 #2511758] ERROR -- : from /usr/local/lib/ruby/3.2.0/open-uri.rb:760:in `buffer_open' E, [2024-05-14T21:48:15.692658 #2511758] ERROR -- : from /usr/local/lib/ruby/3.2.0/open-uri.rb:214:in `block in open_loop' E, [2024-05-14T21:48:15.692667 #2511758] ERROR -- : from /usr/local/lib/ruby/3.2.0/open-uri.rb:212:in `catch' E, [2024-05-14T21:48:15.692675 #2511758] ERROR -- : from /usr/local/lib/ruby/3.2.0/open-uri.rb:212:in `open_loop' E, [2024-05-14T21:48:15.692683 #2511758] ERROR -- : from /usr/local/lib/ruby/3.2.0/open-uri.rb:153:in `open_uri' E, [2024-05-14T21:48:15.692691 #2511758] ERROR -- : from /usr/local/lib/ruby/3.2.0/open-uri.rb:740:in `open' E, [2024-05-14T21:48:15.692699 #2511758] ERROR -- : from /usr/local/lib/ruby/3.2.0/open-uri.rb:748:in `read' E, [2024-05-14T21:48:15.692707 #2511758] ERROR -- : from /home/opc/ruby/src/master/tool/downloader.rb:247:in `block in download' E, [2024-05-14T21:48:15.692715 #2511758] ERROR -- : from /home/opc/ruby/src/master/tool/downloader.rb:378:in `with_retry' E, [2024-05-14T21:48:15.692723 #2511758] ERROR -- : from /home/opc/ruby/src/master/tool/downloader.rb:246:in `download' E, [2024-05-14T21:48:15.692731 #2511758] ERROR -- : from /home/opc/ruby/src/master/tool/downloader.rb:136:in `download' E, [2024-05-14T21:48:15.692739 #2511758] ERROR -- : from /home/opc/ruby/src/master/tool/downloader.rb:482:in `block in
' E, [2024-05-14T21:48:15.692747 #2511758] ERROR -- : from /home/opc/ruby/src/master/tool/downloader.rb:465:in `each' E, [2024-05-14T21:48:15.692759 #2511758] ERROR -- : from /home/opc/ruby/src/master/tool/downloader.rb:465:in `
' E, [2024-05-14T21:48:15.695592 #2511758] ERROR -- : make: *** [uncommon.mk:1765: /home/opc/ruby/src/master/enc/unicode/data/emoji/15.0/emoji-test.txt] Error 1 E, [2024-05-14T21:48:15.729444 #2511758] ERROR -- : /home/opc/ruby/src/master/tool/downloader.rb:302:in `rescue in download': failed to download emoji/15.0/emoji-test.txt (RuntimeError) E, [2024-05-14T21:48:15.729502 #2511758] ERROR -- : OpenURI::HTTPError: 403 Forbidden: https://www.unicode.org/Public/emoji/15.0/emoji-test.txt E, [2024-05-14T21:48:15.729512 #2511758] ERROR -- : from /home/opc/ruby/src/master/tool/downloader.rb:201:in `download' E, [2024-05-14T21:48:15.729521 #2511758] ERROR -- : from /home/opc/ruby/src/master/tool/downloader.rb:136:in `download' E, [2024-05-14T21:48:15.729530 #2511758] ERROR -- : from /home/opc/ruby/src/master/tool/downloader.rb:482:in `block in
' E, [2024-05-14T21:48:15.729538 #2511758] ERROR -- : from /home/opc/ruby/src/master/tool/downloader.rb:465:in `each' E, [2024-05-14T21:48:15.729546 #2511758] ERROR -- : from /home/opc/ruby/src/master/tool/downloader.rb:465:in `
' E, [2024-05-14T21:48:15.729554 #2511758] ERROR -- : /usr/local/lib/ruby/3.2.0/open-uri.rb:369:in `open_http': 403 Forbidden (OpenURI::HTTPError) E, [2024-05-14T21:48:15.729562 #2511758] ERROR -- : from /usr/local/lib/ruby/3.2.0/open-uri.rb:760:in `buffer_open' E, [2024-05-14T21:48:15.729569 #2511758] ERROR -- : from /usr/local/lib/ruby/3.2.0/open-uri.rb:214:in `block in open_loop' E, [2024-05-14T21:48:15.729578 #2511758] ERROR -- : from /usr/local/lib/ruby/3.2.0/open-uri.rb:212:in `catch' E, [2024-05-14T21:48:15.729586 #2511758] ERROR -- : from /usr/local/lib/ruby/3.2.0/open-uri.rb:212:in `open_loop' E, [2024-05-14T21:48:15.729594 #2511758] ERROR -- : from /usr/local/lib/ruby/3.2.0/open-uri.rb:153:in `open_uri' E, [2024-05-14T21:48:15.729602 #2511758] ERROR -- : from /usr/local/lib/ruby/3.2.0/open-uri.rb:740:in `open' E, [2024-05-14T21:48:15.729610 #2511758] ERROR -- : from /usr/local/lib/ruby/3.2.0/open-uri.rb:748:in `read' E, [2024-05-14T21:48:15.729618 #2511758] ERROR -- : from /home/opc/ruby/src/master/tool/downloader.rb:247:in `block in download' E, [2024-05-14T21:48:15.729626 #2511758] ERROR -- : from /home/opc/ruby/src/master/tool/downloader.rb:378:in `with_retry' E, [2024-05-14T21:48:15.729635 #2511758] ERROR -- : from /home/opc/ruby/src/master/tool/downloader.rb:246:in `download' E, [2024-05-14T21:48:15.729666 #2511758] ERROR -- : from /home/opc/ruby/src/master/tool/downloader.rb:136:in `download' E, [2024-05-14T21:48:15.729675 #2511758] ERROR -- : from /home/opc/ruby/src/master/tool/downloader.rb:482:in `block in
' E, [2024-05-14T21:48:15.729684 #2511758] ERROR -- : from /home/opc/ruby/src/master/tool/downloader.rb:465:in `each' E, [2024-05-14T21:48:15.729692 #2511758] ERROR -- : from /home/opc/ruby/src/master/tool/downloader.rb:465:in `
' E, [2024-05-14T21:48:15.732367 #2511758] ERROR -- : make: *** [uncommon.mk:1765: /home/opc/ruby/src/master/enc/unicode/data/emoji/15.0/emoji-zwj-sequences.txt] Error 1 I, [2024-05-14T21:48:15.732446 #2511758] INFO -- : downloading emoji/15.0/emoji-test.txt ... I, [2024-05-14T21:48:15.732695 #2511758] INFO -- : $$$[end] "make update-unicode -j3" exit with 512. I, [2024-05-14T21:48:15.732735 #2511758] INFO -- : $$$[beg] make update-download -j3 I, [2024-05-14T21:48:15.896545 #2511758] INFO -- : tool/config.guess already exists I, [2024-05-14T21:48:15.896614 #2511758] INFO -- : tool/config.sub already exists I, [2024-05-14T21:48:15.899381 #2511758] INFO -- : Update minitest to ea9caafc0754b1d6236a490d59e624b53209734a I, [2024-05-14T21:48:15.899580 #2511758] INFO -- : Update power_assert to 84e85124c5014a139af39161d484156cfe87a9ed I, [2024-05-14T21:48:15.899711 #2511758] INFO -- : Update rbs to ba7872795d5de04adb8ff500c0e6afdc81a041dd I, [2024-05-14T21:48:15.903000 #2511758] INFO -- : echo ea9caafc0754b1d6236a490d59e624b53209734a | /bin/sh /home/opc/ruby/src/master/tool/ifchange /home/opc/ruby/src/master/.bundle/.timestamp/minitest.revision - I, [2024-05-14T21:48:15.903200 #2511758] INFO -- : echo 84e85124c5014a139af39161d484156cfe87a9ed | /bin/sh /home/opc/ruby/src/master/tool/ifchange /home/opc/ruby/src/master/.bundle/.timestamp/power_assert.revision - I, [2024-05-14T21:48:15.903345 #2511758] INFO -- : echo ba7872795d5de04adb8ff500c0e6afdc81a041dd | /bin/sh /home/opc/ruby/src/master/tool/ifchange /home/opc/ruby/src/master/.bundle/.timestamp/rbs.revision - I, [2024-05-14T21:48:15.910650 #2511758] INFO -- : /home/opc/ruby/src/master/.bundle/.timestamp/rbs.revision unchanged I, [2024-05-14T21:48:15.910707 #2511758] INFO -- : /home/opc/ruby/src/master/.bundle/.timestamp/minitest.revision unchanged I, [2024-05-14T21:48:15.913315 #2511758] INFO -- : Update typeprof to b19a6416da3a05d57fadd6ffdadb382b6d236ca5 I, [2024-05-14T21:48:15.913854 #2511758] INFO -- : /home/opc/ruby/src/master/.bundle/.timestamp/power_assert.revision unchanged I, [2024-05-14T21:48:15.923167 #2511758] INFO -- : echo b19a6416da3a05d57fadd6ffdadb382b6d236ca5 | /bin/sh /home/opc/ruby/src/master/tool/ifchange /home/opc/ruby/src/master/.bundle/.timestamp/typeprof.revision - I, [2024-05-14T21:48:15.931143 #2511758] INFO -- : /home/opc/ruby/src/master/.bundle/.timestamp/typeprof.revision unchanged I, [2024-05-14T21:48:16.012436 #2511758] INFO -- : Building power_assert@84e85124c5014a139af39161d484156cfe87a9ed to /home/opc/ruby/src/master/gems/power_assert-2.0.3.gem I, [2024-05-14T21:48:16.123323 #2511758] INFO -- : Successfully built RubyGem I, [2024-05-14T21:48:16.123398 #2511758] INFO -- : Name: power_assert I, [2024-05-14T21:48:16.123419 #2511758] INFO -- : Version: 2.0.4dev I, [2024-05-14T21:48:16.123436 #2511758] INFO -- : File: power_assert-2.0.4dev.gem I, [2024-05-14T21:48:16.202975 #2511758] INFO -- : $$$[end] "make update-download -j3" exit with 0. I, [2024-05-14T21:48:16.203044 #2511758] INFO -- : $$$[beg] make update-rubyspec -j3 I, [2024-05-14T21:48:16.292222 #2511758] INFO -- : make: Nothing to be done for 'update-rubyspec'. I, [2024-05-14T21:48:16.292361 #2511758] INFO -- : $$$[end] "make update-rubyspec -j3" exit with 0. I, [2024-05-14T21:48:16.292385 #2511758] INFO -- : $$$[beg] make update-src -j3 E, [2024-05-14T21:48:17.425963 #2511758] ERROR -- : From https://github.com/ruby/ruby E, [2024-05-14T21:48:17.426026 #2511758] ERROR -- : cb1a574..e3e1e53 master -> origin/master I, [2024-05-14T21:48:17.455911 #2511758] INFO -- : Updating cb1a574..e3e1e53 I, [2024-05-14T21:48:17.455976 #2511758] INFO -- : Fast-forward I, [2024-05-14T21:48:17.459596 #2511758] INFO -- : ext/zlib/zlib.c | 110 +++++++++++++++++++++++++++++-------------------- I, [2024-05-14T21:48:17.459625 #2511758] INFO -- : test/zlib/test_zlib.rb | 25 ++++++++++- I, [2024-05-14T21:48:17.459635 #2511758] INFO -- : 2 files changed, 90 insertions(+), 45 deletions(-) I, [2024-05-14T21:48:17.474621 #2511758] INFO -- : Latest commit hash = e3e1e53098 I, [2024-05-14T21:48:17.475233 #2511758] INFO -- : $$$[end] "make update-src -j3" exit with 0. I, [2024-05-14T21:48:17.475278 #2511758] INFO -- : $$$[beg] make after-update -j3 I, [2024-05-14T21:48:17.578904 #2511758] INFO -- : generating /home/opc/ruby/src/master/ext/ripper/eventids2table.c I, [2024-05-14T21:48:17.585474 #2511758] INFO -- : make[1]: Entering directory '/home/opc/ruby/src/master/ext/ripper' I, [2024-05-14T21:48:17.585530 #2511758] INFO -- : make[1]: Nothing to be done for 'src'. I, [2024-05-14T21:48:17.585541 #2511758] INFO -- : make[1]: Leaving directory '/home/opc/ruby/src/master/ext/ripper' I, [2024-05-14T21:48:17.613610 #2511758] INFO -- : /home/opc/ruby/src/master/revision.h updated I, [2024-05-14T21:48:17.614913 #2511758] INFO -- : generating aarch64-linux-fake.rb I, [2024-05-14T21:48:17.671996 #2511758] INFO -- : aarch64-linux-fake.rb updated I, [2024-05-14T21:48:17.673696 #2511758] INFO -- : generating enc.mk I, [2024-05-14T21:48:17.904703 #2511758] INFO -- : making srcs under enc I, [2024-05-14T21:48:17.947075 #2511758] INFO -- : make[1]: Entering directory '/home/opc/ruby/build/master' I, [2024-05-14T21:48:17.947141 #2511758] INFO -- : make[1]: Nothing to be done for 'srcs'. I, [2024-05-14T21:48:17.947161 #2511758] INFO -- : make[1]: Leaving directory '/home/opc/ruby/build/master' I, [2024-05-14T21:48:18.027201 #2511758] INFO -- : Update minitest to ea9caafc0754b1d6236a490d59e624b53209734a I, [2024-05-14T21:48:18.027266 #2511758] INFO -- : Update power_assert to 84e85124c5014a139af39161d484156cfe87a9ed I, [2024-05-14T21:48:18.027641 #2511758] INFO -- : Update rbs to ba7872795d5de04adb8ff500c0e6afdc81a041dd I, [2024-05-14T21:48:18.030752 #2511758] INFO -- : echo ba7872795d5de04adb8ff500c0e6afdc81a041dd | /bin/sh /home/opc/ruby/src/master/tool/ifchange /home/opc/ruby/src/master/.bundle/.timestamp/rbs.revision - I, [2024-05-14T21:48:18.031328 #2511758] INFO -- : echo ea9caafc0754b1d6236a490d59e624b53209734a | /bin/sh /home/opc/ruby/src/master/tool/ifchange /home/opc/ruby/src/master/.bundle/.timestamp/minitest.revision - I, [2024-05-14T21:48:18.031461 #2511758] INFO -- : echo 84e85124c5014a139af39161d484156cfe87a9ed | /bin/sh /home/opc/ruby/src/master/tool/ifchange /home/opc/ruby/src/master/.bundle/.timestamp/power_assert.revision - I, [2024-05-14T21:48:18.036641 #2511758] INFO -- : /home/opc/ruby/src/master/.bundle/.timestamp/minitest.revision unchanged I, [2024-05-14T21:48:18.037079 #2511758] INFO -- : /home/opc/ruby/src/master/.bundle/.timestamp/power_assert.revision unchanged I, [2024-05-14T21:48:18.037888 #2511758] INFO -- : /home/opc/ruby/src/master/.bundle/.timestamp/rbs.revision unchanged I, [2024-05-14T21:48:18.040122 #2511758] INFO -- : Update typeprof to b19a6416da3a05d57fadd6ffdadb382b6d236ca5 I, [2024-05-14T21:48:18.043443 #2511758] INFO -- : echo b19a6416da3a05d57fadd6ffdadb382b6d236ca5 | /bin/sh /home/opc/ruby/src/master/tool/ifchange /home/opc/ruby/src/master/.bundle/.timestamp/typeprof.revision - I, [2024-05-14T21:48:18.049112 #2511758] INFO -- : /home/opc/ruby/src/master/.bundle/.timestamp/typeprof.revision unchanged I, [2024-05-14T21:48:18.131593 #2511758] INFO -- : Building power_assert@84e85124c5014a139af39161d484156cfe87a9ed to /home/opc/ruby/src/master/gems/power_assert-2.0.3.gem I, [2024-05-14T21:48:18.242093 #2511758] INFO -- : Successfully built RubyGem I, [2024-05-14T21:48:18.242160 #2511758] INFO -- : Name: power_assert I, [2024-05-14T21:48:18.242171 #2511758] INFO -- : Version: 2.0.4dev I, [2024-05-14T21:48:18.242179 #2511758] INFO -- : File: power_assert-2.0.4dev.gem I, [2024-05-14T21:48:18.244431 #2511758] INFO -- : Extracting bundle gem power_assert-2.0.3... I, [2024-05-14T21:48:18.343598 #2511758] INFO -- : Try with hash version of bundled gems instead of gems/power_assert-2.0.3.gem. We don't use this gem with release version of Ruby. I, [2024-05-14T21:48:18.356399 #2511758] INFO -- : Unpacked gems/power_assert-2.0.4dev.gem I, [2024-05-14T21:48:18.358301 #2511758] INFO -- : $$$[end] "make after-update -j3" exit with 0. I, [2024-05-14T21:48:18.358451 #2511758] INFO -- : $$$[beg] make miniruby -j3 I, [2024-05-14T21:48:18.447826 #2511758] INFO -- : BASERUBY = /usr/local/bin/ruby --disable=gems I, [2024-05-14T21:48:18.447895 #2511758] INFO -- : CC = gcc I, [2024-05-14T21:48:18.447906 #2511758] INFO -- : LD = ld I, [2024-05-14T21:48:18.447937 #2511758] INFO -- : LDSHARED = gcc -shared I, [2024-05-14T21:48:18.447949 #2511758] INFO -- : CFLAGS = -O3 -fno-fast-math -ggdb3 -Wall -Wextra -Wdeprecated-declarations -Wdiv-by-zero -Wduplicated-cond -Wimplicit-function-declaration -Wimplicit-int -Wpointer-arith -Wwrite-strings -Wold-style-definition -Wimplicit-fallthrough=0 -Wmissing-noreturn -Wno-cast-function-type -Wno-constant-logical-operand -Wno-long-long -Wno-missing-field-initializers -Wno-overlength-strings -Wno-packed-bitfield-compat -Wno-parentheses-equality -Wno-self-assign -Wno-tautological-compare -Wno-unused-parameter -Wno-unused-value -Wsuggest-attribute=format -Wsuggest-attribute=noreturn -Wunused-variable -Wmisleading-indentation -Wundef I, [2024-05-14T21:48:18.447962 #2511758] INFO -- : XCFLAGS = -U_FORTIFY_SOURCE -D_FORTIFY_SOURCE=2 -fstack-protector-strong -msign-return-address=all -fno-strict-overflow -fvisibility=hidden -fexcess-precision=standard -DRUBY_EXPORT -fPIE -I. -I.ext/include/aarch64-linux -I/home/opc/ruby/src/master/include -I/home/opc/ruby/src/master -I/home/opc/ruby/src/master/prism -I/home/opc/ruby/src/master/enc/unicode/15.0.0 I, [2024-05-14T21:48:18.447970 #2511758] INFO -- : CPPFLAGS = I, [2024-05-14T21:48:18.447978 #2511758] INFO -- : DLDFLAGS = -Wl,--compress-debug-sections=zlib -fstack-protector-strong -pie I, [2024-05-14T21:48:18.447987 #2511758] INFO -- : SOLIBS = -lz -lrt -lrt -ldl -lcrypt -lm -lpthread I, [2024-05-14T21:48:18.447995 #2511758] INFO -- : LANG = en_US.UTF-8 I, [2024-05-14T21:48:18.448003 #2511758] INFO -- : LC_ALL = I, [2024-05-14T21:48:18.448010 #2511758] INFO -- : LC_CTYPE = I, [2024-05-14T21:48:18.448018 #2511758] INFO -- : MFLAGS = -j3 --jobserver-auth=4,5 I, [2024-05-14T21:48:18.448025 #2511758] INFO -- : RUSTC = rustc I, [2024-05-14T21:48:18.448033 #2511758] INFO -- : YJIT_RUSTC_ARGS = --crate-name=yjit --crate-type=staticlib --edition=2021 -g -C lto=thin -C opt-level=3 -C overflow-checks=on '--out-dir=/home/opc/ruby/build/master/yjit/target/release/' /home/opc/ruby/src/master/yjit/src/lib.rs I, [2024-05-14T21:48:18.448776 #2511758] INFO -- : gcc (GCC) 8.5.0 20210514 (Red Hat 8.5.0-10.1.0.1) I, [2024-05-14T21:48:18.448822 #2511758] INFO -- : Copyright (C) 2018 Free Software Foundation, Inc. I, [2024-05-14T21:48:18.448832 #2511758] INFO -- : This is free software; see the source for copying conditions. There is NO I, [2024-05-14T21:48:18.448842 #2511758] INFO -- : warranty; not even for MERCHANTABILITY or FITNESS FOR A PARTICULAR PURPOSE. I, [2024-05-14T21:48:18.448850 #2511758] INFO -- : I, [2024-05-14T21:48:18.473957 #2511758] INFO -- : compiling /home/opc/ruby/src/master/version.c I, [2024-05-14T21:48:18.616716 #2511758] INFO -- : linking miniruby I, [2024-05-14T21:48:19.520660 #2511758] INFO -- : $$$[end] "make miniruby -j3" exit with 0. I, [2024-05-14T21:48:19.520825 #2511758] INFO -- : $$$[beg] make ruby -j3 I, [2024-05-14T21:48:19.610304 #2511758] INFO -- : BASERUBY = /usr/local/bin/ruby --disable=gems I, [2024-05-14T21:48:19.610373 #2511758] INFO -- : CC = gcc I, [2024-05-14T21:48:19.610384 #2511758] INFO -- : LD = ld I, [2024-05-14T21:48:19.610393 #2511758] INFO -- : LDSHARED = gcc -shared I, [2024-05-14T21:48:19.610404 #2511758] INFO -- : CFLAGS = -O3 -fno-fast-math -ggdb3 -Wall -Wextra -Wdeprecated-declarations -Wdiv-by-zero -Wduplicated-cond -Wimplicit-function-declaration -Wimplicit-int -Wpointer-arith -Wwrite-strings -Wold-style-definition -Wimplicit-fallthrough=0 -Wmissing-noreturn -Wno-cast-function-type -Wno-constant-logical-operand -Wno-long-long -Wno-missing-field-initializers -Wno-overlength-strings -Wno-packed-bitfield-compat -Wno-parentheses-equality -Wno-self-assign -Wno-tautological-compare -Wno-unused-parameter -Wno-unused-value -Wsuggest-attribute=format -Wsuggest-attribute=noreturn -Wunused-variable -Wmisleading-indentation -Wundef I, [2024-05-14T21:48:19.610413 #2511758] INFO -- : XCFLAGS = -U_FORTIFY_SOURCE -D_FORTIFY_SOURCE=2 -fstack-protector-strong -msign-return-address=all -fno-strict-overflow -fvisibility=hidden -fexcess-precision=standard -DRUBY_EXPORT -fPIE -I. -I.ext/include/aarch64-linux -I/home/opc/ruby/src/master/include -I/home/opc/ruby/src/master -I/home/opc/ruby/src/master/prism -I/home/opc/ruby/src/master/enc/unicode/15.0.0 I, [2024-05-14T21:48:19.610422 #2511758] INFO -- : CPPFLAGS = I, [2024-05-14T21:48:19.610430 #2511758] INFO -- : DLDFLAGS = -Wl,--compress-debug-sections=zlib -fstack-protector-strong -pie I, [2024-05-14T21:48:19.610439 #2511758] INFO -- : SOLIBS = -lz -lrt -lrt -ldl -lcrypt -lm -lpthread I, [2024-05-14T21:48:19.610447 #2511758] INFO -- : LANG = en_US.UTF-8 I, [2024-05-14T21:48:19.610482 #2511758] INFO -- : LC_ALL = I, [2024-05-14T21:48:19.610495 #2511758] INFO -- : LC_CTYPE = I, [2024-05-14T21:48:19.610507 #2511758] INFO -- : MFLAGS = -j3 --jobserver-auth=4,5 I, [2024-05-14T21:48:19.610515 #2511758] INFO -- : RUSTC = rustc I, [2024-05-14T21:48:19.610523 #2511758] INFO -- : YJIT_RUSTC_ARGS = --crate-name=yjit --crate-type=staticlib --edition=2021 -g -C lto=thin -C opt-level=3 -C overflow-checks=on '--out-dir=/home/opc/ruby/build/master/yjit/target/release/' /home/opc/ruby/src/master/yjit/src/lib.rs I, [2024-05-14T21:48:19.611138 #2511758] INFO -- : gcc (GCC) 8.5.0 20210514 (Red Hat 8.5.0-10.1.0.1) I, [2024-05-14T21:48:19.611156 #2511758] INFO -- : Copyright (C) 2018 Free Software Foundation, Inc. I, [2024-05-14T21:48:19.611165 #2511758] INFO -- : This is free software; see the source for copying conditions. There is NO I, [2024-05-14T21:48:19.611173 #2511758] INFO -- : warranty; not even for MERCHANTABILITY or FITNESS FOR A PARTICULAR PURPOSE. I, [2024-05-14T21:48:19.611181 #2511758] INFO -- : I, [2024-05-14T21:48:19.790869 #2511758] INFO -- : builtin_binary.inc updated I, [2024-05-14T21:48:19.795947 #2511758] INFO -- : c5234a9416e4f20f175185e840b25b0f08674d14078ed7083f37e655458e3ca9 builtin_binary.inc I, [2024-05-14T21:48:19.797038 #2511758] INFO -- : compiling /home/opc/ruby/src/master/builtin.c I, [2024-05-14T21:48:20.121433 #2511758] INFO -- : linking static-library libruby-static.a I, [2024-05-14T21:48:22.627558 #2511758] INFO -- : linking ruby I, [2024-05-14T21:48:23.538333 #2511758] INFO -- : $$$[end] "make ruby -j3" exit with 0. I, [2024-05-14T21:48:23.538509 #2511758] INFO -- : $$$[beg] make all -j3 I, [2024-05-14T21:48:23.628296 #2511758] INFO -- : BASERUBY = /usr/local/bin/ruby --disable=gems I, [2024-05-14T21:48:23.628363 #2511758] INFO -- : CC = gcc I, [2024-05-14T21:48:23.628374 #2511758] INFO -- : LD = ld I, [2024-05-14T21:48:23.628383 #2511758] INFO -- : LDSHARED = gcc -shared I, [2024-05-14T21:48:23.628394 #2511758] INFO -- : CFLAGS = -O3 -fno-fast-math -ggdb3 -Wall -Wextra -Wdeprecated-declarations -Wdiv-by-zero -Wduplicated-cond -Wimplicit-function-declaration -Wimplicit-int -Wpointer-arith -Wwrite-strings -Wold-style-definition -Wimplicit-fallthrough=0 -Wmissing-noreturn -Wno-cast-function-type -Wno-constant-logical-operand -Wno-long-long -Wno-missing-field-initializers -Wno-overlength-strings -Wno-packed-bitfield-compat -Wno-parentheses-equality -Wno-self-assign -Wno-tautological-compare -Wno-unused-parameter -Wno-unused-value -Wsuggest-attribute=format -Wsuggest-attribute=noreturn -Wunused-variable -Wmisleading-indentation -Wundef I, [2024-05-14T21:48:23.628403 #2511758] INFO -- : XCFLAGS = -U_FORTIFY_SOURCE -D_FORTIFY_SOURCE=2 -fstack-protector-strong -msign-return-address=all -fno-strict-overflow -fvisibility=hidden -fexcess-precision=standard -DRUBY_EXPORT -fPIE -I. -I.ext/include/aarch64-linux -I/home/opc/ruby/src/master/include -I/home/opc/ruby/src/master -I/home/opc/ruby/src/master/prism -I/home/opc/ruby/src/master/enc/unicode/15.0.0 I, [2024-05-14T21:48:23.628412 #2511758] INFO -- : CPPFLAGS = I, [2024-05-14T21:48:23.628420 #2511758] INFO -- : DLDFLAGS = -Wl,--compress-debug-sections=zlib -fstack-protector-strong -pie I, [2024-05-14T21:48:23.628428 #2511758] INFO -- : SOLIBS = -lz -lrt -lrt -ldl -lcrypt -lm -lpthread I, [2024-05-14T21:48:23.628436 #2511758] INFO -- : LANG = en_US.UTF-8 I, [2024-05-14T21:48:23.628444 #2511758] INFO -- : LC_ALL = I, [2024-05-14T21:48:23.628452 #2511758] INFO -- : LC_CTYPE = I, [2024-05-14T21:48:23.628460 #2511758] INFO -- : MFLAGS = -j3 --jobserver-auth=4,5 I, [2024-05-14T21:48:23.628467 #2511758] INFO -- : RUSTC = rustc I, [2024-05-14T21:48:23.628475 #2511758] INFO -- : YJIT_RUSTC_ARGS = --crate-name=yjit --crate-type=staticlib --edition=2021 -g -C lto=thin -C opt-level=3 -C overflow-checks=on '--out-dir=/home/opc/ruby/build/master/yjit/target/release/' /home/opc/ruby/src/master/yjit/src/lib.rs I, [2024-05-14T21:48:23.629280 #2511758] INFO -- : gcc (GCC) 8.5.0 20210514 (Red Hat 8.5.0-10.1.0.1) I, [2024-05-14T21:48:23.629323 #2511758] INFO -- : Copyright (C) 2018 Free Software Foundation, Inc. I, [2024-05-14T21:48:23.629337 #2511758] INFO -- : This is free software; see the source for copying conditions. There is NO I, [2024-05-14T21:48:23.629347 #2511758] INFO -- : warranty; not even for MERCHANTABILITY or FITNESS FOR A PARTICULAR PURPOSE. I, [2024-05-14T21:48:23.629355 #2511758] INFO -- : I, [2024-05-14T21:48:23.661877 #2511758] INFO -- : generating encdb.h I, [2024-05-14T21:48:23.663281 #2511758] INFO -- : generating enc.mk I, [2024-05-14T21:48:23.701337 #2511758] INFO -- : encdb.h unchanged I, [2024-05-14T21:48:23.895880 #2511758] INFO -- : making srcs under enc I, [2024-05-14T21:48:23.896802 #2511758] INFO -- : making enc I, [2024-05-14T21:48:23.923832 #2511758] INFO -- : make[1]: Entering directory '/home/opc/ruby/build/master' I, [2024-05-14T21:48:23.923898 #2511758] INFO -- : make[1]: Nothing to be done for 'enc'. I, [2024-05-14T21:48:23.923909 #2511758] INFO -- : make[1]: Leaving directory '/home/opc/ruby/build/master' I, [2024-05-14T21:48:23.938023 #2511758] INFO -- : make[1]: Entering directory '/home/opc/ruby/build/master' I, [2024-05-14T21:48:23.938070 #2511758] INFO -- : make[1]: Nothing to be done for 'srcs'. I, [2024-05-14T21:48:23.938081 #2511758] INFO -- : make[1]: Leaving directory '/home/opc/ruby/build/master' I, [2024-05-14T21:48:23.938815 #2511758] INFO -- : generating transdb.h I, [2024-05-14T21:48:24.084027 #2511758] INFO -- : transdb.h unchanged I, [2024-05-14T21:48:24.085518 #2511758] INFO -- : generating makefiles ext/configure-ext.mk I, [2024-05-14T21:48:24.085554 #2511758] INFO -- : making trans I, [2024-05-14T21:48:24.124637 #2511758] INFO -- : ext/configure-ext.mk updated I, [2024-05-14T21:48:24.127656 #2511758] INFO -- : make[1]: Entering directory '/home/opc/ruby/build/master' I, [2024-05-14T21:48:24.134881 #2511758] INFO -- : make[1]: Entering directory '/home/opc/ruby/build/master' I, [2024-05-14T21:48:24.134940 #2511758] INFO -- : make[1]: Nothing to be done for 'trans'. I, [2024-05-14T21:48:24.134951 #2511758] INFO -- : make[1]: Leaving directory '/home/opc/ruby/build/master' I, [2024-05-14T21:48:24.836053 #2511758] INFO -- : making encs I, [2024-05-14T21:48:24.862727 #2511758] INFO -- : make[1]: Leaving directory '/home/opc/ruby/build/master' I, [2024-05-14T21:48:24.863315 #2511758] INFO -- : generating makefile exts.mk I, [2024-05-14T21:48:24.893676 #2511758] INFO -- : make[1]: Entering directory '/home/opc/ruby/build/master' I, [2024-05-14T21:48:24.893748 #2511758] INFO -- : make[1]: Nothing to be done for 'encs'. I, [2024-05-14T21:48:24.893759 #2511758] INFO -- : make[1]: Leaving directory '/home/opc/ruby/build/master' I, [2024-05-14T21:48:24.921895 #2511758] INFO -- : exts.mk unchanged I, [2024-05-14T21:48:24.926751 #2511758] INFO -- : make[1]: Entering directory '/home/opc/ruby/build/master' I, [2024-05-14T21:48:25.032814 #2511758] INFO -- : make[2]: Entering directory '/home/opc/ruby/build/master/ext/coverage' I, [2024-05-14T21:48:25.032890 #2511758] INFO -- : make[2]: Entering directory '/home/opc/ruby/build/master/ext/digest' I, [2024-05-14T21:48:25.034057 #2511758] INFO -- : make[2]: Entering directory '/home/opc/ruby/build/master/ext/date' I, [2024-05-14T21:48:25.037733 #2511758] INFO -- : make[2]: Leaving directory '/home/opc/ruby/build/master/ext/coverage' I, [2024-05-14T21:48:25.039301 #2511758] INFO -- : make[2]: Leaving directory '/home/opc/ruby/build/master/ext/date' I, [2024-05-14T21:48:25.041511 #2511758] INFO -- : make[2]: Leaving directory '/home/opc/ruby/build/master/ext/digest' I, [2024-05-14T21:48:25.048163 #2511758] INFO -- : make[2]: Entering directory '/home/opc/ruby/build/master/ext/io/console' I, [2024-05-14T21:48:25.048568 #2511758] INFO -- : make[2]: Entering directory '/home/opc/ruby/build/master/ext/fiddle' I, [2024-05-14T21:48:25.052344 #2511758] INFO -- : make[2]: Leaving directory '/home/opc/ruby/build/master/ext/io/console' I, [2024-05-14T21:48:25.054475 #2511758] INFO -- : make[2]: Entering directory '/home/opc/ruby/build/master/ext/json' I, [2024-05-14T21:48:25.058937 #2511758] INFO -- : make[2]: Leaving directory '/home/opc/ruby/build/master/ext/fiddle' I, [2024-05-14T21:48:25.061590 #2511758] INFO -- : make[2]: Entering directory '/home/opc/ruby/build/master/ext/monitor' I, [2024-05-14T21:48:25.063853 #2511758] INFO -- : make[2]: Leaving directory '/home/opc/ruby/build/master/ext/json' I, [2024-05-14T21:48:25.065595 #2511758] INFO -- : make[2]: Leaving directory '/home/opc/ruby/build/master/ext/monitor' I, [2024-05-14T21:48:25.066895 #2511758] INFO -- : make[2]: Entering directory '/home/opc/ruby/build/master/ext/objspace' I, [2024-05-14T21:48:25.069601 #2511758] INFO -- : make[2]: Entering directory '/home/opc/ruby/build/master/ext/pathname' I, [2024-05-14T21:48:25.072734 #2511758] INFO -- : make[2]: Leaving directory '/home/opc/ruby/build/master/ext/objspace' I, [2024-05-14T21:48:25.073463 #2511758] INFO -- : make[2]: Leaving directory '/home/opc/ruby/build/master/ext/pathname' I, [2024-05-14T21:48:25.077704 #2511758] INFO -- : make[2]: Entering directory '/home/opc/ruby/build/master/ext/pty' I, [2024-05-14T21:48:25.079189 #2511758] INFO -- : make[2]: Entering directory '/home/opc/ruby/build/master/ext/psych' I, [2024-05-14T21:48:25.083125 #2511758] INFO -- : make[2]: Entering directory '/home/opc/ruby/build/master/ext/openssl' I, [2024-05-14T21:48:25.084137 #2511758] INFO -- : make[2]: Leaving directory '/home/opc/ruby/build/master/ext/pty' I, [2024-05-14T21:48:25.097634 #2511758] INFO -- : make[2]: Leaving directory '/home/opc/ruby/build/master/ext/psych' I, [2024-05-14T21:48:25.099439 #2511758] INFO -- : make[2]: Entering directory '/home/opc/ruby/build/master/ext/rubyvm' I, [2024-05-14T21:48:25.102654 #2511758] INFO -- : make[2]: Entering directory '/home/opc/ruby/build/master/ext/ripper' I, [2024-05-14T21:48:25.103014 #2511758] INFO -- : make[2]: Leaving directory '/home/opc/ruby/build/master/ext/rubyvm' I, [2024-05-14T21:48:25.103550 #2511758] INFO -- : make[2]: Leaving directory '/home/opc/ruby/build/master/ext/openssl' I, [2024-05-14T21:48:25.109713 #2511758] INFO -- : make[2]: Leaving directory '/home/opc/ruby/build/master/ext/ripper' I, [2024-05-14T21:48:25.113327 #2511758] INFO -- : make[2]: Entering directory '/home/opc/ruby/build/master/ext/zlib' I, [2024-05-14T21:48:25.114606 #2511758] INFO -- : compiling /home/opc/ruby/src/master/ext/zlib/zlib.c I, [2024-05-14T21:48:25.115218 #2511758] INFO -- : make[2]: Entering directory '/home/opc/ruby/build/master/ext/socket' I, [2024-05-14T21:48:25.115336 #2511758] INFO -- : make[2]: Entering directory '/home/opc/ruby/build/master/.bundle/gems/bigdecimal-3.1.7/ext/bigdecimal' I, [2024-05-14T21:48:25.126525 #2511758] INFO -- : make[2]: Leaving directory '/home/opc/ruby/build/master/ext/socket' I, [2024-05-14T21:48:25.129033 #2511758] INFO -- : make[2]: Entering directory '/home/opc/ruby/build/master/.bundle/gems/bigdecimal-3.1.8/ext/bigdecimal' I, [2024-05-14T21:48:25.146246 #2511758] INFO -- : make[2]: Leaving directory '/home/opc/ruby/build/master/.bundle/gems/bigdecimal-3.1.7/ext/bigdecimal' I, [2024-05-14T21:48:25.148704 #2511758] INFO -- : make[2]: Entering directory '/home/opc/ruby/build/master/.bundle/gems/debug-1.9.2/ext/debug' I, [2024-05-14T21:48:25.161975 #2511758] INFO -- : make[2]: Leaving directory '/home/opc/ruby/build/master/.bundle/gems/bigdecimal-3.1.8/ext/bigdecimal' I, [2024-05-14T21:48:25.164528 #2511758] INFO -- : make[2]: Entering directory '/home/opc/ruby/build/master/.bundle/gems/nkf-0.2.0/ext/nkf' I, [2024-05-14T21:48:25.179735 #2511758] INFO -- : make[2]: Leaving directory '/home/opc/ruby/build/master/.bundle/gems/debug-1.9.2/ext/debug' I, [2024-05-14T21:48:25.182287 #2511758] INFO -- : make[2]: Entering directory '/home/opc/ruby/build/master/.bundle/gems/racc-1.7.3/ext/racc/cparse' I, [2024-05-14T21:48:25.200108 #2511758] INFO -- : make[2]: Leaving directory '/home/opc/ruby/build/master/.bundle/gems/nkf-0.2.0/ext/nkf' I, [2024-05-14T21:48:25.203078 #2511758] INFO -- : make[2]: Entering directory '/home/opc/ruby/build/master/.bundle/gems/rbs-3.4.4/ext/rbs_extension' I, [2024-05-14T21:48:25.213914 #2511758] INFO -- : make[2]: Leaving directory '/home/opc/ruby/build/master/.bundle/gems/racc-1.7.3/ext/racc/cparse' I, [2024-05-14T21:48:25.221018 #2511758] INFO -- : make[2]: Entering directory '/home/opc/ruby/build/master/.bundle/gems/syslog-0.1.2/ext/syslog' I, [2024-05-14T21:48:25.234336 #2511758] INFO -- : make[2]: Leaving directory '/home/opc/ruby/build/master/.bundle/gems/rbs-3.4.4/ext/rbs_extension' I, [2024-05-14T21:48:25.252677 #2511758] INFO -- : make[2]: Leaving directory '/home/opc/ruby/build/master/.bundle/gems/syslog-0.1.2/ext/syslog' I, [2024-05-14T21:48:25.257131 #2511758] INFO -- : make[2]: Entering directory '/home/opc/ruby/build/master/ext/digest/sha2' I, [2024-05-14T21:48:25.262235 #2511758] INFO -- : make[2]: Leaving directory '/home/opc/ruby/build/master/ext/digest/sha2' I, [2024-05-14T21:48:26.637597 #2511758] INFO -- : linking shared-object zlib.so I, [2024-05-14T21:48:26.691880 #2511758] INFO -- : make[2]: Leaving directory '/home/opc/ruby/build/master/ext/zlib' I, [2024-05-14T21:48:26.729969 #2511758] INFO -- : make[2]: Entering directory '/home/opc/ruby/build/master' I, [2024-05-14T21:48:26.812878 #2511758] INFO -- : make[2]: 'ruby' is up to date. I, [2024-05-14T21:48:26.812951 #2511758] INFO -- : make[2]: Leaving directory '/home/opc/ruby/build/master' I, [2024-05-14T21:48:26.813135 #2511758] INFO -- : make[1]: Leaving directory '/home/opc/ruby/build/master' I, [2024-05-14T21:48:26.817868 #2511758] INFO -- : make[1]: Entering directory '/home/opc/ruby/build/master' I, [2024-05-14T21:48:26.817912 #2511758] INFO -- : make[1]: Nothing to be done for 'note'. I, [2024-05-14T21:48:26.817922 #2511758] INFO -- : make[1]: Leaving directory '/home/opc/ruby/build/master' I, [2024-05-14T21:48:26.818277 #2511758] INFO -- : $$$[end] "make all -j3" exit with 0. I, [2024-05-14T21:48:26.818429 #2511758] INFO -- : $$$[beg] make install -j3 I, [2024-05-14T21:48:26.912665 #2511758] INFO -- : Update minitest to ea9caafc0754b1d6236a490d59e624b53209734a I, [2024-05-14T21:48:26.912861 #2511758] INFO -- : Update power_assert to 84e85124c5014a139af39161d484156cfe87a9ed I, [2024-05-14T21:48:26.913151 #2511758] INFO -- : Update rbs to ba7872795d5de04adb8ff500c0e6afdc81a041dd I, [2024-05-14T21:48:26.915930 #2511758] INFO -- : echo ea9caafc0754b1d6236a490d59e624b53209734a | /bin/sh /home/opc/ruby/src/master/tool/ifchange /home/opc/ruby/src/master/.bundle/.timestamp/minitest.revision - I, [2024-05-14T21:48:26.916056 #2511758] INFO -- : echo 84e85124c5014a139af39161d484156cfe87a9ed | /bin/sh /home/opc/ruby/src/master/tool/ifchange /home/opc/ruby/src/master/.bundle/.timestamp/power_assert.revision - I, [2024-05-14T21:48:26.917089 #2511758] INFO -- : echo ba7872795d5de04adb8ff500c0e6afdc81a041dd | /bin/sh /home/opc/ruby/src/master/tool/ifchange /home/opc/ruby/src/master/.bundle/.timestamp/rbs.revision - I, [2024-05-14T21:48:26.922110 #2511758] INFO -- : /home/opc/ruby/src/master/.bundle/.timestamp/minitest.revision unchanged I, [2024-05-14T21:48:26.922149 #2511758] INFO -- : /home/opc/ruby/src/master/.bundle/.timestamp/power_assert.revision unchanged I, [2024-05-14T21:48:26.924060 #2511758] INFO -- : /home/opc/ruby/src/master/.bundle/.timestamp/rbs.revision unchanged I, [2024-05-14T21:48:26.924878 #2511758] INFO -- : Update typeprof to b19a6416da3a05d57fadd6ffdadb382b6d236ca5 I, [2024-05-14T21:48:26.927284 #2511758] INFO -- : BASERUBY = /usr/local/bin/ruby --disable=gems I, [2024-05-14T21:48:26.927318 #2511758] INFO -- : CC = gcc I, [2024-05-14T21:48:26.927329 #2511758] INFO -- : LD = ld I, [2024-05-14T21:48:26.927338 #2511758] INFO -- : LDSHARED = gcc -shared I, [2024-05-14T21:48:26.927348 #2511758] INFO -- : CFLAGS = -O3 -fno-fast-math -ggdb3 -Wall -Wextra -Wdeprecated-declarations -Wdiv-by-zero -Wduplicated-cond -Wimplicit-function-declaration -Wimplicit-int -Wpointer-arith -Wwrite-strings -Wold-style-definition -Wimplicit-fallthrough=0 -Wmissing-noreturn -Wno-cast-function-type -Wno-constant-logical-operand -Wno-long-long -Wno-missing-field-initializers -Wno-overlength-strings -Wno-packed-bitfield-compat -Wno-parentheses-equality -Wno-self-assign -Wno-tautological-compare -Wno-unused-parameter -Wno-unused-value -Wsuggest-attribute=format -Wsuggest-attribute=noreturn -Wunused-variable -Wmisleading-indentation -Wundef I, [2024-05-14T21:48:26.927360 #2511758] INFO -- : XCFLAGS = -U_FORTIFY_SOURCE -D_FORTIFY_SOURCE=2 -fstack-protector-strong -msign-return-address=all -fno-strict-overflow -fvisibility=hidden -fexcess-precision=standard -DRUBY_EXPORT -fPIE -I. -I.ext/include/aarch64-linux -I/home/opc/ruby/src/master/include -I/home/opc/ruby/src/master -I/home/opc/ruby/src/master/prism -I/home/opc/ruby/src/master/enc/unicode/15.0.0 I, [2024-05-14T21:48:26.927369 #2511758] INFO -- : CPPFLAGS = I, [2024-05-14T21:48:26.927378 #2511758] INFO -- : DLDFLAGS = -Wl,--compress-debug-sections=zlib -fstack-protector-strong -pie I, [2024-05-14T21:48:26.927386 #2511758] INFO -- : SOLIBS = -lz -lrt -lrt -ldl -lcrypt -lm -lpthread I, [2024-05-14T21:48:26.927394 #2511758] INFO -- : LANG = en_US.UTF-8 I, [2024-05-14T21:48:26.927402 #2511758] INFO -- : LC_ALL = I, [2024-05-14T21:48:26.927409 #2511758] INFO -- : LC_CTYPE = I, [2024-05-14T21:48:26.927418 #2511758] INFO -- : MFLAGS = -j3 --jobserver-auth=4,5 I, [2024-05-14T21:48:26.927425 #2511758] INFO -- : RUSTC = rustc I, [2024-05-14T21:48:26.927434 #2511758] INFO -- : YJIT_RUSTC_ARGS = --crate-name=yjit --crate-type=staticlib --edition=2021 -g -C lto=thin -C opt-level=3 -C overflow-checks=on '--out-dir=/home/opc/ruby/build/master/yjit/target/release/' /home/opc/ruby/src/master/yjit/src/lib.rs I, [2024-05-14T21:48:26.957699 #2511758] INFO -- : echo b19a6416da3a05d57fadd6ffdadb382b6d236ca5 | /bin/sh /home/opc/ruby/src/master/tool/ifchange /home/opc/ruby/src/master/.bundle/.timestamp/typeprof.revision - I, [2024-05-14T21:48:26.958836 #2511758] INFO -- : gcc (GCC) 8.5.0 20210514 (Red Hat 8.5.0-10.1.0.1) I, [2024-05-14T21:48:26.958878 #2511758] INFO -- : Copyright (C) 2018 Free Software Foundation, Inc. I, [2024-05-14T21:48:26.958888 #2511758] INFO -- : This is free software; see the source for copying conditions. There is NO I, [2024-05-14T21:48:26.958898 #2511758] INFO -- : warranty; not even for MERCHANTABILITY or FITNESS FOR A PARTICULAR PURPOSE. I, [2024-05-14T21:48:26.958906 #2511758] INFO -- : I, [2024-05-14T21:48:26.959591 #2511758] INFO -- : generating encdb.h I, [2024-05-14T21:48:26.961340 #2511758] INFO -- : generating enc.mk I, [2024-05-14T21:48:26.964338 #2511758] INFO -- : /home/opc/ruby/src/master/.bundle/.timestamp/typeprof.revision unchanged I, [2024-05-14T21:48:26.998944 #2511758] INFO -- : encdb.h unchanged I, [2024-05-14T21:48:27.097168 #2511758] INFO -- : Building power_assert@84e85124c5014a139af39161d484156cfe87a9ed to /home/opc/ruby/src/master/gems/power_assert-2.0.3.gem I, [2024-05-14T21:48:27.203666 #2511758] INFO -- : making srcs under enc I, [2024-05-14T21:48:27.203878 #2511758] INFO -- : making enc I, [2024-05-14T21:48:27.215111 #2511758] INFO -- : Successfully built RubyGem I, [2024-05-14T21:48:27.215168 #2511758] INFO -- : Name: power_assert I, [2024-05-14T21:48:27.215179 #2511758] INFO -- : Version: 2.0.4dev I, [2024-05-14T21:48:27.215188 #2511758] INFO -- : File: power_assert-2.0.4dev.gem I, [2024-05-14T21:48:27.217396 #2511758] INFO -- : Extracting bundle gem power_assert-2.0.3... I, [2024-05-14T21:48:27.232122 #2511758] INFO -- : make[1]: Entering directory '/home/opc/ruby/build/master' I, [2024-05-14T21:48:27.232180 #2511758] INFO -- : make[1]: Nothing to be done for 'enc'. I, [2024-05-14T21:48:27.232193 #2511758] INFO -- : make[1]: Leaving directory '/home/opc/ruby/build/master' I, [2024-05-14T21:48:27.246867 #2511758] INFO -- : make[1]: Entering directory '/home/opc/ruby/build/master' I, [2024-05-14T21:48:27.246926 #2511758] INFO -- : make[1]: Nothing to be done for 'srcs'. I, [2024-05-14T21:48:27.246937 #2511758] INFO -- : make[1]: Leaving directory '/home/opc/ruby/build/master' I, [2024-05-14T21:48:27.247729 #2511758] INFO -- : generating transdb.h I, [2024-05-14T21:48:27.316223 #2511758] INFO -- : Try with hash version of bundled gems instead of gems/power_assert-2.0.3.gem. We don't use this gem with release version of Ruby. I, [2024-05-14T21:48:27.326691 #2511758] INFO -- : Unpacked gems/power_assert-2.0.4dev.gem I, [2024-05-14T21:48:27.391869 #2511758] INFO -- : transdb.h unchanged I, [2024-05-14T21:48:27.393309 #2511758] INFO -- : generating makefiles ext/configure-ext.mk I, [2024-05-14T21:48:27.393647 #2511758] INFO -- : making trans I, [2024-05-14T21:48:27.433604 #2511758] INFO -- : ext/configure-ext.mk unchanged I, [2024-05-14T21:48:27.436654 #2511758] INFO -- : make[1]: Entering directory '/home/opc/ruby/build/master' I, [2024-05-14T21:48:27.442476 #2511758] INFO -- : make[1]: Entering directory '/home/opc/ruby/build/master' I, [2024-05-14T21:48:27.442538 #2511758] INFO -- : make[1]: Nothing to be done for 'trans'. I, [2024-05-14T21:48:27.442550 #2511758] INFO -- : make[1]: Leaving directory '/home/opc/ruby/build/master' I, [2024-05-14T21:48:28.148905 #2511758] INFO -- : making encs I, [2024-05-14T21:48:28.166107 #2511758] INFO -- : make[1]: Leaving directory '/home/opc/ruby/build/master' I, [2024-05-14T21:48:28.166712 #2511758] INFO -- : generating makefile exts.mk I, [2024-05-14T21:48:28.205315 #2511758] INFO -- : make[1]: Entering directory '/home/opc/ruby/build/master' I, [2024-05-14T21:48:28.205386 #2511758] INFO -- : make[1]: Nothing to be done for 'encs'. I, [2024-05-14T21:48:28.205397 #2511758] INFO -- : make[1]: Leaving directory '/home/opc/ruby/build/master' I, [2024-05-14T21:48:28.225532 #2511758] INFO -- : exts.mk unchanged I, [2024-05-14T21:48:28.230418 #2511758] INFO -- : make[1]: Entering directory '/home/opc/ruby/build/master' I, [2024-05-14T21:48:28.336030 #2511758] INFO -- : make[2]: Entering directory '/home/opc/ruby/build/master/ext/coverage' I, [2024-05-14T21:48:28.338210 #2511758] INFO -- : make[2]: Entering directory '/home/opc/ruby/build/master/ext/digest' I, [2024-05-14T21:48:28.341373 #2511758] INFO -- : make[2]: Entering directory '/home/opc/ruby/build/master/ext/date' I, [2024-05-14T21:48:28.341543 #2511758] INFO -- : make[2]: Leaving directory '/home/opc/ruby/build/master/ext/coverage' I, [2024-05-14T21:48:28.346407 #2511758] INFO -- : make[2]: Leaving directory '/home/opc/ruby/build/master/ext/date' I, [2024-05-14T21:48:28.347084 #2511758] INFO -- : make[2]: Leaving directory '/home/opc/ruby/build/master/ext/digest' I, [2024-05-14T21:48:28.353638 #2511758] INFO -- : make[2]: Entering directory '/home/opc/ruby/build/master/ext/io/console' I, [2024-05-14T21:48:28.354090 #2511758] INFO -- : make[2]: Entering directory '/home/opc/ruby/build/master/ext/fiddle' I, [2024-05-14T21:48:28.359100 #2511758] INFO -- : make[2]: Leaving directory '/home/opc/ruby/build/master/ext/io/console' I, [2024-05-14T21:48:28.361396 #2511758] INFO -- : make[2]: Entering directory '/home/opc/ruby/build/master/ext/json' I, [2024-05-14T21:48:28.366188 #2511758] INFO -- : make[2]: Entering directory '/home/opc/ruby/build/master/ext/monitor' I, [2024-05-14T21:48:28.366842 #2511758] INFO -- : make[2]: Leaving directory '/home/opc/ruby/build/master/ext/fiddle' I, [2024-05-14T21:48:28.370383 #2511758] INFO -- : make[2]: Leaving directory '/home/opc/ruby/build/master/ext/monitor' I, [2024-05-14T21:48:28.370741 #2511758] INFO -- : make[2]: Leaving directory '/home/opc/ruby/build/master/ext/json' I, [2024-05-14T21:48:28.374159 #2511758] INFO -- : make[2]: Entering directory '/home/opc/ruby/build/master/ext/objspace' I, [2024-05-14T21:48:28.374882 #2511758] INFO -- : make[2]: Entering directory '/home/opc/ruby/build/master/ext/pathname' I, [2024-05-14T21:48:28.379040 #2511758] INFO -- : make[2]: Leaving directory '/home/opc/ruby/build/master/ext/pathname' I, [2024-05-14T21:48:28.380810 #2511758] INFO -- : make[2]: Leaving directory '/home/opc/ruby/build/master/ext/objspace' I, [2024-05-14T21:48:28.385311 #2511758] INFO -- : make[2]: Entering directory '/home/opc/ruby/build/master/ext/pty' I, [2024-05-14T21:48:28.385512 #2511758] INFO -- : make[2]: Entering directory '/home/opc/ruby/build/master/ext/psych' I, [2024-05-14T21:48:28.389164 #2511758] INFO -- : make[2]: Leaving directory '/home/opc/ruby/build/master/ext/pty' I, [2024-05-14T21:48:28.391408 #2511758] INFO -- : make[2]: Entering directory '/home/opc/ruby/build/master/ext/openssl' I, [2024-05-14T21:48:28.402975 #2511758] INFO -- : make[2]: Leaving directory '/home/opc/ruby/build/master/ext/psych' I, [2024-05-14T21:48:28.404784 #2511758] INFO -- : make[2]: Entering directory '/home/opc/ruby/build/master/ext/rubyvm' I, [2024-05-14T21:48:28.408128 #2511758] INFO -- : make[2]: Leaving directory '/home/opc/ruby/build/master/ext/rubyvm' I, [2024-05-14T21:48:28.410267 #2511758] INFO -- : make[2]: Entering directory '/home/opc/ruby/build/master/ext/ripper' I, [2024-05-14T21:48:28.417458 #2511758] INFO -- : make[2]: Leaving directory '/home/opc/ruby/build/master/ext/openssl' I, [2024-05-14T21:48:28.418295 #2511758] INFO -- : make[2]: Leaving directory '/home/opc/ruby/build/master/ext/ripper' I, [2024-05-14T21:48:28.420388 #2511758] INFO -- : make[2]: Entering directory '/home/opc/ruby/build/master/ext/socket' I, [2024-05-14T21:48:28.425155 #2511758] INFO -- : make[2]: Entering directory '/home/opc/ruby/build/master/.bundle/gems/bigdecimal-3.1.7/ext/bigdecimal' I, [2024-05-14T21:48:28.430998 #2511758] INFO -- : make[2]: Entering directory '/home/opc/ruby/build/master/.bundle/gems/bigdecimal-3.1.8/ext/bigdecimal' I, [2024-05-14T21:48:28.431512 #2511758] INFO -- : make[2]: Leaving directory '/home/opc/ruby/build/master/ext/socket' I, [2024-05-14T21:48:28.436412 #2511758] INFO -- : make[2]: Entering directory '/home/opc/ruby/build/master/.bundle/gems/debug-1.9.2/ext/debug' I, [2024-05-14T21:48:28.457617 #2511758] INFO -- : make[2]: Leaving directory '/home/opc/ruby/build/master/.bundle/gems/bigdecimal-3.1.7/ext/bigdecimal' I, [2024-05-14T21:48:28.460151 #2511758] INFO -- : make[2]: Entering directory '/home/opc/ruby/build/master/.bundle/gems/nkf-0.2.0/ext/nkf' I, [2024-05-14T21:48:28.462238 #2511758] INFO -- : make[2]: Leaving directory '/home/opc/ruby/build/master/.bundle/gems/bigdecimal-3.1.8/ext/bigdecimal' I, [2024-05-14T21:48:28.464680 #2511758] INFO -- : make[2]: Entering directory '/home/opc/ruby/build/master/.bundle/gems/racc-1.7.3/ext/racc/cparse' I, [2024-05-14T21:48:28.469931 #2511758] INFO -- : make[2]: Leaving directory '/home/opc/ruby/build/master/.bundle/gems/debug-1.9.2/ext/debug' I, [2024-05-14T21:48:28.475172 #2511758] INFO -- : make[2]: Entering directory '/home/opc/ruby/build/master/.bundle/gems/rbs-3.4.4/ext/rbs_extension' I, [2024-05-14T21:48:28.492903 #2511758] INFO -- : make[2]: Leaving directory '/home/opc/ruby/build/master/.bundle/gems/nkf-0.2.0/ext/nkf' I, [2024-05-14T21:48:28.495505 #2511758] INFO -- : make[2]: Entering directory '/home/opc/ruby/build/master/.bundle/gems/syslog-0.1.2/ext/syslog' I, [2024-05-14T21:48:28.498628 #2511758] INFO -- : make[2]: Leaving directory '/home/opc/ruby/build/master/.bundle/gems/racc-1.7.3/ext/racc/cparse' I, [2024-05-14T21:48:28.508737 #2511758] INFO -- : make[2]: Leaving directory '/home/opc/ruby/build/master/.bundle/gems/rbs-3.4.4/ext/rbs_extension' I, [2024-05-14T21:48:28.518114 #2511758] INFO -- : make[2]: Entering directory '/home/opc/ruby/build/master/ext/digest/sha2' I, [2024-05-14T21:48:28.523217 #2511758] INFO -- : make[2]: Leaving directory '/home/opc/ruby/build/master/ext/digest/sha2' I, [2024-05-14T21:48:28.533479 #2511758] INFO -- : make[2]: Leaving directory '/home/opc/ruby/build/master/.bundle/gems/syslog-0.1.2/ext/syslog' I, [2024-05-14T21:48:28.571416 #2511758] INFO -- : make[2]: Entering directory '/home/opc/ruby/build/master' I, [2024-05-14T21:48:28.654802 #2511758] INFO -- : make[2]: 'ruby' is up to date. I, [2024-05-14T21:48:28.654874 #2511758] INFO -- : make[2]: Leaving directory '/home/opc/ruby/build/master' I, [2024-05-14T21:48:28.655029 #2511758] INFO -- : make[1]: Leaving directory '/home/opc/ruby/build/master' I, [2024-05-14T21:48:28.659392 #2511758] INFO -- : make[1]: Entering directory '/home/opc/ruby/build/master' I, [2024-05-14T21:48:28.659435 #2511758] INFO -- : make[1]: Nothing to be done for 'note'. I, [2024-05-14T21:48:28.659447 #2511758] INFO -- : make[1]: Leaving directory '/home/opc/ruby/build/master' I, [2024-05-14T21:48:28.659612 #2511758] INFO -- : ./miniruby -I/home/opc/ruby/src/master/lib -I. -I.ext/common /home/opc/ruby/src/master/tool/runruby.rb --extout=.ext -- --disable-gems -r./aarch64-linux-fake /home/opc/ruby/src/master/tool/rbinstall.rb --make="make" --dest-dir="" --extout=".ext" --ext-build-dir="./ext" --mflags="-j3 --jobserver-auth=4,5" --make-flags=" -j3 --jobserver-auth=4,5" --data-mode=0644 --prog-mode=0755 --installed-list .installed.list --mantype="doc" --gnumake --install=all --exclude=doc I, [2024-05-14T21:48:28.812147 #2511758] INFO -- : Installing to I, [2024-05-14T21:48:28.812214 #2511758] INFO -- : installing binary commands: /home/opc/ruby/install/master/bin I, [2024-05-14T21:48:28.934621 #2511758] INFO -- : installing base libraries: /home/opc/ruby/install/master/lib I, [2024-05-14T21:48:28.935050 #2511758] INFO -- : installing arch files: /home/opc/ruby/install/master/lib/ruby/3.4.0+0/aarch64-linux I, [2024-05-14T21:48:28.935164 #2511758] INFO -- : installing pkgconfig data: /home/opc/ruby/install/master/lib/pkgconfig I, [2024-05-14T21:48:28.935253 #2511758] INFO -- : installing extension objects: /home/opc/ruby/install/master/lib/ruby/3.4.0+0/aarch64-linux I, [2024-05-14T21:48:28.950136 #2511758] INFO -- : installing extension objects: /home/opc/ruby/install/master/lib/ruby/site_ruby/3.4.0+0/aarch64-linux I, [2024-05-14T21:48:28.950179 #2511758] INFO -- : installing extension objects: /home/opc/ruby/install/master/lib/ruby/vendor_ruby/3.4.0+0/aarch64-linux I, [2024-05-14T21:48:28.950388 #2511758] INFO -- : installing extension headers: /home/opc/ruby/install/master/include/ruby-3.4.0+0/aarch64-linux I, [2024-05-14T21:48:28.950672 #2511758] INFO -- : installing extension scripts: /home/opc/ruby/install/master/lib/ruby/3.4.0+0 I, [2024-05-14T21:48:28.958584 #2511758] INFO -- : installing extension scripts: /home/opc/ruby/install/master/lib/ruby/site_ruby/3.4.0+0 I, [2024-05-14T21:48:28.958604 #2511758] INFO -- : installing extension scripts: /home/opc/ruby/install/master/lib/ruby/vendor_ruby/3.4.0+0 I, [2024-05-14T21:48:28.958615 #2511758] INFO -- : installing extension headers: /home/opc/ruby/install/master/include/ruby-3.4.0+0/ruby I, [2024-05-14T21:48:28.958732 #2511758] INFO -- : installing command scripts: /home/opc/ruby/install/master/bin I, [2024-05-14T21:48:28.958872 #2511758] INFO -- : installing library scripts: /home/opc/ruby/install/master/lib/ruby/3.4.0+0 I, [2024-05-14T21:48:29.041693 #2511758] INFO -- : installing common headers: /home/opc/ruby/install/master/include/ruby-3.4.0+0 I, [2024-05-14T21:48:29.054055 #2511758] INFO -- : installing manpages: /home/opc/ruby/install/master/share/man/man1 I, [2024-05-14T21:48:29.054363 #2511758] INFO -- : installing default gems from lib: /home/opc/ruby/install/master/lib/ruby/gems/3.4.0+0 I, [2024-05-14T21:48:29.099714 #2511758] INFO -- : benchmark 0.3.0 I, [2024-05-14T21:48:29.112388 #2511758] INFO -- : bundler 2.6.0.dev I, [2024-05-14T21:48:29.117124 #2511758] INFO -- : cgi 0.4.1 I, [2024-05-14T21:48:29.118312 #2511758] INFO -- : delegate 0.3.1 I, [2024-05-14T21:48:29.119389 #2511758] INFO -- : did_you_mean 1.6.3 I, [2024-05-14T21:48:29.120481 #2511758] INFO -- : english 0.8.0 I, [2024-05-14T21:48:29.121643 #2511758] INFO -- : erb 4.0.4 I, [2024-05-14T21:48:29.124080 #2511758] INFO -- : error_highlight 0.6.0 I, [2024-05-14T21:48:29.125339 #2511758] INFO -- : fileutils 1.7.2 I, [2024-05-14T21:48:29.126449 #2511758] INFO -- : find 0.2.0 I, [2024-05-14T21:48:29.127537 #2511758] INFO -- : forwardable 1.3.3 I, [2024-05-14T21:48:29.128617 #2511758] INFO -- : ipaddr 1.2.6 I, [2024-05-14T21:48:29.129754 #2511758] INFO -- : irb 1.13.1 I, [2024-05-14T21:48:29.133945 #2511758] INFO -- : logger 1.6.0 I, [2024-05-14T21:48:29.135053 #2511758] INFO -- : net-http 0.4.1 I, [2024-05-14T21:48:29.136190 #2511758] INFO -- : net-protocol 0.2.2 I, [2024-05-14T21:48:29.137381 #2511758] INFO -- : open-uri 0.4.1 I, [2024-05-14T21:48:29.138519 #2511758] INFO -- : open3 0.2.1 I, [2024-05-14T21:48:29.139608 #2511758] INFO -- : optparse 0.5.0 I, [2024-05-14T21:48:29.140779 #2511758] INFO -- : ostruct 0.6.0 I, [2024-05-14T21:48:29.141868 #2511758] INFO -- : pp 0.5.0 I, [2024-05-14T21:48:29.142982 #2511758] INFO -- : prettyprint 0.2.0 I, [2024-05-14T21:48:29.144095 #2511758] INFO -- : prism 0.29.0 I, [2024-05-14T21:48:29.145328 #2511758] INFO -- : pstore 0.1.3 I, [2024-05-14T21:48:29.146394 #2511758] INFO -- : rdoc 6.6.3.1 I, [2024-05-14T21:48:29.150124 #2511758] INFO -- : readline 0.0.4 I, [2024-05-14T21:48:29.151210 #2511758] INFO -- : reline 0.5.7 I, [2024-05-14T21:48:29.152374 #2511758] INFO -- : resolv 0.4.0 I, [2024-05-14T21:48:29.153554 #2511758] INFO -- : ruby2_keywords 0.0.5 I, [2024-05-14T21:48:29.154676 #2511758] INFO -- : securerandom 0.3.1 I, [2024-05-14T21:48:29.155781 #2511758] INFO -- : set 1.1.0 I, [2024-05-14T21:48:29.158176 #2511758] INFO -- : shellwords 0.2.0 I, [2024-05-14T21:48:29.159628 #2511758] INFO -- : singleton 0.2.0 I, [2024-05-14T21:48:29.160737 #2511758] INFO -- : syntax_suggest 2.0.0 I, [2024-05-14T21:48:29.163151 #2511758] INFO -- : tempfile 0.2.1 I, [2024-05-14T21:48:29.164261 #2511758] INFO -- : time 0.3.0 I, [2024-05-14T21:48:29.165477 #2511758] INFO -- : timeout 0.4.1 I, [2024-05-14T21:48:29.166595 #2511758] INFO -- : tmpdir 0.2.0 I, [2024-05-14T21:48:29.167718 #2511758] INFO -- : tsort 0.2.0 I, [2024-05-14T21:48:29.168843 #2511758] INFO -- : un 0.3.0 I, [2024-05-14T21:48:29.170004 #2511758] INFO -- : uri 0.13.0 I, [2024-05-14T21:48:29.171201 #2511758] INFO -- : weakref 0.1.3 I, [2024-05-14T21:48:29.172311 #2511758] INFO -- : yaml 0.3.0 I, [2024-05-14T21:48:29.173277 #2511758] INFO -- : installing default gems from ext: /home/opc/ruby/install/master/lib/ruby/gems/3.4.0+0 I, [2024-05-14T21:48:29.184629 #2511758] INFO -- : date 3.3.4 I, [2024-05-14T21:48:29.185834 #2511758] INFO -- : digest 3.1.1 I, [2024-05-14T21:48:29.186934 #2511758] INFO -- : etc 1.4.3 I, [2024-05-14T21:48:29.188076 #2511758] INFO -- : fcntl 1.1.0 I, [2024-05-14T21:48:29.189261 #2511758] INFO -- : fiddle 1.1.3 I, [2024-05-14T21:48:29.190396 #2511758] INFO -- : io-console 0.7.2 I, [2024-05-14T21:48:29.191506 #2511758] INFO -- : io-nonblock 0.3.0 I, [2024-05-14T21:48:29.192624 #2511758] INFO -- : io-wait 0.3.1 I, [2024-05-14T21:48:29.193855 #2511758] INFO -- : json 2.7.2 I, [2024-05-14T21:48:29.195072 #2511758] INFO -- : openssl 3.2.0 I, [2024-05-14T21:48:29.196212 #2511758] INFO -- : pathname 0.3.0 I, [2024-05-14T21:48:29.197405 #2511758] INFO -- : psych 5.1.2 I, [2024-05-14T21:48:29.198663 #2511758] INFO -- : stringio 3.1.1 I, [2024-05-14T21:48:29.199823 #2511758] INFO -- : strscan 3.1.1 I, [2024-05-14T21:48:29.201088 #2511758] INFO -- : zlib 3.1.0 I, [2024-05-14T21:48:29.202077 #2511758] INFO -- : installing bundled gems: /home/opc/ruby/install/master/lib/ruby/gems/3.4.0+0 I, [2024-05-14T21:48:29.204145 #2511758] INFO -- : minitest 5.22.3 I, [2024-05-14T21:48:29.217267 #2511758] INFO -- : rake 13.2.1 I, [2024-05-14T21:48:29.230708 #2511758] INFO -- : test-unit 3.6.2 I, [2024-05-14T21:48:29.247307 #2511758] INFO -- : rexml 3.2.6 I, [2024-05-14T21:48:29.261266 #2511758] INFO -- : rss 0.3.0 I, [2024-05-14T21:48:29.270910 #2511758] INFO -- : net-ftp 0.3.4 I, [2024-05-14T21:48:29.274633 #2511758] INFO -- : net-imap 0.4.11 I, [2024-05-14T21:48:29.287033 #2511758] INFO -- : net-pop 0.1.2 I, [2024-05-14T21:48:29.289487 #2511758] INFO -- : net-smtp 0.5.0 I, [2024-05-14T21:48:29.292767 #2511758] INFO -- : matrix 0.4.2 I, [2024-05-14T21:48:29.298756 #2511758] INFO -- : prime 0.1.2 I, [2024-05-14T21:48:29.308734 #2511758] INFO -- : rbs 3.4.4 I, [2024-05-14T21:48:29.411382 #2511758] INFO -- : typeprof 0.21.11 I, [2024-05-14T21:48:29.419335 #2511758] INFO -- : debug 1.9.2 I, [2024-05-14T21:48:29.429022 #2511758] INFO -- : racc 1.7.3 I, [2024-05-14T21:48:29.439743 #2511758] INFO -- : mutex_m 0.2.0 I, [2024-05-14T21:48:29.442614 #2511758] INFO -- : getoptlong 0.2.1 I, [2024-05-14T21:48:29.446975 #2511758] INFO -- : base64 0.2.0 I, [2024-05-14T21:48:29.449815 #2511758] INFO -- : bigdecimal 3.1.8 I, [2024-05-14T21:48:29.455386 #2511758] INFO -- : observer 0.1.2 I, [2024-05-14T21:48:29.458296 #2511758] INFO -- : abbrev 0.1.2 I, [2024-05-14T21:48:29.461043 #2511758] INFO -- : resolv-replace 0.1.1 I, [2024-05-14T21:48:29.464087 #2511758] INFO -- : rinda 0.2.0 I, [2024-05-14T21:48:29.467522 #2511758] INFO -- : drb 2.2.1 I, [2024-05-14T21:48:29.473202 #2511758] INFO -- : nkf 0.2.0 I, [2024-05-14T21:48:29.479614 #2511758] INFO -- : syslog 0.1.2 I, [2024-05-14T21:48:29.484474 #2511758] INFO -- : csv 3.3.0 I, [2024-05-14T21:48:29.493123 #2511758] INFO -- : installing bundled gem cache: /home/opc/ruby/install/master/lib/ruby/gems/3.4.0+0/cache I, [2024-05-14T21:48:29.495042 #2511758] INFO -- : skipped bundled gems: I, [2024-05-14T21:48:29.495058 #2511758] INFO -- : power_assert-2.0.4dev.gem not found in bundled_gems I, [2024-05-14T21:48:29.497896 #2511758] INFO -- : $$$[end] "make install -j3" exit with 0. I, [2024-05-14T21:48:29.498042 #2511758] INFO -- : $$$[beg] make yes-btest TESTOPTS='-q -j3' I, [2024-05-14T21:48:52.289681 #2511758] INFO -- : PASS all 1936 tests E, [2024-05-14T21:48:52.291336 #2511758] ERROR -- : I, [2024-05-14T21:48:52.291448 #2511758] INFO -- : $$$[end] "make yes-btest TESTOPTS='-q -j3'" exit with 0. I, [2024-05-14T21:48:52.291609 #2511758] INFO -- : $$$[beg] make yes-test-basic TESTS='-j3' I, [2024-05-14T21:48:52.384481 #2511758] INFO -- : BASERUBY = /usr/local/bin/ruby --disable=gems I, [2024-05-14T21:48:52.384581 #2511758] INFO -- : CC = gcc I, [2024-05-14T21:48:52.384592 #2511758] INFO -- : LD = ld I, [2024-05-14T21:48:52.384601 #2511758] INFO -- : LDSHARED = gcc -shared I, [2024-05-14T21:48:52.384614 #2511758] INFO -- : CFLAGS = -O3 -fno-fast-math -ggdb3 -Wall -Wextra -Wdeprecated-declarations -Wdiv-by-zero -Wduplicated-cond -Wimplicit-function-declaration -Wimplicit-int -Wpointer-arith -Wwrite-strings -Wold-style-definition -Wimplicit-fallthrough=0 -Wmissing-noreturn -Wno-cast-function-type -Wno-constant-logical-operand -Wno-long-long -Wno-missing-field-initializers -Wno-overlength-strings -Wno-packed-bitfield-compat -Wno-parentheses-equality -Wno-self-assign -Wno-tautological-compare -Wno-unused-parameter -Wno-unused-value -Wsuggest-attribute=format -Wsuggest-attribute=noreturn -Wunused-variable -Wmisleading-indentation -Wundef I, [2024-05-14T21:48:52.384624 #2511758] INFO -- : XCFLAGS = -U_FORTIFY_SOURCE -D_FORTIFY_SOURCE=2 -fstack-protector-strong -msign-return-address=all -fno-strict-overflow -fvisibility=hidden -fexcess-precision=standard -DRUBY_EXPORT -fPIE -I. -I.ext/include/aarch64-linux -I/home/opc/ruby/src/master/include -I/home/opc/ruby/src/master -I/home/opc/ruby/src/master/prism -I/home/opc/ruby/src/master/enc/unicode/15.0.0 I, [2024-05-14T21:48:52.384633 #2511758] INFO -- : CPPFLAGS = I, [2024-05-14T21:48:52.384642 #2511758] INFO -- : DLDFLAGS = -Wl,--compress-debug-sections=zlib -fstack-protector-strong -pie I, [2024-05-14T21:48:52.384651 #2511758] INFO -- : SOLIBS = -lz -lrt -lrt -ldl -lcrypt -lm -lpthread I, [2024-05-14T21:48:52.384660 #2511758] INFO -- : LANG = en_US.UTF-8 I, [2024-05-14T21:48:52.384668 #2511758] INFO -- : LC_ALL = I, [2024-05-14T21:48:52.384676 #2511758] INFO -- : LC_CTYPE = I, [2024-05-14T21:48:52.384684 #2511758] INFO -- : MFLAGS = I, [2024-05-14T21:48:52.384692 #2511758] INFO -- : RUSTC = rustc I, [2024-05-14T21:48:52.384701 #2511758] INFO -- : YJIT_RUSTC_ARGS = --crate-name=yjit --crate-type=staticlib --edition=2021 -g -C lto=thin -C opt-level=3 -C overflow-checks=on '--out-dir=/home/opc/ruby/build/master/yjit/target/release/' /home/opc/ruby/src/master/yjit/src/lib.rs I, [2024-05-14T21:48:52.385461 #2511758] INFO -- : gcc (GCC) 8.5.0 20210514 (Red Hat 8.5.0-10.1.0.1) I, [2024-05-14T21:48:52.385501 #2511758] INFO -- : Copyright (C) 2018 Free Software Foundation, Inc. I, [2024-05-14T21:48:52.385512 #2511758] INFO -- : This is free software; see the source for copying conditions. There is NO I, [2024-05-14T21:48:52.385521 #2511758] INFO -- : warranty; not even for MERCHANTABILITY or FITNESS FOR A PARTICULAR PURPOSE. I, [2024-05-14T21:48:52.385530 #2511758] INFO -- : I, [2024-05-14T21:48:52.541889 #2511758] INFO -- : Checking leaked global symbols...none I, [2024-05-14T21:48:52.594264 #2511758] INFO -- : /home/opc/ruby/src/master/basictest/test.rb:assignment ....................................................................................................................................................................................................................................................................................................................................................................................OK 372 I, [2024-05-14T21:48:52.594340 #2511758] INFO -- : /home/opc/ruby/src/master/basictest/test.rb:condition ..OK 2 I, [2024-05-14T21:48:52.594355 #2511758] INFO -- : /home/opc/ruby/src/master/basictest/test.rb:if/unless ...OK 3 I, [2024-05-14T21:48:52.594408 #2511758] INFO -- : /home/opc/ruby/src/master/basictest/test.rb:case .....OK 5 I, [2024-05-14T21:48:52.594962 #2511758] INFO -- : /home/opc/ruby/src/master/basictest/test.rb:while/until ........OK 8 I, [2024-05-14T21:48:52.595083 #2511758] INFO -- : /home/opc/ruby/src/master/basictest/test.rb:exception ..........OK 10 I, [2024-05-14T21:48:52.595699 #2511758] INFO -- : /home/opc/ruby/src/master/basictest/test.rb:array .......................................OK 39 I, [2024-05-14T21:48:52.595953 #2511758] INFO -- : /home/opc/ruby/src/master/basictest/test.rb:hash ...........................OK 27 I, [2024-05-14T21:48:52.598036 #2511758] INFO -- : /home/opc/ruby/src/master/basictest/test.rb:iterator ...........................................................................................................OK 107 I, [2024-05-14T21:48:52.598749 #2511758] INFO -- : /home/opc/ruby/src/master/basictest/test.rb:float ................................................................................OK 80 I, [2024-05-14T21:48:52.602388 #2511758] INFO -- : /home/opc/ruby/src/master/basictest/test.rb:bignum ...............................OK 31 I, [2024-05-14T21:48:52.603941 #2511758] INFO -- : /home/opc/ruby/src/master/basictest/test.rb:string & char ..............................................................OK 62 I, [2024-05-14T21:48:52.604077 #2511758] INFO -- : /home/opc/ruby/src/master/basictest/test.rb:assignment ..........OK 10 I, [2024-05-14T21:48:52.604147 #2511758] INFO -- : /home/opc/ruby/src/master/basictest/test.rb:call ......OK 6 I, [2024-05-14T21:48:52.604263 #2511758] INFO -- : /home/opc/ruby/src/master/basictest/test.rb:proc .........OK 9 I, [2024-05-14T21:48:52.704556 #2511758] INFO -- : /home/opc/ruby/src/master/basictest/test.rb:signal ..OK 2 I, [2024-05-14T21:48:52.706016 #2511758] INFO -- : /home/opc/ruby/src/master/basictest/test.rb:eval ...........................OK 27 I, [2024-05-14T21:48:52.836242 #2511758] INFO -- : /home/opc/ruby/src/master/basictest/test.rb:system ........OK 8 I, [2024-05-14T21:48:52.836326 #2511758] INFO -- : /home/opc/ruby/src/master/basictest/test.rb:const .....OK 5 I, [2024-05-14T21:48:52.836426 #2511758] INFO -- : /home/opc/ruby/src/master/basictest/test.rb:clone .....OK 5 I, [2024-05-14T21:48:52.836631 #2511758] INFO -- : /home/opc/ruby/src/master/basictest/test.rb:marshal ....OK 4 I, [2024-05-14T21:48:52.836707 #2511758] INFO -- : /home/opc/ruby/src/master/basictest/test.rb:pack ....OK 4 I, [2024-05-14T21:48:52.836738 #2511758] INFO -- : /home/opc/ruby/src/master/basictest/test.rb:math ..OK 2 I, [2024-05-14T21:48:52.836828 #2511758] INFO -- : /home/opc/ruby/src/master/basictest/test.rb:struct ......OK 6 I, [2024-05-14T21:48:52.836998 #2511758] INFO -- : /home/opc/ruby/src/master/basictest/test.rb:variable ............OK 12 I, [2024-05-14T21:48:52.837040 #2511758] INFO -- : /home/opc/ruby/src/master/basictest/test.rb:trace ...OK 3 I, [2024-05-14T21:48:52.837242 #2511758] INFO -- : /home/opc/ruby/src/master/basictest/test.rb:defined? ............OK 12 I, [2024-05-14T21:48:52.837310 #2511758] INFO -- : /home/opc/ruby/src/master/basictest/test.rb:alias ......OK 6 I, [2024-05-14T21:48:52.837847 #2511758] INFO -- : /home/opc/ruby/src/master/basictest/test.rb:path .......................OK 23 I, [2024-05-14T21:48:52.905349 #2511758] INFO -- : /home/opc/ruby/src/master/basictest/test.rb:gc ....OK 4 I, [2024-05-14T21:48:52.907281 #2511758] INFO -- : I, [2024-05-14T21:48:52.907316 #2511758] INFO -- : test succeeded I, [2024-05-14T21:48:52.907890 #2511758] INFO -- : $$$[end] "make yes-test-basic TESTS='-j3'" exit with 0. I, [2024-05-14T21:48:52.908093 #2511758] INFO -- : $$$[beg] make yes-test-all TESTOPTS='--stderr-on-failure' TESTS='-j3' I, [2024-05-14T21:48:53.032918 #2511758] INFO -- : BASERUBY = /usr/local/bin/ruby --disable=gems I, [2024-05-14T21:48:53.032995 #2511758] INFO -- : CC = gcc I, [2024-05-14T21:48:53.033006 #2511758] INFO -- : LD = ld I, [2024-05-14T21:48:53.033015 #2511758] INFO -- : LDSHARED = gcc -shared I, [2024-05-14T21:48:53.033027 #2511758] INFO -- : CFLAGS = -O3 -fno-fast-math -ggdb3 -Wall -Wextra -Wdeprecated-declarations -Wdiv-by-zero -Wduplicated-cond -Wimplicit-function-declaration -Wimplicit-int -Wpointer-arith -Wwrite-strings -Wold-style-definition -Wimplicit-fallthrough=0 -Wmissing-noreturn -Wno-cast-function-type -Wno-constant-logical-operand -Wno-long-long -Wno-missing-field-initializers -Wno-overlength-strings -Wno-packed-bitfield-compat -Wno-parentheses-equality -Wno-self-assign -Wno-tautological-compare -Wno-unused-parameter -Wno-unused-value -Wsuggest-attribute=format -Wsuggest-attribute=noreturn -Wunused-variable -Wmisleading-indentation -Wundef I, [2024-05-14T21:48:53.033038 #2511758] INFO -- : XCFLAGS = -U_FORTIFY_SOURCE -D_FORTIFY_SOURCE=2 -fstack-protector-strong -msign-return-address=all -fno-strict-overflow -fvisibility=hidden -fexcess-precision=standard -DRUBY_EXPORT -fPIE -I. -I.ext/include/aarch64-linux -I/home/opc/ruby/src/master/include -I/home/opc/ruby/src/master -I/home/opc/ruby/src/master/prism -I/home/opc/ruby/src/master/enc/unicode/15.0.0 I, [2024-05-14T21:48:53.033047 #2511758] INFO -- : CPPFLAGS = I, [2024-05-14T21:48:53.033055 #2511758] INFO -- : DLDFLAGS = -Wl,--compress-debug-sections=zlib -fstack-protector-strong -pie I, [2024-05-14T21:48:53.033064 #2511758] INFO -- : SOLIBS = -lz -lrt -lrt -ldl -lcrypt -lm -lpthread I, [2024-05-14T21:48:53.033072 #2511758] INFO -- : LANG = en_US.UTF-8 I, [2024-05-14T21:48:53.033081 #2511758] INFO -- : LC_ALL = I, [2024-05-14T21:48:53.033116 #2511758] INFO -- : LC_CTYPE = I, [2024-05-14T21:48:53.033125 #2511758] INFO -- : MFLAGS = I, [2024-05-14T21:48:53.033134 #2511758] INFO -- : RUSTC = rustc I, [2024-05-14T21:48:53.033143 #2511758] INFO -- : YJIT_RUSTC_ARGS = --crate-name=yjit --crate-type=staticlib --edition=2021 -g -C lto=thin -C opt-level=3 -C overflow-checks=on '--out-dir=/home/opc/ruby/build/master/yjit/target/release/' /home/opc/ruby/src/master/yjit/src/lib.rs I, [2024-05-14T21:48:53.033832 #2511758] INFO -- : gcc (GCC) 8.5.0 20210514 (Red Hat 8.5.0-10.1.0.1) I, [2024-05-14T21:48:53.033848 #2511758] INFO -- : Copyright (C) 2018 Free Software Foundation, Inc. I, [2024-05-14T21:48:53.033858 #2511758] INFO -- : This is free software; see the source for copying conditions. There is NO I, [2024-05-14T21:48:53.033867 #2511758] INFO -- : warranty; not even for MERCHANTABILITY or FITNESS FOR A PARTICULAR PURPOSE. I, [2024-05-14T21:48:53.033875 #2511758] INFO -- : I, [2024-05-14T21:48:53.035863 #2511758] INFO -- : generating enc.mk I, [2024-05-14T21:48:53.272931 #2511758] INFO -- : generating encdb.h I, [2024-05-14T21:48:53.311143 #2511758] INFO -- : encdb.h unchanged I, [2024-05-14T21:48:53.312334 #2511758] INFO -- : making enc I, [2024-05-14T21:48:53.339484 #2511758] INFO -- : make[1]: Entering directory '/home/opc/ruby/build/master' I, [2024-05-14T21:48:53.339537 #2511758] INFO -- : make[1]: Nothing to be done for 'enc'. I, [2024-05-14T21:48:53.339548 #2511758] INFO -- : make[1]: Leaving directory '/home/opc/ruby/build/master' I, [2024-05-14T21:48:53.340293 #2511758] INFO -- : making srcs under enc I, [2024-05-14T21:48:53.381929 #2511758] INFO -- : make[1]: Entering directory '/home/opc/ruby/build/master' I, [2024-05-14T21:48:53.381974 #2511758] INFO -- : make[1]: Nothing to be done for 'srcs'. I, [2024-05-14T21:48:53.381984 #2511758] INFO -- : make[1]: Leaving directory '/home/opc/ruby/build/master' I, [2024-05-14T21:48:53.383065 #2511758] INFO -- : generating transdb.h I, [2024-05-14T21:48:53.526503 #2511758] INFO -- : transdb.h unchanged I, [2024-05-14T21:48:53.527903 #2511758] INFO -- : making trans I, [2024-05-14T21:48:53.576135 #2511758] INFO -- : make[1]: Entering directory '/home/opc/ruby/build/master' I, [2024-05-14T21:48:53.576204 #2511758] INFO -- : make[1]: Nothing to be done for 'trans'. I, [2024-05-14T21:48:53.576225 #2511758] INFO -- : make[1]: Leaving directory '/home/opc/ruby/build/master' I, [2024-05-14T21:48:53.576913 #2511758] INFO -- : making encs I, [2024-05-14T21:48:53.629112 #2511758] INFO -- : make[1]: Entering directory '/home/opc/ruby/build/master' I, [2024-05-14T21:48:53.629207 #2511758] INFO -- : make[1]: Nothing to be done for 'encs'. I, [2024-05-14T21:48:53.629222 #2511758] INFO -- : make[1]: Leaving directory '/home/opc/ruby/build/master' I, [2024-05-14T21:48:53.631116 #2511758] INFO -- : generating makefiles ext/configure-ext.mk I, [2024-05-14T21:48:53.670621 #2511758] INFO -- : ext/configure-ext.mk updated I, [2024-05-14T21:48:53.673857 #2511758] INFO -- : make[1]: Entering directory '/home/opc/ruby/build/master' I, [2024-05-14T21:48:55.711735 #2511758] INFO -- : make[1]: Leaving directory '/home/opc/ruby/build/master' I, [2024-05-14T21:48:55.712420 #2511758] INFO -- : generating makefile exts.mk I, [2024-05-14T21:48:55.771519 #2511758] INFO -- : exts.mk unchanged I, [2024-05-14T21:48:55.776427 #2511758] INFO -- : make[1]: Entering directory '/home/opc/ruby/build/master' I, [2024-05-14T21:48:56.071362 #2511758] INFO -- : make[2]: Entering directory '/home/opc/ruby/build/master/ext/coverage' I, [2024-05-14T21:48:56.076018 #2511758] INFO -- : make[2]: Leaving directory '/home/opc/ruby/build/master/ext/coverage' I, [2024-05-14T21:48:56.081586 #2511758] INFO -- : make[2]: Entering directory '/home/opc/ruby/build/master/ext/date' I, [2024-05-14T21:48:56.086695 #2511758] INFO -- : make[2]: Leaving directory '/home/opc/ruby/build/master/ext/date' I, [2024-05-14T21:48:56.090059 #2511758] INFO -- : make[2]: Entering directory '/home/opc/ruby/build/master/ext/digest' I, [2024-05-14T21:48:56.098797 #2511758] INFO -- : make[2]: Leaving directory '/home/opc/ruby/build/master/ext/digest' I, [2024-05-14T21:48:56.120926 #2511758] INFO -- : make[2]: Entering directory '/home/opc/ruby/build/master/ext/digest/sha2' I, [2024-05-14T21:48:56.125690 #2511758] INFO -- : make[2]: Leaving directory '/home/opc/ruby/build/master/ext/digest/sha2' I, [2024-05-14T21:48:56.143630 #2511758] INFO -- : make[2]: Entering directory '/home/opc/ruby/build/master/ext/fiddle' I, [2024-05-14T21:48:56.153569 #2511758] INFO -- : make[2]: Leaving directory '/home/opc/ruby/build/master/ext/fiddle' I, [2024-05-14T21:48:56.157823 #2511758] INFO -- : make[2]: Entering directory '/home/opc/ruby/build/master/ext/io/console' I, [2024-05-14T21:48:56.162039 #2511758] INFO -- : make[2]: Leaving directory '/home/opc/ruby/build/master/ext/io/console' I, [2024-05-14T21:48:56.172512 #2511758] INFO -- : make[2]: Entering directory '/home/opc/ruby/build/master/ext/json' I, [2024-05-14T21:48:56.181738 #2511758] INFO -- : make[2]: Leaving directory '/home/opc/ruby/build/master/ext/json' I, [2024-05-14T21:48:56.194467 #2511758] INFO -- : make[2]: Entering directory '/home/opc/ruby/build/master/ext/monitor' I, [2024-05-14T21:48:56.198454 #2511758] INFO -- : make[2]: Leaving directory '/home/opc/ruby/build/master/ext/monitor' I, [2024-05-14T21:48:56.204352 #2511758] INFO -- : make[2]: Entering directory '/home/opc/ruby/build/master/ext/objspace' I, [2024-05-14T21:48:56.210207 #2511758] INFO -- : make[2]: Leaving directory '/home/opc/ruby/build/master/ext/objspace' I, [2024-05-14T21:48:56.229035 #2511758] INFO -- : make[2]: Entering directory '/home/opc/ruby/build/master/ext/openssl' I, [2024-05-14T21:48:56.250405 #2511758] INFO -- : make[2]: Leaving directory '/home/opc/ruby/build/master/ext/openssl' I, [2024-05-14T21:48:56.254543 #2511758] INFO -- : make[2]: Entering directory '/home/opc/ruby/build/master/ext/pathname' I, [2024-05-14T21:48:56.258730 #2511758] INFO -- : make[2]: Leaving directory '/home/opc/ruby/build/master/ext/pathname' I, [2024-05-14T21:48:56.265090 #2511758] INFO -- : make[2]: Entering directory '/home/opc/ruby/build/master/ext/psych' I, [2024-05-14T21:48:56.288075 #2511758] INFO -- : make[2]: Leaving directory '/home/opc/ruby/build/master/ext/psych' I, [2024-05-14T21:48:56.292451 #2511758] INFO -- : make[2]: Entering directory '/home/opc/ruby/build/master/ext/pty' I, [2024-05-14T21:48:56.296860 #2511758] INFO -- : make[2]: Leaving directory '/home/opc/ruby/build/master/ext/pty' I, [2024-05-14T21:48:56.310027 #2511758] INFO -- : make[2]: Entering directory '/home/opc/ruby/build/master/ext/ripper' I, [2024-05-14T21:48:56.317672 #2511758] INFO -- : make[2]: Leaving directory '/home/opc/ruby/build/master/ext/ripper' I, [2024-05-14T21:48:56.319531 #2511758] INFO -- : make[2]: Entering directory '/home/opc/ruby/build/master/ext/rubyvm' I, [2024-05-14T21:48:56.322963 #2511758] INFO -- : make[2]: Leaving directory '/home/opc/ruby/build/master/ext/rubyvm' I, [2024-05-14T21:48:56.334829 #2511758] INFO -- : make[2]: Entering directory '/home/opc/ruby/build/master/ext/socket' I, [2024-05-14T21:48:56.345409 #2511758] INFO -- : make[2]: Leaving directory '/home/opc/ruby/build/master/ext/socket' I, [2024-05-14T21:48:56.360593 #2511758] INFO -- : make[2]: Entering directory '/home/opc/ruby/build/master/.bundle/gems/bigdecimal-3.1.7/ext/bigdecimal' I, [2024-05-14T21:48:56.390731 #2511758] INFO -- : make[2]: Leaving directory '/home/opc/ruby/build/master/.bundle/gems/bigdecimal-3.1.7/ext/bigdecimal' I, [2024-05-14T21:48:56.393314 #2511758] INFO -- : make[2]: Entering directory '/home/opc/ruby/build/master/.bundle/gems/bigdecimal-3.1.8/ext/bigdecimal' I, [2024-05-14T21:48:56.423688 #2511758] INFO -- : make[2]: Leaving directory '/home/opc/ruby/build/master/.bundle/gems/bigdecimal-3.1.8/ext/bigdecimal' I, [2024-05-14T21:48:56.426173 #2511758] INFO -- : make[2]: Entering directory '/home/opc/ruby/build/master/.bundle/gems/debug-1.9.2/ext/debug' I, [2024-05-14T21:48:56.455738 #2511758] INFO -- : make[2]: Leaving directory '/home/opc/ruby/build/master/.bundle/gems/debug-1.9.2/ext/debug' I, [2024-05-14T21:48:56.458260 #2511758] INFO -- : make[2]: Entering directory '/home/opc/ruby/build/master/.bundle/gems/nkf-0.2.0/ext/nkf' I, [2024-05-14T21:48:56.488065 #2511758] INFO -- : make[2]: Leaving directory '/home/opc/ruby/build/master/.bundle/gems/nkf-0.2.0/ext/nkf' I, [2024-05-14T21:48:56.490554 #2511758] INFO -- : make[2]: Entering directory '/home/opc/ruby/build/master/.bundle/gems/racc-1.7.3/ext/racc/cparse' I, [2024-05-14T21:48:56.520507 #2511758] INFO -- : make[2]: Leaving directory '/home/opc/ruby/build/master/.bundle/gems/racc-1.7.3/ext/racc/cparse' I, [2024-05-14T21:48:56.523398 #2511758] INFO -- : make[2]: Entering directory '/home/opc/ruby/build/master/.bundle/gems/rbs-3.4.4/ext/rbs_extension' I, [2024-05-14T21:48:56.553717 #2511758] INFO -- : make[2]: Leaving directory '/home/opc/ruby/build/master/.bundle/gems/rbs-3.4.4/ext/rbs_extension' I, [2024-05-14T21:48:56.556177 #2511758] INFO -- : make[2]: Entering directory '/home/opc/ruby/build/master/.bundle/gems/syslog-0.1.2/ext/syslog' I, [2024-05-14T21:48:56.586259 #2511758] INFO -- : make[2]: Leaving directory '/home/opc/ruby/build/master/.bundle/gems/syslog-0.1.2/ext/syslog' I, [2024-05-14T21:48:56.624248 #2511758] INFO -- : make[2]: Entering directory '/home/opc/ruby/build/master' I, [2024-05-14T21:48:56.707499 #2511758] INFO -- : make[2]: 'ruby' is up to date. I, [2024-05-14T21:48:56.707578 #2511758] INFO -- : make[2]: Leaving directory '/home/opc/ruby/build/master' I, [2024-05-14T21:48:56.707717 #2511758] INFO -- : make[1]: Leaving directory '/home/opc/ruby/build/master' I, [2024-05-14T21:48:56.712130 #2511758] INFO -- : make[1]: Entering directory '/home/opc/ruby/build/master' I, [2024-05-14T21:48:56.712187 #2511758] INFO -- : make[1]: Nothing to be done for 'note'. I, [2024-05-14T21:48:56.712198 #2511758] INFO -- : make[1]: Leaving directory '/home/opc/ruby/build/master' I, [2024-05-14T21:48:56.825655 #2511758] INFO -- : Run options: I, [2024-05-14T21:48:56.825729 #2511758] INFO -- : --seed=21213 I, [2024-05-14T21:48:56.825740 #2511758] INFO -- : "--ruby=./miniruby -I/home/opc/ruby/src/master/lib -I. -I.ext/common /home/opc/ruby/src/master/tool/runruby.rb --extout=.ext -- --disable-gems" I, [2024-05-14T21:48:56.825750 #2511758] INFO -- : --excludes-dir=/home/opc/ruby/src/master/test/.excludes I, [2024-05-14T21:48:56.825760 #2511758] INFO -- : --name=!/memory_leak/ I, [2024-05-14T21:48:56.825768 #2511758] INFO -- : --stderr-on-failure I, [2024-05-14T21:48:56.825776 #2511758] INFO -- : -j3 I, [2024-05-14T21:48:56.825784 #2511758] INFO -- : I, [2024-05-14T21:48:56.825792 #2511758] INFO -- : # Running tests: I, [2024-05-14T21:48:56.825801 #2511758] INFO -- : I, [2024-05-14T21:48:56.956130 #2511758] INFO -- : [ 1/885] 2552778=test_ostruct I, [2024-05-14T21:48:56.958966 #2511758] INFO -- : [ 2/885] 2552779=test_config I, [2024-05-14T21:48:56.970609 #2511758] INFO -- : [ 3/885] 2552777=test_change_word I, [2024-05-14T21:48:56.992802 #2511758] INFO -- : [ 4/885] 2552777=test_depth_first I, [2024-05-14T21:48:57.018198 #2511758] INFO -- : [ 5/885] 2552777=test_custom_command I, [2024-05-14T21:48:57.049905 #2511758] INFO -- : [ 6/885] 2552779=test_rdoc_parser_markdown I, [2024-05-14T21:48:57.125309 #2511758] INFO -- : [ 7/885] 2552777=test_c_struct_entry I, [2024-05-14T21:48:57.133331 #2511758] INFO -- : [ 8/885] 2552778=test_struct I, [2024-05-14T21:48:57.140604 #2511758] INFO -- : [ 9/885] 2552778=static_inspect_test I, [2024-05-14T21:48:57.201636 #2511758] INFO -- : [ 10/885] 2552779=test_cparser I, [2024-05-14T21:48:57.211618 #2511758] INFO -- : [ 11/885] 2552777=fuzzer_test I, [2024-05-14T21:48:57.215099 #2511758] INFO -- : [ 12/885] 2552778=test_rubyvm I, [2024-05-14T21:48:57.219365 #2511758] INFO -- : [ 13/885] 2552778=test_resize I, [2024-05-14T21:48:57.232535 #2511758] INFO -- : [ 14/885] 2552778=test_lock_native_thread I, [2024-05-14T21:48:57.280156 #2511758] INFO -- : [ 15/885] 2552777=test_gem_package_task I, [2024-05-14T21:48:57.461531 #2511758] INFO -- : [ 16/885] 2552777=test_fiber I, [2024-05-14T21:48:57.502605 #2511758] INFO -- : [ 17/885] 2552779=test_gem_commands_mirror I, [2024-05-14T21:48:57.630009 #2511758] INFO -- : [ 18/885] 2552778=test_engine I, [2024-05-14T21:48:57.630931 #2511758] INFO -- : [ 19/885] 2552779=test_win32ole_param I, [2024-05-14T21:48:57.639560 #2511758] INFO -- : [ 20/885] 2552779=test_key_error I, [2024-05-14T21:48:57.697129 #2511758] INFO -- : [ 21/885] 2552779=test_gem_validator I, [2024-05-14T21:48:57.717322 #2511758] INFO -- : [ 22/885] 2552779=test_gem_source_installed I, [2024-05-14T21:48:57.717508 #2511758] INFO -- : [ 23/885] 2552779=test_usrmarshal I, [2024-05-14T21:48:57.923945 #2511758] INFO -- : [ 24/885] 2552779=test_erb_command I, [2024-05-14T21:48:57.959081 #2511758] INFO -- : [ 25/885] 2552779=test_module I, [2024-05-14T21:48:58.096557 #2511758] INFO -- : [ 26/885] 2552778=test_gem_security_trust_dir I, [2024-05-14T21:48:58.371984 #2511758] INFO -- : [ 27/885] 2552778=test_ssl I, [2024-05-14T21:48:59.685851 #2511758] INFO -- : [ 28/885] 2552779=test_integer_comb I, [2024-05-14T21:49:01.978532 #2511758] INFO -- : [ 29/885] 2552779=test_bundled_ca I, [2024-05-14T21:49:03.568565 #2511758] INFO -- : [ 30/885] 2552777=test_load I, [2024-05-14T21:49:03.571605 #2511758] INFO -- : Leaked file descriptor: TestOptionParserLoad#test_load_xdg_config_home: 7 # I, [2024-05-14T21:49:03.596976 #2511758] INFO -- : COMMAND PID USER FD TYPE DEVICE SIZE/OFF NODE NAME I, [2024-05-14T21:49:03.597037 #2511758] INFO -- : ruby 2552777 opc 7r REG 252,0 9253600 13705411 /var/lib/sss/mc/passwd I, [2024-05-14T21:49:03.653884 #2511758] INFO -- : [ 31/885] 2552777=test_abi I, [2024-05-14T21:49:03.766737 #2511758] INFO -- : [ 32/885] 2552777=test_my_integer I, [2024-05-14T21:49:03.781435 #2511758] INFO -- : [ 33/885] 2552777=test_gem_resolver_composed_set I, [2024-05-14T21:49:03.804440 #2511758] INFO -- : [ 34/885] 2552777=test_debugger_integration I, [2024-05-14T21:49:03.811346 #2511758] INFO -- : [ 35/885] 2552777=test_objectspace I, [2024-05-14T21:49:04.148186 #2511758] INFO -- : [ 36/885] 2552779=test_require I, [2024-05-14T21:49:04.680466 #2511758] INFO -- : [ 37/885] 2552777=test_rdoc_markup_attribute_manager I, [2024-05-14T21:49:04.829303 #2511758] INFO -- : [ 38/885] 2552777=test_wss I, [2024-05-14T21:49:04.952639 #2511758] INFO -- : [ 39/885] 2552777=test_option I, [2024-05-14T21:49:04.956100 #2511758] INFO -- : [ 40/885] 2552777=test_not I, [2024-05-14T21:49:04.964315 #2511758] INFO -- : [ 41/885] 2552777=test_cgi_cookie I, [2024-05-14T21:49:04.974905 #2511758] INFO -- : [ 42/885] 2552777=test_tracer I, [2024-05-14T21:49:05.002535 #2511758] INFO -- : [ 43/885] 2552777=test_rdoc_generator_pot I, [2024-05-14T21:49:05.008234 #2511758] INFO -- : [ 44/885] 2552777=test_rdoc_markup_to_joined_paragraph I, [2024-05-14T21:49:05.015251 #2511758] INFO -- : [ 45/885] 2552777=test_rdoc_markup_to_markdown I, [2024-05-14T21:49:05.075150 #2511758] INFO -- : [ 46/885] 2552777=test_rdoc_rd I, [2024-05-14T21:49:05.087748 #2511758] INFO -- : [ 47/885] 2552777=test_x509store I, [2024-05-14T21:49:05.588890 #2511758] INFO -- : [ 48/885] 2552777=test_rdoc_rd_block_parser I, [2024-05-14T21:49:05.615371 #2511758] INFO -- : [ 49/885] 2552777=test_metaclass I, [2024-05-14T21:49:05.631587 #2511758] INFO -- : [ 50/885] 2552777=test_gem_gem_runner I, [2024-05-14T21:49:05.672655 #2511758] INFO -- : [ 51/885] 2552777=test_require_lib I, [2024-05-14T21:49:06.690311 #2511758] INFO -- : [ 52/885] 2552779=test_rdoc_rd_inline_parser I, [2024-05-14T21:49:06.716520 #2511758] INFO -- : [ 53/885] 2552779=test_win32ole_type I, [2024-05-14T21:49:06.719355 #2511758] INFO -- : [ 54/885] 2552779=test_load I, [2024-05-14T21:49:06.732738 #2511758] INFO -- : [ 55/885] 2552779=test_gem_source_lock I, [2024-05-14T21:49:06.780787 #2511758] INFO -- : [ 56/885] 2552779=test_new I, [2024-05-14T21:49:06.788574 #2511758] INFO -- : [ 57/885] 2552779=test_update I, [2024-05-14T21:49:06.801657 #2511758] INFO -- : [ 58/885] 2552779=test_cipher I, [2024-05-14T21:49:06.817499 #2511758] INFO -- : [ 59/885] 2552779=test_variable_name_check I, [2024-05-14T21:49:06.866069 #2511758] INFO -- : [ 60/885] 2552779=test_bn I, [2024-05-14T21:49:06.918019 #2511758] INFO -- : [ 61/885] 2552779=test_require_path_check I, [2024-05-14T21:49:06.951731 #2511758] INFO -- : [ 62/885] 2552779=test_rdoc_markup_paragraph I, [2024-05-14T21:49:06.952397 #2511758] INFO -- : [ 63/885] 2552779=test_x509cert I, [2024-05-14T21:49:07.065217 #2511758] INFO -- : [ 64/885] 2552779=test_irb I, [2024-05-14T21:49:07.366373 #2511758] INFO -- : [ 65/885] 2552779=test_ast I, [2024-05-14T21:49:08.602515 #2511758] INFO -- : [ 66/885] 2552777=test_logdevice I, [2024-05-14T21:49:08.817018 #2511758] INFO -- : [ 67/885] 2552778=test_object_create_start I, [2024-05-14T21:49:08.822011 #2511758] INFO -- : [ 68/885] 2552778=test_gem_commands_info_command I, [2024-05-14T21:49:08.868839 #2511758] INFO -- : [ 69/885] 2552778=test_https I, [2024-05-14T21:49:09.350475 #2511758] INFO -- : [ 70/885] 2552777=test_evaluation I, [2024-05-14T21:49:09.356672 #2511758] INFO -- : [ 71/885] 2552777=test_protocol I, [2024-05-14T21:49:09.407426 #2511758] INFO -- : [ 72/885] 2552778=test_files_test I, [2024-05-14T21:49:09.444078 #2511758] INFO -- : [ 73/885] 2552778=test_weakkeymap I, [2024-05-14T21:49:09.651880 #2511758] INFO -- : [ 74/885] 2552778=test_rdoc_markup_to_ansi I, [2024-05-14T21:49:09.666552 #2511758] INFO -- : [ 75/885] 2552777=test_name_error_extension I, [2024-05-14T21:49:09.676882 #2511758] INFO -- : [ 76/885] 2552777=test_gem_request_set_gem_dependency_api I, [2024-05-14T21:49:09.798335 #2511758] INFO -- : [ 77/885] 2552778=test_gem_security_policy I, [2024-05-14T21:49:09.977806 #2511758] INFO -- : [ 78/885] 2552777=test_rdoc_markup_document I, [2024-05-14T21:49:09.995866 #2511758] INFO -- : [ 79/885] 2552777=test_delete I, [2024-05-14T21:49:10.003684 #2511758] INFO -- : [ 80/885] 2552777=parse_stream_test I, [2024-05-14T21:49:10.004978 #2511758] INFO -- : [ 81/885] 2552777=test_handle I, [2024-05-14T21:49:10.172494 #2511758] INFO -- : [ 82/885] 2552778=test_completion I, [2024-05-14T21:49:10.334814 #2511758] INFO -- : [ 83/885] 2552777=test_file_exhaustive I, [2024-05-14T21:49:10.870155 #2511758] INFO -- : [ 84/885] 2552778=test_continuation I, [2024-05-14T21:49:10.881377 #2511758] INFO -- : [ 85/885] 2552778=test_fixnum I, [2024-05-14T21:49:10.886762 #2511758] INFO -- : [ 86/885] 2552778=test_signal I, [2024-05-14T21:49:10.957146 #2511758] INFO -- : Leaked file descriptor: TestFileExhaustive#test_expand_path_home_dir_string: 8 # I, [2024-05-14T21:49:10.993447 #2511758] INFO -- : COMMAND PID USER FD TYPE DEVICE SIZE/OFF NODE NAME I, [2024-05-14T21:49:10.993520 #2511758] INFO -- : ruby 2552777 opc 8u unix 0x0000000000000000 0t0 2983981627 type=STREAM I, [2024-05-14T21:49:12.874973 #2511758] INFO -- : [ 87/885] 2552778=test_gem_silent_ui I, [2024-05-14T21:49:12.916065 #2511758] INFO -- : [ 88/885] 2552778=test_gem_ci_detector I, [2024-05-14T21:49:12.916255 #2511758] INFO -- : Environment variable changed: TestCiDetector#test_ci? : "GEM_PRIVATE_KEY_PASSPHRASE" added I, [2024-05-14T21:49:12.916278 #2511758] INFO -- : Environment variable changed: TestCiDetector#test_ci? : "GEM_SPEC_CACHE" added I, [2024-05-14T21:49:12.938027 #2511758] INFO -- : Environment variable changed: TestCiDetector#test_ci? : "HOME" changed : "/home/opc" -> "/tmp/rubytest.7ahg6r/test_rubygems_20240514-2552778-ybh5ah/userhome" I, [2024-05-14T21:49:12.938092 #2511758] INFO -- : Environment variable changed: TestCiDetector#test_ci? : "RUBYGEMS_PREVENT_UPDATE_SUGGESTION" added I, [2024-05-14T21:49:12.943446 #2511758] INFO -- : Environment variable changed: TestCiDetector#test_ci_strings : "GEM_SPEC_CACHE" changed : "/tmp/rubytest.7ahg6r/test_rubygems_20240514-2552778-ybh5ah/spec_cache" -> "/tmp/rubytest.7ahg6r/test_rubygems_20240514-2552778-82knip/spec_cache" I, [2024-05-14T21:49:12.962575 #2511758] INFO -- : Environment variable changed: TestCiDetector#test_ci_strings : "HOME" changed : "/tmp/rubytest.7ahg6r/test_rubygems_20240514-2552778-ybh5ah/userhome" -> "/tmp/rubytest.7ahg6r/test_rubygems_20240514-2552778-82knip/userhome" I, [2024-05-14T21:49:12.967420 #2511758] INFO -- : [ 89/885] 2552778=test_io_wait_uncommon I, [2024-05-14T21:49:12.977217 #2511758] INFO -- : [ 90/885] 2552778=test_gem_package_tar_header I, [2024-05-14T21:49:13.020964 #2511758] INFO -- : [ 91/885] 2552778=test_ssl_session I, [2024-05-14T21:49:13.913556 #2511758] INFO -- : [ 92/885] 2552778=test_placearg I, [2024-05-14T21:49:14.023731 #2511758] INFO -- : [ 93/885] 2552778=test_logperiod I, [2024-05-14T21:49:14.098579 #2511758] INFO -- : [ 94/885] 2552778=test_case_comprehensive I, [2024-05-14T21:49:16.648538 #2511758] INFO -- : [ 95/885] 2552777=test_rational2 I, [2024-05-14T21:49:16.659196 #2511758] INFO -- : [ 96/885] 2552777=test_type I, [2024-05-14T21:49:16.671462 #2511758] INFO -- : [ 97/885] 2552777=heredoc_dedent_test I, [2024-05-14T21:49:16.731230 #2511758] INFO -- : [ 98/885] 2552777=test_mutex I, [2024-05-14T21:49:17.811648 #2511758] INFO -- : [ 99/885] 2552777=test_rdoc_token_stream I, [2024-05-14T21:49:17.821679 #2511758] INFO -- : [100/885] 2552777=test_struct I, [2024-05-14T21:49:18.382152 #2511758] INFO -- : [101/885] 2552777=test_tmpdir I, [2024-05-14T21:49:18.466072 #2511758] INFO -- : [102/885] 2552777=test_acceptable I, [2024-05-14T21:49:18.588601 #2511758] INFO -- : [103/885] 2552777=test_rdoc_single_class I, [2024-05-14T21:49:18.595509 #2511758] INFO -- : [104/885] 2552777=test_dup I, [2024-05-14T21:49:18.744987 #2511758] INFO -- : [105/885] 2552777=test_gem_local_remote_options I, [2024-05-14T21:49:18.804803 #2511758] INFO -- : [106/885] 2552777=test_gem_ext_cargo_builder_link_flag_converter I, [2024-05-14T21:49:18.858637 #2511758] INFO -- : [107/885] 2552777=test_ractor I, [2024-05-14T21:49:18.928648 #2511758] INFO -- : [108/885] 2552777=test_httpheader I, [2024-05-14T21:49:18.971009 #2511758] INFO -- : [109/885] 2552777=test_sexp I, [2024-05-14T21:49:18.989140 #2511758] INFO -- : [110/885] 2552777=test_rdoc_ri_driver I, [2024-05-14T21:49:19.427900 #2511758] INFO -- : [111/885] 2552777=test_gem_safe_marshal I, [2024-05-14T21:49:20.096801 #2511758] INFO -- : [112/885] 2552777=test_digest I, [2024-05-14T21:49:20.847848 #2511758] INFO -- : [113/885] 2552777=test_signedness I, [2024-05-14T21:49:22.882355 #2511758] INFO -- : [114/885] 2552777=test_gem_commands_check_command I, [2024-05-14T21:49:22.921344 #2511758] INFO -- : [115/885] 2552777=test_gem_resolver_git_set I, [2024-05-14T21:49:23.713662 #2511758] INFO -- : [116/885] 2552777=test_stringscanner I, [2024-05-14T21:49:23.756708 #2511758] INFO -- : [117/885] 2552777=test_gem_resolver_installed_specification I, [2024-05-14T21:49:23.790989 #2511758] INFO -- : [118/885] 2552777=test_exception_at_throwing I, [2024-05-14T21:49:23.853514 #2511758] INFO -- : [119/885] 2552777=test_ractor I, [2024-05-14T21:49:23.964539 #2511758] INFO -- : [120/885] 2552777=test_date_arith I, [2024-05-14T21:49:23.972019 #2511758] INFO -- : [121/885] 2552777=test_gem_resolver_vendor_specification I, [2024-05-14T21:49:24.007241 #2511758] INFO -- : [122/885] 2552777=json_generic_object_test I, [2024-05-14T21:49:24.067372 #2511758] INFO -- : [123/885] 2552777=test_fiddle I, [2024-05-14T21:49:24.132223 #2511758] INFO -- : [124/885] 2552777=test_at_exit I, [2024-05-14T21:49:24.143191 #2511758] INFO -- : [125/885] 2552777=test_benchmark I, [2024-05-14T21:49:25.512043 #2511758] INFO -- : [126/885] 2552777=test_class I, [2024-05-14T21:49:25.572138 #2511758] INFO -- : [127/885] 2552777=test_have_macro I, [2024-05-14T21:49:25.793448 #2511758] INFO -- : [128/885] 2552777=test_gem_source I, [2024-05-14T21:49:26.136617 #2511758] INFO -- : [129/885] 2552777=test_mkmf I, [2024-05-14T21:49:26.206850 #2511758] INFO -- : [130/885] 2552777=test_autoload I, [2024-05-14T21:49:30.415839 #2511758] INFO -- : [131/885] 2552777=test_array I, [2024-05-14T21:49:33.326288 #2511758] INFO -- : [132/885] 2552778=test_gem_package I, [2024-05-14T21:49:34.056735 #2511758] INFO -- : [133/885] 2552778=test_unicode I, [2024-05-14T21:49:34.069258 #2511758] INFO -- : [134/885] 2552778=test_eval_history I, [2024-05-14T21:49:34.085955 #2511758] INFO -- : [135/885] 2552778=dispatcher_test I, [2024-05-14T21:49:34.090475 #2511758] INFO -- : [136/885] 2552778=test_ripper I, [2024-05-14T21:49:34.412303 #2511758] INFO -- : [137/885] 2552778=test_lexer I, [2024-05-14T21:49:34.425482 #2511758] INFO -- : [138/885] 2552778=test_win32ole_method I, [2024-05-14T21:49:34.454272 #2511758] INFO -- : [139/885] 2552778=test_regex_casefold I, [2024-05-14T21:49:34.922223 #2511758] INFO -- : [140/885] 2552778=test_gem_source_git I, [2024-05-14T21:49:35.889317 #2511758] INFO -- : [141/885] 2552778=test_random I, [2024-05-14T21:49:35.900301 #2511758] INFO -- : [142/885] 2552778=test_thread_cv I, [2024-05-14T21:49:36.548227 #2511758] INFO -- : [143/885] 2552778=test_stringio I, [2024-05-14T21:49:36.640031 #2511758] INFO -- : [144/885] 2552778=test_assembler I, [2024-05-14T21:49:36.643952 #2511758] INFO -- : [145/885] 2552778=test_files_ext I, [2024-05-14T21:49:36.656293 #2511758] INFO -- : [146/885] 2552778=test_iseq I, [2024-05-14T21:49:37.242322 #2511758] INFO -- : [147/885] 2552778=test_rdoc_ri_paths I, [2024-05-14T21:49:37.312967 #2511758] INFO -- : [148/885] 2552778=test_parser I, [2024-05-14T21:49:37.337611 #2511758] INFO -- : [149/885] 2552778=test_primitive I, [2024-05-14T21:49:37.347669 #2511758] INFO -- : [150/885] 2552778=test_gem_package_tar_reader I, [2024-05-14T21:49:37.396109 #2511758] INFO -- : [151/885] 2552778=test_gem_commands_signout_command I, [2024-05-14T21:49:37.472007 #2511758] INFO -- : [152/885] 2552778=test_env I, [2024-05-14T21:49:37.665313 #2511758] INFO -- : [153/885] 2552777=test_win32ole_variant_m I, [2024-05-14T21:49:37.683474 #2511758] INFO -- : [154/885] 2552777=test_pair I, [2024-05-14T21:49:39.877635 #2511758] INFO -- : [155/885] 2552778=command_line_test I, [2024-05-14T21:49:39.884347 #2511758] INFO -- : [156/885] 2552778=test_singleton_function I, [2024-05-14T21:49:39.911641 #2511758] INFO -- : [157/885] 2552778=test_gem_commands_setup_command I, [2024-05-14T21:49:40.670080 #2511758] INFO -- : [158/885] 2552778=test_history I, [2024-05-14T21:49:40.701036 #2511758] INFO -- : [159/885] 2552778=test_document I, [2024-05-14T21:49:40.705496 #2511758] INFO -- : [160/885] 2552778=test_eval I, [2024-05-14T21:49:40.708938 #2511758] INFO -- : [161/885] 2552778=test_gem_safe_yaml I, [2024-05-14T21:49:40.719612 #2511758] INFO -- : [162/885] 2552778=test_ftp I, [2024-05-14T21:49:40.722488 #2511758] INFO -- : [163/885] 2552778=test_sockopt I, [2024-05-14T21:49:40.732286 #2511758] INFO -- : [164/885] 2552778=test_rdoc_comment I, [2024-05-14T21:49:40.910406 #2511758] INFO -- : [165/885] 2552778=test_install I, [2024-05-14T21:49:40.980803 #2511758] INFO -- : [166/885] 2552778=test_encoding I, [2024-05-14T21:49:40.996645 #2511758] INFO -- : [167/885] 2552778=test_gem_source_fetch_problem I, [2024-05-14T21:49:41.008074 #2511758] INFO -- : [168/885] 2552778=test_gem_request_set_lockfile_tokenizer I, [2024-05-14T21:49:41.078274 #2511758] INFO -- : [169/885] 2552778=test_lazy_enumerator I, [2024-05-14T21:49:41.530396 #2511758] INFO -- : [170/885] 2552778=test_cgi_multipart I, [2024-05-14T21:49:41.630827 #2511758] INFO -- : [171/885] 2552778=test_find_executable I, [2024-05-14T21:49:41.637051 #2511758] INFO -- : [172/885] 2552778=test_autoconf I, [2024-05-14T21:49:41.641586 #2511758] INFO -- : [173/885] 2552778=integer_parse_test I, [2024-05-14T21:49:41.643370 #2511758] INFO -- : [174/885] 2552778=test_ractor_compatibility I, [2024-05-14T21:49:41.990968 #2511758] INFO -- : [175/885] 2552778=test_arithmetic_sequence I, [2024-05-14T21:49:42.008158 #2511758] INFO -- : [176/885] 2552778=test_rdoc_parser I, [2024-05-14T21:49:42.054169 #2511758] INFO -- : [177/885] 2552778=test_https_proxy I, [2024-05-14T21:49:42.058296 #2511758] INFO -- : [178/885] 2552778=test_win32ole_param_event I, [2024-05-14T21:49:42.064056 #2511758] INFO -- : [179/885] 2552778=test_stat I, [2024-05-14T21:49:42.092929 #2511758] INFO -- : [180/885] 2552778=test_etc I, [2024-05-14T21:49:42.101285 #2511758] INFO -- : Leaked file descriptor: TestEtc#test_getgrgid: 10 # I, [2024-05-14T21:49:42.136742 #2511758] INFO -- : COMMAND PID USER FD TYPE DEVICE SIZE/OFF NODE NAME I, [2024-05-14T21:49:42.136833 #2511758] INFO -- : ruby 2552778 opc 10u unix 0x0000000000000000 0t0 2983984631 type=STREAM I, [2024-05-14T21:49:42.183342 #2511758] INFO -- : Leaked file descriptor: TestEtc#test_getpwuid: 11 # I, [2024-05-14T21:49:42.209090 #2511758] INFO -- : COMMAND PID USER FD TYPE DEVICE SIZE/OFF NODE NAME I, [2024-05-14T21:49:42.209160 #2511758] INFO -- : ruby 2552778 opc 11r REG 252,0 9253600 13705411 /var/lib/sss/mc/passwd I, [2024-05-14T21:49:42.316697 #2511758] INFO -- : [181/885] 2552778=test_gem_commands_rebuild_command I, [2024-05-14T21:49:42.370157 #2511758] INFO -- : [182/885] 2552778=test_nomethod_error I, [2024-05-14T21:49:42.379040 #2511758] INFO -- : [183/885] 2552778=test_workspace I, [2024-05-14T21:49:42.488317 #2511758] INFO -- : [184/885] 2552778=test_printf I, [2024-05-14T21:49:42.508958 #2511758] INFO -- : [185/885] 2552778=test_x509attr I, [2024-05-14T21:49:42.514274 #2511758] INFO -- : [186/885] 2552778=test_cgi_modruby I, [2024-05-14T21:49:42.520150 #2511758] INFO -- : [187/885] 2552778=magic_comment_test I, [2024-05-14T21:49:42.523174 #2511758] INFO -- : [188/885] 2552778=test_win32ole_variant I, [2024-05-14T21:49:42.533369 #2511758] INFO -- : [189/885] 2552778=test_io I, [2024-05-14T21:49:42.977337 #2511758] INFO -- : [190/885] 2552777=test_uncorrectable_name_check I, [2024-05-14T21:49:42.980315 #2511758] INFO -- : [191/885] 2552777=test_rubygems I, [2024-05-14T21:49:43.140008 #2511758] INFO -- : [192/885] 2552777=test_resolve_symbol I, [2024-05-14T21:49:43.226568 #2511758] INFO -- : [193/885] 2552777=test_closure I, [2024-05-14T21:49:45.368082 #2511758] INFO -- : [194/885] 2552777=test_files_test_1 I, [2024-05-14T21:49:47.840455 #2511758] INFO -- : [195/885] 2552777=test_dir I, [2024-05-14T21:49:48.131816 #2511758] INFO -- : [196/885] 2552777=test_rdoc_rd_inline I, [2024-05-14T21:49:48.137583 #2511758] INFO -- : [197/885] 2552777=test_digest I, [2024-05-14T21:49:48.143872 #2511758] INFO -- : [198/885] 2552777=test_path I, [2024-05-14T21:49:48.160556 #2511758] INFO -- : [199/885] 2552777=test_reline_key I, [2024-05-14T21:49:48.161751 #2511758] INFO -- : [200/885] 2552777=test_gem_commands_lock_command I, [2024-05-14T21:49:48.205332 #2511758] INFO -- : [201/885] 2552777=test_gb18030 I, [2024-05-14T21:49:48.211325 #2511758] INFO -- : [202/885] 2552777=test_propertyputref I, [2024-05-14T21:49:48.215585 #2511758] INFO -- : [203/885] 2552777=test_rdoc_generator_ri I, [2024-05-14T21:49:48.226311 #2511758] INFO -- : [204/885] 2552777=test_gem_stream_ui I, [2024-05-14T21:49:48.322269 #2511758] INFO -- : [205/885] 2552777=test_unicode_normalize I, [2024-05-14T21:49:49.829787 #2511758] INFO -- : [206/885] 2552779=test_float I, [2024-05-14T21:49:51.424343 #2511758] INFO -- : [207/885] 2552779=test_gem_stub_specification I, [2024-05-14T21:49:51.567118 #2511758] INFO -- : [208/885] 2552779=test_cmethod I, [2024-05-14T21:49:51.588196 #2511758] INFO -- : [209/885] 2552779=test_rdoc_top_level I, [2024-05-14T21:49:51.836862 #2511758] INFO -- : [210/885] 2552779=test_io_m17n I, [2024-05-14T21:49:51.863311 #2511758] INFO -- : [211/885] 2552778=test_color I, [2024-05-14T21:49:51.979816 #2511758] INFO -- : [212/885] 2552778=test_gem_ext_configure_builder I, [2024-05-14T21:49:52.012758 #2511758] INFO -- : [213/885] 2552778=json_ext_parser_test I, [2024-05-14T21:49:52.035761 #2511758] INFO -- : [214/885] 2552778=test_rdoc_parser_simple I, [2024-05-14T21:49:52.040445 #2511758] INFO -- : [215/885] 2552777=test_nonblock I, [2024-05-14T21:49:52.056634 #2511758] INFO -- : [216/885] 2552778=test_omap I, [2024-05-14T21:49:52.069560 #2511758] INFO -- : [217/885] 2552778=test_date_strptime I, [2024-05-14T21:49:52.093774 #2511758] INFO -- : [218/885] 2552777=test_ipaddr I, [2024-05-14T21:49:52.134778 #2511758] INFO -- : [219/885] 2552777=test_scanner_events I, [2024-05-14T21:49:52.172099 #2511758] INFO -- : [220/885] 2552777=test_ocsp I, [2024-05-14T21:49:52.189124 #2511758] INFO -- : [221/885] 2552778=test_shellwords I, [2024-05-14T21:49:52.194545 #2511758] INFO -- : [222/885] 2552778=test_mul I, [2024-05-14T21:49:52.209458 #2511758] INFO -- : [223/885] 2552778=test_rdoc_generator_pot_po I, [2024-05-14T21:49:52.226193 #2511758] INFO -- : [224/885] 2552778=test_x509crl I, [2024-05-14T21:49:52.295479 #2511758] INFO -- : [225/885] 2552777=test_c_union_entity I, [2024-05-14T21:49:52.330957 #2511758] INFO -- : [226/885] 2552778=test_notimplement I, [2024-05-14T21:49:52.332874 #2511758] INFO -- : [227/885] 2552778=test_cgi_session I, [2024-05-14T21:49:52.360594 #2511758] INFO -- : [228/885] 2552778=test_dns I, [2024-05-14T21:49:52.445352 #2511758] INFO -- : [229/885] 2552777=test_io_console I, [2024-05-14T21:49:52.562109 #2511758] INFO -- : Leaked file descriptor: TestIO_Console#test_setecho: 12 # I, [2024-05-14T21:49:52.585560 #2511758] INFO -- : COMMAND PID USER FD TYPE DEVICE SIZE/OFF NODE NAME I, [2024-05-14T21:49:52.585632 #2511758] INFO -- : ruby 2552777 opc 12r REG 252,0 6940392 13705429 /var/lib/sss/mc/group I, [2024-05-14T21:49:52.866828 #2511758] INFO -- : [230/885] 2552778=test_flip I, [2024-05-14T21:49:52.892754 #2511758] INFO -- : [231/885] 2552778=test_rdoc_markup_heading I, [2024-05-14T21:49:52.908041 #2511758] INFO -- : [232/885] 2552778=test_profile_frames I, [2024-05-14T21:49:53.067338 #2511758] INFO -- : [233/885] 2552778=test_pattern_key_name_check I, [2024-05-14T21:49:53.094789 #2511758] INFO -- : [234/885] 2552778=test_gem_commands_cleanup_command I, [2024-05-14T21:49:53.112479 #2511758] INFO -- : [235/885] 2552779=test_class2name I, [2024-05-14T21:49:53.130738 #2511758] INFO -- : [236/885] 2552779=test_refinement I, [2024-05-14T21:49:53.686438 #2511758] INFO -- : [237/885] 2552778=test_transcode I, [2024-05-14T21:49:53.854974 #2511758] INFO -- : [238/885] 2552778=test_debug I, [2024-05-14T21:49:53.874385 #2511758] INFO -- : [239/885] 2552778=test_thread_fd_close I, [2024-05-14T21:49:54.694724 #2511758] INFO -- : [240/885] 2552778=test_last_thread I, [2024-05-14T21:49:54.939922 #2511758] INFO -- : [241/885] 2552778=test_digest_extend I, [2024-05-14T21:49:54.969410 #2511758] INFO -- : [242/885] 2552778=test_gem_ext_cmake_builder I, [2024-05-14T21:49:54.976989 #2511758] INFO -- : [243/885] 2552778=test_alias I, [2024-05-14T21:49:55.188236 #2511758] INFO -- : [244/885] 2552778=test_fips I, [2024-05-14T21:49:55.217396 #2511758] INFO -- : [245/885] 2552777=test_emitter I, [2024-05-14T21:49:55.225081 #2511758] INFO -- : [246/885] 2552777=test_getopts I, [2024-05-14T21:49:55.225782 #2511758] INFO -- : [247/885] 2552777=test_helper I, [2024-05-14T21:49:55.239834 #2511758] INFO -- : [248/885] 2552777=test_compile_prism I, [2024-05-14T21:49:55.376706 #2511758] INFO -- : [249/885] 2552778=test_rdoc_markup_formatter I, [2024-05-14T21:49:55.421503 #2511758] INFO -- : [250/885] 2552778=test_gem_commands_uninstall_command I, [2024-05-14T21:49:55.548566 #2511758] INFO -- : [251/885] 2552777=test_win32ole_event I, [2024-05-14T21:49:55.554351 #2511758] INFO -- : [252/885] 2552777=errors_test I, [2024-05-14T21:49:55.691454 #2511758] INFO -- : [253/885] 2552777=test_convertible I, [2024-05-14T21:49:56.373164 #2511758] INFO -- : [254/885] 2552778=test_gem_available_set I, [2024-05-14T21:49:56.478285 #2511758] INFO -- : [255/885] 2552778=test_pkg_config I, [2024-05-14T21:49:56.483686 #2511758] INFO -- : [256/885] 2552778=test_modify_expand I, [2024-05-14T21:49:56.494393 #2511758] INFO -- : [257/885] 2552778=test_config I, [2024-05-14T21:49:56.562442 #2511758] INFO -- : [258/885] 2552778=test_func I, [2024-05-14T21:49:56.837867 #2511758] INFO -- : [259/885] 2552779=test_vm_dump I, [2024-05-14T21:49:56.853681 #2511758] INFO -- : [260/885] 2552779=json_encoding_test I, [2024-05-14T21:49:56.855760 #2511758] INFO -- : [261/885] 2552779=test_dln I, [2024-05-14T21:49:56.898254 #2511758] INFO -- : [262/885] 2552779=test_object I, [2024-05-14T21:49:57.233687 #2511758] INFO -- : [263/885] 2552779=test_gem_source_vendor I, [2024-05-14T21:49:57.250009 #2511758] INFO -- : [264/885] 2552779=test_gem_resolver I, [2024-05-14T21:49:58.356597 #2511758] INFO -- : [265/885] 2552779=test_super I, [2024-05-14T21:49:58.566234 #2511758] INFO -- : [266/885] 2552779=test_color_printer I, [2024-05-14T21:49:58.712993 #2511758] INFO -- : [267/885] 2552779=unescape_test I, [2024-05-14T21:49:59.250017 #2511758] INFO -- : [268/885] 2552777=test_gem_commands_exec_command I, [2024-05-14T21:50:00.216207 #2511758] INFO -- : [269/885] 2552779=test_rdoc_parser_ruby I, [2024-05-14T21:50:00.741939 #2511758] INFO -- : [270/885] 2552777=test_httpresponse I, [2024-05-14T21:50:00.780291 #2511758] INFO -- : [271/885] 2552777=test_readpartial I, [2024-05-14T21:50:01.132159 #2511758] INFO -- : [272/885] 2552779=test_x509req I, [2024-05-14T21:50:01.188709 #2511758] INFO -- : [273/885] 2552779=test_allocation I, [2024-05-14T21:50:01.196049 #2511758] INFO -- : [274/885] 2552777=test_ifunless I, [2024-05-14T21:50:01.216412 #2511758] INFO -- : [275/885] 2552777=test_gem_console_ui I, [2024-05-14T21:50:01.230238 #2511758] INFO -- : [276/885] 2552777=test_insns_leaf I, [2024-05-14T21:50:01.238613 #2511758] INFO -- : [277/885] 2552777=test_object I, [2024-05-14T21:50:01.245836 #2511758] INFO -- : [278/885] 2552777=test_member I, [2024-05-14T21:50:01.255735 #2511758] INFO -- : [279/885] 2552777=test_kill_ring I, [2024-05-14T21:50:01.265359 #2511758] INFO -- : [280/885] 2552777=test_mailto I, [2024-05-14T21:50:01.279527 #2511758] INFO -- : [281/885] 2552777=test_addr I, [2024-05-14T21:50:01.287339 #2511758] INFO -- : [282/885] 2552777=test_case_options I, [2024-05-14T21:50:01.296626 #2511758] INFO -- : [283/885] 2552777=test_cgi_header I, [2024-05-14T21:50:01.303383 #2511758] INFO -- : [284/885] 2552777=format_errors_test I, [2024-05-14T21:50:01.316172 #2511758] INFO -- : [285/885] 2552777=test_gem_resolver_api_set I, [2024-05-14T21:50:01.393774 #2511758] INFO -- : [286/885] 2552777=test_duplicate I, [2024-05-14T21:50:01.394865 #2511758] INFO -- : [287/885] 2552777=test_helper I, [2024-05-14T21:50:01.453752 #2511758] INFO -- : [288/885] 2552777=test_ossl I, [2024-05-14T21:50:02.151356 #2511758] INFO -- : [289/885] 2552778=test_buffered_io I, [2024-05-14T21:50:02.169308 #2511758] INFO -- : [290/885] 2552778=test_bug_reporter I, [2024-05-14T21:50:02.347964 #2511758] INFO -- : [291/885] 2552778=test_gem_installer I, [2024-05-14T21:50:03.447294 #2511758] INFO -- : [292/885] 2552779=test_object_references I, [2024-05-14T21:50:03.474808 #2511758] INFO -- : [293/885] 2552779=test_gem_source_subpath_problem I, [2024-05-14T21:50:03.637722 #2511758] INFO -- : [294/885] 2552779=test_arith_seq_extract I, [2024-05-14T21:50:03.747744 #2511758] INFO -- : [295/885] 2552779=compiler_test I, [2024-05-14T21:50:03.756735 #2511758] INFO -- : [296/885] 2552779=test_ruby_lex I, [2024-05-14T21:50:03.882509 #2511758] INFO -- : [297/885] 2552779=test_monitor I, [2024-05-14T21:50:04.111929 #2511758] INFO -- : [298/885] 2552779=test_beginendblock I, [2024-05-14T21:50:04.439237 #2511758] INFO -- : [299/885] 2552779=test_eval I, [2024-05-14T21:50:04.685382 #2511758] INFO -- : [300/885] 2552779=test_within_pipe I, [2024-05-14T21:50:04.753402 #2511758] INFO -- : [301/885] 2552779=test_rdoc_normal_class I, [2024-05-14T21:50:04.830045 #2511758] INFO -- : [302/885] 2552779=test_pointer I, [2024-05-14T21:50:05.815719 #2511758] INFO -- : [303/885] 2552779=test_whileuntil I, [2024-05-14T21:50:05.838545 #2511758] INFO -- : [304/885] 2552779=test_regexp I, [2024-05-14T21:50:07.415857 #2511758] INFO -- : [305/885] 2552778=test_nofree I, [2024-05-14T21:50:07.421328 #2511758] INFO -- : [306/885] 2552778=test_rb_str_dup I, [2024-05-14T21:50:07.429488 #2511758] INFO -- : [307/885] 2552778=test_lambda I, [2024-05-14T21:50:07.502539 #2511758] INFO -- : [308/885] 2552778=test_scalar_scanner I, [2024-05-14T21:50:07.534892 #2511758] INFO -- : [309/885] 2552778=test_trace I, [2024-05-14T21:50:07.540539 #2511758] INFO -- : [310/885] 2552778=test_win32ole_type_event I, [2024-05-14T21:50:07.630240 #2511758] INFO -- : [311/885] 2552778=test_keyword I, [2024-05-14T21:50:08.204275 #2511758] INFO -- : [312/885] 2552778=test_gem_path_support I, [2024-05-14T21:50:08.243419 #2511758] INFO -- : [313/885] 2552778=test_arity I, [2024-05-14T21:50:08.262309 #2511758] INFO -- : [314/885] 2552778=test_gem_resolver_installer_set I, [2024-05-14T21:50:08.530702 #2511758] INFO -- : [315/885] 2552778=test_append I, [2024-05-14T21:50:08.536651 #2511758] INFO -- : [316/885] 2552778=test_foreach I, [2024-05-14T21:50:08.549754 #2511758] INFO -- : [317/885] 2552778=test_rdoc_markup_to_html I, [2024-05-14T21:50:08.662782 #2511758] INFO -- : [318/885] 2552778=test_emitter I, [2024-05-14T21:50:08.670507 #2511758] INFO -- : [319/885] 2552778=test_x509ext I, [2024-05-14T21:50:08.679212 #2511758] INFO -- : [320/885] 2552778=test_helper_method I, [2024-05-14T21:50:08.692143 #2511758] INFO -- : [321/885] 2552778=test_summary I, [2024-05-14T21:50:08.762062 #2511758] INFO -- : [322/885] 2552778=test_file I, [2024-05-14T21:50:09.332844 #2511758] INFO -- : [323/885] 2552777=test_config I, [2024-05-14T21:50:09.648267 #2511758] INFO -- : [324/885] 2552777=bom_test I, [2024-05-14T21:50:09.664240 #2511758] INFO -- : [325/885] 2552777=test_key_stroke I, [2024-05-14T21:50:09.673026 #2511758] INFO -- : [326/885] 2552777=test_rdoc_markup I, [2024-05-14T21:50:09.682166 #2511758] INFO -- : [327/885] 2552777=test_euc_jp I, [2024-05-14T21:50:09.737361 #2511758] INFO -- : [328/885] 2552777=test_ensured I, [2024-05-14T21:50:09.798584 #2511758] INFO -- : [329/885] 2552777=test_popen_deadlock I, [2024-05-14T21:50:10.306149 #2511758] INFO -- : [330/885] 2552777=test_time I, [2024-05-14T21:50:10.455762 #2511758] INFO -- : [331/885] 2552777=test_alias_and_anchor I, [2024-05-14T21:50:10.463585 #2511758] INFO -- : [332/885] 2552777=test_symbol I, [2024-05-14T21:50:10.519492 #2511758] INFO -- : [333/885] 2552777=test_project_sanity I, [2024-05-14T21:50:10.532745 #2511758] INFO -- : [334/885] 2552777=test_delegate I, [2024-05-14T21:50:10.608529 #2511758] INFO -- : [335/885] 2552777=test_chilled I, [2024-05-14T21:50:10.620162 #2511758] INFO -- : [336/885] 2552777=location_test I, [2024-05-14T21:50:10.675233 #2511758] INFO -- : [337/885] 2552777=test_pattern_matching I, [2024-05-14T21:50:10.704580 #2511758] INFO -- : [338/885] 2552777=test_folderitem2_invokeverb I, [2024-05-14T21:50:10.710702 #2511758] INFO -- : [339/885] 2552777=test_interned_str I, [2024-05-14T21:50:10.718541 #2511758] INFO -- : [340/885] 2552777=constant_path_node_test I, [2024-05-14T21:50:10.726063 #2511758] INFO -- : [341/885] 2552777=test_set_len I, [2024-05-14T21:50:10.738721 #2511758] INFO -- : [342/885] 2552777=test_gem_request_set I, [2024-05-14T21:50:11.219276 #2511758] INFO -- : [343/885] 2552777=test_gem_bundler_version_finder I, [2024-05-14T21:50:11.314470 #2511758] INFO -- : [344/885] 2552777=test_gc I, [2024-05-14T21:50:14.960096 #2511758] INFO -- : [345/885] 2552778=test_gem_resolver_index_set I, [2024-05-14T21:50:15.009372 #2511758] INFO -- : [346/885] 2552778=ruby_api_test I, [2024-05-14T21:50:15.192408 #2511758] INFO -- : [347/885] 2552778=test_webauthn_listener_response I, [2024-05-14T21:50:15.499891 #2511758] INFO -- : [348/885] 2552778=test_sleep I, [2024-05-14T21:50:20.232734 #2511758] INFO -- : [349/885] 2552778=test_time_tz I, [2024-05-14T21:50:20.287199 #2511758] INFO -- : [350/885] 2552778=test_to_ruby I, [2024-05-14T21:50:20.310455 #2511758] INFO -- : [351/885] 2552778=test_addrinfo I, [2024-05-14T21:50:20.420606 #2511758] INFO -- : [352/885] 2552778=test_bug-14834 I, [2024-05-14T21:50:20.428217 #2511758] INFO -- : [353/885] 2552778=test_data I, [2024-05-14T21:50:20.451102 #2511758] INFO -- : [354/885] 2552778=test_thread I, [2024-05-14T21:50:21.574911 #2511758] INFO -- : [355/885] 2552777=test_terminfo I, [2024-05-14T21:50:21.624610 #2511758] INFO -- : [356/885] 2552777=test_socket I, [2024-05-14T21:50:22.515978 #2511758] INFO -- : [357/885] 2552777=test_inlinecache I, [2024-05-14T21:50:22.572849 #2511758] INFO -- : [358/885] 2552777=test_reline I, [2024-05-14T21:50:22.825015 #2511758] INFO -- : [359/885] 2552777=test_gem_commands_build_command I, [2024-05-14T21:50:23.214845 #2511758] INFO -- : [360/885] 2552777=test_call I, [2024-05-14T21:50:23.341837 #2511758] INFO -- : [361/885] 2552777=test_ellipsize I, [2024-05-14T21:50:23.359030 #2511758] INFO -- : [362/885] 2552777=test_windows_1251 I, [2024-05-14T21:50:23.375868 #2511758] INFO -- : [363/885] 2552777=test_history I, [2024-05-14T21:50:23.420859 #2511758] INFO -- : [364/885] 2552777=test_to_ary_concat I, [2024-05-14T21:50:26.949068 #2511758] INFO -- : [365/885] 2552779=test_gem_ext_builder I, [2024-05-14T21:50:27.928927 #2511758] INFO -- : [366/885] 2552779=test_rdoc_markup_to_label I, [2024-05-14T21:50:27.967228 #2511758] INFO -- : [367/885] 2552779=test_parser I, [2024-05-14T21:50:27.992707 #2511758] INFO -- : [368/885] 2552779=test_cgi_core I, [2024-05-14T21:50:28.027684 #2511758] INFO -- : [369/885] 2552779=test_gem_resolver_best_set I, [2024-05-14T21:50:28.107758 #2511758] INFO -- : [370/885] 2552779=test_gem I, [2024-05-14T21:50:28.406987 #2511758] INFO -- : [371/885] 2552777=test_registry I, [2024-05-14T21:50:28.417248 #2511758] INFO -- : [372/885] 2552777=test_ractor I, [2024-05-14T21:50:28.434428 #2511758] INFO -- : [373/885] 2552777=test_ansi_without_terminfo I, [2024-05-14T21:50:28.446354 #2511758] INFO -- : [374/885] 2552777=json_generator_test I, [2024-05-14T21:50:28.543241 #2511758] INFO -- : [375/885] 2552777=test_ractor I, [2024-05-14T21:50:28.771864 #2511758] INFO -- : Leaked file descriptor: TestGem#test_self_clear_paths: 8 # I, [2024-05-14T21:50:28.795901 #2511758] INFO -- : COMMAND PID USER FD TYPE DEVICE SIZE/OFF NODE NAME I, [2024-05-14T21:50:28.795971 #2511758] INFO -- : ruby 2552779 opc 8r REG 252,0 9253600 13705411 /var/lib/sss/mc/passwd I, [2024-05-14T21:50:28.796159 #2511758] INFO -- : Environment variable changed: TestGem#test_self_clear_paths : "GEM_PRIVATE_KEY_PASSPHRASE" added I, [2024-05-14T21:50:28.796179 #2511758] INFO -- : Environment variable changed: TestGem#test_self_clear_paths : "GEM_SPEC_CACHE" added I, [2024-05-14T21:50:28.796188 #2511758] INFO -- : Environment variable changed: TestGem#test_self_clear_paths : "HOME" changed : "/home/opc" -> "/tmp/rubytest.7ahg6r/test_rubygems_20240514-2552779-96lebo/userhome" I, [2024-05-14T21:50:28.834222 #2511758] INFO -- : Environment variable changed: TestGem#test_self_clear_paths : "RUBYGEMS_PREVENT_UPDATE_SUGGESTION" added I, [2024-05-14T21:50:28.876277 #2511758] INFO -- : [376/885] 2552777=test_gem_resolver_conflict I, [2024-05-14T21:50:28.897889 #2511758] INFO -- : [377/885] 2552777=test_ssl I, [2024-05-14T21:50:29.119183 #2511758] INFO -- : [378/885] 2552777=test_scheduler I, [2024-05-14T21:50:29.303586 #2511758] INFO -- : [379/885] 2552777=test_gem_commands_help_command I, [2024-05-14T21:50:29.344713 #2511758] INFO -- : [380/885] 2552777=newline_test I, [2024-05-14T21:50:29.410648 #2511758] INFO -- : [381/885] 2552777=test_bignum I, [2024-05-14T21:50:29.537170 #2511758] INFO -- : [382/885] 2552778=test_enc_str_buf_cat I, [2024-05-14T21:50:29.543184 #2511758] INFO -- : [383/885] 2552778=test_nesting_parser I, [2024-05-14T21:50:29.612299 #2511758] INFO -- : [384/885] 2552778=ractor_test I, [2024-05-14T21:50:29.617568 #2511758] INFO -- : [385/885] 2552778=test_ancdata I, [2024-05-14T21:50:29.630972 #2511758] INFO -- : [386/885] 2552778=test_marshal I, [2024-05-14T21:50:30.363277 #2511758] INFO -- : [387/885] 2552779=test_rdoc_markup_hard_break I, [2024-05-14T21:50:30.372528 #2511758] INFO -- : [388/885] 2552779=test_formatter I, [2024-05-14T21:50:30.380931 #2511758] INFO -- : [389/885] 2552779=test_coder I, [2024-05-14T21:50:30.485289 #2511758] INFO -- : [390/885] 2552779=test_rdoc_servlet I, [2024-05-14T21:50:30.624017 #2511758] INFO -- : [391/885] 2552779=test_gem_commands_search_command I, [2024-05-14T21:50:30.677970 #2511758] INFO -- : [392/885] 2552779=test_symbol I, [2024-05-14T21:50:30.832718 #2511758] INFO -- : [393/885] 2552778=test_udp I, [2024-05-14T21:50:30.839483 #2511758] INFO -- : [394/885] 2552778=test_context I, [2024-05-14T21:50:30.947915 #2511758] INFO -- : [395/885] 2552778=test_gem_commands_contents_command I, [2024-05-14T21:50:31.058816 #2511758] INFO -- : [396/885] 2552778=test_integer I, [2024-05-14T21:50:33.047981 #2511758] INFO -- : [397/885] 2552777=test_unix I, [2024-05-14T21:50:33.098803 #2511758] INFO -- : [398/885] 2552777=test_date_marshal I, [2024-05-14T21:50:33.659338 #2511758] INFO -- : [399/885] 2552777=test_have_func I, [2024-05-14T21:50:33.702500 #2511758] INFO -- : [400/885] 2552778=test_gem_commands_list_command I, [2024-05-14T21:50:33.713007 #2511758] INFO -- : [401/885] 2552778=test_date_new I, [2024-05-14T21:50:33.810031 #2511758] INFO -- : [402/885] 2552778=test_configuration I, [2024-05-14T21:50:33.831963 #2511758] INFO -- : [403/885] 2552778=test_gem_resolver_local_specification I, [2024-05-14T21:50:33.852635 #2511758] INFO -- : [404/885] 2552778=test_rdoc_attr I, [2024-05-14T21:50:33.933510 #2511758] INFO -- : [405/885] 2552778=test_ractor I, [2024-05-14T21:50:33.948229 #2511758] INFO -- : [406/885] 2552778=test_trick I, [2024-05-14T21:50:34.386384 #2511758] INFO -- : [407/885] 2552777=test_stream I, [2024-05-14T21:50:34.399442 #2511758] INFO -- : [408/885] 2552777=test_address_resolve I, [2024-05-14T21:50:34.425860 #2511758] INFO -- : [409/885] 2552777=test_ts I, [2024-05-14T21:50:34.708684 #2511758] INFO -- : [410/885] 2552777=test_locale I, [2024-05-14T21:50:34.749967 #2511758] INFO -- : [411/885] 2552777=test_num2int I, [2024-05-14T21:50:34.783836 #2511758] INFO -- : [412/885] 2552779=test_rbconfig I, [2024-05-14T21:50:34.798522 #2511758] INFO -- : [413/885] 2552779=test_enum I, [2024-05-14T21:50:34.831517 #2511758] INFO -- : [414/885] 2552777=test_rdoc_markup_include I, [2024-05-14T21:50:34.851969 #2511758] INFO -- : [415/885] 2552777=test_require I, [2024-05-14T21:50:35.698182 #2511758] INFO -- : [416/885] 2552779=test_recursion I, [2024-05-14T21:50:35.719269 #2511758] INFO -- : [417/885] 2552779=test_gem_commands_signin_command I, [2024-05-14T21:50:35.912676 #2511758] INFO -- : [418/885] 2552779=test_range I, [2024-05-14T21:50:36.109993 #2511758] INFO -- : [419/885] 2552777=test_iter_break I, [2024-05-14T21:50:36.172531 #2511758] INFO -- : [420/885] 2552777=test_extlibs I, [2024-05-14T21:50:36.410726 #2511758] INFO -- : [421/885] 2552778=test_external_new I, [2024-05-14T21:50:36.452051 #2511758] INFO -- : [422/885] 2552778=test_pkey I, [2024-05-14T21:50:36.459071 #2511758] INFO -- : [423/885] 2552778=test_win32ole_typelib I, [2024-05-14T21:50:36.462728 #2511758] INFO -- : [424/885] 2552778=test_gem_platform I, [2024-05-14T21:50:36.573650 #2511758] INFO -- : [425/885] 2552778=test_gem_commands_query_command I, [2024-05-14T21:50:36.641717 #2511758] INFO -- : [426/885] 2552779=test_bigzero I, [2024-05-14T21:50:36.655530 #2511758] INFO -- : [427/885] 2552779=test_memory_view I, [2024-05-14T21:50:36.682409 #2511758] INFO -- : [428/885] 2552779=test_data I, [2024-05-14T21:50:36.683648 #2511758] INFO -- : [429/885] 2552779=test_ractor I, [2024-05-14T21:50:36.747476 #2511758] INFO -- : [430/885] 2552779=test_null I, [2024-05-14T21:50:36.750238 #2511758] INFO -- : [431/885] 2552779=test_m17n_comb I, [2024-05-14T21:50:37.233392 #2511758] INFO -- : [432/885] 2552778=test_pkey_dh I, [2024-05-14T21:50:37.738957 #2511758] INFO -- : [433/885] 2552777=test_multi_irb_commands I, [2024-05-14T21:50:37.753754 #2511758] INFO -- : [434/885] 2552777=test_input_method I, [2024-05-14T21:50:37.790508 #2511758] INFO -- : [435/885] 2552777=test_rdoc_i18n_text I, [2024-05-14T21:50:37.796873 #2511758] INFO -- : [436/885] 2552777=test_io I, [2024-05-14T21:50:38.075190 #2511758] INFO -- : [437/885] 2552777=test_literal I, [2024-05-14T21:50:38.542557 #2511758] INFO -- : [438/885] 2552778=test_gem_unsatisfiable_dependency_error I, [2024-05-14T21:50:38.564720 #2511758] INFO -- : [439/885] 2552778=test_gem_util I, [2024-05-14T21:50:38.575086 #2511758] INFO -- : [440/885] 2552777=test_complex2 I, [2024-05-14T21:50:38.617905 #2511758] INFO -- : [441/885] 2552777=test_config I, [2024-05-14T21:50:38.666915 #2511758] INFO -- : [442/885] 2552777=test_gem_security_signer I, [2024-05-14T21:50:38.713515 #2511758] INFO -- : [443/885] 2552778=test_thread I, [2024-05-14T21:50:38.775390 #2511758] INFO -- : [444/885] 2552777=test_basicsocket I, [2024-05-14T21:50:38.872281 #2511758] INFO -- : [445/885] 2552777=test_zsh_completion I, [2024-05-14T21:50:38.881266 #2511758] INFO -- : [446/885] 2552777=test_scalar I, [2024-05-14T21:50:38.892059 #2511758] INFO -- : [447/885] 2552777=test_syntax I, [2024-05-14T21:50:38.948185 #2511758] INFO -- : [448/885] 2552778=test_class_name_check I, [2024-05-14T21:50:39.076110 #2511758] INFO -- : [449/885] 2552779=test_pack I, [2024-05-14T21:50:39.089923 #2511758] INFO -- : [450/885] 2552778=test_pkcs7 I, [2024-05-14T21:50:39.265328 #2511758] INFO -- : [451/885] 2552778=test_gem_commands_environment_command I, [2024-05-14T21:50:39.276590 #2511758] INFO -- : [452/885] 2552779=test_optparse I, [2024-05-14T21:50:39.324277 #2511758] INFO -- : [453/885] 2552778=test_deprecated I, [2024-05-14T21:50:39.332380 #2511758] INFO -- : [454/885] 2552778=test_io_buffer I, [2024-05-14T21:50:39.334945 #2511758] INFO -- : [455/885] 2552779=test_rdoc_context_section I, [2024-05-14T21:50:39.350141 #2511758] INFO -- : [456/885] 2552779=test_div I, [2024-05-14T21:50:39.433154 #2511758] INFO -- : [457/885] 2552779=test_files_test_2 I, [2024-05-14T21:50:39.472376 #2511758] INFO -- : [458/885] 2552778=test_rdoc_markup_to_html_crossref I, [2024-05-14T21:50:39.776963 #2511758] INFO -- : [459/885] 2552778=test_exception I, [2024-05-14T21:50:42.064821 #2511758] INFO -- : [460/885] 2552779=test_bash_completion I, [2024-05-14T21:50:42.073141 #2511758] INFO -- : [461/885] 2552779=test_word I, [2024-05-14T21:50:42.087974 #2511758] INFO -- : [462/885] 2552779=test_rdoc_require I, [2024-05-14T21:50:42.316789 #2511758] INFO -- : [463/885] 2552779=test_gem_ext_rake_builder I, [2024-05-14T21:50:42.796633 #2511758] INFO -- : [464/885] 2552779=test_numeric I, [2024-05-14T21:50:42.808983 #2511758] INFO -- : [465/885] 2552779=test_fstring I, [2024-05-14T21:50:42.920238 #2511758] INFO -- : [466/885] 2552779=test_singleton I, [2024-05-14T21:50:42.935881 #2511758] INFO -- : [467/885] 2552779=test_rdoc_alias I, [2024-05-14T21:50:43.072954 #2511758] INFO -- : [468/885] 2552779=test_instrumentation_api I, [2024-05-14T21:50:43.779362 #2511758] INFO -- : [469/885] 2552778=test_weakref I, [2024-05-14T21:50:43.877704 #2511758] INFO -- : [470/885] 2552778=test_rdoc_markup_raw I, [2024-05-14T21:50:43.885709 #2511758] INFO -- : [471/885] 2552778=test_key_name_check I, [2024-05-14T21:50:43.895097 #2511758] INFO -- : [472/885] 2552778=test_rdoc_markup_to_bs I, [2024-05-14T21:50:43.941515 #2511758] INFO -- : [473/885] 2552778=test_timeout I, [2024-05-14T21:50:44.716260 #2511758] INFO -- : [474/885] 2552778=json_parser_test I, [2024-05-14T21:50:44.853737 #2511758] INFO -- : [475/885] 2552778=test_date_strftime I, [2024-05-14T21:50:45.186329 #2511758] INFO -- : [476/885] 2552778=test_ws I, [2024-05-14T21:50:45.200640 #2511758] INFO -- : [477/885] 2552778=test_rdoc_markup_to_tt_only I, [2024-05-14T21:50:45.226313 #2511758] INFO -- : [478/885] 2552778=ruby_parser_test I, [2024-05-14T21:50:45.240892 #2511758] INFO -- : [479/885] 2552778=test_gem_commands_stale_command I, [2024-05-14T21:50:45.480077 #2511758] INFO -- : [480/885] 2552778=test_gem_commands_cert_command I, [2024-05-14T21:50:45.910342 #2511758] INFO -- : [481/885] 2552779=test_rdoc_constant I, [2024-05-14T21:50:45.996888 #2511758] INFO -- : [482/885] 2552779=test_deprecate I, [2024-05-14T21:50:46.066925 #2511758] INFO -- : [483/885] 2552779=test_httpresponses I, [2024-05-14T21:50:46.078140 #2511758] INFO -- : [484/885] 2552779=test_rdoc_markup_to_html_snippet I, [2024-05-14T21:50:46.233866 #2511758] INFO -- : [485/885] 2552779=test_common I, [2024-05-14T21:50:46.344418 #2511758] INFO -- : [486/885] 2552779=test_generic I, [2024-05-14T21:50:46.364759 #2511758] INFO -- : [487/885] 2552779=test_win32ole_variant_outarg I, [2024-05-14T21:50:46.374576 #2511758] INFO -- : [488/885] 2552779=test_rdoc_encoding I, [2024-05-14T21:50:46.433093 #2511758] INFO -- : [489/885] 2552779=test_rdoc_markdown I, [2024-05-14T21:50:46.691167 #2511758] INFO -- : [490/885] 2552779=test_gem_request_set_lockfile I, [2024-05-14T21:50:47.155904 #2511758] INFO -- : [491/885] 2552779=test_postponed_job I, [2024-05-14T21:50:47.424758 #2511758] INFO -- : [492/885] 2552779=test_key_actor_vi I, [2024-05-14T21:50:47.926199 #2511758] INFO -- : [493/885] 2552779=test_iseq_load I, [2024-05-14T21:50:47.960649 #2511758] INFO -- : [494/885] 2552778=test_rdoc_markup_parser I, [2024-05-14T21:50:48.012758 #2511758] INFO -- : [495/885] 2552778=test_rdoc_markup_indented_paragraph I, [2024-05-14T21:50:48.019464 #2511758] INFO -- : [496/885] 2552778=test_ns_spki I, [2024-05-14T21:50:48.375839 #2511758] INFO -- : [497/885] 2552778=test_have_library I, [2024-05-14T21:50:48.669584 #2511758] INFO -- : [498/885] 2552779=test_stream I, [2024-05-14T21:50:48.702176 #2511758] INFO -- : [499/885] 2552779=test_objspace I, [2024-05-14T21:50:48.768010 #2511758] INFO -- : [500/885] 2552777=test_stringify_symbols I, [2024-05-14T21:50:48.776032 #2511758] INFO -- : [501/885] 2552777=test_require I, [2024-05-14T21:50:48.781095 #2511758] INFO -- : [502/885] 2552777=library_symbols_test I, [2024-05-14T21:50:48.817056 #2511758] INFO -- : [503/885] 2552777=test_rdoc_text I, [2024-05-14T21:50:48.866924 #2511758] INFO -- : [504/885] 2552777=test_securerandom I, [2024-05-14T21:50:48.910448 #2511758] INFO -- : [505/885] 2552777=test_typeddata I, [2024-05-14T21:50:49.157149 #2511758] INFO -- : [506/885] 2552778=test_gem_commands_fetch_command I, [2024-05-14T21:50:49.180322 #2511758] INFO -- : [507/885] 2552777=test_tsort I, [2024-05-14T21:50:49.185979 #2511758] INFO -- : [508/885] 2552777=test_rdoc_parser_changelog I, [2024-05-14T21:50:49.315868 #2511758] INFO -- : [509/885] 2552778=parameters_signature_test I, [2024-05-14T21:50:49.327605 #2511758] INFO -- : [510/885] 2552778=test_gem_dependency_list I, [2024-05-14T21:50:49.405623 #2511758] INFO -- : [511/885] 2552777=test_gem_commands_outdated_command I, [2024-05-14T21:50:49.460585 #2511758] INFO -- : [512/885] 2552778=test_len I, [2024-05-14T21:50:49.466126 #2511758] INFO -- : [513/885] 2552778=json_fixtures_test I, [2024-05-14T21:50:49.491269 #2511758] INFO -- : [514/885] 2552778=test_gem_doctor I, [2024-05-14T21:50:49.521010 #2511758] INFO -- : [515/885] 2552777=parse_test I, [2024-05-14T21:50:49.553144 #2511758] INFO -- : [516/885] 2552778=test_io_wait I, [2024-05-14T21:50:49.903697 #2511758] INFO -- : [517/885] 2552778=test_pack I, [2024-05-14T21:50:50.153888 #2511758] INFO -- : [518/885] 2552778=test_rdoc_parser_c I, [2024-05-14T21:50:50.524303 #2511758] INFO -- : [519/885] 2552778=test_kwargs I, [2024-05-14T21:50:50.531836 #2511758] INFO -- : [520/885] 2552778=test_process I, [2024-05-14T21:50:52.254886 #2511758] INFO -- : [521/885] 2552777=test_rdoc_code_object I, [2024-05-14T21:50:52.593021 #2511758] INFO -- : [522/885] 2552777=test_euc_kr I, [2024-05-14T21:50:52.604546 #2511758] INFO -- : [523/885] 2552777=test_provider I, [2024-05-14T21:50:52.623196 #2511758] INFO -- : [524/885] 2552777=test_gem_source_specific_file I, [2024-05-14T21:50:52.719770 #2511758] INFO -- : [525/885] 2552777=test_bmethod I, [2024-05-14T21:50:52.728622 #2511758] INFO -- : [526/885] 2552777=test_string_processing I, [2024-05-14T21:50:52.730159 #2511758] INFO -- : [527/885] 2552777=test_random_formatter I, [2024-05-14T21:50:52.744443 #2511758] INFO -- : [528/885] 2552777=test_rand I, [2024-05-14T21:50:53.311313 #2511758] INFO -- : [529/885] 2552777=redundant_return_test I, [2024-05-14T21:50:53.320680 #2511758] INFO -- : [530/885] 2552777=test_rdoc_markup_attributes I, [2024-05-14T21:50:53.356590 #2511758] INFO -- : [531/885] 2552777=test_encoding I, [2024-05-14T21:50:53.534450 #2511758] INFO -- : [532/885] 2552777=test_hmac I, [2024-05-14T21:50:53.548582 #2511758] INFO -- : [533/885] 2552777=test_find I, [2024-05-14T21:50:53.730982 #2511758] INFO -- : [534/885] 2552777=test_constant I, [2024-05-14T21:50:55.309729 #2511758] INFO -- : [535/885] 2552777=test_rdoc_generator_markup I, [2024-05-14T21:50:55.322990 #2511758] INFO -- : [536/885] 2552777=test_yamlstore I, [2024-05-14T21:50:55.347629 #2511758] INFO -- : [537/885] 2552777=test_bug-3571 I, [2024-05-14T21:50:55.360600 #2511758] INFO -- : [538/885] 2552777=test_numeric I, [2024-05-14T21:50:55.616038 #2511758] INFO -- : [539/885] 2552777=test_flags I, [2024-05-14T21:50:56.402080 #2511758] INFO -- : [540/885] 2552777=test_gem_request_connection_pools I, [2024-05-14T21:50:57.044301 #2511758] INFO -- : [541/885] 2552777=test_init I, [2024-05-14T21:50:57.377169 #2511758] INFO -- : [542/885] 2552777=test_rat I, [2024-05-14T21:50:57.405269 #2511758] INFO -- : [543/885] 2552777=test_gem_commands_owner_command I, [2024-05-14T21:50:58.059056 #2511758] INFO -- : [544/885] 2552777=test_nextafter I, [2024-05-14T21:50:58.200652 #2511758] INFO -- : [545/885] 2552777=test_capacity I, [2024-05-14T21:50:58.219891 #2511758] INFO -- : [546/885] 2552777=test_file I, [2024-05-14T21:50:58.236817 #2511758] INFO -- : [547/885] 2552777=test_time I, [2024-05-14T21:50:58.346087 #2511758] INFO -- : [548/885] 2552777=test_integer I, [2024-05-14T21:50:58.413293 #2511758] INFO -- : [549/885] 2552777=test_gem_name_tuple I, [2024-05-14T21:50:58.442497 #2511758] INFO -- : [550/885] 2552777=test_rdoc_markup_to_table_of_contents I, [2024-05-14T21:50:58.485703 #2511758] INFO -- : [551/885] 2552777=parse_comments_test I, [2024-05-14T21:50:58.497882 #2511758] INFO -- : [552/885] 2552777=test_tcp I, [2024-05-14T21:50:58.702857 #2511758] INFO -- : [553/885] 2552777=test_win32ole_method_event I, [2024-05-14T21:50:58.722029 #2511758] INFO -- : [554/885] 2552777=test_gem_requirement I, [2024-05-14T21:50:58.863148 #2511758] INFO -- : [555/885] 2552777=test_pipe I, [2024-05-14T21:50:58.991040 #2511758] INFO -- : [556/885] 2552777=test_macro I, [2024-05-14T21:50:59.025012 #2511758] INFO -- : [557/885] 2552777=test_string I, [2024-05-14T21:51:08.785305 #2511758] INFO -- : [558/885] 2552778=test_gem_commands_server_command I, [2024-05-14T21:51:08.798305 #2511758] INFO -- : [559/885] 2552778=test_function I, [2024-05-14T21:51:09.046617 #2511758] INFO -- : [560/885] 2552778=test_gem_resolver_activation_request I, [2024-05-14T21:51:09.065386 #2511758] INFO -- : [561/885] 2552778=test_gem_uri I, [2024-05-14T21:51:09.165141 #2511758] INFO -- : [562/885] 2552778=test_resource I, [2024-05-14T21:51:09.186277 #2511758] INFO -- : [563/885] 2552778=test_gem_package_tar_reader_entry I, [2024-05-14T21:51:09.522336 #2511758] INFO -- : [564/885] 2552778=test_c_struct_builder I, [2024-05-14T21:51:09.804226 #2511758] INFO -- : [565/885] 2552778=test_yield_block I, [2024-05-14T21:51:09.810218 #2511758] INFO -- : [566/885] 2552778=test_bug-5832 I, [2024-05-14T21:51:09.815858 #2511758] INFO -- : [567/885] 2552778=test_enumerator I, [2024-05-14T21:51:09.821577 #2511758] INFO -- : [568/885] 2552778=test_path_to_class I, [2024-05-14T21:51:09.833266 #2511758] INFO -- : [569/885] 2552778=test_spell_checker I, [2024-05-14T21:51:09.846041 #2511758] INFO -- : [570/885] 2552778=test_gem_version I, [2024-05-14T21:51:10.052885 #2511758] INFO -- : [571/885] 2552778=test_gem_ext_ext_conf_builder I, [2024-05-14T21:51:11.063626 #2511758] INFO -- : [572/885] 2552778=test_frozen_error I, [2024-05-14T21:51:11.074826 #2511758] INFO -- : [573/885] 2552778=test_reqarg I, [2024-05-14T21:51:11.429716 #2511758] INFO -- : [574/885] 2552778=test_gem_commands_unpack_command I, [2024-05-14T21:51:11.818025 #2511758] INFO -- : [575/885] 2552778=test_proc I, [2024-05-14T21:51:12.638122 #2511758] INFO -- : [576/885] 2552778=test_console_attr I, [2024-05-14T21:51:12.673783 #2511758] INFO -- : [577/885] 2552778=test_gem_ext_cargo_builder I, [2024-05-14T21:51:12.689629 #2511758] INFO -- : [578/885] 2552778=test_rdoc_options I, [2024-05-14T21:51:12.967916 #2511758] INFO -- : [579/885] 2552778=test_zlib I, [2024-05-14T21:51:22.248647 #2511758] INFO -- : [580/885] 2552778=test_pstore I, [2024-05-14T21:51:22.490274 #2511758] INFO -- : [581/885] 2552778=test_ubf_async_safe I, [2024-05-14T21:51:22.502396 #2511758] INFO -- : [582/885] 2552778=test_date_compat I, [2024-05-14T21:51:22.517111 #2511758] INFO -- : [583/885] 2552778=test_gem_version_option I, [2024-05-14T21:51:22.568406 #2511758] INFO -- : [584/885] 2552778=test_win32ole_record I, [2024-05-14T21:51:22.586659 #2511758] INFO -- : [585/885] 2552778=test_rdoc_include I, [2024-05-14T21:51:22.679918 #2511758] INFO -- : [586/885] 2552778=test_euc_tw I, [2024-05-14T21:51:22.697524 #2511758] INFO -- : [587/885] 2552778=test_command I, [2024-05-14T21:51:22.981712 #2511758] INFO -- : [588/885] 2552778=test_gem_resolver_dependency_request I, [2024-05-14T21:51:23.016928 #2511758] INFO -- : [589/885] 2552778=test_cstr I, [2024-05-14T21:51:25.196705 #2511758] INFO -- : [590/885] 2552778=test_yaml_tree I, [2024-05-14T21:51:25.209720 #2511758] INFO -- : [591/885] 2552778=test_gem_commands_yank_command I, [2024-05-14T21:51:25.219521 #2511758] INFO -- : [592/885] 2552779=test_logger I, [2024-05-14T21:51:25.240978 #2511758] INFO -- : [593/885] 2552779=test_pkey_dsa I, [2024-05-14T21:51:25.749532 #2511758] INFO -- : [594/885] 2552778=test_gem_resolver_specification I, [2024-05-14T21:51:25.765536 #2511758] INFO -- : [595/885] 2552778=test_big2str I, [2024-05-14T21:51:25.779052 #2511758] INFO -- : [596/885] 2552778=test_human_typo I, [2024-05-14T21:51:25.843225 #2511758] INFO -- : [597/885] 2552778=test_import I, [2024-05-14T21:51:26.714183 #2511758] INFO -- : [598/885] 2552779=test_wait I, [2024-05-14T21:51:26.774299 #2511758] INFO -- : [599/885] 2552779=test_nil I, [2024-05-14T21:51:26.785523 #2511758] INFO -- : [600/885] 2552779=test_psych I, [2024-05-14T21:51:26.821410 #2511758] INFO -- : [601/885] 2552779=test_io_buffer I, [2024-05-14T21:51:26.925836 #2511758] INFO -- : [602/885] 2552779=test_defined I, [2024-05-14T21:51:27.005249 #2511758] INFO -- : [603/885] 2552779=test_passing_block I, [2024-05-14T21:51:27.014850 #2511758] INFO -- : [604/885] 2552779=test_nowrite I, [2024-05-14T21:51:27.057508 #2511758] INFO -- : [605/885] 2552779=test_thread_queue I, [2024-05-14T21:51:28.571973 #2511758] INFO -- : [606/885] 2552778=test_kdf I, [2024-05-14T21:51:28.638424 #2511758] INFO -- : [607/885] 2552778=test_ldap I, [2024-05-14T21:51:28.644142 #2511758] INFO -- : [608/885] 2552778=test_comparable I, [2024-05-14T21:51:28.668674 #2511758] INFO -- : [609/885] 2552778=test_gem_config_file I, [2024-05-14T21:51:28.824552 #2511758] INFO -- : [610/885] 2552778=json_string_matching_test I, [2024-05-14T21:51:28.875055 #2511758] INFO -- : [611/885] 2552778=test_rdoc_markdown_test I, [2024-05-14T21:51:30.025536 #2511758] INFO -- : [612/885] 2552778=test_rdoc_normal_module I, [2024-05-14T21:51:30.057723 #2511758] INFO -- : [613/885] 2552778=test_type_completor I, [2024-05-14T21:51:30.063853 #2511758] INFO -- : [614/885] 2552778=test_io_timeout I, [2024-05-14T21:51:30.066697 #2511758] INFO -- : [615/885] 2552778=test_yjit_exit_locations I, [2024-05-14T21:51:30.075270 #2511758] INFO -- : [616/885] 2552778=test_rdoc_rdoc I, [2024-05-14T21:51:30.147786 #2511758] INFO -- : [617/885] 2552778=test_timeout I, [2024-05-14T21:51:30.155649 #2511758] INFO -- : [618/885] 2552778=test_rdoc_generator_pot_po_entry I, [2024-05-14T21:51:30.168957 #2511758] INFO -- : [619/885] 2552778=test_erb_m17n I, [2024-05-14T21:51:30.211126 #2511758] INFO -- : [620/885] 2552778=test_egrep_cpp I, [2024-05-14T21:51:30.259529 #2511758] INFO -- : [621/885] 2552778=test_frozen I, [2024-05-14T21:51:30.274805 #2511758] INFO -- : [622/885] 2552778=test_gem_resolver_index_specification I, [2024-05-14T21:51:30.322903 #2511758] INFO -- : [623/885] 2552778=test_serialize_subclasses I, [2024-05-14T21:51:30.332279 #2511758] INFO -- : [624/885] 2552778=test_date_conv I, [2024-05-14T21:51:30.341721 #2511758] INFO -- : [625/885] 2552778=test_rdoc_markup_verbatim I, [2024-05-14T21:51:30.457352 #2511758] INFO -- : [626/885] 2552778=test_webauthn_poller I, [2024-05-14T21:51:30.542130 #2511758] INFO -- : [627/885] 2552778=test_gem_commands_update_command I, [2024-05-14T21:51:31.975743 #2511758] INFO -- : [628/885] 2552778=test_big5 I, [2024-05-14T21:51:31.984924 #2511758] INFO -- : [629/885] 2552778=test_date I, [2024-05-14T21:51:31.990988 #2511758] INFO -- : [630/885] 2552778=test_protect I, [2024-05-14T21:51:31.997674 #2511758] INFO -- : [631/885] 2552778=test_tree_builder I, [2024-05-14T21:51:32.014721 #2511758] INFO -- : [632/885] 2552778=test_coverage I, [2024-05-14T21:51:32.596049 #2511758] INFO -- : [633/885] 2552778=test_http_request I, [2024-05-14T21:51:32.603506 #2511758] INFO -- : [634/885] 2552778=test_tempfile I, [2024-05-14T21:51:32.853318 #2511758] INFO -- : [635/885] 2552778=test_rdoc_markup_pre_process I, [2024-05-14T21:51:32.993354 #2511758] INFO -- : [636/885] 2552778=test_store I, [2024-05-14T21:51:33.234773 #2511758] INFO -- : [637/885] 2552778=test_fnmatch I, [2024-05-14T21:51:33.284691 #2511758] INFO -- : [638/885] 2552778=test_pathname I, [2024-05-14T21:51:33.474179 #2511758] INFO -- : [639/885] 2552778=test_function_entry I, [2024-05-14T21:51:33.489468 #2511758] INFO -- : [640/885] 2552778=test_error_highlight I, [2024-05-14T21:51:33.805761 #2511758] INFO -- : [641/885] 2552779=test_rdoc_any_method I, [2024-05-14T21:51:34.164199 #2511758] INFO -- : [642/885] 2552779=json_common_interface_test I, [2024-05-14T21:51:34.178100 #2511758] INFO -- : [643/885] 2552778=test_string I, [2024-05-14T21:51:34.183519 #2511758] INFO -- : [644/885] 2552779=version_test I, [2024-05-14T21:51:34.186710 #2511758] INFO -- : [645/885] 2552779=test_raise I, [2024-05-14T21:51:34.187732 #2511758] INFO -- : [646/885] 2552779=test_complexrational I, [2024-05-14T21:51:34.195483 #2511758] INFO -- : [647/885] 2552779=test_help I, [2024-05-14T21:51:34.204713 #2511758] INFO -- : [648/885] 2552778=test_string_memory I, [2024-05-14T21:51:34.206375 #2511758] INFO -- : [649/885] 2552779=test_files_lib I, [2024-05-14T21:51:34.220160 #2511758] INFO -- : [650/885] 2552779=reflection_test I, [2024-05-14T21:51:34.228918 #2511758] INFO -- : [651/885] 2552779=test_line_editor I, [2024-05-14T21:51:34.237478 #2511758] INFO -- : [652/885] 2552779=test_marshalable I, [2024-05-14T21:51:34.244264 #2511758] INFO -- : [653/885] 2552779=test_enumerator_kw I, [2024-05-14T21:51:34.261781 #2511758] INFO -- : [654/885] 2552779=test_gem_gemcutter_utilities I, [2024-05-14T21:51:34.512836 #2511758] INFO -- : [655/885] 2552778=test_rendering I, [2024-05-14T21:51:34.520110 #2511758] INFO -- : [656/885] 2552778=test_internal_ivar I, [2024-05-14T21:51:34.525868 #2511758] INFO -- : [657/885] 2552778=test_win32ole I, [2024-05-14T21:51:34.537695 #2511758] INFO -- : [658/885] 2552778=desugar_compiler_test I, [2024-05-14T21:51:34.560722 #2511758] INFO -- : [659/885] 2552778=test_gem_source_local I, [2024-05-14T21:51:34.694404 #2511758] INFO -- : [660/885] 2552779=test_backtrace I, [2024-05-14T21:51:34.784207 #2511758] INFO -- : [661/885] 2552778=test_tracepoint I, [2024-05-14T21:51:35.130002 #2511758] INFO -- : [662/885] 2552778=test_gem_text I, [2024-05-14T21:51:35.201251 #2511758] INFO -- : [663/885] 2552778=test_settracefunc I, [2024-05-14T21:51:36.097807 #2511758] INFO -- : [664/885] 2552779=test_rdoc_task I, [2024-05-14T21:51:36.120323 #2511758] INFO -- : [665/885] 2552779=locals_test I, [2024-05-14T21:51:36.170903 #2511758] INFO -- : [666/885] 2552778=test_gem_commands_push_command I, [2024-05-14T21:51:36.529448 #2511758] INFO -- : [667/885] 2552779=test_sprintf_comb I, [2024-05-14T21:51:36.715925 #2511758] INFO -- : [668/885] 2552779=test_too_many_dummy_encodings I, [2024-05-14T21:51:36.741833 #2511758] INFO -- : [669/885] 2552779=test_method_cache I, [2024-05-14T21:51:36.744670 #2511758] INFO -- : [670/885] 2552779=test_gem_commands_specification_command I, [2024-05-14T21:51:36.871769 #2511758] INFO -- : [671/885] 2552778=test_scan_args I, [2024-05-14T21:51:36.889911 #2511758] INFO -- : [672/885] 2552779=encoding_test I, [2024-05-14T21:51:36.904877 #2511758] INFO -- : [673/885] 2552778=test_gem_package_old I, [2024-05-14T21:51:36.959868 #2511758] INFO -- : [674/885] 2552778=test_gem_request I, [2024-05-14T21:51:36.974484 #2511758] INFO -- : [675/885] 2552779=test_gem_commands_which_command I, [2024-05-14T21:51:37.014377 #2511758] INFO -- : [676/885] 2552779=test_gem_dependency_installer I, [2024-05-14T21:51:37.256379 #2511758] INFO -- : [677/885] 2552778=test_pty I, [2024-05-14T21:51:37.758740 #2511758] INFO -- : [678/885] 2552778=test_hash I, [2024-05-14T21:51:39.680351 #2511758] INFO -- : [679/885] 2552779=parser_test I, [2024-05-14T21:51:39.690727 #2511758] INFO -- : [680/885] 2552779=test_http I, [2024-05-14T21:51:39.702956 #2511758] INFO -- : [681/885] 2552779=test_filter I, [2024-05-14T21:51:39.737141 #2511758] INFO -- : [682/885] 2552779=test_parser_events I, [2024-05-14T21:51:39.850552 #2511758] INFO -- : [683/885] 2552779=test_gem_remote_fetcher I, [2024-05-14T21:51:41.641516 #2511758] INFO -- : [684/885] 2552779=test_koi8 I, [2024-05-14T21:51:41.651194 #2511758] INFO -- : [685/885] 2552779=test_json_tree I, [2024-05-14T21:51:41.728323 #2511758] INFO -- : [686/885] 2552779=test_pkcs12 I, [2024-05-14T21:51:42.152482 #2511758] INFO -- : [687/885] 2552778=test_x509name I, [2024-05-14T21:51:42.190309 #2511758] INFO -- : [688/885] 2552778=test_yaml I, [2024-05-14T21:51:42.291311 #2511758] INFO -- : [689/885] 2552778=test_argf I, [2024-05-14T21:51:42.380699 #2511758] INFO -- : [690/885] 2552779=test_m17n I, [2024-05-14T21:51:42.441382 #2511758] INFO -- : [691/885] 2552779=test_method I, [2024-05-14T21:51:46.149025 #2511758] INFO -- : [692/885] 2552778=test_gem_uninstaller I, [2024-05-14T21:51:47.574653 #2511758] INFO -- : [693/885] 2552778=test_cclass I, [2024-05-14T21:51:47.636936 #2511758] INFO -- : [694/885] 2552778=test_yjit I, [2024-05-14T21:51:47.649517 #2511758] INFO -- : [695/885] 2552778=test_gem_dependency I, [2024-05-14T21:51:47.813781 #2511758] INFO -- : [696/885] 2552778=test_rdoc_markup_to_rdoc I, [2024-05-14T21:51:47.868821 #2511758] INFO -- : [697/885] 2552778=test_gem_package_tar_writer I, [2024-05-14T21:51:48.068356 #2511758] INFO -- : [698/885] 2552778=test_str2big I, [2024-05-14T21:51:48.075674 #2511758] INFO -- : [699/885] 2552778=test_severity I, [2024-05-14T21:51:48.076816 #2511758] INFO -- : [700/885] 2552778=test_case I, [2024-05-14T21:51:48.090995 #2511758] INFO -- : [701/885] 2552778=test_ractor I, [2024-05-14T21:51:48.100278 #2511758] INFO -- : [702/885] 2552778=test_set I, [2024-05-14T21:51:48.113258 #2511758] INFO -- : [703/885] 2552778=test_http I, [2024-05-14T21:51:48.547022 #2511758] INFO -- : [704/885] 2552777=test_utf16 I, [2024-05-14T21:51:48.564890 #2511758] INFO -- : [705/885] 2552777=attribute_write_test I, [2024-05-14T21:51:48.577451 #2511758] INFO -- : [706/885] 2552777=warnings_test I, [2024-05-14T21:51:48.591969 #2511758] INFO -- : [707/885] 2552777=test_stringchar I, [2024-05-14T21:51:48.665043 #2511758] INFO -- : [708/885] 2552777=test_date_attr I, [2024-05-14T21:51:48.668949 #2511758] INFO -- : [709/885] 2552777=test_sizeof I, [2024-05-14T21:51:51.023377 #2511758] INFO -- : [710/885] 2552777=test_gem_request_set_lockfile_parser I, [2024-05-14T21:51:51.153067 #2511758] INFO -- : [711/885] 2552777=test_face I, [2024-05-14T21:51:51.292577 #2511758] INFO -- : [712/885] 2552777=test_gem_install_update_options I, [2024-05-14T21:51:51.408542 #2511758] INFO -- : [713/885] 2552777=test_econv I, [2024-05-14T21:51:52.267338 #2511758] INFO -- : [714/885] 2552777=test_mixed_unicode_escapes I, [2024-05-14T21:51:52.290388 #2511758] INFO -- : [715/885] 2552777=test_sleep I, [2024-05-14T21:51:52.655101 #2511758] INFO -- : [716/885] 2552779=test_fileutils I, [2024-05-14T21:51:53.119148 #2511758] INFO -- : [717/885] 2552779=test_gem_dependency_resolution_error I, [2024-05-14T21:51:53.129047 #2511758] INFO -- : [718/885] 2552779=test_condition I, [2024-05-14T21:51:53.139216 #2511758] INFO -- : [719/885] 2552779=test_gem_resolver_vendor_set I, [2024-05-14T21:51:53.161555 #2511758] INFO -- : [720/885] 2552779=test_cp949 I, [2024-05-14T21:51:53.167724 #2511758] INFO -- : [721/885] 2552779=test_jaro_winkler I, [2024-05-14T21:51:53.174213 #2511758] INFO -- : [722/885] 2552779=test_windows_1252 I, [2024-05-14T21:51:53.527055 #2511758] INFO -- : [723/885] 2552779=test_stack I, [2024-05-14T21:51:54.013040 #2511758] INFO -- : [724/885] 2552779=test_sorted_set I, [2024-05-14T21:51:54.147270 #2511758] INFO -- : [725/885] 2552779=test_emoji I, [2024-05-14T21:51:54.243502 #2511758] INFO -- : [726/885] 2552779=test_rdoc_class_module I, [2024-05-14T21:51:54.324903 #2511758] INFO -- : [727/885] 2552777=test_parse I, [2024-05-14T21:51:54.698662 #2511758] INFO -- : [728/885] 2552779=test_rdoc_cross_reference I, [2024-05-14T21:51:54.859689 #2511758] INFO -- : [729/885] 2552777=test_method_cache I, [2024-05-14T21:51:54.864342 #2511758] INFO -- : [730/885] 2552777=test_win32ole_variable I, [2024-05-14T21:51:54.865473 #2511758] INFO -- : [731/885] 2552777=test_gem_specification I, [2024-05-14T21:51:55.126429 #2511758] INFO -- : [732/885] 2552779=test_numhash I, [2024-05-14T21:51:55.138315 #2511758] INFO -- : [733/885] 2552779=test_system I, [2024-05-14T21:51:55.974786 #2511758] INFO -- : [734/885] 2552779=test_pkey_rsa I, [2024-05-14T21:51:56.243675 #2511758] INFO -- : [735/885] 2552779=test_flush I, [2024-05-14T21:51:56.261000 #2511758] INFO -- : [736/885] 2552779=test_safe_load I, [2024-05-14T21:51:56.267913 #2511758] INFO -- : [737/885] 2552779=test_qsort I, [2024-05-14T21:51:56.284828 #2511758] INFO -- : [738/885] 2552779=comments_test I, [2024-05-14T21:51:56.288005 #2511758] INFO -- : [739/885] 2552779=test_gc I, [2024-05-14T21:51:56.296845 #2511758] INFO -- : [740/885] 2552779=test_math I, [2024-05-14T21:51:56.325984 #2511758] INFO -- : [741/885] 2552779=test_libs I, [2024-05-14T21:51:56.362086 #2511758] INFO -- : [742/885] 2552779=ripper_test I, [2024-05-14T21:51:56.870375 #2511758] INFO -- : [743/885] 2552779=test_iso_8859 I, [2024-05-14T21:51:56.894987 #2511758] INFO -- : [744/885] 2552779=test_gem_source_list I, [2024-05-14T21:51:56.953254 #2511758] INFO -- : [745/885] 2552779=json_addition_test I, [2024-05-14T21:51:56.981820 #2511758] INFO -- : [746/885] 2552779=test_name_error I, [2024-05-14T21:51:57.056270 #2511758] INFO -- : [747/885] 2552778=test_gem_commands_sources_command I, [2024-05-14T21:51:57.064506 #2511758] INFO -- : [748/885] 2552779=test_yaml_special_cases I, [2024-05-14T21:51:57.071761 #2511758] INFO -- : [749/885] 2552779=test_recorder I, [2024-05-14T21:51:57.075634 #2511758] INFO -- : [750/885] 2552779=test_const I, [2024-05-14T21:51:57.083045 #2511758] INFO -- : [751/885] 2552779=test_rdoc_parser_rd I, [2024-05-14T21:51:57.101973 #2511758] INFO -- : [752/885] 2552779=index_write_test I, [2024-05-14T21:51:57.108148 #2511758] INFO -- : [753/885] 2552777=test_class I, [2024-05-14T21:51:57.113254 #2511758] INFO -- : [754/885] 2552779=test_exit I, [2024-05-14T21:51:57.188245 #2511758] INFO -- : [755/885] 2552779=test_sprintf I, [2024-05-14T21:51:57.274471 #2511758] INFO -- : [756/885] 2552778=test_enumerator I, [2024-05-14T21:51:57.468015 #2511758] INFO -- : [757/885] 2552779=test_enc_associate I, [2024-05-14T21:51:57.933645 #2511758] INFO -- : [758/885] 2552779=test_open-uri I, [2024-05-14T21:51:58.347932 #2511758] INFO -- : [759/885] 2552779=test_case I, [2024-05-14T21:51:58.370474 #2511758] INFO -- : [760/885] 2552779=test_array I, [2024-05-14T21:51:58.379823 #2511758] INFO -- : [761/885] 2552779=test_rdoc_context I, [2024-05-14T21:51:59.142678 #2511758] INFO -- : [762/885] 2552779=test_gem_command_manager I, [2024-05-14T21:51:59.320841 #2511758] INFO -- : [763/885] 2552779=test_rdoc_generator_json_index I, [2024-05-14T21:51:59.348286 #2511758] INFO -- : [764/885] 2552779=test_nil2vtempty I, [2024-05-14T21:51:59.357434 #2511758] INFO -- : [765/885] 2552779=test_date_time I, [2024-05-14T21:51:59.380410 #2511758] INFO -- : [766/885] 2552779=test_inadvertent_creation I, [2024-05-14T21:51:59.473045 #2511758] INFO -- : [767/885] 2552777=test_ansi_with_terminfo I, [2024-05-14T21:51:59.475784 #2511758] INFO -- : [768/885] 2552779=test_coderange I, [2024-05-14T21:51:59.484934 #2511758] INFO -- : [769/885] 2552777=test_weakmap I, [2024-05-14T21:51:59.487761 #2511758] INFO -- : [770/885] 2552779=test_framework I, [2024-05-14T21:51:59.560589 #2511758] INFO -- : [771/885] 2552779=test_pinned I, [2024-05-14T21:51:59.694631 #2511758] INFO -- : [772/885] 2552779=test_pack I, [2024-05-14T21:51:59.707029 #2511758] INFO -- : [773/885] 2552779=test_cgi_tag_helper I, [2024-05-14T21:51:59.730885 #2511758] INFO -- : [774/885] 2552779=test_gem_commands_install_command I, [2024-05-14T21:52:01.626428 #2511758] INFO -- : [775/885] 2552779=test_iterator I, [2024-05-14T21:52:01.684636 #2511758] INFO -- : [776/885] 2552779=test_string I, [2024-05-14T21:52:01.704101 #2511758] INFO -- : [777/885] 2552779=test_gem_rdoc I, [2024-05-14T21:52:01.847762 #2511758] INFO -- : [778/885] 2552779=test_dot_dot I, [2024-05-14T21:52:01.868863 #2511758] INFO -- : [779/885] 2552779=pattern_test I, [2024-05-14T21:52:01.922106 #2511758] INFO -- : [780/885] 2552779=test_kernel I, [2024-05-14T21:52:02.510699 #2511758] INFO -- : [781/885] 2552779=test_rendering I, [2024-05-14T21:52:02.527387 #2511758] INFO -- : [782/885] 2552779=test_rdoc_extend I, [2024-05-14T21:52:02.553750 #2511758] INFO -- : [783/885] 2552779=test_cesu8 I, [2024-05-14T21:52:02.559203 #2511758] INFO -- : [784/885] 2552779=test_shapes I, [2024-05-14T21:52:02.568180 #2511758] INFO -- : [785/885] 2552779=test_did_you_mean I, [2024-05-14T21:52:02.632624 #2511758] INFO -- : [786/885] 2552779=test_merge_keys I, [2024-05-14T21:52:02.647709 #2511758] INFO -- : [787/885] 2552779=test_method_name_check I, [2024-05-14T21:52:02.691419 #2511758] INFO -- : [788/885] 2552779=test_err_in_callback I, [2024-05-14T21:52:02.707230 #2511758] INFO -- : [789/885] 2552779=test_storage I, [2024-05-14T21:52:02.721661 #2511758] INFO -- : [790/885] 2552779=test_complex I, [2024-05-14T21:52:03.811082 #2511758] INFO -- : [791/885] 2552779=test_threadgroup I, [2024-05-14T21:52:03.883312 #2511758] INFO -- : [792/885] 2552779=test_memory_view I, [2024-05-14T21:52:04.402587 #2511758] INFO -- : [793/885] 2552779=test_dir_m17n I, [2024-05-14T21:52:05.594019 #2511758] INFO -- : [794/885] 2552779=test_array_create I, [2024-05-14T21:52:05.595362 #2511758] INFO -- : [795/885] 2552779=!Nothing_to_test I, [2024-05-14T21:52:05.640814 #2511758] INFO -- : [796/885] 2552779=test_process I, [2024-05-14T21:52:05.654028 #2511758] INFO -- : [797/885] 2552779=test_forwardable I, [2024-05-14T21:52:05.668885 #2511758] INFO -- : [798/885] 2552779=test_fd_setsize I, [2024-05-14T21:52:05.685047 #2511758] INFO -- : [799/885] 2552779=test_assignment I, [2024-05-14T21:52:07.105215 #2511758] INFO -- : [800/885] 2552779=test_gem_update_suggestion I, [2024-05-14T21:52:07.107275 #2511758] INFO -- : [801/885] 2552779=test_normalize I, [2024-05-14T21:52:07.115107 #2511758] INFO -- : [802/885] 2552779=test_emoji_breaks I, [2024-05-14T21:52:07.123164 #2511758] INFO -- : [803/885] 2552779=test_verbose I, [2024-05-14T21:52:07.159846 #2511758] INFO -- : [804/885] 2552779=test_gem_commands_open_command I, [2024-05-14T21:52:07.293152 #2511758] INFO -- : [805/885] 2552779=test_rdoc_generator_darkfish I, [2024-05-14T21:52:07.630644 #2511758] INFO -- : [806/885] 2552779=test_random I, [2024-05-14T21:52:07.641893 #2511758] INFO -- : [807/885] 2552779=test_gem_resolver_lock_set I, [2024-05-14T21:52:07.665640 #2511758] INFO -- : [808/885] 2552779=test_undef I, [2024-05-14T21:52:07.679146 #2511758] INFO -- : [809/885] 2552779=test_asn1 I, [2024-05-14T21:52:07.701855 #2511758] INFO -- : [810/885] 2552779=test_gem_command I, [2024-05-14T21:52:07.813080 #2511758] INFO -- : [811/885] 2552779=test_arith_seq_beg_len_step I, [2024-05-14T21:52:07.937528 #2511758] INFO -- : [812/885] 2552779=test_raise_exception I, [2024-05-14T21:52:08.396235 #2511758] INFO -- : [813/885] 2552779=test_exception I, [2024-05-14T21:52:08.409585 #2511758] INFO -- : [814/885] 2552779=test_noarg I, [2024-05-14T21:52:08.543849 #2511758] INFO -- : [815/885] 2552779=test_gem_resolver_requirement_list I, [2024-05-14T21:52:08.550679 #2511758] INFO -- : [816/885] 2552779=memsize_test I, [2024-05-14T21:52:08.562530 #2511758] INFO -- : [817/885] 2552779=test_pp I, [2024-05-14T21:52:08.626993 #2511758] INFO -- : [818/885] 2552779=test_gem_impossible_dependencies_error I, [2024-05-14T21:52:08.638738 #2511758] INFO -- : [819/885] 2552779=test_erb I, [2024-05-14T21:52:08.912671 #2511758] INFO -- : [820/885] 2552779=test_date_ractor I, [2024-05-14T21:52:08.927538 #2511758] INFO -- : [821/885] 2552779=test_key_actor_emacs I, [2024-05-14T21:52:09.042723 #2511758] INFO -- : [822/885] 2552779=test_gem_security I, [2024-05-14T21:52:15.986889 #2511758] INFO -- : [823/885] 2552779=test_utf32 I, [2024-05-14T21:52:16.057035 #2511758] INFO -- : [824/885] 2552779=test_gem_resolver_git_specification I, [2024-05-14T21:52:16.069624 #2511758] INFO -- : [825/885] 2552777=test_basicinstructions I, [2024-05-14T21:52:16.175942 #2511758] INFO -- : [826/885] 2552777=test_gem_commands_pristine_command I, [2024-05-14T21:52:16.333645 #2511758] INFO -- : [827/885] 2552779=test_optarg I, [2024-05-14T21:52:16.406410 #2511758] INFO -- : [828/885] 2552779=test_rdoc_tom_doc I, [2024-05-14T21:52:16.432074 #2511758] INFO -- : [829/885] 2552779=test_hash I, [2024-05-14T21:52:16.439756 #2511758] INFO -- : [830/885] 2552779=test_variable I, [2024-05-14T21:52:16.567720 #2511758] INFO -- : [831/885] 2552779=test_cgi_util I, [2024-05-14T21:52:16.761768 #2511758] INFO -- : [832/885] 2552779=test_ole_methods I, [2024-05-14T21:52:16.775654 #2511758] INFO -- : [833/885] 2552779=test_prettyprint I, [2024-05-14T21:52:16.821890 #2511758] INFO -- : [834/885] 2552779=test_gem_uri_formatter I, [2024-05-14T21:52:16.841685 #2511758] INFO -- : [835/885] 2552779=test_enc_raise I, [2024-05-14T21:52:16.852357 #2511758] INFO -- : [836/885] 2552779=test_clone I, [2024-05-14T21:52:17.016697 #2511758] INFO -- : [837/885] 2552779=test_boolean I, [2024-05-14T21:52:17.029656 #2511758] INFO -- : [838/885] 2552779=test_gem_resolver_lock_specification I, [2024-05-14T21:52:17.076979 #2511758] INFO -- : [839/885] 2552779=test_queue I, [2024-05-14T21:52:17.089825 #2511758] INFO -- : [840/885] 2552779=test_dryrun I, [2024-05-14T21:52:17.142565 #2511758] INFO -- : [841/885] 2552779=test_gc_compact I, [2024-05-14T21:52:17.752651 #2511758] INFO -- : [842/885] 2552777=test_rdoc_i18n_locale I, [2024-05-14T21:52:17.774344 #2511758] INFO -- : [843/885] 2552777=test_show_source I, [2024-05-14T21:52:17.786792 #2511758] INFO -- : [844/885] 2552777=test_remote_fetch_error I, [2024-05-14T21:52:17.808205 #2511758] INFO -- : [845/885] 2552777=test_yield I, [2024-05-14T21:52:20.621161 #2511758] INFO -- : [846/885] 2552777=regexp_test I, [2024-05-14T21:52:20.640364 #2511758] INFO -- : [847/885] 2552777=test_force_exit I, [2024-05-14T21:52:20.725267 #2511758] INFO -- : [848/885] 2552777=test_optimization I, [2024-05-14T21:52:21.007236 #2511758] INFO -- : [849/885] 2552779=test_rubyoptions I, [2024-05-14T21:52:27.393033 #2511758] INFO -- : [850/885] 2552777=test_data_error I, [2024-05-14T21:52:27.408236 #2511758] INFO -- : [851/885] 2552779=test_rdoc_stats I, [2024-05-14T21:52:27.438585 #2511758] INFO -- : [852/885] 2552779=test_files_sample I, [2024-05-14T21:52:27.464783 #2511758] INFO -- : [853/885] 2552779=test_rdoc_store I, [2024-05-14T21:52:27.478921 #2511758] INFO -- : [854/885] 2552777=test_shift_jis I, [2024-05-14T21:52:27.632104 #2511758] INFO -- : [855/885] 2552777=test_date_parse I, [2024-05-14T21:52:27.698990 #2511758] INFO -- : [856/885] 2552777=test_open3 I, [2024-05-14T21:52:28.356253 #2511758] INFO -- : [857/885] 2552779=test_mdns I, [2024-05-14T21:52:28.358261 #2511758] INFO -- : [858/885] 2552779=test_key_event_record I, [2024-05-14T21:52:28.367268 #2511758] INFO -- : [859/885] 2552779=test_buffering I, [2024-05-14T21:52:28.375686 #2511758] INFO -- : [860/885] 2552779=test_svcb_https I, [2024-05-14T21:52:28.384932 #2511758] INFO -- : [861/885] 2552779=test_pkey_ec I, [2024-05-14T21:52:28.408521 #2511758] INFO -- : [862/885] 2552779=test_thread I, [2024-05-14T21:52:28.421708 #2511758] INFO -- : [863/885] 2552779=test_arity I, [2024-05-14T21:52:28.434354 #2511758] INFO -- : [864/885] 2552779=test_gem_ext_cargo_builder_unit I, [2024-05-14T21:52:28.454624 #2511758] INFO -- : [865/885] 2552779=test_case_mapping I, [2024-05-14T21:52:28.476801 #2511758] INFO -- : [866/885] 2552779=test_rational I, [2024-05-14T21:52:28.504678 #2511758] INFO -- : [867/885] 2552779=test_webauthn_listener I, [2024-05-14T21:52:28.527576 #2511758] INFO -- : Leaked file descriptor: WebauthnListenerTest#test_wait_for_otp_code_options_request: 14 : # I, [2024-05-14T21:52:28.564427 #2511758] INFO -- : COMMAND PID USER FD TYPE DEVICE SIZE/OFF NODE NAME I, [2024-05-14T21:52:28.564581 #2511758] INFO -- : ruby 2552779 opc 14u IPv4 2984009453 0t0 TCP localhost:45735->localhost:41922 (CLOSE_WAIT) I, [2024-05-14T21:52:28.706385 #2511758] INFO -- : [868/885] 2552779=test_gem_resolver_api_specification I, [2024-05-14T21:52:28.762311 #2511758] INFO -- : [869/885] 2552779=test_rdoc_rubygems_hook I, [2024-05-14T21:52:28.993917 #2511758] INFO -- : [870/885] 2552779=test_ractor.Closed file descriptor: TestIOWaitInRactor#test_ractor: 14 I, [2024-05-14T21:52:28.994214 #2511758] INFO -- : I, [2024-05-14T21:52:29.006598 #2511758] INFO -- : [871/885] 2552779=static_literals_test I, [2024-05-14T21:52:29.025298 #2511758] INFO -- : [872/885] 2552779=test_tree_spell_checker I, [2024-05-14T21:52:29.099641 #2511758] INFO -- : [873/885] 2552779=test_set I, [2024-05-14T21:52:29.146628 #2511758] INFO -- : [874/885] 2552779=test_rdoc_method_attr I, [2024-05-14T21:52:29.268401 #2511758] INFO -- : [875/885] 2552779=test_enumerable I, [2024-05-14T21:52:29.271756 #2511758] INFO -- : [876/885] 2552779=test_hash_create I, [2024-05-14T21:52:29.294647 #2511758] INFO -- : [877/885] 2552779=test_grapheme_breaks I, [2024-05-14T21:52:29.307420 #2511758] INFO -- : [878/885] 2552779=test_switch_hitter I, [2024-05-14T21:52:29.376749 #2511758] INFO -- : [879/885] 2552779=test_default_gems I, [2024-05-14T21:52:29.391266 #2511758] INFO -- : [880/885] 2552779=test_unicode_escape I, [2024-05-14T21:52:29.490817 #2511758] INFO -- : [881/885] 2552779=test_gem_spec_fetcher I, [2024-05-14T21:52:29.674302 #2511758] INFO -- : [882/885] 2552779=test_yamldbm I, [2024-05-14T21:52:29.688569 #2511758] INFO -- : [883/885] 2552779=test_gem_commands_dependency_command I, [2024-05-14T21:52:29.779087 #2511758] INFO -- : [884/885] 2552779=test_gbk I, [2024-05-14T21:52:29.786548 #2511758] INFO -- : [885/885] 2552779=test_backtrace I, [2024-05-14T21:52:32.265324 #2511758] INFO -- : Finished tests in 215.452789s, 122.0546 tests/s, 43393.4230 assertions/s. E, [2024-05-14T21:52:32.265506 #2511758] ERROR -- : Children under /tmp/rubytest.7ahg6r: E, [2024-05-14T21:52:32.265640 #2511758] ERROR -- : * drwx------ 4 28 2024-05-14 21:49:42 +0000 gem_rebuild20240514-2552778-isa5t4/ E, [2024-05-14T21:52:32.265658 #2511758] ERROR -- : * drwxrwxr-x 2 40 2024-05-14 21:49:42 +0000 old/ E, [2024-05-14T21:52:32.265691 #2511758] ERROR -- : * -rw-rw-r-- 1 4096 2024-05-14 21:49:42 +0000 rebuild_test_gem-1.0.0.gem E, [2024-05-14T21:52:32.265847 #2511758] ERROR -- : * drwxrwxr-x 2 40 2024-05-14 21:49:42 +0000 new/ E, [2024-05-14T21:52:32.265862 #2511758] ERROR -- : * -rw-rw-r-- 1 4096 2024-05-14 21:49:42 +0000 rebuild_test_gem-1.0.0.gem I, [2024-05-14T21:52:32.271735 #2511758] INFO -- : 26297 tests, 9349234 assertions, 0 failures, 0 errors, 320 skips I, [2024-05-14T21:52:32.271778 #2511758] INFO -- : I, [2024-05-14T21:52:32.271790 #2511758] INFO -- : ruby -v: ruby 3.4.0dev (2024-05-14T21:44:34Z master e3e1e53098) [aarch64-linux] I, [2024-05-14T21:52:32.272664 #2511758] INFO -- : $$$[end] "make yes-test-all TESTOPTS='--stderr-on-failure' TESTS='-j3'" exit with 0. I, [2024-05-14T21:52:32.272808 #2511758] INFO -- : $$$[beg] make yes-test-rubyspec MSPECOPT='--error-output stderr --debug -j' TESTS='-j3' I, [2024-05-14T21:52:32.399075 #2511758] INFO -- : BASERUBY = /usr/local/bin/ruby --disable=gems I, [2024-05-14T21:52:32.399152 #2511758] INFO -- : CC = gcc I, [2024-05-14T21:52:32.399163 #2511758] INFO -- : LD = ld I, [2024-05-14T21:52:32.399172 #2511758] INFO -- : LDSHARED = gcc -shared I, [2024-05-14T21:52:32.399184 #2511758] INFO -- : CFLAGS = -O3 -fno-fast-math -ggdb3 -Wall -Wextra -Wdeprecated-declarations -Wdiv-by-zero -Wduplicated-cond -Wimplicit-function-declaration -Wimplicit-int -Wpointer-arith -Wwrite-strings -Wold-style-definition -Wimplicit-fallthrough=0 -Wmissing-noreturn -Wno-cast-function-type -Wno-constant-logical-operand -Wno-long-long -Wno-missing-field-initializers -Wno-overlength-strings -Wno-packed-bitfield-compat -Wno-parentheses-equality -Wno-self-assign -Wno-tautological-compare -Wno-unused-parameter -Wno-unused-value -Wsuggest-attribute=format -Wsuggest-attribute=noreturn -Wunused-variable -Wmisleading-indentation -Wundef I, [2024-05-14T21:52:32.399195 #2511758] INFO -- : XCFLAGS = -U_FORTIFY_SOURCE -D_FORTIFY_SOURCE=2 -fstack-protector-strong -msign-return-address=all -fno-strict-overflow -fvisibility=hidden -fexcess-precision=standard -DRUBY_EXPORT -fPIE -I. -I.ext/include/aarch64-linux -I/home/opc/ruby/src/master/include -I/home/opc/ruby/src/master -I/home/opc/ruby/src/master/prism -I/home/opc/ruby/src/master/enc/unicode/15.0.0 I, [2024-05-14T21:52:32.399203 #2511758] INFO -- : CPPFLAGS = I, [2024-05-14T21:52:32.399211 #2511758] INFO -- : DLDFLAGS = -Wl,--compress-debug-sections=zlib -fstack-protector-strong -pie I, [2024-05-14T21:52:32.399220 #2511758] INFO -- : SOLIBS = -lz -lrt -lrt -ldl -lcrypt -lm -lpthread I, [2024-05-14T21:52:32.399229 #2511758] INFO -- : LANG = en_US.UTF-8 I, [2024-05-14T21:52:32.399236 #2511758] INFO -- : LC_ALL = I, [2024-05-14T21:52:32.399244 #2511758] INFO -- : LC_CTYPE = I, [2024-05-14T21:52:32.399252 #2511758] INFO -- : MFLAGS = I, [2024-05-14T21:52:32.399260 #2511758] INFO -- : RUSTC = rustc I, [2024-05-14T21:52:32.399268 #2511758] INFO -- : YJIT_RUSTC_ARGS = --crate-name=yjit --crate-type=staticlib --edition=2021 -g -C lto=thin -C opt-level=3 -C overflow-checks=on '--out-dir=/home/opc/ruby/build/master/yjit/target/release/' /home/opc/ruby/src/master/yjit/src/lib.rs I, [2024-05-14T21:52:32.400070 #2511758] INFO -- : gcc (GCC) 8.5.0 20210514 (Red Hat 8.5.0-10.1.0.1) I, [2024-05-14T21:52:32.400115 #2511758] INFO -- : Copyright (C) 2018 Free Software Foundation, Inc. I, [2024-05-14T21:52:32.400126 #2511758] INFO -- : This is free software; see the source for copying conditions. There is NO I, [2024-05-14T21:52:32.400135 #2511758] INFO -- : warranty; not even for MERCHANTABILITY or FITNESS FOR A PARTICULAR PURPOSE. I, [2024-05-14T21:52:32.400144 #2511758] INFO -- : I, [2024-05-14T21:52:32.402145 #2511758] INFO -- : generating enc.mk I, [2024-05-14T21:52:32.633304 #2511758] INFO -- : generating encdb.h I, [2024-05-14T21:52:32.670674 #2511758] INFO -- : encdb.h unchanged I, [2024-05-14T21:52:32.671901 #2511758] INFO -- : making enc I, [2024-05-14T21:52:32.699122 #2511758] INFO -- : make[1]: Entering directory '/home/opc/ruby/build/master' I, [2024-05-14T21:52:32.699188 #2511758] INFO -- : make[1]: Nothing to be done for 'enc'. I, [2024-05-14T21:52:32.699199 #2511758] INFO -- : make[1]: Leaving directory '/home/opc/ruby/build/master' I, [2024-05-14T21:52:32.699943 #2511758] INFO -- : making srcs under enc I, [2024-05-14T21:52:32.741864 #2511758] INFO -- : make[1]: Entering directory '/home/opc/ruby/build/master' I, [2024-05-14T21:52:32.741934 #2511758] INFO -- : make[1]: Nothing to be done for 'srcs'. I, [2024-05-14T21:52:32.741945 #2511758] INFO -- : make[1]: Leaving directory '/home/opc/ruby/build/master' I, [2024-05-14T21:52:32.743082 #2511758] INFO -- : generating transdb.h I, [2024-05-14T21:52:32.887205 #2511758] INFO -- : transdb.h unchanged I, [2024-05-14T21:52:32.888646 #2511758] INFO -- : making trans I, [2024-05-14T21:52:32.937990 #2511758] INFO -- : make[1]: Entering directory '/home/opc/ruby/build/master' I, [2024-05-14T21:52:32.938041 #2511758] INFO -- : make[1]: Nothing to be done for 'trans'. I, [2024-05-14T21:52:32.938052 #2511758] INFO -- : make[1]: Leaving directory '/home/opc/ruby/build/master' I, [2024-05-14T21:52:32.938887 #2511758] INFO -- : making encs I, [2024-05-14T21:52:32.991133 #2511758] INFO -- : make[1]: Entering directory '/home/opc/ruby/build/master' I, [2024-05-14T21:52:32.991202 #2511758] INFO -- : make[1]: Nothing to be done for 'encs'. I, [2024-05-14T21:52:32.991214 #2511758] INFO -- : make[1]: Leaving directory '/home/opc/ruby/build/master' I, [2024-05-14T21:52:32.993279 #2511758] INFO -- : generating makefiles ext/configure-ext.mk I, [2024-05-14T21:52:33.033536 #2511758] INFO -- : ext/configure-ext.mk updated I, [2024-05-14T21:52:33.037007 #2511758] INFO -- : make[1]: Entering directory '/home/opc/ruby/build/master' I, [2024-05-14T21:52:35.078328 #2511758] INFO -- : make[1]: Leaving directory '/home/opc/ruby/build/master' I, [2024-05-14T21:52:35.079058 #2511758] INFO -- : generating makefile exts.mk I, [2024-05-14T21:52:35.137874 #2511758] INFO -- : exts.mk unchanged I, [2024-05-14T21:52:35.142850 #2511758] INFO -- : make[1]: Entering directory '/home/opc/ruby/build/master' I, [2024-05-14T21:52:35.440000 #2511758] INFO -- : make[2]: Entering directory '/home/opc/ruby/build/master/ext/coverage' I, [2024-05-14T21:52:35.444575 #2511758] INFO -- : make[2]: Leaving directory '/home/opc/ruby/build/master/ext/coverage' I, [2024-05-14T21:52:35.450139 #2511758] INFO -- : make[2]: Entering directory '/home/opc/ruby/build/master/ext/date' I, [2024-05-14T21:52:35.455468 #2511758] INFO -- : make[2]: Leaving directory '/home/opc/ruby/build/master/ext/date' I, [2024-05-14T21:52:35.458844 #2511758] INFO -- : make[2]: Entering directory '/home/opc/ruby/build/master/ext/digest' I, [2024-05-14T21:52:35.467657 #2511758] INFO -- : make[2]: Leaving directory '/home/opc/ruby/build/master/ext/digest' I, [2024-05-14T21:52:35.490570 #2511758] INFO -- : make[2]: Entering directory '/home/opc/ruby/build/master/ext/digest/sha2' I, [2024-05-14T21:52:35.495634 #2511758] INFO -- : make[2]: Leaving directory '/home/opc/ruby/build/master/ext/digest/sha2' I, [2024-05-14T21:52:35.514058 #2511758] INFO -- : make[2]: Entering directory '/home/opc/ruby/build/master/ext/fiddle' I, [2024-05-14T21:52:35.524305 #2511758] INFO -- : make[2]: Leaving directory '/home/opc/ruby/build/master/ext/fiddle' I, [2024-05-14T21:52:35.528599 #2511758] INFO -- : make[2]: Entering directory '/home/opc/ruby/build/master/ext/io/console' I, [2024-05-14T21:52:35.532877 #2511758] INFO -- : make[2]: Leaving directory '/home/opc/ruby/build/master/ext/io/console' I, [2024-05-14T21:52:35.543479 #2511758] INFO -- : make[2]: Entering directory '/home/opc/ruby/build/master/ext/json' I, [2024-05-14T21:52:35.552939 #2511758] INFO -- : make[2]: Leaving directory '/home/opc/ruby/build/master/ext/json' I, [2024-05-14T21:52:35.565870 #2511758] INFO -- : make[2]: Entering directory '/home/opc/ruby/build/master/ext/monitor' I, [2024-05-14T21:52:35.570067 #2511758] INFO -- : make[2]: Leaving directory '/home/opc/ruby/build/master/ext/monitor' I, [2024-05-14T21:52:35.577143 #2511758] INFO -- : make[2]: Entering directory '/home/opc/ruby/build/master/ext/objspace' I, [2024-05-14T21:52:35.583394 #2511758] INFO -- : make[2]: Leaving directory '/home/opc/ruby/build/master/ext/objspace' I, [2024-05-14T21:52:35.602565 #2511758] INFO -- : make[2]: Entering directory '/home/opc/ruby/build/master/ext/openssl' I, [2024-05-14T21:52:35.624337 #2511758] INFO -- : make[2]: Leaving directory '/home/opc/ruby/build/master/ext/openssl' I, [2024-05-14T21:52:35.628537 #2511758] INFO -- : make[2]: Entering directory '/home/opc/ruby/build/master/ext/pathname' I, [2024-05-14T21:52:35.632690 #2511758] INFO -- : make[2]: Leaving directory '/home/opc/ruby/build/master/ext/pathname' I, [2024-05-14T21:52:35.638956 #2511758] INFO -- : make[2]: Entering directory '/home/opc/ruby/build/master/ext/psych' I, [2024-05-14T21:52:35.660178 #2511758] INFO -- : make[2]: Leaving directory '/home/opc/ruby/build/master/ext/psych' I, [2024-05-14T21:52:35.664631 #2511758] INFO -- : make[2]: Entering directory '/home/opc/ruby/build/master/ext/pty' I, [2024-05-14T21:52:35.669165 #2511758] INFO -- : make[2]: Leaving directory '/home/opc/ruby/build/master/ext/pty' I, [2024-05-14T21:52:35.682676 #2511758] INFO -- : make[2]: Entering directory '/home/opc/ruby/build/master/ext/ripper' I, [2024-05-14T21:52:35.690425 #2511758] INFO -- : make[2]: Leaving directory '/home/opc/ruby/build/master/ext/ripper' I, [2024-05-14T21:52:35.692518 #2511758] INFO -- : make[2]: Entering directory '/home/opc/ruby/build/master/ext/rubyvm' I, [2024-05-14T21:52:35.695960 #2511758] INFO -- : make[2]: Leaving directory '/home/opc/ruby/build/master/ext/rubyvm' I, [2024-05-14T21:52:35.708102 #2511758] INFO -- : make[2]: Entering directory '/home/opc/ruby/build/master/ext/socket' I, [2024-05-14T21:52:35.718847 #2511758] INFO -- : make[2]: Leaving directory '/home/opc/ruby/build/master/ext/socket' I, [2024-05-14T21:52:35.734265 #2511758] INFO -- : make[2]: Entering directory '/home/opc/ruby/build/master/.bundle/gems/bigdecimal-3.1.7/ext/bigdecimal' I, [2024-05-14T21:52:35.764299 #2511758] INFO -- : make[2]: Leaving directory '/home/opc/ruby/build/master/.bundle/gems/bigdecimal-3.1.7/ext/bigdecimal' I, [2024-05-14T21:52:35.766927 #2511758] INFO -- : make[2]: Entering directory '/home/opc/ruby/build/master/.bundle/gems/bigdecimal-3.1.8/ext/bigdecimal' I, [2024-05-14T21:52:35.797451 #2511758] INFO -- : make[2]: Leaving directory '/home/opc/ruby/build/master/.bundle/gems/bigdecimal-3.1.8/ext/bigdecimal' I, [2024-05-14T21:52:35.799957 #2511758] INFO -- : make[2]: Entering directory '/home/opc/ruby/build/master/.bundle/gems/debug-1.9.2/ext/debug' I, [2024-05-14T21:52:35.831495 #2511758] INFO -- : make[2]: Leaving directory '/home/opc/ruby/build/master/.bundle/gems/debug-1.9.2/ext/debug' I, [2024-05-14T21:52:35.834004 #2511758] INFO -- : make[2]: Entering directory '/home/opc/ruby/build/master/.bundle/gems/nkf-0.2.0/ext/nkf' I, [2024-05-14T21:52:35.864443 #2511758] INFO -- : make[2]: Leaving directory '/home/opc/ruby/build/master/.bundle/gems/nkf-0.2.0/ext/nkf' I, [2024-05-14T21:52:35.866963 #2511758] INFO -- : make[2]: Entering directory '/home/opc/ruby/build/master/.bundle/gems/racc-1.7.3/ext/racc/cparse' I, [2024-05-14T21:52:35.897137 #2511758] INFO -- : make[2]: Leaving directory '/home/opc/ruby/build/master/.bundle/gems/racc-1.7.3/ext/racc/cparse' I, [2024-05-14T21:52:35.900076 #2511758] INFO -- : make[2]: Entering directory '/home/opc/ruby/build/master/.bundle/gems/rbs-3.4.4/ext/rbs_extension' I, [2024-05-14T21:52:35.930356 #2511758] INFO -- : make[2]: Leaving directory '/home/opc/ruby/build/master/.bundle/gems/rbs-3.4.4/ext/rbs_extension' I, [2024-05-14T21:52:35.932950 #2511758] INFO -- : make[2]: Entering directory '/home/opc/ruby/build/master/.bundle/gems/syslog-0.1.2/ext/syslog' I, [2024-05-14T21:52:35.962990 #2511758] INFO -- : make[2]: Leaving directory '/home/opc/ruby/build/master/.bundle/gems/syslog-0.1.2/ext/syslog' I, [2024-05-14T21:52:36.001329 #2511758] INFO -- : make[2]: Entering directory '/home/opc/ruby/build/master' I, [2024-05-14T21:52:36.084417 #2511758] INFO -- : make[2]: 'ruby' is up to date. I, [2024-05-14T21:52:36.084509 #2511758] INFO -- : make[2]: Leaving directory '/home/opc/ruby/build/master' I, [2024-05-14T21:52:36.084713 #2511758] INFO -- : make[1]: Leaving directory '/home/opc/ruby/build/master' I, [2024-05-14T21:52:36.089136 #2511758] INFO -- : make[1]: Entering directory '/home/opc/ruby/build/master' I, [2024-05-14T21:52:36.089198 #2511758] INFO -- : make[1]: Nothing to be done for 'note'. I, [2024-05-14T21:52:36.089212 #2511758] INFO -- : make[1]: Leaving directory '/home/opc/ruby/build/master' E, [2024-05-14T21:52:36.165151 #2511758] ERROR -- : $ /home/opc/ruby/build/master/miniruby -I/home/opc/ruby/src/master/lib /home/opc/ruby/src/master/tool/runruby.rb --archdir=/home/opc/ruby/build/master --extout=.ext -- /home/opc/ruby/src/master/spec/mspec/bin/mspec-run -B /home/opc/ruby/src/master/spec/default.mspec --error-output stderr --debug -fy -o /tmp/rubytest.d8ohf6/1-mspec-multi-0 E, [2024-05-14T21:52:36.165486 #2511758] ERROR -- : $ /home/opc/ruby/build/master/miniruby -I/home/opc/ruby/src/master/lib /home/opc/ruby/src/master/tool/runruby.rb --archdir=/home/opc/ruby/build/master --extout=.ext -- /home/opc/ruby/src/master/spec/mspec/bin/mspec-run -B /home/opc/ruby/src/master/spec/default.mspec --error-output stderr --debug -fy -o /tmp/rubytest.d8ohf6/2-mspec-multi-1 E, [2024-05-14T21:52:36.165737 #2511758] ERROR -- : $ /home/opc/ruby/build/master/miniruby -I/home/opc/ruby/src/master/lib /home/opc/ruby/src/master/tool/runruby.rb --archdir=/home/opc/ruby/build/master --extout=.ext -- /home/opc/ruby/src/master/spec/mspec/bin/mspec-run -B /home/opc/ruby/src/master/spec/default.mspec --error-output stderr --debug -fy -o /tmp/rubytest.d8ohf6/3-mspec-multi-2 I, [2024-05-14T21:52:36.295980 #2511758] INFO -- : ruby 3.4.0dev (2024-05-14T21:44:34Z master e3e1e53098) [aarch64-linux] I, [2024-05-14T21:52:41.683585 #2511758] INFO -- : 0 ......................................................................... I, [2024-05-14T21:52:44.084924 #2511758] INFO -- : 73 ......................................................................... I, [2024-05-14T21:52:44.272403 #2511758] INFO -- : 146 ......................................................................... I, [2024-05-14T21:52:44.568827 #2511758] INFO -- : 219 ......................................................................... I, [2024-05-14T21:52:44.741508 #2511758] INFO -- : 292 ......................................................................... I, [2024-05-14T21:52:44.974042 #2511758] INFO -- : 365 ......................................................................... I, [2024-05-14T21:52:45.094370 #2511758] INFO -- : 438 ......................................................................... I, [2024-05-14T21:52:45.152048 #2511758] INFO -- : 511 ......................................................................... I, [2024-05-14T21:52:45.208850 #2511758] INFO -- : 584 ......................................................................... I, [2024-05-14T21:52:45.827173 #2511758] INFO -- : 657 ......................................................................... I, [2024-05-14T21:52:45.911844 #2511758] INFO -- : 730 ......................................................................... I, [2024-05-14T21:52:45.959703 #2511758] INFO -- : 803 ......................................................................... I, [2024-05-14T21:52:46.158161 #2511758] INFO -- : 876 ......................................................................... I, [2024-05-14T21:52:46.264022 #2511758] INFO -- : 949 ......................................................................... I, [2024-05-14T21:52:46.860229 #2511758] INFO -- : 1022 ......................................................................... I, [2024-05-14T21:52:49.182263 #2511758] INFO -- : 1095 ......................................................................... I, [2024-05-14T21:52:50.036943 #2511758] INFO -- : 1168 ......................................................................... I, [2024-05-14T21:52:50.239166 #2511758] INFO -- : 1241 ......................................................................... I, [2024-05-14T21:52:50.413895 #2511758] INFO -- : 1314 ......................................................................... I, [2024-05-14T21:52:50.508983 #2511758] INFO -- : 1387 ......................................................................... I, [2024-05-14T21:52:52.575862 #2511758] INFO -- : 1460 ......................................................................... I, [2024-05-14T21:52:56.079047 #2511758] INFO -- : 1533 ......................................................................... I, [2024-05-14T21:52:56.238859 #2511758] INFO -- : 1606 ......................................................................... I, [2024-05-14T21:52:57.063899 #2511758] INFO -- : 1679 ......................................................................... I, [2024-05-14T21:52:57.294389 #2511758] INFO -- : 1752 ......................................................................... I, [2024-05-14T21:52:57.558343 #2511758] INFO -- : 1825 ......................................................................... I, [2024-05-14T21:52:57.875189 #2511758] INFO -- : 1898 ......................................................................... I, [2024-05-14T21:52:58.287542 #2511758] INFO -- : 1971 ......................................................................... I, [2024-05-14T21:52:58.788409 #2511758] INFO -- : 2044 ......................................................................... I, [2024-05-14T21:52:58.868603 #2511758] INFO -- : 2117 ......................................................................... I, [2024-05-14T21:52:58.934300 #2511758] INFO -- : 2190 ......................................................................... I, [2024-05-14T21:52:58.983252 #2511758] INFO -- : 2263 ......................................................................... I, [2024-05-14T21:52:59.032138 #2511758] INFO -- : 2336 ......................................................................... I, [2024-05-14T21:52:59.126491 #2511758] INFO -- : 2409 ......................................................................... I, [2024-05-14T21:52:59.413412 #2511758] INFO -- : 2482 ......................................................................... I, [2024-05-14T21:52:59.551776 #2511758] INFO -- : 2555 ......................................................................... I, [2024-05-14T21:53:00.845687 #2511758] INFO -- : 2628 ......................................................................... I, [2024-05-14T21:53:01.020759 #2511758] INFO -- : 2701 ......................................................................... I, [2024-05-14T21:53:01.160725 #2511758] INFO -- : 2774 ......................................................................... I, [2024-05-14T21:53:01.466881 #2511758] INFO -- : 2847 ......................................................................... I, [2024-05-14T21:53:01.726968 #2511758] INFO -- : 2920 ......................................................................... I, [2024-05-14T21:53:01.824972 #2511758] INFO -- : 2993 ......................................................................... I, [2024-05-14T21:53:01.894119 #2511758] INFO -- : 3066 ......................................................................... I, [2024-05-14T21:53:01.957405 #2511758] INFO -- : 3139 ......................................................................... I, [2024-05-14T21:53:02.023666 #2511758] INFO -- : 3212 ......................................................................... I, [2024-05-14T21:53:02.100893 #2511758] INFO -- : 3285 ......................................................................... I, [2024-05-14T21:53:05.920731 #2511758] INFO -- : 3358 ........................................................................ I, [2024-05-14T21:53:05.920804 #2511758] INFO -- : I, [2024-05-14T21:53:05.920815 #2511758] INFO -- : Finished in 29.755454 seconds I, [2024-05-14T21:53:05.920823 #2511758] INFO -- : I, [2024-05-14T21:53:05.920832 #2511758] INFO -- : 3429 files, 32607 examples, 183084 expectations, 0 failures, 0 errors, 0 tagged I, [2024-05-14T21:53:05.922457 #2511758] INFO -- : $$$[end] "make yes-test-rubyspec MSPECOPT='--error-output stderr --debug -j' TESTS='-j3'" exit with 0.