# Logfile created on 2024-05-13 21:49:36 +0000 by logger.rb/v1.5.3 I, [2024-05-13T21:49:36.576358 #1989258] INFO -- : #, @formatter=nil, @logdev=#, @binmode=false, @mon_data=#, @mon_data_owner_object_id=860>>> I, [2024-05-13T21:49:36.576681 #1989258] INFO -- : $$$[beg] make update-unicode -j3 I, [2024-05-13T21:49:36.665536 #1989258] INFO -- : Downloading Unicode emoji 15.0 files... I, [2024-05-13T21:49:36.665905 #1989258] INFO -- : Downloading Unicode emoji 15.0 files... I, [2024-05-13T21:49:36.666105 #1989258] INFO -- : Downloading Unicode emoji 15.0 files... I, [2024-05-13T21:49:36.742276 #1989258] INFO -- : made symlink emoji/15.0/emoji-sequences.txt to /home/opc/ruby/src/master/.downloaded-cache/emoji/15.0/emoji-sequences.txt I, [2024-05-13T21:49:36.743047 #1989258] INFO -- : downloading emoji/15.0/emoji-test.txt ... /home/opc/ruby/src/master/enc/unicode/data/emoji/15.0/emoji-sequences.txt already exists I, [2024-05-13T21:49:36.744838 #1989258] INFO -- : downloading emoji/15.0/emoji-test.txt ... /home/opc/ruby/src/master/enc/unicode/data/emoji/15.0/emoji-sequences.txt already exists E, [2024-05-13T21:49:37.253084 #1989258] ERROR -- : /home/opc/ruby/src/master/tool/downloader.rb:302:in `rescue in download': failed to download emoji/15.0/emoji-test.txt (RuntimeError) E, [2024-05-13T21:49:37.253153 #1989258] ERROR -- : OpenURI::HTTPError: 403 Forbidden: https://www.unicode.org/Public/emoji/15.0/emoji-test.txt E, [2024-05-13T21:49:37.253164 #1989258] ERROR -- : from /home/opc/ruby/src/master/tool/downloader.rb:201:in `download' E, [2024-05-13T21:49:37.253174 #1989258] ERROR -- : from /home/opc/ruby/src/master/tool/downloader.rb:136:in `download' E, [2024-05-13T21:49:37.253182 #1989258] ERROR -- : from /home/opc/ruby/src/master/tool/downloader.rb:482:in `block in
' E, [2024-05-13T21:49:37.253190 #1989258] ERROR -- : from /home/opc/ruby/src/master/tool/downloader.rb:465:in `each' E, [2024-05-13T21:49:37.253198 #1989258] ERROR -- : from /home/opc/ruby/src/master/tool/downloader.rb:465:in `
' E, [2024-05-13T21:49:37.253206 #1989258] ERROR -- : /usr/local/lib/ruby/3.2.0/open-uri.rb:369:in `open_http': 403 Forbidden (OpenURI::HTTPError) E, [2024-05-13T21:49:37.253215 #1989258] ERROR -- : from /usr/local/lib/ruby/3.2.0/open-uri.rb:760:in `buffer_open' E, [2024-05-13T21:49:37.253223 #1989258] ERROR -- : from /usr/local/lib/ruby/3.2.0/open-uri.rb:214:in `block in open_loop' E, [2024-05-13T21:49:37.253231 #1989258] ERROR -- : from /usr/local/lib/ruby/3.2.0/open-uri.rb:212:in `catch' E, [2024-05-13T21:49:37.253239 #1989258] ERROR -- : from /usr/local/lib/ruby/3.2.0/open-uri.rb:212:in `open_loop' E, [2024-05-13T21:49:37.253247 #1989258] ERROR -- : from /usr/local/lib/ruby/3.2.0/open-uri.rb:153:in `open_uri' E, [2024-05-13T21:49:37.253255 #1989258] ERROR -- : from /usr/local/lib/ruby/3.2.0/open-uri.rb:740:in `open' E, [2024-05-13T21:49:37.253266 #1989258] ERROR -- : from /usr/local/lib/ruby/3.2.0/open-uri.rb:748:in `read' E, [2024-05-13T21:49:37.253274 #1989258] ERROR -- : from /home/opc/ruby/src/master/tool/downloader.rb:247:in `block in download' E, [2024-05-13T21:49:37.253283 #1989258] ERROR -- : from /home/opc/ruby/src/master/tool/downloader.rb:378:in `with_retry' E, [2024-05-13T21:49:37.253291 #1989258] ERROR -- : from /home/opc/ruby/src/master/tool/downloader.rb:246:in `download' E, [2024-05-13T21:49:37.253299 #1989258] ERROR -- : from /home/opc/ruby/src/master/tool/downloader.rb:136:in `download' E, [2024-05-13T21:49:37.253307 #1989258] ERROR -- : from /home/opc/ruby/src/master/tool/downloader.rb:482:in `block in
' E, [2024-05-13T21:49:37.253315 #1989258] ERROR -- : from /home/opc/ruby/src/master/tool/downloader.rb:465:in `each' E, [2024-05-13T21:49:37.253323 #1989258] ERROR -- : from /home/opc/ruby/src/master/tool/downloader.rb:465:in `
' E, [2024-05-13T21:49:37.255981 #1989258] ERROR -- : make: *** [uncommon.mk:1765: /home/opc/ruby/src/master/enc/unicode/data/emoji/15.0/emoji-zwj-sequences.txt] Error 1 E, [2024-05-13T21:49:37.256011 #1989258] ERROR -- : make: *** Waiting for unfinished jobs.... E, [2024-05-13T21:49:37.264723 #1989258] ERROR -- : /home/opc/ruby/src/master/tool/downloader.rb:302:in `rescue in download': failed to download emoji/15.0/emoji-test.txt (RuntimeError) E, [2024-05-13T21:49:37.264773 #1989258] ERROR -- : OpenURI::HTTPError: 403 Forbidden: https://www.unicode.org/Public/emoji/15.0/emoji-test.txt E, [2024-05-13T21:49:37.264783 #1989258] ERROR -- : from /home/opc/ruby/src/master/tool/downloader.rb:201:in `download' E, [2024-05-13T21:49:37.264792 #1989258] ERROR -- : from /home/opc/ruby/src/master/tool/downloader.rb:136:in `download' E, [2024-05-13T21:49:37.264801 #1989258] ERROR -- : from /home/opc/ruby/src/master/tool/downloader.rb:482:in `block in
' E, [2024-05-13T21:49:37.264809 #1989258] ERROR -- : from /home/opc/ruby/src/master/tool/downloader.rb:465:in `each' E, [2024-05-13T21:49:37.264817 #1989258] ERROR -- : from /home/opc/ruby/src/master/tool/downloader.rb:465:in `
' E, [2024-05-13T21:49:37.264825 #1989258] ERROR -- : /usr/local/lib/ruby/3.2.0/open-uri.rb:369:in `open_http': 403 Forbidden (OpenURI::HTTPError) E, [2024-05-13T21:49:37.264833 #1989258] ERROR -- : from /usr/local/lib/ruby/3.2.0/open-uri.rb:760:in `buffer_open' E, [2024-05-13T21:49:37.264841 #1989258] ERROR -- : from /usr/local/lib/ruby/3.2.0/open-uri.rb:214:in `block in open_loop' E, [2024-05-13T21:49:37.264849 #1989258] ERROR -- : from /usr/local/lib/ruby/3.2.0/open-uri.rb:212:in `catch' E, [2024-05-13T21:49:37.264857 #1989258] ERROR -- : from /usr/local/lib/ruby/3.2.0/open-uri.rb:212:in `open_loop' E, [2024-05-13T21:49:37.264865 #1989258] ERROR -- : from /usr/local/lib/ruby/3.2.0/open-uri.rb:153:in `open_uri' E, [2024-05-13T21:49:37.264873 #1989258] ERROR -- : from /usr/local/lib/ruby/3.2.0/open-uri.rb:740:in `open' E, [2024-05-13T21:49:37.264881 #1989258] ERROR -- : from /usr/local/lib/ruby/3.2.0/open-uri.rb:748:in `read' E, [2024-05-13T21:49:37.264889 #1989258] ERROR -- : from /home/opc/ruby/src/master/tool/downloader.rb:247:in `block in download' E, [2024-05-13T21:49:37.264897 #1989258] ERROR -- : from /home/opc/ruby/src/master/tool/downloader.rb:378:in `with_retry' E, [2024-05-13T21:49:37.264905 #1989258] ERROR -- : from /home/opc/ruby/src/master/tool/downloader.rb:246:in `download' E, [2024-05-13T21:49:37.264913 #1989258] ERROR -- : from /home/opc/ruby/src/master/tool/downloader.rb:136:in `download' E, [2024-05-13T21:49:37.264921 #1989258] ERROR -- : from /home/opc/ruby/src/master/tool/downloader.rb:482:in `block in
' E, [2024-05-13T21:49:37.264969 #1989258] ERROR -- : from /home/opc/ruby/src/master/tool/downloader.rb:465:in `each' E, [2024-05-13T21:49:37.264978 #1989258] ERROR -- : from /home/opc/ruby/src/master/tool/downloader.rb:465:in `
' E, [2024-05-13T21:49:37.267748 #1989258] ERROR -- : make: *** [uncommon.mk:1765: /home/opc/ruby/src/master/enc/unicode/data/emoji/15.0/emoji-sequences.txt] Error 1 E, [2024-05-13T21:49:37.267795 #1989258] ERROR -- : make: *** Deleting file '/home/opc/ruby/src/master/enc/unicode/data/emoji/15.0/emoji-sequences.txt' E, [2024-05-13T21:49:37.268266 #1989258] ERROR -- : /home/opc/ruby/src/master/tool/downloader.rb:302:in `rescue in download': failed to download emoji/15.0/emoji-test.txt (RuntimeError) E, [2024-05-13T21:49:37.268283 #1989258] ERROR -- : OpenURI::HTTPError: 403 Forbidden: https://www.unicode.org/Public/emoji/15.0/emoji-test.txt E, [2024-05-13T21:49:37.268292 #1989258] ERROR -- : from /home/opc/ruby/src/master/tool/downloader.rb:201:in `download' E, [2024-05-13T21:49:37.268301 #1989258] ERROR -- : from /home/opc/ruby/src/master/tool/downloader.rb:136:in `download' E, [2024-05-13T21:49:37.268309 #1989258] ERROR -- : from /home/opc/ruby/src/master/tool/downloader.rb:482:in `block in
' E, [2024-05-13T21:49:37.268317 #1989258] ERROR -- : from /home/opc/ruby/src/master/tool/downloader.rb:465:in `each' E, [2024-05-13T21:49:37.268326 #1989258] ERROR -- : from /home/opc/ruby/src/master/tool/downloader.rb:465:in `
' E, [2024-05-13T21:49:37.268334 #1989258] ERROR -- : /usr/local/lib/ruby/3.2.0/open-uri.rb:369:in `open_http': 403 Forbidden (OpenURI::HTTPError) E, [2024-05-13T21:49:37.268342 #1989258] ERROR -- : from /usr/local/lib/ruby/3.2.0/open-uri.rb:760:in `buffer_open' E, [2024-05-13T21:49:37.268350 #1989258] ERROR -- : from /usr/local/lib/ruby/3.2.0/open-uri.rb:214:in `block in open_loop' E, [2024-05-13T21:49:37.268358 #1989258] ERROR -- : from /usr/local/lib/ruby/3.2.0/open-uri.rb:212:in `catch' E, [2024-05-13T21:49:37.268366 #1989258] ERROR -- : from /usr/local/lib/ruby/3.2.0/open-uri.rb:212:in `open_loop' E, [2024-05-13T21:49:37.268374 #1989258] ERROR -- : from /usr/local/lib/ruby/3.2.0/open-uri.rb:153:in `open_uri' E, [2024-05-13T21:49:37.268382 #1989258] ERROR -- : from /usr/local/lib/ruby/3.2.0/open-uri.rb:740:in `open' E, [2024-05-13T21:49:37.268390 #1989258] ERROR -- : from /usr/local/lib/ruby/3.2.0/open-uri.rb:748:in `read' E, [2024-05-13T21:49:37.268398 #1989258] ERROR -- : from /home/opc/ruby/src/master/tool/downloader.rb:247:in `block in download' E, [2024-05-13T21:49:37.268406 #1989258] ERROR -- : from /home/opc/ruby/src/master/tool/downloader.rb:378:in `with_retry' E, [2024-05-13T21:49:37.268414 #1989258] ERROR -- : from /home/opc/ruby/src/master/tool/downloader.rb:246:in `download' E, [2024-05-13T21:49:37.268422 #1989258] ERROR -- : from /home/opc/ruby/src/master/tool/downloader.rb:136:in `download' E, [2024-05-13T21:49:37.268430 #1989258] ERROR -- : from /home/opc/ruby/src/master/tool/downloader.rb:482:in `block in
' E, [2024-05-13T21:49:37.268439 #1989258] ERROR -- : from /home/opc/ruby/src/master/tool/downloader.rb:465:in `each' E, [2024-05-13T21:49:37.268447 #1989258] ERROR -- : from /home/opc/ruby/src/master/tool/downloader.rb:465:in `
' E, [2024-05-13T21:49:37.271143 #1989258] ERROR -- : make: *** [uncommon.mk:1765: /home/opc/ruby/src/master/enc/unicode/data/emoji/15.0/emoji-test.txt] Error 1 I, [2024-05-13T21:49:37.271216 #1989258] INFO -- : downloading emoji/15.0/emoji-test.txt ... I, [2024-05-13T21:49:37.271351 #1989258] INFO -- : $$$[end] "make update-unicode -j3" exit with 512. I, [2024-05-13T21:49:37.271393 #1989258] INFO -- : $$$[beg] make update-download -j3 I, [2024-05-13T21:49:37.433589 #1989258] INFO -- : tool/config.guess already exists I, [2024-05-13T21:49:37.433658 #1989258] INFO -- : tool/config.sub already exists I, [2024-05-13T21:49:37.436343 #1989258] INFO -- : Update minitest to ea9caafc0754b1d6236a490d59e624b53209734a I, [2024-05-13T21:49:37.436522 #1989258] INFO -- : Update power_assert to 84e85124c5014a139af39161d484156cfe87a9ed I, [2024-05-13T21:49:37.436888 #1989258] INFO -- : Update rbs to ba7872795d5de04adb8ff500c0e6afdc81a041dd I, [2024-05-13T21:49:37.439819 #1989258] INFO -- : echo ea9caafc0754b1d6236a490d59e624b53209734a | /bin/sh /home/opc/ruby/src/master/tool/ifchange /home/opc/ruby/src/master/.bundle/.timestamp/minitest.revision - I, [2024-05-13T21:49:37.440050 #1989258] INFO -- : echo 84e85124c5014a139af39161d484156cfe87a9ed | /bin/sh /home/opc/ruby/src/master/tool/ifchange /home/opc/ruby/src/master/.bundle/.timestamp/power_assert.revision - I, [2024-05-13T21:49:37.440192 #1989258] INFO -- : echo ba7872795d5de04adb8ff500c0e6afdc81a041dd | /bin/sh /home/opc/ruby/src/master/tool/ifchange /home/opc/ruby/src/master/.bundle/.timestamp/rbs.revision - I, [2024-05-13T21:49:37.445483 #1989258] INFO -- : /home/opc/ruby/src/master/.bundle/.timestamp/power_assert.revision unchanged I, [2024-05-13T21:49:37.446230 #1989258] INFO -- : /home/opc/ruby/src/master/.bundle/.timestamp/rbs.revision unchanged I, [2024-05-13T21:49:37.446314 #1989258] INFO -- : /home/opc/ruby/src/master/.bundle/.timestamp/minitest.revision unchanged I, [2024-05-13T21:49:37.447874 #1989258] INFO -- : Update typeprof to b19a6416da3a05d57fadd6ffdadb382b6d236ca5 I, [2024-05-13T21:49:37.457120 #1989258] INFO -- : echo b19a6416da3a05d57fadd6ffdadb382b6d236ca5 | /bin/sh /home/opc/ruby/src/master/tool/ifchange /home/opc/ruby/src/master/.bundle/.timestamp/typeprof.revision - I, [2024-05-13T21:49:37.462903 #1989258] INFO -- : /home/opc/ruby/src/master/.bundle/.timestamp/typeprof.revision unchanged I, [2024-05-13T21:49:37.535689 #1989258] INFO -- : Building power_assert@84e85124c5014a139af39161d484156cfe87a9ed to /home/opc/ruby/src/master/gems/power_assert-2.0.3.gem I, [2024-05-13T21:49:37.645404 #1989258] INFO -- : Successfully built RubyGem I, [2024-05-13T21:49:37.645464 #1989258] INFO -- : Name: power_assert I, [2024-05-13T21:49:37.645474 #1989258] INFO -- : Version: 2.0.4dev I, [2024-05-13T21:49:37.645483 #1989258] INFO -- : File: power_assert-2.0.4dev.gem I, [2024-05-13T21:49:37.727573 #1989258] INFO -- : $$$[end] "make update-download -j3" exit with 0. I, [2024-05-13T21:49:37.727650 #1989258] INFO -- : $$$[beg] make update-rubyspec -j3 I, [2024-05-13T21:49:37.816671 #1989258] INFO -- : make: Nothing to be done for 'update-rubyspec'. I, [2024-05-13T21:49:37.816865 #1989258] INFO -- : $$$[end] "make update-rubyspec -j3" exit with 0. I, [2024-05-13T21:49:37.816914 #1989258] INFO -- : $$$[beg] make update-src -j3 I, [2024-05-13T21:49:38.790850 #1989258] INFO -- : Already up to date. I, [2024-05-13T21:49:38.808301 #1989258] INFO -- : Latest commit hash = 5319587ac3 I, [2024-05-13T21:49:38.809478 #1989258] INFO -- : $$$[end] "make update-src -j3" exit with 0. I, [2024-05-13T21:49:38.809524 #1989258] INFO -- : $$$[beg] make after-update -j3 I, [2024-05-13T21:49:38.915542 #1989258] INFO -- : generating /home/opc/ruby/src/master/ext/ripper/eventids2table.c I, [2024-05-13T21:49:38.921946 #1989258] INFO -- : make[1]: Entering directory '/home/opc/ruby/src/master/ext/ripper' I, [2024-05-13T21:49:38.922004 #1989258] INFO -- : make[1]: Nothing to be done for 'src'. I, [2024-05-13T21:49:38.922014 #1989258] INFO -- : make[1]: Leaving directory '/home/opc/ruby/src/master/ext/ripper' I, [2024-05-13T21:49:38.950060 #1989258] INFO -- : /home/opc/ruby/src/master/revision.h updated I, [2024-05-13T21:49:38.951160 #1989258] INFO -- : generating aarch64-linux-fake.rb I, [2024-05-13T21:49:39.007758 #1989258] INFO -- : aarch64-linux-fake.rb updated I, [2024-05-13T21:49:39.009462 #1989258] INFO -- : generating enc.mk I, [2024-05-13T21:49:39.239670 #1989258] INFO -- : making srcs under enc I, [2024-05-13T21:49:39.281670 #1989258] INFO -- : make[1]: Entering directory '/home/opc/ruby/build/master' I, [2024-05-13T21:49:39.281734 #1989258] INFO -- : make[1]: Nothing to be done for 'srcs'. I, [2024-05-13T21:49:39.281753 #1989258] INFO -- : make[1]: Leaving directory '/home/opc/ruby/build/master' I, [2024-05-13T21:49:39.362659 #1989258] INFO -- : Update minitest to ea9caafc0754b1d6236a490d59e624b53209734a I, [2024-05-13T21:49:39.362725 #1989258] INFO -- : Update power_assert to 84e85124c5014a139af39161d484156cfe87a9ed I, [2024-05-13T21:49:39.363148 #1989258] INFO -- : Update rbs to ba7872795d5de04adb8ff500c0e6afdc81a041dd I, [2024-05-13T21:49:39.366067 #1989258] INFO -- : echo 84e85124c5014a139af39161d484156cfe87a9ed | /bin/sh /home/opc/ruby/src/master/tool/ifchange /home/opc/ruby/src/master/.bundle/.timestamp/power_assert.revision - I, [2024-05-13T21:49:39.366362 #1989258] INFO -- : echo ea9caafc0754b1d6236a490d59e624b53209734a | /bin/sh /home/opc/ruby/src/master/tool/ifchange /home/opc/ruby/src/master/.bundle/.timestamp/minitest.revision - I, [2024-05-13T21:49:39.366401 #1989258] INFO -- : echo ba7872795d5de04adb8ff500c0e6afdc81a041dd | /bin/sh /home/opc/ruby/src/master/tool/ifchange /home/opc/ruby/src/master/.bundle/.timestamp/rbs.revision - I, [2024-05-13T21:49:39.371849 #1989258] INFO -- : /home/opc/ruby/src/master/.bundle/.timestamp/power_assert.revision unchanged I, [2024-05-13T21:49:39.372079 #1989258] INFO -- : /home/opc/ruby/src/master/.bundle/.timestamp/minitest.revision unchanged I, [2024-05-13T21:49:39.373797 #1989258] INFO -- : /home/opc/ruby/src/master/.bundle/.timestamp/rbs.revision unchanged I, [2024-05-13T21:49:39.374687 #1989258] INFO -- : Update typeprof to b19a6416da3a05d57fadd6ffdadb382b6d236ca5 I, [2024-05-13T21:49:39.383677 #1989258] INFO -- : echo b19a6416da3a05d57fadd6ffdadb382b6d236ca5 | /bin/sh /home/opc/ruby/src/master/tool/ifchange /home/opc/ruby/src/master/.bundle/.timestamp/typeprof.revision - I, [2024-05-13T21:49:39.390165 #1989258] INFO -- : /home/opc/ruby/src/master/.bundle/.timestamp/typeprof.revision unchanged I, [2024-05-13T21:49:39.463204 #1989258] INFO -- : Building power_assert@84e85124c5014a139af39161d484156cfe87a9ed to /home/opc/ruby/src/master/gems/power_assert-2.0.3.gem I, [2024-05-13T21:49:39.576300 #1989258] INFO -- : Successfully built RubyGem I, [2024-05-13T21:49:39.576360 #1989258] INFO -- : Name: power_assert I, [2024-05-13T21:49:39.576370 #1989258] INFO -- : Version: 2.0.4dev I, [2024-05-13T21:49:39.576379 #1989258] INFO -- : File: power_assert-2.0.4dev.gem I, [2024-05-13T21:49:39.578762 #1989258] INFO -- : Extracting bundle gem power_assert-2.0.3... I, [2024-05-13T21:49:39.675015 #1989258] INFO -- : Try with hash version of bundled gems instead of gems/power_assert-2.0.3.gem. We don't use this gem with release version of Ruby. I, [2024-05-13T21:49:39.685689 #1989258] INFO -- : Unpacked gems/power_assert-2.0.4dev.gem I, [2024-05-13T21:49:39.687930 #1989258] INFO -- : $$$[end] "make after-update -j3" exit with 0. I, [2024-05-13T21:49:39.688070 #1989258] INFO -- : $$$[beg] make miniruby -j3 I, [2024-05-13T21:49:39.777309 #1989258] INFO -- : BASERUBY = /usr/local/bin/ruby --disable=gems I, [2024-05-13T21:49:39.777375 #1989258] INFO -- : CC = gcc I, [2024-05-13T21:49:39.777387 #1989258] INFO -- : LD = ld I, [2024-05-13T21:49:39.777395 #1989258] INFO -- : LDSHARED = gcc -shared I, [2024-05-13T21:49:39.777406 #1989258] INFO -- : CFLAGS = -O3 -fno-fast-math -ggdb3 -Wall -Wextra -Wdeprecated-declarations -Wdiv-by-zero -Wduplicated-cond -Wimplicit-function-declaration -Wimplicit-int -Wpointer-arith -Wwrite-strings -Wold-style-definition -Wimplicit-fallthrough=0 -Wmissing-noreturn -Wno-cast-function-type -Wno-constant-logical-operand -Wno-long-long -Wno-missing-field-initializers -Wno-overlength-strings -Wno-packed-bitfield-compat -Wno-parentheses-equality -Wno-self-assign -Wno-tautological-compare -Wno-unused-parameter -Wno-unused-value -Wsuggest-attribute=format -Wsuggest-attribute=noreturn -Wunused-variable -Wmisleading-indentation -Wundef I, [2024-05-13T21:49:39.777416 #1989258] INFO -- : XCFLAGS = -U_FORTIFY_SOURCE -D_FORTIFY_SOURCE=2 -fstack-protector-strong -msign-return-address=all -fno-strict-overflow -fvisibility=hidden -fexcess-precision=standard -DRUBY_EXPORT -fPIE -I. -I.ext/include/aarch64-linux -I/home/opc/ruby/src/master/include -I/home/opc/ruby/src/master -I/home/opc/ruby/src/master/prism -I/home/opc/ruby/src/master/enc/unicode/15.0.0 I, [2024-05-13T21:49:39.777425 #1989258] INFO -- : CPPFLAGS = I, [2024-05-13T21:49:39.777433 #1989258] INFO -- : DLDFLAGS = -Wl,--compress-debug-sections=zlib -fstack-protector-strong -pie I, [2024-05-13T21:49:39.777445 #1989258] INFO -- : SOLIBS = -lz -lrt -lrt -ldl -lcrypt -lm -lpthread I, [2024-05-13T21:49:39.777454 #1989258] INFO -- : LANG = en_US.UTF-8 I, [2024-05-13T21:49:39.777462 #1989258] INFO -- : LC_ALL = I, [2024-05-13T21:49:39.777470 #1989258] INFO -- : LC_CTYPE = I, [2024-05-13T21:49:39.777477 #1989258] INFO -- : MFLAGS = -j3 --jobserver-auth=4,5 I, [2024-05-13T21:49:39.777485 #1989258] INFO -- : RUSTC = rustc I, [2024-05-13T21:49:39.777493 #1989258] INFO -- : YJIT_RUSTC_ARGS = --crate-name=yjit --crate-type=staticlib --edition=2021 -g -C lto=thin -C opt-level=3 -C overflow-checks=on '--out-dir=/home/opc/ruby/build/master/yjit/target/release/' /home/opc/ruby/src/master/yjit/src/lib.rs I, [2024-05-13T21:49:39.778231 #1989258] INFO -- : gcc (GCC) 8.5.0 20210514 (Red Hat 8.5.0-10.1.0.1) I, [2024-05-13T21:49:39.778274 #1989258] INFO -- : Copyright (C) 2018 Free Software Foundation, Inc. I, [2024-05-13T21:49:39.778284 #1989258] INFO -- : This is free software; see the source for copying conditions. There is NO I, [2024-05-13T21:49:39.778294 #1989258] INFO -- : warranty; not even for MERCHANTABILITY or FITNESS FOR A PARTICULAR PURPOSE. I, [2024-05-13T21:49:39.778303 #1989258] INFO -- : I, [2024-05-13T21:49:39.803310 #1989258] INFO -- : compiling /home/opc/ruby/src/master/version.c I, [2024-05-13T21:49:39.946623 #1989258] INFO -- : linking miniruby I, [2024-05-13T21:49:40.847213 #1989258] INFO -- : $$$[end] "make miniruby -j3" exit with 0. I, [2024-05-13T21:49:40.847383 #1989258] INFO -- : $$$[beg] make ruby -j3 I, [2024-05-13T21:49:40.935963 #1989258] INFO -- : BASERUBY = /usr/local/bin/ruby --disable=gems I, [2024-05-13T21:49:40.936031 #1989258] INFO -- : CC = gcc I, [2024-05-13T21:49:40.936041 #1989258] INFO -- : LD = ld I, [2024-05-13T21:49:40.936050 #1989258] INFO -- : LDSHARED = gcc -shared I, [2024-05-13T21:49:40.936061 #1989258] INFO -- : CFLAGS = -O3 -fno-fast-math -ggdb3 -Wall -Wextra -Wdeprecated-declarations -Wdiv-by-zero -Wduplicated-cond -Wimplicit-function-declaration -Wimplicit-int -Wpointer-arith -Wwrite-strings -Wold-style-definition -Wimplicit-fallthrough=0 -Wmissing-noreturn -Wno-cast-function-type -Wno-constant-logical-operand -Wno-long-long -Wno-missing-field-initializers -Wno-overlength-strings -Wno-packed-bitfield-compat -Wno-parentheses-equality -Wno-self-assign -Wno-tautological-compare -Wno-unused-parameter -Wno-unused-value -Wsuggest-attribute=format -Wsuggest-attribute=noreturn -Wunused-variable -Wmisleading-indentation -Wundef I, [2024-05-13T21:49:40.936071 #1989258] INFO -- : XCFLAGS = -U_FORTIFY_SOURCE -D_FORTIFY_SOURCE=2 -fstack-protector-strong -msign-return-address=all -fno-strict-overflow -fvisibility=hidden -fexcess-precision=standard -DRUBY_EXPORT -fPIE -I. -I.ext/include/aarch64-linux -I/home/opc/ruby/src/master/include -I/home/opc/ruby/src/master -I/home/opc/ruby/src/master/prism -I/home/opc/ruby/src/master/enc/unicode/15.0.0 I, [2024-05-13T21:49:40.936079 #1989258] INFO -- : CPPFLAGS = I, [2024-05-13T21:49:40.936088 #1989258] INFO -- : DLDFLAGS = -Wl,--compress-debug-sections=zlib -fstack-protector-strong -pie I, [2024-05-13T21:49:40.936097 #1989258] INFO -- : SOLIBS = -lz -lrt -lrt -ldl -lcrypt -lm -lpthread I, [2024-05-13T21:49:40.936105 #1989258] INFO -- : LANG = en_US.UTF-8 I, [2024-05-13T21:49:40.936112 #1989258] INFO -- : LC_ALL = I, [2024-05-13T21:49:40.936120 #1989258] INFO -- : LC_CTYPE = I, [2024-05-13T21:49:40.936128 #1989258] INFO -- : MFLAGS = -j3 --jobserver-auth=4,5 I, [2024-05-13T21:49:40.936136 #1989258] INFO -- : RUSTC = rustc I, [2024-05-13T21:49:40.936145 #1989258] INFO -- : YJIT_RUSTC_ARGS = --crate-name=yjit --crate-type=staticlib --edition=2021 -g -C lto=thin -C opt-level=3 -C overflow-checks=on '--out-dir=/home/opc/ruby/build/master/yjit/target/release/' /home/opc/ruby/src/master/yjit/src/lib.rs I, [2024-05-13T21:49:40.936948 #1989258] INFO -- : gcc (GCC) 8.5.0 20210514 (Red Hat 8.5.0-10.1.0.1) I, [2024-05-13T21:49:40.936994 #1989258] INFO -- : Copyright (C) 2018 Free Software Foundation, Inc. I, [2024-05-13T21:49:40.937011 #1989258] INFO -- : This is free software; see the source for copying conditions. There is NO I, [2024-05-13T21:49:40.937022 #1989258] INFO -- : warranty; not even for MERCHANTABILITY or FITNESS FOR A PARTICULAR PURPOSE. I, [2024-05-13T21:49:40.937031 #1989258] INFO -- : I, [2024-05-13T21:49:41.114772 #1989258] INFO -- : builtin_binary.inc updated I, [2024-05-13T21:49:41.120141 #1989258] INFO -- : c5234a9416e4f20f175185e840b25b0f08674d14078ed7083f37e655458e3ca9 builtin_binary.inc I, [2024-05-13T21:49:41.121084 #1989258] INFO -- : compiling /home/opc/ruby/src/master/builtin.c I, [2024-05-13T21:49:41.445233 #1989258] INFO -- : linking static-library libruby-static.a I, [2024-05-13T21:49:44.304100 #1989258] INFO -- : linking ruby I, [2024-05-13T21:49:45.219896 #1989258] INFO -- : $$$[end] "make ruby -j3" exit with 0. I, [2024-05-13T21:49:45.220063 #1989258] INFO -- : $$$[beg] make all -j3 I, [2024-05-13T21:49:45.307997 #1989258] INFO -- : BASERUBY = /usr/local/bin/ruby --disable=gems I, [2024-05-13T21:49:45.308062 #1989258] INFO -- : CC = gcc I, [2024-05-13T21:49:45.308073 #1989258] INFO -- : LD = ld I, [2024-05-13T21:49:45.308084 #1989258] INFO -- : LDSHARED = gcc -shared I, [2024-05-13T21:49:45.308093 #1989258] INFO -- : CFLAGS = -O3 -fno-fast-math -ggdb3 -Wall -Wextra -Wdeprecated-declarations -Wdiv-by-zero -Wduplicated-cond -Wimplicit-function-declaration -Wimplicit-int -Wpointer-arith -Wwrite-strings -Wold-style-definition -Wimplicit-fallthrough=0 -Wmissing-noreturn -Wno-cast-function-type -Wno-constant-logical-operand -Wno-long-long -Wno-missing-field-initializers -Wno-overlength-strings -Wno-packed-bitfield-compat -Wno-parentheses-equality -Wno-self-assign -Wno-tautological-compare -Wno-unused-parameter -Wno-unused-value -Wsuggest-attribute=format -Wsuggest-attribute=noreturn -Wunused-variable -Wmisleading-indentation -Wundef I, [2024-05-13T21:49:45.308102 #1989258] INFO -- : XCFLAGS = -U_FORTIFY_SOURCE -D_FORTIFY_SOURCE=2 -fstack-protector-strong -msign-return-address=all -fno-strict-overflow -fvisibility=hidden -fexcess-precision=standard -DRUBY_EXPORT -fPIE -I. -I.ext/include/aarch64-linux -I/home/opc/ruby/src/master/include -I/home/opc/ruby/src/master -I/home/opc/ruby/src/master/prism -I/home/opc/ruby/src/master/enc/unicode/15.0.0 I, [2024-05-13T21:49:45.308111 #1989258] INFO -- : CPPFLAGS = I, [2024-05-13T21:49:45.308119 #1989258] INFO -- : DLDFLAGS = -Wl,--compress-debug-sections=zlib -fstack-protector-strong -pie I, [2024-05-13T21:49:45.308127 #1989258] INFO -- : SOLIBS = -lz -lrt -lrt -ldl -lcrypt -lm -lpthread I, [2024-05-13T21:49:45.308136 #1989258] INFO -- : LANG = en_US.UTF-8 I, [2024-05-13T21:49:45.308144 #1989258] INFO -- : LC_ALL = I, [2024-05-13T21:49:45.308152 #1989258] INFO -- : LC_CTYPE = I, [2024-05-13T21:49:45.308160 #1989258] INFO -- : MFLAGS = -j3 --jobserver-auth=4,5 I, [2024-05-13T21:49:45.308168 #1989258] INFO -- : RUSTC = rustc I, [2024-05-13T21:49:45.308176 #1989258] INFO -- : YJIT_RUSTC_ARGS = --crate-name=yjit --crate-type=staticlib --edition=2021 -g -C lto=thin -C opt-level=3 -C overflow-checks=on '--out-dir=/home/opc/ruby/build/master/yjit/target/release/' /home/opc/ruby/src/master/yjit/src/lib.rs I, [2024-05-13T21:49:45.308951 #1989258] INFO -- : gcc (GCC) 8.5.0 20210514 (Red Hat 8.5.0-10.1.0.1) I, [2024-05-13T21:49:45.308993 #1989258] INFO -- : Copyright (C) 2018 Free Software Foundation, Inc. I, [2024-05-13T21:49:45.309003 #1989258] INFO -- : This is free software; see the source for copying conditions. There is NO I, [2024-05-13T21:49:45.309013 #1989258] INFO -- : warranty; not even for MERCHANTABILITY or FITNESS FOR A PARTICULAR PURPOSE. I, [2024-05-13T21:49:45.309022 #1989258] INFO -- : I, [2024-05-13T21:49:45.341852 #1989258] INFO -- : generating encdb.h I, [2024-05-13T21:49:45.343228 #1989258] INFO -- : generating enc.mk I, [2024-05-13T21:49:45.379525 #1989258] INFO -- : encdb.h unchanged I, [2024-05-13T21:49:45.578169 #1989258] INFO -- : making srcs under enc I, [2024-05-13T21:49:45.578242 #1989258] INFO -- : making enc I, [2024-05-13T21:49:45.605974 #1989258] INFO -- : make[1]: Entering directory '/home/opc/ruby/build/master' I, [2024-05-13T21:49:45.606045 #1989258] INFO -- : make[1]: Nothing to be done for 'enc'. I, [2024-05-13T21:49:45.606055 #1989258] INFO -- : make[1]: Leaving directory '/home/opc/ruby/build/master' I, [2024-05-13T21:49:45.620154 #1989258] INFO -- : make[1]: Entering directory '/home/opc/ruby/build/master' I, [2024-05-13T21:49:45.620211 #1989258] INFO -- : make[1]: Nothing to be done for 'srcs'. I, [2024-05-13T21:49:45.620222 #1989258] INFO -- : make[1]: Leaving directory '/home/opc/ruby/build/master' I, [2024-05-13T21:49:45.621025 #1989258] INFO -- : generating transdb.h I, [2024-05-13T21:49:45.763374 #1989258] INFO -- : transdb.h unchanged I, [2024-05-13T21:49:45.764708 #1989258] INFO -- : generating makefiles ext/configure-ext.mk I, [2024-05-13T21:49:45.764834 #1989258] INFO -- : making trans I, [2024-05-13T21:49:45.804015 #1989258] INFO -- : ext/configure-ext.mk updated I, [2024-05-13T21:49:45.807093 #1989258] INFO -- : make[1]: Entering directory '/home/opc/ruby/build/master' I, [2024-05-13T21:49:45.813434 #1989258] INFO -- : make[1]: Entering directory '/home/opc/ruby/build/master' I, [2024-05-13T21:49:45.813505 #1989258] INFO -- : make[1]: Nothing to be done for 'trans'. I, [2024-05-13T21:49:45.813539 #1989258] INFO -- : make[1]: Leaving directory '/home/opc/ruby/build/master' I, [2024-05-13T21:49:46.498163 #1989258] INFO -- : making encs I, [2024-05-13T21:49:46.550371 #1989258] INFO -- : make[1]: Leaving directory '/home/opc/ruby/build/master' I, [2024-05-13T21:49:46.551147 #1989258] INFO -- : generating makefile exts.mk I, [2024-05-13T21:49:46.551399 #1989258] INFO -- : make[1]: Entering directory '/home/opc/ruby/build/master' I, [2024-05-13T21:49:46.551432 #1989258] INFO -- : make[1]: Nothing to be done for 'encs'. I, [2024-05-13T21:49:46.551442 #1989258] INFO -- : make[1]: Leaving directory '/home/opc/ruby/build/master' I, [2024-05-13T21:49:46.610202 #1989258] INFO -- : exts.mk unchanged I, [2024-05-13T21:49:46.615038 #1989258] INFO -- : make[1]: Entering directory '/home/opc/ruby/build/master' I, [2024-05-13T21:49:46.718702 #1989258] INFO -- : make[2]: Entering directory '/home/opc/ruby/build/master/ext/digest' I, [2024-05-13T21:49:46.719611 #1989258] INFO -- : make[2]: Entering directory '/home/opc/ruby/build/master/ext/coverage' I, [2024-05-13T21:49:46.720758 #1989258] INFO -- : make[2]: Entering directory '/home/opc/ruby/build/master/ext/date' I, [2024-05-13T21:49:46.724283 #1989258] INFO -- : make[2]: Leaving directory '/home/opc/ruby/build/master/ext/coverage' I, [2024-05-13T21:49:46.726182 #1989258] INFO -- : make[2]: Leaving directory '/home/opc/ruby/build/master/ext/date' I, [2024-05-13T21:49:46.727752 #1989258] INFO -- : make[2]: Leaving directory '/home/opc/ruby/build/master/ext/digest' I, [2024-05-13T21:49:46.734693 #1989258] INFO -- : make[2]: Entering directory '/home/opc/ruby/build/master/ext/fiddle' I, [2024-05-13T21:49:46.735052 #1989258] INFO -- : make[2]: Entering directory '/home/opc/ruby/build/master/ext/io/console' I, [2024-05-13T21:49:46.740701 #1989258] INFO -- : make[2]: Leaving directory '/home/opc/ruby/build/master/ext/io/console' I, [2024-05-13T21:49:46.742774 #1989258] INFO -- : make[2]: Entering directory '/home/opc/ruby/build/master/ext/json' I, [2024-05-13T21:49:46.744752 #1989258] INFO -- : make[2]: Entering directory '/home/opc/ruby/build/master/ext/monitor' I, [2024-05-13T21:49:46.745360 #1989258] INFO -- : make[2]: Leaving directory '/home/opc/ruby/build/master/ext/fiddle' I, [2024-05-13T21:49:46.749239 #1989258] INFO -- : make[2]: Leaving directory '/home/opc/ruby/build/master/ext/monitor' I, [2024-05-13T21:49:46.751981 #1989258] INFO -- : make[2]: Leaving directory '/home/opc/ruby/build/master/ext/json' I, [2024-05-13T21:49:46.752429 #1989258] INFO -- : make[2]: Entering directory '/home/opc/ruby/build/master/ext/objspace' I, [2024-05-13T21:49:46.756018 #1989258] INFO -- : make[2]: Entering directory '/home/opc/ruby/build/master/ext/pathname' I, [2024-05-13T21:49:46.758425 #1989258] INFO -- : make[2]: Leaving directory '/home/opc/ruby/build/master/ext/objspace' I, [2024-05-13T21:49:46.760780 #1989258] INFO -- : make[2]: Leaving directory '/home/opc/ruby/build/master/ext/pathname' I, [2024-05-13T21:49:46.764756 #1989258] INFO -- : make[2]: Entering directory '/home/opc/ruby/build/master/ext/psych' I, [2024-05-13T21:49:46.765164 #1989258] INFO -- : make[2]: Entering directory '/home/opc/ruby/build/master/ext/pty' I, [2024-05-13T21:49:46.770775 #1989258] INFO -- : make[2]: Entering directory '/home/opc/ruby/build/master/ext/openssl' I, [2024-05-13T21:49:46.775206 #1989258] INFO -- : make[2]: Leaving directory '/home/opc/ruby/build/master/ext/pty' I, [2024-05-13T21:49:46.782225 #1989258] INFO -- : make[2]: Leaving directory '/home/opc/ruby/build/master/ext/psych' I, [2024-05-13T21:49:46.784048 #1989258] INFO -- : make[2]: Entering directory '/home/opc/ruby/build/master/ext/rubyvm' I, [2024-05-13T21:49:46.787384 #1989258] INFO -- : make[2]: Leaving directory '/home/opc/ruby/build/master/ext/rubyvm' I, [2024-05-13T21:49:46.790142 #1989258] INFO -- : make[2]: Entering directory '/home/opc/ruby/build/master/ext/ripper' I, [2024-05-13T21:49:46.793554 #1989258] INFO -- : make[2]: Leaving directory '/home/opc/ruby/build/master/ext/openssl' I, [2024-05-13T21:49:46.798097 #1989258] INFO -- : make[2]: Leaving directory '/home/opc/ruby/build/master/ext/ripper' I, [2024-05-13T21:49:46.799473 #1989258] INFO -- : make[2]: Entering directory '/home/opc/ruby/build/master/ext/socket' I, [2024-05-13T21:49:46.804618 #1989258] INFO -- : make[2]: Entering directory '/home/opc/ruby/build/master/.bundle/gems/bigdecimal-3.1.7/ext/bigdecimal' I, [2024-05-13T21:49:46.805116 #1989258] INFO -- : make[2]: Entering directory '/home/opc/ruby/build/master/.bundle/gems/bigdecimal-3.1.8/ext/bigdecimal' I, [2024-05-13T21:49:46.809969 #1989258] INFO -- : make[2]: Leaving directory '/home/opc/ruby/build/master/ext/socket' I, [2024-05-13T21:49:46.812372 #1989258] INFO -- : make[2]: Entering directory '/home/opc/ruby/build/master/.bundle/gems/debug-1.9.2/ext/debug' I, [2024-05-13T21:49:46.835590 #1989258] INFO -- : make[2]: Leaving directory '/home/opc/ruby/build/master/.bundle/gems/bigdecimal-3.1.7/ext/bigdecimal' I, [2024-05-13T21:49:46.837443 #1989258] INFO -- : make[2]: Leaving directory '/home/opc/ruby/build/master/.bundle/gems/bigdecimal-3.1.8/ext/bigdecimal' I, [2024-05-13T21:49:46.838206 #1989258] INFO -- : make[2]: Entering directory '/home/opc/ruby/build/master/.bundle/gems/nkf-0.2.0/ext/nkf' I, [2024-05-13T21:49:46.839937 #1989258] INFO -- : make[2]: Entering directory '/home/opc/ruby/build/master/.bundle/gems/racc-1.7.3/ext/racc/cparse' I, [2024-05-13T21:49:46.850055 #1989258] INFO -- : make[2]: Leaving directory '/home/opc/ruby/build/master/.bundle/gems/debug-1.9.2/ext/debug' I, [2024-05-13T21:49:46.853118 #1989258] INFO -- : make[2]: Entering directory '/home/opc/ruby/build/master/.bundle/gems/rbs-3.4.4/ext/rbs_extension' I, [2024-05-13T21:49:46.869769 #1989258] INFO -- : make[2]: Leaving directory '/home/opc/ruby/build/master/.bundle/gems/nkf-0.2.0/ext/nkf' I, [2024-05-13T21:49:46.869912 #1989258] INFO -- : make[2]: Leaving directory '/home/opc/ruby/build/master/.bundle/gems/racc-1.7.3/ext/racc/cparse' I, [2024-05-13T21:49:46.872623 #1989258] INFO -- : make[2]: Entering directory '/home/opc/ruby/build/master/.bundle/gems/syslog-0.1.2/ext/syslog' I, [2024-05-13T21:49:46.885047 #1989258] INFO -- : make[2]: Leaving directory '/home/opc/ruby/build/master/.bundle/gems/rbs-3.4.4/ext/rbs_extension' I, [2024-05-13T21:49:46.892043 #1989258] INFO -- : make[2]: Entering directory '/home/opc/ruby/build/master/ext/digest/sha2' I, [2024-05-13T21:49:46.899088 #1989258] INFO -- : make[2]: Leaving directory '/home/opc/ruby/build/master/ext/digest/sha2' I, [2024-05-13T21:49:46.903267 #1989258] INFO -- : make[2]: Leaving directory '/home/opc/ruby/build/master/.bundle/gems/syslog-0.1.2/ext/syslog' I, [2024-05-13T21:49:46.941093 #1989258] INFO -- : make[2]: Entering directory '/home/opc/ruby/build/master' I, [2024-05-13T21:49:47.023994 #1989258] INFO -- : make[2]: 'ruby' is up to date. I, [2024-05-13T21:49:47.024081 #1989258] INFO -- : make[2]: Leaving directory '/home/opc/ruby/build/master' I, [2024-05-13T21:49:47.024173 #1989258] INFO -- : make[1]: Leaving directory '/home/opc/ruby/build/master' I, [2024-05-13T21:49:47.028553 #1989258] INFO -- : make[1]: Entering directory '/home/opc/ruby/build/master' I, [2024-05-13T21:49:47.028616 #1989258] INFO -- : make[1]: Nothing to be done for 'note'. I, [2024-05-13T21:49:47.028627 #1989258] INFO -- : make[1]: Leaving directory '/home/opc/ruby/build/master' I, [2024-05-13T21:49:47.028987 #1989258] INFO -- : $$$[end] "make all -j3" exit with 0. I, [2024-05-13T21:49:47.029119 #1989258] INFO -- : $$$[beg] make install -j3 I, [2024-05-13T21:49:47.125693 #1989258] INFO -- : Update minitest to ea9caafc0754b1d6236a490d59e624b53209734a I, [2024-05-13T21:49:47.125910 #1989258] INFO -- : Update power_assert to 84e85124c5014a139af39161d484156cfe87a9ed I, [2024-05-13T21:49:47.126075 #1989258] INFO -- : Update rbs to ba7872795d5de04adb8ff500c0e6afdc81a041dd I, [2024-05-13T21:49:47.128794 #1989258] INFO -- : echo ea9caafc0754b1d6236a490d59e624b53209734a | /bin/sh /home/opc/ruby/src/master/tool/ifchange /home/opc/ruby/src/master/.bundle/.timestamp/minitest.revision - I, [2024-05-13T21:49:47.129129 #1989258] INFO -- : echo 84e85124c5014a139af39161d484156cfe87a9ed | /bin/sh /home/opc/ruby/src/master/tool/ifchange /home/opc/ruby/src/master/.bundle/.timestamp/power_assert.revision - I, [2024-05-13T21:49:47.129761 #1989258] INFO -- : echo ba7872795d5de04adb8ff500c0e6afdc81a041dd | /bin/sh /home/opc/ruby/src/master/tool/ifchange /home/opc/ruby/src/master/.bundle/.timestamp/rbs.revision - I, [2024-05-13T21:49:47.134920 #1989258] INFO -- : /home/opc/ruby/src/master/.bundle/.timestamp/minitest.revision unchanged I, [2024-05-13T21:49:47.135331 #1989258] INFO -- : /home/opc/ruby/src/master/.bundle/.timestamp/power_assert.revision unchanged I, [2024-05-13T21:49:47.136163 #1989258] INFO -- : /home/opc/ruby/src/master/.bundle/.timestamp/rbs.revision unchanged I, [2024-05-13T21:49:47.137767 #1989258] INFO -- : Update typeprof to b19a6416da3a05d57fadd6ffdadb382b6d236ca5 I, [2024-05-13T21:49:47.139761 #1989258] INFO -- : BASERUBY = /usr/local/bin/ruby --disable=gems I, [2024-05-13T21:49:47.139794 #1989258] INFO -- : CC = gcc I, [2024-05-13T21:49:47.139805 #1989258] INFO -- : LD = ld I, [2024-05-13T21:49:47.139813 #1989258] INFO -- : LDSHARED = gcc -shared I, [2024-05-13T21:49:47.139822 #1989258] INFO -- : CFLAGS = -O3 -fno-fast-math -ggdb3 -Wall -Wextra -Wdeprecated-declarations -Wdiv-by-zero -Wduplicated-cond -Wimplicit-function-declaration -Wimplicit-int -Wpointer-arith -Wwrite-strings -Wold-style-definition -Wimplicit-fallthrough=0 -Wmissing-noreturn -Wno-cast-function-type -Wno-constant-logical-operand -Wno-long-long -Wno-missing-field-initializers -Wno-overlength-strings -Wno-packed-bitfield-compat -Wno-parentheses-equality -Wno-self-assign -Wno-tautological-compare -Wno-unused-parameter -Wno-unused-value -Wsuggest-attribute=format -Wsuggest-attribute=noreturn -Wunused-variable -Wmisleading-indentation -Wundef I, [2024-05-13T21:49:47.139832 #1989258] INFO -- : XCFLAGS = -U_FORTIFY_SOURCE -D_FORTIFY_SOURCE=2 -fstack-protector-strong -msign-return-address=all -fno-strict-overflow -fvisibility=hidden -fexcess-precision=standard -DRUBY_EXPORT -fPIE -I. -I.ext/include/aarch64-linux -I/home/opc/ruby/src/master/include -I/home/opc/ruby/src/master -I/home/opc/ruby/src/master/prism -I/home/opc/ruby/src/master/enc/unicode/15.0.0 I, [2024-05-13T21:49:47.139840 #1989258] INFO -- : CPPFLAGS = I, [2024-05-13T21:49:47.139848 #1989258] INFO -- : DLDFLAGS = -Wl,--compress-debug-sections=zlib -fstack-protector-strong -pie I, [2024-05-13T21:49:47.139856 #1989258] INFO -- : SOLIBS = -lz -lrt -lrt -ldl -lcrypt -lm -lpthread I, [2024-05-13T21:49:47.139864 #1989258] INFO -- : LANG = en_US.UTF-8 I, [2024-05-13T21:49:47.139875 #1989258] INFO -- : LC_ALL = I, [2024-05-13T21:49:47.139883 #1989258] INFO -- : LC_CTYPE = I, [2024-05-13T21:49:47.139890 #1989258] INFO -- : MFLAGS = -j3 --jobserver-auth=4,5 I, [2024-05-13T21:49:47.139898 #1989258] INFO -- : RUSTC = rustc I, [2024-05-13T21:49:47.139908 #1989258] INFO -- : YJIT_RUSTC_ARGS = --crate-name=yjit --crate-type=staticlib --edition=2021 -g -C lto=thin -C opt-level=3 -C overflow-checks=on '--out-dir=/home/opc/ruby/build/master/yjit/target/release/' /home/opc/ruby/src/master/yjit/src/lib.rs I, [2024-05-13T21:49:47.170983 #1989258] INFO -- : echo b19a6416da3a05d57fadd6ffdadb382b6d236ca5 | /bin/sh /home/opc/ruby/src/master/tool/ifchange /home/opc/ruby/src/master/.bundle/.timestamp/typeprof.revision - I, [2024-05-13T21:49:47.171890 #1989258] INFO -- : gcc (GCC) 8.5.0 20210514 (Red Hat 8.5.0-10.1.0.1) I, [2024-05-13T21:49:47.171931 #1989258] INFO -- : Copyright (C) 2018 Free Software Foundation, Inc. I, [2024-05-13T21:49:47.171941 #1989258] INFO -- : This is free software; see the source for copying conditions. There is NO I, [2024-05-13T21:49:47.171951 #1989258] INFO -- : warranty; not even for MERCHANTABILITY or FITNESS FOR A PARTICULAR PURPOSE. I, [2024-05-13T21:49:47.171960 #1989258] INFO -- : I, [2024-05-13T21:49:47.172773 #1989258] INFO -- : generating encdb.h I, [2024-05-13T21:49:47.174490 #1989258] INFO -- : generating enc.mk I, [2024-05-13T21:49:47.177464 #1989258] INFO -- : /home/opc/ruby/src/master/.bundle/.timestamp/typeprof.revision unchanged I, [2024-05-13T21:49:47.210734 #1989258] INFO -- : encdb.h unchanged I, [2024-05-13T21:49:47.302904 #1989258] INFO -- : Building power_assert@84e85124c5014a139af39161d484156cfe87a9ed to /home/opc/ruby/src/master/gems/power_assert-2.0.3.gem I, [2024-05-13T21:49:47.414318 #1989258] INFO -- : making srcs under enc I, [2024-05-13T21:49:47.414527 #1989258] INFO -- : making enc I, [2024-05-13T21:49:47.421065 #1989258] INFO -- : Successfully built RubyGem I, [2024-05-13T21:49:47.421116 #1989258] INFO -- : Name: power_assert I, [2024-05-13T21:49:47.421127 #1989258] INFO -- : Version: 2.0.4dev I, [2024-05-13T21:49:47.421135 #1989258] INFO -- : File: power_assert-2.0.4dev.gem I, [2024-05-13T21:49:47.423295 #1989258] INFO -- : Extracting bundle gem power_assert-2.0.3... I, [2024-05-13T21:49:47.443142 #1989258] INFO -- : make[1]: Entering directory '/home/opc/ruby/build/master' I, [2024-05-13T21:49:47.443196 #1989258] INFO -- : make[1]: Nothing to be done for 'enc'. I, [2024-05-13T21:49:47.443208 #1989258] INFO -- : make[1]: Leaving directory '/home/opc/ruby/build/master' I, [2024-05-13T21:49:47.456883 #1989258] INFO -- : make[1]: Entering directory '/home/opc/ruby/build/master' I, [2024-05-13T21:49:47.456970 #1989258] INFO -- : make[1]: Nothing to be done for 'srcs'. I, [2024-05-13T21:49:47.456985 #1989258] INFO -- : make[1]: Leaving directory '/home/opc/ruby/build/master' I, [2024-05-13T21:49:47.457810 #1989258] INFO -- : generating transdb.h I, [2024-05-13T21:49:47.523903 #1989258] INFO -- : Try with hash version of bundled gems instead of gems/power_assert-2.0.3.gem. We don't use this gem with release version of Ruby. I, [2024-05-13T21:49:47.534132 #1989258] INFO -- : Unpacked gems/power_assert-2.0.4dev.gem I, [2024-05-13T21:49:47.603227 #1989258] INFO -- : transdb.h unchanged I, [2024-05-13T21:49:47.604605 #1989258] INFO -- : generating makefiles ext/configure-ext.mk I, [2024-05-13T21:49:47.604830 #1989258] INFO -- : making trans I, [2024-05-13T21:49:47.643615 #1989258] INFO -- : ext/configure-ext.mk unchanged I, [2024-05-13T21:49:47.646700 #1989258] INFO -- : make[1]: Entering directory '/home/opc/ruby/build/master' I, [2024-05-13T21:49:47.653130 #1989258] INFO -- : make[1]: Entering directory '/home/opc/ruby/build/master' I, [2024-05-13T21:49:47.653197 #1989258] INFO -- : make[1]: Nothing to be done for 'trans'. I, [2024-05-13T21:49:47.653209 #1989258] INFO -- : make[1]: Leaving directory '/home/opc/ruby/build/master' I, [2024-05-13T21:49:48.350604 #1989258] INFO -- : making encs I, [2024-05-13T21:49:48.378981 #1989258] INFO -- : make[1]: Leaving directory '/home/opc/ruby/build/master' I, [2024-05-13T21:49:48.379672 #1989258] INFO -- : generating makefile exts.mk I, [2024-05-13T21:49:48.408397 #1989258] INFO -- : make[1]: Entering directory '/home/opc/ruby/build/master' I, [2024-05-13T21:49:48.408465 #1989258] INFO -- : make[1]: Nothing to be done for 'encs'. I, [2024-05-13T21:49:48.408478 #1989258] INFO -- : make[1]: Leaving directory '/home/opc/ruby/build/master' I, [2024-05-13T21:49:48.438362 #1989258] INFO -- : exts.mk unchanged I, [2024-05-13T21:49:48.443235 #1989258] INFO -- : make[1]: Entering directory '/home/opc/ruby/build/master' I, [2024-05-13T21:49:48.548456 #1989258] INFO -- : make[2]: Entering directory '/home/opc/ruby/build/master/ext/coverage' I, [2024-05-13T21:49:48.549742 #1989258] INFO -- : make[2]: Entering directory '/home/opc/ruby/build/master/ext/digest' I, [2024-05-13T21:49:48.551166 #1989258] INFO -- : make[2]: Entering directory '/home/opc/ruby/build/master/ext/date' I, [2024-05-13T21:49:48.553771 #1989258] INFO -- : make[2]: Leaving directory '/home/opc/ruby/build/master/ext/coverage' I, [2024-05-13T21:49:48.556403 #1989258] INFO -- : make[2]: Leaving directory '/home/opc/ruby/build/master/ext/date' I, [2024-05-13T21:49:48.558922 #1989258] INFO -- : make[2]: Leaving directory '/home/opc/ruby/build/master/ext/digest' I, [2024-05-13T21:49:48.565157 #1989258] INFO -- : make[2]: Entering directory '/home/opc/ruby/build/master/ext/io/console' I, [2024-05-13T21:49:48.566170 #1989258] INFO -- : make[2]: Entering directory '/home/opc/ruby/build/master/ext/fiddle' I, [2024-05-13T21:49:48.570781 #1989258] INFO -- : make[2]: Leaving directory '/home/opc/ruby/build/master/ext/io/console' I, [2024-05-13T21:49:48.572008 #1989258] INFO -- : make[2]: Entering directory '/home/opc/ruby/build/master/ext/json' I, [2024-05-13T21:49:48.574872 #1989258] INFO -- : make[2]: Leaving directory '/home/opc/ruby/build/master/ext/fiddle' I, [2024-05-13T21:49:48.575895 #1989258] INFO -- : make[2]: Entering directory '/home/opc/ruby/build/master/ext/monitor' I, [2024-05-13T21:49:48.579495 #1989258] INFO -- : make[2]: Leaving directory '/home/opc/ruby/build/master/ext/json' I, [2024-05-13T21:49:48.581963 #1989258] INFO -- : make[2]: Leaving directory '/home/opc/ruby/build/master/ext/monitor' I, [2024-05-13T21:49:48.582680 #1989258] INFO -- : make[2]: Entering directory '/home/opc/ruby/build/master/ext/objspace' I, [2024-05-13T21:49:48.586045 #1989258] INFO -- : make[2]: Entering directory '/home/opc/ruby/build/master/ext/pathname' I, [2024-05-13T21:49:48.590105 #1989258] INFO -- : make[2]: Leaving directory '/home/opc/ruby/build/master/ext/pathname' I, [2024-05-13T21:49:48.591660 #1989258] INFO -- : make[2]: Leaving directory '/home/opc/ruby/build/master/ext/objspace' I, [2024-05-13T21:49:48.595990 #1989258] INFO -- : make[2]: Entering directory '/home/opc/ruby/build/master/ext/pty' I, [2024-05-13T21:49:48.596566 #1989258] INFO -- : make[2]: Entering directory '/home/opc/ruby/build/master/ext/psych' I, [2024-05-13T21:49:48.600583 #1989258] INFO -- : make[2]: Entering directory '/home/opc/ruby/build/master/ext/openssl' I, [2024-05-13T21:49:48.603473 #1989258] INFO -- : make[2]: Leaving directory '/home/opc/ruby/build/master/ext/pty' I, [2024-05-13T21:49:48.610922 #1989258] INFO -- : make[2]: Leaving directory '/home/opc/ruby/build/master/ext/psych' I, [2024-05-13T21:49:48.615153 #1989258] INFO -- : make[2]: Entering directory '/home/opc/ruby/build/master/ext/rubyvm' I, [2024-05-13T21:49:48.618464 #1989258] INFO -- : make[2]: Leaving directory '/home/opc/ruby/build/master/ext/rubyvm' I, [2024-05-13T21:49:48.619450 #1989258] INFO -- : make[2]: Entering directory '/home/opc/ruby/build/master/ext/ripper' I, [2024-05-13T21:49:48.625445 #1989258] INFO -- : make[2]: Leaving directory '/home/opc/ruby/build/master/ext/ripper' I, [2024-05-13T21:49:48.625815 #1989258] INFO -- : make[2]: Leaving directory '/home/opc/ruby/build/master/ext/openssl' I, [2024-05-13T21:49:48.634793 #1989258] INFO -- : make[2]: Entering directory '/home/opc/ruby/build/master/ext/socket' I, [2024-05-13T21:49:48.636385 #1989258] INFO -- : make[2]: Entering directory '/home/opc/ruby/build/master/.bundle/gems/bigdecimal-3.1.7/ext/bigdecimal' I, [2024-05-13T21:49:48.636651 #1989258] INFO -- : make[2]: Entering directory '/home/opc/ruby/build/master/.bundle/gems/bigdecimal-3.1.8/ext/bigdecimal' I, [2024-05-13T21:49:48.646586 #1989258] INFO -- : make[2]: Leaving directory '/home/opc/ruby/build/master/ext/socket' I, [2024-05-13T21:49:48.650831 #1989258] INFO -- : make[2]: Entering directory '/home/opc/ruby/build/master/.bundle/gems/debug-1.9.2/ext/debug' I, [2024-05-13T21:49:48.667020 #1989258] INFO -- : make[2]: Leaving directory '/home/opc/ruby/build/master/.bundle/gems/bigdecimal-3.1.7/ext/bigdecimal' I, [2024-05-13T21:49:48.667280 #1989258] INFO -- : make[2]: Leaving directory '/home/opc/ruby/build/master/.bundle/gems/bigdecimal-3.1.8/ext/bigdecimal' I, [2024-05-13T21:49:48.669551 #1989258] INFO -- : make[2]: Entering directory '/home/opc/ruby/build/master/.bundle/gems/nkf-0.2.0/ext/nkf' I, [2024-05-13T21:49:48.669738 #1989258] INFO -- : make[2]: Entering directory '/home/opc/ruby/build/master/.bundle/gems/racc-1.7.3/ext/racc/cparse' I, [2024-05-13T21:49:48.683323 #1989258] INFO -- : make[2]: Leaving directory '/home/opc/ruby/build/master/.bundle/gems/debug-1.9.2/ext/debug' I, [2024-05-13T21:49:48.686301 #1989258] INFO -- : make[2]: Entering directory '/home/opc/ruby/build/master/.bundle/gems/rbs-3.4.4/ext/rbs_extension' I, [2024-05-13T21:49:48.699773 #1989258] INFO -- : make[2]: Leaving directory '/home/opc/ruby/build/master/.bundle/gems/nkf-0.2.0/ext/nkf' I, [2024-05-13T21:49:48.702981 #1989258] INFO -- : make[2]: Entering directory '/home/opc/ruby/build/master/.bundle/gems/syslog-0.1.2/ext/syslog' I, [2024-05-13T21:49:48.707712 #1989258] INFO -- : make[2]: Leaving directory '/home/opc/ruby/build/master/.bundle/gems/racc-1.7.3/ext/racc/cparse' I, [2024-05-13T21:49:48.716740 #1989258] INFO -- : make[2]: Leaving directory '/home/opc/ruby/build/master/.bundle/gems/rbs-3.4.4/ext/rbs_extension' I, [2024-05-13T21:49:48.725770 #1989258] INFO -- : make[2]: Entering directory '/home/opc/ruby/build/master/ext/digest/sha2' I, [2024-05-13T21:49:48.730696 #1989258] INFO -- : make[2]: Leaving directory '/home/opc/ruby/build/master/ext/digest/sha2' I, [2024-05-13T21:49:48.734561 #1989258] INFO -- : make[2]: Leaving directory '/home/opc/ruby/build/master/.bundle/gems/syslog-0.1.2/ext/syslog' I, [2024-05-13T21:49:48.773228 #1989258] INFO -- : make[2]: Entering directory '/home/opc/ruby/build/master' I, [2024-05-13T21:49:48.857489 #1989258] INFO -- : make[2]: 'ruby' is up to date. I, [2024-05-13T21:49:48.857560 #1989258] INFO -- : make[2]: Leaving directory '/home/opc/ruby/build/master' I, [2024-05-13T21:49:48.857745 #1989258] INFO -- : make[1]: Leaving directory '/home/opc/ruby/build/master' I, [2024-05-13T21:49:48.861986 #1989258] INFO -- : make[1]: Entering directory '/home/opc/ruby/build/master' I, [2024-05-13T21:49:48.862017 #1989258] INFO -- : make[1]: Nothing to be done for 'note'. I, [2024-05-13T21:49:48.862028 #1989258] INFO -- : make[1]: Leaving directory '/home/opc/ruby/build/master' I, [2024-05-13T21:49:48.862187 #1989258] INFO -- : ./miniruby -I/home/opc/ruby/src/master/lib -I. -I.ext/common /home/opc/ruby/src/master/tool/runruby.rb --extout=.ext -- --disable-gems -r./aarch64-linux-fake /home/opc/ruby/src/master/tool/rbinstall.rb --make="make" --dest-dir="" --extout=".ext" --ext-build-dir="./ext" --mflags="-j3 --jobserver-auth=4,5" --make-flags=" -j3 --jobserver-auth=4,5" --data-mode=0644 --prog-mode=0755 --installed-list .installed.list --mantype="doc" --gnumake --install=all --exclude=doc I, [2024-05-13T21:49:49.010898 #1989258] INFO -- : Installing to I, [2024-05-13T21:49:49.010965 #1989258] INFO -- : installing binary commands: /home/opc/ruby/install/master/bin I, [2024-05-13T21:49:49.022752 #1989258] INFO -- : installing base libraries: /home/opc/ruby/install/master/lib I, [2024-05-13T21:49:49.023225 #1989258] INFO -- : installing arch files: /home/opc/ruby/install/master/lib/ruby/3.4.0+0/aarch64-linux I, [2024-05-13T21:49:49.023348 #1989258] INFO -- : installing pkgconfig data: /home/opc/ruby/install/master/lib/pkgconfig I, [2024-05-13T21:49:49.023426 #1989258] INFO -- : installing extension objects: /home/opc/ruby/install/master/lib/ruby/3.4.0+0/aarch64-linux I, [2024-05-13T21:49:49.035897 #1989258] INFO -- : installing extension objects: /home/opc/ruby/install/master/lib/ruby/site_ruby/3.4.0+0/aarch64-linux I, [2024-05-13T21:49:49.035919 #1989258] INFO -- : installing extension objects: /home/opc/ruby/install/master/lib/ruby/vendor_ruby/3.4.0+0/aarch64-linux I, [2024-05-13T21:49:49.036031 #1989258] INFO -- : installing extension headers: /home/opc/ruby/install/master/include/ruby-3.4.0+0/aarch64-linux I, [2024-05-13T21:49:49.036325 #1989258] INFO -- : installing extension scripts: /home/opc/ruby/install/master/lib/ruby/3.4.0+0 I, [2024-05-13T21:49:49.044715 #1989258] INFO -- : installing extension scripts: /home/opc/ruby/install/master/lib/ruby/site_ruby/3.4.0+0 I, [2024-05-13T21:49:49.044749 #1989258] INFO -- : installing extension scripts: /home/opc/ruby/install/master/lib/ruby/vendor_ruby/3.4.0+0 I, [2024-05-13T21:49:49.044760 #1989258] INFO -- : installing extension headers: /home/opc/ruby/install/master/include/ruby-3.4.0+0/ruby I, [2024-05-13T21:49:49.044882 #1989258] INFO -- : installing command scripts: /home/opc/ruby/install/master/bin I, [2024-05-13T21:49:49.045333 #1989258] INFO -- : installing library scripts: /home/opc/ruby/install/master/lib/ruby/3.4.0+0 I, [2024-05-13T21:49:49.130897 #1989258] INFO -- : installing common headers: /home/opc/ruby/install/master/include/ruby-3.4.0+0 I, [2024-05-13T21:49:49.145458 #1989258] INFO -- : installing manpages: /home/opc/ruby/install/master/share/man/man1 I, [2024-05-13T21:49:49.145746 #1989258] INFO -- : installing default gems from lib: /home/opc/ruby/install/master/lib/ruby/gems/3.4.0+0 I, [2024-05-13T21:49:49.185290 #1989258] INFO -- : benchmark 0.3.0 I, [2024-05-13T21:49:49.198924 #1989258] INFO -- : bundler 2.6.0.dev I, [2024-05-13T21:49:49.204147 #1989258] INFO -- : cgi 0.4.1 I, [2024-05-13T21:49:49.205361 #1989258] INFO -- : delegate 0.3.1 I, [2024-05-13T21:49:49.206436 #1989258] INFO -- : did_you_mean 1.6.3 I, [2024-05-13T21:49:49.207765 #1989258] INFO -- : english 0.8.0 I, [2024-05-13T21:49:49.208890 #1989258] INFO -- : erb 4.0.4 I, [2024-05-13T21:49:49.211566 #1989258] INFO -- : error_highlight 0.6.0 I, [2024-05-13T21:49:49.212708 #1989258] INFO -- : fileutils 1.7.2 I, [2024-05-13T21:49:49.213842 #1989258] INFO -- : find 0.2.0 I, [2024-05-13T21:49:49.214942 #1989258] INFO -- : forwardable 1.3.3 I, [2024-05-13T21:49:49.216023 #1989258] INFO -- : ipaddr 1.2.6 I, [2024-05-13T21:49:49.217186 #1989258] INFO -- : irb 1.13.1 I, [2024-05-13T21:49:49.219951 #1989258] INFO -- : logger 1.6.0 I, [2024-05-13T21:49:49.222544 #1989258] INFO -- : net-http 0.4.1 I, [2024-05-13T21:49:49.223984 #1989258] INFO -- : net-protocol 0.2.2 I, [2024-05-13T21:49:49.225191 #1989258] INFO -- : open-uri 0.4.1 I, [2024-05-13T21:49:49.226358 #1989258] INFO -- : open3 0.2.1 I, [2024-05-13T21:49:49.227467 #1989258] INFO -- : optparse 0.5.0 I, [2024-05-13T21:49:49.228648 #1989258] INFO -- : ostruct 0.6.0 I, [2024-05-13T21:49:49.229778 #1989258] INFO -- : pp 0.5.0 I, [2024-05-13T21:49:49.230912 #1989258] INFO -- : prettyprint 0.2.0 I, [2024-05-13T21:49:49.232041 #1989258] INFO -- : prism 0.29.0 I, [2024-05-13T21:49:49.233289 #1989258] INFO -- : pstore 0.1.3 I, [2024-05-13T21:49:49.234554 #1989258] INFO -- : rdoc 6.6.3.1 I, [2024-05-13T21:49:49.238322 #1989258] INFO -- : readline 0.0.4 I, [2024-05-13T21:49:49.239407 #1989258] INFO -- : reline 0.5.6 I, [2024-05-13T21:49:49.240596 #1989258] INFO -- : resolv 0.4.0 I, [2024-05-13T21:49:49.241758 #1989258] INFO -- : ruby2_keywords 0.0.5 I, [2024-05-13T21:49:49.242854 #1989258] INFO -- : securerandom 0.3.1 I, [2024-05-13T21:49:49.243961 #1989258] INFO -- : set 1.1.0 I, [2024-05-13T21:49:49.245174 #1989258] INFO -- : shellwords 0.2.0 I, [2024-05-13T21:49:49.246326 #1989258] INFO -- : singleton 0.2.0 I, [2024-05-13T21:49:49.248701 #1989258] INFO -- : syntax_suggest 2.0.0 I, [2024-05-13T21:49:49.251744 #1989258] INFO -- : tempfile 0.2.1 I, [2024-05-13T21:49:49.252893 #1989258] INFO -- : time 0.3.0 I, [2024-05-13T21:49:49.254064 #1989258] INFO -- : timeout 0.4.1 I, [2024-05-13T21:49:49.255172 #1989258] INFO -- : tmpdir 0.2.0 I, [2024-05-13T21:49:49.256314 #1989258] INFO -- : tsort 0.2.0 I, [2024-05-13T21:49:49.257504 #1989258] INFO -- : un 0.3.0 I, [2024-05-13T21:49:49.258613 #1989258] INFO -- : uri 0.13.0 I, [2024-05-13T21:49:49.259760 #1989258] INFO -- : weakref 0.1.3 I, [2024-05-13T21:49:49.260914 #1989258] INFO -- : yaml 0.3.0 I, [2024-05-13T21:49:49.262043 #1989258] INFO -- : installing default gems from ext: /home/opc/ruby/install/master/lib/ruby/gems/3.4.0+0 I, [2024-05-13T21:49:49.272876 #1989258] INFO -- : date 3.3.4 I, [2024-05-13T21:49:49.274103 #1989258] INFO -- : digest 3.1.1 I, [2024-05-13T21:49:49.275191 #1989258] INFO -- : etc 1.4.3 I, [2024-05-13T21:49:49.276365 #1989258] INFO -- : fcntl 1.1.0 I, [2024-05-13T21:49:49.277546 #1989258] INFO -- : fiddle 1.1.3 I, [2024-05-13T21:49:49.278674 #1989258] INFO -- : io-console 0.7.2 I, [2024-05-13T21:49:49.279781 #1989258] INFO -- : io-nonblock 0.3.0 I, [2024-05-13T21:49:49.280991 #1989258] INFO -- : io-wait 0.3.1 I, [2024-05-13T21:49:49.282084 #1989258] INFO -- : json 2.7.2 I, [2024-05-13T21:49:49.283479 #1989258] INFO -- : openssl 3.2.0 I, [2024-05-13T21:49:49.285129 #1989258] INFO -- : pathname 0.3.0 I, [2024-05-13T21:49:49.286271 #1989258] INFO -- : psych 5.1.2 I, [2024-05-13T21:49:49.287518 #1989258] INFO -- : stringio 3.1.1 I, [2024-05-13T21:49:49.288749 #1989258] INFO -- : strscan 3.1.1 I, [2024-05-13T21:49:49.289919 #1989258] INFO -- : zlib 3.1.0 I, [2024-05-13T21:49:49.290865 #1989258] INFO -- : installing bundled gems: /home/opc/ruby/install/master/lib/ruby/gems/3.4.0+0 I, [2024-05-13T21:49:49.291502 #1989258] INFO -- : minitest 5.22.3 I, [2024-05-13T21:49:49.305837 #1989258] INFO -- : rake 13.2.1 I, [2024-05-13T21:49:49.319342 #1989258] INFO -- : test-unit 3.6.2 I, [2024-05-13T21:49:49.335909 #1989258] INFO -- : rexml 3.2.6 I, [2024-05-13T21:49:49.349929 #1989258] INFO -- : rss 0.3.0 I, [2024-05-13T21:49:49.359976 #1989258] INFO -- : net-ftp 0.3.4 I, [2024-05-13T21:49:49.363794 #1989258] INFO -- : net-imap 0.4.11 I, [2024-05-13T21:49:49.383181 #1989258] INFO -- : net-pop 0.1.2 I, [2024-05-13T21:49:49.385771 #1989258] INFO -- : net-smtp 0.5.0 I, [2024-05-13T21:49:49.388983 #1989258] INFO -- : matrix 0.4.2 I, [2024-05-13T21:49:49.395014 #1989258] INFO -- : prime 0.1.2 I, [2024-05-13T21:49:49.405663 #1989258] INFO -- : rbs 3.4.4 I, [2024-05-13T21:49:49.508819 #1989258] INFO -- : typeprof 0.21.11 I, [2024-05-13T21:49:49.517173 #1989258] INFO -- : debug 1.9.2 I, [2024-05-13T21:49:49.527320 #1989258] INFO -- : racc 1.7.3 I, [2024-05-13T21:49:49.537475 #1989258] INFO -- : mutex_m 0.2.0 I, [2024-05-13T21:49:49.541705 #1989258] INFO -- : getoptlong 0.2.1 I, [2024-05-13T21:49:49.546285 #1989258] INFO -- : base64 0.2.0 I, [2024-05-13T21:49:49.548698 #1989258] INFO -- : bigdecimal 3.1.8 I, [2024-05-13T21:49:49.555195 #1989258] INFO -- : observer 0.1.2 I, [2024-05-13T21:49:49.558207 #1989258] INFO -- : abbrev 0.1.2 I, [2024-05-13T21:49:49.561269 #1989258] INFO -- : resolv-replace 0.1.1 I, [2024-05-13T21:49:49.564239 #1989258] INFO -- : rinda 0.2.0 I, [2024-05-13T21:49:49.567661 #1989258] INFO -- : drb 2.2.1 I, [2024-05-13T21:49:49.572130 #1989258] INFO -- : nkf 0.2.0 I, [2024-05-13T21:49:49.579778 #1989258] INFO -- : syslog 0.1.2 I, [2024-05-13T21:49:49.584200 #1989258] INFO -- : csv 3.3.0 I, [2024-05-13T21:49:49.593359 #1989258] INFO -- : installing bundled gem cache: /home/opc/ruby/install/master/lib/ruby/gems/3.4.0+0/cache I, [2024-05-13T21:49:49.595130 #1989258] INFO -- : skipped bundled gems: I, [2024-05-13T21:49:49.595168 #1989258] INFO -- : power_assert-2.0.4dev.gem not found in bundled_gems I, [2024-05-13T21:49:49.598068 #1989258] INFO -- : $$$[end] "make install -j3" exit with 0. I, [2024-05-13T21:49:49.598222 #1989258] INFO -- : $$$[beg] make yes-btest TESTOPTS='-q -j3' I, [2024-05-13T21:50:11.806902 #1989258] INFO -- : PASS all 1936 tests E, [2024-05-13T21:50:11.808647 #1989258] ERROR -- : I, [2024-05-13T21:50:11.808774 #1989258] INFO -- : $$$[end] "make yes-btest TESTOPTS='-q -j3'" exit with 0. I, [2024-05-13T21:50:11.808919 #1989258] INFO -- : $$$[beg] make yes-test-basic TESTS='-j3' I, [2024-05-13T21:50:11.902215 #1989258] INFO -- : BASERUBY = /usr/local/bin/ruby --disable=gems I, [2024-05-13T21:50:11.902282 #1989258] INFO -- : CC = gcc I, [2024-05-13T21:50:11.902292 #1989258] INFO -- : LD = ld I, [2024-05-13T21:50:11.902301 #1989258] INFO -- : LDSHARED = gcc -shared I, [2024-05-13T21:50:11.902329 #1989258] INFO -- : CFLAGS = -O3 -fno-fast-math -ggdb3 -Wall -Wextra -Wdeprecated-declarations -Wdiv-by-zero -Wduplicated-cond -Wimplicit-function-declaration -Wimplicit-int -Wpointer-arith -Wwrite-strings -Wold-style-definition -Wimplicit-fallthrough=0 -Wmissing-noreturn -Wno-cast-function-type -Wno-constant-logical-operand -Wno-long-long -Wno-missing-field-initializers -Wno-overlength-strings -Wno-packed-bitfield-compat -Wno-parentheses-equality -Wno-self-assign -Wno-tautological-compare -Wno-unused-parameter -Wno-unused-value -Wsuggest-attribute=format -Wsuggest-attribute=noreturn -Wunused-variable -Wmisleading-indentation -Wundef I, [2024-05-13T21:50:11.902339 #1989258] INFO -- : XCFLAGS = -U_FORTIFY_SOURCE -D_FORTIFY_SOURCE=2 -fstack-protector-strong -msign-return-address=all -fno-strict-overflow -fvisibility=hidden -fexcess-precision=standard -DRUBY_EXPORT -fPIE -I. -I.ext/include/aarch64-linux -I/home/opc/ruby/src/master/include -I/home/opc/ruby/src/master -I/home/opc/ruby/src/master/prism -I/home/opc/ruby/src/master/enc/unicode/15.0.0 I, [2024-05-13T21:50:11.902348 #1989258] INFO -- : CPPFLAGS = I, [2024-05-13T21:50:11.902356 #1989258] INFO -- : DLDFLAGS = -Wl,--compress-debug-sections=zlib -fstack-protector-strong -pie I, [2024-05-13T21:50:11.902365 #1989258] INFO -- : SOLIBS = -lz -lrt -lrt -ldl -lcrypt -lm -lpthread I, [2024-05-13T21:50:11.902373 #1989258] INFO -- : LANG = en_US.UTF-8 I, [2024-05-13T21:50:11.902381 #1989258] INFO -- : LC_ALL = I, [2024-05-13T21:50:11.902389 #1989258] INFO -- : LC_CTYPE = I, [2024-05-13T21:50:11.902397 #1989258] INFO -- : MFLAGS = I, [2024-05-13T21:50:11.902405 #1989258] INFO -- : RUSTC = rustc I, [2024-05-13T21:50:11.902413 #1989258] INFO -- : YJIT_RUSTC_ARGS = --crate-name=yjit --crate-type=staticlib --edition=2021 -g -C lto=thin -C opt-level=3 -C overflow-checks=on '--out-dir=/home/opc/ruby/build/master/yjit/target/release/' /home/opc/ruby/src/master/yjit/src/lib.rs I, [2024-05-13T21:50:11.903180 #1989258] INFO -- : gcc (GCC) 8.5.0 20210514 (Red Hat 8.5.0-10.1.0.1) I, [2024-05-13T21:50:11.903204 #1989258] INFO -- : Copyright (C) 2018 Free Software Foundation, Inc. I, [2024-05-13T21:50:11.903213 #1989258] INFO -- : This is free software; see the source for copying conditions. There is NO I, [2024-05-13T21:50:11.903221 #1989258] INFO -- : warranty; not even for MERCHANTABILITY or FITNESS FOR A PARTICULAR PURPOSE. I, [2024-05-13T21:50:11.903230 #1989258] INFO -- : I, [2024-05-13T21:50:12.059345 #1989258] INFO -- : Checking leaked global symbols...none I, [2024-05-13T21:50:12.112490 #1989258] INFO -- : /home/opc/ruby/src/master/basictest/test.rb:assignment ....................................................................................................................................................................................................................................................................................................................................................................................OK 372 I, [2024-05-13T21:50:12.112588 #1989258] INFO -- : /home/opc/ruby/src/master/basictest/test.rb:condition ..OK 2 I, [2024-05-13T21:50:12.112617 #1989258] INFO -- : /home/opc/ruby/src/master/basictest/test.rb:if/unless ...OK 3 I, [2024-05-13T21:50:12.112670 #1989258] INFO -- : /home/opc/ruby/src/master/basictest/test.rb:case .....OK 5 I, [2024-05-13T21:50:12.113299 #1989258] INFO -- : /home/opc/ruby/src/master/basictest/test.rb:while/until ........OK 8 I, [2024-05-13T21:50:12.113428 #1989258] INFO -- : /home/opc/ruby/src/master/basictest/test.rb:exception ..........OK 10 I, [2024-05-13T21:50:12.114087 #1989258] INFO -- : /home/opc/ruby/src/master/basictest/test.rb:array .......................................OK 39 I, [2024-05-13T21:50:12.114372 #1989258] INFO -- : /home/opc/ruby/src/master/basictest/test.rb:hash ...........................OK 27 I, [2024-05-13T21:50:12.116099 #1989258] INFO -- : /home/opc/ruby/src/master/basictest/test.rb:iterator ...........................................................................................................OK 107 I, [2024-05-13T21:50:12.116916 #1989258] INFO -- : /home/opc/ruby/src/master/basictest/test.rb:float ................................................................................OK 80 I, [2024-05-13T21:50:12.120436 #1989258] INFO -- : /home/opc/ruby/src/master/basictest/test.rb:bignum ...............................OK 31 I, [2024-05-13T21:50:12.122291 #1989258] INFO -- : /home/opc/ruby/src/master/basictest/test.rb:string & char ..............................................................OK 62 I, [2024-05-13T21:50:12.122362 #1989258] INFO -- : /home/opc/ruby/src/master/basictest/test.rb:assignment ..........OK 10 I, [2024-05-13T21:50:12.122438 #1989258] INFO -- : /home/opc/ruby/src/master/basictest/test.rb:call ......OK 6 I, [2024-05-13T21:50:12.122573 #1989258] INFO -- : /home/opc/ruby/src/master/basictest/test.rb:proc .........OK 9 I, [2024-05-13T21:50:12.222818 #1989258] INFO -- : /home/opc/ruby/src/master/basictest/test.rb:signal ..OK 2 I, [2024-05-13T21:50:12.224359 #1989258] INFO -- : /home/opc/ruby/src/master/basictest/test.rb:eval ...........................OK 27 I, [2024-05-13T21:50:12.362285 #1989258] INFO -- : /home/opc/ruby/src/master/basictest/test.rb:system ........OK 8 I, [2024-05-13T21:50:12.362356 #1989258] INFO -- : /home/opc/ruby/src/master/basictest/test.rb:const .....OK 5 I, [2024-05-13T21:50:12.362451 #1989258] INFO -- : /home/opc/ruby/src/master/basictest/test.rb:clone .....OK 5 I, [2024-05-13T21:50:12.362643 #1989258] INFO -- : /home/opc/ruby/src/master/basictest/test.rb:marshal ....OK 4 I, [2024-05-13T21:50:12.362722 #1989258] INFO -- : /home/opc/ruby/src/master/basictest/test.rb:pack ....OK 4 I, [2024-05-13T21:50:12.362753 #1989258] INFO -- : /home/opc/ruby/src/master/basictest/test.rb:math ..OK 2 I, [2024-05-13T21:50:12.362845 #1989258] INFO -- : /home/opc/ruby/src/master/basictest/test.rb:struct ......OK 6 I, [2024-05-13T21:50:12.363016 #1989258] INFO -- : /home/opc/ruby/src/master/basictest/test.rb:variable ............OK 12 I, [2024-05-13T21:50:12.363058 #1989258] INFO -- : /home/opc/ruby/src/master/basictest/test.rb:trace ...OK 3 I, [2024-05-13T21:50:12.363185 #1989258] INFO -- : /home/opc/ruby/src/master/basictest/test.rb:defined? ............OK 12 I, [2024-05-13T21:50:12.363277 #1989258] INFO -- : /home/opc/ruby/src/master/basictest/test.rb:alias ......OK 6 I, [2024-05-13T21:50:12.363794 #1989258] INFO -- : /home/opc/ruby/src/master/basictest/test.rb:path .......................OK 23 I, [2024-05-13T21:50:12.431441 #1989258] INFO -- : /home/opc/ruby/src/master/basictest/test.rb:gc ....OK 4 I, [2024-05-13T21:50:12.433555 #1989258] INFO -- : I, [2024-05-13T21:50:12.433606 #1989258] INFO -- : test succeeded I, [2024-05-13T21:50:12.434151 #1989258] INFO -- : $$$[end] "make yes-test-basic TESTS='-j3'" exit with 0. I, [2024-05-13T21:50:12.434379 #1989258] INFO -- : $$$[beg] make yes-test-all TESTOPTS='--stderr-on-failure' TESTS='-j3' I, [2024-05-13T21:50:12.559814 #1989258] INFO -- : BASERUBY = /usr/local/bin/ruby --disable=gems I, [2024-05-13T21:50:12.559888 #1989258] INFO -- : CC = gcc I, [2024-05-13T21:50:12.559899 #1989258] INFO -- : LD = ld I, [2024-05-13T21:50:12.559908 #1989258] INFO -- : LDSHARED = gcc -shared I, [2024-05-13T21:50:12.559919 #1989258] INFO -- : CFLAGS = -O3 -fno-fast-math -ggdb3 -Wall -Wextra -Wdeprecated-declarations -Wdiv-by-zero -Wduplicated-cond -Wimplicit-function-declaration -Wimplicit-int -Wpointer-arith -Wwrite-strings -Wold-style-definition -Wimplicit-fallthrough=0 -Wmissing-noreturn -Wno-cast-function-type -Wno-constant-logical-operand -Wno-long-long -Wno-missing-field-initializers -Wno-overlength-strings -Wno-packed-bitfield-compat -Wno-parentheses-equality -Wno-self-assign -Wno-tautological-compare -Wno-unused-parameter -Wno-unused-value -Wsuggest-attribute=format -Wsuggest-attribute=noreturn -Wunused-variable -Wmisleading-indentation -Wundef I, [2024-05-13T21:50:12.559929 #1989258] INFO -- : XCFLAGS = -U_FORTIFY_SOURCE -D_FORTIFY_SOURCE=2 -fstack-protector-strong -msign-return-address=all -fno-strict-overflow -fvisibility=hidden -fexcess-precision=standard -DRUBY_EXPORT -fPIE -I. -I.ext/include/aarch64-linux -I/home/opc/ruby/src/master/include -I/home/opc/ruby/src/master -I/home/opc/ruby/src/master/prism -I/home/opc/ruby/src/master/enc/unicode/15.0.0 I, [2024-05-13T21:50:12.559938 #1989258] INFO -- : CPPFLAGS = I, [2024-05-13T21:50:12.559947 #1989258] INFO -- : DLDFLAGS = -Wl,--compress-debug-sections=zlib -fstack-protector-strong -pie I, [2024-05-13T21:50:12.559956 #1989258] INFO -- : SOLIBS = -lz -lrt -lrt -ldl -lcrypt -lm -lpthread I, [2024-05-13T21:50:12.559964 #1989258] INFO -- : LANG = en_US.UTF-8 I, [2024-05-13T21:50:12.559972 #1989258] INFO -- : LC_ALL = I, [2024-05-13T21:50:12.559980 #1989258] INFO -- : LC_CTYPE = I, [2024-05-13T21:50:12.559987 #1989258] INFO -- : MFLAGS = I, [2024-05-13T21:50:12.559995 #1989258] INFO -- : RUSTC = rustc I, [2024-05-13T21:50:12.560003 #1989258] INFO -- : YJIT_RUSTC_ARGS = --crate-name=yjit --crate-type=staticlib --edition=2021 -g -C lto=thin -C opt-level=3 -C overflow-checks=on '--out-dir=/home/opc/ruby/build/master/yjit/target/release/' /home/opc/ruby/src/master/yjit/src/lib.rs I, [2024-05-13T21:50:12.560751 #1989258] INFO -- : gcc (GCC) 8.5.0 20210514 (Red Hat 8.5.0-10.1.0.1) I, [2024-05-13T21:50:12.560770 #1989258] INFO -- : Copyright (C) 2018 Free Software Foundation, Inc. I, [2024-05-13T21:50:12.560779 #1989258] INFO -- : This is free software; see the source for copying conditions. There is NO I, [2024-05-13T21:50:12.560787 #1989258] INFO -- : warranty; not even for MERCHANTABILITY or FITNESS FOR A PARTICULAR PURPOSE. I, [2024-05-13T21:50:12.560795 #1989258] INFO -- : I, [2024-05-13T21:50:12.562837 #1989258] INFO -- : generating enc.mk I, [2024-05-13T21:50:12.805442 #1989258] INFO -- : generating encdb.h I, [2024-05-13T21:50:12.844108 #1989258] INFO -- : encdb.h unchanged I, [2024-05-13T21:50:12.845461 #1989258] INFO -- : making enc I, [2024-05-13T21:50:12.872742 #1989258] INFO -- : make[1]: Entering directory '/home/opc/ruby/build/master' I, [2024-05-13T21:50:12.872813 #1989258] INFO -- : make[1]: Nothing to be done for 'enc'. I, [2024-05-13T21:50:12.872824 #1989258] INFO -- : make[1]: Leaving directory '/home/opc/ruby/build/master' I, [2024-05-13T21:50:12.873630 #1989258] INFO -- : making srcs under enc I, [2024-05-13T21:50:12.915452 #1989258] INFO -- : make[1]: Entering directory '/home/opc/ruby/build/master' I, [2024-05-13T21:50:12.915534 #1989258] INFO -- : make[1]: Nothing to be done for 'srcs'. I, [2024-05-13T21:50:12.915553 #1989258] INFO -- : make[1]: Leaving directory '/home/opc/ruby/build/master' I, [2024-05-13T21:50:12.916663 #1989258] INFO -- : generating transdb.h I, [2024-05-13T21:50:13.060529 #1989258] INFO -- : transdb.h unchanged I, [2024-05-13T21:50:13.061910 #1989258] INFO -- : making trans I, [2024-05-13T21:50:13.110422 #1989258] INFO -- : make[1]: Entering directory '/home/opc/ruby/build/master' I, [2024-05-13T21:50:13.110504 #1989258] INFO -- : make[1]: Nothing to be done for 'trans'. I, [2024-05-13T21:50:13.110514 #1989258] INFO -- : make[1]: Leaving directory '/home/opc/ruby/build/master' I, [2024-05-13T21:50:13.111297 #1989258] INFO -- : making encs I, [2024-05-13T21:50:13.163760 #1989258] INFO -- : make[1]: Entering directory '/home/opc/ruby/build/master' I, [2024-05-13T21:50:13.163832 #1989258] INFO -- : make[1]: Nothing to be done for 'encs'. I, [2024-05-13T21:50:13.163842 #1989258] INFO -- : make[1]: Leaving directory '/home/opc/ruby/build/master' I, [2024-05-13T21:50:13.165932 #1989258] INFO -- : generating makefiles ext/configure-ext.mk I, [2024-05-13T21:50:13.206015 #1989258] INFO -- : ext/configure-ext.mk updated I, [2024-05-13T21:50:13.209530 #1989258] INFO -- : make[1]: Entering directory '/home/opc/ruby/build/master' I, [2024-05-13T21:50:15.272965 #1989258] INFO -- : make[1]: Leaving directory '/home/opc/ruby/build/master' I, [2024-05-13T21:50:15.273679 #1989258] INFO -- : generating makefile exts.mk I, [2024-05-13T21:50:15.331665 #1989258] INFO -- : exts.mk unchanged I, [2024-05-13T21:50:15.336537 #1989258] INFO -- : make[1]: Entering directory '/home/opc/ruby/build/master' I, [2024-05-13T21:50:15.634517 #1989258] INFO -- : make[2]: Entering directory '/home/opc/ruby/build/master/ext/coverage' I, [2024-05-13T21:50:15.639509 #1989258] INFO -- : make[2]: Leaving directory '/home/opc/ruby/build/master/ext/coverage' I, [2024-05-13T21:50:15.645415 #1989258] INFO -- : make[2]: Entering directory '/home/opc/ruby/build/master/ext/date' I, [2024-05-13T21:50:15.650686 #1989258] INFO -- : make[2]: Leaving directory '/home/opc/ruby/build/master/ext/date' I, [2024-05-13T21:50:15.654157 #1989258] INFO -- : make[2]: Entering directory '/home/opc/ruby/build/master/ext/digest' I, [2024-05-13T21:50:15.663036 #1989258] INFO -- : make[2]: Leaving directory '/home/opc/ruby/build/master/ext/digest' I, [2024-05-13T21:50:15.685659 #1989258] INFO -- : make[2]: Entering directory '/home/opc/ruby/build/master/ext/digest/sha2' I, [2024-05-13T21:50:15.690601 #1989258] INFO -- : make[2]: Leaving directory '/home/opc/ruby/build/master/ext/digest/sha2' I, [2024-05-13T21:50:15.709354 #1989258] INFO -- : make[2]: Entering directory '/home/opc/ruby/build/master/ext/fiddle' I, [2024-05-13T21:50:15.719769 #1989258] INFO -- : make[2]: Leaving directory '/home/opc/ruby/build/master/ext/fiddle' I, [2024-05-13T21:50:15.724105 #1989258] INFO -- : make[2]: Entering directory '/home/opc/ruby/build/master/ext/io/console' I, [2024-05-13T21:50:15.728450 #1989258] INFO -- : make[2]: Leaving directory '/home/opc/ruby/build/master/ext/io/console' I, [2024-05-13T21:50:15.739429 #1989258] INFO -- : make[2]: Entering directory '/home/opc/ruby/build/master/ext/json' I, [2024-05-13T21:50:15.749777 #1989258] INFO -- : make[2]: Leaving directory '/home/opc/ruby/build/master/ext/json' I, [2024-05-13T21:50:15.762859 #1989258] INFO -- : make[2]: Entering directory '/home/opc/ruby/build/master/ext/monitor' I, [2024-05-13T21:50:15.766962 #1989258] INFO -- : make[2]: Leaving directory '/home/opc/ruby/build/master/ext/monitor' I, [2024-05-13T21:50:15.773161 #1989258] INFO -- : make[2]: Entering directory '/home/opc/ruby/build/master/ext/objspace' I, [2024-05-13T21:50:15.779125 #1989258] INFO -- : make[2]: Leaving directory '/home/opc/ruby/build/master/ext/objspace' I, [2024-05-13T21:50:15.798108 #1989258] INFO -- : make[2]: Entering directory '/home/opc/ruby/build/master/ext/openssl' I, [2024-05-13T21:50:15.819875 #1989258] INFO -- : make[2]: Leaving directory '/home/opc/ruby/build/master/ext/openssl' I, [2024-05-13T21:50:15.824224 #1989258] INFO -- : make[2]: Entering directory '/home/opc/ruby/build/master/ext/pathname' I, [2024-05-13T21:50:15.828526 #1989258] INFO -- : make[2]: Leaving directory '/home/opc/ruby/build/master/ext/pathname' I, [2024-05-13T21:50:15.834769 #1989258] INFO -- : make[2]: Entering directory '/home/opc/ruby/build/master/ext/psych' I, [2024-05-13T21:50:15.856269 #1989258] INFO -- : make[2]: Leaving directory '/home/opc/ruby/build/master/ext/psych' I, [2024-05-13T21:50:15.860817 #1989258] INFO -- : make[2]: Entering directory '/home/opc/ruby/build/master/ext/pty' I, [2024-05-13T21:50:15.865013 #1989258] INFO -- : make[2]: Leaving directory '/home/opc/ruby/build/master/ext/pty' I, [2024-05-13T21:50:15.878491 #1989258] INFO -- : make[2]: Entering directory '/home/opc/ruby/build/master/ext/ripper' I, [2024-05-13T21:50:15.886199 #1989258] INFO -- : make[2]: Leaving directory '/home/opc/ruby/build/master/ext/ripper' I, [2024-05-13T21:50:15.888265 #1989258] INFO -- : make[2]: Entering directory '/home/opc/ruby/build/master/ext/rubyvm' I, [2024-05-13T21:50:15.891682 #1989258] INFO -- : make[2]: Leaving directory '/home/opc/ruby/build/master/ext/rubyvm' I, [2024-05-13T21:50:15.903764 #1989258] INFO -- : make[2]: Entering directory '/home/opc/ruby/build/master/ext/socket' I, [2024-05-13T21:50:15.914466 #1989258] INFO -- : make[2]: Leaving directory '/home/opc/ruby/build/master/ext/socket' I, [2024-05-13T21:50:15.930208 #1989258] INFO -- : make[2]: Entering directory '/home/opc/ruby/build/master/.bundle/gems/bigdecimal-3.1.7/ext/bigdecimal' I, [2024-05-13T21:50:15.961124 #1989258] INFO -- : make[2]: Leaving directory '/home/opc/ruby/build/master/.bundle/gems/bigdecimal-3.1.7/ext/bigdecimal' I, [2024-05-13T21:50:15.963811 #1989258] INFO -- : make[2]: Entering directory '/home/opc/ruby/build/master/.bundle/gems/bigdecimal-3.1.8/ext/bigdecimal' I, [2024-05-13T21:50:15.993770 #1989258] INFO -- : make[2]: Leaving directory '/home/opc/ruby/build/master/.bundle/gems/bigdecimal-3.1.8/ext/bigdecimal' I, [2024-05-13T21:50:15.996345 #1989258] INFO -- : make[2]: Entering directory '/home/opc/ruby/build/master/.bundle/gems/debug-1.9.2/ext/debug' I, [2024-05-13T21:50:16.026553 #1989258] INFO -- : make[2]: Leaving directory '/home/opc/ruby/build/master/.bundle/gems/debug-1.9.2/ext/debug' I, [2024-05-13T21:50:16.029133 #1989258] INFO -- : make[2]: Entering directory '/home/opc/ruby/build/master/.bundle/gems/nkf-0.2.0/ext/nkf' I, [2024-05-13T21:50:16.059124 #1989258] INFO -- : make[2]: Leaving directory '/home/opc/ruby/build/master/.bundle/gems/nkf-0.2.0/ext/nkf' I, [2024-05-13T21:50:16.062257 #1989258] INFO -- : make[2]: Entering directory '/home/opc/ruby/build/master/.bundle/gems/racc-1.7.3/ext/racc/cparse' I, [2024-05-13T21:50:16.092468 #1989258] INFO -- : make[2]: Leaving directory '/home/opc/ruby/build/master/.bundle/gems/racc-1.7.3/ext/racc/cparse' I, [2024-05-13T21:50:16.095599 #1989258] INFO -- : make[2]: Entering directory '/home/opc/ruby/build/master/.bundle/gems/rbs-3.4.4/ext/rbs_extension' I, [2024-05-13T21:50:16.126202 #1989258] INFO -- : make[2]: Leaving directory '/home/opc/ruby/build/master/.bundle/gems/rbs-3.4.4/ext/rbs_extension' I, [2024-05-13T21:50:16.128827 #1989258] INFO -- : make[2]: Entering directory '/home/opc/ruby/build/master/.bundle/gems/syslog-0.1.2/ext/syslog' I, [2024-05-13T21:50:16.158947 #1989258] INFO -- : make[2]: Leaving directory '/home/opc/ruby/build/master/.bundle/gems/syslog-0.1.2/ext/syslog' I, [2024-05-13T21:50:16.197258 #1989258] INFO -- : make[2]: Entering directory '/home/opc/ruby/build/master' I, [2024-05-13T21:50:16.281115 #1989258] INFO -- : make[2]: 'ruby' is up to date. I, [2024-05-13T21:50:16.281192 #1989258] INFO -- : make[2]: Leaving directory '/home/opc/ruby/build/master' I, [2024-05-13T21:50:16.281297 #1989258] INFO -- : make[1]: Leaving directory '/home/opc/ruby/build/master' I, [2024-05-13T21:50:16.285949 #1989258] INFO -- : make[1]: Entering directory '/home/opc/ruby/build/master' I, [2024-05-13T21:50:16.285990 #1989258] INFO -- : make[1]: Nothing to be done for 'note'. I, [2024-05-13T21:50:16.286001 #1989258] INFO -- : make[1]: Leaving directory '/home/opc/ruby/build/master' I, [2024-05-13T21:50:16.400536 #1989258] INFO -- : Run options: I, [2024-05-13T21:50:16.400612 #1989258] INFO -- : --seed=4350 I, [2024-05-13T21:50:16.400623 #1989258] INFO -- : "--ruby=./miniruby -I/home/opc/ruby/src/master/lib -I. -I.ext/common /home/opc/ruby/src/master/tool/runruby.rb --extout=.ext -- --disable-gems" I, [2024-05-13T21:50:16.400633 #1989258] INFO -- : --excludes-dir=/home/opc/ruby/src/master/test/.excludes I, [2024-05-13T21:50:16.400641 #1989258] INFO -- : --name=!/memory_leak/ I, [2024-05-13T21:50:16.400650 #1989258] INFO -- : --stderr-on-failure I, [2024-05-13T21:50:16.400658 #1989258] INFO -- : -j3 I, [2024-05-13T21:50:16.400666 #1989258] INFO -- : I, [2024-05-13T21:50:16.400674 #1989258] INFO -- : # Running tests: I, [2024-05-13T21:50:16.400682 #1989258] INFO -- : I, [2024-05-13T21:50:16.530730 #1989258] INFO -- : [ 1/885] 2030245=test_fiber I, [2024-05-13T21:50:16.538770 #1989258] INFO -- : [ 2/885] 2030244=test_gem_commands_mirror I, [2024-05-13T21:50:16.667798 #1989258] INFO -- : [ 3/885] 2030246=test_engine I, [2024-05-13T21:50:16.696375 #1989258] INFO -- : [ 4/885] 2030244=test_win32ole_param I, [2024-05-13T21:50:16.704591 #1989258] INFO -- : [ 5/885] 2030244=test_key_error I, [2024-05-13T21:50:16.709098 #1989258] INFO -- : [ 6/885] 2030244=test_resize I, [2024-05-13T21:50:16.746801 #1989258] INFO -- : [ 7/885] 2030244=test_lock_native_thread I, [2024-05-13T21:50:16.978348 #1989258] INFO -- : [ 8/885] 2030244=test_gem_package_task I, [2024-05-13T21:50:17.012152 #1989258] INFO -- : [ 9/885] 2030244=test_ssl I, [2024-05-13T21:50:17.176704 #1989258] INFO -- : [ 10/885] 2030246=test_bundled_ca I, [2024-05-13T21:50:19.420734 #1989258] INFO -- : [ 11/885] 2030246=test_integer_comb I, [2024-05-13T21:50:21.558273 #1989258] INFO -- : [ 12/885] 2030246=test_load I, [2024-05-13T21:50:21.562412 #1989258] INFO -- : Leaked file descriptor: TestOptionParserLoad#test_load_xdg_config_home: 7 # I, [2024-05-13T21:50:21.562468 #1989258] INFO -- : Leaked file descriptor: TestOptionParserLoad#test_load_xdg_config_home: 8 # I, [2024-05-13T21:50:21.591018 #1989258] INFO -- : COMMAND PID USER FD TYPE DEVICE SIZE/OFF NODE NAME I, [2024-05-13T21:50:21.591081 #1989258] INFO -- : ruby 2030246 opc 7r REG 252,0 9253600 13705411 /var/lib/sss/mc/passwd I, [2024-05-13T21:50:21.591092 #1989258] INFO -- : ruby 2030246 opc 8u unix 0x0000000000000000 0t0 2969466568 type=STREAM I, [2024-05-13T21:50:21.616370 #1989258] INFO -- : [ 13/885] 2030246=test_abi I, [2024-05-13T21:50:21.795093 #1989258] INFO -- : [ 14/885] 2030246=test_gem_validator I, [2024-05-13T21:50:21.801432 #1989258] INFO -- : [ 15/885] 2030246=test_gem_source_installed I, [2024-05-13T21:50:21.829201 #1989258] INFO -- : [ 16/885] 2030246=test_usrmarshal I, [2024-05-13T21:50:22.009704 #1989258] INFO -- : [ 17/885] 2030246=test_erb_command I, [2024-05-13T21:50:22.051960 #1989258] INFO -- : [ 18/885] 2030246=test_module I, [2024-05-13T21:50:22.649738 #1989258] INFO -- : [ 19/885] 2030245=test_gem_security_trust_dir I, [2024-05-13T21:50:22.776805 #1989258] INFO -- : [ 20/885] 2030245=test_change_word I, [2024-05-13T21:50:22.781573 #1989258] INFO -- : [ 21/885] 2030245=test_depth_first I, [2024-05-13T21:50:22.813756 #1989258] INFO -- : [ 22/885] 2030245=test_ostruct I, [2024-05-13T21:50:22.957623 #1989258] INFO -- : [ 23/885] 2030245=test_config I, [2024-05-13T21:50:22.980226 #1989258] INFO -- : [ 24/885] 2030245=test_c_struct_entry I, [2024-05-13T21:50:23.099940 #1989258] INFO -- : [ 25/885] 2030245=static_inspect_test I, [2024-05-13T21:50:23.168620 #1989258] INFO -- : [ 26/885] 2030245=test_struct I, [2024-05-13T21:50:23.169632 #1989258] INFO -- : [ 27/885] 2030245=test_cparser I, [2024-05-13T21:50:23.606428 #1989258] INFO -- : [ 28/885] 2030245=fuzzer_test I, [2024-05-13T21:50:23.610050 #1989258] INFO -- : [ 29/885] 2030245=test_rubyvm I, [2024-05-13T21:50:23.622852 #1989258] INFO -- : [ 30/885] 2030245=test_custom_command I, [2024-05-13T21:50:23.683957 #1989258] INFO -- : [ 31/885] 2030246=test_rdoc_parser_markdown I, [2024-05-13T21:50:23.698003 #1989258] INFO -- : [ 32/885] 2030245=test_load I, [2024-05-13T21:50:23.843335 #1989258] INFO -- : [ 33/885] 2030245=test_rdoc_rd_inline_parser I, [2024-05-13T21:50:23.851417 #1989258] INFO -- : [ 34/885] 2030246=test_win32ole_type I, [2024-05-13T21:50:23.855421 #1989258] INFO -- : [ 35/885] 2030246=test_new I, [2024-05-13T21:50:23.855465 #1989258] INFO -- : [ 36/885] 2030246=test_update I, [2024-05-13T21:50:23.865952 #1989258] INFO -- : [ 37/885] 2030246=test_cipher I, [2024-05-13T21:50:23.878880 #1989258] INFO -- : [ 38/885] 2030245=test_gem_source_lock I, [2024-05-13T21:50:23.892635 #1989258] INFO -- : [ 39/885] 2030246=test_rdoc_markup_attribute_manager I, [2024-05-13T21:50:23.934271 #1989258] INFO -- : [ 40/885] 2030246=test_wss I, [2024-05-13T21:50:23.947152 #1989258] INFO -- : [ 41/885] 2030246=test_option I, [2024-05-13T21:50:23.955311 #1989258] INFO -- : [ 42/885] 2030245=test_not I, [2024-05-13T21:50:23.967708 #1989258] INFO -- : [ 43/885] 2030245=test_cgi_cookie I, [2024-05-13T21:50:23.973923 #1989258] INFO -- : [ 44/885] 2030245=test_tracer I, [2024-05-13T21:50:23.976992 #1989258] INFO -- : [ 45/885] 2030245=test_my_integer I, [2024-05-13T21:50:23.982963 #1989258] INFO -- : [ 46/885] 2030245=test_gem_resolver_composed_set I, [2024-05-13T21:50:24.005572 #1989258] INFO -- : [ 47/885] 2030245=test_debugger_integration I, [2024-05-13T21:50:24.063383 #1989258] INFO -- : [ 48/885] 2030245=test_objectspace I, [2024-05-13T21:50:24.072540 #1989258] INFO -- : [ 49/885] 2030246=test_require I, [2024-05-13T21:50:24.864652 #1989258] INFO -- : [ 50/885] 2030245=test_metaclass I, [2024-05-13T21:50:24.881893 #1989258] INFO -- : [ 51/885] 2030245=test_gem_gem_runner I, [2024-05-13T21:50:24.985371 #1989258] INFO -- : [ 52/885] 2030245=test_require_lib I, [2024-05-13T21:50:26.579937 #1989258] INFO -- : [ 53/885] 2030246=test_rdoc_generator_pot I, [2024-05-13T21:50:26.590878 #1989258] INFO -- : [ 54/885] 2030246=test_rdoc_markup_to_markdown I, [2024-05-13T21:50:26.649878 #1989258] INFO -- : [ 55/885] 2030246=test_rdoc_markup_to_joined_paragraph I, [2024-05-13T21:50:26.670397 #1989258] INFO -- : [ 56/885] 2030246=test_rdoc_rd I, [2024-05-13T21:50:26.700871 #1989258] INFO -- : [ 57/885] 2030246=test_x509store I, [2024-05-13T21:50:27.197513 #1989258] INFO -- : [ 58/885] 2030246=test_rdoc_rd_block_parser I, [2024-05-13T21:50:27.215399 #1989258] INFO -- : [ 59/885] 2030246=test_continuation I, [2024-05-13T21:50:27.226967 #1989258] INFO -- : [ 60/885] 2030246=test_fixnum I, [2024-05-13T21:50:27.267172 #1989258] INFO -- : [ 61/885] 2030246=test_signal I, [2024-05-13T21:50:27.378283 #1989258] INFO -- : [ 62/885] 2030244=test_gem_silent_ui I, [2024-05-13T21:50:27.418555 #1989258] INFO -- : [ 63/885] 2030244=test_gem_ci_detector I, [2024-05-13T21:50:27.436907 #1989258] INFO -- : [ 64/885] 2030244=test_io_wait_uncommon I, [2024-05-13T21:50:27.448060 #1989258] INFO -- : [ 65/885] 2030244=test_gem_security_policy I, [2024-05-13T21:50:27.837180 #1989258] INFO -- : [ 66/885] 2030244=test_rdoc_markup_document I, [2024-05-13T21:50:27.842384 #1989258] INFO -- : [ 67/885] 2030245=test_delete I, [2024-05-13T21:50:27.847547 #1989258] INFO -- : [ 68/885] 2030245=parse_stream_test I, [2024-05-13T21:50:27.868383 #1989258] INFO -- : [ 69/885] 2030245=test_handle I, [2024-05-13T21:50:27.972594 #1989258] INFO -- : [ 70/885] 2030244=test_completion I, [2024-05-13T21:50:28.154792 #1989258] INFO -- : [ 71/885] 2030245=test_file_exhaustive I, [2024-05-13T21:50:28.653663 #1989258] INFO -- : [ 72/885] 2030244=test_placearg I, [2024-05-13T21:50:28.676684 #1989258] INFO -- : Leaked file descriptor: TestFileExhaustive#test_expand_path_home_dir_string: 8 # I, [2024-05-13T21:50:28.676754 #1989258] INFO -- : Leaked file descriptor: TestFileExhaustive#test_expand_path_home_dir_string: 9 # I, [2024-05-13T21:50:28.699495 #1989258] INFO -- : COMMAND PID USER FD TYPE DEVICE SIZE/OFF NODE NAME I, [2024-05-13T21:50:28.699562 #1989258] INFO -- : ruby 2030245 opc 8r REG 252,0 9253600 13705411 /var/lib/sss/mc/passwd I, [2024-05-13T21:50:28.699573 #1989258] INFO -- : ruby 2030245 opc 9u unix 0x0000000000000000 0t0 2969470186 type=STREAM I, [2024-05-13T21:50:28.764135 #1989258] INFO -- : [ 73/885] 2030244=test_logperiod I, [2024-05-13T21:50:28.770503 #1989258] INFO -- : [ 74/885] 2030244=test_case_comprehensive I, [2024-05-13T21:50:29.237969 #1989258] INFO -- : [ 75/885] 2030246=test_rational2 I, [2024-05-13T21:50:29.247805 #1989258] INFO -- : [ 76/885] 2030246=test_gem_package_tar_header I, [2024-05-13T21:50:29.425477 #1989258] INFO -- : [ 77/885] 2030246=test_ssl_session I, [2024-05-13T21:50:30.164028 #1989258] INFO -- : [ 78/885] 2030246=test_ast I, [2024-05-13T21:50:34.392440 #1989258] INFO -- : [ 79/885] 2030245=test_logdevice I, [2024-05-13T21:50:35.280968 #1989258] INFO -- : [ 80/885] 2030245=test_variable_name_check I, [2024-05-13T21:50:35.330334 #1989258] INFO -- : [ 81/885] 2030245=test_bn I, [2024-05-13T21:50:35.387800 #1989258] INFO -- : [ 82/885] 2030245=test_require_path_check I, [2024-05-13T21:50:35.408225 #1989258] INFO -- : [ 83/885] 2030245=test_rdoc_markup_paragraph I, [2024-05-13T21:50:35.417221 #1989258] INFO -- : [ 84/885] 2030245=test_x509cert I, [2024-05-13T21:50:35.523410 #1989258] INFO -- : [ 85/885] 2030245=test_irb I, [2024-05-13T21:50:35.746445 #1989258] INFO -- : [ 86/885] 2030245=test_name_error_extension I, [2024-05-13T21:50:35.763703 #1989258] INFO -- : [ 87/885] 2030245=test_gem_request_set_gem_dependency_api I, [2024-05-13T21:50:36.035946 #1989258] INFO -- : [ 88/885] 2030245=test_object_create_start I, [2024-05-13T21:50:36.047365 #1989258] INFO -- : [ 89/885] 2030245=test_gem_commands_info_command I, [2024-05-13T21:50:36.066767 #1989258] INFO -- : [ 90/885] 2030245=test_https I, [2024-05-13T21:50:36.293017 #1989258] INFO -- : [ 91/885] 2030245=test_evaluation I, [2024-05-13T21:50:36.315369 #1989258] INFO -- : [ 92/885] 2030245=test_protocol I, [2024-05-13T21:50:36.629110 #1989258] INFO -- : [ 93/885] 2030245=test_weakkeymap I, [2024-05-13T21:50:36.900127 #1989258] INFO -- : [ 94/885] 2030245=test_files_test I, [2024-05-13T21:50:36.972824 #1989258] INFO -- : [ 95/885] 2030245=test_rdoc_markup_to_ansi I, [2024-05-13T21:50:37.027524 #1989258] INFO -- : [ 96/885] 2030245=test_digest I, [2024-05-13T21:50:37.795958 #1989258] INFO -- : [ 97/885] 2030245=test_signedness I, [2024-05-13T21:50:39.825663 #1989258] INFO -- : [ 98/885] 2030245=test_gem_commands_check_command I, [2024-05-13T21:50:39.888821 #1989258] INFO -- : [ 99/885] 2030245=test_gem_resolver_git_set I, [2024-05-13T21:50:40.549528 #1989258] INFO -- : [100/885] 2030245=test_ractor I, [2024-05-13T21:50:40.588614 #1989258] INFO -- : [101/885] 2030245=test_httpheader I, [2024-05-13T21:50:40.613912 #1989258] INFO -- : [102/885] 2030245=test_sexp I, [2024-05-13T21:50:40.643966 #1989258] INFO -- : [103/885] 2030245=test_rdoc_ri_driver I, [2024-05-13T21:50:41.096363 #1989258] INFO -- : [104/885] 2030245=test_gem_safe_marshal I, [2024-05-13T21:50:41.863094 #1989258] INFO -- : [105/885] 2030245=test_date_arith I, [2024-05-13T21:50:41.879137 #1989258] INFO -- : [106/885] 2030245=test_gem_resolver_vendor_specification I, [2024-05-13T21:50:41.927613 #1989258] INFO -- : [107/885] 2030245=json_generic_object_test I, [2024-05-13T21:50:41.945298 #1989258] INFO -- : [108/885] 2030245=test_fiddle I, [2024-05-13T21:50:42.055440 #1989258] INFO -- : [109/885] 2030245=test_stringscanner I, [2024-05-13T21:50:42.093106 #1989258] INFO -- : [110/885] 2030245=test_gem_resolver_installed_specification I, [2024-05-13T21:50:42.133052 #1989258] INFO -- : [111/885] 2030245=test_exception_at_throwing I, [2024-05-13T21:50:42.170614 #1989258] INFO -- : [112/885] 2030245=test_ractor I, [2024-05-13T21:50:42.258649 #1989258] INFO -- : [113/885] 2030245=test_struct I, [2024-05-13T21:50:42.815180 #1989258] INFO -- : [114/885] 2030245=test_tmpdir I, [2024-05-13T21:50:42.893299 #1989258] INFO -- : [115/885] 2030245=test_type I, [2024-05-13T21:50:42.927453 #1989258] INFO -- : [116/885] 2030245=heredoc_dedent_test I, [2024-05-13T21:50:42.945948 #1989258] INFO -- : [117/885] 2030245=test_mutex I, [2024-05-13T21:50:44.074405 #1989258] INFO -- : [118/885] 2030245=test_rdoc_token_stream I, [2024-05-13T21:50:44.080960 #1989258] INFO -- : [119/885] 2030245=test_gem_local_remote_options I, [2024-05-13T21:50:44.145581 #1989258] INFO -- : [120/885] 2030245=test_gem_ext_cargo_builder_link_flag_converter I, [2024-05-13T21:50:44.220756 #1989258] INFO -- : [121/885] 2030245=test_acceptable I, [2024-05-13T21:50:44.330802 #1989258] INFO -- : [122/885] 2030245=test_rdoc_single_class I, [2024-05-13T21:50:44.335939 #1989258] INFO -- : [123/885] 2030245=test_dup I, [2024-05-13T21:50:44.496909 #1989258] INFO -- : [124/885] 2030245=test_unicode I, [2024-05-13T21:50:44.506555 #1989258] INFO -- : [125/885] 2030245=test_eval_history I, [2024-05-13T21:50:44.524117 #1989258] INFO -- : [126/885] 2030245=dispatcher_test I, [2024-05-13T21:50:44.530183 #1989258] INFO -- : [127/885] 2030245=test_random I, [2024-05-13T21:50:44.543309 #1989258] INFO -- : [128/885] 2030245=test_thread_cv I, [2024-05-13T21:50:45.179871 #1989258] INFO -- : [129/885] 2030245=test_stringio I, [2024-05-13T21:50:45.315108 #1989258] INFO -- : [130/885] 2030245=test_assembler I, [2024-05-13T21:50:45.316687 #1989258] INFO -- : [131/885] 2030245=test_files_ext I, [2024-05-13T21:50:45.325054 #1989258] INFO -- : [132/885] 2030245=test_ripper I, [2024-05-13T21:50:45.632574 #1989258] INFO -- : [133/885] 2030245=test_lexer I, [2024-05-13T21:50:45.645893 #1989258] INFO -- : [134/885] 2030245=test_win32ole_method I, [2024-05-13T21:50:45.705964 #1989258] INFO -- : [135/885] 2030245=test_regex_casefold I, [2024-05-13T21:50:46.093046 #1989258] INFO -- : [136/885] 2030245=test_gem_source_git I, [2024-05-13T21:50:47.095141 #1989258] INFO -- : [137/885] 2030245=test_class I, [2024-05-13T21:50:47.161511 #1989258] INFO -- : [138/885] 2030245=test_have_macro I, [2024-05-13T21:50:47.391886 #1989258] INFO -- : [139/885] 2030245=test_mkmf I, [2024-05-13T21:50:47.420666 #1989258] INFO -- : [140/885] 2030245=test_gem_source I, [2024-05-13T21:50:47.773117 #1989258] INFO -- : [141/885] 2030245=test_at_exit I, [2024-05-13T21:50:47.811841 #1989258] INFO -- : [142/885] 2030245=test_benchmark I, [2024-05-13T21:50:48.611014 #1989258] INFO -- : [143/885] 2030244=test_array I, [2024-05-13T21:50:49.246991 #1989258] INFO -- : [144/885] 2030245=test_gem_package I, [2024-05-13T21:50:50.057732 #1989258] INFO -- : [145/885] 2030245=test_autoload I, [2024-05-13T21:50:54.328350 #1989258] INFO -- : [146/885] 2030245=test_rdoc_comment I, [2024-05-13T21:50:54.419121 #1989258] INFO -- : [147/885] 2030245=test_install I, [2024-05-13T21:50:54.561718 #1989258] INFO -- : [148/885] 2030245=test_encoding I, [2024-05-13T21:50:54.584190 #1989258] INFO -- : [149/885] 2030245=test_gem_source_fetch_problem I, [2024-05-13T21:50:54.598205 #1989258] INFO -- : [150/885] 2030245=test_ftp I, [2024-05-13T21:50:54.603989 #1989258] INFO -- : [151/885] 2030245=test_sockopt I, [2024-05-13T21:50:54.610467 #1989258] INFO -- : [152/885] 2030245=test_find_executable I, [2024-05-13T21:50:54.621789 #1989258] INFO -- : [153/885] 2030245=test_autoconf I, [2024-05-13T21:50:54.629086 #1989258] INFO -- : [154/885] 2030245=integer_parse_test I, [2024-05-13T21:50:54.631015 #1989258] INFO -- : [155/885] 2030245=test_ractor_compatibility I, [2024-05-13T21:50:54.643152 #1989258] INFO -- : [156/885] 2030244=test_arithmetic_sequence I, [2024-05-13T21:50:54.667548 #1989258] INFO -- : [157/885] 2030244=test_gem_request_set_lockfile_tokenizer I, [2024-05-13T21:50:54.744832 #1989258] INFO -- : [158/885] 2030244=test_cgi_multipart I, [2024-05-13T21:50:54.854895 #1989258] INFO -- : [159/885] 2030244=test_lazy_enumerator I, [2024-05-13T21:50:55.005318 #1989258] INFO -- : [160/885] 2030245=test_rdoc_ri_paths I, [2024-05-13T21:50:55.039892 #1989258] INFO -- : [161/885] 2030245=test_parser I, [2024-05-13T21:50:55.055507 #1989258] INFO -- : [162/885] 2030245=test_primitive I, [2024-05-13T21:50:55.074705 #1989258] INFO -- : [163/885] 2030245=test_iseq I, [2024-05-13T21:50:55.296582 #1989258] INFO -- : [164/885] 2030244=test_singleton_function I, [2024-05-13T21:50:55.338019 #1989258] INFO -- : [165/885] 2030244=test_gem_commands_setup_command I, [2024-05-13T21:50:55.700079 #1989258] INFO -- : [166/885] 2030245=test_history I, [2024-05-13T21:50:55.741067 #1989258] INFO -- : [167/885] 2030245=test_document I, [2024-05-13T21:50:55.750662 #1989258] INFO -- : [168/885] 2030245=test_eval I, [2024-05-13T21:50:55.753713 #1989258] INFO -- : [169/885] 2030245=test_gem_safe_yaml I, [2024-05-13T21:50:55.768581 #1989258] INFO -- : [170/885] 2030245=test_gem_package_tar_reader I, [2024-05-13T21:50:55.846705 #1989258] INFO -- : [171/885] 2030245=test_gem_commands_signout_command I, [2024-05-13T21:50:55.864535 #1989258] INFO -- : [172/885] 2030245=test_env I, [2024-05-13T21:50:56.151865 #1989258] INFO -- : [173/885] 2030244=test_win32ole_variant_m I, [2024-05-13T21:50:56.165370 #1989258] INFO -- : [174/885] 2030244=test_pair I, [2024-05-13T21:50:58.485575 #1989258] INFO -- : [175/885] 2030245=command_line_test I, [2024-05-13T21:50:58.547355 #1989258] INFO -- : [176/885] 2030245=test_io I, [2024-05-13T21:51:01.413853 #1989258] INFO -- : [177/885] 2030244=test_uncorrectable_name_check I, [2024-05-13T21:51:01.422174 #1989258] INFO -- : [178/885] 2030244=test_rdoc_rd_inline I, [2024-05-13T21:51:01.430659 #1989258] INFO -- : [179/885] 2030244=test_digest I, [2024-05-13T21:51:01.437675 #1989258] INFO -- : [180/885] 2030244=test_path I, [2024-05-13T21:51:01.444454 #1989258] INFO -- : [181/885] 2030244=test_rubygems I, [2024-05-13T21:51:01.649592 #1989258] INFO -- : [182/885] 2030244=test_resolve_symbol I, [2024-05-13T21:51:01.688214 #1989258] INFO -- : [183/885] 2030244=test_closure I, [2024-05-13T21:51:03.822794 #1989258] INFO -- : [184/885] 2030244=test_files_test_1 I, [2024-05-13T21:51:06.292856 #1989258] INFO -- : [185/885] 2030244=test_dir I, [2024-05-13T21:51:06.388139 #1989258] INFO -- : Leaked file descriptor: TestDir#test_home: 9 # I, [2024-05-13T21:51:06.419031 #1989258] INFO -- : COMMAND PID USER FD TYPE DEVICE SIZE/OFF NODE NAME I, [2024-05-13T21:51:06.419102 #1989258] INFO -- : ruby 2030244 opc 9r REG 252,0 9253600 13705411 /var/lib/sss/mc/passwd I, [2024-05-13T21:51:06.647069 #1989258] INFO -- : [186/885] 2030244=test_stat I, [2024-05-13T21:51:06.666539 #1989258] INFO -- : [187/885] 2030244=test_etc I, [2024-05-13T21:51:06.737444 #1989258] INFO -- : [188/885] 2030244=test_gem_commands_rebuild_command I, [2024-05-13T21:51:06.789988 #1989258] INFO -- : [189/885] 2030244=test_nomethod_error I, [2024-05-13T21:51:06.806689 #1989258] INFO -- : [190/885] 2030244=test_rdoc_parser I, [2024-05-13T21:51:06.840748 #1989258] INFO -- : [191/885] 2030244=test_https_proxy I, [2024-05-13T21:51:06.884785 #1989258] INFO -- : [192/885] 2030244=test_win32ole_param_event I, [2024-05-13T21:51:06.889729 #1989258] INFO -- : [193/885] 2030244=test_cgi_modruby I, [2024-05-13T21:51:06.948379 #1989258] INFO -- : [194/885] 2030244=magic_comment_test I, [2024-05-13T21:51:06.955818 #1989258] INFO -- : [195/885] 2030244=test_win32ole_variant I, [2024-05-13T21:51:06.962054 #1989258] INFO -- : [196/885] 2030244=test_workspace I, [2024-05-13T21:51:07.073698 #1989258] INFO -- : [197/885] 2030244=test_printf I, [2024-05-13T21:51:07.125126 #1989258] INFO -- : [198/885] 2030244=test_x509attr I, [2024-05-13T21:51:07.134082 #1989258] INFO -- : [199/885] 2030244=test_rdoc_parser_simple I, [2024-05-13T21:51:07.152028 #1989258] INFO -- : [200/885] 2030244=test_nonblock I, [2024-05-13T21:51:07.160326 #1989258] INFO -- : [201/885] 2030244=test_gem_ext_configure_builder I, [2024-05-13T21:51:07.210266 #1989258] INFO -- : [202/885] 2030244=json_ext_parser_test I, [2024-05-13T21:51:07.217049 #1989258] INFO -- : [203/885] 2030244=test_shellwords I, [2024-05-13T21:51:07.229310 #1989258] INFO -- : [204/885] 2030244=test_mul I, [2024-05-13T21:51:07.235068 #1989258] INFO -- : [205/885] 2030244=test_rdoc_generator_pot_po I, [2024-05-13T21:51:07.245031 #1989258] INFO -- : [206/885] 2030244=test_omap I, [2024-05-13T21:51:07.253046 #1989258] INFO -- : [207/885] 2030244=test_date_strptime I, [2024-05-13T21:51:07.385416 #1989258] INFO -- : [208/885] 2030244=test_ipaddr I, [2024-05-13T21:51:07.424766 #1989258] INFO -- : [209/885] 2030244=test_scanner_events I, [2024-05-13T21:51:07.451683 #1989258] INFO -- : [210/885] 2030244=test_ocsp I, [2024-05-13T21:51:07.533039 #1989258] INFO -- : [211/885] 2030245=test_rdoc_generator_ri I, [2024-05-13T21:51:07.548758 #1989258] INFO -- : [212/885] 2030244=test_gem_stream_ui I, [2024-05-13T21:51:07.574058 #1989258] INFO -- : [213/885] 2030245=test_unicode_normalize I, [2024-05-13T21:51:07.667123 #1989258] INFO -- : [214/885] 2030244=test_reline_key I, [2024-05-13T21:51:07.680425 #1989258] INFO -- : [215/885] 2030244=test_gem_commands_lock_command I, [2024-05-13T21:51:07.704214 #1989258] INFO -- : [216/885] 2030244=test_gb18030 I, [2024-05-13T21:51:07.713355 #1989258] INFO -- : [217/885] 2030244=test_propertyputref I, [2024-05-13T21:51:07.793596 #1989258] INFO -- : [218/885] 2030244=test_color I, [2024-05-13T21:51:07.803272 #1989258] INFO -- : [219/885] 2030244=test_float I, [2024-05-13T21:51:09.563490 #1989258] INFO -- : [220/885] 2030244=test_gem_stub_specification I, [2024-05-13T21:51:09.734335 #1989258] INFO -- : [221/885] 2030244=test_cmethod I, [2024-05-13T21:51:09.739965 #1989258] INFO -- : [222/885] 2030244=test_rdoc_top_level I, [2024-05-13T21:51:10.049619 #1989258] INFO -- : [223/885] 2030244=test_io_m17n I, [2024-05-13T21:51:11.360129 #1989258] INFO -- : [224/885] 2030244=test_alias I, [2024-05-13T21:51:11.516698 #1989258] INFO -- : [225/885] 2030244=test_fips I, [2024-05-13T21:51:11.751906 #1989258] INFO -- : [226/885] 2030245=test_emitter I, [2024-05-13T21:51:11.764248 #1989258] INFO -- : [227/885] 2030245=test_getopts I, [2024-05-13T21:51:11.778524 #1989258] INFO -- : [228/885] 2030245=test_thread_fd_close I, [2024-05-13T21:51:11.784124 #1989258] INFO -- : [229/885] 2030245=test_last_thread I, [2024-05-13T21:51:11.816064 #1989258] INFO -- : [230/885] 2030244=test_digest_extend I, [2024-05-13T21:51:11.825651 #1989258] INFO -- : [231/885] 2030244=test_gem_ext_cmake_builder I, [2024-05-13T21:51:11.853597 #1989258] INFO -- : [232/885] 2030244=test_rdoc_markup_formatter I, [2024-05-13T21:51:11.859952 #1989258] INFO -- : [233/885] 2030244=test_gem_commands_uninstall_command I, [2024-05-13T21:51:12.666408 #1989258] INFO -- : [234/885] 2030244=test_win32ole_event I, [2024-05-13T21:51:12.666601 #1989258] INFO -- : [235/885] 2030244=test_helper I, [2024-05-13T21:51:12.678942 #1989258] INFO -- : [236/885] 2030244=test_compile_prism I, [2024-05-13T21:51:12.866377 #1989258] INFO -- : [237/885] 2030245=test_io_console I, [2024-05-13T21:51:12.958054 #1989258] INFO -- : [238/885] 2030244=test_flip I, [2024-05-13T21:51:12.992140 #1989258] INFO -- : [239/885] 2030244=test_rdoc_markup_heading I, [2024-05-13T21:51:13.012835 #1989258] INFO -- : [240/885] 2030244=test_x509crl I, [2024-05-13T21:51:13.139318 #1989258] INFO -- : [241/885] 2030244=test_c_union_entity I, [2024-05-13T21:51:13.220884 #1989258] INFO -- : [242/885] 2030244=test_cgi_session I, [2024-05-13T21:51:13.233683 #1989258] INFO -- : [243/885] 2030244=test_notimplement I, [2024-05-13T21:51:13.243755 #1989258] INFO -- : [244/885] 2030244=test_dns I, [2024-05-13T21:51:13.682308 #1989258] INFO -- : [245/885] 2030244=test_gem_commands_cleanup_command I, [2024-05-13T21:51:13.929031 #1989258] INFO -- : [246/885] 2030246=test_class2name I, [2024-05-13T21:51:13.963879 #1989258] INFO -- : [247/885] 2030246=test_refinement I, [2024-05-13T21:51:14.311267 #1989258] INFO -- : [248/885] 2030244=test_transcode I, [2024-05-13T21:51:14.479768 #1989258] INFO -- : [249/885] 2030244=test_debug I, [2024-05-13T21:51:14.546713 #1989258] INFO -- : [250/885] 2030244=test_profile_frames I, [2024-05-13T21:51:14.653637 #1989258] INFO -- : [251/885] 2030244=test_pattern_key_name_check I, [2024-05-13T21:51:14.668325 #1989258] INFO -- : [252/885] 2030244=test_x509req I, [2024-05-13T21:51:14.694006 #1989258] INFO -- : [253/885] 2030244=test_rdoc_parser_ruby I, [2024-05-13T21:51:15.382157 #1989258] INFO -- : [254/885] 2030244=test_httpresponse I, [2024-05-13T21:51:15.405955 #1989258] INFO -- : [255/885] 2030244=test_readpartial I, [2024-05-13T21:51:15.437545 #1989258] INFO -- : [256/885] 2030245=test_insns_leaf I, [2024-05-13T21:51:15.444232 #1989258] INFO -- : [257/885] 2030245=test_ifunless I, [2024-05-13T21:51:15.607037 #1989258] INFO -- : [258/885] 2030245=test_allocation I, [2024-05-13T21:51:15.812882 #1989258] INFO -- : [259/885] 2030244=test_gem_console_ui I, [2024-05-13T21:51:15.828662 #1989258] INFO -- : [260/885] 2030244=test_config I, [2024-05-13T21:51:15.921802 #1989258] INFO -- : [261/885] 2030244=test_func I, [2024-05-13T21:51:17.621091 #1989258] INFO -- : [262/885] 2030246=test_vm_dump I, [2024-05-13T21:51:17.640046 #1989258] INFO -- : [263/885] 2030246=json_encoding_test I, [2024-05-13T21:51:17.653954 #1989258] INFO -- : [264/885] 2030246=errors_test I, [2024-05-13T21:51:17.897734 #1989258] INFO -- : [265/885] 2030246=test_convertible I, [2024-05-13T21:51:17.977353 #1989258] INFO -- : [266/885] 2030245=test_gem_available_set I, [2024-05-13T21:51:18.077439 #1989258] INFO -- : [267/885] 2030245=test_pkg_config I, [2024-05-13T21:51:18.085913 #1989258] INFO -- : [268/885] 2030245=test_modify_expand I, [2024-05-13T21:51:18.615094 #1989258] INFO -- : [269/885] 2030245=test_super I, [2024-05-13T21:51:20.074240 #1989258] INFO -- : [270/885] 2030245=test_color_printer I, [2024-05-13T21:51:20.112356 #1989258] INFO -- : [271/885] 2030245=unescape_test I, [2024-05-13T21:51:20.401050 #1989258] INFO -- : [272/885] 2030244=test_gem_commands_exec_command I, [2024-05-13T21:51:21.432748 #1989258] INFO -- : [273/885] 2030245=test_dln I, [2024-05-13T21:51:21.444715 #1989258] INFO -- : [274/885] 2030245=test_object I, [2024-05-13T21:51:21.624608 #1989258] INFO -- : [275/885] 2030246=test_gem_source_vendor I, [2024-05-13T21:51:21.628169 #1989258] INFO -- : [276/885] 2030246=test_gem_resolver I, [2024-05-13T21:51:21.764551 #1989258] INFO -- : [277/885] 2030245=test_object_references I, [2024-05-13T21:51:21.792802 #1989258] INFO -- : [278/885] 2030245=test_gem_source_subpath_problem I, [2024-05-13T21:51:21.797643 #1989258] INFO -- : [279/885] 2030244=test_arith_seq_extract I, [2024-05-13T21:51:21.920324 #1989258] INFO -- : [280/885] 2030245=compiler_test I, [2024-05-13T21:51:21.927934 #1989258] INFO -- : [281/885] 2030245=test_ruby_lex I, [2024-05-13T21:51:21.961149 #1989258] INFO -- : [282/885] 2030246=test_ossl I, [2024-05-13T21:51:21.990414 #1989258] INFO -- : [283/885] 2030244=test_buffered_io I, [2024-05-13T21:51:22.052659 #1989258] INFO -- : [284/885] 2030244=test_bug_reporter I, [2024-05-13T21:51:22.090412 #1989258] INFO -- : [285/885] 2030245=test_gem_installer I, [2024-05-13T21:51:22.195241 #1989258] INFO -- : [286/885] 2030244=test_within_pipe I, [2024-05-13T21:51:22.228105 #1989258] INFO -- : [287/885] 2030244=test_rdoc_normal_class I, [2024-05-13T21:51:22.308390 #1989258] INFO -- : [288/885] 2030244=test_pointer I, [2024-05-13T21:51:23.451799 #1989258] INFO -- : [289/885] 2030244=test_whileuntil I, [2024-05-13T21:51:23.471949 #1989258] INFO -- : [290/885] 2030244=test_regexp I, [2024-05-13T21:51:27.160078 #1989258] INFO -- : [291/885] 2030245=test_nofree I, [2024-05-13T21:51:27.168702 #1989258] INFO -- : [292/885] 2030245=test_monitor I, [2024-05-13T21:51:27.388407 #1989258] INFO -- : [293/885] 2030245=test_beginendblock I, [2024-05-13T21:51:27.730641 #1989258] INFO -- : [294/885] 2030245=test_eval I, [2024-05-13T21:51:27.991786 #1989258] INFO -- : [295/885] 2030245=test_case_options I, [2024-05-13T21:51:28.001967 #1989258] INFO -- : [296/885] 2030245=test_cgi_header I, [2024-05-13T21:51:28.009605 #1989258] INFO -- : [297/885] 2030245=format_errors_test I, [2024-05-13T21:51:28.018417 #1989258] INFO -- : [298/885] 2030245=test_object I, [2024-05-13T21:51:28.026486 #1989258] INFO -- : [299/885] 2030245=test_member I, [2024-05-13T21:51:28.036595 #1989258] INFO -- : [300/885] 2030245=test_kill_ring I, [2024-05-13T21:51:28.048100 #1989258] INFO -- : [301/885] 2030245=test_mailto I, [2024-05-13T21:51:28.085619 #1989258] INFO -- : [302/885] 2030245=test_addr I, [2024-05-13T21:51:28.153690 #1989258] INFO -- : [303/885] 2030245=test_gem_resolver_api_set I, [2024-05-13T21:51:28.237222 #1989258] INFO -- : [304/885] 2030245=test_duplicate I, [2024-05-13T21:51:28.237873 #1989258] INFO -- : [305/885] 2030245=test_helper I, [2024-05-13T21:51:28.250653 #1989258] INFO -- : [306/885] 2030245=test_gem_resolver_installer_set I, [2024-05-13T21:51:28.535449 #1989258] INFO -- : [307/885] 2030245=test_append I, [2024-05-13T21:51:28.544170 #1989258] INFO -- : [308/885] 2030245=test_foreach I, [2024-05-13T21:51:28.557461 #1989258] INFO -- : [309/885] 2030245=test_rdoc_markup_to_html I, [2024-05-13T21:51:28.671555 #1989258] INFO -- : [310/885] 2030245=test_helper_method I, [2024-05-13T21:51:28.687043 #1989258] INFO -- : [311/885] 2030245=test_summary I, [2024-05-13T21:51:28.754012 #1989258] INFO -- : [312/885] 2030245=test_file I, [2024-05-13T21:51:29.666815 #1989258] INFO -- : [313/885] 2030246=test_config I, [2024-05-13T21:51:29.989246 #1989258] INFO -- : [314/885] 2030246=bom_test I, [2024-05-13T21:51:30.000409 #1989258] INFO -- : [315/885] 2030246=test_emitter I, [2024-05-13T21:51:30.008084 #1989258] INFO -- : [316/885] 2030246=test_x509ext I, [2024-05-13T21:51:30.016510 #1989258] INFO -- : [317/885] 2030246=test_rb_str_dup I, [2024-05-13T21:51:30.024738 #1989258] INFO -- : [318/885] 2030246=test_lambda I, [2024-05-13T21:51:30.085408 #1989258] INFO -- : [319/885] 2030246=test_scalar_scanner I, [2024-05-13T21:51:30.098599 #1989258] INFO -- : [320/885] 2030246=test_win32ole_type_event I, [2024-05-13T21:51:30.141457 #1989258] INFO -- : [321/885] 2030246=test_keyword I, [2024-05-13T21:51:30.628917 #1989258] INFO -- : [322/885] 2030246=test_gem_path_support I, [2024-05-13T21:51:30.665769 #1989258] INFO -- : [323/885] 2030246=test_arity I, [2024-05-13T21:51:30.686118 #1989258] INFO -- : [324/885] 2030246=test_trace I, [2024-05-13T21:51:30.706066 #1989258] INFO -- : [325/885] 2030246=test_gem_request_set I, [2024-05-13T21:51:31.231212 #1989258] INFO -- : [326/885] 2030246=test_gem_bundler_version_finder I, [2024-05-13T21:51:31.922488 #1989258] INFO -- : [327/885] 2030246=test_gc I, [2024-05-13T21:51:34.962514 #1989258] INFO -- : [328/885] 2030245=test_pattern_matching I, [2024-05-13T21:51:34.992801 #1989258] INFO -- : [329/885] 2030245=test_folderitem2_invokeverb I, [2024-05-13T21:51:35.001557 #1989258] INFO -- : [330/885] 2030245=test_interned_str I, [2024-05-13T21:51:35.010581 #1989258] INFO -- : [331/885] 2030245=constant_path_node_test I, [2024-05-13T21:51:35.020613 #1989258] INFO -- : [332/885] 2030245=test_set_len I, [2024-05-13T21:51:35.034275 #1989258] INFO -- : [333/885] 2030245=test_webauthn_listener_response I, [2024-05-13T21:51:35.198596 #1989258] INFO -- : [334/885] 2030245=test_sleep I, [2024-05-13T21:51:39.860710 #1989258] INFO -- : [335/885] 2030246=test_gem_resolver_index_set I, [2024-05-13T21:51:39.892782 #1989258] INFO -- : [336/885] 2030246=ruby_api_test I, [2024-05-13T21:51:40.054095 #1989258] INFO -- : [337/885] 2030246=test_popen_deadlock I, [2024-05-13T21:51:40.077966 #1989258] INFO -- : [338/885] 2030245=test_time I, [2024-05-13T21:51:40.258873 #1989258] INFO -- : [339/885] 2030245=test_alias_and_anchor I, [2024-05-13T21:51:40.273986 #1989258] INFO -- : [340/885] 2030245=test_key_stroke I, [2024-05-13T21:51:40.300186 #1989258] INFO -- : [341/885] 2030245=test_rdoc_markup I, [2024-05-13T21:51:40.315372 #1989258] INFO -- : [342/885] 2030245=test_euc_jp I, [2024-05-13T21:51:40.345825 #1989258] INFO -- : [343/885] 2030245=test_ensured I, [2024-05-13T21:51:40.428527 #1989258] INFO -- : [344/885] 2030245=test_delegate I, [2024-05-13T21:51:40.442892 #1989258] INFO -- : [345/885] 2030245=test_chilled I, [2024-05-13T21:51:40.449332 #1989258] INFO -- : [346/885] 2030245=location_test I, [2024-05-13T21:51:40.510033 #1989258] INFO -- : [347/885] 2030245=test_symbol I, [2024-05-13T21:51:40.516207 #1989258] INFO -- : [348/885] 2030245=test_project_sanity I, [2024-05-13T21:51:40.586043 #1989258] INFO -- : [349/885] 2030245=test_gem_commands_build_command I, [2024-05-13T21:51:40.694637 #1989258] INFO -- : [350/885] 2030246=test_call I, [2024-05-13T21:51:40.937042 #1989258] INFO -- : [351/885] 2030246=test_ellipsize I, [2024-05-13T21:51:40.946689 #1989258] INFO -- : [352/885] 2030245=test_reline I, [2024-05-13T21:51:40.960313 #1989258] INFO -- : [353/885] 2030246=test_history I, [2024-05-13T21:51:41.101535 #1989258] INFO -- : [354/885] 2030246=test_to_ary_concat I, [2024-05-13T21:51:41.247308 #1989258] INFO -- : [355/885] 2030245=test_gem_ext_builder I, [2024-05-13T21:51:42.294162 #1989258] INFO -- : [356/885] 2030245=test_windows_1251 I, [2024-05-13T21:51:42.304519 #1989258] INFO -- : [357/885] 2030245=test_to_ruby I, [2024-05-13T21:51:42.330761 #1989258] INFO -- : [358/885] 2030245=test_addrinfo I, [2024-05-13T21:51:42.421048 #1989258] INFO -- : [359/885] 2030245=test_time_tz I, [2024-05-13T21:51:42.522736 #1989258] INFO -- : [360/885] 2030245=test_thread I, [2024-05-13T21:51:43.853369 #1989258] INFO -- : [361/885] 2030246=test_terminfo I, [2024-05-13T21:51:43.975104 #1989258] INFO -- : [362/885] 2030246=test_socket I, [2024-05-13T21:51:44.787017 #1989258] INFO -- : [363/885] 2030246=test_inlinecache I, [2024-05-13T21:51:44.848672 #1989258] INFO -- : [364/885] 2030246=test_bug-14834 I, [2024-05-13T21:51:44.916629 #1989258] INFO -- : [365/885] 2030246=test_data I, [2024-05-13T21:51:45.052748 #1989258] INFO -- : [366/885] 2030246=test_ssl I, [2024-05-13T21:51:45.151979 #1989258] INFO -- : [367/885] 2030246=test_scheduler I, [2024-05-13T21:51:45.353319 #1989258] INFO -- : [368/885] 2030246=test_gem_commands_help_command I, [2024-05-13T21:51:45.459090 #1989258] INFO -- : [369/885] 2030246=test_ractor I, [2024-05-13T21:51:45.810485 #1989258] INFO -- : [370/885] 2030246=test_gem_resolver_conflict I, [2024-05-13T21:51:45.829354 #1989258] INFO -- : [371/885] 2030246=test_nesting_parser I, [2024-05-13T21:51:45.920707 #1989258] INFO -- : [372/885] 2030246=ractor_test I, [2024-05-13T21:51:45.925675 #1989258] INFO -- : [373/885] 2030244=test_ancdata I, [2024-05-13T21:51:45.938743 #1989258] INFO -- : [374/885] 2030244=test_marshal I, [2024-05-13T21:51:45.966902 #1989258] INFO -- : [375/885] 2030246=test_rdoc_markup_hard_break I, [2024-05-13T21:51:45.977666 #1989258] INFO -- : [376/885] 2030246=newline_test I, [2024-05-13T21:51:46.056759 #1989258] INFO -- : [377/885] 2030246=test_bignum I, [2024-05-13T21:51:46.979176 #1989258] INFO -- : [378/885] 2030244=test_enc_str_buf_cat I, [2024-05-13T21:51:46.988350 #1989258] INFO -- : [379/885] 2030244=test_cgi_core I, [2024-05-13T21:51:47.003214 #1989258] INFO -- : [380/885] 2030244=test_gem_resolver_best_set I, [2024-05-13T21:51:47.071813 #1989258] INFO -- : [381/885] 2030244=test_rdoc_markup_to_label I, [2024-05-13T21:51:47.114012 #1989258] INFO -- : [382/885] 2030244=test_parser I, [2024-05-13T21:51:47.136797 #1989258] INFO -- : [383/885] 2030244=test_ractor I, [2024-05-13T21:51:47.144862 #1989258] INFO -- : [384/885] 2030244=test_ansi_without_terminfo I, [2024-05-13T21:51:47.154154 #1989258] INFO -- : [385/885] 2030244=json_generator_test I, [2024-05-13T21:51:47.268852 #1989258] INFO -- : [386/885] 2030244=test_gem I, [2024-05-13T21:51:49.559294 #1989258] INFO -- : [387/885] 2030244=test_registry I, [2024-05-13T21:51:49.566140 #1989258] INFO -- : [388/885] 2030244=test_ts I, [2024-05-13T21:51:49.652130 #1989258] INFO -- : [389/885] 2030246=test_locale I, [2024-05-13T21:51:49.682586 #1989258] INFO -- : [390/885] 2030246=test_rdoc_attr I, [2024-05-13T21:51:49.701041 #1989258] INFO -- : [391/885] 2030246=test_ractor I, [2024-05-13T21:51:49.765176 #1989258] INFO -- : [392/885] 2030246=test_trick I, [2024-05-13T21:51:49.845086 #1989258] INFO -- : [393/885] 2030244=test_stream I, [2024-05-13T21:51:49.876374 #1989258] INFO -- : [394/885] 2030244=test_address_resolve I, [2024-05-13T21:51:49.898518 #1989258] INFO -- : [395/885] 2030244=test_enum I, [2024-05-13T21:51:50.832901 #1989258] INFO -- : [396/885] 2030244=test_rdoc_markup_include I, [2024-05-13T21:51:50.835283 #1989258] INFO -- : [397/885] 2030244=test_require I, [2024-05-13T21:51:51.341373 #1989258] INFO -- : [398/885] 2030245=test_recursion I, [2024-05-13T21:51:51.345446 #1989258] INFO -- : [399/885] 2030245=test_gem_commands_signin_command I, [2024-05-13T21:51:51.520249 #1989258] INFO -- : [400/885] 2030245=test_range I, [2024-05-13T21:51:52.213698 #1989258] INFO -- : [401/885] 2030244=test_iter_break I, [2024-05-13T21:51:52.216205 #1989258] INFO -- : [402/885] 2030244=test_extlibs I, [2024-05-13T21:51:52.247376 #1989258] INFO -- : [403/885] 2030245=test_num2int I, [2024-05-13T21:51:52.272044 #1989258] INFO -- : [404/885] 2030245=test_rbconfig I, [2024-05-13T21:51:52.277790 #1989258] INFO -- : [405/885] 2030245=test_integer I, [2024-05-13T21:51:52.345566 #1989258] INFO -- : [406/885] 2030246=test_unix I, [2024-05-13T21:51:52.435856 #1989258] INFO -- : [407/885] 2030246=test_formatter I, [2024-05-13T21:51:52.446159 #1989258] INFO -- : [408/885] 2030246=test_coder I, [2024-05-13T21:51:52.465052 #1989258] INFO -- : [409/885] 2030246=test_rdoc_servlet I, [2024-05-13T21:51:52.565614 #1989258] INFO -- : [410/885] 2030246=test_gem_commands_search_command I, [2024-05-13T21:51:52.565998 #1989258] INFO -- : [411/885] 2030246=test_symbol I, [2024-05-13T21:51:53.806583 #1989258] INFO -- : [412/885] 2030244=test_udp I, [2024-05-13T21:51:53.820818 #1989258] INFO -- : [413/885] 2030244=test_context I, [2024-05-13T21:51:53.961757 #1989258] INFO -- : [414/885] 2030244=test_gem_commands_contents_command I, [2024-05-13T21:51:54.094047 #1989258] INFO -- : [415/885] 2030244=test_gem_commands_list_command I, [2024-05-13T21:51:54.104902 #1989258] INFO -- : [416/885] 2030244=test_date_new I, [2024-05-13T21:51:54.210436 #1989258] INFO -- : [417/885] 2030244=test_configuration I, [2024-05-13T21:51:54.232813 #1989258] INFO -- : [418/885] 2030244=test_gem_resolver_local_specification I, [2024-05-13T21:51:54.257070 #1989258] INFO -- : [419/885] 2030244=test_date_marshal I, [2024-05-13T21:51:54.925095 #1989258] INFO -- : [420/885] 2030244=test_have_func I, [2024-05-13T21:51:54.945869 #1989258] INFO -- : [421/885] 2030245=test_rdoc_i18n_text I, [2024-05-13T21:51:54.957094 #1989258] INFO -- : [422/885] 2030245=test_io I, [2024-05-13T21:51:55.161030 #1989258] INFO -- : [423/885] 2030245=test_input_method I, [2024-05-13T21:51:55.265722 #1989258] INFO -- : [424/885] 2030245=test_gem_util I, [2024-05-13T21:51:55.373085 #1989258] INFO -- : [425/885] 2030245=test_complex2 I, [2024-05-13T21:51:55.387881 #1989258] INFO -- : [426/885] 2030245=test_config I, [2024-05-13T21:51:55.455454 #1989258] INFO -- : [427/885] 2030245=test_gem_security_signer I, [2024-05-13T21:51:55.591402 #1989258] INFO -- : [428/885] 2030245=test_thread I, [2024-05-13T21:51:55.648866 #1989258] INFO -- : [429/885] 2030244=test_literal I, [2024-05-13T21:51:55.807582 #1989258] INFO -- : [430/885] 2030245=test_gem_unsatisfiable_dependency_error I, [2024-05-13T21:51:55.833905 #1989258] INFO -- : [431/885] 2030245=test_gem_platform I, [2024-05-13T21:51:56.010309 #1989258] INFO -- : [432/885] 2030245=test_gem_commands_query_command I, [2024-05-13T21:51:56.214371 #1989258] INFO -- : [433/885] 2030244=test_bigzero I, [2024-05-13T21:51:56.216353 #1989258] INFO -- : [434/885] 2030244=test_external_new I, [2024-05-13T21:51:56.230459 #1989258] INFO -- : [435/885] 2030244=test_pkey I, [2024-05-13T21:51:56.236797 #1989258] INFO -- : [436/885] 2030244=test_win32ole_typelib I, [2024-05-13T21:51:56.257801 #1989258] INFO -- : [437/885] 2030244=test_m17n_comb I, [2024-05-13T21:51:56.763604 #1989258] INFO -- : [438/885] 2030245=test_pkey_dh I, [2024-05-13T21:51:57.734627 #1989258] INFO -- : [439/885] 2030246=test_multi_irb_commands I, [2024-05-13T21:51:57.746586 #1989258] INFO -- : [440/885] 2030246=test_memory_view I, [2024-05-13T21:51:57.769222 #1989258] INFO -- : [441/885] 2030246=test_data I, [2024-05-13T21:51:57.830753 #1989258] INFO -- : [442/885] 2030246=test_ractor I, [2024-05-13T21:51:57.836200 #1989258] INFO -- : [443/885] 2030246=test_null I, [2024-05-13T21:51:57.857555 #1989258] INFO -- : [444/885] 2030246=test_rdoc_alias I, [2024-05-13T21:51:57.884997 #1989258] INFO -- : [445/885] 2030246=test_instrumentation_api I, [2024-05-13T21:51:58.208297 #1989258] INFO -- : [446/885] 2030245=test_weakref I, [2024-05-13T21:51:58.535105 #1989258] INFO -- : [447/885] 2030244=test_rdoc_markup_raw I, [2024-05-13T21:51:58.545949 #1989258] INFO -- : [448/885] 2030244=test_rdoc_markup_to_bs I, [2024-05-13T21:51:58.560524 #1989258] INFO -- : [449/885] 2030245=test_key_name_check I, [2024-05-13T21:51:58.570166 #1989258] INFO -- : [450/885] 2030245=test_timeout I, [2024-05-13T21:51:58.585206 #1989258] INFO -- : [451/885] 2030244=test_word I, [2024-05-13T21:51:58.593825 #1989258] INFO -- : [452/885] 2030244=test_rdoc_require I, [2024-05-13T21:51:58.695593 #1989258] INFO -- : [453/885] 2030244=test_gem_ext_rake_builder I, [2024-05-13T21:51:59.219761 #1989258] INFO -- : [454/885] 2030244=test_numeric I, [2024-05-13T21:51:59.231686 #1989258] INFO -- : [455/885] 2030244=test_fstring I, [2024-05-13T21:51:59.345059 #1989258] INFO -- : [456/885] 2030244=test_singleton I, [2024-05-13T21:51:59.506707 #1989258] INFO -- : [457/885] 2030244=test_gem_commands_cert_command I, [2024-05-13T21:51:59.520502 #1989258] INFO -- : [458/885] 2030245=json_parser_test I, [2024-05-13T21:51:59.555553 #1989258] INFO -- : [459/885] 2030245=test_date_strftime I, [2024-05-13T21:51:59.962359 #1989258] INFO -- : [460/885] 2030245=test_ws I, [2024-05-13T21:51:59.966253 #1989258] INFO -- : [461/885] 2030244=test_rdoc_markup_to_tt_only I, [2024-05-13T21:51:59.971096 #1989258] INFO -- : [462/885] 2030245=ruby_parser_test I, [2024-05-13T21:51:59.973617 #1989258] INFO -- : [463/885] 2030245=test_gem_commands_stale_command I, [2024-05-13T21:52:00.006891 #1989258] INFO -- : [464/885] 2030245=test_pack I, [2024-05-13T21:52:00.019796 #1989258] INFO -- : [465/885] 2030244=test_pkcs7 I, [2024-05-13T21:52:00.200690 #1989258] INFO -- : [466/885] 2030244=test_gem_commands_environment_command I, [2024-05-13T21:52:00.229283 #1989258] INFO -- : [467/885] 2030245=test_basicsocket I, [2024-05-13T21:52:00.261884 #1989258] INFO -- : [468/885] 2030245=test_zsh_completion I, [2024-05-13T21:52:00.277094 #1989258] INFO -- : [469/885] 2030245=test_syntax I, [2024-05-13T21:52:00.290330 #1989258] INFO -- : [470/885] 2030244=test_scalar I, [2024-05-13T21:52:00.323181 #1989258] INFO -- : [471/885] 2030244=test_class_name_check I, [2024-05-13T21:52:00.350335 #1989258] INFO -- : [472/885] 2030244=test_div I, [2024-05-13T21:52:00.352168 #1989258] INFO -- : [473/885] 2030244=test_files_test_2 I, [2024-05-13T21:52:00.352870 #1989258] INFO -- : [474/885] 2030244=test_rdoc_markup_to_html_crossref I, [2024-05-13T21:52:00.651617 #1989258] INFO -- : [475/885] 2030244=test_exception I, [2024-05-13T21:52:00.891681 #1989258] INFO -- : [476/885] 2030246=test_bash_completion I, [2024-05-13T21:52:00.902184 #1989258] INFO -- : [477/885] 2030246=test_optparse I, [2024-05-13T21:52:00.957005 #1989258] INFO -- : [478/885] 2030246=test_deprecated I, [2024-05-13T21:52:00.965032 #1989258] INFO -- : [479/885] 2030246=test_io_buffer I, [2024-05-13T21:52:01.086743 #1989258] INFO -- : [480/885] 2030246=test_rdoc_context_section I, [2024-05-13T21:52:01.100726 #1989258] INFO -- : [481/885] 2030246=test_ns_spki I, [2024-05-13T21:52:01.320600 #1989258] INFO -- : [482/885] 2030246=test_have_library I, [2024-05-13T21:52:01.990668 #1989258] INFO -- : [483/885] 2030246=test_stream I, [2024-05-13T21:52:02.439869 #1989258] INFO -- : [484/885] 2030246=test_iseq_load I, [2024-05-13T21:52:03.189073 #1989258] INFO -- : [485/885] 2030246=test_rdoc_markup_parser I, [2024-05-13T21:52:03.306269 #1989258] INFO -- : [486/885] 2030246=test_rdoc_markup_indented_paragraph I, [2024-05-13T21:52:03.315232 #1989258] INFO -- : [487/885] 2030246=library_symbols_test I, [2024-05-13T21:52:03.328671 #1989258] INFO -- : [488/885] 2030246=test_rdoc_text I, [2024-05-13T21:52:03.565650 #1989258] INFO -- : [489/885] 2030246=test_objspace I, [2024-05-13T21:52:04.749577 #1989258] INFO -- : [490/885] 2030244=test_stringify_symbols I, [2024-05-13T21:52:04.754424 #1989258] INFO -- : [491/885] 2030244=test_require I, [2024-05-13T21:52:04.766475 #1989258] INFO -- : [492/885] 2030244=test_rdoc_markup_to_html_snippet I, [2024-05-13T21:52:04.981876 #1989258] INFO -- : [493/885] 2030244=test_common I, [2024-05-13T21:52:05.092251 #1989258] INFO -- : [494/885] 2030244=test_generic I, [2024-05-13T21:52:05.126305 #1989258] INFO -- : [495/885] 2030244=test_rdoc_constant I, [2024-05-13T21:52:05.219358 #1989258] INFO -- : [496/885] 2030244=test_deprecate I, [2024-05-13T21:52:05.263489 #1989258] INFO -- : [497/885] 2030244=test_httpresponses I, [2024-05-13T21:52:05.277874 #1989258] INFO -- : [498/885] 2030244=test_rdoc_markdown I, [2024-05-13T21:52:05.531988 #1989258] INFO -- : [499/885] 2030244=test_gem_request_set_lockfile I, [2024-05-13T21:52:06.031606 #1989258] INFO -- : [500/885] 2030244=test_postponed_job I, [2024-05-13T21:52:06.319079 #1989258] INFO -- : [501/885] 2030244=test_key_actor_vi I, [2024-05-13T21:52:06.419025 #1989258] INFO -- : [502/885] 2030244=test_win32ole_variant_outarg I, [2024-05-13T21:52:06.429149 #1989258] INFO -- : [503/885] 2030244=test_rdoc_encoding I, [2024-05-13T21:52:06.476628 #1989258] INFO -- : [504/885] 2030244=test_euc_kr I, [2024-05-13T21:52:06.480001 #1989258] INFO -- : [505/885] 2030244=test_provider I, [2024-05-13T21:52:06.496051 #1989258] INFO -- : [506/885] 2030244=test_gem_source_specific_file I, [2024-05-13T21:52:06.599738 #1989258] INFO -- : [507/885] 2030244=test_bmethod I, [2024-05-13T21:52:06.620731 #1989258] INFO -- : [508/885] 2030244=test_process I, [2024-05-13T21:52:10.420526 #1989258] INFO -- : [509/885] 2030245=test_rdoc_code_object I, [2024-05-13T21:52:10.756680 #1989258] INFO -- : [510/885] 2030245=test_rdoc_markup_attributes I, [2024-05-13T21:52:10.765790 #1989258] INFO -- : [511/885] 2030245=test_string_processing I, [2024-05-13T21:52:10.776910 #1989258] INFO -- : [512/885] 2030245=test_random_formatter I, [2024-05-13T21:52:10.802991 #1989258] INFO -- : [513/885] 2030245=test_rand I, [2024-05-13T21:52:11.289454 #1989258] INFO -- : [514/885] 2030245=redundant_return_test I, [2024-05-13T21:52:11.301941 #1989258] INFO -- : [515/885] 2030245=test_rdoc_parser_changelog I, [2024-05-13T21:52:11.428878 #1989258] INFO -- : [516/885] 2030245=parameters_signature_test I, [2024-05-13T21:52:11.445761 #1989258] INFO -- : [517/885] 2030245=test_gem_dependency_list I, [2024-05-13T21:52:11.578782 #1989258] INFO -- : [518/885] 2030245=test_gem_commands_outdated_command I, [2024-05-13T21:52:11.624482 #1989258] INFO -- : [519/885] 2030245=test_securerandom I, [2024-05-13T21:52:11.867620 #1989258] INFO -- : [520/885] 2030245=test_typeddata I, [2024-05-13T21:52:11.891485 #1989258] INFO -- : [521/885] 2030245=test_gem_commands_fetch_command I, [2024-05-13T21:52:12.068533 #1989258] INFO -- : [522/885] 2030245=test_tsort I, [2024-05-13T21:52:12.128847 #1989258] INFO -- : [523/885] 2030245=parse_test I, [2024-05-13T21:52:14.871946 #1989258] INFO -- : [524/885] 2030245=test_io_wait I, [2024-05-13T21:52:15.226299 #1989258] INFO -- : [525/885] 2030245=test_pack I, [2024-05-13T21:52:15.530074 #1989258] INFO -- : [526/885] 2030245=test_rdoc_parser_c I, [2024-05-13T21:52:16.153898 #1989258] INFO -- : [527/885] 2030245=test_kwargs I, [2024-05-13T21:52:16.166866 #1989258] INFO -- : [528/885] 2030245=test_len I, [2024-05-13T21:52:16.179790 #1989258] INFO -- : [529/885] 2030245=json_fixtures_test I, [2024-05-13T21:52:16.205239 #1989258] INFO -- : [530/885] 2030245=test_gem_doctor I, [2024-05-13T21:52:16.281297 #1989258] INFO -- : [531/885] 2030245=test_gem_requirement I, [2024-05-13T21:52:16.487071 #1989258] INFO -- : [532/885] 2030245=test_integer I, [2024-05-13T21:52:16.564583 #1989258] INFO -- : [533/885] 2030245=test_gem_name_tuple I, [2024-05-13T21:52:16.594899 #1989258] INFO -- : [534/885] 2030245=test_rdoc_markup_to_table_of_contents I, [2024-05-13T21:52:16.630024 #1989258] INFO -- : [535/885] 2030245=parse_comments_test I, [2024-05-13T21:52:16.639023 #1989258] INFO -- : [536/885] 2030245=test_tcp I, [2024-05-13T21:52:16.720693 #1989258] INFO -- : [537/885] 2030245=test_win32ole_method_event I, [2024-05-13T21:52:16.732154 #1989258] INFO -- : [538/885] 2030245=test_gem_commands_server_command I, [2024-05-13T21:52:16.838473 #1989258] INFO -- : [539/885] 2030245=test_function I, [2024-05-13T21:52:17.117497 #1989258] INFO -- : [540/885] 2030245=test_gem_resolver_activation_request I, [2024-05-13T21:52:17.138405 #1989258] INFO -- : [541/885] 2030245=test_pipe I, [2024-05-13T21:52:17.265894 #1989258] INFO -- : [542/885] 2030245=test_macro I, [2024-05-13T21:52:17.283373 #1989258] INFO -- : [543/885] 2030245=test_string I, [2024-05-13T21:52:25.070891 #1989258] INFO -- : [544/885] 2030244=test_find I, [2024-05-13T21:52:25.135770 #1989258] INFO -- : [545/885] 2030244=test_constant I, [2024-05-13T21:52:27.003588 #1989258] INFO -- : [546/885] 2030244=test_rdoc_generator_markup I, [2024-05-13T21:52:27.063319 #1989258] INFO -- : [547/885] 2030244=test_encoding I, [2024-05-13T21:52:27.195790 #1989258] INFO -- : [548/885] 2030244=test_hmac I, [2024-05-13T21:52:27.217955 #1989258] INFO -- : [549/885] 2030244=test_gem_commands_owner_command I, [2024-05-13T21:52:27.898860 #1989258] INFO -- : [550/885] 2030244=test_nextafter I, [2024-05-13T21:52:28.045507 #1989258] INFO -- : [551/885] 2030244=test_capacity I, [2024-05-13T21:52:28.053450 #1989258] INFO -- : [552/885] 2030244=test_file I, [2024-05-13T21:52:28.070756 #1989258] INFO -- : [553/885] 2030244=test_time I, [2024-05-13T21:52:28.195159 #1989258] INFO -- : [554/885] 2030244=test_yamlstore I, [2024-05-13T21:52:28.215809 #1989258] INFO -- : [555/885] 2030244=test_bug-3571 I, [2024-05-13T21:52:28.226690 #1989258] INFO -- : [556/885] 2030244=test_numeric I, [2024-05-13T21:52:28.485575 #1989258] INFO -- : [557/885] 2030244=test_flags I, [2024-05-13T21:52:29.392163 #1989258] INFO -- : [558/885] 2030244=test_gem_request_connection_pools I, [2024-05-13T21:52:29.945145 #1989258] INFO -- : [559/885] 2030244=test_init I, [2024-05-13T21:52:30.265025 #1989258] INFO -- : [560/885] 2030244=test_rat I, [2024-05-13T21:52:30.282001 #1989258] INFO -- : [561/885] 2030244=test_rdoc_options I, [2024-05-13T21:52:30.570027 #1989258] INFO -- : [562/885] 2030244=test_zlib I, [2024-05-13T21:52:40.055211 #1989258] INFO -- : [563/885] 2030244=test_gem_commands_unpack_command I, [2024-05-13T21:52:40.455491 #1989258] INFO -- : [564/885] 2030244=test_proc I, [2024-05-13T21:52:41.394325 #1989258] INFO -- : [565/885] 2030244=test_console_attr I, [2024-05-13T21:52:41.427401 #1989258] INFO -- : [566/885] 2030244=test_gem_ext_cargo_builder I, [2024-05-13T21:52:41.432813 #1989258] INFO -- : [567/885] 2030244=test_date_compat I, [2024-05-13T21:52:41.443991 #1989258] INFO -- : [568/885] 2030244=test_gem_version_option I, [2024-05-13T21:52:41.511357 #1989258] INFO -- : [569/885] 2030244=test_win32ole_record I, [2024-05-13T21:52:41.530105 #1989258] INFO -- : [570/885] 2030244=test_rdoc_include I, [2024-05-13T21:52:41.618476 #1989258] INFO -- : [571/885] 2030244=test_pstore I, [2024-05-13T21:52:41.854417 #1989258] INFO -- : [572/885] 2030244=test_ubf_async_safe I, [2024-05-13T21:52:41.874063 #1989258] INFO -- : [573/885] 2030244=test_c_struct_builder I, [2024-05-13T21:52:42.204088 #1989258] INFO -- : [574/885] 2030244=test_yield_block I, [2024-05-13T21:52:42.211322 #1989258] INFO -- : [575/885] 2030244=test_bug-5832 I, [2024-05-13T21:52:42.221874 #1989258] INFO -- : [576/885] 2030244=test_gem_uri I, [2024-05-13T21:52:42.263081 #1989258] INFO -- : [577/885] 2030244=test_resource I, [2024-05-13T21:52:42.280093 #1989258] INFO -- : [578/885] 2030244=test_gem_package_tar_reader_entry I, [2024-05-13T21:52:42.626436 #1989258] INFO -- : [579/885] 2030244=test_spell_checker I, [2024-05-13T21:52:42.639809 #1989258] INFO -- : [580/885] 2030244=test_gem_version I, [2024-05-13T21:52:42.826441 #1989258] INFO -- : [581/885] 2030244=test_gem_ext_ext_conf_builder I, [2024-05-13T21:52:42.836370 #1989258] INFO -- : [582/885] 2030246=test_frozen_error I, [2024-05-13T21:52:42.845595 #1989258] INFO -- : [583/885] 2030246=test_reqarg I, [2024-05-13T21:52:43.145230 #1989258] INFO -- : [584/885] 2030246=test_enumerator I, [2024-05-13T21:52:43.153544 #1989258] INFO -- : [585/885] 2030246=test_path_to_class I, [2024-05-13T21:52:43.170393 #1989258] INFO -- : [586/885] 2030246=test_defined I, [2024-05-13T21:52:43.248228 #1989258] INFO -- : [587/885] 2030246=test_passing_block I, [2024-05-13T21:52:43.258719 #1989258] INFO -- : [588/885] 2030246=test_nowrite I, [2024-05-13T21:52:43.300987 #1989258] INFO -- : [589/885] 2030246=test_thread_queue I, [2024-05-13T21:52:43.901590 #1989258] INFO -- : [590/885] 2030244=test_kdf I, [2024-05-13T21:52:43.970158 #1989258] INFO -- : [591/885] 2030244=test_ldap I, [2024-05-13T21:52:43.977457 #1989258] INFO -- : [592/885] 2030244=test_io_buffer I, [2024-05-13T21:52:44.129411 #1989258] INFO -- : [593/885] 2030244=test_rdoc_markdown_test I, [2024-05-13T21:52:45.228113 #1989258] INFO -- : [594/885] 2030244=test_io_timeout I, [2024-05-13T21:52:45.234556 #1989258] INFO -- : [595/885] 2030244=test_type_completor I, [2024-05-13T21:52:45.250073 #1989258] INFO -- : [596/885] 2030244=test_rdoc_normal_module I, [2024-05-13T21:52:45.288111 #1989258] INFO -- : [597/885] 2030244=test_yjit_exit_locations I, [2024-05-13T21:52:45.300705 #1989258] INFO -- : [598/885] 2030244=test_rdoc_rdoc I, [2024-05-13T21:52:45.389281 #1989258] INFO -- : [599/885] 2030244=test_comparable I, [2024-05-13T21:52:45.403700 #1989258] INFO -- : [600/885] 2030244=test_gem_config_file I, [2024-05-13T21:52:45.639971 #1989258] INFO -- : [601/885] 2030244=json_string_matching_test I, [2024-05-13T21:52:45.651711 #1989258] INFO -- : [602/885] 2030244=test_pkey_dsa I, [2024-05-13T21:52:50.081902 #1989258] INFO -- : [603/885] 2030244=test_logger I, [2024-05-13T21:52:50.090220 #1989258] INFO -- : [604/885] 2030246=test_gem_resolver_specification I, [2024-05-13T21:52:50.103883 #1989258] INFO -- : [605/885] 2030244=test_big2str I, [2024-05-13T21:52:50.107207 #1989258] INFO -- : [606/885] 2030244=test_euc_tw I, [2024-05-13T21:52:50.113932 #1989258] INFO -- : [607/885] 2030244=test_command I, [2024-05-13T21:52:50.132036 #1989258] INFO -- : [608/885] 2030246=test_gem_resolver_dependency_request I, [2024-05-13T21:52:50.167796 #1989258] INFO -- : [609/885] 2030246=test_cstr I, [2024-05-13T21:52:50.426310 #1989258] INFO -- : [610/885] 2030244=test_yaml_tree I, [2024-05-13T21:52:50.463171 #1989258] INFO -- : [611/885] 2030244=test_gem_commands_yank_command I, [2024-05-13T21:52:51.005159 #1989258] INFO -- : [612/885] 2030244=test_nil I, [2024-05-13T21:52:51.006834 #1989258] INFO -- : [613/885] 2030244=test_psych I, [2024-05-13T21:52:51.051542 #1989258] INFO -- : [614/885] 2030244=test_human_typo I, [2024-05-13T21:52:51.126657 #1989258] INFO -- : [615/885] 2030244=test_import I, [2024-05-13T21:52:51.971814 #1989258] INFO -- : [616/885] 2030246=test_wait I, [2024-05-13T21:52:52.040138 #1989258] INFO -- : [617/885] 2030246=version_test I, [2024-05-13T21:52:52.044648 #1989258] INFO -- : [618/885] 2030246=test_raise I, [2024-05-13T21:52:52.052274 #1989258] INFO -- : [619/885] 2030246=test_complexrational I, [2024-05-13T21:52:52.054611 #1989258] INFO -- : [620/885] 2030246=test_function_entry I, [2024-05-13T21:52:52.073177 #1989258] INFO -- : [621/885] 2030246=test_error_highlight I, [2024-05-13T21:52:52.693404 #1989258] INFO -- : [622/885] 2030246=test_rdoc_any_method I, [2024-05-13T21:52:53.109722 #1989258] INFO -- : [623/885] 2030246=json_common_interface_test I, [2024-05-13T21:52:53.134008 #1989258] INFO -- : [624/885] 2030246=test_string I, [2024-05-13T21:52:53.157927 #1989258] INFO -- : [625/885] 2030246=reflection_test I, [2024-05-13T21:52:53.165173 #1989258] INFO -- : [626/885] 2030246=test_marshalable I, [2024-05-13T21:52:53.176864 #1989258] INFO -- : [627/885] 2030246=test_line_editor I, [2024-05-13T21:52:53.184414 #1989258] INFO -- : [628/885] 2030246=test_enumerator_kw I, [2024-05-13T21:52:53.192917 #1989258] INFO -- : [629/885] 2030246=test_help I, [2024-05-13T21:52:53.237463 #1989258] INFO -- : [630/885] 2030246=test_string_memory I, [2024-05-13T21:52:53.469841 #1989258] INFO -- : [631/885] 2030246=test_files_lib I, [2024-05-13T21:52:54.182037 #1989258] INFO -- : [632/885] 2030244=test_egrep_cpp I, [2024-05-13T21:52:54.278330 #1989258] INFO -- : [633/885] 2030244=test_frozen I, [2024-05-13T21:52:54.295140 #1989258] INFO -- : [634/885] 2030244=test_gem_resolver_index_specification I, [2024-05-13T21:52:54.353500 #1989258] INFO -- : [635/885] 2030244=test_serialize_subclasses I, [2024-05-13T21:52:54.363380 #1989258] INFO -- : [636/885] 2030244=test_date_conv I, [2024-05-13T21:52:54.373215 #1989258] INFO -- : [637/885] 2030244=test_rdoc_markup_verbatim I, [2024-05-13T21:52:54.486232 #1989258] INFO -- : [638/885] 2030244=test_webauthn_poller I, [2024-05-13T21:52:54.546776 #1989258] INFO -- : [639/885] 2030244=test_timeout I, [2024-05-13T21:52:54.563128 #1989258] INFO -- : [640/885] 2030244=test_rdoc_generator_pot_po_entry I, [2024-05-13T21:52:54.581030 #1989258] INFO -- : [641/885] 2030244=test_erb_m17n I, [2024-05-13T21:52:54.600342 #1989258] INFO -- : [642/885] 2030244=test_coverage I, [2024-05-13T21:52:55.310037 #1989258] INFO -- : [643/885] 2030244=test_http_request I, [2024-05-13T21:52:55.322723 #1989258] INFO -- : [644/885] 2030244=test_tempfile I, [2024-05-13T21:52:55.559461 #1989258] INFO -- : [645/885] 2030244=test_rdoc_markup_pre_process I, [2024-05-13T21:52:55.754717 #1989258] INFO -- : [646/885] 2030244=test_store I, [2024-05-13T21:52:56.066707 #1989258] INFO -- : [647/885] 2030244=test_fnmatch I, [2024-05-13T21:52:56.124207 #1989258] INFO -- : [648/885] 2030244=test_pathname I, [2024-05-13T21:52:56.451429 #1989258] INFO -- : [649/885] 2030244=test_gem_commands_update_command I, [2024-05-13T21:52:56.602704 #1989258] INFO -- : [650/885] 2030246=test_big5 I, [2024-05-13T21:52:56.610651 #1989258] INFO -- : [651/885] 2030246=test_date I, [2024-05-13T21:52:56.617492 #1989258] INFO -- : [652/885] 2030246=test_protect I, [2024-05-13T21:52:56.624444 #1989258] INFO -- : [653/885] 2030246=test_tree_builder I, [2024-05-13T21:52:56.636709 #1989258] INFO -- : [654/885] 2030246=test_gem_package_old I, [2024-05-13T21:52:56.700717 #1989258] INFO -- : [655/885] 2030246=test_gem_request I, [2024-05-13T21:52:56.972011 #1989258] INFO -- : [656/885] 2030246=test_gem_commands_which_command I, [2024-05-13T21:52:57.020617 #1989258] INFO -- : [657/885] 2030246=test_gem_commands_specification_command I, [2024-05-13T21:52:57.168532 #1989258] INFO -- : [658/885] 2030246=test_scan_args I, [2024-05-13T21:52:57.198832 #1989258] INFO -- : [659/885] 2030246=encoding_test I, [2024-05-13T21:52:57.296656 #1989258] INFO -- : [660/885] 2030246=test_hash I, [2024-05-13T21:52:58.287247 #1989258] INFO -- : [661/885] 2030244=parser_test I, [2024-05-13T21:52:58.300376 #1989258] INFO -- : [662/885] 2030244=test_http I, [2024-05-13T21:52:58.346259 #1989258] INFO -- : [663/885] 2030244=test_gem_dependency_installer I, [2024-05-13T21:53:01.113367 #1989258] INFO -- : [664/885] 2030244=test_pty I, [2024-05-13T21:53:01.235882 #1989258] INFO -- : [665/885] 2030246=test_backtrace I, [2024-05-13T21:53:01.574853 #1989258] INFO -- : [666/885] 2030244=test_tracepoint I, [2024-05-13T21:53:01.920415 #1989258] INFO -- : [667/885] 2030244=test_gem_text I, [2024-05-13T21:53:02.027547 #1989258] INFO -- : [668/885] 2030244=test_settracefunc I, [2024-05-13T21:53:02.537189 #1989258] INFO -- : [669/885] 2030246=test_rdoc_task I, [2024-05-13T21:53:02.556879 #1989258] INFO -- : [670/885] 2030246=test_gem_gemcutter_utilities I, [2024-05-13T21:53:03.050752 #1989258] INFO -- : [671/885] 2030246=test_rendering I, [2024-05-13T21:53:03.068673 #1989258] INFO -- : [672/885] 2030246=test_internal_ivar I, [2024-05-13T21:53:03.069372 #1989258] INFO -- : [673/885] 2030246=test_win32ole I, [2024-05-13T21:53:03.075558 #1989258] INFO -- : [674/885] 2030244=desugar_compiler_test I, [2024-05-13T21:53:03.087644 #1989258] INFO -- : [675/885] 2030246=test_gem_source_local I, [2024-05-13T21:53:03.101676 #1989258] INFO -- : [676/885] 2030244=test_sprintf_comb I, [2024-05-13T21:53:03.268030 #1989258] INFO -- : [677/885] 2030244=test_too_many_dummy_encodings I, [2024-05-13T21:53:03.330862 #1989258] INFO -- : [678/885] 2030244=test_method_cache I, [2024-05-13T21:53:03.341700 #1989258] INFO -- : [679/885] 2030244=locals_test I, [2024-05-13T21:53:03.366642 #1989258] INFO -- : [680/885] 2030246=test_gem_commands_push_command I, [2024-05-13T21:53:03.765284 #1989258] INFO -- : [681/885] 2030244=test_rdoc_markup_to_rdoc I, [2024-05-13T21:53:03.809118 #1989258] INFO -- : [682/885] 2030244=test_set I, [2024-05-13T21:53:03.823951 #1989258] INFO -- : [683/885] 2030244=test_http I, [2024-05-13T21:53:04.146926 #1989258] INFO -- : [684/885] 2030246=test_utf16 I, [2024-05-13T21:53:04.154655 #1989258] INFO -- : [685/885] 2030246=attribute_write_test I, [2024-05-13T21:53:04.177975 #1989258] INFO -- : [686/885] 2030246=test_gem_package_tar_writer I, [2024-05-13T21:53:04.355599 #1989258] INFO -- : [687/885] 2030246=test_str2big I, [2024-05-13T21:53:04.369832 #1989258] INFO -- : [688/885] 2030246=test_severity I, [2024-05-13T21:53:04.370506 #1989258] INFO -- : [689/885] 2030246=test_case I, [2024-05-13T21:53:04.385926 #1989258] INFO -- : [690/885] 2030246=test_ractor I, [2024-05-13T21:53:04.406354 #1989258] INFO -- : [691/885] 2030246=test_gem_remote_fetcher I, [2024-05-13T21:53:04.863278 #1989258] INFO -- : [692/885] 2030245=test_koi8 I, [2024-05-13T21:53:04.870754 #1989258] INFO -- : [693/885] 2030245=test_json_tree I, [2024-05-13T21:53:04.936984 #1989258] INFO -- : [694/885] 2030245=test_pkcs12 I, [2024-05-13T21:53:05.580805 #1989258] INFO -- : [695/885] 2030245=test_filter I, [2024-05-13T21:53:05.619034 #1989258] INFO -- : [696/885] 2030245=test_parser_events I, [2024-05-13T21:53:05.696860 #1989258] INFO -- : [697/885] 2030245=test_m17n I, [2024-05-13T21:53:05.756652 #1989258] INFO -- : [698/885] 2030245=test_method I, [2024-05-13T21:53:06.494512 #1989258] INFO -- : [699/885] 2030246=test_gem_uninstaller I, [2024-05-13T21:53:07.741287 #1989258] INFO -- : [700/885] 2030246=test_cclass I, [2024-05-13T21:53:07.796302 #1989258] INFO -- : [701/885] 2030246=test_yjit I, [2024-05-13T21:53:07.807531 #1989258] INFO -- : [702/885] 2030246=test_gem_dependency I, [2024-05-13T21:53:07.991772 #1989258] INFO -- : [703/885] 2030246=test_x509name I, [2024-05-13T21:53:08.006547 #1989258] INFO -- : [704/885] 2030246=test_yaml I, [2024-05-13T21:53:08.202637 #1989258] INFO -- : [705/885] 2030246=test_argf I, [2024-05-13T21:53:11.731071 #1989258] INFO -- : [706/885] 2030246=test_rdoc_class_module I, [2024-05-13T21:53:12.277286 #1989258] INFO -- : [707/885] 2030246=test_parse I, [2024-05-13T21:53:12.739404 #1989258] INFO -- : [708/885] 2030246=test_rdoc_cross_reference I, [2024-05-13T21:53:12.787700 #1989258] INFO -- : [709/885] 2030244=test_method_cache I, [2024-05-13T21:53:12.789611 #1989258] INFO -- : [710/885] 2030244=test_win32ole_variable I, [2024-05-13T21:53:12.800221 #1989258] INFO -- : [711/885] 2030244=test_numhash I, [2024-05-13T21:53:12.811280 #1989258] INFO -- : [712/885] 2030244=test_system I, [2024-05-13T21:53:13.261561 #1989258] INFO -- : [713/885] 2030246=test_pkey_rsa I, [2024-05-13T21:53:13.476188 #1989258] INFO -- : [714/885] 2030246=test_flush I, [2024-05-13T21:53:13.503551 #1989258] INFO -- : [715/885] 2030246=test_gem_specification I, [2024-05-13T21:53:13.715635 #1989258] INFO -- : [716/885] 2030244=test_gem_install_update_options I, [2024-05-13T21:53:13.890400 #1989258] INFO -- : [717/885] 2030244=test_econv I, [2024-05-13T21:53:14.831401 #1989258] INFO -- : [718/885] 2030244=warnings_test I, [2024-05-13T21:53:14.856676 #1989258] INFO -- : [719/885] 2030244=test_stringchar I, [2024-05-13T21:53:14.932836 #1989258] INFO -- : [720/885] 2030244=test_date_attr I, [2024-05-13T21:53:14.947628 #1989258] INFO -- : [721/885] 2030244=test_sizeof I, [2024-05-13T21:53:16.601322 #1989258] INFO -- : [722/885] 2030246=test_gem_request_set_lockfile_parser I, [2024-05-13T21:53:16.760136 #1989258] INFO -- : [723/885] 2030246=test_face I, [2024-05-13T21:53:17.359421 #1989258] INFO -- : [724/885] 2030246=test_stack I, [2024-05-13T21:53:17.368375 #1989258] INFO -- : [725/885] 2030244=test_windows_1252 I, [2024-05-13T21:53:17.405011 #1989258] INFO -- : [726/885] 2030244=test_sorted_set I, [2024-05-13T21:53:17.596376 #1989258] INFO -- : [727/885] 2030244=test_emoji I, [2024-05-13T21:53:17.642310 #1989258] INFO -- : [728/885] 2030244=test_mixed_unicode_escapes I, [2024-05-13T21:53:17.675942 #1989258] INFO -- : [729/885] 2030244=test_sleep I, [2024-05-13T21:53:17.882957 #1989258] INFO -- : [730/885] 2030246=test_fileutils I, [2024-05-13T21:53:18.391436 #1989258] INFO -- : [731/885] 2030246=test_gem_dependency_resolution_error I, [2024-05-13T21:53:18.452570 #1989258] INFO -- : [732/885] 2030246=test_condition I, [2024-05-13T21:53:18.464892 #1989258] INFO -- : [733/885] 2030246=test_gem_resolver_vendor_set I, [2024-05-13T21:53:18.494594 #1989258] INFO -- : [734/885] 2030246=test_cp949 I, [2024-05-13T21:53:18.509315 #1989258] INFO -- : [735/885] 2030246=test_jaro_winkler I, [2024-05-13T21:53:18.514464 #1989258] INFO -- : [736/885] 2030246=test_nil2vtempty I, [2024-05-13T21:53:18.520309 #1989258] INFO -- : [737/885] 2030246=test_date_time I, [2024-05-13T21:53:18.536010 #1989258] INFO -- : [738/885] 2030246=test_rdoc_generator_json_index I, [2024-05-13T21:53:18.629150 #1989258] INFO -- : [739/885] 2030246=test_pinned I, [2024-05-13T21:53:18.743672 #1989258] INFO -- : [740/885] 2030246=test_pack I, [2024-05-13T21:53:18.757952 #1989258] INFO -- : [741/885] 2030246=test_cgi_tag_helper I, [2024-05-13T21:53:18.772712 #1989258] INFO -- : [742/885] 2030246=test_inadvertent_creation I, [2024-05-13T21:53:18.857261 #1989258] INFO -- : [743/885] 2030246=test_ansi_with_terminfo I, [2024-05-13T21:53:18.863556 #1989258] INFO -- : [744/885] 2030246=test_coderange I, [2024-05-13T21:53:19.092415 #1989258] INFO -- : [745/885] 2030246=test_weakmap I, [2024-05-13T21:53:19.697139 #1989258] INFO -- : [746/885] 2030244=test_framework I, [2024-05-13T21:53:19.709950 #1989258] INFO -- : [747/885] 2030244=test_gem_source_list I, [2024-05-13T21:53:19.827626 #1989258] INFO -- : [748/885] 2030244=json_addition_test I, [2024-05-13T21:53:19.840627 #1989258] INFO -- : [749/885] 2030244=test_name_error I, [2024-05-13T21:53:19.936305 #1989258] INFO -- : [750/885] 2030244=test_gem_commands_sources_command I, [2024-05-13T21:53:20.131224 #1989258] INFO -- : [751/885] 2030245=test_yaml_special_cases I, [2024-05-13T21:53:20.149374 #1989258] INFO -- : [752/885] 2030245=test_recorder I, [2024-05-13T21:53:20.162555 #1989258] INFO -- : [753/885] 2030245=test_const I, [2024-05-13T21:53:20.172392 #1989258] INFO -- : [754/885] 2030245=test_rdoc_parser_rd I, [2024-05-13T21:53:20.177513 #1989258] INFO -- : [755/885] 2030244=index_write_test I, [2024-05-13T21:53:20.189955 #1989258] INFO -- : [756/885] 2030244=test_class I, [2024-05-13T21:53:20.202369 #1989258] INFO -- : [757/885] 2030245=test_exit I, [2024-05-13T21:53:20.304673 #1989258] INFO -- : [758/885] 2030245=test_sprintf I, [2024-05-13T21:53:20.525020 #1989258] INFO -- : [759/885] 2030245=test_safe_load I, [2024-05-13T21:53:20.542086 #1989258] INFO -- : [760/885] 2030245=comments_test I, [2024-05-13T21:53:20.554522 #1989258] INFO -- : [761/885] 2030245=test_qsort I, [2024-05-13T21:53:20.556532 #1989258] INFO -- : [762/885] 2030245=test_gc I, [2024-05-13T21:53:20.566713 #1989258] INFO -- : [763/885] 2030245=test_math I, [2024-05-13T21:53:20.592839 #1989258] INFO -- : [764/885] 2030245=test_libs I, [2024-05-13T21:53:20.633272 #1989258] INFO -- : [765/885] 2030245=ripper_test I, [2024-05-13T21:53:21.249925 #1989258] INFO -- : [766/885] 2030245=test_iso_8859 I, [2024-05-13T21:53:21.275424 #1989258] INFO -- : [767/885] 2030245=test_array I, [2024-05-13T21:53:21.303063 #1989258] INFO -- : [768/885] 2030245=test_rdoc_context I, [2024-05-13T21:53:22.042370 #1989258] INFO -- : [769/885] 2030245=test_gem_command_manager I, [2024-05-13T21:53:22.252925 #1989258] INFO -- : [770/885] 2030245=test_enumerator I, [2024-05-13T21:53:22.950250 #1989258] INFO -- : [771/885] 2030244=test_enc_associate I, [2024-05-13T21:53:23.422098 #1989258] INFO -- : [772/885] 2030244=test_open-uri I, [2024-05-13T21:53:23.828991 #1989258] INFO -- : [773/885] 2030244=test_case I, [2024-05-13T21:53:23.860842 #1989258] INFO -- : [774/885] 2030244=test_complex I, [2024-05-13T21:53:24.946438 #1989258] INFO -- : [775/885] 2030244=test_threadgroup I, [2024-05-13T21:53:25.031277 #1989258] INFO -- : [776/885] 2030244=test_memory_view I, [2024-05-13T21:53:25.701466 #1989258] INFO -- : [777/885] 2030244=test_dir_m17n I, [2024-05-13T21:53:26.796107 #1989258] INFO -- : [778/885] 2030244=test_array_create I, [2024-05-13T21:53:26.831083 #1989258] INFO -- : [779/885] 2030244=test_process I, [2024-05-13T21:53:26.847993 #1989258] INFO -- : [780/885] 2030244=test_forwardable I, [2024-05-13T21:53:26.867761 #1989258] INFO -- : [781/885] 2030244=test_fd_setsize I, [2024-05-13T21:53:26.869340 #1989258] INFO -- : [782/885] 2030244=!Nothing_to_test I, [2024-05-13T21:53:26.891620 #1989258] INFO -- : [783/885] 2030244=test_gem_rdoc I, [2024-05-13T21:53:27.046195 #1989258] INFO -- : [784/885] 2030244=test_dot_dot I, [2024-05-13T21:53:27.066184 #1989258] INFO -- : [785/885] 2030244=pattern_test I, [2024-05-13T21:53:27.131187 #1989258] INFO -- : [786/885] 2030244=test_kernel I, [2024-05-13T21:53:27.732793 #1989258] INFO -- : [787/885] 2030244=test_rendering I, [2024-05-13T21:53:27.765375 #1989258] INFO -- : [788/885] 2030244=test_gem_commands_install_command I, [2024-05-13T21:53:29.680801 #1989258] INFO -- : [789/885] 2030246=test_iterator I, [2024-05-13T21:53:29.734687 #1989258] INFO -- : [790/885] 2030246=test_string I, [2024-05-13T21:53:29.745681 #1989258] INFO -- : [791/885] 2030246=test_merge_keys I, [2024-05-13T21:53:29.752364 #1989258] INFO -- : [792/885] 2030246=test_err_in_callback I, [2024-05-13T21:53:29.765803 #1989258] INFO -- : [793/885] 2030246=test_method_name_check I, [2024-05-13T21:53:29.822838 #1989258] INFO -- : [794/885] 2030246=test_storage I, [2024-05-13T21:53:29.831570 #1989258] INFO -- : [795/885] 2030246=test_rdoc_extend I, [2024-05-13T21:53:29.841534 #1989258] INFO -- : [796/885] 2030244=test_cesu8 I, [2024-05-13T21:53:29.847458 #1989258] INFO -- : [797/885] 2030244=test_shapes I, [2024-05-13T21:53:29.851992 #1989258] INFO -- : [798/885] 2030244=test_did_you_mean I, [2024-05-13T21:53:29.858388 #1989258] INFO -- : [799/885] 2030246=test_arith_seq_beg_len_step I, [2024-05-13T21:53:29.921842 #1989258] INFO -- : [800/885] 2030246=test_raise_exception I, [2024-05-13T21:53:29.933777 #1989258] INFO -- : [801/885] 2030244=test_exception I, [2024-05-13T21:53:29.944621 #1989258] INFO -- : [802/885] 2030244=test_noarg I, [2024-05-13T21:53:30.088031 #1989258] INFO -- : [803/885] 2030244=test_gem_resolver_requirement_list I, [2024-05-13T21:53:30.095176 #1989258] INFO -- : [804/885] 2030244=memsize_test I, [2024-05-13T21:53:30.105536 #1989258] INFO -- : [805/885] 2030244=test_pp I, [2024-05-13T21:53:30.173013 #1989258] INFO -- : [806/885] 2030244=test_gem_impossible_dependencies_error I, [2024-05-13T21:53:30.212102 #1989258] INFO -- : [807/885] 2030244=test_gem_commands_pristine_command I, [2024-05-13T21:53:30.542923 #1989258] INFO -- : [808/885] 2030246=test_optarg I, [2024-05-13T21:53:30.610930 #1989258] INFO -- : [809/885] 2030246=test_rdoc_tom_doc I, [2024-05-13T21:53:30.640120 #1989258] INFO -- : [810/885] 2030246=test_hash I, [2024-05-13T21:53:30.655401 #1989258] INFO -- : [811/885] 2030246=test_variable I, [2024-05-13T21:53:30.750973 #1989258] INFO -- : [812/885] 2030246=test_erb I, [2024-05-13T21:53:30.995141 #1989258] INFO -- : [813/885] 2030246=test_date_ractor I, [2024-05-13T21:53:31.040638 #1989258] INFO -- : [814/885] 2030246=test_key_actor_emacs I, [2024-05-13T21:53:31.220908 #1989258] INFO -- : [815/885] 2030246=test_gem_security I, [2024-05-13T21:53:31.676767 #1989258] INFO -- : [816/885] 2030244=test_utf32 I, [2024-05-13T21:53:31.705319 #1989258] INFO -- : [817/885] 2030244=test_gem_resolver_git_specification I, [2024-05-13T21:53:31.987993 #1989258] INFO -- : [818/885] 2030244=test_basicinstructions I, [2024-05-13T21:53:32.061996 #1989258] INFO -- : [819/885] 2030244=test_assignment I, [2024-05-13T21:53:33.507812 #1989258] INFO -- : [820/885] 2030244=test_gem_update_suggestion I, [2024-05-13T21:53:33.510149 #1989258] INFO -- : [821/885] 2030244=test_normalize I, [2024-05-13T21:53:33.518511 #1989258] INFO -- : [822/885] 2030244=test_emoji_breaks I, [2024-05-13T21:53:33.527403 #1989258] INFO -- : [823/885] 2030244=test_verbose I, [2024-05-13T21:53:33.635404 #1989258] INFO -- : [824/885] 2030244=test_gem_commands_open_command I, [2024-05-13T21:53:33.679542 #1989258] INFO -- : [825/885] 2030244=test_asn1 I, [2024-05-13T21:53:33.718947 #1989258] INFO -- : [826/885] 2030244=test_gem_command I, [2024-05-13T21:53:33.904629 #1989258] INFO -- : [827/885] 2030244=test_rdoc_generator_darkfish I, [2024-05-13T21:53:34.215500 #1989258] INFO -- : [828/885] 2030244=test_random I, [2024-05-13T21:53:34.230865 #1989258] INFO -- : [829/885] 2030244=test_gem_resolver_lock_set I, [2024-05-13T21:53:34.260619 #1989258] INFO -- : [830/885] 2030244=test_undef I, [2024-05-13T21:53:34.277904 #1989258] INFO -- : [831/885] 2030244=test_show_source I, [2024-05-13T21:53:34.290228 #1989258] INFO -- : [832/885] 2030244=test_remote_fetch_error I, [2024-05-13T21:53:34.312958 #1989258] INFO -- : [833/885] 2030244=test_yield I, [2024-05-13T21:53:37.358803 #1989258] INFO -- : [834/885] 2030244=regexp_test I, [2024-05-13T21:53:37.390477 #1989258] INFO -- : [835/885] 2030244=test_rdoc_store I, [2024-05-13T21:53:38.106177 #1989258] INFO -- : [836/885] 2030244=test_shift_jis I, [2024-05-13T21:53:38.114246 #1989258] INFO -- : [837/885] 2030244=test_force_exit I, [2024-05-13T21:53:38.186079 #1989258] INFO -- : [838/885] 2030244=test_optimization I, [2024-05-13T21:53:40.362140 #1989258] INFO -- : [839/885] 2030246=test_rubyoptions I, [2024-05-13T21:53:44.919025 #1989258] INFO -- : [840/885] 2030244=test_data_error I, [2024-05-13T21:53:44.931101 #1989258] INFO -- : [841/885] 2030244=test_rdoc_stats I, [2024-05-13T21:53:44.962576 #1989258] INFO -- : [842/885] 2030244=test_files_sample I, [2024-05-13T21:53:44.975354 #1989258] INFO -- : [843/885] 2030244=test_enc_raise I, [2024-05-13T21:53:44.984391 #1989258] INFO -- : [844/885] 2030244=test_clone I, [2024-05-13T21:53:45.162657 #1989258] INFO -- : [845/885] 2030244=test_cgi_util I, [2024-05-13T21:53:45.375285 #1989258] INFO -- : [846/885] 2030244=test_ole_methods I, [2024-05-13T21:53:45.384393 #1989258] INFO -- : [847/885] 2030244=test_prettyprint I, [2024-05-13T21:53:45.431614 #1989258] INFO -- : [848/885] 2030244=test_gem_uri_formatter I, [2024-05-13T21:53:45.461192 #1989258] INFO -- : [849/885] 2030244=test_dryrun I, [2024-05-13T21:53:45.707855 #1989258] INFO -- : [850/885] 2030244=test_gc_compact I, [2024-05-13T21:53:46.882905 #1989258] INFO -- : [851/885] 2030246=test_rdoc_i18n_locale I, [2024-05-13T21:53:46.896451 #1989258] INFO -- : [852/885] 2030246=test_boolean I, [2024-05-13T21:53:46.914574 #1989258] INFO -- : [853/885] 2030246=test_gem_resolver_lock_specification I, [2024-05-13T21:53:47.029194 #1989258] INFO -- : [854/885] 2030246=test_queue I, [2024-05-13T21:53:47.031785 #1989258] INFO -- : [855/885] 2030246=test_hash_create I, [2024-05-13T21:53:47.046915 #1989258] INFO -- : [856/885] 2030246=test_grapheme_breaks I, [2024-05-13T21:53:47.061607 #1989258] INFO -- : [857/885] 2030246=static_literals_test I, [2024-05-13T21:53:47.095245 #1989258] INFO -- : [858/885] 2030246=test_tree_spell_checker I, [2024-05-13T21:53:47.156265 #1989258] INFO -- : [859/885] 2030246=test_set I, [2024-05-13T21:53:47.198738 #1989258] INFO -- : [860/885] 2030246=test_rdoc_method_attr I, [2024-05-13T21:53:47.381436 #1989258] INFO -- : [861/885] 2030246=test_enumerable I, [2024-05-13T21:53:47.396737 #1989258] INFO -- : [862/885] 2030246=test_gem_commands_dependency_command I, [2024-05-13T21:53:47.505874 #1989258] INFO -- : [863/885] 2030246=test_gbk I, [2024-05-13T21:53:47.514629 #1989258] INFO -- : [864/885] 2030246=test_backtrace I, [2024-05-13T21:53:47.527104 #1989258] INFO -- : [865/885] 2030246=test_switch_hitter I, [2024-05-13T21:53:47.590328 #1989258] INFO -- : [866/885] 2030246=test_default_gems I, [2024-05-13T21:53:47.600463 #1989258] INFO -- : [867/885] 2030246=test_unicode_escape I, [2024-05-13T21:53:47.696005 #1989258] INFO -- : [868/885] 2030246=test_gem_spec_fetcher I, [2024-05-13T21:53:47.932895 #1989258] INFO -- : [869/885] 2030246=test_yamldbm I, [2024-05-13T21:53:47.941017 #1989258] INFO -- : [870/885] 2030246=test_buffering I, [2024-05-13T21:53:47.951248 #1989258] INFO -- : [871/885] 2030246=test_svcb_https I, [2024-05-13T21:53:47.963802 #1989258] INFO -- : [872/885] 2030246=test_pkey_ec I, [2024-05-13T21:53:47.983441 #1989258] INFO -- : [873/885] 2030246=test_thread I, [2024-05-13T21:53:47.993593 #1989258] INFO -- : [874/885] 2030246=test_arity I, [2024-05-13T21:53:48.010846 #1989258] INFO -- : [875/885] 2030246=test_date_parse I, [2024-05-13T21:53:48.194517 #1989258] INFO -- : [876/885] 2030246=test_open3 I, [2024-05-13T21:53:49.768927 #1989258] INFO -- : [877/885] 2030244=test_mdns I, [2024-05-13T21:53:49.773857 #1989258] INFO -- : [878/885] 2030244=test_key_event_record I, [2024-05-13T21:53:49.806282 #1989258] INFO -- : [879/885] 2030244=test_webauthn_listener I, [2024-05-13T21:53:49.834637 #1989258] INFO -- : Leaked file descriptor: WebauthnListenerTest#test_wait_for_otp_code_options_request: 14 : # I, [2024-05-13T21:53:49.881301 #1989258] INFO -- : COMMAND PID USER FD TYPE DEVICE SIZE/OFF NODE NAME I, [2024-05-13T21:53:49.881374 #1989258] INFO -- : ruby 2030244 opc 14u IPv4 2969497920 0t0 TCP localhost:44573->localhost:42962 (CLOSE_WAIT) I, [2024-05-13T21:53:50.040304 #1989258] INFO -- : [880/885] 2030244=test_rdoc_rubygems_hook I, [2024-05-13T21:53:50.164646 #1989258] INFO -- : [881/885] 2030244=test_gem_resolver_api_specification I, [2024-05-13T21:53:50.230035 #1989258] INFO -- : [882/885] 2030244=test_ractor I, [2024-05-13T21:53:50.242971 #1989258] INFO -- : .Closed file descriptor: TestIOWaitInRactor#test_ractor: 14 I, [2024-05-13T21:53:50.258969 #1989258] INFO -- : [883/885] 2030244=test_gem_ext_cargo_builder_unit I, [2024-05-13T21:53:50.293815 #1989258] INFO -- : [884/885] 2030244=test_case_mapping I, [2024-05-13T21:53:50.315486 #1989258] INFO -- : [885/885] 2030244=test_rational I, [2024-05-13T21:54:09.331735 #1989258] INFO -- : Finished tests in 232.944584s, 112.8723 tests/s, 40139.9030 assertions/s. E, [2024-05-13T21:54:09.331890 #1989258] ERROR -- : Children under /tmp/rubytest.hh2le4: E, [2024-05-13T21:54:09.332000 #1989258] ERROR -- : * drwx------ 4 28 2024-05-13 21:51:06 +0000 gem_rebuild20240513-2030244-s1thzh/ E, [2024-05-13T21:54:09.332044 #1989258] ERROR -- : * drwxrwxr-x 2 40 2024-05-13 21:51:06 +0000 old/ E, [2024-05-13T21:54:09.332074 #1989258] ERROR -- : * -rw-rw-r-- 1 4096 2024-05-13 21:51:06 +0000 rebuild_test_gem-1.0.0.gem E, [2024-05-13T21:54:09.332236 #1989258] ERROR -- : * drwxrwxr-x 2 40 2024-05-13 21:51:06 +0000 new/ E, [2024-05-13T21:54:09.332251 #1989258] ERROR -- : * -rw-rw-r-- 1 4096 2024-05-13 21:51:06 +0000 rebuild_test_gem-1.0.0.gem I, [2024-05-13T21:54:09.338445 #1989258] INFO -- : 26293 tests, 9350373 assertions, 0 failures, 0 errors, 320 skips I, [2024-05-13T21:54:09.338499 #1989258] INFO -- : I, [2024-05-13T21:54:09.338513 #1989258] INFO -- : ruby -v: ruby 3.4.0dev (2024-05-13T18:04:55Z master 5319587ac3) [aarch64-linux] I, [2024-05-13T21:54:09.339306 #1989258] INFO -- : $$$[end] "make yes-test-all TESTOPTS='--stderr-on-failure' TESTS='-j3'" exit with 0. I, [2024-05-13T21:54:09.339468 #1989258] INFO -- : $$$[beg] make yes-test-rubyspec MSPECOPT='--error-output stderr --debug -j' TESTS='-j3' I, [2024-05-13T21:54:09.486232 #1989258] INFO -- : BASERUBY = /usr/local/bin/ruby --disable=gems I, [2024-05-13T21:54:09.486308 #1989258] INFO -- : CC = gcc I, [2024-05-13T21:54:09.486319 #1989258] INFO -- : LD = ld I, [2024-05-13T21:54:09.486328 #1989258] INFO -- : LDSHARED = gcc -shared I, [2024-05-13T21:54:09.486340 #1989258] INFO -- : CFLAGS = -O3 -fno-fast-math -ggdb3 -Wall -Wextra -Wdeprecated-declarations -Wdiv-by-zero -Wduplicated-cond -Wimplicit-function-declaration -Wimplicit-int -Wpointer-arith -Wwrite-strings -Wold-style-definition -Wimplicit-fallthrough=0 -Wmissing-noreturn -Wno-cast-function-type -Wno-constant-logical-operand -Wno-long-long -Wno-missing-field-initializers -Wno-overlength-strings -Wno-packed-bitfield-compat -Wno-parentheses-equality -Wno-self-assign -Wno-tautological-compare -Wno-unused-parameter -Wno-unused-value -Wsuggest-attribute=format -Wsuggest-attribute=noreturn -Wunused-variable -Wmisleading-indentation -Wundef I, [2024-05-13T21:54:09.486351 #1989258] INFO -- : XCFLAGS = -U_FORTIFY_SOURCE -D_FORTIFY_SOURCE=2 -fstack-protector-strong -msign-return-address=all -fno-strict-overflow -fvisibility=hidden -fexcess-precision=standard -DRUBY_EXPORT -fPIE -I. -I.ext/include/aarch64-linux -I/home/opc/ruby/src/master/include -I/home/opc/ruby/src/master -I/home/opc/ruby/src/master/prism -I/home/opc/ruby/src/master/enc/unicode/15.0.0 I, [2024-05-13T21:54:09.486360 #1989258] INFO -- : CPPFLAGS = I, [2024-05-13T21:54:09.486368 #1989258] INFO -- : DLDFLAGS = -Wl,--compress-debug-sections=zlib -fstack-protector-strong -pie I, [2024-05-13T21:54:09.486377 #1989258] INFO -- : SOLIBS = -lz -lrt -lrt -ldl -lcrypt -lm -lpthread I, [2024-05-13T21:54:09.486386 #1989258] INFO -- : LANG = en_US.UTF-8 I, [2024-05-13T21:54:09.486394 #1989258] INFO -- : LC_ALL = I, [2024-05-13T21:54:09.486402 #1989258] INFO -- : LC_CTYPE = I, [2024-05-13T21:54:09.486409 #1989258] INFO -- : MFLAGS = I, [2024-05-13T21:54:09.486417 #1989258] INFO -- : RUSTC = rustc I, [2024-05-13T21:54:09.486425 #1989258] INFO -- : YJIT_RUSTC_ARGS = --crate-name=yjit --crate-type=staticlib --edition=2021 -g -C lto=thin -C opt-level=3 -C overflow-checks=on '--out-dir=/home/opc/ruby/build/master/yjit/target/release/' /home/opc/ruby/src/master/yjit/src/lib.rs I, [2024-05-13T21:54:09.487135 #1989258] INFO -- : gcc (GCC) 8.5.0 20210514 (Red Hat 8.5.0-10.1.0.1) I, [2024-05-13T21:54:09.487156 #1989258] INFO -- : Copyright (C) 2018 Free Software Foundation, Inc. I, [2024-05-13T21:54:09.487166 #1989258] INFO -- : This is free software; see the source for copying conditions. There is NO I, [2024-05-13T21:54:09.487174 #1989258] INFO -- : warranty; not even for MERCHANTABILITY or FITNESS FOR A PARTICULAR PURPOSE. I, [2024-05-13T21:54:09.487182 #1989258] INFO -- : I, [2024-05-13T21:54:09.489328 #1989258] INFO -- : generating enc.mk I, [2024-05-13T21:54:09.722306 #1989258] INFO -- : generating encdb.h I, [2024-05-13T21:54:09.759430 #1989258] INFO -- : encdb.h unchanged I, [2024-05-13T21:54:09.760738 #1989258] INFO -- : making enc I, [2024-05-13T21:54:09.787973 #1989258] INFO -- : make[1]: Entering directory '/home/opc/ruby/build/master' I, [2024-05-13T21:54:09.788035 #1989258] INFO -- : make[1]: Nothing to be done for 'enc'. I, [2024-05-13T21:54:09.788046 #1989258] INFO -- : make[1]: Leaving directory '/home/opc/ruby/build/master' I, [2024-05-13T21:54:09.788840 #1989258] INFO -- : making srcs under enc I, [2024-05-13T21:54:09.830628 #1989258] INFO -- : make[1]: Entering directory '/home/opc/ruby/build/master' I, [2024-05-13T21:54:09.830696 #1989258] INFO -- : make[1]: Nothing to be done for 'srcs'. I, [2024-05-13T21:54:09.830707 #1989258] INFO -- : make[1]: Leaving directory '/home/opc/ruby/build/master' I, [2024-05-13T21:54:09.831831 #1989258] INFO -- : generating transdb.h I, [2024-05-13T21:54:09.975581 #1989258] INFO -- : transdb.h unchanged I, [2024-05-13T21:54:09.976888 #1989258] INFO -- : making trans I, [2024-05-13T21:54:10.025285 #1989258] INFO -- : make[1]: Entering directory '/home/opc/ruby/build/master' I, [2024-05-13T21:54:10.025357 #1989258] INFO -- : make[1]: Nothing to be done for 'trans'. I, [2024-05-13T21:54:10.025367 #1989258] INFO -- : make[1]: Leaving directory '/home/opc/ruby/build/master' I, [2024-05-13T21:54:10.026136 #1989258] INFO -- : making encs I, [2024-05-13T21:54:10.078508 #1989258] INFO -- : make[1]: Entering directory '/home/opc/ruby/build/master' I, [2024-05-13T21:54:10.078578 #1989258] INFO -- : make[1]: Nothing to be done for 'encs'. I, [2024-05-13T21:54:10.078588 #1989258] INFO -- : make[1]: Leaving directory '/home/opc/ruby/build/master' I, [2024-05-13T21:54:10.080668 #1989258] INFO -- : generating makefiles ext/configure-ext.mk I, [2024-05-13T21:54:10.120332 #1989258] INFO -- : ext/configure-ext.mk updated I, [2024-05-13T21:54:10.123382 #1989258] INFO -- : make[1]: Entering directory '/home/opc/ruby/build/master' I, [2024-05-13T21:54:12.222103 #1989258] INFO -- : make[1]: Leaving directory '/home/opc/ruby/build/master' I, [2024-05-13T21:54:12.222907 #1989258] INFO -- : generating makefile exts.mk I, [2024-05-13T21:54:12.282633 #1989258] INFO -- : exts.mk unchanged I, [2024-05-13T21:54:12.287673 #1989258] INFO -- : make[1]: Entering directory '/home/opc/ruby/build/master' I, [2024-05-13T21:54:12.589511 #1989258] INFO -- : make[2]: Entering directory '/home/opc/ruby/build/master/ext/coverage' I, [2024-05-13T21:54:12.594207 #1989258] INFO -- : make[2]: Leaving directory '/home/opc/ruby/build/master/ext/coverage' I, [2024-05-13T21:54:12.599866 #1989258] INFO -- : make[2]: Entering directory '/home/opc/ruby/build/master/ext/date' I, [2024-05-13T21:54:12.605367 #1989258] INFO -- : make[2]: Leaving directory '/home/opc/ruby/build/master/ext/date' I, [2024-05-13T21:54:12.608835 #1989258] INFO -- : make[2]: Entering directory '/home/opc/ruby/build/master/ext/digest' I, [2024-05-13T21:54:12.618199 #1989258] INFO -- : make[2]: Leaving directory '/home/opc/ruby/build/master/ext/digest' I, [2024-05-13T21:54:12.641177 #1989258] INFO -- : make[2]: Entering directory '/home/opc/ruby/build/master/ext/digest/sha2' I, [2024-05-13T21:54:12.646304 #1989258] INFO -- : make[2]: Leaving directory '/home/opc/ruby/build/master/ext/digest/sha2' I, [2024-05-13T21:54:12.664470 #1989258] INFO -- : make[2]: Entering directory '/home/opc/ruby/build/master/ext/fiddle' I, [2024-05-13T21:54:12.674871 #1989258] INFO -- : make[2]: Leaving directory '/home/opc/ruby/build/master/ext/fiddle' I, [2024-05-13T21:54:12.679347 #1989258] INFO -- : make[2]: Entering directory '/home/opc/ruby/build/master/ext/io/console' I, [2024-05-13T21:54:12.683630 #1989258] INFO -- : make[2]: Leaving directory '/home/opc/ruby/build/master/ext/io/console' I, [2024-05-13T21:54:12.694469 #1989258] INFO -- : make[2]: Entering directory '/home/opc/ruby/build/master/ext/json' I, [2024-05-13T21:54:12.703842 #1989258] INFO -- : make[2]: Leaving directory '/home/opc/ruby/build/master/ext/json' I, [2024-05-13T21:54:12.717061 #1989258] INFO -- : make[2]: Entering directory '/home/opc/ruby/build/master/ext/monitor' I, [2024-05-13T21:54:12.721357 #1989258] INFO -- : make[2]: Leaving directory '/home/opc/ruby/build/master/ext/monitor' I, [2024-05-13T21:54:12.727527 #1989258] INFO -- : make[2]: Entering directory '/home/opc/ruby/build/master/ext/objspace' I, [2024-05-13T21:54:12.733588 #1989258] INFO -- : make[2]: Leaving directory '/home/opc/ruby/build/master/ext/objspace' I, [2024-05-13T21:54:12.752429 #1989258] INFO -- : make[2]: Entering directory '/home/opc/ruby/build/master/ext/openssl' I, [2024-05-13T21:54:12.774331 #1989258] INFO -- : make[2]: Leaving directory '/home/opc/ruby/build/master/ext/openssl' I, [2024-05-13T21:54:12.778561 #1989258] INFO -- : make[2]: Entering directory '/home/opc/ruby/build/master/ext/pathname' I, [2024-05-13T21:54:12.782825 #1989258] INFO -- : make[2]: Leaving directory '/home/opc/ruby/build/master/ext/pathname' I, [2024-05-13T21:54:12.789075 #1989258] INFO -- : make[2]: Entering directory '/home/opc/ruby/build/master/ext/psych' I, [2024-05-13T21:54:12.810708 #1989258] INFO -- : make[2]: Leaving directory '/home/opc/ruby/build/master/ext/psych' I, [2024-05-13T21:54:12.815281 #1989258] INFO -- : make[2]: Entering directory '/home/opc/ruby/build/master/ext/pty' I, [2024-05-13T21:54:12.819557 #1989258] INFO -- : make[2]: Leaving directory '/home/opc/ruby/build/master/ext/pty' I, [2024-05-13T21:54:12.833058 #1989258] INFO -- : make[2]: Entering directory '/home/opc/ruby/build/master/ext/ripper' I, [2024-05-13T21:54:12.841147 #1989258] INFO -- : make[2]: Leaving directory '/home/opc/ruby/build/master/ext/ripper' I, [2024-05-13T21:54:12.843580 #1989258] INFO -- : make[2]: Entering directory '/home/opc/ruby/build/master/ext/rubyvm' I, [2024-05-13T21:54:12.847400 #1989258] INFO -- : make[2]: Leaving directory '/home/opc/ruby/build/master/ext/rubyvm' I, [2024-05-13T21:54:12.859661 #1989258] INFO -- : make[2]: Entering directory '/home/opc/ruby/build/master/ext/socket' I, [2024-05-13T21:54:12.870776 #1989258] INFO -- : make[2]: Leaving directory '/home/opc/ruby/build/master/ext/socket' I, [2024-05-13T21:54:12.886765 #1989258] INFO -- : make[2]: Entering directory '/home/opc/ruby/build/master/.bundle/gems/bigdecimal-3.1.7/ext/bigdecimal' I, [2024-05-13T21:54:12.917713 #1989258] INFO -- : make[2]: Leaving directory '/home/opc/ruby/build/master/.bundle/gems/bigdecimal-3.1.7/ext/bigdecimal' I, [2024-05-13T21:54:12.920383 #1989258] INFO -- : make[2]: Entering directory '/home/opc/ruby/build/master/.bundle/gems/bigdecimal-3.1.8/ext/bigdecimal' I, [2024-05-13T21:54:12.950863 #1989258] INFO -- : make[2]: Leaving directory '/home/opc/ruby/build/master/.bundle/gems/bigdecimal-3.1.8/ext/bigdecimal' I, [2024-05-13T21:54:12.953469 #1989258] INFO -- : make[2]: Entering directory '/home/opc/ruby/build/master/.bundle/gems/debug-1.9.2/ext/debug' I, [2024-05-13T21:54:12.984298 #1989258] INFO -- : make[2]: Leaving directory '/home/opc/ruby/build/master/.bundle/gems/debug-1.9.2/ext/debug' I, [2024-05-13T21:54:12.986810 #1989258] INFO -- : make[2]: Entering directory '/home/opc/ruby/build/master/.bundle/gems/nkf-0.2.0/ext/nkf' I, [2024-05-13T21:54:13.017035 #1989258] INFO -- : make[2]: Leaving directory '/home/opc/ruby/build/master/.bundle/gems/nkf-0.2.0/ext/nkf' I, [2024-05-13T21:54:13.019871 #1989258] INFO -- : make[2]: Entering directory '/home/opc/ruby/build/master/.bundle/gems/racc-1.7.3/ext/racc/cparse' I, [2024-05-13T21:54:13.050232 #1989258] INFO -- : make[2]: Leaving directory '/home/opc/ruby/build/master/.bundle/gems/racc-1.7.3/ext/racc/cparse' I, [2024-05-13T21:54:13.053348 #1989258] INFO -- : make[2]: Entering directory '/home/opc/ruby/build/master/.bundle/gems/rbs-3.4.4/ext/rbs_extension' I, [2024-05-13T21:54:13.083817 #1989258] INFO -- : make[2]: Leaving directory '/home/opc/ruby/build/master/.bundle/gems/rbs-3.4.4/ext/rbs_extension' I, [2024-05-13T21:54:13.086467 #1989258] INFO -- : make[2]: Entering directory '/home/opc/ruby/build/master/.bundle/gems/syslog-0.1.2/ext/syslog' I, [2024-05-13T21:54:13.117265 #1989258] INFO -- : make[2]: Leaving directory '/home/opc/ruby/build/master/.bundle/gems/syslog-0.1.2/ext/syslog' I, [2024-05-13T21:54:13.155510 #1989258] INFO -- : make[2]: Entering directory '/home/opc/ruby/build/master' I, [2024-05-13T21:54:13.241043 #1989258] INFO -- : make[2]: 'ruby' is up to date. I, [2024-05-13T21:54:13.241119 #1989258] INFO -- : make[2]: Leaving directory '/home/opc/ruby/build/master' I, [2024-05-13T21:54:13.241241 #1989258] INFO -- : make[1]: Leaving directory '/home/opc/ruby/build/master' I, [2024-05-13T21:54:13.245739 #1989258] INFO -- : make[1]: Entering directory '/home/opc/ruby/build/master' I, [2024-05-13T21:54:13.245770 #1989258] INFO -- : make[1]: Nothing to be done for 'note'. I, [2024-05-13T21:54:13.245780 #1989258] INFO -- : make[1]: Leaving directory '/home/opc/ruby/build/master' E, [2024-05-13T21:54:13.321729 #1989258] ERROR -- : $ /home/opc/ruby/build/master/miniruby -I/home/opc/ruby/src/master/lib /home/opc/ruby/src/master/tool/runruby.rb --archdir=/home/opc/ruby/build/master --extout=.ext -- /home/opc/ruby/src/master/spec/mspec/bin/mspec-run -B /home/opc/ruby/src/master/spec/default.mspec --error-output stderr --debug -fy -o /tmp/rubytest.7apgpm/1-mspec-multi-0 E, [2024-05-13T21:54:13.322089 #1989258] ERROR -- : $ /home/opc/ruby/build/master/miniruby -I/home/opc/ruby/src/master/lib /home/opc/ruby/src/master/tool/runruby.rb --archdir=/home/opc/ruby/build/master --extout=.ext -- /home/opc/ruby/src/master/spec/mspec/bin/mspec-run -B /home/opc/ruby/src/master/spec/default.mspec --error-output stderr --debug -fy -o /tmp/rubytest.7apgpm/2-mspec-multi-1 E, [2024-05-13T21:54:13.322340 #1989258] ERROR -- : $ /home/opc/ruby/build/master/miniruby -I/home/opc/ruby/src/master/lib /home/opc/ruby/src/master/tool/runruby.rb --archdir=/home/opc/ruby/build/master --extout=.ext -- /home/opc/ruby/src/master/spec/mspec/bin/mspec-run -B /home/opc/ruby/src/master/spec/default.mspec --error-output stderr --debug -fy -o /tmp/rubytest.7apgpm/3-mspec-multi-2 I, [2024-05-13T21:54:13.461279 #1989258] INFO -- : ruby 3.4.0dev (2024-05-13T18:04:55Z master 5319587ac3) [aarch64-linux] I, [2024-05-13T21:54:19.010859 #1989258] INFO -- : 0 ......................................................................... I, [2024-05-13T21:54:21.447191 #1989258] INFO -- : 73 ......................................................................... I, [2024-05-13T21:54:21.630878 #1989258] INFO -- : 146 ......................................................................... I, [2024-05-13T21:54:21.939713 #1989258] INFO -- : 219 ......................................................................... I, [2024-05-13T21:54:22.108969 #1989258] INFO -- : 292 ......................................................................... I, [2024-05-13T21:54:22.356042 #1989258] INFO -- : 365 ......................................................................... I, [2024-05-13T21:54:22.484029 #1989258] INFO -- : 438 ......................................................................... I, [2024-05-13T21:54:22.545564 #1989258] INFO -- : 511 ......................................................................... I, [2024-05-13T21:54:22.607919 #1989258] INFO -- : 584 ......................................................................... I, [2024-05-13T21:54:23.235019 #1989258] INFO -- : 657 ......................................................................... I, [2024-05-13T21:54:23.337652 #1989258] INFO -- : 730 ......................................................................... I, [2024-05-13T21:54:23.387666 #1989258] INFO -- : 803 ......................................................................... I, [2024-05-13T21:54:23.595034 #1989258] INFO -- : 876 ......................................................................... I, [2024-05-13T21:54:23.704062 #1989258] INFO -- : 949 ......................................................................... I, [2024-05-13T21:54:24.313301 #1989258] INFO -- : 1022 ......................................................................... I, [2024-05-13T21:54:26.666071 #1989258] INFO -- : 1095 ......................................................................... I, [2024-05-13T21:54:27.487953 #1989258] INFO -- : 1168 ......................................................................... I, [2024-05-13T21:54:27.672312 #1989258] INFO -- : 1241 ......................................................................... I, [2024-05-13T21:54:27.848051 #1989258] INFO -- : 1314 ......................................................................... I, [2024-05-13T21:54:27.943036 #1989258] INFO -- : 1387 ......................................................................... I, [2024-05-13T21:54:30.026682 #1989258] INFO -- : 1460 ......................................................................... I, [2024-05-13T21:54:33.577640 #1989258] INFO -- : 1533 ......................................................................... I, [2024-05-13T21:54:33.721494 #1989258] INFO -- : 1606 ......................................................................... I, [2024-05-13T21:54:34.531812 #1989258] INFO -- : 1679 ......................................................................... I, [2024-05-13T21:54:34.839717 #1989258] INFO -- : 1752 ......................................................................... I, [2024-05-13T21:54:35.103669 #1989258] INFO -- : 1825 ......................................................................... I, [2024-05-13T21:54:35.417509 #1989258] INFO -- : 1898 ......................................................................... I, [2024-05-13T21:54:35.827203 #1989258] INFO -- : 1971 ......................................................................... I, [2024-05-13T21:54:36.350587 #1989258] INFO -- : 2044 ......................................................................... I, [2024-05-13T21:54:36.429787 #1989258] INFO -- : 2117 ......................................................................... I, [2024-05-13T21:54:36.487981 #1989258] INFO -- : 2190 ......................................................................... I, [2024-05-13T21:54:36.538217 #1989258] INFO -- : 2263 ......................................................................... I, [2024-05-13T21:54:36.587112 #1989258] INFO -- : 2336 ......................................................................... I, [2024-05-13T21:54:36.679886 #1989258] INFO -- : 2409 ......................................................................... I, [2024-05-13T21:54:36.974764 #1989258] INFO -- : 2482 ......................................................................... I, [2024-05-13T21:54:37.117204 #1989258] INFO -- : 2555 ......................................................................... I, [2024-05-13T21:54:38.414733 #1989258] INFO -- : 2628 ......................................................................... I, [2024-05-13T21:54:38.658119 #1989258] INFO -- : 2701 ......................................................................... I, [2024-05-13T21:54:38.788283 #1989258] INFO -- : 2774 ......................................................................... I, [2024-05-13T21:54:39.113066 #1989258] INFO -- : 2847 ......................................................................... I, [2024-05-13T21:54:39.382456 #1989258] INFO -- : 2920 ......................................................................... I, [2024-05-13T21:54:39.545096 #1989258] INFO -- : 2993 ......................................................................... I, [2024-05-13T21:54:39.628143 #1989258] INFO -- : 3066 ......................................................................... I, [2024-05-13T21:54:39.688845 #1989258] INFO -- : 3139 ......................................................................... I, [2024-05-13T21:54:39.749889 #1989258] INFO -- : 3212 ......................................................................... I, [2024-05-13T21:54:39.818649 #1989258] INFO -- : 3285 ......................................................................... I, [2024-05-13T21:54:43.656167 #1989258] INFO -- : 3358 ........................................................................ I, [2024-05-13T21:54:43.656237 #1989258] INFO -- : I, [2024-05-13T21:54:43.656247 #1989258] INFO -- : Finished in 30.334430 seconds I, [2024-05-13T21:54:43.656256 #1989258] INFO -- : I, [2024-05-13T21:54:43.656265 #1989258] INFO -- : 3429 files, 32607 examples, 181442 expectations, 0 failures, 0 errors, 0 tagged I, [2024-05-13T21:54:43.657579 #1989258] INFO -- : $$$[end] "make yes-test-rubyspec MSPECOPT='--error-output stderr --debug -j' TESTS='-j3'" exit with 0.